##TITLE=	t161wGbBQt+MHcorNRuPAA.10.fid
##JCAMP-DX=	6.0	$$ MestReNova 14.3.3-33362
##DATA TYPE=	LINK
##BLOCKS=	1    
##ORIGIN=	Mestrelab Research S.L.
##OWNER=	hrzepa
##$MNOVA/METADATA=	(DOCUMENT,BASE64)
eyJuYW1lIjoiL1VzZXJzL2hyemVwYS9MaWJyYXJ5L01vYmlsZSBEb2N1bWVudHMvY29tfmFwcGxlfkN
sb3VkRG9jcy9TaGVwcGFyZC9OTVIgZmlsZXMgemlwcy0yLzE5LzE5LUgubW5vdmEiLCJwYWdlcyI6W3
siaXRlbXMiOlsiMSIgICAgIF19XX0=
##TITLE=	t161wGbBQt+MHcorNRuPAA.10.fid
##JCAMP-DX=	6.0	$$ MestReNova 14.3.3-33362
##DATA TYPE=	NMR SPECTRUM
##DATA CLASS=	XYDATA
##BLOCK_ID=	1
##ORIGIN=	Bruker BioSpin GmbH
##OWNER=	nmrsu
##NUMDIM=	1
##$MNOVA/METADATA=	(ITEM,BASE64)
eyJhbmdsZSI6MCwiYXhlcyI6eyJ4Ijp7Im1heCI6MTYuMDY0MjU5OTk5OTM5MTI1LCJtaW4iOi0zLjc
2Njk0MjMzOTE1NjYyMjZ9LCJ5Ijp7Im1heCI6Mzk2NDguNzIyNDEyMTA5Mzc1LCJtaW4iOi0zNTg0Lj
g5NTA4MDU2NjQwNjJ9fSwicG9pbnRzIjpbeyJ4Ijo1MzIxLCJ5Ijo1ODM1fSx7IngiOjg3MjIsInkiO
jU4MzV9LHsieCI6ODcyMiwieSI6ODIwOH0seyJ4Ijo1MzIxLCJ5Ijo4MjA4fSx7IngiOjUzMjEsInki
OjU4MzV9XSwieiI6MH0=
##.OBSERVE FREQUENCY=	700.35432466099996418
##.OBSERVE NUCLEUS=	^1H
##.SOLVENT NAME=	CDCl3
##.PULSE SEQUENCE=	zg30
##LONGDATE=	2024/05/14 15:47:50.000
##.ACQUISITIONMODE=	SIMULTANEOUS (DQD)
##$ORIGINAL FORMAT=	Bruker XWIN-NMR
##$MNOVA/SCALES_VERSION=	9
##$PARAMETER FILE=	(acqus, ASCII, /private/var/folders/f6/rjf_tdyn2v98c5c0wvkgn4s80000gq/T/t161wGbBQt+MHcorNRuPAA/10/acqus, 0)
$$ ##TITLE= Parameter file, TopSpin 4.1.3
$$ ##JCAMPDX= 5.0
$$ ##DATATYPE= Parameter Values
$$ ##NPOINTS= 1	$$ modification sequence number
$$ ##ORIGIN= Bruker BioSpin GmbH
$$ ##OWNER= nmrsu
$$ $$ 2024-05-14 15:48:22.047 +0100  nmrsu@CZC7167VR1
$$ $$ Z:/700/data/tds/nmr/UHS-595-P1/10/acqus
$$ $$ process C:\Bruker\TopSpin4.1.3\prog\mod\dirdata.exe
$$ ##$ACQT0= -2.0981556054023
$$ ##$AMP= (0..31)
$$ 100 100 100 100 100 100 100 100 100 100 100 100 100 100 100 100 100 100
$$ 100 100 100 100 100 100 100 100 100 100 100 100 100 100
$$ ##$AMPCOIL= (0..32)
$$ -1 0 0 0 0 0 0 0 0 0 0 0 0 0 0 0 0 0 0 0 0 0 0 0 0 0 0 0 0 0 0 0 0
$$ ##$AQSEQ= 0
$$ ##$AQ_mod= 3
$$ ##$AUNM= <au_zg>
$$ ##$AUTOPOS= <26 >
$$ ##$BF1= 700.349999998
$$ ##$BF2= 700.349999998
$$ ##$BF3= 700.349999998
$$ ##$BF4= 700.349999998
$$ ##$BF5= 700.349999998
$$ ##$BF6= 700.349999998
$$ ##$BF7= 700.349999998
$$ ##$BF8= 700.349999998
$$ ##$BWFAC= (0..63)
$$ 0 0 0 0 0 0 0 0 0 0 0 0 0 0 0 0 0 0 0 0 0 0 0 0 0 0 0 0 0 0 0 0 0 0 0 0
$$ 0 0 0 0 0 0 0 0 0 0 0 0 0 0 0 0 0 0 0 0 0 0 0 0 0 0 0 0
$$ ##$BYTORDA= 0
$$ ##$CHANFCU= (0..24)
$$ 0 1 0 0 0 0 0 0 0 0 0 0 0 0 0 0 0 0 0 0 0 0 0 0 0
$$ ##$CHANREC= (0..24)
$$ 0 0 0 0 0 0 0 0 0 0 0 0 0 0 0 0 0 0 0 0 0 0 0 0 0
$$ ##$CHEMSTR= <none>
$$ ##$CNST= (0..63)
$$ 1 1 1 1 1 1 1 1 1 1 1 1 1 1 1 1 1 1 1 1 1 1 1 1 1 1 1 1 1 1 1 1 1 1 1 1
$$ 1 1 1 1 1 1 1 1 1 1 1 1 1 1 1 1 1 1 1 1 1 1 1 1 1 1 1 1
$$ ##$CPDPRG= (0..8)
$$ <> <> <> <> <> <> <> <> <>
$$ ##$D= (0..63)
$$ 0 1 0 0 0 0 0 0 0 0 0 0 0 0 0 0 0.0002 0 0 0 0 0 0 0 0 0 0 0 0 0 0 0 0
$$ 0 0 0 0 0 0 0 0 0 0 0 0 0 0 0 0 0 0 0 0 0 0 0 0 0 0 0 0 0 0 0
$$ ##$DATE= 1715698070
$$ [...]
$$ ##$ShimPowRng3= (0..63)
$$ 1 1 1 1 1 1 1 1 1 1 1 1 1 1 1 1 1 1 1 1 1 1 1 1 1 1 1 1 1 1 1 1 1 1 1 1
$$ 1 1 1 1 0 0 0 0 0 0 0 0 0 0 0 0 0 0 0 0 0 0 0 0 0 0 0 0
$$ ##$ShimPowType1= 8
$$ ##$ShimPowType2= 8
$$ ##$ShimPowType3= 0
$$ ##$ShimPowType4= 0
$$ ##$ShimPowType5= 0
$$ ##$ShimPowType6= 0
$$ ##$ShimPowType7= 0
$$ ##$ShimPowType8= 0
$$ ##$ShimSysActGrad= (0..63)
$$ 1 2 3 4 13 5 7 11 10 9 6 8 12 18 19 20 21 15 22 23 24 14 25 16 26 17 27
$$ 28 31 32 33 34 35 36 37 38 0 0 0 0 0 0 0 0 0 0 0 0 0 0 0 0 0 0 0 0 0 0
$$ 0 0 0 0 0 0
$$ ##$ShimSysAngle= <>
$$ ##$ShimSysFunc= (0..63)
$$ 1 2 3 4 5 6 7 8 9 10 0 37 38 35 16 15 14 13 12 11 28 27 26 25 24 23 36
$$ 22 30 29 20 21 34 33 32 31 17 18 19 0 0 0 0 0 0 0 0 0 0 0 0 0 0 0 0 0 0
$$ 0 0 0 0 0 0 0
$$ ##$ShimSysMatId= <292722da.dat>
$$ ##$ShimSysMatrix= 1
$$ ##$ShimSysMinMaxUG= 130000
$$ ##$ShimSysOffset= <29 mm>
$$ ##$ShimSysType= 4
$$ ##$ShimUnit= 3
$$ ##$SpectrOsVersion= <4.1.156.20210628>
$$ ##$TCubeEth= <192.168.180.38>
$$ ##$TCubeSeqDevice= <>
$$ ##$TOSITY= <no>
$$ ##$TRIPLO2= 0
$$ ##$TopSpinVersion= <TopSpin 4.1.3>
$$ ##$TrxFreqFormula= (0..23)
$$ <TrxFreqFormula(2.0,700350000.000000,'TRX',Trx(1.0,'TRX 1200.1',1,5.000000,1290.000000))>
$$ <TrxFreqFormula(2.0,700350000.000000,'TRX',Trx(1.0,'TRX 1200.2',1,5.000000,1290.000000))>
$$ <TrxFreqFormula(2.0,700350000.000000,'TRX',Trx(1.0,'TRX 1200.3',1,5.000000,1290.000000))>
$$ <> <> <> <> <> <> <> <> <> <> <> <> <> <> <> <> <> <> <> <> <>
$$ ##$TrxPN= (0..23)
$$ <Z148391> <Z148391> <Z148391> <> <> <> <> <> <> <> <> <> <> <> <> <> <>
$$ <> <> <> <> <> <> <>
$$ ##$TrxSN= (0..23)
$$ <00336> <00337> <00342> <> <> <> <> <> <> <> <> <> <> <> <> <> <> <> <>
$$ <> <> <> <> <>
$$ ##$VCubeEth= (0..23)
$$ <no> <no> <no> <no> <no> <no> <no> <no> <no> <no> <no> <no> <no> <no> <no>
$$ <no> <no> <no> <no> <no> <no> <no> <no> <no>
$$ ##$VTU= 2
$$ ##$VTUETH= <192.168.99.11>
$$ ##$VTUTY= <no>
$$ ##$ValueLine= no
$$ ##$VpuPN= (0..23)
$$ <no> <no> <no> <no> <no> <no> <no> <no> <no> <no> <no> <no> <no> <no> <no>
$$ <no> <no> <no> <no> <no> <no> <no> <no> <no>
$$ ##$VpuSN= (0..23)
$$ <no> <no> <no> <no> <no> <no> <no> <no> <no> <no> <no> <no> <no> <no> <no>
$$ <no> <no> <no> <no> <no> <no> <no> <no> <no>
$$ ##$WBREFAM= (0..31)
$$ 99.8 100 100 100 100 100 100 100 100 100 100 100 100 100 100 100 100 100
$$ 100 100 100 100 100 100 100 100 100 100 100 100 100 100
$$ ##$WBREFLM= (0..31)
$$ 1 0 1 0 0 0 0 0 0 0 0 0 0 0 0 0 0 0 0 0 0 0 0 0 0 0 0 0 0 0 0 0
$$ ##$WBREFPH= (0..31)
$$ 0.05 0 0 0 0 0 0 0 0 0 0 0 0 0 0 0 0 0 0 0 0 0 0 0 0 0 0 0 0 0 0 0
$$ ##$WBSGU= (0..31)
$$ 1 2 4 0 0 0 0 0 0 0 0 0 0 0 0 0 0 0 0 0 0 0 0 0 0 0 0 0 0 0 0 0
$$ ##END=
$$ 
##$DECIM=	1440
##$DSPFVS=	21
##XUNITS=	HZ
##YUNITS=	ARBITRARY UNITS
##FIRSTX=	11250.604788156719223
##LASTX=	-2638.1781369192458442
##DELTAX=	-0.10596381293402784562
##XFACTOR=	1
##YFACTOR=	1.1000173812448499344
##FIRSTY=	54.785648345947265625
##MINY=	19.664539337158203125
##MAXY=	36044.26953125
##NPOINTS=	131072
##XYDATA=	(X++(Y..Y))
$$ [...]
3505 66 66 65 66 66 66 67 67 67 68 68 68 68 68 68 67 67 68 68 68 68 67 67 66 66 67 68 68 68 68 68 68 68 68 68 68 69 69 69 69 69 68 68 68 68 68 69 68 68 67 67 67 67 67 68 68 68 68 68 68 68 69 69 69 68 68 68 68 67 67 67
3498 67 68 68 69 68 68 68 68 68 68 68 67 67 67 67 68 68 68 68 68 68 68 69 69 69 68 68 68 67 68 68 67 66 66 67 68 68 68 68 67 67 66 65 65 66 67 67 67 67 67 67 67 68 68 68 68 68 69 68 68 68 68 68 68 68 68 67 67 67 67 67
3490 67 68 69 68 68 68 68 68 67 67 67 67 66 66 67 67 67 67 66 66 66 67 67 67 67 67 67 67 66 67 67 67 67 67 67 67 67 67 68 68 68 68 68 68 68 68 68 69 68 68 68 68 68 69 69 69 69 69 68 67 67 68 68 68 68 68 68 68 68 68 68
3483 68 68 68 68 68 67 67 68 68 69 69 69 68 67 67 67 68 68 68 68 68 68 69 69 68 68 69 69 70 70 70 70 70 70 70 70 70 70 69 69 69 69 69 70 69 69 69 69 69 69 68 68 68 68 68 67 67 66 66 66 67 67 67 68 68 67 67 67 66 67 67
3475 67 67 67 67 67 67 68 68 68 68 67 68 69 69 69 69 68 68 68 69 70 70 69 69 68 69 69 69 68 68 68 68 68 68 68 68 69 69 68 68 67 67 67 67 67 68 68 68 67 67 66 66 66 67 68 68 68 68 69 69 68 67 67 67 68 68 68 67 66 67 67
3468 67 68 69 69 68 67 67 66 66 66 66 66 67 67 67 67 66 66 66 66 67 67 67 67 67 68 68 67 67 67 67 67 67 67 67 67 66 67 68 68 67 67 67 67 67 68 68 68 66 66 67 67 66 66 66 66 67 68 68 68 67 67 67 66 66 67 67 68 68 68 68
3461 68 68 68 68 69 69 68 68 68 68 67 67 67 67 67 67 67 67 67 68 68 67 66 66 66 67 67 67 68 68 68 67 68 68 67 67 67 68 68 68 68 68 68 68 68 68 67 67 67 67 67 67 67 67 67 67 67 66 67 67 66 66 67 67 67 66 66 66 66 67 67
3453 67 67 67 67 67 67 67 68 68 68 68 67 67 67 67 67 67 67 66 66 65 66 66 66 67 67 67 67 67 67 67 67 68 67 67 66 66 67 67 67 67 66 66 66 66 66 66 66 67 67 67 67 67 68 68 68 68 68 69 69 68 67 67 67 68 68 68 67 67 67 68
3446 68 69 69 69 68 68 68 68 69 69 69 69 69 69 69 69 68 68 68 68 68 67 67 67 67 67 66 66 66 65 66 66 66 67 67 67 67 68 68 68 67 67 68 68 68 67 67 67 66 67 67 67 67 67 67 67 66 66 66 67 68 68 67 67 67 67 66 66 66 67 68
3438 68 68 67 67 67 67 67 67 68 68 67 67 67 67 68 68 68 68 67 67 67 67 68 67 67 66 66 65 65 66 66 67 67 67 67 67 68 68 68 67 67 68 68 68 69 68 68 67 67 68 68 67 67 67 67 68 68 68 68 68 68 68 67 67 68 68 68 68 67 67 67
3431 67 66 66 67 67 67 67 67 68 68 68 67 68 68 67 67 66 66 67 67 67 67 67 68 68 68 66 65 65 65 66 67 68 68 68 68 67 67 67 67 67 67 67 67 67 67 67 67 67 67 67 68 68 68 68 68 68 68 68 67 67 67 67 67 67 67 67 67 67 67 68
3423 68 68 68 67 67 66 66 66 66 66 66 66 67 67 67 67 67 66 66 66 66 66 66 66 67 67 67 67 67 68 68 68 67 67 67 68 68 68 67 67 67 67 67 67 67 67 67 67 67 68 68 67 67 67 68 67 67 66 67 67 67 66 67 67 67 66 65 66 66 66 66
3416 66 66 66 67 68 68 68 68 68 68 68 67 67 67 67 67 67 67 67 66 66 66 66 66 66 66 68 69 69 68 68 67 66 66 66 66 67 66 66 66 65 65 65 66 66 66 66 66 66 66 66 67 67 67 67 67 67 67 67 67 67 67 68 68 68 67 67 67 67 67 67
3409 67 67 68 68 68 68 68 68 68 68 68 68 68 68 68 68 68 68 68 68 68 68 68 68 68 67 67 66 66 67 68 68 68 68 68 68 68 67 67 67 68 68 68 68 68 68 68 68 69 69 69 69 68 68 69 69 69 70 70 70 70 69 69 69 68 68 69 68 68 68 69
3401 69 69 69 69 69 69 69 70 69 68 68 68 67 67 67 67 66 66 67 67 67 68 68 68 68 68 68 68 67 67 67 68 68 68 68 67 67 67 68 68 68 67 67 67 67 68 69 70 71 70 69 69 69 69 68 68 68 68 69 69 69 69 69 69 69 69 69 68 68 69 69
3394 69 69 69 70 70 70 70 70 69 69 68 69 70 70 69 69 68 68 68 68 69 69 68 67 67 67 67 67 68 68 68 68 68 68 68 68 68 67 67 67 67 67 67 66 66 66 67 66 66 66 67 67 66 67 68 68 68 69 69 69 68 68 68 68 69 69 68 68 68 68 68
3386 68 68 68 68 68 69 69 68 69 68 68 68 67 67 66 66 67 67 67 67 67 67 67 67 68 67 67 67 67 68 69 69 69 69 69 69 69 68 68 67 67 67 67 67 67 67 67 66 66 66 67 67 67 67 68 67 67 67 68 69 69 69 68 67 67 68 68 68 68 68 68
3379 68 67 67 66 66 66 67 67 67 67 67 67 67 67 67 67 67 66 66 66 67 67 67 67 67 68 68 67 67 66 67 67 67 67 67 66 66 66 66 66 66 66 66 66 66 66 66 66 66 66 66 66 66 66 66 67 67 67 67 67 66 66 66 66 67 67 68 68 67 67 67
3372 67 67 67 67 66 66 66 66 66 66 66 66 66 66 66 67 67 67 67 67 67 67 68 67 67 66 66 66 66 67 68 68 68 68 67 67 67 67 66 66 66 66 66 66 66 66 66 67 67 67 67 67 67 67 67 67 67 67 66 66 66 65 65 66 66 66 67 67 67 66 66
3364 66 66 67 67 67 67 67 68 68 67 67 68 68 67 67 66 66 67 67 67 67 67 67 67 67 67 66 66 66 66 65 64 64 65 65 65 65 65 65 65 66 66 66 66 66 66 65 65 66 66 67 66 66 66 66 65 65 65 65 66 66 66 67 67 66 66 66 66 66 67 67
3357 67 67 67 67 67 66 66 66 66 66 66 66 66 66 67 67 66 66 66 66 66 67 67 67 67 67 67 67 67 67 67 67 67 67 68 67 67 67 67 67 66 66 65 65 65 65 65 65 65 66 66 66 66 66 66 67 67 67 67 67 66 66 66 66 66 66 67 67 67 67 66
3349 66 66 65 66 66 66 66 66 66 67 67 68 68 68 68 68 67 66 66 66 66 67 67 67 67 67 67 67 67 67 67 67 68 68 68 68 69 68 68 68 68 67 67 67 68 68 68 68 68 68 68 68 67 67 67 67 68 67 67 67 66 67 67 67 68 67 67 66 66 66 66
3342 66 67 67 66 67 67 67 67 67 67 68 67 67 67 67 67 67 67 67 68 67 67 66 67 67 67 67 67 67 67 67 66 66 67 67 67 67 67 67 67 68 68 67 67 68 67 67 67 67 67 67 66 66 67 68 68 67 67 67 67 68 68 68 67 67 68 68 67 66 66 66
3334 66 66 66 66 66 67 66 66 66 66 66 65 66 66 66 66 66 67 67 67 67 67 67 67 66 66 67 66 66 66 66 66 66 67 67 67 67 67 68 67 67 67 67 67 67 68 68 67 67 67 67 67 66 67 67 67 67 67 67 66 66 66 67 67 67 66 65 64 64 64 65
3327 65 66 66 66 66 66 66 66 65 66 66 66 67 67 67 67 67 67 67 67 66 66 66 66 66 66 67 67 67 67 67 67 67 67 67 67 67 67 67 67 67 67 67 67 67 67 68 68 69 68 67 66 66 65 65 66 66 66 66 67 67 66 66 66 67 67 67 66 66 66 66
3320 66 66 67 68 68 68 68 68 68 68 67 66 67 66 66 66 66 66 65 65 66 66 66 67 67 67 66 66 65 66 66 65 65 66 66 66 66 67 67 66 66 66 66 66 67 67 67 68 68 67 67 66 66 66 66 66 66 66 66 66 66 66 66 66 66 65 65 65 65 64 65
3312 65 66 66 66 66 67 67 67 67 67 67 67 67 67 66 66 66 66 66 66 65 66 66 67 67 67 67 67 66 66 65 66 66 66 67 66 66 66 66 66 65 65 66 67 67 66 66 66 65 65 64 64 64 65 65 65 66 66 66 66 66 66 66 66 65 66 66 66 66 66 66
3305 66 66 66 66 67 67 67 67 67 67 67 66 66 66 66 66 66 66 66 66 66 66 66 66 66 66 65 65 66 65 65 64 65 66 66 66 67 67 67 67 68 67 67 67 67 67 67 68 68 68 67 66 66 66 67 67 68 67 67 67 67 66 66 66 66 66 67 68 67 67 67
3297 67 67 66 66 66 67 67 67 68 69 68 68 68 68 67 67 66 66 65 65 65 65 66 66 67 68 68 68 67 66 65 64 65 66 66 66 66 66 66 67 67 66 66 66 66 67 67 67 66 66 66 66 66 66 66 66 66 66 66 67 67 67 67 68 68 68 67 67 67 67 67
3290 67 67 67 67 66 66 65 65 66 66 66 66 66 66 65 65 65 65 66 66 66 66 66 65 65 66 66 66 65 66 66 67 68 68 68 67 67 67 67 67 67 66 66 66 66 65 65 65 65 65 64 64 64 64 64 65 66 66 67 67 67 67 67 67 67 66 65 65 66 66 67
3283 67 67 67 67 66 66 66 66 66 66 66 66 66 65 65 65 65 66 66 65 65 65 65 65 65 65 65 66 65 65 65 65 65 65 66 67 67 67 67 66 66 66 66 67 67 66 66 66 65 65 65 65 65 65 65 65 65 66 66 66 67 67 67 67 68 67 67 67 67 67 66
3275 66 66 66 66 67 66 66 66 67 66 66 66 66 66 66 66 67 67 68 68 68 68 67 67 66 65 65 66 66 66 67 67 66 66 66 65 65 64 64 65 65 65 65 65 65 65 65 65 65 65 65 65 65 65 65 65 66 66 66 67 67 67 68 67 67 67 67 67 68 68 68
3268 68 67 67 67 67 66 66 66 66 66 66 66 65 65 66 67 68 68 67 67 67 66 66 65 65 66 66 66 66 66 66 66 66 66 66 66 66 67 67 67 67 66 65 65 66 65 65 66 68 68 68 67 67 67 66 66 65 65 66 66 66 66 66 66 66 66 66 66 66 66 66
3260 66 67 67 66 65 66 66 66 66 66 66 66 66 66 65 65 65 66 66 66 65 65 64 64 65 66 66 65 65 65 66 66 66 66 66 65 65 64 65 66 66 66 65 65 66 66 66 66 65 66 66 66 67 68 68 69 69 68 68 67 67 67 67 67 66 66 66 66 66 66 65
3253 65 66 66 66 66 66 66 65 65 65 65 66 65 65 65 66 67 66 66 66 67 66 65 66 66 65 65 65 65 65 66 66 67 66 66 66 66 66 65 65 65 65 65 65 65 65 66 66 66 66 66 66 66 66 66 66 66 66 65 65 65 65 65 65 65 65 66 66 66 66 66
3245 66 67 68 67 67 66 66 66 66 66 66 66 66 66 66 65 65 66 66 66 66 66 66 66 65 65 65 65 65 65 66 66 66 66 66 65 64 64 63 64 64 64 64 64 65 66 66 65 66 66 65 65 65 65 65 65 65 65 65 66 66 65 66 66 67 66 66 66 66 65 64
3238 64 64 64 64 64 64 64 65 65 65 65 66 66 66 66 67 67 66 66 65 64 64 64 64 64 65 65 65 66 66 65 65 65 65 66 65 65 65 65 66 66 65 65 65 66 66 66 65 65 65 65 65 65 65 64 64 64 65 65 65 66 66 66 66 66 66 66 66 66 66 67
3231 67 66 66 65 64 64 64 64 64 64 65 66 66 67 67 66 66 66 66 65 65 65 66 66 66 66 66 66 66 66 66 66 66 65 65 65 65 65 65 64 64 64 64 65 65 65 66 66 66 66 66 66 66 66 65 65 66 66 66 66 67 67 67 67 67 67 67 67 67 66 66
3223 66 66 66 66 66 66 66 65 65 65 65 66 66 66 66 66 66 66 66 66 66 66 66 65 65 65 65 66 66 66 66 66 66 66 66 66 66 66 66 66 65 66 66 66 66 65 65 65 66 66 67 66 65 64 65 65 65 65 65 65 65 65 65 65 65 65 66 66 66 66 67
3216 67 67 67 66 66 66 66 66 66 66 65 65 65 65 65 66 66 66 66 67 67 67 67 67 66 67 66 66 66 66 66 66 66 66 67 66 65 65 65 66 66 66 66 66 65 66 66 66 67 66 66 66 65 66 66 66 66 66 66 66 66 65 65 65 64 65 65 65 65 65 65
3208 65 65 66 66 65 65 65 65 65 65 65 65 64 65 66 66 67 67 66 66 65 65 65 66 66 66 65 65 66 66 66 65 65 65 65 65 65 65 65 65 64 64 64 64 65 65 65 65 66 66 65 65 65 65 64 64 65 66 66 66 66 67 68 67 66 66 65 66 67 67 67
3201 67 67 67 66 66 66 66 66 66 66 66 66 66 66 67 67 66 66 66 66 65 65 64 64 64 64 64 64 65 65 65 66 67 67 66 66 66 67 67 67 67 67 68 68 68 67 66 66 65 65 64 64 64 65 65 66 66 66 66 66 66 66 66 66 66 66 67 67 66 66 66
3194 66 66 66 67 68 68 68 68 68 67 66 66 65 65 65 65 65 64 65 66 66 66 66 65 65 65 65 66 66 66 66 66 66 66 66 66 65 66 66 66 65 65 64 65 65 65 65 66 67 66 66 66 66 66 66 66 67 67 67 67 67 67 67 67 66 66 65 65 64 64 64
3186 64 65 65 65 65 65 65 65 65 65 66 66 66 67 67 67 66 66 66 66 67 66 66 66 66 66 66 65 65 65 65 66 66 66 65 66 66 66 66 66 66 66 67 67 67 66 66 66 65 65 66 66 66 66 66 66 66 66 66 66 66 67 67 67 65 65 65 65 65 65 66
3179 66 66 66 66 65 65 65 65 65 65 65 66 66 66 66 66 65 66 66 65 65 65 65 65 65 65 65 65 65 64 64 64 64 65 65 66 65 65 65 64 64 64 64 64 64 65 65 65 64 64 64 64 65 65 65 65 65 65 65 65 65 65 65 65 65 65 65 65 65 66 66
3171 66 66 66 66 66 67 67 67 67 67 67 66 66 66 66 66 66 66 66 65 65 65 65 65 65 65 65 65 66 66 66 65 65 65 65 65 65 66 66 66 65 65 65 65 65 65 65 65 64 65 65 67 67 66 66 65 66 66 66 66 66 66 66 66 66 66 66 66 65 66 66
3164 66 66 65 65 64 64 63 63 64 65 65 65 66 65 65 66 66 67 67 66 66 66 66 66 66 66 65 64 64 64 65 66 67 67 67 66 66 66 66 66 65 65 65 65 65 65 65 65 65 65 65 65 66 66 66 65 65 65 65 66 66 66 66 66 66 66 66 67 67 66 65
3156 65 66 66 65 65 64 64 64 64 65 65 65 65 64 64 65 65 65 65 65 65 65 65 66 66 66 66 66 67 67 68 68 68 67 66 66 65 65 66 66 66 66 65 65 65 65 65 65 65 65 65 66 67 67 67 67 67 67 66 66 66 66 65 65 66 65 65 66 67 67 67
3149 67 67 67 67 66 66 65 65 65 66 66 65 65 64 65 65 66 66 65 66 66 66 66 66 66 66 66 66 66 66 66 65 65 64 65 65 66 65 65 65 65 66 66 66 65 65 65 65 66 65 64 64 64 64 64 65 66 66 66 66 66 66 65 65 65 65 66 66 67 67 67
3142 67 67 67 67 67 66 66 66 66 65 65 65 66 66 65 64 64 64 64 64 64 63 63 64 64 64 64 64 65 65 66 66 66 66 66 66 66 66 66 65 65 65 65 65 65 66 66 65 65 65 65 65 65 65 65 65 65 65 65 65 66 66 67 66 66 66 66 66 66 66 66
3134 66 66 66 66 66 65 65 65 65 66 66 66 66 65 65 64 64 64 64 64 64 64 64 64 65 65 65 64 65 65 65 65 65 65 66 67 67 67 66 66 66 66 65 65 65 65 64 63 64 65 66 66 65 65 66 66 66 66 66 66 66 66 67 67 67 67 67 66 66 66 66
3127 66 66 65 65 65 65 65 65 65 66 66 66 66 65 65 65 66 66 66 66 66 66 65 65 65 64 65 65 65 65 65 65 65 66 66 66 67 66 65 65 65 66 66 67 67 66 66 65 65 65 65 65 65 65 65 65 65 65 65 65 66 66 67 67 67 67 67 67 67 67 67
3119 67 67 66 66 66 67 66 65 65 66 66 65 65 66 66 66 65 64 64 64 65 65 65 65 66 66 66 66 66 65 65 66 67 67 66 66 66 66 66 66 67 67 68 68 67 66 65 65 66 65 65 65 65 65 65 66 66 66 66 65 65 65 65 65 65 65 65 65 65 65 66
3112 66 66 66 65 65 65 64 65 65 65 65 66 66 66 66 67 67 68 67 67 66 66 67 67 67 67 67 67 67 67 67 67 66 66 66 66 67 67 67 67 66 66 66 66 66 67 67 68 68 67 67 66 66 66 66 66 66 66 66 66 66 65 64 64 64 64 65 65 65 64 64
3105 64 65 66 66 66 65 65 64 65 65 65 65 65 66 67 67 67 67 67 66 65 65 66 66 66 66 66 66 66 66 67 67 67 66 66 66 66 66 66 67 67 67 66 66 66 65 65 65 65 66 66 67 67 67 67 66 67 67 67 66 67 66 66 67 66 66 66 66 66 66 66
3097 66 66 66 66 66 66 66 66 67 67 67 66 66 66 66 66 66 66 66 66 66 66 66 66 67 67 67 67 67 67 68 67 67 66 66 67 67 67 67 67 67 67 67 67 67 67 67 67 67 66 66 66 65 65 65 66 66 67 68 68 67 67 67 67 67 67 67 67 66 66 66
3090 66 67 68 67 67 67 66 66 65 66 66 66 66 66 66 66 67 68 67 67 67 67 67 67 66 65 65 66 67 66 66 67 67 67 67 67 67 67 68 67 67 67 67 66 66 67 67 68 68 68 67 66 66 66 66 67 67 67 67 67 67 67 67 67 67 67 67 67 67 66 66
3082 66 66 66 66 67 67 67 68 67 68 68 67 67 67 67 67 68 69 69 69 69 69 69 68 68 67 68 67 66 66 67 67 67 68 68 68 68 67 66 66 67 67 67 67 67 67 67 67 67 68 68 69 69 68 68 68 68 68 68 69 69 69 68 68 67 67 68 68 68 68 68
3075 68 68 68 68 68 68 67 67 67 67 67 66 66 66 66 67 67 67 68 69 69 68 68 68 68 69 69 68 68 67 67 67 67 66 66 67 68 68 68 68 68 69 69 69 69 69 69 69 68 69 69 68 68 67 67 67 67 67 66 67 67 68 69 70 70 69 68 68 67 68 68
3067 68 68 69 69 69 70 70 70 70 70 69 68 67 67 68 69 69 68 68 69 69 69 69 69 69 68 68 68 69 69 69 69 69 69 69 69 69 69 69 69 69 69 69 69 69 69 69 69 68 69 69 69 69 69 69 70 70 69 69 68 69 69 69 68 68 68 68 68 68 68 68
3060 68 68 68 69 69 68 68 68 69 69 70 70 70 70 70 70 69 70 71 71 70 71 71 70 70 70 69 69 69 69 68 69 69 70 70 70 70 70 69 69 69 69 70 71 71 71 71 70 70 70 70 70 70 70 70 69 69 69 69 69 69 69 69 69 69 70 71 70 70 70 69
3053 69 69 69 69 69 69 69 69 69 69 69 69 69 69 69 69 70 71 71 70 70 71 72 71 70 71 71 71 72 72 72 72 72 71 71 71 71 70 71 71 71 71 72 71 71 71 71 71 71 72 72 71 71 70 70 70 71 71 71 71 71 71 71 71 71 71 71 71 71 71 71
3045 71 71 72 71 71 72 72 72 71 71 72 72 72 72 73 73 73 72 71 71 72 72 72 72 72 73 73 73 73 73 73 73 73 72 73 73 74 74 73 73 74 74 75 74 74 74 74 74 74 74 74 74 74 74 74 74 74 74 74 74 74 74 75 74 74 75 76 76 75 75 75
3038 75 74 74 75 75 75 75 75 75 75 75 75 75 75 75 75 76 76 77 77 77 76 75 74 74 74 75 75 75 75 75 75 76 76 76 76 76 76 76 76 76 76 76 77 77 77 77 78 78 77 76 76 76 77 77 77 77 77 77 77 77 77 78 78 77 77 77 77 77 77 77
3030 77 77 78 78 78 78 79 79 79 79 79 78 78 78 78 79 80 81 81 80 80 79 79 80 80 80 80 80 80 80 80 80 81 81 80 80 79 79 79 81 82 81 81 81 81 80 81 82 81 81 81 81 81 81 81 81 81 82 82 82 81 81 81 81 82 83 84 85 85 84 83
3023 83 84 83 83 83 83 83 84 83 82 82 83 83 83 84 84 84 84 84 84 84 84 84 84 84 84 84 85 85 85 84 84 83 83 83 83 84 85 85 85 86 86 86 86 86 86 86 86 86 86 87 87 88 89 90 89 89 89 89 88 89 89 88 88 88 88 88 89 89 89 89
3016 89 89 89 89 89 89 90 90 90 90 90 90 90 90 91 91 91 92 92 91 91 91 91 91 91 91 91 91 92 92 93 92 92 92 93 93 93 93 92 92 92 93 93 94 93 93 93 94 94 94 94 94 95 95 94 94 93 94 94 94 95 96 97 97 97 97 97 97 98 98 98
3008 98 98 99 99 99 99 100 100 100 100 99 99 99 99 99 100 101 100 101 101 101 101 101 101 101 102 103 103 103 103 103 104 105 105 104 103 103 103 104 104 104 104 104 104 103 104 105 105 106 106 107 106 106 107 107 107 108 108 107 108 108 108 109 109 110 110 110 109 109 110 111
3001 111 111 110 111 111 111 111 111 111 112 112 112 112 113 114 115 115 115 115 115 115 115 116 116 116 116 115 116 116 117 117 117 117 118 118 119 120 120 120 120 121 121 121 120 121 121 122 122 122 122 121 121 121 121 122 123 123 124 125 125 126 127 127 126 126 127 128 127 127 127
2993 127 127 127 127 128 128 128 129 129 130 130 131 132 132 133 134 135 134 134 135 135 135 134 134 134 133 134 135 136 137 138 138 138 138 138 139 139 140 140 140 140 141 142 142 142 142 143 143 144 144 145 145 146 146 146 146 147 147 147 147 148 148 148 149 149 149 150 150 151 151
2986 151 152 152 153 154 154 155 155 155 156 156 157 157 157 157 158 159 159 159 159 159 160 160 160 161 162 162 163 163 164 164 164 164 165 165 165 165 166 166 167 169 170 170 170 169 170 170 170 171 172 173 174 174 173 174 176 177 177 177 177 177 177 177 178 179 179 180 180 181 182
2979 182 182 183 183 184 185 185 186 186 186 187 187 187 187 187 187 188 189 189 190 191 191 192 193 193 194 194 195 195 196 196 196 197 198 198 199 199 199 199 200 200 200 201 202 203 204 204 203 203 205 207 208 208 208 209 210 210 211 211 211 211 212 212 213 214 214 215 216 216 217
2971 217 218 218 219 219 220 220 220 221 222 223 222 222 223 224 224 225 225 225 226 227 227 228 228 228 227 228 229 231 232 231 231 231 232 233 233 234 235 236 237 237 237 238 238 238 238 239 240 240 241 241 241 241 242 243 245 246 247 247 248 248 248 249 249 249 250 250 250 251 251
2964 251 252 252 253 253 253 253 254 254 254 255 255 256 257 257 258 259 260 261 261 262 262 263 263 264 265 265 265 264 265 265 266 267 267 267 268 269 270 270 271 272 272 272 272 272 273 273 273 274 274 275 276 277 277 278 278 278 278 278 279 279 279 281 282 282 281 281 281 281 282
2957 282 283 283 284 284 285 285 286 287 287 287 287 287 287 287 287 288 288 289 290 291 291 292 292 292 292 293 293 294 295 295 295 295 295 295 296 296 296 296 296 296 297 298 298 298 298 299 300 300 301 302 302 302 302 303 303 303 302 303 303 304 304 304 304 304 304 305 306 306 306
2950 306 305 306 306 306 306 307 307 307 308 308 307 308 309 309 309 310 311 311 310 309 309 309 310 312 312 312 312 312 313 313 313 313 313 313 314 314 314 314 314 314 314 315 315 315 315 315 315 315 315 315 316 317 317 317 317 317 317 317 317 317 317 317 317 318 318 318 319 318 318
2942 318 318 318 318 318 319 319 318 318 318 318 317 318 318 319 319 319 319 318 318 318 319 319 319 319 319 318 319 319 320 321 321 321 321 321 321 320 319 319 319 319 319 319 319 319 319 319 319 319 319 319 319 319 319 319 319 319 319 319 319 319 319 319 318 318 317 316 316 317 317
2935 317 318 318 318 317 317 317 316 316 316 316 317 316 316 316 315 315 315 315 315 315 315 315 314 314 314 314 314 313 313 313 313 313 313 312 312 312 312 312 312 312 311 311 310 310 310 310 310 309 309 309 309 309 308 308 308 307 306 307 307 306 306 306 306 306 307 306 306 306 305
2928 305 305 304 304 304 304 303 303 302 302 301 301 300 300 300 300 300 300 300 300 300 299 299 298 298 297 297 297 296 296 296 295 295 295 295 294 294 293 293 293 293 293 292 292 291 291 291 290 290 289 289 288 287 287 287 287 286 285 285 285 285 285 284 284 283 282 282 281 279 279
2920 279 279 278 278 279 279 279 278 278 278 277 276 275 275 274 274 273 273 273 272 272 272 272 272 271 271 271 270 269 269 269 268 267 266 265 264 264 264 264 264 263 263 262 262 262 261 260 260 259 258 257 257 256 256 257 257 257 256 255 255 255 254 253 252 252 251 250 250 250 250
2913 250 249 249 248 248 247 247 247 246 245 244 243 242 242 242 241 241 241 240 239 239 238 237 237 237 236 236 235 235 235 233 232 232 232 232 233 233 233 232 231 230 229 228 228 227 226 226 226 226 225 224 224 223 223 222 221 221 220 219 219 219 219 218 218 217 217 217 216 215 214
2906 214 214 214 214 213 212 211 211 210 209 209 208 208 207 207 206 206 205 205 204 204 204 203 203 202 202 201 200 200 200 200 200 200 199 199 197 196 196 196 195 194 194 194 193 193 193 192 191 191 191 190 189 188 188 187 187 186 186 185 184 184 184 184 184 183 182 182 182 181 181
2898 181 180 180 180 180 180 179 178 178 177 177 176 175 174 173 173 173 173 173 172 172 172 172 171 170 170 170 170 169 168 168 168 167 167 167 167 167 167 167 167 166 166 165 164 163 163 162 162 162 161 160 160 161 161 160 158 157 157 156 156 155 155 156 156 155 154 154 154 153 153
2891 153 152 152 152 151 151 150 150 150 150 150 148 148 148 148 148 147 147 146 146 145 145 145 145 146 145 144 144 144 144 144 144 144 143 145 146 147 147 146 145 144 143 143 143 143 143 142 142 141 140 139 138 137 136 136 135 134 133 132 132 132 132 131 131 131 130 130 129 129 129
2884 129 129 129 128 128 128 128 128 127 127 127 127 126 127 127 126 126 125 126 126 127 127 127 126 125 125 124 125 125 125 124 125 125 125 124 124 125 125 125 125 126 125 124 124 123 122 122 121 121 121 121 120 119 119 118 118 117 117 117 116 115 115 114 114 114 113 114 114 114 113
2876 113 112 112 112 112 112 111 110 110 111 111 110 110 110 111 111 110 110 110 109 109 109 109 109 109 108 109 110 109 109 108 108 108 108 108 108 108 107 107 107 107 107 106 105 104 104 104 104 103 102 102 102 102 102 102 102 103 103 102 102 102 101 101 101 100 101 101 101 100 101
2869 101 101 101 101 101 100 100 100 100 100 100 100 100 100 100 100 99 98 98 97 97 96 96 96 97 97 97 97 97 96 96 96 96 96 96 95 94 94 94 93 93 94 94 94 94 94 94 94 94 95 94 94 93 93 92 91 91 92 92 93 93 93 92 93 92 91 91 91 91 92
2862 92 92 93 92 92 91 91 92 92 92 92 91 91 92 92 92 91 91 91 90 90 90 90 90 89 89 89 88 88 88 88 90 90 90 89 89 89 88 87 87 87 86 87 87 87 88 87 87 87 87 87 87 87 86 85 85 85 85 86 86 86 87 87 86 86 86 86 86 86 87 87
2854 87 86 86 86 86 86 86 86 87 87 86 86 86 86 86 86 86 86 85 85 85 84 84 84 85 84 84 84 84 84 83 83 83 82 82 82 82 82 82 83 83 83 83 83 83 83 82 82 82 81 81 80 81 82 82 82 83 82 82 82 81 81 81 81 81 81 80 80 80 80 80
2847 80 81 81 80 80 80 80 80 80 80 80 80 81 81 80 80 81 81 81 81 79 79 80 80 80 80 80 79 79 79 79 79 79 79 80 80 80 80 81 81 81 80 79 79 79 78 78 78 77 77 77 78 78 78 78 78 77 77 78 78 78 78 79 79 79 79 79 78 78 77 77
2840 77 77 77 77 77 77 77 77 77 77 78 78 78 79 78 78 78 78 79 79 78 79 79 80 81 81 81 81 82 82 83 83 83 83 84 85 85 85 85 84 84 83 83 82 82 83 82 81 81 81 81 82 81 81 81 80 80 80 79 78 78 78 77 76 75 75 75 75 75 75 76
2832 76 75 75 75 75 75 75 74 75 76 76 75 75 75 75 75 75 74 74 74 74 74 74 75 75 76 75 75 75 74 74 74 74 74 74 74 74 74 74 74 74 74 75 75 75 75 74 73 73 73 73 73 73 73 74 74 74 74 74 74 74 74 74 75 75 74 74 74 75 75 75
2825 75 75 75 75 74 73 74 75 75 74 75 75 75 75 75 75 74 75 75 74 73 73 73 73 73 73 73 73 73 73 73 73 73 73 73 73 73 73 73 74 73 72 72 72 71 71 72 72 72 73 74 73 73 73 73 73 73 74 73 73 73 72 73 73 73 73 73 72 72 72 72
2817 72 73 73 73 72 72 71 71 70 70 71 72 71 71 70 70 69 70 70 71 71 71 70 70 71 71 71 71 71 70 70 70 70 70 70 71 71 70 70 70 69 69 69 70 69 69 69 69 69 69 68 68 68 69 70 70 70 69 69 68 68 69 69 69 69 68 68 68 68 69 69
2810 69 68 69 69 69 69 69 69 70 70 70 71 70 70 70 69 69 69 69 69 70 69 69 70 70 70 70 70 70 70 70 70 70 70 69 69 69 69 69 69 69 69 69 69 69 69 68 68 69 69 69 69 69 69 68 68 68 67 68 68 69 69 69 70 70 70 69 69 69 69 69
2802 69 69 69 69 68 67 67 68 68 69 68 68 69 70 70 70 70 70 70 69 69 68 68 69 69 69 69 68 68 67 68 68 68 69 68 68 68 68 69 69 69 69 69 69 69 69 69 69 69 69 69 69 69 68 68 69 70 70 69 69 69 70 69 69 68 68 67 67 67 67 67
2795 67 67 67 67 67 67 68 68 68 68 68 68 68 68 68 68 68 67 67 67 68 68 68 68 68 68 68 68 68 68 67 67 67 67 67 67 67 67 67 68 67 67 68 68 66 66 66 66 66 67 67 67 68 69 68 68 68 68 68 68 67 67 67 67 67 66 67 67 68 69 69
2788 69 69 69 69 68 68 69 69 69 69 69 69 68 68 68 67 67 67 67 66 66 67 68 69 69 69 69 68 68 68 68 68 69 69 68 68 68 68 68 68 67 67 67 67 67 67 67 68 68 68 68 68 68 68 69 69 69 69 69 69 69 68 68 68 68 69 69 69 68 67 67
2780 67 66 67 67 67 67 67 66 66 66 66 66 66 66 66 66 67 67 67 67 66 67 67 67 66 66 66 66 66 67 68 68 68 68 68 68 68 68 68 68 67 67 67 67 66 66 67 67 66 66 65 66 67 67 67 67 67 67 67 67 67 67 66 66 67 67 67 66 66 65 65
2773 65 66 66 66 66 66 65 64 65 65 65 65 65 65 66 67 66 66 66 65 66 66 66 66 66 67 67 67 67 67 67 67 67 66 66 68 69 68 68 67 66 67 67 67 67 67 67 67 67 67 67 67 67 67 67 67 67 67 68 68 67 67 67 66 66 67 66 66 67 66 66
2765 66 66 66 67 67 67 67 67 67 67 68 68 67 66 66 66 66 67 68 67 67 66 66 67 67 66 66 66 66 66 66 66 65 64 64 64 64 65 65 65 66 67 66 66 66 66 66 66 67 67 68 68 68 68 67 67 67 67 66 66 65 65 66 67 66 66 66 66 66 65 65
2758 65 65 65 66 67 67 67 66 66 66 66 66 66 66 66 66 66 65 65 65 65 65 66 66 67 66 66 67 67 68 67 66 66 67 67 67 66 66 66 65 65 65 66 67 67 67 67 66 66 66 66 65 65 64 65 66 66 67 67 67 66 67 67 67 67 67 67 67 67 66 66
2751 66 67 67 67 66 67 67 67 67 67 66 66 66 66 66 66 66 66 67 67 66 66 66 66 66 66 66 66 66 66 66 66 66 65 66 66 66 66 66 66 66 67 67 67 67 66 66 66 66 66 66 66 66 66 65 65 65 65 65 65 65 65 64 64 65 65 65 65 65 66 66
2743 66 66 66 66 66 66 66 65 65 66 66 66 65 65 65 65 65 66 66 65 65 64 65 65 65 65 65 65 64 64 65 65 65 65 65 65 65 65 65 66 66 66 66 66 66 66 66 66 66 66 66 65 64 64 64 64 65 65 66 66 67 66 66 66 66 66 67 67 67 66 66
2736 66 66 66 65 65 66 66 66 65 64 64 64 64 64 65 66 66 66 66 66 66 65 65 65 65 65 65 65 65 65 64 64 65 65 65 65 65 66 66 66 67 67 67 67 66 66 66 65 65 66 66 66 66 66 65 65 64 64 63 63 64 65 64 64 64 65 65 65 65 65 65
2728 65 65 66 66 66 67 66 66 66 66 66 65 65 65 65 65 65 66 66 65 64 63 63 63 64 65 66 65 65 65 65 64 65 65 66 67 66 66 66 66 66 66 66 65 64 64 64 64 64 64 65 66 66 66 65 65 64 64 64 64 64 64 64 64 65 66 66 65 65 64 64
2721 64 64 65 65 64 65 65 65 65 64 63 63 63 63 64 64 64 64 65 65 65 65 65 65 64 64 65 66 66 67 66 66 66 65 65 65 65 66 65 65 65 65 65 66 66 66 66 66 65 65 65 64 64 65 65 65 65 64 65 65 65 65 66 65 65 64 63 63 63 63 64
2713 64 65 65 66 66 66 65 65 66 66 66 66 66 65 65 65 65 65 66 66 65 65 65 65 66 66 66 66 65 65 65 66 66 66 66 66 66 66 67 67 67 67 67 66 65 64 64 66 67 67 67 67 67 67 66 66 66 66 66 66 66 66 66 65 65 64 64 63 63 63 63
2706 63 64 64 65 65 66 66 65 66 66 66 66 66 66 66 65 65 65 66 66 65 65 65 65 65 65 66 66 66 65 66 67 67 67 66 66 66 66 66 66 66 67 67 67 66 65 64 65 66 66 67 66 66 66 66 65 64 64 65 66 66 66 66 66 66 66 66 66 66 66 66
2699 66 66 66 66 65 66 67 67 67 66 67 67 67 67 67 67 67 67 66 66 65 65 64 65 65 65 64 65 64 64 64 64 64 64 65 65 65 65 65 65 64 64 64 64 64 64 64 64 64 63 64 64 64 65 65 66 66 65 64 64 63 63 64 64 65 65 65 65 65 65 64
2691 64 64 65 65 65 65 65 64 64 64 64 64 64 64 64 64 64 64 64 64 65 65 65 65 64 64 64 64 64 65 64 64 64 63 64 64 64 64 65 65 65 65 64 63 63 63 63 63 63 63 64 64 64 63 63 63 64 65 65 65 64 63 62 63 63 64 65 66 66 66 66
2684 66 66 66 65 65 65 65 64 64 63 62 62 62 62 63 63 63 64 64 64 64 64 64 64 64 64 64 64 64 65 65 65 66 65 65 64 64 65 64 64 65 65 65 66 66 66 66 66 66 65 65 65 65 66 66 66 66 67 66 66 66 66 65 65 65 65 63 63 63 64 64
2676 64 64 64 64 64 65 65 65 64 63 64 64 64 64 64 64 63 63 63 63 63 63 63 64 64 64 64 64 65 65 65 64 63 63 64 64 64 63 63 64 64 64 64 64 64 63 63 63 63 63 64 65 65 66 66 66 67 67 66 65 66 66 66 66 65 65 65 65 65 64 64
2669 64 64 64 64 64 64 64 65 65 65 65 65 65 64 64 65 65 65 65 65 65 65 65 65 65 64 64 64 65 65 65 65 65 65 65 65 65 65 65 65 65 65 65 64 63 63 63 63 63 63 64 64 64 64 64 64 64 64 65 65 65 65 65 65 65 65 64 64 64 65 65
2661 65 65 65 65 64 64 64 64 65 65 66 66 66 65 65 64 65 65 65 66 66 65 65 66 66 66 66 66 66 66 66 66 67 67 67 67 67 66 67 67 67 67 66 67 67 68 67 67 67 67 67 67 67 67 67 67 66 66 66 66 66 66 67 66 65 65 66 66 65 65 65
2654 65 65 64 64 63 63 64 64 63 64 64 65 65 66 66 65 65 65 65 65 65 65 64 64 64 64 65 66 65 65 64 64 64 64 64 65 65 65 65 65 65 65 64 63 63 63 63 63 62 62 62 62 62 62 63 63 63 63 64 64 64 64 64 64 65 65 65 65 64 64 64
2647 64 64 64 64 65 65 65 65 64 64 64 63 63 63 63 64 64 64 65 65 65 65 65 64 65 65 65 65 65 65 64 64 64 65 65 65 65 65 64 64 64 64 65 66 66 66 66 66 65 65 65 65 65 66 66 66 65 64 64 64 65 64 64 64 64 64 64 64 64 63 63
2639 63 63 63 63 63 64 65 65 65 65 66 66 65 65 64 64 65 65 66 65 65 65 65 65 65 65 66 66 65 65 65 66 65 65 64 64 64 64 64 65 65 66 65 65 65 65 64 65 65 65 65 64 64 64 65 65 65 65 65 65 65 65 65 64 64 64 64 64 65 66 66
2632 66 66 67 66 66 66 66 67 68 69 69 69 69 69 69 68 67 68 68 69 69 70 70 69 69 68 68 67 67 68 68 67 66 66 65 65 65 65 65 65 66 66 66 66 67 66 67 67 67 67 66 66 66 66 65 65 64 63 64 65 65 66 66 66 64 64 64 65 65 65 66
2624 66 66 66 66 66 66 67 66 66 66 65 64 64 65 66 65 65 65 66 66 66 66 67 67 68 68 67 66 67 67 68 67 67 67 67 66 67 67 67 67 67 66 67 67 67 66 66 66 66 67 67 67 67 67 66 65 65 66 67 66 66 66 66 66 66 66 66 66 67 67 67
2617 67 66 66 66 66 66 65 65 65 66 66 65 65 65 66 66 66 66 66 66 66 65 65 65 65 66 67 67 66 66 66 65 65 64 64 65 65 65 64 65 65 65 65 65 66 66 66 66 66 66 67 66 66 66 65 65 65 65 66 66 67 67 66 66 66 66 66 66 66 66 66
2610 66 66 66 66 66 66 66 66 66 66 66 66 66 65 65 66 67 66 65 65 65 65 65 65 66 67 67 67 67 67 67 68 67 67 67 67 67 67 68 68 68 68 67 67 67 66 66 67 67 67 67 68 68 68 68 68 68 68 67 67 68 67 66 66 66 66 66 67 67 67 67
2602 67 68 69 69 69 69 68 68 67 67 67 67 67 68 68 68 67 67 67 67 67 66 66 66 66 67 67 68 68 68 68 68 67 67 67 67 67 67 67 67 67 67 67 67 67 67 67 67 67 67 67 67 67 67 67 67 67 67 67 67 66 66 67 67 67 67 67 67 67 68 67
2595 67 67 67 66 67 68 68 69 69 68 68 68 68 68 68 67 67 67 67 67 67 67 67 67 68 68 69 69 68 67 67 67 67 68 69 68 68 68 69 70 69 68 67 67 67 67 68 68 68 68 68 68 67 67 67 68 68 68 68 68 68 68 68 68 68 67 68 69 69 70 70
2587 70 69 69 69 69 69 68 68 68 68 67 67 67 67 67 67 68 68 68 68 68 68 68 68 69 69 69 69 68 68 68 68 69 69 68 68 68 68 68 68 68 67 68 68 68 68 68 67 68 69 69 69 69 68 69 69 69 69 68 68 67 67 67 67 67 67 67 67 67 68 69
2580 69 68 68 67 68 68 68 68 68 67 66 67 67 68 68 68 68 68 68 68 67 67 66 66 67 67 67 68 68 68 67 67 66 66 65 65 65 66 67 68 68 68 67 68 68 68 68 68 68 68 68 67 68 68 68 68 67 67 67 67 67 67 68 68 68 67 67 67 66 65 64
2572 64 65 65 65 64 64 64 65 65 66 66 65 66 66 66 66 67 67 67 68 68 67 67 66 66 66 66 66 67 66 66 66 66 66 66 66 66 66 66 66 67 66 66 66 67 67 67 66 65 64 65 66 66 66 66 66 67 67 67 66 67 67 67 67 67 68 68 68 69 68 68
2565 68 69 68 68 69 69 70 70 70 70 71 71 70 69 69 69 69 69 68 68 67 67 67 67 67 67 67 66 65 65 65 65 65 65 65 65 66 66 66 66 66 66 66 65 65 66 66 67 66 66 65 64 65 65 65 65 65 65 65 65 66 65 65 65 66 67 67 67 67 67 66
2558 66 66 66 66 65 65 65 64 64 64 64 64 65 65 66 66 65 65 64 64 64 65 65 65 66 66 66 66 66 65 65 66 66 66 66 65 65 64 64 65 64 64 64 64 64 64 63 63 63 62 63 63 63 64 64 64 64 64 64 64 64 64 65 65 65 65 65 64 65 65 65
2550 65 65 65 65 65 65 64 64 64 65 65 65 65 65 65 65 64 64 64 64 64 64 64 64 64 64 65 64 63 64 64 65 65 66 65 65 64 64 64 64 64 64 64 64 64 65 65 65 65 65 64 64 64 64 65 64 64 65 65 66 65 65 64 64 65 65 65 65 65 65 65
2543 65 64 65 65 65 64 65 64 64 64 63 63 64 64 64 64 64 63 63 64 64 64 64 64 64 64 64 64 64 64 64 64 64 64 64 64 64 65 65 64 64 64 64 64 64 64 64 64 63 63 62 62 62 63 63 64 64 63 63 62 62 63 63 64 64 64 64 64 63 63 63
2535 63 63 63 64 64 64 65 65 64 65 65 65 64 65 65 66 66 65 65 65 64 64 64 65 65 64 64 64 65 64 64 63 63 64 64 64 64 65 64 64 64 64 64 64 64 63 63 63 63 63 63 64 65 65 64 63 63 62 62 62 62 62 62 63 63 63 63 63 63 63 64
2528 64 64 64 64 65 65 65 65 65 64 64 65 65 65 65 65 65 64 64 64 64 64 64 65 64 64 63 63 63 63 63 63 63 64 64 64 64 65 65 65 64 64 64 63 63 63 63 63 64 64 64 64 65 65 64 64 63 63 63 63 63 62 62 63 64 64 64 64 63 63 63
2521 63 63 63 63 64 64 63 64 65 65 64 64 63 62 62 62 62 62 62 62 63 63 63 64 63 64 64 63 62 62 62 62 62 63 63 64 64 63 63 63 64 64 64 64 64 63 63 62 61 61 61 62 62 62 62 62 63 63 62 62 62 63 63 63 63 63 64 64 64 63 63
2513 63 62 63 64 64 63 63 63 62 62 62 63 63 63 64 64 64 63 63 63 64 65 65 64 64 64 64 64 64 64 64 64 64 63 63 63 63 62 61 61 62 62 62 62 62 62 62 63 63 63 63 63 63 62 62 62 63 63 63 64 63 63 63 62 61 61 62 63 63 63 62
2506 62 62 63 63 63 62 61 61 62 62 62 62 62 62 62 62 62 62 62 62 62 62 62 63 63 63 63 63 62 62 62 63 63 63 63 62 63 63 63 63 62 62 63 64 64 64 64 64 63 62 62 63 63 63 63 62 62 62 63 63 64 64 63 63 62 62 62 62 63 63 63
2498 63 63 63 62 63 63 63 63 63 63 63 63 63 63 63 64 64 63 63 62 62 62 62 62 62 62 63 63 64 64 64 64 64 64 64 63 63 63 62 62 63 63 63 63 63 63 63 63 63 62 62 62 62 62 63 63 63 63 63 63 63 63 63 63 63 63 62 62 62 62 63
2491 63 63 63 63 63 63 63 63 63 63 63 63 63 62 62 62 62 62 62 62 62 62 62 62 62 62 63 64 64 64 64 63 63 62 62 62 62 62 62 62 62 62 62 62 62 62 62 61 61 62 62 62 61 61 62 62 63 64 64 64 63 63 63 63 63 63 63 63 62 62 62
2483 62 63 62 63 63 62 62 62 63 63 63 63 63 63 63 64 64 64 63 63 64 64 63 63 63 63 63 64 64 64 63 62 62 62 62 62 62 63 63 63 62 61 62 62 63 63 63 63 64 64 64 64 63 63 64 64 64 64 63 63 63 63 64 64 64 64 64 63 63 63 63
2476 63 63 63 62 62 61 61 61 61 62 62 62 62 62 62 61 62 62 62 62 61 61 61 62 63 63 63 63 63 63 63 62 62 63 62 62 62 62 63 62 62 63 63 63 64 64 64 63 62 62 63 63 62 62 62 62 62 61 62 61 61 61 61 62 62 63 63 62 62 62 62
2469 62 63 63 63 64 64 64 63 64 64 64 63 63 63 64 65 65 64 63 63 63 64 64 63 63 63 64 64 63 63 63 64 64 64 64 64 65 64 63 63 63 63 63 63 64 64 65 65 64 63 63 63 63 62 62 62 63 63 64 64 64 63 63 64 63 63 64 64 64 64 65
2461 65 65 64 64 63 63 63 64 65 65 65 65 64 64 64 63 63 63 63 63 63 63 63 62 62 62 62 62 62 62 63 63 63 63 63 64 63 63 63 63 64 63 63 64 64 63 63 63 63 63 63 63 63 63 64 65 65 64 63 63 62 62 63 62 63 63 63 63 63 62 62
2454 62 62 63 63 63 63 63 63 62 62 62 62 62 62 62 62 62 63 63 63 63 63 63 63 63 62 62 62 63 63 63 64 64 64 64 64 64 64 64 64 63 63 63 64 64 64 64 64 63 63 63 63 62 62 62 62 62 62 62 63 63 64 64 64 64 64 64 64 64 64 64
2446 64 63 64 64 63 63 63 62 62 63 63 63 63 62 63 64 65 65 66 66 67 67 68 69 69 70 71 73 74 75 77 78 80 81 83 85 88 89 90 89 89 89 90 91 92 92 91 88 85 81 77 73 71 69 67 66 66 65 64 63 63 64 64 64 64 63 63 62 63 64 63
2439 63 63 63 63 64 64 64 64 64 63 62 62 62 63 64 63 62 62 63 63 64 64 64 64 64 65 64 64 64 64 64 64 64 64 64 64 64 64 64 64 64 64 64 63 63 63 63 63 64 64 64 63 63 64 64 64 64 63 63 62 62 62 61 61 61 61 61 61 62 62 62
2432 62 62 62 62 62 62 61 61 60 60 61 62 62 63 63 64 64 63 64 64 63 62 62 62 62 63 62 62 62 62 63 63 63 63 62 62 61 61 60 60 60 61 62 62 62 63 62 62 62 63 63 63 63 63 63 63 63 62 62 62 63 62 61 60 61 62 62 63 62 62 62
2424 62 62 62 62 61 61 61 61 62 62 62 61 61 62 63 63 63 63 63 63 63 63 63 63 63 63 63 63 63 64 64 63 63 63 63 63 63 63 63 63 62 62 62 61 62 62 62 62 62 62 62 62 62 62 62 62 63 63 63 63 63 63 63 62 63 63 63 63 62 62 62
2417 62 63 63 63 63 62 62 62 63 62 62 62 62 61 61 61 61 61 61 61 61 61 61 60 61 61 61 61 62 62 62 62 62 62 62 62 62 62 62 62 62 62 61 61 61 61 61 61 61 61 61 61 61 61 60 61 61 61 61 60 60 60 61 61 62 62 63 63 62 62 62
2409 62 64 64 64 64 63 63 63 62 62 62 62 62 62 63 63 63 63 63 63 63 64 63 63 62 62 62 62 62 62 62 61 62 62 62 63 63 63 62 62 62 62 62 62 62 62 62 62 62 62 61 61 62 62 62 62 62 62 61 61 61 61 61 62 62 62 62 63 63 63 63
2402 63 63 63 63 62 62 61 61 61 62 62 63 63 62 61 60 60 61 61 62 61 61 60 61 61 61 60 60 60 61 61 61 62 62 62 63 63 63 63 63 63 62 62 61 61 61 61 61 61 60 61 61 62 62 62 62 62 61 61 62 62 62 62 62 62 62 62 61 62 62 62
2394 62 61 61 61 61 62 61 61 60 60 60 60 60 60 61 61 61 61 61 61 61 61 61 61 61 61 61 61 61 60 60 60 60 61 61 61 61 61 61 61 61 61 61 61 60 60 60 60 61 61 61 62 62 62 62 62 62 62 62 62 62 62 62 62 61 61 60 60 60 60 60
2387 60 61 61 61 61 61 61 62 62 62 62 62 61 61 62 62 63 63 63 63 63 63 63 63 63 63 63 63 64 63 62 62 62 62 63 63 63 63 62 62 62 61 61 62 62 62 62 62 61 61 61 62 62 62 63 63 62 62 62 62 63 63 62 62 62 61 61 61 61 62 62
2380 62 62 61 60 60 60 61 62 62 62 61 60 60 61 61 61 61 61 60 61 62 63 63 62 62 61 61 61 60 60 61 61 62 62 62 63 63 64 65 64 64 64 64 64 64 63 64 64 64 65 65 65 66 66 66 65 65 66 66 67 67 67 67 67 68 68 69 70 70 70 70
2372 70 70 70 70 71 72 72 72 72 72 71 71 71 70 69 69 69 70 70 69 69 69 69 68 67 66 65 64 64 64 64 64 63 63 64 64 64 65 65 65 65 66 66 68 69 70 70 70 71 71 71 72 73 73 72 73 73 73 73 73 72 72 72 73 72 71 70 69 69 68 67
2365 67 65 64 64 64 65 64 64 63 63 63 63 63 63 63 63 63 62 62 62 62 63 63 63 64 63 63 63 63 62 62 62 62 62 63 62 62 61 62 62 62 63 64 64 64 64 63 63 63 62 62 62 62 62 62 62 62 62 62 62 62 62 61 61 61 61 61 60 60 60 60
2357 60 60 61 61 61 61 62 62 62 61 61 61 61 61 61 61 60 60 60 61 61 61 61 61 61 61 61 61 62 62 62 63 62 62 62 62 62 62 62 62 63 63 63 63 63 63 64 64 64 63 62 61 61 62 62 62 62 61 61 60 60 60 60 60 61 61 61 61 61 61 61
2350 61 61 61 62 62 61 61 61 61 61 62 62 62 63 63 62 62 61 62 62 62 62 62 62 61 61 60 60 60 60 60 60 61 62 61 61 61 60 60 60 60 61 61 61 61 61 61 62 62 63 62 62 61 60 60 60 61 62 63 63 63 63 62 62 61 62 62 62 61 61 60
2343 60 60 60 60 60 61 61 61 61 61 62 62 63 64 63 62 61 61 61 61 61 60 59 59 60 61 62 61 61 61 61 61 61 61 62 62 62 62 62 62 62 61 62 62 62 62 62 62 62 63 62 61 60 60 61 60 60 60 60 60 60 60 61 61 61 62 62 61 61 60 61
2335 61 61 61 61 60 59 60 61 61 61 61 61 60 59 59 59 59 59 60 60 60 60 61 61 61 61 61 61 61 60 60 60 60 61 61 62 62 62 62 62 62 62 61 61 61 61 61 61 61 61 62 62 62 62 62 62 62 62 62 62 62 62 61 61 61 61 61 61 61 61 61
2328 61 61 61 60 60 61 61 61 61 60 61 61 61 61 62 62 61 61 61 61 61 61 61 62 62 61 61 61 61 62 62 62 60 59 59 59 60 60 60 61 61 61 61 61 61 61 61 61 61 61 62 62 61 61 61 62 62 61 60 60 60 60 60 61 61 62 62 61 61 61 60
2320 60 60 61 61 61 61 61 61 60 60 60 61 61 60 59 59 60 60 60 60 60 60 60 61 61 62 61 61 61 61 61 62 61 60 60 61 61 61 61 61 61 62 62 62 61 60 60 60 61 61 61 61 62 62 62 62 62 62 62 62 63 63 63 62 62 62 62 63 63 63 62
2313 62 62 62 62 62 62 62 62 62 62 62 62 62 62 62 62 62 62 61 61 61 61 61 61 61 62 62 61 61 61 61 61 62 62 62 62 62 62 61 60 60 59 59 60 60 61 61 61 60 60 61 60 61 61 61 61 60 60 60 60 60 60 60 60 60 60 60 60 60 59 58
2305 58 59 60 60 61 61 60 60 60 60 61 61 62 61 61 60 61 61 60 60 60 59 60 60 61 61 61 61 60 60 60 60 60 60 60 60 60 60 60 61 61 61 60 60 61 61 61 62 62 62 62 61 60 60 60 60 60 61 61 61 61 61 61 61 61 61 61 61 62 62 62
2298 62 62 61 60 60 60 61 61 60 59 60 60 60 60 60 60 60 60 61 61 60 60 60 60 60 61 61 60 60 60 60 60 59 60 60 61 60 60 60 60 60 61 60 60 61 61 61 61 61 62 62 62 61 62 62 62 62 62 62 61 61 60 61 61 61 61 61 62 62 62 62
2291 62 63 62 62 62 62 61 61 61 62 61 61 60 59 59 59 60 60 60 61 61 61 61 60 60 60 60 60 60 60 60 60 59 59 59 59 59 59 60 60 61 61 61 61 61 61 61 60 61 61 61 61 62 62 62 61 61 61 61 61 61 61 60 60 60 61 61 61 61 62 62
2283 62 62 62 62 63 63 62 62 62 62 61 61 60 60 61 61 61 61 62 62 62 62 62 61 61 61 61 62 62 61 60 60 60 60 59 59 60 60 60 60 61 61 61 61 60 59 59 59 60 60 60 60 60 60 61 61 61 62 61 61 61 60 60 60 59 59 60 60 60 60 60
2276 60 59 60 60 61 61 61 61 61 61 61 61 61 61 60 61 61 61 61 61 61 61 61 61 61 61 61 61 61 61 62 61 61 60 61 61 61 61 62 62 62 61 62 62 62 62 62 61 61 61 61 60 61 61 61 60 60 60 60 60 60 59 59 59 60 59 59 59 59 59 59
2268 59 59 59 60 60 60 61 61 61 61 60 59 60 60 60 60 60 60 61 60 60 61 60 60 60 61 62 62 62 63 62 62 62 61 61 61 61 60 60 61 61 60 60 61 61 61 61 60 60 60 60 60 60 60 59 59 59 60 60 61 61 61 60 60 61 61 61 60 61 60 60
2261 60 61 60 60 59 60 61 61 60 60 60 60 60 60 59 59 59 59 59 60 60 60 60 60 60 60 61 61 61 61 61 61 60 60 61 62 61 61 61 61 61 61 60 59 58 58 59 60 60 60 60 60 60 60 60 60 60 60 60 60 60 60 60 60 60 60 60 60 60 61 61
2254 61 62 62 61 60 59 60 60 60 60 60 60 61 60 60 60 60 60 60 60 60 60 60 60 60 60 60 60 60 60 60 60 60 60 59 59 60 60 60 59 58 58 59 60 61 62 62 61 61 61 61 61 61 60 59 59 59 59 60 60 61 61 61 61 60 60 61 60 60 61 62
2246 62 62 61 61 60 60 60 60 60 60 60 60 60 59 59 59 59 59 59 59 60 60 60 61 60 60 59 59 58 59 60 60 60 60 61 61 61 60 61 61 61 61 61 60 60 60 60 60 60 60 60 60 60 59 60 60 60 60 61 60 60 60 60 60 60 60 59 60 60 59 59
2239 59 59 60 60 60 60 60 59 59 59 59 59 59 59 59 60 60 59 58 58 59 60 60 61 61 61 61 61 61 61 61 61 61 61 60 60 60 60 60 60 60 60 60 60 60 60 60 59 59 59 59 60 59 59 59 59 59 59 59 60 60 60 60 60 60 60 60 60 60 60 60
2231 60 60 60 61 61 61 61 61 61 61 60 60 61 61 61 60 60 60 60 60 60 60 60 60 60 60 60 60 60 59 59 59 59 59 60 60 60 60 60 59 59 60 60 60 59 59 59 59 59 60 60 60 60 60 59 59 59 59 59 59 59 59 59 59 59 60 61 61 61 61 60
2224 60 59 58 58 58 58 59 59 59 59 59 59 59 59 59 59 59 59 60 61 62 62 63 63 62 62 62 61 61 61 61 61 61 61 61 61 60 60 60 60 59 59 59 59 60 60 60 60 60 60 60 60 60 60 60 61 60 59 58 58 58 58 58 59 59 60 60 60 60 61 60
2216 60 60 60 59 59 58 58 58 58 58 59 60 60 59 59 58 58 59 60 60 60 60 59 58 58 58 59 59 58 58 58 58 58 58 59 59 59 59 59 59 58 58 58 59 59 58 59 60 60 60 61 61 60 60 60 60 60 60 60 61 61 60 60 60 60 61 61 61 61 60 60
2209 60 60 60 60 60 60 60 60 60 59 58 59 59 60 60 59 59 59 59 60 60 60 60 59 59 59 59 59 59 59 60 60 60 59 59 58 59 59 60 60 60 60 59 59 59 60 60 61 61 61 60 60 60 60 60 59 60 60 60 60 60 59 59 59 60 59 59 59 60 61 61
2202 61 60 60 60 60 60 60 60 60 60 59 59 59 59 59 60 59 59 59 59 59 59 59 59 59 59 59 59 60 60 59 59 59 60 60 60 59 59 59 59 59 59 59 59 59 60 60 60 59 59 59 59 60 60 60 59 59 59 60 60 60 60 60 60 61 61 61 61 60 60 60
2194 60 60 61 61 61 61 61 61 61 61 61 62 61 61 60 59 59 59 60 60 60 59 59 59 59 59 60 61 60 60 60 60 60 59 60 60 60 60 60 60 60 60 60 60 60 60 60 60 60 60 60 61 61 61 61 61 61 61 61 61 61 61 61 59 58 58 58 58 58 58 58
2187 58 58 59 59 59 59 59 59 59 59 58 58 59 59 59 58 59 59 59 59 59 59 59 59 59 60 60 61 60 59 60 60 60 61 60 60 60 60 60 60 60 60 60 59 60 60 60 60 61 61 61 61 61 61 61 61 61 60 60 60 61 61 60 59 59 60 59 59 59 59 59
2179 59 59 59 60 60 60 60 59 59 59 60 60 60 59 59 58 58 59 59 59 60 60 61 61 60 60 60 59 58 58 58 58 59 60 60 60 59 59 59 60 60 60 59 59 60 60 59 58 58 59 60 60 59 59 59 60 60 60 60 60 60 59 60 60 60 60 59 59 59 59 59
2172 59 60 60 60 60 60 60 60 59 58 58 59 59 59 58 58 59 59 59 59 59 58 59 60 61 61 61 60 61 61 62 62 62 61 61 61 61 60 60 60 60 61 61 60 60 59 59 58 58 58 58 57 58 58 58 58 58 58 58 58 58 58 59 59 59 58 58 58 58 58 58
2165 58 58 58 58 58 58 59 59 59 59 59 58 59 59 59 59 59 59 59 60 60 59 59 60 60 60 60 60 60 60 60 60 60 59 59 59 59 60 60 59 59 58 58 58 58 58 59 59 59 59 58 58 58 58 58 59 59 59 59 60 60 60 60 60 60 60 59 59 60 60 60
2157 60 61 61 60 60 59 59 59 60 60 59 59 59 59 59 59 59 59 59 60 60 60 60 59 58 58 59 59 59 59 59 58 57 58 58 59 59 58 57 57 57 58 59 59 58 59 59 59 59 59 59 59 59 58 58 58 58 59 59 59 59 59 58 58 58 58 58 59 59 60 59
2150 59 59 60 60 60 60 60 59 58 58 59 59 59 58 59 59 59 60 59 58 58 59 59 59 59 59 59 59 59 60 60 60 60 59 59 59 58 58 58 58 59 59 59 59 59 60 60 60 60 60 59 59 59 60 60 60 59 59 59 59 58 58 58 58 59 59 59 59 58 59 59
2142 59 59 59 59 59 59 60 60 60 60 60 60 61 60 60 59 59 59 58 58 58 58 59 59 58 59 59 59 59 58 58 59 58 58 58 59 59 58 58 58 58 59 59 59 59 59 60 60 60 60 60 60 60 60 60 60 60 60 60 60 60 60 60 59 59 59 60 59 59 59 59
2135 59 59 59 59 59 58 58 58 58 59 59 59 60 60 59 59 59 60 60 59 59 59 59 60 60 60 60 60 61 61 60 60 59 59 59 59 59 59 59 59 59 59 60 60 59 59 58 58 58 59 60 59 59 60 60 60 59 59 59 58 58 58 58 58 58 59 59 59 59 60 60
2127 60 60 60 60 60 60 60 60 60 60 59 60 60 61 60 60 60 59 59 59 59 59 60 60 60 60 60 61 60 59 60 60 60 61 60 60 60 60 60 59 60 60 60 60 60 60 60 60 60 59 59 59 59 59 59 59 59 59 60 59 59 59 59 59 59 59 59 58 58 59 59
2120 59 59 59 59 58 58 59 59 59 59 59 59 60 60 60 60 60 60 60 60 59 59 59 59 59 59 59 59 59 59 59 59 58 58 58 59 59 59 59 60 59 60 60 60 59 59 58 59 60 61 61 60 59 59 60 60 61 60 60 61 61 61 61 61 60 60 59 59 59 60 60
2113 60 60 60 59 59 59 59 58 58 58 58 59 59 59 60 60 60 60 59 59 59 59 60 60 60 59 59 59 59 59 59 59 59 59 59 59 59 59 59 60 60 60 61 61 60 60 60 60 60 60 59 58 58 59 59 59 59 60 60 61 61 61 61 61 62 62 63 63 64 65 65
2105 65 66 67 70 72 74 76 79 82 85 89 93 96 100 105 110 115 121 127 134 141 149 158 166 175 181 187 192 195 198 200 201 201 198 193 186 176 166 154 142 129 118 108 100 94 88 85 81 78 75 74 72 72 70 68 68 67 67 66 66 65 65 65 66
2099 66 66 65 64 64 63 62 62 63 64 64 62 61 61 60 61 61 61 62 62 62 62 62 62 61 61 61 62 62 62 61 61 61 61 61 62 61 60 60 60 60 60 60 60 60 59 59 59 59 59 59 60 60 60 60 60 60 60 60 60 60 59 59 59 60 60 59 59 59 58 57
2091 57 58 58 58 58 58 59 59 59 59 59 59 59 60 60 60 61 61 60 60 60 60 60 60 59 59 59 59 58 58 58 58 59 59 59 60 60 59 59 59 59 59 59 59 59 59 60 60 60 60 60 60 60 60 60 60 60 59 58 59 60 60 60 60 60 60 60 60 60 60 61
2084 61 60 60 60 61 61 61 61 61 60 60 60 60 60 61 61 60 60 60 60 61 60 60 59 59 59 59 59 59 59 60 59 58 58 58 58 59 59 60 61 61 62 61 61 61 61 62 62 62 62 61 60 60 59 59 60 60 59 59 58 58 59 60 61 61 61 60 60 59 59 60
2076 60 60 61 60 60 60 60 60 60 60 59 59 60 61 61 60 60 60 60 60 59 59 59 59 59 60 60 60 60 60 60 59 59 59 60 60 60 60 60 61 62 62 61 60 60 60 60 60 60 61 61 61 61 62 62 63 63 62 61 61 61 62 62 62 62 62 62 62 62 62 62
2069 62 62 62 61 60 60 60 60 60 60 60 60 61 61 61 61 61 61 61 61 61 60 61 61 62 62 62 62 62 61 61 61 62 62 61 61 62 62 62 62 61 62 62 62 62 62 62 62 62 62 62 62 61 62 63 63 62 62 61 62 62 62 62 62 62 62 63 63 63 63 63
2061 63 64 65 66 66 65 65 66 66 67 67 68 69 71 74 76 78 79 82 84 87 91 95 99 104 109 114 119 123 129 135 141 148 155 162 169 175 180 186 190 194 197 198 197 195 192 187 180 172 162 153 143 133 124 115 108 101 95 90 86 83 80 78 76 75 74 73 72
2054 72 71 71 70 70 69 68 68 68 67 67 67 67 67 67 66 66 66 65 65 64 64 64 64 64 64 65 65 65 65 65 65 65 65 66 66 66 66 66 65 65 65 65 64 64 65 65 64 64 64 64 65 65 65 65 65 65 65 65 66 66 66 66 65 65 65 65 65 65 65 65
2047 65 65 64 64 64 63 64 64 65 65 65 65 66 67 66 66 65 65 65 65 66 67 66 66 66 66 65 65 65 65 65 64 65 66 66 66 66 66 66 66 66 66 67 67 66 66 65 65 65 66 66 67 67 68 67 67 67 67 67 67 67 67 68 68 67 67 67 68 68 67 67
2039 67 67 68 68 68 67 67 67 67 67 68 67 67 67 67 67 67 68 69 68 69 69 69 68 68 68 68 68 68 69 69 69 69 69 69 69 69 69 69 70 70 70 70 70 69 69 69 69 68 68 69 69 69 70 71 71 71 71 71 71 72 72 72 72 72 71 70 70 71 70 70
2032 70 70 71 72 71 71 71 71 71 71 71 71 71 71 71 72 72 73 73 72 72 72 72 73 72 72 71 71 72 72 72 72 72 72 72 72 72 72 72 72 72 71 71 72 72 72 72 72 72 72 72 73 74 75 75 75 75 75 76 75 75 75 75 74 74 74 75 75 75 75 75
2025 75 75 75 74 74 75 75 75 75 75 75 75 75 75 75 76 76 77 77 77 77 78 77 77 77 77 76 77 77 76 77 78 78 78 78 78 78 78 78 79 79 79 79 78 79 79 79 79 79 79 79 80 80 80 81 81 81 81 80 80 81 81 81 82 82 81 82 82 82 82 82
2017 82 82 82 82 82 82 82 81 80 80 81 81 81 81 82 83 84 84 84 84 84 84 84 83 83 83 84 85 84 84 84 85 85 84 84 84 85 85 86 86 86 87 87 87 88 87 88 88 88 88 88 88 88 88 88 89 89 89 89 89 89 89 89 89 89 90 91 91 92 92 92
2010 92 93 93 94 94 93 94 94 95 95 96 96 96 95 95 95 95 95 95 95 95 95 95 95 94 95 95 96 96 97 98 98 98 99 100 100 100 100 100 100 101 102 102 102 102 101 102 103 103 103 104 105 106 106 106 106 106 106 107 107 107 106 106 107 107 107 107 108 109 109 110
2002 110 110 110 110 110 111 111 112 112 112 112 112 113 113 114 115 116 115 115 115 116 117 117 118 118 118 119 119 119 120 120 120 121 121 122 122 124 124 123 123 124 125 126 126 126 127 128 128 128 129 129 130 131 131 132 132 133 133 134 134 135 135 136 137 137 137 138 138 139 139
1995 139 140 140 141 142 142 143 143 144 145 146 147 147 148 149 149 149 150 151 151 151 152 153 154 155 155 156 157 158 160 162 163 163 164 165 167 168 169 171 172 174 175 177 178 179 180 181 181 182 182 183 184 185 186 187 187 187 187 187 187 186 187 187 187 187 188 189 190 192 193
1988 193 194 194 194 195 196 197 199 201 202 203 204 205 206 207 207 208 209 210 212 214 215 216 217 217 218 219 220 221 222 224 226 227 229 231 232 232 233 234 236 237 239 240 240 242 244 246 247 248 249 251 253 255 256 257 258 259 260 261 263 264 266 266 267 269 270 272 273 275 277
1980 277 278 279 280 282 284 285 286 287 289 291 292 293 295 297 299 300 302 303 304 306 308 309 311 313 314 315 316 318 319 321 322 324 325 327 329 331 333 334 335 336 338 340 341 342 344 346 348 349 350 351 353 355 356 357 358 360 362 365 367 368 369 370 371 373 374 376 378 380 382
1973 382 383 384 384 385 386 388 389 391 393 395 396 397 398 400 402 403 405 406 407 409 411 412 413 414 415 416 417 418 419 420 422 423 425 426 428 429 430 431 432 432 434 436 437 439 440 441 442 442 444 446 446 447 449 451 452 453 453 454 456 457 458 459 460 460 461 462 463 465 466
1966 466 467 468 469 470 472 473 474 474 474 474 474 475 475 476 478 479 480 481 481 481 482 483 484 484 485 486 486 486 486 487 489 489 489 489 490 490 490 490 491 491 492 492 493 493 493 494 494 495 495 496 495 495 495 495 495 495 495 496 496 495 494 494 494 494 494 493 493 493 494
1959 494 494 493 493 492 491 491 491 491 491 490 489 489 488 488 487 487 487 486 485 484 484 483 482 482 481 480 480 479 479 478 478 477 475 473 472 472 472 472 471 470 469 468 468 466 465 464 463 463 462 461 460 459 458 456 455 454 453 451 450 449 448 447 446 445 444 443 442 440 440
1951 440 439 438 437 435 435 434 432 431 430 429 427 425 424 423 422 420 419 418 416 415 414 413 413 411 410 409 407 406 405 403 402 401 399 397 396 395 394 393 391 389 388 386 385 384 383 381 380 378 376 375 373 371 369 368 367 365 363 363 362 360 359 357 355 354 352 350 349 348 347
1944 347 345 343 341 340 340 338 337 336 334 333 332 330 328 326 324 322 320 319 317 315 313 312 311 310 309 308 306 304 303 301 300 298 297 296 294 293 291 289 287 286 285 284 282 281 280 279 277 276 275 273 271 270 268 267 265 264 262 261 260 259 258 257 256 255 253 251 249 248 247
1937 247 246 245 243 242 241 239 238 237 236 234 233 231 231 230 229 228 226 225 224 223 222 220 218 217 216 215 214 213 212 210 210 209 208 206 205 204 202 202 201 200 199 198 197 196 195 194 194 193 191 190 190 190 188 187 186 185 184 183 182 181 181 181 179 178 177 176 176 175 175
1929 175 173 173 172 171 171 170 169 168 168 167 167 167 166 165 164 163 162 162 162 161 161 160 158 156 155 155 154 153 153 152 152 151 151 150 150 149 148 148 148 148 147 147 146 145 144 144 144 143 142 141 141 141 140 140 139 138 138 137 137 136 136 136 135 135 135 135 134 134 134
1922 134 133 132 132 131 131 130 130 129 128 128 127 128 128 127 126 125 125 125 125 124 124 123 124 124 123 122 121 122 122 122 122 121 121 120 120 120 119 119 119 118 117 116 115 115 116 116 115 115 114 114 113 113 112 112 112 112 112 112 113 113 113 112 111 110 109 109 108 107 107
1915 107 107 107 107 107 107 106 106 106 106 106 105 105 106 105 104 104 104 104 104 104 103 103 102 102 102 102 102 102 101 100 100 100 100 99 100 100 100 99 99 100 99 98 98 98 98 98 99 99 98 98 97 97 97 97 96 96 95 95 95 95 95 95 95 94 94 94 95 94 93
1907 93 94 94 95 94 93 92 92 92 93 92 92 92 92 92 92 92 92 92 91 91 90 90 89 89 89 90 89 89 89 89 89 89 89 89 89 89 88 88 87 87 87 86 86 86 86 87 87 87 86 86 86 85 85 85 86 86 85 85 85 86 85 85 84 84 84 84 85 85 86 86
1900 86 85 85 84 83 83 83 83 83 83 83 83 83 83 82 82 81 82 82 82 82 82 82 82 82 82 82 82 82 82 82 82 81 81 81 81 81 81 82 82 82 82 82 81 81 81 81 80 80 80 79 79 79 79 80 80 79 78 78 77 77 78 78 79 78 78 78 78 77 77 76
1893 76 77 77 77 77 77 77 77 77 77 78 77 77 77 77 76 76 76 77 76 76 77 77 77 77 76 76 77 77 76 75 75 76 76 77 76 76 75 75 75 75 76 76 76 76 76 76 76 76 75 75 75 75 74 74 74 73 73 73 73 73 74 74 74 74 75 75 74 74 73 72
1885 72 73 73 73 73 73 73 73 73 73 73 73 73 73 72 72 72 71 71 72 72 72 73 73 73 73 72 72 72 72 72 72 72 73 73 72 72 71 70 71 71 71 71 71 70 70 71 72 72 71 71 71 71 71 71 71 71 71 70 71 71 71 70 69 69 69 70 70 70 70 70
1878 70 70 70 70 70 70 70 71 71 71 71 71 71 71 70 70 70 70 69 69 70 70 70 70 69 69 68 69 69 69 69 69 69 69 69 69 69 70 71 71 70 69 68 68 68 68 68 67 67 67 67 66 67 67 67 67 67 67 68 68 67 67 67 67 67 67 67 67 68 68 69
1870 69 68 68 68 68 68 68 67 67 67 68 68 68 68 68 68 68 68 67 67 67 68 68 68 68 67 67 66 65 66 66 66 66 67 66 65 66 67 67 67 67 67 66 66 66 66 65 65 65 64 64 63 64 65 66 66 66 66 66 66 66 65 65 65 66 66 67 66 65 64 64
1863 64 64 64 64 64 64 65 65 66 66 66 66 65 65 66 66 66 66 67 66 65 65 64 64 64 64 64 64 64 64 64 64 64 64 64 64 63 63 63 63 63 63 63 64 64 65 65 64 64 64 64 64 64 64 64 64 63 63 63 63 63 64 64 64 65 65 66 66 65 65 64
1855 64 63 62 63 64 64 64 64 64 64 63 63 62 62 61 62 62 62 63 63 63 64 64 64 64 64 65 64 64 64 64 64 64 64 64 64 64 63 63 63 62 62 63 63 62 62 62 63 63 62 62 62 62 62 63 62 62 62 62 62 61 61 61 61 61 61 62 63 62 62 62
1848 62 62 62 62 62 62 62 62 62 62 62 62 62 62 62 62 62 63 63 63 63 63 63 62 62 63 63 63 63 63 63 63 62 62 62 61 61 61 61 62 62 62 61 61 60 60 61 61 61 61 61 62 63 63 62 62 62 61 61 62 62 62 63 62 61 60 60 60 60 61 61
1841 61 61 61 60 61 61 61 61 62 62 62 62 62 62 62 62 62 62 61 61 62 62 63 63 62 62 62 62 61 61 60 59 59 60 61 61 60 60 60 61 61 61 61 61 60 59 58 58 58 59 60 60 60 60 61 61 61 60 60 60 61 62 62 63 63 63 62 62 61 61 61
1833 61 61 61 62 62 62 62 61 60 60 60 60 61 61 61 61 61 61 62 61 61 60 60 60 60 60 61 60 60 59 59 59 59 60 60 60 60 60 60 60 59 59 59 60 60 60 60 60 61 61 61 61 61 61 61 61 62 61 60 60 59 59 59 60 60 60 60 60 59 59 59
1826 59 59 59 59 58 59 59 59 59 60 60 60 61 61 61 60 60 61 61 62 62 62 61 60 60 59 59 59 60 60 61 61 61 60 60 60 60 60 60 60 60 60 59 60 61 61 61 61 61 61 60 61 61 61 61 60 60 60 60 60 59 60 60 60 60 60 60 60 59 59 59
1818 59 59 59 60 60 60 60 60 60 59 59 60 60 60 61 61 60 59 59 60 60 60 59 59 59 59 60 59 59 59 59 59 59 59 58 59 59 59 59 59 59 58 58 59 59 59 59 59 59 60 59 59 59 59 58 59 59 60 60 60 59 59 59 59 59 60 60 60 60 60 59
1811 59 60 60 60 59 59 58 58 58 58 58 59 60 61 60 60 60 61 61 61 60 59 58 58 59 58 58 58 58 58 58 59 58 58 58 58 58 58 58 59 59 59 59 59 60 60 60 60 59 58 58 58 58 59 59 59 58 58 58 59 59 60 61 61 60 59 59 59 59 58 58
1804 58 58 58 58 58 58 58 58 58 58 58 58 57 57 58 58 58 58 57 57 57 57 58 59 59 59 60 59 59 59 58 58 58 58 58 58 58 59 59 59 60 60 60 60 60 60 59 59 59 59 59 59 59 59 58 58 57 57 58 58 57 58 58 57 57 57 57 57 57 58 58
1796 58 58 57 57 56 56 56 56 56 57 57 58 58 58 57 57 56 56 57 57 58 58 59 59 59 59 59 59 59 58 59 59 59 59 59 59 59 59 59 59 58 58 59 59 59 59 59 58 58 58 58 58 58 57 57 57 56 57 57 57 58 58 58 58 58 58 58 58 58 58 57
1789 57 57 57 56 56 57 56 56 57 57 57 59 59 59 59 59 58 58 59 59 58 58 58 59 59 58 59 60 60 59 59 59 59 59 59 59 59 59 60 60 59 58 58 58 58 58 57 57 57 57 56 57 57 57 57 57 57 58 59 58 58 58 57 57 57 57 57 57 57 57 58
1781 58 58 58 58 57 57 57 57 58 58 58 58 58 58 58 58 58 58 58 58 58 58 58 57 57 57 57 56 56 57 57 58 58 58 58 58 58 57 57 58 58 58 58 59 59 59 59 59 58 58 58 57 58 59 59 59 58 58 58 58 58 59 59 59 58 58 58 58 58 58 58
1774 58 59 59 59 60 60 60 60 59 59 59 58 57 58 58 59 59 59 60 61 61 61 60 60 59 59 59 59 59 59 59 59 59 59 59 60 60 60 60 60 59 59 59 59 60 59 59 59 60 60 59 59 59 59 59 59 60 59 59 59 59 59 59 59 59 59 59 60 60 60 60
1766 60 59 59 59 58 58 58 58 58 58 58 58 59 59 59 59 59 59 60 60 60 60 60 60 60 60 60 59 58 58 59 59 59 59 59 59 59 59 58 58 60 60 59 58 57 58 59 60 60 60 60 60 60 60 60 60 61 61 61 61 62 62 62 62 62 61 60 59 59 60 60
1759 60 60 60 59 59 60 61 61 60 60 59 59 59 60 60 60 60 60 60 60 59 59 59 59 59 59 59 59 60 60 59 59 58 58 58 58 57 57 57 57 58 58 59 59 58 58 58 58 57 57 57 57 59 60 60 60 60 59 58 58 59 59 59 59 59 59 58 58 58 59 60
1752 60 59 59 58 58 58 58 58 57 57 57 58 59 59 59 59 59 59 59 59 59 59 59 59 59 59 59 58 57 56 56 56 57 57 58 58 57 57 57 57 57 57 57 57 57 58 58 59 58 58 58 57 57 57 57 57 57 58 58 57 57 57 57 57 57 57 57 57 58 58 59
1744 59 59 58 59 59 59 59 58 57 57 57 57 58 58 58 58 59 58 57 57 57 58 58 58 58 58 58 58 58 58 58 58 57 57 57 57 58 58 58 58 58 58 58 58 58 59 59 59 58 57 57 56 56 56 56 57 58 57 56 56 56 56 56 55 55 55 54 55 55 55 56
1737 56 56 56 56 56 57 57 56 56 56 56 56 56 56 56 56 57 57 57 57 58 58 57 57 57 57 57 56 56 56 57 57 56 55 55 56 57 57 57 57 58 58 59 59 57 57 57 57 57 57 57 57 57 57 57 57 57 56 56 56 57 57 56 56 56 57 57 57 57 57 57
1729 57 57 58 58 58 59 59 59 58 58 58 58 58 58 58 58 58 58 58 58 59 58 58 58 58 58 58 58 58 58 58 59 60 60 60 59 59 60 59 59 59 59 59 59 59 59 59 59 60 60 60 60 60 60 60 60 60 60 60 60 60 60 60 59 60 60 60 60 60 61 61
1722 61 62 62 62 63 63 63 63 62 63 64 64 63 64 64 63 63 63 63 63 63 64 65 65 65 65 66 66 66 67 67 68 69 69 69 70 72 73 74 75 77 78 79 81 83 87 90 93 97 101 105 110 115 120 126 131 137 143 150 157 165 173 181 190 200 210 218 225 233
1715 233 240 247 252 256 259 262 262 262 261 259 255 251 248 243 239 237 235 236 237 240 244 250 257 265 275 285 295 307 320 335 350 366 381 396 409 421 432 440 447 451 453 452 447 440 430 417 401 384 365 347
1709 347 329 312 296 281 269 260 253 248 245 242 241 241 244 247 251 256 260 266 272 278 285 290 294 297 300 302 303 302 299 294 289 283 276 268 261 253 245 240 236 234 233 234 238 244 251 258 267 278 290 303 317 331 347 363 380 398
1703 398 416 434 451 466 480 492 502 509 513 515 513 508 501 492 482 470 459 449 440 433 430 430 435 442 453 466 482 500 520 542 567 594 625 656 689 722 754 785 814 839 859
1699 859 875 885 890 888 881 867 847 819 786 748 707 666 624 585 549 517 490 467 449 435 425 419 416 416 418 422 429 438 448 458 469 481 492 502 510 516 520 521 519 515 507 496 482
1695 482 465 445 423 400 376 353 332 313 296 281 269 259 252 246 243 242 241 242 244 247 251 256 262 269 276 285 293 301 307 313 318 321 324 327 328 327 323 318 312 305 298 291 284 277 273 270 269 269 271 275 281 288 296 307 318
1689 318 331 345 360 375 392 409 426 442 457 470 481 490 496 500 500 498 491 480 466 449 429 407 385 363 342 322 304 288 275 264 255 249 245 242 241 242 244 247 251 255 260 265 271 276 281
1684 281 285 287 289 290 289 286 282 276 268 258 247 236 223 210 198 185 173 162 152 142 134 127 121 115 110 106 102 99 97 95 92 90 88 86 84 83 82 82 80 79 78 77 77 76 75 74 74 73 73 72 71 70 69 69 69 69 68 68
1678 68 68 69 69 68 68 67 67 67 66 66 66 66 66 66 66 65 65 64 64 64 64 64 65 65 65 65 65 65 63 63 63 64 63 63 63 63 64 64 64 63 63 63 63 62 62 62 62 61 61 61 61 61 61 60 60 61 62 62 62 62 63 63 63 62 61 60 60 60 61 62
1670 62 62 62 62 62 62 62 62 62 63 63 62 62 62 63 62 62 62 62 63 63 63 63 63 63 63 63 63 64 64 64 63 63 62 62 62 61 62 62 63 63 63 63 63 62 62 62 62 61 61 61 61 61 61 61 61 61 61 62 62 61 61 61 61 61 61 61 61 61 61 62
1663 62 62 62 62 62 62 62 62 62 62 62 62 61 61 61 61 62 62 63 63 63 63 63 63 63 63 63 63 63 63 63 64 64 63 63 63 62 62 62 62 62 62 61 61 61 62 62 61 60 60 60 60 61 61 62 61 61 60 60 61 61 61 61 60 59 59 59 59 59 60 61
1656 61 61 61 61 60 60 59 60 60 60 61 60 60 60 60 59 59 60 59 59 61 61 62 62 61 61 61 61 61 61 61 61 62 62 62 63 62 62 62 62 62 62 62 62 61 61 61 61 61 61 61 60 60 60 61 61 61 61 61 62 62 62 61 61 61 61 61 61 61 61 61
1648 61 61 60 60 60 61 61 62 62 62 61 61 61 61 62 62 63 64 63 62 61 62 62 62 61 60 61 61 61 61 61 61 62 61 61 61 60 60 60 59 59 59 59 59 59 60 60 60 61 61 61 61 61 60 60 61 61 61 61 61 60 61 61 61 61 62 61 61 61 60 60
1641 60 60 60 59 60 60 60 60 61 59 59 60 61 62 62 62 62 62 63 63 62 61 61 61 61 61 60 60 60 61 61 61 60 61 62 62 61 61 61 61 62 62 62 61 61 60 61 61 62 62 62 63 63 64 63 63 64 65 65 65 64 64 63 63 62 62 62 63 63 63 63
1633 63 62 61 61 60 60 60 60 60 61 61 61 61 62 61 61 61 61 61 60 60 60 60 61 61 61 61 60 60 61 62 61 61 61 61 60 60 60 61 60 59 59 58 58 58 58 58 58 59 59 59 58 58 59 59 59 59 59 59 59 59 59 59 59 59 60 60 60 60 60 59
1626 59 58 57 58 58 58 59 59 59 59 58 59 59 60 60 61 60 61 61 60 60 60 60 61 61 61 62 62 62 62 61 60 60 61 61 61 62 62 62 62 62 61 61 60 60 60 60 60 61 60 60 60 60 61 62 62 63 63 64 66 67 67 67 67 67 67 69 70 71 73 74
1618 74 75 77 77 77 78 79 79 79 79 79 78 78 77 76 75 74 73 72 71 70 69 68 67 66 65 65 64 63 63 62 61 61 61 61 62 62 62 62 62 62 62 63 62 62 63 63 64 64 64 64 64 64 64 65 65 66 67 68 69 70 72 73 74 75 77 79 79 80 80 81
1611 81 82 83 85 85 86 86 87 87 87 88 88 89 89 88 88 87 86 86 85 84 82 80 78 77 77 76 75 74 73 72 70 69 68 67 67 66 65 64 64 64 64 64 63 63 62 62 62 62 61 60 60 61 61 61 62 61 61 61 61 62 62 63 63 64 64 64 65 66 67 67
1604 67 68 69 71 71 72 73 74 75 76 77 78 79 80 80 80 79 77 77 76 75 74 73 72 72 71 70 68 67 66 65 64 63 63 62 62 61 61 60 60 59 59 59 59 59 58 58 57 57 57 57 57 57 57 57 58 58 58 58 57 58 57 57 56 57 57 58 57 56 56 57
1596 57 57 57 57 56 57 57 57 57 58 58 58 57 57 57 57 58 58 58 57 57 57 57 57 58 58 57 57 58 57 57 56 57 58 58 58 57 57 56 56 56 56 57 57 57 56 56 56 56 56 56 56 57 57 57 57 57 57 57 56 56 57 57 57 57 57 56 56 55 56 57
1589 57 57 57 57 57 57 58 57 57 57 56 56 56 56 56 56 57 57 56 56 57 57 57 57 57 57 57 57 58 57 56 56 55 56 56 56 57 57 57 58 58 58 58 57 57 57 57 57 57 57 57 57 56 56 56 57 57 57 58 58 57 57 57 57 57 56 55 55 55 55 56
1581 56 56 56 55 55 56 56 56 56 56 57 57 58 57 56 56 57 57 57 57 56 56 56 56 57 57 57 57 56 56 57 57 57 57 57 57 57 57 56 56 55 56 57 57 57 58 58 57 57 57 56 56 57 57 57 56 56 56 56 56 55 56 56 56 55 55 55 56 57 57 57
1574 57 57 57 57 57 57 57 57 56 56 56 56 56 56 55 55 56 57 57 57 57 57 57 57 57 56 57 56 56 57 56 56 56 56 56 56 56 56 56 56 56 56 57 57 57 57 56 56 56 56 56 56 56 56 56 55 55 55 56 55 55 56 56 56 55 55 55 55 55 56 56
1567 56 56 56 56 56 56 55 55 55 55 55 54 54 55 55 55 55 55 55 55 55 55 55 56 56 56 56 57 57 57 56 56 55 55 54 54 54 54 54 55 56 57 57 57 57 57 56 55 55 56 56 56 56 56 56 56 55 55 55 55 56 55 55 55 54 55 55 55 56 56 56
1559 56 56 56 55 55 55 55 56 56 56 56 56 55 55 56 56 57 56 57 57 56 55 55 56 56 56 57 57 57 57 57 56 56 57 58 58 58 57 57 57 57 57 56 56 56 56 56 56 56 56 56 56 56 56 56 56 57 57 57 56 56 56 56 56 56 56 57 57 57 57 57
1552 57 56 55 55 55 55 55 56 56 56 57 57 57 56 56 56 55 55 54 55 54 54 55 55 55 56 55 55 55 56 56 56 55 56 55 55 56 56 56 55 56 56 56 55 54 54 55 55 56 56 56 56 56 56 55 56 57 56 56 55 54 55 55 56 56 56 57 56 56 55 55
1544 55 55 54 54 54 54 55 55 55 55 55 55 55 55 55 56 56 56 55 55 54 54 54 55 55 56 57 57 57 57 57 57 57 56 56 56 57 56 57 57 57 57 56 56 56 56 56 56 55 55 55 55 55 55 55 55 55 55 55 55 56 56 56 56 56 56 56 56 56 56 56
1537 56 56 57 56 56 56 55 54 55 56 56 56 55 55 56 56 56 56 56 56 56 56 56 55 55 55 55 56 56 55 55 55 55 55 55 55 56 56 56 56 56 56 56 56 56 56 56 56 56 55 54 54 54 54 54 54 54 54 55 56 57 57 57 57 56 56 55 55 54 55 55
1529 55 55 55 55 55 55 55 55 56 56 56 56 56 56 56 57 56 55 54 54 54 54 54 54 54 55 55 56 56 55 55 55 54 54 54 55 55 55 55 55 54 54 54 55 55 56 55 55 54 54 54 55 56 56 57 56 56 55 55 55 56 56 56 56 56 56 56 56 56 55 55
1522 55 55 56 56 56 56 56 56 57 57 58 58 59 59 60 60 61 62 62 63 64 64 65 67 68 70 72 73 74 75 76 76 76 77 78 79 79 78 77 75 74 71 69 67 66 65 62 60 59 59 58 58 58 57 57 57 57 57 57 56 55 55 55 55 55 56 56 56 56 55 54
1515 54 54 54 54 55 55 55 54 54 54 54 54 54 55 55 55 55 55 55 55 55 55 55 55 55 55 54 55 55 55 55 55 55 55 55 55 55 55 54 54 54 54 55 55 55 55 55 55 55 56 56 56 55 55 55 56 56 56 56 55 55 55 55 55 55 56 56 56 57 56 55
1507 55 54 54 55 55 55 55 54 54 54 54 55 55 55 55 55 54 55 55 55 54 54 54 55 55 55 55 55 55 55 54 54 54 54 54 54 53 53 54 55 55 55 55 55 56 56 56 56 56 56 56 56 56 55 54 54 54 54 54 54 54 54 54 54 53 53 53 54 54 55 54
1500 54 54 54 54 54 54 53 54 54 54 54 54 54 55 55 55 55 55 55 55 54 54 54 54 55 55 55 55 54 54 54 55 55 54 55 55 55 54 54 54 54 54 54 54 55 55 55 55 54 54 54 54 54 54 54 54 54 55 56 56 56 56 56 55 54 53 53 54 54 54 55
1492 55 54 54 55 55 55 55 54 55 55 55 55 54 54 55 55 55 54 54 54 55 55 55 55 55 55 55 55 55 55 54 54 53 54 55 55 54 54 54 54 55 55 55 55 54 54 54 53 54 55 55 55 54 54 55 55 55 55 56 56 55 55 55 55 55 55 55 55 55 55 55
1485 55 55 54 54 54 55 55 54 54 54 54 53 53 53 54 55 55 55 55 55 55 55 55 55 55 55 55 55 56 55 55 55 55 55 54 54 54 53 53 53 53 53 53 53 53 53 54 54 54 54 54 54 54 53 53 54 54 54 54 53 53 53 53 54 54 53 53 53 53 53 53
1478 53 54 54 53 53 53 53 53 53 53 54 54 55 55 56 55 55 55 55 55 55 54 54 54 54 53 53 53 53 54 54 53 52 52 52 53 53 54 54 53 54 54 55 55 55 55 54 54 54 54 54 54 53 53 53 52 51 51 51 52 53 53 53 53 53 53 53 53 54 54 53
1470 53 53 52 53 53 53 53 53 54 54 54 54 54 54 54 54 53 54 55 56 55 54 54 55 55 55 55 55 55 56 57 57 57 57 57 58 58 57 57 57 57 58 58 58 57 57 58 59 59 60 60 59 58 58 56 55 55 54 53 53 54 53 53 54 54 54 54 53 53 53 53
1463 53 53 53 53 53 53 54 54 54 53 53 53 53 53 53 54 54 53 54 54 54 53 53 52 52 52 53 53 53 53 53 53 53 53 53 53 53 54 54 54 54 54 54 54 54 54 54 54 53 53 53 52 51 51 51 51 52 52 52 52 52 53 54 54 54 54 54 54 54 54 54
1455 54 54 54 54 54 54 54 53 53 53 53 53 53 53 53 53 53 52 53 53 54 55 56 55 55 54 54 54 53 53 52 52 53 52 52 52 52 52 52 52 52 52 52 52 53 53 53 53 53 53 53 54 54 54 53 53 53 53 53 53 54 54 54 54 54 54 54 54 54 54 54
1448 54 54 54 53 52 52 52 53 54 53 53 53 53 53 54 54 53 53 52 53 53 54 54 54 54 53 53 52 53 53 53 54 54 54 54 53 54 54 53 53 53 53 53 54 54 54 54 54 53 53 53 53 53 53 53 53 54 55 55 54 54 53 53 52 52 52 52 52 52 52 52
1440 52 52 53 53 53 53 53 53 52 52 52 52 52 52 52 52 53 53 53 52 53 53 53 53 53 53 52 53 54 54 53 52 52 52 52 52 52 53 54 55 55 56 55 54 53 53 54 54 54 54 54 53 53 53 53 53 53 53 53 53 53 53 53 53 53 53 54 54 54 53 53
1433 53 53 53 54 54 54 55 55 56 56 57 57 57 57 58 59 60 60 62 63 65 66 67 67 67 69 70 73 75 76 78 78 79 79 79 80 80 80 81 80 77 75 72 69 67 64 62 61 59 58 57 57 56 55 55 55 56 56 56 55 55 55 56 57 57 57 57 57 57 56 56
1426 56 57 57 58 59 59 59 59 59 60 60 60 61 62 62 63 65 66 68 68 69 70 70 71 73 74 74 75 76 77 78 78 78 78 77 77 76 75 74 73 71 70 68 67 65 65 64 63 62 62 60 60 59 59 58 58 58 58 58 58 58 57 57 57 57 57 56 56 56 56 55
1418 55 55 55 55 55 55 55 55 56 56 56 56 56 56 56 56 56 56 57 57 57 57 57 57 57 57 57 57 57 57 56 56 56 57 57 58 59 59 59 58 58 58 59 59 60 60 59 59 59 59 59 59 59 59 58 59 59 59 59 60 59 59 59 59 59 59 59 59 59 59 59
1411 59 59 58 58 58 58 59 59 60 59 59 60 59 59 58 59 59 58 58 59 59 59 60 60 59 58 58 59 59 59 59 60 60 60 59 59 59 59 59 58 58 58 59 58 58 58 57 58 58 58 58 58 58 58 58 59 58 57 57 57 58 58 59 59 58 58 58 57 56 56 57
1403 57 57 57 57 57 57 57 57 58 59 59 59 58 58 57 58 59 59 59 58 59 59 59 59 59 59 58 59 59 59 59 60 59 59 59 59 59 59 59 59 59 59 58 58 58 58 58 59 59 58 59 60 60 61 61 60 60 59 58 58 58 59 60 59 58 59 60 59 59 59 59
1396 59 58 58 58 59 60 61 60 60 60 60 59 59 59 59 60 60 59 59 59 60 60 60 60 60 60 60 61 61 61 60 60 60 60 60 60 60 60 60 60 60 59 59 59 59 59 59 58 58 58 58 58 59 60 59 59 59 59 59 59 59 59 59 59 59 59 59 59 59 59 59
1389 59 60 61 61 61 61 62 61 61 61 61 61 61 62 62 61 61 61 61 63 63 63 62 62 62 61 61 61 61 61 60 60 60 59 59 58 58 58 57 58 58 58 59 58 58 58 58 58 58 58 58 57 57 58 59 60 60 60 60 60 59 59 59 60 60 61 61 61 61 61 60
1381 60 61 61 61 61 61 61 60 60 60 60 59 59 60 61 62 62 62 61 61 61 61 61 62 62 62 61 61 61 61 63 63 64 63 62 62 62 63 62 62 63 63 63 63 64 64 64 64 64 64 64 64 64 64 64 65 65 65 65 65 65 64 64 65 65 65 65 66 66 65 65
1374 65 65 65 66 67 68 68 67 67 67 67 67 68 67 67 67 67 67 67 67 67 67 67 68 69 70 70 71 71 71 71 71 71 71 70 70 71 72 72 72 72 71 71 72 73 73 73 73 73 74 74 75 75 76 75 75 75 76 77 77 78 78 78 78 79 79 79 79 80 81 82
1366 82 81 82 82 83 84 84 84 84 84 84 85 85 85 85 86 86 87 87 88 89 89 89 89 90 90 91 91 91 93 95 95 96 96 96 97 97 98 99 99 99 100 101 102 103 104 105 105 106 106 106 107 109 110 112 113 113 114 116 117 118 120 121 122 123 124 124 125 126 128 129
1359 129 131 132 135 136 137 138 139 140 141 143 146 148 149 151 153 154 155 157 159 162 164 167 169 170 173 176 179 183 186 189 192 194 197 201 205 208 212 216 220 224 228 232 237 242 248 253 258 263 269 275 281 286 292 299 306 313 319 326 333 340 348 355 363 370 379 387 395 402 410
1352 410 418 426 435 444 454 463 472 481 490 499 509 519 529 538 548 557 566 576 585 595 604 613 623 632 641 649 657 666 674 682 690 697 705 713 720 726 732 738 745 750 755 760 764 768 772 776 780 783 786 789 791 793 794 796 798 799 800 800 801 800 800
1345 800 799 799 798 797 795 794 793 790 788 785 782 778 774 770 766 762 758 753 749 745 741 736 732 727 723 719 715 711 707 703 699 694 690 686 682 679 676 673 671 669 666 664 662 660 658 658 658 658 658 658 659 659 660 662 664 666 669 672 674 677 681 686 690 694 698 702 707 713 719
1338 719 724 730 736 742 749 756 763 770 777 784 792 799 806 814 821 829 837 844 852 859 865 871 879 886 893 898 903 909 914 919 924 930 935 939 943 946 949 952 954 955 957 958 958 959 960 960 959 959 958 956 953 951 949 946 942 937 933 928 923 918 912 907 900 893 886 879 872 864 856
1330 856 846 837 828 818 809 800 789 779 769 757 746 735 723 712 701 690 679 669 658 646 635 623 611 600 589 578 567 556 545 535 524 513 503 492 482 472 462
1327 462 452 443 434 425 416 407 398 390 381 372 364 356 348 341 334 326 320 313 306 300 294 288 282 277 272 266 261 256 251 247 242 238 234 229 225 222 218 215 211 207 203 200 197 194 192 189 186 183 181 178 176 174 172 169 167 165 163 160 158 157 155 153 151 149 147 145 143 142
1319 142 140 139 138 137 136 134 133 132 130 130 129 127 126 125 124 123 122 121 120 119 118 117 116 115 115 114 113 112 111 111 111 111 110 108 108 107 107 106 105 105 104 103 102 102 102 101 101 101 100 100 99 99 99 99 99 98 97 97 98 97 97 97 97 97 96 96 95 95 95
1312 95 94 93 93 93 92 92 91 92 91 91 91 91 92 92 92 91 90 89 89 89 88 88 87 87 87 87 87 86 86 86 85 85 85 85 84 84 83 83 83 82 82 82 81 81 81 81 80 80 80 80 80 80 79 79 79 79 78 77 77 77 77 77 77 77 77 76 76 76 77 77
1305 77 76 75 75 76 75 75 75 75 74 75 75 75 75 76 76 76 77 77 77 76 76 76 76 76 76 76 76 77 77 77 77 77 78 78 77 77 77 76 76 76 77 76 76 77 77 76 75 75 76 76 76 76 75 75 75 74 74 74 74 74 73 72 72 72 72 72 72 72 72 72
1297 72 72 72 72 73 73 73 73 73 73 73 73 73 73 72 72 72 72 73 72 72 71 70 69 68 68 68 68 68 68 68 67 67 68 68 68 68 68 68 68 67 66 65 66 65 65 65 65 65 65 65 66 66 66 66 66 66 65 65 66 67 66 66 66 65 66 66 67 67 67 67
1290 67 67 67 67 67 67 67 67 68 68 69 69 68 67 67 68 68 68 68 67 67 67 68 68 67 67 66 66 66 65 65 66 66 66 67 66 66 65 66 66 67 67 67 67 66 67 67 67 67 67 67 67 66 66 66 66 66 67 67 68 68 68 69 69 68 68 68 67 67 66 66
1282 66 66 66 65 65 64 63 64 64 65 65 65 65 65 65 65 65 65 65 64 64 64 63 63 62 63 63 63 63 63 64 63 63 63 63 63 62 63 63 63 63 63 64 63 63 63 63 63 63 63 63 63 63 62 62 62 62 62 63 64 64 64 64 63 63 63 63 63 63 63 63
1275 63 63 63 63 63 63 62 62 62 62 62 62 61 61 61 62 62 61 61 61 61 61 62 62 62 63 62 62 62 62 62 62 62 62 61 61 61 61 61 61 61 61 60 60 61 62 62 63 62 61 61 61 62 63 63 62 61 62 62 63 63 63 63 62 62 61 60 60 61 61 61
1268 61 61 61 61 61 62 61 61 62 62 63 62 62 62 62 62 62 62 61 61 62 62 62 62 62 62 61 61 62 62 62 63 64 64 64 65 64 64 63 63 63 64 65 65 64 64 64 64 64 64 64 63 63 63 62 63 64 64 64 64 64 64 63 63 63 64 65 65 64 64 64
1260 64 63 63 63 63 63 64 65 65 66 66 66 65 65 66 65 65 65 65 65 65 65 65 65 65 66 67 67 66 65 65 65 66 66 66 67 67 68 69 70 70 71 70 70 72 73 74 74 74 74 73 74 74 75 75 76 78 79 80 81 82 83 84 87 89 90 91 93 95 97 100
1253 100 103 105 108 112 116 121 126 132 138 145 151 160 169 178 187 198 209 221 235 248 262 277 292 307 323 340 356 372 388 403 416 430 442 452 459 464 467 468 467 463 455 446 435 422 409 395
1248 395 382 369 356 345 334 326 320 316 314 314 315 318 323 328 334 342 351 362 373 385 398 411 424 437 451 464 475 485 493 499 503 505 504 501 495 485 473 458 442 423 403 384 364 344
1243 344 325 307 292 278 266 255 246 238 230 224 218 214 210 208 205 204 204 203 204 205 207 210 214 218 223 230 237 244 253 263 274 287 301 317 334 352 372 394 417 441 466 494 523 554 587 621
1238 621 656 692 728 763 799 835 870 904 934 961 985 1006 1023 1037 1046 1051 1052 1049 1042 1031 1017 1002 985 967 948 929 911 895 879 865 853 842 832 823 817 814 813 816 821 830 843
1234 843 858 876 896 918 940 964 987 1009 1029 1047 1062 1074 1084 1088 1089 1085 1075 1062 1045 1023 998 971 942 910 878 845 812 779 746 714 682 651 620 589 559 530
1230 530 502 476 452 430 410 392 375 362 350 340 331 323 316 311 306 303 302 301 302 304 307 312 319 326 334 343 354 367 380 395 411 428 447 468 491 514 540 567 594 623 652 681 709
1226 709 738 765 791 816 840 863 884 903 919 932 943 952 957 960 962 961 957 951 943 933 921 906 891 875 857 838 820 802 785 770 758 748 741 738 738 741 749 759 773 787 802
1221 802 817 834 850 866 881 895 908 918 927 933 936 937 933 927 918 906 892 876 857 837 814 787 759 728 696 662 629 595 560 526 494 464 435 408 384 362 341 322
1217 322 305 291 277 265 255 246 237 230 224 218 213 208 203 199 196 194 192 190 189 188 188 189 190 192 194 197 201 205 210 216 222 229 237 244 253 262 271 281 292 303 313 324 335 346 356 366 375 382 388 392 394 395 394 391 386
1211 386 379 370 359 346 333 320 308 296 284 274 266 259 253 249 247 246 246 248 250 253 259 264 271 278 285 293 300 308 316 324 331 339 346 351 354 356 357 356 354 350 344 336 326 315 303 289 275 259 244 229 216 203
1206 203 192 181 171 163 155 149 143 137 132 128 124 120 116 114 112 110 107 104 102 100 98 96 95 94 92 91 90 89 88 87 86 85 85 84 83 82 81 80 80 79 78 78 77 76 76 76 75 75 74 74 73 72 71 72 72 73 73 73 72 72 72 71 71 71 71 71
1199 71 71 70 70 70 70 70 70 70 70 69 69 68 68 68 67 67 67 67 66 65 65 66 67 67 67 66 66 66 65 65 65 65 65 64 64 65 65 64 64 64 64 64 64 64 64 64 64 64 65 65 65 65 65 65 64 64 64 64 64 65 65 64 64 64 64 64 64 64 64 64
1191 64 64 64 64 65 65 65 65 64 63 63 63 64 64 64 64 64 64 64 64 64 63 64 63 63 63 63 63 63 63 62 63 63 64 64 64 64 63 63 63 63 64 64 64 63 63 63 63 63 63 63 63 63 63 63 63 63 63 62 62 62 62 62 62 62 62 62 62 62 62 62
1184 62 62 62 63 64 64 65 65 64 64 64 63 62 62 63 64 65 64 63 63 63 64 64 64 63 63 63 64 64 65 64 64 64 64 63 64 64 64 64 64 64 64 64 64 64 64 64 64 65 66 66 65 65 65 65 65 65 64 64 64 63 64 64 64 64 64 64 63 64 64 64
1177 64 64 64 64 63 63 64 64 65 64 64 64 63 63 63 63 63 63 63 63 62 62 63 63 62 62 62 62 63 63 63 63 63 64 65 65 65 65 65 65 65 66 66 65 65 65 66 66 66 66 66 67 67 68 68 68 68 68 68 70 70 69 70 69 69 69 69 69 69 69 69
1169 69 69 69 69 68 68 68 68 67 66 67 67 68 68 68 68 69 69 69 69 69 69 69 70 70 69 69 69 70 70 71 72 72 72 71 71 72 72 71 71 71 71 70 70 70 70 70 70 71 70 69 70 70 69 68 68 68 68 68 68 68 68 68 68 69 70 69 69 68 68 68
1162 68 68 68 68 68 68 69 69 68 68 68 68 69 69 70 70 70 69 69 70 72 72 71 71 71 71 71 72 73 73 73 73 73 73 73 74 74 75 75 76 76 77 77 77 77 77 77 76 75 75 75 76 76 76 76 76 76 76 77 78 78 77 77 76 76 77 77 77 77 78 78
1154 78 78 78 79 79 80 81 82 83 83 84 84 83 83 83 82 81 81 81 82 83 83 83 83 83 83 83 83 83 83 83 83 83 83 83 83 83 83 83 83 83 84 84 85 86 86 86 87 88 88 88 88 89 89 90 90 90 90 90 90 90 91 92 92 92 92 93 94 95 96 97
1147 97 97 96 97 97 98 98 99 100 101 101 101 101 101 101 102 103 103 103 104 104 105 106 107 108 109 110 111 112 112 113 113 114 116 116 117 117 118 118 119 120 120 121 121 122 122 123 123 123 124 125 126 127 128 129 130 131 131 132 133 134 135 135 136 136 137 139 140 140 140 140
1140 140 142 143 144 144 144 146 147 148 149 151 153 154 156 157 159 161 162 163 165 167 169 171 173 175 178 180 182 185 187 190 191 193 196 198 201 203 207 210 214 217 220 223 227 230 233 236 240 243 245 248 250 253 256 259 262 265 268 271 273 277 280 282 284 286 288 290 293 296 300
1132 300 303 306 310 312 315 317 321 324 327 330 333 336 341 344 348 352 356 361 366 372 377 383 388 394 401 408 415 421 428 436 445 454 462 471 480 490 500 511 522 534 547 558 571 585 599 614 630 646 662 679 698 718
1127 718 739 760 782 805 829 854 881 909 939 969 1002 1035 1070 1106 1145 1186 1229 1274 1322 1373 1428 1485 1544 1608 1675 1745 1819 1897 1978 2065 2157 2254 2355 2461
1123 2461 2571 2687 2808 2932 3062 3196 3333 3474 3618 3765 3913 4063 4214 4366 4518 4669 4818 4965 5110 5250 5386 5516 5640
1121 5640 5755 5862 5959 6044 6116 6173 6215 6242 6252 6245 6220 6179 6119 6044 5953 5848 5729 5600 5461 5313 5157 4996 4832 4664 4496 4328 4162 3999
1118 3999 3838 3681 3528 3380 3238 3101 2969 2843 2723 2608 2499 2395 2296 2202 2112 2028 1947 1870 1798 1730 1665 1603 1545 1489 1435 1385 1337 1291
1115 1291 1248 1207 1167 1129 1094 1060 1028 998 969 940 913 888 863 840 817 795 774 754 736 717 699 681 666 651 636 621 607 592 578 566 554 542 531 519
1111 519 508 497 487 476 466 457 448 439 431 423 415 407 398 391 383 376 368 360 354 347 341 334 327 322 317 312 305 299 293 288 283 278 274 270 265 260 255 250 247 243 239 236 232 229 225 221 218 215 213 210 208 206 203 201 199 196 194 193 191 189 188 186 186 186
1104 186 185 184 182 181 180 179 179 178 177 176 174 173 172 171 170 169 168 167 167 167 165 164 163 163 162 162 162 161 160 159 158 158 157 156 155 154 153 153 152 151 150 150 149 147 147 146 145 144 144 143 142 142 141 140 140 139 138 137 135 134 133 133 132 132 131 130 130 129 129
1097 129 128 127 126 125 125 125 124 123 123 122 120 119 118 118 118 118 118 117 116 115 115 114 114 114 114 115 115 115 114 114 114 114 114 114 114 113 112 113 113 113 113 113 112 112 111 112 113 114 114 114 114 115 116 117 117 120 122 125 127 131 135 138 142 146 149 154 159 165 171
1090 171 177 183 189 196 203 210 215 221 226 232 236 239 240 242 242 240 237 234 229 222 215 208 200 192 183 174 166 158 150 142 136 130 126 122 119 116 112 110 108 106 105 103 102 101 99 98 97 97 96 96 95 94 92 91 91 91 90 90 90 90 90 90 89 88 88 88 88 88 87
1082 87 86 86 86 85 85 85 85 85 85 84 84 83 83 82 82 82 82 82 82 81 81 81 82 82 82 82 81 81 81 80 79 79 79 80 81 80 79 79 79 79 79 79 78 78 78 77 78 78 79 79 78 78 78 77 76 77 77 77 77 76 75 74 73 72 72 72 71 71 71 70
1075 70 69 68 68 69 69 70 70 71 71 72 73 75 76 77 78 79 80 81 81 81 81 81 81 80 79 78 77 75 74 73 72 72 71 71 70 71 71 70 69 69 69 68 68 68 68 68 69 69 68 68 68 68 68 68 67 67 67 67 67 68 69 69 69 69 69 69 69 69 70 70
1068 70 70 70 70 69 69 69 69 69 69 69 69 68 68 68 67 67 67 66 65 65 65 65 64 64 64 64 64 65 66 66 65 65 65 65 64 64 64 63 63 63 63 64 64 64 64 63 63 63 64 63 63 63 64 64 63 63 63 63 63 64 65 66 65 65 65 65 66 66 67 67
1060 67 67 68 69 70 71 72 72 74 74 74 74 75 76 77 78 79 80 79 79 79 78 77 76 74 73 72 72 72 72 72 72 72 72 72 72 71 71 71 71 72 73 73 73 72 71 70 70 69 68 67 66 66 66 65 64 64 63 63 62 62 62 62 62 62 63 64 65 65 66 66
1053 66 66 68 70 71 73 74 76 77 79 80 82 83 84 84 85 86 87 87 87 87 88 88 87 86 85 85 85 85 84 84 85 85 85 85 85 86 86 85 82 80 79 76 74 72 70 68 67 66 66 65 64 63 63 62 62 62 62 63 63 64 64 65 65 66 66 68 70 71 73 76
1045 76 78 81 83 84 85 87 89 91 94 96 98 99 100 101 102 103 103 104 105 105 107 109 111 113 114 116 118 120 123 128 132 138 143 149 154 160 168 179 190 201 211 220 229 237 246 256 264 271 276 278 277 273 269 265 261 256 251 245 238 231 224 217 210 206 202
1038 202 201 201 202 204 206 206 206 206 204 201 198 196 193 190 188 187 185 183 182 180 179 177 176 174 172 171 170 169 170 170 171 172 174 176 178 181 186 191 197 203 210 217 225 233 242 250 258 267 274 281 288 295 304 312 320 330 340 351 364 379 397 417
1032 417 437 459 481 502 525 550 578 610 644 682 722 767 818 874 939 1012 1095 1189 1294 1414 1550 1708 1891 2106 2362 2665 3024 3446 3941
1029 3941 4518 5183 5935 6765 7658 8592 9547 10517 11523 12608 13810 15144 16593 18128 19744 21484 23401 25447 27437
1027 27437 29133 30362 31135 31616 31981 32320 32621 32767 32557 31794 30361 28251 25577 22583 19571 16765 14253 12061 10203
1025 10203 8681 7464 6501 5737 5122 4619 4199 3841 3534 3266 3029 2817 2625 2449 2286 2133 1990 1856 1730 1616 1511 1416
1022 1416 1330 1251 1180 1116 1058 1006 959 917 879 844 813 784 757 731 707 683 662 641 620 601 582 565 547 531 517 504 492 482 472 462 451 442 433 425 417 408 400
1019 400 393 387 379 372 366 361 356 351 346 341 336 330 324 318 310 303 294 286 277 269 260 251 243 234 225 216 209 202 196 190 184 178 172 167 161 156 151 145 139 133 127 121 114 108 103 99 94 90 86 80 75 70 66 61 55 47 38 28 21 18 19 23 28 33 39 44 51 59
1011 59 68 80 92 102 110 115 118 122 126 130 132 133 134 135 135 135 135 135 136 136 136 134 133 132 131 130 129 129 131 133 134 134 136 138 140 142 143 144 145 145 146 148 150 152 153 152 152 151 151 151 150 150 150 150 149 148 146 144 143 141 139 137 136 134 133 130 128
1004 128 126 124 123 121 119 117 116 114 112 110 109 109 109 109 108 108 108 109 109 108 107 106 105 105 104 104 105 105 105 105 104 105 105 106 107 108 109 112 114 115 116 117 118 119 119 120 120 121 121 121 120 121 121 122 123 121 120 119 118 117 116 114 113 113 113 112 112 111 110
997 110 111 112 112 112 111 111 112 113 114 115 115 114 114 113 112 112 112 112 110 108 107 105 103 102 100 99 97 97 96 96 95 95 94 94 95 96 98 99 100 101 102 103 104 105 106 107 107 107 107 107 107 106 106 106 107 107 107 106 106 106 107 107 106 106 107 106 106 106 106 105
989 105 105 105 105 104 103 103 103 103 103 103 103 103 102 102 102 103 104 104 104 104 103 102 101 100 100 100 100 100 100 99 99 99 99 99 99 99 98 97 97 96 95 96 96 95 96 97 97 97 98 98 98 98 98 98 97 97 97 97 98 97 98 99 99 100 100 100 100 100 100 101
982 101 101 101 101 101 100 99 98 98 98 97 96 95 94 93 92 90 88 87 87 87 88 87 87 86 85 84 84 84 84 85 85 86 87 87 88 89 90 91 92 94 96 97 97 97 96 96 95 95 95 94 94 93 92 92 91 90 90 89 89 90 90 90 90 90 90 90 90 89 88 88
975 88 89 88 88 88 89 89 89 90 89 89 89 88 88 89 89 88 88 89 89 89 89 88 88 87 88 88 87 88 88 88 88 89 89 89 89 88 88 88 87 87 87 87 86 87 87 86 85 86 85 85 86 86 87 88 88 87 87 87 87 87 87 86 86 86 86 86 87 87 87 87 87
967 87 87 87 87 87 87 88 88 89 90 90 90 90 90 90 90 91 91 92 94 95 96 98 100 102 103 106 110 113 116 119 122 126 130 135 140 146 152 158 164 171 178 187 194 200 207 213 219 223 227 231 233 234 234 233 231 228 223 217 211 204 196 187 178 169 161 153 144 137 130 125 121
960 121 117 113 110 107 104 101 100 98 96 94 93 92 92 92 91 91 90 89 88 87 86 86 86 86 86 86 86 85 84 83 84 84 84 83 83 83 84 84 83 84 84 84 82 82 82 83 83 84 83 83 83 83 83 83 83 83 83 83 82 82 82 81 82 82 81 80 80 81 81 81
952 81 81 81 82 82 82 82 82 82 81 81 80 80 80 81 81 81 82 81 81 81 80 79 79 79 78 78 78 77 77 78 78 78 78 78 78 78 78 78 78 78 78 78 78 78 79 80 79 79 79 78 78 78 77 77 76 77 78 79 78 78 78 79 80 80 80 79 79 79 79 79 79
945 79 80 79 79 78 78 78 78 78 78 78 77 77 77 76 76 77 78 79 79 80 79 79 79 80 81 81 81 81 81 81 80 80 80 81 81 81 81 81 81 81 80 80 80 80 80 80 80 79 79 79 79 78 78 78 78 79 79 79 80 80 80 80 79 79 79 79 78 79 79 79 79
937 79 79 79 79 80 79 79 79 80 80 80 81 81 81 81 81 81 81 80 81 82 82 83 83 83 83 84 84 84 84 84 84 84 83 83 83 82 83 83 83 84 84 85 84 84 84 83 83 82 83 84 84 84 83 84 84 84 84 84 84 85 86 86 85 84 84 84 84 84 84 85 85
930 85 84 84 84 84 83 84 84 84 84 84 84 84 84 85 85 86 86 85 84 85 86 87 88 87 87 88 89 90 90 91 90 90 90 90 90 90 90 89 89 88 88 89 90 90 90 90 91 91 91 91 91 91 91 91 91 90 90 89 89 89 91 92 92 93 94 94 95 94 94 94 94
922 94 94 94 95 95 95 95 94 94 95 96 97 96 96 96 96 96 96 96 97 97 97 96 96 96 96 95 95 95 95 96 96 97 97 97 98 98 98 99 100 100 100 100 101 101 101 100 100 100 100 99 99 99 99 100 101 102 103 103 103 102 101 100 100 100 100 100 101 101 101 100 100
915 100 100 101 101 102 103 103 103 103 102 102 102 102 103 103 103 103 103 103 102 101 101 101 101 101 101 101 102 103 104 104 103 103 103 103 102 102 102 102 102 101 101 100 100 100 100 99 99 99 99 99 99 99 98 98 98 97 97 97 97 98 98 99 99 99 99 98 98 98 98 98
907 98 98 98 98 99 99 100 101 102 103 104 103 103 103 103 103 103 104 105 105 106 106 106 106 106 106 106 106 106 106 106 105 106 106 106 106 106 105 105 105 104 104 104 103 103 103 103 103 102 102 102 102 103 103 103 103 103 103 103 103 104 104 105 105 105 106 106 106 106 106 107 106
900 106 106 105 105 105 105 106 106 107 108 108 108 108 108 108 109 110 110 111 111 111 111 111 110 110 109 110 111 111 111 110 110 110 109 109 109 109 108 107 107 107 107 107 107 107 106 106 106 107 107 108 108 108 109 110 111 110 111 111 111 111 112 113 113 112 112 112 113 114 115 115
892 115 115 115 115 116 117 116 115 115 116 117 118 117 116 116 116 117 116 116 116 116 116 116 116 117 116 116 117 117 117 117 118 118 119 120 120 120 120 120 121 121 122 122 122 122 123 123 124 124 125 126 126 126 127 127 128 128 129 129 129 129 129 129 131 131 131 130 130 129 129 128
885 128 128 127 127 127 127 128 127 127 126 126 126 127 127 128 128 128 128 128 127 127 127 128 129 129 129 129 130 130 131 131 132 132 134 135 137 138 139 140 141 142 144 145 147 148 150 152 155 157 159 161 163 166 168 171 173 176 177 179 181 182 185 188 191 193 194 195 196 197 199 202
877 202 204 206 209 212 216 220 224 227 230 234 238 242 246 250 255 259 263 267 271 275 279 283 286 290 294 298 302 305 309 312 315 318 321 324 327 330 331 333 335 335 336 336 335 333 330 327 322 318 313 307 301 294 287 280 274 267 262 257 252 247 242 237 232 227 223 218 214 210 205 201
870 201 197 194 190 186 182 177 174 172 168 165 162 159 155 152 149 146 143 141 140 139 137 135 133 132 130 128 127 125 123 122 120 118 117 117 117 117 117 116 115 112 110 109 108 107 106 105 104 104 103 103 103 102 101 101 100 99 99 99 99 99 98 98 98 97 97 96 96 95 95 95
863 95 95 95 94 94 94 94 94 93 93 92 92 91 91 91 91 92 91 91 91 90 90 90 89 88 87 87 87 88 88 89 88 88 88 88 89 88 87 86 86 86 87 88 88 88 87 87 87 87 87 87 87 86 86 86 85 84 84 85 86 87 87 87 86 86 85 84 83 83 83 83 83
855 83 82 82 82 82 82 82 83 83 82 82 82 82 82 82 81 80 81 81 81 81 81 82 82 81 81 82 82 82 81 81 82 81 81 80 80 81 81 81 82 82 81 81 81 81 80 80 79 79 80 80 81 81 81 81 81 81 80 79 80 80 81 80 80 80 80 80 79 80 81 81 80
848 80 80 80 80 80 79 79 79 79 78 78 78 78 78 79 79 79 79 79 79 79 78 77 78 78 78 78 77 77 77 77 77 77 78 78 78 78 78 78 79 78 78 78 77 77 77 77 77 77 77 78 78 79 79 79 78 78 78 77 77 76 77 77 77 77 77 76 76 77 77 77 76
840 76 77 77 78 77 77 76 76 76 76 76 76 77 77 77 77 76 75 75 75 75 75 76 75 75 75 75 75 75 74 73 73 74 74 74 74 74 74 75 76 76 75 74 74 74 74 74 74 74 74 74 74 73 73 72 72 73 72 72 72 71 72 72 72 72 73 73 73 73 74 74 73
832 73 73 73 72 72 72 72 72 72 72 72 72 71 71 71 71 71 71 72 71 71 71 70 70 70 70 71 71 71 70 70 71 71 72 72 72 71 71 71 70 70 70 70 70 70 70 71 71 71 71 71 71 71 71 72 72 71 71 72 72 72 72 71 71 71 71 71 72 72 72 73 73
825 73 72 72 71 72 72 73 73 73 72 72 72 71 70 70 70 71 71 71 70 70 69 69 69 69 68 69 69 69 69 68 68 67 68 68 67 67 67 68 68 68 69 69 69 69 69 68 68 68 68 68 68 68 68 67 68 68 68 68 69 69 69 69 69 69 69 69 69 69 69 70 70
817 70 70 70 69 69 68 68 68 68 69 69 69 69 69 69 69 70 71 71 70 70 70 70 71 71 70 69 68 67 66 66 66 67 68 67 66 66 66 66 66 67 67 68 68 69 69 68 68 68 68 68 68 67 68 68 68 68 68 68 69 69 69 70 70 71 70 70 69 69 69 69 69
810 69 69 69 69 69 68 68 69 69 69 70 70 71 71 71 71 71 71 71 71 70 70 70 70 69 69 70 70 70 70 70 69 68 68 68 69 68 68 68 67 67 68 69 69 69 70 69 70 71 71 70 70 70 70 69 69 69 70 70 70 70 70 70 70 69 69 67 66 66 66 66 66
802 66 67 68 69 70 70 71 71 71 72 72 72 72 71 70 71 71 71 72 73 72 72 72 71 71 72 72 72 71 71 71 70 71 71 72 72 72 72 71 72 72 72 73 74 74 74 74 74 73 73 72 72 72 72 72 72 72 72 72 71 71 71 71 73 73 73 73 73 73 73 74 74
795 74 74 73 73 73 73 73 73 74 74 74 73 73 73 73 73 73 73 73 73 73 73 73 73 73 72 73 72 71 71 72 73 73 74 74 73 73 73 73 73 72 71 70 70 70 69 70 70 70 70 71 71 70 70 70 69 69 69 70 70 71 71 71 69 69 69 69 69 69 69 69 70
787 70 70 70 70 71 70 70 71 72 71 70 70 69 68 68 68 68 68 68 68 69 68 68 68 68 68 67 67 67 68 68 68 68 68 67 67 66 66 65 66 67 68 67 67 67 67 66 66 66 65 65 65 64 64 64 65 66 65 64 64 63 64 65 66 66 65 64 63 63 63 63 63
780 63 63 63 64 63 63 63 64 64 65 65 65 65 66 66 65 65 65 65 65 65 65 66 66 66 67 67 67 67 67 68 69 69 69 68 68 68 68 68 67 66 66 67 67 67 66 66 66 66 66 67 66 65 65 65 65 66 66 66 66 66 67 66 66 66 66 66 66 66 67 66 66
772 66 66 66 67 67 68 68 68 68 67 67 67 67 67 67 66 66 66 66 67 68 68 68 67 68 68 68 68 68 69 69 69 69 68 68 67 67 67 67 67 67 67 68 67 67 66 66 66 66 66 65 66 66 67 67 67 66 66 66 66 66 66 66 66 67 68 68 68 67 67 67 66
765 66 66 65 65 65 64 64 64 64 64 65 65 65 65 65 65 65 65 65 65 65 65 65 64 65 65 65 65 66 66 65 65 64 64 64 64 64 64 64 64 64 64 64 64 64 64 64 65 65 64 64 63 63 64 64 64 64 64 65 65 65 65 64 64 63 63 63 63 64 64 65 65
757 65 65 65 65 65 65 64 64 64 64 64 63 63 63 63 63 63 63 64 64 64 64 64 64 64 64 65 65 66 65 65 64 64 64 64 65 65 65 64 64 64 63 64 65 65 65 66 65 65 65 66 65 65 64 65 66 66 65 65 65 65 65 65 65 65 65 64 64 64 65 65 66
750 66 66 66 65 65 65 65 65 64 65 65 66 66 66 66 65 65 65 64 63 64 64 64 64 65 65 65 65 65 65 65 65 65 65 65 65 65 66 65 65 65 65 64 64 63 64 65 65 65 65 65 65 65 65 65 65 65 66 65 65 66 65 64 64 63 63 63 63 63 64 65 64
742 64 65 65 65 66 65 65 64 64 63 63 64 64 64 64 64 63 63 63 63 64 64 64 64 64 64 64 64 64 64 64 64 64 64 64 63 63 62 63 63 63 63 62 62 63 63 64 64 64 64 64 64 64 63 64 64 64 64 64 65 65 66 66 66 65 65 64 64 64 64 63 63
735 63 63 63 63 63 63 64 64 64 64 64 64 64 64 64 65 65 65 65 65 65 64 64 64 64 64 63 63 63 64 64 64 64 64 64 64 64 64 64 64 64 64 64 64 64 64 64 64 64 63 63 63 63 62 62 62 62 62 63 63 62 63 63 63 63 63 63 63 63 64 64 63
727 63 64 64 64 64 63 62 62 62 62 63 63 63 63 63 64 65 64 64 64 63 63 64 64 63 62 62 63 63 63 63 63 63 62 62 62 63 63 63 62 62 62 63 63 63 63 62 62 62 63 63 63 62 62 62 62 62 62 62 62 62 62 62 62 62 62 62 62 62 62 62 62
720 62 62 62 63 63 63 63 63 62 62 62 62 62 62 61 61 61 60 60 60 61 61 62 62 63 63 64 64 64 63 63 63 64 64 63 63 63 63 62 62 63 63 62 62 62 62 62 63 63 63 62 61 61 61 61 62 62 62 63 63 62 63 63 63 63 63 63 62 62 62 62 63
712 63 63 63 63 63 63 62 62 63 63 63 62 61 61 61 61 61 61 62 62 62 62 62 63 63 62 62 62 62 62 62 62 62 61 61 61 61 60 60 61 62 62 62 63 63 63 62 61 61 61 61 61 61 61 61 62 61 61 61 61 61 61 61 61 62 62 62 62 62 61 60 61
705 61 61 61 60 60 61 61 61 60 61 61 61 61 61 60 61 61 62 62 62 61 62 62 62 62 61 61 61 61 61 61 60 61 61 61 62 62 62 61 61 62 62 62 63 63 63 62 62 62 60 60 60 60 60 60 60 60 60 60 60 60 61 61 61 61 61 61 61 61 61 61 61
697 61 60 60 61 61 61 61 61 61 60 61 61 61 61 61 60 60 61 61 62 62 63 62 62 62 62 62 62 62 62 62 62 61 61 62 62 62 62 61 61 61 61 61 61 61 61 61 61 61 61 61 61 61 61 61 61 62 62 62 61 61 61 62 62 61 61 60 60 59 60 60 61
690 61 60 60 60 60 60 61 61 61 61 60 60 61 61 62 62 62 62 61 61 61 60 61 61 61 61 61 61 61 62 62 62 62 63 63 62 61 61 61 61 61 61 62 62 61 61 61 62 62 62 62 62 62 62 62 62 62 62 62 62 61 61 62 62 62 61 61 61 60 60 60 61
682 61 61 62 62 61 60 60 60 60 60 60 60 61 61 61 61 61 61 61 60 59 60 60 61 61 61 61 62 62 62 63 63 63 63 62 62 62 61 61 60 59 60 60 60 61 61 61 61 61 60 61 61 60 60 60 60 59 59 59 59 59 60 60 60 61 60 60 59 60 61 61 61
674 61 61 61 61 61 61 61 61 61 60 59 59 58 58 59 59 59 60 60 59 60 61 61 62 62 62 62 62 62 61 61 61 61 62 62 62 62 62 61 61 62 62 62 63 62 61 60 60 60 60 61 61 61 61 61 61 60 60 60 59 59 60 60 60 59 59 59 60 60 60 60 60
667 60 61 61 61 61 61 61 61 61 61 61 61 61 61 61 61 61 61 61 61 61 62 62 62 62 62 62 62 62 62 62 62 61 61 61 61 61 61 62 63 62 61 61 61 61 62 62 62 62 62 61 61 61 61 62 62 63 63 63 62 62 62 62 62 62 62 62 63 63 63 62 62
659 62 62 62 62 62 61 62 62 62 62 62 61 62 62 62 62 61 62 62 62 62 62 62 62 61 61 62 62 62 63 63 62 62 63 62 61 61 61 61 61 60 60 60 60 61 61 60 59 59 60 61 62 62 62 62 61 62 62 62 61 62 62 62 61 61 61 61 62 62 61 61 61
652 61 61 61 62 62 62 61 61 60 60 60 59 59 60 60 61 62 62 62 62 61 61 61 61 61 61 60 61 62 62 62 62 62 61 60 61 61 62 62 62 62 62 63 63 62 62 62 62 62 62 62 62 62 61 61 61 62 62 61 60 59 59 59 60 60 61 61 61 61 60 60 60
644 60 60 60 61 61 62 61 61 61 60 60 59 59 58 59 60 60 60 60 60 60 60 60 60 60 61 61 61 62 61 61 61 61 61 61 60 60 61 61 61 61 61 61 61 62 62 62 61 61 61 61 60 60 60 60 60 61 61 61 62 63 63 63 62 61 62 62 62 62 62 62 61
637 61 61 61 60 61 61 61 62 62 62 61 60 60 59 59 59 60 61 61 61 61 61 61 60 60 60 60 60 61 61 61 62 62 62 62 63 62 62 62 62 62 62 63 62 62 61 62 62 62 63 64 63 63 62 62 62 62 62 62 62 62 62 62 62 63 63 63 63 63 63 63 63
629 63 63 63 62 61 61 62 62 63 62 62 63 63 63 64 64 65 65 65 65 65 64 64 64 65 65 65 65 64 64 64 64 64 64 64 64 64 64 65 64 64 65 66 66 66 66 65 65 65 65 65 65 65 66 66 66 67 68 68 68 68 68 68 68 67 66 66 66 67 68 68 69
622 69 69 70 70 70 70 70 70 71 70 71 72 73 75 76 77 77 77 77 78 78 79 79 80 81 82 83 84 85 85 85 86 88 88 88 89 89 89 91 91 92 93 95 97 98 99 99 99 100 101 101 101 100 99 99 97 96 94 93 91 90 90 90 89 89 88 87 87 87 87 86 87
614 87 87 87 88 88 88 89 89 90 90 91 92 94 95 95 95 96 97 98 100 102 102 103 104 105 105 106 107 108 109 110 111 113 114 117 119 121 124 126 128 129 129 130 131 131 131 130 130 127 123 119 115 109 104 100 95 91 88 86 85 83 83 82 81 80 80 80 80 79 79 79 78
607 78 78 79 79 80 80 80 80 81 81 81 81 82 83 84 84 84 85 85 85 85 85 85 86 86 86 87 87 88 89 91 92 93 95 96 98 99 100 100 100 100 100 99 99 98 96 94 92 90 87 84 81 79 77 75 73 72 72 71 72 72 71 71 70 70 69 69 68 68 69 70 70
599 70 70 69 69 69 68 68 67 66 67 67 66 66 66 66 66 66 66 66 66 66 67 67 67 66 66 65 65 65 65 66 67 67 67 67 66 66 66 66 66 66 66 66 65 65 66 65 65 65 65 65 66 66 67 68 68 68 68 67 67 66 66 67 67 67 67 67 67 67 66 65 65
592 65 65 65 66 66 67 68 68 69 69 68 68 68 69 69 69 69 69 68 69 70 70 69 69 69 69 68 68 69 69 69 69 69 69 69 69 70 69 69 69 68 69 70 70 70 70 70 70 69 69 69 70 70 70 70 71 71 71 71 71 71 71 71 71 71 71 71 71 71 70 70 70
584 70 70 71 72 72 70 70 71 71 71 71 71 71 70 70 71 70 70 70 70 70 70 70 70 69 70 71 70 70 70 70 70 70 70 69 68 68 68 68 68 69 69 69 69 69 69 69 69 69 69 69 69 69 69 69 68 68 68 68 68 67 66 66 66 67 67 67 67 67 67 68 68
577 68 67 67 67 67 67 67 67 66 67 67 67 66 67 67 67 67 67 67 67 67 66 66 66 66 66 65 65 65 65 65 65 65 65 64 65 65 65 65 65 66 66 66 65 64 63 63 64 64 65 65 65 64 64 65 64 63 63 64 64 64 63 63 64 64 64 64 64 64 64 63 63
569 63 63 63 64 64 64 63 63 64 64 65 64 64 64 64 65 65 64 63 64 64 63 63 64 64 64 63 63 63 63 63 64 64 65 64 64 64 65 65 64 63 63 62 62 62 63 63 63 63 63 63 63 63 63 64 64 64 64 63 63 63 62 63 63 63 63 63 63 62 62 62 63
562 63 63 62 62 62 62 61 61 61 61 61 62 62 62 63 63 63 63 63 62 62 61 61 61 62 61 61 61 60 61 61 61 61 61 60 61 61 61 61 61 61 62 61 60 60 60 60 60 60 60 60 60 60 61 61 61 61 61 60 60 61 61 61 61 61 60 60 59 59 59 60 60
554 60 60 61 62 61 61 61 60 60 60 61 60 60 59 59 60 60 60 60 59 60 60 60 59 58 59 59 59 60 59 59 59 59 60 60 60 60 60 59 59 59 59 60 60 60 59 59 59 59 58 59 59 60 60 60 60 60 60 60 60 60 60 60 60 60 60 60 60 60 60 60 60
547 60 59 59 58 58 58 59 59 59 59 59 59 59 59 58 58 59 58 58 59 59 59 59 59 59 60 60 60 60 59 59 59 59 59 59 59 59 59 59 58 58 58 58 58 58 58 58 59 59 60 60 60 60 60 59 58 58 58 58 58 58 58 59 59 59 59 59 58 58 58 58 58
539 58 59 59 59 59 59 58 59 59 59 59 60 60 61 61 60 59 59 59 59 59 59 59 59 59 59 58 58 58 58 58 57 57 57 58 59 59 59 59 59 60 60 59 59 59 59 58 58 58 58 58 59 59 59 59 58 58 58 58 58 58 58 58 59 59 59 59 59 59 59 58 58
532 58 59 60 60 60 61 61 60 59 59 59 59 59 58 58 58 59 59 59 58 59 59 59 58 58 58 58 58 58 58 58 58 57 57 56 57 57 57 56 57 57 57 58 59 59 58 58 58 58 58 57 58 58 59 59 59 59 58 59 59 59 59 59 59 60 60 60 60 59 58 58 58
524 58 58 57 57 57 57 58 58 58 59 59 59 59 59 59 59 59 59 59 58 58 58 58 59 59 58 58 57 57 57 57 58 57 57 57 57 57 58 58 58 58 58 58 59 58 58 57 57 58 58 58 58 59 59 59 58 58 58 57 57 57 58 58 58 59 59 59 59 59 59 59 60
516 60 60 59 58 59 58 58 58 58 58 57 58 59 59 59 58 58 59 58 58 58 58 58 59 59 59 59 60 60 60 60 59 58 58 57 57 58 58 57 57 57 57 58 58 57 58 58 59 60 59 58 59 59 59 59 59 58 58 57 57 57 58 58 58 58 58 58 58 58 58 59 59
509 59 60 60 60 60 59 59 58 58 58 57 57 58 58 58 58 57 57 56 56 56 57 57 56 56 56 56 57 57 57 57 58 59 59 59 59 59 59 58 58 58 58 57 57 57 58 58 57 57 57 58 58 59 59 59 59 59 58 58 58 57 57 57 57 57 58 58 59 59 59 58 57
501 57 57 57 58 58 58 58 58 58 59 58 58 58 58 58 58 58 58 58 58 58 58 58 58 57 58 58 58 57 58 58 58 58 58 59 59 59 59 59 59 59 58 58 57 56 57 58 59 59 58 58 58 58 58 58 58 59 59 59 59 59 59 58 57 57 57 57 58 58 58 57 57
494 57 56 56 56 56 56 56 56 56 56 55 55 55 55 56 56 56 56 57 57 57 57 57 57 57 56 56 56 55 55 56 57 57 57 57 57 57 57 57 57 57 58 58 58 57 57 57 57 58 59 59 59 58 58 58 58 57 57 57 58 58 58 58 57 57 58 58 58 58 58 57 56
486 56 56 57 57 57 57 58 57 57 58 58 58 58 57 57 57 57 57 57 57 57 57 57 57 57 57 57 57 57 58 58 58 57 57 57 56 57 57 57 57 57 58 58 57 56 56 56 56 57 56 56 56 56 56 56 56 55 55 56 56 56 56 56 56 57 57 57 57 57 58 58 58
479 58 57 57 57 57 58 58 58 58 58 57 57 56 55 56 57 57 57 58 59 58 59 59 59 58 57 56 56 57 57 57 58 58 58 58 57 57 56 56 57 57 57 57 57 57 57 56 56 56 56 56 56 56 57 57 57 56 56 56 56 55 55 56 57 58 58 58 57 57 57 57 57
471 57 56 56 57 57 57 57 57 57 56 55 55 55 56 56 56 55 56 56 56 56 56 57 57 57 57 57 56 56 57 58 58 57 57 56 56 56 57 57 57 57 58 58 57 57 57 57 57 57 58 57 57 56 55 55 55 56 56 56 56 56 56 56 56 56 56 56 56 55 55 55 55
464 55 56 56 56 56 56 57 57 56 56 57 58 57 57 57 57 57 57 57 57 57 56 57 57 57 57 57 57 57 57 57 57 57 57 57 57 57 56 56 56 57 57 57 56 56 57 57 57 57 57 57 57 57 57 57 57 57 56 56 56 56 56 56 56 56 57 56 56 56 56 56 57
456 57 57 57 57 56 55 55 55 56 55 55 55 55 55 55 55 55 55 54 55 55 56 56 55 55 55 55 55 55 55 56 56 56 56 56 57 57 57 57 57 57 56 56 55 55 55 55 56 56 56 56 56 56 56 56 56 55 56 56 57 57 58 58 58 57 57 56 56 55 55 56 57
449 57 57 57 57 57 57 57 57 57 57 57 56 56 56 56 56 56 56 56 57 57 56 56 56 56 55 56 56 56 56 57 57 57 58 57 56 56 57 56 56 55 55 55 55 55 56 55 55 55 56 56 56 56 56 56 56 56 56 56 55 55 55 56 55 55 56 56 56 56 56 56 55
441 55 55 55 55 55 56 56 56 56 56 56 56 55 55 55 55 56 56 55 55 55 56 56 57 56 56 56 56 56 56 56 56 56 55 55 55 55 55 55 56 56 56 56 56 56 57 57 57 57 58 59 59 59 58 58 58 57 57 57 56 57 56 56 56 56 57 57 57 57 56 56 55
434 55 55 55 55 56 55 55 55 56 56 55 55 55 56 56 56 56 56 57 57 57 56 56 56 56 56 56 56 56 56 56 56 55 55 55 55 55 54 55 55 55 55 56 56 57 56 56 57 57 57 57 57 58 58 57 56 56 56 56 55 55 55 55 55 55 55 55 56 56 56 57 57
426 57 57 56 55 55 55 55 56 56 56 56 55 55 56 57 57 56 56 56 56 56 57 57 57 57 57 57 57 57 57 57 57 57 56 56 56 56 56 56 55 55 54 54 54 55 56 57 57 57 57 56 55 55 55 56 56 57 57 56 56 56 56 56 56 56 56 56 57 57 57 56 55
419 55 55 55 56 56 55 55 55 55 55 55 55 55 54 55 55 55 55 55 56 56 56 56 56 56 56 56 56 56 55 55 55 55 55 55 56 56 55 56 57 57 58 58 57 57 57 56 56 56 56 56 56 55 55 55 56 57 57 56 55 55 56 55 55 55 55 55 56 56 56 55 55
411 55 55 55 56 56 56 56 56 55 55 55 55 55 55 55 55 55 55 55 55 55 55 55 55 55 55 55 55 56 56 56 56 55 55 55 56 55 55 55 55 55 55 55 56 57 57 56 56 56 55 55 55 55 56 56 56 57 57 57 57 56 56 55 55 54 55 56 56 56 56 55 55
404 55 55 55 55 55 55 55 55 55 55 54 55 56 56 56 56 56 57 56 56 56 56 56 56 56 56 56 56 56 56 56 56 56 55 55 55 54 54 54 54 55 55 56 56 57 56 57 57 57 56 56 56 56 56 55 55 55 55 55 56 56 56 56 55 55 55 55 55 55 55 56 56
396 56 56 56 56 55 56 57 57 56 56 56 56 56 56 56 56 56 56 56 56 56 55 55 55 55 56 55 55 55 55 55 55 54 55 55 55 55 55 55 55 55 55 55 55 56 56 56 56 56 56 56 56 56 56 56 56 56 56 55 55 55 55 55 56 56 55 54 55 55 55 54 54
389 54 55 55 54 53 53 54 54 54 54 54 54 54 54 54 55 55 54 54 54 54 55 55 56 56 56 56 56 55 55 55 55 55 54 54 54 55 55 55 55 55 55 55 55 54 54 54 53 54 54 54 54 54 54 54 54 54 54 54 54 54 54 55 55 55 56 56 56 56 55 55 55
381 55 55 54 55 55 55 55 55 54 54 54 55 55 55 55 56 55 55 55 56 56 55 55 55 55 55 55 55 55 55 55 56 56 56 55 55 55 55 55 55 56 56 56 56 57 57 57 57 58 59 58 57 56 56 56 56 55 56 56 56 55 55 55 55 54 55 55 55 55 56 57 56
374 56 56 56 55 56 56 56 57 56 56 56 56 57 57 57 57 57 56 56 56 55 55 55 55 54 54 54 54 54 55 55 55 55 55 54 54 54 54 54 54 55 55 55 55 55 54 53 54 54 54 55 55 55 55 55 56 56 56 56 57 56 56 56 55 54 54 54 55 56 56 56 56
366 56 56 56 55 55 55 54 54 55 56 56 56 56 56 56 56 55 55 55 55 55 56 56 55 55 54 54 54 54 54 55 55 55 55 55 56 55 55 54 54 53 54 54 55 55 55 55 55 56 56 57 56 56 56 56 56 57 57 57 56 56 56 55 55 55 55 55 55 55 55 55 54
358 54 54 55 55 55 55 55 55 55 55 55 55 55 55 55 55 55 56 55 55 55 56 56 56 56 56 55 55 55 54 54 54 54 54 54 54 54 54 55 55 54 54 54 55 55 55 55 54 54 53 53 54 54 55 54 54 54 55 55 55 54 54 55 55 55 55 55 55 55 55 56 56
351 56 56 57 57 57 57 56 55 56 56 56 55 55 55 55 55 55 56 56 56 56 56 56 56 55 55 55 56 56 56 55 55 55 55 55 55 56 56 57 57 57 56 55 55 55 55 56 56 56 55 55 55 55 56 56 56 55 55 55 55 54 54 54 54 54 54 54 54 54 55 55 55
343 55 55 55 54 55 55 55 56 56 56 55 55 55 55 55 55 55 55 56 56 56 56 56 55 55 55 55 55 54 55 56 55 55 55 55 54 54 55 55 55 55 55 55 55 55 55 55 55 54 54 54 54 54 54 55 55 55 55 55 55 55 55 54 54 54 54 54 55 55 56 55 55
336 55 55 54 54 54 54 54 55 56 56 56 56 57 57 57 56 56 56 55 54 53 54 55 55 56 55 55 55 56 56 56 55 54 54 54 55 56 56 56 56 55 55 55 55 55 55 55 55 54 55 56 55 55 54 54 55 54 54 53 53 54 54 54 55 55 55 55 55 55 55 55 55
328 55 55 55 55 54 54 54 54 54 54 54 54 53 53 53 53 54 55 56 56 56 56 56 56 55 54 54 54 54 54 54 55 54 54 54 54 54 53 53 53 54 55 55 55 55 54 54 55 55 56 56 55 55 55 56 57 56 56 56 55 55 55 55 55 55 54 54 54 54 53 53 54
321 54 54 54 54 55 55 56 55 54 54 53 53 53 53 53 53 53 53 53 53 54 54 54 54 54 53 54 54 55 55 55 54 54 54 54 54 54 55 55 54 54 54 54 55 56 56 56 56 56 55 54 53 53 53 53 54 54 54 55 54 54 53 54 54 54 54 55 55 55 55 55 55
313 55 55 55 54 54 54 54 55 55 55 54 53 54 54 54 54 54 54 54 54 54 54 55 55 55 54 55 55 55 55 55 55 55 55 55 54 53 54 54 55 55 55 54 54 54 55 55 55 55 55 55 54 54 54 54 54 54 55 55 55 55 55 55 55 55 55 55 55 55 55 55 55
306 55 55 54 54 55 55 55 55 55 55 54 54 54 54 55 56 57 57 56 56 55 55 54 54 54 55 55 56 55 55 55 55 55 54 54 53 53 53 54 54 54 54 53 52 52 53 54 54 54 54 54 55 55 54 54 54 54 54 53 53 53 54 54 54 55 55 54 54 54 54 55 55
298 55 55 55 55 55 55 55 55 55 54 54 54 54 54 54 55 55 55 55 55 55 56 56 56 55 55 55 54 53 52 52 52 53 54 54 54 53 54 54 55 54 54 54 54 54 54 54 54 55 55 56 56 56 56 55 55 55 55 55 55 55 55 55 55 55 55 55 54 55 55 55 55
291 55 54 54 54 55 55 55 55 54 54 54 54 54 54 53 54 54 54 54 54 53 54 53 52 52 52 53 53 54 54 54 55 55 54 54 55 55 55 55 54 54 54 55 55 55 55 56 55 55 55 54 54 55 56 55 55 54 54 55 55 55 56 56 56 55 55 55 54 54 54 54 54
283 54 55 55 55 55 54 54 54 54 54 54 54 54 54 54 54 55 56 55 55 55 55 55 55 55 55 55 55 55 55 55 54 54 55 55 55 56 56 56 56 54 54 54 54 54 54 55 55 55 54 53 53 53 54 54 55 55 55 55 55 55 55 54 54 54 54 54 54 54 54 54 54
276 54 55 54 54 55 55 54 54 54 54 55 54 54 54 54 54 53 54 54 54 54 54 54 54 54 55 55 54 54 54 53 53 53 53 54 54 54 54 53 52 52 53 53 53 53 54 54 54 54 54 54 54 54 54 54 54 54 54 54 55 54 54 54 54 54 54 54 53 53 53 53 54
268 54 55 55 55 55 55 54 54 54 53 54 55 55 55 54 54 54 53 53 53 53 54 54 54 54 54 54 53 53 55 56 57 57 57 56 55 55 54 53 53 53 53 53 53 53 53 53 54 54 54 54 54 54 54 54 54 54 54 54 53 53 53 53 53 53 53 53 53 53 53 53 53
261 53 53 53 53 54 55 55 55 55 55 55 54 54 54 54 55 54 54 53 54 55 55 55 55 55 55 54 54 55 55 54 53 53 53 54 53 53 53 54 54 54 54 55 55 55 55 55 55 55 55 54 54 54 54 53 53 53 53 53 52 52 52 52 53 53 53 53 53 53 53 53 54
253 54 54 54 55 55 54 53 53 53 54 54 53 53 53 53 53 53 53 53 54 54 54 54 55 55 55 55 55 54 55 55 55 55 55 55 55 56 55 54 53 54 54 55 55 54 54 54 54 55 55 56 55 54 54 54 54 54 55 55 55 55 56 56 55 54 54 53 53 53 53 53 53
246 53 54 54 54 54 54 54 54 55 55 54 53 54 54 54 54 54 54 55 55 55 55 54 53 53 53 53 53 53 53 53 53 53 53 54 54 54 54 54 54 53 53 53 53 53 53 53 53 53 53 53 53 53 53 53 53 54 54 54 54 54 54 54 54 53 53 53 53 55 55 54 54
238 54 54 54 54 54 54 54 54 53 53 53 53 54 54 54 54 54 54 55 55 54 54 53 53 53 52 52 52 52 52 52 53 54 54 54 53 52 52 52 53 54 55 55 56 55 54 54 53 53 53 53 53 54 54 53 52 52 53 54 54 53 53 53 53 53 54 54 54 54 54 53 53
231 53 53 53 53 54 54 55 55 54 53 53 54 54 53 53 53 53 53 53 53 53 52 52 53 53 53 53 53 54 54 54 55 54 54 54 54 54 54 54 53 53 53 52 52 52 52 53 53 53 54 54 54 54 54 54 54 53 53 53 52 52 52 52 52 53 53 53 54 53 53 54 54
223 54 54 54 54 54 54 54 53 53 53 53 54 54 53 53 53 52 53 54 54 54 54 53 53 52 52 53 53 53 53 53 53 53 54 54 55 54 54 54 54 54 55 55 55 56 56 56 55 55 56 55 55 55 55 54 54 55 55 55 55 55 54 54 53 54 54 54 54 54 54 55 55
216 55 54 54 54 54 54 54 54 54 53 53 53 52 52 53 53 53 54 54 54 54 54 54 55 55 54 54 53 53 53 54 54 54 53 53 54 54 54 55 56 56 55 54 53 52 52 52 52 53 53 52 53 53 53 53 52 52 53 53 54 55 54 54 54 53 53 54 54 53 54 54 53
208 53 53 52 52 53 54 54 54 54 55 55 55 55 55 55 55 55 54 54 54 54 55 55 55 55 54 54 55 55 55 55 55 54 54 53 53 53 53 53 52 52 52 52 52 52 52 53 54 55 55 54 54 53 53 53 53 53 53 53 53 53 53 53 53 53 53 53 54 54 54 54 54
200 54 54 54 53 52 52 52 53 53 53 54 54 54 54 54 53 53 53 53 53 52 52 52 52 53 53 53 54 54 54 54 54 55 54 54 53 53 53 53 53 53 53 54 53 53 53 52 52 53 53 53 53 53 53 53 53 53 53 53 52 53 53 53 53 53 54 54 54 53 53 53 53
193 53 53 53 53 53 53 53 53 53 53 53 53 53 53 52 52 52 52 53 53 53 53 53 53 52 53 54 54 53 52 52 52 53 54 54 54 54 54 55 55 54 54 54 54 54 54 54 53 53 53 52 53 53 52 51 51 52 53 54 54 53 53 53 53 53 53 52 52 52 52 53 53
185 53 53 52 52 52 53 53 54 54 54 54 53 52 52 52 53 53 53 53 53 53 53 53 53 53 53 52 52 52 52 53 52 53 54 55 55 55 55 55 53 54 54 53 53 53 53 53 53 53 53 54 54 54 53 53 52 51 51 51 51 51 51 51 51 52 52 53 53 53 53 53 53
178 53 53 53 53 54 54 54 53 53 53 53 53 53 52 53 53 53 53 53 52 52 53 53 53 53 53 53 53 53 53 53 54 54 54 54 54 54 54 54 55 55 55 54 54 53 52 53 53 53 53 53 53 54 54 54 54 55 55 55 54 54 54 54 54 55 55 54 53 53 53 53 53
170 53 53 54 54 54 53 53 53 53 53 53 53 53 52 52 52 52 52 53 52 52 52 52 52 51 52 52 52 52 52 52 53 53 53 53 54 54 54 53 52 53 54 55 55 55 55 54 53 53 53 53 53 53 52 53 53 53 53 54 54 54 54 54 54 55 54 53 53 53 53 53 54
163 54 54 53 52 52 52 52 52 52 52 53 52 52 53 53 53 53 52 53 53 53 53 52 52 52 52 52 52 52 52 51 51 51 52 52 52 53 53 53 53 53 54 54 54 53 52 52 52 52 52 52 52 52 52 52 53 53 53 52 53 54 55 54 54 54 54 53 53 52 52 53 52
155 52 52 53 53 52 52 52 53 53 53 52 53 53 54 55 55 54 53 53 53 54 55 55 54 53 53 53 53 53 53 53 53 53 53 53 53 53 53 53 52 52 52 52 53 53 53 52 52 52 52 52 53 53 52 52 52 52 51 51 51 52 52 52 52 53 53 54 54 55 55 55 54
148 54 53 53 54 54 54 54 53 53 53 53 53 53 53 53 53 53 53 53 53 52 52 53 52 52 53 54 54 54 54 54 54 53 53 54 54 54 54 53 53 53 53 53 53 53 53 53 53 52 52 52 52 52 52 52 52 52 51 51 51 51 51 51 51 52 53 53 53 54 54 54 54
140 54 54 54 54 53 53 53 53 53 53 54 54 54 54 54 54 54 55 55 55 55 55 55 54 54 54 54 54 54 54 54 54 54 53 53 53 52 52 52 53 53 53 52 52 51 51 51 52 52 52 52 52 52 52 52 52 52 52 52 52 52 53 53 52 52 52 53 53 53 53 52 52
133 52 52 52 52 52 52 51 52 52 53 53 53 53 53 53 53 53 54 53 53 53 53 53 53 53 53 54 54 53 53 53 53 53 53 53 53 53 54 54 55 54 53 53 53 53 53 52 52 52 52 53 53 53 53 53 53 53 53 53 53 53 53 54 54 54 54 54 54 54 54 54 54
125 54 54 54 54 53 53 53 53 53 53 54 54 52 52 52 52 53 53 54 54 54 54 54 54 54 54 54 54 54 54 54 53 53 53 53 52 52 53 53 53 54 53 53 52 52 52 53 53 54 54 53 52 53 53 53 53 53 53 53 54 53 53 53 53 53 53 53 53 52 52 52 53
118 53 53 53 53 52 52 52 52 52 52 52 52 52 52 52 51 51 51 51 51 51 52 52 53 54 54 53 53 53 53 53 53 54 54 54 54 54 54 54 54 54 53 52 52 52 53 52 52 52 52 52 52 52 53 54 53 52 53 53 53 53 54 54 54 54 54 54 54 54 54 54 54
110 54 53 53 54 54 54 53 53 53 53 53 53 53 53 54 54 54 53 53 54 54 54 55 54 54 54 54 53 53 52 51 51 51 51 51 51 52 52 52 53 53 53 54 53 53 52 52 52 52 53 53 53 54 54 54 54 54 54 53 54 54 53 53 52 52 52 52 53 53 53 52 52
103 52 52 51 52 53 53 54 55 54 54 53 53 53 53 52 52 53 53 53 54 54 53 52 52 53 53 55 55 54 54 53 53 53 54 53 53 53 52 52 52 51 51 51 51 51 51 52 52 52 52 52 51 51 51 51 52 52 52 53 53 53 53 54 54 54 53 53 52 53 53 53 54
95 54 54 54 54 53 53 53 53 53 53 54 53 53 52 54 54 54 54 54 55 55 54 54 53 53 53 53 52 52 53 54 54 54 53 53 52 52 52 52 53 53 53 53 53 52 51 51 52 53 53 52 52 52 52 52 51 52 53 53 54 54 54 53 53 53 53 54 54 53 53 53 53 52
88 52 52 52 52 52 53 53 53 53 53 53 53 53 53 53 52 52 52 53 53 53 53 52 53 53 53 53 53 53 53 53 52 52 53 52 51 51 51 52 52 51 51 52 52 52 52 52 52 52 52 52 52 52 52 53 53 52 52 53 53 53 53 52 52 52 52 53 53 53 53 52 52 51
80 51 52 52 52 52 52 52 51 51 51 51 52 52 52 53 53 52 52 52 52 52 52 51 52 52 52 52 51 51 51 51 51 51 51 51 51 51 51 51 51 52 51 52 52 52 52 51 52 52 52 52 52 52 52 52 52 52 52 52 52 52 52 51 52 53 53 53 54 54 53 52 52 52
72 52 51 51 51 52 52 51 52 53 53 53 54 53 53 53 53 53 52 52 52 52 51 50 50 50 51 52 51 51 51 52 52 53 53 54 54 54 53 52 52 52 52 52 52 51 50 51 51 52 52 53 53 53 52 51 51 51 52 52 52 52 53 53 53 53 53 52 52 51 52 52 52 52
65 52 52 52 52 52 52 52 52 52 52 52 52 52 52 51 51 50 51 52 52 53 52 52 52 51 51 51 52 52 52 53 53 52 52 52 52 52 53 53 53 53 53 53 52 52 52 53 52 52 52 53 53 53 53 54 54 55 55 54 54 54 54 53 53 53 54 54 54 54 54 53 54 54
57 54 54 54 54 53 52 51 53 54 54 54 54 53 55 56 55 54 54 53 53 53 53 53 53 53 53 54 54 54 54 54 55 54 54 53 53 53 53 53 54 53 53 53 53 53 53 54 54 54 55 55 55 56 55 55 55 54 55 56 56 56 56 57 57 57 57 57 58 57 58 58 57 57
49 57 56 57 58 59 59 60 60 61 61 62 61 62 63 64 65 66 67 67 68 69 70 72 74 75 77 81 85 88 92 96 99 103 106 110 115 121 128 134 141 148 156 164 170 174 176 177 178 179 179 179 178 173 167 157 145 132 119 108 99 90 83 78 74 71 69 66 65
42 65 63 63 62 62 61 60 59 60 60 61 61 61 60 60 60 60 60 61 60 59 59 58 58 57 57 56 56 55 54 54 54 53 53 54 54 54 54 54 54 53 53 53 53 53 53 53 53 53 53 53 53 53 53 53 53 53 52 52 52 52 53 53 53 53 53 53 53 53 53 54 54 54
35 54 53 53 53 53 54 54 53 53 53 53 53 53 52 52 52 52 52 53 53 53 52 51 51 52 53 53 52 52 52 52 52 52 52 52 52 52 53 52 52 52 51 51 51 51 52 52 52 52 53 52 52 52 52 52 53 53 53 53 53 52 52 52 52 52 53 53 53 53 53 53 53 53
27 53 53 53 53 52 52 52 52 52 53 53 53 54 54 54 54 54 54 53 53 53 53 53 53 54 54 53 52 52 51 51 52 52 52 52 52 52 52 52 52 52 52 53 53 53 54 53 53 53 52 52 53 53 53 53 53 52 52 52 51 52 52 52 53 53 53 53 54 54 53 52 52 52
19 52 52 52 52 52 52 53 53 53 53 54 54 54 53 53 52 52 52 52 52 51 51 51 52 52 52 52 52 52 52 52 52 52 52 52 52 51 51 51 51 51 51 51 52 52 53 53 53 53 52 51 51 52 53 53 53 53 52 52 52 53 53 52 52 52 51 50 50 49 50 51 52 52
12 52 51 50 51 52 52 53 53 53 53 54 54 54 53 52 52 52 52 53 53 52 52 52 52 51 51 51 51 51 52 51 51 51 50 51 51 52 52 52 52 52 52 51 51 52 52 52 53 52 51 51 52 53 54 53 52 53 53 53 53 53 53 53 53 53 53 53 53 53 53 53 53 53
4 53 53 52 52 53 53 53 53 53 53 52 52 52 53 52 52 52 52 53 53 52 52 52 51 51 52 52 53 52 52 52 52 52 53 53 53 52 52 52 52 53 54 54 53 52 51 51 51 52 52 52 51 51 51 51 51 52 52 52 53 53 53 52 52 51 51 51 51 51 51 51 51 51 51
-4 51 51 52 52 52 52 53 53 53 52 52 52 52 52 52 52 51 51 51 51 51 51 52 52 52 52 52 51 51 51 50 49 49 50 50 51 51 51 51 52 52 52 51 51 51 52 51 50 50 50 50 51 51 52 52 52 52 52 51 51 50 51 52 52 51 51 51 51 51 52 52 53 52
-11 52 52 52 52 52 52 52 52 52 52 51 51 52 53 53 52 52 52 52 51 52 52 52 53 53 52 52 52 52 52 51 52 52 53 53 53 53 53 53 53 53 53 53 53 54 53 53 53 52 53 53 53 53 53 53 53 52 52 53 52 52 52 51 52 53 53 53 53 53 52 52 51
-19 51 51 51 50 50 50 50 51 51 51 51 52 52 52 52 51 52 52 52 52 52 52 52 53 53 52 52 52 52 52 51 52 52 52 51 51 51 51 51 51 51 52 53 53 53 53 52 53 53 54 54 54 54 54 53 53 52 52 52 52 52 53 53 53 53 52 51 51 52 53 52 52
-26 52 52 51 51 51 51 51 51 51 51 51 51 51 51 51 51 51 51 51 51 51 51 51 51 51 51 51 50 51 51 51 52 52 51 51 51 51 51 51 51 51 51 51 51 51 52 52 52 51 51 51 51 51 51 51 51 52 52 52 52 52 51 51 51 50 50 50 51 51 51 51 51
-34 51 50 50 51 50 50 50 50 51 51 52 52 53 53 53 53 53 54 54 54 54 54 55 54 54 53 52 52 51 52 52 52 52 52 52 51 52 52 51 51 51 51 51 51 51 52 52 52 52 52 52 51 52 53 54 53 52 52 52 52 52 52 52 51 51 51 52 52 53 52 52 52
-41 52 52 52 52 51 52 52 52 52 51 51 51 52 52 52 51 51 51 51 51 52 52 52 52 52 51 52 52 51 51 51 52 52 52 52 51 51 51 52 52 52 52 51 51 51 50 50 50 50 51 51 51 51 51 52 52 52 51 51 51 51 52 52 52 52 53 52 52 52 52 52 52
-49 52 52 52 52 53 53 52 52 52 52 52 52 52 51 51 50 51 52 53 53 52 52 52 53 52 51 51 51 51 51 52 51 51 52 53 52 52 51 51 51 51 51 51 52 52 53 52 52 52 52 52 52 52 52 52 52 52 52 52 51 51 51 51 51 51 51 51 51 51 51 50 50
-56 50 51 52 52 52 52 52 52 52 52 52 52 52 52 52 52 52 52 53 52 52 52 52 52 52 51 51 51 51 50 50 51 50 50 50 51 50 50 51 50 50 50 50 50 50 50 50 50 50 50 50 50 51 51 51 52 52 51 51 51 51 51 51 50 50 50 50 50 51 51 52 52
-64 52 52 53 53 53 53 52 52 52 52 53 53 52 52 51 51 51 51 51 51 51 51 50 50 50 51 51 51 51 51 51 51 51 51 50 50 50 50 51 51 51 50 51 51 51 50 51 51 51 51 50 50 51 51 51 51 51 51 51 52 52 53 52 52 52 51 52 52 52 52 52 52
-71 52 51 51 51 50 50 50 50 50 50 50 50 51 52 52 52 52 51 51 52 52 52 52 51 51 51 50 50 51 51 51 51 51 51 51 52 52 52 52 52 52 52 52 52 52 52 52 52 52 52 52 52 52 51 51 51 51 51 51 51 51 51 51 51 51 52 52 52 51 51 50 50
-79 50 50 51 51 51 51 51 51 50 50 50 51 51 51 50 50 50 51 51 51 51 51 51 51 52 51 51 50 50 51 51 50 50 50 51 51 51 52 52 52 52 52 52 52 52 51 52 52 52 51 51 51 51 51 50 50 50 51 51 51 51 52 52 52 52 52 51 51 51 51 51 51
-86 51 52 52 52 52 53 53 53 53 52 52 52 52 52 52 52 51 51 51 51 50 50 50 50 50 50 50 51 51 51 52 52 52 52 51 51 51 51 51 51 51 51 51 51 51 50 50 50 50 50 50 50 50 50 50 51 51 50 51 51 51 51 50 50 50 51 50 50 50 51 51 52
-94 52 52 52 52 52 51 51 51 51 52 52 51 50 50 50 51 50 50 50 50 50 50 49 49 50 50 50 50 51 50 50 50 51 50 50 50 50 51 51 50 50 51 51 50 51 51 51 51 51 52 52 51 51 50 49 50 51 51 51 51 52 52 51 50 50 51 51 51 51 50 51 51
-102 51 51 51 52 52 51 50 50 50 51 51 50 49 48 48 48 48 49 49 49 49 50 50 50 50 50 50 50 50 50 50 51 51 51 51 51 51 51 51 52 51 51 50 51 51 51 51 51 51 50 50 50 50 51 51 50 50 51 51 51 51 51 52 52 52 52 53 52 52 51 51
-109 51 51 51 52 52 52 52 52 53 52 52 52 53 52 52 51 51 51 51 52 51 50 51 51 52 52 52 51 50 50 51 51 51 50 50 50 50 50 50 50 49 49 50 50 50 50 50 50 50 50 49 50 50 51 51 51 52 52 52 52 52 52 51 51 51 51 51 51 51 51 51
-116 51 52 52 52 52 51 50 50 50 51 51 51 51 51 51 51 51 52 51 51 52 52 52 52 52 52 51 51 51 50 49 50 50 50 50 50 50 50 51 51 51 51 52 52 51 51 51 51 52 52 51 51 51 51 51 51 50 50 51 51 50 51 52 52 52 52 52 52 51 51 51
-124 51 51 51 50 49 49 49 49 49 49 49 50 50 51 51 50 50 50 51 51 51 51 51 51 51 51 51 51 51 51 51 51 51 51 51 52 52 52 51 51 51 51 51 51 50 50 50 50 50 50 50 50 50 50 49 50 50 50 51 51 51 51 50 50 50 50 50 50 51 50 50
-131 50 50 49 50 50 50 50 50 50 50 51 51 52 52 52 51 50 50 51 51 51 52 52 52 51 51 51 52 52 51 51 51 51 51 51 52 52 51 51 51 51 52 52 51 50 51 51 51 51 51 51 51 51 51 50 50 50 51 52 53 52 52 51 51 51 51 51 51 51 51 51
-139 51 50 50 49 50 51 51 52 52 52 52 51 51 51 51 50 50 50 49 50 50 50 51 50 50 50 50 50 51 51 50 51 52 51 51 52 52 52 52 51 50 50 50 50 50 50 51 50 49 50 50 51 52 52 52 51 51 51 51 51 51 51 51 51 51 51 50 50 50 50 50
-146 50 49 49 50 51 52 52 52 52 52 52 52 52 51 51 52 52 53 53 53 53 53 52 52 51 51 52 52 51 51 50 49 49 49 50 51 51 51 51 51 52 51 51 50 50 50 50 50 50 50 50 51 50 50 49 49 49 50 51 51 52 51 50 50 50 50 50 50 50 50 49
-153 49 50 50 50 50 50 49 50 50 50 50 50 50 49 49 49 50 49 50 51 51 51 50 50 50 50 50 50 50 51 51 51 51 51 51 51 51 51 51 52 52 52 51 51 51 51 51 51 51 51 51 51 50 50 50 50 50 50 50 51 51 52 52 51 51 51 51 51 51 51 52
-161 52 51 51 51 51 51 51 51 51 51 50 49 49 49 49 49 50 50 51 52 52 52 52 52 52 52 51 51 51 51 51 51 51 51 50 50 50 50 51 51 51 52 51 51 51 51 50 50 51 51 51 51 51 51 50 50 50 49 49 50 50 49 49 50 51 51 50 50 49 49 49
-168 49 49 49 49 50 50 50 49 49 49 49 49 50 50 50 50 50 49 49 49 49 49 50 50 50 50 49 50 50 50 50 50 50 49 49 49 50 50 49 50 50 50 50 49 50 50 51 50 50 51 50 50 50 50 50 50 50 51 51 51 50 49 49 49 49 49 49 50 51 51 51
-176 51 51 51 50 50 50 51 50 50 50 49 50 50 50 50 51 51 51 51 50 50 49 49 49 49 49 50 50 50 50 50 50 50 50 51 52 52 52 51 51 51 50 51 51 51 51 51 51 51 52 52 51 51 50 50 49 50 51 51 50 51 51 51 51 51 51 50 51 51 51 51
-183 51 51 51 50 50 50 49 49 49 50 51 50 50 51 51 51 51 51 50 49 49 49 49 50 50 50 50 50 51 50 50 50 50 49 49 49 50 50 50 50 50 50 50 49 49 49 50 50 50 50 50 50 49 50 50 50 50 50 50 50 50 50 50 51 51 51 51 50 50 49 49
-191 49 49 49 49 49 49 49 49 49 49 49 49 49 50 50 50 51 51 51 50 49 49 50 50 49 49 49 49 50 49 49 49 49 49 49 49 50 49 49 50 50 50 51 50 50 50 49 50 49 49 50 50 50 50 50 50 50 50 51 51 51 50 50 50 50 50 50 49 49 49 49
-198 49 49 49 49 50 50 49 49 50 51 51 50 49 49 48 49 50 51 51 52 52 52 51 50 50 50 50 50 50 49 49 50 51 52 51 51 51 51 50 49 49 49 49 49 49 49 50 50 50 50 50 50 51 51 50 50 49 50 51 50 50 50 50 50 50 50 50 51 50 50 50
-205 50 51 50 50 50 51 51 51 51 51 50 50 51 51 50 50 50 50 50 50 50 50 50 49 50 50 50 50 50 50 49 49 49 50 51 51 50 50 50 50 49 50 50 51 51 51 50 49 49 49 49 50 50 49 49 49 50 50 51 51 52 52 51 51 51 50 50 50 50 50 50
-213 50 49 50 50 49 49 49 50 50 50 50 51 51 51 52 52 52 52 52 52 52 51 51 51 51 51 51 51 51 50 50 50 50 51 51 50 50 50 49 49 49 49 49 49 49 49 49 49 49 49 49 50 50 50 50 50 50 49 48 48 48 49 50 50 50 51 51 51 52 51 51
-220 51 50 50 50 50 50 50 50 50 50 50 50 50 50 51 51 51 50 50 50 50 51 52 52 51 50 51 50 50 50 50 49 49 49 49 50 50 51 51 51 51 51 51 51 51 51 51 50 51 51 50 50 50 50 50 50 50 51 51 51 51 51 50 50 50 50 51 51 51 52 51
-228 51 51 50 50 50 50 50 50 50 50 50 49 49 49 49 50 50 51 51 52 53 53 52 52 51 50 50 49 49 49 49 49 49 49 49 50 50 51 52 52 51 50 50 50 50 49 49 49 49 50 50 49 49 49 50 50 50 51 51 51 50 50 50 50 49 49 50 51 51 51 51
-235 51 51 51 50 50 50 51 50 50 49 49 50 50 50 49 49 48 49 49 50 50 50 49 49 48 48 48 48 48 49 49 49 50 51 51 51 51 51 51 51 51 51 51 50 50 50 50 50 50 50 50 51 51 51 51 51 51 51 50 50 50 50 50 50 50 49 48 49 49 49 50
-242 50 50 50 50 50 49 49 49 49 49 49 50 50 50 50 49 50 50 49 49 49 49 50 50 50 51 51 51 50 50 50 50 50 51 51 50 50 50 51 51 50 50 50 50 50 50 50 50 50 50 50 50 51 51 50 50 49 49 49 50 50 49 49 49 49 49 49 49 50 50 50
-250 50 50 50 51 51 51 50 50 49 49 49 50 50 50 49 49 50 51 51 51 51 50 50 51 51 50 50 50 50 50 50 51 51 52 51 51 50 50 50 50 50 50 50 50 50 50 51 51 51 51 50 50 50 50 50 50 50 50 51 51 51 50 50 49 49 49 49 49 49 49 49
-257 49 49 49 49 48 49 49 50 50 50 50 50 50 50 49 49 49 49 50 50 50 50 51 51 52 52 51 50 50 50 50 50 51 50 50 51 51 51 50 50 51 51 50 51 51 50 50 50 50 51 51 51 51 51 51 52 52 51 50 49 49 49 49 50 50 50 50 50 51 50 50
-265 50 50 49 49 49 49 49 50 50 50 50 50 50 50 51 51 51 51 51 50 50 49 49 50 50 50 50 50 50 50 50 51 50 50 50 49 49 49 49 50 50 49 49 49 48 49 49 50 50 50 49 49 50 50 50 51 51 51 51 51 51 50 50 50 50 50 50 50 49 49 49
-272 49 49 49 49 48 48 48 49 50 51 50 49 49 49 50 50 50 50 50 50 49 49 48 48 47 48 49 49 49 49 49 49 49 50 50 50 50 50 50 50 50 50 50 50 51 51 51 51 51 51 51 50 50 50 51 51 51 50 49 49 49 49 49 48 47 47 48 49 49 49 49
-280 49 49 50 50 50 50 50 50 51 51 50 50 50 50 50 50 50 50 50 50 50 50 50 50 50 50 50 50 50 50 49 49 49 50 50 50 49 49 50 49 48 49 49 49 48 48 49 49 49 49 49 50 50 49 49 49 48 48 47 48 48 48 48 47 47 47 48 48 48 48 47
-287 47 47 48 49 50 50 49 49 49 49 49 49 49 49 49 49 49 50 50 50 50 50 49 49 48 48 47 48 49 49 49 49 49 49 50 50 49 49 49 49 50 50 50 51 50 50 49 49 49 50 49 49 49 49 49 50 49 49 49 49 49 50 50 50 50 50 50 50 50 50 50
-294 50 50 49 49 49 50 50 49 49 49 49 49 49 49 49 49 49 49 50 49 49 49 49 50 50 50 50 51 51 50 49 49 49 49 50 51 50 49 49 50 50 50 50 49 49 50 50 50 49 49 50 50 50 50 49 49 49 49 50 49 48 48 48 48 48 48 48 49 49 48 48
-302 48 48 48 49 49 50 50 50 49 49 49 49 50 50 50 49 49 49 50 50 50 51 51 51 51 51 51 50 49 49 48 47 48 48 49 49 50 50 51 51 50 50 50 50 49 48 48 48 49 49 49 48 48 47 47 47 47 48 48 49 50 50 50 50 50 50 50 49 49 49 49
-309 49 49 49 49 49 49 50 49 48 48 49 50 49 49 49 49 48 48 49 49 49 49 49 49 49 49 49 50 49 49 49 50 51 50 50 50 50 50 50 50 49 49 49 50 50 49 49 49 49 49 50 50 50 50 50 50 50 49 49 49 49 49 49 49 50 50 49 49 49 50 50
-317 50 50 50 51 50 49 49 49 49 49 49 49 49 49 49 49 49 49 49 49 50 49 49 50 50 50 50 50 49 49 49 49 49 49 49 49 48 49 49 49 50 50 50 49 49 48 48 48 49 49 49 49 49 49 49 49 50 50 50 50 49 48 48 48 48 49 49 49 49 50 50
-324 50 50 50 50 50 50 50 50 49 49 49 49 49 50 49 49 48 49 49 49 49 49 48 49 49 49 49 49 49 49 50 50 49 49 50 49 49 49 49 49 50 50 50 50 50 50 49 49 49 49 48 48 48 49 49 49 49 48 48 48 48 48 48 47 47 48 49 49 49 48 48
-331 48 48 48 48 49 49 48 49 49 49 48 48 49 49 49 48 48 48 48 48 48 49 49 49 49 49 49 49 49 50 51 51 50 49 48 48 49 49 50 51 51 50 50 49 49 48 48 48 49 48 48 48 49 49 50 50 49 49 49 49 49 49 49 49 49 49 49 49 49 49 49
-339 49 49 49 49 49 49 49 50 50 50 50 49 49 49 49 49 50 50 50 50 50 49 49 49 49 49 49 50 50 50 50 50 50 49 49 48 49 49 49 48 48 49 49 50 50 50 50 50 50 50 50 49 49 48 48 48 48 49 49 48 48 48 48 48 48 48 49 49 49 49 48
-346 48 48 48 48 48 48 48 49 49 50 50 51 51 51 51 50 49 49 50 50 50 50 49 49 49 49 48 48 48 49 49 49 49 49 50 50 49 49 49 49 49 48 48 47 47 48 48 49 49 49 50 49 49 49 49 49 49 48 48 48 48 49 49 48 49 49 49 49 49 48 48
-354 48 48 49 49 49 49 50 51 50 50 49 50 50 50 49 49 49 49 49 49 49 49 49 49 49 49 49 49 49 48 48 48 48 48 49 50 50 50 50 49 49 49 49 49 49 49 49 49 49 49 49 49 49 49 50 49 49 48 49 49 49 48 48 49 49 49 49 50 49 49 49
-361 49 49 49 48 48 49 50 50 50 49 49 50 50 50 49 49 48 48 49 49 49 49 49 49 49 48 48 48 48 48 47 48 48 48 49 49 49 49 48 48 49 50 50 49 49 48 48 48 48 49 49 50 49 49 50 50 50 50 50 50 50 50 49 49 49 48 48 48 48 48 47
-369 47 47 47 48 48 49 49 49 49 49 48 48 48 48 48 49 49 49 49 49 50 50 50 49 49 49 49 48 48 48 47 47 47 47 47 48 48 48 48 48 48 49 49 49 50 49 49 49 49 50 51 50 50 49 49 48 48 48 48 49 49 50 49 48 48 48 47 47 48 48 48
-376 48 48 48 49 49 49 48 49 49 49 48 48 48 49 50 49 49 50 50 50 50 49 49 49 50 49 49 49 48 49 49 50 51 51 51 50 49 49 50 50 51 51 50 50 50 49 49 49 48 48 48 48 48 49 49 49 49 48 48 48 48 48 48 48 48 49 49 48 49 49 48
-383 48 48 48 47 47 48 48 48 48 49 50 49 49 49 48 48 48 48 48 48 47 48 48 49 50 49 50 49 49 49 49 48 48 48 48 48 49 50 49 49 49 49 49 49 49 49 48 48 48 48 49 49 49 49 50 50 49 49 50 50 50 50 49 49 49 49 49 49 50 50 49
-391 49 49 49 49 49 48 48 49 49 49 49 49 49 49 49 48 48 48 49 49 49 49 49 49 49 49 49 48 48 48 48 48 49 50 49 48 49 49 49 49 49 48 47 46 47 48 49 49 48 48 48 48 47 48 48 49 49 49 49 49 49 49 50 49 49 49 49 49 50 50 50
-398 50 50 49 48 48 48 47 47 47 47 48 48 48 49 49 49 50 50 49 49 48 48 48 49 49 49 49 49 50 49 48 48 47 48 48 48 49 49 50 50 49 49 49 49 49 49 49 49 49 49 48 48 48 48 48 48 48 48 49 49 49 49 49 50 50 51 51 50 49 48 48
-406 48 48 48 48 49 49 49 49 48 48 48 48 48 48 48 49 49 50 50 51 51 51 50 51 51 50 50 49 49 49 48 48 49 49 49 49 49 50 50 49 48 49 50 50 49 49 49 49 49 49 49 49 49 49 49 48 49 50 50 49 49 48 48 48 48 48 49 49 48 48 48
-413 48 48 47 47 48 48 49 49 49 49 48 49 49 49 49 49 48 48 47 48 49 49 49 49 48 48 48 48 48 48 47 48 48 48 47 48 48 48 48 48 48 48 48 48 48 49 49 49 49 48 48 48 47 48 48 48 49 48 48 48 48 48 48 48 47 48 48 48 48 48 48
-420 48 48 47 48 48 48 49 49 49 49 49 49 49 50 50 50 49 48 48 48 48 48 48 48 48 48 48 48 48 48 48 48 48 48 48 47 47 47 47 47 48 48 48 48 47 47 48 48 48 48 47 48 48 48 48 48 48 48 49 48 48 48 48 48 48 48 48 49 50 49 48
-428 48 48 47 47 47 48 48 49 49 49 49 49 50 50 50 50 50 50 50 49 48 47 47 47 47 47 47 47 47 46 46 46 46 46 47 47 48 48 49 49 49 48 48 48 48 49 49 50 50 50 50 50 50 50 49 48 48 49 49 49 49 49 49 49 49 49 49 49 49 48 48
-435 48 48 48 49 48 48 47 48 48 49 49 49 48 49 49 49 49 49 49 49 49 49 49 48 48 48 47 47 47 47 47 47 48 47 47 47 48 48 48 48 48 49 48 48 48 48 47 47 47 48 48 48 48 49 49 49 49 49 49 49 49 49 48 48 48 48 48 48 48 49 49
-443 49 48 48 48 48 49 49 49 50 49 49 49 48 48 48 48 48 48 48 48 48 48 48 48 49 48 48 47 47 46 46 46 47 47 48 47 47 47 47 47 47 48 49 49 49 49 49 49 49 49 49 49 49 49 49 49 49 49 49 49 49 48 48 48 47 47 47 47 47 47 48
-450 48 48 48 47 47 47 48 48 49 49 49 49 49 49 49 49 48 47 47 47 48 48 49 48 47 47 48 49 48 48 49 49 49 49 48 48 47 46 46 47 47 48 49 48 48 48 48 48 47 48 48 48 48 48 48 49 49 49 48 47 47 47 48 48 47 47 47 47 47 47 48
-458 48 47 48 49 49 48 47 47 48 48 48 48 48 48 48 48 49 49 49 49 49 49 49 49 48 48 47 47 48 48 48 49 49 49 49 50 51 51 50 50 49 49 48 48 48 48 49 49 49 49 49 49 48 48 48 48 48 48 48 48 47 48 48 48 48 48 47 46 46 47 47
-465 47 47 47 47 47 47 47 47 47 47 47 47 47 48 48 48 48 47 48 48 48 48 47 46 46 46 46 46 46 47 47 47 46 46 46 47 47 48 48 47 48 48 47 47 48 48 49 50 49 48 48 48 48 48 48 49 49 49 48 48 47 47 47 47 47 47 47 47 47 47 48
-472 48 47 47 47 47 47 47 47 47 47 47 48 48 48 48 48 48 48 48 47 47 48 49 49 48 48 48 48 48 48 47 48 48 48 48 48 48 48 48 48 48 48 48 48 48 48 48 47 47 47 47 48 48 48 48 48 48 48 48 48 48 48 47 48 48 48 47 47 48 48 48
-480 48 48 48 47 47 48 48 48 48 49 49 48 48 48 48 49 49 50 50 50 49 48 48 48 48 49 49 49 49 48 48 49 49 49 48 47 46 46 47 48 48 47 47 47 46 46 46 47 47 47 48 48 48 48 48 48 48 48 48 48 48 48 48 48 49 49 50 49 48 48 48
-487 48 48 49 49 49 49 49 49 49 49 49 49 49 49 49 48 48 49 49 50 50 49 49 49 49 48 48 48 48 47 48 49 49 48 48 48 47 47 46 47 47 47 48 48 48 48 48 49 49 49 48 48 48 48 48 48 47 47 47 48 48 48 48 48 48 48 49 49 49 49 48
-495 48 48 48 48 48 49 49 49 49 48 48 48 48 48 48 47 46 46 47 47 47 48 48 48 49 49 50 49 49 48 48 48 48 49 49 49 49 48 48 48 47 47 47 47 47 47 47 47 47 47 47 47 48 48 48 48 48 48 49 48 47 47 46 46 47 47 46 46 47 48 48
-502 48 48 48 48 48 47 47 47 47 47 47 48 48 48 48 48 48 48 48 48 48 48 49 49 49 49 48 48 48 48 48 48 48 48 48 49 49 48 48 48 48 48 48 48 48 48 48 48 47 47 48 48 48 47 47 46 46 47 47 47 48 47 47 48 48 48 48 48 48 48 48
-509 48 48 47 47 47 47 47 46 47 47 47 48 48 47 47 47 47 47 46 46 46 47 46 46 47 47 47 47 48 49 49 49 48 48 47 48 48 46 46 46 46 46 46 46 46 46 47 47 47 46 46 46 46 46 47 48 48 48 48 48 47 47 47 47 47 47 47 47 47 48 49
-517 49 49 49 48 47 47 47 47 47 48 48 48 48 48 47 47 47 47 47 47 48 48 48 48 48 48 48 47 48 48 48 48 47 47 47 47 48 47 47 47 47 47 47 47 47 47 46 47 48 48 47 47 47 47 46 47 47 47 47 47 47 47 46 47 47 47 47 47 47 47 47
-524 47 48 48 48 48 49 48 48 48 48 48 48 49 49 50 49 48 48 48 48 48 48 48 48 49 48 48 48 48 48 48 49 49 49 48 48 48 49 49 49 49 49 49 47 47 47 47 47 47 46 46 46 46 46 45 45 46 47 47 47 47 47 47 47 47 47 47 48 47 47 48
-532 48 48 49 48 48 48 48 48 48 47 47 47 47 48 48 48 48 48 48 48 48 48 48 48 48 48 48 48 48 48 47 47 47 47 47 48 48 48 48 47 48 48 48 48 49 48 47 47 48 48 49 49 48 47 47 47 47 47 46 47 48 48 48 48 48 47 47 47 47 46 46
-539 46 46 47 47 47 47 48 48 48 48 48 48 48 48 47 47 47 47 47 47 47 48 48 49 48 48 48 49 49 48 47 46 47 47 47 48 48 48 48 48 47 47 47 48 49 49 49 49 48 48 48 49 49 49 48 48 48 48 48 48 47 48 48 49 49 49 48 47 47 47 47
-547 47 47 47 47 48 48 48 48 49 49 48 48 47 46 46 46 46 46 46 46 47 47 48 47 47 48 48 49 48 48 48 48 48 48 48 48 48 48 47 47 47 47 46 46 47 47 47 46 47 47 47 47 47 47 47 47 47 48 49 49 49 49 48 48 48 48 49 48 48 48 48
-554 48 48 47 47 47 47 48 47 47 47 47 47 47 48 48 48 48 48 47 47 47 47 47 47 47 47 47 47 48 49 48 48 48 48 47 47 47 47 47 47 47 47 47 47 48 49 49 48 48 47 47 47 47 47 47 48 47 47 48 48 48 48 48 48 48 48 47 47 47 46 46
-561 46 46 47 47 47 47 47 46 46 46 46 46 47 47 46 47 47 47 47 47 47 46 46 46 46 46 47 47 48 47 47 47 47 47 47 47 47 48 48 48 47 47 47 47 47 47 47 47 47 47 48 48 48 48 48 48 48 48 48 48 48 49 48 48 48 48 48 48 48 48 48
-569 48 48 48 48 47 47 47 47 47 47 47 47 47 47 47 47 47 47 47 47 48 49 49 48 47 47 47 48 48 47 47 47 48 48 48 47 47 46 46 46 47 47 48 48 47 48 49 49 48 48 48 48 48 49 49 49 49 48 48 48 48 47 47 47 47 47 47 47 47 47 47
-576 47 47 47 47 47 47 47 47 47 47 48 48 48 47 47 46 47 47 48 47 46 46 47 47 48 47 47 47 47 47 47 47 47 47 47 47 47 47 46 46 46 46 47 47 47 47 47 46 46 46 45 46 46 46 46 46 46 47 48 47 47 47 47 47 48 47 47 48 48 49 49
-584 49 49 49 48 49 49 48 48 48 48 47 47 47 47 48 48 48 48 48 48 48 48 48 48 47 47 47 47 47 46 46 46 47 47 47 46 47 47 48 48 49 49 49 49 49 49 49 48 48 48 47 47 47 46 46 47 47 47 47 48 49 48 48 48 47 47 47 48 49 48 48
-591 48 48 48 47 47 47 47 47 47 47 47 47 48 48 48 48 48 48 47 46 45 44 45 46 47 48 48 47 47 47 47 47 46 46 47 47 48 47 47 47 48 48 47 47 47 47 47 48 48 48 47 47 47 47 47 47 47 48 48 47 47 47 47 48 48 48 48 48 48 48 48
-598 48 48 48 49 49 49 48 47 47 46 46 46 46 46 46 46 46 46 46 47 48 48 48 48 48 48 49 50 50 50 50 49 48 47 47 48 48 48 47 48 48 48 48 48 48 48 48 48 48 48 48 47 47 47 47 47 47 47 47 47 47 48 48 48 47 48 48 48 48 48 48
-606 48 48 48 48 48 48 47 47 47 47 47 46 46 46 47 47 48 47 47 47 47 47 47 46 45 45 46 47 47 47 47 47 46 45 45 45 46 46 47 47 47 47 47 48 48 47 46 46 46 46 47 48 49 48 48 48 48 48 48 48 47 47 47 47 47 47 48 47 46 47 47
-613 47 47 46 46 45 46 45 45 45 45 45 46 47 48 48 48 47 47 47 47 47 47 47 47 47 47 47 47 47 47 47 46 46 46 46 46 46 47 47 47 47 47 47 47 47 47 47 47 47 47 47 46 46 46 47 46 46 46 46 46 46 46 46 46 46 46 45 45 45 46 46
-621 46 46 46 47 47 47 47 46 46 46 46 46 46 46 46 46 46 46 47 47 47 47 48 48 48 48 47 47 47 47 47 48 48 48 47 47 46 46 47 48 48 48 48 48 48 48 48 48 47 47 47 47 47 47 47 47 46 46 47 48 48 48 48 48 48 48 47 47 46 46 46
-628 46 47 47 47 47 47 46 47 47 47 47 48 47 47 47 48 48 48 47 47 47 47 48 47 47 47 46 47 48 48 48 47 46 45 45 46 46 46 46 46 45 46 46 46 46 46 46 46 46 47 46 47 48 48 48 47 46 46 46 47 47 47 47 47 47 47 47 47 47 47 46
-636 46 46 46 47 48 48 47 47 47 47 47 46 46 46 45 45 45 45 45 46 46 46 47 47 48 47 46 46 45 45 44 44 45 46 47 48 47 46 47 47 47 47 47 47 47 47 47 46 46 46 47 47 48 47 47 47 47 47 47 47 47 46 46 46 45 45 45 46 46 46 46
-643 46 46 46 46 46 46 46 47 46 46 47 48 48 47 47 47 47 47 47 47 47 47 47 46 46 46 45 46 47 47 47 47 47 48 48 47 47 47 48 48 48 47 47 46 47 47 47 47 47 47 46 46 45 45 46 47 47 48 48 48 48 47 47 47 47 47 47 47 46 45 45
-650 45 45 45 45 46 47 48 48 48 47 48 48 47 47 47 47 47 47 47 48 48 48 48 48 49 49 49 49 48 48 48 48 47 47 47 47 47 47 47 46 46 46 47 47 47 47 47 47 47 48 47 47 48 47 47 46 46 46 46 45 46 46 46 46 46 47 48 48 48 48 48
-658 48 49 49 49 48 48 47 47 47 47 46 46 46 46 46 46 46 47 47 47 47 47 47 46 45 46 46 47 47 47 47 47 48 47 47 46 45 46 47 47 47 47 47 47 46 46 46 46 46 46 46 46 47 47 48 48 48 47 47 47 46 46 46 46 45 46 46 46 47 47 48
-665 48 48 48 48 48 47 48 48 48 47 47 47 46 46 47 47 47 47 47 47 48 48 48 48 48 47 47 46 46 46 46 46 45 45 46 46 46 46 46 47 47 46 46 46 46 46 47 46 46 45 45 46 47 47 47 47 47 47 46 46 46 46 46 46 46 46 46 47 47 47 47
-673 47 46 46 46 46 46 46 46 47 47 47 48 48 47 47 47 47 47 47 47 47 47 47 47 47 48 48 48 48 48 48 48 48 47 48 47 47 47 48 49 49 48 48 48 48 47 47 48 48 47 46 47 47 47 47 46 46 46 47 47 46 46 47 47 47 47 46 46 47 47 46
-680 46 46 46 46 46 46 46 47 47 48 48 48 47 46 46 46 46 46 47 48 48 47 47 47 47 47 47 48 49 49 48 48 48 48 47 46 46 46 47 47 48 48 48 48 47 47 47 46 47 48 48 48 48 47 47 47 46 47 47 47 46 46 46 46 46 45 45 46 46 47 47
-687 47 47 46 46 47 47 47 47 47 47 47 47 47 46 46 46 46 46 46 46 46 46 47 47 48 47 47 47 47 46 46 46 46 47 47 46 46 46 47 47 47 47 48 49 48 48 48 48 48 48 47 47 47 48 48 47 47 47 48 48 48 47 47 47 47 46 46 47 48 48 49
-695 49 48 47 47 47 47 47 47 47 47 46 46 47 48 48 48 47 46 46 46 46 46 46 46 46 46 45 45 45 46 46 47 47 48 47 47 47 46 46 46 47 46 46 46 46 47 47 47 47 47 47 47 46 46 46 46 46 47 48 47 47 48 48 48 48 47 47 46 46 46 46
-702 46 48 48 47 46 46 45 45 45 45 45 45 45 45 45 45 45 45 45 45 44 45 45 45 45 46 46 46 46 46 46 47 47 48 48 48 47 46 46 46 46 45 45 45 45 45 45 45 45 45 45 46 46 46 46 47 47 46 46 46 46 46 46 47 47 47 47 46 46 46 45
-710 45 45 46 46 46 46 47 47 48 48 48 48 48 47 47 47 47 48 48 47 47 46 47 47 48 48 49 48 48 48 48 48 48 47 47 46 45 45 45 46 46 47 46 46 47 47 47 47 47 47 46 46 46 46 46 46 46 46 46 47 47 47 48 48 47 47 47 47 46 46 46
-717 46 46 47 46 46 47 47 47 46 46 47 47 47 47 47 47 46 46 47 47 47 46 46 46 46 46 46 47 47 47 47 46 46 46 47 47 48 47 46 46 46 46 46 47 48 47 46 46 45 45 45 46 46 47 47 46 46 46 46 46 46 46 46 46 46 46 46 46 46 45 45
-725 45 45 45 45 45 45 46 46 46 46 45 46 46 46 46 47 48 48 48 47 47 47 46 45 45 45 46 46 46 46 46 46 46 46 47 46 46 46 45 45 45 44 44 45 46 47 47 47 48 47 47 47 46 46 46 45 45 45 45 45 46 46 46 47 46 46 45 45 45 45 45
-732 45 45 45 45 45 45 45 45 46 45 45 45 45 46 46 46 47 47 48 48 48 48 47 48 48 48 48 48 48 48 48 48 48 47 47 47 47 47 47 47 47 47 47 46 47 47 47 46 45 46 46 46 46 47 47 47 46 46 46 46 46 46 46 46 45 45 45 45 45 45 45
-739 45 45 46 46 46 46 46 46 46 46 47 47 47 46 46 46 46 47 47 47 46 46 46 46 46 46 45 46 46 46 47 47 47 47 47 47 47 47 48 47 47 47 47 47 47 46 45 45 46 46 46 47 47 47 47 47 46 46 46 45 45 45 46 48 48 48 48 48 47 47 47
-747 47 47 47 47 47 47 48 47 47 47 46 46 46 46 46 46 46 46 46 45 44 44 45 46 47 48 47 46 46 46 46 46 47 47 47 47 47 47 47 47 47 47 48 47 47 47 47 47 47 47 47 47 47 47 47 47 46 47 47 47 46 46 46 47 47 47 47 47 46 46 46
-754 46 46 45 45 45 45 46 46 45 46 46 46 46 46 46 46 46 47 47 46 46 47 47 47 47 47 48 48 48 48 48 48 48 48 48 47 47 47 47 47 47 47 46 46 46 45 46 47 47 47 46 46 45 45 45 45 45 45 45 45 46 46 46 46 46 46 46 46 46 45 45
-762 45 45 46 46 46 46 46 45 45 46 46 46 46 46 47 46 46 46 46 46 46 46 46 46 46 47 47 46 46 46 46 46 46 46 46 46 46 46 46 47 47 46 47 47 47 47 48 47 46 46 46 46 47 47 47 47 46 46 47 47 47 47 47 47 47 48 48 48 47 47 47
-769 47 47 47 46 45 45 45 45 45 46 46 46 46 46 46 46 45 45 45 46 46 46 45 45 46 46 47 46 46 46 46 46 47 47 47 47 47 46 46 46 45 45 44 45 45 45 45 46 46 47 47 47 46 46 46 45 44 44 45 46 47 48 47 47 47 46 46 45 45 45 46
-776 46 46 45 45 46 47 46 46 46 46 46 46 46 46 46 46 46 46 46 46 46 46 46 46 46 46 46 46 46 45 45 45 45 46 46 45 45 45 45 45 45 45 44 45 45 45 45 46 46 47 47 47 47 47 46 45 45 46 46 46 46 46 46 47 46 46 46 46 45 44 43
-784 43 44 44 44 44 45 46 46 46 46 46 47 47 47 46 47 47 47 46 46 46 46 46 46 46 46 46 46 46 46 46 45 45 44 45 45 45 45 45 45 46 46 46 46 46 45 44 45 45 46 47 47 45 45 46 46 46 47 47 47 47 47 47 46 45 45 44 44 44 44 45
-791 45 46 46 46 46 46 46 46 46 46 46 46 46 46 46 46 46 46 46 46 46 46 45 45 45 46 46 45 46 46 46 45 45 44 43 44 44 44 45 45 45 45 44 45 45 46 47 46 46 46 45 44 45 46 46 46 46 46 45 45 45 46 46 46 47 47 46 46 47 47 47
-799 47 47 47 47 46 46 45 45 46 46 46 46 46 46 45 45 45 46 46 47 47 46 46 46 45 46 46 45 45 46 46 46 46 46 46 46 46 46 46 46 46 46 45 45 45 45 45 46 46 46 46 47 47 47 46 45 45 45 45 45 45 45 45 45 44 45 45 46 47 47 46
-806 46 46 46 46 46 46 46 46 46 46 46 46 46 46 46 46 46 46 46 46 46 46 47 47 47 46 46 46 46 45 45 45 46 46 46 46 46 47 47 47 47 47 47 47 47 46 47 47 46 45 45 45 45 45 45 44 45 45 45 45 45 46 46 46 45 45 45 45 45 45 45
-814 45 45 46 46 46 46 46 46 47 47 47 48 47 47 46 46 46 46 46 46 46 46 46 46 46 46 46 47 47 48 48 47 46 46 46 47 47 47 46 46 45 45 45 45 45 45 45 45 45 45 45 45 44 45 45 46 46 46 47 47 47 47 47 46 45 45 44 44 45 44 44
-821 44 45 45 45 45 44 44 44 44 44 45 45 45 45 45 45 45 45 45 45 45 45 46 46 47 46 46 46 46 46 46 46 47 47 46 47 47 47 47 47 47 47 46 46 45 45 46 46 45 45 46 46 46 46 46 46 46 45 44 44 44 43 44 44 44 45 45 44 44 44 45
-828 45 45 46 46 46 47 47 46 45 45 45 44 45 45 46 46 46 46 46 47 46 46 46 45 45 45 45 45 45 46 46 46 46 46 46 46 46 46 46 46 46 46 46 46 46 46 46 45 45 46 46 46 45 46 46 46 46 46 46 47 47 47 46 46 46 45 45 45 45 45 45
-836 45 44 44 45 45 44 43 43 44 45 45 46 46 45 44 43 43 43 44 45 46 46 46 45 46 46 46 46 46 46 45 45 45 45 44 44 44 44 45 45 45 45 46 46 46 46 46 46 45 45 45 45 45 45 45 45 45 45 45 45 44 43 43 44 44 45 44 44 45 45 45
-843 45 45 45 45 46 46 46 46 46 46 46 46 45 45 45 45 45 46 45 45 46 46 46 45 45 46 46 45 44 44 44 44 45 45 45 45 45 45 45 44 44 44 45 45 45 44 44 44 44 45 45 45 46 46 46 46 46 46 46 47 47 47 46 47 47 47 46 44 44 44 45
-851 45 44 44 44 44 44 45 45 45 45 45 45 45 46 46 46 46 46 46 46 46 46 46 45 45 45 45 45 44 44 44 44 44 44 44 44 45 45 46 46 46 46 46 45 45 45 45 45 45 45 46 47 47 46 45 45 45 45 44 45 45 45 45 45 44 44 44 45 45 45 44
-858 44 44 44 43 43 43 44 44 43 43 43 43 44 44 44 44 44 45 46 46 46 45 45 45 45 45 45 45 46 46 47 47 46 45 45 45 45 45 45 45 45 46 46 47 46 46 47 47 46 45 45 46 46 47 47 46 46 46 46 45 45 45 44 45 45 46 47 46 46 46 46
-866 46 45 45 45 45 44 44 45 45 45 45 46 46 46 47 48 48 47 47 47 47 47 46 47 46 46 46 46 46 46 46 46 46 46 46 46 46 46 46 45 45 45 45 44 44 44 44 44 44 44 43 43 44 45 45 44 44 44 44 43 43 43 44 44 43 43 43 44 44 44 45
-873 45 45 46 46 47 47 46 46 45 45 46 46 46 46 46 46 46 46 46 46 46 46 45 44 44 44 44 44 44 45 45 45 45 44 45 45 46 46 46 45 45 46 46 46 46 46 46 46 46 45 45 45 45 45 44 44 45 45 45 45 45 45 45 45 45 45 45 45 45 45 45
-880 45 46 46 45 45 45 44 44 44 44 44 44 44 44 44 43 43 43 43 43 44 45 45 46 46 46 46 45 46 46 46 45 45 45 45 45 45 46 46 45 45 45 45 45 45 45 45 45 44 45 46 46 46 46 46 45 45 46 46 46 46 46 46 46 47 47 47 46 46 46 46
-888 46 46 46 46 46 46 46 46 45 45 44 45 45 45 45 45 46 46 46 46 46 46 46 45 45 45 45 45 45 45 45 46 46 46 46 45 45 45 45 46 46 46 47 47 46 47 46 45 45 45 46 46 45 45 46 46 46 45 45 45 45 45 45 46 47 46 46 46 45 45 45
-895 45 45 45 44 45 45 45 44 45 45 46 45 45 44 44 43 44 44 45 46 47 47 47 46 46 46 46 46 46 45 45 45 45 45 45 45 44 43 44 45 46 46 46 46 46 45 44 44 44 43 43 43 44 44 44 44 44 44 45 45 45 45 45 45 45 45 45 46 46 46 47
-903 47 47 46 46 46 46 46 46 47 47 47 47 46 46 46 46 46 47 46 45 44 44 44 44 44 44 45 45 45 45 46 46 46 46 46 46 45 45 45 44 44 44 44 44 45 45 44 44 44 44 45 46 46 46 45 45 45 46 46 46 45 45 45 45 44 44 44 45 46 45 44
-910 44 44 44 44 45 45 45 45 45 45 45 46 46 46 46 45 46 47 47 46 45 45 44 44 44 45 45 45 44 44 44 45 45 46 46 46 45 45 45 45 46 46 46 46 46 47 48 48 47 46 46 46 45 45 45 46 46 45 45 45 45 45 45 45 45 44 44 44 44 45 44
-917 44 44 44 44 44 44 44 44 44 44 45 45 46 45 45 44 43 42 43 44 45 45 44 44 44 44 45 45 44 44 44 44 43 43 43 43 43 44 44 44 45 45 45 45 45 45 45 45 45 45 45 44 44 44 44 44 44 44 44 44 44 44 44 44 44 44 45 45 45 45 45
-925 45 45 45 45 45 45 46 46 46 45 45 46 47 47 46 46 45 45 45 45 45 45 45 45 45 45 44 44 44 44 45 45 44 44 44 44 44 44 44 45 45 45 45 46 46 46 45 45 45 45 45 45 45 45 45 45 44 44 44 44 44 45 45 45 44 45 46 46 46 46 46
-932 46 46 46 45 45 44 44 44 43 44 44 44 45 45 44 44 44 44 44 44 44 45 45 46 46 46 46 46 46 46 46 47 47 47 46 46 45 45 44 44 43 43 44 45 45 46 46 45 45 45 45 45 45 45 45 46 46 46 46 46 46 46 46 46 45 45 45 45 45 45 45
-940 45 46 46 46 46 46 46 45 44 44 45 45 45 45 45 45 44 44 44 44 44 44 44 46 46 46 46 46 46 46 45 45 46 46 46 46 46 45 45 45 45 45 45 45 45 45 45 45 45 45 44 44 44 45 45 44 44 44 44 45 45 45 45 45 45 45 45 45 45 44 44
-947 44 44 45 45 45 45 45 46 46 46 47 46 46 45 45 45 46 46 45 44 44 45 45 46 46 46 45 45 45 45 45 45 44 44 44 44 44 44 44 44 44 45 46 47 47 47 47 47 47 47 46 46 46 46 46 46 46 45 45 45 45 45 45 45 45 45 46 45 45 45 45
-955 45 45 45 44 44 44 44 44 44 44 44 44 44 44 44 45 45 45 44 44 43 42 43 44 44 44 44 44 44 44 45 45 45 45 45 45 45 46 46 46 45 45 45 45 45 45 45 45 45 45 45 44 44 44 44 45 45 45 45 45 45 45 44 44 44 44 44 44 44 45 45
-962 45 46 46 45 45 44 44 44 44 45 45 45 44 44 45 45 45 44 45 45 45 45 45 44 44 44 44 44 44 44 44 44 43 43 44 44 44 44 45 45 45 45 45 44 44 44 44 45 46 46 46 46 45 45 45 45 45 45 45 45 45 45 46 46 46 46 45 44 43 44 44
-969 44 44 44 44 45 45 46 46 46 45 44 44 44 44 44 43 44 44 44 44 44 45 45 45 45 46 46 46 45 45 45 44 44 44 44 44 44 44 45 45 45 45 45 44 44 44 44 44 44 44 44 44 43 43 43 43 43 44 44 44 45 45 44 44 44 44 44 44 45 45 45
-977 45 45 45 44 44 45 45 45 44 44 43 44 45 45 45 45 45 45 45 45 45 45 44 45 45 45 45 45 44 44 44 45 45 44 44 44 44 44 44 45 45 45 45 45 45 45 45 45 46 46 46 45 45 45 45 45 45 45 45 45 44 44 43 44 44 44 45 46 46 46 46
-984 46 45 45 45 45 45 45 44 43 43 44 45 45 45 45 46 46 46 45 44 44 44 45 45 45 45 45 45 44 44 44 44 44 45 45 45 45 45 45 45 44 44 45 45 45 45 44 44 44 44 44 43 43 44 44 44 43 43 43 44 45 45 45 45 45 45 45 45 44 45 45
-992 45 45 45 44 44 44 44 44 44 44 44 44 44 44 44 44 44 45 45 45 46 46 45 44 43 44 44 45 44 44 44 44 44 44 44 45 45 44 44 45 45 45 45 45 45 45 46 46 46 46 45 45 45 46 45 44 44 44 44 43 43 43 44 44 44 45 45 45 45 45 44
-999 44 44 44 45 46 46 46 45 45 45 44 44 44 44 44 44 44 43 44 44 45 44 44 44 43 43 43 44 44 45 45 45 44 44 43 44 44 45 44 43 43 43 44 44 44 44 44 44 44 44 44 45 44 44 43 44 44 44 44 44 44 44 43 43 43 43 44 44 44 45 45
-1006 45 45 45 45 45 45 45 45 45 45 45 45 45 45 44 44 44 44 44 44 44 44 44 44 45 46 46 46 45 45 45 45 45 46 45 45 45 46 46 46 45 45 45 45 45 45 45 46 45 44 44 44 43 43 44 45 45 46 46 45 44 44 45 44 44 44 44 45 44 44
-1014 44 44 44 44 44 44 44 45 45 45 45 44 44 44 45 45 45 45 45 46 46 46 46 46 45 45 45 45 45 45 45 45 45 45 45 44 45 45 45 46 46 46 45 45 45 45 45 45 44 44 44 44 45 46 46 45 45 46 46 45 44 44 44 43 42 42 42 43 43 44
-1021 44 44 44 44 45 46 45 45 45 44 44 44 44 44 44 44 44 44 44 45 45 46 46 46 46 46 45 45 46 45 45 45 44 44 45 45 46 45 45 45 45 45 45 45 45 45 44 44 45 44 44 43 43 43 43 43 43 44 44 44 44 44 44 43 43 43 43 43 43 44
-1028 44 44 44 44 44 43 44 45 45 44 44 44 45 45 45 44 43 43 43 43 43 43 43 43 43 44 43 43 43 44 44 45 45 45 44 43 43 42 42 42 42 42 43 43 43 43 44 43 43 43 43 44 43 43 43 43 43 43 44 43 43 43 44 44 44 44 45 45 45 45
-1036 45 44 43 43 44 44 44 43 43 43 43 43 43 43 43 43 43 43 44 44 45 44 44 44 44 44 44 44 44 45 45 45 45 45 44 44 44 44 44 45 44 43 43 43 44 44 44 44 44 44 44 44 43 44 44 44 44 44 45 44 44 43 44 44 44 44 44 44 44 43
-1043 43 43 44 44 44 44 44 44 44 44 43 43 42 43 44 44 44 44 44 44 45 45 45 45 45 45 44 44 44 44 44 45 44 44 45 45 45 45 45 45 45 44 44 44 45 45 45 44 44 43 44 44 43 43 43 44 43 42 42 43 43 44 44 45 44 44 44 43 43 43
-1050 43 44 44 43 43 42 43 43 44 44 44 43 44 44 43 43 42 43 43 43 43 44 44 44 44 44 44 44 44 45 45 45 45 45 44 45 45 46 46 46 45 45 46 46 46 46 45 44 44 43 44 44 43 43 43 44 44 44 44 44 44 45 45 45 45 45 44 44 44 43
-1058 43 44 45 46 46 46 45 45 45 44 45 45 45 44 44 43 43 43 43 43 43 44 44 44 44 43 43 43 43 43 43 44 44 44 44 44 45 45 46 45 45 45 45 45 44 44 45 46 46 46 45 44 44 44 44 45 45 46 46 46 45 45 45 45 45 45 45 46 46 46
-1065 46 46 46 45 44 43 43 43 43 43 43 44 44 44 44 45 45 45 45 45 44 44 44 43 43 43 44 44 44 43 43 44 44 44 45 44 44 43 43 43 43 43 43 43 43 43 43 43 43 43 43 43 43 44 44 44 44 45 45 45 45 45 44 44 44 43 43 43 43 43
-1072 43 43 44 44 44 44 44 45 45 45 44 44 43 44 44 44 44 45 46 46 46 45 45 46 46 45 44 44 44 44 44 44 45 45 44 44 44 44 44 43 43 43 43 43 43 44 44 44 44 44 45 46 46 45 44 44 44 44 43 43 43 43 43 43 42 42 43 44 44 43
-1080 43 43 43 44 44 43 43 43 43 43 43 43 43 43 43 43 42 43 44 44 43 43 43 44 43 43 43 44 44 44 44 43 44 44 45 45 45 44 44 44 44 44 44 44 43 43 43 43 43 43 43 43 42 42 42 43 44 44 45 45 45 45 44 44 44 44 44 44 44 44
-1087 44 44 44 44 43 43 44 44 43 43 43 43 43 43 43 43 44 44 44 44 44 43 43 43 43 43 44 44 44 44 44 43 43 44 44 43 43 42 43 44 45 45 45 45 45 45 44 43 42 43 43 43 43 43 43 43 43 43 43 43 43 43 43 43 43 43 43 43 44 45
-1094 45 44 44 44 43 43 42 42 43 43 43 44 44 44 45 45 44 43 43 44 44 44 44 44 44 44 44 44 43 44 44 44 44 44 43 42 42 42 43 43 44 44 45 45 45 44 44 43 43 44 43 43 44 44 44 44 44 44 44 44 44 44 43 43 43 43 43 43 43 43
-1101 43 44 44 43 43 43 44 44 44 44 43 43 42 42 42 43 44 44 44 45 45 44 44 44 44 44 43 44 44 44 45 44 44 44 43 43 43 43 42 43 43 43 43 43 43 43 42 42 42 42 42 42 42 42 42 43 43 43 43 43 44 44 44 43 43 43 43 44 44 45
-1109 45 45 45 44 44 43 43 43 43 42 42 43 43 43 44 43 43 43 43 43 43 43 43 43 43 44 44 44 44 43 43 43 43 43 42 43 43 43 43 43 43 43 43 43 43 43 43 43 43 43 43 43 44 44 44 44 44 43 43 43 43 43 42 42 42 42 42 42 43 43
-1116 43 44 44 43 43 43 44 44 44 44 44 44 44 44 44 44 45 45 45 43 43 43 43 42 41 41 42 43 43 43 43 43 43 44 44 44 44 44 44 44 44 44 44 44 44 44 44 44 44 43 43 43 43 43 43 43 43 43 43 43 43 44 44 44 45 45 44 44 44 44
-1123 44 44 44 44 45 44 44 44 43 43 43 43 44 44 43 44 45 45 44 44 44 44 43 43 43 43 43 43 43 44 45 46 45 44 43 42 42 42 42 43 43 43 43 44 45 45 45 45 43 43 43 43 43 43 44 44 45 44 44 44 43 43 43 43 43 43 43 44 44 44
-1131 44 45 44 44 43 43 43 43 43 43 43 44 43 43 44 45 44 44 44 44 44 43 43 43 43 43 44 44 44 44 44 43 43 43 43 44 44 45 45 44 44 44 44 44 43 43 42 42 43 44 44 44 43 43 42 42 42 42 41 42 42 42 42 42 42 42 43 43 43 44
-1138 44 44 45 44 44 43 43 43 42 42 42 42 43 42 42 43 43 43 43 43 43 43 44 44 45 44 44 44 43 43 43 42 43 43 43 43 43 43 43 43 43 43 44 43 43 43 43 43 43 44 44 43 43 43 43 44 43 43 43 43 43 43 43 43 43 43 43 43 43 43
-1145 43 44 44 45 44 44 44 44 44 43 43 43 44 43 42 42 42 42 43 43 43 42 43 43 43 43 43 44 43 43 43 43 43 43 43 43 44 44 44 43 43 43 43 43 43 43 43 44 44 44 44 43 43 43 43 43 44 44 44 43 43 43 43 43 44 44 44 44 43 43
-1153 43 43 43 44 44 43 42 42 42 42 43 43 43 43 43 43 43 42 42 41 41 41 42 42 42 42 43 43 43 44 44 45 45 44 43 43 43 44 45 45 44 44 44 44 44 44 44 44 43 44 44 44 44 43 43 43 43 43 43 43 44 44 44 44 44 44 44 45 45 44
-1160 44 42 43 43 43 43 43 42 42 43 43 43 43 43 44 44 44 44 44 44 44 43 42 43 43 43 43 44 43 43 42 42 42 43 43 42 42 42 42 43 43 43 43 43 43 43 44 44 44 44 44 44 44 45 45 45 44 43 43 44 44 44 43 44 43 43 43 43 43 43
-1167 43 43 43 44 44 44 44 44 44 44 44 44 44 45 45 44 44 44 44 44 44 44 44 43 43 43 43 43 43 43 43 44 44 43 44 44 45 45 45 44 44 43 43 43 43 43 43 44 43 43 44 43 43 43 43 43 44 43 43 42 42 43 44 43 43 44 44 44 44 43
-1175 43 42 42 42 42 42 41 41 41 41 41 42 43 44 43 43 43 43 43 44 44 43 42 43 43 44 44 44 43 43 42 42 43 44 43 43 43 43 43 44 44 44 44 44 43 43 44 43 43 43 44 44 44 44 44 44 44 44 44 44 43 43 43 43 43 43 43 43 43 43
-1182 43 43 43 44 44 44 43 43 43 44 44 44 44 44 44 44 44 44 44 44 44 44 44 44 44 44 44 44 44 45 45 45 45 45 44 44 44 44 45 44 44 44 43 43 42 42 42 42 43 43 43 43 43 43 43 44 44 45 44 44 44 44 44 44 44 44 43 42 42 43
-1189 43 44 44 44 43 43 44 44 45 45 44 44 43 43 43 43 44 44 43 43 43 43 43 44 44 44 44 44 43 44 44 44 44 43 43 42 42 43 44 44 44 44 44 43 43 42 42 41 42 42 42 43 43 43 43 42 43 43 43 43 43 43 43 43 43 43 43 42 42 43
-1197 43 43 43 43 43 44 43 43 43 43 42 42 42 42 42 42 43 43 43 43 43 43 43 43 43 44 44 44 44 43 43 43 42 41 41 42 43 43 43 43 43 43 43 43 43 44 44 44 45 45 44 43 44 44 43 43 43 43 43 44 44 44 43 43 43 42 42 42 43 43
-1204 43 43 43 43 43 43 43 43 43 43 43 43 43 43 44 43 43 44 43 44 44 44 43 43 42 42 42 43 43 44 45 45 45 45 44 44 44 45 45 44 44 43 43 44 44 44 45 44 44 44 44 43 43 43 43 42 42 43 43 43 43 43 43 43 44 44 44 44 44 43
-1211 43 43 43 43 43 43 43 43 43 43 43 42 42 42 42 43 43 42 42 43 42 42 42 43 43 43 43 44 44 44 44 44 43 42 43 43 44 43 43 43 43 42 42 43 43 42 42 42 43 43 43 43 42 42 42 42 43 43 44 43 43 43 43 43 44 44 44 44 44 44
-1218 44 44 44 44 44 44 44 43 43 43 42 42 42 42 43 42 43 43 43 43 44 44 44 43 43 42 42 43 43 43 43 43 43 44 44 43 43 43 43 43 43 44 45 44 44 44 44 43 43 43 43 43 43 43 43 43 42 42 42 42 42 42 42 41 41 41 41 41 42 43
-1226 43 43 43 43 44 43 43 43 43 42 42 42 42 43 43 43 42 43 44 43 43 43 43 42 42 43 44 43 43 43 43 43 43 43 43 43 43 44 44 43 42 42 42 42 43 43 43 43 43 43 43 43 43 43 43 43 43 43 42 43 44 45 45 45 45 44 45 45 44 44
-1233 44 44 43 43 43 42 42 42 42 42 42 42 42 43 43 43 43 43 43 43 43 44 44 44 44 44 45 44 43 43 43 44 44 44 44 44 44 43 44 44 44 45 45 45 44 43 43 44 44 44 43 43 44 44 44 44 44 44 43 43 43 43 44 44 44 44 44 43 42 42
-1240 42 42 43 43 43 43 43 43 43 43 43 43 43 43 43 43 43 43 43 43 43 43 43 43 43 43 43 43 43 44 44 44 44 44 45 45 45 45 44 44 43 43 43 43 43 42 42 43 43 42 42 43 43 44 45 44 43 43 43 43 43 43 44 43 44 44 43 43 43 43
-1248 43 43 43 43 43 42 42 42 42 42 43 44 45 44 44 43 43 43 43 43 44 43 44 44 44 43 43 43 43 42 42 42 41 41 41 42 42 42 42 42 42 43 43 43 43 43 43 43 43 42 42 42 42 42 43 43 43 43 42 42 43 44 44 43 43 44 44 44 43 43
-1255 43 42 41 41 41 42 43 43 43 43 43 42 43 43 43 43 44 44 44 43 43 43 43 44 44 43 42 42 42 43 43 43 42 42 42 42 43 44 43 43 43 43 42 42 42 42 42 42 42 42 42 42 43 43 44 44 44 44 44 43 42 42 42 42 41 41 42 42 42 41
-1262 41 41 41 41 42 43 42 42 42 43 43 42 42 42 43 43 44 43 43 43 43 43 43 43 43 42 42 41 42 42 43 43 44 44 44 44 44 44 44 44 44 44 43 43 42 42 42 43 43 43 43 43 43 42 42 41 42 42 42 41 41 41 42 42 42 42 42 42 42 42
-1270 42 42 43 43 43 43 43 43 43 43 43 43 43 43 43 44 44 44 43 43 43 42 42 42 42 42 42 43 44 44 43 43 42 42 42 42 42 42 42 43 43 43 44 44 44 43 43 43 43 43 43 43 43 43 43 44 44 44 44 44 44 44 43 43 43 43 44 44 44 44
-1277 44 44 44 44 44 44 43 43 43 43 43 42 43 43 42 42 42 42 42 43 42 42 42 42 43 43 43 42 42 43 43 43 43 43 43 43 43 43 42 42 43 42 42 42 42 43 43 42 42 43 44 44 44 43 42 42 42 42 42 42 43 43 43 43 43 43 43 44 43 43
-1284 43 42 42 42 42 42 42 42 42 42 43 44 43 43 43 43 44 43 43 42 42 42 43 42 42 41 42 42 42 42 43 43 43 43 43 43 44 43 42 42 41 42 42 43 43 43 43 43 43 42 42 42 42 42 42 42 43 43 42 43 43 44 44 43 42 42 42 43 44 43
-1292 43 42 41 41 41 41 42 42 42 43 43 43 42 42 43 44 44 43 43 43 43 43 42 42 42 42 42 43 43 44 44 44 44 43 43 43 42 42 42 42 42 42 42 42 42 42 42 42 43 43 43 43 43 43 43 43 44 44 43 43 42 42 42 43 43 43 43 43 43 43
-1299 43 42 42 42 42 42 42 42 42 42 42 41 41 41 41 42 42 42 41 41 41 41 41 42 42 42 41 40 40 41 42 43 43 43 43 42 42 42 42 42 41 42 42 42 42 42 42 43 43 43 43 43 43 42 41 41 42 43 43 43 43 42 42 42 42 42 42 42 43 43
-1306 43 42 42 42 42 42 42 43 44 43 43 42 42 41 42 43 43 43 43 43 43 43 43 43 43 43 43 42 43 44 44 44 44 43 43 43 43 42 42 41 42 42 42 42 43 43 42 41 41 41 42 42 43 43 43 42 42 42 43 42 42 42 43 42 43 43 43 43 43 42
-1314 42 43 43 44 44 44 44 44 43 43 42 42 41 42 42 43 43 43 42 42 42 43 43 43 43 42 42 42 42 42 42 42 42 42 41 41 40 40 41 41 42 42 43 43 42 42 42 41 42 42 42 43 44 44 43 43 43 42 42 42 42 42 42 43 43 43 43 43 43 43
-1321 43 43 43 43 43 43 43 42 42 42 41 41 41 41 42 42 42 42 42 42 42 43 42 42 42 42 42 42 42 43 44 44 44 43 43 42 41 40 40 41 40 41 41 41 40 41 41 41 41 41 41 41 41 41 42 42 42 42 42 42 43 43 43 43 43 43 43 43 43 43
-1328 43 43 43 43 43 42 42 42 42 41 41 42 43 43 43 43 44 43 43 43 43 42 42 42 42 42 42 41 41 41 42 42 43 43 44 44 44 43 43 43 42 42 43 43 43 42 41 42 43 43 42 41 42 42 42 41 42 42 43 44 44 44 43 42 42 42 42 42 42 42
-1335 42 43 43 43 43 43 43 42 42 42 42 41 41 41 41 41 41 41 42 42 42 42 42 42 42 42 42 42 43 43 43 43 43 44 44 44 44 44 43 43 43 42 42 42 41 41 40 39 39 39 40 41 42 42 42 41 41 41 41 42 42 43 43 43 43 43 43 43 43 42
-1343 42 41 41 41 41 42 42 42 42 42 42 43 43 42 41 42 42 42 42 42 42 41 41 41 40 41 41 41 42 42 42 42 42 42 42 41 41 41 41 41 41 41 42 43 43 42 42 41 41 41 41 42 42 42 42 43 43 44 43 43 44 44 44 43 43 43 42 42 42 42
-1350 42 42 42 42 43 43 43 43 43 43 43 42 42 42 42 43 43 43 44 43 42 42 42 42 43 43 43 43 43 44 44 43 42 42 42 42 42 42 41 41 41 41 42 42 43 43 43 43 43 42 42 42 42 41 41 41 41 41 42 42 42 41 41 42 43 44 43 43 42 41
-1357 41 41 41 41 42 42 42 42 42 42 42 42 42 42 42 42 42 43 42 42 41 41 41 42 42 42 42 41 41 42 42 42 42 42 43 43 43 43 43 43 43 42 42 41 40 41 42 43 43 43 42 43 43 43 43 42 42 41 41 41 41 41 41 42 42 41 42 42 42 42
-1365 42 42 42 42 43 43 44 44 44 44 43 43 43 42 42 42 43 43 42 42 42 42 43 43 44 43 43 42 42 42 41 42 43 43 42 42 42 42 42 42 42 42 42 42 42 43 43 43 44 44 44 43 42 43 43 43 42 42 42 43 43 43 42 42 42 42 43 43 43 42
-1372 42 42 42 43 43 42 42 42 42 42 42 43 44 44 44 43 42 43 43 42 42 42 42 41 41 41 41 42 42 42 43 43 42 42 42 42 42 42 42 42 42 41 41 42 43 42 42 43 43 43 43 43 42 43 43 43 42 42 42 42 42 42 42 42 42 43 43 43 42 42
-1379 42 42 42 43 42 42 42 42 41 41 41 42 41 41 41 41 41 42 42 42 42 42 43 42 42 42 43 43 43 42 42 43 43 43 42 42 43 43 43 44 43 43 43 43 43 43 42 42 43 42 42 41 41 41 41 41 41 42 42 43 42 42 42 42 42 42 42 41 41 41
-1387 41 41 41 41 41 41 41 41 41 42 42 43 43 42 42 42 41 42 42 42 42 41 41 42 42 42 42 42 42 42 42 41 41 41 42 42 42 41 41 41 41 41 41 42 42 42 42 42 42 42 42 42 41 41 41 41 41 41 40 41 41 41 42 42 43 43 42 43 44 43
-1394 43 43 42 42 42 42 42 42 42 43 42 42 42 42 42 42 43 43 43 43 43 43 43 43 43 43 42 41 40 41 41 42 42 42 42 42 42 42 42 42 41 41 42 42 41 42 42 42 42 41 41 42 42 41 41 41 42 42 41 41 41 41 41 41 41 41 42 42 42 42
-1401 42 42 42 42 41 42 42 43 43 43 43 43 42 42 42 42 42 43 43 42 42 41 41 41 42 42 41 41 41 41 40 40 40 41 41 41 41 42 42 43 43 42 41 41 41 41 40 40 41 42 42 41 41 41 41 41 41 41 41 42 41 41 40 40 40 41 43 43 43 42
-1409 42 42 41 42 41 41 41 41 41 41 40 41 41 42 42 42 41 42 42 42 42 42 41 41 41 41 41 41 42 42 42 43 43 43 43 43 43 43 43 44 43 42 41 41 41 41 40 41 41 42 42 42 42 43 43 42 42 42 42 42 42 42 41 41 41 41 40 41 42 42
-1416 42 42 42 42 42 42 42 42 41 41 42 42 43 42 42 42 42 42 42 41 41 41 42 41 41 41 41 41 41 40 40 40 40 41 41 41 42 42 42 41 41 41 41 41 42 41 41 40 40 40 41 42 42 42 42 42 41 42 42 42 42 42 42 42 42 42 42 42 42 42
-1423 42 42 42 42 42 42 42 43 42 42 42 42 42 42 42 42 42 42 42 42 42 42 42 42 42 41 41 42 42 42 41 40 41 42 43 43 42 41 40 40 40 41 42 41 41 41 41 41 41 41 41 41 41 40 40 40 40 40 40 41 42 43 43 43 43 42 42 42 42 41
-1431 41 41 41 41 41 41 41 42 42 41 41 41 40 41 41 42 42 42 42 41 42 42 42 42 42 42 42 42 42 42 42 42 42 42 42 42 42 42 42 42 42 42 42 42 43 42 41 42 42 42 42 41 41 41 41 41 41 42 42 42 42 41 40 40 40 40 41 42 42 42
-1438 42 41 41 41 41 41 41 41 42 42 42 42 42 42 42 43 43 42 41 40 40 41 42 42 42 41 42 42 41 41 41 42 42 42 42 42 42 41 40 41 41 41 41 41 40 40 41 41 41 41 42 42 42 41 42 42 42 42 42 43 43 44 45 45 44 44 43 42 42 41
-1445 41 41 41 40 40 40 40 41 41 42 42 42 42 41 42 42 43 43 42 41 40 41 42 42 42 42 42 41 42 42 42 42 42 42 42 42 41 41 40 41 41 41 41 41 41 40 40 40 41 42 42 43 44 43 43 42 42 41 41 41 41 41 41 41 41 41 41 41 41 41
-1452 41 42 42 42 42 42 42 41 41 41 41 42 42 42 42 43 43 43 42 42 42 42 42 42 41 41 42 42 42 42 42 41 42 42 43 43 43 43 43 43 43 43 42 41 40 41 41 41 41 41 42 42 42 42 42 43 43 43 43 43 42 42 41 41 41 40 40 40 40 40
-1460 40 40 40 40 40 41 42 42 41 42 42 41 41 42 43 43 42 42 42 42 42 42 42 42 43 42 41 41 41 41 42 42 42 42 42 42 41 40 40 40 40 39 40 40 41 40 40 40 40 40 41 41 41 41 42 42 42 41 42 42 41 41 41 42 43 42 43 43 43 43
-1467 43 42 42 42 42 42 42 42 42 41 41 41 41 41 41 41 42 43 43 42 42 42 41 42 42 42 42 42 42 42 42 42 42 42 42 41 41 41 42 42 42 42 42 41 41 41 40 40 40 41 41 41 42 43 44 43 43 42 41 41 41 42 42 42 42 43 43 43 42 42
-1474 42 41 41 41 41 42 42 42 42 42 42 41 41 40 40 40 40 41 41 41 41 42 42 42 42 42 41 42 42 42 41 41 40 39 39 39 40 40 40 40 40 41 42 42 41 41 40 41 41 41 41 41 41 41 41 40 40 41 41 41 41 41 41 40 41 41 42 42 42 42
-1482 42 42 42 42 41 41 41 41 41 40 41 41 41 42 42 43 43 43 43 42 42 41 41 41 41 40 40 40 41 42 42 42 41 41 41 41 40 41 41 42 42 42 41 41 41 41 41 42 42 43 42 42 41 40 41 41 41 41 41 41 42 42 42 42 42 41 41 41 42 42
-1489 42 42 42 42 42 42 42 41 41 42 42 42 42 42 42 42 42 42 42 41 41 42 42 43 43 43 42 42 42 42 42 41 42 42 42 42 41 41 41 41 41 41 40 40 40 41 42 42 42 43 43 43 43 43 43 42 42 41 41 41 40 40 41 42 41 41 42 43 43 43
-1496 43 42 42 42 42 42 42 42 42 42 42 42 41 40 39 40 40 41 41 42 41 41 40 41 41 42 42 42 43 43 43 42 41 41 41 40 40 41 41 41 41 41 41 41 41 41 40 40 41 42 42 42 42 41 41 41 41 41 41 41 42 41 41 42 42 42 42 42 42 43
-1504 43 43 42 41 40 41 42 41 41 41 41 41 40 41 41 41 42 42 42 42 42 42 42 42 42 42 42 41 41 41 41 41 41 40 41 41 41 41 41 40 40 41 41 42 41 41 41 42 41 41 40 40 41 41 42 42 42 41 41 41 41 41 42 42 41 41 42 42 42 42
-1511 42 42 41 41 41 41 41 41 41 40 40 40 41 42 42 41 41 41 41 41 42 43 42 42 42 41 41 41 41 42 41 41 41 41 42 42 41 41 41 41 41 40 40 40 41 41 42 42 42 42 42 41 41 41 40 40 40 40 40 40 40 40 39 39 40 41 42 41 41 41
-1518 41 41 42 42 41 40 41 41 42 42 41 40 40 39 39 40 40 40 40 40 40 41 41 42 42 42 41 41 41 41 40 39 39 40 41 41 41 42 42 42 42 41 40 40 40 40 40 40 41 41 41 42 43 43 43 43 42 41 40 40 40 40 41 41 42 42 41 40 39 39
-1526 39 40 41 41 42 42 42 43 42 41 40 40 40 40 40 40 40 40 41 41 41 42 42 42 42 41 41 41 41 41 41 41 41 41 42 42 41 41 41 41 41 40 40 40 41 42 42 42 41 40 40 40 40 41 41 41 41 41 41 41 41 41 42 42 42 42 42 43 43 43
-1533 43 43 42 42 42 42 42 42 43 43 43 43 43 42 42 42 41 42 42 41 41 40 40 39 39 39 39 39 39 40 40 40 40 40 40 41 41 41 40 41 41 42 41 41 42 41 41 41 41 41 41 41 41 41 40 40 40 41 42 42 41 41 41 42 42 42 41 41 40 40
-1540 40 40 40 40 41 41 41 41 41 41 41 41 41 41 41 41 40 40 40 40 40 41 41 40 39 39 40 40 41 40 40 40 40 41 41 41 41 41 41 40 40 40 40 40 40 40 40 40 41 41 41 41 41 42 42 42 42 42 41 41 41 40 40 40 40 40 40 41 41 42
$$ [...]
-2638E6
##END=		$$ NMR SPECTRUM
##END=		$$ LINK
