##TITLE=	UHS-592-P1.10.fid
##JCAMP-DX=	6.0	$$ MestReNova 14.3.3-33362
##DATA TYPE=	LINK
##BLOCKS=	1    
##ORIGIN=	Mestrelab Research S.L.
##OWNER=	hrzepa
##$MNOVA/METADATA=	(DOCUMENT,BASE64)
eyJuYW1lIjoiL1VzZXJzL2hyemVwYS9MaWJyYXJ5L01vYmlsZSBEb2N1bWVudHMvY29tfmFwcGxlfkN
sb3VkRG9jcy9TaGVwcGFyZC9OTVIgZmlsZXMgemlwcy0yLzE4LzE4LUgubW5vdmEiLCJwYWdlcyI6W3
siaXRlbXMiOlsiMSIgICAgIF19XX0=
##TITLE=	UHS-592-P1.10.fid
##JCAMP-DX=	6.0	$$ MestReNova 14.3.3-33362
##DATA TYPE=	NMR SPECTRUM
##DATA CLASS=	XYDATA
##BLOCK_ID=	1
##ORIGIN=	Bruker BioSpin GmbH
##OWNER=	Cryotool
##NUMDIM=	1
##$MNOVA/METADATA=	(ITEM,BASE64)
eyJhbmdsZSI6MCwiYXhlcyI6eyJ4Ijp7Im1heCI6MTYuMTYzMjM5OTk5OTQ4NDI3LCJtaW4iOi0zLjg
2NDMxODYzMjIwNjg5Mn0sInkiOnsibWF4Ijo2NjExLjYyMzA0Njg3NSwibWluIjotNjAxLjI4Mzk4MT
UwMjA1NjF9fSwicG9pbnRzIjpbeyJ4Ijo1MzIxLCJ5Ijo1ODM1fSx7IngiOjg3MjIsInkiOjU4MzV9L
HsieCI6ODcyMiwieSI6ODIwOH0seyJ4Ijo1MzIxLCJ5Ijo4MjA4fSx7IngiOjUzMjEsInkiOjU4MzV9
XSwieiI6MH0=
##.OBSERVE FREQUENCY=	600.13370580200000859
##.OBSERVE NUCLEUS=	^1H
##.SOLVENT NAME=	CDCl3
##.PULSE SEQUENCE=	zg30
##LONGDATE=	2024/05/03 15:51:36.000
##.ACQUISITIONMODE=	SIMULTANEOUS (DQD)
##$ORIGINAL FORMAT=	Bruker XWIN-NMR
##$MNOVA/SCALES_VERSION=	9
##$PARAMETER FILE=	(acqus, ASCII, /private/var/folders/f6/rjf_tdyn2v98c5c0wvkgn4s80000gq/T/qFOLyzmrRRC64YCK+F4giQ/10/acqus, 0)
$$ ##TITLE= Parameter file, TopSpin 3.6.4
$$ ##JCAMPDX= 5.0
$$ ##DATATYPE= Parameter Values
$$ ##NPOINTS= 1	$$ modification sequence number
$$ ##ORIGIN= Bruker BioSpin GmbH
$$ ##OWNER= Cryotool
$$ $$ 2024-05-03 15:54:53.632 +0100  Cryotool@topspin3
$$ $$ Y:/600/data/tds/nmr/UHS-592-P1/10/acqus
$$ $$ process C:\Bruker\TopSpin3.6.4\prog\mod\dirdata.exe
$$ ##$ACQT0= -1.36465403113263
$$ ##$AMP= (0..31)
$$ 100 100 100 100 100 100 100 100 100 100 100 100 100 100 100 100 100 100
$$ 100 100 100 100 100 100 100 100 100 100 100 100 100 100
$$ ##$AMPCOIL= (0..19)
$$ -1 0 0 0 0 0 0 0 0 0 0 0 0 0 0 0 0 0 0 0
$$ ##$ANAVPT= -1
$$ ##$AQSEQ= 0
$$ ##$AQ_mod= 3
$$ ##$AUNM= <au_zg>
$$ ##$AUTOPOS= <10 >
$$ ##$BF1= 600.13
$$ ##$BF2= 600.13
$$ ##$BF3= 600.13
$$ ##$BF4= 600.13
$$ ##$BF5= 600.13
$$ ##$BF6= 600.13
$$ ##$BF7= 600.13
$$ ##$BF8= 600.13
$$ ##$BWFAC= (0..63)
$$ 0 0 0 0 0 0 0 0 0 0 0 0 0 0 0 0 0 0 0 0 0 0 0 0 0 0 0 0 0 0 0 0 0 0 0 0
$$ 0 0 0 0 0 0 0 0 0 0 0 0 0 0 0 0 0 0 0 0 0 0 0 0 0 0 0 0
$$ ##$BYTORDA= 0
$$ ##$CAGPARS= (0..11)
$$ 0 0 0 0 0 0 0 0 0 0 0 0
$$ ##$CHEMSTR= <none>
$$ ##$CNST= (0..63)
$$ 1 1 1 1 1 1 1 1 1 1 1 1 1 1 1 1 1 1 1 1 1 1 1 1 1 1 1 1 1 1 1 1 1 1 1 1
$$ 1 1 1 1 1 1 1 1 1 1 1 1 1 1 1 1 1 1 1 1 1 1 1 1 1 1 1 1
$$ ##$CPDPRG= (0..8)
$$ <> <> <> <> <> <> <> <> <>
$$ ##$D= (0..63)
$$ 0 1 0 0 0 0 0 0 0 0 0 0 0 0 0 0 0.0002 0 0 0 0 0 0 0 0 0 0 0 0 0 0 0 0
$$ 0 0 0 0 0 0 0 0 0 0 0 0 0 0 0 0 0 0 0 0 0 0 0 0 0 0 0 0 0 0 0
$$ ##$DATE= 1714747896
$$ ##$DATE_START= 1714747855
$$ ##$DE= 43.81035
$$ ##$DECBNUC= <off>
$$ ##$DECIM= 1664
$$ ##$DECNUC= <off>
$$ ##$DECSTAT= 4
$$ ##$DIGMOD= 3
$$ ##$DIGTYP= 12
$$ ##$DQDMODE= 0
$$ ##$DR= 22
$$ ##$DS= 2
$$ ##$DSPFIRM= 4
$$ [...]
$$ ##$ShimPowMaxUC= (0..63)
$$ 130000 130000 130000 130000 130000 130000 130000 130000 130000 130000 130000
$$ 130000 130000 130000 130000 130000 130000 130000 130000 130000 130000 130000
$$ 130000 130000 130000 130000 130000 130000 130000 130000 130000 130000 130000
$$ 130000 130000 130000 130000 130000 130000 130000 0 0 0 0 0 0 0 0 0 0 0
$$ 0 0 0 0 0 0 0 0 0 0 0 0 0
$$ ##$ShimPowMaxUG= (0..63)
$$ 1000000 1000000 1000000 1000000 1000000 1000000 1000000 1000000 1000000
$$ 1000000 1000000 1000000 1000000 1000000 1000000 1000000 1000000 1000000
$$ 1000000 1000000 1000000 1000000 1000000 1000000 1000000 1000000 1000000
$$ 1000000 1000000 1000000 1000000 1000000 1000000 1000000 1000000 1000000
$$ 1000000 1000000 1000000 0 0 0 0 0 0 0 0 0 0 0 0 0 0 0 0 0 0 0 0 0 0 0 0
$$ 0
$$ ##$ShimPowNum= 0
$$ ##$ShimPowRcbType= 3
$$ ##$ShimPowRes= (0..63)
$$ 1e-020 1e-020 1e-020 1e-020 1e-020 1e-020 1e-020 1e-020 1e-020 1e-020 1e-020
$$ 1e-020 1e-020 1e-020 1e-020 1e-020 1e-020 1e-020 1e-020 1e-020 1e-020 1e-020
$$ 1e-020 1e-020 1e-020 1e-020 1e-020 1e-020 1e-020 1e-020 1e-020 1e-020 1e-020
$$ 1e-020 1e-020 1e-020 1e-020 1e-020 1e-020 1e-020 0 0 0 0 0 0 0 0 0 0 0
$$ 0 0 0 0 0 0 0 0 0 0 0 0 0
$$ ##$ShimPowRng0= (0..63)
$$ 1 1 1 1 1 1 1 1 1 1 1 1 1 1 1 1 1 1 1 1 1 1 1 1 1 1 1 1 1 1 1 1 1 1 1 1
$$ 1 1 1 1 0 0 0 0 0 0 0 0 0 0 0 0 0 0 0 0 0 0 0 0 0 0 0 0
$$ ##$ShimPowRng1= (0..63)
$$ 1 1 1 1 1 1 1 1 1 1 1 1 1 1 1 1 1 1 1 1 1 1 1 1 1 1 1 1 1 1 1 1 1 1 1 1
$$ 1 1 1 1 0 0 0 0 0 0 0 0 0 0 0 0 0 0 0 0 0 0 0 0 0 0 0 0
$$ ##$ShimPowRng2= (0..63)
$$ 1 1 1 1 1 1 1 1 1 1 1 1 1 1 1 1 1 1 1 1 1 1 1 1 1 1 1 1 1 1 1 1 1 1 1 1
$$ 1 1 1 1 0 0 0 0 0 0 0 0 0 0 0 0 0 0 0 0 0 0 0 0 0 0 0 0
$$ ##$ShimPowRng3= (0..63)
$$ 1 1 1 1 1 1 1 1 1 1 1 1 1 1 1 1 1 1 1 1 1 1 1 1 1 1 1 1 1 1 1 1 1 1 1 1
$$ 1 1 1 1 0 0 0 0 0 0 0 0 0 0 0 0 0 0 0 0 0 0 0 0 0 0 0 0
$$ ##$ShimPowType1= 0
$$ ##$ShimPowType2= 0
$$ ##$ShimPowType3= 0
$$ ##$ShimPowType4= 0
$$ ##$ShimSysAngle= <>
$$ ##$ShimSysFunc= (0..63)
$$ 1 2 3 4 5 6 7 8 9 10 0 37 38 35 16 15 14 13 12 11 28 27 26 25 24 23 36
$$ 22 30 29 20 21 34 33 32 31 17 18 19 0 0 0 0 0 0 0 0 0 0 0 0 0 0 0 0 0 0
$$ 0 0 0 0 0 0 0
$$ ##$ShimSysMatId= <no>
$$ ##$ShimSysMatrix= 1
$$ ##$ShimSysOffset= <42 mm>
$$ ##$ShimSysType= 4
$$ ##$ShimUnit= 0
$$ ##$TFXNUM= 0
$$ ##$TOSITY= <no>
$$ ##$TRIPLO2= 0
$$ ##$VTU= 1
$$ ##$VTUETH= <no>
$$ ##$VTUTY= <tty05>
$$ ##$WBREFAM= (0..15)
$$ 100 100 100 100 100 100 100 100 100 100 100 100 100 100 100 100
$$ ##$WBREFLM= (0..15)
$$ 0 0 0 0 0 0 0 0 0 0 0 0 0 0 0 0
$$ ##$WBREFPH= (0..15)
$$ 0 0 0 0 0 0 0 0 0 0 0 0 0 0 0 0
$$ ##$WBSGU= (0..15)
$$ 0 0 0 0 0 0 0 0 0 0 0 0 0 0 0 0
$$ ##$XFAC= 2
$$ ##END=
$$ 
##$DECIM=	1664
##$DSPFVS=	21
##XUNITS=	HZ
##YUNITS=	ARBITRARY UNITS
##FIRSTX=	9700.0454696289998537
##LASTX=	-2319.0936001482996289
##DELTAX=	-0.091699453500601185718
##XFACTOR=	1
##YFACTOR=	0.18343516700300607769
##FIRSTY=	1.3089261054992675781
##MINY=	-0.23199839890003204346
##MAXY=	6010.6201171875
##NPOINTS=	131072
##XYDATA=	(X++(Y..Y))
$$ [...]
4416 3133 3100 3042 2958 2854 2732 2597 2455 2309 2161 2016 1877 1745 1621 1505 1399 1304 1219 1144 1077 1018 965 919 878 843 811 781 755 730
4414 730 708 688 669 652 636 621 606 593 581 571 561 552 543 535 527 518 509 501 494 487 480 474 469 463 458 452 447 442 438 434 430 425 419 415 411 407 404 399 395 389 383 378 372 367 361 355 350 344 339 334 330 325 321 316 311 306 302 299
4409 299 296 293 290 286 283 281 279 277 275 272 269 266 263 261 259 257 255 254 253 251 250 246 243 241 238 236 234 232 231 230 228 227 226 225 223 221 220 218 216 214 211 209 207 206 205 204 203 201 199 198 198 196 194 193 192 191 190 189 188 188 186 183 181 180 179 178 176 176 176
4402 176 175 173 171 170 171 171 170 169 168 167 166 165 164 163 162 162 162 161 161 160 159 158 157 157 156 156 155 155 154 154 153 153 152 151 151 150 148 147 146 145 143 141 141 142 142 142 141 141 141 140 139 138 138 138 138 138 137 136 134 133 132 132 133 134 134 134 134 133 133
4396 133 133 133 134 133 132 131 131 130 129 129 128 128 128 127 127 126 124 123 122 123 123 123 122 121 120 120 119 119 119 119 118 118 118 117 116 116 117 118 119 118 117 116 117 117 117 118 118 118 116 115 114 113 113 113 114 114 114 114 114 114 114 113 112 111 110 109 108 107 105
4390 105 106 106 106 107 107 107 107 106 105 106 107 108 107 107 107 107 107 108 108 107 108 108 107 107 107 106 106 106 105 105 104 103 102 101 100 99 99 98 97 97 97 97 97 97 97 97 97 96 96 97 97 97 97 98 99 99 99 98 98 97 97 97 97 97 98 100 101 102 102
4383 102 103 104 104 105 107 108 109 111 112 112 112 113 115 116 118 119 121 121 121 122 123 123 122 121 120 119 117 115 114 114 113 110 108 107 106 105 104 103 102 101 102 102 101 101 100 100 99 99 99 99 98 98 98 98 98 98 97 97 97 97 98 99 99 99 99 99 101 102 103
4377 103 102 102 103 104 105 106 107 107 108 109 109 110 110 111 112 113 115 117 118 120 121 121 121 122 124 126 127 127 127 128 130 132 134 136 139 142 145 148 151 154 157 160 163 168 173 177 180 184 190 195 201 207 213 218 225 231 237 244 250 256 262 269 278 288 299 311
4371 311 323 338 354 372 391 413 438 466 496 530 568 612 662 719 783 854 934 1025 1127 1243 1374 1521 1685 1870 2075 2299 2540 2792 3053
4368 3053 3315 3571 3814 4038 4237 4404 4535 4626 4674 4678 4638 4557 4436 4279 4089 3873 3637 3390 3141 2897 2662 2440 2234 2047 1879
4366 1879 1732 1605 1497 1410 1338 1283 1242 1216 1202 1200 1210 1233 1267 1312 1368 1438 1522 1620 1736 1871 2026 2199 2393 2606 2836 3079 3328 3577
4363 3577 3818 4046 4253 4436 4588 4704 4780 4816 4812 4766 4681 4561 4408 4225 4018 3799 3573 3350 3136 2937 2755 2592 2452 2337 2249
4361 2249 2188 2154 2147 2165 2209 2281 2379 2505 2657 2835 3038 3261 3497 3739 3981 4215 4434 4634 4811 4959 5074 5154 5201 5217 5203 5162 5100 5016
4358 5016 4914 4804 4700 4612 4551 4531 4563 4657 4823 5083 5455 5948 6572 7344 8271 9316 10394 11410 12255 12816 13001 12809 12356 11793
4356 11793 11204 10588 9916 9190 8443 7712 7030 6422 5906 5491 5181 4981 4878 4846 4856 4894 4948 5006 5051 5075 5074 5043 4977 4877 4745 4581
4354 4581 4385 4162 3918 3659 3392 3124 2864 2615 2377 2154 1950 1765 1597 1445 1311 1194 1091 1000 921 851 789 734 687 646 609 576
4351 576 547 520 496 473 454 438 422 408 395 383 370 359 348 337 327 316 306 295 284 273 265 256 247 238 230 222 215 209 205 201 197 193 191 189 186 182 179 177 176 173 170 166 162 158 154 150 145 142 139
4347 139 137 134 131 128 124 121 118 116 114 112 111 111 109 106 102 100 98 97 96 96 98 98 98 97 96 95 94 93 93 92 91 90 89 88 87 86 87 87 88 88 88 88 88 88 89 90 92 93 93 94 94 94 95 93 91 91 91 91 90 89 89 89 88 87 86 85 85 86 87
4341 87 86 85 84 84 83 82 81 79 77 76 75 75 74 73 73 71 70 68 67 66 66 65 64 64 64 63 63 63 63 63 63 63 61 59 58 58 57 57 56 55 54 53 53 53 53 53 53 53 53 53 54 54 55 56 56 57 58 60 60 60 59 59 60 61 62 63 64 65 65 64
4334 64 62 62 62 61 61 60 59 57 56 56 55 53 51 50 49 48 48 48 47 46 45 46 46 46 46 47 48 48 47 47 46 46 45 46 47 46 45 44 44 45 46 46 45 44 44 44 45 46 46 47 47 48 48 48 48 48 48 48 48 49 49 48 47 48 48 50 52 53 55 55
4328 55 56 57 58 57 56 55 54 54 55 56 58 59 59 59 59 58 58 58 59 60 62 62 62 61 61 61 62 62 62 62 63 62 61 60 60 60 60 60 60 59 59 59 58 59 59 58 56 56 56 56 56 55 55 54 53 54 54 55 55 55 53 52 52 53 53 53 52 52 52 53
4321 53 53 53 53 54 54 55 55 56 57 56 55 54 53 52 51 52 52 54 55 56 58 58 59 59 60 61 61 59 59 60 62 64 65 66 66 64 63 64 65 66 65 64 63 63 62 62 61 61 60 61 62 61 60 60 59 59 60 61 62 62 63 63 63 63 63 62 61 60 59 60
4315 60 60 61 62 62 62 63 63 63 63 63 63 63 63 64 64 65 66 66 67 67 67 67 67 67 67 67 67 68 68 67 66 65 64 64 63 63 65 66 66 66 65 64 63 63 63 62 62 62 63 63 63 63 64 64 65 65 65 63 62 61 59 58 56 55 53 52 50 50 49 48
4309 48 48 47 46 46 45 45 44 44 44 43 43 43 43 42 42 42 42 42 42 43 43 43 43 42 42 42 41 41 41 41 42 42 42 42 42 43 45 47 49 50 49 48 48 48 47 48 49 49 50 50 51 52 52 52 52 52 51 51 51 51 50 51 51 52 52 54 55 55 55 54
4302 54 54 54 54 53 52 52 51 51 52 53 53 53 52 51 50 51 52 50 48 47 47 46 45 45 45 44 44 44 43 43 43 42 43 43 43 44 44 45 45 45 44 44 44 44 44 45 45 45 44 44 43 44 45 46 46 45 45 44 43 43 43 43 43 44 45 45 44 45 45 46
4296 46 46 47 48 49 50 51 52 53 54 54 54 55 55 55 55 55 55 56 57 58 59 59 60 60 58 57 57 58 58 58 58 58 58 60 61 62 61 61 61 62 61 61 62 62 62 63 63 64 65 65 66 66 67 69 70 70 70 71 72 74 75 75 75 76 78 79 80 82 83 84
4289 84 86 87 88 90 92 95 97 99 101 103 105 107 110 112 114 116 118 120 122 125 128 130 133 138 143 147 152 158 164 169 175 182 189 196 203 210 219 228 237 247 259 272 284 295 308 322 337 353 369 387 407 427 449 473 498
4284 498 526 557 590 628 668 713 763 818 880 949 1027 1115 1213 1322 1445 1582 1731 1893 2067 2253 2450 2655 2867 3084 3303 3523 3739 3949
4282 3949 4154 4351 4541 4726 4903 5072 5230 5374 5505 5622 5723 5806 5873 5923 5957 5974 5972 5951 5911 5852 5778 5691 5590 5474 5343 5199 5042
4279 5042 4870 4682 4483 4273 4057 3836 3614 3390 3169 2952 2743 2544 2354 2177 2014 1864 1730 1610 1504 1412 1332 1263 1204 1155 1115
4277 1115 1082 1057 1039 1028 1023 1023 1029 1042 1060 1085 1116 1155 1202 1258 1323 1399 1485 1584 1694 1818 1953 2101 2258 2425 2599 2780 2967 3156 3344 3530
4274 3530 3710 3885 4053 4216 4372 4521 4661 4793 4915 5025 5122 5204 5272 5327 5367 5394 5405 5400 5378 5337 5282 5214 5132 5038 4931 4810 4676 4527
4272 4527 4365 4189 4002 3806 3605 3400 3193 2984 2775 2569 2370 2179 1999 1830 1673 1528 1396 1276 1169 1073 987 911 843 783 729
4269 729 682 639 600 566 534 506 481 459 438 418 400 384 369 356 342 330 317 306 295 284 274 264 254 245 237 227 218 210 203 196 190 185 181 177 172 168 163 160 156 154 151 149 147 145 143
4265 143 142 139 136 132 129 127 124 121 119 118 116 115 113 112 110 108 107 105 105 105 105 105 104 102 102 102 101 101 101 101 101 101 100 98 95 94 95 95 94 93 93 93 92 91 91 91 92 91 90 90 89 88 89 89 89 90 91 93 95 96 97 98 98 99 100 100 100 99 97
4259 97 96 97 96 96 96 96 95 93 92 92 94 94 94 92 91 91 90 90 89 89 89 89 89 90 91 93 93 93 94 95 96 96 96 97 97 98 99 99 100 101 102 102 103 104 105 106 107 109 111 113 115 117 120 122 124 127 129 131 134 136 139 141 144 147 151 156 161 165 169 174
4252 174 180 186 191 198 205 213 221 230 240 251 264 278 293 309 326 345 367 390 414 439 466 494 522 550 579 610 644 682 726 776 833 895 964 1040 1124 1216 1313 1416
4249 1416 1525 1637 1751 1865 1975 2082 2184 2278 2365 2446 2519 2586 2647 2704 2759 2814 2872 2934 3001 3075 3156 3244 3342 3446 3554 3667 3783 3898
4246 3898 4011 4117 4215 4302 4377 4436 4480 4507 4518 4514 4497 4468 4429 4384 4336 4286 4235 4185 4136 4090 4043 3995 3944 3889 3829 3760 3682 3595 3498 3391 3271 3143
4243 3143 3009 2872 2733 2593 2455 2322 2195 2077 1969 1874 1791 1721 1665 1623 1595 1580 1580 1593 1621 1664 1723 1797 1885 1987 2103 2231 2372 2520
4241 2520 2672 2826 2978 3126 3267 3401 3530 3652 3769 3879 3982 4078 4165 4243 4309 4365 4409 4442 4466 4482 4492 4498 4502 4505 4510 4519 4532 4550 4574 4606 4646
4238 4646 4692 4747 4808 4876 4950 5029 5115 5203 5292 5378 5460 5535 5600 5649 5683 5700 5699 5680 5644 5594 5530 5455 5369 5278 5183 5087 4992 4903 4819 4743 4672 4608 4546 4487 4426
4235 4426 4364 4297 4224 4146 4061 3969 3871 3768 3660 3552 3447 3348 3258 3182 3120 3076 3053 3055 3084 3138 3219 3327 3459 3613 3783 3966 4156 4349 4537
4232 4537 4715 4879 5027 5157 5265 5350 5411 5450 5464 5454 5419 5359 5276 5172 5050 4914 4770 4626 4483 4348 4224 4114 4020 3940 3873 3820 3776
4230 3776 3741 3711 3684 3658 3631 3601 3568 3528 3478 3418 3347 3264 3168 3060 2940 2809 2672 2528 2380 2233 2086 1943 1805 1673 1549 1434 1328
4227 1328 1231 1143 1065 997 937 885 841 802 769 742 720 703 689 680 675 675 678 684 695 708 727 751 779 814 854 900 955 1019 1092 1174 1266 1365 1470 1578 1688
4224 1688 1797 1902 2001 2092 2173 2245 2308 2361 2402 2431 2448 2454 2448 2430 2400 2359 2308 2249 2186 2122 2061 2004 1953 1909 1875 1849 1833 1823 1820 1822 1827 1832 1835 1837 1837 1833 1826 1814 1796
4220 1796 1771 1738 1697 1648 1591 1526 1454 1376 1294 1211 1127 1045 965 887 812 743 680 621 569 523 482 444 410 380 355 333 314 296 280 266 253 241 230 220
4217 220 212 204 197 190 183 176 170 164 158 152 147 142 137 133 129 126 123 120 116 113 111 109 106 103 102 101 100 99 98 96 94 93 91 89 87 85 83 83 83 82 82 82 81 79 78 77 76 74 73 71 71 72 72 70 69 69 69 69 68 67 67 66 65 65 65 64 64 64 64
4211 64 65 65 65 64 63 62 60 60 59 59 59 58 57 58 59 59 57 55 54 54 54 54 53 53 53 53 53 53 53 53 52 52 51 51 50 49 49 49 49 49 49 49 48 47 47 47 48 49 50 51 51 50 49 49 49 50 49 49 49 49 48 48 47 47 48 48 48 47 47 47
4205 47 47 47 48 49 50 50 50 49 48 47 48 50 51 51 51 51 51 51 50 50 51 52 51 50 49 49 50 51 52 52 52 52 53 53 53 54 56 57 58 60 61 63 64 66 67 69 70 71 71 72 72 72 72 72 72 73 74 75 74 73 70 70 70 70 70 69 68 67 66 66
4198 66 65 64 63 61 61 61 60 59 58 57 56 54 53 53 52 52 51 50 48 48 48 49 50 49 48 47 46 45 45 45 46 48 48 49 50 50 51 52 53 53 54 55 55 56 56 58 59 61 62 63 64 65 65 66 67 68 68 68 67 67 67 66 66 67 66 66 66 67 68 68
4192 68 68 67 66 66 66 65 65 64 63 63 63 62 60 58 56 55 54 54 53 53 53 53 53 52 50 49 48 47 45 44 42 41 40 39 38 38 38 38 38 38 37 37 37 37 37 37 37 37 36 36 36 36 36 36 36 36 36 35 35 35 37 39 39 39 39 39 39 38 38 37
4185 37 37 36 36 36 36 36 35 35 35 34 33 32 31 32 32 33 34 34 34 34 33 33 32 32 31 32 32 33 33 34 35 36 36 36 36 35 35 35 35 34 33 32 31 31 32 33 33 33 33 32 32 30 30 30 30 30 31 31 31 32 32 32 32 32 32 32 32 33 33 33
4179 33 32 32 32 32 33 33 33 34 34 35 35 35 36 36 37 36 36 35 35 35 34 34 34 33 33 33 33 33 33 32 32 31 31 31 30 29 29 30 30 31 30 30 30 31 31 31 30 29 28 28 29 29 30 31 31 31 32 32 32 31 31 30 30 30 31 31 32 32 31 30
4172 30 29 29 29 29 29 30 30 30 30 30 30 30 30 30 31 31 31 31 31 31 31 31 31 31 31 32 33 33 34 34 33 33 33 33 34 35 35 35 34 33 33 33 34 33 32 33 33 34 34 33 34 36 38 37 37 38 39 40 41 42 42 43 44 45 46 46 47 48 48 48
4166 48 48 47 47 46 47 49 50 50 50 50 50 51 53 53 53 51 50 51 52 52 52 52 52 53 53 52 51 50 49 49 49 49 49 49 49 49 49 49 49 48 48 46 45 43 42 41 40 40 40 40 41 40 39 39 38 37 36 36 37 37 37 36 35 33 32 31 33 33 33 34
4160 34 34 34 34 34 35 36 37 39 39 40 40 40 41 41 41 43 45 46 47 47 49 51 53 54 54 54 55 56 58 59 60 60 61 61 60 60 60 60 60 61 61 62 62 63 64 64 65 66 66 65 64 64 66 67 66 66 66 66 65 64 64 63 62 61 60 59 58 56 54 54
4153 54 53 53 52 52 51 50 49 49 49 48 47 46 44 44 44 43 42 41 41 41 40 41 42 43 43 42 41 41 40 39 39 39 40 40 40 40 41 43 44 45 46 47 48 49 50 51 52 53 54 55 56 56 56 56 56 57 58 58 57 56 55 55 55 55 55 55 55 55 55 55
4147 55 54 53 53 53 54 55 56 56 56 55 55 55 55 54 53 52 51 50 50 49 48 47 46 45 43 42 41 40 39 37 36 36 36 36 36 36 36 36 36 35 35 36 36 36 36 36 35 35 35 35 35 35 35 35 35 34 34 34 34 35 36 37 37 37 36 37 38 39 39 38
4140 38 38 38 40 42 43 43 43 43 42 42 41 41 41 42 42 42 41 40 40 40 41 41 41 42 43 42 41 41 41 41 42 42 42 43 43 43 42 42 42 42 41 41 40 40 39 39 38 37 36 35 34 34 34 34 34 33 34 34 34 33 33 33 32 32 32 31 31 31 31 30
4134 30 30 30 30 30 30 30 29 29 29 28 28 27 26 26 26 26 27 28 29 28 27 27 28 28 27 26 25 24 24 25 25 26 26 27 28 28 29 29 29 30 29 27 26 26 26 26 26 27 27 27 27 26 27 28 29 30 29 29 29 30 30 30 30 29 29 29 29 29 29 29
4128 29 29 28 28 28 28 27 27 28 29 29 29 28 27 26 25 25 26 27 28 27 26 25 24 25 26 27 28 27 27 27 26 26 25 24 22 21 21 22 24 26 27 27 27 26 26 25 25 25 26 26 26 26 26 26 26 26 26 27 27 27 28 28 28 27 26 25 24 23 24 24
4121 24 23 23 22 22 24 25 26 25 25 25 26 26 26 26 26 26 26 27 27 27 28 28 28 27 26 24 23 23 23 24 24 25 26 27 27 26 25 25 26 26 26 25 26 26 27 28 28 27 26 25 25 25 25 24 25 25 25 25 25 25 24 25 26 27 28 28 27 27 27 27
4115 27 27 27 27 26 26 25 25 25 25 25 25 26 27 28 28 27 26 26 26 26 26 26 27 26 26 26 26 26 27 29 29 28 29 29 29 28 28 28 27 26 25 25 24 24 25 26 26 26 26 25 25 26 26 27 28 28 28 29 29 29 28 28 27 27 27 26 26 26 26 25
4108 25 25 25 25 24 23 24 26 28 28 28 27 26 24 24 24 25 26 26 26 27 27 27 26 26 26 26 27 27 27 26 25 23 22 22 22 22 22 21 21 21 23 24 25 26 26 26 26 25 24 24 24 23 22 23 24 25 26 25 25 25 24 25 25 25 26 26 26 26 26 26
4102 26 25 25 25 25 25 24 23 23 23 24 24 25 26 25 24 23 23 24 25 26 25 24 23 22 22 22 23 23 23 23 24 24 25 26 26 26 25 24 23 24 25 26 26 27 27 28 27 26 25 26 26 25 25 24 25 25 26 27 28 27 26 25 24 24 24 24 24 23 22 22
4095 22 23 24 25 24 23 22 22 21 21 21 22 22 23 23 24 26 26 26 25 24 23 23 22 21 21 21 22 23 23 23 23 23 23 23 23 24 25 26 26 25 24 24 24 24 24 24 25 26 26 25 25 24 24 24 24 23 23 23 24 24 24 24 24 23 23 25 26 26 25 23
4089 23 23 24 24 23 23 23 24 25 27 27 26 26 25 24 23 23 23 23 22 22 22 22 22 22 22 22 22 22 21 21 20 20 20 19 19 20 20 21 22 22 22 24 25 25 26 25 24 23 22 22 22 22 22 22 21 21 21 21 22 22 23 23 23 23 23 23 23 23 23 23
4083 23 23 24 25 25 26 26 25 25 25 24 22 21 20 21 21 22 22 22 21 21 20 21 21 22 22 22 21 22 22 23 24 23 22 22 22 23 24 25 24 23 22 22 23 22 22 21 20 20 21 20 19 18 17 17 18 18 19 19 19 19 19 21 22 22 22 22 22 22 21 21
4076 21 21 21 21 20 20 19 19 19 19 19 19 19 20 21 21 21 21 21 21 21 21 21 21 21 21 22 22 22 22 21 20 19 18 19 22 24 26 26 26 26 25 25 24 25 25 24 23 22 21 21 22 22 23 24 24 23 20 18 18 20 21 21 21 20 20 20 20 21 22 23
4070 23 23 23 22 21 20 21 22 22 23 22 22 21 20 21 22 22 23 23 23 23 23 23 22 22 22 21 19 19 18 18 19 20 21 22 23 23 22 22 22 22 22 22 22 21 20 20 19 20 21 21 21 21 21 20 20 21 21 21 20 21 22 23 24 24 23 22 22 22 23 22
4063 22 21 21 21 21 21 21 20 21 21 22 22 22 22 21 21 20 20 20 21 21 22 23 23 23 23 22 21 20 19 19 20 20 21 22 23 22 20 19 19 20 21 21 21 20 20 20 20 20 20 21 21 21 21 20 20 19 19 19 19 20 20 18 17 16 17 18 18 19 19 19
4057 19 18 18 17 19 20 21 23 22 21 20 20 21 23 22 21 20 20 19 19 18 17 16 16 16 17 18 18 19 20 20 20 19 19 19 19 19 19 19 19 19 19 19 20 21 23 23 22 21 20 20 19 18 17 18 19 18 17 17 18 19 20 20 21 23 23 23 22 21 20 21
4051 21 21 22 23 22 22 22 23 23 23 23 22 22 22 21 19 19 18 19 20 19 19 19 18 17 16 18 19 21 22 22 22 21 21 21 21 21 21 21 21 21 21 21 21 21 21 21 21 21 20 19 18 19 19 19 20 19 19 19 19 18 18 19 20 21 20 19 18 18 19 19
4044 19 20 19 19 18 18 19 21 22 21 19 18 18 19 20 21 21 21 20 20 20 19 19 19 18 18 18 18 19 19 19 20 20 20 20 21 21 19 18 18 18 19 19 19 19 19 18 18 18 19 20 20 21 21 21 21 21 20 20 20 20 20 20 21 21 21 22 22 22 22 22
4038 22 21 20 19 20 20 19 18 18 18 18 18 18 19 19 19 19 20 20 20 20 20 20 19 18 18 19 19 19 19 18 18 17 18 19 20 20 20 21 22 22 21 20 19 19 19 19 19 18 18 17 17 16 15 14 13 14 16 18 19 19 20 20 20 20 21 21 21 21 20 19
4031 19 19 19 19 19 19 19 19 20 20 20 20 20 20 20 20 20 19 19 19 19 19 19 20 20 20 21 22 22 21 20 20 22 22 22 21 21 20 20 20 20 20 19 18 19 21 21 21 21 21 21 21 20 20 21 22 21 20 19 18 18 18 18 19 18 18 18 18 18 19 19
4025 19 19 19 18 19 19 20 20 21 21 21 21 21 20 19 18 18 18 18 19 19 19 20 20 19 19 18 17 17 16 16 15 16 17 18 19 19 19 19 19 19 18 18 18 18 18 17 17 16 16 17 18 18 17 16 17 18 18 17 16 16 15 17 19 21 21 20 20 20 20 20
4018 20 20 20 19 19 19 19 20 20 20 20 19 19 18 18 18 18 19 18 18 18 19 20 21 21 20 18 17 17 17 17 17 18 18 18 18 18 18 18 18 18 19 18 18 17 16 16 16 16 17 17 18 18 19 20 21 21 20 19 19 19 20 20 20 20 20 19 20 21 20 19
4012 19 17 18 18 18 18 19 19 18 18 18 19 19 19 20 20 20 21 21 22 20 19 19 18 18 18 18 18 18 18 19 19 20 20 20 20 20 20 18 17 16 15 16 16 17 17 17 17 17 17 16 16 17 18 19 20 21 20 20 20 21 21 20 19 20 20 21 21 22 22 21
4006 21 21 20 20 20 21 21 21 21 21 21 21 21 21 21 20 18 17 17 17 17 17 18 18 19 20 21 21 20 20 20 20 20 19 20 19 18 17 17 18 19 19 19 18 17 18 18 20 21 22 20 19 19 20 20 20 19 20 21 21 20 20 20 21 21 21 21 20 20 21 22
3999 22 22 20 19 18 18 17 17 17 18 19 19 19 20 19 19 19 19 19 19 18 19 19 19 19 19 20 20 20 20 20 20 21 21 21 21 21 21 20 20 19 20 20 21 21 20 20 20 19 18 18 18 19 20 20 19 18 18 19 20 21 21 21 21 20 19 18 17 16 17 18
3993 18 18 19 19 18 17 16 17 18 18 17 17 18 18 19 20 20 21 21 20 19 19 19 20 20 21 21 20 18 17 15 16 17 18 18 18 18 18 19 19 18 17 17 18 19 19 18 19 19 20 19 17 16 16 17 18 18 19 19 19 20 21 22 22 21 20 19 18 18 19 20
3986 20 20 20 20 20 21 20 21 22 23 23 23 22 21 20 18 17 17 17 17 17 17 18 18 18 18 18 18 17 16 16 17 18 20 21 22 21 21 19 18 18 19 18 17 16 15 16 17 17 18 18 19 19 19 20 21 20 19 19 18 19 19 18 18 19 20 21 21 21 21 21
3980 21 21 21 21 21 20 20 20 20 21 20 20 19 18 18 18 19 19 18 18 18 19 20 21 20 20 20 20 19 18 18 19 19 19 19 19 19 19 19 19 19 20 20 21 20 20 20 20 19 19 19 19 19 18 19 19 18 17 18 18 18 18 18 17 18 19 20 21 20 19 18
3974 18 17 17 17 17 16 16 15 15 17 19 19 19 18 17 16 16 16 17 17 17 18 19 19 20 20 20 21 21 21 21 21 21 21 21 21 20 20 19 19 19 19 19 19 19 19 19 19 19 20 20 20 20 20 20 20 21 21 21 22 21 21 21 21 20 20 19 19 19 18 18
3967 18 18 18 18 17 16 15 16 18 18 19 19 19 19 18 17 16 15 15 16 17 19 19 19 19 19 20 19 19 19 19 19 19 19 19 19 19 19 19 19 19 19 18 18 17 16 17 17 18 18 18 19 19 19 19 19 18 19 19 19 19 20 20 19 19 19 20 20 19 18 18
3961 18 17 17 17 17 17 17 16 15 15 15 15 16 16 17 19 19 18 17 17 18 19 19 19 19 18 17 15 14 13 14 15 17 19 19 19 19 19 19 19 19 19 18 18 17 17 17 16 17 18 19 20 20 21 21 22 20 19 18 16 16 17 17 17 17 18 18 19 20 21 22
3954 22 23 23 23 22 22 21 19 18 18 20 21 21 22 22 22 21 21 21 21 21 20 20 19 19 18 18 19 19 19 19 19 20 22 22 21 20 19 19 19 19 20 19 19 18 18 19 19 19 19 20 20 19 19 18 18 18 18 18 18 19 19 19 19 20 20 21 22 22 21 20
3948 20 19 19 20 20 20 21 21 21 21 21 20 20 20 19 19 19 18 19 19 19 18 18 18 17 17 17 17 18 19 21 22 22 21 21 20 18 18 18 19 20 19 18 17 18 20 21 21 21 20 21 21 21 20 20 19 19 19 19 18 18 19 19 20 20 19 19 19 19 19 19
3941 19 18 18 17 17 18 19 19 19 19 18 16 16 16 17 18 18 17 17 17 17 19 20 21 21 21 20 20 19 18 19 20 20 19 18 18 19 18 17 16 16 16 17 18 18 17 17 17 17 18 18 18 18 19 19 20 21 21 20 18 18 18 18 19 20 21 20 20 19 18 18
3935 18 17 18 19 19 19 19 19 19 19 20 20 20 19 19 18 18 17 17 16 17 18 18 19 20 20 21 21 21 19 17 17 16 17 17 17 17 18 20 21 21 21 19 18 18 18 19 19 19 18 17 17 17 17 17 17 17 18 18 18 19 19 19 19 20 20 21 22 21 21 21
3929 21 20 20 20 20 19 19 19 18 18 18 19 19 19 19 19 18 18 18 18 19 19 19 19 18 19 20 22 22 20 20 19 19 18 18 18 18 17 16 16 16 16 17 18 17 17 17 18 18 18 18 17 17 17 18 18 19 19 19 18 18 17 18 18 18 18 18 18 19 19 18
3922 18 17 17 16 17 18 18 19 19 19 19 19 19 20 21 21 21 21 21 21 21 20 19 19 18 18 18 18 18 19 20 19 18 18 19 20 20 21 21 21 21 21 21 21 21 21 20 20 21 21 22 22 22 21 21 21 21 20 20 20 20 21 21 21 21 20 20 19 18 17 17
3916 17 17 18 19 21 22 22 21 20 19 18 18 18 18 18 18 18 17 18 18 18 18 18 18 19 19 19 18 18 18 18 18 18 18 17 16 15 14 14 15 17 19 18 18 18 18 17 17 17 18 19 20 20 19 18 18 18 18 18 19 18 18 17 17 17 17 17 17 17 17 17
3909 17 18 18 18 18 18 18 17 17 17 16 16 17 18 19 19 19 20 18 17 16 16 16 16 16 16 17 18 19 19 19 18 19 19 19 19 20 20 19 18 19 19 18 17 17 17 17 18 18 19 19 19 19 19 19 19 19 19 19 20 19 19 19 19 20 21 22 23 23 22 22
3903 22 21 21 21 21 20 20 20 19 19 18 18 19 20 20 20 21 21 21 20 20 20 20 20 20 20 20 21 21 21 22 22 22 22 22 21 19 18 17 18 18 18 18 19 19 19 19 19 19 19 18 17 17 17 18 18 18 19 19 19 19 19 19 19 19 19 19 20 20 19 19
3896 19 18 18 17 16 16 18 19 20 20 19 18 17 17 17 18 18 18 18 18 18 17 17 17 17 18 18 18 19 19 18 18 17 18 19 19 18 17 17 18 20 21 21 20 19 18 18 18 19 19 20 21 20 20 20 20 20 20 21 21 20 20 20 20 21 21 21 20 19 20 20
3890 20 21 20 19 19 19 20 21 20 19 20 20 20 21 20 19 18 18 17 17 18 20 21 20 19 18 18 17 16 16 16 17 17 16 16 16 17 19 20 20 20 19 19 18 18 18 18 18 18 18 18 19 19 19 20 20 20 19 19 19 19 19 19 19 19 19 19 18 17 17 17
3884 17 18 17 17 17 17 18 18 18 17 18 18 18 18 18 18 19 19 20 21 20 19 19 18 17 16 17 17 17 17 17 17 18 18 18 18 18 19 20 20 20 20 19 19 19 19 18 18 18 18 18 18 18 18 17 17 17 17 17 18 18 17 16 16 16 17 17 17 17 17 18
3877 18 18 18 18 18 18 19 20 19 18 19 20 21 21 21 20 20 20 19 19 18 18 18 17 17 17 17 18 19 19 19 19 19 19 19 19 20 20 20 19 18 18 18 19 19 19 20 21 22 22 21 20 19 19 19 21 22 23 22 22 22 21 20 19 20 20 21 21 21 21 20
3871 20 19 19 18 19 19 18 18 18 18 18 19 19 20 20 19 20 21 21 19 17 17 18 19 19 19 20 20 20 20 20 20 21 22 24 23 22 21 20 21 22 23 23 22 21 21 21 21 20 19 19 19 20 20 21 21 19 17 15 15 15 16 16 16 16 16 16 16 17 18 19
3864 19 18 18 18 19 19 19 20 20 20 20 19 19 18 18 17 17 16 16 17 17 17 18 18 18 19 19 18 17 17 17 17 18 18 19 20 20 19 19 19 18 18 18 19 19 19 19 19 18 18 18 18 18 18 18 18 19 19 19 19 20 19 19 18 17 17 17 17 17 18 19
3858 19 20 21 22 23 22 23 23 22 22 21 20 21 21 22 22 22 21 19 17 16 16 15 15 15 15 16 16 16 17 18 18 17 17 17 16 17 17 17 16 15 16 17 18 18 19 19 19 19 20 19 18 17 16 16 15 16 17 18 19 19 19 19 19 20 20 21 21 20 19 18
3852 18 18 18 18 19 19 20 20 20 20 20 19 18 18 17 16 16 16 17 17 17 17 17 18 19 19 19 17 16 15 16 16 16 16 17 17 16 15 16 17 18 18 20 20 20 20 19 19 18 18 18 17 17 15 14 14 15 17 17 17 17 16 16 16 17 19 20 21 21 20 19
3845 19 18 18 18 17 17 17 17 18 18 18 19 19 19 19 19 19 18 18 17 17 16 16 15 15 16 16 16 17 17 17 17 18 18 18 18 17 16 17 17 18 18 18 18 18 18 18 18 18 18 18 18 19 20 19 19 18 18 18 18 18 19 20 20 19 18 17 17 19 20 21
3839 21 21 21 20 20 19 20 20 20 21 21 21 21 21 20 19 17 16 17 17 18 19 18 18 18 18 18 19 18 16 16 16 17 18 18 18 18 18 18 18 18 18 18 18 18 17 18 18 18 18 18 18 18 17 17 17 17 17 17 18 19 20 19 19 18 18 18 18 18 17 17
3832 17 17 18 19 19 19 19 18 18 18 19 19 18 17 16 17 18 18 18 19 19 18 18 18 19 20 19 19 19 19 18 17 17 17 17 18 18 18 19 19 18 17 18 18 19 20 19 19 19 18 19 19 20 20 21 21 21 20 20 20 19 19 19 18 18 18 18 18 19 20 20
3826 20 20 19 18 19 19 19 19 19 19 19 18 18 17 17 18 18 18 18 19 19 19 19 19 19 19 19 19 19 19 19 19 19 19 18 17 18 18 20 22 21 21 21 20 20 20 20 19 19 18 18 17 16 15 15 16 17 18 18 17 18 19 20 21 20 19 19 18 19 19 20
3819 20 20 20 19 18 17 17 16 17 19 19 19 19 18 18 19 20 19 17 15 15 15 15 16 16 17 17 17 18 18 19 19 20 20 20 20 20 20 20 19 19 18 17 17 18 19 18 18 19 20 21 22 21 21 20 19 19 18 18 19 19 20 20 20 19 19 19 20 20 18 17
3813 17 16 17 18 17 17 17 17 18 18 18 19 19 18 17 16 16 17 17 18 19 19 20 19 19 19 21 21 21 20 19 18 17 16 17 18 18 17 18 20 22 22 21 20 19 18 18 19 20 21 21 21 21 20 18 17 17 18 18 19 20 20 20 19 18 18 18 18 19 19 19
3807 19 19 19 18 18 17 16 16 17 17 18 18 18 18 17 17 17 18 18 18 18 19 19 19 19 20 20 20 19 19 19 18 18 18 18 18 18 18 17 17 17 17 17 18 18 19 20 20 20 20 20 20 20 20 20 19 18 19 19 19 20 21 21 20 19 18 18 17 17 18 18
3800 18 18 17 16 16 17 18 18 18 18 19 20 20 20 20 20 20 20 19 19 19 19 19 18 18 17 17 17 17 17 18 19 20 21 21 21 20 19 17 16 17 17 17 18 18 18 17 17 17 17 17 17 17 17 17 17 17 17 17 18 19 19 18 18 19 20 19 18 17 17 18
3794 18 18 18 17 17 18 19 19 19 19 19 19 19 18 18 18 19 20 19 19 18 18 18 19 20 21 20 20 20 19 19 19 19 19 20 20 20 20 19 19 18 18 17 16 16 17 16 15 14 15 16 18 19 20 19 17 16 17 18 18 17 16 17 17 17 18 17 17 16 16 16
3787 16 16 16 17 17 18 18 19 19 18 17 17 17 18 18 18 19 19 19 19 20 20 20 20 20 20 19 18 18 17 17 17 18 18 19 20 19 17 16 17 19 20 21 22 22 21 20 19 17 16 17 18 19 19 19 18 18 17 17 17 17 18 18 19 19 18 18 17 18 18 18
3781 18 17 18 18 18 19 20 20 20 20 20 21 20 20 20 19 19 19 19 18 18 19 21 22 22 21 21 21 21 20 20 20 19 18 18 18 19 19 20 22 23 22 21 20 19 18 18 17 17 18 19 20 22 22 21 18 17 16 17 19 20 21 20 18 16 15 15 15 14 14 15
3775 15 16 17 17 17 17 17 17 17 17 17 16 16 16 17 18 19 20 19 19 18 18 17 17 18 19 18 17 18 19 19 19 19 19 20 20 20 20 18 17 18 18 18 18 17 17 17 17 16 16 16 16 16 16 16 16 15 16 16 17 18 18 17 16 15 15 15 15 16 16 16
3768 16 16 17 18 18 18 18 18 19 18 18 19 19 18 18 18 19 21 21 21 21 20 19 19 19 19 19 19 18 17 16 16 16 17 17 18 18 18 18 18 18 18 19 19 19 19 19 19 19 18 18 18 17 17 16 16 17 18 19 19 18 18 19 18 18 19 19 19 19 19 19
3762 19 18 18 17 17 17 16 17 18 20 20 20 20 20 20 19 19 18 18 17 17 17 17 18 19 19 19 20 20 20 19 19 18 17 17 18 18 18 18 19 19 20 20 19 19 18 18 17 17 16 17 17 17 17 18 19 18 18 19 19 18 17 17 18 19 19 19 19 20 21 22
3755 22 22 22 21 20 19 19 18 18 19 19 19 19 18 18 17 17 18 19 20 19 18 17 16 16 15 15 16 16 16 18 19 19 17 17 19 20 20 20 19 19 19 18 17 17 16 17 17 17 16 16 15 16 16 16 17 19 20 20 20 19 19 19 20 20 20 20 19 18 17 18
3749 18 19 19 19 19 19 19 19 19 18 18 18 18 18 18 18 18 18 19 19 18 18 19 20 19 19 19 18 18 18 17 16 15 13 14 15 16 17 17 17 18 18 18 18 18 18 17 17 18 19 19 20 20 19 20 20 21 22 22 21 19 19 20 20 20 21 22 22 22 21 21
3742 21 21 21 21 21 20 20 20 19 19 19 19 18 18 18 18 18 19 19 19 19 19 19 19 20 20 19 19 19 19 20 21 22 22 21 20 19 19 20 21 20 18 18 19 19 19 19 19 18 18 17 16 17 17 18 18 18 19 19 18 18 18 18 18 19 19 20 20 19 18 17
3736 17 17 17 17 18 18 18 17 16 15 15 14 14 14 14 15 16 17 18 18 18 17 17 17 16 16 16 15 15 15 15 14 14 14 16 17 16 16 16 16 16 17 17 17 17 17 17 17 17 17 16 16 16 16 16 16 15 15 15 15 16 16 17 18 18 18 17 15 14 14 15
3730 15 16 17 16 16 17 18 18 17 17 16 16 15 14 15 15 16 16 16 17 17 18 18 19 19 19 19 20 20 21 21 20 20 19 20 20 20 19 19 18 18 18 17 16 15 14 14 15 15 15 16 16 16 16 17 17 17 18 18 19 19 18 19 19 19 18 18 18 18 17 17
3723 17 16 16 16 15 15 15 16 17 17 17 17 16 16 16 16 16 16 15 15 16 18 19 21 21 20 20 19 18 17 17 19 21 22 23 22 22 21 20 19 18 17 17 17 17 17 17 17 16 16 17 18 18 18 17 18 18 19 18 17 17 17 17 16 16 15 15 15 15 15 15
3717 15 15 16 17 18 19 19 20 20 20 20 20 20 20 20 20 20 20 20 20 19 18 18 17 16 16 16 18 19 19 19 18 18 19 20 20 20 20 20 20 20 20 20 19 19 19 19 19 19 18 18 19 19 19 18 17 16 16 16 17 17 17 17 16 16 15 15 15 15 16 17
3710 17 17 18 19 19 20 20 19 17 17 17 16 16 16 16 16 16 17 17 17 17 17 17 17 17 17 17 18 18 19 18 17 17 16 16 17 18 18 18 18 18 18 19 19 20 20 19 18 18 17 16 16 16 16 16 16 16 15 16 16 16 16 16 16 16 16 16 16 16 16 15
3704 15 15 15 14 15 16 17 18 18 18 18 18 18 18 17 17 17 16 15 15 15 16 17 17 18 17 18 18 18 18 19 20 21 21 19 18 17 17 18 18 19 19 19 20 19 18 18 17 18 18 18 18 18 18 17 18 18 18 19 19 20 20 20 19 19 18 19 19 19 18 18
3697 18 18 18 19 20 20 20 19 17 17 18 18 18 17 17 16 15 15 15 16 16 17 16 16 15 15 15 16 17 18 17 17 16 16 17 18 18 19 20 21 20 19 19 18 19 19 20 20 19 18 18 17 16 16 16 16 16 16 16 16 17 17 17 18 18 18 18 19 20 20 19
3691 19 18 19 19 20 20 20 19 19 19 18 18 18 18 18 18 17 17 17 18 19 18 18 18 18 19 19 19 18 17 17 17 18 19 18 18 17 17 17 16 18 19 19 17 16 16 17 18 18 18 17 16 15 14 14 15 16 17 18 19 19 20 21 22 22 23 22 21 20 19 18
3685 18 17 16 15 14 13 13 15 17 17 17 17 17 17 16 16 16 16 16 16 17 17 17 18 18 19 18 18 17 16 16 16 16 16 16 17 18 18 18 17 18 19 20 20 20 19 18 17 17 16 16 17 17 18 18 18 19 19 20 21 21 21 20 20 19 19 18 17 18 18 19
3678 19 19 18 18 18 18 18 17 17 17 17 17 16 15 15 16 17 18 17 17 17 18 19 19 19 19 19 19 18 17 17 16 15 16 17 19 21 21 20 20 20 19 19 19 20 21 22 21 20 19 19 19 18 17 17 18 18 19 20 21 21 20 19 19 18 17 16 15 16 17 17
3672 17 18 18 18 18 19 18 18 17 17 16 16 16 17 18 18 18 17 16 16 17 18 18 17 17 17 16 15 15 16 17 17 17 17 17 17 17 17 17 17 17 16 16 16 16 16 16 16 15 15 17 19 21 22 22 20 18 17 17 18 19 19 20 19 19 19 19 19 19 19 20
3665 20 19 18 17 17 18 18 18 18 19 19 19 19 18 18 17 17 17 17 17 17 17 18 18 17 17 16 17 18 18 19 19 19 18 18 17 17 18 18 19 20 20 19 19 18 17 17 16 16 17 18 18 17 17 17 19 19 19 18 19 20 20 21 20 20 19 19 18 19 19 17
3659 17 16 16 17 18 18 18 17 18 19 20 20 20 20 19 20 21 20 19 18 17 16 15 14 13 14 15 16 16 15 15 17 18 18 18 18 18 18 17 17 17 18 19 19 19 18 18 18 17 17 17 17 18 18 18 18 18 18 18 17 16 16 17 17 17 16 15 16 16 16 16
3653 16 16 16 16 15 15 14 15 16 17 18 18 18 18 19 19 19 19 19 19 18 18 16 15 14 14 15 15 15 14 15 16 16 17 17 17 16 15 15 15 16 18 19 19 18 18 17 17 17 17 18 19 18 17 16 16 17 17 17 18 18 19 19 19 19 18 16 15 16 16 17
3646 17 17 17 16 16 16 16 16 16 17 17 16 16 16 16 18 18 19 19 19 19 18 18 18 18 18 18 18 18 18 17 16 16 16 17 17 17 18 17 17 17 17 17 16 16 16 17 17 18 18 18 18 18 18 18 18 18 18 18 17 17 17 17 17 17 16 17 17 18 17 17
3640 17 17 18 18 18 17 17 18 18 18 18 18 18 18 19 19 19 18 18 18 18 19 19 20 20 20 19 19 19 19 19 19 19 18 17 17 17 17 17 17 18 19 21 22 21 20 19 19 19 19 20 20 20 20 20 19 18 18 18 19 19 19 19 19 18 18 18 19 20 19 18
3633 18 18 19 19 19 18 18 18 17 17 17 17 17 16 15 15 16 17 18 20 20 19 18 18 19 20 20 21 21 19 17 16 16 16 16 16 17 17 17 17 17 17 17 17 17 17 16 16 17 18 18 17 15 15 16 16 17 18 18 18 17 17 17 16 17 17 18 19 19 19 18
3627 18 17 17 16 16 16 16 15 15 16 17 17 17 18 18 18 19 19 20 20 20 19 19 18 18 18 17 17 17 18 18 18 18 18 17 17 18 19 19 20 20 20 20 20 20 20 20 20 21 22 23 23 21 20 18 17 16 15 16 16 17 18 19 18 18 18 17 17 17 18 19
3620 19 19 17 16 16 16 16 16 16 16 17 17 18 19 19 17 16 15 16 16 17 18 18 18 18 17 17 17 17 17 18 19 19 20 20 20 20 20 19 19 18 18 18 19 19 19 19 18 18 17 17 17 17 17 17 18 18 19 18 18 17 16 16 16 15 15 15 15 15 15 15
3614 15 14 14 13 14 16 17 18 18 19 19 19 19 20 20 20 20 19 18 18 18 18 18 18 18 17 17 17 16 16 16 17 19 20 20 20 20 19 19 18 18 18 19 19 18 17 16 16 17 18 19 19 19 18 17 16 15 14 15 16 17 18 18 18 17 16 17 17 19 20 21
3608 21 21 20 17 16 15 15 16 17 17 17 17 16 16 16 16 16 16 17 17 18 18 18 18 18 18 17 16 16 17 19 19 19 18 18 18 17 17 17 17 18 18 18 17 17 17 17 18 18 19 19 20 19 18 17 16 17 17 19 21 22 22 21 20 19 18 17 17 17 18 18
3601 18 17 16 15 14 14 15 16 17 18 18 18 18 18 18 18 18 18 19 20 21 21 20 19 18 16 16 15 15 15 16 17 18 18 18 18 18 18 17 16 16 17 18 18 18 18 18 18 18 18 17 17 17 17 17 17 17 17 17 17 17 18 18 18 19 19 20 20 20 19 18
3595 18 18 18 18 18 17 17 17 16 16 16 16 16 16 17 18 19 19 19 18 17 16 16 16 16 16 17 17 18 18 18 18 19 19 19 20 20 20 20 20 20 20 19 18 18 17 16 16 15 15 14 14 14 13 14 15 17 19 20 20 19 18 16 15 15 15 15 15 15 15 15
3588 15 14 14 14 14 15 15 15 15 15 16 17 18 18 17 16 16 17 17 17 17 17 17 16 15 14 14 15 16 17 19 19 19 19 18 18 17 17 16 15 16 17 17 18 18 18 18 18 18 17 16 15 13 13 14 16 17 17 18 18 17 17 16 16 16 16 17 18 18 17 19
3582 19 20 19 19 19 18 19 19 19 20 19 19 19 18 18 18 17 17 17 18 19 21 22 21 20 19 19 19 19 19 18 18 18 18 17 16 15 15 15 16 17 19 18 18 18 17 17 18 16 15 15 15 15 16 16 16 18 19 19 19 17 16 16 16 16 16 16 16 17 18 19
3576 19 20 20 20 19 18 17 16 17 17 17 18 18 19 19 19 19 19 18 18 18 19 20 22 22 21 19 17 16 15 15 16 17 18 19 19 20 20 20 20 19 19 18 18 17 16 16 17 18 18 18 17 17 17 16 16 16 16 16 16 16 15 16 17 18 17 17 18 18 19 20
3569 20 20 20 19 19 19 18 18 18 17 17 16 17 18 19 20 19 19 19 19 19 19 18 18 18 17 17 17 17 17 17 17 18 18 17 17 16 15 15 15 15 16 17 19 19 18 18 19 19 19 18 16 17 17 17 17 17 18 18 18 18 18 18 17 18 20 20 20 19 20 20
3563 20 19 19 19 19 19 18 17 17 17 17 16 17 18 19 19 20 20 20 19 18 17 17 17 17 17 18 18 18 19 19 19 19 18 18 18 18 18 18 18 18 19 19 19 19 19 19 19 19 19 19 19 19 19 19 19 19 17 16 15 15 16 18 19 20 20 19 18 17 17 17
3556 17 17 16 17 17 17 17 17 18 18 17 16 15 14 14 14 14 14 14 15 15 16 15 15 14 13 13 13 12 12 13 14 16 17 17 18 18 19 19 19 18 17 16 16 17 17 17 17 17 16 15 15 16 17 18 19 20 21 20 19 18 17 17 18 19 20 19 19 19 19 18
3550 18 18 17 17 17 18 19 19 20 20 21 21 21 20 20 19 19 19 19 19 19 19 20 21 20 20 20 21 22 22 21 20 19 18 18 19 19 18 17 17 17 17 17 16 17 18 18 19 19 19 20 20 20 19 19 18 17 16 16 16 17 17 16 16 16 17 17 17 18 18 19
3543 19 19 19 19 19 19 19 18 18 18 17 17 16 16 16 17 17 17 18 17 17 17 17 17 17 17 17 18 18 18 19 19 20 20 20 19 18 17 17 17 17 17 16 16 17 18 19 19 18 17 17 16 16 16 16 16 17 17 18 19 20 19 19 18 18 18 18 18 17 16 16
3537 16 16 15 15 16 16 17 17 17 17 16 15 15 15 16 16 18 19 19 18 18 17 17 17 17 17 17 17 18 18 18 18 18 18 18 19 20 21 20 19 18 18 18 18 18 17 17 17 17 17 17 18 18 19 19 20 19 18 17 16 17 17 17 18 18 18 19 19 19 19 19
3531 19 18 16 16 15 16 16 16 16 16 15 16 16 16 16 16 17 18 18 18 17 17 17 17 17 18 18 18 18 18 18 17 17 16 16 17 17 17 18 18 19 19 20 20 21 21 21 21 20 20 19 18 17 17 17 18 18 19 18 18 18 18 18 19 19 20 21 21 21 19 19
3524 19 19 19 19 19 19 19 19 19 19 18 18 18 17 17 18 20 21 21 21 20 20 19 19 18 17 17 16 16 17 18 18 18 18 17 17 17 17 17 18 19 20 19 17 17 17 18 19 20 21 21 21 21 21 21 21 20 20 20 19 19 19 19 18 18 18 19 19 19 19 19
3518 19 19 19 18 17 17 16 15 14 15 16 17 18 18 18 18 19 20 21 21 21 21 21 21 20 20 20 20 20 20 21 20 20 18 17 16 17 18 18 18 18 19 20 21 20 20 19 18 17 16 16 16 16 17 18 19 20 21 21 20 20 20 19 19 19 18 19 20 19 18 18
3511 18 19 19 19 19 19 19 19 18 18 18 18 17 17 17 17 17 17 17 17 17 17 16 15 15 17 17 16 15 15 16 16 17 17 17 18 18 18 18 19 18 18 18 17 18 18 18 19 19 19 20 20 20 20 21 21 20 19 20 21 21 22 21 20 19 17 17 17 18 19 17
3505 17 16 16 16 16 17 18 20 21 21 21 22 22 22 20 18 18 17 18 18 19 19 19 18 18 17 16 15 15 15 16 17 17 17 18 19 20 20 21 21 22 22 22 21 21 20 20 20 20 20 20 20 20 20 19 17 18 19 20 21 20 20 19 18 16 16 18 19 19 18 17
3499 17 16 16 17 17 18 17 17 17 18 18 18 19 19 19 19 19 18 17 17 17 18 18 19 19 20 20 21 21 20 19 18 19 19 19 20 20 20 20 21 22 22 21 20 19 19 19 18 18 18 18 17 18 17 17 17 18 18 17 17 16 17 17 16 17 17 17 17 18 18 19
3492 19 19 19 19 18 18 18 18 18 19 20 21 21 20 21 21 21 20 19 19 19 17 16 15 15 15 15 15 14 15 16 17 17 16 15 15 16 18 19 19 20 20 20 20 19 18 18 19 19 20 20 18 17 17 17 17 18 18 18 17 17 16 16 16 16 16 17 18 19 19 19
3486 19 18 18 18 19 21 21 20 20 20 20 21 21 21 20 20 19 18 18 18 19 20 21 22 21 20 20 19 19 18 18 17 18 18 19 19 19 18 18 17 17 17 16 16 17 18 18 19 19 19 19 18 18 18 18 19 18 17 16 15 15 15 15 15 16 16 17 17 17 17 18
3479 18 18 17 16 16 15 14 14 15 16 17 19 19 19 17 15 14 13 13 14 15 16 16 16 16 16 16 17 18 19 18 18 17 17 18 19 21 21 21 21 20 20 20 20 19 19 19 20 20 20 20 20 20 20 20 20 20 20 21 22 21 20 20 20 19 19 19 18 18 17 17
3473 17 16 17 18 19 19 20 20 19 18 17 17 16 16 16 17 17 18 18 17 16 15 15 15 15 16 16 17 17 18 18 19 19 19 19 19 20 19 19 20 19 19 18 18 18 18 18 18 18 17 17 16 16 16 15 15 16 17 19 20 21 21 21 21 20 18 18 19 19 19 19
3466 19 18 18 18 18 18 17 16 16 16 15 15 16 17 18 16 15 15 15 15 15 15 16 16 16 16 17 17 17 17 18 20 20 20 19 19 18 18 18 18 18 18 18 19 20 20 19 17 17 17 18 18 19 20 20 19 19 19 19 18 18 18 17 17 16 16 17 19 18 18 18
3460 18 18 17 17 17 17 17 16 16 15 15 15 15 16 17 18 19 20 21 22 21 21 21 20 20 20 20 20 19 19 19 18 17 16 15 14 14 15 16 18 19 20 21 22 22 21 20 20 19 19 19 19 20 20 20 20 20 20 19 20 20 21 21 20 19 19 18 18 17 17 17
3454 17 18 19 19 19 19 20 20 20 20 20 19 17 15 15 16 16 16 16 16 17 17 17 17 17 17 18 19 20 20 20 19 19 18 17 17 18 18 19 19 18 19 20 20 20 19 19 18 17 16 16 16 16 15 15 16 16 16 16 17 17 17 17 18 18 19 20 21 21 20 19
3447 19 18 19 19 19 18 18 18 17 16 16 17 17 16 16 16 16 17 17 17 18 19 19 20 20 19 19 18 18 18 17 17 17 17 16 17 17 17 18 18 18 18 18 18 18 18 17 17 18 18 19 20 19 19 19 18 18 17 16 15 15 15 15 14 15 15 16 16 16 17 17
3441 17 17 18 19 20 21 20 18 17 16 16 17 17 17 18 19 19 20 20 20 20 20 20 20 20 20 20 21 20 19 18 17 16 15 15 16 16 16 17 18 19 20 19 19 18 18 18 19 17 16 15 14 15 16 17 18 19 20 19 18 18 17 17 17 16 16 17 17 17 17 17
3434 17 18 18 18 19 20 19 18 18 17 17 17 17 18 18 19 19 19 19 19 19 19 19 19 19 19 20 20 20 20 20 20 20 19 19 19 18 17 16 16 16 16 17 17 18 19 21 23 23 22 20 18 17 16 16 16 16 16 16 16 16 16 16 16 16 18 19 20 19 18 17
3428 17 17 17 17 18 18 18 17 17 17 16 16 16 16 16 16 16 17 17 17 17 17 17 16 16 16 16 17 18 19 19 20 19 18 17 17 17 17 17 17 17 18 18 18 18 18 19 19 19 19 20 20 21 21 20 20 19 19 18 18 18 17 17 17 17 18 17 16 15 15 16
3421 16 16 17 17 17 17 18 19 20 20 20 19 18 18 18 19 19 19 19 18 18 18 18 18 18 18 17 17 17 16 16 16 16 16 16 16 17 17 17 17 18 19 19 17 16 17 17 17 17 17 18 19 20 20 20 21 21 20 20 20 19 18 18 17 18 18 17 16 15 15 15
3415 15 16 15 15 15 16 17 18 19 20 19 18 18 17 17 17 19 20 20 21 21 21 22 21 20 19 18 18 17 17 17 17 17 18 17 17 17 17 17 18 18 17 17 18 18 19 20 21 21 21 21 20 19 17 17 17 17 18 18 17 16 15 15 14 15 16 17 18 18 18 18
3409 18 18 19 19 19 18 17 17 18 19 21 22 22 21 21 20 21 22 21 20 19 18 18 19 19 19 18 18 17 18 19 19 19 18 18 17 17 16 17 17 16 16 17 18 18 19 19 18 18 17 17 17 17 18 18 19 19 17 16 14 14 15 16 16 16 15 15 15 15 15 15
3402 15 15 16 17 17 18 18 18 18 18 18 18 17 17 17 17 17 17 17 17 17 17 17 18 18 18 18 17 17 18 19 20 19 19 19 19 19 18 18 18 18 18 19 19 19 20 20 20 21 21 21 21 21 22 22 22 22 21 21 19 16 15 15 17 18 19 20 21 20 20 20
3396 20 20 20 20 20 19 19 19 19 19 19 19 19 18 18 18 18 17 17 16 16 16 16 15 17 19 20 20 20 20 20 19 18 17 15 15 17 18 18 18 18 18 19 19 19 20 21 21 18 17 18 19 19 18 17 16 16 17 17 17 16 15 14 13 14 14 15 16 16 16 17
3389 17 17 18 18 19 20 19 19 19 19 20 21 21 21 20 19 19 18 18 17 17 17 18 19 19 19 20 20 20 18 16 15 15 16 17 19 19 19 19 18 18 19 19 20 20 19 19 19 18 18 18 20 21 19 18 18 18 18 17 17 17 17 17 18 19 20 20 20 20 20 19
3383 19 19 19 18 18 17 18 18 19 20 20 19 18 18 18 17 17 17 16 16 16 17 17 17 16 15 15 16 17 18 18 19 18 18 18 18 19 19 19 20 20 21 20 19 19 18 18 17 17 16 16 17 17 17 17 18 17 16 15 16 17 19 20 19 18 17 16 15 16 16 16
3377 16 16 18 19 19 18 18 17 18 19 18 18 17 17 17 17 17 17 17 16 16 16 17 17 17 18 19 19 19 19 18 17 17 17 18 18 19 20 19 18 18 18 18 19 21 21 21 21 21 21 20 19 17 16 17 18 18 18 18 18 18 17 16 15 15 17 18 19 18 18 18
3370 18 18 17 17 17 17 17 17 17 16 17 17 18 18 18 17 16 16 15 14 14 15 16 18 18 18 17 17 17 16 17 17 16 16 15 14 14 15 15 15 16 16 17 17 17 16 16 16 16 16 15 14 15 15 15 14 15 16 16 17 17 16 16 16 16 16 16 16 16 16 17
3364 17 17 17 16 17 19 20 19 18 16 16 15 16 16 17 18 19 20 19 19 18 18 17 16 15 14 15 16 17 18 19 19 19 19 19 19 19 19 19 19 18 18 18 17 17 16 17 17 18 18 19 19 20 21 20 20 19 19 19 19 18 18 18 18 18 18 18 18 18 19 18
3357 18 18 17 17 17 18 19 20 19 19 19 20 21 20 20 19 18 19 19 19 19 18 18 18 18 18 17 17 18 19 19 20 20 19 18 17 16 14 14 15 15 16 17 18 19 20 20 19 18 16 16 16 17 16 15 15 16 17 18 18 18 19 18 17 18 20 21 20 19 19 18
3351 18 17 16 16 16 17 17 17 17 17 17 17 18 18 18 18 18 18 19 19 19 19 19 19 18 18 18 19 20 21 21 21 21 21 20 19 18 17 17 18 18 18 17 17 17 18 19 20 21 21 20 20 19 18 16 15 15 16 18 18 18 17 17 17 16 16 16 17 17 17 17
3344 17 18 18 19 19 19 20 20 20 20 20 19 19 19 18 16 16 18 18 19 19 19 19 19 18 16 15 14 14 14 15 15 15 15 15 15 16 16 16 16 15 15 15 15 15 14 15 16 17 17 17 17 18 19 18 18 18 19 20 20 20 20 19 19 18 18 17 17 17 18 18
3338 18 18 18 18 18 18 18 18 18 18 18 18 18 18 18 18 18 18 18 18 18 17 17 17 18 19 19 19 18 17 16 15 16 17 17 17 18 18 18 18 17 17 17 17 18 18 18 18 16 14 14 14 16 17 17 17 17 17 16 16 16 15 15 15 16 16 16 17 17 17 17
3332 17 16 15 14 14 14 14 14 15 17 17 17 16 16 16 16 17 18 17 17 17 17 16 14 15 16 18 17 17 18 19 20 20 19 18 17 17 17 18 18 18 18 19 19 19 19 19 19 19 18 18 18 17 17 18 20 21 22 21 20 19 18 19 19 19 19 19 18 18 18 18
3325 18 17 18 18 18 18 18 18 18 18 18 18 18 19 19 19 18 18 18 17 16 15 16 16 16 17 17 17 17 18 18 18 18 18 18 19 19 20 20 20 20 21 20 20 20 19 19 19 18 18 18 18 18 18 18 18 18 18 18 17 18 19 19 19 18 18 19 18 18 18 18
3319 18 18 18 18 18 19 18 18 19 20 19 18 19 20 21 22 23 22 21 20 20 20 19 17 16 17 17 17 15 15 15 16 17 18 18 18 17 17 16 16 15 15 15 16 16 16 16 16 17 17 17 18 18 19 20 21 20 20 19 19 18 18 18 17 17 17 17 17 18 18 19
3312 19 19 19 19 18 18 18 18 16 15 15 15 17 18 18 19 18 17 18 18 18 18 17 16 15 14 15 16 16 17 17 17 17 17 17 16 16 15 15 15 16 16 17 18 17 16 16 18 18 18 16 16 17 19 19 18 18 18 19 19 19 18 17 15 15 15 16 16 17 18 18
3306 18 18 19 19 20 20 20 21 21 20 19 19 20 21 20 19 18 18 19 19 19 19 19 19 19 19 18 17 17 16 17 17 17 18 17 16 17 17 17 17 16 17 17 18 17 17 16 16 16 17 17 18 18 18 18 18 18 19 20 20 19 19 19 19 20 20 19 18 17 17 17
3300 17 18 17 17 18 19 19 18 17 16 16 16 16 16 16 16 16 16 16 16 16 16 17 17 17 18 18 18 19 19 18 18 17 17 17 16 16 16 17 17 18 18 18 19 19 19 19 18 17 17 17 17 18 18 18 19 19 19 19 18 18 18 17 17 17 17 17 18 17 16 15
3293 15 15 15 15 17 18 18 17 15 15 16 17 17 17 17 17 16 16 17 18 19 18 18 18 19 19 20 20 20 20 19 19 19 18 18 17 17 16 15 15 16 17 17 17 16 16 16 16 17 17 17 16 17 17 17 17 18 18 18 18 18 16 15 15 15 16 16 17 17 17 17
3287 17 18 18 18 18 18 18 17 15 15 16 18 18 18 17 17 17 16 17 17 17 18 18 19 19 20 19 18 18 17 17 18 18 18 19 19 19 17 16 16 17 17 17 17 17 18 19 19 18 18 19 20 21 20 20 19 18 16 15 15 14 15 15 16 17 18 17 17 16 17 17
3280 17 18 17 16 17 18 19 18 18 19 20 21 21 20 19 19 19 19 18 18 18 18 18 19 18 18 17 16 15 15 16 16 16 16 16 16 17 17 18 18 18 18 17 17 17 16 15 15 15 14 14 14 15 16 17 17 16 16 16 17 18 18 18 17 16 16 16 17 17 18 19
3274 19 20 20 19 18 17 16 16 16 17 16 16 15 16 16 16 16 15 15 17 18 18 19 19 19 19 19 18 18 17 17 17 17 17 18 18 19 21 21 21 20 20 19 18 17 18 19 19 19 19 18 17 17 16 16 16 16 15 15 15 15 15 14 14 15 16 17 17 17 17 18
3267 18 18 18 18 17 16 16 17 17 17 16 15 14 14 15 16 17 18 17 17 18 19 21 22 23 22 21 20 19 18 18 18 18 17 17 17 18 17 16 15 15 16 17 17 17 17 17 17 16 16 17 18 19 18 17 16 16 17 17 17 16 15 15 15 16 17 17 16 16 17 17
3261 17 17 17 16 16 17 17 18 18 17 16 16 16 16 16 17 18 19 19 19 19 19 18 18 17 17 18 18 19 19 18 17 17 18 18 18 18 19 20 20 20 19 19 18 17 17 17 16 16 16 17 17 18 18 17 16 17 18 18 19 18 18 18 18 18 18 19 20 21 21 20
3255 20 20 20 20 20 20 19 18 18 18 19 19 19 18 17 18 19 19 18 18 17 16 16 16 17 17 16 15 15 14 15 16 17 18 19 19 19 18 18 18 17 17 17 17 17 17 17 17 17 16 15 16 17 19 19 19 19 18 18 18 18 17 17 17 17 17 17 17 17 17 18
3248 18 18 18 18 19 19 19 19 19 19 19 19 19 19 19 18 17 17 16 16 17 18 17 16 15 16 17 19 19 20 19 18 19 19 19 18 18 18 16 15 14 15 16 17 17 18 19 19 18 18 17 17 16 16 16 16 16 15 15 15 15 14 15 15 16 16 17 17 17 17 17
3242 17 17 17 17 18 19 18 17 17 18 19 19 18 18 19 19 19 18 17 16 16 16 16 17 16 16 16 16 16 16 16 16 15 15 15 15 16 16 17 17 17 18 19 20 20 20 19 18 18 18 18 18 19 18 17 17 18 18 17 16 15 15 16 16 16 16 16 16 16 16 16
3235 16 15 15 17 18 18 17 16 15 15 15 16 17 18 19 20 21 22 21 21 20 18 17 17 16 15 14 14 15 15 16 18 21 22 21 19 18 17 17 17 16 16 17 18 18 19 19 19 18 17 16 16 17 18 18 17 18 18 18 18 17 17 18 19 18 17 17 18 19 20 19
3229 19 19 19 19 19 19 20 20 21 21 20 19 18 17 18 18 18 18 18 17 17 16 17 17 17 16 16 17 17 17 17 18 19 20 20 19 18 17 17 17 17 17 17 16 16 17 17 17 18 18 19 20 19 17 17 17 17 16 16 17 17 16 15 14 14 14 14 14 15 16 17
3222 17 18 19 19 19 19 19 19 18 18 18 17 17 18 18 18 19 19 18 17 17 16 16 17 17 17 17 17 17 17 17 16 16 16 17 17 18 19 19 19 19 19 19 19 19 18 17 16 16 16 16 17 17 18 18 19 19 19 19 19 19 19 18 18 18 19 19 19 18 17 17
3216 17 17 17 16 16 15 15 15 15 16 17 17 17 16 15 15 15 16 17 17 18 18 18 18 19 20 20 21 21 20 19 19 20 20 21 22 22 22 21 20 19 19 19 18 18 19 19 19 19 20 20 20 20 20 20 19 18 18 18 18 18 18 19 20 20 20 19 19 19 19 20
3210 20 21 21 20 19 18 18 18 18 17 17 16 16 17 18 20 20 20 19 19 18 18 17 16 17 18 19 20 20 18 17 16 17 18 17 17 17 16 16 16 15 15 15 15 14 14 15 16 16 17 17 18 18 18 18 18 17 17 17 18 18 18 18 18 17 17 19 20 20 20 19
3203 19 19 19 18 18 18 18 18 18 18 18 18 18 18 17 17 18 18 19 19 19 19 18 18 18 18 18 18 18 18 18 18 18 19 19 20 19 19 18 18 18 17 18 17 17 17 17 17 17 17 18 18 17 17 17 18 18 18 17 17 18 18 18 19 19 19 18 18 18 17 15
3197 15 15 15 16 15 14 15 16 16 17 18 19 19 20 20 20 20 20 19 18 19 19 19 19 18 16 16 16 16 16 15 16 17 18 18 18 18 18 18 18 18 19 18 18 18 18 17 17 17 18 19 19 19 19 19 18 18 18 18 19 18 18 17 17 17 18 18 19 19 20 20
3190 20 20 20 21 20 20 19 19 19 18 18 17 17 17 17 17 17 18 19 19 19 19 19 19 19 19 19 19 19 19 19 19 18 16 17 18 18 18 18 18 18 19 20 21 21 21 21 21 21 22 21 20 18 17 17 18 19 19 19 18 17 16 15 15 14 14 14 15 15 15 15
3184 15 15 15 14 14 15 16 18 18 18 18 18 17 17 18 19 20 20 20 21 21 21 21 21 21 21 22 22 23 23 23 23 23 23 25 26 27 28 29 30 33 35 39 42 43 43 42 42 42 41 40 39 37 34 32 30 28 26 25 24 22 20 19 19 19 19 19 20 20 21 21
3178 21 21 21 21 20 20 20 19 19 18 18 17 17 18 19 20 20 20 19 19 20 20 20 20 20 19 19 19 19 19 19 19 18 17 16 15 16 16 17 17 18 19 20 19 17 18 19 20 19 19 19 18 18 18 18 18 19 19 20 20 20 19 20 21 20 19 19 19 19 19 18
3171 18 19 20 20 19 18 18 17 16 16 16 15 16 17 17 17 16 16 15 15 15 16 16 16 16 17 17 17 18 18 19 20 19 19 18 17 17 16 17 17 17 17 16 16 15 15 15 15 16 16 17 17 16 16 16 16 17 17 17 16 17 17 18 18 18 17 17 17 17 16 16
3165 16 16 16 16 16 16 16 15 16 16 16 17 17 17 17 18 17 17 17 17 16 16 16 16 17 17 18 18 18 18 18 18 18 17 17 17 17 16 16 16 16 17 17 18 18 19 20 20 19 18 17 17 17 18 18 18 18 19 19 19 18 18 18 18 18 18 19 20 19 18 17
3158 17 18 18 18 18 18 19 19 19 18 18 17 17 16 16 16 16 16 17 17 19 20 20 19 18 18 19 19 18 17 17 19 20 20 19 18 18 18 19 19 20 21 21 21 21 21 20 20 20 19 19 19 19 19 18 18 18 17 17 17 18 18 18 18 17 16 16 16 18 19 19
3152 19 18 17 15 16 16 17 18 20 21 21 20 20 19 19 18 18 18 18 18 17 18 18 19 18 18 18 18 18 18 17 17 17 17 17 17 17 18 18 18 17 17 16 16 16 16 17 17 17 18 18 18 18 18 18 18 18 18 19 19 19 19 20 20 20 19 19 19 19 19 19
3145 19 19 19 19 20 20 19 19 19 18 18 18 18 19 19 19 18 17 17 17 18 18 19 20 20 19 18 17 18 19 18 17 16 16 15 15 15 14 14 14 14 14 15 16 17 17 16 16 15 14 14 15 16 16 16 15 14 15 16 17 16 16 17 17 17 18 18 18 18 19 18
3139 18 18 17 16 15 15 16 17 18 19 19 19 18 18 20 21 20 19 20 20 20 19 19 18 18 18 18 18 19 19 19 20 19 19 18 18 18 17 17 17 17 18 20 21 22 21 20 19 19 18 18 18 18 18 19 19 19 18 18 18 17 17 16 16 16 16 17 17 18 18 19
3133 19 19 19 19 19 18 19 19 19 20 19 19 18 18 17 17 17 16 17 17 17 18 19 20 21 21 20 20 19 19 19 18 18 18 18 19 19 20 20 21 21 20 18 17 17 17 18 18 18 18 18 18 18 18 17 17 17 18 17 17 16 17 18 19 19 19 18 18 18 18 18
3126 18 18 19 20 21 21 20 20 19 19 18 18 19 19 19 19 19 19 18 18 17 16 15 16 16 17 17 18 18 18 18 17 17 16 16 17 17 17 17 18 18 18 19 20 20 19 19 19 19 20 20 20 20 20 21 21 21 22 23 22 21 20 21 21 21 21 21 22 23 24 25
3120 25 24 24 23 23 22 22 22 21 21 21 21 22 22 21 20 20 20 19 18 17 16 16 15 14 14 14 14 14 14 16 18 19 19 20 20 20 20 19 19 19 19 19 20 20 20 20 19 18 17 16 15 14 13 13 12 12 11 12 13 14 15 15 15 15 15 16 16 17 17 17
3113 17 16 16 16 16 16 16 17 17 17 16 15 16 16 16 16 16 15 15 16 15 15 16 17 18 18 18 17 17 16 16 17 17 17 16 15 15 16 16 16 17 18 18 19 19 18 18 17 17 17 17 16 17 17 18 18 18 18 19 19 20 21 21 21 20 19 18 18 19 20 20
3107 20 20 19 18 17 17 17 17 17 17 18 18 17 17 17 17 18 19 19 18 16 16 16 17 19 19 19 19 19 18 18 19 19 19 19 19 18 18 18 17 17 17 17 16 16 16 16 17 17 18 17 17 17 16 16 16 15 15 16 17 17 17 17 17 17 16 15 16 17 18 18
3101 18 18 18 17 18 19 20 20 20 19 18 18 18 19 19 18 18 17 17 17 18 18 18 17 17 17 17 17 18 18 18 19 19 20 20 20 21 22 21 20 19 19 19 19 19 20 20 19 18 17 17 18 19 20 21 22 22 21 19 16 15 16 16 16 17 18 19 19 18 17 16
3094 16 15 16 17 19 20 19 19 18 18 17 16 16 15 15 15 16 17 18 18 19 19 19 18 18 18 18 18 18 18 18 18 18 18 18 18 19 19 19 18 18 18 18 19 19 19 19 19 19 19 19 20 20 20 19 18 18 18 19 19 19 17 16 16 16 16 17 17 18 19 19
3088 19 19 20 20 19 19 18 18 17 16 17 18 19 19 18 17 16 15 16 16 16 16 16 16 16 16 16 17 16 16 16 16 16 17 18 17 16 15 16 17 17 18 19 19 19 19 18 18 18 17 16 15 15 14 14 15 14 14 14 15 15 15 15 16 17 19 18 18 17 17 16
3081 16 16 16 17 17 17 17 17 16 16 16 16 15 15 15 15 16 16 16 16 17 17 16 16 17 17 17 18 18 18 18 18 17 17 18 18 18 18 18 18 18 18 19 19 20 19 19 19 20 21 21 21 19 19 18 18 18 17 17 17 17 17 17 17 16 16 16 18 19 20 19
3075 19 19 19 19 19 20 20 20 19 19 19 18 16 16 16 17 17 17 18 19 19 19 20 20 20 19 17 16 15 15 16 17 18 18 18 18 18 18 18 18 18 17 17 17 16 17 16 16 16 16 15 15 16 16 16 17 17 18 18 19 19 19 18 19 19 19 19 19 18 18 17
3068 17 17 17 17 18 18 18 18 19 19 19 19 18 18 18 17 16 16 16 16 16 16 16 16 16 17 17 17 16 15 15 16 18 19 18 17 17 16 15 14 14 16 17 18 18 18 16 15 15 17 18 18 17 17 16 16 15 15 15 15 16 16 17 18 19 19 19 18 17 17 18
3062 18 20 20 20 19 19 19 19 18 17 17 18 18 18 18 18 17 17 16 16 16 17 18 19 18 18 16 16 17 17 17 17 17 17 17 17 17 18 18 18 17 17 16 16 16 16 15 15 14 14 14 15 17 18 19 19 20 20 19 18 18 18 18 18 17 17 17 16 16 16 17
3056 17 17 17 17 18 18 18 19 19 19 19 18 16 16 17 18 17 16 16 16 16 16 17 17 18 19 18 17 16 15 16 16 16 17 17 17 16 16 16 16 17 17 17 17 17 17 17 17 18 18 18 18 18 18 18 18 17 16 17 17 19 20 21 22 21 20 19 18 18 18 19
3049 19 20 19 19 18 17 17 19 20 21 21 21 20 20 19 18 18 18 18 18 18 18 19 19 19 19 19 18 19 19 19 20 19 19 19 19 18 17 18 18 19 20 20 19 17 17 17 17 16 16 17 17 17 16 15 15 15 16 16 16 16 16 15 15 15 15 15 15 16 17 17
3043 17 18 18 19 20 21 22 22 21 19 18 18 18 19 18 18 17 17 17 17 16 16 16 17 17 17 17 17 16 16 16 16 16 16 16 15 16 16 17 17 16 16 16 16 16 15 15 15 15 15 14 14 14 15 16 16 16 16 16 16 15 15 16 16 16 17 17 18 18 19 19
3036 19 19 20 20 20 20 20 20 20 19 18 17 16 17 18 20 20 19 18 18 18 18 18 18 18 18 18 18 18 18 18 17 17 17 18 18 17 17 17 17 17 18 18 19 19 19 19 20 20 19 18 16 16 16 17 17 17 17 17 17 18 18 18 18 18 19 18 18 19 19 20
3030 20 20 21 21 20 19 18 18 17 16 17 18 19 19 20 20 20 21 20 20 19 19 18 17 17 16 14 13 14 14 14 14 15 16 16 16 16 17 18 18 17 16 16 16 16 16 17 18 18 17 17 17 18 18 17 17 17 16 16 17 18 18 18 18 18 17 17 16 15 14 14
3023 14 14 14 15 15 15 15 15 15 15 15 15 15 15 15 15 16 17 18 20 21 21 20 19 18 18 18 18 19 19 19 18 18 19 20 20 20 18 17 16 16 17 18 18 18 17 16 16 15 15 15 15 15 15 15 15 15 15 16 16 16 16 16 17 17 18 18 19 18 18 17
3017 17 17 17 17 17 18 17 17 17 18 19 20 19 19 19 19 18 18 18 17 17 17 16 16 16 15 16 16 17 17 18 18 17 16 16 16 16 16 17 17 18 18 18 18 18 18 17 16 16 17 17 17 18 18 18 18 16 15 15 15 16 17 17 17 17 16 16 16 16 16 15
3011 15 15 14 14 14 14 14 15 16 16 16 16 16 16 16 16 16 16 17 17 17 18 18 17 17 19 20 21 20 19 18 18 18 18 17 17 17 16 17 18 19 19 18 17 17 17 16 16 16 15 15 15 15 15 15 16 16 17 17 16 17 17 17 17 17 17 16 16 15 15 16
3004 16 18 18 19 18 18 18 19 19 17 16 16 18 20 20 21 22 23 23 22 21 21 20 19 19 20 20 20 20 19 18 17 17 17 17 18 17 16 16 16 17 17 17 18 17 17 17 17 17 18 17 17 18 20 21 22 22 22 20 19 19 18 18 18 18 17 17 17 17 16 17
2998 17 17 17 16 15 15 15 16 16 17 17 17 16 16 17 17 17 17 16 15 15 15 14 14 14 13 14 14 14 14 14 14 16 18 19 19 18 17 18 18 18 18 17 16 16 15 15 14 15 15 15 15 16 17 17 16 16 17 17 17 17 17 17 16 16 17 18 18 18 19 20
2991 20 20 20 19 19 20 19 18 17 16 16 17 18 19 18 18 19 20 21 21 20 19 19 19 19 19 19 19 20 20 19 18 18 18 18 18 18 18 17 17 17 17 18 18 18 18 18 18 19 19 20 20 20 20 19 18 18 18 20 21 20 20 19 18 18 17 17 18 18 18 18
2985 18 17 17 16 17 18 18 19 20 21 22 23 23 21 20 20 19 18 19 20 20 21 21 22 22 22 22 22 21 20 19 19 20 20 19 19 19 20 21 21 20 19 18 17 16 17 18 18 18 17 18 18 19 18 18 18 18 18 19 19 18 18 17 17 17 16 16 16 17 17 18
2979 18 18 19 20 21 22 22 20 19 18 18 18 18 17 17 17 18 17 17 17 17 16 16 16 16 16 16 16 17 17 17 16 16 16 16 17 18 18 18 17 17 16 16 16 16 15 15 15 16 15 15 15 14 14 14 14 14 14 15 16 17 18 18 17 15 15 16 17 17 17 16
2972 16 16 16 16 16 15 15 15 15 16 15 15 15 14 15 16 18 20 21 23 23 22 22 21 21 20 20 20 20 20 20 21 21 21 19 17 16 16 16 16 16 16 16 15 15 16 17 17 17 16 17 18 18 17 18 18 18 18 17 18 19 19 21 21 21 20 20 19 19 18 18
2966 18 18 17 16 16 15 14 13 14 15 16 18 18 19 19 18 18 17 18 18 18 18 18 18 18 18 18 18 19 19 18 17 16 15 15 15 15 15 15 15 15 15 15 16 16 16 16 16 16 16 15 15 16 16 17 17 18 18 18 17 17 16 16 16 15 15 16 16 17 17 18
2959 18 18 19 19 19 19 19 19 19 19 20 20 20 20 19 20 20 19 19 19 18 18 17 17 17 18 18 18 18 18 18 17 18 18 18 18 18 17 16 15 15 16 15 16 17 18 19 20 20 20 20 20 20 19 20 19 19 18 18 17 17 18 18 18 18 18 18 18 18 20 21
2953 21 21 20 19 19 18 17 16 16 17 17 17 16 16 15 16 17 18 18 18 18 18 17 18 19 19 18 19 19 19 19 19 19 19 19 19 18 18 18 18 18 18 18 18 18 18 18 19 19 19 19 18 17 17 17 18 19 19 19 18 17 17 18 19 19 20 20 18 18 17 17
2946 17 17 17 17 17 17 17 16 16 15 16 17 18 19 19 19 19 19 20 20 20 19 19 18 18 18 18 18 18 18 18 18 17 16 16 15 14 12 12 13 15 16 16 16 17 18 18 17 17 17 16 16 15 15 15 16 17 18 19 19 19 19 19 18 19 19 19 19 17 17 17
2940 17 17 17 16 16 15 15 15 16 16 15 15 15 16 17 18 18 18 18 18 19 20 19 19 19 19 18 18 18 17 17 16 15 14 14 13 13 14 14 15 16 16 17 17 17 18 17 17 16 16 16 14 14 15 16 17 18 18 18 19 18 18 17 16 17 17 17 17 17 18 18
2934 18 17 16 17 18 18 18 19 19 20 21 22 21 20 20 19 18 17 15 14 15 16 17 17 18 18 18 19 18 18 18 18 18 18 18 18 18 19 19 19 20 20 20 20 20 19 16 15 15 15 15 14 14 16 16 17 16 16 18 19 20 20 20 20 20 20 19 19 19 19 18
2927 18 18 18 18 18 18 18 17 17 17 17 16 17 18 18 18 18 19 19 18 17 15 15 16 17 18 18 19 20 20 19 18 18 18 18 18 18 18 18 18 18 18 19 20 20 19 18 18 17 16 16 16 15 15 15 15 16 16 16 16 16 16 16 16 15 15 16 18 18 18 18
2921 18 17 17 17 17 17 18 18 18 17 17 17 17 16 16 16 16 17 17 18 18 19 19 19 19 18 18 17 18 18 19 20 19 18 17 17 17 17 18 18 17 17 16 16 16 17 17 18 17 17 17 17 17 17 17 18 19 19 19 19 18 18 18 17 17 18 18 18 17 17 17
2914 17 17 17 18 18 19 19 19 19 19 19 18 16 16 16 17 17 16 15 15 16 18 20 20 20 21 20 20 20 20 20 20 20 19 19 20 21 21 21 20 19 18 18 17 17 17 17 17 16 16 17 17 17 16 16 15 16 16 17 17 18 18 18 18 18 18 19 19 20 20 20
2908 20 20 21 21 21 22 22 23 22 21 20 19 20 20 20 20 20 19 17 17 18 20 21 21 20 19 17 16 16 16 17 17 18 19 19 19 18 18 18 18 19 19 19 19 18 18 18 18 19 19 19 19 20 20 19 19 19 20 19 19 19 18 17 17 17 17 17 16 16 16 17
2902 17 18 18 18 18 17 17 17 17 17 17 17 18 18 18 19 19 20 19 19 19 19 18 18 17 16 16 16 16 16 16 18 19 18 16 15 16 16 17 18 17 17 17 17 16 16 16 16 16 16 17 18 18 18 17 18 19 21 21 21 20 19 18 17 18 18 18 18 18 19 18
2895 18 18 17 16 16 16 18 19 18 18 18 18 18 18 18 17 17 17 17 17 17 17 17 17 17 17 17 17 16 15 15 16 17 17 18 19 18 17 17 16 16 16 16 16 17 17 16 15 16 17 17 17 17 18 18 19 18 18 17 16 15 15 16 17 18 20 19 19 18 17 18
2889 18 18 19 20 21 21 21 20 20 20 19 18 17 16 17 17 18 18 20 21 22 21 21 20 19 19 18 18 17 17 17 16 16 15 16 16 17 17 17 16 16 15 15 14 14 13 14 15 16 17 18 18 19 18 16 15 15 16 16 16 16 16 16 16 16 15 16 16 16 17 16
2882 16 16 17 18 18 17 17 17 17 17 17 17 17 17 18 19 19 17 16 16 17 18 18 18 18 17 16 15 16 17 17 17 18 19 20 21 21 21 20 19 18 16 16 17 17 17 16 15 15 15 15 15 16 17 17 16 14 13 13 12 12 13 13 13 13 14 16 17 18 19 19
2876 19 19 19 20 19 19 19 20 20 19 18 16 16 16 16 16 16 16 16 16 16 15 15 15 16 17 17 18 18 18 17 16 16 15 15 15 15 15 16 16 17 17 16 15 14 14 12 11 11 12 12 13 13 13 13 14 16 16 16 17 17 17 17 18 19 19 20 20 20 20 20
2869 20 19 19 18 18 18 17 17 17 17 17 18 18 18 19 19 20 21 21 20 19 19 20 20 19 18 18 18 18 18 18 18 18 19 20 21 20 20 19 18 18 18 18 18 18 18 18 18 18 18 18 18 18 18 18 18 19 19 19 18 17 16 16 16 16 15 15 15 15 16 17
2863 17 18 17 17 17 17 17 17 17 17 16 16 18 19 19 18 17 17 17 17 17 18 18 17 17 17 17 17 17 16 15 16 17 18 18 19 19 20 20 19 19 19 19 18 17 18 18 17 17 17 17 16 16 16 16 16 17 17 18 19 20 20 20 19 17 17 17 17 17 17 16
2857 16 16 16 16 16 16 16 15 17 18 20 21 21 21 21 21 20 20 19 18 18 17 17 18 17 17 17 18 19 18 17 18 19 20 20 19 18 18 17 17 16 16 16 15 15 15 14 14 14 15 16 17 17 17 16 15 15 15 17 18 18 16 15 15 14 14 14 16 17 18 17
2850 17 16 16 15 16 16 17 18 19 19 19 19 18 17 17 17 17 17 18 18 18 19 19 19 19 20 19 19 18 18 18 18 18 19 19 19 19 19 18 18 18 18 18 18 18 19 18 18 18 18 18 18 17 17 18 18 18 17 17 16 16 15 15 16 16 16 16 16 15 14 13
2844 13 14 16 17 17 17 17 17 17 16 16 16 16 16 18 19 20 19 18 17 16 15 15 16 17 17 17 17 17 17 18 19 19 20 20 20 20 18 18 18 18 17 17 17 16 16 16 16 16 14 13 13 14 15 16 17 18 18 18 18 17 17 16 16 16 17 17 18 18 17 18
2837 18 19 19 19 19 18 17 18 19 19 19 19 19 19 19 18 18 18 18 18 19 19 20 20 20 21 20 19 18 17 16 15 15 15 16 17 18 18 17 17 17 17 17 17 17 18 18 18 18 19 18 18 18 18 17 17 16 15 16 16 17 17 17 18 17 16 15 15 15 15 15
2831 15 16 16 16 16 15 14 15 17 17 17 17 17 17 17 17 17 17 16 16 16 17 16 16 15 16 18 20 21 20 19 19 19 20 19 19 19 19 18 18 18 18 18 18 17 16 15 16 16 17 16 16 16 15 16 16 17 18 17 16 16 17 17 17 17 16 17 17 17 18 17
2825 17 17 17 17 17 18 18 18 18 17 17 17 15 14 14 13 13 12 13 14 15 15 15 15 15 15 15 15 16 17 17 18 18 19 18 17 16 15 16 16 17 17 18 19 20 21 20 20 18 17 16 15 16 17 17 17 18 18 17 16 15 14 15 16 17 18 18 18 18 18 17
2818 17 16 16 15 16 17 17 18 18 17 17 16 16 16 15 15 15 16 16 17 18 18 18 18 17 17 18 19 18 17 16 17 17 18 19 19 20 20 21 21 22 21 20 18 19 19 18 18 17 17 17 17 17 17 18 18 18 18 18 19 20 21 21 21 21 20 20 19 19 19 20
2812 20 19 18 16 16 17 17 18 19 19 18 18 17 17 18 18 19 20 20 20 20 20 20 19 20 19 18 16 14 14 14 15 15 16 16 17 18 18 18 18 18 17 17 17 18 18 19 20 20 19 18 18 18 18 18 19 19 19 19 18 17 17 17 18 18 18 18 17 16 16 16
2805 16 16 17 17 16 16 16 16 16 17 17 18 18 18 18 18 18 18 19 19 18 18 18 18 18 19 19 20 19 19 18 18 18 18 19 19 18 16 15 15 16 17 17 17 16 15 15 15 15 16 16 17 17 18 18 18 17 16 16 15 15 15 16 17 18 18 18 17 16 16 15
2799 15 15 15 15 16 16 16 17 17 17 16 16 15 15 15 17 18 18 18 18 18 17 17 17 16 16 16 16 16 16 16 16 17 17 18 19 20 20 19 18 16 16 16 16 15 15 14 14 15 16 17 17 17 17 17 17 16 16 16 16 16 16 16 16 17 17 17 17 18 18 17
2792 17 17 16 16 16 15 15 15 15 16 17 17 17 16 16 16 16 16 16 16 15 15 15 16 17 18 19 18 17 16 16 15 14 14 14 15 15 15 15 15 16 15 15 16 16 16 15 16 15 14 13 13 13 14 15 15 16 16 16 15 15 16 18 19 20 20 20 19 18 18 18
2786 18 18 18 18 18 19 20 20 20 19 18 17 16 17 17 17 18 18 18 18 18 17 18 18 18 18 18 17 17 16 17 18 17 17 18 18 18 18 18 18 19 19 19 19 18 17 15 16 17 18 19 19 19 19 19 19 19 18 19 19 19 19 18 18 17 16 16 16 16 15 16
2780 16 17 19 19 19 19 19 19 19 18 18 18 18 19 20 21 20 19 18 18 17 16 17 17 17 16 17 17 17 17 17 18 18 17 17 17 17 17 17 17 17 17 18 18 18 18 18 18 18 17 17 17 17 16 16 16 16 17 17 18 18 17 16 15 15 15 16 16 16 16 17
2773 17 17 16 16 16 17 18 18 18 17 17 18 18 18 18 17 17 16 16 16 16 15 14 13 13 13 15 16 16 15 15 16 16 16 16 16 16 16 16 16 17 17 17 17 17 16 16 16 16 15 15 16 16 16 17 17 17 17 17 17 18 19 19 18 18 19 19 18 17 17 17
2767 17 18 18 18 18 17 17 17 17 15 14 13 14 15 15 16 16 16 16 16 16 16 16 16 16 16 16 15 15 15 16 16 16 16 16 16 17 17 17 18 17 17 16 15 15 14 13 12 13 15 16 16 16 16 17 17 18 18 16 15 15 15 16 17 17 18 19 19 18 18 17
2760 17 16 16 17 17 18 17 17 16 16 15 15 14 14 13 13 14 15 15 15 16 17 17 16 16 16 16 16 16 16 16 16 15 15 13 12 12 14 15 15 15 14 14 14 14 14 14 15 15 16 16 16 16 15 15 15 15 15 16 16 16 17 17 17 17 16 17 18 18 18 18
2754 18 18 18 17 17 16 16 15 16 16 16 16 16 16 16 16 17 18 18 19 18 18 17 17 17 18 18 18 17 18 18 18 18 18 19 19 19 19 18 17 15 15 15 17 18 18 18 18 18 18 18 19 18 18 18 18 18 18 19 19 19 19 18 18 18 18 19 19 18 18 17
2747 17 17 17 17 18 18 18 17 17 17 17 17 18 18 18 17 16 15 15 14 14 13 13 13 14 15 16 16 16 15 15 15 15 15 16 17 17 18 19 19 19 19 19 19 19 19 19 19 19 19 19 18 18 18 18 18 18 18 17 15 14 13 13 15 16 16 16 16 16 15 16
2741 16 16 17 17 17 17 17 17 17 18 19 20 20 20 18 17 17 17 17 17 17 17 18 18 18 18 18 18 18 18 18 18 18 18 17 17 17 17 17 17 17 17 17 17 17 18 18 19 19 18 18 19 20 21 22 21 21 20 20 19 18 17 16 15 16 17 18 18 18 17 16
2735 16 15 15 16 17 19 20 20 19 17 17 18 18 18 18 18 19 20 20 20 19 18 18 17 17 17 16 16 16 16 16 16 16 16 17 17 17 17 17 18 19 19 18 18 17 16 15 15 16 16 18 19 19 19 19 19 20 20 19 18 18 17 16 17 18 18 18 17 18 19 19
2728 19 19 18 16 15 14 15 15 15 15 15 15 16 17 18 20 20 21 21 20 19 18 18 17 17 18 18 18 18 18 18 18 18 18 18 18 17 17 17 17 18 18 18 19 18 18 17 17 17 17 18 18 17 17 16 16 16 17 19 19 18 17 17 17 17 18 18 16 15 14 15
2722 15 17 18 18 18 17 16 15 16 16 16 17 16 15 16 16 15 14 15 16 16 15 15 15 16 16 17 17 16 15 16 17 18 19 19 19 19 19 18 17 17 16 17 18 18 19 19 18 18 18 18 18 17 17 17 17 17 16 16 15 16 17 17 16 16 16 16 17 17 17 17
2715 17 18 18 18 19 20 21 20 18 17 16 15 15 15 15 15 14 14 14 15 15 15 15 16 16 16 16 16 15 15 14 14 15 16 17 17 17 18 18 18 18 18 19 19 19 18 18 17 18 18 18 18 18 17 17 17 17 17 17 16 17 17 17 17 17 16 15 15 15 17 18
2709 18 18 19 19 19 19 19 18 18 17 17 16 16 15 16 17 17 18 18 19 20 20 19 18 17 16 16 15 16 17 18 18 18 18 18 18 18 17 17 16 17 17 17 17 18 19 19 19 19 19 18 17 16 16 16 16 17 17 17 17 18 18 18 18 18 18 19 19 18 17 16
2703 16 15 14 14 15 15 16 16 16 16 15 15 16 17 18 18 18 18 17 17 17 16 16 16 16 17 17 18 18 18 18 18 18 17 17 17 16 17 18 19 19 18 17 16 16 16 16 17 17 17 17 16 17 18 19 19 20 19 19 18 18 17 17 16 16 16 16 16 16 16 16
2696 16 16 17 17 18 19 19 19 18 18 18 18 18 18 18 18 18 18 19 19 19 20 20 19 19 19 19 19 18 18 18 18 17 17 17 18 18 19 19 19 18 18 18 17 15 14 14 15 17 19 20 20 20 20 19 18 17 17 17 17 17 18 19 20 20 19 18 17 17 16 15
2690 15 15 15 16 16 17 18 19 19 19 19 20 20 20 20 21 21 19 18 18 18 18 18 18 18 18 16 16 17 17 17 17 17 17 16 15 16 17 18 18 18 18 18 17 17 17 16 16 17 17 18 18 18 18 18 17 17 17 18 19 19 20 19 19 19 19 19 19 18 17 16
2683 16 16 16 16 16 16 16 17 18 18 18 18 18 18 18 18 19 19 19 19 19 19 19 19 20 20 20 20 19 18 17 17 17 17 17 18 17 17 17 17 18 18 18 17 17 17 17 16 16 16 16 16 16 16 16 16 16 17 18 18 18 18 18 18 20 21 21 20 19 19 18
2677 18 17 17 18 18 18 17 17 16 16 16 16 16 16 16 16 16 17 17 17 17 16 16 17 17 18 17 16 16 16 16 17 17 18 19 19 18 17 15 14 14 14 14 15 15 15 16 16 16 16 16 17 18 18 18 17 16 17 17 17 17 18 19 20 20 20 19 18 16 15 14
2670 14 15 16 17 17 17 17 16 16 15 15 16 16 16 17 17 17 16 15 16 17 19 19 19 20 20 20 20 20 19 18 16 17 18 18 18 18 18 18 18 19 20 20 19 19 18 18 18 18 18 18 18 18 17 18 18 18 18 17 16 16 18 19 20 20 20 19 19 18 17 17
2664 17 17 17 17 18 18 19 19 19 19 19 18 17 16 17 18 18 18 17 17 16 16 16 16 16 15 15 15 15 15 14 14 15 17 18 19 18 17 17 17 18 18 18 17 17 16 17 17 18 18 18 18 17 15 15 16 18 19 18 18 17 17 17 17 17 18 18 19 18 18 17
2658 17 17 17 16 16 16 15 14 14 15 16 16 15 14 14 15 16 16 16 16 15 14 13 13 14 15 15 14 14 15 15 15 15 15 15 15 14 14 14 15 15 15 15 15 15 15 16 16 17 18 17 17 17 17 17 17 17 16 17 17 17 17 17 16 17 16 16 16 16 17 17
2651 17 17 17 18 18 18 17 17 17 16 15 14 14 14 14 15 16 16 14 14 14 15 16 16 15 15 15 16 17 18 17 17 17 17 18 19 19 18 18 18 18 18 18 18 17 17 17 17 17 18 18 18 18 17 16 16 16 15 15 15 15 15 16 16 15 15 16 17 18 17 16
2645 16 16 16 16 16 16 17 17 17 17 17 17 17 17 16 16 15 14 15 15 16 16 16 16 16 16 16 17 17 17 18 18 19 19 19 19 18 18 18 19 19 20 19 19 18 18 17 17 17 16 17 17 18 18 19 19 19 18 17 15 15 15 16 16 17 17 17 18 19 20 20
2638 20 19 18 16 16 16 17 18 18 18 18 17 16 15 15 15 16 16 17 18 18 18 18 18 18 18 19 19 19 19 19 19 19 19 20 20 19 18 18 17 16 16 17 18 18 19 19 19 18 17 17 17 17 17 17 17 19 20 19 18 17 17 16 15 15 15 15 16 17 17 16
2632 16 14 14 15 16 16 16 16 17 18 18 17 17 17 17 16 16 16 16 15 14 14 14 15 15 15 15 15 14 14 14 14 14 14 15 15 16 16 17 17 18 18 18 17 17 18 19 19 17 15 15 15 15 16 17 18 18 18 18 17 17 17 17 17 17 17 16 16 16 15 15
2626 15 16 16 16 16 15 16 16 17 18 18 18 17 16 16 15 16 16 17 18 18 19 18 18 18 18 18 18 18 18 17 17 18 18 18 17 17 17 18 19 19 19 18 17 16 15 15 15 15 16 17 17 18 18 18 17 16 16 17 17 18 17 18 18 18 17 17 17 17 17 18
2619 18 18 19 19 18 18 18 18 17 16 16 16 17 17 17 16 16 16 16 18 19 19 19 19 19 19 18 17 16 16 16 17 18 19 19 19 19 18 18 18 17 17 16 17 17 18 18 18 16 15 15 15 17 18 19 18 18 18 19 18 17 17 17 18 18 17 17 19 20 20 20
2613 20 20 19 19 19 18 18 18 17 17 16 16 16 17 17 17 17 16 15 15 15 15 16 16 17 17 18 18 18 18 18 18 17 17 16 16 16 17 17 16 15 16 16 16 15 15 17 18 18 19 19 19 20 20 18 17 17 16 17 17 17 16 17 17 16 16 15 15 15 15 15
2606 15 15 15 14 14 15 16 17 17 16 16 17 17 17 17 17 18 18 18 18 18 18 17 17 17 16 16 17 17 17 17 16 16 15 16 17 17 18 18 17 17 17 17 16 16 16 16 15 15 15 16 16 17 17 17 17 17 17 18 18 19 19 19 18 18 17 17 17 17 17 17
2600 17 17 16 15 16 16 17 17 17 17 17 17 18 19 20 19 19 19 19 19 19 18 18 17 17 17 16 16 16 17 17 18 18 18 19 19 19 18 19 18 16 15 14 14 14 14 15 16 18 19 20 19 18 16 15 15 15 16 16 16 17 18 17 16 15 14 14 14 15 16 16
2593 16 16 15 15 15 15 15 14 15 16 17 18 18 18 18 18 17 16 15 16 17 17 17 17 18 19 20 20 20 19 18 17 18 18 17 17 18 18 18 18 18 17 18 18 18 18 18 17 16 15 16 16 15 15 14 15 16 17 18 18 18 19 18 18 17 17 16 16 15 15 15
2587 15 16 16 17 17 16 15 15 15 15 15 15 15 15 16 16 17 18 18 18 17 17 16 15 15 14 15 16 17 18 18 18 17 17 17 17 15 14 14 15 16 17 17 16 15 15 16 16 16 16 16 16 16 15 15 15 16 16 17 18 18 18 18 18 17 17 17 17 17 17 17
2581 17 16 17 18 19 19 19 19 19 19 18 17 16 16 17 18 19 19 19 19 18 18 18 18 17 17 17 17 17 17 17 17 17 17 17 16 15 14 15 15 16 17 16 16 17 17 18 18 18 17 15 15 15 15 14 13 13 15 17 18 20 21 20 20 19 19 19 20 18 17 18
2574 18 18 18 18 18 19 19 19 19 19 19 19 19 20 20 18 17 16 17 17 17 17 18 19 20 21 21 21 20 19 18 18 18 17 18 18 17 17 16 16 17 17 18 18 18 18 19 20 21 21 21 20 19 19 18 18 17 17 17 16 17 18 19 20 19 18 17 17 16 16 16
2568 16 16 16 16 16 16 16 16 16 16 18 19 18 17 16 17 18 18 19 19 20 20 20 19 20 21 20 19 19 19 20 20 20 20 18 17 17 17 17 17 17 17 17 16 17 18 18 18 17 18 18 19 19 20 20 20 19 19 19 19 19 19 20 20 19 18 16 15 15 15 15
2561 15 15 15 16 17 17 17 17 16 15 16 17 17 16 15 15 17 19 19 19 18 18 18 18 17 18 18 18 18 18 17 17 17 17 18 18 17 17 16 15 15 15 15 14 15 16 15 15 15 14 15 16 17 17 16 15 15 15 16 16 15 16 16 16 15 15 14 14 14 16 17
2555 17 18 17 15 14 13 13 14 15 15 15 15 16 16 15 14 14 15 16 18 18 18 17 17 17 16 16 16 15 15 15 15 15 16 16 17 18 19 19 18 18 18 18 17 17 16 17 17 18 19 18 18 18 17 17 17 17 17 18 18 18 18 17 16 17 18 17 17 16 15 16
2548 16 16 17 17 16 15 14 13 14 14 16 17 18 19 19 19 18 17 17 17 18 19 19 20 20 20 19 19 19 18 18 18 18 19 19 19 19 19 19 19 20 19 17 16 16 17 17 17 17 17 16 14 15 15 16 18 19 20 19 19 18 18 17 17 16 15 16 18 20 20 19
2542 19 18 19 19 19 18 18 17 17 16 16 16 18 19 19 20 19 18 18 18 19 19 18 18 17 16 16 16 15 15 16 17 18 19 19 19 19 18 17 17 17 17 17 17 16 16 16 16 15 15 15 16 17 18 18 18 18 18 18 18 19 19 19 19 18 18 17 16 16 16 16
2536 16 17 17 17 17 17 16 16 16 15 15 15 16 16 16 15 15 16 16 17 17 18 18 19 20 20 19 17 17 16 17 18 19 19 18 17 17 17 17 17 17 17 17 17 18 18 19 19 19 18 18 17 18 18 19 19 19 19 19 19 18 17 16 17 18 19 19 18 18 17 17
2529 17 18 18 17 17 17 17 16 15 15 15 16 16 16 17 17 18 18 19 20 19 19 18 18 17 17 17 18 18 18 19 20 20 19 18 18 18 18 18 18 18 19 19 20 20 19 19 19 20 20 20 20 20 19 18 18 19 18 17 17 17 16 17 17 18 18 18 18 18 17 17
2523 17 17 18 18 17 18 19 19 18 17 17 17 17 17 16 16 17 17 18 18 18 19 19 19 19 19 19 19 19 19 19 19 18 17 17 18 17 17 16 16 16 16 16 17 19 20 20 19 18 17 15 14 14 15 16 17 17 17 18 18 18 18 17 15 15 15 14 14 14 14 14
2516 14 14 15 15 16 17 17 17 18 18 19 20 21 20 20 19 21 22 22 22 22 23 22 22 21 20 19 19 19 20 21 21 22 22 23 23 22 22 22 22 23 24 23 22 21 21 21 22 21 21 20 19 18 19 20 21 21 20 19 18 18 19 19 19 19 19 20 20 21 21 21
2510 21 20 20 20 19 19 19 19 19 19 19 19 19 18 18 18 18 18 18 18 18 18 18 18 18 18 17 17 17 18 18 18 18 18 18 18 18 19 19 19 19 20 19 18 18 18 19 20 20 21 21 20 21 22 22 23 22 21 20 21 20 20 20 20 19 19 18 18 18 18 18
2504 18 17 18 18 20 20 19 17 18 19 19 20 19 19 18 17 17 18 19 19 19 18 18 18 18 19 19 18 18 19 19 20 20 20 21 20 20 21 20 20 20 20 20 19 18 17 18 20 21 20 18 17 17 18 18 18 17 16 16 16 17 18 18 18 18 18 19 18 17 16 16
2497 16 16 17 17 18 19 19 18 18 17 17 18 18 18 18 17 17 17 18 17 17 17 17 17 17 18 18 17 16 16 17 17 17 17 17 17 17 17 17 17 17 17 16 16 16 17 16 15 15 16 17 19 19 19 18 18 17 17 17 17 16 15 14 15 17 19 20 22 21 21 20
2491 20 20 20 20 20 20 20 19 18 17 17 17 18 19 20 20 20 19 19 19 19 19 19 20 19 18 18 18 19 19 19 20 20 20 20 19 19 18 18 18 19 19 18 17 17 16 17 18 17 17 17 17 18 18 19 20 19 18 18 18 17 17 16 16 17 17 18 18 18 19 19
2484 19 19 19 19 19 19 19 19 20 21 22 23 24 24 25 25 27 28 30 32 34 35 37 39 40 41 41 42 41 41 40 38 37 35 33 32 30 28 27 25 24 24 23 23 22 22 22 21 21 20 20 19 18 17 16 15 15 16 16 17 17 17 17 17 17 17 17 17 18 18 19
2478 19 20 20 20 21 21 21 21 21 21 22 23 24 24 24 23 25 26 28 30 32 34 37 40 43 46 52 58 63 69 74 77 79 80 79 79 76 73 69 66 62 58 54 50 46 42 40 38 35 33 32 30 29 28 28 27 27 26 26 25 25 24 23 23 22 21 20 19 19 18 18
2471 18 19 20 20 19 19 19 19 18 17 18 19 20 22 22 23 23 23 24 26 27 28 27 26 27 28 30 32 34 35 38 41 45 48 54 59 65 69 72 76 80 81 80 78 76 73 70 67 63 60 56 51 47 43 40 37 34 31 30 28 27 26 25 24 23 22 21 20 19 19 21
2465 21 22 21 21 20 19 19 19 19 19 19 19 18 18 18 18 18 18 17 17 17 17 17 17 18 18 18 19 20 21 21 22 22 22 23 23 24 24 26 28 29 31 32 33 35 36 37 38 39 40 40 39 37 36 34 33 32 32 31 30 27 25 24 23 21 20 19 19 19 20 20
2459 20 20 20 19 19 18 18 17 17 18 18 18 18 17 18 19 19 19 20 20 20 20 20 20 19 19 18 17 19 21 21 21 19 18 17 17 18 18 18 18 18 18 18 19 18 17 16 15 15 15 16 18 19 19 19 18 17 16 15 13 13 14 16 18 18 19 19 18 18 18 17
2452 17 17 16 15 15 15 16 17 18 19 19 18 19 21 21 20 19 18 18 19 18 17 17 17 17 17 17 16 17 18 18 17 16 16 15 15 15 15 15 15 15 15 15 16 16 17 17 17 18 18 19 19 20 21 21 21 20 20 20 20 19 19 18 18 17 16 17 18 19 20 21
2446 21 21 20 19 19 19 19 19 20 20 20 21 21 22 21 20 20 20 21 21 20 20 19 19 18 18 18 18 18 18 18 18 18 18 18 18 18 17 17 17 17 17 17 17 17 17 16 16 17 18 18 18 18 18 18 18 18 18 18 18 18 18 19 19 18 17 18 19 21 22 22
2439 22 22 23 23 22 23 24 25 25 24 24 24 24 24 24 24 24 24 24 23 23 23 23 23 23 24 24 25 25 26 28 31 32 33 34 34 34 33 31 30 29 28 27 26 25 25 24 25 26 27 29 30 32 33 34 35 34 33 32 31 29 28 28 28 27 26 25 24 23 22 22
2433 22 22 22 21 22 22 23 23 23 23 23 23 23 24 24 24 24 23 22 22 21 21 20 20 20 21 20 19 19 18 18 18 18 19 19 19 19 19 19 19 20 20 19 20 20 20 20 20 20 20 20 20 18 18 19 19 19 20 21 21 21 20 20 20 20 20 20 20 20 20 20
2427 20 20 20 21 21 21 21 21 21 21 21 21 20 20 22 23 23 21 19 18 19 20 21 21 21 22 21 21 21 21 21 21 21 22 21 21 21 21 20 20 20 20 19 19 18 16 15 15 16 17 19 21 21 20 19 18 18 18 19 19 20 20 20 20 20 20 20 20 21 20 20
2420 20 20 20 19 19 18 18 17 18 18 19 21 21 21 21 20 19 19 19 18 17 17 17 17 16 16 16 17 19 20 20 20 21 21 20 19 18 18 19 19 19 19 19 19 19 19 19 19 19 19 18 18 18 19 20 20 20 19 18 18 19 19 20 20 20 20 19 19 19 19 18
2414 18 18 18 18 18 18 17 18 19 20 21 20 20 19 19 20 21 21 20 19 17 16 16 17 17 17 18 19 21 21 21 19 18 17 17 18 18 19 19 19 19 19 19 18 18 18 17 17 16 15 16 18 19 20 19 19 19 19 20 21 20 20 20 20 20 20 20 19 19 19 19
2407 19 19 19 19 19 19 20 20 20 21 23 23 22 21 20 19 19 20 21 21 21 21 22 23 22 21 21 22 22 21 21 22 23 22 21 20 20 19 20 20 21 21 21 21 19 19 19 20 20 20 19 19 19 19 20 20 20 20 20 21 21 21 20 20 19 20 20 19 19 18 17
2401 17 17 17 18 18 19 18 18 18 17 18 18 18 19 20 21 20 19 19 18 18 19 18 18 18 18 18 18 18 18 19 20 20 19 17 16 17 18 20 20 19 19 19 19 19 19 20 21 22 23 23 23 24 25 25 25 23 22 22 22 23 24 24 23 22 21 21 21 22 22 22
2394 22 23 23 23 24 24 24 25 24 24 25 26 26 26 27 27 27 27 29 31 32 32 31 31 32 32 33 34 33 32 32 33 34 35 34 33 33 33 34 34 34 33 32 31 30 29 29 29 28 28 28 27 26 25 25 25 25 25 24 23 22 22 21 21 20 19 19 19 20 20 20
2388 20 19 19 19 20 21 22 23 23 22 21 20 20 20 20 21 22 23 22 22 21 21 21 21 20 20 19 17 18 19 20 20 19 18 19 19 19 18 19 20 21 20 20 19 19 18 18 18 18 19 20 21 20 19 19 19 19 18 19 19 18 17 18 18 18 19 19 19 19 20 20
2382 20 20 20 20 20 21 21 21 21 20 19 18 18 18 19 20 20 20 20 20 20 21 22 21 20 19 19 20 21 21 21 20 19 19 20 21 21 21 21 21 21 20 20 19 19 19 17 16 15 16 17 18 19 20 20 20 20 20 20 20 19 19 20 21 21 22 22 22 21 20 19
2375 19 18 17 17 18 19 19 18 17 17 18 20 20 19 18 17 18 19 20 20 20 19 19 19 20 21 20 20 20 20 20 19 19 19 19 19 19 19 20 20 21 22 21 20 19 18 19 19 20 21 21 21 21 21 21 21 21 21 21 21 20 20 20 20 20 20 21 21 21 21 22
2369 22 22 22 22 21 20 21 21 21 20 20 19 19 20 20 20 19 18 19 19 20 20 20 21 20 20 19 18 18 18 19 20 22 21 21 21 21 21 21 22 21 20 19 19 19 19 19 21 22 22 21 22 23 23 22 22 22 22 20 20 20 22 22 21 21 21 22 22 23 23 22
2362 22 21 20 19 19 18 18 19 19 19 20 20 21 21 21 22 22 22 21 21 20 19 18 18 17 16 16 16 17 17 17 17 18 17 17 17 17 17 17 17 18 18 17 16 16 15 15 15 17 18 18 17 17 18 19 19 19 20 21 22 21 20 20 19 20 20 20 19 18 18 18
2356 18 19 19 20 21 21 20 19 19 20 20 20 20 20 19 19 19 20 20 20 21 21 21 20 20 20 20 20 20 21 22 22 21 21 20 19 19 19 19 19 18 18 17 17 17 18 19 19 19 19 19 19 20 20 21 20 20 20 20 21 21 21 20 20 20 19 19 19 18 18 17
2350 17 16 17 19 20 21 21 20 19 19 19 20 20 21 21 21 21 21 20 20 19 19 19 20 20 21 21 21 22 21 20 19 18 17 17 18 19 20 21 21 21 20 20 20 21 22 23 22 21 20 19 19 20 21 22 23 23 22 21 22 21 21 21 20 20 19 19 19 19 19 19
2343 19 19 19 19 19 19 19 18 18 19 19 19 19 20 20 20 21 22 23 24 23 21 21 21 19 18 18 19 19 19 19 18 18 18 19 21 21 21 21 20 21 21 22 22 22 22 22 22 21 20 20 19 19 19 20 22 23 23 22 21 21 21 21 21 21 21 21 21 21 20 21
2337 21 22 22 21 20 20 20 21 21 22 22 21 21 20 20 21 21 21 21 21 20 19 18 18 18 20 21 23 23 23 22 21 21 22 23 24 23 23 23 22 21 20 20 20 20 20 20 21 22 23 23 23 23 23 23 23 23 23 23 24 24 25 25 25 25 25 24 24 24 23 23
2330 23 22 22 21 21 22 22 22 22 22 22 22 22 22 22 22 22 22 22 22 22 22 22 22 23 23 23 24 24 23 23 23 23 23 23 23 23 24 25 25 25 25 24 23 23 23 23 24 24 24 25 25 25 25 25 25 26 27 27 28 28 29 29 30 30 31 32 33 33 34 35
2324 35 35 37 38 40 41 43 44 46 47 49 51 52 54 57 61 65 69 73 77 83 89 95 101 110 118 127 137 145 154 162 168 174 179 184 189 192 192 190 186 181 175 168 161 153 145 137 128 120 111 104 96 90 85 78 72 67 64 60 57 54 51 50 48 47 45 44 43 42 41
2318 41 40 39 37 36 36 35 35 34 33 33 32 32 31 31 30 30 28 27 27 28 29 29 27 26 26 26 26 26 26 25 25 24 25 25 26 27 26 26 25 25 25 24 24 24 24 23 23 23 24 24 24 24 24 24 24 24 25 25 26 26 26 26 25 25 24 24 24 23 24 24
2311 24 25 25 25 25 25 24 23 22 20 20 20 22 24 25 25 25 24 24 24 24 24 25 24 23 23 23 23 23 23 23 23 24 24 25 25 26 26 27 26 25 24 24 23 23 23 23 23 23 23 22 21 20 19 20 22 22 23 23 24 24 25 25 25 25 25 25 24 24 23 22
2305 22 23 25 25 26 26 27 26 25 25 24 24 24 24 23 23 23 23 23 23 22 23 23 23 24 24 24 24 24 24 25 25 25 25 25 25 25 25 25 25 25 25 25 25 25 24 24 25 26 26 25 26 26 26 26 25 25 25 26 25 25 24 24 24 25 25 25 24 23 23 23
2298 23 24 24 25 26 25 25 25 26 26 26 25 25 25 26 26 25 25 25 23 22 23 25 28 29 29 28 27 26 26 25 27 28 29 30 30 29 28 28 28 28 28 29 28 28 29 31 33 34 33 33 33 33 32 32 32 31 31 31 30 31 31 31 32 32 32 33 34 33 33 33
2292 33 33 34 32 31 31 31 31 31 32 33 33 32 32 33 33 33 34 34 34 33 33 33 34 34 33 33 34 34 35 35 35 35 34 34 33 33 33 34 35 36 35 35 34 34 33 34 35 36 36 36 36 36 37 38 38 37 37 37 37 38 37 36 36 37 37 38 38 38 39 40
2285 40 40 40 40 41 42 42 42 43 44 44 44 44 43 43 43 44 44 44 44 44 44 44 45 45 45 45 45 44 44 44 43 43 43 43 43 43 43 42 43 44 44 45 45 45 45 45 46 47 47 48 48 47 46 46 46 47 47 47 48 48 48 49 49 50 51 51 52 53 54 55
2279 55 56 58 58 58 58 58 58 59 59 59 59 60 59 57 57 57 56 55 55 56 58 59 58 57 56 56 56 55 55 56 56 56 57 58 57 57 57 58 58 59 59 61 63 64 64 65 66 68 69 70 71 73 74 74 75 76 77 78 79 81 82 82 83 84 85 85 86 86 87 87
2273 87 87 88 89 90 92 93 95 96 96 96 98 99 102 104 106 109 110 112 114 116 119 122 124 126 128 129 131 133 135 137 139 141 141 142 143 144 145 146 146 147 149 152 155 159 161 163 164 165 166 168 170 172 174 176 177 179 181 183 185 187 189 190 193 195 198 200 203 206 210 214
2266 214 218 223 229 235 241 247 253 259 266 273 281 290 298 307 314 322 330 338 347 356 365 374 383 392 401 411 422 433 447 461 475 488 504 520 537 556 578 600 623 647 674 702 733 765 799 835 873
2262 873 914 958 1004 1055 1109 1167 1231 1299 1373 1452 1538 1630 1731 1838 1952 2073 2201 2338 2484 2640 2807 2988 3185 3397 3628 3881 4161
2259 4161 4471 4817 5205 5641 6131 6684 7310 8019 8821 9725 10740 11873 13128 14504 15995 17589 19266 20998 22752 24493
2258 24493 26175 27754 29184 30420 31424 32164 32617 32767 32611 32157 31422 30431 29219 27824 26288 24653 22960 21248 19552
2256 19552 17902 16322 14831 13440 12158 10988 9928 8976 8126 7374 6710 6126 5613 5164 4770 4422 4115 3841 3598 3380
2254 3380 3184 3005 2840 2688 2547 2414 2290 2173 2063 1957 1856 1760 1669 1581 1498 1419 1342 1269 1200 1137 1077 1021 969 920 874 832 793 757 722
2251 722 690 662 636 612 588 566 545 526 506 488 471 455 439 424 410 395 382 369 358 346 336 326 317 308 301 295 290 284 279 274 269 265 260 256 253 250 247 245 241 238 234 229 228 226 222 219 216
2247 216 212 211 209 207 205 202 199 197 195 193 190 187 184 182 180 178 177 175 171 169 166 164 161 158 153 149 146 142 138 134 130 127 123 119 116 114 111 109 107 105 104 103 101 100 100 99 98 97 97 97 96 95 94 94 93 91 89 88 87 87 86 84 82 80 79 78 77 77 77
2241 77 76 74 72 70 69 69 69 69 69 69 68 67 67 66 66 66 66 66 66 67 68 70 70 70 69 67 67 67 67 67 66 66 65 65 64 63 62 61 59 59 58 56 56 56 55 55 55 56 57 57 57 57 57 57 57 58 58 58 59 59 60 60 61 62 63 64 64 64 63 63
2234 63 63 63 63 63 62 61 59 58 56 55 53 51 50 49 49 48 47 47 47 47 46 46 45 45 45 45 45 45 44 44 43 42 42 41 40 39 39 40 40 41 41 41 39 38 36 36 36 35 35 34 33 32 31 31 32 33 34 33 33 32 32 32 33 34 34 33 33 34 35 34
2228 34 35 35 34 34 34 34 34 33 33 33 33 33 33 33 33 32 32 31 31 31 31 31 31 31 31 32 31 30 30 29 29 29 28 28 28 29 29 29 30 31 33 34 34 33 33 33 33 33 33 33 33 32 32 31 31 30 29 28 29 30 31 31 31 31 31 31 31 30 30 30
2221 30 29 29 29 28 28 28 27 27 26 26 25 25 25 24 24 24 25 26 26 27 28 30 30 30 29 28 29 29 29 30 30 29 30 30 31 31 31 31 30 30 28 27 27 28 28 29 31 31 31 29 27 26 27 27 27 27 27 27 26 26 26 27 28 28 29 29 28 27 27 27
2215 27 27 27 26 25 26 26 27 27 27 28 29 29 29 28 27 27 27 26 27 27 27 28 27 26 26 26 26 26 25 24 24 24 24 25 27 29 28 27 25 24 24 25 25 25 25 24 23 23 23 24 23 23 23 23 23 23 23 23 23 22 22 21 21 20 20 20 21 22 23 22
2209 22 22 22 24 25 25 26 27 27 28 27 27 27 27 27 26 26 26 26 25 25 25 25 25 25 26 26 26 26 26 26 26 26 26 25 25 25 24 24 24 24 23 23 22 22 23 23 23 24 24 25 25 25 26 26 25 24 24 25 25 26 26 26 25 24 24 23 22 22 23 24
2202 24 26 27 27 25 25 24 24 25 25 26 26 26 26 26 26 25 24 24 24 25 25 26 26 25 25 24 25 26 25 25 25 24 25 26 26 26 26 25 25 25 25 24 24 24 24 25 24 24 24 24 23 23 23 22 23 25 26 27 28 28 29 29 29 29 29 29 30 30 31 31
2196 31 31 30 30 30 31 31 32 33 34 35 36 37 39 40 40 40 40 40 40 41 43 45 47 49 52 55 57 59 62 66 70 75 79 82 88 94 103 112 120 129 137 145 153 163 171 178 183 187 190 193 193 191 187 184 178 173 167 160 152 143 133 124 115 106 99 91 85 79
2189 79 75 70 67 64 60 56 52 50 49 47 46 45 43 42 40 38 38 37 36 35 33 32 32 32 32 32 32 32 32 32 32 33 31 30 29 28 27 27 27 27 27 27 27 26 27 28 28 29 29 27 26 26 27 27 27 26 25 24 23 23 22 22 22 22 22 23 22 21 21 20
2183 20 21 22 23 23 23 23 23 22 22 22 22 22 22 22 21 20 19 18 19 19 20 20 19 18 18 17 18 20 21 21 21 20 21 22 24 24 22 20 19 19 20 21 21 21 21 22 21 21 21 21 21 22 22 23 22 22 22 22 21 20 19 18 18 19 21 22 22 21 21 20
2177 20 21 22 22 23 23 23 23 23 22 22 21 21 21 22 23 24 24 23 23 23 23 22 22 21 21 21 20 20 20 20 20 20 20 20 20 20 20 20 21 21 21 22 22 22 22 23 22 22 20 20 20 21 21 21 21 21 20 20 20 21 22 24 25 26 27 26 25 24 24 24
2170 24 24 24 23 23 22 21 21 21 21 21 21 20 20 20 20 20 21 21 21 21 22 22 22 22 23 22 21 20 20 19 19 20 21 23 24 24 23 23 23 23 23 23 23 23 23 23 22 22 21 20 21 21 22 22 23 23 23 23 23 23 24 25 25 25 24 23 23 23 23 22
2164 22 22 21 20 20 19 19 19 19 19 19 19 20 22 22 22 23 23 23 23 23 23 23 23 23 22 21 21 22 22 22 22 22 21 20 19 18 19 19 20 20 20 20 19 19 20 20 21 21 22 21 21 21 23 24 24 24 23 22 22 21 21 21 21 21 21 21 21 21 21 21
2157 21 20 20 19 18 19 19 20 20 19 19 19 21 21 22 22 23 23 24 24 25 24 24 23 23 23 23 23 23 24 24 24 24 24 24 24 24 24 24 24 23 23 23 23 23 23 24 24 24 24 24 24 23 23 22 22 22 22 22 21 21 20 19 19 18 20 21 22 22 21 21
2151 21 19 18 17 17 18 18 18 16 16 16 17 18 18 18 19 20 21 22 21 20 20 19 19 19 19 19 19 20 19 18 17 17 17 18 18 19 20 20 21 22 22 22 22 22 21 20 19 19 19 19 20 20 20 20 20 20 20 19 19 19 19 19 19 20 20 20 20 21 20 20
2145 20 20 19 18 17 18 18 17 17 18 20 22 23 24 24 24 22 20 19 19 19 19 19 19 18 18 18 18 18 18 18 18 18 18 17 18 18 18 19 19 19 19 18 18 18 18 18 18 17 17 17 17 17 18 19 20 20 19 19 19 19 20 20 19 19 19 18 18 19 19 19
2138 19 19 18 18 18 18 17 17 16 18 19 19 19 19 19 19 19 19 19 19 19 19 19 19 19 19 19 19 20 20 20 19 18 19 19 20 20 20 21 20 20 19 18 18 19 19 19 20 20 20 21 21 21 20 19 18 16 16 17 18 20 20 20 20 19 19 19 19 19 19 18
2132 18 19 19 19 18 19 21 21 20 19 19 18 17 16 16 17 18 18 18 18 17 18 18 18 18 17 17 17 16 17 18 19 19 18 18 18 18 18 18 18 18 19 19 20 21 20 20 19 19 20 20 20 20 19 19 19 19 18 17 17 18 18 17 17 18 19 19 19 20 21 21
2125 21 21 20 20 19 19 19 19 18 19 19 19 19 20 20 20 21 21 21 21 21 20 20 19 20 21 21 21 20 20 21 21 21 20 20 19 18 17 17 17 16 16 16 16 16 16 15 15 15 15 17 17 18 19 20 20 21 21 21 22 22 20 18 18 17 16 16 17 18 18 18
2119 18 19 20 20 19 17 16 14 14 14 15 16 16 17 18 18 18 17 16 16 17 18 18 18 18 17 17 17 17 17 17 17 17 17 17 17 16 17 18 19 20 20 20 19 19 18 18 18 18 18 18 17 17 16 16 16 17 17 18 19 20 21 21 20 19 18 19 19 20 19 19
2112 19 18 18 18 18 19 21 22 23 22 21 20 19 19 19 19 18 18 18 18 18 18 19 19 19 19 18 18 18 18 19 19 20 19 18 18 17 16 17 18 18 18 17 17 18 18 18 18 17 15 14 14 16 18 19 20 21 22 22 21 20 20 20 20 19 18 19 19 20 21 21
2106 21 21 20 19 18 18 18 18 19 18 16 17 18 19 20 20 21 22 23 23 23 21 20 19 20 21 21 20 20 19 18 17 17 16 15 16 16 17 17 17 17 17 17 17 16 16 15 14 13 14 14 14 15 15 16 17 18 20 21 21 20 19 19 19 18 16 15 15 15 17 18
2100 18 19 20 20 19 18 18 17 17 17 18 18 17 17 16 17 18 17 17 18 18 19 20 20 21 21 21 21 21 21 22 21 20 20 21 22 23 24 25 26 26 27 28 28 29 31 34 36 38 43 48 53 59 67 76 86 96 104 111 114 114 111 106 100 95 89 83 76 69
2093 69 63 56 50 44 40 36 33 30 28 27 25 23 21 21 21 22 21 20 19 18 18 19 20 20 20 19 19 18 18 18 18 18 19 19 19 19 19 18 18 17 17 17 16 16 16 15 16 17 17 17 17 17 17 17 17 18 19 18 19 19 19 19 20 20 20 20 19 19 19 20
2087 20 20 20 20 20 20 20 20 20 19 19 18 18 18 17 17 17 16 15 15 15 15 15 15 15 15 14 14 14 14 14 14 15 16 16 17 18 18 19 18 18 18 17 17 16 16 15 16 16 16 17 18 18 20 20 20 20 20 21 20 19 17 17 17 18 18 18 18 18 18 17
2081 17 18 18 18 18 18 17 17 16 16 16 16 16 15 15 15 15 16 16 16 17 17 17 17 17 17 17 18 19 20 19 19 19 19 20 19 19 19 19 18 17 17 18 19 18 17 17 16 15 14 14 15 16 16 16 17 17 16 16 15 14 15 15 15 16 16 16 17 17 17 16
2074 16 16 16 15 16 16 16 15 15 15 14 14 14 14 13 13 13 13 13 14 15 16 16 16 15 15 15 15 15 16 16 16 15 15 15 14 14 14 14 14 14 14 15 15 15 15 16 15 15 15 15 16 17 17 18 18 18 18 18 18 18 17 17 17 17 17 17 17 18 19 19
2068 19 19 18 18 17 17 16 16 15 14 14 15 15 15 15 15 14 14 14 14 13 14 14 14 15 16 17 18 19 19 19 18 18 18 17 16 15 16 16 17 17 17 17 16 16 16 17 17 18 18 19 18 17 17 17 17 17 16 16 16 16 15 15 15 16 16 16 15 15 15 15
2061 15 16 17 17 17 16 16 16 16 16 16 16 15 14 14 14 15 17 17 17 17 17 17 18 19 19 18 17 17 17 17 17 17 18 19 19 19 18 18 18 19 20 20 20 19 18 17 16 15 15 14 14 15 15 15 15 15 14 14 15 15 16 16 15 13 11 10 10 11 12 13
2055 13 13 14 15 16 15 16 16 16 16 16 16 16 17 17 18 18 18 17 16 15 15 14 12 12 12 13 15 15 15 15 15 15 14 15 17 19 19 18 18 18 18 18 18 18 17 16 15 14 14 13 13 13 13 14 14 15 15 15 16 15 15 15 16 15 15 15 17 18 18 17
2048 17 17 17 17 17 17 17 16 16 15 15 15 16 16 17 16 16 15 15 15 15 15 16 15 15 15 15 15 16 17 18 18 18 18 16 14 14 15 16 16 17 17 18 17 17 17 17 16 16 15 15 15 16 16 16 16 16 16 16 16 16 16 16 17 18 18 19 19 18 18 18
2042 18 17 17 17 16 16 16 17 17 17 16 17 18 18 17 17 18 18 17 17 18 19 20 19 18 17 16 15 15 16 17 16 16 15 15 15 16 16 16 16 16 16 16 16 16 15 15 15 16 17 18 18 19 20 19 18 17 17 18 19 20 20 19 18 18 18 19 20 21 20 20
2036 20 20 19 20 20 20 21 21 22 22 22 24 25 27 30 32 34 35 36 35 34 33 33 34 34 33 34 34 34 34 34 34 35 34 32 30 28 26 23 22 21 20 19 19 18 18 17 17 17 16 16 16 16 16 16 17 18 18 19 19 18 18 17 17 17 18 19 19 19 19 20
2029 20 20 19 18 19 20 20 19 19 19 19 18 19 19 20 21 21 20 19 18 17 17 16 15 14 15 14 13 13 14 15 15 14 14 14 14 13 13 14 14 14 15 15 16 17 17 18 18 17 16 15 16 16 16 16 15 14 13 13 14 14 14 14 14 15 15 16 16 16 17 16
2023 16 17 18 19 20 20 19 18 17 16 16 17 17 16 17 17 17 16 15 14 14 14 14 14 15 15 15 15 15 15 15 14 15 16 17 18 18 18 17 16 17 17 17 16 16 17 16 15 14 14 14 15 16 17 17 16 15 15 16 16 15 15 15 16 16 15 14 13 13 14 15
2016 15 16 16 16 17 17 17 17 17 17 16 16 15 15 16 17 17 17 16 16 16 16 16 15 16 16 16 16 16 17 17 19 19 18 17 16 15 15 15 16 16 16 17 19 19 19 17 17 18 19 19 18 18 17 16 16 17 16 16 15 15 15 16 16 17 17 17 17 16 16 16
2010 16 15 15 15 14 14 14 14 14 14 14 15 15 16 16 16 17 17 17 16 16 16 17 17 16 15 15 15 15 15 15 16 16 16 16 16 17 17 17 17 17 16 16 16 16 16 16 16 15 14 14 14 15 15 16 15 15 15 15 15 15 15 15 15 16 17 17 17 16 16 15
2004 15 14 14 14 15 15 15 15 15 15 17 17 17 16 15 15 16 16 16 16 16 17 19 19 18 18 17 16 15 14 14 13 13 13 14 15 15 15 15 15 15 15 16 17 17 17 17 17 17 16 16 16 16 16 15 14 14 15 15 16 16 15 15 15 15 15 15 15 15 15 16
1997 16 16 16 14 13 12 13 14 14 14 15 15 15 15 15 15 15 15 15 15 14 14 14 14 15 15 16 15 14 13 13 14 15 14 14 14 15 15 15 15 15 14 14 13 13 15 16 16 16 15 16 16 16 16 15 14 14 14 15 16 17 17 17 16 16 16 15 15 15 15 15
1991 15 15 14 14 14 14 13 13 12 13 13 14 14 15 15 15 15 16 16 16 17 17 18 17 16 15 15 15 16 15 14 14 15 17 18 18 18 18 17 16 14 15 15 15 14 15 15 16 17 18 19 19 19 19 19 18 17 16 16 17 18 17 16 16 16 17 17 17 16 17 17
1984 17 17 18 17 16 16 15 15 16 17 17 17 16 15 14 13 13 13 14 14 14 14 14 15 16 16 17 17 17 16 16 16 17 17 17 17 17 18 20 21 21 20 19 18 18 17 16 16 17 17 17 17 17 17 17 17 17 17 17 16 16 16 16 16 17 16 16 16 17 16 15
1978 15 15 15 15 15 14 14 15 16 16 17 17 17 16 17 18 18 17 17 16 16 15 16 17 18 18 16 14 14 14 14 15 15 15 16 16 16 16 15 15 15 15 15 15 16 15 16 17 17 16 15 15 14 14 14 14 14 14 14 14 15 15 16 17 17 17 17 16 15 14 14
1971 14 15 16 16 16 15 15 15 15 16 16 16 16 16 15 15 14 15 16 17 18 18 17 17 16 16 16 17 17 16 16 16 17 17 16 16 16 16 16 16 16 16 16 15 15 16 16 16 16 15 15 14 14 13 13 13 12 12 12 12 14 15 16 16 17 17 18 18 17 17 17
1965 17 17 17 16 16 17 17 17 16 15 14 15 15 16 16 16 15 14 13 14 14 15 16 17 17 17 16 16 16 17 18 18 19 19 18 16 16 17 18 18 17 16 15 15 15 15 16 16 15 16 16 17 17 17 16 16 15 16 17 18 19 18 17 17 16 15 13 13 15 17 17
1959 17 18 17 16 17 17 17 17 17 17 17 17 17 17 17 17 17 18 18 18 18 18 17 17 17 16 16 16 17 17 17 18 18 18 18 18 18 17 17 17 17 17 18 18 19 19 17 15 14 14 14 14 14 15 16 16 15 14 13 14 14 15 15 15 15 16 16 17 17 16 16
1952 16 15 16 16 17 17 18 18 18 17 17 17 18 17 16 15 14 14 15 16 17 17 16 16 16 16 15 15 15 15 16 16 16 16 16 16 16 16 16 15 14 14 14 15 16 17 17 18 18 18 18 17 17 16 16 15 15 16 16 15 13 11 11 12 15 17 17 17 15 14 14
1946 14 14 13 14 14 15 15 15 14 14 13 14 14 14 15 15 15 14 14 14 14 14 14 15 15 14 13 13 14 14 14 14 14 14 15 16 16 15 14 14 14 13 13 14 15 15 16 16 16 15 14 15 16 16 16 15 15 15 14 15 16 16 16 15 15 14 14 14 14 15 16
1939 16 16 17 17 18 17 17 16 16 16 17 16 16 15 16 16 16 16 16 15 15 15 16 17 18 18 17 17 17 16 15 15 15 15 14 13 12 13 14 16 16 14 14 14 15 15 15 14 14 14 15 15 16 16 16 16 16 16 16 16 16 15 14 14 13 14 14 15 16 17 17
1933 17 18 19 20 20 20 19 18 17 15 15 16 16 16 16 16 15 15 15 15 15 16 16 16 15 15 14 14 14 15 16 17 17 17 17 16 16 16 16 16 16 16 16 16 15 15 15 14 14 14 15 15 15 14 15 15 15 15 15 15 15 15 15 15 16 16 16 16 16 16 15
1926 15 15 15 15 15 14 13 12 11 12 12 12 13 13 13 13 13 14 15 16 16 16 15 15 15 16 16 16 16 16 16 16 15 15 15 15 15 15 14 12 11 10 10 11 12 13 13 13 13 14 14 14 14 14 14 13 13 13 13 14 16 16 16 17 17 17 18 17 16 15 14
1920 14 14 15 16 16 16 16 16 16 16 16 16 16 16 16 16 16 16 16 15 14 13 12 12 12 14 16 16 15 14 14 15 15 15 15 15 15 16 17 18 18 17 16 16 16 16 16 16 16 15 15 15 14 15 16 16 17 18 18 17 16 15 14 14 13 13 12 12 13 13 13
1914 13 14 15 16 16 17 18 17 17 16 15 15 16 18 19 18 18 17 16 15 14 14 13 13 13 14 15 16 17 17 17 17 18 17 16 15 14 15 16 17 18 17 15 15 15 15 15 15 14 13 13 14 14 15 15 14 14 14 14 15 16 16 16 15 15 15 15 15 15 15 15
1907 15 15 15 15 15 16 16 16 16 16 15 16 17 17 16 16 16 17 17 18 18 18 17 15 15 15 14 14 13 12 12 13 13 13 14 15 16 16 15 14 13 12 11 12 13 13 14 15 16 17 17 16 14 13 14 14 15 16 16 16 17 17 17 16 16 17 18 17 16 16 15
1901 15 14 13 13 15 15 14 13 13 14 15 15 14 14 14 15 16 17 16 15 16 15 15 14 14 14 14 15 15 15 15 15 15 15 16 15 14 14 15 15 14 14 14 15 16 16 16 17 17 17 16 15 14 13 13 14 15 15 14 13 12 12 13 14 15 16 15 14 13 14 14
1894 14 15 15 15 15 15 14 14 14 15 16 16 16 17 17 17 17 16 16 16 16 16 15 15 15 14 14 13 13 13 12 12 13 13 12 11 11 11 11 12 13 14 15 16 16 17 17 17 17 17 17 16 15 15 16 16 16 16 16 16 16 16 16 15 15 14 14 13 14 15 15
1888 15 15 15 15 15 15 15 15 15 14 14 13 13 13 14 15 15 14 13 11 11 11 12 13 13 14 14 15 15 14 14 14 13 13 13 12 13 13 14 15 15 15 15 14 14 14 15 16 16 15 14 14 15 15 15 15 15 15 13 11 11 12 13 14 15 15 15 14 14 14 14
1882 14 15 15 15 15 14 14 14 14 13 14 14 13 13 13 15 16 16 16 17 17 16 16 15 14 14 14 15 16 16 16 15 15 14 13 14 15 16 16 16 15 14 14 14 15 15 16 16 16 16 16 15 14 14 13 13 14 14 15 15 15 16 16 15 15 15 15 15 15 15 15
1875 15 16 16 16 15 14 14 15 16 17 16 15 15 16 17 17 17 16 15 16 16 16 17 17 17 17 16 17 18 19 18 16 14 14 13 13 14 14 14 14 15 14 13 12 11 12 13 14 15 15 15 15 14 15 16 17 18 18 19 18 17 16 15 15 15 14 13 12 12 12 13
1869 13 15 16 16 16 15 14 13 14 14 15 16 17 17 18 17 16 16 16 16 17 18 18 18 17 17 16 17 17 18 19 19 18 16 15 13 13 15 16 17 16 16 16 16 17 16 16 17 18 18 16 15 14 15 15 14 13 12 13 15 16 17 18 18 18 17 17 17 17 17 17
1862 17 18 19 20 21 20 19 17 16 16 16 16 15 16 16 17 18 17 17 17 16 17 18 18 15 14 15 17 17 16 15 15 16 16 15 15 15 15 15 15 15 15 14 14 13 12 11 12 12 13 14 14 15 14 13 12 12 12 12 13 15 15 15 15 15 15 16 16 17 16 16
1856 16 16 15 16 17 17 17 15 14 13 13 13 14 15 17 16 16 16 15 15 15 14 14 15 16 17 18 17 17 17 16 16 15 15 14 14 14 13 13 13 12 12 12 14 16 16 16 16 15 14 14 13 13 14 14 16 17 17 17 16 15 16 16 17 17 16 15 14 15 16 15
1849 15 15 14 14 13 13 13 12 12 12 13 13 14 15 15 16 17 17 17 17 17 16 16 16 17 18 18 18 17 18 18 19 19 18 18 17 16 15 14 13 14 15 16 16 15 14 13 13 14 15 14 13 13 13 13 14 14 14 14 14 14 15 15 16 16 16 16 15 15 15 14
1843 14 14 13 13 13 13 13 13 13 14 14 14 14 14 14 15 16 16 17 18 19 19 18 17 16 14 13 13 13 14 13 13 13 13 12 13 13 14 15 15 15 16 16 16 15 14 14 14 15 15 16 16 16 15 15 15 15 15 15 16 16 16 16 15 15 15 16 16 15 15 16
1837 16 17 17 17 17 18 18 17 15 14 14 14 13 12 12 13 14 14 15 15 15 15 15 15 16 15 14 13 12 12 13 14 14 14 15 14 13 13 12 13 14 15 17 17 17 16 14 14 14 14 14 14 14 14 14 14 16 17 18 18 18 18 17 16 16 16 15 15 15 15 15
1830 15 15 15 16 16 16 16 15 15 16 17 18 18 18 19 18 18 16 15 14 13 12 12 11 11 12 13 14 16 16 17 17 17 17 17 17 17 17 17 17 17 16 16 15 14 15 15 16 16 15 14 14 15 15 15 15 14 14 14 14 15 16 17 16 16 16 16 15 16 16 16
1824 16 15 15 15 14 14 14 14 14 14 14 14 14 15 16 16 17 16 16 15 15 16 16 17 17 17 16 15 15 15 14 14 14 14 14 14 14 14 14 14 13 12 12 12 13 14 15 16 15 13 12 12 12 13 13 13 14 15 16 16 17 18 17 17 17 17 17 15 14 14 14
1817 14 14 14 14 14 15 15 14 15 15 15 14 14 14 14 14 12 12 13 14 15 15 15 15 15 16 17 18 18 18 18 17 17 17 18 18 18 17 17 17 16 16 16 16 15 15 15 15 16 16 16 16 16 15 15 15 16 17 19 19 19 18 18 17 17 16 16 16 17 18 18
1811 18 18 18 18 18 18 18 18 17 18 17 17 17 16 15 14 13 14 15 16 17 18 18 18 17 17 17 17 17 17 17 17 17 16 16 15 15 15 16 16 16 16 17 17 17 17 17 17 17 17 17 17 17 17 17 17 17 16 16 17 18 19 18 16 14 14 15 15 15 15 15
1805 15 15 15 15 15 16 16 17 17 15 14 14 15 16 17 16 16 16 16 16 16 15 15 16 16 16 15 13 13 13 14 13 13 13 13 14 15 14 14 14 14 14 13 14 15 15 16 15 15 15 15 14 14 13 13 12 12 13 14 16 16 16 15 16 16 15 14 15 15 15 15
1798 15 16 16 17 18 17 17 16 16 16 16 16 16 16 16 17 19 20 19 17 16 15 14 14 14 15 15 16 17 17 17 17 17 17 16 15 14 15 15 16 16 17 18 18 17 17 17 17 16 17 18 18 17 16 15 15 15 16 17 17 17 17 18 18 19 18 16 14 14 13 13
1792 13 12 12 12 13 14 14 14 14 15 15 15 16 16 17 16 16 16 15 15 16 16 16 16 16 16 16 16 16 17 17 16 16 16 16 14 13 12 11 11 12 13 14 15 16 17 17 16 14 12 11 11 12 13 15 16 16 15 14 13 13 14 15 16 17 16 16 15 14 14 14
1785 14 15 16 16 17 17 17 16 16 16 16 17 17 16 16 15 15 15 15 14 14 14 14 14 14 13 13 12 12 12 13 13 14 14 15 15 15 15 14 14 13 14 14 15 16 17 17 16 15 15 15 15 13 13 13 14 15 16 16 16 16 15 14 14 13 13 15 16 16 17 16
1779 16 16 16 16 16 16 16 17 17 18 18 18 17 17 16 16 16 16 16 16 16 16 17 17 17 17 17 16 15 14 13 13 13 13 13 13 14 14 14 15 15 16 16 16 15 14 13 13 13 13 13 13 14 15 16 16 16 16 16 15 14 14 13 13 13 14 14 14 15 16 17
1772 17 17 18 19 19 19 19 18 19 18 18 18 18 18 17 17 17 17 17 16 16 16 16 15 15 15 16 16 16 16 16 15 15 15 15 15 15 15 15 15 14 14 14 14 14 15 15 15 16 16 16 15 15 15 15 14 14 15 16 17 18 18 17 17 18 19 19 19 19 18 19
1766 19 19 19 19 18 17 17 16 15 15 14 14 15 15 15 16 17 17 17 16 14 12 11 11 11 12 14 15 15 15 15 15 16 16 17 16 15 15 16 16 15 15 15 14 14 13 13 13 14 15 15 16 17 16 15 13 13 14 15 16 17 16 16 15 14 14 14 14 15 15 16
1760 16 16 15 15 15 15 16 16 16 15 14 14 14 14 15 15 16 16 16 16 16 17 17 18 18 18 17 16 15 15 15 15 15 15 15 15 15 15 15 16 16 16 16 15 15 15 15 16 16 16 17 17 17 17 16 17 17 17 16 15 15 16 17 17 17 16 15 16 16 16 17
1753 17 17 18 17 17 17 17 18 19 18 17 16 15 15 15 15 15 16 16 16 17 17 16 16 16 16 17 16 15 15 15 15 16 16 16 16 16 16 15 15 15 16 16 17 18 18 17 16 15 16 17 18 18 18 18 18 18 18 18 18 17 17 16 17 17 16 15 14 14 14 14
1747 14 14 14 14 14 15 15 16 16 17 18 17 17 16 16 15 14 15 16 18 18 18 17 16 15 16 16 16 17 16 15 15 15 16 17 17 17 15 14 15 16 16 15 15 16 17 17 17 16 16 15 16 17 18 18 17 16 16 16 16 16 16 16 16 17 16 16 16 16 15 15
1740 15 14 13 13 12 12 12 13 14 14 14 13 13 13 13 13 14 14 14 14 14 14 15 15 15 14 13 13 14 14 14 15 15 16 17 16 16 15 14 13 14 14 14 13 14 15 14 14 13 12 11 12 12 13 13 14 14 15 15 14 14 13 12 14 16 17 19 19 20 19 19
1734 19 17 16 15 15 15 14 15 15 15 14 15 15 16 16 15 14 13 13 13 14 14 15 15 16 16 15 15 15 15 16 16 17 16 16 16 15 15 17 18 19 17 16 16 16 16 16 16 16 15 15 15 15 15 15 15 15 15 14 15 16 16 16 14 13 14 15 15 16 16 16
1728 16 16 16 16 15 15 15 15 14 14 14 14 14 14 15 15 15 15 15 16 17 18 19 20 19 18 19 19 19 18 16 15 14 12 11 11 11 13 14 15 16 16 17 17 17 17 17 17 18 17 15 15 15 15 15 16 16 16 16 16 16 16 16 16 16 16 16 15 14 15 15
1721 15 15 16 16 17 16 16 16 16 16 17 17 18 17 16 16 17 19 19 19 19 19 19 18 17 17 19 20 20 19 17 17 18 20 20 20 20 20 19 19 19 18 18 18 17 17 16 17 17 17 18 18 18 19 19 19 19 19 19 19 18 18 18 18 18 17 17 16 16 16 16
1715 16 16 15 15 15 15 15 15 14 14 14 14 14 14 13 13 14 14 14 13 13 13 13 15 16 17 17 18 18 18 17 16 15 16 16 16 17 17 17 18 18 17 17 17 17 17 16 17 18 18 17 18 18 18 19 19 19 18 17 17 18 18 18 18 18 19 20 21 22 22 20
1708 20 18 17 18 19 18 18 18 18 18 17 17 17 17 17 17 16 16 16 17 17 18 18 18 19 18 18 18 18 17 16 16 17 18 18 16 15 14 14 15 15 15 15 15 16 16 16 16 16 17 18 17 16 16 16 15 15 15 16 16 16 16 16 17 16 15 15 15 16 16 16
1702 16 16 16 16 16 16 17 17 16 15 15 15 15 15 14 14 14 15 15 16 16 16 15 15 15 15 15 15 16 16 15 15 15 15 16 16 17 17 17 16 15 15 15 16 16 16 15 14 14 14 15 15 16 17 17 17 17 17 17 17 17 18 18 18 17 17 16 16 16 16 16
1695 16 16 16 16 16 17 17 18 18 18 17 15 13 13 14 15 15 14 14 13 13 14 15 16 18 19 20 20 20 19 18 17 17 16 15 15 15 16 17 17 16 15 15 17 18 18 18 17 16 16 16 16 16 16 15 15 16 16 15 15 15 16 17 18 18 17 16 15 14 14 13
1689 13 13 13 14 15 16 17 17 17 17 16 15 14 13 13 13 13 13 14 15 16 15 14 14 14 14 14 15 15 15 15 14 15 16 17 17 17 18 18 18 18 18 18 18 17 17 17 17 17 18 18 17 17 16 16 15 15 15 14 14 15 15 15 15 15 15 15 15 14 14 13
1683 13 14 14 15 15 15 15 14 14 14 15 16 16 16 16 16 16 15 15 14 14 14 14 14 14 15 15 15 14 14 14 14 14 14 14 15 15 15 15 16 16 16 16 17 17 18 18 18 18 17 16 16 17 17 17 17 17 17 17 16 15 14 12 12 12 12 12 12 12 14 15
1676 15 16 15 14 13 14 14 15 17 19 19 17 15 14 14 15 15 15 15 16 16 16 17 16 16 16 16 15 15 16 17 17 17 16 15 15 15 15 14 15 16 16 17 17 18 18 19 18 17 16 15 14 14 14 15 15 16 16 16 16 16 16 16 17 16 16 16 15 15 14 14
1670 14 14 13 13 13 13 14 15 16 16 15 14 13 14 15 15 16 16 15 14 13 14 14 14 14 13 13 14 16 17 17 17 16 15 14 14 15 16 16 16 17 18 19 19 18 17 16 17 18 18 17 16 16 16 16 15 15 16 16 17 17 17 18 18 18 18 18 17 15 15 16
1663 16 17 17 17 17 17 16 16 16 16 16 16 16 16 16 16 16 16 16 15 15 14 14 14 15 15 16 17 17 17 17 16 16 17 18 17 16 16 15 15 14 14 13 13 12 12 11 12 13 15 16 16 16 16 16 16 17 17 17 16 16 15 15 15 16 15 15 15 15 15 16
1657 16 16 15 16 17 17 17 16 15 15 15 16 18 18 18 18 19 18 18 18 18 18 19 20 19 18 17 18 18 17 15 16 17 18 18 17 17 17 18 18 18 17 16 16 15 15 15 16 16 16 15 15 16 16 17 18 19 19 18 17 16 15 14 14 15 17 17 16 15 13 12
1650 12 12 13 14 14 14 15 16 16 17 18 17 16 15 15 14 14 14 14 15 14 13 12 12 13 14 15 16 18 19 20 20 19 18 18 18 17 16 16 17 19 20 19 19 19 18 18 16 15 13 12 11 11 12 13 15 16 17 18 17 17 16 16 16 16 17 17 16 15 14 14
1644 14 15 17 17 17 16 16 15 15 15 15 15 16 15 15 14 13 14 15 15 14 14 14 14 14 14 15 15 15 15 16 16 16 16 17 17 17 18 19 19 20 19 18 17 16 15 14 15 16 17 17 16 15 14 13 12 12 12 13 14 14 14 14 15 16 17 18 17 17 15 14
1638 14 14 14 14 15 15 16 15 15 15 14 14 14 15 17 17 16 16 16 16 15 15 15 15 16 16 16 15 15 16 16 16 15 15 15 15 15 15 15 16 16 15 15 15 16 17 17 17 17 17 16 16 16 16 16 16 16 16 16 15 15 15 14 14 14 14 14 15 15 15 16
1631 16 16 16 16 17 17 16 16 17 19 20 20 20 19 18 17 17 17 17 18 18 17 16 15 14 14 14 14 13 14 14 15 15 15 14 14 13 13 13 12 12 12 13 13 13 13 14 15 15 16 16 17 18 18 17 17 17 17 16 16 16 15 15 15 16 16 16 16 16 16 16
1625 16 16 16 15 14 13 12 11 10 9 10 11 13 13 13 13 13 14 15 16 17 18 18 19 19 19 19 18 17 17 17 16 14 13 12 13 13 14 14 14 13 13 12 13 13 14 14 13 12 12 12 13 13 14 15 16 17 17 17 17 17 18 18 18 17 17 17 17 16 16 15
1618 15 15 15 14 14 14 15 16 17 17 18 16 14 13 11 12 13 15 16 18 19 18 16 15 14 15 15 16 17 18 19 18 17 17 17 17 17 16 15 14 14 14 14 14 14 14 14 14 14 14 13 13 14 15 15 14 13 13 12 12 12 12 13 14 15 15 15 16 16 16 15
1612 15 13 13 14 14 15 15 15 15 16 16 16 16 16 16 16 17 17 16 16 15 14 13 14 14 14 15 14 14 14 13 14 15 17 19 20 19 17 16 17 17 17 17 17 17 16 16 17 17 17 16 16 16 16 16 16 16 16 16 16 17 17 18 17 17 17 16 17 18 18 17
1606 17 16 16 17 19 19 19 18 18 18 17 17 17 17 17 16 16 15 15 16 17 16 15 14 14 16 17 16 15 14 14 14 15 15 16 16 16 16 16 17 17 17 16 15 14 14 15 15 15 15 15 14 14 14 14 14 14 14 15 16 16 16 16 16 16 16 16 17 17 15 13
1599 13 12 13 14 15 15 15 15 14 14 13 13 13 13 13 13 13 14 14 14 15 15 15 15 16 16 16 16 16 16 16 16 16 16 15 16 16 17 17 17 17 17 16 16 16 16 16 16 16 16 16 16 16 16 16 16 16 17 17 17 17 18 18 17 17 16 16 16 17 16 15
1593 15 14 13 14 14 14 14 14 13 14 14 16 18 19 19 19 18 17 16 15 14 13 12 13 13 14 15 15 14 14 15 17 17 17 16 15 15 15 16 15 16 17 16 17 17 17 17 17 17 18 19 18 18 17 18 18 17 16 15 15 16 16 16 16 17 18 18 17 16 16 15
1586 15 15 15 15 15 15 15 15 16 17 17 17 17 17 17 16 16 16 15 15 15 15 14 14 13 13 14 15 15 15 14 15 15 15 15 15 16 17 17 17 16 16 15 15 15 15 14 15 16 16 15 14 15 16 17 17 16 16 16 17 17 17 17 16 16 16 15 14 13 14 16
1580 16 17 18 18 18 18 18 18 17 17 16 16 16 16 17 17 18 17 17 16 16 17 17 17 17 17 17 17 16 17 17 17 17 17 18 17 16 15 13 15 16 17 18 18 17 18 18 18 18 17 16 15 15 16 16 17 17 16 15 15 15 15 15 15 14 15 16 17 18 17 17
1573 17 16 15 15 15 16 17 18 19 19 18 18 17 16 15 14 13 14 15 15 16 16 16 17 17 17 17 18 18 17 16 15 14 14 14 14 15 16 16 16 16 15 15 14 12 12 13 16 18 18 17 15 15 16 17 17 17 17 17 16 16 15 15 14 14 13 13 13 14 13 13
1567 13 13 15 15 15 14 15 15 15 14 14 14 14 13 13 12 12 12 13 14 14 14 14 14 14 14 14 14 14 14 14 14 14 15 15 15 16 17 16 16 17 17 18 18 18 18 18 18 18 18 18 18 18 19 19 18 18 17 16 16 17 18 18 17 16 15 15 16 16 17 17
1561 17 16 15 14 14 13 13 13 13 14 14 14 15 16 16 17 16 16 16 17 17 17 16 15 15 15 15 16 16 17 17 18 18 19 19 20 20 20 19 19 18 18 17 17 17 17 16 17 18 18 19 19 19 18 18 19 19 18 18 17 17 17 18 20 20 20 20 20 20 19 19
1554 19 19 18 18 18 18 18 18 18 18 17 17 16 16 17 17 17 17 16 16 15 15 16 16 16 17 17 17 17 17 18 19 19 19 19 19 20 20 19 18 17 17 17 17 17 17 17 17 17 16 16 16 15 16 17 18 18 18 18 17 17 17 17 18 17 16 16 16 16 16 16
1548 16 16 16 17 17 18 18 18 18 17 17 17 17 17 16 16 17 16 17 18 18 18 18 20 20 19 19 18 17 16 16 16 16 16 16 16 16 15 15 15 15 15 16 18 19 18 17 16 16 16 15 14 14 13 12 13 14 14 15 16 17 18 19 18 18 18 18 18 17 17 17
1541 17 16 16 15 15 14 15 15 14 13 12 13 14 16 17 18 17 15 14 13 13 13 13 14 14 14 15 15 16 16 16 17 17 17 16 16 16 15 15 14 14 14 14 14 14 14 14 14 14 15 16 16 16 16 15 15 14 15 15 17 18 18 16 15 14 14 14 15 16 16 17
1535 17 16 16 16 16 15 15 15 15 14 14 14 14 14 14 13 13 13 14 14 15 15 15 15 15 15 15 14 14 14 13 13 12 13 14 14 15 14 13 14 14 15 16 16 15 15 14 14 15 16 16 16 15 15 14 15 16 17 17 18 19 19 18 17 17 17 18 17 17 17 18
1529 18 18 17 16 14 14 14 15 15 15 15 15 15 15 15 16 16 16 17 18 18 17 17 17 17 16 16 15 14 15 15 16 16 16 17 17 17 16 17 17 17 17 16 16 15 16 16 17 17 18 18 17 17 18 18 18 17 16 16 15 14 14 14 15 16 16 16 16 15 14 15
1522 15 15 14 15 16 17 17 17 17 16 16 16 17 17 17 17 17 17 17 17 17 17 17 17 16 15 15 15 15 15 15 16 17 18 18 17 17 17 15 13 12 13 14 13 13 14 14 14 13 13 13 14 14 15 15 15 14 13 12 13 14 15 15 14 13 13 13 14 16 17 18
1516 18 17 16 15 14 15 15 15 16 16 16 16 17 17 18 18 19 19 19 19 20 19 19 18 17 17 17 15 16 16 16 17 17 16 16 15 15 17 17 17 16 16 16 16 16 16 15 16 17 17 16 14 13 14 15 14 14 13 12 12 14 16 17 17 16 15 14 13 14 15 16
1509 16 15 14 15 15 16 16 16 16 16 16 16 16 15 15 16 16 16 15 15 14 14 15 15 16 16 16 17 17 17 17 17 17 15 14 13 13 14 15 16 16 16 15 15 15 15 15 15 14 14 16 17 17 17 16 15 14 14 14 14 14 15 16 17 18 18 19 20 20 20 20
1503 20 19 18 17 17 17 18 19 19 18 17 16 16 16 16 17 17 17 16 15 15 16 16 16 16 16 15 15 15 15 14 14 15 16 18 18 19 18 18 18 18 17 17 16 16 15 15 15 14 14 15 16 16 16 15 14 13 13 13 13 13 14 16 16 17 16 16 15 15 15 15
1496 15 15 15 16 16 17 17 17 17 17 17 17 17 17 17 16 16 16 15 15 16 16 17 18 18 17 17 17 16 16 16 16 16 15 15 14 14 14 14 14 14 14 14 14 13 14 15 16 17 17 16 15 15 15 15 14 14 14 14 14 13 13 13 13 13 14 15 15 16 16 16
1490 16 16 17 17 17 16 16 15 13 12 12 13 14 16 15 15 14 14 14 14 14 14 15 15 15 16 18 17 17 16 15 15 14 15 15 16 15 14 15 15 15 16 17 18 18 17 17 17 16 16 16 16 15 15 16 16 16 16 15 15 14 14 15 16 17 17 17 16 16 16 16
1484 16 16 16 16 16 17 17 17 17 17 17 17 18 17 17 17 17 16 16 17 17 18 18 18 19 19 19 19 18 17 17 17 18 19 19 18 17 16 16 16 17 17 18 17 16 15 14 14 14 15 15 16 17 17 17 16 16 16 16 16 16 15 14 14 14 16 16 16 16 15 15
1477 15 16 16 16 16 16 15 16 16 16 16 16 16 15 14 14 15 16 17 16 15 15 15 16 16 16 16 17 17 17 17 16 16 17 18 19 20 19 19 18 18 18 18 18 17 16 15 14 13 14 14 14 14 14 15 16 17 17 18 18 18 17 16 15 15 15 15 16 16 16 16
1471 16 16 15 14 15 15 15 16 16 16 16 16 16 16 16 15 14 13 14 14 14 14 14 15 15 16 16 15 15 14 13 13 12 11 11 11 12 12 12 13 13 14 14 15 15 16 17 16 16 16 16 17 17 18 18 18 18 18 17 17 17 17 16 15 14 15 16 17 17 17 16
1464 16 16 15 15 14 15 15 15 15 15 14 15 16 17 17 16 15 14 13 13 13 14 15 16 17 18 19 19 18 18 17 17 18 18 18 17 17 16 17 17 16 15 15 15 15 15 15 16 16 16 16 17 17 17 17 16 16 18 19 20 20 20 21 19 18 17 16 16 17 17 17
1458 17 17 17 16 15 15 14 13 13 14 15 16 17 17 17 17 17 18 18 19 19 18 17 17 18 18 19 18 18 17 17 16 15 16 17 17 17 18 18 17 17 17 17 17 17 18 18 18 18 18 19 18 18 17 17 17 16 16 16 16 16 16 16 16 15 15 15 16 17 17 18
1451 18 18 18 17 17 17 16 16 15 15 16 16 16 16 16 16 16 15 14 13 12 12 13 15 17 18 18 17 15 15 16 16 17 17 17 17 18 18 17 16 16 16 16 17 17 16 16 15 15 15 15 16 16 16 16 17 17 17 16 15 15 15 15 16 16 17 18 19 18 17 17
1445 17 16 16 16 16 17 17 16 15 15 14 14 15 15 15 15 16 16 17 17 18 19 20 20 19 17 16 15 16 18 19 19 18 19 20 20 19 19 19 19 19 19 19 18 18 17 16 15 15 15 16 16 16 15 15 15 15 15 15 15 15 15 15 15 14 13 13 14 15 15 16
1439 16 16 17 16 15 15 14 15 15 16 16 17 17 17 15 14 13 13 14 15 15 15 16 17 18 19 18 18 17 17 16 17 17 17 17 18 18 18 17 17 17 17 17 17 17 16 16 16 16 17 17 17 17 17 18 18 18 18 17 17 17 17 18 18 17 17 16 16 15 15 14
1432 14 14 14 14 15 16 17 18 18 17 18 19 19 18 18 17 16 15 13 13 14 15 16 18 19 20 19 18 18 17 17 17 16 16 16 16 17 19 19 18 17 17 18 17 17 17 17 17 17 17 17 17 18 19 19 20 20 20 19 19 19 19 19 18 17 16 15 15 16 16 16
1426 16 16 15 15 14 14 14 14 15 17 19 19 20 20 19 17 16 16 16 17 18 18 17 16 15 15 17 17 18 18 19 19 19 19 19 19 18 19 19 17 16 15 14 14 15 16 16 16 16 16 16 16 16 15 14 14 14 15 15 15 15 16 16 17 17 17 17 16 16 16 16
1419 16 16 17 18 19 18 18 18 18 18 17 18 19 18 16 15 15 16 17 17 17 16 15 14 14 13 13 12 12 13 14 14 15 15 15 15 16 16 16 16 15 16 16 16 16 17 18 19 19 20 20 19 19 18 17 17 17 17 17 17 17 17 17 18 19 19 19 18 18 17 17
1413 17 16 15 16 17 17 16 16 16 16 16 15 13 13 14 16 17 17 16 16 17 17 17 17 17 17 17 17 17 17 17 17 17 17 17 17 17 17 17 17 17 17 16 16 17 19 19 19 19 20 20 21 21 21 20 20 20 20 19 19 19 19 19 19 18 17 16 16 17 18 18
1407 18 17 16 16 16 15 15 16 17 18 19 19 19 18 18 18 18 18 18 18 18 17 15 14 14 14 14 15 16 17 17 16 15 15 16 16 16 17 17 17 18 18 19 19 19 19 19 19 19 19 20 20 19 18 16 16 15 15 16 16 17 17 17 18 18 18 18 19 21 21 21
1400 21 21 21 22 21 20 19 19 18 18 18 19 19 19 20 20 20 20 19 18 18 18 17 17 17 16 16 15 15 16 17 17 18 18 19 18 17 16 16 17 17 16 15 15 16 17 18 17 17 16 16 17 18 18 18 18 18 18 19 18 16 15 14 14 14 15 15 16 17 17 17
1394 17 17 17 16 15 15 16 17 19 18 18 18 18 18 17 18 18 18 19 18 17 16 16 15 15 15 15 16 16 17 17 17 17 17 18 17 17 16 16 16 16 16 15 16 16 16 16 15 14 14 15 15 16 17 18 18 19 19 19 18 17 16 15 15 14 14 13 14 15 16 18
1387 18 18 18 18 18 17 17 17 16 16 16 17 18 18 18 18 18 18 18 19 19 20 20 21 19 17 15 15 16 16 16 17 17 18 17 17 17 17 16 16 16 16 17 18 18 19 19 20 20 21 20 19 17 16 15 15 15 15 16 17 18 18 18 18 17 18 19 19 20 20 20
1381 20 20 20 19 19 18 18 17 17 16 16 16 16 15 15 15 16 16 16 16 16 16 16 16 16 16 17 17 17 17 17 16 15 14 13 14 14 15 15 16 17 18 19 18 18 17 17 17 18 19 19 19 19 19 20 20 20 19 17 17 16 16 15 15 15 15 14 15 15 16 16
1374 16 17 18 19 19 19 18 17 17 16 16 15 15 16 16 17 18 18 18 18 19 19 19 19 19 18 18 18 17 17 17 17 17 17 16 16 16 16 17 19 19 19 19 19 20 19 19 19 19 18 18 17 17 17 17 18 18 17 17 17 16 15 14 14 15 15 16 16 17 17 17
1368 17 17 17 17 17 17 17 18 18 18 19 18 18 18 17 18 18 18 19 18 18 18 17 17 17 16 16 16 16 16 17 18 18 18 18 18 18 18 18 18 18 17 16 15 15 15 17 18 18 18 17 18 18 18 18 18 18 17 17 16 16 15 15 15 14 14 14 15 16 16 17
1362 17 17 18 18 19 18 17 17 17 18 19 18 18 19 19 19 18 18 18 17 17 17 16 16 16 16 16 17 17 16 15 15 14 14 14 15 16 16 16 16 16 17 17 18 18 18 18 17 17 18 18 17 17 16 15 15 16 16 17 17 17 16 16 16 15 15 14 15 15 15 15
1355 15 14 14 14 15 15 16 17 18 19 20 19 18 18 17 17 18 17 17 15 15 15 16 17 17 17 16 17 18 20 21 22 22 21 19 19 19 19 18 18 18 19 20 19 18 18 18 19 19 18 18 19 19 19 19 19 18 18 18 17 15 16 17 17 16 17 18 19 19 19 20
1349 20 21 21 21 20 20 20 20 20 20 19 19 18 19 20 20 21 21 21 20 20 20 20 20 20 21 23 23 23 23 23 21 20 19 18 19 20 19 19 19 19 19 19 19 19 19 19 19 19 20 20 20 21 21 21 20 19 19 20 20 21 21 21 21 21 22 23 23 22 22 22
1342 22 22 22 21 20 19 19 21 22 22 21 20 20 19 19 19 20 20 19 19 19 19 19 19 20 21 21 20 20 20 21 21 20 20 19 19 18 17 17 16 16 17 17 17 16 16 15 16 16 16 16 17 17 17 17 17 18 19 19 17 16 16 16 16 16 15 15 16 17 17 16
1336 16 15 15 15 16 17 17 18 18 18 18 18 18 18 18 19 19 18 18 18 18 19 19 20 20 20 21 20 20 19 18 17 17 17 19 20 20 20 19 18 18 18 18 18 17 17 18 18 18 18 17 18 18 18 18 19 19 19 20 18 17 17 16 16 16 17 18 18 19 20 20
1330 20 19 18 17 16 16 17 18 19 19 19 17 16 16 17 19 19 19 19 20 20 20 18 17 18 19 21 21 22 21 20 20 20 20 20 20 20 20 20 20 19 19 18 18 18 17 17 16 15 15 16 17 17 18 18 19 19 19 19 19 19 19 18 18 17 16 16 16 17 17 17
1323 17 18 18 17 16 16 16 16 17 17 16 15 15 16 16 16 16 16 16 16 16 17 17 18 18 19 20 19 19 20 21 20 19 19 19 19 19 18 18 17 17 17 17 17 16 16 17 18 18 19 19 20 20 19 19 20 21 23 23 23 23 23 23 23 23 23 23 22 22 21 19
1317 19 17 16 17 18 18 17 17 18 18 18 17 17 17 18 19 19 19 19 18 17 17 18 19 21 21 20 20 20 20 20 19 19 18 18 17 17 19 21 20 20 20 19 19 18 18 17 18 18 19 19 18 17 17 17 18 18 18 18 19 19 20 21 20 20 19 19 19 19 19 19
1310 19 19 19 18 18 18 18 18 19 18 18 19 19 19 19 18 17 17 16 17 17 18 18 19 20 20 20 20 20 19 19 19 20 21 21 21 21 20 19 18 19 20 21 21 21 21 22 24 25 26 27 27 28 30 32 35 39 42 45 46 48 47 46 45 44 41 39 37 35 33 31
1304 31 30 29 28 28 27 26 24 23 21 20 20 21 21 22 21 21 20 20 19 19 20 19 17 15 15 17 19 21 21 20 19 19 18 18 19 19 19 18 18 17 17 18 17 16 16 17 18 20 19 19 18 18 19 19 19 18 18 17 18 18 17 16 16 16 16 16 16 16 16 17
1297 17 17 17 17 18 18 18 19 19 19 19 19 19 19 18 18 18 18 19 19 20 19 19 18 18 18 18 18 18 19 19 19 20 21 21 21 20 19 19 19 18 18 18 19 19 19 19 20 20 20 20 21 22 23 24 23 23 22 22 22 22 23 22 22 21 21 20 19 18 19 19
1291 19 20 21 22 22 21 20 20 19 19 18 18 18 18 19 19 18 18 18 18 19 19 19 19 18 18 18 18 19 20 20 20 20 20 20 20 19 18 18 18 18 17 16 16 17 18 18 19 20 20 19 18 18 20 21 21 20 19 18 18 18 18 18 17 17 17 16 16 17 18 18
1285 18 18 18 17 17 17 18 18 18 18 19 19 19 19 19 19 20 20 20 20 20 20 20 21 21 21 20 20 20 20 20 20 20 20 21 21 21 21 22 22 22 22 22 22 22 22 21 21 21 21 22 22 23 22 22 20 19 18 18 19 19 20 21 22 23 23 22 22 21 21 20
1278 20 19 19 19 20 20 20 19 18 18 18 19 19 19 19 18 18 18 19 19 18 18 18 19 19 19 19 20 20 21 21 22 24 26 26 25 23 22 22 22 22 23 23 24 23 21 20 21 21 21 22 22 23 23 22 22 21 22 22 23 24 24 25 24 23 23 22 21 20 20 20
1272 20 20 20 19 19 19 20 20 20 20 20 19 19 20 20 22 22 22 21 20 19 20 20 21 22 21 21 21 21 20 19 18 17 17 16 17 18 19 19 19 19 19 20 20 21 20 19 19 18 18 19 19 20 20 20 21 22 21 21 23 24 24 23 21 21 21 21 21 21 22 23
1265 23 24 24 23 21 19 18 18 19 19 20 20 21 22 23 22 21 22 23 23 23 22 22 23 23 23 22 21 21 21 21 21 21 22 22 23 23 24 25 26 27 27 26 25 24 23 22 22 21 21 21 20 19 19 18 19 19 19 19 20 21 22 22 23 24 24 25 25 26 26 26
1259 26 26 26 25 25 25 26 26 27 27 28 30 32 33 34 35 37 39 41 44 48 52 56 61 65 66 65 64 61 59 56 52 48 45 43 40 38 34 32 30 29 28 27 26 25 25 25 25 25 26 26 25 24 23 22 22 21 21 22 22 23 23 23 23 23 23 23 23 22 22 21
1253 21 20 20 20 21 21 21 21 22 22 22 22 22 21 22 23 23 22 21 21 21 21 21 20 19 20 21 21 22 22 23 23 22 21 21 22 22 23 23 23 22 21 20 20 20 21 22 23 24 23 23 23 24 26 26 24 22 22 23 24 25 24 24 23 23 22 22 22 21 21 21
1246 21 22 23 24 25 25 25 24 24 24 23 22 22 22 22 22 22 22 22 23 23 22 22 22 21 21 20 20 19 20 20 21 21 21 21 22 22 23 24 24 23 22 21 22 22 21 20 20 20 20 21 21 20 21 21 22 23 23 24 24 25 24 24 24 24 24 24 23 22 21 20
1240 20 22 23 24 23 22 22 21 21 21 21 21 22 22 23 23 23 23 23 23 23 24 24 23 22 21 19 20 20 20 20 20 20 20 20 19 18 17 17 18 19 20 20 21 22 22 21 21 20 21 22 23 24 24 24 24 25 25 25 26 27 27 26 26 26 26 25 24 23 23 23
1233 23 25 26 26 25 24 24 25 25 26 27 28 28 29 29 29 29 29 30 30 30 32 33 33 33 34 34 34 35 35 36 36 36 36 37 38 40 43 46 49 52 55 57 61 66 71 78 87 97 108 121 137 155 175 198 224 249 270 287 298
1228 298 302 298 287 270 252 234 215 195 175 155 136 118 104 91 82 73 67 61 56 53 49 46 42 40 37 37 36 35 34 34 34 34 33 34 34 34 35 35 35 36 36 36 36 35 35 35 35 36 37 38 40 40 41 41 42 42 43
1223 43 44 46 48 49 49 50 50 50 49 48 47 46 44 43 41 39 38 37 36 35 35 34 34 33 33 32 32 32 31 30 30 30 31 31 30 30 29 28 27 26 26 26 27 27 27 27 27 27 27 27 27 28 28 28 27 27 28 28 28 28 28 28 28 28 28 27 27 27 28 29
1216 29 30 29 28 26 26 27 27 27 27 27 27 28 27 27 27 27 28 29 29 28 28 28 28 27 27 27 27 27 27 27 27 27 28 28 28 28 27 27 27 28 28 28 28 28 28 28 27 26 26 26 25 25 25 27 29 29 29 28 28 27 26 26 26 27 27 28 28 28 28 28
1210 28 28 28 28 27 28 28 28 29 28 28 28 28 27 26 25 24 25 25 26 26 26 25 24 23 24 24 25 25 25 25 26 27 28 29 28 27 28 28 28 29 28 27 27 27 28 29 30 30 29 28 28 28 28 29 29 30 31 30 29 28 28 27 27 27 28 29 29 30 29 29
1203 29 27 26 26 25 26 27 28 28 27 27 26 26 26 27 28 28 29 29 29 28 27 26 26 27 28 29 30 30 31 32 31 30 30 29 28 26 26 26 27 27 27 26 26 25 25 26 27 28 28 29 30 30 30 30 30 30 29 28 27 26 25 24 25 25 26 26 27 28 27 26
1197 26 26 26 26 26 26 25 26 27 27 27 27 26 26 26 27 27 27 28 28 28 28 28 28 28 28 28 27 27 27 25 24 24 24 24 25 25 26 27 29 30 30 28 28 27 27 27 28 28 28 29 30 30 31 31 31 32 32 32 32 32 32 32 32 32 32 33 33 33 34 35
1191 35 36 37 38 38 39 39 40 40 39 38 37 37 37 37 37 37 36 36 36 35 35 36 37 38 37 36 35 34 33 32 32 31 32 33 34 34 34 33 32 31 31 31 32 32 33 33 34 33 32 31 31 31 31 31 31 30 30 30 30 31 31 32 32 32 32 32 32 32 32 32
1184 32 33 33 34 34 33 33 33 33 33 33 32 32 32 33 33 33 33 32 32 32 33 34 34 35 35 34 34 34 34 33 32 32 32 34 35 36 36 35 35 35 35 35 35 36 36 36 36 36 35 35 35 34 34 34 33 33 33 32 32 32 33 35 37 38 38 37 37 36 36 36
1178 36 36 35 35 35 35 35 34 33 32 33 34 34 33 31 31 31 31 32 33 33 34 34 34 33 34 34 36 37 37 36 36 37 37 37 37 36 36 36 35 35 35 34 34 33 34 35 36 36 35 34 33 32 33 34 35 36 38 39 39 39 38 37 37 37 37 37 37 37 37 36
1171 36 37 37 37 38 38 38 38 39 38 37 38 38 36 34 33 34 35 35 35 34 34 35 35 36 36 37 37 38 38 39 40 40 39 38 39 39 39 39 39 38 38 37 37 36 36 37 37 37 37 38 38 39 39 39 41 42 43 42 41 41 40 40 40 40 40 40 38 37 37 37
1165 37 38 38 38 39 40 40 41 42 42 43 42 41 40 39 39 39 39 39 39 39 39 39 39 40 40 41 40 40 40 40 40 41 42 42 42 42 42 42 42 41 41 41 42 42 44 44 43 43 42 41 41 41 41 41 41 41 41 41 42 43 43 43 42 42 43 43 43 42 42 42
1158 42 44 45 46 46 45 45 45 45 45 45 45 45 45 45 44 44 44 44 43 44 44 44 45 45 45 44 44 44 45 46 46 45 44 44 46 47 48 49 49 48 47 45 45 45 45 45 46 46 46 46 46 47 47 47 47 47 47 48 47 46 47 48 48 49 49 51 52 51 51 50
1152 50 50 50 50 51 50 49 49 49 49 48 48 48 48 48 48 49 49 50 49 49 49 49 48 48 48 48 49 49 50 51 50 50 51 52 52 53 53 53 54 55 55 54 54 53 53 54 54 53 53 53 53 52 52 52 52 51 51 51 53 55 55 55 55 55 56 57 57 57 56 56
1146 56 57 57 57 58 58 58 59 59 59 58 58 58 57 57 57 56 56 56 56 56 57 57 58 59 59 60 60 61 61 62 63 63 63 63 62 62 62 62 61 61 62 62 63 63 63 62 61 61 61 61 62 62 62 61 61 60 61 62 63 64 64 65 65 65 66 66 66 66 66 65
1139 65 64 64 64 65 65 65 66 67 68 68 69 69 70 70 69 69 69 68 68 69 69 70 71 72 73 73 73 72 72 72 73 73 74 75 75 75 75 76 77 77 76 76 76 75 75 75 75 75 76 77 78 78 78 78 78 78 78 79 79 80 81 81 81 81 81 81 82 82 82 81
1133 81 81 81 81 82 83 84 83 83 83 83 83 83 83 83 84 85 86 87 87 88 89 88 88 88 89 89 89 90 89 88 88 87 87 87 87 87 87 86 86 85 86 86 87 87 88 90 91 93 93 94 95 96 97 98 98 97 96 94 95 95 95 96 96 96 97 97 98 99 100 101
1126 101 101 101 101 102 102 102 102 103 103 104 104 104 104 104 104 105 105 106 105 104 106 107 108 109 109 109 110 111 112 113 113 114 114 115 116 118 119 119 119 118 118 117 117 117 117 118 118 118 118 118 119 119 120 121 123 124 124 125 125 126 125 125 126 128 130 130 130 131 131
1120 131 131 132 133 134 135 135 136 136 136 137 138 139 139 140 141 141 142 142 143 143 143 144 144 146 147 147 147 148 149 150 150 149 150 151 152 153 154 155 156 158 159 159 160 161 161 160 159 159 160 162 163 164 165 166 168 169 170 171 172 173 173 174 175 176 177 179 180 180 180
1114 180 180 179 180 180 180 180 182 183 186 188 190 191 192 194 195 195 195 196 197 199 200 201 202 202 204 205 206 208 209 210 211 212 214 216 218 219 220 220 220 221 222 223 225 226 228 229 231 232 234 235 237 238 240 241 243 245 246 248 250 252 254 257 258 260 260 261 263 265 267
1107 267 269 271 272 275 277 280 281 281 282 284 286 287 288 289 291 293 296 298 300 302 304 306 308 309 311 313 315 317 320 323 325 327 329 331 334 336 339 342 344 347 349 352 354 357 360 362 365 368 371 374 377 380 383 386 388 391 395 398 401 402 405 409 414 416 419 422 425 429 432
1101 432 436 439 443 447 450 454 457 461 464 467 471 475 479 483 487 490 493 496 501 505 509 514 518 523 527 532 537 542 548 553 558 561 565 569 574 579 584 589 594 599 604 609 615 621 627 633 639 644 648 652 656 661 667 675 682 688 694 700 707 714 720 726 732 738 746 753 760 766 773
1095 773 781 789 797 803 808 814 821 828 837 845 853 860 869 878 887 896 903 911 919 926 934 942 951 959 967 976 984 993 1001 1010 1018 1026 1034 1042 1051 1061 1071 1081 1091 1100 1109 1117 1127 1136 1145 1154 1163 1171 1180 1190 1200 1209 1219 1228 1238 1247 1256 1265 1274 1284
1089 1284 1293 1303 1313 1322 1330 1338 1346 1355 1364 1372 1380 1386 1393 1400 1408 1415 1424 1432 1441 1448 1454 1462 1469 1476 1483 1488 1494 1499 1505 1510 1515 1520 1523 1527 1530 1534 1538 1542 1545 1549 1552 1555 1558 1562 1565 1566 1566 1567 1568 1569 1569 1569 1570 1569 1569 1567 1565 1563 1560 1557 1555 1552 1550 1547 1544 1542
1083 1542 1540 1536 1533 1528 1523 1518 1513 1508 1504 1499 1492 1485 1477 1471 1464 1458 1451 1444 1437 1429 1420 1413 1405 1398 1390 1382 1374 1365 1355 1346 1338 1331 1324 1316 1307 1298 1288 1278 1268 1259 1250 1240 1231 1221 1211 1202 1192 1183 1174 1165 1157 1147 1138 1129 1120 1111 1102 1093 1084
1078 1084 1075 1066 1057 1047 1037 1027 1019 1010 1001 992 983 974 967 959 951 942 933 924 916 908 900 892 884 876 867 859 850 841 831 823 817 811 803 796 789 782 774 767 761 755 748 742 735 728 721 714 707 701 696 690 684 678 673 667 661 654 648 643 638 633 627 621 615 608
1072 608 603 598 592 587 582 577 571 566 561 557 554 551 547 542 536 531 526 523 518 513 509 505 501 497 492 487 483 479 476 473 469 465 460 456 451 447 442 438 435 432 428 425 422 419 415 411 407 404 401 398 395 392 390 388 385 383 380 376 373 370 367 365 362 359 357 354 352 350 347
1066 347 344 342 339 337 334 332 329 326 324 321 318 315 312 310 309 307 305 303 300 298 296 293 291 290 289 287 285 283 281 279 277 274 272 270 269 268 267 266 264 261 259 256 254 253 253 252 252 249 247 245 243 241 240 238 236 235 233 231 230 229 228 228 227 226 225 224 222 221 219
1059 219 217 215 214 212 211 210 209 208 207 206 205 204 204 203 201 200 198 196 193 191 190 189 189 188 187 187 186 186 184 182 181 181 180 179 178 178 177 175 175 174 174 173 172 171 170 169 169 169 169 169 167 166 164 162 162 162 161 161 160 159 157 156 156 155 155 154 153 152 151
1053 151 150 149 148 147 146 145 144 144 145 144 144 143 142 141 141 141 140 139 137 135 133 133 132 133 134 134 133 131 130 130 131 130 129 128 129 130 131 130 129 127 125 123 121 120 119 118 117 118 118 119 120 120 120 119 118 116 115 115 114 114 113 113 114 114 114 114 113 112 112
1047 112 111 111 111 111 111 111 110 109 109 108 108 108 108 109 110 109 107 105 105 105 104 104 103 103 102 102 102 101 100 99 98 97 96 96 95 94 94 94 93 93 93 93 94 95 95 94 92 90 89 90 91 92 93 92 90 89 89 89 90 90 89 88 89 90 89 88 88 88 88
1040 88 88 87 86 86 86 86 86 85 84 83 82 82 81 81 81 81 81 82 82 82 82 81 81 81 81 80 79 78 78 77 77 77 78 79 79 79 78 77 76 75 74 75 75 75 76 75 74 74 73 73 72 73 74 75 76 75 75 74 74 73 73 73 72 72 72 72 72 71 71 70
1034 70 69 68 68 68 68 69 70 69 69 69 70 71 71 70 69 68 67 65 64 64 65 65 65 66 67 67 68 68 68 68 68 68 67 66 65 64 63 61 59 58 59 60 60 60 61 62 63 63 63 62 62 61 61 61 61 61 61 61 60 60 60 59 59 59 58 58 58 58 58 57
1027 57 56 56 55 55 57 59 59 59 59 59 59 59 59 58 57 55 55 55 56 56 55 54 54 55 55 54 53 52 52 52 53 53 54 53 52 51 51 50 50 50 49 49 50 50 51 51 52 52 51 51 51 50 49 49 48 48 48 48 48 48 49 49 50 49 48 48 47 47 47 47
1021 47 47 47 46 47 48 48 47 46 46 47 49 50 51 51 49 48 47 47 47 48 48 48 47 46 46 46 46 46 46 46 46 46 46 46 46 45 43 42 41 41 42 42 43 44 46 47 48 47 46 46 46 45 45 45 45 45 45 45 45 45 45 45 45 45 45 45 46 47 47 46
1015 46 45 45 44 43 43 43 43 42 40 39 39 39 39 39 40 40 40 40 40 41 41 41 41 42 43 43 41 40 40 39 39 40 40 41 41 41 42 42 42 42 41 41 42 42 41 40 40 39 38 37 36 36 37 38 38 38 39 39 40 40 41 40 39 39 40 40 40 40 39 39
1008 39 39 39 39 39 40 39 39 38 38 37 37 37 37 37 38 39 39 40 40 40 39 38 36 36 36 36 36 37 38 38 38 36 35 35 34 35 36 37 38 39 39 38 37 37 37 38 38 38 37 36 36 36 36 36 37 37 37 36 35 35 37 38 40 40 40 39 38 38 38 39
1002 39 39 38 38 37 37 36 35 36 36 36 36 36 36 35 35 35 35 35 35 35 36 36 36 36 36 36 36 37 37 37 37 37 36 35 35 35 35 35 35 35 35 34 33 32 32 32 32 33 34 34 34 33 33 33 33 34 36 36 35 34 34 33 32 32 32 33 34 34 34 34
995 34 34 33 32 31 32 33 34 34 34 34 33 33 33 33 34 34 34 34 34 34 33 33 33 32 32 31 30 29 28 28 29 31 32 32 31 30 29 29 28 28 29 29 29 30 31 32 32 33 34 34 33 33 33 33 33 33 33 32 31 30 30 30 31 31 32 31 31 31 31 30 30
989 30 30 29 29 28 28 28 28 29 29 30 30 30 30 30 30 30 30 30 30 29 29 30 31 32 31 31 30 29 29 29 29 29 28 28 28 28 28 28 28 28 28 28 30 31 32 32 31 30 31 31 31 32 32 32 33 33 32 31 31 31 31 31 31 31 31 31 31 31 31 32 33
982 33 34 34 33 33 33 33 33 34 34 34 32 31 31 32 32 32 32 31 31 32 34 34 33 32 32 32 32 32 33 35 36 36 36 35 36 36 36 36 36 36 35 35 35 34 33 32 31 31 32 32 32 32 32 31 31 31 31 31 31 29 28 27 26 26 27 28 28 28 30 31 32
976 32 31 31 30 29 29 28 28 29 29 30 31 31 32 32 32 32 32 31 29 29 30 32 33 32 32 32 31 31 31 31 31 31 30 30 29 29 28 28 27 27 27 26 26 26 26 27 28 28 29 29 30 30 30 31 31 31 31 31 29 27 25 24 25 25 25 26 27 28 28 27 27
969 27 27 28 28 28 29 29 29 29 29 29 28 27 26 26 26 26 26 25 25 25 25 24 23 23 25 26 27 27 26 26 26 26 25 25 26 26 27 26 26 26 25 25 25 25 26 27 27 26 25 25 26 26 26 26 27 28 28 28 28 28 29 29 28 28 28 28 28 27 26 26 26
963 26 26 27 27 28 28 28 26 24 23 24 25 25 25 25 25 24 24 24 25 26 26 27 27 28 28 27 26 25 25 26 27 28 28 28 28 27 27 28 28 27 27 27 27 27 27 27 26 26 26 26 26 26 26 26 25 25 23 23 24 24 25 25 25 23 23 22 22 22 22 22 22
956 22 23 24 24 25 25 25 26 26 26 26 26 25 25 25 26 25 25 25 26 26 27 28 28 29 28 27 26 25 24 23 23 23 23 23 24 24 24 24 23 24 24 24 24 24 22 22 23 24 25 24 24 23 23 23 24 25 26 27 26 26 26 26 25 24 22 22 22 22 23 23 24
950 24 23 23 22 22 23 24 25 25 26 26 25 23 22 22 22 21 21 21 20 20 21 22 23 24 23 23 23 23 23 23 23 23 23 23 24 24 23 22 21 21 20 19 20 20 20 21 20 20 19 19 19 20 21 22 23 24 24 23 21 21 22 22 23 23 23 23 24 24 25 26 26
943 26 25 23 22 23 23 24 24 24 23 22 22 22 23 22 21 21 21 21 22 22 22 22 22 22 22 22 22 21 22 22 21 21 21 21 21 21 22 23 23 22 21 21 21 21 22 23 22 22 21 20 20 20 21 21 21 22 22 22 22 22 23 23 22 22 22 22 22 21 21 22 22
937 22 21 20 19 19 19 18 19 19 20 20 20 21 21 21 20 20 20 20 21 21 21 22 22 21 21 21 21 20 20 19 20 20 21 22 21 21 20 20 19 19 18 19 20 20 20 19 18 18 17 18 19 21 21 21 21 22 22 21 20 19 20 20 20 20 21 21 21 21 21 21 21
930 21 20 20 20 20 21 22 22 22 21 20 19 19 19 19 18 19 20 19 19 19 19 19 19 19 19 19 18 17 17 18 20 22 22 22 21 21 21 20 19 19 19 19 18 18 19 20 21 22 22 22 21 20 20 19 18 19 20 21 21 21 20 20 20 19 19 19 19 19 19 19 19
924 19 19 20 20 19 18 17 18 18 19 20 21 22 22 21 20 20 20 20 21 21 21 21 20 20 20 21 21 21 21 21 21 22 22 23 23 24 24 23 22 22 21 21 21 21 21 21 22 22 22 22 22 21 20 19 19 19 19 20 19 19 18 18 19 20 21 22 22 22 22 21 21
917 21 22 22 23 24 24 24 23 22 20 18 16 15 16 18 19 19 20 20 20 20 19 20 20 21 21 21 21 21 21 21 21 20 20 20 19 18 18 18 18 18 18 19 19 19 20 20 20 21 21 21 20 19 19 19 18 18 18 19 19 20 20 20 20 20 20 19 18 18 18 17 17
911 17 17 19 20 21 20 20 20 20 21 21 22 22 22 21 21 21 21 21 21 21 21 21 21 22 22 22 22 21 21 20 19 19 21 22 21 21 21 20 20 20 21 22 23 23 22 22 22 22 22 21 21 20 20 20 20 20 20 20 21 21 22 22 21 20 19 18 19 20 20 20 21
904 21 22 21 21 21 22 23 23 24 24 25 25 25 24 24 23 24 24 24 24 25 25 24 23 22 21 22 22 23 24 23 22 22 22 22 22 21 21 20 19 20 21 21 22 22 22 22 22 22 23 25 25 24 24 23 23 22 21 22 22 23 24 23 23 22 22 23 25 26 27 28 29
898 29 29 29 29 29 29 30 30 31 30 30 30 30 29 29 29 29 28 27 27 26 25 23 22 20 21 21 21 22 21 21 21 20 22 23 25 26 27 27 27 27 26 26 25 24 24 23 22 22 21 20 19 18 18 19 20 21 21 21 21 22 22 22 21 20 20 21 21 22 21 20 21
891 21 22 22 22 22 21 21 20 20 19 19 20 20 21 21 21 21 22 24 24 24 23 23 24 24 25 24 24 24 24 23 21 21 22 23 23 22 21 21 22 21 21 20 19 18 17 17 19 20 20 20 20 19 19 19 19 19 20 20 20 20 20 19 19 20 21 20 20 19 19 19 19
885 19 20 21 21 21 21 21 20 20 19 18 18 18 18 18 18 18 18 18 19 20 20 20 20 19 19 20 20 21 21 22 22 22 22 22 21 20 18 18 18 19 19 20 21 22 22 22 21 21 21 22 21 20 20 19 18 18 18 17 17 17 17 18 17 17 17 17 18 19 19 20 20
878 20 20 20 20 20 19 18 18 18 18 17 16 16 15 15 15 16 16 17 17 18 18 19 19 19 19 19 19 20 21 20 20 19 19 19 19 19 18 18 18 18 18 19 20 20 20 19 19 18 17 18 18 18 19 19 19 19 19 19 19 19 18 19 19 20 20 19 18 17 17 17 18
872 18 18 18 19 19 19 18 18 18 18 18 18 18 17 16 16 17 17 17 16 17 19 19 19 19 19 19 19 19 19 18 18 17 17 16 16 16 16 16 16 17 17 18 19 19 19 19 18 18 18 18 19 19 19 19 20 20 20 19 21 23 25 25 24 24 25 25 24 24 23 22 21
865 21 21 22 23 23 23 22 22 21 20 21 21 21 21 20 19 19 20 22 23 22 20 19 18 18 19 20 22 22 22 21 20 21 22 22 23 23 23 22 21 21 21 22 23 22 22 21 21 20 19 19 20 20 20 19 19 19 19 19 19 19 20 21 21 21 20 20 20 20 21 22 23
859 23 22 21 22 22 23 23 23 23 22 22 21 20 20 21 21 20 21 22 23 24 24 24 25 26 26 26 26 26 27 28 30 31 32 33 35 36 38 40 42 43 45 48 52 56 61 66 71 77 84 92 102 112 120 128 135 141 144 145 145 143 139 133 127 121 114 108 99 91 83
852 83 77 70 64 58 53 49 45 42 38 36 35 34 32 31 30 28 27 27 27 26 25 25 25 25 26 25 25 25 24 24 23 23 23 22 21 21 20 21 21 22 24 24 23 22 21 20 19 19 20 21 21 21 21 20 20 19 18 18 17 17 17 18 18 17 16 16 16 16 15 16 17
846 17 19 20 20 20 19 18 18 19 19 20 18 17 16 14 14 14 15 15 15 15 16 16 16 17 17 18 17 16 16 16 16 16 17 18 18 19 19 18 18 18 18 19 19 20 21 21 21 21 21 20 20 20 20 21 21 21 21 21 20 19 20 21 21 20 18 18 19 20 21 22 23
839 23 24 23 22 21 20 20 19 18 17 17 17 17 16 16 15 16 17 16 15 14 13 14 15 16 18 18 17 16 17 18 19 19 19 18 18 18 18 18 19 19 20 20 19 19 18 18 18 18 18 18 17 18 18 18 19 19 19 18 18 18 18 18 17 17 17 16 15 15 14 15 15
833 15 15 15 15 15 16 17 17 17 16 16 17 18 18 18 18 17 17 16 16 16 17 17 18 18 19 20 20 21 20 20 20 20 20 19 19 19 18 18 18 17 19 20 21 21 21 20 19 19 19 19 19 19 19 19 21 23 25 27 27 28 28 29 29 28 26 26 28 29 29 29 28
826 28 28 28 28 28 28 28 28 28 28 27 27 26 25 25 26 26 26 26 25 24 23 22 22 21 21 20 19 18 18 19 19 18 16 16 17 17 17 17 17 18 19 20 21 20 20 20 20 20 21 20 20 20 19 19 19 19 18 17 16 16 17 18 19 20 21 22 21 20 19 20 21
820 21 21 21 20 19 19 19 18 19 19 20 20 20 20 21 21 21 20 20 20 20 19 19 19 19 20 20 19 18 18 18 19 20 20 21 21 21 21 21 21 22 22 22 22 21 19 19 20 20 21 21 22 22 21 20 19 19 19 19 19 20 21 21 21 20 19 19 19 20 20 21 21
813 21 20 20 19 19 20 20 20 21 21 22 22 22 23 24 24 24 23 22 22 22 21 21 21 20 20 19 19 19 20 20 20 21 22 22 21 20 21 22 21 21 21 21 21 21 21 22 23 24 25 26 25 24 23 24 24 24 24 25 25 24 23 24 25 24 24 24 23 23 22 23 23
807 23 24 24 24 24 23 22 22 23 23 22 22 22 22 23 23 23 23 22 21 21 21 22 23 24 24 24 25 25 25 24 24 24 23 23 23 23 22 22 22 22 22 21 21 21 21 21 21 21 21 22 22 23 25 26 28 30 31 30 30 31 31 32 32 33 34 36 36 36 37 37 39
800 39 41 43 46 47 49 50 52 56 59 63 67 71 74 79 85 92 99 107 115 125 135 147 158 169 179 186 190 190 189 185 180 173 166 158 150 140 130 120 110 101 94 86 79 72 67 62 59 57 55 53 50 48 46 44 43 41 39 37 36 34 34
795 34 34 34 33 33 32 31 31 30 30 30 29 29 29 29 29 29 29 30 28 27 27 27 27 27 26 25 25 25 25 25 24 23 24 25 25 26 27 27 26 24 24 24 24 24 23 24 25 26 27 28 28 29 29 30 30 28 27 25 25 25 26 27 28 27 27 27 26 26 26 25 25
788 25 25 24 24 24 23 24 25 26 26 26 25 25 25 25 26 26 26 27 28 28 29 29 29 30 30 30 30 30 28 27 27 27 28 28 28 28 28 28 28 28 28 28 27 27 26 26 27 28 30 32 33 33 33 32 31 31 31 31 32 32 33 33 33 33 34 34 33 33 33 33 33
782 33 33 33 33 33 33 33 33 33 33 33 33 33 33 32 32 31 30 29 30 30 31 31 32 33 33 33 33 33 33 34 34 34 33 32 32 33 35 35 35 35 36 36 36 36 36 36 35 35 35 35 35 36 36 37 37 37 38 38 38 38 39 41 41 41 40 40 41 41 41 41 42
775 42 41 40 39 39 40 41 40 40 41 41 41 40 40 39 38 39 39 39 39 39 40 40 40 41 41 42 42 42 42 42 42 42 43 43 43 43 43 43 43 43 43 43 42 43 43 43 42 41 41 42 43 43 44 44 44 43 43 42 42 42 43 43 43 44 45 46 47 47 47 47 47
769 47 48 50 51 52 53 54 54 54 54 54 55 56 56 56 57 57 58 59 61 63 65 68 70 72 74 77 79 81 84 88 93 99 103 108 113 119 128 137 147 159 173 187 200 214 227 237 243 244 242 237 230 222 212 202 191 180 169 158
763 158 147 137 129 122 116 112 109 106 105 105 107 110 114 118 123 128 131 133 134 133 130 126 122 118 114 110 105 100 95 91 86 82 79 75 74 72 70 68 67 67 67 68 68 68 68 69 69 69 69 70 70 71 71 71 71 71 71 71 71 71 71 72 72 73 74 75 76 77
757 77 76 75 76 78 81 83 84 86 88 90 91 93 94 96 99 105 112 118 125 132 141 151 163 177 192 205 215 221 224 223 219 214 209 204 198 191 184 177 171 165 159 154 150 147 146 146 147 148 150 154 157 161 163 166 168 171 175 179 185 190 197 203 209 215 222
751 222 230 239 249 256 264 272 279 286 291 295 299 304 310 316 322 328 332 335 339 344 349 355 361 366 372 377 384 392 400 406 413 419 425 430 436 439 442 443 442 440 434 425 413 399 385 372 358 344 328 312 297 283 269 256 245 235
746 235 226 216 208 202 196 189 183 176 169 163 156 153 149 145 141 137 133 129 125 121 118 115 111 108 104 102 99 97 96 92 89 86 82 80 78 76 74 72 71 70 69 69 69 69 66 64 62 61 62 63 63 62 62 61 60 59 58 56 54 52 51 51 50 50 50 49 48 48 47
740 47 46 46 46 47 48 49 49 49 48 47 46 44 44 45 47 47 47 46 44 42 42 42 42 41 41 41 41 42 41 41 40 39 39 39 39 39 39 38 37 36 36 36 36 36 36 36 36 37 36 35 35 35 35 35 34 32 31 31 31 32 33 34 34 34 35 35 34 34 33 33 33
733 33 33 33 32 31 30 30 29 29 28 29 29 29 29 29 29 29 30 30 31 31 31 32 32 31 30 30 29 28 28 28 28 28 29 30 31 30 30 29 28 28 27 28 28 30 31 31 32 32 32 32 31 29 27 26 26 27 27 28 29 29 30 30 30 29 28 27 26 27 28 29 31
727 31 31 30 30 30 30 30 31 33 32 31 31 30 30 30 29 30 31 32 32 30 29 28 30 31 31 31 29 28 26 25 26 26 27 27 27 28 27 26 27 27 27 27 27 27 27 28 28 28 28 28 27 28 28 27 25 25 26 27 28 29 29 30 28 27 27 27 27 27 27 27 26
720 26 25 24 24 25 26 26 25 25 25 25 25 25 25 26 27 27 27 27 26 26 26 25 25 25 26 26 26 26 26 26 25 25 25 25 25 25 25 24 24 24 24 24 24 22 21 21 20 20 19 20 20 21 21 22 22 22 20 20 20 20 19 18 18 17 18 19 20 19 19 20 20
713 20 21 21 21 21 21 21 21 21 22 21 21 21 21 20 19 19 19 20 21 21 21 21 20 21 21 20 20 20 20 21 21 21 20 20 20 20 21 22 22 22 21 20 19 19 20 19 19 20 21 21 20 20 21 22 22 22 21 20 20 20 21 20 19 17 17 16 16 16 15 15 17
707 17 18 18 18 17 17 17 18 18 17 17 17 18 19 20 21 20 18 18 18 18 17 17 17 16 16 16 15 15 16 17 18 17 17 17 17 17 16 16 16 16 17 18 18 17 15 15 15 15 15 15 15 16 16 15 16 17 18 19 19 19 19 18 17 17 17 17 17 18 19 19 18
700 18 18 18 19 19 19 19 20 20 19 18 16 16 17 16 16 16 16 16 15 14 15 16 16 15 15 15 15 15 15 15 15 15 15 16 15 15 15 15 14 14 15 17 17 17 17 16 17 17 17 17 17 17 17 18 18 18 18 18 19 20 21 22 21 20 19 19 20 20 20 19 19
694 19 20 20 20 21 21 22 22 23 23 23 23 23 23 23 23 23 23 23 23 24 24 25 26 27 28 28 28 28 28 28 28 28 27 27 27 26 26 26 25 25 24 24 23 23 22 22 21 21 21 21 21 21 20 19 18 19 20 22 23 22 21 21 20 20 21 22 24 25 26 25 24
687 24 24 23 22 21 20 20 20 20 20 20 20 20 20 19 19 19 20 21 22 23 24 24 25 26 25 25 25 25 25 25 25 25 25 26 27 26 24 23 23 24 24 23 22 22 23 24 24 25 26 26 26 27 27 27 27 28 28 28 29 31 32 33 33 32 32 31 31 30 30 28 27
681 27 26 28 29 29 27 26 25 23 22 21 20 19 19 19 19 19 19 18 18 19 20 20 20 19 20 20 19 19 19 19 19 18 17 18 18 19 19 20 21 22 23 23 23 23 23 24 24 24 23 22 22 22 22 22 22 22 22 22 23 23 24 24 24 23 23 22 22 22 23 24 24
674 24 24 23 22 21 20 20 19 19 19 19 18 18 18 18 18 18 18 19 18 18 17 17 17 17 17 17 17 16 15 15 14 14 14 14 13 13 14 14 13 13 15 16 16 16 16 16 15 15 14 14 15 16 16 16 16 15 16 17 18 17 16 15 15 15 16 16 16 15 14 14 14
668 14 14 14 14 15 16 17 18 18 18 17 17 17 17 17 17 17 17 17 17 16 16 16 15 15 16 16 16 16 17 18 18 18 18 18 19 18 17 16 15 15 15 15 15 16 16 17 17 17 16 16 15 16 16 15 14 14 13 13 13 12 11 12 13 14 15 16 17 17 17 16 15
661 15 15 14 14 14 14 14 15 15 15 15 14 14 15 17 20 21 20 18 17 16 16 16 17 17 15 14 14 14 14 14 14 15 15 15 15 14 14 13 13 14 16 17 17 17 18 18 18 19 18 18 17 17 17 18 18 19 19 19 18 16 16 15 15 15 16 18 18 19 19 18 18
655 18 17 17 17 16 16 17 19 20 21 21 20 18 17 16 16 16 16 16 17 16 16 16 16 16 16 17 18 18 19 18 18 17 16 16 15 15 15 15 15 14 14 13 12 12 12 12 12 12 12 13 13 14 14 14 14 14 14 14 13 13 13 13 13 14 14 15 16 17 17 17 16
648 16 15 15 14 14 14 14 14 14 15 15 15 15 16 16 16 15 15 14 14 15 15 15 15 15 15 13 12 10 11 12 13 13 13 13 12 13 14 15 16 16 17 18 18 19 18 18 16 15 16 16 15 15 14 13 13 13 13 13 14 16 17 19 19 19 19 19 18 18 17 17 17
642 17 16 15 15 15 15 15 15 16 16 15 14 15 15 15 14 13 14 14 15 15 15 15 16 16 16 15 15 16 16 17 17 17 17 16 16 16 16 15 15 16 17 17 17 17 16 15 14 14 15 15 15 14 14 13 12 13 15 16 16 15 15 15 15 15 15 16 16 16 16 16 16
635 16 16 16 16 16 16 15 15 15 15 15 14 13 13 12 12 13 13 14 13 12 13 14 15 16 16 16 16 16 16 15 15 15 15 14 14 14 14 13 14 15 15 15 15 15 15 16 16 16 16 15 15 15 14 14 14 14 13 13 13 13 14 16 17 19 18 16 15 14 15 15 14
629 14 14 13 12 13 14 15 14 13 12 12 13 14 13 14 14 14 14 14 14 14 13 13 12 13 15 16 16 16 16 16 15 14 13 13 13 12 12 13 13 13 14 14 14 14 14 14 14 13 13 13 13 13 13 13 14 14 13 12 12 13 14 14 14 14 15 14 13 12 10 9 9
622 9 10 12 12 12 13 13 13 12 12 14 15 15 15 15 15 14 14 13 14 14 14 15 14 12 12 12 14 14 14 13 12 11 10 10 9 9 10 12 13 15 15 14 14 14 13 13 13 14 14 14 14 14 15 15 15 15 15 14 14 15 15 15 15 16 16 16 16 17 16 16 15 14
616 14 14 13 13 13 13 13 13 13 13 13 13 14 14 15 14 14 13 12 13 13 14 15 16 15 14 13 13 13 13 13 13 13 13 13 13 12 13 14 14 13 14 15 15 15 15 15 15 15 15 15 15 15 15 14 15 15 15 15 15 15 14 13 12 11 12 12 12 13 12 11 11
609 11 10 11 12 12 12 12 12 12 12 12 11 11 12 12 12 12 12 12 12 12 11 10 10 10 11 12 13 13 13 12 12 12 13 13 13 13 13 12 12 12 12 12 11 10 11 12 14 14 14 15 15 15 15 15 15 14 14 13 13 12 12 12 12 12 12 11 11 12 13 14 15
603 15 15 15 16 16 16 15 13 13 14 15 15 15 14 13 13 14 12 11 11 10 11 12 12 13 13 13 13 13 12 12 12 12 13 14 15 14 13 13 13 13 13 13 13 13 13 13 14 14 13 13 13 13 14 14 14 13 13 12 13 13 14 15 16 16 16 15 15 15 14 14 14
596 14 13 13 14 14 14 13 13 14 15 15 16 15 15 14 14 13 12 12 12 12 12 13 13 14 15 15 15 15 14 14 14 13 13 13 12 13 13 13 12 12 13 14 14 13 12 11 11 12 13 14 13 13 14 15 15 14 14 14 15 15 15 15 15 14 14 13 13 13 12 12 12
590 12 11 11 11 12 13 13 13 13 14 14 13 12 12 13 13 13 13 13 13 12 12 12 12 12 12 11 12 12 12 12 12 13 13 13 13 13 13 13 13 14 14 14 14 13 12 12 13 13 12 11 12 13 13 12 12 12 13 14 14 15 16 16 15 14 13 13 13 14 15 15 15
583 15 14 14 14 14 13 13 13 13 12 12 11 11 12 12 12 12 12 12 12 12 13 14 14 14 14 14 14 14 14 13 13 13 13 13 13 13 14 14 15 14 14 14 13 13 14 14 14 13 13 12 12 12 12 13 14 14 14 13 12 11 12 14 14 15 15 15 15 15 14 14 14
577 14 13 14 14 14 14 13 12 12 13 14 13 13 13 12 12 12 12 12 12 12 12 13 13 14 13 12 12 11 11 12 13 14 13 13 14 15 16 16 15 14 14 14 13 12 12 13 12 12 12 13 13 12 12 12 13 14 13 12 12 12 13 14 15 15 14 14 14 14 14 14 14
570 14 14 14 14 14 13 12 12 12 13 14 15 15 15 14 13 13 14 15 15 14 15 15 15 16 16 16 15 13 13 14 14 15 15 15 14 14 14 12 10 8 8 10 12 13 13 14 15 15 15 15 14 14 14 13 13 13 14 14 15 14 13 14 14 15 16 15 14 15 15 16 16
564 16 16 16 16 15 15 14 14 14 14 14 14 14 15 15 16 17 18 18 17 17 16 15 14 14 14 14 13 13 12 12 13 14 15 16 15 14 14 13 13 14 14 15 14 13 13 13 15 16 16 16 16 15 16 17 17 17 17 18 17 16 15 14 14 14 15 17 18 18 17 17 16
557 16 15 15 14 15 15 15 15 17 18 17 17 17 16 15 15 15 14 14 14 14 15 16 16 15 15 15 15 15 14 14 15 17 17 16 15 15 15 14 14 15 15 16 16 16 15 15 15 16 16 16 17 18 18 17 15 14 13 13 13 13 13 13 13 14 15 15 14 15 15 16 16
551 16 16 15 14 14 15 16 17 17 17 16 16 16 16 17 17 18 18 18 18 17 18 18 19 19 18 17 16 15 15 15 16 16 15 15 15 15 15 15 15 16 15 15 15 14 14 14 14 14 14 15 15 16 16 17 18 19 18 17 16 15 14 13 12 11 12 13 14 15 15 14 14
544 14 14 14 14 14 15 15 15 16 16 16 15 15 15 15 15 15 15 14 14 15 15 16 16 16 17 16 17 18 17 16 15 16 16 16 15 15 15 15 15 15 15 17 18 19 18 17 17 17 18 17 17 16 16 16 15 15 15 15 16 16 16 16 17 17 17 17 18 18 18 19 19
538 19 20 20 19 19 19 20 22 22 21 19 20 20 20 18 17 17 18 19 18 18 17 17 18 19 20 21 22 21 20 19 19 19 19 19 20 21 21 22 22 22 22 22 22 23 24 25 25 26 26 27 27 28 28 29 30 31 32 33 34 36 35 35 36 37 38 39 40 41 40 40 39
531 39 38 37 36 36 35 35 34 33 32 32 31 30 31 32 32 31 30 31 32 31 30 29 28 27 26 24 24 25 25 26 27 27 27 28 28 29 30 30 28 27 27 28 29 30 31 31 32 33 33 34 35 36 37 38 37 37 39 41 43 44 45 48 51 52 54 55 57 58 59 59 58
525 58 57 55 54 53 51 50 48 47 45 43 42 40 38 37 35 33 33 32 31 30 30 31 32 32 30 29 28 26 26 25 25 24 24 24 23 23 23 24 25 25 26 26 27 26 25 24 24 24 25 24 25 25 25 26 26 27 27 27 27 27 28 28 29 29 30 31 31 32 32 32 32
518 32 34 35 36 35 35 35 35 35 35 34 33 32 32 31 31 29 27 25 24 23 23 23 23 24 24 24 23 22 21 20 20 20 20 20 19 19 19 19 19 18 18 19 19 20 20 20 20 20 20 20 20 20 19 20 19 19 19 20 19 19 19 19 18 17 17 17 19 20 19 19 18
512 18 19 19 20 20 21 21 20 18 18 19 19 19 19 19 20 20 20 20 20 20 19 18 17 17 18 19 19 20 20 20 20 20 20 18 17 17 18 19 19 19 18 18 18 18 18 18 18 18 17 17 17 16 16 16 16 15 15 15 15 16 16 16 17 17 18 18 18 18 17 17 17
505 17 18 18 19 19 19 20 20 20 19 19 18 18 18 18 17 18 18 18 18 17 17 18 19 19 19 19 19 19 20 20 20 20 21 22 22 22 23 23 22 20 19 17 18 20 21 22 23 23 23 24 24 23 22 22 21 20 19 19 20 21 21 21 21 22 23 22 22 21 22 22 22
499 22 21 21 21 21 21 20 19 18 18 20 21 22 22 22 22 22 21 20 20 19 19 19 20 20 20 20 20 21 20 18 17 18 19 20 19 19 19 19 20 20 20 20 20 20 20 19 18 17 18 18 19 19 18 18 17 17 18 18 19 20 19 18 17 15 14 14 15 16 16 16 16
492 16 15 16 17 18 19 18 17 16 15 16 16 17 17 18 18 19 19 18 18 17 16 17 17 17 17 16 16 16 17 16 16 16 15 16 16 16 15 14 13 14 15 16 17 17 17 16 16 17 17 18 19 18 18 17 16 16 15 15 14 14 15 15 15 15 14 15 16 17 17 17 17
486 17 17 17 16 16 16 16 17 17 16 15 15 15 16 17 16 16 15 15 15 15 16 16 15 15 14 13 13 12 12 12 13 15 17 17 17 17 17 17 16 16 15 15 14 13 13 13 13 13 14 15 16 15 13 13 14 14 14 14 15 15 15 16 16 16 16 16 16 16 15 14 14
479 14 14 14 14 13 13 13 12 13 13 13 13 12 11 12 13 14 14 13 12 11 11 11 10 11 12 13 14 13 12 12 11 12 13 13 14 14 13 12 11 11 10 11 12 12 12 13 14 14 14 13 11 10 9 10 10 10 9 10 11 12 12 13 13 13 13 13 13 13 12 12 12
473 12 12 11 11 11 11 11 11 11 12 12 13 14 14 14 14 14 14 14 15 15 14 14 14 14 13 12 12 13 15 16 15 14 14 14 14 13 13 13 13 13 14 14 15 15 16 16 16 16 15 15 15 14 14 14 15 15 13 12 12 12 13 13 14 14 14 14 15 15 14 14 14
466 14 13 14 14 15 15 15 14 14 13 13 12 11 11 11 12 12 13 12 12 12 11 12 13 14 15 15 15 15 14 13 12 12 13 15 16 15 14 14 14 14 14 14 14 14 14 14 14 14 14 14 14 14 14 14 13 13 13 13 12 12 12 12 12 12 12 12 12 13 13 13 14
459 14 14 15 14 12 11 10 10 9 9 8 9 10 11 12 12 12 12 12 12 12 12 12 12 12 12 12 13 13 13 12 11 11 12 13 13 13 13 14 14 15 15 16 16 15 15 15 15 14 14 13 13 13 14 14 13 13 12 12 12 11 12 12 12 12 13 15 16 17 15 14 14
453 14 13 12 11 11 10 9 8 9 10 11 12 13 14 14 14 13 12 13 13 13 13 13 12 12 13 13 14 14 14 14 15 15 14 14 14 13 12 12 13 14 15 14 14 13 12 11 11 13 15 15 15 14 14 13 13 13 13 14 14 14 14 14 13 12 11 11 12 13 13 14 14
446 14 15 14 13 12 11 11 12 13 13 13 12 12 12 13 13 13 14 14 14 14 14 14 14 14 13 13 14 13 12 11 11 10 11 11 12 14 15 16 16 15 15 14 13 14 14 15 15 15 15 15 15 15 15 14 13 12 13 13 14 14 15 15 15 16 16 15 14 13 12 12 12
440 12 13 13 12 12 12 12 12 12 12 12 11 10 10 11 13 14 15 16 17 17 16 15 14 14 14 13 13 13 13 13 13 13 13 13 13 12 12 13 14 14 13 13 12 11 10 10 11 11 11 12 12 13 13 14 14 14 14 14 13 13 12 12 11 11 10 10 10 10 10 10 12
433 12 13 13 13 12 12 12 11 12 12 12 12 11 11 11 11 12 13 14 14 14 14 15 14 14 13 13 13 12 12 12 12 12 13 14 14 14 13 12 11 11 10 10 10 9 9 9 10 12 14 14 14 13 12 11 11 10 10 10 10 11 12 12 12 11 11 11 11 12 13 13 13
427 13 14 14 14 14 13 12 12 13 13 14 15 15 16 16 16 15 14 14 14 14 13 12 12 12 12 12 12 13 13 14 14 14 13 13 13 12 12 12 12 13 13 12 11 11 11 11 12 12 12 12 12 12 13 13 13 13 14 14 13 12 12 13 14 14 14 13 13 12 12 11 11
420 11 10 8 9 9 9 10 12 13 13 12 12 11 11 11 11 11 12 13 13 12 11 10 11 13 14 14 14 13 13 13 12 12 13 14 14 15 15 14 13 13 13 13 13 13 13 13 14 14 15 15 14 13 11 11 11 12 12 13 12 12 12 12 11 11 11 11 10 10 11 11 12
414 12 13 12 12 12 11 10 10 10 11 13 13 13 12 12 13 14 15 15 13 13 12 11 11 10 9 10 10 10 10 11 12 12 13 13 13 13 13 13 13 13 13 13 12 12 12 13 13 12 13 13 12 12 12 11 11 10 9 10 11 12 13 14 14 14 14 14 14 13 12 12 12
407 12 13 14 15 15 13 12 11 10 9 9 9 10 11 11 12 12 12 12 12 13 13 13 13 13 12 12 12 12 13 12 12 13 13 13 14 14 14 15 15 14 14 14 14 14 13 13 13 14 14 15 14 14 14 13 13 12 12 12 11 11 11 11 11 12 12 12 13 13 14 14 14
401 14 14 14 14 15 15 16 16 15 14 13 12 11 11 11 11 10 9 10 11 13 14 13 13 12 12 13 14 15 14 12 12 11 11 12 12 12 12 12 13 12 12 12 12 12 12 11 11 11 11 12 12 12 11 13 14 13 12 12 11 10 10 10 12 15 15 14 13 12 12 12 12
394 12 12 12 13 13 12 12 12 12 12 13 12 11 12 13 14 14 13 12 11 9 9 9 9 9 10 11 12 13 13 13 12 12 11 10 10 10 10 10 10 10 10 11 11 11 11 11 11 10 10 10 10 10 10 11 10 9 8 8 9 10 10 11 11 10 11 12 12 12 12 12 13
388 13 13 13 13 14 14 14 13 13 13 13 12 12 12 11 12 13 14 13 11 10 10 11 12 12 13 13 13 14 14 13 13 12 12 12 12 12 11 10 11 11 11 10 9 10 10 10 11 11 11 11 10 11 12 12 12 12 12 12 11 11 10 11 12 12 13 13 13 13 13 13 14
381 14 14 14 14 13 13 12 12 12 12 12 12 13 13 13 14 14 14 14 14 14 14 14 13 12 11 11 11 12 12 13 13 13 13 13 13 12 11 10 10 10 10 10 10 10 10 10 10 11 11 11 11 11 11 11 10 10 10 10 10 10 10 10 10 10 9 9 10 10 10 11 11
375 11 12 12 12 12 11 11 10 10 9 10 11 11 11 11 11 12 12 13 13 13 12 12 11 11 11 11 11 11 11 11 12 13 14 13 13 13 13 13 12 11 11 11 11 12 12 12 11 11 12 12 12 11 10 9 10 11 12 12 12 12 12 12 12 11 10 9 8 8 9 9 10
368 10 10 10 10 10 9 9 9 9 10 11 12 12 13 13 13 14 14 14 13 12 12 12 12 12 13 13 13 14 13 13 13 13 13 12 12 12 12 12 12 12 12 12 12 11 11 11 12 13 13 14 13 12 12 12 12 12 12 11 11 11 12 12 12 12 12 11 11 10 10 9 10
362 10 11 12 12 13 14 14 13 12 11 11 11 11 11 11 11 11 10 10 10 9 9 10 11 12 12 12 12 11 11 11 11 12 12 12 11 11 11 12 12 12 11 10 10 9 8 8 9 10 10 10 11 11 11 11 11 11 11 11 10 11 12 11 10 10 11 12 12 11 10 10 10
355 10 11 10 10 12 13 13 12 11 12 13 13 11 10 10 11 12 12 13 12 11 12 13 13 12 12 12 12 13 13 13 12 11 11 10 11 11 12 12 12 12 11 9 9 10 10 10 10 10 10 10 11 11 11 12 12 12 12 11 11 10 11 12 12 12 13 13 12 12 12 11 11
349 11 12 12 12 12 12 13 13 13 12 12 11 11 11 10 10 10 10 9 9 10 11 12 13 13 14 13 13 13 13 13 14 14 14 13 11 11 11 11 11 11 11 11 12 12 12 12 13 13 13 13 13 13 13 13 13 13 13 12 12 12 13 13 13 13 12 12 11 12 12 11 10
342 10 10 9 9 8 9 10 11 11 11 11 11 11 11 12 12 13 13 13 13 12 11 11 12 13 14 13 14 14 14 14 14 13 13 14 15 14 14 12 11 11 12 13 13 13 12 12 12 12 12 11 11 11 11 12 12 12 12 12 12 12 12 11 11 11 11 12 12 12 12 11 11
336 11 11 11 12 13 14 14 13 13 13 13 13 14 14 13 13 12 12 12 13 15 15 15 15 14 14 13 12 12 11 11 12 13 14 15 15 14 13 12 12 12 13 13 13 14 14 14 13 12 12 12 12 12 11 10 9 8 9 10 11 11 12 12 12 11 11 12 13 12 12 12 12
329 12 12 13 12 11 10 11 12 13 12 12 11 11 11 11 11 11 12 11 10 9 10 10 11 11 10 9 9 9 9 9 10 11 12 13 12 11 12 13 13 13 12 12 12 13 12 11 10 12 13 14 14 14 14 15 14 13 13 13 13 12 11 10 11 11 11 11 11 10 10 9 9
323 9 9 9 9 9 9 9 10 10 10 11 11 13 14 15 16 16 14 12 10 9 8 10 11 11 10 9 9 9 10 11 11 12 13 13 14 14 15 15 15 14 13 12 10 10 10 10 10 10 10 10 10 10 10 11 11 11 10 10 10 11 12 13 13 13 12 12 12 12 13 13 14 14
316 14 14 15 14 13 12 13 13 13 12 13 13 14 16 16 16 17 17 17 16 15 14 13 13 12 12 11 11 10 10 10 10 10 10 10 10 10 9 7 7 8 9 11 12 12 12 11 11 11 11 11 10 10 10 11 13 13 13 13 14 14 14 13 12 11 12 11 11 11 11 12 12
310 12 12 11 11 11 11 11 12 12 11 11 11 10 11 11 12 12 12 12 12 12 12 11 11 11 11 12 13 13 12 12 11 10 9 9 9 9 8 8 9 9 9 8 8 7 8 8 9 9 10 10 10 11 12 12 12 13 14 13 12 11 11 11 10 10 11 11 11 12 13 14 15
303 15 14 13 12 12 12 11 11 11 11 11 11 11 11 11 11 10 10 11 11 11 11 12 12 12 13 12 12 11 10 10 10 10 10 10 10 10 11 11 11 10 10 9 9 8 9 9 9 9 9 11 11 11 11 11 11 11 10 10 11 12 12 12 12 12 12 12 11 10 10 11 12
297 12 13 15 15 13 11 9 9 9 9 9 9 10 10 10 10 10 9 9 10 12 13 13 12 11 11 11 11 11 10 10 9 9 9 8 8 8 9 10 11 11 10 10 10 11 12 12 11 10 9 8 8 9 9 9 8 8 8 9 9 9 9 9 10 11 12 13 13 13 12 12 12
290 12 12 11 11 11 11 10 10 11 11 12 12 12 11 11 11 11 11 11 11 11 11 12 12 12 12 12 11 10 10 11 12 12 12 12 12 11 10 9 9 10 12 12 12 11 10 9 9 8 7 8 9 11 11 12 12 13 14 13 13 13 13 13 14 14 13 13 13 13 11 11 11
284 11 11 11 11 11 11 10 10 10 10 10 11 11 11 11 11 11 11 11 12 12 13 13 14 14 14 14 14 14 13 12 11 12 12 11 10 10 11 11 11 11 10 10 10 11 11 11 11 11 12 13 13 13 12 12 13 13 12 12 11 10 10 9 10 10 11 12 12 12 12 12 12
277 12 12 11 11 10 10 9 9 10 11 11 10 10 10 10 9 10 11 12 12 11 11 12 12 13 13 14 15 15 16 15 14 15 15 15 15 13 11 11 11 12 14 13 13 12 11 11 10 10 10 10 11 11 9 8 8 9 11 12 12 12 11 11 10 11 11 11 12 12 13 13 12
271 12 12 13 14 15 14 13 13 12 13 14 14 14 13 12 12 11 11 11 11 11 12 13 13 13 12 11 11 12 12 12 12 12 12 12 13 13 13 13 13 12 13 13 13 12 11 11 11 12 12 12 13 13 12 12 11 10 11 11 11 12 11 11 11 11 12 13 14 14 12 11 11
264 11 10 10 9 10 12 13 12 11 11 11 10 11 11 11 12 12 12 12 11 12 12 12 12 13 13 13 13 13 13 12 12 11 11 10 10 10 11 12 11 10 10 9 9 10 12 13 13 12 11 11 12 13 14 14 13 12 12 11 10 10 10 11 11 10 9 9 9 10 11 11 12
258 12 12 12 12 12 12 12 12 12 12 11 12 12 12 13 13 14 13 12 11 11 12 12 12 11 12 13 14 14 13 13 12 12 12 12 12 12 12 12 12 11 10 9 8 8 9 9 10 10 9 8 8 8 8 8 9 9 9 9 10 10 10 10 11 11 12 12 11 10 10 10 10
251 10 10 11 12 11 10 10 11 12 12 12 12 11 11 11 11 11 11 11 12 12 13 13 12 12 11 11 11 11 11 11 11 10 9 9 9 10 11 11 10 9 9 9 9 10 11 11 10 10 9 9 9 9 9 10 11 12 12 11 11 10 11 11 11 10 10 11 11 10 10 10 10
245 10 10 9 8 9 9 10 9 9 9 10 11 12 13 13 13 12 11 10 10 10 10 11 13 14 14 14 13 12 11 10 10 11 12 12 11 10 11 12 11 11 11 10 10 10 11 11 10 9 9 10 11 12 11 11 9 9 9 10 11 11 11 12 12 12 12 11 12 13 13 12 12
238 12 12 12 12 12 12 13 14 14 14 14 15 15 14 14 14 14 13 12 12 13 15 16 15 15 14 14 14 14 14 15 15 15 15 15 14 13 13 14 13 12 12 11 11 11 10 11 12 13 13 13 13 13 14 16 16 15 13 11 10 10 11 11 12 12 13 14 14 14 14 13 13
232 13 13 14 14 14 13 12 11 10 10 11 11 11 11 10 8 7 7 8 9 9 10 10 10 11 11 12 13 13 12 12 12 13 13 12 11 11 11 11 10 10 11 11 11 12 12 12 12 12 12 12 11 11 11 11 12 13 14 14 14 13 13 12 11 10 9 9 10 11 11 11 10
225 10 10 10 10 10 10 11 11 11 11 11 11 11 12 12 13 13 13 12 11 12 12 12 12 12 12 12 11 11 11 11 11 11 12 12 12 13 13 13 13 13 12 12 12 12 12 12 11 11 11 12 13 14 13 12 11 11 11 10 9 10 10 11 12 12 12 12 11 11 10 10 10
219 10 11 12 12 12 12 13 13 12 11 12 13 14 15 15 14 13 13 12 12 13 11 10 10 11 11 11 11 12 12 12 12 12 12 12 10 9 10 10 10 10 10 11 12 13 12 10 9 9 9 10 10 10 11 12 13 12 10 9 9 10 10 12 13 13 12 11 12 12 12 11 11
212 11 11 12 12 13 12 11 10 9 9 9 9 9 9 9 8 9 9 10 10 10 10 10 10 10 11 12 13 12 12 11 11 10 10 10 10 10 11 11 11 12 12 13 13 12 11 11 10 9 8 8 9 11 12 13 14 14 13 13 13 14 14 14 13 12 11 10 9 9 10 12 12
205 12 12 12 12 12 12 12 12 12 11 10 9 9 9 10 10 11 11 11 11 11 11 11 11 11 10 10 10 11 11 12 11 10 10 11 11 10 10 11 12 12 12 11 11 11 11 10 10 10 10 10 10 10 10 10 10 10 10 10 10 10 11 11 11 12 13 13 13 13 12 13 13
199 13 14 14 14 14 14 14 14 13 13 13 13 14 14 14 14 13 13 14 13 13 13 13 13 13 13 12 12 11 10 9 8 7 8 8 8 8 8 9 9 10 10 11 11 12 12 12 13 13 13 13 12 11 11 12 12 12 11 10 11 11 12 11 11 10 10 10 9 10 12 12 12
192 12 13 13 12 12 11 10 10 11 11 11 12 12 12 13 13 12 12 12 12 12 12 12 12 12 13 13 13 13 12 12 12 11 11 10 11 11 11 11 11 11 11 11 11 10 9 8 9 11 12 13 13 12 12 12 12 12 12 12 12 11 10 10 9 9 9 10 11 11 10 9 9
186 9 10 11 13 13 12 11 10 10 10 10 11 11 11 11 12 12 12 12 11 11 10 9 8 8 9 10 10 11 12 13 14 14 13 13 13 12 12 11 12 12 13 13 12 10 9 10 11 11 12 12 12 13 14 13 12 11 11 12 12 12 12 13 14 14 13 13 13 13 12 12 11 11
179 11 11 11 11 11 11 11 10 10 11 11 10 9 9 9 11 11 12 12 12 11 11 12 12 12 12 12 12 12 11 11 10 10 11 12 12 12 12 12 12 11 10 9 9 9 10 10 11 11 12 12 12 12 12 12 12 12 12 12 12 12 12 12 12 12 11 10 9 10 10 10 11
173 11 10 10 10 10 10 10 10 9 9 9 8 8 8 9 9 9 10 11 11 12 12 13 12 11 10 9 9 10 10 11 11 11 11 10 10 9 9 9 9 9 9 10 11 12 12 11 10 11 11 12 13 13 13 14 13 12 12 12 12 12 13 13 13 12 12 12 12 11 11 11 11
166 11 11 10 9 9 9 10 10 11 11 11 12 12 12 12 11 10 10 11 11 10 10 9 10 9 9 10 11 12 13 12 11 10 10 11 11 10 10 11 12 12 12 11 11 10 9 10 10 11 11 12 11 11 11 12 12 13 13 12 11 10 9 9 8 8 8 9 10 12 13 12 11
160 11 11 10 10 10 10 10 10 11 12 12 12 11 11 10 10 10 10 10 10 9 8 8 7 7 7 7 7 8 8 8 9 9 9 10 10 9 9 9 10 11 13 13 14 14 13 12 11 10 10 10 10 11 12 12 11 10 10 11 11 11 12 12 12 12 12 11 10 10 12 12 12
153 12 12 12 11 11 11 10 9 8 9 10 11 12 13 14 15 14 13 12 11 11 10 10 11 11 10 11 13 14 14 14 15 16 16 15 15 14 14 14 13 12 11 10 10 9 9 9 10 10 10 9 9 9 9 9 10 9 9 9 8 9 9 9 10 10 10 9 10 10 12 13 14
147 14 14 13 13 13 13 13 13 13 14 14 13 12 12 12 12 12 11 10 10 10 11 12 11 10 10 10 12 13 12 12 12 12 12 12 11 11 11 11 10 10 10 9 9 9 9 9 9 10 10 11 11 11 12 12 12 13 13 12 12 12 13 13 13 13 13 13 13 13 12 11 11
140 11 12 13 14 13 13 11 10 10 9 9 8 8 7 8 8 9 11 11 11 10 9 8 8 9 11 11 11 11 10 10 11 11 11 12 12 12 12 12 12 11 11 11 11 9 8 8 9 11 12 13 13 12 11 11 11 12 13 12 12 12 13 13 13 14 14 14 14 13 13 12 12
134 12 11 11 11 11 11 11 10 9 10 10 10 10 10 9 9 10 9 9 8 8 8 8 9 10 12 12 11 10 10 12 12 12 11 10 11 11 11 11 10 9 9 10 10 11 11 11 11 10 10 9 10 10 11 11 11 10 10 10 11 12 12 11 10 11 12 14 13 13 13 12 12
127 12 11 11 11 12 12 11 10 9 8 8 8 8 8 7 7 9 10 10 10 10 10 10 10 11 11 11 12 12 11 10 10 10 11 12 13 12 11 11 10 10 10 10 10 10 10 10 10 10 10 11 11 11 11 11 12 11 11 10 10 9 9 9 10 11 12 13 12 12 12 10 8
121 8 7 7 8 9 10 10 11 11 12 11 10 10 11 11 11 10 10 10 10 11 11 11 11 11 12 12 12 12 12 12 11 11 10 10 9 9 8 9 9 9 9 8 8 7 7 8 8 8 8 8 8 8 8 9 9 10 11 11 11 11 12 11 11 11 11 11 11 11 10 10 10 11
114 11 12 12 12 11 11 10 11 11 12 12 11 11 10 10 10 10 11 11 10 10 10 10 10 9 8 9 10 12 13 14 14 13 14 15 14 13 12 12 11 10 10 11 11 12 12 12 12 12 12 11 11 10 11 11 12 12 12 12 12 12 12 12 12 13 14 15 14 13 13 12 12
108 12 11 11 10 9 9 9 9 10 11 11 11 11 11 11 11 11 11 12 12 12 12 12 11 11 10 11 12 12 12 11 11 10 9 10 10 10 11 11 11 12 12 12 12 12 12 12 12 13 13 13 14 13 13 12 11 11 12 14 15 15 14 12 12 12 11 10 9 9 9 10 11
101 11 12 11 10 9 10 10 10 11 11 12 12 11 11 11 11 12 12 12 12 12 11 11 11 12 12 12 12 12 11 11 11 10 10 10 11 11 11 10 10 10 11 12 12 11 11 11 12 12 14 14 13 12 12 13 14 14 14 14 15 15 14 12 11 11 12 13 13 13 12 12 14
95 14 15 15 14 13 12 11 10 10 10 11 11 11 11 12 12 11 10 9 10 11 12 12 13 12 12 11 10 10 10 11 11 11 12 13 13 13 12 12 11 11 11 11 10 9 8 9 9 9 10 10 10 10 10 11 12 13 12 11 11 10 10 10 10 9 10 10 10 10 9 9 10 11
88 11 11 11 10 10 10 10 11 12 13 13 12 12 11 11 11 10 10 10 10 12 13 14 13 11 10 10 10 10 11 11 12 11 11 10 9 10 11 11 12 11 11 10 10 9 9 8 8 8 10 11 11 11 9 8 7 8 8 9 9 9 10 10 10 10 9 9 8 9 9 9 10 10
81 10 9 9 9 10 11 11 12 11 10 9 8 9 9 10 10 10 11 11 11 11 12 12 12 12 12 12 12 12 13 12 11 11 11 12 11 11 11 11 11 12 12 13 13 13 12 11 10 9 9 9 10 11 11 10 9 9 9 9 9 9 9 9 9 10 11 11 12 11 11 10 10 10
75 10 11 11 11 12 12 12 12 12 11 11 11 11 12 13 13 13 13 12 12 12 12 13 13 13 13 13 13 12 12 11 11 11 11 11 11 11 11 11 11 11 11 11 11 10 10 10 10 10 10 10 10 10 10 9 9 9 9 9 8 9 9 10 10 11 11 11 12 12 11 11 11 11
68 11 11 11 11 11 12 11 12 13 13 13 12 11 10 9 10 10 11 10 10 10 10 9 8 9 10 12 13 12 12 12 12 11 11 10 9 8 9 10 11 11 10 10 10 10 11 11 10 9 8 9 9 9 9 9 9 9 10 10 10 12 14 14 13 12 12 12 13 13 12 12 12 11
62 11 10 10 10 9 9 9 10 10 10 10 10 10 10 10 10 11 11 10 9 9 9 9 10 10 10 10 10 10 10 9 9 9 9 9 9 10 10 11 11 11 11 10 10 10 10 11 11 11 10 10 10 10 10 9 8 8 8 10 11 12 12 12 11 12 12 11 11 11 10 10 10 10
55 10 10 10 10 10 11 11 12 12 11 10 10 12 12 12 11 10 11 11 11 11 10 10 10 10 11 10 10 11 12 11 11 11 10 11 12 12 12 11 10 9 8 8 8 8 9 11 11 11 11 11 11 11 11 12 13 15 16 16 15 14 13 13 13 13 13 13 13 12 12 11 11 12
48 12 12 13 13 13 14 14 14 13 13 12 11 12 13 14 15 15 15 15 15 15 15 15 15 16 17 16 15 15 15 15 15 14 14 14 14 13 14 14 14 14 13 13 13 13 13 14 14 14 14 15 15 16 17 18 19 19 18 18 18 18 18 19 21 22 23 22 21 21 20 20 19 20
42 20 21 22 23 24 26 28 29 30 32 33 34 37 40 43 47 50 54 59 65 72 79 89 100 112 125 138 152 167 181 193 202 208 210 205 197 187 177 166 155 143 130 117 104 91 80 71 63 55 49 45 41 37 34
37 34 31 29 28 26 25 24 22 20 20 20 19 18 17 17 18 18 19 19 20 20 18 17 15 13 13 12 13 13 12 11 11 10 11 11 12 12 13 13 13 12 11 10 10 10 10 10 10 11 11 11 11 11 11 10 11 11 12 12 12 12 12 12 12 12 11 11 11 10 10 10 9 8
30 8 9 9 9 10 10 11 12 13 12 11 11 12 12 12 12 12 12 12 12 11 11 10 10 10 11 11 12 12 11 9 9 10 11 11 11 10 10 9 9 9 9 9 9 10 11 11 11 11 11 12 12 12 12 11 10 10 10 8 7 8 10 10 11 11 11 11 10 10 9 9 8 8 8
24 8 8 8 9 9 9 9 8 8 8 8 8 10 11 12 11 11 11 10 9 9 10 10 10 11 11 11 10 10 10 10 9 9 10 11 11 10 9 9 10 11 13 13 13 13 13 13 12 13 13 13 13 11 11 11 12 12 12 13 12 12 11 11 11 11 11 11 11 11 11 10 10 9 9
17 9 9 9 9 8 8 7 8 9 10 10 10 10 11 12 12 12 12 12 12 12 11 10 9 8 8 9 10 10 11 11 10 8 7 6 6 7 7 8 9 10 10 10 10 10 11 11 12 11 10 9 10 11 9 8 8 8 8 10 11 12 11 11 11 11 11 12 12 12 12 12 12 11 10
10 10 10 10 10 9 8 7 8 8 8 9 9 9 10 11 11 11 11 12 12 12 13 13 13 13 13 13 13 12 12 11 11 12 12 11 10 10 9 9 9 9 10 10 10 11 12 12 13 13 13 13 13 13 12 12 11 12 12 13 14 14 13 13 12 12 11 10 10 10 10 10 11 11
4 11 11 10 10 11 11 11 11 11 12 11 12 13 14 13 12 12 12 12 12 13 13 14 14 14 14 13 12 13 13 13 12 11 11 11 11 11 11 12 12 12 11 11 11 11 11 11 11 11 11 12 12 11 10 10 11 12 12 12 11 11 12 13 13 12 11 12 13 14 14 13 12 12 12
-3 12 12 11 11 12 12 12 12 11 11 11 11 12 12 12 12 11 10 9 9 9 9 9 11 11 11 11 9 9 9 8 7 6 6 7 8 9 9 9 9 10 10 10 10 10 11 12 12 13 12 12 11 11 12 13 12 12 12 11 10 9 10 10 10 10 11 11 12 12 12 12 12 12
-10 12 11 11 11 11 12 12 11 10 11 12 12 12 11 10 10 9 9 10 10 10 10 10 11 11 11 10 11 11 11 10 9 9 9 8 9 11 11 11 11 11 11 10 10 11 11 11 10 10 12 13 13 13 13 12 12 12 12 12 12 12 12 11 10 9 10 12 13 14 13 13 13
$$ [...]
-2319G
##END=		$$ NMR SPECTRUM
##END=		$$ LINK
