##TITLE=	RP259_700.10.fid
##JCAMP-DX=	6.0	$$ MestReNova 14.3.3-33362
##DATA TYPE=	LINK
##BLOCKS=	1    
##ORIGIN=	Mestrelab Research S.L.
##OWNER=	hrzepa
##$MNOVA/METADATA=	(DOCUMENT,BASE64)
eyJuYW1lIjoiL1VzZXJzL2hyemVwYS9MaWJyYXJ5L01vYmlsZSBEb2N1bWVudHMvY29tfmFwcGxlfkN
sb3VkRG9jcy9TaGVwcGFyZC9OTVIgZmlsZXMgemlwcy0yLzE3LzE3LUgubW5vdmEiLCJwYWdlcyI6W3
siaXRlbXMiOlsiMSIgICAgIF19XX0=
##TITLE=	RP259_700.10.fid
##JCAMP-DX=	6.0	$$ MestReNova 14.3.3-33362
##DATA TYPE=	NMR SPECTRUM
##DATA CLASS=	XYDATA
##BLOCK_ID=	1
##ORIGIN=	Bruker BioSpin GmbH
##OWNER=	nmrsu
##NUMDIM=	1
##$MNOVA/METADATA=	(ITEM,BASE64)
eyJhbmdsZSI6MCwiYXhlcyI6eyJ4Ijp7Im1heCI6MTYuMDY0MjU5OTk5OTM5MTI1LCJtaW4iOi0zLjc
2Njk0MjMzOTE1NjYyMjZ9LCJ5Ijp7Im1heCI6ODAxMTMwLjY4NzUsIm1pbiI6LTcyNzc4LjgxNzAwNT
E1NzQ3fX0sInBvaW50cyI6W3sieCI6NTMyMSwieSI6NTgzNX0seyJ4Ijo4NzIyLCJ5Ijo1ODM1fSx7I
ngiOjg3MjIsInkiOjgyMDh9LHsieCI6NTMyMSwieSI6ODIwOH0seyJ4Ijo1MzIxLCJ5Ijo1ODM1fV0s
InoiOjB9
##.OBSERVE FREQUENCY=	700.35432466099996418
##.OBSERVE NUCLEUS=	^1H
##.SOLVENT NAME=	CDCl3
##.PULSE SEQUENCE=	zg30
##LONGDATE=	2022/10/18 11:47:53.000
##.ACQUISITIONMODE=	SIMULTANEOUS (DQD)
##$ORIGINAL FORMAT=	Bruker XWIN-NMR
##$MNOVA/SCALES_VERSION=	9
##$PARAMETER FILE=	(acqus, ASCII, /private/var/folders/f6/rjf_tdyn2v98c5c0wvkgn4s80000gq/T/jAZCv6hOQBK1RpGLLGhXSQ/10/acqus, 0)
$$ ##TITLE= Parameter file, TopSpin 4.1.3
$$ ##JCAMPDX= 5.0
$$ ##DATATYPE= Parameter Values
$$ ##NPOINTS= 1	$$ modification sequence number
$$ ##ORIGIN= Bruker BioSpin GmbH
$$ ##OWNER= nmrsu
$$ $$ 2022-10-18 11:48:16.638 +0100  nmrsu@CZC7167VR1
$$ $$ Z:/700/data/tds/nmr/RP259/10/acqus
$$ $$ process C:\Bruker\TopSpin4.1.3\prog\mod\dirdata.exe
$$ ##$ACQT0= -2.72930806226526
$$ ##$AMP= (0..31)
$$ 100 100 100 100 100 100 100 100 100 100 100 100 100 100 100 100 100 100
$$ 100 100 100 100 100 100 100 100 100 100 100 100 100 100
$$ ##$AMPCOIL= (0..32)
$$ -1 0 0 0 0 0 0 0 0 0 0 0 0 0 0 0 0 0 0 0 0 0 0 0 0 0 0 0 0 0 0 0 0
$$ ##$AQSEQ= 0
$$ ##$AQ_mod= 3
$$ ##$AUNM= <au_zg>
$$ ##$AUTOPOS= <14 >
$$ ##$BF1= 700.349999998
$$ ##$BF2= 700.349999998
$$ ##$BF3= 700.349999998
$$ ##$BF4= 700.349999998
$$ ##$BF5= 700.349999998
$$ ##$BF6= 700.349999998
$$ ##$BF7= 700.349999998
$$ ##$BF8= 700.349999998
$$ ##$BWFAC= (0..63)
$$ 0 0 0 0 0 0 0 0 0 0 0 0 0 0 0 0 0 0 0 0 0 0 0 0 0 0 0 0 0 0 0 0 0 0 0 0
$$ 0 0 0 0 0 0 0 0 0 0 0 0 0 0 0 0 0 0 0 0 0 0 0 0 0 0 0 0
$$ ##$BYTORDA= 0
$$ ##$CHANFCU= (0..24)
$$ 0 1 0 0 0 0 0 0 0 0 0 0 0 0 0 0 0 0 0 0 0 0 0 0 0
$$ ##$CHANREC= (0..24)
$$ 0 0 0 0 0 0 0 0 0 0 0 0 0 0 0 0 0 0 0 0 0 0 0 0 0
$$ ##$CHEMSTR= <none>
$$ ##$CNST= (0..63)
$$ 1 1 1 1 1 1 1 1 1 1 1 1 1 1 1 1 1 1 1 1 1 1 1 1 1 1 1 1 1 1 1 1 1 1 1 1
$$ 1 1 1 1 1 1 1 1 1 1 1 1 1 1 1 1 1 1 1 1 1 1 1 1 1 1 1 1
$$ ##$CPDPRG= (0..8)
$$ <> <> <> <> <> <> <> <> <>
$$ ##$D= (0..63)
$$ 0 1 0 0 0 0 0 0 0 0 0 0 0 0 0 0 0.0002 0 0 0 0 0 0 0 0 0 0 0 0 0 0 0 0
$$ 0 0 0 0 0 0 0 0 0 0 0 0 0 0 0 0 0 0 0 0 0 0 0 0 0 0 0 0 0 0 0
$$ ##$DATE= 1666090073
$$ ##$DATE_START= 1666090029
$$ ##$DE= 10.77069
$$ [...]
$$ ##$ShimPowRng3= (0..63)
$$ 1 1 1 1 1 1 1 1 1 1 1 1 1 1 1 1 1 1 1 1 1 1 1 1 1 1 1 1 1 1 1 1 1 1 1 1
$$ 1 1 1 1 0 0 0 0 0 0 0 0 0 0 0 0 0 0 0 0 0 0 0 0 0 0 0 0
$$ ##$ShimPowType1= 8
$$ ##$ShimPowType2= 8
$$ ##$ShimPowType3= 0
$$ ##$ShimPowType4= 0
$$ ##$ShimPowType5= 0
$$ ##$ShimPowType6= 0
$$ ##$ShimPowType7= 0
$$ ##$ShimPowType8= 0
$$ ##$ShimSysActGrad= (0..63)
$$ 1 2 3 4 13 5 7 11 10 9 6 8 12 18 19 20 21 15 22 23 24 14 25 16 26 17 27
$$ 28 31 32 33 34 35 36 37 38 0 0 0 0 0 0 0 0 0 0 0 0 0 0 0 0 0 0 0 0 0 0
$$ 0 0 0 0 0 0
$$ ##$ShimSysAngle= <>
$$ ##$ShimSysFunc= (0..63)
$$ 1 2 3 4 5 6 7 8 9 10 0 37 38 35 16 15 14 13 12 11 28 27 26 25 24 23 36
$$ 22 30 29 20 21 34 33 32 31 17 18 19 0 0 0 0 0 0 0 0 0 0 0 0 0 0 0 0 0 0
$$ 0 0 0 0 0 0 0
$$ ##$ShimSysMatId= <292722da.dat>
$$ ##$ShimSysMatrix= 1
$$ ##$ShimSysMinMaxUG= 130000
$$ ##$ShimSysOffset= <29 mm>
$$ ##$ShimSysType= 4
$$ ##$ShimUnit= 3
$$ ##$SpectrOsVersion= <4.1.156.20210628>
$$ ##$TCubeEth= <192.168.180.38>
$$ ##$TCubeSeqDevice= <>
$$ ##$TOSITY= <no>
$$ ##$TRIPLO2= 0
$$ ##$TopSpinVersion= <TopSpin 4.1.3>
$$ ##$TrxFreqFormula= (0..23)
$$ <TrxFreqFormula(2.0,700350000.000000,'TRX',Trx(1.0,'TRX 1200.1',1,5.000000,1290.000000))>
$$ <TrxFreqFormula(2.0,700350000.000000,'TRX',Trx(1.0,'TRX 1200.2',1,5.000000,1290.000000))>
$$ <TrxFreqFormula(2.0,700350000.000000,'TRX',Trx(1.0,'TRX 1200.3',1,5.000000,1290.000000))>
$$ <> <> <> <> <> <> <> <> <> <> <> <> <> <> <> <> <> <> <> <> <>
$$ ##$TrxPN= (0..23)
$$ <Z148391> <Z148391> <Z148391> <> <> <> <> <> <> <> <> <> <> <> <> <> <>
$$ <> <> <> <> <> <> <>
$$ ##$TrxSN= (0..23)
$$ <00336> <00337> <00342> <> <> <> <> <> <> <> <> <> <> <> <> <> <> <> <>
$$ <> <> <> <> <>
$$ ##$VCubeEth= (0..23)
$$ <no> <no> <no> <no> <no> <no> <no> <no> <no> <no> <no> <no> <no> <no> <no>
$$ <no> <no> <no> <no> <no> <no> <no> <no> <no>
$$ ##$VTU= 2
$$ ##$VTUETH= <192.168.99.11>
$$ ##$VTUTY= <no>
$$ ##$ValueLine= no
$$ ##$VpuPN= (0..23)
$$ <no> <no> <no> <no> <no> <no> <no> <no> <no> <no> <no> <no> <no> <no> <no>
$$ <no> <no> <no> <no> <no> <no> <no> <no> <no>
$$ ##$VpuSN= (0..23)
$$ <no> <no> <no> <no> <no> <no> <no> <no> <no> <no> <no> <no> <no> <no> <no>
$$ <no> <no> <no> <no> <no> <no> <no> <no> <no>
$$ ##$WBREFAM= (0..31)
$$ 99.8 100 100 100 100 100 100 100 100 100 100 100 100 100 100 100 100 100
$$ 100 100 100 100 100 100 100 100 100 100 100 100 100 100
$$ ##$WBREFLM= (0..31)
$$ 1 0 1 0 0 0 0 0 0 0 0 0 0 0 0 0 0 0 0 0 0 0 0 0 0 0 0 0 0 0 0 0
$$ ##$WBREFPH= (0..31)
$$ 0.05 0 0 0 0 0 0 0 0 0 0 0 0 0 0 0 0 0 0 0 0 0 0 0 0 0 0 0 0 0 0 0
$$ ##$WBSGU= (0..31)
$$ 1 2 4 0 0 0 0 0 0 0 0 0 0 0 0 0 0 0 0 0 0 0 0 0 0 0 0 0 0 0 0 0
$$ ##END=
$$ 
##$DECIM=	1440
##$DSPFVS=	21
##XUNITS=	HZ
##YUNITS=	ARBITRARY UNITS
##FIRSTX=	11250.604788156719223
##LASTX=	-2638.1781369192458442
##DELTAX=	-0.10596381293402784562
##XFACTOR=	1
##YFACTOR=	22.226573229163488321
##FIRSTY=	119.654998779296875
##MINY=	45.89557647705078125
##MAXY=	728298.125
##NPOINTS=	131072
##XYDATA=	(X++(Y..Y))
$$ [...]
$$ plain form
3558 12 12 12 13 14 15 16 15 15 15 16 15 15 15 15 14 14 14 14 13 13 13 14 13 13 13 14 13 13 14 14 14 14 15 15 15 14 12 12 12 12 12 12 12 13 13 13 13 14 14 13 13 13 14 14 14 13 13 14 15 15 15 14 14 14 13 13 13 14 15 14
3551 14 14 13 13 13 14 14 14 14 14 13 12 13 14 15 14 13 13 13 13 13 13 14 14 15 16 14 13 13 14 14 14 14 14 14 14 14 15 14 15 15 15 14 13 14 14 14 15 15 15 15 15 16 16 16 16 16 15 14 14 14 14 14 14 14 14 15 14 13 13 14
3544 14 14 13 13 13 14 13 13 13 13 13 14 14 14 14 14 14 13 13 14 13 13 13 13 13 14 15 16 16 15 13 13 13 13 13 14 14 15 16 16 15 14 14 14 15 15 15 15 14 14 14 13 13 13 13 13 14 15 15 15 14 14 13 13 13 14 14 13 14 14 14
3536 14 14 14 13 13 12 12 12 12 12 13 14 14 14 14 14 14 14 14 14 14 13 13 13 14 14 14 14 14 13 13 14 14 14 14 14 14 13 13 12 11 11 11 11 12 12 13 13 12 13 15 15 16 16 16 15 14 14 13 13 13 13 13 12 13 14 14 13 13 12 12
3529 12 12 11 11 12 14 14 13 12 11 12 12 12 13 13 13 13 13 12 12 12 12 12 13 14 14 13 12 12 13 13 13 13 13 13 13 13 14 13 13 12 12 12 12 12 12 13 14 13 13 13 14 13 12 13 13 13 13 13 14 14 14 14 14 14 14 14 15 14 14 13
3521 13 13 13 13 13 12 13 13 13 13 14 14 15 15 15 15 15 15 14 14 14 14 13 13 13 12 12 13 14 14 13 14 13 12 12 11 12 12 12 12 12 12 12 12 12 11 11 11 12 13 14 15 16 15 14 13 13 13 12 12 13 13 14 14 14 14 14 13 13 13 13
3514 13 14 13 13 13 13 14 14 14 14 14 13 12 11 12 12 13 12 12 13 14 13 13 14 13 13 12 12 12 13 12 12 11 11 12 12 12 12 12 12 12 13 13 13 13 13 14 14 14 14 15 15 15 14 14 14 14 15 15 14 13 13 14 14 14 14 14 14 14 15 15
3506 15 15 16 16 16 15 14 14 13 13 13 13 14 14 14 15 15 16 14 13 12 12 13 12 12 13 14 15 15 15 14 13 12 11 13 14 14 14 15 15 15 15 15 15 14 14 15 16 15 14 14 13 12 12 13 13 12 12 13 12 12 11 11 11 12 13 13 14 13 13 13
$$ packed form
3558A2%%JJJJj%%Jj%%%j%%%j%%Jj%%Jj%J%%%J%%jk%%%%%%J%%%J%j%%J%%j%JJ%%j%%j%%JJj
3551A4%j%%J%%%%jjJJJjj%%%%%J%JJkj%J%%%%%%%JjJ%%jjJ%%J%%%%J%%%%jj%%%%%%%Jjj%J
3544A4%j%%Jj%%%%J%%%%%j%Jj%%%%JJJ%jk%%%%J%JJ%jj%%J%%%j%%j%%%%JJ%%j%j%%J%jJ%%
3536A4%%j%j%%%%JJ%%%%%%%%%j%%J%%%%j%J%%%%%j%jj%%%J%J%jJK%J%%jj%j%%%%jJJ%j%j%
3529A2%j%JK%jjjJ%%J%%%%j%%%%JJ%jj%J%%%%%%%Jj%j%%%%%JJj%%JjjJ%%%%J%%%%%%%Jj%j
3521A3%%%%jJ%%%J%J%%%%%j%%%j%%j%JJ%jJjj%jJ%%%%%%%%j%%JJJJJjjj%%j%J%J%%%%j%%%
3514A3Jj%%%J%%%%jjjJ%Jj%JJj%Jj%j%%Jj%j%J%%%%%%J%%%%J%%%J%%j%%%J%jj%J%%%%%%J%
3506A5%J%%jj%j%%%J%%J%Jkjj%Jj%JJJ%%jjjjKJ%%J%%%%%j%JJjj%jj%J%j%Jj%j%%JJ%Jj%%
$$ plain form
3499 13 13 13 13 14 15 15 14 14 14 14 14 14 14 13 13 13 12 12 12 12 12 12 13 12 12 12 11 12 13 13 14 15 15 14 14 14 14 14 14 14 14 14 14 14 14 14 14 13 13 13 13 13 13 13 12 12 12 12 12 12 12 12 11 12 12 12 13 13 13 13
3492 13 13 14 15 14 14 14 13 13 13 13 13 14 14 14 14 14 13 13 13 13 13 13 13 13 13 14 14 14 14 14 13 13 13 14 14 13 13 13 14 15 15 14 14 14 13 14 14 14 14 14 14 14 14 14 14 14 13 13 13 12 12 13 13 14 14 14 14 15 15 15
3484 15 15 15 15 14 13 13 12 12 12 13 14 14 15 15 15 14 14 13 13 13 13 13 13 13 13 14 14 14 14 14 15 15 15 15 16 16 16 16 14 13 12 12 12 12 13 13 14 13 12 12 11 11 10 10 10 10 11 12 12 12 12 12 12 11 11 12 13 13 13 13
3477 13 13 13 14 15 15 15 14 14 13 13 13 13 12 13 13 13 13 14 14 13 13 13 13 13 13 13 13 13 14 13 13 13 13 13 13 13 14 14 14 14 14 13 13 13 13 13 13 14 14 14 14 14 13 14 14 15 15 15 15 14 14 14 14 14 14 14 14 14 14 14
3469 14 13 12 12 13 14 14 13 11 11 11 11 11 12 12 13 13 12 12 11 12 12 13 13 13 13 13 13 12 12 13 13 13 13 13 13 13 13 12 12 12 12 12 13 13 13 13 12 12 12 12 12 12 13 13 13 13 12 13 13 14 15 15 15 14 14 14 14 14 14 14
3462 14 14 14 13 14 14 14 14 14 14 13 13 12 12 12 13 13 13 13 13 13 13 14 15 14 14 14 14 13 13 13 13 13 13 13 13 12 12 13 13 14 14 14 15 15 15 14 14 14 13 12 12 12 12 11 12 12 13 13 12 13 14 13 13 13 13 13 14 15 14 14
3455 14 14 14 14 14 14 14 14 13 13 12 12 12 13 14 14 13 13 12 11 12 13 13 13 13 13 14 14 15 17 18 17 16 14 14 13 13 14 14 13 12 13 14 14 13 13 14 15 14 13 13 13 13 13 14 14 14 14 14 15 16 14 14 14 14 14 15 15 15 14 14
3447 14 14 14 14 13 13 13 13 13 12 12 12 12 12 13 13 13 14 13 13 13 13 13 13 13 13 13 14 14 14 14 15 14 14 15 15 14 14 13 13 13 14 15 16 15 13 12 13 14 14 14 14 15 15 15 14 14 13 13 13 13 13 13 13 14 14 14 14 14 14 14
$$ packed form
3499A3%%%JJ%j%%%%%%j%%j%%%%%Jj%%jJJ%JJ%j%%%%%%%%%%%%%j%%%%%%j%%%%%%%jJ%%J%%%
3492A3%JJj%%j%%%%J%%%%j%%%%%%%%J%%%%j%%J%j%%JJ%j%%jJ%%%%%%%%%%j%%j%J%J%%%J%%
3484A5%%%jj%j%%JJ%J%%j%j%%%%%%%J%%%%J%%%J%%%kjj%%%J%Jjj%j%j%%%JJ%%%%%j%JJ%%%
3477A3%%JJ%%j%j%%%jJ%%%J%j%%%%%%%%Jj%%%%%%J%%%%j%%%%%J%%%%jJ%J%%%j%%%%%%%%%%
3469A4jj%JJ%jk%%%%J%J%j%jJ%J%%%%%j%J%%%%%%%j%%%%J%%%j%%%%%J%%%jJ%JJ%%j%%%%%%
3462A4%%jJ%%%%%j%j%%J%%%%%%JJj%%%j%%%%%%%j%J%J%%J%%j%%jj%%%jJ%J%jJJj%%%%JJj%
3455A4%%%%%%%j%j%%JJ%j%jjJJ%%%%J%JKJjjk%j%J%jjJJ%j%JJjj%%%%J%%%%JJk%%%%J%%j%
3447A4%%%j%%%%j%%%%J%%Jj%%%%%%%%J%%%Jj%J%j%j%%JJJjkjJJ%%%J%%j%j%%%%%%J%%%%%%
$$ plain form
3440 14 14 13 12 12 11 12 12 12 13 12 12 13 14 14 14 14 14 14 14 14 14 14 14 15 15 13 13 13 13 13 13 13 14 14 14 13 13 13 12 13 14 15 16 16 15 15 15 14 14 13 12 12 12 11 10 10 11 12 12 12 13 14 14 14 15 15 15 16 17 17
3432 17 16 16 15 15 15 14 13 14 14 14 14 13 13 13 14 15 15 14 13 13 14 14 14 14 13 13 14 14 14 14 13 14 14 14 13 13 14 15 15 14 14 14 14 14 14 14 15 15 15 15 15 14 14 13 13 13 13 13 13 13 13 13 14 13 13 13 13 14 14 14
3425 14 14 14 14 13 12 12 11 10 11 12 14 14 14 12 12 13 13 13 14 15 15 14 13 14 14 14 15 15 15 15 15 15 15 15 15 15 14 13 14 15 15 15 16 16 16 15 14 14 15 14 13 13 14 14 14 15 15 15 16 16 15 15 15 15 15 14 14 14 15 15
3417 15 15 15 15 15 14 14 13 13 12 12 14 15 15 14 14 13 13 13 13 13 14 14 14 13 13 14 14 14 14 15 16 16 16 16 16 15 15 15 15 15 14 14 15 15 15 15 15 15 15 14 13 13 12 12 13 13 13 12 12 13 13 14 15 14 14 14 13 12 12 13
3410 13 13 13 13 13 14 14 14 14 13 13 12 12 12 13 14 15 15 14 13 14 14 14 15 15 15 15 15 15 15 15 14 14 13 13 13 13 13 13 13 14 14 13 13 13 13 12 13 13 14 14 14 15 14 13 14 14 14 14 14 13 12 11 11 12 11 11 11 11 11 12
3403 12 14 14 13 13 13 13 14 14 14 14 13 13 14 14 14 14 14 14 15 14 14 14 14 14 14 14 14 13 13 13 14 14 14 14 14 14 14 15 14 14 14 14 14 14 13 14 14 14 13 12 12 12 13 14 14 14 14 14 14 13 13 13 12 11 11 11 11 12 12 12
3395 12 13 13 13 14 14 13 14 14 13 13 14 13 13 12 12 12 13 13 13 14 15 15 15 14 14 14 13 13 12 12 11 12 11 11 11 12 11 11 11 11 12 12 13 12 12 12 12 12 12 13 13 13 13 14 14 14 14 13 13 13 13 13 13 12 11 11 12 13 13 13
3388 13 12 13 13 13 14 13 12 12 12 12 11 11 11 12 13 13 14 14 14 14 14 14 13 12 12 13 12 12 12 12 12 13 14 14 14 14 14 13 12 12 12 12 12 12 12 13 13 13 13 13 14 14 13 12 12 11 11 11 11 12 12 13 13 13 13 13 13 13 12 13
$$ packed form
3440A4%jj%jJ%%Jj%JJ%%%%%%%%%%J%k%%%%%%J%%j%%jJJJJ%j%%j%jj%%jj%JJ%%JJ%%J%%JJ%
3432A7j%j%%jjJ%%%j%%JJ%jj%J%%%j%J%%%jJ%%j%JJ%j%%%%%%J%%%%j%j%%%%%%%%Jj%%%J%%
3425A4%%%jj%jjJJK%%k%J%%JJ%jjJ%%J%%%%%%%%%jjJJ%%J%%jj%Jjj%J%%J%%J%j%%%%j%%J%
3417A5%%%%j%j%j%KJ%j%j%%%%J%%j%J%%%JJ%%%%j%%%%j%J%%%%%%jj%j%J%%j%J%JJj%%jj%J
3410A3%%%%J%%%j%j%%JJJ%jjJ%%J%%%%%%%j%j%%%%%%J%j%%%jJ%J%%JjjJ%%%%jjj%Jj%%%%J
3403A2K%j%%%J%%%j%J%%%%%Jj%%%%%%%j%%J%%%%%%Jj%%%%%jJ%%jj%%JJ%%%%%j%%jj%%%J%%
3395A2J%%J%jJ%j%Jj%j%%J%%JJ%%j%%j%j%jJj%%Jj%%%J%Jj%%%%%J%%%J%%%j%%%%%jj%JJ%%
3388A3jJ%%Jjj%%%j%%JJ%J%%%%%jj%Jj%%%%JJ%%%%jj%%%%%%J%%%%J%jj%j%%%J%J%%%%%%jJ
$$ plain form
3380 13 13 13 13 13 14 14 14 14 15 15 16 16 16 16 15 15 16 15 15 14 14 14 14 14 13 13 12 12 13 12 11 11 12 12 12 14 15 15 15 13 13 13 14 14 14 14 14 14 13 12 12 13 13 14 15 14 13 13 12 12 13 14 15 15 14 13 14 14 14 13
3373 13 13 14 14 14 13 14 14 14 14 14 13 12 12 12 13 14 15 15 14 14 14 14 15 15 16 15 15 15 15 14 14 14 14 14 14 13 12 11 11 12 12 11 11 12 13 13 13 13 13 14 15 16 16 15 14 14 13 13 13 13 13 14 14 14 13 13 13 13 13 13
3366 13 13 12 12 12 12 12 12 13 14 13 12 13 13 13 13 13 14 14 14 14 15 14 15 15 15 15 13 13 14 14 14 14 14 14 14 14 14 14 13 14 15 15 14 13 13 12 13 13 14 13 13 13 13 13 13 13 13 13 14 14 13 13 14 14 14 14 14 14 14 14
3358 14 14 14 15 15 14 14 13 14 16 16 16 14 13 13 13 14 15 15 14 14 14 14 14 14 14 14 14 14 14 14 13 13 14 14 14 15 15 15 14 14 13 13 13 14 14 14 14 14 14 15 15 16 15 15 14 14 15 14 13 13 12 12 12 11 11 12 13 13 13 13
3351 13 14 14 15 14 13 13 14 14 14 14 15 15 15 15 14 14 14 14 14 14 14 14 14 14 14 13 14 15 15 16 15 15 14 13 12 12 12 12 12 12 13 14 14 14 14 14 14 15 15 15 16 16 14 13 13 14 15 14 14 14 13 14 14 14 14 15 15 15 15 15
3343 15 14 14 15 15 15 14 13 13 14 15 16 16 15 15 15 15 15 15 16 15 15 15 15 15 15 15 14 14 13 14 14 14 14 14 14 13 13 13 14 14 14 14 14 14 14 14 14 14 14 14 14 15 14 14 13 12 12 11 12 12 12 12 13 14 14 15 14 14 14 13
3336 13 13 13 14 14 15 14 13 14 14 14 14 14 13 13 13 13 13 12 12 12 13 13 13 13 12 13 13 13 13 13 13 14 14 14 13 13 14 14 14 14 12 11 11 11 11 11 12 12 12 13 13 13 13 13 13 13 13 13 13 13 13 12 12 12 13 13 13 13 14 14
3328 14 14 14 14 13 13 12 12 12 12 12 12 13 13 13 14 14 15 14 14 14 14 13 14 13 13 14 14 15 15 15 15 14 14 13 12 13 14 14 14 14 14 14 14 14 13 13 14 14 14 14 13 12 12 13 13 13 12 12 12 12 12 12 11 11 11 11 12 14 14 13
$$ packed form
3380A3%%%%J%%%J%J%%%j%Jj%j%%%%j%j%Jjj%J%%KJ%%k%%J%%%%%jj%J%JJjj%j%JJJ%jjJ%%j
3373A3%J%%jJ%%%%jj%%JJJ%j%%%J%Jj%%%j%%%%%jjj%J%j%JJ%%%%JJJ%jj%j%%%%J%%j%%%%%
3366A3%j%%%%%JJjjJ%%%%J%%%JjJ%%%k%J%%%%%%%%%jJJ%jj%jJ%Jj%%%%%%%%J%j%J%%%%%%%
3358A4%%J%j%jJK%%kj%%JJ%j%%%%%%%%%%%j%J%%J%%j%j%%J%%%%%J%Jj%j%Jjj%j%%j%JJ%%%
3351A3J%Jjj%J%%%J%%%j%%%%%%%%%%jJJ%Jj%jjj%%%%%JJ%%%%%J%%J%kj%JJj%%jJ%%%J%%%%
3343A5j%J%%jj%JJJ%j%%%%%Jj%%%%%%j%jJ%%%%%j%%J%%%%%%%%%%%%Jj%jj%jJ%%%JJ%Jj%%j
3336A3%%J%JjjJ%%%%j%%%%j%%J%%%jJ%%%%%J%%j%J%%%kj%%%%J%%J%%%%%%%%%%%j%%J%%%J%
3328A4%%%j%j%%%%%J%%J%Jj%%%jJj%J%J%%%j%jjJJ%%%%%%%j%J%%%jj%J%%j%%%%%j%%%JK%j
$$ plain form
3321 13 12 11 11 12 12 12 12 12 12 12 13 13 13 13 13 13 13 13 14 15 15 15 16 16 17 15 15 15 14 14 14 14 13 13 12 13 13 13 13 14 15 14 14 14 14 12 12 12 13 14 15 15 15 16 15 15 14 14 14 15 15 15 14 14 13 13 13 13 14 14
3314 14 15 15 15 15 15 16 15 15 14 14 14 13 12 13 12 12 11 11 12 14 15 16 16 15 14 14 13 13 13 14 14 14 14 15 15 14 13 13 12 12 12 12 13 13 14 14 15 15 16 16 16 15 14 13 12 12 11 11 12 12 12 12 11 11 11 11 12 13 13 13
3306 13 13 14 13 13 12 13 13 14 13 13 13 14 15 16 15 15 15 14 14 14 13 13 14 13 12 12 11 11 11 12 13 13 13 14 14 14 14 15 15 15 15 14 14 14 14 14 14 14 14 14 15 15 15 15 14 14 14 14 13 13 13 13 13 13 13 13 12 12 12 12
3299 12 12 12 13 13 13 13 13 13 14 15 15 14 14 13 13 12 12 14 15 16 16 15 15 14 13 13 13 14 14 13 13 13 13 13 13 13 13 14 14 14 15 14 13 13 12 12 13 14 14 15 15 15 15 15 15 15 15 15 15 15 15 14 13 14 14 15 15 14 14 13
3291 13 13 12 12 13 13 14 14 13 13 13 13 13 13 13 13 13 13 13 13 13 13 13 14 14 14 13 13 14 14 13 13 12 12 12 12 12 12 12 12 13 14 14 14 13 13 12 11 11 12 12 13 13 13 12 12 12 13 13 13 13 13 13 13 13 13 13 12 13 13 13
3284 13 11 12 13 14 15 15 14 13 13 13 14 14 14 14 14 14 13 13 13 13 13 14 14 14 14 15 15 15 14 15 15 15 14 14 14 14 14 14 16 16 16 16 16 16 15 14 13 13 13 14 15 15 14 13 13 13 13 14 15 15 15 14 14 14 14 13 13 13 14 14
3277 14 13 13 12 12 12 12 12 13 13 14 15 15 16 15 13 12 13 14 14 14 14 14 14 14 14 14 14 14 13 13 12 13 13 13 13 13 13 14 14 14 13 13 13 14 14 14 15 15 15 14 14 14 13 13 13 13 13 12 12 13 14 14 13 13 14 14 13 13 12 12
3269 12 13 13 14 14 14 14 14 14 14 13 13 12 12 12 13 13 14 14 14 14 14 14 14 15 15 14 14 14 14 14 13 12 12 13 13 12 12 12 12 12 12 13 14 15 16 15 15 14 14 14 13 14 14 14 15 15 15 15 15 14 14 14 13 13 12 12 12 12 12 13
$$ packed form
3321A3jj%J%%%%%%J%%%%%%%JJ%%J%Jk%%j%%%j%jJ%%%JJj%%%k%%JJJ%%Jj%j%%J%%j%j%%%J%
3314A4J%%%%Jj%j%%jjJj%j%JKJJ%jj%j%%J%%%J%jj%j%%%J%J%J%J%%jjjj%j%J%%%j%%%JJ%%
3306A3%Jj%jJ%Jj%%JJJj%%j%%j%Jjj%j%%JJ%%J%%%J%%%j%%%%%%%%J%%%j%%%j%%%%%%%j%%%
3299A2%%J%%%%%JJ%j%j%j%KJJ%j%jj%%J%j%%%%%%%J%%Jjj%j%JJ%J%%%%%%%%%%%jjJ%J%j%j
3291A3%j%J%J%j%%%%%%%%%%%%%%J%%j%J%j%j%%%%%%%JJ%%j%jj%J%J%%j%%J%%%%%%%%%jJ%%
3284A3kJJJJ%jj%%J%%%%%j%%%%J%%%J%%jJ%%j%%%%%K%%%%%jjj%%JJ%jj%%%JJ%%j%%%j%%J%
3277A4j%j%%%%J%JJ%JjkjJJ%%%%%%%%%%j%jJ%%%%%J%%j%%J%%J%%j%%j%%%%j%JJ%j%J%j%j%
3269A2J%J%%%%%%j%j%%J%J%%%%%%J%j%%%%jj%J%j%%%%%JJJJj%j%%jJ%%J%%%%j%%j%j%%%%J
$$ plain form
3262 13 13 13 14 14 14 14 14 14 14 14 13 13 13 13 13 13 13 13 12 13 13 14 14 13 13 13 13 13 12 12 13 14 14 14 15 14 14 15 16 16 15 15 15 14 13 13 14 13 13 14 14 14 14 14 15 15 15 15 15 15 15 15 14 13 13 13 13 13 13 12
3254 12 11 12 12 12 13 13 13 13 12 12 12 12 12 12 12 12 13 14 14 14 14 13 13 13 14 13 13 13 14 13 13 13 13 14 14 15 15 15 16 15 14 14 13 13 13 13 13 13 14 14 14 13 13 12 12 11 11 11 11 11 12 13 13 13 13 13 13 14 15 15
3247 15 14 13 13 13 14 13 13 13 13 13 14 14 13 13 12 13 13 12 11 12 12 12 12 13 14 15 14 14 14 14 14 14 15 15 14 15 16 15 14 14 14 14 14 13 12 10 10 10 11 11 11 11 10 11 12 13 14 14 14 14 13 13 12 12 12 12 13 13 13 13
3239 13 13 13 13 13 12 11 11 12 13 13 13 13 13 14 14 13 14 13 13 13 13 12 13 14 14 14 14 13 13 13 13 13 12 12 11 12 13 13 13 13 13 13 14 14 15 16 16 16 14 13 14 14 14 14 14 14 15 16 16 15 14 14 13 13 14 13 13 13 13 13
3232 13 13 14 14 14 14 13 14 15 15 14 14 14 14 14 13 11 12 12 12 12 11 11 12 12 12 12 13 13 13 13 13 13 13 12 12 12 13 13 13 13 13 13 13 13 12 12 12 12 13 12 12 12 12 12 12 13 13 13 12 12 14 14 13 13 14 14 14 14 14 14
3225 14 13 13 13 13 13 14 14 14 14 13 13 13 14 14 13 13 12 12 13 13 13 14 14 14 13 13 13 12 12 13 13 13 14 14 14 14 13 13 13 13 14 14 13 13 13 14 14 15 14 14 14 13 13 14 14 13 13 13 13 14 14 14 14 13 13 13 13 13 13 14
3217 14 14 15 16 15 14 14 14 13 14 15 15 15 15 16 15 15 15 15 14 14 13 14 14 14 14 13 13 13 13 13 13 13 13 13 14 14 14 14 14 14 14 14 15 15 16 16 16 15 15 14 14 15 14 14 14 15 15 15 15 16 16 15 15 15 15 15 14 13 13 13
3210 13 13 13 14 13 13 13 13 13 13 13 13 13 13 13 13 12 13 13 13 13 13 14 14 13 14 15 14 13 13 13 13 13 13 13 13 13 13 13 13 13 13 13 14 14 14 14 14 14 14 14 14 13 13 14 13 15 16 15 15 15 14 14 14 14 13 13 14 14 15 15
$$ packed form
3262A3%%J%%%%%%%j%%%%%%%jJ%J%j%%%%j%JJ%%Jj%JJ%j%%jj%Jj%J%%%%J%%%%%%%jj%%%%%j
3254A2jJ%%J%%%j%%%%%%%JJ%%%j%%Jj%%Jj%%%J%J%%Jjj%j%%%%%J%%j%j%j%%%%JJ%%%%%JJ%
3247A5jj%%Jj%%%%J%j%jJ%jjJ%%%JJJj%%%%%J%jJJjj%%%%jjk%%J%%%jJJJJ%%%j%j%%%J%%%
3239A3%%%%jj%JJ%%%%J%jJj%%%jJJ%%%j%%%%j%jJJ%%%%%J%JJ%%kjJ%%%%%JJ%jj%j%Jj%%%%
3232A3%J%%%jJJ%j%%%%jkJ%%%j%J%%%J%%%%%%j%%J%%%%%%%j%%%Jj%%%%%J%%j%K%j%J%%%%%
3225A4j%%%%J%%%j%%J%j%j%J%%J%%j%%j%J%%J%%%j%%%J%j%%J%Jj%%j%J%j%%%J%%%j%%%%%J
3217A4%JJjj%%jJJ%%%Jj%%%j%jJ%%%j%%%%%%%%J%%%%%%%J%J%%j%j%Jj%%J%%%J%j%%%%jj%%
3210A3%%Jj%%%%%%%%%%%jJ%%%%J%jJJjj%%%%%%%%%%%%%%J%%%%%%%%j%JjKJj%%j%%%j%J%J%
$$ plain form
3202 15 15 15 14 14 15 15 15 15 15 15 16 15 14 14 15 14 14 13 13 13 13 13 13 13 13 13 13 13 13 13 12 12 13 13 13 12 12 12 11 12 12 13 13 13 14 14 14 14 14 14 14 13 13 13 14 14 14 15 15 14 13 14 14 14 14 14 15 14 13 13
3195 13 14 15 14 14 14 14 14 14 14 14 14 14 14 14 14 14 14 14 14 13 13 13 13 14 14 15 16 15 15 14 14 14 14 14 14 14 13 14 14 14 13 13 13 14 14 13 12 12 12 13 13 13 13 14 14 14 13 13 13 14 14 14 13 13 13 13 14 15 15 15
3188 15 15 15 14 13 13 13 14 14 15 15 16 16 15 14 14 15 16 16 15 15 16 15 15 14 15 15 14 13 13 13 14 14 14 14 14 13 13 13 13 15 15 15 13 13 12 13 14 14 14 14 13 13 13 14 14 14 13 13 12 13 13 13 13 12 12 13 13 13 13 13
3180 13 13 13 13 13 13 14 13 13 12 13 13 13 13 12 12 12 12 13 14 14 15 15 14 14 14 15 16 15 15 14 13 13 13 13 12 12 12 13 14 14 14 13 13 12 12 13 14 14 13 12 12 11 12 12 12 12 12 12 12 13 13 13 13 14 15 15 14 14 14 14
3173 14 14 14 14 14 14 14 14 13 13 13 14 14 13 13 13 14 15 15 15 14 13 14 14 14 15 16 16 15 14 14 13 14 14 12 12 13 13 13 13 13 13 14 14 14 14 12 12 12 12 11 10 11 12 13 14 15 16 16 15 15 14 14 14 14 14 13 13 13 13 12
3165 12 12 13 13 13 14 13 12 13 14 14 15 15 15 14 13 13 13 13 13 13 13 14 14 14 14 14 14 13 12 10 10 11 12 12 12 13 14 15 16 15 15 14 13 14 14 14 14 14 14 13 13 12 12 12 12 12 12 12 13 13 13 13 14 14 14 15 15 16 16 15
3158 15 15 14 14 14 13 14 15 15 15 15 15 14 14 13 12 12 12 12 12 12 13 13 13 14 14 14 14 14 13 15 16 16 15 15 15 14 14 14 13 13 13 13 14 14 14 14 14 14 15 15 15 15 15 15 15 15 14 14 15 15 14 13 14 14 13 13 13 13 13 13
3150 13 13 13 14 14 13 14 15 15 15 15 14 14 14 14 13 13 13 12 12 12 13 14 15 15 16 15 14 14 13 13 12 13 13 14 14 15 15 15 15 14 13 12 12 12 13 14 14 13 13 13 13 13 13 14 14 15 15 15 15 14 12 12 11 12 13 13 14 14 14 14
$$ packed form
3202A5%%j%J%%%%%Jjj%Jj%j%%%%%%%%%%%%j%J%%j%%jJ%J%%J%%%%%%j%%J%%J%jjJ%%%%Jjj%
3195A3JJj%%%%%%%%%%%%%%%%j%%%J%JJj%j%%%%%%jJ%%j%%J%jj%%J%%%J%%j%%J%%j%%%JJ%%
3188A5%%jj%%J%J%J%jj%JJ%j%Jj%jJ%jj%%J%%%%j%%%K%%k%jJJ%%%j%%J%%j%jJ%%%j%J%%%%
3180A3%%%%%Jj%jJ%%%j%%%JJ%J%j%%JJj%jj%%%j%%JJ%%j%j%JJ%jj%jJ%%%%%%J%%%JJ%j%%%
3173A4%%%%%%%j%%J%j%%JJ%%jjJ%%JJ%jj%jJ%k%J%%%%%J%%%k%%%jjJJJJJJ%j%j%%%%j%%%j
3165A2%J%%JjjJJ%J%%jj%%%%%%J%%%%%jjk%JJ%%JJJJj%jjJ%%%%%j%j%%%%%%J%%%J%%J%J%j
3158A5%j%%jJJ%%%%j%jj%%%%%J%%J%%%%jKJ%j%%j%%j%%%J%%%%%J%%%%%%%j%J%jjJ%j%%%%%
3150A3%%J%jJJ%%%j%%%j%%j%%JJJ%Jjj%j%jJ%J%J%%%jjj%%JJ%j%%%%%J%J%%%jk%jJJ%J%%%
$$ plain form
3143 14 14 14 14 13 12 13 13 14 14 14 14 13 13 12 12 12 12 11 11 11 12 14 14 14 14 14 14 14 14 13 13 13 12 12 12 12 12 13 13 14 14 14 14 14 14 15 15 15 15 15 14 13 13 14 15 14 14 14 15 15 16 15 14 14 14 14 14 14 14 14
3136 14 13 12 12 13 14 14 14 14 14 14 14 14 14 13 13 13 13 14 13 13 12 13 14 15 14 13 12 12 12 11 11 11 12 12 13 12 11 12 12 13 13 13 12 12 13 14 14 14 15 14 13 13 13 13 13 13 13 12 12 12 12 12 12 13 13 13 13 14 14 13
3128 13 13 13 13 13 14 14 13 12 12 12 13 13 12 12 12 12 12 12 13 14 15 15 15 15 14 14 14 15 14 13 13 14 13 13 14 14 13 13 13 14 15 15 15 15 15 14 13 13 14 14 14 15 15 14 14 13 13 14 14 14 14 15 16 15 14 14 14 13 12 13
3121 13 13 14 14 13 14 14 15 14 14 14 14 13 13 13 14 14 14 14 14 14 14 15 15 15 14 14 13 13 13 13 13 13 14 13 13 13 12 12 12 11 11 11 12 13 14 15 14 13 13 14 14 14 14 14 14 14 13 13 13 14 14 14 13 14 14 14 13 13 13 13
3113 13 14 14 13 13 12 13 13 13 13 13 14 15 16 16 16 16 15 14 14 14 14 14 14 13 13 12 13 13 13 13 13 13 12 12 13 13 14 14 15 14 14 14 14 14 14 15 15 15 15 16 15 15 14 13 13 13 12 12 12 13 14 13 13 13 13 12 12 12 13 14
3106 14 14 14 14 14 13 12 12 13 13 13 13 12 12 12 12 12 12 12 12 12 13 14 14 14 14 14 14 15 15 14 14 14 14 14 14 13 12 12 13 14 16 16 15 15 15 15 15 15 14 14 14 13 14 14 14 14 14 14 13 13 13 13 13 12 12 12 12 12 13 13
3098 13 12 13 13 13 13 13 14 14 15 15 16 15 15 14 13 12 12 12 13 13 13 13 13 13 12 13 13 13 14 15 15 15 15 14 14 14 14 15 15 14 13 13 13 14 15 15 16 15 15 15 15 15 14 14 14 13 13 12 13 14 14 13 14 14 14 14 14 14 15 14
3091 14 13 13 12 12 12 12 13 13 14 14 13 14 14 13 13 13 14 14 15 14 13 13 12 12 13 13 14 14 14 14 14 13 12 12 13 13 13 12 12 12 13 13 13 13 13 13 13 12 12 13 14 15 14 13 13 14 14 14 14 14 14 14 14 13 13 12 11 11 11 12
$$ packed form
3143A4%%%jjJ%J%%%j%j%%%j%%JK%%%%%%%j%%j%%%%J%J%%%%%J%%%%jj%JJj%%J%Jjj%%%%%%%
3136A4jj%JJ%%%%%%%%j%%%Jj%jJJJjjj%%j%%J%JjjJ%J%%j%JJ%%Jjj%%%%%%j%%%%%J%%%J%j
3128A3%%%%J%jj%%J%j%%%%%JJJ%%%j%%Jjj%Jj%J%j%%JJ%%%%jj%J%%J%j%j%J%%%JJjj%%jjJ
3121A3%J%jJ%Jj%%%j%%J%%%%%%J%%j%j%%%%%Jj%%j%%j%%JJJJjj%J%%%%%%j%%J%%jJ%%j%%%
3113A3J%j%jJ%%%%JJJ%%%jj%%%%%j%jJ%%%%%j%J%J%Jj%%%%%J%%%Jj%jj%%j%%JJj%%%j%%JJ
3106A4%%%%jj%J%%%j%%%%%%%%JJ%%%%%J%j%%%%%jj%JJK%j%%%%%j%%jJ%%%%%j%%%%j%%%%J%
3098A3jJ%%%%J%J%Jj%jjj%%J%%%%%jJ%%JJ%%%j%%%J%jj%%JJ%Jj%%%%j%%j%jJJ%jJ%%%%%Jj
3091A4j%j%%%J%J%jJ%j%%J%Jjj%j%J%J%%%%jj%J%%j%%J%%%%%%j%JJJjj%J%%%%%%%j%jj%%J
$$ plain form
3084 12 13 14 15 15 15 14 13 14 14 14 15 14 14 14 14 13 13 13 14 13 13 14 14 14 14 13 13 13 14 15 16 15 15 15 14 14 13 14 14 14 14 14 13 13 14 14 15 15 15 15 16 16 15 14 13 13 13 14 14 14 15 15 14 14 14 14 15 14 13 13
3076 13 13 14 14 13 13 14 15 15 15 14 13 12 12 13 13 13 14 14 13 13 14 14 14 14 14 14 14 14 14 14 14 14 13 14 15 15 16 16 15 15 15 14 14 13 12 12 12 13 13 13 14 13 12 12 12 14 14 14 14 15 15 15 14 14 13 13 14 14 13 13
3069 13 12 12 12 12 12 14 14 13 14 14 14 14 14 14 14 14 15 15 15 15 16 16 16 16 16 16 15 14 13 12 12 12 12 12 13 14 14 14 13 13 13 13 12 13 13 13 13 13 13 13 14 14 13 13 13 14 14 14 13 13 14 14 14 14 15 15 15 14 14 13
3061 13 13 13 14 14 14 14 14 14 13 13 13 12 12 12 11 12 13 13 13 14 15 16 16 15 14 14 15 15 14 15 14 14 14 14 13 13 13 13 14 13 13 12 12 12 12 13 14 13 13 13 14 14 13 13 13 13 13 14 14 14 14 14 15 15 15 15 15 15 16 16
3054 16 16 15 15 15 14 14 15 15 15 15 14 14 13 13 12 13 14 13 13 13 13 13 13 14 14 14 14 14 15 15 15 14 14 14 14 14 14 14 14 13 13 13 13 13 13 13 13 13 14 13 13 13 13 12 12 12 12 12 12 13 13 13 13 13 13 12 13 14 14 14
3047 14 14 14 14 14 14 14 14 13 13 13 12 12 12 12 13 14 14 14 15 16 16 15 15 14 13 13 14 14 14 14 13 14 14 14 14 14 14 14 15 15 15 14 14 14 14 14 15 14 14 14 14 14 15 15 15 15 14 13 13 12 13 14 14 14 13 14 14 14 13 13
3039 13 12 11 11 11 12 12 13 14 14 15 16 15 14 13 13 13 13 13 13 13 13 13 13 14 14 14 14 14 13 13 14 14 13 13 13 13 13 13 12 13 14 14 14 14 14 14 13 13 13 12 12 13 13 14 14 14 14 14 14 14 13 14 14 14 14 13 13 13 14 15
3032 15 14 13 12 12 12 12 12 13 13 12 13 13 13 13 14 13 13 13 13 13 13 13 13 13 14 14 13 13 14 15 15 15 14 14 14 14 14 13 13 13 12 13 13 13 13 14 14 14 14 14 13 12 12 13 12 12 12 13 13 14 15 14 14 14 14 15 14 14 14 14
$$ packed form
3084A2JJJ%%jjJ%%Jj%%%j%%Jj%J%%%j%%JJJj%%j%jJ%%%%j%J%J%%%J%jjj%%J%%J%j%%%Jjj%
3076A3%J%j%JJ%%jjj%J%%J%j%J%%%%%%%%%%%jJJ%J%j%%j%jj%%J%%Jjj%%K%%%J%%j%j%J%j%
3069A3j%%%%K%jJ%%%%%%%J%%%J%%%%%jjjj%%%%JJ%%j%%%jJ%%%%%%J%j%%J%%j%J%%%J%%j%j
3061A3%%J%%%%%j%%j%%jJJ%%JJJ%jj%J%jJj%%%j%%%Jj%j%%%JJj%%J%j%%%%J%%%%J%%%%%J%
3054A6%j%%j%J%%%j%j%jJJj%%%%%J%%%%J%%j%%%%%%%j%%%%%%%%Jj%%%j%%%%%J%%%%%jJJ%%
3047A4%%%%%%%j%%j%%%JJ%%JJ%j%jj%J%%%jJ%%%%%%J%%j%%%%Jj%%%%J%%%jj%jJJ%%jJ%%j%
3039A3jj%%J%JJ%JJjjj%%%%%%%%%J%%%%j%J%j%%%%%jJJ%%%%%j%%j%J%J%%%%%%jJ%%%j%%JJ
3032A5jjj%%%%J%jJ%%%Jj%%%%%%%%J%j%JJ%%j%%%%j%%jJ%%%J%%%%jj%Jj%%J%JJj%%%Jj%%%
$$ plain form
3024 14 14 13 13 13 13 13 13 13 13 13 13 12 12 12 12 12 13 13 12 12 12 12 12 13 14 14 13 13 13 13 13 13 13 14 13 13 13 13 13 14 14 13 13 13 13 14 14 14 14 14 14 13 13 13 13 14 13 13 14 14 14 15 15 15 15 15 14 15 15 15
3017 15 15 14 14 13 13 14 15 15 15 15 15 14 14 14 14 14 13 13 13 13 13 14 14 14 14 14 14 14 14 14 14 14 13 13 13 13 12 13 13 13 14 14 15 15 15 15 15 13 12 12 14 14 14 13 13 13 13 13 13 13 13 14 14 14 14 14 14 13 13 14
3009 14 15 15 15 15 15 15 15 15 16 15 14 14 14 14 13 13 14 15 15 14 14 14 14 15 15 15 14 13 13 14 14 14 14 15 15 15 14 14 14 14 14 14 12 11 11 11 12 13 13 13 14 14 14 13 12 12 12 12 13 13 13 13 13 13 14 14 13 13 13 13
3002 13 13 13 15 15 15 14 14 14 14 13 12 12 12 13 12 12 12 12 12 12 14 15 15 15 14 14 15 14 13 14 14 13 12 12 12 13 13 13 13 13 13 13 13 14 14 14 15 14 14 13 12 13 13 14 14 13 12 12 12 12 13 14 14 14 14 13 14 14 14 14
2995 14 15 15 14 14 14 14 13 13 13 13 14 14 14 14 13 13 13 13 13 12 12 13 13 13 14 14 14 13 13 14 14 14 13 13 14 15 15 14 13 13 12 12 13 13 13 12 13 13 14 13 13 13 14 14 13 13 13 14 14 14 14 15 15 15 15 15 14 14 14 14
2987 14 13 13 13 13 13 13 13 14 15 15 14 13 13 14 16 15 15 14 15 14 14 14 15 15 15 14 14 14 14 14 14 13 13 13 13 13 13 13 14 14 14 14 13 13 12 12 12 13 13 13 13 13 13 14 13 13 13 13 14 14 14 13 13 13 13 13 12 12 12 13
2980 13 14 14 13 13 12 12 12 12 13 14 14 14 14 14 13 12 11 11 12 11 11 12 13 14 15 14 14 13 12 12 12 13 13 13 13 13 13 13 12 12 12 12 13 13 13 13 12 12 12 12 12 13 13 14 15 14 14 13 12 11 11 12 13 13 13 13 12 11 10 11
2972 11 11 12 12 12 12 13 13 13 13 13 14 14 14 15 15 14 13 13 13 13 13 12 12 12 13 14 14 15 15 14 14 14 13 14 14 14 14 14 13 14 14 13 12 12 13 14 15 13 13 12 12 12 12 12 12 12 12 13 14 14 14 14 15 15 16 16 16 15 15 14
$$ packed form
3024A4%j%%%%%%%%%j%%%%J%j%%%%JJ%j%%%%%%Jj%%%%J%j%%%J%%%%%j%%%Jj%J%%J%%%%jJ%%
3017A5%j%j%JJ%%%%j%%%%j%%%%J%%%%%%%%%%j%%%jJ%%J%J%%%%kj%K%%j%%%%%%%J%%%%%j%J
3009A4J%%%%%%%Jjj%%%j%JJ%j%%%J%%jj%J%%%J%%j%%%%%kj%%JJ%%J%%jj%%%J%%%%%J%j%%%
3002A3%%K%%j%%%jj%%Jj%%%%%KJ%%j%JjjJ%jj%%J%%%%%%%J%%Jj%jjJ%J%jj%%%JJ%%%jJ%%%
2995A4J%j%%%j%%%J%%%j%%%%j%J%%J%%j%J%%j%JJ%jj%j%J%%jJ%Jj%%J%j%%J%%%J%%%%j%%%
2987A4j%%%%%%JJ%jj%JKj%jJj%%J%%j%%%%%j%%%%%%J%%%j%j%%J%%%%%Jj%%%J%%j%%%%j%%J
2980A3J%j%j%%%JJ%%%%jjj%Jj%JJJJj%jj%%J%%%%%%j%%%J%%%j%%%%J%JJj%jjj%JJ%%%jjjJ
2972A1%J%%%J%%%%J%%J%jj%%%%j%%JJ%J%j%%jJ%%%%jJ%jj%JJJk%j%%%%%%%JJ%%%J%J%%j%j
$$ plain form
2965 14 14 14 14 14 13 13 12 12 13 14 14 14 14 14 14 14 13 13 13 13 14 15 15 15 16 16 16 15 15 15 15 16 16 16 15 14 13 13 13 13 13 13 13 13 13 13 13 13 12 11 11 12 12 12 12 12 12 12 13 13 13 14 15 15 15 14 13 13 13 13
2958 13 13 14 15 15 15 15 15 15 15 15 14 14 14 15 14 13 13 13 13 13 13 13 13 13 13 13 12 12 12 13 13 14 15 15 16 15 14 14 13 14 14 14 14 14 15 15 15 15 15 15 14 14 14 14 15 15 15 14 13 13 13 14 14 15 15 15 14 14 14 14
2950 14 14 14 14 14 14 13 12 12 12 12 12 12 12 13 13 13 14 14 13 12 12 13 13 13 12 13 14 14 14 14 14 14 13 13 12 12 13 13 14 14 14 15 15 14 14 14 14 13 12 12 13 13 13 14 14 14 14 14 14 15 16 17 16 15 14 14 13 13 13 13
2943 13 13 14 14 14 14 14 14 14 14 13 13 13 13 13 13 12 12 12 13 13 13 14 14 14 14 14 13 13 12 11 11 12 12 12 12 12 13 13 13 13 13 12 12 12 13 13 14 14 14 14 14 14 14 13 13 13 13 13 13 13 12 13 13 14 14 15 15 14 14 14
2935 14 13 14 13 12 12 12 11 12 13 14 13 12 12 12 12 12 13 14 15 15 14 13 13 13 13 13 12 12 11 12 13 14 14 14 14 14 14 13 12 12 12 13 14 14 14 14 14 14 13 13 12 12 11 11 11 12 13 12 12 13 13 13 14 14 15 15 14 14 15 15
2928 15 15 14 14 13 13 13 12 13 14 14 15 14 14 14 14 14 13 13 14 14 14 14 14 14 15 14 14 13 13 13 13 12 12 12 12 12 12 13 14 13 13 12 13 13 13 12 12 12 12 12 12 12 11 12 12 12 13 13 13 13 12 13 13 13 12 12 12 12 13 13
2920 13 13 14 14 14 14 14 14 13 13 13 14 13 13 13 14 14 14 14 14 15 14 14 14 14 14 14 14 15 15 15 15 15 15 15 14 14 14 14 14 14 14 14 14 15 15 14 13 13 12 11 10 11 11 12 12 12 11 11 11 12 12 12 13 14 14 14 13 13 13 14
2913 14 14 13 13 13 13 13 13 13 13 13 13 13 13 13 13 14 14 13 12 12 13 14 14 13 13 13 13 13 13 12 13 14 14 15 15 15 15 15 14 14 14 14 15 15 14 13 13 13 13 13 13 13 14 14 14 14 14 14 14 13 14 14 14 15 15 15 15 14 14 14
$$ packed form
2965A4%%%%j%j%JJ%%%%%%j%%%JJ%%J%%j%%%J%%jjj%%%%%%%%%%%jj%J%%%%%%J%%JJ%%jj%%%
2958A3%JJ%%%%%%%j%%Jjj%%%%%%%%%%j%%J%JJ%Jjj%jJ%%%%J%%%%%j%%%J%%jj%%J%J%%j%%%
2950A4%%%%%jj%%%%%%J%%J%jj%J%%jJJ%%%%%j%j%J%J%%J%j%%%jj%J%%J%%%%%JJJjjj%j%%%
2943A3%J%%%%%%%j%%%%%j%%J%%J%%%%j%jj%J%%%%J%%%%j%%J%J%%%%%%j%%%%%%jJ%J%J%j%%
2935A4jJjj%%jJJJjj%%%%JJJ%jj%%%%j%jJJJ%%%%%jj%%JJ%%%%%j%j%j%%JJj%J%%J%J%j%J%
2928A5%j%j%%jJJ%Jj%%%%j%J%%%%%Jj%j%%%j%%%%%JJj%jJ%%j%%%%%%jJ%%J%%%jJ%%j%%%J%
2920A3%J%%%%%j%%Jj%%J%%%%Jj%%%%%%J%%%%%%j%%%%%%%%J%jj%jjjJ%J%%j%%J%%JJ%%j%%J
2913A4%j%%%%%%%%%%%%%J%jj%JJ%j%%%%%jJJ%J%%%%j%%%J%jj%%%%%%J%%%%%%jJ%%J%%%j%%
$$ plain form
2906 14 15 15 14 13 14 14 14 13 13 13 13 12 13 14 15 14 13 13 14 15 14 14 15 15 14 13 13 12 12 13 13 14 15 14 14 14 14 13 14 14 15 14 14 14 14 14 14 15 15 15 16 16 15 15 14 14 14 15 17 17 16 14 13 13 14 14 14 14 13 13
2898 13 13 13 13 13 13 12 12 12 11 12 13 14 15 14 14 13 12 13 14 15 15 15 15 15 15 15 15 15 15 14 13 13 13 13 13 14 15 15 15 14 14 14 14 14 14 14 15 15 15 15 15 15 15 15 15 14 14 14 14 14 14 14 14 14 14 13 11 12 13 14
2891 14 15 14 14 14 13 13 13 13 12 12 11 11 11 12 12 12 13 13 14 15 16 15 15 15 14 14 14 13 13 13 13 13 13 13 14 13 13 13 13 14 14 14 14 14 14 14 13 13 12 12 13 13 13 14 14 15 14 13 14 14 13 12 11 12 12 12 12 13 14 13
2883 13 13 12 12 13 14 14 13 14 14 14 14 15 15 15 15 15 15 14 14 13 13 12 12 12 13 14 14 14 14 13 13 12 13 13 13 13 14 14 14 15 15 15 15 15 15 15 15 15 15 15 15 16 15 14 14 14 13 13 13 12 11 11 11 12 13 13 13 13 13 13
2876 13 13 13 13 14 14 15 15 15 15 15 15 14 14 14 15 15 15 15 15 15 15 15 15 15 15 14 14 15 16 15 15 15 14 13 13 13 13 13 12 12 13 13 14 14 14 14 15 16 16 16 16 15 15 15 15 15 16 15 15 15 14 14 13 13 13 13 13 13 13 13
2869 13 13 13 13 13 13 13 12 12 13 12 12 12 11 11 12 13 13 13 13 12 12 11 11 12 12 12 12 13 14 14 14 15 15 15 14 14 13 13 13 13 12 12 12 13 14 13 13 14 14 13 14 14 14 14 15 15 15 15 15 14 14 15 15 15 14 13 13 12 13 13
2861 13 13 12 13 13 13 13 13 13 13 12 13 13 13 13 12 13 13 13 13 13 13 13 12 12 12 13 12 12 13 13 14 14 14 14 15 16 16 15 14 14 14 14 14 14 14 15 15 15 15 15 15 15 15 15 15 15 15 16 16 15 15 14 13 13 12 13 13 14 15 15
2854 15 14 13 13 14 14 14 13 13 13 13 14 15 15 15 14 14 14 14 13 13 13 14 14 14 13 14 14 14 14 14 14 13 13 14 15 15 16 16 17 17 16 15 15 16 16 16 16 16 15 15 15 16 16 16 15 15 13 13 13 13 13 12 11 12 12 14 15 15 14 14
$$ packed form
2906A4J%jjJ%%j%%%jJJJjj%JJj%J%jj%j%J%JJj%%%jJ%Jj%%%%%J%%J%j%j%%JK%jkj%J%%%j%
2898A3%%%%%j%%jJJJJj%jjJJJ%%%%%%%%%jj%%%%JJ%%j%%%%%%J%%%%%%%%j%%%%%%%%%jkJJJ
2891A4Jj%%j%%%j%j%%J%%J%JJJj%%j%%j%%%%%%Jj%%%J%%%%%%j%j%J%%J%JjjJ%jjjJ%%%JJj
2883A3%j%JJ%jJ%%%J%%%%%j%j%j%%JJ%%%j%jJ%%%J%%J%%%%%%%%%%%Jjj%%j%%jj%%JJ%%%%%
2876A3%%%J%J%%%%%j%%J%%%%%%%%%%j%JJj%%jj%%%%j%J%J%%%JJ%%%j%%%%Jj%%j%j%%%%%%%
2869A3%%%%%%j%Jj%%j%JJ%%%j%j%J%%%JJ%%J%%j%j%%%j%%JJj%J%jJ%%%J%%%%j%J%%jj%jJ%
2861A3%jJ%%%%%%jJ%%%jJ%%%%%%j%%Jj%J%J%%%JJ%jj%%%%%%J%%%%%%%%%%%J%j%jj%jJ%JJ%
2854A5jj%J%%j%%%JJ%%j%%%j%%J%%jJ%%%%%j%JJ%J%J%jj%J%%%%j%%J%%j%k%%%%jjJ%KJ%j%
$$ plain form
2846 14 14 14 14 14 14 14 14 14 14 13 13 13 12 12 12 12 12 12 13 13 13 13 13 13 13 13 13 13 13 14 15 15 15 14 12 12 13 14 14 14 14 15 15 15 15 15 16 16 16 15 15 15 14 14 15 14 13 13 14 14 15 16 15 15 15 15 14 14 14 14
2839 14 13 14 15 14 14 14 14 13 13 13 13 13 13 14 14 15 15 15 15 15 15 15 15 15 15 14 14 14 14 14 14 14 14 14 13 13 13 14 15 16 15 15 14 14 13 12 13 14 15 15 15 14 14 14 15 15 14 14 14 14 15 15 14 15 15 15 15 16 17 17
2831 17 16 15 15 14 14 14 14 14 14 14 14 14 14 14 14 13 13 13 14 13 13 13 12 13 13 13 12 12 12 12 11 12 13 14 14 13 13 14 15 14 14 13 13 13 13 13 13 13 14 14 14 14 14 14 15 14 14 14 14 14 14 14 14 14 14 14 14 15 16 16
2824 16 15 15 15 15 14 14 14 13 12 13 13 13 14 14 14 14 13 12 12 13 13 14 15 15 15 14 14 14 15 16 16 15 15 14 14 13 13 14 15 15 15 15 16 16 17 17 16 16 16 16 15 15 15 15 15 16 16 17 16 14 15 15 15 14 14 14 14 14 15 14
2817 14 14 13 13 14 14 15 16 16 16 16 16 15 15 14 14 13 13 13 13 13 13 13 13 13 13 13 14 13 13 13 12 12 13 13 13 13 14 14 14 14 14 14 13 13 13 13 14 14 15 15 15 15 14 13 13 14 14 14 14 13 13 13 14 14 14 13 14 14 14 14
2809 14 13 12 12 13 13 13 13 13 14 14 15 14 14 14 14 14 14 14 14 14 14 14 15 15 14 14 14 14 14 14 14 13 13 13 13 14 13 13 14 14 14 14 15 15 15 15 15 14 13 13 13 13 13 13 14 14 15 15 15 15 15 14 14 14 14 14 14 13 14 14
2802 14 14 14 14 13 12 12 13 13 12 11 12 12 12 13 14 14 14 15 15 15 14 15 15 15 16 16 15 13 14 14 15 15 16 16 17 16 16 16 16 15 15 14 14 14 15 15 15 16 16 17 18 17 16 16 15 15 15 15 15 15 15 15 15 16 16 16 16 16 15 16
2794 16 16 17 18 17 17 16 16 15 15 14 13 14 15 16 16 15 15 15 15 16 16 16 15 15 14 14 15 15 15 15 16 16 17 17 17 16 16 15 15 15 15 15 15 15 15 15 15 16 16 16 16 16 15 14 14 14 15 16 16 16 15 15 14 14 14 14 15 15 15 14
$$ packed form
2846A4%%%%%%%%%j%%j%%%%%J%%%%%%%%%%JJ%%jk%JJ%%%J%%%%J%%j%%j%Jjj%J%JJj%%%j%%%
2839A4jJJj%%%j%%%%%J%J%%%%%%%%%j%%%%%%%%j%%JJJj%j%jjJJJ%%j%%J%j%%%J%jJ%%%JJ%
2831A7jj%j%%%%%%%%%%%j%%Jj%%jJ%%j%%%jJJJ%j%JJj%j%%%%%%J%%%%%Jj%%%%%%%%%%%JJ%
2824A6j%%%j%%jjJ%%J%%%jj%J%JJ%%j%%JJ%j%j%j%JJ%%%J%J%j%%%j%%%%J%JjkJ%%j%%%%Jj
2817A4%j%J%JJ%%%%j%j%j%%%%%%%%%%Jj%%j%J%%%J%%%%%j%%%J%J%%%jj%J%%%j%%J%%jJ%%%
2809A4jj%J%%%%J%Jj%%%%%%%%%%J%j%%%%%%j%%%Jj%J%%%J%%%%jj%%%%%J%J%%%%j%%%%%jJ%
2802A4%%%jj%J%jjJ%%JJ%%J%%jJ%%J%jkJ%J%J%Jj%%%j%j%%J%%J%JJjj%j%%%%%%%%J%%%%jJ
2794A6%JJj%j%j%jjJJJ%j%%%J%%j%j%J%%%J%J%%j%j%%%%%%%%%J%%%%jj%%JJ%%j%j%%%J%%j
$$ plain form
2787 14 14 14 14 14 15 15 14 14 15 15 16 16 16 16 16 16 16 15 15 15 15 14 14 15 15 15 16 17 17 18 17 16 15 15 15 15 15 15 15 16 16 16 17 16 16 16 15 15 16 16 16 16 17 17 18 17 17 17 16 16 15 15 15 16 16 16 16 16 16 16
2780 16 16 16 15 15 15 16 15 14 13 13 12 13 14 15 15 16 16 16 15 15 15 15 14 14 14 14 14 15 15 14 14 14 15 14 14 14 13 13 14 14 15 16 16 15 15 15 14 14 14 14 14 14 14 15 15 15 15 15 15 16 16 16 16 16 16 16 15 15 14 15
2772 15 15 15 14 14 15 16 17 17 16 15 14 13 14 15 15 15 15 15 15 14 13 12 12 13 14 14 14 14 13 14 13 12 12 12 13 13 13 13 13 14 15 14 14 15 15 15 16 16 17 17 16 15 15 16 16 16 15 15 14 15 15 14 14 14 14 15 16 16 15 15
2765 15 15 15 15 15 16 16 16 16 16 16 16 15 15 15 15 15 15 15 15 14 14 15 15 15 15 14 13 14 14 15 16 16 17 17 18 17 16 16 16 15 14 13 13 14 14 15 16 16 16 15 15 15 15 16 17 16 16 16 16 16 17 18 17 16 15 15 15 16 17 17
2757 17 16 16 16 16 17 17 16 16 15 16 16 16 16 17 17 17 17 17 17 17 18 18 17 16 16 16 16 15 15 16 16 16 15 15 14 14 13 14 14 15 16 16 17 17 17 17 17 17 17 17 17 16 15 16 16 16 16 16 17 16 16 15 15 15 17 18 18 18 18 18
2750 18 17 17 18 18 18 18 17 17 17 16 16 15 14 15 16 16 17 17 17 17 17 17 16 16 16 16 16 16 16 15 14 14 14 15 15 15 15 15 15 15 15 16 16 16 15 15 15 16 16 16 16 16 15 14 14 15 16 16 16 16 16 16 15 16 17 17 17 17 17 17
2742 17 17 17 16 16 15 15 15 15 15 15 15 15 15 15 15 16 17 18 18 19 18 18 17 17 17 17 17 16 16 15 15 15 16 15 15 15 15 15 15 16 16 16 16 17 17 18 18 18 17 17 16 16 16 17 17 18 19 19 20 19 18 17 16 15 15 16 16 17 18 17
2735 17 17 16 16 15 15 14 14 14 14 15 15 16 16 17 18 18 18 17 17 17 16 17 16 16 17 16 16 16 16 15 15 15 16 17 16 17 17 17 18 17 17 16 15 14 14 15 16 16 17 17 17 18 17 17 17 17 17 17 17 17 17 17 17 17 17 17 17 16 16 17
$$ packed form
2787A4%%%%J%j%J%J%%%%%%j%%%j%J%%JJ%Jjjj%%%%%%J%%Jj%%j%J%%%J%Jj%%j%j%%J%%%%%%
2780A6%%j%%Jjjj%jJJJ%J%%j%%%j%%%%J%j%%Jj%%j%J%JJ%j%%j%%%%%%J%%%%%J%%%%%%j%jJ
2772A5%%j%JJJ%jjjjJJ%%%%%jjj%JJ%%%jJjj%%J%%%%JJj%J%%J%J%jj%J%%j%jJ%j%%%JJ%j%
2765A5%%%%J%%%%%%j%%%%%%%j%J%%%jjJ%JJ%J%Jjj%%jjj%J%JJ%%j%%%JJj%%%%JJjjj%%JJ%
2757A7j%%%J%j%jJ%%%J%%%%%%J%jj%%%j%J%%j%j%jJ%JJ%J%%%%%%%%jjJ%%%%Jj%j%%KJ%%%%
2750A8j%J%%%j%%j%jjJJ%J%%%%%j%%%%%%jj%%J%%%%%%%J%%j%%J%%%%jj%JJ%%%%%jJJ%%%%%
2742A7%%j%j%%%%%%%%%%JJJ%Jj%j%%%%j%j%%Jj%%%%%J%%%J%J%%j%j%%J%JJ%Jjjjjj%J%JJj
2735A7%j%j%j%%%J%J%JJ%%j%%jJj%Jj%%%j%%JJjJ%%Jj%jjj%JJ%J%%Jj%%%%%%%%%%%%%%j%J
$$ plain form
2728 17 17 17 18 18 17 18 18 18 18 18 18 18 18 19 19 18 18 18 19 19 18 17 17 18 18 18 18 18 17 16 15 15 14 13 13 13 14 15 16 17 18 17 17 18 18 18 18 17 17 17 17 17 17 17 17 18 18 17 17 17 18 18 19 18 18 18 18 17 18 18
2720 18 18 18 18 18 18 18 17 17 17 17 18 17 17 17 18 19 19 18 18 17 17 17 18 18 19 19 19 19 19 19 19 19 19 18 18 18 18 18 18 18 17 18 19 20 20 20 19 19 19 20 21 20 19 19 19 19 19 19 19 19 19 19 19 19 20 20 20 20 20 20
2713 20 19 19 20 20 21 21 22 22 22 23 23 23 23 24 24 24 24 24 24 24 24 23 23 24 26 27 28 29 29 30 31 31 32 33 34 36 37 38 39 42 45 47 50 53 56 58 62 66 70 73 76 78 80 84 87 89 90 90 89 87 85 83 81 78 74 70 67 64 61 58
2705 58 55 53 51 50 47 44 41 40 38 37 36 35 35 34 34 33 33 32 31 31 30 30 30 29 28 27 26 26 26 26 25 25 25 25 25 25 26 26 26 26 26 25 25 24 24 23 23 23 21 21 21 21 21 20 20 21 21 21 21 21 21 21 22 22 22 22 22 22 22 22
2698 22 22 22 22 21 21 21 21 21 21 20 20 19 20 21 21 21 22 21 21 21 21 21 21 21 21 22 22 22 22 22 23 23 23 22 22 21 21 21 21 22 22 23 24 24 24 24 24 24 23 22 21 22 23 23 23 23 22 23 24 23 22 21 22 23 22 22 23 23 24 23
2691 23 23 22 22 22 23 23 24 23 23 23 23 23 24 24 24 24 23 23 23 22 22 22 21 21 21 21 22 22 23 22 22 22 22 22 23 23 23 24 24 25 25 25 25 24 23 24 25 26 27 27 27 26 25 25 25 25 26 26 26 26 25 25 24 24 25 25 26 27 26 24
2683 24 23 23 24 24 24 24 25 25 25 24 25 26 27 27 26 26 26 26 27 27 28 27 26 26 27 28 28 28 28 28 28 27 27 27 28 28 29 28 27 27 27 27 27 27 27 27 27 27 28 28 29 29 29 29 29 28 28 28 29 29 30 29 29 29 29 29 30 29 29 29
2676 29 29 29 29 28 28 28 29 29 29 29 30 31 31 30 29 28 28 28 28 29 29 29 29 29 29 29 29 29 29 29 29 29 29 30 30 31 32 31 31 31 32 32 33 34 34 35 35 35 36 36 36 37 37 38 39 39 40 40 39 40 39 38 39 41 42 41 41 39 39 41
$$ packed form
2728A7%%J%jJ%%%%%%%J%j%%J%jj%J%%%%jjj%jj%%JJJJJj%J%%%j%%%%%%%J%j%%J%Jj%%%jJ%
2720A8%%%%%%j%%%Jj%%JJ%j%j%%J%J%%%%%%%%j%%%%%%jJJJ%%j%%JJjj%%%%%%%%%%%J%%%%%
2713B0j%J%J%J%%J%%%J%%%%%%%j%JKJJJ%JJ%JJJKJJJLLKLLLKMMMLLKKMLKJ%jkkkklmmllll
2705E8lkkjllljkjjj%j%j%jj%j%%jjjj%%%j%%%%%J%%%%j%j%j%%k%%%%j%J%%%%%%J%%%%%%%
2698B2%%%j%%%%%j%jJJ%%Jj%%%%%%%J%%%%J%%j%j%%%J%JJ%%%%%jjjJJ%%%jJJjjjJJj%J%Jj
2691B3%j%%J%Jj%%%%J%%%j%%j%%j%%%J%Jj%%%%J%%J%J%%%jjJJJJ%%jj%%%J%%%j%j%J%JJjk
2683B4j%J%%%J%%jJJJ%j%%%J%Jjj%JJ%%%%%j%%J%Jjj%%%%%%%%%J%J%%%%j%%J%Jj%%%%Jj%%
2676B9%%%j%%J%%%JJ%jjj%%%J%%%%%%%%%%%%%J%JJj%%J%JJ%J%%J%%J%JJ%J%jJjjJKJj%k%K
$$ plain form
2668 41 42 43 43 43 43 43 43 44 45 45 46 45 44 44 45 45 45 45 45 47 48 48 48 47 47 48 49 50 51 51 52 52 52 53 54 54 54 53 53 54 54 55 56 56 57 57 57 58 59 60 60 60 60 61 62 62 62 62 63 63 63 63 63 63 63 64 65 66 67 67
2661 67 68 68 67 68 68 68 68 67 67 67 67 68 68 68 68 68 67 68 68 69 70 70 71 73 75 77 80 83 86 89 92 96 99 102 105 107 110 113 115 116 116 117 116 114 113 110 109 109 109 109 109 109 108 110 111 113 116 118 121 123 126 130 135 139 144 147 150 155 161 165
2653 165 170 174 178 183 188 193 197 203 209 215 221 226 232 238 243 250 256 262 269 276 285 293 301 309 317 325 333 342 351 362 372 382 393 405 417 431 445 459 473 489 506 525 545 565 588 613 640 668 697
2648 697 729 765 803 844 888 936 987 1042 1102 1167 1237 1312 1393 1480 1576 1680 1793 1917 2052 2203 2369 2552 2757 2985 3239 3523 3838 4188
2645 4188 4576 5004 5475 5987 6541 7135 7764 8420 9094 9773 10441 11082 11676 12203 12648 12994 13226 13337 13324 13186 12930 12566 12107
2643 12107 11570 10970 10328 9660 8984 8314 7659 7033 6441 5888 5378 4912 4488 4106 3763 3458 3187 2946 2731 2540 2368 2216 2078
2640 2078 1952 1837 1733 1636 1546 1462 1383 1310 1241 1176 1114 1055 1001 950 901 856 813 773 734 698 665 634 606 579 554 530 507 485 467 449 431 414 397
2637 397 381 366 354 342 329 318 306 295 285 276 269 261 255 248 242 236 231 226 223 218 214 210 207 204 200 197 194 191 189 187 184 181 178 175 172 171 170 169 167 165 164 163 161 160 158 157 155 154 152 151 149 147 145 143 140 138 136 133 129 126
$$ packed form
2668D1JJ%%%%%JJ%Jjj%J%%%%KJ%%j%JJJJ%J%%JJ%%j%J%JJ%J%%JJJ%%%JJ%%%J%%%%%%JJJJ%
2661F7J%jJ%%%j%%%J%%%%jJ%JJ%JKKKLLLLLMLLLKLLKJ%Jjkjlj%%%%%jKJKLKLKLMNMNLLNOM
2653A65NMMNNNMOOOONOONPOOPPRQQQQQQRRJ1J0J0J1J2J2J4J4J4J4J6J7J9K0K0K3K5K7K8K9
2648F97L2L6L8M1M4M8N1N5O0O5P0P5Q1Q7R6J04J13J24J35J51J66J83K05K28K54K84L15L50
2645D188L88M28M71N12N54N94O29O56O74O79O68O41N94N27M45L46K32J11j3j38k56l64m59
2643A2107n37o00o42o68o76o70o55o26n92n53n10m66m24l82l43l05k71k41k15j91j72j52j38
2640B078j26j15j04r7r0q4p9p3o9o5o2n9n4n1m9m5m3m0l9l6l3l1k8k7k5k4k3k2j8j8j8j7j7
2637C97j6j5j2j2j3j1j2j1j0rpqopoonnlnmmllmlllkkllllljjjkkjjkjkjkjkjkkkklkklml
$$ plain form
2631 126 123 119 117 115 112 110 108 108 107 107 107 107 108 108 107 107 108 110 110 110 109 108 107 107 106 105 103 101 100 97 94 92 90 88 87 85 83 81 80 79 77 76 75 74 73 72 70 69 68 68 67 66 65 65 64 63 62 61 60 59 58 57 57 56 56 56 56 54 54
2623 54 54 53 52 50 50 50 50 50 50 50 49 48 48 47 47 46 46 46 46 46 46 47 46 46 46 45 45 45 44 44 44 44 45 45 46 46 45 44 43 43 43 43 43 43 44 43 43 43 42 41 41 41 41 41 41 42 41 39 39 40 41 40 39 39 38 38 39 40 41 42
2616 42 42 42 41 40 39 38 39 39 39 39 39 39 39 39 38 39 39 38 38 38 38 39 38 38 38 38 37 36 36 37 38 38 37 36 36 37 37 37 37 36 36 35 35 35 34 34 35 36 36 36 35 34 33 32 33 33 32 31 31 31 31 30 29 29 30 30 29 30 30 30
2608 30 30 29 29 29 28 28 28 28 27 27 27 27 28 28 29 29 28 28 28 28 27 27 27 27 27 27 27 27 27 26 26 26 26 28 28 28 28 28 28 29 31 32 33 34 35 36 37 39 40 41 42 43 44 45 44 42 41 39 38 37 36 35 33 31 30 29 28 28 28 27
2601 27 27 26 26 26 25 24 25 25 25 25 26 26 26 26 25 24 24 24 24 24 24 25 24 24 23 23 23 24 24 24 25 25 25 25 25 25 25 25 24 24 24 24 24 24 24 24 23 23 23 23 23 23 24 24 23 23 22 21 22 22 22 22 22 22 22 21 21 22 22 23
2594 23 23 24 23 23 22 22 23 23 23 22 22 22 22 22 21 21 21 20 21 21 21 21 22 22 22 21 21 22 23 23 22 22 21 21 21 22 22 22 22 22 22 22 21 21 21 20 20 20 20 20 21 21 22 22 23 22 21 20 19 18 19 19 20 20 19 19 19 20 20 20
2586 20 21 22 21 20 20 20 20 20 21 21 20 20 20 20 20 20 20 20 21 22 22 21 21 21 22 22 22 23 24 24 23 24 24 23 23 23 22 22 23 24 24 25 25 26 26 27 27 27 27 27 27 29 30 31 32 34 35 36 37 39 41 43 45 46 48 51 54 57 61 65
2579 65 69 73 76 79 82 85 87 89 90 90 90 89 86 82 80 77 75 72 68 64 61 57 54 52 49 46 43 41 40 39 36 35 34 33 32 32 32 30 29 28 27 27 26 25 24 24 24 24 23 23 24 24 23 24 23 23 23 22 22 22 23 22 21 20 21 21 21 21 22 22
$$ packed form
2631A26lmkklkk%j%%%J%j%JK%%jjj%jjkkjllkkkjkkkjjkjjjjjkjj%jjj%jjjjjjjj%j%%%k%
2623E4%jjk%%%%%%jj%j%j%%%%%Jj%%j%%j%%%J%J%jjj%%%%%Jj%%jj%%%%%Jjk%JJjj%j%JJJJ
2616D2%%jjjjJ%%%%%%%jJ%j%%%Jj%%%jj%JJ%jj%J%%%j%j%%j%JJ%%jjjjJ%jj%%%jj%J%jJ%%
2608C0%j%%j%%%j%%%J%J%j%%%j%%%%%%%%j%%%K%%%%%JKJJJJJJKJJJJJJjkjkjjjjkkjjj%%j
2601B7%j%%jjJ%%%J%%%jj%%%%%Jj%j%%J%%J%%%%%%%j%%%%%%%j%%%%%J%j%jjJ%%%%%%j%J%J
2594B3%Jj%j%J%%j%%%%j%%jJ%%%J%%j%JJ%j%j%%J%%%%%%j%%j%%%%J%J%JjjjjjJ%J%j%%J%%
2586B0JJjj%%%%J%j%%%%%%%JJ%j%%J%%JJ%jJ%j%%j%JJ%J%J%J%%%%%KJJJKJJJKKKKJKLLLMM
2579F5MMLLLLKKJ%%jlmklklmmlmlklllkjjljjjj%%kjjj%jjj%%%j%J%jJj%%j%%JjjjJ%%%J%
$$ plain form
2571 22 22 20 20 19 19 19 19 19 19 19 20 20 20 19 19 18 18 18 18 19 19 19 19 20 20 20 21 22 21 19 17 18 19 19 18 18 18 17 17 17 18 18 18 17 16 16 16 17 18 19 19 19 18 17 17 17 18 18 17 16 16 17 17 17 17 17 18 18 18 18
2564 18 18 19 17 16 16 17 17 18 18 18 18 18 18 18 18 18 17 17 17 17 17 17 16 16 16 16 16 16 16 16 17 18 18 19 18 18 18 18 16 15 15 15 15 16 16 16 16 16 16 17 17 17 17 17 17 18 17 16 15 15 16 16 16 17 17 17 17 16 16 15
2556 15 15 16 16 16 16 16 16 17 16 17 17 17 16 16 16 16 15 15 15 16 16 16 16 17 16 15 15 14 14 15 15 16 15 15 15 16 17 18 17 17 17 17 18 17 17 17 17 18 18 18 18 18 18 18 17 16 16 16 16 15 16 16 16 16 16 15 15 15 14 13
2549 13 13 13 14 15 15 15 16 17 17 16 16 16 16 15 16 16 16 15 14 14 15 16 16 16 16 17 17 16 16 16 16 17 17 17 17 17 17 17 17 17 17 16 16 16 16 17 17 17 17 17 17 18 18 17 17 16 16 15 15 15 15 15 16 16 16 16 16 16 16 17
2542 17 17 18 18 17 16 16 16 16 16 16 16 16 17 17 18 18 18 18 18 18 17 16 17 18 18 17 16 16 17 17 18 18 17 17 16 15 15 16 18 17 17 18 18 18 17 17 17 17 17 17 16 15 15 15 15 15 15 15 15 15 16 16 16 16 17 17 16 16 16 15
2534 15 14 14 15 15 15 16 15 14 14 15 14 14 14 14 15 15 15 15 15 15 15 14 14 14 14 15 15 15 15 16 15 15 15 14 14 14 13 13 14 15 16 16 17 18 18 17 17 17 16 15 15 16 16 16 16 16 16 15 15 15 15 14 15 15 16 16 16 16 15 15
2527 15 15 15 15 15 16 16 15 15 15 15 16 16 16 17 17 16 16 15 15 16 16 15 15 15 15 15 15 16 15 15 14 14 14 15 15 15 15 15 15 15 14 14 15 15 15 14 13 13 13 14 15 15 16 16 16 16 17 16 16 15 14 14 14 14 14 15 15 15 15 15
2519 15 16 16 17 17 16 15 15 16 16 16 15 15 14 13 13 14 14 14 14 14 14 15 15 16 17 17 17 17 16 16 16 17 16 16 16 16 15 15 16 16 16 17 17 17 17 16 15 15 15 15 15 16 16 16 16 16 16 15 15 15 14 13 13 13 15 15 15 14 14 15
$$ packed form
2571B2%k%j%%%%%%J%%j%j%%%J%%%J%%JJjkkJJ%j%%j%%J%%jj%%JJJ%%jj%%J%jj%J%%%%J%%%
2564A8%Jkj%J%J%%%%%%%%j%%%%%j%%%%%%%JJ%Jj%%%kj%%%J%%%%%J%%%%%Jjjj%J%%J%%%j%j
2556A5%J%%%%%JjJ%%j%%%j%%J%%%Jjj%j%J%Jj%%JJJj%%%Jj%%%J%%%%%%jj%%%jJ%%%%j%%jj
2549A3%%JJ%%JJ%j%%%jJ%%jj%JJ%%%J%j%%%J%%%%%%%%%j%%%J%%%%%J%j%j%j%%%%J%%%%%%J
2542A7%J%jj%%%%%%%J%J%%%%%jjJJ%jj%J%J%j%jj%JKj%J%%j%%%%%jj%%%%%%%%J%%%J%j%%j
2534A5j%J%%Jjj%Jj%%%J%%%%%%j%%%J%%%Jj%%j%%j%JJJ%JJ%j%%jj%J%%%%%j%%%jJ%J%%%j%
2527A5%%%%J%j%%%J%%J%j%j%J%j%%%%%Jj%j%%J%%%%%%j%J%%jj%%JJ%J%%%Jj%jj%%%%J%%%%
2519A5J%J%jj%J%%j%jj%J%%%%%J%JJ%%%j%%Jj%%%j%J%%J%%%jj%%%%J%%%%%j%%jj%%K%%j%J
$$ plain form
2512 15 15 14 15 15 16 16 15 15 15 14 14 14 15 15 15 15 16 15 15 15 14 15 16 15 16 16 16 15 15 15 15 15 15 14 14 14 15 16 16 16 14 14 14 14 14 14 14 13 14 14 14 14 13 12 13 13 13 12 11 12 12 13 14 14 14 14 13 14 14 14
2505 14 14 14 14 14 15 15 15 14 14 13 13 14 14 14 13 13 12 12 12 12 12 13 13 13 14 14 14 14 15 15 15 15 16 16 17 17 17 16 16 16 15 15 15 15 15 14 14 13 14 14 14 15 15 16 16 15 15 15 14 13 14 14 14 15 16 16 15 15 14 13
2497 13 14 14 15 15 15 15 15 15 16 15 14 14 14 14 13 13 13 13 14 14 13 13 13 13 13 13 14 14 15 15 16 16 16 16 16 16 16 16 15 14 13 13 12 12 12 13 13 12 12 13 13 13 13 13 14 15 15 16 16 16 15 15 15 14 14 14 14 15 15 15
2490 15 15 15 15 15 14 14 14 15 14 14 14 14 14 14 14 14 15 15 15 15 15 14 14 13 13 14 14 15 16 15 15 14 14 13 14 16 16 16 16 15 15 15 15 15 16 16 16 16 15 16 16 17 16 15 15 15 15 15 15 15 15 15 14 14 14 15 15 15 15 14
2482 14 14 14 14 14 14 15 16 16 16 15 14 13 13 14 14 13 13 13 14 14 13 13 13 13 12 12 13 14 16 16 15 15 14 14 14 15 15 15 16 16 16 16 15 15 16 16 17 17 17 16 17 18 18 17 17 17 17 16 16 15 16 17 16 16 15 15 16 16 16 17
2475 17 16 15 15 15 14 14 15 14 14 14 14 14 14 14 14 14 14 15 15 15 15 15 13 14 14 14 14 14 14 14 14 14 13 14 14 15 14 13 13 12 12 13 14 14 14 14 14 15 14 13 14 14 14 14 15 15 15 16 15 15 15 15 14 14 13 12 12 13 14 15
2467 15 15 14 13 13 14 15 15 15 14 14 15 15 15 15 14 13 13 14 15 15 15 14 14 14 14 14 14 14 14 14 15 14 14 14 14 13 12 12 12 13 14 14 14 13 13 13 13 14 14 15 15 16 15 15 15 15 15 15 16 16 16 16 16 16 16 15 16 17 17 17
2460 17 16 15 15 15 15 15 16 16 15 13 13 13 13 13 14 14 14 14 15 16 16 16 16 16 16 16 15 14 15 15 15 16 16 15 15 15 14 13 13 13 13 14 14 14 14 14 14 13 14 15 15 15 15 15 15 14 13 13 14 14 14 14 14 14 15 15 15 16 16 16
$$ packed form
2512A5%jJ%J%j%%j%%J%%%Jj%%jJJjJ%%j%%%%%j%%JJ%%k%%%%%%jJ%%%jjJ%%jjJ%JJ%%%jJ%%
2505A4%%%%J%%j%j%J%%j%j%%%%J%%J%%%J%%%J%J%%j%%j%%%%j%jJ%%J%J%j%%jjJ%%JJ%j%jj
2497A3J%J%%%%%Jjj%%%j%%%J%j%%%%%J%J%J%%%%%%%jjj%j%%J%j%J%%%%JJ%J%%j%%j%%%J%%
2490A5%%%%j%%Jj%%%%%%%J%%%%j%j%J%JJj%j%jJK%%%j%%%%J%%%jJ%Jjj%%%%%%%%j%%J%%%j
2482A4%%%%%JJ%%jjj%J%j%%J%j%%%j%JJK%j%j%%J%%J%%%j%J%J%%jJJ%j%%%j%jJJj%j%J%%J
2475A7jj%%j%Jj%%%%%%%%%J%%%%kJ%%%%%%%%jJ%Jjj%j%JJ%%%%JjjJ%%%J%%Jj%%%j%jj%JJJ
2467A5%jj%JJ%%j%J%%%jj%JJ%%j%%%%%%%%Jj%%%jj%%JJ%%j%%%J%J%Jj%%%%%J%%%%%%jJJ%%
2460A7jj%%%%J%jk%%%%J%%%JJ%%%%%%jjJ%%J%j%%jj%%%J%%%%%jJJ%%%%%jj%J%%%%%J%%J%%
$$ plain form
2453 16 16 17 16 15 15 15 15 14 14 15 15 15 15 15 14 14 14 14 15 15 15 15 14 13 13 14 14 14 14 14 14 13 14 13 13 13 13 14 14 15 15 14 13 13 13 13 13 13 13 13 14 15 15 13 12 12 12 12 13 14 14 14 14 14 14 14 13 13 13 13
2445 13 13 13 14 15 16 16 16 15 14 15 14 14 14 14 15 15 14 14 14 14 14 14 13 13 13 13 13 13 14 14 14 14 14 14 15 15 16 16 17 16 16 15 15 15 14 14 15 15 15 15 14 13 13 14 14 14 14 14 13 13 14 14 13 13 13 13 13 13 13 13
2438 13 13 13 13 12 12 13 13 13 14 14 14 13 13 13 13 13 13 14 14 15 14 15 15 16 16 16 16 16 16 15 15 16 16 17 16 15 14 14 15 15 14 14 14 14 14 14 14 13 14 14 14 14 14 15 15 15 15 14 14 13 13 13 13 14 14 15 15 15 14 14
2430 14 14 14 14 13 13 13 13 13 13 14 14 15 16 17 16 14 13 13 14 15 15 15 14 13 13 13 14 15 16 16 15 14 13 13 14 14 14 14 15 15 15 14 14 14 15 15 15 15 14 14 14 14 15 15 15 14 15 15 15 14 14 14 14 14 14 15 15 15 16 16
2423 16 15 15 14 13 13 13 13 13 13 13 14 13 13 14 14 15 16 16 16 16 15 15 14 13 13 13 14 14 14 14 14 14 14 14 14 14 14 13 13 13 13 13 13 14 14 14 14 14 14 14 14 14 14 14 15 15 15 16 17 17 16 16 16 15 15 15 15 15 15 15
2416 15 15 15 14 13 14 14 14 14 15 15 14 14 14 15 15 15 14 13 14 14 14 14 15 16 16 16 16 15 14 14 14 14 14 15 14 13 13 13 13 13 13 13 14 15 15 15 15 14 14 14 13 12 12 13 14 15 15 15 15 15 14 14 14 14 14 14 14 13 13 13
2408 13 14 15 15 16 16 15 15 15 15 15 15 14 14 14 14 15 15 15 15 14 14 14 14 14 15 15 15 15 15 15 15 15 14 14 14 14 14 15 15 15 15 15 15 14 14 14 14 14 14 14 14 13 13 13 14 14 13 13 14 14 14 14 13 13 13 13 14 14 14 14
2401 14 14 14 13 13 12 12 13 13 13 13 13 12 12 12 12 13 13 14 14 14 14 14 15 15 15 15 16 17 16 16 17 18 18 18 17 16 16 16 15 15 16 16 15 15 15 14 14 14 13 13 12 12 12 12 13 13 13 13 14 15 15 15 14 14 15 15 15 14 14 13
$$ packed form
2453A6%Jjj%%%j%J%%%%j%%%J%%%jj%J%%%%%jJj%%%J%J%jj%%%%%%%JJ%kj%%%JJ%%%%%%j%%%
2445A3%%JJJ%%jjJj%%%J%j%%%%%j%%%%%J%%%%%J%J%Jj%j%%j%J%%%jj%J%%%%j%J%j%%%%%%%
2438A3%%%j%J%%J%%j%%%%%J%JjJ%J%%%%%j%J%Jjjj%J%j%%%%%%jJ%%%%J%%%j%j%%%J%J%%j%
2430A4%%%j%%%%%J%JJJjkj%JJ%%jj%%JJJ%jjj%J%%%J%%j%%J%%%j%%%J%%jJ%%j%%%%%J%%J%
2423A6j%jj%%%%%%Jj%J%JJ%%%j%jj%%J%%%%%%%%%%j%%%%%J%%%%%%%%%%J%%JJ%j%%j%%%%%%
2416A5%%jjJ%%%J%j%%J%%jjJ%%%JJ%%%jj%%%%Jjj%%%%%%JJ%%%j%%jj%JJJ%%%%j%%%%%%j%%
2408A3JJ%J%j%%%%%j%%%J%%%j%%%%J%%%%%%%j%%%%J%%%%%j%%%%%%%j%%J%j%J%%%j%%%J%%%
2401A4%%j%j%J%%%%j%%%J%J%%%%J%%%JJj%JJ%%jj%%j%J%j%%j%%j%j%%%J%%%JJ%%j%J%%j%j
$$ plain form
2393 13 13 12 12 12 12 13 13 13 14 14 13 12 12 12 12 13 13 12 12 12 12 13 13 13 13 13 12 12 13 13 13 14 14 14 14 14 14 14 14 15 16 15 15 15 15 16 16 16 15 14 13 12 12 13 13 14 13 13 13 13 13 13 12 12 13 14 15 16 16 16
2386 16 16 16 15 14 15 15 15 14 14 14 14 15 15 15 15 15 15 15 15 15 15 15 15 15 16 16 16 16 16 15 15 15 14 14 13 13 14 14 14 14 14 14 13 13 13 13 13 12 12 12 12 13 13 13 14 14 14 14 14 14 14 15 14 14 14 14 14 14 14 14
2378 14 14 14 14 14 14 14 14 13 13 12 11 12 13 14 14 14 14 15 15 14 13 13 13 14 14 14 14 14 14 15 14 14 14 15 15 15 14 13 13 13 14 14 14 14 14 14 13 13 14 15 15 15 15 15 15 15 15 14 14 13 13 13 13 12 13 13 14 14 14 14
2371 14 14 14 13 13 13 13 13 13 13 13 13 14 14 14 14 13 13 13 13 13 14 15 15 15 14 13 14 15 15 15 14 14 13 12 12 13 14 14 13 12 13 13 14 13 13 13 13 13 13 12 12 12 12 11 12 12 13 14 15 15 16 16 16 16 15 15 16 16 16 15
2364 15 14 14 14 14 13 13 13 13 13 12 13 14 15 15 15 15 14 14 14 15 16 15 15 14 14 14 14 15 15 15 14 14 13 13 14 15 15 15 14 14 13 13 13 13 14 14 14 15 15 15 15 14 14 14 14 14 14 14 14 14 14 14 13 12 12 12 12 13 13 14
2356 14 14 13 14 16 17 16 16 16 15 15 15 15 15 15 14 14 13 14 15 14 15 15 16 16 16 16 16 16 16 15 14 14 14 15 16 15 15 15 15 15 15 15 15 15 15 14 15 15 15 15 15 14 12 12 12 12 13 13 13 13 13 12 12 11 12 13 13 14 13 13
2349 13 13 14 15 16 15 15 15 15 15 15 15 15 15 15 15 15 14 14 14 14 14 14 14 15 15 14 14 13 14 14 14 14 14 14 14 14 15 15 14 14 14 14 14 14 14 14 14 14 14 15 15 14 15 15 15 16 15 15 15 14 14 14 14 14 14 14 14 15 14 14
2341 14 13 13 13 13 13 13 13 14 14 15 14 14 13 13 13 14 14 14 14 15 15 15 15 14 15 15 15 15 15 15 14 13 13 12 12 13 14 14 14 14 14 13 13 14 15 15 15 15 15 15 14 14 14 13 13 14 14 14 14 14 14 15 15 15 15 15 15 14 13 13
$$ packed form
2393A3%j%%%J%%J%jj%%%J%j%%%J%%%%j%J%%J%%%%%%%JJj%%%J%%jjjj%J%Jj%%%%%j%JJJJ%%
2386A6%%jjJ%%j%%%J%%%%%%%%%%%%J%%%%j%%j%j%J%%%%%j%%%%j%%%J%%J%%%%%%Jj%%%%%%%
2378A4%%%%%%%j%jjJJJ%%%J%jj%%J%%%%%Jj%%J%%jj%%J%%%%%j%JJ%%%%%%%j%j%%%jJ%J%%%
2371A4%%j%%%%%%%%J%%%j%%%%JJ%%jjJJ%%j%jj%JJ%jjJ%Jj%%%%%j%%%jJ%JJJ%J%%%j%J%%j
2364A5j%%%j%%%%jJJJ%%%j%%JJj%j%%%J%%j%j%JJ%%j%j%%%J%%J%%%j%%%%%%%%%%jj%%%J%J
2356A4%jJKJj%%j%%%%%j%jJJjJ%J%%%%%%jj%%JJj%%%%%%%%%jJ%%%%jk%%%J%%%%j%jJJ%Jj%
2349A3%JJJj%%%%%%%%%%%j%%%%%%J%j%jJ%%%%%%%J%j%%%%%%%%%%J%jJ%%Jj%%j%%%%%%%Jj%
2341A4j%%%%%%J%Jj%j%%J%%%J%%%jJ%%%%%jj%j%JJ%%%%j%JJ%%%%%j%%j%J%%%%%J%%%%%jj%
$$ plain form
2334 13 13 12 11 11 11 12 12 13 13 13 13 14 14 13 13 14 13 13 13 14 14 14 13 13 14 15 15 15 15 15 15 15 14 14 14 15 15 15 15 15 14 14 14 14 14 14 14 13 13 14 14 13 13 12 13 13 14 14 14 13 13 13 13 12 12 13 13 13 14 15
2327 15 16 16 15 15 15 14 14 14 14 14 14 13 13 13 13 13 13 13 13 13 13 13 13 14 14 14 14 14 14 15 15 15 15 14 15 16 15 15 14 14 14 14 15 15 14 14 14 14 14 13 13 13 13 13 13 12 13 14 14 15 15 14 14 14 14 14 14 14 14 13
2319 13 13 13 14 15 15 15 15 15 14 13 13 13 14 14 15 15 15 15 15 16 16 16 15 14 13 13 13 13 14 14 14 13 14 14 14 15 16 17 17 16 16 15 14 13 12 12 13 14 14 15 16 16 16 16 15 15 15 14 15 16 15 14 15 15 15 15 15 15 14 14
2312 14 15 16 18 18 17 16 15 14 13 13 13 12 12 12 13 13 14 14 15 15 16 16 16 15 15 14 14 14 14 14 14 14 15 15 15 16 15 14 13 13 13 13 13 13 13 14 14 14 15 14 14 15 15 15 15 15 15 15 14 14 14 15 15 16 16 16 16 16 16 16
2304 16 15 15 15 15 15 15 15 16 16 16 15 13 13 13 14 13 12 12 11 12 13 14 15 15 15 15 15 14 14 14 14 14 14 14 14 14 14 14 14 14 14 13 14 14 14 15 15 16 15 15 14 14 13 13 12 13 14 14 14 15 15 15 15 15 15 13 12 12 12 13
2297 13 13 13 14 14 14 15 15 15 14 14 15 15 15 15 15 14 13 13 14 14 14 14 13 12 13 14 14 14 14 14 14 13 12 13 13 13 13 13 13 12 13 14 14 14 14 14 13 13 13 14 14 13 12 13 14 14 14 14 14 14 15 14 13 13 13 13 13 13 12 12
2289 12 12 12 13 13 13 13 13 13 13 13 14 15 15 15 14 13 13 13 13 14 15 14 13 13 13 13 13 13 13 14 14 15 16 16 16 15 15 15 15 16 15 15 14 14 13 13 14 15 15 15 14 14 14 14 14 14 14 14 15 15 16 15 15 15 15 15 15 15 16 15
2282 15 15 15 16 16 16 16 15 15 14 14 14 14 14 13 12 12 12 12 13 13 13 14 15 15 15 15 15 15 15 15 14 13 13 13 13 14 15 15 15 15 15 14 15 16 16 15 15 14 15 15 15 15 15 15 15 16 16 16 16 16 17 17 16 15 16 16 17 17 17 16
$$ packed form
2334A3%jj%%J%J%%%J%j%Jj%%J%%j%JJ%%%%%%j%%J%%%%j%%%%%%j%J%j%jJ%J%%j%%%j%J%%JJ
2327A5J%j%%j%%%%%j%%%%%%%%%%%J%%%%%J%%%jJJj%j%%%J%j%%%%j%%%%%jJJ%J%j%%%%%%%j
2319A3%%JJ%%%%jj%%J%J%%%%J%%jjj%%%J%%jJ%%JJJ%j%jjjj%JJ%JJ%%%j%%jJJjjJ%%%%%j%
2312A4JJK%jjjjj%%j%%J%J%J%J%%j%j%%%%%%J%%Jjjj%%%%%%J%%Jj%J%%%%%%j%%J%J%%%%%%
2304A6j%%%%%%J%%jk%%Jjj%jJJJJ%%%%j%%%%%%%%%%%%%jJ%%J%Jj%j%j%jJJ%%J%%%%%kj%%J
2297A3%%J%%J%%j%J%%%%jj%J%%%jjJJ%%%%%jjJ%%%%%jJJ%%%%j%%J%jjJJ%%%%%Jjj%%%%%j%
2289A2%%J%%%%%%%JJ%%jj%%%JJjj%%%%%%J%JJ%%j%%%Jj%j%j%JJ%%j%%%%%%%J%Jj%%%%%%Jj
2282A5%%J%%%j%j%%%%jj%%%J%%JJ%%%%%%%jj%%%JJ%%%%jJJ%j%jJ%%%%%%J%%%%J%jjJ%J%%j
$$ plain form
2275 16 16 16 16 15 14 13 13 14 15 14 15 15 15 16 15 15 14 15 15 15 15 15 15 14 14 14 15 15 14 15 16 16 16 16 17 18 18 18 17 16 16 16 17 16 16 16 16 15 15 15 15 14 14 14 15 15 15 15 14 14 14 14 15 15 15 15 15 15 15 15
2267 15 15 15 14 14 15 16 15 15 15 14 14 15 15 15 15 14 15 15 15 14 14 14 13 13 14 14 14 14 13 13 13 14 14 15 15 14 14 14 14 15 15 15 15 14 14 14 14 15 16 16 17 17 16 15 15 15 15 14 14 14 14 14 15 16 16 16 15 14 13 14
2260 14 15 16 16 15 15 15 15 14 14 14 16 16 16 16 16 16 16 16 16 15 15 14 13 13 13 14 15 16 16 16 15 15 16 16 15 14 14 14 15 15 16 16 16 15 15 15 14 14 14 15 16 16 16 16 15 15 15 15 15 15 15 15 16 15 14 14 13 14 15 15
2252 15 14 13 13 13 14 15 15 14 13 13 14 14 14 15 15 15 15 15 15 14 14 14 14 15 16 16 16 15 14 14 14 14 14 13 13 13 14 14 15 16 16 16 16 16 17 17 16 15 14 14 13 14 15 15 16 17 16 16 15 15 15 16 16 16 16 16 16 16 17 16
2245 16 15 14 14 14 15 16 16 16 16 16 15 15 15 15 16 16 16 17 17 17 17 17 17 16 17 17 17 17 17 17 16 16 15 15 16 16 15 16 16 16 15 15 14 15 15 15 14 14 15 15 15 15 15 16 16 15 15 15 14 14 16 15 14 13 13 13 14 14 15 15
2238 15 16 16 16 16 15 15 15 15 16 16 16 16 16 16 15 14 14 14 14 14 15 14 14 14 14 15 14 14 15 15 15 15 15 15 15 14 13 13 13 13 14 15 15 15 15 16 17 16 16 15 15 15 15 15 15 15 15 15 15 15 15 14 14 14 15 14 14 13 13 14
2230 14 15 15 14 13 13 12 12 12 13 15 15 16 16 16 16 15 15 16 15 16 16 16 15 15 15 15 14 14 14 15 15 15 15 14 14 15 16 15 15 14 14 14 14 15 16 15 15 14 15 15 15 15 15 17 18 17 16 16 16 15 16 16 16 15 14 15 15 16 16 16
2223 16 16 16 16 16 16 16 16 15 14 14 15 16 17 17 17 17 17 17 17 17 16 16 16 16 16 16 16 17 17 16 16 15 15 15 14 13 14 15 15 15 15 16 15 16 16 17 17 17 16 16 16 16 16 16 16 16 16 16 16 17 17 16 16 16 16 16 16 15 15 15
$$ packed form
2275A6%%%jjj%JJjJ%%Jj%jJ%%%%%j%%J%jJJ%%%JJ%%jj%%Jj%%%j%%%j%%J%%%j%%%J%%%%%%%
2267A5%%j%JJj%%j%J%%%jJ%%j%%j%J%%%j%%J%J%j%%%J%%%j%%%JJ%J%jj%%%j%%%%JJ%%jjjJ
2260A4JJ%j%%%j%%K%%%%%%%%j%jj%%JJJ%%j%J%jj%%J%J%%j%%j%%JJ%%%j%%%%%%%Jjj%jJJ%
2252A5jj%%JJ%jj%J%%J%%%%%j%%%JJ%%jj%%%%j%%J%JJ%%%%J%jjj%jJJ%JJj%j%%J%%%%%%Jj
2245A6jj%%JJ%%%%j%%%J%%J%%%%%jJ%%%%%j%j%J%jJ%%j%jJ%%j%J%%%%J%j%%j%Kjjj%%J%J%
2238A5J%%%j%%%J%%%%%jj%%%%Jj%%%Jj%J%%%%%%jj%%%JJ%%%JJj%j%%%%%%%%%%%j%%Jj%j%J
2230A4J%jj%j%%JK%J%%%j%JjJ%%j%%%j%%J%%%j%JJj%j%%%JJj%jJ%%%%KJjj%%jJ%%jjJ%J%%
2223A6%%%%%%%jj%JJJ%%%%%%%j%%%%%%J%j%j%%jjJJ%%%JjJ%J%%j%%%%%%%%%%J%j%%%%%j%%
$$ plain form
2215 15 16 17 17 17 17 17 17 18 18 18 17 17 17 18 18 18 18 18 17 17 17 17 17 18 18 18 19 19 18 18 17 16 16 16 16 16 16 16 17 17 17 17 16 16 15 15 15 16 17 17 17 16 16 17 16 15 15 15 16 16 17 17 17 17 18 18 18 18 18 18
2208 18 17 17 17 17 17 16 16 16 16 16 16 16 17 17 17 16 16 15 16 16 17 18 17 17 16 16 16 15 15 15 15 15 16 16 16 17 17 17 16 16 16 17 17 17 17 17 16 15 15 15 15 15 16 17 18 17 16 15 15 15 16 16 16 16 16 16 16 17 17 17
2200 17 17 17 17 17 17 17 17 17 17 16 16 16 16 17 17 18 18 18 18 18 18 19 18 18 18 19 19 19 18 17 18 18 18 18 19 19 19 17 17 16 16 16 17 18 18 18 18 17 16 16 16 16 17 18 19 19 18 18 18 18 18 17 17 16 16 16 16 16 17 17
2193 17 17 18 17 17 17 17 17 17 17 17 17 18 18 18 18 17 17 17 17 17 18 18 18 17 18 18 18 17 16 17 17 16 16 16 16 17 18 19 18 18 17 18 17 17 17 18 17 17 17 17 17 17 17 18 18 18 19 19 19 19 19 19 19 18 18 17 17 17 17 17
2186 17 17 17 18 19 19 19 18 17 17 17 17 17 17 17 18 17 18 18 18 19 19 19 19 18 18 18 17 17 17 17 17 17 16 16 16 17 18 18 17 17 17 17 17 16 17 17 17 18 18 18 18 16 16 17 17 17 17 17 18 18 19 20 19 18 17 17 18 18 19 19
2178 19 18 17 17 17 17 18 18 19 18 18 18 18 18 17 16 16 15 16 16 16 16 17 18 19 20 19 19 19 19 19 18 18 17 17 17 16 16 16 16 17 17 18 18 17 16 16 17 18 17 17 17 17 16 16 16 15 15 15 16 16 17 17 18 18 18 20 20 20 20 20
2171 20 20 20 20 19 19 19 19 19 18 17 18 18 18 18 18 18 18 18 18 18 18 18 18 19 19 18 18 18 19 19 19 19 19 19 19 19 18 18 17 18 18 19 18 18 18 19 19 19 19 19 20 19 18 19 18 18 18 18 18 18 19 19 20 19 19 19 18 18 18 19
2163 19 19 18 18 18 18 18 18 18 19 18 18 19 20 20 20 19 19 19 19 19 19 18 17 17 17 18 19 18 18 19 19 19 18 18 19 18 18 18 18 18 19 20 20 20 19 19 19 20 20 20 19 18 18 17 18 18 19 19 19 19 19 19 19 19 19 19 19 20 20 19
$$ packed form
2215A5JJ%%%%%J%%j%%J%%%%j%%%%J%%J%j%jj%%%%%%J%%%j%j%%JJ%%j%Jjj%%J%J%%%J%%%%%
2208A8j%%%%j%%%%%%J%%j%jJ%JJj%j%%j%%%%J%%J%%j%%J%%%%jj%%%%JJJjjj%%J%%%%%%J%%
2200A7%%%%%%%%%j%%%J%J%%%%%Jj%%J%%jjJ%%%J%%k%j%%JJ%%%jj%%%JJJ%j%%%%j%j%%%%J%
2193A7%Jj%%%%%%%%J%%%j%%%%J%%jJ%%jjJ%j%%%JJJj%jJj%%Jj%%%%%%J%%J%%%%%%j%j%%%%
2186A7%%JJ%%jj%%%%%%JjJ%%J%%%j%%j%%%%%j%%JJ%j%%%%jJ%%J%%%k%J%%%%J%JJjjj%J%J%
2178A9jj%%%J%Jj%%%%jj%jJ%%%JJJJj%%%%j%j%%j%%%J%J%jj%JJj%%%j%%j%%J%J%J%%K%%%%
2171B0%%%j%%%%jjJ%%%%%%%%%%%%J%j%%J%%%%%%%j%jJ%Jj%%J%%%%JjjJj%%%%%J%Jj%%j%%J
2163A9%j%%%%%%Jj%JJ%%j%%%%%jj%%JJj%J%%j%Jj%%%%JJ%%j%%J%%jj%jJ%J%%%%%%%%%%J%j
$$ plain form
2156 19 18 18 18 18 19 19 20 20 19 19 19 19 19 19 19 18 18 18 19 18 18 18 18 18 18 18 18 17 18 18 19 19 20 20 20 19 20 20 20 19 19 18 18 19 19 21 21 20 20 20 20 21 21 21 21 21 21 20 19 19 19 19 20 20 19 18 18 17 18 18
2149 18 18 18 18 19 18 18 18 18 18 17 18 18 18 18 18 17 17 16 17 19 19 19 18 19 20 20 21 21 20 19 19 20 20 20 20 21 21 22 22 22 22 21 22 22 23 23 23 23 23 24 24 24 23 22 22 22 22 23 22 22 21 20 20 19 19 19 19 19 19 19
2141 19 20 21 20 20 20 21 20 20 20 19 19 19 18 18 18 19 19 18 18 18 18 19 19 19 20 20 20 20 19 19 19 18 18 18 18 18 19 19 19 20 19 19 18 18 19 19 19 20 20 19 19 19 19 19 20 20 18 18 18 18 18 18 19 19 19 20 20 19 18 18
2134 18 19 19 20 20 19 19 18 18 18 18 18 17 17 17 17 17 18 18 18 18 18 19 19 18 18 18 18 17 17 17 18 18 18 18 18 19 18 18 17 16 16 16 16 16 16 16 17 17 17 17 17 18 18 18 18 19 19 19 19 20 20 20 19 18 18 18 18 18 18 18
2126 18 18 18 19 19 18 18 17 17 17 17 17 18 18 18 18 18 19 18 18 18 19 20 20 19 19 19 19 19 18 18 18 18 18 18 17 17 18 18 18 19 19 19 19 19 19 19 19 19 19 19 17 17 17 17 17 18 18 17 18 18 18 18 18 17 18 18 18 18 17 17
2119 17 18 18 18 18 19 19 19 19 20 20 20 20 21 21 20 20 20 19 19 20 20 20 20 19 19 19 19 19 19 19 19 19 18 18 17 17 17 18 18 18 18 18 18 17 18 18 19 19 19 18 17 17 18 19 19 20 20 20 20 20 20 20 20 20 21 22 23 23 23 23
2111 23 24 25 25 25 25 25 24 24 23 23 22 21 21 20 20 19 19 19 19 19 20 20 20 19 19 19 18 18 18 17 17 17 17 17 16 16 16 15 15 14 14 14 14 15 15 16 16 17 17 17 17 17 18 19 20 19 19 19 18 17 17 17 18 17 16 16 16 17 18 18
2104 18 18 17 17 17 17 17 17 18 17 17 17 17 18 17 17 17 17 18 19 20 19 17 17 17 17 17 17 17 16 16 16 16 17 17 17 17 17 17 16 16 17 18 17 17 17 17 17 17 17 17 16 16 17 18 18 18 18 18 17 17 16 16 16 16 16 17 16 16 16 16
$$ packed form
2156A9j%%%J%J%j%%%%%%j%%Jj%%%%%%%jJ%J%J%%jJ%%j%j%J%K%j%%%J%%%%%jj%%%J%jj%jJ%
2149A8%%%Jj%%%%jJ%%%%j%jJK%%jJJ%J%jj%J%%%J%J%%%jJ%J%%%%J%%jj%%%Jj%jj%j%%%%%%
2141A9JJj%%Jj%%j%%j%%J%j%%%J%%J%%%j%%j%%%%J%%Jj%j%J%%J%j%%%%J%k%%%%%J%%J%jj%
2134A8J%J%j%j%%%%j%%%%J%%%%J%j%%%j%%J%%%%Jj%jj%%%%%%J%%%%J%%%J%%%J%%jj%%%%%%
2126A8%%J%j%j%%%%J%%%%Jj%%JJ%j%%%%j%%%%%j%J%%J%%%%%%%%%%k%%%%J%jJ%%%%jJ%%%j%
2119A7J%%%J%%%J%%%J%j%%j%J%%%j%%%%%%%%j%j%%J%%%%%jJ%J%%jj%JJ%J%%%%%%%%JJJ%%%
2111B3JJ%%%%j%j%jj%j%j%%%%J%%j%%j%%j%%%%j%%j%j%%%J%J%J%%%%JJJj%%jj%%Jjj%%JJ%
2104A8%j%%%%%Jj%%%Jj%%%JJJjk%%%%%%j%%%J%%%%%j%JJj%%%%%%%j%JJ%%%%j%j%%%%Jj%%%
$$ plain form
2097 16 16 16 16 16 16 15 16 16 16 17 17 18 18 18 18 18 18 18 18 18 18 17 17 17 17 17 17 17 18 19 18 18 18 18 18 18 18 18 18 17 17 16 16 16 16 16 16 16 17 18 19 19 19 19 19 18 17 16 16 16 17 19 19 18 17 16 14 14 15 16
2089 16 17 18 18 17 17 17 17 17 17 17 16 15 16 17 17 17 18 18 18 18 18 19 19 20 19 19 18 17 17 16 16 16 17 17 16 16 15 15 15 15 16 16 17 17 18 18 18 18 18 18 18 18 18 17 17 17 17 16 15 15 16 16 16 16 16 16 16 16 17 18
2082 18 18 18 18 17 17 17 18 19 19 19 19 19 19 18 17 16 16 16 16 16 17 17 17 17 17 16 16 16 17 18 17 17 17 17 16 16 17 18 17 16 16 16 16 15 16 16 16 16 16 17 17 18 18 17 16 16 16 16 17 17 17 16 16 15 15 15 16 16 16 16
2074 16 16 16 16 16 16 15 16 15 15 15 16 15 15 15 16 16 17 18 17 17 16 16 16 15 15 15 15 16 15 16 16 16 17 17 17 18 17 16 15 15 15 15 16 16 17 17 16 16 16 16 16 15 15 16 17 18 18 18 18 18 18 18 18 18 18 17 17 18 18 18
2067 18 17 17 17 17 18 18 18 18 17 17 17 16 15 14 15 15 15 15 15 16 16 15 15 15 14 15 15 16 16 16 16 17 17 17 16 15 14 15 16 16 15 15 16 16 16 16 15 15 15 16 16 16 16 16 16 17 16 17 17 17 17 17 17 18 18 18 17 16 16 17
2060 17 17 17 17 17 17 16 17 18 17 17 17 16 15 14 14 14 14 15 15 15 16 17 17 16 15 16 15 15 16 15 15 14 14 14 15 16 16 17 16 15 14 14 15 16 17 17 16 16 16 16 16 16 17 17 17 17 17 16 16 17 18 18 17 16 16 16 17 17 16 16
2052 16 16 16 16 16 16 15 15 15 15 15 15 15 15 15 14 14 14 14 15 15 15 14 15 16 15 15 15 15 15 16 16 16 16 17 17 17 17 17 17 16 17 17 16 16 16 16 16 16 16 16 16 16 16 17 17 17 18 18 17 17 17 17 17 16 17 18 19 20 20 20
2045 20 21 21 21 20 20 20 19 18 17 16 16 17 16 16 15 15 16 17 16 16 15 15 16 16 17 18 18 17 16 16 16 15 15 14 14 15 15 15 15 15 15 15 15 16 15 15 15 15 16 16 16 17 16 16 16 15 15 14 13 12 13 13 14 16 16 17 17 18 17 17
$$ packed form
2097A6%%%%%jJ%%J%J%%%%%%%%%j%%%%%%JJj%%%%%%%%j%j%%%%%%JJJ%%%%jjj%%JK%jjjk%JJ
2089A6JJ%j%%%%%%jjJJ%%J%%%%J%Jj%jj%j%%J%j%j%%%J%J%J%%%%%%%%j%%%jj%J%%%%%%%JJ
2082A8%%%j%%JJ%%%%%jjj%%%%J%%%%j%%JJj%%%j%JJjj%%%jJ%%%%J%J%jj%%%J%%j%j%%J%%%
2074A6%%%%%jJj%%Jj%%J%JJj%j%%j%%%JjJ%%J%%Jjjj%%%J%J%j%%%%j%JJJ%%%%%%%%%j%J%%
2067A8j%%%J%%%j%%jjjJ%%%%J%j%%jJ%J%%%J%%jjjJJ%j%J%%%j%%J%%%%%JjJ%%%%%J%%jj%J
2060A7%%%%%jJJj%%jjj%%%J%%JJ%jjJj%Jj%j%%JJ%Jjjj%JJJ%j%%%%%J%%%%j%JJ%jj%%J%j%
2052A6%%%%%j%%%%%%%%j%%%J%%jJJj%%%%J%%%J%%%%%jJ%j%%%%%%%%%%J%%J%j%%%%jJJJJ%%
2045B0J%%j%%jjjj%Jj%j%JJj%j%J%JJ%jj%%j%j%J%%%%%%%Jj%%%J%%Jj%%j%jjjJ%JK%J%Jj%
$$ plain form
2037 17 17 17 17 17 17 18 18 16 15 15 14 13 14 14 13 13 14 15 15 15 15 14 15 15 15 16 16 16 16 15 15 15 15 15 16 16 16 16 16 15 15 16 16 16 17 17 17 17 17 16 14 13 13 13 13 15 16 16 17 16 15 14 14 14 14 15 15 15 16 16
2030 16 16 15 15 14 15 16 16 17 17 18 18 18 18 18 17 17 17 17 16 15 15 14 14 15 14 13 13 14 15 14 15 15 16 16 16 16 15 14 13 13 13 14 15 16 16 16 15 14 14 14 15 14 14 14 15 16 16 15 15 16 17 17 16 15 15 14 15 16 16 15
2022 15 15 15 15 15 15 16 15 15 15 15 14 14 14 14 14 15 15 15 15 15 15 16 15 16 16 16 15 14 14 13 14 14 14 13 13 13 14 15 15 14 14 13 14 15 15 15 15 16 17 17 18 17 17 16 15 15 15 16 16 17 16 15 15 15 15 15 15 15 16 16
2015 16 16 15 15 16 16 17 18 18 18 17 17 17 16 16 15 15 15 16 16 16 16 17 17 17 16 16 15 14 14 15 14 14 14 15 15 15 16 16 16 16 16 16 17 17 17 17 16 16 15 16 16 17 18 17 17 16 15 16 16 16 17 17 17 17 16 15 15 15 16 16
2008 16 16 16 16 17 17 16 16 16 16 17 17 16 16 15 15 16 16 16 15 15 15 15 16 16 16 16 17 18 18 17 17 17 17 17 16 15 16 16 15 15 14 13 13 13 14 14 14 15 15 16 16 16 16 16 16 16 15 15 16 15 14 14 14 14 15 16 16 17 17 17
2000 17 17 17 17 16 16 17 17 17 17 18 18 17 16 16 17 17 18 18 18 18 17 17 18 18 17 17 17 17 17 18 17 16 16 15 15 15 16 16 16 17 17 17 16 15 15 15 15 15 15 15 16 17 16 16 16 16 15 15 15 16 16 16 15 14 14 13 13 14 14 13
1993 13 14 14 15 15 15 15 15 16 15 15 15 15 14 14 14 15 15 15 15 16 15 15 14 14 14 15 16 16 16 16 15 14 14 14 14 14 14 14 14 15 15 15 15 15 15 15 15 15 15 14 13 12 13 13 12 13 14 15 15 15 14 15 16 17 16 15 15 15 15 16
1985 16 16 16 16 16 16 15 14 13 13 13 14 14 14 13 13 14 13 13 13 14 15 15 15 14 14 14 14 14 14 14 14 14 15 15 15 15 16 16 16 16 16 16 17 16 15 14 14 15 15 16 16 15 15 15 15 15 16 16 16 16 15 15 14 13 13 13 14 13 13 14
$$ packed form
2037A7%%%%%J%kj%jjJ%j%JJ%%%jJ%%J%%%j%%%%J%%%%j%J%%J%%%%jkj%%%KJ%Jjjj%%%J%%J%
2030A6%j%jJJ%J%J%%%%j%%%jj%j%Jjj%JJjJ%J%%%jjj%%JJJ%%jj%%Jj%%JJ%j%JJ%jj%jJJ%j
2022A5%%%%%Jj%%%j%%%%J%%%%%JjJ%%jj%jJ%%j%%JJ%j%jJJ%%%JJ%Jj%jj%%J%Jjj%%%%%%J%
2015A6%j%J%JJ%%j%%j%j%%J%%%J%%j%jj%Jj%%J%%J%%%%%J%%%j%jJ%JJj%jjJ%%J%%%jj%%J%
2008A6%%%J%j%%%J%j%j%J%%j%%%J%%%JJ%j%%%%jjJ%j%jj%%J%%J%J%%%%%%j%Jjj%%%JJ%J%%
2000A7%%%j%J%%%J%jj%J%J%%%j%J%j%%%%Jjj%j%%J%%J%%jj%%%%%%JJj%%%j%%J%%jj%j%J%j
1993A3J%J%%%%Jj%%%j%%J%%%Jj%j%%JJ%%%jj%%%%%%%J%%%%%%%%%jjjJ%jJJJ%%jJJJjj%%%J
1985A6%%%%%jjj%%J%%j%Jj%%JJ%%j%%%%%%%%J%%%J%%%%%Jjjj%J%J%j%%%%J%%%j%jj%%Jj%J
$$ plain form
1978 14 14 14 14 15 14 13 13 13 13 13 13 13 14 14 14 14 15 15 15 14 15 15 14 14 13 13 14 14 14 13 13 14 14 14 14 15 15 16 15 14 14 13 14 14 15 15 15 15 15 15 14 14 14 15 14 15 15 15 15 15 16 16 16 16 16 16 16 16 16 16
1971 16 15 15 14 13 13 12 12 14 14 14 14 14 14 13 13 13 13 13 13 13 13 13 13 13 13 13 13 13 14 14 14 14 14 14 14 15 16 16 16 15 14 14 14 14 14 14 15 15 15 15 15 14 15 15 15 15 15 14 14 14 15 16 16 15 14 14 15 15 15 15
1963 15 15 16 16 15 15 16 16 16 16 16 15 14 14 14 15 15 15 14 14 14 15 15 15 15 16 16 16 17 17 16 15 14 15 15 14 14 14 14 14 14 14 14 14 14 14 15 15 15 15 15 15 15 15 16 15 15 15 15 16 16 15 15 16 16 16 15 15 15 16 15
1956 15 14 15 15 15 14 13 13 14 14 14 14 14 15 15 14 15 15 16 15 15 15 14 14 14 14 14 15 15 15 14 14 14 14 15 16 16 16 15 15 14 15 15 15 15 15 15 16 17 16 15 14 15 15 16 17 18 18 18 17 16 15 15 15 15 16 16 16 16 15 14
1948 14 14 13 14 15 15 16 15 15 15 15 14 13 13 14 13 13 13 14 15 15 15 16 15 15 15 15 15 14 15 15 15 15 16 16 15 15 16 15 15 14 14 14 14 14 15 15 16 16 16 16 15 14 14 15 15 14 14 14 14 15 15 15 15 15 15 15 15 16 16 16
1941 16 16 16 16 16 15 14 14 15 15 14 14 14 14 15 15 15 14 15 15 15 15 15 15 15 15 15 15 16 16 16 16 14 14 14 14 15 16 15 15 15 15 16 17 17 16 16 16 16 17 16 17 18 19 20 21 22 23 23 21 19 19 18 18 18 18 18 18 17 16 15
1933 15 15 15 15 15 15 15 15 16 16 16 15 15 15 16 15 15 15 15 15 16 16 16 15 15 15 15 16 17 17 16 15 15 15 16 16 16 17 17 16 16 16 16 16 16 15 15 15 15 15 15 15 16 16 15 15 15 15 16 16 16 15 15 15 16 16 16 17 17 17 17
1926 17 17 16 16 15 15 14 14 15 15 15 15 15 16 16 15 15 15 14 14 15 16 17 17 17 17 17 16 15 14 13 13 13 13 13 13 13 14 14 15 15 15 16 15 15 15 14 14 14 14 14 14 14 14 14 14 14 14 13 13 13 14 15 15 15 15 15 15 15 15 15
$$ packed form
1978A4%%%Jjj%%%%%%J%%%J%%jJ%j%j%J%%j%J%%%J%Jjj%jJ%J%%%%%j%%JjJ%%%%J%%%%%%%%%
1971A6j%jj%j%K%%%%%j%%%%%%%%%%%%%%J%%%%%%JJ%%jj%%%%%J%%%%jJ%%%%j%%JJ%jj%J%%%
1963A5%J%j%J%%%%jj%%J%%j%%J%%%J%%J%jjjJ%j%%%%%%%%%%J%%%%%%%Jj%%%J%j%J%%j%%Jj
1956A5jJ%%jj%J%%%%J%jJ%Jj%%j%%%%J%%j%%%JJ%%j%jJ%%%%%JJjjjJ%JJJ%%jjj%%%J%%%jj
1948A4%jJJ%Jj%%%jj%Jj%%JJ%%Jj%%%%jJ%%%J%j%Jj%j%%%%J%J%%%jj%J%j%%%J%%%%%%%J%%
1941A6%%%%jj%J%j%%%J%%jJ%%%%%%%%%J%%%k%%%JJj%%%JJ%j%%%JjJJJJJJJ%kk%j%%%%%jjj
1933A5%%%%%%%J%%j%%Jj%%%%J%%j%%%JJ%jj%%J%%J%j%%%%%j%%%%%%J%j%%%J%%j%%J%%J%%%
1926A7%j%j%j%J%%%%J%j%%j%JJJ%%%%jjjj%%%%%%J%J%%Jj%%j%%%%%%%%%%%j%%JJ%%%%%%%%
$$ plain form
1919 15 15 16 17 16 16 16 16 16 16 16 16 15 15 14 15 15 15 14 14 15 16 15 14 13 13 12 13 13 14 14 15 15 15 14 14 15 15 15 14 14 14 15 15 15 15 15 15 15 16 16 17 17 17 17 17 17 17 17 16 16 16 16 16 15 15 16 16 16 15 15
1911 15 14 15 15 14 13 13 14 14 14 14 14 14 14 15 16 17 17 16 16 16 16 15 15 15 15 15 15 15 15 15 15 15 16 16 17 18 18 18 18 18 18 18 18 17 16 16 16 15 16 17 18 18 17 17 16 15 15 15 15 14 14 13 13 14 15 16 15 15 15 15
1904 15 15 15 14 14 15 15 16 16 15 15 15 15 15 15 15 14 14 15 15 15 15 15 14 14 14 14 15 15 15 15 15 15 15 15 15 15 15 15 14 14 14 14 14 14 14 14 14 14 14 14 14 15 15 15 16 18 18 18 17 16 16 16 15 15 15 16 16 16 16 16
1896 16 16 16 16 16 16 16 15 15 15 15 15 14 14 13 14 14 15 16 16 16 16 16 17 17 18 18 17 17 16 15 15 15 15 15 15 16 16 16 17 17 16 15 16 17 17 16 16 16 16 15 16 17 17 17 16 16 15 14 15 15 16 16 17 19 18 17 17 18 18 18
1889 18 17 16 16 16 16 16 16 16 16 16 16 16 16 16 15 14 14 14 14 14 13 14 14 15 15 15 15 14 14 15 14 15 16 16 17 17 16 15 15 15 15 15 15 16 15 15 15 15 16 16 16 15 15 15 14 14 15 16 16 16 16 16 16 16 16 16 16 15 15 15
1881 15 15 15 15 16 16 16 16 15 15 15 15 14 14 15 16 15 15 15 15 16 16 15 15 16 17 17 17 16 15 15 14 14 13 14 14 14 14 14 13 13 13 13 13 13 14 15 16 17 17 17 17 17 16 16 15 15 15 14 15 15 15 15 16 16 16 16 16 15 16 16
1874 16 17 17 17 17 17 17 17 18 17 16 16 17 16 16 16 16 15 15 16 16 16 17 17 17 17 17 17 17 17 17 17 17 17 17 17 17 16 16 16 15 15 16 16 16 16 16 16 16 16 17 17 17 17 18 18 18 18 16 15 15 14 15 15 15 16 16 16 16 17 17
1867 17 17 16 16 16 16 15 15 15 15 15 15 15 15 15 15 15 15 14 15 16 16 16 16 17 17 17 17 16 15 15 15 16 16 17 17 16 16 16 17 18 18 17 16 16 16 16 15 16 16 15 15 15 15 16 16 17 17 18 18 17 17 17 17 18 17 17 17 18 18 17
$$ packed form
1919A5%JJj%%%%%%%j%jJ%%j%JJjjj%jJ%J%J%%j%J%%j%%J%%%%%%J%J%%%%%%%j%%%%j%J%%j%
1911A5jJ%jj%J%%%%%%JJJ%j%%%j%%%%%%%%%%J%JJ%%%%%%%jj%%jJJJ%j%jj%%%j%j%JJJj%%%
1904A5%%j%J%J%j%%%%%%j%J%%%%j%%%J%%%%%%%%%%%j%%%%%%%%%%%%J%%JK%%jj%%j%%J%%%%
1896A6%%%%%%j%%%%j%jJ%JJ%%%%J%J%j%jj%%%%%J%%J%jjJJ%j%%%jJJ%%j%jjJ%J%JKjj%J%%
1889A8jj%%%%%%%%%%%%jj%%%%jJ%J%%%j%JjJJ%J%jj%%%%%Jj%%%J%%j%%j%JJ%%%%%%%%%j%%
1881A5%%%J%%%j%%%j%JJj%%%J%j%JJ%%jj%j%jJ%%%%j%%%%%JJJJ%%%%j%j%%jJ%%%J%%%%jJ%
1874A6J%%%%%%Jjj%Jj%%%j%J%%J%%%%%%%%%%%%%%j%%j%J%%%%%%%J%%%J%%%kj%jJ%%J%%%J%
1867A7%j%%%j%%%%%%%%%%%jJJ%%%J%%%jj%%J%J%j%%JJ%jj%%%jJ%j%%%J%J%J%j%%%Jj%%J%j
$$ plain form
1859 17 17 17 18 18 18 17 17 17 17 18 17 17 17 17 17 17 17 17 17 18 17 16 15 15 15 16 15 15 15 16 16 17 17 17 17 16 16 16 16 16 16 15 15 15 16 16 15 15 16 17 18 18 18 18 17 17 17 16 16 16 16 16 16 16 16 16 15 15 16 16
1852 16 16 15 15 14 15 15 16 16 15 15 15 15 15 15 15 15 16 15 15 15 15 15 15 15 16 16 15 15 15 16 16 16 16 15 15 15 15 15 15 16 16 16 15 15 15 15 15 15 15 15 15 15 15 15 15 15 15 15 16 17 17 17 17 16 16 16 15 15 14 14
1844 14 13 14 15 15 15 15 15 15 15 15 14 13 14 15 15 15 15 15 15 15 15 15 16 16 16 16 16 15 16 16 16 16 16 17 17 17 17 17 16 16 15 14 15 16 16 16 16 17 17 16 16 16 16 17 17 17 16 16 15 15 14 14 14 14 13 13 14 14 14 14
1837 14 14 14 13 13 14 14 14 14 13 13 13 14 15 15 16 16 17 16 16 15 14 14 14 13 14 15 15 14 14 14 15 14 14 14 15 16 16 16 15 14 14 14 14 14 14 14 14 14 14 14 14 13 13 14 14 15 15 15 15 15 15 14 13 12 13 13 13 14 15 16
1830 16 17 16 16 16 16 17 17 16 16 15 15 15 15 14 13 13 14 15 16 15 15 15 15 15 15 16 16 17 17 17 16 16 16 16 15 15 15 15 15 14 15 16 16 15 14 14 15 15 15 16 16 17 17 16 17 17 16 16 15 16 16 16 16 17 17 17 16 16 17 16
1822 16 16 15 16 16 16 16 16 17 16 16 16 16 16 14 14 13 14 15 15 16 15 15 14 14 14 14 14 14 15 16 16 16 16 16 15 15 16 17 17 16 16 16 15 15 15 15 15 16 16 15 15 15 14 15 15 16 16 16 16 16 17 17 17 17 17 17 17 16 16 16
1815 16 16 16 16 16 16 16 17 18 18 18 18 17 15 13 13 14 15 15 16 16 17 17 17 18 17 17 16 16 15 15 15 14 14 14 15 16 17 16 16 15 16 17 17 16 17 17 16 16 15 15 15 15 15 14 14 14 14 15 15 15 15 15 16 16 16 17 17 16 16 16
1807 16 15 15 15 15 15 15 15 16 16 16 16 16 15 15 15 15 15 15 15 15 14 15 15 14 13 13 14 15 15 16 16 16 16 16 16 16 16 16 15 15 15 15 15 15 16 15 15 15 15 15 15 15 15 15 16 16 15 15 15 15 16 17 18 18 18 18 17 17 17 16
$$ packed form
1859A7%%J%%j%%%Jj%%%%%%%%Jjjj%%Jj%%J%J%%%j%%%%%j%%J%j%JJJ%%%j%%j%%%%%%%%j%J%
1852A6%j%jJ%J%j%%%%%%%Jj%%%%%%J%j%%J%%%j%%%%%J%%j%%%%%%%%%%%%%%%JJ%%%j%%j%j%
1844A4jJJ%%%%%%%jjJJ%%%%%%%%J%%%%jJ%%%%J%%%%j%jjJJ%%%J%j%%%J%%j%j%j%%%j%J%%%
1837A4%%j%J%%%j%%JJ%J%Jj%jj%%jJJ%j%%Jj%%JJ%%jj%%%%%%%%%%%j%J%J%%%%%jjjJ%%JJJ
1830A6Jj%%%J%j%j%%%jj%JJJj%%%%%J%J%%j%%%j%%%%jJJ%jj%J%%J%J%jJ%j%jJ%%%J%%j%Jj
1822A6%jJ%%%%Jj%%%%k%jJJ%Jj%j%%%%%JJ%%%%j%JJ%j%%j%%%%J%j%%jJ%J%%%%J%%%%%%j%%
1815A6%%%%%%JJ%%%jkk%JJ%J%J%%Jj%j%j%%j%%JJJj%jJJ%jJ%j%j%%%%j%%%J%%%%J%%J%j%%
1807A6j%%%%%%J%%%%j%%%%%%%jJ%jj%JJ%J%%%%%%%%j%%%%%Jj%%%%%%%%J%j%%%JJJ%%%j%%j
$$ plain form
1800 16 16 16 15 14 15 16 17 17 16 15 14 15 16 17 16 16 15 15 16 15 15 15 16 16 17 16 15 16 17 18 17 17 17 17 17 15 15 15 15 16 16 16 17 17 16 16 16 15 15 16 17 17 17 17 16 16 16 16 17 16 16 15 15 14 15 15 16 16 16 15
1792 15 15 15 14 15 15 15 15 16 16 16 16 17 16 15 15 15 15 16 16 16 16 16 17 17 17 17 17 17 16 16 16 16 16 16 16 15 16 15 15 15 14 13 14 15 15 15 15 15 16 16 15 15 15 15 15 16 15 15 15 16 17 17 16 16 15 15 15 15 15 15
1785 15 14 14 14 14 14 14 14 14 15 15 15 15 14 15 16 17 17 17 17 17 17 16 17 18 17 17 16 16 16 16 16 16 16 15 15 15 15 15 15 15 16 16 16 16 17 18 18 18 18 18 18 18 17 16 16 16 17 18 18 17 16 16 15 15 17 17 16 16 15 15
1778 15 16 16 16 15 15 15 15 15 16 16 16 17 17 18 17 17 16 16 17 16 16 16 17 18 18 17 18 18 17 16 16 15 15 16 17 17 17 17 17 18 18 16 15 15 15 15 16 16 16 17 17 17 17 17 17 17 17 17 17 16 16 16 16 15 16 16 16 17 17 17
1770 17 17 18 16 15 16 16 17 18 19 18 16 15 15 15 14 14 15 16 17 17 16 16 17 16 17 17 16 16 16 16 16 16 16 17 17 17 17 18 18 17 18 18 17 17 17 17 17 17 16 16 15 15 15 16 16 16 17 17 17 17 17 16 15 15 15 15 15 15 15 15
1763 15 16 16 16 16 16 15 15 16 16 17 16 16 16 16 16 16 16 15 15 14 14 15 15 16 16 16 16 16 16 17 16 16 16 16 15 16 16 15 15 15 15 16 16 17 17 18 17 17 16 15 15 15 16 17 16 16 17 17 17 16 16 17 16 16 16 17 17 17 16 16
1755 16 16 15 15 15 16 16 17 17 17 17 16 16 17 18 18 18 18 17 17 16 17 17 17 17 17 17 17 17 17 17 17 17 17 17 17 17 16 16 17 17 17 17 17 16 15 15 15 16 16 16 16 16 16 15 15 15 15 16 17 18 18 17 17 16 16 15 16 16 17 18
1748 18 18 18 17 16 16 16 17 17 18 18 19 19 20 21 21 21 19 18 18 18 17 17 17 18 17 18 19 18 18 18 18 19 17 16 16 16 17 18 18 17 17 16 16 16 15 15 15 16 16 17 17 18 18 19 19 19 18 18 17 18 18 18 17 17 18 18 19 19 19 19
$$ packed form
1800A6%%jjJJJ%jjjJJJj%j%Jj%%J%JjjJJJj%%%%k%%%J%%J%j%%j%JJ%%%j%%%Jj%j%jJ%J%%j
1792A5%%jJ%%%J%%%Jjj%%%J%%%%J%%%%%j%%%%%%jJj%%jjJJ%%%%J%j%%%%Jj%%JJ%j%j%%%%%
1785A5j%%%%%%%J%%%jJJJ%%%%%jJJj%j%%%%%%j%%%%%%J%%%JJ%%%%%%jj%%JJ%jj%j%K%j%j%
1778A5J%%j%%%%J%%J%Jj%j%Jj%%JJ%jJ%jj%j%JJ%%%%J%kj%%%J%%J%%%%%%%%%j%%%jJ%%J%%
1770A7%JkjJ%JJJjkj%%j%JJJ%j%JjJ%j%%%%%%J%%%J%jJ%j%%%%%j%j%%J%%J%%%%jj%%%%%%%
1763A5J%%%%j%J%Jj%%%%%%j%j%J%J%%%%%Jj%%%jJ%j%%%J%J%Jj%jj%%JJj%J%%j%Jj%%J%%j%
1755A6%j%%J%J%%%j%JJ%%%j%jJ%%%%%%%%%%%%%%%j%J%%%%jj%%J%%%%%j%%%JJJ%j%j%jJ%JJ
1748A8%%jj%%J%J%J%JJ%%kj%%j%%JjJJj%%%Jkj%%JJ%j%j%%j%%J%J%J%J%%j%jJ%%j%J%J%%%
$$ plain form
1741 19 19 18 18 19 20 20 20 19 18 19 19 18 18 19 20 21 21 21 20 20 20 20 20 21 20 20 19 18 19 19 18 18 18 18 18 18 19 19 19 18 18 19 19 19 19 20 20 19 18 19 19 18 18 18 18 18 19 19 19 19 19 19 20 19 18 18 18 18 18 19
1733 19 19 18 17 17 18 19 20 20 20 20 19 19 19 18 18 19 19 19 20 20 20 20 19 18 17 18 18 18 19 19 20 21 21 21 21 22 22 22 21 21 20 20 19 18 18 19 18 18 18 18 19 19 19 19 19 19 20 20 20 19 19 19 19 19 19 19 19 18 18 19
1726 19 20 21 21 21 21 21 21 20 19 19 20 21 22 22 22 22 21 20 20 20 20 20 20 21 23 24 24 24 23 23 22 22 22 22 22 22 22 22 22 22 21 22 23 23 23 23 22 22 21 21 21 21 21 20 19 19 20 20 20 20 21 22 22 22 22 21 22 22 22 21
1718 21 22 22 23 22 21 21 21 21 22 22 22 22 22 22 23 23 23 24 24 23 23 23 23 23 23 24 24 24 23 23 23 24 25 25 26 25 24 24 25 25 25 25 26 26 25 24 24 25 25 25 25 25 26 27 27 27 27 27 27 27 27 27 27 26 27 28 29 30 32 33
1711 33 33 33 33 36 39 41 44 47 51 55 60 65 70 74 79 84 87 87 85 80 76 71 66 61 57 54 51 47 44 42 40 39 38 36 35 34 34 33 33 33 31 30 30 31 31 31 32 32 32 31 31 31 31 30 31 31 31 31 31 31 31 30 30 30 31 31 32 32 32 33
1703 33 33 33 34 34 34 36 36 36 36 36 36 36 36 36 37 38 39 40 40 40 41 41 41 43 44 45 46 47 47 48 49 50 51 53 54 56 58 61 63 65 67 70 74 78 82 85 90 95 100 105 110 116 122 129 135 141 148 154 161 169 175 180 184 188 191 193 195 195 194 193
1696 193 191 188 182 176 170 164 158 152 146 140 133 126 119 113 108 103 99 95 91 87 84 80 77 74 71 68 65 63 61 60 59 58 56 54 53 53 52 52 51 49 48 47 47 47 47 47 47 46 45 44 43 43 43 42 41 41 40 39 39 40 40 40 40 40 40 40 41 41 42
1689 42 42 43 43 42 42 41 41 41 41 41 40 40 41 41 41 40 39 39 40 40 40 41 41 42 42 41 40 40 40 40 39 39 39 39 39 38 37 37 37 38 37 37 37 37 36 35 36 38 38 38 39 39 39 38 38 39 38 37 37 38 39 40 40 40 39 39 39 39 39 39
$$ packed form
1741A9%j%JJ%%jjJ%j%JJJ%%j%%%%Jj%jjJ%j%%%%%J%%j%J%%%J%jjJ%j%%%%J%%%%%Jjj%%%%J
1733A9%jj%JJJ%%%j%%j%J%%J%%%jjjJ%%J%JJ%%%J%%j%j%jj%Jj%%%J%%%%%J%%j%%%%%%%j%J
1726A9JJ%%%%%jj%JJJ%%%jj%%%%%JKJ%%j%j%%%%%%%%%jJJ%%%j%j%%%%jj%J%%%JJ%%%jJ%%j
1718B1J%Jjj%%%J%%%%%J%%J%j%%%%%J%%j%%JJ%Jjj%J%%%J%jj%J%%%%JJ%%%%%%%%%jJJJJKJ
1711C3%%%LLKLLMMNNNMNNL%knmnnnmllmlkkjjkjj%j%%kj%J%%J%%j%%%jJ%%%%%%j%%J%J%%J
1703C3%%J%%K%%%%%%%%JJJJ%%J%%KJJJJ%JJJJKJKKLKKKLMMMLNNNNNOOPOOPOPQONMMLKK%jj
1696A93klooooooooppponnmmmmlmlllllkkjjjkkj%j%jkjj%%%%%jjjj%%jj%jj%J%%%%%%J%J
1689D2%J%j%j%%%%j%J%%jj%J%%J%J%jj%%%j%%%%jj%%Jj%%%jjJK%%J%%j%Jjj%JJJ%%j%%%%%
$$ plain form
1681 39 40 39 39 40 41 42 43 43 43 42 43 43 42 42 43 43 43 43 42 42 42 42 43 43 43 43 43 44 43 43 44 44 45 45 45 44 45 45 45 45 46 46 46 47 47 47 47 46 46 45 45 45 44 45 45 46 47 47 46 45 45 46 47 47 47 47 47 47 47 48
1674 48 48 48 48 49 49 50 50 51 51 51 51 51 51 51 51 52 53 53 54 54 53 53 54 55 54 54 56 57 58 59 59 59 59 60 60 60 59 60 60 60 59 58 57 58 58 59 59 58 57 58 58 59 59 60 60 61 61 61 61 62 62 61 61 61 62 62 61 61 60 62
1666 62 63 64 65 65 65 65 65 65 65 66 66 67 67 68 70 70 71 71 71 71 70 70 70 70 70 70 70 70 71 71 72 72 72 72 71 71 72 72 73 73 73 73 72 72 74 75 75 75 75 76 78 79 79 79 80 80 80 80 80 79 79 79 80 81 81 81 81 81 81 81
1659 81 82 83 85 86 86 87 88 89 90 91 93 93 94 95 96 98 100 102 103 103 103 104 104 106 109 111 112 113 113 114 115 117 118 119 119 121 124 126 127 128 129 130 131 131 132 133 134 137 139 140 142 143 144 144 144 146 147 148 149 151 153 155 157 158 160 161 163 165 166 168
1652 168 170 171 172 173 175 175 176 178 179 181 183 185 187 190 192 193 194 196 199 202 204 207 209 210 211 213 215 217 218 220 221 222 223 225 226 227 230 232 233 234 236 239 241 243 246 247 248 251 253 255 257 259 262 264 266 269 273 276 279 283 289 296 302 309 317 326 335 344 353
1644 353 362 371 378 386 393 400 406 412 416 420 423 425 427 429 431 434 437 440 443 447 453 459 466 474 482 492 503 515 526 539 552 566 581 596 612 627 643 658 675 692 708 725 744 762 782 802 823
1639 823 844 866 887 910 934 959 984 1009 1037 1065 1095 1124 1153 1183 1215 1248 1282 1318 1354 1391 1430 1470 1511 1554 1600 1647 1697 1749 1804 1862 1924 1989 2056 2126 2201
1636 2201 2281 2365 2455 2551 2652 2760 2876 2999 3130 3270 3420 3581 3754 3942 4146 4366 4604 4861 5139 5442 5771 6128 6517 6942
$$ packed form
1681C9Jj%JJJJ%%jJ%j%J%%%j%%%J%%%%Jj%J%J%%jJ%%%J%%J%%%j%j%%jJ%JJ%jj%JJ%%%%%%J
1674D8%%%J%J%J%%%%%%%JJ%J%j%JJj%KJJJ%%%J%%jJ%%jjjJ%J%jjJ%J%J%J%%%J%j%%J%j%jK
1666F2JJJ%%%%%%J%J%JK%J%%%j%%%%%%%J%J%%%j%J%J%%%j%KJ%%%JKJ%%J%%%%j%%JJ%%%%%%
1659H1JJKJ%JJJJJK%JJJKKKJ%%J%KLKJJ%JJKJJ%KLKJJJJJ%JJJLKJKJJ%%KJJJKKKKJKJKKJK
1652A68KJJJK%JKJKKKKLKJJKLLKLKJJKKKJKJJJKJJLKJJKLKKLJJLKKKKLKKLMLLMOPOPQRRRR
1644C53RRPQPPOOMMLKKKKLLLLMOOPQQJ0J1J2J1J3J3J4J5J5J6J5J6J5J7J7J6J7J9J8K0K0K1
1639H23K1K2K1K3K4K5K5K5K8K8L0K9K9L0L2L3L4L6L6L7L9M0M1M3M6M7N0N2N5N8O2O5O7P0P5
1636B201Q0Q4R0R6J01J08J16J23J31J40J50J61J73J88K04K20K38K57K78L03L29L57L89M25
$$ plain form
1633 6942 7405 7911 8462 9060 9710 10417 11182 12009 12902 13863 14891 15989 17155 18386 19676 21016 22395 23795 25196 26570
1631 26570 27889 29120 30227 31174 31928 32458 32741 32767 32535 32055 31348 30442 29373 28172 26876 25515 24121 22720 21333 19977
1629 19977 18670 17422 16241 15132 14094 13131 12239 11416 10659 9962 9323 8737 8199 7704 7248 6828 6440 6081 5749 5440 5153
1627 5153 4887 4638 4407 4191 3989 3801 3624 3458 3303 3157 3021 2893 2772 2658 2552 2453 2357 2267 2181 2100 2024 1951 1882 1817 1754 1693 1635
1624 1635 1580 1528 1478 1430 1385 1342 1301 1262 1227 1193 1160 1129 1099 1072 1046 1022 999 977 956 936 917 899 882 865 849 833 819 804 791 778 765 753 741 729
1620 729 717 705 695 685 676 668 658 649 640 631 623 615 607 600 592 585 576 566 556 545 535 525 515 505 494 483 472 461 451 441 433 424 417 411 405 399 394 391 389 386 384 383 382 381 379 378 375 373 369 365 361
1615 361 356 352 347 342 338 332 327 321 316 311 305 301 296 292 289 285 281 277 272 267 262 259 255 252 248 245 242 239 236 232 229 228 227 226 224 222 221 219 218 217 217 216 215 216 217 219 221 221 222 223 223 224 226 226 225 224 224 221 217 212 208 205 202 198 195 191 188 184 181
1607 181 177 174 171 167 165 163 162 159 157 155 153 152 151 150 149 148 147 145 144 143 142 142 141 141 140 139 138 137 136 135 134 133 131 130 129 129 128 128 127 127 126 126 126 125 125 124 124 123 123 123 123 122 122 120 119 119 119 118 118 118 117 117 116 116 115 114 113 112 112
$$ packed form
1633F942M63N06N51N98O50P07P65Q27Q93R61J028J098J166J231J290J340J379J400J401J374
1631B6570J319J231J107R47P54N30K83K6k32m80p07r06j069j201j296j361j394j401j387j356
1629A9977j307j248j181j109j038r63q92q23p57o97o39n86n38m95m56m20l88l59l32l09k87
1627E153k66k49k31k16k02j88j77j66j55j46j36j28j21j14j06r9r6r0q6q1p6p3o9o5o3o1n8
1624A635n5n2n0m8m5m3m1l9l5l4l3l1l0k7k6k4k3k2k1k0j9j8j7j7j6j6j4j5j3j3j3j2j2j2
1620G29j2j2j0j0rqj0rrrqqqpqprj0j0j1j0j0j0j0j1j1j1j1j0j0qrpooonlklkjjjkjlkmmm
1615C61nmnnmononnomnmlmmmnnnlmlmllllmljjjkkjkjj%jjJJKK%JJ%JK%jj%lmnmllmlmlml
1607A81mllmkkjlkkkjjjjjjkjjj%j%jjjjjjjjkjj%j%j%j%%j%j%j%%%j%kj%%j%%j%j%jjjj%
$$ plain form
1600 112 112 111 109 109 108 106 106 106 106 105 105 105 104 103 101 100 100 99 98 97 96 96 96 95 94 94 94 94 93 92 92 92 91 89 88 88 87 85 84 83 83 83 83 83 83 82 81 81 81 80 79 79 79 78 78 77 77 77 77 76 76 77 76 76 75 75 74 74 74
1593 74 73 73 72 70 68 68 68 68 67 67 67 66 65 65 65 64 64 63 62 62 62 63 63 64 64 63 62 62 61 60 60 59 59 60 60 59 59 59 59 60 62 62 62 61 60 61 61 60 60 60 60 61 61 61 61 60 60 60 59 58 58 58 58 58 58 58 58 58 57 57
1585 57 57 56 56 56 56 56 55 55 54 53 54 55 55 55 55 54 53 53 53 54 54 53 53 53 53 53 52 52 51 50 50 50 50 50 50 49 49 48 47 46 46 46 47 47 47 47 47 47 47 48 48 47 48 49 49 48 48 49 49 49 48 47 48 48 48 48 48 47 47 47
1578 47 47 47 47 47 48 48 49 48 48 48 47 46 45 44 44 43 42 42 41 41 41 40 41 41 41 41 43 43 42 42 42 41 40 41 42 40 39 40 40 39 39 39 38 37 37 38 38 39 39 39 39 39 39 39 40 40 40 40 39 39 39 38 38 38 38 38 38 38 38 38
1571 38 37 38 38 39 39 39 39 39 39 39 39 39 40 40 40 41 42 43 42 41 41 41 42 43 43 44 44 45 45 45 45 46 47 48 48 48 48 47 48 49 50 50 49 48 49 49 50 50 52 54 55 57 59 61 62 64 65 67 69 71 74 78 82 86 91 96 100 104 109 113
1563 113 119 125 130 136 143 151 158 165 171 176 181 185 189 193 196 199 200 198 196 193 189 186 181 174 168 163 156 150 142 135 127 121 116 112 106 101 96 91 87 84 80 76 74 71 69 66 65 63 62 60 58 56 55 54 53 52 51 50 49 49 48 47 46 46 44 42 41 40 41
1556 41 41 40 40 38 38 37 37 36 36 35 35 34 34 33 33 35 36 35 34 34 33 34 34 33 32 32 32 32 32 32 32 32 32 32 31 31 30 30 30 30 30 30 29 30 31 30 30 29 29 29 30 30 30 30 30 30 30 30 29 29 30 30 31 30 30 29 29 29 29 29
1548 29 29 28 28 28 28 28 28 28 29 29 29 28 27 28 28 28 29 29 28 28 27 27 26 26 25 25 25 25 25 25 25 25 26 26 27 27 26 26 26 26 26 25 24 24 24 24 24 24 25 26 26 26 26 25 25 24 24 24 25 25 25 26 26 26 26 25 25 25 25 26
$$ packed form
1600A12%jk%jk%%%j%%jjkj%jjjj%%jj%%%jj%%jkj%jkjj%%%%%jj%%jj%%j%j%%%j%Jj%j%j%%
1593G4j%jkk%%%j%%jj%%j%jj%%J%J%jj%jj%j%J%j%%%JK%%jjJ%j%%%J%%%j%%jj%%%%%%%%j%
1585E7%j%%%%j%jjJJ%%%jj%%J%j%%%%j%jj%%%%%j%jjj%%J%%%%%%J%jJJ%j%J%%jjJ%%%%j%%
1578D7%%%%J%Jj%%jjjj%jj%j%%jJ%%%K%j%%jjJJkjJ%j%%jj%J%J%%%%%%J%%%j%%j%%%%%%%%
1571C8jJ%J%%%%%%%%J%%JJJjj%%JJ%J%J%%%JJJ%%%jJJJ%jjJ%J%KKJKKKJKJKKKLMMMNNMMNM
1563A13OONOPQPPONNMMMLLJkklmlnponpoqpqonmonnnmlmmklkljkjkkkjjjjjjj%jjj%kkjjJ
1556D1%j%k%j%j%j%j%j%KJjj%jJ%jj%%%%%%%%%j%j%%%%%jJJj%j%%J%%%%%%%j%J%Jj%j%%%%
1548B9%j%%%%%%J%%jjJ%%J%j%j%j%j%%%%%%%J%J%j%%%%jj%%%%%JJ%%%j%j%%J%%J%%%j%%%J
$$ plain form
1541 26 26 25 25 25 25 24 25 26 26 26 25 25 25 24 24 23 23 23 23 23 23 22 23 25 25 25 26 26 25 24 24 24 23 24 24 25 25 25 25 24 24 25 25 26 26 26 25 25 25 24 24 24 24 24 24 24 24 25 25 24 24 23 23 22 22 22 21 21 21 22
1534 22 23 23 23 24 24 23 22 22 22 22 22 23 23 23 24 23 23 23 22 22 22 22 22 22 22 21 21 20 20 21 21 22 22 22 21 21 20 21 21 22 23 22 22 22 21 21 21 22 23 24 24 24 23 23 22 22 22 22 21 22 22 22 22 22 23 22 22 21 21 21
1526 21 21 21 21 21 21 22 23 23 22 23 24 24 25 25 25 25 24 24 24 23 22 22 22 22 22 22 21 21 21 21 21 21 21 21 20 20 20 20 20 20 21 20 20 20 19 19 19 20 20 21 20 20 19 19 20 20 21 21 22 22 22 22 23 23 24 24 24 24 24 24
1519 24 24 24 25 26 28 28 27 27 25 24 25 25 24 23 23 24 24 24 24 24 23 22 21 21 20 20 20 20 19 19 20 20 21 21 21 21 21 21 21 21 21 20 20 20 20 20 20 20 19 19 19 20 20 20 20 20 20 20 20 20 20 19 18 19 19 20 20 21 21 21
1511 21 22 22 22 21 20 19 18 17 17 17 18 18 19 18 18 19 19 20 20 21 22 21 21 20 19 18 17 18 18 19 20 21 21 21 21 21 21 22 22 23 23 22 22 21 21 22 22 22 21 20 20 20 20 19 19 21 22 22 22 22 21 21 20 19 18 18 19 20 20 19
1504 19 19 19 18 18 19 19 19 19 19 19 19 19 19 18 18 18 19 19 21 22 22 21 21 21 21 20 20 21 21 21 21 21 21 20 20 20 20 20 20 19 18 19 19 19 18 18 18 18 17 18 18 19 18 18 18 18 18 19 19 19 19 19 19 19 19 19 19 20 21 21
1497 21 20 20 20 20 21 20 19 19 19 19 19 18 18 18 18 19 19 18 18 18 17 16 16 16 18 19 19 19 18 18 17 18 19 19 18 18 18 18 18 18 18 18 18 19 18 18 17 18 19 19 18 18 18 18 17 17 17 16 16 16 16 17 17 17 17 17 18 18 17 17
1489 17 17 17 17 17 16 16 17 17 17 16 15 17 18 18 18 18 18 18 18 17 16 16 16 17 17 16 16 16 17 17 17 18 18 18 18 18 17 18 18 19 18 17 16 15 15 16 16 16 16 16 16 15 16 16 16 16 17 17 16 16 17 19 20 20 20 20 20 19 19 18
$$ packed form
1541B6%j%%%jJJ%%j%%j%j%%%%%jJK%%J%jj%%jJ%J%%%j%J%J%%j%%j%%%%%%%J%j%j%j%%j%%J
1534B2J%%J%jj%%%%J%%Jj%%j%%%%%%j%j%J%J%%j%jJ%JJj%%j%%JJJ%%j%j%%%jJ%%%%Jj%j%%
1526B1%%%%%JJ%jJJ%J%%%j%%jj%%%%%j%%%%%%%j%%%%%Jj%%j%%J%Jj%j%J%J%J%%%J%J%%%%%
1519B4%%JJK%j%kjJ%jj%J%%%%jjj%j%%%j%J%J%%%%%%%%j%%%%%%j%%J%%%%%%%%%jjJ%J%J%%
1511B1J%%jjjjj%%J%Jj%J%J%JJj%jjjjJ%JJJ%%%%%J%J%j%j%J%%jj%%%j%KJ%%%j%jjj%JJ%j
1504A9%%j%J%%%%%%%%j%%J%KJ%j%%%j%J%%%%%j%%%%%jjJ%%j%%%jJ%Jj%%%%J%%%%%%%%%JJ%
1497B1j%%%Jjj%%%%j%%%J%j%%jj%%KJ%%j%jJJ%j%%%%%%%%Jj%jJJ%j%%%j%%j%%%J%%%%J%j%
1489A7%%%%j%J%%jjKJ%%%%%%jj%%J%j%%J%%J%%%%jJ%Jjjjj%J%%%%%jJ%%%J%j%JKJ%%%%j%j
$$ plain form
1482 18 17 17 16 16 15 16 16 16 16 16 16 16 16 16 16 16 16 15 15 16 15 15 15 15 15 15 14 15 15 15 16 16 16 16 16 16 17 17 16 16 16 16 16 16 16 15 15 15 15 15 15 15 15 16 17 16 16 15 15 14 13 14 15 15 16 16 16 16 16 17
1474 17 17 17 17 16 16 16 16 15 15 16 17 17 16 16 16 16 16 15 15 15 16 16 16 16 16 15 15 16 17 17 17 17 18 18 17 16 17 17 17 16 16 16 15 15 15 15 15 15 16 17 18 17 17 18 18 18 17 17 16 16 16 17 17 18 19 20 21 22 23 24
1467 24 25 25 24 23 22 22 21 21 20 20 19 18 17 16 16 16 16 16 16 15 15 15 15 15 15 15 17 17 17 17 16 15 15 15 16 16 16 17 17 16 15 14 14 15 16 16 17 17 17 17 16 16 16 16 16 17 16 16 16 16 17 17 17 17 16 15 15 15 15 15
1459 15 14 14 14 15 16 16 15 15 15 15 15 15 15 15 15 15 15 15 15 15 15 15 15 15 14 14 13 14 15 15 15 15 16 16 17 17 16 16 17 17 17 17 16 16 17 17 15 13 13 14 16 16 16 16 16 15 14 15 15 15 15 15 15 15 15 15 16 16 16 15
1452 15 15 15 15 14 15 15 16 16 17 17 17 17 17 16 16 15 15 15 14 14 15 15 15 16 16 16 16 16 16 16 16 16 17 17 17 18 18 18 17 17 16 16 16 16 16 16 16 16 16 16 16 15 15 15 16 15 15 15 15 16 16 15 15 15 15 15 14 14 14 14
1445 14 15 15 16 17 16 15 15 16 16 15 15 14 14 14 15 15 16 16 15 15 14 15 15 15 14 14 14 14 13 13 13 14 14 13 14 15 16 15 15 16 16 16 16 16 16 16 16 15 15 15 16 16 16 16 16 16 16 15 16 16 16 16 16 16 15 14 14 14 14 15
1437 15 15 15 15 16 16 16 16 16 15 15 14 13 13 14 15 16 17 16 16 16 17 17 16 15 15 15 15 14 14 13 13 13 12 13 14 14 15 15 16 16 17 17 18 18 18 19 18 18 17 17 17 16 16 16 17 17 17 17 18 18 19 19 18 19 19 18 18 18 18 18
1430 18 18 18 17 17 18 17 17 16 15 15 15 15 16 16 16 16 16 16 17 16 15 15 15 15 15 15 15 15 15 15 14 14 15 15 15 16 16 17 16 16 17 17 17 17 17 17 17 17 17 17 16 17 17 16 15 16 17 18 18 18 18 17 16 16 16 16 16 15 16 16
$$ packed form
1482A8j%j%jJ%%%%%%%%%%%j%Jj%%%%%jJ%%J%%%%%J%j%%%%%%j%%%%%%%JJj%j%jjJJ%J%%%%J
1474A7%%%j%%%j%JJ%j%%%%j%%J%%%%j%JJ%%%J%jjJ%%j%%j%%%%%JJJj%J%%j%j%%J%JJJJJJJ
1467B4J%jjj%j%j%jjjj%%%%%j%%%%%%K%%%jj%%J%%J%jjj%JJ%J%%%j%%%%Jj%%%J%%%jj%%%%
1459A5j%%JJ%j%%%%%%%%%%%%%%%%%j%jJJ%%%J%J%j%J%%%j%J%kk%JK%%%%jjJ%%%%%%%%J%%j
1452A5%%%jJ%J%J%%%%j%j%%j%J%%J%%%%%%%%J%%J%%j%j%%%%%%%%%%j%%Jj%%%J%j%%%%j%%%
1445A4J%JJjj%J%j%j%%J%J%j%jJ%%j%%%j%%J%jJJJj%J%%%%%%%j%%J%%%%%%jJ%%%%%jj%%%J
1437A5%%%J%%%%j%jj%JJJJj%%J%jj%%%j%j%%jJJ%J%J%J%J%%Jj%j%%j%%J%%%J%J%jJ%j%%%%
1430A8%%j%Jj%jj%%%J%%%%%Jjj%%%%%%%%%j%J%%J%Jj%J%%%%%%%%%jJ%jjJJJ%%%jj%%%%jJ%
$$ plain form
1422 16 16 16 16 17 17 17 16 16 16 16 16 16 17 17 17 17 17 16 16 16 16 16 16 16 17 16 16 16 15 15 15 15 16 15 14 15 15 15 16 16 16 15 15 14 14 15 16 16 16 17 17 17 17 16 16 15 15 15 15 16 16 15 15 14 14 14 14 14 13 13
1415 13 13 13 13 13 13 14 14 14 14 15 16 16 17 17 18 17 16 15 14 14 14 14 14 14 14 14 15 15 14 14 14 14 14 14 14 14 14 15 15 14 14 13 13 13 13 13 13 13 14 14 14 14 14 14 14 14 14 14 14 14 14 14 15 15 16 16 17 17 16 17
1408 17 16 16 16 16 16 15 15 15 15 16 16 16 16 15 14 13 14 14 13 13 13 14 15 15 15 15 15 15 16 16 17 17 17 16 15 15 14 15 15 15 15 15 16 15 15 14 14 14 14 14 13 15 16 16 15 15 15 15 14 15 14 14 16 16 17 17 16 16 16 16
1400 16 17 16 16 16 16 15 15 16 16 16 17 17 17 17 17 16 16 16 16 16 16 16 16 15 14 14 13 13 13 13 12 12 12 13 13 13 14 14 14 15 15 14 13 13 13 14 15 15 14 14 13 13 14 14 14 14 14 14 14 14 14 14 13 14 14 14 15 15 14 14
1393 14 14 14 13 14 15 14 13 13 12 12 12 12 13 13 13 14 13 12 13 13 14 14 15 14 14 14 14 14 14 14 14 14 14 13 13 13 13 13 14 14 14 14 15 15 15 15 15 14 13 12 11 12 13 14 16 15 15 15 14 14 14 13 12 13 13 14 14 14 15 15
1385 15 15 15 15 14 14 13 13 13 13 15 14 14 14 13 13 14 14 14 14 14 14 15 15 16 16 15 14 14 14 15 15 16 15 14 13 14 15 15 14 13 12 11 11 12 12 11 11 11 13 13 12 11 12 12 13 13 14 15 14 14 14 15 15 14 14 13 13 14 14 15
1378 15 15 15 14 14 15 15 14 14 14 14 14 14 13 14 15 16 17 16 15 16 16 16 16 15 16 15 15 15 15 14 14 13 13 12 12 12 12 11 12 13 14 15 15 15 15 14 14 13 13 13 13 15 16 16 15 15 15 14 13 13 14 14 14 14 14 14 14 15 16 16
1370 16 15 14 14 14 14 15 15 14 14 14 15 14 14 14 14 14 13 13 13 14 15 15 14 14 13 13 13 13 13 14 14 15 16 16 15 15 15 15 14 14 14 14 15 15 16 15 15 15 15 14 14 14 14 14 14 14 15 16 15 15 14 14 14 15 16 15 14 14 15 15
$$ packed form
1422A6%%%J%%j%%%%%J%%%%j%%%%%%Jj%%j%%%JjjJ%%J%%j%j%JJ%%J%%%j%j%%%J%j%j%%%%j%
1415A3%%%%%J%%%JJ%J%Jjjjj%%%%%%%J%j%%%%%%%%J%j%j%%%%%%J%%%%%%%%%%%%%J%J%J%jJ
1408A7j%%%%j%%%J%%%jjjJ%j%%JJ%%%%%J%J%%jj%jJ%%%%Jj%j%%%%jKJ%j%%%jJj%K%J%j%%%
1400A6Jj%%%j%J%%J%%%%j%%%%%%%jj%j%%%j%%J%%J%%J%jj%%JJ%j%j%J%%%%%%%%%jJ%%J%j%
1393A4%%jJJjj%j%%%J%%JjjJ%J%Jj%%%%%%%%%j%%%%J%%%J%%%%jjjjJJJKj%%j%%jjJ%J%%J%
1385A5%%%j%j%%%Kj%%j%J%%%%%J%J%jj%%J%JjjjJJ%jjjj%J%j%%K%jjJ%J%JJj%%J%j%j%J%J
1378A5%%j%J%j%%%%%jJJJJjjJ%%%jJj%%%j%j%j%%%jJJJJ%%%j%j%%%KJ%j%%jj%J%%%%%%JJ%
1370A6jj%%%J%j%%Jj%%%%j%%JJ%j%j%%%%J%JJ%j%%%j%%%J%Jj%%%j%%%%%%JJj%j%%JJjj%J%
$$ plain form
1363 15 15 15 14 14 14 14 14 14 14 15 15 13 12 13 13 13 13 14 14 14 14 13 14 13 13 13 13 13 13 13 13 13 13 12 12 12 12 12 12 12 13 14 14 14 14 14 15 15 16 16 15 15 14 14 14 14 15 14 14 13 13 13 14 14 15 15 15 14 14 13
1356 13 14 15 15 15 14 14 12 12 12 12 13 13 13 13 12 12 12 13 14 15 15 15 15 16 15 15 15 14 14 13 13 13 14 14 15 15 16 16 16 16 16 15 14 13 13 14 15 15 14 14 14 14 14 14 14 13 13 13 14 14 14 13 12 13 13 13 14 14 14 14
1348 14 14 13 11 11 12 13 13 13 12 13 13 13 14 14 14 14 14 14 14 14 13 14 14 13 12 12 12 12 13 13 13 13 13 13 14 13 13 13 13 13 13 13 14 15 15 14 15 15 14 13 12 12 13 13 13 13 14 14 14 14 14 14 14 14 15 14 14 14 14 14
1341 14 14 14 14 14 14 14 14 15 16 16 15 15 14 14 14 14 13 13 12 12 12 12 12 12 13 13 13 13 14 14 14 14 15 15 15 15 15 14 12 12 12 12 11 11 11 12 13 13 13 13 13 12 12 12 12 13 14 15 15 15 15 15 15 15 14 14 14 14 14 14
1333 14 14 14 14 15 15 15 15 15 14 14 13 12 13 14 14 14 14 14 13 13 13 12 12 12 13 15 15 14 13 13 13 13 12 12 12 13 15 14 14 14 14 13 13 12 12 12 12 12 12 12 12 12 12 12 12 11 11 11 12 12 13 13 13 14 14 14 14 14 15 14
1326 14 14 14 13 13 13 12 12 12 12 12 12 12 12 13 12 13 14 15 14 14 15 15 15 15 14 15 16 16 16 15 14 14 14 14 14 14 13 13 12 13 13 13 14 14 14 15 15 14 14 13 12 13 13 13 14 14 14 14 14 13 13 13 12 13 14 14 12 11 11 11
1319 11 12 13 13 13 14 14 14 14 14 14 14 15 15 15 15 14 13 11 11 11 10 11 12 12 13 13 13 13 14 13 13 13 13 12 12 12 13 13 13 12 11 11 11 11 12 12 12 13 13 13 14 14 14 14 13 14 15 14 13 13 13 13 13 13 13 14 14 15 15 15
1311 15 15 14 14 14 13 13 14 14 15 15 14 14 13 13 13 13 13 14 14 15 15 15 15 14 14 13 13 13 13 13 14 14 13 14 15 14 14 14 15 15 15 14 14 14 14 14 14 14 13 13 13 13 13 13 13 14 15 14 13 12 11 12 12 12 13 13 13 13 14 14
$$ packed form
1363A5%%j%%%%%%J%kjJ%%%J%%%jJj%%%%%%%%%j%%%%%%JJ%%%%J%J%j%j%%%Jj%j%%J%J%%j%j
1356A3JJ%%j%k%%%J%%%j%%JJJ%%%Jj%%j%j%%J%J%J%%%%jjj%JJ%j%%%%%%j%%J%%jjJ%%J%%%
1348A4%jk%JJ%%jJ%%J%%%%%%%jJ%jj%%%J%%%%%Jj%%%%%%JJ%jJ%jjj%J%%%J%%%%%%%Jj%%%%
1341A4%%%%%%%JJ%j%j%%%j%j%%%%%J%%%J%%%J%%%%jk%%%j%%JJ%%%%j%%%JJJ%%%%%%j%%%%%
1333A4%%%J%%%%j%jjJJ%%%%j%%j%%JK%jj%%%j%%JKj%%%j%j%%%%%%%%%%%j%%J%J%%J%%%%Jj
1326A4%%j%%j%%%%%%%JjJJJj%J%%%jJJ%%jj%%%%%j%jJ%%J%%J%j%jjJ%%J%%%%j%%jJJ%kj%%
1319A1JJ%%J%%%%%%J%%%jjk%%jJJ%J%%%Jj%%%j%%J%%jj%%%J%%J%%J%%%jJJjj%%%%%%J%J%%
1311A5%j%%j%J%J%j%j%%%%J%J%%%j%j%%%%J%jJJj%%J%%j%%%%%%j%%%%%%JJjjjjJ%%J%%%J%
$$ plain form
1304 14 13 13 13 13 13 13 13 14 14 14 14 15 14 12 11 12 14 15 14 13 13 13 12 13 14 14 14 14 15 14 14 13 13 13 13 13 13 13 14 14 14 14 13 14 14 15 15 15 15 15 14 14 13 14 14 13 12 12 12 12 12 12 12 12 13 13 14 14 13 14
1296 14 15 14 13 12 13 14 14 14 13 14 15 15 14 13 13 13 14 14 14 14 14 13 13 13 12 12 12 12 12 13 12 12 12 12 12 13 12 12 12 12 13 13 14 15 14 13 13 12 12 11 11 11 12 13 13 13 13 14 14 14 13 13 14 14 15 15 14 14 13 13
1289 13 13 13 13 13 14 13 13 13 13 13 13 12 12 12 13 13 13 13 12 12 12 12 12 13 13 12 12 12 12 12 12 12 12 12 13 13 14 14 14 14 15 15 15 15 15 14 14 14 14 14 14 13 13 13 13 14 14 14 14 14 13 14 14 14 14 13 13 13 13 13
1281 13 13 13 12 13 13 14 14 15 15 15 15 15 14 14 13 13 12 13 13 13 13 13 13 13 13 12 12 12 12 12 12 12 13 13 13 13 13 14 14 14 14 14 13 13 12 13 13 13 13 12 13 14 14 14 14 13 13 12 11 12 12 12 12 12 12 12 11 12 13 14
1274 14 14 13 11 12 13 13 13 13 13 13 14 14 15 15 15 14 14 14 14 14 14 14 14 13 13 13 12 12 12 12 12 13 13 13 13 13 12 12 13 13 12 12 13 14 14 13 13 13 13 13 13 13 13 13 13 13 13 13 13 13 13 13 14 13 12 12 11 11 12 13
1267 13 13 12 12 11 11 11 12 12 13 14 14 14 13 13 13 13 13 13 13 13 13 13 14 14 15 14 14 13 12 12 12 13 13 13 13 13 12 12 12 13 13 13 13 13 13 14 14 14 15 15 15 15 15 16 16 15 14 14 14 13 13 13 12 12 12 11 11 11 12 13
1259 13 12 11 11 11 12 12 11 11 12 12 12 12 13 13 13 13 13 13 13 14 14 14 14 13 13 13 12 13 13 13 13 12 12 12 12 13 14 14 14 14 13 13 12 12 12 12 12 13 13 13 12 12 12 13 13 13 13 13 13 13 13 14 14 14 15 14 13 13 13 13
1252 13 13 12 12 12 11 11 11 12 13 13 13 13 14 14 14 13 12 12 12 13 15 14 13 13 13 14 14 14 14 13 13 13 13 13 13 13 12 12 12 13 14 14 14 14 14 13 11 11 10 11 11 12 12 12 12 12 12 13 14 14 14 13 13 13 13 14 14 14 14 14
$$ packed form
1304A4j%%%%%%J%%%JjkjJKJjj%%jJJ%%%Jj%j%%%%%%J%%%jJ%J%%%%j%jJ%jj%%%%%%%J%J%jJ
1296A4JjjjJJ%%jJJ%jj%%J%%%%j%%j%%%%Jj%%%%Jj%%%J%JJjj%j%j%%JJ%%%J%%j%J%J%j%j%
1289A3%%%%Jj%%%%%j%%J%%%j%%%%J%j%%%%%%%%J%J%%%J%%%%j%%%%%j%%%J%%%%jJ%%%j%%%%
1281A3%%jJ%J%J%%%%j%j%jJ%%%%%%%j%%%%%%J%%%%J%%%%j%jJ%%%jJJ%%%j%jjJ%%%%%%jJJJ
1274A4%jkJJ%%%%%J%J%%j%%%%%%%j%%j%%%%J%%%%j%J%j%JJ%j%%%%%%%%%%%%%%%%Jjj%j%JJ
1267A3%j%j%%J%JJ%%j%%%%%%%%%J%Jj%jj%%J%%%%j%%J%%%%%J%%J%%%%J%jj%%j%%j%%j%%JJ
1259A3jj%%J%j%J%%%J%%%%%%J%%%j%%jJ%%%j%%%JJ%%%j%j%%%%J%%j%%J%%%%%%%J%%Jjj%%%
1252A3%j%%j%%JJ%%%J%%jj%%JKjj%%J%%%j%%%%%%j%%JJ%%%%jk%jJ%J%%%%%JJ%%j%%%J%%%%
$$ plain form
1244 14 13 12 12 13 14 14 14 13 13 13 12 12 13 13 14 13 13 12 12 12 13 13 13 13 11 11 11 11 12 12 12 12 13 12 12 12 11 12 12 12 12 12 11 12 12 13 14 14 14 14 14 13 13 12 12 12 12 14 14 14 14 13 13 13 12 12 12 12 12 13
1237 13 13 14 13 13 13 13 13 14 14 14 14 13 13 14 13 13 13 13 13 13 12 12 13 13 13 13 13 14 14 14 14 14 13 13 14 14 13 12 12 13 13 13 14 14 14 14 14 13 13 13 13 14 14 14 14 14 14 15 14 14 14 14 14 14 14 14 14 14 14 13
1230 13 12 12 12 13 13 13 13 13 13 14 14 14 14 13 12 12 12 13 13 13 13 13 13 14 14 14 14 14 14 14 14 13 12 12 12 12 12 12 11 11 12 12 12 12 14 14 14 14 14 14 15 14 13 13 13 14 14 14 15 15 15 14 14 14 13 13 13 13 13 12
1222 12 13 13 13 13 13 13 14 14 13 13 13 13 13 12 12 12 12 12 13 13 13 14 14 14 14 13 13 13 12 12 12 12 12 12 13 13 13 13 13 13 13 13 13 13 14 15 14 14 14 13 13 13 13 13 14 13 13 13 14 14 13 12 12 13 12 12 12 13 13 14
1215 14 14 14 15 14 14 13 14 14 14 14 14 14 14 13 13 12 12 12 12 13 13 13 13 13 13 14 14 14 15 14 13 13 12 13 14 14 14 13 13 13 12 12 11 12 12 12 13 14 15 15 15 14 13 12 12 12 13 13 13 13 14 14 14 13 12 12 12 12 11 11
1207 11 11 12 12 13 13 13 13 13 12 12 11 12 12 12 12 13 13 13 14 14 14 14 14 13 13 13 12 13 14 14 14 13 13 12 12 13 13 14 15 15 14 14 14 13 13 13 14 13 13 13 13 13 12 13 13 14 14 14 14 14 14 14 14 14 13 13 13 13 12 12
1200 12 11 12 13 14 14 14 14 14 14 13 13 13 13 14 15 15 15 14 13 13 12 12 12 12 11 12 12 12 13 14 14 13 12 12 12 11 11 11 10 10 11 12 12 12 13 13 12 12 12 12 13 13 13 13 13 13 13 12 12 12 12 12 12 13 13 14 14 13 13 12
1192 12 12 13 13 14 14 15 15 15 16 16 15 14 14 13 12 12 10 10 11 12 13 13 13 13 13 12 12 12 11 12 12 13 14 13 13 14 14 14 15 14 14 13 13 13 13 13 14 13 13 13 14 14 14 14 13 13 13 13 13 13 13 14 15 15 16 15 15 14 14 13
$$ packed form
1244A4jj%JJ%%j%%j%J%Jj%j%%J%%%k%%%J%%%Jj%%jJ%%%%jJ%JJ%%%%j%j%%%K%%%j%%j%%%%J
1237A3%Jj%%%%J%%%j%Jj%%%%%j%J%%%%J%%%%j%J%jj%J%%J%%%%j%%%J%%%%%Jj%%%%%%%%%%j
1230A3j%%J%%%%%J%%%jj%%J%%%%%J%%%%%%%jj%%%%%j%J%%%K%%%%%Jjj%%J%%J%%j%%j%%%%j
1222A2J%%%%%J%j%%%%j%%%%J%%J%%%j%%j%%%%%J%%%%%%%%%JJj%%j%%%%Jj%%J%jj%Jj%%J%J
1215A4%%Jj%jJ%%%%%%j%j%%%J%%%%%J%%Jjj%jJJ%%j%%j%jJ%%JJJ%%jjj%%J%%%J%%jj%%%j%
1207A1%J%J%%%%j%jJ%%%J%%J%%%%j%%jJJ%%j%j%J%JJ%j%%j%%Jj%%%%jJ%J%%%%%%%%j%%%j%
1200A2jJJJ%%%%%j%%%JJ%%jj%j%%%jJ%%JJ%jj%%j%%j%JJ%%J%j%%%J%%%%%%j%%%%%J%J%j%j
1192A2%J%J%J%%J%jj%jj%k%JJJ%%%%j%%jJ%JJj%J%%Jj%j%%%%Jj%%J%%%j%%%%%%JJ%Jj%j%j
$$ plain form
1185 13 12 13 13 13 13 13 13 13 14 14 15 14 14 14 13 14 14 15 15 15 15 15 14 14 14 14 14 15 15 14 13 12 12 13 14 14 15 14 14 13 12 12 14 15 15 15 15 14 13 12 11 12 12 12 12 12 13 13 13 13 14 14 14 13 12 12 12 13 14 14
1178 14 13 13 13 14 15 15 15 14 14 14 14 14 14 14 14 14 12 12 12 12 11 11 12 14 14 14 13 13 14 15 16 16 16 15 14 13 12 13 13 14 15 15 15 14 13 13 13 14 14 14 14 15 15 15 14 15 15 15 15 15 15 15 14 14 15 14 13 14 14 14
1170 14 15 14 13 13 13 13 13 13 14 14 13 13 13 13 13 13 13 12 13 14 15 15 13 13 12 11 10 11 12 13 13 13 14 13 13 13 12 12 12 13 13 12 11 12 13 13 14 14 14 14 14 14 14 14 14 14 15 15 14 14 13 13 12 13 13 13 13 14 14 14
1163 14 14 14 14 14 14 13 13 13 13 12 12 13 14 14 15 15 14 14 14 13 13 14 14 14 14 15 15 15 15 15 15 15 15 15 14 15 16 16 16 15 15 14 14 14 14 15 15 15 14 15 16 16 17 16 15 14 14 14 13 13 14 15 15 15 15 15 15 14 14 15
1155 15 15 16 16 15 15 14 14 13 14 14 14 14 15 15 14 14 14 14 15 15 16 16 15 15 15 16 16 16 15 15 15 15 15 15 16 16 16 16 16 16 17 18 18 17 16 15 16 16 16 16 16 16 16 15 14 13 13 13 13 14 15 15 15 16 16 16 16 15 15 15
1148 15 16 16 16 16 16 15 14 15 16 16 16 16 16 15 15 15 15 14 14 14 14 14 13 14 14 14 15 15 15 15 15 15 16 16 17 17 17 17 17 18 17 17 18 18 17 17 18 19 19 18 18 19 20 20 19 19 19 20 20 20 19 19 19 18 17 17 17 18 19 19
1140 19 19 19 20 20 19 19 20 19 19 20 20 21 20 20 20 19 19 19 19 20 20 21 21 22 21 20 20 20 20 20 20 20 21 22 22 22 21 21 22 22 23 22 22 21 19 19 20 21 21 21 22 22 23 23 23 23 23 23 23 23 22 21 20 20 20 20 20 20 21 21
1133 21 22 23 24 24 25 27 28 30 31 31 32 32 33 33 34 34 33 32 31 31 30 29 29 28 28 27 26 26 26 27 27 28 28 29 29 30 31 32 33 33 35 37 38 38 39 40 41 42 43 44 45 45 46 47 47 48 49 50 51 52 53 54 56 58 60 62 64 65 66 66
$$ packed form
1185A3jJ%%%%%%J%Jj%%jJ%J%%%%j%%%%J%jjj%JJ%Jj%jj%KJ%%%jjjjJ%%%%J%%%J%%jj%%JJ%
1178A4j%%JJ%%j%%%%%%%%k%%%j%JK%%j%JJJ%%jjjjJ%JJ%%jj%%J%%%J%%jJ%%%%%%j%JjjJ%%
1170A4Jjj%%%%%J%j%%%%%%jJJJ%k%jjjJJJ%%Jj%%j%%J%jjJJ%J%%%%%%%%%J%j%j%jJ%%%J%%
1163A4%%%%%j%%%j%JJ%J%j%%j%J%%%J%%%%%%%%jJJ%%j%j%%%J%%jJJ%Jjjj%%j%JJ%%%%%j%J
1155A5%J%j%j%jJ%%%J%j%%%J%J%j%%J%%j%%%%%J%%%%%JJ%jjjJ%%%%%%jjj%%%JJ%%J%%%j%%
1148A5J%%%%jjJJ%%%%j%%%j%%%%jJ%%J%%%%%J%J%%%%Jj%J%j%JJ%j%JJ%j%%J%%j%%jj%%JJ%
1140A9%%J%j%Jj%J%Jj%%j%%%J%J%Jjj%%%%%%JJ%%j%J%Jj%jk%JJ%%J%J%%%%%%%jjj%%%%%J%
1133B1JJJ%JKJKJ%J%J%J%jjj%jj%j%jj%%J%J%J%JJJJ%KKJ%JJJJJJJ%JJ%JJJJJJJKKKKKJJ%
$$ plain form
1126 66 66 67 68 70 72 73 75 77 78 80 82 84 86 87 89 93 96 99 101 104 107 111 115 119 124 129 135 140 144 149 155 162 169 177 185 195 206 219 232 248 265 285 307 331 359 391 429 471 519 574 637 711 794
1120 794 886 990 1108 1239 1387 1554 1740 1945 2165 2397 2638 2881 3117 3335 3521 3655 3722 3712 3628 3481 3289 3068 2832 2593 2357
1117 2357 2128 1912 1711 1526 1358 1206 1072 955 854 766 689 623 566 518 475 437 405 376 350 327 307 288 272 257 243 230 219 209 199 189
1114 189 179 170 162 155 148 141 135 130 124 120 118 115 110 106 102 100 97 94 91 87 84 82 79 76 74 72 70 68 66 65 63 61 58 56 55 54 54 53 53 53 52 51 51 50 50 51 50 48 47 46 46 46 46 46 46 45 43 43 43 43 44 44 44 42 41 42 42 43
1107 43 43 42 42 42 42 41 41 40 39 38 38 37 36 34 32 31 29 28 27 27 27 27 28 27 27 27 28 30 31 31 32 32 33 33 33 34 34 35 34 33 33 33 33 32 32 31 30 30 30 30 28 27 26 26 26 25 25 25 24 25 25 25 24 24 23 23 23 23 22 22
1100 22 22 22 22 22 23 24 25 24 24 23 23 23 23 24 25 26 26 26 26 26 26 26 25 25 25 24 24 24 23 23 23 23 24 25 25 26 26 25 25 25 25 24 24 24 24 23 23 23 22 21 20 21 21 21 21 21 20 20 20 21 21 22 22 22 21 20 19 20 20 20
1092 20 19 19 19 19 19 19 19 20 20 21 21 21 20 19 19 19 19 19 19 19 18 18 19 18 18 17 18 18 18 18 17 17 18 18 18 19 19 19 19 19 19 19 19 19 19 19 19 19 17 17 18 18 19 19 19 19 19 19 19 18 18 18 18 17 17 17 17 17 16 16
1085 16 16 16 17 17 17 16 16 16 15 16 16 16 16 16 16 16 16 16 15 15 15 15 15 16 15 15 15 15 16 16 17 17 16 16 16 17 16 16 17 17 17 16 16 16 15 16 15 14 14 14 15 15 15 15 14 15 16 16 16 15 14 13 12 13 13 13 14 13 13 13
$$ packed form
1126F6%JJKKJKKJKKKKJKMLLKLLMMMNNONMNOPPQQJ0J1J3J3J6J7K0K2K4K8L2L8M2M8N5O3P4Q3
1120G94R2J04J18J31J48J67J86K05K20K32K41K43K36K18J86J34O7j0q4j47j92k21k36k39k36
1117B357k29k16k01j85j68j52j34j17j01q8p7o6n7m8m3l8l2k9k6k3k0j9j6j5j4j3j1j0j0j0
1114A89j0rqppponomklnmmklllmlkllkkkkkjkklkjj%j%%jj%j%Jjkjj%%%%%jk%%%J%%kjJ%J
1107D3%j%%%j%jjj%jjkkjkjj%%%Jj%%JKJ%J%J%%J%Jjj%%%j%jj%%%kjj%%j%%jJ%%j%j%%%j%
1100B2%%%%JJJj%j%%%JJJ%%%%%%j%%j%%j%%%JJ%J%j%%%j%%%j%%jjjJ%%%%j%%J%J%%jjjJ%%
1092B0j%%%%%%J%J%%jj%%%%%%j%Jj%jJ%%%j%J%%J%%%%%%%%%%%%k%J%J%%%%%%j%%%j%%%%j%
1085A6%%J%%j%%jJ%%%%%%%%j%%%%Jj%%%J%J%j%%Jj%J%%j%%jJjj%%J%%%jJJ%%jjjjJ%%Jj%%
$$ plain form
1077 13 12 12 13 14 13 13 13 13 14 14 14 15 15 15 15 14 14 14 14 14 14 15 16 16 17 16 16 16 17 17 17 16 16 16 16 16 16 16 16 16 15 15 15 16 16 15 15 15 15 15 15 14 14 14 14 14 14 14 14 15 15 15 16 15 15 15 15 14 14 14
1070 14 14 14 14 14 15 15 15 15 15 14 14 14 13 12 12 13 13 13 13 13 12 12 12 12 13 13 13 13 13 13 13 14 15 16 16 16 16 15 14 15 15 15 15 15 15 14 14 14 14 13 13 14 14 15 15 15 15 15 14 14 13 14 15 15 15 15 15 15 16 16
1063 16 16 15 15 14 14 14 14 14 15 16 17 17 15 14 14 15 15 15 15 14 13 13 13 14 15 15 14 14 14 14 14 14 15 15 14 13 12 13 13 13 14 14 14 14 14 14 14 14 14 13 13 13 13 14 15 15 15 15 14 15 15 15 14 14 14 14 14 14 14 14
1055 14 15 15 16 15 15 15 14 14 14 14 14 13 13 13 13 13 14 14 13 13 13 12 13 14 14 13 13 14 14 15 15 14 14 14 15 14 14 13 12 12 12 12 12 13 13 14 15 16 16 15 14 14 13 14 14 13 13 12 11 12 14 14 14 14 14 14 13 13 14 15
1048 15 15 15 15 15 15 15 15 15 15 14 14 14 14 14 14 13 12 12 12 13 13 13 12 13 13 13 13 13 12 11 11 11 12 13 15 15 15 14 14 14 14 14 14 14 12 11 11 12 13 14 14 13 13 13 13 13 14 14 14 13 13 13 13 14 14 14 14 13 13 13
1040 13 13 14 14 14 13 13 13 13 12 12 11 12 13 13 14 13 13 13 13 13 12 13 13 14 14 14 14 14 13 12 12 12 12 12 13 13 12 11 11 12 13 13 13 13 14 13 14 14 14 14 13 13 13 13 13 13 12 12 12 12 13 14 14 14 13 13 13 14 13 13
1033 13 14 15 15 14 12 13 13 14 15 15 14 14 14 14 14 14 14 14 14 13 13 13 13 14 14 14 14 14 13 13 13 13 13 12 12 12 12 12 13 13 13 12 12 12 12 12 13 13 14 14 14 13 13 12 12 13 14 14 13 13 13 13 13 12 13 14 15 14 14 14
1025 14 14 14 15 14 14 15 15 14 14 14 14 14 14 13 13 13 14 14 14 14 15 15 14 14 14 13 12 11 12 12 13 13 13 12 11 12 13 13 12 11 11 12 13 14 14 13 13 13 14 14 15 15 15 14 14 13 13 13 14 14 14 14 14 13 12 12 12 12 13 13
$$ packed form
1077A3j%JJj%%%J%%J%%%j%%%%%JJ%Jj%%J%%j%%%%%%%%j%%J%j%%%%%j%%%%%%%J%%Jj%%%j%%
1070A4%%%%J%%%%j%%jj%J%%%%j%%%J%%%%%%JJJ%%%jjJ%%%%%j%%%j%J%J%%%%j%jJJ%%%%%J%
1063A6%j%j%%%%JJJ%kj%J%%%jj%%JJ%j%%%%%J%jjjJ%%J%%%%%%%%j%%%JJ%%%jJ%%j%%%%%%%
1055A4J%Jj%%j%%%%j%%%%J%j%%jJJ%j%J%J%j%%Jj%jj%%%%J%JJJ%jj%jJ%j%jjJK%%%%%j%JJ
1048A5%%%%%%%%%j%%%%%jj%%J%%jJ%%%%jj%%JJK%%j%%%%%%kj%JJJ%j%%%%J%%j%%%J%%%j%%
1040A3%J%%j%%%j%jJJ%Jj%%%%jJ%J%%%%jj%%%%J%jj%JJ%%%JjJ%%%j%%%%%j%%%JJ%%j%%Jj%
1033A3JJ%jkJ%JJ%j%%%%%%%%j%%%J%%%%j%%%%j%%%%J%%j%%%%J%J%%j%j%JJ%j%%%%jJJJj%%
1025A4%%Jj%J%j%%%%%j%%J%%%J%j%%jjjJ%J%%jjJJ%jj%JJJ%j%%J%J%%j%j%%J%%%%jj%%%J%
$$ plain form
1018 13 14 14 13 13 13 13 13 13 13 13 12 12 11 12 12 12 12 13 13 13 13 13 13 13 13 13 12 11 11 12 13 13 14 15 15 14 14 14 14 13 14 14 13 13 13 13 14 14 14 14 14 14 14 15 15 15 15 15 15 15 15 15 14 15 16 15 15 15 14 14
1011 14 13 14 15 15 14 14 14 15 15 15 15 15 16 16 16 16 16 16 15 16 16 16 16 17 17 18 18 18 18 19 20 20 20 20 20 19 19 19 19 19 19 19 19 19 20 21 22 21 21 22 23 23 23 24 24 24 24 25 26 27 28 29 29 30 31 32 33 34 35 36
1003 36 37 38 39 41 42 44 46 49 52 55 58 62 66 72 77 83 88 95 104 111 119 129 139 150 162 174 187 201 212 223 233 241 246 248 247 243 237 229 219 208 196 185 173 161 149 137 127 118 109 101 95
998 95 88 82 76 73 69 65 61 58 55 52 50 47 45 42 40 38 36 35 34 33 33 32 31 29 29 29 29 28 27 26 25 24 24 24 25 25 23 22 22 22 21 20 20 21 21 21 21 20 19 19 19 19 19 18 17 17 18 18 18 18 18 18 17 17 17 17 17 17 17 17 16
990 16 16 16 16 16 16 15 15 16 16 16 16 16 16 16 16 16 16 16 16 16 16 16 17 18 17 15 14 14 14 13 13 13 13 14 15 15 15 14 12 12 13 14 14 14 14 15 15 14 15 15 14 14 14 14 14 14 13 14 15 16 16 16 17 16 15 15 15 16 16 16 16
983 16 16 15 15 14 14 13 13 13 14 14 14 13 13 13 13 13 13 14 14 13 12 12 12 12 12 13 14 15 15 14 15 15 15 15 16 16 16 16 16 14 14 14 14 14 14 14 15 15 13 12 12 13 14 14 14 14 14 14 14 13 13 13 13 13 13 14 13 13 13 12 12
975 12 13 14 14 14 14 13 12 12 12 13 12 12 12 12 12 12 12 12 11 11 10 11 11 12 13 13 12 12 12 13 13 12 13 13 13 12 13 13 13 13 13 13 12 12 13 13 13 13 13 14 14 14 14 15 15 16 16 16 16 16 15 14 15 15 16 16 16 15 14 14 13
968 13 14 14 14 14 13 13 13 13 13 13 13 13 13 12 12 13 14 14 14 15 14 14 14 13 12 12 13 13 13 13 14 15 15 14 14 13 14 15 15 15 15 16 16 17 17 16 15 15 14 13 13 13 14 15 16 16 16 17 17 16 15 15 15 14 14 13 13 13 14 14 13
$$ packed form
1018A3J%j%%%%%%%j%jJ%%%J%%%%%%%%jj%JJ%JJ%j%%%jJ%j%%%J%%%%%%J%%%%%%%%jJJj%%j%
1011A4jJJ%j%%J%%%%J%%%%%jJ%%%J%J%%%JJ%%%%j%%%%%%%%JJJj%JJ%%J%%%JJJJJ%JJJJJJJ
1003C6JJJKJKKLLLLMMONONPRPQJ0J0J1J2J2J3J4J1J1J0QNKjmoqj0j1j2j1j2j2j2j2j0rrqo
998I5poolmmmlllklklkkkjjj%jjk%%%jjjjj%%J%kj%%jj%J%%%jj%%%%jj%J%%%%%j%%%%%%%j
990A6%%%%%j%J%%%%%%%%%%%%%%JJjkj%%j%%%JJ%%jk%JJ%%%J%jJ%j%%%%%jJJJ%%Jjj%%J%%%
983A6%j%j%j%%J%%j%%%%%J%jj%%%%JJJ%jJ%%%J%%%%k%%%%%%J%kj%JJ%%%%%%j%%%%%Jj%%j%
975A2JJ%%%jj%%Jj%%%%%%%j%jJ%JJ%j%%J%jJ%%jJ%%%%%j%J%%%%J%%%J%J%%%%jjJ%J%%jj%j
968A3J%%%j%%%%%%%%j%JJ%%Jj%%jj%J%%%JJ%j%jJJ%%%J%J%jj%jj%%JJJ%%J%jj%%j%j%%J%j
$$ plain form
960 13 13 13 13 13 13 13 13 14 14 14 14 14 14 14 13 12 12 11 11 12 12 13 14 13 12 12 12 13 14 14 15 15 14 14 14 14 15 16 16 16 15 14 14 15 14 13 13 14 14 13 12 11 11 12 13 13 12 12 12 13 14 15 15 14 15 15 15 13 13 13 14
953 14 14 14 13 13 13 13 13 14 13 13 13 13 14 14 15 15 15 14 14 14 14 14 14 13 13 13 13 13 13 13 12 13 13 13 14 14 14 14 14 13 13 14 14 14 14 14 13 13 14 14 14 13 13 13 13 13 13 12 13 13 13 13 12 12 12 12 12 12 13 12 12
945 12 12 12 13 14 15 14 14 13 13 12 11 12 13 14 13 13 13 13 13 13 13 13 13 13 13 13 13 13 14 14 15 15 15 14 13 13 14 15 16 16 15 14 12 12 13 13 13 13 14 15 16 16 15 15 14 14 13 14 15 15 16 15 15 15 15 14 13 13 14 14 14
938 14 15 15 15 15 15 15 16 16 16 16 16 17 17 17 17 18 19 19 19 18 18 19 20 20 21 22 22 22 22 22 22 21 22 22 21 21 20 19 19 19 19 17 16 17 17 16 16 16 17 17 18 18 17 17 16 16 15 15 15 15 14 13 14 15 15 15 15 14 14 14 14
930 14 13 14 14 15 15 15 15 15 15 15 15 15 15 14 14 14 14 15 15 16 15 15 15 15 14 14 14 13 13 12 12 12 12 12 13 13 14 13 13 13 13 13 13 13 13 13 12 13 13 12 11 11 11 11 11 11 11 12 13 13 14 14 14 14 13 13 13 13 13 14 13
923 13 13 13 13 13 13 14 15 15 16 16 15 14 15 15 16 16 16 15 15 15 15 15 15 15 15 15 15 15 15 15 14 14 14 15 15 15 15 16 17 16 14 14 14 14 14 15 15 14 14 16 16 17 17 17 17 17 16 15 14 14 15 15 16 16 16 16 16 16 15 14 15
915 15 16 16 16 16 16 15 15 15 14 15 15 15 16 16 16 16 15 16 15 15 16 17 17 16 16 16 16 16 16 16 15 15 15 16 16 16 17 17 17 17 16 16 17 17 17 16 16 16 17 17 17 19 20 20 20 20 21 21 21 20 19 19 19 19 19 20 19 18 18 18 18
907 18 18 18 18 18 18 18 17 17 17 18 18 19 19 20 20 21 21 20 18 17 17 17 17 17 17 17 17 17 16 16 16 16 17 18 18 18 18 18 19 20 20 19 18 18 18 18 18 19 20 20 20 19 19 19 19 19 20 20 20 19 19 20 20 20 20 20 21 21 22 24 25
$$ packed form
960A3%%%%%%%J%%%%%%jj%j%J%JJjj%%JJ%J%j%%%JJ%%jj%Jjj%J%jjj%JJ%j%%JJJ%jJ%%k%%J
953A4%%j%%%%Jj%%%J%J%%j%%%%%j%%%%%%jJ%%J%%%%j%J%%%%j%J%%j%%%%%jJ%%%j%%%%%Jj%
945A2%%JJJj%j%jjJJJj%%%%%%%%%%%%%J%J%%jj%JJJ%jjk%J%%%JJJ%j%j%jJJ%Jj%%%jj%J%%
938A4J%%%%%J%%%%J%%%JJ%%j%JJ%JJ%%%%%jJ%j%jj%%%kjJ%j%%J%J%j%j%j%%%jjJJ%%%j%%%
930A4jJ%J%%%%%%%%%j%%%J%Jj%%%j%%j%j%%%%J%Jj%%%%%%%%jJ%jj%%%%%%JJ%J%%%j%%%%Jj
923A3%%%%%JJ%J%jjJ%J%%j%%%%%%%%%%%%j%%J%%%JJjk%%%%J%j%K%J%%%%jjj%J%J%%%%%jjJ
915A5J%%%%j%%jJ%%J%%%jJj%JJ%j%%%%%%j%%J%%J%%%j%J%%j%%J%%KJ%%%J%%jj%%%%Jjj%%%
907A8%%%%%%j%%J%J%J%J%jkj%%%%%%%%j%%%JJ%%%%JJ%jj%%%%JJ%%j%%%%J%%j%J%%%%J%JKJ
$$ plain form
900 25 27 27 27 27 26 26 26 26 26 25 24 23 23 22 22 22 22 21 20 19 19 20 20 20 20 20 20 20 20 20 20 20 20 20 20 19 19 19 19 19 19 19 19 18 18 18 18 18 19 20 20 19 18 19 19 19 18 18 19 18 17 16 17 18 19 20 20 19 19 19 18
892 18 18 17 18 18 18 19 20 21 21 22 22 21 22 22 22 23 21 20 20 21 21 21 21 21 21 21 22 22 23 23 22 22 21 22 23 23 23 23 23 22 22 22 22 22 22 21 21 22 22 23 23 23 22 22 22 23 23 24 25 25 25 25 25 25 26 27 28 28 28 29 29
885 29 29 30 31 32 33 33 34 35 35 35 35 35 35 36 38 39 40 40 41 43 45 45 46 48 50 52 54 55 55 56 57 58 59 60 62 62 63 65 66 67 67 69 72 74 74 74 73 71 70 70 69 69 69 68 68 67 65 65 62 60 57 55 52 49 47 45 43 41 39 38 37
877 37 36 35 34 33 32 31 30 29 27 26 26 26 26 26 26 25 25 25 24 23 22 21 20 19 19 19 19 19 19 18 19 19 19 19 19 19 19 18 18 17 17 16 16 16 17 17 16 16 16 16 17 17 17 16 16 16 16 15 15 15 14 14 14 14 14 14 15 15 15 16 16
870 16 15 15 15 15 16 15 15 15 15 15 16 16 16 16 15 14 15 16 16 16 16 15 15 15 16 16 15 15 15 15 15 14 14 14 14 14 14 14 15 14 14 13 13 14 14 14 14 14 14 15 15 15 15 15 16 15 15 15 15 16 16 15 14 15 16 15 15 15 15 15 14
862 14 13 12 13 14 14 14 13 12 12 12 13 14 14 14 13 14 15 16 15 14 13 14 14 14 14 15 15 16 17 17 16 16 15 14 14 13 13 12 13 13 13 12 12 12 11 11 12 12 12 12 12 11 12 12 13 13 13 13 13 12 13 13 13 14 14 14 15 15 14 14 14
855 14 14 14 14 14 14 14 13 13 14 14 14 14 14 14 13 13 15 15 15 14 13 13 12 13 13 14 14 14 14 13 12 13 14 14 14 13 12 11 11 12 12 13 14 15 14 13 13 13 14 14 15 15 15 15 15 14 14 14 14 13 13 14 14 13 13 12 12 13 13 13 13
847 13 14 13 13 14 13 13 12 12 12 12 12 11 11 11 11 11 10 11 12 13 14 14 14 13 13 13 14 14 15 15 16 15 13 12 12 12 12 13 13 13 13 12 12 11 12 13 14 14 14 13 13 13 12 11 12 11 11 11 10 10 11 12 12 12 12 11 11 11 11 12 11
$$ packed form
900B5K%%%j%%%%jjj%j%%%jjj%J%%%%%%%%%%%%%j%%%%%%%j%%%%JJ%jjJ%%j%JjjjJJJJ%j%%j
892A8%jJ%%JJJ%J%jJ%%Jkj%J%%%%%%J%J%j%jJJ%%%%j%%%%%j%J%J%%j%%J%JJ%%%%%JJJ%%J%
885B9%JJJJ%JJ%%%%%JKJJ%JKK%JKKKKJ%JJJJJK%JKJJ%KLK%%jkj%j%%j%jk%lklkllkkkkkjj
877C7jjjjjjjjkj%%%%%j%%jjjjjj%%%%%jJ%%%%%%j%j%j%%J%j%%%J%%j%%%j%%j%%%%%J%%J%
870A6j%%%Jj%%%%J%%%jjJJ%%%j%%J%j%%%%j%%%%%%Jj%j%J%%%%%J%%%%Jj%%%J%jjJJj%%%%j
862A4jjJJ%%jj%%JJ%%jJJJjjjJ%%%J%JJ%j%jj%j%jJ%%j%%j%J%%%%jJ%J%%%%jJ%%J%%J%j%%
855A4%%%%%%j%J%%%%%j%K%%jj%jJ%J%%%jjJJ%%jjj%J%JJJjj%%J%J%%%%j%%%j%J%j%j%J%%%
847A3Jj%Jj%j%%%%j%%%%jJJJJ%%j%%J%J%Jjkj%%%J%%%j%jJJJ%%j%%jjJj%%j%JJ%%%j%%%Jj
$$ plain form
840 11 11 11 11 12 13 14 14 14 14 14 14 13 12 12 12 12 13 13 13 13 13 12 13 13 14 14 14 15 15 15 14 14 13 13 13 13 13 12 12 13 12 11 10 10 10 10 11 12 11 11 10 11 11 11 11 11 12 12 13 12 11 11 11 12 12 12 12 12 13 13 13
832 13 13 13 13 13 13 13 13 13 13 13 13 13 13 13 13 13 13 14 14 14 14 14 14 14 13 13 12 12 12 12 12 13 13 13 12 11 12 13 14 13 12 11 12 12 12 12 12 13 12 12 12 12 13 13 13 13 12 11 10 11 12 13 12 11 11 12 12 12 12 11 11
825 11 11 10 10 11 11 11 10 10 11 12 13 13 13 12 12 12 13 12 12 12 12 12 12 11 11 12 12 13 13 13 13 13 13 12 11 11 11 12 13 14 15 15 14 14 14 14 14 14 14 15 16 16 16 15 14 14 14 13 13 13 13 13 14 14 13 12 11 12 12 13 13
817 13 14 14 14 14 14 14 13 12 12 11 12 12 13 13 13 13 12 12 11 11 11 10 10 10 10 11 11 11 11 11 11 12 13 13 13 13 13 13 13 12 12 12 12 13 13 13 13 12 11 11 11 11 10 9 10 11 10 10 11 11 11 11 12 13 13 13 13 12 13 13 13
810 13 13 13 13 13 12 12 12 13 12 12 12 12 12 12 11 12 12 12 13 13 13 13 12 12 12 12 11 11 11 11 11 11 10 10 10 11 12 12 12 12 12 11 11 11 11 12 12 12 12 12 13 12 12 12 12 13 12 12 11 11 11 12 13 14 13 12 11 11 11 11 12
802 12 13 13 13 12 11 11 12 12 13 13 13 14 14 13 13 13 13 13 13 13 13 12 11 11 12 12 12 13 12 12 11 11 11 12 12 13 14 14 13 13 12 11 12 13 13 13 13 13 13 13 12 12 11 11 11 11 11 11 10 10 11 11 12 11 11 11 11 11 10 10 11
795 11 11 11 11 11 10 11 12 12 12 12 12 12 13 13 13 12 12 12 13 13 14 13 13 13 14 13 13 12 12 11 11 11 11 11 11 11 12 12 13 12 12 12 12 11 11 12 12 11 11 10 10 11 11 12 12 12 12 11 12 12 11 10 11 12 12 11 10 9 9 11 11
787 11 11 11 11 11 11 10 10 10 9 9 10 10 10 10 10 10 10 11 11 12 12 12 11 11 12 13 14 14 14 14 13 13 12 12 12 11 12 12 12 12 12 11 11 12 12 12 12 12 11 10 10 11 11 12 13 14 15 15 14 14 13 13 11 11 11 10 10 11 11 11 11
$$ packed form
840A1%%%JJJ%%%%%jj%%%J%%%%jJ%J%%J%%j%j%%%%j%Jjjj%%%JJj%jJ%%%%J%Jjj%%J%%%%J%%
832A3%%%%%%%%%%%%%%%%%J%%%%%%j%j%%%%J%%jjJJJjjjJ%%%%Jj%%%J%%%jjjJJJjj%J%%%j%
825A1%j%J%%j%JJJ%%j%%Jj%%%%%j%J%J%%%%%jj%%JJJJ%j%%%%%%JJ%%jj%%j%%%%J%jjjJ%J%
817A3J%%%%%jj%jJ%J%%%j%j%%j%%%J%%%%%JJ%%%%%%j%%%J%%%jj%%%jjJJj%J%%%JJ%%%jJ%%
810A3%%%%j%%Jj%%%%%jJ%%J%%%j%%%j%%%%%j%%JJ%%%%j%%%J%%%%Jj%%%Jj%j%%JJJjjj%%%J
802A2J%%jj%J%J%%J%j%%%%%%%jj%J%%Jj%j%%J%JJ%j%jjJJ%%%%%%j%j%%%%%j%J%Jj%%%%j%J
795A1%%%%jJJ%%%%%J%%j%%J%Jj%%Jj%j%j%%%%%%J%Jj%%%j%J%j%j%J%J%%%jJ%jjJJ%jjj%K%
787A1%%%%%j%%j%J%%%%%%J%J%%j%JJJ%%%j%j%%jJ%%%%j%J%%%%jj%J%JJJJ%j%j%k%%j%J%%%
$$ plain form
780 11 11 12 12 11 11 11 10 11 11 11 11 11 11 11 11 12 13 13 13 12 12 12 12 11 11 11 11 11 10 10 10 11 12 12 12 11 11 11 12 12 12 12 12 11 11 11 11 12 12 12 12 12 12 11 11 10 11 11 11 12 13 13 12 12 12 12 11 12 12 12 13
772 13 13 12 11 10 10 10 11 13 13 13 13 12 13 13 14 14 14 13 12 12 12 12 12 11 11 11 10 10 10 10 10 10 10 10 11 11 11 12 12 12 12 12 12 12 12 12 12 11 12 12 12 12 13 13 12 12 13 13 14 14 14 12 12 11 10 11 11 11 11 11 11
765 11 11 11 11 10 10 11 10 10 10 11 11 11 11 11 11 11 11 11 11 12 12 12 11 11 10 11 11 12 12 12 12 12 12 12 12 13 13 13 13 12 13 13 12 12 11 11 12 12 13 13 14 13 12 11 11 10 11 12 12 12 11 11 11 11 12 13 13 13 12 12 11
757 11 11 10 11 11 11 12 12 12 13 13 12 13 13 14 14 15 14 14 14 14 14 14 14 13 13 13 13 12 13 13 12 12 11 12 12 13 13 13 12 12 13 12 12 11 12 12 13 13 12 12 12 12 12 12 12 13 13 13 13 13 13 12 12 12 11 11 12 12 12 13 12
749 12 12 12 11 11 10 10 10 11 11 11 11 11 11 11 11 11 11 12 12 12 11 11 11 12 13 13 14 13 13 13 13 12 11 11 11 12 12 12 12 12 12 12 11 10 11 11 11 11 12 12 12 12 11 11 11 11 11 11 11 12 11 11 12 12 12 12 12 12 12 12 12
742 12 11 11 10 10 10 11 11 11 11 12 13 13 13 13 13 13 13 13 13 13 13 13 12 12 12 12 12 13 13 12 12 12 12 11 10 10 11 12 14 15 14 13 12 12 13 13 13 12 11 11 11 11 12 13 13 12 11 11 12 13 13 13 13 12 12 12 12 11 11 10 9
734 9 9 10 11 11 11 11 12 12 13 12 12 12 11 11 11 11 10 10 11 11 10 10 10 11 12 13 13 13 13 13 12 12 11 11 11 11 10 10 9 10 10 11 10 10 10 11 11 12 12 13 12 12 12 13 12 11 10 10 10 11 12 12 11 11 12 12 12 12 11 11 11 12
727 12 12 11 11 11 12 12 11 12 12 12 13 12 12 12 12 13 13 12 11 11 11 12 12 11 10 10 10 10 10 10 11 10 11 11 11 11 12 12 12 12 12 12 11 11 12 12 12 12 11 11 11 12 12 12 12 12 12 13 13 13 13 13 12 12 11 11 11 11 10 10 10
$$ packed form
780A1%J%j%%jJ%%%%%%%JJ%%j%%%j%%%%j%%JJ%%j%%J%%%%j%%%J%%%%%j%jJ%%JJ%j%%%jJ%%J
772A3%jjj%%JK%%%jJ%J%%jj%%%%j%%j%%%%%%%J%%J%%%%%%%%%jJ%%%J%j%J%J%%k%jjJ%%%%%
765A1%%%j%Jj%%J%%%%%%%%%J%%j%jJ%J%%%%%%%J%%%jJ%j%j%J%J%Jjjj%jJJ%%j%%%JJ%%j%j
757A1%jJ%%J%%J%jJ%J%Jj%%%%%%j%%%jJ%j%jJ%J%%j%Jj%jJ%J%j%%%%%%J%%%%%j%%j%J%%Jj
749A2%%j%j%%J%%%%%%%%%J%%j%%JJ%Jj%%%jj%%J%%%%%%jjJ%%%J%%%j%%%%%%Jj%J%%%%%%%%
742A2j%j%%J%%%JJ%%%%%%%%%%%j%%%%J%j%%%jj%JJKJjjj%J%%jj%%%JJ%jj%JJ%%%j%%%j%jj
734I%JJ%%%J%Jj%%j%%%j%J%j%%JJJ%%%%j%j%%%j%jJ%Jj%%J%J%Jj%%Jjjj%%JJ%j%J%%%j%%J
727A2%j%%J%jJ%%Jj%%%J%jj%%J%jj%%%%%JjJ%%%J%%%%%j%J%%%j%%J%%%%%J%%%%j%j%%%j%%
$$ plain form
719 10 10 9 9 9 10 10 10 10 11 11 11 10 11 12 11 11 12 11 11 11 12 11 10 11 11 12 12 12 12 12 13 14 13 12 12 12 12 12 12 12 12 12 13 13 13 13 12 12 12 12 12 12 12 12 11 11 12 12 12 11 10 9 9 10 10 9 9 9 9 11 11
712 11 11 11 12 12 13 13 14 13 12 12 11 11 11 11 11 12 12 12 12 13 14 14 13 13 13 13 12 12 12 11 11 11 11 12 13 13 13 13 13 14 14 14 13 12 11 11 11 11 12 12 13 13 12 13 13 13 14 14 14 13 12 13 13 12 10 10 11 11 11 11 11
704 11 10 10 10 10 11 12 11 11 11 11 11 11 10 10 9 9 9 9 9 9 9 9 10 11 12 12 12 12 13 12 10 10 10 11 11 11 11 11 12 12 12 13 13 13 12 10 9 9 9 9 10 10 10 11 10 10 9 9 9 10 10 11 11 11 11 11 11 11 10 10 10
697 10 10 10 10 10 10 10 11 11 11 11 12 12 13 12 12 11 11 11 10 11 11 11 12 12 12 11 12 12 12 11 10 10 10 11 12 12 12 12 12 12 11 10 9 9 8 9 9 10 11 11 11 11 11 9 8 9 9 9 10 10 10 10 11 11 11 11 10 11 11 12 12
689 12 12 12 12 11 11 11 11 11 12 13 14 14 14 13 13 13 12 12 11 11 11 11 11 10 9 9 10 10 10 10 11 11 11 10 10 10 10 10 10 9 10 11 11 10 9 10 10 11 11 11 11 12 12 12 11 10 10 10 11 12 12 11 11 11 10 11 12 13 13 13 12
682 12 12 12 12 12 12 13 13 13 12 12 13 13 13 12 11 10 11 12 12 12 12 12 13 12 12 11 11 11 10 10 11 12 12 12 12 12 11 12 12 12 11 11 11 11 12 13 12 11 10 10 11 11 11 11 12 12 13 12 12 12 12 12 12 12 12 13 12 12 13 13 13
674 13 13 13 13 14 14 13 13 12 12 12 11 11 11 11 11 11 11 12 13 13 13 13 12 12 12 13 14 14 13 12 13 13 13 13 12 12 12 12 12 12 13 12 11 11 12 12 12 12 12 11 11 11 11 10 10 10 10 9 9 9 10 11 11 11 11 12 12 13 13 13 12
667 12 12 12 13 12 12 12 13 13 12 12 12 12 12 12 12 11 11 11 11 10 10 10 10 10 10 10 9 10 10 9 9 11 11 11 11 11 11 12 13 12 12 12 12 12 11 11 11 11 10 10 10 10 10 10 10 10 10 10 10 11 11 10 10 10 10 11 11 11 11 12 12
$$ packed form
719A0%j%%J%%%J%%jJJj%Jj%%JjjJ%J%%%%JJjj%%%%%%%%J%%%j%%%%%%%j%J%%jjj%J%j%%%K%
712A1%%J%J%Jjj%j%%%%J%%%JJ%j%%%j%%j%%%JJ%%%%J%%jjj%%%J%J%jJ%%J%%jjJ%jk%J%%%%
704A1j%%%JJj%%%%%j%j%%%%%%%JJJ%%%Jjk%%J%%%%J%%J%%jkj%%%J%%Jj%j%%J%J%%%%%%j%%
697A0%%%%%%J%%%J%Jj%j%%jJ%%J%%jJ%%jj%%JJ%%%%%jjj%jJ%JJ%%%%kjJ%%J%%%J%%%jJ%J%
689A2%%%j%%%%JJJ%%j%%j%j%%%%jj%J%%%J%%j%%%%%jJJ%jjJ%J%%%J%%jj%%JJ%j%%jJJJ%%j
682A2%%%%%J%%j%J%%jjjJJ%%%%Jj%j%%j%JJ%%%%jJ%%j%%%JJjjj%J%%%J%Jj%%%%%%%Jj%J%%
674A3%%%J%j%j%%j%%%%%%JJ%%%j%%JJ%jjJ%%%j%%%%%Jjj%J%%%%j%%%j%%%j%%JJ%%%J%J%%j
667A2%%Jj%%J%j%%%%%%j%%%j%%%%%%jJ%j%K%%%%%JJj%%%%j%%%j%%%%%%%%%%J%j%%%J%%%J%
$$ plain form
659 12 12 12 12 12 13 13 11 10 10 9 10 10 10 11 11 11 10 10 10 10 10 10 11 10 10 9 10 11 11 11 11 11 11 12 12 12 12 12 11 11 12 13 13 13 12 11 12 12 13 13 12 12 11 10 10 9 9 9 9 10 10 10 9 9 11 11 11 11 12 12 13
652 13 14 14 14 13 13 13 12 13 14 13 13 13 13 12 11 11 11 10 10 11 12 12 11 11 12 12 12 12 12 12 12 12 11 11 10 11 11 12 12 12 12 12 12 13 13 12 11 10 11 11 12 12 12 12 12 12 12 11 11 11 11 10 11 11 12 12 12 12 12 12 12
644 12 12 11 12 12 12 11 12 12 12 12 13 14 13 12 12 11 11 11 11 11 11 11 11 11 11 11 12 12 12 12 12 12 12 11 11 10 11 11 11 11 11 11 11 11 11 11 11 11 11 11 10 9 10 10 10 11 10 9 10 11 11 11 11 11 11 12 12 12 12 11 11
637 11 11 10 10 10 10 10 11 11 11 11 10 10 9 9 9 8 9 10 11 11 11 12 13 13 12 11 11 11 12 12 12 12 13 13 13 12 12 12 11 10 10 10 12 14 14 15 14 13 13 12 12 12 11 11 11 11 11 11 11 12 13 14 13 13 12 11 11 11 12 12 12
629 12 12 11 13 13 13 12 12 12 11 11 12 12 12 13 13 12 11 11 11 10 11 11 12 12 12 13 13 13 13 13 13 13 14 14 14 14 15 15 15 16 16 16 16 16 16 17 17 17 16 16 16 16 16 16 15 14 14 14 14 13 13 12 13 13 13 14 14 14 14 15 16
621 16 16 15 15 15 14 15 15 16 16 16 15 15 15 15 15 15 15 15 15 15 15 16 16 16 16 16 17 17 18 18 17 17 17 17 17 18 18 19 19 19 19 19 19 19 20 20 20 21 21 20 20 20 20 20 20 20 19 17 17 17 17 16 16 16 15 15 15 14 14 14 14
614 14 13 13 13 14 14 13 12 12 12 12 12 12 12 12 12 12 12 11 11 12 12 12 12 13 13 13 12 12 12 12 13 14 16 17 17 17 17 17 17 17 16 16 17 17 16 15 14 15 16 16 16 16 15 15 15 15 14 13 13 14 14 14 14 14 14 13 12 12 12 13 13
606 13 12 12 12 13 14 14 14 13 12 12 12 14 15 15 14 14 13 12 12 12 12 13 12 12 12 13 14 14 14 14 13 14 13 12 12 12 13 12 12 13 13 13 13 14 14 14 14 14 14 13 13 13 13 13 13 13 13 13 12 12 11 12 12 12 12 12 12 13 14 14 15
$$ packed form
659A2%%%%J%kj%jJ%%J%%j%%%%%Jj%jJJ%%%%%J%%%%j%JJ%%jjJ%J%j%jj%j%%%J%%j%K%%%J%J
652A3J%%j%%jJJj%%%jj%%j%JJ%j%J%%%%%%%j%jJ%J%%%%%J%jjjJ%J%%%%%%j%%%jJ%J%%%%%%
644A2%jJ%%jJ%%%JJjj%j%%%%%%%%%%J%%%%%%j%jJ%%%%%%%%%%%%%jjJ%%JjjJJ%%%%%J%%%j%
637A1%j%%%%J%%%j%j%%jJJJ%%JJ%jj%%J%%%J%%j%%jj%%KK%Jjj%j%%j%%%%%%JJJj%jj%%J%%
629A2%jK%%j%%j%J%%J%jj%%jJ%J%%J%%%%%%J%%%J%%J%%%%%J%%j%%%%%jj%%%j%jJ%%J%%%JJ
621A6%j%%jJ%J%%j%%%%%%%%%%J%%%%J%J%j%%%%J%J%%%%%%J%%J%j%%%%%%jk%%%j%%j%%j%%%
614A4j%%J%jj%%%%%%%%%%j%J%%%J%%j%%%JJKJ%%%%%%j%J%jjjJJ%%%j%%%jj%J%%%%%jj%%J%
606A3j%%JJ%%jj%%KJ%j%jj%%%Jj%%JJ%%%jJjj%%Jj%J%%%J%%%%%j%%%%%%%%j%jJ%%%%%JJ%J
$$ plain form
599 15 14 14 14 14 16 16 16 15 15 14 13 13 13 12 13 13 13 13 13 13 12 11 11 12 12 12 13 13 12 11 11 11 11 11 12 13 14 15 14 14 13 12 11 10 11 12 12 13 13 13 13 13 13 13 14 14 15 15 15 14 14 14 14 14 14 14 14 14 14 13 13
591 13 13 13 13 14 15 15 14 14 14 15 15 15 15 16 17 16 16 15 15 15 16 15 14 14 13 14 14 14 14 14 14 13 13 13 13 14 14 14 14 14 14 14 14 14 15 15 14 13 12 12 12 13 13 13 14 14 14 13 12 13 13 13 15 16 15 15 15 14 14 14 14
584 14 13 13 13 12 12 13 13 13 13 13 14 14 14 15 15 15 15 15 14 14 15 14 13 12 13 13 12 12 12 11 11 11 10 10 10 11 12 13 13 13 13 14 14 14 14 14 14 13 12 12 12 11 12 13 13 13 13 13 14 14 14 14 14 14 14 14 13 13 12 12 12
576 12 13 14 13 12 12 13 13 12 11 11 12 12 12 12 12 12 12 12 13 13 14 14 14 14 13 13 13 13 12 12 11 11 12 12 12 12 12 13 13 14 13 13 14 14 14 14 14 14 13 12 12 12 12 12 12 12 13 13 12 13 13 13 13 13 13 12 12 12 12 13 13
569 13 13 13 12 11 10 10 10 10 10 10 11 11 10 10 11 11 11 12 12 11 12 12 12 11 10 10 10 11 12 13 13 13 14 14 13 12 11 12 12 12 11 11 10 10 11 12 13 13 14 13 12 11 12 12 12 12 11 11 11 12 12 11 11 11 11 12 12 12 12 11 11
561 11 12 11 11 11 11 12 11 11 12 12 13 13 13 12 12 11 10 10 10 10 11 11 11 11 9 8 9 9 9 10 10 11 12 13 12 12 12 11 11 11 12 12 12 12 11 11 10 10 9 9 10 10 11 12 13 13 12 12 12 13 13 12 12 12 12 11 11 11 11 10 10
554 10 11 12 12 12 11 10 11 12 12 12 13 12 12 12 11 11 11 11 11 11 11 10 10 10 11 11 11 11 11 11 11 12 13 13 13 13 13 12 12 12 11 11 11 10 10 10 10 10 11 12 12 12 12 11 12 12 12 12 12 12 11 10 9 8 9 10 11 11 11 11 10
546 10 10 10 11 11 11 12 12 11 10 10 10 10 10 10 11 11 11 11 11 11 11 11 11 10 10 10 10 11 11 11 11 12 12 12 11 10 11 11 11 10 10 10 10 11 11 11 11 11 11 11 10 10 10 10 10 10 11 11 12 12 12 12 13 13 13 12 11 11 11 12 13
$$ packed form
599A5j%%%K%%j%jj%%jJ%%%%%jj%J%%J%jj%%%%JJJJj%jjjjJJ%J%%%%%%J%J%%j%%%%%%%%%j%
591A3%%%JJ%j%%J%%%JJj%j%%Jjj%jJ%%%%%j%%%J%%%%%%%%J%jjj%%J%%J%%jjJ%%KJj%%j%%%
584A4j%%j%J%%%%J%%J%%%%j%JjjjJ%j%%j%%j%%JJJ%%%J%%%%%jj%%jJJ%%%%J%%%%%%%j%j%%
576A2JJjj%J%jj%J%%%%%%%J%J%%%j%%%j%j%J%%%%J%Jj%J%%%%%jj%%%%%%J%jJ%%%%%j%%%J%
569A3%%jjj%%%%%J%j%J%%J%jJ%%jj%%JJJ%%J%jjjJ%%j%j%JJJ%JjjjJ%%%j%%J%j%%%J%%%j%
561A1Jj%%%Jj%J%J%%j%jj%%%J%%%kjJ%%J%JJJj%%j%%J%%%j%j%j%J%JJJ%j%%J%j%%%j%%%j%
554A0JJ%%jjJJ%%Jj%%j%%%%%%j%%J%%%%%%JJ%%%%j%%j%%j%%%%JJ%%%jJ%%%%%jjjjJJJ%%%j
546A0%%J%%J%jj%%%%%J%%%%%%%%j%%%J%%%J%%jjJ%%j%%%J%%%%%%j%%%%%J%J%%%J%%jj%%JJ
$$ plain form
539 13 13 13 12 12 12 11 11 11 10 11 11 11 11 11 11 11 11 11 11 10 11 12 12 12 12 11 12 12 12 12 11 12 11 11 11 10 10 9 10 10 11 13 13 13 12 11 12 13 14 14 13 12 11 11 11 11 11 11 11 11 11 11 11 11 11 10 10 11 11 10 10
531 10 10 10 11 11 11 11 11 12 12 11 10 11 11 12 12 12 12 11 10 10 10 10 10 10 9 9 9 10 11 11 11 10 9 10 10 9 9 9 9 10 10 10 9 9 9 9 9 10 10 10 10 10 10 11 11 11 11 11 11 11 11 11 11 11 11 10 9 8 7 8 8
524 8 8 8 8 7 8 8 9 9 10 10 10 9 8 9 10 9 9 9 9 9 10 10 11 11 11 11 11 10 10 10 10 10 11 11 11 12 11 12 11 11 11 11 11 11 11 11 11 10 11 11 12 12 13 12 12 11 11 11 12 12 11 10 9 10 10 10 11 11 12 12 12 12
516 12 12 12 12 12 12 10 10 11 12 12 11 11 11 10 10 10 10 10 10 10 9 9 9 10 10 11 11 12 11 11 11 10 10 11 11 11 11 10 10 11 10 11 11 10 10 10 10 10 10 9 9 10 11 10 10 10 11 11 11 11 11 12 12 12 11 11 11 11 11 10 9
509 9 9 9 10 10 10 10 10 10 10 11 11 12 13 12 12 11 11 11 13 13 11 10 10 11 11 11 11 11 11 11 11 11 11 11 10 10 10 10 10 10 11 12 12 12 12 11 10 10 9 9 8 9 10 10 10 10 11 11 12 12 11 11 11 11 10 10 9 10 11 11 11 10
501 10 10 10 11 11 11 10 10 9 9 10 10 10 10 9 9 9 9 10 11 11 11 12 12 12 12 12 12 12 13 12 12 12 12 11 10 10 11 11 12 12 12 12 13 12 11 12 12 12 12 11 11 11 11 10 10 10 11 11 12 12 12 12 12 12 12 11 10 11 11 11 12
493 12 13 13 12 12 12 12 13 12 10 9 10 11 10 10 9 9 9 9 9 9 9 10 9 9 10 10 11 11 10 9 9 9 10 11 11 11 11 10 10 9 10 10 10 10 10 10 11 11 11 10 11 11 11 12 12 12 12 12 13 13 12 11 10 9 9 9 10 10 11 11 12
486 12 12 12 11 10 9 9 10 11 12 12 12 12 12 12 11 10 10 10 10 11 12 11 10 9 9 10 10 10 10 10 10 10 10 11 11 11 11 11 12 12 13 12 11 11 11 11 12 11 10 11 11 11 11 11 11 11 10 9 9 10 11 11 10 10 11 11 11 12 13 12 12
$$ packed form
539A3%%j%%j%%jJ%%%%%%%%%jJJ%%%jJ%%%jJj%%j%jJ%JK%%jjJJJ%jjj%%%%%%%%%%%%j%J%j%
531A0%%J%%%%J%jjJ%J%%%jj%%%%%j%%JJ%%jjJ%j%%%J%%j%%%%J%%%%%J%%%%%%%%%%%jjjjJ%
524H%%%jJ%J%J%%jjJJj%%%%J%J%%%%j%%%%J%%JjJj%%%%%%%%jJ%J%Jj%j%%J%jjjJ%%J%J%%%
516A2%%%%%k%JJ%j%%j%%%%%%j%%J%J%Jj%%j%J%%%j%JjJ%j%%%%%j%JJj%%J%%%%J%%j%%%%jj
509I%%J%%%%%%J%JJj%j%%K%kj%J%%%%%%%%%%j%%%%%JJ%%%jj%j%jJJ%%%J%J%j%%%j%jJJ%%j
501A0%%J%%j%j%J%%%j%%%JJ%%J%%%%%%Jj%%%jj%J%J%%%JjjJ%%%j%%%j%%J%J%%%%%%jjJ%%J
493A2J%j%%%JjkjJJj%j%%%%%%Jj%J%J%jj%%JJ%%%j%jJ%%%%%J%%jJ%%J%%%%J%jjjj%%J%J%J
486A2%%jjj%JJJ%%%%%jj%%%JJjjj%J%%%%%%%J%%%%J%Jjj%%%JjjJ%%%%%%jj%JJ%j%J%%JJj%
$$ plain form
478 12 12 12 11 10 10 10 11 11 11 11 11 10 10 10 9 9 9 10 10 11 11 11 12 12 11 11 11 11 11 12 12 13 12 12 12 12 13 13 13 12 11 10 10 9 10 10 10 11 10 10 10 11 11 11 12 12 12 12 12 12 12 12 11 11 11 10 10 10 10 11 10
471 10 10 11 11 12 13 13 13 12 11 11 10 10 10 11 11 11 10 10 10 11 12 12 12 11 11 10 9 9 9 9 9 8 8 8 9 9 9 9 10 10 10 10 10 10 11 11 10 11 12 12 12 12 12 11 11 10 11 10 10 9 10 11 12 11 11 11 12 12 10 10 11
463 11 12 12 12 11 11 11 11 11 11 11 12 12 12 12 12 13 13 13 13 12 12 11 11 10 11 11 10 10 10 10 11 11 11 12 12 12 11 10 11 11 10 10 9 9 9 10 10 9 9 9 10 10 11 12 11 11 11 11 11 10 8 9 10 10 10 10 10 10 10 10 11
456 11 11 10 10 10 11 10 10 11 11 11 11 11 11 12 11 12 13 12 12 12 12 11 11 11 11 11 11 11 11 11 11 11 11 11 12 12 11 10 9 10 10 9 10 10 10 11 10 10 10 10 11 12 12 12 12 12 12 12 12 12 12 12 12 11 11 11 11 10 10 10 11
448 11 11 11 11 11 11 10 10 10 11 10 10 10 10 9 9 9 9 10 11 11 11 11 12 11 11 10 11 12 11 11 10 10 10 10 10 10 11 13 13 13 13 12 12 11 9 9 9 10 10 11 10 10 10 9 10 11 12 12 12 11 10 9 9 9 9 9 9 9 9 8 9
441 9 9 10 10 10 10 10 10 9 8 7 8 9 10 10 10 10 10 9 9 9 9 9 9 9 9 9 9 9 9 10 11 11 10 10 10 10 10 10 10 11 11 10 10 10 10 10 9 10 10 11 11 11 11 11 10 11 12 12 12 11 11 11 11 11 11 11 11 12 13 14 14 14
433 14 13 12 11 10 11 11 11 11 11 12 13 13 12 11 11 11 10 9 9 9 10 11 11 11 11 12 12 11 11 10 11 11 11 11 11 11 11 12 11 11 11 10 10 10 10 10 10 10 11 10 10 11 11 12 13 12 11 11 11 10 10 10 10 10 11 11 11 10 10 10 10
426 10 10 10 10 10 10 10 11 11 11 11 10 10 10 10 10 11 11 12 12 11 11 11 11 10 9 8 8 8 8 8 8 10 11 11 11 10 9 9 9 9 10 11 11 10 9 9 8 7 8 9 9 8 9 9 9 10 10 11 10 10 10 10 10 10 10 10 11 12 13 13 12
$$ packed form
478A2%%jj%%J%%%%j%%j%%J%J%%J%j%%%%J%Jj%%%J%%jjj%jJ%%Jj%%J%%J%%%%%%%j%%j%%%Jj
471A0%J%JJ%%jj%j%%J%%j%%JJ%%j%jj%%%%j%%J%%%J%%%%%J%jJJ%%%%j%jJj%jJJJj%%J%k%J
463A1J%%j%%%%%%J%%%%J%%%j%j%jJ%j%%%J%%J%%jjJ%j%j%%J%j%%J%JJj%%%%jkJJ%%%%%%%J
456A1%j%%Jj%J%%%%%JjJJj%%%j%%%%%%%%%%%%J%jjjJ%jJ%%Jj%%%JJ%%%%%%%%%%%j%%%j%%J
448A1%%%%%j%%Jj%%%j%%%JJ%%%Jj%jJJj%j%%%%%JK%%%j%jk%%J%Jj%%jJJJ%%jjj%%%%%%%jJ
441I%J%%%%%jjjJJJ%%%%j%%%%%%%%%%%JJ%j%%%%%%J%j%%%%jJ%J%%%%jJJ%%j%%%%%%%JJJ%%
433A4jjjjJ%%%%JJ%jj%%jj%%JJ%%%J%j%jJ%%%%%%Jj%%j%%%%%%Jj%J%JJjj%%j%%%%J%%j%%%
426A0%%%%%%J%%%j%%%%J%J%j%%%jjj%%%%%KJ%%jj%%%JJ%jj%jjJJ%jJ%%J%Jj%%%%%%%JJJ%j
$$ plain form
418 12 12 11 10 9 9 10 10 10 10 10 10 10 11 11 10 9 9 9 9 9 9 10 10 11 12 12 12 11 10 10 9 10 10 10 11 11 11 11 11 10 10 9 9 9 10 10 11 10 10 10 9 10 10 10 10 10 11 10 9 9 9 11 11 10 10 11 12 12 12 12 11
411 11 12 12 12 11 11 11 10 11 12 13 13 13 12 11 10 10 11 11 11 10 10 10 10 11 12 11 10 10 10 10 9 10 11 11 11 11 12 11 11 11 11 11 11 10 10 10 10 11 11 10 10 10 10 11 11 11 10 10 10 9 9 8 8 7 9 10 9 9 10 10 10
403 10 10 10 10 10 10 9 9 9 9 9 9 9 9 10 10 10 11 12 12 11 11 10 10 10 10 10 10 10 10 9 8 9 9 11 11 10 10 11 11 12 12 11 11 11 11 11 11 11 11 10 10 10 11 11 11 9 9 10 10 11 11 10 11 10 10 11 11 11 11 12 12
395 12 10 10 10 11 11 11 10 10 10 11 11 10 10 10 10 11 12 12 11 11 10 10 10 11 11 11 10 11 11 11 10 10 10 10 10 10 10 11 11 11 11 12 12 11 11 11 11 10 10 10 11 11 12 12 13 13 13 13 12 11 11 12 12 12 10 9 9 10 10 10 11
388 11 10 10 9 9 10 11 11 10 10 10 10 9 9 8 9 9 10 11 11 10 10 11 11 11 11 11 11 10 9 9 10 10 10 10 10 11 11 11 11 11 11 12 11 10 10 11 12 12 11 11 11 11 11 11 10 10 10 10 10 11 12 12 12 12 11 11 11 10 10 10 10
380 10 10 10 10 10 10 10 9 9 9 9 10 11 12 12 11 10 10 10 11 12 12 12 12 12 11 10 10 10 11 11 12 12 12 11 11 10 10 12 13 13 12 10 10 10 10 10 9 9 9 9 10 9 9 10 10 10 10 10 11 11 11 12 12 11 11 11 11 11 10 10 10
373 10 10 10 10 10 9 9 8 9 10 10 10 11 12 12 12 12 12 11 10 10 10 10 10 9 10 11 12 12 12 12 11 11 11 11 11 10 10 10 10 10 10 11 11 11 11 10 10 9 9 10 11 11 12 12 12 11 10 11 11 12 12 11 11 10 9 9 9 10 10 9 7
365 7 8 9 10 10 11 12 11 10 10 10 10 9 10 11 11 10 11 12 11 11 11 10 10 9 10 10 10 10 10 9 10 9 9 9 10 10 10 10 11 11 11 11 11 11 11 11 11 11 10 10 10 11 11 11 11 11 10 10 11 11 11 10 10 10 10 11 10 10 10 10 11 12
$$ packed form
418A2%jjj%J%%%%%%J%jj%%%%%J%JJ%%jj%jJ%%J%%%%j%j%%J%Jj%%jJ%%%%Jjj%%K%j%JJ%%%j
411A1J%%j%%jJJJ%%jjj%J%%j%%%JJjj%%%jJJ%%%Jj%%%%%j%%%J%j%%%J%%j%%j%j%jKJj%J%%
403A0%%%%%j%%%%%%%J%%JJ%j%j%%%%%%%jjJ%K%j%J%J%j%%%%%%%j%%J%%k%J%J%jJj%J%%%J%
395A2k%%J%%j%%J%j%%%JJ%j%j%%J%%jJ%%j%%%%%%J%%%J%j%%%j%%J%J%J%%%jj%J%%kj%J%%J
388A1j%j%JJ%j%%%j%jJ%JJ%j%J%%%%%jj%J%%%%J%%%%%Jjj%JJ%j%%%%%j%%%%JJ%%%j%%j%%%
380A0%%%%%%j%%%JJJ%jj%%JJ%%%%jj%%J%J%%j%j%KJ%jk%%%%j%%%Jj%J%%%%J%%J%j%%%%j%%
373A0%%%%j%jJJ%%JJ%%%%jj%%%%jJJJ%%%j%%%%j%%%%%J%%%j%j%JJ%J%%jjJ%J%j%jj%%J%jk
365GJJJ%JJjj%%%jJJ%jJJj%%j%jJ%%%%jJj%%J%%%J%%%%%%%%%j%%J%%%%j%J%%j%%%Jj%%%JJ
$$ plain form
358 12 12 11 10 10 11 11 11 11 11 11 11 11 11 11 11 11 11 10 10 10 10 9 9 8 9 10 10 10 8 7 8 9 9 9 8 9 10 10 10 10 10 10 10 10 9 9 9 9 8 8 8 7 7 7 8 9 9 9 9 10 10 11 11 10 11 12 12 12 12 11 12
350 12 12 12 11 11 11 11 11 11 11 11 11 10 10 10 10 10 11 11 11 10 9 9 9 10 10 10 10 10 10 10 9 9 8 8 8 7 7 8 9 9 9 10 10 10 9 9 9 9 10 11 11 12 11 11 11 11 11 12 12 12 11 11 11 10 10 10 10 10 10 11 11
343 11 10 10 10 9 9 9 9 9 9 10 11 11 11 11 11 11 11 10 10 10 10 12 12 12 11 9 10 10 10 10 9 9 9 10 10 11 11 11 11 11 10 10 11 12 12 12 13 13 12 11 11 11 11 10 10 11 12 13 13 12 12 11 11 11 11 11 10 9 8 8 8
335 8 9 10 10 9 10 10 10 10 10 9 10 11 11 12 12 11 11 11 11 11 11 11 11 11 11 11 11 11 11 11 11 10 10 10 10 10 10 10 10 9 9 9 9 10 10 9 9 9 9 9 9 10 10 10 9 9 9 8 8 9 10 10 10 11 11 11 11 11 11 11 12 11
328 11 11 11 11 12 12 12 11 11 10 10 9 10 9 9 10 10 9 9 10 10 10 10 9 10 10 10 10 10 10 10 10 10 10 10 11 11 10 10 10 11 11 10 10 10 11 11 10 11 10 10 9 9 10 9 8 9 9 10 11 11 10 11 11 11 11 11 11 11 11 10 10
320 10 10 10 10 10 11 11 11 11 11 11 11 11 12 11 10 10 10 10 11 11 11 11 10 9 9 10 10 9 10 11 11 10 10 10 10 10 9 9 10 10 11 11 12 12 12 12 13 13 12 11 11 11 11 11 10 9 10 10 12 13 13 12 12 12 12 12 11 11 11 10 11
312 11 11 9 9 9 9 10 10 10 10 10 9 9 9 10 11 11 11 11 11 11 10 11 12 12 11 10 10 10 10 10 9 9 9 9 9 9 10 10 10 10 10 9 10 11 10 10 11 11 11 10 10 9 9 8 8 8 8 8 8 9 10 10 11 11 10 10 10 10 10 9 8
305 8 9 9 10 10 10 9 9 9 7 8 8 8 8 8 9 9 8 8 8 8 8 8 8 8 8 9 9 9 9 10 10 10 10 10 10 10 10 10 10 10 10 10 10 10 10 10 10 10 10 11 10 10 9 9 8 9 10 10 10 9 10 9 8 9 10 10 10 10 10 11 12 12
$$ packed form
358A2%jj%J%%%%%%%%%%%%j%%%j%jJJ%%kjJJ%%jJJ%%%%%%%j%%%j%%j%%JJ%%%J%J%jJJ%%%jJ
350A2%%j%%%%%%%%j%%%%J%%jj%%J%%%%%%j%j%%j%JJ%%J%%j%%%JJ%Jj%%%%J%%j%%j%%%%%J%
343A1j%%j%%%%%JJ%%%%%%j%%%K%%jkJ%%%j%%J%J%%%%j%JJ%%J%jj%%%j%JJJ%j%j%%%%jjj%%
335HJJ%jJ%%%%jJJ%J%j%%%%%%%%%%%%%%%j%%%%%%%j%%%J%j%%%%%J%%j%%j%JJ%%J%%%%%%Jj
328A1%%%J%%j%j%jJj%J%j%J%%%jJ%%%%%%%%%%J%j%%J%j%%J%jJj%j%JjjJ%JJ%jJ%%%%%%%j%
320A0%%%%J%%%%%%%Jjj%%%J%%%jj%J%jJJ%j%%%%j%J%J%J%%%J%jj%%%%jjJ%KJ%j%%%%j%%jJ
312A1%k%%%J%%%%j%%JJ%%%%%jJJ%jj%%%%j%%%%%J%%%%jJJj%J%%j%j%j%%%%%JJ%J%j%%%%jj
305HJ%J%%j%%kJ%%%%J%j%%%%%%%%J%%%J%%%%%%%%%%%%%%%%%%%Jj%j%jJJ%%jJjjJJ%%%%JJ%
$$ plain form
297 12 12 12 11 11 11 11 11 10 11 11 11 10 10 10 9 9 9 10 10 10 10 10 11 10 10 10 10 9 9 10 10 10 10 9 8 8 8 8 8 8 8 8 8 8 9 9 10 10 9 9 8 8 8 8 9 9 9 10 11 11 11 11 11 10 9 8 9 10 10 11 11
290 11 11 11 11 11 11 11 10 9 9 9 10 10 10 10 10 10 10 10 11 11 11 11 10 10 10 11 11 11 10 10 9 9 9 9 9 10 10 9 8 9 10 9 9 8 8 8 8 8 7 8 9 9 10 10 9 10 9 8 8 9 10 11 11 10 10 10 10 11 12 12 12
282 12 11 10 10 11 10 10 9 8 9 10 10 10 10 11 11 12 13 13 13 13 13 12 11 11 11 11 11 11 11 11 11 10 9 9 9 10 10 10 11 11 11 11 12 12 13 13 12 11 10 10 11 11 11 10 10 10 10 9 9 9 11 12 12 11 11 10 11 11 11 11 10
275 10 9 10 10 10 10 10 10 10 10 11 12 12 12 11 11 11 11 11 11 11 10 10 10 10 10 10 10 11 11 12 12 12 13 13 12 11 10 10 10 10 10 10 10 10 10 10 9 10 10 10 10 9 9 10 10 10 10 10 10 10 10 11 9 9 10 11 11 10 10 10 9
267 9 9 10 9 9 9 9 9 10 12 13 13 13 12 11 11 11 11 10 10 10 10 11 11 11 10 10 10 10 10 11 11 12 12 12 12 11 10 10 11 10 10 10 10 10 11 11 10 10 10 10 10 11 12 11 11 11 11 11 10 10 11 11 11 11 10 9 9 9 9 10 11 10
260 10 10 11 11 10 10 9 8 8 9 9 9 10 9 9 10 10 11 12 12 12 12 12 11 11 11 11 10 10 10 10 10 9 9 9 9 9 10 11 11 10 10 10 10 9 9 9 9 9 10 9 9 9 8 8 9 9 9 9 9 8 8 8 8 9 9 9 9 9 10 10 10
252 10 10 10 9 9 9 9 10 10 10 10 10 10 10 11 12 12 11 10 10 10 10 10 9 9 10 10 10 9 9 11 11 11 11 10 10 10 10 10 10 10 9 8 8 8 9 9 9 10 10 10 10 10 10 10 10 10 10 10 11 11 12 12 11 10 10 10 11 11 11 11 11
245 11 11 11 11 12 12 12 11 11 10 9 9 10 11 11 11 11 11 11 11 10 11 10 9 10 9 9 9 9 10 10 10 11 12 11 11 11 10 10 11 11 10 10 10 10 9 9 9 10 10 10 11 12 12 11 10 10 11 12 12 10 9 10 10 11 10 10 11 11 12 12 12
$$ packed form
297A2%%j%%%%jJ%%j%%j%%J%%%%Jj%%%j%J%%%jj%%%%%%%%%J%J%j%j%%%J%%JJ%%%%jjjJJ%J%
290A1%%%%%%jj%%J%%%%%%%J%%%j%%J%%j%j%%%%J%jjJJj%j%%%%jJJ%J%jJjj%JJJ%j%%%JJ%%
282A2jj%Jj%jjJJ%%%J%JJ%%%%jj%%%%%%%%jj%%J%%J%%%J%J%jjj%J%%j%%%j%%KJ%j%jJ%%%j
275A0jJ%%%%%%%JJ%%j%%%%%%j%%%%%%J%J%%J%jjj%%%%%%%%%jJ%%%j%J%%%%%%%Jk%JJ%j%%j
267I%Jj%%%%JKJ%%jj%%%j%%%J%%j%%%%J%J%%%jj%Jj%%%%J%j%%%%JJj%%%%j%J%%%jj%%%JJj
260A0%J%j%jj%J%%Jj%J%JJ%%%%j%%%j%%%%j%%%%JJ%j%%%j%%%%Jj%%j%J%%%%j%%%J%%%%J%%
252A0%%j%%%J%%%%%%JJ%jj%%%%j%J%%j%K%%%j%%%%%%jj%%J%%J%%%%%%%%%%J%J%jj%%J%%%%
245A1%%%J%%j%jj%JJ%%%%%%jJjjJj%%%J%%JJj%%j%J%j%%%j%%J%%JJ%jj%JJ%kjJ%Jj%J%J%%
$$ plain form
237 12 13 12 12 11 11 11 11 11 11 12 12 11 10 9 9 9 9 9 10 10 10 11 11 11 11 11 12 12 12 12 12 12 11 11 12 12 12 12 12 11 10 10 10 10 11 10 10 9 9 9 10 10 9 9 9 9 8 8 9 9 8 8 8 8 9 9 9 10 10 10 10
230 10 10 10 9 9 9 9 8 7 8 8 9 9 10 10 11 12 11 11 11 11 11 11 11 11 11 12 11 11 10 9 9 10 11 12 13 13 12 11 11 12 12 10 9 9 9 9 9 10 10 9 9 9 10 10 10 10 11 11 11 11 12 13 13 14 14 14 13 12 12 11 10
222 10 10 10 10 10 11 11 11 10 9 9 10 10 10 10 9 10 10 8 7 7 7 7 7 8 9 9 10 10 10 9 10 11 12 12 12 12 11 12 12 12 12 11 11 11 11 11 10 10 10 10 10 10 10 9 9 8 8 8 8 8 8 8 8 10 11 12 12 12 12 11 11
214 11 11 12 12 11 11 11 11 11 11 12 12 13 12 10 10 9 8 8 9 10 11 11 11 11 10 10 10 10 10 9 9 9 10 11 12 12 12 12 12 12 12 11 11 11 11 10 10 9 9 9 10 10 11 12 12 12 11 10 10 10 10 9 8 8 8 9 9 10 10 10 10
207 10 9 9 9 10 10 10 11 11 10 10 10 10 11 11 11 11 11 11 11 10 10 9 9 9 9 9 10 10 10 11 11 11 10 10 10 10 10 9 10 10 11 11 11 12 12 12 12 12 12 12 11 11 12 12 11 11 10 10 11 12 11 10 10 10 10 11 11 11 12 12 13
199 13 13 13 13 12 12 12 12 11 11 11 12 11 10 9 9 9 9 10 11 12 13 13 13 13 12 12 12 11 11 11 11 11 10 9 8 7 7 7 8 8 8 8 8 8 8 9 10 10 10 10 11 11 11 11 10 10 9 9 10 11 11 12 12 13 12 12 12 12 12 13 12
192 12 12 12 12 11 9 9 9 10 10 9 9 9 8 9 9 10 11 11 11 11 11 10 11 12 12 13 12 11 11 11 11 11 10 10 9 8 8 8 9 9 9 10 10 10 10 10 10 10 10 10 10 9 9 8 7 8 8 9 10 11 12 12 12 12 12 11 11 11 10 10 9
184 9 9 8 9 9 10 11 11 11 11 11 11 11 11 10 10 10 10 10 10 10 10 10 10 9 9 8 8 9 10 10 9 9 10 10 10 10 10 10 10 9 9 9 9 10 11 11 11 11 11 11 10 10 10 11 11 11 11 11 11 11 11 11 10 9 10 10 10 10 10 11 11 11
$$ packed form
237A2Jj%j%%%%%J%jjj%%%%J%%J%%%%J%%%%%j%J%%%%jj%%%Jj%j%%J%j%%%j%J%j%%%J%%J%%%
230A0%%j%%%jjJ%J%J%JJj%%%%%%%%Jj%jj%JJJJ%jj%J%kj%%%%J%j%%J%%%J%%%JJ%J%%jj%jj
222A0%%%%J%%jj%J%%%jJ%kj%%%%JJ%J%%jJJJ%%%jJ%%%j%%%%j%%%%%%j%j%%%%%%%KJJ%%%j%
214A1%J%j%%%%%J%Jjk%jj%JJJ%%%j%%%%j%%JJJ%%%%%%j%%%j%j%%J%JJ%%jj%%%jj%%J%J%%%
207A0j%%J%%J%j%%%J%%%%%%j%j%%%%J%%J%%j%%%%jJ%J%%J%%%%%%j%J%j%j%JJjj%%%J%%J%J
199A3%%%j%%%j%%Jjjj%%%JJJJ%%%j%%j%%%%jjjj%%J%%%%%%JJ%%%J%%%j%j%JJ%J%Jj%%%%Jj
192A2%%%jk%%J%j%%jJ%JJ%%%%jJJ%Jjj%%%%j%jj%%J%%J%%%%%%%%%j%jjJ%JJJJ%%%%j%%j%j
184I%jJ%JJ%%%%%%%j%%%%%%%%%j%j%JJ%j%J%%%%%%j%%%JJ%%%%%j%%J%%%%%%%%jjJ%%%%J%%
$$ plain form
177 11 11 11 10 10 9 9 9 9 9 9 10 11 11 12 12 11 11 11 10 9 9 8 8 8 8 9 9 10 11 11 11 11 10 9 9 8 9 9 9 9 9 9 10 10 11 11 11 12 12 12 11 11 10 9 9 11 12 12 11 11 10 9 10 11 11 12 12 12 12 12 11
169 11 11 11 11 11 10 11 11 11 11 11 10 10 11 10 10 10 10 10 11 10 10 10 9 9 8 8 9 9 9 9 9 9 10 10 11 11 11 10 10 10 11 11 11 10 10 10 10 10 11 11 12 11 11 11 11 11 11 11 11 11 10 10 10 10 11 11 12 10 9 9 9
162 9 10 10 10 10 10 11 12 11 11 11 10 10 10 9 10 11 12 12 11 11 11 12 11 10 10 10 11 11 10 10 10 11 11 10 11 11 11 11 10 10 9 9 9 10 10 9 9 9 9 10 10 10 10 10 10 9 9 9 9 9 9 10 10 11 11 12 11 11 10 9 8 7
154 7 7 8 9 9 9 10 10 10 10 10 10 11 11 10 10 10 10 10 10 10 10 9 9 9 9 9 10 11 11 12 11 11 10 10 10 9 8 8 8 8 9 9 10 11 11 11 10 9 9 9 9 10 10 11 11 11 11 11 10 10 10 9 9 9 9 10 10 11 11 10 10 10
146 10 9 9 9 10 10 10 10 9 10 10 10 9 9 9 10 10 9 9 9 9 10 10 11 11 11 10 10 10 11 11 10 9 10 10 10 11 11 10 10 11 10 10 11 11 11 11 12 12 11 11 10 11 11 11 11 10 10 10 10 10 9 10 10 10 11 11 11 11 11 11 11
139 11 10 10 11 11 11 11 11 11 11 11 11 11 11 11 11 11 10 10 9 8 9 10 11 12 11 10 9 9 9 9 9 10 11 11 11 10 10 10 9 10 11 11 12 12 11 10 10 10 10 10 11 12 12 13 12 11 11 11 12 12 11 11 11 11 11 11 11 11 10 11 11
131 11 11 11 10 10 10 10 10 10 10 11 11 10 10 10 10 9 9 9 10 10 9 9 9 10 9 9 9 8 9 9 10 11 11 11 11 11 11 11 11 9 8 9 9 9 9 10 10 9 9 9 9 9 10 10 11 12 12 12 11 12 13 13 12 10 10 11 12 13 14 13 13
124 13 13 12 12 12 11 11 12 12 11 11 11 11 11 12 12 11 11 12 12 12 11 11 12 12 12 11 11 11 10 11 11 11 12 12 12 11 10 10 10 10 10 10 9 8 8 9 9 9 9 9 9 8 7 7 6 7 8 8 9 9 8 8 8 8 9 9 9 9 8 8 7
$$ packed form
177A1%%j%j%%%%%JJ%J%j%%jj%j%%%J%JJ%%%jj%jJ%%%%%J%J%%J%%j%jj%KJ%j%jjJJ%J%%%%j
169A1%%%%jJ%%%%j%Jj%%%%Jj%%j%j%J%%%%%J%J%%j%%J%%j%%%%J%Jj%%%%%%%%j%%%J%Jkj%%
162IJ%%%%JJj%%j%%jJJJ%j%%Jjj%%J%j%%J%jJ%%%j%j%%J%j%%%J%%%%%j%%%%%J%J%Jj%jjjj
154G%JJ%%J%%%%%J%j%%%%%%%j%%%%JJ%Jj%j%%jj%%%J%JJ%%jj%%%J%J%%%%j%%j%%%J%J%j%%
146A0j%%J%%%jJ%%j%%J%j%%%J%J%%j%%J%jjJ%%J%j%Jj%J%%%J%j%jJ%%%j%%%%jJ%%J%%%%%%
139A1j%J%%%%%%%%%%%%%j%jjJJJJjjj%%%%JJ%%j%%jJJ%J%jj%%%%JJ%Jjj%%J%j%%%%%%%jJ%
131A1%%j%%%%%%J%j%%%j%%J%j%%Jj%%jJ%JJ%%%%%%%kjJ%%%J%j%%%%J%JJ%%jJJ%jk%JJJJj%
124A3%j%%j%J%j%%%%J%j%J%%j%J%%j%%jJ%%J%%jj%%%%%jj%J%%%%%jj%jJJ%J%j%%%J%%%j%j
$$ plain form
116 7 7 7 8 9 9 9 9 10 10 9 9 9 9 10 9 9 9 9 8 8 8 9 11 11 10 11 12 12 12 12 12 12 12 12 12 12 12 12 12 11 12 12 11 11 11 11 11 11 11 11 11 10 10 9 9 10 10 10 9 9 9 9 9 9 9 9 9 9 10 10 10 11
109 11 11 11 11 11 11 11 11 11 11 11 12 12 12 12 11 11 11 11 12 12 11 11 10 10 9 9 9 10 11 11 12 12 12 12 11 11 10 9 10 10 9 9 8 7 8 9 9 10 11 11 10 10 10 11 12 12 11 10 10 9 10 10 10 10 10 11 10 10 10 11 11
101 11 11 11 11 11 10 10 10 10 10 10 10 9 8 8 8 10 11 11 11 11 11 10 10 11 12 12 12 12 12 12 12 12 13 13 13 13 13 13 12 12 11 11 10 11 12 12 12 12 12 11 11 10 10 10 9 9 9 9 10 10 11 11 12 11 11 11 11 11 11 12 12
94 12 11 11 11 11 11 11 11 11 12 12 11 10 11 11 12 13 12 11 11 12 11 11 10 9 8 9 9 10 10 9 9 9 9 9 9 10 10 10 10 10 10 10 10 10 10 9 9 10 11 11 11 10 10 10 10 10 10 10 10 10 9 8 7 7 8 9 9 9 10 10 10 10
86 10 10 11 10 10 10 10 9 9 9 9 10 10 10 10 10 10 10 10 10 10 11 12 13 12 11 10 10 9 9 9 10 11 11 11 11 11 11 11 11 11 10 9 9 9 9 9 9 8 9 9 9 10 10 9 9 10 10 11 10 10 10 11 11 11 10 10 9 9 9 9 10 11
78 11 11 11 11 9 9 9 10 9 9 10 10 11 11 11 11 11 11 11 11 11 11 10 10 11 11 11 11 11 10 10 11 11 12 13 12 12 12 12 12 12 12 12 12 12 11 11 12 11 9 9 9 8 9 10 11 13 13 12 12 12 12 12 12 11 11 10 10 11 11 11 11 10
71 10 11 12 11 10 10 9 9 9 10 10 11 11 11 10 10 10 10 10 11 11 11 11 11 11 12 12 12 11 12 12 13 14 14 14 13 13 13 13 13 12 11 11 10 10 11 12 13 13 12 11 11 10 10 10 10 10 10 11 11 12 11 10 10 10 11 11 11 12 11 11 11 12
63 12 12 12 12 12 12 12 13 13 13 13 13 12 11 11 11 12 12 13 12 11 11 11 11 11 11 11 11 12 12 12 12 12 12 12 11 10 11 11 11 10 10 11 11 11 11 11 11 10 11 11 11 12 12 12 12 13 14 14 13 12 13 13 14 14 13 13 14 14 15 15 16 17
$$ packed form
116G%%JJ%%%J%j%%%Jj%%%j%%JK%jJJ%%%%%%%%%%%%jJ%j%%%%%%%%j%j%J%%j%%%%%%%%%J%%J
109A1%%%%%%%%%%J%%%j%%%J%j%j%j%%JJ%J%%%j%jjJ%j%jjJJ%JJ%j%%JJ%jj%jJ%%%%Jj%%J%
101A1%%%%j%%%%%%jj%%KJ%%%%j%JJ%%%%%%%J%%%%%j%j%jJJ%%%%j%j%%j%%%J%J%Jj%%%%%J%
94A2j%%%%%%%J%jjJ%JJjj%Jj%jjjJ%J%j%%%%%J%%%%%%%%%j%JJ%%j%%%%%%%%jjj%JJ%%J%%%
86A0%Jj%%%j%%%J%%%%%%%%%JJJjjj%j%%JJ%%%%%%%%jj%%%%%jJ%%J%j%J%Jj%%J%%j%j%%%JJ
78A1%%%k%%Jj%J%J%%%%%%%%%j%J%%%%j%J%JJj%%%%%%%%%j%Jjk%%jJJJK%j%%%%%j%j%J%%%j
71A0JJjj%j%%J%J%%j%%%%J%%%%%J%%jJ%JJ%%j%%%%jj%j%JJJ%jj%j%%%%%J%Jjj%%J%%Jj%%J
63A2%%%%%%J%%%%jj%%J%Jjj%%%%%%%J%%%%%%jjJ%%j%J%%%%%jJ%%J%%%JJ%jjJ%J%j%J%J%JJ
$$ plain form
56 17 16 16 16 15 15 15 15 15 16 16 16 16 16 17 17 17 17 17 18 18 18 18 19 20 20 20 21 21 23 24 26 27 29 30 32 35 38 41 44 49 54 59 65 71 80 89 99 110 121 133 144 156 166 172 171 163 153 141 128 116 104
49 104 92 82 72 63 56 50 45 41 37 34 31 27 25 23 22 22 21 19 18 18 18 17 17 16 17 18 19 20 20 19 18 17 16 15 14 14 14 13 13 14 13 13 12 12 12 12 13 12 11 11 11 11 10 11 11 11 11 11 11 12 12 12 11 11 11 12 11 11
42 11 11 12 12 12 12 12 11 10 10 10 10 10 10 11 11 12 12 12 12 11 10 10 10 10 10 11 10 9 9 10 10 10 10 10 10 12 12 11 11 11 11 10 10 9 9 9 9 10 10 11 11 11 11 12 12 11 11 11 10 10 10 10 10 10 10 10 10 10 11 11 11 11
34 11 11 11 10 10 10 10 9 10 10 11 11 11 11 11 11 11 11 10 10 10 10 11 11 11 11 11 11 10 10 10 11 11 11 11 11 10 10 9 8 8 9 10 10 10 11 11 11 10 10 11 12 12 12 12 12 12 12 11 10 9 9 10 10 10 11 10 9 8 8 8 9 8
27 8 8 8 8 9 9 10 10 10 9 8 8 9 10 11 11 10 10 10 10 10 10 10 10 10 10 10 10 10 11 11 12 11 10 10 10 10 9 9 9 9 8 9 9 9 9 9 9 9 9 10 11 11 10 10 10 11 10 10 10 10 10 10 10 11 12 11 11 11 11 11 10 10 10
19 10 11 11 12 12 12 11 11 10 10 10 10 10 10 10 10 10 10 10 11 11 11 11 11 11 10 11 11 11 12 12 12 11 11 11 10 10 10 11 11 11 11 11 10 10 11 11 12 12 12 12 12 12 12 13 13 13 13 13 13 12 12 11 11 10 10 10 10 11 10 10 11 11
11 11 10 11 10 11 11 10 10 10 11 11 10 9 9 9 9 8 9 9 10 10 10 10 9 9 9 9 9 8 7 7 7 8 8 8 9 10 10 9 9 9 10 11 10 10 9 8 8 9 10 10 11 12 11 10 10 9 9 9 9 10 9 8 9 9 11 11 11 11 11 12 11 11
4 11 10 10 11 11 12 12 12 12 11 11 10 11 11 10 9 9 10 10 9 10 10 10 10 10 9 9 9 10 9 9 8 9 8 8 8 9 10 10 9 8 7 7 8 8 8 9 10 9 9 9 9 10 10 10 9 9 9 9 10 11 10 9 10 11 10 10 10 10 10 9 9 10 10
$$ packed form
56A7j%%j%%%%J%%%%J%%%%J%%%JJ%%J%KJKJKJKLLLLNNNOORRJ0J1J1J2J1J2J0Ojqj0j2j3j2j2
49A04j2j0j0rponmmllmkkj%jkj%%j%jJJJJ%jjjjjj%%j%Jj%j%%%Jjj%%%jJ%%%%%J%%j%%Jj%
42A1%J%%%%jj%%%%%J%J%%%jj%%%%Jjj%J%%%%%K%j%%%j%j%%%J%J%%%J%j%%j%%%%%%%%%J%%%
34A1%%j%%%jJ%J%%%%%%%j%%%J%%%%%j%%J%%%%j%jj%JJ%%J%%j%JJ%%%%%%jjj%J%%Jjjj%%Jj
27H%%%J%J%%jj%JJJ%j%%%%%%%%%%%%J%Jjj%%%j%%%jJ%%%%%%%JJ%j%%Jj%%%%%%JJj%%%%j%%
19A0J%J%%j%j%%%%%%%%%%J%%%%%jJ%%J%%j%%j%%J%%%%j%J%J%%%%%%J%%%%%j%j%j%%%Jj%J%
11A1jJjJ%j%%J%jj%%%jJ%J%%%j%%%%jj%%J%%JJ%j%%JJj%jj%JJ%JJjj%j%%%JjjJ%K%%%%Jj%
4A1j%J%J%%%j%jJ%jj%J%jJ%%%%j%%Jj%jJj%%JJ%jjj%J%%JJj%%%J%%j%%%JJjjJJj%%%%j%J%
$$ plain form
-4 10 10 9 9 9 9 9 8 8 9 10 11 11 11 11 11 10 10 10 10 10 10 10 10 11 11 10 9 8 8 9 9 9 9 9 9 10 9 9 9 9 9 9 9 9 9 10 10 11 11 11 11 11 11 11 12 12 12 12 11 11 10 10 10 10 10 10 11 11 10 9 9 9
-12 9 9 9 9 8 8 9 11 11 11 11 10 10 11 11 11 11 9 8 8 8 8 8 8 9 10 10 10 10 10 11 11 11 12 11 11 10 9 9 10 9 9 9 8 9 10 10 11 11 11 11 11 11 12 11 10 9 10 11 11 11 10 9 9 10 10 11 11 11 11 10 10 9
-19 9 9 9 9 9 9 9 9 9 10 11 13 12 12 11 11 11 11 12 12 11 11 11 11 11 10 10 10 10 11 10 9 9 9 9 10 10 10 10 10 10 10 10 10 10 10 11 10 9 9 9 9 9 9 9 8 9 9 9 9 10 10 10 9 9 10 10 10 9 9 8 8 8
-27 8 9 9 10 10 9 9 9 10 10 9 9 9 9 9 9 8 8 8 8 8 8 9 10 10 10 9 8 9 9 9 9 9 9 8 8 9 10 10 10 9 9 9 9 9 9 8 7 7 8 9 9 9 9 8 8 9 10 10 10 11 11 10 9 9 9 9 9 9 9 10 10 11
-35 11 11 12 13 12 11 11 10 11 11 11 10 10 10 10 9 10 10 10 10 10 11 11 11 10 9 9 9 11 11 10 11 11 10 9 9 9 9 10 11 10 9 9 9 10 11 12 12 12 12 12 12 11 11 11 10 10 10 10 10 9 9 9 9 9 9 10 10 11 11 11 11
-42 11 11 10 10 10 10 9 8 9 10 10 10 10 9 8 8 8 9 9 10 10 10 10 10 10 9 8 8 8 9 9 9 9 9 8 8 8 8 9 9 10 10 10 10 11 11 11 11 12 12 11 10 11 11 12 12 11 10 9 8 9 10 10 10 9 9 9 9 10 10 10 9
-50 9 8 8 9 10 11 10 10 10 10 10 9 9 9 9 9 9 9 9 9 9 9 9 9 9 9 9 10 10 11 11 11 11 10 10 10 10 10 10 10 10 11 11 10 9 9 9 9 9 9 9 9 9 9 9 9 10 9 9 9 10 11 11 12 11 10 10 10 10 10 9 9 10
-57 10 10 10 9 9 10 9 9 10 10 10 10 10 10 10 10 9 9 8 8 8 9 9 10 11 11 11 11 10 11 11 11 10 11 11 11 11 11 11 11 10 9 9 9 8 8 8 8 8 8 8 8 8 9 10 10 9 10 10 9 9 9 9 9 10 10 10 10 11 11 11 11
$$ packed form
-4A0%j%%%%j%JJJ%%%%j%%%%%%%J%jjj%J%%%%%Jj%%%%%%%%J%J%%%%%%J%%%j%j%%%%%J%jj%%
-12I%%%j%JK%%%j%J%%%kj%%%%%JJ%%%%J%%Jj%jj%Jj%%jJJ%J%%%%%JjjjJJ%%jj%J%J%%%j%j
-19I%%%%%%%%JJKj%j%%%J%j%%%%j%%%Jjj%%%J%%%%%%%%%%Jjj%%%%%%jJ%%%J%%j%J%%j%j%%
-27HJ%J%j%%J%j%%%%%j%%%%%JJ%%jjJ%%%%%j%JJ%%j%%%%%jj%JJ%%%j%JJ%%J%jj%%%%%%J%J
-35A1%JJjj%jJ%%j%%%jJ%%%%J%%jj%%K%jJ%jj%%%JJjj%%JJJ%%%%%j%%j%%%%j%%%%%J%J%%%
-42A1%j%%%jjJJ%%%jj%%J%J%%%%%jj%%J%%%%j%%%J%J%%%J%%%J%jjJ%J%jjjjJJ%%j%%%J%%j
-50Ij%JJJj%%%%j%%%%%%%%%%%%%%%J%J%%%j%%%%%%%J%jj%%%%%%%%%%%Jj%%JJ%Jjj%%%%j%J
-57A0%%j%Jj%J%%%%%%%j%j%%J%JJ%%%jJ%%jJ%%%%%%jj%%j%%%%%%%%JJ%jJ%j%%%%J%%%J%%%
$$ plain form
-65 11 11 12 12 11 11 11 11 12 11 10 9 9 10 10 9 9 9 10 10 10 9 10 10 11 11 12 12 12 12 11 10 9 9 9 10 10 10 9 9 9 9 8 7 7 8 9 10 10 10 10 10 9 9 10 10 10 10 10 9 9 9 10 10 10 10 10 10 9 8 8 8
-72 8 9 9 10 10 10 10 9 9 9 8 8 8 8 8 8 8 8 8 8 9 9 9 9 10 10 10 10 11 12 11 11 10 10 10 10 11 12 12 12 11 10 9 9 9 10 10 11 11 11 11 11 11 11 10 10 10 11 12 12 11 11 11 10 10 10 10 10 10 12 13 13 13
-80 13 13 13 12 11 11 11 11 11 11 10 11 11 11 10 9 9 9 9 10 9 9 9 8 8 8 8 8 8 8 8 8 9 10 11 11 11 11 11 10 9 8 7 8 8 8 8 9 9 9 9 10 10 10 10 10 9 9 9 8 8 8 8 8 9 9 9 9 9 10 10 10
-88 10 10 11 11 11 10 9 8 9 9 10 10 10 10 10 10 10 10 10 10 9 8 8 9 9 9 9 9 9 9 9 8 9 9 10 11 11 10 10 11 11 11 11 11 10 10 10 10 10 10 10 11 10 9 8 8 9 9 8 8 8 10 10 10 9 9 9 8 8 9 9 10
-95 10 10 10 10 9 8 7 8 9 9 8 9 9 9 10 10 10 10 10 10 10 10 10 10 10 10 10 10 10 12 12 12 12 11 11 12 11 11 11 11 11 11 11 11 11 11 11 11 11 12 11 11 11 11 12 12 12 11 11 10 10 10 9 9 8 8 8 8 8 8 9 9
-103 9 10 10 10 10 10 9 8 8 9 10 10 10 9 8 7 7 8 8 8 9 9 9 9 9 8 7 8 9 9 9 10 10 10 10 10 10 9 9 9 9 9 9 10 11 10 10 10 10 11 10 10 9 10 10 10 10 10 10 10 11 11 11 10 10 10 10 10 10 9 9 10
-110 10 10 10 11 10 10 10 9 9 8 8 8 9 9 9 9 9 10 10 11 11 11 10 10 10 10 9 9 10 10 11 11 11 10 11 10 9 9 10 10 10 10 11 11 11 10 10 11 11 12 12 12 12 12 11 10 10 11 10 10 10 10 10 10 10 10 10 10 11 10 9
-118 9 9 10 11 12 12 13 13 13 12 11 11 10 11 11 9 9 9 9 9 9 9 10 10 10 10 9 9 8 8 9 10 11 11 10 9 9 9 10 10 10 10 10 10 10 11 10 10 9 10 10 10 9 8 9 9 9 10 10 11 11 11 10 11 11 12 11 10 9 9 10 11
$$ packed form
-65A1%J%j%%%Jjjj%J%j%%J%%jJ%J%J%%%jjj%%J%%j%%%jj%JJJ%%%%j%J%%%%j%%J%%%%%jj%%
-72HJ%J%%%j%%j%%%%%%%%%J%%%J%%%JJj%j%%%JJ%%jjj%%J%J%%%%%%j%%JJ%j%%j%%%%%KJ%%
-80A3%%jj%%%%%jJ%%jj%%%Jj%%j%%%%%%%%JJJ%%%%jjjjJ%%%J%%%J%%%%j%%j%%%%J%%%%J%%
-88A0%J%%jjjJ%J%%%%%%%%%jj%J%%%%%%%jJ%JJ%j%J%%%%j%%%%%%Jjjj%J%j%%K%%j%%j%J%J
-95A0%%%jjjJJ%jJ%%J%%%%%%%%%%%%%%K%%%j%Jj%%%%%%%%%%%%Jj%%%J%%j%j%%j%j%%%%%J%
-103IJ%%%%jj%JJ%%jjj%J%%J%%%%jjJJ%%J%%%%%j%%%%%JJj%%%Jj%jJ%%%%%%J%%j%%%%%j%J
-110A0%%Jj%%j%j%%J%%%%J%J%%j%%%j%J%J%%jJjj%J%%%J%%j%J%J%%%%jj%Jj%%%%%%%%%Jjj
-118I%JJJ%J%%jj%jJ%k%%%%%%J%%%j%j%JJJ%jj%%J%%%%%%Jj%jJ%%jjJ%%J%J%%jJ%Jjjj%JJ
$$ plain form
-125 11 10 10 11 11 11 11 11 11 10 9 9 8 9 9 10 9 9 8 7 7 7 8 9 10 10 11 10 10 9 9 8 9 9 8 8 8 9 9 8 9 10 10 10 10 10 10 10 9 9 9 9 10 10 11 11 10 10 10 10 9 10 11 10 10 10 10 10 10 10 10
-132 10 10 11 11 11 10 9 9 10 9 9 9 8 8 8 8 8 9 9 8 8 9 9 9 9 9 9 9 9 9 8 8 8 8 7 8 8 9 9 9 9 9 8 8 9 8 7 7 8 8 8 8 9 9 9 9 9 9 8 9 9 9 10 10 9 8 8 9 10 11 11
-140 11 10 9 10 10 10 10 10 10 11 11 11 11 11 11 10 10 9 9 9 10 10 10 11 11 11 11 10 9 9 8 8 8 9 10 10 10 10 11 12 12 11 10 9 9 9 9 9 9 9 9 10 10 10 10 11 10 10 9 9 9 9 9 8 7 8 8 9 8 8 8
-147 8 7 7 8 9 9 9 9 9 8 8 10 9 9 9 10 10 10 10 10 10 10 10 10 11 11 11 11 11 10 9 9 10 10 10 10 10 10 8 8 8 8 8 8 8 9 9 9 10 10 9 9 9 9 10 10 10 10 9 9 9 9 9 9 9 9 9 10 10 9 7 6
-155 6 7 7 9 9 7 7 7 7 8 8 7 7 7 8 8 9 10 10 10 10 9 9 9 9 9 9 10 11 11 11 12 11 10 10 11 11 11 11 10 10 11 11 11 11 10 10 9 9 9 10 10 10 10 10 10 11 11 10 10 10 10 10 10 11 12 12 11 11 10 9 9
-162 9 10 10 11 11 11 11 11 10 9 9 9 8 8 9 10 11 11 10 10 10 10 9 10 10 10 10 10 10 9 10 10 10 10 9 10 11 11 10 10 10 10 10 10 10 11 11 11 10 10 9 9 9 9 10 10 10 10 10 10 10 10 10 9 8 8 8 9 9 9 10 11
-170 11 11 11 10 8 8 9 9 9 9 9 9 9 8 7 8 9 9 9 8 8 8 9 9 8 8 8 9 8 8 8 8 7 7 8 8 8 8 8 8 8 8 8 8 8 9 8 8 8 9 9 8 9 10 11 11 11 11 11 12 12 12 11 10 9 9 9 8 8 9 10
-177 10 10 11 11 11 10 9 9 9 9 9 9 10 10 9 8 8 8 9 9 10 10 10 10 11 11 9 9 9 8 7 7 7 8 9 9 9 9 10 11 11 10 10 10 10 10 10 10 10 10 10 10 10 9 9 10 10 9 9 10 11 11 11 10 9 9 9 10 10 11 10
$$ packed form
-125A1j%J%%%%%jj%jJ%Jj%jj%%JJJ%Jj%j%jJ%j%%J%jJJ%%%%%%j%%%J%J%j%%%jJJj%%%%%%%
-132A0%J%%jj%Jj%%j%%%%J%j%J%%%%%%%%j%%%jJ%J%%%%j%Jjj%J%%%J%%%%%jJ%%J%jj%JJJ%
-140A1jjJ%%%%%J%%%%%j%j%%J%%J%%%jj%j%%JJ%%%JJ%jjj%%%%%%%J%%%Jj%j%%%%jjJ%Jj%%
-147Hj%JJ%%%%j%Kj%%J%%%%%%%%J%%%%jj%J%%%%%k%%%%%%J%%J%j%%%J%%%j%%%%%%%%J%jkj
-155FJ%K%k%%%J%j%%J%JJ%%%j%%%%%JJ%%Jjj%J%%%j%J%%%j%j%%J%%%%%J%j%%%%%JJ%j%jj%
-162IJ%J%%%%jj%%j%JJJ%j%%%jJ%%%%%jJ%%%jJJ%j%%%%%%J%%j%j%%%J%%%%%%%%jj%%J%%JJ
-170A1%%jk%J%%%%%%jjJJ%%j%%J%j%%Jj%%%j%J%%%%%%%%%%Jj%%J%jJJJ%%%%J%%jjj%%j%JJ
-177A0%J%%jj%%%%%J%jj%%J%J%%%J%k%%jj%%JJ%%%JJ%j%%%%%%%%%%%j%J%j%JJ%%jj%%J%Jj
$$ plain form
-185 10 9 8 8 8 9 10 10 11 11 11 12 12 12 11 11 10 10 11 11 11 10 10 11 11 11 10 10 10 11 10 9 10 10 11 12 12 12 12 11 10 9 9 9 9 9 10 11 11 11 12 11 11 11 11 11 11 11 11 11 11 11 11 11 10 10 10 10 10 10 10
-192 10 10 9 9 9 8 9 10 10 10 10 10 9 9 10 11 11 10 10 9 9 9 9 9 9 9 10 11 10 10 10 10 10 10 10 9 8 9 9 10 10 10 10 10 10 11 10 10 10 10 11 11 10 9 8 8 9 10 9 9 10 9 9 9 9 9 9 10 9 9 9
-200 9 10 10 10 10 10 10 10 9 9 9 8 9 9 9 8 7 7 7 7 8 8 9 9 8 7 7 8 9 10 11 11 10 10 10 10 10 10 11 12 12 11 10 10 10 9 9 9 9 9 9 9 9 9 9 9 9 10 10 10 10 10 10 10 9 10 11 10 10 10 9 8
-207 8 8 8 9 10 10 11 11 11 12 12 11 10 9 9 9 10 10 11 11 10 10 9 9 10 10 10 10 11 11 11 11 11 11 11 11 11 10 9 10 10 10 9 10 11 12 11 11 11 11 11 11 11 11 12 11 10 9 9 8 9 10 11 11 11 12 13 12 11 10 9 10
-215 10 10 11 11 12 12 12 11 11 11 11 11 10 9 9 8 8 7 7 7 7 7 8 8 8 9 8 8 8 9 10 11 11 9 7 7 8 8 8 9 8 8 9 9 9 9 10 10 10 9 9 8 8 8 8 8 9 9 9 9 9 9 9 9 8 7 7 8 8 8 9
-222 9 10 10 9 9 10 10 10 10 10 10 11 10 9 10 10 10 10 10 10 10 10 10 10 10 10 10 11 11 11 11 11 10 10 10 9 7 8 9 10 9 9 9 9 9 8 8 8 9 9 10 11 11 11 10 10 10 9 9 9 9 9 10 11 11 10 8 8 8 7 8 7
-230 7 7 8 9 9 9 9 9 9 9 9 10 10 10 11 10 9 9 10 10 10 10 10 9 9 9 9 9 9 8 7 6 7 8 10 10 10 9 8 8 8 9 9 9 9 9 9 10 11 10 10 10 9 9 9 9 8 8 8 8 7 7 8 9 10 11 11 11 11 11 10 9
-237 9 10 9 9 10 10 10 10 10 10 10 11 11 11 11 11 12 12 11 11 12 11 11 11 11 10 9 9 9 9 10 10 10 9 9 10 10 10 9 9 9 9 9 10 10 10 10 10 10 10 10 9 9 9 9 9 9 9 9 9 9 9 8 8 9 10 10 11 11 10 9 9
$$ packed form
-185A0jj%%JJ%J%%J%%j%j%J%%j%J%%j%%JjjJ%JJ%%%jjj%%%%JJ%%Jj%%%%%%%%%%%%j%%%%%%
-192A0%j%%jJJ%%%%j%JJ%j%j%%%%%%JJj%%%%%%jjJ%J%%%%%Jj%%%J%jjj%JJj%Jj%%%%%Jj%%
-200IJ%%%%%%j%%jJ%%jj%%%J%J%jj%JJJJ%j%%%%%JJ%jj%%j%%%%%%%%%%%J%%%%%%jJJj%%jj
-207H%%JJ%J%%J%jjj%%J%J%j%j%J%%%J%%%%%%%%jjJ%%jJJJj%%%%%%%Jjjj%jJJJ%%JJjjjjJ
-215A0%J%J%%j%%%%jj%j%j%%%%J%%Jj%%JJJ%kk%J%%Jj%J%%%J%%j%j%%%%J%%%%%%%jj%J%%J
-222IJ%j%J%%%%%JjjJ%%%%%%%%%%%%J%%%%j%%jkJJJj%%%%j%%J%JJ%%j%%j%%%%JJ%jk%%jJj
-230G%JJ%%%%%%%J%%Jjj%J%%%%j%%%%%jjjJJK%%jj%%J%%%%%JJj%%j%%%j%%%j%JJJJ%%%%jj
-237IJj%J%%%%%%J%%%%J%j%Jj%%%jj%%%J%%j%J%%j%%%%J%%%%%%%j%%%%%%%%%%j%JJ%J%jj%
$$ plain form
-245 9 10 10 10 11 10 10 10 10 10 11 10 10 11 11 11 10 11 11 11 12 12 11 11 11 11 11 10 10 10 9 9 9 8 8 8 8 8 8 8 8 9 9 9 9 10 10 10 10 10 10 9 8 8 9 9 9 8 8 9 10 10 9 9 9 9 10 10 10 9 8 8
-252 8 8 8 8 8 9 8 8 7 8 8 8 7 8 8 7 7 8 9 11 11 11 12 11 10 9 9 9 10 11 11 11 11 12 11 11 11 11 11 11 10 10 10 10 11 11 11 11 11 11 11 11 11 11 11 11 11 12 11 10 10 10 10 10 10 10 9 10 10 10 10 10
-260 10 10 10 11 11 11 11 11 11 11 10 9 9 9 10 11 10 9 9 9 9 9 9 9 10 11 11 11 11 11 10 9 9 9 9 10 10 10 11 11 10 10 10 9 9 9 9 9 9 10 10 10 10 10 9 9 9 9 10 10 9 9 9 9 9 9 9 10 10 10 9
-267 9 9 9 9 9 9 9 9 10 10 10 11 12 12 11 9 9 9 9 9 10 10 10 10 10 10 9 10 10 10 10 9 9 9 10 9 9 9 9 9 8 8 7 7 8 7 7 7 7 7 7 8 8 9 9 9 9 8 8 8 9 9 9 9 9 9 8 8 8 8 9 9
-275 9 10 10 9 10 11 11 10 10 10 9 8 8 8 8 8 8 8 8 8 8 8 8 9 10 9 10 10 9 9 8 8 8 8 9 9 9 9 10 10 10 9 9 9 10 10 9 9 9 9 9 9 8 8 9 9 10 11 11 10 10 10 9 9 9 10 9 8 8 9 9 10
-282 10 10 10 9 9 9 9 10 10 11 12 11 11 11 11 12 11 10 9 9 9 9 9 9 9 9 9 9 10 9 8 8 8 9 9 9 9 9 9 9 8 9 9 9 9 9 9 9 9 9 9 9 9 10 10 10 10 10 9 9 9 9 10 9 9 9 9 9 9 9 9
-289 9 9 10 10 11 11 11 11 9 8 7 6 7 8 8 9 9 10 10 11 10 9 9 10 10 10 10 10 11 11 10 10 9 9 9 9 9 9 9 10 10 10 10 9 9 9 10 10 11 10 9 8 8 8 8 8 9 9 9 10 10 10 10 10 10 9 8 8 10 10 10 9
-297 9 8 8 8 9 9 10 10 10 9 9 9 9 8 7 6 7 7 8 8 8 8 8 8 9 10 10 10 10 10 10 10 10 10 10 10 10 10 10 11 9 8 9 9 9 10 10 10 11 12 12 12 11 10 9 8 9 10 10 11 10 9 9 10 10 10 10 11 11 11 10 9
$$ packed form
-245IJ%%Jj%%%%Jj%J%%jJ%%J%j%%%%j%%j%%j%%%%%%%J%%%J%%%%%jj%J%%j%JJ%j%%%J%%jj%
-252H%%%%Jj%jJ%%jJ%j%JJK%%Jjjj%%JJ%%%Jj%%%%%j%%%J%%%%%%%%%%%%Jjj%%%%%%jJ%%%%
-260A0%%J%%%%%%jj%%JJjj%%%%%%JJ%%%%jj%%%J%%J%j%%j%%%%%J%%%%j%%%J%j%%%%%%J%%j
-267I%%%%%%%J%%JJ%jk%%%%J%%%%%jJ%%%j%%Jj%%%%j%j%Jj%%%%%J%J%%%j%%J%%%%%j%%%J%
-275IJ%jJJ%j%%jj%%%%%%%%%%%JJjJ%j%j%%%J%%%J%%j%%J%j%%%%%j%J%JJ%j%%j%%Jjj%J%J
-282A0%%j%%%J%JJj%%%Jjjj%%%%%%%%%Jjj%%J%%%%%%jJ%%%%%%%%%%%J%%%%j%%%Jj%%%%%%%
-289I%J%J%%%kjjjJJ%J%J%Jjj%J%%%%J%j%j%%%%%%J%%%j%%J%Jjjj%%%%J%%J%%%%%jj%K%%j
-297Ij%%J%J%%j%%%jjjJ%J%%%%%JJ%%%%%%%%%%%%%JkjJ%%J%%JJ%%jjjjJJ%Jjj%J%%%J%%jj
$$ plain form
-305 9 9 8 8 8 10 11 11 11 12 12 11 9 9 8 8 8 9 9 9 9 9 10 10 11 11 11 10 10 10 10 11 11 10 10 10 10 10 10 10 10 11 11 10 10 10 10 10 10 11 11 11 11 10 10 10 10 10 9 9 8 9 10 9 9 8 8 8 8 8 7 8
-312 8 9 9 8 9 9 8 9 9 9 10 10 10 10 10 10 10 11 11 12 12 11 11 11 11 10 10 9 9 9 10 9 9 8 8 8 7 7 8 9 10 10 9 9 9 9 10 11 11 11 10 10 9 8 8 9 9 9 9 9 9 9 10 9 9 9 10 10 10 10 10 9
-320 9 10 10 10 9 9 8 8 8 8 9 9 10 9 9 9 8 9 10 9 9 10 10 10 10 10 11 11 11 10 11 11 11 11 11 11 10 11 11 10 9 9 10 10 9 9 8 8 9 9 10 10 11 11 10 10 10 10 9 9 10 10 11 10 10 10 9 9 9 8 8 8
-327 8 8 9 9 9 10 10 10 10 11 11 10 9 9 9 10 9 9 9 9 10 10 10 11 11 11 11 11 10 10 10 10 11 11 11 11 10 10 9 10 11 10 9 8 8 8 8 8 9 9 8 8 7 7 8 8 9 9 10 9 9 10 10 10 10 10 11 10 10 9 9 8
$$ packed form
-305I%j%%KJ%%J%jk%j%%J%%%%J%J%%j%%%J%j%%%%%%%J%j%%%%%J%%%j%%%%j%jJJj%j%%%%jJ
-312HJ%jJ%jJ%%J%%%%%%J%J%j%%%j%j%%Jj%j%%j%JJJ%j%%%JJ%%j%jj%J%%%%%%Jj%%J%%%%j
-320IJ%%j%j%%%J%Jj%%jJJj%J%%%%J%%jJ%%%%%jJ%jj%J%j%j%J%J%J%j%%%j%J%Jj%%j%%j%%
-327H%J%%J%%%J%jj%%Jj%%%J%%J%%%%j%%%J%%%j%jJJjjj%%%%J%j%j%J%J%Jj%J%%%%Jj%j%j
$$ [...]
-2638E
##END=		$$ NMR SPECTRUM
##END=		$$ LINK
