##TITLE=	iIf+J5x2QsGCJlEZiJlw5A.10.fid
##JCAMP-DX=	6.0	$$ MestReNova 14.3.3-33362
##DATA TYPE=	LINK
##BLOCKS=	1    
##ORIGIN=	Mestrelab Research S.L.
##OWNER=	hrzepa
##$MNOVA/METADATA=	(DOCUMENT,BASE64)
eyJuYW1lIjoiL1VzZXJzL2hyemVwYS9MaWJyYXJ5L01vYmlsZSBEb2N1bWVudHMvY29tfmFwcGxlfkN
sb3VkRG9jcy9TaGVwcGFyZC9OTVIgZmlsZXMgemlwcy0yLzE2LzE2LUgubW5vdmEiLCJwYWdlcyI6W3
siaXRlbXMiOlsiMSIgICAgIF19XX0=
##TITLE=	iIf+J5x2QsGCJlEZiJlw5A.10.fid
##JCAMP-DX=	6.0	$$ MestReNova 14.3.3-33362
##DATA TYPE=	NMR SPECTRUM
##DATA CLASS=	XYDATA
##BLOCK_ID=	1
##ORIGIN=	Bruker BioSpin GmbH & Co. KG
##OWNER=	nmrsu
##NUMDIM=	1
##$MNOVA/METADATA=	(ITEM,BASE64)
eyJhbmdsZSI6MCwiYXhlcyI6eyJ4Ijp7Im1heCI6MTUuOTM5MjEwMDAwMDE4ODk0LCJtaW4iOi0zLjU
4ODkxMDM5OTMyMjUyNn0sInkiOnsibWF4IjoxMTAyNDgzMS40Mzc1LCJtaW4iOi0xMDAyODI2LjY5MD
AwMjQ0MTR9fSwicG9pbnRzIjpbeyJ4Ijo1MzIxLCJ5Ijo1ODM1fSx7IngiOjg3MjIsInkiOjU4MzV9L
HsieCI6ODcyMiwieSI6ODIwOH0seyJ4Ijo1MzIxLCJ5Ijo4MjA4fSx7IngiOjUzMjEsInkiOjU4MzV9
XSwieiI6MH0=
##.OBSERVE FREQUENCY=	400.06047035799997502
##.OBSERVE NUCLEUS=	^1H
##.SOLVENT NAME=	DMSO
##.PULSE SEQUENCE=	zg30
##LONGDATE=	2024/04/26 09:42:37.000
##.ACQUISITIONMODE=	SIMULTANEOUS (DQD)
##$ORIGINAL FORMAT=	Bruker XWIN-NMR
##$MNOVA/SCALES_VERSION=	9
##$PARAMETER FILE=	(acqus, ASCII, /private/var/folders/f6/rjf_tdyn2v98c5c0wvkgn4s80000gq/T/iIf+J5x2QsGCJlEZiJlw5A/10/acqus, 0)
$$ ##TITLE= Parameter file, TopSpin 4.4.0
$$ ##JCAMPDX= 5.0
$$ ##DATATYPE= Parameter Values
$$ ##NPOINTS= 1	$$ modification sequence number
$$ ##ORIGIN= Bruker BioSpin GmbH & Co. KG
$$ ##OWNER= nmrsu
$$ $$ 2024-04-26 10:42:46.188 +0200  nmrsu@CZC32574CW
$$ $$ Z:/400/data/tds/nmr/UHS-587-F1/10/acqus
$$ $$ process C:\Bruker\TopSpin4.4.0\prog\mod\dirdata.exe
$$ ##$ACQT0= -2.3881445544821
$$ ##$AMP= (0..31)
$$ 100 100 100 100 100 100 100 100 100 100 100 100 100 100 100 100 100 100
$$ 100 100 100 100 100 100 100 100 100 100 100 100 100 100
$$ ##$AMPCOIL= (0..32)
$$ -1 0 0 0 0 0 0 0 0 0 0 0 0 0 0 0 0 0 0 0 0 0 0 0 0 0 0 0 0 0 0 0 0
$$ ##$AQSEQ= 0
$$ ##$AQ_mod= 3
$$ ##$AUNM= <au_zg>
$$ ##$AUTOPOS= <15 >
$$ ##$BF1= 400.058
$$ ##$BF2= 400.058
$$ ##$BF3= 400.058
$$ ##$BF4= 400.058
$$ ##$BF5= 400.058
$$ ##$BF6= 400.058
$$ ##$BF7= 400.058
$$ ##$BF8= 400.058
$$ ##$BWFAC= (0..63)
$$ 0 0 0 0 0 0 0 0 0 0 0 0 0 0 0 0 0 0 0 0 0 0 0 0 0 0 0 0 0 0 0 0 0 0 0 0
$$ 0 0 0 0 0 0 0 0 0 0 0 0 0 0 0 0 0 0 0 0 0 0 0 0 0 0 0 0
$$ ##$BYTORDA= 0
$$ ##$CHANFCU= (0..24)
$$ 0 0 1 0 0 0 0 0 0 0 0 0 0 0 0 0 0 0 0 0 0 0 0 0 0
$$ ##$CHANREC= (0..24)
$$ 0 0 1 0 0 0 0 0 0 0 0 0 0 0 0 0 0 0 0 0 0 0 0 0 0
$$ ##$CHEMSTR= <none>
$$ ##$CNST= (0..63)
$$ 1 1 1 1 1 1 1 1 1 1 1 1 1 1 1 1 1 1 1 1 1 1 1 1 1 1 1 1 1 1 1 1 1 1 1 1
$$ 1 1 1 1 1 1 1 1 1 1 1 1 1 1 1 1 1 1 1 1 1 1 1 1 1 1 1 1
$$ ##$CPDPRG= (0..8)
$$ <> <> <> <> <> <> <> <> <>
$$ ##$D= (0..63)
$$ 0 1 0 0 0 0 0 0 0 0 0 0 0 0 0 0 0.0002 0 0 0 0 0 0 0 0 0 0 0 0 0 0 0 0
$$ 0 0 0 0 0 0 0 0 0 0 0 0 0 0 0 0 0 0 0 0 0 0 0 0 0 0 0 0 0 0 0
$$ ##$DATE= 1714120957
$$ ##$DATE_START= 1714120862
$$ ##$DE= 13.61186
$$ [...]
$$ ##$ShimPowRng2= (0..63)
$$ 1 1 1 1 1 1 1 1 1 1 1 1 1 1 1 1 1 1 1 1 1 1 1 1 1 1 1 1 1 1 1 1 1 1 1 1
$$ 1 1 1 1 0 0 0 0 0 0 0 0 0 0 0 0 0 0 0 0 0 0 0 0 0 0 0 0
$$ ##$ShimPowRng3= (0..63)
$$ 1 1 1 1 1 1 1 1 1 1 1 1 1 1 1 1 1 1 1 1 1 1 1 1 1 1 1 1 1 1 1 1 1 1 1 1
$$ 1 1 1 1 0 0 0 0 0 0 0 0 0 0 0 0 0 0 0 0 0 0 0 0 0 0 0 0
$$ ##$ShimPowType1= 8
$$ ##$ShimPowType2= 8
$$ ##$ShimPowType3= 0
$$ ##$ShimPowType4= 0
$$ ##$ShimPowType5= 0
$$ ##$ShimPowType6= 0
$$ ##$ShimPowType7= 0
$$ ##$ShimPowType8= 0
$$ ##$ShimSysActGrad= (0..63)
$$ 1 2 3 4 13 5 7 11 10 9 6 8 12 18 19 20 21 15 22 23 24 14 25 16 26 17 27
$$ 28 31 32 33 34 35 36 37 38 0 0 0 0 0 0 0 0 0 0 0 0 0 0 0 0 0 0 0 0 0 0
$$ 0 0 0 0 0 0
$$ ##$ShimSysAngle= <>
$$ ##$ShimSysFunc= (0..63)
$$ 1 2 3 4 5 6 7 8 9 10 0 37 38 35 16 15 14 13 12 11 28 27 26 25 24 23 36
$$ 22 30 29 20 21 34 33 32 31 17 18 19 0 0 0 0 0 0 0 0 0 0 0 0 0 0 0 0 0 0
$$ 0 0 0 0 0 0 0
$$ ##$ShimSysMatId= <292722aa.dat>
$$ ##$ShimSysMatrix= 1
$$ ##$ShimSysMinMaxUG= 130000
$$ ##$ShimSysOffset= <.>
$$ ##$ShimSysType= 4
$$ ##$ShimUnit= 3
$$ ##$SpectrOsVersion= <4.3.180.20230524>
$$ ##$TCubeEth= <192.168.180.18>
$$ ##$TCubeSeqDevice= <>
$$ ##$TopSpinVersion= <TopSpin 4.4.0>
$$ ##$TrxFreqFormula= (0..23)
$$ <TrxFreqFormula(2.0,400058000.000000,'TRX',Trx(1.0,'TRX 1200.1',2,5.000000,1290.000000))>
$$ <TrxFreqFormula(2.0,400058000.000000,'TRX',Trx(1.0,'TRX 1200.2',2,5.000000,1290.000000))>
$$ <> <> <> <> <> <> <> <> <> <> <> <> <> <> <> <> <> <> <> <> <> <>
$$ ##$TrxPN= (0..23)
$$ <Z148391> <Z148391> <> <> <> <> <> <> <> <> <> <> <> <> <> <> <> <> <>
$$ <> <> <> <> <>
$$ ##$TrxSN= (0..23)
$$ <11200> <11201> <> <> <> <> <> <> <> <> <> <> <> <> <> <> <> <> <> <> <>
$$ <> <> <>
$$ ##$VCubeEth= (0..23)
$$ <no> <no> <no> <no> <no> <no> <no> <no> <no> <no> <no> <no> <no> <no> <no>
$$ <no> <no> <no> <no> <no> <no> <no> <no> <no>
$$ ##$VTU= 2
$$ ##$VTUETH= <192.168.99.10>
$$ ##$ValueLine= no
$$ ##$VpuPN= (0..23)
$$ <no> <no> <no> <no> <no> <no> <no> <no> <no> <no> <no> <no> <no> <no> <no>
$$ <no> <no> <no> <no> <no> <no> <no> <no> <no>
$$ ##$VpuSN= (0..23)
$$ <no> <no> <no> <no> <no> <no> <no> <no> <no> <no> <no> <no> <no> <no> <no>
$$ <no> <no> <no> <no> <no> <no> <no> <no> <no>
$$ ##$WBREFAM= (0..31)
$$ 100 127.7 107.6 100 100 100 100 100 100 100 100 100 100 100 100 100 100
$$ 100 100 100 100 100 100 100 100 100 100 100 100 100 100 100
$$ ##$WBREFLM= (0..31)
$$ 0 0 0 0 0 0 0 0 0 0 0 0 0 0 0 0 0 0 0 0 0 0 0 0 0 0 0 0 0 0 0 0
$$ ##$WBREFPH= (0..31)
$$ 0 81.57 -68.07 0 0 0 0 0 0 0 0 0 0 0 0 0 0 0 0 0 0 0 0 0 0 0 0 0 0 0 0
$$ 0
$$ ##$WBSGU= (0..31)
$$ 1 2 2 0 0 0 0 0 0 0 0 0 0 0 0 0 0 0 0 0 0 0 0 0 0 0 0 0 0 0 0 0
$$ ##END=
$$ 
##$DECIM=	2560
##$DSPFVS=	21
##XUNITS=	HZ
##YUNITS=	ARBITRARY UNITS
##FIRSTX=	6376.6084741800004849
##LASTX=	-1435.7723165304691975
##DELTAX=	-0.11920928955078155531
##XFACTOR=	1
##YFACTOR=	305.87548448133793499
##FIRSTY=	673.39337158203125
##MINY=	-631.5341796875
##MAXY=	10022622
##NPOINTS=	65536
##XYDATA=	(X++(Y..Y))
$$ [...]
$$ plain form
3800 4 1 2 3 4 4 5 5 3 2 2 1 1 1 3 5 4 5 5 5 5 5 4 3 4 4 3 3 3 4 5 5 4 3 4 4 3 3 5 6 6 5 5 4 4 2 2 3 3 4 5 5 5 5 6 6 6 5 5 4 4 5 6 5 5 5 5 4 4 5 6 6
3792 6 6 7 7 7 7 6 5 4 4 3 2 2 2 4 3 2 2 2 3 4 4 4 4 4 4 4 3 4 5 5 5 5 5 4 3 2 2 2 3 3 3 4 4 5 5 3 2 2 2 3 3 4 4 5 5 4 3 2 2 3 3 4 4 4 3 3 3 3 2 2 2
3783 2 3 3 4 5 5 3 2 1 2 3 5 6 7 7 7 7 5 4 2 1 1 2 3 5 5 5 5 5 4 3 3 4 5 5 5 5 6 6 5 5 5 5 4 4 5 4 4 4 4 4 4 4 4 3 3 4 5 6 6 6 6 5 4 4 4 4 5 6 5 5 5
3775 5 5 4 3 3 3 3 4 5 4 4 3 4 4 4 4 5 5 4 3 3 3 3 3 4 4 4 4 4 4 6 7 6 4 4 3 3 4 6 6 6 5 7 8 9 9 8 6 5 4 5 5 5 5 4 5 6 8 8 9 8 8 7 6 5 4 3 3 5 6 5 5
3766 5 4 3 3 4 4 2 3 5 5 6 6 6 7 7 8 7 7 7 7 7 5 4 3 2 3 5 6 8 7 6 6 5 5 4 5 5 5 5 5 5 5 5 5 4 4 4 6 8 7 6 5 6 5 5 4 3 3 4 4 4 4 3 3 2 2 2 4 5 5 5 6
3758 6 6 6 6 6 5 6 7 7 5 4 5 5 6 5 5 5 4 6 7 6 5 6 6 5 4 4 4 5 4 3 2 2 2 3 3 3 3 3 4 4 5 5 6 7 6 5 5 5 6 6 5 6 6 7 7 5 5 6 6 5 5 4 4 4 4 3 3 4 5 5 4
3749 4 4 3 3 3 4 3 3 4 4 4 5 5 5 5 3 2 2 3 4 6 7 6 6 5 4 4 4 3 3 3 3 4 4 4 5 5 5 5 5 5 5 6 5 5 5 5 4 3 4 4 6 7 7 7 7 7 6 4 3 4 5 6 5 4 3 2 3 4 4 3 3
3741 3 2 3 3 3 2 3 3 3 3 2 2 4 5 6 6 6 5 6 6 7 8 7 7 6 6 6 5 4 3 3 2 1 2 3 4 3 3 4 4 5 6 7 8 6 5 5 6 6 6 6 5 6 6 6 6 6 5 5 4 5 6 6 6 6 6 6 6 5 5 4 4
$$ packed form
3800DlJJJ%J%kj%j%%KKjJ%%%%jjJ%j%%JJ%jjJ%j%KJ%j%j%k%J%JJ%%%J%%j%j%JJj%%%j%JJ%
3792F%J%%%jjj%jj%%Kjj%%JJ%%%%%%jJJ%%%%jjj%%J%%J%J%kj%%J%J%J%jjj%J%J%%j%%%j%%
3783BJ%JJ%kjjJJKJJ%%%kjkj%JJK%%%%jj%JJ%%%J%j%%%j%Jj%%%%%%%j%JJJ%%%jj%%%JJj%%
3775E%jj%%%JJj%jJ%%%J%jj%%%%J%%%%%KJjk%j%JK%%jKJJ%jkjjJ%%%jJJK%Jj%jjjjj%KJj%
3766Ejj%J%kJK%J%%J%Jj%%%%kjjjJKJKjj%j%jJ%%%%%%%%j%%KKjjjJj%jj%J%%%j%j%%KJ%%J
3758F%%%%jJJ%kjJ%Jj%%jKJjjJ%jj%%Jjjj%%J%%%%J%J%JJjj%%J%jJ%J%k%J%j%j%%%j%JJ%j
3749D%j%%Jj%J%%J%%%kj%JJKJj%jj%%j%%%J%%J%%%%%%Jj%%%jjJ%KJ%%%%jkjJJJjjjjJJ%j%
3741CjJ%%jJ%%%j%KJJ%%jJ%JJj%j%%jjj%jjJJJj%J%JJJJkj%J%%%jJ%%%%j%jJJ%%%%%%j%j%
$$ plain form
3733 4 4 5 5 5 4 4 4 4 3 3 3 4 4 4 4 4 4 5 4 4 3 2 3 5 4 4 5 5 5 4 4 3 3 3 2 2 2 2 2 1 2 3 4 5 6 6 5 5 5 4 4 4 4 5 5 5 6 6 5 5 5 6 5 4 5 5 5 4 5 5 5
3724 5 5 4 3 4 4 5 5 5 5 4 3 4 5 5 4 4 5 5 5 4 3 3 3 4 4 5 5 4 4 4 4 5 5 5 5 6 5 5 5 5 6 7 7 5 4 3 2 0 0 1 2 3 4 4 2 3 5 6 7 6 7 7 8 7 7 6 5 5 5 5 5
3716 5 5 4 4 4 3 2 3 4 3 3 3 4 5 6 6 6 5 5 4 5 4 4 4 5 5 5 6 5 5 4 4 3 4 4 5 7 7 7 8 8 8 7 7 7 6 6 5 5 6 7 7 6 7 7 7 6 6 6 6 7 7 7 7 7 7 6 7 6 6 5 5
3707 5 6 6 6 5 4 4 6 5 4 4 3 4 4 4 4 5 6 6 6 8 7 7 6 6 7 7 7 7 7 6 5 5 5 5 5 5 6 7 7 5 4 4 4 4 3 3 4 4 5 5 6 6 7 6 6 6 6 6 5 5 5 5 4 4 5 5 5 4 3 4 5
3699 5 5 5 6 5 4 2 2 3 4 4 5 6 6 4 4 4 4 4 4 5 5 5 5 5 5 5 6 4 3 5 6 6 6 6 6 6 7 6 5 5 4 4 4 4 4 5 6 8 8 6 6 5 3 3 4 6 6 5 4 4 4 4 5 5 5 6 6 7 7 7 7
3690 7 7 8 7 6 6 5 4 4 3 4 5 5 6 5 5 5 5 5 4 4 3 4 4 4 4 3 3 3 3 2 2 2 2 2 2 3 4 4 3 4 5 6 6 7 5 5 6 7 6 4 5 4 3 3 3 4 6 8 9 8 7 6 5 6 6 7 7 7 6 6 6
3682 6 6 5 6 6 6 6 6 5 5 5 5 6 7 5 5 4 3 4 5 6 5 5 4 3 4 5 5 5 5 5 5 4 4 4 4 4 4 5 7 7 6 5 6 6 5 4 5 7 7 6 5 5 4 2 2 2 3 3 3 3 3 3 4 5 5 5 3 3 4 4 5
3673 5 5 5 5 5 4 4 4 4 4 4 4 5 5 6 4 4 5 5 5 5 5 5 4 5 5 6 7 7 7 7 7 6 4 3 2 2 3 5 6 6 6 6 4 2 3 4 5 5 4 4 4 4 3 4 4 4 5 4 5 6 6 6 6 6 4 3 3 3 3 3 5
$$ packed form
3733D%J%%j%%%j%%J%%%%%Jj%jjJKj%J%%j%j%%j%%%%jJJJJJ%j%%j%%%J%%J%j%%JjjJ%%jJ%%
3724E%jjJ%J%%%jjJJ%j%J%%jj%%J%J%j%%%J%%%Jj%%%JJ%kjjjk%JJJJ%kJKJJjJ%Jj%jj%%%%
3716E%j%%jjJJj%%JJJ%%j%jJj%%J%%Jj%j%jJ%JK%%J%%j%%j%j%JJ%jJ%%j%%%J%%%%%jJj%j%
3707EJ%%jj%Kjj%jJ%%%JJ%%Kj%j%J%%%%jj%%%%%JJ%kj%%%j%J%J%J%Jj%%%%j%%%j%J%%jjJJ
3699E%%Jjjk%JJ%JJ%k%%%%%J%%%%%%JkjKJ%%%%%Jjj%j%%%%JJK%k%jk%JK%jj%%%J%%J%J%%%
3690G%Jjj%jj%jJJ%Jj%%%%j%jJ%%%j%%%j%%%%%JJ%jJJJ%Jk%JJjkJjj%%JKKJjjjjJ%J%%j%%
3682F%jJ%%%%j%%%JJk%jjJJJj%jjJJ%%%%%j%%%%%JK%jjJ%jjJK%jj%jk%%J%%%%%JJ%%k%J%J
3673E%%%%j%%%%%%J%Jk%J%%%%%jJ%JJ%%%%jkjj%JKJ%%%kkJJJ%j%%%jJ%%JjJJ%%%%kj%%%%K
$$ plain form
3665 5 6 5 5 5 5 5 5 5 4 3 4 5 6 7 5 4 4 4 3 3 3 4 4 5 5 5 5 5 5 5 4 3 2 3 4 4 4 4 4 5 5 5 6 6 7 8 8 9 8 7 6 5 4 3 3 3 3 4 4 4 4 5 6 7 5 3 3 5 6 7 6
3656 6 5 4 3 3 3 3 2 1 3 4 4 4 4 4 3 4 5 5 4 4 3 5 7 6 6 6 6 7 5 5 4 4 4 5 5 5 5 5 4 5 6 6 6 7 7 7 6 5 5 5 6 5 4 4 4 4 4 3 4 5 6 5 3 3 4 5 6 5 4 4 5
3648 5 6 7 7 6 5 4 5 5 5 5 5 5 4 3 4 5 5 5 4 4 4 4 4 3 4 4 5 5 5 5 4 4 4 3 4 4 5 5 6 7 7 7 7 7 6 5 4 4 4 4 4 4 5 6 5 5 4 3 3 4 4 3 4 4 5 6 7 7 7 7 6
3639 6 6 6 6 6 6 6 6 6 6 7 7 7 6 7 7 6 6 6 6 5 4 4 4 5 6 6 5 5 5 5 5 6 6 6 6 5 4 4 5 5 5 5 6 5 5 5 5 6 6 7 8 8 8 7 7 7 6 6 5 5 5 5 4 5 5 6 6 6 6 5 5
3631 5 5 5 5 6 6 6 5 4 5 5 6 6 7 7 7 8 8 8 8 8 8 7 7 7 7 7 8 9 9 8 7 7 6 6 6 7 6 5 4 4 4 3 4 5 4 4 4 5 6 7 8 8 7 7 6 6 6 6 7 7 7 7 7 7 7 7 6 5 5 5 5
3623 5 5 5 6 6 6 6 6 6 6 6 6 6 6 6 6 6 6 5 4 4 3 3 3 4 5 6 7 6 6 6 5 7 8 7 6 6 6 7 7 8 8 7 5 5 5 5 6 7 7 8 7 6 6 7 8 9 11 9 7 6 5 5 6 7 8 8 8 8 8 7 6
3614 6 6 7 7 6 6 6 7 7 7 7 6 5 6 6 7 8 8 8 8 9 9 7 6 5 5 5 5 4 5 6 6 6 4 3 3 4 6 6 6 7 8 8 7 7 6 6 6 8 8 7 6 6 6 7 7 7 7 6 6 8 8 7 8 8 8 8 7 6 7 7 8
3606 8 8 7 7 6 6 7 8 9 8 8 8 8 9 9 10 9 8 8 8 8 8 8 7 7 8 8 7 7 6 5 5 5 5 6 6 6 6 7 7 7 7 7 6 7 7 7 8 8 7 7 7 7 8 7 6 6 5 7 8 8 8 8 9 8 7 7 8 8 8 8 9
$$ packed form
3665EJj%%%%%%jjJJJJkj%%j%%J%J%%%%%%jjjJJ%%%%J%%J%JJ%Jjjjjjj%%%J%%%JJJkk%KJJj
3656Fjjj%%%jjKJ%%%%jJJ%j%jKKj%%%Jk%j%%J%%%%jJJ%%J%%jj%%Jjj%%%%jJJJjk%JJJjj%J
3648EJJ%jjjJ%%%%%jjJJ%%j%%%%jJ%J%%%j%%jJ%J%JJ%%%%jjj%%%%%JJj%jj%J%jJ%JJJ%%%j
3639F%%%%%%%%%J%%jJ%j%%%jj%%JJ%j%%%%J%%%jj%J%%%Jj%%%J%JJ%%j%%j%j%%%jJ%J%%%j%
3631E%%%J%%jjJ%J%J%%J%%%%%j%%%%JJ%jj%j%%Jjjj%%jJJj%%JJJJ%j%j%%%J%%%%%%%jj%%%
3623E%%J%%%%%%%%%%%%%%jj%j%%JJJJj%%jKJjj%%J%J%jk%%%JJ%Jjj%JJJKkkjj%JJJ%%%%jj
3614F%J%j%%J%%%jjJ%JJ%%%J%kjj%%%jJJ%%kj%JK%%JJ%j%j%%K%jj%%J%%%j%K%jJ%%%jjJ%J
3606H%j%j%JJJj%%%J%Jjj%%%%%j%J%j%jj%%%J%%%J%%%%jJ%%J%j%%%Jjj%jKJ%%%Jjj%J%%%J
$$ plain form
3597 9 8 8 8 7 8 8 9 9 9 9 9 9 9 8 7 7 6 6 6 7 8 9 10 11 10 10 10 10 9 8 9 9 9 9 9 9 8 7 7 6 6 7 7 8 7 7 7 7 8 8 8 8 8 8 9 9 9 9 10 10 9 9 8 8 10 11 11 11 10 10 8
3589 8 8 8 7 7 7 8 9 9 8 7 8 8 8 7 6 8 9 9 8 7 5 5 6 6 7 8 8 8 9 9 9 8 7 6 7 9 9 8 8 9 9 9 9 9 9 8 7 7 6 6 7 8 9 10 10 9 7 8 8 8 7 8 8 9 9 9 10 8 7 8 8
3580 8 8 8 9 10 10 9 10 11 11 11 11 10 9 9 9 9 10 10 11 11 12 13 12 12 10 9 8 7 7 7 7 7 7 8 8 8 8 9 8 8 10 11 10 10 10 10 10 10 10 10 10 10 11 11 12 12 11 11 10 9 9 9 9 9 10 11 11 11 11 10 11
3572 11 11 11 12 10 9 9 9 11 12 12 12 13 13 13 12 11 10 9 8 8 8 8 8 9 10 10 10 10 9 9 10 9 9 10 11 11 11 11 10 10 9 10 11 12 12 11 11 11 11 10 10 11 12 13 14 14 15 15 16 16 15 15 15 13 12 10 9 10 10 11
3563 11 12 12 12 12 12 11 10 9 8 9 10 11 13 12 12 12 12 12 12 11 10 11 12 12 11 12 13 13 13 13 13 14 14 13 12 13 13 13 13 12 10 10 11 11 11 12 13 14 15 15 14 14 13 13 14 13 13 13 12 12 12 14 16 14 12 12 12 13 13 14
3555 14 14 14 14 15 15 15 16 16 16 15 15 15 16 15 15 14 13 14 16 16 17 16 16 14 13 13 13 14 14 15 16 16 15 15 16 17 18 17 17 18 18 18 17 17 16 15 15 15 15 15 16 16 17 16 16 16 16 17 17 17 17 17 17 16 16 16 15 16 17 18
3547 18 19 20 20 20 19 19 18 18 19 18 17 18 18 19 19 19 18 18 18 20 22 22 22 21 20 21 22 22 22 22 21 22 23 24 24 23 22 22 21 21 20 19 19 20 20 21 22 22 23 23 23 23 23 23 23 23 24 22 21 21 20 21 22 23 24 23 23 22 21 21
3538 21 21 21 20 21 22 23 24 24 25 24 24 24 25 24 24 24 24 24 23 24 24 25 26 26 26 27 28 28 29 28 27 27 28 28 28 28 28 29 29 30 31 31 30 30 30 30 30 31 32 30 29 30 31 30 30 30 30 31 31 31 32 32 33 33 33 33 34 33 32 33
$$ packed form
3597Ij%%jJ%J%%%%%%jj%j%%JJJJJj%%%jjJ%%%%%jj%j%J%Jj%%%J%%%%%J%%%J%j%j%KJ%%j%k
3589H%%j%%JJ%jjJ%%jjKJ%jjk%J%JJ%%J%%jjjJK%j%J%%%%%jj%j%JJJJ%jkJ%%jJ%J%%JkjJ%
3580H%%JJ%jJJ%%%jj%%%J%J%JJj%kjjj%%%%%J%%%Jj%KJj%%%%%%%%%J%J%j%jj%%%%JJ%%%jJ
3572A1%%Jkj%%KJ%%J%%jjjjj%%%%JJ%%%j%Jj%JJ%%%j%jJJJ%j%%%j%JJJJ%J%J%j%%kjkjJ%J
3563A1J%%%%jjjjJJJKj%%%%%jjJJ%jJJ%%%%J%jjJ%%%jk%J%%JJJJ%j%j%Jj%%j%%KKkk%%J%J
3555A4%%%J%%J%%j%%Jj%jjJK%Jj%kj%%J%JJ%j%JJJj%J%%j%jj%%%%J%Jj%%%J%%%%%j%%jJJJ
3547A8JJ%%j%j%JjjJ%J%%j%%KK%%jjJJ%%%jJJJ%jj%j%jj%J%JJ%J%%%%%%%Jkj%jJJJJj%jj%
3538B1%%jJJJJ%Jj%%Jj%%%%jJ%JJ%%JJ%Jjj%J%%%%J%JJ%j%%%%JJkjJJj%%%J%%J%J%%%JjjJ
$$ plain form
3530 33 33 34 34 35 36 37 37 37 37 38 39 39 39 39 39 39 39 39 39 39 40 40 40 40 40 40 40 41 42 43 44 43 42 42 43 43 44 45 46 46 46 46 46 46 46 46 47 46 46 46 47 48 49 49 49 50 51 51 51 51 52 54 54 54 53 53 52 54 56 57
3522 57 59 61 61 60 59 59 61 62 63 64 63 63 65 65 66 66 65 66 66 67 67 69 70 72 73 74 75 76 76 77 77 78 79 80 80 79 79 81 83 86 86 85 85 86 87 90 92 93 93 94 94 96 98 99 100 101 101 102 104 106 108 110 112 113 114 114 115 117 118 120
3513 120 121 122 122 125 127 129 131 132 134 136 137 138 141 142 143 146 149 150 151 154 156 158 159 160 163 167 169 172 175 177 179 181 183 185 186 188 190 192 195 198 201 204 206 208 209 211 215 218 222 224 226 229 231 234 236 240 243 246 248 250 252 255 257 259 261 263 264 267 269
3505 269 273 276 278 282 286 289 291 293 295 297 299 301 304 306 309 311 312 313 316 318 321 323 324 326 327 329 331 334 335 337 339 341 341 342 343 346 349 351 352 353 354 356 358 360 360 360 362 363 364 365 366 366 367 368 368 369 369 368 368 368 368 368 368 368 369 369 368 368 366
3497 366 365 364 363 362 361 360 360 359 359 357 356 354 351 348 347 347 346 344 342 342 341 339 336 334 330 327 325 324 324 322 321 319 318 316 314 312 310 308 306 303 300 297 294 291 288 287 285 283 280 277 275 274 271 268 265 262 262 260 257 254 252 250 249 245 242 238 235 232 230
3489 230 227 225 223 222 220 216 213 209 207 205 203 201 198 195 192 190 187 184 183 182 181 179 176 174 171 168 165 163 161 159 158 156 154 153 150 148 147 145 143 141 139 137 135 134 132 131 129 128 127 126 125 124 122 120 118 117 116 114 113 113 112 112 110 107 105 103 102 101 99
3480 99 98 97 96 95 94 92 90 90 91 89 88 87 87 85 84 84 82 81 80 79 76 75 75 76 76 75 73 72 72 73 71 71 71 71 70 70 70 69 68 67 67 67 65 63 61 61 61 61 62 61 61 61 61 60 58 56 55 55 55 55 55 55 55 55 55 56 55 54 53 53
3472 53 52 51 51 51 51 52 52 51 50 48 47 47 48 47 46 45 45 45 45 44 43 42 41 42 43 43 41 41 40 41 41 41 41 40 39 38 38 39 39 39 39 39 38 38 37 36 35 35 35 36 35 35 37 37 38 36 35 33 32 30 31 31 32 32 32 31 31 31 31 31
$$ packed form
3530C3%J%JJJ%%%JJ%%%%%%%%%J%%%%%%JJJJjj%J%JJJ%%%%%%%Jj%%JJJ%%JJ%%%JK%%j%jKKJ
3522E7KK%jj%KJJJj%K%J%jJ%J%KJKJJJJ%J%JJJ%j%KKL%j%JJLKJ%J%KKJJJ%JKKKKKJJ%JKJK
3513A20JJ%LKKKJKKJJLJJLLJJLKKJJLMKLLKKKKKJKKKLLLLKKJKMLMKKLKLKMLLKKKLKKKKJLK
3505B69MLKMMLKKKKKKLKLKJJLKLKJKJKKLJKKK%JJLLKJJJKKK%%KJJJJ%JJ%J%j%%%%%%J%j%k
3497C66jjjjjj%j%kjkllj%jkk%jklkmlkj%kjkjkkkkkklllllljkkllkjllll%kllkkjmlmllk
3489B30lkkjkmlmkkkklllklljjjklklllkkkjkkjlkjkkkkkkjkjkjjjjjkkkjjkj%j%klkkjjk
3480I9jjjjjkk%Jkjj%kj%kjjjlj%J%jkj%Jk%%%j%%jjj%%kkk%%%Jj%%%jkkj%%%%%%%%Jjjj%
3472E3jj%%%J%jjkj%Jjjj%%%jjjjJJ%k%jJ%%%jjj%J%%%%j%jjj%%Jj%K%JkjkjkJ%J%%j%%%%
$$ plain form
3464 31 32 32 32 32 32 32 32 32 33 33 33 34 32 32 31 31 30 28 26 26 26 26 25 25 26 26 26 25 25 27 26 26 26 27 27 27 27 26 25 25 25 24 23 24 24 25 26 24 23 22 21 21 21 21 22 23 25 25 25 24 24 23 22 22 22 23 23 23 24 23
3455 23 22 22 22 22 22 22 22 23 24 23 22 23 23 22 22 22 22 23 23 24 24 23 22 22 22 20 19 20 22 21 20 19 19 19 20 20 20 20 20 20 20 20 20 20 20 20 20 19 19 19 19 19 19 19 18 19 19 18 17 17 18 18 19 19 19 19 18 19 19 19
3447 19 18 18 18 17 15 16 17 17 17 16 15 15 17 18 17 17 18 17 17 18 18 18 18 18 17 17 16 16 15 15 15 15 14 14 14 15 16 16 16 16 15 15 15 15 15 15 15 15 14 14 15 15 15 15 15 14 14 13 13 13 13 13 14 13 13 14 15 15 14 15
3439 15 15 14 14 14 14 14 15 15 16 16 15 16 16 16 17 16 14 14 13 13 13 13 12 11 11 12 13 14 14 15 16 14 13 13 12 12 12 12 12 11 10 9 8 9 9 10 10 10 10 11 12 12 13 13 14 14 14 14 13 13 13 14 13 11 10 11 12 11 11 11
3430 11 12 12 13 14 15 14 14 13 13 14 14 13 13 13 13 12 11 11 11 12 13 14 14 13 12 10 8 8 8 8 9 9 9 9 11 13 13 12 11 11 12 12 12 12 12 12 12 12 10 9 9 9 8 9 9 10 11 9 8 9 10 10 10 10 10 11 11 11 10 10
3422 10 12 12 13 13 12 11 11 10 9 8 7 8 8 9 9 9 10 9 8 9 9 9 9 9 10 10 10 10 9 10 10 12 12 12 12 12 12 11 10 11 11 10 9 9 8 9 11 11 11 10 10 9 8 9 9 9 10 9 8 8 9 9 10 10 10 10 10 10 10 9
3414 9 9 9 9 9 9 10 10 11 12 11 9 8 8 8 8 8 9 9 9 9 9 9 9 9 8 9 10 9 9 10 10 10 9 10 11 12 11 9 8 8 7 7 8 7 7 8 8 8 8 8 9 10 11 11 9 8 8 8 7 6 6 7 9 8 8 8 9 8 8 9 10
3405 10 9 8 9 10 11 12 12 12 11 10 10 10 10 10 11 11 10 8 7 8 8 8 8 8 9 9 8 8 8 7 7 8 8 8 8 9 8 8 9 9 9 8 8 9 9 9 9 8 6 7 8 7 6 5 5 6 6 7 8 8 9 9 8 8 7 7 6 5 5 6
$$ packed form
3464C1J%%%%%%%J%%Jk%j%jkk%%%j%J%%j%Kj%%J%%%jj%%jjJ%JJkjjj%%%JJK%%j%jj%%J%%Jj
3455B3j%%%%%%JJjjJ%j%%%J%J%jj%%kjJKjjj%%J%%%%%%%%%%%%j%%%%%%jJ%jj%J%J%%%jJ%%
3447A9j%%jkJJ%%jj%KJj%Jj%J%%%%j%j%j%%%j%%JJ%%%j%%%%%%%j%J%%%%j%j%%%%Jj%JJ%jJ
3439A5%j%%%%J%J%jJ%%Jjk%j%%%jj%JJJ%JJkj%j%%%%jjjjJ%J%%%JJ%J%J%%%j%%JjkjJJj%%
3430A1J%JJJj%j%J%j%%%jj%%JJJ%jjkk%%%J%%%KK%jj%J%%%%%%%kj%%jJ%JJkjJJ%%%%J%%j%
3422A0K%J%jj%jjjjJ%J%%JjjJ%%%%J%%%jJ%K%%%%%jjJ%jj%jJK%%j%jjJ%%Jjj%J%J%%%%%%j
3414I%%%%%J%JJjkj%%%%J%%%%%%%jJJj%J%%jJJJjkj%j%Jj%J%%%%JJJ%kj%%jj%JKj%%Jj%JJ
3405A0jjJJJJ%%jj%%%%J%jkjJ%%%%J%j%%j%J%%%Jj%J%%j%J%%%jkJJjjj%J%JJ%J%j%j%jj%J
$$ plain form
3397 6 8 10 9 8 8 9 9 9 8 7 8 8 9 10 9 8 6 6 7 7 8 8 8 8 7 7 7 8 8 9 8 8 7 6 6 7 8 8 8 8 8 8 8 9 9 9 9 9 9 9 9 9 8 8 9 8 8 7 7 8 8 7 7 8 8 8 8 9 9 9 8
3388 8 8 8 8 9 9 8 8 7 6 6 6 7 8 8 7 7 8 7 6 6 6 5 6 7 6 6 8 8 8 6 5 7 8 8 9 9 8 8 8 8 8 9 10 9 9 7 6 6 7 7 8 8 8 7 7 6 6 7 6 5 5 5 5 5 4 3 3 3 4 5 4
3380 4 4 5 6 6 6 7 7 6 5 5 6 6 6 6 7 7 6 7 7 6 8 8 7 7 7 6 6 5 6 7 6 6 7 8 9 10 9 9 8 8 7 7 6 6 6 7 7 7 6 6 6 6 7 7 7 7 7 6 6 6 7 8 8 7 7 6 6 5 5 5 5
3371 5 6 5 5 5 4 5 6 7 6 6 5 5 4 5 6 7 7 6 5 4 4 6 6 7 7 8 8 7 8 10 9 9 9 8 7 6 6 7 6 5 4 5 6 6 5 4 4 4 5 4 3 4 5 5 6 6 6 6 6 6 6 7 8 8 8 8 8 7 7 7 7
3363 7 8 9 8 8 8 8 7 5 5 6 7 8 7 8 9 9 8 7 5 5 7 8 9 9 8 7 5 5 5 5 5 6 7 6 6 5 6 6 7 8 9 9 8 6 7 7 7 7 7 7 7 8 8 8 8 8 7 9 9 8 8 8 8 8 8 8 8 7 7 8 7
3355 7 5 5 6 6 6 7 8 7 6 5 6 7 6 5 6 7 9 9 9 9 9 8 7 6 6 6 7 7 7 8 8 7 8 8 8 7 6 6 6 7 7 6 6 5 4 4 6 7 8 8 7 7 7 8 9 8 7 5 5 6 6 6 5 6 7 8 8 7 7 7 7
3346 7 9 9 9 9 9 9 8 7 6 6 6 6 6 6 7 8 8 9 10 10 9 7 6 7 8 7 7 8 10 9 9 8 8 8 8 8 8 8 9 9 9 8 8 8 7 6 6 6 6 6 7 8 6 5 7 8 8 8 7 7 6 5 5 5 6 7 7 7 6 6 6
3338 6 6 6 6 6 6 7 7 7 8 7 7 7 7 8 8 8 8 8 8 8 8 7 7 7 8 8 8 7 6 5 4 5 5 6 6 6 6 5 5 6 7 6 4 3 3 3 3 4 6 6 6 6 5 5 5 5 6 6 7 6 6 6 5 5 5 6 8 8 9 8 6
$$ packed form
3397FKKjj%J%%jjJ%JJjjk%J%J%%%j%%J%Jj%jj%JJ%%%%%%J%%%%%%%%j%Jj%j%J%j%J%%%J%%j
3388H%%%J%j%jj%%JJ%j%Jjj%%jJJj%K%%kjKJ%J%j%%%%JJj%kj%J%J%%j%j%Jjj%%%%jj%%JJj
3380D%JJ%%J%jj%J%%%J%jJ%jK%j%%j%jJJj%JJJJj%j%j%j%%J%%j%%%J%%%%j%%JJ%j%j%j%%%
3371EJj%%jJJJj%j%jJJJ%jjj%K%J%J%jJKj%%jjj%JjjjJJ%jj%%JjjJJ%J%%%%%%JJ%%%%j%%%
3363GJJj%%%jk%JJJjJJ%jjk%KJJ%jjk%%%%JJj%jJ%JJJ%jkJ%%%%%%J%%%%jK%j%%%%%%%j%Jj
3355Gk%J%%JJjjjJJjjJJK%%%%jjj%%J%%J%jJ%%jj%%J%j%jj%KJJ%j%%JJjjk%J%%jJJJ%j%%%
3346GK%%%%%jjj%%%%%JJ%JJ%jkjJJj%JKj%j%%%%%%J%%j%%jj%%%%JJkjKJ%%j%jj%%JJ%%j%%
3338F%%%%%J%%Jj%%%J%%%%%%%j%%J%%jjjjJ%J%%%j%JJjkj%%%JK%%%j%%%J%Jj%%j%%JK%Jjk
$$ plain form
3329 6 6 6 6 7 5 4 4 4 3 2 3 4 5 6 7 7 6 5 5 5 5 5 5 5 5 5 5 6 6 6 6 6 7 7 5 3 3 3 5 7 7 7 6 5 4 3 4 4 5 6 6 5 5 6 6 7 6 6 5 5 4 4 4 4 4 5 5 6 6 6 6
3321 6 6 5 4 3 2 2 1 3 4 6 7 8 9 9 9 8 7 6 5 5 4 5 5 5 5 5 5 5 4 4 5 5 6 7 6 5 5 6 6 7 7 7 6 5 5 5 4 5 5 6 7 7 6 7 7 5 4 4 5 4 4 4 5 6 7 7 6 5 5 4 4
3312 4 4 5 6 7 7 6 6 6 5 4 3 3 4 6 5 5 5 5 6 7 6 6 5 5 4 4 3 3 2 2 4 5 6 7 7 7 7 6 6 6 6 6 6 6 5 5 4 4 5 5 6 6 7 7 7 6 6 4 4 4 5 6 6 6 5 4 4 4 2 3 5
3304 5 5 5 5 5 4 3 4 6 7 7 7 7 6 6 6 8 8 8 7 7 6 6 7 6 6 6 6 5 5 5 5 5 6 6 6 7 7 7 7 6 5 4 5 6 7 7 7 7 6 5 5 4 7 9 8 6 5 5 4 5 5 4 3 4 4 5 5 6 7 6 6
3295 6 5 6 6 6 6 5 4 5 6 6 6 6 5 4 4 4 5 6 6 7 6 6 5 5 5 6 6 6 6 6 6 5 5 5 5 5 5 4 4 4 4 4 4 4 5 6 6 7 6 6 6 5 4 3 4 4 4 5 5 5 6 7 7 7 6 5 5 5 6 7 8
3287 8 8 8 7 6 6 6 6 5 3 4 4 5 5 6 6 6 7 7 7 7 6 6 6 6 5 5 5 5 6 6 6 6 6 6 6 7 7 6 5 6 7 6 6 6 5 5 5 5 5 5 5 6 6 5 4 4 4 4 5 6 7 6 6 6 7 7 6 6 7 5 4
3278 4 4 4 3 3 3 3 4 5 5 5 5 5 6 6 7 7 8 9 7 6 6 6 6 6 5 5 6 7 7 7 7 6 4 4 6 7 8 9 8 7 6 6 7 7 7 6 5 5 5 4 4 4 4 4 5 6 6 6 5 4 4 5 6 6 6 6 5 5 6 7 7
3270 7 7 7 8 7 7 7 6 6 7 7 7 7 8 8 8 8 9 8 7 7 6 5 3 3 3 3 3 4 4 4 4 4 4 5 5 5 5 4 4 4 4 4 3 3 3 4 6 6 6 6 6 6 6 6 8 9 8 7 6 5 6 5 5 4 4 4 4 5 5 6 6
$$ packed form
3329F%%%Jkj%%jjJJJJJ%jj%%%%%%%%%J%%%%J%kk%%KK%%jjjjJ%JJ%j%J%Jj%j%j%%%%J%J%%%
3321F%jjjj%jKJKJJJ%%jjjj%jJ%%%%%%j%J%JJjj%J%J%%jj%%jJ%JJ%jJ%kj%Jj%%JJJ%jj%j%
3312D%JJJ%j%%jjj%JKj%%%JJj%j%j%j%j%KJJJ%%%j%%%%%%j%j%J%J%J%%j%k%%JJ%%jj%%kJK
3304E%%%%jjJKJ%%%j%%K%%j%j%Jj%%%j%%%%J%%J%%%jjjJJJ%%%jj%jLKjkj%jJ%jjJ%J%JJj%
3295FjJ%%%jjJJ%%%jj%%JJ%Jj%j%%J%%%%%j%%%%%j%%%%%%JJ%Jj%%jjjJ%%J%%JJ%%jj%%JJJ
3287H%%jj%%%jkJ%J%J%%J%%%j%%%j%%%J%%%%%%J%jjJJj%%j%%%%%%J%jj%%%JJJj%%J%j%Jkj
3278D%%j%%%JJ%%%%J%J%JJkj%%%%j%JJ%%%jk%KJJJjjj%J%%jj%%j%%%%JJ%%jj%JJ%%%j%JJ%
3270G%%Jj%%j%J%%%J%%%Jjj%jjk%%%%J%%%%%J%%%j%%%%j%%JK%%%%%%%KJjjjjJj%j%%%J%J%
$$ plain form
3261 6 6 5 5 5 5 4 5 6 6 5 5 6 5 4 4 3 4 4 4 3 3 3 2 4 6 6 5 4 5 5 4 4 4 5 5 5 6 7 5 6 7 7 6 5 5 5 6 6 5 5 5 6 5 5 5 5 3 2 2 2 3 4 4 5 5 5 4 4 5 7 7
3253 7 7 6 6 6 6 6 6 6 4 3 3 5 5 5 5 5 5 5 5 5 6 6 5 5 4 3 4 5 6 6 7 8 8 7 7 7 8 7 6 7 7 8 8 8 7 6 5 5 5 5 6 6 5 6 7 7 6 5 4 4 4 5 6 6 6 7 7 8 8 8 9
3245 9 8 7 8 8 7 6 5 4 5 6 6 7 6 5 6 7 6 5 5 4 5 5 4 4 4 5 5 5 5 4 5 6 6 6 5 5 7 8 8 7 7 7 7 7 6 6 6 5 5 5 6 7 8 7 5 6 5 5 5 5 3 1 2 4 5 6 5 5 5 4 3
3236 3 3 4 5 4 4 4 4 4 4 5 5 7 8 7 6 6 6 8 9 9 9 9 9 9 8 8 8 7 7 6 6 5 4 4 5 5 5 6 6 6 7 7 7 7 7 6 6 6 6 6 6 4 4 6 7 7 8 8 8 8 8 8 8 8 8 8 8 8 8 8 8
3228 8 7 6 7 8 7 6 6 7 8 7 6 6 7 7 7 7 7 7 7 6 6 6 6 6 7 8 8 8 8 7 7 6 7 7 8 8 8 7 6 5 4 4 5 5 7 8 7 7 6 6 7 7 7 6 6 7 7 7 7 7 8 8 7 6 6 6 6 6 5 5 5
3219 5 5 5 5 5 5 6 6 6 6 7 7 8 8 8 8 8 8 7 7 7 7 7 6 5 6 6 6 5 6 6 5 6 6 6 7 8 8 7 6 6 5 5 6 6 7 8 9 8 8 8 9 10 11 11 11 10 9 9 7 6 4 4 4 5 6 7 7 7 8 7 7
3211 7 7 7 7 8 7 7 7 7 7 7 7 8 9 10 10 9 9 9 9 10 10 9 8 7 7 8 10 11 9 8 7 7 8 9 9 8 8 9 9 9 9 9 9 10 10 10 10 9 10 10 9 9 9 9 10 11 11 11 10 9 9 8 8 8 10 11 10 10 9 9 9
3202 9 10 10 10 10 10 9 8 9 10 9 9 8 6 7 8 9 9 8 7 8 8 10 10 9 9 10 10 10 10 9 9 9 9 9 9 8 8 8 8 8 9 9 8 8 9 10 9 8 7 8 9 9 9 9 8 7 6 6 8 8 8 8 8 8 9 9 8 8 8 8 8
$$ packed form
3261F%j%%%jJJ%j%Jjj%jJ%%j%%jKK%jjJ%j%%J%%JJkJJ%jj%%J%j%%Jj%%%kj%%JJ%J%%j%JK%
3253G%j%%%%%%kj%K%%%%%%%%J%j%jjJJJ%JJ%j%%JjjJ%J%%jjj%%%J%jJJ%jjj%%JJ%%J%J%%J
3245IjjJ%jjjjJJ%JjjJJjj%jJ%j%%J%%%jJJ%%j%KJ%j%%%%j%%j%%JJJjkJj%%%kkJKJJj%%jj
3236C%JJj%%%%%J%KJjj%%KJ%%%%%j%%j%j%jj%J%%J%%J%%%%j%%%%%k%KJ%J%%%%%%%%%%%%%%
3228HjjJJjj%JJjj%J%%%%%%j%%%%JJ%%%j%jJ%J%%jjjj%J%KJj%j%J%%j%J%%%%J%jj%%%%j%%
3219E%%%%%J%%%J%J%%%%%j%%%%jjJ%%jJ%jJ%%JJ%jj%j%J%JJJj%%JJJ%%jj%kjk%%JJJ%%Jj%
3211G%%%Jj%%%%%%JJJ%j%%%J%jjj%JKJkjj%JJ%j%J%%%%%J%%%jJ%j%%%JJ%%jj%j%%KJj%j%%
3202IJ%%%%jjJJj%jkJJJ%jjJ%K%j%J%%%j%%%%%j%%%%J%j%JJjjjJJ%%%jjj%K%%%%%J%j%%%%
$$ plain form
3194 8 8 8 8 8 7 6 7 8 7 7 7 9 10 9 9 8 8 9 8 9 9 7 6 5 5 4 5 6 6 6 6 7 7 7 8 8 8 8 8 8 8 9 9 10 9 8 8 7 8 9 8 7 8 8 8 8 8 8 8 8 8 7 7 7 8 8 8 9 7 6 6
3185 6 8 8 8 8 8 9 9 9 8 7 8 10 10 9 8 8 8 7 6 6 6 6 6 7 9 8 8 8 7 7 7 6 7 8 8 8 8 8 8 8 8 8 9 8 8 8 8 8 7 7 8 8 8 9 9 10 10 10 8 8 8 8 9 9 10 10 11 10 10 10 10
3177 10 12 11 11 10 8 8 7 8 9 9 9 9 9 9 9 9 9 9 10 11 11 9 8 8 10 11 11 11 11 12 11 11 11 10 9 10 10 10 9 9 8 7 7 7 8 8 9 10 11 12 12 11 11 11 11 11 11 12 11 11 11 11 11 11 10 11 11 10 9 9
3168 9 10 10 10 10 10 10 10 9 8 7 7 8 7 6 7 8 10 12 13 13 11 10 10 10 10 11 10 9 10 12 12 13 13 12 11 12 12 12 12 13 12 12 12 12 13 15 14 12 12 13 14 13 13 13 13 12 12 11 11 11 12 12 13 13 13 13 11 11 12 13 13
3160 13 15 16 16 16 15 14 14 15 14 14 13 13 13 12 12 10 10 11 12 13 14 15 16 15 15 14 15 16 15 15 15 14 14 14 14 14 14 14 15 16 17 18 18 17 16 16 16 16 16 16 17 18 18 19 19 18 18 17 16 17 17 17 18 18 18 18 18 19 19 19
3152 19 21 21 20 19 19 18 18 18 18 20 19 19 19 19 20 21 19 18 19 19 20 20 20 20 19 19 19 19 18 20 21 21 20 20 20 20 21 21 22 22 22 23 23 23 22 23 26 26 25 24 23 23 22 23 23 24 25 25 25 24 23 23 23 23 22 22 23 23 23 23
3143 23 24 26 27 26 26 24 23 24 25 25 25 25 25 25 26 25 25 25 25 26 27 26 26 26 26 26 26 26 27 29 30 31 31 32 34 34 35 34 32 33 34 33 33 33 32 32 31 32 32 32 33 33 33 32 31 32 33 35 36 36 36 36 35 36 36 37 39 40 41 41
3135 41 41 41 41 42 43 42 42 42 43 43 42 43 44 46 48 48 48 48 48 48 47 48 48 49 49 50 51 52 53 54 55 54 53 53 54 55 55 57 58 59 60 60 60 61 62 62 63 64 66 65 65 64 66 69 70 71 72 73 75 76 77 78 79 79 80 80 81 83 85 85
$$ packed form
3194H%%%%jjJJj%%KJj%j%JjJ%kjj%jJJ%%%J%%J%%%%%%J%Jjj%jJJjjJ%%%%%%%%j%%J%%Jkj%
3185FK%%%%J%%jjJK%jj%%jj%%%%JKj%%j%%jJJ%%%%%%%%Jj%%%%j%J%%J%J%%k%%%J%J%Jj%%%
3177A0Kj%jk%jJJ%%%%%%%%%JJ%kj%KJ%%%Jj%%jjJ%%j%jj%%J%JJJJ%j%%%%%Jj%%%%%jJ%jj%
3168IJ%%%%%%jjj%JjjJJKKJ%kj%%%JjjJK%J%jjJ%%%Jj%%%JKjk%JJj%%%j%j%%J%J%%%k%JJ%
3160A3KJ%%jj%Jj%j%%j%k%JJJJJJj%jJJj%%j%%%%%%JJJJ%jj%%%%%JJ%J%j%jjJ%%J%%%%J%%
3152A9K%jj%j%%%Kj%%%JJkjJ%J%%%j%%%jKJ%j%%%J%J%%J%%jJL%jjj%jJ%JJ%%jj%%%j%J%%%
3143B3JKJj%kjJJ%%%%%Jj%%%JJj%%%%%%JKJJ%JK%JjkJJj%%j%jJ%%J%%jjJJKJ%%%jJ%JKJJ%
3135D1%%%JJj%%J%jJJKK%%%%%jJ%J%JJJJJJjj%JJ%KJJJ%%JJ%JJKj%jKLJJJJKJJJJ%J%JKK%
$$ plain form
3127 85 86 87 87 89 92 93 94 96 97 98 100 100 101 102 103 104 104 106 107 109 111 112 114 116 119 121 122 124 125 127 130 132 134 136 138 139 140 142 143 146 148 151 155 158 161 162 164 166 169 172 176 178 181 185 189 192 195 198 201 203 205 209 213 217 221 226 231 235 239 243
3118 243 246 251 257 261 266 270 274 279 283 288 294 299 304 310 315 320 324 329 334 339 345 350 355 361 367 373 379 385 392 398 404 411 418 423 428 433 438 442 445 451 456 461 466 470 474 479 484 489 493 496 500 501 503 506 509 512 516 516 517 517 518 519 522 523 522 520 519 517 516
3110 516 515 513 512 510 507 504 501 499 496 494 491 488 483 478 473 469 464 458 453 448 444 440 434 429 424 419 413 406 400 394 389 385 380 374 368 362 358 353 347 341 335 329 324 319 315 311 304 297 292 289 284 280 274 270 268 264 259 254 250 247 243 239 235 232 227 224 221 216 211
3102 211 208 205 201 199 198 195 192 189 185 182 179 176 173 171 168 165 163 161 160 157 154 152 149 147 145 143 140 139 138 137 135 135 133 130 127 125 123 122 120 118 117 115 113 112 111 109 108 107 107 105 104 102 101 99 98 97 96 95 94 93 93 93 91 90 88 87 87 86 85
3094 85 85 85 83 81 79 79 80 79 77 76 76 76 74 72 72 71 70 69 69 68 68 67 66 65 65 64 63 63 63 63 62 61 61 60 60 60 59 58 56 56 56 56 56 55 54 55 56 55 54 53 52 53 53 51 50 49 49 48 47 47 47 46 45 46 49 49 47 46 46 46
3085 46 46 45 45 45 43 42 42 41 42 42 41 40 40 39 39 39 39 39 39 38 38 38 37 36 35 34 33 32 33 34 34 34 34 33 33 33 32 33 34 34 34 34 34 34 33 32 31 31 31 32 31 29 30 31 31 31 31 31 31 31 30 30 30 31 30 30 28 27 26 25
3077 25 26 26 27 28 28 28 28 29 28 28 27 26 26 26 25 25 25 25 25 25 25 25 24 23 25 27 26 26 27 28 26 25 25 24 25 24 23 24 24 25 25 25 25 25 24 23 23 23 22 21 21 21 21 21 22 22 22 21 21 21 21 21 21 22 21 20 19 19 19 19
3069 19 18 18 18 18 18 17 18 19 19 19 19 19 19 19 19 19 18 17 18 18 18 18 17 16 17 17 17 17 17 17 16 16 15 15 14 14 14 15 17 18 19 19 18 17 17 16 15 14 15 15 15 15 15 16 16 17 16 15 14 15 17 17 17 16 16 14 14 15 16 15
$$ packed form
3127H5JJ%KLJJKJJK%JJJJ%KJKKJKKLKJKJKLKKKKJJKJLKLMLLJKKLLMKLMMLLLLKKMMMMNNMMM
3118B43LNOMNMMNMNONNONNMNNNONNOOOOOPOOPPNNNNMLONNNMMNNNMLMJKLLLM%J%JJLJjkjkj
3110E16jkjklllklkllnnnmnonnmmonnnopoonmnooomnoooonnmmppnlnmomkmnnmlmmmlnllnn
3102B11llmkjlllmllllkllkkjllklkkkljjjk%kllkkjkkjkkjjkjj%kjkjkjjjjjj%%kjkj%jj
3094H5%%kkk%Jjkj%%kk%jjj%j%jjj%jj%%%jj%j%%jjk%%%%jjJJjjjjJ%kjj%jj%%jjJL%kj%%
3085D6%j%%kj%jJ%jj%j%%%%%j%%jjjjjjJJ%%%j%%jJJ%%%%%jjj%%JjkJJ%%%%%%j%%Jj%kjjj
3077B5J%JJ%%%Jj%jj%%j%%%%%%%jjKKj%JJkj%jJjjJ%J%%%%jj%%jj%%%%J%%j%%%%%Jjjj%%%
3069A9j%%%%jJJ%%%%%%%%jjJ%%%jjJ%%%%%j%j%j%%JKJJ%jj%jjjJ%%%%J%JjjjJK%%j%k%JJj
$$ plain form
3060 15 15 16 15 15 16 16 15 14 13 14 14 13 13 12 12 13 13 13 13 13 13 13 14 15 15 14 14 14 13 13 12 12 13 14 13 14 14 14 13 12 11 12 12 13 13 13 13 13 13 11 10 10 11 12 13 14 14 14 15 15 16 17 16 15 15 14 13 12 12 13
3052 13 12 11 12 12 13 13 13 13 13 13 13 13 13 13 13 13 12 12 14 15 14 12 12 12 12 12 13 13 13 13 14 15 14 14 13 12 12 13 12 11 11 11 12 12 12 11 12 12 13 13 13 13 12 12 12 12 13 13 13 13 13 13 13 12 12 12 12 12 11 9
3044 9 9 8 9 10 11 11 12 11 11 12 12 12 12 11 11 10 10 10 11 11 12 12 12 12 11 10 9 10 11 11 10 9 9 9 9 9 10 11 10 9 9 9 9 10 10 10 10 11 10 9 6 5 5 7 9 11 11 10 10 11 11 11 12 10 9 9 9 9 9 8 8
3035 8 8 8 7 8 10 10 11 12 11 9 9 10 10 11 12 12 11 11 11 11 12 11 10 9 8 9 9 9 7 7 7 6 6 6 8 8 9 9 9 8 8 8 8 9 9 8 8 8 9 9 8 8 8 8 8 8 8 10 9 9 8 8 8 9 10 11 11 10 9 11 11
3027 11 9 8 8 8 8 8 9 9 10 11 11 12 12 12 12 10 9 9 9 10 10 9 9 8 9 10 10 9 9 8 8 8 7 7 7 10 11 10 9 10 10 9 9 10 10 10 10 10 10 10 10 10 11 11 10 10 11 12 11 11 11 11 12 13 12 12 11 11 13 13
3018 13 12 11 10 10 11 13 14 13 12 12 12 12 12 12 12 11 11 11 10 9 10 10 10 11 12 11 12 13 13 12 12 12 13 13 11 9 9 10 13 15 15 14 14 14 14 15 15 16 16 16 15 14 15 17 16 15 15 15 16 17 17 18 19 21 20 18 17 16 15 14
3010 14 14 13 12 11 12 13 14 15 13 11 10 10 10 9 9 9 10 11 12 13 12 12 12 13 14 14 15 16 17 17 17 18 18 18 18 19 20 21 22 24 25 25 26 28 29 30 30 30 29 30 32 32 31 31 31 32 31 30 29 29 28 26 25 24 22 21 22 22 22 22
3002 22 22 23 21 18 16 16 16 16 15 14 14 14 14 14 13 13 13 13 14 14 14 13 14 14 15 15 15 16 17 16 17 19 21 23 23 24 25 26 28 29 29 28 27 27 26 27 28 29 28 28 27 26 26 26 24 25 25 24 24 24 24 23 23 21 19 19 18 17 18 17
$$ packed form
3060A5%Jj%J%jjjJ%j%j%J%%%%%%JJ%j%%j%j%JJjJ%%jjjJ%J%%%%%kj%JJJJ%%J%JJjj%jjj%J
3052A3jjJ%J%%%%%%%%%%%j%KJjk%%%%J%%%JJj%jj%Jjj%%J%%jJ%J%%%j%%%J%%%%%%j%%%%jk
3044I%jJJJ%Jj%J%%%j%j%%J%J%%%jjjJJ%jj%%%%JJjj%%%J%%%Jjjlj%KKK%j%J%%Jkj%%%%j%
3035H%%jJK%JJjk%J%JJ%j%%%JjjjjJ%%k%%j%%K%J%%j%%%J%j%%J%j%%%%%%Kj%j%%JJJ%jjK%
3027A1kj%%%%J%JJ%J%%%kj%%J%j%jJJ%j%j%%j%%LJjjJ%j%J%%%%%%%%J%j%JJj%%%JJj%j%K%
3018A3jjj%JKJjj%%%%%%j%%jjJ%%JJjJJ%j%%J%kk%JLK%j%%%J%J%%jjJKjj%%JJ%JJKjkjjjj
3010A4%jjjJJJJkkj%%j%%JJJJj%%JJ%JJJ%%J%%%JJJJKJ%JKJJ%%jJK%j%%Jjjj%jkjjkjJ%%%
3002B2%Jklk%%%jj%%%%j%%%J%%jJ%J%%JJjJKKK%JJJKJ%jj%jJJJj%jj%%kJ%j%%%j%kk%jjJj
$$ plain form
2993 17 16 14 14 14 13 11 11 13 13 12 11 11 10 10 9 8 7 7 7 9 9 10 10 8 7 7 6 7 9 9 9 8 9 10 9 8 8 8 9 9 9 8 8 8 7 6 6 6 7 6 6 5 5 6 7 6 7 7 8 7 6 7 9 9 9 8 8 6 5 5
2985 5 6 6 6 6 6 6 6 5 4 4 5 5 6 6 7 7 8 6 6 7 7 8 8 9 8 7 6 7 7 7 7 7 7 8 8 7 6 6 7 6 6 6 7 9 9 9 9 9 9 8 6 5 5 5 7 8 8 8 8 8 9 10 11 11 11 10 9 8 9 10 10
2976 10 11 11 11 11 12 11 11 11 11 12 12 13 13 14 12 12 11 11 12 12 13 13 12 13 13 13 12 10 10 11 12 14 14 12 13 15 17 16 15 15 14 14 14 16 16 14 14 14 14 13 13 13 12 12 11 11 10 10 11 11 11 12 12 12 13 12 12 12 11 10
2968 10 11 10 10 9 8 9 11 11 12 13 14 14 13 12 11 11 10 10 9 10 11 11 10 8 8 8 7 7 7 8 9 9 9 10 10 10 10 10 10 9 9 9 8 8 8 7 8 8 8 8 8 8 8 8 7 7 6 6 5 4 3 3 4 4 5 5 6 7 7 7
2960 7 7 7 7 8 9 9 8 8 7 7 7 8 8 8 7 9 10 9 9 9 10 9 8 8 9 9 9 8 8 10 10 9 8 8 8 8 8 9 9 8 9 9 10 9 9 8 8 8 8 8 8 7 6 6 7 8 9 9 7 6 7 8 7 8 8 9 9 9 8 8 8
2951 8 8 7 7 9 9 8 9 9 9 9 10 11 11 11 11 10 8 8 9 10 10 10 11 11 14 14 14 13 12 11 12 12 11 11 11 12 12 12 11 9 7 8 8 7 7 6 6 6 6 6 6 7 9 11 13 14 13 12 13 13 12 12 12 13 14 16 17 17 17 17 17
2943 17 17 17 16 15 15 15 15 16 16 18 20 21 22 22 22 23 23 23 23 24 25 26 26 27 28 27 29 30 31 30 30 31 32 33 34 37 39 40 40 42 45 49 51 53 57 61 64 68 75 82 91 101 115 131 154 181 213 248 283 314 336
2936 336 349 356 362 372 387 402 415 421 419 408 388 361 330 299 274 256 247 244 247 253 257 258 254 246 233 218 203 191 180 173 170 168 168 168 170 173 178 186 195 206 219 235 252 273 300 331
$$ packed form
2993A7jk%%jk%K%jj%j%jjj%%K%J%kj%jJK%%jJJjj%%J%%j%%jj%%Jj%j%JJjJ%JjjJK%%j%kj%
2985EJ%%%%%%jj%J%J%J%Jk%J%J%JjjjJ%%%%%J%jj%Jj%%JK%%%%%jkj%%KJ%%%%JJJ%%jjjJJ%
2976A0J%%%Jj%%%J%J%Jk%j%J%J%jJ%%jk%JJK%kJKKjj%j%%K%k%%%j%%j%j%j%J%%J%%Jj%%jj
2968A0Jj%jjJK%JJJ%jjj%j%jJJ%jk%%j%%JJ%%J%%%%%j%%j%%jJ%%%%%%%j%j%jjj%J%J%JJ%%
2960G%%%JJ%j%j%%J%%jKJj%%Jjj%J%%j%K%jj%%%%J%jJ%Jj%j%%%%%jj%JJJ%kjJJjJ%J%%j%%
2951H%j%K%jJ%%%JJ%%%jk%JJ%%J%L%%jjjJ%j%%J%%jkkJ%j%j%%%%%JKKKJjjJ%j%%JJKJ%%%%
2943A7%%jj%%%J%KKJJ%%J%%%JJJ%JJjKJJj%JJJJLKJ%KLMKKMMLMPPRJ0J4J6K3K7L2L5L5L1K2
2936C36J3POJ0J5J5J3Okj1k0k7l1l1k5j8rlLOMJmqj3j5j5j2j1plk%%KLNQRJ1J3J6J7K1K7L1
$$ plain form
2930 331 366 407 450 494 538 579 616 643 662 673 682 698 721 758 810 882 981 1111 1280 1495 1759 2070 2413 2759 3069 3311 3470 3551 3557 3486 3337
2926 3337 3111 2830 2535 2264 2042 1882 1791 1770 1816 1927 2096 2321 2589 2886 3192 3475 3701 3837 3864 3787 3638 3454 3261 3082 2929
2923 2929 2815 2741 2705 2709 2758 2858 3019 3250 3570 4000 4568 5310 6255 7406 8719 10082 11329 12272 12749 12671 12046 10985 9657
2921 9657 8243 6884 5675 4660 3844 3207 2718 2343 2056 1833 1656 1513 1394 1293 1208 1134 1072 1019 978 946 923 908 898 891 884 875 863
2917 863 850 836 820 803 787 775 769 774 788 809 836 865 888 897 889 862 817 760 693 624 557 494 440 393 356 323 297 275 257 243 230 217 206 196 188 182 178 173 170
2913 170 166 160 154 150 146 140 135 129 124 119 114 109 106 104 102 100 99 97 95 94 93 92 89 87 84 83 82 80 79 78 76 74 72 72 71 71 70 69 69 69 69 68 68 67 67 66 66 67 69 71 74 75 76 77 80 85 90 96 103 111 121 132 146 157 164
2905 164 169 171 171 170 166 158 149 141 133 125 120 115 112 110 109 111 113 116 119 124 131 139 148 157 167 175 182 187 188 190 194 201 211 224 241 264 294 332 377 427 482 536 586 625 651 658 648 624 593 556 518
2899 518 481 448 421 400 388 386 393 410 438 479 529 590 655 718 772 808 828 834 832 825 812 792 764 726 680 632 588 552 525 510 505 510 523 543 570 601 634 662
$$ packed form
2930C31L5M1M3M4M4M1L7K7J9J1RJ6K3L7N2P2R9J30J69K15K64L11L43L46L10K42J59Q1Op1j49
2926C337k26k81k95k71k22j60r1k1M6J11J69K25K68K97L06K83K26J36K7p7j49j84j93j79j53
2923B929j14p4l6MM9J00J61K31L20M30N68P42R45J151J313J363J247R43M77p8o25j061j328
2921I657j414j359j209j015q16o37m89l75k87k23j77j43j19j01q5p4o2n3m1l2k3j5j0pprj2
2917H63j3j4j6j7j6j2oNJ4K1K7K9K3Rqk7m5n7o7o9o7o3n4m7l7l3k6k2j8j4j3j3j1j0qomnl
2913A70moommononnnnlkkkjkkjjjlkljjkjjkkk%j%jj%%%j%j%j%JKKLJJJLNNOPQJ0J1J4J1P
2905A64NK%jmqrqqqnnlkjKKLLNPQRRJ0QPNJKMPJ0J3J7K3L0L8M5N0N5N4N0L9K6Pj0k4l1l7l8
2899E18l7l3k7k1j2kPJ7K8M1N0O1O5O3N4L6K0Okpj3k0k8l8m6m8m4l6k7j5nNJ3K0K7L1L3K8
$$ plain form
2894 662 683 699 710 721 731 743 753 759 761 763 763 761 756 745 731 716 703 694 691 694 703 720 746 778 813 850 885 910 920 912 888 852 808 760 713 669 631 601 582 574 576
2889 576 583 595 604 609 606 598 586 569 550 531 511 494 483 480 481 487 492 492 485 470 447 422 395 374 358 351 350 354 362 375 391 409 426 443 458 464 460 445 423 397 368 337 309
2884 309 281 256 233 214 199 187 180 177 179 184 194 206 219 231 243 253 256 252 243 227 209 190 173 157 142 128 117 108 99 93 86 83 80 80 79 78 77 75 73 69 66 64 63 62 61 60 60 59 58
2879 58 56 54 52 51 51 51 49 48 47 46 45 43 42 41 40 39 38 37 36 36 34 33 32 31 31 30 29 29 28 27 27 26 26 25 25 24 23 22 22 21 21 21 20 19 18 16 16 16 17 18 18 19 20 21 20 20 20 19 19 19 18 17 17 16 16 16 16 16 17 19
2870 19 18 18 17 17 17 18 18 18 19 19 19 18 18 17 18 19 19 19 19 19 18 18 17 17 16 16 16 19 20 18 17 16 14 15 15 15 15 15 15 16 15 16 15 14 15 16 17 17 18 18 19 20 19 18 17 16 15 13 14 15 16 16 16 17 18 17 17 17 16 17
2862 17 17 16 15 15 15 15 15 15 16 18 18 19 17 16 16 15 15 14 13 14 13 13 13 14 15 14 13 13 15 17 17 18 18 18 18 18 18 16 14 14 15 15 14 14 13 13 14 14 13 13 14 15 15 15 15 14 14 15 16 16 15 16 16 16 17 17 18 19 20 21
2853 21 21 21 22 23 22 21 22 22 22 20 20 21 23 22 22 21 22 22 22 21 22 21 19 19 20 21 21 21 21 21 21 20 20 20 19 18 17 16 17 17 17 17 17 16 16 16 16 15 17 19 21 23 23 23 23 25 26 27 28 28 29 30 31 32 34 36 36 37 38 39
2845 39 42 44 45 46 47 46 45 43 41 38 36 35 33 32 31 30 29 29 28 28 25 22 20 20 20 20 20 20 19 18 18 18 18 18 19 18 18 19 19 19 19 20 20 20 20 22 24 24 24 23 23 22 23 23 23 24 26 25 25 26 27 29 30 30 29 30 30 29 28 27
$$ packed form
2894F62K1J6J1J1J0J2J0OKK%knj1j4j5j3rlLRJ7K6L2L5L7L5K5J0qk4l6m4m8m7m4l8l0j9qK
2889E76PJ2RNlqj2j7j9j9k0j7j1lJON%pj5k3k5k7k1j6pjMQJ3J6J8J7J7J5Omj5k2k6k9l1k8
2884C09k8k5k3j9j5j2plKNJ0J2J3J2J2J0Lmrj6j8j9j7j6j5j4j1rropll%jjjkkmlkjjjj%jj
2879E8kkkj%%kjjjjkjjjjjjj%kjjj%jj%jj%j%j%jjj%j%%jjjk%%JJ%JJJj%%j%%jj%j%%%%JK
2870A9j%j%%J%%J%%j%jJJ%%%%j%j%j%%LJkjjkJ%%%%%JjJjjJJJ%J%JJjjjjjkJJJ%%JJj%%jJ
2862A7%jj%%%%%JK%Jkj%j%jjJj%%JJjj%KK%J%%%%%kk%J%j%j%J%j%JJ%%%j%JJ%jJ%%J%JJJJ
2853B1%%JJjjJ%%k%JKj%jJ%%jJjk%JJ%%%%%j%%jjjjJ%%%%j%%%jKKKK%%%KJJJ%JJJJKK%JJJ
2845C9LKJJJjjkklkjkjjjj%j%llk%%%%%jj%%%%Jj%J%%%J%%%KK%%j%jJ%%JKj%JJKJ%jJ%jjj
$$ plain form
2837 27 27 27 27 26 26 27 27 26 26 26 25 23 22 21 19 17 16 16 18 17 17 16 15 15 14 12 13 12 12 11 11 11 11 12 12 13 13 14 13 13 13 13 13 13 13 12 12 12 11 11 11 12 11 11 11 10 10 9 9 10 10 10 11 11 11 11 11 11 11 11
2828 11 11 10 11 11 11 12 13 13 12 11 10 9 8 9 10 11 11 12 12 12 11 11 12 13 13 12 13 13 13 13 13 13 14 14 14 15 14 14 14 13 15 16 16 17 15 13 12 12 13 12 12 13 13 14 14 13 13 13 13 13 13 12 12 11 12 12 12 12 12 13
2820 13 13 13 13 14 14 15 14 14 14 14 13 12 12 12 13 14 15 17 17 17 16 15 16 17 17 18 16 15 16 16 17 17 17 17 17 16 15 14 13 12 13 13 14 14 15 15 15 14 14 13 14 15 15 15 15 14 14 14 14 15 15 15 15 15 14 14 14 14 14 14
2812 14 15 16 15 15 16 18 16 15 14 14 14 14 15 15 15 15 15 15 16 16 15 15 13 12 11 10 11 12 13 14 15 16 16 15 15 15 14 13 14 14 13 12 13 15 15 15 14 13 12 12 12 12 12 12 12 13 12 11 12 12 12 12 11 11 12 13 12 12 12 12
2803 12 12 11 11 11 11 11 12 13 13 13 13 12 11 10 10 10 10 10 11 12 10 10 12 12 11 11 10 8 9 10 10 11 11 11 11 10 10 9 10 11 12 12 12 12 11 10 10 11 11 12 12 12 12 12 12 11 12 12 13 14 13 12 12 12 14 13 13 12 11 10
2795 10 9 8 7 8 10 11 11 12 12 13 12 11 9 8 7 8 9 8 7 8 9 8 7 9 11 12 11 10 9 9 8 7 8 8 9 11 11 11 11 11 11 11 10 11 12 12 12 11 11 12 12 11 11 11 12 13 12 10 9 9 10 11 11 11 10 9 9 9 9 10
2787 10 11 11 10 10 10 10 9 9 9 10 10 9 8 9 9 9 9 9 9 9 8 7 8 9 10 10 10 9 9 8 8 9 9 9 8 8 9 9 9 8 9 9 9 10 11 12 12 12 11 11 10 9 10 10 10 10 10 11 12 13 13 13 13 13 13 12 11 11 12 11
2778 11 11 10 10 9 9 10 10 11 11 10 9 8 9 9 9 9 10 11 11 12 11 11 10 9 8 8 8 9 10 11 11 12 10 9 9 9 8 8 10 11 11 12 13 14 13 13 13 12 12 12 11 11 11 12 12 12 11 11 11 11 11 10 11 12 13 13 13 13 13 12
$$ packed form
2837B7%%%j%J%j%%jkjjkkj%Kj%jj%jkJj%j%%%J%J%Jj%%%%%%j%%j%%Jj%%j%j%J%%J%%%%%%%
2828A1%jJ%%JJ%jjjjjJJJ%J%%j%JJ%jJ%%%%%J%%Jj%%jKJ%Jkkj%Jj%J%J%j%%%%%j%jJ%%%%J
2820A3%%%J%Jj%%%jj%%JJJK%%jjJJ%JkjJ%J%%%%jjjjjJ%J%J%%j%jJJ%%%j%%%J%%%%j%%%%%
2812A4JJj%JKkjj%%%J%%%%%J%j%kjjjJJJJJJ%j%%jjJ%jjJK%%jjj%%%%%%JjjJ%%%j%JJj%%%
2803A2%j%%%%JJ%%%jjj%%%%JJk%K%j%jkJJ%J%%%j%jJJJ%%%jj%J%J%%%%%jJ%JJjj%%Kj%jjj
2795A0jjjJKJ%J%JjjkjjJJjjJJjjKKJjjj%jjJ%JK%%%%%%jJJ%%j%J%j%%JJjkj%JJ%%jj%%%J
2787A0J%j%%%j%%J%jjJ%%%%%%jjJJJ%%j%j%J%%j%J%%jJ%%JJJ%%j%jjJ%%%%JJJ%%%%%jj%Jj
2778A1%j%j%J%J%jjjJ%%%JJ%Jj%jjj%%JJJ%Jkj%%j%KJ%JJJj%%j%%j%%J%%j%%%%jJJJ%%%%j
$$ plain form
2770 12 12 12 11 11 10 10 10 10 11 12 12 12 11 11 11 12 13 12 12 11 12 14 16 17 15 14 13 13 14 14 15 15 14 14 15 14 14 13 14 14 15 17 17 16 16 15 15 15 14 13 14 14 14 13 13 13 13 13 13 12 12 12 13 14 14 13 13 12 12 14
2762 14 14 14 14 13 13 13 12 12 11 11 12 12 11 10 10 11 11 12 13 13 12 12 12 12 11 10 9 8 9 10 10 11 12 11 10 9 9 9 9 9 10 10 11 12 13 12 11 12 12 11 11 10 9 8 9 10 10 10 10 10 9 9 10 9 8 9 10 11 11 11
2753 11 11 10 11 11 11 11 10 10 11 11 12 13 14 15 14 14 13 14 14 13 13 13 12 11 10 11 12 11 11 10 11 11 11 11 11 10 10 9 9 9 10 10 9 9 11 12 12 12 12 12 13 13 13 12 12 12 12 12 11 10 10 11 10 10 11 11 12 12 11 10
2745 10 10 11 12 13 13 13 13 13 12 12 12 13 12 12 11 11 11 11 11 11 11 11 11 11 10 10 11 12 12 12 12 12 12 13 13 12 11 10 10 9 10 11 11 11 12 12 12 12 12 12 12 11 12 13 13 13 13 13 12 11 11 10 11 12 12 13 12 11 11 11
2737 11 11 12 13 14 13 13 13 13 13 13 12 11 11 10 11 12 13 14 14 15 14 14 14 14 13 13 13 13 14 16 15 14 14 14 14 15 15 16 15 14 13 13 14 14 14 13 13 12 12 12 12 12 12 12 13 13 14 15 14 14 14 15 15 15 15 15 14 14 14 14
2728 14 13 12 12 13 14 15 14 13 14 15 14 14 15 15 13 13 15 16 16 16 16 16 16 16 15 14 14 14 15 15 14 13 13 15 15 13 13 15 16 17 18 19 17 16 16 17 17 18 18 18 18 18 18 18 17 17 17 18 18 19 19 18 17 17 17 17 18 19 19 17
2720 17 16 15 16 17 17 17 17 16 16 16 16 16 15 16 18 19 20 20 21 20 19 20 20 19 20 20 21 21 21 22 22 21 20 19 18 18 18 19 20 19 17 17 17 17 18 20 21 22 21 20 20 20 20 20 21 20 18 19 19 20 20 21 20 20 19 20 20 20 19 18
2712 18 18 19 18 18 18 18 19 19 21 22 22 21 21 21 21 20 21 22 23 22 21 22 22 22 22 23 23 22 22 22 23 24 24 24 24 23 24 25 26 26 26 26 27 28 27 26 27 27 27 27 27 26 26 25 25 25 26 27 28 28 28 28 28 28 28 28 28 28 27 28
$$ packed form
2770A2%%j%j%%%JJ%%j%%JJj%jJKKJkjj%J%J%j%Jj%jJ%JK%j%j%%jjJ%%j%%%%%j%%JJ%j%j%K
2762A4%%%j%%j%j%J%jj%J%JJ%j%%%jjjjJJ%JJjjj%%%%J%JJJjjJ%j%jjjJJ%%%%j%JjjJJJ%%
2753A1%jJ%%%j%J%JJJJj%jJ%j%%jjjJJj%jJ%%%%j%j%%J%j%KJ%%%%J%%j%%%%jj%Jj%J%J%jj
2745A0%JJJ%%%%j%%Jj%j%%%%%%%%%j%JJ%%%%%J%jjj%jJJ%%J%%%%%%jJJ%%%%jj%jJJ%Jjj%%
2737A1%JJJj%%%%%jj%jJJJJ%Jj%%%j%%%JKjj%%%J%Jjjj%J%%j%j%%%%%%J%JJj%%J%%%%j%%%
2728A4jj%JJJjjJJj%J%k%KJ%%%%%%jj%%J%jj%K%k%KJJJJkj%J%J%%%%%%j%%J%J%jj%%%JJ%k
2720A7jjJJ%%%j%%%%jJKJJ%JjjJ%jJ%J%%J%jjjj%%JJjk%%%JKJJjj%%%%JjkJ%J%Jj%jJ%%jj
2712A8%Jj%%%J%KJ%j%%%jJJJjjJ%%%J%j%%JJ%%%jJJJ%%%JJjjJ%%%%j%j%%JJJ%%%%%%%%%jJ
$$ plain form
2703 28 29 29 30 28 27 26 28 30 30 30 31 32 32 31 31 31 32 34 33 32 34 35 36 37 36 36 35 36 37 38 38 37 37 38 38 39 41 42 42 40 40 41 41 40 40 40 41 40 40 42 44 45 45 46 46 45 45 45 46 47 47 48 48 49 49 49 50 51 51 51
2695 51 52 53 53 52 54 56 56 57 57 57 59 61 64 66 67 66 65 65 65 66 69 71 72 73 74 74 74 73 73 75 77 79 79 79 81 82 83 83 83 85 86 88 89 91 91 91 93 95 98 102 104 104 105 107 109 111 113 115 117 119 120 121 124 127 130 132 133 135 136 138
2687 138 140 143 144 148 153 156 158 160 163 165 169 174 178 180 183 188 193 197 202 207 212 218 222 227 232 237 242 247 252 257 263 269 274 281 288 295 302 310 317 325 332 339 346 355 365 375 384 393 402 412 423 433 442 451 461 472 482 492 503
2680 503 514 525 536 546 556 567 577 587 597 606 615 625 635 644 653 660 667 674 682 689 693 698 702 706 709 712 714 714 713 713 712 711 710 707 703 698 695 692 686 680 674 669 662 653 644 635 625 616 607 597 587 577 568 557
2673 557 547 535 523 514 504 493 482 472 461 451 440 430 421 412 403 393 385 377 368 359 352 344 336 329 322 315 307 299 290 284 278 272 267 262 255 248 241 236 230 226 222 219 214 207 202 198 195 193 190 188 184 179 174 169 166 163 160
2666 160 157 154 152 149 146 144 142 140 138 136 135 132 129 126 123 121 119 118 115 112 110 109 108 107 107 105 103 101 97 95 94 94 93 92 91 88 87 85 85 85 83 82 81 80 79 78 77 77 75 73 72 73 73 73 72 71 69 68 67 66 65 64 63 61 60 59 60 60 60
2658 60 60 59 58 59 59 57 56 55 54 53 52 51 50 50 51 51 50 49 48 48 49 48 47 46 46 45 45 46 47 47 46 45 45 44 43 42 42 42 42 42 42 43 42 41 41 40 39 39 40 40 39 37 35 35 35 35 35 35 34 34 34 34 33 34 35 34 34 33 33 33
2650 33 32 33 33 33 33 33 31 30 30 30 30 29 28 29 30 30 30 30 30 29 29 30 31 30 30 29 29 29 28 29 29 30 30 30 28 27 26 24 23 24 25 27 28 28 29 29 28 27 26 27 26 26 25 24 22 22 22 21 22 23 24 24 25 26 26 26 25 25 25 25
$$ packed form
2703B8J%JkjjKK%%JJ%j%%JKjjKJJJj%jJJJ%j%J%JKJ%k%J%j%%Jj%KKJ%J%j%%JJ%J%J%%JJ%%
2695E1JJ%jKK%J%%KKLKJjj%%JLKJJJ%%j%KKK%%KJJ%%KJKJK%%KKLMK%JKKKKKKKJJLLLKJKJK
2687A38KLJMNLKKLKMNMKLNNMNNNOMNNNNNNNOONPPPPQPQPPPRJ0J0RRRJ0J1J0RRJ0J1J0J0J1
2680E03J1J1J1J0J0J1J0J0J0RRJ0J0RRPPPQPMNMMLLK%j%jjjlmnllooonprrrj0rrj0j0j0rj1
2673E57j0j2j2rj0j1j1j0j1j0j1j0rrrj0qqrrpqqpppqqrooonnpppnommlnpnmlklkmnnnlll
2666A60llkllkkkkkjllllkkjllkjjj%kkkmkj%jjjljk%%kjjjjjj%kkjJ%%jjkjjjjjjkjjJ%%
2658F0%jjJ%kjjjjjjj%J%jjj%Jjjj%j%JJ%jj%jjj%%%%%Jjj%jj%J%jkk%%%%%j%%%jJJj%j%%
2650C3jJ%%%%kj%%%jjJJ%%%%j%JJj%j%%jJ%J%%kjjkjJJKJ%J%jjjJj%jjk%%jJJJ%JJ%%j%%%
$$ plain form
2641 25 25 24 23 23 24 25 23 21 22 22 21 21 21 21 21 21 21 22 21 21 22 22 22 21 21 21 21 20 20 20 19 19 20 19 18 18 18 18 19 20 20 19 19 18 18 18 19 19 19 18 17 17 16 16 16 17 18 17 16 16 17 17 17 18 19 19 19 19 18 18
2633 18 17 16 15 17 19 18 17 17 17 17 16 16 16 18 18 17 16 16 16 16 16 16 15 15 15 15 15 15 15 15 14 15 15 15 15 16 18 17 16 15 14 15 16 16 16 16 16 16 15 15 15 15 15 15 14 15 16 17 16 16 15 14 14 14 14 14 14 14 15 15
2625 15 14 12 13 15 17 16 15 13 13 13 14 14 14 15 16 16 16 15 14 13 12 12 11 12 13 14 14 14 14 14 14 15 15 15 16 15 15 15 14 14 13 13 13 13 15 15 15 14 14 13 13 13 13 13 12 12 12 10 11 12 13 12 12 12 12 14 14 13 13 12
2616 12 11 10 10 10 11 13 13 12 12 13 13 13 13 14 14 12 12 12 13 14 14 13 12 13 14 14 15 14 14 14 13 12 12 13 14 14 14 13 13 12 12 13 13 13 13 11 11 11 12 11 11 11 12 13 13 13 12 12 11 11 11 13 14 13 13 12 11 11 11 12
2608 12 13 14 14 13 12 12 11 10 11 11 11 12 11 10 9 10 11 11 12 14 15 13 12 11 11 12 14 13 12 12 12 11 10 11 12 12 11 11 12 11 10 11 12 13 12 12 11 13 13 12 13 13 14 13 12 11 11 10 10 9 9 9 9 9 9 9 10 10 11 13
2600 13 12 12 11 11 12 12 12 11 10 11 11 10 11 12 13 12 12 11 12 12 12 12 13 13 13 12 11 11 10 10 11 10 10 11 12 12 11 11 11 12 13 11 11 11 12 11 10 11 11 11 11 12 12 12 12 13 13 13 13 12 10 11 11 11 12 12 12 12 12 13
2591 13 14 14 12 12 11 11 12 13 14 14 14 12 10 11 12 13 14 14 14 14 14 13 12 12 12 13 14 13 12 12 12 12 11 12 13 13 14 14 14 15 15 15 16 16 17 16 15 16 16 16 16 15 14 13 13 12 12 11 11 10 10 12 14 15 15 15 15 15 13 12
2583 12 12 12 12 12 12 11 11 11 13 13 13 13 12 13 13 13 13 13 14 13 11 10 9 8 9 11 11 11 11 11 11 11 11 12 13 12 11 11 11 12 12 11 10 9 10 10 10 10 10 11 11 12 12 12 12 12 12 11 10 9 10 10 11 10 9 9 10 10 9 10
$$ packed form
2641B5%jj%JJkkJ%j%%%%%%Jj%J%%j%%%j%%j%Jjj%%%JJ%j%j%%J%%jj%j%%JJjj%J%%JJ%%%j%
2633A8jjjKKjj%%%j%%K%jj%%%%%j%%%%%%%jJ%%%JKjjjjJJ%%%%%j%%%%%jJJJj%jj%%%%%%J%
2625A5jkJKKjjk%%J%%JJ%%jjjj%jJJJ%%%%%J%%Jj%%j%j%%%K%%j%j%%%%j%%kJJJj%%%K%j%j
2616A2jj%%JK%j%J%%%J%k%%JJ%jjJJ%Jj%%jj%JJ%%j%j%J%%%k%%Jj%%JJ%%j%j%%KJj%jj%%J
2608A2JJ%jj%jjJ%%JjjjJJ%JKJkjj%JKjj%%jjJJ%j%JjjJJJj%jK%jJ%Jjjj%j%j%%%%%%J%JK
2600A3j%j%J%%jjJ%jJJJj%jJ%%%J%%jj%j%Jj%JJ%j%%JJk%%JjjJ%%%J%%%J%%%jkJ%%J%%%%J
2591A3J%k%j%JJJ%%kkJJJJ%%%%jj%%JJjj%%%jJJ%J%%J%%J%JjjJ%%%jjj%j%j%j%KKJ%%%%kj
2583A2%%%%%j%%K%%%jJ%%%%JjkjjjJK%%%%%%%JJjj%%J%jjjJ%%%%J%J%%%%%jjjJ%Jjj%J%jJ
$$ plain form
2575 10 11 11 11 11 11 11 11 11 11 11 12 12 12 11 9 10 10 10 10 10 9 9 10 10 10 10 9 9 10 11 11 11 10 10 10 10 11 10 10 9 9 10 11 11 11 11 11 10 11 12 11 12 12 12 9 9 9 10 11 11 11 10 9 9 8 9 10 9 9 9
2566 9 9 10 11 11 10 11 12 12 11 11 10 11 11 11 11 10 9 9 8 8 9 8 7 7 8 9 10 10 9 8 9 10 12 13 13 12 13 12 11 11 10 9 8 9 9 9 8 7 6 7 8 9 10 10 10 10 11 10 10 10 10 10 10 9 9 8 8 8 8 7 7
2558 7 7 8 8 8 8 9 9 9 9 8 7 6 7 8 8 7 7 8 8 9 8 8 8 8 8 7 8 8 7 7 8 9 9 9 9 9 8 8 9 9 9 9 9 9 9 9 10 10 11 11 11 11 11 11 11 11 11 11 10 9 9 9 9 8 9 9 9 10 9 8 8
2549 8 9 8 7 8 8 9 9 9 10 9 9 9 9 9 8 8 8 9 10 11 12 11 11 9 7 8 9 10 12 11 11 11 11 9 8 8 8 10 12 11 10 9 8 8 8 8 8 7 7 7 7 7 6 6 5 5 4 5 6 7 8 7 7 8 8 7 6 6 5 6 7
2541 7 7 8 8 8 9 9 9 9 9 9 9 10 10 10 10 10 9 9 9 8 9 9 9 9 10 11 10 10 9 9 9 10 9 9 9 10 9 9 8 8 8 8 7 8 10 10 10 9 9 9 9 9 9 9 10 10 9 9 10 10 10 9 9 9 9 9 9 9 9 8 9
2532 9 9 9 9 7 6 6 6 7 7 7 8 7 7 7 7 8 9 11 12 13 10 9 8 8 7 7 9 11 11 11 10 9 8 9 9 9 8 8 8 8 8 8 8 7 7 7 6 7 7 7 7 7 8 8 8 8 7 7 7 7 6 6 5 5 5 7 7 6 6 6 7
2524 7 8 6 5 6 6 6 5 5 6 7 8 9 9 10 10 10 9 8 9 9 9 9 9 9 9 9 10 11 11 11 11 11 11 11 11 10 10 9 9 9 8 8 9 7 7 7 7 8 8 8 8 8 8 8 7 7 6 7 8 8 8 7 7 7 7 8 7 7 8 8 8
2516 8 9 8 8 7 7 8 9 10 11 10 10 10 9 10 10 9 9 9 9 9 10 10 10 10 11 11 11 10 10 10 10 10 9 9 9 10 11 10 10 10 10 10 10 9 9 9 9 9 8 7 7 7 7 7 7 7 7 7 6 7 8 8 9 8 7 8 9 9 9 9 8
$$ packed form
2575A0J%%%%%%%%%J%%jkJ%%%%j%J%%%j%JJ%%j%%%Jj%j%JJ%%%%jJJjJ%%l%%JJ%%jj%jJJj%%
2566I%JJ%jJJ%j%jJ%%%jj%j%Jjj%JJJ%jjJJKJ%jJjj%jjjJ%%jjjJJJJ%%%Jj%%%%%j%j%%%j%
2558G%J%%%J%%%jjjJJ%j%J%Jj%%%%jJ%j%JJ%%%%j%J%%%%%%%J%J%%%%%%%%%jj%%%jJ%%Jjj%
2549HJjjJ%J%%Jj%%%%j%%JJJJj%kkJJJKj%%%kj%%KKjjjj%%%%j%%%%j%j%jJJJJj%J%jj%jJJ
2541G%J%%J%%%%%%J%%%%j%%jJ%%%JJj%j%%Jj%%Jj%j%%%jJK%%j%%%%%%J%j%J%%j%%%%%%%jJ
2532I%%%kj%%J%%Jj%%%JJKJJljj%j%KK%%jjjJ%%j%%%%%%j%%jJ%%%%J%%%j%%%j%j%%K%j%%J
2524GJkjJ%%j%JJJJ%J%%jjJ%%%%%%%JJ%%%%%%%j%j%%j%Jk%%%J%%%%%%j%jJJ%%j%%%Jj%J%%
2516HJj%j%JJJJj%%jJ%j%%%%J%%%J%%j%%%%j%%JJj%%%%%j%%%%jj%%%%%%%%jJJ%JjjJJ%%%j
$$ plain form
2507 8 9 11 10 10 10 9 8 7 7 6 7 7 8 9 9 10 10 9 8 7 6 6 5 5 6 7 8 8 8 8 8 8 7 7 7 7 8 8 8 8 7 7 8 8 8 8 8 8 7 6 6 7 7 7 7 7 6 5 4 5 7 7 6 6 7 8 10 9 9 8 7
2499 7 6 7 7 7 6 6 7 6 5 4 4 5 6 6 7 7 7 7 7 7 7 7 6 7 8 8 7 6 7 8 9 9 8 8 7 7 6 7 8 9 8 7 6 6 6 6 6 6 6 7 9 10 10 10 10 9 8 8 8 8 8 9 10 10 8 7 7 7 8 7 7
2490 7 7 8 9 9 10 10 11 11 11 11 11 11 10 8 8 7 7 6 6 6 7 8 8 8 8 7 6 7 7 7 6 7 7 7 7 8 8 9 9 8 8 8 8 9 8 7 6 6 6 6 7 6 5 5 7 7 8 10 10 10 10 10 9 8 8 9 10 11 11 11 10
2482 10 10 8 8 8 7 6 7 7 7 7 7 8 8 8 9 8 7 7 8 9 8 8 8 8 8 8 8 7 8 9 8 7 7 6 6 7 8 8 8 8 7 8 7 6 6 7 7 7 8 8 8 8 8 8 9 8 8 8 7 8 8 9 10 10 10 11 11 11 11 10
2473 10 10 9 9 9 9 9 9 9 9 9 9 9 10 10 10 10 10 9 8 8 8 8 9 8 7 8 8 9 10 9 8 8 7 8 9 10 10 10 9 8 8 9 8 7 6 7 7 8 8 9 9 8 7 7 7 7 7 6 5 5 5 6 6 7 9 10 9 8 8 8
2465 8 8 10 11 9 8 7 7 7 7 7 7 7 7 8 9 9 8 8 8 9 10 9 9 7 6 7 8 8 8 9 10 8 8 8 8 7 6 6 7 6 6 7 6 6 6 6 6 6 6 6 6 7 9 11 10 10 8 7 7 7 6 7 8 8 8 8 8 8 9 8 7
2457 7 7 7 7 7 7 7 8 9 8 6 6 7 7 8 8 8 8 9 9 9 10 10 9 8 8 8 8 9 9 10 9 9 9 8 8 8 9 9 8 7 6 5 6 7 7 8 8 8 8 7 7 7 7 7 7 6 6 6 7 9 9 9 10 10 10 10 9 8 7 7 7
2448 7 7 7 7 8 8 7 7 7 7 9 10 10 10 9 8 8 9 9 9 9 8 7 6 6 7 7 7 7 7 8 10 8 7 7 7 7 7 7 7 6 5 6 7 7 7 7 7 7 7 7 7 7 7 7 6 7 7 7 6 6 6 5 5 6 7 8 10 10 10 8 7
$$ packed form
2507HJKj%%jjj%jJ%JJ%J%jjjj%j%JJJ%%%%%j%%%J%%%j%J%%%%%jj%J%%%%jjjJK%j%JJKj%jj
2499GjJ%%j%Jjjj%JJ%J%%%%%%%jJJ%jjJJJ%j%j%jJJJjjj%%%%%%JKJ%%%jj%%%%JJ%kj%%Jj%
2490G%JJ%J%J%%%%%jk%j%j%%JJ%%%jjJ%%jJ%%%J%J%j%%%Jjjj%%%Jjj%K%JK%%%%jj%JJJ%%j
2482A0%k%%jjJ%%%%J%%Jjj%JJj%%%%%%jJJjj%j%JJ%%%jJjj%J%%J%%%%%Jj%%jJ%JJ%%J%%%j
2473A0%j%%%%%%%%%%J%%%%jj%%%JjjJ%JJjj%jJJJ%%jj%JjjjJ%J%J%jj%%%%jj%%J%JKJjj%%
2465H%KJkjj%%%%%%%JJ%j%%JJj%kjJJ%%JJk%%%jj%Jj%Jj%%%%%%%%JKKj%kj%%jJJ%%%%%Jjj
2457G%%%%%%JJjk%J%J%%%J%%J%jj%%%J%Jj%%j%%J%jjjjJJ%J%%%j%%%%%j%%JK%%J%%%jjj%%
2448G%%%J%j%%%KJ%%jj%J%%%jjj%J%%%%JKkj%%%%%%jjJJ%%%%%%%%%%%jJ%%j%%j%JJJK%%kj
$$ plain form
2440 7 8 9 10 10 9 8 7 7 8 8 9 9 9 10 9 8 6 5 5 5 5 5 7 7 8 8 8 8 8 8 9 9 8 8 7 7 8 9 8 8 8 7 7 7 7 7 8 8 8 8 8 8 7 6 8 9 10 10 9 7 7 6 5 6 6 6 5 6 8 8 8
2431 8 9 10 11 11 9 7 7 6 7 7 7 6 6 7 9 9 9 9 8 6 6 7 7 8 9 9 10 9 9 8 8 10 9 8 7 8 8 8 7 5 5 6 7 7 7 8 10 10 10 9 8 7 6 8 10 11 10 9 8 7 6 5 5 6 6 7 8 9 10 10 10
2423 10 9 9 9 8 8 9 9 9 8 7 7 7 6 7 7 6 6 8 8 9 8 7 7 7 6 5 5 7 8 9 8 7 7 6 6 5 5 7 9 9 9 8 8 8 8 8 9 10 10 8 8 7 7 6 5 6 7 8 7 7 7 7 6 5 5 6 6 6 6 6
2414 6 7 7 7 7 6 5 5 5 6 6 7 7 9 9 9 9 8 7 7 7 7 8 9 9 9 9 8 9 10 9 8 8 9 8 8 7 8 7 7 8 8 8 8 7 7 6 5 5 5 6 6 6 7 7 6 7 7 6 6 6 5 6 7 6 6 5 6 6 6 6 7
2406 7 7 8 9 9 9 10 9 9 8 8 8 7 6 6 5 5 6 8 9 8 7 7 6 7 7 9 8 6 8 10 8 7 6 6 7 7 8 6 7 6 5 4 4 7 9 9 8 7 8 8 7 7 6 5 4 3 4 5 6 6 6 6 6 6 6 5 6 7 8 8 9
2397 9 9 9 8 7 6 6 7 8 7 7 7 8 9 9 11 11 11 11 11 11 12 12 11 12 11 11 10 9 9 10 9 9 9 9 9 8 8 9 7 5 5 6 6 7 8 9 8 8 8 7 6 4 4 4 5 6 6 6 5 5 6 7 7 7 7 6 7 8 7 7 7
2389 7 8 8 7 8 8 8 7 7 7 7 7 7 7 8 9 9 9 9 8 9 10 9 9 8 8 7 7 8 9 9 9 8 8 7 7 7 6 6 6 7 8 8 8 8 8 8 9 8 7 7 7 7 8 7 7 6 6 6 7 8 8 8 8 9 10 10 10 9 7 7 7
2380 7 7 8 8 9 8 8 7 7 7 7 7 6 6 5 6 6 6 6 6 5 6 7 8 8 7 6 7 7 7 7 6 6 6 6 6 5 5 5 6 6 6 7 7 7 6 5 6 7 7 8 8 8 9 9 9 9 9 9 9 11 12 12 11 11 11 11 9 8 8 9 9
$$ packed form
2440GJJJ%jjj%J%J%%Jjjkj%%%%K%J%%%%%J%j%j%JJj%%j%%%%J%%%%%jjKJJ%jk%jjJ%%jJK%%
2431HJJJ%kk%jJ%%j%JK%%%jk%J%JJ%Jj%j%KjjjJ%%jk%JJ%%JK%%jjjjKKJjjjjjj%J%JJJJ%%
2423A0j%%j%J%%jj%%jJ%j%K%Jjj%%jj%KJJjj%j%j%KK%%j%%%%JJ%k%j%jjJJJj%%%jj%J%%%%
2414FJ%%%jj%%J%J%K%%%jj%%%JJ%%%jJJjj%Jj%jJj%J%%%j%jj%%J%%J%jJ%j%%jJJj%jJ%%%J
2406G%JJ%%Jj%j%%jj%j%JKJjj%jJ%KjkKKkjj%J%JkJjjj%LK%jjJ%j%jjjjJJJ%%%%%%jJJJ%J
2397I%%jjj%JJj%%JJ%K%%%%%J%jJj%jj%Jj%%%%j%Jkk%J%JJJj%%jjk%%JJ%%j%JJ%%%jJJj%%
2389GJ%jJ%%j%%%%%%JJ%%%jJJj%j%j%JJ%%j%j%%j%%JJ%%%%%Jjj%%%Jj%j%%JJ%%%JJ%%jk%%
2380G%J%Jj%j%%%%j%jJ%%%%jJJJ%jjJ%%%j%%%%j%%J%%J%%jjJJ%J%%J%%%%%%KJ%j%%%kj%J%
$$ plain form
2372 9 9 9 9 9 8 8 9 10 10 10 10 9 10 9 8 7 8 8 8 7 8 9 9 9 8 7 7 7 8 8 7 7 7 8 9 9 8 8 8 8 8 8 8 7 8 8 7 6 7 8 8 8 8 8 7 7 7 8 9 8 8 8 7 7 8 9 10 9 9 9 9
2364 9 8 8 7 7 7 8 8 7 7 6 6 5 5 6 6 7 7 7 8 9 9 9 8 6 6 5 5 4 5 7 6 5 5 5 6 6 6 7 7 7 7 7 7 7 7 7 6 6 6 5 6 7 7 7 7 6 6 6 7 7 9 11 10 9 9 9 8 8 7 6 6
2355 6 6 7 7 8 8 8 8 7 6 6 6 5 5 6 7 7 7 7 8 7 6 6 6 6 5 6 6 7 8 8 8 8 9 8 7 6 5 5 4 5 6 7 7 7 7 8 8 8 7 9 10 10 11 11 11 11 11 11 10 11 11 11 12 11 11 10 9 10 11 11 12
2347 12 12 13 13 12 10 9 9 9 9 9 9 8 8 8 7 6 6 6 7 8 8 8 8 8 8 8 7 8 8 8 8 8 8 9 8 8 8 8 7 6 6 5 6 8 10 9 8 6 6 5 5 4 5 6 7 8 9 10 9 9 9 8 8 7 7 6 6 7 8 8
2338 8 8 7 7 8 8 9 9 8 8 9 10 9 9 9 10 10 10 10 10 10 9 9 8 6 7 8 9 10 8 7 7 8 8 9 9 9 9 9 8 8 8 7 6 6 6 7 7 7 7 6 7 8 8 8 7 8 9 10 10 9 8 7 7 7 6 4 3 4 5 6 7
2330 7 7 7 7 7 6 6 7 8 7 6 5 6 7 7 6 6 6 6 7 8 9 9 8 8 10 11 10 10 10 10 9 9 9 8 10 10 9 8 8 8 7 7 8 9 8 9 9 9 10 8 7 7 7 7 6 7 7 7 7 6 6 7 8 7 6 6 6 6 6 6 7
2321 7 7 8 8 8 8 8 7 7 7 7 8 9 8 8 9 9 8 7 7 8 8 8 9 9 9 8 7 6 7 7 8 10 9 9 9 9 9 8 8 8 9 9 8 7 7 6 6 7 6 6 6 5 3 4 5 5 6 7 6 6 6 6 7 8 8 8 7 6 7 8 10
2313 10 11 10 9 8 7 8 8 8 9 9 9 7 6 6 6 8 9 8 7 7 8 8 8 7 7 7 8 8 8 8 8 8 9 8 7 7 7 7 7 7 8 7 6 6 6 7 9 9 10 10 10 11 11 10 9 9 9 9 8 7 7 7 7 7 7 8 9 10 10 9
$$ packed form
2372I%%%%j%JJ%%%jJjjjJ%%jJJ%%jj%%J%j%%JJ%j%%%%%%jJ%jjJJ%%%%j%%JJj%%j%JJJj%%%
2364Ij%j%%J%j%j%j%J%J%%JJ%%jk%j%jJKjj%%J%%J%%%%%%%%j%%jJJ%%%j%%J%KKjj%%j%jj%
2355F%J%J%%%jj%%j%JJ%%%Jjj%%%jJ%JJ%%%Jjjjj%jJJJ%%%J%%jKJ%J%%%%%jJ%%Jj%jjJJ%J
2347A2%J%jkj%%%%%j%%jj%%JJ%%%%%%jJ%%%%%Jj%%%jj%jJKKjjk%j%jJJJJJJj%%j%j%j%JJ%
2338H%j%J%J%j%JJj%%J%%%%%j%jkJJJJkj%J%J%%%%j%%jj%%J%%%jJJ%%jJJJ%jjj%%jkjJJJJ
2330G%%%%j%JJjjjJJ%j%%%JJJ%j%KJj%%%j%%jK%jj%%j%JJjJ%%Jkj%%%jJ%%%j%JJjj%%%%%J
2321G%J%%%%j%%%JJj%J%jj%J%%J%%jjjJ%JKj%%%%j%%J%jj%j%Jj%%jkJJ%JJj%%%JJ%%jjJJK
2313A0JjjjjJ%%J%%kj%%KJjj%J%%j%%J%%%%%Jjj%%%%%Jjj%%JK%J%%J%jj%%%jj%%%%%JJJ%j
$$ plain form
2305 9 8 8 8 7 6 7 8 8 9 9 9 9 9 8 8 8 9 8 7 7 6 6 8 9 10 11 11 12 13 11 10 10 9 8 6 6 7 7 7 6 6 7 7 7 6 6 5 6 6 7 8 7 6 6 8 11 12 11 10 8 8 7 7 6 4 5 7 7 7 8 9
2296 9 9 9 8 8 9 10 10 10 10 9 8 8 7 7 6 6 5 5 4 5 6 5 6 6 7 7 7 7 7 7 7 7 7 7 8 9 9 7 6 5 6 7 8 8 9 10 10 11 11 11 10 9 7 7 7 6 6 6 5 6 7 8 8 8 8 8 9 10 9 9 8
2288 8 8 9 9 8 7 8 9 9 9 8 9 8 7 7 7 7 7 7 7 7 8 8 8 7 7 7 8 8 9 9 10 10 9 7 7 8 9 9 8 8 8 8 8 10 10 9 9 9 8 9 9 10 10 10 10 10 9 9 9 9 9 8 8 8 8 7 6 6 7 8 9
2279 9 9 9 9 8 7 7 6 5 4 5 6 6 7 7 8 8 7 5 5 4 5 7 7 6 5 5 6 7 7 9 10 11 9 8 8 8 8 8 7 6 7 9 8 8 8 8 7 6 5 4 5 6 7 8 8 8 8 8 8 8 9 9 7 5 4 5 6 8 8 8 8
2271 8 7 6 5 5 5 6 7 6 7 7 7 7 7 7 8 9 8 8 7 7 7 5 7 7 8 8 8 9 10 9 9 8 7 6 8 9 9 9 7 6 5 4 4 6 5 5 5 6 9 8 7 6 6 6 7 6 6 6 7 8 9 9 9 8 7 7 6 7 8 9 9
2262 9 8 8 8 8 7 7 7 8 9 9 9 10 9 8 7 6 6 5 7 8 8 7 7 7 7 7 8 8 8 8 8 8 7 6 6 6 5 7 7 8 9 10 10 10 10 9 8 7 8 9 10 8 9 10 9 8 8 8 8 7 7 8 8 8 8 8 8 7 7 7 7
2254 7 6 7 8 8 9 9 10 9 8 8 7 7 8 7 7 7 7 6 6 6 6 6 7 8 10 9 8 8 7 7 6 6 7 7 7 8 9 10 9 9 9 8 8 8 9 9 8 8 8 7 7 7 8 8 8 7 6 5 7 9 9 8 8 8 8 8 10 9 9 9 8
2245 8 8 8 8 8 9 10 9 9 8 7 6 6 6 7 8 9 10 9 8 6 5 6 6 6 6 7 7 7 7 8 8 8 7 7 7 7 6 6 7 7 7 6 7 7 7 7 8 8 8 8 8 8 8 8 9 9 10 9 8 8 8 9 9 8 7 8 9 9 10 9 8
$$ packed form
2305Ij%%jjJJ%J%%%%j%%Jjj%j%KJJJ%JJkj%jjk%J%%j%J%%j%jJ%JJjj%KLJjjk%j%jkJK%%JJ
2296I%%j%JJ%%%jj%j%j%j%jJJjJ%J%%%%%%%%%JJ%kjjJJJ%JJ%J%%jjk%%j%%jJJJ%%%%JJj%j
2288H%J%jjJJ%%jJjj%%%%%%%J%%j%%J%J%J%jk%JJ%j%%%%K%j%%jJ%J%%%%j%%%%j%%%jj%JJJ
2279I%%%jj%jjjJJ%J%J%jk%jJK%jj%JJ%KJJkj%%%%jjJKj%%%jjjjJJJJ%%%%%%J%kkjJJK%%%
2271Hjjj%%JJjJ%%%%%JJj%j%%kK%J%%JJj%jjjKJ%%kjjj%Kj%%JLjjj%%Jj%%JJJ%%jj%jJJJ%
2262Ij%%%j%%JJ%%Jjjjj%jKJ%j%%%%J%%%%%jj%%jK%JJJ%%%jjjJJJkJJjj%%%j%J%%%%%j%%%
2254GjJJ%J%Jjj%j%Jj%%%j%%%%JJKjj%j%j%J%%JJJj%%j%%J%j%%j%%J%%jjjKK%j%%%%Kj%%j
2245H%%%%JJj%jjj%%JJJJjjkjJ%%%J%%%J%%j%%%j%J%%jJ%%%J%%%%%%%J%Jjj%%J%jjJJ%Jjj
$$ plain form
2237 8 8 8 7 8 9 8 8 9 9 10 9 7 7 8 8 8 8 9 9 8 7 6 6 6 6 6 7 8 9 10 10 9 9 8 6 7 8 9 10 8 5 5 6 6 8 8 8 8 8 9 9 9 8 8 7 7 6 7 7 7 6 6 6 7 7 6 7 8 8 7 6
2228 6 7 7 8 8 9 8 7 7 8 8 8 7 7 6 6 6 6 5 5 5 5 5 5 4 6 7 7 8 9 9 8 8 8 8 9 9 9 9 8 8 9 9 9 10 9 8 8 8 8 9 9 8 8 8 8 8 8 8 9 9 8 7 7 7 8 9 9 9 9 9 8
2220 8 7 7 7 6 6 6 7 7 8 8 9 9 9 9 9 9 10 9 9 8 8 8 7 6 6 7 8 8 8 7 7 6 6 7 7 7 8 7 6 7 8 9 9 8 8 8 8 7 6 7 8 9 9 9 9 8 7 7 8 6 5 5 5 6 6 6 6 7 7 7 7
2211 7 7 7 9 10 10 10 9 8 7 6 7 9 7 6 6 6 5 5 7 8 8 7 7 7 7 8 8 8 7 6 6 5 6 7 7 7 7 7 5 4 4 4 5 6 7 7 7 6 5 4 6 8 8 9 9 8 8 7 7 6 6 6 6 6 7 7 6 5 5 5 5
2203 5 6 6 7 6 6 5 5 5 5 6 8 7 7 6 6 7 8 9 10 10 10 10 9 8 7 7 6 6 6 6 6 7 7 8 9 8 8 7 7 7 7 8 9 9 8 8 7 7 8 7 7 6 5 5 5 6 7 7 7 7 6 6 5 6 6 7 8 8 9 8 7
2195 7 8 8 8 8 9 10 11 11 10 9 8 7 7 8 7 7 6 4 5 5 6 6 7 6 5 5 5 6 7 6 4 4 6 7 7 7 7 7 7 7 7 5 5 6 7 8 8 7 7 7 7 7 7 7 7 8 7 7 7 7 7 7 7 6 6 6 6 6 6 7 7
2186 7 8 8 7 6 7 8 9 8 7 7 7 7 7 7 6 5 7 7 7 7 8 8 8 8 7 7 7 5 5 6 5 5 5 5 5 5 5 6 6 6 7 7 7 7 6 5 4 5 5 6 7 7 8 7 6 6 5 5 6 6 6 6 7 7 7 7 6 6 7 7 6
2178 6 5 7 7 8 8 7 6 4 6 7 8 9 10 8 7 8 8 8 8 9 8 6 5 6 7 7 5 4 3 4 5 6 7 8 9 11 11 10 10 10 9 11 10 9 7 6 5 5 7 7 7 7 7 8 9 8 9 9 8 7 6 8 9 8 8 7 7 7 6 5 5
$$ packed form
2237H%%jJJj%J%Jjk%J%%%J%jjj%%%%JJJJ%j%jkJJJJkl%J%K%%%%J%%j%j%jJ%%j%%J%jJJ%jj
2228FJ%J%Jjj%J%%j%j%%%j%%%%%jKJ%JJ%j%%%J%%%j%J%%Jjj%%%J%j%%%%%%J%jj%%JJ%%%%j
2220Hj%%j%%J%J%J%%%%%Jj%j%%jj%JJ%%j%j%J%%JjjJJJ%j%%%jjJJJ%%%jj%Jkj%%J%%%J%%%
2211G%%KJ%%jjjjJKkj%%j%KJ%j%%%J%%jj%jJJ%%%%kj%%JJJ%%jjjKK%J%j%j%j%%%%J%jj%%%
2203EJ%Jj%j%%%JKj%j%JJJJ%%%jjj%j%%%%J%JJj%j%%%JJ%j%j%Jj%jj%%JJ%%%j%jJ%JJ%Jjj
2195GJ%%%JJJ%jjjj%Jj%jkJ%J%Jjj%%JJjk%KJ%%%%%%%k%JJJ%j%%%%%%%Jj%%%%%%j%%%%%J%
2186GJ%jjJJJjj%%%%%jjK%%%J%%%j%%k%Jj%%%%%%J%%J%%%jjjJ%JJ%Jjj%j%J%%%J%%%j%J%j
2178FjK%J%jjkKJJJJkjJ%%%JjkjJJ%kjjJJJJJJK%j%%jKjjkjj%K%%%%JJjJ%jjjKJj%j%%jj%
$$ plain form
2169 5 5 4 5 7 9 9 9 9 9 9 7 5 5 6 6 6 6 6 7 9 10 9 8 7 6 6 6 6 5 5 5 6 7 7 7 7 6 7 8 9 10 11 10 9 8 7 7 7 7 7 8 8 7 7 8 8 9 10 10 10 10 9 9 8 7 6 7 7 7 7 6
2161 6 5 4 4 6 7 8 7 7 8 8 9 10 11 10 8 6 6 6 7 7 8 7 6 6 6 6 7 8 9 10 9 8 7 7 7 8 8 9 7 6 6 6 6 6 6 7 7 6 6 6 6 5 6 7 8 8 8 7 7 7 8 8 7 6 6 7 7 8 8 8 8
2152 8 9 8 6 7 7 7 7 6 6 6 6 6 7 7 7 6 4 3 3 3 3 5 7 8 7 7 7 8 7 6 6 7 6 7 9 9 8 8 8 8 8 9 9 8 8 8 7 7 6 5 5 6 7 7 7 9 9 9 10 9 9 8 9 11 10 9 7 7 7 8 9
2144 9 8 7 7 7 6 6 6 7 7 7 6 6 7 8 7 7 7 7 8 8 8 8 7 6 6 5 5 6 7 6 7 7 7 7 6 6 6 7 8 8 8 8 8 7 7 7 5 5 7 8 7 7 8 7 6 6 7 7 8 8 8 8 9 9 9 9 8 6 6 6 6
2135 6 5 5 4 5 5 7 9 8 6 6 5 5 6 6 7 8 8 8 8 8 8 7 7 7 6 8 9 9 9 10 11 12 12 12 10 9 9 9 9 9 9 9 10 10 9 8 8 7 7 9 9 8 7 7 8 8 8 8 8 8 8 8 9 8 7 7 7 6 6 6 6
2127 6 6 5 7 8 7 7 7 6 7 7 8 8 9 9 9 9 10 10 9 10 10 10 9 10 11 10 8 8 9 10 9 9 8 8 8 8 8 8 8 8 8 7 7 7 7 8 10 9 8 7 6 6 7 8 7 6 6 7 8 10 10 10 10 10 9 9 9 8 9 9 9
2118 9 9 8 7 8 9 8 7 7 7 7 6 6 6 7 8 8 9 8 8 7 7 8 9 9 9 9 9 9 8 7 6 6 5 5 5 6 8 8 8 8 9 9 9 8 8 7 6 6 7 7 7 7 6 6 7 7 7 7 8 8 7 8 9 9 8 8 8 8 9 8 7
2110 7 7 7 7 6 7 8 7 6 6 6 6 7 7 8 8 9 9 9 9 9 8 7 6 6 7 7 7 7 6 6 6 6 7 7 8 9 10 10 9 8 8 8 8 8 8 8 6 5 6 7 7 8 8 9 8 7 7 8 8 9 8 9 9 10 9 8 9 9 8 8 8
$$ packed form
2169E%jJKK%%%%%kk%J%%%%JKJjjjj%%%j%%JJ%%%jJJJJJjjjj%%%%J%j%J%JJ%%%j%jjjJ%%%j
2161Fjj%KJJj%J%JJJjkk%%J%Jjj%%%JJJJjjj%%J%Jkj%%%%%J%j%%%jJJJ%%j%%J%jj%J%J%%%
2152HJjkJ%%%j%%%%J%%jkj%%%KKJj%%Jjj%JjJK%j%%%%J%j%%j%jj%JJ%%K%%Jj%jJKjjk%%JJ
2144Ijj%%j%%J%%j%JJj%%%J%%%jj%j%JJjJ%%%j%%JJ%%%%j%%k%KJj%Jjj%J%J%%%J%%%jk%%%
2135Fj%jJ%KKjk%j%J%JJ%%%%%j%%jKJ%%JJJ%%kj%%%%%%J%jj%j%K%jj%J%%%%%%%Jjj%%j%%%
2127F%jKJj%%jJ%J%J%%%J%jJ%%jJJjk%JJj%j%%%%%%%%j%%%JKjjjj%JJjj%JJK%%%%j%%jJ%%
2118I%jjJJjj%%%j%%JJ%Jj%j%JJ%%%%%jjj%j%%JK%%%J%%j%jj%J%%%j%J%%%J%jJJ%j%%%Jjj
2110G%%%jJJjj%%%J%J%J%%%%jjj%J%%%j%%%J%JJJ%jj%%%%%%kjJJ%J%Jjj%J%JjJ%JjjJ%j%%
$$ plain form
2101 8 8 8 9 8 8 8 8 8 7 7 7 7 8 8 8 7 7 7 8 8 8 8 8 8 9 9 8 8 9 9 8 8 8 8 7 6 7 7 7 6 6 7 7 5 5 5 6 7 7 8 8 7 5 5 6 7 8 8 9 9 9 9 9 9 9 9 8 7 6 7 7
2093 7 7 7 8 8 9 9 9 9 9 7 7 7 8 8 9 9 10 10 10 11 10 10 9 8 8 8 8 8 8 7 7 7 8 9 9 8 8 7 8 8 8 7 7 7 8 8 8 9 8 8 8 9 8 7 7 8 8 6 7 8 8 8 7 7 7 8 9 10 10 8 6
2084 6 7 6 7 8 8 7 6 5 6 8 9 9 8 8 8 9 9 8 8 7 6 6 8 10 9 7 5 4 3 4 4 5 8 9 8 7 7 7 7 8 9 8 8 8 9 11 11 10 10 9 8 7 6 6 6 5 6 7 7 8 7 7 7 6 5 4 4 6 7 8 7
2076 7 7 9 10 10 8 7 6 8 9 8 6 4 4 5 6 6 7 8 9 8 6 6 6 6 7 8 8 9 8 8 8 10 11 12 10 9 9 10 9 9 9 9 9 9 9 9 8 8 7 6 5 5 5 6 6 6 6 7 7 8 7 7 7 7 7 8 8 9 9 9 8
2068 8 7 7 7 8 9 10 8 9 9 9 8 8 7 7 7 6 6 6 6 6 6 5 7 9 9 9 8 9 9 10 11 10 10 9 8 8 8 8 8 8 8 8 8 7 7 8 8 8 7 7 7 7 6 7 7 9 10 10 9 9 9 8 8 7 6 6 8 8 9 9 7
2059 7 6 6 6 7 7 7 7 7 8 8 8 8 7 6 6 7 8 8 8 9 8 8 8 8 8 7 7 7 7 7 7 7 7 7 8 8 9 10 9 8 8 8 8 8 8 7 7 7 7 7 7 7 8 7 6 7 7 6 8 10 10 9 8 8 8 8 8 9 9 8 8
2051 8 7 7 6 7 7 8 8 8 9 7 6 5 4 4 4 6 8 8 9 9 9 9 9 9 9 8 7 7 6 6 7 9 8 8 7 9 10 10 8 7 8 8 8 8 8 8 8 8 8 9 9 8 7 6 6 7 7 8 8 8 7 7 7 8 8 9 10 9 9 8 8
2042 8 8 8 8 8 10 11 11 11 11 10 10 9 9 10 10 9 9 9 9 9 9 8 8 8 7 6 6 6 7 8 8 8 6 5 5 4 6 7 8 8 9 9 7 5 6 7 7 8 8 8 7 7 8 9 9 9 9 9 9 10 10 10 9 9 8 7 7 7 8 9 9
$$ packed form
2101H%%Jj%%%%j%%%J%%j%%J%%%%%J%j%J%j%%%jjJ%%j%J%k%%JJ%J%jk%JJJ%J%%%%%%%jjjJ%
2093G%%J%J%%%%k%%J%J%J%%Jj%jj%%%%%j%%JJ%j%jJ%%j%%J%%Jj%%Jjj%J%kJJ%%j%%JJJ%kk
2084FJjJJ%jjjJKJ%j%%J%j%jj%KKjkkjjJ%JLJjj%%%JJj%%JK%j%jjjj%%jJJ%Jj%%jjj%KJJj
2076G%KJ%kjjKJjkk%JJ%JJJjk%%%JJ%Jj%%KJJkj%Jj%%%%%%%j%jjj%%J%%%J%Jj%%%%J%J%%j
2068Hj%%JJJkJ%%j%j%%j%%%%%jKK%%jJ%JJj%jj%%%%%%%%j%J%%j%%%jJ%KJ%j%%j%jj%K%J%k
2059Gj%%J%%%%J%%%jj%JJ%%Jj%%%%j%%%%%%%%J%JJjj%%%%%j%%%%%%JjjJ%jKK%jj%%%%J%j%
2051Hj%jJ%J%%Jkjjj%%KK%J%%%%%%jj%j%JKj%jKJ%kjJ%%%%%%%%J%jjj%J%J%%j%%J%JJj%j%
2042H%%%%KJ%%%j%j%J%j%%%%%j%%jj%%JJ%%kj%jKJJ%J%kkJJ%J%%j%JJ%%%%%J%%j%jj%%JJ%
$$ plain form
2034 9 8 9 9 9 10 9 8 7 7 7 7 8 9 9 9 8 6 7 8 8 8 8 8 8 7 7 7 6 6 6 6 6 6 6 6 6 6 6 6 6 7 6 5 5 5 6 6 6 7 7 7 8 8 8 8 8 8 8 8 8 9 9 10 10 8 8 7 7 7 8 9
2025 9 8 7 6 6 7 7 7 7 9 8 7 6 6 6 6 6 6 5 5 6 6 7 8 9 9 8 8 8 8 9 9 8 8 8 8 9 10 11 10 9 9 9 8 8 9 8 8 8 7 7 6 7 9 8 6 6 7 7 7 6 7 8 9 8 7 6 5 4 4 5 5
2017 5 5 6 6 6 5 4 5 5 7 8 8 8 8 8 8 7 7 9 9 8 8 7 5 4 4 5 5 7 7 7 7 8 7 6 6 7 5 6 7 8 8 8 9 8 8 8 9 9 10 10 10 11 12 10 9 7 6 6 6 5 5 4 6 6 7 6 6 6 6 7 8
2008 8 7 6 6 6 6 6 6 7 7 8 10 10 8 6 4 4 5 6 8 8 6 5 6 6 7 7 8 8 7 8 8 9 9 8 8 9 9 9 8 7 7 7 6 6 6 7 8 7 7 6 6 7 8 8 7 7 6 5 5 6 7 8 8 7 7 7 7 6 7 7 6
2000 6 6 6 7 9 9 8 9 9 8 7 7 8 8 9 9 10 10 9 8 9 9 10 10 10 9 9 8 8 8 9 9 9 9 8 7 7 7 8 8 7 6 6 6 7 8 8 8 8 9 8 7 8 7 5 6 7 9 8 8 6 5 6 6 7 7 7 7 9 10 9 8
1991 8 7 6 7 8 8 8 8 7 7 7 8 9 7 6 7 8 8 8 9 9 9 8 7 6 7 9 9 9 9 9 9 8 8 7 7 6 6 7 7 8 7 7 6 6 6 6 6 7 8 9 9 8 9 9 8 8 8 9 8 8 8 9 9 9 8 8 8 8 7 6 7
1983 7 7 7 7 7 6 6 6 6 7 8 8 8 8 8 8 8 8 7 6 7 7 7 7 8 9 9 8 7 6 6 7 7 6 6 6 8 9 9 10 9 8 7 7 9 10 9 8 7 6 7 7 8 8 7 7 8 9 9 8 7 8 9 10 9 8 8 8 9 9 9 8
1974 8 7 8 9 9 8 8 6 6 8 9 10 9 9 8 8 7 7 7 8 9 10 10 9 7 6 6 6 6 6 5 5 5 6 7 6 5 5 7 8 8 7 7 6 6 5 5 5 6 5 4 5 5 7 8 8 8 7 7 7 7 8 8 8 8 9 9 9 9 9 10 10
$$ packed form
2034IjJ%%Jjjj%%%JJ%%jkJJ%%%%%j%%j%%%%%%%%%%%%Jjj%%J%%J%%J%%%%%%%%J%J%k%j%%JJ
2025Ijjj%J%%%Kjjj%%%%%j%J%JJJ%j%%%J%j%%%JJJjj%%j%Jj%%j%jJKjk%J%%jJJJjjjjj%J%
2017E%J%%jjJ%KJ%%%%%j%K%j%jkj%J%K%%%Jjj%JkJJJ%%Jj%%J%J%%JJkjkj%%j%jK%Jj%%%JJ
2008Hjj%%%%%J%JK%kkk%JJK%kjJ%J%J%jJ%J%j%J%%jj%%j%%JJj%j%JJ%j%jj%JJJ%j%%%jJ%j
2000F%%JK%jJ%jj%J%J%J%jjJ%J%%j%j%%J%%%jj%%J%jj%%JJ%%%JjjJjkJJKj%kjJ%J%%%KJjj
1991HjjJJ%%%j%%JJkjJJ%%J%%jjjJK%%%%%j%j%j%J%Jj%j%%%%JJJ%jJ%j%%Jj%%J%%j%%%jjJ
1983G%%%%j%%%JJ%%%%%%%jjJ%%%JJ%jjj%J%j%%KJ%Jjjj%KJjjjjJ%J%j%JJ%jjJJJjj%%J%%j
1974HjJJ%j%k%KJJj%j%j%%JJJ%jkj%%%%j%%JJjj%KJ%j%j%j%%JjjJ%KJ%%j%%%J%%%J%%%%J%
$$ plain form
1966 10 9 8 9 9 8 8 8 8 8 7 7 7 7 7 8 8 8 9 9 8 6 6 5 6 7 7 6 6 6 5 5 5 5 5 4 5 6 7 8 8 9 8 7 8 8 8 9 9 8 7 8 9 10 10 9 9 8 8 8 8 9 12 13 12 12 11 11 10 9 9
1958 9 10 9 8 7 8 9 9 9 8 6 5 6 6 7 8 8 9 9 10 9 9 8 7 8 8 8 8 8 9 8 7 7 7 7 6 6 7 9 10 10 9 10 10 11 11 11 11 11 11 11 9 9 8 8 8 7 7 7 7 8 8 8 9 9 9 10 11 10 10 10 10
1949 10 10 10 10 10 10 10 9 9 8 8 7 7 6 5 5 5 4 4 5 6 7 9 10 10 10 10 9 9 10 12 11 9 7 7 9 8 7 6 7 8 7 7 6 6 6 7 7 7 7 8 8 9 9 10 9 8 9 10 10 10 9 9 9 9 9 9 8 8 7 7
1941 7 7 8 8 9 9 10 9 8 8 8 9 9 9 8 9 10 10 8 7 8 8 9 8 8 8 7 8 8 7 7 7 6 8 9 9 9 9 8 8 8 8 9 8 7 6 7 8 10 9 8 8 7 6 6 6 7 7 6 5 6 8 9 9 9 9 10 11 10 11 11 10
1932 10 11 11 11 9 8 9 9 9 9 8 7 6 7 8 7 7 7 7 8 8 8 9 8 8 8 8 8 9 8 8 7 8 9 10 10 9 8 8 7 7 7 8 8 9 9 8 6 4 5 7 9 10 11 10 10 9 8 7 6 7 7 7 7 7 7 7 7 8 9 9
1924 9 9 8 7 8 8 9 9 9 8 9 9 9 9 9 8 8 9 9 9 9 9 9 9 9 9 8 7 5 4 4 5 5 6 7 8 7 6 5 5 4 6 7 6 5 6 7 8 9 9 9 9 9 8 8 8 7 8 8 9 9 9 9 8 9 10 10 9 8 8 8 8
1916 8 8 8 9 11 10 10 9 8 8 9 9 9 9 8 8 8 8 9 8 7 7 8 9 9 9 10 10 11 10 10 10 10 9 9 8 9 9 10 10 10 10 11 11 10 9 7 8 8 8 9 9 10 11 12 11 11 11 9 8 8 7 7 7 8 8 7 7 7 6 6 7
1907 7 7 7 6 7 7 7 7 7 7 6 6 6 7 7 8 8 9 9 8 9 9 9 9 8 7 8 8 8 7 7 7 7 8 9 10 9 8 7 6 7 7 8 9 8 8 7 7 7 8 8 7 7 8 7 6 7 8 8 9 8 7 6 6 8 9 9 8 8 8 9 10
$$ packed form
1966A0jjJ%j%%%%j%%%%J%%J%jk%jJJ%j%%j%%%%jJJJJ%JjjJ%%J%jjJJJ%j%j%%%JLJj%j%jj%
1958IJjjjJJ%%jkjJ%JJ%J%Jj%jjJ%%%%Jjj%%%j%JKJ%jJ%J%%%%%%k%j%%j%%%J%%J%%JJj%%%
1949A0%%%%%%j%j%j%jj%%j%JJJKJ%%%j%JKjkk%KjjjJJj%j%%J%%%J%J%JjjJJ%%j%%%%%j%j%
1941G%J%J%Jjj%%J%%jJJ%kjJ%Jj%%jJ%j%%jKJ%%%j%%%JjjjJJKjj%jj%%J%jjJKJ%%%JJjJ%j
1932A0J%%kjJ%%%jjjJJj%%%J%%Jj%%%%Jj%jJJJ%jj%j%%J%J%jkkJKKJJj%jjjjJ%%%%%%%JJ%
1924I%jjJ%J%%jJ%%%%j%J%%%%%%%%jjkj%J%JJJjjj%jKJjjJJJJ%%%%j%%jJ%J%%%jJJ%jj%%%
1916H%%JKj%jj%J%%%j%%%Jjj%JJ%%J%Jj%%%j%jJ%J%%%J%jjkJ%%J%JJJj%%kj%j%%J%j%%j%J
1907G%%jJ%%%%%j%%J%J%J%jJ%%%jjJ%%j%%%JJJjjjjJ%JJj%j%%J%j%JjjJJ%Jjjj%KJ%j%%JJ
$$ plain form
1899 10 9 7 8 9 9 9 9 9 11 12 12 11 10 10 10 10 9 7 6 6 6 6 8 9 9 9 8 8 8 8 9 9 9 9 9 9 9 9 8 8 8 8 8 9 9 9 8 7 7 6 6 6 6 6 8 10 9 7 8 9 8 8 9 10 10 10 9 9 9 9
1890 9 9 9 9 9 9 9 9 9 9 10 9 8 8 8 8 8 8 8 8 8 7 7 6 6 7 7 8 8 8 8 9 10 11 12 11 10 9 8 9 9 10 10 9 9 8 7 8 8 8 9 8 8 8 8 8 8 8 8 8 8 8 9 8 8 7 6 6 6 7 9 8
1882 8 8 8 9 9 8 9 9 9 8 7 6 6 6 6 6 6 7 8 9 9 9 9 10 10 11 11 12 10 9 8 7 7 8 8 8 7 7 7 7 6 6 6 5 6 8 8 8 8 8 8 8 8 8 8 8 9 10 9 8 8 8 8 6 5 6 8 9 10 10 10 10
1873 10 8 6 7 7 8 9 9 8 7 7 7 8 9 9 10 10 10 9 9 8 8 8 9 10 10 10 9 10 10 10 9 10 11 9 9 9 8 9 8 8 8 8 9 8 8 8 8 8 8 8 8 8 7 8 9 9 8 6 6 7 8 10 12 11 11 10 9 8 7 6
1865 6 7 8 8 9 10 10 10 10 9 9 8 8 9 10 9 9 9 10 10 11 10 10 10 10 9 9 9 9 9 7 7 9 9 8 7 7 8 8 8 8 9 9 8 8 8 8 9 9 9 8 7 8 9 9 8 8 8 7 7 7 7 7 7 6 6 6 6 7 8 7 7
1857 7 9 9 10 10 11 11 11 10 10 9 8 8 8 8 8 9 9 9 8 7 6 7 9 9 10 10 10 9 9 10 10 11 11 11 11 10 9 9 10 10 10 9 9 10 11 11 12 11 10 10 10 10 9 9 8 7 6 6 8 9 9 9 9 8 8 9 9 9 9 9 10
1848 10 11 12 12 11 11 13 14 13 12 11 11 11 11 10 10 10 9 9 10 10 10 11 10 10 11 11 13 15 16 17 17 17 17 16 17 17 17 18 19 21 22 23 24 24 25 25 25 25 24 24 23 22 22 21 21 20 19 18 18 18 17 16 16 16 16 17 16 16 15 15
1840 15 13 12 12 12 12 11 11 11 13 14 14 15 15 16 16 16 17 17 19 20 21 21 21 21 22 23 24 24 24 25 25 26 24 22 21 19 19 18 18 18 17 17 17 17 15 13 14 15 14 13 11 12 13 13 13 12 13 13 14 15 14 13 13 12 12 12 12 12 12 13
$$ packed form
1899A0jkJJ%%%%KJ%jj%%%jkj%%%KJ%%j%%%J%%%%%%%j%%%%J%%jj%j%%%%KKjkJJj%JJ%%j%%%
1890I%%%%%%%%%Jjj%%%%%%%%j%j%J%J%%%JJJJjjjjJ%J%j%jjJ%%Jj%%%%%%%%%%Jj%jj%%JKj
1882H%%J%jJ%%jjj%%%%%JJJ%%%J%J%Jkjjj%J%%j%%%j%%jJK%%%%%%%%%%JJjj%%%kjJKJJ%%%
1873A0kkJ%JJ%jj%%JJ%J%%j%j%%JJ%%jJ%%jJJk%%jJj%%%Jj%%%%%%%%jJJ%jk%JJKKj%jjjjj
1865FJJ%JJ%%%j%j%JJj%%J%Jj%%%j%%%%k%K%jj%J%%%J%j%%%J%%jjJJ%j%%j%%%%%j%%%JJj%
1857GK%J%J%%j%jj%%%%J%%jjjJK%J%%j%J%J%%%jj%J%%j%JJ%Jjj%%%j%jjj%KJ%%%j%J%%%%J
1848A0JJ%j%KJjjj%%%j%%j%J%%Jj%J%KKJJ%%%jJ%%JJKJJJ%J%%%j%jj%j%jjj%%jj%%%Jj%j%
1840A5kj%%%j%%KJ%J%J%%J%KJJ%%%JJJ%%J%Jkkjk%j%%j%%%kkJJjjkJJ%%jJ%JJjj%j%%%%%J
$$ plain form
1831 13 15 14 14 13 11 10 10 10 9 11 12 12 11 10 9 8 8 9 10 9 9 8 9 9 9 10 10 10 11 11 10 9 8 9 9 10 11 11 12 12 13 13 12 12 11 10 10 9 10 10 10 11 12 12 12 12 12 11 12 12 12 11 10 10 9 9 10 11 12 13
1823 13 13 12 12 12 13 14 13 12 12 12 12 11 11 12 11 11 10 10 11 13 13 12 11 11 11 10 11 11 11 11 11 12 11 10 11 12 11 11 11 12 13 12 12 12 11 11 13 12 12 12 13 14 13 12 12 13 14 14 13 12 10 9 9 9 11 12 13 13 12 11
1815 11 12 12 12 12 11 10 10 9 9 10 11 11 10 10 12 13 12 12 12 11 11 12 12 11 11 10 11 13 14 12 11 11 11 10 10 10 11 11 11 13 13 13 13 11 11 11 10 10 11 11 12 13 13 12 11 12 13 13 13 12 12 12 12 12 11 10 10 11 11 12
1806 12 12 13 14 14 15 16 16 16 15 14 14 14 14 14 14 13 13 12 12 14 14 15 14 14 14 14 13 15 16 16 14 13 13 14 14 14 15 16 16 16 16 16 15 16 16 14 14 13 14 14 14 14 14 14 14 15 15 15 14 13 12 11 11 12 13 13 14 14 14 14
1798 14 13 14 15 16 16 16 17 17 16 16 17 18 17 16 16 17 16 16 17 18 17 17 17 17 18 19 19 18 18 18 17 17 18 20 19 18 19 18 16 16 15 17 17 18 18 19 19 18 18 18 18 20 20 21 21 21 21 21 22 23 23 23 23 23 23 24 24 25 25 25
1790 25 25 25 24 25 27 27 26 26 26 25 26 27 28 29 29 29 29 28 30 31 32 33 33 34 35 37 38 37 38 38 38 37 38 39 41 43 44 43 44 45 46 47 46 47 48 49 49 50 51 52 53 54 55 56 57 58 62 65 66 67 67 67 70 72 75 77 79 81 83 84
1781 84 86 88 91 93 97 100 103 107 110 114 118 122 127 132 138 144 151 158 165 172 182 192 204 216 229 243 258 276 297 318 342 368 397 429 464 503 548 597 651 712 781 861 951 1055 1176
1776 1176 1316 1477 1661 1867 2094 2334 2582 2823 3043 3228 3367 3448 3468 3427 3333 3197 3028 2836 2631 2422 2215 2020 1837 1671
$$ packed form
1831A3Kj%jkj%%jKJ%jjjj%JJj%jJ%%J%%J%jjjJ%JJ%J%J%j%jj%jJ%%JJ%%%%jJ%%jj%j%JJJJ
1823A3%j%%JJjj%%%j%Jj%j%JK%jj%%jJ%%%%JjjJJj%%JJj%%j%Kj%%JJjj%JJ%jjkj%%KJJ%jj
1815A1J%%%jj%j%JJ%j%KJj%%j%J%j%jJKJkj%%j%%J%%K%%%k%%j%J%JJ%jjJJ%%j%%%%jj%J%J
1806A2%JJ%JJ%%jj%%%%%j%j%K%Jj%%%jKJ%kj%J%%JJ%%%%jJ%k%jJ%%%%%%J%%jjjj%JJ%J%%%
1798A4jJJJ%%J%j%JJjj%Jj%JJj%%%JJ%j%%j%JKjjJjk%jK%J%J%j%%%K%J%%%%JJ%%%%%J%J%%
1790B5%%jJK%j%%jJJJJ%%%jKJJJ%JJKJjJ%%jJJKKJjJJJJjJJJ%JJJJJJJJJMLJJ%%LKLKKKKJ
1781H4KKLKMLLMLMMMNNOOPPPPJ0J0J2J2J3J4J5J8K1K1K4K6K9L2L5L9M5M9N4O1O9Q0R0J04J21
1776A176J40J61J84K06K27K40K48K41K20J85J39Q1K0m1r4j36j69j92k05k09k07j95j83j66
$$ plain form
1773 1671 1521 1388 1273 1174 1091 1021 962 911 868 834 806 784 766 755 749 748 751 759 774 794 820 850 888 934 988 1054 1132 1226 1335 1462 1609 1777 1965
1769 1965 2175 2399 2631 2857 3065 3239 3366 3438 3451 3405 3304 3159 2981 2779 2566 2349 2132 1926 1732 1555 1394 1252 1127 1019
1766 1019 924 842 771 710 655 605 559 518 480 447 417 390 367 345 323 303 286 270 254 241 229 218 207 197 188 180 173 166 159 152 145 139 134 130 126 121 118 114 111 108 104 101 97 94
1761 94 91 89 88 86 84 81 80 78 76 73 71 69 67 65 64 63 61 60 58 55 55 54 54 54 52 50 50 50 50 50 49 48 46 45 44 44 43 42 42 42 42 42 41 40 39 38 37 36 35 33 33 33 33 33 33 32 31 31 31 31 31 31 29 28 29 29 29 30 30 30
1753 30 29 28 28 27 26 26 25 24 24 24 24 24 26 27 27 26 27 27 25 23 24 24 25 27 26 24 24 23 24 25 25 25 24 23 23 22 22 22 21 21 21 20 21 21 21 20 20 21 20 19 20 20 21 20 19 20 21 20 20 21 21 22 21 20 19 18 19 19 20 20
1744 20 21 21 21 21 21 20 19 18 20 21 21 20 20 20 20 20 20 20 19 19 19 19 19 19 19 19 18 18 17 16 16 15 15 15 15 16 17 18 17 17 15 14 14 15 14 14 13 13 14 14 14 15 15 15 16 16 16 16 16 16 16 16 15 15 17 17 16 16 15 15
1736 15 16 15 15 16 15 15 16 17 16 15 15 14 15 16 16 15 14 13 13 14 14 14 15 16 16 16 15 13 14 14 14 15 15 15 16 15 14 14 14 13 14 14 15 15 16 15 14 12 12 12 14 15 15 15 15 14 14 14 14 15 15 15 14 13 14 15 15 15 14 14
1728 14 15 15 14 13 12 10 11 12 13 13 12 12 13 14 13 12 11 12 13 13 12 10 9 9 11 12 13 13 12 11 12 12 12 13 14 11 10 10 11 12 12 12 12 14 16 16 14 13 12 12 11 11 10 11 12 12 12 12 12 12 12 13 13 14 13 12 12 12 12 12
$$ packed form
1773A671j50j33j15r9q3p0n9n1m3l4k8k2j8j1ojLQJ5K0K6L0L8M6N4O6P8R4J09J27J47J68J88
1769A965K10K24K32K26K08J74J27P2J3m6j01j45j78k02k13k17k17k06j94j77j61j42j25j08
1766A019r5q2p1o1n5n0m6m1l8l3l0k7k3k2k2k0j7j6j6j3j2j1j1j0rqppppponmmnlmllmlml
1761I4lkjkkljkklkkkkjjkjkl%j%%kk%%%%jjkjj%jj%%%%jjjjjjjk%%%%%jj%%%%%kjJ%%J%%
1753C0jj%jj%jj%%%%KJ%jJ%kkJ%JKjk%jJJ%%jj%j%%j%%jJ%%j%JjjJ%JjjJJj%J%JjjjjJ%J%
1744B0J%%%%jjjKJ%j%%%%%%j%%%%%%%j%jj%j%%%JJJj%kj%Jj%j%J%%J%%J%%%%%%%j%K%j%j%
1736A5Jj%Jj%JJjj%jJJ%jjj%J%%JJ%%jkJ%%J%%Jjj%%jJ%J%Jjjk%%KJ%%%j%%%J%%jjJJ%%j%
1728A4J%jjjkJJJ%j%JJjjjJJ%jkj%KJJ%jjJ%%JJlj%JJ%%%KK%kjj%j%jJJ%%%%%%J%Jjj%%%%
$$ plain form
1719 12 12 11 11 11 11 12 12 12 11 11 12 12 13 13 12 13 13 13 12 12 12 13 13 12 12 10 10 12 13 13 13 12 12 12 11 12 13 12 12 13 13 13 12 13 14 14 14 12 11 10 11 11 11 10 10 9 9 11 12 12 11 12 13 13 13 13 12 11 11 12
1711 12 12 12 12 13 13 13 14 14 14 13 13 13 14 14 14 14 13 14 15 15 16 17 16 15 15 14 14 14 14 14 13 13 13 14 16 17 16 16 17 18 19 22 23 23 23 25 25 26 26 27 28 28 28 27 26 24 23 23 22 21 20 19 19 19 20 20 20 20 20 19
1703 19 18 16 17 17 17 17 17 17 18 19 21 23 24 25 25 25 24 24 24 24 24 23 24 24 25 26 27 27 26 25 25 26 27 27 26 27 27 26 26 26 26 24 23 21 21 20 19 19 18 17 17 16 16 15 15 16 18 19 19 18 18 18 18 17 18 18 19 19 19 19
1694 19 18 18 17 16 16 13 12 13 14 16 15 14 13 12 12 13 13 13 13 13 11 10 10 10 11 13 12 12 12 12 12 12 13 12 11 10 10 10 9 10 11 11 10 10 10 11 12 12 12 13 12 12 11 10 11 10 10 10 9 9 7 7 8 9 10 10 11 10 10 11
1686 11 11 13 12 12 12 11 11 11 12 13 12 11 11 13 14 14 13 12 11 10 10 10 11 11 10 9 8 9 10 11 11 12 12 11 9 11 12 11 12 13 13 13 14 14 13 12 10 11 10 10 11 11 11 11 12 12 11 11 10 10 11 12 12 12 12 12 12 13 12 11
1678 11 11 11 11 11 12 10 9 9 10 11 11 10 11 11 9 10 11 11 12 11 11 11 11 11 12 14 14 14 13 12 12 12 11 10 11 11 12 12 13 13 13 14 13 12 11 11 11 11 10 12 13 14 14 14 13 12 11 11 11 9 8 8 9 10 10 10 9 9 10 10
1669 10 10 10 10 10 10 11 12 13 13 12 10 10 10 10 10 11 9 8 8 8 8 8 8 8 9 10 10 10 10 10 11 12 11 11 11 12 12 11 12 12 11 11 10 10 10 9 8 9 9 9 9 8 7 7 8 9 9 9 10 9 8 7 7 9 10 12 12 12 12 12
1661 12 12 12 12 11 11 11 11 12 11 11 11 11 11 11 11 11 11 12 12 11 11 11 11 11 11 11 11 12 11 10 8 7 8 9 10 10 11 12 12 11 10 10 10 10 11 11 10 9 10 10 10 10 10 10 10 11 11 11 12 13 12 11 11 11 11 11 11 10 11 11
$$ packed form
1719A2%j%%%J%%j%J%J%jJ%%j%%J%j%k%KJ%%j%%jJJj%J%%jJJ%%kjjJ%%j%j%KJ%jJJ%%%jj%J
1711A2%%%J%%J%%j%%J%%%jJJ%JJjj%j%%%%j%%JKJj%JJJLJ%%K%J%JJ%%jjkj%jjjj%%J%%%%j
1703A9jkJ%%%%%JJKKJJ%%j%%%%jJ%JJJ%jj%JJ%jJ%j%%%kjk%jj%jj%j%j%JKJ%j%%%jJ%J%%%
1694A9j%jj%ljJJKjjjj%J%%%%kj%%JKj%%%%%Jjjj%%jJJ%j%%JJ%%Jj%jjJj%%j%k%JJJ%Jj%J
1686A1%Kj%%j%%JJjj%KJ%jjjj%%J%jjjJJJ%J%jkKJjJJ%%J%jjkJj%J%%%J%j%j%JJ%%%%%Jjj
1678A1%%%%Jkj%JJ%jJ%kJJ%Jj%%%%JK%%jj%%jjJ%J%J%%Jjjj%%%jKJJ%%jjj%%kj%JJ%%j%J%
1669A0%%%%%JJJ%jk%%%%Jkj%%%%%%JJ%%%%JJj%%J%jJ%j%j%%jjJ%%%jj%JJ%%Jjjj%KJK%%%%
1661A2%%%j%%%Jj%%%%%%%%J%j%%%%%%%JjjkjJJJ%JJ%jj%%%J%jjJ%%%%%%J%%JJjj%%%%%jJ%
$$ plain form
1653 11 11 11 11 11 12 12 11 11 10 10 11 12 12 13 13 13 11 10 10 10 10 10 9 9 10 11 12 13 13 13 12 11 10 10 10 10 11 13 12 11 10 9 9 9 10 10 11 11 11 11 10 9 8 9 9 10 11 11 11 11 10 10 11 12 11 11 11 12 12 13
1644 13 13 11 8 8 9 9 10 11 11 12 12 13 13 12 13 12 11 10 10 10 10 10 9 10 10 11 11 12 11 10 11 11 11 11 11 10 11 12 12 12 13 14 15 15 14 13 12 11 10 10 11 11 11 11 11 12 13 13 13 12 11 10 10 9 9 11 12 12 11 9
1636 9 10 10 11 11 12 12 12 10 9 9 10 11 11 12 12 12 12 12 11 10 8 9 10 11 11 11 10 9 9 10 11 11 10 11 12 12 11 10 10 11 11 12 11 11 10 9 9 11 12 12 12 11 11 10 10 10 11 11 10 9 9 8 9 9 10 9 10 10 11 10 9
1627 9 10 9 9 9 9 11 12 13 12 12 11 11 11 11 10 11 14 15 15 13 11 12 13 13 12 13 13 14 14 14 15 15 15 17 18 19 21 23 26 29 32 32 31 27 23 22 20 19 18 16 15 14 13 12 13 13 12 12 12 12 11 11 11 11 10 10 10 10 10 10 11
1619 11 12 13 14 13 14 14 14 13 13 13 14 14 15 16 18 19 20 20 21 22 23 26 32 38 45 52 60 69 75 77 75 69 59 49 42 35 31 26 24 22 20 18 18 18 18 17 16 15 14 13 13 13 13 14 13 13 13 13 13 12 13 13 14 14 13 12 11 9
1611 9 10 11 12 13 15 17 17 16 16 16 18 20 24 28 33 40 48 56 63 70 75 75 71 65 58 49 40 34 30 26 23 20 20 20 19 18 16 14 15 15 14 13 13 13 12 12 12 13 14 16 15 14 13 12 12 12 13 13 13 13 13 13 12 11 12 13 14 14 15 15 16
1602 16 16 18 19 22 24 27 29 31 34 36 35 32 29 25 22 21 20 18 16 14 14 15 15 16 16 16 15 15 15 12 11 12 13 15 16 16 14 12 13 14 14 12 12 14 15 14 13 13 13 13 14 13 12 13 14 14 15 15 15 14 13 13 13 13 12 10 10 11 12 13
1594 13 13 12 11 11 11 12 13 14 15 16 15 14 13 12 13 13 13 12 13 12 12 12 12 12 12 13 14 13 11 10 9 10 12 11 11 11 11 11 11 11 11 11 11 10 9 9 10 9 8 9 11 12 12 12 12 14 13 12 12 12 13 12 12 11 12 13 14 14 12 12
$$ packed form
1653A1%%%%J%j%j%JJ%J%%kj%%%%j%JJJJ%%jjj%%%JKjjjj%%J%J%%%jjjJ%JJ%%%j%JJj%%J%J
1644A3%kl%J%JJ%J%J%jJjjj%%%%jJ%J%JjjJ%%%%jJJ%%JJJ%jjjjj%J%%%%JJ%%jjj%j%KJ%jk
1636IJ%J%J%%kj%JJ%J%%%%jjkJJJ%%jj%JJ%jJJ%jj%J%Jj%jj%KJ%%j%j%%J%jj%jJ%JjJ%Jjj
1627IJj%%%KJJj%j%%%jJLJ%kkJJ%jJ%J%%J%%KJJKKLLL%jmmjkjjkjjjjJ%j%%%j%%%j%%%%%J
1619A1JJJjJ%%j%%J%JJKJJ%JJJLOOPPQROKkoj0j0ppmnkkkk%%%jjjjj%%%Jj%%%%jJ%J%jjjk
1611IJJJJKK%j%%KKMMNPQQPPN%moprrommll%%jjkkJ%jj%%j%%JJKjjjj%%J%%%%%jjJJJ%J%J
1602A6%KJLKLKKLKjllmljjkkk%J%J%%j%%ljJJKJ%kkJJ%k%KJjj%%%JjjJJ%J%%jj%%%jk%JJJ
1594A3%jj%%JJJJJjjjjJ%%jJj%%%%%JJjkjjJKj%%%%%%%%%jj%JjjJKJ%%%Kjj%%Jj%jJJJ%k%
$$ plain form
1586 12 12 12 12 12 11 11 11 10 10 12 13 15 16 15 14 14 15 15 15 14 13 14 14 14 14 13 12 12 14 14 15 14 13 13 13 15 14 13 13 13 13 14 12 13 13 13 13 13 13 14 13 13 14 15 14 12 12 13 14 14 14 13 11 11 11 11 11 10 10 10
1577 10 9 10 10 11 13 14 13 14 14 14 14 14 15 15 13 12 13 14 13 12 14 14 13 13 13 13 12 12 12 11 11 11 11 9 10 12 14 15 15 14 14 14 12 11 12 13 14 13 13 12 12 11 12 13 13 12 11 11 11 11 12 13 13 14 15 15 16 16 16 15
1569 15 15 15 14 13 12 11 10 9 8 9 10 11 13 13 13 13 12 12 12 12 13 12 12 11 11 11 10 10 10 11 12 12 13 12 12 13 14 13 12 11 11 10 10 11 11 12 13 13 13 14 14 14 14 14 13 13 13 13 13 12 12 12 12 14 13 13 14 15 15 15
1561 15 14 14 14 14 14 13 12 13 13 13 13 13 13 14 14 13 13 13 14 14 14 15 14 13 14 14 12 12 13 13 13 14 14 14 14 15 14 13 13 14 15 16 15 13 12 13 13 13 12 12 11 12 12 13 14 14 14 12 11 11 11 12 13 13 13 14 14 14 14 15
1552 15 14 13 13 13 13 13 13 14 16 15 15 13 13 15 16 15 14 13 13 13 13 13 12 12 11 12 14 14 15 15 15 16 16 17 18 17 16 15 14 14 14 15 15 15 15 16 15 14 14 14 14 14 15 15 16 16 15 15 16 15 12 11 11 13 14 15 15 15 15 14
1544 14 14 14 14 15 15 15 16 16 15 15 15 15 15 16 16 14 14 14 14 15 16 16 16 16 16 15 15 14 14 14 13 14 13 13 13 13 12 12 13 13 14 15 15 14 13 13 13 13 13 11 10 10 11 11 11 12 12 12 11 12 12 13 14 14 14 14 13 12 12 12
1536 12 13 13 14 14 15 16 16 15 14 13 12 12 12 13 13 14 15 17 17 16 17 18 17 15 14 13 14 16 16 17 15 14 13 13 14 14 15 16 16 16 17 17 17 16 16 15 15 15 15 15 15 13 13 13 13 13 13 14 13 13 12 13 13 13 13 13 14 14 15 15
1527 15 15 15 15 16 16 16 15 15 14 14 14 15 14 13 11 12 13 14 16 17 16 15 16 16 16 15 15 15 16 16 16 16 15 14 13 13 13 13 13 13 15 15 13 13 14 15 15 16 17 17 16 15 14 14 15 15 16 16 15 16 16 16 16 17 16 14 14 14 15 16
$$ packed form
1586A2%%%%j%%j%KJKJjj%J%%jjJ%%%jj%K%Jjj%%Kjj%%%JkJ%%%%%Jj%JJjk%JJ%%jk%%%%j%%
1577A0jJ%JKJjJ%%%%J%kjJJjjK%j%%%j%%j%%%kJKKJ%j%%kjJJJj%j%jJJ%jj%%%JJ%JJ%J%%j
1569A5%%jjjjjjjJJJK%%%j%%%Jj%j%%j%%JJ%Jj%JJjjj%j%J%JJ%%J%%%%j%%%%j%%%Kj%JJ%%
1561A5j%%%%jjJ%%%%%J%j%%J%%JjjJ%k%J%%J%%%Jjj%JJJjkjJ%%j%jJ%JJ%%kj%%JJ%%J%%%J
1552A5jj%%%%%JKj%k%KJjjj%%%%j%jJK%J%%J%JJjjjj%%J%%%Jjj%%%%J%J%j%Jjlj%KJJ%%%j
1544A4%%%J%%J%j%%%%J%k%%%JJ%%%%j%j%%jJj%%%j%J%JJ%jj%%%%kj%J%%J%%jJ%JJ%%%jj%%
1536A2J%J%JJ%jjjj%%J%JJK%jJJjkjjJK%Jkjj%J%JJ%%J%%j%j%%%%%k%%%%%Jj%jJ%%%%J%J%
1527A5%%%J%%j%j%%JjjkJJJKJjjJ%%j%%J%%%jjj%%%%%K%k%JJ%JJ%jjj%J%J%jJ%%%Jjk%%JJ
$$ plain form
1519 16 16 16 15 15 14 15 16 16 16 16 17 18 18 18 18 19 19 19 19 18 18 18 18 18 17 15 14 14 14 15 16 16 16 15 15 15 15 14 13 15 16 16 15 13 13 14 15 16 16 17 16 15 16 17 16 14 14 15 16 16 17 18 17 16 15 15 17 18 17 16
1511 16 15 16 16 16 17 19 19 18 17 17 16 17 18 19 18 18 18 17 16 16 15 15 16 16 17 18 18 16 15 15 15 15 15 16 17 18 19 20 18 18 18 17 18 16 15 15 15 15 15 16 17 20 20 19 19 18 18 18 18 18 18 18 17 17 17 17 18 18 19 18
1502 18 18 17 17 17 18 17 16 17 17 17 17 18 19 19 18 18 18 19 19 18 17 17 17 18 20 21 21 20 20 21 21 19 19 19 18 18 18 16 17 17 18 19 19 20 19 20 20 19 18 18 18 19 20 18 17 17 18 17 18 20 21 23 22 20 19 19 19 20 21 22
1494 22 23 22 20 21 21 21 22 22 23 23 22 21 20 19 19 21 21 21 22 21 20 19 18 17 16 15 16 17 17 16 15 17 19 21 22 21 20 19 17 17 18 19 19 19 20 21 20 19 20 21 21 20 19 18 18 19 19 19 21 22 22 22 22 21 21 21 20 21 21 21
1486 21 20 20 20 21 21 21 21 20 22 23 22 22 21 20 20 20 20 20 20 18 18 20 19 18 19 19 20 20 21 21 21 21 21 21 21 21 21 21 21 21 21 21 22 22 21 22 22 21 21 20 20 19 21 21 22 21 21 21 21 20 20 21 21 21 21 21 21 21 21 21
1477 21 21 20 19 20 21 21 21 21 20 21 21 21 21 21 21 22 23 23 23 23 23 23 22 22 22 22 22 22 21 21 22 21 21 21 21 21 21 21 21 22 22 22 23 23 22 22 22 23 23 22 21 21 22 22 22 22 23 23 22 21 22 23 23 22 20 20 21 21 21 22
1469 22 23 24 25 25 25 25 26 25 24 23 23 24 25 26 26 25 26 27 26 25 25 25 25 25 26 26 25 24 24 25 25 25 25 25 26 25 24 24 25 24 23 24 24 24 24 24 25 24 23 23 22 22 22 22 23 24 26 27 27 28 29 28 28 27 26 25 24 25 26 27
1461 27 28 27 26 26 25 26 27 27 27 27 27 28 27 26 26 26 25 25 25 25 24 25 25 26 26 25 25 24 25 25 26 26 26 25 26 26 26 26 27 28 28 28 28 28 28 27 25 26 27 27 28 29 30 30 30 31 31 30 30 30 30 30 31 30 29 30 31 31 31 30
$$ packed form
1519A6%%j%jJJ%%%JJ%%%J%%%j%%%%jkj%%JJ%%j%%%jjKJ%jk%JJJ%JjjJJjk%JJ%JJjjj%KJjj
1511A6jJ%%JK%jj%jJJJj%%jj%j%J%JJ%kj%%%%JJJJJk%%jJkj%%%%JJL%j%j%%%%%%j%%%J%Jj
1502A8%j%%JjjJ%%%JJ%j%%J%jj%%JKJ%j%J%k%%j%%kJ%JJ%JjJ%jj%%JJkj%JjJKJKjkj%%JJJ
1494B2JjkJ%%J%J%jjjj%K%%JjjjjjjjJJ%jjKKKJjjjk%JJ%%JJjjJJ%jjj%J%%KJ%%%j%%jJ%%
1486B1j%%J%%%jKJj%jj%%%%%k%KjjJ%J%J%%%%%%%%%%%%%J%jJ%j%j%jK%Jj%%%j%J%%%%%%%%
1477B1%jjJJ%%%jJ%%%%%JJ%%%%%j%%%%%j%Jj%%%%%%%J%%J%j%%J%jj%J%%%J%jjJJ%jk%J%%J
1469B2JJJ%%%Jjjj%JJJ%jJJjj%%%%J%jj%J%%%%Jjj%JjjJ%%%%Jjj%j%%%JJKJ%JJj%jjjjJJJ
1461B7Jjj%jJJ%%%%Jjj%%j%%%jJ%J%j%jJ%J%%jJ%%%JJ%%%%%jkJJ%JJJ%%J%j%%%%JjjJJ%%j
$$ plain form
1452 30 29 29 28 28 29 29 28 27 27 28 29 29 29 28 28 28 27 29 31 31 31 31 31 30 28 29 29 29 29 29 29 31 32 31 32 32 31 31 33 33 33 33 34 33 32 33 33 34 34 33 32 32 32 32 31 32 33 34 34 33 32 32 33 33 34 34 34 34 35 35
1444 35 35 34 32 33 33 35 37 37 37 37 36 37 37 37 37 36 36 36 36 36 37 36 36 36 37 37 37 37 37 36 37 37 37 37 36 35 35 35 35 36 36 36 36 36 36 36 36 36 36 36 36 35 34 35 37 37 37 37 37 38 38 40 39 39 40 40 40 39 38 39
1436 39 40 42 42 41 39 40 39 37 37 39 41 42 43 42 41 40 40 40 41 43 44 43 42 42 43 44 43 43 43 45 44 44 45 44 43 44 44 44 44 44 44 45 45 45 45 44 43 42 43 43 43 44 45 45 45 45 44 45 45 45 46 47 49 48 47 47 46 45 44 45
1427 45 46 47 48 49 50 50 50 49 48 49 49 49 48 47 46 45 47 48 48 47 47 48 49 49 49 49 49 49 49 49 49 49 49 49 50 50 50 50 50 50 51 53 53 52 51 49 48 48 50 52 53 54 53 53 53 52 50 52 54 54 54 55 54 54 54 54 54 54 54 55
1419 55 57 57 56 54 54 55 56 57 57 57 56 56 56 56 56 57 58 58 58 57 57 58 59 59 59 59 59 60 60 60 60 61 61 61 61 60 59 61 62 62 61 63 65 64 63 64 66 66 66 67 68 68 66 65 66 67 69 70 72 72 71 71 72 71 70 71 71 70 70 71
1410 71 71 71 72 72 72 73 73 74 75 76 76 76 76 76 77 78 78 78 77 78 79 80 82 81 80 81 82 83 83 83 83 82 82 83 85 85 85 85 85 85 86 86 87 87 88 88 89 90 92 92 91 92 93 94 94 95 96 96 96 96 96 96 95 95 95 96 98 98 98 99
1402 99 99 100 102 103 104 106 107 107 107 108 108 108 108 109 109 110 111 111 112 113 114 115 116 116 116 116 116 117 118 118 117 119 118 117 117 117 117 117 117 118 119 119 118 118 119 119 118 119 119 120 121 121 120 120 119 120 121 121 121 122 122 123 123 124 125 125 126 128 130 131
1394 131 130 130 130 131 132 131 131 133 134 136 137 138 138 137 136 137 138 139 139 139 142 143 145 146 146 147 147 147 147 149 150 151 152 153 153 154 154 155 157 157 159 161 161 161 163 165 165 166 166 167 170 171 173 175 177 178 177 177 179 181 181 181 183 185 187 189 189 190 192
$$ packed form
1452C0j%j%J%jj%JJ%%j%%jKK%%%%jkJ%%%%%KJjJ%j%K%%%JjjJ%J%jj%%%jJJJ%jj%J%J%%%J%
1444C5%jkJ%KK%%%jJ%%%j%%%%Jj%%J%%%%jJ%%%jj%%%J%%%%%%%%%%%jjJK%%%%J%Kj%J%%jjJ
1436C9JK%jkJjk%KKJJjjj%%JKJjj%JJj%%Kj%JjjJ%%%%%J%%%jjjJ%%JJ%%%jJ%%JJKjj%jjjJ
1427D5JJJJJ%%jjJ%%jjjjKJ%j%JJ%%%%%%%%%%%J%%%%%JK%jjkj%KKJJj%%jkKK%%Jj%%%%%%J
1419E5K%jk%JJJ%%j%%%%JJ%%j%JJ%%%%J%%%J%%%jjKJ%jKKjjJK%%JJ%kjJJKJK%j%JjjJ%j%J
1410G1%%J%%J%JJJ%%%%JJ%%jJJJKjjJJJ%%%j%JK%%%%%J%J%J%JJK%jJJJ%JJ%%%%%j%%JK%%J
1402I9%JKJJKJ%%J%%%J%JJ%JJJJJ%%%%JJ%jKjj%%%%%JJ%j%J%jJ%JJ%j%jJJ%%J%J%JJ%JKKJ
1394A31j%%JJj%KJKJJ%jjJJJ%%LJKJ%J%%%KJJJJ%J%JK%KK%%KK%J%JLJKKKJj%KK%%KKKK%JK
$$ plain form
1386 192 193 194 194 196 198 199 200 203 205 205 205 206 207 208 210 211 212 214 215 216 219 221 223 225 226 227 230 232 234 235 236 237 239 240 242 244 245 247 250 252 253 255 259 263 265 267 269 271 271 273 275 278 280 282 285 287 288 289 291 294 297 300 301 303 304 307 310 313 315
1377 315 317 318 320 323 327 330 332 335 338 340 341 344 346 349 352 356 360 363 367 372 378 381 385 388 392 397 401 406 411 415 420 425 430 435 440 445 450 456 461 465 469 475 480 486 492 499 505 512 516 522 529 535 541 548 555 562 568 575 581 588 596 604 612 620 627 635 642 651 661
1369 661 670 679 688 696 704 713 723 733 742 751 762 772 784 796 807 819 831 842 855 868 880 893 906 919 934 949 964 977 991 1007 1024 1042 1059 1076 1094 1112 1132 1152 1172
1364 1172 1192 1213 1233 1255 1276 1298 1322 1346 1373 1399 1425 1450 1477 1506 1535 1565 1595 1628 1660 1694 1727 1763 1800 1840 1880 1919 1960 2003 2048 2093 2139 2190 2240 2292
1360 2292 2346 2402 2461 2521 2583 2648 2715 2784 2857 2933 3012 3092 3175 3263 3354 3450 3550 3653 3760 3872 3989 4110 4236 4368 4506 4652 4805 4964
1357 4964 5130 5305 5487 5679 5881 6093 6316 6550 6797 7057 7331 7619 7924 8247 8586 8944 9323 9723 10145 10591 11062 11559 12082
1354 12082 12635 13219 13833 14481 15162 15875 16624 17405 18219 19067 19945 20851 21782 22732 23694 24661 25627 26580 27510 28406 29252 30038 30747
1352 30747 31368 31885 32292 32578 32738 32767 32663 32431 32075 31604 31027 30357 29606 28788 27918 27011 26076 25125 24168 23214 22271 21346 20444
$$ packed form
1386A92JJ%KKJJLK%%JJJKJJKJJLKKKJJLKKJJJKJKKJKLKJKMMKKKK%KKLKKLKJJKLLLJKJLLLK
1377C15KJKLMLKLLKJLKLLMMLMNOLMLMNMNNMNNNNNNNONMMONOOPOPMOPOOPPPOPOPQQQQPQPRJ0
1369F61RRRQQRJ0J0RRJ1J0J2J2J1J2J2J1J3J3J2J3J3J3J5J5J5J3J4J6J7J8J7J7J8J8K0K0K0
1364A172K0K1K0K2K1K2K4K4K7K6K6K5K7K9K9L0L0L3L2L4L3L6L7M0M0L9M1M3M5M5M6N1N0N2
1360B292N4N6N9O0O2O5O7O9P3P6P9Q0Q3Q8R1R6J00J03J07J12J17J21J26J32J38J46J53J59
1357D964J66J75J82J92K02K12K23K34K47K60K74K88L05L23L39L58L79M00M22M46M71M97N23
1354A2082N53N84O14O48O81P13P49P81Q14Q48Q78R06R31R50R62R67R66R53R30Q96Q46P86P09
1352C0747O21N17M07K86J60K9j04k32l56m71n77o70p51q18q70r07r35r51r57r54r43r25r02
$$ plain form
1349 20444 19567 18719 17902 17119 16367 15648 14962 14311 13690 13098 12538 12008 11505 11026 10571 10139 9730 9344 8976 8626 8294 7980 7682
1346 7682 7396 7126 6869 6624 6390 6167 5955 5752 5559 5376 5200 5031 4870 4715 4568 4428 4294 4163 4039 3920 3806 3698 3592
1343 3592 3491 3393 3299 3209 3124 3041 2961 2883 2809 2737 2668 2602 2538 2476 2416 2359 2306 2252 2200 2148 2100 2053 2008 1967 1924 1882 1843 1803 1765 1730 1696 1661 1628 1597
1339 1597 1566 1535 1505 1476 1448 1421 1395 1372 1348 1322 1297 1275 1254 1235 1214 1192 1171 1151 1131 1114 1095 1077 1059 1044 1029 1014 999 987 972 958 943 928 914 901
1335 901 887 873 861 848 838 827 816 804 793 783 773 763 752 742 732 723 713 703 694 685 676 668 660 651 643 636 629 622 615 607 600 593 585 579 572 566 559 551 545 541 535 530 523 518 513 509 504 499 495 491 486 481
1329 481 476 472 468 465 462 457 451 446 443 440 435 429 426 423 421 418 414 410 406 402 399 396 392 388 383 379 375 371 368 364 361 358 354 350 345 340 336 332 331 329 326 323 319 314 311 308 306 305 302 300 297 295 293 291 289 286 283 280 278 276 274 272 270 268 265 263 262 259 255
1321 255 254 254 253 250 248 246 244 243 242 240 237 237 236 234 232 229 226 224 223 222 220 219 217 216 216 213 211 210 209 208 207 205 203 202 200 199 197 196 196 195 193 192 191 189 188 186 185 184 183 182 182 179 177 176 176 175 174 174 174 173 171 170 168 165 165 164 163 163 163
1313 163 162 161 160 160 158 157 156 156 155 155 154 154 153 152 152 151 151 150 148 145 144 143 142 142 140 138 138 138 138 139 139 137 136 135 134 132 131 131 131 132 132 130 129 128 128 128 126 125 124 123 123 123 121 120 119 119 119 117 115 115 115 115 113 112 110 109 108 107 107
$$ packed form
1349B0444q77q48q17p83p52p19o86o51o21n92n60n30n03m79m55m32m09l86l68l50l32l14k98
1346G682k86k70k57k45k34k23k12k03j93j83j76j69j61j55j47j40j34j31j24j19j14j08j06
1343C592j01r8r4r0q5q3q0p8p4p2o9o6o4o2o0n7n3n4n2n2m8m7m5m1m3m2l9m0l8l5l4l5l3l1
1339A597l1l1l0k9k8k7k6k3k4k6k5k2k1j9k1k2k1k0k0j7j9j8j8j5j5j5j5j2j5j4j5j5j4j3
1335I01j4j4j2j3j0j1j1j2j1j0j0j0j1j0j0rj0j0rrrqqrqppppqppqopopqomonpnnmnnmmnn
1329D81nmmllnonllnollklmmmmllmmnmmmlmllmmnnmmjkllmnllkjlklkkkklllkkkkkklkjlm
1321B55j%jlkkkjjkl%jkkllkjjkjkj%lkjjjjkkjkjkj%jkjjkjkjjjj%lkj%jj%%jkjkl%jj%%
1313A63jjj%kjj%j%j%jj%j%jkljjj%kk%%%J%kjjjkj%%J%kjj%%kjjj%%kjj%%kk%%%kjkjjj%
$$ plain form
1304 107 106 105 101 100 99 98 98 97 96 96 95 97 97 94 91 90 91 91 89 87 87 88 89 90 92 91 90 89 88 86 87 87 87 86 84 83 85 85 85 85 84 84 84 83 83 84 85 85 84 83 84 84 84 84 83 82 81 81 82 83 82 82 82 81 80 80 80 79 79
1296 79 79 79 78 78 79 80 80 79 77 78 77 76 75 75 75 75 75 75 75 75 76 75 74 74 76 76 75 74 74 73 73 73 72 72 72 72 72 73 72 72 72 71 70 71 72 71 70 69 68 68 68 69 69 70 70 70 70 70 70 69 68 67 68 68 68 68 66 65 65 66
1288 66 66 66 66 66 67 68 66 65 66 65 64 64 64 63 63 63 63 63 64 64 63 62 61 61 61 62 63 63 62 62 62 61 60 59 58 57 58 60 59 59 59 59 59 60 58 56 57 59 60 59 58 57 57 58 57 57 57 57 58 57 56 56 56 56 56 56 56 56 55 54
1279 54 53 52 52 52 52 52 53 54 54 53 52 52 53 55 54 54 54 53 53 52 51 50 51 52 52 50 49 50 50 50 52 54 52 50 48 48 49 50 49 48 47 47 47 48 49 48 47 47 47 46 46 45 45 46 47 48 48 48 46 44 43 43 44 45 44 42 42 42 42 45
1271 45 45 46 46 45 45 45 45 45 45 45 44 44 44 45 46 47 47 46 45 45 45 46 45 45 45 44 45 45 45 44 44 45 47 46 44 42 42 42 41 41 42 42 41 42 43 44 42 41 41 41 41 41 40 40 41 42 42 42 43 44 42 41 39 38 37 37 37 37 37 37
1263 37 37 37 36 35 36 36 37 38 37 37 35 34 35 36 36 37 37 37 36 36 36 36 36 36 37 37 38 39 40 38 36 36 35 35 35 35 36 37 37 36 36 36 36 36 35 34 34 34 34 35 34 34 34 33 33 33 33 33 34 35 34 33 34 34 34 34 34 33 33 33
1254 33 33 34 33 33 33 34 34 33 34 35 35 35 34 33 33 32 33 34 34 33 33 33 34 34 33 32 32 31 31 31 32 32 33 34 34 34 34 34 34 34 34 34 33 32 31 30 30 30 30 30 31 31 32 33 33 32 31 30 30 30 30 30 29 29 29 29 29 29 28 28
1246 28 27 27 28 29 29 30 30 30 30 29 30 30 30 30 30 31 31 30 29 30 29 29 29 29 29 28 31 32 30 29 28 28 29 30 29 29 28 28 28 29 29 27 26 25 26 27 26 25 25 27 28 29 29 30 29 27 26 26 27 28 29 29 29 29 29 28 28 27 28 28
$$ packed form
1304A07jjmjjj%jj%jK%lljJ%kk%JJJKjjjjkJ%%jkjK%%%j%%j%JJ%jjJ%%%jjj%JJj%%jj%%j%
1296G9%%j%JJ%jkJjjj%%%%%%%Jjj%K%jj%j%%j%%%%Jj%%jjJJjjjj%%J%J%%%%%jjjJ%%%kj%J
1288F6%%%%JJkjJjj%%j%%%%J%jjj%%JJ%j%%jjjjjJKj%%%%JkkJKJjjj%Jj%%%Jjj%%%%%%%jj
1279E4jj%%%%JJ%jj%JKj%%j%jjjJJ%kjJ%%KKkkk%JJjjj%%JJjj%%j%j%JJJ%%kkj%JJjk%%%L
1271D5%J%j%%%%%%j%%JJJ%jj%%Jj%%jJ%%j%JKjkk%%j%J%jJJJkj%%%%j%JJ%%JJkjkjj%%%%%
1263C7%%jjJ%JJj%kjJJ%J%%j%%%%%J%JJJkk%j%%%JJ%j%%%%jj%%%Jj%%j%%%%JJjjJ%%%%j%%
1254C3%Jj%%J%jJJ%%jj%jJJ%j%%J%jj%j%%J%JJ%%%%%%%%jjjj%%%%J%JJ%jjj%%%%j%%%%%j%
1246B8j%JJ%J%%%jJ%%%%J%jjJj%%%%jLJkjj%JJj%j%%J%kjjJJjj%KJJ%Jjkj%JJJ%%%%j%jJ%
$$ plain form
1238 28 28 27 26 25 26 26 27 28 29 30 29 28 27 28 29 28 27 27 28 28 28 27 27 27 27 27 28 28 28 28 28 27 27 26 27 28 29 27 25 24 24 24 23 22 23 24 25 26 26 26 26 25 26 26 26 26 26 26 27 25 25 25 26 26 26 25 25 25 25 26
1229 26 25 25 26 26 25 26 28 29 29 27 25 25 25 24 24 25 27 27 26 26 25 25 24 24 24 23 23 24 25 25 24 24 24 24 24 23 23 23 23 23 23 23 24 24 25 25 24 22 22 21 21 20 19 20 22 23 23 24 25 26 26 25 25 25 24 23 23 22 22 22
1221 22 23 23 22 23 23 23 22 22 22 21 21 21 21 21 22 22 22 23 20 19 20 20 21 22 22 22 22 21 21 20 21 22 22 22 22 21 21 21 21 20 20 21 21 22 23 22 22 22 23 23 23 22 23 24 24 25 24 24 23 21 21 21 22 23 23 21 20 20 20 21
1213 21 21 22 21 21 22 22 22 22 22 22 22 22 20 20 22 23 22 21 20 19 19 20 20 21 21 22 21 20 20 20 19 20 21 22 22 22 21 19 19 19 19 18 18 18 19 21 22 22 22 22 22 23 22 22 20 18 18 17 18 19 20 21 20 20 20 19 20 20 20 20
1204 20 20 19 20 20 21 20 18 18 18 19 19 19 18 18 19 20 19 18 18 18 20 20 19 19 19 19 20 20 20 20 21 20 20 21 21 20 19 19 18 18 18 17 18 19 20 21 21 21 21 21 22 21 20 21 21 21 21 20 21 21 20 19 19 19 20 21 21 21 20 19
1196 19 18 19 20 20 20 20 20 19 20 20 20 20 19 19 18 17 17 16 16 16 18 18 16 17 17 17 18 18 19 19 19 20 19 19 19 19 19 20 19 19 18 18 18 17 17 17 17 17 16 16 17 18 19 19 19 20 19 18 19 20 20 20 20 19 20 21 20 20 20 19
1188 19 18 16 16 16 16 17 18 18 18 18 18 18 19 19 19 19 19 19 18 18 18 18 19 20 19 19 18 17 17 18 18 18 16 15 16 16 16 16 16 18 18 18 19 19 17 15 16 18 18 18 18 18 19 20 20 18 17 18 18 18 18 18 18 17 16 14 17 19 19 18
1179 18 17 16 16 16 16 16 16 17 19 20 19 17 16 16 17 17 17 16 14 15 18 18 17 16 18 19 19 20 19 16 16 16 16 16 16 16 15 14 16 18 18 17 17 16 16 15 17 19 18 17 16 15 16 16 16 17 16 15 16 16 15 16 18 18 17 16 16 15 16 16
$$ packed form
1238B8%jjjJ%JJJJjjjJJjj%J%%j%%%%J%%%%j%jJJJkkj%%jjJJJJ%%%jJ%%%%%Jk%%J%%j%%%J
1229B6j%J%jJKJ%kk%%j%JK%j%j%j%%j%JJ%j%%%%j%%%%%%J%J%jk%j%jjJKJ%JJJ%j%%jj%j%%
1221B2J%jJ%%j%%j%%%%J%%JljJ%JJ%%%j%jJJ%%%j%%%j%J%JJj%%J%%jJJ%Jj%jk%%JJ%kj%%J
1213B1%Jj%J%%%%%%%k%KJjjjj%J%J%Jjj%%jJJJ%%jk%%%j%%JKJ%%%%Jj%kk%jJJJJj%%jJ%%%
1204B0%jJ%Jjk%%J%%j%JJjj%%K%j%%%J%%%Jj%J%jj%j%%jJJJJ%%%%JjjJ%%%jJ%jj%%JJ%%jj
1196A9jJJ%%%%jJ%%%j%jj%j%%K%kJ%%J%J%%Jj%%%%Jj%j%%j%%%%j%JJJ%%JjjJJ%%%jJJj%%j
1188A9jk%%%JJ%%%%%J%%%%%j%%%JJj%jj%J%%kjJ%%%%K%%J%kkJK%%%%JJ%kjJ%%%%%jjkLK%j
1179A8jj%%%%%JKJjkj%J%%jkJL%jjKJ%Jjl%%%%%%jjKK%j%j%jKKjjjjJ%%JjjJ%jJK%jj%jJ%
$$ plain form
1171 16 17 17 15 14 15 15 15 15 15 15 15 16 15 16 17 17 17 16 16 15 15 15 14 14 13 12 12 13 13 13 14 14 14 14 14 14 15 15 15 16 16 17 17 17 17 16 16 16 16 16 15 15 14 14 14 15 15 15 16 16 16 15 15 16 15 13 15 15 14 14
1163 14 15 16 17 17 17 17 17 17 17 17 17 16 15 14 14 14 14 14 16 18 17 16 16 16 16 16 16 16 15 15 15 14 14 14 14 14 14 14 14 13 13 14 14 14 13 12 12 12 12 13 13 14 13 13 13 12 13 14 14 15 15 15 15 15 15 16 16 16 16 16
1154 16 15 15 15 15 16 17 17 16 15 13 13 13 13 14 13 13 13 14 14 14 14 14 14 14 14 14 14 14 13 13 13 13 13 14 14 14 13 13 13 12 14 15 15 15 16 16 15 15 15 16 15 15 14 13 13 12 13 14 14 14 14 14 15 16 16 17 16 15 13 12
1146 12 13 14 15 16 16 16 15 14 14 14 14 14 14 15 15 16 15 15 14 14 14 15 14 13 13 13 13 14 14 14 14 14 14 13 14 15 14 14 13 13 13 14 14 13 14 14 14 14 15 16 18 17 16 16 16 16 15 15 13 14 14 15 15 14 14 14 15 14 13 14
1138 14 13 12 13 14 15 14 13 11 12 12 12 13 12 12 12 12 11 11 11 12 13 13 13 14 14 14 15 16 15 15 16 16 16 16 16 16 16 15 15 14 14 13 14 14 16 17 17 17 17 16 16 15 14 13 13 13 14 15 16 16 15 14 14 13 12 12 13 13 13 12
1129 12 11 12 12 12 13 12 11 12 13 14 14 12 12 13 14 15 15 14 14 14 14 15 15 15 16 16 16 15 15 16 15 15 14 13 12 12 12 12 12 12 12 13 13 14 14 14 14 14 14 13 13 13 14 13 12 11 11 11 12 12 12 14 15 14 14 15 15 16 17 16
1121 16 15 16 16 16 17 17 17 16 15 15 14 13 12 11 11 11 12 13 14 13 13 12 13 13 13 13 13 13 13 13 13 13 13 13 14 14 14 13 14 14 15 14 13 13 14 15 15 15 14 14 13 13 14 14 14 13 14 14 15 14 13 13 13 13 14 14 14 14 13 14
1113 14 15 15 15 15 14 12 13 13 14 15 15 15 15 15 15 14 14 14 14 14 13 12 12 13 13 12 13 14 14 14 13 13 14 14 14 14 14 15 14 14 14 14 15 15 15 14 14 14 14 15 15 15 15 15 14 15 15 14 13 13 13 14 14 15 15 15 14 14 13 12
$$ packed form
1171A6J%kjJ%%%%%%JjJJ%%j%j%%j%jj%J%%J%%%%%J%%J%J%%%j%%%%j%j%%J%%J%%j%JjkK%j%
1163A4JJJ%%%%%%%%jjj%%%%KKjj%%%%%%j%%j%%%%%%%j%J%%jj%%%J%Jj%%jJJ%J%%%%%J%%%%
1154A6j%%%JJ%jjk%%%Jj%%J%%%%%%%%%%j%%%%J%%j%%jKJ%%J%j%%Jj%jj%jJJ%%%%JJ%Jjjkj
1146A2JJJJ%%jj%%%%%J%Jj%j%%Jjj%%%J%%%%%jJJj%j%%J%jJ%%%JJKjj%%%j%kJ%J%j%%JjjJ
1138A4jjJJJjjkJ%%Jj%%%j%%JJ%%J%%JJj%J%%%%%%j%j%jJ%KJ%%%j%jjj%%JJJ%jj%jj%J%%j
1129A2jJ%%JjjJJJ%k%JJJ%j%%%J%%J%%j%Jj%jjj%%%%%%J%J%%%%%j%%Jjjj%%J%%KJj%J%JJj
1121A6jJ%%J%%jj%jjjj%%JJJj%jJ%%%%%%%%%%%J%%jJ%Jjj%JJ%%j%j%J%%jJ%Jjj%%%J%%%jJ
1113A4J%%%jkJ%JJ%%%%%j%%%%jj%J%jJJ%%j%J%%%%Jj%%%J%%j%%%J%%%%jJ%jj%%J%J%%j%jj
$$ plain form
1104 12 12 12 12 12 12 13 14 12 11 12 13 13 11 12 13 13 14 15 13 11 12 12 13 14 13 12 12 12 12 12 12 12 12 12 12 11 12 13 14 15 14 13 13 12 12 12 13 14 15 16 14 13 12 11 11 12 12 12 11 11 10 10 10 10 11 12 12 13 14 14
1096 14 14 13 13 13 13 14 14 14 15 15 15 15 14 14 14 15 14 14 13 13 14 16 15 14 14 14 14 14 14 14 13 14 16 16 15 14 15 15 14 12 13 14 14 14 14 13 12 12 12 13 13 14 13 13 13 12 13 14 14 13 14 15 15 14 14 14 13 12 12 12
1088 12 12 13 14 15 14 14 13 13 13 14 13 13 13 12 13 14 14 14 13 13 11 10 11 12 13 14 14 14 14 14 14 14 14 13 14 15 15 15 14 13 14 15 15 14 14 14 14 14 14 15 14 14 14 13 12 11 12 13 14 13 14 15 15 14 14 14 14 14 15 15
1079 15 14 15 16 17 16 15 16 16 17 17 16 15 14 15 15 15 15 15 15 14 16 17 17 18 17 18 18 19 18 18 17 19 20 20 21 21 22 23 24 26 29 31 33 35 38 40 43 43 42 41 40 41 42 43 45 49 55 60 64 69 71 74 76 74 71 68 65 64 64 64
1071 64 67 71 74 80 85 90 94 95 93 89 85 81 77 74 70 67 65 65 66 69 73 74 74 74 72 67 61 55 51 49 47 45 45 44 43 43 43 42 42 40 38 36 34 30 27 24 22 20 20 20 19 19 18 18 18 18 18 18 18 18 18 17 17 17 16 15 15 15 15 14
1062 14 14 15 15 15 14 15 16 16 14 14 13 12 13 13 13 13 14 14 15 16 16 16 16 16 16 16 18 19 18 17 16 16 18 19 19 18 17 17 16 16 16 16 15 14 14 14 13 14 15 16 16 15 15 15 16 16 16 14 13 13 14 16 17 18 19 20 20 20 19 20
1054 20 21 21 21 20 19 19 19 20 20 21 21 20 21 22 22 23 22 21 21 20 21 21 20 20 21 21 20 20 20 20 21 23 24 24 24 22 21 21 22 23 23 22 19 17 17 18 18 18 18 19 18 18 17 17 17 17 17 16 16 16 13 14 15 16 16 17 17 16 16 15
1046 15 15 16 15 15 14 14 13 14 14 14 13 14 14 14 14 15 16 16 15 15 15 16 16 16 16 16 16 16 16 15 16 16 18 18 17 18 18 19 20 21 21 19 18 17 16 15 17 18 18 18 18 18 19 18 18 19 18 18 18 18 18 18 19 20 20 20 20 19 19 19
$$ packed form
1104A2%%%%%JJkjJJ%kJJ%JJkkJ%JJjj%%%%%%%%%jJJJJjj%j%%JJJJkjjj%J%%j%j%%%JJ%JJ%
1096A4%j%%%J%%J%%%j%%Jj%j%JKjj%%%%%%jJK%jjJ%jkJJ%%%jj%%J%Jj%%jJJ%jJJ%j%%jj%%
1088A2%JJJj%j%%Jj%%jJJ%%j%kjJJJJ%%%%%%%jJJ%%jjJJ%j%%%%%Jj%%jjjJJJjJJ%j%%%%J%
1079A5jJJJjjJ%J%jjjJ%%%%%jKJ%JjJ%Jj%jKJ%J%JJJKLKKKLKL%jjjJJJKMONMNKLKklllj%%
1071F4LMLONNMJkmmmmlmlk%JLMJ%%knoomkkk%jj%%j%kkkkmllkk%%j%j%%%%%%%%j%%jj%%%j
1062A4%J%%jJJ%k%jjJ%%%J%JJ%%%%%%KJjjj%KJ%jj%j%%%jj%%jJJJ%j%%J%%kj%JKJJJJ%%jJ
1054B0J%%jj%%J%J%jJJ%Jjj%jJ%j%J%j%%%JKJ%%kj%JJ%jlk%J%%%Jj%j%%%%j%%lJJJ%J%j%j
1046A5%Jj%j%jJ%%jJ%%%JJ%j%%J%%%%%%%jJ%K%jJ%JJJ%kjjjjKJ%%%%Jj%Jj%%%%%JJ%%%j%%
$$ plain form
1037 19 19 19 19 20 20 20 20 20 20 20 20 20 20 20 20 21 20 20 20 20 20 20 20 21 20 19 19 20 21 22 22 21 21 21 21 22 22 23 22 22 22 22 22 22 22 23 22 21 21 20 20 20 20 20 21 22 23 23 23 24 23 21 22 22 21 21 21 22 22 22
1029 22 22 23 21 20 20 20 21 22 22 21 21 21 21 20 19 18 19 19 20 21 23 24 25 27 26 25 25 26 25 24 24 24 23 22 22 22 23 24 26 28 29 30 30 30 29 28 29 29 29 29 30 30 31 31 31 31 32 33 33 33 33 32 32 32 32 33 34 36 36 36
1021 36 38 40 40 41 40 39 39 39 39 40 42 44 44 45 45 46 45 44 44 43 44 44 45 45 47 49 51 53 55 56 57 57 57 57 59 60 61 61 62 63 65 66 67 69 70 71 71 72 74 77 80 84 84 85 85 86 88 91 95 99 102 106 108 110 113 117 122 128 133 139
1012 139 146 156 167 180 194 209 227 243 256 264 265 263 259 256 255 258 264 273 284 301 319 341 364 385 403 415 422 427 433 444 461 486 516 554 597 647 708 779 857 943 1042
1008 1042 1156 1290 1453 1654 1902 2204 2565 2985 3450 3932 4393 4789 5082 5253 5315 5303 5266 5256 5315 5477 5770 6211 6806 7537 8358
1005 8358 9193 9939 10490 10773 10777 10549 10184 9786 9455 9266 9271 9498 9958 10637 11489 12426 13323 14024 14385 14327 13858 13084 12152 11208 10365
1002 10365 9700 9254 9037 9037 9221 9534 9895 10204 10358 10280 9940 9368 8640 7851 7088 6413 5862 5451 5177 5023 4960 4957 4969 4950 4859 4670
998 4670 4379 4008 3589 3156 2739 2361 2033 1756 1527 1340 1185 1059 954 866 790 727 672 624 581 542 506 473 443 416 392 372 351 332
$$ packed form
1037A9%%%J%%%%%%%%%%%Jj%%%%%%Jjj%JJJ%j%%%J%Jj%%%%%%Jjj%j%%%%JJJ%%JjkJ%j%%J%%
1029B2%Jkj%%JJ%j%%%jjjJ%JJKJJKjj%Jjj%%jj%%JJKKJJ%%jjJ%%%J%J%%%JJ%%%j%%%JJK%%
1021C6KK%Jjj%%%JKK%J%Jjj%jJ%J%KKKKKJJ%%%KJJ%JJKJJKJJ%JKLLM%J%JKLMMLMKKLMNONO
1012A39PJ0J1J3J4J5J8J6J3QJkmljLORJ1J7J8K2K3K1J8J2PNOJ1J7K5L0L8M3N0O1P1P8Q6R9
1008A042J14J34J63K01K48L02L61M20M65M82M61L96K93J71O2j2l7j0N9J62K93M41N95P31Q21
1005H358Q35P46N51K83Mk28l65l98l31j89NK27M60O79Q52R37Q97P01L61n8m69p74r32r44q43
1002A0365o65m46k17%J84L13L61L09J54p8l40n72p28p89p63o75n51m11k74j54o3lJ2j9r1j89
998D670k91l71m19m33m17l78l28k77k29j87j55j26j05q8p6o3n5m8m3l9l6l3l0k7k4k0k1j9
$$ plain form
995 332 312 294 278 263 250 240 229 219 209 200 192 185 178 171 164 156 149 143 137 132 127 122 118 113 108 105 101 99 97 94 90 89 87 85 83 81 79 77 75 74 73 73 70 67 63 62 63 63 62 62 61 60 58 55 54 54 54 53 52 51 50
988 50 50 50 49 48 47 47 46 46 46 45 45 45 45 44 43 43 42 42 41 39 39 40 40 38 38 37 36 36 36 36 35 35 35 35 35 35 35 36 35 35 34 33 32 32 32 32 32 32 31 31 32 32 32 32 32 32 32 31 31 31 31 30 30 30 29 29 30 31 32 33 32
979 32 31 30 29 28 29 31 32 32 32 31 32 32 31 30 29 28 28 26 25 25 24 24 23 24 25 26 27 27 26 25 24 23 24 25 24 23 24 23 22 21 20 20 20 21 20 19 17 17 17 18 18 18 17 17 17 18 19 19 19 17 17 17 17 18 18 18 19 19 19 19 19
971 19 20 19 19 18 18 19 18 17 17 17 18 19 19 18 19 20 19 18 18 18 16 15 14 13 14 15 16 16 16 15 14 16 18 18 18 18 17 17 19 19 19 19 19 17 16 16 17 17 17 17 16 16 16 16 17 18 18 19 19 17 17 17 17 17 17 15 14 15 16 16 16
962 16 17 17 18 17 17 16 17 16 14 13 14 13 13 13 13 13 13 14 14 16 16 15 14 13 13 13 14 14 15 14 14 14 14 14 13 12 11 11 10 10 10 10 10 11 11 10 10 10 10 11 11 12 12 13 12 12 11 10 10 9 9 9 9 10 10 9 8 9 9 9 8
954 8 8 8 9 9 8 10 12 13 11 9 7 6 6 6 8 9 11 11 10 9 7 7 8 8 8 7 8 9 9 9 9 9 9 9 9 8 9 10 10 10 10 10 10 10 11 11 10 9 9 9 9 10 12 12 11 10 11 11 10 10 10 10 11 11 12 13 13 12 11 12 13 12
945 12 12 12 12 12 12 11 11 10 10 11 11 11 12 12 13 13 12 11 9 11 12 14 15 15 16 16 15 15 14 14 14 13 14 14 14 14 15 15 15 15 14 13 13 13 14 16 16 16 15 14 15 16 17 18 18 17 17 16 18 19 20 20 23 25 26 27 28 29 32 35 36
937 36 38 39 41 40 39 39 39 39 40 42 45 48 52 56 61 66 69 71 71 69 67 66 65 65 65 66 68 72 77 83 89 93 96 97 94 90 84 78 71 67 63 61 60 61 65 69 72 73 73 70 67 62 57 53 49 45 41 41 40 40 39 40 41 40 40 39 37 34 30 28 25
$$ packed form
995C32k0j8j6j5j3j0j1j0j0rqppppqpoonnnmnnlmkklmjkkkkkkkjj%llmjJ%j%jjklj%%jjjj
988E0%%jjj%j%%j%%%jj%j%jk%J%k%jj%%%j%%%%%%Jj%jjj%%%%%j%J%%%%%%j%%%j%%j%JJJJj
979C2jjjjJKJ%%jJ%jjjj%kj%j%jJJJJ%jjjjJJjjJjjjj%%Jjjk%%J%%j%%JJ%%k%%%J%%J%%%%
971A9Jj%j%Jjj%%JJ%jJJjj%%kjjjJJJ%%jjKK%%%j%K%%%%kj%J%%%j%%%JJ%J%k%%%%%kjJJ%%
962A6J%Jj%jJjkjJj%%%%%J%K%jjj%%J%Jj%%%%jjj%j%%%%J%j%%%J%J%Jj%jj%j%%%J%jjJ%%j
954H%%J%jKKJkkkj%%KJK%jjk%J%%jJJ%%%%%%%jJJ%%%%%%J%jj%%%JK%jjJ%j%%%J%JJ%jjJJj
945A2%%%%%j%j%J%%J%J%jjkKJKJ%J%j%j%%jJ%%%J%%%jj%%JK%%jjJJJJ%j%jKJJ%LKJJJJLLJ
937C6KJKjj%%%JKLLMMNNLK%kkjj%%JKMNOOMLJlmoopmmkjJMMLJ%llnnmmmm%j%jJJj%jklmkl
$$ plain form
929 25 23 21 21 20 19 17 16 15 15 15 15 14 13 12 13 13 13 13 13 12 11 11 11 12 12 11 11 10 11 12 13 13 12 10 11 12 12 11 11 11 12 12 12 11 11 11 11 11 11 11 11 11 10 10 10 10 11 12 12 12 12 12 11 10 10 12 13 12 12 12 12
920 12 12 12 10 10 10 11 10 10 10 10 10 10 10 10 10 11 10 9 9 9 9 9 9 10 10 11 12 12 11 10 9 9 10 11 13 12 11 11 12 12 12 12 11 11 12 11 10 10 10 11 11 9 10 11 12 11 11 9 9 9 9 9 9 10 10 10 9 8 8 7 8
912 8 9 10 10 9 8 8 10 11 11 10 10 10 9 9 9 8 8 8 9 10 10 10 10 9 9 8 9 9 10 10 10 9 9 11 11 12 11 10 9 8 6 8 9 10 9 9 8 9 11 11 12 11 9 9 8 8 8 8 7 7 7 8 7 7 7 6 8 9 9 9 8 8
903 8 10 11 11 11 11 12 13 13 12 12 12 12 11 10 11 11 10 9 9 10 9 9 9 9 9 10 11 11 10 9 9 10 10 10 11 11 11 10 9 9 8 8 7 7 8 10 10 11 11 10 11 11 11 10 11 11 12 12 12 12 12 13 12 10 10 10 10 10 10 9 9 9
894 9 10 11 10 10 10 10 10 10 10 10 9 9 9 10 11 11 11 11 11 11 11 11 10 10 10 10 10 10 10 10 9 9 11 12 11 11 10 10 10 11 10 9 10 10 11 12 11 11 11 11 12 12 10 9 9 9 9 9 9 9 10 11 12 14 14 13 11 12 13 13 13 12
886 12 11 10 9 10 10 9 10 10 11 11 10 9 9 10 9 8 9 9 10 10 11 12 12 12 12 13 13 12 12 11 10 9 9 9 11 13 13 13 12 12 12 12 13 14 15 15 15 15 16 16 17 17 18 19 19 19 19 19 18 18 17 17 16 15 15 14 14 13 12 11 11
877 11 12 12 13 12 12 13 13 13 13 13 13 12 12 12 12 12 13 13 13 12 11 11 11 11 12 12 12 12 12 12 12 12 12 11 10 9 8 7 7 8 9 8 7 8 9 9 9 9 9 10 11 10 8 8 8 9 9 9 9 9 9 9 9 9 9 8 8 10 11 12 12
869 12 11 9 9 8 7 7 7 7 8 8 8 9 9 9 10 11 10 9 9 8 9 9 10 10 11 11 10 10 10 10 10 11 11 11 10 10 9 9 8 8 7 7 8 8 8 8 9 11 10 10 10 10 10 10 10 8 8 9 10 12 12 12 11 11 9 9 9 9 10 11 11
$$ packed form
929B5kk%jjkjj%%%jjjJ%%%%jj%%J%j%jJJJ%jkJJ%j%%J%%j%%%%%%%%j%%%JJ%%%%jj%KJj%%%
920A2%%k%%Jj%%%%%%%%Jjj%%%%%J%JJ%jjj%JJKjj%J%%%j%Jjj%%J%kJJJj%k%%%%%J%%jj%jJ
912HJJ%jj%KJ%j%%j%%j%%JJ%%%j%jJ%J%%j%K%JjjjjkKJJj%jJK%Jjk%j%%%j%%Jj%%jKJ%%j%
903HKJ%%%JJ%j%%%jjJ%jj%Jj%%%%JJ%jj%J%%J%%jj%j%j%JK%J%jJ%%jJ%J%%%%Jjk%%%%%j%%
894IJJj%%%%%%%j%%JJ%%%%%%%j%%%%%%%j%KJj%j%%JjjJ%JJj%%%J%kj%%%%%%JJJK%jkJJ%%j
886A2jjjJ%jJ%J%jj%JjjJ%J%JJ%%%J%j%jjj%%KK%%j%%%JJJ%%%J%J%JJ%%%%j%j%jj%j%jjj%
877A1J%Jj%J%%%%%j%%%%J%%jj%%%J%%%%%%%%jjjjj%JJjjJJ%%%%JJjk%%J%%%%%%%%%j%KJJ%
869A2jk%jj%%%J%%J%%JJjj%jJ%J%J%j%%%%J%%j%j%j%j%J%%%JKj%%%%%%k%JJK%%j%k%%%JJ%
$$ plain form
860 11 11 9 9 9 9 9 11 12 11 10 9 9 9 9 10 11 12 12 12 11 11 10 10 10 10 10 9 9 9 9 9 10 11 10 10 10 10 10 12 12 11 10 9 9 9 9 9 8 7 7 8 9 10 9 9 11 10 10 10 10 11 10 9 9 9 10 10 10 10 10 10
852 10 10 10 9 7 7 7 7 7 7 7 7 7 8 9 10 10 10 10 10 9 8 7 7 8 8 9 9 8 9 9 9 9 9 10 10 10 9 8 8 8 8 9 9 10 9 9 10 10 10 10 9 9 10 11 10 9 9 9 8 7 7 7 7 7 7 8 8 8 9 9 9
844 9 9 8 8 8 8 9 10 11 12 12 12 11 10 9 9 8 8 8 8 9 9 9 10 10 11 10 10 9 9 9 9 8 8 7 7 6 5 7 8 7 7 7 8 8 8 9 9 10 11 10 10 11 10 10 9 9 11 12 13 12 11 12 13 14 18 22 26 29 33 36 36 34
835 34 30 26 22 19 17 15 13 11 12 12 12 11 11 11 12 12 12 12 12 11 11 10 10 10 9 9 9 9 9 9 9 9 9 11 13 14 13 11 10 10 11 12 13 13 13 13 13 12 11 11 10 11 10 9 8 9 9 10 10 11 11 11 11 11 10 9 8 7 8 8 9
826 9 9 8 8 8 8 8 8 8 8 8 8 9 9 9 9 9 9 9 9 9 10 10 10 9 8 8 7 7 8 9 9 10 10 11 10 8 7 8 9 10 11 9 10 10 10 10 10 10 10 10 10 10 9 9 9 10 10 11 11 11 9 8 7 7 6 7 8 9 9 9 8 7
818 7 7 7 8 10 10 10 9 9 8 9 10 12 12 10 9 7 7 7 8 9 9 9 8 8 8 7 7 7 8 9 9 8 8 7 8 9 9 10 10 10 9 8 8 8 9 9 9 9 9 10 9 8 8 9 9 9 10 10 10 11 11 10 9 9 9 9 9 9 9 9 9 8
809 8 8 7 8 8 8 8 8 7 8 9 10 11 10 9 9 10 9 9 9 10 10 10 9 9 9 9 8 8 8 9 10 11 11 10 10 10 9 9 8 6 7 9 10 9 8 10 11 12 12 10 9 10 10 11 12 12 12 12 10 8 8 9 11 12 11 10 10 11 11 11 11 11
801 11 11 11 13 16 18 17 17 18 18 18 18 18 18 17 18 19 19 20 21 24 27 30 32 34 40 48 60 72 90 116 149 190 233 270 289 287 261 223 181 141 108 82 64 53 45 38 33 29 27 25 24 23 21 20
$$ packed form
860A1%k%%%%KJjjj%%%JJJ%%j%j%%%%j%%%%JJj%%%%K%jjj%%%%jj%JJJj%Kj%%%Jjj%%J%%%%%
852A0%%jk%%%%%%%%JJJ%%%%jjj%J%J%jJ%%%%J%%jj%%%J%Jj%J%%%j%JJjj%%jj%%%%%J%%J%%
844I%j%%%JJJJ%%jjj%j%%%J%%J%Jj%j%%%j%j%jjKJj%%J%%J%JJj%Jj%j%KJJjjJJJMMMLML%k
835C4mmmlkkkkJ%%j%%J%%%%j%j%%j%%%%%%%%KKJjkj%JJJ%%%%jj%jJjjjJ%J%J%%%%jjjjJ%J
826I%j%%%%%%%%%J%%%%%%%%J%%jj%j%JJ%J%JjkjJJJJkJ%%%%%%%%%j%%J%J%%kjj%jJJJ%%jj
818G%%JK%%j%jJJK%kjk%%JJ%%j%%j%%JJ%j%jJJ%J%%jj%%J%%%%Jjj%J%%J%%J%jj%%%%%%%%j
809H%jJ%%%%jJJJJjj%Jj%%J%%j%%%j%%JJJ%j%%j%jkJKJjjKJJ%kjJ%JJ%%%kk%JKJjj%J%%%%
801A1%%KLKj%J%%%%%jJJ%JJLLLKKOQJ2J2J8K6L3M1M3L7J9kk6l8m2m0l3k6j8j1qpnmkkjjkj
$$ plain form
794 20 18 17 15 15 16 15 15 15 16 16 16 15 14 13 12 12 12 12 12 11 12 12 12 11 11 12 12 10 10 9 9 10 10 10 10 10 10 11 11 11 12 12 13 12 11 11 10 9 8 9 9 9 9 9 9 8 7 8 9 9 9 9 8 8 8 7 8 9 9 9 9
786 9 8 9 9 9 8 8 8 8 7 8 8 8 7 9 10 9 9 9 10 10 10 10 10 10 10 9 8 8 8 9 10 10 9 9 9 10 8 7 6 7 8 8 8 9 11 11 10 10 10 10 10 10 9 11 12 12 11 11 10 9 9 8 8 7 7 7 8 8 8 7 7 8
777 8 10 11 11 10 10 11 11 9 7 7 7 7 7 6 6 6 5 6 6 7 8 9 10 12 12 10 10 10 10 9 9 8 8 7 9 9 8 9 9 9 9 10 11 11 11 10 9 9 9 9 9 9 8 8 7 8 8 8 8 8 7 7 7 8 9 9 9 9 10 10 9 9
769 9 8 7 8 9 10 11 11 10 9 8 7 8 8 8 8 8 9 10 11 11 11 10 9 9 10 12 13 13 14 13 13 14 16 18 20 21 22 22 20 18 16 15 14 13 12 11 10 9 8 8 9 9 9 9 9 7 7 8 9 9 9 9 8 8 7 7 7 8 10 10 9 9
760 9 8 8 9 9 10 9 8 7 7 7 8 7 7 8 9 9 10 9 8 9 9 8 7 7 7 9 9 8 9 10 10 11 11 10 9 8 9 10 9 8 8 9 9 8 7 7 7 8 9 9 9 9 8 8 7 7 8 7 7 6 8 10 10 11 11 11 11 10 10 9 9 10
751 10 10 10 9 10 11 10 10 10 10 10 10 10 10 11 12 13 14 15 15 16 18 20 23 26 31 36 41 43 43 41 37 33 29 25 21 19 18 17 16 13 11 9 9 9 10 10 11 10 10 10 10 9 8 9 10 9 9 9 9 9 9 10 11 11 12 10 9 9 9 10 10
743 10 9 9 8 7 7 7 8 8 9 9 9 10 10 10 11 11 11 10 10 9 8 7 7 8 8 8 8 7 7 7 7 8 8 8 9 9 10 10 10 10 9 8 7 7 8 9 9 9 9 10 10 10 11 11 11 12 11 10 9 9 8 7 7 8 8 8 8 7 7 7 7
735 7 7 7 8 8 9 9 9 9 9 10 11 10 10 9 9 8 8 8 9 9 9 9 10 9 8 9 10 9 9 8 8 7 7 7 7 6 7 8 8 8 9 10 10 10 9 9 9 9 9 11 11 10 9 10 10 11 11 10 11 10 9 8 8 8 9 10 10 8 7 6 6 7
$$ packed form
794B0kjk%Jj%%J%%jjjj%%%%jJ%%j%J%k%j%J%%%%%J%%J%Jjj%jjjJ%%%%%jjJJ%%%j%%jJJ%%%
786IjJ%%j%%%jJ%%jKJj%%J%%%%%%jj%%JJ%j%%JkjjJJ%%JK%j%%%%%jKJ%j%jj%j%j%%J%%j%J
777HKJ%j%J%kk%%%%j%%jJ%JJJJK%k%%%j%j%jK%jJ%%%JJ%%jj%%%%%j%jJ%%%%j%%JJ%%%J%j%
769IjjJJJJ%jjjjJ%%%%JJJ%%jj%JKJ%Jj%JKKKJJ%kkkjjjjjjjj%J%%%%k%JJ%%%j%j%%JK%j%
760Ij%J%Jjjj%%Jj%JJ%JjjJ%jj%%K%jJJ%J%jjjJJjj%J%jj%%JJ%%%j%j%Jj%jKK%J%%%j%j%J
751A0%%jJJj%%%%%%%JJJJJ%JKKLLNNNK%kmmmmmkjjjlkk%%J%Jj%%%jjJJj%%%%%JJ%Jkj%%J%
743A0j%jj%%J%J%%J%%J%%j%jjj%J%%%j%%%J%%J%J%%%jjj%JJ%%%J%%J%%Jjjj%jj%J%%%j%%%
735G%%J%J%%%%JJj%j%j%%J%%%JjjJJj%j%j%%%jJJ%%JJ%%j%%%%K%jjJ%J%jJjjj%%JJ%kjj%J
$$ plain form
726 7 8 8 7 7 8 8 9 10 9 7 5 5 7 9 9 9 10 9 7 6 7 10 10 10 10 10 11 9 8 8 8 9 10 9 9 9 9 9 10 9 9 9 10 11 12 11 11 10 10 11 11 11 9 8 9 9 9 9 8 8 9 11 10 9 9 9 9 9 9 9 9 9
717 9 10 9 8 8 7 8 8 8 8 9 9 9 9 9 9 8 7 8 10 10 10 10 10 10 9 8 9 8 8 8 8 9 9 10 10 9 9 9 11 11 9 9 9 8 8 7 7 8 9 11 12 11 10 10 9 9 8 7 8 8 8 7 7 6 6 6 6 8 9 9 9 10
709 10 10 9 8 8 7 7 8 8 8 8 9 9 9 9 10 10 9 9 9 8 8 8 9 10 10 9 8 8 9 10 10 10 9 10 12 12 12 11 10 9 9 8 7 7 7 7 8 10 10 10 11 11 9 9 8 9 8 8 8 9 10 9 8 9 9 8 7 7 8 7 7
700 7 8 9 9 9 10 12 11 11 11 10 10 10 11 10 9 9 9 10 9 8 8 8 8 7 7 7 6 6 7 7 8 9 9 10 9 9 10 10 9 9 9 9 9 9 9 9 9 8 9 9 9 8 8 7 7 7 7 7 8 8 8 9 10 11 11 11 10 10 10 10 11 12
692 12 11 10 10 9 9 10 9 9 8 7 8 10 10 10 10 10 10 9 9 9 8 8 8 8 7 7 6 5 6 8 8 8 9 9 9 9 9 9 8 7 7 6 6 6 7 7 8 9 9 9 8 8 8 7 7 7 8 9 10 11 11 11 11 12 10 8 7 6 7 7 9
683 9 10 10 10 8 7 7 7 8 9 9 9 9 8 8 7 7 7 7 7 8 8 8 8 8 8 9 10 9 9 8 8 9 10 10 10 10 10 10 9 9 9 9 9 9 9 9 10 9 8 9 9 9 9 8 7 8 8 9 9 10 10 10 10 10 10 10 9 8 7 8 8 8
675 8 9 9 9 7 5 6 8 7 7 7 7 8 9 9 9 10 10 9 9 10 10 10 11 10 10 9 9 8 8 8 8 7 6 6 5 5 5 6 6 7 7 7 6 6 6 7 8 8 8 9 10 10 10 9 9 8 7 6 7 7 7 8 8 8 8 8 8 8 8 8 7 8
666 8 8 8 8 8 7 6 4 4 6 6 7 9 10 10 9 8 6 6 7 8 9 8 8 7 7 8 8 8 8 10 11 11 12 12 12 11 9 8 8 6 7 8 9 9 9 9 9 9 8 9 10 11 10 10 10 10 10 9 8 7 9 9 9 9 9 8 8 7 7 9 10 10
$$ packed form
726GJ%j%J%JJjkk%KK%%JjkjJL%%%%Jkj%%JJj%%%%Jj%%JJJj%j%J%%kjJ%%%j%JKjj%%%%%%%%
717IJjj%jJ%%%J%%%%%jjJK%%%%%jjJj%%%J%J%j%%K%k%%j%j%JJKJjj%j%jjJ%%j%j%%%KJ%%J
709A0%jj%j%J%%%J%%%J%j%%j%%JJ%jj%JJ%%jJK%%jjj%jj%%%JK%%J%k%jJj%%JJjjJ%jj%Jj%
700GJJ%%JKj%%j%%Jjj%%Jjj%%%j%%j%J%JJ%Jj%J%j%%%%%%%%jJ%%j%j%%%%J%%JJJ%%j%%%JJ
692A2jj%j%Jj%jjJK%%%%%j%%j%%%j%jjJK%%J%%%%%jj%j%%J%JJ%%j%%j%%JJJJ%%%JkkjjJ%K
683IJ%%kj%%JJ%%%j%j%%%%J%%%%%JJj%j%JJ%%%%%j%%%%%%%JjjJ%%%jjJ%J%J%%%%%%jjjJ%%
675HJ%%kkJKj%%%JJ%%J%j%J%%Jj%j%j%%%jj%j%%J%J%%j%%JJ%%JJ%%j%jjjJ%%J%%%%%%%%jJ
666H%%%%jjk%K%JKJ%jjk%JJJj%j%J%%%KJ%J%%jkj%kJJJ%%%%%jJJJj%%%%jjjK%%%%j%j%KJ%
$$ plain form
658 10 10 10 10 9 9 9 9 9 10 10 10 10 8 7 6 6 7 9 9 9 9 8 7 7 8 8 8 8 8 8 7 8 8 8 8 8 8 8 8 8 8 8 7 7 7 7 7 6 5 5 5 6 6 5 6 7 8 8 8 8 8 8 8 8 8 8 7 7 7 7 8
649 8 8 8 9 9 8 8 8 9 9 10 9 9 9 9 10 10 10 9 10 11 11 10 10 10 9 8 8 9 9 9 9 9 8 8 9 10 9 9 8 9 8 8 8 8 8 7 8 9 8 7 6 6 6 6 6 6 7 8 9 9 10 11 11 10 9 9 8 8 8 7 7 8
640 8 8 9 9 8 8 9 11 13 12 10 8 8 8 8 9 9 9 8 9 10 10 9 9 9 9 9 9 10 10 9 9 8 8 8 9 9 8 7 7 7 7 7 8 9 10 10 10 9 8 8 7 5 6 7 7 8 8 9 9 9 10 10 9 9 8 7 7 6 7 8 8 9
632 9 9 10 8 7 6 6 7 9 10 10 10 9 8 8 9 10 10 10 10 9 8 8 8 8 9 9 9 10 9 9 10 10 11 11 12 12 11 11 10 10 10 10 11 11 12 13 13 13 12 11 9 8 8 9 9 10 9 7 7 8 7 6 7 8 7 7 8 8 8 7 7 7
623 7 7 7 7 7 7 8 7 6 7 8 8 8 8 9 8 8 7 7 7 7 7 7 7 7 7 8 8 8 9 9 9 8 7 7 7 8 8 8 7 7 8 9 9 10 10 11 10 10 9 9 8 7 8 9 9 9 8 6 7 7 8 9 10 11 11 10 10 10 9 9 10 10
615 10 10 10 10 10 9 8 8 8 8 9 8 8 8 8 8 8 8 9 8 7 7 7 7 7 7 7 7 7 7 7 8 9 10 10 10 9 10 11 10 10 9 9 9 9 9 9 9 9 9 9 9 10 9 8 8 8 7 7 8 9 9 9 9 8 5 6 5 5 6 8 8
606 8 8 8 7 8 9 10 10 9 9 9 8 8 7 7 7 6 7 7 7 8 8 7 5 6 7 7 8 7 7 7 8 8 8 8 8 8 8 7 7 5 4 5 6 6 8 9 9 10 10 11 10 8 8 9 8 7 7 7 8 9 7 6 6 6 6 7 7 8 9 9 9 8
598 8 7 7 7 6 5 6 6 7 7 7 7 7 7 6 7 8 8 8 8 8 7 7 7 7 8 9 9 9 9 9 9 10 11 12 11 10 10 10 10 10 9 9 9 9 9 8 7 7 6 7 9 9 9 9 9 9 9 9 9 8 7 8 9 9 9 9 9 9 8 8 8 8
$$ packed form
658A0%%%j%%%%J%%%kjj%JK%%%jj%J%%%%%jJ%%%%%%%%%%j%%%%jj%%J%jJJJ%%%%%%%%%j%%%J
649H%%J%j%%J%Jj%%%J%%jJJ%j%%jj%J%%%%j%JJj%jJj%%%%jJJjjj%%%%%JJJ%JJ%jj%j%%j%J
640H%J%j%JKKjkk%%%J%%jJJ%j%%%%%J%j%j%%J%jj%%%%JJJ%%jj%jkJJ%J%J%%J%j%jj%jJJ%J
632I%Jkjj%JKJ%%jj%JJ%%%jj%%%J%%Jj%J%J%J%j%j%%%J%JJ%%jjkj%J%Jjk%JjjJJj%J%%j%%
623G%%%%%JjjJJ%%%Jj%j%%%%%%%%J%%J%%jj%%J%%j%JJ%J%Jj%j%jjJJ%%jkJ%JJJJ%j%%j%J%
615A0%%%%jj%%%Jj%%%%%%Jjj%%%%%%%%%%JJJ%%jJJj%j%%%%%%%%%%Jjj%%j%JJ%%%jlJj%JK%
606H%%jJJJ%j%%j%j%%jJ%%J%jkJJ%Jj%%J%%%%%%j%kjJJ%KJ%J%Jjk%Jjj%%JJkj%%%J%JJ%%j
598Hj%%jjJ%J%%%%%jJJ%%%%j%%%JJ%%%%%JJJjj%%%%j%%%%jj%jJK%%%%%%%%jjJJ%%%%%j%%%
$$ plain form
589 8 8 8 7 7 7 7 7 7 8 9 9 9 8 8 8 9 9 9 8 9 10 10 9 8 8 8 9 10 9 9 10 10 10 10 9 9 8 7 7 7 7 7 9 9 9 9 9 9 8 9 9 9 9 9 10 9 8 7 8 8 8 9 9 9 9 8 8 8 9 8 7 7
581 7 8 9 10 8 7 7 7 6 6 7 7 7 7 6 6 5 6 7 7 8 7 6 8 8 8 9 10 10 8 9 10 10 9 9 9 9 8 9 9 10 9 10 10 9 8 9 10 9 9 8 9 10 11 10 9 8 7 7 7 8 8 9 10 10 10 10 10 11 10 10 11 9
572 9 9 9 9 8 7 7 9 9 9 10 10 10 9 9 8 8 9 8 7 7 7 7 8 9 8 8 9 9 9 9 9 8 9 10 11 10 10 8 7 7 8 8 9 9 10 10 8 7 6 6 8 9 9 9 10 9 8 7 6 6 7 8 7 7 7 7 8 10 11 10 10 10
563 10 11 10 9 8 8 9 10 12 12 10 9 9 9 9 9 8 9 9 8 9 9 9 8 8 8 8 7 7 8 10 12 11 11 10 9 10 11 10 9 9 10 11 11 11 11 13 14 16 18 20 24 29 35 41 44 43 39 35 30 26 23 19 16 15 14 13 12 12 12 12 12
555 12 12 12 11 11 11 11 11 11 12 12 12 10 8 8 9 11 10 10 11 11 11 9 8 7 7 8 9 10 10 11 10 9 9 9 9 9 8 9 11 11 11 10 10 9 9 9 8 7 6 7 6 6 7 9 10 11 10 9 9 9 9 8 9 10 9 9 9 9 9 10 9
546 9 9 9 8 8 9 8 7 7 7 7 7 7 8 8 9 10 9 9 9 9 9 10 10 10 10 10 10 10 11 11 12 10 9 9 10 11 12 12 12 13 14 16 18 20 22 22 21 20 18 17 16 14 13 13 12 12 11 12 13 12 11 10 10 9 9 9 9 9 10 9 9 10
538 10 11 10 10 9 8 8 8 8 8 8 7 8 9 9 10 10 9 9 9 10 10 10 11 10 9 9 10 10 11 11 11 10 9 9 8 7 7 7 8 8 8 7 6 6 5 4 5 6 6 6 6 6 6 7 9 9 10 10 9 9 11 10 10 9 9 9 10 10 10 10 10
529 10 10 9 8 8 8 9 8 8 7 6 6 7 8 8 9 9 10 11 10 10 9 9 9 9 11 10 10 9 10 12 11 9 8 7 7 6 6 8 9 9 8 8 6 7 7 7 8 8 10 12 12 11 11 12 13 13 13 13 13 13 12 11 13 14 14 14 15 15 16 16 17
$$ packed form
589H%%j%%%%%JJ%%j%%J%%jJJ%jj%%JJj%J%%%j%jj%%%%K%%%%%jJ%%%%JjjjJ%%J%%%j%%Jjj%
581GJJJkj%%j%J%%%j%jJJ%JjjK%%JJ%kJJ%j%%%jJ%JjJ%jjJJj%jJJJjjjj%%J%JJ%%%%Jj%Jk
572I%%%jj%K%%J%%j%j%Jjj%%%JJj%J%%%%jJJJj%kj%J%J%J%kjj%KJ%%Jjjjj%JJj%%%JKJj%%
563A0Jjjj%JJK%kj%%%%jJ%jJ%%j%%%j%JKKj%jjJJjj%JJ%%%KJKKKMNOOLjmmnmlmljjjj%%%%
555A2%%j%%%%%J%%kk%JKj%J%%kjj%JJJ%Jjj%%%%jJK%%j%j%%jjjJj%JKJJjj%%%jJJj%%%%Jj
546I%%j%Jjj%%%%%J%JJj%%%%J%%%%%%J%Jkj%JJJ%%JJKKKK%jjkjjkj%j%jJJjjj%j%%%%Jj%J
538A0Jj%jj%%%%%jJJ%J%j%%J%%Jjj%J%J%%jj%jj%%J%%jj%jjJJ%%%%%JK%J%j%Kj%j%%J%%%%
529A0%jj%%Jj%jj%JJ%J%JJj%j%%%Kj%jJKjkjj%j%KJ%j%kJ%%J%KK%j%JJ%%%%%jjKJ%%J%J%J
$$ plain form
521 17 18 20 23 24 25 26 27 28 28 27 27 26 23 20 19 17 16 14 13 12 14 15 15 14 13 12 11 12 11 10 11 12 12 12 12 12 11 12 11 11 10 10 10 9 8 7 7 7 7 9 10 11 10 10 9 9 9 9 9 10 10 10 10 9 8 8 8 8 8 9 10
512 10 10 10 10 9 9 9 8 8 9 10 10 11 11 11 10 9 9 9 8 8 9 9 10 8 8 7 8 10 10 8 8 8 9 9 10 10 11 11 11 10 8 7 8 9 10 11 11 11 11 12 12 14 14 13 13 15 15 16 16 15 16 17 17 16 17 18 19 22 24 26 29
504 29 32 35 37 37 38 36 34 29 25 21 19 16 16 15 14 15 16 15 14 14 13 14 14 14 14 12 10 11 12 12 13 13 14 14 14 13 12 12 12 12 11 11 12 12 13 14 14 14 15 16 18 18 17 17 17 17 18 17 16 17 18 19 20 19 17 17 19 21 22 23 24
496 24 25 25 25 25 24 24 25 25 26 27 28 29 29 30 31 30 29 29 29 29 29 28 28 27 27 27 26 26 27 27 27 27 27 27 25 24 23 22 21 21 20 19 20 18 16 16 18 18 17 16 16 17 16 14 13 11 11 11 11 11 11 11 12 12 12 12 12 12 12 11 12
487 12 13 13 14 14 13 12 12 11 11 11 11 10 9 9 9 10 11 12 12 12 12 10 9 11 12 12 13 11 10 10 10 10 10 10 9 10 10 9 8 8 7 9 10 10 10 12 13 12 11 11 11 11 11 12 13 12 12 12 12 12 12 11 11 12 14 14 13 13 12 13 13
479 13 15 17 20 22 25 31 38 47 59 70 80 86 84 76 63 53 43 33 26 22 21 19 18 16 16 16 15 13 13 14 13 13 13 13 13 12 12 12 13 14 14 14 13 13 13 13 15 16 16 17 17 17 17 16 16 16 17 19 21 23 26 30 34 39
471 39 45 54 67 85 108 131 150 159 152 132 109 89 69 54 43 36 31 29 26 24 22 20 18 16 16 15 15 15 15 14 14 14 14 14 15 15 14 12 11 10 11 11 11 11 12 12 13 14 14 14 14 15 15 16 17 19 19 20 21 23
464 23 28 32 40 50 60 71 79 81 76 65 54 44 36 30 24 20 18 16 15 15 13 12 11 10 11 11 12 12 11 11 10 10 11 11 11 11 11 11 11 11 11 11 10 9 9 9 9 9 9 9 8 8 7 6 6 6 6 7 6 5 5 6 6 7 7
$$ packed form
521A7JKLJJJJJ%j%jlljkjkjjKJ%jjjjJjjJJ%%%%jJj%j%%jjj%%%KJJj%j%%%%J%%%jj%%%%JJ
512A0%%%j%%j%JJ%J%%jj%%j%J%Jk%jJK%k%%J%J%J%%jkjJJJJ%%%J%K%j%K%J%jJJ%jJJJLKKL
504B9LLK%Jkknmmkl%jjJJjj%jJ%%%kkJJ%J%J%%jj%%%j%J%JJ%%JJK%j%%%JjjJJJJjk%KKJJJ
496B4J%%%j%J%JJJJ%JJjj%%%%j%j%%j%J%%%%%kjjjj%jjJkk%K%jj%Jjkjk%%%%%%J%%%%%%jJ
487A2J%J%jj%j%%%jj%%JJJ%%%kjKJ%Jkj%%%%%jJ%jj%jKJ%%KJjj%%%%JJj%%%%%j%JK%j%jJ%
479A3KKLKLOPRJ2J1J0Okqj3j0j0j0pmjkjk%%jk%Jj%%%%j%%JJ%%j%%%KJ%J%%%j%%JKKKLMMN
471C9ORJ3J8K3K3J9Rpk0k3k0k0j5j1pnklkkkkk%j%%%j%%%%J%jkjjJ%%%J%JJ%%%J%JJK%JJK
464B3NMQJ0J0J1QKnj1j1j0qoomkkj%kjjjJ%J%j%j%J%%%%%%%%%jj%%%%%%j%jj%%%Jjj%J%J%
$$ plain form
456 7 7 7 7 7 8 8 9 9 8 8 8 8 8 9 9 9 9 9 9 9 9 9 9 9 8 8 7 7 6 7 8 8 7 8 9 8 7 8 9 9 9 9 9 8 8 9 9 9 9 8 7 8 9 8 8 9 9 6 5 5 7 8 8 7 7 8 9 10 11 11 9 7
447 7 7 8 9 8 7 6 7 9 8 8 8 9 10 10 10 10 9 9 10 10 8 8 7 7 8 7 6 5 5 5 5 6 8 8 8 8 6 6 8 7 7 7 7 7 7 8 8 8 8 9 8 8 8 8 8 8 9 8 8 9 9 9 8 9 9 10 10 9 8 8 8 9
439 9 9 9 9 9 9 9 9 9 8 8 8 8 8 7 9 9 10 9 9 9 10 9 7 6 7 7 8 9 10 9 9 8 7 7 7 9 10 10 10 10 9 8 7 7 6 6 6 6 5 7 8 9 8 7 7 8 10 10 10 9 9 8 8 8 8 9 10 10 9 8 8 8
430 8 8 8 8 8 7 7 6 6 7 8 7 7 6 7 8 8 8 9 9 8 7 8 9 8 8 7 6 7 7 8 8 8 8 7 5 5 6 7 7 8 9 9 10 11 11 10 9 8 9 9 8 7 8 7 7 8 8 7 6 6 6 6 6 7 8 8 6 6 7 8 9 10
422 10 10 10 11 10 10 10 9 9 9 8 8 9 10 10 10 9 7 7 7 8 9 10 11 9 8 8 8 8 8 8 7 6 6 4 4 5 7 7 7 7 7 7 8 7 6 7 7 8 8 8 8 8 7 8 9 9 10 10 10 10 10 9 9 9 9 9 9 8 8 8 10
413 10 11 10 8 8 9 10 10 9 9 10 10 9 8 8 9 11 10 10 10 10 9 8 7 7 7 7 7 6 6 7 7 7 8 9 9 8 7 6 6 7 8 8 8 7 6 6 6 5 6 7 7 7 6 8 9 9 9 8 8 8 7 7 8 8 7 8 8 8 7 6 6
405 6 6 7 7 8 9 9 10 10 10 10 10 9 8 8 8 8 9 10 10 8 7 7 7 8 9 8 7 7 7 8 8 8 8 7 7 7 6 7 7 6 5 6 6 7 8 9 8 9 9 10 10 9 9 7 6 6 8 9 8 8 8 8 8 8 7 8 7 6 7 8 8 8
396 8 7 7 6 6 7 8 9 8 8 8 8 7 7 7 6 6 7 8 9 9 9 10 9 8 8 7 7 7 8 8 8 7 7 7 8 8 9 8 7 7 7 8 8 8 8 8 8 7 6 6 7 7 8 8 9 8 8 7 7 8 9 9 9 8 8 8 8 8 8 6 4 5
$$ packed form
456G%%%%J%J%j%%%%J%%%%%%%%%%j%j%jJJ%jJJjjJJ%%%%j%J%%%jjJJj%J%lj%KJ%j%JJJJ%kk
447G%JJjjjJKj%%JJ%%%j%J%k%j%Jjjj%%%JK%%%k%Kj%%%%%J%%%Jj%%%%%Jj%J%%jJ%J%jj%%J
439I%%%%%%%%j%%%%jK%Jj%%JjkjJ%JJJj%jj%%KJ%%%jjj%j%%%jKJJjj%JK%%j%j%%%JJ%jj%%
430H%%%%j%j%JJj%jJJ%%J%jjJJj%jjJ%J%%%jk%JJ%JJ%JJ%jjjJ%jjJj%J%jj%%%%JJ%k%JJJJ
422A0%%Jj%%j%%j%JJ%%jk%%JJJJkj%%%%%jj%k%JK%%%%%JjjJ%J%%%%jJJ%J%%%%j%%%%%j%%K
413A0Jjk%JJ%j%J%jj%JKj%%%jjj%%%%j%J%%JJ%jjj%JJ%%jj%%jJJ%%jKJ%%j%%j%J%jJ%%jj%
405F%J%JJ%J%%%%jj%%%JJ%kj%%JJjj%%J%%%j%%jJ%jjJ%JJJjJ%J%j%kj%KJj%%%%%jJjjJJ%%
396Hj%j%JJJj%%%j%%j%JJJ%%Jjj%j%%J%%j%%J%Jjj%%J%%%%%jj%J%J%Jj%j%JJ%%j%%%%%kkJ
$$ plain form
388 5 6 8 8 7 7 6 7 7 7 7 8 8 8 8 8 8 8 7 6 7 7 8 8 9 9 9 9 8 8 9 11 11 9 9 10 11 10 9 9 8 7 7 6 6 6 6 6 6 8 9 8 8 8 9 9 9 8 9 9 8 7 7 7 7 7 7 6 6 6 6 6 6
379 6 6 7 8 8 9 8 8 8 9 10 9 7 6 6 6 6 8 9 10 9 8 8 9 10 10 9 9 9 8 9 9 10 10 9 8 8 8 9 10 9 8 10 10 10 10 10 11 10 9 8 9 9 8 8 7 7 8 9 9 8 7 8 9 9 9 8 8 7 9 9 8 8
370 8 7 8 8 9 9 9 7 6 5 6 6 7 7 7 6 6 5 8 9 8 7 6 5 4 6 7 8 8 9 9 10 9 9 9 9 9 8 9 9 9 9 7 7 8 8 9 8 8 7 7 8 9 11 11 11 9 7 7 7 8 8 7 7 7 8 9 9 9 9 7 6 6
362 6 7 6 6 6 6 7 8 8 8 8 9 8 8 9 9 9 8 9 9 9 10 10 11 10 9 9 8 8 7 8 8 9 10 10 10 9 8 8 8 8 7 7 7 8 8 8 8 7 7 6 5 6 7 6 5 6 6 5 4 4 4 4 5 5 5 7 9 10 11 10 10 9
353 9 8 7 6 6 6 7 8 8 9 10 10 9 9 7 6 6 6 7 8 9 10 9 9 8 7 8 9 9 9 9 8 8 9 10 11 10 9 9 8 8 9 9 10 9 9 9 8 9 9 9 9 10 11 12 12 11 9 7 8 8 8 9 9 8 9 10 10 9 8 8 8 9
345 9 10 10 9 8 9 8 8 8 9 9 9 8 8 9 9 9 8 9 9 10 10 11 11 11 11 11 11 11 10 10 12 14 13 12 12 12 11 10 10 10 10 10 9 9 10 10 9 7 6 6 6 7 7 7 7 7 9 10 11 10 10 10 10 10 10 10 10 9 9 9 8 8
336 8 9 10 10 11 10 9 9 9 9 8 9 10 11 12 13 13 14 13 13 12 11 9 8 9 9 10 9 8 7 7 9 9 9 8 8 8 9 9 10 9 9 7 7 7 8 8 8 7 6 6 7 7 7 8 10 10 9 9 9 8 8 8 8 7 7 6 5 5 5 5 5 6
328 6 6 7 7 8 8 8 7 8 8 8 8 8 8 8 8 7 6 6 6 7 8 8 8 7 7 8 8 7 6 7 8 9 10 10 9 10 10 10 10 10 10 10 9 7 7 9 10 10 10 10 10 10 9 9 9 9 9 8 7 7 6 7 9 8 8 9 11 11 10 9 8 8
$$ packed form
388EJK%j%jJ%%%J%%%%%%jjJ%J%J%%%j%JK%k%JJjj%jj%j%%%%%KJj%%J%%jJ%jj%%%%%j%%%%%
379F%JJ%Jj%%JJjkj%%%KJJjj%JJ%j%%jJ%J%jj%%JJjjK%%%%JjjjJ%j%j%JJ%jjJJ%%j%jK%j%
370HjJ%J%%kjjJ%J%%j%jLJjjjjjKJJ%J%Jj%%%%jJ%%%k%J%Jj%j%JJK%%kk%%J%j%%JJ%%%kj%
362FJj%%%JJ%%%Jj%J%%jJ%%J%Jjj%j%jJ%JJ%%jj%%%j%%J%%%j%jjJJjjJ%jj%%%J%%KKJJj%j
353Ijjj%%JJ%JJ%j%kj%%JJJJj%jjJJ%%%j%JJJjj%j%J%Jj%%jJ%%%JJJ%jkkJ%%J%jJJ%jj%%J
345IJ%jjJj%%J%%j%J%%jJ%J%J%%%%%%j%KKjj%%jj%%%%j%J%jkj%%J%%%%KJJj%%%%%%%j%%j%
336HJJ%Jjj%%%jJJJJJ%Jj%jjkjJ%Jjjj%K%%j%%J%Jj%k%%J%%jj%J%%JK%j%%j%%%j%jj%%%%J
328F%J%J%%jJ%%%%%%%jj%%JJ%%j%J%jjJJJJ%jJ%%%%%%jk%KJ%%%%%j%%%%jj%jJKj%JK%jjj%
$$ plain form
319 8 8 8 8 8 9 9 8 8 8 8 7 8 10 9 9 8 6 6 7 8 9 10 10 9 8 9 9 8 8 8 9 8 8 8 8 7 6 8 9 9 7 8 9 9 8 8 8 8 8 8 7 8 7 6 6 7 8 9 11 11 11 11 11 10 8 7 8 7 7 9 10 9
310 9 8 8 8 9 10 8 7 8 8 8 7 8 8 8 8 8 7 7 7 7 7 8 8 7 6 7 8 8 8 5 5 6 6 7 7 7 8 8 8 9 10 9 9 9 9 8 7 8 8 8 8 8 8 9 10 10 9 7 6 6 6 6 7 8 7 5 5 5 7 8 8 9
302 9 10 10 9 8 6 6 7 6 6 5 5 6 7 8 10 9 8 7 7 7 8 7 7 6 6 5 5 5 6 6 7 7 7 7 7 8 10 9 7 7 6 6 5 5 6 5 5 5 6 6 6 6 5 5 5 5 4 5 6 5 7 8 7 6 6 6 6 6 5 5 6 7
293 7 8 8 9 9 9 8 8 7 6 7 7 7 7 8 9 8 6 5 6 6 7 7 8 8 7 6 6 6 7 6 5 5 5 6 7 7 8 7 7 7 8 8 9 9 9 8 7 7 7 8 8 8 8 8 9 9 10 8 6 5 5 5 5 5 4 4 5 5 5 5 6 7
285 7 7 6 7 7 7 8 9 8 7 7 7 7 7 7 7 7 7 7 8 9 8 7 7 8 9 9 10 8 6 5 4 5 5 7 9 9 10 10 8 6 5 6 6 6 7 8 8 7 7 7 9 9 8 8 7 6 7 6 6 6 6 7 7 7 7 8 8 7 7 8 9 8
276 8 7 8 6 5 5 5 5 7 7 6 6 7 8 7 7 8 8 7 6 6 6 7 7 7 6 7 7 8 6 5 4 6 8 8 9 8 7 6 5 6 7 8 8 6 5 6 6 6 7 7 7 7 6 5 6 7 7 8 8 8 7 8 8 8 8 8 9 8 8 7 8 9
267 9 8 7 7 8 8 8 8 7 7 7 8 7 7 8 8 7 8 10 9 7 8 8 8 9 9 9 8 8 8 8 8 8 8 8 8 8 7 7 7 7 7 8 8 8 7 7 7 7 7 7 7 7 7 7 7 7 8 8 9 9 9 8 8 9 8 7 6 6 6 5 5 5
259 5 5 6 6 6 6 6 5 5 5 6 6 7 7 7 7 8 9 9 7 6 6 6 7 8 8 8 7 7 8 8 6 4 3 5 7 9 8 7 6 6 8 9 10 10 10 9 7 5 4 5 6 7 7 6 8 8 8 8 9 8 7 6 7 8 8 8 7 7 6 5 5 5
$$ packed form
319H%%%%J%j%%%jJKj%jk%JJJJ%jjJ%j%%Jj%%%jjKJ%kJJ%j%%%%%jJjj%JJJK%%%%jkjJj%KJj
310Ij%%JJkjJ%%jJ%%%%j%%%%J%jjJJ%%l%J%J%%J%%JJj%%%jjJ%%%%%JJ%jkj%%%JJjk%%KJ%J
302IJ%jjk%Jj%j%JJJKjjj%%Jj%j%j%%J%J%%%%JKjk%j%j%Jj%%J%%%j%%%jJJjKJjj%%%%j%JJ
293GJ%J%%j%jjJ%%%JJjkjJ%J%J%jj%%Jjj%%JJ%Jj%%J%J%%jj%%J%%%%J%Jkkj%%%%j%J%%%JJ
285G%jJ%%JJjj%%%%%%%%%JJjj%JJ%JkkjjJ%KK%J%kkjJ%%JJ%j%%K%j%jjJj%%%J%%%J%j%JJj
276HjJkj%%%K%j%JJj%J%jj%%J%%jJ%JkjjKK%JjjjjJJJ%kjJ%%J%%%jjJJ%J%%jJ%%%%Jj%jJJ
267Ijj%J%%%j%%Jj%J%jJKjkJ%%J%%j%%%%%%%%%j%%%%J%%j%%%%%%%%%%%J%J%%j%Jjjj%%j%%
259E%J%%%%j%%J%J%%%JJ%kj%%JJ%%j%J%kkjKKKjjj%KJJ%%jkkjJJJ%jK%%%JjjjJJ%%j%jj%%
$$ plain form
250 5 5 6 6 7 7 8 7 6 7 8 8 8 7 7 8 8 8 7 7 6 6 6 6 6 8 9 9 8 7 7 8 7 7 5 4 5 6 6 5 4 5 5 5 5 6 7 8 8 7 6 6 6 6 6 6 8 8 7 7 8 8 8 9 8 8 7 7 7 6 5 5 5
242 5 6 6 6 5 5 6 7 7 6 6 6 5 6 7 8 7 7 8 8 8 7 8 9 8 7 7 6 5 5 6 7 6 5 5 5 4 4 4 6 6 7 8 8 10 10 8 7 8 9 9 9 8 7 7 6 5 4 3 3 3 4 6 7 7 7 7 6 5 4 5 6 5
233 5 5 5 5 5 6 6 5 5 6 7 8 9 9 8 8 7 6 6 6 5 4 5 6 6 7 6 6 6 6 7 8 7 6 6 7 6 5 6 6 6 6 6 6 8 9 10 9 8 8 9 9 10 10 10 10 9 7 6 7 7 7 7 7 6 6 6 6 6 6 7 8 9
225 9 8 7 6 6 6 8 8 8 7 6 6 7 7 7 7 7 6 5 5 4 5 5 5 6 7 7 7 7 7 7 7 5 6 7 7 6 5 5 5 6 7 6 6 7 7 7 6 6 6 6 7 7 8 8 8 9 9 10 9 7 6 6 7 7 7 7 8 8 8 8 8 7
216 7 8 8 8 6 6 7 6 6 5 4 4 5 7 8 10 9 8 7 8 9 8 8 7 7 7 8 9 9 9 8 7 9 10 10 11 11 9 7 7 6 6 7 7 7 6 7 7 7 6 6 5 5 6 6 6 6 6 7 7 8 9 9 10 9 9 8 8 8 7 6 6 5
207 5 5 5 6 6 6 6 6 6 6 7 8 7 6 6 6 7 7 6 6 6 6 6 5 4 4 5 8 8 7 6 5 5 4 5 7 7 6 7 7 7 7 8 8 8 8 8 7 7 8 9 9 10 10 9 9 9 10 11 11 10 9 9 8 8 8 8 8 6 6 5 5 5
199 5 6 6 6 6 5 5 5 6 7 7 6 4 4 5 7 7 5 6 7 7 8 8 7 8 9 9 10 9 9 9 9 8 8 9 9 9 9 7 5 4 3 5 6 6 6 8 9 8 6 6 6 6 7 7 8 8 7 7 8 8 8 8 8 8 7 7 6 7 7 7 7 7
190 7 7 6 6 6 6 7 8 8 8 7 6 6 6 7 8 8 8 8 9 8 7 8 8 7 7 7 7 7 8 7 7 7 8 7 7 7 7 7 7 8 8 8 8 8 9 9 7 6 7 7 8 8 8 7 7 7 7 6 6 6 6 6 6 5 4 5 6 6 6 6 6 6
$$ packed form
250E%J%J%JjjJJ%%j%J%%j%j%%%%KJ%jj%Jj%kjJJ%jjJ%%%JJJ%jj%%%%%K%j%J%%Jj%j%%jj%%
242EJ%%j%JJ%j%%jJJJj%J%%jJJjj%jj%JJjj%%j%%K%JJ%K%kjJJ%%jj%jjjj%%JKJ%%%jjjJJj
233E%%%%J%j%JJJJ%j%jj%%jjJJ%Jj%%%JJjj%JjjJ%%%%%KJJjj%J%J%%%jkjJ%%%%j%%%%%JJJ
225Ijjj%%K%%jj%J%%%%jj%jJ%%JJ%%%%%%kJJ%jj%%JJj%J%%j%%%J%J%%J%Jjkj%J%%%J%%%%j
216GJ%%k%Jj%jj%JKJKjjjJJj%j%%JJ%%jjKJ%J%kk%j%J%%jJ%%j%j%J%%%%J%JJ%Jj%j%%jj%j
207E%%J%%%%%%JJjj%%J%j%%%%jj%JL%jjj%jJK%jJ%%%J%%%%j%JJ%J%j%%JJ%jj%j%%%%k%j%%
199EJ%%%j%%JJ%jk%JK%kJJ%J%jJJ%Jj%%%j%J%%%kkjjKJ%%KJjk%%%J%J%j%J%%%%%j%jJ%%%%
190G%j%%%JJ%%jj%%JJ%%%JjjJ%j%%%%Jj%%Jj%%%%%J%%%%J%kjJ%J%%j%%%j%%%%%jjJJ%%%%%
$$ plain form
182 6 7 6 6 6 6 6 6 7 6 5 6 8 8 8 7 7 7 6 6 6 6 8 8 8 7 6 6 7 8 8 7 6 7 7 7 6 6 7 8 9 9 8 7 7 7 7 6 6 6 7 7 8 7 7 7 8 9 8 8 7 7 7 9 11 9 9 8 8 7 6 5 5
173 5 5 4 5 6 7 8 8 8 7 7 8 7 7 6 6 5 5 5 5 5 5 6 7 7 8 9 9 8 8 7 6 6 6 6 5 6 8 9 8 8 7 7 7 7 7 7 6 7 5 6 6 6 5 5 7 7 8 8 9 8 6 5 5 6 6 5 5 7 8 8 8 8
164 8 7 7 8 8 8 8 7 7 8 7 7 8 8 8 8 7 7 7 6 5 5 7 8 9 8 7 7 8 7 7 8 8 7 7 8 8 6 5 5 4 3 4 4 4 5 6 7 8 8 8 7 7 7 8 8 8 8 9 9 8 7 6 6 8 8 8 7 7 6 6 6 6
156 6 7 8 9 9 8 8 8 8 8 8 7 7 9 9 8 9 9 9 8 8 8 8 8 8 8 6 6 7 8 9 8 6 6 7 7 7 6 6 7 8 8 7 7 8 8 9 8 7 7 7 7 7 6 6 6 6 6 7 7 7 6 7 7 8 8 8 9 8 8 8 8 8
147 8 8 7 6 6 6 6 4 3 4 3 3 4 5 8 9 9 9 9 9 8 7 7 6 7 7 8 8 6 5 5 6 6 5 6 6 6 5 6 7 8 8 8 7 8 8 8 8 8 7 7 7 7 6 5 5 4 6 6 6 7 8 9 8 7 7 6 5 6 6 6 7 6
139 6 5 5 4 5 7 7 7 6 6 6 7 7 7 7 7 7 8 7 7 6 6 6 6 6 7 7 7 7 8 9 9 9 9 9 9 9 8 8 8 8 9 7 6 7 7 7 7 7 7 7 7 7 8 9 8 7 7 7 7 8 8 8 7 7 8 8 9 9 10 9 9 7
130 7 7 8 8 8 8 8 8 8 8 7 6 7 8 7 7 7 8 8 8 8 7 7 6 6 5 6 6 7 8 7 5 6 7 7 7 7 7 6 5 6 8 8 9 11 11 9 7 7 6 6 6 7 7 8 9 9 8 7 7 7 7 7 7 5 3 3 5 6 5 6 7 7
122 7 6 6 5 4 3 3 5 6 6 5 4 4 3 5 6 6 6 7 6 5 6 5 5 5 5 5 5 6 7 6 5 6 6 6 6 6 4 4 4 4 4 5 4 4 3 5 5 4 5 5 6 6 6 7 7 7 7 8 9 9 9 8 7 6 7 7 6 7 6 4 4 4
$$ packed form
182FJj%%%%%JjjJK%%j%%j%%%K%%jj%JJ%jjJ%%j%JJJ%jj%%%j%%J%Jj%%JJj%j%%KKk%j%jjj%
173E%jJJJJ%%j%Jj%j%j%%%%%JJ%JJ%j%jj%%%jJKJj%j%%%%%jJkJ%%j%K%J%Jjkj%J%j%KJ%%%
164Hj%J%%%j%Jj%J%%%j%%jj%KJJjj%Jj%J%j%J%kj%jjJ%%JJJJ%%j%%J%%%J%jjj%K%%j%j%%%
156FJJJ%j%%%%%j%K%jJ%%j%%%%%%k%JJJjk%J%%j%JJ%j%J%Jjj%%%%j%%%%J%%jJ%J%%Jj%%%%
147H%jj%%%kjJj%JJLJ%%%%jj%jJ%J%kj%J%jJ%%jJJJ%%jJ%%%%j%%%jj%jK%%JJJjj%jjJ%%Jj
139Fj%jJK%%j%%J%%%%%Jj%j%%%%J%%%JJ%%%%%%j%%%JkjJ%%%%%%%%JJjj%%%J%%j%J%J%Jj%k
130G%J%%%%%%%jjJJj%%J%%%j%j%jJ%JJjkJJ%%%%jjJK%JK%kk%j%%J%JJ%jj%%%%%kk%KJjJJ%
122Gj%jjj%KJ%jj%jKJ%%JjjJj%%%%%JJjjJ%%%%k%%%%Jj%jK%jJ%J%%J%%%JJ%%jjjJ%jJjk%%
$$ plain form
113 4 4 4 4 5 6 6 6 5 6 7 5 5 6 6 4 3 4 5 5 5 6 6 6 7 7 6 6 6 6 5 4 5 5 6 7 7 5 5 5 6 6 6 5 5 4 5 5 6 6 5 4 5 5 5 5 6 7 7 6 6 7 7 9 10 9 8 7 7 7 8 8 8
104 8 9 9 9 10 11 9 8 7 7 7 7 6 6 5 5 5 4 5 6 6 5 6 6 6 6 7 7 7 7 8 8 9 9 10 10 8 7 8 9 9 9 7 6 7 7 7 7 7 6 6 6 6 5 5 5 7 9 9 9 8 7 7 7 7 7 7 7 7 7 7 6 6
96 6 6 7 7 7 7 7 6 7 7 8 9 8 8 7 6 6 5 5 5 6 6 7 8 7 7 7 7 6 5 5 5 5 6 7 7 6 5 6 6 6 6 7 7 6 5 5 6 5 5 5 5 6 5 4 4 5 6 7 6 5 5 5 6 7 7 8 8 8 7 7 8 9 10
87 10 10 10 9 8 6 7 8 9 8 8 8 7 7 7 7 8 8 9 8 8 8 7 6 6 6 7 6 6 6 6 5 6 6 6 7 9 10 11 10 8 8 7 6 6 6 6 6 6 7 8 9 10 10 10 9 9 9 7 7 8 7 7 8 8 7 5 4 5 6 6 7 6
79 6 5 6 6 7 7 7 7 7 6 7 7 7 7 8 8 8 8 8 7 6 5 6 8 7 7 7 7 7 6 5 5 6 6 6 7 7 8 9 8 7 7 6 6 6 5 4 3 5 7 7 6 6 6 5 6 7 7 7 6 5 5 6 7 8 8 9 8 8 8 7 6 5 4
70 4 3 3 4 5 6 7 7 7 7 7 8 9 9 9 9 9 8 8 8 9 10 8 6 5 4 4 4 5 6 6 6 6 6 6 5 5 5 6 7 6 6 6 6 6 6 6 7 6 4 4 3 5 7 7 7 8 8 8 8 8 7 7 6 6 6 7 8 7 6 6 5 5 5
61 5 6 7 6 6 6 6 6 6 5 5 6 7 7 8 8 8 5 6 6 6 6 7 6 6 8 9 9 9 7 7 8 8 8 7 8 8 7 7 7 6 6 7 7 8 9 8 8 7 7 8 8 7 7 7 7 7 6 5 4 5 5 6 6 7 8 7 8 8 8 8 8 9 9
52 9 8 7 6 5 4 3 5 6 7 7 6 6 6 6 7 7 6 7 7 6 6 5 6 7 6 7 7 8 7 5 6 7 6 6 5 5 5 5 5 5 5 5 6 7 6 5 5 5 5 6 6 7 5 6 6 7 7 8 8 8 7 7 6 7 7 7 8 7 7 7 6 6 7
$$ packed form
113D%%%JJ%%jJJk%J%kjJJ%%J%%J%j%%%jjJ%JJ%k%%J%%j%jJ%J%jjJ%%%JJ%j%J%KJjjj%%J%%
104HJ%%JJkjj%%%j%j%%jJJ%jJ%%%J%%%J%J%J%kjJJ%%kjJ%%%%j%%%j%%KK%%jj%%%%%%%%%j%
96F%J%%%%jJ%JJj%jj%j%%J%JJj%%%jj%%%JJ%jjJ%%%J%jj%Jj%%%Jjj%JJJjj%%JJ%J%%j%JJJ
87A0%%jjkJJJj%%j%%%J%Jj%%jj%%Jj%%%jJ%%JKJJjk%jj%%%%%JJJJ%%j%%k%Jj%J%jkjJJ%Jj
79FjJ%J%%%%jJ%%%J%%%%jjjJKj%%%%jj%J%%J%JJjj%j%%jjjKK%j%%jJJ%%jj%JJJ%Jj%%jjjj
70Dj%JJJJ%%%%JJ%%%%j%%JJkkjj%%JJ%%%%%j%%JJj%%%%%%Jjk%jKK%%J%%%%j%j%%JJjj%j%%
61EJJj%%%%%j%JJ%J%%lJ%%%Jj%KJ%%k%J%%jJ%j%%j%J%JJj%j%J%j%%%%jjjJ%J%JJjJ%%%%J%
52IjjjjjjKJJ%j%%%J%jJ%j%jJJjJ%JjkJJj%j%%%%%%%JJjj%%%J%JkJ%J%J%%j%jJ%%Jj%%j%J
$$ plain form
44 7 7 6 6 5 5 6 5 6 8 9 10 10 10 10 10 8 8 8 8 7 6 7 7 8 7 5 5 5 5 6 6 6 8 9 8 8 8 9 9 10 9 8 8 7 6 6 8 9 8 7 7 7 7 8 9 10 10 11 10 9 8 8 7 7 5 5 6 6 7 8 9 9 8
35 8 9 9 9 8 7 7 7 6 6 6 7 7 7 8 7 6 6 6 6 5 4 4 4 5 5 6 7 8 6 6 6 6 6 7 8 8 7 6 5 4 4 3 5 6 8 9 9 8 8 7 7 7 7 6 5 5 5 5 4 5 6 7 7 7 6 6 5 5 5 4 4 5 6
26 6 6 5 5 5 5 5 6 6 6 6 7 8 8 8 7 5 6 6 6 6 5 5 5 5 6 6 6 7 7 7 6 6 6 6 5 5 4 4 4 4 4 4 5 6 6 7 6 5 6 7 7 7 7 6 6 6 6 7 7 7 6 5 5 5 5 6 6 6 7 8 7 7 7
18 7 7 7 6 4 5 6 6 7 8 7 6 5 5 5 4 4 4 4 4 5 6 5 4 4 5 6 6 6 6 5 4 4 3 4 4 4 5 5 5 6 8 8 9 9 8 7 7 7 8 7 7 7 7 8 9 10 10 9 9 8 7 7 7 8 9 9 10 8 6 5 6 6 7
9 7 8 7 6 6 6 7 7 8 7 7 7 7 7 8 7 7 8 9 9 8 7 7 8 8 8 9 8 8 7 5 5 6 6 5 5 4 3 4 7 7 7 9 10 8 6 7 9 10 10 9 7 7 7 7 8 9 8 7 6 5 6 6 5 4 4 6 7 8 8 6 6 5 6 7
0 7 6 6 5 5 7 7 6 5 4 5 6 6 6 6 6 7 8 7 7 8 8 7 6 6 5 7 8 8 7 6 6 6 5 5 5 4 4 5 5 6 6 6 6 5 6 7 7 7 6 6 6 7 8 9 9 9 10 9 9 8 8 8 7 5 5 5 6 7 7 7 7 7 5 3
-9 3 4 5 5 6 6 6 7 8 8 7 7 6 7 8 7 6 6 6 7 7 7 6 7 7 7 7 8 8 6 6 6 5 6 7 7 7 8 8 7 6 7 6 5 5 6 7 6 5 5 6 7 7 7 8 9 8 8 7 6 7 8 6 6 5 5 6 7 7 8 9 10 10 9
-17 9 8 7 6 5 4 5 7 7 7 7 8 10 9 9 9 10 10 9 8 5 5 5 5 6 6 6 5 5 4 5 5 6 6 7 8 7 7 6 6 7 8 9 9 8 8 8 9 9 10 9 9 8 7 7 7 7 7 6 5 5 5 5 5 5 6 6 7 6 5 5 5 5
$$ packed form
44G%j%j%JjJKJJ%%%%k%%%jjJ%Jjk%%%J%%KJj%%J%Jjj%jj%KJjj%%%JJJ%Jjjj%j%k%J%JJJ%j
35HJ%%jj%%j%%J%%Jjj%%%jj%%J%JJJk%%%%JJ%jjjj%jKJKJ%j%j%%%jj%%%jJJJ%%j%j%%j%JJ
26F%j%%%%J%%%JJ%%jkJ%%%j%%%J%%J%%j%%%j%j%%%%%JJ%JjjJJ%%%j%%%J%%jj%%%J%%JJj%%
18G%%jkJJ%JJjjj%%j%%%%JJjj%JJ%%%jj%jJ%%J%%JK%J%jj%%Jj%%%JJJ%j%jj%%JJ%JkkjJ%J
9GJjj%%J%Jj%%%%Jj%JJ%jj%J%%Jj%jk%J%j%jjJL%%KJkkJKJ%jk%%%JJjjjjJ%jj%KJJ%k%jJJ
0Gj%j%K%jjjJJ%%%%JJj%J%jj%jKJ%jj%%j%%j%J%J%%%jJJ%%j%%JJJ%%Jj%j%%jk%%JJ%%%%kk
-9CJJ%J%%JJ%j%jJJjj%%J%%jJ%%%J%k%%jJJ%%J%jjJjj%JJjj%JJ%%JJj%jjJJk%j%JJ%JJJ%j
-17IjjjjjJK%%%JKj%%J%jjl%%%J%%j%jJ%J%JJj%j%JJJ%j%%J%Jj%jj%%%%jj%%%%%J%Jjj%%%
$$ plain form
-26 5 5 5 5 7 8 7 6 6 6 7 8 8 8 8 8 8 9 9 9 9 8 8 7 7 8 9 8 8 7 7 6 6 7 6 5 5 6 6 6 6 6 7 6 5 5 6 6 7 7 7 8 7 6 6 5 5 5 6 5 5 5 4 4 5 5 6 6 7 7 8 8 8
-35 8 8 7 6 6 7 7 8 7 6 7 7 7 8 6 6 6 7 8 8 9 10 10 10 10 8 6 5 5 6 6 6 5 6 7 8 8 8 9 8 8 7 8 8 10 9 8 8 8 7 7 7 7 7 7 7 8 8 8 8 8 7 6 6 6 6 7 7 8 8 8 8 6
-43 6 7 9 9 7 6 6 5 4 3 4 4 5 5 4 4 5 5 5 5 5 5 6 7 8 8 8 7 8 8 9 9 8 7 7 7 8 9 10 8 7 5 6 7 9 10 9 9 8 8 7 6 6 6 6 6 5 5 6 6 6 5 5 7 8 8 7 9 10 9 9 10 10
-52 10 10 9 9 9 7 5 6 7 7 6 5 4 6 7 7 6 5 5 4 5 6 7 9 9 9 9 8 7 7 7 7 6 5 6 6 7 7 6 5 6 6 6 6 6 6 5 5 4 4 4 5 5 6 6 6 5 4 4 4 5 6 6 5 4 5 5 6 6 6 6 6
-60 6 6 6 6 7 6 7 8 8 8 7 4 4 5 7 7 7 6 5 3 3 5 5 5 5 6 7 7 7 8 8 6 5 5 6 6 6 5 4 4 4 6 6 6 5 5 5 5 5 4 2 3 4 4 5 6 6 5 3 2 3 4 5 5 5 5 5 5 6 5 6 6 6
-69 6 6 6 6 6 5 3 4 4 5 6 6 6 5 6 6 6 6 6 6 7 8 7 7 6 6 6 6 6 7 8 7 7 7 7 6 6 6 5 5 5 5 4 5 6 5 5 5 6 6 6 5 5 5 6 6 7 7 8 8 9 10 11 10 9 8 8 7 7 7 7 7 7
-77 7 7 6 6 6 5 4 4 4 4 4 4 4 4 4 5 5 5 6 8 8 8 9 9 8 6 4 4 4 5 5 5 6 7 8 7 6 5 6 7 7 6 8 8 7 6 6 6 7 7 6 6 6 6 7 6 6 6 6 6 6 6 5 6 7 7 7 7 7 7 6 7 8
-86 8 8 8 8 8 7 7 7 7 7 6 6 5 6 6 6 5 6 6 7 7 7 7 7 7 7 6 5 6 7 6 6 7 7 5 5 6 6 7 7 7 7 7 7 7 7 6 6 6 6 5 5 6 7 8 8 8 7 7 6 6 5 5 4 4 5 5 5 4 5 5 6 6
$$ packed form
-26E%%%KJjj%%JJ%%%%%J%%%j%j%JJj%j%j%Jjj%J%%%%Jjj%J%J%%Jjj%j%%Jj%%j%J%J%J%J%%
-35H%jj%J%JjjJ%%Jk%%JJ%JJ%%%kkj%J%%jJJJ%%Jj%jJ%Kjj%%j%%%%%%J%%%%jj%%%J%J%%%k
-43FJK%kj%jjjJ%J%j%J%%%%%JJJ%%jJ%J%jj%%JJJkjkJJKJj%j%jj%%%%j%J%%j%KJ%jKJj%J%
-52A0%j%%kkJJ%jjjKJ%jj%jJJJK%%%jj%%%jjJ%J%jjJ%%%%%j%j%%J%J%%jj%%JJ%jjJ%J%%%%
-60F%%%JjJJ%%jl%JK%%jjk%K%%%JJ%%J%kj%J%%jj%%K%%j%%%%jkJJ%JJ%jkjJJJ%%%%%JjJ%%
-69F%%%%jkJ%JJ%%jJ%%%%%JJj%j%%%%JJj%%%j%%j%%%jJJj%%J%%j%%J%J%J%JJJjjj%j%%%%%
-77G%j%%jj%%%%%%%%J%%JK%%J%jkk%%J%%JJJjjjJJ%jK%jj%%J%j%%%Jj%%%%%%jJJ%%%%%jJJ
-86H%%%%j%%%%j%jJ%%jJ%J%%%%%%jjJJj%J%k%J%J%%%%%%%j%%%j%JJJ%%j%j%j%j%J%%jJ%J%
$$ plain form
-95 6 6 6 5 4 4 4 5 5 5 5 5 5 4 4 4 3 3 3 3 3 4 4 6 6 5 7 9 9 8 8 8 6 7 8 8 8 7 6 7 7 7 8 8 8 8 9 9 8 7 6 5 4 4 5 6 7 6 6 6 7 7 7 8 8 9 10 7 6 6 6 6 5
-103 5 6 6 6 5 5 5 6 6 7 8 8 8 7 6 5 4 5 6 6 6 6 6 4 3 4 4 6 7 7 7 7 7 7 6 7 7 7 7 6 6 6 6 6 5 7 8 8 8 7 7 7 7 8 8 8 6 5 4 3 3 4 5 4 4 4 5 6 7 7 7 7
-112 7 6 6 5 5 7 8 8 8 8 8 7 7 6 6 7 7 8 8 7 6 6 5 5 5 5 5 6 4 4 6 7 7 7 6 8 9 9 9 9 9 8 9 9 9 9 9 10 9 9 9 8 7 7 7 7 8 8 8 7 8 8 9 7 6 5 5 6 7 8 8 7
-120 7 6 6 7 7 8 9 8 8 7 7 7 7 7 7 7 7 6 6 7 8 8 7 7 6 6 5 4 5 5 5 3 5 6 7 8 6 6 6 6 6 6 6 7 7 7 7 8 8 6 4 4 5 6 6 6 5 5 5 5 6 7 7 6 6 7 7 7 7 5 6 6
-129 6 7 7 6 5 6 7 6 6 5 6 7 8 7 7 6 6 7 6 5 5 6 6 7 7 8 8 9 10 11 9 8 6 6 7 7 6 6 6 7 6 7 8 8 8 7 7 8 8 7 8 8 6 5 5 4 4 5 5 6 5 5 5 6 7 7 7 6 6 6 6 6
-137 6 5 5 5 6 7 6 5 5 6 7 8 9 8 7 8 8 7 6 6 6 6 5 6 6 6 6 6 5 6 6 6 7 7 6 6 5 5 5 5 6 6 6 6 6 7 7 8 8 9 10 9 7 4 4 5 7 6 6 6 6 5 4 5 7 7 7 6 5 5 6 6
-145 6 7 6 5 6 6 6 6 6 6 6 6 6 6 5 5 5 6 6 7 6 5 5 5 6 6 7 7 6 5 5 5 5 5 6 6 6 6 5 4 5 6 5 4 5 5 6 6 7 7 7 6 7 8 8 8 8 8 8 7 6 5 5 4 5 5 5 5 4 4 5 5
-154 5 6 6 6 6 6 5 6 6 6 7 7 8 8 8 8 8 7 7 6 6 7 8 8 8 7 5 5 5 7 8 8 6 6 8 9 8 8 8 7 6 6 6 5 4 5 5 6 8 7 6 6 5 5 5 5 6 5 4 6 7 7 8 8 7 8 8 8 7 6 5 4
$$ packed form
-95F%%jj%%J%%%%%j%%j%%%%J%K%jKK%j%%kJJ%%jjJ%%J%%%J%jjjjj%JJJj%%J%%J%JJlj%%%j
-103EJ%%j%%J%JJ%%jjjjJJ%%%%kjJ%KJ%%%%%jJ%%%j%%%%jKJ%%j%%%J%%kjjj%JJj%%JJJ%%%
-112Gj%j%KJ%%%%j%j%J%J%jj%j%%%%Jk%KJ%%jKJ%%%%jJ%%%%Jj%%jj%%%J%%jJ%Jkjj%JJJ%j
-120Gj%J%JJj%j%%%%%%%j%JJ%j%j%jjJ%%kKJJJk%%%%%%J%%%J%kk%JJ%%j%%%JJ%j%J%%%kJ%
-129FJ%jjJJj%jJJJj%j%Jjj%J%J%J%JJJkjk%J%j%%JjJJ%%j%J%jJ%kj%j%J%Jj%%JJ%%j%%%%
-137Fj%%JJjj%JJJJjjJ%jj%%%jJ%%%%jJ%%J%j%j%%%J%%%%J%J%JJjkl%JKj%%%jjJK%%jj%J%
-145FJjjJ%%%%%%%%%j%%J%Jjj%%J%J%jj%%%%J%%%jjJJjjJ%J%J%%jJJ%%%%%jjj%jJ%%%j%J%
-154EJ%%%%jJ%%J%J%%%%j%j%JJ%%jk%%KJ%k%KJj%%jj%%jjJ%JKjj%j%%%JjjKJ%J%jJ%%jjjj
$$ plain form
-162 4 3 3 3 4 4 4 4 5 5 5 4 4 4 4 4 5 5 5 6 5 5 5 5 6 6 5 5 4 4 4 4 4 3 4 4 5 5 6 7 5 4 4 7 9 9 9 9 9 9 7 6 5 5 5 6 6 5 5 5 6 6 5 4 5 6 6 7 6 6 6 6
-171 6 6 7 6 5 6 6 7 7 7 8 8 8 8 8 7 6 6 5 5 4 4 6 7 8 9 8 8 7 7 7 6 6 6 7 7 6 7 7 6 7 8 7 6 6 6 6 6 6 5 5 5 6 6 6 6 6 6 5 5 5 6 7 8 9 9 9 9 9 8 7 7
-179 7 6 6 7 7 7 7 6 7 7 5 4 4 5 7 7 6 5 4 4 5 6 6 5 5 5 4 4 4 4 4 4 4 5 5 5 6 6 6 6 5 5 5 5 4 5 6 6 6 7 6 5 5 6 6 5 6 6 6 7 7 7 7 7 7 7 8 8 8 7 8 8
-188 8 8 7 7 6 6 6 6 7 8 6 5 4 3 3 4 6 6 6 6 6 6 7 6 5 6 7 7 6 6 6 6 6 7 7 7 7 7 7 7 6 5 5 5 5 5 5 6 7 6 6 7 8 8 7 6 6 5 4 5 6 6 6 6 7 7 7 7 7 7 8 8
-196 8 8 8 8 8 7 7 7 8 8 7 6 6 5 5 5 5 5 6 7 8 9 9 8 8 9 10 7 6 5 4 3 3 3 4 5 5 6 6 5 5 5 5 5 5 6 5 5 5 6 7 7 7 6 6 6 6 6 6 7 9 9 8 8 6 5 2 2 3 5 7 7
-205 7 6 4 3 3 5 7 6 6 7 8 7 7 6 6 7 7 7 7 8 8 8 8 7 6 5 4 4 3 2 3 4 4 5 5 5 5 6 7 6 5 5 5 4 4 5 6 6 5 5 5 6 6 7 8 7 6 6 6 5 5 5 4 3 4 5 5 5 4 5 6 6
-213 6 6 6 6 7 7 7 6 6 6 6 6 6 7 7 8 8 6 5 5 6 7 7 7 8 8 7 7 7 8 7 7 6 6 7 10 10 10 11 10 8 9 8 7 7 7 7 7 6 5 5 6 8 10 10 10 10 9 8 7 6 6 6 6 6 6 6 5 4 4 5 5
-222 5 5 5 7 8 9 9 8 7 7 6 5 4 4 5 6 6 6 5 5 5 6 7 7 7 7 7 6 6 4 3 3 3 4 6 6 5 4 5 6 6 6 6 6 6 6 6 8 8 7 7 7 6 6 6 7 8 8 9 9 9 8 6 6 6 6 6 5 6 7 6 6
$$ packed form
-162Dj%%J%%%J%%j%%%%J%%Jj%%%J%j%j%%%%jJ%J%JJkj%LK%%%%%kjj%%J%j%%J%jjJJ%Jj%%%
-171F%JjjJ%J%%J%%%%jj%j%j%KJJJj%j%%j%%J%jJ%jJJjj%%%%%j%%J%%%%%j%%JJJJ%%%%jj%
-179Gj%J%%%jJ%kj%JK%jjj%JJ%j%%j%%%%%%J%%J%%%j%%%jJJ%%Jjj%J%jJ%%J%%%%%%J%%jJ%
-188H%j%j%%%JJkjjj%JK%%%%%JjjJJ%j%%%%J%%%%%%jj%%%%%JJj%JJ%jj%jjJJ%%%J%%%%%J%
-196H%%%%j%%J%jj%j%%%%JJJJ%j%JJljjjj%%JJ%J%j%%%%%Jj%%JJ%%j%%%%%JK%j%kjl%JKK%
-205Gjkj%KKj%JJj%j%J%%%J%%%jjjj%jjJJ%J%%%JJjj%%j%JJ%j%%J%JJjj%%j%%jjJJ%%jJJ%
-213F%%%J%%j%%%%%J%J%kj%JJ%%J%j%%Jj%j%JL%%JjkJjj%%%%jj%JKK%%%jjjj%%%%%%jj%J%
-222E%%KJJ%jj%jjj%JJ%%j%%JJ%%%%j%kj%%JK%jjJJ%%%%%%%K%j%%j%%JJ%J%%jk%%%%jJJj%
$$ plain form
-230 6 6 6 5 6 5 5 7 7 7 8 8 7 7 6 4 4 5 6 6 5 3 3 4 4 3 4 5 6 7 6 4 5 6 7 8 7 5 5 5 5 5 5 6 6 5 6 6 6 7 7 7 7 6 7 8 9 8 7 7 6 6 6 6 5 5 4 4 5 6 6 7
-239 7 8 7 6 5 5 4 4 5 7 7 6 5 5 5 5 5 6 6 7 7 6 5 6 7 7 6 5 6 7 7 5 6 7 7 6 7 7 8 7 7 6 5 4 5 7 8 6 5 5 5 6 6 6 6 6 6 7 8 9 9 9 9 9 9 9 8 7 8 9 8 8
-247 8 8 7 7 7 8 7 7 8 8 7 6 6 7 7 7 8 8 6 5 5 5 5 5 5 5 5 5 5 5 6 6 6 6 6 6 6 6 6 6 5 5 6 7 8 8 8 7 7 6 5 4 4 5 6 6 6 6 7 6 7 7 8 8 8 7 7 8 7 6 5 4
-255 4 3 5 6 6 7 6 5 5 3 3 4 6 6 5 5 5 5 5 5 6 5 4 6 7 8 9 8 7 6 7 7 6 6 6 6 5 5 6 5 4 3 4 5 6 8 8 8 8 9 8 7 6 6 6 7 7 8 8 8 7 7 6 6 6 7 6 5 5 5 5 6
-264 6 6 6 7 6 5 5 5 6 7 8 9 7 5 5 5 5 5 5 5 6 7 6 6 6 5 5 5 5 5 6 6 6 6 6 6 6 6 6 6 7 6 7 7 6 7 7 7 7 7 7 7 7 7 6 6 5 5 4 4 3 3 4 5 6 6 6 4 3 4 4 5
-272 5 5 5 5 5 4 3 4 6 8 8 7 6 5 6 7 9 9 8 7 7 6 6 6 7 6 6 6 7 6 5 5 5 5 7 7 7 6 8 9 10 9 8 7 5 3 2 1 2 4 3 3 3 4 5 5 5 6 6 7 6 5 4 4 4 5 6 7 8 8 8 7
-281 7 7 8 7 6 5 5 6 6 6 6 6 5 4 5 7 8 10 10 8 7 7 7 8 10 11 9 8 7 7 6 4 4 4 5 5 5 5 4 4 4 4 5 6 7 7 8 8 7 6 5 5 5 6 6 6 5 5 4 3 4 5 4 4 4 5 5 6 7 7 8 8
-289 8 7 6 6 5 6 6 6 6 4 5 5 5 5 4 4 5 5 6 5 5 7 6 6 7 6 5 5 5 6 7 7 7 7 9 9 8 7 6 6 6 6 6 7 8 8 6 6 6 6 6 6 5 5 5 5 5 5 6 6 6 5 4 4 6 6 5 5 4 5 5 5
$$ packed form
-230F%%jJj%K%%J%j%jk%JJ%jk%J%jJJJJjkJJJJjk%%%%%J%jJ%%J%%%jJJJjj%j%%%j%j%JJ%J
-239GJjjj%j%JK%jj%%%%J%J%jjJJ%jjJJ%kJJ%jJ%Jj%jjjJKJkj%%J%%%%%JJJ%%%%%%jjJJj%
-247H%j%%Jj%J%jj%J%%J%kj%%%%%%%%%%J%%%%%%%%%j%JJJ%%j%jjj%JJ%%%JjJ%J%%j%Jjjjj
-255DjKJ%Jjj%k%JK%j%%%%%JjjKJJJjjjJ%j%%%j%JjjjJJJK%%%Jjjj%%J%J%%j%j%%Jjj%%%J
-264F%%Jjj%%JJJJkk%%%%%%JJj%%j%%%%J%%%%%%%%%JjJ%jJ%%%%%%%%j%j%j%j%JJJ%%kjJ%J
-272E%%%%jjJKK%jjjJJK%jj%j%%Jj%%Jjj%%%K%%jKJJjjjkkjjJKj%%JJ%%J%Jjjj%%JJJJ%%j
-281G%Jjjj%J%%%%jjJKJK%kj%%JKJkjj%jk%%J%%%j%%%JJJ%J%jjj%%J%%j%jjJJj%%J%JJ%J%
-289Hjj%jJ%%%kJ%%%j%J%Jj%Kj%Jjj%%JJ%%%K%jjj%%%%JJ%k%%%%%j%%%%%J%%jj%K%j%jJ%%
$$ plain form
-298 5 5 5 5 4 6 7 7 7 7 6 5 5 6 6 7 8 6 5 5 5 5 5 6 6 8 9 9 9 9 10 9 8 7 7 6 6 6 5 4 4 5 5 5 5 4 3 3 2 4 5 7 9 9 9 9 8 7 6 6 6 6 6 5 5 5 5 7 8 9 8 7
-306 7 8 8 8 9 10 11 10 9 8 7 6 6 5 4 4 4 4 4 4 4 4 4 5 6 6 6 6 5 4 5 5 5 6 6 6 8 9 8 6 6 6 6 6 7 7 7 6 6 6 6 6 6 6 7 8 8 8 8 7 6 6 6 6 7 6 6 5 4 5 5 5
-315 5 4 6 7 7 7 6 5 5 6 6 5 5 5 5 4 3 2 3 4 5 6 7 8 8 8 8 8 8 8 7 6 6 6 6 5 4 4 5 6 6 6 6 7 6 6 6 6 6 7 6 6 5 5 5 6 5 4 4 4 5 6 6 6 7 7 7 5 4 6 7 6
-323 6 6 5 6 6 6 7 6 5 5 4 5 5 5 5 5 6 7 7 7 7 6 5 5 5 6 7 6 5 4 3 5 5 5 6 6 6 5 6 7 7 7 8 7 7 6 6 5 5 7 7 7 7 7 7 7 7 7 7 7 7 8 8 8 8 7 7 7 8 7 7 7
-332 7 7 7 7 7 8 8 8 8 8 9 9 9 10 9 9 7 6 6 7 7 6 4 5 6 6 5 4 4 4 3 4 5 5 5 6 5 5 4 6 5 5 4 3 4 5 5 6 6 6 4 3 2 3 4 4 5 6 6 6 6 6 4 2 2 3 4 6 7 7 7 6
-340 6 7 7 7 8 7 6 5 5 5 6 8 10 10 9 8 7 7 8 7 7 7 7 7 6 7 7 8 9 8 8 7 6 6 6 5 4 4 4 5 4 3 4 5 6 6 7 7 7 9 9 8 6 6 7 7 7 6 6 6 6 6 7 6 6 6 6 6 7 6 6 5
-349 5 4 5 6 5 5 6 5 5 5 3 3 4 5 5 6 5 4 3 3 4 5 5 5 5 6 5 5 6 7 7 7 5 4 4 4 5 5 5 5 4 4 6 5 6 7 7 8 6 5 5 4 4 4 4 4 4 5 5 5 5 5 4 4 3 3 3 3 3 4 4 5
-357 5 5 6 6 7 6 6 6 5 4 5 5 5 4 4 3 4 4 4 5 8 7 7 7 7 7 5 4 5 6 5 5 5 5 5 5 5 6 6 6 7 7 6 6 5 6 7 7 6 6 5 5 5 4 4 5 6 7 8 8 8 7 7 8 8 8 6 4 3 4 4 4
$$ packed form
-298E%%%jKJ%%%jj%J%JJkj%%%%J%KJ%%%Jjjj%j%%jj%J%%%jj%jKJKK%%%jjj%%%%j%%%KJJjj
-306GJ%%JJJjjjjj%jj%%%%%%%%JJ%%%jjJ%%J%%KJjk%%%%J%%j%%%%%%JJ%%%jj%%%Jj%jjJ%%
-315EjKJ%%jj%J%j%%%jjjJJJJJJ%%%%%%jj%%%jj%JJ%%%Jj%%%%Jj%j%%Jjj%%JJ%%J%%kjKJj
-323F%jJ%%Jjj%jJ%%%%JJ%%%jj%%JJjjjjK%%J%%jJJ%%Jj%j%j%K%%%%%%%%%%%J%%%j%%Jj%%
-332G%%%%J%%%%J%%Jj%kj%J%jkJJ%jj%%jJJ%%Jj%jKj%jjJJ%J%%kjjJJ%JJ%%%%kk%JJKJ%%j
-340FJ%%Jjjj%%JKK%jjj%Jj%%%%jJ%JJj%jj%%jj%%JjjJJJ%J%%K%jk%J%%j%%%%Jj%%%%Jj%j
-349EjJJj%Jj%%k%JJ%Jjjj%JJ%%%Jj%JJ%%kj%%J%%%j%KjJJ%Jkj%j%%%%%J%%%%j%j%%%%J%J
-357E%J%Jj%%jjJ%%j%jJ%%JLj%%%%kjJJj%%%%%%J%%J%j%jJJ%j%j%%j%JJJJ%%j%J%%kkjJ%%
$$ plain form
-366 4 4 4 5 5 5 6 5 4 5 6 6 7 7 7 7 7 7 7 7 8 8 8 7 7 7 7 7 6 6 5 3 3 3 4 5 4 4 4 5 5 5 4 4 4 4 4 4 5 7 6 5 4 4 4 5 5 6 6 5 6 6 6 7 7 7 7 7 7 7 5 4
-374 4 3 3 3 4 4 4 5 6 7 7 7 7 7 6 6 7 6 5 5 5 6 6 7 7 8 8 8 8 8 8 7 7 6 6 5 4 5 6 5 5 5 5 5 6 7 8 7 6 6 7 7 7 7 6 6 6 6 6 5 4 5 5 5 4 5 7 7 8 7 7 7
-382 7 7 6 6 5 5 5 4 4 3 3 2 3 4 4 5 5 6 6 7 6 5 5 5 5 4 4 4 4 5 4 4 4 5 6 6 7 8 8 9 7 7 7 6 6 6 6 6 6 5 6 7 7 8 7 6 6 6 6 6 6 5 5 4 4 4 5 5 5 5 5 5
-391 5 6 6 6 6 6 6 7 7 7 7 6 6 5 5 5 6 7 7 6 5 5 5 5 5 5 5 6 6 6 5 5 4 4 3 4 5 6 7 6 5 6 6 5 6 7 7 7 6 4 4 4 3 2 3 4 3 4 4 4 4 5 5 6 7 6 6 5 4 3 3 3
-399 3 4 4 5 4 4 4 5 5 6 6 7 7 7 7 7 8 9 9 8 7 5 5 6 8 7 5 5 5 5 5 5 7 6 5 5 4 4 5 5 6 6 6 6 6 5 6 7 6 5 5 5 6 7 7 6 6 6 6 6 7 7 6 5 4 4 4 5 5 6 5 6
-408 6 8 7 5 5 6 7 7 7 7 6 7 7 6 5 5 4 5 6 6 5 5 6 7 8 7 5 5 4 4 4 5 4 4 6 7 7 8 8 7 7 6 5 6 6 7 8 8 7 7 6 6 6 6 5 5 5 5 4 4 5 5 5 5 5 6 7 7 7 6 5 5
-416 5 6 6 6 6 5 5 7 6 5 5 6 7 8 8 8 7 6 6 6 4 5 7 7 6 6 6 6 6 6 6 7 8 9 9 9 9 9 8 7 8 8 8 8 7 7 7 7 6 5 5 4 3 4 5 5 6 6 6 5 5 4 5 5 6 6 7 7 7 7 6 6
-425 6 6 5 5 6 6 6 6 5 5 5 4 5 6 6 6 6 6 7 7 7 7 7 7 6 6 5 5 5 6 7 7 7 6 5 5 5 6 7 7 8 7 7 6 6 5 4 5 6 6 7 7 7 6 5 5 6 6 6 7 8 7 7 7 6 7 7 7 7 6 4 4
$$ packed form
-366D%%J%%JjjJJ%J%%%%%%%J%%j%%%%j%jk%%JJj%%J%%j%%%%%JKjjj%%J%J%jJ%%J%%%%%%kj
-374Dj%%J%%JJJ%%%%j%Jjj%%J%J%J%%%%%j%j%jjJJj%%%%JJJjj%J%%%j%%%%jjJ%%jJK%Jj%%
-382G%j%j%%j%j%jJJ%J%J%Jjj%%%j%%%Jj%%JJ%JJ%Jk%%j%%%%%jJJ%Jjj%%%%%j%j%%J%%%%%
-391EJ%%%%%J%%%j%j%%JJ%jj%%%%%%J%%j%j%jJJJJjjJ%jJJ%%jk%%jjJJjJ%%%J%JJj%jjj%%
-399CJ%Jj%%J%J%J%%%%JJ%jjk%JKjk%%%%%Kjj%j%J%J%%%%jJJjj%%JJ%j%%%%J%jjj%%J%JjJ
-408FKjk%JJ%%%jJ%jj%jJJ%j%JJJjk%j%%Jj%KJ%J%j%jjJ%JJ%j%j%%%j%%%j%J%%%%JJ%%jj%
-416EJ%%%j%Kjj%JJJ%%jj%%kJK%j%%%%%%JJJ%%%%jjJ%%%j%%%jj%jjJJ%J%%j%jJ%J%J%%%j%
-425F%j%J%%%j%%jJJ%%%%J%%%%%j%j%%JJ%%jj%%JJ%Jj%j%jjJJ%J%%jj%J%%JJj%%jJ%%%jk%
$$ plain form
-433 4 4 5 5 6 6 7 7 7 7 6 5 5 5 5 5 5 5 6 6 7 8 7 6 5 4 4 3 3 3 4 4 5 7 6 6 6 5 5 6 6 7 7 7 6 5 6 6 6 6 6 6 7 7 7 6 7 8 7 7 6 6 6 5 5 4 5 5 5 5 6 6
-442 6 6 6 6 6 5 4 4 4 4 5 7 8 8 8 8 7 7 6 7 7 6 5 5 6 7 8 7 5 6 6 6 6 5 5 4 4 5 5 6 6 6 6 4 5 6 5 5 6 6 6 6 5 5 4 5 6 6 6 6 7 7 7 7 6 6 7 7 7 7 6 6
-450 6 5 6 6 4 3 4 5 5 5 6 7 7 6 6 5 5 4 4 4 6 5 3 3 3 4 4 5 6 6 6 6 5 5 6 7 7 8 7 6 7 8 7 5 5 5 6 6 6 7 7 7 7 7 6 8 7 7 7 7 7 6 6 5 5 6 6 6 7 8 9 9
-459 9 8 7 6 6 5 5 4 5 6 5 5 5 5 5 5 6 7 8 9 8 8 7 8 8 7 7 6 6 6 5 5 5 5 4 3 4 5 6 6 6 6 7 6 4 4 4 4 5 6 7 7 6 6 5 5 6 7 6 6 5 5 4 4 6 6 6 6 5 4 4 3
-467 3 2 3 3 3 2 3 3 3 4 7 8 7 7 7 6 5 5 6 6 5 4 4 5 6 6 5 5 5 4 3 4 5 6 6 6 5 5 5 6 6 7 6 5 5 5 4 3 3 4 3 3 4 5 5 6 6 6 4 3 2 1 2 3 4 3 2 2 3 5 7 8
-476 8 8 8 8 6 6 5 4 5 7 8 8 7 6 7 6 6 6 6 6 6 6 6 6 6 6 5 6 4 4 5 6 6 5 5 6 6 7 8 7 6 6 7 6 6 5 4 4 5 6 7 7 7 8 9 10 10 9 7 7 6 5 5 6 5 4 2 4 6 6 6 5
-484 5 5 6 7 8 8 7 6 6 8 7 7 6 6 5 4 5 6 6 7 6 7 8 9 9 8 6 4 5 5 5 5 5 5 6 6 7 8 7 7 6 6 6 6 7 7 7 6 6 6 5 4 4 4 5 6 7 7 6 6 5 4 4 4 4 3 3 4 4 4 4 3
-492 3 4 5 5 6 5 5 4 4 5 5 5 6 6 7 6 5 5 5 5 5 6 6 7 9 8 8 7 5 5 4 5 5 5 5 5 5 5 6 6 6 6 5 5 4 5 6 6 6 5 4 4 5 4 4 4 4 4 4 5 6 5 4 3 2 3 4 5 6 6 7 7
$$ packed form
-433D%J%J%J%%%jj%%%%%%J%JJjjjj%j%%J%JKj%%j%J%J%%jjJ%%%%%J%%jJJj%j%%j%jJ%%%J%
-442F%%%%jj%%%JKJ%%%j%jJ%jj%JJJjkJ%%%j%j%J%J%%%kJJj%J%%%j%jJJ%%%J%%%j%J%%%j%
-450FjJ%kjJJ%%JJ%j%j%j%%Kjk%%J%JJ%%%j%JJ%JjjJJjk%%J%%J%%%%jKj%%%%j%j%J%%JJJ%
-459Ijjj%j%jJJj%%%%%JJJJj%jJ%j%j%%j%%%jjJJJ%%%Jjk%%%JJJ%j%j%JJj%j%j%K%%%jj%j
-467CjJ%%jJ%%JLJj%%jj%J%jj%JJ%j%%jjJJJ%%j%%J%Jjj%%jj%Jj%JJ%J%%kjjjJJJjj%JKKJ
-476H%%%k%jjJKJ%jjJj%%%%%%%%%%jJk%JJ%j%J%JJjj%Jj%jj%JJJ%%JJJ%jk%jj%JjjkKK%%j
-484E%JJJ%jj%Kj%j%jjJJ%JjJJJ%jkkJ%%%%%J%JJj%j%%%J%%j%%jj%%JJJ%j%jj%%%j%J%%%j
-492CJJ%Jj%j%J%%J%Jjj%%%%J%JKj%jk%jJ%%%%%%J%%%j%jJJ%%jj%Jj%%%%%JJjjjjJJJJ%J%
$$ plain form
-501 7 7 6 6 5 3 3 4 4 4 4 4 4 5 5 6 6 6 6 6 5 4 5 5 5 5 5 5 6 7 8 8 7 6 5 4 4 4 5 5 7 6 6 5 6 8 7 5 3 2 4 5 7 7 6 5 6 7 7 6 7 7 7 7 7 7 6 5 4 3 3 3
-509 3 3 4 6 6 5 6 6 7 7 8 8 8 6 5 4 5 6 6 6 6 5 4 4 4 4 4 5 6 6 4 3 3 4 4 4 5 4 4 5 6 5 4 5 5 5 4 4 5 5 6 5 4 4 3 4 4 4 5 5 5 4 3 2 1 3 4 4 4 4 5 5
-518 5 6 6 6 7 7 6 6 6 7 6 5 5 6 6 6 6 5 4 2 2 2 2 2 4 5 6 6 6 5 6 6 6 6 6 6 6 5 5 4 4 3 3 4 4 5 5 5 5 4 5 5 5 5 5 5 5 5 4 4 4 4 4 4 4 3 4 4 5 5 5 5
-526 5 4 4 4 3 5 7 7 7 7 7 7 6 5 4 5 6 6 6 6 6 7 7 7 7 6 5 4 3 4 5 6 7 6 5 5 5 5 6 5 5 4 2 3 4 5 6 5 5 6 7 8 8 9 9 8 7 6 5 5 5 6 6 6 5 5 4 5 6 6 6 6
-535 6 7 7 6 6 6 5 3 3 3 4 5 6 6 6 7 6 6 6 6 5 4 4 3 4 5 6 7 6 5 4 5 6 8 7 7 6 7 7 6 6 5 5 6 7 6 4 2 3 3 4 6 7 7 7 7 7 7 6 5 4 4 4 4 4 4 5 6 5 4 4 4
-543 4 6 7 6 5 4 4 2 3 3 4 4 4 5 5 5 4 5 6 5 4 4 5 6 6 7 7 7 6 5 5 5 5 6 7 7 6 5 6 6 6 6 7 6 6 6 6 6 6 6 6 6 6 7 7 6 5 4 5 5 5 6 6 5 5 5 5 5 5 7 7 7
-552 7 7 5 4 4 4 4 4 4 5 5 5 6 6 7 7 6 6 5 4 5 6 7 8 8 7 8 8 8 7 7 7 9 9 8 8 7 6 5 5 5 5 5 5 6 6 5 4 4 4 4 3 3 5 6 6 6 6 7 6 6 6 7 7 7 6 6 6 7 7 7 6
-560 6 6 5 3 3 4 6 6 6 5 4 5 6 5 5 5 5 6 5 5 4 4 3 2 3 4 5 6 7 7 6 4 5 4 3 3 3 4 5 4 2 2 2 3 6 6 7 7 7 6 5 5 6 5 4 4 4 4 4 5 6 6 7 7 6 5 6 7 6 5 5 5
$$ packed form
-501G%j%jk%J%%%%%J%J%%%%jjJ%%%%%JJJ%jjjj%%J%Kj%jJKjkkjKJK%jjJJ%jJ%%%%%jjjj%%
-509C%JK%jJ%J%J%%kjjJJ%%%jj%%%%JJ%kj%J%%Jj%JJjjJ%%j%J%Jjj%jJ%%J%%jjjjKJ%%%J%
-518EJ%%J%j%%Jjj%J%%%jjk%%%%KJJ%%jJ%%%%%%j%j%j%J%J%%%jJ%%%%%%%j%%%%%%jJ%J%%%
-526Ej%%jKK%%%%%jjjJJ%%%%J%%%jjjjJJJJjj%%%Jj%jkJJJJj%JJJ%J%jjjj%%J%%j%jJJ%%%
-535FJ%j%%jk%%JJJ%%Jj%%%jj%jJJJJjjjJJKj%jJ%j%j%JJjkkJ%JKJ%%%%%jjj%%%%%JJjj%%
-543DKJjjj%kJ%J%%J%%jJJjj%JJ%J%%jj%%%JJ%jjJ%%%Jj%%%%%%%%%J%jjjJ%%J%j%%%%%K%%
-552G%kj%%%%%J%%J%J%j%jjJJJJ%jJ%%j%%K%j%jjj%%%%%J%jj%%%j%KJ%%%Jj%%J%%j%%J%%j
-560F%jk%JK%%jjJJj%%%Jj%j%jjJJJJJ%jkJjj%%JJjk%%JL%J%%jj%Jjj%%%%JJ%J%jjJJjj%%
$$ plain form
-569 5 5 5 6 7 6 6 6 5 5 5 4 4 4 4 7 7 5 3 3 4 5 5 6 6 6 6 6 6 6 7 6 5 4 4 4 5 6 7 8 7 5 5 5 5 5 5 5 5 6 5 5 4 5 5 5 6 7 7 7 6 6 5 5 6 6 5 4 3 4 5 5
-577 5 4 4 6 6 5 5 5 5 6 6 6 6 5 5 5 6 6 6 7 8 8 7 7 7 7 6 6 5 5 6 6 6 6 6 7 7 6 5 6 7 7 6 7 7 8 7 6 7 7 7 6 6 5 6 5 5 3 1 1 3 5 7 6 6 5 4 6 7 7 5 5
-586 5 5 6 6 6 6 6 5 4 6 6 7 6 5 4 4 5 6 4 3 3 3 3 3 3 3 4 5 5 6 6 7 6 5 5 5 5 5 5 6 5 4 4 4 5 5 4 4 3 3 4 5 5 6 6 5 5 5 5 5 4 6 7 6 7 7 7 6 6 6 6 7
-594 7 8 9 9 9 9 9 6 4 5 6 6 6 5 4 4 5 4 4 5 6 5 4 3 5 5 6 5 5 5 5 5 4 4 4 3 3 3 4 5 6 6 4 3 3 2 2 3 3 4 5 5 5 6 6 7 7 6 5 4 6 7 7 6 6 6 6 6 6 6 7 6
-602 6 6 5 4 4 3 4 5 6 5 4 4 5 7 5 4 4 5 4 4 4 4 5 4 3 2 3 4 5 4 5 6 5 5 6 6 7 8 7 6 5 6 6 6 7 7 8 8 8 7 7 7 7 7 6 6 5 5 6 6 6 5 5 5 5 5 5 5 6 4 3 3
-611 3 4 6 5 5 6 5 5 5 5 5 5 5 5 5 5 5 6 6 4 4 5 7 6 6 6 6 6 5 5 5 5 5 6 7 7 6 6 6 6 7 6 5 5 4 4 4 5 6 5 5 4 3 3 3 3 3 4 5 5 6 6 6 6 6 4 3 4 6 6 6 6
-619 6 6 5 4 4 4 4 4 4 5 6 5 4 4 6 8 8 7 6 6 7 7 6 6 6 6 5 4 3 2 3 4 4 4 4 4 5 6 6 7 6 6 5 5 5 6 6 5 4 4 4 5 5 5 5 4 3 3 3 4 5 6 8 8 7 6 6 7 6 7 7 7
-628 7 6 6 6 5 5 5 7 9 9 7 6 6 6 5 6 6 6 7 7 6 6 6 6 6 6 6 6 7 7 8 9 9 8 6 6 6 7 8 8 8 7 5 4 4 5 6 6 7 6 4 4 4 3 4 3 5 6 6 6 6 6 6 6 5 6 7 8 8 9 9 9
$$ packed form
-569E%%JJj%%j%%j%%%L%kk%JJ%J%%%%%%Jjjj%%JJJJjk%%%%%%%Jj%jJ%%JJ%%j%j%J%jjjJJ%
-577Ej%K%j%%%J%%%j%%J%%JJ%j%%%j%j%J%%%%J%jjJJ%jJ%JjjJ%%j%jJj%kk%KKKj%jjKJ%k%
-586E%J%%%%jjK%Jjjj%JJkj%%%%%%JJ%J%Jjj%%%%%Jjj%%J%j%j%JJ%J%j%%%%jKJjJ%%j%%%J
-594GJJ%%%%lkJJ%%jj%Jj%JJjjjK%Jj%%%%j%%j%%JJJ%kj%j%J%JJ%%J%J%jjjKJ%j%%%%%%Jj
-602F%jj%jJJJjj%JKkj%Jj%%%JjjjJJJjJJj%J%JJjjjJ%%J%J%%j%%%%j%j%J%%j%%%%%%Jkj%
-611CJKj%Jj%%%%%%%%%%J%k%JKj%%%%j%%%%JJ%j%%%Jjj%j%%JJj%jj%%%%JJ%J%%%%kjJK%%%
-619F%jj%%%%%JJjj%KK%jj%J%j%%%jjjjJJ%%%%JJ%Jj%j%%J%jj%%J%%%jj%%JJJK%jj%JjJ%%
-628Gj%%j%%KK%kj%%jJ%%J%j%%%%%%%J%JJ%jk%%JJ%%jkj%JJ%Jjk%%jJjKJ%%%%%%jJJJ%J%%
$$ plain form
-636 9 9 8 6 5 5 5 5 6 7 7 7 6 6 7 8 9 7 6 6 7 7 6 4 4 6 7 7 6 5 6 6 7 7 8 8 5 4 5 4 4 5 6 7 8 8 7 6 5 3 4 5 5 6 6 5 6 6 6 6 5 4 3 2 4 6 5 4 5 6 6 6
-645 6 7 7 6 6 6 6 6 5 5 5 5 4 4 5 5 5 6 6 5 5 5 5 4 4 5 5 3 3 3 4 4 3 3 4 6 7 6 4 3 4 5 5 5 4 4 3 4 5 5 3 1 1 2 3 5 7 7 6 5 6 8 8 6 4 5 5 6 7 8 8 8
-653 8 7 7 7 7 7 6 4 4 4 4 5 5 5 5 5 6 8 7 7 6 5 5 6 6 4 3 4 4 3 3 3 5 6 6 6 7 7 7 7 7 7 7 7 7 7 6 5 5 5 7 8 9 9 8 7 7 7 7 8 8 8 7 6 6 5 5 5 5 6 6 6
-662 6 5 5 5 5 5 6 5 5 6 6 6 6 6 6 5 4 5 5 5 5 5 5 5 4 5 5 4 4 3 3 3 4 5 6 5 4 5 6 6 6 6 6 6 5 5 5 5 5 5 5 5 4 5 5 6 6 6 6 6 5 5 4 5 6 6 6 6 6 6 7 7
-670 7 8 7 7 7 7 7 7 7 7 6 6 5 4 5 5 5 5 4 3 3 3 3 3 2 2 2 1 3 4 5 6 6 5 5 5 5 5 6 6 7 7 6 5 6 6 7 8 6 6 7 7 6 7 8 7 5 3 2 2 3 4 4 6 6 6 7 7 7 7 5 4
-679 4 4 4 4 4 4 4 4 4 3 3 3 4 4 5 5 4 3 4 5 5 4 3 4 4 4 4 3 2 3 3 4 4 5 6 7 7 7 7 6 6 7 7 5 5 7 6 6 6 5 4 4 5 6 7 5 6 6 5 3 3 4 5 5 5 4 3 4 4 5 6 6
-687 6 5 5 5 6 7 6 6 5 4 4 3 3 4 5 6 6 6 7 8 8 7 6 4 4 4 3 3 2 1 1 1 1 0 1 2 2 3 4 6 6 6 5 4 3 2 1 0 0 -1 1 2 3 4 4 5 5 4 4 4 4 5 5 5 5 5 6 6 7 8 7 7
-696 7 6 6 6 6 5 5 5 5 5 5 6 6 7 7 6 6 7 8 8 7 7 8 8 7 6 6 6 7 7 7 7 7 7 6 5 4 4 5 6 6 7 8 8 8 7 7 7 8 7 7 7 7 6 5 5 6 5 5 5 5 5 6 6 5 5 5 6 7 6 5 5
$$ packed form
-636I%jkj%%%JJ%%j%JJJkj%J%jk%KJ%jjJ%J%J%ljJj%JJJJ%jjjkJJ%J%jJ%%%jjjjKKjjJJ%%
-645FJ%j%%%%j%%%j%J%%J%j%%%j%J%k%%J%j%JKJjkjJJ%%j%jJJ%kk%JJKK%jjJK%kkJ%JJJ%%
-653Hj%%%%jk%%%J%%%%JKj%jj%J%kjJ%j%%KJ%%J%%%%%%%%%jj%%KJJ%jj%%%J%%jj%j%%%J%%
-662Fj%%%%Jj%J%%%%%jjJ%%%%%%jJ%j%j%%JJJjjJJ%%%%%j%%%%%%%jJ%J%%%%j%jJJ%%%%%J%
-670GJj%%%%%%%j%jjJ%%%jj%%%%j%%jKJJJ%j%%%%J%J%jjJ%JJk%J%jJJjkkj%JJ%K%%J%%%kj
-679D%%%%%%%%j%%J%J%jjJJ%jjJ%%%jjJ%J%JJJ%%%j%J%k%Kj%%jj%JJJkJ%jk%JJ%%jjJ%JJ%
-687Fj%%JJj%jj%j%JJJ%%JJ%jjk%%j%jj%%%jJJ%JJK%%jjjjjj%jKJJJ%J%j%%%J%%%%J%JJj%
-696Gj%%%j%%%%%J%J%j%JJ%j%J%jj%%J%%%%%jjj%JJ%JJ%%j%%Jj%%%jj%Jj%%%%J%j%%JJjj%
$$ plain form
-704 5 5 5 5 5 5 6 7 6 6 6 6 5 6 6 6 5 4 4 4 5 5 4 3 4 5 5 5 5 5 5 5 6 7 7 8 7 7 6 5 4 3 3 3 4 5 5 6 6 5 5 6 5 5 5 4 4 4 3 3 2 3 4 6 7 6 4 2 2 1 0 1
-713 1 3 4 6 6 6 7 7 7 7 7 8 8 8 7 8 8 8 9 8 6 6 6 6 7 7 6 6 6 6 7 7 6 5 3 3 3 5 7 8 8 8 7 6 7 6 5 5 5 5 5 5 8 9 10 10 8 5 4 6 6 7 8 8 8 7 5 4 4 5 6 6
-721 6 6 7 7 7 8 7 7 7 5 4 4 4 3 4 6 7 8 7 5 5 4 3 3 5 6 5 5 5 6 5 5 5 5 5 5 5 4 4 4 5 5 6 7 7 6 6 5 4 4 4 5 5 5 5 5 5 4 4 3 4 4 5 4 3 2 2 2 3 4 3 3
-729 3 4 4 5 5 4 4 4 4 5 7 8 7 6 6 6 6 6 6 6 6 7 8 7 6 4 3 3 3 4 5 5 5 5 4 4 4 4 4 5 6 5 4 4 4 3 2 2 1 2 3 3 4 4 5 7 6 6 6 5 3 3 3 3 3 3 3 4 5 5 5 5
-738 5 6 5 4 4 4 4 4 4 4 4 4 5 5 4 4 4 4 4 4 4 4 4 5 5 5 4 4 4 4 5 5 5 6 7 6 4 2 3 4 4 5 5 5 7 8 8 6 4 4 5 6 6 5 5 6 5 5 5 5 5 4 4 4 4 4 4 4 4 4 5 5
-746 5 5 5 5 6 5 4 4 3 3 5 7 7 6 6 5 4 4 4 2 3 3 3 4 5 6 7 6 5 5 4 4 4 4 4 4 4 4 4 4 5 6 7 7 6 6 6 6 6 6 5 5 5 5 5 5 4 3 4 5 6 5 5 5 4 5 5 4 5 7 7 7
-755 7 7 6 5 7 8 8 8 7 6 6 6 7 6 6 6 5 5 6 6 7 7 8 8 7 6 6 6 6 5 6 7 8 8 8 8 8 8 8 7 7 6 6 5 5 6 8 8 7 5 5 5 5 5 4 4 4 4 3 3 2 2 2 3 5 6 6 5 4 5 6 6
-763 6 6 5 5 5 5 5 5 5 5 5 5 5 5 5 5 4 5 5 5 4 5 5 5 5 6 6 6 6 6 7 6 6 5 5 6 7 6 6 6 6 6 6 7 7 6 6 5 4 5 5 5 5 6 7 6 6 5 5 5 6 5 4 5 7 6 5 5 5 5 5 5
$$ packed form
-704E%%%%%JJj%%%jJ%%jj%%J%jjJJ%%%%%%JJ%Jj%jjjj%%JJ%J%j%Jj%%j%%j%jJJKJjkk%jjJ
-713AKJK%%J%%%%J%%jJ%%Jjk%%%J%j%%%J%jjk%%KKJ%%jjJjj%%%%%LJJ%kljK%JJ%%jkj%JJ%
-721F%J%%Jj%%kj%%jJKJJjk%jj%KJj%%Jj%%%%%%j%%J%JJ%j%jj%%J%%%%%j%jJ%Jjjj%%JJj%
-729CJ%J%j%%%JKJjj%%%%%%%JJjjkj%%JJ%%%j%%%%JJjj%%jj%jJJ%J%JKj%%jk%%%%%%JJ%%%
-738EJjj%%%%%%%%J%j%%%%%%%%J%%j%%%J%%JJjkkJJ%J%%KJ%kk%JJ%j%Jj%%%%j%%%%%%%%J%
-746E%%%Jjj%j%KK%j%jj%%kJ%%JJJJjj%j%%%%%%%%%JJJ%j%%%%%j%%%%%jjJJJj%%jJ%jJK%%
-755G%jjKJ%%jj%%Jj%%j%J%J%J%jj%%%jJJJ%%%%%%j%j%j%JK%jk%%%%j%%%j%j%%JKJ%jjJJ%
-763F%j%%%%%%%%%%%%%jJ%%jJ%%%J%%%%Jj%j%JJj%%%%%J%j%jjJ%%%JJj%j%%JjjJKjj%%%%%
$$ plain form
-772 5 5 5 5 4 4 4 3 4 5 5 5 5 4 5 6 6 7 7 8 7 7 7 7 7 7 7 7 7 8 8 9 9 10 9 8 7 7 6 6 5 5 5 5 5 6 5 5 4 3 3 4 6 9 8 8 6 4 5 5 6 6 7 7 7 6 6 5 5 6 5 5
-780 5 6 6 5 4 5 5 5 5 6 8 8 8 7 8 8 7 7 6 5 7 8 7 7 7 6 5 5 4 4 4 5 6 6 6 5 4 3 3 3 3 2 3 4 4 4 5 6 7 7 7 7 6 5 4 3 3 3 4 4 5 5 5 5 6 7 6 5 5 5 6 5
-789 5 5 5 4 5 5 4 3 4 4 4 5 5 6 6 5 4 4 4 4 3 3 4 4 5 5 7 7 7 5 4 4 5 6 5 4 3 5 6 6 7 8 8 7 8 9 8 8 8 7 7 7 6 4 5 6 6 6 7 6 6 6 6 6 6 6 6 7 6 5 4 4
-797 4 3 4 5 4 3 2 3 3 4 6 6 6 6 7 7 6 5 6 7 6 6 5 5 6 6 5 4 4 5 6 7 6 5 4 4 4 4 4 5 6 6 7 8 8 8 7 7 6 5 4 5 6 7 8 9 7 7 6 4 4 4 4 4 3 4 4 4 4 4 4 4
-806 4 4 4 5 4 4 4 4 4 4 4 4 3 3 3 2 2 2 3 3 4 4 4 4 4 4 5 4 3 3 3 3 4 5 4 2 2 2 4 5 6 7 8 7 5 4 2 2 3 3 4 4 4 4 3 3 3 3 3 3 2 1 0 1 2 2 5 7 8 7 5 4
-814 4 3 4 4 5 7 7 6 5 6 7 7 8 7 7 7 6 6 6 5 4 2 2 3 3 3 4 5 6 6 7 7 6 4 5 5 5 5 5 5 4 5 5 5 6 6 6 6 6 5 5 5 5 5 6 7 6 6 5 5 4 5 4 2 3 4 6 5 5 5 6 6
-823 6 6 6 5 5 4 4 4 4 5 5 7 8 9 9 7 7 6 5 5 5 5 5 5 5 5 5 5 5 5 5 5 4 5 6 5 4 3 3 4 3 3 4 5 5 6 6 4 2 3 4 6 7 7 7 6 6 5 6 6 6 6 5 4 5 5 6 6 6 6 6 6
-831 6 7 7 7 7 6 6 5 7 8 7 6 5 4 6 6 5 4 5 5 5 4 4 4 3 3 4 5 5 5 5 5 3 3 2 3 4 4 4 4 3 3 4 5 5 6 6 6 5 5 4 4 4 5 7 8 7 6 6 7 7 7 5 5 4 3 3 3 4 4 5 5
$$ packed form
-772E%%%j%%jJJ%%%jJJ%J%Jj%%%%%%%%J%J%Jjjj%j%j%%%%Jj%jj%JKLj%kkJ%J%J%%j%j%Jj%
-780EJ%jjJ%%%JK%%jJ%j%jjKJj%%jj%j%%JJ%%jjj%%%jJJ%%JJJ%%%jjjj%%J%J%%%JJjj%%Jj
-789E%%jJ%jjJ%%J%J%jj%%%j%J%J%K%%kj%JJjjjKJ%JJ%jJJj%%j%%jkJJ%%Jj%%%%%%%Jjjj%
-797DjJJjjjJ%JK%%%J%jjJJj%j%J%jj%JJJjjj%%%%JJ%JJ%%j%jjjJJJJJk%jk%%%%jJ%%%%%%
-806D%%Jj%%%%%%%j%%j%%J%J%%%%%Jjj%%%JJjk%%KJJJJjkjk%J%J%%%j%%%%%jjjJJ%LKJjkj
-814DjJ%JK%jjJJ%Jj%%j%%jjk%J%%JJJ%J%jkJ%%%%%jJ%%J%%%%j%%%%JJj%j%jJjkJJKj%%J%
-823F%%j%j%%%J%KJJ%k%jj%%%%%%%%%%%%%jJJjjj%Jj%JJ%J%kkJJKJ%%j%jJ%%%jjJ%J%%%%%
-831FJ%%%j%jKJjjjjK%jjJ%%j%%j%JJ%%%%k%jJJ%%%j%JJ%J%%j%j%%JKJjj%J%%k%jj%%J%J%
$$ plain form
-839 5 4 4 4 4 4 6 7 6 6 6 5 5 4 5 5 6 4 4 3 5 5 4 4 4 4 3 4 5 5 4 4 4 4 4 5 6 7 6 5 5 5 4 3 4 4 4 3 3 3 4 4 5 6 5 4 5 5 6 6 6 6 5 5 5 5 5 4 3 2 2 2
-848 2 3 4 5 4 4 5 4 4 5 5 6 6 6 5 4 5 5 5 4 4 3 4 4 4 5 5 6 4 2 3 4 6 7 7 7 6 5 5 5 5 5 6 4 3 4 4 4 3 4 4 4 4 4 4 5 6 7 7 6 6 6 6 6 6 6 6 7 8 7 7 6
-856 6 6 6 6 6 5 6 6 6 6 6 5 5 5 6 6 6 6 6 6 5 5 6 6 6 6 5 4 3 5 7 6 6 5 6 6 6 5 5 5 4 3 4 5 5 5 5 5 5 4 3 2 2 4 6 6 5 6 5 5 6 6 6 6 5 5 6 7 6 5 5 4
-865 4 5 6 7 6 5 5 5 5 5 5 4 4 4 5 5 5 4 4 4 4 4 4 4 3 3 4 5 6 6 5 6 4 3 3 3 3 5 6 6 7 6 5 4 3 3 4 4 3 4 4 5 6 6 5 5 6 6 6 7 7 7 7 6 6 5 5 5 5 6 7 8
-873 8 8 7 6 6 7 7 6 6 6 5 5 5 7 8 7 6 6 7 7 8 8 6 6 6 7 6 6 5 5 6 7 7 7 7 8 8 8 9 8 5 3 2 2 4 5 5 6 5 5 3 2 3 4 5 4 4 4 4 5 5 6 7 7 6 6 6 6 6 6 6 6
-882 6 7 7 6 6 5 5 4 3 4 3 3 3 4 5 5 4 5 5 5 6 6 7 6 5 5 5 5 5 4 4 4 3 4 5 6 5 4 3 3 3 3 4 4 5 5 5 5 6 7 9 8 6 5 4 4 4 5 5 5 6 5 5 5 5 5 5 6 4 4 4 5
-890 5 6 6 7 6 6 5 5 5 6 6 6 6 6 6 6 7 7 7 7 6 6 6 7 7 7 6 4 4 5 6 6 6 5 5 4 4 4 4 4 4 3 3 2 4 5 5 5 5 3 3 4 4 4 4 4 3 2 2 3 3 4 4 4 4 5 4 2 2 1 2 2
-899 2 2 2 3 3 2 3 4 5 5 5 4 3 4 4 5 6 8 7 6 5 5 4 5 5 4 4 4 5 5 5 5 7 7 5 4 3 3 4 4 4 4 4 4 4 3 3 2 2 1 1 1 2 4 6 7 6 6 6 6 6 6 6 4 2 1 3 6 8 7 6 5
$$ packed form
-839Ej%%%%KJj%%j%jJ%Jk%jK%j%%%jJJ%j%%%%JJJjj%%jjJ%%j%%J%JJjjJ%J%%%j%%%%jjj%%
-848BJJJj%Jj%J%J%%jjJ%%j%jJ%%J%JkkJJKJ%%jj%%%%JkjJ%%jJ%%%%%JJJ%j%%%%%%%JJj%j
-856F%%%%jJ%%%%j%%J%%%%%j%J%%%jjjKKj%jJ%%j%%jjJJ%%%%%jjj%KK%jJj%J%%%j%JJjj%j
-865DJJJjj%%%%%j%%J%%j%%%%%%j%JJJ%jJkj%%%KJ%Jjjjj%J%jJ%JJ%j%J%%J%%%j%j%%%JJJ
-873H%jj%J%j%%j%%KJjj%J%J%k%%Jj%j%JJ%%%J%%Jjlkj%KJ%Jj%kjJJJj%%%J%JJ%j%%%%%%%
-882FJ%j%j%jjJj%%JJ%jJ%%J%Jjj%%%%j%%jJJJjjj%%%J%J%%%JJKjkjj%%J%%Jj%%%%%Jk%%J
-890EJ%Jj%j%%J%%%%%%J%%%j%%J%%jk%JJ%%j%j%%%%%j%jKJ%%%k%J%%%%jj%J%J%%%Jjk%jJ%
-899B%%J%jJJJ%%jjJ%JJKjjj%jJ%j%%J%%%K%kjj%J%%%%%%j%j%j%%JKKJj%%%%%%kkjKLKjjj
$$ plain form
-907 5 5 5 5 5 5 5 5 4 4 4 4 4 3 2 2 2 2 3 4 4 5 4 3 3 3 5 6 5 5 3 3 4 5 6 7 5 6 8 8 8 8 7 6 6 6 6 6 6 6 5 5 5 4 5 6 6 6 7 7 8 8 9 9 8 8 7 6 6 6 6 6
-916 6 5 4 3 2 2 2 2 2 3 3 4 4 5 6 5 5 5 5 5 5 4 3 3 3 4 5 6 7 6 5 4 5 5 5 5 5 6 7 6 5 5 6 5 5 5 5 6 6 5 5 4 4 4 5 6 7 6 6 6 6 6 6 6 6 5 5 5 5 5 5 5
-924 5 5 6 6 6 6 5 5 5 6 5 5 4 4 4 4 4 4 4 4 5 7 9 7 8 8 7 7 7 7 7 6 7 7 7 7 6 6 5 5 4 3 3 3 3 3 4 5 5 4 4 4 4 4 4 4 4 4 4 5 4 2 3 3 4 4 4 4 3 3 3 4
-933 4 4 4 4 3 3 3 4 5 5 6 6 6 6 6 6 5 5 5 5 4 4 5 6 7 6 6 5 5 4 3 4 4 3 2 3 4 5 5 5 4 4 3 4 5 5 5 5 6 6 6 6 6 7 8 7 6 6 6 6 6 6 6 4 2 2 2 3 5 4 4 4
-941 4 5 6 6 6 6 5 5 4 4 4 4 4 4 4 4 5 5 6 6 7 7 6 5 4 3 2 1 1 1 2 3 4 5 5 5 5 5 5 5 5 6 7 7 7 6 5 4 5 6 5 4 4 4 4 4 3 2 3 3 4 4 4 3 4 4 5 6 6 6 6 5
-950 5 6 6 5 3 3 4 4 5 5 6 6 6 6 6 5 4 5 5 6 6 6 6 7 7 6 6 6 6 6 5 5 4 4 4 6 7 8 8 7 6 5 5 5 4 4 4 4 4 4 4 5 6 6 7 7 8 7 6 5 3 3 4 4 5 5 6 6 7 6 6 6
-958 6 6 6 6 5 5 5 5 6 6 6 6 6 6 5 5 5 5 5 6 6 7 7 6 6 6 6 7 6 6 5 5 5 5 5 6 6 6 7 7 6 5 5 5 5 5 5 5 4 4 4 3 4 5 5 5 5 5 4 2 3 3 4 4 4 4 4 4 3 1 1 3
-966 3 4 4 3 3 2 1 2 2 3 3 4 3 3 3 3 2 3 3 3 3 5 6 5 3 2 3 4 4 5 6 5 5 4 3 3 4 4 4 4 4 4 4 4 5 5 6 5 4 4 4 5 6 6 6 5 5 6 7 6 6 5 4 6 7 7 6 5 4 4 4 3
$$ packed form
-907E%%%%%%%j%%%%jj%%%JJ%Jjj%%KJj%k%JJJJkJK%%%jj%%%%%%j%%jJJ%%J%J%J%j%jj%%%%
-916Fjjjj%%%%J%J%JJj%%%%%jj%%JJJJjjjJ%%%%JJjj%Jj%%%J%j%j%%JJJj%%%%%%%j%%%%%%
-924E%J%%%j%%Jj%j%%%%%%%JKKkJ%j%%%%jJ%%%j%j%jj%%%%JJ%j%%%%%%%%%JjkJ%J%%%j%%J
-933D%%%j%%JJ%J%%%%%j%%%j%JJJj%j%jjJ%jjJJJ%%j%jJJ%%%J%%%%JJjj%%%%%%kk%%JKj%%
-941DJJ%%%j%j%%%%%%%J%J%J%jjjjjj%%JJJJ%%%%%%%JJ%%jjjJJjj%%%%jjJ%J%%jJ%JJ%%%j
-950EJ%jk%J%J%J%%%%jjJ%J%%%J%j%%%%j%j%%KJJ%jjj%%j%%%%%%JJ%J%Jjjjk%J%J%J%Jj%%
-958F%%%j%%%J%%%%%j%%%%J%J%j%%%Jj%j%%%%J%%J%jj%%%%%%j%%jJJ%%%%jkJ%J%%%%%jk%K
-966CJ%j%jjJ%J%Jj%%%jJ%%%KJjkjJJ%JJj%jj%J%%%%%%%J%Jjj%%JJ%%j%JJj%jjKJ%jjj%%j
$$ plain form
-975 3 4 5 4 4 4 4 4 4 4 5 5 4 4 4 4 2 2 5 6 6 6 6 5 5 5 4 4 5 5 4 3 3 3 3 3 3 4 5 4 3 3 4 4 4 5 6 6 6 6 6 5 4 3 3 2 2 4 5 5 5 5 5 5 6 7 7 5 5 5 5 5
-983 5 5 6 6 6 5 5 5 6 5 5 5 4 4 5 5 5 6 7 6 5 4 4 3 4 5 5 5 5 3 2 2 3 3 3 4 4 5 3 3 3 5 7 6 5 4 4 4 4 4 4 5 5 5 5 5 5 4 4 4 4 3 3 3 3 3 4 4 5 5 5 5
-992 5 6 5 4 3 2 2 2 2 1 2 3 4 4 3 3 3 2 1 2 3 5 5 4 4 4 4 4 3 2 2 2 4 6 6 5 6 6 6 4 4 5 5 4 4 4 5 6 6 6 6 6 7 8 7 7 7 6 6 5 5 5 5 5 6 6 6 5 4 4 4 5
-1000 5 5 5 6 6 6 5 4 4 4 4 4 3 3 2 1 3 4 5 5 5 5 5 6 6 6 6 5 4 5 6 6 5 5 5 5 5 6 6 6 7 6 6 6 6 6 6 6 5 5 6 6 7 7 6 6 6 6 5 6 4 3 3 4 5 6 4 2 1 2 3
-1009 3 4 5 5 4 4 4 4 4 4 4 4 5 5 5 4 4 4 3 4 4 5 6 7 7 6 4 4 4 4 5 5 6 5 3 4 5 5 4 2 3 4 5 6 7 7 7 7 5 5 6 5 5 5 5 6 5 4 3 3 4 3 2 2 2 3 4 4 5 5 5
-1017 5 5 5 5 5 5 5 5 5 4 4 4 6 6 7 7 8 8 8 7 7 6 5 6 7 7 6 4 2 3 4 3 2 3 4 3 1 2 2 3 4 4 4 4 5 5 6 5 5 3 1 1 1 1 2 2 2 2 2 3 4 5 5 5 4 4 3 3 3 3 2
-1025 2 2 3 3 3 3 4 4 4 4 4 3 3 3 3 3 2 1 2 2 2 3 4 4 4 5 6 8 8 8 8 5 3 3 2 2 2 2 3 3 1 0 2 2 5 6 6 5 4 4 4 5 4 4 3 4 4 3 2 2 3 4 3 1 1 2 3 4 5 4 4
-1034 4 3 3 3 3 2 3 4 4 5 5 5 5 5 6 6 6 6 6 6 5 4 4 5 5 5 5 6 7 6 5 5 4 5 6 7 8 7 7 5 5 5 6 7 7 4 3 3 2 3 4 4 4 4 3 4 4 4 5 4 3 4 4 4 5 5 5 6 6 5 4
$$ packed form
-975CJJj%%%%%%J%j%%%k%LJ%%%j%%j%J%jj%%%%%JJjj%J%%JJ%%%%jjj%j%KJ%%%%%JJ%k%%%%
-983E%J%%j%%Jj%%j%J%%JJjjj%jJJ%%%kj%J%%J%Jk%%KKjjj%%%%%J%%%%%j%%%j%%%%J%J%%%
-992EJjjjj%%%jJJJ%j%%jjJJK%j%%%%jj%%KK%jJ%%k%J%j%%JJ%%%%JJj%%j%j%%%%J%%jj%%J
-1000E%%J%%jj%%%%j%jjKJJ%%%%J%%%jjJJ%j%%%%J%%Jj%%%%%%j%J%J%j%%%jJkj%JJJkkjJJ
-1009CJJ%j%%%%%%%J%%j%%jJ%JJJ%jk%%%J%JjkJJ%jkJJJJJ%%%k%Jj%%%Jjjj%Jjj%%JJ%J%%
-1017E%%%%%%%%j%%K%J%J%%j%jjJJ%jkkJJjjJJjkJ%JJ%%%J%Jj%kk%%%J%%%%JJJ%%j%j%%%j
-1025B%J%%%J%%%%j%%%%jjJ%%JJ%%JJK%%%lk%j%%%J%kjK%LJ%jj%%Jj%jJ%jj%JJjk%JJJJj%
-1034Dj%%%jJJ%J%%%%J%%%%%jj%J%%%JJjj%jJJJJj%k%%JJ%lj%jJJ%%%jJ%%JjjJ%%J%%J%jj
$$ plain form
-1042 4 3 2 3 4 4 3 3 3 3 3 3 4 4 3 3 2 2 3 2 2 3 4 4 4 4 3 2 1 2 3 3 2 3 4 5 5 6 6 4 2 2 2 3 4 4 4 5 5 5 6 6 6 6 6 6 6 5 5 6 6 6 6 6 6 6 6 6 6 5 4
-1050 4 5 5 6 7 7 7 6 6 5 4 4 3 3 3 4 4 5 6 5 4 5 5 6 6 7 7 7 6 6 6 5 4 4 3 4 4 4 4 3 4 4 4 5 4 4 4 5 5 7 7 7 6 8 9 9 9 7 6 4 3 4 4 4 4 4 5 4 5 6 7
-1059 7 7 6 6 7 7 7 7 7 7 8 6 5 6 6 6 5 5 6 6 5 5 6 6 5 4 3 4 4 5 5 5 5 5 6 5 4 3 2 3 3 3 3 2 1 1 3 4 4 4 4 5 5 4 3 3 3 4 4 3 2 3 4 4 4 5 6 7 6 5 4
-1067 4 3 3 2 2 1 2 2 3 4 3 2 3 4 3 2 3 3 4 4 4 5 6 6 5 5 5 4 5 5 6 5 6 6 7 7 5 4 3 4 4 4 3 3 3 3 2 2 4 5 5 5 5 5 5 5 5 5 5 5 5 5 5 5 6 6 6 4 5 5 5
-1075 5 5 5 4 4 6 5 5 4 5 7 6 6 5 4 3 4 5 5 4 3 2 2 3 4 4 4 4 3 3 5 6 6 5 5 5 4 4 3 3 4 6 7 6 6 5 5 5 4 6 7 8 7 6 6 6 7 6 6 6 6 6 7 6 6 6 7 7 8 8 6
-1084 6 5 5 6 6 6 6 4 4 4 5 6 7 7 8 8 9 8 7 5 4 4 4 5 5 5 5 5 5 6 7 7 5 4 4 5 6 4 3 3 4 4 4 5 5 5 5 4 3 4 5 5 5 5 5 6 7 6 6 6 6 6 6 6 5 5 5 6 6 6 6
-1092 6 6 5 4 4 4 4 4 5 5 4 4 4 3 3 3 4 4 4 6 7 6 5 5 5 6 8 7 7 6 6 5 3 3 2 4 6 6 6 6 6 5 4 5 6 6 6 5 4 4 4 5 5 5 5 4 3 4 4 4 4 4 4 3 2 4 5 5 6 5 5
-1100 5 5 6 7 7 6 5 4 4 4 4 4 4 4 4 4 4 4 4 4 3 3 2 3 4 4 5 5 5 6 6 5 4 5 5 4 3 4 5 6 5 5 4 5 5 5 5 5 6 5 5 4 6 6 7 7 6 4 3 3 4 4 4 5 5 7 6 7 7 6 5
$$ packed form
-1042DjjJJ%j%%%%%J%j%j%Jj%JJ%%%jjjJJ%jJJJ%J%kk%%JJ%%J%%J%%%%%%j%J%%%%%%%%%jj
-1050DJ%JJ%%j%jj%j%%J%JJjjJ%J%J%%j%%jj%jJ%%%jJ%%Jj%%J%K%%jKJ%%kjkjJ%%%%JjJJJ
-1059G%j%J%%%%%JkjJ%%j%J%j%J%jjjJ%J%%%%JjjjjJ%%%jj%KJ%%%J%jj%%J%jjJJ%%JJJjjj
-1067Dj%j%jJ%JJjjJJjjJ%J%%JJ%j%%jJ%JjJ%J%kjjJ%%j%%%j%KJ%%%%%%%%%%%%%%J%%kJ%%
-1075E%%j%Kj%jJKj%jjjJJ%jjj%JJ%%%j%KJ%j%%j%j%JKJj%j%%jKJJjj%%Jj%%%%Jj%%J%J%k
-1084Fj%J%%%k%%JJJ%J%Jjjkj%%J%%%%%JJ%kj%JJkj%J%%J%%%jjJJ%%%%JJj%%%%%%j%%J%%%
-1092F%jj%%%%J%j%%j%%J%%KJjj%%JKj%j%jk%jKK%%%%jjJJ%%jj%%J%%%jjJ%%%%%jjKJ%Jj%
-1100E%JJ%jjj%%%%%%%%%%%%j%jJJ%J%%J%jjJ%jjJJJj%jJ%%%%Jj%jK%J%jkj%J%%J%KjJ%jj
$$ plain form
-1109 5 5 5 5 5 4 4 4 5 6 6 7 7 6 6 5 5 5 4 5 6 4 3 3 3 4 3 2 1 2 3 4 4 4 4 4 2 1 2 3 3 3 2 3 4 3 3 4 6 7 7 6 6 5 5 4 5 6 9 9 7 6 5 5 5 4 4 5 5 5 5
-1117 5 5 5 5 6 7 7 7 7 7 6 6 6 5 5 6 6 5 3 4 4 5 6 6 7 6 6 5 4 5 5 5 5 5 4 3 1 1 1 1 1 3 4 4 4 3 2 2 2 2 2 3 4 4 4 5 5 5 5 5 6 5 5 5 5 6 6 6 5 6 7
-1125 7 6 6 6 5 4 5 5 5 5 4 3 2 3 3 4 5 5 5 4 5 6 5 5 4 5 5 4 4 4 4 4 4 4 4 3 2 3 3 4 5 5 5 4 4 4 4 3 3 4 4 4 3 4 4 5 5 5 5 4 4 5 5 6 6 6 5 5 5 4 4
-1134 4 5 6 5 5 4 4 4 5 5 6 6 4 3 3 3 4 5 5 6 6 6 6 6 6 5 5 4 4 4 4 5 4 4 4 5 6 7 6 6 6 6 7 6 5 4 4 4 4 4 4 5 5 6 5 4 4 4 4 5 5 5 4 3 3 4 5 4 4 4 4
-1142 4 4 5 5 5 5 5 4 3 2 2 3 3 4 3 3 3 3 4 4 3 3 3 2 3 4 4 3 2 2 2 2 2 3 4 5 5 4 5 6 5 6 6 6 6 5 4 3 2 2 2 4 5 6 7 7 7 6 6 5 5 6 7 6 6 6 6 5 5 5 5
-1151 5 5 6 6 5 5 5 5 5 6 6 7 7 7 8 7 6 5 5 4 5 5 5 5 6 5 5 6 7 7 7 6 6 5 5 4 3 3 3 4 6 5 4 4 4 4 4 4 4 5 5 5 5 6 7 7 7 7 5 5 4 4 4 5 5 5 5 5 4 3 4
-1159 4 5 5 5 4 6 7 8 9 7 5 3 4 4 4 5 5 5 6 7 7 5 4 4 4 5 6 6 5 5 4 3 2 3 4 5 6 5 4 5 6 5 5 4 4 4 4 5 5 4 4 3 3 2 2 3 4 4 4 4 4 4 4 5 5 4 2 1 1 3 5
-1167 5 6 7 6 6 5 5 4 5 5 4 3 4 5 4 3 3 2 2 3 3 3 2 2 3 3 3 4 5 5 5 4 3 4 4 4 4 4 3 4 4 4 4 5 6 6 6 5 5 4 4 5 6 6 4 3 3 3 3 3 4 4 4 4 5 4 4 4 3 5 6
$$ packed form
-1109E%%%%j%%JJ%J%j%j%%jJJkj%%JjjjJJJ%%%%kjJJ%%jJJj%JKJ%j%j%jJJL%kjj%%j%J%%%
-1117E%%%JJ%%%%j%%j%J%jkJ%JJ%Jj%jjJ%%%%jjk%%%%KJ%%jj%%%%JJ%%J%%%%Jj%%%J%%jJJ
-1125Gj%%jjJ%%%jjjJ%JJ%%jJJj%jJ%j%%%%%%%jjJ%JJ%%j%%%j%J%%jJ%J%%%j%J%J%%j%%j%
-1134DJJj%j%%J%J%kj%%JJ%J%%%%%j%j%%%Jj%%JJJj%%%Jjjj%%%%%J%Jjj%%%J%%jj%JJj%%%
-1142D%J%%%%jjj%J%Jj%%%J%j%%jJJ%jj%%%%JJJ%jJJjJ%%%jjjj%%KJJJ%%j%j%JJj%%%j%%%
-1151E%J%j%%%%J%J%%Jjjj%jJ%%%Jj%JJ%%j%j%jj%%JKjj%%%%%%J%%%JJ%%%k%j%%J%%%%jjJ
-1159DJ%%jKJJJkkkJ%%J%%JJ%kj%%JJ%j%jjjJJJJjjJJj%j%%%J%j%j%j%JJ%%%%%%J%jkj%KK
-1167EJJj%j%jJ%jjJJjj%j%J%%j%J%%JJ%%jjJ%%%%jJ%%%JJ%%j%j%JJ%kj%%%%J%%%Jj%%jKJ
$$ [...]
-1436B
##END=		$$ NMR SPECTRUM
##END=		$$ LINK
