##TITLE=	RP318 washed full.10.fid
##JCAMP-DX=	6.0	$$ MestReNova 14.3.3-33362
##DATA TYPE=	LINK
##BLOCKS=	1    
##ORIGIN=	Mestrelab Research S.L.
##OWNER=	hrzepa
##$MNOVA/METADATA=	(DOCUMENT,BASE64)
eyJuYW1lIjoiL1VzZXJzL2hyemVwYS9MaWJyYXJ5L01vYmlsZSBEb2N1bWVudHMvY29tfmFwcGxlfkN
sb3VkRG9jcy9TaGVwcGFyZC9OTVIgZmlsZXMgemlwcy0yLzE1LzE1LUgubW5vdmEiLCJwYWdlcyI6W3
siaXRlbXMiOlsiMSIgICAgIF19XX0=
##TITLE=	RP318 washed full.10.fid
##JCAMP-DX=	6.0	$$ MestReNova 14.3.3-33362
##DATA TYPE=	NMR SPECTRUM
##DATA CLASS=	XYDATA
##BLOCK_ID=	1
##ORIGIN=	Bruker BioSpin GmbH
##OWNER=	nmrsu
##NUMDIM=	1
##$MNOVA/METADATA=	(ITEM,BASE64)
eyJhbmdsZSI6MCwiYXhlcyI6eyJ4Ijp7Im1heCI6MTYuMDY0MjU5OTk5OTM5MTI1LCJtaW4iOi0zLjc
2Njk0MjMzOTE1NjYyMjZ9LCJ5Ijp7Im1heCI6Mjc5MTEuMDE5Nzc1MzkwNjI1LCJtaW4iOi0yNDUwLj
k1NDUyMTE3OTE5OX19LCJwb2ludHMiOlt7IngiOjUzMjEsInkiOjU4MzV9LHsieCI6ODcyMiwieSI6N
TgzNX0seyJ4Ijo4NzIyLCJ5Ijo4MjA4fSx7IngiOjUzMjEsInkiOjgyMDh9LHsieCI6NTMyMSwieSI6
NTgzNX1dLCJ6IjowfQ==
##.OBSERVE FREQUENCY=	700.35432466099996418
##.OBSERVE NUCLEUS=	^1H
##.SOLVENT NAME=	CDCl3
##.PULSE SEQUENCE=	zg30
##LONGDATE=	2023/08/09 14:09:47.000
##.ACQUISITIONMODE=	SIMULTANEOUS (DQD)
##$ORIGINAL FORMAT=	Bruker XWIN-NMR
##$MNOVA/SCALES_VERSION=	9
##$PARAMETER FILE=	(acqus, ASCII, /private/var/folders/f6/rjf_tdyn2v98c5c0wvkgn4s80000gq/T/O3kRyR6pT$GQ0I7PlYQKwQ/10/acqus, 0)
$$ ##TITLE= Parameter file, TopSpin 4.1.3
$$ ##JCAMPDX= 5.0
$$ ##DATATYPE= Parameter Values
$$ ##NPOINTS= 1	$$ modification sequence number
$$ ##ORIGIN= Bruker BioSpin GmbH
$$ ##OWNER= nmrsu
$$ $$ 2023-08-09 14:10:22.088 +0100  nmrsu@CZC7167VR1
$$ $$ Z:/700/data/tds/nmr/RP318 washed full/10/acqus
$$ $$ process C:\Bruker\TopSpin4.1.3\prog\mod\dirdata.exe
$$ ##$ACQT0= -2.0981556054023
$$ ##$AMP= (0..31)
$$ 100 100 100 100 100 100 100 100 100 100 100 100 100 100 100 100 100 100
$$ 100 100 100 100 100 100 100 100 100 100 100 100 100 100
$$ ##$AMPCOIL= (0..32)
$$ -1 0 0 0 0 0 0 0 0 0 0 0 0 0 0 0 0 0 0 0 0 0 0 0 0 0 0 0 0 0 0 0 0
$$ ##$AQSEQ= 0
$$ ##$AQ_mod= 3
$$ ##$AUNM= <au_zg>
$$ ##$AUTOPOS= <13 >
$$ ##$BF1= 700.349999998
$$ ##$BF2= 700.349999998
$$ ##$BF3= 700.349999998
$$ ##$BF4= 700.349999998
$$ ##$BF5= 700.349999998
$$ ##$BF6= 700.349999998
$$ ##$BF7= 700.349999998
$$ ##$BF8= 700.349999998
$$ ##$BWFAC= (0..63)
$$ 0 0 0 0 0 0 0 0 0 0 0 0 0 0 0 0 0 0 0 0 0 0 0 0 0 0 0 0 0 0 0 0 0 0 0 0
$$ 0 0 0 0 0 0 0 0 0 0 0 0 0 0 0 0 0 0 0 0 0 0 0 0 0 0 0 0
$$ ##$BYTORDA= 0
$$ ##$CHANFCU= (0..24)
$$ 0 1 0 0 0 0 0 0 0 0 0 0 0 0 0 0 0 0 0 0 0 0 0 0 0
$$ ##$CHANREC= (0..24)
$$ 0 0 0 0 0 0 0 0 0 0 0 0 0 0 0 0 0 0 0 0 0 0 0 0 0
$$ ##$CHEMSTR= <none>
$$ ##$CNST= (0..63)
$$ 1 1 1 1 1 1 1 1 1 1 1 1 1 1 1 1 1 1 1 1 1 1 1 1 1 1 1 1 1 1 1 1 1 1 1 1
$$ 1 1 1 1 1 1 1 1 1 1 1 1 1 1 1 1 1 1 1 1 1 1 1 1 1 1 1 1
$$ ##$CPDPRG= (0..8)
$$ <> <> <> <> <> <> <> <> <>
$$ ##$D= (0..63)
$$ 0 36 0 0 0 0 0 0 0 0 0 0 0 0 0 0 0.0002 0 0 0 0 0 0 0 0 0 0 0 0 0 0 0 0
$$ 0 0 0 0 0 0 0 0 0 0 0 0 0 0 0 0 0 0 0 0 0 0 0 0 0 0 0 0 0 0 0
$$ ##$DATE= 1691586587
$$ [...]
$$ ##$ShimPowRng3= (0..63)
$$ 1 1 1 1 1 1 1 1 1 1 1 1 1 1 1 1 1 1 1 1 1 1 1 1 1 1 1 1 1 1 1 1 1 1 1 1
$$ 1 1 1 1 0 0 0 0 0 0 0 0 0 0 0 0 0 0 0 0 0 0 0 0 0 0 0 0
$$ ##$ShimPowType1= 8
$$ ##$ShimPowType2= 8
$$ ##$ShimPowType3= 0
$$ ##$ShimPowType4= 0
$$ ##$ShimPowType5= 0
$$ ##$ShimPowType6= 0
$$ ##$ShimPowType7= 0
$$ ##$ShimPowType8= 0
$$ ##$ShimSysActGrad= (0..63)
$$ 1 2 3 4 13 5 7 11 10 9 6 8 12 18 19 20 21 15 22 23 24 14 25 16 26 17 27
$$ 28 31 32 33 34 35 36 37 38 0 0 0 0 0 0 0 0 0 0 0 0 0 0 0 0 0 0 0 0 0 0
$$ 0 0 0 0 0 0
$$ ##$ShimSysAngle= <>
$$ ##$ShimSysFunc= (0..63)
$$ 1 2 3 4 5 6 7 8 9 10 0 37 38 35 16 15 14 13 12 11 28 27 26 25 24 23 36
$$ 22 30 29 20 21 34 33 32 31 17 18 19 0 0 0 0 0 0 0 0 0 0 0 0 0 0 0 0 0 0
$$ 0 0 0 0 0 0 0
$$ ##$ShimSysMatId= <292722da.dat>
$$ ##$ShimSysMatrix= 1
$$ ##$ShimSysMinMaxUG= 130000
$$ ##$ShimSysOffset= <29 mm>
$$ ##$ShimSysType= 4
$$ ##$ShimUnit= 3
$$ ##$SpectrOsVersion= <4.1.156.20210628>
$$ ##$TCubeEth= <192.168.180.38>
$$ ##$TCubeSeqDevice= <>
$$ ##$TOSITY= <no>
$$ ##$TRIPLO2= 0
$$ ##$TopSpinVersion= <TopSpin 4.1.3>
$$ ##$TrxFreqFormula= (0..23)
$$ <TrxFreqFormula(2.0,700350000.000000,'TRX',Trx(1.0,'TRX 1200.1',1,5.000000,1290.000000))>
$$ <TrxFreqFormula(2.0,700350000.000000,'TRX',Trx(1.0,'TRX 1200.2',1,5.000000,1290.000000))>
$$ <TrxFreqFormula(2.0,700350000.000000,'TRX',Trx(1.0,'TRX 1200.3',1,5.000000,1290.000000))>
$$ <> <> <> <> <> <> <> <> <> <> <> <> <> <> <> <> <> <> <> <> <>
$$ ##$TrxPN= (0..23)
$$ <Z148391> <Z148391> <Z148391> <> <> <> <> <> <> <> <> <> <> <> <> <> <>
$$ <> <> <> <> <> <> <>
$$ ##$TrxSN= (0..23)
$$ <00336> <00337> <00342> <> <> <> <> <> <> <> <> <> <> <> <> <> <> <> <>
$$ <> <> <> <> <>
$$ ##$VCubeEth= (0..23)
$$ <no> <no> <no> <no> <no> <no> <no> <no> <no> <no> <no> <no> <no> <no> <no>
$$ <no> <no> <no> <no> <no> <no> <no> <no> <no>
$$ ##$VTU= 2
$$ ##$VTUETH= <192.168.99.11>
$$ ##$VTUTY= <no>
$$ ##$ValueLine= no
$$ ##$VpuPN= (0..23)
$$ <no> <no> <no> <no> <no> <no> <no> <no> <no> <no> <no> <no> <no> <no> <no>
$$ <no> <no> <no> <no> <no> <no> <no> <no> <no>
$$ ##$VpuSN= (0..23)
$$ <no> <no> <no> <no> <no> <no> <no> <no> <no> <no> <no> <no> <no> <no> <no>
$$ <no> <no> <no> <no> <no> <no> <no> <no> <no>
$$ ##$WBREFAM= (0..31)
$$ 99.8 100 100 100 100 100 100 100 100 100 100 100 100 100 100 100 100 100
$$ 100 100 100 100 100 100 100 100 100 100 100 100 100 100
$$ ##$WBREFLM= (0..31)
$$ 1 0 1 0 0 0 0 0 0 0 0 0 0 0 0 0 0 0 0 0 0 0 0 0 0 0 0 0 0 0 0 0
$$ ##$WBREFPH= (0..31)
$$ 0.05 0 0 0 0 0 0 0 0 0 0 0 0 0 0 0 0 0 0 0 0 0 0 0 0 0 0 0 0 0 0 0
$$ ##$WBSGU= (0..31)
$$ 1 2 4 0 0 0 0 0 0 0 0 0 0 0 0 0 0 0 0 0 0 0 0 0 0 0 0 0 0 0 0 0
$$ ##END=
$$ 
##$DECIM=	1440
##$DSPFVS=	21
##XUNITS=	HZ
##YUNITS=	ARBITRARY UNITS
##FIRSTX=	11250.604788156719223
##LASTX=	-2638.1781369192458442
##DELTAX=	-0.10596381293402784562
##XFACTOR=	1
##YFACTOR=	0.77436610909985659212
##FIRSTY=	187.043914794921875
##MINY=	86.41425323486328125
##MAXY=	25373.654296875
##NPOINTS=	131072
##XYDATA=	(X++(Y..Y))
$$ [...]
7277C90%%%%%%%%%%%%%%%%%%%%%%%%%%%%%%%%%%%%%%%%%%%%%%%%%%%%%%%%%%%%%%%%%%%%%
$$ 390 390 390 390 390 390 390 390 390 390 390 390 390 390 390 390 390 390 390 390 390 390 390 390 390 390 390 390 390 390 390 390 390 390 390 390 390 390 390 390 390 390 390 390 390 390 390 390 390 390 390 390 390 390 390 390 390 390 390 390 390 390 390 390 390 390 390 390 390 390
7270C90%%%%%%%%%%%%%%%%%%%%%%%%%%%%%%%%%%%%%%%%%%%%%%%%%%%%%%%%%%%%%%%%%%%%%
$$ 390 390 390 390 390 390 390 390 390 390 390 390 390 390 390 390 390 390 390 390 390 390 390 390 390 390 390 390 390 390 390 390 390 390 390 390 390 390 390 390 390 390 390 390 390 390 390 390 390 390 390 390 390 390 390 390 390 390 390 390 390 390 390 390 390 390 390 390 390 390
7262C90%%%%%%%%%%%%%%%%%%%%%%%%%%%%%%%%%%%%%%%%%%%%%%%%%%%%%%%%%%%%%%%%%%%%%
$$ 390 390 390 390 390 390 390 390 390 390 390 390 390 390 390 390 390 390 390 390 390 390 390 390 390 390 390 390 390 390 390 390 390 390 390 390 390 390 390 390 390 390 390 390 390 390 390 390 390 390 390 390 390 390 390 390 390 390 390 390 390 390 390 390 390 390 390 390 390 390
7255C90%%%%%%%%%%%%%%%%%%%%%%%%%%%%%%%%%%%%%%%%%%%%%%%%%j%%%%%%%%%%%%%%%%%%%
$$ 390 390 390 390 390 390 390 390 390 390 390 390 390 390 390 390 390 390 390 390 390 390 390 390 390 390 390 390 390 390 390 390 390 390 390 390 390 390 390 390 390 390 390 390 390 390 390 390 390 390 389 389 389 389 389 389 389 389 389 389 389 389 389 389 389 389 389 389 389 389
7248C89%%%%%%%%%%%%%%%%%%%%%%%%%%%%%%%%%%%%%%%%%%%%%%%%%%%%%%%%%%%%%%%%%%%%%
$$ 389 389 389 389 389 389 389 389 389 389 389 389 389 389 389 389 389 389 389 389 389 389 389 389 389 389 389 389 389 389 389 389 389 389 389 389 389 389 389 389 389 389 389 389 389 389 389 389 389 389 389 389 389 389 389 389 389 389 389 389 389 389 389 389 389 389 389 389 389 389
7240C89%%%%%%%%%%%%%%%%%%%%%%%j%%%%%%%%%%%%%%%%%%%%%%%%J%%%%%%%%%%%%%%%%%%%%
$$ 389 389 389 389 389 389 389 389 389 389 389 389 389 389 389 389 389 389 389 389 389 389 389 389 388 388 388 388 388 388 388 388 388 388 388 388 388 388 388 388 388 388 388 388 388 388 388 388 388 389 389 389 389 389 389 389 389 389 389 389 389 389 389 389 389 389 389 389 389 389
7233C89%%%%%%%%%%%%%%%%%%%%%%%%%%%%%%%%%J%%%%%%%%%%%%%%%%%%%%%%%%%%%%%%%%%%%
$$ 389 389 389 389 389 389 389 389 389 389 389 389 389 389 389 389 389 389 389 389 389 389 389 389 389 389 389 389 389 389 389 389 389 389 390 390 390 390 390 390 390 390 390 390 390 390 390 390 390 390 390 390 390 390 390 390 390 390 390 390 390 390 390 390 390 390 390 390 390 390
7226C90%%%%%%%%%%%%%%%%%%%%%%%J%%%%%%%%%%%%%%%%%%%%%%%%%%%%%%%%%%%%%%%%%%%%%
$$ 390 390 390 390 390 390 390 390 390 390 390 390 390 390 390 390 390 390 390 390 390 390 390 390 391 391 391 391 391 391 391 391 391 391 391 391 391 391 391 391 391 391 391 391 391 391 391 391 391 391 391 391 391 391 391 391 391 391 391 391 391 391 391 391 391 391 391 391 391 391
7218C91%%%%%%%%%%j%%%%%%J%%%%%%%%%%%%%%%%%j%%%%%%%%%J%%%%%%%%%%%%%%%%%%%%%%%
$$ 391 391 391 391 391 391 391 391 391 391 391 390 390 390 390 390 390 390 391 391 391 391 391 391 391 391 391 391 391 391 391 391 391 391 391 391 390 390 390 390 390 390 390 390 390 390 391 391 391 391 391 391 391 391 391 391 391 391 391 391 391 391 391 391 391 391 391 391 391 391
7211C91%%%%%%%%%J%%%%%%j%%%%%%%%%%%%%%%%%%%%%%%%%%%%%%%%%%%%%%%%%%%%%%%%%%%%
$$ 391 391 391 391 391 391 391 391 391 391 392 392 392 392 392 392 392 391 391 391 391 391 391 391 391 391 391 391 391 391 391 391 391 391 391 391 391 391 391 391 391 391 391 391 391 391 391 391 391 391 391 391 391 391 391 391 391 391 391 391 391 391 391 391 391 391 391 391 391 391
7204C91%%%%%%%%%%%%%%%%%%%%%%%%%%%%%%%%%%%%%%%%%%%%%%%%%%%%%%%%%%%%%%%%%%%%%
$$ 391 391 391 391 391 391 391 391 391 391 391 391 391 391 391 391 391 391 391 391 391 391 391 391 391 391 391 391 391 391 391 391 391 391 391 391 391 391 391 391 391 391 391 391 391 391 391 391 391 391 391 391 391 391 391 391 391 391 391 391 391 391 391 391 391 391 391 391 391 391
7197C91%%%%%%%%%%%%%%%j%%%%%%%%%%%%%%%%%%%%%%%%%%%%%%%%%%%%%%%%%%%%%%%%%%%%%
$$ 391 391 391 391 391 391 391 391 391 391 391 391 391 391 391 391 390 390 390 390 390 390 390 390 390 390 390 390 390 390 390 390 390 390 390 390 390 390 390 390 390 390 390 390 390 390 390 390 390 390 390 390 390 390 390 390 390 390 390 390 390 390 390 390 390 390 390 390 390 390
7189C90%%%%%%%%%%%%%%%%%%%%%%%%%%%%%%%%%%%%%%%%%%%%%%%%%%%%%%%%%%%%%%%%%%%%%
$$ 390 390 390 390 390 390 390 390 390 390 390 390 390 390 390 390 390 390 390 390 390 390 390 390 390 390 390 390 390 390 390 390 390 390 390 390 390 390 390 390 390 390 390 390 390 390 390 390 390 390 390 390 390 390 390 390 390 390 390 390 390 390 390 390 390 390 390 390 390 390
7182C90%%%%%%%%%%%%%%%%%%%%%%%%%%%%%%%%%%%%%%%%%%%%%%%%%%%%%%%%%%%%%%%%%%%%%
$$ 390 390 390 390 390 390 390 390 390 390 390 390 390 390 390 390 390 390 390 390 390 390 390 390 390 390 390 390 390 390 390 390 390 390 390 390 390 390 390 390 390 390 390 390 390 390 390 390 390 390 390 390 390 390 390 390 390 390 390 390 390 390 390 390 390 390 390 390 390 390
7175C90%%%%%%%%%%%%%%%%%%%%%%%%%%%%%%%j%%%%%%%%%%%%%%%%%%%%%%%%%%%%%%%%%%%%%
$$ 390 390 390 390 390 390 390 390 390 390 390 390 390 390 390 390 390 390 390 390 390 390 390 390 390 390 390 390 390 390 390 390 389 389 389 389 389 389 389 389 389 389 389 389 389 389 389 389 389 389 389 389 389 389 389 389 389 389 389 389 389 389 389 389 389 389 389 389 389 389
7167C89%%%%%%%%%%%%%%%%%%%%%%%%%%%%%%%%%%%%%%%%%j%%%%%%%%%%%%%%J%%%%%%%%%%%%
$$ 389 389 389 389 389 389 389 389 389 389 389 389 389 389 389 389 389 389 389 389 389 389 389 389 389 389 389 389 389 389 389 389 389 389 389 389 389 389 389 389 389 389 388 388 388 388 388 388 388 388 388 388 388 388 388 388 388 389 389 389 389 389 389 389 389 389 389 389 389 389
7160C89%%%%%%%%%%%%%%%%%%%%%%%%%%%j%%%%%%%%%%%%%%%%%%%%%%%%%%%%%%%%%%%%%%%%%
$$ 389 389 389 389 389 389 389 389 389 389 389 389 389 389 389 389 389 389 389 389 389 389 389 389 389 389 389 389 388 388 388 388 388 388 388 388 388 388 388 388 388 388 388 388 388 388 388 388 388 388 388 388 388 388 388 388 388 388 388 388 388 388 388 388 388 388 388 388 388 388
7153C88%%%%%%%%%%%%%%%%%%%%%%%%%%%%%%%%%%%%%%%%%%%%%%%%%%%%%%%%%%%%%%%%%%%%%
$$ 388 388 388 388 388 388 388 388 388 388 388 388 388 388 388 388 388 388 388 388 388 388 388 388 388 388 388 388 388 388 388 388 388 388 388 388 388 388 388 388 388 388 388 388 388 388 388 388 388 388 388 388 388 388 388 388 388 388 388 388 388 388 388 388 388 388 388 388 388 388
7145C88%%%%%%%%%%%%%%%%%%%%%%%%%%%%%%%%%%%%%%%%%%%%%J%%%%%%%%%%%%%%%%%%%%%%%
$$ 388 388 388 388 388 388 388 388 388 388 388 388 388 388 388 388 388 388 388 388 388 388 388 388 388 388 388 388 388 388 388 388 388 388 388 388 388 388 388 388 388 388 388 388 388 388 389 389 389 389 389 389 389 389 389 389 389 389 389 389 389 389 389 389 389 389 389 389 389 389
7138C89%j%%%%%%%%%%%J%%%%%%%%%%j%%%%%%%%%J%%%%%%%%%%%%%%%%%%%%%%%%%%%%%%%%%%
$$ 389 389 388 388 388 388 388 388 388 388 388 388 388 388 389 389 389 389 389 389 389 389 389 389 389 388 388 388 388 388 388 388 388 388 388 389 389 389 389 389 389 389 389 389 389 389 389 389 389 389 389 389 389 389 389 389 389 389 389 389 389 389 389 389 389 389 389 389 389 389
7131C89%%%%%%%%%%%%%%%%%%%%%%%%%%%%%%%%%%%%%%j%%%%%%%%%%%%%%%%%%%%%%%%%%%%%%
$$ 389 389 389 389 389 389 389 389 389 389 389 389 389 389 389 389 389 389 389 389 389 389 389 389 389 389 389 389 389 389 389 389 389 389 389 389 389 389 389 388 388 388 388 388 388 388 388 388 388 388 388 388 388 388 388 388 388 388 388 388 388 388 388 388 388 388 388 388 388 388
7123C88%%%%%%%%%%%%%%%j%%%%%%%%%%%%%%%%%%%%%%%%%%%%%%%%%%%%%%%%%%%j%%%%%%%%%
$$ 388 388 388 388 388 388 388 388 388 388 388 388 388 388 388 388 387 387 387 387 387 387 387 387 387 387 387 387 387 387 387 387 387 387 387 387 387 387 387 387 387 387 387 387 387 387 387 387 387 387 387 387 387 387 387 387 387 387 387 387 386 386 386 386 386 386 386 386 386 386
7116C86%%%%%%%%%%%%%%%%%%%%%%%%%%%%%%j%%%%%%%%%%%%%%%%%%%%%%%%%%%%%%%%%%%%%%
$$ 386 386 386 386 386 386 386 386 386 386 386 386 386 386 386 386 386 386 386 386 386 386 386 386 386 386 386 386 386 386 386 385 385 385 385 385 385 385 385 385 385 385 385 385 385 385 385 385 385 385 385 385 385 385 385 385 385 385 385 385 385 385 385 385 385 385 385 385 385 385
7109C85%%%%%%%%%%%%%%%%%%%%%%%%%%%%%%%%%%%%%%%%%%%%%%%j%%%%%%%%%%%%%%%%J%%%%
$$ 385 385 385 385 385 385 385 385 385 385 385 385 385 385 385 385 385 385 385 385 385 385 385 385 385 385 385 385 385 385 385 385 385 385 385 385 385 385 385 385 385 385 385 385 385 385 385 385 384 384 384 384 384 384 384 384 384 384 384 384 384 384 384 384 384 385 385 385 385 385
7101C85%%%%%%%%%%%%%%%%%%%%%%%%%%%%%%%%%%%%%%%%%%%%%%%%%%%J%%%%%%%%%%%%%%%%%
$$ 385 385 385 385 385 385 385 385 385 385 385 385 385 385 385 385 385 385 385 385 385 385 385 385 385 385 385 385 385 385 385 385 385 385 385 385 385 385 385 385 385 385 385 385 385 385 385 385 385 385 385 385 386 386 386 386 386 386 386 386 386 386 386 386 386 386 386 386 386 386
7094C86%%%%%%%%%%%%%%%%%%%%%%%%%%%%%%%%%%%%%%%%%%%%%%%%%%%%%%%%%%%%%%%%%%%%%
$$ 386 386 386 386 386 386 386 386 386 386 386 386 386 386 386 386 386 386 386 386 386 386 386 386 386 386 386 386 386 386 386 386 386 386 386 386 386 386 386 386 386 386 386 386 386 386 386 386 386 386 386 386 386 386 386 386 386 386 386 386 386 386 386 386 386 386 386 386 386 386
7087C86%%%J%%%%%%%%%%%%%%%%%%%%%%%%%%%%%%%%%%%%%%%%%%%%%%%%%%%%%%%%%%%%%%%%%
$$ 386 386 386 386 387 387 387 387 387 387 387 387 387 387 387 387 387 387 387 387 387 387 387 387 387 387 387 387 387 387 387 387 387 387 387 387 387 387 387 387 387 387 387 387 387 387 387 387 387 387 387 387 387 387 387 387 387 387 387 387 387 387 387 387 387 387 387 387 387 387
7080C87%%j%%%%%%%%%%%%%%%%%%%%%%%%%%%%%%%%%%%%%%%%%%%%%%%%%%%%%%%%%%%%%%%%%%
$$ 387 387 387 386 386 386 386 386 386 386 386 386 386 386 386 386 386 386 386 386 386 386 386 386 386 386 386 386 386 386 386 386 386 386 386 386 386 386 386 386 386 386 386 386 386 386 386 386 386 386 386 386 386 386 386 386 386 386 386 386 386 386 386 386 386 386 386 386 386 386
7072C86%%%%%%%%%%%%%%%%%%%%%%j%%%%%%%%%%%%%%J%%%%%%%%%%%%%%%%%%%%%%%%%%%%%%%
$$ 386 386 386 386 386 386 386 386 386 386 386 386 386 386 386 386 386 386 386 386 386 386 386 385 385 385 385 385 385 385 385 385 385 385 385 385 385 385 386 386 386 386 386 386 386 386 386 386 386 386 386 386 386 386 386 386 386 386 386 386 386 386 386 386 386 386 386 386 386 386
7065C86%%%%%%%%%%%%%%%%%j%%%%%%J%%%%%%%%%%%%%%%%%%%%%%%%%%%%%%%%%%%%%%%%%J%%
$$ 386 386 386 386 386 386 386 386 386 386 386 386 386 386 386 386 386 386 385 385 385 385 385 385 385 386 386 386 386 386 386 386 386 386 386 386 386 386 386 386 386 386 386 386 386 386 386 386 386 386 386 386 386 386 386 386 386 386 386 386 386 386 386 386 386 386 386 387 387 387
7058C87%%%%%%%%%%%%%%%%%%%%%%%%%%%%%%%%%%%%%%%%j%%%%%%%%%%%%%%%%%%%%%%%%%%%%
$$ 387 387 387 387 387 387 387 387 387 387 387 387 387 387 387 387 387 387 387 387 387 387 387 387 387 387 387 387 387 387 387 387 387 387 387 387 387 387 387 387 387 386 386 386 386 386 386 386 386 386 386 386 386 386 386 386 386 386 386 386 386 386 386 386 386 386 386 386 386 386
7050C86%%%%%%%%%%%%%%%%%%%%%%%%%%%%%%%%%%%%%%%%%%%%%%%%%%%%%%%%%%%%%%%%%%%%%
$$ 386 386 386 386 386 386 386 386 386 386 386 386 386 386 386 386 386 386 386 386 386 386 386 386 386 386 386 386 386 386 386 386 386 386 386 386 386 386 386 386 386 386 386 386 386 386 386 386 386 386 386 386 386 386 386 386 386 386 386 386 386 386 386 386 386 386 386 386 386 386
7043C86%%%%%%%%%%%%%%%%%%%%%%%%%j%%%%%%%%%%%%%%%%%%%%%%%%%%%%%%%%%%%%%%%%%%%
$$ 386 386 386 386 386 386 386 386 386 386 386 386 386 386 386 386 386 386 386 386 386 386 386 386 386 386 385 385 385 385 385 385 385 385 385 385 385 385 385 385 385 385 385 385 385 385 385 385 385 385 385 385 385 385 385 385 385 385 385 385 385 385 385 385 385 385 385 385 385 385
7036C85%%%%%%%%%%%%%%%%%%%%%%%%%%%%%%%%%%j%%%%%%%%%%%%%%%%%%%%%%%%%%%%%%%%%%
$$ 385 385 385 385 385 385 385 385 385 385 385 385 385 385 385 385 385 385 385 385 385 385 385 385 385 385 385 385 385 385 385 385 385 385 385 384 384 384 384 384 384 384 384 384 384 384 384 384 384 384 384 384 384 384 384 384 384 384 384 384 384 384 384 384 384 384 384 384 384 384
7028C84%%%%%%%%%%%%%%%%%%%%%%%%%%%%%%%%%%%%%%%%%%%%%%%%%%%%%%%%%%%%%%%%%%%%%
$$ 384 384 384 384 384 384 384 384 384 384 384 384 384 384 384 384 384 384 384 384 384 384 384 384 384 384 384 384 384 384 384 384 384 384 384 384 384 384 384 384 384 384 384 384 384 384 384 384 384 384 384 384 384 384 384 384 384 384 384 384 384 384 384 384 384 384 384 384 384 384
7021C84%%%%%%%%%%%%%%%%%%%%%%%%%%%%%%%%%%%%%%%%%%%%%%%%%%%%%%%%%%%%%%%%%%%%%
$$ 384 384 384 384 384 384 384 384 384 384 384 384 384 384 384 384 384 384 384 384 384 384 384 384 384 384 384 384 384 384 384 384 384 384 384 384 384 384 384 384 384 384 384 384 384 384 384 384 384 384 384 384 384 384 384 384 384 384 384 384 384 384 384 384 384 384 384 384 384 384
7014C84%%%%%%%%%%%%%%%%%%%%%%%%%%%%%%%%%%%%%%%%%%%%%%%%%%%%%%%%%%%%%%%%%%%%%
$$ 384 384 384 384 384 384 384 384 384 384 384 384 384 384 384 384 384 384 384 384 384 384 384 384 384 384 384 384 384 384 384 384 384 384 384 384 384 384 384 384 384 384 384 384 384 384 384 384 384 384 384 384 384 384 384 384 384 384 384 384 384 384 384 384 384 384 384 384 384 384
7006C84%%%%%%%%%%%%%%%%%%%%%J%%%%%%%%%%%%%%%%%%%%%%%%%%%%%%%%%%%%%%%%%%%%%%%
$$ 384 384 384 384 384 384 384 384 384 384 384 384 384 384 384 384 384 384 384 384 384 384 385 385 385 385 385 385 385 385 385 385 385 385 385 385 385 385 385 385 385 385 385 385 385 385 385 385 385 385 385 385 385 385 385 385 385 385 385 385 385 385 385 385 385 385 385 385 385 385
6999C85%%%%%j%%%%%%%J%%%%%%%%%%%%%j%%%%%%%%%%%%%%%%%%J%%%%%%%%%%%%%%%%%%%%%%
$$ 385 385 385 385 385 385 384 384 384 384 384 384 384 384 385 385 385 385 385 385 385 385 385 385 385 385 385 385 384 384 384 384 384 384 384 384 384 384 384 384 384 384 384 384 384 384 384 385 385 385 385 385 385 385 385 385 385 385 385 385 385 385 385 385 385 385 385 385 385 385
6992C85%%%%%%%%%%%%%%%%%%%%%%%%%%%%%%%%%%%%%%%%%%%%%%%%%%%%%%%%%%%%%%%%%%%%%
$$ 385 385 385 385 385 385 385 385 385 385 385 385 385 385 385 385 385 385 385 385 385 385 385 385 385 385 385 385 385 385 385 385 385 385 385 385 385 385 385 385 385 385 385 385 385 385 385 385 385 385 385 385 385 385 385 385 385 385 385 385 385 385 385 385 385 385 385 385 385 385
6985C85%%%%%%%%j%%%%%%%%%%%%%%%J%%%%%%%%%%%%%%%%%%%%%%%%%%%%%%%%%%%%%%%%%%%%
$$ 385 385 385 385 385 385 385 385 385 384 384 384 384 384 384 384 384 384 384 384 384 384 384 384 384 385 385 385 385 385 385 385 385 385 385 385 385 385 385 385 385 385 385 385 385 385 385 385 385 385 385 385 385 385 385 385 385 385 385 385 385 385 385 385 385 385 385 385 385 385
6977C85%%%%%%%%%%%%%%%%%%%%%%jJ%%%%%%%%%%%%%%%%%%%%%%%%%%%%%%%%%%j%%%%%%%%%%
$$ 385 385 385 385 385 385 385 385 385 385 385 385 385 385 385 385 385 385 385 385 385 385 385 384 385 385 385 385 385 385 385 385 385 385 385 385 385 385 385 385 385 385 385 385 385 385 385 385 385 385 385 385 385 385 385 385 385 385 385 384 384 384 384 384 384 384 384 384 384 384
6970C84%%%%%%%%%%%%%%%%%%%%%%%%%%%%%%%%%%%%%%%%%%%%%%%%%%%%%%%%j%%%%%%%%%%%%
$$ 384 384 384 384 384 384 384 384 384 384 384 384 384 384 384 384 384 384 384 384 384 384 384 384 384 384 384 384 384 384 384 384 384 384 384 384 384 384 384 384 384 384 384 384 384 384 384 384 384 384 384 384 384 384 384 384 384 383 383 383 383 383 383 383 383 383 383 383 383 383
6963C83%%%%%%%%%%%%%%%%%%%%%%%%%J%%%%%%%%%%%%%%%%%j%%%%%%%%%%%%%%%%%%%%%%%%%
$$ 383 383 383 383 383 383 383 383 383 383 383 383 383 383 383 383 383 383 383 383 383 383 383 383 383 383 384 384 384 384 384 384 384 384 384 384 384 384 384 384 384 384 384 384 383 383 383 383 383 383 383 383 383 383 383 383 383 383 383 383 383 383 383 383 383 383 383 383 383 383
6955C83%%%%%%%%%%%%%%%%%%%%%%%%%%%%%%%%%%%%%%%%%%%%%%%%%%%%%%%%%%%%%%%%%%%%%
$$ 383 383 383 383 383 383 383 383 383 383 383 383 383 383 383 383 383 383 383 383 383 383 383 383 383 383 383 383 383 383 383 383 383 383 383 383 383 383 383 383 383 383 383 383 383 383 383 383 383 383 383 383 383 383 383 383 383 383 383 383 383 383 383 383 383 383 383 383 383 383
6948C83%%%J%%%%%%%%%%%%%%%%%%%%%%%%%%%%%%%%%%%%j%%%%%%%%%%%%%%%J%%%%j%%%%%%%
$$ 383 383 383 383 384 384 384 384 384 384 384 384 384 384 384 384 384 384 384 384 384 384 384 384 384 384 384 384 384 384 384 384 384 384 384 384 384 384 384 384 384 383 383 383 383 383 383 383 383 383 383 383 383 383 383 383 383 384 384 384 384 384 383 383 383 383 383 383 383 383
6941C83%%%%%%%%%%%%%%%%%%%%%%%%%%%%%%%%%%%%%%%%%%%%%%%%%%%%%%%%%%%%%%%%%%%%%
$$ 383 383 383 383 383 383 383 383 383 383 383 383 383 383 383 383 383 383 383 383 383 383 383 383 383 383 383 383 383 383 383 383 383 383 383 383 383 383 383 383 383 383 383 383 383 383 383 383 383 383 383 383 383 383 383 383 383 383 383 383 383 383 383 383 383 383 383 383 383 383
6933C83%%%%%%%j%%%%%%%%%%J%%%%%%%%%%%j%%%%%%%%%%%%%%%%%%%%%%%%%%%%%%%%%%%%%%
$$ 383 383 383 383 383 383 383 383 382 382 382 382 382 382 382 382 382 382 382 383 383 383 383 383 383 383 383 383 383 383 383 382 382 382 382 382 382 382 382 382 382 382 382 382 382 382 382 382 382 382 382 382 382 382 382 382 382 382 382 382 382 382 382 382 382 382 382 382 382 382
6926C82%%%J%%%%%%%%%j%%%%%%%%%%%%%%%%%%%%%%%%%%%j%%%%%%%%%%%J%%%%%%%%%%%%%%%
$$ 382 382 382 382 383 383 383 383 383 383 383 383 383 383 382 382 382 382 382 382 382 382 382 382 382 382 382 382 382 382 382 382 382 382 382 382 382 382 382 382 382 382 381 381 381 381 381 381 381 381 381 381 381 381 382 382 382 382 382 382 382 382 382 382 382 382 382 382 382 382
6919C82%%%%%%%%%%%%%%%%%%%%%%%%%%%%%%%%%%%%%%%%%%%%%%%%%%%%%%%%%%%%%%%%%%%%%
$$ 382 382 382 382 382 382 382 382 382 382 382 382 382 382 382 382 382 382 382 382 382 382 382 382 382 382 382 382 382 382 382 382 382 382 382 382 382 382 382 382 382 382 382 382 382 382 382 382 382 382 382 382 382 382 382 382 382 382 382 382 382 382 382 382 382 382 382 382 382 382
6911C82%%%%%%%%%%%%%%%%%%%%%%%%%%%%%%%%%%%%%%%%%%%%%%%%%%%%%%%%%J%%%%%%%%%%%
$$ 382 382 382 382 382 382 382 382 382 382 382 382 382 382 382 382 382 382 382 382 382 382 382 382 382 382 382 382 382 382 382 382 382 382 382 382 382 382 382 382 382 382 382 382 382 382 382 382 382 382 382 382 382 382 382 382 382 382 383 383 383 383 383 383 383 383 383 383 383 383
6904C83%%%%%%%%%%%%%%%%%%%%%%%%%%%%%%%%%%%%%%%%%%%%%%%%%%%%%%%%%%%%%%%%%%%%%
$$ 383 383 383 383 383 383 383 383 383 383 383 383 383 383 383 383 383 383 383 383 383 383 383 383 383 383 383 383 383 383 383 383 383 383 383 383 383 383 383 383 383 383 383 383 383 383 383 383 383 383 383 383 383 383 383 383 383 383 383 383 383 383 383 383 383 383 383 383 383 383
6897C83J%%%%%%%%%%%%%%%%%%%%%%%%%%%%%%%%%%%%%%%%%%%%%%%%%%%%%%%%%%%%%%%%%%%%
$$ 383 384 384 384 384 384 384 384 384 384 384 384 384 384 384 384 384 384 384 384 384 384 384 384 384 384 384 384 384 384 384 384 384 384 384 384 384 384 384 384 384 384 384 384 384 384 384 384 384 384 384 384 384 384 384 384 384 384 384 384 384 384 384 384 384 384 384 384 384 384
6889C84%%%%%%%%%%%%J%%%%%%%%%%j%%%%J%%%%%%%%%%%%%%%%%%%%%%%%%%%%%%%%%%%%%%%%
$$ 384 384 384 384 384 384 384 384 384 384 384 384 384 385 385 385 385 385 385 385 385 385 385 385 384 384 384 384 384 385 385 385 385 385 385 385 385 385 385 385 385 385 385 385 385 385 385 385 385 385 385 385 385 385 385 385 385 385 385 385 385 385 385 385 385 385 385 385 385 385
6882C85%%%%%%%%j%%%%%%%%%%%%%J%%%%%%%%%%%%%%%%%%%%%%%%%%%%%%%%%%%%%%%%%%%%%%
$$ 385 385 385 385 385 385 385 385 385 384 384 384 384 384 384 384 384 384 384 384 384 384 384 385 385 385 385 385 385 385 385 385 385 385 385 385 385 385 385 385 385 385 385 385 385 385 385 385 385 385 385 385 385 385 385 385 385 385 385 385 385 385 385 385 385 385 385 385 385 385
6875C85%%%%%%%%%%%%%%%%%%%%%%%%%%%%j%%%%%%%%%%%%%%%%%%%%%%%%%%%%%%%%%%j%%%%%
$$ 385 385 385 385 385 385 385 385 385 385 385 385 385 385 385 385 385 385 385 385 385 385 385 385 385 385 385 385 385 384 384 384 384 384 384 384 384 384 384 384 384 384 384 384 384 384 384 384 384 384 384 384 384 384 384 384 384 384 384 384 384 384 384 384 383 383 383 383 383 383
6868C83%%%%%%%%%%%%%%%%%%%%%%%%%%%%%%%%%%j%%%%%%%%%%%%%%%%%%%%%%%%%%%%%%%%%%
$$ 383 383 383 383 383 383 383 383 383 383 383 383 383 383 383 383 383 383 383 383 383 383 383 383 383 383 383 383 383 383 383 383 383 383 383 382 382 382 382 382 382 382 382 382 382 382 382 382 382 382 382 382 382 382 382 382 382 382 382 382 382 382 382 382 382 382 382 382 382 382
6860C82%%%%%%%%%%%%%%%%%%%%%%%%%%%%%%%%%%%%%%%%%%%%%%%%%%%%%%%%%%%%%%%%%%%%j
$$ 382 382 382 382 382 382 382 382 382 382 382 382 382 382 382 382 382 382 382 382 382 382 382 382 382 382 382 382 382 382 382 382 382 382 382 382 382 382 382 382 382 382 382 382 382 382 382 382 382 382 382 382 382 382 382 382 382 382 382 382 382 382 382 382 382 382 382 382 382 381
6853C81%%%%%%%%%%%%%%%%%%%%%%%%%%%%%%%%%%%%%%%%%%%%%%%%%%%j%%%%%%%%%%%%%%j%%
$$ 381 381 381 381 381 381 381 381 381 381 381 381 381 381 381 381 381 381 381 381 381 381 381 381 381 381 381 381 381 381 381 381 381 381 381 381 381 381 381 381 381 381 381 381 381 381 381 381 381 381 381 381 380 380 380 380 380 380 380 380 380 380 380 380 380 380 380 379 379 379
6846C79%%%%%%%%J%%%%%%%%%%%%%%%%%J%%%%%j%%%%%%%%%%%%%%%%%%%%%%%J%%%%%%%%%%%%
$$ 379 379 379 379 379 379 379 379 379 380 380 380 380 380 380 380 380 380 380 380 380 380 380 380 380 380 380 381 381 381 381 381 381 380 380 380 380 380 380 380 380 380 380 380 380 380 380 380 380 380 380 380 380 380 380 380 380 381 381 381 381 381 381 381 381 381 381 381 381 381
6838C81%%%%%%%%%%%%%%%%%%%%%%%%%%%%%%%%%%%%%%%%%%%%%%%%%%%%%%%%%%%%%%%%%%%%%
$$ 381 381 381 381 381 381 381 381 381 381 381 381 381 381 381 381 381 381 381 381 381 381 381 381 381 381 381 381 381 381 381 381 381 381 381 381 381 381 381 381 381 381 381 381 381 381 381 381 381 381 381 381 381 381 381 381 381 381 381 381 381 381 381 381 381 381 381 381 381 381
6831C81%%%%%%%%%%%%%%%%%%%%%%%%%%%%%%%%%%%%%%%%%%%%%%%%%%%%%%%%%%%%%%%%%%%%%
$$ 381 381 381 381 381 381 381 381 381 381 381 381 381 381 381 381 381 381 381 381 381 381 381 381 381 381 381 381 381 381 381 381 381 381 381 381 381 381 381 381 381 381 381 381 381 381 381 381 381 381 381 381 381 381 381 381 381 381 381 381 381 381 381 381 381 381 381 381 381 381
6824C81%%%%%%%%%%%%%%%%%%%%%%%%%%%%%j%%%%%%%%%%J%%%%%%%%%%%%%%%%%%%%%%%%%%%%
$$ 381 381 381 381 381 381 381 381 381 381 381 381 381 381 381 381 381 381 381 381 381 381 381 381 381 381 381 381 381 381 380 380 380 380 380 380 380 380 380 380 380 381 381 381 381 381 381 381 381 381 381 381 381 381 381 381 381 381 381 381 381 381 381 381 381 381 381 381 381 381
6816C81%%%%%%%%%%%%%%%%%%%%%%%%%%%%%%%%%%%%%%%%%%%%%%%%%%%%%%%%%%%%%%%%%%%%%
$$ 381 381 381 381 381 381 381 381 381 381 381 381 381 381 381 381 381 381 381 381 381 381 381 381 381 381 381 381 381 381 381 381 381 381 381 381 381 381 381 381 381 381 381 381 381 381 381 381 381 381 381 381 381 381 381 381 381 381 381 381 381 381 381 381 381 381 381 381 381 381
6809C81%%%%%%%%%%%%%%%%%%%%%%%%%%%%%J%%%%%%%%%%%%%%%%%%%%%%%%%%%%%%%%%%%%%%%
$$ 381 381 381 381 381 381 381 381 381 381 381 381 381 381 381 381 381 381 381 381 381 381 381 381 381 381 381 381 381 381 382 382 382 382 382 382 382 382 382 382 382 382 382 382 382 382 382 382 382 382 382 382 382 382 382 382 382 382 382 382 382 382 382 382 382 382 382 382 382 382
6802C82j%%%%%%%%%%%%%%%%%J%%%%%%%%%%%%%%%%%%%%%%%%%%%%%%%%%%%%%%%%%%%%%%%%%%
$$ 382 381 381 381 381 381 381 381 381 381 381 381 381 381 381 381 381 381 381 382 382 382 382 382 382 382 382 382 382 382 382 382 382 382 382 382 382 382 382 382 382 382 382 382 382 382 382 382 382 382 382 382 382 382 382 382 382 382 382 382 382 382 382 382 382 382 382 382 382 382
6794C82%%%%%%%%%%%%%%%%%%%%%%%%%%%%%%%%%%%%%%%%%%%%%%%%%%%%%%%%%%%%%%%J%%%%%
$$ 382 382 382 382 382 382 382 382 382 382 382 382 382 382 382 382 382 382 382 382 382 382 382 382 382 382 382 382 382 382 382 382 382 382 382 382 382 382 382 382 382 382 382 382 382 382 382 382 382 382 382 382 382 382 382 382 382 382 382 382 382 382 382 382 383 383 383 383 383 383
6787C83%%%%%%%%%%%%%%%%%%%%J%%%%%%%%%%%%%%%%%%%%%%%%%%%%%J%%%%%j%%%%%%%%%%%%
$$ 383 383 383 383 383 383 383 383 383 383 383 383 383 383 383 383 383 383 383 383 383 384 384 384 384 384 384 384 384 384 384 384 384 384 384 384 384 384 384 384 384 384 384 384 384 384 384 384 384 384 384 385 385 385 385 385 385 384 384 384 384 384 384 384 384 384 384 384 384 384
6780C84%%%%%%%%%%%%%%%%%%%%%%%%%%%%%%%%j%%%%%%%%%%%%%%%%%%%%%%j%%%%%%%%%%%%%
$$ 384 384 384 384 384 384 384 384 384 384 384 384 384 384 384 384 384 384 384 384 384 384 384 384 384 384 384 384 384 384 384 384 384 383 383 383 383 383 383 383 383 383 383 383 383 383 383 383 383 383 383 383 383 383 383 383 382 382 382 382 382 382 382 382 382 382 382 382 382 382
6772C82%%%%%%j%%%%%%%%%%%%%%%%%%%%%%%%%%%%j%%%%%%%%%%%%%%%%%%%%%%%%%%%%%%%%%
$$ 382 382 382 382 382 382 382 381 381 381 381 381 381 381 381 381 381 381 381 381 381 381 381 381 381 381 381 381 381 381 381 381 381 381 381 381 380 380 380 380 380 380 380 380 380 380 380 380 380 380 380 380 380 380 380 380 380 380 380 380 380 380 380 380 380 380 380 380 380 380
6765C80%%%%%%%%%%%%%%%%%%%%%%%%%%%%%%%%%%%%%%%%%%%%%J%%%%%%%%%%%%%%%%%%%%%%%
$$ 380 380 380 380 380 380 380 380 380 380 380 380 380 380 380 380 380 380 380 380 380 380 380 380 380 380 380 380 380 380 380 380 380 380 380 380 380 380 380 380 380 380 380 380 380 380 381 381 381 381 381 381 381 381 381 381 381 381 381 381 381 381 381 381 381 381 381 381 381 381
6758C81%%%%%%%%%%%%%%J%%%%%%%%%%%%%%%%%%%%%%%%%%%%%%%j%%%%%%%%%%%%%%%%%%%%%%
$$ 381 381 381 381 381 381 381 381 381 381 381 381 381 381 381 382 382 382 382 382 382 382 382 382 382 382 382 382 382 382 382 382 382 382 382 382 382 382 382 382 382 382 382 382 382 382 382 381 381 381 381 381 381 381 381 381 381 381 381 381 381 381 381 381 381 381 381 381 381 381
6751C81%%%%%%%%%%%%%%%%%%%%%%%%%%%%%%%%%%%%%%%%%j%%%%%%%%%%%%%%%%%%%%%%%%%%%
$$ 381 381 381 381 381 381 381 381 381 381 381 381 381 381 381 381 381 381 381 381 381 381 381 381 381 381 381 381 381 381 381 381 381 381 381 381 381 381 381 381 381 381 380 380 380 380 380 380 380 380 380 380 380 380 380 380 380 380 380 380 380 380 380 380 380 380 380 380 380 380
6743C80%%%%%%j%%%%%%%%%%%%%%%%%%%%%%%%%%%%%%%%%%%%%%%%%%%%%%%%%%%%%j%%%%%%%%
$$ 380 380 380 380 380 380 380 379 379 379 379 379 379 379 379 379 379 379 379 379 379 379 379 379 379 379 379 379 379 379 379 379 379 379 379 379 379 379 379 379 379 379 379 379 379 379 379 379 379 379 379 379 379 379 379 379 379 379 379 379 379 378 378 378 378 378 378 378 378 378
6736C78%%%%%%%%%%%%%%%%%%%%%%j%%%%%%%%%%%%%%%%%%%%%%%%%%%%%%%%%%%%%%%%%%%j%%
$$ 378 378 378 378 378 378 378 378 378 378 378 378 378 378 378 378 378 378 378 378 378 378 378 377 377 377 377 377 377 377 377 377 377 377 377 377 377 377 377 377 377 377 377 377 377 377 377 377 377 377 377 377 377 377 377 377 377 377 377 377 377 377 377 377 377 377 377 376 376 376
6729C76%%%%%%%%%%%%%%%%%%%%%%%%%%%%%%%%%%%%%%%%%%%%%%%%%%%%%%%%%%%%%%%%%%%%%
$$ 376 376 376 376 376 376 376 376 376 376 376 376 376 376 376 376 376 376 376 376 376 376 376 376 376 376 376 376 376 376 376 376 376 376 376 376 376 376 376 376 376 376 376 376 376 376 376 376 376 376 376 376 376 376 376 376 376 376 376 376 376 376 376 376 376 376 376 376 376 376
6721C76%%%%%%%%%%%%%%%%%J%%%%%%%%%%%%%%%%%%%%%%%%%%%%%%%J%%%%%%%%%%%%%%%%%%%
$$ 376 376 376 376 376 376 376 376 376 376 376 376 376 376 376 376 376 376 377 377 377 377 377 377 377 377 377 377 377 377 377 377 377 377 377 377 377 377 377 377 377 377 377 377 377 377 377 377 377 377 378 378 378 378 378 378 378 378 378 378 378 378 378 378 378 378 378 378 378 378
6714C78%%%%%%%%%%%%%%%%%%%%%%%%%%%%%%%J%%%%%%%%%%%%%%%%%%%%%%%%%%%J%%%%%%%%%
$$ 378 378 378 378 378 378 378 378 378 378 378 378 378 378 378 378 378 378 378 378 378 378 378 378 378 378 378 378 378 378 378 378 379 379 379 379 379 379 379 379 379 379 379 379 379 379 379 379 379 379 379 379 379 379 379 379 379 379 379 379 380 380 380 380 380 380 380 380 380 380
6707C80%%%%%%%%%%%%%%%%%%%%%%%%%%%%%%%%%%%%%%%%%%%%%%%%%%%%%%%%%%%%%%%%%%%%%
$$ 380 380 380 380 380 380 380 380 380 380 380 380 380 380 380 380 380 380 380 380 380 380 380 380 380 380 380 380 380 380 380 380 380 380 380 380 380 380 380 380 380 380 380 380 380 380 380 380 380 380 380 380 380 380 380 380 380 380 380 380 380 380 380 380 380 380 380 380 380 380
6699C80%%%%%%%%%%%%%%%%%%%%%%%%%%%%%%%%%%%%%%%%%%%%%%%%%%%%%%%%%%%%%%%%%%%%%
$$ 380 380 380 380 380 380 380 380 380 380 380 380 380 380 380 380 380 380 380 380 380 380 380 380 380 380 380 380 380 380 380 380 380 380 380 380 380 380 380 380 380 380 380 380 380 380 380 380 380 380 380 380 380 380 380 380 380 380 380 380 380 380 380 380 380 380 380 380 380 380
6692C80%%%%%%%%%%%%%%%%%%%%%%%%%%%%%%%%%%%%%%%%j%%%%%%%%%%%%%%%%%%%%%%%%%%%%
$$ 380 380 380 380 380 380 380 380 380 380 380 380 380 380 380 380 380 380 380 380 380 380 380 380 380 380 380 380 380 380 380 380 380 380 380 380 380 380 380 380 380 379 379 379 379 379 379 379 379 379 379 379 379 379 379 379 379 379 379 379 379 379 379 379 379 379 379 379 379 379
6685C79%%%%%%%%%%%%%%%%%j%%%%%%%%%%%%%%%%%%%%%%%%%%%%%%%%%%%%%%%%%%%%%%%%%%%
$$ 379 379 379 379 379 379 379 379 379 379 379 379 379 379 379 379 379 379 378 378 378 378 378 378 378 378 378 378 378 378 378 378 378 378 378 378 378 378 378 378 378 378 378 378 378 378 378 378 378 378 378 378 378 378 378 378 378 378 378 378 378 378 378 378 378 378 378 378 378 378
6677C78%%%%%%%%%%%%%%j%%%%%%%%%%%%%%%%%%%%%%%%%%%%%%%%%%%%%%%%%%%%%%%%%%%%%%
$$ 378 378 378 378 378 378 378 378 378 378 378 378 378 378 378 377 377 377 377 377 377 377 377 377 377 377 377 377 377 377 377 377 377 377 377 377 377 377 377 377 377 377 377 377 377 377 377 377 377 377 377 377 377 377 377 377 377 377 377 377 377 377 377 377 377 377 377 377 377 377
6670C77%%%%%%%%%%%%%%%%%%%%%%%%%%%%%%%%%%%%%%%%%%%%%%%%%%%%%%%%%%%%%%%%%%%%%
$$ 377 377 377 377 377 377 377 377 377 377 377 377 377 377 377 377 377 377 377 377 377 377 377 377 377 377 377 377 377 377 377 377 377 377 377 377 377 377 377 377 377 377 377 377 377 377 377 377 377 377 377 377 377 377 377 377 377 377 377 377 377 377 377 377 377 377 377 377 377 377
6663C77%%%%%%%%%%%%%%%%%%%%%%%%%%%%%%%%%%%%%%%%%%%%%%%%%%%%%%%%%%%%%%%%%%%%%
$$ 377 377 377 377 377 377 377 377 377 377 377 377 377 377 377 377 377 377 377 377 377 377 377 377 377 377 377 377 377 377 377 377 377 377 377 377 377 377 377 377 377 377 377 377 377 377 377 377 377 377 377 377 377 377 377 377 377 377 377 377 377 377 377 377 377 377 377 377 377 377
6655C77%%%%%%%%%%%%%%%%%%%%%%%%%%%%%%%%%%%%%%%%%%%J%%%%%%%%%%%%%%%%%%%%%%J%%
$$ 377 377 377 377 377 377 377 377 377 377 377 377 377 377 377 377 377 377 377 377 377 377 377 377 377 377 377 377 377 377 377 377 377 377 377 377 377 377 377 377 377 377 377 377 378 378 378 378 378 378 378 378 378 378 378 378 378 378 378 378 378 378 378 378 378 378 378 379 379 379
6648C79%%%%%%%%%%%%%%%%%%%%%%%%%%%%%%%%%%%%%%%%%%%%%%%%%%%%%%%%J%%%%%%%%%%%%
$$ 379 379 379 379 379 379 379 379 379 379 379 379 379 379 379 379 379 379 379 379 379 379 379 379 379 379 379 379 379 379 379 379 379 379 379 379 379 379 379 379 379 379 379 379 379 379 379 379 379 379 379 379 379 379 379 379 379 380 380 380 380 380 380 380 380 380 380 380 380 380
6641C80%%%%%%%%%%%%%%%%%%%%%%%%%%%%%%%%%%%%%%%%%%%%%%%%%%%%%%%%%%%%%%%%%%%%%
$$ 380 380 380 380 380 380 380 380 380 380 380 380 380 380 380 380 380 380 380 380 380 380 380 380 380 380 380 380 380 380 380 380 380 380 380 380 380 380 380 380 380 380 380 380 380 380 380 380 380 380 380 380 380 380 380 380 380 380 380 380 380 380 380 380 380 380 380 380 380 380
6634C80j%%%%%%%%%%%%%%%%%%%%%%%%%%j%%%%%%%%%%%%%%%%%%%%%%%%%%%%%%%%%%%%%%%%%
$$ 380 379 379 379 379 379 379 379 379 379 379 379 379 379 379 379 379 379 379 379 379 379 379 379 379 379 379 379 378 378 378 378 378 378 378 378 378 378 378 378 378 378 378 378 378 378 378 378 378 378 378 378 378 378 378 378 378 378 378 378 378 378 378 378 378 378 378 378 378 378
6626C78%%%%%%%%%%%%%%%%%%%%%%%%%%%%J%%%%%%%%%%%%%%%%%%%%%%%%%%%%%%%%%%%%%%%%
$$ 378 378 378 378 378 378 378 378 378 378 378 378 378 378 378 378 378 378 378 378 378 378 378 378 378 378 378 378 378 379 379 379 379 379 379 379 379 379 379 379 379 379 379 379 379 379 379 379 379 379 379 379 379 379 379 379 379 379 379 379 379 379 379 379 379 379 379 379 379 379
6619C79%%%%%%%%%%%%%%%%%%%%%%%%%%%%%%%%%%%%%%%%%%%%%%%%%%%%%%%%%%%%%%%%%%%%%
$$ 379 379 379 379 379 379 379 379 379 379 379 379 379 379 379 379 379 379 379 379 379 379 379 379 379 379 379 379 379 379 379 379 379 379 379 379 379 379 379 379 379 379 379 379 379 379 379 379 379 379 379 379 379 379 379 379 379 379 379 379 379 379 379 379 379 379 379 379 379 379
6612C79%%%%%%%%%%%%%%%%%%%%%%%%%%%%%%%%%%%%%%%%%%%%%%%%%%%%%j%%%%%%%%%%%%%J%
$$ 379 379 379 379 379 379 379 379 379 379 379 379 379 379 379 379 379 379 379 379 379 379 379 379 379 379 379 379 379 379 379 379 379 379 379 379 379 379 379 379 379 379 379 379 379 379 379 379 379 379 379 379 379 379 378 378 378 378 378 378 378 378 378 378 378 378 378 378 379 379
6604C79%%%%%%%%%%%%%%%%%%%j%%%%%%%%%%%%%%%%%%%%%%%%%%%%%%%%%%%%%%%%%%%%%%%%%
$$ 379 379 379 379 379 379 379 379 379 379 379 379 379 379 379 379 379 379 379 379 378 378 378 378 378 378 378 378 378 378 378 378 378 378 378 378 378 378 378 378 378 378 378 378 378 378 378 378 378 378 378 378 378 378 378 378 378 378 378 378 378 378 378 378 378 378 378 378 378 378
6597C78%%%%%%%%Jj%%%%%%%%%%%%%%%%%%%%%%%%%%%%%%%%%j%%%%%%%%%%%%%%%%%%%%%%%%%
$$ 378 378 378 378 378 378 378 378 378 379 378 378 378 378 378 378 378 378 378 378 378 378 378 378 378 378 378 378 378 378 378 378 378 378 378 378 378 378 378 378 378 378 378 378 377 377 377 377 377 377 377 377 377 377 377 377 377 377 377 377 377 377 377 377 377 377 377 377 377 377
6590C77%%%%%%%%%%%%%%%%%%%%%J%%%%%%%%%%%%%%%%%%%%%j%%%%%%%%%%%%%%%%%%%%%%%%%
$$ 377 377 377 377 377 377 377 377 377 377 377 377 377 377 377 377 377 377 377 377 377 377 378 378 378 378 378 378 378 378 378 378 378 378 378 378 378 378 378 378 378 378 378 378 377 377 377 377 377 377 377 377 377 377 377 377 377 377 377 377 377 377 377 377 377 377 377 377 377 377
6582C77%%%%%%%%%%%%%%%%%%%%%%%%%%%%%%%%%%%%%%%%%%%%%%%%%%%%%%%%%%%%%%%%%%%j%
$$ 377 377 377 377 377 377 377 377 377 377 377 377 377 377 377 377 377 377 377 377 377 377 377 377 377 377 377 377 377 377 377 377 377 377 377 377 377 377 377 377 377 377 377 377 377 377 377 377 377 377 377 377 377 377 377 377 377 377 377 377 377 377 377 377 377 377 377 377 376 376
6575C76%%%%%%%%%%%%%%%%%%%%%%%%%%%%j%%%%%%%%%%%%%%%%%%%%%%%%%%%%%%%%%%%%%%%%
$$ 376 376 376 376 376 376 376 376 376 376 376 376 376 376 376 376 376 376 376 376 376 376 376 376 376 376 376 376 376 375 375 375 375 375 375 375 375 375 375 375 375 375 375 375 375 375 375 375 375 375 375 375 375 375 375 375 375 375 375 375 375 375 375 375 375 375 375 375 375 375
6568C75%%%%j%%%%%%%%%%%%%%%%%%%%%%%%%%%%%%%%%%%%%%%%%%%%%%%%%%%%%%%%%%%%%%%%
$$ 375 375 375 375 375 374 374 374 374 374 374 374 374 374 374 374 374 374 374 374 374 374 374 374 374 374 374 374 374 374 374 374 374 374 374 374 374 374 374 374 374 374 374 374 374 374 374 374 374 374 374 374 374 374 374 374 374 374 374 374 374 374 374 374 374 374 374 374 374 374
6560C74%%%%%%%%%%%%%%%%%%%%%%%%%%%%%%%%%%%%%%%%%%%%%%%%%%%%%%%%%%%%%%%%%%%J%
$$ 374 374 374 374 374 374 374 374 374 374 374 374 374 374 374 374 374 374 374 374 374 374 374 374 374 374 374 374 374 374 374 374 374 374 374 374 374 374 374 374 374 374 374 374 374 374 374 374 374 374 374 374 374 374 374 374 374 374 374 374 374 374 374 374 374 374 374 374 375 375
6553C75%%%%%%%%%%%%%J%%%%%%%%%%%%%%%%J%%%%%%%%%%%%%%%%%%%%%J%%%%%%%%%%%%%J%%
$$ 375 375 375 375 375 375 375 375 375 375 375 375 375 375 376 376 376 376 376 376 376 376 376 376 376 376 376 376 376 376 376 377 377 377 377 377 377 377 377 377 377 377 377 377 377 377 377 377 377 377 377 377 377 378 378 378 378 378 378 378 378 378 378 378 378 378 378 379 379 379
6546C79%%%%%%%%%%%%%%%%%%%%%%%%%%%%%%%%%%%%%%%%%%%%%%%%%%%%%%%%%%%%%%%%%%%j%
$$ 379 379 379 379 379 379 379 379 379 379 379 379 379 379 379 379 379 379 379 379 379 379 379 379 379 379 379 379 379 379 379 379 379 379 379 379 379 379 379 379 379 379 379 379 379 379 379 379 379 379 379 379 379 379 379 379 379 379 379 379 379 379 379 379 379 379 379 379 378 378
6538C78%%%%%%%%%%%%%%%%%%j%%%%%%%%%%%j%%%%%%%%%%%%%%%%%%%%%%%%%%%%%%%%%%%%%%
$$ 378 378 378 378 378 378 378 378 378 378 378 378 378 378 378 378 378 378 378 377 377 377 377 377 377 377 377 377 377 377 377 376 376 376 376 376 376 376 376 376 376 376 376 376 376 376 376 376 376 376 376 376 376 376 376 376 376 376 376 376 376 376 376 376 376 376 376 376 376 376
6531C76%%%%%%%%%%j%%%%%%%%%%%%%%%%%%%%%%%%%%%%%%%%%%%%%%%J%%%%%%%%%%%%%%%%%%
$$ 376 376 376 376 376 376 376 376 376 376 376 375 375 375 375 375 375 375 375 375 375 375 375 375 375 375 375 375 375 375 375 375 375 375 375 375 375 375 375 375 375 375 375 375 375 375 375 375 375 375 375 376 376 376 376 376 376 376 376 376 376 376 376 376 376 376 376 376 376 376
6524C76%%%%%%%%%%%%%%%%%%%%%%%%%%%%%%%J%%%%%%%%%%%%J%%%%%%%%%%%%%%%%%%%%%%%%
$$ 376 376 376 376 376 376 376 376 376 376 376 376 376 376 376 376 376 376 376 376 376 376 376 376 376 376 376 376 376 376 376 376 377 377 377 377 377 377 377 377 377 377 377 377 377 378 378 378 378 378 378 378 378 378 378 378 378 378 378 378 378 378 378 378 378 378 378 378 378 378
6517C78%%%%%%%%j%%%%%%%%%%%%%%%%%%%%%%%%%%%%%%%%%%%%%%%%%%%%%%%%%%%%%%%%%%%j
$$ 378 378 378 378 378 378 378 378 378 377 377 377 377 377 377 377 377 377 377 377 377 377 377 377 377 377 377 377 377 377 377 377 377 377 377 377 377 377 377 377 377 377 377 377 377 377 377 377 377 377 377 377 377 377 377 377 377 377 377 377 377 377 377 377 377 377 377 377 377 376
6509C76%%%%%%%%%%%%%%%%%%%%%%%%%%%%%%%%%%%j%%%%%%%%%%%%j%%%%%%%%%%%%%%%%%%%%
$$ 376 376 376 376 376 376 376 376 376 376 376 376 376 376 376 376 376 376 376 376 376 376 376 376 376 376 376 376 376 376 376 376 376 376 376 376 375 375 375 375 375 375 375 375 375 375 375 375 375 374 374 374 374 374 374 374 374 374 374 374 374 374 374 374 374 374 374 374 374 374
6502C74%%%%%%%%%%%%%%J%%%%%%%%%%%%%%%%%%%%%%%%%%%%%%%%%%%%%%%%%%%%%%%%%%%%%%
$$ 374 374 374 374 374 374 374 374 374 374 374 374 374 374 374 375 375 375 375 375 375 375 375 375 375 375 375 375 375 375 375 375 375 375 375 375 375 375 375 375 375 375 375 375 375 375 375 375 375 375 375 375 375 375 375 375 375 375 375 375 375 375 375 375 375 375 375 375 375 375
6495C75%%%%%%%%%%%%%%%%%%%%%%%%%%J%%%%%%%%%%%%j%%%%%%J%%%%%%%%%%%%%%%%%%%%%%
$$ 375 375 375 375 375 375 375 375 375 375 375 375 375 375 375 375 375 375 375 375 375 375 375 375 375 375 375 376 376 376 376 376 376 376 376 376 376 376 376 376 375 375 375 375 375 375 375 376 376 376 376 376 376 376 376 376 376 376 376 376 376 376 376 376 376 376 376 376 376 376
6487C76%%%j%%%%%%%%%%%J%%%%%%%%%%%%%%%%%%%%%%%%%%%%%%%%%%%%%%%%%%%%%%%%%%%%%
$$ 376 376 376 376 375 375 375 375 375 375 375 375 375 375 375 375 376 376 376 376 376 376 376 376 376 376 376 376 376 376 376 376 376 376 376 376 376 376 376 376 376 376 376 376 376 376 376 376 376 376 376 376 376 376 376 376 376 376 376 376 376 376 376 376 376 376 376 376 376 376
6480C76%%%%%%%%%%%%%%%%%%%%%%%%%%%%%%%%%%j%%%%%%%%%%%%%%%%%%%%%%%%%j%%%%%%%%
$$ 376 376 376 376 376 376 376 376 376 376 376 376 376 376 376 376 376 376 376 376 376 376 376 376 376 376 376 376 376 376 376 376 376 376 376 375 375 375 375 375 375 375 375 375 375 375 375 375 375 375 375 375 375 375 375 375 375 375 375 375 375 374 374 374 374 374 374 374 374 374
6473C74%%%%%%%%%%%%%j%%%%%%%%%%%%%%%%%%%%%%%%%%%%%%%%%%%%%%%J%%%%%%%%%%%%%%%
$$ 374 374 374 374 374 374 374 374 374 374 374 374 374 374 373 373 373 373 373 373 373 373 373 373 373 373 373 373 373 373 373 373 373 373 373 373 373 373 373 373 373 373 373 373 373 373 373 373 373 373 373 373 373 373 374 374 374 374 374 374 374 374 374 374 374 374 374 374 374 374
6465C74%%%%j%%%%%%%%%%%%%%%%%%%%%%%%%%%%%%%%%%%%%%%%%%%%%%%%%%%%%%%%%%%%%%%%
$$ 374 374 374 374 374 373 373 373 373 373 373 373 373 373 373 373 373 373 373 373 373 373 373 373 373 373 373 373 373 373 373 373 373 373 373 373 373 373 373 373 373 373 373 373 373 373 373 373 373 373 373 373 373 373 373 373 373 373 373 373 373 373 373 373 373 373 373 373 373 373
6458C73%%%%%%%%%%%%%%%%%%%J%%%%%%%%%%%%%%%J%%%%%%%%%%%%%%%%%%%%%%%%%%%%%%%%%
$$ 373 373 373 373 373 373 373 373 373 373 373 373 373 373 373 373 373 373 373 373 374 374 374 374 374 374 374 374 374 374 374 374 374 374 374 374 375 375 375 375 375 375 375 375 375 375 375 375 375 375 375 375 375 375 375 375 375 375 375 375 375 375 375 375 375 375 375 375 375 375
6451C75%%%%%%%%%%%%%%%%%%%%%%%%%%%%%%%%%%%%%%%%%%%%%%%%%%%%%%%%%%%%%%%%%%j%%
$$ 375 375 375 375 375 375 375 375 375 375 375 375 375 375 375 375 375 375 375 375 375 375 375 375 375 375 375 375 375 375 375 375 375 375 375 375 375 375 375 375 375 375 375 375 375 375 375 375 375 375 375 375 375 375 375 375 375 375 375 375 375 375 375 375 375 375 375 374 374 374
6443C74%%%%%%%J%%%%%%%%%%%%%%%%%%%%%%%%%%%%%%%%%%%%%%%J%%%%%%%%%%%%%%%%%%%%%
$$ 374 374 374 374 374 374 374 374 375 375 375 375 375 375 375 375 375 375 375 375 375 375 375 375 375 375 375 375 375 375 375 375 375 375 375 375 375 375 375 375 375 375 375 375 375 375 375 375 376 376 376 376 376 376 376 376 376 376 376 376 376 376 376 376 376 376 376 376 376 376
6436C76%%%%%%%%%%%j%%%%%%%%%%%%%%%%%%%%%%%%%%%%%%%%%%%%%%%%%%%%%%%%%%%%%%%%%
$$ 376 376 376 376 376 376 376 376 376 376 376 376 375 375 375 375 375 375 375 375 375 375 375 375 375 375 375 375 375 375 375 375 375 375 375 375 375 375 375 375 375 375 375 375 375 375 375 375 375 375 375 375 375 375 375 375 375 375 375 375 375 375 375 375 375 375 375 375 375 375
6429C75%%%%%j%%%%%%%%%%%%%%%%%%%%%%%%%%%%%%%%%%%%%%%%%%%%%%%%%%%%%%%%%%%%%%%
$$ 375 375 375 375 375 375 374 374 374 374 374 374 374 374 374 374 374 374 374 374 374 374 374 374 374 374 374 374 374 374 374 374 374 374 374 374 374 374 374 374 374 374 374 374 374 374 374 374 374 374 374 374 374 374 374 374 374 374 374 374 374 374 374 374 374 374 374 374 374 374
6422C74%%%%%%%%%%%%%%%%%%%%%%%%%%%%%%%%%%%j%%%%%%%%%%%%%%%%%%%%J%%%%%%%%%%%%
$$ 374 374 374 374 374 374 374 374 374 374 374 374 374 374 374 374 374 374 374 374 374 374 374 374 374 374 374 374 374 374 374 374 374 374 374 374 373 373 373 373 373 373 373 373 373 373 373 373 373 373 373 373 373 373 373 373 373 374 374 374 374 374 374 374 374 374 374 374 374 374
6414C74j%%%%%%%%%J%%%%%%%%%%%%%%%%%%%%%%%%%%%%%%%%%%%%%%%%%%%%%%%%%%%%%%%%%%
$$ 374 373 373 373 373 373 373 373 373 373 373 374 374 374 374 374 374 374 374 374 374 374 374 374 374 374 374 374 374 374 374 374 374 374 374 374 374 374 374 374 374 374 374 374 374 374 374 374 374 374 374 374 374 374 374 374 374 374 374 374 374 374 374 374 374 374 374 374 374 374
6407C74%%%%J%%%%%%%%%%%%%%%%%%%%%%%%%%%%%%%%%%%J%%%%%%%%%j%%%%%%%%%%%%%%%%%%
$$ 374 374 374 374 374 375 375 375 375 375 375 375 375 375 375 375 375 375 375 375 375 375 375 375 375 375 375 375 375 375 375 375 375 375 375 375 375 375 375 375 375 376 376 376 376 376 376 376 376 376 376 375 375 375 375 375 375 375 375 375 375 375 375 375 375 375 375 375 375 375
6400C75%%%%%%%%%%%%%%j%%%%%%%%%%%%%%%%%j%%%%%%%%%%%%%%%%%%%%%%j%%%%%%%%%%%%%
$$ 375 375 375 375 375 375 375 375 375 375 375 375 375 375 375 374 374 374 374 374 374 374 374 374 374 374 374 374 374 374 374 374 374 373 373 373 373 373 373 373 373 373 373 373 373 373 373 373 373 373 373 373 373 373 373 373 372 372 372 372 372 372 372 372 372 372 372 372 372 372
6392C72%%%%%%%%%%%%%%%%%%%%%%%%%j%%%%%%%%%%%%%%%%%%%%%%%%%J%%%%%%%%%%%%%%%%%
$$ 372 372 372 372 372 372 372 372 372 372 372 372 372 372 372 372 372 372 372 372 372 372 372 372 372 372 371 371 371 371 371 371 371 371 371 371 371 371 371 371 371 371 371 371 371 371 371 371 371 371 371 371 372 372 372 372 372 372 372 372 372 372 372 372 372 372 372 372 372 372
6385C72%%%%%%%%%%%%%%%%%%%%%%%%%%%j%%%%%%%%%%%%%%%%%%%%%%%%%%%%%%%%%%%%%%%%%
$$ 372 372 372 372 372 372 372 372 372 372 372 372 372 372 372 372 372 372 372 372 372 372 372 372 372 372 372 372 371 371 371 371 371 371 371 371 371 371 371 371 371 371 371 371 371 371 371 371 371 371 371 371 371 371 371 371 371 371 371 371 371 371 371 371 371 371 371 371 371 371
6378C71%%%%%J%%%%%%%%%%%%%%%%%%%%%%%%%%%%%%%%%%%%%J%%%%%%%%%%%%%%%%%%%%%%%%%
$$ 371 371 371 371 371 371 372 372 372 372 372 372 372 372 372 372 372 372 372 372 372 372 372 372 372 372 372 372 372 372 372 372 372 372 372 372 372 372 372 372 372 372 372 372 373 373 373 373 373 373 373 373 373 373 373 373 373 373 373 373 373 373 373 373 373 373 373 373 373 373
6370C73%%%%%%%%%%J%%%%%%%%%%%%%%%%%%%%%%%%%%%%%%%%%%%%%%%%%%%%%%%%%%%%%%%%%%
$$ 373 373 373 373 373 373 373 373 373 373 373 374 374 374 374 374 374 374 374 374 374 374 374 374 374 374 374 374 374 374 374 374 374 374 374 374 374 374 374 374 374 374 374 374 374 374 374 374 374 374 374 374 374 374 374 374 374 374 374 374 374 374 374 374 374 374 374 374 374 374
6363C74%%%%%%%%%%%%%%%%%%%%%%%%%%%%%%%%%%%%%%%%%%%%%%%%%%%%%%%%%%%%%%%%%%%%%
$$ 374 374 374 374 374 374 374 374 374 374 374 374 374 374 374 374 374 374 374 374 374 374 374 374 374 374 374 374 374 374 374 374 374 374 374 374 374 374 374 374 374 374 374 374 374 374 374 374 374 374 374 374 374 374 374 374 374 374 374 374 374 374 374 374 374 374 374 374 374 374
6356C74%%%%%%%%%%%%%%%%%%%%%%j%%%%%%%%%%%%%%%%%%%%%%%%%%%%%%%%%%%%j%%%%%%%%%
$$ 374 374 374 374 374 374 374 374 374 374 374 374 374 374 374 374 374 374 374 374 374 374 374 373 373 373 373 373 373 373 373 373 373 373 373 373 373 373 373 373 373 373 373 373 373 373 373 373 373 373 373 373 373 373 373 373 373 373 373 373 372 372 372 372 372 372 372 372 372 372
6348C72%%%%%%%%%%%%%%%%%%%%%%%%%%%%%%%%%%%%%%%%%%%%%%%%j%%%%%%%%%%%%%%%%%%%%
$$ 372 372 372 372 372 372 372 372 372 372 372 372 372 372 372 372 372 372 372 372 372 372 372 372 372 372 372 372 372 372 372 372 372 372 372 372 372 372 372 372 372 372 372 372 372 372 372 372 372 371 371 371 371 371 371 371 371 371 371 371 371 371 371 371 371 371 371 371 371 371
6341C71%J%%%%%%%%%%%%%%%%j%%%%%%%%%%%%%%%j%%%%%%%%%%%%%%%%%%%%%%%%%%%%%%%%%%
$$ 371 371 372 372 372 372 372 372 372 372 372 372 372 372 372 372 372 372 372 371 371 371 371 371 371 371 371 371 371 371 371 371 371 371 371 370 370 370 370 370 370 370 370 370 370 370 370 370 370 370 370 370 370 370 370 370 370 370 370 370 370 370 370 370 370 370 370 370 370 370
6334C70%%%J%%%%%%%%%%%%%%%%%%%%%%%%%%%%%%%%%%%%%%%%%%%%%%%%%%%%%%J%%%%%%%%%%
$$ 370 370 370 370 371 371 371 371 371 371 371 371 371 371 371 371 371 371 371 371 371 371 371 371 371 371 371 371 371 371 371 371 371 371 371 371 371 371 371 371 371 371 371 371 371 371 371 371 371 371 371 371 371 371 371 371 371 371 371 372 372 372 372 372 372 372 372 372 372 372
6326C72%%%%%%%%%%%%%%%%%%%%%%%%%%%%%%%%%%%%%%%%J%%%%%%%%%%%%%%%%%%%%%%%%%%%%
$$ 372 372 372 372 372 372 372 372 372 372 372 372 372 372 372 372 372 372 372 372 372 372 372 372 372 372 372 372 372 372 372 372 372 372 372 372 372 372 372 372 372 373 373 373 373 373 373 373 373 373 373 373 373 373 373 373 373 373 373 373 373 373 373 373 373 373 373 373 373 373
6319C73%%%%%%%%%%%%%%J%%%%%%%%%%%%%%%%%%%%%%%%%%%%%%%%%%J%%%%%%%%%%%%%%%%%%J
$$ 373 373 373 373 373 373 373 373 373 373 373 373 373 373 373 374 374 374 374 374 374 374 374 374 374 374 374 374 374 374 374 374 374 374 374 374 374 374 374 374 374 374 374 374 374 374 374 374 374 374 375 375 375 375 375 375 375 375 375 375 375 375 375 375 375 375 375 375 375 376
6312C76%%%%%%%%%%%%%%%%%%%%%%%%%%%%%%%%%%%%%%%%%%%%%%%%%%%%%%%%%%%%%%%%%%%%J
$$ 376 376 376 376 376 376 376 376 376 376 376 376 376 376 376 376 376 376 376 376 376 376 376 376 376 376 376 376 376 376 376 376 376 376 376 376 376 376 376 376 376 376 376 376 376 376 376 376 376 376 376 376 376 376 376 376 376 376 376 376 376 376 376 376 376 376 376 376 376 377
6305C77%%%%%%%%%%%%%%%%%%%j%%%%%%%%%%%%%%%%j%%%%%%%%%%%%%%%%%%%%%%%%%%%%%%%%
$$ 377 377 377 377 377 377 377 377 377 377 377 377 377 377 377 377 377 377 377 377 376 376 376 376 376 376 376 376 376 376 376 376 376 376 376 376 376 375 375 375 375 375 375 375 375 375 375 375 375 375 375 375 375 375 375 375 375 375 375 375 375 375 375 375 375 375 375 375 375 375
6297C75J%%%%%%%%%%%%%%%%%%%%%%%%%%%j%%%%%%%%j%%%%%%%%%%%%%%%%%%%%%%%%%%%%%%%
$$ 375 376 376 376 376 376 376 376 376 376 376 376 376 376 376 376 376 376 376 376 376 376 376 376 376 376 376 376 376 375 375 375 375 375 375 375 375 375 374 374 374 374 374 374 374 374 374 374 374 374 374 374 374 374 374 374 374 374 374 374 374 374 374 374 374 374 374 374 374 374
6290C74%%%%%%%%%%%%%%%%%%%%%%%%j%%%%%%%%%%%%%%%%%j%%%%%%%%%%%%%%%%%%%%%%%%%%
$$ 374 374 374 374 374 374 374 374 374 374 374 374 374 374 374 374 374 374 374 374 374 374 374 374 374 373 373 373 373 373 373 373 373 373 373 373 373 373 373 373 373 373 373 372 372 372 372 372 372 372 372 372 372 372 372 372 372 372 372 372 372 372 372 372 372 372 372 372 372 372
6283C72%%%%%%%%%%%%%%%%%%%%%%%%%%%%%%%%%%%j%%%%%%%%%%%j%%%%%%%%%%%%%%%%%%%%%
$$ 372 372 372 372 372 372 372 372 372 372 372 372 372 372 372 372 372 372 372 372 372 372 372 372 372 372 372 372 372 372 372 372 372 372 372 372 371 371 371 371 371 371 371 371 371 371 371 371 370 370 370 370 370 370 370 370 370 370 370 370 370 370 370 370 370 370 370 370 370 370
6275C70%%%%%%%%%%%%%%%%%%%%%%%%%%%%%%%%%%%%%%%%%%%%%%%%%%%%%%%%%%%%%%%%%%%%%
$$ 370 370 370 370 370 370 370 370 370 370 370 370 370 370 370 370 370 370 370 370 370 370 370 370 370 370 370 370 370 370 370 370 370 370 370 370 370 370 370 370 370 370 370 370 370 370 370 370 370 370 370 370 370 370 370 370 370 370 370 370 370 370 370 370 370 370 370 370 370 370
6268C70%J%%%%%%%%%%%%%%%%%%%%%%%%%%%%%%%%%%%%%%%%%%%%%%%%%%%%%%%%%%%%%%%%%%%
$$ 370 370 371 371 371 371 371 371 371 371 371 371 371 371 371 371 371 371 371 371 371 371 371 371 371 371 371 371 371 371 371 371 371 371 371 371 371 371 371 371 371 371 371 371 371 371 371 371 371 371 371 371 371 371 371 371 371 371 371 371 371 371 371 371 371 371 371 371 371 371
6261C71%J%%%%%%%%%%%%J%%%%%%%%%%%%%%%%%%%%%%%%%%%%%%j%%%%%%%%%%%%%%%J%%%%%%%
$$ 371 371 372 372 372 372 372 372 372 372 372 372 372 372 372 373 373 373 373 373 373 373 373 373 373 373 373 373 373 373 373 373 373 373 373 373 373 373 373 373 373 373 373 373 373 373 372 372 372 372 372 372 372 372 372 372 372 372 372 372 372 372 373 373 373 373 373 373 373 373
6253C73%%%%%%%%%%%%%%%%%%%%%%%%%%%%%%%%%%%%%%%J%%%%%%%%%%%%%%%%%%%%%j%%%%%%%
$$ 373 373 373 373 373 373 373 373 373 373 373 373 373 373 373 373 373 373 373 373 373 373 373 373 373 373 373 373 373 373 373 373 373 373 373 373 373 373 373 373 374 374 374 374 374 374 374 374 374 374 374 374 374 374 374 374 374 374 374 374 374 374 373 373 373 373 373 373 373 373
6246C73%%%%%%%%%%%%%%%%%%%%%%%%%%%%%%j%%%%%%%%%%%%%%%%%%%j%%%%%%%%%%%%%%%%%%
$$ 373 373 373 373 373 373 373 373 373 373 373 373 373 373 373 373 373 373 373 373 373 373 373 373 373 373 373 373 373 373 373 372 372 372 372 372 372 372 372 372 372 372 372 372 372 372 372 372 372 372 372 371 371 371 371 371 371 371 371 371 371 371 371 371 371 371 371 371 371 371
6239C71%%%j%%%%%%%%%%%%j%%%%%%%%%%%j%%%%%%%%%%%%%%%%%%%%%%%%%J%%%%%%%%%%j%%%
$$ 371 371 371 371 370 370 370 370 370 370 370 370 370 370 370 370 370 369 369 369 369 369 369 369 369 369 369 369 369 368 368 368 368 368 368 368 368 368 368 368 368 368 368 368 368 368 368 368 368 368 368 368 368 368 368 369 369 369 369 369 369 369 369 369 369 369 368 368 368 368
6231C68%%%%%%%%%%%j%%%%%%%%%%%%%%%%%%%%%%%%%%%%%%%%%%%%%%%J%%%%%%%%%%%%%J%%%
$$ 368 368 368 368 368 368 368 368 368 368 368 368 367 367 367 367 367 367 367 367 367 367 367 367 367 367 367 367 367 367 367 367 367 367 367 367 367 367 367 367 367 367 367 367 367 367 367 367 367 367 367 367 368 368 368 368 368 368 368 368 368 368 368 368 368 368 369 369 369 369
6224C69%%%%%%%%%%%%%%%%%%%%%%%%%%%%%%%%%%%%%%%%%%%%%%%J%%%%%%%%%%%%%%%%%%%%%
$$ 369 369 369 369 369 369 369 369 369 369 369 369 369 369 369 369 369 369 369 369 369 369 369 369 369 369 369 369 369 369 369 369 369 369 369 369 369 369 369 369 369 369 369 369 369 369 369 369 370 370 370 370 370 370 370 370 370 370 370 370 370 370 370 370 370 370 370 370 370 370
6217C70%%%j%%%%%%%%%%%%%%%%%%j%%%%%%%%%%%%%%%%%%%J%%%%%%%%%%%%%%%%%J%%%%%%%%
$$ 370 370 370 370 369 369 369 369 369 369 369 369 369 369 369 369 369 369 369 369 369 369 369 368 368 368 368 368 368 368 368 368 368 368 368 368 368 368 368 368 368 368 368 369 369 369 369 369 369 369 369 369 369 369 369 369 369 369 369 369 369 370 370 370 370 370 370 370 370 370
6209C70%%%%%%%%%%%%%%%%%%%%%%%%%%J%%%%j%%%%%%%%%%%%%J%%%%%%%%%J%%%%%%%%%%%%J
$$ 370 370 370 370 370 370 370 370 370 370 370 370 370 370 370 370 370 370 370 370 370 370 370 370 370 370 370 371 371 371 371 371 370 370 370 370 370 370 370 370 370 370 370 370 370 370 371 371 371 371 371 371 371 371 371 371 372 372 372 372 372 372 372 372 372 372 372 372 372 373
6202C73%%%%%%%%%%%%%%%%%%%%%%%%%%J%%%%%%%%%%%%%%%%%%%%%%%%%%%%%%%%%%%%%%%%%%
$$ 373 373 373 373 373 373 373 373 373 373 373 373 373 373 373 373 373 373 373 373 373 373 373 373 373 373 373 374 374 374 374 374 374 374 374 374 374 374 374 374 374 374 374 374 374 374 374 374 374 374 374 374 374 374 374 374 374 374 374 374 374 374 374 374 374 374 374 374 374 374
6195C74%%%j%%%%%%%%%%%%%%%%%%%%%j%%%%%%%%%%%%%%%%%%%%%%%%%%%%%%%%%%%%%%%%%%%
$$ 374 374 374 374 373 373 373 373 373 373 373 373 373 373 373 373 373 373 373 373 373 373 373 373 373 373 372 372 372 372 372 372 372 372 372 372 372 372 372 372 372 372 372 372 372 372 372 372 372 372 372 372 372 372 372 372 372 372 372 372 372 372 372 372 372 372 372 372 372 372
6188C72%%%%%%%%%%%%J%%%%%%%%%%%%%%%%%%%%%%%%%%%J%%%%%%%%%%%%%%%%%%%%%j%%%%%%
$$ 372 372 372 372 372 372 372 372 372 372 372 372 372 373 373 373 373 373 373 373 373 373 373 373 373 373 373 373 373 373 373 373 373 373 373 373 373 373 373 373 373 374 374 374 374 374 374 374 374 374 374 374 374 374 374 374 374 374 374 374 374 374 374 373 373 373 373 373 373 373
6180C73%%%%%%%%%%%%%%%%%%%%%%%%%%%%%%%%%%%%%%%%%%%%%%%%%%%%%%%%%J%%%%%%%%%%%
$$ 373 373 373 373 373 373 373 373 373 373 373 373 373 373 373 373 373 373 373 373 373 373 373 373 373 373 373 373 373 373 373 373 373 373 373 373 373 373 373 373 373 373 373 373 373 373 373 373 373 373 373 373 373 373 373 373 373 373 374 374 374 374 374 374 374 374 374 374 374 374
6173C74%%%%%%%%%%%%%%%%%%%%%%%%%%%%%%%%%%%J%%%%%%%%%%%%%%%%%%%%%%%%%%%%%%%%%
$$ 374 374 374 374 374 374 374 374 374 374 374 374 374 374 374 374 374 374 374 374 374 374 374 374 374 374 374 374 374 374 374 374 374 374 374 374 375 375 375 375 375 375 375 375 375 375 375 375 375 375 375 375 375 375 375 375 375 375 375 375 375 375 375 375 375 375 375 375 375 375
6166C75%%%%%%%%%%%%%%%j%%%%%%%%%%%%j%%%%%%%%%%%j%%%%%%%%%%%%%%%%%%%%%%%%%%%%
$$ 375 375 375 375 375 375 375 375 375 375 375 375 375 375 375 375 374 374 374 374 374 374 374 374 374 374 374 374 374 373 373 373 373 373 373 373 373 373 373 373 373 372 372 372 372 372 372 372 372 372 372 372 372 372 372 372 372 372 372 372 372 372 372 372 372 372 372 372 372 372
6158C72%%%%%%%%%%%%%%%%%%%%%%%%%%%%%%%%%%%%%%%%%%%%%%%%%%%%%%j%%%%%%%%%%%%%%
$$ 372 372 372 372 372 372 372 372 372 372 372 372 372 372 372 372 372 372 372 372 372 372 372 372 372 372 372 372 372 372 372 372 372 372 372 372 372 372 372 372 372 372 372 372 372 372 372 372 372 372 372 372 372 372 372 371 371 371 371 371 371 371 371 371 371 371 371 371 371 371
6151C71%%%%%%j%%%%%%%j%%%%%%%%%%%j%%%%%%%%%%%%%%%%%%%%%%%%%J%%%%%%%%%%%%%%%%
$$ 371 371 371 371 371 371 371 370 370 370 370 370 370 370 370 369 369 369 369 369 369 369 369 369 369 369 369 368 368 368 368 368 368 368 368 368 368 368 368 368 368 368 368 368 368 368 368 368 368 368 368 368 368 369 369 369 369 369 369 369 369 369 369 369 369 369 369 369 369 369
6144C69%%%jJ%%%%%%%%%%%%%%%%%J%%%%%%%%%%%%J%%%%%%%%%%%%%%%%%%%%%%%%%%%%%%%J%
$$ 369 369 369 369 368 369 369 369 369 369 369 369 369 369 369 369 369 369 369 369 369 369 369 370 370 370 370 370 370 370 370 370 370 370 370 370 371 371 371 371 371 371 371 371 371 371 371 371 371 371 371 371 371 371 371 371 371 371 371 371 371 371 371 371 371 371 371 371 372 372
6136C72%%%%%%%%%J%%%%%%%%%J%%%%%%%%%%%%%%%%%%%%%%%%%%%%%%%%%%%%%%j%%%%%%%%%%
$$ 372 372 372 372 372 372 372 372 372 372 373 373 373 373 373 373 373 373 373 373 374 374 374 374 374 374 374 374 374 374 374 374 374 374 374 374 374 374 374 374 374 374 374 374 374 374 374 374 374 374 374 374 374 374 374 374 374 374 374 373 373 373 373 373 373 373 373 373 373 373
6129C73%%%%%%J%%%%%%%%%%%%%%%%%J%%%%%%%%%%%j%%%%%%%J%%%%%%%%%%%%j%%%%%%%%%%%
$$ 373 373 373 373 373 373 373 374 374 374 374 374 374 374 374 374 374 374 374 374 374 374 374 374 374 375 375 375 375 375 375 375 375 375 375 375 375 374 374 374 374 374 374 374 374 375 375 375 375 375 375 375 375 375 375 375 375 375 374 374 374 374 374 374 374 374 374 374 374 374
6122C74%%J%%%%%%%%%%%%%%%%%%%%%%J%%%%%%%%%%%%%%%%%%%%%%%%%j%%%%%%%%%%%%%%%%%
$$ 374 374 374 375 375 375 375 375 375 375 375 375 375 375 375 375 375 375 375 375 375 375 375 375 375 375 376 376 376 376 376 376 376 376 376 376 376 376 376 376 376 376 376 376 376 376 376 376 376 376 376 376 375 375 375 375 375 375 375 375 375 375 375 375 375 375 375 375 375 375
6114C75j%%%%%%%%%%%%j%%%%%%%%%%%%%%%%%%%%%%%%%%%%%%%%%%%%%%%J%%%%%%%%%%%%J%%
$$ 375 374 374 374 374 374 374 374 374 374 374 374 374 374 373 373 373 373 373 373 373 373 373 373 373 373 373 373 373 373 373 373 373 373 373 373 373 373 373 373 373 373 373 373 373 373 373 373 373 373 373 373 373 373 374 374 374 374 374 374 374 374 374 374 374 374 374 375 375 375
6107C75%%%%%%%%%%%%%%%%%%%%%%%%j%%%%%%%%%%%%%%%%%%%%%%%%%%%%%%%%%%%%%%%j%%%%
$$ 375 375 375 375 375 375 375 375 375 375 375 375 375 375 375 375 375 375 375 375 375 375 375 375 375 374 374 374 374 374 374 374 374 374 374 374 374 374 374 374 374 374 374 374 374 374 374 374 374 374 374 374 374 374 374 374 374 374 374 374 374 374 374 374 374 373 373 373 373 373
6100C73%%%%%%%%%%%%%%%%%%J%%%%%%%%%%%%%%%%%%%%%J%%%%%%%%%J%%%%%%%J%%%%%%%J%%
$$ 373 373 373 373 373 373 373 373 373 373 373 373 373 373 373 373 373 373 373 374 374 374 374 374 374 374 374 374 374 374 374 374 374 374 374 374 374 374 374 374 374 375 375 375 375 375 375 375 375 375 375 376 376 376 376 376 376 376 376 377 377 377 377 377 377 377 377 378 378 378
6092C78%%%%%%%%%%%%%%%%%%%%%%%%%%%%%%%%%%%%%%%J%%%%%%%%%%%%%%%%%%J%%%%%%%J%%
$$ 378 378 378 378 378 378 378 378 378 378 378 378 378 378 378 378 378 378 378 378 378 378 378 378 378 378 378 378 378 378 378 378 378 378 378 378 378 378 378 378 379 379 379 379 379 379 379 379 379 379 379 379 379 379 379 379 379 379 379 380 380 380 380 380 380 380 380 381 381 381
6085C81%%%%%J%%%%%%%%%%%%%%%%%%%%%%%%%%%%%%%%%%J%%%%%%%j%%%%%%%%%%%%%%%%J%%%
$$ 381 381 381 381 381 381 382 382 382 382 382 382 382 382 382 382 382 382 382 382 382 382 382 382 382 382 382 382 382 382 382 382 382 382 382 382 382 382 382 382 382 383 383 383 383 383 383 383 383 382 382 382 382 382 382 382 382 382 382 382 382 382 382 382 382 382 383 383 383 383
6078C83%%%%%%%%%%%%%%%%%%%%%%%%%%%J%%%%%%%%%%%%%%%%%%%%J%%%%%%%%%%%%J%%%%%%%
$$ 383 383 383 383 383 383 383 383 383 383 383 383 383 383 383 383 383 383 383 383 383 383 383 383 383 383 383 383 384 384 384 384 384 384 384 384 384 384 384 384 384 384 384 384 384 384 384 384 384 385 385 385 385 385 385 385 385 385 385 385 385 385 386 386 386 386 386 386 386 386
6071C86J%%%%%J%%%J%%J%%J%J%J%%J%J%JJ%JJJ%JJJJJJKJKJKKKLKLLLMMMNNNNOONONNOMNM
$$ 386 387 387 387 387 387 387 388 388 388 388 389 389 389 390 390 390 391 391 392 392 393 393 393 394 394 395 395 396 397 397 398 399 400 400 401 402 403 404 405 406 408 409 411 412 414 416 418 421 423 426 429 432 436 440 444 449 454 459 464 470 476 481 487 492 497 503 507 512 516
6063E16MMLLLKKKJJJ%%jjjjkkklklllkljkj%%%JKKKKLKLLKLKKKJJJJ%%%jjkjlklmlmnmnon
$$ 516 520 524 527 530 533 535 537 539 540 541 542 542 542 541 540 539 538 536 534 532 529 527 524 521 518 516 513 512 510 509 509 509 509 510 512 514 516 518 521 523 526 529 531 534 536 538 540 541 542 543 544 544 544 544 543 542 540 539 536 534 531 527 524 520 515 511 506 500 495
6056D95ononnnnnmmlmlllklkkjkkjjjjjjjjjj%j%j%j%j%j%%j%%j%%%j%%%j%%%%j%%%%j%%%
$$ 495 489 484 478 473 468 463 458 453 449 445 442 438 435 432 429 427 424 422 420 419 417 415 414 413 412 411 410 409 408 407 406 405 405 404 404 403 403 402 402 401 401 400 400 400 399 399 399 398 398 398 398 397 397 397 397 396 396 396 396 396 395 395 395 395 395 394 394 394 394
6049C94%%j%%%%%%%j%%%%%%%%%%%%%%%%%%%%%%%%%%%%%%%%%%%%%%%%%%%%%%%%%%%%j%%%%%
$$ 394 394 394 393 393 393 393 393 393 393 393 392 392 392 392 392 392 392 392 392 392 392 392 392 392 392 392 392 392 392 392 392 392 392 392 392 392 392 392 392 392 392 392 392 392 392 392 392 392 392 392 392 392 392 392 392 392 392 392 392 392 392 392 392 391 391 391 391 391 391
6041C91%%%%%%%j%%%%%%%%%%J%%%%%%%%%%J%%%%%J%%%%%%J%%%%%%%%J%%%%%%%%%%%%%%%%%
$$ 391 391 391 391 391 391 391 391 390 390 390 390 390 390 390 390 390 390 390 391 391 391 391 391 391 391 391 391 391 391 392 392 392 392 392 392 393 393 393 393 393 393 393 394 394 394 394 394 394 394 394 394 395 395 395 395 395 395 395 395 395 395 395 395 395 395 395 395 395 395
6034C95%%%%%%%%%%%J%%%%%J%%%J%%%%J%%%J%%%J%%%J%%%%%J%%%%%%%J%%%%%%%%%%%J%%%%
$$ 395 395 395 395 395 395 395 395 395 395 395 395 396 396 396 396 396 396 397 397 397 397 398 398 398 398 398 399 399 399 399 400 400 400 400 401 401 401 401 402 402 402 402 402 402 403 403 403 403 403 403 403 403 404 404 404 404 404 404 404 404 404 404 404 404 405 405 405 405 405
6027D05%%%%J%%%%%%%J%%%%%J%%%%%%J%%%%%%%%%%%J%%%%%%J%%%J%%J%%J%%J%%J%%J%%%J%
$$ 405 405 405 405 405 406 406 406 406 406 406 406 406 407 407 407 407 407 407 408 408 408 408 408 408 408 409 409 409 409 409 409 409 409 409 409 409 409 410 410 410 410 410 410 410 411 411 411 411 412 412 412 413 413 413 414 414 414 415 415 415 416 416 416 417 417 417 417 418 418
6019D18%%%J%%%%J%%%%%%J%%%%J%%%J%%J%%J%J%J%J%J%J%J%J%J%J%J%%J%J%J%J%%J%J%J%%
$$ 418 418 418 418 419 419 419 419 419 420 420 420 420 420 420 420 421 421 421 421 421 422 422 422 422 423 423 423 424 424 424 425 425 426 426 427 427 428 428 429 429 430 430 431 431 432 432 433 433 434 434 435 435 435 436 436 437 437 438 438 439 439 439 440 440 441 441 442 442 442
6012D42J%J%J%J%J%J%J%J%JJ%JJ%JJ%JJJ%JJJ%J%JJ%JJ%JJ%JJ%JJ%JJJ%JJJJJJJJJJJJJJJ
$$ 442 443 443 444 444 445 445 446 446 447 447 448 448 449 449 450 450 451 452 452 453 454 454 455 456 456 457 458 459 459 460 461 462 462 463 463 464 465 465 466 467 467 468 469 469 470 471 471 472 473 473 474 475 476 476 477 478 479 480 481 482 483 484 485 486 487 488 489 490 491
6005D91JJJJJKJJJJJJJJJJJJKJJJJJJJKJJJKJKJKJKJKKJKKJKJKKJKKJKKKJKKKKKKKKKKKKK
$$ 491 492 493 494 495 496 498 499 500 501 502 503 504 505 506 507 508 509 510 512 513 514 515 516 517 518 519 521 522 523 524 526 527 529 530 532 533 535 536 538 540 541 543 545 546 548 549 551 553 554 556 558 559 561 563 565 566 568 570 572 574 576 578 580 582 584 586 588 590 592
5997E92KKKKLKKKKKLKKKKLKKKKKKKKKKKKLKKLLKLLLMLLMMMMMMNMNMNNMNMNMMMMLMLKLKJKJ
$$ 592 594 596 598 600 603 605 607 609 611 613 616 618 620 622 624 627 629 631 633 635 637 639 641 643 645 647 649 651 654 656 658 661 664 666 669 672 675 679 682 685 689 693 697 701 705 709 714 718 723 727 732 737 741 746 750 755 759 763 767 771 774 778 781 783 786 788 789 791 792
5990G92JJ%%%%%%%j%j%j%%%%%JJJKKKLMLNMNNOOPOPPQPQPQQQQQRRRJ0RJ0J1J0J2J1J2J2J3
$$ 792 793 794 794 794 794 794 794 794 794 793 793 792 792 791 791 791 791 791 791 792 793 794 796 798 800 803 807 810 815 819 824 829 835 841 848 854 861 868 876 883 891 898 906 914 922 930 938 947 956 965 975 984 994 1005 1015 1027 1038 1050 1062 1075
5984A075J3J5J4J6J7J7J9K0K1K2K3K5K7K8L0L2L3L6L8M0M2M5M7M9N2N4N7O0O3O5O9P1P5P9
$$ 1075 1088 1103 1117 1133 1150 1167 1186 1206 1227 1249 1272 1297 1324 1352 1382 1414 1447 1483 1521 1561 1603 1648 1695 1744 1796 1850 1907 1967 2030 2095 2164 2235 2310 2389
5980B389Q2Q6R1R4R9J04J09J15J20J27J33J40J49J57J67J78J89K03K18K34K52K73K97L22L52
$$ 2389 2471 2557 2648 2742 2841 2945 3054 3169 3289 3416 3549 3689 3838 3995 4162 4340 4529 4732 4950 5184 5436 5709 6006 6328 6680
5978F680L84M21M62N06N56O09O66P26P86Q46R03R53R95J025J043J046J037J014R83R43Q99
$$ 6680 7064 7485 7947 8453 9009 9618 10284 11010 11796 12642 13545 14498 15493 16518 17561 18607 19644 20658 21641 22584 23483
5975B3483Q49P98P42O84O24N60M95M29L61K94K26J57Q9K3m2j03j63k20k77l32l85m36m79n14
$$ 23483 24332 25130 25872 26556 27180 27740 28235 28664 29025 29319 29545 29702 29791 29814 29772 29669 29506 29286 29009 28677 28292 27856 27377 26863
5973B6863n36n44n32n04m58l95l17k26j28k4P9J79K70L49M12M60M92N09N13N06M90M68M38
$$ 26863 26327 25783 25251 24747 24289 23894 23577 23351 23223 23199 23278 23457 23727 24076 24488 24948 25440 25949 26462 26968 27458 27926 28364
5970B8364M02L61L13K61K05J46Q4K0m5j12j79k46l13l79m44n10n77o45p15p83q50r09r61j001
$$ 28364 28766 29127 29440 29701 29906 30052 30136 30156 30111 29999 29820 29574 29261 28882 28438 27928 27351 26706 25991 25208 24358 23449 22488 21487
5968B1487j027j041j040j028j003r70r29q82q33p81p28o77o26n78n32m88m49m11l76l45l17
$$ 21487 20460 19419 18379 17351 16348 15378 14449 13567 12734 11953 11225 10548 9922 9344 8812 8324 7875 7464 7088 6743 6426
5966F426k91k67k47k27k11j96j82j70j58j49j40j31j24j17j11j05j00r6r1q7q4q1p7p5p2o9
$$ 6426 6135 5868 5621 5394 5183 4987 4805 4635 4477 4328 4188 4057 3933 3816 3705 3600 3500 3404 3313 3226 3142 3061 2984 2909 2837 2768
5963B768o7o5o2o1n8n6n4n2n0m8m6m5m3m2m0l9l7l7l5l4l3l2l2l0l0k9k9k7k7k6k6k5k4k4
$$ 2768 2701 2636 2574 2513 2455 2399 2345 2293 2243 2195 2149 2104 2061 2019 1979 1940 1903 1866 1831 1797 1764 1732 1700 1670 1640 1611 1582 1555 1528 1502 1476 1451 1427 1403
5959A403k3k2k2k1k1k0k0j9j9j8j7j6j6j5j4j4j3j2j2j1j2j0j1j1j1j0j1j1j0j1j2j1j1j2
$$ 1403 1380 1358 1336 1315 1294 1274 1254 1235 1216 1198 1181 1165 1149 1134 1120 1106 1093 1081 1069 1058 1046 1036 1025 1014 1003 993 982 971 961 950 938 927 916 904
5956I04j2j1j3j2j2j2j2j2j2j2j2j2j1j2j1j1j1j1j0j0j0rrqppponnnmllllkkkkjkjkjjkj
$$ 904 892 881 868 856 844 832 820 808 796 784 772 760 749 737 726 715 704 693 683 673 663 654 645 637 630 623 616 610 605 600 595 591 588 585 582 579 577 575 573 571 570 568 567 565 564 563 561 560
5951E60kjjkjkkjkkkkkkkkkkkkljkkkkjkkjjkjjkjjjjjjjjjjj%jjj%jjj%jj%jjj%j%jj%j%
$$ 560 558 557 556 554 553 551 549 548 546 544 542 540 538 536 534 532 530 528 526 524 521 520 518 516 514 512 511 509 507 506 505 503 502 501 499 498 497 496 495 494 493 492 491 490 489 488 488 487 486 485 485 484 483 482 482 481 480 480 479 478 477 477 476 476 475 474 474 473 473
5943D73j%j%j%j%j%jj%j%j%j%jj%j%j%%j%j%%j%%%%%j%%%%%%%j%%%j%%j%j%%j%j%j%j%j%j
$$ 473 472 472 471 471 470 470 469 469 468 468 467 466 466 465 465 464 464 463 463 462 461 461 460 460 459 459 459 458 458 457 457 457 456 456 456 456 456 456 455 455 455 455 455 455 455 455 454 454 454 454 453 453 453 452 452 451 451 451 450 450 449 449 448 448 447 447 446 446 445
5936D45%j%%j%j%%j%%%j%%%%%j%%%j%%%j%%j%%j%%%j%j%%j%%j%%j%%j%%%j%%%j%%%%%%%j%
$$ 445 445 444 444 444 443 443 442 442 442 441 441 441 441 440 440 440 440 440 440 439 439 439 439 438 438 438 438 437 437 437 436 436 436 435 435 435 435 434 434 433 433 433 432 432 432 431 431 431 430 430 430 429 429 429 429 428 428 428 428 427 427 427 427 427 427 427 427 426 426
5929D26%%%%%%%%%%%%%%%j%%%%j%%j%%j%%j%%j%j%%j%%%j%%%%%%%%%j%%%%%%%%j%%%%%j%%
$$ 426 426 426 426 426 426 426 426 426 426 426 426 426 426 426 426 425 425 425 425 425 424 424 424 423 423 423 422 422 422 421 421 421 420 420 419 419 419 418 418 418 418 417 417 417 417 417 417 417 417 417 417 416 416 416 416 416 416 416 416 416 415 415 415 415 415 415 414 414 414
5921D14j%%j%%j%%j%j%%j%%j%%%%j%%%%%j%%%%%%%%%%%%%%j%%%%%%%j%%%%%j%%%%%%%j%%%
$$ 414 413 413 413 412 412 412 411 411 411 410 410 409 409 409 408 408 408 407 407 407 407 407 406 406 406 406 406 406 405 405 405 405 405 405 405 405 405 405 405 405 405 405 405 404 404 404 404 404 404 404 404 403 403 403 403 403 403 402 402 402 402 402 402 402 402 401 401 401 401
5914D01%%%%%%%j%%%%%%%%%j%%%%%%j%%%%%%%j%%%%%%%j%%%%%%%j%%%%%%%%%j%%%%%%%%%%
$$ 401 401 401 401 401 401 401 401 400 400 400 400 400 400 400 400 400 400 399 399 399 399 399 399 399 398 398 398 398 398 398 398 398 397 397 397 397 397 397 397 397 396 396 396 396 396 396 396 396 395 395 395 395 395 395 395 395 395 395 394 394 394 394 394 394 394 394 394 394 394
5907C94%%%j%%%%%%%%%%%%j%%%%%%%%%%%%%%%%%%%%%%%%%%%%%%%%%%%%%%%%%%%%%%j%%%%%
$$ 394 394 394 394 393 393 393 393 393 393 393 393 393 393 393 393 393 392 392 392 392 392 392 392 392 392 392 392 392 392 392 392 392 392 392 392 392 392 392 392 392 392 392 392 392 392 392 392 392 392 392 392 392 392 392 392 392 392 392 392 392 392 392 392 391 391 391 391 391 391
5899C91%%%%%%%%%%%j%%%%%%%%%j%%%%%%%%%%%%%%%%%%%%%%%%%%%%%%%%%%%J%%%%%%%%%%%
$$ 391 391 391 391 391 391 391 391 391 391 391 391 390 390 390 390 390 390 390 390 390 390 389 389 389 389 389 389 389 389 389 389 389 389 389 389 389 389 389 389 389 389 389 389 389 389 389 389 389 389 389 389 389 389 389 389 389 389 390 390 390 390 390 390 390 390 390 390 390 390
5892C90J%%%%%%%%J%%%%%%J%%%J%%J%%J%J%%J%J%J%J%JJ%JJJJJJJJJKJKKKKKLLLLMMMNNNN
$$ 390 391 391 391 391 391 391 391 391 391 392 392 392 392 392 392 392 393 393 393 393 394 394 394 395 395 395 396 396 397 397 397 398 398 399 399 400 400 401 401 402 403 403 404 405 406 407 408 409 410 411 412 414 415 417 419 421 423 425 428 431 434 437 441 445 449 454 459 464 469
5885D69ONONNNNMNMMLLLKKKKJ%J%j%jkjkklklkllkkjk%%%JJKKKLLKLKLKKKKJJJJ%j%jjkkl
$$ 469 475 480 486 491 496 501 506 510 515 519 523 526 529 532 534 536 538 540 541 541 542 542 541 541 540 538 537 535 533 530 528 525 523 520 517 515 513 512 510 510 510 510 511 512 514 516 518 521 524 526 529 531 534 536 538 540 542 543 544 545 546 546 545 545 544 543 541 539 536
5877E36klmmmnmonnononnnnnmmlmllklkkkkkjkjjjjjjjj%jj%jj%j%j%j%j%%j%%j%%j%%%j%
$$ 536 534 531 527 523 519 514 510 504 499 494 488 483 477 472 467 462 457 452 448 444 441 437 434 431 429 426 424 422 420 418 416 415 413 412 411 410 409 408 407 406 405 405 404 403 403 402 401 401 400 400 399 399 398 398 397 397 397 396 396 396 395 395 395 394 394 394 394 393 393
5870C93%%j%%%%%%j%%%%%%j%%%%%%%%j%%%%%%%%%%%%%%%%%%j%%%%%%%%%%%%%%%%%%%%j%%%
$$ 393 393 393 392 392 392 392 392 392 392 391 391 391 391 391 391 391 390 390 390 390 390 390 390 390 390 389 389 389 389 389 389 389 389 389 389 389 389 389 389 389 389 389 389 389 388 388 388 388 388 388 388 388 388 388 388 388 388 388 388 388 388 388 388 388 388 387 387 387 387
5863C87%%%%%%%j%%%%%%%%%%%%%%%%%%%%%%%%%%%%j%%%%%%%%%%%%%%%%%%%%%%%%%%%%%J%%
$$ 387 387 387 387 387 387 387 387 386 386 386 386 386 386 386 386 386 386 386 386 386 386 386 386 386 386 386 386 386 386 386 386 386 386 386 386 386 385 385 385 385 385 385 385 385 385 385 385 385 385 385 385 385 385 385 385 385 385 385 385 385 385 385 385 385 385 385 386 386 386
5855C86%%%%%%%%%%%%%%%%%%%%%%%%%%%j%%%%%%%%%%%%%%%J%%%%%%%%%%%%%%j%%%%%%%%%%
$$ 386 386 386 386 386 386 386 386 386 386 386 386 386 386 386 386 386 386 386 386 386 386 386 386 386 386 386 386 385 385 385 385 385 385 385 385 385 385 385 385 385 385 385 385 386 386 386 386 386 386 386 386 386 386 386 386 386 386 386 385 385 385 385 385 385 385 385 385 385 385
5848C85%%%%%%%%%%%%%%%%%%%%%J%%%%%%%%%%%%%%%%%%%%%%%%%%%%%%%%%%%%%%%%J%%%%%%
$$ 385 385 385 385 385 385 385 385 385 385 385 385 385 385 385 385 385 385 385 385 385 385 386 386 386 386 386 386 386 386 386 386 386 386 386 386 386 386 386 386 386 386 386 386 386 386 386 386 386 386 386 386 386 386 386 386 386 386 386 386 386 386 386 387 387 387 387 387 387 387
5841C87%%%%%J%%%%%%%%%%%%%%%%%%%%%%%%%%%%%%%%%%%%%%%%%%%%%%%%%%%%%%J%%%%%%%%
$$ 387 387 387 387 387 387 388 388 388 388 388 388 388 388 388 388 388 388 388 388 388 388 388 388 388 388 388 388 388 388 388 388 388 388 388 388 388 388 388 388 388 388 388 388 388 388 388 388 388 388 388 388 388 388 388 388 388 388 388 388 388 389 389 389 389 389 389 389 389 389
5834C89%%%%%J%%%%%%%%J%%%%%%J%%%J%%%%J%%%%J%%%%J%%%%J%%%J%%%J%%J%%J%J%%JJ%JJ
$$ 389 389 389 389 389 389 390 390 390 390 390 390 390 390 390 391 391 391 391 391 391 391 392 392 392 392 393 393 393 393 393 394 394 394 394 394 395 395 395 395 395 396 396 396 396 396 397 397 397 397 398 398 398 398 399 399 399 400 400 400 401 401 402 402 402 403 404 404 405 406
5826D06%JJJJJJJKJKJKKKLLLLMMMNNNOOOPOOPOOONNNMLLKJ%%jklllmnnnooonoonnnnmmlll
$$ 406 406 407 408 409 410 411 412 413 415 416 418 419 421 423 425 428 431 434 437 441 445 449 454 459 464 470 476 482 489 495 501 508 514 520 526 531 536 541 545 548 551 553 554 554 554 553 551 548 545 542 538 533 528 523 517 511 505 500 494 488 483 478 473 468 464 460 457 454 451
5819D51lkkkjjjjj%%%%J%JJKJKKKLLMMMMNOOOOOOPOOONONMMLKJJ%jkkmlnmonpoopopoooon
$$ 451 448 446 444 442 441 440 439 438 437 437 437 437 437 438 438 439 440 442 443 445 447 449 452 455 459 463 467 471 476 482 488 494 500 506 512 519 525 531 537 542 548 553 557 561 564 566 567 568 568 567 565 563 559 556 551 547 541 536 529 523 517 510 504 497 491 485 479 473 468
5812D68nnmmmllllklkjkkjjkjjjj%jjj%j%j%j%j%j%%j%%%j%%%j%%%%%%%%%%j%%%%%%%%%%%
$$ 468 463 458 454 450 446 443 440 437 434 432 429 427 426 424 422 421 420 418 417 416 415 414 414 413 412 411 411 410 410 409 409 408 408 407 407 406 406 406 405 405 405 405 404 404 404 404 403 403 403 403 403 403 403 403 403 403 403 402 402 402 402 402 402 402 402 402 402 402 402
5804D02%%%%%%%%%%%%%%%%%%%%%%%%%%%%%%%%%%%%%%%J%%%%%%%%%%%%%%%%%%%%%%%%%%%J%
$$ 402 402 402 402 402 402 402 402 402 402 402 402 402 402 402 402 402 402 402 402 402 402 402 402 402 402 402 402 402 402 402 402 402 402 402 402 402 402 402 402 403 403 403 403 403 403 403 403 403 403 403 403 403 403 403 403 403 403 403 403 403 403 403 403 403 403 403 403 404 404
5797D04%%%%%%%%J%%%%%%%J%%%%%%J%%%%%J%%%%%%J%%%%%%%%%%J%%%%%%J%%%%%J%%%%%%%%
$$ 404 404 404 404 404 404 404 404 404 405 405 405 405 405 405 405 405 406 406 406 406 406 406 406 407 407 407 407 407 407 408 408 408 408 408 408 408 409 409 409 409 409 409 409 409 409 409 409 410 410 410 410 410 410 410 411 411 411 411 411 411 412 412 412 412 412 412 412 412 412
5790D12%%%%%%%%%%%%%%%%%%%%%%%%%%J%%%J%%J%%J%J%%J%J%J%%J%J%%J%J%%%J%%J%%%J%%
$$ 412 412 412 412 412 412 412 412 412 412 412 412 412 412 412 412 412 412 412 412 412 412 412 412 412 412 412 413 413 413 413 414 414 414 415 415 415 416 416 417 417 417 418 418 419 419 420 420 420 421 421 422 422 422 423 423 424 424 424 424 425 425 425 426 426 426 426 427 427 427
5782D27%J%%%J%%%%%%%J%%%%%%J%%%J%%J%%J%%J%J%J%J%%JJ%J%J%%J%J%J%%J%J%J%J%JJ%J
$$ 427 427 428 428 428 428 429 429 429 429 429 429 429 429 430 430 430 430 430 430 430 431 431 431 431 432 432 432 433 433 433 434 434 434 435 435 436 436 437 437 438 438 438 439 440 440 441 441 442 442 442 443 443 444 444 445 445 445 446 446 447 447 448 448 449 449 450 451 451 452
5775D52%JJJ%JJJJ%JJJJ%JJJ%JJJ%JJ%JJJ%JJ%JJ%JJJJJ%JJJJJJJJJJJJJ%JJJJJ%JJJJJJJ
$$ 452 452 453 454 455 455 456 457 458 459 459 460 461 462 463 463 464 465 466 466 467 468 469 469 470 471 471 472 473 474 474 475 476 476 477 478 478 479 480 481 482 483 483 484 485 486 487 488 489 490 491 492 493 494 495 496 496 497 498 499 500 501 501 502 503 504 505 506 507 508
5768E08KJJJKJKJKKKJKKKJKKJKKJKJKJJJKJJJJJJKJJJKJKJKKKJKKKLKKKKKKKKKKJKKJKJKJ
$$ 508 510 511 512 513 515 516 518 519 521 523 525 526 528 530 532 533 535 537 538 540 542 543 545 546 548 549 550 551 553 554 555 556 557 558 559 561 562 563 564 566 567 569 570 572 574 576 577 579 581 583 586 588 590 592 594 596 598 600 602 604 606 607 609 611 612 614 615 617 618
5760F18JKJKJKKKKKLKLKLMLLMLMMMMNMMNMNMNMMNMMMMLMLLLKKKJJJ%%%jjjkkklklllllklk
$$ 618 619 621 622 624 625 627 629 631 633 635 638 640 643 645 648 652 655 658 662 665 669 673 677 681 686 690 694 699 703 708 712 717 721 725 730 734 738 742 746 749 753 756 759 762 764 766 768 769 770 771 771 771 771 770 769 768 766 764 762 759 757 754 751 748 745 742 740 737 735
5753G35kkjjj%%JJKKLMMNOOOPQQRRJ0J1J1J1J2J3J3J3J4J5J5J5J6J7J7J7J8J8J8J9J9K0K0
$$ 735 733 731 730 729 728 728 728 729 730 732 734 737 741 745 750 756 762 768 775 783 791 800 809 819 830 841 852 864 877 890 903 917 932 947 962 978 995 1012 1029 1047 1065 1083 1102 1121 1141 1161
5748A161K0K1K1K1K1K2K2K2K3K3K4K4K5K5K7K7K8K9L1L2L4L6L7M0M3M5M8N1N5N9O3O7P2P7
$$ 1161 1181 1202 1223 1244 1265 1287 1309 1331 1354 1377 1401 1425 1450 1475 1502 1529 1557 1586 1617 1649 1683 1719 1756 1796 1839 1884 1932 1983 2038 2097 2160 2227 2299 2376
5745B376Q3Q8R4J01J08J15J23J32J42J52J63J75J89K03K20K38K59K81L07L35L67M03M44M88
$$ 2376 2459 2547 2641 2742 2850 2965 3088 3220 3362 3514 3677 3852 4041 4244 4464 4702 4961 5242 5549 5884 6251 6654 7098 7586
5742G586N38N93O53P17P84Q55R25R91J054J107J148J177J191J193J181J158J126J083J032
$$ 7586 8124 8717 9370 10087 10871 11726 12651 13642 14696 15803 16951 18128 19319 20512 21693 22851 23977 25060 26092
5740B6092R66Q87P92O80N53M14K68J19k7j67k98m20n34o38p36q24r05r73j029j071j096j106
$$ 26092 27058 27945 28737 29417 29970 30384 30652 30771 30744 30577 30279 29859 29325 28687 27951 27127 26222 25249 24220 23149 22053 20947
5738B0947j100j080j047j005r54q96q35p72p08o45n83n24m66m12l60l12k65k21j79j39j01
$$ 20947 19847 18767 17720 16715 15761 14865 14030 13258 12550 11905 11322 10798 10332 9920 9560 9248 8983 8762 8583 8444 8343
5736H343o4k7QM5Q2J20J59K02K45K94L46M01M62N29N98O73P51Q31R09R85J053J111J157J188
$$ 8343 8279 8252 8260 8305 8387 8507 8666 8868 9113 9407 9753 10154 10616 11145 11743 12416 13167 13998 14907 15892 16945 18056 19213 20401
5733B0401J203J205J191J167J132J087J029R58Q71P67O44N08L58K01M5j09k55l92n19o37p46
$$ 20401 21604 22809 24000 25167 26299 27386 28415 29373 30244 31011 31655 32163 32521 32722 32767 32658 32403 32011 31492 30855 30109
5731C0109q47r41j023j096j154j197j223j234j227j208j174j131j080j023r62r00q37p76p17
$$ 30109 29262 28321 27298 26202 25048 23851 22628 21394 20167 18959 17785 16654 15574 14551 13589 12689 11852 11076 10359
5729A0359o60o07n57n11m68m29l93l60l30l03k79k57k37k19k03j88j76j63j53j43j34j26j19
$$ 10359 9699 9092 8535 8024 7556 7127 6734 6374 6044 5741 5462 5205 4968 4749 4546 4358 4182 4019 3866 3723 3589 3463 3344
5726C344j12j05j00r5r0q5q2p8p4p1o8o5o3o0n7n6n3n0m9m6m5m2m0l9l7l5l3l1l0k8k6k5k3
$$ 3344 3232 3127 3027 2932 2842 2757 2675 2597 2523 2452 2384 2319 2256 2196 2139 2083 2030 1980 1931 1885 1840 1798 1758 1719 1682 1647 1614 1583 1553 1525 1499 1474 1451
5723A451k2k1j9j9j8j6j6j5j4j4j3j2j2j2j1j1j1j0j0j0j0rj0rj0rrrrrrrrrrrrj0rj0j1j0
$$ 1451 1429 1408 1389 1370 1352 1336 1320 1305 1291 1277 1264 1252 1240 1228 1217 1206 1195 1185 1175 1165 1155 1146 1136 1127 1117 1108 1099 1090 1081 1072 1063 1054 1045 1036 1027 1018 1009 999 990 980 969 959
5718I59j1j1j1j2j2j2j3j3j3j3j4j3j4j4j3j4j3j3j2j3j2j1j1j0j0j0qqqponnmmmlklkjkj
$$ 959 948 937 926 914 902 890 877 864 851 838 824 811 797 783 770 756 743 730 718 705 693 682 671 661 651 641 633 625 617 610 604 599 594 590 586 582 579 577 574 572 571 569 568
5714E68jjjj%j%j%j%jjjjjjjjjkkjkkkkkkkkkkkkkjkkjjjjjj%j%j%%j%j%%j%%jj%jj%jjj%
$$ 568 567 566 565 564 564 563 563 562 562 561 561 560 559 558 557 556 555 554 553 552 550 548 547 545 543 541 539 537 535 533 531 529 527 525 523 521 520 518 516 515 514 513 512 511 510 510 509 509 508 508 508 507 507 506 506 506 505 505 505 504 503 503 502 501 501 500 499 498 498
5706D98jjjj%jj%j%j%j%%j%%%j%%j%%j%%j%j%j%j%j%j%j%j%%%j%%%%%%%%%%j%%%%%%%j%%%
$$ 498 497 496 495 494 494 493 492 492 491 491 490 490 489 489 489 488 488 488 488 487 487 487 486 486 486 485 485 485 484 484 483 483 482 482 481 481 480 480 479 479 478 478 477 477 477 477 476 476 476 476 476 476 476 476 476 476 476 475 475 475 475 475 475 475 475 474 474 474 474
5699D74j%%j%%j%%%j%%%%%j%%%%%%%%%%%%%%%%%%j%%%%%j%%%%%%j%%%%%%%%%%%%%%%%%%%%
$$ 474 473 473 473 472 472 472 471 471 471 471 470 470 470 470 470 470 469 469 469 469 469 469 469 469 469 469 469 469 469 469 469 469 469 469 469 468 468 468 468 468 468 467 467 467 467 467 467 467 466 466 466 466 466 466 466 466 466 466 466 466 466 466 466 466 466 466 466 466 466
5692D66j%%%j%%j%j%%j%j%%j%%j%%%%%j%%%%%%%%%%%%%%%%%J%%%%%%%%%%%%J%%%%%%J%%%%
$$ 466 465 465 465 465 464 464 464 463 463 462 462 462 461 461 460 460 460 459 459 459 458 458 458 458 458 458 457 457 457 457 457 457 457 457 457 457 457 457 457 457 457 457 457 457 458 458 458 458 458 458 458 458 458 458 458 458 458 459 459 459 459 459 459 459 460 460 460 460 460
5685D60%%%%%%%j%%j%%j%%j%%j%%j%%%j%%%%j%%%%%%%%%%%%%%%%%%%%%%%%%%%%%%%%%%%%%
$$ 460 460 460 460 460 460 460 460 459 459 459 458 458 458 457 457 457 456 456 456 455 455 455 454 454 454 454 453 453 453 453 453 452 452 452 452 452 452 452 452 452 452 452 452 452 452 452 452 452 452 452 452 452 452 452 452 452 452 452 452 452 452 452 452 452 452 452 452 452 452
5677D52%%%%%%%%%%%%J%%%%%%%%%%J%%%%%%%J%%%%%%%%J%%%%%%%%%%%%%J%%%%%%%%%%%%J%
$$ 452 452 452 452 452 452 452 452 452 452 452 452 452 453 453 453 453 453 453 453 453 453 453 453 454 454 454 454 454 454 454 454 455 455 455 455 455 455 455 455 455 456 456 456 456 456 456 456 456 456 456 456 456 456 456 457 457 457 457 457 457 457 457 457 457 457 457 457 458 458
5670D58%%%%%J%%%%%J%%%%J%%%J%%J%%%%%%%%%%%%%%%%%j%%%%%%%%%%%J%%%%%%J%%%%J%%%
$$ 458 458 458 458 458 458 459 459 459 459 459 459 460 460 460 460 460 461 461 461 461 462 462 462 463 463 463 463 463 463 463 463 463 463 463 463 463 463 463 463 463 463 462 462 462 462 462 462 462 462 462 462 462 462 463 463 463 463 463 463 463 464 464 464 464 464 465 465 465 465
5663D65%%J%%%%J%%%J%%%J%%%J%%J%J%%J%J%JJ%JJ%JJJJJJKJJKKJKLKKLLLMMMNNNNOOPOOP
$$ 465 465 465 466 466 466 466 466 467 467 467 467 468 468 468 468 469 469 469 469 470 470 470 471 471 472 472 472 473 473 474 474 475 476 476 477 478 478 479 480 481 482 483 484 486 487 488 490 492 493 495 498 500 502 505 508 511 515 519 523 528 533 538 543 549 555 562 568 574 581
5655E81OOOONNNMLLKJ%%jkklmmmnnnononnnnnmmllllkkkjjjj%j%%J%JJJJKJLKLLLMMNNONP
$$ 581 587 593 599 605 610 615 620 624 627 630 632 633 633 633 632 630 628 625 621 617 613 608 603 598 592 587 581 576 571 566 561 556 552 548 545 542 539 536 534 532 530 529 528 527 526 526 525 525 525 526 526 527 528 529 530 532 533 536 538 541 544 547 551 555 560 565 571 576 583
5648E83OPOPPPOOOONNMLKKJ%jkklmmnnoooopooooonnnmmmlllklkkjkjjjjjj%j%j%j%%%%%%
$$ 583 589 596 602 609 616 623 629 635 641 647 652 657 661 664 666 668 669 669 668 666 664 661 657 653 648 643 637 631 625 619 612 606 600 594 588 582 577 572 567 563 559 555 552 549 546 544 541 539 537 536 534 533 532 531 530 529 528 528 527 527 526 526 525 525 525 525 525 525 525
5641E25%%%%%%%%J%%%%J%%%J%%%J%%%J%%J%%%J%%J%%J%%J%J%%J%J%%J%J%%J%J%%J%%J%J%J
$$ 525 525 525 525 525 525 525 525 525 526 526 526 526 526 527 527 527 527 528 528 528 528 529 529 529 529 530 530 530 531 531 531 531 532 532 532 533 533 533 534 534 534 535 535 536 536 536 537 537 538 538 538 539 539 540 540 540 541 541 542 542 542 543 543 543 544 544 545 545 546
5633E46%%J%J%J%%J%J%J%J%%J%J%J%J%J%J%J%J%JJ%J%J%JJ%J%JJ%JJ%JJ%JJ%JJ%JJJ%JJ%J
$$ 546 546 546 547 547 548 548 549 549 549 550 550 551 551 552 552 553 553 553 554 554 555 555 556 556 557 557 558 558 559 559 560 560 561 561 562 563 563 564 564 565 565 566 567 567 568 568 569 570 570 571 572 572 573 574 574 575 576 576 577 578 578 579 580 581 581 582 583 583 584
5626E84JJ%JJJ%JJJJ%JJJ%JJJ%JJJJ%JJJJJ%JJJJJJJJJJJJJJJJJJJJJJJJJJJJJJJJJJKJJJ
$$ 584 585 586 586 587 588 589 589 590 591 592 593 593 594 595 596 596 597 598 599 599 600 601 602 603 603 604 605 606 607 608 608 609 610 611 612 613 614 615 616 617 618 619 620 621 622 623 624 625 626 627 628 629 630 631 632 633 634 635 636 637 638 639 640 641 642 644 645 646 647
5619F47JJJJJJKJJJKJJKJKKJKKJKKKKKKKLKLKLLLLLLMLLMLLMLLKLKKJJJJ%%%%%j%%%j%%%J
$$ 647 648 649 650 651 652 653 655 656 657 658 660 661 662 664 665 667 669 670 672 674 675 677 679 681 683 685 687 689 692 694 697 699 702 705 708 711 714 717 721 724 727 731 734 737 741 744 747 749 752 754 756 757 758 759 760 760 760 760 760 760 759 759 759 759 758 758 758 758 759
5611G59%%JJ%JJJJJKJJKJKJKKKJKKKKLKKKLKLKLKLLLLLLLMLMMMMMMMNMNMNMMMMLLLLKKKJK
$$ 759 759 759 760 761 761 762 763 764 765 766 768 769 770 772 773 775 776 778 780 782 783 785 787 789 791 794 796 798 800 803 805 808 810 813 815 818 821 824 827 830 833 836 840 843 847 851 855 859 863 867 871 876 880 885 889 894 898 902 906 910 913 916 919 922 924 926 928 929 931
5604I31JJJJ%JJJJKJKJKKKKKKLKLKLLLLLLLLLLMLLMLMMLMMMMLMMMMNMMMNMNMNMNNMNNNNNN
$$ 931 932 933 934 935 935 936 937 938 939 941 942 944 945 947 949 951 953 955 957 960 962 965 967 970 973 976 979 982 985 988 991 994 997 1001 1004 1007 1011 1014 1018 1022 1025 1029 1033 1037 1041 1044 1048 1052 1056 1060 1065 1069 1073 1077 1082 1086 1091 1095 1100 1104 1109 1114 1118 1123 1128 1133 1138 1143 1148
5597A148NNNNNONNONONOOONOOOOOOPOOPOPOPPOPPPPQPPQPQPQQQQQQQQRQRRQRRRRJ0RJ0RJ0
$$ 1148 1153 1158 1163 1168 1173 1179 1184 1189 1195 1200 1206 1211 1217 1223 1229 1234 1240 1246 1252 1258 1264 1270 1277 1283 1289 1296 1302 1309 1315 1322 1329 1335 1342 1349 1356 1363 1371 1378 1385 1393 1400 1408 1415 1423 1431 1439 1447 1455 1463 1471 1479 1488 1496 1505 1514 1522 1531 1540 1549 1558 1568 1577 1587 1596 1606
5590A606J0J0J0J0J0J0J1J0J1J1J1J1J1J2J1J2J1J2J2J3J2J2J3J3J3J3J3J4J3J4J4J4J4J5
$$ 1606 1616 1626 1636 1646 1656 1666 1677 1687 1698 1709 1720 1731 1742 1754 1765 1777 1788 1800 1812 1825 1837 1849 1862 1875 1888 1901 1914 1928 1941 1955 1969 1983 1997 2012
5586B012J5J5J5J5J5J6J6J6J6J7J7J7J7J7J8J8J8J9J8J9K0J9K0K0K1K0K1K2K1K2K3K2K3K3
$$ 2012 2027 2042 2057 2072 2087 2103 2119 2135 2151 2168 2185 2202 2219 2236 2254 2272 2290 2309 2327 2346 2366 2385 2405 2425 2446 2466 2487 2509 2530 2552 2575 2597 2620 2643
5583B643K4K4K5K4K6K5K6K6K7K7K8K8K8K9K9L0L0L1L1L1L2L3L3L4L4L5L5L6L6L7L7L8L9L9
$$ 2643 2667 2691 2716 2740 2766 2791 2817 2843 2870 2897 2925 2953 2981 3010 3039 3069 3099 3130 3161 3192 3224 3257 3290 3324 3358 3393 3428 3464 3500 3537 3574 3612 3651 3690
5579C690M0M0M1M2M2M3M4M4M5M5M7M6M8M8M9N0N0N1N2N2N4N3N5N5N6N7N7N9N8O0O0O1O2O2
$$ 3690 3730 3770 3811 3853 3895 3938 3982 4026 4071 4116 4163 4209 4257 4305 4354 4404 4454 4505 4557 4609 4663 4716 4771 4826 4882 4939 4996 5055 5113 5173 5233 5294 5356 5418
5576E418O3O4O4O5O6O6O7O7O8O9O9P0P0P0P1P2P2P2P2P3P3P3P3P3P4P3P4P3P4P3P3P2P3P2
$$ 5418 5481 5545 5609 5674 5740 5806 5873 5940 6008 6077 6146 6216 6286 6356 6427 6499 6571 6643 6715 6788 6861 6934 7007 7080 7154 7227 7301 7374 7448 7521 7594 7666 7739 7811
5572G811P1P1P1P0O9O9O8O7O6O6O4O4O3O1O1N9N9N7N6N5N3N2N1M9M7M5M3M2M0L8L5L5L2L1
$$ 7811 7882 7953 8024 8094 8163 8232 8300 8367 8433 8499 8563 8627 8690 8751 8812 8871 8930 8987 9043 9098 9151 9203 9254 9303 9350 9395 9438 9480 9520 9558 9593 9628 9660 9691
5568I691K9K8K6K5K4K2K1J9J8J6J5J3J2J1RRPPONNMMMLLKLKKJKJKJJ%J%%%%%jjkkkkllmmm
$$ 9691 9720 9748 9774 9799 9823 9845 9866 9885 9903 9919 9934 9947 9959 9970 9979 9988 9995 10002 10008 10013 10018 10022 10026 10030 10033 10036 10038 10041 10043 10045 10046 10048 10049 10051 10052 10053 10053 10054 10054 10054 10054 10054 10054 10053 10052 10050 10048 10046 10044 10041 10038 10034 10030 10026
5563A0026noopqqj0j2j2j5j6j9k0k3k5k6k9l1l2l4l6l7l9m1m3m4m7m9n1n4n5n8n9o1o3o5o5
$$ 10026 10021 10015 10009 10002 9994 9986 9976 9964 9952 9937 9921 9902 9882 9859 9834 9808 9779 9748 9716 9682 9646 9609 9570 9529 9486 9442 9395 9346 9295 9241 9186 9128 9069 9008 8945 8880 8815
5559H815o7o8o9o9p1p1p1p2p2p3p3p3p4p4p4p4p4p4p4p4p4p3p4p3p3p3p2p2p2p1p1p0o9o9
$$ 8815 8748 8680 8611 8542 8471 8400 8329 8257 8185 8112 8039 7966 7892 7818 7744 7670 7596 7522 7448 7374 7300 7227 7153 7080 7007 6934 6862 6790 6718 6647 6576 6506 6437 6368
5555F368o8o7o7o6o5o5o3o4o2o2o1o1o1o0o0n9o0n8n8n8n7n6n6n5n4n4n3n2n3n2n1n2n0n1
$$ 6368 6300 6233 6166 6100 6035 5970 5907 5843 5781 5719 5658 5597 5536 5476 5416 5357 5297 5239 5181 5123 5066 5010 4954 4899 4845 4791 4738 4686 4633 4581 4530 4478 4428 4377
5551D377n0n0m9m9m7m8m6m6m5m4m4m3m2m1m1m0l9l9l8l7l7l6l6l5l4l4l4l3l2l2l1l1l1l0
$$ 4377 4327 4277 4228 4179 4132 4084 4038 3992 3947 3903 3859 3816 3774 3733 3692 3652 3613 3574 3536 3499 3462 3426 3390 3355 3321 3287 3253 3220 3188 3156 3125 3094 3063 3033
5548C033l0k9k8k9k8k7k7k7k6k6k6k5k5k5k4k4k3k3k3k3k2k2k1k1k1k1k0k0k0k0j9j9j9j8
$$ 3033 3003 2974 2946 2917 2889 2862 2835 2808 2782 2756 2730 2705 2680 2655 2631 2607 2584 2561 2538 2515 2493 2471 2450 2429 2408 2387 2367 2347 2327 2307 2288 2269 2250 2232
5544B232j8j8j8j8j7j7j7j6j6j7j5j6j6j5j5j5j4j5j4j4j4j4j3j4j3j3j3j3j2j2j3j2j2j1
$$ 2232 2214 2196 2178 2160 2143 2126 2109 2093 2077 2060 2045 2029 2013 1998 1983 1968 1954 1939 1925 1911 1897 1883 1870 1856 1843 1830 1817 1804 1792 1780 1767 1755 1743 1732
5541A732j2j2j1j1j1j1j1j0j1j0j0j0j0j0j0rj0rj0rrrrqrqrqqrqqpqqpqpqppppppoppoop
$$ 1732 1720 1708 1697 1686 1675 1664 1653 1643 1632 1622 1612 1602 1592 1582 1572 1563 1553 1544 1534 1525 1516 1507 1498 1490 1481 1473 1464 1456 1448 1439 1431 1423 1416 1408 1400 1393 1385 1378 1370 1363 1356 1349 1342 1335 1328 1322 1315 1308 1302 1296 1289
5535A289oooooonoononnonnnnnnnnnmnnmnmnmnmmnmmmmmmmmmmmlmmlmmlmlmlmllmlllllll
$$ 1289 1283 1277 1271 1265 1259 1253 1248 1242 1236 1231 1225 1220 1215 1209 1204 1199 1194 1189 1184 1179 1174 1169 1164 1160 1155 1150 1146 1141 1137 1132 1128 1123 1119 1115 1110 1106 1102 1098 1094 1090 1086 1082 1078 1074 1070 1066 1063 1059 1055 1052 1048 1044 1041 1037 1034 1030 1027 1023 1020 1017 1013 1010 1007 1004 1001 998 995 992
5528I92lllkllklklkkkkkkkkkjkjjjjjjjj%%j%%%%%%%%%j%jkjkkllllmlmlmlmlmlllllklk
$$ 992 989 986 983 981 978 975 973 970 968 965 963 961 959 957 955 953 951 949 947 946 944 943 942 941 940 939 938 937 936 936 936 935 935 935 935 935 935 935 935 935 935 934 934 933 931 930 928 926 923 920 917 914 910 907 903 900 896 893 889 886 882 879 876 873 870 867 865 862 860
5521H60lkkkkkkkjkkjjkjjkjjjjjjj%j%j%j%%%%%%%%J%JJJJJKJKJKJKJJJ%Jj%jjjkjkkklk
$$ 860 857 855 853 851 849 847 845 843 842 840 838 837 836 834 833 832 830 829 828 827 826 825 824 823 823 822 822 821 821 820 820 820 820 820 820 820 820 820 821 821 822 823 824 825 826 828 829 831 832 834 835 837 838 839 840 840 841 840 840 839 838 837 835 834 832 830 828 825 823
5513H23kklkkkkjkjkjjjj%jj%j%j%j%%j%%%%%%%%%%%%%%%%%%%%%%J%JJ%JJJJJKJJKJKKJKK
$$ 823 821 819 816 814 812 810 808 807 805 804 802 801 800 799 798 798 797 796 796 795 795 794 794 793 793 793 792 792 792 792 792 792 792 792 792 792 792 792 792 792 792 792 792 792 792 792 792 792 792 793 793 794 795 795 796 797 798 799 800 802 803 804 806 807 809 811 812 814 816
5506H16LKKKLKKKKKKKKKJKJKJJJJ%%%%%jj%jjj%jj%jjjjkjjjjj%%%JJKKLKLLMLMMNNNOOOP
$$ 816 819 821 823 825 828 830 832 834 836 838 840 842 844 846 847 849 850 852 853 854 855 856 856 856 856 856 856 855 854 854 853 852 851 851 850 849 849 848 847 846 845 843 842 841 840 839 838 838 838 838 839 840 842 844 847 849 852 855 859 862 866 870 875 880 885 891 897 903 910
5499I10QPRQRRJ0RJ0J0J0J0J1J0J1J1J0J1J1J1J1J1J1J1J2J1J1J1J1J1J1J2J2J3J3J4J5J5
$$ 910 918 925 934 942 951 960 970 979 989 999 1009 1019 1030 1040 1051 1062 1072 1083 1094 1105 1116 1127 1138 1149 1161 1172 1183 1194 1205 1216 1227 1239 1251 1264 1277 1291 1306 1321
5495A321J7J7J8K0K0K1K3K4K6K8L0L3L6L8M2M5M9N2N5N8O2O5O8P3P7Q2Q8R4J01J10J20J30
$$ 1321 1338 1355 1373 1393 1413 1434 1457 1481 1507 1535 1565 1598 1634 1672 1714 1759 1808 1860 1915 1973 2035 2100 2168 2241 2318 2400 2488 2582 2683 2793 2913 3043
5491C043J41J55J69J85K03K23K45K70K98L29L63M00M41M82N25N67O04O35O56O63O53O28N84
$$ 3043 3184 3339 3508 3693 3896 4119 4364 4634 4932 5261 5624 6024 6465 6947 7472 8039 8643 9278 9934 10597 11250 11878 12462
5489A2462N26M58L84L10K43J86J42J14R7R1R2R4R3Q2N9K2l0r3j67k42l15l83m39m83n14n31
$$ 12462 12988 13446 13830 14140 14383 14569 14711 14825 14922 15013 15105 15199 15292 15374 15433 15455 15425 15332 15165 14923 14608 14225 13786 13303 12789 12258
5486A2258n36n30n14m91m63m31l96l61l24k89k52k18j85j52j21r0o0l1lK6N5Q4J13J45J77
$$ 12258 11722 11192 10678 10187 9724 9293 8897 8536 8212 7923 7671 7453 7268 7116 6995 6905 6845 6814 6811 6837 6892 6976 7089 7234 7411
5484G411K11K48K86L30L76M27M84N46O13O86P65Q47R30J012J086J150J194J217J210J173J104
$$ 7411 7622 7870 8156 8486 8862 9289 9773 10319 10932 11618 12383 13230 14160 15172 16258 17408 18602 19819 21029 22202 23306
5481B3306J007Q87P54O18M87L70K76K05J59J33J23J18J11R3N6nr0k00l27m66o05p39q58r57
$$ 23306 24313 25200 25954 26572 27059 27429 27705 27910 28069 28202 28325 28443 28554 28647 28703 28698 28608 28408 28081 27615 27010 26271 25413 24456
5479B4456j033j086j114j122j109j082j043r94r39q80q20p59o98o38n81n27m74m25l78l35
$$ 24456 23423 22337 21223 20101 18992 17910 16867 15873 14934 14054 13234 12475 11777 11139 10558 10031 9557 9132 8754 8419
5477H419k94k57k21j88j57j26r8p0m1j4J5M5P5J09J44J81K21K65L10L57M05M51M93N30N56
$$ 8419 8125 7868 7647 7459 7302 7176 7078 7008 6967 6953 6968 7013 7088 7197 7341 7522 7743 8008 8318 8675 9080 9531 10024 10554 11110
5474A1110N68N65N45N07M52L88L16K44J77J20P7M6L0K4K5K9L0K1Kl2q1j43k13k89l62m31m90
$$ 11110 11678 12243 12788 13295 13747 14135 14451 14695 14872 14992 15069 15115 15145 15169 15194 15223 15253 15274 15276 15244 15163 15020 14807 14518 14156 13725 13235
5471A3235n38n71n92o02o00n89n71n49n21m93m62m32m01l71l43l15k90k65k42k22k03j86j70
$$ 13235 12697 12126 11534 10932 10332 9743 9172 8623 8102 7609 7147 6715 6314 5943 5600 5285 4995 4730 4488 4266 4063 3877 3707
5469C707j56j45j33j24j15j07j01r4q9q3p8p5p0o7o4o1n9n6n5n2n0m8m6m5m2m0l8l7l5l3l2
$$ 3707 3551 3406 3273 3149 3034 2927 2826 2732 2643 2560 2482 2407 2337 2270 2206 2145 2086 2030 1975 1923 1873 1825 1779 1734 1692 1652 1614 1577 1542 1509 1477
5465A477l2l0k9k8k8k7k6k4k4k3k2k1j9j8j8j6j5j5j3j3j2j1j1j0rqrpppoooononnononon
$$ 1477 1445 1415 1386 1358 1330 1303 1277 1253 1229 1206 1184 1163 1144 1126 1108 1092 1077 1062 1049 1036 1024 1013 1002 992 983 975 966 959 952 945 939 933 927 921 916 910 905 900 894 889 883 878 872 867
5461H67ononnnnnnnnooppppqqqpqpppopoopopopopoononmnmlmlllklkkkkjjkjj%jjj%jjjj
$$ 867 861 856 850 845 840 835 830 825 820 815 810 804 798 791 784 777 770 762 754 746 739 731 724 717 710 704 697 691 685 678 672 665 659 652 646 639 633 627 622 616 611 607 602 598 595 591 588 585 582 580 577 575 573 571 569 568 567 565 564 563 563 562 561 560 560 559 558 557 556
5453E56jjjjjjjjjjjjjjkjjkjjkjkjjjjjjjjjjjjjjjj%jjj%jj%j%jj%jjjj%jjjj%jj%j%j%
$$ 556 555 554 553 552 551 550 549 548 547 546 545 544 543 542 540 539 538 536 535 534 532 531 529 528 527 526 525 524 523 522 521 520 519 518 517 516 515 514 513 513 512 511 510 510 509 508 508 507 507 506 505 505 504 503 502 501 501 500 499 498 497 497 496 495 495 494 494 493 493
5446D93j%%j%%j%j%%j%%%j%%%j%j%j%j%jj%j%j%%j%j%j%j%%j%j%j%j%%j%j%%j%%j%%j%j%%
$$ 493 492 492 492 491 491 491 490 490 489 489 489 488 488 488 488 487 487 487 487 486 486 485 485 484 484 483 483 482 481 481 480 480 479 479 479 478 478 477 477 476 476 475 475 475 474 474 473 473 472 472 471 471 471 470 470 469 469 469 468 468 468 467 467 467 466 466 465 465 465
5439D65j%%j%%%j%%%j%%%%j%%%%j%%%j%%j%%j%%j%%%j%%%%j%%%%%j%%%j%%%j%%%j%%%j%%j
$$ 465 464 464 464 463 463 463 463 462 462 462 462 461 461 461 461 461 460 460 460 460 460 459 459 459 459 458 458 458 457 457 457 456 456 456 455 455 455 455 454 454 454 454 454 453 453 453 453 453 453 452 452 452 452 451 451 451 451 450 450 450 450 449 449 449 449 448 448 448 447
5431D47%j%%j%j%j%%j%j%%j%%%j%%%%j%%%j%%%j%%%%j%%%j%%%%j%%%%%%j%%%%j%%%%%%j%%
$$ 447 447 446 446 446 445 445 444 444 443 443 443 442 442 441 441 441 440 440 440 440 439 439 439 439 439 438 438 438 438 437 437 437 437 436 436 436 436 436 435 435 435 435 434 434 434 434 434 433 433 433 433 433 433 433 432 432 432 432 432 431 431 431 431 431 431 431 430 430 430
5424D30%%%j%%%j%%%j%%%j%%%%j%%%%j%%%%%j%%%%%j%%%j%%%j%%%j%%%j%%%j%%%%j%%%%%%
$$ 430 430 430 430 429 429 429 429 428 428 428 428 427 427 427 427 426 426 426 426 426 425 425 425 425 425 424 424 424 424 424 424 423 423 423 423 423 423 422 422 422 422 421 421 421 421 420 420 420 420 419 419 419 419 418 418 418 418 417 417 417 417 417 416 416 416 416 416 416 416
5417D16%%%%%%%%%%%%%%%%%%%%%%%%%%j%%%%%%%%%%%%j%%%%%%%%%%%%%%%%%%%%%%%%J%%%%
$$ 416 416 416 416 416 416 416 416 416 416 416 416 416 416 416 416 416 416 416 416 416 416 416 416 416 416 416 415 415 415 415 415 415 415 415 415 415 415 415 415 414 414 414 414 414 414 414 414 414 414 414 414 414 414 414 414 414 414 414 414 414 414 414 414 414 415 415 415 415 415
5410D15%J%%%%J%%J%J%JJ%JJJJJJKJKKKKKLLLLLLLLLKKKJJJ%J%J%J%%%%%jjkkkklkllklkl
$$ 415 415 416 416 416 416 416 417 417 417 418 418 419 419 420 421 421 422 423 424 425 426 427 429 430 432 434 436 438 440 443 446 449 452 455 458 461 464 467 469 471 473 474 475 476 476 477 477 478 478 479 479 479 479 479 479 478 477 475 473 471 469 466 464 461 458 456 453 451 448
5402D48kkkjkjjjj%j%%%%%%JJJJJKKKKLLLMMMNNOOOOOONNNLLLKJJJJ%J%J%jjjklmmnnonoo
$$ 448 446 444 442 441 439 438 437 436 435 435 434 434 434 434 434 434 434 435 436 437 438 439 441 443 445 447 450 453 456 460 464 468 473 478 484 490 496 502 508 514 519 524 529 532 535 538 540 541 542 543 544 544 545 545 546 546 545 544 543 541 538 534 530 525 520 514 509 503 497
5395D97ononnnmmlmllkkkkkjjjj%j%j%J%%JJJJJKKKKLLKLLLKKKKJJ%J%%%J%%%%j%jkkkkll
$$ 497 491 486 480 475 470 465 461 457 454 450 447 444 442 440 438 436 434 433 432 431 430 430 429 429 428 428 429 429 429 430 431 432 433 434 436 438 440 442 445 448 450 453 456 459 461 463 465 467 468 469 469 470 470 470 470 471 471 471 471 471 470 470 469 467 465 463 461 458 455
5388D55llllmllklklkkkjkjkjjjjjj%jjj%j%j%j%j%%j%%j%%%j%%%%j%%%%%j%%%%%j%%%%%%
$$ 455 452 449 446 443 439 436 433 431 428 426 423 421 419 417 416 414 413 411 410 409 408 407 406 405 405 404 403 402 402 401 401 400 400 399 399 398 398 398 397 397 397 396 396 396 396 395 395 395 395 395 394 394 394 394 394 394 393 393 393 393 393 393 392 392 392 392 392 392 392
5380C92j%%%%%%%%j%%%%%%%%%%j%%%%%%%%%%%%%%%%%%%%j%%%%%%%%%%%%%%%%%%%%%j%%%%%
$$ 392 391 391 391 391 391 391 391 391 391 390 390 390 390 390 390 390 390 390 390 390 389 389 389 389 389 389 389 389 389 389 389 389 389 389 389 389 389 389 389 389 389 388 388 388 388 388 388 388 388 388 388 388 388 388 388 388 388 388 388 388 388 388 388 387 387 387 387 387 387
5373C87%%%%%%%%%%%%%%%%%%%%j%%%%%%%%%%%%%%%j%%%%%%%%%%%%%%j%%%%%%%%%%%%%%%%%
$$ 387 387 387 387 387 387 387 387 387 387 387 387 387 387 387 387 387 387 387 387 387 386 386 386 386 386 386 386 386 386 386 386 386 386 386 386 386 385 385 385 385 385 385 385 385 385 385 385 385 385 385 385 384 384 384 384 384 384 384 384 384 384 384 384 384 384 384 384 384 384
5366C84%%%%%%j%%%%%%%%%%%%%%j%%%%%%%%%%%%%%%%%j%%%%%%%%%%%j%%%%%%%j%%%%%%%%j
$$ 384 384 384 384 384 384 384 383 383 383 383 383 383 383 383 383 383 383 383 383 383 383 382 382 382 382 382 382 382 382 382 382 382 382 382 382 382 382 382 382 381 381 381 381 381 381 381 381 381 381 381 381 380 380 380 380 380 380 380 380 379 379 379 379 379 379 379 379 379 378
5358C78%%%%%%%%%%%%%%%%%%%%%%%%%%j%%%%%%%%%%%%%%%%%%%j%%%%%%%%%%%%%%%j%%%%%%
$$ 378 378 378 378 378 378 378 378 378 378 378 378 378 378 378 378 378 378 378 378 378 378 378 378 378 378 378 377 377 377 377 377 377 377 377 377 377 377 377 377 377 377 377 377 377 377 377 376 376 376 376 376 376 376 376 376 376 376 376 376 376 376 376 375 375 375 375 375 375 375
5351C75%%%%%%J%%%%%%%%%%%%%%%%%%%%%%%%%j%%%%%%%%%%%%%%%%%%%%%%%%%%%%%%%%%j%%
$$ 375 375 375 375 375 375 375 376 376 376 376 376 376 376 376 376 376 376 376 376 376 376 376 376 376 376 376 376 376 376 376 376 376 375 375 375 375 375 375 375 375 375 375 375 375 375 375 375 375 375 375 375 375 375 375 375 375 375 375 375 375 375 375 375 375 375 375 374 374 374
5344C74%%%%%%%%J%%%%%%%%%%%%%%%%%%%J%%%%%%%%%%%j%%%%%%%%%%%%%%%%%%%%%j%%%%%%
$$ 374 374 374 374 374 374 374 374 374 375 375 375 375 375 375 375 375 375 375 375 375 375 375 375 375 375 375 375 375 376 376 376 376 376 376 376 376 376 376 376 376 375 375 375 375 375 375 375 375 375 375 375 375 375 375 375 375 375 375 375 375 375 375 374 374 374 374 374 374 374
5336C74%%%%%%%%%j%%%%%%%%%%%%%%%%%J%%%%%%%%%%%%%%%%%%%%%%%%%j%%%%%%%%j%%%%%%
$$ 374 374 374 374 374 374 374 374 374 374 373 373 373 373 373 373 373 373 373 373 373 373 373 373 373 373 373 373 374 374 374 374 374 374 374 374 374 374 374 374 374 374 374 374 374 374 374 374 374 374 374 374 374 374 373 373 373 373 373 373 373 373 373 372 372 372 372 372 372 372
5329C72%j%%%%%%%%%%%%%%%%%%%%%%%%%%%%%%%%%%%%%%%%%%%%%%%%%%%%%%%%%j%%%%%%%%%
$$ 372 372 371 371 371 371 371 371 371 371 371 371 371 371 371 371 371 371 371 371 371 371 371 371 371 371 371 371 371 371 371 371 371 371 371 371 371 371 371 371 371 371 371 371 371 371 371 371 371 371 371 371 371 371 371 371 371 371 371 371 370 370 370 370 370 370 370 370 370 370
5322C70%%%%%j%%%%%%%%%%%%%%%%%%j%%%%%%%%%%%%%%%%%%%%%%%%%%%%%%%%%%%%%%%%%%%%
$$ 370 370 370 370 370 370 369 369 369 369 369 369 369 369 369 369 369 369 369 369 369 369 369 369 369 368 368 368 368 368 368 368 368 368 368 368 368 368 368 368 368 368 368 368 368 368 368 368 368 368 368 368 368 368 368 368 368 368 368 368 368 368 368 368 368 368 368 368 368 368
5315C68%%j%%%%%%%%%%%%%%%%%%%%J%%%%%%%%%%%%%%%%%%%%%J%%%%%%%%%%%%%%%%%%%%%%%
$$ 368 368 368 367 367 367 367 367 367 367 367 367 367 367 367 367 367 367 367 367 367 367 367 367 368 368 368 368 368 368 368 368 368 368 368 368 368 368 368 368 368 368 368 368 368 368 369 369 369 369 369 369 369 369 369 369 369 369 369 369 369 369 369 369 369 369 369 369 369 369
5307C69%%%%%%%%%%%%%%%%%%%%%%%%%%%%%%%%%%%%%%%%%%%J%%%%%%J%%%%J%%%%%%%%%%%%%
$$ 369 369 369 369 369 369 369 369 369 369 369 369 369 369 369 369 369 369 369 369 369 369 369 369 369 369 369 369 369 369 369 369 369 369 369 369 369 369 369 369 369 369 369 369 370 370 370 370 370 370 370 371 371 371 371 371 372 372 372 372 372 372 372 372 372 372 372 372 372 372
5300C72%%%%%%%%%%%%%%%%%%%%%%%%%%%%J%%%%%%%%%%%J%%%%%%%%%%%%J%%%%%%%J%%%%%J%
$$ 372 372 372 372 372 372 372 372 372 372 372 372 372 372 372 372 372 372 372 372 372 372 372 372 372 372 372 372 372 373 373 373 373 373 373 373 373 373 373 373 373 374 374 374 374 374 374 374 374 374 374 374 374 374 375 375 375 375 375 375 375 375 376 376 376 376 376 376 377 377
5293C77%%%%%%%%%%%j%%%%%%%%%%%%%%%%%%%%%%%%%%%%J%%%%%%%%%%%%%%%%%%%%%%%%%%%%
$$ 377 377 377 377 377 377 377 377 377 377 377 377 376 376 376 376 376 376 376 376 376 376 376 376 376 376 376 376 376 376 376 376 376 376 376 376 376 376 376 376 376 377 377 377 377 377 377 377 377 377 377 377 377 377 377 377 377 377 377 377 377 377 377 377 377 377 377 377 377 377
5285C77%%%%%%%%%%%%%%%%%%%%%%%%%%%%%%%%%%%%%%%%%%%%%%%%%%%%%%%%%%%%%%%%%%%%%
$$ 377 377 377 377 377 377 377 377 377 377 377 377 377 377 377 377 377 377 377 377 377 377 377 377 377 377 377 377 377 377 377 377 377 377 377 377 377 377 377 377 377 377 377 377 377 377 377 377 377 377 377 377 377 377 377 377 377 377 377 377 377 377 377 377 377 377 377 377 377 377
5278C77%J%%%%%%%%%%%%%%%%%%%%%%%%%%%%%%%J%%%%%%%%%%%%J%%%%%J%%J%%J%%J%J%J%JJ
$$ 377 377 378 378 378 378 378 378 378 378 378 378 378 378 378 378 378 378 378 378 378 378 378 378 378 378 378 378 378 378 378 378 378 378 379 379 379 379 379 379 379 379 379 379 379 379 379 380 380 380 380 380 380 381 381 381 382 382 382 383 383 383 384 384 385 385 386 386 387 388
5271C88%JJJJJJJKJKJKLKLKMLLMMMMMMMMLLLKKKJJ%J%jjkjlklklllkkkkjjj%%J%KKKKLLLM
$$ 388 388 389 390 391 392 393 394 395 397 398 400 401 403 406 408 411 413 417 420 423 427 431 435 439 443 447 451 455 458 461 464 466 468 470 471 472 472 473 473 472 471 469 468 465 463 460 458 455 452 449 447 445 443 441 440 439 438 438 438 439 439 441 443 445 447 450 453 456 460
5263D60LMLLLLKLKJKJJJJ%%%%j%%j%%%%%%%%%%%j%jjjjkjklkllllmllllklkjk%j%%J%KJKL
$$ 460 463 467 470 473 476 479 481 484 486 487 489 490 491 492 493 493 493 493 493 492 492 492 491 491 491 491 491 491 491 491 491 491 491 491 490 490 489 488 487 486 484 483 481 478 476 473 470 467 464 460 457 454 451 448 446 443 441 440 438 438 437 437 437 438 438 440 441 443 446
5256D46KKLLKKKKKJJ%J%%jjjkkllllmmlmlmlllllkkkkkjkjjkj%jjj%j%j%j%j%%%%j%%%%j%
$$ 446 448 450 453 456 458 460 462 464 466 467 468 468 469 469 469 468 467 466 464 462 459 456 453 450 446 442 439 435 432 428 425 422 419 416 413 411 409 407 405 403 402 400 399 398 396 395 395 394 393 392 392 391 391 390 390 389 389 388 388 388 388 388 387 387 387 387 387 386 386
5249C86%%%%%%%%j%%%%%%%%%j%%%%%%%%%%%%%%%%%%%%%%%J%%%%J%%%%%J%%%%%J%%%%%%J%%
$$ 386 386 386 386 386 386 386 386 386 385 385 385 385 385 385 385 385 385 385 384 384 384 384 384 384 384 384 384 384 384 384 384 384 384 384 384 384 384 384 384 384 384 384 385 385 385 385 385 386 386 386 386 386 386 387 387 387 387 387 387 388 388 388 388 388 388 388 389 389 389
5241C89%%%%%%%%%%%%%%%%%%%%%%%%%%%%%%%%%%%J%%%J%%%J%%J%%J%%J%%%%J%%%%%%J%%%%
$$ 389 389 389 389 389 389 389 389 389 389 389 389 389 389 389 389 389 389 389 389 389 389 389 389 389 389 389 389 389 389 389 389 389 389 389 389 390 390 390 390 391 391 391 391 392 392 392 393 393 393 394 394 394 395 395 395 395 395 396 396 396 396 396 396 396 397 397 397 397 397
5234C97%%%J%%%%%%%J%%%%%%%%J%%%%%%%%%%%%%%%%%%%%%%J%%%J%%J%%J%%J%%J%%J%%J%%J
$$ 397 397 397 397 398 398 398 398 398 398 398 398 399 399 399 399 399 399 399 399 399 400 400 400 400 400 400 400 400 400 400 400 400 400 400 400 400 400 400 400 400 400 400 400 401 401 401 401 402 402 402 403 403 403 404 404 404 405 405 405 406 406 406 407 407 407 408 408 408 409
5227D09%%J%%%J%%J%%J%%J%%J%%%J%%%%J%%%%%%J%%%%J%%J%%J%JJ%J%JJ%JJ%JJ%JJ%JJ%J%
$$ 409 409 409 410 410 410 410 411 411 411 412 412 412 413 413 413 414 414 414 415 415 415 415 416 416 416 416 416 417 417 417 417 417 417 417 418 418 418 418 418 419 419 419 420 420 420 421 421 422 423 423 424 424 425 426 426 427 428 428 429 430 430 431 432 432 433 434 434 435 435
5219D35JJ%J%JJ%JJ%J%JJJ%JJJ%JJJ%JJJ%JJ%JJ%JJ%JJ%JJ%JJJJJJJJJJJJJKJJJKJJKJJJJ
$$ 435 436 437 437 438 438 439 440 440 441 442 442 443 443 444 445 446 446 447 448 449 449 450 451 452 452 453 454 455 455 456 457 457 458 459 459 460 461 461 462 463 463 464 465 465 466 467 468 469 470 471 472 473 474 475 476 477 478 480 481 482 483 485 486 487 489 490 491 492 493
5212D93KJJJJJJJJJJJJJJKJJKJKJKKKKKJKKKKKKKKKKJKJKJKJKJJKJJKKJKKKKLKLKLLLLLML
$$ 493 495 496 497 498 499 500 501 502 503 504 505 506 507 508 509 511 512 513 515 516 518 519 521 523 525 527 529 530 532 534 536 538 540 542 544 546 548 550 551 553 554 556 557 559 560 562 563 564 566 567 568 570 572 573 575 577 579 581 584 586 589 591 594 597 600 603 606 610 613
5205F13MLMLMLMLLMLLLLLKLKKKKKKJJJJ%J%%%%%%%%%%%J%%JJ%KJKLKLMMLNMNNNNNOOOOOPO
$$ 613 617 620 624 627 631 634 638 641 644 648 651 654 657 660 663 665 668 670 672 674 676 678 680 681 682 683 684 684 685 685 685 685 685 685 685 685 685 685 685 685 686 686 686 687 688 688 690 691 693 696 698 701 705 709 712 717 721 726 731 736 741 746 752 758 764 770 776 783 789
5198G89OPOOOOOPOPPPPPQQPRQQRJ0RJ0J1J1J1J2J3J3J3J4J5J5J6J7J7J8K0K0K2K2K4K6K6K9
$$ 789 795 802 808 814 820 826 832 839 845 852 859 866 873 880 888 896 903 912 920 928 937 947 956 966 977 988 999 1011 1024 1037 1050 1064 1079 1094 1110 1127 1144 1162 1182 1202 1224 1246 1270 1296 1322 1351
5193A351L0L2L3L6L9M1M3M6N0N2N5N9O2O6P0P4P8Q3Q8R4R9J06J13J21J30J39J51J63J77J92
$$ 1351 1381 1413 1446 1482 1521 1562 1605 1651 1701 1753 1808 1867 1929 1995 2065 2139 2217 2300 2388 2482 2581 2687 2800 2921 3051 3190 3341 3504 3681 3873
5189C873K09K29K51K75L04L35L70M08M51M96N44N95O44O91P34P68P90P97P87P61P18O62N97
$$ 3873 4082 4311 4562 4837 5141 5476 5846 6254 6705 7201 7745 8340 8984 9675 10409 11177 11967 12764 13551 14312 15030 15692 16289
5187A6289N28M59L91L29K67K08J46P9Op3j58k43l25m00m62n10n41n57n56n40n13m73m25l71
$$ 16289 16817 17276 17667 17996 18263 18471 18617 18696 18702 18629 18471 18228 17903 17503 17041 16531 15990 15433 14877 14337 13824 13351 12926 12555
5184A2555l10k45j78j06l3M3J19J98K75L53M28M98N61O13O52O75O81O69O41O01N52N00M49
$$ 12555 12245 12000 11822 11716 11683 11726 11845 12043 12318 12671 13099 13597 14158 14771 15423 16098 16779 17448 18089 18690 19242 19742 20191
5182B0191M00L56L17K79K39J99J54J04N6Pl4o5q3q7p7n7l0JK9M9O0N9M6K5jl1n9q6j11j38
$$ 20191 20591 20947 21264 21543 21782 21981 22135 22239 22295 22302 22268 22203 22120 22033 21956 21899 21869 21870 21899 21948 22008 22067 22113 22138 22137 22106 22047 21961 21850 21712
5179B1712j67k02k45k96l53m15m78n35n86o24o49o60o57o41o13n75n29m77m18l57k91k24j55
$$ 21712 21545 21343 21098 20802 20449 20034 19556 19021 18435 17811 17162 16502 15845 15204 14591 14016 13487 13010 12592 12235 11944 11720 11565
5176A1565q3j1O3J38K11K82L50M10M63N01N24N31N19M90M46L93L33K72K12J55J01M8qo6j33
$$ 11565 11482 11471 11534 11672 11883 12165 12515 12925 13388 13889 14413 14944 15463 15953 16399 16792 17125 17397 17609 17764 17865 17913 17905 17839 17706
5174A7706k05k83l63m43n17n81o35o74o99p10p09o97o76o49o17n82n45n08m72m36m02l70l40
$$ 17706 17501 17218 16855 16412 15895 15314 14679 14005 13306 12596 11887 11190 10514 9865 9248 8666 8121 7613 7141 6705 6303 5933 5593
5171E593l12k85k62k41k20k02j87j71j58j46j36j26j17j09j01r5q9q3p8p2o9o4o0n7n4n2m8
$$ 5593 5281 4996 4734 4493 4273 4071 3884 3713 3555 3409 3273 3147 3030 2921 2820 2725 2636 2553 2475 2403 2334 2270 2210 2153 2099 2047 1999
5168A999m7m4m3m1l9l8l7l5l4l3l2l0l0k9k8k7k7k6k4k4k3k2k2k1j9k0j8j9j7j8j6j7j6j5
$$ 1999 1952 1908 1865 1824 1785 1747 1710 1675 1641 1608 1576 1546 1516 1487 1459 1432 1405 1379 1355 1331 1308 1286 1264 1243 1224 1204 1186 1167 1150 1132 1116 1099 1083 1068
5165A068j5j5j4j4j4j3j3j2j3j2j2j1j2j0j1rj0rqqqpppoooonnnnnmnnnnonoopoppoppppp
$$ 1068 1053 1038 1024 1010 996 983 970 958 945 933 921 910 898 888 877 868 858 849 841 833 825 818 811 804 798 792 786 780 775 770 765 760 755 751 746 741 736 731 725 720 714 708 701 695 688 681 675 668 661 654 647 640
5159F40qppqppppooonomnmmllllkkkkjkjj%jj%j%j%%j%j%j%jj%jjjjjkjjjkjjjjkjj%jjj%
$$ 640 632 625 618 610 603 596 589 582 576 570 564 559 553 549 544 540 536 533 530 527 524 522 520 518 516 515 513 512 511 511 510 509 509 508 508 507 507 507 506 506 505 505 504 504 503 502 502 501 500 499 498 497 495 494 493 492 490 489 488 487 486 484 483 482 482 481 480 479 479
5152D79jj%j%j%j%j%j%j%jjjjjjjjjjjjjjj%jj%jj%j%%j%%j%%%j%%%%j%%%j%%%j%%%j%%%j
$$ 479 478 477 477 476 476 475 475 474 474 473 473 472 472 471 471 470 469 468 467 466 465 464 463 462 461 460 459 458 457 456 456 455 454 454 453 452 452 451 451 451 450 450 450 449 449 449 449 448 448 448 448 448 447 447 447 447 446 446 446 446 445 445 445 445 444 444 444 444 443
5145D43%%%%%j%%j%%j%j%j%j%j%j%%j%j%j%%j%%j%%%%%%%%%%%%%%J%%%%%%%%%%%%j%%%%j%
$$ 443 443 443 443 443 443 442 442 442 441 441 441 440 440 439 439 438 438 437 437 436 436 435 435 435 434 434 433 433 432 432 432 431 431 431 430 430 430 430 430 430 430 430 430 430 430 430 430 430 430 431 431 431 431 431 431 431 431 431 431 431 431 431 430 430 430 430 430 429 429
5137D29%%j%%j%j%%j%j%j%j%%j%%j%%j%%j%%%%j%%%j%%%%%%%j%%%%%%%%%%%%j%%j%%j%%j%
$$ 429 429 429 428 428 428 427 427 426 426 426 425 425 424 424 423 423 422 422 422 421 421 421 420 420 420 419 419 419 418 418 418 418 418 417 417 417 417 416 416 416 416 416 416 416 416 415 415 415 415 415 415 415 415 415 415 415 415 415 414 414 414 413 413 413 412 412 412 411 411
5130D11j%%%j%%%%j%%%j%%%%%j%%%%%%j%%%%%%j%%%j%%%j%%j%%%j%%%j%%%%%%%%%%j%%%%%
$$ 411 410 410 410 410 409 409 409 409 409 408 408 408 408 407 407 407 407 407 407 406 406 406 406 406 406 406 405 405 405 405 405 405 405 404 404 404 404 403 403 403 403 402 402 402 401 401 401 401 400 400 400 400 399 399 399 399 399 399 399 399 399 399 399 398 398 398 398 398 398
5123C98%%%%%j%%%%%%%%j%%%%%j%%%%%%%%%%j%%%%%J%%%%%%%J%%%%J%%%%%%%%%%%%%%%%%j
$$ 398 398 398 398 398 398 397 397 397 397 397 397 397 397 397 396 396 396 396 396 396 395 395 395 395 395 395 395 395 395 395 395 394 394 394 394 394 394 395 395 395 395 395 395 395 395 396 396 396 396 396 397 397 397 397 397 397 397 397 397 397 397 397 397 397 397 397 397 397 396
5116C96%%%%%%%%J%%%%%J%%%%J%%%%%%%%%%%%%%%%J%%%%J%%%%J%J%%J%J%%J%J%%J%%J%%J%
$$ 396 396 396 396 396 396 396 396 396 397 397 397 397 397 397 398 398 398 398 398 399 399 399 399 399 399 399 399 399 399 399 399 399 399 399 399 399 400 400 400 400 400 401 401 401 401 401 402 402 403 403 403 404 404 405 405 405 406 406 407 407 407 408 408 408 409 409 409 410 410
5108D10J%%J%J%J%JJ%JJJJKJJKJKKJKKKKLKLKLMLMMMMMMMLLLLLKKJKJJ%%%%j%kjjkjjkj%j
$$ 410 411 411 411 412 412 413 413 414 414 415 416 416 417 418 419 420 422 423 424 426 427 429 431 432 434 436 438 440 443 445 448 450 453 457 460 464 468 472 476 480 484 488 491 494 497 500 503 505 507 508 510 511 512 512 512 512 512 511 511 509 508 507 505 504 503 501 500 500 499
5101D99%%JJJKKKLLLMLMMLMLLKKKJJ%%%jjkkkkkljkjjjj%%%%J%%%J%J%JJ%J%%%j%jjj%j%%
$$ 499 499 499 500 501 502 504 506 508 511 514 517 521 524 528 532 535 539 542 545 547 549 551 552 553 553 553 553 552 551 549 547 545 543 541 538 537 535 534 533 532 531 531 531 531 531 532 532 532 532 533 533 534 534 535 536 536 537 537 537 537 536 536 535 534 533 533 532 532 532
5094E32%JJKKLLMMMONPOPQPQRQQQQQQQQQQQPQQQQQQQRRRJ0J1J2J3J4J5J7J8J9K1K3K4K7K8
$$ 532 532 533 534 536 538 541 544 548 552 556 562 567 574 580 587 595 602 610 619 627 635 643 651 659 667 675 683 691 699 707 714 722 730 738 746 754 762 770 779 788 797 807 818 830 843 857 872 889 907 926 947 970 994 1021 1049
5088A049L1L3L5L8M1M4M8N1N5N9O5P0P7Q3R2J00J10J22J34J49J65J83K04K28K55K85L18L56
$$ 1049 1080 1113 1148 1186 1227 1271 1319 1370 1425 1484 1549 1619 1696 1779 1871 1971 2081 2203 2337 2486 2651 2834 3038 3266 3521 3806 4124 4480
5085D480L96M40M85N30N74O11O41O55O54O29N82N07M08K88J51Oj38k73l94m91n65o14o39o45
$$ 4480 4876 5316 5801 6331 6905 7516 8157 8812 9466 10095 10677 11184 11592 11880 12031 12037 11899 11626 11232 10741 10176 9562 8923 8278
5082H278o33o08n74n33m90m46m04l63l27k92k62k35k10j89j70j53j39j25j14j03r4q6p9p2
$$ 8278 7645 7037 6463 5930 5440 4994 4590 4227 3900 3608 3346 3111 2901 2712 2542 2389 2250 2125 2011 1908 1814 1728 1649 1577
5080A577o6o1n5n2m8m4m0l8l5l3l1k8k7k6k3k3k1k0j9j8j8j6j5j5j4j3j3j2j1j1j0j0rrrq
$$ 1577 1511 1450 1395 1343 1295 1251 1211 1173 1138 1105 1074 1046 1019 993 970 947 926 906 887 869 851 835 820 805 791 778 765 753 742 731 721 711 702 693 684 676
5076F76pqppooononmnmmmmlmllllllllllklllkllkklkkkkjkkkkkkkkkkkkjkkjklklmmmnno
$$ 676 669 661 654 647 641 635 629 624 618 613 609 604 600 596 592 588 585 581 578 575 572 569 566 563 560 557 554 551 549 546 543 540 538 535 532 530 528 525 523 521 519 517 516 514 512 510 508 506 504 502 500 498 496 494 492 491 489 487 486 484 481 479 476 472 468 464 459 454 448
5069D48ononnmnlmlklkkjjjj%j%%%%%%%%%%%%%%%%J%%%%J%%%j%%%jj%j%jjj%jjj%jj%j%j%
$$ 448 442 437 431 426 421 417 412 409 405 402 400 397 395 393 392 391 390 389 389 388 388 388 388 388 388 388 388 388 388 388 388 388 388 388 388 388 389 389 389 389 389 390 390 390 390 389 389 389 389 388 387 387 386 386 385 384 383 383 382 381 380 380 379 378 378 377 377 376 376
5061C76j%%%%j%%%J%%%%%%j%%%%j%%%j%%%%%j%%%%%j%%%%%%%%%%%%%%%%%%%%j%%%%j%%%%%
$$ 376 375 375 375 375 375 374 374 374 374 375 375 375 375 375 375 375 374 374 374 374 374 373 373 373 373 372 372 372 372 372 372 371 371 371 371 371 371 370 370 370 370 370 370 370 370 370 370 370 370 370 370 370 370 370 370 370 370 370 369 369 369 369 369 368 368 368 368 368 368
5054C68j%%%%%%%%%%%%%J%%%%%%%%%%%%%%j%%%%j%%%%%%%j%%%%%%%%J%%%%%j%%%%%%%%%%%
$$ 368 367 367 367 367 367 367 367 367 367 367 367 367 367 367 368 368 368 368 368 368 368 368 368 368 368 368 368 368 368 367 367 367 367 367 366 366 366 366 366 366 366 366 365 365 365 365 365 365 365 365 365 366 366 366 366 366 366 365 365 365 365 365 365 365 365 365 365 365 365
5047C65%%%%%%%j%%%%%%%%%%%%%%%%%%%%%%%%%%%%%%%%%%%%j%%%%%%%%%%%%%J%%%%%%%%%%
$$ 365 365 365 365 365 365 365 365 364 364 364 364 364 364 364 364 364 364 364 364 364 364 364 364 364 364 364 364 364 364 364 364 364 364 364 364 364 364 364 364 364 364 364 364 364 363 363 363 363 363 363 363 363 363 363 363 363 363 363 364 364 364 364 364 364 364 364 364 364 364
5039C64%%j%%%%%%%%%%%%%%%%%%J%%%%%%%%%%%%%%%%j%%%%%j%%%%%%%%%%j%%%%%%%%%%%%%
$$ 364 364 364 363 363 363 363 363 363 363 363 363 363 363 363 363 363 363 363 363 363 363 364 364 364 364 364 364 364 364 364 364 364 364 364 364 364 364 364 363 363 363 363 363 363 362 362 362 362 362 362 362 362 362 362 362 361 361 361 361 361 361 361 361 361 361 361 361 361 361
5032C61%J%%%%%%%%%%%%%%%%%%%%%%%%%%%%%%%%%%%%%%%%%%%%%j%%%%%%%%%%%%%%%%%%%%%
$$ 361 361 362 362 362 362 362 362 362 362 362 362 362 362 362 362 362 362 362 362 362 362 362 362 362 362 362 362 362 362 362 362 362 362 362 362 362 362 362 362 362 362 362 362 362 362 362 362 361 361 361 361 361 361 361 361 361 361 361 361 361 361 361 361 361 361 361 361 361 361
5025C61%%%%%%j%%%%%%%%%%%%%%%%j%%%%%%%%%%%%%%%j%%%%%%%%%%%%%%j%%%%%%%%%%%%%%
$$ 361 361 361 361 361 361 361 360 360 360 360 360 360 360 360 360 360 360 360 360 360 360 360 360 359 359 359 359 359 359 359 359 359 359 359 359 359 359 359 359 358 358 358 358 358 358 358 358 358 358 358 358 358 358 358 357 357 357 357 357 357 357 357 357 357 357 357 357 357 357
5017C57%j%%%%%%%%%%%%j%%%%%%%%%%%j%%%%%%%%%%%%%%%%%%%%%%%%%%%%%%%%%%j%%%%%%%
$$ 357 357 356 356 356 356 356 356 356 356 356 356 356 356 356 355 355 355 355 355 355 355 355 355 355 355 355 354 354 354 354 354 354 354 354 354 354 354 354 354 354 354 354 354 354 354 354 354 354 354 354 354 354 354 354 354 354 354 354 354 354 354 353 353 353 353 353 353 353 353
5010C53%%%%%%%%%%j%%%%%%%%%%%%%%%%%%%%%%%%%%%%%%%%%%%%%%%%%%%%j%%%%%J%%%%%%%
$$ 353 353 353 353 353 353 353 353 353 353 353 352 352 352 352 352 352 352 352 352 352 352 352 352 352 352 352 352 352 352 352 352 352 352 352 352 352 352 352 352 352 352 352 352 352 352 352 352 352 352 352 352 352 352 352 352 351 351 351 351 351 351 352 352 352 352 352 352 352 352
5003C52%%%%%%%%%%%%%%%%%%%%%%%%%%%%%%%%%%%%j%%%%%%%%%%%%%%%%%%%%%%%%%%%%%%%%
$$ 352 352 352 352 352 352 352 352 352 352 352 352 352 352 352 352 352 352 352 352 352 352 352 352 352 352 352 352 352 352 352 352 352 352 352 352 352 351 351 351 351 351 351 351 351 351 351 351 351 351 351 351 351 351 351 351 351 351 351 351 351 351 351 351 351 351 351 351 351 351
4995C51%%%%%%%%%%%%%%%%%%%%%%%%%%%%%%%%%%%%%%%%%%%%%%%%%%%%J%%%%%%%%%%%%%%%j
$$ 351 351 351 351 351 351 351 351 351 351 351 351 351 351 351 351 351 351 351 351 351 351 351 351 351 351 351 351 351 351 351 351 351 351 351 351 351 351 351 351 351 351 351 351 351 351 351 351 351 351 351 351 351 352 352 352 352 352 352 352 352 352 352 352 352 352 352 352 352 351
4988C51%%%%%%%%%%%%%%%%%%%%J%%%%%%%%%%%%%%%%%%%%%%%%%%%%%%J%%%%%%%%J%%%%J%%%
$$ 351 351 351 351 351 351 351 351 351 351 351 351 351 351 351 351 351 351 351 351 351 352 352 352 352 352 352 352 352 352 352 352 352 352 352 352 352 352 352 352 352 352 352 352 352 352 352 352 352 352 352 352 353 353 353 353 353 353 353 353 353 354 354 354 354 354 355 355 355 355
4981C55%J%%J%%J%J%J%JJ%JJKJJKKKKLKLMLLMLMKLKJ%%kjlllmlmllllklkkjkjjjjjjj%j%j
$$ 355 355 356 356 356 357 357 357 358 358 359 359 360 360 361 362 362 363 364 366 367 368 370 372 374 376 379 381 384 388 391 394 398 401 405 407 410 412 413 413 413 411 410 407 404 401 397 394 390 387 384 381 378 376 373 371 369 368 366 365 364 363 362 361 360 359 359 358 358 357
4974C57%%j%%j%%%%j%%%%%j%%%%%%%%%%%j%%%%%%%%%%%%%%%%%%%%%%%%%%%%%%%%%%%%%%%%
$$ 357 357 357 356 356 356 355 355 355 355 355 354 354 354 354 354 354 353 353 353 353 353 353 353 353 353 353 353 353 352 352 352 352 352 352 352 352 352 352 352 352 352 352 352 352 352 352 352 352 352 352 352 352 352 352 352 352 352 352 352 352 352 352 352 352 352 352 352 352 352
4966C52%%%%%%%%%%%%%%%%%%%%%%%%%%%%%%%%%%%%%%%%%%%%%%%%%%%%%%%%%%%%%j%%%%%%%
$$ 352 352 352 352 352 352 352 352 352 352 352 352 352 352 352 352 352 352 352 352 352 352 352 352 352 352 352 352 352 352 352 352 352 352 352 352 352 352 352 352 352 352 352 352 352 352 352 352 352 352 352 352 352 352 352 352 352 352 352 352 352 352 351 351 351 351 351 351 351 351
4959C51%%%%%%j%%%%%%%%%%%%%J%%%%%%%%%%%%%%%%%%%%%%%%j%%%%%%%j%%%%j%%%%%%%j%%
$$ 351 351 351 351 351 351 351 350 350 350 350 350 350 350 350 350 350 350 350 350 350 351 351 351 351 351 351 351 351 351 351 351 351 351 351 351 351 351 351 351 351 351 351 351 351 351 350 350 350 350 350 350 350 350 349 349 349 349 349 348 348 348 348 348 348 348 348 347 347 347
4952C47%%%%%%%%%%%%%%%%%%%%%%%%%%%%%%%%%%J%%%j%%%%%%%%%%%%%%j%%%%%%%%%%j%%%%
$$ 347 347 347 347 347 347 347 347 347 347 347 347 347 347 347 347 347 347 347 347 347 347 347 347 347 347 347 347 347 347 347 347 347 347 347 348 348 348 348 347 347 347 347 347 347 347 347 347 347 347 347 347 347 347 346 346 346 346 346 346 346 346 346 346 346 345 345 345 345 345
4944C45%J%%%%%%%%%%J%%%%%%%J%%%%%%%%%%%%%%%%%%%%%%%%%%%%%%%%%%j%%%%%%%%%%%%%
$$ 345 345 346 346 346 346 346 346 346 346 346 346 346 347 347 347 347 347 347 347 347 348 348 348 348 348 348 348 348 348 348 348 348 348 348 348 348 348 348 348 348 348 348 348 348 348 348 348 348 348 348 348 348 348 348 348 347 347 347 347 347 347 347 347 347 347 347 347 347 347
4937C47%%%%%%%%%%%%%%%%J%%%%%%%%%%%%%%%Jj%%%%%%%%%%%%j%%%%%%%%%%%%j%%%%%%%%%
$$ 347 347 347 347 347 347 347 347 347 347 347 347 347 347 347 347 347 348 348 348 348 348 348 348 348 348 348 348 348 348 348 348 348 349 348 348 348 348 348 348 348 348 348 348 348 348 348 347 347 347 347 347 347 347 347 347 347 347 347 347 346 346 346 346 346 346 346 346 346 346
4930C46%%%%%%J%%%%%%%%%%%%%%%%%%%%%%%%%%%%%%%%%%%%%%%%j%%%%%%%%%%%%%%%%%%%%%
$$ 346 346 346 346 346 346 346 347 347 347 347 347 347 347 347 347 347 347 347 347 347 347 347 347 347 347 347 347 347 347 347 347 347 347 347 347 347 347 347 347 347 347 347 347 347 347 347 347 346 346 346 346 346 346 346 346 346 346 346 346 346 346 346 346 346 346 346 346 346 346
4922C46%%%%%%%%%%%%J%%%%%%%%%%%%%%%J%%%%%%%%%%%%%%%%%%%j%%%%%%%%%%%%%%%%%%%%
$$ 346 346 346 346 346 346 346 346 346 346 346 346 346 347 347 347 347 347 347 347 347 347 347 347 347 347 347 347 347 348 348 348 348 348 348 348 348 348 348 348 348 348 348 348 348 348 348 348 348 347 347 347 347 347 347 347 347 347 347 347 347 347 347 347 347 347 347 347 347 347
4915C47%%%%J%%%%%%%%%%%%%%%J%%%%%%%%%%%%%%%%%%%%%%%%%%%%%%%%%%j%%%%%%%%%%%%%
$$ 347 347 347 347 347 348 348 348 348 348 348 348 348 348 348 348 348 348 348 348 348 349 349 349 349 349 349 349 349 349 349 349 349 349 349 349 349 349 349 349 349 349 349 349 349 349 349 349 349 349 349 349 349 349 349 349 348 348 348 348 348 348 348 348 348 348 348 348 348 348
4908C48%%%%%%%%%j%%%%%%%%%%%%%%%%%%%%%%%J%%%%%%%%%%%%%%%%%%%%%%j%%%%%%%%%%%%
$$ 348 348 348 348 348 348 348 348 348 348 347 347 347 347 347 347 347 347 347 347 347 347 347 347 347 347 347 347 347 347 347 347 347 347 348 348 348 348 348 348 348 348 348 348 348 348 348 348 348 348 348 348 348 348 348 348 348 347 347 347 347 347 347 347 347 347 347 347 347 347
4900C47%%%%%%j%%%%%%%%%%%%%%%%%%%%%%%%j%%%%%%%%%%%%%%%%%%%%%%%%%%j%%%%%%%%%%
$$ 347 347 347 347 347 347 347 346 346 346 346 346 346 346 346 346 346 346 346 346 346 346 346 346 346 346 346 346 346 346 346 346 345 345 345 345 345 345 345 345 345 345 345 345 345 345 345 345 345 345 345 345 345 345 345 345 345 345 345 344 344 344 344 344 344 344 344 344 344 344
4893C44%%%%%%%%%%%%%%%%%%%%j%%%%%%%%%%%%%%j%%%%%%%%%%%%%%%%%%%%J%%%%%%%%j%%%
$$ 344 344 344 344 344 344 344 344 344 344 344 344 344 344 344 344 344 344 344 344 344 343 343 343 343 343 343 343 343 343 343 343 343 343 343 343 342 342 342 342 342 342 342 342 342 342 342 342 342 342 342 342 342 342 342 342 342 343 343 343 343 343 343 343 343 343 342 342 342 342
4886C42%%%%%%%%%%%%%%%%%%%%%%%%%%j%%%%%%%%%%%%%%%%%%%%%%%%%%%%%%%%J%%%%%%%%%
$$ 342 342 342 342 342 342 342 342 342 342 342 342 342 342 342 342 342 342 342 342 342 342 342 342 342 342 342 341 341 341 341 341 341 341 341 341 341 341 341 341 341 341 341 341 341 341 341 341 341 341 341 341 341 341 341 341 341 341 341 341 342 342 342 342 342 342 342 342 342 342
4878C42%%%%%%%%%%%%%%%%%%%%%%%%%%%%%%%%%%%%%%%%%%%%%%%%%%J%%%%%%%%%%%%%%J%%%
$$ 342 342 342 342 342 342 342 342 342 342 342 342 342 342 342 342 342 342 342 342 342 342 342 342 342 342 342 342 342 342 342 342 342 342 342 342 342 342 342 342 342 342 342 342 342 342 342 342 342 342 342 343 343 343 343 343 343 343 343 343 343 343 343 343 343 343 344 344 344 344
4871C44%%%%%%%%%%%%%%%%%%J%%%%%%%%%%%%%%%%%%%%%%%%%%%%%%%%%%%%%%%%J%%%%%%%%%
$$ 344 344 344 344 344 344 344 344 344 344 344 344 344 344 344 344 344 344 344 345 345 345 345 345 345 345 345 345 345 345 345 345 345 345 345 345 345 345 345 345 345 345 345 345 345 345 345 345 345 345 345 345 345 345 345 345 345 345 345 345 346 346 346 346 346 346 346 346 346 346
4864C46%%%%%%%%%%%%%%%%%%%%%%%%%%%J%%%%%%%%%%%%%%%%%%%%%%%%%%%J%%%%%%%%%j%%%
$$ 346 346 346 346 346 346 346 346 346 346 346 346 346 346 346 346 346 346 346 346 346 346 346 346 346 346 346 346 347 347 347 347 347 347 347 347 347 347 347 347 347 347 347 347 347 347 347 347 347 347 347 347 347 347 347 347 348 348 348 348 348 348 348 348 348 348 347 347 347 347
4857C47%%%%%%%%%%%%%%%%%jJ%%%%%%%%%%%%%%%%%%%%%%%%%%%%%%%%%%%%%%%%%%%%%%%%%%
$$ 347 347 347 347 347 347 347 347 347 347 347 347 347 347 347 347 347 347 346 347 347 347 347 347 347 347 347 347 347 347 347 347 347 347 347 347 347 347 347 347 347 347 347 347 347 347 347 347 347 347 347 347 347 347 347 347 347 347 347 347 347 347 347 347 347 347 347 347 347 347
4849C47%%%%%%%%%%%%%%%%%%%%%%%%%%%%%%%%%%%%%%%%%%%%%%%%%%%%%%%%%%%%%j%%%%%%%
$$ 347 347 347 347 347 347 347 347 347 347 347 347 347 347 347 347 347 347 347 347 347 347 347 347 347 347 347 347 347 347 347 347 347 347 347 347 347 347 347 347 347 347 347 347 347 347 347 347 347 347 347 347 347 347 347 347 347 347 347 347 347 347 346 346 346 346 346 346 346 346
4842C46%%%%%%%%%%%%%%%%%%%%%%%%%%%%%%%%%%%%%%%%%%%%%%%%%%%%%j%%%%%%%%%%%%j%%
$$ 346 346 346 346 346 346 346 346 346 346 346 346 346 346 346 346 346 346 346 346 346 346 346 346 346 346 346 346 346 346 346 346 346 346 346 346 346 346 346 346 346 346 346 346 346 346 346 346 346 346 346 346 346 346 345 345 345 345 345 345 345 345 345 345 345 345 345 344 344 344
4835C44%%%%%j%%%%%%%%%%j%%%%%%%%%%%%%%%%%%%%J%%%%%j%%%%%%%%%%%%%%%%%%%%%%%%%
$$ 344 344 344 344 344 344 343 343 343 343 343 343 343 343 343 343 343 342 342 342 342 342 342 342 342 342 342 342 342 342 342 342 342 342 342 342 342 342 343 343 343 343 343 343 342 342 342 342 342 342 342 342 342 342 342 342 342 342 342 342 342 342 342 342 342 342 342 342 342 342
4827C42%%%%%%j%%%%%%%%%%%%%%%%%%%%%%%%%%%%%%%%%%%%%%%%%%%%%%%%%%%%%%%%%%%%%%
$$ 342 342 342 342 342 342 342 341 341 341 341 341 341 341 341 341 341 341 341 341 341 341 341 341 341 341 341 341 341 341 341 341 341 341 341 341 341 341 341 341 341 341 341 341 341 341 341 341 341 341 341 341 341 341 341 341 341 341 341 341 341 341 341 341 341 341 341 341 341 341
4820C41%%%%%%%%%%%%%%%j%%%%%%%%%%%%%%%%%%%%%%%%%%%%%%%%%%%%%%%%%%%%%%%%%%%%%
$$ 341 341 341 341 341 341 341 341 341 341 341 341 341 341 341 341 340 340 340 340 340 340 340 340 340 340 340 340 340 340 340 340 340 340 340 340 340 340 340 340 340 340 340 340 340 340 340 340 340 340 340 340 340 340 340 340 340 340 340 340 340 340 340 340 340 340 340 340 340 340
4813C40%%%%%%%%%%%%%%%%%%%%%%%%%%%%j%%%%%%%%%%%%%J%%%%%%%%%%%%%%%%%%%%%%%%%%
$$ 340 340 340 340 340 340 340 340 340 340 340 340 340 340 340 340 340 340 340 340 340 340 340 340 340 340 340 340 340 339 339 339 339 339 339 339 339 339 339 339 339 339 339 340 340 340 340 340 340 340 340 340 340 340 340 340 340 340 340 340 340 340 340 340 340 340 340 340 340 340
4805C40%%%%%%%%%%%%%%%%%%%%%%%%%%%%%%%%%%%%%%%%%%%%%%J%%%%%%%%%%%%%%%%%%%%%j
$$ 340 340 340 340 340 340 340 340 340 340 340 340 340 340 340 340 340 340 340 340 340 340 340 340 340 340 340 340 340 340 340 340 340 340 340 340 340 340 340 340 340 340 340 340 340 340 340 341 341 341 341 341 341 341 341 341 341 341 341 341 341 341 341 341 341 341 341 341 341 340
4798C40%%%%%%%%%%%%%%%%%%%%%%%%%%%%%%%%%%%%%%%%%%%%%%%j%%%%J%%%%%%%%%%%%%%%%
$$ 340 340 340 340 340 340 340 340 340 340 340 340 340 340 340 340 340 340 340 340 340 340 340 340 340 340 340 340 340 340 340 340 340 340 340 340 340 340 340 340 340 340 340 340 340 340 340 340 339 339 339 339 339 340 340 340 340 340 340 340 340 340 340 340 340 340 340 340 340 340
4791C40%%%%%%%%%%%%%%%%%%%%%%%%%%%%%%%%%%%%%%j%%%%%%%%%%%%%%%%%%%%%%%%%%%%%%
$$ 340 340 340 340 340 340 340 340 340 340 340 340 340 340 340 340 340 340 340 340 340 340 340 340 340 340 340 340 340 340 340 340 340 340 340 340 340 340 340 339 339 339 339 339 339 339 339 339 339 339 339 339 339 339 339 339 339 339 339 339 339 339 339 339 339 339 339 339 339 339
4783C39%%%%%%%%%%%%%%%%%%%%%%%%%%%%%%%%%%%%%%%%%%%%%%%%%%%%%%%%%%%%%%%%%%%%%
$$ 339 339 339 339 339 339 339 339 339 339 339 339 339 339 339 339 339 339 339 339 339 339 339 339 339 339 339 339 339 339 339 339 339 339 339 339 339 339 339 339 339 339 339 339 339 339 339 339 339 339 339 339 339 339 339 339 339 339 339 339 339 339 339 339 339 339 339 339 339 339
4776C39%%%%%%%%%%%%%%%%%%%%j%%%%%%%%%%%J%%%%%%%%%%%%%%%%%%j%%%%%%%%%%%%%%%%%
$$ 339 339 339 339 339 339 339 339 339 339 339 339 339 339 339 339 339 339 339 339 339 338 338 338 338 338 338 338 338 338 338 338 338 339 339 339 339 339 339 339 339 339 339 339 339 339 339 339 339 339 339 339 338 338 338 338 338 338 338 338 338 338 338 338 338 338 338 338 338 338
4769C38J%%%%%%%%%%%%%%%%%%%%%%%%%%%%%%%J%%%%%%%%%%%%%%%%%%%%%%%%%%%%%%%%%%%%
$$ 338 339 339 339 339 339 339 339 339 339 339 339 339 339 339 339 339 339 339 339 339 339 339 339 339 339 339 339 339 339 339 339 339 340 340 340 340 340 340 340 340 340 340 340 340 340 340 340 340 340 340 340 340 340 340 340 340 340 340 340 340 340 340 340 340 340 340 340 340 340
4761C40%%%%%%%%%%%%%%%%%%%%%%%%%%%%%%%%%%%%%%%%%%%%%%%%%%%%%%%%%%%%%%%%%%%%%
$$ 340 340 340 340 340 340 340 340 340 340 340 340 340 340 340 340 340 340 340 340 340 340 340 340 340 340 340 340 340 340 340 340 340 340 340 340 340 340 340 340 340 340 340 340 340 340 340 340 340 340 340 340 340 340 340 340 340 340 340 340 340 340 340 340 340 340 340 340 340 340
4754C40%%%%%%%%%%%%%%%%%%%%%%%%%%j%%%%%%%%%%%%%%%%%%%%%%%%%%%%%%%%%%%%%%%%%%
$$ 340 340 340 340 340 340 340 340 340 340 340 340 340 340 340 340 340 340 340 340 340 340 340 340 340 340 340 339 339 339 339 339 339 339 339 339 339 339 339 339 339 339 339 339 339 339 339 339 339 339 339 339 339 339 339 339 339 339 339 339 339 339 339 339 339 339 339 339 339 339
4747C39%%%%%%%%%%%%%%%%%%%%%%%%%%%%%%%%%%%%%%%%%%%%%%%%%%%%%%%%%%%%%%%%%%%%%
$$ 339 339 339 339 339 339 339 339 339 339 339 339 339 339 339 339 339 339 339 339 339 339 339 339 339 339 339 339 339 339 339 339 339 339 339 339 339 339 339 339 339 339 339 339 339 339 339 339 339 339 339 339 339 339 339 339 339 339 339 339 339 339 339 339 339 339 339 339 339 339
4740C39%%%%%%%%%%%%%%%%%%%%%%%%%%%%%%%%%%%%%%%%%%%%%%%%%%%%%j%%%%%%%%%%%%%%%
$$ 339 339 339 339 339 339 339 339 339 339 339 339 339 339 339 339 339 339 339 339 339 339 339 339 339 339 339 339 339 339 339 339 339 339 339 339 339 339 339 339 339 339 339 339 339 339 339 339 339 339 339 339 339 339 338 338 338 338 338 338 338 338 338 338 338 338 338 338 338 338
4732C38%%%%%%%%%%%%%%%%%%%%%%%%J%%%%%%%%%%%%%j%%%%%%%%%%%%%%%%%%%%%%%%%%%%%J
$$ 338 338 338 338 338 338 338 338 338 338 338 338 338 338 338 338 338 338 338 338 338 338 338 338 338 339 339 339 339 339 339 339 339 339 339 339 339 339 339 338 338 338 338 338 338 338 338 338 338 338 338 338 338 338 338 338 338 338 338 338 338 338 338 338 338 338 338 338 338 339
4725C39%j%%%%%%%%%%%%%%%%%%%%%%J%%%%%%%%%%%%%%%j%%%%%%%%%%%%%%%%%%%%%%%J%%%%
$$ 339 339 338 338 338 338 338 338 338 338 338 338 338 338 338 338 338 338 338 338 338 338 338 338 338 339 339 339 339 339 339 339 339 339 339 339 339 339 339 339 339 338 338 338 338 338 338 338 338 338 338 338 338 338 338 338 338 338 338 338 338 338 338 338 338 339 339 339 339 339
4718C39%%%%%%%%%%%%j%%%%%%%%%%%J%%%%%%%%%%%%%%%%%%%%%%%%%%%%%%%%%%%%%%%%%%%%
$$ 339 339 339 339 339 339 339 339 339 339 339 339 339 338 338 338 338 338 338 338 338 338 338 338 338 339 339 339 339 339 339 339 339 339 339 339 339 339 339 339 339 339 339 339 339 339 339 339 339 339 339 339 339 339 339 339 339 339 339 339 339 339 339 339 339 339 339 339 339 339
4710C39%%%%%%%%%%%%%%%%%%%%%%%%%%%%%%%%%%%%%%%%%%%%%%j%%%%%%%%%%%%%%%%%%%%%%
$$ 339 339 339 339 339 339 339 339 339 339 339 339 339 339 339 339 339 339 339 339 339 339 339 339 339 339 339 339 339 339 339 339 339 339 339 339 339 339 339 339 339 339 339 339 339 339 339 338 338 338 338 338 338 338 338 338 338 338 338 338 338 338 338 338 338 338 338 338 338 338
4703C38%%%j%%%%%%%%%%%%%%%%%%j%%%%%%%%%%%%%%%%%%%%%%%%%%%%%%%%%%%j%%%%%%%%%%
$$ 338 338 338 338 337 337 337 337 337 337 337 337 337 337 337 337 337 337 337 337 337 337 337 336 336 336 336 336 336 336 336 336 336 336 336 336 336 336 336 336 336 336 336 336 336 336 336 336 336 336 336 336 336 336 336 336 336 336 336 335 335 335 335 335 335 335 335 335 335 335
4696C35%%%%%j%%%%%%%%%%%%%%%%%%%%%%%%%%%%%%%%%%%%J%%%%%%%%%%%%%%%%%%%%%%%%%%
$$ 335 335 335 335 335 335 334 334 334 334 334 334 334 334 334 334 334 334 334 334 334 334 334 334 334 334 334 334 334 334 334 334 334 334 334 334 334 334 334 334 334 334 334 335 335 335 335 335 335 335 335 335 335 335 335 335 335 335 335 335 335 335 335 335 335 335 335 335 335 335
4688C35%%%%%%%%%%%%%%Jj%%%%%%%%J%%%%%%%%%%%%J%%%%%%%%%%%%%%%%%%%%%%%%%%%%%%%
$$ 335 335 335 335 335 335 335 335 335 335 335 335 335 335 335 336 335 335 335 335 335 335 335 335 335 336 336 336 336 336 336 336 336 336 336 336 336 336 337 337 337 337 337 337 337 337 337 337 337 337 337 337 337 337 337 337 337 337 337 337 337 337 337 337 337 337 337 337 337 337
4681C37%%%%%%%%%%%%%%%%%%%%%%%%%%%J%%%%%%%%%%%%J%%%%%%%%%%%%%%%%%%%%%j%%%%%%
$$ 337 337 337 337 337 337 337 337 337 337 337 337 337 337 337 337 337 337 337 337 337 337 337 337 337 337 337 337 338 338 338 338 338 338 338 338 338 338 338 338 338 339 339 339 339 339 339 339 339 339 339 339 339 339 339 339 339 339 339 339 339 339 339 338 338 338 338 338 338 338
4674C38%%%%%%%%%%%%%%%%%%%%%%%%%%%%%%%%%%%%%%%%%%%%%%%%%%%%j%%%%%%%%%%%%%%%%
$$ 338 338 338 338 338 338 338 338 338 338 338 338 338 338 338 338 338 338 338 338 338 338 338 338 338 338 338 338 338 338 338 338 338 338 338 338 338 338 338 338 338 338 338 338 338 338 338 338 338 338 338 338 338 337 337 337 337 337 337 337 337 337 337 337 337 337 337 337 337 337
4666C37%%%%%%%%%%%%%%%%%%%%%%%%%%%%%%%j%%%%%%%%%%%%%%%%%%%%%%%%%%%%%%%%%%%j%
$$ 337 337 337 337 337 337 337 337 337 337 337 337 337 337 337 337 337 337 337 337 337 337 337 337 337 337 337 337 337 337 337 337 336 336 336 336 336 336 336 336 336 336 336 336 336 336 336 336 336 336 336 336 336 336 336 336 336 336 336 336 336 336 336 336 336 336 336 336 335 335
4659C35%%%%%%%%%%%%%%%%%%%%%%%%%%%%%%%%%%%%%%%%%%%%%j%%%%%%%%%%%%%%%%%%%%%%%
$$ 335 335 335 335 335 335 335 335 335 335 335 335 335 335 335 335 335 335 335 335 335 335 335 335 335 335 335 335 335 335 335 335 335 335 335 335 335 335 335 335 335 335 335 335 335 335 334 334 334 334 334 334 334 334 334 334 334 334 334 334 334 334 334 334 334 334 334 334 334 334
4652C34%%%%%%%%%%J%%%%%%%j%%%%%%%J%%%j%%%%%%%%%%%%%%%%%%%%%%%%%%%%%%%%%%%%%%
$$ 334 334 334 334 334 334 334 334 334 334 334 335 335 335 335 335 335 335 335 334 334 334 334 334 334 334 334 335 335 335 335 334 334 334 334 334 334 334 334 334 334 334 334 334 334 334 334 334 334 334 334 334 334 334 334 334 334 334 334 334 334 334 334 334 334 334 334 334 334 334
4645C34%%%%%%%%%%%%%%%%%%%%%%%%%%%%%%%%%%%%%%%%%%%%%%%%%%%%j%%%%%%%%%%%J%%%%
$$ 334 334 334 334 334 334 334 334 334 334 334 334 334 334 334 334 334 334 334 334 334 334 334 334 334 334 334 334 334 334 334 334 334 334 334 334 334 334 334 334 334 334 334 334 334 334 334 334 334 334 334 334 334 333 333 333 333 333 333 333 333 333 333 333 333 334 334 334 334 334
4637C34%%%%%%%%%%%%%%%%%%%%%%%%%%%%%%%%%%%%%%J%%%%%%j%%%%%%%%%%%%%%%%%%%j%%%
$$ 334 334 334 334 334 334 334 334 334 334 334 334 334 334 334 334 334 334 334 334 334 334 334 334 334 334 334 334 334 334 334 334 334 334 334 334 334 334 334 335 335 335 335 335 335 335 334 334 334 334 334 334 334 334 334 334 334 334 334 334 334 334 334 334 334 334 333 333 333 333
4630C33%%%J%%%%%%%%%%%%%%%%%%%%%%%%%%%%%%%%%%%%%%%%%%%%%%%%%%J%j%%%%%%%J%%%%
$$ 333 333 333 333 334 334 334 334 334 334 334 334 334 334 334 334 334 334 334 334 334 334 334 334 334 334 334 334 334 334 334 334 334 334 334 334 334 334 334 334 334 334 334 334 334 334 334 334 334 334 334 334 334 334 334 335 335 334 334 334 334 334 334 334 334 335 335 335 335 335
4623C35%%%%%%%%%%%%%%%%%%%%%%J%%%%%%%%%%%%%%%%%%%%%%%j%%%%%%%%%%%%%%%%%%%%%%
$$ 335 335 335 335 335 335 335 335 335 335 335 335 335 335 335 335 335 335 335 335 335 335 335 336 336 336 336 336 336 336 336 336 336 336 336 336 336 336 336 336 336 336 336 336 336 336 336 335 335 335 335 335 335 335 335 335 335 335 335 335 335 335 335 335 335 335 335 335 335 335
4615C35%%%%%%%%%%%%J%%%j%%%%%J%%%%%%%%%%%%%%%%%%%%%%%%%%%%%%%%%%%%%%%%%%%%%%
$$ 335 335 335 335 335 335 335 335 335 335 335 335 335 336 336 336 336 335 335 335 335 335 335 336 336 336 336 336 336 336 336 336 336 336 336 336 336 336 336 336 336 336 336 336 336 336 336 336 336 336 336 336 336 336 336 336 336 336 336 336 336 336 336 336 336 336 336 336 336 336
4608C36%%%%j%%%%%%%%%%%%%%%%%%%j%%%%%%%%%%%%%%%%%%%%%%%%%%%%%%%%%%%%%%%%%%%%
$$ 336 336 336 336 336 335 335 335 335 335 335 335 335 335 335 335 335 335 335 335 335 335 335 335 335 334 334 334 334 334 334 334 334 334 334 334 334 334 334 334 334 334 334 334 334 334 334 334 334 334 334 334 334 334 334 334 334 334 334 334 334 334 334 334 334 334 334 334 334 334
4601C34%%%%%%%%%%%%%%%%%j%%%%%%%%%%%%%%%%%%%%%%%%%%%%%%%%%%%%%%%%%%%%%%%%%%%
$$ 334 334 334 334 334 334 334 334 334 334 334 334 334 334 334 334 334 334 333 333 333 333 333 333 333 333 333 333 333 333 333 333 333 333 333 333 333 333 333 333 333 333 333 333 333 333 333 333 333 333 333 333 333 333 333 333 333 333 333 333 333 333 333 333 333 333 333 333 333 333
4593C33%J%%%%%%%%%%%%%%j%%%%%%%%%%%%%%%%%%%%%%%%%%%%%%%%%%%%%%%J%%%%%%%%%%%%
$$ 333 333 334 334 334 334 334 334 334 334 334 334 334 334 334 334 334 333 333 333 333 333 333 333 333 333 333 333 333 333 333 333 333 333 333 333 333 333 333 333 333 333 333 333 333 333 333 333 333 333 333 333 333 333 333 333 333 334 334 334 334 334 334 334 334 334 334 334 334 334
4586C34%%%%%%%%%%%%%%%%%%%%%%%%%%%%%%%%%%%%%%%%%%%%%%%%%%%%%%%%%%%%%%%%%%%%%
$$ 334 334 334 334 334 334 334 334 334 334 334 334 334 334 334 334 334 334 334 334 334 334 334 334 334 334 334 334 334 334 334 334 334 334 334 334 334 334 334 334 334 334 334 334 334 334 334 334 334 334 334 334 334 334 334 334 334 334 334 334 334 334 334 334 334 334 334 334 334 334
4579C34%%%%%%%%%%%%%J%%%%%%%%%%%%%%%%%%%j%%%%%%%%%%%%%%%%%%%%%%%%%%%%%%%%%%%
$$ 334 334 334 334 334 334 334 334 334 334 334 334 334 334 335 335 335 335 335 335 335 335 335 335 335 335 335 335 335 335 335 335 335 335 334 334 334 334 334 334 334 334 334 334 334 334 334 334 334 334 334 334 334 334 334 334 334 334 334 334 334 334 334 334 334 334 334 334 334 334
4571C34%%%%%%%%%%%%%%%%j%%%J%%%%%%%%%%%%%%%%%%%%%%%%%%%%%%%%%%%%j%%%%%%%%%%%
$$ 334 334 334 334 334 334 334 334 334 334 334 334 334 334 334 334 334 333 333 333 333 334 334 334 334 334 334 334 334 334 334 334 334 334 334 334 334 334 334 334 334 334 334 334 334 334 334 334 334 334 334 334 334 334 334 334 334 334 333 333 333 333 333 333 333 333 333 333 333 333
4564C33%%%%%%%%%%%%%%%%%%j%%%%%%%%%%%%%%%J%%%%%j%%%%%%%%%%%%%%%%%%%%%%%%%%%%
$$ 333 333 333 333 333 333 333 333 333 333 333 333 333 333 333 333 333 333 333 332 332 332 332 332 332 332 332 332 332 332 332 332 332 332 332 333 333 333 333 333 333 332 332 332 332 332 332 332 332 332 332 332 332 332 332 332 332 332 332 332 332 332 332 332 332 332 332 332 332 332
4557C32%J%%%%%%%%%%%%%%%%j%%%%%%%%%%%%%%%%%%%%%%%%%%%%%%%J%%%%%%%%%%%%%%%%%%
$$ 332 332 333 333 333 333 333 333 333 333 333 333 333 333 333 333 333 333 333 332 332 332 332 332 332 332 332 332 332 332 332 332 332 332 332 332 332 332 332 332 332 332 332 332 332 332 332 332 332 332 332 333 333 333 333 333 333 333 333 333 333 333 333 333 333 333 333 333 333 333
4549C33%%%%%%%%%%%%%%%%%%%%%%%%%%%%%%%%%%%%%%%%%%%%%%%%%%%%%%%%%%%%%%%%%%%%%
$$ 333 333 333 333 333 333 333 333 333 333 333 333 333 333 333 333 333 333 333 333 333 333 333 333 333 333 333 333 333 333 333 333 333 333 333 333 333 333 333 333 333 333 333 333 333 333 333 333 333 333 333 333 333 333 333 333 333 333 333 333 333 333 333 333 333 333 333 333 333 333
4542C33%%%%%%%%%%%%j%%%%%%%%%J%%%%%%%%%%%%%%%%%%%%%%%%%%%%%%%%%%%%%%%%%%J%%%
$$ 333 333 333 333 333 333 333 333 333 333 333 333 333 332 332 332 332 332 332 332 332 332 332 333 333 333 333 333 333 333 333 333 333 333 333 333 333 333 333 333 333 333 333 333 333 333 333 333 333 333 333 333 333 333 333 333 333 333 333 333 333 333 333 333 333 333 334 334 334 334
4535C34%%%%%%%%%%%j%%%%%%%%%%%%%%%%%%%%%%%%%%%%%%%%%J%%%%%%%%%%%%%%%%%%%%%%%
$$ 334 334 334 334 334 334 334 334 334 334 334 334 333 333 333 333 333 333 333 333 333 333 333 333 333 333 333 333 333 333 333 333 333 333 333 333 333 333 333 333 333 333 333 333 333 333 334 334 334 334 334 334 334 334 334 334 334 334 334 334 334 334 334 334 334 334 334 334 334 334
4528C34%%%%%%%%j%%%%%%%%J%%%%%%%%%%%%%%J%%%%%%%%%%%%%%%%%%%%%%%%%%%%%%%%%%%%
$$ 334 334 334 334 334 334 334 334 334 333 333 333 333 333 333 333 333 333 334 334 334 334 334 334 334 334 334 334 334 334 334 334 334 335 335 335 335 335 335 335 335 335 335 335 335 335 335 335 335 335 335 335 335 335 335 335 335 335 335 335 335 335 335 335 335 335 335 335 335 335
4520C35%%%%%%%%%%%%%%%%%%%%%%%%%%%%%%%j%%%%%%%%%%%%%%%%%%%%%%%%%%%%%%%%%%%%%
$$ 335 335 335 335 335 335 335 335 335 335 335 335 335 335 335 335 335 335 335 335 335 335 335 335 335 335 335 335 335 335 335 335 334 334 334 334 334 334 334 334 334 334 334 334 334 334 334 334 334 334 334 334 334 334 334 334 334 334 334 334 334 334 334 334 334 334 334 334 334 334
4513C34%%%%%%%%%%%%%%%%%%%%%%%%%%%%%%%%%%%%%%%%%%%%%%%%%%%%%%%j%%%%%%%%%%%%%
$$ 334 334 334 334 334 334 334 334 334 334 334 334 334 334 334 334 334 334 334 334 334 334 334 334 334 334 334 334 334 334 334 334 334 334 334 334 334 334 334 334 334 334 334 334 334 334 334 334 334 334 334 334 334 334 334 334 333 333 333 333 333 333 333 333 333 333 333 333 333 333
4506C33%%%%%%%%%%%%%%%%%%%%%%%%%%%%%%%%%%%%j%%%%%%%%%%%%%%%%%%J%%%%%%%%%%%%%
$$ 333 333 333 333 333 333 333 333 333 333 333 333 333 333 333 333 333 333 333 333 333 333 333 333 333 333 333 333 333 333 333 333 333 333 333 333 333 332 332 332 332 332 332 332 332 332 332 332 332 332 332 332 332 332 332 332 333 333 333 333 333 333 333 333 333 333 333 333 333 333
4498C33j%%%%%%%%%%%%%%%%%%%%%%%%%%%%%%%%%%%%%%%%%%%%%%%%%%%%%%%%%%%%%%%%%%%%
$$ 333 332 332 332 332 332 332 332 332 332 332 332 332 332 332 332 332 332 332 332 332 332 332 332 332 332 332 332 332 332 332 332 332 332 332 332 332 332 332 332 332 332 332 332 332 332 332 332 332 332 332 332 332 332 332 332 332 332 332 332 332 332 332 332 332 332 332 332 332 332
4491C32%%%%%%%%%%%%%%%%%%%%%%%%%%%%%%%%%%%%%%%%%%%%%%%%%%%%%%%%%%%%%%%%%%%%%
$$ 332 332 332 332 332 332 332 332 332 332 332 332 332 332 332 332 332 332 332 332 332 332 332 332 332 332 332 332 332 332 332 332 332 332 332 332 332 332 332 332 332 332 332 332 332 332 332 332 332 332 332 332 332 332 332 332 332 332 332 332 332 332 332 332 332 332 332 332 332 332
4484C32%%%%%%%%%%%%%%%%%%%%%%%%%%%%%%%%%%%%%%%%%%%%%%%%%%%%%%%%%%%%%%%%%%%%%
$$ 332 332 332 332 332 332 332 332 332 332 332 332 332 332 332 332 332 332 332 332 332 332 332 332 332 332 332 332 332 332 332 332 332 332 332 332 332 332 332 332 332 332 332 332 332 332 332 332 332 332 332 332 332 332 332 332 332 332 332 332 332 332 332 332 332 332 332 332 332 332
4476C32%%%%%%%%%%%%%%%%%%%%%%%%%%%%%%%%%%%%%%%%%%%%%%%%%%%%%%%%%%%%%%%%%%%%%
$$ 332 332 332 332 332 332 332 332 332 332 332 332 332 332 332 332 332 332 332 332 332 332 332 332 332 332 332 332 332 332 332 332 332 332 332 332 332 332 332 332 332 332 332 332 332 332 332 332 332 332 332 332 332 332 332 332 332 332 332 332 332 332 332 332 332 332 332 332 332 332
4469C32%%%%%%%%%%%%%%%%%%%J%%%%%%%%%%%j%%%%%%%%%%%%%%%%%%%%%%%%%%%%%%%%%%%%%
$$ 332 332 332 332 332 332 332 332 332 332 332 332 332 332 332 332 332 332 332 332 333 333 333 333 333 333 333 333 333 333 333 333 332 332 332 332 332 332 332 332 332 332 332 332 332 332 332 332 332 332 332 332 332 332 332 332 332 332 332 332 332 332 332 332 332 332 332 332 332 332
4462C32%%%%%%%%%%%%%%%%%%%%%%%%%%%%%%%%%%J%%%%j%%%%%%%%%%%%%%%%%%%%%%%%%%%%%
$$ 332 332 332 332 332 332 332 332 332 332 332 332 332 332 332 332 332 332 332 332 332 332 332 332 332 332 332 332 332 332 332 332 332 332 332 333 333 333 333 333 332 332 332 332 332 332 332 332 332 332 332 332 332 332 332 332 332 332 332 332 332 332 332 332 332 332 332 332 332 332
4454C32%%%%%%%%%%%%%%%%%%%%%%%%%%%%%%%%%%%%%%%%%%%%%%%j%%%%%%%%%%%%%%%%%%%%%
$$ 332 332 332 332 332 332 332 332 332 332 332 332 332 332 332 332 332 332 332 332 332 332 332 332 332 332 332 332 332 332 332 332 332 332 332 332 332 332 332 332 332 332 332 332 332 332 332 332 331 331 331 331 331 331 331 331 331 331 331 331 331 331 331 331 331 331 331 331 331 331
4447C31j%%J%%%%%%%%%%%%%%%%%%%%%%%%%%%%%%%%j%%%%%%%%%%%%%%%%%%%%%%%%%%%j%%J%
$$ 331 330 330 330 331 331 331 331 331 331 331 331 331 331 331 331 331 331 331 331 331 331 331 331 331 331 331 331 331 331 331 331 331 331 331 331 331 330 330 330 330 330 330 330 330 330 330 330 330 330 330 330 330 330 330 330 330 330 330 330 330 330 330 330 330 329 329 329 330 330
4440C30%%%%%%%%%%%%%%%%%%%%%%%%j%%%%%%%%%%%%%%%%%%%%%%%%%%%%%%%%%%%%%%%%%%%%
$$ 330 330 330 330 330 330 330 330 330 330 330 330 330 330 330 330 330 330 330 330 330 330 330 330 330 329 329 329 329 329 329 329 329 329 329 329 329 329 329 329 329 329 329 329 329 329 329 329 329 329 329 329 329 329 329 329 329 329 329 329 329 329 329 329 329 329 329 329 329 329
4432C29%%%%%%%%%%%%%%%%%%%%%%%%%%%%%%%%%%%%%%%%%%%%%%%%%%%%%%%%%%%%%%%%%%%%%
$$ 329 329 329 329 329 329 329 329 329 329 329 329 329 329 329 329 329 329 329 329 329 329 329 329 329 329 329 329 329 329 329 329 329 329 329 329 329 329 329 329 329 329 329 329 329 329 329 329 329 329 329 329 329 329 329 329 329 329 329 329 329 329 329 329 329 329 329 329 329 329
4425C29%%%%%%%%%%%%J%%%%%%%%j%%%%%%%%%%%%%%%%%%%%%%%%%%%%%%%J%%%%%%%%%%%%%%%
$$ 329 329 329 329 329 329 329 329 329 329 329 329 329 330 330 330 330 330 330 330 330 330 329 329 329 329 329 329 329 329 329 329 329 329 329 329 329 329 329 329 329 329 329 329 329 329 329 329 329 329 329 329 329 329 330 330 330 330 330 330 330 330 330 330 330 330 330 330 330 330
4418C30%%%%%%%%%%%%%%%%%%%%%%%%%%%%%%%%%%%%%%J%%%%%%%%%%%%%%%%%%%%%%%%%%%%%%
$$ 330 330 330 330 330 330 330 330 330 330 330 330 330 330 330 330 330 330 330 330 330 330 330 330 330 330 330 330 330 330 330 330 330 330 330 330 330 330 330 331 331 331 331 331 331 331 331 331 331 331 331 331 331 331 331 331 331 331 331 331 331 331 331 331 331 331 331 331 331 331
4411C31%%%%%%%%%%%J%%%%%%%%%%%%%%%%%%%%%%%%%%%%%%%%%%%%%%%%%%%%j%%%%%%%%%%%%
$$ 331 331 331 331 331 331 331 331 331 331 331 331 332 332 332 332 332 332 332 332 332 332 332 332 332 332 332 332 332 332 332 332 332 332 332 332 332 332 332 332 332 332 332 332 332 332 332 332 332 332 332 332 332 332 332 332 332 331 331 331 331 331 331 331 331 331 331 331 331 331
4403C31%%%%%%%%%%%%%%%%%%%%%%%%%%%%%%%%%%%%%%%%%%%%%%%%j%%%%%%%%%%%%%%%%%%%%
$$ 331 331 331 331 331 331 331 331 331 331 331 331 331 331 331 331 331 331 331 331 331 331 331 331 331 331 331 331 331 331 331 331 331 331 331 331 331 331 331 331 331 331 331 331 331 331 331 331 331 330 330 330 330 330 330 330 330 330 330 330 330 330 330 330 330 330 330 330 330 330
4396C30%%%%%%%j%%%%%%%%%%%%%%%%%%%%%%%%%%%%%%%%%%%%%%%%%%%%%%%%%%%%%%%%%%%%%
$$ 330 330 330 330 330 330 330 330 329 329 329 329 329 329 329 329 329 329 329 329 329 329 329 329 329 329 329 329 329 329 329 329 329 329 329 329 329 329 329 329 329 329 329 329 329 329 329 329 329 329 329 329 329 329 329 329 329 329 329 329 329 329 329 329 329 329 329 329 329 329
4389C29%%%%%%%%j%%%J%%%%%%%%%%%%%%%%%%%J%%%%%%%%%%%%%%%%%%%%%%%%%%%%%%%%%%%%
$$ 329 329 329 329 329 329 329 329 329 328 328 328 328 329 329 329 329 329 329 329 329 329 329 329 329 329 329 329 329 329 329 329 329 330 330 330 330 330 330 330 330 330 330 330 330 330 330 330 330 330 330 330 330 330 330 330 330 330 330 330 330 330 330 330 330 330 330 330 330 330
4381C30%%%%%%%%%%%%%%%%%%%%%%%%%%%%%%%%%%%%%%%%%%%%%%%%%%%%%%%j%%%%%%%%%%%%%
$$ 330 330 330 330 330 330 330 330 330 330 330 330 330 330 330 330 330 330 330 330 330 330 330 330 330 330 330 330 330 330 330 330 330 330 330 330 330 330 330 330 330 330 330 330 330 330 330 330 330 330 330 330 330 330 330 330 329 329 329 329 329 329 329 329 329 329 329 329 329 329
4374C29%%%%%%%%%%%%%%%%%%%%%%%%%%%j%%%%%%%%%%%%%%%%%%%%%%%%%%%%%%%%%%%%%%%%%
$$ 329 329 329 329 329 329 329 329 329 329 329 329 329 329 329 329 329 329 329 329 329 329 329 329 329 329 329 329 328 328 328 328 328 328 328 328 328 328 328 328 328 328 328 328 328 328 328 328 328 328 328 328 328 328 328 328 328 328 328 328 328 328 328 328 328 328 328 328 328 328
4367C28%%%%%j%%%%%%%%%%%%%%%%%%%%%%%%%%%%J%%%%%%%%%%%%%j%%%%%%%%%%%%%%%J%%%%
$$ 328 328 328 328 328 328 327 327 327 327 327 327 327 327 327 327 327 327 327 327 327 327 327 327 327 327 327 327 327 327 327 327 327 327 327 328 328 328 328 328 328 328 328 328 328 328 328 328 328 327 327 327 327 327 327 327 327 327 327 327 327 327 327 327 327 328 328 328 328 328
4359C28%%%%%%j%%%%%%%%%%%%%%%%%%%%%%%%%%%%%%%%%%%%%%%%%%%%%%%%%%%%%%%%%%%%%%
$$ 328 328 328 328 328 328 328 327 327 327 327 327 327 327 327 327 327 327 327 327 327 327 327 327 327 327 327 327 327 327 327 327 327 327 327 327 327 327 327 327 327 327 327 327 327 327 327 327 327 327 327 327 327 327 327 327 327 327 327 327 327 327 327 327 327 327 327 327 327 327
4352C27%%%%%%%%%%%%%%%%%%%%%%%%%%%%%%%%%%%%%%%%%%%%%%%%%%%%%%%%%%%%%%%%%%%%%
$$ 327 327 327 327 327 327 327 327 327 327 327 327 327 327 327 327 327 327 327 327 327 327 327 327 327 327 327 327 327 327 327 327 327 327 327 327 327 327 327 327 327 327 327 327 327 327 327 327 327 327 327 327 327 327 327 327 327 327 327 327 327 327 327 327 327 327 327 327 327 327
4345C27%%%%%%%%J%%%%%%%%%%%%%%%%%%%%%%%%%%%%%%%%%%%%%%%%%%%%%%%%%%%%%%%%%%%%
$$ 327 327 327 327 327 327 327 327 327 328 328 328 328 328 328 328 328 328 328 328 328 328 328 328 328 328 328 328 328 328 328 328 328 328 328 328 328 328 328 328 328 328 328 328 328 328 328 328 328 328 328 328 328 328 328 328 328 328 328 328 328 328 328 328 328 328 328 328 328 328
4337C28%%j%%%%%%%%%%%%%%%J%%%%%%%%%%%%%%%%%%j%%%%%%%%%%%%%%%%%%%%%%%%%%%%%%%
$$ 328 328 328 327 327 327 327 327 327 327 327 327 327 327 327 327 327 327 327 328 328 328 328 328 328 328 328 328 328 328 328 328 328 328 328 328 328 328 327 327 327 327 327 327 327 327 327 327 327 327 327 327 327 327 327 327 327 327 327 327 327 327 327 327 327 327 327 327 327 327
4330C27%%%%%%%%%%%%%%%%%%%%%%%%%%%%%%%%%%%%%%%%%%%%%%%%%%%%%%%%%%%%%%%%%%%%%
$$ 327 327 327 327 327 327 327 327 327 327 327 327 327 327 327 327 327 327 327 327 327 327 327 327 327 327 327 327 327 327 327 327 327 327 327 327 327 327 327 327 327 327 327 327 327 327 327 327 327 327 327 327 327 327 327 327 327 327 327 327 327 327 327 327 327 327 327 327 327 327
4323C27%%%%%%%%%%%%%%%%%%%j%%%%%%%%%%%%%%%%%%J%%%%%%%%%%%%%%%j%%%%%%%%%%%%%%
$$ 327 327 327 327 327 327 327 327 327 327 327 327 327 327 327 327 327 327 327 327 326 326 326 326 326 326 326 326 326 326 326 326 326 326 326 326 326 326 326 327 327 327 327 327 327 327 327 327 327 327 327 327 327 327 327 326 326 326 326 326 326 326 326 326 326 326 326 326 326 326
4315C26%%%%%%%%%%%%%%%%%%%%%%%%%%%%%%%%%%%%%%%%%%%%%%%%%%%%%%%%%%%%%%%%%%%%%
$$ 326 326 326 326 326 326 326 326 326 326 326 326 326 326 326 326 326 326 326 326 326 326 326 326 326 326 326 326 326 326 326 326 326 326 326 326 326 326 326 326 326 326 326 326 326 326 326 326 326 326 326 326 326 326 326 326 326 326 326 326 326 326 326 326 326 326 326 326 326 326
4308C26%%%%%%%%%%%%%%%%%%%%%%%%%%%%%%%%%%%%%%%%%%%%%%%%%%%%%%%%%%%%%J%%%%%%%
$$ 326 326 326 326 326 326 326 326 326 326 326 326 326 326 326 326 326 326 326 326 326 326 326 326 326 326 326 326 326 326 326 326 326 326 326 326 326 326 326 326 326 326 326 326 326 326 326 326 326 326 326 326 326 326 326 326 326 326 326 326 326 326 327 327 327 327 327 327 327 327
4301C27%%j%%%%%%J%%%%%%%%%%%%%%%%%%%%%%%%%%%%%%%%%%%%%%%%%%%%%%%%%%%%%%%%%%%
$$ 327 327 327 326 326 326 326 326 326 326 327 327 327 327 327 327 327 327 327 327 327 327 327 327 327 327 327 327 327 327 327 327 327 327 327 327 327 327 327 327 327 327 327 327 327 327 327 327 327 327 327 327 327 327 327 327 327 327 327 327 327 327 327 327 327 327 327 327 327 327
4294C27%%%%%%%%%%%%%%%%%%%%%%%%%%%%%%%%%%%%%%%%%%%%%%%%%%%%%%%%%%%%%%%J%%%%%
$$ 327 327 327 327 327 327 327 327 327 327 327 327 327 327 327 327 327 327 327 327 327 327 327 327 327 327 327 327 327 327 327 327 327 327 327 327 327 327 327 327 327 327 327 327 327 327 327 327 327 327 327 327 327 327 327 327 327 327 327 327 327 327 327 327 328 328 328 328 328 328
4286C28%%%%%%%%%%%%%%%%%%%%%%%%%%%%%%%%%%%%%%%%%%%%%%%%%J%%%%%%%%%%%%%j%%%%%
$$ 328 328 328 328 328 328 328 328 328 328 328 328 328 328 328 328 328 328 328 328 328 328 328 328 328 328 328 328 328 328 328 328 328 328 328 328 328 328 328 328 328 328 328 328 328 328 328 328 328 328 329 329 329 329 329 329 329 329 329 329 329 329 329 329 328 328 328 328 328 328
$$ [...]
-2638B67
##END=		$$ NMR SPECTRUM
##END=		$$ LINK
