##TITLE=	RP297 char.10.fid
##JCAMP-DX=	6.0	$$ MestReNova 14.3.3-33362
##DATA TYPE=	LINK
##BLOCKS=	1    
##ORIGIN=	Mestrelab Research S.L.
##OWNER=	hrzepa
##$MNOVA/METADATA=	(DOCUMENT,BASE64)
eyJuYW1lIjoiL1VzZXJzL2hyemVwYS9MaWJyYXJ5L01vYmlsZSBEb2N1bWVudHMvY29tfmFwcGxlfkN
sb3VkRG9jcy9TaGVwcGFyZC9OTVIgZmlsZXMgemlwcy0yLzE0LzE0LUgubW5vdmEiLCJwYWdlcyI6W3
siaXRlbXMiOlsiMSIgICAgIF19XX0=
##TITLE=	RP297 char.10.fid
##JCAMP-DX=	6.0	$$ MestReNova 14.3.3-33362
##DATA TYPE=	NMR SPECTRUM
##DATA CLASS=	XYDATA
##BLOCK_ID=	1
##ORIGIN=	Bruker BioSpin GmbH
##OWNER=	nmrsu
##NUMDIM=	1
##$MNOVA/METADATA=	(ITEM,BASE64)
eyJhbmdsZSI6MCwiYXhlcyI6eyJ4Ijp7Im1heCI6MTYuMDY0MjU5OTk5OTM5MTI1LCJtaW4iOi0zLjc
2Njk0MjMzOTE1NjYyMjZ9LCJ5Ijp7Im1heCI6NzgzMDcuNTA0ODgyODEyNSwibWluIjotNzA0Ni40Mj
g1Mjc4MzIwMzF9fSwicG9pbnRzIjpbeyJ4Ijo1MzIxLCJ5Ijo1ODM1fSx7IngiOjg3MjIsInkiOjU4M
zV9LHsieCI6ODcyMiwieSI6ODIwOH0seyJ4Ijo1MzIxLCJ5Ijo4MjA4fSx7IngiOjUzMjEsInkiOjU4
MzV9XSwieiI6MH0=
##.OBSERVE FREQUENCY=	700.35432466099996418
##.OBSERVE NUCLEUS=	^1H
##.SOLVENT NAME=	CDCl3
##.PULSE SEQUENCE=	zg30
##LONGDATE=	2023/03/07 21:34:07.000
##.ACQUISITIONMODE=	SIMULTANEOUS (DQD)
##$ORIGINAL FORMAT=	Bruker XWIN-NMR
##$MNOVA/SCALES_VERSION=	9
##$PARAMETER FILE=	(acqus, ASCII, /private/var/folders/f6/rjf_tdyn2v98c5c0wvkgn4s80000gq/T/4lgyzj4KSc29qZ1mQlhe$A/10/acqus, 0)
$$ ##TITLE= Parameter file, TopSpin 4.1.3
$$ ##JCAMPDX= 5.0
$$ ##DATATYPE= Parameter Values
$$ ##NPOINTS= 1	$$ modification sequence number
$$ ##ORIGIN= Bruker BioSpin GmbH
$$ ##OWNER= nmrsu
$$ $$ 2023-03-07 21:34:16.082 +0000  nmrsu@CZC7167VR1
$$ $$ Z:/700/data/tds/nmr/RP297 char/10/acqus
$$ $$ process C:\Bruker\TopSpin4.1.3\prog\mod\dirdata.exe
$$ ##$ACQT0= -2.0981556054023
$$ ##$AMP= (0..31)
$$ 100 100 100 100 100 100 100 100 100 100 100 100 100 100 100 100 100 100
$$ 100 100 100 100 100 100 100 100 100 100 100 100 100 100
$$ ##$AMPCOIL= (0..32)
$$ -1 0 0 0 0 0 0 0 0 0 0 0 0 0 0 0 0 0 0 0 0 0 0 0 0 0 0 0 0 0 0 0 0
$$ ##$AQSEQ= 0
$$ ##$AQ_mod= 3
$$ ##$AUNM= <au_zg>
$$ ##$AUTOPOS= <27 >
$$ ##$BF1= 700.349999998
$$ ##$BF2= 700.349999998
$$ ##$BF3= 700.349999998
$$ ##$BF4= 700.349999998
$$ ##$BF5= 700.349999998
$$ ##$BF6= 700.349999998
$$ ##$BF7= 700.349999998
$$ ##$BF8= 700.349999998
$$ ##$BWFAC= (0..63)
$$ 0 0 0 0 0 0 0 0 0 0 0 0 0 0 0 0 0 0 0 0 0 0 0 0 0 0 0 0 0 0 0 0 0 0 0 0
$$ 0 0 0 0 0 0 0 0 0 0 0 0 0 0 0 0 0 0 0 0 0 0 0 0 0 0 0 0
$$ ##$BYTORDA= 0
$$ ##$CHANFCU= (0..24)
$$ 0 1 0 0 0 0 0 0 0 0 0 0 0 0 0 0 0 0 0 0 0 0 0 0 0
$$ ##$CHANREC= (0..24)
$$ 0 0 0 0 0 0 0 0 0 0 0 0 0 0 0 0 0 0 0 0 0 0 0 0 0
$$ ##$CHEMSTR= <none>
$$ ##$CNST= (0..63)
$$ 1 1 1 1 1 1 1 1 1 1 1 1 1 1 1 1 1 1 1 1 1 1 1 1 1 1 1 1 1 1 1 1 1 1 1 1
$$ 1 1 1 1 1 1 1 1 1 1 1 1 1 1 1 1 1 1 1 1 1 1 1 1 1 1 1 1
$$ ##$CPDPRG= (0..8)
$$ <> <> <> <> <> <> <> <> <>
$$ ##$D= (0..63)
$$ 0 1 0 0 0 0 0 0 0 0 0 0 0 0 0 0 0.0002 0 0 0 0 0 0 0 0 0 0 0 0 0 0 0 0
$$ 0 0 0 0 0 0 0 0 0 0 0 0 0 0 0 0 0 0 0 0 0 0 0 0 0 0 0 0 0 0 0
$$ ##$DATE= 1678224847
$$ ##$DATE_START= 1678224804
$$ ##$DE= 6.901845
$$ [...]
$$ ##$ShimPowRng3= (0..63)
$$ 1 1 1 1 1 1 1 1 1 1 1 1 1 1 1 1 1 1 1 1 1 1 1 1 1 1 1 1 1 1 1 1 1 1 1 1
$$ 1 1 1 1 0 0 0 0 0 0 0 0 0 0 0 0 0 0 0 0 0 0 0 0 0 0 0 0
$$ ##$ShimPowType1= 8
$$ ##$ShimPowType2= 8
$$ ##$ShimPowType3= 0
$$ ##$ShimPowType4= 0
$$ ##$ShimPowType5= 0
$$ ##$ShimPowType6= 0
$$ ##$ShimPowType7= 0
$$ ##$ShimPowType8= 0
$$ ##$ShimSysActGrad= (0..63)
$$ 1 2 3 4 13 5 7 11 10 9 6 8 12 18 19 20 21 15 22 23 24 14 25 16 26 17 27
$$ 28 31 32 33 34 35 36 37 38 0 0 0 0 0 0 0 0 0 0 0 0 0 0 0 0 0 0 0 0 0 0
$$ 0 0 0 0 0 0
$$ ##$ShimSysAngle= <>
$$ ##$ShimSysFunc= (0..63)
$$ 1 2 3 4 5 6 7 8 9 10 0 37 38 35 16 15 14 13 12 11 28 27 26 25 24 23 36
$$ 22 30 29 20 21 34 33 32 31 17 18 19 0 0 0 0 0 0 0 0 0 0 0 0 0 0 0 0 0 0
$$ 0 0 0 0 0 0 0
$$ ##$ShimSysMatId= <292722da.dat>
$$ ##$ShimSysMatrix= 1
$$ ##$ShimSysMinMaxUG= 130000
$$ ##$ShimSysOffset= <29 mm>
$$ ##$ShimSysType= 4
$$ ##$ShimUnit= 3
$$ ##$SpectrOsVersion= <4.1.156.20210628>
$$ ##$TCubeEth= <192.168.180.38>
$$ ##$TCubeSeqDevice= <>
$$ ##$TOSITY= <no>
$$ ##$TRIPLO2= 0
$$ ##$TopSpinVersion= <TopSpin 4.1.3>
$$ ##$TrxFreqFormula= (0..23)
$$ <TrxFreqFormula(2.0,700350000.000000,'TRX',Trx(1.0,'TRX 1200.1',1,5.000000,1290.000000))>
$$ <TrxFreqFormula(2.0,700350000.000000,'TRX',Trx(1.0,'TRX 1200.2',1,5.000000,1290.000000))>
$$ <TrxFreqFormula(2.0,700350000.000000,'TRX',Trx(1.0,'TRX 1200.3',1,5.000000,1290.000000))>
$$ <> <> <> <> <> <> <> <> <> <> <> <> <> <> <> <> <> <> <> <> <>
$$ ##$TrxPN= (0..23)
$$ <Z148391> <Z148391> <Z148391> <> <> <> <> <> <> <> <> <> <> <> <> <> <>
$$ <> <> <> <> <> <> <>
$$ ##$TrxSN= (0..23)
$$ <00336> <00337> <00342> <> <> <> <> <> <> <> <> <> <> <> <> <> <> <> <>
$$ <> <> <> <> <>
$$ ##$VCubeEth= (0..23)
$$ <no> <no> <no> <no> <no> <no> <no> <no> <no> <no> <no> <no> <no> <no> <no>
$$ <no> <no> <no> <no> <no> <no> <no> <no> <no>
$$ ##$VTU= 2
$$ ##$VTUETH= <192.168.99.11>
$$ ##$VTUTY= <no>
$$ ##$ValueLine= no
$$ ##$VpuPN= (0..23)
$$ <no> <no> <no> <no> <no> <no> <no> <no> <no> <no> <no> <no> <no> <no> <no>
$$ <no> <no> <no> <no> <no> <no> <no> <no> <no>
$$ ##$VpuSN= (0..23)
$$ <no> <no> <no> <no> <no> <no> <no> <no> <no> <no> <no> <no> <no> <no> <no>
$$ <no> <no> <no> <no> <no> <no> <no> <no> <no>
$$ ##$WBREFAM= (0..31)
$$ 99.8 100 100 100 100 100 100 100 100 100 100 100 100 100 100 100 100 100
$$ 100 100 100 100 100 100 100 100 100 100 100 100 100 100
$$ ##$WBREFLM= (0..31)
$$ 1 0 1 0 0 0 0 0 0 0 0 0 0 0 0 0 0 0 0 0 0 0 0 0 0 0 0 0 0 0 0 0
$$ ##$WBREFPH= (0..31)
$$ 0.05 0 0 0 0 0 0 0 0 0 0 0 0 0 0 0 0 0 0 0 0 0 0 0 0 0 0 0 0 0 0 0
$$ ##$WBSGU= (0..31)
$$ 1 2 4 0 0 0 0 0 0 0 0 0 0 0 0 0 0 0 0 0 0 0 0 0 0 0 0 0 0 0 0 0
$$ ##END=
$$ 
##$DECIM=	1440
##$DSPFVS=	21
##XUNITS=	HZ
##YUNITS=	ARBITRARY UNITS
##FIRSTX=	11250.604788156719223
##LASTX=	-2638.1781369192458442
##DELTAX=	-0.10596381293402784562
##XFACTOR=	1
##YFACTOR=	2.1725657197027499201
##FIRSTY=	121.57254791259765625
##MINY=	72.2807464599609375
##MAXY=	71188.4609375
##NPOINTS=	131072
##XYDATA=	(X++(Y..Y))
$$ [...]
6982G7%%%%J%%%%%%%%%%%%%%%%j%%%%%J%%jj%%%%%%%%%%j%J%%%%%%%j%J%%%%%%%%%%%J%J%
$$ 77 77 77 77 77 78 78 78 78 78 78 78 78 78 78 78 78 78 78 78 78 78 77 77 77 77 77 77 78 78 78 77 76 76 76 76 76 76 76 76 76 76 76 75 75 76 76 76 76 76 76 76 76 75 75 76 76 76 76 76 76 76 76 76 76 76 76 77 77 78 78
6974G8%%%%%%%%%%%%%%%%%%%jJ%%%%%%%%%%j%%j%J%%%%%%%%%j%%%%%%%%%%J%%j%J%%%%%j%
$$ 78 78 78 78 78 78 78 78 78 78 78 78 78 78 78 78 78 78 78 78 77 78 78 78 78 78 78 78 78 78 78 78 77 77 77 76 76 77 77 77 77 77 77 77 77 77 77 76 76 76 76 76 76 76 76 76 76 76 77 77 77 76 76 77 77 77 77 77 77 76 76
6967G6Jj%JjJ%j%%%%J%%%%%%Jj%%%%%%%%%%%%Jj%%%%%%j%%J%%j%j%J%Jj%J%j%%j%J%%%%%%
$$ 76 77 76 76 77 76 77 77 76 76 76 76 76 77 77 77 77 77 77 77 78 77 77 77 77 77 77 77 77 77 77 77 77 77 78 77 77 77 77 77 77 77 76 76 76 77 77 77 76 76 75 75 76 76 77 76 76 77 77 76 76 76 75 75 76 76 76 76 76 76 76
6959G6%%%%%J%%Jj%%%%J%%%%%%%%%%%%%%%%%%j%%%%%%%%%%%%%%J%j%%j%%%%%%%J%j%%%J%j
$$ 76 76 76 76 76 76 77 77 77 78 77 77 77 77 77 78 78 78 78 78 78 78 78 78 78 78 78 78 78 78 78 78 78 78 77 77 77 77 77 77 77 77 77 77 77 77 77 77 77 78 78 77 77 77 76 76 76 76 76 76 76 76 77 77 76 76 76 76 77 77 76
6952G6%%%%%j%J%%%J%%%%%%j%%%J%%%%%%%%%%%%%%%j%%J%%%%%%%%%%%%%j%%%%%%%j%%%%%J
$$ 76 76 76 76 76 76 75 75 76 76 76 76 77 77 77 77 77 77 77 76 76 76 76 77 77 77 77 77 77 77 77 77 77 77 77 77 77 77 77 76 76 76 77 77 77 77 77 77 77 77 77 77 77 77 77 77 76 76 76 76 76 76 76 76 75 75 75 75 75 75 76
6944G6%J%j%%%%%%%%%jJ%%%%J%%%j%%%%%%%J%%%%%%J%%%%%j%%%%%%%%J%%j%%%%%%%%%%%%%
$$ 76 76 77 77 76 76 76 76 76 76 76 76 76 76 75 76 76 76 76 76 77 77 77 77 76 76 76 76 76 76 76 76 77 77 77 77 77 77 77 78 78 78 78 78 78 77 77 77 77 77 77 77 77 77 78 78 78 77 77 77 77 77 77 77 77 77 77 77 77 77 77
6937G7%%%%%%%%%%%%%%%%%%J%%%jJ%j%%%J%%%%%%%%%%j%%%%%J%%%%%%%%%%%%%%%%%j%%J%%
$$ 77 77 77 77 77 77 77 77 77 77 77 77 77 77 77 77 77 77 77 78 78 78 78 77 78 78 77 77 77 77 78 78 78 78 78 78 78 78 78 78 78 77 77 77 77 77 77 78 78 78 78 78 78 78 78 78 78 78 78 78 78 78 78 78 78 77 77 77 78 78 78
6930G8%%%%%%%%%%%%jJ%%%%%%%%%%%%%%%%Jj%%%%%%%%%%%J%%%%%%j%%J%%jj%J%%%%%%%%%J
$$ 78 78 78 78 78 78 78 78 78 78 78 78 78 77 78 78 78 78 78 78 78 78 78 78 78 78 78 78 78 78 78 79 78 78 78 78 78 78 78 78 78 78 78 78 79 79 79 79 79 79 79 78 78 78 79 79 79 78 77 77 78 78 78 78 78 78 78 78 78 78 79
6922G9%%%jJ%%j%J%%%%%%%jJ%%%j%%%%%%%%%%%%%%%%%%jJ%%J%%%%%%%%j%%%%%%Jj%%%%J%%
$$ 79 79 79 79 78 79 79 79 78 78 79 79 79 79 79 79 79 79 78 79 79 79 79 78 78 78 78 78 78 78 78 78 78 78 78 78 78 78 78 78 78 78 77 78 78 78 79 79 79 79 79 79 79 79 79 78 78 78 78 78 78 78 79 78 78 78 78 78 79 79 79
6915G9%%%%%jJ%%j%%%J%%%%%%%%%%%%%j%%%%J%%%j%%%%%J%%%%%%%%j%%%%J%%j%%%%%%%%%%
$$ 79 79 79 79 79 79 78 79 79 79 78 78 78 78 79 79 79 79 79 79 79 79 79 79 79 79 79 79 78 78 78 78 78 79 79 79 79 78 78 78 78 78 78 79 79 79 79 79 79 79 79 79 78 78 78 78 78 79 79 79 78 78 78 78 78 78 78 78 78 78 78
6907G8%%J%%%%%%%%%%%%%%j%%%%J%%%%%%%j%%%j%%%J%%%j%%J%%%%j%%J%jJ%%%%%%%%%%%%%
$$ 78 78 78 79 79 79 79 79 79 79 79 79 79 79 79 79 79 79 78 78 78 78 78 79 79 79 79 79 79 79 79 78 78 78 78 77 77 77 77 78 78 78 78 77 77 77 78 78 78 78 78 77 77 77 78 78 77 78 78 78 78 78 78 78 78 78 78 78 78 78 78
6900G8%jJ%%%%%j%%J%%%%%%%%j%%%%%%%%%%%%j%J%%%%%j%%%J%%%%%%%%%%%%%J%%%%%Jj%%%
$$ 78 78 77 78 78 78 78 78 78 77 77 77 78 78 78 78 78 78 78 78 78 77 77 77 77 77 77 77 77 77 77 77 77 77 76 76 77 77 77 77 77 77 76 76 76 76 77 77 77 77 77 77 77 77 77 77 77 77 77 77 78 78 78 78 78 78 79 78 78 78 78
6893G8j%%%J%%j%%%%%%%%%%J%%%%j%%%%%%%J%%%j%%%%%%%%%%j%%%%%J%%%%%%%J%%%%%%%%%
$$ 78 77 77 77 77 78 78 78 77 77 77 77 77 77 77 77 77 77 77 78 78 78 78 78 77 77 77 77 77 77 77 77 78 78 78 78 77 77 77 77 77 77 77 77 77 77 77 76 76 76 76 76 76 77 77 77 77 77 77 77 77 78 78 78 78 78 78 78 78 78 78
6885G8j%%%%%%jJ%%Jj%%%%%J%%j%j%J%%%%%%%%%%%%%%%%%%%%%j%%%J%%%%%%%%%%%%%%%%%%
$$ 78 77 77 77 77 77 77 77 76 77 77 77 78 77 77 77 77 77 77 78 78 78 77 77 76 76 77 77 77 77 77 77 77 77 77 77 77 77 77 77 77 77 77 77 77 77 77 77 76 76 76 76 77 77 77 77 77 77 77 77 77 77 77 77 77 77 77 77 77 77 77
6878G7%%%%%J%%%j%%J%%j%%%%%%%%%%%jJJ%%%j%%%J%%Jj%j%%%J%j%%%J%%%%%%%%%%%%%%%%
$$ 77 77 77 77 77 77 78 78 78 78 77 77 77 78 78 78 77 77 77 77 77 77 77 77 77 77 77 77 76 77 78 78 78 78 77 77 77 77 78 78 78 79 78 78 77 77 77 77 78 78 77 77 77 77 78 78 78 78 78 78 78 78 78 78 78 78 78 78 78 78 78
6870G8j%%J%j%%%%%%J%%j%%%%J%%%%%%%j%J%%%%%%j%J%%%%%%%j%%J%%%%%%%j%%%%%%%%J%%
$$ 78 77 77 77 78 78 77 77 77 77 77 77 77 78 78 78 77 77 77 77 77 78 78 78 78 78 78 78 78 77 77 78 78 78 78 78 78 78 77 77 78 78 78 78 78 78 78 78 77 77 77 78 78 78 78 78 78 78 78 77 77 77 77 77 77 77 77 77 78 78 78
6863G8%%%%%j%%%Jj%%%%%%%%%%%%%%%%%%%%%%%%%%%J%%%%jJ%%%%j%%%%J%%%%jj%%J%%%%%%
$$ 78 78 78 78 78 78 77 77 77 77 78 77 77 77 77 77 77 77 77 77 77 77 77 77 77 77 77 77 77 77 77 77 77 77 77 77 77 77 77 78 78 78 78 78 77 78 78 78 78 78 77 77 77 77 77 78 78 78 78 78 77 76 76 76 77 77 77 77 77 77 77
6855G7%%J%j%%jJ%%%%%%jJ%%%%%%%%%%%%J%j%%%%%J%j%%J%%%%%%%%%%%j%%j%%%J%%%%j%%J
$$ 77 77 77 78 78 77 77 77 76 77 77 77 77 77 77 77 76 77 77 77 77 77 77 77 77 77 77 77 77 77 78 78 77 77 77 77 77 77 78 78 77 77 77 78 78 78 78 78 78 78 78 78 78 78 78 77 77 77 76 76 76 76 77 77 77 77 77 76 76 76 77
6848G7%%%%%%%%%%%%%%%%%%%%%%%%%%%%%%%%%%%%%%%%%%%%%%%jJ%%Jj%%%%%%%%%%%%%j%%%
$$ 77 77 77 77 77 77 77 77 77 77 77 77 77 77 77 77 77 77 77 77 77 77 77 77 77 77 77 77 77 77 77 77 77 77 77 77 77 77 77 77 77 77 77 77 77 77 77 77 76 77 77 77 78 77 77 77 77 77 77 77 77 77 77 77 77 77 77 76 76 76 76
6841G6%%%%%%%%j%%%J%%%%%%J%%%%%%%%%j%J%%%%j%%%%%%%%%%%%%%%%%%%%%%%%Jj%%%%%%j
$$ 76 76 76 76 76 76 76 76 76 75 75 75 75 76 76 76 76 76 76 76 77 77 77 77 77 77 77 77 77 77 76 76 77 77 77 77 77 76 76 76 76 76 76 76 76 76 76 76 76 76 76 76 76 76 76 76 76 76 76 76 76 76 77 76 76 76 76 76 76 76 75
6833G5Jj%J%%%%j%%%%%J%%%%%%%%%%%%j%J%%%%%%J%%%j%%%%%%%%%%%%%%%%%%j%J%%%%%%J%
$$ 75 76 75 75 76 76 76 76 76 75 75 75 75 75 75 76 76 76 76 76 76 76 76 76 76 76 76 76 75 75 76 76 76 76 76 76 76 77 77 77 77 76 76 76 76 76 76 76 76 76 76 76 76 76 76 76 76 76 76 76 75 75 76 76 76 76 76 76 76 77 77
6826G7%%%%%j%%%%%J%%%%%%%%%%%j%%%%J%j%%%j%J%%%%%%%%%%%%%%%%%%%%Jj%%%%%%%%%%%
$$ 77 77 77 77 77 77 76 76 76 76 76 76 77 77 77 77 77 77 77 77 77 77 77 77 76 76 76 76 76 77 77 76 76 76 76 75 75 76 76 76 76 76 76 76 76 76 76 76 76 76 76 76 76 76 76 76 76 76 77 76 76 76 76 76 76 76 76 76 76 76 76
6818G6%%%%%%%%%%J%%%%%%%%j%J%%%%%%%%%%%%%%%%%%%%%%%j%J%j%%%%%%%%%%%%jJ%%%%%%
$$ 76 76 76 76 76 76 76 76 76 76 76 77 77 77 77 77 77 77 77 77 76 76 77 77 77 77 77 77 77 77 77 77 77 77 77 77 77 77 77 77 77 77 77 77 77 77 76 76 77 77 76 76 76 76 76 76 76 76 76 76 76 76 76 75 76 76 76 76 76 76 76
6811G6%%%%%%%%%%%%%%J%%%j%%%J%%%%j%%%%%%%%J%%j%%%%%%%J%j%%%J%%%%%%%%%%%%%%%j
$$ 76 76 76 76 76 76 76 76 76 76 76 76 76 76 76 77 77 77 77 76 76 76 76 77 77 77 77 77 76 76 76 76 76 76 76 76 76 77 77 77 76 76 76 76 76 76 76 76 77 77 76 76 76 76 77 77 77 77 77 77 77 77 77 77 77 77 77 77 77 77 76
6804G6%%J%%%%%%j%J%%%%j%%J%%%%%%%%%%j%%%%%%%%%j%%JJ%%%%%%%%%%%%%%%%%%%%%%%%j
$$ 76 76 76 77 77 77 77 77 77 77 76 76 77 77 77 77 77 76 76 76 77 77 77 77 77 77 77 77 77 77 77 76 76 76 76 76 76 76 76 76 76 75 75 75 76 77 77 77 77 77 77 77 77 77 77 77 77 77 77 77 77 77 77 77 77 77 77 77 77 77 76
6796G6%%J%jJ%%jJ%j%%%%%%%J%%%%%%%%%j%%%%J%j%%%%%%%%%%%%%%%%%%%%%%%%%%Jj%J%%%
$$ 76 76 76 77 77 76 77 77 77 76 77 77 76 76 76 76 76 76 76 76 77 77 77 77 77 77 77 77 77 77 76 76 76 76 76 77 77 76 76 76 76 76 76 76 76 76 76 76 76 76 76 76 76 76 76 76 76 76 76 76 76 76 76 76 77 76 76 77 77 77 77
6789G7%%%%%%%%%%%j%%%%%%J%%%%%%%%%%j%%%%%%%%%J%%%%%%%%%%%%%%%%j%JJ%%%%%jJj%%
$$ 77 77 77 77 77 77 77 77 77 77 77 77 76 76 76 76 76 76 76 77 77 77 77 77 77 77 77 77 77 77 76 76 76 76 76 76 76 76 76 76 77 77 77 77 77 77 77 77 77 77 77 77 77 77 77 77 77 76 76 77 78 78 78 78 78 78 77 78 77 77 77
6781G7%%J%%%j%%%%%%%%%%%%%%%j%%%%%%%%%%%%%%%%%J%%%%%%%%j%%%%%%J%%%%%%%%%%%%%
$$ 77 77 77 78 78 78 78 77 77 77 77 77 77 77 77 77 77 77 77 77 77 77 77 76 76 76 76 76 76 76 76 76 76 76 76 76 76 76 76 76 76 77 77 77 77 77 77 77 77 77 76 76 76 76 76 76 76 77 77 77 77 77 77 77 77 77 77 77 77 77 77
6774G7%%%%%%%%%%%%%%%%j%%J%%%%%%j%%%%%%J%%%%j%%J%%%%%%%%%%%j%%J%%%%%%%j%%J%%
$$ 77 77 77 77 77 77 77 77 77 77 77 77 77 77 77 77 77 76 76 76 77 77 77 77 77 77 77 76 76 76 76 76 76 76 77 77 77 77 77 76 76 76 77 77 77 77 77 77 77 77 77 77 77 77 76 76 76 77 77 77 77 77 77 77 77 76 76 76 77 77 77
6766G7%%%%%%%%%%%%%J%%%%%%%%%j%%%%j%%%J%%%%%%%J%%%%%%%%%%%j%%%%%%%%%%%%%%J%%
$$ 77 77 77 77 77 77 77 77 77 77 77 77 77 77 78 78 78 78 78 78 78 78 78 78 77 77 77 77 77 76 76 76 76 77 77 77 77 77 77 77 77 78 78 78 78 78 78 78 78 78 78 78 78 77 77 77 77 77 77 77 77 77 77 77 77 77 77 77 78 78 78
6759G8%%%jJ%%%%%j%%%J%%j%%%J%%%%%J%%j%%%%j%%J%Jj%j%%%%%Jj%%%%%%%J%%%%%%jJ%%%
$$ 78 78 78 78 77 78 78 78 78 78 78 77 77 77 77 78 78 78 77 77 77 77 78 78 78 78 78 78 79 79 79 78 78 78 78 78 77 77 77 78 78 79 78 78 77 77 77 77 77 77 78 77 77 77 77 77 77 77 77 78 78 78 78 78 78 78 77 78 78 78 78
6752G8%%%j%%%%%%%%%%%%%%%%%%%%%%%%%%%j%J%%%jJ%%%J%%%%jJ%%j%jJ%j%%%%%%%%%%%%%
$$ 78 78 78 78 77 77 77 77 77 77 77 77 77 77 77 77 77 77 77 77 77 77 77 77 77 77 77 77 77 77 77 77 76 76 77 77 77 77 76 77 77 77 77 78 78 78 78 78 77 78 78 78 77 77 76 77 77 76 76 76 76 76 76 76 76 76 76 76 76 76 76
6744G6%%%%%%%%%%%J%%%%%j%%%j%J%J%%%j%%%J%jJ%%j%%%%%%J%j%%%%%%%%%%%%%%Jj%%%%J
$$ 76 76 76 76 76 76 76 76 76 76 76 76 77 77 77 77 77 77 76 76 76 76 75 75 76 76 77 77 77 77 76 76 76 76 77 77 76 77 77 77 76 76 76 76 76 76 76 77 77 76 76 76 76 76 76 76 76 76 76 76 76 76 76 76 77 76 76 76 76 76 77
6737G7%j%%%%%%%%%%%%%%%%%%%J%%%j%J%%%j%%%j%%%%%%%J%JjJ%%j%%%%%%%%%%J%j%%%%%%
$$ 77 77 76 76 76 76 76 76 76 76 76 76 76 76 76 76 76 76 76 76 76 76 77 77 77 77 76 76 77 77 77 77 76 76 76 76 75 75 75 75 75 75 75 75 76 76 77 76 77 77 77 76 76 76 76 76 76 76 76 76 76 76 77 77 76 76 76 76 76 76 76
6729G6Jj%%J%J%j%%%%%%%%%%%%%%%%%%j%%%%%J%J%j%%%j%%%%%%J%%%%%j%%%%%J%%%%j%%%%
$$ 76 77 76 76 76 77 77 78 78 77 77 77 77 77 77 77 77 77 77 77 77 77 77 77 77 77 77 77 76 76 76 76 76 76 77 77 78 78 77 77 77 77 76 76 76 76 76 76 76 77 77 77 77 77 77 76 76 76 76 76 76 77 77 77 77 77 76 76 76 76 76
6722G6J%j%%%%%%%%%%%%%%%J%j%%%%%%J%%%%j%%%%%%%%%%%%%%Jj%%%%%Jj%J%%%%%%%%%%%j
$$ 76 77 77 76 76 76 76 76 76 76 76 76 76 76 76 76 76 76 76 77 77 76 76 76 76 76 76 76 77 77 77 77 77 76 76 76 76 76 76 76 76 76 76 76 76 76 76 76 77 76 76 76 76 76 76 77 76 76 77 77 77 77 77 77 77 77 77 77 77 77 76
6715G6%Jj%Jj%%%%%%J%j%J%%j%%%%%%%%%%%Jj%j%%%J%%%j%J%%%%%%j%%J%%%%Jj%%%%%%%%%
$$ 76 76 77 76 76 77 76 76 76 76 76 76 76 77 77 76 76 77 77 77 76 76 76 76 76 76 76 76 76 76 76 76 77 76 76 75 75 75 75 76 76 76 76 75 75 76 76 76 76 76 76 76 75 75 75 76 76 76 76 76 77 76 76 76 76 76 76 76 76 76 76
6707G6%%jJj%J%%%J%j%j%J%%%%%%%J%%j%%%%%%%%%%%%%%%%%%%%J%%%j%%%%%J%j%%%%%%%%%
$$ 76 76 76 75 76 75 75 76 76 76 76 77 77 76 76 75 75 76 76 76 76 76 76 76 76 77 77 77 76 76 76 76 76 76 76 76 76 76 76 76 76 76 76 76 76 76 76 76 76 77 77 77 77 76 76 76 76 76 76 77 77 76 76 76 76 76 76 76 76 76 76
6700G6%J%%%j%%%%%J%%%%%%%%%j%%%%J%%jJ%%j%J%%%%%%%%%%%%%j%%%Jj%%%J%%%%%%jJ%%%
$$ 76 76 77 77 77 77 76 76 76 76 76 76 77 77 77 77 77 77 77 77 77 77 76 76 76 76 76 77 77 77 76 77 77 77 76 76 77 77 77 77 77 77 77 77 77 77 77 77 77 77 76 76 76 76 77 76 76 76 76 77 77 77 77 77 77 77 76 77 77 77 77
6692G7%%%J%%%%j%Jj%Jj%%j%%J%%%%%%%Jj%%%%%%%%%J%j%%%%%%%%%%%%%%%%%%%%J%%%J%j%
$$ 77 77 77 77 78 78 78 78 78 77 77 78 77 77 78 77 77 77 76 76 76 77 77 77 77 77 77 77 77 78 77 77 77 77 77 77 77 77 77 77 78 78 77 77 77 77 77 77 77 77 77 77 77 77 77 77 77 77 77 77 77 77 77 78 78 78 78 79 79 78 78
6685G8jJ%%j%%%%J%%%%%j%%%%%%%%%%%%%%%%Jj%JjJ%%j%%%%%%%%%%%%%%%%%%%%%%%%%%%%%
$$ 78 77 78 78 78 77 77 77 77 77 78 78 78 78 78 78 77 77 77 77 77 77 77 77 77 77 77 77 77 77 77 77 77 78 77 77 78 77 78 78 78 77 77 77 77 77 77 77 77 77 77 77 77 77 77 77 77 77 77 77 77 77 77 77 77 77 77 77 77 77 77
6677G7%%%%%%%%%%%%Jj%%J%j%%%%%%%%%J%%jJj%%%%%%%Jj%%%%%Jj%%%j%%JJ%%%j%%%%%%%%
$$ 77 77 77 77 77 77 77 77 77 77 77 77 77 78 77 77 77 78 78 77 77 77 77 77 77 77 77 77 77 78 78 78 77 78 77 77 77 77 77 77 77 77 78 77 77 77 77 77 77 78 77 77 77 77 76 76 76 77 78 78 78 78 77 77 77 77 77 77 77 77 77
6670G7%%%jJ%%%%%%%%%%%%%j%%J%%%%j%%J%%%%%%%%%%%%%%%%%j%J%%%%%%J%j%%%%%%j%J%%
$$ 77 77 77 77 76 77 77 77 77 77 77 77 77 77 77 77 77 77 77 76 76 76 77 77 77 77 77 76 76 76 77 77 77 77 77 77 77 77 77 77 77 77 77 77 77 77 77 77 76 76 77 77 77 77 77 77 77 78 78 77 77 77 77 77 77 77 76 76 77 77 77
6663G7j%%%%%%%J%%%%%%%%%%%%%%%%%j%%J%%%%%%%%%%%jJ%%%j%%%%%%%%%%Jj%%%%J%%%%%%
$$ 77 76 76 76 76 76 76 76 76 77 77 77 77 77 77 77 77 77 77 77 77 77 77 77 77 77 77 76 76 76 77 77 77 77 77 77 77 77 77 77 77 77 76 77 77 77 77 76 76 76 76 76 76 76 76 76 76 76 77 76 76 76 76 76 77 77 77 77 77 77 77
6655G7%jJ%%%%%%%%%%%%%%%%%j%J%%%%%%%%%%%%%%%j%%J%%%%%%%%%%%%%%%%J%%j%%%%%jJ%
$$ 77 77 76 77 77 77 77 77 77 77 77 77 77 77 77 77 77 77 77 77 77 76 76 77 77 77 77 77 77 77 77 77 77 77 77 77 77 77 77 76 76 76 77 77 77 77 77 77 77 77 77 77 77 77 77 77 77 77 77 78 78 78 77 77 77 77 77 77 76 77 77
6648G7%j%J%%%%%%%%%%%%%%%jJ%%j%%%%J%%%%%%%%j%J%%%%%%%%%j%%%%%%J%%%%%%%j%%%%J
$$ 77 77 76 76 77 77 77 77 77 77 77 77 77 77 77 77 77 77 77 77 76 77 77 77 76 76 76 76 76 77 77 77 77 77 77 77 77 77 76 76 77 77 77 77 77 77 77 77 77 77 76 76 76 76 76 76 76 77 77 77 77 77 77 77 77 76 76 76 76 76 77
6640G7%%%j%%J%%%%%%%%%%%%%%j%%%%%%%J%%%%%J%%j%%%j%%J%%%%%%%%%%%%%%%%%%%%%%%%
$$ 77 77 77 77 76 76 76 77 77 77 77 77 77 77 77 77 77 77 77 77 77 77 76 76 76 76 76 76 76 76 77 77 77 77 77 77 78 78 78 77 77 77 77 76 76 76 77 77 77 77 77 77 77 77 77 77 77 77 77 77 77 77 77 77 77 77 77 77 77 77 77
6633G7Jj%%%%%%%%%%%%%j%J%%%%%%%J%%%j%%%%%%%%%%%%%%%%%%%%%%%%%%%%%%j%%%J%%J%%
$$ 77 78 77 77 77 77 77 77 77 77 77 77 77 77 77 77 76 76 77 77 77 77 77 77 77 77 78 78 78 78 77 77 77 77 77 77 77 77 77 77 77 77 77 77 77 77 77 77 77 77 77 77 77 77 77 77 77 77 77 77 77 76 76 76 76 77 77 77 78 78 78
6625G8%%j%%J%%%j%%%j%J%%%%%%%%%%%j%%%%%J%%j%%J%%%%%%%%%%j%%%%%%%%J%%%%%%%j%%
$$ 78 78 78 77 77 77 78 78 78 78 77 77 77 77 76 76 77 77 77 77 77 77 77 77 77 77 77 77 76 76 76 76 76 76 77 77 77 76 76 76 77 77 77 77 77 77 77 77 77 77 77 76 76 76 76 76 76 76 76 76 77 77 77 77 77 77 77 77 76 76 76
6618G6%%%%%%%%%%%%%%%jJ%%%%%%%J%%j%%%%%Jj%%%%%J%%%%jJ%%%j%J%%j%%%J%%%%%%%%%%
$$ 76 76 76 76 76 76 76 76 76 76 76 76 76 76 76 76 75 76 76 76 76 76 76 76 76 77 77 77 76 76 76 76 76 76 77 76 76 76 76 76 76 77 77 77 77 77 76 77 77 77 77 76 76 77 77 77 76 76 76 76 77 77 77 77 77 77 77 77 77 77 77
6611G7%%%%%%%%%j%%%%%%J%%%%%j%%Jj%J%%%j%%%%%%%%%%%%%%%J%jJ%%%%j%%J%j%%%%%%%J
$$ 77 77 77 77 77 77 77 77 77 77 76 76 76 76 76 76 76 77 77 77 77 77 77 76 76 76 77 76 76 77 77 77 77 76 76 76 76 76 76 76 76 76 76 76 76 76 76 76 76 77 77 76 77 77 77 77 77 76 76 76 77 77 76 76 76 76 76 76 76 76 77
6603G7%%%j%j%J%J%j%%%%%%%%%%%%%%%%%%J%%j%%%%%%j%J%%%%%%%%%%%%%%%%%j%%%%%J%%%
$$ 77 77 77 77 76 76 75 75 76 76 77 77 76 76 76 76 76 76 76 76 76 76 76 76 76 76 76 76 76 76 76 77 77 77 76 76 76 76 76 76 76 75 75 76 76 76 76 76 76 76 76 76 76 76 76 76 76 76 76 76 76 75 75 75 75 75 75 76 76 76 76
6596G6j%%J%%%%%%%%%%%%%%%%%%%%%%%%%%%%%%%%%%%%%%%%%%%%%%%Jj%%%%%j%%%%%%%%J%%
$$ 76 75 75 75 76 76 76 76 76 76 76 76 76 76 76 76 76 76 76 76 76 76 76 76 76 76 76 76 76 76 76 76 76 76 76 76 76 76 76 76 76 76 76 76 76 76 76 76 76 76 76 76 77 76 76 76 76 76 76 75 75 75 75 75 75 75 75 75 76 76 76
6588G6%%%%J%%%j%%%%%%Jj%%j%J%%%%%J%%%%%j%%%%%%%%%%%%j%%J%%%%%%%%%%%%j%%%J%%%
$$ 76 76 76 76 76 77 77 77 77 76 76 76 76 76 76 76 77 76 76 76 75 75 76 76 76 76 76 76 77 77 77 77 77 77 76 76 76 76 76 76 76 76 76 76 76 76 76 75 75 75 76 76 76 76 76 76 76 76 76 76 76 76 76 75 75 75 75 76 76 76 76
6581G6%%J%%j%%%%%%%Jj%%j%J%%%%%%%%%%%%j%%%J%%%%%%%%%%%%%%%Jj%%%%%J%j%%%%%J%%
$$ 76 76 76 77 77 77 76 76 76 76 76 76 76 76 77 76 76 76 75 75 76 76 76 76 76 76 76 76 76 76 76 76 76 75 75 75 75 76 76 76 76 76 76 76 76 76 76 76 76 76 76 76 76 77 76 76 76 76 76 76 77 77 76 76 76 76 76 76 77 77 77
6574G7%j%%%%%%%%%%%%%%%%%%%%%%%%%%J%%j%%%%%%%%%%%%%%%%%%%%%Jj%%%%%%%%%J%%%j%
$$ 77 77 76 76 76 76 76 76 76 76 76 76 76 76 76 76 76 76 76 76 76 76 76 76 76 76 76 76 76 77 77 77 76 76 76 76 76 76 76 76 76 76 76 76 76 76 76 76 76 76 76 76 76 76 77 76 76 76 76 76 76 76 76 76 76 77 77 77 77 76 76
6566G6%%%%%%%%J%jJ%%%%%%j%%%%jJ%%%%%%%%%%%%%%%j%%J%%%%%jJ%J%%%jJ%%%%j%%j%J%%
$$ 76 76 76 76 76 76 76 76 76 77 77 76 77 77 77 77 77 77 77 76 76 76 76 76 75 76 76 76 76 76 76 76 76 76 76 76 76 76 76 76 76 75 75 75 76 76 76 76 76 76 75 76 76 77 77 77 77 76 77 77 77 77 77 76 76 76 75 75 76 76 76
6559G6%%%%%%%%J%%j%%%%%%%%%%%%Jj%%%%%%%%%%Jj%J%%j%%%%%%%%%%jJ%%%%J%%j%%J%%%%
$$ 76 76 76 76 76 76 76 76 76 77 77 77 76 76 76 76 76 76 76 76 76 76 76 76 76 77 76 76 76 76 76 76 76 76 76 76 76 77 76 76 77 77 77 76 76 76 76 76 76 76 76 76 76 76 75 76 76 76 76 76 77 77 77 76 76 76 77 77 77 77 77
6551G7j%%%%%%J%%j%%%%J%%%%%%J%j%%%j%%%%%%%%%J%j%%%%%%%%%%%%%%%J%%j%%J%%%%%%%
$$ 77 76 76 76 76 76 76 76 77 77 77 76 76 76 76 76 77 77 77 77 77 77 77 78 78 77 77 77 77 76 76 76 76 76 76 76 76 76 76 77 77 76 76 76 76 76 76 76 76 76 76 76 76 76 76 76 76 77 77 77 76 76 76 77 77 77 77 77 77 77 77
6544G7%%%j%J%%jJj%%%%%%%%%Jj%%%%%%%%%%%%%%%%%%%%%J%%%%%%%%%jJ%%%%%%%%%%%%%%%
$$ 77 77 77 77 76 76 77 77 77 76 77 76 76 76 76 76 76 76 76 76 76 77 76 76 76 76 76 76 76 76 76 76 76 76 76 76 76 76 76 76 76 76 76 76 77 77 77 77 77 77 77 77 77 77 76 77 77 77 77 77 77 77 77 77 77 77 77 77 77 77 77
6536G7%%Jj%%%%%%%%%%%j%%%J%%%%%%%%%%%%%%%%%%%%%%%%%%%%j%%%J%%%%%%%%%%%%%%%%%
$$ 77 77 77 78 77 77 77 77 77 77 77 77 77 77 77 77 76 76 76 76 77 77 77 77 77 77 77 77 77 77 77 77 77 77 77 77 77 77 77 77 77 77 77 77 77 77 77 77 77 76 76 76 76 77 77 77 77 77 77 77 77 77 77 77 77 77 77 77 77 77 77
6529G7%%%j%%J%%%%%j%%%%J%%jJ%%%j%%%%%%%jJ%%%%J%%%%%%%%%j%%jJ%%J%%%%%%%%%%%%%
$$ 77 77 77 77 76 76 76 77 77 77 77 77 77 76 76 76 76 76 77 77 77 76 77 77 77 77 76 76 76 76 76 76 76 76 75 76 76 76 76 76 77 77 77 77 77 77 77 77 77 77 76 76 76 75 76 76 76 77 77 77 77 77 77 77 77 77 77 77 77 77 77
6522G7j%J%%%%%%%%%%%j%J%%%%%%%j%%%%%j%%J%%%%%Jj%%%%%%%%%%Jj%%%%%%%J%%%j%%%%%
$$ 77 76 76 77 77 77 77 77 77 77 77 77 77 77 77 76 76 77 77 77 77 77 77 77 77 76 76 76 76 76 76 75 75 75 76 76 76 76 76 76 77 76 76 76 76 76 76 76 76 76 76 76 77 76 76 76 76 76 76 76 76 77 77 77 77 76 76 76 76 76 76
6514G6%%%%j%J%%%j%%%%%%%J%%j%%%%%%%Jj%%%%%%%j%J%%%%%%%%Jj%%%%%%J%%%%j%%%%%%%
$$ 76 76 76 76 76 75 75 76 76 76 76 75 75 75 75 75 75 75 75 76 76 76 75 75 75 75 75 75 75 75 76 75 75 75 75 75 75 75 75 74 74 75 75 75 75 75 75 75 75 75 76 75 75 75 75 75 75 75 76 76 76 76 76 75 75 75 75 75 75 75 75
6507G5%J%j%%J%%Jj%%%%%%%%%%%%%%%%%%%J%%j%%%Jj%%j%Jj%%J%%%%%%%%%%%%%%%%%%%%%%
$$ 75 75 76 76 75 75 75 76 76 76 77 76 76 76 76 76 76 76 76 76 76 76 76 76 76 76 76 76 76 76 76 77 77 77 76 76 76 76 77 76 76 76 75 75 76 75 75 75 76 76 76 76 76 76 76 76 76 76 76 76 76 76 76 76 76 76 76 76 76 76 76
6499G6%%%%%%%%%J%%%%%%%%%%%%%%%%%%j%%%%J%j%J%%%%%%%%%%%%%%%j%J%%%%%%%%%%%%J%
$$ 76 76 76 76 76 76 76 76 76 76 77 77 77 77 77 77 77 77 77 77 77 77 77 77 77 77 77 77 77 76 76 76 76 76 77 77 76 76 77 77 77 77 77 77 77 77 77 77 77 77 77 77 77 77 76 76 77 77 77 77 77 77 77 77 77 77 77 77 77 78 78
6492G8%%%%j%%%%%%%%%%%%%%%%J%j%%%%%%%%%%%%%%%%%%%%%%%%%%%%j%%%%%J%%%%%J%j%%%
$$ 78 78 78 78 78 77 77 77 77 77 77 77 77 77 77 77 77 77 77 77 77 77 78 78 77 77 77 77 77 77 77 77 77 77 77 77 77 77 77 77 77 77 77 77 77 77 77 77 77 77 77 77 77 76 76 76 76 76 76 77 77 77 77 77 77 78 78 77 77 77 77
6485G7%%%%%%%%J%j%%%%%%%%%%%J%%%j%%%%%%%%%%%%jJj%J%%%%%%%%%J%j%%%%%%%%%%%%%%
$$ 77 77 77 77 77 77 77 77 77 78 78 77 77 77 77 77 77 77 77 77 77 77 77 78 78 78 78 77 77 77 77 77 77 77 77 77 77 77 77 77 76 77 76 76 77 77 77 77 77 77 77 77 77 77 78 78 77 77 77 77 77 77 77 77 77 77 77 77 77 77 77
6477G7%%j%JjJ%%%j%%%J%%%%%%jJ%%%%%%%%%%%%%%%%%j%%J%%%%%%%j%J%%%Jj%%%%%%%%%jJ
$$ 77 77 77 76 76 77 76 77 77 77 77 76 76 76 76 77 77 77 77 77 77 77 76 77 77 77 77 77 77 77 77 77 77 77 77 77 77 77 77 77 77 76 76 76 77 77 77 77 77 77 77 77 76 76 77 77 77 77 78 77 77 77 77 77 77 77 77 77 77 76 77
6470G7%%%%%%%%%%%J%%j%%%%%%%%%%%%%%%%%%%%%%%%%%%%j%%%%%%%%%%%%%%%%%%%%%%%%%%
$$ 77 77 77 77 77 77 77 77 77 77 77 77 78 78 78 77 77 77 77 77 77 77 77 77 77 77 77 77 77 77 77 77 77 77 77 77 77 77 77 77 77 77 77 77 76 76 76 76 76 76 76 76 76 76 76 76 76 76 76 76 76 76 76 76 76 76 76 76 76 76 76
6462G6%%%%%%%%%%jJ%%%%%%%J%j%%%%%%%%j%%%%%%%%%%%%%%%%%%%%%%j%%J%%j%%%%JjJ%%%
$$ 76 76 76 76 76 76 76 76 76 76 76 75 76 76 76 76 76 76 76 76 77 77 76 76 76 76 76 76 76 76 76 75 75 75 75 75 75 75 75 75 75 75 75 75 75 75 75 75 75 75 75 75 75 75 74 74 74 75 75 75 74 74 74 74 74 75 74 75 75 75 75
6455G5%%%%%j%%%J%%%%%%%%%%%jJ%%J%%j%%%%%J%%j%Jj%%%%J%jJ%j%%%%%%%%%%%J%%%%%%j
$$ 75 75 75 75 75 75 74 74 74 74 75 75 75 75 75 75 75 75 75 75 75 75 74 75 75 75 76 76 76 75 75 75 75 75 75 76 76 76 75 75 76 75 75 75 75 75 76 76 75 76 76 75 75 75 75 75 75 75 75 75 75 75 75 76 76 76 76 76 76 76 75
6447G5%%J%%J%j%%%%%%%J%%%%%j%%%%J%%%%%%%%%%%%j%%%%%%%j%%%%J%%%%%%%%J%j%%%%%%
$$ 75 75 75 76 76 76 77 77 76 76 76 76 76 76 76 76 77 77 77 77 77 77 76 76 76 76 76 77 77 77 77 77 77 77 77 77 77 77 77 77 76 76 76 76 76 76 76 76 75 75 75 75 75 76 76 76 76 76 76 76 76 76 77 77 76 76 76 76 76 76 76
6440G6Jj%%%%%%%%%%%%%%%%jJ%%j%%J%%%%%%%%%%%%%%J%%%%j%%%%J%%%%%%%j%%%jJ%%%%%%
$$ 76 77 76 76 76 76 76 76 76 76 76 76 76 76 76 76 76 76 76 75 76 76 76 75 75 75 76 76 76 76 76 76 76 76 76 76 76 76 76 76 76 77 77 77 77 77 76 76 76 76 76 77 77 77 77 77 77 77 77 76 76 76 76 75 76 76 76 76 76 76 76
6433G6%%%%%%%jJ%%%%j%%%J%%%%%%%%%%%%%%J%jJ%%%j%%%%%%%%%J%%%%%%%%%%%%%%%%%%j%
$$ 76 76 76 76 76 76 76 76 75 76 76 76 76 76 75 75 75 75 76 76 76 76 76 76 76 76 76 76 76 76 76 76 76 77 77 76 77 77 77 77 76 76 76 76 76 76 76 76 76 76 77 77 77 77 77 77 77 77 77 77 77 77 77 77 77 77 77 77 77 76 76
6425G6%%J%%j%%%%%J%%%%%%%j%%%%%J%%%%%%%%%%%%%%J%%%%jJ%%%%%%%%%%%%%%jJ%%%%%j%
$$ 76 76 76 77 77 77 76 76 76 76 76 76 77 77 77 77 77 77 77 77 76 76 76 76 76 76 77 77 77 77 77 77 77 77 77 77 77 77 77 77 77 78 78 78 78 78 77 78 78 78 78 78 78 78 78 78 78 78 78 78 78 78 77 78 78 78 78 78 78 77 77
6418G7%%%%%%%%%%%%%%%%%%%Jj%%%%%%%%%%%%%jJ%%%%%J%%%%%%%%%%%jJ%%j%%%J%j%%%%%%
$$ 77 77 77 77 77 77 77 77 77 77 77 77 77 77 77 77 77 77 77 77 78 77 77 77 77 77 77 77 77 77 77 77 77 77 77 76 77 77 77 77 77 77 78 78 78 78 78 78 78 78 78 78 78 78 77 78 78 78 77 77 77 77 78 78 77 77 77 77 77 77 77
6410G7%%%%%%%%%%%%%%%%%%%%%J%%%%%%j%%%j%%J%%%j%%%J%%%%%%%J%%j%%%j%%%%%%%%%%J
$$ 77 77 77 77 77 77 77 77 77 77 77 77 77 77 77 77 77 77 77 77 77 77 78 78 78 78 78 78 78 77 77 77 77 76 76 76 77 77 77 77 76 76 76 76 77 77 77 77 77 77 77 77 78 78 78 77 77 77 77 76 76 76 76 76 76 76 76 76 76 76 77
6403G7%%%%%%%j%%%j%J%J%%j%%%%%%J%%%%%%j%%%%%%%%Jj%J%%%j%%%%j%J%%j%%J%%%%j%%J
$$ 77 77 77 77 77 77 77 77 76 76 76 76 75 75 76 76 77 77 77 76 76 76 76 76 76 76 77 77 77 77 77 77 77 76 76 76 76 76 76 76 76 76 77 76 76 77 77 77 77 76 76 76 76 76 75 75 76 76 76 75 75 75 76 76 76 76 76 75 75 75 76
6396G6%%%%%%%%%%%%%%%%%J%j%%%J%%%j%%J%%j%J%%%%%%%%%%%%j%%%%%%%%%%%%%%%%%%%%j
$$ 76 76 76 76 76 76 76 76 76 76 76 76 76 76 76 76 76 76 77 77 76 76 76 76 77 77 77 77 76 76 76 77 77 77 76 76 77 77 77 77 77 77 77 77 77 77 77 77 77 76 76 76 76 76 76 76 76 76 76 76 76 76 76 76 76 76 76 76 76 76 75
6388G5J%J%%jJ%%J%j%%%%%%%%%j%J%J%%%%%%%j%%J%%%%%%%%%%%%j%%%j%%J%%%%%%j%J%%%J
$$ 75 76 76 77 77 77 76 77 77 77 78 78 77 77 77 77 77 77 77 77 77 77 76 76 77 77 78 78 78 78 78 78 78 78 77 77 77 78 78 78 78 78 78 78 78 78 78 78 78 78 77 77 77 77 76 76 76 77 77 77 77 77 77 77 76 76 77 77 77 77 78
6381G8%%%j%%%%%j%%J%%%%%J%j%%%j%%%%%J%%j%%%%%%%%%%%%%Jj%%%%%%%%%%%jJ%%%%%%j%
$$ 78 78 78 78 77 77 77 77 77 77 76 76 76 77 77 77 77 77 77 78 78 77 77 77 77 76 76 76 76 76 76 77 77 77 76 76 76 76 76 76 76 76 76 76 76 76 76 76 77 76 76 76 76 76 76 76 76 76 76 76 76 75 76 76 76 76 76 76 76 75 75
6373G5%%%Jj%%%J%%j%%%%%%J%%j%%%%%%%%%%%%J%%%%%j%%%%jJ%%%%%%%%%%%%%%%%%%%%%%%
$$ 75 75 75 75 76 75 75 75 75 76 76 76 75 75 75 75 75 75 75 76 76 76 75 75 75 75 75 75 75 75 75 75 75 75 75 76 76 76 76 76 76 75 75 75 75 75 74 75 75 75 75 75 75 75 75 75 75 75 75 75 75 75 75 75 75 75 75 75 75 75 75
6366G5%jJ%%J%%%j%%Jj%%%%%%%%%%%%%%%Jj%%J%j%J%%j%%%%%%%%%%%J%%%%%%%%%%%%%J%j%
$$ 75 75 74 75 75 75 76 76 76 76 75 75 75 76 75 75 75 75 75 75 75 75 75 75 75 75 75 75 75 75 76 75 75 75 76 76 75 75 76 76 76 75 75 75 75 75 75 75 75 75 75 75 75 76 76 76 76 76 76 76 76 76 76 76 76 76 76 77 77 76 76
6358G6J%%%%%%%%j%%Jj%%%%%%J%%%%j%%%%%%%%%%%%%Jj%%%%j%%J%%%j%%%%%%%%%%%%J%%%%
$$ 76 77 77 77 77 77 77 77 77 77 76 76 76 77 76 76 76 76 76 76 76 77 77 77 77 77 76 76 76 76 76 76 76 76 76 76 76 76 76 76 77 76 76 76 76 76 75 75 75 76 76 76 76 75 75 75 75 75 75 75 75 75 75 75 75 75 76 76 76 76 76
6351G6%%%%J%%%%%%%%j%%%Jj%%%jJ%%j%%%%%j%%%%J%%%%%j%%%%%%%%J%%%%%%%%%j%J%%%%%
$$ 76 76 76 76 76 77 77 77 77 77 77 77 77 77 76 76 76 76 77 76 76 76 76 75 76 76 76 75 75 75 75 75 75 74 74 74 74 74 75 75 75 75 75 75 74 74 74 74 74 74 74 74 74 75 75 75 75 75 75 75 75 75 75 74 74 75 75 75 75 75 75
6344G5%%%%%%%J%%%j%%j%J%%%j%%j%%JJj%J%%%%%%%%j%Jj%%%%%%%%%J%%%%%%%%%%%%%%jJ%
$$ 75 75 75 75 75 75 75 75 76 76 76 76 75 75 75 74 74 75 75 75 75 74 74 74 73 73 73 74 75 74 74 75 75 75 75 75 75 75 75 75 74 74 75 74 74 74 74 74 74 74 74 74 74 75 75 75 75 75 75 75 75 75 75 75 75 75 75 75 74 75 75
6336G5jJ%%%J%%%%j%%%%jJ%%%%%%%%%%J%j%%%%%%J%j%%%J%%%%j%%%%J%%%j%%%%%%%J%%%%%
$$ 75 74 75 75 75 75 76 76 76 76 76 75 75 75 75 75 74 75 75 75 75 75 75 75 75 75 75 75 76 76 75 75 75 75 75 75 75 76 76 75 75 75 75 76 76 76 76 76 75 75 75 75 75 76 76 76 76 75 75 75 75 75 75 75 75 76 76 76 76 76 76
6329G6%%%%%%%j%%%%%%j%J%%%%%%jJ%%%%j%%%%%%J%%%%j%%%%%%%%%%%%%%%%J%%j%%%J%j%%
$$ 76 76 76 76 76 76 76 76 75 75 75 75 75 75 75 74 74 75 75 75 75 75 75 75 74 75 75 75 75 75 74 74 74 74 74 74 74 75 75 75 75 75 74 74 74 74 74 74 74 74 74 74 74 74 74 74 74 74 74 75 75 75 74 74 74 74 75 75 74 74 74
6321G4%%%%%%%%J%%%%%%%%%%%%j%J%%%%%jJ%%%%%%%%%%%%%j%J%%%%%%j%%%%%jJ%%%J%%%%%
$$ 74 74 74 74 74 74 74 74 74 75 75 75 75 75 75 75 75 75 75 75 75 75 74 74 75 75 75 75 75 75 74 75 75 75 75 75 75 75 75 75 75 75 75 75 75 74 74 75 75 75 75 75 75 75 74 74 74 74 74 74 73 74 74 74 74 75 75 75 75 75 75
6314G5j%%%%Jj%%%J%%%%%jJ%%%%%%%%j%%%Jj%%%%%%%%%%%%%%%%j%%J%%j%%%%%%%%J%%%%%%
$$ 75 74 74 74 74 74 75 74 74 74 74 75 75 75 75 75 75 74 75 75 75 75 75 75 75 75 75 74 74 74 74 75 74 74 74 74 74 74 74 74 74 74 74 74 74 74 74 74 74 73 73 73 74 74 74 73 73 73 73 73 73 73 73 73 74 74 74 74 74 74 74
6307G4%%%%%%%%%J%%%%%%%%%%%%%%%%%%%%%%%%%%j%J%%Jj%%%%%%%%%%%%%%j%%%%%%J%%Jj%
$$ 74 74 74 74 74 74 74 74 74 74 75 75 75 75 75 75 75 75 75 75 75 75 75 75 75 75 75 75 75 75 75 75 75 75 75 75 75 74 74 75 75 75 76 75 75 75 75 75 75 75 75 75 75 75 75 75 75 75 74 74 74 74 74 74 74 75 75 75 76 75 75
6299G5%%%%%%%%%%%%J%%j%%%%J%%j%%%%%J%%%%J%%j%%j%%J%%%%%Jj%%%%%J%%%%j%%%%j%%%
$$ 75 75 75 75 75 75 75 75 75 75 75 75 75 76 76 76 75 75 75 75 75 76 76 76 75 75 75 75 75 75 76 76 76 76 76 77 77 77 76 76 76 75 75 75 76 76 76 76 76 76 77 76 76 76 76 76 76 77 77 77 77 77 76 76 76 76 76 75 75 75 75
6292G5%%%J%%%%%%%%%%%%%%%%%%J%%%%%%%%%%jJ%%j%%%%%%%%%%%%J%%%%%%jJ%%%%%%j%J%%
$$ 75 75 75 75 76 76 76 76 76 76 76 76 76 76 76 76 76 76 76 76 76 76 76 77 77 77 77 77 77 77 77 77 77 77 76 77 77 77 76 76 76 76 76 76 76 76 76 76 76 76 76 77 77 77 77 77 77 77 76 77 77 77 77 77 77 77 76 76 77 77 77
6284G7%%%%%%%%%%%%%%%%%%%%%%%%%%%%%%%%%%J%j%%%%%%J%%%%j%%J%%%%%%%%%%%%%%%%%%
$$ 77 77 77 77 77 77 77 77 77 77 77 77 77 77 77 77 77 77 77 77 77 77 77 77 77 77 77 77 77 77 77 77 77 77 77 78 78 77 77 77 77 77 77 77 78 78 78 78 78 77 77 77 78 78 78 78 78 78 78 78 78 78 78 78 78 78 78 78 78 78 78
6277G8%%%%%%%%j%%%%%%%%%%%%%%%J%%j%%%%%%%%%%%%%%%%%%%%%%%%%Jj%%%%%%%%%%j%J%%
$$ 78 78 78 78 78 78 78 78 78 77 77 77 77 77 77 77 77 77 77 77 77 77 77 77 77 78 78 78 77 77 77 77 77 77 77 77 77 77 77 77 77 77 77 77 77 77 77 77 77 77 77 77 77 77 78 77 77 77 77 77 77 77 77 77 77 77 76 76 77 77 77
6269G7%%%%%%%%J%%%%j%%%%j%J%%%%jJ%%%j%%%%%%%j%J%%%j%%JJ%%j%%%%J%%%%j%%%%%%%%
$$ 77 77 77 77 77 77 77 77 77 78 78 78 78 78 77 77 77 77 77 76 76 77 77 77 77 77 76 77 77 77 77 76 76 76 76 76 76 76 76 75 75 76 76 76 76 75 75 75 76 77 77 77 76 76 76 76 76 77 77 77 77 77 76 76 76 76 76 76 76 76 76
6262G6Jj%J%%j%%j%%J%%%%%j%%Jj%%%%%%%%%j%%%J%%%j%%%%%%%%J%%j%%%%%%J%%%%%%%j%%
$$ 76 77 76 76 77 77 77 76 76 76 75 75 75 76 76 76 76 76 76 75 75 75 76 75 75 75 75 75 75 75 75 75 75 74 74 74 74 75 75 75 75 74 74 74 74 74 74 74 74 74 75 75 75 74 74 74 74 74 74 74 75 75 75 75 75 75 75 75 74 74 74
6255G4%%%%%%%%%%%%j%%%J%%%%j%%%j%J%%%%%j%%%%%J%%%J%%%%%%%%%%%%%%%%%%%%%%%J%%
$$ 74 74 74 74 74 74 74 74 74 74 74 74 74 73 73 73 73 74 74 74 74 74 73 73 73 73 72 72 73 73 73 73 73 73 72 72 72 72 72 72 73 73 73 73 74 74 74 74 74 74 74 74 74 74 74 74 74 74 74 74 74 74 74 74 74 74 74 74 75 75 75
6247G5j%%%%%%Jj%%j%J%Jj%%J%j%%%%%%%%%%%J%%%%%%%%%%%%%%%%%%%%%%%%%%Jj%%%j%%%%
$$ 75 74 74 74 74 74 74 74 75 74 74 74 73 73 74 74 75 74 74 74 75 75 74 74 74 74 74 74 74 74 74 74 74 74 75 75 75 75 75 75 75 75 75 75 75 75 75 75 75 75 75 75 75 75 75 75 75 75 75 75 75 76 75 75 75 75 74 74 74 74 74
6240G4%%%%%J%%%%j%%%J%%%%%%%%%%%%%%%%%%%%%%%%%%%%%%%%%%%%%%%%%%%%%%%%%%%%%%%
$$ 74 74 74 74 74 74 75 75 75 75 75 74 74 74 74 75 75 75 75 75 75 75 75 75 75 75 75 75 75 75 75 75 75 75 75 75 75 75 75 75 75 75 75 75 75 75 75 75 75 75 75 75 75 75 75 75 75 75 75 75 75 75 75 75 75 75 75 75 75 75 75
6232G5%%%Jj%%%%%%%%%%%%%%%%%%%%%%%%%j%%J%%j%%%%%%%%%J%%%%%%%%%%jJ%%%%J%%%%%j
$$ 75 75 75 75 76 75 75 75 75 75 75 75 75 75 75 75 75 75 75 75 75 75 75 75 75 75 75 75 75 75 75 74 74 74 75 75 75 74 74 74 74 74 74 74 74 74 74 75 75 75 75 75 75 75 75 75 75 75 74 75 75 75 75 75 76 76 76 76 76 76 75
6225G5%%J%j%%Jj%%%%%J%%%%%%%%%%%%%J%j%%%%%%%%%%%%%%%J%j%%%%%%%%%%%%%%%%%%%%J
$$ 75 75 75 76 76 75 75 75 76 75 75 75 75 75 75 76 76 76 76 76 76 76 76 76 76 76 76 76 76 77 77 76 76 76 76 76 76 76 76 76 76 76 76 76 76 76 76 77 77 76 76 76 76 76 76 76 76 76 76 76 76 76 76 76 76 76 76 76 76 76 77
6218G7%%%%%jJ%%%%%%%%j%%%%%%%%%%%%%%J%%%%%%%%j%%%J%%%%%%%%j%%%J%%%%%j%J%%%%%
$$ 77 77 77 77 77 77 76 77 77 77 77 77 77 77 77 77 76 76 76 76 76 76 76 76 76 76 76 76 76 76 76 77 77 77 77 77 77 77 77 77 76 76 76 76 77 77 77 77 77 77 77 77 77 76 76 76 76 77 77 77 77 77 77 76 76 77 77 77 77 77 77
6210G7%%%%%j%%%%%%%%J%%%%%%%%%%%%%j%%%%%%J%%%%%%%%j%%%%%%%%%%%%J%%%j%%%%%%J%
$$ 77 77 77 77 77 77 76 76 76 76 76 76 76 76 76 77 77 77 77 77 77 77 77 77 77 77 77 77 77 76 76 76 76 76 76 76 77 77 77 77 77 77 77 77 77 76 76 76 76 76 76 76 76 76 76 76 76 76 77 77 77 77 76 76 76 76 76 76 76 77 77
6203G7%%%%%%%%%%%%%%%%%%%%%%J%%%%%j%%j%%J%%%%%%%%J%%j%Jj%J%%%%j%%%J%%j%J%%%j
$$ 77 77 77 77 77 77 77 77 77 77 77 77 77 77 77 77 77 77 77 77 77 77 77 78 78 78 78 78 78 77 77 77 76 76 76 77 77 77 77 77 77 77 77 77 78 78 78 77 77 78 77 77 78 78 78 78 78 77 77 77 77 78 78 78 77 77 78 78 78 78 77
6195G7%%%%%%%%%%%%%%%j%%%%%%%%%J%%%%%%%j%%%%%%%J%%%j%%%J%%%%%%j%%J%j%J%%%%%j
$$ 77 77 77 77 77 77 77 77 77 77 77 77 77 77 77 77 76 76 76 76 76 76 76 76 76 76 77 77 77 77 77 77 77 77 76 76 76 76 76 76 76 76 77 77 77 77 76 76 76 76 77 77 77 77 77 77 77 76 76 76 77 77 76 76 77 77 77 77 77 77 76
6188G6%%%%%%%Jj%%%J%%%j%%%%%j%%%%%%%J%%%%%%%%jJ%J%%j%JjJ%j%%%%%J%%%%%%j%%%%J
$$ 76 76 76 76 76 76 76 76 77 76 76 76 76 77 77 77 77 76 76 76 76 76 76 75 75 75 75 75 75 75 75 76 76 76 76 76 76 76 76 76 75 76 76 77 77 77 76 76 77 76 77 77 76 76 76 76 76 76 77 77 77 77 77 77 77 76 76 76 76 76 77
6180G7j%%%%%%%%%%%%%%%%%%j%%J%%%%%%%j%J%%%%%%J%j%%%%%J%%%%%%%%%%%%j%%%%%%%%%
$$ 77 76 76 76 76 76 76 76 76 76 76 76 76 76 76 76 76 76 76 76 75 75 75 76 76 76 76 76 76 76 76 75 75 76 76 76 76 76 76 76 77 77 76 76 76 76 76 76 77 77 77 77 77 77 77 77 77 77 77 77 77 76 76 76 76 76 76 76 76 76 76
6173G6%%%%%%%%%%%%%%%%JjJ%jJ%%%%%j%%%%%%%%j%%%J%%%J%%%j%%%j%%%%%J%%%j%%J%%%%
$$ 76 76 76 76 76 76 76 76 76 76 76 76 76 76 76 76 76 77 76 77 77 76 77 77 77 77 77 77 76 76 76 76 76 76 76 76 76 75 75 75 75 76 76 76 76 77 77 77 77 76 76 76 76 75 75 75 75 75 75 76 76 76 76 75 75 75 76 76 76 76 76
6166G6%%jJ%%%%j%%%%%%%%%%%%%j%%%J%%%%%%%%%%%%%%%%%%%Jj%%%%J%j%%%%%%%%Jj%Jj%%
$$ 76 76 76 75 76 76 76 76 76 75 75 75 75 75 75 75 75 75 75 75 75 75 75 74 74 74 74 75 75 75 75 75 75 75 75 75 75 75 75 75 75 75 75 75 75 75 75 76 75 75 75 75 75 76 76 75 75 75 75 75 75 75 75 75 76 75 75 76 75 75 75
6158G5%%J%jJ%J%%j%%%%%%%%%jJ%%%%%%%%%j%%%%%%%%J%%%%%%%%%%%%%%%%%%%%%%%%%jJj%
$$ 75 75 75 76 76 75 76 76 77 77 77 76 76 76 76 76 76 76 76 76 76 75 76 76 76 76 76 76 76 76 76 76 75 75 75 75 75 75 75 75 75 76 76 76 76 76 76 76 76 76 76 76 76 76 76 76 76 76 76 76 76 76 76 76 76 76 76 75 76 75 75
6151G5J%%%%%%%%%%%%%%%%%%%%%%%j%J%J%%%%%%%%%%%j%%%%%%%%%J%%%%j%J%%%%%%%%%%%j
$$ 75 76 76 76 76 76 76 76 76 76 76 76 76 76 76 76 76 76 76 76 76 76 76 76 76 75 75 76 76 77 77 77 77 77 77 77 77 77 77 77 77 76 76 76 76 76 76 76 76 76 76 77 77 77 77 77 76 76 77 77 77 77 77 77 77 77 77 77 77 77 76
6143G6%%%%%Jj%%%%%%j%jJ%%%%%%J%%%%%%%%j%%%%J%%j%%J%%%%%j%%%%Jj%%%%%%%%%%%%%%
$$ 76 76 76 76 76 76 77 76 76 76 76 76 76 76 75 75 74 75 75 75 75 75 75 75 76 76 76 76 76 76 76 76 76 75 75 75 75 75 76 76 76 75 75 75 76 76 76 76 76 76 75 75 75 75 75 76 75 75 75 75 75 75 75 75 75 75 75 75 75 75 75
6136G5%%%%%%j%J%%%%%%j%%%%%%%%j%%%J%J%%%j%%%J%j%J%j%%%%%%%%%%%%%%%j%%%%%%%%%
$$ 75 75 75 75 75 75 75 74 74 75 75 75 75 75 75 75 74 74 74 74 74 74 74 74 74 73 73 73 73 74 74 75 75 75 75 74 74 74 74 75 75 74 74 75 75 74 74 74 74 74 74 74 74 74 74 74 74 74 74 74 74 73 73 73 73 73 73 73 73 73 73
6129G3%%%J%%%%%%%%%%%%%%%%j%%%%%J%%%%%%Jj%%%%%%%%%%%%%%%%%%%%J%%%%%J%%j%%%%J
$$ 73 73 73 73 74 74 74 74 74 74 74 74 74 74 74 74 74 74 74 74 74 73 73 73 73 73 73 74 74 74 74 74 74 74 75 74 74 74 74 74 74 74 74 74 74 74 74 74 74 74 74 74 74 74 74 74 75 75 75 75 75 75 76 76 76 75 75 75 75 75 76
6121G6%%%%%%%jJ%%%%%%%%%%%%%jJ%j%%%%%%%J%%j%%%%%J%%%%%%%%%%%J%%%j%%%%%%%%%%j
$$ 76 76 76 76 76 76 76 76 75 76 76 76 76 76 76 76 76 76 76 76 76 76 76 75 76 76 75 75 75 75 75 75 75 75 76 76 76 75 75 75 75 75 75 76 76 76 76 76 76 76 76 76 76 76 76 77 77 77 77 76 76 76 76 76 76 76 76 76 76 76 75
6114G5%%%J%%%%%%%%j%%%%%%%%J%j%%%%%%j%J%J%%%%j%%%J%%%jJ%%jJ%%%%%%%%%%%%%%%j%
$$ 75 75 75 75 76 76 76 76 76 76 76 76 76 75 75 75 75 75 75 75 75 75 76 76 75 75 75 75 75 75 75 74 74 75 75 76 76 76 76 76 75 75 75 75 76 76 76 76 75 76 76 76 75 76 76 76 76 76 76 76 76 76 76 76 76 76 76 76 76 75 75
6106G5%%%%%%%%%%%%%%J%%%j%%%%%%J%j%%J%%%%%%%%%%%%%%%%%%%%%%%j%%%%J%%%%%%%%%%
$$ 75 75 75 75 75 75 75 75 75 75 75 75 75 75 75 76 76 76 76 75 75 75 75 75 75 75 76 76 75 75 75 76 76 76 76 76 76 76 76 76 76 76 76 76 76 76 76 76 76 76 76 76 76 76 76 75 75 75 75 75 76 76 76 76 76 76 76 76 76 76 76
6099G6%jJ%%%%%%%%%%%%%jJ%%%Jj%%%%%%%%%%%%%%%%%%%%%J%%j%%%%%%%%Jj%%%J%%%%%%j%
$$ 76 76 75 76 76 76 76 76 76 76 76 76 76 76 76 76 76 75 76 76 76 76 77 76 76 76 76 76 76 76 76 76 76 76 76 76 76 76 76 76 76 76 76 76 76 77 77 77 76 76 76 76 76 76 76 76 76 77 76 76 76 76 77 77 77 77 77 77 77 76 76
6091G6%Jj%%%%%%%%%%%J%j%%%%%%%%J%j%J%j%%%%%%%%%%%%%%%%%%j%%%%J%%%j%%%J%%j%%%
$$ 76 76 77 76 76 76 76 76 76 76 76 76 76 76 76 77 77 76 76 76 76 76 76 76 76 76 77 77 76 76 77 77 76 76 76 76 76 76 76 76 76 76 76 76 76 76 76 76 76 76 76 75 75 75 75 75 76 76 76 76 75 75 75 75 76 76 76 75 75 75 75
6084G5J%%j%%J%%j%%%%J%%%%%%%%%%%%%%%j%%%%J%J%%jj%Jj%%%%%%%%%%%%J%%%j%%%%J%%%
$$ 75 76 76 76 75 75 75 76 76 76 75 75 75 75 75 76 76 76 76 76 76 76 76 76 76 76 76 76 76 76 76 75 75 75 75 75 76 76 77 77 77 76 75 75 76 75 75 75 75 75 75 75 75 75 75 75 75 75 76 76 76 76 75 75 75 75 75 76 76 76 76
6077G6%%%%%%%%%j%%%%%J%%%%%%%%%j%%J%%%%%jJ%%%%%%%%%%%%%%%%%%j%%%%%%%J%%%%%%%
$$ 76 76 76 76 76 76 76 76 76 76 75 75 75 75 75 75 76 76 76 76 76 76 76 76 76 76 75 75 75 76 76 76 76 76 76 75 76 76 76 76 76 76 76 76 76 76 76 76 76 76 76 76 76 76 76 75 75 75 75 75 75 75 75 76 76 76 76 76 76 76 76
6069G6%%%%%J%%j%%%j%%%%J%%%%%%%%%j%%%%%%%%J%%%%%%%%%%j%%%J%%%%%%%jJ%%%%%%%%%
$$ 76 76 76 76 76 76 77 77 77 76 76 76 76 75 75 75 75 75 76 76 76 76 76 76 76 76 76 76 75 75 75 75 75 75 75 75 75 76 76 76 76 76 76 76 76 76 76 76 75 75 75 75 76 76 76 76 76 76 76 76 75 76 76 76 76 76 76 76 76 76 76
6062G6%%j%J%%%%%%%%%%%%%j%%Jj%%%%J%%j%J%%Jj%%j%J%%%%j%J%%%%%%%%%%%%J%%%%%%%%
$$ 76 76 76 75 75 76 76 76 76 76 76 76 76 76 76 76 76 76 76 75 75 75 76 75 75 75 75 75 76 76 76 75 75 76 76 76 77 76 76 76 75 75 76 76 76 76 76 75 75 76 76 76 76 76 76 76 76 76 76 76 76 76 77 77 77 77 77 77 77 77 77
6054G7%%j%%%%%%%J%%%j%%%%J%j%%%%Jj%J%%%%%%%j%%%%%%%%%%%J%%%%%%%j%%j%%%%J%%%j
$$ 77 77 77 76 76 76 76 76 76 76 76 77 77 77 77 76 76 76 76 76 77 77 76 76 76 76 76 77 76 76 77 77 77 77 77 77 77 77 76 76 76 76 76 76 76 76 76 76 76 76 77 77 77 77 77 77 77 77 76 76 76 75 75 75 75 75 76 76 76 76 75
6047G5%%%%%jJ%J%%jJ%%%%%%%%%j%%%%%%J%%%%j%%jj%%J%%%%%%%%%%%%%%%%%%%j%J%J%%%%
$$ 75 75 75 75 75 75 74 75 75 76 76 76 75 76 76 76 76 76 76 76 76 76 76 75 75 75 75 75 75 75 76 76 76 76 76 75 75 75 74 73 73 73 74 74 74 74 74 74 74 74 74 74 74 74 74 74 74 74 74 74 74 74 73 73 74 74 75 75 75 75 75
6040G5%%%%%%j%%%%Jj%%%J%%%%jJ%%j%%%%%%%%J%%j%%J%%%%%%%%%%%%%%%J%%j%%%%J%%jJ%
$$ 75 75 75 75 75 75 75 74 74 74 74 74 75 74 74 74 74 75 75 75 75 75 74 75 75 75 74 74 74 74 74 74 74 74 74 75 75 75 74 74 74 75 75 75 75 75 75 75 75 75 75 75 75 75 75 75 75 76 76 76 75 75 75 75 75 76 76 76 75 76 76
6032G6%%%%%%%%%%%j%%%%%%%%J%%%%%%%%jJ%%%%%%J%%%%%%%%%%%%%%%j%%%%%%%%%%%%%%%%
$$ 76 76 76 76 76 76 76 76 76 76 76 76 75 75 75 75 75 75 75 75 75 76 76 76 76 76 76 76 76 76 75 76 76 76 76 76 76 76 77 77 77 77 77 77 77 77 77 77 77 77 77 77 77 77 76 76 76 76 76 76 76 76 76 76 76 76 76 76 76 76 76
6025G6%%%%%J%%j%%%%%J%%%%j%%%%%%%%%%%%%%%%%%%%%%%%%Jj%%J%%j%%Jj%%%%%%%%%%%%j
$$ 76 76 76 76 76 76 77 77 77 76 76 76 76 76 76 77 77 77 77 77 76 76 76 76 76 76 76 76 76 76 76 76 76 76 76 76 76 76 76 76 76 76 76 76 76 76 77 76 76 76 77 77 77 76 76 76 77 76 76 76 76 76 76 76 76 76 76 76 76 76 75
6017G5%J%%%j%%J%%%%%%%%%%%%%%j%%%%J%j%%%%%J%%%%%%%%%%%j%%%%%%%%%%%%%%%%%%%%J
$$ 75 75 76 76 76 76 75 75 75 76 76 76 76 76 76 76 76 76 76 76 76 76 76 76 75 75 75 75 75 76 76 75 75 75 75 75 75 76 76 76 76 76 76 76 76 76 76 76 76 75 75 75 75 75 75 75 75 75 75 75 75 75 75 75 75 75 75 75 75 75 76
6010G6%%%jJ%%%j%%%J%%%%%%%jJ%%%j%%%j%%%%%%%%%J%%%Jj%%%%%%j%J%%%%%j%%%%%%%%%J
$$ 76 76 76 76 75 76 76 76 76 75 75 75 75 76 76 76 76 76 76 76 76 75 76 76 76 76 75 75 75 75 74 74 74 74 74 74 74 74 74 74 75 75 75 75 76 75 75 75 75 75 75 75 74 74 75 75 75 75 75 75 74 74 74 74 74 74 74 74 74 74 75
6002G5%%%%%%j%%%%%%%%%JJ%%j%%%%%J%%%%%%%%%%%%%%%j%J%%%%%%%%%%%%J%jJ%%%j%%%%%
$$ 75 75 75 75 75 75 75 74 74 74 74 74 74 74 74 74 74 75 76 76 76 75 75 75 75 75 75 76 76 76 76 76 76 76 76 76 76 76 76 76 76 76 76 75 75 76 76 76 76 76 76 76 76 76 76 76 76 76 77 77 76 77 77 77 77 76 76 76 76 76 76
5995G6%%%%j%j%J%%J%%%%%%%%%%%%%j%J%%%%%j%J%%%%%%%%%%j%J%%Jj%%%%%%%%%%Jj%%%j%
$$ 76 76 76 76 76 75 75 74 74 75 75 75 76 76 76 76 76 76 76 76 76 76 76 76 76 76 75 75 76 76 76 76 76 76 75 75 76 76 76 76 76 76 76 76 76 76 76 75 75 76 76 76 77 76 76 76 76 76 76 76 76 76 76 76 77 76 76 76 76 75 75
5988G5%%%%J%%%%%%%%%%%%%jJ%%%%%%jJ%%%j%%%%%%%%%%%%%J%J%%j%Jj%J%%%j%%%%%%%%%%
$$ 75 75 75 75 75 76 76 76 76 76 76 76 76 76 76 76 76 76 76 75 76 76 76 76 76 76 76 75 76 76 76 76 75 75 75 75 75 75 75 75 75 75 75 75 75 75 76 76 77 77 77 76 76 77 76 76 77 77 77 77 76 76 76 76 76 76 76 76 76 76 76
5980G6%%%%%%%%j%J%%%%%%%%%%%%%%%%%%%%%%%%j%%%%J%%Jj%%j%%J%%%%j%%J%%%%%%%%%%J
$$ 76 76 76 76 76 76 76 76 76 75 75 76 76 76 76 76 76 76 76 76 76 76 76 76 76 76 76 76 76 76 76 76 76 76 76 76 75 75 75 75 75 76 76 76 77 76 76 76 75 75 75 76 76 76 76 76 75 75 75 76 76 76 76 76 76 76 76 76 76 76 77
5973G7j%%%%%%%Jj%Jj%%%%%j%%%%%%%%%jJ%%J%%%%%%%%j%%%%%%%%J%%j%Jj%%J%%%%%%%%%j
$$ 77 76 76 76 76 76 76 76 76 77 76 76 77 76 76 76 76 76 76 75 75 75 75 75 75 75 75 75 75 74 75 75 75 76 76 76 76 76 76 76 76 76 75 75 75 75 75 75 75 75 75 76 76 76 75 75 76 75 75 75 76 76 76 76 76 76 76 76 76 76 75
5965G5%%%%%%%%%%%%%%%%%J%%j%Jj%%%J%%%jJ%%j%%%%%%%Jj%%%%%%Jj%%J%%%%%%j%%%%%%%
$$ 75 75 75 75 75 75 75 75 75 75 75 75 75 75 75 75 75 75 76 76 76 75 75 76 75 75 75 75 76 76 76 76 75 76 76 76 75 75 75 75 75 75 75 75 76 75 75 75 75 75 75 75 76 75 75 75 76 76 76 76 76 76 76 75 75 75 75 75 75 75 75
5958G5%%J%%%%Jj%%jJ%%%j%%%%%%%%%%J%%%%%%%%%%%%%%j%%%%J%%%%%%%%%%%%%%%j%%%%%%
$$ 75 75 75 76 76 76 76 76 77 76 76 76 75 76 76 76 76 75 75 75 75 75 75 75 75 75 75 75 76 76 76 76 76 76 76 76 76 76 76 76 76 76 76 75 75 75 75 75 76 76 76 76 76 76 76 76 76 76 76 76 76 76 76 76 75 75 75 75 75 75 75
5951G5%%%Jj%%%%%%%%%%%%%%%%J%%%j%%J%%jJ%%%%%%j%%%%%%%J%%%%%%%j%%%J%%%j%%%%%%
$$ 75 75 75 75 76 75 75 75 75 75 75 75 75 75 75 75 75 75 75 75 75 75 76 76 76 76 75 75 75 76 76 76 75 76 76 76 76 76 76 76 75 75 75 75 75 75 75 75 76 76 76 76 76 76 76 76 75 75 75 75 76 76 76 76 75 75 75 75 75 75 75
5943G5J%%%%%%%j%J%%%%j%%J%%%%%j%%%%%%J%%%%%%%%%%%%%%%%%%%%%%%%%%%%%%%%%%%%%%
$$ 75 76 76 76 76 76 76 76 76 75 75 76 76 76 76 76 75 75 75 76 76 76 76 76 76 75 75 75 75 75 75 75 76 76 76 76 76 76 76 76 76 76 76 76 76 76 76 76 76 76 76 76 76 76 76 76 76 76 76 76 76 76 76 76 76 76 76 76 76 76 76
5936G6%%%%%%%%%%%%%%%%%%j%%J%J%%j%%%%%%%%%j%%%J%%%%%%%%%%%%%%%%j%J%%%%%%%%%%
$$ 76 76 76 76 76 76 76 76 76 76 76 76 76 76 76 76 76 76 76 75 75 75 76 76 77 77 77 76 76 76 76 76 76 76 76 76 76 75 75 75 75 76 76 76 76 76 76 76 76 76 76 76 76 76 76 76 76 76 75 75 76 76 76 76 76 76 76 76 76 76 76
5928G6%%J%%%jJ%%%jJ%%%j%%Jj%%%%%%J%jJj%J%%%%%j%%%%%%%J%%%%%j%%j%%J%%%%%j%%%%
$$ 76 76 76 77 77 77 77 76 77 77 77 77 76 77 77 77 77 76 76 76 77 76 76 76 76 76 76 76 77 77 76 77 76 76 77 77 77 77 77 77 76 76 76 76 76 76 76 76 77 77 77 77 77 77 76 76 76 75 75 75 76 76 76 76 76 76 75 75 75 75 75
5921G5%%%%%J%%%%%%%Jj%%%%%%%%%%%%J%%j%%%%j%%%%%%%%%%%%%%%j%%J%%%%%%%J%%%%j%J
$$ 75 75 75 75 75 75 76 76 76 76 76 76 76 76 77 76 76 76 76 76 76 76 76 76 76 76 76 76 77 77 77 76 76 76 76 76 75 75 75 75 75 75 75 75 75 75 75 75 75 75 75 75 74 74 74 75 75 75 75 75 75 75 75 76 76 76 76 76 75 75 76
5913G6%%%%%%%%%%j%%J%%%j%%%%J%%j%%%%%%%%j%J%%%%%%%%%%%%%%%%%%%%%J%%%%%%%%%%%
$$ 76 76 76 76 76 76 76 76 76 76 76 75 75 75 76 76 76 76 75 75 75 75 75 76 76 76 75 75 75 75 75 75 75 75 75 74 74 75 75 75 75 75 75 75 75 75 75 75 75 75 75 75 75 75 75 75 75 75 75 76 76 76 76 76 76 76 76 76 76 76 76
5906G6%%%%%%%%%%%%%Jj%%%j%%Jj%%%%j%%J%%jJ%%Jj%%%%%%%%%%jJ%%%%%%%%%%%%%%%%%%%
$$ 76 76 76 76 76 76 76 76 76 76 76 76 76 76 77 76 76 76 76 75 75 75 76 75 75 75 75 75 74 74 74 75 75 75 74 75 75 75 76 75 75 75 75 75 75 75 75 75 75 75 74 75 75 75 75 75 75 75 75 75 75 75 75 75 75 75 75 75 75 75 75
5899G5%%%%%%%%%%%%%%%%%Jj%%%%j%%%%%%%%%%%%%%J%j%%J%%%%%%%j%%J%j%%J%%J%j%%%%%
$$ 75 75 75 75 75 75 75 75 75 75 75 75 75 75 75 75 75 75 76 75 75 75 75 75 74 74 74 74 74 74 74 74 74 74 74 74 74 74 74 75 75 74 74 74 75 75 75 75 75 75 75 75 74 74 74 75 75 74 74 74 75 75 75 76 76 75 75 75 75 75 75
5891G5%Jj%%%%Jj%%%%%%%%%j%%J%%%j%%Jj%%%%%J%%%%%%%%%%%%%%%j%J%%%%%%%%%%%%%%%%
$$ 75 75 76 75 75 75 75 75 76 75 75 75 75 75 75 75 75 75 75 74 74 74 75 75 75 75 74 74 74 75 74 74 74 74 74 74 75 75 75 75 75 75 75 75 75 75 75 75 75 75 75 75 74 74 75 75 75 75 75 75 75 75 75 75 75 75 75 75 75 75 75
5884G5%%%%%%%Jj%%%%%%%%%%%%%%%%%%J%%%%j%%%%%%%%%%%%%%%%%%%%J%%%%%%%J%jj%%%%%
$$ 75 75 75 75 75 75 75 75 76 75 75 75 75 75 75 75 75 75 75 75 75 75 75 75 75 75 75 75 76 76 76 76 76 75 75 75 75 75 75 75 75 75 75 75 75 75 75 75 75 75 75 75 75 75 76 76 76 76 76 76 76 76 77 77 76 75 75 75 75 75 75
5876G5%%%Jj%%%%J%j%%%%%%%%%%%%%%%%%%%%%%%%%%%%%J%j%%%%%Jj%J%%j%%%%%jJ%%%%%%%
$$ 75 75 75 75 76 75 75 75 75 75 76 76 75 75 75 75 75 75 75 75 75 75 75 75 75 75 75 75 75 75 75 75 75 75 75 75 75 75 75 75 75 75 76 76 75 75 75 75 75 75 76 75 75 76 76 76 75 75 75 75 75 75 74 75 75 75 75 75 75 75 75
5869G5%%%%%%%%%%%Jj%%%%%J%%%%j%%%%%%%%%%%%%%%%%%%%%%%%%%%%%J%%%%%%%%j%%%Jj%%
$$ 75 75 75 75 75 75 75 75 75 75 75 75 76 75 75 75 75 75 75 76 76 76 76 76 75 75 75 75 75 75 75 75 75 75 75 75 75 75 75 75 75 75 75 75 75 75 75 75 75 75 75 75 75 75 76 76 76 76 76 76 76 76 76 75 75 75 75 76 75 75 75
5861G5%%%%J%j%jJ%%%j%%J%%%%jJ%%%Jj%%Jj%%%J%%%%j%%%J%j%%%%%%%%%%%%%%%%%%%%%%%
$$ 75 75 75 75 75 76 76 75 75 74 75 75 75 75 74 74 74 75 75 75 75 75 74 75 75 75 75 76 75 75 75 76 75 75 75 75 76 76 76 76 76 75 75 75 75 76 76 75 75 75 75 75 75 75 75 75 75 75 75 75 75 75 75 75 75 75 75 75 75 75 75
5854G5%%%j%J%%%%%%j%%J%%%%%%%%%%%%%%%%%%%%%J%%%j%%%%%%%%%%%%%jJ%%%%%%%%%j%%%
$$ 75 75 75 75 74 74 75 75 75 75 75 75 75 74 74 74 75 75 75 75 75 75 75 75 75 75 75 75 75 75 75 75 75 75 75 75 75 75 76 76 76 76 75 75 75 75 75 75 75 75 75 75 75 75 75 75 74 75 75 75 75 75 75 75 75 75 75 74 74 74 74
5847G4%Jj%J%%%%%%%jJ%%%%%%%%J%%j%%jJ%%%%%J%%%%%%j%%J%%j%%%%%%%%%%%%J%%%%%%j%
$$ 74 74 75 74 74 75 75 75 75 75 75 75 75 74 75 75 75 75 75 75 75 75 75 76 76 76 75 75 75 74 75 75 75 75 75 75 76 76 76 76 76 76 76 75 75 75 76 76 76 75 75 75 75 75 75 75 75 75 75 75 75 75 76 76 76 76 76 76 76 75 75
5839G5%%%%%%J%%%%%%%j%%%%%%J%%%j%%%%%J%J%%%%j%%%Jj%%%%%%%%%%j%%%%J%%%%Jj%%%%
$$ 75 75 75 75 75 75 75 76 76 76 76 76 76 76 76 75 75 75 75 75 75 75 76 76 76 76 75 75 75 75 75 75 76 76 77 77 77 77 77 76 76 76 76 77 76 76 76 76 76 76 76 76 76 76 76 75 75 75 75 75 76 76 76 76 76 77 76 76 76 76 76
5832G6%j%%%%%%%%%%%%%%j%J%%%%%%%%%%J%%j%%%%%%%%%%%%j%%%J%%%%%j%%J%%%%j%%%%%%
$$ 76 76 75 75 75 75 75 75 75 75 75 75 75 75 75 75 75 74 74 75 75 75 75 75 75 75 75 75 75 75 76 76 76 75 75 75 75 75 75 75 75 75 75 75 75 75 74 74 74 74 75 75 75 75 75 75 74 74 74 75 75 75 75 75 74 74 74 74 74 74 74
5824G4%%%j%J%%%%%%%%%%%%%jJ%%%%Jj%%j%J%%%%%%%%%%%%%%%%%%%%%%Jj%J%%%%%%%%%%%%
$$ 74 74 74 74 73 73 74 74 74 74 74 74 74 74 74 74 74 74 74 74 73 74 74 74 74 74 75 74 74 74 73 73 74 74 74 74 74 74 74 74 74 74 74 74 74 74 74 74 74 74 74 74 74 74 74 75 74 74 75 75 75 75 75 75 75 75 75 75 75 75 75
5817G5%j%%%%%%%%%%%%%%%%%%%%%%j%%J%%%%%%%%%%%%%%%%j%%%%%%%%J%%%%%%%%%%J%j%%%
$$ 75 75 74 74 74 74 74 74 74 74 74 74 74 74 74 74 74 74 74 74 74 74 74 74 74 73 73 73 74 74 74 74 74 74 74 74 74 74 74 74 74 74 74 74 74 73 73 73 73 73 73 73 73 73 74 74 74 74 74 74 74 74 74 74 74 75 75 74 74 74 74
5810G4%%%%%%%%%%%%%%%%%%%%%%%%%%%%j%%%%%J%%J%%j%%%%J%%j%%%%%%%%j%%%J%%%%%%%%
$$ 74 74 74 74 74 74 74 74 74 74 74 74 74 74 74 74 74 74 74 74 74 74 74 74 74 74 74 74 74 73 73 73 73 73 73 74 74 74 75 75 75 74 74 74 74 74 75 75 75 74 74 74 74 74 74 74 74 74 73 73 73 73 74 74 74 74 74 74 74 74 74
5802G4%%%%%%%%%%%%jJ%%J%j%%%j%J%J%%%%%%%%%%%%%%%%%%%%%%%%j%%%%%J%j%%%J%%%%j%
$$ 74 74 74 74 74 74 74 74 74 74 74 74 74 73 74 74 74 75 75 74 74 74 74 73 73 74 74 75 75 75 75 75 75 75 75 75 75 75 75 75 75 75 75 75 75 75 75 75 75 75 75 75 74 74 74 74 74 74 75 75 74 74 74 74 75 75 75 75 75 74 74
5795G4%%%J%%%%%J%%%j%%%%%%%%%J%%%%%%j%J%%%jJ%j%%%J%%%%jJ%%%%%%j%%%%%%%%%%%J%
$$ 74 74 74 74 75 75 75 75 75 75 76 76 76 76 75 75 75 75 75 75 75 75 75 75 76 76 76 76 76 76 76 75 75 76 76 76 76 75 76 76 75 75 75 75 76 76 76 76 76 75 76 76 76 76 76 76 76 75 75 75 75 75 75 75 75 75 75 75 75 76 76
5787G6%%%%%%%%%%j%J%%%%%%%%%%%%%%j%%%%%J%%%%%%%j%%J%Jj%%%%%j%%%%%%J%%%%%%%j%
$$ 76 76 76 76 76 76 76 76 76 76 76 75 75 76 76 76 76 76 76 76 76 76 76 76 76 76 76 76 75 75 75 75 75 75 76 76 76 76 76 76 76 76 75 75 75 76 76 77 76 76 76 76 76 76 75 75 75 75 75 75 75 76 76 76 76 76 76 76 76 75 75
5780G5%J%j%%J%J%j%%%%%%%%%%%%%J%%j%%%%J%%j%%%j%%%%J%%%%%%%%%%%%%%%%%%%%%%%%%
$$ 75 75 76 76 75 75 75 76 76 77 77 76 76 76 76 76 76 76 76 76 76 76 76 76 76 77 77 77 76 76 76 76 76 77 77 77 76 76 76 76 75 75 75 75 75 76 76 76 76 76 76 76 76 76 76 76 76 76 76 76 76 76 76 76 76 76 76 76 76 76 76
5772G6%J%%j%J%%j%%%%%%%%%j%%%%%%%%%%J%%j%%%%%%%Jj%%J%%%%%%%%j%%J%j%%%%%%%%%%
$$ 76 76 77 77 77 76 76 77 77 77 76 76 76 76 76 76 76 76 76 76 75 75 75 75 75 75 75 75 75 75 75 76 76 76 75 75 75 75 75 75 75 75 76 75 75 75 76 76 76 76 76 76 76 76 76 75 75 75 76 76 75 75 75 75 75 75 75 75 75 75 75
5765G5%%%%%%%j%%%%%%%J%%%%%%jJ%%%%%%%%%%%%J%%%%%j%%%%%j%%%%%%%Jj%%%J%%%%%%%%
$$ 75 75 75 75 75 75 75 75 74 74 74 74 74 74 74 74 75 75 75 75 75 75 75 74 75 75 75 75 75 75 75 75 75 75 75 75 75 76 76 76 76 76 76 75 75 75 75 75 75 74 74 74 74 74 74 74 74 75 74 74 74 74 75 75 75 75 75 75 75 75 75
5758G5%%%%%%%%j%%%%%%%%%J%%%%%%%%%%%%%%%%%%%%%%%%%%%%%%%%%%%%jJ%%%%%%%%%%%%%
$$ 75 75 75 75 75 75 75 75 75 74 74 74 74 74 74 74 74 74 74 75 75 75 75 75 75 75 75 75 75 75 75 75 75 75 75 75 75 75 75 75 75 75 75 75 75 75 75 75 75 75 75 75 75 75 75 75 74 75 75 75 75 75 75 75 75 75 75 75 75 75 75
5750G5%%%%%%%%%%%%%%%j%%%J%%%%%%%%%%%jJ%%%%%%%%%%%%%J%%%%%%%j%%%%%Jj%%J%%%%j
$$ 75 75 75 75 75 75 75 75 75 75 75 75 75 75 75 75 74 74 74 74 75 75 75 75 75 75 75 75 75 75 75 75 74 75 75 75 75 75 75 75 75 75 75 75 75 75 75 76 76 76 76 76 76 76 76 75 75 75 75 75 75 76 75 75 75 76 76 76 76 76 75
5743G5%%%%%%%%%%%%%%%%%%%%%%%%%%%%%%%%%%j%%%%J%%%%%%j%%%%%J%%J%j%%%%%%%j%%J%
$$ 75 75 75 75 75 75 75 75 75 75 75 75 75 75 75 75 75 75 75 75 75 75 75 75 75 75 75 75 75 75 75 75 75 75 75 74 74 74 74 74 75 75 75 75 75 75 75 74 74 74 74 74 74 75 75 75 76 76 75 75 75 75 75 75 75 75 74 74 74 75 75
5735G5%%%%%%%Jj%%%%%%%%%%%%%%%%%%%%%j%J%%%%j%%%%%%%%%%J%%J%%j%%%%%%%%J%j%%%%
$$ 75 75 75 75 75 75 75 75 76 75 75 75 75 75 75 75 75 75 75 75 75 75 75 75 75 75 75 75 75 75 75 74 74 75 75 75 75 75 74 74 74 74 74 74 74 74 74 74 74 75 75 75 76 76 76 75 75 75 75 75 75 75 75 75 76 76 75 75 75 75 75
5728G5%%%j%%%%%J%%j%J%%%%%%j%%%%%J%%j%%%%%%%%%J%j%%%%%J%%j%%%J%%%%%%%%%%%%%J
$$ 75 75 75 75 74 74 74 74 74 74 75 75 75 74 74 75 75 75 75 75 75 75 74 74 74 74 74 74 75 75 75 74 74 74 74 74 74 74 74 74 74 75 75 74 74 74 74 74 74 75 75 75 74 74 74 74 75 75 75 75 75 75 75 75 75 75 75 75 75 75 76
5721G6%%j%%J%j%J%%%%%%%%%%%j%%%Jj%%%%%%%%%J%%%%%%%%%j%%J%%%%%Jj%%%%%%%%%j%%%
$$ 76 76 76 75 75 75 76 76 75 75 76 76 76 76 76 76 76 76 76 76 76 76 75 75 75 75 76 75 75 75 75 75 75 75 75 75 75 76 76 76 76 76 76 76 76 76 76 75 75 75 76 76 76 76 76 76 77 76 76 76 76 76 76 76 76 76 76 75 75 75 75
5713G5%%%J%jJ%%%%%%%%%%%%%%%%%%%%%%%%%%%%%%%%%%%%%%%%%%%%%%j%%%%%%J%%%%%j%%J
$$ 75 75 75 75 76 76 75 76 76 76 76 76 76 76 76 76 76 76 76 76 76 76 76 76 76 76 76 76 76 76 76 76 76 76 76 76 76 76 76 76 76 76 76 76 76 76 76 76 76 76 76 76 76 76 75 75 75 75 75 75 75 76 76 76 76 76 76 75 75 75 76
5706G6%%jJ%%%%%j%%%J%%%%%j%%%%%%J%%%%%%%%%%%%j%%%%%J%%%%j%%%%%%%%%%%%%%%%%%%
$$ 76 76 76 75 76 76 76 76 76 76 75 75 75 75 76 76 76 76 76 76 75 75 75 75 75 75 75 76 76 76 76 76 76 76 76 76 76 76 76 76 75 75 75 75 75 75 76 76 76 76 76 75 75 75 75 75 75 75 75 75 75 75 75 75 75 75 75 75 75 75 75
5698G5%%%%%%%Jj%%%%%%%Jj%%%%%J%%%%%%%j%%%%%%%%%j%%%%J%%%%%%%%%%%%%%%%%%j%%%J
$$ 75 75 75 75 75 75 75 75 76 75 75 75 75 75 75 75 75 76 75 75 75 75 75 75 76 76 76 76 76 76 76 76 75 75 75 75 75 75 75 75 75 75 74 74 74 74 74 75 75 75 75 75 75 75 75 75 75 75 75 75 75 75 75 75 75 75 74 74 74 74 75
5691G5%J%%j%%%%%%%%%%%%jJ%%%%%%%%%%%J%%j%%%%%%%%j%%JjJ%J%%%j%%%Jj%%%%Jj%%%J%
$$ 75 75 76 76 76 75 75 75 75 75 75 75 75 75 75 75 75 75 74 75 75 75 75 75 75 75 75 75 75 75 75 76 76 76 75 75 75 75 75 75 75 75 75 74 74 74 75 74 75 75 76 76 76 76 75 75 75 75 76 75 75 75 75 75 76 75 75 75 75 76 76
5683G6%j%%%%%%J%j%%%%J%%%%%%%%%%%%%%%%%%%%%%%j%%%%%%%jJ%%%%%%%%%%JjJ%%%%%%j%
$$ 76 76 75 75 75 75 75 75 75 76 76 75 75 75 75 75 76 76 76 76 76 76 76 76 76 76 76 76 76 76 76 76 76 76 76 76 76 76 76 76 75 75 75 75 75 75 75 75 74 75 75 75 75 75 75 75 75 75 75 75 76 75 76 76 76 76 76 76 76 75 75
5676G5%%%%%%%%%%j%J%%%%%%%%%%%%%%J%%%j%%%%%%J%%%%%%%%j%%%%%%%%%Jj%%%%%%%%%%%
$$ 75 75 75 75 75 75 75 75 75 75 75 74 74 75 75 75 75 75 75 75 75 75 75 75 75 75 75 75 76 76 76 76 75 75 75 75 75 75 75 76 76 76 76 76 76 76 76 76 75 75 75 75 75 75 75 75 75 75 76 75 75 75 75 75 75 75 75 75 75 75 75
5669G5Jj%%%%%%%%%%%%%%%%j%%J%j%%%%%%%%%J%jJ%%%%%j%%%%%%%%%%%%%%%%%%%J%%%%%%%
$$ 75 76 75 75 75 75 75 75 75 75 75 75 75 75 75 75 75 75 75 74 74 74 75 75 74 74 74 74 74 74 74 74 74 74 75 75 74 75 75 75 75 75 75 74 74 74 74 74 74 74 74 74 74 74 74 74 74 74 74 74 74 74 74 75 75 75 75 75 75 75 75
5661G5%%%%%J%j%j%%J%%%j%%%%%%%%%%%%%%%%%%jJ%%%%%%Jj%%J%%j%%%%Jj%%%%%%%%%%J%%
$$ 75 75 75 75 75 75 76 76 75 75 74 74 74 75 75 75 75 74 74 74 74 74 74 74 74 74 74 74 74 74 74 74 74 74 74 74 73 74 74 74 74 74 74 74 75 74 74 74 75 75 75 74 74 74 74 74 75 74 74 74 74 74 74 74 74 74 74 74 75 75 75
5654G5j%%%J%j%%%%%%%%j%%%J%%%J%%%%%%%%%%j%J%Jj%%%%%%%j%%%j%%J%%%j%%J%%%%%%%%
$$ 75 74 74 74 74 75 75 74 74 74 74 74 74 74 74 74 73 73 73 73 74 74 74 74 75 75 75 75 75 75 75 75 75 75 75 74 74 75 75 76 75 75 75 75 75 75 75 75 74 74 74 74 73 73 73 74 74 74 74 73 73 73 74 74 74 74 74 74 74 74 74
5646G4%%J%%j%%%%%%%%%%%%%%%%%%%%%%%%%%%%%%%%%%%%%%%%%%%%%j%%%%%%J%%%%%%%%%%j
$$ 74 74 74 75 75 75 74 74 74 74 74 74 74 74 74 74 74 74 74 74 74 74 74 74 74 74 74 74 74 74 74 74 74 74 74 74 74 74 74 74 74 74 74 74 74 74 74 74 74 74 74 74 73 73 73 73 73 73 73 74 74 74 74 74 74 74 74 74 74 74 73
5639G3J%%j%%%%%%%%%%J%%%%%j%%Jj%%%J%%j%%%%%%%%%%%%%j%%J%%%%Jj%%%%%%%%%J%%%j%
$$ 73 74 74 74 73 73 73 73 73 73 73 73 73 73 73 74 74 74 74 74 74 73 73 73 74 73 73 73 73 74 74 74 73 73 73 73 73 73 73 73 73 73 73 73 73 73 72 72 72 73 73 73 73 73 74 73 73 73 73 73 73 73 73 73 73 74 74 74 74 73 73
5632G3%%%%J%%%%%%%%%%%%%%%%%j%%%%%%%%%J%%%%%j%%%%%%%%%%%%%%%%%%%%%J%%%%%%%%j
$$ 73 73 73 73 73 74 74 74 74 74 74 74 74 74 74 74 74 74 74 74 74 74 74 73 73 73 73 73 73 73 73 73 73 74 74 74 74 74 74 73 73 73 73 73 73 73 73 73 73 73 73 73 73 73 73 73 73 73 73 73 73 74 74 74 74 74 74 74 74 74 73
5624G3%Jj%%J%%%%j%J%%j%J%%%%j%%J%j%%%%%%%%Jj%%%%J%%%%%%j%%J%%j%j%J%%%%%%%%J%
$$ 73 73 74 73 73 73 74 74 74 74 74 73 73 74 74 74 73 73 74 74 74 74 74 73 73 73 74 74 73 73 73 73 73 73 73 73 73 74 73 73 73 73 73 74 74 74 74 74 74 74 73 73 73 74 74 74 73 73 72 72 73 73 73 73 73 73 73 73 73 74 74
5617G4%%%%%%%%%%j%J%%%%%%%%%j%%J%%%%%%%%J%j%%%j%J%%%%%%%j%j%%%J%%%%%Jj%%J%%%
$$ 74 74 74 74 74 74 74 74 74 74 74 73 73 74 74 74 74 74 74 74 74 74 74 73 73 73 74 74 74 74 74 74 74 74 74 75 75 74 74 74 74 73 73 74 74 74 74 74 74 74 74 73 73 72 72 72 72 73 73 73 73 73 73 74 73 73 73 74 74 74 74
5609G4%%%j%%%%%%%%%%%%%%%%%J%%j%%%%%%%%%%%J%%%%%%%%%%%%%%%%%%%%j%%%%%Jj%%%%J
$$ 74 74 74 74 73 73 73 73 73 73 73 73 73 73 73 73 73 73 73 73 73 73 74 74 74 73 73 73 73 73 73 73 73 73 73 73 73 74 74 74 74 74 74 74 74 74 74 74 74 74 74 74 74 74 74 74 74 74 73 73 73 73 73 73 74 73 73 73 73 73 74
5602G4%%%%%j%%J%%j%%%J%%%%%%%%%%%%%%%%%%%%%%%%%%%%%%%%%%%%%%J%%%%%%%%%%%%%%%
$$ 74 74 74 74 74 74 73 73 73 74 74 74 73 73 73 73 74 74 74 74 74 74 74 74 74 74 74 74 74 74 74 74 74 74 74 74 74 74 74 74 74 74 74 74 74 74 74 74 74 74 74 74 74 74 74 75 75 75 75 75 75 75 75 75 75 75 75 75 75 75 75
5594G5%%%%%j%%J%%%%%%%%%%%%%%%%j%%%%%%%%%%J%%%%%%j%Jj%%J%%%%%%%%%%Jj%%%%%%j%
$$ 75 75 75 75 75 75 74 74 74 75 75 75 75 75 75 75 75 75 75 75 75 75 75 75 75 75 74 74 74 74 74 74 74 74 74 74 74 75 75 75 75 75 75 75 74 74 75 74 74 74 75 75 75 75 75 75 75 75 75 75 75 76 75 75 75 75 75 75 75 74 74
5587G4%%J%%%%%%%%J%%%%j%%%J%%%%%%%J%%%%%%%%%j%%%%%%%j%%%%%%%%%%%%%%%%%%%%Jj%
$$ 74 74 74 75 75 75 75 75 75 75 75 75 76 76 76 76 76 75 75 75 75 76 76 76 76 76 76 76 76 77 77 77 77 77 77 77 77 77 77 76 76 76 76 76 76 76 76 75 75 75 75 75 75 75 75 75 75 75 75 75 75 75 75 75 75 75 75 75 76 75 75
5580G5%J%%%%%%%%%%%%%%%%%j%J%%%%%%j%%J%%%%%%%%%j%%%Jjj%%J%%%J%%%j%%%%%%%%%%%
$$ 75 75 76 76 76 76 76 76 76 76 76 76 76 76 76 76 76 76 76 76 75 75 76 76 76 76 76 76 76 75 75 75 76 76 76 76 76 76 76 76 76 76 75 75 75 75 76 75 74 74 74 75 75 75 75 76 76 76 76 75 75 75 75 75 75 75 75 75 75 75 75
5572G5%%%%%%j%%%%%J%%%%J%%%j%%%%%%%%%%%%%%%%%%%%%%%%%%%%%%%%%%%%%%%%%%%%%%%%
$$ 75 75 75 75 75 75 75 74 74 74 74 74 74 75 75 75 75 75 76 76 76 76 75 75 75 75 75 75 75 75 75 75 75 75 75 75 75 75 75 75 75 75 75 75 75 75 75 75 75 75 75 75 75 75 75 75 75 75 75 75 75 75 75 75 75 75 75 75 75 75 75
5565G5%%%%j%%%%%%%%%%%%%%JjJ%%%%%%%%%j%%%%%%%J%%%%j%%%%%%jJ%%%%%%%%%%%%%%%J%
$$ 75 75 75 75 75 74 74 74 74 74 74 74 74 74 74 74 74 74 74 74 75 74 75 75 75 75 75 75 75 75 75 75 74 74 74 74 74 74 74 74 75 75 75 75 75 74 74 74 74 74 74 74 73 74 74 74 74 74 74 74 74 74 74 74 74 74 74 74 74 75 75
5557G5%%j%%%%%%%%jJ%%%%%%%%%%%%%%%%%%%%%%%%%%%%%%j%%%%%J%%%%%j%J%%%%%%%%%%%%
$$ 75 75 75 74 74 74 74 74 74 74 74 74 73 74 74 74 74 74 74 74 74 74 74 74 74 74 74 74 74 74 74 74 74 74 74 74 74 74 74 74 74 74 74 74 73 73 73 73 73 73 74 74 74 74 74 74 73 73 74 74 74 74 74 74 74 74 74 74 74 74 74
5550G4%%%%%%%%%j%%%%%%%%J%%%%%%%%j%%%J%%%%%%%%%%j%%%%%%%%J%%%jJ%%%%%%%%%%%%J
$$ 74 74 74 74 74 74 74 74 74 74 73 73 73 73 73 73 73 73 73 74 74 74 74 74 74 74 74 74 73 73 73 73 74 74 74 74 74 74 74 74 74 74 74 73 73 73 73 73 73 73 73 73 74 74 74 74 73 74 74 74 74 74 74 74 74 74 74 74 74 74 75
5543G5%%%%%%%%%j%J%%%%%%jjJ%%%%%%%%%%J%%j%%%J%%%%%%%%%%j%%%J%%%%%%%j%%%%%%%%
$$ 75 75 75 75 75 75 75 75 75 75 74 74 75 75 75 75 75 75 75 74 73 74 74 74 74 74 74 74 74 74 74 74 75 75 75 74 74 74 74 75 75 75 75 75 75 75 75 75 75 75 74 74 74 74 75 75 75 75 75 75 75 75 74 74 74 74 74 74 74 74 74
5535G4J%%%%%j%%%%%%%%%%%%%J%%jJ%%%%%%%%%%j%J%jJ%%%%%%%%j%%%%%%%J%%j%Jj%%%j%%
$$ 74 75 75 75 75 75 75 74 74 74 74 74 74 74 74 74 74 74 74 74 74 75 75 75 74 75 75 75 75 75 75 75 75 75 75 75 74 74 75 75 74 75 75 75 75 75 75 75 75 75 74 74 74 74 74 74 74 74 75 75 75 74 74 75 74 74 74 74 73 73 73
5528G3J%%j%J%%%%%J%%%%%%%%%%%%%%%%%%%%%%%%%%%%j%J%%%%%%%%%%%%%%j%%%%J%%%%%j%
$$ 73 74 74 74 73 73 74 74 74 74 74 74 75 75 75 75 75 75 75 75 75 75 75 75 75 75 75 75 75 75 75 75 75 75 75 75 75 75 75 75 75 74 74 75 75 75 75 75 75 75 75 75 75 75 75 75 75 75 74 74 74 74 74 75 75 75 75 75 75 74 74
5520G4%%%%%%J%J%%%%%%%%%%%%%j%%jJ%%%%J%%j%%%%%%J%%j%J%j%%%%%%%%%%J%%%%%%%%j%
$$ 74 74 74 74 74 74 74 75 75 76 76 76 76 76 76 76 76 76 76 76 76 76 76 75 75 75 74 75 75 75 75 75 76 76 76 75 75 75 75 75 75 75 76 76 76 75 75 76 76 75 75 75 75 75 75 75 75 75 75 75 76 76 76 76 76 76 76 76 76 75 75
5513G5J%%%%j%%%%%%%%%%J%%%%%%%%%%%%j%%j%%J%J%j%%%%%%%%%%%%%%%%%%%%%%%%%%%%%%
$$ 75 76 76 76 76 76 75 75 75 75 75 75 75 75 75 75 75 76 76 76 76 76 76 76 76 76 76 76 76 76 75 75 75 74 74 74 75 75 76 76 75 75 75 75 75 75 75 75 75 75 75 75 75 75 75 75 75 75 75 75 75 75 75 75 75 75 75 75 75 75 75
5505G5%%%%%%%%%%%%%%%%%%J%%%%%j%J%%%%j%%%%%%%%%%%J%j%%J%%%j%J%%%%%%j%j%%J%%%
$$ 75 75 75 75 75 75 75 75 75 75 75 75 75 75 75 75 75 75 75 76 76 76 76 76 76 75 75 76 76 76 76 76 75 75 75 75 75 75 75 75 75 75 75 75 76 76 75 75 75 76 76 76 76 75 75 76 76 76 76 76 76 76 75 75 74 74 74 75 75 75 75
5498G5%%%%J%%j%%%J%%%%%%%%%jJ%%%%%%%%%%%%%%%%%%%%%%%%%%%%%%%%%%%%%%%j%%%%%%%
$$ 75 75 75 75 75 76 76 76 75 75 75 75 76 76 76 76 76 76 76 76 76 76 75 76 76 76 76 76 76 76 76 76 76 76 76 76 76 76 76 76 76 76 76 76 76 76 76 76 76 76 76 76 76 76 76 76 76 76 76 76 76 76 76 75 75 75 75 75 75 75 75
5491G5%%%%%%%%%%J%%%%%j%%%%%%J%%%jJ%%%J%j%%%%%%%J%%j%%j%%%J%%%%%%%%%%%%J%%j%
$$ 75 75 75 75 75 75 75 75 75 75 75 76 76 76 76 76 76 75 75 75 75 75 75 75 76 76 76 76 75 76 76 76 76 77 77 76 76 76 76 76 76 76 76 77 77 77 76 76 76 75 75 75 75 76 76 76 76 76 76 76 76 76 76 76 76 76 77 77 77 76 76
5483G6%jJ%J%j%%%%%%%%%%%%%%%%%%jJ%%%%%%%%%%%%%%%%%%%J%%%%%%%%%%%%%%%Jj%%%%j%
$$ 76 76 75 76 76 77 77 76 76 76 76 76 76 76 76 76 76 76 76 76 76 76 76 76 76 76 75 76 76 76 76 76 76 76 76 76 76 76 76 76 76 76 76 76 76 76 76 77 77 77 77 77 77 77 77 77 77 77 77 77 77 77 77 78 77 77 77 77 77 76 76
5476G6%%J%%%%%%%j%%%%%%%%%%%%%%%%%%%%jJ%%%%%%%%%%%%%%%%%%%%%%j%J%%%%jJ%%%%%%
$$ 76 76 76 77 77 77 77 77 77 77 77 76 76 76 76 76 76 76 76 76 76 76 76 76 76 76 76 76 76 76 76 76 75 76 76 76 76 76 76 76 76 76 76 76 76 76 76 76 76 76 76 76 76 76 76 76 75 75 76 76 76 76 76 75 76 76 76 76 76 76 76
5468G6%%%%%%%%%%%%%%%Jj%%J%%%%j%%%%%%%%%%j%J%%jJ%%%j%%J%%%%%%%%j%%%%Jj%%%J%j
$$ 76 76 76 76 76 76 76 76 76 76 76 76 76 76 76 76 77 76 76 76 77 77 77 77 77 76 76 76 76 76 76 76 76 76 76 76 75 75 76 76 76 75 76 76 76 76 75 75 75 76 76 76 76 76 76 76 76 76 75 75 75 75 75 76 75 75 75 75 76 76 75
5461G5%%%%%%%J%%j%%%J%j%%%%%%%%j%%%J%%%%%%%%%J%%j%J%%%%%%j%J%%jJ%%%%%%j%%%%%
$$ 75 75 75 75 75 75 75 75 76 76 76 75 75 75 75 76 76 75 75 75 75 75 75 75 75 75 74 74 74 74 75 75 75 75 75 75 75 75 75 75 76 76 76 75 75 76 76 76 76 76 76 76 75 75 76 76 76 75 76 76 76 76 76 76 76 75 75 75 75 75 75
5454G5%%%%%%%jJ%%%%%j%%J%%%%%%%%%%%%%%%%%J%%jJ%%%%%j%J%%jJj%%%%%%%%%%%%%%%J%
$$ 75 75 75 75 75 75 75 75 74 75 75 75 75 75 75 74 74 74 75 75 75 75 75 75 75 75 75 75 75 75 75 75 75 75 75 75 76 76 76 75 76 76 76 76 76 76 75 75 76 76 76 75 76 75 75 75 75 75 75 75 75 75 75 75 75 75 75 75 75 76 76
5446G6%%%%j%J%%%%%%%%%%%%%%%%%%%%%%%%%%Jj%%%%%%%%%%%%%%j%J%%%Jj%%%%%%%%%J%%%
$$ 76 76 76 76 76 75 75 76 76 76 76 76 76 76 76 76 76 76 76 76 76 76 76 76 76 76 76 76 76 76 76 76 76 76 77 76 76 76 76 76 76 76 76 76 76 76 76 76 76 76 75 75 76 76 76 76 77 76 76 76 76 76 76 76 76 76 76 77 77 77 77
5439G7%J%j%%%%%%%%j%%%%%%j%J%%%%%%%%%J%%%%j%J%%j%%%%%%%j%%%%%%%%J%%%%%%%%J%%
$$ 77 77 78 78 77 77 77 77 77 77 77 77 77 76 76 76 76 76 76 76 75 75 76 76 76 76 76 76 76 76 76 76 77 77 77 77 77 76 76 77 77 77 76 76 76 76 76 76 76 76 75 75 75 75 75 75 75 75 75 76 76 76 76 76 76 76 76 76 77 77 77
5431G7j%%J%%%j%%%%%%j%%J%%%%%jJ%%%jJ%%%%%j%%%%%J%J%j%%%%%%%j%%%%%%J%%%%%%%%%
$$ 77 76 76 76 77 77 77 77 76 76 76 76 76 76 76 75 75 75 76 76 76 76 76 76 75 76 76 76 76 75 76 76 76 76 76 76 75 75 75 75 75 75 76 76 77 77 76 76 76 76 76 76 76 76 75 75 75 75 75 75 75 76 76 76 76 76 76 76 76 76 76
5424G6J%%%%%%%%j%%J%%%%%%%%%%j%%Jj%J%%%%j%%%%%%%%Jj%%%%%%j%%%J%%j%%J%%%%%%%%
$$ 76 77 77 77 77 77 77 77 77 77 76 76 76 77 77 77 77 77 77 77 77 77 77 77 76 76 76 77 76 76 77 77 77 77 77 76 76 76 76 76 76 76 76 76 77 76 76 76 76 76 76 76 75 75 75 75 76 76 76 75 75 75 76 76 76 76 76 76 76 76 76
5416G6J%%Jj%%%j%%J%%%%%%%%%%%%%%j%%%%%J%%%j%%J%%%%%j%%%%%j%%%%%%%%%J%%%%%%%J
$$ 76 77 77 77 78 77 77 77 77 76 76 76 77 77 77 77 77 77 77 77 77 77 77 77 77 77 77 76 76 76 76 76 76 77 77 77 77 76 76 76 77 77 77 77 77 77 76 76 76 76 76 76 75 75 75 75 75 75 75 75 75 75 76 76 76 76 76 76 76 76 77
5409G7j%%%%%J%%%%%%j%%J%%%%%%%j%J%%%%%j%%j%%%%J%jJ%%j%%J%%%%%J%%j%%%%%%%%%%%
$$ 77 76 76 76 76 76 76 77 77 77 77 77 77 77 76 76 76 77 77 77 77 77 77 77 77 76 76 77 77 77 77 77 77 76 76 76 75 75 75 75 75 76 76 75 76 76 76 75 75 75 76 76 76 76 76 76 77 77 77 76 76 76 76 76 76 76 76 76 76 76 76
5402G6%%%%%%%%%J%%%j%%%%%%J%%%j%%%%%%%%%%%%%j%%J%%%%%%%%j%%%%J%%%%%%%%%%J%%J
$$ 76 76 76 76 76 76 76 76 76 76 77 77 77 77 76 76 76 76 76 76 76 77 77 77 77 76 76 76 76 76 76 76 76 76 76 76 76 76 76 75 75 75 76 76 76 76 76 76 76 76 76 75 75 75 75 75 76 76 76 76 76 76 76 76 76 76 76 77 77 77 78
5394G8%%%j%J%j%%%%%%%%j%%J%%%%%jJ%%%%j%%%J%j%%%J%%%%%%%%%j%%%J%%%%%%%%%%j%%J
$$ 78 78 78 78 77 77 78 78 77 77 77 77 77 77 77 77 77 76 76 76 77 77 77 77 77 77 76 77 77 77 77 77 76 76 76 76 77 77 76 76 76 76 77 77 77 77 77 77 77 77 77 77 76 76 76 76 77 77 77 77 77 77 77 77 77 77 77 76 76 76 77
5387G7%%%%%Jj%J%%%%%%%%%j%Jj%%%%%%%%%jJ%%%%%j%%%%%%%%%Jj%J%%j%%%%%%%%%%%%%%%
$$ 77 77 77 77 77 77 78 77 77 78 78 78 78 78 78 78 78 78 78 77 77 78 77 77 77 77 77 77 77 77 77 77 76 77 77 77 77 77 77 76 76 76 76 76 76 76 76 76 76 77 76 76 77 77 77 76 76 76 76 76 76 76 76 76 76 76 76 76 76 76 76
5379G6%%%%%%%J%j%%%Jj%%%%%%Jj%j%%J%%%%%%%%%%%%%%%%%%%%%%%%%%%%%j%%J%%%%jJ%%%
$$ 76 76 76 76 76 76 76 76 77 77 76 76 76 76 77 76 76 76 76 76 76 76 77 76 76 75 75 75 76 76 76 76 76 76 76 76 76 76 76 76 76 76 76 76 76 76 76 76 76 76 76 76 76 76 76 76 76 76 75 75 75 76 76 76 76 76 75 76 76 76 76
5372G6j%%%%%%%%%%%%%%%%%%%%%%J%%%%%j%%J%%%%j%%%%%%%%%%%%%%%%%%%%%%%%%%%%%%J%
$$ 76 75 75 75 75 75 75 75 75 75 75 75 75 75 75 75 75 75 75 75 75 75 75 75 76 76 76 76 76 76 75 75 75 76 76 76 76 76 75 75 75 75 75 75 75 75 75 75 75 75 75 75 75 75 75 75 75 75 75 75 75 75 75 75 75 75 75 75 75 76 76
5365G6J%%%%%%%%%%%%J%%%%%%%jJ%%%%%j%%%%%%%%%%%%%%%%%%%%%%Jj%%jJ%%%%%%%jJ%%%%
$$ 76 77 77 77 77 77 77 77 77 77 77 77 77 77 78 78 78 78 78 78 78 78 77 78 78 78 78 78 78 77 77 77 77 77 77 77 77 77 77 77 77 77 77 77 77 77 77 77 77 77 77 77 78 77 77 77 76 77 77 77 77 77 77 77 77 76 77 77 77 77 77
5357G7%%%%j%%%Jj%%%%%%%Jj%J%%%%%%%%%%%%%%J%j%J%%%%%%%%%%%%%%%%j%J%%%%%j%%%%%
$$ 77 77 77 77 77 76 76 76 76 77 76 76 76 76 76 76 76 76 77 76 76 77 77 77 77 77 77 77 77 77 77 77 77 77 77 77 78 78 77 77 78 78 78 78 78 78 78 78 78 78 78 78 78 78 78 78 78 77 77 78 78 78 78 78 78 77 77 77 77 77 77
5350G7%j%%%%%%%%%%%%%%%Jj%%%%%%%%%J%%%%%%%%%J%%%%%%%%%%%%%%%%%%J%j%j%%%%J%%j
$$ 77 77 76 76 76 76 76 76 76 76 76 76 76 76 76 76 76 76 77 76 76 76 76 76 76 76 76 76 76 77 77 77 77 77 77 77 77 77 77 78 78 78 78 78 78 78 78 78 78 78 78 78 78 78 78 78 78 78 79 79 78 78 77 77 77 77 77 78 78 78 77
5342G7%%%%%%%%Jj%%%%%j%%%%J%%%%%%%J%%%%%J%%%%%%j%%%%%J%%%%j%%JjJ%%%%%Jj%%%%%
$$ 77 77 77 77 77 77 77 77 77 78 77 77 77 77 77 77 76 76 76 76 76 77 77 77 77 77 77 77 77 78 78 78 78 78 78 79 79 79 79 79 79 79 78 78 78 78 78 78 79 79 79 79 79 78 78 78 79 78 79 79 79 79 79 79 80 79 79 79 79 79 79
5335G9%j%%%%%%%%%%%Jj%%%%%%%%%%%%%%%%%%%%%%Jj%%%%%J%%%%%%%%%%%%%%%%%%%j%%%%%
$$ 79 79 78 78 78 78 78 78 78 78 78 78 78 78 79 78 78 78 78 78 78 78 78 78 78 78 78 78 78 78 78 78 78 78 78 78 78 78 79 78 78 78 78 78 78 79 79 79 79 79 79 79 79 79 79 79 79 79 79 79 79 79 79 79 79 78 78 78 78 78 78
5327G8j%%%%%%%J%%jJ%%j%%%j%%J%%%Jj%%J%%%%%%%%%%%%%%%J%J%j%j%%%j%Jj%%%j%%%%%%
$$ 78 77 77 77 77 77 77 77 77 78 78 78 77 78 78 78 77 77 77 77 76 76 76 77 77 77 77 78 77 77 77 78 78 78 78 78 78 78 78 78 78 78 78 78 78 78 78 79 79 80 80 79 79 78 78 78 78 77 77 78 77 77 77 77 76 76 76 76 76 76 76
5320G6%%%%%j%J%%%%%jJ%%JJ%jj%%J%%%%%J%%%%%%J%%%J%%%%%%%j%%J%%%%%%%%J%%%j%%J%
$$ 76 76 76 76 76 76 75 75 76 76 76 76 76 76 75 76 76 76 77 78 78 77 76 76 76 77 77 77 77 77 77 78 78 78 78 78 78 78 79 79 79 79 80 80 80 80 80 80 80 80 79 79 79 80 80 80 80 80 80 80 80 80 81 81 81 81 80 80 80 81 81
5313H1J%%JJJKLLLMNMNMMLL%jkklllkj%KKMMMLLJjlmmnnnnmllkkj%jjjJ%j%%%%%%%%jJ%%%
$$ 81 82 82 82 83 84 85 87 90 93 96 100 105 109 114 118 122 125 128 128 127 125 123 120 117 114 112 111 111 113 115 119 123 127 130 133 134 133 130 126 122 117 112 107 102 98 95 92 90 88 87 87 86 85 84 85 85 84 84 84 84 84 84 84 84 84 83 84 84 84 84
5305H4%%JJJJJKLLMMNNMNMLKJjkkkmllj%JLLMLMLJ%llnnnonnlllkjkjj%%j%jj%%J%%%%%%%
$$ 84 84 84 85 86 87 88 89 91 94 97 101 105 110 115 119 124 128 131 133 134 133 131 129 127 123 120 117 116 116 117 120 123 127 130 134 137 138 138 135 132 127 122 117 111 106 101 98 95 92 90 89 87 86 85 85 85 84 84 83 82 82 82 83 83 83 83 83 83 83 83
5298H3%j%%%j%%%%%%%%J%%j%%%j%%%%%%%%%%%%%Jj%%%%%%%%%Jj%%%J%%%%%%%%J%J%%J%%%%
$$ 83 83 82 82 82 82 81 81 81 81 81 81 81 81 81 82 82 82 81 81 81 81 80 80 80 80 80 80 80 80 80 80 80 80 80 80 81 80 80 80 80 80 80 80 80 80 80 81 80 80 80 80 81 81 81 81 81 81 81 81 81 82 82 83 83 83 84 84 84 84 84
5290H4j%%%%%%%%%%%%%%j%%%%j%%%%%%%%%J%%%%%%j%%%%%%J%%%%J%%%%%%J%%%%%%%%%%Jj%
$$ 84 83 83 83 83 83 83 83 83 83 83 83 83 83 83 83 82 82 82 82 82 81 81 81 81 81 81 81 81 81 81 82 82 82 82 82 82 82 81 81 81 81 81 81 81 82 82 82 82 82 83 83 83 83 83 83 83 84 84 84 84 84 84 84 84 84 84 84 85 84 84
5283H4%%%%jj%jjjjkkkllkjjJ%JJKKJ%J%jjjjkj%%JJKKLKKKKJK%JJ%%J%J%%%%%jJ%%j%J%%
$$ 84 84 84 84 84 83 82 82 81 80 79 78 76 74 72 69 66 64 63 62 63 63 64 65 67 69 70 70 71 71 70 69 68 67 65 64 64 64 65 66 68 70 73 75 77 79 81 82 84 84 85 86 86 86 87 87 88 88 88 88 88 88 87 88 88 88 87 87 88 88 88
5276H8%%J%%%j%jjjkjklklkjkj%J%JKKJJJ%jjkjkj%%JKJKKLLKKKJJJJJ%%J%J%j%%j%j%%%%
$$ 88 88 88 89 89 89 89 88 88 87 86 85 83 82 80 77 75 72 70 69 67 66 66 67 67 68 70 72 73 74 75 75 74 73 71 70 68 67 67 67 68 70 71 73 75 78 81 83 85 87 88 89 90 91 92 92 92 93 93 94 94 93 93 93 92 92 91 91 91 91 91
5268I1%J%%J%%%j%j%j%%j%%%%j%%%J%%J%J%%%%%%%%%j%%J%%%%%%%%%%%%%J%j%%%%j%j%%%%
$$ 91 91 92 92 92 93 93 93 93 92 92 91 91 90 90 90 89 89 89 89 89 88 88 88 88 89 89 89 90 90 91 91 91 91 91 91 91 91 91 91 90 90 90 91 91 91 91 91 91 91 91 91 91 91 91 91 91 92 92 91 91 91 91 91 90 90 89 89 89 89 89
5261H9%%%%J%%%%%%%%%%j%%%%%%J%%j%J%JJJ%J%%J%%JJ%%%j%%j%%%%%%%%J%%JJ%J%J%JJJK
$$ 89 89 89 89 89 90 90 90 90 90 90 90 90 90 90 90 89 89 89 89 89 89 89 90 90 90 89 89 90 90 91 92 93 93 94 94 94 95 95 95 96 97 97 97 97 96 96 96 95 95 95 95 95 95 95 95 95 96 96 96 97 98 98 99 99 100 100 101 102 103 105
5253A05KKKLMNOOONLJ%kklkjJLLLKK%klmoonnllk%%%%%%J%%%J%J%JJJKKKKKJJ%jj%j%%%%%
$$ 105 107 109 111 114 118 123 129 135 141 146 149 150 150 148 146 143 141 140 141 144 147 150 152 154 154 152 149 145 139 133 128 123 120 117 115 115 115 115 115 115 115 116 116 116 116 117 117 118 118 119 120 121 123 125 127 129 131 132 133 133 132 131 131 130 130 130 130 130 130
5246A30%j%jkjj%%KMMOPPNLJ%lllljjJKJJjllnonmlk%%JKKJJJ%%%J%JJKLKLMLKKJKJJ%JKK
$$ 130 130 129 129 128 126 125 124 124 124 126 130 134 140 147 154 159 162 163 163 160 157 154 151 150 149 150 152 153 154 153 150 147 142 136 131 127 124 122 122 122 123 125 127 128 129 130 130 130 130 131 131 132 133 135 138 140 143 147 150 152 154 155 157 158 159 159 160 162 164
5239A64KLKLMLKKLLLMNOQRJ1J1J1J2J1J1RQPNMMLKNOQJ1J3J7J8K0K1K1K2K2K3K3K5K8L1L5
$$ 164 166 169 171 174 178 181 183 185 188 191 194 198 203 209 217 226 237 248 259 271 282 293 302 310 317 322 326 330 333 335 340 346 354 365 378 395 413 433 454 475 497 519 542 565 590 618 649 684
5234F84M0M7N7O9Q7J13J49J98K63L52M66N97P35Q66R71J016R72Q61P12M98J97j12l43m99o19
$$ 684 724 771 828 897 984 1097 1246 1444 1707 2059 2525 3122 3857 4723 5694 6710 7682 8543 9255 9753 9950 9838 9495 8996 8377
5231H377o80o32m79k57jK60N04O93P82P47O13M07J24j96m86p18r02j012j026r62q58p36o10
$$ 8377 7697 7065 6586 6329 6328 6588 7092 7785 8567 9314 9927 10334 10458 10262 9776 9058 8156 7144 6118 5156 4298 3562 2952
5228B952m92l84k94k22j68j25r3p0n1m0l0k3j8j5j2j0ol%LRJ4J9K6L4M4N7P4R7J30J74K35
$$ 2952 2460 2076 1782 1560 1392 1267 1174 1104 1053 1013 983 960 942 927 915 905 899 896 896 899 908 922 941 967 1001 1045 1102 1176 1273 1403 1577 1812
5225A812L16M22N54O98Q37R60J045J053R82Q80P55N47K20j22l53m83n96o84o72n21k81nK65
$$ 1812 2128 2550 3104 3802 4639 5599 6644 7697 8679 9559 10314 10861 11081 10959 10606 10123 9527 8843 8171 7650 7369 7364 7629
5223G629N11O95P68P27O19M37J39k22n26p43r23j068j126j084r80q51p20n92m73l69k85k21
$$ 7629 8140 8835 9603 10330 10949 11386 11525 11303 10777 10034 9111 8043 6917 5833 4853 4002 3282 2690 2217 1848 1563 1342
5220A342j71j33j04q2o7n4m5l8l3k9k6k5k2k0k0k0j9j8j6j5j3j1j0qonnmmnoprj0j1j1j2j2
$$ 1342 1171 1038 934 852 785 731 686 648 615 586 560 535 513 493 473 453 434 416 400 385 372 361 351 343 337 332 327 323 319 314 308 301 292 282 271 260 248 236
5216B36j2j1j0j0rooonmlkkjjkkkkkkjjj%j%%jkklnmmmlj%KLMMLMJJJ%%%%JJJJJ%JJ%%%J%
$$ 236 224 213 203 193 184 178 172 166 161 157 154 152 150 149 148 146 144 142 140 138 136 135 134 133 133 132 132 132 131 129 127 124 119 115 111 107 104 103 103 105 108 112 116 119 123 124 125 126 126 126 126 126 127 128 129 130 131 131 132 133 133 133 133 134 134
5209A34%J%jjjkkklmllllk%%JJ%%%j%%%%Jj%jkjkkjjjjj%%%%%%J%%JJJJJJ%JJ%%J%%%JKJK
$$ 134 134 135 135 134 133 132 130 128 126 123 119 116 113 110 107 105 105 105 106 107 107 107 107 106 106 106 106 106 107 106 106 105 103 102 100 98 97 96 95 94 93 93 93 93 93 93 93 94 94 94 95 96 97 98 99 100 100 101 102 102 102 103 103 103 103 104 106 107 109
5202A09JKKLKMLNOPOPOONLK%%%j%j%jjjjjjjjjklnnnnnmmljjj%jkjkkkkjk%j%%%%%%%%J%J
$$ 109 110 112 114 117 119 123 126 131 137 144 150 157 163 169 174 177 179 179 179 179 178 178 177 177 176 175 174 173 172 171 170 169 168 166 163 158 153 148 143 138 134 130 127 126 125 124 124 123 121 120 118 116 114 112 111 109 109 108 108 108 108 108 108 108 108 108 109 109 110
5195A10KJKLMMOPQJ0J0J1J0J0QPNMLKJKKLMNMMK%kmopj0j0j0rpnljjjjkmmoooonlmkj%%J%
$$ 110 112 113 115 118 122 126 132 139 147 157 167 178 188 198 206 213 218 222 225 227 228 230 232 235 239 244 248 252 254 254 252 248 242 235 225 215 205 196 189 184 181 180 179 178 177 175 171 167 161 155 149 143 138 135 131 129 128 128 128 129 129
5188A29%%%%%%%JKKKLLLMMMNOQRJ1J0QM%loomljJLMLLjlorj0rrqnmkkjjjkkjkjjjjjjj%KK
$$ 129 129 129 129 129 129 129 129 130 132 134 136 139 142 145 149 153 157 162 168 176 185 196 206 214 218 218 215 209 203 199 196 195 196 199 203 206 209 208 205 199 190 180 171 162 154 149 145 143 141 140 139 138 136 134 133 131 130 129 128 127 126 125 124 124 126 128
5181A28LMNMNMMLLJJ%%j%%%%%jjjkkkjjj%JLLMNNNNMNMMLKJJJJKLNOPQJ0J1J1J1J2J1J2J3
$$ 128 131 135 140 144 149 153 157 160 163 164 165 165 165 164 164 164 164 164 164 163 162 161 159 157 155 154 153 152 152 153 156 159 163 168 173 178 183 187 192 196 200 203 205 206 207 208 209 211 214 219 225 232 240 250 261 272 283 295 306 318 331
5175C31J2J2J1J1J1J1J3J6J9K2K5K8L0K9K9K9K7K8K9L3L9M9O0P5R2J15J46J89K49L30M38N81
$$ 331 343 355 366 377 388 399 412 428 447 469 494 522 552 581 610 639 666 694 723 756 795 844 904 979 1071 1186 1332 1521 1770 2100 2538 3119
5171C119P53R37J103J221J239J086P70M16R7k37n53p03o36m23j36J71M42O29O57M86K17lj93
$$ 3119 3872 4809 5912 7133 8372 9458 10228 10644 10741 10504 9951 9248 8612 8189 8053 8224 8666 9295 9952 10438 10655 10652 10459
5169A0459m64q06j069j151j100r89q56p18n81m54l47k60j92j42j04p4n2l5k3j5j1j1j0j0r
$$ 10459 9995 9189 8120 6969 5869 4880 4024 3306 2725 2271 1924 1664 1472 1330 1226 1152 1100 1065 1042 1027 1016 1005 995 985 976
5166I76qnlKPJ1J3J0PKkk%PJ9L5N2P4R8J27J65K16K89L87N24P03R26J174J409J586J635J467
$$ 976 968 963 960 962 969 980 993 1003 1010 1012 1010 1008 1008 1015 1034 1069 1121 1195 1293 1420 1585 1801 2090 2477 3001 3704 4630 5804 7213 8799 10434 11901
5163A1901J047M99n3n62r06r71q11n11j25K87O61R27R96P90L87k9m27q76j281j481j480j370
$$ 11901 12948 13447 13394 12832 11926 10955 10144 9633 9508 9795 10456 11383 12379 13169 13556 13527 13100 12224 10943 9462 7982 6612
5161F612j207j022q34o59n08l86k93k22j71j33j05q3o8n5m5m0l7l7l6l6l6l6l5l1k8k4k0j9
$$ 6612 5405 4383 3549 2890 2382 1996 1703 1481 1310 1177 1072 989 921 866 821 781 744 707 671 635 599 563 528 497 469 445 425 406
5158D06j6j6j6j7j8j9j8j8j8j7j6j3j2j1qqommmlmlmk%JKLLMMMLKJJ%jjkjjjj%JJKLKJJ%k
$$ 406 390 374 358 341 323 304 286 268 250 233 217 204 192 181 173 165 159 155 151 147 144 140 137 133 131 131 132 134 137 140 144 148 152 155 157 158 159 159 158 157 155 154 153 152 151 151 152 153 155 158 160 161 162 162 160
5152A60kkkj%KLMOOONOPOONNLLK%jlnnpooonllk%JJJJklnoppqqponljJLOOPNNLKjkllnmll
$$ 160 158 156 154 153 153 155 158 162 168 174 180 185 191 198 204 210 215 220 223 226 228 228 227 224 219 214 207 201 195 189 184 181 178 176 176 177 178 179 180 178 175 170 164 157 150 142 134 127 121 116 113 112 113 116 122 128 135 140 145 148 150 149 147 144 141 136 132 129 126
5145A26kkk%j%%%JKLLMNOOPPRQQQPNLK%kllmllj%KMNNONMLJjknoqrrj0qqomkkkjkkkkkj%J
$$ 126 124 122 120 120 119 119 119 119 120 122 125 128 132 137 143 149 156 163 172 180 188 196 203 208 211 213 213 211 208 205 201 198 195 194 194 196 200 205 210 216 221 225 228 229 228 226 221 215 207 198 189 179 171 163 157 153 151 149 147 146 144 142 140 138 136 135 135 136
5137A36KKKLKKKK%J%jkjjkjkjkjjjjkkkjkljjJJKKLKJKKKKLMMOPQPOOMKLJKKLLNNMLLJJ%J
$$ 136 138 140 142 145 147 149 151 153 153 154 154 153 151 150 149 147 146 144 143 141 140 139 138 137 135 133 131 130 128 125 124 123 124 125 127 129 132 134 135 137 139 141 143 146 150 154 160 167 175 182 188 194 198 200 203 204 206 208 211 214 219 224 228 231 234 235 236 236 237
5130B37JKKLLLMMMNMNMMMKJ%klmlljJLLNPJ0J0J2J4J5J7J9J9J9J9J7J5J6J5J7K0K4K9L3L7
$$ 237 238 240 242 245 248 251 255 259 263 268 272 277 281 285 289 291 292 292 290 287 283 280 277 276 277 280 283 288 295 305 315 327 341 356 373 392 411 430 449 466 481 497 512 529 549 573 602 635 672
5125F72M1M1M1M0M0M1M5N3O4Q2J06J37J75K23K75L31L88M42M95N48O05O72P39P73P57O77N24
$$ 672 713 754 795 835 875 916 961 1014 1078 1160 1266 1403 1578 1801 2076 2407 2795 3237 3732 4280 4885 5557 6296 7069 7826 8503 9027
5122I027L14J13ml1j7N3K18M37O33P35P08N63L02n8m33p26r07j022j092j063r25p31n32l53
$$ 9027 9341 9454 9450 9419 9402 9455 9673 10110 10743 11478 12186 12749 13051 12993 12560 11834 10927 9905 8813 7750 6825 6094 5562 5209
5119E209k11j21q5j06j66k35k85l13l18k98k64k22j78j37r9o6l8j2J1L3N6Q0J05J37J77K24
$$ 5209 4998 4877 4792 4686 4520 4285 4000 3687 3369 3071 2807 2585 2407 2270 2171 2105 2067 2055 2066 2099 2155 2235 2340 2477 2654 2878
5117B878K82L46M13M76N22N44N40N09M69M37M27M69N97Q33J174J599K062K504K845K976K844
$$ 2878 3160 3506 3919 4395 4917 5461 6001 6510 6979 7416 7843 8312 8909 9742 10916 12515 14577 17081 19926 22902 25746
5114B5746K510K041J451Q03K16k48o20r18j127j239j241j150j030q86o93n42n17n59o24p66
$$ 25746 28256 30297 31748 32551 32767 32519 31899 30981 29854 28615 27374 26224 25194 24308 23615 23073 22556 21997 21373 20607
5112B0607j003j272j494j633j706j702j613j461j275j075q76o98n46m25l30k61k09j72j45
$$ 20607 19604 18332 16838 15205 13499 11797 10184 8723 7448 6373 5497 4799 4253 3828 3498 3237 3028 2856 2711
5110B711j23j05q6o7m8k7nJ7M0O4R2J25J67K20K88L72M75N92P15Q29R09R33Q91P95O83O28
$$ 2711 2588 2483 2397 2330 2282 2255 2250 2267 2307 2371 2463 2588 2755 2975 3263 3635 4110 4702 5417 6246 7155 8088 8979 9774 10457 11085
5108A1085O86Q60J125J446J739J897J887J772J517J032M20j43n66p97q34p45o18n42n85p84
$$ 11085 11771 12631 13756 15202 16941 18838 20725 22497 24014 25046 25466 25323 24757 23960 23126 22381 21763 21221 20636 19852
5105A9852j074j321j468j574j653j620j457j227r88p73n96m72m06l90l96l99l91l66l28k82
$$ 19852 18778 17457 15989 14415 12762 11142 9685 8458 7470 6697 6101 5629 5223 4833 4437 4038 3647 3281 2953 2671
5103B671k36j94j60j32j16j02r2q1o9n8m8l9l3k8k2j5j0omj%JKNJ0J6K4L4M9O8R3J25J71K33
$$ 2671 2435 2241 2081 1949 1833 1731 1639 1558 1489 1431 1383 1344 1311 1283 1261 1246 1236 1230 1226 1225 1225 1226 1228 1233 1243 1259 1283 1317 1366 1434 1527 1652 1823 2056
5100B056L18M30N70P40R18J071J159J130R25N30M8m00p16q44q31p28n55l25n0K51N69Q91J182
$$ 2056 2374 2804 3374 4114 5032 6103 7262 8392 9317 9847 9895 9495 8779 7935 7104 6376 5821 5496 5446 5697 6266 7157 8339
5097H339J401J490J412J116O07nn61r07j014r68q23n92l05j1K34L81M30M03K85N5k13m09n24
$$ 8339 9740 11230 12642 13758 14365 14360 13799 12892 11878 10910 10087 9495 9190 9179 9413 9794 10224 10627 10912 10967 10754 10345 9821
5095I821n92o03n40m18k75j45n9j7k0q9k18l43m28m89n28n31m95m30l53k70j86j03j9P1J72
$$ 9821 9229 8626 8086 7668 7393 7248 7189 7172 7152 7063 6845 6502 6074 5585 5057 4526 4031 3601 3248 2978 2792 2689 2670 2741 2913
5092B913K87M25N82P53R22J068J163J160J063R09P23N04K15j25m36o54p42p23o24m38j92Q4
$$ 2913 3200 3625 4207 4960 5882 6950 8113 9273 10336 11245 11968 12472 12687 12562 12126 11472 10730 10007 9383 8945 8753 8837
5090H837L63O29Q44R52R50Q65P01M67K07k9j76j84j21r3j16j47j77k62m40o53q10r00r72j031
$$ 8837 9200 9829 10673 11625 12575 13440 14141 14608 14815 14786 14610 14426 14305 14212 14096 13949 13772 13510 13070 12417 11607 10707 9735 8704
5087H704j041r93r05p99o81n63m49l45k49j65q9k0L8R0J29J51J55J38J05M9j8p4j10j29j27
$$ 8704 7663 6670 5765 4966 4285 3722 3273 2928 2679 2514 2425 2405 2443 2533 2662 2813 2968 3106 3211 3260 3242 3168 3058 2929 2802
5085B802j01n2J7J07K18L51M98O53Q00R19R83R92R83R64R32Q19M24k41p99j029j018q83o73
$$ 2802 2701 2649 2666 2773 2991 3342 3840 4493 5293 6212 7195 8187 9170 10134 11066 11885 12309 12068 11269 10240 9222 8339 7666
5082G666m40k36p6K9L4o3k04l29l85l69l27k78k29j93j93k26k50k55k55k55k37k02j61j22
$$ 7666 7226 6990 6914 6943 6977 6914 6710 6381 5996 5627 5300 5022 4793 4600 4407 4181 3931 3676 3421 3166 2929 2727 2566 2444
5080B444r2p1o5q0j08j29j40j50j57j55j41j25j05q6p0n7m6l8l3k7k5k1k0j9j9j6j6j5j5j4
$$ 2444 2352 2281 2216 2136 2028 1899 1759 1609 1452 1297 1156 1031 926 840 770 713 667 629 596 569 544 523 503 484 465 449 433 418 403 389
5077C89j2j1j1j0j0j1j2j1j0rj0rrrrpoonnmlkkkjkkkjjj%JJLKLJK%%kjjj%JKJKK%kklmmm
$$ 389 377 366 355 345 335 324 312 301 291 282 272 263 254 245 236 229 223 217 212 207 203 200 198 196 194 193 191 189 187 186 185 184 184 185 186 189 191 194 195 197 197 197 195 194 193 192 192 193 195 196 198 200 200 198 196 193 189 185 181
5070A81mmlllllmmnonnnmllklkkkjjjkjj%%%%%KLKLLMLLKLLNNOQPQONMJjjkkmllkjj%%%j%
$$ 181 177 173 170 167 164 161 158 154 150 145 139 134 129 124 120 117 114 112 109 107 105 103 102 101 100 98 97 96 96 96 96 96 96 98 101 103 106 109 113 116 119 121 124 127 132 137 143 151 158 166 172 177 181 182 181 180 178 176 172 169 166 164 163 162 162 162 162 161 161
5063A61jlllmmnmnlmlkkkkkjjjj%j%%j%%%Jj%%jjj%%JKKKKK%JKJLLNNNNMLJ%kkkkjkjkllm
$$ 161 160 157 154 151 147 143 138 134 129 126 122 119 117 115 113 111 109 108 107 106 105 105 104 104 104 103 103 103 103 104 103 103 103 102 101 100 100 100 101 103 105 107 109 111 111 112 114 115 118 121 126 131 136 141 145 148 149 149 147 145 143 141 140 138 137 135 132 129 125
5056A25mlmlkkj%%%jjjjj%jj%j%%j%%%%J%%%%%j%j%j%J%JJKKKKJ%%%%jjj%JJJKJ%kklkkkk
$$ 125 121 118 114 111 109 107 106 106 106 106 105 104 103 102 101 101 100 99 99 98 98 98 97 97 97 97 97 98 98 98 98 98 98 97 97 96 96 95 95 96 96 97 98 100 102 104 106 107 107 107 107 107 106 105 104 104 105 106 107 109 110 110 108 106 103 101 99 97 95
5048I5%%%KKLMMLK%jkjj%%KLNOPPOM%lmnmlkk%JKKLKKKKJJ%jjkkjjjjJJJLLMMMMMLLJ%klm
$$ 95 95 95 95 97 99 102 106 110 113 115 115 114 112 111 110 110 110 112 115 120 126 133 140 146 150 150 147 143 138 134 131 129 127 127 128 130 132 135 137 139 141 143 144 145 145 144 143 141 139 138 137 136 135 136 137 138 141 144 148 152 156 160 164 167 170 171 171 169 166 162
5041A62lmlk%JLLLMK%%llmmnmlk%Jjjjk%jJLLMNNNLLJ%j%jJ%KKKKLLLMNNNOOOOPQRJ0J1J1
$$ 162 159 155 152 150 150 151 154 157 160 164 166 166 166 163 160 156 152 147 143 140 138 138 139 138 137 136 134 134 133 134 137 140 144 149 154 159 162 165 166 166 165 165 164 165 165 167 169 171 173 176 179 182 186 191 196 201 207 213 219 225 232 240 249 259 270 281
5034B81J2J1J0J0J0J0QQQQOMLMNPJ1J4J8K2K6L0L1L1K9K8K5K3K3K3K4K7K9L1L5M0M6N0N5N9
$$ 281 293 304 314 324 334 344 352 360 368 376 382 386 389 393 398 405 416 430 448 470 496 526 557 588 617 645 670 693 716 739 763 790 819 850 885 925 971 1021 1076 1135
5030A135O6P3Q2R4J09J30J62K03K59L27M07M98N95O94P92Q94R99J091J152J138J024Q75P74
$$ 1135 1201 1274 1356 1450 1559 1689 1851 2054 2313 2640 3047 3545 4140 4834 5626 6520 7519 8610 9762 10900 11924 12799 13573
5027A3573P22O80N92L93J32j6J9J60L24M37M50M03L94M68N87O54N44J85k96o66q46r11r65
$$ 13573 14295 14975 15567 15960 16092 16076 16095 16255 16579 17016 17466 17869 18263 18731 19318 19972 20516 20701 20405 19739 18893 17982 17017
5025A7017j091j271j385j364j242j075r02p47o12m85l66k58j73j30j39j93k50k79k84k78k77
$$ 17017 15926 14655 13270 11906 10664 9589 8687 7940 7328 6843 6477 6219 6046 5916 5777 5584 5334 5055 4771 4493 4216
5023D216k82k84k68k36j92j43q9l2L0J00J75K54L31L99M49M77M90N12N54O03O27N97N13M18
$$ 4216 3934 3650 3382 3146 2954 2811 2722 2690 2720 2820 2995 3249 3580 3979 4428 4905 5395 5907 6461 7064 7691 8288 8801 9219
5020I219L69M01M92N89O54O51N81N18N42O29P00O96N70L52J91J42J04Lj38k97m33m91m93m93
$$ 9219 9588 9989 10481 11070 11724 12375 12956 13474 14016 14645 15345 16041 16611 16963 17154 17296 17400 17403 17265 16968 16535 16044 15551 15058
5017A5058n38o73q70j012j038r90r24q84q83q78q25p32o23n12m09l18k40j78j28q9n9m2m2
$$ 15058 14520 13847 12977 11965 10927 9937 9013 8129 7246 6368 5543 4811 4188 3676 3267 2949 2709 2531 2403 2314 2255 2213 2171
5015B171o1q4j00j06j06j07j12j15j16j09r9q8p6o6n7n1m5l8l5l1k7k5k2k1k0j8j6j6j4j4
$$ 2171 2110 2026 1926 1820 1714 1607 1495 1380 1264 1155 1056 968 892 826 769 718 673 635 600 569 542 517 495 474 454 436 420 404 390 376
5012C76j3j3j2j2j0rrqqpnmmkkjjJJLLNNMLLLKJJ%%jj%KLLNNMLJ%klmnoppoponnonnmmnmn
$$ 376 363 350 338 326 316 307 298 290 282 275 270 266 262 260 258 257 256 257 258 261 264 269 274 278 281 284 287 289 290 291 291 291 290 289 289 291 294 297 302 307 311 314 315 315 313 310 306 301 295 288 281 275 268 262 257 252 246 241 236 232 228 223 219 214
5005B14ononnononnnmnllllkljkjj%%JJKLLLMMMLK%kkklkj%%KKKLKKJjjkllklkkkjkjjjjj
$$ 214 208 203 197 192 187 181 176 170 165 160 155 151 146 143 140 137 134 132 129 128 126 125 124 124 124 125 126 128 131 134 137 141 145 149 152 154 154 152 150 148 145 143 142 142 142 144 146 148 151 153 155 156 155 154 152 149 146 144 141 139 137 135 134 132 131 130 129 128 127
4998A27kjjjjjjjj%jjjjjjjjj%%j%jjj%jjjj%j%%%%jjj%j%%j%jj%%%%%%%jj%%%J%%j%%%%%
$$ 127 125 124 123 122 121 120 119 118 117 117 116 115 114 113 112 111 110 109 108 108 108 107 107 106 105 104 104 103 102 101 100 100 99 99 99 99 99 98 97 96 96 95 95 95 94 94 93 92 92 92 92 92 92 92 92 91 90 90 90 90 91 91 91 90 90 90 90 90 90
4990I0%%%%j%j%%%%%%%%%%j%j%%jjjj%%%%%%%%J%%%J%J%%%%%%%%%J%%%J%%%j%%%jj%j%%%%
$$ 90 90 90 90 90 89 89 88 88 88 88 88 88 88 88 88 88 88 87 87 86 86 86 85 84 83 82 82 82 82 82 82 82 82 82 83 83 83 83 84 84 85 85 85 85 85 85 85 85 85 85 86 86 86 86 87 87 87 87 86 86 86 86 85 84 84 83 83 83 83 83
4983H3%%%j%%%j%j%%%j%%j%jj%%%j%j%jj%%%%J%J%JJKKLKLLKLLKLLLLKLKMOQQROKkmmnmoo
$$ 83 83 83 83 82 82 82 82 81 81 80 80 80 80 79 79 79 78 78 77 76 76 76 76 75 75 74 74 73 72 72 72 72 72 73 73 74 74 75 76 78 80 83 85 88 91 93 96 99 101 104 107 110 113 115 118 120 124 130 138 146 155 161 163 161 157 153 148 144 138 132
4976A32nmmmlmnllkkjjjjj%j%jjjjjj%jjjj%%j%%%JJ%KJJJJKJKJJJKJKJKJKKKKJJJJJ%%jj
$$ 132 127 123 119 115 112 108 103 100 97 95 93 92 91 90 89 88 88 87 87 86 85 84 83 82 81 81 80 79 78 77 77 77 76 76 76 76 77 78 78 80 81 82 83 84 86 87 89 90 91 92 94 95 97 98 100 101 103 105 107 109 110 111 112 113 114 114 114 113 112
4968A12jjjjkkkkkkkkkkjkjjj%j%j%%%%%%j%jj%%j%j%j%j%%%%J%j%%%%%%%%%J%%%%%%%%J%
$$ 112 111 110 109 108 106 104 102 100 98 96 94 92 90 88 87 85 84 83 82 82 81 81 80 80 80 80 80 80 80 79 79 78 77 77 77 76 76 75 75 74 74 73 73 73 73 73 74 74 73 73 73 73 73 73 73 73 73 73 74 74 74 74 74 74 74 74 74 75 75
4961G5%J%j%%J%J%%%%%%%%%%jJ%j%%%j%%Jj%%%%%%%%j%%j%%%%J%j%%%J%%%%%%%%%%%%JJ%j
$$ 75 75 76 76 75 75 75 76 76 77 77 77 77 77 77 77 77 77 77 77 76 77 77 76 76 76 76 75 75 75 76 75 75 75 75 75 75 75 75 75 74 74 74 73 73 73 73 73 74 74 73 73 73 73 74 74 74 74 74 74 74 74 74 74 74 74 74 75 76 76 75
4954G5%j%%J%%%J%%%%%%%%J%%%%%%J%%J%J%%%J%JJJ%J%JKLKLLMLLMMMMLLKLKKKJKJLKLLKK
$$ 75 75 74 74 74 75 75 75 75 76 76 76 76 76 76 76 76 76 77 77 77 77 77 77 77 78 78 78 79 79 80 80 80 80 81 81 82 83 84 84 85 85 86 88 91 93 96 99 103 106 109 113 117 121 125 128 131 133 136 138 140 142 143 145 146 149 151 154 157 159 161
4946A61LKLKJJjjjlkmmmnmoonommmmlllkjjjj%%%J%JJJJ%KJKJKJLKLMLNLMLLLLKLKKJ%Jj%
$$ 161 164 166 169 171 172 173 172 171 170 167 165 161 157 153 148 144 138 132 127 121 117 113 109 105 102 99 96 94 93 92 91 90 90 90 90 91 91 92 93 94 95 95 97 98 100 101 103 104 107 109 112 116 119 124 127 131 134 137 140 143 145 148 150 152 153 153 154 153 153
4939A53J%Jjjkklklklmlkkkj%j%%%%jjllklllllllkjkjjjjjj%%%j%j%jj%j%%%%jJ%j%%%%j
$$ 153 154 154 155 154 153 151 149 146 144 141 139 136 132 129 127 125 123 122 122 121 121 121 121 121 120 119 116 113 111 108 105 102 99 96 93 90 88 87 85 84 83 82 81 80 79 79 79 79 78 78 77 77 76 75 75 74 74 74 74 74 73 74 74 73 73 73 73 73 72
4932G2%%jJ%%%%%%%%%J%%J%%%%%%%%%J%%%%%J%Jj%%%%J%%%%%%j%%%%%%%j%%%%%%j%%%j%%%
$$ 72 72 72 71 72 72 72 72 72 72 72 72 72 72 73 73 73 74 74 74 74 74 74 74 74 74 74 75 75 75 75 75 75 76 76 77 76 76 76 76 76 77 77 77 77 77 77 77 76 76 76 76 76 76 76 76 75 75 75 75 75 75 75 74 74 74 74 73 73 73 73
4924G3%%%%%%%%%%%%%J%%%%%%%J%%%%%%%%%%%%%%%%%%%%%%%%%%%%%%%%j%%%J%j%%%%Jj%%%
$$ 73 73 73 73 73 73 73 73 73 73 73 73 73 73 74 74 74 74 74 74 74 74 75 75 75 75 75 75 75 75 75 75 75 75 75 75 75 75 75 75 75 75 75 75 75 75 75 75 75 75 75 75 75 75 75 74 74 74 74 75 75 74 74 74 74 74 75 74 74 74 74
4917G4%%%J%%%%j%jJ%J%J%%%%%%%j%%%J%%j%%%%%J%%%%%%%%%%%%%%jJ%%%J%%%%%%%%JJ%JJ
$$ 74 74 74 74 75 75 75 75 75 74 74 73 74 74 75 75 76 76 76 76 76 76 76 76 75 75 75 75 76 76 76 75 75 75 75 75 75 76 76 76 76 76 76 76 76 76 76 76 76 76 76 76 75 76 76 76 76 77 77 77 77 77 77 77 77 77 78 79 79 80 81
4909H1%%JJ%JJJ%JJJKJJ%JJ%J%%%%J%%%%%%%%%%%%%%J%j%%jj%j%j%jj%j%%j%%%%%j%j%J%%
$$ 81 81 81 82 83 83 84 85 86 86 87 88 89 91 92 93 93 94 95 95 96 96 96 96 96 97 97 97 97 97 97 97 97 97 97 97 97 97 97 97 98 98 97 97 97 96 95 95 94 94 93 93 92 91 91 90 90 90 89 89 89 89 89 89 88 88 87 87 88 88 88
4902H8%J%%%J%%J%%J%J%J%J%J%J%%%%J%%j%%%%j%j%%%j%%%%%j%jjjjjjjjjjkj%j%%j%%j%j
$$ 88 88 89 89 89 89 90 90 90 91 91 91 92 92 93 93 94 94 95 95 96 96 97 97 97 97 97 98 98 98 97 97 97 97 97 96 96 95 95 95 95 94 94 94 94 94 94 93 93 92 91 90 89 88 87 86 85 84 83 81 80 80 79 79 79 78 78 78 77 77 76
4894G6%%%%j%%%j%j%%%%J%%%%j%J%%%%%%%%%%%%%%%j%%%%J%%J%%%%j%%Jj%%%%j%%%%%%%%j
$$ 76 76 76 76 76 75 75 75 75 74 74 73 73 73 73 73 74 74 74 74 74 73 73 74 74 74 74 74 74 74 74 74 74 74 74 74 74 74 74 73 73 73 73 73 74 74 74 75 75 75 75 75 74 74 74 75 74 74 74 74 74 73 73 73 73 73 73 73 73 73 72
4887G2%%%%%Jj%%%j%%%%%%%%%%%%%jJ%%%%%%J%%jJj%%%%%%%%%%%J%%%%%%j%%%%%%%%%Jj%J
$$ 72 72 72 72 72 72 73 72 72 72 72 71 71 71 71 71 71 71 71 71 71 71 71 71 71 70 71 71 71 71 71 71 71 72 72 72 71 72 71 71 71 71 71 71 71 71 71 71 71 71 72 72 72 72 72 72 72 71 71 71 71 71 71 71 71 71 71 72 71 71 72
4880G2%%%%%%%%%%%%%J%%%%%%%%%%%%%j%%%%%%%%%%%%%%%j%Jj%%J%%%Jj%%%%Jj%J%%J%%%%
$$ 72 72 72 72 72 72 72 72 72 72 72 72 72 72 73 73 73 73 73 73 73 73 73 73 73 73 73 73 72 72 72 72 72 72 72 72 72 72 72 72 72 72 72 72 71 71 72 71 71 71 72 72 72 72 73 72 72 72 72 72 73 72 72 73 73 73 74 74 74 74 74
4872G4%%%%%Jj%%%%%%%%%%%%%%%J%%%%j%%%%%%%%j%%%%%%J%%%j%%J%%%%%%%%j%%%%%%%%%%
$$ 74 74 74 74 74 74 75 74 74 74 74 74 74 74 74 74 74 74 74 74 74 74 74 75 75 75 75 75 74 74 74 74 74 74 74 74 74 73 73 73 73 73 73 73 74 74 74 74 73 73 73 74 74 74 74 74 74 74 74 74 73 73 73 73 73 73 73 73 73 73 73
4865G3%%%%J%%%%j%%%%%J%%%%%%%%%J%%%%%j%%%%%%%%%%%%%%%%%%%J%j%%%J%%%j%%%%%j%%
$$ 73 73 73 73 73 74 74 74 74 74 73 73 73 73 73 73 74 74 74 74 74 74 74 74 74 74 75 75 75 75 75 75 74 74 74 74 74 74 74 74 74 74 74 74 74 74 74 74 74 74 74 74 75 75 74 74 74 74 75 75 75 75 74 74 74 74 74 74 73 73 73
4857G3%%%J%%%%%%%%%%%%%%%%%%%%%%%%%%%%%j%J%%%%j%%%%%J%%j%%J%%%%j%J%%%%%%%%%%
$$ 73 73 73 73 74 74 74 74 74 74 74 74 74 74 74 74 74 74 74 74 74 74 74 74 74 74 74 74 74 74 74 74 74 74 73 73 74 74 74 74 74 73 73 73 73 73 73 74 74 74 73 73 73 74 74 74 74 74 73 73 74 74 74 74 74 74 74 74 74 74 74
4850G4%%%%%%%%%%%%%%%%%%%%%%%%J%%%%j%%J%j%%%%%j%%Jj%J%%%%%%%%%%%j%%%%%J%%%%%
$$ 74 74 74 74 74 74 74 74 74 74 74 74 74 74 74 74 74 74 74 74 74 74 74 74 74 75 75 75 75 75 74 74 74 75 75 74 74 74 74 74 74 73 73 73 74 73 73 74 74 74 74 74 74 74 74 74 74 74 74 73 73 73 73 73 73 74 74 74 74 74 74
4843G4%%%%%%%%%%%%%%%%J%%%%j%%%%%J%%%%%j%%%%%%%%%%j%%%%%%%%%%%%%%%%%%%%%%%%J
$$ 74 74 74 74 74 74 74 74 74 74 74 74 74 74 74 74 74 75 75 75 75 75 74 74 74 74 74 74 75 75 75 75 75 75 74 74 74 74 74 74 74 74 74 74 74 73 73 73 73 73 73 73 73 73 73 73 73 73 73 73 73 73 73 73 73 73 73 73 73 73 74
4835G4%%j%J%j%%%%%%J%%j%%%%%%%%%%%%%%%%%%%j%J%%%%%%J%%%%j%%J%%j%%%%%%%%%%%%J
$$ 74 74 74 73 73 74 74 73 73 73 73 73 73 73 74 74 74 73 73 73 73 73 73 73 73 73 73 73 73 73 73 73 73 73 73 73 73 72 72 73 73 73 73 73 73 73 74 74 74 74 74 73 73 73 74 74 74 73 73 73 73 73 73 73 73 73 73 73 73 73 74
4828G4j%%%%J%j%%%%%%%%%%%j%%%%%%%%%%%J%%%%j%%%%J%%%%%%%%%%j%%J%%%%j%%J%j%%%%
$$ 74 73 73 73 73 73 74 74 73 73 73 73 73 73 73 73 73 73 73 73 72 72 72 72 72 72 72 72 72 72 72 72 73 73 73 73 73 72 72 72 72 72 73 73 73 73 73 73 73 73 73 73 73 72 72 72 73 73 73 73 73 72 72 72 73 73 72 72 72 72 72
4820G2%%J%%%%%%%%%%J%%%%%%%%%%%%%%%%%%%j%%%%%%%%%j%%%%%%%J%%%%%%%%%j%%J%j%%J
$$ 72 72 72 73 73 73 73 73 73 73 73 73 73 73 74 74 74 74 74 74 74 74 74 74 74 74 74 74 74 74 74 74 74 74 73 73 73 73 73 73 73 73 73 73 72 72 72 72 72 72 72 72 73 73 73 73 73 73 73 73 73 73 72 72 72 73 73 72 72 72 73
4813G3%j%%J%J%j%%j%J%jJ%%%%%%%%%J%%%%%%%jJ%%%%%%%%%jJj%%%%J%%%%%%j%%%%%%%%%%
$$ 73 73 72 72 72 73 73 74 74 73 73 73 72 72 73 73 72 73 73 73 73 73 73 73 73 73 73 74 74 74 74 74 74 74 74 73 74 74 74 74 74 74 74 74 74 74 73 74 73 73 73 73 73 74 74 74 74 74 74 74 73 73 73 73 73 73 73 73 73 73 73
4805G3%%%%%%J%%%%jJ%%%%%%%%%j%%%JjJ%%%%%%%%%%%j%%%%%%%%%%%%%%%%%%%%%J%j%%%%%
$$ 73 73 73 73 73 73 73 74 74 74 74 74 73 74 74 74 74 74 74 74 74 74 74 73 73 73 73 74 73 74 74 74 74 74 74 74 74 74 74 74 74 73 73 73 73 73 73 73 73 73 73 73 73 73 73 73 73 73 73 73 73 73 73 74 74 73 73 73 73 73 73
4798G3J%%%j%%%%%%%J%%%%%%%%%%%%%%%%%%j%%%%%J%%%j%j%%J%%%j%%%%%j%J%%J%%j%%Jj%
$$ 73 74 74 74 74 73 73 73 73 73 73 73 73 74 74 74 74 74 74 74 74 74 74 74 74 74 74 74 74 74 74 74 73 73 73 73 73 73 74 74 74 74 73 73 72 72 72 73 73 73 73 72 72 72 72 72 72 71 71 72 72 72 73 73 73 72 72 72 73 72 72
4791G2%%%%%J%%%%J%%%j%%%%%Jj%%%%J%%%%%%%j%%%%%%%%%%%%%%%%%%%%%%%%%%%%J%%%%%%
$$ 72 72 72 72 72 72 73 73 73 73 73 74 74 74 74 73 73 73 73 73 73 74 73 73 73 73 73 74 74 74 74 74 74 74 74 73 73 73 73 73 73 73 73 73 73 73 73 73 73 73 73 73 73 73 73 73 73 73 73 73 73 73 73 73 74 74 74 74 74 74 74
4783G4%%%%%%j%%%%J%%%%%%%%%%Jj%%%%%%%J%%%%%%%%%%%%%%%%jJ%%%%%%%%%%%%%%%%%%J%
$$ 74 74 74 74 74 74 74 73 73 73 73 73 74 74 74 74 74 74 74 74 74 74 74 75 74 74 74 74 74 74 74 74 75 75 75 75 75 75 75 75 75 75 75 75 75 75 75 75 75 74 75 75 75 75 75 75 75 75 75 75 75 75 75 75 75 75 75 75 75 76 76
4776G6%j%%%%J%%%%%%%%jJj%%%%J%jJ%%j%%%%%%%J%%%%%%%j%%J%%%%%%%%%%%j%J%%%%%Jj%
$$ 76 76 75 75 75 75 75 76 76 76 76 76 76 76 76 76 75 76 75 75 75 75 75 76 76 75 76 76 76 75 75 75 75 75 75 75 75 76 76 76 76 76 76 76 76 75 75 75 76 76 76 76 76 76 76 76 76 76 76 76 75 75 76 76 76 76 76 76 77 76 76
4768G6%%%%%%J%%%%j%%%%%%%j%%%J%%%J%j%%%%j%%J%%J%j%%%%%%%%%%%%%%%%j%%J%J%j%%%
$$ 76 76 76 76 76 76 76 77 77 77 77 77 76 76 76 76 76 76 76 76 75 75 75 75 76 76 76 76 77 77 76 76 76 76 76 75 75 75 76 76 76 77 77 76 76 76 76 76 76 76 76 76 76 76 76 76 76 76 76 76 75 75 75 76 76 77 77 76 76 76 76
4761G6%%J%j%%%%%%%%%%%%%%%J%%%%%%%j%%%%%%%%J%%%%J%%%%j%%%%%%%%%%%j%%J%Jj%%%%
$$ 76 76 76 77 77 76 76 76 76 76 76 76 76 76 76 76 76 76 76 76 76 77 77 77 77 77 77 77 77 76 76 76 76 76 76 76 76 76 77 77 77 77 77 78 78 78 78 78 77 77 77 77 77 77 77 77 77 77 77 77 76 76 76 77 77 78 77 77 77 77 77
4754G7%%%%%%%%%jJ%%%%%%%%%j%J%%%%j%%%%%%%%%J%%%%%%jJ%%%%%%%j%%%%%%%%%%%%%%%%
$$ 77 77 77 77 77 77 77 77 77 77 76 77 77 77 77 77 77 77 77 77 77 76 76 77 77 77 77 77 76 76 76 76 76 76 76 76 76 76 77 77 77 77 77 77 77 76 77 77 77 77 77 77 77 77 76 76 76 76 76 76 76 76 76 76 76 76 76 76 76 76 76
4746G6%%%%%%%%%%%j%%%%%J%%%J%%%%%j%J%j%J%%j%%%%J%j%%%%%%%%%%J%%%%%%%%%%j%%%%
$$ 76 76 76 76 76 76 76 76 76 76 76 76 75 75 75 75 75 75 76 76 76 76 77 77 77 77 77 77 76 76 77 77 76 76 77 77 77 76 76 76 76 76 77 77 76 76 76 76 76 76 76 76 76 76 76 77 77 77 77 77 77 77 77 77 77 77 76 76 76 76 76
4739G6%%J%%j%%%%%%J%j%%%J%%%J%j%%%%%%%j%%%Jj%J%%%j%%%%%%%%%J%%j%%%%%%%%J%%j%
$$ 76 76 76 77 77 77 76 76 76 76 76 76 76 77 77 76 76 76 76 77 77 77 77 78 78 77 77 77 77 77 77 77 77 76 76 76 76 77 76 76 77 77 77 77 76 76 76 76 76 76 76 76 76 76 77 77 77 76 76 76 76 76 76 76 76 76 77 77 77 76 76
4731G6%%%%%%jJ%%%%J%%%%j%%%j%%%J%%%%%%J%Jj%%%%%%%%%jJ%%%%%%%%%%%%%j%J%%%jJ%%
$$ 76 76 76 76 76 76 76 75 76 76 76 76 76 77 77 77 77 77 76 76 76 76 75 75 75 75 76 76 76 76 76 76 76 77 77 78 77 77 77 77 77 77 77 77 77 77 76 77 77 77 77 77 77 77 77 77 77 77 77 77 77 76 76 77 77 77 77 76 77 77 77
4724G7%%%%j%%%%J%j%J%%%%J%%jJ%%%%j%%%J%%%%%%%%%%j%J%%%%%%%%%%%%%%j%J%%%%j%%J
$$ 77 77 77 77 77 76 76 76 76 76 77 77 76 76 77 77 77 77 77 78 78 78 77 78 78 78 78 78 77 77 77 77 78 78 78 78 78 78 78 78 78 78 78 77 77 78 78 78 78 78 78 78 78 78 78 78 78 78 78 78 77 77 78 78 78 78 78 77 77 77 78
4716G8%%j%J%%%%%%%%%%%Jj%%%%%%%%%%Jj%%%%J%%%j%%%%%%J%%%j%%%%%%%Jj%%%J%%%%%%%
$$ 78 78 78 77 77 78 78 78 78 78 78 78 78 78 78 78 78 79 78 78 78 78 78 78 78 78 78 78 78 79 78 78 78 78 78 79 79 79 79 78 78 78 78 78 78 78 79 79 79 79 78 78 78 78 78 78 78 78 79 78 78 78 78 79 79 79 79 79 79 79 79
4709G9j%%J%%%%%%%%%%j%J%%%%%%%%%J%j%%%%%%%%%%%%J%%%%j%%%%%%%%%%%j%%J%%%%%%%%
$$ 79 78 78 78 79 79 79 79 79 79 79 79 79 79 79 78 78 79 79 79 79 79 79 79 79 79 79 80 80 79 79 79 79 79 79 79 79 79 79 79 79 79 80 80 80 80 80 79 79 79 79 79 79 79 79 79 79 79 79 78 78 78 79 79 79 79 79 79 79 79 79
4702G9%%%%%%%%%J%j%%%J%%%%%%%%%%%%%%%%%Jj%%%%Jj%%%J%j%%%J%%%%%%%%%%%%%%%%%%%
$$ 79 79 79 79 79 79 79 79 79 79 80 80 79 79 79 79 80 80 80 80 80 80 80 80 80 80 80 80 80 80 80 80 80 80 81 80 80 80 80 80 81 80 80 80 80 81 81 80 80 80 80 81 81 81 81 81 81 81 81 81 81 81 81 81 81 81 81 81 81 81 81
4694H1%%%%%j%%%J%%%%%%%%%%%%%%%%%%%%%%%%%%%%%%%%%J%j%J%%%j%%J%%%%%%%%%%%J%j%
$$ 81 81 81 81 81 81 80 80 80 80 81 81 81 81 81 81 81 81 81 81 81 81 81 81 81 81 81 81 81 81 81 81 81 81 81 81 81 81 81 81 81 81 81 81 82 82 81 81 82 82 82 82 81 81 81 82 82 82 82 82 82 82 82 82 82 82 82 83 83 82 82
4687H2%j%%%%J%%%J%j%%%%%%%j%%%%%%%%j%J%J%%%%%%%%J%%%j%J%%%%%%%Jj%Jj%%%%%%j%J
$$ 82 82 81 81 81 81 81 82 82 82 82 83 83 82 82 82 82 82 82 82 82 81 81 81 81 81 81 81 81 81 80 80 81 81 82 82 82 82 82 82 82 82 82 83 83 83 83 82 82 83 83 83 83 83 83 83 83 84 83 83 84 83 83 83 83 83 83 83 82 82 83
4679H3%%%%%%%%%%%J%%%%%%%%%Jj%%%%J%%%j%Jj%%%%%J%%J%j%j%J%%%J%j%%%%J%%%%%j%%%
$$ 83 83 83 83 83 83 83 83 83 83 83 83 84 84 84 84 84 84 84 84 84 84 85 84 84 84 84 84 85 85 85 85 84 84 85 84 84 84 84 84 84 85 85 85 86 86 85 85 84 84 85 85 85 85 86 86 85 85 85 85 85 86 86 86 86 86 86 85 85 85 85
4672H5%%J%%%%J%j%%%%%%J%j%%%J%%%%%%%%%%%%%%%%%%%%%%J%%%%%%%J%j%%%%j%J%J%%%%%
$$ 85 85 85 86 86 86 86 86 87 87 86 86 86 86 86 86 86 87 87 86 86 86 86 87 87 87 87 87 87 87 87 87 87 87 87 87 87 87 87 87 87 87 87 87 87 87 88 88 88 88 88 88 88 88 89 89 88 88 88 88 88 87 87 88 88 89 89 89 89 89 89
4665H9%%%%%%J%%%%J%j%%%%j%J%%%J%j%%%%%J%%%%%%%%%%%J%%j%%%%J%%%%%%%%%%%%%J%%%
$$ 89 89 89 89 89 89 89 90 90 90 90 90 91 91 90 90 90 90 90 89 89 90 90 90 90 91 91 90 90 90 90 90 90 91 91 91 91 91 91 91 91 91 91 91 91 92 92 92 91 91 91 91 91 92 92 92 92 92 92 92 92 92 92 92 92 92 92 93 93 93 93
4657I3%%J%j%%J%%%%%%%%%%%%%j%%J%%%%J%jJ%J%%%j%%J%%%%%J%%%%%%%%%%%%J%%%%%%J%j
$$ 93 93 93 94 94 93 93 93 94 94 94 94 94 94 94 94 94 94 94 94 94 94 93 93 93 94 94 94 94 94 95 95 94 95 95 96 96 96 96 95 95 95 96 96 96 96 96 96 97 97 97 97 97 97 97 97 97 97 97 97 97 98 98 98 98 98 98 98 99 99 98
4650I8%%J%%j%%%%%%%%%J%%%%J%%%%%Jj%J%%%%%%j%%%J%%%%%%J%J%%%%%jJ%%%%%J%%%%%%%
$$ 98 98 98 99 99 99 98 98 98 98 98 98 98 98 98 98 99 99 99 99 99 100 100 100 100 100 100 101 100 100 101 101 101 101 101 101 101 100 100 100 100 101 101 101 101 101 101 101 102 102 103 103 103 103 103 103 102 103 103 103 103 103 103 104 104 104 104 104 104 104 104
4642A04%J%%%%%J%%%%%%%J%%%%J%J%%J%%JJJJKKKKJKJJJ%jjjkkjkkjJj%%%%%%J%%%%%J%%%
$$ 104 104 105 105 105 105 105 105 106 106 106 106 106 106 106 106 107 107 107 107 107 108 108 109 109 109 110 110 110 111 112 113 114 116 118 120 122 123 125 126 127 128 128 127 126 125 123 121 120 118 116 115 116 115 115 115 115 115 115 115 116 116 116 116 116 116 117 117 117 117
4635A17J%%J%%JJ%JJJ%KJJKLKMLMMMLKK%%jllmmllljk%j%%%%%%%%J%%J%J%%%J%%JJ%J%J%J
$$ 117 118 118 118 119 119 119 120 121 121 122 123 124 124 126 127 128 130 133 135 139 142 146 150 154 157 159 161 161 161 160 157 154 150 146 143 140 137 136 134 134 133 133 133 133 133 133 133 133 133 134 134 134 135 135 136 136 136 136 137 137 137 138 139 139 140 140 141 141 142
4628A42JJJJKKKJLKKKKJ%%jjkkjkjj%jJ%%J%J%%J%J%%%JJ%J%J%J%J%%JJ%J%%J%J%JJJJJ%J
$$ 142 143 144 145 146 148 150 152 153 156 158 160 162 164 165 165 165 164 163 161 159 158 156 155 154 154 153 154 154 154 155 155 156 156 156 157 157 158 158 158 158 159 160 160 161 161 162 162 163 163 164 164 164 165 166 166 167 167 167 168 168 169 169 170 171 172 173 174 174 175
4620A75%JJJ%J%JJJJJ%JJJ%J%KJ%J%JKJJ%KJJJJJ%JJJJJJK%JJJJJJKJJJJKJJJJJKKJJJKJK
$$ 175 175 176 177 178 178 179 179 180 181 182 183 184 184 185 186 187 187 188 188 190 191 191 192 192 193 195 196 197 197 199 200 201 202 203 204 204 205 206 207 208 209 210 212 212 213 214 215 216 217 218 220 221 222 223 224 226 227 228 229 230 231 233 235 236 237 238 240 241 243
4613B43JKJKJKJKJKJJKKKKKJKKKKKKKKKKKKKKKKKKKLKLLLKLLKKLLKLKMLLMLLLLMLMMMLMMM
$$ 243 244 246 247 249 250 252 253 255 256 258 259 260 262 264 266 268 270 271 273 275 277 279 281 283 285 287 289 291 293 295 297 299 301 303 305 307 309 312 314 317 320 323 325 328 331 333 335 338 341 343 346 348 352 355 358 362 365 368 371 374 378 381 385 389 393 396 400 404 408
4606D08MNMMMNMMNMONNNNOONOOOONPOPPPPPPQPQRQQRRRJ0RRJ0J0J0J0J1J1J1J2J2J1J3J3J3
$$ 408 412 417 421 425 429 434 438 442 447 451 457 462 467 472 477 483 489 494 500 506 512 518 523 530 536 543 550 557 564 571 578 586 593 601 610 618 626 635 644 653 663 672 681 691 701 711 721 732 743 754 766 778 789 802 815 828
4600H28J4J4J4J4J5J5J6J6J6J7J7J8J8J9J9J9K1K0K1K1K1K3K3K3K4K5K4K6K5K6K8K7K8K9K9
$$ 828 842 856 870 884 899 914 930 946 962 979 996 1014 1032 1051 1070 1089 1110 1130 1151 1172 1193 1216 1239 1262 1286 1311 1335 1361 1386 1412 1440 1467 1495 1524 1553
4596A553K9L0L0L0L1L1L2L2L2L2L2L3L2L3L2L2L2L2L2L2L0L1L1L0K9K8K9K8K7K6K6K5K4K4
$$ 1553 1582 1612 1642 1672 1703 1734 1766 1798 1830 1862 1894 1927 1959 1992 2024 2056 2088 2120 2152 2184 2214 2245 2276 2306 2335 2363 2392 2420 2447 2473 2499 2524 2548 2572
4592B572K4K2K2K2K1K1K1K1K1K0K0K0K0K1K1K0K2K1K2K1K3K2K3K3K5K4K4K5K5K5K5K5K6K5
$$ 2572 2596 2618 2640 2662 2683 2704 2725 2746 2767 2787 2807 2827 2847 2868 2889 2909 2931 2952 2974 2995 3018 3040 3063 3086 3111 3135 3159 3184 3209 3234 3259 3284 3310 3335
4589C335K5K4K4K4K2K2K1K0J8J7J6J4J3J1QPOLK%kmpqrj2j4j4j7j8j8k0k1k2k2k4k4k4k4k5
$$ 3335 3360 3384 3408 3432 3454 3476 3497 3517 3535 3552 3568 3582 3595 3606 3614 3621 3627 3630 3632 3632 3630 3626 3619 3611 3602 3590 3576 3562 3545 3527 3509 3489 3468 3446 3424 3400 3376 3352 3328 3303
4585C303k5k6k5k5k5k4k3k4k4k3k3k2k2k2k1k0k1k0k1k0k0j9k1k0k0k1k0k1k1k2k2k3k3k4
$$ 3303 3278 3252 3227 3202 3177 3153 3130 3106 3082 3059 3036 3014 2992 2970 2949 2929 2908 2888 2867 2847 2827 2808 2787 2767 2747 2726 2706 2685 2664 2642 2620 2597 2574 2550
4581B550k4k5k6k7k7k7k9k8k9l0l1l1l1l1l2l2l3l3l2l3l2l3l2l2l2l3l1l1l1l0l0l0k9k9
$$ 2550 2526 2501 2475 2448 2421 2394 2365 2337 2308 2278 2247 2216 2185 2154 2122 2090 2057 2024 1992 1959 1927 1894 1862 1830 1798 1765 1734 1703 1672 1642 1612 1582 1553 1524
4577A524k9k8k7k7k6k5k6k5k4k4k3k3k2k2k1k1k0j9j9j9j8j8j7j7j7j7j6j5j5j5j4j4j4j3
$$ 1524 1495 1467 1440 1413 1387 1362 1336 1311 1287 1263 1240 1217 1195 1173 1152 1131 1111 1092 1073 1054 1036 1018 1001 984 967 950 934 919 904 889 875 861 847 834
4574H34j3j3j3j3j2j1j1j1j1j1j0j0j0j0j0rrrqqrqqqqpqppoppooooonoooonnnnmnmnmnnm
$$ 834 821 808 795 782 770 759 748 737 726 715 705 695 685 675 665 656 647 638 630 622 613 605 597 589 581 574 566 559 552 546 539 532 526 520 514 508 502 497 491 485 479 473 468 463 458 453 449 444 440 435 431 426 421 417
4568D17mmmmmmlmmmlmlllmlllllmklkllmklklklkklkkklkkkkkkkkkkkkjkkkjkkjkjjkkkkj
$$ 417 413 409 405 401 397 393 390 386 382 378 375 371 368 365 362 358 355 352 349 346 343 339 337 334 332 329 326 322 320 317 315 312 310 307 305 303 300 298 296 294 291 289 287 285 283 281 279 277 275 273 271 269 267 266 264 262 260 259 257 255 254 252 251 250 248 246 244 242 241
4561B41jkjkjjjkjkjjjjjkjjkjkjjjjjjj%jjkjjjjjjjjj%jjjjjj%j%kjjj%jj%j%jj%j%kjj
$$ 241 240 238 237 235 234 233 232 230 229 227 226 225 224 223 222 220 219 218 216 215 213 212 211 210 209 208 207 206 206 205 204 202 201 200 199 198 197 196 195 194 193 193 192 191 190 189 188 187 187 186 186 184 183 182 181 181 180 179 179 178 178 177 176 176 175 175 173 172 171
4553A71%j%jj%j%jjjj%j%%j%j%j%j%j%j%j%%jj%%%%jj%j%%j%%%j%j%%%jJ%J%JJJJKJJJ%j%
$$ 171 171 170 170 169 168 168 167 167 166 165 164 163 163 162 162 162 161 161 160 160 159 159 158 158 157 157 156 156 155 155 155 154 153 153 153 153 153 152 151 151 150 150 150 149 149 149 149 148 148 147 147 147 147 146 147 147 148 148 149 150 151 152 154 155 156 157 157 156 156
4546A56jkkjlkkkjj%%%jj%j%j%j%%j%%%%%j%%%%%%J%%%JJJKKLKLLMKLJ%%jklmmnmlkkjjjj
$$ 156 155 153 151 150 147 145 143 141 140 139 139 139 139 138 137 137 136 136 135 135 134 134 134 133 133 133 133 133 133 132 132 132 132 132 132 132 133 133 133 133 134 135 136 138 140 143 145 148 151 155 157 160 161 161 161 160 158 155 151 147 142 138 135 133 131 130 129 128 127
4539A27jj%%j%%%j%%%%j%%jj%%%%%%%%J%JJ%JJJKJJKJ%%jjjklkkjkjjjj%jj%j%%%%j%%%j%
$$ 127 126 125 125 125 124 124 124 124 123 123 123 123 123 122 122 122 121 120 120 120 120 120 120 120 120 120 121 121 122 123 123 124 125 126 128 129 130 132 133 133 133 132 131 130 128 125 123 121 120 118 117 116 115 114 114 113 112 112 111 111 111 111 111 110 110 110 110 109 109
4532A09J%%j%%j%%%%j%%%%%j%%j%j%%%%j%%%%J%j%j%Jj%j%%%%%%%%%j%j%%%%%%%j%%jJ%%j
$$ 109 110 110 110 109 109 109 108 108 108 108 108 107 107 107 107 107 107 106 106 106 105 105 104 104 104 104 104 103 103 103 103 103 104 104 103 103 102 102 103 102 102 101 101 101 101 101 101 101 101 101 101 100 100 99 99 99 99 99 99 99 99 98 98 98 97 98 98 98 97
4524I7J%%%j%%%j%%%%%j%%%%%Jj%%%%%%j%%%%j%%%%%J%%%%j%%j%%J%%%%j%J%%%j%%%%%%%%
$$ 97 98 98 98 98 97 97 97 97 96 96 96 96 96 96 95 95 95 95 95 95 96 95 95 95 95 95 95 95 94 94 94 94 94 93 93 93 93 93 93 94 94 94 94 94 93 93 93 92 92 92 93 93 93 93 93 92 92 93 93 93 93 92 92 92 92 92 92 92 92 92
4517I2%j%%j%%J%%%%%%%%%j%%%%%%%j%%%J%j%%%jJ%%%%%%%%%j%%%j%%%%%J%%%%%%%%%%j%%
$$ 92 92 91 91 91 90 90 90 91 91 91 91 91 91 91 91 91 91 90 90 90 90 90 90 90 90 89 89 89 89 90 90 89 89 89 89 88 89 89 89 89 89 89 89 89 89 89 88 88 88 88 87 87 87 87 87 87 88 88 88 88 88 88 88 88 88 88 88 87 87 87
4509H7%%%%%%%%%%%%%%j%%jJ%%%%%%J%%j%%%%%%%j%%%%%%%%%%%%%%%%%%j%%J%%j%%%j%%%J
$$ 87 87 87 87 87 87 87 87 87 87 87 87 87 87 87 86 86 86 85 86 86 86 86 86 86 86 87 87 87 86 86 86 86 86 86 86 86 85 85 85 85 85 85 85 85 85 85 85 85 85 85 85 85 85 85 85 84 84 84 85 85 85 84 84 84 84 83 83 83 83 84
4502H4%%%%%%%%%%%j%%J%j%%%%J%%j%%%%%%%%%%%%%%%%%%j%Jj%%%%%%%J%%j%%%j%%%%%%%J
$$ 84 84 84 84 84 84 84 84 84 84 84 84 83 83 83 84 84 83 83 83 83 83 84 84 84 83 83 83 83 83 83 83 83 83 83 83 83 83 83 83 83 83 83 83 82 82 83 82 82 82 82 82 82 82 82 83 83 83 82 82 82 82 81 81 81 81 81 81 81 81 82
4495H2%%%j%%%%%%%%%%%%%%%J%%%%j%%%%%%j%J%%%%%%%%%%%j%%J%%%%%%%%%%j%%%%%%%J%%
$$ 82 82 82 82 81 81 81 81 81 81 81 81 81 81 81 81 81 81 81 81 82 82 82 82 82 81 81 81 81 81 81 81 80 80 81 81 81 81 81 81 81 81 81 81 81 81 80 80 80 81 81 81 81 81 81 81 81 81 81 81 80 80 80 80 80 80 80 80 81 81 81
4487H1%%%Jj%%%%%%%%%%j%%J%%%%%%%%%%%%j%%%%%%%%J%%%%%%%%%%jJ%%%%j%%%%%%j%J%J%
$$ 81 81 81 81 82 81 81 81 81 81 81 81 81 81 81 81 80 80 80 81 81 81 81 81 81 81 81 81 81 81 81 81 80 80 80 80 80 80 80 80 80 81 81 81 81 81 81 81 81 81 81 81 80 81 81 81 81 81 80 80 80 80 80 80 80 79 79 80 80 81 81
4480H1%j%Jj%%%Jj%j%%%%J%%%%%j%%%%%%%%%%%%J%%%j%%%%%%%%%%%%%%%Jj%%%%%%%%%%%%%
$$ 81 81 80 80 81 80 80 80 80 81 80 80 79 79 79 79 79 80 80 80 80 80 80 79 79 79 79 79 79 79 79 79 79 79 79 79 80 80 80 80 79 79 79 79 79 79 79 79 79 79 79 79 79 79 79 79 80 79 79 79 79 79 79 79 79 79 79 79 79 79 79
4472G9%j%J%%%%%%j%%%%j%J%%%%%J%%j%%%j%J%J%j%%%%%%%%%J%%%%%%%jJ%%%j%%%%%%%%%%
$$ 79 79 78 78 79 79 79 79 79 79 79 78 78 78 78 78 77 77 78 78 78 78 78 78 79 79 79 78 78 78 78 77 77 78 78 79 79 78 78 78 78 78 78 78 78 78 78 79 79 79 79 79 79 79 79 78 79 79 79 79 78 78 78 78 78 78 78 78 78 78 78
4465G8%%%Jj%%%j%%J%Jj%%j%%%%%%%J%%%%%j%%%%J%%%%%%%j%%%%Jj%%%%%%%%%%%%%%j%Jj%
$$ 78 78 78 78 79 78 78 78 78 77 77 77 78 78 79 78 78 78 77 77 77 77 77 77 77 77 78 78 78 78 78 78 77 77 77 77 77 78 78 78 78 78 78 78 78 77 77 77 77 77 78 77 77 77 77 77 77 77 77 77 77 77 77 77 77 77 76 76 77 76 76
4457G6%%%%%%%%%JjJ%%%%%%j%J%%%%%%%%%Jj%%%%%%j%%%%%%J%%%%%j%%%J%%%%%%%%%%j%%%
$$ 76 76 76 76 76 76 76 76 76 76 77 76 77 77 77 77 77 77 77 76 76 77 77 77 77 77 77 77 77 77 77 78 77 77 77 77 77 77 77 76 76 76 76 76 76 76 77 77 77 77 77 77 76 76 76 76 77 77 77 77 77 77 77 77 77 77 77 76 76 76 76
4450G6j%%%%%Jj%%Jj%%J%%%%jJ%%%%%%%%%%%j%%%%%%%J%%%%%%j%%%%%%%%%j%%J%%%%%J%%%
$$ 76 75 75 75 75 75 75 76 75 75 75 76 75 75 75 76 76 76 76 76 75 76 76 76 76 76 76 76 76 76 76 76 76 75 75 75 75 75 75 75 75 76 76 76 76 76 76 76 75 75 75 75 75 75 75 75 75 75 74 74 74 75 75 75 75 75 75 76 76 76 76
4443G6j%%%J%%%%jJ%%%j%%%%%%%%%J%%%%j%%%%%%%%%J%%%%%j%%%%%%J%%j%%J%j%%%J%%j%%
$$ 76 75 75 75 75 76 76 76 76 76 75 76 76 76 76 75 75 75 75 75 75 75 75 75 75 76 76 76 76 76 75 75 75 75 75 75 75 75 75 75 76 76 76 76 76 76 75 75 75 75 75 75 75 76 76 76 75 75 75 76 76 75 75 75 75 76 76 76 75 75 75
4435G5%Jj%Jj%%Jj%%%%%%%%%%j%%J%%%J%%%%%%%%%%j%%%%%jJ%%%j%%%Jj%%%%J%%%%%%%%%%
$$ 75 75 76 75 75 76 75 75 75 76 75 75 75 75 75 75 75 75 75 75 75 74 74 74 75 75 75 75 76 76 76 76 76 76 76 76 76 76 76 75 75 75 75 75 75 74 75 75 75 75 74 74 74 74 75 74 74 74 74 74 75 75 75 75 75 75 75 75 75 75 75
4428G5%%%%%%%%%%%%j%J%%j%%%%J%%%%%%%%%%%%%%J%%%%%%j%%%%%%%%%%%%%%%j%%%J%Jj%%
$$ 75 75 75 75 75 75 75 75 75 75 75 75 75 74 74 75 75 75 74 74 74 74 74 75 75 75 75 75 75 75 75 75 75 75 75 75 75 75 76 76 76 76 76 76 76 75 75 75 75 75 75 75 75 75 75 75 75 75 75 75 75 74 74 74 74 75 75 76 75 75 75
4420G5%%%%%jJ%%%%%%j%%j%%%J%%%%%%jJ%%J%%j%Jj%J%j%%%%J%%%j%%%J%j%%%%%%Jj%%%%%
$$ 75 75 75 75 75 75 74 75 75 75 75 75 75 75 74 74 74 73 73 73 73 74 74 74 74 74 74 74 73 74 74 74 75 75 75 74 74 75 74 74 75 75 74 74 74 74 74 75 75 75 75 74 74 74 74 75 75 74 74 74 74 74 74 74 75 74 74 74 74 74 74
4413G4j%%J%%%%%%%J%%j%j%J%J%%j%%%Jj%j%%%J%J%%%j%%%%J%jJ%%%%%J%%%J%%%%%jJ%j%%
$$ 74 73 73 73 74 74 74 74 74 74 74 74 75 75 75 74 74 73 73 74 74 75 75 75 74 74 74 74 75 74 74 73 73 73 73 74 74 75 75 75 75 74 74 74 74 74 75 75 74 75 75 75 75 75 75 76 76 76 76 77 77 77 77 77 77 76 77 77 76 76 76
4406G6%J%%j%%%%j%%j%%%%%%%%%j%%%%%J%%J%%%%%%%J%%%J%%%%%%%j%%%%%%%%j%%%jJ%%%%
$$ 76 76 77 77 77 76 76 76 76 76 75 75 75 74 74 74 74 74 74 74 74 74 74 73 73 73 73 73 73 74 74 74 75 75 75 75 75 75 75 75 76 76 76 76 77 77 77 77 77 77 77 77 76 76 76 76 76 76 76 76 76 75 75 75 75 74 75 75 75 75 75
4398G5J%%%%%%%%%%j%%j%%%%%%%%j%%%%%%j%%J%%%%J%%%J%%%%%%%%%%%%J%%%%%%j%%%%j%%
$$ 75 76 76 76 76 76 76 76 76 76 76 76 75 75 75 74 74 74 74 74 74 74 74 74 73 73 73 73 73 73 73 72 72 72 73 73 73 73 73 74 74 74 74 75 75 75 75 75 75 75 75 75 75 75 75 75 76 76 76 76 76 76 76 75 75 75 75 75 74 74 74
4391G4%%j%%%%%%j%%%Jj%%%j%J%%%%%%%%%%%%jJ%%%%%j%%%%%%%%%%%%%%%%%%%%J%%%%%%j%
$$ 74 74 74 73 73 73 73 73 73 73 72 72 72 72 73 72 72 72 72 71 71 72 72 72 72 72 72 72 72 72 72 72 72 72 71 72 72 72 72 72 72 71 71 71 71 71 71 71 71 71 71 71 71 71 71 71 71 71 71 71 71 71 72 72 72 72 72 72 72 71 71
4383G1%%J%%j%%%%j%J%%%%%%%%%J%%%%%j%%%%%%%%%J%J%%%%%%%j%%%%%%%%%%%%%j%%%%Jj%
$$ 71 71 71 72 72 72 71 71 71 71 71 70 70 71 71 71 71 71 71 71 71 71 71 72 72 72 72 72 72 71 71 71 71 71 71 71 71 71 71 72 72 73 73 73 73 73 73 73 73 72 72 72 72 72 72 72 72 72 72 72 72 72 72 71 71 71 71 71 72 71 71
4376G1%%%J%%%%%%%jJ%%%%%%%J%%%j%%%j%J%%%%%J%%%%j%J%%%%%%%j%%J%%%%%%%%%%j%%%J
$$ 71 71 71 71 72 72 72 72 72 72 72 72 71 72 72 72 72 72 72 72 72 73 73 73 73 72 72 72 72 71 71 72 72 72 72 72 72 73 73 73 73 73 72 72 73 73 73 73 73 73 73 73 72 72 72 73 73 73 73 73 73 73 73 73 73 73 72 72 72 72 73
4368G3%%%j%%%%%%%%%%%%J%j%%%%%%J%%%%%%J%j%%%%%%%%%J%%j%jJ%%%%%%%%%%%%%%j%%J%
$$ 73 73 73 73 72 72 72 72 72 72 72 72 72 72 72 72 72 73 73 72 72 72 72 72 72 72 73 73 73 73 73 73 73 74 74 73 73 73 73 73 73 73 73 73 73 74 74 74 73 73 72 73 73 73 73 73 73 73 73 73 73 73 73 73 73 73 72 72 72 73 73
4361G3%%%%%j%%%%%%%J%%%%%%%jJ%%%%%%%%%j%%%%j%%%J%%%%%J%%%j%%%J%%%%%%%j%%%%%J
$$ 73 73 73 73 73 73 72 72 72 72 72 72 72 72 73 73 73 73 73 73 73 73 72 73 73 73 73 73 73 73 73 73 73 72 72 72 72 72 71 71 71 71 72 72 72 72 72 72 73 73 73 73 72 72 72 72 73 73 73 73 73 73 73 73 72 72 72 72 72 72 73
4354G3j%%%Jj%%%J%%%j%%%%%%%%%%%%J%%j%%%%%%%jJ%J%%%%j%%%%%%%%%%%%%%%%%%%%%%%%
$$ 73 72 72 72 72 73 72 72 72 72 73 73 73 73 72 72 72 72 72 72 72 72 72 72 72 72 72 73 73 73 72 72 72 72 72 72 72 72 71 72 72 73 73 73 73 73 72 72 72 72 72 72 72 72 72 72 72 72 72 72 72 72 72 72 72 72 72 72 72 72 72
4346G2%%%%%j%%%J%J%%j%%%%%%J%%%%%%%%%jJ%%%%%j%%%%%%j%J%%%%%%%j%%j%J%%J%%%j%%
$$ 72 72 72 72 72 72 71 71 71 71 72 72 73 73 73 72 72 72 72 72 72 72 73 73 73 73 73 73 73 73 73 73 72 73 73 73 73 73 73 72 72 72 72 72 72 72 71 71 72 72 72 72 72 72 72 72 71 71 71 70 70 71 71 71 72 72 72 72 71 71 71
4339G1%%%%J%%%%%%%%%%%%%%J%j%%%j%%%%%%%%%%%%%jJ%%%%%%%%%%%%%%%%%%%%%%%%%%%%%
$$ 71 71 71 71 71 72 72 72 72 72 72 72 72 72 72 72 72 72 72 72 73 73 72 72 72 72 71 71 71 71 71 71 71 71 71 71 71 71 71 71 70 71 71 71 71 71 71 71 71 71 71 71 71 71 71 71 71 71 71 71 71 71 71 71 71 71 71 71 71 71 71
4331G1%J%%j%j%%J%%%%J%%%%jJ%%%j%%%%%%%J%%%%j%%%%%%%%%%%%%%%%%%%%%j%%J%%%%J%j
$$ 71 71 72 72 72 71 71 70 70 70 71 71 71 71 71 72 72 72 72 72 71 72 72 72 72 71 71 71 71 71 71 71 71 72 72 72 72 72 71 71 71 71 71 71 71 71 71 71 71 71 71 71 71 71 71 71 71 71 71 71 70 70 70 71 71 71 71 71 72 72 71
4324G1J%%j%J%%j%%%%%%%%%j%%%J%%%%%%%%%%%%%%%%%%%%%%jJ%%%jJ%j%%J%%%%%%j%J%jJ%
$$ 71 72 72 72 71 71 72 72 72 71 71 71 71 71 71 71 71 71 71 70 70 70 70 71 71 71 71 71 71 71 71 71 71 71 71 71 71 71 71 71 71 71 71 71 71 71 70 71 71 71 71 70 71 71 70 70 70 71 71 71 71 71 71 71 70 70 71 71 70 71 71
4317G1%%j%J%%%j%J%%%%%%%%%%%j%J%%%%%%%%%Jj%%%%%%%J%%%%%%%%%%%%%%%%%%%j%%%%jJ
$$ 71 71 71 70 70 71 71 71 71 70 70 71 71 71 71 71 71 71 71 71 71 71 71 70 70 71 71 71 71 71 71 71 71 71 71 72 71 71 71 71 71 71 71 71 72 72 72 72 72 72 72 72 72 72 72 72 72 72 72 72 72 72 72 72 71 71 71 71 71 70 71
4309G1%%%%%%%%%%J%%%j%J%j%%J%%%j%%%J%%%%%j%J%%%%%%%%%%%%%%%%%%%%%%%%j%J%%%%%
$$ 71 71 71 71 71 71 71 71 71 71 71 72 72 72 72 71 71 72 72 71 71 71 72 72 72 72 71 71 71 71 72 72 72 72 72 72 71 71 72 72 72 72 72 72 72 72 72 72 72 72 72 72 72 72 72 72 72 72 72 72 72 72 72 71 71 72 72 72 72 72 72
4302G2%%%%%%%J%%%jJ%%%j%%%%%%%%%%%%%%%%%%%%%%%%j%%%%%%j%%%%%%J%%%%%%%%%%%%%%
$$ 72 72 72 72 72 72 72 72 73 73 73 73 72 73 73 73 73 72 72 72 72 72 72 72 72 72 72 72 72 72 72 72 72 72 72 72 72 72 72 72 72 72 71 71 71 71 71 71 71 70 70 70 70 70 70 70 71 71 71 71 71 71 71 71 71 71 71 71 71 71 71
4294G1%jJj%%%%J%j%%%%Jj%J%%%%%%%j%J%%%J%%%j%%%Jj%%%%%%%%%%%%%%%%%%jJ%%%%J%%%
$$ 71 71 70 71 70 70 70 70 70 71 71 70 70 70 70 70 71 70 70 71 71 71 71 71 71 71 71 70 70 71 71 71 71 72 72 72 72 71 71 71 71 72 71 71 71 71 71 71 71 71 71 71 71 71 71 71 71 71 71 71 71 70 71 71 71 71 71 72 72 72 72
4287G2j%%%%%%%%%J%%%Jj%J%j%%%%%%J%%%j%%%%%%%%%%%%%%%j%J%%Jj%%%%%%%j%%%J%%%%%
$$ 72 71 71 71 71 71 71 71 71 71 71 72 72 72 72 73 72 72 73 73 72 72 72 72 72 72 72 73 73 73 73 72 72 72 72 72 72 72 72 72 72 72 72 72 72 72 72 71 71 72 72 72 73 72 72 72 72 72 72 72 72 71 71 71 71 72 72 72 72 72 72
4279G2%%%%%%%%%%%%%%%%j%%%J%%%%%%%j%%%%%%%%%%%%%%%J%%%%%%%%%%%%%%%%%jJ%%%%%%
$$ 72 72 72 72 72 72 72 72 72 72 72 72 72 72 72 72 72 71 71 71 71 72 72 72 72 72 72 72 72 71 71 71 71 71 71 71 71 71 71 71 71 71 71 71 71 72 72 72 72 72 72 72 72 72 72 72 72 72 72 72 72 72 72 71 72 72 72 72 72 72 72
4272G2%j%%%%J%j%%j%%%%J%%%J%%%%%%%%jJ%%%j%%%%Jj%%%J%%%%%j%J%%%J%j%%%%%%%%%%%
$$ 72 72 71 71 71 71 71 72 72 71 71 71 70 70 70 70 70 71 71 71 71 72 72 72 72 72 72 72 72 72 71 72 72 72 72 71 71 71 71 71 72 71 71 71 71 72 72 72 72 72 72 71 71 72 72 72 72 73 73 72 72 72 72 72 72 72 72 72 72 72 72
4265G2%%%%j%%%%%%%%%%%%%J%%j%%%%%%%%J%%%%%%%%%%%%%%j%%J%%%j%J%%%%%%%%%%%%%%j
$$ 72 72 72 72 72 71 71 71 71 71 71 71 71 71 71 71 71 71 71 72 72 72 71 71 71 71 71 71 71 71 71 72 72 72 72 72 72 72 72 72 72 72 72 72 72 72 71 71 71 72 72 72 72 71 71 72 72 72 72 72 72 72 72 72 72 72 72 72 72 72 71
4257G1J%%%%%%%%%%%%%%%%j%%%%%%%%%%Jj%%%J%%%%j%%%%%%%%%%%%%%%%%%Jj%%%%Jj%%%%%
$$ 71 72 72 72 72 72 72 72 72 72 72 72 72 72 72 72 72 72 71 71 71 71 71 71 71 71 71 71 71 72 71 71 71 71 72 72 72 72 72 71 71 71 71 71 71 71 71 71 71 71 71 71 71 71 71 71 71 71 72 71 71 71 71 71 72 71 71 71 71 71 71
4250G1%%J%%%%%%%%%j%%J%j%%%%%%%%%%%%%%%%%j%%%%%%%%%J%%%j%%J%%%%%%%J%j%%%%%%%
$$ 71 71 71 72 72 72 72 72 72 72 72 72 72 71 71 71 72 72 71 71 71 71 71 71 71 71 71 71 71 71 71 71 71 71 71 71 70 70 70 70 70 70 70 70 70 70 71 71 71 71 70 70 70 71 71 71 71 71 71 71 71 72 72 71 71 71 71 71 71 71 71
4242G1j%J%%J%j%%%%%%%%%%%%%%%Jj%%%%%%%%%%%%%%%J%%%%%%jJ%%%%%j%%J%%%%%%j%J%%%
$$ 71 70 70 71 71 71 72 72 71 71 71 71 71 71 71 71 71 71 71 71 71 71 71 71 72 71 71 71 71 71 71 71 71 71 71 71 71 71 71 71 71 72 72 72 72 72 72 72 71 72 72 72 72 72 72 71 71 71 72 72 72 72 72 72 72 71 71 72 72 72 72
4235G2%%%%%jJ%%%%%%j%%%%%Jj%%J%%%%j%%%%%%%%%%Jj%%J%%%%j%%%%%%Jj%%J%%%%%%%%%%
$$ 72 72 72 72 72 72 71 72 72 72 72 72 72 72 71 71 71 71 71 71 72 71 71 71 72 72 72 72 72 71 71 71 71 71 71 71 71 71 71 71 72 71 71 71 72 72 72 72 72 71 71 71 71 71 71 71 72 71 71 71 72 72 72 72 72 72 72 72 72 72 72
4228G2%%%%%%%%%%%%%%Jj%%%j%J%%%%%%%%%%%%%%J%%j%%%%%%%%%%J%%j%%%%%%%jJ%%%%%%%
$$ 72 72 72 72 72 72 72 72 72 72 72 72 72 72 72 73 72 72 72 72 71 71 72 72 72 72 72 72 72 72 72 72 72 72 72 72 72 73 73 73 72 72 72 72 72 72 72 72 72 72 72 73 73 73 72 72 72 72 72 72 72 72 71 72 72 72 72 72 72 72 72
4220G2%%%%J%j%%J%%%%%j%%%j%%%%J%%%%%J%%%%%%%%%%j%%%%%%%%%J%%%%%%%%%%%%%Jj%%%
$$ 72 72 72 72 72 73 73 72 72 72 73 73 73 73 73 73 72 72 72 72 71 71 71 71 71 72 72 72 72 72 72 73 73 73 73 73 73 73 73 73 73 73 72 72 72 72 72 72 72 72 72 72 73 73 73 73 73 73 73 73 73 73 73 73 73 73 74 73 73 73 73
4213G3%%J%%%j%%%J%%%%%%Jj%%J%%%%%%%%%%%%%%%Jj%%%J%%%%%%%%%J%%%%%%%%%%jJ%%%%%
$$ 73 73 73 74 74 74 74 73 73 73 73 74 74 74 74 74 74 74 75 74 74 74 75 75 75 75 75 75 75 75 75 75 75 75 75 75 75 75 76 75 75 75 75 76 76 76 76 76 76 76 76 76 76 77 77 77 77 77 77 77 77 77 77 77 76 77 77 77 77 77 77
4205G7%%%%%%%%%%%%Jj%J%%%%%%%J%%%%j%%%J%%%%j%%j%%%J%%%%%%%%%%%%%%%j%%%%j%%%%
$$ 77 77 77 77 77 77 77 77 77 77 77 77 77 78 77 77 78 78 78 78 78 78 78 78 79 79 79 79 79 78 78 78 78 79 79 79 79 79 78 78 78 77 77 77 77 78 78 78 78 78 78 78 78 78 78 78 78 78 78 78 78 77 77 77 77 77 76 76 76 76 76
4198G6%%%%%J%%j%%%%Jj%%%%%j%%%%Jj%%%%%%%%%%%%j%%%J%j%%%J%%%%j%j%%%J%%%%%%%j%
$$ 76 76 76 76 76 76 77 77 77 76 76 76 76 76 77 76 76 76 76 76 76 75 75 75 75 75 76 75 75 75 75 75 75 75 75 75 75 75 75 75 74 74 74 74 75 75 74 74 74 74 75 75 75 75 75 74 74 73 73 73 73 74 74 74 74 74 74 74 74 73 73
4190G3Jj%j%%J%%%%%%%%%%%%jJ%%%%%%%%%%j%%%%%%%%%%%%%%%%%%%%%%%%%%%%%%%%%%%%J%
$$ 73 74 73 73 72 72 72 73 73 73 73 73 73 73 73 73 73 73 73 73 72 73 73 73 73 73 73 73 73 73 73 73 72 72 72 72 72 72 72 72 72 72 72 72 72 72 72 72 72 72 72 72 72 72 72 72 72 72 72 72 72 72 72 72 72 72 72 72 72 73 73
4183G3%j%%%%%%%%%%%%J%%%j%%%%%%%%%%J%j%%%%%%%jJ%%%%%%%%%%%%%%%%%%%%J%%%j%%%%
$$ 73 73 72 72 72 72 72 72 72 72 72 72 72 72 72 73 73 73 73 72 72 72 72 72 72 72 72 72 72 72 73 73 72 72 72 72 72 72 72 72 71 72 72 72 72 72 72 72 72 72 72 72 72 72 72 72 72 72 72 72 72 72 73 73 73 73 72 72 72 72 72
4176G2%%%%%%%%%%%%J%%%j%%j%J%%%%%%%%%%%j%%%%%J%%%j%%%%%%%J%%%j%Jj%%%%%%%J%j%
$$ 72 72 72 72 72 72 72 72 72 72 72 72 72 73 73 73 73 72 72 72 71 71 72 72 72 72 72 72 72 72 72 72 72 72 71 71 71 71 71 71 72 72 72 72 71 71 71 71 71 71 71 71 72 72 72 72 71 71 72 71 71 71 71 71 71 71 71 72 72 71 71
4168G1%%%%J%%%%jJ%%%%%%%%%j%%%%jJ%%%%%%J%%%%%%Jj%%%%%%%%%%%%%%%%%%%j%%%%J%%%
$$ 71 71 71 71 71 72 72 72 72 72 71 72 72 72 72 72 72 72 72 72 72 71 71 71 71 71 70 71 71 71 71 71 71 71 72 72 72 72 72 72 72 73 72 72 72 72 72 72 72 72 72 72 72 72 72 72 72 72 72 72 72 72 71 71 71 71 71 72 72 72 72
4161G2j%%jJ%%%%%%%%J%%%%%jJ%%%%%%%%%%%%j%%%%%%%%j%%J%%%j%%%Jj%%%%J%%%%%%%%%%
$$ 72 71 71 71 70 71 71 71 71 71 71 71 71 71 72 72 72 72 72 72 71 72 72 72 72 72 72 72 72 72 72 72 72 72 71 71 71 71 71 71 71 71 71 70 70 70 71 71 71 71 70 70 70 70 71 70 70 70 70 70 71 71 71 71 71 71 71 71 71 71 71
4153G1%%%%%%%%%j%Jj%%%%%%%%%%%%%%%%J%%%%%%%%%%%%%%%%j%j%%J%%%%%%%%%%%%%%%%J%
$$ 71 71 71 71 71 71 71 71 71 71 70 70 71 70 70 70 70 70 70 70 70 70 70 70 70 70 70 70 70 70 71 71 71 71 71 71 71 71 71 71 71 71 71 71 71 71 71 70 70 69 69 69 70 70 70 70 70 70 70 70 70 70 70 70 70 70 70 70 70 71 71
4146G1%%%%%%%%%%%%j%%%%%Jj%%%%%%J%%j%%%%%%%%%%%%%%%J%%%%%%%%jJ%%%%%j%%Jj%jJ%
$$ 71 71 71 71 71 71 71 71 71 71 71 71 71 70 70 70 70 70 70 71 70 70 70 70 70 70 70 71 71 71 70 70 70 70 70 70 70 70 70 70 70 70 70 70 70 70 71 71 71 71 71 71 71 71 71 70 71 71 71 71 71 71 70 70 70 71 70 70 69 70 70
4139G0jJ%J%%%%%%J%%%%j%J%j%%%%%%%%%j%J%%%%%%j%J%%%%%J%%%%j%j%J%%J%%j%J%%j%%%
$$ 70 69 70 70 71 71 71 71 71 71 71 72 72 72 72 72 71 71 72 72 71 71 71 71 71 71 71 71 71 71 70 70 71 71 71 71 71 71 71 70 70 71 71 71 71 71 71 72 72 72 72 72 71 71 70 70 71 71 71 72 72 72 71 71 72 72 72 71 71 71 71
4131G1%%J%%%%%%%%%%%%%%%%%j%J%%%%%%jJ%%j%%%%j%%%%jJ%%%%J%%J%j%%%%J%j%%%%%%%%
$$ 71 71 71 72 72 72 72 72 72 72 72 72 72 72 72 72 72 72 72 72 72 71 71 72 72 72 72 72 72 72 71 72 72 72 71 71 71 71 71 70 70 70 70 70 69 70 70 70 70 70 71 71 71 72 72 71 71 71 71 71 72 72 71 71 71 71 71 71 71 71 71
4124G1jJ%j%%%%%%%J%j%J%j%%%%%%J%%%%J%Jj%%%%%%%%%j%%%%j%%Jj%%%%J%%%%Jj%%%%%%%
$$ 71 70 71 71 70 70 70 70 70 70 70 70 71 71 70 70 71 71 70 70 70 70 70 70 70 71 71 71 71 71 72 72 73 72 72 72 72 72 72 72 72 72 72 71 71 71 71 71 70 70 70 71 70 70 70 70 70 71 71 71 71 71 72 71 71 71 71 71 71 71 71
4116G1%%%%%%%%%%J%%%j%jJ%J%%%%%%Jj%%j%%%%%%%%%%%%%%J%%j%J%%%%%%%%%%%%%%%j%%j
$$ 71 71 71 71 71 71 71 71 71 71 71 72 72 72 72 71 71 70 71 71 72 72 72 72 72 72 72 73 72 72 72 71 71 71 71 71 71 71 71 71 71 71 71 71 71 71 72 72 72 71 71 72 72 72 72 72 72 72 72 72 72 72 72 72 72 72 72 71 71 71 70
4109G0J%%%%%jJ%j%%%J%%j%%%%%%%%%%%j%%%%J%%%%%%%%%%%%%%%%%%%j%%%J%j%%%%J%%%%%
$$ 70 71 71 71 71 71 71 70 71 71 70 70 70 70 71 71 71 70 70 70 70 70 70 70 70 70 70 70 70 69 69 69 69 69 70 70 70 70 70 70 70 70 70 70 70 70 70 70 70 70 70 70 70 70 69 69 69 69 70 70 69 69 69 69 69 70 70 70 70 70 70
4101G0%%%%%j%%%%Jj%%%%jJ%%%%%%%%%%%%J%%%%%%%%%%j%%%%%%%J%%%j%%%JjJ%%%%%%j%%%
$$ 70 70 70 70 70 70 69 69 69 69 69 70 69 69 69 69 69 68 69 69 69 69 69 69 69 69 69 69 69 69 69 70 70 70 70 70 70 70 70 70 70 70 69 69 69 69 69 69 69 69 70 70 70 70 69 69 69 69 70 69 70 70 70 70 70 70 70 69 69 69 69
4094F9%%jJ%j%%%J%J%j%%%%J%%j%%%%%%J%J%%%%%%j%%%J%%%%%%j%j%J%Jj%%%%%%%%j%J%%%
$$ 69 69 69 68 69 69 68 68 68 68 69 69 70 70 69 69 69 69 69 70 70 70 69 69 69 69 69 69 69 70 70 71 71 71 71 71 71 71 70 70 70 70 71 71 71 71 71 71 71 70 70 69 69 70 70 71 70 70 70 70 70 70 70 70 70 69 69 70 70 70 70
4087G0%%j%%J%%J%%Jjj%%%%%%%%%%%%%%%%%%%%%%%%%%%%j%J%%%%%%%%%%j%J%%%%%J%j%%%%
$$ 70 70 70 69 69 69 70 70 70 71 71 71 72 71 70 70 70 70 70 70 70 70 70 70 70 70 70 70 70 70 70 70 70 70 70 70 70 70 70 70 70 70 70 69 69 70 70 70 70 70 70 70 70 70 70 70 69 69 70 70 70 70 70 70 71 71 70 70 70 70 70
4079G0%%%J%%%%%%%%%%%%%%%%%%%%j%%%%%%%%%%%%%%J%%%%%%%j%J%%%%%%%%%%%%%%%%%%%J
$$ 70 70 70 70 71 71 71 71 71 71 71 71 71 71 71 71 71 71 71 71 71 71 71 71 71 70 70 70 70 70 70 70 70 70 70 70 70 70 70 70 71 71 71 71 71 71 71 71 70 70 71 71 71 71 71 71 71 71 71 71 71 71 71 71 71 71 71 71 71 71 72
4072G2%j%%%%%%%%%%%%%%%Jj%%%%%%%%j%%%%%%j%J%J%%%%%%%j%%%J%%j%J%J%%j%%J%%%%%%
$$ 72 72 71 71 71 71 71 71 71 71 71 71 71 71 71 71 71 71 72 71 71 71 71 71 71 71 71 71 70 70 70 70 70 70 70 69 69 70 70 71 71 71 71 71 71 71 71 70 70 70 70 71 71 71 70 70 71 71 72 72 72 71 71 71 72 72 72 72 72 72 72
4064G2j%%%%%%%%J%%%%%%%%%%j%%%%%%%%%%%%J%%%%%%j%%%%J%%%%%%%%j%%%%%%%%%%%%%%%
$$ 72 71 71 71 71 71 71 71 71 71 72 72 72 72 72 72 72 72 72 72 72 71 71 71 71 71 71 71 71 71 71 71 71 71 72 72 72 72 72 72 72 71 71 71 71 71 72 72 72 72 72 72 72 72 72 71 71 71 71 71 71 71 71 71 71 71 71 71 71 71 71
4057G1%%%%%%%%%%%J%%%j%%%%%J%%%j%%%%J%%%%%%j%J%%%%jJ%%%%%%%%%%%%%%%%J%j%%J%%
$$ 71 71 71 71 71 71 71 71 71 71 71 71 72 72 72 72 71 71 71 71 71 71 72 72 72 72 71 71 71 71 71 72 72 72 72 72 72 72 71 71 72 72 72 72 72 71 72 72 72 72 72 72 72 72 72 72 72 72 72 72 72 72 72 73 73 72 72 72 73 73 73
4050G3j%%%%J%%%%%%%%%j%%J%%%%%%%%%%Jj%%%%%%%%%%%%%%%%%%j%J%%%%%%%%%%jJ%%j%%%
$$ 73 72 72 72 72 72 73 73 73 73 73 73 73 73 73 73 72 72 72 73 73 73 73 73 73 73 73 73 73 73 74 73 73 73 73 73 73 73 73 73 73 73 73 73 73 73 73 73 73 73 72 72 73 73 73 73 73 73 73 73 73 73 73 72 73 73 73 72 72 72 72
4042G2%%J%%%%%j%%J%%%%j%%%%J%%%j%%%%%%%%%%%%%%%%%%%%%%%%%J%j%%%%%%%%%Jj%%j%%
$$ 72 72 72 73 73 73 73 73 73 72 72 72 73 73 73 73 73 72 72 72 72 72 73 73 73 73 72 72 72 72 72 72 72 72 72 72 72 72 72 72 72 72 72 72 72 72 72 72 72 72 72 72 73 73 72 72 72 72 72 72 72 72 72 72 73 72 72 72 71 71 71
4035G1J%%%j%%%%%%%%%%%%%%%%%j%J%%%j%%J%%%%%%jJ%%%%%%j%J%%%%%%%%%%%%%%%%%%%%%
$$ 71 72 72 72 72 71 71 71 71 71 71 71 71 71 71 71 71 71 71 71 71 71 71 70 70 71 71 71 71 70 70 70 71 71 71 71 71 71 71 70 71 71 71 71 71 71 71 70 70 71 71 71 71 71 71 71 71 71 71 71 71 71 71 71 71 71 71 71 71 71 71
4027G1%%%%%%%J%j%%%%J%j%%%%%%%%%%%%%%%%%%%%%%J%j%%%%%%%Jj%%%%J%j%%%%%J%%%%j%
$$ 71 71 71 71 71 71 71 71 72 72 71 71 71 71 71 72 72 71 71 71 71 71 71 71 71 71 71 71 71 71 71 71 71 71 71 71 71 71 71 71 72 72 71 71 71 71 71 71 71 71 72 71 71 71 71 71 72 72 71 71 71 71 71 71 72 72 72 72 72 71 71
4020G1%%%J%%j%%%%%%%j%%%J%%j%%%%%J%%%J%%%%jJ%%%j%J%%%%%%%%j%%%%J%%%j%%%%%%%%
$$ 71 71 71 71 72 72 72 71 71 71 71 71 71 71 71 70 70 70 70 71 71 71 70 70 70 70 70 70 71 71 71 71 72 72 72 72 72 71 72 72 72 72 71 71 72 72 72 72 72 72 72 72 72 71 71 71 71 71 72 72 72 72 71 71 71 71 71 71 71 71 71
4012G1j%%%%%%%%%%%J%%%j%%%%%%%%%%%%%J%%J%j%%%%%%%%%%%jJ%%%jJj%%%%%%%%j%%J%%%
$$ 71 70 70 70 70 70 70 70 70 70 70 70 70 71 71 71 71 70 70 70 70 70 70 70 70 70 70 70 70 70 70 71 71 71 72 72 71 71 71 71 71 71 71 71 71 71 71 71 70 71 71 71 71 70 71 70 70 70 70 70 70 70 70 70 69 69 69 70 70 70 70
4005G0%%J%%%%%%%%%j%%%%Jj%%J%%%%%%%%%%%%%%%%%%%%J%%%%%%%j%%%%%%%%%J%jJ%%j%%%
$$ 70 70 70 71 71 71 71 71 71 71 71 71 71 70 70 70 70 70 71 70 70 70 71 71 71 71 71 71 71 71 71 71 71 71 71 71 71 71 71 71 71 71 71 72 72 72 72 72 72 72 72 71 71 71 71 71 71 71 71 71 71 72 72 71 72 72 72 71 71 71 71
3998G1%%%%J%%j%%%J%J%%%%%%%%jJj%%%%%J%%j%%%%%%%%%%%%%%%%%%%J%%%%%%j%%%J%%%%%
$$ 71 71 71 71 71 72 72 72 71 71 71 71 72 72 73 73 73 73 73 73 73 73 73 72 73 72 72 72 72 72 72 73 73 73 72 72 72 72 72 72 72 72 72 72 72 72 72 72 72 72 72 72 72 72 73 73 73 73 73 73 73 72 72 72 72 73 73 73 73 73 73
3990G3J%%%%j%%J%%J%%%%J%%%J%J%J%JJ%JJ%JJJJJJ%JJ%j%%%jjjjjjj%j%j%j%jj%%%%%%j%
$$ 73 74 74 74 74 74 73 73 73 74 74 74 75 75 75 75 75 76 76 76 76 77 77 78 78 79 79 80 81 81 82 83 83 84 85 86 87 88 89 89 90 91 91 90 90 90 90 89 88 87 86 85 84 83 83 82 82 81 81 80 80 79 78 78 78 78 78 78 78 77 77
3983G7%%J%%%j%%J%J%JJJ%JJJJ%JJJ%J%%j%%j%%jjjjjjjjjjj%%%j%%jj%j%%%j%%%%Jj%%%j
$$ 77 77 77 78 78 78 78 77 77 77 78 78 79 79 80 81 82 82 83 84 85 86 86 87 88 89 89 90 90 90 89 89 89 88 88 88 87 86 85 84 83 82 81 80 79 78 77 77 77 77 76 76 76 75 74 74 73 73 73 73 72 72 72 72 72 73 72 72 72 72 71
3975G1%%J%%%%%%%J%%j%%%%%%%%%%%%%%j%%%%%%%%%%%%%%%%j%%%%%%%J%%%J%J%%%j%%%%%%
$$ 71 71 71 72 72 72 72 72 72 72 72 73 73 73 72 72 72 72 72 72 72 72 72 72 72 72 72 72 72 71 71 71 71 71 71 71 71 71 71 71 71 71 71 71 71 71 70 70 70 70 70 70 70 70 71 71 71 71 72 72 73 73 73 73 72 72 72 72 72 72 72
3968G2J%j%%%%%%%J%%%%%J%%%%j%%J%%%%%%%%%%%%%%%J%%%%%%J%J%J%J%JJJJJKKLLMNOOOP
$$ 72 73 73 72 72 72 72 72 72 72 72 73 73 73 73 73 73 74 74 74 74 74 73 73 73 74 74 74 74 74 74 74 74 74 74 74 74 74 74 74 74 75 75 75 75 75 75 75 76 76 77 77 78 78 79 79 80 81 82 83 84 86 88 91 94 98 103 109 115 121 128
3961A28PPNNMJ%jlmnopoonnmmllkkjk%%%%J%%J%JLLLMNNNPOOOOMLJjkmnopopoonnmllkkkj
$$ 128 135 142 147 152 156 157 157 156 153 149 144 138 131 125 119 114 109 105 101 98 95 93 91 90 88 88 88 88 88 89 89 89 90 90 91 94 97 100 104 109 114 119 126 132 138 144 150 154 157 158 157 155 151 146 140 133 127 120 114 108 103 98 94 91 88 86 84 82 81
3953H1jjjjj%%%j%%j%%j%%%%%%%%%j%%%Jj%%%J%%%%%%%%Jj%%%%%%J%%%%%%j%%%j%%%%J%%%
$$ 81 80 79 78 77 76 76 76 76 75 75 75 74 74 74 73 73 73 73 73 73 73 73 73 73 72 72 72 72 73 72 72 72 72 73 73 73 73 73 73 73 73 73 74 73 73 73 73 73 73 73 74 74 74 74 74 74 74 73 73 73 73 72 72 72 72 72 73 73 73 73
3946G3%%%%%%%%%%%%%%%%%J%%%%%%%%%%%%%%%%%%%J%%%%%%%%%j%%%%%%%%%%j%%%j%%%%%j%
$$ 73 73 73 73 73 73 73 73 73 73 73 73 73 73 73 73 73 73 74 74 74 74 74 74 74 74 74 74 74 74 74 74 74 74 74 74 74 74 75 75 75 75 75 75 75 75 75 75 74 74 74 74 74 74 74 74 74 74 74 73 73 73 73 72 72 72 72 72 72 71 71
3938G1%%jjkkkkllllkljk%%JJKLLLLLLKKKJJJJ%J%%%j%%%%j%jjjkkklklkllkj%%JKLLLLLL
$$ 71 71 71 70 69 67 65 63 61 58 55 52 49 47 44 43 41 41 41 42 43 45 48 51 54 57 60 63 65 67 69 70 71 72 73 73 74 74 74 74 73 73 73 73 73 72 72 71 70 69 67 65 63 60 58 55 53 50 47 45 44 44 44 45 47 50 53 56 59 62 65
3931F5LKLJKJJJ%J%%J%%%%J%%%%%%%%%%%%%%%%%J%J%%%%%%%%J%%%J%%%%%%j%%%j%jj%%%j%
$$ 65 68 70 73 74 76 77 78 79 79 80 80 80 81 81 81 81 81 82 82 82 82 82 82 82 82 82 82 82 82 82 82 82 82 82 82 83 83 84 84 84 84 84 84 84 84 84 85 85 85 85 86 86 86 86 86 86 86 85 85 85 85 84 84 83 82 82 82 82 81 81
3924H1%%%%%%J%J%%%%%%J%%%%%%%%J%j%%%%j%j%j%j%j%%%j%J%%J%J%%%%%%%%%%%%%%%%j%%
$$ 81 81 81 81 81 81 81 82 82 83 83 83 83 83 83 83 84 84 84 84 84 84 84 84 84 85 85 84 84 84 84 84 83 83 82 82 81 81 80 80 79 79 79 79 78 78 79 79 79 80 80 81 81 81 81 81 81 81 81 81 81 81 81 81 81 81 81 81 80 80 80
3916H0%%J%%J%J%J%%%J%%%%J%%%%%%j%%%J%%%J%%%J%%J%j%%%%%%%j%J%%%%%J%J%%%%%%j%j
$$ 80 80 80 81 81 81 82 82 83 83 84 84 84 84 85 85 85 85 85 86 86 86 86 86 86 86 85 85 85 85 86 86 86 86 87 87 87 87 88 88 88 89 89 88 88 88 88 88 88 88 88 87 87 88 88 88 88 88 88 89 89 90 90 90 90 90 90 90 89 89 88
3909H8j%j%%j%j%j%%j%J%J%JJJJJJJKJKKJJKJJK%J%%j%jjkj%jjjjj%j%J%JJKKKLKLKKJJJ%
$$ 88 87 87 86 86 86 85 85 84 84 83 83 83 82 82 83 83 84 84 85 86 87 88 89 90 91 93 94 96 98 99 100 102 103 104 106 106 107 107 107 106 106 105 104 102 101 101 100 99 98 97 96 96 95 95 96 96 97 98 100 102 104 107 109 112 114 116 117 118 119 119
3901A19jkllllmlllkkj%jJJJJJKLKKKKKLKLLMLMMMLKKK%jjkllnmnnmlkk%%JLLMNNNOOOONO
$$ 119 118 116 113 110 107 104 100 97 94 91 89 87 86 86 85 86 87 88 89 90 92 95 97 99 101 103 105 108 110 113 116 120 123 127 131 135 138 140 142 144 144 143 142 140 137 134 129 125 120 115 111 108 106 104 104 104 105 108 111 115 120 125 130 136 142 148 154 159 165
3894A65POPOPQPPPPQRQQRRRJ0J0J0J1J2J2J4J4J6J8K0K2K5L0L3L9M4M9N6O2O8P3P8Q3Q9R4
$$ 165 172 178 185 191 198 206 213 220 227 234 242 251 259 267 276 285 294 304 314 324 335 347 359 373 387 403 421 441 463 488 518 551 590 634 683 739 801 869 942 1020 1103 1192 1286
3889A286J01J13J30J53J87K33K95L74M74N92P26Q70J013J145J247J306J310J246J117R22O72
$$ 1286 1387 1500 1630 1783 1970 2203 2498 2872 3346 3938 4664 5534 6547 7692 8939 10245 11555 12801 13918 14840 15512
3887A5512L85P6k32n19p69r67j108j185j204j171j094r88q63p31o01m81l73k81k05j43r5n8
$$ 15512 15897 15973 15741 15222 14453 13486 12378 11193 9989 8818 7724 6736 5873 5142 4541 4060 3687 3406 3201 3058 2963 2905
3885B905k6kK3M9Q0J20J71K40L25M31N55O92Q38R81J107J201J249J238J161J016Q08N48K53
$$ 2905 2879 2877 2900 2949 3029 3149 3320 3560 3885 4316 4871 5563 6401 7382 8489 9690 10939 12177 13338 14354 15162 15710 15963
3882A5963n7l64o45q87j075j201j265j270j225j138j025q95p64o36n19m16l31k62k08j66j35
$$ 15963 15906 15542 14897 14010 12935 11734 10469 9199 7974 6836 5811 4916 4152 3516 2997 2581 2250 1988 1780 1614 1479
3880A479j14r7q8q1p6p4p0o7o4o0n5n2m6m2l7l3l0k5k2k0j7j6j3j2j0rqpoonnlmlllkkkkj
$$ 1479 1365 1268 1180 1099 1023 949 879 812 748 688 633 581 535 493 456 423 393 368 346 326 309 293 280 268 258 249 241 234 228 222 217 212 209 205 202 199 196 194 192 190 188 187
3876A87jj%%%JJ%JJ%%%jkllmmoopopopnnmmkj%JJKJKJKJJJJJJJJJJ%JJ%%%jjkllmmmmlmmm
$$ 187 186 185 185 185 185 186 187 187 188 189 189 189 189 188 186 183 180 176 172 166 160 153 147 140 134 127 122 117 113 109 107 106 106 107 108 110 111 113 114 116 117 118 119 120 121 122 123 124 125 126 126 127 128 128 128 128 127 126 124 121 118 114 110 106 102 99 95 91 87
3868H7lkk%jJJJJKKJKJJ%%%jjjjjkjkjkjkjkj%%%%%%%JJJJJJ%KJJ%JJ%%J%%j%%j%jj%jjkj
$$ 87 84 82 80 80 79 80 81 82 83 85 87 88 90 91 92 92 92 92 91 90 89 88 87 85 84 82 81 79 78 76 75 73 72 72 72 72 72 72 72 72 73 74 75 76 77 78 78 80 81 82 82 83 84 84 84 85 85 85 84 84 84 83 83 82 81 81 80 79 77 76
3861G6%jjj%jj%%%%%%%%J%J%%%j%j%%j%%j%j%%%%%%%%%%%%%%%j%%%J%%j%J%JJ%JJ%J%J%%%
$$ 76 76 75 74 73 73 72 71 71 71 71 71 71 71 71 71 72 72 73 73 73 73 72 72 71 71 71 70 70 70 69 69 68 68 68 68 68 68 68 68 68 68 68 68 68 68 68 68 67 67 67 67 68 68 68 67 67 68 68 69 70 70 71 72 72 73 73 74 74 74 74
3854G4%%j%%%%%j%%%j%%J%%%J%%%%%%J%%%%%jj%%%jjjjj%%%%jJ%%%%%%%J%%%%%%%%%J%%J%
$$ 74 74 74 73 73 73 73 73 73 72 72 72 72 71 71 71 72 72 72 72 73 73 73 73 73 73 73 74 74 74 74 74 74 73 72 72 72 72 71 70 69 68 67 67 67 67 67 66 67 67 67 67 67 67 67 67 68 68 68 68 68 68 68 68 68 68 69 69 69 70 70
3846G0%%%%%j%jjj%%j%j%%j%%%%JJ%%%%J%%JJ%%%%%%%j%j%%Jj%%%%%%j%%%%%%J%%JJJ%KJK
$$ 70 70 70 70 70 70 69 69 68 67 66 66 66 65 65 64 64 64 63 63 63 63 63 64 65 65 65 65 65 66 66 66 67 68 68 68 68 68 68 68 68 67 67 66 66 66 67 66 66 66 66 66 66 66 65 65 65 65 65 65 65 66 66 66 67 68 69 69 71 72 74
3839G4LKMLLMLLKKJJjkkkllllllkkjkjj%%j%%%%%%%%JJ%KKLLKLLLLKKJJ%jkllklllklkkj%
$$ 74 77 79 83 86 89 93 96 99 101 103 104 105 104 102 100 98 95 92 89 86 83 80 78 76 75 73 72 71 71 71 70 70 70 70 70 70 70 70 70 71 72 72 74 76 79 82 84 87 90 93 96 98 100 101 102 102 101 99 96 93 91 88 85 82 80 77 75 73 72 72
3831G2jj%j%%j%%J%%%%%%j%%%%%%%%j%%%%j%%%jJ%%j%%%%%%J%%%j%%%%%%%J%%%%j%%%%%%%
$$ 72 71 70 70 69 69 69 68 68 68 69 69 69 69 69 69 69 68 68 68 68 68 68 68 68 68 67 67 67 67 67 66 66 66 66 65 66 66 66 65 65 65 65 65 65 65 66 66 66 66 65 65 65 65 65 65 65 65 66 66 66 66 66 65 65 65 65 65 65 65 65
3824F5%%%%Jj%J%%%%%%%%%%%%%%%%%%%%%j%%%%%%J%%%%%%%%%%%%%%%J%jJ%JjJ%%%%%%j%%J
$$ 65 65 65 65 65 66 65 65 66 66 66 66 66 66 66 66 66 66 66 66 66 66 66 66 66 66 66 66 66 66 65 65 65 65 65 65 65 66 66 66 66 66 66 66 66 66 66 66 66 66 66 66 66 67 67 66 67 67 68 67 68 68 68 68 68 68 68 67 67 67 68
3817F8%%%%%%%%%%%%%J%%J%%J%J%J%JJJ%KJJKLLMMOOOPOPPNMK%jkmnoopoonmmllkkjj%%%%
$$ 68 68 68 68 68 68 68 68 68 68 68 68 68 68 69 69 69 70 70 70 71 71 72 72 73 73 74 75 76 76 78 79 80 82 85 88 92 96 102 108 114 121 127 134 141 146 150 152 152 151 149 145 140 134 128 121 115 109 104 100 96 93 90 88 86 85 84 84 84 84 84
3809H4jJ%JJJJLLLNNNPOOOOMLJ%klnnpopoonnmllkkkjjjjj%%%jjj%%%j%%j%%j%%%%j%%%%j
$$ 84 83 84 84 85 86 87 88 91 94 97 102 107 112 119 125 131 137 143 147 150 151 151 149 146 141 136 129 123 116 110 104 99 94 90 87 84 82 80 78 77 76 75 74 73 73 73 73 72 71 70 70 70 70 69 69 69 68 68 68 67 67 67 67 67 66 66 66 66 66 65
3802F5%%%J%%%%%%j%%%%%%%%%J%%%%%%%%%%%J%jJ%%%%%%%%%%jj%J%%j%%%%%%%j%J%%%%%%%
$$ 65 65 65 65 66 66 66 66 66 66 66 65 65 65 65 65 65 65 65 65 65 66 66 66 66 66 66 66 66 66 66 66 66 67 67 66 67 67 67 67 67 67 67 67 67 67 67 66 65 65 66 66 66 65 65 65 65 65 65 65 65 64 64 65 65 65 65 65 65 65 65
3794F5%JjJ%%%%%%%%%%%%%%%Jj%%%%%%%J%%%%%%%%%%jJ%%%%%%%%j%%%%%%%%%%%%%%%%J%%%
$$ 65 65 66 65 66 66 66 66 66 66 66 66 66 66 66 66 66 66 66 66 67 66 66 66 66 66 66 66 66 67 67 67 67 67 67 67 67 67 67 67 66 67 67 67 67 67 67 67 67 67 66 66 66 66 66 66 66 66 66 66 66 66 66 66 66 66 66 67 67 67 67
3787F7%%%%%%%J%%%j%%J%%%%%%%%J%%%j%J%%%%%j%%%%J%j%%%%%%%%%%%%%j%%%%%J%%%%%%%
$$ 67 67 67 67 67 67 67 67 68 68 68 68 67 67 67 68 68 68 68 68 68 68 68 68 69 69 69 69 68 68 69 69 69 69 69 69 68 68 68 68 68 69 69 68 68 68 68 68 68 68 68 68 68 68 68 68 68 67 67 67 67 67 67 68 68 68 68 68 68 68 68
3779F8%%jJ%%J%%%j%%j%J%%%J%%%%%%j%%%%%%%%%%%%%%%%%%%%%%%%%j%%%%J%%%%%j%%%%%%
$$ 68 68 68 67 68 68 68 69 69 69 69 68 68 68 67 67 68 68 68 68 69 69 69 69 69 69 69 68 68 68 68 68 68 68 68 68 68 68 68 68 68 68 68 68 68 68 68 68 68 68 68 68 68 67 67 67 67 67 68 68 68 68 68 68 67 67 67 67 67 67 67
3772F7J%%%%%%%%%%%%%%%j%J%%%%%%%%%%%%%%%%%%J%%%%%j%%%%j%J%%%%%%%%%j%%J%%%%%%
$$ 67 68 68 68 68 68 68 68 68 68 68 68 68 68 68 68 68 67 67 68 68 68 68 68 68 68 68 68 68 68 68 68 68 68 68 68 68 68 69 69 69 69 69 69 68 68 68 68 68 67 67 68 68 68 68 68 68 68 68 68 68 67 67 67 68 68 68 68 68 68 68
3765F8%%J%%j%Jj%%%%%J%%%J%%%%%j%%%%%%%%%j%J%%%%%j%%%%%%%%%J%j%%Jj%%J%%%%%J%%
$$ 68 68 68 69 69 69 68 68 69 68 68 68 68 68 68 69 69 69 69 70 70 70 70 70 70 69 69 69 69 69 69 69 69 69 69 68 68 69 69 69 69 69 69 68 68 68 68 68 68 68 68 68 68 69 69 68 68 68 69 68 68 68 69 69 69 69 69 69 70 70 70
3757G0%%j%j%%%J%%%%%%%%j%%%%%%%%%%%%%%%J%%%j%%%%%%%J%j%%%%%%%%%%%j%%%%J%%%%%
$$ 70 70 70 69 69 68 68 68 68 69 69 69 69 69 69 69 69 69 68 68 68 68 68 68 68 68 68 68 68 68 68 68 68 68 69 69 69 69 68 68 68 68 68 68 68 68 69 69 68 68 68 68 68 68 68 68 68 68 68 68 67 67 67 67 67 68 68 68 68 68 68
3750F8%%%%j%%%%%%%%%J%%%%%%j%%%j%J%%Jj%%%%%Jj%%%%%%%%%%%%%%%%%%%%%%%%%%J%%%j
$$ 68 68 68 68 68 67 67 67 67 67 67 67 67 67 67 68 68 68 68 68 68 68 67 67 67 67 66 66 67 67 67 68 67 67 67 67 67 67 68 67 67 67 67 67 67 67 67 67 67 67 67 67 67 67 67 67 67 67 67 67 67 67 67 67 67 67 68 68 68 68 67
3742F7%%%%%%Jj%%%%%%%%%%%%%%%J%%J%j%%%%%%%%%%%%%%%%%%%%%%%%%%%%%%%%%%J%%J%%j
$$ 67 67 67 67 67 67 67 68 67 67 67 67 67 67 67 67 67 67 67 67 67 67 67 67 68 68 68 69 69 68 68 68 68 68 68 68 68 68 68 68 68 68 68 68 68 68 68 68 68 68 68 68 68 68 68 68 68 68 68 68 68 68 68 68 69 69 69 70 70 70 69
3735F9%%%%%%%%%%%%%%%%%%%%%j%%%%%%%%%%%%%J%j%%%J%j%%%%%J%%%%%%%%%%%%%%%J%%%%
$$ 69 69 69 69 69 69 69 69 69 69 69 69 69 69 69 69 69 69 69 69 69 69 68 68 68 68 68 68 68 68 68 68 68 68 68 68 69 69 68 68 68 68 69 69 68 68 68 68 68 68 69 69 69 69 69 69 69 69 69 69 69 69 69 69 69 69 70 70 70 70 70
3727G0%%%j%%%%%%%%%j%%J%%%%%%%%%%%%%Jj%%%%%%%%%%%J%%%j%%Jj%%%%%j%J%%%%%%%%%%
$$ 70 70 70 70 69 69 69 69 69 69 69 69 69 69 68 68 68 69 69 69 69 69 69 69 69 69 69 69 69 69 69 70 69 69 69 69 69 69 69 69 69 69 69 69 70 70 70 70 69 69 69 70 69 69 69 69 69 69 68 68 69 69 69 69 69 69 69 69 69 69 69
3720F9j%J%%%%%%%%%%%%%%%%%%%j%J%%%Jj%%J%%j%%%%%%%j%J%%%%%%%%%%%%%%jJ%%%%%%%%
$$ 69 68 68 69 69 69 69 69 69 69 69 69 69 69 69 69 69 69 69 69 69 69 69 68 68 69 69 69 69 70 69 69 69 70 70 70 69 69 69 69 69 69 69 69 68 68 69 69 69 69 69 69 69 69 69 69 69 69 69 69 69 68 69 69 69 69 69 69 69 69 69
3713F9%%%%%%%%%%%%%%Jj%%%%J%%j%%%%%%J%%%%%j%%%j%%J%J%%%%%J%J%JJKLLMMLKjklmll
$$ 69 69 69 69 69 69 69 69 69 69 69 69 69 69 69 70 69 69 69 69 69 70 70 70 69 69 69 69 69 69 69 70 70 70 70 70 70 69 69 69 69 68 68 68 69 69 70 70 70 70 70 70 71 71 72 72 73 74 76 79 82 86 90 93 95 94 92 89 85 82 79
3705G9klkj%j%%%%j%%%%%%%%%%%%%%%%%%%%%%%jJ%%%j%%%%%%%J%%%j%Jj%J%%%%j%%%%%%Jj
$$ 79 77 74 72 71 71 70 70 70 70 70 69 69 69 69 69 69 69 69 69 69 69 69 69 69 69 69 69 69 69 69 69 69 69 69 68 69 69 69 69 68 68 68 68 68 68 68 68 69 69 69 69 68 68 69 68 68 69 69 69 69 69 68 68 68 68 68 68 68 69 68
3698F8%J%%%%%%jJ%%%j%%%J%j%%%%%%%%%%j%J%%%%j%%%J%%%%%%j%J%%%%j%%%%%J%%j%%%%%
$$ 68 68 69 69 69 69 69 69 69 68 69 69 69 69 68 68 68 68 69 69 68 68 68 68 68 68 68 68 68 68 68 67 67 68 68 68 68 68 67 67 67 67 68 68 68 68 68 68 68 67 67 68 68 68 68 68 67 67 67 67 67 67 68 68 68 67 67 67 67 67 67
3690F7%%%j%J%%%%%%%J%%%%%%%%%j%%%%%%%%J%%%j%%%%j%J%%j%%%%J%%%%%%Jj%j%%%%%%%%
$$ 67 67 67 67 66 66 67 67 67 67 67 67 67 67 68 68 68 68 68 68 68 68 68 68 67 67 67 67 67 67 67 67 67 68 68 68 68 67 67 67 67 67 66 66 67 67 67 66 66 66 66 66 67 67 67 67 67 67 67 68 67 67 66 66 66 66 66 66 66 66 66
3683F6%%Jj%%%%%Jj%J%%%%%%%%%%%%%%%%j%%%J%%jJ%J%j%%%%%%%%%%%%%%%J%jJ%%j%%%J%%
$$ 66 66 66 67 66 66 66 66 66 66 67 66 66 67 67 67 67 67 67 67 67 67 67 67 67 67 67 67 67 67 66 66 66 66 67 67 67 66 67 67 68 68 67 67 67 67 67 67 67 67 67 67 67 67 67 67 67 67 68 68 67 68 68 68 67 67 67 67 68 68 68
3676F8%%%%%j%%J%%%%%%%%%%%%%j%J%%%%%%%%%%%jJ%%%%%%j%%%%%J%%%j%%%%J%%%jJ%%%%J
$$ 68 68 68 68 68 68 67 67 67 68 68 68 68 68 68 68 68 68 68 68 68 68 68 67 67 68 68 68 68 68 68 68 68 68 68 68 68 67 68 68 68 68 68 68 68 67 67 67 67 67 67 68 68 68 68 67 67 67 67 67 68 68 68 68 67 68 68 68 68 68 69
3668F9%%%%%%j%J%J%j%j%J%%%j%%%%%%%%J%%%%j%%%%%%%J%%j%J%%%%%%%%%%Jj%%%%J%j%%%
$$ 69 69 69 69 69 69 69 68 68 69 69 70 70 69 69 68 68 69 69 69 69 68 68 68 68 68 68 68 68 68 69 69 69 69 69 68 68 68 68 68 68 68 68 69 69 69 68 68 69 69 69 69 69 69 69 69 69 69 69 70 69 69 69 69 69 70 70 69 69 69 69
3661F9j%%J%%%%j%%%%%%%%%%%%%%J%j%J%%%j%%%%%%%%%%%%J%%%%%%%j%%%%%%%%jJ%J%%j%%
$$ 69 68 68 68 69 69 69 69 69 68 68 68 68 68 68 68 68 68 68 68 68 68 68 68 69 69 68 68 69 69 69 69 68 68 68 68 68 68 68 68 68 68 68 68 68 69 69 69 69 69 69 69 69 68 68 68 68 68 68 68 68 68 67 68 68 69 69 69 68 68 68
3653F8%%%%%%%%%%%%%%%%J%%%j%%%%%%%j%Jj%%jJ%%%%%%%%%J%%j%%%%%%%%%J%%%%%%%%%%%
$$ 68 68 68 68 68 68 68 68 68 68 68 68 68 68 68 68 68 69 69 69 69 68 68 68 68 68 68 68 68 67 67 68 67 67 67 66 67 67 67 67 67 67 67 67 67 67 68 68 68 67 67 67 67 67 67 67 67 67 67 68 68 68 68 68 68 68 68 68 68 68 68
3646F8%J%j%%%%Jj%%%%%%%%%%%%%%J%%j%%%%%%%%%%%%%%%JjJ%j%%%%%%%%%%%%%%J%%j%%%%
$$ 68 68 69 69 68 68 68 68 68 69 68 68 68 68 68 68 68 68 68 68 68 68 68 68 68 69 69 69 68 68 68 68 68 68 68 68 68 68 68 68 68 68 68 68 69 68 69 69 68 68 68 68 68 68 68 68 68 68 68 68 68 68 68 69 69 69 68 68 68 68 68
3638F8%%J%%%%%%j%%%%j%J%%%%%%%%%%%%%jJ%%%%%%%%%%%%%%%%%j%%%%%J%%%%%j%%J%%%%j
$$ 68 68 68 69 69 69 69 69 69 69 68 68 68 68 68 67 67 68 68 68 68 68 68 68 68 68 68 68 68 68 68 67 68 68 68 68 68 68 68 68 68 68 68 68 68 68 68 68 68 68 67 67 67 67 67 67 68 68 68 68 68 68 67 67 67 68 68 68 68 68 67
3631F7%%J%%%%%%%j%%%%J%%%%%%%%%%%%%%%%%%%%%%%%%%%%%%%%%%%jJj%%%%J%%%jJ%%%%%%
$$ 67 67 67 68 68 68 68 68 68 68 68 67 67 67 67 67 68 68 68 68 68 68 68 68 68 68 68 68 68 68 68 68 68 68 68 68 68 68 68 68 68 68 68 68 68 68 68 68 68 68 68 68 67 68 67 67 67 67 67 68 68 68 68 67 68 68 68 68 68 68 68
3624F8j%%%%%J%%%%%%%%%%%%%%%%%%%%%%%%%%%jJ%%%%jJ%%%%%%%j%J%%%%%%%%%%%%%j%%%J
$$ 68 67 67 67 67 67 67 68 68 68 68 68 68 68 68 68 68 68 68 68 68 68 68 68 68 68 68 68 68 68 68 68 68 68 68 67 68 68 68 68 68 67 68 68 68 68 68 68 68 68 67 67 68 68 68 68 68 68 68 68 68 68 68 68 68 68 67 67 67 67 68
3616F8%%%%%%%%%%%%%%%%%%%%%%%%%%%%%%%%%Jj%%%%%%%%%%%%%%%j%%%%%%%%%%%%%%%%%%%
$$ 68 68 68 68 68 68 68 68 68 68 68 68 68 68 68 68 68 68 68 68 68 68 68 68 68 68 68 68 68 68 68 68 68 68 69 68 68 68 68 68 68 68 68 68 68 68 68 68 68 68 68 67 67 67 67 67 67 67 67 67 67 67 67 67 67 67 67 67 67 67 67
3609F7%%%%%Jj%%%J%%%%%%%%%j%%%%%%J%j%%%%%%%J%%%%%%%%%%%%%%J%%%%j%%%%%%%%%%%%
$$ 67 67 67 67 67 67 68 67 67 67 67 68 68 68 68 68 68 68 68 68 68 67 67 67 67 67 67 67 68 68 67 67 67 67 67 67 67 67 68 68 68 68 68 68 68 68 68 68 68 68 68 68 68 69 69 69 69 69 68 68 68 68 68 68 68 68 68 68 68 68 68
3601F8%%%%%%%%J%j%%%%%%J%j%%%Jj%J%%%%%%jJ%%%%%%%j%%%%%%%%%%%%%%%J%%%%%%%%%%j
$$ 68 68 68 68 68 68 68 68 68 69 69 68 68 68 68 68 68 68 69 69 68 68 68 68 69 68 68 69 69 69 69 69 69 69 68 69 69 69 69 69 69 69 69 68 68 68 68 68 68 68 68 68 68 68 68 68 68 68 68 69 69 69 69 69 69 69 69 69 69 69 68
3594F8%%J%j%%%%%%%%%%%%j%%%%%%J%%%%jJ%%%J%%%j%J%%j%%%%%j%%%%Jj%%%%%J%%%%%j%J
$$ 68 68 68 69 69 68 68 68 68 68 68 68 68 68 68 68 68 68 67 67 67 67 67 67 67 68 68 68 68 68 67 68 68 68 68 69 69 69 69 68 68 69 69 69 68 68 68 68 68 68 67 67 67 67 67 68 67 67 67 67 67 67 68 68 68 68 68 68 67 67 68
3587F8%J%j%%%%%%%%%jJ%%J%%%j%%J%j%%%%%J%%%%j%%%%%%%%J%j%%%%%%%j%J%J%%j%J%%%%
$$ 68 68 69 69 68 68 68 68 68 68 68 68 68 68 67 68 68 68 69 69 69 69 68 68 68 69 69 68 68 68 68 68 68 69 69 69 69 69 68 68 68 68 68 68 68 68 68 69 69 68 68 68 68 68 68 68 68 67 67 68 68 69 69 69 68 68 69 69 69 69 69
3579F9%j%J%%j%%%%J%j%%%%%%%%%%%%%%j%%J%%%%%%%%%%J%%j%%%%%%%%%%%%%%%%%%%%%%%%
$$ 69 69 68 68 69 69 69 68 68 68 68 68 69 69 68 68 68 68 68 68 68 68 68 68 68 68 68 68 68 67 67 67 68 68 68 68 68 68 68 68 68 68 68 69 69 69 68 68 68 68 68 68 68 68 68 68 68 68 68 68 68 68 68 68 68 68 68 68 68 68 68
3572F8%%j%%J%%%%%%%%%%jJ%jJ%%%%%jJ%%%%%J%%j%%%%%%%%%%%J%j%%%%%%%%%J%%%%j%%%%
$$ 68 68 68 67 67 67 68 68 68 68 68 68 68 68 68 68 68 67 68 68 67 68 68 68 68 68 68 67 68 68 68 68 68 68 69 69 69 68 68 68 68 68 68 68 68 68 68 68 68 69 69 68 68 68 68 68 68 68 68 68 68 69 69 69 69 69 68 68 68 68 68
3564F8%%%%%%%%%%%%%%%%J%%j%%%J%j%%J%%%%%j%%%J%%%%%%%j%%%%%%%%%%Jj%%%J%%%%%%%
$$ 68 68 68 68 68 68 68 68 68 68 68 68 68 68 68 68 68 69 69 69 68 68 68 68 69 69 68 68 68 69 69 69 69 69 69 68 68 68 68 69 69 69 69 69 69 69 69 68 68 68 68 68 68 68 68 68 68 68 69 68 68 68 68 69 69 69 69 69 69 69 69
3557F9%%%%%%%%%%%%%%%J%%J%%J%%j%%%%%%%j%j%%%%%%%j%%%%%J%%%%j%%J%%%%%%%%%%%j%
$$ 69 69 69 69 69 69 69 69 69 69 69 69 69 69 69 69 70 70 70 71 71 71 72 72 72 71 71 71 71 71 71 71 71 70 70 69 69 69 69 69 69 69 69 68 68 68 68 68 68 69 69 69 69 69 68 68 68 69 69 69 69 69 69 69 69 69 69 69 69 68 68
3549F8%%%%%J%%%j%%%%%%%%J%j%%%%%%%%%%%%%%%%%%%%%%%J%%%j%J%%%%%%%%%%%%%%J%j%%
$$ 68 68 68 68 68 68 69 69 69 69 68 68 68 68 68 68 68 68 68 69 69 68 68 68 68 68 68 68 68 68 68 68 68 68 68 68 68 68 68 68 68 68 68 68 68 69 69 69 69 68 68 69 69 69 69 69 69 69 69 69 69 69 69 69 69 69 70 70 69 69 69
3542F9jJ%%%%%%%%%j%%%%%%%%%%%%%%%%%%%%%%%%%%%%%%%%%%%%%%%%%%%J%j%jJ%%%j%%J%%
$$ 69 68 69 69 69 69 69 69 69 69 69 69 68 68 68 68 68 68 68 68 68 68 68 68 68 68 68 68 68 68 68 68 68 68 68 68 68 68 68 68 68 68 68 68 68 68 68 68 68 68 68 68 68 68 68 68 69 69 68 68 67 68 68 68 68 67 67 67 68 68 68
3535F8%%%jJ%%%%%%%%%%%%%%%%%%%J%%%j%%%%%%%%%%%%%%%%%%%%J%j%%%J%%%%%%%%%%%%%%
$$ 68 68 68 68 67 68 68 68 68 68 68 68 68 68 68 68 68 68 68 68 68 68 68 68 68 69 69 69 69 68 68 68 68 68 68 68 68 68 68 68 68 68 68 68 68 68 68 68 68 68 69 69 68 68 68 68 69 69 69 69 69 69 69 69 69 69 69 69 69 69 69
3527F9%j%J%%%%%%%%%%J%j%%%%j%%%j%JJ%%%%%%%J%j%%%%%%J%%j%%%%%%%%%%%%%%%%%j%%%
$$ 69 69 68 68 69 69 69 69 69 69 69 69 69 69 69 70 70 69 69 69 69 69 68 68 68 68 67 67 68 69 69 69 69 69 69 69 69 70 70 69 69 69 69 69 69 69 70 70 70 69 69 69 69 69 69 69 69 69 69 69 69 69 69 69 69 69 69 68 68 68 68
3520F8%J%%%%%%j%%%%%JjJ%%%%%%%%%%jJ%%%j%%%%Jj%J%%%Jj%j%%%%J%%j%%%%%%%%%%%%%%
$$ 68 68 69 69 69 69 69 69 69 68 68 68 68 68 68 69 68 69 69 69 69 69 69 69 69 69 69 69 68 69 69 69 69 68 68 68 68 68 69 68 68 69 69 69 69 70 69 69 68 68 68 68 68 69 69 69 68 68 68 68 68 68 68 68 68 68 68 68 68 68 68
3512F8%%%%%%%%%%%%%%%%%J%%%%%j%%%%%J%%J%j%j%Jj%%%%j%%%J%%%%%J%%%%%%%%%%%%%%%
$$ 68 68 68 68 68 68 68 68 68 68 68 68 68 68 68 68 68 68 69 69 69 69 69 69 68 68 68 68 68 68 69 69 69 70 70 69 69 68 68 69 68 68 68 68 68 67 67 67 67 68 68 68 68 68 68 69 69 69 69 69 69 69 69 69 69 69 69 69 69 69 69
3505F9%%%%%%%%%%%j%%%%%%%%%%%%%J%%J%j%%%%%j%%%%%%%%%%%%%%%%%%%J%%%%%%%%j%%%%
$$ 69 69 69 69 69 69 69 69 69 69 69 69 68 68 68 68 68 68 68 68 68 68 68 68 68 68 69 69 69 70 70 69 69 69 69 69 69 68 68 68 68 68 68 68 68 68 68 68 68 68 68 68 68 68 68 68 68 69 69 69 69 69 69 69 69 69 68 68 68 68 68
3498F8%J%%%%%%%%%%j%J%%%%%%j%%%%%%J%%%Jj%%%%%%%%%%%%%%%j%%J%j%%%%%%J%%%%%%%%
$$ 68 68 69 69 69 69 69 69 69 69 69 69 69 68 68 69 69 69 69 69 69 69 68 68 68 68 68 68 68 69 69 69 69 70 69 69 69 69 69 69 69 69 69 69 69 69 69 69 69 69 68 68 68 69 69 68 68 68 68 68 68 68 69 69 69 69 69 69 69 69 69
3490F9%%%%%%%%%%%%%%%%%%%%%%%%%%%%%%%%%Jj%%%%%%%%%%%j%%%%J%%%%%%%%%%jJ%%%j%%
$$ 69 69 69 69 69 69 69 69 69 69 69 69 69 69 69 69 69 69 69 69 69 69 69 69 69 69 69 69 69 69 69 69 69 69 70 69 69 69 69 69 69 69 69 69 69 69 69 68 68 68 68 68 69 69 69 69 69 69 69 69 69 69 69 68 69 69 69 69 68 68 68
3483F8J%%%%%%%%%%%%%%%%%%%%%%%%%%%%%%%%%j%%%%%%%J%%%%%%%%%%%%%%%%J%%%%j%%J%j
$$ 68 69 69 69 69 69 69 69 69 69 69 69 69 69 69 69 69 69 69 69 69 69 69 69 69 69 69 69 69 69 69 69 69 69 69 68 68 68 68 68 68 68 68 69 69 69 69 69 69 69 69 69 69 69 69 69 69 69 69 69 70 70 70 70 70 69 69 69 70 70 69
3475F9J%%jJ%%j%%%%%%J%%jJ%%%%%%%%%j%%%%%%%%%%%%%JjJ%%%j%%%%jJ%%j%%%%J%%%%%%%
$$ 69 70 70 70 69 70 70 70 69 69 69 69 69 69 69 70 70 70 69 70 70 70 70 70 70 70 70 70 70 69 69 69 69 69 69 69 69 69 69 69 69 69 69 70 69 70 70 70 70 69 69 69 69 69 68 69 69 69 68 68 68 68 68 69 69 69 69 69 69 69 69
3468F9%%%%%%%%%%%%%%%%%%%J%%%%%j%%%%Jj%%%%%%%%%%%%%%%%jJ%%J%%%%j%%jJ%%%%%%j%
$$ 69 69 69 69 69 69 69 69 69 69 69 69 69 69 69 69 69 69 69 69 70 70 70 70 70 70 69 69 69 69 69 70 69 69 69 69 69 69 69 69 69 69 69 69 69 69 69 69 69 68 69 69 69 70 70 70 70 70 69 69 69 68 69 69 69 69 69 69 69 68 68
3460F8J%jJ%%%%%%%j%%%%J%%%%%%%%%%j%%%%J%%%%%%j%Jj%%%%%%%%%%%%%%%%%%%%%j%%%%J
$$ 68 69 69 68 69 69 69 69 69 69 69 69 68 68 68 68 68 69 69 69 69 69 69 69 69 69 69 69 68 68 68 68 68 69 69 69 69 69 69 69 68 68 69 68 68 68 68 68 68 68 68 68 68 68 68 68 68 68 68 68 68 68 68 68 68 67 67 67 67 67 68
3453F8%%%%%%%%%%%J%j%%%%%%%%%%%%%%%%%%%%%%%%Jj%%%%%%%%%%%jJ%%%%%%%%%%Jj%j%J%
$$ 68 68 68 68 68 68 68 68 68 68 68 68 69 69 68 68 68 68 68 68 68 68 68 68 68 68 68 68 68 68 68 68 68 68 68 68 68 68 68 69 68 68 68 68 68 68 68 68 68 68 68 68 67 68 68 68 68 68 68 68 68 68 68 68 69 68 68 67 67 68 68
3446F8J%j%%%%%%%%J%j%%%%%%%%J%j%%%%J%%%%%%%%%%%%%%%%%%%%%%%%%%%%%%%%%%%%%%%%
$$ 68 69 69 68 68 68 68 68 68 68 68 68 69 69 68 68 68 68 68 68 68 68 68 69 69 68 68 68 68 68 69 69 69 69 69 69 69 69 69 69 69 69 69 69 69 69 69 69 69 69 69 69 69 69 69 69 69 69 69 69 69 69 69 69 69 69 69 69 69 69 69
3438F9%%%%%%j%%%%%%%%%%%%%%%%J%%%%%%%%%%%%%%%jJ%%j%%%%%J%%j%%%%%%%%%%%%%%%%%
$$ 69 69 69 69 69 69 69 68 68 68 68 68 68 68 68 68 68 68 68 68 68 68 68 68 69 69 69 69 69 69 69 69 69 69 69 69 69 69 69 69 68 69 69 69 68 68 68 68 68 68 69 69 69 68 68 68 68 68 68 68 68 68 68 68 68 68 68 68 68 68 68
3431F8%%%%J%%%%%%%%%%%%%%%%%%%%j%%J%j%%%%%%J%%%%%j%%%%%%%%%%%J%%j%%J%%%%%%%%
$$ 68 68 68 68 68 69 69 69 69 69 69 69 69 69 69 69 69 69 69 69 69 69 69 69 69 69 68 68 68 69 69 68 68 68 68 68 68 68 69 69 69 69 69 69 68 68 68 68 68 68 68 68 68 68 68 68 69 69 69 68 68 68 69 69 69 69 69 69 69 69 69
3423F9%%%%%jJ%jJ%%%%%%%J%%j%%%%%j%%%J%%%%%jJ%%j%%%%%%J%%%%%%%%%%%%%%%%%%%j%%
$$ 69 69 69 69 69 69 68 69 69 68 69 69 69 69 69 69 69 69 70 70 70 69 69 69 69 69 69 68 68 68 68 69 69 69 69 69 69 68 69 69 69 68 68 68 68 68 68 68 69 69 69 69 69 69 69 69 69 69 69 69 69 69 69 69 69 69 69 69 68 68 68
3416F8J%%%%J%j%%%j%%%%%%J%%%%%%%%%%%%%%j%%%%%J%%j%%%%%%%%%%%%%%%%%%%%%%%%%%%
$$ 68 69 69 69 69 69 70 70 69 69 69 69 68 68 68 68 68 68 68 69 69 69 69 69 69 69 69 69 69 69 69 69 69 69 68 68 68 68 68 68 69 69 69 68 68 68 68 68 68 68 68 68 68 68 68 68 68 68 68 68 68 68 68 68 68 68 68 68 68 68 68
3409F8%j%J%J%%j%j%J%%%%%%%%%%%%%%%%%%%%%%%j%%J%%%%%%%jJ%j%%%J%%%Jj%jJ%%%%%%%
$$ 68 68 67 67 68 68 69 69 69 68 68 67 67 68 68 68 68 68 68 68 68 68 68 68 68 68 68 68 68 68 68 68 68 68 68 68 68 67 67 67 68 68 68 68 68 68 68 68 67 68 68 67 67 67 67 68 68 68 68 69 68 68 67 68 68 68 68 68 68 68 68
3401F8%%%%%%%%jJj%J%%%%%j%%J%%%%%%%%%%%%%%%%j%%%%%%J%%j%%%Jj%%Jj%%%%%%%%%%%J
$$ 68 68 68 68 68 68 68 68 68 67 68 67 67 68 68 68 68 68 68 67 67 67 68 68 68 68 68 68 68 68 68 68 68 68 68 68 68 68 68 67 67 67 67 67 67 67 68 68 68 67 67 67 67 68 67 67 67 68 67 67 67 67 67 67 67 67 67 67 67 67 68
3394F8%J%%j%%%%%%J%%%%j%%%%%%%%%%%%%%%%%J%%%j%%%j%%%J%%%%J%%%%%%%%%%%%%%%%j%
$$ 68 68 69 69 69 68 68 68 68 68 68 68 69 69 69 69 69 68 68 68 68 68 68 68 68 68 68 68 68 68 68 68 68 68 68 69 69 69 69 68 68 68 68 67 67 67 67 68 68 68 68 68 69 69 69 69 69 69 69 69 69 69 69 69 69 69 69 69 69 68 68
3386F8%%%%%%J%%%jJ%%j%%%%%%%J%%%j%%%%%J%%%%%jJ%%%%%%%%%%%%%%%%%%%%%%%%%j%%%%
$$ 68 68 68 68 68 68 68 69 69 69 69 68 69 69 69 68 68 68 68 68 68 68 68 69 69 69 69 68 68 68 68 68 68 69 69 69 69 69 69 68 69 69 69 69 69 69 69 69 69 69 69 69 69 69 69 69 69 69 69 69 69 69 69 69 69 69 68 68 68 68 68
3379F8%J%%%%%%%%jJ%%%%%j%%%%J%%j%%%%%%j%J%%j%%%%%J%J%%j%%%%%%%%J%%%%%%%%%%%j
$$ 68 68 69 69 69 69 69 69 69 69 69 68 69 69 69 69 69 69 68 68 68 68 68 69 69 69 68 68 68 68 68 68 68 67 67 68 68 68 67 67 67 67 67 67 68 68 69 69 69 68 68 68 68 68 68 68 68 68 69 69 69 69 69 69 69 69 69 69 69 69 68
3371F8%%%%%%%%%%%%%%%%%j%%%J%%%J%%%%%j%%%%%%%%%%%%%%%J%j%%J%%%%%%j%%%%%%%%%%
$$ 68 68 68 68 68 68 68 68 68 68 68 68 68 68 68 68 68 68 67 67 67 67 68 68 68 68 69 69 69 69 69 69 68 68 68 68 68 68 68 68 68 68 68 68 68 68 68 68 69 69 68 68 68 69 69 69 69 69 69 69 68 68 68 68 68 68 68 68 68 68 68
3364F8%%%j%%%J%%%%%%J%%%%%%%%%j%%%%%%%%%%%%%%j%%%J%%%%%Jj%%%%%%%%%%%%%%%%J%%
$$ 68 68 68 68 67 67 67 67 68 68 68 68 68 68 68 69 69 69 69 69 69 69 69 69 69 68 68 68 68 68 68 68 68 68 68 68 68 68 68 68 67 67 67 67 68 68 68 68 68 68 69 68 68 68 68 68 68 68 68 68 68 68 68 68 68 68 68 68 69 69 69
3357F9J%%j%%%%%%%%j%%%%%%%Jj%%J%%%%j%%%%%%%Jj%%%%J%%%%%%%%%%%%%%%%%%%J%%%%%j
$$ 69 70 70 70 69 69 69 69 69 69 69 69 69 68 68 68 68 68 68 68 68 69 68 68 68 69 69 69 69 69 68 68 68 68 68 68 68 68 69 68 68 68 68 68 69 69 69 69 69 69 69 69 69 69 69 69 69 69 69 69 69 69 69 69 70 70 70 70 70 70 69
3349F9%%%%%%%%%%%J%%%J%%%j%%J%%%j%j%J%%%%%%%%%%%%%%%%%J%j%%%%%%%%%%%%%%%%%%%
$$ 69 69 69 69 69 69 69 69 69 69 69 69 70 70 70 70 71 71 71 71 70 70 70 71 71 71 71 70 70 69 69 70 70 70 70 70 70 70 70 70 70 70 70 70 70 70 70 70 70 71 71 70 70 70 70 70 70 70 70 70 70 70 70 70 70 70 70 70 70 70 70
3342G0J%%%%%%jJ%%%%%%%%%%J%j%%J%%%%%%%j%%%%%%%%J%%j%%%%%%J%%%j%%%%%%%%%%%%%%
$$ 70 71 71 71 71 71 71 71 70 71 71 71 71 71 71 71 71 71 71 71 72 72 71 71 71 72 72 72 72 72 72 72 72 71 71 71 71 71 71 71 71 71 72 72 72 71 71 71 71 71 71 71 72 72 72 72 71 71 71 71 71 71 71 71 71 71 71 71 71 71 71
3334G1%%%%%%%Jj%%%%%%%J%%%%j%%%%J%%%%%%%%%j%%%%J%jJ%%j%%%%%%%%J%%j%J%j%%%J%j
$$ 71 71 71 71 71 71 71 71 72 71 71 71 71 71 71 71 71 72 72 72 72 72 71 71 71 71 71 72 72 72 72 72 72 72 72 72 72 71 71 71 71 71 72 72 71 72 72 72 71 71 71 71 71 71 71 71 71 72 72 72 71 71 72 72 71 71 71 71 72 72 71
$$ [...]
-2638E6
##END=		$$ NMR SPECTRUM
##END=		$$ LINK
