##TITLE=	RP261 char.10.fid
##JCAMP-DX=	6.0	$$ MestReNova 14.3.3-33362
##DATA TYPE=	LINK
##BLOCKS=	1    
##ORIGIN=	Mestrelab Research S.L.
##OWNER=	hrzepa
##$MNOVA/METADATA=	(DOCUMENT,BASE64)
eyJuYW1lIjoiL1VzZXJzL2hyemVwYS9MaWJyYXJ5L01vYmlsZSBEb2N1bWVudHMvY29tfmFwcGxlfkN
sb3VkRG9jcy9TaGVwcGFyZC9OTVIgZmlsZXMgemlwcy0yLzEzLzEzLUgubW5vdmEiLCJwYWdlcyI6W3
siaXRlbXMiOlsiMSIgICAgIF19XX0=
##TITLE=	RP261 char.10.fid
##JCAMP-DX=	6.0	$$ MestReNova 14.3.3-33362
##DATA TYPE=	NMR SPECTRUM
##DATA CLASS=	XYDATA
##BLOCK_ID=	1
##ORIGIN=	Bruker BioSpin GmbH
##OWNER=	nmrsu
##NUMDIM=	1
##$MNOVA/METADATA=	(ITEM,BASE64)
eyJhbmdsZSI6MCwiYXhlcyI6eyJ4Ijp7Im1heCI6MTYuMDY0MjU5OTk5OTM5MTI1LCJtaW4iOi0zLjc
2Njk0MjMzOTE1NjYyMjZ9LCJ5Ijp7Im1heCI6MjEzMTQ5LjkzOTQ1MzEyNSwibWluIjotMTkyMzMuMD
kwNDU0MTAxNTYyfX0sInBvaW50cyI6W3sieCI6NTMyMSwieSI6NTgzNX0seyJ4Ijo4NzIyLCJ5Ijo1O
DM1fSx7IngiOjg3MjIsInkiOjgyMDh9LHsieCI6NTMyMSwieSI6ODIwOH0seyJ4Ijo1MzIxLCJ5Ijo1
ODM1fV0sInoiOjB9
##.OBSERVE FREQUENCY=	700.35432466099996418
##.OBSERVE NUCLEUS=	^1H
##.SOLVENT NAME=	CDCl3
##.PULSE SEQUENCE=	zg30
##LONGDATE=	2023/05/30 23:43:41.000
##.ACQUISITIONMODE=	SIMULTANEOUS (DQD)
##$ORIGINAL FORMAT=	Bruker XWIN-NMR
##$MNOVA/SCALES_VERSION=	9
##$PARAMETER FILE=	(acqus, ASCII, /private/var/folders/f6/rjf_tdyn2v98c5c0wvkgn4s80000gq/T/wOC5NoJOSMSMpagCMX7cmA/10/acqus, 0)
$$ ##TITLE= Parameter file, TopSpin 4.1.3
$$ ##JCAMPDX= 5.0
$$ ##DATATYPE= Parameter Values
$$ ##NPOINTS= 1	$$ modification sequence number
$$ ##ORIGIN= Bruker BioSpin GmbH
$$ ##OWNER= nmrsu
$$ $$ 2023-05-30 23:43:31.990 +0100  nmrsu@CZC7167VR1
$$ $$ Z:/700/data/tds/nmr/RP261 char/10/acqus
$$ $$ process C:\Bruker\TopSpin4.1.3\prog\mod\dirdata.exe
$$ ##$ACQT0= -2.0981556054023
$$ ##$AMP= (0..31)
$$ 100 100 100 100 100 100 100 100 100 100 100 100 100 100 100 100 100 100
$$ 100 100 100 100 100 100 100 100 100 100 100 100 100 100
$$ ##$AMPCOIL= (0..32)
$$ -1 0 0 0 0 0 0 0 0 0 0 0 0 0 0 0 0 0 0 0 0 0 0 0 0 0 0 0 0 0 0 0 0
$$ ##$AQSEQ= 0
$$ ##$AQ_mod= 3
$$ ##$AUNM= <au_zg>
$$ ##$AUTOPOS= <25 >
$$ ##$BF1= 700.349999998
$$ ##$BF2= 700.349999998
$$ ##$BF3= 700.349999998
$$ ##$BF4= 700.349999998
$$ ##$BF5= 700.349999998
$$ ##$BF6= 700.349999998
$$ ##$BF7= 700.349999998
$$ ##$BF8= 700.349999998
$$ ##$BWFAC= (0..63)
$$ 0 0 0 0 0 0 0 0 0 0 0 0 0 0 0 0 0 0 0 0 0 0 0 0 0 0 0 0 0 0 0 0 0 0 0 0
$$ 0 0 0 0 0 0 0 0 0 0 0 0 0 0 0 0 0 0 0 0 0 0 0 0 0 0 0 0
$$ ##$BYTORDA= 0
$$ ##$CHANFCU= (0..24)
$$ 0 1 0 0 0 0 0 0 0 0 0 0 0 0 0 0 0 0 0 0 0 0 0 0 0
$$ ##$CHANREC= (0..24)
$$ 0 0 0 0 0 0 0 0 0 0 0 0 0 0 0 0 0 0 0 0 0 0 0 0 0
$$ ##$CHEMSTR= <none>
$$ ##$CNST= (0..63)
$$ 1 1 1 1 1 1 1 1 1 1 1 1 1 1 1 1 1 1 1 1 1 1 1 1 1 1 1 1 1 1 1 1 1 1 1 1
$$ 1 1 1 1 1 1 1 1 1 1 1 1 1 1 1 1 1 1 1 1 1 1 1 1 1 1 1 1
$$ ##$CPDPRG= (0..8)
$$ <> <> <> <> <> <> <> <> <>
$$ ##$D= (0..63)
$$ 0 1 0 0 0 0 0 0 0 0 0 0 0 0 0 0 0.0002 0 0 0 0 0 0 0 0 0 0 0 0 0 0 0 0
$$ 0 0 0 0 0 0 0 0 0 0 0 0 0 0 0 0 0 0 0 0 0 0 0 0 0 0 0 0 0 0 0
$$ ##$DATE= 1685486621
$$ ##$DATE_START= 1685486578
$$ ##$DE= 6.901845
$$ [...]
$$ ##$ShimPowRng3= (0..63)
$$ 1 1 1 1 1 1 1 1 1 1 1 1 1 1 1 1 1 1 1 1 1 1 1 1 1 1 1 1 1 1 1 1 1 1 1 1
$$ 1 1 1 1 0 0 0 0 0 0 0 0 0 0 0 0 0 0 0 0 0 0 0 0 0 0 0 0
$$ ##$ShimPowType1= 8
$$ ##$ShimPowType2= 8
$$ ##$ShimPowType3= 0
$$ ##$ShimPowType4= 0
$$ ##$ShimPowType5= 0
$$ ##$ShimPowType6= 0
$$ ##$ShimPowType7= 0
$$ ##$ShimPowType8= 0
$$ ##$ShimSysActGrad= (0..63)
$$ 1 2 3 4 13 5 7 11 10 9 6 8 12 18 19 20 21 15 22 23 24 14 25 16 26 17 27
$$ 28 31 32 33 34 35 36 37 38 0 0 0 0 0 0 0 0 0 0 0 0 0 0 0 0 0 0 0 0 0 0
$$ 0 0 0 0 0 0
$$ ##$ShimSysAngle= <>
$$ ##$ShimSysFunc= (0..63)
$$ 1 2 3 4 5 6 7 8 9 10 0 37 38 35 16 15 14 13 12 11 28 27 26 25 24 23 36
$$ 22 30 29 20 21 34 33 32 31 17 18 19 0 0 0 0 0 0 0 0 0 0 0 0 0 0 0 0 0 0
$$ 0 0 0 0 0 0 0
$$ ##$ShimSysMatId= <292722da.dat>
$$ ##$ShimSysMatrix= 1
$$ ##$ShimSysMinMaxUG= 130000
$$ ##$ShimSysOffset= <29 mm>
$$ ##$ShimSysType= 4
$$ ##$ShimUnit= 3
$$ ##$SpectrOsVersion= <4.1.156.20210628>
$$ ##$TCubeEth= <192.168.180.38>
$$ ##$TCubeSeqDevice= <>
$$ ##$TOSITY= <no>
$$ ##$TRIPLO2= 0
$$ ##$TopSpinVersion= <TopSpin 4.1.3>
$$ ##$TrxFreqFormula= (0..23)
$$ <TrxFreqFormula(2.0,700350000.000000,'TRX',Trx(1.0,'TRX 1200.1',1,5.000000,1290.000000))>
$$ <TrxFreqFormula(2.0,700350000.000000,'TRX',Trx(1.0,'TRX 1200.2',1,5.000000,1290.000000))>
$$ <TrxFreqFormula(2.0,700350000.000000,'TRX',Trx(1.0,'TRX 1200.3',1,5.000000,1290.000000))>
$$ <> <> <> <> <> <> <> <> <> <> <> <> <> <> <> <> <> <> <> <> <>
$$ ##$TrxPN= (0..23)
$$ <Z148391> <Z148391> <Z148391> <> <> <> <> <> <> <> <> <> <> <> <> <> <>
$$ <> <> <> <> <> <> <>
$$ ##$TrxSN= (0..23)
$$ <00336> <00337> <00342> <> <> <> <> <> <> <> <> <> <> <> <> <> <> <> <>
$$ <> <> <> <> <>
$$ ##$VCubeEth= (0..23)
$$ <no> <no> <no> <no> <no> <no> <no> <no> <no> <no> <no> <no> <no> <no> <no>
$$ <no> <no> <no> <no> <no> <no> <no> <no> <no>
$$ ##$VTU= 2
$$ ##$VTUETH= <192.168.99.11>
$$ ##$VTUTY= <no>
$$ ##$ValueLine= no
$$ ##$VpuPN= (0..23)
$$ <no> <no> <no> <no> <no> <no> <no> <no> <no> <no> <no> <no> <no> <no> <no>
$$ <no> <no> <no> <no> <no> <no> <no> <no> <no>
$$ ##$VpuSN= (0..23)
$$ <no> <no> <no> <no> <no> <no> <no> <no> <no> <no> <no> <no> <no> <no> <no>
$$ <no> <no> <no> <no> <no> <no> <no> <no> <no>
$$ ##$WBREFAM= (0..31)
$$ 99.8 100 100 100 100 100 100 100 100 100 100 100 100 100 100 100 100 100
$$ 100 100 100 100 100 100 100 100 100 100 100 100 100 100
$$ ##$WBREFLM= (0..31)
$$ 1 0 1 0 0 0 0 0 0 0 0 0 0 0 0 0 0 0 0 0 0 0 0 0 0 0 0 0 0 0 0 0
$$ ##$WBREFPH= (0..31)
$$ 0.05 0 0 0 0 0 0 0 0 0 0 0 0 0 0 0 0 0 0 0 0 0 0 0 0 0 0 0 0 0 0 0
$$ ##$WBSGU= (0..31)
$$ 1 2 4 0 0 0 0 0 0 0 0 0 0 0 0 0 0 0 0 0 0 0 0 0 0 0 0 0 0 0 0 0
$$ ##END=
$$ 
##$DECIM=	1440
##$DSPFVS=	21
##XUNITS=	HZ
##YUNITS=	ARBITRARY UNITS
##FIRSTX=	11250.604788156719223
##LASTX=	-2638.1781369192458442
##DELTAX=	-0.10596381293402784562
##XFACTOR=	1
##YFACTOR=	5.9136535996581924834
##FIRSTY=	269.6756591796875
##MINY=	144.41156005859375
##MAXY=	193772.6875
##NPOINTS=	131072
##XYDATA=	(X++(Y..Y))
$$ [...]
5130A087q3o7n3m5l9l5l3l1k9k8k7k7k7k7k6k6k6k6k6k6k6k5k5k4k3k0j7j3j0nlj%J%J%%K
$$ 1087 1004 937 884 839 800 765 732 701 672 644 617 590 563 536 510 484 458 432 406 380 354 329 304 280 257 237 220 207 197 192 189 188 188 189 189 190 190 190 192
5126A92LLMMLLJjjllkkj%%JJ%%J%jjjkjjjj%j%%JJJJ%%%jjjjjj%jjjlmnmlkkjkjjj%j%JLM
$$ 192 195 198 202 206 209 212 213 212 211 208 205 203 201 200 200 200 201 202 202 202 203 203 202 201 200 198 197 196 195 194 194 193 193 193 194 195 196 197 197 197 197 196 195 194 193 192 191 191 190 189 188 185 181 176 172 169 167 165 164 162 161 160 159 159 158 158 159 162 166
5119A66OOOQQOOMNNNNMMKklnpoolkjjjjkkmllmlmlmnmlj%%JKKLLMLLMMNMMMMMMLKLLLMMMM
$$ 166 172 178 184 192 200 206 212 216 221 226 231 236 240 244 246 244 241 236 229 223 217 214 212 211 210 209 208 206 204 200 197 194 190 187 183 180 176 171 167 164 163 163 163 164 166 168 171 174 178 181 184 188 192 197 201 205 209 213 217 221 224 226 229 232 235 239 243 247 251
5112B51MNMMKLKMLMMMNOONNMKKJLLMOQJ0J2J2J3J3J3J3J5J6J7K0K2K8L4M2N5P0R0J13J42J74
$$ 251 255 260 264 268 270 273 275 279 282 286 290 294 299 305 311 316 321 325 327 329 330 333 336 340 346 354 364 376 388 401 414 427 440 455 471 488 508 530 558 592 634 689 759 849 962 1104 1278
5107A278K14K56L03L44L82M09M17L93L48K98K47J72Q7L9N0R5J55K30L16L96M42M23L49K60
$$ 1278 1492 1748 2051 2395 2777 3186 3603 3996 4344 4642 4889 5061 5148 5187 5237 5332 5487 5717 6033 6429 6871 7294 7643 7903
5104G903J55qk19l86m62m79m71m38l65k66j64r0n7m9m9p4j46k43l09l30l33l37l31l05k62
$$ 7903 8058 8050 7831 7445 6983 6504 6033 5595 5230 4964 4800 4710 4653 4604 4555 4481 4335 4092 3783 3453 3120 2783 2452 2147 1885
5101A885k13j67j26r0o1l8j9jJ5L2N1P2R8J28J64K02K40K77L07L28L26L03K76K48K05J46J09
$$ 1885 1672 1505 1379 1289 1228 1190 1171 1170 1185 1217 1268 1340 1438 1566 1730 1932 2172 2449 2756 3084 3410 3713 3989 4237 4442 4588 4697
5099D697J18J56K09K80L62M46N23N92O36O40O17N87N46M57L23J81N1j01k76m26n36o18o72
$$ 4697 4815 4971 5180 5460 5822 6268 6791 7383 8019 8659 9276 9863 10409 10866 11189 11370 11421 11320 11044 10618 10082 9464 8792
5096H792o83o59o33o09n56m70l80l03k37j78j34j13j06j09j38j91k36k58k62k63k54k32j99
$$ 8792 8109 7450 6817 6208 5652 5182 4802 4499 4262 4084 3950 3837 3731 3622 3484 3293 3057 2799 2537 2274 2020 1788 1589
5094A589j65j31j04q0o3m7l5k4j4mQK2M0N8Q1J05J32J58J81K00K08K02J80J54J24Q2L8J7K3
$$ 1589 1424 1293 1189 1109 1046 999 964 940 926 922 930 952 992 1050 1131 1236 1368 1526 1707 1907 2115 2317 2497 2651 2775 2857 2895 2912 2935
5091B935M8Q4J31J82K25K41K22J78J22M6o2j70k36k63k67k52k14j59j03n8l7l2l7n6r7j48
$$ 2935 2983 3067 3198 3380 3605 3846 4068 4246 4368 4414 4352 4182 3946 3683 3416 3164 2950 2791 2688 2630 2593 2561 2524 2468 2371 2223
5088B223j82j95k01k01j92j70j44j16r3p2n6m3l3k5j9j4j0polk%JLMPJ0J3J6K0K6L4M2N4O9
$$ 2223 2041 1846 1645 1444 1252 1082 938 822 729 657 601 558 525 500 481 467 457 450 444 441 439 439 440 443 447 454 464 477 493 513 539 573 615 669 738
5084G38R0J19J61K20K96L82M73N67O59P19P23O66N33K40k21o50q66q87q00o69n27l95k88k09
$$ 738 828 947 1108 1328 1624 2006 2479 3046 3705 4424 5147 5813 6346 6586 6365 5715 4849 3962 3162 2493 1966 1571 1283 1074
5082A074j55j18r2p3o1n1m4l7l3k8k4k0j7j5j2j1j0qppoonnnmllllkkjkjj%%%%%%%%%%%%j
$$ 1074 919 801 709 636 575 524 480 443 410 382 358 338 321 306 294 283 273 265 258 251 245 239 234 229 224 220 217 214 211 208 206 204 203 201 200 199 199 199 199 199 199 199 199 199 199 199 199 199 198
5076A98%J%J%j%kkllmkkkjkljkjkkjjkjkklklklllllkjkjkkjkjj%j%%%JJ%J%jkmnnnmkjJL
$$ 198 198 199 199 200 200 199 199 197 195 192 189 185 183 181 179 178 176 173 172 170 169 167 165 164 163 161 160 158 156 153 151 148 146 143 140 137 134 131 129 128 126 125 123 121 120 118 117 116 116 115 115 115 115 116 117 117 118 118 117 115 111 106 101 96 92 90 89 90 93
5069I3MMLLLOPQRRPPONMMMMKKJ%lmoqj0j0rqpomlkkkkj%j%%%JJJJJ%JJ%%%jjjjjj%%%%KJK
$$ 93 97 101 104 107 110 116 123 131 140 149 156 163 169 174 178 182 186 190 192 194 195 195 192 188 182 174 164 154 145 137 130 124 120 117 115 113 111 109 108 108 107 107 107 107 108 109 110 111 112 112 113 114 114 114 114 113 112 111 110 109 108 108 108 108 108 110 111 113
5062A13MMMNOPOPPPNMLLJKKLLKJjjkklkkkkjkllopqrqponmlkjjj%%jjj%jjkjjj%j%%%%J%J
$$ 113 117 121 125 130 136 143 149 156 163 170 175 179 182 185 186 188 190 193 196 198 199 198 197 195 193 190 188 186 184 182 181 179 176 173 167 160 152 143 135 128 122 117 113 110 108 107 106 105 105 105 104 103 102 102 101 100 98 97 96 95 95 94 94 94 94 94 95 95 96
5055I6%KJKKLLKLKKKJ%J%%%%%jkjkjjJ%KKLKKJ%jmmnmnllkkkjkjjjjkj%jj%%%%%%%%%%%%%
$$ 96 96 98 99 101 103 106 109 111 114 116 118 120 121 121 122 122 122 122 122 122 121 119 118 116 115 114 115 115 117 119 122 124 126 127 127 126 122 118 113 109 104 101 98 96 94 92 91 89 88 87 86 85 83 82 82 81 80 80 80 80 80 80 80 80 80 80 80 80 80 80
5047H0%%%j%%%j%%%J%%%%%%Jj%%%%%%%%%%%J%j%%%%%%%%j%%%%%%%%j%%%%J%%%%%%%%j%%%j
$$ 80 80 80 80 79 79 79 79 78 78 78 78 79 79 79 79 79 79 79 80 79 79 79 79 79 79 79 79 79 79 79 79 80 80 79 79 79 79 79 79 79 79 79 78 78 78 78 78 78 78 78 78 77 77 77 77 77 78 78 78 78 78 78 78 78 78 77 77 77 77 76
5040G6J%%%%%%%%%%%%%J%%%%%%%j%%%Jj%%%%J%%%%j%%%%j%jj%%%%%%J%%%%%%%%%%j%J%%%%
$$ 76 77 77 77 77 77 77 77 77 77 77 77 77 77 77 78 78 78 78 78 78 78 78 77 77 77 77 78 77 77 77 77 77 78 78 78 78 78 77 77 77 77 77 76 76 75 74 74 74 74 74 74 74 75 75 75 75 75 75 75 75 75 75 75 74 74 75 75 75 75 75
5032G5%%%%%%%%%%%%%%%%%%%J%jJ%%j%%%%%%%%%%%%%%%%%%%%J%%%%%%J%%%J%J%JJJJKJKJK
$$ 75 75 75 75 75 75 75 75 75 75 75 75 75 75 75 75 75 75 75 75 76 76 75 76 76 76 75 75 75 75 75 75 75 75 75 75 75 75 75 75 75 75 75 75 75 75 75 76 76 76 76 76 76 76 77 77 77 77 78 78 79 79 80 81 82 83 85 86 88 89 91
5025I1JJJ%J%%%JJJKJKKJJ%%kkjkkjk%jj%%%j%jjjkjkjjjjj%j%%%J%%%%JJJJKKKKKLLLKKK
$$ 91 92 93 94 94 95 95 95 95 96 97 98 100 101 103 105 106 107 107 107 105 103 102 100 98 97 95 95 94 93 93 93 93 92 92 91 90 89 87 86 84 83 82 81 80 79 79 78 78 78 78 79 79 79 79 79 80 81 82 83 85 87 89 91 93 96 99 102 104 106 108
5017A08JJ%JJJKKLLLLKJ%%kllmllkkkj%jjjjkkkkklkkkjkjj%jj%%%%%%%%J%%JJJJJKJJ%JJ
$$ 108 109 110 110 111 112 113 115 117 120 123 126 129 131 132 132 132 130 127 124 120 117 114 112 110 108 107 107 106 105 104 103 101 99 97 95 93 90 88 86 84 83 81 80 79 79 78 77 77 77 77 77 77 77 77 77 78 78 78 79 80 81 82 83 85 86 87 87 88 89
5010H9%%j%J%KKKJKJ%%jjkkkjkj%%%%%j%jjjkjjjjjj%%%j%j%%%%%j%%%%%%j%%J%%j%%%j%%
$$ 89 89 89 88 88 89 89 91 93 95 96 98 99 99 99 98 97 95 93 91 90 88 87 87 87 87 87 87 86 86 85 84 83 81 80 79 78 77 76 75 75 75 75 74 74 73 73 73 73 73 73 72 72 72 72 72 72 72 71 71 71 72 72 72 71 71 71 71 70 70 70
5003G0%%%%%Jj%%J%%%j%%%%%J%%%%%%jJ%%%%%%%%%%j%%%%%%%J%j%%%%%%%%%%%%%%J%%%%J%
$$ 70 70 70 70 70 70 71 70 70 70 71 71 71 71 70 70 70 70 70 70 71 71 71 71 71 71 71 70 71 71 71 71 71 71 71 71 71 71 71 70 70 70 70 70 70 70 70 71 71 70 70 70 70 70 70 70 70 70 70 70 70 70 70 70 71 71 71 71 71 72 72
4995G2j%%%%%%%j%%%%%j%%%%J%%%%%%j%%%%%%J%%%%%%%%%%%%%%%%%%%%%%%%%%%j%%%%%%%%
$$ 72 71 71 71 71 71 71 71 71 70 70 70 70 70 70 69 69 69 69 69 70 70 70 70 70 70 70 69 69 69 69 69 69 69 70 70 70 70 70 70 70 70 70 70 70 70 70 70 70 70 70 70 70 70 70 70 70 70 70 70 70 70 69 69 69 69 69 69 69 69 69
4988F9%%%%%%%%J%j%%%%%%%J%j%%jJ%j%%%J%%%%%J%%%%%%j%%%%J%%%%j%%%%%%%%%%%j%%%%
$$ 69 69 69 69 69 69 69 69 69 70 70 69 69 69 69 69 69 69 69 70 70 69 69 69 68 69 69 68 68 68 68 69 69 69 69 69 69 70 70 70 70 70 70 70 69 69 69 69 69 70 70 70 70 70 69 69 69 69 69 69 69 69 69 69 69 69 68 68 68 68 68
4981F8%%%%%%%%%%%%%%%%J%%jJ%%%J%J%JJKKKLLMMMLL%kmnnmllkjjj%j%%%j%%%%%%%%%%%%
$$ 68 68 68 68 68 68 68 68 68 68 68 68 68 68 68 68 68 69 69 69 68 69 69 69 69 70 70 71 71 72 73 75 77 79 82 85 89 93 97 100 103 103 101 97 92 87 83 80 77 75 74 73 72 72 71 71 71 71 70 70 70 70 70 70 70 70 70 70 70 70 70
4973G0%%%%%%j%%%j%J%%%%%%%%%%%j%J%%%%jJ%%%%%%%%%%%j%%%%%%%%%%%%jJ%%%%%%%%%%%
$$ 70 70 70 70 70 70 70 69 69 69 69 68 68 69 69 69 69 69 69 69 69 69 69 69 69 68 68 69 69 69 69 69 68 69 69 69 69 69 69 69 69 69 69 69 69 68 68 68 68 68 68 68 68 68 68 68 68 68 67 68 68 68 68 68 68 68 68 68 68 68 68
4966F8%%%%%%%%%%%%%%%%%%%%jJ%%j%%%%%%%%%%%J%%%%%%%%%j%%%%%%%%%%%%%%%%%%%%%%%
$$ 68 68 68 68 68 68 68 68 68 68 68 68 68 68 68 68 68 68 68 68 68 67 68 68 68 67 67 67 67 67 67 67 67 67 67 67 67 68 68 68 68 68 68 68 68 68 68 67 67 67 67 67 67 67 67 67 67 67 67 67 67 67 67 67 67 67 67 67 67 67 67
4958F7%%%j%%%%J%%%%%%%j%%J%%%%%j%%J%%j%%%%%%%%Jj%%%%J%%%%%%%%%%j%%%%%%%%%%%%
$$ 67 67 67 67 66 66 66 66 66 67 67 67 67 67 67 67 67 66 66 66 67 67 67 67 67 67 66 66 66 67 67 67 66 66 66 66 66 66 66 66 66 67 66 66 66 66 66 67 67 67 67 67 67 67 67 67 67 67 66 66 66 66 66 66 66 66 66 66 66 66 66
4951F6%%J%j%%%%%%%%%J%%%%%%%%J%%%j%%%%%%%%j%%%%Jj%%%%%%%%%%%%%%%%%%%%j%J%%%j
$$ 66 66 66 67 67 66 66 66 66 66 66 66 66 66 66 67 67 67 67 67 67 67 67 67 68 68 68 68 67 67 67 67 67 67 67 67 67 66 66 66 66 66 67 66 66 66 66 66 66 66 66 66 66 66 66 66 66 66 66 66 66 66 66 66 65 65 66 66 66 66 65
4943F5%%%%%%%%%%%%%%%%%%%%J%%j%%J%%%%%%%%%%%%%%%%%j%%%%%%%%%%%%J%%%%%%%%%%%%
$$ 65 65 65 65 65 65 65 65 65 65 65 65 65 65 65 65 65 65 65 65 65 66 66 66 65 65 65 66 66 66 66 66 66 66 66 66 66 66 66 66 66 66 66 66 66 65 65 65 65 65 65 65 65 65 65 65 65 65 66 66 66 66 66 66 66 66 66 66 66 66 66
4936F6%%Jj%%%%%%%%%%%%%%%%%%%%%%%%%%%%%j%%%J%%%%J%%j%j%%%%J%%%j%%%%%%%%%%%%%
$$ 66 66 66 67 66 66 66 66 66 66 66 66 66 66 66 66 66 66 66 66 66 66 66 66 66 66 66 66 66 66 66 66 66 66 65 65 65 65 66 66 66 66 66 67 67 67 66 66 65 65 65 65 65 66 66 66 66 65 65 65 65 65 65 65 65 65 65 65 65 65 65
4929F5%%%J%%%%%%%%%%%%%%%%%%%%%%%%jJ%%%%%%%%%%%j%%J%j%%%%%%%%%%j%J%%%%%%%%%%
$$ 65 65 65 65 66 66 66 66 66 66 66 66 66 66 66 66 66 66 66 66 66 66 66 66 66 66 66 66 66 65 66 66 66 66 66 66 66 66 66 66 66 66 65 65 65 66 66 65 65 65 65 65 65 65 65 65 65 65 64 64 65 65 65 65 65 65 65 65 65 65 65
4921F5%%%%%%%%%%%%%%%%%%%%%%%%%%%%%%%%%%%%%%%%%%%%%%%%%%%%%%%%%%%%%%%%%%%%%%
$$ 65 65 65 65 65 65 65 65 65 65 65 65 65 65 65 65 65 65 65 65 65 65 65 65 65 65 65 65 65 65 65 65 65 65 65 65 65 65 65 65 65 65 65 65 65 65 65 65 65 65 65 65 65 65 65 65 65 65 65 65 65 65 65 65 65 65 65 65 65 65 65
4914F5%%%%%%%%J%%j%%%%J%%%%%j%%%%%%%%%%%%%%%%%%%%%%%%%%%%%%%%%%Jj%%%%J%%%%j%
$$ 65 65 65 65 65 65 65 65 65 66 66 66 65 65 65 65 65 66 66 66 66 66 66 65 65 65 65 65 65 65 65 65 65 65 65 65 65 65 65 65 65 65 65 65 65 65 65 65 65 65 65 65 65 65 65 65 65 65 66 65 65 65 65 65 66 66 66 66 66 65 65
4906F5%%J%j%%%%%%J%%%%%%j%%%%%%j%%%%%%%%%%%%%%%%%%j%J%%j%J%%%%jJ%%%%%%%%%J%%
$$ 65 65 65 66 66 65 65 65 65 65 65 65 66 66 66 66 66 66 66 65 65 65 65 65 65 65 64 64 64 64 64 64 64 64 64 64 64 64 64 64 64 64 64 64 64 63 63 64 64 64 63 63 64 64 64 64 64 63 64 64 64 64 64 64 64 64 64 64 65 65 65
4899F5%%%%%%%%%%%%%%%%%%%%%%%Jj%%%J%%%%%%%j%%%%%%%%%%%%%%%%%%j%%%%%%%%J%j%%%
$$ 65 65 65 65 65 65 65 65 65 65 65 65 65 65 65 65 65 65 65 65 65 65 65 65 66 65 65 65 65 66 66 66 66 66 66 66 66 65 65 65 65 65 65 65 65 65 65 65 65 65 65 65 65 65 65 65 64 64 64 64 64 64 64 64 64 65 65 64 64 64 64
4892F4%J%j%j%%%J%%%%jJ%%%%%%%%%%%J%%%%%%%%%J%%%%%j%%%%%%%%%%J%%%%%j%%%%%%%%%
$$ 64 64 65 65 64 64 63 63 63 63 64 64 64 64 64 63 64 64 64 64 64 64 64 64 64 64 64 64 65 65 65 65 65 65 65 65 65 65 66 66 66 66 66 66 65 65 65 65 65 65 65 65 65 65 65 66 66 66 66 66 66 65 65 65 65 65 65 65 65 65 65
4884F5Jj%%%%%%%%%j%%%%%%%%j%%%%%%%%%%%%%%%%J%%%%%%%%%%%%%%%%%%%%%%%%JjJ%%%%%
$$ 65 66 65 65 65 65 65 65 65 65 65 65 64 64 64 64 64 64 64 64 64 63 63 63 63 63 63 63 63 63 63 63 63 63 63 63 63 63 64 64 64 64 64 64 64 64 64 64 64 64 64 64 64 64 64 64 64 64 64 64 64 64 64 65 64 65 65 65 65 65 65
4877F5%%%%%%%%%%%%%%J%%j%%%%%%j%%%%%%%%%%%%%%%%%%%j%%%J%%%%%%%j%%%%%%%%J%%%%
$$ 65 65 65 65 65 65 65 65 65 65 65 65 65 65 65 66 66 66 65 65 65 65 65 65 65 64 64 64 64 64 64 64 64 64 64 64 64 64 64 64 64 64 64 64 64 63 63 63 63 64 64 64 64 64 64 64 64 63 63 63 63 63 63 63 63 63 64 64 64 64 64
4869F4J%%%j%%%%%%%%J%%jJ%%%j%%%%%%%%%%%%%%%%%%%%%%%%%%%%j%J%%%%%%%%j%%%%%%%J
$$ 64 65 65 65 65 64 64 64 64 64 64 64 64 64 65 65 65 64 65 65 65 65 64 64 64 64 64 64 64 64 64 64 64 64 64 64 64 64 64 64 64 64 64 64 64 64 64 64 64 64 64 63 63 64 64 64 64 64 64 64 64 64 63 63 63 63 63 63 63 63 64
4862F4%%%%%%%%%%%J%j%%%%J%j%%%%%%%%%%%%Jj%%%%%%%J%%j%%%%%%%%%%%%%%%%j%%%%%%%
$$ 64 64 64 64 64 64 64 64 64 64 64 64 65 65 64 64 64 64 64 65 65 64 64 64 64 64 64 64 64 64 64 64 64 64 65 64 64 64 64 64 64 64 64 65 65 65 64 64 64 64 64 64 64 64 64 64 64 64 64 64 64 64 64 63 63 63 63 63 63 63 63
4854F3%%J%j%%%%%%J%%%%%%%%%%%%%%%%%%%%J%%%%%%%j%%%%%J%%j%%%%%%%%%%j%%%J%j%%J
$$ 63 63 63 64 64 63 63 63 63 63 63 63 64 64 64 64 64 64 64 64 64 64 64 64 64 64 64 64 64 64 64 64 64 65 65 65 65 65 65 65 65 64 64 64 64 64 64 65 65 65 64 64 64 64 64 64 64 64 64 64 64 63 63 63 63 64 64 63 63 63 64
4847F4%%%j%%%%%J%%%%%%%%%%j%%%J%%%%%%%%%%%%%%%%%%%%%%%%j%%%J%%%%%%%J%%%%%%%%
$$ 64 64 64 64 63 63 63 63 63 63 64 64 64 64 64 64 64 64 64 64 64 63 63 63 63 64 64 64 64 64 64 64 64 64 64 64 64 64 64 64 64 64 64 64 64 64 64 64 64 64 63 63 63 63 64 64 64 64 64 64 64 64 65 65 65 65 65 65 65 65 65
4840F5j%%%%%%%%%%%%j%%%%%Jj%%%%%%%%%%%%J%j%%%%J%%%%jJ%%%%j%%%%%%%%%%J%%%%%%%
$$ 65 64 64 64 64 64 64 64 64 64 64 64 64 64 63 63 63 63 63 63 64 63 63 63 63 63 63 63 63 63 63 63 63 63 64 64 63 63 63 63 63 64 64 64 64 64 63 64 64 64 64 64 63 63 63 63 63 63 63 63 63 63 63 64 64 64 64 64 64 64 64
4832F4%%%%%%%%%%%%%%%%%%%%%%%%%%%%%%%%%%%%%%J%j%%%%%j%%%%%J%%%%%%%%%%%j%%%%%
$$ 64 64 64 64 64 64 64 64 64 64 64 64 64 64 64 64 64 64 64 64 64 64 64 64 64 64 64 64 64 64 64 64 64 64 64 64 64 64 64 65 65 64 64 64 64 64 64 63 63 63 63 63 63 64 64 64 64 64 64 64 64 64 64 64 64 63 63 63 63 63 63
4825F3J%j%%%%%%%%%%%%%Jj%%J%%%%%%%%%%%%%%%%%%%%%%%%%%%%%%%%%%j%%J%%%%%%jJ%%%
$$ 63 64 64 63 63 63 63 63 63 63 63 63 63 63 63 63 63 64 63 63 63 64 64 64 64 64 64 64 64 64 64 64 64 64 64 64 64 64 64 64 64 64 64 64 64 64 64 64 64 64 64 64 64 64 64 64 63 63 63 64 64 64 64 64 64 64 63 64 64 64 64
4817F4%%%j%%%%%%%%%%%%%%%jJ%%%%%%J%%%%%%%j%%%%%%J%%%%%%%%%%%%%%%%%%%%%%%%J%j
$$ 64 64 64 64 63 63 63 63 63 63 63 63 63 63 63 63 63 63 63 63 62 63 63 63 63 63 63 63 64 64 64 64 64 64 64 64 63 63 63 63 63 63 63 64 64 64 64 64 64 64 64 64 64 64 64 64 64 64 64 64 64 64 64 64 64 64 64 64 65 65 64
4810F4%%%%%%%%%%%%Jj%%%%j%%%%%%%%%%%%%J%j%%%%Jj%%J%%%%%%%%%%%%%Jj%%%%%%%%%%J
$$ 64 64 64 64 64 64 64 64 64 64 64 64 64 65 64 64 64 64 64 63 63 63 63 63 63 63 63 63 63 63 63 63 63 64 64 63 63 63 63 63 64 63 63 63 64 64 64 64 64 64 64 64 64 64 64 64 64 64 65 64 64 64 64 64 64 64 64 64 64 64 65
4802F5%%%%%%%%%%%%%%%%%j%%%%%j%%%%j%%%%%J%%%%%j%%%%%Jj%%%J%%%%%%%%%%%%%%%%%J
$$ 65 65 65 65 65 65 65 65 65 65 65 65 65 65 65 65 65 65 64 64 64 64 64 64 63 63 63 63 63 62 62 62 62 62 62 63 63 63 63 63 63 62 62 62 62 62 62 63 62 62 62 62 63 63 63 63 63 63 63 63 63 63 63 63 63 63 63 63 63 63 64
4795F4%%%%%%J%%%%%%%%%%%%j%%%Jj%%%%j%%%%%%%j%%%%%%%%%%%%%J%%%%%%%%%%%%%%%%%%
$$ 64 64 64 64 64 64 64 65 65 65 65 65 65 65 65 65 65 65 65 65 64 64 64 64 65 64 64 64 64 64 63 63 63 63 63 63 63 63 62 62 62 62 62 62 62 62 62 62 62 62 62 62 63 63 63 63 63 63 63 63 63 63 63 63 63 63 63 63 63 63 63
4788F3%%%J%%%%%%%%%%%%%%%j%%%%%%%%%%%%%%%%%jJ%%%j%%J%%%%j%%%%%J%j%%%%%%%%J%%
$$ 63 63 63 63 64 64 64 64 64 64 64 64 64 64 64 64 64 64 64 64 63 63 63 63 63 63 63 63 63 63 63 63 63 63 63 63 63 63 62 63 63 63 63 62 62 62 63 63 63 63 63 62 62 62 62 62 62 63 63 62 62 62 62 62 62 62 62 62 63 63 63
4780F3%%%%%%%%%%%%%%%%%%%%%%%%%%%%%%j%%%J%%j%%%%J%%%%%%%%%j%%%%%%%%%%%%%%%%%
$$ 63 63 63 63 63 63 63 63 63 63 63 63 63 63 63 63 63 63 63 63 63 63 63 63 63 63 63 63 63 63 63 62 62 62 62 63 63 63 62 62 62 62 62 63 63 63 63 63 63 63 63 63 63 62 62 62 62 62 62 62 62 62 62 62 62 62 62 62 62 62 62
4773F2%%%%%%%%%%%J%%%%%%%%%%%%%%%%%%%J%%%%%%%%j%%%%%%%%%%%%%%%%%%%%%%%%%%j%%
$$ 62 62 62 62 62 62 62 62 62 62 62 62 63 63 63 63 63 63 63 63 63 63 63 63 63 63 63 63 63 63 63 63 64 64 64 64 64 64 64 64 64 63 63 63 63 63 63 63 63 63 63 63 63 63 63 63 63 63 63 63 63 63 63 63 63 63 63 63 62 62 62
4765F2J%%j%%%%%%%%%%%%%%%%%%%%%%%%J%%%%%%%%%%%%%%%%%%%%%%%%%%%%%%%%%%%%%%jJ%
$$ 62 63 63 63 62 62 62 62 62 62 62 62 62 62 62 62 62 62 62 62 62 62 62 62 62 62 62 62 62 63 63 63 63 63 63 63 63 63 63 63 63 63 63 63 63 63 63 63 63 63 63 63 63 63 63 63 63 63 63 63 63 63 63 63 63 63 63 63 62 63 63
4758F3%%%%%%%%%%%%%j%%%%%%%%%%%%%%%%%%%%%%%%%%%%%%%%%%%%%%%%%%%J%%%%%%%%%%%%
$$ 63 63 63 63 63 63 63 63 63 63 63 63 63 63 62 62 62 62 62 62 62 62 62 62 62 62 62 62 62 62 62 62 62 62 62 62 62 62 62 62 62 62 62 62 62 62 62 62 62 62 62 62 62 62 62 62 62 62 63 63 63 63 63 63 63 63 63 63 63 63 63
4751F3j%%J%%%%%%%%%%%%%%%%j%%%%%%%%%%%%%%%%%%%%%%%%%%%%J%%j%%%%%j%%%J%%%%%%%
$$ 63 62 62 62 63 63 63 63 63 63 63 63 63 63 63 63 63 63 63 63 63 62 62 62 62 62 62 62 62 62 62 62 62 62 62 62 62 62 62 62 62 62 62 62 62 62 62 62 62 62 63 63 63 62 62 62 62 62 62 61 61 61 61 62 62 62 62 62 62 62 62
4743F2%%%%%%%%%%%%%%%%%%%%%%%%%%%%%%%%%%%%%j%%%%%%%J%%%%%%%%%%%%%%%%%%%%%%%%
$$ 62 62 62 62 62 62 62 62 62 62 62 62 62 62 62 62 62 62 62 62 62 62 62 62 62 62 62 62 62 62 62 62 62 62 62 62 62 62 61 61 61 61 61 61 61 61 62 62 62 62 62 62 62 62 62 62 62 62 62 62 62 62 62 62 62 62 62 62 62 62 62
4736F2%%%%%%%%%%%%%%%%%%%%%%%%Jj%J%%j%%%%%%%%%jJ%%%%%%%%%%%%%%%%%%%j%%%%%%%%
$$ 62 62 62 62 62 62 62 62 62 62 62 62 62 62 62 62 62 62 62 62 62 62 62 62 62 63 62 62 63 63 63 62 62 62 62 62 62 62 62 62 62 61 62 62 62 62 62 62 62 62 62 62 62 62 62 62 62 62 62 62 62 62 61 61 61 61 61 61 61 61 61
4728F1%%%%J%%%%%jJ%%%%%%%%%%%%%%%%%%%%%%%%%%%%%j%J%%%%%%%%%%%%%%%%%%%%%%%%%%
$$ 61 61 61 61 61 62 62 62 62 62 62 61 62 62 62 62 62 62 62 62 62 62 62 62 62 62 62 62 62 62 62 62 62 62 62 62 62 62 62 62 62 62 61 61 62 62 62 62 62 62 62 62 62 62 62 62 62 62 62 62 62 62 62 62 62 62 62 62 62 62 62
4721F2%%%%%%%%%%%%%%%%%%%%%%%%%%%%%%%%%%%Jj%%%%%J%%%%%%%%%%%%%%%%%%%j%%%%%%%
$$ 62 62 62 62 62 62 62 62 62 62 62 62 62 62 62 62 62 62 62 62 62 62 62 62 62 62 62 62 62 62 62 62 62 62 62 62 63 62 62 62 62 62 62 63 63 63 63 63 63 63 63 63 63 63 63 63 63 63 63 63 63 63 63 62 62 62 62 62 62 62 62
4713F2%%%%%%%%%%%%%%%%%%Jj%%%%%%%%%%%%%J%%j%%%%%%%J%%%%%%J%j%%%%%%%%%%jJ%%%%
$$ 62 62 62 62 62 62 62 62 62 62 62 62 62 62 62 62 62 62 62 63 62 62 62 62 62 62 62 62 62 62 62 62 62 62 63 63 63 62 62 62 62 62 62 62 62 63 63 63 63 63 63 63 64 64 63 63 63 63 63 63 63 63 63 63 63 62 63 63 63 63 63
4706F3j%%%%%%%%%%%%%%%%%%%%%%%%%%%%%%%J%%j%%%%%%%%%%%%%J%j%%%%%%%%%%%%%%%%%%
$$ 63 62 62 62 62 62 62 62 62 62 62 62 62 62 62 62 62 62 62 62 62 62 62 62 62 62 62 62 62 62 62 62 62 63 63 63 62 62 62 62 62 62 62 62 62 62 62 62 62 62 63 63 62 62 62 62 62 62 62 62 62 62 62 62 62 62 62 62 62 62 62
4699F2%%%%%%%%%%%%%%%jJ%%%%J%j%J%%%%%%%%%%%j%%%J%%%%%%%%%%%%%%%jJ%%%%%%%%%%%
$$ 62 62 62 62 62 62 62 62 62 62 62 62 62 62 62 62 61 62 62 62 62 62 63 63 62 62 63 63 63 63 63 63 63 63 63 63 63 63 62 62 62 62 63 63 63 63 63 63 63 63 63 63 63 63 63 63 63 63 62 63 63 63 63 63 63 63 63 63 63 63 63
4691F3%%%%j%%%%%%%J%%%%%%%%%%%%%j%%%%%%%%%%%%%%%%%%%%%%%%%%%%%%%%%%%%%%Jj%J%
$$ 63 63 63 63 63 62 62 62 62 62 62 62 62 63 63 63 63 63 63 63 63 63 63 63 63 63 63 62 62 62 62 62 62 62 62 62 62 62 62 62 62 62 62 62 62 62 62 62 62 62 62 62 62 62 62 62 62 62 62 62 62 62 62 62 62 62 63 62 62 63 63
4684F3%j%%%%J%%%%%%%%%%%%%%%%%j%%%%%%%%J%j%%%%%%Jj%%%%%%%%%%%%j%J%%%%%%%%%%%
$$ 63 63 62 62 62 62 62 63 63 63 63 63 63 63 63 63 63 63 63 63 63 63 63 63 63 62 62 62 62 62 62 62 62 62 63 63 62 62 62 62 62 62 62 63 62 62 62 62 62 62 62 62 62 62 62 62 62 61 61 62 62 62 62 62 62 62 62 62 62 62 62
4676F2%%%%%%j%%J%%%%%%%%%%%%%%%%%%%%%jJ%%%%%%%%%%%%%%%%%%%%%%%%%%%%%%%%%%%%%
$$ 62 62 62 62 62 62 62 61 61 61 62 62 62 62 62 62 62 62 62 62 62 62 62 62 62 62 62 62 62 62 62 62 61 62 62 62 62 62 62 62 62 62 62 62 62 62 62 62 62 62 62 62 62 62 62 62 62 62 62 62 62 62 62 62 62 62 62 62 62 62 62
4669F2%jJ%%%%%%%%%%%%%%%%%%%%%%%%%%%%%%%%%%%%%%%%%%%%jJ%%%%%%%%%%%%Jj%%%%%%%
$$ 62 62 61 62 62 62 62 62 62 62 62 62 62 62 62 62 62 62 62 62 62 62 62 62 62 62 62 62 62 62 62 62 62 62 62 62 62 62 62 62 62 62 62 62 62 62 62 62 61 62 62 62 62 62 62 62 62 62 62 62 62 62 63 62 62 62 62 62 62 62 62
4662F2%%%%%%%%%%%%%%%%%%%%%%J%%j%%%%%%%%Jj%%%%J%%%%%jJ%%%%%%%%%%j%%%%%%%%%%%
$$ 62 62 62 62 62 62 62 62 62 62 62 62 62 62 62 62 62 62 62 62 62 62 62 63 63 63 62 62 62 62 62 62 62 62 62 63 62 62 62 62 62 63 63 63 63 63 63 62 63 63 63 63 63 63 63 63 63 63 63 62 62 62 62 62 62 62 62 62 62 62 62
4654F2%%%%%%%%%%%%%%%%%%%%%%%J%%%j%%%%%%%%%%%%%%%%%%%%%%%%%%%%%%%%%%%%%%%%%%
$$ 62 62 62 62 62 62 62 62 62 62 62 62 62 62 62 62 62 62 62 62 62 62 62 62 63 63 63 63 62 62 62 62 62 62 62 62 62 62 62 62 62 62 62 62 62 62 62 62 62 62 62 62 62 62 62 62 62 62 62 62 62 62 62 62 62 62 62 62 62 62 62
4647F2%j%%%%%%%%%%%%%%%%%%%%%%%%%%%%J%%%%%%%%%%%j%%%%%%%J%%%%%%%%%%%%%%%%%%%
$$ 62 62 61 61 61 61 61 61 61 61 61 61 61 61 61 61 61 61 61 61 61 61 61 61 61 61 61 61 61 61 61 62 62 62 62 62 62 62 62 62 62 62 62 61 61 61 61 61 61 61 61 62 62 62 62 62 62 62 62 62 62 62 62 62 62 62 62 62 62 62 62
4639F2%%j%%%%%%J%%%%j%%%%J%%%%%%%jJ%%J%%%j%%%%%J%j%%%%%%%%%%%%%%%%%j%%%%%%%%
$$ 62 62 62 61 61 61 61 61 61 61 62 62 62 62 62 61 61 61 61 61 62 62 62 62 62 62 62 62 61 62 62 62 63 63 63 63 62 62 62 62 62 62 63 63 62 62 62 62 62 62 62 62 62 62 62 62 62 62 62 62 62 62 61 61 61 61 61 61 61 61 61
4632F1%%%%%%%%%%J%%%%%%%%%%%%%%%%%%%%%%%%%%%%%%%%%%%%%%%%%%%%%%%%%%%%J%%%%j%
$$ 61 61 61 61 61 61 61 61 61 61 61 62 62 62 62 62 62 62 62 62 62 62 62 62 62 62 62 62 62 62 62 62 62 62 62 62 62 62 62 62 62 62 62 62 62 62 62 62 62 62 62 62 62 62 62 62 62 62 62 62 62 62 62 62 63 63 63 63 63 62 62
4624F2%%%%%%%%%%j%%J%%%%%%%%%%%%%%%%%%%%%%%%%%%%%%%%%%%%%%%%%%%%%j%J%j%%%J%%
$$ 62 62 62 62 62 62 62 62 62 62 62 61 61 61 62 62 62 62 62 62 62 62 62 62 62 62 62 62 62 62 62 62 62 62 62 62 62 62 62 62 62 62 62 62 62 62 62 62 62 62 62 62 62 62 62 62 62 62 62 62 61 61 62 62 61 61 61 61 62 62 62
4617F2%%%Jj%%%%%%%%%%j%%%%%%jJ%%%%%%%%%%J%%%%%%%jJ%%%%%%%%%%%%%%%%%%%%%%%%%%
$$ 62 62 62 62 63 62 62 62 62 62 62 62 62 62 62 62 61 61 61 61 61 61 61 60 61 61 61 61 61 61 61 61 61 61 61 62 62 62 62 62 62 62 62 61 62 62 62 62 62 62 62 62 62 62 62 62 62 62 62 62 62 62 62 62 62 62 62 62 62 62 62
4610F2%%%%%%%%%%%%%%%%%%%%%%%%%%%%%%%%%%%%j%J%%%%%%%%%j%%%%J%%j%%%%%%%%%%%%%
$$ 62 62 62 62 62 62 62 62 62 62 62 62 62 62 62 62 62 62 62 62 62 62 62 62 62 62 62 62 62 62 62 62 62 62 62 62 62 61 61 62 62 62 62 62 62 62 62 62 62 61 61 61 61 61 62 62 62 61 61 61 61 61 61 61 61 61 61 61 61 61 61
4602F1%%%J%%%j%%J%jJ%%%%%%%%%%J%%%%%%j%%%%J%%j%%%%%%%%%%%%%%%%%%Jj%%%%%%%%%%
$$ 61 61 61 61 62 62 62 62 61 61 61 62 62 61 62 62 62 62 62 62 62 62 62 62 62 63 63 63 63 63 63 63 62 62 62 62 62 63 63 63 62 62 62 62 62 62 62 62 62 62 62 62 62 62 62 62 62 62 62 63 62 62 62 62 62 62 62 62 62 62 62
4595F2%%%%%%%%%%%%%%J%%%%%%%%j%%%%%J%%j%%%J%%%%%%%%%%%%j%%%%%%%%%j%%%%%%J%%%
$$ 62 62 62 62 62 62 62 62 62 62 62 62 62 62 62 63 63 63 63 63 63 63 63 63 62 62 62 62 62 62 63 63 63 62 62 62 62 63 63 63 63 63 63 63 63 63 63 63 63 63 62 62 62 62 62 62 62 62 62 62 61 61 61 61 61 61 61 62 62 62 62
4587F2%%%%%%%%%%%%%%%%%%%%%%%%%%%%%%%%%%%%%%%%%%J%%%%%J%%%J%JJJJKJJJJJj%kjkk
$$ 62 62 62 62 62 62 62 62 62 62 62 62 62 62 62 62 62 62 62 62 62 62 62 62 62 62 62 62 62 62 62 62 62 62 62 62 62 62 62 62 62 62 62 63 63 63 63 63 63 64 64 64 64 65 65 66 67 68 69 71 72 73 74 75 76 75 75 73 72 70 68
4580F8kjj%j%%j%%%%%%%%%%%%%J%%%%%j%%%%%%%jJ%%%j%%J%%%%%%%%%%%%%%%%J%%%%%j%%%
$$ 68 66 65 64 64 63 63 63 62 62 62 62 62 62 62 62 62 62 62 62 62 62 63 63 63 63 63 63 62 62 62 62 62 62 62 62 61 62 62 62 62 61 61 61 62 62 62 62 62 62 62 62 62 62 62 62 62 62 62 62 62 63 63 63 63 63 63 62 62 62 62
4573F2%%%j%%%%%%%%%%%%%%%%%%%%%%%%%%%%%%%%%%%%%%%%%%%%%%%%%%%J%%%%%%%%%%%%%%
$$ 62 62 62 62 61 61 61 61 61 61 61 61 61 61 61 61 61 61 61 61 61 61 61 61 61 61 61 61 61 61 61 61 61 61 61 61 61 61 61 61 61 61 61 61 61 61 61 61 61 61 61 61 61 61 61 61 62 62 62 62 62 62 62 62 62 62 62 62 62 62 62
4565F2%%%%%%%%%%%j%%%%%%%%%%%%%%%%%%J%%%j%%%%%%%%%%%j%J%%%%%%%%%%%%%%%%%%%%%
$$ 62 62 62 62 62 62 62 62 62 62 62 62 61 61 61 61 61 61 61 61 61 61 61 61 61 61 61 61 61 61 61 62 62 62 62 61 61 61 61 61 61 61 61 61 61 61 61 60 60 61 61 61 61 61 61 61 61 61 61 61 61 61 61 61 61 61 61 61 61 61 61
4558F1Jj%%%%%%%%%%%%%%J%jJ%%%%%%%%%%%%J%%%%Jj%%%j%%%%%J%j%%%%%%%%%%j%%%%%%%%
$$ 61 62 61 61 61 61 61 61 61 61 61 61 61 61 61 61 61 62 62 61 62 62 62 62 62 62 62 62 62 62 62 62 62 63 63 63 63 63 64 63 63 63 63 62 62 62 62 62 62 63 63 62 62 62 62 62 62 62 62 62 62 62 61 61 61 61 61 61 61 61 61
4550F1%%%%%%%%%j%%J%j%%%%%%%%%%%J%%%%%%%J%%%%%%%%%%%J%%%%%%%%j%%%%%%%%%%%%%%
$$ 61 61 61 61 61 61 61 61 61 61 60 60 60 61 61 60 60 60 60 60 60 60 60 60 60 60 60 61 61 61 61 61 61 61 61 62 62 62 62 62 62 62 62 62 62 62 62 63 63 63 63 63 63 63 63 63 62 62 62 62 62 62 62 62 62 62 62 62 62 62 62
4543F2%%%%%%%%%%%%%%%%%j%%%%%%%j%%%%%%%%%%%J%%%%%%%%%%%J%%%%%%%%%%%%%%%%%%%%
$$ 62 62 62 62 62 62 62 62 62 62 62 62 62 62 62 62 62 62 61 61 61 61 61 61 61 61 60 60 60 60 60 60 60 60 60 60 60 60 61 61 61 61 61 61 61 61 61 61 61 61 62 62 62 62 62 62 62 62 62 62 62 62 62 62 62 62 62 62 62 62 62
4535F2%%%%%J%%%%%%j%%%%%%%j%%%%j%%%%%%%%j%%%%%%J%%%%%J%%%%%%%%%%%J%%%%%%%%%%
$$ 62 62 62 62 62 62 63 63 63 63 63 63 63 62 62 62 62 62 62 62 62 61 61 61 61 61 60 60 60 60 60 60 60 60 60 59 59 59 59 59 59 59 60 60 60 60 60 60 61 61 61 61 61 61 61 61 61 61 61 61 62 62 62 62 62 62 62 62 62 62 62
4528F2%%%J%%%%%j%%J%j%%%%%%%%j%%%%%%%j%%j%%%j%%%J%%%%%%J%jJ%%%%%%%%Jj%J%%J%%
$$ 62 62 62 62 63 63 63 63 63 63 62 62 62 63 63 62 62 62 62 62 62 62 62 62 61 61 61 61 61 61 61 61 60 60 60 59 59 59 59 58 58 58 58 59 59 59 59 59 59 59 60 60 59 60 60 60 60 60 60 60 60 60 61 60 60 61 61 61 62 62 62
4521F2%%%%%%%%%%J%%J%%%%%%%%%%j%%%%%j%%%j%%%j%%%%%%%%%%%%%%%%%%%%%%%%J%%%%%%
$$ 62 62 62 62 62 62 62 62 62 62 62 63 63 63 64 64 64 64 64 64 64 64 64 64 64 63 63 63 63 63 63 62 62 62 62 61 61 61 61 60 60 60 60 60 60 60 60 60 60 60 60 60 60 60 60 60 60 60 60 60 60 60 60 60 61 61 61 61 61 61 61
4513F1%jJ%%%%%%%%%%%J%%%%%%%%%j%%%J%%j%%%%%%j%%%%%%%%%%j%%%J%%%%%%%%%%%%%%%J
$$ 61 61 60 61 61 61 61 61 61 61 61 61 61 61 61 62 62 62 62 62 62 62 62 62 62 61 61 61 61 62 62 62 61 61 61 61 61 61 61 60 60 60 60 60 60 60 60 60 60 60 59 59 59 59 60 60 60 60 60 60 60 60 60 60 60 60 60 60 60 60 61
4506F1j%%%%%%%%J%%%%%J%%%%%%j%J%%%%jJ%%%%%j%%%%%%%%%%%%%j%%%%%%%%%%%%%%%%%%%
$$ 61 60 60 60 60 60 60 60 60 60 61 61 61 61 61 61 62 62 62 62 62 62 62 61 61 62 62 62 62 62 61 62 62 62 62 62 62 61 61 61 61 61 61 61 61 61 61 61 61 61 61 60 60 60 60 60 60 60 60 60 60 60 60 60 60 60 60 60 60 60 60
4498F0%%%%%%%%%%%%%%%%%%%%%%%%J%%%%%%%%%%%J%%%%%%%%%%%%%%%%%%%%%%%j%%J%%%%%%
$$ 60 60 60 60 60 60 60 60 60 60 60 60 60 60 60 60 60 60 60 60 60 60 60 60 60 61 61 61 61 61 61 61 61 61 61 61 61 62 62 62 62 62 62 62 62 62 62 62 62 62 62 62 62 62 62 62 62 62 62 62 62 61 61 61 62 62 62 62 62 62 62
4491F2j%%%%%%%%%j%%%%%%%%%%J%%j%%%%%%%%%J%j%%J%%%%%%%%%%J%%%%%%%%%j%J%%%%%%%
$$ 62 61 61 61 61 61 61 61 61 61 61 60 60 60 60 60 60 60 60 60 60 60 61 61 61 60 60 60 60 60 60 60 60 60 60 61 61 60 60 60 61 61 61 61 61 61 61 61 61 61 61 62 62 62 62 62 62 62 62 62 62 61 61 62 62 62 62 62 62 62 62
4484F2%%%%%%%%%%%%%%%%%%%%%%%%j%%%%%%%%%%%%%%%%%%%%%%%%%%%%%%%%%%j%%J%%%%%%%
$$ 62 62 62 62 62 62 62 62 62 62 62 62 62 62 62 62 62 62 62 62 62 62 62 62 62 61 61 61 61 61 61 61 61 61 61 61 61 61 61 61 61 61 61 61 61 61 61 61 61 61 61 61 61 61 61 61 61 61 61 61 60 60 60 61 61 61 61 61 61 61 61
4476F1%%%%%%%%%%%%%%%%%%%%%%%%%%%%J%%%j%%%%%%j%%%J%%%%%%%%%%%%%%%%%%%%%%%%%%
$$ 61 61 61 61 61 61 61 61 61 61 61 61 61 61 61 61 61 61 61 61 61 61 61 61 61 61 61 61 61 62 62 62 62 61 61 61 61 61 61 61 60 60 60 60 61 61 61 61 61 61 61 61 61 61 61 61 61 61 61 61 61 61 61 61 61 61 61 61 61 61 61
4469F1%%%%%%%%%%%%%%%%%%%%%%%%%%%%%%%%%%%%%%%%%%%%%%%%%%%%%%%%%%%%%%%%%%%%%%
$$ 61 61 61 61 61 61 61 61 61 61 61 61 61 61 61 61 61 61 61 61 61 61 61 61 61 61 61 61 61 61 61 61 61 61 61 61 61 61 61 61 61 61 61 61 61 61 61 61 61 61 61 61 61 61 61 61 61 61 61 61 61 61 61 61 61 61 61 61 61 61 61
4461F1%%%%%j%%%%%J%jJ%%%%%%%%%J%%%%%%%%%%%%%%%%%j%%%%%%Jj%%%%%%%%%%%%j%%%%%%
$$ 61 61 61 61 61 61 60 60 60 60 60 60 61 61 60 61 61 61 61 61 61 61 61 61 61 62 62 62 62 62 62 62 62 62 62 62 62 62 62 62 62 62 62 61 61 61 61 61 61 61 62 61 61 61 61 61 61 61 61 61 61 61 61 61 60 60 60 60 60 60 60
4454F0J%%%%%%%%%%j%%%%%J%%%%%%%%%%%%%%%%j%J%%%%%%%J%%%%j%%%J%j%%%%%%%%%%%%%%
$$ 60 61 61 61 61 61 61 61 61 61 61 61 60 60 60 60 60 60 61 61 61 61 61 61 61 61 61 61 61 61 61 61 61 61 61 60 60 61 61 61 61 61 61 61 61 62 62 62 62 62 61 61 61 61 62 62 61 61 61 61 61 61 61 61 61 61 61 61 61 61 61
4446F1%%%%%%%j%%%%%%%%%%%J%%%%%%jJ%%%%%%%%%%%%%j%J%%%%J%%%%%%j%%%%%J%%%j%%%%
$$ 61 61 61 61 61 61 61 61 60 60 60 60 60 60 60 60 60 60 60 60 61 61 61 61 61 61 61 60 61 61 61 61 61 61 61 61 61 61 61 61 61 61 60 60 61 61 61 61 61 62 62 62 62 62 62 62 61 61 61 61 61 61 62 62 62 62 61 61 61 61 61
4439F1%%%%%%%%%%%%%%%%%%%%%%%%%%%%%%%J%%%%j%%%%%J%%%j%%%%%%%%%%%J%%%j%%%%%%%
$$ 61 61 61 61 61 61 61 61 61 61 61 61 61 61 61 61 61 61 61 61 61 61 61 61 61 61 61 61 61 61 61 61 62 62 62 62 62 61 61 61 61 61 61 62 62 62 62 61 61 61 61 61 61 61 61 61 61 61 61 62 62 62 62 61 61 61 61 61 61 61 61
4432F1%%%%%%%%%%j%J%%%%%%%%%%%%%%%%%%%%%%%%%%%%%%%%%%%%%%%%%%%%%%J%%%j%%%J%%
$$ 61 61 61 61 61 61 61 61 61 61 61 60 60 61 61 61 61 61 61 61 61 61 61 61 61 61 61 61 61 61 61 61 61 61 61 61 61 61 61 61 61 61 61 61 61 61 61 61 61 61 61 61 61 61 61 61 61 61 61 61 62 62 62 62 61 61 61 61 62 62 62
4424F2%%%j%%%%J%%%%j%J%%%j%%%%%%%%%%%%%%%%%%%%%%%%%%%%%%%%%%J%%j%%%%%%%%%%%J
$$ 62 62 62 62 61 61 61 61 61 62 62 62 62 62 61 61 62 62 62 62 61 61 61 61 61 61 61 61 61 61 61 61 61 61 61 61 61 61 61 61 61 61 61 61 61 61 61 61 61 61 61 61 61 61 61 62 62 62 61 61 61 61 61 61 61 61 61 61 61 61 62
4417F2%%%jJ%%%%j%%%J%j%%%%%%%%%%%%%%%%%%%%%%%%%%%jJ%%%%%%%%J%j%%%%%%%%%%%%%%
$$ 62 62 62 62 61 62 62 62 62 62 61 61 61 61 62 62 61 61 61 61 61 61 61 61 61 61 61 61 61 61 61 61 61 61 61 61 61 61 61 61 61 61 61 61 60 61 61 61 61 61 61 61 61 61 62 62 61 61 61 61 61 61 61 61 61 61 61 61 61 61 61
4409F1%%%%%%%%%%%%%%%jJj%J%%%%%%%j%%%%%%%%%%%%%%%%%%%%%%%%%%%Jj%%%%%J%%%jJ%%
$$ 61 61 61 61 61 61 61 61 61 61 61 61 61 61 61 61 60 61 60 60 61 61 61 61 61 61 61 61 60 60 60 60 60 60 60 60 60 60 60 60 60 60 60 60 60 60 60 60 60 60 60 60 60 60 60 60 61 60 60 60 60 60 60 61 61 61 61 60 61 61 61
4402F1%%%%j%%%%%%%%%%%%%%%%J%%%j%%%%%%%%%%%%J%%%%%%%%%%%%%%%%%%%%%%%%%%%%%%%
$$ 61 61 61 61 61 60 60 60 60 60 60 60 60 60 60 60 60 60 60 60 60 60 61 61 61 61 60 60 60 60 60 60 60 60 60 60 60 60 60 61 61 61 61 61 61 61 61 61 61 61 61 61 61 61 61 61 61 61 61 61 61 61 61 61 61 61 61 61 61 61 61
4395F1%%%%%%%%%%%%%%%%%%jJ%%%%%%%%%J%j%%%%%%%%%%%%%%%%j%%%%%%%%%%%J%%%%%%%%%
$$ 61 61 61 61 61 61 61 61 61 61 61 61 61 61 61 61 61 61 61 60 61 61 61 61 61 61 61 61 61 61 62 62 61 61 61 61 61 61 61 61 61 61 61 61 61 61 61 61 61 60 60 60 60 60 60 60 60 60 60 60 60 61 61 61 61 61 61 61 61 61 61
4387F1%%%%%%%%%%%%%%%%%%%%%%%%%%%%%%%%%%%%%%%%%%%%%%%%%%%%%%%%%%%jJ%%%%%%%%%
$$ 61 61 61 61 61 61 61 61 61 61 61 61 61 61 61 61 61 61 61 61 61 61 61 61 61 61 61 61 61 61 61 61 61 61 61 61 61 61 61 61 61 61 61 61 61 61 61 61 61 61 61 61 61 61 61 61 61 61 61 61 60 61 61 61 61 61 61 61 61 61 61
4380F1%%%%%jJ%%%%%%%%%%%%%%%%%%%%%j%%J%%%%%%%%%%%%%%%%%%%%%%%%%%%%%%j%J%%%%%
$$ 61 61 61 61 61 61 60 61 61 61 61 61 61 61 61 61 61 61 61 61 61 61 61 61 61 61 61 61 61 60 60 60 61 61 61 61 61 61 61 61 61 61 61 61 61 61 61 61 61 61 61 61 61 61 61 61 61 61 61 61 61 61 61 60 60 61 61 61 61 61 61
4372F1%j%%%%J%%j%%%%%%%%%%%%%%%%%%%%%%%%%%%%%%%%%%J%%j%%%%%%%%%%%Jj%%jJ%%%%%
$$ 61 61 60 60 60 60 60 61 61 61 60 60 60 60 60 60 60 60 60 60 60 60 60 60 60 60 60 60 60 60 60 60 60 60 60 60 60 60 60 60 60 60 60 60 60 61 61 61 60 60 60 60 60 60 60 60 60 60 60 60 61 60 60 60 59 60 60 60 60 60 60
4365F0%%%%%jJ%%%%J%%%%%%%%%%%%%%%%%%%%%%%%%%%%J%%%j%%%%Jj%%%%%%%%%%%%%%%%%%%
$$ 60 60 60 60 60 60 59 60 60 60 60 60 61 61 61 61 61 61 61 61 61 61 61 61 61 61 61 61 61 61 61 61 61 61 61 61 61 61 61 61 61 62 62 62 62 61 61 61 61 61 62 61 61 61 61 61 61 61 61 61 61 61 61 61 61 61 61 61 61 61 61
4357F1%%%%%%%%%%%%%%%%%%%%%%%%%%%%%%%%%%%j%J%%%%%%%%%%%%%%%%%%%%%%%%%%j%%%%%
$$ 61 61 61 61 61 61 61 61 61 61 61 61 61 61 61 61 61 61 61 61 61 61 61 61 61 61 61 61 61 61 61 61 61 61 61 61 60 60 61 61 61 61 61 61 61 61 61 61 61 61 61 61 61 61 61 61 61 61 61 61 61 61 61 61 61 60 60 60 60 60 60
4350F0%%%%%%%%%%%%%Jj%%%%%%%J%%j%%J%%%%%%%%j%%%%%%%%%%%%%%%%J%%%%%%%%%j%%%%J
$$ 60 60 60 60 60 60 60 60 60 60 60 60 60 60 61 60 60 60 60 60 60 60 60 61 61 61 60 60 60 61 61 61 61 61 61 61 61 61 60 60 60 60 60 60 60 60 60 60 60 60 60 60 60 60 60 61 61 61 61 61 61 61 61 61 61 60 60 60 60 60 61
4343F1%%%%%%%%%%%%%%%%%%%%%%%%%%%%%%%%%%%%%%%%%%%%%%%%%%%%j%%%%%%%%%%%%j%%%%
$$ 61 61 61 61 61 61 61 61 61 61 61 61 61 61 61 61 61 61 61 61 61 61 61 61 61 61 61 61 61 61 61 61 61 61 61 61 61 61 61 61 61 61 61 61 61 61 61 61 61 61 61 61 61 60 60 60 60 60 60 60 60 60 60 60 60 60 59 59 59 59 59
4335E9%%%%%%%%%%%j%%%J%%%%%%%%%%%%%%%%%J%%%%%%%%%%%Jj%%%%jJ%%%%%%%%%%%%%%%%%
$$ 59 59 59 59 59 59 59 59 59 59 59 59 58 58 58 58 59 59 59 59 59 59 59 59 59 59 59 59 59 59 59 59 59 59 60 60 60 60 60 60 60 60 60 60 60 60 61 60 60 60 60 60 59 60 60 60 60 60 60 60 60 60 60 60 60 60 60 60 60 60 60
4328F0%%%%%%%%%%%J%%%%j%%%%%J%%%%%%%%%%%%%%%%%j%%J%%%%%%j%J%j%%%%Jj%%%%%%%%%
$$ 60 60 60 60 60 60 60 60 60 60 60 60 61 61 61 61 61 60 60 60 60 60 60 61 61 61 61 61 61 61 61 61 61 61 61 61 61 61 61 61 61 60 60 60 61 61 61 61 61 61 61 60 60 61 61 60 60 60 60 60 61 60 60 60 60 60 60 60 60 60 60
4320F0%%%%%%%%%%%%%%%%%%%%%%%%%%%%%j%J%%%%%%%%%%%%%%%%%%%jJ%%%%%jJ%j%%%%%%%J
$$ 60 60 60 60 60 60 60 60 60 60 60 60 60 60 60 60 60 60 60 60 60 60 60 60 60 60 60 60 60 60 59 59 60 60 60 60 60 60 60 60 60 60 60 60 60 60 60 60 60 60 60 60 59 60 60 60 60 60 60 59 60 60 59 59 59 59 59 59 59 59 60
4313F0%%%%%%%%%%%%%%%%j%%%%%%%%%%%%%%%%JjJ%%%j%J%%%%%%%%%%%jJj%%%%%JjJ%%j%%J
$$ 60 60 60 60 60 60 60 60 60 60 60 60 60 60 60 60 60 59 59 59 59 59 59 59 59 59 59 59 59 59 59 59 59 59 60 59 60 60 60 60 59 59 60 60 60 60 60 60 60 60 60 60 60 60 59 60 59 59 59 59 59 59 60 59 60 60 60 59 59 59 60
4306F0%%%%%%%%%%%%%Jj%%%%%J%%%%%%%%%%%%%%%%%%j%J%%%%%%%%j%Jj%%%%%%%%%%%%%%%%
$$ 60 60 60 60 60 60 60 60 60 60 60 60 60 60 61 60 60 60 60 60 60 61 61 61 61 61 61 61 61 61 61 61 61 61 61 61 61 61 61 61 60 60 61 61 61 61 61 61 61 61 61 60 60 61 60 60 60 60 60 60 60 60 60 60 60 60 60 60 60 60 60
4298F0%%%%%%%%%%%%%%%%%%%%%%%%%J%%%j%%%%%%%%%%%%%%%%%%%%%%%%%%%%%j%%%%%J%%%%
$$ 60 60 60 60 60 60 60 60 60 60 60 60 60 60 60 60 60 60 60 60 60 60 60 60 60 60 61 61 61 61 60 60 60 60 60 60 60 60 60 60 60 60 60 60 60 60 60 60 60 60 60 60 60 60 60 60 60 60 60 60 59 59 59 59 59 59 60 60 60 60 60
4291F0%%j%%%%J%%%%%%%%%%%%%%%%%%%Jj%%%%Jj%%%%%%%%Jj%%%%%%%%%%%J%%%%%%j%%%%J%
$$ 60 60 60 59 59 59 59 59 60 60 60 60 60 60 60 60 60 60 60 60 60 60 60 60 60 60 60 60 61 60 60 60 60 60 61 60 60 60 60 60 60 60 60 60 61 60 60 60 60 60 60 60 60 60 60 60 60 61 61 61 61 61 61 61 60 60 60 60 60 61 61
4283F1%%%%%%j%%%%%J%%%%%%%%%%%%%%%%%%J%%j%%%%%%J%j%%%%%%%jJ%%%%%%%%%j%%%%%%%
$$ 61 61 61 61 61 61 61 60 60 60 60 60 60 61 61 61 61 61 61 61 61 61 61 61 61 61 61 61 61 61 61 61 62 62 62 61 61 61 61 61 61 61 62 62 61 61 61 61 61 61 61 61 60 61 61 61 61 61 61 61 61 61 61 60 60 60 60 60 60 60 60
4276F0%jJj%J%%%%%%%%%%%%%%%%%%%%%%%%%%%%%%%%%%%%%%%%%%%%%%%%%%%%%%%%%%%%%J%%
$$ 60 60 59 60 59 59 60 60 60 60 60 60 60 60 60 60 60 60 60 60 60 60 60 60 60 60 60 60 60 60 60 60 60 60 60 60 60 60 60 60 60 60 60 60 60 60 60 60 60 60 60 60 60 60 60 60 60 60 60 60 60 60 60 60 60 60 60 60 61 61 61
4268F1%%j%J%%%j%%%%%%Jj%%%%%%%%%%%%%%%%J%%j%%%%%%%J%%%%%%%%%%%%%%jJ%%%%%j%%%
$$ 61 61 61 60 60 61 61 61 61 60 60 60 60 60 60 60 61 60 60 60 60 60 60 60 60 60 60 60 60 60 60 60 60 60 61 61 61 60 60 60 60 60 60 60 60 61 61 61 61 61 61 61 61 61 61 61 61 61 61 61 60 61 61 61 61 61 61 60 60 60 60
4261F0%%%%%%%%%%%%%%%%%%%%%%%%%%%%%%%%j%Jj%%J%j%%%%Jj%%%J%%%%%%%%%%%%%%%%%%%
$$ 60 60 60 60 60 60 60 60 60 60 60 60 60 60 60 60 60 60 60 60 60 60 60 60 60 60 60 60 60 60 60 60 60 59 59 60 59 59 59 60 60 59 59 59 59 59 60 59 59 59 59 60 60 60 60 60 60 60 60 60 60 60 60 60 60 60 60 60 60 60 60
4254F0%%%%J%%%%%%%%%%%%%%%%%%j%J%%j%%J%%%%%j%%%%%%%%j%%%%%%%%%%%%%%%%%J%%%%J
$$ 60 60 60 60 60 61 61 61 61 61 61 61 61 61 61 61 61 61 61 61 61 61 61 61 60 60 61 61 61 60 60 60 61 61 61 61 61 61 60 60 60 60 60 60 60 60 60 59 59 59 59 59 59 59 59 59 59 59 59 59 59 59 59 59 59 60 60 60 60 60 61
4246F1%%%%%%%%%%%%%%J%%%%%j%%%%%%%%j%%%%%%%%%%%%%%%%%%%%%%%j%%%%%%%%%%J%%%%%
$$ 61 61 61 61 61 61 61 61 61 61 61 61 61 61 61 62 62 62 62 62 62 61 61 61 61 61 61 61 61 61 60 60 60 60 60 60 60 60 60 60 60 60 60 60 60 60 60 60 60 60 60 60 60 60 59 59 59 59 59 59 59 59 59 59 59 60 60 60 60 60 60
4239F0%%%%Jj%%%%%%%%%%J%%%%%%%%%%%%%%%%%%j%%%%%%j%%%%%%%%%%%%%%%%%%%%%%%%%%J
$$ 60 60 60 60 60 61 60 60 60 60 60 60 60 60 60 60 60 61 61 61 61 61 61 61 61 61 61 61 61 61 61 61 61 61 61 61 60 60 60 60 60 60 60 59 59 59 59 59 59 59 59 59 59 59 59 59 59 59 59 59 59 59 59 59 59 59 59 59 59 59 60
4231F0%%%%%j%J%%%%%%%%%%%%%%%%%%%%%%%%%%%%%%jJ%%%%%%%%%%%%j%%%%%%%%%%%%%%%%%
$$ 60 60 60 60 60 60 59 59 60 60 60 60 60 60 60 60 60 60 60 60 60 60 60 60 60 60 60 60 60 60 60 60 60 60 60 60 60 60 60 59 60 60 60 60 60 60 60 60 60 60 60 60 60 59 59 59 59 59 59 59 59 59 59 59 59 59 59 59 59 59 59
4224E9%%%%%%%%%J%%%%%%%%%%%%%%%%%%%%%%%%%%%%%%%%%%%%%%%%%%%%%%%%%%%%%%%%j%%%
$$ 59 59 59 59 59 59 59 59 59 59 60 60 60 60 60 60 60 60 60 60 60 60 60 60 60 60 60 60 60 60 60 60 60 60 60 60 60 60 60 60 60 60 60 60 60 60 60 60 60 60 60 60 60 60 60 60 60 60 60 60 60 60 60 60 60 60 60 59 59 59 59
4217E9%%%%%%%J%%%%%%%%%%j%%%%%%J%%%%%%%j%%J%%%%%%%%%%%%%%%%%%%%%jJ%%%%%%%%%%
$$ 59 59 59 59 59 59 59 59 60 60 60 60 60 60 60 60 60 60 60 59 59 59 59 59 59 59 60 60 60 60 60 60 60 60 59 59 59 60 60 60 60 60 60 60 60 60 60 60 60 60 60 60 60 60 60 60 60 60 60 59 60 60 60 60 60 60 60 60 60 60 60
4209F0%%%%%jJ%%%j%%%%J%%%%%%%%%%%j%J%%%%%%%%%%%%%%%%%%%%%%J%%j%%%%%%%%%%%%J%
$$ 60 60 60 60 60 60 59 60 60 60 60 59 59 59 59 59 60 60 60 60 60 60 60 60 60 60 60 60 59 59 60 60 60 60 60 60 60 60 60 60 60 60 60 60 60 60 60 60 60 60 60 60 60 61 61 61 60 60 60 60 60 60 60 60 60 60 60 60 60 61 61
4202F1%%%%j%%%%%%%%%%%%%%%%J%%j%%%%%%%%J%%%j%%%%J%%%%%j%J%%%%j%%%%%%%%%%%%%%
$$ 61 61 61 61 61 60 60 60 60 60 60 60 60 60 60 60 60 60 60 60 60 60 61 61 61 60 60 60 60 60 60 60 60 60 61 61 61 61 60 60 60 60 60 61 61 61 61 61 61 60 60 61 61 61 61 61 60 60 60 60 60 60 60 60 60 60 60 60 60 60 60
4194F0%%%%%%%%j%%%%%J%%%%%%%%%%%%%%%%%%%%%%%%%%%%%%%%%%%%Jj%%%%%%%%%%%%%j%%%
$$ 60 60 60 60 60 60 60 60 60 59 59 59 59 59 59 60 60 60 60 60 60 60 60 60 60 60 60 60 60 60 60 60 60 60 60 60 60 60 60 60 60 60 60 60 60 60 60 60 60 60 60 60 61 60 60 60 60 60 60 60 60 60 60 60 60 60 60 59 59 59 59
4187E9%%%%%%%%%%%%%%%%%%%%%%%%%%%%%%%%%J%%%%j%J%%%%%%%%%%%%%%%%%%%%%%%%%%%%%
$$ 59 59 59 59 59 59 59 59 59 59 59 59 59 59 59 59 59 59 59 59 59 59 59 59 59 59 59 59 59 59 59 59 59 59 60 60 60 60 60 59 59 60 60 60 60 60 60 60 60 60 60 60 60 60 60 60 60 60 60 60 60 60 60 60 60 60 60 60 60 60 60
4179F0%%%%%j%%%%%%%%%%%%%%j%%J%j%%J%%%%%%%%%%%%%%%%%%%%%%%%%J%%%%%%%%%%%%j%%
$$ 60 60 60 60 60 60 59 59 59 59 59 59 59 59 59 59 59 59 59 59 59 58 58 58 59 59 58 58 58 59 59 59 59 59 59 59 59 59 59 59 59 59 59 59 59 59 59 59 59 59 59 59 59 59 59 60 60 60 60 60 60 60 60 60 60 60 60 60 59 59 59
4172E9%%%%%%%%%%%%%%%%%%%%%%%%%%%%%jJ%%%%j%%%%J%%%%%%%%%%J%%%%%%%%%%%%%%J%%%
$$ 59 59 59 59 59 59 59 59 59 59 59 59 59 59 59 59 59 59 59 59 59 59 59 59 59 59 59 59 59 59 58 59 59 59 59 59 58 58 58 58 58 59 59 59 59 59 59 59 59 59 59 59 60 60 60 60 60 60 60 60 60 60 60 60 60 60 60 61 61 61 61
4165F1%%%%j%%%%%%j%%%%%%%%%%%%%%%%%%%jJ%%%%%%%%J%%%%%%%%%%%%%%%%%j%%%%%J%%%%
$$ 61 61 61 61 61 60 60 60 60 60 60 60 59 59 59 59 59 59 59 59 59 59 59 59 59 59 59 59 59 59 59 59 58 59 59 59 59 59 59 59 59 59 60 60 60 60 60 60 60 60 60 60 60 60 60 60 60 60 60 60 59 59 59 59 59 59 60 60 60 60 60
4157F0%%%%%%%%%%%%j%JjJ%%%%%%%%%J%j%%J%j%%%%%%%%%%%%%%%%%%J%j%%J%%%j%%J%j%j%
$$ 60 60 60 60 60 60 60 60 60 60 60 60 60 59 59 60 59 60 60 60 60 60 60 60 60 60 60 61 61 60 60 60 61 61 60 60 60 60 60 60 60 60 60 60 60 60 60 60 60 60 60 60 60 61 61 60 60 60 61 61 61 61 60 60 60 61 61 60 60 59 59
4150E9%%J%%%%%%%%%j%%%%%%%%%%J%%%%%%j%%%%J%%%%%%%%%%%%%%%%%j%%J%%j%J%j%%j%%J
$$ 59 59 59 60 60 60 60 60 60 60 60 60 60 59 59 59 59 59 59 59 59 59 59 59 60 60 60 60 60 60 60 59 59 59 59 59 60 60 60 60 60 60 60 60 60 60 60 60 60 60 60 60 60 60 59 59 59 60 60 60 59 59 60 60 59 59 59 58 58 58 59
4142E9%%%jJ%%%%%%%%%%%%%%%%%J%%j%%%%%%%%%%%%%%%%%%%%%%%%%%%%%%%%%%%%%%%J%%%%
$$ 59 59 59 59 58 59 59 59 59 59 59 59 59 59 59 59 59 59 59 59 59 59 59 60 60 60 59 59 59 59 59 59 59 59 59 59 59 59 59 59 59 59 59 59 59 59 59 59 59 59 59 59 59 59 59 59 59 59 59 59 59 59 59 59 59 59 60 60 60 60 60
4135F0%%%%%%%%%%%J%%%j%%%%%%Jj%%%%%%%%%%%%j%%%%%%J%%%j%%%%%%J%j%%%%%Jj%%%%%%
$$ 60 60 60 60 60 60 60 60 60 60 60 60 61 61 61 61 60 60 60 60 60 60 60 61 60 60 60 60 60 60 60 60 60 60 60 60 60 59 59 59 59 59 59 59 60 60 60 60 59 59 59 59 59 59 59 60 60 59 59 59 59 59 59 60 59 59 59 59 59 59 59
4128E9%%%%%%%Jj%%%%%%%%%%%%%%%%%%%%%%%%%%%%%%%%%%%%%%%J%%%j%%J%%%%%%%%%%%%%%
$$ 59 59 59 59 59 59 59 59 60 59 59 59 59 59 59 59 59 59 59 59 59 59 59 59 59 59 59 59 59 59 59 59 59 59 59 59 59 59 59 59 59 59 59 59 59 59 59 59 59 60 60 60 60 59 59 59 60 60 60 60 60 60 60 60 60 60 60 60 60 60 60
4120F0%%%%%%%jJ%%%%%%%j%%%%%%%%%%%%%%%%%J%%%%%%%%%%%%J%%%%%%%%%J%%%%%%%%j%%%
$$ 60 60 60 60 60 60 60 60 59 60 60 60 60 60 60 60 60 59 59 59 59 59 59 59 59 59 59 59 59 59 59 59 59 59 59 60 60 60 60 60 60 60 60 60 60 60 60 60 61 61 61 61 61 61 61 61 61 61 62 62 62 62 62 62 62 62 62 61 61 61 61
4113F1%%%%%%%%%%%%%j%%%%%%%%%%%%%%%%%J%%%%%%J%%j%%%%%J%%%%%j%%%%%%%%%j%%%%%%
$$ 61 61 61 61 61 61 61 61 61 61 61 61 61 61 60 60 60 60 60 60 60 60 60 60 60 60 60 60 60 60 60 60 61 61 61 61 61 61 61 62 62 62 61 61 61 61 61 61 62 62 62 62 62 62 61 61 61 61 61 61 61 61 61 61 60 60 60 60 60 60 60
4105F0%%j%%%%%%%%%j%%J%%%j%J%%%%%%%Jj%%%%%%%%%%%%j%%%%%%%%%%%%%j%%%%%%%%%%%%
$$ 60 60 60 59 59 59 59 59 59 59 59 59 59 58 58 58 59 59 59 59 58 58 59 59 59 59 59 59 59 59 60 59 59 59 59 59 59 59 59 59 59 59 59 59 58 58 58 58 58 58 58 58 58 58 58 58 58 58 57 57 57 57 57 57 57 57 57 57 57 57 57
4098E7%%J%%%J%%%%J%%%%%%J%%%%%%%%%J%%%%%%%%%%j%%%%%%%%%%J%%%%%%%%%%%J%%%%%%%
$$ 57 57 57 58 58 58 58 59 59 59 59 59 60 60 60 60 60 60 60 61 61 61 61 61 61 61 61 61 61 62 62 62 62 62 62 62 62 62 62 62 61 61 61 61 61 61 61 61 61 61 61 62 62 62 62 62 62 62 62 62 62 62 62 63 63 63 63 63 63 63 63
4090F3%%%%%%%%%j%%%%%%%%%j%%%%%%j%%%%%%%%j%%%%%%%%%%%%%%%%%%%%%j%%%%%%j%%%%%
$$ 63 63 63 63 63 63 63 63 63 63 62 62 62 62 62 62 62 62 62 62 61 61 61 61 61 61 61 60 60 60 60 60 60 60 60 60 59 59 59 59 59 59 59 59 59 59 59 59 59 59 59 59 59 59 59 59 59 59 58 58 58 58 58 58 58 57 57 57 57 57 57
4083E7%%%j%%%%%%%%%%%%%%%%%%%J%%%%%%%%%%J%j%%%%%%%%%%%%%%%J%%%%%%%%%%%%%%%J%
$$ 57 57 57 57 56 56 56 56 56 56 56 56 56 56 56 56 56 56 56 56 56 56 56 56 57 57 57 57 57 57 57 57 57 57 57 58 58 57 57 57 57 57 57 57 57 57 57 57 57 57 57 57 57 58 58 58 58 58 58 58 58 58 58 58 58 58 58 58 58 59 59
4076E9%%%%%%%%%%%%%%%%%%J%%%%%%%j%%J%%%%%%j%%%%%%%%%%%j%J%%%j%J%%%%%%%%%%%%%
$$ 59 59 59 59 59 59 59 59 59 59 59 59 59 59 59 59 59 59 59 60 60 60 60 60 60 60 60 59 59 59 60 60 60 60 60 60 60 59 59 59 59 59 59 59 59 59 59 59 59 58 58 59 59 59 59 58 58 59 59 59 59 59 59 59 59 59 59 59 59 59 59
4068E9%%%J%%%%%%j%%%%Jj%%%%%%%%j%%%%%%%%%%J%%%%%%%j%%J%%%%%%%%%%%%%%%%%%%J%%
$$ 59 59 59 59 60 60 60 60 60 60 60 59 59 59 59 59 60 59 59 59 59 59 59 59 59 59 58 58 58 58 58 58 58 58 58 58 58 59 59 59 59 59 59 59 59 58 58 58 59 59 59 59 59 59 59 59 59 59 59 59 59 59 59 59 59 59 59 59 60 60 60
4061F0%%%%%%%%%%%%%%%%%%j%%%%%%%%%%%%%%j%%%J%%%%%%%%%%J%%%%%%%%%%%J%j%%%%%%%
$$ 60 60 60 60 60 60 60 60 60 60 60 60 60 60 60 60 60 60 60 59 59 59 59 59 59 59 59 59 59 59 59 59 59 59 58 58 58 58 59 59 59 59 59 59 59 59 59 59 59 60 60 60 60 60 60 60 60 60 60 60 60 61 61 60 60 60 60 60 60 60 60
4053F0%%%%%%%j%%%%%%%%%%%%%%%%%%%jJ%%J%%%%%%%%%%%%%%J%j%%%%%%%j%%%%%%%%%%%%%
$$ 60 60 60 60 60 60 60 60 59 59 59 59 59 59 59 59 59 59 59 59 59 59 59 59 59 59 59 59 58 59 59 59 60 60 60 60 60 60 60 60 60 60 60 60 60 60 60 61 61 60 60 60 60 60 60 60 60 59 59 59 59 59 59 59 59 59 59 59 59 59 59
4046E9%%%j%%%%j%J%%%%%%J%%%%%%%%JjJ%%%%%%%%%%%%%%%%%%%%%j%%%%%%%%%%%%%%%%%%%
$$ 59 59 59 59 58 58 58 58 58 57 57 58 58 58 58 58 58 58 59 59 59 59 59 59 59 59 59 60 59 60 60 60 60 60 60 60 60 60 60 60 60 60 60 60 60 60 60 60 60 60 60 59 59 59 59 59 59 59 59 59 59 59 59 59 59 59 59 59 59 59 59
4038E9%%%%%%J%%%%%%%%J%%%%j%%%%%%%%%%%%%j%%%%%%%%%%%%%%%%%%J%%%%%%%%%%%%%%%%
$$ 59 59 59 59 59 59 59 60 60 60 60 60 60 60 60 60 61 61 61 61 61 60 60 60 60 60 60 60 60 60 60 60 60 60 60 59 59 59 59 59 59 59 59 59 59 59 59 59 59 59 59 59 59 59 60 60 60 60 60 60 60 60 60 60 60 60 60 60 60 60 60
4031F0%%%%%%%%%%%%%j%J%%%%%%j%%%%%%%%%%%%%%%%%%%%%%%%%%%%%%%%%%%%%%%%%%%%%Jj
$$ 60 60 60 60 60 60 60 60 60 60 60 60 60 60 59 59 60 60 60 60 60 60 60 59 59 59 59 59 59 59 59 59 59 59 59 59 59 59 59 59 59 59 59 59 59 59 59 59 59 59 59 59 59 59 59 59 59 59 59 59 59 59 59 59 59 59 59 59 59 60 59
4024E9%J%%%%%j%%%%%%%%%%%%%%%%%%%%%%%%%%%%%%%%%%%%%%%%%%%%%%%%%%%%%%%%%%%%j%
$$ 59 59 60 60 60 60 60 60 59 59 59 59 59 59 59 59 59 59 59 59 59 59 59 59 59 59 59 59 59 59 59 59 59 59 59 59 59 59 59 59 59 59 59 59 59 59 59 59 59 59 59 59 59 59 59 59 59 59 59 59 59 59 59 59 59 59 59 59 59 58 58
4016E8J%%%%%%%%%%%%%Jj%%%%%%%Jj%%%%%J%%j%%%J%%%%%j%%%%%%%%%%j%%%J%%%%%%%%%%%
$$ 58 59 59 59 59 59 59 59 59 59 59 59 59 59 59 60 59 59 59 59 59 59 59 59 60 59 59 59 59 59 59 60 60 60 59 59 59 59 60 60 60 60 60 60 59 59 59 59 59 59 59 59 59 59 59 58 58 58 58 59 59 59 59 59 59 59 59 59 59 59 59
4009E9%%%%%%%%%%%%%%%J%%%j%Jj%%%J%%%%j%%%J%%%%%%j%%%%%%%%%%%%%%%%%%%%%%%%%%%
$$ 59 59 59 59 59 59 59 59 59 59 59 59 59 59 59 59 60 60 60 60 59 59 60 59 59 59 59 60 60 60 60 60 59 59 59 59 60 60 60 60 60 60 60 59 59 59 59 59 59 59 59 59 59 59 59 59 59 59 59 59 59 59 59 59 59 59 59 59 59 59 59
4001E9%%%%%%%%%%j%%J%j%%J%%%%%%%%%%%%%%%%%%%%%%%%j%%%Jj%%%%%%%%%%%%%%%%%%%J%
$$ 59 59 59 59 59 59 59 59 59 59 59 58 58 58 59 59 58 58 58 59 59 59 59 59 59 59 59 59 59 59 59 59 59 59 59 59 59 59 59 59 59 59 59 59 58 58 58 58 59 58 58 58 58 58 58 58 58 58 58 58 58 58 58 58 58 58 58 58 58 59 59
3994E9%%%%%%%j%%%%%%J%%j%%%%%%%%%%%%%%%J%%%%%%%%%%j%%%J%%%%%%%%%%%%%%%%%%%%%
$$ 59 59 59 59 59 59 59 59 58 58 58 58 58 58 58 59 59 59 58 58 58 58 58 58 58 58 58 58 58 58 58 58 58 58 59 59 59 59 59 59 59 59 59 59 59 58 58 58 58 59 59 59 59 59 59 59 59 59 59 59 59 59 59 59 59 59 59 59 59 59 59
3987E9%%%%%%%%%%%%%%%%%%%%%%J%%%j%%%%Jj%%%%%%%%%%%%%%%%%%%%j%%%%%%%%%%J%%%j%
$$ 59 59 59 59 59 59 59 59 59 59 59 59 59 59 59 59 59 59 59 59 59 59 59 60 60 60 60 59 59 59 59 59 60 59 59 59 59 59 59 59 59 59 59 59 59 59 59 59 59 59 59 59 59 59 58 58 58 58 58 58 58 58 58 58 58 59 59 59 59 58 58
3979E8%%%%J%%%%%%%%%%%%%%%%%%%%%%%%%%%%%%%%%%Jj%%%%%%%j%%%%%%%%%%%%%%%%%%%%%
$$ 58 58 58 58 58 59 59 59 59 59 59 59 59 59 59 59 59 59 59 59 59 59 59 59 59 59 59 59 59 59 59 59 59 59 59 59 59 59 59 59 60 59 59 59 59 59 59 59 59 58 58 58 58 58 58 58 58 58 58 58 58 58 58 58 58 58 58 58 58 58 58
3972E8%%%%J%%%%%%%%%%J%%%%%%%%%%%%%%%%%%%%j%J%%j%%j%%%%%%%%%%%%%%%%%%%%J%j%%
$$ 58 58 58 58 58 59 59 59 59 59 59 59 59 59 59 59 60 60 60 60 60 60 60 60 60 60 60 60 60 60 60 60 60 60 60 60 60 59 59 60 60 60 59 59 59 58 58 58 58 58 58 58 58 58 58 58 58 58 58 58 58 58 58 58 58 58 59 59 58 58 58
3964E8%%J%%%%%%%%%J%%%%%%%%J%%jJ%%%j%%%%%%%j%%%%%%%%j%%%%%%%j%%J%%%%%%%%%%%%
$$ 58 58 58 59 59 59 59 59 59 59 59 59 59 60 60 60 60 60 60 60 60 60 61 61 61 60 61 61 61 61 60 60 60 60 60 60 60 60 59 59 59 59 59 59 59 59 59 58 58 58 58 58 58 58 58 57 57 57 58 58 58 58 58 58 58 58 58 58 58 58 58
3957E8%%%%J%%%%%%%%%%%J%%%%%%%%%%%%%%jJ%j%%%%%%%%%%%%%%%%%%%%j%%%%%J%%%%%%%%
$$ 58 58 58 58 58 59 59 59 59 59 59 59 59 59 59 59 59 60 60 60 60 60 60 60 60 60 60 60 60 60 60 60 59 60 60 59 59 59 59 59 59 59 59 59 59 59 59 59 59 59 59 59 59 59 59 59 58 58 58 58 58 58 59 59 59 59 59 59 59 59 59
3949E9%%%%%%%%%%%%%%%%%%%jJ%%%%%%%j%J%%%%%j%%%%%%J%%%%%%%%%%%%%%%%%%%%%%%%%%
$$ 59 59 59 59 59 59 59 59 59 59 59 59 59 59 59 59 59 59 59 59 58 59 59 59 59 59 59 59 59 58 58 59 59 59 59 59 59 58 58 58 58 58 58 58 59 59 59 59 59 59 59 59 59 59 59 59 59 59 59 59 59 59 59 59 59 59 59 59 59 59 59
3942E9%%j%%J%%%%%%%%%%%%%%%%j%%%%%J%%%%%%%%%%%%%%%%%%Jj%%%%%%%%%j%%Jj%%%%%%%
$$ 59 59 59 58 58 58 59 59 59 59 59 59 59 59 59 59 59 59 59 59 59 59 59 58 58 58 58 58 58 59 59 59 59 59 59 59 59 59 59 59 59 59 59 59 59 59 59 59 60 59 59 59 59 59 59 59 59 59 59 58 58 58 59 58 58 58 58 58 58 58 58
3935E8%%%%%%%J%%%j%%%%%%%%%%J%%%%%%%%%%J%%%%j%%%%%%%%%%%j%%%%%%%%%j%%%%%%%%%
$$ 58 58 58 58 58 58 58 58 59 59 59 59 58 58 58 58 58 58 58 58 58 58 58 59 59 59 59 59 59 59 59 59 59 59 60 60 60 60 60 59 59 59 59 59 59 59 59 59 59 59 59 58 58 58 58 58 58 58 58 58 58 57 57 57 57 57 57 57 57 57 57
3927E7%%%%%%%%%J%%%%%%%J%%%%%%%%J%%%%j%J%%j%%%%%%%%%%%%%j%%%%%%%%%j%J%%%%%%%
$$ 57 57 57 57 57 57 57 57 57 57 58 58 58 58 58 58 58 58 59 59 59 59 59 59 59 59 59 60 60 60 60 60 59 59 60 60 60 59 59 59 59 59 59 59 59 59 59 59 59 59 59 58 58 58 58 58 58 58 58 58 58 57 57 58 58 58 58 58 58 58 58
3920E8J%%%%%%%%%%%%%J%%%%%%%%%%%%%%%j%J%%%%%%%j%%%%Jj%%%%%%%%%%Jj%%%%%%%%%J%
$$ 58 59 59 59 59 59 59 59 59 59 59 59 59 59 59 60 60 60 60 60 60 60 60 60 60 60 60 60 60 60 60 59 59 60 60 60 60 60 60 60 60 59 59 59 59 59 60 59 59 59 59 59 59 59 59 59 59 59 60 59 59 59 59 59 59 59 59 59 59 60 60
3912F0%%%%%%%%%%%%%%%%%%%%j%%%%%%%%j%%%%%%%%%%%%%%J%%%%%%%%%%%%J%%%%%%%%j%%%
$$ 60 60 60 60 60 60 60 60 60 60 60 60 60 60 60 60 60 60 60 60 60 59 59 59 59 59 59 59 59 59 58 58 58 58 58 58 58 58 58 58 58 58 58 58 58 59 59 59 59 59 59 59 59 59 59 59 59 59 60 60 60 60 60 60 60 60 60 59 59 59 59
3905E9%%%%J%%j%%%%%%%j%%%%%%%%j%%%%%J%%%%%%%%%%J%%%J%%%%J%%%%%%%%%%%%%%%%%%%
$$ 59 59 59 59 59 60 60 60 59 59 59 59 59 59 59 59 58 58 58 58 58 58 58 58 58 57 57 57 57 57 57 58 58 58 58 58 58 58 58 58 58 58 59 59 59 59 60 60 60 60 60 61 61 61 61 61 61 61 61 61 61 61 61 61 61 61 61 61 61 61 61
3898F1%%%%%%%%j%%%%%j%%%%%%%%%%%%%%%%j%J%%%%%%J%%%%%%%%%J%%%%%%%%%%%%%%%%%%%
$$ 61 61 61 61 61 61 61 61 61 60 60 60 60 60 60 59 59 59 59 59 59 59 59 59 59 59 59 59 59 59 59 59 58 58 59 59 59 59 59 59 59 60 60 60 60 60 60 60 60 60 60 61 61 61 61 61 61 61 61 61 61 61 61 61 61 61 61 61 61 61 61
3890F1%%%%%%%%j%%%%%%%%%%%%%jj%%%%j%%%%%%%%%%j%%%%%Jj%%J%%%%%%%%%%J%%%%%%%J%
$$ 61 61 61 61 61 61 61 61 61 60 60 60 60 60 60 60 60 60 60 60 60 60 60 59 58 58 58 58 58 57 57 57 57 57 57 57 57 57 57 57 56 56 56 56 56 56 57 56 56 56 57 57 57 57 57 57 57 57 57 57 57 58 58 58 58 58 58 58 58 59 59
3883E9%%%%J%%%%jJ%%%%%%%%j%%%%%%j%%%j%%%%%%%J%%%%%%%%%%%%%%%%%%%%%%j%%%%%%%%
$$ 59 59 59 59 59 60 60 60 60 60 59 60 60 60 60 60 60 60 60 60 59 59 59 59 59 59 59 58 58 58 58 57 57 57 57 57 57 57 57 58 58 58 58 58 58 58 58 58 58 58 58 58 58 58 58 58 58 58 58 58 58 58 57 57 57 57 57 57 57 57 57
3875E7%%%%J%%%%%%%%%J%%%%%%%%%%%J%%%%%%%%%J%%%%%%%%%%%%%j%%%%%j%%%%%%j%%%%%j
$$ 57 57 57 57 57 58 58 58 58 58 58 58 58 58 58 59 59 59 59 59 59 59 59 59 59 59 59 60 60 60 60 60 60 60 60 60 60 61 61 61 61 61 61 61 61 61 61 61 61 61 61 60 60 60 60 60 60 59 59 59 59 59 59 59 58 58 58 58 58 58 57
3868E7%%%%%%%%jJ%jJ%%%%%%%%J%%%J%%%%%%%%J%%%%%%%%%%%%%%%%j%%%%%%Jj%%%%j%%%%%
$$ 57 57 57 57 57 57 57 57 57 56 57 57 56 57 57 57 57 57 57 57 57 57 58 58 58 58 59 59 59 59 59 59 59 59 59 60 60 60 60 60 60 60 60 60 60 60 60 60 60 60 60 60 59 59 59 59 59 59 59 60 59 59 59 59 59 58 58 58 58 58 58
3860E8%%%%%J%j%%%%%%%%%%%J%%%%%j%%%%%%%J%%%%%%%%%j%%%%%j%%J%%%%%%j%%j%J%%%J%
$$ 58 58 58 58 58 58 59 59 58 58 58 58 58 58 58 58 58 58 58 58 59 59 59 59 59 59 58 58 58 58 58 58 58 58 59 59 59 59 59 59 59 59 59 59 58 58 58 58 58 58 57 57 57 58 58 58 58 58 58 58 57 57 57 56 56 57 57 57 57 58 58
3853E8%%%%%%%J%%%%%%%%%%%%%%%%%%%%j%%%%%%%j%%%%%%Jj%%%%%%%%%j%%%J%%%%J%%%%%%
$$ 58 58 58 58 58 58 58 58 59 59 59 59 59 59 59 59 59 59 59 59 59 59 59 59 59 59 59 59 59 58 58 58 58 58 58 58 58 57 57 57 57 57 57 57 58 57 57 57 57 57 57 57 57 57 57 56 56 56 56 57 57 57 57 57 58 58 58 58 58 58 58
3846E8%%%%%%%%%%%%%J%%%%j%J%%%%%%%%%%%%%%%%%%%%%%%%%%%%%%%%%%%%%%%%%%%%%%%%%
$$ 58 58 58 58 58 58 58 58 58 58 58 58 58 58 59 59 59 59 59 58 58 59 59 59 59 59 59 59 59 59 59 59 59 59 59 59 59 59 59 59 59 59 59 59 59 59 59 59 59 59 59 59 59 59 59 59 59 59 59 59 59 59 59 59 59 59 59 59 59 59 59
3838E9%%%%%%%%%%%j%J%%%j%%%%%J%%%%%%%%%%%%%%%J%%%%%%%%%%%j%%%%%%%%j%%%%%%%%%
$$ 59 59 59 59 59 59 59 59 59 59 59 59 58 58 59 59 59 59 58 58 58 58 58 58 59 59 59 59 59 59 59 59 59 59 59 59 59 59 59 59 60 60 60 60 60 60 60 60 60 60 60 60 59 59 59 59 59 59 59 59 59 58 58 58 58 58 58 58 58 58 58
3831E8%%j%%Jj%%%J%%%%%%%%%%%%J%%%%%%%%%%%%%j%J%%%%%%%%%%%%%%%%%%%%%%j%%%%%J%
$$ 58 58 58 57 57 57 58 57 57 57 57 58 58 58 58 58 58 58 58 58 58 58 58 58 59 59 59 59 59 59 59 59 59 59 59 59 59 59 58 58 59 59 59 59 59 59 59 59 59 59 59 59 59 59 59 59 59 59 59 59 59 59 59 58 58 58 58 58 58 59 59
3823E9j%%%%%%%%%%j%%%%J%%%%%%%%Jj%%%%%%J%j%%%J%%j%%J%%%%%%j%%%%J%%%j%%%%%%%%
$$ 59 58 58 58 58 58 58 58 58 58 58 58 57 57 57 57 57 58 58 58 58 58 58 58 58 58 59 58 58 58 58 58 58 58 59 59 58 58 58 58 59 59 59 58 58 58 59 59 59 59 59 59 59 58 58 58 58 58 59 59 59 59 58 58 58 58 58 58 58 58 58
3816E8%%%%%%j%J%j%%J%%%%%%%%%%%%%%%Jj%%%%%%%Jj%%%%%%%%J%%j%%%%%%J%%j%%%%%%%%
$$ 58 58 58 58 58 58 58 57 57 58 58 57 57 57 58 58 58 58 58 58 58 58 58 58 58 58 58 58 58 58 59 58 58 58 58 58 58 58 58 59 58 58 58 58 58 58 58 58 58 59 59 59 58 58 58 58 58 58 58 59 59 59 58 58 58 58 58 58 58 58 58
3809E8%%%%J%j%%%%%%J%%%%%%%%%j%%%%%%%%%%%J%%%%%%%%%%%%j%%%%Jj%%%J%%%j%%%%%%%
$$ 58 58 58 58 58 59 59 58 58 58 58 58 58 58 59 59 59 59 59 59 59 59 59 59 58 58 58 58 58 58 58 58 58 58 58 58 59 59 59 59 59 59 59 59 59 59 59 59 59 58 58 58 58 58 59 58 58 58 58 59 59 59 59 58 58 58 58 58 58 58 58
3801E8%%%%%%%%%%%%%Jj%%%%%%%%%%%%%%%%%%%%%%%J%%%j%%%%%%%%%%%%%%%%%%%%%%%%%%J
$$ 58 58 58 58 58 58 58 58 58 58 58 58 58 58 59 58 58 58 58 58 58 58 58 58 58 58 58 58 58 58 58 58 58 58 58 58 58 58 58 59 59 59 59 58 58 58 58 58 58 58 58 58 58 58 58 58 58 58 58 58 58 58 58 58 58 58 58 58 58 58 59
3794E9%%%%%%%%j%Jj%%%%%%%%%%%%%%%%%%%%%%%%%%%J%j%%J%%%%%%%%j%%%%%%%%%%%%%%%%
$$ 59 59 59 59 59 59 59 59 59 58 58 59 58 58 58 58 58 58 58 58 58 58 58 58 58 58 58 58 58 58 58 58 58 58 58 58 58 58 58 58 59 59 58 58 58 59 59 59 59 59 59 59 59 59 58 58 58 58 58 58 58 58 58 58 58 58 58 58 58 58 58
3786E8%%%%%%%J%%%%j%J%%%%%j%%%%%J%%%j%%%%%%%%%%%%%J%%%%%%%%%j%%%%%%%%%JjJ%%j
$$ 58 58 58 58 58 58 58 58 59 59 59 59 59 58 58 59 59 59 59 59 59 58 58 58 58 58 58 59 59 59 59 58 58 58 58 58 58 58 58 58 58 58 58 58 58 59 59 59 59 59 59 59 59 59 59 58 58 58 58 58 58 58 58 58 58 59 58 59 59 59 58
3779E8%%%%%%J%%%%%%%%%%%%%%%%%%%%%%%%j%%%%%%%%%%%%%%%%%%%%%%%%%%%%%%J%j%%%J%
$$ 58 58 58 58 58 58 58 59 59 59 59 59 59 59 59 59 59 59 59 59 59 59 59 59 59 59 59 59 59 59 59 59 58 58 58 58 58 58 58 58 58 58 58 58 58 58 58 58 58 58 58 58 58 58 58 58 58 58 58 58 58 58 58 59 59 58 58 58 58 59 59
3771E9%j%%%%%%%%%%%%%%%%%%%%%%%%%%%%%%j%J%%%%%j%%%%%%%%%%%%%%%J%%%%%%%%%%%%%
$$ 59 59 58 58 58 58 58 58 58 58 58 58 58 58 58 58 58 58 58 58 58 58 58 58 58 58 58 58 58 58 58 58 58 57 57 58 58 58 58 58 58 57 57 57 57 57 57 57 57 57 57 57 57 57 57 57 57 58 58 58 58 58 58 58 58 58 58 58 58 58 58
3764E8%%%%%%%J%%j%%%%%%%%%%Jj%%%j%%%%%%%%%%%%%J%%%%%j%%J%%%%j%J%%%%%%%J%%%%%
$$ 58 58 58 58 58 58 58 58 59 59 59 58 58 58 58 58 58 58 58 58 58 58 59 58 58 58 58 57 57 57 57 57 57 57 57 57 57 57 57 57 57 58 58 58 58 58 58 57 57 57 58 58 58 58 58 57 57 58 58 58 58 58 58 58 58 59 59 59 59 59 59
3757E9%j%%%%%%%%%%%%%%%%%%%%%%%j%%%%%%%%J%%%%%%%%%%%%%J%%%%%%%%%%%%%%%%j%%%%
$$ 59 59 58 58 58 58 58 58 58 58 58 58 58 58 58 58 58 58 58 58 58 58 58 58 58 58 57 57 57 57 57 57 57 57 57 58 58 58 58 58 58 58 58 58 58 58 58 58 58 59 59 59 59 59 59 59 59 59 59 59 59 59 59 59 59 59 58 58 58 58 58
3749E8%%J%%j%%%%%%%%%%%%%%j%%%%%J%%%%%%%%J%%%%%%%%%%%%%j%%%%%%%%%%%%j%%%%%%%
$$ 58 58 58 59 59 59 58 58 58 58 58 58 58 58 58 58 58 58 58 58 58 57 57 57 57 57 57 58 58 58 58 58 58 58 58 58 59 59 59 59 59 59 59 59 59 59 59 59 59 59 58 58 58 58 58 58 58 58 58 58 58 58 58 57 57 57 57 57 57 57 57
3742E7%%%%%%%%%%%%%%%%%%J%%%%%%%%%%%%%%%%%%%%%%%%%%%%%%%%%j%%%J%%%%%%%j%%%%%
$$ 57 57 57 57 57 57 57 57 57 57 57 57 57 57 57 57 57 57 57 58 58 58 58 58 58 58 58 58 58 58 58 58 58 58 58 58 58 58 58 58 58 58 58 58 58 58 58 58 58 58 58 58 58 57 57 57 57 58 58 58 58 58 58 58 58 57 57 57 57 57 57
3734E7%%%%%%%%%%J%%%%%%%%%%%%%%%J%j%%Jj%J%%%j%%%%%%jJ%%%%%%%%%%%%j%%%%%%%J%%
$$ 57 57 57 57 57 57 57 57 57 57 57 58 58 58 58 58 58 58 58 58 58 58 58 58 58 58 58 59 59 58 58 58 59 58 58 59 59 59 59 58 58 58 58 58 58 58 57 58 58 58 58 58 58 58 58 58 58 58 58 58 57 57 57 57 57 57 57 57 58 58 58
3727E8%%%%%%%%%%%%%%%%J%j%%%%%%%%%%%%%j%%%%%%%%%%%%%%%%%%%%%%%%%%%%%%%%%%%%%
$$ 58 58 58 58 58 58 58 58 58 58 58 58 58 58 58 58 58 59 59 58 58 58 58 58 58 58 58 58 58 58 58 58 58 57 57 57 57 57 57 57 57 57 57 57 57 57 57 57 57 57 57 57 57 57 57 57 57 57 57 57 57 57 57 57 57 57 57 57 57 57 57
3720E7%%%%%%%%%%%%%%%%%J%%%%%jJ%%%%%%%%%%%%%%%%j%%%Jj%%%%%%%%%%%%%%%%%%%%%%%
$$ 57 57 57 57 57 57 57 57 57 57 57 57 57 57 57 57 57 57 58 58 58 58 58 58 57 58 58 58 58 58 58 58 58 58 58 58 58 58 58 58 58 58 57 57 57 57 58 57 57 57 57 57 57 57 57 57 57 57 57 57 57 57 57 57 57 57 57 57 57 57 57
3712E7%%%%%%J%%%%%%%%%%%%%%%%%J%%j%%%%%%%%%%%%%%%%%%%%%%%%%%%%%%%%%j%%%%J%%%
$$ 57 57 57 57 57 57 57 58 58 58 58 58 58 58 58 58 58 58 58 58 58 58 58 58 58 59 59 59 58 58 58 58 58 58 58 58 58 58 58 58 58 58 58 58 58 58 58 58 58 58 58 58 58 58 58 58 58 58 58 58 58 58 57 57 57 57 57 58 58 58 58
3705E8%%%%%%%%%%J%%%j%J%%%%%%%J%JJJJJJJKJ%%kjkjjk%j%j%%%j%%%%%%j%Jj%%j%J%%%%
$$ 58 58 58 58 58 58 58 58 58 58 58 59 59 59 59 58 58 59 59 59 59 59 59 59 59 60 60 61 62 63 64 65 66 67 69 70 70 70 68 67 65 64 63 61 61 60 60 59 59 59 59 58 58 58 58 58 58 58 57 57 58 57 57 57 56 56 57 57 57 57 57
3697E7%%J%%%%%j%J%%jJ%%%%%%%%%%%%%%%%%%J%%%j%%%%%%%%%%%%j%%%%%%%%%%%%%%Jj%%%
$$ 57 57 57 58 58 58 58 58 58 57 57 58 58 58 57 58 58 58 58 58 58 58 58 58 58 58 58 58 58 58 58 58 58 58 59 59 59 59 58 58 58 58 58 58 58 58 58 58 58 58 58 57 57 57 57 57 57 57 57 57 57 57 57 57 57 57 58 57 57 57 57
3690E7%J%%%%%%%%J%%%%%%%%%%%%%%%%j%%%Jj%%%%%%%%jJ%%%%%%jJ%%%%%%j%%%J%%%%%%%%
$$ 57 57 58 58 58 58 58 58 58 58 58 59 59 59 59 59 59 59 59 59 59 59 59 59 59 59 59 59 58 58 58 58 59 58 58 58 58 58 58 58 58 58 57 58 58 58 58 58 58 58 57 58 58 58 58 58 58 58 57 57 57 57 58 58 58 58 58 58 58 58 58
3682E8%%%%J%%%j%%%%%%%J%%%%%%jJ%%j%%%%%%%%%%%%%%j%%%%%%%%%J%%%%%%%%j%J%%%%%%
$$ 58 58 58 58 58 59 59 59 59 58 58 58 58 58 58 58 58 59 59 59 59 59 59 59 58 59 59 59 58 58 58 58 58 58 58 58 58 58 58 58 58 58 58 57 57 57 57 57 57 57 57 57 57 58 58 58 58 58 58 58 58 58 57 57 58 58 58 58 58 58 58
3675E8%%%%%%%%%%%%%%%%%%%j%%%%%%%%%%%%%%%%J%%j%%%J%j%%%%%%J%%j%%%%%J%j%%%%%%
$$ 58 58 58 58 58 58 58 58 58 58 58 58 58 58 58 58 58 58 58 58 57 57 57 57 57 57 57 57 57 57 57 57 57 57 57 57 57 58 58 58 57 57 57 57 58 58 57 57 57 57 57 57 57 58 58 58 57 57 57 57 57 57 58 58 57 57 57 57 57 57 57
3668E7J%%%%%%%j%J%%%%%j%%%%%%Jj%%%%%%%J%%%%%%%%%%%%%%%%%%%j%Jj%%J%%%%%j%%%%%
$$ 57 58 58 58 58 58 58 58 58 57 57 58 58 58 58 58 58 57 57 57 57 57 57 57 58 57 57 57 57 57 57 57 57 58 58 58 58 58 58 58 58 58 58 58 58 58 58 58 58 58 58 58 58 57 57 58 57 57 57 58 58 58 58 58 58 57 57 57 57 57 57
3660E7%%%%%%%%%%%%%%%%%%%%%J%%%%%%%%%%%%%%%%%%%%%%j%%%J%%%j%%%%%%%%%%%%Jj%%%
$$ 57 57 57 57 57 57 57 57 57 57 57 57 57 57 57 57 57 57 57 57 57 57 58 58 58 58 58 58 58 58 58 58 58 58 58 58 58 58 58 58 58 58 58 58 58 57 57 57 57 58 58 58 58 57 57 57 57 57 57 57 57 57 57 57 57 57 58 57 57 57 57
3653E7%%%%J%%%%%%%%%%%%%%%%%%%%%%%%%%%%%%%%%%%%%%%%%%j%%%%%%%%%%%%%%%%%%%%%%
$$ 57 57 57 57 57 58 58 58 58 58 58 58 58 58 58 58 58 58 58 58 58 58 58 58 58 58 58 58 58 58 58 58 58 58 58 58 58 58 58 58 58 58 58 58 58 58 58 58 57 57 57 57 57 57 57 57 57 57 57 57 57 57 57 57 57 57 57 57 57 57 57
3645E7%%J%%%%%%%%J%%%%%%%%%%%%%j%%%%%j%%%%%%%%%%%%%%%%%%%%%%%%%J%%j%%%J%%%%%
$$ 57 57 57 58 58 58 58 58 58 58 58 58 59 59 59 59 59 59 59 59 59 59 59 59 59 59 58 58 58 58 58 58 57 57 57 57 57 57 57 57 57 57 57 57 57 57 57 57 57 57 57 57 57 57 57 57 57 57 58 58 58 57 57 57 57 58 58 58 58 58 58
3638E8%%%%%%%%%%%%%%%%%%%%%%%j%%%%%%%%%%%%%%%J%%%%%%%%%Jj%%J%%%J%%%J%%%%j%%%
$$ 58 58 58 58 58 58 58 58 58 58 58 58 58 58 58 58 58 58 58 58 58 58 58 58 57 57 57 57 57 57 57 57 57 57 57 57 57 57 57 57 58 58 58 58 58 58 58 58 58 58 59 58 58 58 59 59 59 59 60 60 60 60 61 61 61 61 61 60 60 60 60
3631F0%%%%%%%j%j%%%%%%%%%%j%%%%%j%%%%%%%%%%%%%%J%%J%%%%%%%%%%%%J%Jj%%%%%%J%%
$$ 60 60 60 60 60 60 60 60 59 59 58 58 58 58 58 58 58 58 58 58 58 57 57 57 57 57 57 56 56 56 56 56 56 56 56 56 56 56 56 56 56 56 57 57 57 58 58 58 58 58 58 58 58 58 58 58 58 58 59 59 60 59 59 59 59 59 59 59 60 60 60
3623F0%j%%%%%%%%%%%j%%%%%j%%%%%%%j%%%%%%%%%J%%j%%%%%J%%%%%%%%%%%%Jj%%%%%J%%%
$$ 60 60 59 59 59 59 59 59 59 59 59 59 59 59 58 58 58 58 58 58 57 57 57 57 57 57 57 57 56 56 56 56 56 56 56 56 56 56 57 57 57 56 56 56 56 56 56 57 57 57 57 57 57 57 57 57 57 57 57 57 58 57 57 57 57 57 57 58 58 58 58
3616E8%%%J%%%%%%%%%%j%%%%j%%%%%%j%%%%%jJj%%J%%%%%%%%%%%%%%%%%%%%%%%%%%%%%%jJ
$$ 58 58 58 58 59 59 59 59 59 59 59 59 59 59 59 58 58 58 58 58 57 57 57 57 57 57 57 56 56 56 56 56 56 55 56 55 55 55 56 56 56 56 56 56 56 56 56 56 56 56 56 56 56 56 56 56 56 56 56 56 56 56 56 56 56 56 56 56 56 55 56
3608E6%%%J%%j%%Jj%%J%%%%%%%%%%J%j%J%%%%%%%%%%%%%%%%J%j%%%%%%%%%%%j%%%%%j%%Jj
$$ 56 56 56 56 57 57 57 56 56 56 57 56 56 56 57 57 57 57 57 57 57 57 57 57 57 58 58 57 57 58 58 58 58 58 58 58 58 58 58 58 58 58 58 58 58 58 59 59 58 58 58 58 58 58 58 58 58 58 58 58 57 57 57 57 57 57 56 56 56 57 56
3601E6%%%%%%j%%%%%J%%%%%%%%%%%%J%%%%J%%%%%J%%%%%%%J%%%j%%%%%%%%%j%%%%j%%%%%%
$$ 56 56 56 56 56 56 56 55 55 55 55 55 55 56 56 56 56 56 56 56 56 56 56 56 56 56 57 57 57 57 57 58 58 58 58 58 58 59 59 59 59 59 59 59 59 60 60 60 60 59 59 59 59 59 59 59 59 59 59 58 58 58 58 58 57 57 57 57 57 57 57
3593E7j%%%%%%j%%%%%%%%%J%%%%%%%%J%%%%%%%J%%%%%%%%%%%%%%%%%%%%%%j%%%%%%%%%%%%
$$ 57 56 56 56 56 56 56 56 55 55 55 55 55 55 55 55 55 55 56 56 56 56 56 56 56 56 56 57 57 57 57 57 57 57 57 58 58 58 58 58 58 58 58 58 58 58 58 58 58 58 58 58 58 58 58 58 58 58 57 57 57 57 57 57 57 57 57 57 57 57 57
3586E7%%%%j%%%J%%%%%%%%%%%%%%%%J%%%%%%%%%%%j%%%%%%%%%%%j%%%%%%%%%%%%%%%%%%%%
$$ 57 57 57 57 57 56 56 56 56 57 57 57 57 57 57 57 57 57 57 57 57 57 57 57 57 57 58 58 58 58 58 58 58 58 58 58 58 58 57 57 57 57 57 57 57 57 57 57 57 57 56 56 56 56 56 56 56 56 56 56 56 56 56 56 56 56 56 56 56 56 56
3579E6%%%J%%%%%%%%%%%%%%%%J%%%%%%%%%%%%%%%%j%%%%%%%%%j%%%%%%%%%%%%%%%%%%%%%%
$$ 56 56 56 56 57 57 57 57 57 57 57 57 57 57 57 57 57 57 57 57 57 58 58 58 58 58 58 58 58 58 58 58 58 58 58 58 58 58 57 57 57 57 57 57 57 57 57 57 56 56 56 56 56 56 56 56 56 56 56 56 56 56 56 56 56 56 56 56 56 56 56
3571E6%%%%%%%%%%J%%%%%%%J%%j%%%J%%%%%%%%Jj%%%%%%%%%%%%%%%%%%j%%%%%j%%%%%%%%%
$$ 56 56 56 56 56 56 56 56 56 56 56 57 57 57 57 57 57 57 57 58 58 58 57 57 57 57 58 58 58 58 58 58 58 58 58 59 58 58 58 58 58 58 58 58 58 58 58 58 58 58 58 58 58 58 58 57 57 57 57 57 57 56 56 56 56 56 56 56 56 56 56
3564E6j%%%J%%%%%%%%J%%%%%J%jJ%%%%%%J%%%%%%%%%%%%%%%%%%%%%%j%%%%%%j%%%%%%%%%j
$$ 56 55 55 55 55 56 56 56 56 56 56 56 56 56 57 57 57 57 57 57 58 58 57 58 58 58 58 58 58 58 59 59 59 59 59 59 59 59 59 59 59 59 59 59 59 59 59 59 59 59 59 59 59 58 58 58 58 58 58 58 57 57 57 57 57 57 57 57 57 57 56
3556E6%%%%%%%%%%%%%%%%J%%%%%%J%%%%%%%%%%J%%%%%j%%%%%%%jJ%%%%%%%%%j%%j%%%%%%%
$$ 56 56 56 56 56 56 56 56 56 56 56 56 56 56 56 56 56 57 57 57 57 57 57 57 58 58 58 58 58 58 58 58 58 58 58 59 59 59 59 59 59 58 58 58 58 58 58 58 58 57 58 58 58 58 58 58 58 58 58 58 57 57 57 56 56 56 56 56 56 56 56
3549E6%J%%%j%%J%%%%%%%%%%%%%%jJ%%%j%J%j%%%%%%%J%j%%%%j%J%%%%%%%%Jj%J%j%%%Jj%
$$ 56 56 57 57 57 57 56 56 56 57 57 57 57 57 57 57 57 57 57 57 57 57 57 57 56 57 57 57 57 56 56 57 57 56 56 56 56 56 56 56 56 57 57 56 56 56 56 56 55 55 56 56 56 56 56 56 56 56 56 57 56 56 57 57 56 56 56 56 57 56 56
3542E6%%J%%%%%%%%%j%%%%%%%%%%%%j%J%%%%%Jj%%%%%%%%%%J%%%%j%J%%%%%%%%%%%%%%%%%
$$ 56 56 56 57 57 57 57 57 57 57 57 57 57 56 56 56 56 56 56 56 56 56 56 56 56 56 55 55 56 56 56 56 56 56 57 56 56 56 56 56 56 56 56 56 56 56 57 57 57 57 57 56 56 57 57 57 57 57 57 57 57 57 57 57 57 57 57 57 57 57 57
3534E7%%%%%%%%j%%%%%%%%%%%%%%%%%%%%J%%jJ%%%%%%J%%%%%%%%%%%%%J%j%%%Jj%%%%%%%j
$$ 57 57 57 57 57 57 57 57 57 56 56 56 56 56 56 56 56 56 56 56 56 56 56 56 56 56 56 56 56 56 57 57 57 56 57 57 57 57 57 57 57 58 58 58 58 58 58 58 58 58 58 58 58 58 58 59 59 58 58 58 58 59 58 58 58 58 58 58 58 58 57
3527E7%%%%%%%j%%%%%%%%jJ%%%%%%%j%%%%%%J%%%%%%J%%%%%%%jJ%%%%%J%%%%%%%%%%%%%%%
$$ 57 57 57 57 57 57 57 57 56 56 56 56 56 56 56 56 56 55 56 56 56 56 56 56 56 56 55 55 55 55 55 55 55 56 56 56 56 56 56 56 57 57 57 57 57 57 57 57 56 57 57 57 57 57 57 58 58 58 58 58 58 58 58 58 58 58 58 58 58 58 58
3519E8%%%j%%%%%%%%%%%j%%%J%j%%%%%%%%%%%%%%%%%%Jj%%%%%%J%%%%%%Jj%%%%J%%%%j%%%
$$ 58 58 58 58 57 57 57 57 57 57 57 57 57 57 57 57 56 56 56 56 57 57 56 56 56 56 56 56 56 56 56 56 56 56 56 56 56 56 56 56 56 57 56 56 56 56 56 56 56 57 57 57 57 57 57 57 58 57 57 57 57 57 58 58 58 58 58 57 57 57 57
3512E7%%%%%%%%%%%%J%%%%%j%%J%%%%%%j%%%%%%%%%%%%%%%%%%%%%%%%%%%j%J%%%%%%%%%%%
$$ 57 57 57 57 57 57 57 57 57 57 57 57 57 58 58 58 58 58 58 57 57 57 58 58 58 58 58 58 58 57 57 57 57 57 57 57 57 57 57 57 57 57 57 57 57 57 57 57 57 57 57 57 57 57 57 57 57 56 56 57 57 57 57 57 57 57 57 57 57 57 57
3504E7%%%%%%%%%%%%%%%%%%%%%J%%%%%%J%%%jJ%%%J%%%JJ%J%JJJKKKKKLKKLKKKJJ%%jkkjl
$$ 57 57 57 57 57 57 57 57 57 57 57 57 57 57 57 57 57 57 57 57 57 57 58 58 58 58 58 58 58 59 59 59 59 58 59 59 59 59 60 60 60 60 61 62 62 63 63 64 65 66 68 70 72 74 76 79 81 83 86 88 90 92 93 94 94 94 93 91 89 88 85
3497H5klklkkkkkjjjjj%j%%%j%%%%%%j%%%%%%%%%%%j%%%J%%%%j%%Jj%%%%%%J%%%j%%Jj%%%
$$ 85 83 80 78 75 73 71 69 67 65 64 63 62 61 60 60 59 59 59 59 58 58 58 58 58 58 58 57 57 57 57 57 57 57 57 57 57 57 57 56 56 56 56 57 57 57 57 57 56 56 56 57 56 56 56 56 56 56 56 57 57 57 57 56 56 56 57 56 56 56 56
3490E6%%%%%%%%%%%%%%%%J%%%%%%%%%%%%%%%jJ%j%%%%%%%J%%%%%%%%%%J%%%%%%%%%%%%%%%
$$ 56 56 56 56 56 56 56 56 56 56 56 56 56 56 56 56 56 57 57 57 57 57 57 57 57 57 57 57 57 57 57 57 57 56 57 57 56 56 56 56 56 56 56 56 57 57 57 57 57 57 57 57 57 57 57 58 58 58 58 58 58 58 58 58 58 58 58 58 58 58 58
3482E8%%%%%%%%%%%%%%%%j%%%%%j%%%%%%%%%%%%%%%%%%%%J%%%%%%%%%%%%%%%%%%%%%%%%%%
$$ 58 58 58 58 58 58 58 58 58 58 58 58 58 58 58 58 58 57 57 57 57 57 57 56 56 56 56 56 56 56 56 56 56 56 56 56 56 56 56 56 56 56 56 56 57 57 57 57 57 57 57 57 57 57 57 57 57 57 57 57 57 57 57 57 57 57 57 57 57 57 57
3475E7%%%j%%%%%%%j%%%%%%%%%%%%%%%%%%%%%J%%%%%%%%%jJ%%%%%%%%%%%%jJ%%%%%%%%%%%
$$ 57 57 57 57 56 56 56 56 56 56 56 56 55 55 55 55 55 55 55 55 55 55 55 55 55 55 55 55 55 55 55 55 55 55 56 56 56 56 56 56 56 56 56 56 55 56 56 56 56 56 56 56 56 56 56 56 56 56 55 56 56 56 56 56 56 56 56 56 56 56 56
3467E6%j%%%%%%%%%%%%%J%%%%%%%J%%%%%%%%%%%%%%%Jj%%%%%%%%j%%%%%j%J%%%%%%%%%%%%
$$ 56 56 55 55 55 55 55 55 55 55 55 55 55 55 55 55 56 56 56 56 56 56 56 56 57 57 57 57 57 57 57 57 57 57 57 57 57 57 57 57 58 57 57 57 57 57 57 57 57 57 56 56 56 56 56 56 55 55 56 56 56 56 56 56 56 56 56 56 56 56 56
3460E6%%%%%%%J%%%%%%J%%%%%%%%%j%%%%%%%%%%%%%%%%%%%%%j%%%%%%%%%%%%%%%%%%%%%%%
$$ 56 56 56 56 56 56 56 56 57 57 57 57 57 57 57 58 58 58 58 58 58 58 58 58 58 57 57 57 57 57 57 57 57 57 57 57 57 57 57 57 57 57 57 57 57 57 57 56 56 56 56 56 56 56 56 56 56 56 56 56 56 56 56 56 56 56 56 56 56 56 56
3453E6%%%%%%%%%J%%%j%%%%%%%%%%J%%%j%%%%%%%j%%%J%%%%jJ%%%%%%%%%j%%J%%%%%%%%%%
$$ 56 56 56 56 56 56 56 56 56 56 57 57 57 57 56 56 56 56 56 56 56 56 56 56 56 57 57 57 57 56 56 56 56 56 56 56 56 55 55 55 55 56 56 56 56 56 55 56 56 56 56 56 56 56 56 56 56 55 55 55 56 56 56 56 56 56 56 56 56 56 56
3445E6%%%%%%%%%%%%%%%%J%j%%%%%%%%%%%%%%%j%%%%%%%%J%%%%%%%%j%%%%%%J%%j%%%%%%%
$$ 56 56 56 56 56 56 56 56 56 56 56 56 56 56 56 56 56 57 57 56 56 56 56 56 56 56 56 56 56 56 56 56 56 56 56 55 55 55 55 55 55 55 55 55 56 56 56 56 56 56 56 56 56 55 55 55 55 55 55 55 56 56 56 55 55 55 55 55 55 55 55
3438E5%J%%%%%%%%%%JjJ%%%%j%%%%%%%%jJj%%J%%%%j%J%%%%jJ%%%%%%%j%J%%%%%J%%%%jJ%
$$ 55 55 56 56 56 56 56 56 56 56 56 56 56 57 56 57 57 57 57 57 56 56 56 56 56 56 56 56 56 55 56 55 55 55 56 56 56 56 56 55 55 56 56 56 56 56 55 56 56 56 56 56 56 56 56 55 55 56 56 56 56 56 56 57 57 57 57 57 56 57 57
3430E7%%j%J%%j%%%J%j%%%%%%%%%j%%J%%j%%%%%%%%%%%%%J%%j%%%%J%%%%%%%jJ%%%%Jj%%%
$$ 57 57 57 56 56 57 57 57 56 56 56 56 57 57 56 56 56 56 56 56 56 56 56 56 55 55 55 56 56 56 55 55 55 55 55 55 55 55 55 55 55 55 55 55 56 56 56 55 55 55 55 55 56 56 56 56 56 56 56 56 55 56 56 56 56 56 57 56 56 56 56
3423E6%%%%J%%%%j%%%%%%%%%%%%%%%%%jJ%%%%%J%%%%%%%jJ%%j%%%%%%%%%%%%%J%j%J%%%%%
$$ 56 56 56 56 56 57 57 57 57 57 56 56 56 56 56 56 56 56 56 56 56 56 56 56 56 56 56 56 55 56 56 56 56 56 56 57 57 57 57 57 57 57 57 56 57 57 57 56 56 56 56 56 56 56 56 56 56 56 56 56 56 57 57 56 56 57 57 57 57 57 57
3415E7%%%%%%%j%%%J%%%%j%%J%%%%%%%j%%%%%%%Jj%%%%%J%%%%%%%%%%%%%%%%%%%%%%%%%%%
$$ 57 57 57 57 57 57 57 57 56 56 56 56 57 57 57 57 57 56 56 56 57 57 57 57 57 57 57 57 56 56 56 56 56 56 56 56 57 56 56 56 56 56 56 57 57 57 57 57 57 57 57 57 57 57 57 57 57 57 57 57 57 57 57 57 57 57 57 57 57 57 57
3408E7%%%%%%%%%%%%%%%%j%%%%%%%%%%%%%%%%%%%%%%%%%%%%%%%%%%%%%J%%%%%%%%%j%%jJ%
$$ 57 57 57 57 57 57 57 57 57 57 57 57 57 57 57 57 57 56 56 56 56 56 56 56 56 56 56 56 56 56 56 56 56 56 56 56 56 56 56 56 56 56 56 56 56 56 56 56 56 56 56 56 56 56 56 57 57 57 57 57 57 57 57 57 57 56 56 56 55 56 56
3401E6%%%%%%%%%%%%%%%%j%%%%%%%%%%Jj%%%J%%%%%%%%%%%%%%%%%%%%%%%%%%%%%%%%%%%j%
$$ 56 56 56 56 56 56 56 56 56 56 56 56 56 56 56 56 56 55 55 55 55 55 55 55 55 55 55 55 56 55 55 55 55 56 56 56 56 56 56 56 56 56 56 56 56 56 56 56 56 56 56 56 56 56 56 56 56 56 56 56 56 56 56 56 56 56 56 56 56 55 55
3393E5%J%%%%%%j%%%%%%J%%%%%%%%%%%%%%%%%%%%%%%%%%J%%%%%%%%%%%%%j%%%%j%%%J%%%%
$$ 55 55 56 56 56 56 56 56 56 55 55 55 55 55 55 55 56 56 56 56 56 56 56 56 56 56 56 56 56 56 56 56 56 56 56 56 56 56 56 56 56 56 56 57 57 57 57 57 57 57 57 57 57 57 57 57 57 56 56 56 56 56 55 55 55 55 56 56 56 56 56
3386E6%%%%%%%%%%%%%%%%%%J%%%%j%%%%%%%%%J%%%%%%%%%%%%%%%%%%%j%%%%J%%%%j%%%%J%
$$ 56 56 56 56 56 56 56 56 56 56 56 56 56 56 56 56 56 56 56 57 57 57 57 57 56 56 56 56 56 56 56 56 56 56 57 57 57 57 57 57 57 57 57 57 57 57 57 57 57 57 57 57 57 57 56 56 56 56 56 57 57 57 57 57 56 56 56 56 56 57 57
3378E7%j%%%J%%%%%%%%%%%%%%%%%j%J%%%%%%%%%J%%%%%%%j%%%%%%%%%jJ%%%%%%%%%%%%%%%
$$ 57 57 56 56 56 56 57 57 57 57 57 57 57 57 57 57 57 57 57 57 57 57 57 57 56 56 57 57 57 57 57 57 57 57 57 57 58 58 58 58 58 58 58 58 57 57 57 57 57 57 57 57 57 57 56 57 57 57 57 57 57 57 57 57 57 57 57 57 57 57 57
3371E7%%%j%%%%%%%%%%%%%%%%%%%%%%%%jJ%%%%%%%%%J%%%%%%%%%%%%%%%j%%%%%%%%%%%%%%
$$ 57 57 57 57 56 56 56 56 56 56 56 56 56 56 56 56 56 56 56 56 56 56 56 56 56 56 56 56 56 55 56 56 56 56 56 56 56 56 56 56 57 57 57 57 57 57 57 57 57 57 57 57 57 57 57 57 56 56 56 56 56 56 56 56 56 56 56 56 56 56 56
3364E6j%%%%%%%%%%%%%%%%%%J%%%%%%%%%J%%%%%J%%%%j%%%Jj%J%%%%%%%%%%%%j%%%%Jj%%%
$$ 56 55 55 55 55 55 55 55 55 55 55 55 55 55 55 55 55 55 55 55 56 56 56 56 56 56 56 56 56 56 57 57 57 57 57 57 58 58 58 58 58 57 57 57 57 58 57 57 58 58 58 58 58 58 58 58 58 58 58 58 58 57 57 57 57 57 58 57 57 57 57
3356E7%j%%%%%%%%%%J%%%%%%J%%%%%%J%%%%%%%%J%%%%%%%%%%%%%%%%%j%%%%%%%%j%%%%%%J
$$ 57 57 56 56 56 56 56 56 56 56 56 56 56 57 57 57 57 57 57 57 58 58 58 58 58 58 58 59 59 59 59 59 59 59 59 59 60 60 60 60 60 60 60 60 60 60 60 60 60 60 60 60 60 60 59 59 59 59 59 59 59 59 59 58 58 58 58 58 58 58 59
3349E9%%%J%%%J%%J%JJ%JJJJJJJKJKJKKMLNNOPRJ0J1J1J3J2J3J3J1J0QNK%morj1j2j2j3j3
$$ 59 59 59 59 60 60 60 60 61 61 61 62 62 63 64 64 65 66 67 68 69 70 71 73 74 76 77 79 81 85 88 93 98 104 111 120 130 141 152 165 177 190 203 214 224 232 237 239 239 235 229 220 209 197 185 172 159
3343A59j3j1j1rqonnlkkjkj%j%%j%J%%JJJJKKKLLNNPPRJ0J1J2J2J2J3J1J1ROMJlnpj0j2j3
$$ 159 146 135 124 115 107 101 96 91 88 86 84 83 81 80 80 79 79 79 78 78 79 79 79 80 81 82 83 85 87 89 92 95 100 105 112 119 128 138 149 161 173 185 198 209 220 229 235 239 240 237 232 225 215 203 190
3337A90j3j4j3j2j2j0rponmmkljkj%jjjj%jj%%j%%%%%%%j%%%%j%%%%%j%%%%j%%%%j%%%j%%
$$ 190 177 163 150 138 126 116 107 100 94 89 85 81 79 76 75 73 72 72 71 70 69 68 68 67 66 66 66 65 65 65 65 65 65 65 65 64 64 64 64 64 63 63 63 63 63 63 62 62 62 62 62 61 61 61 61 61 60 60 60 60 59 59 59
3330E9%%%%%%%%%%%%%%%%%J%%%J%%JJ%J%J%%J%%%J%%%%%%%%%J%J%%J%J%%J%j%%%jjjjjjkj
$$ 59 59 59 59 59 59 59 59 59 59 59 59 59 59 59 59 59 59 60 60 60 60 61 61 61 62 63 63 64 64 65 65 65 66 66 66 66 67 67 67 67 67 67 67 67 67 67 68 68 69 69 69 70 70 71 71 71 72 72 71 71 71 71 70 69 68 67 66 65 63 62
3323F2jjj%j%%%j%%%%%%J%%J%J%JJ%J%J%JJ%J%J%J%%J%%J%%%j%jjjjjjjk%jjjj%j%j%%%J%
$$ 62 61 60 59 59 58 58 58 58 57 57 57 57 57 57 57 58 58 58 59 59 60 60 61 62 62 63 63 64 64 65 66 66 67 67 68 68 69 69 69 70 70 70 71 71 71 71 70 70 69 68 67 66 65 64 63 61 61 60 59 58 57 57 56 56 55 55 55 55 56 56
3315E6%%%%%%J%%J%J%J%%J%%%%%%J%%%j%%%%%%%%J%%J%J%%%%%%%%%j%j%%j%%%j%%%J%J%%J
$$ 56 56 56 56 56 56 56 57 57 57 58 58 59 59 60 60 60 61 61 61 61 61 61 61 62 62 62 62 61 61 61 61 61 61 61 61 61 62 62 62 63 63 64 64 64 64 64 64 64 64 64 64 63 63 62 62 62 61 61 61 61 60 60 60 60 61 61 62 62 62 63
3308F3%J%JJ%J%J%%%J%%JJ%JJJJJJ%JJJJJ%%J%%%j%%j%j%jjj%j%%%%%%%%%J%J%J%J%%JJ%J
$$ 63 63 64 64 65 66 66 67 67 68 68 68 68 69 69 69 70 71 71 72 73 74 75 76 77 77 78 79 80 81 82 82 82 83 83 83 83 82 82 82 81 81 80 80 79 78 77 77 76 76 76 76 76 76 76 76 76 76 77 77 78 78 79 79 80 80 80 81 82 82 83
3301H3JJKJKJKKKKLKLKLKKKKJJ%Jj%jjkjkjkjjkjjjjjjj%jj%j%J%%JJ%JKJJJJKJJKJKKJKK
$$ 83 84 85 87 88 90 91 93 95 97 99 102 104 107 109 112 114 116 118 120 121 122 122 123 122 122 121 120 118 117 115 114 112 111 110 108 107 106 105 104 103 102 101 101 100 99 99 98 98 99 99 99 100 101 101 102 104 105 106 107 108 110 111 112 114 115 117 119 120 122 124
3293A24LKKLKKJJ%%%j%%%JJLNOQRJ0J2J4J4J5J6J5J4J4J1J0PMJknqj0j2j4j3j5j3j3j2j1q
$$ 124 127 129 131 134 136 138 139 140 140 140 140 139 139 139 139 140 141 144 149 155 163 172 182 194 208 222 237 253 268 282 296 307 317 324 328 329 327 322 314 304 292 278 265 250 237 224 212 201 193
3288A93pomk%JJLLMMLLKLKLKJKKKKLMMOPQJ0J2J3J5J6J8J8J9J9J9J8J7J5J4J1QNLK%jjkj%
$$ 193 186 180 176 174 174 175 176 179 182 186 190 193 196 198 201 203 206 208 209 211 213 215 217 220 224 228 234 241 249 259 271 284 299 315 333 351 370 389 408 426 443 458 472 483 491 496 499 501 501 500 499 497 496 496
3282D96JKMNPQRJ0J1J2J2J4J4J5J7J9K2K4K9L3L8M4M9N6O3P2Q0R0J00J12J24J38J51J66J83
$$ 496 497 499 503 508 515 523 532 542 553 565 577 591 605 620 637 656 678 702 731 764 802 846 895 951 1014 1086 1166 1256 1356 1468 1592 1730 1881 2047 2230
3279B230K02K23K48K79L17L66M30N11O16P45R03J089J301J531J768J989K175K299K353K329
$$ 2230 2432 2655 2903 3182 3499 3865 4295 4806 5422 6167 7070 8159 9460 10991 12759 14748 16923 19222 21575 23904
3276B3904K225K038J761J392R57M85Nm59r02j315j681j977k193k317k353k313k208k045j835
$$ 23904 26129 28167 29928 31320 32277 32762 32767 32308 31406 30091 28410 26433 24240 21923 19570 17257 15049 13004 11169
3274A1169j593j339j095q78o94n45m28l37k68k13j70j34j03p5m8k3ML0N9Q8J21J57J99K47
$$ 11169 9576 8237 7142 6264 5570 5025 4597 4260 3992 3779 3609 3475 3372 3297 3249 3226 3230 3260 3319 3407 3528 3685 3884 4131
3272D131L07L81M73N88P27Q94J087J306J538J772J983K152K257K290K247K124J919J621J239
$$ 4131 4438 4819 5292 5880 6607 7501 8588 9894 11432 13204 15187 17339 19596 21886 24133 26257 28176 29797 31036
3270C1036Q02L37j28n76j001j394j732j999k183k277k291k233k117j945j734j497j257j032
$$ 31036 31838 32175 32047 31471 30470 29076 27344 25345 23162 20885 18594 16361 14244 12299 10565 9068 7811 6779
3268F779q37o75n47m49l73l19k77k46k22k03j87j74j61j49j38j27j15j05r5q6p7p0o3n7n3
$$ 6779 5942 5267 4720 4271 3898 3579 3302 3056 2834 2631 2444 2270 2109 1960 1822 1695 1580 1475 1380 1294 1217 1147 1084 1027 974
3265I74m8m6m2m0l8l5l3l1k9k8k5k3k1k1k1k0k0k0k1k0k1k1k1k0k0j9j7j6j4j1j0pljJMNP
$$ 974 926 880 838 798 760 725 692 661 632 604 579 556 535 514 493 473 453 433 412 392 371 350 329 309 289 270 253 237 223 212 202 195 192 191 192 196 201 208
3261B08QQQQPNNLK%jklmmnnnmlllkkkjkjjjjllmooqj0j0j1j2j2j3j3j3j3j1j0rpnljLMOQR
$$ 208 216 224 232 240 247 252 257 260 262 262 261 259 256 252 248 243 238 233 229 226 223 220 218 216 214 213 211 210 209 208 207 204 201 197 191 185 177 167 157 146 134 122 109 96 83 70 59 49 40 33 28 25 24 27 31 37 45 54
3255E4RJ0J0RRPOMLKjjllmlmlkjjj%JJKJJJJJJJJJ%JJ%J%J%JJ%%%%j%kkkjkkkkkkkkklkkk
$$ 54 63 73 83 92 101 108 114 118 121 123 122 121 118 115 111 108 104 101 99 98 97 96 96 97 98 100 101 102 103 104 105 106 107 108 109 109 110 111 111 112 112 113 113 114 115 115 115 115 115 114 114 112 110 108 107 105 103 101 99 97 95 93 91 89 86 84 82 80
3248H0lkkjkj%%%%JJJKJKJKJKKJJJJ%JJ%%J%%%%%J%%%J%%%%%%%%j%jj%jjjjjjjj%j%j%%%J
$$ 80 77 75 73 72 70 69 69 69 69 69 70 71 72 74 75 77 78 80 81 83 85 86 87 88 89 89 90 91 91 91 92 92 92 92 92 92 93 93 93 93 94 94 94 94 94 94 94 94 94 93 93 92 91 91 90 89 88 87 86 85 84 83 83 82 82 81 81 81 81 82
3240H2%%%J%%JJ%%%%%%%%%J%%%%%%%J%%J%%J%%%%%%j%%j%j%j%jj%%%%%j%J%%%%j%%%%j%%j
$$ 82 82 82 82 83 83 83 84 85 85 85 85 85 85 85 85 85 85 86 86 86 86 86 86 86 86 87 87 87 88 88 88 89 89 89 89 89 89 89 88 88 88 87 87 86 86 85 85 84 83 83 83 83 83 83 82 82 83 83 83 83 83 82 82 82 82 82 81 81 81 80
3233H0%%j%%%%%%%%%%J%JJ%JJ%J%JJ%J%%%j%J%%j%%jjj%kjkjjkjjkjj%%%%%J%%%%J%%j%%J
$$ 80 80 80 79 79 79 79 79 79 79 79 79 79 79 80 80 81 82 82 83 84 84 85 85 86 87 87 88 88 88 88 87 87 88 88 88 87 87 87 86 85 84 84 82 81 79 78 77 75 74 73 71 70 69 69 69 69 69 69 70 70 70 70 70 71 71 71 70 70 70 71
3226G1%%%J%J%%J%J%J%J%%J%%%%%j%jjjjjjkjkjkj%j%jJ%%J%JJ%J%J%J%%%%%%%j%%%%%%%%
$$ 71 71 71 71 72 72 73 73 73 74 74 75 75 76 76 77 77 77 78 78 78 78 78 78 77 77 76 75 74 73 72 71 69 68 66 65 63 62 62 61 61 60 61 61 61 62 62 63 64 64 65 65 66 66 67 67 67 67 67 67 67 67 66 66 66 66 66 66 66 66 66
3218F6%%%j%%j%%J%%%%%%%%%%j%J%%j%J%J%%%%J%%%%%%%J%%%J%j%J%%%%j%%%%%%j%%%%%%%
$$ 66 66 66 66 65 65 65 64 64 64 65 65 65 65 65 65 65 65 65 65 65 64 64 65 65 65 64 64 65 65 66 66 66 66 66 67 67 67 67 67 67 67 67 68 68 68 68 69 69 68 68 69 69 69 69 69 68 68 68 68 68 68 68 67 67 67 67 67 67 67 67
3211F7%%%%%%%%%J%%%%J%J%J%J%J%J%JJJJJJJJKKKKMMNNPQJ0J0J2J3J3J3J3J2J1ROL%lorj0
$$ 67 67 67 67 67 67 67 67 67 67 68 68 68 68 68 69 69 70 70 71 71 72 72 73 73 74 74 75 76 77 78 79 80 81 82 84 86 88 90 94 98 103 108 115 123 133 143 155 168 181 194 207 219 230 239 245 248 248 245 239 230 220
3204B20j3j3j3j4j3j2j0rqpnmlkljjjjj%j%%%%JJ%JJKKKLLMNOPRRJ1J1J3J2J3J2J1J0PNJk
$$ 220 207 194 181 167 154 142 132 123 115 108 103 99 96 94 91 90 89 88 87 86 86 85 85 85 85 85 86 87 87 88 89 91 93 95 98 101 105 110 116 123 132 141 152 163 176 188 201 213 224 234 241 246 247 245
3199B45mqrj2j3j4j4j3j3j2j0qponmmklkjjkjjj%jjj%%j%%%j%%%%%%%j%%%%%j%%%j%%%%%j
$$ 245 241 233 224 212 199 185 171 158 145 133 123 115 108 102 97 93 89 87 84 82 81 80 78 77 76 75 75 74 73 72 72 72 71 71 71 71 70 70 70 70 70 70 70 70 69 69 69 69 69 69 68 68 68 68 67 67 67 67 67 67 66
3192F6%j%%j%%%%%j%J%%%%%%%%%%%%%%%%%%%%J%%%%%%%%%J%%j%%Jj%%jJ%%%j%%%j%%%j%%%
$$ 66 66 65 65 65 64 64 64 64 64 64 63 63 64 64 64 64 64 64 64 64 64 64 64 64 64 64 64 64 64 64 64 64 64 65 65 65 65 65 65 65 65 65 65 66 66 66 65 65 65 66 65 65 65 64 65 65 65 65 64 64 64 64 63 63 63 63 62 62 62 62
3185F2%%%%%%%%%%%%J%%j%J%%%%%%%%%%%%J%%%%%%%%%%j%%%%%%%%%%%%%j%%%%%%%%%%%%%%
$$ 62 62 62 62 62 62 62 62 62 62 62 62 62 63 63 63 62 62 63 63 63 63 63 63 63 63 63 63 63 63 63 64 64 64 64 64 64 64 64 64 64 64 63 63 63 63 63 63 63 63 63 63 63 63 63 63 62 62 62 62 62 62 62 62 62 62 62 62 62 62 62
3177F2%%%Jj%%%%J%%%%%%%%%%%%%%Jj%%%%%%%j%J%%%%%%%%%%%%%%%%%j%%%%%%%%%%%%%%%%
$$ 62 62 62 62 63 62 62 62 62 62 63 63 63 63 63 63 63 63 63 63 63 63 63 63 63 64 63 63 63 63 63 63 63 63 62 62 63 63 63 63 63 63 63 63 63 63 63 63 63 63 63 63 63 63 62 62 62 62 62 62 62 62 62 62 62 62 62 62 62 62 62
3170F2%%J%%%%%%%%%%%%%%%%%%j%%%%%%%%%%%%%%%%%%%%%%%%%%%%%%%%%%%%%%%%%%%%%%%%
$$ 62 62 62 63 63 63 63 63 63 63 63 63 63 63 63 63 63 63 63 63 63 63 62 62 62 62 62 62 62 62 62 62 62 62 62 62 62 62 62 62 62 62 62 62 62 62 62 62 62 62 62 62 62 62 62 62 62 62 62 62 62 62 62 62 62 62 62 62 62 62 62
3162F2%%%%%%%%%%%%%%%%%%%%%%%%%%%%%%%%j%%%%%%%%%%%%%%%%%%%%%%%%%%%J%%%%%j%%%
$$ 62 62 62 62 62 62 62 62 62 62 62 62 62 62 62 62 62 62 62 62 62 62 62 62 62 62 62 62 62 62 62 62 62 61 61 61 61 61 61 61 61 61 61 61 61 61 61 61 61 61 61 61 61 61 61 61 61 61 61 61 61 62 62 62 62 62 62 61 61 61 61
3155F1%%%J%j%%%%%%%%%%%%%j%%%%J%%%%%%%%%%%%%%%%%%%%%%%%%%%%%%%%%%%%%%%%%%%%%
$$ 61 61 61 61 62 62 61 61 61 61 61 61 61 61 61 61 61 61 61 61 60 60 60 60 60 61 61 61 61 61 61 61 61 61 61 61 61 61 61 61 61 61 61 61 61 61 61 61 61 61 61 61 61 61 61 61 61 61 61 61 61 61 61 61 61 61 61 61 61 61 61
3148F1%%%%j%%%%%J%%%%j%%%%%%%%%%%%%%%%%%%%%%%%%%%%%%%%%%%%%J%%%%%%%%%j%%J%Jj
$$ 61 61 61 61 61 60 60 60 60 60 60 61 61 61 61 61 60 60 60 60 60 60 60 60 60 60 60 60 60 60 60 60 60 60 60 60 60 60 60 60 60 60 60 60 60 60 60 60 60 60 60 60 60 60 61 61 61 61 61 61 61 61 61 61 60 60 60 61 61 62 61
3140F1%%%%%%%%%%%%jJj%%%%%Jj%%%%%%J%%%%%%%%%%%%%j%J%%%%%%%%%%%%%%%%%%%%%%%%%
$$ 61 61 61 61 61 61 61 61 61 61 61 61 61 60 61 60 60 60 60 60 60 61 60 60 60 60 60 60 60 61 61 61 61 61 61 61 61 61 61 61 61 61 61 60 60 61 61 61 61 61 61 61 61 61 61 61 61 61 61 61 61 61 61 61 61 61 61 61 61 61 61
3133F1%%%%%%%%%%%%%%%%%%%%%%%%%%%%%%%%j%%%%%%%%%%%%%%%%%j%J%%%%%%%%%%%%%%Jj%
$$ 61 61 61 61 61 61 61 61 61 61 61 61 61 61 61 61 61 61 61 61 61 61 61 61 61 61 61 61 61 61 61 61 61 60 60 60 60 60 60 60 60 60 60 60 60 60 60 60 60 60 60 59 59 60 60 60 60 60 60 60 60 60 60 60 60 60 60 60 61 60 60
3125F0%J%%j%%%%%%%%%%%%%%%%%%%%%%%jJ%%%%%j%%%%%%%J%%%%%%%%%%%%%%%J%%%%%%%%%%
$$ 60 60 61 61 61 60 60 60 60 60 60 60 60 60 60 60 60 60 60 60 60 60 60 60 60 60 60 60 60 59 60 60 60 60 60 60 59 59 59 59 59 59 59 59 60 60 60 60 60 60 60 60 60 60 60 60 60 60 60 60 61 61 61 61 61 61 61 61 61 61 61
3118F1%%%%%%%%%%%jJ%%%j%%%%%%%%%%%%%%J%%%%%%%%%%%%%%jJ%%%%%%j%%%J%%j%J%%%j%%
$$ 61 61 61 61 61 61 61 61 61 61 61 61 60 61 61 61 61 60 60 60 60 60 60 60 60 60 60 60 60 60 60 60 61 61 61 61 61 61 61 61 61 61 61 61 61 61 61 60 61 61 61 61 61 61 61 60 60 60 60 61 61 61 60 60 61 61 61 61 60 60 60
3111F0%%%%%%%%%%J%%%jJ%%%%%%%%%%%j%%%%%%%%%%%%%%%%%%%%%%%%%jJ%%%%%%%%%%%%%%%
$$ 60 60 60 60 60 60 60 60 60 60 60 61 61 61 61 60 61 61 61 61 61 61 61 61 61 61 61 61 60 60 60 60 60 60 60 60 60 60 60 60 60 60 60 60 60 60 60 60 60 60 60 60 60 60 59 60 60 60 60 60 60 60 60 60 60 60 60 60 60 60 60
3103F0%%%%%%%%%%%%%%%%%%%%%%%%%%%%%%%%%%jJ%%%%%%%%%%%%%%%%%j%%%J%%%%%%%%%%%%
$$ 60 60 60 60 60 60 60 60 60 60 60 60 60 60 60 60 60 60 60 60 60 60 60 60 60 60 60 60 60 60 60 60 60 60 60 59 60 60 60 60 60 60 60 60 60 60 60 60 60 60 60 60 60 60 59 59 59 59 60 60 60 60 60 60 60 60 60 60 60 60 60
3096F0%%%%%%J%%j%%%J%%%%%j%%%%%%%%%%%%%%%%%%%%%%%%%%%j%J%%%%%%%J%%%%%%jJ%%%%
$$ 60 60 60 60 60 60 60 61 61 61 60 60 60 60 61 61 61 61 61 61 60 60 60 60 60 60 60 60 60 60 60 60 60 60 60 60 60 60 60 60 60 60 60 60 60 60 60 60 59 59 60 60 60 60 60 60 60 60 61 61 61 61 61 61 61 60 61 61 61 61 61
3088F1%%%%%%%%%%%%%%%%j%%%%%j%%%Jj%%%%%%%%%%J%%%%%%%%%%%%%%%%%%%%%%%%%%%j%%%
$$ 61 61 61 61 61 61 61 61 61 61 61 61 61 61 61 61 61 60 60 60 60 60 60 59 59 59 59 60 59 59 59 59 59 59 59 59 59 59 59 60 60 60 60 60 60 60 60 60 60 60 60 60 60 60 60 60 60 60 60 60 60 60 60 60 60 60 60 59 59 59 59
3081E9%%%%%%%%%%%%%%%%%j%%%%%%%%%%%%%%%%%%%%%J%j%%%%%%%J%%%%%%j%%%J%%j%%%%%%
$$ 59 59 59 59 59 59 59 59 59 59 59 59 59 59 59 59 59 59 58 58 58 58 58 58 58 58 58 58 58 58 58 58 58 58 58 58 58 58 58 58 59 59 58 58 58 58 58 58 58 58 59 59 59 59 59 59 59 58 58 58 58 59 59 59 58 58 58 58 58 58 58
3073E8%%%%%%%%%%%%%%%%%%%J%%%%%%%%%%%J%%%%%jJ%%%%%%%%j%%%%%%%%%%%%%%%%%%%%%%
$$ 58 58 58 58 58 58 58 58 58 58 58 58 58 58 58 58 58 58 58 58 59 59 59 59 59 59 59 59 59 59 59 59 60 60 60 60 60 60 59 60 60 60 60 60 60 60 60 60 59 59 59 59 59 59 59 59 59 59 59 59 59 59 59 59 59 59 59 59 59 59 59
3066E9%%J%%%%%%%%J%j%%%%%%%%%%%%%%%%j%%%%J%%%%j%%%%%%%%%%%%%%%%%%%%%%%%%%%%%
$$ 59 59 59 60 60 60 60 60 60 60 60 60 61 61 60 60 60 60 60 60 60 60 60 60 60 60 60 60 60 60 60 59 59 59 59 59 60 60 60 60 60 59 59 59 59 59 59 59 59 59 59 59 59 59 59 59 59 59 59 59 59 59 59 59 59 59 59 59 59 59 59
3059E9%%%%%%%%%%%%%%%%%%%%%%j%%J%%%%%%%%%%%%%%%j%J%j%%Jj%%%%%J%%%%%%%%%j%%Jj
$$ 59 59 59 59 59 59 59 59 59 59 59 59 59 59 59 59 59 59 59 59 59 59 59 58 58 58 59 59 59 59 59 59 59 59 59 59 59 59 59 59 59 59 58 58 59 59 58 58 58 59 58 58 58 58 58 58 59 59 59 59 59 59 59 59 59 59 58 58 58 59 58
3051E8%%%%%J%%%%j%%%%%%%%%%%%%J%%%%%Jj%%%%%%%%J%%%j%%%%%%%%%%%%J%j%%%%%%%%%%
$$ 58 58 58 58 58 58 59 59 59 59 59 58 58 58 58 58 58 58 58 58 58 58 58 58 58 59 59 59 59 59 59 60 59 59 59 59 59 59 59 59 59 60 60 60 60 59 59 59 59 59 59 59 59 59 59 59 59 59 60 60 59 59 59 59 59 59 59 59 59 59 59
3044E9%%%%%%%%%%%%%%%%%j%%JjJ%%j%%%%%J%%%%%j%%%%%%J%%%%%%%%%%%%%%%%%%%%%%%%%
$$ 59 59 59 59 59 59 59 59 59 59 59 59 59 59 59 59 59 59 58 58 58 59 58 59 59 59 58 58 58 58 58 58 59 59 59 59 59 59 58 58 58 58 58 58 58 59 59 59 59 59 59 59 59 59 59 59 59 59 59 59 59 59 59 59 59 59 59 59 59 59 59
3036E9%j%%J%%%%%%%%%%%%%%%%%%%j%%%%%%%%%%%%%%%%%%%%%%%%%%%%%%%%%j%%%J%%%%%%%
$$ 59 59 58 58 58 59 59 59 59 59 59 59 59 59 59 59 59 59 59 59 59 59 59 59 59 58 58 58 58 58 58 58 58 58 58 58 58 58 58 58 58 58 58 58 58 58 58 58 58 58 58 58 58 58 58 58 58 58 58 57 57 57 57 58 58 58 58 58 58 58 58
3029E8%%%%%%%%%%%%%%%%J%%%%%%%%%%%%%%%%%%%%%%%%%%%%%%%j%%J%%j%%%%%%%%%%%%%%%
$$ 58 58 58 58 58 58 58 58 58 58 58 58 58 58 58 58 58 59 59 59 59 59 59 59 59 59 59 59 59 59 59 59 59 59 59 59 59 59 59 59 59 59 59 59 59 59 59 59 59 58 58 58 59 59 59 58 58 58 58 58 58 58 58 58 58 58 58 58 58 58 58
3022E8%%%jJ%%%%%%J%%%%%J%%%%%%%%%%%%%%J%j%%%%%%%%%%%%%%%%%%j%%%%j%%%%%%%Jj%%
$$ 58 58 58 58 57 58 58 58 58 58 58 58 59 59 59 59 59 59 60 60 60 60 60 60 60 60 60 60 60 60 60 60 60 61 61 60 60 60 60 60 60 60 60 60 60 60 60 60 60 60 60 60 60 60 59 59 59 59 59 58 58 58 58 58 58 58 58 59 58 58 58
3014E8%%%%%%%%%%Jj%%%%%%%J%%%%%%%%%%J%%%%j%%%%%%%%%%%%%%%%j%J%%%%%%j%J%%%%%%
$$ 58 58 58 58 58 58 58 58 58 58 58 59 58 58 58 58 58 58 58 58 59 59 59 59 59 59 59 59 59 59 59 60 60 60 60 60 59 59 59 59 59 59 59 59 59 59 59 59 59 59 59 59 59 58 58 59 59 59 59 59 59 59 58 58 59 59 59 59 59 59 59
3007E9%%%%j%%J%%%%%%j%%%%%%%%%j%%%%%J%%%%%%%%%j%%%%%%J%%%%%%%%%%%%%%%%%%%%%%
$$ 59 59 59 59 59 58 58 58 59 59 59 59 59 59 59 58 58 58 58 58 58 58 58 58 58 57 57 57 57 57 57 58 58 58 58 58 58 58 58 58 58 57 57 57 57 57 57 57 58 58 58 58 58 58 58 58 58 58 58 58 58 58 58 58 58 58 58 58 58 58 58
2999E8%%%%%%%%%%%%%%%%J%j%%%%%%%%%%%%%%%%%%%%%%%%%%J%%%%%%%%%%%%%%%%%%j%J%j%
$$ 58 58 58 58 58 58 58 58 58 58 58 58 58 58 58 58 58 59 59 58 58 58 58 58 58 58 58 58 58 58 58 58 58 58 58 58 58 58 58 58 58 58 58 58 58 58 59 59 59 59 59 59 59 59 59 59 59 59 59 59 59 59 59 59 59 58 58 59 59 58 58
2992E8%%%%jJ%j%%%%%%%%%%%%%%%%%%%J%%%%J%%%%%%%%J%%%%%%%J%%j%Jj%%%%%%j%%%%%%j
$$ 58 58 58 58 58 57 58 58 57 57 57 57 57 57 57 57 57 57 57 57 57 57 57 57 57 57 57 57 58 58 58 58 58 59 59 59 59 59 59 59 59 59 60 60 60 60 60 60 60 60 61 61 61 60 60 61 60 60 60 60 60 60 60 59 59 59 59 59 59 59 58
2984E8%%%%%%%j%%%%%%%%%%%%%%%%%%J%jJ%%%%%%J%%%%%%J%j%%%J%%%%%%%%%%%%jJ%%%j%%
$$ 58 58 58 58 58 58 58 58 57 57 57 57 57 57 57 57 57 57 57 57 57 57 57 57 57 57 57 58 58 57 58 58 58 58 58 58 58 59 59 59 59 59 59 59 60 60 59 59 59 59 60 60 60 60 60 60 60 60 60 60 60 60 60 59 60 60 60 60 59 59 59
2977E9%%%%%%j%J%%j%%%%%%%%%%%%%%%j%JjJ%%%%j%%%%%%J%%%%%%%J%%%%%%%%%%%%%%%%%j
$$ 59 59 59 59 59 59 59 58 58 59 59 59 58 58 58 58 58 58 58 58 58 58 58 58 58 58 58 58 57 57 58 57 58 58 58 58 58 57 57 57 57 57 57 57 58 58 58 58 58 58 58 58 59 59 59 59 59 59 59 59 59 59 59 59 59 59 59 59 59 59 58
2970E8Jj%%%%%%%%%%%%Jj%%%%%%%j%%%%%%%%jJ%%%%J%%%%%%%%%%%%%%%%%%%Jj%%%%%%%%%%
$$ 58 59 58 58 58 58 58 58 58 58 58 58 58 58 58 59 58 58 58 58 58 58 58 58 57 57 57 57 57 57 57 57 57 56 57 57 57 57 57 58 58 58 58 58 58 58 58 58 58 58 58 58 58 58 58 58 58 58 58 59 58 58 58 58 58 58 58 58 58 58 58
2962E8%%%%j%%%%%%%%%%%%%%%%%%%%%%%%%J%%%%%%%%%%%%%%%%%%J%%%%%j%%%%%%%%%%%j%%
$$ 58 58 58 58 58 57 57 57 57 57 57 57 57 57 57 57 57 57 57 57 57 57 57 57 57 57 57 57 57 57 57 58 58 58 58 58 58 58 58 58 58 58 58 58 58 58 58 58 58 58 59 59 59 59 59 59 58 58 58 58 58 58 58 58 58 58 58 58 57 57 57
2955E7%%%%%j%%%%%%%%%J%%%%%%%%J%%%%J%%%J%%%%%%%%%%J%%%j%%%%%%%%%%%%j%%%j%%j%
$$ 57 57 57 57 57 57 56 56 56 56 56 56 56 56 56 56 57 57 57 57 57 57 57 57 57 58 58 58 58 58 59 59 59 59 60 60 60 60 60 60 60 60 60 60 60 61 61 61 61 60 60 60 60 60 60 60 60 60 60 60 60 60 59 59 59 59 58 58 58 57 57
2947E7%%%%%%%%%%j%J%%%%%%%%%%J%%J%%%%J%%j%%J%%%%%%%%%%%%%%%%%%%%%%%%j%%%%j%%
$$ 57 57 57 57 57 57 57 57 57 57 57 56 56 57 57 57 57 57 57 57 57 57 57 57 58 58 58 59 59 59 59 59 60 60 60 59 59 59 60 60 60 60 60 60 60 60 60 60 60 60 60 60 60 60 60 60 60 60 60 60 60 60 60 59 59 59 59 59 58 58 58
2940E8%%%%%%%%%J%%%j%%%%%%%J%%%%%%%%%j%%%%%%%Jj%%%%%j%%%%%%%%%%%%%%%%%J%%%%%
$$ 58 58 58 58 58 58 58 58 58 58 59 59 59 59 58 58 58 58 58 58 58 58 59 59 59 59 59 59 59 59 59 59 58 58 58 58 58 58 58 58 59 58 58 58 58 58 58 57 57 57 57 57 57 57 57 57 57 57 57 57 57 57 57 57 57 58 58 58 58 58 58
2933E8%%%%%%%%%%J%%%%J%%%j%%%%%%%%%J%j%%%%%%%%%%j%%%%j%%%%%%%j%%%%Jj%Jj%%%%%
$$ 58 58 58 58 58 58 58 58 58 58 58 59 59 59 59 59 60 60 60 60 59 59 59 59 59 59 59 59 59 59 60 60 59 59 59 59 59 59 59 59 59 59 59 58 58 58 58 58 57 57 57 57 57 57 57 57 56 56 56 56 56 57 56 56 57 56 56 56 56 56 56
2925E6J%%%%%%%%J%%J%%%J%%%%%J%%%j%%J%%%%%%%j%%%%%%%%%j%j%%%j%%%%%%%%%%%%%%%%
$$ 56 57 57 57 57 57 57 57 57 57 58 58 58 59 59 59 59 60 60 60 60 60 60 61 61 61 61 60 60 60 61 61 61 61 61 61 61 61 60 60 60 60 60 60 60 60 60 60 59 59 58 58 58 58 57 57 57 57 57 57 57 57 57 57 57 57 57 57 57 57 57
2918E7%%%%%%%%%%%%%J%%%%%%J%%%%%%%%%%%%%%%%%%j%%%%%%j%J%%%j%%%%%j%%%%%%J%%%%
$$ 57 57 57 57 57 57 57 57 57 57 57 57 57 57 58 58 58 58 58 58 58 59 59 59 59 59 59 59 59 59 59 59 59 59 59 59 59 59 59 59 58 58 58 58 58 58 58 57 57 58 58 58 58 57 57 57 57 57 57 56 56 56 56 56 56 56 57 57 57 57 57
2910E7%%Jj%%%%%%%%%%%%%%%%%%%J%%%%%j%%%%%%%%%%%J%%%j%%%%J%%%%%J%j%%%%%%%%%%%
$$ 57 57 57 58 57 57 57 57 57 57 57 57 57 57 57 57 57 57 57 57 57 57 57 57 58 58 58 58 58 58 57 57 57 57 57 57 57 57 57 57 57 57 58 58 58 58 57 57 57 57 57 58 58 58 58 58 58 59 59 58 58 58 58 58 58 58 58 58 58 58 58
2903E8%%%%%%%%%%%j%%%%%%%%%%%%%%%%%j%J%%%%%%%%%%%%%%%J%%%%%%%%%%%%J%%j%%%%%%
$$ 58 58 58 58 58 58 58 58 58 58 58 58 57 57 57 57 57 57 57 57 57 57 57 57 57 57 57 57 57 57 56 56 57 57 57 57 57 57 57 57 57 57 57 57 57 57 57 57 58 58 58 58 58 58 58 58 58 58 58 58 58 59 59 59 58 58 58 58 58 58 58
2895E8%Jj%%%%%%%%%%%%J%JJ%JJ%%%%jjj%jj%%%%%%%%%%%%%%%%%%%%%%%%%%%%%%%%J%j%%%
$$ 58 58 59 58 58 58 58 58 58 58 58 58 58 58 58 58 59 59 60 61 61 62 63 63 63 63 63 62 61 60 60 59 58 58 58 58 58 58 58 58 58 58 58 58 58 58 58 58 58 58 58 58 58 58 58 58 58 58 58 58 58 58 58 58 58 59 59 58 58 58 58
2888E8%J%%%%%%%JJJJJKKKKKKJjjjlkkkjjjj%j%j%%%%%%%%%%%%%%%%%%%%%%j%%%%%%%%%%%
$$ 58 58 59 59 59 59 59 59 59 59 60 61 62 63 64 66 68 70 72 74 76 77 76 75 74 71 69 67 65 64 63 62 61 61 60 60 59 59 59 59 59 59 59 59 59 59 59 59 59 59 59 59 59 59 59 59 59 59 59 58 58 58 58 58 58 58 58 58 58 58 58
2881E8J%%%J%%JJJJKKKKKKJ%%kkkljkkjj%j%%%j%%%%%%%%j%%%%%%%%%%%%%%%j%%%J%%%%%%
$$ 58 59 59 59 59 60 60 60 61 62 63 64 66 68 70 72 74 76 77 77 77 75 73 71 68 67 65 63 62 61 61 60 60 60 60 59 59 59 59 59 59 59 59 59 58 58 58 58 58 58 58 58 58 58 58 58 58 58 58 58 57 57 57 57 58 58 58 58 58 58 58
2873E8%%%%J%%%J%JJJ%J%%%j%jjj%j%%%%j%%%%%%%%%j%%J%%%%%%%%j%%J%j%Jj%%J%%%%%%%
$$ 58 58 58 58 58 59 59 59 59 60 60 61 62 63 63 64 64 64 64 63 63 62 61 60 60 59 59 59 59 59 58 58 58 58 58 58 58 58 58 58 57 57 57 58 58 58 58 58 58 58 58 58 57 57 57 58 58 57 57 58 57 57 57 58 58 58 58 58 58 58 58
2866E8%%%%%%%J%%%%%%%j%%%%%%%%%%%%%%%%%j%%%%%%%%%Jj%J%j%%%J%%%%%%%J%%%%%%j%%
$$ 58 58 58 58 58 58 58 58 59 59 59 59 59 59 59 59 58 58 58 58 58 58 58 58 58 58 58 58 58 58 58 58 58 58 57 57 57 57 57 57 57 57 57 57 58 57 57 58 58 57 57 57 57 58 58 58 58 58 58 58 58 59 59 59 59 59 59 59 58 58 58
2858E8%%%%%%%J%j%%%%%%%%%%%%%j%%%%J%%%%%%%%%%%%%j%%%%%%%%%%%%J%%%%%%J%%j%%%%
$$ 58 58 58 58 58 58 58 58 59 59 58 58 58 58 58 58 58 58 58 58 58 58 58 58 57 57 57 57 57 58 58 58 58 58 58 58 58 58 58 58 58 58 58 57 57 57 57 57 57 57 57 57 57 57 57 57 58 58 58 58 58 58 58 59 59 59 58 58 58 58 58
2851E8%%Jj%%%%%%%%%%%%%%%%%%%%%%J%j%%%%%%%%%%%%%%%j%%%%%%%%%%%%J%%%%%%%J%J%%
$$ 58 58 58 59 58 58 58 58 58 58 58 58 58 58 58 58 58 58 58 58 58 58 58 58 58 58 58 59 59 58 58 58 58 58 58 58 58 58 58 58 58 58 58 58 58 57 57 57 57 57 57 57 57 57 57 57 57 57 58 58 58 58 58 58 58 58 59 59 60 60 60
2844F0%%%%%%%j%%%%%%j%%%j%%%%%%%%J%%%j%%%%J%%j%%J%%%%%%%%%%%J%%%%JJ%J%%J%%%j
$$ 60 60 60 60 60 60 60 60 59 59 59 59 59 59 59 58 58 58 58 57 57 57 57 57 57 57 57 57 58 58 58 58 57 57 57 57 57 58 58 58 57 57 57 58 58 58 58 58 58 58 58 58 58 58 58 59 59 59 59 59 60 61 61 62 62 62 63 63 63 63 62
2836F2%j%j%j%%j%%%%%%%%%%%%%%%%%%%%%%%%%%%j%%%%J%%%%%%%%%%%J%%%J%%Jj%%%%%j%%
$$ 62 62 61 61 60 60 59 59 59 58 58 58 58 58 58 58 58 58 58 58 58 58 58 58 58 58 58 58 58 58 58 58 58 58 58 58 58 57 57 57 57 57 58 58 58 58 58 58 58 58 58 58 58 58 59 59 59 59 60 60 60 61 60 60 60 60 60 60 59 59 59
2829E9%%%%j%%%%%%%%%%%%%%%%%%%%%%%%%%%J%%%%%%%j%%%%%%%%%%%%%%%%J%%%%%%%%Jj%%
$$ 59 59 59 59 59 58 58 58 58 58 58 58 58 58 58 58 58 58 58 58 58 58 58 58 58 58 58 58 58 58 58 58 58 59 59 59 59 59 59 59 59 58 58 58 58 58 58 58 58 58 58 58 58 58 58 58 58 58 59 59 59 59 59 59 59 59 59 60 59 59 59
2821E9%%%%J%j%%j%%%J%%%%%j%%Jj%%%%%%%J%%%%%%Jj%%%%%%%%%%%%J%%%%%%%j%%%%%%%%%
$$ 59 59 59 59 59 60 60 59 59 59 58 58 58 58 59 59 59 59 59 59 58 58 58 59 58 58 58 58 58 58 58 58 59 59 59 59 59 59 59 60 59 59 59 59 59 59 59 59 59 59 59 59 59 60 60 60 60 60 60 60 60 59 59 59 59 59 59 59 59 59 59
2814E9%%%%%%%%%%%%%%%%%j%%%%%%%%%j%%%%%%%J%j%%%%J%%%%%JjJj%%%%%%j%%%%J%j%%%%
$$ 59 59 59 59 59 59 59 59 59 59 59 59 59 59 59 59 59 59 58 58 58 58 58 58 58 58 58 58 57 57 57 57 57 57 57 57 58 58 57 57 57 57 57 58 58 58 58 58 58 59 58 59 58 58 58 58 58 58 58 57 57 57 57 57 58 58 57 57 57 57 57
2806E7%%%%%%%%%%%%%%%%j%J%%%%%%%%%%%%%J%%%%%%%%%%%%%%%%j%%%%%%%j%%%%%J%%%%%j
$$ 57 57 57 57 57 57 57 57 57 57 57 57 57 57 57 57 57 56 56 57 57 57 57 57 57 57 57 57 57 57 57 57 57 58 58 58 58 58 58 58 58 58 58 58 58 58 58 58 58 58 57 57 57 57 57 57 57 57 56 56 56 56 56 56 57 57 57 57 57 57 56
2799E6Jj%J%j%J%%%%%%%%%%%%%%%%%%%%%%%%%J%%%%%%j%%%%%%%%%%%%%%%%%%%j%%%%%%%%%
$$ 56 57 56 56 57 57 56 56 57 57 57 57 57 57 57 57 57 57 57 57 57 57 57 57 57 57 57 57 57 57 57 57 57 57 58 58 58 58 58 58 58 57 57 57 57 57 57 57 57 57 57 57 57 57 57 57 57 57 57 57 57 56 56 56 56 56 56 56 56 56 56
2792E6%J%%%%%%%%%%%%%%J%%%%%%%j%%%%%%%%%%%%%%%%%%%%%%%%%%%%%%%%%%%%%%%%%%%%j
$$ 56 56 57 57 57 57 57 57 57 57 57 57 57 57 57 57 57 58 58 58 58 58 58 58 58 57 57 57 57 57 57 57 57 57 57 57 57 57 57 57 57 57 57 57 57 57 57 57 57 57 57 57 57 57 57 57 57 57 57 57 57 57 57 57 57 57 57 57 57 57 56
2784E6%%J%%%%J%j%%%%%%%%%%%%%%%%%%%%%%%%%%%%%%jJ%%%%%%%%%%%%%%%%%%%%%%%%%%%%
$$ 56 56 56 57 57 57 57 57 58 58 57 57 57 57 57 57 57 57 57 57 57 57 57 57 57 57 57 57 57 57 57 57 57 57 57 57 57 57 57 57 57 56 57 57 57 57 57 57 57 57 57 57 57 57 57 57 57 57 57 57 57 57 57 57 57 57 57 57 57 57 57
2777E7%%%%%J%%%%%%%%%%%%%%%%%%%j%%%%%%%%%%%%%%%%%%%%%%%%%%%%%%%%%%%%%J%%%%jJ
$$ 57 57 57 57 57 57 58 58 58 58 58 58 58 58 58 58 58 58 58 58 58 58 58 58 58 58 57 57 57 57 57 57 57 57 57 57 57 57 57 57 57 57 57 57 57 57 57 57 57 57 57 57 57 57 57 57 57 57 57 57 57 57 57 57 58 58 58 58 58 57 58
2769E8%%%%jJ%%%%%%%%%j%%%%%%%%J%j%%%%%%%%%%%%%%%%%%%Jj%%%%%%%%%%%%%%J%%%%%%%
$$ 58 58 58 58 58 57 58 58 58 58 58 58 58 58 58 58 57 57 57 57 57 57 57 57 57 58 58 57 57 57 57 57 57 57 57 57 57 57 57 57 57 57 57 57 57 57 57 58 57 57 57 57 57 57 57 57 57 57 57 57 57 57 57 58 58 58 58 58 58 58 58
2762E8%%%%j%%J%%%%%%%%J%%J%%%j%j%%%%%%%j%%%%%%%%%%%%%%%%%%J%j%%%%%%%Jj%%Jj%%
$$ 58 58 58 58 58 57 57 57 58 58 58 58 58 58 58 58 58 59 59 59 60 60 60 60 59 59 58 58 58 58 58 58 58 58 57 57 57 57 57 57 57 57 57 57 57 57 57 57 57 57 57 57 57 58 58 57 57 57 57 57 57 57 57 58 57 57 57 58 57 57 57
2755E7%%%%%%%%%%%%%%%%%Jj%%%%%%%%%J%%%%j%Jj%%%%%%%%%%%%%%%%%%%%%%%%%%%%%%%%%
$$ 57 57 57 57 57 57 57 57 57 57 57 57 57 57 57 57 57 57 58 57 57 57 57 57 57 57 57 57 57 58 58 58 58 58 57 57 58 57 57 57 57 57 57 57 57 57 57 57 57 57 57 57 57 57 57 57 57 57 57 57 57 57 57 57 57 57 57 57 57 57 57
2747E7%%%j%%J%%%%%%%%%%%%%%%J%j%%%%%%%%%%%%%%%%%%%%%%%%%%%%J%j%%%%%%%%%%%%%%
$$ 57 57 57 57 56 56 56 57 57 57 57 57 57 57 57 57 57 57 57 57 57 57 57 58 58 57 57 57 57 57 57 57 57 57 57 57 57 57 57 57 57 57 57 57 57 57 57 57 57 57 57 57 57 57 58 58 57 57 57 57 57 57 57 57 57 57 57 57 57 57 57
2740E7jJ%%%%%%%%%%%%%%J%j%%%%%Jj%%%%%%%%%%%%%%%%%%%%%%%%%%%%%%%%%%%%%%%%%%%%
$$ 57 56 57 57 57 57 57 57 57 57 57 57 57 57 57 57 57 58 58 57 57 57 57 57 57 58 57 57 57 57 57 57 57 57 57 57 57 57 57 57 57 57 57 57 57 57 57 57 57 57 57 57 57 57 57 57 57 57 57 57 57 57 57 57 57 57 57 57 57 57 57
2732E7%%%%%%jJ%%%%%%%j%%%%%%J%%%%%%j%J%%%%%%%%%%%%%%%%j%%%J%%%%%%%%j%%%%%%%%
$$ 57 57 57 57 57 57 57 56 57 57 57 57 57 57 57 57 56 56 56 56 56 56 56 57 57 57 57 57 57 57 56 56 57 57 57 57 57 57 57 57 57 57 57 57 57 57 57 57 57 56 56 56 56 57 57 57 57 57 57 57 57 57 56 56 56 56 56 56 56 56 56
2725E6%J%%%%%%j%%%%%%%Jj%%%%%%%J%%%%%%J%%%%%%%%%%%%%%%%%%%%%%%%%%%%%%%%%%j%%
$$ 56 56 57 57 57 57 57 57 57 56 56 56 56 56 56 56 56 57 56 56 56 56 56 56 56 56 57 57 57 57 57 57 57 58 58 58 58 58 58 58 58 58 58 58 58 58 58 58 58 58 58 58 58 58 58 58 58 58 58 58 58 58 58 58 58 58 58 58 57 57 57
2717E7%%%%%%%%%%%%%%%%j%%%J%%%%%%%%%%%%%J%%J%j%%%%%%%%%%%%%j%%%%J%%j%%%%%%%%
$$ 57 57 57 57 57 57 57 57 57 57 57 57 57 57 57 57 57 56 56 56 56 57 57 57 57 57 57 57 57 57 57 57 57 57 57 58 58 58 59 59 58 58 58 58 58 58 58 58 58 58 58 58 58 58 57 57 57 57 57 58 58 58 57 57 57 57 57 57 57 57 57
2710E7%%%%%%%%%%%%%%%%%%%%%%%%%%%%%%j%%%J%%%%%%%J%%%%%%%%j%%%%%%%%%%%%%%%%%%
$$ 57 57 57 57 57 57 57 57 57 57 57 57 57 57 57 57 57 57 57 57 57 57 57 57 57 57 57 57 57 57 57 56 56 56 56 57 57 57 57 57 57 57 57 58 58 58 58 58 58 58 58 58 57 57 57 57 57 57 57 57 57 57 57 57 57 57 57 57 57 57 57
2703E7%%%%%%%%%%%%%%%%%j%%%J%%j%%%%%%%%j%%%%%%%%%%%%%%J%%%%%%%%%J%%%%%%%%%%%
$$ 57 57 57 57 57 57 57 57 57 57 57 57 57 57 57 57 57 57 56 56 56 56 57 57 57 56 56 56 56 56 56 56 56 56 55 55 55 55 55 55 55 55 55 55 55 55 55 55 55 56 56 56 56 56 56 56 56 56 56 57 57 57 57 57 57 57 57 57 57 57 57
2695E7%%%%%%%%%%%%%j%%%%%%j%%%%%%%%%%%%%%%%%%%%J%%j%J%%J%%j%%%%%%%%%J%%%%%%%
$$ 57 57 57 57 57 57 57 57 57 57 57 57 57 57 56 56 56 56 56 56 56 55 55 55 55 55 55 55 55 55 55 55 55 55 55 55 55 55 55 55 55 55 56 56 56 55 55 56 56 56 57 57 57 56 56 56 56 56 56 56 56 56 56 57 57 57 57 57 57 57 57
2688E7%j%%%%J%%%%%j%%%%%%%%%%%%%%%%J%%%j%%%%%J%%%%Jj%%%%%%J%%%%%%%j%%%%%j%%%
$$ 57 57 56 56 56 56 56 57 57 57 57 57 57 56 56 56 56 56 56 56 56 56 56 56 56 56 56 56 56 56 57 57 57 57 56 56 56 56 56 56 57 57 57 57 57 58 57 57 57 57 57 57 57 58 58 58 58 58 58 58 58 57 57 57 57 57 57 56 56 56 56
2680E6%%%%%%%j%J%%%j%J%%%%%%%J%%%%%%%%J%%%%J%%%%%%%%%J%%%%%%%j%%%%%%%%%%j%%%
$$ 56 56 56 56 56 56 56 56 55 55 56 56 56 56 55 55 56 56 56 56 56 56 56 56 57 57 57 57 57 57 57 57 57 58 58 58 58 58 59 59 59 59 59 59 59 59 59 59 60 60 60 60 60 60 60 60 59 59 59 59 59 59 59 59 59 59 59 58 58 58 58
2673E8%%j%%%j%%%%%%%%%%%%%J%%%%%%%%%%%%%%%%%j%%J%%%j%%%%%%%%%%%%%%%%%%%%%%%%
$$ 58 58 58 57 57 57 57 56 56 56 56 56 56 56 56 56 56 56 56 56 56 57 57 57 57 57 57 57 57 57 57 57 57 57 57 57 57 57 57 56 56 56 57 57 57 57 56 56 56 56 56 56 56 56 56 56 56 56 56 56 56 56 56 56 56 56 56 56 56 56 56
2666E6%J%%%%%%%%%%%%%%Jj%%%%%%%%%%%%%%%j%%%%%%%jJ%%%%%%%%j%%%%%%%%%%%J%jJj%J
$$ 56 56 57 57 57 57 57 57 57 57 57 57 57 57 57 57 57 58 57 57 57 57 57 57 57 57 57 57 57 57 57 57 57 57 56 56 56 56 56 56 56 56 55 56 56 56 56 56 56 56 56 56 55 55 55 55 55 55 55 55 55 55 55 55 56 56 55 56 55 55 56
2658E6%%%J%%%%%J%%%%%%%%%%%J%%jJ%%%%%%%%%%%%%%%%j%%%%%%%%j%%%%%j%%%%%%j%%J%%
$$ 56 56 56 56 57 57 57 57 57 57 58 58 58 58 58 58 58 58 58 58 58 58 59 59 59 58 59 59 59 59 59 59 59 59 59 59 59 59 59 59 59 59 59 58 58 58 58 58 58 58 58 58 57 57 57 57 57 57 56 56 56 56 56 56 56 55 55 55 56 56 56
2651E6%%%%%%%%J%%%%%%%%%%%%%%%%%J%%%%%%J%%%%j%%%J%%j%%%%j%%j%%j%%%%%j%%%%J%%
$$ 56 56 56 56 56 56 56 56 56 57 57 57 57 57 57 57 57 57 57 57 57 57 57 57 57 57 57 58 58 58 58 58 58 58 59 59 59 59 59 58 58 58 58 59 59 59 58 58 58 58 58 57 57 57 56 56 56 55 55 55 55 55 55 54 54 54 54 54 55 55 55
2643E5%%%%%%Jj%%%%%%%%%%J%%%%%%%%J%%%%j%%%%%%%%%%%%%%%%%%%%%%%%%%%%%J%%J%%J%
$$ 55 55 55 55 55 55 55 56 55 55 55 55 55 55 55 55 55 55 55 56 56 56 56 56 56 56 56 56 57 57 57 57 57 56 56 56 56 56 56 56 56 56 56 56 56 56 56 56 56 56 56 56 56 56 56 56 56 56 56 56 56 56 56 57 57 57 58 58 58 59 59
2636E9%%%%%%%%j%%%%j%%%%%%j%%%%%%%%%%%%j%%J%%%%%%J%%J%%%%%%%%%%%j%%%%%%%%%%%
$$ 59 59 59 59 59 59 59 59 59 58 58 58 58 58 57 57 57 57 57 57 57 56 56 56 56 56 56 56 56 56 56 56 56 56 55 55 55 56 56 56 56 56 56 56 57 57 57 58 58 58 58 58 58 58 58 58 58 58 58 57 57 57 57 57 57 57 57 57 57 57 57
2628E7%%%%%%%Jj%%%%j%%%j%J%%%j%%J%%%%%%%%JJ%%%%j%%jJ%%%%%%%j%%J%%%%%%%%%jJ%%
$$ 57 57 57 57 57 57 57 57 58 57 57 57 57 57 56 56 56 56 55 55 56 56 56 56 55 55 55 56 56 56 56 56 56 56 56 56 57 58 58 58 58 58 57 57 57 56 57 57 57 57 57 57 57 57 56 56 56 57 57 57 57 57 57 57 57 57 57 56 57 57 57
2621E7%%j%%%%%J%%%J%%%%%%%%%%%j%%%%j%%%%%%%%%%%%J%%%%%%%%%%%%%%%%%%%%%%%j%%%
$$ 57 57 57 56 56 56 56 56 56 57 57 57 57 58 58 58 58 58 58 58 58 58 58 58 58 57 57 57 57 57 56 56 56 56 56 56 56 56 56 56 56 56 56 57 57 57 57 57 57 57 57 57 57 57 57 57 57 57 57 57 57 57 57 57 57 57 57 56 56 56 56
2614E6J%%%%%%%%%%%%%%j%%%%%%%%%%%J%%%%%%%%%%%%%%%%%%%%%%%%%%%%%j%J%%j%%%%%%%
$$ 56 57 57 57 57 57 57 57 57 57 57 57 57 57 57 57 56 56 56 56 56 56 56 56 56 56 56 56 57 57 57 57 57 57 57 57 57 57 57 57 57 57 57 57 57 57 57 57 57 57 57 57 57 57 57 57 57 57 56 56 57 57 57 56 56 56 56 56 56 56 56
2606E6J%%%%%%%jJ%%jJ%%%%%%%%%%%%%%J%%j%%%%%%%%%%%%%%%j%%J%%%j%%%%%%%%%%%%J%%
$$ 56 57 57 57 57 57 57 57 57 56 57 57 57 56 57 57 57 57 57 57 57 57 57 57 57 57 57 57 57 58 58 58 57 57 57 57 57 57 57 57 57 57 57 57 57 57 57 57 56 56 56 57 57 57 57 56 56 56 56 56 56 56 56 56 56 56 56 56 57 57 57
2599E7%%%%%%%j%%%%%%%%J%%j%%J%%%j%%J%%%%%%%%%%j%%J%%jJ%%%%%%%%%%%%%%%%%%%%J%
$$ 57 57 57 57 57 57 57 57 56 56 56 56 56 56 56 56 56 57 57 57 56 56 56 57 57 57 57 56 56 56 57 57 57 57 57 57 57 57 57 57 57 56 56 56 57 57 57 56 57 57 57 57 57 57 57 57 57 57 57 57 57 57 57 57 57 57 57 57 57 58 58
2591E8%%%%%%%%j%J%%j%%%%%%%j%%%%%j%%%%%%J%%%%%%%Jj%%%%J%%%%%%%J%%%%%%%%%%%%%
$$ 58 58 58 58 58 58 58 58 58 57 57 58 58 58 57 57 57 57 57 57 57 57 56 56 56 56 56 56 55 55 55 55 55 55 55 56 56 56 56 56 56 56 56 57 56 56 56 56 56 57 57 57 57 57 57 57 57 58 58 58 58 58 58 58 58 58 58 58 58 58 58
2584E8%%Jj%%%%%%%j%%%%%%%%%j%%%%%%%%j%%%%%%%%J%jJ%j%%%J%%%%J%%%%%%%%%%%%%%%%
$$ 58 58 58 59 58 58 58 58 58 58 58 58 57 57 57 57 57 57 57 57 57 57 56 56 56 56 56 56 56 56 56 55 55 55 55 55 55 55 55 55 56 56 55 56 56 55 55 55 55 56 56 56 56 56 57 57 57 57 57 57 57 57 57 57 57 57 57 57 57 57 57
2577E7%%%%%%%%%%J%j%%%j%%%%%%%%jJ%%%%%%%%%%%%%%%%%%%%%%%%%J%%%%%%%%j%%%%J%%%
$$ 57 57 57 57 57 57 57 57 57 57 57 58 58 57 57 57 57 56 56 56 56 56 56 56 56 56 55 56 56 56 56 56 56 56 56 56 56 56 56 56 56 56 56 56 56 56 56 56 56 56 56 56 56 57 57 57 57 57 57 57 57 57 56 56 56 56 56 57 57 57 57
2569E7%%%%%%%%%j%%%%J%%%%%%%j%%%%%%%%%%%%%%%%J%%%%J%%J%%%Jj%%%j%%%j%%%%%%%%%
$$ 57 57 57 57 57 57 57 57 57 57 56 56 56 56 56 57 57 57 57 57 57 57 57 56 56 56 56 56 56 56 56 56 56 56 56 56 56 56 56 56 57 57 57 57 57 58 58 58 59 59 59 59 60 59 59 59 59 58 58 58 58 57 57 57 57 57 57 57 57 57 57
2562E7%%%%%%jJ%%%%%%%j%J%%%%%%%%%%%%%%%%%%%%%%%%%%%J%%J%%%%%%j%j%%%%%%%jJ%%%
$$ 57 57 57 57 57 57 57 56 57 57 57 57 57 57 57 57 56 56 57 57 57 57 57 57 57 57 57 57 57 57 57 57 57 57 57 57 57 57 57 57 57 57 57 57 57 57 58 58 58 59 59 59 59 59 59 59 58 58 57 57 57 57 57 57 57 57 56 57 57 57 57
2554E7%j%%%%%%%J%%%J%%%%J%j%%j%%%j%%%%%%%%%%%%%J%%j%%%%%%%%J%%%%%%%%%%%j%%%J
$$ 57 57 56 56 56 56 56 56 56 56 57 57 57 57 58 58 58 58 58 59 59 58 58 58 57 57 57 57 56 56 56 56 56 56 56 56 56 56 56 56 56 56 57 57 57 56 56 56 56 56 56 56 56 56 57 57 57 57 57 57 57 57 57 57 57 57 56 56 56 56 57
2547E7%%%%%%%%%%%%%J%%%%%%%%j%j%%%%%%J%%%%%%%%%%%j%%J%%%%%%%%%%%%%%%%%%%%%%%
$$ 57 57 57 57 57 57 57 57 57 57 57 57 57 57 58 58 58 58 58 58 58 58 58 57 57 56 56 56 56 56 56 56 57 57 57 57 57 57 57 57 57 57 57 57 56 56 56 57 57 57 57 57 57 57 57 57 57 57 57 57 57 57 57 57 57 57 57 57 57 57 57
2539E7j%%%%J%%j%%%%%%%%%%%%%%%%%%J%%%%%j%%%%%%%%%%%%%%%%%%%%%%%%%%%%%%%%%%%%
$$ 57 56 56 56 56 56 57 57 57 56 56 56 56 56 56 56 56 56 56 56 56 56 56 56 56 56 56 56 57 57 57 57 57 57 56 56 56 56 56 56 56 56 56 56 56 56 56 56 56 56 56 56 56 56 56 56 56 56 56 56 56 56 56 56 56 56 56 56 56 56 56
2532E6%%%%%%%%%%jJ%%%%%%%%%%jJ%%%%%%%%%%%%%%%%%%%%%%%%%%%%%%%%%%%%%%%%%%%%%%
$$ 56 56 56 56 56 56 56 56 56 56 56 55 56 56 56 56 56 56 56 56 56 56 56 55 56 56 56 56 56 56 56 56 56 56 56 56 56 56 56 56 56 56 56 56 56 56 56 56 56 56 56 56 56 56 56 56 56 56 56 56 56 56 56 56 56 56 56 56 56 56 56
2525E6j%%%J%%%%%%%%%%%%%%%%%%%%%%%%%%%%%%%%%%%%J%%%%%j%%%%%%%%%%%%%%%%%%%%%%
$$ 56 55 55 55 55 56 56 56 56 56 56 56 56 56 56 56 56 56 56 56 56 56 56 56 56 56 56 56 56 56 56 56 56 56 56 56 56 56 56 56 56 56 57 57 57 57 57 57 56 56 56 56 56 56 56 56 56 56 56 56 56 56 56 56 56 56 56 56 56 56 56
2517E6%J%%%%j%%%J%%%%%%%%%Jj%%%%%%%%%%%%%%%%%%%%%%%%%%%jJ%%%%%%%%%%J%%%%%%%%
$$ 56 56 57 57 57 57 57 56 56 56 56 57 57 57 57 57 57 57 57 57 57 58 57 57 57 57 57 57 57 57 57 57 57 57 57 57 57 57 57 57 57 57 57 57 57 57 57 57 57 57 56 57 57 57 57 57 57 57 57 57 57 57 58 58 58 58 58 58 58 58 58
2510E8%%%%%j%%%%%%%%%%%%%j%%%J%%j%%%J%%%%%%%%%%%%%%%%%%%%%%%%%%%%j%%%%%%%%%%
$$ 58 58 58 58 58 58 57 57 57 57 57 57 57 57 57 57 57 57 57 57 56 56 56 56 57 57 57 56 56 56 56 57 57 57 57 57 57 57 57 57 57 57 57 57 57 57 57 57 57 57 57 57 57 57 57 57 57 57 57 57 56 56 56 56 56 56 56 56 56 56 56
2502E6%%%%%%%%%%%j%%%%%%%%%%%%%%%%%%J%%%%%j%J%%%%%%%%%%%%%j%%%%%%%%%%%%%%%%%
$$ 56 56 56 56 56 56 56 56 56 56 56 56 55 55 55 55 55 55 55 55 55 55 55 55 55 55 55 55 55 55 55 56 56 56 56 56 56 55 55 56 56 56 56 56 56 56 56 56 56 56 56 56 56 55 55 55 55 55 55 55 55 55 55 55 55 55 55 55 55 55 55
2495E5%%%j%%J%%%%%%%%%%%%J%%%%%%%Jj%%%%%%%%%%%%%j%%%%%%%%%%%%%%%%%%%%%%%%%J%
$$ 55 55 55 55 54 54 54 55 55 55 55 55 55 55 55 55 55 55 55 55 56 56 56 56 56 56 56 56 57 56 56 56 56 56 56 56 56 56 56 56 56 56 56 55 55 55 55 55 55 55 55 55 55 55 55 55 55 55 55 55 55 55 55 55 55 55 55 55 55 56 56
2488E6%%%%%%%%J%%j%%%%%%%%%%%%%J%%%%%j%%%%%%%%%%%%%j%%%%%%%%%%%%%%%J%%%%%%%%
$$ 56 56 56 56 56 56 56 56 56 57 57 57 56 56 56 56 56 56 56 56 56 56 56 56 56 56 57 57 57 57 57 57 56 56 56 56 56 56 56 56 56 56 56 56 56 56 55 55 55 55 55 55 55 55 55 55 55 55 55 55 55 55 56 56 56 56 56 56 56 56 56
2480E6%%%J%%jJ%%%%%%%%%%%%%%%%j%%%J%%%%%%%%%%J%j%%%j%J%%%%%%J%%%%j%%%%Jj%%%%
$$ 56 56 56 56 57 57 57 56 57 57 57 57 57 57 57 57 57 57 57 57 57 57 57 57 57 56 56 56 56 57 57 57 57 57 57 57 57 57 57 57 58 58 57 57 57 57 56 56 57 57 57 57 57 57 57 58 58 58 58 58 57 57 57 57 57 58 57 57 57 57 57
2473E7%%%%%%%%%%%jJ%%%%%j%%%j%j%%%%%%%%%%%%%%%jJ%%%%%%%%%%%%J%%j%%%%%%%%%%j%
$$ 57 57 57 57 57 57 57 57 57 57 57 57 56 57 57 57 57 57 57 56 56 56 56 55 55 54 54 54 54 54 54 54 54 54 54 54 54 54 54 54 54 53 54 54 54 54 54 54 54 54 54 54 54 54 54 55 55 55 54 54 54 54 54 54 54 54 54 54 54 53 53
2465E3%%%%%%%%%%%%%J%j%J%%%%%%J%%%%%%J%%%%%%%%%%%%J%%%%%%%%%%%%%%j%J%%%%%%%%
$$ 53 53 53 53 53 53 53 53 53 53 53 53 53 53 54 54 53 53 54 54 54 54 54 54 54 55 55 55 55 55 55 55 56 56 56 56 56 56 56 56 56 56 56 56 56 57 57 57 57 57 57 57 57 57 57 57 57 57 57 57 56 56 57 57 57 57 57 57 57 57 57
2458E7%J%%%%%J%%%%%%J%%%%%%%%j%%%%%j%%%%%%j%%%%%%%j%%%%%J%%%%%%%%%%%%%%%%%%%
$$ 57 57 58 58 58 58 58 58 59 59 59 59 59 59 59 60 60 60 60 60 60 60 60 60 59 59 59 59 59 59 58 58 58 58 58 58 58 57 57 57 57 57 57 57 57 56 56 56 56 56 56 57 57 57 57 57 57 57 57 57 57 57 57 57 57 57 57 57 57 57 57
2450E7%%%%%j%%%%%%%%j%%%%j%%%%%%%%%%%%%%%%%%%%%%%%%%%%%J%%%%J%%%%%%%%%%%%%j%
$$ 57 57 57 57 57 57 56 56 56 56 56 56 56 56 56 55 55 55 55 55 54 54 54 54 54 54 54 54 54 54 54 54 54 54 54 54 54 54 54 54 54 54 54 54 54 54 54 54 54 54 55 55 55 55 55 56 56 56 56 56 56 56 56 56 56 56 56 56 56 55 55
2443E5%%%%%J%%%%%%%%%%%%%%%%%%%%%%%%J%%%%%%%%%%%%%%%%%%%%%%%%%%%%%%%%%j%%J%j
$$ 55 55 55 55 55 55 56 56 56 56 56 56 56 56 56 56 56 56 56 56 56 56 56 56 56 56 56 56 56 56 56 57 57 57 57 57 57 57 57 57 57 57 57 57 57 57 57 57 57 57 57 57 57 57 57 57 57 57 57 57 57 57 57 57 57 56 56 56 57 57 56
2436E6%%%%%j%J%%%%%%J%%%%%%%%%%%%J%%%j%%%%%%%%j%%%%%%%%%%%j%J%%%%%%%%j%%%%J%
$$ 56 56 56 56 56 56 55 55 56 56 56 56 56 56 56 57 57 57 57 57 57 57 57 57 57 57 57 57 58 58 58 58 57 57 57 57 57 57 57 57 57 56 56 56 56 56 56 56 56 56 56 56 56 55 55 56 56 56 56 56 56 56 56 56 55 55 55 55 55 56 56
2428E6%%%%%%%%%%%%%%%%%%%%%%%%%%%%%%%%%%%%%jJ%%%%%%%%%%%%%%%j%%%%%Jj%%%%%%J%
$$ 56 56 56 56 56 56 56 56 56 56 56 56 56 56 56 56 56 56 56 56 56 56 56 56 56 56 56 56 56 56 56 56 56 56 56 56 56 56 55 56 56 56 56 56 56 56 56 56 56 56 56 56 56 56 56 55 55 55 55 55 55 56 55 55 55 55 55 55 55 56 56
2421E6%%%%%%%%%%%%%%J%%%%%%%%%%%%%%%%%%%%%%j%%%%%%%%%%%%%%%%%%%%%%%%%%%%J%%%
$$ 56 56 56 56 56 56 56 56 56 56 56 56 56 56 56 57 57 57 57 57 57 57 57 57 57 57 57 57 57 57 57 57 57 57 57 57 57 57 56 56 56 56 56 56 56 56 56 56 56 56 56 56 56 56 56 56 56 56 56 56 56 56 56 56 56 56 56 57 57 57 57
2413E7%%%%%%%%%%%%%%%%%%%%%%%j%%%%%%%%%%%%%%%%%%%%%%%%%%%%j%%%%%J%%%%%%j%%%%
$$ 57 57 57 57 57 57 57 57 57 57 57 57 57 57 57 57 57 57 57 57 57 57 57 57 56 56 56 56 56 56 56 56 56 56 56 56 56 56 56 56 56 56 56 56 56 56 56 56 56 56 56 56 56 55 55 55 55 55 55 56 56 56 56 56 56 56 55 55 55 55 55
2406E5%%%%%%%%J%%%j%%Jj%%%%%%%%%%%%%%%%%%%%Jj%%J%%%%%%%%%%%%%%%%%%%%%%%%%%%%
$$ 55 55 55 55 55 55 55 55 55 56 56 56 56 55 55 55 56 55 55 55 55 55 55 55 55 55 55 55 55 55 55 55 55 55 55 55 55 55 56 55 55 55 56 56 56 56 56 56 56 56 56 56 56 56 56 56 56 56 56 56 56 56 56 56 56 56 56 56 56 56 56
2398E6%j%%%%J%%%%%j%J%%%%%%%%%%%%%%%%%%%%%%%%%%%%%%%%%%%%%%%%%%%%%%%%%%%%%%%
$$ 56 56 55 55 55 55 55 56 56 56 56 56 56 55 55 56 56 56 56 56 56 56 56 56 56 56 56 56 56 56 56 56 56 56 56 56 56 56 56 56 56 56 56 56 56 56 56 56 56 56 56 56 56 56 56 56 56 56 56 56 56 56 56 56 56 56 56 56 56 56 56
2391E6%%%j%%%%%%%%%%%%%%%%%%%J%%%%%%%%%%%%%%%%Jj%%%%%%%%%%%%%%%%%j%%%%%%J%%%
$$ 56 56 56 56 55 55 55 55 55 55 55 55 55 55 55 55 55 55 55 55 55 55 55 55 56 56 56 56 56 56 56 56 56 56 56 56 56 56 56 56 56 57 56 56 56 56 56 56 56 56 56 56 56 56 56 56 56 56 56 56 55 55 55 55 55 55 55 56 56 56 56
2384E6%%%%%%%%%%j%%J%%%%j%J%%%%%jJ%%j%%%%%%%%%%%%%%%%%%%%%%%%%%%%%%%J%%%%%%%
$$ 56 56 56 56 56 56 56 56 56 56 56 55 55 55 56 56 56 56 56 55 55 56 56 56 56 56 56 55 56 56 56 55 55 55 55 55 55 55 55 55 55 55 55 55 55 55 55 55 55 55 55 55 55 55 55 55 55 55 55 55 55 55 55 56 56 56 56 56 56 56 56
2376E6%%%%%%%%%%%%%%%%%%%%%%%%%%%j%%J%%%j%%%%%%%%%%%%%%%%%%%%%jJ%%%J%%%%%%%%
$$ 56 56 56 56 56 56 56 56 56 56 56 56 56 56 56 56 56 56 56 56 56 56 56 56 56 56 56 56 55 55 55 56 56 56 56 55 55 55 55 55 55 55 55 55 55 55 55 55 55 55 55 55 55 55 55 55 55 54 55 55 55 55 56 56 56 56 56 56 56 56 56
2369E6%%J%%%j%%%%%%%%%%%%%j%J%%%%%%%%%%%%%%%j%%%%%%%%%%%%%%%%%%%%%%%%%%%%J%%
$$ 56 56 56 57 57 57 57 56 56 56 56 56 56 56 56 56 56 56 56 56 56 55 55 56 56 56 56 56 56 56 56 56 56 56 56 56 56 56 56 55 55 55 55 55 55 55 55 55 55 55 55 55 55 55 55 55 55 55 55 55 55 55 55 55 55 55 55 55 56 56 56
2361E6%%%%%%%%%%%%%%%%%%%%%%%%%%%%%%%%%%%%%%%%%jJ%%%%%%%%%%%%%%%%%%%%%%%%%%%
$$ 56 56 56 56 56 56 56 56 56 56 56 56 56 56 56 56 56 56 56 56 56 56 56 56 56 56 56 56 56 56 56 56 56 56 56 56 56 56 56 56 56 56 55 56 56 56 56 56 56 56 56 56 56 56 56 56 56 56 56 56 56 56 56 56 56 56 56 56 56 56 56
2354E6%%%%%%%%%%%%%%%%%%%J%%%%%%%%%%%%j%%%%%%%%%%%%%%%%%%%%%%%%%%%%%%%%%%%%J
$$ 56 56 56 56 56 56 56 56 56 56 56 56 56 56 56 56 56 56 56 56 57 57 57 57 57 57 57 57 57 57 57 57 57 56 56 56 56 56 56 56 56 56 56 56 56 56 56 56 56 56 56 56 56 56 56 56 56 56 56 56 56 56 56 56 56 56 56 56 56 56 57
2347E7%%%%j%%%%%%%J%%%%%j%%%J%%%%%j%%Jj%%%J%%%%%%j%%%%%%%%%%%%%%%%J%j%%%%%%%
$$ 57 57 57 57 57 56 56 56 56 56 56 56 56 57 57 57 57 57 57 56 56 56 56 57 57 57 57 57 57 56 56 56 57 56 56 56 56 57 57 57 57 57 57 57 56 56 56 56 56 56 56 56 56 56 56 56 56 56 56 56 56 57 57 56 56 56 56 56 56 56 56
2339E6%%%%%%%%%%%%%%%%%%%%%%%J%j%%%%%%%%%%%%%%%%%%%%%%j%%%%%J%%%%%%%%%%%%jJj
$$ 56 56 56 56 56 56 56 56 56 56 56 56 56 56 56 56 56 56 56 56 56 56 56 56 57 57 56 56 56 56 56 56 56 56 56 56 56 56 56 56 56 56 56 56 56 56 56 56 56 55 55 55 55 55 55 56 56 56 56 56 56 56 56 56 56 56 56 56 55 56 55
2332E5%%%%%%%J%%j%%%%%J%%%%%%%%%%%%%%%%%%%%%%%%%%%%%%jJ%%%%%%%%j%%%%%%J%%%%%
$$ 55 55 55 55 55 55 55 55 56 56 56 55 55 55 55 55 55 56 56 56 56 56 56 56 56 56 56 56 56 56 56 56 56 56 56 56 56 56 56 56 56 56 56 56 56 56 56 56 55 56 56 56 56 56 56 56 56 56 55 55 55 55 55 55 55 56 56 56 56 56 56
2324E6j%%%%%%%%%%%%%%%%%%%%%%%%%%%%%%%J%%%%%j%%%%%%%%%J%%%jJ%%%%j%%%%%%%%J%%
$$ 56 55 55 55 55 55 55 55 55 55 55 55 55 55 55 55 55 55 55 55 55 55 55 55 55 55 55 55 55 55 55 55 55 56 56 56 56 56 56 55 55 55 55 55 55 55 55 55 55 56 56 56 56 55 56 56 56 56 56 55 55 55 55 55 55 55 55 55 56 56 56
2317E6j%%J%%j%%%%%%J%%j%%%%%%%%%%%%%%%%%%%%j%%J%%%%%%J%%%%%%%%%J%%%%%%%%%%%%
$$ 56 55 55 55 56 56 56 55 55 55 55 55 55 55 56 56 56 55 55 55 55 55 55 55 55 55 55 55 55 55 55 55 55 55 55 55 55 55 54 54 54 55 55 55 55 55 55 55 56 56 56 56 56 56 56 56 56 56 57 57 57 57 57 57 57 57 57 57 57 57 57
2309E7%%%%%%%%%%%j%%%%J%j%%%%%j%%%%%%%%%%%%%%%%%%%%%%J%%%%%%%%%%%J%%%%%%%%%%
$$ 57 57 57 57 57 57 57 57 57 57 57 57 56 56 56 56 56 57 57 56 56 56 56 56 56 55 55 55 55 55 55 55 55 55 55 55 55 55 55 55 55 55 55 55 55 55 55 55 56 56 56 56 56 56 56 56 56 56 56 56 57 57 57 57 57 57 57 57 57 57 57
2302E7J%%%%j%J%%%%%%j%%%%%%%j%%%%%j%%J%j%%%%%%%%%%%%%%%%%%%%%%%J%%%%%%%J%j%%
$$ 57 58 58 58 58 58 57 57 58 58 58 58 58 58 58 57 57 57 57 57 57 57 57 56 56 56 56 56 56 55 55 55 56 56 55 55 55 55 55 55 55 55 55 55 55 55 55 55 55 55 55 55 55 55 55 55 55 55 56 56 56 56 56 56 56 56 57 57 56 56 56
2295E6%%%%%J%%J%%j%%%%%%%%%%j%%%%%%%%%%%%%%j%%%jJ%%%%%%%%%%%%%JjJ%%j%%%%%%J%
$$ 56 56 56 56 56 56 57 57 57 58 58 58 57 57 57 57 57 57 57 57 57 57 57 56 56 56 56 56 56 56 56 56 56 56 56 56 56 56 55 55 55 55 54 55 55 55 55 55 55 55 55 55 55 55 55 55 55 56 55 56 56 56 55 55 55 55 55 55 55 56 56
2287E6%%%%%%%%%%%%%%%%J%%j%%J%j%%J%%%%%%j%%%%%%%%%%%j%%%%%%%%%%J%%j%%%%J%j%%
$$ 56 56 56 56 56 56 56 56 56 56 56 56 56 56 56 56 56 57 57 57 56 56 56 57 57 56 56 56 57 57 57 57 57 57 57 56 56 56 56 56 56 56 56 56 56 56 56 55 55 55 55 55 55 55 55 55 55 55 56 56 56 55 55 55 55 55 56 56 55 55 55
2280E5%%J%%%%%%%%%%%%%J%%%%%%%%%%jJj%%%%%%%%%%%%%%%%%%%%%%%%%%%%%%%j%J%%%%%%
$$ 55 55 55 56 56 56 56 56 56 56 56 56 56 56 56 56 56 57 57 57 57 57 57 57 57 57 57 57 56 57 56 56 56 56 56 56 56 56 56 56 56 56 56 56 56 56 56 56 56 56 56 56 56 56 56 56 56 56 56 56 56 56 55 55 56 56 56 56 56 56 56
2272E6%%%%%%%%%J%j%%J%%%j%%J%%%j%%%%%%%%%j%%%%J%%%%%%%%%%%%%%%%%%%%%%%%%%%%%
$$ 56 56 56 56 56 56 56 56 56 56 57 57 56 56 56 57 57 57 57 56 56 56 57 57 57 57 56 56 56 56 56 56 56 56 56 56 55 55 55 55 55 56 56 56 56 56 56 56 56 56 56 56 56 56 56 56 56 56 56 56 56 56 56 56 56 56 56 56 56 56 56
2265E6%%%%%%%j%%%%J%%%j%%%J%jJj%J%%%%j%J%%%%%%%%%%%%%J%%jJj%J%%%j%%%%%%%%%%%
$$ 56 56 56 56 56 56 56 56 55 55 55 55 55 56 56 56 56 55 55 55 55 56 56 55 56 55 55 56 56 56 56 56 55 55 56 56 56 56 56 56 56 56 56 56 56 56 56 56 57 57 57 56 57 56 56 57 57 57 57 56 56 56 56 56 56 56 56 56 56 56 56
2258E6%%%%%%%%%%%%%%%%%%%j%J%%%%%%%jJj%Jj%J%%%%%%%%%%%%%%%%%%%%%%%%%%%%%%%%%
$$ 56 56 56 56 56 56 56 56 56 56 56 56 56 56 56 56 56 56 56 56 55 55 56 56 56 56 56 56 56 56 55 56 55 55 56 55 55 56 56 56 56 56 56 56 56 56 56 56 56 56 56 56 56 56 56 56 56 56 56 56 56 56 56 56 56 56 56 56 56 56 56
2250E6%%%%%%%%%%%%%%j%J%%%%%j%%%%%%%%%%%%%%%%%%%%%%%%%%%%%%%%%%%%%%%%%%J%%%%
$$ 56 56 56 56 56 56 56 56 56 56 56 56 56 56 56 55 55 56 56 56 56 56 56 55 55 55 55 55 55 55 55 55 55 55 55 55 55 55 55 55 55 55 55 55 55 55 55 55 55 55 55 55 55 55 55 55 55 55 55 55 55 55 55 55 55 55 56 56 56 56 56
2243E6j%%%%%%%%%%%%%%%%%%%%%%%%%%%%%%%%%%%%%J%%j%%%%%%%%%Jj%%J%%jJ%%%%j%%%%J
$$ 56 55 55 55 55 55 55 55 55 55 55 55 55 55 55 55 55 55 55 55 55 55 55 55 55 55 55 55 55 55 55 55 55 55 55 55 55 55 55 56 56 56 55 55 55 55 55 55 55 55 55 55 56 55 55 55 56 56 56 55 56 56 56 56 56 55 55 55 55 55 56
2235E6%j%%%%%J%%%j%%%%%%%J%%j%%%%%%%%J%%j%%%%%%%%%%%%J%%j%%%J%%j%%%%%%%%%%%%
$$ 56 56 55 55 55 55 55 55 56 56 56 56 55 55 55 55 55 55 55 55 56 56 56 55 55 55 55 55 55 55 55 55 56 56 56 55 55 55 55 55 55 55 55 55 55 55 55 55 56 56 56 55 55 55 55 56 56 56 55 55 55 55 55 55 55 55 55 55 55 55 55
2228E5%%%%%%%%%%%%%%%%%%%%%%%%%%%%%%%%%J%%%%%%%%%%J%%%%%%J%JKJKJJJJ%jkjkkjj%
$$ 55 55 55 55 55 55 55 55 55 55 55 55 55 55 55 55 55 55 55 55 55 55 55 55 55 55 55 55 55 55 55 55 55 55 56 56 56 56 56 56 56 56 56 56 56 57 57 57 57 57 57 57 58 58 59 61 62 64 65 66 67 68 68 67 65 64 62 60 59 58 58
2220E8j%%%j%%%%%%%%%%%%%%%%%%%%%%%%%%%%%%%%%%%%%%%%%%%%%%%%%%%%%%%%%%%%j%%%%
$$ 58 57 57 57 57 56 56 56 56 56 56 56 56 56 56 56 56 56 56 56 56 56 56 56 56 56 56 56 56 56 56 56 56 56 56 56 56 56 56 56 56 56 56 56 56 56 56 56 56 56 56 56 56 56 56 56 56 56 56 56 56 56 56 56 56 56 55 55 55 55 55
2213E5%%J%%%%%%%j%%%%J%%%%%j%%%%%%%%%%%%%%%%%%%j%%%%%%%%%%%%J%%%%%%%%%%j%J%%
$$ 55 55 55 56 56 56 56 56 56 56 56 55 55 55 55 55 56 56 56 56 56 56 55 55 55 55 55 55 55 55 55 55 55 55 55 55 55 55 55 55 55 55 54 54 54 54 54 54 54 54 54 54 54 54 54 55 55 55 55 55 55 55 55 55 55 55 54 54 55 55 55
2206E5jJ%%%%%%%%%%%%%%%j%J%%%%%%%%%%%%%%%%%%%%J%%%%%%%%%j%%%%J%%%%%%j%J%%%%%
$$ 55 54 55 55 55 55 55 55 55 55 55 55 55 55 55 55 55 55 54 54 55 55 55 55 55 55 55 55 55 55 55 55 55 55 55 55 55 55 55 55 55 56 56 56 56 56 56 56 56 56 56 55 55 55 55 55 56 56 56 56 56 56 56 55 55 56 56 56 56 56 56
2198E6%J%j%%%%%%%%%%%%%%%Jj%J%%%%%%%%j%%J%%%%%%%%%%%%%%%%%%j%%%%%J%%%%%%%j%%
$$ 56 56 57 57 56 56 56 56 56 56 56 56 56 56 56 56 56 56 56 56 57 56 56 57 57 57 57 57 57 57 57 57 56 56 56 57 57 57 57 57 57 57 57 57 57 57 57 57 57 57 57 57 57 57 56 56 56 56 56 56 57 57 57 57 57 57 57 57 56 56 56
2191E6%%J%j%%J%j%%%%%%%%%%%J%%j%%%%%%%%%J%j%%%%J%%%%%%%j%%%%%%%%%%%%%jJ%j%%%
$$ 56 56 56 57 57 56 56 56 57 57 56 56 56 56 56 56 56 56 56 56 56 56 57 57 57 56 56 56 56 56 56 56 56 56 56 57 57 56 56 56 56 56 57 57 57 57 57 57 57 57 56 56 56 56 56 56 56 56 56 56 56 56 56 56 55 56 56 55 55 55 55
2183E5%%%%%%%%%%%%%%%%%%%%%%%J%%%%%%%%%%%%%%%%j%J%%%%%%j%%%J%%%%%j%%%%%J%jJj
$$ 55 55 55 55 55 55 55 55 55 55 55 55 55 55 55 55 55 55 55 55 55 55 55 55 56 56 56 56 56 56 56 56 56 56 56 56 56 56 56 56 56 55 55 56 56 56 56 56 56 56 55 55 55 55 56 56 56 56 56 56 55 55 55 55 55 55 56 56 55 56 55
2176E5%J%%%%%jJ%%%%%%%%%%%%%j%%%J%%%%%%%%%j%%J%%%%%%%%%j%%J%jJ%%%j%%%%%%%%%%
$$ 55 55 56 56 56 56 56 56 55 56 56 56 56 56 56 56 56 56 56 56 56 56 56 55 55 55 55 56 56 56 56 56 56 56 56 56 56 55 55 55 56 56 56 56 56 56 56 56 56 56 55 55 55 56 56 55 56 56 56 56 55 55 55 55 55 55 55 55 55 55 55
2169E5J%%%%%%%%%%%%%%%%%%%%jJ%%%J%%%jJj%%%%%%%%%%%%%%%%%%%%%%%J%%j%%%%%J%j%%
$$ 55 56 56 56 56 56 56 56 56 56 56 56 56 56 56 56 56 56 56 56 56 56 55 56 56 56 56 57 57 57 57 56 57 56 56 56 56 56 56 56 56 56 56 56 56 56 56 56 56 56 56 56 56 56 56 56 56 57 57 57 56 56 56 56 56 56 57 57 56 56 56
2161E6%%%%%%%%%%J%j%J%%%%%%%j%%%%%%%J%%%%%j%%%%%%%%%J%%%%%%%%%j%%%%%%%%%J%j%
$$ 56 56 56 56 56 56 56 56 56 56 56 57 57 56 56 57 57 57 57 57 57 57 57 56 56 56 56 56 56 56 56 57 57 57 57 57 57 56 56 56 56 56 56 56 56 56 56 57 57 57 57 57 57 57 57 57 57 56 56 56 56 56 56 56 56 56 56 57 57 56 56
2154E6%%%%%%%J%%j%Jj%%%%%%%%%%%j%%%%%%%%%%%%%%%%%%%%%%%%%%%j%%%%%J%%%%%%%%%%
$$ 56 56 56 56 56 56 56 56 57 57 57 56 56 57 56 56 56 56 56 56 56 56 56 56 56 56 55 55 55 55 55 55 55 55 55 55 55 55 55 55 55 55 55 55 55 55 55 55 55 55 55 55 55 55 54 54 54 54 54 54 55 55 55 55 55 55 55 55 55 55 55
2146E5%%%%J%%%%%j%J%%j%%%%%%%%Jj%%%%%%%%%%%%%%%%%%Jj%%%%%%%%%%%%%%%%%J%%%%%%
$$ 55 55 55 55 55 56 56 56 56 56 56 55 55 56 56 56 55 55 55 55 55 55 55 55 55 56 55 55 55 55 55 55 55 55 55 55 55 55 55 55 55 55 55 55 55 56 55 55 55 55 55 55 55 55 55 55 55 55 55 55 55 55 55 55 56 56 56 56 56 56 56
2139E6%%%%%%%%%%%j%%J%%%%%%%%%%%%%%%%%%%%%%%%%%%%%%%%%%%%%%%%%%%%%%%%%%%%%%%
$$ 56 56 56 56 56 56 56 56 56 56 56 56 55 55 55 56 56 56 56 56 56 56 56 56 56 56 56 56 56 56 56 56 56 56 56 56 56 56 56 56 56 56 56 56 56 56 56 56 56 56 56 56 56 56 56 56 56 56 56 56 56 56 56 56 56 56 56 56 56 56 56
2131E6%%%%%%%%%%%%%%%%%J%j%%%%%%%%%%%%%%%%%%%%%%%%%%%%%%%%%%%%%%%%Jj%%%%%%%%
$$ 56 56 56 56 56 56 56 56 56 56 56 56 56 56 56 56 56 56 57 57 56 56 56 56 56 56 56 56 56 56 56 56 56 56 56 56 56 56 56 56 56 56 56 56 56 56 56 56 56 56 56 56 56 56 56 56 56 56 56 56 56 57 56 56 56 56 56 56 56 56 56
2124E6%%%j%%%%J%%%%%%%%%%%%%%%%%%%%%%%%%%%%%%%%%%%%%%%%%jJj%%%%%%%%%%%%%J%%%
$$ 56 56 56 56 55 55 55 55 55 56 56 56 56 56 56 56 56 56 56 56 56 56 56 56 56 56 56 56 56 56 56 56 56 56 56 56 56 56 56 56 56 56 56 56 56 56 56 56 56 56 56 55 56 55 55 55 55 55 55 55 55 55 55 55 55 55 55 56 56 56 56
2117E6jJ%%%j%%J%%%%%%%%%%%%%%%%%%%%%%%%%%%%%%%%%%%%%%%%%%%%%%%%%%%%%%%%%%%%%
$$ 56 55 56 56 56 56 55 55 55 56 56 56 56 56 56 56 56 56 56 56 56 56 56 56 56 56 56 56 56 56 56 56 56 56 56 56 56 56 56 56 56 56 56 56 56 56 56 56 56 56 56 56 56 56 56 56 56 56 56 56 56 56 56 56 56 56 56 56 56 56 56
2109E6%%%%%%%%%%%%%%%%%%%%%%%%%%%%%j%J%%%%%%%%%%%%%%%%%%%%%%%%%%%%%%%%%%%%%%
$$ 56 56 56 56 56 56 56 56 56 56 56 56 56 56 56 56 56 56 56 56 56 56 56 56 56 56 56 56 56 56 55 55 56 56 56 56 56 56 56 56 56 56 56 56 56 56 56 56 56 56 56 56 56 56 56 56 56 56 56 56 56 56 56 56 56 56 56 56 56 56 56
2102E6%%%%%%%%%%%%%%%J%%%j%%%%%%%%%%%%%%%%%%%%%%jJ%%%j%%%%%J%%%%%j%%%J%%%%%%
$$ 56 56 56 56 56 56 56 56 56 56 56 56 56 56 56 56 57 57 57 57 56 56 56 56 56 56 56 56 56 56 56 56 56 56 56 56 56 56 56 56 56 56 56 55 56 56 56 56 55 55 55 55 55 55 56 56 56 56 56 56 55 55 55 55 56 56 56 56 56 56 56
2094E6%%%%%%%%%%%%%%%%%%%%%%%%%j%%J%%%j%%%%%%%%J%%%%%%%%%%%%%%%%%j%%J%%%%%%%
$$ 56 56 56 56 56 56 56 56 56 56 56 56 56 56 56 56 56 56 56 56 56 56 56 56 56 56 55 55 55 56 56 56 56 55 55 55 55 55 55 55 55 55 56 56 56 56 56 56 56 56 56 56 56 56 56 56 56 56 56 56 55 55 55 56 56 56 56 56 56 56 56
2087E6%%j%%%J%%%%%%%%%%j%%%%%%%%%J%%jJj%J%%%%%%j%%%%J%%%%%%%%%%%%%%%%%%%%%j%
$$ 56 56 56 55 55 55 55 56 56 56 56 56 56 56 56 56 56 56 55 55 55 55 55 55 55 55 55 55 56 56 56 55 56 55 55 56 56 56 56 56 56 56 55 55 55 55 55 56 56 56 56 56 56 56 56 56 56 56 56 56 56 56 56 56 56 56 56 56 56 55 55
2080E5%%%%%%%%%%%%%%%%%%Jj%%%%%%%%%%J%%%j%%%%%%%%%%%J%%%%%%%%%%%%j%%J%%%%%%%
$$ 55 55 55 55 55 55 55 55 55 55 55 55 55 55 55 55 55 55 55 56 55 55 55 55 55 55 55 55 55 55 55 56 56 56 56 55 55 55 55 55 55 55 55 55 55 55 55 56 56 56 56 56 56 56 56 56 56 56 56 56 55 55 55 56 56 56 56 56 56 56 56
2072E6%%%%%%%%%%%%%%%j%%%%%%%J%j%%%%%%%%%%%%J%%j%%J%%%%%%j%%%J%%%%%%%%%%%%%%
$$ 56 56 56 56 56 56 56 56 56 56 56 56 56 56 56 56 55 55 55 55 55 55 55 55 56 56 55 55 55 55 55 55 55 55 55 55 55 55 55 56 56 56 55 55 55 56 56 56 56 56 56 56 55 55 55 55 56 56 56 56 56 56 56 56 56 56 56 56 56 56 56
2065E6%%Jj%%%%%%%%%%%%%%j%J%%%%%%%%%%%%%%%%%%%%%%%%%j%JjJ%%%%%%%%%%jJ%%%%%%%
$$ 56 56 56 57 56 56 56 56 56 56 56 56 56 56 56 56 56 56 56 55 55 56 56 56 56 56 56 56 56 56 56 56 56 56 56 56 56 56 56 56 56 56 56 56 56 56 56 55 55 56 55 56 56 56 56 56 56 56 56 56 56 56 55 56 56 56 56 56 56 56 56
2057E6%%%%%%%%%%%%%j%%%%%%%%%%%%%%%%%%%%%%%%J%%%%%%%%%%%%%%%%%%%%%%j%%%%%%%%
$$ 56 56 56 56 56 56 56 56 56 56 56 56 56 56 55 55 55 55 55 55 55 55 55 55 55 55 55 55 55 55 55 55 55 55 55 55 55 55 55 56 56 56 56 56 56 56 56 56 56 56 56 56 56 56 56 56 56 56 56 56 56 56 55 55 55 55 55 55 55 55 55
2050E5%%%%%%%%%%%%%%%%%%%%J%%%j%%%%%%%%%%%jJ%%%%%%%%%%%%%%%%%%%J%%%%%%%%%%%%
$$ 55 55 55 55 55 55 55 55 55 55 55 55 55 55 55 55 55 55 55 55 55 56 56 56 56 55 55 55 55 55 55 55 55 55 55 55 55 54 55 55 55 55 55 55 55 55 55 55 55 55 55 55 55 55 55 55 55 55 56 56 56 56 56 56 56 56 56 56 56 56 56
2042E6%%%%%%%%%%%j%%%%J%%j%%%%%Jj%%%%%J%%%%%%%%j%%%%J%%%%%%%%%%%%%%%%%%J%%%%
$$ 56 56 56 56 56 56 56 56 56 56 56 56 55 55 55 55 55 56 56 56 55 55 55 55 55 55 56 55 55 55 55 55 55 56 56 56 56 56 56 56 56 56 55 55 55 55 55 56 56 56 56 56 56 56 56 56 56 56 56 56 56 56 56 56 56 56 57 57 57 57 57
2035E7j%%J%%%%%%%%j%%%%%%%%%%%%%j%J%%%%%j%%%%%%J%j%%%%%JjJ%%%%%%%%%%%%%%%%%%
$$ 57 56 56 56 57 57 57 57 57 57 57 57 57 56 56 56 56 56 56 56 56 56 56 56 56 56 56 55 55 56 56 56 56 56 56 55 55 55 55 55 55 55 56 56 55 55 55 55 55 55 56 55 56 56 56 56 56 56 56 56 56 56 56 56 56 56 56 56 56 56 56
2028E6%%%j%%%J%%%%%%%%%%%j%%%%%%%J%%%%%%%%%%%%%%%%%%%%%%%%%%%%%%%%%%%%%%%%%%
$$ 56 56 56 56 55 55 55 55 56 56 56 56 56 56 56 56 56 56 56 56 55 55 55 55 55 55 55 55 56 56 56 56 56 56 56 56 56 56 56 56 56 56 56 56 56 56 56 56 56 56 56 56 56 56 56 56 56 56 56 56 56 56 56 56 56 56 56 56 56 56 56
2020E6%%%%%%%%%%%%%%%%%%%j%%%%%%%%%%%%J%%%%%%%%%%%%%%%J%%%%%%%%%%%%j%%%%%%%%
$$ 56 56 56 56 56 56 56 56 56 56 56 56 56 56 56 56 56 56 56 56 55 55 55 55 55 55 55 55 55 55 55 55 55 56 56 56 56 56 56 56 56 56 56 56 56 56 56 56 56 57 57 57 57 57 57 57 57 57 57 57 57 57 56 56 56 56 56 56 56 56 56
2013E6%%%%j%%%%%%%%%%%%%Jj%%%%Jj%%%%%%%%%%%%%J%%%%Jj%%%%%%%%%%%%%%%%%%%%%%%%
$$ 56 56 56 56 56 55 55 55 55 55 55 55 55 55 55 55 55 55 55 56 55 55 55 55 55 56 55 55 55 55 55 55 55 55 55 55 55 55 55 55 56 56 56 56 56 57 56 56 56 56 56 56 56 56 56 56 56 56 56 56 56 56 56 56 56 56 56 56 56 56 56
2005E6%j%%%%%J%%%%%%%%%%%%%%%j%%%J%%%%%%%%%%J%j%%%%%%%%%%%%%J%%%%%%%%%%%j%%J
$$ 56 56 55 55 55 55 55 55 56 56 56 56 56 56 56 56 56 56 56 56 56 56 56 56 55 55 55 55 56 56 56 56 56 56 56 56 56 56 56 57 57 56 56 56 56 56 56 56 56 56 56 56 56 56 56 57 57 57 57 57 57 57 57 57 57 57 57 56 56 56 57
1998E7%%%j%%%%%%%%Jj%%%%%%%%%%%%%%%%%%%%%%%%%j%%%J%%%%jJjJ%jJ%%%%%%%%%%%%%%%
$$ 57 57 57 57 56 56 56 56 56 56 56 56 56 57 56 56 56 56 56 56 56 56 56 56 56 56 56 56 56 56 56 56 56 56 56 56 56 56 56 56 55 55 55 55 56 56 56 56 56 55 56 55 56 56 55 56 56 56 56 56 56 56 56 56 56 56 56 56 56 56 56
1991E6%J%j%%%%%%%%%%%%%%%%%%%%%%%j%%%%%%%%%%%%jJ%%%%%%%%%%%%%%%%%%%%J%%%%%%%
$$ 56 56 57 57 56 56 56 56 56 56 56 56 56 56 56 56 56 56 56 56 56 56 56 56 56 56 56 56 55 55 55 55 55 55 55 55 55 55 55 55 55 54 55 55 55 55 55 55 55 55 55 55 55 55 55 55 55 55 55 55 55 55 55 56 56 56 56 56 56 56 56
1983E6%%%%%%%%%%%%%%%%%%%%jJ%%%%%%%j%%%Jj%%%%%%%J%%%%%j%%%J%%%%%%%%%%%%%%%Jj
$$ 56 56 56 56 56 56 56 56 56 56 56 56 56 56 56 56 56 56 56 56 56 55 56 56 56 56 56 56 56 56 55 55 55 55 56 55 55 55 55 55 55 55 55 56 56 56 56 56 56 55 55 55 55 56 56 56 56 56 56 56 56 56 56 56 56 56 56 56 56 57 56
1976E6%%%%%%%%%%%%%%%%jJ%%%%%%%%%%%%%%%%%%%%%%%%%%%%%%Jj%%%%%%%%%%%%%%%%%%%%
$$ 56 56 56 56 56 56 56 56 56 56 56 56 56 56 56 56 56 55 56 56 56 56 56 56 56 56 56 56 56 56 56 56 56 56 56 56 56 56 56 56 56 56 56 56 56 56 56 56 56 57 56 56 56 56 56 56 56 56 56 56 56 56 56 56 56 56 56 56 56 56 56
1968E6%%%%J%jJ%jJ%%j%%%%%%%%%%%%%%%%%%%%%%%%%%%%%%%%%%J%%%%%%j%J%%%%%%%%%%%%
$$ 56 56 56 56 56 57 57 56 57 57 56 57 57 57 56 56 56 56 56 56 56 56 56 56 56 56 56 56 56 56 56 56 56 56 56 56 56 56 56 56 56 56 56 56 56 56 56 56 56 57 57 57 57 57 57 57 56 56 57 57 57 57 57 57 57 57 57 57 57 57 57
1961E7j%%%%%%%%J%%%%%j%%%%%%%%%%%%%%%%%%%%%%%%%%%%%J%%%%%%j%%%%%%%%%%%%%J%%j
$$ 57 56 56 56 56 56 56 56 56 56 57 57 57 57 57 57 56 56 56 56 56 56 56 56 56 56 56 56 56 56 56 56 56 56 56 56 56 56 56 56 56 56 56 56 56 56 57 57 57 57 57 57 57 56 56 56 56 56 56 56 56 56 56 56 56 56 56 57 57 57 56
1953E6%%%%%%%%%j%%%%%J%%%%%%%%%%%%%%%%%%%%%%%%%%%%%%%%%%%%%%%%%%%%%%%%%%%%%j
$$ 56 56 56 56 56 56 56 56 56 56 55 55 55 55 55 55 56 56 56 56 56 56 56 56 56 56 56 56 56 56 56 56 56 56 56 56 56 56 56 56 56 56 56 56 56 56 56 56 56 56 56 56 56 56 56 56 56 56 56 56 56 56 56 56 56 56 56 56 56 56 55
1946E5%%J%%%%%j%%%%%%%%%J%%%%%%%%jJ%%%%%%%j%%J%%%%%%%%%%%%j%J%%%%%%%%%%%%%%%
$$ 55 55 55 56 56 56 56 56 56 55 55 55 55 55 55 55 55 55 55 56 56 56 56 56 56 56 56 56 55 56 56 56 56 56 56 56 56 55 55 55 56 56 56 56 56 56 56 56 56 56 56 56 56 55 55 56 56 56 56 56 56 56 56 56 56 56 56 56 56 56 56
1939E6%%%%%%%%%%%%%%%%%%%%%%%%%%%%%%%%%%%%%%%%%%%%%%%%%%%%%%%%%%%%%%%%%%%%%%
$$ 56 56 56 56 56 56 56 56 56 56 56 56 56 56 56 56 56 56 56 56 56 56 56 56 56 56 56 56 56 56 56 56 56 56 56 56 56 56 56 56 56 56 56 56 56 56 56 56 56 56 56 56 56 56 56 56 56 56 56 56 56 56 56 56 56 56 56 56 56 56 56
1931E6%%%%%%%%%%%%%%%%%%%%%J%j%%%%J%%j%%%%%%%%%%%%%%Jj%%%%%%J%%%%%%%%j%%%%%J
$$ 56 56 56 56 56 56 56 56 56 56 56 56 56 56 56 56 56 56 56 56 56 56 57 57 56 56 56 56 56 57 57 57 56 56 56 56 56 56 56 56 56 56 56 56 56 56 56 57 56 56 56 56 56 56 56 57 57 57 57 57 57 57 57 57 56 56 56 56 56 56 57
1924E7j%%%%%%%J%jJ%j%%%%%%%%J%%%%%%%%%%%%%%%%%%j%%%%%%%%J%jJ%%%%%%%%%%%%%%%%
$$ 57 56 56 56 56 56 56 56 56 57 57 56 57 57 56 56 56 56 56 56 56 56 56 57 57 57 57 57 57 57 57 57 57 57 57 57 57 57 57 57 57 57 56 56 56 56 56 56 56 56 56 57 57 56 57 57 57 57 57 57 57 57 57 57 57 57 57 57 57 57 57
1916E7j%%%%%%%%%%%%%%%%%%%%%%%%%%%%J%%j%%%%%%%%%%%%%%%%%%%%%%%%%%%%%J%j%%%%%
$$ 57 56 56 56 56 56 56 56 56 56 56 56 56 56 56 56 56 56 56 56 56 56 56 56 56 56 56 56 56 56 57 57 57 56 56 56 56 56 56 56 56 56 56 56 56 56 56 56 56 56 56 56 56 56 56 56 56 56 56 56 56 56 56 57 57 56 56 56 56 56 56
1909E6%%%%%%%%%%%%%%%%%%%%%%%%%%%%%%%%%%%%%J%j%%%%%J%%%%%j%%%%%%%%%%%%%%%%%%
$$ 56 56 56 56 56 56 56 56 56 56 56 56 56 56 56 56 56 56 56 56 56 56 56 56 56 56 56 56 56 56 56 56 56 56 56 56 56 56 57 57 56 56 56 56 56 56 57 57 57 57 57 57 56 56 56 56 56 56 56 56 56 56 56 56 56 56 56 56 56 56 56
1902E6%%%%%%%%%%%%%J%%%%%%%j%%%%%%%J%%%%%%j%%%%J%%%%%%%%%%%%%%Jj%%%%%%%%%%%J
$$ 56 56 56 56 56 56 56 56 56 56 56 56 56 56 57 57 57 57 57 57 57 57 56 56 56 56 56 56 56 56 57 57 57 57 57 57 57 56 56 56 56 56 57 57 57 57 57 57 57 57 57 57 57 57 57 57 57 58 57 57 57 57 57 57 57 57 57 57 57 57 58
1894E8%%%j%%%%%%%%%%%%%%%%%%%%%%%%%%%%%%%J%%%%%%%%j%%%%%%%%%%%%%%%%%%%%%%%%%
$$ 58 58 58 58 57 57 57 57 57 57 57 57 57 57 57 57 57 57 57 57 57 57 57 57 57 57 57 57 57 57 57 57 57 57 57 57 58 58 58 58 58 58 58 58 58 57 57 57 57 57 57 57 57 57 57 57 57 57 57 57 57 57 57 57 57 57 57 57 57 57 57
1887E7%%%%%%%%%%%%%%%%%%%%%%%%%%%%%%%%%%%%%%%%%%%%%%%%jJ%%%%%%%%%%%%%%%%%%%%
$$ 57 57 57 57 57 57 57 57 57 57 57 57 57 57 57 57 57 57 57 57 57 57 57 57 57 57 57 57 57 57 57 57 57 57 57 57 57 57 57 57 57 57 57 57 57 57 57 57 57 56 57 57 57 57 57 57 57 57 57 57 57 57 57 57 57 57 57 57 57 57 57
1879E7%%%%%%%%%%%%%%%J%%j%%%%%%%%J%j%%%%%%%%%%%%%%%%%%%%%%%%%%%%%%%%%%%%%%%%
$$ 57 57 57 57 57 57 57 57 57 57 57 57 57 57 57 57 58 58 58 57 57 57 57 57 57 57 57 57 58 58 57 57 57 57 57 57 57 57 57 57 57 57 57 57 57 57 57 57 57 57 57 57 57 57 57 57 57 57 57 57 57 57 57 57 57 57 57 57 57 57 57
1872E7%%%%%%%%%%%%%%%%%%%%%%jJ%%%%%%%%%%%%%%%j%%%%%%%%%%%%%%%%%%%%%%%%%%%%%%
$$ 57 57 57 57 57 57 57 57 57 57 57 57 57 57 57 57 57 57 57 57 57 57 57 56 57 57 57 57 57 57 57 57 57 57 57 57 57 57 57 57 56 56 56 56 56 56 56 56 56 56 56 56 56 56 56 56 56 56 56 56 56 56 56 56 56 56 56 56 56 56 56
1864E6%%%J%%%%%J%%j%%%%%%%%%%%%%%%%%%%%J%%%%%%j%%%%%%%%%%%%%%%%%%%%%%%%%%J%%
$$ 56 56 56 56 57 57 57 57 57 57 58 58 58 57 57 57 57 57 57 57 57 57 57 57 57 57 57 57 57 57 57 57 57 57 58 58 58 58 58 58 58 57 57 57 57 57 57 57 57 57 57 57 57 57 57 57 57 57 57 57 57 57 57 57 57 57 57 57 58 58 58
1857E8%%%jJ%jJ%%%%%%%%%%%%jJ%%%%%%%%%%%%%%%%%%%%%%%%%j%%%J%%%%%%%j%%Jj%%%%%%
$$ 58 58 58 58 57 58 58 57 58 58 58 58 58 58 58 58 58 58 58 58 58 57 58 58 58 58 58 58 58 58 58 58 58 58 58 58 58 58 58 58 58 58 58 58 58 58 58 58 57 57 57 57 58 58 58 58 58 58 58 58 57 57 57 58 57 57 57 57 57 57 57
1850E7%%%%%%%%%%%%%%%%%%%%%%%%%%%%%%%%%%%%%%%%%%%%%%%%%j%%%J%%%j%%%JjJ%%%%%%
$$ 57 57 57 57 57 57 57 57 57 57 57 57 57 57 57 57 57 57 57 57 57 57 57 57 57 57 57 57 57 57 57 57 57 57 57 57 57 57 57 57 57 57 57 57 57 57 57 57 57 57 56 56 56 56 57 57 57 57 56 56 56 56 57 56 57 57 57 57 57 57 57
1842E7%%J%%%j%%%%%%%%%%%j%%J%%%%%%%%%%%J%j%%%%%%%%jJ%%%%%%%%%%%%%%%%%%J%%%j%
$$ 57 57 57 58 58 58 58 57 57 57 57 57 57 57 57 57 57 57 57 56 56 56 57 57 57 57 57 57 57 57 57 57 57 57 58 58 57 57 57 57 57 57 57 57 57 56 57 57 57 57 57 57 57 57 57 57 57 57 57 57 57 57 57 57 57 58 58 58 58 57 57
1835E7%%%%%%%J%%%j%%%%%%%%%%%%%%%%J%%jJ%%%%j%%%%%J%%%%%%j%%%%%%%%%J%%j%%%%%J
$$ 57 57 57 57 57 57 57 57 58 58 58 58 57 57 57 57 57 57 57 57 57 57 57 57 57 57 57 57 57 58 58 58 57 58 58 58 58 58 57 57 57 57 57 57 58 58 58 58 58 58 58 57 57 57 57 57 57 57 57 57 57 58 58 58 57 57 57 57 57 57 58
1827E8%%%%%%%%%%%%%%%%%j%%%%%%%%%%%%%%%%%%%%%%%%%%%J%%%%%%j%%%%%J%%%jJ%%%%%%
$$ 58 58 58 58 58 58 58 58 58 58 58 58 58 58 58 58 58 58 57 57 57 57 57 57 57 57 57 57 57 57 57 57 57 57 57 57 57 57 57 57 57 57 57 57 57 57 58 58 58 58 58 58 58 57 57 57 57 57 57 58 58 58 58 57 58 58 58 58 58 58 58
1820E8j%%%%%%%%%%%%%%%%%%%%%%%%%%%%%%%%%%Jj%%%%%%%%J%%j%%%%%%%%J%%%%%%%%%%j%
$$ 58 57 57 57 57 57 57 57 57 57 57 57 57 57 57 57 57 57 57 57 57 57 57 57 57 57 57 57 57 57 57 57 57 57 57 57 58 57 57 57 57 57 57 57 57 57 58 58 58 57 57 57 57 57 57 57 57 57 58 58 58 58 58 58 58 58 58 58 58 57 57
1813E7J%%%%%%j%%%%%%%%%%jJ%%%%%%%%%%%%%%%%%%%%%%%%%%%%%%%%%%%%%%%%%%%%%%J%j%
$$ 57 58 58 58 58 58 58 58 57 57 57 57 57 57 57 57 57 57 57 56 57 57 57 57 57 57 57 57 57 57 57 57 57 57 57 57 57 57 57 57 57 57 57 57 57 57 57 57 57 57 57 57 57 57 57 57 57 57 57 57 57 57 57 57 57 57 57 58 58 57 57
1805E7%%%%%%%%%%%%%%%%%%%%%%%%%%%%%%%%%%%%%%%%%%%%%%%%%%%%J%%%%j%J%%%%%%%%%%
$$ 57 57 57 57 57 57 57 57 57 57 57 57 57 57 57 57 57 57 57 57 57 57 57 57 57 57 57 57 57 57 57 57 57 57 57 57 57 57 57 57 57 57 57 57 57 57 57 57 57 57 57 57 57 58 58 58 58 58 57 57 58 58 58 58 58 58 58 58 58 58 58
1798E8%%%%%%jJ%%%%%%%Jj%%%%%%j%%%%J%%%%%%%%%%%%%%%%%%%%%J%%%%%%j%%%%%%%%%%%%
$$ 58 58 58 58 58 58 58 57 58 58 58 58 58 58 58 58 59 58 58 58 58 58 58 58 57 57 57 57 57 58 58 58 58 58 58 58 58 58 58 58 58 58 58 58 58 58 58 58 58 58 58 59 59 59 59 59 59 59 58 58 58 58 58 58 58 58 58 58 58 58 58
1790E8%%%%%%%%j%J%%%%%%%%%%%jJ%%%J%%%jJ%%%%%%%%%j%%%%%%%%%%%%%%%%%%J%%%%%%%%
$$ 58 58 58 58 58 58 58 58 58 57 57 58 58 58 58 58 58 58 58 58 58 58 58 57 58 58 58 58 59 59 59 59 58 59 59 59 59 59 59 59 59 59 59 58 58 58 58 58 58 58 58 58 58 58 58 58 58 58 58 58 58 58 59 59 59 59 59 59 59 59 59
1783E9%%%jJ%%%%%%%%j%%%%%J%%%%%%%%%%j%%%%%%%J%%%%%%%%%j%%%%J%%j%%%%%%%%%%%%%
$$ 59 59 59 59 58 59 59 59 59 59 59 59 59 59 58 58 58 58 58 58 59 59 59 59 59 59 59 59 59 59 59 58 58 58 58 58 58 58 58 59 59 59 59 59 59 59 59 59 59 58 58 58 58 58 59 59 59 58 58 58 58 58 58 58 58 58 58 58 58 58 58
1775E8J%j%%%%%%%%%%%%%%%%%%%%%%J%j%%J%%%%%%jJ%%%%j%%%%%%%%%%%%%%%%j%J%%%%%%%
$$ 58 59 59 58 58 58 58 58 58 58 58 58 58 58 58 58 58 58 58 58 58 58 58 58 58 58 59 59 58 58 58 59 59 59 59 59 59 59 58 59 59 59 59 59 58 58 58 58 58 58 58 58 58 58 58 58 58 58 58 58 58 57 57 58 58 58 58 58 58 58 58
1768E8%%%%%%%%%%%%%%%%%%%%%J%%%%%%%j%%%%%%%J%%%%%%%%%%%%%%%%%%%j%%%%%%%%%%%%
$$ 58 58 58 58 58 58 58 58 58 58 58 58 58 58 58 58 58 58 58 58 58 58 59 59 59 59 59 59 59 59 58 58 58 58 58 58 58 58 59 59 59 59 59 59 59 59 59 59 59 59 59 59 59 59 59 59 59 59 58 58 58 58 58 58 58 58 58 58 58 58 58
1761E8%%%%%%J%%%j%J%%j%%%%%%%%%%%%%J%%%%%%%%%%%%J%%%%%%%%%%%%%%%%%%%%%%j%%%%
$$ 58 58 58 58 58 58 58 59 59 59 59 58 58 59 59 59 58 58 58 58 58 58 58 58 58 58 58 58 58 58 59 59 59 59 59 59 59 59 59 59 59 59 59 60 60 60 60 60 60 60 60 60 60 60 60 60 60 60 60 60 60 60 60 60 60 60 59 59 59 59 59
1753E9%%%%%%%%j%%%%%%%%J%%%%%%%%j%%%%%J%%%%%%%%%%%%J%%%%%%%%%%%%%%%%%j%%%%%%
$$ 59 59 59 59 59 59 59 59 59 58 58 58 58 58 58 58 58 58 59 59 59 59 59 59 59 59 59 58 58 58 58 58 58 59 59 59 59 59 59 59 59 59 59 59 59 59 60 60 60 60 60 60 60 60 60 60 60 60 60 60 60 60 60 60 59 59 59 59 59 59 59
1746E9%%%%%%%%%%%%%%j%%%%%%%%%%%%J%%%%%%%%%%%%%%j%%J%%%%%%%%%%%%%%%%%%%%%%%j
$$ 59 59 59 59 59 59 59 59 59 59 59 59 59 59 59 58 58 58 58 58 58 58 58 58 58 58 58 58 59 59 59 59 59 59 59 59 59 59 59 59 59 59 59 58 58 58 59 59 59 59 59 59 59 59 59 59 59 59 59 59 59 59 59 59 59 59 59 59 59 59 58
1738E8%%%%J%%%j%%%%%%%J%%%j%%%%%J%%%%%%%%j%%%%%%%%%%%J%%%%%%%%%%%jJ%%%%%%jJ%
$$ 58 58 58 58 58 59 59 59 59 58 58 58 58 58 58 58 58 59 59 59 59 58 58 58 58 58 58 59 59 59 59 59 59 59 59 59 58 58 58 58 58 58 58 58 58 58 58 58 59 59 59 59 59 59 59 59 59 59 59 59 58 59 59 59 59 59 59 59 58 59 59
1731E9%%%%%%%%%J%jJ%j%%%%%%%%%%%%%%%%%%%%%%%%%%%%%jJ%%%%%%%%%%%%%%%%%J%j%%%%
$$ 59 59 59 59 59 59 59 59 59 59 60 60 59 60 60 59 59 59 59 59 59 59 59 59 59 59 59 59 59 59 59 59 59 59 59 59 59 59 59 59 59 59 59 59 59 58 59 59 59 59 59 59 59 59 59 59 59 59 59 59 59 59 59 59 60 60 59 59 59 59 59
1724E9%%%%J%%%%%%%%%%%J%%j%%%%%%%%%%%%j%%%%%%%%%%%%%%%%J%%%%%%j%%%%%%%J%%%%j
$$ 59 59 59 59 59 60 60 60 60 60 60 60 60 60 60 60 60 61 61 61 60 60 60 60 60 60 60 60 60 60 60 60 60 59 59 59 59 59 59 59 59 59 59 59 59 59 59 59 59 59 60 60 60 60 60 60 60 59 59 59 59 59 59 59 59 60 60 60 60 60 59
1716E9%%%%%%%%%%J%%%%j%%J%%%%j%%%%%%%%%%%%%%%J%%%%%%%%J%%%J%%%%j%%%%j%%%j%%%
$$ 59 59 59 59 59 59 59 59 59 59 59 60 60 60 60 60 59 59 59 60 60 60 60 60 59 59 59 59 59 59 59 59 59 59 59 59 59 59 59 59 60 60 60 60 60 60 60 60 60 61 61 61 61 62 62 62 62 62 61 61 61 61 61 60 60 60 60 59 59 59 59
1709E9%%%%%%%%%Jj%J%%%%%%%%%%jJ%j%%%%%%%%%%%%%%%%J%%%%%%j%%%%%%%%%%%%%Jj%%%%
$$ 59 59 59 59 59 59 59 59 59 59 60 59 59 60 60 60 60 60 60 60 60 60 60 60 59 60 60 59 59 59 59 59 59 59 59 59 59 59 59 59 59 59 59 59 60 60 60 60 60 60 60 59 59 59 59 59 59 59 59 59 59 59 59 59 59 60 59 59 59 59 59
1701E9jJ%%%%%Jj%%J%%%%%%%%%%%%%%%%%%%%%%%%jJ%jJ%%%%%%%%%%%%%%J%%%%%J%%%%%%%%
$$ 59 58 59 59 59 59 59 59 60 59 59 59 60 60 60 60 60 60 60 60 60 60 60 60 60 60 60 60 60 60 60 60 60 60 60 60 60 59 60 60 59 60 60 60 60 60 60 60 60 60 60 60 60 60 60 60 61 61 61 61 61 61 62 62 62 62 62 62 62 62 62
1694F2%j%%%%j%%%%%%%J%%%%%%%%%%%%%j%%%%%%%J%%%jJ%%%%jJ%%%%%%J%%%%J%%%J%j%%%%
$$ 62 62 61 61 61 61 61 60 60 60 60 60 60 60 60 61 61 61 61 61 61 61 61 61 61 61 61 61 61 60 60 60 60 60 60 60 60 61 61 61 61 60 61 61 61 61 61 60 61 61 61 61 61 61 61 62 62 62 62 62 63 63 63 63 64 64 63 63 63 63 63
1686F3%%%j%%%%%%%%%j%%%%j%%%%%%%%%%%%%%%%%%%%%%%%%%%%%%J%%%%%%%%%%%%%J%%%%%J
$$ 63 63 63 63 62 62 62 62 62 62 62 62 62 62 61 61 61 61 61 60 60 60 60 60 60 60 60 60 60 60 60 60 60 60 60 60 60 60 60 60 60 60 60 60 60 60 60 60 60 60 61 61 61 61 61 61 61 61 61 61 61 61 61 61 62 62 62 62 62 62 63
1679F3%%%j%%%%%%j%%%j%%%j%J%%%%%%%%%%%%%%%%%%%%%%%%%%%%%%%%%%%%%%%%J%%%%%%%j
$$ 63 63 63 63 62 62 62 62 62 62 62 61 61 61 61 60 60 60 60 59 59 60 60 60 60 60 60 60 60 60 60 60 60 60 60 60 60 60 60 60 60 60 60 60 60 60 60 60 60 60 60 60 60 60 60 60 60 60 60 60 60 60 61 61 61 61 61 61 61 61 60
1672F0%%%%%%%%%%%%%%%%%%%%%%%%%%%%%%%%%%%%%%J%j%%%%%%%%%%%%%%%J%%%%%%%%%%%%%
$$ 60 60 60 60 60 60 60 60 60 60 60 60 60 60 60 60 60 60 60 60 60 60 60 60 60 60 60 60 60 60 60 60 60 60 60 60 60 60 60 61 61 60 60 60 60 60 60 60 60 60 60 60 60 60 60 60 60 61 61 61 61 61 61 61 61 61 61 61 61 61 61
1664F1%%%%%%%%Jj%%%%%%%%j%%%%%J%%%%%%%%%%%%%%%%%%%%%J%%%%%%%%%%%%%Jj%%%%%%%%
$$ 61 61 61 61 61 61 61 61 61 62 61 61 61 61 61 61 61 61 61 60 60 60 60 60 60 61 61 61 61 61 61 61 61 61 61 61 61 61 61 61 61 61 61 61 61 61 61 62 62 62 62 62 62 62 62 62 62 62 62 62 62 63 62 62 62 62 62 62 62 62 62
1657F2%%%%%%%%%%%%%%%%j%%%%%%%%%%%%%J%j%%%%%%%%%%%%%%%%%%j%J%%%%%Jj%%%%%%%%%
$$ 62 62 62 62 62 62 62 62 62 62 62 62 62 62 62 62 62 61 61 61 61 61 61 61 61 61 61 61 61 61 61 62 62 61 61 61 61 61 61 61 61 61 61 61 61 61 61 61 61 61 61 61 60 60 61 61 61 61 61 61 62 61 61 61 61 61 61 61 61 61 61
1649F1%%%%%%%%jJ%%j%J%%%%%%%%%J%%%%%%%%%J%J%%J%%%%%%%%%%j%%j%%j%%%j%%%%%%%%%
$$ 61 61 61 61 61 61 61 61 61 60 61 61 61 60 60 61 61 61 61 61 61 61 61 61 61 62 62 62 62 62 62 62 62 62 62 63 63 64 64 64 65 65 65 65 65 65 65 65 65 65 65 64 64 64 63 63 63 62 62 62 62 61 61 61 61 61 61 61 61 61 61
1642F1%%%%%%j%%%%J%%%%J%%%%%%J%%%%J%%%%%%%%%j%%%j%%%%%%%%%%%%%j%%%%%%%J%%%%%
$$ 61 61 61 61 61 61 61 60 60 60 60 60 61 61 61 61 61 62 62 62 62 62 62 62 63 63 63 63 63 64 64 64 64 64 64 64 64 64 64 63 63 63 63 62 62 62 62 62 62 62 62 62 62 62 62 62 62 61 61 61 61 61 61 61 61 62 62 62 62 62 62
1634F2%%%%%%%%J%%%%J%%%%%%%%%%%%%%%%%%J%%%%%%j%%%j%%j%%%Jj%%%J%%j%%%%%%%%J%%
$$ 62 62 62 62 62 62 62 62 62 63 63 63 63 63 64 64 64 64 64 64 64 64 64 64 64 64 64 64 64 64 64 64 64 65 65 65 65 65 65 65 64 64 64 64 63 63 63 62 62 62 62 63 62 62 62 62 63 63 63 62 62 62 62 62 62 62 62 62 63 63 63
1627F3%%%j%%%%J%%%%%%J%%%%j%%%%%%%%%%%%%%%%%%%%%%%%j%%%%%%%%%%%%%%%%%%%%%%%%
$$ 63 63 63 63 62 62 62 62 62 63 63 63 63 63 63 63 64 64 64 64 64 63 63 63 63 63 63 63 63 63 63 63 63 63 63 63 63 63 63 63 63 63 63 63 63 63 62 62 62 62 62 62 62 62 62 62 62 62 62 62 62 62 62 62 62 62 62 62 62 62 62
1620F2%%%%%%%%%%%%%%%%%%%%%%%%%%%%%%%%%%%%%%%%%%J%%%%%j%%%%%%%%%%%%%%%%%%%%%
$$ 62 62 62 62 62 62 62 62 62 62 62 62 62 62 62 62 62 62 62 62 62 62 62 62 62 62 62 62 62 62 62 62 62 62 62 62 62 62 62 62 62 62 62 63 63 63 63 63 63 62 62 62 62 62 62 62 62 62 62 62 62 62 62 62 62 62 62 62 62 62 62
1612F2%%%%%%%%%%%%%%%%%%%%J%%j%J%%%j%%%%%%%%%J%%%%%%%%%%%%%%%%%%%%%%j%%%%%%%
$$ 62 62 62 62 62 62 62 62 62 62 62 62 62 62 62 62 62 62 62 62 62 63 63 63 62 62 63 63 63 63 62 62 62 62 62 62 62 62 62 62 63 63 63 63 63 63 63 63 63 63 63 63 63 63 63 63 63 63 63 63 63 63 63 62 62 62 62 62 62 62 62
1605F2%%J%%%%j%%%%J%%%%%%%%%%%%%%%%%%%%%j%J%%%%%%%%%%%%%%%%%%%%%%%%%%%%%%j%J
$$ 62 62 62 63 63 63 63 63 62 62 62 62 62 63 63 63 63 63 63 63 63 63 63 63 63 63 63 63 63 63 63 63 63 63 63 62 62 63 63 63 63 63 63 63 63 63 63 63 63 63 63 63 63 63 63 63 63 63 63 63 63 63 63 63 63 63 63 63 62 62 63
1597F3%%%j%%%%%%%%%%%J%%%%%%%%%%%%%J%%%%%J%%J%%j%%%%%%%j%%%%%%%%j%%%%%%J%jJ%
$$ 63 63 63 63 62 62 62 62 62 62 62 62 62 62 62 62 63 63 63 63 63 63 63 63 63 63 63 63 63 63 64 64 64 64 64 64 65 65 65 66 66 66 65 65 65 65 65 65 65 65 64 64 64 64 64 64 64 64 64 63 63 63 63 63 63 63 64 64 63 64 64
1590F4%%%%%%%%%%%%%%%%%%%%J%%%%%%%JJ%J%%%j%%%%%%%%J%%J%%%j%%j%j%j%%%%%%%%Jj%
$$ 64 64 64 64 64 64 64 64 64 64 64 64 64 64 64 64 64 64 64 64 64 65 65 65 65 65 65 65 65 66 67 67 68 68 68 68 67 67 67 67 67 67 67 67 67 68 68 68 69 69 69 69 68 68 68 67 67 66 66 65 65 65 65 65 65 65 65 65 66 65 65
1583F5%%%%%%JjJ%%%%%j%%%%%%%%%%%%J%%%%%%%%%%%%%%%J%%j%%%%%%%%%j%%%%j%%%%%%%%
$$ 65 65 65 65 65 65 65 66 65 66 66 66 66 66 66 65 65 65 65 65 65 65 65 65 65 65 65 65 66 66 66 66 66 66 66 66 66 66 66 66 66 66 66 66 67 67 67 66 66 66 66 66 66 66 66 66 66 65 65 65 65 65 64 64 64 64 64 64 64 64 64
1575F4%%%%%%%%%%%%%%%%%%%%%%%%%%%%%%%%%j%%%J%%%%j%%%J%%%%%%%%j%%%%J%%%%j%%J%
$$ 64 64 64 64 64 64 64 64 64 64 64 64 64 64 64 64 64 64 64 64 64 64 64 64 64 64 64 64 64 64 64 64 64 64 63 63 63 63 64 64 64 64 64 63 63 63 63 64 64 64 64 64 64 64 64 64 63 63 63 63 63 64 64 64 64 64 63 63 63 64 64
1568F4%%%%%%j%%J%%%%%%Jj%%%jJ%%j%Jj%J%%%jJ%%%%%%%%%%%%%%%%%%%%%%%%%%%%%%%%%%
$$ 64 64 64 64 64 64 64 63 63 63 64 64 64 64 64 64 64 65 64 64 64 64 63 64 64 64 63 63 64 63 63 64 64 64 64 63 64 64 64 64 64 64 64 64 64 64 64 64 64 64 64 64 64 64 64 64 64 64 64 64 64 64 64 64 64 64 64 64 64 64 64
1560F4%%%%%%%%%%%%%%%%jJ%%%%%%%%%%%%%%%%%%%%%%%%%J%%%%j%J%%j%%%%%%%%%%%%%%%%
$$ 64 64 64 64 64 64 64 64 64 64 64 64 64 64 64 64 64 63 64 64 64 64 64 64 64 64 64 64 64 64 64 64 64 64 64 64 64 64 64 64 64 64 64 64 65 65 65 65 65 64 64 65 65 65 64 64 64 64 64 64 64 64 64 64 64 64 64 64 64 64 64
1553F4%%%%%%%%%%%%%%%%%%%%%%%%%%J%%%%%j%J%%j%%%%%%%%%%%%%J%%%jJ%%%%%%%%%%%%%
$$ 64 64 64 64 64 64 64 64 64 64 64 64 64 64 64 64 64 64 64 64 64 64 64 64 64 64 64 65 65 65 65 65 65 64 64 65 65 65 64 64 64 64 64 64 64 64 64 64 64 64 64 64 65 65 65 65 64 65 65 65 65 65 65 65 65 65 65 65 65 65 65
1545F5%%%%%%%%%%%%%%%%J%jJ%%%j%%%%J%%j%%%%%%%%%%%%%%%%%%%%%%%%%%%%%%%%%%%j%%
$$ 65 65 65 65 65 65 65 65 65 65 65 65 65 65 65 65 65 66 66 65 66 66 66 66 65 65 65 65 65 66 66 66 65 65 65 65 65 65 65 65 65 65 65 65 65 65 65 65 65 65 65 65 65 65 65 65 65 65 65 65 65 65 65 65 65 65 65 65 64 64 64
1538F4%%Jj%%%%%%%%%%J%%%%%%j%%%%%J%%%%%j%J%%%%%%%j%%%%%%%%%%%%J%%%%%%%%%%%%%
$$ 64 64 64 65 64 64 64 64 64 64 64 64 64 64 64 65 65 65 65 65 65 65 64 64 64 64 64 64 65 65 65 65 65 65 64 64 65 65 65 65 65 65 65 65 64 64 64 64 64 64 64 64 64 64 64 64 64 65 65 65 65 65 65 65 65 65 65 65 65 65 65
1531F5%%%%%%j%J%%%%%%%%%%%%%%%%%%%%%%%%%jJ%%%%%%%%%j%%%%%%%J%%%%%%%%%%%%%%%%
$$ 65 65 65 65 65 65 65 64 64 65 65 65 65 65 65 65 65 65 65 65 65 65 65 65 65 65 65 65 65 65 65 65 65 65 65 64 65 65 65 65 65 65 65 65 65 65 64 64 64 64 64 64 64 64 65 65 65 65 65 65 65 65 65 65 65 65 65 65 65 65 65
1523F5%J%%%%%%%%j%%%%%%%%%J%%%%%%j%%%%%%%%%%%%%%J%%%%%jJ%%%%%%%%%%%%%%j%J%%%
$$ 65 65 66 66 66 66 66 66 66 66 66 65 65 65 65 65 65 65 65 65 65 66 66 66 66 66 66 66 65 65 65 65 65 65 65 65 65 65 65 65 65 65 65 66 66 66 66 66 66 65 66 66 66 66 66 66 66 66 66 66 66 66 66 66 66 65 65 66 66 66 66
1516F6%%%%%%%%%J%%%%J%J%%J%%%jj%j%%%%%%j%%%%%%%%%%%%%%%%%%%%%%%%%%%%%%%%%%Jj
$$ 66 66 66 66 66 66 66 66 66 66 67 67 67 67 67 68 68 69 69 69 70 70 70 70 69 68 68 67 67 67 67 67 67 67 66 66 66 66 66 66 66 66 66 66 66 66 66 66 66 66 66 66 66 66 66 66 66 66 66 66 66 66 66 66 66 66 66 66 66 67 66
1508F6Jj%%%%%%%%%%%%%%%%%%%%%%%%%%jJ%%%%%%%jJ%%%%%%%%%%J%%%%%%%%%J%%j%Jj%%%%
$$ 66 67 66 66 66 66 66 66 66 66 66 66 66 66 66 66 66 66 66 66 66 66 66 66 66 66 66 66 66 65 66 66 66 66 66 66 66 66 65 66 66 66 66 66 66 66 66 66 66 66 67 67 67 67 67 67 67 67 67 67 68 68 68 67 67 68 67 67 67 67 67
1501F7%%%%%%%%%%%%%%%%%j%%%%%%%%%%%%%%%%%%%j%%Jj%%%%%J%%%%%%%%%%%%%%%%%%j%%J
$$ 67 67 67 67 67 67 67 67 67 67 67 67 67 67 67 67 67 67 66 66 66 66 66 66 66 66 66 66 66 66 66 66 66 66 66 66 66 66 65 65 65 66 65 65 65 65 65 65 66 66 66 66 66 66 66 66 66 66 66 66 66 66 66 66 66 66 66 65 65 65 66
1494F6%%%%%%%%%%%%%%%%%%Jj%%%%%%%%%%%%j%%%%%%%%%%%%J%%%%%%%%j%%%%%J%%%%%%%%%
$$ 66 66 66 66 66 66 66 66 66 66 66 66 66 66 66 66 66 66 66 67 66 66 66 66 66 66 66 66 66 66 66 66 66 65 65 65 65 65 65 65 65 65 65 65 65 65 66 66 66 66 66 66 66 66 66 65 65 65 65 65 65 66 66 66 66 66 66 66 66 66 66
1486F6%%%%%%%%%%%%J%%%%%%%j%%%%%Jj%%%%%%%%%%%j%%%J%%%%%%j%J%%%%%%%%%%%%%%%%%
$$ 66 66 66 66 66 66 66 66 66 66 66 66 66 67 67 67 67 67 67 67 67 66 66 66 66 66 66 67 66 66 66 66 66 66 66 66 66 66 66 66 65 65 65 65 66 66 66 66 66 66 66 65 65 66 66 66 66 66 66 66 66 66 66 66 66 66 66 66 66 66 66
1479F6%%%%%J%%%j%%%J%%%%%%%%j%%%%%%%%%%%%%%%%%%%%%%%%%%%%%%%%J%%%%%%%J%%j%%%
$$ 66 66 66 66 66 66 67 67 67 67 66 66 66 66 67 67 67 67 67 67 67 67 67 66 66 66 66 66 66 66 66 66 66 66 66 66 66 66 66 66 66 66 66 66 66 66 66 66 66 66 66 66 66 66 66 66 67 67 67 67 67 67 67 67 68 68 68 67 67 67 67
1471F7%%%%%%%%%%%j%%%%%%%j%%%%%%%%%%%%J%%%%%%%%J%%%%j%%%J%%J%J%%%%%%j%%%%%%j
$$ 67 67 67 67 67 67 67 67 67 67 67 67 66 66 66 66 66 66 66 66 65 65 65 65 65 65 65 65 65 65 65 65 65 66 66 66 66 66 66 66 66 66 67 67 67 67 67 66 66 66 66 67 67 67 68 68 69 69 69 69 69 69 69 68 68 68 68 68 68 68 67
1464F7%%%%%j%%%%%j%%J%%%%%%%%%%%%%%%%%%J%%%%%%%%%%%%%Jj%%%%%%J%%%j%%%Jj%%%%%
$$ 67 67 67 67 67 67 66 66 66 66 66 66 65 65 65 66 66 66 66 66 66 66 66 66 66 66 66 66 66 66 66 66 66 66 67 67 67 67 67 67 67 67 67 67 67 67 67 67 68 67 67 67 67 67 67 67 68 68 68 68 67 67 67 67 68 67 67 67 67 67 67
1456F7%%%j%%%%%J%j%%%%%%%%%%%%%%%%%%%%J%%%%J%%%%J%%%%%%%%%j%J%%%J%J%J%J%%jjk
$$ 67 67 67 67 66 66 66 66 66 66 67 67 66 66 66 66 66 66 66 66 66 66 66 66 66 66 66 66 66 66 66 66 66 67 67 67 67 67 68 68 68 68 68 69 69 69 69 69 69 69 69 69 69 68 68 69 69 69 69 70 70 71 71 72 72 73 73 73 72 71 69
1449F9j%j%%%j%%%%%%%%%J%%%%%%%%%%%%%%%%%%%%J%%j%%%%%%%%%%%%j%%%%%%%%J%%%%%%%
$$ 69 68 68 67 67 67 67 66 66 66 66 66 66 66 66 66 66 67 67 67 67 67 67 67 67 67 67 67 67 67 67 67 67 67 67 67 67 67 68 68 68 67 67 67 67 67 67 67 67 67 67 67 67 67 66 66 66 66 66 66 66 66 66 67 67 67 67 67 67 67 67
1442F7%%%J%%%%%%%%%%j%J%%%%%%%%%%%%j%%%%%%%%j%%%%%J%%%j%Jj%J%%%%%%%%%J%%%%%%
$$ 67 67 67 67 68 68 68 68 68 68 68 68 68 68 68 67 67 68 68 68 68 68 68 68 68 68 68 68 68 68 67 67 67 67 67 67 67 67 67 66 66 66 66 66 66 67 67 67 67 66 66 67 66 66 67 67 67 67 67 67 67 67 67 67 68 68 68 68 68 68 68
1434F8%%%%%%%%%%%%j%%%j%J%%j%%J%%%%%%J%j%%%%%%%%J%%J%JJJJKLKMNPQRRRJ0PNJnrj2
$$ 68 68 68 68 68 68 68 68 68 68 68 68 68 67 67 67 67 66 66 67 67 67 66 66 66 67 67 67 67 67 67 67 68 68 67 67 67 67 67 67 67 67 67 68 68 68 69 69 70 71 72 73 75 78 80 84 89 96 104 113 122 131 141 148 153 154 149 140 128
1427A28j2j1qpnmlkjk%jj%j%j%j%%%j%%%%%%%%%%j%%%%%%%%%%%%%J%%%%%%%J%%%%%%%%%%%
$$ 128 116 105 97 90 85 81 78 76 75 73 73 72 71 71 70 70 69 69 68 68 68 68 67 67 67 67 67 67 67 67 67 67 67 66 66 66 66 66 66 66 66 66 66 66 66 66 66 67 67 67 67 67 67 67 67 68 68 68 68 68 68 68 68 68 68 68 68
1420F8%%%%%%j%%%%%%%j%%J%j%%%%%%%%%Jj%%J%%%%%%%%%%J%%%J%%%%%%%%%j%%%%%%%%%j%
$$ 68 68 68 68 68 68 68 67 67 67 67 67 67 67 67 66 66 66 67 67 66 66 66 66 66 66 66 66 66 66 67 66 66 66 67 67 67 67 67 67 67 67 67 67 67 68 68 68 68 69 69 69 69 69 69 69 69 69 69 68 68 68 68 68 68 68 68 68 68 67 67
1413F7%%%%j%%%%j%%%%%j%%%%%%%%J%%J%%%%%%%%J%%%%%%%%%%%%%%%%%%%%j%%%%%j%j%j%%
$$ 67 67 67 67 67 66 66 66 66 66 65 65 65 65 65 65 64 64 64 64 64 64 64 64 64 65 65 65 66 66 66 66 66 66 66 66 66 67 67 67 67 67 67 67 67 67 67 67 67 67 67 67 67 67 67 67 67 67 66 66 66 66 66 66 65 65 64 64 63 63 63
1405F3%%%%%%%%%%%J%J%J%%J%%J%J%%%J%%%%%%%%j%%%%j%%%%%%%%J%%%%%j%j%%%J%%%%J%%
$$ 63 63 63 63 63 63 63 63 63 63 63 63 64 64 65 65 66 66 66 67 67 67 68 68 69 69 69 69 70 70 70 70 70 70 70 70 70 69 69 69 69 69 68 68 68 68 68 68 68 68 68 69 69 69 69 69 69 68 68 67 67 67 67 68 68 68 68 68 69 69 69
1398F9%%J%%%Jj%%%%%%%%%%%%%%%%j%%j%%%%%%%%%j%J%%%%%%%%%%%%%%%j%%%%%%%%%j%%%%
$$ 69 69 69 70 70 70 70 71 70 70 70 70 70 70 70 70 70 70 70 70 70 70 70 70 70 69 69 69 68 68 68 68 68 68 68 68 68 68 67 67 68 68 68 68 68 68 68 68 68 68 68 68 68 68 68 68 67 67 67 67 67 67 67 67 67 67 66 66 66 66 66
1390F6%%j%%%%j%%%j%%%%%%j%%J%%%%%%%%J%%J%%%%%%%%J%%%%%J%%%%%j%%j%%%j%%%%%%%j
$$ 66 66 66 65 65 65 65 65 64 64 64 64 63 63 63 63 63 63 63 62 62 62 63 63 63 63 63 63 63 63 63 64 64 64 65 65 65 65 65 65 65 65 65 66 66 66 66 66 66 67 67 67 67 67 67 66 66 66 65 65 65 65 64 64 64 64 64 64 64 64 63
1383F3%J%%%%%%J%%%%%%J%%%%%%%%%J%%j%J%%%%%%%%%j%%%%%%j%%%%%%%%%%%%%%%%%J%%%%
$$ 63 63 64 64 64 64 64 64 64 65 65 65 65 65 65 65 66 66 66 66 66 66 66 66 66 66 67 67 67 66 66 67 67 67 67 67 67 67 67 67 67 66 66 66 66 66 66 66 65 65 65 65 65 65 65 65 65 65 65 65 65 65 65 65 65 65 66 66 66 66 66
1375F6J%%%%%%%J%%%%%%%%%%%%%%%%%%%j%%j%%%%%%%%%%%%j%%%%%%j%J%%%%%%%J%%j%%%J%
$$ 66 67 67 67 67 67 67 67 67 68 68 68 68 68 68 68 68 68 68 68 68 68 68 68 68 68 68 68 68 67 67 67 66 66 66 66 66 66 66 66 66 66 66 66 66 65 65 65 65 65 65 65 64 64 65 65 65 65 65 65 65 65 66 66 66 65 65 65 65 66 66
1368F6%%J%%%%%%J%%%%j%%J%%%%%%%%j%%j%%%%j%%j%%%%%J%%%%j%%%%J%J%%%J%%%%%%%%%J
$$ 66 66 66 67 67 67 67 67 67 67 68 68 68 68 68 67 67 67 68 68 68 68 68 68 68 68 68 67 67 67 66 66 66 66 66 65 65 65 64 64 64 64 64 64 65 65 65 65 65 64 64 64 64 64 65 65 66 66 66 66 67 67 67 67 67 67 67 67 67 67 68
1361F8%j%%%%%%%%%%j%%%j%%%%%%j%%%%%%j%%%%%%%J%%%%%%%J%J%%%%%%%%%Jj%%%%%%%%%%
$$ 68 68 67 67 67 67 67 67 67 67 67 67 67 66 66 66 66 65 65 65 65 65 65 65 64 64 64 64 64 64 64 63 63 63 63 63 63 63 63 64 64 64 64 64 64 64 64 65 65 66 66 66 66 66 66 66 66 66 66 67 66 66 66 66 66 66 66 66 66 66 66
1353F6%j%%%%%j%%%%%%%%j%J%%%j%%%%%%%%J%%%%%%%%J%%%%%J%%%%%jJ%j%%%%%%%%j%%%%%
$$ 66 66 65 65 65 65 65 65 64 64 64 64 64 64 64 64 64 63 63 64 64 64 64 63 63 63 63 63 63 63 63 63 64 64 64 64 64 64 64 64 64 65 65 65 65 65 65 66 66 66 66 66 66 65 66 66 65 65 65 65 65 65 65 65 65 64 64 64 64 64 64
1346F4%%%%j%%%%J%%%%%%J%%%%%J%%%%%%%%%%%%%%%%j%%%%%%%%j%%%%%%%%%%%%%%J%%%%%%
$$ 64 64 64 64 64 63 63 63 63 63 64 64 64 64 64 64 64 65 65 65 65 65 65 66 66 66 66 66 66 66 66 66 66 66 66 66 66 66 66 66 65 65 65 65 65 65 65 65 65 64 64 64 64 64 64 64 64 64 64 64 64 64 64 64 65 65 65 65 65 65 65
1338F5%%%J%jJ%%%%%%%%%%%%%j%%%%%%%%%%j%%%%%%%%%%%jJ%%%%j%J%%%%%%%%%%%%%%%%%J
$$ 65 65 65 65 66 66 65 66 66 66 66 66 66 66 66 66 66 66 66 66 66 65 65 65 65 65 65 65 65 65 65 65 64 64 64 64 64 64 64 64 64 64 64 64 63 64 64 64 64 64 63 63 64 64 64 64 64 64 64 64 64 64 64 64 64 64 64 64 64 64 65
$$ [...]
-2638D8
##END=		$$ NMR SPECTRUM
##END=		$$ LINK
