##TITLE=	RP349 full char.10.fid
##JCAMP-DX=	6.0	$$ MestReNova 14.3.3-33362
##DATA TYPE=	LINK
##BLOCKS=	1    
##ORIGIN=	Mestrelab Research S.L.
##OWNER=	hrzepa
##$MNOVA/METADATA=	(DOCUMENT,BASE64)
eyJuYW1lIjoiL1VzZXJzL2hyemVwYS9MaWJyYXJ5L01vYmlsZSBEb2N1bWVudHMvY29tfmFwcGxlfkN
sb3VkRG9jcy9TaGVwcGFyZC9OTVIgZmlsZXMgemlwcy0yLzEyLzEyLUgubW5vdmEiLCJwYWdlcyI6W3
siaXRlbXMiOlsiMSIgICAgIF19XX0=
##TITLE=	RP349 full char.10.fid
##JCAMP-DX=	6.0	$$ MestReNova 14.3.3-33362
##DATA TYPE=	NMR SPECTRUM
##DATA CLASS=	XYDATA
##BLOCK_ID=	1
##ORIGIN=	Bruker BioSpin GmbH
##OWNER=	nmrsu
##NUMDIM=	1
##$MNOVA/METADATA=	(ITEM,BASE64)
eyJhbmdsZSI6MCwiYXhlcyI6eyJ4Ijp7Im1heCI6MTYuMDcyNjkwMDAwMDI3NTksIm1pbiI6LTMuNzU
4NTEyNTA2MjQyNTEzfSwieSI6eyJtYXgiOjQ0ODU2LjQyMzA5NTcwMzEyNSwibWluIjotMzk4NS40ND
kyNzIxNTU3NjE3fX0sInBvaW50cyI6W3sieCI6NTMyMSwieSI6NTgzNX0seyJ4Ijo4NzIyLCJ5Ijo1O
DM1fSx7IngiOjg3MjIsInkiOjgyMDh9LHsieCI6NTMyMSwieSI6ODIwOH0seyJ4Ijo1MzIxLCJ5Ijo1
ODM1fV0sInoiOjB9
##.OBSERVE FREQUENCY=	700.35432466099996418
##.OBSERVE NUCLEUS=	^1H
##.SOLVENT NAME=	DMSO
##.PULSE SEQUENCE=	zg30
##LONGDATE=	2023/11/21 19:16:51.000
##.ACQUISITIONMODE=	SIMULTANEOUS (DQD)
##$ORIGINAL FORMAT=	Bruker XWIN-NMR
##$MNOVA/SCALES_VERSION=	9
##$PARAMETER FILE=	(acqus, ASCII, /private/var/folders/f6/rjf_tdyn2v98c5c0wvkgn4s80000gq/T/ETYNHVLGTCW4plGNtixKRQ/10/acqus, 0)
$$ ##TITLE= Parameter file, TopSpin 4.1.3
$$ ##JCAMPDX= 5.0
$$ ##DATATYPE= Parameter Values
$$ ##NPOINTS= 1	$$ modification sequence number
$$ ##ORIGIN= Bruker BioSpin GmbH
$$ ##OWNER= nmrsu
$$ $$ 2023-11-21 19:16:47.835 +0000  nmrsu@CZC7167VR1
$$ $$ Z:/700/data/tds/nmr/RP349 full char/10/acqus
$$ $$ process C:\Bruker\TopSpin4.1.3\prog\mod\dirdata.exe
$$ ##$ACQT0= -2.0981556054023
$$ ##$AMP= (0..31)
$$ 100 100 100 100 100 100 100 100 100 100 100 100 100 100 100 100 100 100
$$ 100 100 100 100 100 100 100 100 100 100 100 100 100 100
$$ ##$AMPCOIL= (0..32)
$$ -1 0 0 0 0 0 0 0 0 0 0 0 0 0 0 0 0 0 0 0 0 0 0 0 0 0 0 0 0 0 0 0 0
$$ ##$AQSEQ= 0
$$ ##$AQ_mod= 3
$$ ##$AUNM= <au_zg>
$$ ##$AUTOPOS= <45 >
$$ ##$BF1= 700.349999998
$$ ##$BF2= 700.349999998
$$ ##$BF3= 700.349999998
$$ ##$BF4= 700.349999998
$$ ##$BF5= 700.349999998
$$ ##$BF6= 700.349999998
$$ ##$BF7= 700.349999998
$$ ##$BF8= 700.349999998
$$ ##$BWFAC= (0..63)
$$ 0 0 0 0 0 0 0 0 0 0 0 0 0 0 0 0 0 0 0 0 0 0 0 0 0 0 0 0 0 0 0 0 0 0 0 0
$$ 0 0 0 0 0 0 0 0 0 0 0 0 0 0 0 0 0 0 0 0 0 0 0 0 0 0 0 0
$$ ##$BYTORDA= 0
$$ ##$CHANFCU= (0..24)
$$ 0 1 0 0 0 0 0 0 0 0 0 0 0 0 0 0 0 0 0 0 0 0 0 0 0
$$ ##$CHANREC= (0..24)
$$ 0 0 0 0 0 0 0 0 0 0 0 0 0 0 0 0 0 0 0 0 0 0 0 0 0
$$ ##$CHEMSTR= <none>
$$ ##$CNST= (0..63)
$$ 1 1 1 1 1 1 1 1 1 1 1 1 1 1 1 1 1 1 1 1 1 1 1 1 1 1 1 1 1 1 1 1 1 1 1 1
$$ 1 1 1 1 1 1 1 1 1 1 1 1 1 1 1 1 1 1 1 1 1 1 1 1 1 1 1 1
$$ ##$CPDPRG= (0..8)
$$ <> <> <> <> <> <> <> <> <>
$$ ##$D= (0..63)
$$ 0 1 0 0 0 0 0 0 0 0 0 0 0 0 0 0 0.0002 0 0 0 0 0 0 0 0 0 0 0 0 0 0 0 0
$$ 0 0 0 0 0 0 0 0 0 0 0 0 0 0 0 0 0 0 0 0 0 0 0 0 0 0 0 0 0 0 0
$$ ##$DATE= 1700594211
$$ ##$DATE_START= 1700594168
$$ [...]
$$ ##$ShimPowRng3= (0..63)
$$ 1 1 1 1 1 1 1 1 1 1 1 1 1 1 1 1 1 1 1 1 1 1 1 1 1 1 1 1 1 1 1 1 1 1 1 1
$$ 1 1 1 1 0 0 0 0 0 0 0 0 0 0 0 0 0 0 0 0 0 0 0 0 0 0 0 0
$$ ##$ShimPowType1= 8
$$ ##$ShimPowType2= 8
$$ ##$ShimPowType3= 0
$$ ##$ShimPowType4= 0
$$ ##$ShimPowType5= 0
$$ ##$ShimPowType6= 0
$$ ##$ShimPowType7= 0
$$ ##$ShimPowType8= 0
$$ ##$ShimSysActGrad= (0..63)
$$ 1 2 3 4 13 5 7 11 10 9 6 8 12 18 19 20 21 15 22 23 24 14 25 16 26 17 27
$$ 28 31 32 33 34 35 36 37 38 0 0 0 0 0 0 0 0 0 0 0 0 0 0 0 0 0 0 0 0 0 0
$$ 0 0 0 0 0 0
$$ ##$ShimSysAngle= <>
$$ ##$ShimSysFunc= (0..63)
$$ 1 2 3 4 5 6 7 8 9 10 0 37 38 35 16 15 14 13 12 11 28 27 26 25 24 23 36
$$ 22 30 29 20 21 34 33 32 31 17 18 19 0 0 0 0 0 0 0 0 0 0 0 0 0 0 0 0 0 0
$$ 0 0 0 0 0 0 0
$$ ##$ShimSysMatId= <292722da.dat>
$$ ##$ShimSysMatrix= 1
$$ ##$ShimSysMinMaxUG= 130000
$$ ##$ShimSysOffset= <29 mm>
$$ ##$ShimSysType= 4
$$ ##$ShimUnit= 3
$$ ##$SpectrOsVersion= <4.1.156.20210628>
$$ ##$TCubeEth= <192.168.180.38>
$$ ##$TCubeSeqDevice= <>
$$ ##$TOSITY= <no>
$$ ##$TRIPLO2= 0
$$ ##$TopSpinVersion= <TopSpin 4.1.3>
$$ ##$TrxFreqFormula= (0..23)
$$ <TrxFreqFormula(2.0,700350000.000000,'TRX',Trx(1.0,'TRX 1200.1',1,5.000000,1290.000000))>
$$ <TrxFreqFormula(2.0,700350000.000000,'TRX',Trx(1.0,'TRX 1200.2',1,5.000000,1290.000000))>
$$ <TrxFreqFormula(2.0,700350000.000000,'TRX',Trx(1.0,'TRX 1200.3',1,5.000000,1290.000000))>
$$ <> <> <> <> <> <> <> <> <> <> <> <> <> <> <> <> <> <> <> <> <>
$$ ##$TrxPN= (0..23)
$$ <Z148391> <Z148391> <Z148391> <> <> <> <> <> <> <> <> <> <> <> <> <> <>
$$ <> <> <> <> <> <> <>
$$ ##$TrxSN= (0..23)
$$ <00336> <00337> <00342> <> <> <> <> <> <> <> <> <> <> <> <> <> <> <> <>
$$ <> <> <> <> <>
$$ ##$VCubeEth= (0..23)
$$ <no> <no> <no> <no> <no> <no> <no> <no> <no> <no> <no> <no> <no> <no> <no>
$$ <no> <no> <no> <no> <no> <no> <no> <no> <no>
$$ ##$VTU= 2
$$ ##$VTUETH= <192.168.99.11>
$$ ##$VTUTY= <no>
$$ ##$ValueLine= no
$$ ##$VpuPN= (0..23)
$$ <no> <no> <no> <no> <no> <no> <no> <no> <no> <no> <no> <no> <no> <no> <no>
$$ <no> <no> <no> <no> <no> <no> <no> <no> <no>
$$ ##$VpuSN= (0..23)
$$ <no> <no> <no> <no> <no> <no> <no> <no> <no> <no> <no> <no> <no> <no> <no>
$$ <no> <no> <no> <no> <no> <no> <no> <no> <no>
$$ ##$WBREFAM= (0..31)
$$ 99.8 100 100 100 100 100 100 100 100 100 100 100 100 100 100 100 100 100
$$ 100 100 100 100 100 100 100 100 100 100 100 100 100 100
$$ ##$WBREFLM= (0..31)
$$ 1 0 1 0 0 0 0 0 0 0 0 0 0 0 0 0 0 0 0 0 0 0 0 0 0 0 0 0 0 0 0 0
$$ ##$WBREFPH= (0..31)
$$ 0.05 0 0 0 0 0 0 0 0 0 0 0 0 0 0 0 0 0 0 0 0 0 0 0 0 0 0 0 0 0 0 0
$$ ##$WBSGU= (0..31)
$$ 1 2 4 0 0 0 0 0 0 0 0 0 0 0 0 0 0 0 0 0 0 0 0 0 0 0 0 0 0 0 0 0
$$ ##END=
$$ 
##$DECIM=	1440
##$DSPFVS=	21
##XUNITS=	HZ
##YUNITS=	ARBITRARY UNITS
##FIRSTX=	11256.508643983790535
##LASTX=	-2632.2742810921758974
##DELTAX=	-0.1059638129340278595
##XFACTOR=	1
##YFACTOR=	1.2444986810281686296
##FIRSTY=	105.970916748046875
##MINY=	92.31829833984375
##MAXY=	40778.48828125
##NPOINTS=	131072
##XYDATA=	(X++(Y..Y))
$$ [...]
3947A09J%%%j%%%%%jj%%%%%%%%j%%%%%J%%%%%%JJ%%%%%%j%%j%%%J%%%%j%%j%%%%%%J%JJj%
3940A08%%%jJJj%j%%%J%j%J%%%%%%%%%J%j%%%j%J%J%%%%j%%%%%j%jJJ%JjjJ%j%j%JJ%jJ%j
3933A07%%%%%%%%%J%%%%%J%%%j%%J%%%%j%%Jj%%%%J%j%%%%%%%%j%%%j%%%%%J%%J%%%%%j%%
3926A07%%%%J%%%jjjJ%K%%j%Jj%j%JJj%J%Jjj%%J%J%%%%%j%%%%%j%JjJ%%%J%%jj%%J%%%%j
3918A07%%%%J%%%%%%%%Jjj%%%%%%%%%%%J%%j%%%%%%%%%%%%%%j%%JJ%%%%%j%%%%Jj%%%JJj%
3911A08%j%%%%jJ%j%%J%J%%%%jJ%%%%%j%%%%%%%%%%J%%%j%jJ%%%%J%%%%%j%%%%%j%%j%%J%
3904A06J%%%%%J%j%%%%%%%%%%J%%j%%%%%%j%%%%%%%%%%%%%%%%%%%%j%J%%J%%%%%j%J%%%%%
3896A07J%%%%%%%j%%%%%%%%%%%%j%%J%J%%%j%%%%%%%%%%Jj%%%%%%%%%jj%%J%%%%J%Jj%%%%
$$ plain form
3947 109 110 110 110 110 109 109 109 109 109 109 108 107 107 107 107 107 107 107 107 107 106 106 106 106 106 106 107 107 107 107 107 107 107 108 109 109 109 109 109 109 109 108 108 108 107 107 107 107 108 108 108 108 108 107 107 107 106 106 106 106 106 106 106 107 107 108 109 108 108
3940 108 108 108 108 107 108 109 108 108 107 107 107 107 108 108 107 107 108 108 108 108 108 108 108 108 108 108 109 109 108 108 108 108 107 107 108 108 109 109 109 109 109 108 108 108 108 108 108 107 107 106 107 108 108 109 108 107 108 108 107 107 106 106 107 108 108 107 108 108 107
3933 107 107 107 107 107 107 107 107 107 107 108 108 108 108 108 108 109 109 109 109 108 108 108 109 109 109 109 109 108 108 108 109 108 108 108 108 108 109 109 108 108 108 108 108 108 108 108 108 107 107 107 107 106 106 106 106 106 106 107 107 107 108 108 108 108 108 108 107 107 107
3926 107 107 107 107 107 108 108 108 108 107 106 105 106 106 108 108 108 107 107 108 107 107 106 106 107 108 107 107 108 108 109 108 107 107 107 108 108 109 109 109 109 109 109 108 108 108 108 108 108 107 107 108 107 108 108 108 108 109 109 109 108 107 107 107 108 108 108 108 108 107
3918 107 107 107 107 107 108 108 108 108 108 108 108 108 108 109 108 107 107 107 107 107 107 107 107 107 107 107 107 108 108 108 107 107 107 107 107 107 107 107 107 107 107 107 107 107 107 106 106 106 107 108 108 108 108 108 108 107 107 107 107 107 108 107 107 107 107 108 109 108 108
3911 108 108 107 107 107 107 107 106 107 107 106 106 106 107 107 108 108 108 108 108 107 108 108 108 108 108 108 107 107 107 107 107 107 107 107 107 107 107 108 108 108 108 107 107 106 107 107 107 107 107 108 108 108 108 108 108 107 107 107 107 107 107 106 106 106 105 105 105 106 106
3904 106 107 107 107 107 107 107 108 108 107 107 107 107 107 107 107 107 107 107 107 108 108 108 107 107 107 107 107 107 107 106 106 106 106 106 106 106 106 106 106 106 106 106 106 106 106 106 106 106 106 106 105 105 106 106 106 107 107 107 107 107 107 106 106 107 107 107 107 107 107
3896 107 108 108 108 108 108 108 108 108 107 107 107 107 107 107 107 107 107 107 107 107 107 106 106 106 107 107 108 108 108 108 107 107 107 107 107 107 107 107 107 107 107 108 107 107 107 107 107 107 107 107 107 107 106 105 105 105 106 106 106 106 106 107 107 108 107 107 107 107 107
3889A07%%%J%jj%%%%%jJ%JJ%%%j%%%%%JJ%%%%%jjj%%J%%%j%J%%%%%%%%J%%%%jJ%%%%j%%%%
3882A07%%%%%J%J%jj%%%%%Jj%J%%%%%%%%%%%%%j%jJ%%%jJJ%%jJ%%%%j%%%%%%%J%J%%j%%%J
3874A09%%%%%%%%jj%%%%j%%J%%%%%%%%%j%%%JJ%%jJ%%j%%%j%J%%%%%%%%%JJjjj%J%%%%%%j
3867A06%%J%%%j%%%%%%J%%%j%%%%J%%Jj%%%%%j%%%%J%%J%J%j%jJ%%%j%%%j%%Jj%%J%%jJ%j
3860A06%%J%%%%%%J%j%%%%%%%%%%%%j%%J%%%j%%%J%%j%%J%%jJ%%%j%jJJ%%j%%%jJJ%%%%%J
3852A08%j%%%%%j%%%%%J%%j%%%%J%%%%%J%%j%%j%%%%%J%%%%jjJ%%%%%%jJ%Jj%%j%%J%%j%J
3845A06J%%%%%%%%%jJ%%%%jJ%%%%%%J%j%j%%%%j%%%%%%%J%%%JJj%%%j%%%%%%%%%J%%J%j%%
3838A07%%%%%%%%j%%jJJ%J%j%%%%%%%%%%%J%%%%j%j%J%%jjJ%%%JJJj%jj%%%%J%%%j%J%%%%
$$ plain form
3889 107 107 107 107 108 108 107 106 106 106 106 106 106 105 106 106 107 108 108 108 108 107 107 107 107 107 107 108 109 109 109 109 109 109 108 107 106 106 106 107 107 107 107 106 106 107 107 107 107 107 107 107 107 107 108 108 108 108 108 107 108 108 108 108 108 107 107 107 107 107
3882 107 107 107 107 107 107 108 108 109 109 108 107 107 107 107 107 107 108 107 107 108 108 108 108 108 108 108 108 108 108 108 108 108 108 107 107 106 107 107 107 107 106 107 108 108 108 107 108 108 108 108 108 107 107 107 107 107 107 107 107 108 108 109 109 109 108 108 108 108 109
3874 109 109 109 109 109 109 109 109 109 108 107 107 107 107 107 106 106 106 107 107 107 107 107 107 107 107 107 107 106 106 106 106 107 108 108 108 107 108 108 108 107 107 107 107 106 106 107 107 107 107 107 107 107 107 107 107 108 109 108 107 106 106 107 107 107 107 107 107 107 106
3867 106 106 106 107 107 107 107 106 106 106 106 106 106 106 107 107 107 107 106 106 106 106 106 107 107 107 108 107 107 107 107 107 107 106 106 106 106 106 107 107 107 108 108 109 109 108 108 107 108 108 108 108 107 107 107 107 106 106 106 107 106 106 106 107 107 107 106 107 107 106
3860 106 106 106 107 107 107 107 107 107 107 108 108 107 107 107 107 107 107 107 107 107 107 107 107 107 106 106 106 107 107 107 107 106 106 106 106 107 107 107 106 106 106 107 107 107 106 107 107 107 107 106 106 105 106 107 107 107 106 106 106 106 105 106 107 107 107 107 107 107 108
3852 108 108 107 107 107 107 107 107 106 106 106 106 106 106 107 107 107 106 106 106 106 106 107 107 107 107 107 107 108 108 108 107 107 107 106 106 106 106 106 106 107 107 107 107 107 106 105 106 106 106 106 106 106 106 105 106 106 107 106 106 106 105 105 105 106 106 106 105 105 106
3845 106 107 107 107 107 107 107 107 107 107 107 106 107 107 107 107 107 106 107 107 107 107 107 107 107 108 108 107 107 106 106 106 106 106 105 105 105 105 105 105 105 105 106 106 106 106 107 108 107 107 107 107 106 106 106 106 106 106 106 106 106 106 107 107 107 108 108 107 107 107
3838 107 107 107 107 107 107 107 107 107 106 106 106 105 106 107 107 108 108 107 107 107 107 107 107 107 107 107 107 107 107 108 108 108 108 108 107 107 106 106 107 107 107 106 105 106 106 106 106 107 108 109 108 108 107 106 106 106 106 106 107 107 107 107 106 106 107 107 107 107 107
3830A07%%%%jj%JJ%%%jJ%%%%%%%%j%J%%%%J%%jJ%%%j%j%%JJ%%j%j%J%J%%j%j%j%%J%%%J%%
3823A07%Jj%%%%j%%%%J%%%j%%%JJ%jj%%%%%J%J%Jj%%%%%jJ%j%J%%%j%%%%%J%jj%J%%%%j%j
3816A05%J%%J%%J%%%%%%%Jj%%j%%%%%%%%%%j%J%%%%J%%%%%%Jj%%j%J%%j%%j%%%%%%%%%%%J
3809A07%%%%%%%%%j%%%%J%J%%j%%j%%%%%J%%JJ%jj%%J%j%%%%%%%%%%%%%j%%J%%%j%J%%%%%
3801A07%%%%%j%J%%%j%%%%%J%%j%j%%%JJj%%J%%%%%J%%jj%%J%%%%%%%%j%%%%%%J%j%%%%%%
3794A06%%%%%%J%%%%jJJj%%%%%%%%%j%%%%%%%J%%%%j%%%%%%%J%%%%%%jJJ%%j%%%%%%%%%%%
3787A07j%J%%j%j%JJ%j%%%J%jJ%%%%%%%%%%%%%%%%j%%%J%%%%%%%%%%j%JJj%%J%%%%j%J%j%
3779A07%%j%%%%%%%%J%J%%%%%j%%j%%jJJ%%%%%%%J%%jj%jJ%%J%%J%%Jj%%%%%J%%j%%%j%%%
$$ plain form
3830 107 107 107 107 107 106 105 105 106 107 107 107 107 106 107 107 107 107 107 107 107 107 107 106 106 107 107 107 107 107 108 108 108 107 108 108 108 108 107 107 106 106 106 107 108 108 108 107 107 106 106 107 107 108 108 108 107 107 106 106 105 105 105 106 106 106 106 107 107 107
3823 107 107 108 107 107 107 107 107 106 106 106 106 106 107 107 107 107 106 106 106 106 107 108 108 107 106 106 106 106 106 106 107 107 108 108 109 108 108 108 108 108 108 107 108 108 107 107 108 108 108 108 107 107 107 107 107 107 108 108 107 106 106 107 107 107 107 107 106 106 105
3816 105 105 106 106 106 107 107 107 108 108 108 108 108 108 108 108 109 108 108 108 107 107 107 107 107 107 107 107 107 107 107 106 106 107 107 107 107 107 108 108 108 108 108 108 108 109 108 108 108 107 107 108 108 108 107 107 107 106 106 106 106 106 106 106 106 106 106 106 106 107
3809 107 107 107 107 107 107 107 107 107 107 106 106 106 106 106 107 107 108 108 108 107 107 107 106 106 106 106 106 106 107 107 107 108 109 109 108 107 107 107 108 108 107 107 107 107 107 107 107 107 107 107 107 107 107 107 106 106 106 107 107 107 107 106 106 107 107 107 107 107 107
3801 107 107 107 107 107 107 106 106 107 107 107 107 106 106 106 106 106 106 107 107 107 106 106 105 105 105 105 106 107 106 106 106 107 107 107 107 107 107 108 108 108 107 106 106 106 107 107 107 107 107 107 107 107 107 106 106 106 106 106 106 106 107 107 106 106 106 106 106 106 106
3794 106 106 106 106 106 106 106 107 107 107 107 107 106 107 108 107 107 107 107 107 107 107 107 107 107 106 106 106 106 106 106 106 106 107 107 107 107 107 106 106 106 106 106 106 106 106 107 107 107 107 107 107 107 106 107 108 108 108 107 107 107 107 107 107 107 107 107 107 107 107
3787 107 106 106 107 107 107 106 106 105 105 106 107 107 106 106 106 106 107 107 106 107 107 107 107 107 107 107 107 107 107 107 107 107 107 107 107 107 106 106 106 106 107 107 107 107 107 107 107 107 107 107 107 106 106 107 108 107 107 107 108 108 108 108 108 107 107 108 108 107 107
3779 107 107 107 106 106 106 106 106 106 106 106 106 107 107 108 108 108 108 108 108 107 107 107 106 106 106 105 106 107 107 107 107 107 107 107 107 108 108 108 107 106 106 105 106 106 106 107 107 107 108 108 108 109 108 108 108 108 108 108 109 109 109 108 108 108 108 107 107 107 107
3772A07%%%%%J%%%%%%j%%%%j%%J%J%j%%JjJ%%%%Jj%%%jJj%%%%%JJ%%%%%%%jj%%%%%J%%J%j
3765A08%%%J%%%%%J%%jj%%%jjJJj%%%%J%%%%%J%%%%%J%%%%j%%%J%%%%%j%%%%%J%%%%jjJ%J
3757A10%J%j%%JJ%J%%J%%%j%%JJ%Jj%j%J%JJ%J%%J%%J%%JJ%J%%JJJ%jj%J%%%J%%%%jJ%%J%
3750A27%%jJ%j%%j%k%%jj%%%J%jj%Jjjj%j%%jjJ%%%j%j%%jj%%Jj%%%%%%%%%%%j%%%Jjj%Jj
3743A10%%j%%%j%%%%%%%%%%%%j%%%%%%%%%J%%%j%%%J%%j%%%J%%%j%%%J%%%%Jj%%%j%jJ%%%
3735A07%%%Jj%%%J%%j%%%J%%%j%jJ%%%%J%%%%%jJ%%J%j%j%%%%JJ%j%%%%%%j%%%%jJ%%Jj%j
3728A06%%%%%%J%%%J%%j%%j%J%%%j%%%J%j%%%J%%%%%%%%%j%%%%J%J%%%jj%%%J%%j%%%%J%J
3721A08j%%%J%jj%%J%%%j%jJ%%%J%J%%%%%%%j%%%%%%JJ%%jj%%%%%%J%j%%jJ%J%%j%%%%%JJ
$$ plain form
3772 107 107 107 107 107 107 108 108 108 108 108 108 108 107 107 107 107 107 106 106 106 107 107 108 108 107 107 107 108 107 108 108 108 108 108 109 108 108 108 108 107 108 107 107 107 107 107 107 108 109 109 109 109 109 109 109 109 108 107 107 107 107 107 107 108 108 108 109 109 108
3765 108 108 108 108 109 109 109 109 109 109 110 110 110 109 108 108 108 108 107 106 107 108 107 107 107 107 107 108 108 108 108 108 108 109 109 109 109 109 109 110 110 110 110 110 109 109 109 109 110 110 110 110 110 110 109 109 109 109 109 109 110 110 110 110 110 109 108 109 109 110
3757 110 110 111 111 110 110 110 111 112 112 113 113 113 114 114 114 114 113 113 113 114 115 115 116 115 115 114 114 115 115 116 117 117 118 118 118 119 119 119 120 120 120 121 122 122 123 123 123 124 125 126 126 125 124 124 125 125 125 125 126 126 126 126 126 125 126 126 126 127 127
3750 127 127 127 126 127 127 126 126 126 125 125 123 123 123 122 121 121 121 121 122 122 121 120 120 121 120 119 118 118 117 117 117 116 115 116 116 116 116 115 115 114 114 114 113 112 112 112 113 112 112 112 112 112 112 112 112 112 112 112 112 111 111 111 111 112 111 110 110 111 110
3743 110 110 110 109 109 109 109 108 108 108 108 108 108 108 108 108 108 108 108 108 107 107 107 107 107 107 107 107 107 107 108 108 108 108 107 107 107 107 108 108 108 107 107 107 107 108 108 108 108 107 107 107 107 108 108 108 108 108 109 108 108 108 108 107 107 106 107 107 107 107
3735 107 107 107 107 108 107 107 107 107 108 108 108 107 107 107 107 108 108 108 108 107 107 106 107 107 107 107 107 108 108 108 108 108 108 107 108 108 108 109 109 108 108 107 107 107 107 107 108 109 109 108 108 108 108 108 108 108 107 107 107 107 107 106 107 107 107 108 107 107 106
3728 106 106 106 106 106 106 106 107 107 107 107 108 108 108 107 107 107 106 106 107 107 107 107 106 106 106 106 107 107 106 106 106 106 107 107 107 107 107 107 107 107 107 107 106 106 106 106 106 107 107 108 108 108 108 107 106 106 106 106 107 107 107 106 106 106 106 106 107 107 108
3721 108 107 107 107 107 108 108 107 106 106 106 107 107 107 107 106 106 105 106 106 106 106 107 107 108 108 108 108 108 108 108 108 107 107 107 107 107 107 107 108 109 109 109 108 107 107 107 107 107 107 107 108 108 107 107 107 106 107 107 108 108 108 107 107 107 107 107 107 108 109
3713A09%j%j%%j%%JJ%j%%%j%%%%J%j%J%%%J%%%%%%%j%%%%%%%%%%%J%%%j%J%%Jj%j%%%j%J%
3706A07%j%%%J%%%%%J%j%j%J%%%%%%%Jj%%%%%%%%%%J%%%%j%%%%%%%J%%%%j%%%%j%%J%%%j%
3699A06%%%JJ%%%%%J%jj%J%%j%jJ%%%j%Jj%%%%%j%J%%%%%J%J%%%%%jJ%%%J%%%%%j%j%j%j%
3692A05%J%%%%%%J%%%%%%%%%%%jJ%%%j%JJ%j%%%Jj%%%j%%%%Jj%%J%J%%%%%jj%%J%J%%jj%J
3684A07%%J%j%j%%J%J%j%%%%%%%%jJ%%%jjJJ%%%%%Jj%%j%%J%%%%%%%%%%%%j%%%%%%%%%%%J
3677A07%%%%%%%J%%%j%j%%%%J%J%%j%%%%%%%%%%%%%%j%%jJ%%%%J%%%j%%jJ%jJ%%%Jj%%%J%
3670A07%%Jjjj%jJJ%%Jj%%%%%%%%%%%J%%%%j%%%j%J%JJ%%%J%%%%jk%%j%%%%J%%J%%%Jj%j%
3662A06%%J%jj%%J%%%%%%%%%%J%%%%j%%j%%%%JJ%%%%J%%j%%%jJj%J%%%%%%%j%%%%%%jjJJ%
$$ plain form
3713 109 109 108 108 107 107 107 106 106 106 107 108 108 107 107 107 107 106 106 106 106 106 107 107 106 106 107 107 107 107 108 108 108 108 108 108 108 108 107 107 107 107 107 107 107 107 107 107 107 107 108 108 108 108 107 107 108 108 108 109 108 108 107 107 107 107 106 106 107 107
3706 107 107 106 106 106 106 107 107 107 107 107 107 108 108 107 107 106 106 107 107 107 107 107 107 107 107 108 107 107 107 107 107 107 107 107 107 107 107 108 108 108 108 108 107 107 107 107 107 107 107 107 108 108 108 108 108 107 107 107 107 107 106 106 106 107 107 107 107 106 106
3699 106 106 106 106 107 108 108 108 108 108 108 109 109 108 107 107 108 108 108 107 107 106 107 107 107 107 106 106 107 106 106 106 106 106 106 105 105 106 106 106 106 106 106 107 107 108 108 108 108 108 108 107 108 108 108 108 109 109 109 109 109 109 108 108 107 107 106 106 105 105
3692 105 105 106 106 106 106 106 106 106 107 107 107 107 107 107 107 107 107 107 107 107 106 107 107 107 107 106 106 107 108 108 107 107 107 107 108 107 107 107 107 106 106 106 106 106 107 106 106 106 107 107 108 108 108 108 108 108 107 106 106 106 107 107 108 108 108 107 106 106 107
3684 107 107 107 108 108 107 107 106 106 106 107 107 108 108 107 107 107 107 107 107 107 107 107 106 107 107 107 107 106 105 106 107 107 107 107 107 107 108 107 107 107 106 106 106 107 107 107 107 107 107 107 107 107 107 107 107 107 106 106 106 106 106 106 106 106 106 106 106 106 107
3677 107 107 107 107 107 107 107 107 108 108 108 108 107 107 106 106 106 106 106 107 107 108 108 108 107 107 107 107 107 107 107 107 107 107 107 107 107 107 107 106 106 106 105 106 106 106 106 106 107 107 107 107 106 106 106 105 106 106 105 106 106 106 106 107 106 106 106 106 107 107
3670 107 107 107 108 107 106 105 105 104 105 106 106 106 107 106 106 106 106 106 106 106 106 106 106 106 106 107 107 107 107 107 106 106 106 106 105 105 106 106 107 108 108 108 108 109 109 109 109 109 108 106 106 106 105 105 105 105 105 106 106 106 107 107 107 107 108 107 107 106 106
3662 106 106 106 107 107 106 105 105 105 106 106 106 106 106 106 106 106 106 106 106 107 107 107 107 107 106 106 106 105 105 105 105 105 106 107 107 107 107 107 108 108 108 107 107 107 107 106 107 106 106 107 107 107 107 107 107 107 107 106 106 106 106 106 106 106 105 104 105 106 106
3655A06%%jJ%J%%%%%%%%%%%%%j%%%%%%%%J%%j%j%J%%%%%%%jJJ%j%%%%%%%%%%%%%%J%%%j%%
3648A06%%%%%%%Jjj%%J%%%%%%Jj%%%%j%%%J%JJ%j%j%%%%%%%%Jj%%%%%%%%%%%%J%%%j%JJ%%
3640A08%j%%%j%%jJ%%%%j%%%%J%%%%j%%J%%%%%%%%%%%%%%%j%%jJ%%jJ%J%%%%%%%%Jj%%j%%
3633A05j%%%J%J%%%%%%%%%JJj%j%j%%%%%J%%%%%J%%%%J%j%j%j%%J%%%%j%J%J%j%%J%j%%jJ
3626A06%%%J%%j%jJ%%Jj%%%%j%J%%%%%%%Jjj%J%%%J%j%%%%j%J%%J%%%j%%j%%j%J%%%%%jJ%
3618A05%%J%%jJ%%%%%%%%%%j%%J%%%J%jJ%%j%%%%%j%%%J%%%%jJ%j%%%%%J%%%%%%%%%j%J%%
3611A06%%%%%J%%%%j%%%%%jJ%%%%%%%%%%%%%j%J%Jjj%%%J%Jj%J%J%j%%%j%%%J%%%%jJ%j%%
3604A06%%%%%Jj%%%%%%%J%%%%%j%%%%%%%j%%J%%%J%%jj%%Jj%JJ%J%jjjJ%%%%J%%J%jjjJ%%
$$ plain form
3655 106 106 106 105 106 106 107 107 107 107 107 107 107 107 107 107 107 107 107 107 106 106 106 106 106 106 106 106 106 107 107 107 106 106 105 105 106 106 106 106 106 106 106 106 105 106 107 107 106 106 106 106 106 106 106 106 106 106 106 106 106 106 106 107 107 107 107 106 106 106
3648 106 106 106 106 106 106 106 106 107 106 105 105 105 106 106 106 106 106 106 106 107 106 106 106 106 106 105 105 105 105 106 106 107 108 108 107 107 106 106 106 106 106 106 106 106 106 107 106 106 106 106 106 106 106 106 106 106 106 106 106 107 107 107 107 106 106 107 108 108 108
3640 108 108 107 107 107 107 106 106 106 105 106 106 106 106 106 105 105 105 105 105 106 106 106 106 106 105 105 105 106 106 106 106 106 106 106 106 106 106 106 106 106 106 106 106 105 105 105 104 105 105 105 104 105 105 106 106 106 106 106 106 106 106 106 107 106 106 106 105 105 105
3633 105 104 104 104 104 105 105 106 106 106 106 106 106 106 106 106 106 107 108 107 107 106 106 105 105 105 105 105 105 106 106 106 106 106 106 107 107 107 107 107 108 108 107 107 106 106 105 105 105 106 106 106 106 106 105 105 106 106 107 107 106 106 106 107 107 106 106 106 105 106
3626 106 106 106 106 107 107 107 106 106 105 106 106 106 107 106 106 106 106 106 105 105 106 106 106 106 106 106 106 106 107 106 105 105 106 106 106 106 107 107 106 106 106 106 106 105 105 106 106 106 107 107 107 107 106 106 106 105 105 105 104 104 105 105 105 105 105 105 104 105 105
3618 105 105 105 106 106 106 105 106 106 106 106 106 106 106 106 106 106 106 105 105 105 106 106 106 106 107 107 106 107 107 107 106 106 106 106 106 106 105 105 105 105 106 106 106 106 106 105 106 106 105 105 105 105 105 105 106 106 106 106 106 106 106 106 106 106 105 105 106 106 106
3611 106 106 106 106 106 106 107 107 107 107 107 106 106 106 106 106 106 105 106 106 106 106 106 106 106 106 106 106 106 106 106 106 105 105 106 106 107 106 105 105 105 105 106 106 107 106 106 107 107 108 108 107 107 107 107 106 106 106 106 107 107 107 107 107 106 107 107 106 106 106
3604 106 106 106 106 106 106 107 106 106 106 106 106 106 106 106 107 107 107 107 107 107 106 106 106 106 106 106 106 106 105 105 105 106 106 106 106 107 107 107 106 105 105 105 106 105 105 106 107 107 108 108 107 106 105 106 106 106 106 106 107 107 107 108 108 107 106 105 106 106 106
3596A06j%J%%jJ%%J%jjJ%J%%j%%J%j%%J%%%%j%%j%J%%%J%%%%jj%%J%%jJ%JJ%j%%%%%%J%j%
3589A07%j%jJ%%J%%%%%%%%%%j%%%%%%%%%%%%%J%%j%%j%%JJ%j%%%%%%%j%%jJJ%%%Jj%%%%%%
3582A06%%%%%%%%%%%%%%%%j%%%%%%%J%%J%J%jj%%J%%Jj%j%%%j%%j%jJ%%JJJ%%%%Jj%%%Jj%
3575A07j%%%%J%%j%%%%%%%%%J%j%jjJ%%J%j%J%%%%%%%%%j%%%%%J%%%%%J%%%%%%%%%%J%%jj
3567A06%%%%%%jJJj%%%%%j%%%%JJ%%j%Jj%%%J%%%j%j%%%%%%%%%%%%jJ%JJj%%%%%jJ%%%j%j
3560A04%%JJ%%J%j%%j%%%%%%%J%%%J%J%jJ%jj%%J%Jj%%j%%%j%%%%%%%%KJ%j%%j%%%%%%%Jj
3553A06%%%%%%%%j%%%J%%%%%%%%%%j%%%%%%%JJ%%j%%%%j%%J%%%%%%%%%%%J%%%jj%%%%%J%%
3545A06J%j%j%J%%%j%J%%J%j%%%%%%j%%j%%JJ%%%J%%%jj%J%%j%%%JJ%%%%j%%%%%%%%%%j%%
$$ plain form
3596 106 105 105 106 106 106 105 106 106 106 107 107 106 105 106 106 107 107 107 106 106 106 107 107 106 106 106 107 107 107 107 107 106 106 106 105 105 106 106 106 106 107 107 107 107 107 106 105 105 105 106 106 106 105 106 106 107 108 108 107 107 107 107 107 107 107 108 108 107 107
3589 107 107 106 106 105 106 106 106 107 107 107 107 107 107 107 107 107 107 107 106 106 106 106 106 106 106 106 106 106 106 106 106 106 107 107 107 106 106 106 105 105 105 106 107 107 106 106 106 106 106 106 106 106 105 105 105 104 105 106 106 106 106 107 106 106 106 106 106 106 106
3582 106 106 106 106 106 106 106 106 106 106 106 106 106 106 106 106 106 105 105 105 105 105 105 105 105 106 106 106 107 107 108 108 107 106 106 106 107 107 107 108 107 107 106 106 106 106 105 105 105 104 104 103 104 104 104 105 106 107 107 107 107 107 108 107 107 107 107 108 107 107
3575 107 106 106 106 106 106 107 107 107 106 106 106 106 106 106 106 106 106 106 107 107 106 106 105 104 105 105 105 106 106 105 105 106 106 106 106 106 106 106 106 106 106 105 105 105 105 105 105 106 106 106 106 106 106 107 107 107 107 107 107 107 107 107 107 107 108 108 108 107 106
3567 106 106 106 106 106 106 106 105 106 107 106 106 106 106 106 106 105 105 105 105 105 106 107 107 107 106 106 107 106 106 106 106 107 107 107 107 106 106 105 105 105 105 105 105 105 105 105 105 105 105 105 104 105 105 106 107 106 106 106 106 106 106 105 106 106 106 106 105 105 104
3560 104 104 104 105 106 106 106 107 107 106 106 106 105 105 105 105 105 105 105 105 106 106 106 106 107 107 108 108 107 108 108 107 106 106 106 107 107 108 107 107 107 106 106 106 106 105 105 105 105 105 105 105 105 105 107 108 108 107 107 107 106 106 106 106 106 106 106 106 107 106
3553 106 106 106 106 106 106 106 106 106 105 105 105 105 106 106 106 106 106 106 106 106 106 106 106 105 105 105 105 105 105 105 105 106 107 107 107 106 106 106 106 106 105 105 105 106 106 106 106 106 106 106 106 106 106 106 106 107 107 107 107 106 105 105 105 105 105 105 106 106 106
3545 106 107 107 106 106 105 105 106 106 106 106 105 105 106 106 106 107 107 106 106 106 106 106 106 106 105 105 105 104 104 104 105 106 106 106 106 107 107 107 107 106 105 105 106 106 106 105 105 105 105 106 107 107 107 107 107 106 106 106 106 106 106 106 106 106 106 106 105 105 105
3538A05%j%J%%J%%%%%%%j%J%%%%j%%J%%j%%%J%J%j%%%%%%%%%%j%%%J%%%%%j%j%%J%%%%%%J
3531A06%Jj%%%%jJ%Jj%%%%%%%%%%%%%%j%J%%%j%%%JJj%%%%JjjjJJ%%jJ%%j%%%%J%%%%%Jj%
3523A06%%%%%Jj%%J%%jj%%%%%%%J%%%%k%J%J%%%%%%%%%%%j%%%%j%%J%%%%%%%%%%JJ%%%jj%
3516A05%jJ%%J%%%%%%%%%%%J%j%j%%%%%%%%J%%%%%%%%%%%j%%%J%%%%%%%%%%j%%J%%%Jj%%%
3509A06%%j%J%%%Jj%%%%%%%%%%J%j%Jj%%%J%%j%j%%jJ%Jj%%%%%Jj%%%%J%%%%%%%%jJ%%%%%
3501A06%j%%J%%j%%%J%%%%%j%%Jj%%%%%%%%%%Jj%J%jJJj%%%%j%%%J%%J%j%%%%%j%j%jJJ%J
3494A06j%J%J%%%j%j%%%Jjj%J%%%%%%%%J%%%%%%%j%%%J%j%%J%J%Jj%%%j%J%%%jj%jJ%%%%%
3487A05%%%Jj%%%j%%J%JJJ%%jj%%%%j%J%%J%%j%%%%%%%%Jj%%%%%j%J%J%%%j%J%%%%%jj%%%
$$ plain form
3538 105 105 104 104 105 105 105 106 106 106 106 106 106 106 106 105 105 106 106 106 106 106 105 105 105 106 106 106 105 105 105 105 106 106 107 107 106 106 106 106 106 106 106 106 106 106 106 105 105 105 105 106 106 106 106 106 106 105 105 104 104 104 105 105 105 105 105 105 105 106
3531 106 106 107 106 106 106 106 106 105 106 106 107 106 106 106 106 106 106 106 106 106 106 106 106 106 106 106 105 105 106 106 106 106 105 105 105 105 106 107 106 106 106 106 106 107 106 105 104 105 106 106 106 105 106 106 106 105 105 105 105 105 106 106 106 106 106 106 107 106 106
3523 106 106 106 106 106 106 107 106 106 106 107 107 107 106 105 105 105 105 105 105 105 105 106 106 106 106 106 104 104 105 105 106 106 106 106 106 106 106 106 106 106 106 106 105 105 105 105 105 104 104 104 105 105 105 105 105 105 105 105 105 105 105 106 107 107 107 107 106 105 105
3516 105 105 104 105 105 105 106 106 106 106 106 106 106 106 106 106 106 106 107 107 106 106 105 105 105 105 105 105 105 105 105 106 106 106 106 106 106 106 106 106 106 106 106 105 105 105 105 106 106 106 106 106 106 106 106 106 106 106 105 105 105 106 106 106 106 107 106 106 106 106
3509 106 106 106 105 105 106 106 106 106 107 106 106 106 106 106 106 106 106 106 106 106 107 107 106 106 107 106 106 106 106 107 107 107 106 106 105 105 105 104 105 105 106 105 105 105 105 105 105 106 105 105 105 105 105 106 106 106 106 106 106 106 106 106 105 106 106 106 106 106 106
3501 106 106 105 105 105 106 106 106 105 105 105 105 106 106 106 106 106 106 105 105 105 106 105 105 105 105 105 105 105 105 105 105 105 106 105 105 106 106 105 106 107 106 106 106 106 106 105 105 105 105 106 106 106 107 107 106 106 106 106 106 106 105 105 104 104 103 104 105 105 106
3494 106 105 105 106 106 107 107 107 107 106 106 105 105 105 105 106 105 104 104 105 105 105 105 105 105 105 105 105 106 106 106 106 106 106 106 106 105 105 105 105 106 106 105 105 105 106 106 107 107 108 107 107 107 107 106 106 107 107 107 107 106 105 105 104 105 105 105 105 105 105
3487 105 105 105 105 106 105 105 105 105 104 104 104 105 105 106 107 108 108 108 107 106 106 106 106 106 105 105 106 106 106 107 107 107 106 106 106 106 106 106 106 106 106 107 106 106 106 106 106 106 105 105 106 106 107 107 107 107 106 106 107 107 107 107 107 107 106 105 105 105 105
3480A05Jj%%J%%%%%%J%%j%%%%%%%%%%%Jj%%j%%J%j%%%%%%%%%%%j%%%J%%J%%j%%j%%%J%%%J
3472A06%j%%%%%jjJ%J%%%%J%%%j%J%%%%j%%%%%%J%%%%jj%J%%%J%J%jj%J%%%%%j%%%%%%%%j
3465A04%%%%%%%%%J%%%%%%%%J%%%jj%JJJj%%%%%j%%j%J%%%%%%%%%%%J%j%%J%Jjj%j%%%J%j
3458A04%%Jj%J%%j%%%%%%%%%J%%%j%%%%%%%%%%%J%%%%%%j%%JJ%j%%j%J%%%%J%%%%%%%%%%j
3450A05%%J%%jj%j%%%%%J%%J%%jJ%%%%J%%%%%%%%J%%%%%%%%j%%j%j%%%%J%%j%J%%J%%%j%%
3443A05%%%%%%%%%j%%%%J%%%jjJJJJj%j%JJ%%%j%j%J%%%%j%J%jj%%%%%%%%%J%JjjJ%%%J%j
3436A05%%%%%j%JJ%%j%%jJ%J%j%j%K%J%%%j%j%%%%J%j%%%%%%%%j%%%J%%%j%%%%%J%%%jJJ%
3428A06%%%Jj%%%%%J%%j%%%%%%%%%%%%%%j%%%%%%J%%%%%j%%%%%%%%%%%j%%%J%%%%j%%%%%J
$$ plain form
3480 105 106 105 105 105 106 106 106 106 106 106 106 107 107 107 106 106 106 106 106 106 106 106 106 106 106 106 107 106 106 106 105 105 105 106 106 105 105 105 105 105 105 105 105 105 105 105 105 104 104 104 104 105 105 105 106 106 106 105 105 105 104 104 104 104 105 105 105 105 106
3472 106 106 105 105 105 105 105 105 104 103 104 104 105 105 105 105 105 106 106 106 106 105 105 106 106 106 106 106 105 105 105 105 105 105 105 106 106 106 106 106 105 104 104 105 105 105 105 106 106 107 107 106 105 105 106 106 106 106 106 106 105 105 105 105 105 105 105 105 105 104
3465 104 104 104 104 104 104 104 104 104 104 105 105 105 105 105 105 105 105 105 106 106 106 106 105 104 104 105 106 107 106 106 106 106 106 106 105 105 105 104 104 105 105 105 105 105 105 105 105 105 105 105 105 106 106 105 105 105 106 106 107 106 105 105 104 104 104 104 105 105 104
3458 104 104 104 105 104 104 105 105 105 104 104 104 104 104 104 104 104 104 104 105 105 105 105 104 104 104 104 104 104 104 104 104 104 104 104 105 105 105 105 105 105 105 104 104 104 105 106 106 105 105 105 104 104 105 105 105 105 105 106 106 106 106 106 106 106 106 106 106 106 105
3450 105 105 105 106 106 106 105 104 104 103 103 103 103 103 103 104 104 104 105 105 105 104 105 105 105 105 105 106 106 106 106 106 106 106 106 106 107 107 107 107 107 107 107 107 107 106 106 106 105 105 104 104 104 104 104 105 105 105 104 104 105 105 105 106 106 106 106 105 105 105
3443 105 105 105 105 105 105 105 105 105 105 104 104 104 104 104 105 105 105 105 104 103 104 105 106 107 106 106 105 105 106 107 107 107 107 106 106 105 105 106 106 106 106 106 105 105 106 106 105 104 104 104 104 104 104 104 104 104 104 105 105 106 105 104 105 105 105 105 106 106 105
3436 105 105 105 105 105 105 104 104 105 106 106 106 105 105 105 104 105 105 106 106 105 105 104 104 106 106 107 107 107 107 106 106 105 105 105 105 105 106 106 105 105 105 105 105 105 105 105 105 104 104 104 104 105 105 105 105 104 104 104 104 104 104 105 105 105 105 104 105 106 106
3428 106 106 106 106 107 106 106 106 106 106 106 107 107 107 106 106 106 106 106 106 106 106 106 106 106 106 106 106 106 105 105 105 105 105 105 105 106 106 106 106 106 106 105 105 105 105 105 105 105 105 105 105 105 105 104 104 104 104 105 105 105 105 105 104 104 104 104 104 104 105
3421A05%%%%%%J%j%%%J%%%%j%J%%%%jj%JJ%%%%%j%%Jj%%%%%%J%J%%%j%%j%%j%%J%%%J%%J%
3414A07j%%%%%%%%%%j%%j%%%%J%%%%%%%%%%j%%%%J%%%%%j%JJ%%j%%J%j%%%%%%%%%%%%J%%%
3406A06%%%%J%jj%%%%J%%%%j%%%%J%j%%j%%%%%%J%%%%%%%%%jJ%%J%%%%%%j%%%%%J%%%%jjJ
3399A05%Jj%%%%%%%%%%Jj%%%%%%%%J%%j%%%%%j%%%%%%%%J%%%%%%%%%%%%%%%%j%%%%%%J%%%
3392A05j%jJ%%%J%jJ%%%Jj%%%%J%%%%jk%JJJ%%%%j%%%Jj%%j%%%%%%%%J%%%%%j%%%%%%%JJ%
3384A06%%%j%%%%%%%%%J%%%j%%%%%%%%%J%%%j%j%J%J%%j%%%j%%J%%%%%J%j%%%%%%%%%%%jJ
3377A05j%%%J%Jj%%%%%%%%%%%%%%%%%%%%%%%%%%%%%JJ%j%%%%%%%%%%%%%%J%jJjj%%%%%%%j
3370A04%%%J%%%%%%%j%%%J%%j%Jj%J%%%%%%%%%%%J%%%%%%%%%%%%J%%jj%%Jj%%%%%%%J%%J%
$$ plain form
3421 105 105 105 105 105 105 105 106 106 105 105 105 105 106 106 106 106 106 105 105 106 106 106 106 106 105 104 104 105 106 106 106 106 106 106 105 105 105 106 105 105 105 105 105 105 105 106 106 107 107 107 107 106 106 106 105 105 105 104 104 104 105 105 105 105 106 106 106 107 107
3414 107 106 106 106 106 106 106 106 106 106 106 106 105 105 105 104 104 104 104 104 105 105 105 105 105 105 105 105 105 105 105 104 104 104 104 104 105 105 105 105 105 105 104 104 105 106 106 106 105 105 105 106 106 105 105 105 105 105 105 105 105 105 105 105 105 105 106 106 106 106
3406 106 106 106 106 106 107 107 106 105 105 105 105 105 106 106 106 106 106 105 105 105 105 105 106 106 105 105 105 104 104 104 104 104 104 104 105 105 105 105 105 105 105 105 105 105 104 105 105 105 106 106 106 106 106 106 106 105 105 105 105 105 105 106 106 106 106 106 105 104 105
3399 105 105 106 105 105 105 105 105 105 105 105 105 105 105 106 105 105 105 105 105 105 105 105 105 106 106 106 105 105 105 105 105 105 104 104 104 104 104 104 104 104 104 105 105 105 105 105 105 105 105 105 105 105 105 105 105 105 105 105 104 104 104 104 104 104 104 105 105 105 105
3392 105 104 104 103 104 104 104 104 105 105 104 105 105 105 105 106 105 105 105 105 105 106 106 106 106 106 105 103 103 104 105 106 106 106 106 106 105 105 105 105 106 105 105 105 104 104 104 104 104 104 104 104 104 105 105 105 105 105 105 104 104 104 104 104 104 104 104 105 106 106
3384 106 106 106 106 105 105 105 105 105 105 105 105 105 105 106 106 106 106 105 105 105 105 105 105 105 105 105 105 106 106 106 106 105 105 104 104 105 105 106 106 106 105 105 105 105 104 104 104 105 105 105 105 105 105 106 106 105 105 105 105 105 105 105 105 105 105 105 105 104 105
3377 105 104 104 104 104 105 105 106 105 105 105 105 105 105 105 105 105 105 105 105 105 105 105 105 105 105 105 105 105 105 105 105 105 105 105 105 105 105 106 107 107 106 106 106 106 106 106 106 106 106 106 106 106 106 106 106 107 107 106 107 106 105 105 105 105 105 105 105 105 104
3370 104 104 104 104 105 105 105 105 105 105 105 105 104 104 104 104 105 105 105 104 104 105 104 104 105 105 105 105 105 105 105 105 105 105 105 105 106 106 106 106 106 106 106 106 106 106 106 106 106 107 107 107 106 105 105 105 106 105 105 105 105 105 105 105 105 106 106 106 107 107
3363A07%%j%%%%%%%j%%%%j%%%JJ%%%j%%%%%%%%%%%j%%J%%%j%%%j%%J%%j%%%JJ%Jj%%Jj%j%
3355A04%%J%J%%%%%%jJ%%%%%j%%j%%JJj%j%J%%%J%%%Jj%j%%%JJ%j%Jjjjj%J%%%%%%%JJj%%
3348A05%%%%Jjj%Jj%%Jj%J%%%jj%J%%J%%%%%%%%jJ%%%%j%%%%%%%J%Jj%%%%%%%%%%jjJ%%%J
3341A05jjJJ%%%%%%%%j%%%%%%%%%J%%%%%%%%%%J%J%j%%%J%%jj%%%J%%%%%%%%%%%%J%%jj%%
3333A05%%%%J%%j%%%%%%%%J%%%j%Jj%J%J%jkJ%%%%%%%Jj%%%%j%%%%%%%%%J%%%%%%%%%%%%%
3326A05j%%%J%%%J%%%j%%%%%jJ%J%%%j%%%%%%%%%%J%%jk%%%J%%%%%JJ%%jJ%%%%j%%%%%J%%
3319A06%%j%j%JJJj%%%j%%j%J%%%%%%J%%%j%%%%j%%%%J%%%%Jj%%j%jJ%J%%%j%%%%%%%J%%%
3311A05%J%Jj%%jJ%%%J%%%jj%%%%%%%%%%%j%j%%%J%%%%%%%%%%%%%%j%jJJJ%%%%%%%%%%%J%
$$ plain form
3363 107 107 107 106 106 106 106 106 106 106 106 105 105 105 105 105 104 104 104 104 105 106 106 106 106 105 105 105 105 105 105 105 105 105 105 105 105 104 104 104 105 105 105 105 104 104 104 104 103 103 103 104 104 104 103 103 103 103 104 105 105 106 105 105 105 106 105 105 104 104
3355 104 104 104 105 105 106 106 106 106 106 106 106 105 106 106 106 106 106 106 105 105 105 104 104 104 105 106 105 105 104 104 105 105 105 105 106 106 106 106 107 106 106 105 105 105 105 106 107 107 106 106 107 106 105 104 103 103 104 104 104 104 104 104 104 104 105 106 105 105 105
3348 105 105 105 105 105 106 105 104 104 105 104 104 104 105 104 104 105 105 105 105 104 103 103 104 104 104 105 105 105 105 105 105 105 105 105 104 105 105 105 105 105 104 104 104 104 104 104 104 104 105 105 106 105 105 105 105 105 105 105 105 105 105 105 104 103 104 104 104 104 105
3341 105 104 103 104 105 105 105 105 105 105 105 105 105 104 104 104 104 104 104 104 104 104 104 105 105 105 105 105 105 105 105 105 105 105 106 106 107 107 106 106 106 106 107 107 107 106 105 105 105 105 106 106 106 106 106 106 106 106 106 106 106 106 106 107 107 107 106 105 105 105
3333 105 105 105 105 105 106 106 106 105 105 105 105 105 105 105 105 105 106 106 106 106 105 105 106 105 105 106 106 107 107 106 104 105 105 105 105 105 105 105 105 106 105 105 105 105 105 104 104 104 104 104 104 104 104 104 104 105 105 105 105 105 105 105 105 105 105 105 105 105 105
3326 105 104 104 104 104 105 105 105 105 106 106 106 106 105 105 105 105 105 105 104 105 105 106 106 106 106 105 105 105 105 105 105 105 105 105 105 105 106 106 106 105 103 103 103 103 104 104 104 104 104 104 105 106 106 106 105 106 106 106 106 106 105 105 105 105 105 105 106 106 106
3319 106 106 106 105 105 104 104 105 106 107 106 106 106 106 105 105 105 104 104 105 105 105 105 105 105 105 106 106 106 106 105 105 105 105 105 104 104 104 104 104 105 105 105 105 105 106 105 105 105 104 104 103 104 104 105 105 105 105 104 104 104 104 104 104 104 104 105 105 105 105
3311 105 105 106 106 107 106 106 106 105 106 106 106 106 107 107 107 107 106 105 105 105 105 105 105 105 105 105 105 105 105 104 104 103 103 103 103 104 104 104 104 104 104 104 104 104 104 104 104 104 104 104 103 103 102 103 104 105 105 105 105 105 105 105 105 105 105 105 105 106 106
3304A06%j%%j%Jj%%%J%%%j%j%%J%%%%j%%%j%%J%JJ%%j%%%%%J%j%%%%J%%jJ%%j%jJ%%j%J%%
3297A04%%%%%%%%%%Jj%%%%%%%%%%%%%%%J%%%j%%j%J%%%%jJ%J%%%%%%%%%Jj%%J%%%%jj%%jJ
3289A04%%jJ%%J%J%%%%j%%jJ%%j%%J%%%j%%%j%J%J%%jj%%J%%%%JJJj%%%%%j%%%%%%%%J%%%
3282A06%%%j%j%%%%%%%%%j%jJJ%j%%%%J%JJJ%%j%JJ%jjj%%%%j%%%JJ%%jjjJJ%%%%j%J%%%%
3275A05%%%%j%%J%%%%%jJ%%%%J%jj%%%%%%%j%jJJJ%%%%%%J%%%j%%%%jJ%%%%jj%%J%%%J%J%
3267A06%j%%j%%JJ%jjj%J%%%J%%%%%%%%Jj%%j%%J%%%%Jj%jJJ%j%%%J%j%%jJ%%Jj%%%%jJ%%
3260A05%%%J%%j%jJ%%%%%%%%%%%%%J%j%%%%j%%%J%%%%%%j%%%J%j%%%%%%J%j%%%%%Jj%%%%%
3253A04JJj%j%%%J%jJ%%%%%%%%%%%%%%%%j%%%%%%J%J%jj%J%%%%%%%J%%%%j%Jj%%%%%%%%%%
$$ plain form
3304 106 106 105 105 105 104 104 105 104 104 104 104 105 105 105 105 104 104 103 103 103 104 104 104 104 104 103 103 103 103 102 102 102 103 103 104 105 105 105 104 104 104 104 104 104 105 105 104 104 104 104 104 105 105 105 104 105 105 105 104 104 103 104 104 104 103 103 104 104 104
3297 104 104 104 104 104 104 104 104 104 104 104 105 104 104 104 104 104 104 104 104 104 104 104 104 104 104 104 104 105 105 105 105 104 104 104 103 103 104 104 104 104 104 103 104 104 105 105 105 105 105 105 105 105 105 105 106 105 105 105 106 106 106 106 106 105 104 104 104 103 104
3289 104 104 104 103 104 104 104 105 105 106 106 106 106 106 105 105 105 104 105 105 105 104 104 104 105 105 105 105 104 104 104 104 103 103 104 104 105 105 105 104 103 103 103 104 104 104 104 104 105 106 107 106 106 106 106 106 106 105 105 105 105 105 105 105 105 105 106 106 106 106
3282 106 106 106 106 105 105 104 104 104 104 104 104 104 104 104 104 103 103 102 103 104 104 103 103 103 103 103 104 104 105 106 107 107 107 106 106 107 108 108 107 106 105 105 105 105 105 104 104 104 104 105 106 106 106 105 104 103 104 105 105 105 105 105 104 104 105 105 105 105 105
3275 105 105 105 105 105 104 104 104 105 105 105 105 105 105 104 105 105 105 105 105 106 106 105 104 104 104 104 104 104 104 104 103 103 102 103 104 105 105 105 105 105 105 105 106 106 106 106 105 105 105 105 105 104 105 105 105 105 105 104 103 103 103 104 104 104 104 105 105 106 106
3267 106 106 105 105 105 104 104 104 105 106 106 105 104 103 103 104 104 104 104 105 105 105 105 105 105 105 105 105 106 105 105 105 104 104 104 105 105 105 105 105 106 105 105 104 105 106 106 105 105 105 105 106 106 105 105 105 104 105 105 105 106 105 105 105 105 105 104 105 105 105
3260 105 105 105 105 106 106 106 105 105 104 105 105 105 105 105 105 105 105 105 105 105 105 105 105 106 106 105 105 105 105 105 104 104 104 104 105 105 105 105 105 105 105 104 104 104 104 105 105 104 104 104 104 104 104 104 105 105 104 104 104 104 104 104 105 104 104 104 104 104 104
3253 104 105 106 105 105 104 104 104 104 105 105 104 105 105 105 105 105 105 105 105 105 105 105 105 105 105 105 105 105 104 104 104 104 104 104 104 105 105 106 106 105 104 104 105 105 105 105 105 105 105 105 106 106 106 106 106 105 105 106 105 105 105 105 105 105 105 105 105 105 105
3246A05%j%%%J%%%J%%j%%%%%%%%J%jJ%j%jJ%%%j%%J%%%%J%j%%%%Jjj%%%%%J%j%%J%%%j%JJ
3238A06%%jjjJJ%%jJ%%%%j%%%%%%J%%jJ%J%j%%%%%%j%%J%%%%%%j%%%%%%%%%%%%%%%%%%%J%
3231A05jJJj%%%%j%%%J%JjjJ%j%%%J%%j%%J%%%J%%%%J%j%j%%jj%JJ%j%%%%J%%%%%%j%%%JJ
3224A06jjJ%%%%J%%j%j%%%%%J%%%j%%%%%J%%j%%%%%%%%%%%J%j%%J%j%%J%%j%J%%j%%%%%%J
3216A05%%%j%%%%J%%j%Jj%%%j%%%%%%%%%%J%%%J%%%j%%%J%%j%%JjJ%%%%%%%j%JJJ%kj%%%%
3209A04%%%%J%j%%%j%%JJj%jJ%%%j%J%%%J%%J%j%%%%%%Jj%%%%%j%%%%J%%%%J%%%j%%%%%%j
3202A04%%Jj%%Jj%J%%%Jj%jjj%%J%%J%%J%%%%%Jj%j%%%jJ%%%%JJj%%J%%%j%J%jj%%%%%%J%
3194A05j%%%%%%%%%J%j%%%%%%%J%%%jjjJ%%%%%%%%%%%%%J%%J%%j%%Jj%%%%%%%%%%%%%%%%%
$$ plain form
3246 105 105 104 104 104 104 105 105 105 105 106 106 106 105 105 105 105 105 105 105 105 105 106 106 105 106 106 105 105 104 105 105 105 105 104 104 104 105 105 105 105 105 106 106 105 105 105 105 105 106 105 104 104 104 104 104 104 105 105 104 104 104 105 105 105 105 104 104 105 106
3238 106 106 106 105 104 103 104 105 105 105 104 105 105 105 105 105 104 104 104 104 104 104 104 105 105 105 104 105 105 106 106 105 105 105 105 105 105 105 104 104 104 105 105 105 105 105 105 105 104 104 104 104 104 104 104 104 104 104 104 104 104 104 104 104 104 104 104 104 105 105
3231 105 104 105 106 105 105 105 105 105 104 104 104 104 105 105 106 105 104 105 105 104 104 104 104 105 105 105 104 104 104 105 105 105 105 106 106 106 106 106 107 107 106 106 105 105 105 104 103 103 104 105 105 104 104 104 104 104 105 105 105 105 105 105 105 104 104 104 104 105 106
3224 106 105 104 105 105 105 105 105 106 106 106 105 105 104 104 104 104 104 104 105 105 105 105 104 104 104 104 104 104 105 105 105 104 104 104 104 104 104 104 104 104 104 104 104 105 105 104 104 104 105 105 104 104 104 105 105 105 104 104 105 105 105 104 104 104 104 104 104 104 105
3216 105 105 105 105 104 104 104 104 104 105 105 105 104 104 105 104 104 104 104 103 103 103 103 103 103 103 103 103 103 103 104 104 104 104 105 105 105 105 104 104 104 104 105 105 105 104 104 104 105 104 105 105 105 105 105 105 105 105 104 104 105 106 107 107 105 104 104 104 104 104
3209 104 104 104 104 104 105 105 104 104 104 104 103 103 103 104 105 104 104 103 104 104 104 104 103 103 104 104 104 104 105 105 105 106 106 105 105 105 105 105 105 105 106 105 105 105 105 105 105 104 104 104 104 104 105 105 105 105 105 106 106 106 106 105 105 105 105 105 105 105 104
3202 104 104 104 105 104 104 104 105 104 104 105 105 105 105 106 105 105 104 103 102 102 102 103 103 103 104 104 104 105 105 105 105 105 105 106 105 105 104 104 104 104 103 104 104 104 104 104 105 106 105 105 105 106 106 106 106 105 105 106 106 105 104 104 104 104 104 104 104 105 105
3194 105 104 104 104 104 104 104 104 104 104 104 105 105 104 104 104 104 104 104 104 104 105 105 105 105 104 103 102 103 103 103 103 103 103 103 103 103 103 103 103 103 103 104 104 104 105 105 105 104 104 104 105 104 104 104 104 104 104 104 104 104 104 104 104 104 104 104 104 104 104
3187A04J%%%%%%%%%jJ%%%%%j%%%%%%%%%J%%%%%J%%%%%%j%%J%%j%j%Jj%J%J%jj%J%J%%%%jj
3180A04%J%%%j%%%%%%%%%J%%%j%%%%%%%%%%%%%%%%J%%%%%%%%%j%%%%j%%%%j%JJJ%j%%j%%%
3172A03J%J%%%%j%%%%%%%%%%%%%%%%jJJjj%%%JJjj%JJ%j%%%J%%%%%%%%%%%J%%%%j%%%%%%%
3165A05J%%%jj%%%%%%j%JJ%%%%%%%Jjj%%%%%J%%%%%j%%%jJ%%%J%j%%%j%%J%J%%%j%%%%%%%
3158A04%%%%%j%%J%%J%%%j%%%%%%%%%%%%%jJ%%%j%%%%%%%J%%%j%J%j%%%J%Jj%%%J%%%%%%j
3150A04%%%%%j%J%JJJJ%j%jj%%%Jjj%%J%J%%%%j%Jj%j%%%J%%j%%%%%J%%j%%%%%JJ%%j%%%%
3143A05%%%%%%%%%%%Jjj%%%JJjj%J%%%j%%%%j%%J%%%%%jJJ%J%j%%jJ%%%%Jjj%Jj%jJ%%%%J
3136A05%%%%%%%j%%%%j%%%%%j%%%%%%KJ%%%%%%%%%%j%jJ%%%%%j%%%J%%%%%%%Jj%%j%%%%%%
$$ plain form
3187 104 105 105 105 105 105 105 105 105 105 105 104 105 105 105 105 105 105 104 104 104 104 104 104 104 104 104 104 105 105 105 105 105 105 106 106 106 106 106 106 106 105 105 105 106 106 106 105 105 104 104 105 104 104 105 105 106 106 105 104 104 105 105 106 106 106 106 106 105 104
3180 104 104 105 105 105 105 104 104 104 104 104 104 104 104 104 104 105 105 105 105 104 104 104 104 104 104 104 104 104 104 104 104 104 104 104 104 104 105 105 105 105 105 105 105 105 105 105 104 104 104 104 104 103 103 103 103 103 102 102 103 104 105 105 104 104 104 103 103 103 103
3172 103 104 104 105 105 105 105 105 104 104 104 104 104 104 104 104 104 104 104 104 104 104 104 104 104 103 104 105 104 103 103 103 103 104 105 104 103 103 104 105 105 104 104 104 104 105 105 105 105 105 105 105 105 105 105 105 105 106 106 106 106 106 105 105 105 105 105 105 105 105
3165 105 106 106 106 106 105 104 104 104 104 104 104 104 103 103 104 105 105 105 105 105 105 105 105 106 105 104 104 104 104 104 104 105 105 105 105 105 105 104 104 104 104 103 104 104 104 104 105 105 104 104 104 104 103 103 103 104 104 105 105 105 105 104 104 104 104 104 104 104 104
3158 104 104 104 104 104 104 103 103 103 104 104 104 105 105 105 105 104 104 104 104 104 104 104 104 104 104 104 104 104 104 103 104 104 104 104 103 103 103 103 103 103 103 103 104 104 104 104 103 103 104 104 103 103 103 103 104 104 105 104 104 104 104 105 105 105 105 105 105 105 104
3150 104 104 104 104 104 104 103 103 104 104 105 106 107 108 108 107 107 106 105 105 105 105 106 105 104 104 104 105 105 106 106 106 106 106 105 105 106 105 105 104 104 104 104 105 105 105 104 104 104 104 104 104 105 105 105 104 104 104 104 104 104 105 106 106 106 105 105 105 105 105
3143 105 105 105 105 105 105 105 105 105 105 105 105 106 105 104 104 104 104 105 106 105 104 104 105 105 105 105 104 104 104 104 104 103 103 103 104 104 104 104 104 104 103 104 105 105 106 106 105 105 105 104 105 105 105 105 105 106 105 104 104 105 104 104 103 104 104 104 104 104 105
3136 105 105 105 105 105 105 105 105 104 104 104 104 104 103 103 103 103 103 103 102 102 102 102 102 102 102 104 105 105 105 105 105 105 105 105 105 105 105 104 104 103 104 104 104 104 104 104 103 103 103 103 104 104 104 104 104 104 104 104 105 104 104 104 103 103 103 103 103 103 103
3129A03%%J%%%%%J%%%%j%%j%%%%%J%%%j%%%%J%%%j%%J%Jj%%%%%%%%%%%%j%%%jJ%%J%j%%%J
3121A04%%%%J%%%%%j%%%J%jjj%%JJ%%%j%%%%J%%k%%JJ%%%%%jJ%%J%j%jJ%%%%%jJ%%%%Jj%%
3114A04%%%%%%%%%J%%jj%%J%%%jJ%J%%%%%j%j%%%%%%%%%J%%%J%%j%%%%J%%%%%j%%%%%%%J%
3107A05j%%%%%%%%%%%%%J%%%%j%%%%%%%%j%J%%%%%j%%%J%jJ%%%%%%%%%j%J%%%%%%%%jj%%%
3099A02J%%%JJ%J%%%%%j%j%j%%J%J%j%jJ%%%%%%%%%%Jj%%jJ%jjJ%%Jj%%J%%%%%j%JJj%j%%
3092A03%%%%%%%%JJj%%jj%J%%J%%J%jj%%%J%Jjj%%%J%J%j%%J%%%%j%%%%%%j%%J%%%%%%J%%
3085A05%%%%%J%%%j%j%%%%%%j%Jj%J%%j%jJ%j%%%jJ%JJJJ%%jjjj%%J%%%%%J%j%%J%%%%J%%
3077A05j%%j%J%%%%j%%J%%%%%%%J%j%%%%%%%j%j%J%%J%%%%%%%%Jj%%j%%%J%%%%%%%%%%%%%
$$ plain form
3129 103 103 103 104 104 104 104 104 104 105 105 105 105 105 104 104 104 103 103 103 103 103 103 104 104 104 104 103 103 103 103 103 104 104 104 104 103 103 103 104 104 105 104 104 104 104 104 104 104 104 104 104 104 104 104 103 103 103 103 102 103 103 103 104 104 103 103 103 103 104
3121 104 104 104 104 104 105 105 105 105 105 105 104 104 104 104 105 105 104 103 102 102 102 103 104 104 104 104 103 103 103 103 103 104 104 104 102 102 102 103 104 104 104 104 104 104 103 104 104 104 105 105 104 104 103 104 104 104 104 104 104 103 104 104 104 104 104 105 104 104 104
3114 104 104 104 104 104 104 104 104 104 104 105 105 105 104 103 103 103 104 104 104 104 103 104 104 105 105 105 105 105 105 104 104 103 103 103 103 103 103 103 103 103 103 104 104 104 104 105 105 105 104 104 104 104 104 105 105 105 105 105 105 104 104 104 104 104 104 104 104 105 105
3107 105 104 104 104 104 104 104 104 104 104 104 104 104 104 104 105 105 105 105 105 104 104 104 104 104 104 104 104 104 103 103 104 104 104 104 104 104 103 103 103 103 104 104 103 104 104 104 104 104 104 104 104 104 104 103 103 104 104 104 104 104 104 104 104 104 103 102 102 102 102
3099 102 103 103 103 103 104 105 105 106 106 106 106 106 106 105 105 104 104 103 103 103 104 104 105 105 104 104 103 104 104 104 104 104 104 104 104 104 104 104 105 104 104 104 103 104 104 103 102 103 103 103 104 103 103 103 104 104 104 104 104 104 103 103 104 105 104 104 103 103 103
3092 103 103 103 103 103 103 103 103 103 104 105 104 104 104 103 102 102 103 103 103 104 104 104 105 105 104 103 103 103 103 104 104 105 104 103 103 103 103 104 104 105 105 104 104 104 105 105 105 105 105 104 104 104 104 104 104 104 103 103 103 104 104 104 104 104 104 104 105 105 105
3085 105 105 105 105 105 105 106 106 106 106 105 105 104 104 104 104 104 104 104 103 103 104 103 103 104 104 104 103 103 102 103 103 102 102 102 102 101 102 102 103 104 105 106 106 106 105 104 103 102 102 102 103 103 103 103 103 103 104 104 103 103 103 104 104 104 104 104 105 105 105
3077 105 104 104 104 103 103 104 104 104 104 104 103 103 103 104 104 104 104 104 104 104 104 105 105 104 104 104 104 104 104 104 104 103 103 102 102 103 103 103 104 104 104 104 104 104 104 104 104 105 104 104 104 103 103 103 103 104 104 104 104 104 104 104 104 104 104 104 104 104 104
3070A04%%%%%%%%%%%%%%j%jJJj%%%JJj%%%%%%j%%%%%%%%%%%J%%%j%JJ%%j%%%%j%%J%%j%JJ
3063A05j%%j%%%J%%%%%%%%%%%%%%j%%%%%%%%%%%J%j%%%%%%%%%%J%%%%%j%%%J%jJJj%jj%%%
3055A02%%%jJ%J%J%%%%j%%%%%%%%%%%%%%J%%%J%j%%%%%%%%%%%%j%%%J%%%%%%%%%%j%%%%%%
3048A03%J%%j%jJJ%%%%%J%%j%%%%%j%%%%%J%%%%%%%%%%%%j%%J%%%j%%%JJ%%%%jj%%JJjJ%%
3041A05%%%%%J%%j%%%%%jJj%%%J%%%%%j%j%j%%J%%J%%J%j%j%J%J%%%%j%%j%j%JJj%%jJ%%j
3034A02%%J%j%%J%J%%%%%%%jJ%%%%%%%%%%%%j%%J%%%%%%Jj%%j%%J%J%%jj%%Jj%%%%%Jj%j%
3026A02Jj%%J%J%Jj%%J%%j%j%%%%%%jJ%%%%%%%%J%%%%%%%%%%J%jj%jJ%%jJ%%%%%%%%%%%j%
3019A02%%%%jJJJ%%%J%%%j%j%%%J%%j%jJ%%jJ%%%%%%%J%%%j%%%%%j%%J%%%%j%%%J%%%%%%J
$$ plain form
3070 104 104 104 104 104 104 104 104 104 104 104 104 104 104 104 103 103 102 103 104 103 103 103 103 104 105 104 104 104 104 104 104 104 103 103 103 103 103 103 103 103 103 103 103 103 104 104 104 104 103 103 104 105 105 105 104 104 104 104 104 103 103 103 104 104 104 103 103 104 105
3063 105 104 104 104 103 103 103 103 104 104 104 104 104 104 104 104 104 104 104 104 104 104 104 103 103 103 103 103 103 103 103 103 103 103 103 104 104 103 103 103 103 103 103 103 103 103 103 103 104 104 104 104 104 104 103 103 103 103 104 104 103 104 105 104 104 103 102 102 102 102
3055 102 102 102 102 101 102 102 103 103 104 104 104 104 104 103 103 103 103 103 103 103 103 103 103 103 103 103 103 103 104 104 104 104 105 105 104 104 104 104 104 104 104 104 104 104 104 104 104 103 103 103 103 104 104 104 104 104 104 104 104 104 104 104 103 103 103 103 103 103 103
3048 103 103 104 104 104 103 103 102 103 104 104 104 104 104 104 105 105 105 104 104 104 104 104 104 103 103 103 103 103 103 104 104 104 104 104 104 104 104 104 104 104 104 104 103 103 103 104 104 104 104 103 103 103 103 104 105 105 105 105 105 104 103 103 103 104 105 104 105 105 105
3041 105 105 105 105 105 105 106 106 106 105 105 105 105 105 105 104 105 104 104 104 104 105 105 105 105 105 105 104 104 103 103 102 102 102 103 103 103 104 104 104 105 105 104 104 103 103 104 104 105 105 105 105 105 104 104 104 103 103 102 102 103 104 103 103 103 102 103 103 103 102
3034 102 102 102 103 103 102 102 102 103 103 104 104 104 104 104 104 104 104 103 104 104 104 104 104 104 104 104 104 104 104 104 104 103 103 103 104 104 104 104 104 104 104 105 104 104 104 103 103 103 104 104 105 105 105 104 103 103 103 104 103 103 103 103 103 103 104 103 103 102 102
3026 102 103 102 102 102 103 103 104 104 105 104 104 104 105 105 105 104 104 103 103 103 103 103 103 103 102 103 103 103 103 103 103 103 103 103 104 104 104 104 104 104 104 104 104 104 104 105 105 104 103 103 102 103 103 103 102 103 103 103 103 103 103 103 103 103 103 103 103 102 102
3019 102 102 102 102 102 101 102 103 104 104 104 104 105 105 105 105 104 104 103 103 103 103 104 104 104 103 103 102 103 103 103 102 103 103 103 103 103 103 103 103 104 104 104 104 103 103 103 103 103 103 102 102 102 103 103 103 103 103 102 102 102 102 103 103 103 103 103 103 103 104
3012A04%%%%Jjj%%%j%%%%J%%%%%jJ%%J%%%%%%j%j%J%%%%j%J%%%J%%Jj%j%%Jj%%%%J%%%%%j
3004A03J%J%jjJ%jJ%%%%j%%%J%j%%%J%J%j%%%%%jjJ%%%%J%%%%%%%%J%%%%%jjj%%%J%%%j%J
2997A03%j%%%J%J%%jj%J%%%%jJ%%%%%%%%%%%%Jj%%%%%j%J%%%j%J%J%%%%%%%j%%%%%%%j%%J
2990A03J%%%j%%J%j%%%%J%%j%J%%%%%%j%%JJ%%%%%%%%%j%%j%%%%%%j%J%J%%%j%%%J%%%%%j
2982A03%j%J%%%%%%%J%jJ%%%%%%%%%%%%%%%Jj%%%j%%%%J%%j%%%%J%%J%jj%%j%%%J%%%%%%%
2975A03j%%%J%%%%%%J%%%%j%%j%J%%J%%%%%%j%j%%j%%J%%J%%J%%%%%%j%%%%%j%%J%Jj%%%%
2968A03j%JJ%j%%%%%%%J%%j%j%%%%%J%%%J%%%%j%%%%%%j%%%%%J%%j%%JJ%j%j%%jJ%J%J%%%
2960A04%%%j%%%%%j%%%%%%jJJJ%%%J%%J%%jj%j%J%%%j%%j%J%%%%J%%jj%%%J%J%%%J%%j%%%
$$ plain form
3012 104 104 104 104 104 105 104 103 103 103 103 102 102 102 102 102 103 103 103 103 103 103 102 103 103 103 104 104 104 104 104 104 104 103 103 102 102 103 103 103 103 103 102 102 103 103 103 103 104 104 104 105 104 104 103 103 103 104 103 103 103 103 103 104 104 104 104 104 104 103
3004 103 104 104 105 105 104 103 104 104 103 104 104 104 104 104 103 103 103 103 104 104 103 103 103 103 104 104 105 105 104 104 104 104 104 104 103 102 103 103 103 103 103 104 104 104 104 104 104 104 104 104 105 105 105 105 105 105 104 103 102 102 102 102 103 103 103 103 102 102 103
2997 103 103 102 102 102 102 103 103 104 104 104 103 102 102 103 103 103 103 103 102 103 103 103 103 103 103 103 103 103 103 103 103 103 104 103 103 103 103 103 103 102 102 103 103 103 103 102 102 103 103 104 104 104 104 104 104 104 104 103 103 103 103 103 103 103 103 102 102 102 103
2990 103 104 104 104 104 103 103 103 104 104 103 103 103 103 103 104 104 104 103 103 104 104 104 104 104 104 104 103 103 103 104 105 105 105 105 105 105 105 105 105 105 104 104 104 103 103 103 103 103 103 103 102 102 103 103 104 104 104 104 103 103 103 103 104 104 104 104 104 104 103
2982 103 103 102 102 103 103 103 103 103 103 103 103 104 104 103 104 104 104 104 104 104 104 104 104 104 104 104 104 104 104 104 105 104 104 104 104 103 103 103 103 103 104 104 104 103 103 103 103 103 104 104 104 105 105 104 103 103 103 102 102 102 102 103 103 103 103 103 103 103 103
2975 103 102 102 102 102 103 103 103 103 103 103 103 104 104 104 104 104 103 103 103 102 102 103 103 103 104 104 104 104 104 104 104 103 103 102 102 102 101 101 101 102 102 102 103 103 103 104 104 104 104 104 104 104 103 103 103 103 103 103 102 102 102 103 103 104 103 103 103 103 103
2968 103 102 102 103 104 104 103 103 103 103 103 103 103 103 104 104 104 103 103 102 102 102 102 102 102 103 103 103 103 104 104 104 104 104 103 103 103 103 103 103 103 102 102 102 102 102 102 103 103 103 102 102 102 103 104 104 103 103 102 102 102 101 102 102 103 103 104 104 104 104
2960 104 104 104 104 103 103 103 103 103 103 102 102 102 102 102 102 102 101 102 103 104 104 104 104 105 105 105 106 106 106 105 104 104 103 103 104 104 104 104 103 103 103 102 102 103 103 103 103 103 104 104 104 103 102 102 102 102 103 103 104 104 104 104 105 105 105 104 104 104 104
2953A04jJ%%%%%%j%%J%J%%jj%%%%%%J%j%%j%%%J%%J%%%j%j%%%%%J%%%%%%Jj%%%%%%%J%%%%
2946A04%%j%J%%%%%%%%%%%%J%jjJ%%jj%J%J%%%%%%%%jjJJ%j%%jj%J%%j%%jJ%%J%J%%%%j%%
2938A02%JJ%Jj%%j%%%%j%%%JJj%%J%jj%%%%J%jJJJ%jjJ%%%%jJ%%%%%%%jJ%%%%Kjjj%J%%%%
2931A04%%%%%%%%%j%j%%J%JJ%%jj%J%Jj%jJ%%%j%%J%%j%%Jj%%j%%%%%%J%%Jjjj%%%J%%%%%
2924A02j%j%j%JJJ%%%j%J%%%jj%%JJJ%%j%jJj%%%%%%%%%%%Jj%J%%%%%J%jJ%%%%%%%%%%%%%
2917A03J%%%J%j%J%J%%%j%%jJ%j%%%%%%%%j%J%%j%%%j%%K%%%%%%%J%%jj%J%%%%%jJ%%%%%J
2909A05%j%jJ%j%%%%%Jj%J%%%%%%j%j%%%%J%%%%%%%%%%%%%J%j%jJ%J%%jjjJ%Jj%J%J%j%%%
2902A03%%J%j%%J%j%%j%%%%%j%%JjJ%J%%Jj%%%%%%%%%%%%%%%JJ%jjJ%j%%%%%J%jJ%%j%%%%
$$ plain form
2953 104 103 104 104 104 104 104 104 104 103 103 103 104 104 105 105 105 104 103 103 103 103 103 103 103 104 104 103 103 103 102 102 102 102 103 103 103 104 104 104 104 103 103 102 102 102 102 102 102 103 103 103 103 103 103 103 104 103 103 103 103 103 103 103 103 104 104 104 104 104
2946 104 104 104 103 103 104 104 104 104 104 104 104 104 104 104 104 104 104 105 105 104 103 104 104 104 103 102 102 103 103 104 104 104 104 104 104 104 104 104 103 102 103 104 104 103 103 103 102 101 101 102 102 102 101 101 101 100 101 101 101 102 102 103 103 103 103 103 102 102 102
2938 102 102 103 104 104 105 104 104 104 103 103 103 103 103 102 102 102 102 103 104 103 103 103 104 104 103 102 102 102 102 102 103 103 102 103 104 105 105 104 103 104 104 104 104 104 103 104 104 104 104 104 104 104 104 103 104 104 104 104 104 106 105 104 103 103 104 104 104 104 104
2931 104 104 104 104 104 104 104 104 104 104 103 103 102 102 102 103 103 104 105 105 105 104 103 103 104 104 105 104 104 103 104 104 104 104 103 103 103 104 104 104 103 103 103 104 103 103 103 102 102 102 102 102 102 102 103 103 103 104 103 102 101 101 101 101 102 102 102 102 102 102
2924 102 101 101 100 100 99 99 100 101 102 102 102 102 101 101 102 102 102 102 101 100 100 100 101 102 103 103 103 102 102 101 102 101 101 101 101 101 101 101 101 101 101 101 101 102 101 101 102 102 102 102 102 102 103 103 102 103 103 103 103 103 103 103 103 103 103 103 103 103 103
2917 103 104 104 104 104 105 105 104 104 105 105 106 106 106 106 105 105 105 104 105 105 104 104 104 104 104 104 104 104 104 103 103 104 104 104 103 103 103 103 102 102 102 104 104 104 104 104 104 104 104 105 105 105 104 103 103 104 104 104 104 104 104 103 104 104 104 104 104 104 105
2909 105 105 104 104 103 104 104 103 103 103 103 103 103 104 103 103 104 104 104 104 104 104 104 103 103 102 102 102 102 102 103 103 103 103 103 103 103 103 103 103 103 103 103 103 104 104 103 103 102 103 103 104 104 104 103 102 101 102 102 103 102 102 103 103 104 104 103 103 103 103
2902 103 103 103 104 104 103 103 103 104 104 103 103 103 102 102 102 102 102 102 101 101 101 102 101 102 102 103 103 103 104 103 103 103 103 103 103 103 103 103 103 103 103 103 103 103 103 104 105 105 104 103 104 104 103 103 103 103 103 103 104 104 103 104 104 104 103 103 103 103 103
2895A03%%%%%%%%%%%%jJ%J%j%%%%J%%J%%%j%j%%%%%j%JJ%J%j%j%JjjJ%J%%%%%j%%%j%%J%%
2887A03%%%J%%%%%%J%%%%%%%jjj%J%%J%%j%%jJ%%J%%%%%%%%%%%%J%%jj%%%%%%J%%%JJ%j%%
2880A05jj%%j%%%%%J%%%%%%%%%%%%%j%J%%J%%%%%%%%%j%J%%%%jJ%%j%%%Jj%%J%%%%%%%j%%
2873A03%%%%%%j%J%J%%J%j%%%j%%%jJ%J%%%%%%%%%%j%%JJ%J%j%%j%%j%%%%%j%%%JJ%%%j%%
2865A03j%%j%%J%J%%%%j%%jJ%%%J%%j%%%J%%J%%%j%%j%%%%%K%j%%J%%j%%%%%%%%J%%%j%%%
2858A03%j%%%%%%%%J%%%%%J%%%%%j%J%%%%%j%j%%%jJ%%%%%%%%%%%%J%j%%J%%%j%%%%J%%j%
2851A02%%%%%%J%%%j%%%%%j%J%%%%%jJ%J%J%j%%%%%%%%j%%%%%%J%%j%%%J%%%%%%%Jj%%%%%
2843A03Jjj%%%J%%%j%%%J%%%%j%%JJ%j%%j%%%%%J%%j%JJ%%%jjJ%%%%jJ%%%j%%J%%%%%j%J%
$$ plain form
2895 103 103 103 103 103 103 103 103 103 103 103 103 103 102 103 103 104 104 103 103 103 103 103 104 104 104 105 105 105 105 104 104 103 103 103 103 103 103 102 102 103 104 104 105 105 104 104 103 103 104 103 102 103 103 104 104 104 104 104 104 103 103 103 103 102 102 102 103 103 103
2887 103 103 103 103 104 104 104 104 104 104 104 105 105 105 105 105 105 105 105 104 103 102 102 103 103 103 104 104 104 103 103 103 102 103 103 103 104 104 104 104 104 104 104 104 104 104 104 104 104 105 105 105 104 103 103 103 103 103 103 103 104 104 104 104 105 106 106 105 105 105
2880 105 104 103 103 103 102 102 102 102 102 102 103 103 103 103 103 103 103 103 103 103 103 103 103 103 102 102 103 103 103 104 104 104 104 104 104 104 104 104 104 103 103 104 104 104 104 104 103 104 104 104 103 103 103 103 104 103 103 103 104 104 104 104 104 104 104 104 103 103 103
2873 103 103 103 103 103 103 103 102 102 103 103 104 104 104 105 105 104 104 104 104 103 103 103 103 102 103 103 104 104 104 104 104 104 104 104 104 104 104 103 103 103 104 105 105 106 106 105 105 105 104 104 104 103 103 103 103 103 103 102 102 102 102 103 104 104 104 104 103 103 103
2865 103 102 102 102 101 101 101 102 102 103 103 103 103 103 102 102 102 101 102 102 102 102 103 103 103 102 102 102 102 103 103 103 104 104 104 104 103 103 103 102 102 102 102 102 102 104 104 103 103 103 104 104 104 103 103 103 103 103 103 103 103 103 104 104 104 104 103 103 103 103
2858 103 103 102 102 102 102 102 102 102 102 102 103 103 103 103 103 103 104 104 104 104 104 104 103 103 104 104 104 104 104 104 103 103 102 102 102 102 101 102 102 102 102 102 102 102 102 102 102 102 102 102 103 103 102 102 102 103 103 103 103 102 102 102 102 102 103 103 103 102 102
2851 102 102 102 102 102 102 102 103 103 103 103 102 102 102 102 102 102 101 101 102 102 102 102 102 102 101 102 102 103 103 104 104 103 103 103 103 103 103 103 103 103 102 102 102 102 102 102 102 103 103 103 102 102 102 102 103 103 103 103 103 103 103 103 104 103 103 103 103 103 103
2843 103 104 103 102 102 102 102 103 103 103 103 102 102 102 102 103 103 103 103 103 102 102 102 103 104 104 103 103 103 102 102 102 102 102 102 103 103 103 102 102 103 104 104 104 104 103 102 103 103 103 103 103 102 103 103 103 103 102 102 102 103 103 103 103 103 103 102 102 103 103
2836A03%j%%%%%%%J%%%%%%j%%%%%%%%%%%%J%%J%J%%%%j%%j%%%%%J%%%jj%JJ%%j%jJ%%%%%%
2829A03%%%J%J%%%%%%j%%j%%%J%%%%%J%j%%J%J%%%%%%%j%JJ%JJ%%%JJJ%J%%%J%JJ%%%%j%j
2821A14%j%jj%%jjjjj%J%%%%%%%%j%%%%J%J%JJj%%J%J%J%KK%JKJJJJJJKKJKJJJ%%jkjjjjk
2814A26jkjjjjjkjjjjj%%j%j%j%%J%%jJJ%%%JJ%%%%J%J%%J%JJLJJJKJKKJKJJ%%%jjjkkjkj
2807A24jlkjjjjjjj%jjjj%JJ%%%%j%%%j%%%J%jJ%J%jj%J%%%%JJJJ%J%%%%%%J%%jjjjj%j%j
2800A07j%%%J%Jj%%%j%%%j%%%jj%%%%%j%%J%j%jJ%%J%%%Jj%%%%J%jj%JJ%%%j%Jj%%%%Jj%%
2792A03%%%%j%J%%%%%Jj%jJ%%%%%j%%%J%%J%%j%j%j%J%j%J%J%j%j%jJ%J%%%%j%jJ%%%J%J%
2785A03Jj%%%j%%%%j%J%%%%%%%%%%%%%%%%%%%%J%%%J%%%%j%j%%%%jJ%%%%%%j%J%%%%j%%%%
$$ plain form
2836 103 103 102 102 102 102 102 102 102 102 103 103 103 103 103 103 103 102 102 102 102 102 102 102 102 102 102 102 102 102 103 103 103 104 104 105 105 105 105 105 104 104 104 103 103 103 103 103 103 104 104 104 104 103 102 102 103 104 104 104 103 103 102 103 103 103 103 103 103 103
2829 103 103 103 103 104 104 105 105 105 105 105 105 105 104 104 104 103 103 103 103 104 104 104 104 104 104 105 105 104 104 104 105 105 106 106 106 106 106 106 106 106 105 105 106 107 107 108 109 109 109 109 110 111 112 112 113 113 113 113 114 114 115 116 116 116 116 116 115 115 114
2821 114 114 113 113 112 111 111 111 110 109 108 107 106 106 107 107 107 107 107 107 107 107 107 106 106 106 106 106 107 107 108 108 109 110 109 109 109 110 110 111 111 112 112 114 116 116 117 119 120 121 122 123 124 125 127 129 130 132 133 134 135 135 135 134 132 131 130 129 128 126
2814 126 125 123 122 121 120 119 118 116 115 114 113 112 111 111 111 110 110 109 109 108 108 108 109 109 109 108 109 110 110 110 110 111 112 112 112 112 112 113 113 114 114 114 115 115 116 117 120 121 122 123 125 126 128 130 131 133 134 135 135 135 135 134 133 132 130 128 127 125 124
2807 124 123 120 118 117 116 115 114 113 112 111 111 110 109 108 107 107 108 109 109 109 109 109 108 108 108 108 107 107 107 107 108 108 107 108 108 109 109 108 107 107 108 108 108 108 108 109 110 111 112 112 113 113 113 113 113 113 113 114 114 114 113 112 111 110 109 109 108 108 107
2800 107 106 106 106 106 107 107 108 107 107 107 107 106 106 106 106 105 105 105 105 104 103 103 103 103 103 103 102 102 102 103 103 102 102 101 102 102 102 103 103 103 103 104 103 103 103 103 103 104 104 103 102 102 103 104 104 104 104 103 103 104 103 103 103 103 103 104 103 103 103
2792 103 103 103 103 103 102 102 103 103 103 103 103 103 104 103 103 102 103 103 103 103 103 103 102 102 102 102 103 103 103 104 104 104 103 103 102 102 101 101 102 102 101 101 102 102 103 103 102 102 101 101 100 101 101 102 102 102 102 102 101 101 100 101 101 101 101 102 102 103 103
2785 103 104 103 103 103 103 102 102 102 102 102 101 101 102 102 102 102 102 102 102 102 102 102 102 102 102 102 102 102 102 102 102 102 102 103 103 103 103 104 104 104 104 104 103 103 102 102 102 102 102 101 102 102 102 102 102 102 102 101 101 102 102 102 102 102 101 101 101 101 101
2778A01%JJ%%%j%%%J%%%%%j%jJ%J%%%%j%%%J%%%%%%%%%%%j%%%%J%%%%J%%%%%%%%%j%%%%%%
2770A03%%%%%%%%%%j%JJj%jj%JJ%%jj%J%%%%%J%%%j%JJJ%j%%j%%%j%%%%%%%%J%J%j%%%j%%
2763A02j%J%%%%%%%%%%%%%%J%%%jJJ%%%%%j%%%%%%%%j%%%%%%%%%%%%%%%%Jj%J%%%%j%%%%j
2756A01%%J%%%%%%%%J%%%%%%%%J%%%%%j%%%%%%%%%J%%%%%j%%j%%jJ%%%J%%%j%%%jJ%J%%Jj
2748A03%j%%%%J%%%%%%%%%%%jj%J%%j%%%%J%J%%j%%%%jjJ%J%jJ%J%%J%jj%%J%%%%%%jJj%%
2741A02%%J%%J%%j%jJ%%j%%%%%j%J%%J%%%jJ%%%J%%j%jj%%jJJ%j%%%%J%%%%%%J%%%%%jJ%%
2734A03%j%%%%%%J%%%j%%%J%%j%J%%%%%%%%j%%J%%%%%%%%%%%%%%%%%j%%%%j%%J%%%%%J%%%
2726A03Jj%%%%%%j%%j%jJ%%J%JJ%jj%%J%jj%JJ%%j%%J%%%J%k%%%%%%%%%%%%%%j%J%%j%%j%
$$ plain form
2778 101 101 102 103 103 103 103 102 102 102 102 103 103 103 103 103 103 102 102 101 102 102 103 103 103 103 103 102 102 102 102 103 103 103 103 103 103 103 103 103 103 103 103 102 102 102 102 102 103 103 103 103 103 104 104 104 104 104 104 104 104 104 104 103 103 103 103 103 103 103
2770 103 103 103 103 103 103 103 103 103 103 103 102 102 103 104 103 103 102 101 101 102 103 103 103 102 101 101 102 102 102 102 102 102 103 103 103 103 102 102 103 104 105 105 104 104 104 103 103 103 103 102 102 102 102 102 102 102 102 102 103 103 104 104 103 103 103 103 102 102 102
2763 102 101 101 102 102 102 102 102 102 102 102 102 102 102 102 102 102 102 103 103 103 103 102 103 104 104 104 104 104 104 103 103 103 103 103 103 103 103 103 102 102 102 102 102 102 102 102 102 102 102 102 102 102 102 102 102 103 102 102 103 103 103 103 103 102 102 102 102 102 101
2756 101 101 101 102 102 102 102 102 102 102 102 102 103 103 103 103 103 103 103 103 103 104 104 104 104 104 104 103 103 103 103 103 103 103 103 103 103 104 104 104 104 104 104 103 103 103 102 102 102 101 102 102 102 102 103 103 103 103 102 102 102 102 101 102 102 103 103 103 104 103
2748 103 103 102 102 102 102 102 103 103 103 103 103 103 103 103 103 103 103 103 102 101 101 102 102 102 101 101 101 101 101 102 102 103 103 103 102 102 102 102 102 101 100 101 101 102 102 101 102 102 103 103 103 104 104 103 102 102 102 103 103 103 103 103 103 103 102 103 102 102 102
2741 102 102 102 103 103 103 104 104 104 103 103 102 103 103 103 102 102 102 102 102 102 101 101 102 102 102 103 103 103 103 102 103 103 103 103 104 104 104 103 103 102 101 101 101 100 101 102 102 101 101 101 101 101 102 102 102 102 102 102 102 103 103 103 103 103 103 102 103 103 103
2734 103 103 102 102 102 102 102 102 102 103 103 103 103 102 102 102 102 103 103 103 102 102 103 103 103 103 103 103 103 103 103 102 102 102 103 103 103 103 103 103 103 103 103 103 103 103 103 103 103 103 103 103 102 102 102 102 102 101 101 101 102 102 102 102 102 102 103 103 103 103
2726 103 104 103 103 103 103 103 103 103 102 102 102 101 101 100 101 101 101 102 102 103 104 104 103 102 102 102 103 103 102 101 101 102 103 103 103 102 102 102 103 103 103 103 104 104 102 102 102 102 102 102 102 102 102 102 102 102 102 102 102 101 101 102 102 102 101 101 101 100 100
2719A00J%J%%%%%J%%jj%%%J%%%%%%%%%%%%%%%%%%%%%%%%%%%%%%jJ%j%J%%%%%%%j%%%%%J%%
2712A02%%%j%%j%J%J%j%JJ%%j%%%%JJJ%jj%%%%%%%%%%jJ%J%%jjJ%%j%%%J%%jJ%%%%%%%%%%
2704A03jjJ%J%%jj%J%%%%%%%%%%%%%j%%%jJ%%JJ%j%%Jj%%%%Jj%%%%J%%%Jj%jJ%Jjj%Jj%%%
2697A02%%%%%j%%%%%J%%%j%jJ%%jJJJ%%%j%%jJ%%%%jJ%%j%%%%%%%%%%%J%jJ%%Jj%%%%%%%j
2690A01%%%J%%jj%J%J%%%J%%%%%j%%%%%%%jJ%jJJ%%%%j%%%jJ%%%%%%j%j%%J%J%%%%%%%j%%
2683A01%%%J%%%%jJ%%%%JJ%%%j%%jj%%J%%%j%J%%JjjjJ%J%%%%%%%%%%%%%JJ%j%J%%%%jJ%%
2675A04%%jjJ%%%%j%%%%jJJ%%%%%%%%%%%%%%%%%%%%%%%j%%%%%jJ%%%%%J%J%%%j%%%%jJ%j%
2668A02%J%%%%Jj%%%%j%%%%j%%J%J%%%%j%Jj%jJ%%%%J%%%j%%%%j%J%%%%J%%%%%%%%J%j%%%
$$ plain form
2719 100 101 101 102 102 102 102 102 102 103 103 103 102 101 101 101 101 102 102 102 102 102 102 102 102 102 102 102 102 102 102 102 102 102 102 102 102 102 102 102 102 102 102 102 102 102 102 102 101 102 102 101 101 102 102 102 102 102 102 102 102 101 101 101 101 101 101 102 102 102
2712 102 102 102 102 101 101 101 100 100 101 101 102 102 101 101 102 103 103 103 102 102 102 102 102 103 104 105 105 104 103 103 103 103 103 103 103 103 103 103 103 102 103 103 104 104 104 103 102 103 103 103 102 102 102 102 103 103 103 102 103 103 103 103 103 103 103 103 103 103 103
2704 103 102 101 102 102 103 103 103 102 101 101 102 102 102 102 102 102 102 102 102 102 102 102 102 102 101 101 101 101 100 101 101 101 102 103 103 102 102 102 103 102 102 102 102 102 103 102 102 102 102 102 103 103 103 103 104 103 103 102 103 103 104 103 102 102 103 102 102 102 102
2697 102 102 102 102 102 102 101 101 101 101 101 101 102 102 102 102 101 101 100 101 101 101 100 101 102 103 103 103 103 102 102 102 101 102 102 102 102 102 101 102 102 102 101 101 101 101 101 101 101 101 101 101 101 101 102 102 101 102 102 102 103 102 102 102 102 102 102 102 102 101
2690 101 101 101 101 102 102 102 101 100 100 101 101 102 102 102 102 103 103 103 103 103 103 102 102 102 102 102 102 102 102 101 102 102 101 102 103 103 103 103 103 102 102 102 102 101 102 102 102 102 102 102 102 101 101 100 100 100 101 101 102 102 102 102 102 102 102 102 101 101 101
2683 101 101 101 101 102 102 102 102 102 101 102 102 102 102 102 103 104 104 104 104 103 103 103 102 101 101 101 102 102 102 102 101 101 102 102 102 103 102 101 100 101 101 102 102 102 102 102 102 102 102 102 102 102 102 102 102 103 104 104 103 103 104 104 104 104 104 103 104 104 104
2675 104 104 104 103 102 103 103 103 103 103 102 102 102 102 102 101 102 103 103 103 103 103 103 103 103 103 103 103 103 103 103 103 103 103 103 103 103 103 103 103 103 102 102 102 102 102 102 101 102 102 102 102 102 102 103 103 104 104 104 104 103 103 103 103 103 102 103 103 102 102
2668 102 102 103 103 103 103 103 104 103 103 103 103 103 102 102 102 102 102 101 101 101 102 102 103 103 103 103 103 102 102 103 102 102 101 102 102 102 102 102 103 103 103 103 102 102 102 102 102 101 101 102 102 102 102 102 103 103 103 103 103 103 103 103 103 104 104 103 103 103 103
2661A03%J%%Jj%j%J%J%%j%%%%%%%%%Jj%%%%%%jJ%%J%j%%%%%%%%%%%%J%%%%%%jJJJ%%%%j%%
2653A06%j%%%J%%%%J%%j%%%J%%j%%J%%%jJ%%J%%JJjj%Jjj%%%%jJ%j%J%%%j%%%%%%j%%%%%%
2646A05%%%J%jj%JJ%%J%jj%j%j%%%j%JjJ%jJ%J%%%%j%%%%%%J%j%%%%%%%%%%J%%%Jj%%%%J%
2639A05%jj%j%%J%%%%%%%%J%%%%Jjj%%j%%%jj%%JJJj%%%%%%%JJ%jj%J%%j%J%%j%%%%%J%%J
2631A04j%j%%j%%JJ%%%j%%jJ%Jj%%J%%%%%%%j%%%%%jjJ%%%%%%%J%J%%%J%j%%%J%%%j%jj%J
2624A02%%%%%%%J%j%%%%%%%J%%jJ%JJ%jj%%j%%j%%%J%%%%%%%jJ%%%%jJ%%%J%%%%%j%jJJ%j
2617A02%%JJ%jjJ%%%j%%%J%%%j%%J%%%%J%%%%%jjj%%%%J%%%%%Jjj%%%%J%J%%%%%%%jJ%%%%
2609A03%%%%J%%%%jj%%%%%%j%%%%J%%j%%JJ%%%%%%j%%jJJj%%%j%%J%J%%jj%%%%%JJ%%j%%%
$$ plain form
2661 103 103 104 104 104 105 104 104 103 103 104 104 105 105 105 104 104 104 104 104 104 104 104 104 104 105 104 104 104 104 104 104 104 103 104 104 104 105 105 104 104 104 104 104 104 104 104 104 104 104 104 104 105 105 105 105 105 105 105 104 105 106 107 107 107 107 107 106 106 106
2653 106 106 105 105 105 105 106 106 106 106 106 107 107 107 106 106 106 106 107 107 107 106 106 106 107 107 107 107 106 107 107 107 108 108 108 109 110 109 108 108 109 108 107 107 107 107 107 106 107 107 106 106 107 107 107 107 106 106 106 106 106 106 106 105 105 105 105 105 105 105
2646 105 105 105 105 106 106 105 104 104 105 106 106 106 107 107 106 105 105 104 104 103 103 103 103 102 102 103 102 103 103 102 103 103 104 104 104 104 104 103 103 103 103 103 103 103 104 104 103 103 103 103 103 103 103 103 103 103 103 104 104 104 104 105 104 104 104 104 104 105 105
2639 105 105 104 103 103 102 102 102 103 103 103 103 103 103 103 103 103 104 104 104 104 104 105 104 103 103 103 102 102 102 102 101 100 100 100 101 102 103 102 102 102 102 102 102 102 102 103 104 104 103 102 102 103 103 103 102 102 103 103 103 102 102 102 102 102 102 103 103 103 104
2631 104 103 103 102 102 102 101 101 101 102 103 103 103 103 102 102 102 101 102 102 103 102 102 102 103 103 103 103 103 103 103 103 102 102 102 102 102 102 101 100 101 101 101 101 101 101 101 101 102 102 103 103 103 103 104 104 103 103 103 103 104 104 104 104 103 103 102 101 101 102
2624 102 102 102 102 102 102 102 102 103 103 102 102 102 102 102 102 102 102 103 103 103 102 103 103 104 105 105 104 103 103 103 102 102 102 101 101 101 101 102 102 102 102 102 102 102 102 101 102 102 102 102 102 101 102 102 102 102 103 103 103 103 103 103 102 102 101 102 103 103 102
2617 102 102 102 103 104 104 103 102 103 103 103 103 102 102 102 102 103 103 103 103 102 102 102 103 103 103 103 103 104 104 104 104 104 104 103 102 101 101 101 101 101 102 102 102 102 102 102 103 102 101 101 101 101 101 102 102 103 103 103 103 103 103 103 103 102 103 103 103 103 103
2609 103 103 103 103 103 104 104 104 104 104 103 102 102 102 102 102 102 102 101 101 101 101 101 102 102 102 101 101 101 102 103 103 103 103 103 103 103 102 102 102 101 102 103 102 102 102 102 101 101 101 102 102 103 103 103 102 101 101 101 101 101 101 102 103 103 103 102 102 102 102
2602A02J%jj%%%%%%J%%%%%%%j%%J%%%%%%%%%%j%%JJ%%j%%%%%j%%%J%J%Jj%%%j%%%%%j%J%%
2595A02J%%jJ%%%j%J%%%%%j%J%%%%jj%%J%%%%%%%%%%%%%%%j%%J%%J%%J%%%j%%%%j%J%%%jj
2588A01%%%%%%%%J%J%%%%j%%%%JJjjj%%%jJ%J%%%J%%%%j%%%%J%%%j%jJ%%J%j%%%%jJ%%%j%
2580A01%J%%%%%%%%%%%%J%%jj%J%J%%%%%j%%%j%%%%%%%JJjjJ%Jj%j%%%J%%%J%%j%%%%j%%%
2573A01J%j%J%%%%%jJ%%%%%JJjj%J%j%%J%j%j%%%J%J%%J%%j%%J%j%J%%j%%%%jJ%%%%%%J%%
2566A04j%%%%%%J%jjJ%%%%%%%%J%j%%j%J%J%%j%j%J%%J%%%%%Jj%%%J%j%%%%jJ%%%%jJ%%Jj
2558A04%JJ%j%%%j%%%jJ%%%%%%%j%%%%%j%J%%%%J%%%J%%%J%j%j%%%jJJ%j%%%%%J%j%%%%J%
2551A05j%%%jJ%%J%%J%%%J%%%%%%%%%%%%%%j%J%%J%%J%%%J%%%jj%%J%%J%%%%%%J%%%%%J%J
$$ plain form
2602 102 103 103 102 101 101 101 101 101 101 101 102 102 102 102 102 102 102 102 101 101 101 102 102 102 102 102 102 102 102 102 102 102 101 101 101 102 103 103 103 102 102 102 102 102 102 101 101 101 101 102 102 103 103 104 103 103 103 103 102 102 102 102 102 102 101 101 102 102 102
2595 102 103 103 103 102 103 103 103 103 102 102 103 103 103 103 103 103 102 102 103 103 103 103 103 102 101 101 101 102 102 102 102 102 102 102 102 102 102 102 102 102 102 102 102 101 101 101 102 102 102 103 103 103 104 104 104 104 103 103 103 103 103 102 102 103 103 103 103 102 101
2588 101 101 101 101 101 101 101 101 101 102 102 103 103 103 103 103 102 102 102 102 102 103 104 103 102 101 101 101 101 100 101 101 102 102 102 102 103 103 103 103 103 102 102 102 102 102 103 103 103 103 102 102 101 102 102 102 103 103 102 102 102 102 102 101 102 102 102 102 101 101
2580 101 101 102 102 102 102 102 102 102 102 102 102 102 102 102 103 103 103 102 101 101 102 102 103 103 103 103 103 103 102 102 102 102 101 101 101 101 101 101 101 101 102 103 102 101 102 102 103 102 102 101 101 101 101 102 102 102 102 103 103 103 102 102 102 102 102 101 101 101 101
2573 101 102 102 101 101 102 102 102 102 102 102 101 102 102 102 102 102 102 103 104 103 102 102 103 103 102 102 102 103 103 102 102 101 101 101 101 102 102 103 103 103 104 104 104 103 103 103 104 104 103 103 104 104 104 103 103 103 103 103 102 103 103 103 103 103 103 103 104 104 104
2566 104 103 103 103 103 103 103 103 104 104 103 102 103 103 103 103 103 103 103 103 103 104 104 103 103 103 102 102 103 103 104 104 104 103 103 102 102 103 103 103 104 104 104 104 104 104 105 104 104 104 104 105 105 104 104 104 104 104 103 104 104 104 104 104 103 104 104 104 105 104
2558 104 104 105 106 106 105 105 105 105 104 104 104 104 103 104 104 104 104 104 104 104 104 103 103 103 103 103 103 102 102 103 103 103 103 103 104 104 104 104 105 105 105 105 106 106 105 105 104 104 104 104 103 104 105 105 104 104 104 104 104 104 105 105 104 104 104 104 104 105 105
2551 105 104 104 104 104 103 104 104 104 105 105 105 106 106 106 106 107 107 107 107 107 107 107 107 107 107 107 107 107 107 107 106 106 107 107 107 108 108 108 109 109 109 109 110 110 110 110 109 108 108 108 109 109 109 110 110 110 110 110 110 110 111 111 111 111 111 111 112 112 113
2544A13%%%%j%J%%%JJ%%%%J%J%%%%%%%JJJJ%j%JJ%J%%%%J%%J%%KJ%%J%%J%%%%JJJJ%J%%%%
2536A35%%%J%%%J%%%%%%%%%%%%%J%%J%%J%%%%%jJ%%%%%%%%Jj%%Jj%j%%j%%%%jj%j%%%%%%%
2529A35%j%%%j%j%%%%j%Jj%%j%j%j%jj%jj%j%j%jjJj%jk%J%%%%%j%j%j%%j%%%%%%%jjj%J%
2522A12%j%%%j%%j%j%%j%%%%%j%%%JJ%j%%%%%j%j%jJ%%%%%Jj%j%Jj%jJJ%Jj%%j%J%%%%%%%
2514A05jJ%%%j%%J%%%j%jJ%%%j%%%%%%%%%%J%%%%%%%%j%J%%%%%%%%%j%%J%%j%%%%J%%%J%j
2507A04j%%%%%%J%j%%%%%%%%Jj%%%%jj%%%%%Jj%%%J%%JJJ%jj%%J%jj%%J%jJ%%%%J%%%J%j%
2500A04%%%%%%j%%Jj%%%%%J%%%j%%%%%%J%%%jj%J%%%%%%j%J%%%%%%%%J%j%%%K%j%%%%J%%j
2492A04%%J%JJjj%%j%%%%jJJ%J%j%%j%j%j%j%JK%%%%%%j%J%%%J%j%%%%%%j%%J%%%%%%j%%J
$$ plain form
2544 113 113 113 113 113 112 112 113 113 113 113 114 115 115 115 115 115 116 116 117 117 117 117 117 117 117 117 118 119 120 121 121 120 120 121 122 122 123 123 123 123 123 124 124 124 125 125 125 127 128 128 128 129 129 129 130 130 130 130 130 131 132 133 134 134 135 135 135 135 135
2536 135 135 135 135 136 136 136 136 137 137 137 137 137 137 137 137 137 137 137 137 137 137 138 138 138 139 139 139 140 140 140 140 140 140 139 140 140 140 140 140 140 140 140 140 141 140 140 140 141 140 140 139 139 139 138 138 138 138 138 137 136 136 135 135 135 135 135 135 135 135
2529 135 135 134 134 134 134 133 133 132 132 132 132 132 131 131 132 131 131 131 130 130 129 129 128 128 127 126 126 125 124 124 123 123 122 122 121 120 121 120 120 119 117 117 118 118 118 118 118 118 117 117 116 116 115 115 115 114 114 114 114 114 114 114 114 113 112 111 111 112 112
2522 112 112 111 111 111 111 110 110 110 109 109 108 108 108 107 107 107 107 107 107 106 106 106 106 107 108 108 107 107 107 107 107 107 106 106 105 105 104 105 105 105 105 105 105 106 105 105 104 104 105 104 104 103 104 105 105 106 105 105 105 104 104 105 105 105 105 105 105 105 105
2514 105 104 105 105 105 105 104 104 104 105 105 105 105 104 104 103 104 104 104 104 103 103 103 103 103 103 103 103 103 103 103 104 104 104 104 104 104 104 104 104 103 103 104 104 104 104 104 104 104 104 104 104 103 103 103 104 104 104 103 103 103 103 103 104 104 104 104 105 105 104
2507 104 103 103 103 103 103 103 103 104 104 103 103 103 103 103 103 103 103 103 104 103 103 103 103 103 102 101 101 101 101 101 101 102 101 101 101 101 102 102 102 103 104 105 105 104 103 103 103 104 104 103 102 102 102 103 103 102 103 103 103 103 103 104 104 104 104 105 105 104 104
2500 104 104 104 104 104 104 104 103 103 103 104 103 103 103 103 103 103 104 104 104 104 103 103 103 103 103 103 103 104 104 104 104 103 102 102 103 103 103 103 103 103 103 102 102 103 103 103 103 103 103 103 103 103 104 104 103 103 103 103 105 105 104 104 104 104 104 105 105 105 104
2492 104 104 104 105 105 106 107 106 105 105 105 104 104 104 104 104 103 104 105 105 106 106 105 105 105 104 104 103 103 102 102 101 101 102 104 104 104 104 104 104 104 103 103 104 104 104 104 105 105 104 104 104 104 104 104 104 103 103 103 104 104 104 104 104 104 104 103 103 103 104
2485A04%JJj%j%%%%%%%%%%%%j%JJ%%%%%%jJ%J%j%%j%%J%%J%%j%%%%%JJj%%j%Jj%%jJJ%j%j
2478A04J%%%%J%%jJ%%j%%jJ%%J%%j%%%%Jj%%%%%%j%%%%J%%%%%%%jj%%J%%%%%%J%jj%%%%%%
2471A03jJ%%%%J%%%Jj%j%%%%J%%%Jj%%j%%J%%J%j%%%%%jJ%%J%%j%%%jJJ%%j%j%%%%%J%%%%
2463A04%%%%%%j%j%%J%%%%%%%%%%J%%%%%%%%%Jj%J%j%%%%%%%j%%%J%%%j%%%J%Jj%%J%j%%%
2456A04%%%%%J%j%j%J%j%%%%%%%%%%J%%%%%J%%%%%jjJ%Jj%j%J%%%j%%%J%%%J%%j%J%j%%%J
2449A05%%%j%%%%JJj%j%%%%%%%%%%%%J%Jj%%%%%%j%%%%%%J%%%%j%%%j%Jj%JJ%%%%%%%J%j%
2441A05%%J%%%jj%JJj%j%%%%%J%%%%%%%%j%%%%%%%%%%J%%%%J%jj%%J%%jJ%%%%%%%%j%%%%J
2434A05%%%%%jj%%%J%%%jJ%%J%%j%%%%%jjJJ%%J%%%%j%%J%j%%%%J%%%J%%J%jJj%JJ%j%j%j
$$ plain form
2485 104 104 105 106 105 105 104 104 104 104 104 104 104 104 104 104 104 104 104 103 103 104 105 105 105 105 105 105 105 104 105 105 106 106 105 105 105 104 104 104 105 105 105 106 106 106 105 105 105 105 105 105 106 107 106 106 106 105 105 106 105 105 105 104 105 106 106 105 105 104
2478 104 105 105 105 105 105 106 106 106 105 106 106 106 105 105 105 104 105 105 105 106 106 106 105 105 105 105 105 106 105 105 105 105 105 105 105 104 104 104 104 104 105 105 105 105 105 105 105 105 104 103 103 103 104 104 104 104 104 104 104 105 105 104 103 103 103 103 103 103 103
2471 103 102 103 103 103 103 103 104 104 104 104 105 104 104 103 103 103 103 103 104 104 104 104 105 104 104 104 103 103 103 104 104 104 105 105 104 104 104 104 104 104 103 104 104 104 105 105 105 104 104 104 104 103 104 105 105 105 104 104 103 103 103 103 103 103 104 104 104 104 104
2463 104 104 104 104 104 104 104 103 103 102 102 102 103 103 103 103 103 103 103 103 103 103 103 104 104 104 104 104 104 104 104 104 104 105 104 104 105 105 104 104 104 104 104 104 104 104 103 103 103 103 104 104 104 104 103 103 103 103 104 104 105 104 104 104 105 105 104 104 104 104
2456 104 104 104 104 104 104 105 105 104 104 103 103 104 104 103 103 103 103 103 103 103 103 103 103 103 104 104 104 104 104 104 105 105 105 105 105 105 104 103 104 104 105 104 104 103 103 104 104 104 104 103 103 103 103 104 104 104 104 105 105 105 104 104 105 105 104 104 104 104 105
2449 105 105 105 105 104 104 104 104 104 105 106 105 105 104 104 104 104 104 104 104 104 104 104 104 104 104 105 105 106 105 105 105 105 105 105 105 104 104 104 104 104 104 104 105 105 105 105 105 104 104 104 104 103 103 104 103 103 104 105 105 105 105 105 105 105 105 106 106 105 105
2441 105 105 105 106 106 106 106 105 104 104 105 106 105 105 104 104 104 104 104 104 105 105 105 105 105 105 105 105 105 104 104 104 104 104 104 104 104 104 104 104 105 105 105 105 105 106 106 105 104 104 104 105 105 105 104 105 105 105 105 105 105 105 105 105 104 104 104 104 104 105
2434 105 105 105 105 105 105 104 103 103 103 103 104 104 104 104 103 104 104 104 105 105 105 104 104 104 104 104 104 103 102 103 104 104 104 105 105 105 105 105 104 104 104 105 105 104 104 104 104 104 105 105 105 105 106 106 106 107 107 106 107 106 106 107 108 108 107 107 106 106 105
2427A05%Jj%%j%JJJ%%j%%jj%J%%%%%%%J%jj%JJJ%j%%%%j%%%%J%%%%%%Jj%%%%%%%%%%%%%%%
2419A06%j%J%%%%%%J%j%%%%%J%J%J%j%%j%J%jJ%j%%jJ%%%%J%%%%%j%%%%%J%%%%j%%%%%JJ%
2412A09%%%%%jj%%%j%J%%J%%%%%%%j%%%%%%%J%%%J%%%%j%J%jJ%%%%%j%%jj%%J%J%%%%%%%%
2405A08%%%%%%jJ%%%%%%J%%%%j%%%%%%%%%J%%%%%Jj%%%%%J%%%%%%%%%J%Jj%%k%%%%J%%%%J
2397A11%%j%%JJ%%%j%%%%%J%%jj%%JJ%%%%%%j%%J%%J%j%J%%%j%%%%J%%%j%%%%%%J%%%%%J%
2390A14J%%%j%%J%%%j%j%%J%j%J%J%%j%%JJ%%%J%%%%jj%J%%J%%%j%%j%%%%%j%jjJJJ%J%Jj
2383A16J%%J%J%J%%%%%J%%j%jjjjjj%jj%%J%%j%%JJJKJJ%JJJ%%JJ%J%J%j%J%%J%%J%J%%%%
2375A29%%%J%%%%JJ%J%J%j%%%JJ%j%%%%%%%%%%%%J%j%%%JKJJJ%%%JJJJ%%%%J%%%%%%%%JJ%
$$ plain form
2427 105 105 106 105 105 105 104 104 105 106 107 107 107 106 106 106 105 104 104 105 105 105 105 105 105 105 105 106 106 105 104 104 105 106 107 107 106 106 106 106 106 105 105 105 105 105 106 106 106 106 106 106 106 107 106 106 106 106 106 106 106 106 106 106 106 106 106 106 106 106
2419 106 106 105 105 106 106 106 106 106 106 106 107 107 106 106 106 106 106 106 107 107 108 108 109 109 108 108 108 107 107 108 108 107 108 108 107 107 107 106 107 107 107 107 107 108 108 108 108 108 108 107 107 107 107 107 107 108 108 108 108 108 107 107 107 107 107 107 108 109 109
2412 109 109 109 109 109 109 108 107 107 107 107 106 106 107 107 107 108 108 108 108 108 108 108 108 107 107 107 107 107 107 107 107 108 108 108 108 109 109 109 109 109 108 108 109 109 108 109 109 109 109 109 109 108 108 108 107 106 106 106 107 107 108 108 108 108 108 108 108 108 108
2405 108 108 108 108 108 108 108 107 108 108 108 108 108 108 108 109 109 109 109 109 108 108 108 108 108 108 108 108 108 108 109 109 109 109 109 109 110 109 109 109 109 109 109 110 110 110 110 110 110 110 110 110 110 111 111 112 111 111 111 109 109 109 109 109 110 110 110 110 110 111
2397 111 111 111 110 110 110 111 112 112 112 112 111 111 111 111 111 111 112 112 112 111 110 110 110 111 112 112 112 112 112 112 112 111 111 111 112 112 112 113 113 112 112 113 113 113 113 112 112 112 112 112 113 113 113 113 112 112 112 112 112 112 112 113 113 113 113 113 113 114 114
2390 114 115 115 115 115 114 114 114 115 115 115 115 114 114 113 113 113 114 114 113 113 114 114 115 115 115 114 114 114 115 116 116 116 116 117 117 117 117 117 116 115 115 116 116 116 117 117 117 117 116 116 116 115 115 115 115 115 115 114 114 113 112 113 114 115 115 116 116 117 116
2383 116 117 117 117 118 118 119 119 120 120 120 120 120 120 121 121 121 120 120 119 118 117 116 115 114 114 113 112 112 112 113 113 113 112 112 112 113 114 115 117 118 119 119 120 121 122 122 122 123 124 124 125 125 126 126 125 125 126 126 126 127 127 127 128 128 129 129 129 129 129
2375 129 129 129 129 130 130 130 130 130 131 132 132 133 133 134 134 133 133 133 133 134 135 135 134 134 134 134 134 134 134 134 134 134 134 134 134 135 135 134 134 134 134 135 137 138 139 140 140 140 140 141 142 143 144 144 144 144 144 145 145 145 145 145 145 145 145 145 146 147 147
2368A47%J%%kj%J%%j%jjj%jj%%%jj%%%%%%J%J%JJJ%JJJJJJJ%%K%J%J%JJ%J%J%%%JJJ%%J%J
2361A63%%J%%%j%%J%%%%JJJJJJKLMKKLKKLLKJKJKJ%J%Jjjj%jjjjjjjjj%%%%%%JJJKJKLLLL
2354B15KKLLKLKLKKKKJKKKJJKJKJKKKLKLMKKKKKLLLKLKLLMMMLMNNNNNNNONNNNNONOOONMNO
2346D42OPPPRRJ0RQRPPOOOMNMLLLKKLLLMMMNPOOQRRQRRJ0J1J1J1J0J2J3J3J3J5J5J5J6J7J7
2341H77J8J8K1K1K1K3K4K5K6K6K8L0L0L2L5L6L7L9M0M3M5M8N0N2N4N6O1O4O8P1P5Q0Q6R0R7
2337B447J04J10J18J26J35J44J55J64J77J89K04K19K35K53K73K95L18L45L74M03M35M70N09
2334H202N50N93O40O92P49Q13Q82R56J036J118J199J270J330J377J411J430J425J393J328
2332B8394J223J073Q83O58M04J32j48m18o61q58j006j117j209j292j362j414j441j446j430
$$ plain form
2368 147 147 148 148 148 146 145 145 146 146 146 145 145 144 143 142 142 141 140 140 140 140 139 138 138 138 138 138 138 138 139 139 140 140 141 142 143 143 144 145 146 147 148 149 150 150 150 152 152 153 153 154 154 155 156 156 157 157 158 158 158 158 159 160 161 161 161 162 162 163
2361 163 163 163 164 164 164 164 163 163 163 164 164 164 164 164 165 166 167 168 169 170 172 175 179 181 183 186 188 190 193 196 198 199 201 202 204 205 205 206 206 207 206 205 204 204 203 202 201 200 199 198 197 196 195 195 195 195 195 195 195 196 197 198 200 201 203 206 209 212 215
2354 215 217 219 222 225 227 230 232 235 237 239 241 243 244 246 248 250 251 252 254 255 257 258 260 262 264 267 269 272 276 278 280 282 284 286 289 292 295 297 300 302 305 308 312 316 320 323 327 332 337 342 347 352 357 362 368 373 378 383 388 393 399 404 410 416 422 427 431 436 442
2346 442 448 455 462 469 478 487 497 506 514 523 530 537 543 549 555 559 564 568 571 574 577 579 581 584 587 590 594 598 602 607 614 620 626 634 643 652 660 669 678 688 699 710 721 731 743 756 769 782 797 812 827 843 860 877
2341 877 895 913 934 955 976 999 1023 1048 1074 1100 1128 1158 1188 1220 1255 1291 1328 1367 1407 1450 1495 1543 1593 1645 1699 1755 1816 1880 1948 2019 2094 2174 2260 2350 2447
2337 2447 2551 2661 2779 2905 3040 3184 3339 3503 3680 3869 4073 4292 4527 4780 5053 5348 5666 6011 6385 6788 7223 7693 8202
2334 8202 8752 9345 9985 10677 11426 12239 13121 14077 15113 16231 17430 18700 20030 21407 22818 24248 25673 27066 28394
2332 28394 29617 30690 31573 32231 32635 32767 32619 32201 31540 30682 29676 28559 27350 26058 24696 23282 21841 20395 18965
2330A8965j393j337j261j174j086j005r31q60p89p18o48n84n26m74m29l90l53l22k93k65k42
2328C885k19k01j83j69j56j45j33j24j15j06j00r2q6q1p6p1o8o4o1n8n3n1m9m6m3m1m0l7l6
2325A181l4l2l0k9k8k7k4k5k4k3k2k1k1k0j9j9j8j8j7j7j7j6j4j5j3j4j3j3j1j2j1j1j1j0
2321E32rrrrpqpppppqqqqqqrpqqpoooonnnmmoponoooonnnnllkk%%%JJJJKKKKKKK%Jjjj%j%
2314B49jjk%kljjjjjjjjjkkjkjjjkjjjjjj%j%j%JJJKJJJJ%Jjjj%j%kkklklklllllllmlkkl
2307A66kkk%jj%j%%Jj%%JJJ%JJJJKJJJJJJ%%%%J%J%%%jjk%jjjj%j%%%jj%j%%%%j%j%j%%jJ
2299A59Jj%%j%%J%j%j%%%%j%j%jkkkjkk%jjjjkj%%%jjj%J%jj%j%%j%%%%%%%JJ%%j%J%%%%J
2292A33%%j%%%%%%J%jjj%j%%%%%%%%%jJ%jj%%J%%%%j%%j%%J%%Jj%%%%%%%%%%J%j%j%JJJJJ
$$ plain form
2330 18965 17572 16235 14974 13800 12714 11709 10778 9918 9129 8411 7763 7179 6653 6179 5750 5360 5007 4685 4392 4127 3885
2328 3885 3666 3465 3282 3113 2957 2812 2679 2555 2440 2334 2234 2142 2056 1975 1899 1828 1760 1696 1635 1577 1524 1473 1424 1378 1335 1294 1254 1217 1181
2325 1181 1147 1115 1085 1056 1028 1001 977 952 928 905 883 862 841 821 802 783 765 747 730 713 696 680 666 651 638 624 611 598 587 575 564 553 542 532
2321 532 523 514 505 496 489 481 474 467 460 453 446 438 430 422 414 406 398 389 382 374 366 359 353 347 341 335 330 325 320 316 312 306 299 293 288 282 276 270 264 259 254 249 244 241 238 236 234 234 234 234 235 236 237 238 240 242 244 246 248 250 252 252 253 252 251 250 250 249 249
2314 249 248 247 245 245 243 240 239 238 237 236 235 234 233 232 231 229 227 226 224 223 222 221 219 218 217 216 215 214 213 213 212 212 211 211 212 213 214 216 217 218 219 220 220 221 220 219 218 218 217 217 215 213 211 208 206 203 201 198 195 192 189 186 183 180 176 173 171 169 166
2307 166 164 162 160 160 159 158 158 157 157 157 158 157 157 157 158 159 160 160 161 162 163 164 166 167 168 169 170 171 172 172 172 172 172 173 173 174 174 174 174 173 172 170 170 169 168 167 166 166 165 165 165 165 164 163 163 162 162 162 162 162 161 161 160 160 159 159 159 158 159
2299 159 160 159 159 159 158 158 158 159 159 158 158 157 157 157 157 157 156 156 155 155 154 152 150 148 147 145 143 143 142 141 140 139 137 136 136 136 136 135 134 133 133 134 134 133 132 132 131 131 131 130 130 130 130 130 130 130 130 131 132 132 132 131 131 132 132 132 132 132 133
2292 133 133 133 132 132 132 132 132 132 132 133 133 132 131 130 130 129 129 129 129 129 129 129 129 129 129 128 129 129 128 127 127 127 128 128 128 128 128 127 127 127 126 126 126 127 127 127 128 127 127 127 127 127 127 127 127 127 127 127 128 128 127 127 126 126 127 128 129 130 131
2285A31JJKJ%JJJ%j%j%jjjjjkjjj%jj%j%%%%J%%%%J%%J%%jjj%%%%%%%%%j%j%%j%jj%%J%%%
2278A20%%%jJ%%Jj%%j%%Jj%%%%%J%%j%j%%%jJ%%%J%%j%%j%%%%%%%%%%%J%%%%%%%%%%%j%%j
2270A16%j%%J%%Jj%%%%%%j%%J%%j%%J%j%%%%%%%j%%%%%%%jJ%%%%%J%j%%%%jJ%J%j%j%%%%J
2263A14%%%%%%%Jj%%j%j%%jJJJJ%%%j%j%%%%%%%jjJ%j%%JJ%j%%%J%j%j%%j%%J%J%%j%jJ%%
2256A11Jj%j%%%J%%%j%JJj%%%j%JJj%j%jjJJ%J%%j%%%%jJ%J%%j%%%Jj%%%%Jjj%%J%%%%%%%
2248A10%%j%%%%%%jJ%%J%%jjJ%%%%%%%%J%%%%j%j%jjJ%%%%J%J%J%Jj%%%jjJ%%%%%%%%%%%j
2241A08%%%%%%%%%%%k%%%%%jJ%J%%%jJJ%%%%j%%j%J%J%%%%%%%%%%%%%%%%%JjJ%j%%%j%%%%
2234A07%%%J%j%%j%%J%J%%%%%%J%%jj%%J%%%%%%%j%%J%%%%%%j%J%%%j%%%jJ%%Jj%%%%j%JJ
$$ plain form
2285 131 132 133 135 136 136 137 138 139 139 138 138 137 137 136 135 134 133 132 130 129 128 127 127 126 125 125 124 124 124 124 124 125 125 125 125 125 126 126 126 127 127 127 126 125 124 124 124 124 124 124 124 124 124 124 123 123 122 122 122 121 121 120 119 119 119 120 120 120 120
2278 120 120 120 120 119 120 120 120 121 120 120 120 119 119 119 120 119 119 119 119 119 119 120 120 120 119 119 118 118 118 118 117 118 118 118 118 119 119 119 118 118 118 117 117 117 117 117 117 117 117 117 117 117 117 118 118 118 118 118 118 118 118 118 118 118 118 117 117 117 116
2270 116 116 115 115 115 116 116 116 117 116 116 116 116 116 116 116 115 115 115 116 116 116 115 115 115 116 116 115 115 115 115 115 115 115 115 114 114 114 114 114 114 114 114 113 114 114 114 114 114 114 115 115 114 114 114 114 114 113 114 114 115 115 114 114 113 113 113 113 113 114
2263 114 114 114 114 114 114 114 114 115 114 114 114 113 113 112 112 112 111 112 113 114 115 115 115 115 114 114 113 113 113 113 113 113 113 113 112 111 112 112 111 111 111 112 113 113 112 112 112 112 113 113 112 112 111 111 111 110 110 110 111 111 112 112 112 111 111 110 111 111 111
2256 111 112 111 111 110 110 110 110 111 111 111 111 110 110 111 112 111 111 111 111 110 110 111 112 111 111 110 110 109 108 109 110 110 111 111 111 110 110 110 110 110 109 110 110 111 111 111 110 110 110 110 111 110 110 110 110 110 111 110 109 109 109 110 110 110 110 110 110 110 110
2248 110 110 110 109 109 109 109 109 109 109 108 109 109 109 110 110 110 109 108 109 109 109 109 109 109 109 109 109 110 110 110 110 110 109 109 108 108 107 106 107 107 107 107 107 108 108 109 109 110 110 111 110 110 110 110 109 108 109 109 109 109 109 109 109 109 109 109 109 109 108
2241 108 108 108 108 108 108 108 108 108 108 108 108 106 106 106 106 106 106 105 106 106 107 107 107 107 106 107 108 108 108 108 108 107 107 107 106 106 107 107 108 108 108 108 108 108 108 108 108 108 108 108 108 108 108 108 108 108 109 108 109 109 108 108 108 108 107 107 107 107 107
2234 107 107 107 107 108 108 107 107 107 106 106 106 107 107 108 108 108 108 108 108 108 109 109 109 108 107 107 107 108 108 108 108 108 108 108 108 107 107 107 108 108 108 108 108 108 108 107 107 108 108 108 108 107 107 107 107 106 107 107 107 108 107 107 107 107 107 106 106 107 108
2226A08%j%%%J%%jj%%%%%j%J%%%%J%%%%%%%%%%jJ%jJ%%%J%%j%j%%%%%j%%J%%%%J%j%%%J%%
2219A07%%j%%%%%%%%%%%Jj%%%%%J%%%%j%%Jjj%J%%%%%%j%%J%%%%j%%%Jjj%%J%jJ%%Jj%%j%
2212A04%%J%%%J%j%%%%%%jJ%%%%%J%%%%%%%jjJJJ%%j%%J%j%j%%J%%%%j%%%J%%%%%j%%%%jJ
2204A05%%%%%%%%%J%%%j%j%%jJJ%j%J%%%j%Jj%%J%J%%Jjj%%%%%j%%jJ%%%%%j%JJ%j%%J%J%
2197A06%%j%%%%%%%%%%%%%%%%%%%%j%JJj%%J%%%%%j%%%JJ%%jjj%j%%%jJ%%J%JJ%%j%%%%%%
2190A05%%%%%%%%%%%j%%%%%%%J%%%%%%%%%%%%%%%%%%J%%%%%%%%j%jj%%J%%J%%%%%%%%j%%%
2183A04%%%%%%J%%j%%%%Jj%%%%%%%%%%J%j%%%%%%%J%%Jj%jj%%%J%%j%%J%%%jJ%j%%%%J%%j
2175A03j%JJ%%%%%%%%%%j%%%%%%%%J%%%j%%%%%Jj%%%%%%%%J%%%%j%j%%%%%J%%j%%Jj%%J%%
$$ plain form
2226 108 108 107 107 107 107 108 108 108 107 106 106 106 106 106 106 105 105 106 106 106 106 106 107 107 107 107 107 107 107 107 107 107 107 106 107 107 106 107 107 107 107 108 108 108 107 107 106 106 106 106 106 106 105 105 105 106 106 106 106 106 107 107 106 106 106 106 107 107 107
2219 107 107 107 106 106 106 106 106 106 106 106 106 106 106 106 107 106 106 106 106 106 106 107 107 107 107 107 106 106 106 107 106 105 105 106 106 106 106 106 106 106 105 105 105 106 106 106 106 106 105 105 105 105 106 105 104 104 104 105 105 104 105 105 105 106 105 105 105 104 104
2212 104 104 104 105 105 105 105 106 106 105 105 105 105 105 105 105 104 105 105 105 105 105 105 106 106 106 106 106 106 106 106 105 104 105 106 107 107 107 106 106 106 107 107 106 106 105 105 105 106 106 106 106 106 105 105 105 105 106 106 106 106 106 106 105 105 105 105 105 104 105
2204 105 105 105 105 105 105 105 105 105 105 106 106 106 106 105 105 104 104 104 103 104 105 105 104 104 105 105 105 105 104 104 105 104 104 104 105 105 106 106 106 107 106 105 105 105 105 105 105 104 104 104 103 104 104 104 104 104 104 103 103 104 105 105 104 104 104 105 105 106 106
2197 106 106 106 105 105 105 105 105 105 105 105 105 105 105 105 105 105 105 105 105 105 105 105 105 104 104 105 106 105 105 105 106 106 106 106 106 106 105 105 105 105 106 107 107 107 106 105 104 104 103 103 103 103 102 103 103 103 104 104 105 106 106 106 105 105 105 105 105 105 105
2190 105 105 105 105 105 105 105 105 105 105 105 105 104 104 104 104 104 104 104 104 105 105 105 105 105 105 105 105 105 105 105 105 105 105 105 105 105 105 105 106 106 106 106 106 106 106 106 106 105 105 104 103 103 103 104 104 104 105 105 105 105 105 105 105 105 105 104 104 104 104
2183 104 104 104 104 104 104 104 105 105 105 104 104 104 104 104 105 104 104 104 104 104 104 104 104 104 104 104 105 105 104 104 104 104 104 104 104 104 105 105 105 106 105 105 104 103 103 103 103 104 104 104 103 103 103 104 104 104 104 103 104 104 103 103 103 103 103 104 104 104 103
2175 103 102 102 103 104 104 104 104 104 104 104 104 104 104 104 103 103 103 103 103 103 103 103 103 104 104 104 104 103 103 103 103 103 103 104 103 103 103 103 103 103 103 103 103 104 104 104 104 104 103 103 102 102 102 102 102 102 103 103 103 102 102 102 103 102 102 102 103 103 103
2168A03%%%J%jj%%%%%%%J%%%%%J%%%jjJJ%j%jjJ%%%%%J%%%%%j%%%%%%j%%J%%%J%j%%J%%J%
2161A04%%%Jj%%%j%%%%%j%%J%%jj%%%%%jJ%%%J%Jj%%%%%%%%%%J%%%%J%%%%j%%%%J%jjJ%%%
2153A03Jj%%%J%%%%%j%%%J%j%%%j%J%%Jj%j%%J%j%JJ%%j%j%J%%%jj%%%J%j%%J%%%%%%%%J%
2146A03%J%j%j%%J%%%%%J%j%%%J%k%%J%%%%%j%%%%%%%%J%%J%%%%%%%%%j%%%%%jjj%J%%%J%
2139A02J%Jjj%%%%%J%j%%%J%Jj%%%%%%Jj%%%j%%j%J%%%%%%%JJ%Jj%j%j%JJ%jj%%%%jJ%J%%
2131A03%%%%J%j%%j%%%%%jJJj%%J%%%%j%%j%%%JJj%%%%%%j%%%%%%%%%%%%%%%%Jj%%%JJ%jj
2124A01%%%JJ%%%j%%%j%%J%%%%%%%%%%%%jj%%J%jJ%J%%%j%%%%jJJ%J%j%%%%%%j%%J%%%J%%
2117A03%%j%jjJ%%%%J%%J%%%J%j%j%%%Jj%jJ%%%%%j%%J%%%%J%%%j%%j%%%%%%%%%J%%%%%j%
$$ plain form
2168 103 103 103 103 104 104 103 102 102 102 102 102 102 102 102 103 103 103 103 103 103 104 104 104 104 103 102 103 104 104 103 103 102 101 102 102 102 102 102 102 103 103 103 103 103 103 102 102 102 102 102 102 102 101 101 101 102 102 102 102 103 103 102 102 102 103 103 103 104 104
2161 104 104 104 104 105 104 104 104 104 103 103 103 103 103 103 102 102 102 103 103 103 102 101 101 101 101 101 101 100 101 101 101 101 102 102 103 102 102 102 102 102 102 102 102 102 102 102 103 103 103 103 103 104 104 104 104 104 103 103 103 103 103 104 104 103 102 103 103 103 103
2153 103 104 103 103 103 103 104 104 104 104 104 104 103 103 103 103 104 104 103 103 103 103 102 102 103 103 103 104 103 103 102 102 102 103 103 102 102 103 104 104 104 103 103 102 102 103 103 103 103 102 101 101 101 101 102 102 101 101 101 102 102 102 102 102 102 102 102 102 103 103
2146 103 103 104 104 103 103 102 102 102 103 103 103 103 103 103 104 104 103 103 103 103 104 104 102 102 102 103 103 103 103 103 103 102 102 102 102 102 102 102 102 102 103 103 103 104 104 104 104 104 104 104 104 104 104 103 103 103 103 103 103 102 101 100 100 101 101 101 101 102 102
2139 102 103 103 104 103 102 102 102 102 102 102 103 103 102 102 102 102 103 103 104 103 103 103 103 103 103 103 104 103 103 103 103 102 102 102 101 101 102 102 102 102 102 102 102 102 103 104 104 105 104 104 103 103 102 102 103 104 104 103 102 102 102 102 102 101 102 102 103 103 103
2131 103 103 103 103 103 104 104 103 103 103 102 102 102 102 102 102 101 102 103 102 102 102 103 103 103 103 103 102 102 102 101 101 101 101 102 103 102 102 102 102 102 102 102 101 101 101 101 101 101 101 101 101 101 101 101 101 101 101 101 101 102 101 101 101 101 102 103 103 102 101
2124 101 101 101 101 102 103 103 103 103 102 102 102 102 101 101 101 102 102 102 102 102 102 102 102 102 102 102 102 102 101 100 100 100 101 101 100 101 101 102 102 102 102 101 101 101 101 101 100 101 102 102 103 103 102 102 102 102 102 102 102 101 101 101 102 102 102 102 103 103 103
2117 103 103 103 102 102 101 100 101 101 101 101 101 102 102 102 103 103 103 103 104 104 103 103 102 102 102 102 103 102 102 101 102 102 102 102 102 102 101 101 101 102 102 102 102 102 103 103 103 103 102 102 102 101 101 101 101 101 101 101 101 101 101 102 102 102 102 102 102 101 101
2109A01%%J%Jj%%j%%%J%%%JjjJ%%%%%j%%%%J%%Jj%%%%%%j%%J%jJJ%%jj%%J%%jjJ%%%%%J%%
2102A02%%%%%%j%%%%%%JJ%%j%%%%%%%%%%j%jJ%%%J%%%%j%%%j%J%J%%J%%%j%%jj%%J%Jj%JJ
2095A03jJ%%j%%%%j%%%%%J%j%j%%%%J%%%%%%%Jj%%%%%%%j%%%j%%JJj%J%%%%j%%%%%%jJ%%%
2087A00%%%%J%%%%%%J%jjj%J%J%jJ%%%%%%%j%%%%%%JJ%%%%%%j%%%%%j%%%%%%%%J%%J%%%j%
2080A01%%%%%%%%%Jj%%%%%jJ%%%%%J%%%jj%%%%%%JjJ%%Jj%%jJ%JJj%%%%%j%J%j%%%jJ%%J%
2073A02j%J%J%%%%%%jj%%Jj%%%j%JJj%%jJ%%Jj%%%%%%%JJ%%j%J%%j%j%%%%%%%J%%jJJJj%%
2066A03j%%%j%J%%%J%%%j%%%j%%%JJ%%%%j%jJj%%J%%%%j%jJ%%%%JJ%%Jj%%%%%%%%j%Jjj%J
2058A02%%%j%%%J%J%j%%%j%%%%JJ%jjjJ%J%J%%%%%%%j%%%%J%j%%%%%%%%j%%%%J%%%J%%%%%
$$ plain form
2109 101 101 101 102 102 103 102 102 102 101 101 101 101 102 102 102 102 103 102 101 102 102 102 102 102 102 101 101 101 101 101 102 102 102 103 102 102 102 102 102 102 102 101 101 101 102 102 101 102 103 103 103 102 101 101 101 102 102 102 101 100 101 101 101 101 101 101 102 102 102
2102 102 102 102 102 102 102 102 101 101 101 101 101 101 101 102 103 103 103 102 102 102 102 102 102 102 102 102 102 102 101 101 100 101 101 101 101 102 102 102 102 102 101 101 101 101 100 100 101 101 102 102 102 103 103 103 103 102 102 102 101 100 100 100 101 101 102 101 101 102 103
2095 103 102 103 103 103 102 102 102 102 102 101 101 101 101 101 101 102 102 101 101 100 100 100 100 100 101 101 101 101 101 101 101 101 102 101 101 101 101 101 101 101 101 100 100 100 100 99 99 99 100 101 100 100 101 101 101 101 101 100 100 100 100 100 100 100 99 100 100 100 100
2087 100 100 100 100 100 101 101 101 101 101 101 101 102 102 101 100 99 99 100 100 101 101 100 101 101 101 101 101 101 101 101 100 100 100 100 100 100 100 101 102 102 102 102 102 102 102 101 101 101 101 101 101 100 100 100 100 100 100 100 100 100 101 101 101 102 102 102 102 101 101
2080 101 101 101 101 101 101 101 101 101 101 102 101 101 101 101 101 101 100 101 101 101 101 101 101 102 102 102 102 101 100 100 100 100 100 100 100 101 100 101 101 101 102 101 101 101 100 101 101 102 103 102 102 102 102 102 102 101 101 102 102 101 101 101 101 100 101 101 101 102 102
2073 102 101 101 102 102 103 103 103 103 103 103 103 102 101 101 101 102 101 101 101 101 100 100 101 102 101 101 101 100 101 101 101 102 101 101 101 101 101 101 101 101 102 103 103 103 102 102 103 103 103 102 102 101 101 101 101 101 101 101 101 102 102 102 101 102 103 104 103 103 103
2066 103 102 102 102 102 101 101 102 102 102 102 103 103 103 103 102 102 102 102 101 101 101 101 102 103 103 103 103 103 102 102 101 102 101 101 101 102 102 102 102 102 101 101 100 101 101 101 101 101 102 103 103 103 104 103 103 103 103 103 103 103 103 103 102 102 103 102 101 101 102
2058 102 102 102 102 101 101 101 101 102 102 103 103 102 102 102 102 101 101 101 101 101 102 103 103 102 101 100 101 101 102 102 103 103 103 103 103 103 103 103 102 102 102 102 102 103 103 102 102 102 102 102 102 102 102 102 101 101 101 101 101 102 102 102 102 103 103 103 103 103 103
2051A03%%jj%J%%%%%%jJ%J%%%%%%%%%%%j%Jj%J%Jj%%J%j%%%j%%%Jj%J%%%%%%%%%%%%%%%%j
2044A02%%J%%%%%%%%j%J%%%j%jJ%%%J%%%%Jj%%%%jJ%J%%%%%%%%Jjj%J%%J%%%J%%%%jj%%JJ
2036A06%%%%J%%j%%j%J%%j%%%%%J%%J%j%%J%%%%Jj%J%%Jj%%%J%J%%Jj%%j%%%%%%%%J%%%%%
2029A10%J%%%%J%j%%%%J%%%J%%%J%Jj%%%%%%%J%%%%%J%J%%%%J%Jj%%J%J%%%%%%%%%%%jJJJ
2022A22%%%JjJ%jJ%%JJJjj%%%%%%%%J%%JJ%%j%j%JJ%Jj%j%%J%%%%%%%%%%j%J%%%%%%jJ%%%
2014A27%%%%%j%%%jJj%j%%J%jjj%J%%%JJ%j%%j%%j%jJ%%%%%%j%%jjj%J%Jjj%%%%%j%%%j%%
2007A16j%%%%%%%J%jjj%%%j%%%%%%%%%j%k%%j%%J%j%%j%%%%%%%%%%%%%j%%j%%%%%%%j%%%%
2000A04JJ%%%%%%%j%j%%%%%%%J%%%J%j%%j%j%%%%JJ%Jjj%%%%%%%j%%%%%JJ%%k%%%%%%JJ%j
$$ plain form
2051 103 103 103 102 101 101 102 102 102 102 102 102 102 101 102 102 103 103 103 103 103 103 103 103 103 103 103 103 102 102 103 102 102 103 103 104 103 103 103 104 104 103 103 103 103 102 102 102 102 103 102 102 103 103 103 103 103 103 103 103 103 103 103 103 103 103 103 103 103 102
2044 102 102 102 103 103 103 103 103 103 103 103 103 102 102 103 103 103 103 102 102 101 102 102 102 102 103 103 103 103 103 104 103 103 103 103 103 102 103 103 104 104 104 104 104 104 104 104 104 105 104 103 103 104 104 104 105 105 105 105 106 106 106 106 106 105 104 104 104 105 106
2036 106 106 106 106 106 107 107 107 106 106 106 105 105 106 106 106 105 105 105 105 105 105 106 106 106 107 107 106 106 106 107 107 107 107 107 108 107 107 108 108 108 109 108 108 108 108 109 109 110 110 110 111 110 110 110 109 109 109 109 109 109 109 109 109 110 110 110 110 110 110
2029 110 110 111 111 111 111 111 112 112 111 111 111 111 111 112 112 112 112 113 113 113 113 114 114 115 114 114 114 114 114 114 114 114 115 115 115 115 115 115 116 116 117 117 117 117 117 118 118 119 118 118 118 119 119 120 120 120 120 120 120 120 120 120 120 120 120 119 120 121 122
2022 122 122 122 122 123 122 123 123 122 123 123 123 124 125 126 125 124 124 124 124 124 124 124 124 124 125 125 125 126 127 127 127 126 126 125 125 126 127 127 128 127 127 126 126 126 127 127 127 127 127 127 127 127 127 127 127 126 126 127 127 127 127 127 127 127 126 127 127 127 127
2014 127 127 127 127 127 127 126 126 126 126 125 126 125 125 124 124 124 125 125 124 123 122 122 123 123 123 123 124 125 125 124 124 124 123 123 123 122 122 121 122 122 122 122 122 122 122 121 121 121 120 119 118 118 119 119 120 119 118 118 118 118 118 118 117 117 117 117 116 116 116
2007 116 115 115 115 115 115 115 115 115 116 116 115 114 113 113 113 113 112 112 112 112 112 112 112 112 112 112 111 111 109 109 109 108 108 108 109 109 108 108 108 107 107 107 107 107 107 107 107 107 107 107 107 107 107 106 106 106 105 105 105 105 105 105 105 105 104 104 104 104 104
2000 104 105 106 106 106 106 106 106 106 106 105 105 104 104 104 104 104 104 104 104 105 105 105 105 106 106 105 105 105 104 104 103 103 103 103 103 104 105 105 106 105 104 104 104 104 104 104 104 104 103 103 103 103 103 103 104 105 105 105 103 103 103 103 103 103 103 104 105 105 104
1992A04%J%%j%jj%%%%j%j%%%%J%%%JJJ%%%%%%%j%j%J%j%%Jj%%%jj%%JJ%%%j%%%%%j%%%%j%
1985I9%%JJ%%J%Jj%j%%%%%%%j%%%%J%Jj%j%%%%J%J%%j%J%%%%j%%%%%%%%%%%%%%%%%%%%%%%
1978A01%jJJj%%%%%%JJj%%j%%jJ%%jJ%%%jjJ%J%%%%%jJ%%%%%%%jj%%%%J%%J%%%J%%j%%%%%
1970A01%%%%%%%j%%%%%%J%%%%j%%%J%Jj%jj%J%%%%%%%%%%%%%%%%%%%%J%j%%%%%Jj%%%%%%%
1963A00%%%%%%J%%%%J%j%j%j%%J%%J%j%%%JJjj%%J%%%%j%%jj%%JJ%%%jJ%jJ%J%Jj%%%jjJj
1956I9%J%%J%%%%%%j%%%%jJ%J%%%%%%jj%J%%%%jJ%%J%%jj%jJ%%j%%JJ%%%%%%j%%J%%%%%J%
1948A01%%%J%j%j%%J%%%%%j%%%Jj%%%%%%%%j%%%%%%%%JJ%%%%%%%%%%%%%%j%%%%%j%%%%J%%
1941A00%j%JJ%%%%j%j%%%J%%%j%jJJJjJ%%%%%%%%%j%%%%%%%J%%j%j%J%%%J%%%%%%%%%j%jJ
$$ plain form
1992 104 104 105 105 105 104 104 103 102 102 102 102 102 101 101 100 100 100 100 100 101 101 101 101 102 103 104 104 104 104 104 104 104 104 103 103 102 102 103 103 102 102 102 103 102 102 102 102 101 100 100 100 101 102 102 102 102 101 101 101 101 101 101 100 100 100 100 100 99 99
1985 99 99 99 100 101 101 101 102 102 103 102 102 101 101 101 101 101 101 101 101 100 100 100 100 100 101 101 102 101 101 100 100 100 100 100 101 101 102 102 102 101 101 102 102 102 102 102 101 101 101 101 101 101 101 101 101 101 101 101 101 101 101 101 101 101 101 101 101 101 101 101
1978 101 101 100 101 102 101 101 101 101 101 101 101 102 103 102 102 102 101 101 101 100 101 101 101 100 101 101 101 101 100 99 100 100 101 101 101 101 101 101 100 101 101 101 101 101 101 101 101 100 99 99 99 99 99 100 100 100 101 101 101 101 102 102 102 101 101 101 101 101 101
1970 101 101 101 101 101 101 101 101 100 100 100 100 100 100 100 101 101 101 101 101 100 100 100 100 101 101 102 101 101 100 99 99 100 100 100 100 100 100 100 100 100 100 100 100 100 100 100 100 100 100 100 100 100 101 101 100 100 100 100 100 100 101 100 100 100 100 100 100 100 100
1963 100 100 100 100 100 100 100 101 101 101 101 101 102 102 101 101 100 100 99 99 99 100 100 100 101 101 100 100 100 100 101 102 101 100 100 100 101 101 101 101 101 100 100 100 99 98 98 98 99 100 100 100 100 99 100 100 99 100 100 101 101 102 101 101 101 101 100 99 100 99
1956 99 99 100 100 100 101 101 101 101 101 101 101 100 100 100 100 100 99 100 100 101 101 101 101 101 101 101 100 99 99 100 100 100 100 100 99 100 100 100 101 101 101 100 99 99 98 99 99 99 98 98 98 99 100 100 100 100 100 100 100 99 99 99 100 100 100 100 100 100 101 101
1948 101 101 101 101 102 102 101 101 100 100 100 101 101 101 101 101 101 100 100 100 100 101 100 100 100 100 100 100 100 100 100 99 99 99 99 99 99 99 99 99 100 101 101 101 101 101 101 101 101 101 101 101 101 101 101 101 100 100 100 100 100 100 99 99 99 99 99 100 100 100
1941 100 100 99 99 100 101 101 101 101 101 100 100 99 99 99 99 100 100 100 100 99 99 98 99 100 101 100 101 101 101 101 101 101 101 101 101 101 100 100 100 100 100 100 100 100 101 101 101 100 100 99 99 100 100 100 100 101 101 101 101 101 101 101 101 101 101 100 100 99 100
1934A00%%%%%%%j%%%%%%%J%J%%j%%%%%%%%%%JJ%%j%j%%J%%%%J%j%%j%%%%%%%%%%%%%%%%%%
1926A00%%j%%Jj%J%%J%%%%%%%%%%%j%j%%%%%J%%%%%%%%%J%%%j%%%%%%%jJ%J%j%%%J%%%%%j
1919A00%%JJJ%%jj%j%%%%j%JJ%Jj%%%%%J%j%%%%%%%%%%%j%%j%%JJ%%Jj%%%j%jJ%%J%%j%J%
1912A01%j%%%%%%%%%%%JJj%%%j%%%%j%%J%%%%J%j%%jJ%%%%%%%%%j%%%%%J%%j%%%%%%%%J%j
1904I9%%%%%%Jj%%JJj%J%%j%%%%%%%%J%j%%%%%%%%%J%j%%%%%%%J%%j%%j%%J%%%%%%J%%%j%
1897A00%%j%%%%%%Jj%jJ%%%%%%%%%%J%%J%%%%j%%%%%%%%%J%%j%%j%%%%%J%%%Jj%j%%%J%%j
1890I9J%%%%%j%%%%jJ%%J%%%%%%%%j%%J%%%j%J%%J%J%%%%jJ%%%%j%%j%%%J%j%%J%%%%%%%%
1882A01j%%%%Jj%%J%%%%%%%%%%j%%%%J%%%%jjJJjjJ%j%J%%%%%j%%%J%%%%%%j%%JJ%j%%%%%
$$ plain form
1934 100 100 100 100 100 100 100 100 99 99 99 99 99 99 99 99 100 100 101 101 101 100 100 100 100 100 100 100 100 100 100 100 101 102 102 102 101 101 100 100 100 101 101 101 101 101 102 102 101 101 101 100 100 100 100 100 100 100 100 100 100 100 100 100 100 100 100 100 100 100
1926 100 100 100 99 99 99 100 99 99 100 100 100 101 101 101 101 101 101 101 101 101 101 101 101 100 100 99 99 99 99 99 99 100 100 100 100 100 100 100 100 100 100 101 101 101 101 100 100 100 100 100 100 100 100 99 100 100 101 101 100 100 100 100 101 101 101 101 101 101 100
1919 100 100 100 101 102 103 103 103 102 101 101 100 100 100 100 100 99 99 100 101 101 102 101 101 101 101 101 101 102 102 101 101 101 101 101 101 101 101 101 101 101 101 100 100 100 99 99 99 100 101 101 101 102 101 101 101 101 100 100 99 100 100 100 101 101 101 100 100 101 101
1912 101 101 100 100 100 100 100 100 100 100 100 100 100 100 101 102 101 101 101 101 100 100 100 100 100 99 99 99 100 100 100 100 100 101 101 100 100 100 99 100 100 100 100 100 100 100 100 100 100 99 99 99 99 99 99 100 100 100 99 99 99 99 99 99 99 99 99 100 100 99
1904 99 99 99 99 99 99 99 100 99 99 99 100 101 100 100 101 101 101 100 100 100 100 100 100 100 100 100 101 101 100 100 100 100 100 100 100 100 100 100 101 101 100 100 100 100 100 100 100 100 101 101 101 100 100 100 99 99 99 100 100 100 100 100 100 100 101 101 101 101 100 100
1897 100 100 100 99 99 99 99 99 99 99 100 99 99 98 99 99 99 99 99 99 99 99 99 99 99 100 100 100 101 101 101 101 101 100 100 100 100 100 100 100 100 100 100 101 101 101 100 100 100 99 99 99 99 99 99 100 100 100 100 101 100 100 99 99 99 99 100 100 100 99
1890 99 100 100 100 100 100 100 99 99 99 99 99 98 99 99 99 100 100 100 100 100 100 100 100 100 99 99 99 100 100 100 100 99 99 100 100 100 101 101 102 102 102 102 102 101 102 102 102 102 102 101 101 101 100 100 100 100 101 101 100 100 100 101 101 101 101 101 101 101 101 101
1882 101 100 100 100 100 100 101 100 100 100 101 101 101 101 101 101 101 101 101 101 101 100 100 100 100 100 101 101 101 101 101 100 99 100 101 100 99 100 100 99 99 100 100 100 100 100 100 99 99 99 99 100 100 100 100 100 100 100 99 99 99 100 101 101 100 100 100 100 100 100
1875A00%J%J%%j%%j%%%J%%%%%%Jj%%%%%%%%%%jjj%J%J%JJj%J%%Jjj%JjJ%j%%%%%%%%j%%%j
1868I9jJJ%J%%%%j%J%%jJ%%%%%%J%j%%%j%%J%%%%%%%J%%%jjJ%%j%j%%%%%Jj%%%%%%J%%J%%
1860A01%J%j%%%%%%%j%%%JJ%%jj%Jj%J%%%J%%%jj%%%%Jj%%%%%%J%jJ%%%%j%%J%%J%j%%%j%
1853A00%%%J%jJ%%j%Jjj%%%%JJJj%%%%%%%%jJ%Jj%%%%%%%%%%J%%%%j%j%%%%J%%Jj%%%%%%%
1846A01%%%J%%%%%%%%%%%%j%%%jJ%j%J%%%%J%J%%Jj%%j%%%J%%%%j%%%%j%Jj%%JJ%jjJ%%%%
1838A02%jjJ%%%JJ%J%%%%j%%j%%j%J%%%%%%%%%%%%%%j%J%%%%%%%%%%%%%jJJ%%j%jjjJJ%%%
1831A01j%JJ%%%J%J%j%%j%%jJ%%%%%%%%%%%%%J%%%%%%%%%Jjj%J%%J%%j%%%%%%J%%%jJJ%%j
1824A04%%%j%%%%%%J%%%%%j%j%J%%J%%%%J%J%%%j%j%%JK%%%%%%JJ%j%%%J%J%%%J%J%%JJJJ
$$ plain form
1875 100 100 101 101 102 102 102 101 101 101 100 100 100 100 101 101 101 101 101 101 101 102 101 101 101 101 101 101 101 101 101 101 101 100 99 98 98 99 99 100 100 101 102 101 101 102 102 102 103 102 101 101 102 101 102 102 101 101 101 101 101 101 101 101 101 100 100 100 100 99
1868 99 98 99 100 100 101 101 101 101 101 100 100 101 101 101 100 101 101 101 101 101 101 101 102 102 101 101 101 101 100 100 100 101 101 101 101 101 101 101 101 102 102 102 102 101 100 101 101 101 100 100 99 99 99 99 99 99 100 99 99 99 99 99 99 99 100 100 100 101 101 101
1860 101 101 102 102 101 101 101 101 101 101 101 101 100 100 100 100 101 102 102 102 101 100 100 101 100 100 101 101 101 101 102 102 102 102 101 100 100 100 100 100 101 100 100 100 100 100 100 100 101 101 100 101 101 101 101 101 100 100 100 101 101 101 102 102 101 101 101 101 100 100
1853 100 100 100 100 101 101 100 101 101 101 100 100 101 100 99 99 99 99 99 100 101 102 101 101 101 101 101 101 101 101 101 100 101 101 102 101 101 101 101 101 101 101 101 101 101 101 102 102 102 102 102 101 101 100 100 100 100 100 101 101 101 102 101 101 101 101 101 101 101 101
1846 101 101 101 101 102 102 102 102 102 102 102 102 102 102 102 102 102 101 101 101 101 100 101 101 100 100 101 101 101 101 101 102 102 103 103 103 104 103 103 103 102 102 102 102 103 103 103 103 103 102 102 102 102 102 101 101 102 101 101 101 102 103 103 102 101 102 102 102 102 102
1838 102 102 101 100 101 101 101 101 102 103 103 104 104 104 104 104 103 103 103 102 102 102 101 101 102 102 102 102 102 102 102 102 102 102 102 102 102 102 102 101 101 102 102 102 102 102 102 102 102 102 102 102 102 102 102 101 102 103 103 103 102 102 101 100 99 100 101 101 101 101
1831 101 100 100 101 102 102 102 102 103 103 104 104 103 103 103 102 102 102 101 102 102 102 102 102 102 102 102 102 102 102 102 102 102 103 103 103 103 103 103 103 103 103 103 104 103 102 102 103 103 103 104 104 104 103 103 103 103 103 103 103 104 104 104 104 103 104 105 105 105 104
1824 104 104 104 104 103 103 103 103 103 103 103 104 104 104 104 104 104 103 103 102 102 103 103 103 104 104 104 104 104 105 105 106 106 106 106 105 105 104 104 104 105 107 107 107 107 107 107 107 108 109 109 108 108 108 108 109 109 110 110 110 110 111 111 112 112 112 113 114 115 116
1816A16J%JJJJJJJJKJJKJJKKJJKKKJJJJJJ%KJKJJKJJJJ%J%J%J%%j%%%%j%%j%jkjjj%jkkjj
1809A51kjjkkjjjkjjjjjjkkjjjj%jjkjjjjjj%j%j%j%%jj%jJ%%J%j%j%%j%J%%%%j%J%%j%%%
1802A07%%%J%%j%JJ%%j%%%%%%j%J%%j%j%%Jj%j%%J%%%%%%J%%%jj%%%%%%JJ%J%j%%Jjj%J%%
1794A07J%j%%%%%%%%%%J%%j%jJ%%Jj%%J%%%%%%%%%%%%%%J%%JJJ%j%%j%%%%J%%%%%J%%%J%J
1787A14%J%%%%J%%%%%%%%%%%%%%J%%%J%Jj%j%%J%J%j%%%%%%J%%%%%%%%%%%J%%%j%%%%%j%%
1780A18J%%J%j%%J%%jj%J%J%%%%%%%%J%%%%jjJJJ%%%%j%J%%%J%j%JJ%JJJJJ%%%J%%J%J%%J
1773A33%J%JJ%%%%%J%J%%%%JJ%%JJ%%J%JJ%%%JJ%%JK%J%J%%JJJJJ%Jj%JJJJJ%JJJJJ%JJJ%
1765A70JJJ%JJJJJJKJJKJKKJJKJKKKJKKLJLKKLKLKLKKLKKLKLKMLMMLMMMNMNLLMLLMLLLLLM
$$ plain form
1816 116 117 117 118 119 120 121 122 123 124 125 127 128 129 131 132 133 135 137 138 139 141 143 145 146 147 148 149 150 151 151 153 154 156 157 158 160 161 162 163 164 164 165 165 166 166 167 167 167 166 166 166 166 166 165 165 165 164 164 163 161 160 159 158 158 157 155 153 152 151
1809 151 149 148 147 145 143 142 141 140 138 137 136 135 134 133 132 130 128 127 126 125 124 124 123 122 120 119 118 117 116 115 114 114 113 113 112 112 111 111 111 110 109 109 108 109 109 109 110 110 109 109 108 108 108 107 107 108 108 108 108 108 107 107 108 108 108 107 107 107 107
1802 107 107 107 107 108 108 108 107 107 108 109 109 109 108 108 108 108 108 108 108 107 107 108 108 108 107 107 106 106 106 107 106 106 105 105 105 106 106 106 106 106 106 106 107 107 107 107 106 105 105 105 105 105 105 105 106 107 107 108 108 107 107 107 108 107 106 106 107 107 107
1794 107 108 108 107 107 107 107 107 107 107 107 107 107 107 108 108 108 107 107 106 107 107 107 108 107 107 107 108 108 108 108 108 108 108 108 108 108 108 108 108 108 108 109 109 109 110 111 112 112 111 111 111 110 110 110 110 110 111 111 111 111 111 111 112 112 112 112 113 113 114
1787 114 114 115 115 115 115 115 116 116 116 116 116 116 116 116 116 116 116 116 116 116 116 117 117 117 117 118 118 119 118 118 117 117 117 118 118 119 119 118 118 118 118 118 118 118 119 119 119 119 119 119 119 119 119 119 119 119 120 120 120 120 119 119 119 119 119 119 118 118 118
1780 118 119 119 119 120 120 119 119 119 120 120 120 119 118 118 119 119 120 120 120 120 120 120 120 120 120 121 121 121 121 121 120 119 120 121 122 122 122 122 122 121 121 122 122 122 122 123 123 122 122 123 124 124 125 126 127 128 129 129 129 129 130 130 130 131 131 132 132 132 133
1773 133 133 134 134 135 136 136 136 136 136 136 137 137 138 138 138 138 138 139 140 140 140 141 142 142 142 143 143 144 145 145 145 145 146 147 147 147 148 150 150 151 151 152 152 152 153 154 155 156 157 157 158 157 157 158 159 160 161 162 162 163 164 165 166 167 167 168 169 170 170
1765 170 171 172 173 173 174 175 176 177 178 179 181 182 183 185 186 188 190 191 192 194 195 197 199 201 202 204 206 209 210 213 215 217 220 222 225 227 230 232 234 237 239 241 244 246 249 251 255 258 262 266 269 273 277 281 286 290 295 298 301 305 308 311 315 318 321 324 327 330 334
1758C34MMMMMNMMMLLKLLLMNMMMMONOMONOOOOOOPPQQQRRRJ1J1J2J2J3J4J5J6J7J7J9K1K2K2
1752G68K5K6K8L0L2L4L5L9M1M4M7N2N5N9O2O7P2P8Q4R0R8J05J13J22J32J42J53J63J74J84
1749C154J94K04K11K18K22K23K22K19K14K10K06K04K04K07K12K19K28K36K46K53K58K61K58
1746H283K49K35K16J95J75J55J41J30J25J25J28J32J38J42J45J44J37J25J02P3L7lm0p5j02
1744A1112j24j38j48j52j52j50j47j44j41j42j46j55j69j87k07k26k40k50k56k57k57k53k48
1741F823k42k34k27k20k15k10k08k08k10k14k15k16k15k13k10k06j99j93j86j76j67j58j47
1739B134j38j27j17j08j00r1q5p8p1o5n8n3m9m6m3l9l5l3l2k9k7k5k2k2k1k0j9j7j6j5j5j5
1736E03j3j2j2j2j2j2j0qrrqqqqppppopoononommmnmnmmmmmmnlllkllkllkkkllklkjkjkjk
$$ plain form
1758 334 338 342 346 350 354 359 363 367 371 374 377 379 382 385 388 392 397 401 405 409 413 419 424 430 434 440 445 451 457 463 469 475 481 488 495 503 511 519 528 537 546 557 568 580 592 605 619 634 650 667 684 703 724 746 768
1752 768 793 819 847 877 909 943 978 1017 1058 1102 1149 1201 1256 1315 1377 1444 1516 1594 1678 1768 1866 1971 2084 2206 2338 2480 2633 2796 2970 3154
1749 3154 3348 3552 3763 3981 4203 4426 4648 4867 5081 5291 5497 5701 5905 6112 6324 6543 6771 7007 7253 7506 7764 8025 8283
1746 8283 8532 8767 8983 9178 9353 9508 9649 9779 9904 10029 10157 10289 10427 10569 10714 10858 10995 11120 11222 11295 11332 11329 11289 11214 11112
1744 11112 10988 10850 10702 10550 10398 10248 10101 9957 9816 9674 9528 9373 9204 9017 8810 8584 8344 8094 7838 7581 7324 7071 6823
1741 6823 6581 6347 6120 5900 5685 5475 5267 5059 4849 4635 4420 4204 3989 3776 3566 3360 3161 2968 2782 2606 2439 2281 2134
1739 2134 1996 1869 1752 1644 1544 1453 1368 1290 1219 1154 1096 1043 994 948 905 866 831 798 766 737 710 685 663 641 620 600 581 564 548 533 518 503
1736 503 490 478 466 454 442 430 420 412 403 394 386 378 370 362 355 348 341 334 328 321 315 309 304 298 293 287 283 279 275 270 266 261 257 253 249 245 241 237 232 229 226 223 221 218 215 213 210 207 205 203 201 198 195 193 190 188 187 185 184 182 181 179
1729A79jj%jjjkjjk%j%jjj%%j%j%%JJjj%j%j%%%j%%%%J%%%J%jj%jjjJ%Jj%%%%jjjJj%j%j%
1722A52j%%%jjj%j%jjj%j%j%jj%j%%J%jjj%%%j%j%Jj%%Jj%%%%j%%%j%%%%%%%j%%%%%j%J%j
1714A31j%%%%%%%%J%J%%j%j%J%jj%%j%%j%%jJ%%%%%j%jj%%jj%%j%j%j%J%%j%j%J%j%%%j%j
1707A16%%%Jj%%%%Jjj%%%%J%%%%%%Jjjj%%%%%J%j%jJ%%j%%J%%%%j%j%%%%Jj%J%%%%%J%%%%
1700A14J%%%j%%%J%%%j%%%%J%%%%%%j%%%%%%%%%JJ%j%j%%j%%%%%J%%%j%J%j%%J%%%%j%%%%
1692A13%%%%j%%j%j%%%JJ%%%j%j%%%%%%J%%%%%%%%J%%%%%%%%j%%%%%%%%%J%%%%%jkJ%%J%%
1685A11%%%%jJ%jJ%%jj%J%%%J%jJ%%%%%%%jJ%J%%Jj%%%%%%JJK%J%J%%JJK%KJJJ%J%JKJKKK
1678A38JJJJKJJJJKJJJJKJKJJ%JJJJ%JJJJJJ%%j%jjj%jkjjjj%%jkjjkjjjkkkjkkjjjj%jjj
$$ plain form
1729 179 178 177 177 176 175 174 172 171 170 168 168 167 167 166 165 164 164 164 163 163 162 162 162 163 164 163 162 162 161 161 160 160 160 160 159 159 159 159 159 160 160 160 160 161 161 160 159 159 158 157 156 157 157 158 157 157 157 157 157 156 155 154 155 154 154 153 153 152 152
1722 152 151 151 151 151 150 149 148 148 147 147 146 145 144 144 143 143 142 142 141 140 140 139 139 139 140 140 139 138 137 137 137 137 136 136 135 135 136 135 135 135 136 135 135 135 135 135 134 134 134 134 133 133 133 133 133 133 133 133 132 132 132 132 132 132 131 131 132 132 131
1714 131 130 130 130 130 130 130 130 130 130 131 131 132 132 132 131 131 130 130 131 131 130 129 129 129 128 128 128 127 127 127 126 127 127 127 127 127 127 126 126 125 124 124 124 123 122 122 122 121 121 120 120 119 119 120 120 120 119 119 118 118 119 119 118 118 118 118 117 117 116
1707 116 116 116 116 117 116 116 116 116 116 117 116 115 115 115 115 115 116 116 116 116 116 116 116 117 116 115 114 114 114 114 114 114 115 115 114 114 113 114 114 114 113 113 113 114 114 114 114 114 113 113 112 112 112 112 112 113 112 112 113 113 113 113 113 113 114 114 114 114 114
1700 114 115 115 115 115 114 114 114 114 115 115 115 115 114 114 114 114 114 115 115 115 115 115 115 115 114 114 114 114 114 114 114 114 114 114 115 116 116 115 115 114 114 114 113 113 113 113 113 113 114 114 114 114 113 113 114 114 113 113 113 114 114 114 114 114 113 113 113 113 113
1692 113 113 113 113 113 112 112 112 111 111 110 110 110 110 111 112 112 112 112 111 111 110 110 110 110 110 110 110 111 111 111 111 111 111 111 111 111 112 112 112 112 112 112 112 112 112 111 111 111 111 111 111 111 111 111 111 112 112 112 112 112 112 111 109 110 110 110 111 111 111
1685 111 111 111 111 111 110 111 111 110 111 111 111 110 109 109 110 110 110 110 111 111 110 111 111 111 111 111 111 111 111 110 111 111 112 112 112 113 112 112 112 112 112 112 112 113 114 116 116 117 117 118 118 118 119 120 122 122 124 125 126 127 127 128 128 129 131 132 134 136 138
1678 138 139 140 141 142 144 145 146 147 148 150 151 152 153 154 156 157 159 160 161 161 162 163 164 165 165 166 167 168 169 170 171 171 171 170 170 169 168 167 167 166 164 163 162 161 160 160 160 159 157 156 155 153 152 151 150 148 146 144 143 141 139 138 137 136 135 135 134 133 132
1670A32jjkjk%%jjkkjjjjjjj%j%j%%%%%%%%%j%jj%%j%%%JJ%%%%j%jj%%%%%Jj%%J%%%%jJ%%
1663A06%Jj%%%%%j%%%%J%%%%j%%%J%jj%%%%J%%j%%%%%%%%%%%%%%%%%%%%%%%j%JJ%%j%%%%%
1656A04%%jJ%%%%%%%%%j%J%%jJ%%j%jJ%%%%%%J%%%%%%%%%j%%jj%J%JJ%%%%%%%j%%%j%%J%J
1649A04%jJ%J%%jjJ%j%%%J%%%jJ%%%%%%%%kJ%%%%%%%%%%j%J%%%%jj%%J%%JJ%%%J%j%j%%%%
1641A03%%%%%j%%J%%Jj%%%%%%%%%%%%%%%%J%j%%JjjJ%Jj%%%%j%%J%%%%%%%%j%%%%%J%%jj%
1634A01%J%%%%%J%%%%%%%j%%J%%%%J%%%%J%%j%j%k%%J%J%%%j%%J%%%j%J%%%%%%%Jj%j%%J%
1627A03%%%j%%%%%%%jJ%%%%%%%J%%%%%%%Jj%%%%%%%Jjj%jJ%%J%j%%%%%Jj%%%%J%%jJJ%j%%
1619A03j%%jJ%%%%%j%%%%%J%%%%J%j%%%%%%%J%%%jJ%%jJ%%%%%%J%%%%%%J%Jj%%%Jj%j%%%%
$$ plain form
1670 132 131 130 128 127 125 125 125 124 123 121 119 118 117 116 115 114 113 112 112 111 111 110 110 110 110 110 110 110 110 110 110 109 109 108 107 107 107 106 106 106 106 107 108 108 108 108 108 107 107 106 105 105 105 105 105 105 106 105 105 105 106 106 106 106 106 105 106 106 106
1663 106 106 107 106 106 106 106 106 106 105 105 105 105 105 106 106 106 106 106 105 105 105 105 106 106 105 104 104 104 104 104 105 105 105 104 104 104 104 104 104 104 104 104 104 104 104 104 104 104 104 104 104 104 104 104 104 104 104 103 103 104 105 105 105 104 104 104 104 104 104
1656 104 104 104 103 104 104 104 104 104 104 104 104 104 104 103 103 104 104 104 103 104 104 104 103 103 102 103 103 103 103 103 103 103 104 104 104 104 104 104 104 104 104 104 103 103 103 102 101 101 102 102 103 104 104 104 104 104 104 104 104 103 103 103 103 102 102 102 103 103 104
1649 104 104 103 104 104 105 105 105 104 103 104 104 103 103 103 103 104 104 104 104 103 104 104 104 104 104 104 104 104 104 102 103 103 103 103 103 103 103 103 103 103 103 102 102 103 103 103 103 103 102 101 101 101 102 102 102 103 104 104 104 104 105 105 104 104 103 103 103 103 103
1641 103 103 103 103 103 103 102 102 102 103 103 103 104 103 103 103 103 103 103 103 103 103 103 103 103 103 103 103 103 103 104 104 103 103 103 104 103 102 103 103 104 103 103 103 103 103 102 102 102 103 103 103 103 103 103 103 103 103 102 102 102 102 102 102 103 103 103 102 101 101
1634 101 101 102 102 102 102 102 102 103 103 103 103 103 103 103 103 102 102 102 103 103 103 103 103 104 104 104 104 104 105 105 105 104 104 103 103 101 101 101 102 102 103 103 103 103 102 102 102 103 103 103 103 102 102 103 103 103 103 103 103 103 103 104 103 103 102 102 102 103 103
1627 103 103 103 103 102 102 102 102 102 102 102 102 101 102 102 102 102 102 102 102 102 103 103 103 103 103 103 103 103 104 103 103 103 103 103 103 103 103 104 103 102 102 101 102 102 102 103 103 102 102 102 102 102 102 103 102 102 102 102 102 103 103 103 102 103 104 104 103 103 103
1619 103 102 102 102 101 102 102 102 102 102 102 101 101 101 101 101 101 102 102 102 102 102 103 103 102 102 102 102 102 102 102 102 103 103 103 103 102 103 103 103 102 103 103 103 103 103 103 103 104 104 104 104 104 104 104 105 105 106 105 105 105 105 106 105 105 104 104 104 104 104
1612A04%J%%%j%%%%J%j%jJ%%%JJJ%%%j%%J%%%%%%%%%JJ%J%%%%%%%%JJJj%%%%%%%KJJJ%JJ%
1605A19KJJKKJKKJKKKKKLKLMMNMNNOOPPRQQJ1J0J1J0J0J0J0J0RPQOMKKjknooqrj1j0j1j1j2
1599B57j2j1j0rrrqqooomnlmlkllklkkkkjjjjjk%%jjj%%%jj%%%%j%%%j%%%j%%%%j%%%jJ%%
1592A07%%j%%j%%%%%%%%%%j%%%%%Jj%J%J%%j%jJjj%J%jjJ%%%j%%%%%%J%%%j%%%%%j%%%%JJ
1584A03%%j%j%%J%J%j%%%%%j%%J%JJ%%kj%%%Jj%%%%%%%%%JJ%jj%%Jj%%%j%%J%J%jj%%%%Jj
1577A00%JJj%%%%%%%j%%%%J%%%j%j%%JJj%j%J%%%%%%J%Jj%%%j%%%%%J%%j%%%%%%%%J%Jj%%
1570A01%j%j%J%%%J%%%%%%%j%%%%%%%%%%%J%%J%%%%%%%%J%%%j%%j%%%%%%%%j%%%%jJ%%%%%
1562A00%%J%j%j%J%%j%JJ%%%jj%J%Jj%%%%%%j%J%%Jj%jJ%%%%%JjjJ%%j%%J%%J%%%%%jJjjJ
$$ plain form
1612 104 104 105 105 105 105 104 104 104 104 104 105 105 104 104 103 104 104 104 104 105 106 107 107 107 107 106 106 106 107 107 107 107 107 107 107 107 107 107 108 109 109 110 110 110 110 110 110 110 110 110 111 112 113 112 112 112 112 112 112 112 112 114 115 116 117 117 118 119 119
1605 119 121 122 123 125 127 128 130 132 133 135 137 139 141 143 146 148 151 155 159 164 168 173 178 184 190 197 204 213 221 229 240 250 261 271 281 291 301 311 320 327 335 341 345 347 349 348 346 341 335 329 321 312 301 291 280 269 257
1599 257 245 234 224 215 206 197 189 181 175 169 163 159 154 151 147 144 142 139 136 134 131 129 127 125 123 122 121 120 119 118 116 116 116 115 114 113 113 113 113 112 111 111 111 111 111 110 110 110 110 109 109 109 109 108 108 108 108 108 107 107 107 107 106 107 107 107
1592 107 107 107 106 106 106 105 105 105 105 105 105 105 105 105 105 105 104 104 104 104 104 104 105 104 104 105 105 106 106 106 105 105 104 105 104 103 103 104 104 103 102 103 103 103 103 102 102 102 102 102 102 102 103 103 103 103 102 102 102 102 102 102 101 101 101 101 101 102 103
1584 103 103 103 102 102 101 101 101 102 102 103 103 102 102 102 102 102 102 101 101 101 102 102 103 104 104 104 102 101 101 101 101 102 101 101 101 101 101 101 101 101 101 101 102 103 103 102 101 101 101 102 101 101 101 101 100 100 100 101 101 102 102 101 100 100 100 100 100 101 100
1577 100 100 101 102 101 101 101 101 101 101 101 101 100 100 100 100 100 101 101 101 101 100 100 99 99 99 100 101 100 100 99 99 100 100 100 100 100 100 100 101 101 102 101 101 101 101 100 100 100 100 100 100 101 101 101 100 100 100 100 100 100 100 100 100 101 101 102 101 101 101
1570 101 101 100 100 99 99 100 100 100 100 101 101 101 101 101 101 101 101 100 100 100 100 100 100 100 100 100 100 100 100 101 101 101 102 102 102 102 102 102 102 102 102 103 103 103 103 102 102 102 101 101 101 101 101 101 101 101 101 100 100 100 100 100 99 100 100 100 100 100 100
1562 100 100 100 101 101 100 100 99 99 100 100 100 99 99 100 101 101 101 101 100 99 99 100 100 101 100 100 100 100 100 100 100 99 99 100 100 100 101 100 100 99 100 100 100 100 100 100 101 100 99 100 100 100 99 99 99 100 100 100 101 101 101 101 101 101 100 101 100 99 100
1555A00%%jJj%J%%J%jj%%%J%%%%%%%%%%J%%%%%%%%%%Jjj%jJ%%J%j%j%J%%%j%%%J%j%%J%j%
1548I9%J%%%%%%%J%j%j%%%jJ%%%%%%%%%J%%%%%J%%%%%Jjj%%j%J%%j%JJ%%%%%j%%%%%%%%%%
1540A00%%%K%%%%%jjj%J%%%%j%J%J%j%%%J%%J%%J%%%J%j%J%%j%%j%%%%j%%Jj%%%%J%jj%K%
1533A02jj%%%%%%%%%%%j%%%%%%%%%%%%%%j%J%%%%%%J%%%%%%%%j%%%%J%Jj%%%J%%%%%%j%%%
1526A00%%%Jj%%%jJ%%%%%%%%%%%%JJ%%%jj%%j%JJjj%J%%%%%%%j%jJ%J%%%j%%%%%%%%%%Jj%
1518I9%J%%%%j%%JJ%j%%jJ%%j%j%%%JJ%%%%%%J%j%j%J%%%j%%%%%%J%%jj%%%JJ%jJ%%%j%J%
1511A00%%%J%j%%J%j%%%%%%Jj%%%%%%%%Jj%jjJ%JJJ%j%j%%%j%%%%%j%%j%%J%%J%%%%%jJ%j
1504I8%%%J%%%j%J%%J%%%Jjjj%K%%%%%%%j%%%%%%%%j%%JJJ%j%%%%%%%%%jJJ%%%J%%%j%JJ%
$$ plain form
1555 100 100 100 99 100 99 99 100 100 100 101 101 100 99 99 99 99 100 100 100 100 100 100 100 100 100 100 100 101 101 101 101 101 101 101 101 101 101 101 102 101 100 100 99 100 100 100 101 101 100 100 99 99 100 100 100 100 99 99 99 99 100 100 99 99 99 100 100 99 99
1548 99 99 100 100 100 100 100 100 100 100 101 101 100 100 99 99 99 99 98 99 99 99 99 99 99 99 99 99 99 100 100 100 100 100 100 101 101 101 101 101 101 102 101 100 100 100 99 99 100 100 100 99 99 100 101 101 101 101 101 101 100 100 100 100 100 100 100 100 100 100 100
1540 100 100 100 100 102 102 102 102 102 102 101 100 99 99 100 100 100 100 100 99 99 100 100 101 101 100 100 100 100 101 101 101 102 102 102 103 103 103 103 104 104 103 103 104 104 104 103 103 103 102 102 102 102 102 101 101 101 102 101 101 101 101 101 102 102 101 100 100 102 102
1533 102 101 100 100 100 100 100 100 100 100 100 100 100 100 99 99 99 99 99 99 99 99 99 99 99 99 99 99 99 98 98 99 99 99 99 99 99 99 100 100 100 100 100 100 100 100 100 99 99 99 99 99 100 100 101 100 100 100 100 101 101 101 101 101 101 101 100 100 100 100
1526 100 100 100 100 101 100 100 100 100 99 100 100 100 100 100 100 100 100 100 100 100 100 100 101 102 102 102 102 101 100 100 100 99 99 100 101 100 99 99 100 100 100 100 100 100 100 100 99 99 98 99 99 100 100 100 100 99 99 99 99 99 99 99 99 99 99 99 100 99 99
1518 99 99 100 100 100 100 100 99 99 99 100 101 101 100 100 100 99 100 100 100 99 99 98 98 98 98 99 100 100 100 100 100 100 100 101 101 100 100 99 99 100 100 100 100 99 99 99 99 99 99 99 100 100 100 99 98 98 98 98 99 100 100 99 100 100 100 100 99 99 100 100
1511 100 100 100 100 101 101 100 100 100 101 101 100 100 100 100 100 100 100 101 100 100 100 100 100 100 100 100 100 101 100 100 99 98 99 99 100 101 102 102 101 101 100 100 100 100 99 99 99 99 99 99 98 98 98 97 97 97 98 98 98 99 99 99 99 99 99 98 99 99 98
1504 98 98 98 98 99 99 99 99 98 98 99 99 99 100 100 100 100 101 100 99 98 98 100 100 100 100 100 100 100 100 99 99 99 99 99 99 99 99 99 98 98 98 99 100 101 101 100 100 100 100 100 100 100 100 100 100 99 100 101 101 101 101 102 102 102 102 101 101 102 103 103
1496A03%j%j%%%J%%%%jJ%%j%%%j%J%%%Jj%%%j%%%%%%%%%%%%%%%%%%%%j%%J%%%JJj%j%%%%j
1489I9%J%%%%j%J%Jj%%%%%Jj%j%%%%%%J%%%%J%%%%%%j%j%%%%%%%j%%J%%%%%%%%%%%Jj%%%%
1482I9%%%jJ%J%%%Jj%%%j%J%%%%%%%%%%%%%jj%J%%%%%%%%%%%%%%%%%%%%J%%%%%%%%%%%%%%
1474A00%j%JJJ%j%jj%%%%%%%%%%J%%%%%j%%%%%%j%%%%jJ%%%%%%%%%%%%%%%j%J%%%%%%%%%J
1467I9%%%%%J%%JjjJ%Jj%%%%jJ%J%j%jjj%%J%%%%%%%JJ%j%j%%%%%J%%%%%%%%%%JJ%%jjj%%
1459I8%J%%%%J%j%%J%%j%%%%%%%%%%%%%%%Jj%%%J%%%%%J%%j%%j%%J%%%%%%%%%J%%JJ%Jj%J
1452A04J%%%%j%J%%j%%%%jj%%%j%%%%%%j%%%%%%%j%%J%%%%%%%%%%%%%jJj%%JJ%%j%j%%%%%
1445I9j%j%%JJ%j%J%%%%%%%%j%%JJJj%%%j%%%j%%%%%%%%J%jj%%%J%%jJ%J%%%%%%%%%j%%%%
$$ plain form
1496 103 103 102 102 101 101 101 101 102 102 102 102 102 101 102 102 102 101 101 101 101 100 100 101 101 101 101 102 101 101 101 101 100 100 100 100 100 100 100 100 100 100 100 100 100 100 100 100 100 100 100 100 100 99 99 99 100 100 100 100 101 102 101 101 100 100 100 100 100 99
1489 99 99 100 100 100 100 100 99 99 100 100 101 100 100 100 100 100 100 101 100 100 99 99 99 99 99 99 99 100 100 100 100 100 101 101 101 101 101 101 101 100 100 99 99 99 99 99 99 99 99 98 98 98 99 99 99 99 99 99 99 99 99 99 99 99 100 99 99 99 99 99
1482 99 99 99 99 98 99 99 100 100 100 100 101 100 100 100 100 99 99 100 100 100 100 100 100 100 100 100 100 100 100 100 100 99 98 98 99 99 99 99 99 99 99 99 99 99 99 99 99 99 99 99 99 99 99 99 99 100 100 100 100 100 100 100 100 100 100 100 100 100 100 100
1474 100 100 99 99 100 101 102 102 101 101 100 99 99 99 99 99 99 99 99 99 99 99 100 100 100 100 100 100 99 99 99 99 99 99 99 98 98 98 98 98 97 98 98 98 98 98 98 98 98 98 98 98 98 98 98 98 98 97 97 98 98 98 98 98 98 98 98 98 98 99
1467 99 99 99 99 99 99 100 100 100 101 100 99 100 100 101 100 100 100 100 100 99 100 100 101 101 100 100 99 98 97 97 97 98 98 98 98 98 98 98 98 99 100 100 99 99 98 98 98 98 98 98 99 99 99 99 99 99 99 99 99 99 99 100 101 101 101 100 99 98 98 98
1459 98 98 99 99 99 99 99 100 100 99 99 99 100 100 100 99 99 99 99 99 99 99 99 99 99 99 99 99 99 99 99 100 99 99 99 99 100 100 100 100 100 100 101 101 101 100 100 100 99 99 99 100 100 100 100 100 100 100 100 100 100 101 101 101 102 103 103 104 103 103 104
1452 104 105 105 105 105 105 104 104 105 105 105 104 104 104 104 104 103 102 102 102 102 101 101 101 101 101 101 101 100 100 100 100 100 100 100 100 99 99 99 100 100 100 100 100 100 100 100 100 100 100 100 100 100 99 100 99 99 99 100 101 101 101 100 100 99 99 99 99 99 99
1445 99 98 98 97 97 97 98 99 99 98 98 99 99 99 99 99 99 99 99 99 98 98 98 99 100 101 100 100 100 100 99 99 99 99 98 98 98 98 98 98 98 98 98 99 99 98 97 97 97 97 98 98 98 97 98 98 99 99 99 99 99 99 99 99 99 99 98 98 98 98 98
1437I8J%%%J%j%%j%%J%%Jjj%jJ%J%%J%j%%%%%j%%%j%%J%%Jj%%JJj%%%JJjj%%%j%jJ%%%%%%
1430I8%J%%%j%jJ%%%%J%%%%%%%%%%%%%%J%%%j%%%%%%j%%%%%%%%%%J%%jj%%%%%%J%%%%%%%%
1422I8%%%j%%JJ%%%%J%j%j%%%%%%%%%%%%%%jJJ%j%%%%J%%j%%%%%%%%%%%%%%J%%%%j%%%J%j
1415I8j%jJJ%J%%%j%%jJ%%J%%%%%j%%%%J%%Jj%%%%Jj%%%j%%%%%%%%%%%j%J%%J%%%%%%%%%%
1408I9%%%%j%Jj%J%Jj%%j%J%%%%%j%j%JJ%%%J%j%%JjjjJ%J%%%%Jj%j%%JJj%%jJ%j%JJ%j%%
1400I9%%%jJ%%%j%%J%%%%jJJ%%%j%%%%%%j%%%%J%%%%%%J%j%j%%JJ%%%j%%%%%%j%J%%K%%%j
1393A00%%j%JJ%%%%%J%j%%%%%%%%Jj%%%J%%%%%%J%J%%J%%%JJ%%J%J%%%JKJJJKJ%%JKKKKKL
1385A32LLLLMMMNOPOPPPOOMMK%kkmnoopnpopponmmmmlllkkjkkjjjj%%j%j%j%j%%%j%%j%jj
$$ plain form
1437 98 99 99 99 99 100 100 99 99 99 98 98 98 99 99 99 100 99 98 98 97 98 98 99 99 99 100 100 99 99 99 99 99 99 98 98 98 98 97 97 97 98 98 98 99 98 98 98 99 100 99 99 99 99 100 101 100 99 99 99 99 98 98 97 98 98 98 98 98 98 98
1430 98 98 99 99 99 99 98 98 97 98 98 98 98 98 99 99 99 99 99 99 99 99 99 99 99 99 99 99 99 100 100 100 100 99 99 99 99 99 99 99 98 98 98 98 98 98 98 98 98 98 98 99 99 99 98 97 97 97 97 97 97 97 98 98 98 98 98 98 98 98 98
1422 98 98 98 98 97 97 97 98 99 99 99 99 99 100 100 99 99 98 98 98 98 98 98 98 98 98 98 98 98 98 98 98 97 98 99 99 98 98 98 98 98 99 99 99 98 98 98 98 98 98 98 98 98 98 98 98 98 98 98 99 99 99 99 99 98 98 98 98 99 99 98
1415 98 97 97 96 97 98 98 99 99 99 99 98 98 98 97 98 98 98 99 99 99 99 99 99 98 98 98 98 98 99 99 99 100 99 99 99 99 99 100 99 99 99 99 98 98 98 98 98 98 98 98 98 98 98 98 97 97 98 98 98 99 99 99 99 99 99 99 99 99 99 99
1408 99 99 99 99 99 98 98 99 98 98 99 99 100 99 99 99 98 98 99 99 99 99 99 99 98 98 97 97 98 99 99 99 99 100 100 99 99 99 100 99 98 97 98 98 99 99 99 99 99 100 99 99 98 98 98 99 100 99 99 99 98 99 99 98 98 99 100 100 99 99 99
1400 99 99 99 99 98 99 99 99 99 98 98 98 99 99 99 99 99 98 99 100 100 100 100 99 99 99 99 99 99 99 98 98 98 98 98 99 99 99 99 99 99 99 100 100 99 99 98 98 98 99 100 100 100 100 99 99 99 99 99 99 99 98 98 99 99 99 101 101 101 101 100
1393 100 100 100 99 99 100 101 101 101 101 101 101 102 102 101 101 101 101 101 101 101 101 101 102 101 101 101 101 102 102 102 102 102 102 102 103 103 104 104 104 105 105 105 105 106 107 107 107 108 108 109 109 109 109 110 112 113 114 115 117 118 118 118 119 121 123 125 127 129 132
1385 132 135 138 141 144 148 152 156 161 167 174 180 187 194 201 207 213 217 221 223 223 221 219 215 210 204 198 191 186 179 173 166 159 153 148 144 140 136 132 129 126 123 121 119 118 116 114 113 112 111 110 110 110 109 109 108 108 107 107 106 106 106 106 105 105 105 104 104 103 102
1378A02J%%%%j%%%%%j%%%%j%%Jj%%j%%%%%%%%%j%JJ%Jj%%%%%%%%%%%%jJ%%j%%j%jJ%%jJj%
1371I7JJ%%%%%J%%j%%j%%J%Jj%%%%%%%j%%j%%%J%J%j%%%j%%J%J%%j%%%%%jJ%%%%%%%%%%%%
1363I8%%%%%%%J%j%%%%J%%J%j%%%%j%%J%j%%jJ%J%J%%%%%%j%J%%%%j%%%%%%%j%%%jJ%%%Jj
1356I8%J%Jj%%%%%%j%jJ%Jj%%%%%J%%%J%jj%j%%%%%J%%%%%%j%J%J%%%%Jj%%%jj%%J%%%%%%
1349I8%%%%%%%%jJ%%%%J%%%%%%%%%j%%J%%%%%j%%j%K%%%%%%%%%%%%%%%%j%%jJJ%%%%%j%%%
1341I8%%Jj%%%%J%%j%%%%%%%j%JJ%%jJ%j%%%%%Jj%j%J%%%%%%%j%JJJJ%j%%j%%Jj%%%j%%J%
1334I9%%j%%%%%%%%%%%%%%JJ%JJ%jJJ%%%J%JJ%%%JJJ%%J%%j%jj%jj%j%j%%%j%j%%%jj%J%%
1326A00%j%%J%%%%j%Jj%%%%j%%J%%%%%%%j%%j%%%%%%%%J%%J%%%%j%%%j%%J%%jJ%J%jj%%%%
$$ plain form
1378 102 103 103 103 103 103 102 102 102 102 102 102 101 101 101 101 101 100 100 100 101 100 100 100 99 99 99 99 99 99 99 99 99 99 98 98 99 100 100 101 100 100 100 100 100 100 100 100 100 100 100 100 100 99 100 100 100 99 99 99 98 98 97 98 98 98 97 98 97 97
1371 97 98 99 99 99 99 99 99 100 100 100 99 99 99 98 98 98 99 99 100 99 99 99 99 99 99 99 99 98 98 98 97 97 97 97 98 98 99 99 98 98 98 98 97 97 97 98 98 99 99 99 98 98 98 98 98 98 97 98 98 98 98 98 98 98 98 98 98 98 98 98
1363 98 98 98 98 98 98 98 98 99 99 98 98 98 98 98 99 99 99 100 100 99 99 99 99 99 98 98 98 99 99 98 98 98 97 98 98 99 99 100 100 100 100 100 100 100 99 99 100 100 100 100 100 99 99 99 99 99 99 99 99 98 98 98 98 97 98 98 98 98 99 98
1356 98 98 99 99 100 99 99 99 99 99 99 99 98 98 97 98 98 99 98 98 98 98 98 98 99 99 99 99 100 100 99 98 98 97 97 97 97 97 97 98 98 98 98 98 98 98 97 97 98 98 99 99 99 99 99 100 99 99 99 99 98 97 97 97 98 98 98 98 98 98 98
1349 98 98 98 98 98 98 98 98 98 97 98 98 98 98 98 99 99 99 99 99 99 99 99 99 99 98 98 98 99 99 99 99 99 99 98 98 98 97 97 99 99 99 99 99 99 99 99 99 99 99 99 99 99 99 99 99 98 98 98 97 98 99 99 99 99 99 99 98 98 98 98
1341 98 98 98 99 98 98 98 98 98 99 99 99 98 98 98 98 98 98 98 98 97 97 98 99 99 99 98 99 99 98 98 98 98 98 98 99 98 98 97 97 98 98 98 98 98 98 98 98 97 97 98 99 100 101 101 100 100 100 99 99 99 100 99 99 99 99 98 98 98 99 99
1334 99 99 99 98 98 98 98 98 98 98 98 98 98 98 98 98 98 98 99 100 100 101 102 102 101 102 103 103 103 103 104 104 105 106 106 106 106 107 108 109 109 109 110 110 110 109 109 108 107 107 106 105 105 104 104 103 103 103 103 102 102 101 101 101 101 100 99 99 100 100 100
1326 100 100 99 99 99 100 100 100 100 100 99 99 100 99 99 99 99 99 98 98 98 99 99 99 99 99 99 99 99 98 98 98 97 97 97 97 97 97 97 97 97 98 98 98 99 99 99 99 99 98 98 98 98 97 97 97 98 98 98 97 98 98 99 99 98 97 97 97 97 97
1319I7%%J%J%%%jJ%%J%%%%%j%%%%JjjjJ%%%j%JJJ%%jJ%%%j%%%j%%j%%%%%J%%%j%%J%j%%%%
1312I7%JJ%j%%%J%%%%%%%%jj%%%JJj%%%J%j%%%JJjjJ%j%%%%Jj%%%%%%%%%%J%%j%%%%JJ%j%
1304I9%j%%%%%%%%j%%%%%%%%j%J%J%%J%%%%j%%%%%%Jj%%%jjJ%%%%%%%%%%%%%J%jJ%%%%%%J
1297I9%%%%j%%%J%%Jj%%%jjJJjj%%J%%%jj%JJ%%%%J%%%%%%%%%%j%%%%j%%%J%Jj%%%j%J%%J
1289I9%j%%%%%%%%%%%%%%%%j%%%%J%J%%%Jjj%j%%J%%%%%%%%%%%j%%%%%%%%%J%%Jjj%jJJJ%
1282I9%%j%j%J%j%%JJ%%%%%%%%%%j%%%%%%%%%%%%%%%%j%J%%%%%%J%Jj%%j%jJ%%%%j%jJ%%%
1275I7%%Jj%%%%%%%%%%%J%J%%%%J%%j%%%%%%jjjJ%%%%j%%J%%%J%%%%%%j%%J%%%%JJj%j%%%
1267I8%%J%%%%%%%%j%%j%%%%%%%%J%%%J%%j%%%%%%%%%%J%%%%%%j%j%%%%J%%%%%%j%%J%%%%
$$ plain form
1319 97 97 97 98 98 99 99 99 99 98 99 99 99 100 100 100 100 100 100 99 99 99 99 99 100 99 98 97 98 98 98 98 97 97 98 99 100 100 100 99 100 100 100 100 99 99 99 99 98 98 98 97 97 97 97 97 97 98 98 98 98 97 97 97 98 98 97 97 97 97 97
1312 97 97 98 99 99 98 98 98 98 99 99 99 99 99 99 99 99 99 98 97 97 97 97 98 99 98 98 98 98 99 99 98 98 98 98 99 100 99 98 99 99 98 98 98 98 98 99 98 98 98 98 98 98 98 98 98 98 98 99 99 99 98 98 98 98 98 99 100 100 99 99
1304 99 99 98 98 98 98 98 98 98 98 98 97 97 97 97 97 97 97 97 97 96 96 97 97 98 98 98 99 99 99 99 99 98 98 98 98 98 98 98 99 98 98 98 98 97 96 97 97 97 97 97 97 97 97 97 97 97 97 97 97 98 98 97 98 98 98 98 98 98 98 99
1297 99 99 99 99 99 98 98 98 98 99 99 99 100 99 99 99 99 98 97 98 99 98 97 97 97 98 98 98 98 97 96 96 97 98 98 98 98 98 99 99 99 99 99 99 99 99 99 99 99 98 98 98 98 98 97 97 97 97 98 98 99 98 98 98 98 97 97 98 98 98 99
1289 99 99 98 98 98 98 98 98 98 98 98 98 98 98 98 98 98 98 98 97 97 97 97 97 98 98 99 99 99 99 100 99 98 98 97 97 97 98 98 98 98 98 98 98 98 98 98 98 98 97 97 97 97 97 97 97 97 97 97 98 98 98 99 98 97 97 96 97 98 99 99
1282 99 99 99 98 98 97 97 98 98 97 97 97 98 99 99 99 99 99 99 99 99 99 99 99 98 98 98 98 98 98 98 98 98 98 98 98 98 98 98 98 98 97 97 98 98 98 98 98 98 98 99 99 100 99 99 99 98 98 97 98 98 98 98 98 97 97 96 97 97 97 97
1275 97 97 97 98 97 97 97 97 97 97 97 97 97 97 97 97 98 98 99 99 99 99 99 100 100 100 99 99 99 99 99 99 99 98 97 96 97 97 97 97 97 96 96 96 97 97 97 97 98 98 98 98 98 98 98 97 97 97 98 98 98 98 98 99 100 99 99 98 98 98 98
1267 98 98 98 99 99 99 99 99 99 99 99 99 98 98 98 97 97 97 97 97 97 97 97 97 98 98 98 98 99 99 99 98 98 98 98 98 98 98 98 98 98 98 99 99 99 99 99 99 99 98 98 97 97 97 97 97 98 98 98 98 98 98 98 97 97 97 98 98 98 98 98
1260I8%j%%%%JJ%%%%%%%%jj%%%%J%%%%jjJ%JJ%%%%%%%J%jj%%%%j%%J%%%J%%%j%%%%%jj%%%
1252I6JJJ%%%%jJ%%jjjJ%j%J%%%%%%%%%%%jJj%J%Jj%%%%%%%%%J%%J%%j%%%Jj%%%%%%J%%%%
1245I9%%%j%%j%%%j%%J%%%j%%%JJj%j%%J%%%j%J%J%%%%%%Jj%%%J%%%%%%JjjjJ%%j%Jj%%Jj
1237I7%%J%%%%%%J%%j%%%%j%%%%%%%%%%%%%%%J%%JJ%%%j%jj%%J%%j%%%%%%%J%%jJ%%%%%j%
1230I7%%%jJJ%j%%%%%%%%JJj%j%JJ%%%j%JJ%j%%j%%j%%%%%%%%%%%%%%J%%%jJ%%%%%Jj%%%%
1223I8%%J%j%%%%%%%jJJ%%j%%J%j%%%%%j%j%JJ%%%%%%%%%%%j%J%J%%%%jj%%%%%%%%%%J%J%
1215I9%%j%Jj%%%jJ%%jj%%J%%%%j%J%J%%j%%%%J%%%%jJ%%j%%%J%%%%J%j%%%%%%%%%%j%%J%
1208I8%%%%%j%J%%J%j%j%%%Jj%%%%Jj%%%J%%%jj%Jj%%%%%Jj%%%J%%%%%J%%j%%%%%%%%%%%%
$$ plain form
1260 98 98 97 97 97 97 97 98 99 99 99 99 99 99 99 99 99 98 97 97 97 97 97 98 98 98 98 98 97 96 97 97 98 99 99 99 99 99 99 99 99 100 100 99 98 98 98 98 98 97 97 97 98 98 98 98 99 99 99 99 98 98 98 98 98 98 97 96 96 96 96
1252 96 97 98 99 99 99 99 99 98 99 99 99 98 97 96 97 97 96 96 97 97 97 97 97 97 97 97 97 97 97 97 96 97 96 96 97 97 98 97 97 97 97 97 97 97 97 97 97 98 98 98 99 99 99 98 98 98 98 99 98 98 98 98 98 98 98 99 99 99 99 99
1245 99 99 99 99 98 98 98 97 97 97 97 96 96 96 97 97 97 97 96 96 96 96 97 98 97 97 96 96 96 97 97 97 97 96 96 97 97 98 98 98 98 98 98 98 99 98 98 98 98 99 99 99 99 99 99 99 100 99 98 97 98 98 98 97 97 98 97 97 97 98 97
1237 97 97 97 98 98 98 98 98 98 98 99 99 99 98 98 98 98 98 97 97 97 97 97 97 97 97 97 97 97 97 97 97 97 97 98 98 98 99 100 100 100 100 99 99 98 97 97 97 98 98 98 97 97 97 97 97 97 97 97 98 98 98 97 98 98 98 98 98 98 97 97
1230 97 97 97 97 96 97 98 98 97 97 97 97 97 97 97 97 97 98 99 98 98 97 97 98 99 99 99 99 98 98 99 100 100 99 99 99 98 98 98 97 97 97 97 97 97 97 97 97 97 97 97 97 97 97 98 98 98 98 97 98 98 98 98 98 98 99 98 98 98 98 98
1223 98 98 98 99 99 98 98 98 98 98 98 98 98 97 98 99 99 99 98 98 98 99 99 98 98 98 98 98 98 97 97 96 96 97 98 98 98 98 98 98 98 98 98 98 98 98 97 97 98 98 99 99 99 99 99 98 97 97 97 97 97 97 97 97 97 97 97 98 98 99 99
1215 99 99 99 98 98 99 98 98 98 98 97 98 98 98 97 96 96 96 97 97 97 97 97 96 96 97 97 98 98 98 97 97 97 97 97 98 98 98 98 98 97 98 98 98 97 97 97 97 98 98 98 98 98 99 99 98 98 98 98 98 98 98 98 98 98 98 97 97 97 98 98
1208 98 98 98 98 98 98 97 97 98 98 98 99 99 98 98 97 97 97 97 98 97 97 97 97 97 98 97 97 97 97 98 98 98 98 97 96 96 97 96 96 96 96 96 96 97 96 96 96 96 97 97 97 97 97 97 98 98 98 97 97 97 97 97 97 97 97 97 97 97 97 97
1200I7%%%%%%j%%J%%J%%%j%%J%%%%%j%jJ%J%%%j%%%%%%J%Jjj%%%%%%%j%%%J%%%j%%J%%%%%
1193I7%%j%%J%%%j%%J%J%%%%j%%%%%%%%%J%%%j%%j%%%J%%j%J%J%%%jJ%j%%%J%j%j%J%j%jJ
1185I6%%%%%%%%JJ%%%%%J%%%J%jjjJ%%%%J%jj%jJ%%%%%%j%j%J%%%JJJ%%j%%%%%%j%%%%%%%
1178I7%%j%J%%J%jjj%J%J%%%j%%%J%J%J%j%j%%%J%%jJ%%%%%%%j%j%%J%%J%jJ%%%%%jj%%J%
1171I7%%%%%%%%%j%%J%j%%%J%Jj%j%Jj%%%%%J%%j%%J%jJ%j%J%%%%j%j%J%%j%%%%%%%%%%%J
1163I6J%%j%%%%jJ%%%%%%%%%%%%%%%%%%jj%J%%%J%%%%j%J%j%%J%%%%%J%j%%%%j%%%%%%J%%
1156I6J%%%%jJ%%j%J%jJ%J%j%%%j%JJ%jJj%%j%J%%%%%%%%%j%%j%%%JJ%J%%j%%%JjJ%%%%%%
1148I8j%%%%jJJ%%%j%%Jj%%%%J%%%%j%j%%J%%%%%J%Jj%%j%%%%%%Jj%%%%%j%J%%%J%jj%%J%
$$ plain form
1200 97 97 97 97 97 97 97 96 96 96 97 97 97 98 98 98 98 97 97 97 98 98 98 98 98 98 97 97 96 97 97 98 98 98 98 97 97 97 97 97 97 97 98 98 99 98 97 97 97 97 97 97 97 97 96 96 96 96 97 97 97 97 96 96 96 97 97 97 97 97 97
1193 97 97 97 96 96 96 97 97 97 97 96 96 96 97 97 98 98 98 98 98 97 97 97 97 97 97 97 97 97 97 98 98 98 98 97 97 97 96 96 96 96 97 97 97 96 96 97 97 98 98 98 98 97 98 98 97 97 97 97 98 98 97 97 96 96 97 97 96 96 95 96
1185 96 96 96 96 96 96 96 96 96 97 98 98 98 98 98 98 99 99 99 99 100 100 99 98 97 98 98 98 98 98 99 99 98 97 97 96 97 97 97 97 97 97 97 96 96 95 95 96 96 96 96 97 98 99 99 99 98 98 98 98 98 98 98 97 97 97 97 97 97 97 97
1178 97 97 97 96 96 97 97 97 98 98 97 96 95 95 96 96 97 97 97 97 96 96 96 96 97 97 98 98 99 99 98 98 97 97 97 97 98 98 98 97 98 98 98 98 98 98 98 98 97 97 96 96 96 97 97 97 98 98 97 98 98 98 98 98 98 97 96 96 96 97 97
1171 97 97 97 97 97 97 97 97 97 97 96 96 96 97 97 96 96 96 96 97 97 98 97 97 96 96 97 96 96 96 96 96 96 97 97 97 96 96 96 97 97 96 97 97 96 96 97 97 97 97 97 96 96 95 95 96 96 96 95 95 95 95 95 95 95 95 95 95 95 95 96
1163 96 97 97 97 96 96 96 96 96 95 96 96 96 96 96 96 96 96 96 96 96 96 96 96 96 96 96 96 96 95 94 94 95 95 95 95 96 96 96 96 96 95 95 96 96 95 95 95 96 96 96 96 96 96 97 97 96 96 96 96 96 95 95 95 95 95 95 95 96 96 96
1156 96 97 97 97 97 97 96 97 97 97 96 96 97 97 96 97 97 98 98 97 97 97 97 96 96 97 98 98 97 98 97 97 97 96 96 97 97 97 97 97 97 97 97 97 97 96 96 96 95 95 95 95 96 97 97 98 98 98 97 97 97 97 98 97 98 98 98 98 98 98 98
1148 98 97 97 97 97 97 96 97 98 98 98 98 97 97 97 98 97 97 97 97 97 98 98 98 98 98 97 97 96 96 96 97 97 97 97 97 97 98 98 99 98 98 98 97 97 97 97 97 97 97 98 97 97 97 97 97 97 96 96 97 97 97 97 98 98 97 96 96 96 97 97
1141I7%jJ%J%%%%%jj%%J%%%j%j%%J%%%%%%J%%%%%j%Jj%J%%%%%%%%%%%J%%j%%%%%%%%%%%%%
1134I7%%%%%%%%%j%jJ%J%%j%%%%%%%%%%%%%%%J%%%%J%%%%%j%j%%%%J%%%%%%%%%%%%%%%%j%
1126I6%%J%%%j%%%%j%%%J%%J%%%%%%%%j%jJJ%%%%%%%%%%j%%%%%JJ%J%j%j%jJ%%%%%%%%J%%
1119I8%jjJ%%%%%j%J%J%j%%%%%%%%%%%%%%%jJ%%j%j%%%%JJK%%%%%j%j%%%%%%%%%%J%j%%%%
1111I7%J%%%%j%%%%%Jj%j%%%%%%%%%%J%j%%%J%%J%%j%J%%%%%j%j%%Jj%%J%J%%%%%%%%J%%j
1104I8%%%%%%%j%%%%jJ%%%%%%%%%%j%%%J%%%%%%J%%%jj%J%JJ%%%%%j%j%J%%%Jj%j%J%j%%%
1096I7%%%%%%%Jj%j%%%%J%%j%%J%%J%%j%jJ%J%%j%%%%%%%%%%%Jj%%%%j%%%%%J%jj%%%%J%J
1089I7%%%%%jj%%J%%J%%%%%j%%%J%j%J%%%%%j%%%%J%J%j%%%J%Jj%j%%J%J%jj%%%%%%%%%%j
$$ plain form
1141 97 97 96 97 97 98 98 98 98 98 98 97 96 96 96 97 97 97 97 96 96 95 95 95 96 96 96 96 96 96 96 97 97 97 97 97 97 96 96 97 96 96 97 97 97 97 97 97 97 97 97 97 97 97 98 98 98 97 97 97 97 97 97 97 97 97 97 97 97 97 97
1134 97 97 97 97 97 97 97 97 97 97 96 96 95 96 96 97 97 97 96 96 96 96 96 96 96 96 96 96 96 96 96 96 96 96 97 97 97 97 97 98 98 98 98 98 98 97 97 96 96 96 96 96 97 97 97 97 97 97 97 97 97 97 97 97 97 97 97 97 97 96 96
1126 96 96 96 97 97 97 97 96 96 96 96 96 95 95 95 95 96 96 96 97 97 97 97 97 97 97 97 97 96 96 95 96 97 97 97 97 97 97 97 97 97 97 97 96 96 96 96 96 96 97 98 98 99 99 98 98 97 97 96 97 97 97 97 97 97 97 97 97 98 98 98
1119 98 98 97 96 97 97 97 97 97 97 96 96 97 97 98 98 97 97 97 97 97 97 97 97 97 97 97 97 97 97 97 97 96 97 97 97 96 96 95 95 95 95 95 96 97 99 99 99 99 99 99 98 98 97 97 97 97 97 97 97 97 97 97 97 98 98 97 97 97 97 97
1111 97 97 98 98 98 98 98 97 97 97 97 97 97 98 97 97 96 96 96 96 96 96 96 96 96 96 96 97 97 96 96 96 96 97 97 97 98 98 98 97 97 98 98 98 98 98 98 97 97 96 96 96 97 96 96 96 97 97 98 98 98 98 98 98 98 98 98 99 99 99 98
1104 98 98 98 98 98 98 98 98 97 97 97 97 97 96 97 97 97 97 97 97 97 97 97 97 97 96 96 96 96 97 97 97 97 97 97 97 98 98 98 98 97 96 96 97 97 98 99 99 99 99 99 99 98 98 97 97 98 98 98 98 99 98 98 97 97 98 98 97 97 97 97
1096 97 97 97 97 97 97 97 97 98 97 97 96 96 96 96 96 97 97 97 96 96 96 97 97 97 98 98 98 97 97 96 97 97 98 98 98 97 97 97 97 97 97 97 97 97 97 97 97 98 97 97 97 97 97 96 96 96 96 96 96 97 97 96 95 95 95 95 95 96 96 97
1089 97 97 97 97 97 97 96 95 95 95 96 96 96 97 97 97 97 97 97 96 96 96 96 97 97 96 96 97 97 97 97 97 97 96 96 96 96 96 97 97 98 98 97 97 97 97 98 98 99 98 98 97 97 97 98 98 99 99 98 97 97 97 97 97 97 97 97 97 97 97 96
1082I6JJj%%%%J%j%%jJ%%j%%J%%%%%%%%%j%%J%%j%jJJ%%%%j%%%%%%j%%J%%Jjj%J%J%J%%%%
1074I8jjJJ%%j%%%%%%%%%%j%%%%J%J%jjJ%%%%%%%J%j%jj%J%%%Jj%%J%J%%%%jj%J%%%j%jJJ
1067I7%J%%j%%%%j%%%J%j%J%%%%%%%J%%%j%J%j%%%jJ%%%j%%J%%%%%Jj%j%%J%%%%%%%J%%%%
1059I8j%%j%%%%J%%%%J%%j%%%%%%%%%%%JJ%%j%%j%%J%%%jj%%K%%j%jJ%%%%%J%%%%%%j%%%J
1052I8%J%j%%%Jjj%j%J%%%%%%%%%%J%%%%j%jJ%j%J%J%%j%J%%%%j%%%%J%j%%jj%J%%J%%%%%
1045I7%%%j%%J%%%%%%%J%%j%%%%%J%j%JjjJ%%j%%%J%%j%%%%%J%%j%JJ%j%%%%%%%j%%J%%%%
1037I7%%J%%jj%%%%J%%%%%%%%%%%%j%%%J%%%%j%%J%%Jj%j%%J%%%%%%%%%%j%%%%%%%Jj%%%%
1030I6%%%%%j%%%J%jJJ%J%j%%%%%J%j%%%%jJ%%%%%%%jJ%%jJ%%%%%%j%%%%%%J%%%j%%%%%%%
$$ plain form
1082 96 97 98 97 97 97 97 97 98 98 97 97 97 96 97 97 97 96 96 96 97 97 97 97 97 97 97 97 97 97 96 96 96 97 97 97 96 96 95 96 97 97 97 97 97 96 96 96 96 96 96 96 95 95 95 96 96 96 97 96 95 95 96 96 97 97 98 98 98 98 98
1074 98 97 96 97 98 98 98 97 97 97 97 97 97 97 97 97 97 97 96 96 96 96 96 97 97 98 98 97 96 97 97 97 97 97 97 97 97 98 98 97 97 96 95 95 96 96 96 96 97 96 96 96 97 97 98 98 98 98 98 97 96 96 97 97 97 97 96 96 95 96 97
1067 97 97 98 98 98 97 97 97 97 97 96 96 96 96 97 97 96 96 97 97 97 97 97 97 97 97 98 98 98 98 97 97 98 98 97 97 97 97 96 97 97 97 97 96 96 96 97 97 97 97 97 97 98 97 97 96 96 96 97 97 97 97 97 97 97 97 98 98 98 98 98
1059 98 97 97 97 96 96 96 96 96 97 97 97 97 97 98 98 98 97 97 97 97 97 97 97 97 97 97 97 97 98 99 99 99 98 98 98 97 97 97 98 98 98 98 97 96 96 96 98 98 98 97 97 96 97 97 97 97 97 97 98 98 98 98 98 98 98 97 97 97 97 98
1052 98 98 99 99 98 98 98 98 99 98 97 97 96 96 97 97 97 97 97 97 97 97 97 97 97 98 98 98 98 98 97 97 96 97 97 96 96 97 97 98 98 98 97 97 98 98 98 98 98 97 97 97 97 97 98 98 97 97 97 96 95 95 96 96 96 97 97 97 97 97 97
1045 97 97 97 97 96 96 96 97 97 97 97 97 97 97 97 98 98 98 97 97 97 97 97 97 98 98 97 97 98 97 96 97 97 97 96 96 96 96 97 97 97 96 96 96 96 96 96 97 97 97 96 96 97 98 98 97 97 97 97 97 97 97 97 96 96 96 97 97 97 97 97
1037 97 97 97 98 98 98 97 96 96 96 96 96 97 97 97 97 97 97 97 97 97 97 97 97 97 96 96 96 96 97 97 97 97 97 96 96 96 97 97 97 98 97 97 96 96 96 97 97 97 97 97 97 97 97 97 97 97 96 96 96 96 96 96 96 96 97 96 96 96 96 96
1030 96 96 96 96 96 96 95 95 95 95 96 96 95 96 97 97 98 98 97 97 97 97 97 97 98 98 97 97 97 97 97 96 97 97 97 97 97 97 97 97 96 97 97 97 96 97 97 97 97 97 97 97 96 96 96 96 96 96 96 97 97 97 97 96 96 96 96 96 96 96 96
1022I6%%%%Jj%jJ%Jj%%%%%%%%%%%JJ%j%%%%%%JJ%jj%%%%J%jj%%%J%%%%jjj%J%J%%J%%%%%%
1015I7%%%%%%%%%jj%%%J%%%%%J%JjjJ%%%%%%%J%%%%%%j%%%%%%J%j%%j%%%%J%%J%%j%%%%%%
1007I7%%%%%J%%j%%%%%%%J%J%%%j%%%%%%j%%J%%%kjJ%%%%%%%JJ%j%%%%%J%%jjJ%j%%%%%J%
1000I7%jJ%%%%%%%%jJ%%%%%%%j%%%%J%%J%%J%jjjJ%%%%%%%jJ%JjjJJ%%j%%%%%%%J%%j%%JJ
993I9jj%%%%jJ%J%%%%%J%%%j%%%%j%%J%Jj%j%%%j%%J%%%%%%%J%%%j%%jJ%%%J%%%%j%%%%%J
985I8%%%%j%J%%%J%%j%%J%j%J%%%%%%J%%%j%%%%J%%%J%%%j%jJ%%%%%%J%%jjJ%jJJ%j%%%J%
978A01%jJ%J%%jJ%%%J%%%%%j%%J%J%J%%%j%JJ%J%jJ%JJ%%%J%J%J%JJ%%%%J%JJ%JJJJJJJJK
970A27JKKJJJKLLKLKLLMMLMMNMNMNNNOOOMMMMLLK%%%jllmnmnnnooonnnnommmmmlklkkkljk
$$ plain form
1022 96 96 96 96 96 97 96 96 95 96 96 97 96 96 96 96 96 96 96 96 96 96 96 96 97 98 98 97 97 97 97 97 97 97 98 99 99 98 97 97 97 97 97 98 98 97 96 96 96 96 97 97 97 97 97 96 95 94 94 95 95 96 96 96 97 97 97 97 97 97 97
1015 97 97 97 97 97 97 97 97 97 97 96 95 95 95 95 96 96 96 96 96 96 97 97 98 97 96 97 97 97 97 97 97 97 97 98 98 98 98 98 98 98 97 97 97 97 97 97 97 98 98 97 97 97 96 96 96 96 96 97 97 97 98 98 98 97 97 97 97 97 97 97
1007 97 97 97 97 97 97 98 98 98 97 97 97 97 97 97 97 97 98 98 99 99 99 99 98 98 98 98 98 98 98 97 97 97 98 98 98 98 96 95 96 96 96 96 96 96 96 96 97 98 98 97 97 97 97 97 97 98 98 98 97 96 97 97 96 96 96 96 96 96 97 97
1000 97 97 96 97 97 97 97 97 97 97 97 97 96 97 97 97 97 97 97 97 97 96 96 96 96 96 97 97 97 98 98 98 99 99 98 97 96 97 97 97 97 97 97 97 97 96 97 97 98 97 96 97 98 98 98 97 97 97 97 97 97 97 97 98 98 98 97 97 97 98 99
993 99 98 97 97 97 97 97 96 97 97 98 98 98 98 98 98 99 99 99 99 98 98 98 98 98 97 97 97 98 98 99 98 98 97 97 97 97 96 96 96 97 97 97 97 97 97 97 97 98 98 98 98 97 97 97 96 97 97 97 97 98 98 98 98 98 97 97 97 97 97 97 98
985 98 98 98 98 98 97 97 98 98 98 98 99 99 99 98 98 98 99 99 98 98 99 99 99 99 99 99 99 100 100 100 100 99 99 99 99 99 100 100 100 100 101 101 101 101 100 100 99 100 100 100 100 100 100 100 101 101 101 100 99 100 100 99 100 101 101 100 100 100 100 101 101
978 101 101 100 101 101 102 102 102 101 102 102 102 102 103 103 103 103 103 103 102 102 102 103 103 104 104 105 105 105 105 104 104 105 106 106 107 107 106 107 107 108 109 109 109 109 110 110 111 111 112 112 113 114 114 114 114 114 115 115 116 117 117 118 119 120 121 122 123 124 125 127
970 127 128 130 132 133 134 135 137 140 143 145 148 150 153 156 160 164 167 171 175 180 184 189 193 198 203 208 214 220 226 230 234 238 242 245 248 250 250 250 250 249 246 243 239 234 230 225 220 215 209 203 197 192 187 182 177 171 167 163 159 155 151 148 146 143 141 139 137 134 133 131
963A31kjkkjkjjjjj%jjjjj%jj%j%j%%%%%j%jj%%%%%%%%j%j%%%%j%j%%%%%%J%%%%%%%%%j%%
955A00%%%%j%%%%%j%%Jj%J%Jjj%J%%%jJ%J%%%%j%%%%%%jjJ%j%%J%%%jj%J%J%%jjJJ%%%%%%
948I8%%Jj%J%%j%%%jJ%j%%J%%%%%J%jj%jJ%%%%%%%%%jjJJ%%%%%Jj%%J%J%j%%%%%%j%J%%Jj
940I8jj%J%J%%jk%%J%%%%%%%%%%%J%%J%%j%j%%%J%j%%%%%%J%%%%j%J%%%%%%%%%%%%J%%jjJ
933I7%j%%J%%%%j%%%%%%%%%%%%%%%Jj%%%%%J%%%%%j%jJJj%%%%%%%%%%%%%J%%%%%%J%%j%jJ
925I7%%j%%%%%%%J%%jjJ%%%%%%%%%%%%j%jJ%%J%JJ%jj%%%J%j%%%%%J%%%%J%j%%j%%%Jjj%%
918I5%Jj%%%J%%%%%%jJjJ%J%%j%%%%%%%%%%J%Jj%j%%J%%Jj%%j%J%%%%J%j%%j%%%J%%%%j%%
910I6%j%J%%%j%%%%%j%J%%%J%j%%%%%%%Jj%%%%J%%j%%%%%J%%%%%%%jJ%%%%%%jJ%%Jj%%%%%
$$ plain form
963 131 129 128 126 124 123 121 120 119 118 117 116 116 115 114 113 112 111 111 110 109 109 108 108 107 107 107 107 107 107 106 106 105 104 104 104 104 104 104 104 104 104 103 103 102 102 102 102 102 101 101 100 100 100 100 100 100 100 101 101 101 101 101 101 101 101 101 101 100 100 100
955 100 100 100 100 100 99 99 99 99 99 99 98 98 98 99 98 98 99 99 100 99 98 98 99 99 99 99 98 99 99 100 100 100 100 100 99 99 99 99 99 99 99 98 97 98 98 97 97 97 98 98 98 98 97 96 96 97 97 98 98 98 97 96 97 98 98 98 98 98 98 98
948 98 98 98 99 98 98 99 99 99 98 98 98 98 97 98 98 97 97 97 98 98 98 98 98 98 99 99 98 97 97 96 97 97 97 97 97 97 97 97 97 97 96 95 96 97 97 97 97 97 97 98 97 97 97 98 98 99 99 98 98 98 98 98 98 98 97 97 98 98 98 99 98
940 98 97 96 96 97 97 98 98 98 97 95 95 95 96 96 96 96 96 96 96 96 96 96 96 96 97 97 97 98 98 98 97 97 96 96 96 96 97 97 96 96 96 96 96 96 96 97 97 97 97 97 96 96 97 97 97 97 97 97 97 97 97 97 97 97 97 98 98 98 97 96 97
933 97 97 96 96 96 97 97 97 97 97 96 96 96 96 96 96 96 96 96 96 96 96 96 96 96 96 97 96 96 96 96 96 96 97 97 97 97 97 97 96 96 95 96 97 96 96 96 96 96 96 96 96 96 96 96 96 96 96 97 97 97 97 97 97 97 98 98 98 97 97 96 97
925 97 97 97 96 96 96 96 96 96 96 96 97 97 97 96 95 96 96 96 96 96 96 96 96 96 96 96 96 96 95 95 94 95 95 95 96 96 97 98 98 97 96 96 96 96 97 97 96 96 96 96 96 96 97 97 97 97 97 98 98 97 97 97 96 96 96 96 97 96 95 95 95
918 95 95 96 95 95 95 95 96 96 96 96 96 96 96 95 96 95 96 96 97 97 97 96 96 96 96 96 96 96 96 96 96 96 97 97 98 97 97 96 96 96 97 97 97 98 97 97 97 96 96 97 97 97 97 97 98 98 97 97 97 96 96 96 96 97 97 97 97 97 96 96 96
910 96 96 95 95 96 96 96 96 95 95 95 95 95 95 94 94 95 95 95 95 96 96 95 95 95 95 95 95 95 95 96 95 95 95 95 95 96 96 96 95 95 95 95 95 95 96 96 96 96 96 96 96 96 95 96 96 96 96 96 96 96 95 96 96 96 97 96 96 96 96 96 96
903I6jJ%%%%J%j%J%%%%j%%%%%%%%%%%%%Jj%%%%%%%%%%j%J%J%%%j%%%j%%J%%%%%%%%Jj%%%%
895I6%%j%%J%%%%%%j%%Jj%%J%%%%%%%%%%j%%%%%%J%j%%%%%%%%%%%%%%%J%%jJ%j%%%J%%J%j
888I6jJ%%J%%%%%%%%J%%%j%%%j%%%%%%jJ%%%%j%%J%J%%jj%%%%%%%%JJ%%j%JJ%%%j%%%%%%%
880I7j%%%%%%%jJ%%%jJ%%j%%%%%%%%J%%J%%%%jj%JJj%%J%%%%jJ%jJJ%%%%j%%Jj%%j%%%%%%
873I6%%%%%%J%Jj%%j%Jj%J%%%%j%%%J%J%%%%%j%Jj%JJ%%%%jJ%%%%j%%%%%k%JJ%%%%%%j%%J
865I8%%j%J%%J%jj%J%%%%J%%%%%j%Jjj%J%%%J%%%J%%%j%%%j%%%J%%%%jJ%J%J%%jj%%%j%%j
858I7J%J%%%%%%J%%%%%%%%%%j%JJ%J%%j%%Jj%%J%JJ%%%%%jj%J%J%%%%%%%%JJJ%%%jJJJ%%%
850A09J%J%j%j%J%%j%%jj%%jjj%%%%j%%%%%%%%j%%%%%k%%j%J%jj%%J%%%%j%j%%%%%J%%%%%
$$ plain form
903 96 95 96 96 96 96 96 97 97 96 96 97 97 97 97 97 96 96 96 96 96 96 96 96 96 96 96 96 96 96 97 96 96 96 96 96 96 96 96 96 96 96 95 95 96 96 97 97 97 97 96 96 96 96 95 95 95 96 96 96 96 96 96 96 96 96 97 96 96 96 96 96
895 96 96 96 95 95 95 96 96 96 96 96 96 96 95 95 95 96 95 95 95 96 96 96 96 96 96 96 96 96 96 96 95 95 95 95 95 95 95 96 96 95 95 95 95 95 95 95 95 95 95 95 95 95 95 95 95 96 96 96 95 96 96 95 95 95 95 96 96 96 97 97 96
888 96 95 96 96 96 97 97 97 97 97 97 97 97 97 98 98 98 98 97 97 97 97 96 96 96 96 96 96 96 95 96 96 96 96 96 95 95 95 96 96 97 97 97 96 95 95 95 95 95 95 95 95 95 96 97 97 97 96 96 97 98 98 98 98 97 97 97 97 97 97 97 97
880 97 96 96 96 96 96 96 96 96 95 96 96 96 96 95 96 96 96 95 95 95 95 95 95 95 95 95 96 96 96 97 97 97 97 97 96 95 95 96 97 96 96 96 97 97 97 97 97 96 97 97 96 97 98 98 98 98 98 97 97 97 98 97 97 97 96 96 96 96 96 96 96
873 96 96 96 96 96 96 96 97 97 98 97 97 97 96 96 97 96 96 97 97 97 97 97 96 96 96 96 97 97 98 98 98 98 98 98 97 97 98 97 97 98 99 99 99 99 99 98 99 99 99 99 99 98 98 98 98 98 98 96 96 97 98 98 98 98 98 98 98 97 97 97 98
865 98 98 98 97 97 98 98 98 99 99 98 97 97 98 98 98 98 98 99 99 99 99 99 99 98 98 99 98 97 97 98 98 98 98 99 99 99 99 100 100 100 100 99 99 99 99 98 98 98 98 99 99 99 99 99 98 99 99 100 100 101 101 101 100 99 99 99 99 98 98 98 97
858 97 98 98 99 99 99 99 99 99 99 100 100 100 100 100 100 100 100 100 100 100 99 99 100 101 101 102 102 102 101 101 101 102 101 101 101 102 102 103 104 104 104 104 104 104 103 102 102 103 103 104 104 104 104 104 104 104 104 104 105 106 107 107 107 107 106 107 108 109 109 109 109
850 109 110 110 111 111 110 110 109 109 110 110 110 109 109 109 108 107 107 107 106 105 104 104 104 104 104 103 103 103 103 103 103 103 103 103 102 102 102 102 102 102 100 100 100 99 99 100 100 99 98 98 98 99 99 99 99 99 98 98 97 97 97 97 97 97 98 98 98 98 98 98
843I8%j%J%%%%%%%%Jj%jJ%%J%%%%%j%%%j%%J%jj%%JJ%%%%j%%%%J%JJj%%%j%%%%j%Jjj%JJ%
835I8%%J%jj%%%%%%%%%%J%%%%%%%j%%%%Jj%%%%%%%J%J%j%%j%%%%J%j%%j%J%%%%jJ%%%%%%%
828I7%%%J%J%%%%Jj%j%%Jj%%KJ%j%j%%j%J%%%%J%j%%JJJJ%%%j%%%J%J%%JJK%%JJJJJJJKKK
820A21LKKJ%J%jkjjjjjjjjljjjjjjjj%j%%%j%%j%j%%JJJJJ%JJ%%%JKJJJJKKJKKLKLMLMLML
813A56LL%%jkkklkmmmmkllmljkjkjjj%jjj%%j%j%j%%J%J%J%%%%%%%J%J%JJKJJJJKJJLKJ%%
805A27%Jjjjjkkjkk%jjkkjjkjjj%%%j%%j%%j%%jJ%%j%j%%%JJ%%jjj%%%%%%%%%%%%jJ%%%%%
798I6%%%%J%%Jj%j%%j%%%JJ%%%%%%%J%%j%%%%j%%J%%%Jj%j%%%%%%J%%j%J%%%Jj%jj%%%J%%
790I6J%%%%j%%%%%%j%jJ%%%%%%%%J%J%%j%j%%%%j%%%%%%J%%j%JJjJ%%%%j%%Jj%%%%%%jK%%
$$ plain form
843 98 98 97 97 98 98 98 98 98 98 98 98 98 99 98 98 97 98 98 98 99 99 99 99 99 99 98 98 98 98 97 97 97 98 98 97 96 96 96 97 98 98 98 98 98 97 97 97 97 97 98 98 99 100 99 99 99 99 98 98 98 98 98 97 97 98 97 96 96 97 98 98
835 98 98 98 99 99 98 97 97 97 97 97 97 97 97 97 97 97 98 98 98 98 98 98 98 98 97 97 97 97 97 98 97 97 97 97 97 97 97 97 98 98 99 99 98 98 98 97 97 97 97 97 98 98 97 97 97 96 96 97 97 97 97 97 96 97 97 97 97 97 97 97 97
828 97 97 97 97 98 98 99 99 99 99 99 100 99 99 98 98 98 99 98 98 98 100 101 101 100 100 99 99 99 98 98 99 99 99 99 99 100 100 99 99 99 100 101 102 103 103 103 103 102 102 102 102 103 103 104 104 104 105 106 108 108 108 109 110 111 112 113 114 115 117 119 121
820 121 124 126 128 129 129 130 130 129 127 126 125 124 123 122 121 120 119 116 115 114 113 112 111 110 109 108 108 107 107 107 107 106 106 106 105 105 104 104 104 105 106 107 108 109 109 110 111 111 111 111 112 114 115 116 117 118 120 122 123 125 127 130 132 135 139 142 146 149 153 156
813 156 159 162 162 162 161 159 157 155 152 150 146 142 138 134 132 129 126 122 119 118 116 115 113 112 111 110 110 109 108 107 107 107 106 106 105 105 104 104 104 105 105 106 106 107 107 107 107 107 107 107 107 108 108 109 109 110 111 113 114 115 116 117 119 120 121 124 126 127 127 127
805 127 127 128 127 126 125 124 122 120 119 117 115 115 114 113 111 109 108 107 105 104 103 102 102 102 102 101 101 101 100 100 100 99 99 99 98 99 99 99 98 98 97 97 97 97 98 99 99 99 98 97 96 96 96 96 96 96 96 96 96 96 96 96 96 95 96 96 96 96 96 96
798 96 96 96 96 96 97 97 97 98 97 97 96 96 96 95 95 95 95 96 97 97 97 97 97 97 97 97 98 98 98 97 97 97 97 97 96 96 96 97 97 97 97 98 97 97 96 96 96 96 96 96 96 97 97 97 96 96 97 97 97 97 98 97 97 96 95 95 95 95 96 96 96
790 96 97 97 97 97 97 96 96 96 96 96 96 96 95 95 94 95 95 95 95 95 95 95 95 95 96 96 97 97 97 96 96 95 95 95 95 95 94 94 94 94 94 94 94 95 95 95 94 94 95 96 95 96 96 96 96 96 95 95 95 96 95 95 95 95 95 95 95 94 96 96 96
783I6%j%%%J%%%%%%j%%j%%j%%J%%%J%j%%J%%%J%%%%%%%Jj%j%J%J%%%%%j%%%%%%%%j%%%%%%
775I5%%%%%%j%J%%%%%j%J%J%Jj%%j%%J%%j%%%%j%%%%J%J%%%J%Jj%j%j%%%%%J%%j%%J%%%J%
768I7%%j%j%%%J%j%%%%J%%%%%%%%%%%%j%%j%%%%JJ%jj%J%J%%%%%%%%JJ%%%j%JK%%%J%%jj%
760I9J%Jj%J%%%%jjj%%j%%Jj%%%%%%%%%%J%%j%%%%%%%%J%Jj%%%J%J%%JJJ%%%J%%J%%%%j%j
753A03J%%jjj%%%j%jj%j%%%j%%%%%J%%%%%J%j%%%%J%%%%J%j%%%%J%jjJ%%J%%%j%J%%Jj%%%
745I9jj%%%%J%j%%%%%%%jj%%%J%%j%J%%%Jj%%%%%J%%j%%%j%%%%%%J%J%jjJJ%%j%%%JjjJ%%
738I6%%Jj%j%%%J%%Jj%%%%%%%%%j%%%%%jJ%%%%%%%%%%%%%%%%%%%j%%%J%j%j%%J%J%%J%j%%
730I5%J%%j%%%%%J%%%%j%%%%%%%%J%%j%%%%%J%%j%%%%%%%k%JJ%j%%JKjj%%%%%%%%%%%%j%%
$$ plain form
783 96 96 95 95 95 95 96 96 96 96 96 96 96 95 95 95 94 94 94 93 93 93 94 94 94 94 95 95 94 94 94 95 95 95 95 96 96 96 96 96 96 96 96 97 96 96 95 95 96 96 97 97 97 97 97 97 96 96 96 96 96 96 96 96 96 95 95 95 95 95 95 95
775 95 95 95 95 95 95 95 94 94 95 95 95 95 95 95 94 94 95 95 96 96 97 96 96 96 95 95 95 96 96 96 95 95 95 95 95 94 94 94 94 94 95 95 96 96 96 96 97 97 98 97 97 96 96 95 95 95 95 95 95 96 96 96 95 95 95 96 96 96 96 97 97
768 97 97 97 96 96 95 95 95 95 96 96 95 95 95 95 95 96 96 96 96 96 96 96 96 96 96 96 96 96 95 95 95 94 94 94 94 94 95 96 96 95 94 94 95 95 96 96 96 96 96 96 96 96 96 97 98 98 98 98 97 97 98 100 100 100 100 101 101 101 100 99 99
760 99 100 100 101 100 100 101 101 101 101 101 100 99 98 98 98 97 97 97 98 97 97 97 97 97 97 97 97 97 97 97 98 98 98 97 97 97 97 97 97 97 97 97 98 98 99 98 98 98 98 99 99 100 100 100 101 102 103 103 103 103 104 104 104 105 105 105 105 105 104 104 103
753 103 104 104 104 103 102 101 101 101 101 100 100 99 98 98 97 97 97 97 96 96 96 96 96 96 97 97 97 97 97 97 98 98 97 97 97 97 97 98 98 98 98 98 99 99 98 98 98 98 98 99 99 98 97 98 98 98 99 99 99 99 98 98 99 99 99 100 99 99 99 99
745 99 98 97 97 97 97 97 98 98 97 97 97 97 97 97 97 97 96 95 95 95 95 96 96 96 95 95 96 96 96 96 97 96 96 96 96 96 96 97 97 97 96 96 96 96 95 95 95 95 95 95 95 96 96 97 97 96 95 96 97 97 97 96 96 96 96 97 96 95 96 96 96
738 96 96 96 97 96 96 95 95 95 95 96 96 96 97 96 96 96 96 96 96 96 96 96 96 95 95 95 95 95 95 94 95 95 95 95 95 95 95 95 95 95 95 95 95 95 95 95 95 95 95 95 94 94 94 94 95 95 94 94 93 93 93 94 94 95 95 95 96 96 95 95 95
730 95 95 96 96 96 95 95 95 95 95 95 96 96 96 96 96 95 95 95 95 95 95 95 95 95 96 96 96 95 95 95 95 95 95 96 96 96 95 95 95 95 95 95 95 95 93 93 94 95 95 94 94 94 95 97 96 95 95 95 95 95 95 95 95 95 95 95 95 95 94 94 94
$$ [...]
-2632H8
##END=		$$ NMR SPECTRUM
##END=		$$ LINK
