##TITLE=	RP309 full char.10.fid
##JCAMP-DX=	6.0	$$ MestReNova 14.3.3-33362
##DATA TYPE=	LINK
##BLOCKS=	1    
##ORIGIN=	Mestrelab Research S.L.
##OWNER=	hrzepa
##$MNOVA/METADATA=	(DOCUMENT,BASE64)
eyJuYW1lIjoiL1VzZXJzL2hyemVwYS9MaWJyYXJ5L01vYmlsZSBEb2N1bWVudHMvY29tfmFwcGxlfkN
sb3VkRG9jcy9TaGVwcGFyZC9OTVIgZmlsZXMgemlwcy0yLzExLzExLUgubW5vdmEiLCJwYWdlcyI6W3
siaXRlbXMiOlsiMSIgICAgIF19XX0=
##TITLE=	RP309 full char.10.fid
##JCAMP-DX=	6.0	$$ MestReNova 14.3.3-33362
##DATA TYPE=	NMR SPECTRUM
##DATA CLASS=	XYDATA
##BLOCK_ID=	1
##ORIGIN=	Bruker BioSpin GmbH
##OWNER=	nmrsu
##NUMDIM=	1
##$MNOVA/METADATA=	(ITEM,BASE64)
eyJhbmdsZSI6MCwiYXhlcyI6eyJ4Ijp7Im1heCI6MTYuMDY0MjU5OTk5OTM5MTI1LCJtaW4iOi0zLjc
2Njk0MjMzOTE1NjYyMjZ9LCJ5Ijp7Im1heCI6NjgwNTAuMzE4MzU5Mzc1LCJtaW4iOi02MTIzLjEyMT
M1MzE0OTQxNH19LCJwb2ludHMiOlt7IngiOjUzMjEsInkiOjU4MzV9LHsieCI6ODcyMiwieSI6NTgzN
X0seyJ4Ijo4NzIyLCJ5Ijo4MjA4fSx7IngiOjUzMjEsInkiOjgyMDh9LHsieCI6NTMyMSwieSI6NTgz
NX1dLCJ6IjowfQ==
##.OBSERVE FREQUENCY=	700.35432466099996418
##.OBSERVE NUCLEUS=	^1H
##.SOLVENT NAME=	CDCl3
##.PULSE SEQUENCE=	zg30
##LONGDATE=	2023/07/09 11:27:13.000
##.ACQUISITIONMODE=	SIMULTANEOUS (DQD)
##$ORIGINAL FORMAT=	Bruker XWIN-NMR
##$MNOVA/SCALES_VERSION=	9
##$PARAMETER FILE=	(acqus, ASCII, /private/var/folders/f6/rjf_tdyn2v98c5c0wvkgn4s80000gq/T/V5sQ0OjJQjuEbMRir49+Rg/10/acqus, 0)
$$ ##TITLE= Parameter file, TopSpin 4.1.3
$$ ##JCAMPDX= 5.0
$$ ##DATATYPE= Parameter Values
$$ ##NPOINTS= 1	$$ modification sequence number
$$ ##ORIGIN= Bruker BioSpin GmbH
$$ ##OWNER= nmrsu
$$ $$ 2023-07-09 11:26:21.180 +0100  nmrsu@CZC7167VR1
$$ $$ Z:/700/data/tds/nmr/RP309 full char/10/acqus
$$ $$ process C:\Bruker\TopSpin4.1.3\prog\mod\dirdata.exe
$$ ##$ACQT0= -2.0981556054023
$$ ##$AMP= (0..31)
$$ 100 100 100 100 100 100 100 100 100 100 100 100 100 100 100 100 100 100
$$ 100 100 100 100 100 100 100 100 100 100 100 100 100 100
$$ ##$AMPCOIL= (0..32)
$$ -1 0 0 0 0 0 0 0 0 0 0 0 0 0 0 0 0 0 0 0 0 0 0 0 0 0 0 0 0 0 0 0 0
$$ ##$AQSEQ= 0
$$ ##$AQ_mod= 3
$$ ##$AUNM= <au_zg>
$$ ##$AUTOPOS= <27 >
$$ ##$BF1= 700.349999998
$$ ##$BF2= 700.349999998
$$ ##$BF3= 700.349999998
$$ ##$BF4= 700.349999998
$$ ##$BF5= 700.349999998
$$ ##$BF6= 700.349999998
$$ ##$BF7= 700.349999998
$$ ##$BF8= 700.349999998
$$ ##$BWFAC= (0..63)
$$ 0 0 0 0 0 0 0 0 0 0 0 0 0 0 0 0 0 0 0 0 0 0 0 0 0 0 0 0 0 0 0 0 0 0 0 0
$$ 0 0 0 0 0 0 0 0 0 0 0 0 0 0 0 0 0 0 0 0 0 0 0 0 0 0 0 0
$$ ##$BYTORDA= 0
$$ ##$CHANFCU= (0..24)
$$ 0 1 0 0 0 0 0 0 0 0 0 0 0 0 0 0 0 0 0 0 0 0 0 0 0
$$ ##$CHANREC= (0..24)
$$ 0 0 0 0 0 0 0 0 0 0 0 0 0 0 0 0 0 0 0 0 0 0 0 0 0
$$ ##$CHEMSTR= <none>
$$ ##$CNST= (0..63)
$$ 1 1 1 1 1 1 1 1 1 1 1 1 1 1 1 1 1 1 1 1 1 1 1 1 1 1 1 1 1 1 1 1 1 1 1 1
$$ 1 1 1 1 1 1 1 1 1 1 1 1 1 1 1 1 1 1 1 1 1 1 1 1 1 1 1 1
$$ ##$CPDPRG= (0..8)
$$ <> <> <> <> <> <> <> <> <>
$$ ##$D= (0..63)
$$ 0 1 0 0 0 0 0 0 0 0 0 0 0 0 0 0 0.0002 0 0 0 0 0 0 0 0 0 0 0 0 0 0 0 0
$$ 0 0 0 0 0 0 0 0 0 0 0 0 0 0 0 0 0 0 0 0 0 0 0 0 0 0 0 0 0 0 0
$$ ##$DATE= 1688898433
$$ ##$DATE_START= 1688898390
$$ [...]
$$ ##$ShimPowRng3= (0..63)
$$ 1 1 1 1 1 1 1 1 1 1 1 1 1 1 1 1 1 1 1 1 1 1 1 1 1 1 1 1 1 1 1 1 1 1 1 1
$$ 1 1 1 1 0 0 0 0 0 0 0 0 0 0 0 0 0 0 0 0 0 0 0 0 0 0 0 0
$$ ##$ShimPowType1= 8
$$ ##$ShimPowType2= 8
$$ ##$ShimPowType3= 0
$$ ##$ShimPowType4= 0
$$ ##$ShimPowType5= 0
$$ ##$ShimPowType6= 0
$$ ##$ShimPowType7= 0
$$ ##$ShimPowType8= 0
$$ ##$ShimSysActGrad= (0..63)
$$ 1 2 3 4 13 5 7 11 10 9 6 8 12 18 19 20 21 15 22 23 24 14 25 16 26 17 27
$$ 28 31 32 33 34 35 36 37 38 0 0 0 0 0 0 0 0 0 0 0 0 0 0 0 0 0 0 0 0 0 0
$$ 0 0 0 0 0 0
$$ ##$ShimSysAngle= <>
$$ ##$ShimSysFunc= (0..63)
$$ 1 2 3 4 5 6 7 8 9 10 0 37 38 35 16 15 14 13 12 11 28 27 26 25 24 23 36
$$ 22 30 29 20 21 34 33 32 31 17 18 19 0 0 0 0 0 0 0 0 0 0 0 0 0 0 0 0 0 0
$$ 0 0 0 0 0 0 0
$$ ##$ShimSysMatId= <292722da.dat>
$$ ##$ShimSysMatrix= 1
$$ ##$ShimSysMinMaxUG= 130000
$$ ##$ShimSysOffset= <29 mm>
$$ ##$ShimSysType= 4
$$ ##$ShimUnit= 3
$$ ##$SpectrOsVersion= <4.1.156.20210628>
$$ ##$TCubeEth= <192.168.180.38>
$$ ##$TCubeSeqDevice= <>
$$ ##$TOSITY= <no>
$$ ##$TRIPLO2= 0
$$ ##$TopSpinVersion= <TopSpin 4.1.3>
$$ ##$TrxFreqFormula= (0..23)
$$ <TrxFreqFormula(2.0,700350000.000000,'TRX',Trx(1.0,'TRX 1200.1',1,5.000000,1290.000000))>
$$ <TrxFreqFormula(2.0,700350000.000000,'TRX',Trx(1.0,'TRX 1200.2',1,5.000000,1290.000000))>
$$ <TrxFreqFormula(2.0,700350000.000000,'TRX',Trx(1.0,'TRX 1200.3',1,5.000000,1290.000000))>
$$ <> <> <> <> <> <> <> <> <> <> <> <> <> <> <> <> <> <> <> <> <>
$$ ##$TrxPN= (0..23)
$$ <Z148391> <Z148391> <Z148391> <> <> <> <> <> <> <> <> <> <> <> <> <> <>
$$ <> <> <> <> <> <> <>
$$ ##$TrxSN= (0..23)
$$ <00336> <00337> <00342> <> <> <> <> <> <> <> <> <> <> <> <> <> <> <> <>
$$ <> <> <> <> <>
$$ ##$VCubeEth= (0..23)
$$ <no> <no> <no> <no> <no> <no> <no> <no> <no> <no> <no> <no> <no> <no> <no>
$$ <no> <no> <no> <no> <no> <no> <no> <no> <no>
$$ ##$VTU= 2
$$ ##$VTUETH= <192.168.99.11>
$$ ##$VTUTY= <no>
$$ ##$ValueLine= no
$$ ##$VpuPN= (0..23)
$$ <no> <no> <no> <no> <no> <no> <no> <no> <no> <no> <no> <no> <no> <no> <no>
$$ <no> <no> <no> <no> <no> <no> <no> <no> <no>
$$ ##$VpuSN= (0..23)
$$ <no> <no> <no> <no> <no> <no> <no> <no> <no> <no> <no> <no> <no> <no> <no>
$$ <no> <no> <no> <no> <no> <no> <no> <no> <no>
$$ ##$WBREFAM= (0..31)
$$ 99.8 100 100 100 100 100 100 100 100 100 100 100 100 100 100 100 100 100
$$ 100 100 100 100 100 100 100 100 100 100 100 100 100 100
$$ ##$WBREFLM= (0..31)
$$ 1 0 1 0 0 0 0 0 0 0 0 0 0 0 0 0 0 0 0 0 0 0 0 0 0 0 0 0 0 0 0 0
$$ ##$WBREFPH= (0..31)
$$ 0.05 0 0 0 0 0 0 0 0 0 0 0 0 0 0 0 0 0 0 0 0 0 0 0 0 0 0 0 0 0 0 0
$$ ##$WBSGU= (0..31)
$$ 1 2 4 0 0 0 0 0 0 0 0 0 0 0 0 0 0 0 0 0 0 0 0 0 0 0 0 0 0 0 0 0
$$ ##END=
$$ 
##$DECIM=	1440
##$DSPFVS=	21
##XUNITS=	HZ
##YUNITS=	ARBITRARY UNITS
##FIRSTX=	11250.604788156719223
##LASTX=	-2638.1781369192458442
##DELTAX=	-0.10596381293402784562
##XFACTOR=	1
##YFACTOR=	1.8879870563371685677
##FIRSTY=	119.891937255859375
##MINY=	63.29608917236328125
##MAXY=	61863.671875
##NPOINTS=	131072
##XYDATA=	(X++(Y..Y))
$$ [...]
7626 104 104 103 103 103 103 103 103 103 103 103 103 104 104 104 104 105 104 103 104 104 105 104 104 104 103 104 104 104 104 103 103 103 103 103 103 104 104 104 104 103 104 104 104 104 103 103 103 102 103 103 103 102 102 102 102 102 101 101 102 102 102 102 102 101 102 102 102 102 102
7619 102 102 102 102 103 103 102 102 102 102 102 103 103 103 103 103 104 103 103 103 103 104 104 103 102 102 102 102 101 102 102 102 102 103 102 102 102 103 104 103 103 102 101 101 101 102 102 101 101 101 101 102 102 102 102 102 103 103 102 103 103 103 103 102 102 101 101 102 102 102
7611 102 103 103 103 103 103 103 103 103 102 102 102 102 102 102 102 102 102 101 101 101 101 101 101 102 102 102 102 102 102 102 102 102 102 102 102 103 103 103 103 103 103 104 104 104 104 104 104 104 103 103 102 102 102 102 103 103 104 104 105 104 103 103 102 103 103 104 104 104 104
7604 104 104 104 104 104 104 103 103 103 104 104 104 104 104 103 103 103 103 103 103 104 104 104 104 104 104 104 104 104 104 103 103 103 103 103 104 104 104 104 104 104 105 105 105 104 105 105 105 105 105 105 105 105 105 105 105 105 105 104 104 103 104 104 104 104 104 104 104 104 104
7597 104 104 104 104 104 104 104 105 104 104 104 105 105 105 105 105 104 105 105 105 104 104 104 104 104 104 104 103 103 103 103 104 104 104 104 104 103 104 104 104 104 104 104 103 104 104 104 104 104 105 104 104 104 103 103 104 104 105 104 104 104 104 103 103 103 103 103 103 103 104
7590 104 104 104 104 104 104 104 104 103 103 103 103 104 104 104 103 103 102 102 102 103 103 104 104 104 104 104 104 104 104 104 103 103 103 104 103 103 103 104 104 104 104 104 104 104 104 104 104 104 104 104 104 104 104 104 104 103 103 104 104 104 104 104 104 103 103 103 103 104 105
7582 105 105 104 103 103 103 103 103 103 102 103 103 103 104 104 104 103 102 102 102 102 102 102 101 102 102 102 102 102 103 102 102 102 103 103 103 103 102 103 103 103 103 102 102 101 102 103 103 103 103 103 103 103 103 103 103 103 103 102 102 102 102 102 103 103 103 103 102 103 103
7575 103 103 102 102 102 102 102 102 102 102 102 102 102 102 102 102 102 102 102 102 103 103 103 103 104 104 103 103 103 103 103 103 103 103 102 102 103 103 103 103 103 103 103 103 103 102 102 102 101 102 102 102 102 102 102 102 101 101 102 102 102 102 103 103 103 102 101 102 102 102
7568 102 103 103 103 103 103 102 102 103 103 103 102 101 101 102 102 103 103 103 102 102 102 102 103 103 103 103 103 103 103 103 103 103 102 102 102 102 102 102 102 102 102 101 102 102 102 102 103 103 103 103 103 102 102 102 102 102 101 101 101 101 101 102 102 101 101 101 102 103 103
7560 103 103 103 102 102 101 101 101 102 102 102 102 102 102 102 103 103 103 103 103 103 104 103 103 103 103 103 104 103 103 103 103 103 103 103 103 103 103 103 103 103 103 103 103 102 102 102 103 103 103 104 104 104 104 103 103 103 103 104 104 104 104 103 103 103 103 103 103 104 104
7553 104 104 104 104 103 103 103 103 104 104 105 105 105 104 105 104 103 103 104 104 103 103 104 103 103 104 104 104 104 104 103 103 103 103 103 103 103 104 105 104 104 104 103 102 102 102 103 103 103 103 103 103 103 104 104 103 103 103 103 102 102 103 103 103 104 104 104 104 104 104
7546 104 104 103 103 103 104 104 104 104 104 105 105 105 105 106 105 105 105 105 104 104 104 104 104 104 103 103 104 104 104 104 104 103 104 104 104 104 104 104 103 104 104 105 105 104 103 102 102 102 102 102 102 102 102 101 101 102 103 103 103 103 102 103 103 104 104 104 104 104 104
7538 104 104 104 103 103 103 103 103 103 104 105 105 104 104 103 103 103 104 104 105 104 104 104 104 103 103 103 103 103 104 103 103 103 103 103 103 103 103 103 102 102 102 103 103 104 104 104 103 102 102 102 102 102 102 102 102 102 103 103 103 103 103 103 104 103 104 104 104 103 102
7531 102 101 101 101 101 101 101 101 102 102 103 103 103 103 103 103 103 103 103 103 103 103 103 103 102 102 102 102 103 103 104 103 103 103 102 102 102 101 101 101 102 102 102 102 102 102 103 103 103 103 102 103 103 103 103 103 103 103 103 103 103 104 103 103 103 103 103 103 103 103
7524 103 103 103 103 103 103 103 102 102 102 102 102 102 102 102 102 102 102 102 103 103 103 103 103 103 104 104 104 103 102 102 102 102 102 102 102 102 101 101 101 102 102 102 103 103 102 102 102 102 102 102 102 102 103 103 103 102 102 101 102 102 103 103 102 102 102 102 102 102 103
7516 103 103 103 102 102 102 102 102 102 102 102 102 103 103 102 102 102 102 102 102 102 102 102 101 101 101 101 101 102 102 102 102 101 102 103 102 102 102 102 102 102 103 103 103 103 103 102 102 102 102 103 103 102 102 102 102 103 103 103 103 103 103 102 102 102 102 102 102 102 102
7509 102 102 102 102 102 102 102 102 101 101 102 103 103 103 103 103 102 102 102 103 103 103 103 103 102 102 102 102 102 102 102 101 102 102 102 102 102 103 103 103 103 103 104 104 104 104 104 104 103 103 103 103 103 103 103 104 104 104 104 104 104 104 103 103 102 102 103 103 103 103
7502 103 103 103 103 104 104 104 104 103 103 103 103 103 102 103 102 102 102 102 102 102 103 103 103 103 103 103 103 104 104 103 103 103 103 103 102 102 102 102 102 102 102 102 102 102 102 102 102 102 102 101 102 103 103 103 103 102 102 103 103 102 102 102 102 102 102 102 103 103 103
7495 103 102 102 103 103 103 104 104 104 104 103 103 103 104 104 103 102 102 102 103 103 103 103 103 103 103 102 102 101 102 103 103 103 103 103 103 102 102 101 101 101 101 101 101 101 102 102 102 102 101 101 101 101 102 103 103 104 104 104 103 103 103 103 103 103 103 104 104 103 103
7487 103 102 102 102 102 102 102 103 103 103 102 102 102 102 103 103 104 103 103 103 102 102 102 102 102 102 101 101 101 101 101 102 103 104 104 103 102 102 101 101 101 102 102 102 102 102 102 102 102 102 102 102 103 102 102 101 101 101 102 102 102 102 103 103 103 103 103 103 102 102
7480 102 102 102 102 102 102 103 103 102 102 102 103 103 103 103 103 102 102 101 101 101 102 102 102 102 102 102 102 103 103 103 103 103 103 103 103 102 102 103 103 104 103 103 102 101 101 101 101 102 103 104 104 103 103 103 103 103 103 103 104 104 103 104 104 104 104 104 104 104 105
7473 105 104 104 104 103 103 104 104 104 104 104 103 103 103 104 104 103 103 103 103 102 103 103 102 102 103 103 103 104 104 105 105 105 104 104 104 104 104 104 104 105 104 104 104 104 104 104 103 102 102 103 103 104 104 104 104 103 103 103 104 104 104 105 105 104 104 104 104 104 104
7465 104 104 104 104 104 104 104 104 104 104 104 103 102 103 103 103 102 103 103 103 102 103 103 103 103 103 103 103 103 103 103 104 104 104 104 103 103 103 102 102 102 102 102 102 102 102 103 103 103 102 102 102 103 104 104 104 104 104 103 103 102 102 102 103 103 103 103 103 103 103
7458 103 103 103 104 105 105 105 104 104 103 102 102 102 102 103 103 104 104 104 104 105 105 105 105 104 103 103 103 103 103 103 104 104 104 103 103 102 103 103 103 103 103 103 103 102 103 103 103 103 103 103 103 103 103 103 103 103 103 103 104 103 103 103 103 103 103 103 103 103 103
7451 103 103 103 103 103 103 104 104 103 103 103 103 103 103 103 103 103 103 103 103 103 103 103 103 103 103 102 102 102 103 103 103 103 103 102 102 101 101 101 102 102 102 101 101 102 102 102 102 102 103 103 103 103 103 103 104 104 103 103 103 103 103 103 104 104 103 102 102 103 103
7443 103 103 102 102 102 102 102 102 102 102 103 102 103 103 104 103 103 103 103 103 103 103 103 103 103 103 103 103 104 104 103 103 102 102 103 103 104 103 103 103 103 104 104 104 104 104 103 103 103 102 102 102 101 102 103 103 103 104 104 104 104 103 102 102 102 102 102 102 102 102
7436 102 103 103 103 104 104 104 103 103 103 103 103 103 103 103 103 102 102 103 103 103 103 103 103 103 102 102 103 103 103 103 102 102 102 102 102 102 102 103 104 104 104 104 104 103 103 104 103 102 102 103 104 103 103 103 103 103 103 103 103 103 103 103 102 103 103 103 103 102 102
7429 102 102 102 102 103 103 103 103 104 104 103 103 103 103 104 103 103 102 102 103 104 104 104 104 103 103 102 103 103 103 104 104 103 103 103 103 103 103 103 103 103 103 103 103 103 102 102 102 102 103 103 103 103 103 103 103 102 102 102 102 102 102 103 103 103 104 104 104 104 104
7421 104 104 103 103 104 104 104 104 104 104 104 103 103 103 103 103 103 104 103 103 102 103 104 105 105 104 104 104 104 103 103 103 103 103 103 102 102 102 102 102 102 102 102 103 103 103 103 103 102 101 101 101 101 102 103 103 103 103 103 102 102 102 102 101 101 102 103 103 103 103
7414 103 103 103 103 101 101 102 103 103 102 102 101 101 101 102 102 102 102 103 103 103 103 103 104 103 102 103 104 103 102 101 100 101 101 101 102 102 102 102 102 102 102 102 102 102 102 102 102 102 102 102 102 103 103 103 102 102 102 102 102 102 102 102 103 103 102 102 101 102 102
7407 102 102 102 103 103 103 103 103 102 102 102 102 102 101 101 101 101 100 100 101 101 101 101 101 101 101 102 102 102 102 102 102 102 103 103 102 102 101 101 101 101 101 101 100 100 101 101 101 101 102 101 101 101 101 101 101 101 100 100 99 100 100 101 100 100 99 99 99 99 99
7399 99 100 100 100 100 100 101 101 101 100 99 99 99 99 100 100 100 100 101 101 101 101 101 101 101 101 100 101 101 101 101 101 101 101 101 101 101 101 101 101 100 101 101 101 101 101 101 101 101 101 101 101 101 101 101 101 102 102 102 102 102 102 101 102 101 101 102 102 102 102 103
7392 103 102 102 103 103 104 103 103 102 102 102 103 103 103 103 102 102 102 102 102 102 102 102 102 102 102 102 103 103 103 102 102 102 102 101 102 101 101 101 102 103 103 103 103 102 102 103 103 103 103 103 103 103 104 103 103 104 104 104 103 103 103 102 102 103 103 103 103 103 103
7385 103 103 103 103 103 103 103 103 103 103 103 103 103 104 104 103 103 103 103 103 103 102 102 102 103 104 105 105 104 103 103 102 103 103 103 104 104 104 104 103 103 103 104 104 103 104 105 105 105 104 104 103 103 103 104 104 104 104 104 104 104 104 104 104 104 104 104 104 104 103
7377 103 104 104 104 105 105 104 103 103 104 104 105 104 103 103 103 104 104 104 104 104 104 104 104 104 104 104 104 104 104 104 103 103 103 103 103 104 104 105 105 104 104 104 104 104 105 104 104 104 104 103 103 103 103 103 103 104 104 105 104 104 103 103 103 102 102 102 103 103 103
7370 103 103 102 102 101 101 101 102 102 102 102 102 103 103 103 103 103 103 103 103 103 103 103 103 104 104 104 103 103 102 103 103 103 103 103 103 103 103 102 102 102 102 102 103 103 103 103 103 103 104 104 104 104 104 104 104 104 103 103 103 103 102 102 102 103 103 103 102 102 103
7363 103 104 104 104 104 104 104 104 104 104 103 103 104 104 104 104 103 103 103 103 103 103 103 103 103 103 103 103 103 103 104 103 103 103 103 103 103 103 103 103 103 104 104 104 104 104 104 104 104 104 104 104 103 103 103 103 103 103 103 103 103 104 104 104 105 105 105 105 105 104
7355 104 104 104 103 103 103 103 103 103 103 103 103 103 103 103 103 103 103 103 103 103 104 104 104 104 104 104 104 104 103 102 102 101 102 103 103 103 104 104 104 104 104 104 104 104 104 105 105 105 104 104 104 104 104 104 104 105 104 104 104 103 102 103 103 104 104 104 104 104 104
7348 104 104 104 104 104 104 104 104 104 104 104 104 105 105 105 106 106 105 104 104 103 103 104 104 104 104 104 104 104 104 104 104 104 104 104 104 104 104 104 105 105 105 105 105 105 104 104 105 105 106 105 105 104 104 104 104 104 104 105 106 106 106 105 104 104 104 104 104 104 104
7341 104 105 105 105 105 106 106 106 106 105 105 105 105 105 104 104 104 104 104 104 104 105 105 105 105 105 105 106 106 107 107 107 107 106 106 106 106 106 106 105 105 105 105 105 105 105 105 105 105 105 105 105 105 106 106 105 105 105 105 105 106 106 107 107 107 106 105 105 105 105
7334 105 105 106 106 105 105 104 104 105 106 106 107 107 107 106 106 106 105 105 105 105 106 106 105 105 105 105 105 105 105 105 105 105 105 105 105 105 106 106 106 105 105 105 105 105 106 106 106 105 105 104 104 104 104 104 104 104 105 105 105 104 104 105 105 105 105 105 105 105 105
7326 105 104 104 104 104 104 104 104 104 104 103 103 103 103 103 103 103 103 104 105 105 106 105 105 105 105 104 103 103 103 104 105 104 104 104 105 105 105 105 105 105 105 105 104 104 103 103 103 103 102 102 103 102 102 102 103 103 103 103 103 102 102 102 101 102 102 103 104 104 104
7319 104 103 103 103 103 103 103 103 102 102 102 101 102 103 103 102 102 102 102 102 102 102 103 103 103 103 103 103 103 103 102 102 102 101 102 102 102 102 102 102 102 102 102 102 102 101 101 102 102 102 102 102 102 102 102 103 103 103 103 103 103 104 104 104 104 104 104 103 103 103
7312 103 104 105 105 105 104 104 103 103 103 103 103 103 103 103 103 102 102 103 104 104 104 104 104 103 103 102 102 101 101 102 103 103 103 103 103 103 103 103 102 102 102 103 104 104 104 104 104 104 104 104 104 104 104 103 103 103 103 103 103 103 103 103 103 104 104 104 105 104 104
7304 104 104 104 104 104 104 105 104 104 104 105 104 104 104 104 104 104 104 104 104 104 104 103 103 104 105 105 105 106 106 105 105 105 105 105 105 105 105 105 105 105 106 106 106 107 106 106 105 104 104 104 105 106 106 106 106 106 107 107 107 106 106 106 106 106 106 106 106 105 105
7297 105 104 104 104 104 104 104 103 103 104 105 105 105 105 105 106 106 106 105 105 105 105 106 106 106 106 106 106 106 106 106 106 106 106 106 106 106 106 106 105 105 106 106 106 106 106 106 107 106 106 106 106 105 104 104 104 105 106 106 106 106 106 106 105 105 105 105 105 105 106
7290 106 106 106 106 106 106 106 106 106 106 106 106 106 106 106 106 105 105 105 105 105 105 106 106 106 106 106 106 105 106 106 106 106 107 107 106 105 105 106 105 105 105 105 105 105 105 105 105 105 105 105 106 106 106 105 105 105 105 105 105 105 106 106 105 105 105 105 104 104 105
7282 105 105 106 106 106 106 106 106 106 105 105 105 106 106 106 105 105 105 106 105 105 105 105 105 106 106 106 107 107 106 106 106 106 106 105 105 106 106 106 107 107 107 106 106 106 106 106 106 106 106 106 106 106 106 107 106 106 105 105 104 105 105 105 105 105 105 105 105 105 105
7275 105 105 105 105 105 105 105 105 105 105 105 105 105 105 105 106 106 106 106 105 105 105 105 105 105 105 105 105 105 105 105 105 105 105 105 105 106 106 106 106 107 107 107 106 105 105 105 106 106 106 106 107 107 106 106 106 106 106 106 107 107 107 108 108 107 107 107 107 106 106
7268 106 106 106 106 106 106 106 107 106 106 106 106 106 106 106 106 105 106 106 106 107 106 106 105 105 106 107 107 107 108 108 108 108 108 107 107 107 107 107 107 107 107 107 107 107 107 107 107 107 107 107 107 106 106 106 106 106 106 106 106 107 107 107 108 108 108 108 108 108 108
7260 108 107 107 107 107 107 107 107 107 107 107 107 108 107 107 107 107 107 107 108 108 107 107 106 106 106 106 106 107 106 106 106 106 107 106 106 106 106 106 106 107 107 107 106 106 106 106 106 106 106 106 107 107 107 107 107 108 108 107 107 107 107 107 107 107 107 107 107 107 107
7253 107 107 107 106 107 107 107 108 107 107 106 106 106 106 106 106 106 106 106 106 107 107 107 107 107 106 106 106 106 105 105 106 107 108 108 108 108 108 107 107 107 107 108 108 108 108 108 107 107 107 107 107 107 107 108 108 109 109 109 108 108 108 108 108 108 108 108 108 108 108
7246 108 109 110 110 110 109 109 109 109 109 109 108 108 107 107 107 107 108 108 108 108 109 109 109 108 108 108 107 107 108 108 108 108 108 109 108 108 109 109 109 109 109 110 110 109 109 109 109 109 109 109 109 109 108 108 109 110 109 109 109 109 109 109 109 109 110 110 109 109 109
7238 109 108 108 107 108 108 108 109 109 109 110 110 110 111 111 110 110 110 111 111 112 111 110 110 110 111 111 111 111 110 110 110 110 110 110 110 110 110 110 110 110 111 111 111 111 110 109 109 110 110 110 110 109 109 110 110 111 111 110 110 110 111 111 111 111 111 111 111 111 111
7231 111 110 110 110 111 111 111 111 111 111 111 110 110 111 111 111 111 110 110 110 110 110 110 110 110 111 111 111 111 111 111 111 112 111 111 111 111 111 110 110 110 110 110 110 110 110 110 110 111 111 110 110 110 110 109 110 111 111 111 112 112 112 112 112 112 111 111 111 111 111
7224 111 111 110 110 111 111 111 111 111 110 110 111 111 111 112 112 112 112 112 111 111 111 112 112 112 111 111 111 111 111 111 111 111 111 111 111 112 112 113 113 113 112 113 113 113 112 112 111 110 110 111 111 111 111 111 111 111 112 112 112 112 112 113 113 113 113 113 113 113 112
7217 112 112 112 112 112 112 112 112 112 112 112 113 113 112 112 112 113 112 112 112 112 113 113 112 112 112 111 111 110 111 111 111 111 111 112 112 112 111 112 111 110 110 111 112 113 113 113 113 113 113 113 113 112 112 112 112 112 112 112 113 114 113 113 113 113 113 113 113 113 112
7209 112 112 112 112 112 112 112 112 112 112 112 112 111 111 112 112 112 112 112 112 112 112 113 113 112 112 112 113 112 112 112 112 112 113 113 113 113 112 111 111 112 112 112 111 111 111 111 111 111 111 111 111 112 112 112 112 112 112 112 112 111 111 111 112 112 112 112 112 113 113
7202 113 112 112 112 112 112 112 113 113 113 113 113 113 113 113 112 112 112 112 111 111 111 112 112 112 112 111 111 112 112 112 112 112 112 112 112 113 112 112 113 113 113 114 114 113 113 113 114 113 113 112 113 113 113 113 113 113 113 113 112 112 113 112 112 112 113 113 113 113 113
7195 113 113 113 114 114 114 114 113 114 114 114 114 114 113 113 114 114 114 114 114 114 114 114 114 113 113 113 114 114 115 115 115 114 114 114 114 115 115 115 115 115 116 116 115 115 115 115 115 115 116 115 116 116 116 115 115 115 114 115 115 116 116 116 116 116 116 115 115 115 116
7187 116 116 116 116 116 116 115 116 117 117 116 116 116 117 117 117 117 117 117 117 117 117 117 116 116 116 116 116 117 118 118 118 118 118 118 118 118 117 116 117 117 117 117 117 117 117 117 118 118 118 117 118 118 118 119 119 119 118 119 119 119 119 119 118 117 117 117 117 117 117
7180 117 117 117 118 118 118 118 117 117 117 117 118 118 119 119 119 118 119 119 119 119 120 120 120 119 119 120 120 120 120 120 119 119 119 119 119 120 120 120 119 119 119 119 119 119 120 120 120 120 120 120 120 120 121 120 120 120 120 120 120 120 120 121 121 122 122 121 121 120 120
7173 120 120 120 120 120 120 120 120 121 121 121 121 121 121 120 120 120 119 119 120 120 121 121 121 121 121 121 121 121 121 122 121 121 121 121 121 122 122 122 122 123 123 123 123 123 123 124 123 123 122 122 121 121 121 121 121 121 121 122 122 122 122 122 122 122 122 122 122 122 122
7165 122 122 122 122 122 122 122 122 122 122 123 123 123 123 123 123 123 123 123 123 123 123 123 123 123 123 124 123 123 123 123 123 123 123 123 123 123 123 123 123 123 123 124 124 124 124 125 125 125 125 125 125 125 125 125 125 125 124 125 125 125 125 125 125 126 126 126 126 126 126
7158 126 126 126 126 125 125 125 125 125 125 125 126 126 126 126 126 127 127 127 126 126 127 127 127 127 126 125 125 126 126 126 126 126 125 126 127 127 127 128 128 128 128 128 128 127 127 127 127 127 127 128 128 128 127 126 126 127 128 128 127 127 127 127 127 127 127 128 128 128 128
7151 128 128 129 129 129 129 128 128 128 128 128 128 128 129 130 130 130 129 129 129 129 129 129 130 130 130 130 131 131 131 132 131 130 130 130 130 130 130 130 130 130 129 130 130 130 130 130 130 130 130 130 130 130 130 131 131 132 132 132 132 132 131 131 132 132 132 132 132 132 132
7143 132 132 132 133 133 133 133 133 133 133 133 133 133 133 134 134 134 134 134 135 134 133 133 133 132 133 133 133 134 134 135 135 135 135 135 135 134 134 133 134 134 135 135 135 135 135 135 136 137 137 137 137 138 138 137 137 137 137 137 137 137 137 137 137 137 137 138 138 138 138
7136 138 137 137 138 139 139 139 139 138 138 139 138 138 138 138 139 139 139 139 140 140 140 140 140 140 140 140 140 140 140 140 140 140 140 141 140 140 140 141 141 141 141 141 142 142 142 141 142 142 142 143 142 141 141 142 142 142 142 142 142 142 142 143 143 143 143 144 144 144 144
7129 144 144 144 144 144 144 143 143 143 143 144 145 146 146 146 146 146 146 146 147 147 147 147 147 147 146 146 146 146 146 146 147 147 148 148 148 148 148 148 148 148 149 149 149 149 149 150 149 149 149 149 149 148 148 149 150 150 150 150 150 150 151 151 151 152 152 152 151 151 151
7122 151 151 152 152 152 152 152 153 153 153 153 153 153 153 154 155 155 155 155 154 155 155 155 155 156 156 156 156 156 156 156 156 156 156 156 155 156 157 158 158 158 158 158 158 158 159 158 158 158 159 159 159 159 159 159 159 160 161 161 160 160 160 160 161 162 163 164 164 164 163
7114 163 164 164 164 164 164 163 163 164 164 164 164 164 164 165 165 165 165 165 166 166 166 166 166 166 166 166 166 166 166 167 166 167 167 167 167 168 168 169 169 169 169 169 169 169 170 169 169 169 169 170 170 171 172 172 172 172 172 172 172 173 173 173 173 173 174 174 175 175 175
7107 175 176 176 176 176 176 176 177 177 177 177 177 177 178 178 179 179 179 178 178 179 179 179 180 180 180 180 180 180 181 181 182 182 182 182 182 183 183 183 183 184 184 185 185 185 185 186 186 186 186 187 187 187 187 187 188 188 188 188 188 189 189 190 190 191 191 192 192 192 193
7100 193 193 193 193 193 193 194 195 195 195 195 195 196 196 197 197 198 198 199 199 199 200 200 200 199 200 200 200 200 201 202 202 203 204 205 205 204 205 205 206 206 206 206 206 207 207 207 208 208 208 209 210 210 211 211 211 212 212 213 213 213 213 214 214 215 215 216 216 216 217
7092 217 218 218 219 219 219 220 221 221 221 221 222 222 222 222 222 223 224 224 225 225 225 226 226 227 228 229 229 230 230 230 230 230 231 232 233 234 235 235 235 235 235 235 234 236 237 238 238 238 238 239 240 241 241 242 243 244 245 245 245 246 246 246 247 248 249 250 251 252 253
7085 253 253 254 255 256 257 257 258 259 259 259 259 259 260 261 261 262 263 264 265 266 266 267 268 269 270 271 272 274 275 275 277 278 279 280 281 282 283 285 286 287 289 290 292 293 295 296 298 299 302 304 307 310 313 316 319 322 326 329 333 337 341 344 348 352 355 358 360 363 365
7078 365 368 369 371 372 372 372 372 371 369 368 366 364 363 362 360 359 357 356 355 354 354 353 353 352 352 352 352 352 352 351 351 351 351 351 351 351 351 352 354 354 355 355 356 357 358 360 361 362 363 364 365 366 368 370 371 372 373 374 375 376 377 379 381 382 384 385 386 388 390
7070 390 391 393 395 397 399 400 401 402 404 407 409 411 413 415 416 417 418 420 421 423 425 426 428 430 432 435 436 437 440 442 444 446 448 451 453 455 457 459 461 463 465 468 470 472 474 476 478 480 483 484 486 488 491 493 496 499 501 504 507 510 513 516 518 520 523 525 528 531 535
7063 535 538 541 543 546 549 552 555 557 560 564 567 570 573 576 580 583 587 590 594 598 601 605 609 612 616 619 623 627 631 635 639 643 646 650 654 659 663 667 671 676 681 685 690 694 699 703 708 712 717 722 727 732 738 743 748 753 757 762 767 773 779 785 791 797 802 808 815 821 827
7056 827 833 840 846 852 857 864 870 877 884 891 898 905 911 919 927 934 942 950 958 967 974 982 990 998 1006 1014 1023 1032 1042 1051 1060 1068 1077 1086 1095 1105 1115 1125 1135 1145 1155 1165 1175 1186 1197 1208 1219 1230 1241 1252 1264 1276
7050 1276 1288 1301 1313 1325 1339 1352 1365 1378 1392 1405 1419 1433 1447 1462 1477 1493 1508 1523 1539 1554 1571 1587 1605 1621 1638 1657 1675 1693 1712 1731 1750 1769 1789 1809
7047 1809 1829 1851 1873 1895 1918 1940 1963 1986 2010 2033 2057 2082 2107 2132 2159 2186 2213 2241 2269 2297 2326 2355 2385 2415 2446 2479 2511 2543 2576 2610 2644 2679 2714 2750
7043 2750 2788 2825 2863 2902 2942 2982 3022 3064 3107 3150 3193 3238 3282 3328 3373 3420 3468 3517 3566 3616 3667 3719 3772 3825 3879 3934 3990 4046 4103 4161 4220 4280 4340 4401
7039 4401 4463 4524 4587 4651 4716 4782 4848 4914 4981 5049 5117 5185 5254 5323 5393 5464 5535 5606 5678 5749 5820 5892 5963 6035 6107 6178 6248 6317 6387 6457 6526 6595 6662 6729
7036 6729 6793 6857 6919 6980 7039 7097 7153 7208 7260 7311 7361 7407 7451 7494 7533 7570 7604 7635 7665 7691 7714 7734 7751 7765 7776 7784 7789 7791 7789 7785 7778 7768 7754 7737 7716 7693 7667
7032 7667 7639 7607 7573 7536 7496 7454 7409 7362 7313 7262 7208 7152 7095 7036 6975 6912 6848 6782 6715 6647 6578 6508 6438 6367 6295 6221 6148 6074 6001 5928 5855 5781 5707 5633
7028 5633 5559 5485 5411 5337 5264 5192 5120 5049 4979 4910 4841 4772 4703 4634 4567 4500 4435 4370 4307 4245 4184 4123 4062 4003 3944 3886 3830 3775 3719 3664 3611 3559 3508 3456
7025 3456 3406 3357 3308 3260 3213 3168 3124 3079 3036 2993 2951 2909 2868 2828 2789 2750 2713 2676 2640 2604 2569 2534 2499 2466 2434 2402 2370 2339 2308 2278 2249 2219 2191 2162
7021 2162 2134 2107 2080 2054 2028 2003 1979 1955 1931 1907 1883 1860 1838 1816 1795 1773 1752 1732 1711 1691 1671 1651 1632 1613 1594 1575 1557 1539 1523 1505 1488 1472 1456 1439
7017 1439 1424 1408 1393 1378 1362 1348 1333 1319 1305 1291 1278 1264 1251 1238 1225 1212 1199 1188 1176 1164 1153 1141 1130 1118 1107 1097 1086 1076 1066 1056 1046 1036 1026 1016
7014 1016 1007 998 989 980 970 962 954 945 936 927 919 912 904 897 889 882 875 867 860 853 845 839 833 826 820 813 807 801 794 788 781 775 769 763 757 751 745 739 734 728 723 717 712 707 702 697 692 687 682 676 672 668 663 658 653 649 645 641 637 633 629 624 620 616 612 608 605
7007 605 601 597 593 589 585 581 578 574 570 567 564 560 557 553 549 545 543 540 537 535 532 528 525 522 519 516 513 509 506 503 500 498 495 493 490 487 485 482 479 477 474 471 468 465 463 461 459 457 454 452 450 448 446 443 441 439 436 433 431 430 427 425 423 421 419 418 416 414 412
6999 412 410 408 406 404 402 400 399 397 394 392 390 389 388 386 385 383 381 379 378 376 374 372 370 369 368 367 366 364 363 361 360 358 356 354 352 351 350 349 348 347 345 344 343 342 341 341 339 337 336 334 334 333 333 332 331 330 328 328 327 325 324 322 322 321 320 319 318 317 317
6992 317 316 315 315 315 314 313 312 311 310 309 309 308 307 307 306 307 307 307 307 306 307 307 307 307 308 309 310 311 313 314 316 317 319 322 325 327 329 330 332 334 335 337 337 338 338 338 338 337 337 336 334 331 328 325 322 319 315 311 308 304 301 298 295 292 289 287 284 282 280
6985 280 278 276 274 272 270 268 267 264 262 260 259 257 255 253 252 251 250 249 248 248 247 246 245 244 244 243 242 241 239 239 239 238 238 237 236 236 235 234 233 233 233 232 232 231 230 229 229 228 227 227 226 225 225 224 224 223 223 222 222 221 221 221 220 220 219 218 217 217 216
6978 216 216 215 215 215 215 214 214 213 212 211 211 211 210 210 209 208 208 208 207 206 206 206 205 205 205 205 204 203 203 202 202 201 201 201 200 199 199 199 199 199 199 198 197 196 196 196 196 195 195 195 194 194 193 193 192 191 191 191 191 191 190 190 190 189 189 189 188 188 188
6970 188 188 187 186 185 185 185 185 185 185 185 185 185 184 184 183 183 183 183 183 182 182 181 181 181 181 181 181 180 180 180 180 180 179 179 178 177 177 177 177 177 178 178 177 176 175 175 174 174 174 173 172 173 173 173 173 173 173 173 172 172 172 171 171 171 171 171 170 170 170
6963 170 170 170 170 169 169 169 169 169 168 168 169 169 169 169 168 167 166 166 166 166 165 165 164 164 164 164 165 165 165 165 164 164 164 163 164 164 164 163 163 163 163 162 162 161 161 161 160 160 160 160 161 161 161 161 160 159 159 159 159 159 159 158 158 157 157 158 158 158 157
6956 157 156 156 155 155 155 155 155 155 155 156 156 156 155 155 155 155 154 154 154 154 154 154 154 154 154 154 154 154 154 154 153 152 153 153 153 153 152 152 152 151 151 151 150 150 150 150 150 149 149 149 149 149 149 149 149 148 148 147 147 147 148 148 148 148 148 147 147 147 147
6948 147 147 147 147 147 146 146 146 146 146 146 146 145 145 145 144 144 145 145 145 145 145 145 145 144 144 144 144 143 142 141 142 142 142 142 142 142 143 143 142 141 141 141 142 142 142 142 142 142 142 142 141 141 141 142 141 141 141 140 139 139 140 140 140 140 139 139 139 139 139
6941 139 139 139 139 139 139 139 139 139 139 139 139 138 137 137 137 137 137 137 138 138 138 137 137 137 137 137 137 138 138 137 137 137 136 136 137 136 136 135 135 135 135 135 135 134 135 135 135 135 136 136 136 135 134 134 134 134 134 134 133 133 133 133 133 133 132 132 132 132 133
6934 133 133 132 133 133 133 134 134 133 133 133 133 133 132 132 132 132 131 131 130 131 131 131 132 132 132 132 131 131 131 131 131 130 130 130 129 129 128 128 129 129 129 129 129 129 129 129 129 129 129 129 128 128 128 129 129 129 129 129 129 129 129 128 128 128 128 127 128 128 128
6926 128 128 127 127 127 128 128 127 127 127 127 126 126 126 126 126 126 126 125 125 125 126 125 125 125 125 125 126 126 126 126 126 126 126 126 126 125 125 124 124 125 125 124 124 124 125 125 126 126 125 125 125 124 124 124 124 123 123 123 123 123 123 123 123 123 124 123 123 123 123
6919 123 123 124 124 124 124 123 123 123 123 123 123 123 123 123 123 123 123 123 123 122 122 122 123 123 123 122 122 122 123 123 122 121 122 122 122 122 122 121 121 122 122 122 122 122 123 122 122 122 122 122 123 122 122 122 122 122 122 121 121 121 121 120 120 119 120 121 121 121 121
6912 121 120 120 121 121 121 121 120 120 120 120 120 120 120 121 122 122 121 121 121 120 120 119 119 119 118 119 119 119 119 119 120 120 120 120 120 119 120 121 120 120 121 121 121 120 119 119 119 119 119 119 120 120 121 121 120 120 120 120 121 121 121 121 121 121 120 119 118 118 118
6904 118 118 118 118 118 118 118 118 119 119 119 118 118 119 118 118 119 119 118 118 118 118 118 118 118 118 118 118 119 119 119 119 119 120 120 120 120 120 120 120 120 119 119 119 119 119 118 118 118 119 119 119 119 118 118 117 117 117 116 116 116 116 117 117 118 118 118 117 117 117
6897 117 117 117 117 116 116 116 116 116 116 116 117 117 117 117 117 117 117 117 117 117 116 116 116 117 117 116 116 116 116 116 116 115 115 115 115 115 115 115 115 115 115 115 115 115 115 115 115 115 115 115 115 116 116 115 115 114 114 116 117 117 116 116 115 116 116 116 116 116 116
6890 116 116 115 115 115 116 115 115 114 114 113 114 114 114 115 114 114 113 113 113 113 114 115 115 115 115 115 115 115 114 114 114 115 115 115 115 114 114 114 114 114 114 114 114 114 114 114 114 115 115 115 115 114 114 114 113 113 113 113 113 113 113 113 114 115 114 114 114 113 113
6882 113 113 113 113 113 113 114 114 114 113 113 113 113 113 113 112 112 112 112 111 111 111 111 111 112 112 112 112 112 111 111 112 112 112 111 111 111 111 111 111 111 111 111 111 110 109 109 109 109 109 110 110 110 110 110 109 110 110 111 112 112 112 111 111 111 111 111 111 111 111
6875 111 110 110 110 110 110 110 109 109 109 110 110 110 110 109 110 110 110 110 109 109 109 108 108 108 108 109 109 109 109 109 109 109 109 109 109 108 108 109 109 109 109 109 109 108 108 108 108 108 108 107 107 107 107 107 108 108 108 108 108 108 108 108 107 107 107 107 108 108 108
6868 108 108 108 108 107 107 107 107 107 107 107 107 108 108 108 108 108 108 108 107 107 108 108 108 108 108 107 108 108 108 108 108 108 108 108 108 108 108 108 107 108 108 108 108 109 108 108 108 108 108 108 108 108 107 108 109 109 109 109 109 109 109 109 108 108 107 107 107 107 108
6861 108 108 107 108 108 108 108 108 109 109 109 109 109 109 109 109 110 110 110 110 109 109 108 108 108 109 110 110 110 110 110 110 110 110 109 109 108 109 109 109 109 109 109 109 109 109 109 109 109 108 108 109 109 110 109 109 109 108 108 108 108 109 109 108 108 108 108 109 109 110
6853 110 110 110 109 109 108 108 108 108 108 109 109 109 109 109 109 109 109 110 109 109 109 109 109 109 108 108 108 108 107 107 108 108 108 108 109 109 109 109 109 109 109 109 109 108 108 108 108 109 109 109 109 109 108 108 108 108 109 109 108 109 108 108 107 107 107 107 107 108 108
6846 108 108 108 108 108 108 107 108 108 108 108 108 108 108 108 108 109 109 108 108 108 108 107 107 107 107 107 108 108 108 108 108 108 108 108 108 107 107 107 107 107 107 107 107 108 109 108 108 107 106 106 107 107 107 107 107 107 107 107 106 106 106 107 107 107 107 107 108 108 108
6839 108 107 107 107 106 106 106 107 108 107 107 107 106 106 106 107 106 106 106 106 107 107 107 107 106 106 106 106 106 106 106 106 106 106 106 105 105 105 106 107 108 108 108 108 107 106 106 106 107 107 107 107 107 106 107 107 107 107 107 106 106 106 106 106 105 105 104 104 104 104
6831 104 104 105 105 105 105 105 105 105 105 105 105 105 105 104 105 105 105 105 104 105 105 105 105 106 106 105 105 106 106 105 104 104 104 104 105 105 105 104 104 104 104 104 104 104 103 103 103 104 103 104 105 105 104 104 105 105 105 105 104 103 103 103 103 103 103 103 103 103 103
6824 103 103 103 103 104 104 103 103 103 103 103 103 103 103 102 101 101 101 101 102 101 102 102 102 101 102 102 103 102 102 102 103 103 103 102 101 101 100 100 100 100 100 101 101 101 101 101 101 102 102 102 103 103 103 103 102 102 102 101 101 101 101 101 101 101 101 101 101 102 102
6817 102 102 102 101 101 101 101 101 102 103 102 101 101 101 101 101 101 101 102 102 102 102 102 102 102 102 102 102 102 102 102 103 103 103 103 102 102 102 102 102 102 102 102 102 102 102 102 102 103 103 103 102 102 102 103 103 103 103 103 103 102 102 103 103 103 103 102 103 103 103
6809 103 103 102 102 102 102 102 103 103 103 102 102 103 103 103 103 103 104 104 104 104 104 104 103 103 103 103 103 103 103 103 103 103 103 103 103 103 103 103 103 102 102 102 101 101 101 102 102 101 101 100 100 100 101 101 102 102 102 102 101 101 101 101 101 101 101 100 101 102 102
6802 102 101 101 101 102 102 101 101 102 102 103 103 104 103 103 103 103 103 103 103 103 103 103 103 103 103 103 103 102 103 103 103 103 103 102 102 102 102 102 102 102 102 103 103 103 103 103 102 102 103 103 103 102 102 103 104 104 103 103 103 103 103 103 103 103 103 103 102 102 102
6795 102 102 102 102 102 102 103 103 103 104 103 102 102 102 102 102 102 102 102 102 103 103 103 103 103 103 103 103 103 103 103 102 102 102 102 102 102 102 103 103 103 103 104 104 104 103 103 103 103 102 102 102 102 101 101 101 101 101 102 102 101 102 102 102 102 102 102 102 103 103
6787 103 103 103 102 102 102 102 102 102 102 102 102 102 102 103 103 103 103 102 101 101 102 102 102 103 103 102 102 102 102 102 102 103 102 102 103 103 103 102 103 103 104 103 103 102 102 102 103 104 104 104 104 104 104 103 103 103 103 103 103 103 103 103 103 103 103 102 102 102 102
6780 102 102 102 103 104 103 103 103 103 103 103 103 102 103 103 103 103 103 103 102 102 102 102 102 102 103 103 103 103 103 103 103 103 103 103 103 103 103 103 103 103 103 103 103 102 102 102 101 102 102 102 103 103 103 102 103 104 104 104 105 104 104 104 104 104 104 103 103 103 103
6773 103 103 102 102 103 103 103 102 102 102 102 102 103 103 103 103 103 104 104 104 104 104 104 104 104 103 103 103 103 102 102 102 102 102 102 102 103 103 103 104 104 104 104 103 103 103 103 103 103 103 102 102 102 102 102 103 104 104 104 104 104 104 103 102 102 103 103 104 104 104
6765 104 104 104 104 103 103 104 105 104 104 104 104 104 103 103 102 102 102 102 101 101 101 101 101 101 101 101 101 102 102 102 102 101 101 101 101 101 101 101 102 102 102 102 102 102 102 102 102 102 102 101 101 100 100 100 100 100 100 101 102 102 102 102 102 102 102 102 101 100 101
6758 101 101 101 101 101 101 101 101 100 100 100 100 100 100 100 100 100 101 101 101 100 100 100 100 100 100 100 100 100 100 100 100 100 100 100 100 100 100 100 99 99 99 99 99 98 99 100 100 99 99 99 99 99 100 100 100 100 100 99 100 100 100 99 99 99 99 99 99 99 99
6751 99 99 100 100 99 99 99 99 99 99 99 99 100 100 99 99 98 98 98 98 99 99 99 99 99 99 99 98 98 99 99 100 100 100 100 99 100 100 100 101 101 101 101 101 102 101 100 100 100 100 100 100 100 100 101 101 101 101 100 100 99 99 99 100 100 100 101 101 101 101 102
6743 102 102 102 102 102 102 101 101 101 101 101 101 102 101 101 102 102 102 102 102 101 101 101 101 100 100 100 100 100 100 100 100 100 100 100 100 99 99 100 100 101 101 101 101 101 101 101 101 100 101 101 101 103 103 103 102 102 103 103 103 103 102 102 102 102 101 102 102 102 101
6736 101 101 101 101 100 100 101 101 101 101 102 102 102 102 102 102 101 101 101 101 101 101 101 101 101 101 100 99 99 99 100 100 100 99 99 99 99 100 100 100 101 102 101 101 100 101 102 102 102 102 102 102 102 103 102 102 101 100 101 101 101 101 101 101 100 100 99 99 100 100
6729 100 100 100 99 100 100 100 100 100 100 100 100 100 100 100 100 100 100 100 100 100 100 99 99 100 99 100 100 99 100 100 100 100 100 100 100 100 100 99 100 99 99 99 99 99 99 99 99 100 100 99 100 100 100 100 100 100 100 99 99 99 99 100 100 99 99 99 99 99 99
6721 99 98 99 99 100 100 100 100 100 99 99 99 99 99 99 99 98 98 99 99 99 99 100 99 99 99 99 99 99 99 99 99 99 99 99 99 99 99 99 99 99 99 99 99 99 99 99 100 100 100 100 100 100 100 100 100 100 99 99 99 99 99 99 99 99 98 98 98 98 98 98
6714 98 99 99 100 100 100 99 98 98 99 99 99 99 99 100 100 101 101 101 101 101 101 101 100 100 100 100 100 100 99 98 98 99 98 98 99 100 100 100 100 100 99 99 99 99 100 100 100 99 99 99 100 99 99 100 100 99 99 99 100 99 99 100 100 100 100 100 100 100 99 100
6707 100 100 99 99 99 99 99 99 100 100 100 100 99 100 100 99 99 99 99 99 99 99 99 99 100 100 100 100 101 101 101 101 100 100 100 100 99 99 99 99 100 100 100 99 99 99 99 99 99 100 100 100 100 100 99 99 100 99 99 99 99 100 100 100 100 100 100 100 100 100
6699 100 100 100 100 101 101 100 100 100 101 102 102 101 100 100 101 101 101 101 101 101 101 100 100 101 102 102 102 102 102 102 103 103 103 103 103 103 102 102 102 102 102 102 102 102 102 102 102 102 102 101 101 101 101 102 102 102 102 102 102 102 102 102 102 101 102 102 102 102 103
6692 103 103 104 104 103 103 104 104 104 104 104 104 104 103 103 102 102 101 102 102 102 101 101 101 100 100 100 100 100 101 101 102 102 102 101 102 102 103 103 103 103 103 103 103 103 102 102 102 102 102 102 103 103 104 103 103 102 102 103 102 102 102 102 102 102 102 102 102 102 101
6685 101 100 100 100 100 101 101 101 102 102 101 101 100 100 100 99 99 100 100 101 101 101 101 100 100 101 101 101 101 101 102 101 102 102 102 102 102 101 101 100 100 100 100 99 99 100 99 99 99 100 100 100 101 101 101 100 99 99 99 99 99 99 99 99 98 98 98 98 98 98
6677 98 98 99 99 99 99 99 99 99 98 98 98 98 99 99 98 98 97 97 98 98 98 98 98 98 98 98 98 98 98 98 98 98 98 98 97 97 97 97 97 98 97 96 96 96 96 96 97 97 97 97 97 97 97 97 96 96 96 97 97 97 97 97 97 97 97 97 97 96 96 96
6670 96 96 97 97 97 96 96 96 95 95 96 96 96 97 96 95 95 96 97 97 97 98 98 98 97 97 97 97 97 97 97 97 97 97 97 97 97 97 98 98 97 97 98 98 98 98 98 98 98 98 98 98 98 97 97 97 98 98 98 97 97 97 97 97 98 97 97 97 97 97 97
6663 97 98 98 98 98 98 98 98 98 98 98 98 98 98 98 98 98 98 98 98 98 98 97 98 98 98 98 99 99 99 100 99 99 99 99 99 99 99 99 99 99 99 99 100 100 100 99 99 99 99 98 98 98 98 99 99 99 99 99 99 99 99 99 98 98 98 97 97 97 98 99
6655 99 99 99 99 99 99 99 99 98 98 98 98 98 98 98 97 97 97 98 98 98 99 99 99 99 99 99 100 100 100 99 98 98 98 98 98 98 98 98 98 98 98 98 99 99 98 98 99 99 99 99 99 99 99 98 98 98 98 98 98 98 98 98 98 98 98 98 98 98 99 99
6648 99 100 99 99 99 99 100 100 100 99 99 99 98 99 99 100 101 100 100 100 99 99 99 99 98 98 98 98 98 98 98 98 97 98 98 98 98 98 98 99 99 100 99 98 98 98 98 98 98 98 97 96 96 97 98 99 99 98 98 98 99 99 98 98 98 98 98 98 98 98 98
6640 98 98 98 98 98 98 98 98 98 99 99 99 99 99 98 98 98 98 98 98 98 98 97 97 97 98 98 98 99 99 99 99 99 99 98 98 98 98 98 98 97 98 98 99 99 99 99 99 98 98 98 99 99 99 99 99 99 99 98 97 97 98 98 98 99 99 99 99 99 99 99
6633 99 99 99 99 99 99 99 99 99 100 100 99 99 99 99 100 100 100 100 99 99 100 101 101 101 101 100 100 100 100 100 100 99 100 100 100 100 100 100 100 100 100 100 100 100 100 100 101 101 102 102 101 101 102 102 102 102 102 102 102 102 101 101 101 101 100 100 100 100 100 100
6625 100 100 101 101 102 102 102 102 102 102 102 101 101 101 101 101 101 101 100 100 101 101 101 101 101 101 101 101 101 101 102 101 101 101 101 100 100 100 100 100 100 100 99 99 98 98 98 98 98 98 98 98 98 98 98 98 98 98 98 98 98 98 98 98 98 98 97 96 96 96
6618 96 97 98 99 99 99 99 98 98 98 97 97 97 97 98 98 97 97 98 98 98 97 97 97 97 97 97 97 97 97 97 96 96 95 95 95 95 95 95 96 96 96 97 97 97 98 98 97 97 97 96 96 96 95 96 96 96 96 97 97 97 97 97 97 97 97 97 98 98 98 97
6611 97 96 96 97 97 97 97 97 97 97 97 97 97 97 97 98 98 98 98 98 98 97 98 98 98 98 98 97 97 98 99 100 99 99 100 100 100 99 99 99 99 99 99 99 99 99 99 99 100 100 100 100 100 100 100 100 100 100 100 100 100 100 100 100 100 100 99 100 100 100 100
6603 100 100 101 101 101 101 101 100 100 100 101 101 102 102 102 102 102 101 102 102 101 101 101 100 101 101 101 101 102 102 102 102 102 102 102 102 102 102 102 102 102 102 102 101 101 101 101 101 100 100 99 100 101 101 100 101 101 100 101 101 101 101 101 101 101 101 100 100 100 100
6596 100 100 101 101 101 101 101 100 100 100 100 99 98 98 98 99 99 99 99 99 99 99 100 99 99 99 99 99 99 99 100 99 99 99 98 99 99 99 99 99 99 99 98 99 99 99 99 99 99 99 99 99 99 98 98 99 99 98 98 98 99 100 99 99 98 98 98 98 97 98
6589 98 98 97 97 97 97 97 97 98 98 98 98 98 98 96 95 96 97 98 98 99 99 99 99 99 99 99 98 98 98 98 98 98 98 98 99 99 99 99 99 99 98 98 98 99 99 99 98 98 98 98 98 98 98 98 98 98 98 97 96 95 96 96 96 97 97 97 98 98 99 99
6581 99 99 98 97 97 97 97 97 98 98 98 98 98 98 98 98 98 98 98 97 98 98 98 98 98 98 98 99 99 98 98 98 98 98 98 98 98 99 98 98 97 97 97 98 97 97 97 98 98 98 97 96 96 96 96 97 97 96 96 96 96 97 97 97 97 97 97 97 98 98 98
6574 98 99 98 98 98 97 98 98 98 98 98 97 97 97 98 99 99 99 99 99 99 99 99 98 97 97 98 98 97 97 98 98 98 98 98 97 97 97 97 97 98 98 98 98 98 98 98 98 98 98 98 97 97 97 97 97 97 97 97 97 97 98 98 99 98 98 98 98 98 98 98
6566 98 99 98 98 98 98 98 98 98 98 99 99 98 98 98 99 99 99 99 98 99 99 99 98 98 98 98 98 98 98 99 99 99 98 98 98 98 98 98 98 97 97 98 98 98 98 98 98 98 98 99 99 99 99 99 99 99 99 99 99 99 99 99 99 99 99 99 99 99 100 100
6559 100 100 100 100 99 99 99 99 98 98 98 98 98 99 99 99 99 100 100 100 100 100 100 100 100 99 99 99 99 99 99 99 100 100 100 99 99 98 99 99 100 100 101 101 100 100 101 101 100 100 100 100 100 100 101 101 101 101 101 101 101 101 101 101 101 101 101 101 101 101
6552 101 102 103 103 103 103 102 102 102 101 101 101 100 100 100 100 100 100 101 101 101 101 101 101 101 101 101 101 101 100 100 100 100 100 100 100 101 101 101 101 101 101 101 102 102 102 101 101 101 101 101 101 101 102 102 102 102 101 101 101 101 102 102 102 102 102 102 101 101 101
6544 101 101 102 102 102 102 102 102 102 101 101 101 101 101 101 100 100 100 101 102 101 101 101 101 101 101 102 101 100 100 100 100 100 101 101 101 101 101 101 101 101 101 100 100 100 100 100 100 100 100 100 100 100 100 101 101 101 101 100 100 100 100 99 100 100 100 100 100 101 101
6537 101 101 101 101 101 100 100 100 100 100 101 101 101 100 100 100 101 101 101 100 101 101 102 102 102 101 101 100 99 99 99 100 101 101 101 101 101 101 101 100 100 100 99 99 99 99 99 99 99 99 99 100 100 101 101 101 100 99 99 99 99 99 99 98 98 98 98 99 99 100
6530 100 100 100 100 100 99 99 99 99 98 98 97 98 98 98 97 98 98 98 99 99 99 99 99 99 99 99 99 99 99 99 98 99 99 99 98 98 98 99 99 99 99 99 99 99 99 98 98 98 99 99 98 98 98 98 98 98 98 99 99 98 98 98 98 98 99 99 99 99 99
6522 99 99 99 99 100 99 99 98 98 98 99 98 98 98 98 98 98 98 98 99 99 99 99 99 99 99 99 100 100 99 99 98 97 98 97 97 98 98 99 99 99 99 99 98 99 99 99 99 99 98 98 98 98 98 98 98 97 97 98 98 98 97 98 98 98 98 97 97 97 97 97
6515 97 98 98 97 97 97 97 98 98 98 98 97 97 97 98 97 97 97 97 97 97 97 97 97 97 97 97 98 97 97 97 98 98 98 98 97 97 97 97 96 96 96 96 96 96 96 96 96 97 97 98 98 97 97 97 97 97 97 97 96 96 97 98 98 98 97 97 98 98 98 99
6508 99 98 98 98 97 97 97 97 96 96 96 96 96 96 96 96 96 96 97 97 97 97 97 97 97 97 98 97 97 97 97 97 98 98 98 98 98 99 99 98 98 97 97 97 97 97 98 99 98 98 97 97 96 96 97 97 97 97 98 98 98 98 98 98 98 98 98 98 98 98 98
6500 98 98 99 99 99 99 98 98 98 98 99 99 99 99 98 99 99 99 99 99 99 99 99 99 99 99 98 98 98 99 99 99 99 99 100 100 100 100 100 100 99 99 99 98 98 98 98 98 98 97 97 97 97 98 98 98 97 98 98 98 99 98 98 99 100 99 99 98 98 98 98
6493 98 98 98 99 99 99 99 99 99 99 99 99 98 98 98 98 98 98 98 99 100 101 100 100 99 99 99 98 98 98 98 98 98 98 98 98 98 98 98 98 98 98 97 96 96 97 97 98 98 98 99 98 98 98 98 98 99 99 99 99 99 99 98 98 98 98 98 98 98 98 98
6485 98 98 98 98 98 98 98 98 98 98 98 97 97 97 98 98 98 97 97 97 97 98 99 99 99 99 98 97 97 97 96 97 97 98 98 99 99 99 98 98 98 98 98 99 99 98 98 98 98 97 97 96 97 97 97 97 97 97 98 98 99 99 100 100 100 100 99 99 99 99 99
6478 99 100 100 100 100 100 100 100 100 100 100 100 100 100 100 101 101 101 101 101 102 102 101 101 101 101 102 102 101 101 101 101 101 100 100 100 101 101 101 100 100 100 100 100 101 102 102 103 103 102 102 102 102 102 102 102 102 102 103 103 102 101 102 102 102 101 101 101 102 102 102
6471 102 102 102 101 101 102 102 102 102 102 102 101 101 100 100 101 101 101 102 102 102 101 102 102 101 101 101 100 100 100 101 101 101 101 101 100 100 100 100 100 99 99 99 99 99 100 100 100 100 101 101 101 100 100 100 100 100 100 101 101 100 100 100 99 98 97 97 97 97 97
6463 97 98 98 97 97 97 97 97 97 96 97 97 98 98 98 98 97 97 97 97 97 98 98 97 97 96 97 98 98 98 97 97 97 97 97 98 99 99 98 99 99 98 98 97 96 96 96 96 96 96 96 96 96 96 96 96 97 97 97 96 95 95 96 96 96 97 97 96 96 96 96
6456 96 96 96 96 96 96 96 96 96 96 96 96 95 96 96 95 95 96 96 96 96 96 95 95 94 94 94 94 94 95 95 96 96 96 96 96 96 95 96 96 96 96 96 97 96 96 95 95 96 97 97 97 97 97 96 96 96 97 97 97 97 97 97 98 97 97 98 97 97 96 97
6448 97 97 96 96 97 97 97 98 98 98 97 96 96 96 96 97 97 97 97 98 98 98 98 98 98 98 98 98 98 98 98 97 97 96 97 97 97 98 98 98 97 98 98 99 98 98 98 97 98 98 99 99 99 98 98 98 98 99 99 98 98 97 97 97 96 96 96 97 97 98 98
6441 98 98 98 98 97 97 97 97 97 97 97 97 97 97 97 96 97 97 97 97 97 97 97 98 98 97 97 97 97 97 97 97 97 97 97 97 97 97 97 97 98 98 98 99 99 99 99 99 99 99 99 100 99 98 98 98 98 98 98 98 98 98 98 98 99 98 98 98 99 99 98
6434 98 98 98 97 98 98 98 97 96 96 97 97 97 98 98 98 97 97 97 97 97 97 97 97 97 97 97 97 97 97 98 98 98 97 97 97 97 98 98 98 98 98 98 97 97 97 97 97 97 96 96 97 97 97 96 96 97 97 97 98 97 97 97 96 97 97 96 96 96 95 95
6426 95 96 96 96 96 96 96 96 96 96 96 96 96 96 96 96 96 97 97 97 96 96 96 97 97 97 97 97 97 97 97 97 96 96 96 96 96 96 95 96 97 97 97 97 96 96 96 97 98 97 97 97 97 97 97 98 98 99 99 98 98 98 98 97 98 98 99 99 99 99 98
6419 98 98 99 99 99 98 98 99 99 99 99 99 100 100 100 99 99 99 99 100 100 100 100 100 99 100 100 100 100 100 100 99 100 100 100 100 100 100 100 100 100 100 100 101 101 101 101 101 100 100 100 101 101 101 101 101 101 100 100 100 99 99 98 98 98 99 99 99 99 99 99
6411 99 100 100 100 100 99 99 99 98 98 98 98 97 97 98 98 98 98 98 98 98 98 98 98 98 98 98 98 98 99 99 99 99 99 98 98 98 98 98 98 97 97 97 97 97 98 98 98 98 97 98 98 99 99 98 98 98 98 97 97 96 97 96 96 96 96 97 97 97 97 97
6404 97 97 97 96 96 96 97 97 96 96 95 95 95 94 94 93 94 94 94 94 94 93 94 94 94 94 94 94 93 93 93 94 94 95 95 94 93 93 93 93 94 94 94 94 93 94 95 95 94 94 93 93 93 93 93 93 94 94 95 95 95 95 94 94 93 93 93 93 93 94 94
6397 94 93 93 93 94 94 94 95 95 95 95 95 95 95 94 94 94 94 94 94 94 95 95 96 96 96 96 95 95 95 95 95 95 95 95 95 96 97 97 97 97 97 97 98 98 98 97 97 97 97 97 97 97 97 97 97 98 98 98 99 98 98 98 98 99 100 100 100 99 99 98
6389 98 98 98 98 98 98 98 98 98 98 98 99 99 99 99 99 100 100 100 99 99 99 99 99 99 99 99 99 99 99 99 100 100 100 100 100 100 100 100 101 100 100 99 99 99 100 100 101 101 102 102 102 102 102 102 101 101 101 101 101 101 101 101 101 100 100 101 102 102 101 101
6382 101 100 101 101 101 100 100 100 100 100 100 100 100 100 100 99 100 100 100 100 100 100 100 101 102 102 102 102 101 101 101 101 101 100 100 100 100 100 100 100 100 100 99 100 100 100 100 99 99 99 98 98 98 99 99 98 99 99 99 99 99 99 99 100 100 99 99 99 99 100
6374 100 99 98 98 97 97 98 98 98 98 98 99 98 98 98 98 98 98 98 99 99 99 99 99 99 99 100 100 100 100 100 100 100 100 100 99 99 98 98 97 97 97 97 98 98 98 98 97 97 97 97 98 99 99 99 99 99 98 98 98 98 98 99 98 97 97 96 96 96 97
6367 97 96 96 96 97 97 97 98 98 98 98 98 98 98 98 97 97 97 97 97 97 97 97 97 97 98 98 97 97 97 97 97 96 96 96 97 97 97 97 97 97 97 97 97 96 96 95 96 96 97 96 96 96 96 96 97 97 97 97 97 97 97 97 96 96 96 96 96 96 96 96
6360 96 96 96 96 96 96 96 96 96 96 96 96 97 97 97 97 97 97 97 97 97 98 97 97 97 97 97 97 97 96 96 96 96 96 96 96 96 96 96 96 96 96 96 97 97 96 96 96 96 96 96 95 95 95 95 96 97 97 97 97 97 97 97 97 97 97 97 96 96 96 97
6352 97 97 97 96 96 96 96 96 96 96 97 98 98 98 98 98 97 97 97 97 97 97 98 98 97 97 98 98 98 98 98 98 98 98 98 98 98 97 98 98 98 98 98 98 98 98 97 96 95 95 96 96 97 97 97 97 97 96 96 97 97 97 97 97 97 96 96 97 97 97 97
6345 97 96 96 95 96 96 96 97 97 98 98 98 98 99 98 98 98 98 98 97 97 97 97 97 97 98 98 99 99 98 98 98 98 98 97 98 98 98 98 98 98 98 98 97 97 97 98 99 98 98 98 98 98 98 98 98 99 100 100 100 99 99 99 100 99 99 99 100 100 100 100
6337 100 100 99 99 99 99 98 98 97 98 98 98 98 98 98 99 99 99 99 98 98 98 98 99 99 100 100 100 100 100 100 100 100 100 100 100 100 100 100 100 99 99 100 100 99 100 100 100 100 100 100 100 100 100 100 100 100 100 100 100 100 100 99 99 99 99 99 99 99 99
6330 99 99 100 100 99 99 99 98 98 98 98 98 98 99 100 100 100 100 100 99 99 99 99 99 100 100 101 100 100 99 98 98 98 98 98 98 98 98 98 98 98 98 98 97 98 98 97 97 97 97 97 96 96 97 97 97 98 98 98 98 97 97 97 97 97 97 97 97 97 96 96
6323 96 96 95 95 94 94 94 94 94 94 94 94 94 94 94 94 94 94 94 94 94 94 94 94 94 94 94 94 94 94 94 94 94 94 94 94 93 93 93 93 93 93 93 93 92 93 94 94 93 92 92 93 94 94 95 95 94 93 93 93 93 92 91 91 91 91 91 92 92 92 91
6315 91 92 92 92 92 92 92 92 92 92 92 92 91 91 91 91 91 90 90 90 89 90 91 91 92 92 92 93 93 93 93 92 92 92 93 93 93 93 94 94 93 93 93 94 94 95 94 94 94 94 94 94 93 93 93 93 93 93 93 93 93 93 94 94 94 94 94 94 94 94 94
6308 94 94 94 94 94 94 94 94 94 94 94 95 95 95 95 96 96 95 95 95 95 96 96 96 96 96 96 97 97 97 97 97 97 97 97 97 97 97 97 97 97 97 97 97 97 97 97 97 97 97 97 97 97 97 97 97 97 97 97 97 98 98 98 98 98 98 98 97 97 97 97
6300 97 98 98 97 97 97 97 97 97 97 97 97 97 97 98 98 98 98 98 98 98 98 98 99 99 99 99 98 98 98 98 97 97 97 97 98 97 97 97 97 98 98 98 98 97 98 98 98 98 98 98 98 98 98 98 98 98 98 98 98 98 99 99 99 98 98 98 98 99 99 100
6293 100 100 100 99 99 99 99 99 99 99 99 98 98 98 98 99 99 99 100 99 99 99 99 98 98 99 99 98 98 99 99 99 99 99 99 99 99 100 100 100 99 99 99 99 99 99 99 99 99 99 100 100 100 100 100 100 99 99 99 99 99 99 99 99 99 99 100 99 99 99
6286 99 99 99 99 99 99 99 98 99 98 98 98 99 100 100 100 100 100 100 99 98 98 98 98 97 97 98 99 99 99 99 99 99 98 99 99 99 100 99 99 99 99 99 99 99 99 99 98 98 98 98 98 98 98 98 98 98 98 99 99 99 99 99 98 99 99 99 99 99 99 99
6278 99 99 99 99 99 99 99 99 99 98 98 98 98 97 97 97 97 98 98 98 98 99 98 98 97 97 97 97 97 97 97 96 96 96 96 96 97 97 97 98 98 98 98 98 97 97 97 97 97 97 97 97 97 97 97 98 98 97 97 97 97 98 98 98 98 99 98 98 97 97 97
6271 97 97 97 97 98 98 98 98 98 97 98 98 98 98 98 98 97 97 97 97 97 97 97 97 97 96 96 96 96 96 96 96 96 96 96 96 96 96 95 96 96 96 97 98 98 98 97 98 98 97 97 97 97 97 97 97 97 96 97 97 96 96 96 96 97 98 97 97 98 98 98
6263 98 98 98 98 97 98 99 99 99 99 99 99 98 97 97 96 97 98 98 99 99 99 99 99 98 98 98 98 98 97 97 97 96 96 96 95 96 96 95 95 94 94 95 95 95 96 96 96 95 94 94 94 94 94 94 94 94 94 94 93 94 94 94 94 95 94 94 95 95 94 94
6256 94 94 94 94 95 95 95 95 95 95 94 93 93 93 93 94 95 95 95 94 94 94 94 95 95 95 95 95 95 95 96 96 96 96 95 95 95 95 94 94 94 94 94 94 94 94 94 94 94 95 95 95 95 95 95 95 95 95 94 95 95 95 94 94 94 93 94 94 93 93 93
6249 93 93 93 93 93 93 94 94 95 95 96 96 96 96 97 97 97 96 96 96 96 96 96 95 96 96 96 96 96 95 95 95 95 96 96 96 96 95 94 94 94 94 95 95 95 95 95 95 96 96 96 97 97 97 98 98 98 99 99 99 98 97 97 97 98 98 98 98 98 98 98
6241 98 97 97 98 99 99 99 99 99 99 99 99 99 99 100 100 99 99 98 97 98 98 98 99 99 99 99 99 99 99 99 99 99 99 100 100 100 99 98 99 99 99 99 99 98 98 98 98 98 98 98 98 99 100 100 101 101 100 99 99 99 99 99 99 99 99 99 99 99 99 99
6234 99 99 99 99 100 100 100 99 99 99 99 98 98 98 97 98 98 98 99 100 101 101 101 101 100 100 100 100 99 99 100 100 100 100 99 99 100 101 100 100 100 100 99 99 99 99 98 98 98 98 99 99 98 98 98 98 98 98 98 98 98 98 98 98 99 99 99 100 100 100 100
6226 100 100 100 100 99 99 99 99 99 99 99 100 100 100 100 100 99 99 99 98 98 98 99 99 99 100 100 99 99 99 99 99 99 99 99 98 98 98 98 98 98 98 98 98 98 98 99 99 99 99 98 98 98 97 98 98 99 99 99 99 99 99 99 99 99 99 99 99 99 99
6219 99 100 99 100 100 100 100 100 100 99 100 100 101 100 100 100 100 100 100 99 99 98 99 99 100 99 99 99 99 100 99 99 99 99 99 100 100 100 100 100 99 99 98 98 99 99 99 99 99 99 99 99 99 99 99 100 100 100 100 100 99 99 99 99 98 98 99 99 100 101 101
6212 101 101 101 101 100 100 100 100 100 100 100 100 100 100 99 99 99 99 99 99 99 99 99 100 100 100 100 99 99 99 99 99 99 99 99 99 100 100 100 100 99 99 98 99 99 98 99 99 99 98 98 99 99 99 100 100 99 99 98 99 99 99 99 98 97 97 97 98 98 99
6204 99 99 99 100 100 100 100 101 100 100 100 99 99 99 99 99 100 100 100 100 100 100 100 101 101 101 100 100 99 99 99 99 100 100 100 100 100 100 101 101 101 101 101 101 101 101 100 99 100 100 100 100 101 101 101 100 100 100 100 101 101 100 100 101 101 101 101 101 101 101 101
6197 101 101 101 101 101 101 101 101 101 101 102 102 102 102 102 101 101 101 101 101 101 102 101 102 103 103 103 102 102 102 101 101 101 101 102 103 103 103 103 103 102 102 102 102 102 102 102 101 102 102 102 102 103 103 103 104 103 102 102 103 103 103 104 104 105 105 105 104 104 105
6190 105 105 105 105 105 106 106 106 105 105 104 104 104 104 104 104 104 104 104 105 105 105 104 104 104 103 103 103 104 104 104 104 104 104 104 104 103 103 103 104 104 104 105 105 104 104 104 104 105 106 106 106 107 107 107 107 107 107 107 107 107 107 107 106 106 107 107 107 107 107
6182 107 107 107 107 108 108 108 108 109 109 108 108 108 108 108 108 108 108 108 108 107 107 108 108 108 108 108 109 109 109 109 109 109 108 108 109 110 110 110 110 110 110 110 111 112 112 112 112 112 112 112 113 113 113 112 113 113 114 114 115 115 116 117 117 118 118 118 119 119 120
6175 120 119 120 121 121 121 122 122 123 123 123 123 123 123 123 124 124 125 125 125 126 126 125 125 126 126 127 127 128 128 128 128 129 129 130 129 129 129 129 129 129 129 130 130 131 131 130 130 131 131 131 130 130 130 130 130 130 130 129 130 131 131 131 130 129 129 130 130 130 130
6168 130 130 129 129 129 129 128 128 128 128 128 127 127 127 126 126 126 127 127 127 127 126 125 125 125 125 125 124 124 124 123 122 122 122 122 121 121 121 121 121 122 122 122 121 120 119 119 119 119 118 118 117 117 116 116 116 116 116 116 116 116 117 117 117 116 116 116 116 115 114
6160 114 114 113 113 113 113 113 113 112 112 112 112 111 111 111 111 110 110 110 110 110 109 109 109 110 109 109 108 108 109 109 109 109 109 109 109 109 109 108 108 107 107 107 107 107 108 108 107 107 107 106 106 106 106 106 106 106 106 106 106 106 107 107 106 106 106 106 106 106 106
6153 106 105 106 106 106 106 106 106 106 106 106 106 106 105 105 104 104 104 105 106 105 106 106 106 105 106 106 105 105 105 105 105 105 105 104 105 105 105 105 105 105 105 105 106 106 106 106 106 105 105 105 105 105 104 104 104 104 105 105 105 105 105 105 105 106 106 105 105 105 104
6146 104 104 104 104 103 103 104 104 104 105 105 105 105 105 105 105 105 105 105 105 105 105 105 105 105 105 105 106 106 106 106 106 106 106 105 105 105 105 105 105 105 105 106 106 106 106 106 106 106 106 106 106 106 106 106 105 105 105 104 104 104 104 105 105 106 106 106 105 106 106
6138 106 106 106 106 107 107 107 107 107 107 108 108 108 107 107 107 108 108 108 108 108 107 108 109 109 109 109 109 108 108 108 109 108 108 109 109 109 109 108 108 108 108 108 109 109 109 109 109 110 110 110 110 111 110 110 110 110 110 110 110 110 110 111 111 111 111 111 111 112 112
6131 112 113 112 112 113 113 114 114 114 114 115 115 115 116 117 118 119 119 119 119 119 120 120 120 121 122 123 124 125 126 127 128 129 131 133 134 136 138 140 142 145 147 150 153 155 158 161 163 166 168 171 175 177 179 181 184 186 188 190 192 193 194 196 196 197 198 198 198 197 196
6124 196 195 195 194 194 193 193 192 190 188 186 185 184 183 182 181 180 180 181 182 183 184 184 185 186 188 189 190 191 193 194 194 195 195 196 197 198 198 198 198 197 197 196 195 193 192 191 190 188 186 183 181 177 174 171 168 166 163 160 157 154 151 148 146 143 141 139 137 136 134
6116 134 133 132 131 129 128 127 127 126 125 124 122 121 120 120 120 119 118 118 118 118 118 118 119 119 118 117 117 117 117 117 116 116 116 116 117 117 116 115 115 116 116 116 116 116 116 116 116 116 116 116 116 116 115 114 113 113 113 112 112 113 113 113 112 112 112 112 112 112 113
6109 113 113 113 112 112 112 112 111 111 111 110 110 110 110 110 110 110 110 109 109 110 110 110 110 110 110 110 110 110 110 110 110 111 112 112 112 112 113 112 112 112 112 112 112 113 113 114 114 114 114 113 113 114 114 114 114 113 112 112 112 113 113 113 113 113 113 112 112 112 112
6102 112 112 111 111 111 111 111 111 111 110 110 110 110 110 110 110 109 109 109 109 109 109 109 109 108 108 108 108 109 109 110 110 110 111 111 111 112 112 113 113 113 112 112 113 113 113 113 114 114 115 115 115 116 116 116 116 116 116 116 116 116 117 118 118 118 119 119 119 119 119
6095 119 118 118 119 119 119 119 119 118 118 119 119 119 119 119 119 119 118 118 118 118 118 118 119 119 119 119 119 119 119 119 119 120 120 120 120 121 121 121 122 122 121 121 121 121 122 122 122 122 122 121 122 123 124 124 124 124 125 125 124 124 125 125 125 125 125 125 125 125 126
6087 126 127 127 127 127 127 127 127 127 127 128 128 129 129 128 128 128 128 127 127 127 127 127 127 127 127 127 127 127 127 127 127 127 126 126 125 124 125 126 127 127 126 126 126 126 126 126 126 127 127 128 128 129 129 128 127 127 127 128 129 129 129 130 130 130 130 130 129 129 130
6080 130 130 130 130 130 131 131 131 131 130 131 131 132 132 133 133 133 133 133 134 134 135 135 136 136 137 137 138 138 139 139 140 140 141 141 141 142 143 143 143 144 144 145 145 146 146 147 147 148 148 149 150 150 151 151 151 151 151 152 153 153 153 154 154 155 156 156 157 158 158
6073 158 159 160 160 160 161 161 162 163 164 165 165 165 166 166 167 167 168 168 168 168 168 169 170 171 171 172 172 172 171 170 170 170 170 170 170 171 172 173 173 173 174 174 174 174 174 175 175 175 176 177 177 178 178 178 178 178 179 180 181 182 182 183 184 184 184 185 185 185 185
6065 185 185 185 186 186 187 188 188 188 188 188 188 188 187 187 187 188 188 188 189 189 189 190 190 191 192 192 192 193 193 194 195 196 197 198 199 200 201 201 201 202 203 204 205 206 207 209 209 210 212 213 214 215 216 218 219 220 221 223 224 226 227 229 230 232 233 235 236 238 239
6058 239 241 243 245 247 248 250 252 254 255 257 258 260 261 263 265 268 269 271 273 275 277 279 281 283 284 286 288 291 293 296 299 301 303 306 309 312 314 317 320 322 325 328 330 333 335 338 340 343 345 348 350 352 355 357 359 361 363 365 366 367 368 369 370 372 374 376 377 378 379
6051 379 381 384 386 388 390 392 394 396 398 400 403 406 409 412 416 419 422 426 430 434 438 443 448 452 457 461 465 471 477 482 488 493 498 504 510 516 524 531 537 545 553 561 570 580 590 601 612 624 636 649 662 676 691 706 722 739
6045 739 757 775 793 812 832 854 877 900 924 949 974 1000 1028 1058 1088 1120 1152 1185 1220 1256 1295 1335 1376 1419 1464 1511 1559 1610 1662 1717 1774 1834 1897 1963 2032
6041 2032 2105 2180 2259 2343 2432 2525 2625 2730 2842 2963 3092 3230 3379 3541 3716 3907 4114 4340 4587 4857 5152 5472 5818 6189 6584
6038 6584 7002 7440 7896 8371 8865 9377 9908 10454 11007 11558 12097 12616 13111 13581 14024 14442 14830 15182 15495 15766 15994 16186 16346
6036 16346 16476 16575 16639 16664 16646 16589 16500 16384 16247 16089 15911 15712 15492 15253 15003 14749 14501 14267 14053 13865 13708 13588 13506 13464 13464 13507
6033 13507 13592 13721 13890 14094 14324 14566 14810 15047 15271 15479 15674 15850 16004 16131 16225 16283 16308 16303 16274 16222 16142 16028 15877 15684 15453 15188
6030 15188 14894 14575 14228 13851 13441 12997 12521 12018 11494 10956 10411 9864 9321 8787 8269 7772 7298 6850 6427 6030 5659 5312 4989
6028 4989 4688 4407 4145 3900 3669 3453 3250 3059 2880 2713 2556 2411 2278 2156 2046 1946 1856 1774 1700 1632 1570 1513 1461 1412 1367 1324
6025 1324 1283 1244 1206 1170 1136 1103 1071 1041 1013 986 959 932 907 883 860 838 816 796 777 758 741 724 707 692 677 663 650 638 625 613 601 591 580 570
6022 570 560 551 541 530 521 512 503 494 485 477 470 462 454 446 438 430 422 415 408 401 394 387 381 374 368 362 357 352 346 342 338 333 329 325 322 318 314 310 306 303 299 295 292 288 283 279 274 270 266 261 257 252 248 243 238 234 229 224 220 216 212 207 203 199 196 192
6015 192 189 186 183 180 177 174 172 171 170 169 169 168 168 167 166 166 166 165 165 164 164 164 163 163 162 162 162 161 161 160 160 160 160 160 160 160 158 158 157 157 157 157 156 156 155 155 155 155 156 156 156 155 155 154 154 154 154 153 153 153 153 152 152 152 152 152 152 151 151
6007 151 150 150 150 150 149 148 148 147 147 147 147 147 146 146 145 145 144 143 143 143 142 142 142 142 142 143 143 142 141 140 139 138 138 137 136 136 136 136 135 134 133 132 131 130 130 130 129 129 128 127 127 127 126 126 126 125 125 125 124 124 124 124 124 124 124 124 124 124 123
6000 123 122 122 122 122 122 121 121 121 122 121 121 120 120 119 119 118 118 117 117 116 116 116 115 115 115 115 115 115 114 114 113 112 112 112 113 113 113 113 113 112 112 113 113 112 112 112 112 113 113 113 113 113 113 113 113 113 114 113 113 113 113 112 113 113 113 113 113 113 113
5993 113 113 113 113 113 112 112 112 112 112 113 113 114 114 114 114 114 114 114 114 114 115 115 115 115 115 116 116 117 117 118 119 120 120 121 122 122 123 123 123 124 124 125 124 124 124 124 124 125 125 125 124 123 123 124 124 124 123 122 121 121 121 121 121 121 120 120 120 121 121
5985 121 120 119 119 119 119 119 119 119 119 120 120 120 119 119 119 119 119 118 118 117 117 117 117 117 116 116 116 115 115 114 113 113 113 114 114 113 114 114 113 112 111 111 110 110 109 109 108 108 108 107 107 107 108 107 107 106 106 107 107 107 107 107 107 106 107 107 107 107 107
5978 107 107 107 107 107 108 108 108 108 108 108 108 109 108 108 108 107 108 108 108 109 108 108 107 107 106 107 107 107 107 107 107 107 107 107 107 107 106 106 106 106 105 104 104 105 105 105 105 105 105 105 105 105 106 106 106 105 106 106 106 106 106 106 106 106 107 107 107 107 107
5971 107 107 107 107 107 108 108 108 107 107 108 108 108 108 108 108 108 107 107 106 107 107 107 106 107 107 108 107 107 108 108 108 108 107 107 108 108 108 108 108 107 107 107 107 107 107 107 108 107 107 107 107 107 107 107 107 107 107 107 107 107 107 107 107 107 107 107 107 107 107
5963 107 107 107 107 107 107 107 107 107 107 107 107 107 107 107 107 107 107 107 107 106 106 106 106 107 106 106 106 106 105 106 106 106 106 106 106 106 106 106 106 106 106 107 107 107 107 106 107 107 107 107 106 106 106 106 106 107 107 107 107 106 106 105 106 106 106 106 106 107 107
5956 107 106 107 107 107 107 107 107 107 107 107 108 107 107 107 107 107 107 107 108 107 107 107 107 107 107 107 107 106 106 106 106 106 106 106 107 107 107 107 107 108 108 108 107 107 107 107 106 107 107 107 108 108 109 109 110 110 111 110 110 110 110 110 111 111 112 112 113 113 114
5949 114 115 115 115 115 116 117 118 119 120 121 121 122 123 124 125 126 128 131 133 135 137 139 141 143 146 148 151 154 157 160 163 166 168 171 174 176 178 181 183 184 186 187 189 189 190 190 191 191 191 191 191 189 189 188 188 186 185 183 182 180 179 178 177 176 176 176 176 176 176
5941 176 177 176 177 178 179 180 181 183 184 185 185 186 187 189 190 191 191 190 190 190 190 189 189 187 186 185 183 181 179 176 174 172 170 167 164 161 158 155 152 149 146 144 142 140 138 135 133 131 129 127 125 125 124 123 121 120 119 118 117 116 115 115 114 113 112 111 111 111 111
5934 111 111 112 111 111 111 111 110 110 109 108 108 108 108 108 108 107 107 107 107 107 106 106 105 105 106 106 107 106 106 107 107 107 107 106 106 106 106 106 106 106 106 106 106 106 105 105 105 105 105 106 106 106 106 106 106 106 106 106 106 107 106 106 105 105 105 106 106 106 106
5927 106 106 107 107 107 106 106 106 107 107 107 107 107 107 107 107 106 106 106 106 106 106 106 107 107 107 107 107 107 107 107 107 107 106 106 106 106 106 107 107 107 106 106 105 105 105 106 106 106 106 106 106 107 108 108 109 109 108 108 107 108 108 108 107 107 107 106 106 107 106
5920 106 106 106 106 106 106 107 107 107 108 108 108 108 107 107 108 108 108 109 108 108 108 108 108 108 108 108 108 108 108 108 108 108 109 109 109 109 108 107 107 108 108 108 108 109 109 109 109 108 108 107 107 107 108 108 108 108 108 109 109 109 109 108 109 109 109 109 108 108 108
5912 108 109 110 110 109 108 107 107 108 109 109 109 109 110 110 110 110 110 110 111 111 112 112 111 112 112 113 113 113 114 114 115 116 117 117 117 117 118 118 119 120 121 122 124 125 126 128 130 131 132 135 137 139 142 144 147 149 152 155 158 161 164 167 169 172 176 179 181 183 185
5905 185 188 190 191 192 192 192 191 191 190 189 187 186 183 181 179 176 174 171 169 167 165 163 160 157 154 150 148 146 144 142 141 140 138 137 136 136 136 135 134 134 134 133 133 133 133 134 134 135 136 137 137 138 140 142 145 147 149 151 154 157 159 162 164 167 170 174 177 181 183
5898 183 186 188 191 193 195 197 199 200 201 201 201 200 199 198 196 194 191 189 187 184 181 178 174 171 169 166 163 160 156 154 151 149 146 144 142 140 137 136 134 133 132 131 131 130 128 127 126 126 125 124 124 123 123 122 121 121 121 120 120 121 120 120 121 121 122 122 121 121 121
5890 121 120 121 121 120 120 119 119 119 119 119 119 119 119 118 118 118 117 117 117 117 118 118 118 118 118 118 118 118 118 118 118 118 119 119 119 119 119 119 118 118 118 118 118 118 119 119 119 120 120 120 120 119 119 119 119 119 119 119 118 118 118 119 119 120 120 120 119 119 119
5883 119 119 120 120 120 120 120 120 120 120 120 120 120 120 119 119 119 120 119 119 118 118 118 118 118 118 119 119 119 119 118 118 119 119 119 119 119 119 119 119 119 119 119 119 119 119 119 119 119 119 119 119 119 119 119 119 119 119 120 120 120 119 119 119 119 119 120 119 119 119
5876 119 120 120 120 120 120 120 120 120 120 121 121 121 121 121 122 122 122 121 121 121 121 122 122 122 122 122 121 122 122 122 121 120 121 121 121 121 121 120 120 120 121 121 120 120 120 119 119 119 119 118 118 118 118 118 118 118 118 118 118 118 118 118 118 118 119 119 119 119 119
5868 119 118 119 119 120 121 121 121 122 122 122 122 123 123 123 124 125 125 127 127 127 127 128 128 129 130 130 130 130 130 130 130 130 130 131 132 132 132 132 131 131 131 131 131 131 130 131 131 131 132 131 131 131 131 131 132 133 133 133 133 133 132 132 132 132 132 132 132 133 133
5861 133 134 136 137 137 137 137 137 138 138 139 139 139 140 141 142 142 142 143 144 144 145 145 146 146 147 148 149 149 150 150 151 151 152 152 153 153 153 153 154 154 155 156 156 157 157 157 158 158 159 160 161 161 161 161 161 161 161 162 162 162 162 162 162 162 163 163 163 164 164
5854 164 164 165 165 165 166 166 165 165 166 166 167 167 167 168 169 170 171 171 171 171 171 172 173 173 174 174 175 175 176 176 177 177 177 178 179 179 180 181 182 183 184 185 186 188 189 189 189 190 190 191 192 193 194 194 194 194 194 195 195 197 198 199 199 199 200 200 201 201 202
5846 202 202 204 205 206 206 207 208 208 209 209 210 212 213 215 216 218 219 220 222 223 224 226 228 229 230 231 233 235 237 238 240 242 243 245 246 247 250 252 254 256 257 258 259 261 262 264 266 268 270 272 273 275 276 278 280 282 284 286 288 291 293 295 298 300 303 306 309 311 314
5839 314 316 318 320 322 323 325 327 328 330 332 332 333 333 334 335 335 336 337 337 338 339 340 342 343 344 345 346 347 349 351 353 355 358 361 364 366 369 372 375 378 381 385 389 393 397 401 405 409 413 418 423 428 434 439 445 451 457 464 471 478 486 495 504 512 521 531 541
5832 541 551 563 574 586 599 612 625 639 654 668 683 699 714 729 745 762 779 796 814 833 852 870 889 909 929 950 972 995 1017 1041 1065 1090 1116 1143 1172
5828 1172 1202 1233 1267 1302 1338 1376 1416 1459 1504 1551 1601 1655 1711 1771 1835 1902 1974 2050 2130 2216 2307 2405 2510 2623 2745 2877 3019 3174 3341 3523
5825 3523 3723 3942 4182 4446 4734 5050 5393 5764 6162 6586 7035 7506 8001 8519 9062 9630 10222 10832 11448 12056 12641 13193 13706
5823 13706 14181 14618 15019 15383 15706 15982 16198 16349 16425 16422 16344 16196 15988 15729 15426 15085 14707 14294 13848 13373 12878 12369 11851 11331
5820 11331 10813 10304 9810 9336 8885 8459 8058 7682 7331 7005 6704 6428 6175 5947 5744 5565 5410 5277 5166 5078 5010 4965 4943 4947 4976
5818 4976 5031 5114 5226 5368 5541 5748 5988 6263 6571 6912 7285 7688 8118 8574 9057 9567 10104 10669 11258 11863 12470 13064 13629 14156
5815 14156 14642 15086 15491 15859 16188 16471 16700 16863 16953 16962 16890 16740 16520 16240 15910 15537 15125 14675 14189 13670 13124 12559 11980 11392
5812 11392 10803 10217 9640 9080 8539 8022 7529 7061 6616 6195 5795 5418 5063 4730 4418 4128 3857 3604 3369 3150 2945 2754 2576
5810 2576 2412 2261 2122 1996 1882 1780 1687 1603 1526 1457 1394 1335 1280 1229 1182 1138 1097 1058 1022 988 956 924 894 865 838 813 788 763 741 719 697
5807 697 677 658 639 623 607 592 577 563 550 537 525 514 504 494 486 478 471 464 458 452 448 444 440 436 432 430 427 425 423 421 419 416 414 413 410 407 405 403 401 400 398 396 394 393 391 388 385 382 380 377 375 373 371 368 365
5801 365 362 359 355 352 348 343 339 335 331 327 323 318 313 308 302 296 289 283 277 270 264 258 252 246 240 234 229 223 218 214 209 205 202 198 195 192 190 188 186 185 183 182 182 182 181 181 181 180 180 180 181 182 183 183 183 184 184 184 184 184 184 184 185 186 186 185 186 186 187
5794 187 187 186 186 187 187 187 187 186 186 186 186 186 186 186 186 186 186 187 186 186 186 185 186 186 186 185 185 184 184 183 184 183 182 181 180 179 178 177 176 176 175 175 174 173 172 171 170 170 169 168 168 167 167 166 165 165 164 164 164 164 163 163 163 163 162 162 162 163 163
5786 163 162 162 162 162 163 162 161 161 161 161 161 160 160 159 158 157 156 156 155 154 153 153 153 152 151 151 150 149 148 149 148 148 148 146 145 145 144 143 142 141 140 139 138 138 137 136 136 135 133 132 131 130 129 128 127 127 126 126 125 125 125 125 124 124 123 123 123 123 122
5779 122 122 121 121 120 120 120 120 120 120 120 120 120 120 119 119 120 120 121 121 121 122 122 122 122 123 123 123 123 123 124 125 125 125 126 127 127 128 128 129 129 129 129 129 129 129 130 130 130 130 130 129 129 129 129 128 127 127 126 125 125 124 123 123 122 121 121 120 120 120
5772 120 120 120 119 118 117 116 116 115 115 115 115 114 114 114 114 114 115 115 114 114 114 114 113 113 114 114 115 115 115 115 114 114 115 116 117 118 118 119 119 119 120 120 120 121 121 121 121 121 120 121 121 121 121 120 120 120 119 119 118 118 117 117 116 115 113 112 112 111 110
5764 110 109 109 108 108 108 107 106 105 105 104 104 104 104 104 104 103 102 101 100 100 100 100 99 99 99 99 98 98 98 98 98 97 96 96 97 97 97 96 96 96 96 96 96 95 95 95 95 96 96 97 97 96 97 97 96 95 95 94 94 95 95 95 95 95 95 95 95 94 94
5757 94 94 94 95 95 95 95 95 95 95 95 96 96 95 95 95 95 95 95 95 95 95 95 96 96 95 95 95 95 96 96 96 96 97 97 97 96 95 96 96 97 97 98 98 98 97 97 97 97 97 97 96 96 97 97 97 98 98 98 99 99 99 98 98 99 98 98 98 97 98 99
5750 99 99 100 100 99 99 99 99 99 99 99 99 99 99 99 99 99 99 99 100 100 100 100 100 101 100 100 101 101 101 100 100 101 101 101 101 102 101 101 101 101 101 101 101 101 100 100 101 102 102 103 103 103 103 103 103 103 103 104 105 105 106 106 106 106 106 106 107 108 108 109
5742 109 109 109 109 110 109 109 109 109 110 111 111 112 112 112 112 113 113 113 113 114 114 115 116 117 119 120 121 122 123 125 127 129 132 134 137 139 141 143 146 148 150 154 157 160 162 165 167 169 172 175 177 179 180 180 181 180 180 178 176 175 173 172 171 169 166 165 163 160 158
5735 158 154 151 149 147 145 143 141 139 137 136 134 133 131 131 130 129 128 127 126 126 126 126 126 126 125 125 125 125 126 126 127 129 130 131 132 134 136 139 141 143 145 148 151 154 157 160 162 165 169 173 175 177 179 181 182 184 185 186 186 187 187 186 185 183 181 178 176 174 171
5728 171 169 166 163 161 157 154 150 147 144 141 138 135 133 132 130 128 126 125 123 122 120 119 117 116 114 113 112 112 111 110 110 109 109 108 108 108 108 108 107 107 106 106 105 105 105 105 104 103 103 104 104 103 103 103 103 102 103 103 103 103 103 102 102 102 101 101 101 101 100
5720 100 100 100 100 99 99 100 100 100 100 100 100 99 99 99 99 99 99 100 100 100 100 100 99 99 98 99 99 100 100 101 100 99 99 99 98 98 99 99 99 99 99 98 98 98 98 98 98 98 98 99 98 98 97 97 97 98 98 98 98 98 98 98 98 98 98 98 97 97 97
5713 97 98 98 98 97 97 97 97 97 97 97 96 96 96 96 97 96 97 97 98 98 97 98 97 97 97 97 97 97 96 96 97 97 98 98 97 97 97 97 97 97 97 96 96 96 97 96 97 97 97 97 97 97 96 97 96 96 96 96 97 97 96 96 96 96 96 95 96 97 97 97
5706 97 97 96 96 96 96 97 97 98 98 98 97 98 98 98 97 97 97 97 98 98 98 98 98 98 99 99 99 99 99 99 99 98 98 98 97 97 97 97 97 97 97 97 97 98 98 98 98 98 98 99 98 97 97 97 98 98 98 98 98 97 97 97 98 98 98 97 97 98 98 98
5698 98 97 97 97 97 97 97 98 98 98 98 98 98 99 99 99 99 98 98 97 98 99 99 99 100 100 100 99 100 100 101 100 100 100 100 100 100 100 100 101 101 101 101 101 101 101 101 101 101 101 101 101 101 101 101 101 101 101 101 100 100 100 100 100 100 100 101 101 102 102 101
5691 101 101 101 101 101 101 101 101 102 102 102 102 103 102 102 102 102 102 102 102 102 102 102 101 101 101 101 101 101 101 101 102 102 102 102 102 101 101 101 101 101 101 101 101 101 101 101 101 102 101 102 102 102 101 101 100 100 101 101 101 100 100 100 100 100 100 100 100 100 100
5683 100 101 101 100 100 100 100 100 100 101 101 101 101 101 101 100 100 100 100 100 99 99 99 99 99 98 98 98 98 98 98 98 98 99 98 98 97 97 98 98 98 97 97 97 98 98 97 96 96 96 96 96 97 97 96 96 96 97 96 96 95 95 95 95 96 96 96 96 95 95
5676 95 96 96 96 97 96 95 95 95 95 95 95 95 95 95 95 95 96 96 96 95 95 94 95 95 95 96 95 95 95 95 95 95 95 94 95 95 95 95 95 95 96 95 95 96 96 96 95 95 95 95 95 95 95 95 95 94 94 95 95 95 95 95 94 94 94 94 95 95 95 95
5669 95 95 96 97 97 97 96 96 96 96 96 96 97 97 97 97 97 98 98 98 98 98 98 98 98 99 99 98 98 98 98 98 98 99 99 98 98 98 99 99 99 99 99 99 100 99 99 99 99 100 100 100 100 100 100 100 100 100 100 100 100 100 100 100 100 101 101 101 101 100 100
5661 100 100 100 101 101 101 101 101 101 101 101 101 101 101 101 100 100 101 101 102 102 102 101 101 102 102 102 102 101 101 101 101 102 103 103 103 103 103 102 102 102 102 102 102 102 102 103 103 102 102 102 102 101 101 101 102 101 102 102 102 102 102 102 102 102 102 103 103 102 102
5654 102 102 103 103 104 104 105 105 105 105 106 106 106 106 106 105 105 105 106 106 105 105 105 105 105 105 105 105 105 104 105 105 105 105 105 105 105 104 104 103 103 103 104 104 103 103 103 103 104 104 104 104 104 105 104 104 104 103 103 102 102 102 102 102 102 102 102 102 101 101
5647 101 101 102 103 103 103 103 102 102 102 102 102 102 103 102 102 102 103 103 103 103 103 103 103 104 104 105 105 105 104 104 104 104 104 104 104 104 105 105 105 106 105 105 105 105 104 104 104 105 104 104 104 104 104 104 104 104 104 103 103 104 104 104 104 104 105 105 105 105 105
5639 105 105 105 105 105 105 105 105 105 105 104 104 104 104 104 104 104 104 105 105 105 105 105 104 104 104 104 104 105 105 105 104 104 104 104 104 105 105 105 105 105 105 105 105 105 105 105 104 104 104 104 104 104 105 106 105 105 105 105 105 105 106 106 107 107 106 106 107 107 107
5632 107 107 107 108 108 108 108 108 109 109 110 110 111 111 112 112 111 111 112 113 114 114 114 114 115 117 119 120 121 122 123 124 124 126 127 128 130 132 133 134 135 137 139 140 142 142 143 143 144 144 145 145 146 146 146 147 147 147 146 146 146 145 144 143 142 141 140 139 138 137
5625 137 136 135 134 133 132 130 130 131 130 129 128 128 128 129 128 128 128 128 129 128 128 128 129 131 132 133 134 135 137 139 140 142 145 148 150 153 155 158 160 163 165 168 171 173 176 179 181 184 185 186 187 188 188 188 188 189 189 188 188 188 188 187 185 183 182 181 179 176 173
5617 173 170 166 164 161 158 156 153 151 149 147 145 143 142 140 139 139 138 137 136 135 134 134 134 133 133 133 133 133 133 132 133 133 133 134 135 136 137 138 139 140 141 142 143 144 146 147 148 149 151 152 153 153 153 154 154 154 153 153 153 153 153 153 152 152 151 151 150 150 149
5610 149 148 147 144 142 141 139 138 136 135 133 133 131 130 130 129 129 128 128 127 126 125 124 124 123 123 122 122 121 121 121 122 122 122 121 121 120 119 119 120 120 120 120 120 121 121 120 120 119 119 119 119 119 119 118 118 118 118 118 119 119 119 120 119 119 119 120 119 119 120
5603 120 120 120 121 121 121 120 120 120 120 120 120 119 120 120 120 120 120 120 120 120 120 120 121 121 120 121 121 121 122 122 122 122 121 121 121 121 121 122 122 122 123 123 122 121 121 121 122 122 123 122 122 121 121 121 122 122 122 123 122 121 122 122 122 122 122 123 122 122 122
5595 122 123 123 123 122 122 123 123 122 122 122 123 123 123 123 123 123 123 123 123 123 122 123 123 124 124 124 124 124 124 124 124 124 124 125 126 126 126 126 125 126 126 126 126 127 127 127 126 126 127 128 128 129 129 130 130 130 130 129 129 129 129 129 129 129 129 129 129 128 128
5588 128 128 128 129 129 129 129 129 129 130 130 129 129 129 129 129 129 129 128 128 128 128 128 128 128 128 130 131 131 131 132 133 134 135 135 134 134 134 134 135 136 137 138 138 138 139 139 139 139 140 140 140 140 141 142 142 143 143 144 145 146 146 147 147 147 148 149 149 149 148
5581 148 148 149 150 150 151 151 150 149 150 150 151 151 152 152 152 152 152 153 153 154 154 154 154 154 154 154 155 154 154 154 154 155 156 157 158 158 158 158 158 159 160 160 161 161 162 162 161 162 162 164 165 165 165 165 165 166 167 167 167 167 169 170 172 172 172 173 173 174 175
5573 175 176 177 177 177 177 178 178 178 179 180 181 182 182 182 182 183 184 184 184 185 186 186 187 187 187 187 186 186 186 187 187 188 188 188 189 190 191 192 192 193 194 195 196 197 198 199 200 201 202 203 204 204 204 205 207 208 208 209 210 212 213 214 215 215 216 217 218 220 221
5566 221 223 224 226 227 228 229 230 231 232 233 235 237 238 240 241 243 244 245 246 246 248 249 251 252 254 256 257 259 260 261 262 263 264 264 265 266 268 270 271 271 272 273 273 274 275 275 276 277 277 279 281 283 284 286 288 290 291 292 293 295 297 298 300 302 305 306 308 311 313
5559 313 317 320 323 325 328 331 335 338 341 345 348 352 356 360 364 368 374 379 384 389 395 401 406 411 418 425 431 438 445 454 462 469 477 484 491 498 507 516 525 535 545 553 562 571 580 588 598 608 618 628 639 650 663 676 690 703 718
5553 718 733 749 765 782 800 819 838 860 882 906 931 958 986 1015 1046 1079 1113 1149 1187 1228 1270 1315 1363 1414 1468 1525 1587 1654 1727 1805 1892 1987 2091 2207
5549 2207 2335 2476 2632 2804 2994 3204 3433 3680 3944 4220 4504 4791 5079 5367 5655 5949 6250 6560 6871 7174 7455 7705 7923
5547 7923 8108 8261 8382 8471 8529 8557 8562 8553 8536 8521 8511 8501 8481 8436 8359 8248 8102 7926 7722 7493 7244 6979 6704 6426 6151 5886 5637 5407
5544 5407 5199 5013 4853 4715 4600 4507 4433 4373 4324 4287 4258 4239 4230 4232 4247 4279 4329 4401 4498 4621 4774 4958 5173 5421 5705 6027 6387 6785
5541 6785 7219 7687 8182 8693 9216 9744 10273 10806 11345 11893 12449 13004 13544 14051 14509 14908 15245 15517 15726 15873 15960 15992 15978 15929
5538 15929 15861 15784 15706 15623 15520 15384 15197 14949 14637 14263 13831 13347 12818 12255 11665 11061 10454 9858 9283 8737 8225 7753 7323 6935
5536 6935 6586 6273 5992 5737 5503 5285 5079 4882 4694 4516 4351 4200 4067 3955 3867 3804 3767 3756 3769 3808 3871 3959 4072 4209 4371 4555
5533 4555 4757 4975 5203 5436 5672 5910 6151 6396 6649 6910 7174 7427 7657 7855 8021 8155 8258 8330 8369 8378 8359 8317 8260 8197 8137 8080
5530 8080 8023 7953 7860 7734 7572 7378 7152 6898 6619 6320 6004 5679 5350 5022 4703 4398 4110 3843 3597 3372 3168 2983 2816 2663
5528 2663 2519 2383 2253 2126 2002 1881 1762 1648 1539 1438 1346 1262 1187 1120 1061 1008 960 917 877 841 807 775 746 720 696 674 653 633 614
5525 614 596 579 563 547 531 516 502 489 476 463 452 442 432 422 412 403 394 385 376 368 360 352 345 338 331 325 320 316 311 307 303 300 296 294 292 289 286 284 282 281 279 278 277 275 274 273 273 273 272 270 269 267 266 265
5519 265 264 263 263 262 261 260 259 257 256 256 255 254 252 251 250 250 249 248 246 245 244 242 241 240 239 237 235 234 232 231 230 229 226 225 223 222 221 219 216 214 212 210 209 207 206 204 204 203 201 200 199 198 197 196 195 195 196 196 196 196 196 196 196 196 196 197 197 197 196
5512 196 196 197 197 197 196 196 196 196 196 196 196 195 196 196 196 195 195 195 196 196 196 197 197 197 197 197 197 197 198 199 200 200 199 198 198 198 198 199 199 198 198 198 198 198 198 197 197 198 199 199 198 197 196 196 196 196 195 195 195 195 195 195 195 195 195 195 195 195 195
5504 195 195 195 194 194 194 195 196 196 197 197 197 197 197 197 197 198 197 197 197 198 198 198 198 199 199 199 199 199 199 200 201 202 201 201 201 202 201 201 200 201 201 201 201 201 201 201 201 202 202 203 203 203 203 202 202 202 202 202 202 202 202 201 202 202 202 203 203 203 203
5497 203 204 204 204 204 204 204 204 204 205 205 206 207 208 208 209 210 211 212 213 213 214 214 215 216 217 219 220 221 222 223 224 224 225 226 226 226 227 227 228 228 229 230 230 231 232 233 234 233 233 234 234 235 236 237 237 237 238 239 240 241 241 242 242 242 243 243 244 244 244
5490 244 245 245 246 245 245 245 245 245 246 246 246 245 245 245 246 246 247 248 248 249 249 250 251 252 253 254 255 256 257 259 260 261 263 264 265 266 267 268 270 271 272 274 275 276 278 279 281 282 284 285 286 287 288 289 289 290 291 293 295 297 297 298 298 299 301 303 305 306 308
5482 308 310 312 314 317 319 321 324 326 329 332 334 337 339 341 343 345 348 350 353 355 358 360 362 365 368 371 374 377 380 383 387 390 393 396 398 401 404 408 411 414 418 421 425 429 433 436 440 444 448 453 457 462 465 469 473 476 480 483 486 490 493 495 498 501 504 507 509 509 511
5475 511 512 513 513 514 514 515 516 517 519 520 521 523 525 528 531 535 538 542 545 549 554 558 562 568 573 580 586 592 598 605 612 619 627 635 643 650 659 667 676 687 698 709 722 734 747 761 775 790 806 823 840 858 877 897
5469 897 917 938 959 982 1005 1029 1053 1080 1107 1135 1164 1194 1225 1256 1286 1318 1352 1385 1420 1456 1494 1532 1572 1612 1654 1697 1740 1785 1831 1879 1929 1981 2035 2093 2153
5466 2153 2217 2283 2354 2428 2506 2589 2677 2770 2869 2974 3086 3206 3334 3471 3617 3773 3940 4120 4314 4523 4747 4987 5245 5521 5814 6127
5463 6127 6460 6817 7201 7615 8062 8544 9063 9620 10218 10861 11553 12300 13103 13954 14844 15758 16685 17622 18573 19555 20582 21666
5461 21666 22797 23945 25070 26127 27079 27909 28617 29214 29720 30149 30509 30794 30988 31078 31052 30909 30656 30308 29873 29356 28758 28081
5458 28081 27332 26522 25666 24782 23887 22995 22116 21257 20424 19620 18845 18101 17387 16703 16047 15417 14810 14223 13657 13113 12597 12115 11674
5456 11674 11281 10941 10659 10438 10277 10179 10142 10165 10249 10389 10583 10825 11114 11449 11832 12266 12754 13300 13900 14550 15241 15966 16719 17500
5453 17500 18314 19167 20064 21004 21973 22947 23904 24824 25699 26539 27360 28175 28988 29779 30513 31150 31655 32005 32196 32241 32159 31970 31691
5451 31691 31327 30873 30321 29665 28909 28061 27137 26152 25119 24049 22951 21839 20728 19633 18568 17543 16566 15638 14759 13926
5449 13926 13139 12393 11688 11020 10385 9781 9204 8652 8120 7605 7107 6626 6165 5729 5321 4944 4602 4293 4015 3766 3543 3341 3158
5446 3158 2993 2841 2701 2570 2447 2331 2221 2116 2016 1922 1834 1752 1675 1604 1537 1475 1417 1363 1313 1267 1222 1180 1141 1103 1066 1032 1000 970 941 915
5443 915 890 867 845 825 807 790 775 761 748 736 725 715 705 696 688 681 674 667 661 655 650 644 639 634 629 623 618 613 607 602 596 591 585 580 575 569 563 557 551 544 538 532 528 523 517 510 503 496 490 484 479 474 468 464 459 454
5437 454 447 441 434 425 416 408 400 392 384 375 366 357 347 337 327 317 307 298 289 279 270 263 256 249 243 238 233 228 224 221 217 215 212 210 208 207 205 204 203 203 202 201 201 201 201 201 202 202 202 202 202 202 203 203 203 203 202 202 202 203 203 203 204
5430 204 204 205 206 208 210 211 212 215 218 221 224 227 230 233 236 239 242 245 248 252 254 256 257 258 259 258 257 256 253 250 246 243 240 236 233 229 226 222 219 216 214 212 210 208 206 204 200 197 195 192 190 187 184 181 180 178 176 174 173 171 170 169 168 168 168 168 168 168 167
5423 167 167 167 167 167 167 167 168 169 170 171 171 173 174 175 177 178 179 181 183 184 186 187 188 190 192 194 197 199 200 202 205 206 207 209 210 211 211 211 210 208 206 204 201 197 192 188 183 180 176 173 170 166 163 160 158 157 155 152 151 149 147 145 144 142 142 141 140 140 139
5416 139 139 138 137 136 136 136 136 135 134 134 134 135 134 134 134 133 134 134 135 136 136 137 138 138 139 141 141 141 142 143 143 144 145 146 146 146 146 147 148 148 148 148 148 149 148 147 147 146 145 144 143 142 142 141 141 141 139 138 138 136 135 134 133 131 130 129 128 128 127
5409 127 126 124 124 124 124 124 124 124 123 122 122 122 122 123 124 123 123 123 124 125 125 126 127 127 128 128 128 129 130 131 132 133 134 135 136 136 136 137 138 139 140 140 140 141 142 142 141 141 141 141 140 140 139 139 139 138 138 137 136 135 134 132 130 128 127 126 125 123 121
5401 121 120 120 119 118 117 116 115 114 113 113 112 111 110 109 109 109 108 108 108 107 107 107 107 106 106 105 105 105 105 105 105 105 105 105 105 105 105 105 105 105 105 105 105 105 105 104 104 104 104 104 104 104 104 104 104 104 104 105 105 105 105 105 106 106 106 106 105 105 105
5394 105 106 106 106 106 106 106 107 107 107 106 106 106 106 106 106 106 106 106 107 106 106 105 105 104 104 104 104 104 104 104 104 104 104 104 104 104 103 103 103 103 104 104 104 104 104 104 103 103 103 103 103 103 104 104 104 105 105 105 105 105 105 105 106 106 107 107 107 107 107
5387 107 107 106 107 107 107 108 108 108 109 109 109 110 110 111 111 112 112 112 112 112 112 112 113 113 113 114 114 114 115 115 115 116 116 117 118 118 119 119 119 120 121 122 122 122 124 125 126 126 128 130 132 133 135 137 140 142 145 147 151 155 159 163 167 171 176 181 185 190 194
5379 194 199 204 209 213 217 221 224 227 230 232 235 238 240 242 243 244 246 247 249 250 250 250 249 249 247 245 244 242 239 237 234 230 227 223 219 214 210 205 200 196 192 189 185 182 179 176 174 172 170 168 166 164 163 162 161 161 160 160 160 161 162 164 165 168 170 172 175 178 182
5372 182 185 189 193 198 202 206 210 214 219 223 226 230 233 235 237 238 240 241 242 243 244 244 245 245 245 244 244 243 242 242 241 240 240 239 238 237 235 233 230 227 224 221 217 214 210 206 201 197 194 189 184 179 174 169 165 161 156 152 148 145 141 138 135 132 130 128 127 126 124
5365 124 122 120 119 118 116 116 115 114 112 111 110 110 109 109 108 107 106 105 105 105 105 104 104 104 104 104 104 104 104 104 103 103 103 103 104 104 104 104 104 104 104 104 104 104 103 103 104 104 104 104 104 104 104 104 104 104 105 105 105 105 105 104 104 104 105 105 105 105 105
5357 105 105 104 104 103 103 103 103 103 104 104 104 104 104 104 104 104 103 104 104 103 103 103 103 103 103 104 104 104 104 104 104 104 103 102 102 103 103 103 102 103 103 103 103 104 104 103 102 102 102 102 101 101 101 101 101 101 101 101 101 101 101 101 102 101 101 100 101 101 102
5350 102 102 102 101 100 101 101 101 101 100 100 100 101 102 102 103 102 102 102 102 102 102 103 103 104 104 104 105 104 104 104 104 104 104 104 104 104 103 102 101 101 102 102 103 103 104 103 102 102 102 102 102 103 103 103 102 102 102 102 103 103 102 102 101 101 102 102 103 103 102
5343 102 102 102 102 102 102 102 102 102 103 103 103 102 102 102 103 103 103 103 103 104 104 105 105 105 105 105 105 105 105 106 106 106 106 106 106 106 105 105 105 106 106 106 106 106 106 105 105 105 105 105 105 105 105 105 106 107 107 107 106 105 105 105 105 105 105 105 106 106 106
5335 106 107 106 106 106 105 106 106 106 106 107 106 106 106 106 106 107 107 107 107 107 107 107 107 107 107 107 108 108 108 108 108 109 109 108 109 110 110 111 111 111 111 111 111 112 112 113 113 113 114 114 115 115 116 116 116 117 117 117 118 118 119 119 121 122 123 124 124 125 127
5328 127 129 130 132 134 136 138 139 141 143 146 148 150 153 154 156 157 158 159 160 160 160 161 160 159 159 159 158 158 157 156 155 154 152 151 150 149 148 148 148 148 147 146 147 147 147 148 148 149 151 152 154 156 157 157 158 159 161 163 165 167 169 170 171 172 173 173 174 174 174
5321 174 174 175 176 176 177 177 177 177 177 176 175 175 175 176 176 176 176 177 177 177 176 176 175 174 173 172 171 169 168 166 165 163 161 160 158 157 156 154 153 152 152 151 151 151 150 150 150 150 150 151 152 152 153 154 155 157 158 159 160 161 162 163 164 164 164 164 164 164 164
5313 164 163 163 162 161 160 159 157 156 155 153 151 149 147 145 143 141 140 139 138 137 136 135 134 133 132 131 131 131 130 130 129 128 127 126 126 126 125 125 125 124 124 123 124 124 124 124 124 123 123 123 123 123 123 123 123 123 122 122 121 121 121 121 122 122 121 120 120 120 121
5306 121 121 121 121 121 121 121 121 121 121 121 120 121 121 121 121 122 122 122 122 122 122 122 122 122 122 122 122 122 122 122 122 123 123 122 122 121 121 121 122 122 121 121 121 121 121 121 120 120 119 119 119 119 119 118 117 117 118 118 117 117 118 118 118 118 118 118 119 119 118
5299 118 118 118 118 118 118 119 119 119 120 119 118 118 117 117 117 118 119 120 120 120 121 121 121 121 121 121 121 121 120 120 120 120 120 119 118 117 118 119 119 119 118 118 118 117 117 117 116 116 116 116 116 115 115 116 116 116 115 115 115 114 114 115 116 116 117 116 117 118 118
5292 118 119 118 118 119 119 119 120 120 120 120 120 120 121 121 122 121 121 121 121 122 122 123 124 124 125 125 125 125 125 125 125 124 124 125 126 126 127 126 126 126 126 126 126 126 127 127 126 126 126 127 127 127 126 126 126 126 126 127 127 128 128 128 127 127 127 127 128 128 129
5284 129 130 131 131 131 132 133 133 134 135 136 137 137 138 138 138 138 138 139 140 140 141 142 142 143 144 145 145 145 145 145 145 145 147 147 147 147 148 148 149 150 151 151 151 152 152 152 153 153 153 153 154 154 154 153 154 154 155 156 157 157 158 158 158 158 158 159 159 159 160
5277 160 160 161 161 162 162 163 163 164 164 164 164 165 166 166 167 167 168 169 170 171 171 172 172 172 172 173 174 175 175 175 176 176 176 176 176 176 177 177 178 178 179 179 180 180 181 181 182 182 183 183 184 184 185 186 186 187 188 188 189 190 190 190 189 190 191 191 192 192 193
5270 193 194 195 196 197 198 200 202 203 203 204 205 205 206 208 209 210 211 213 214 216 217 218 220 222 223 224 225 227 229 231 232 233 234 235 236 237 238 240 241 242 243 244 246 247 249 252 254 257 258 260 263 266 269 272 276 280 284 289 293 297 302 306 311 316 320 326 332 337 342
5262 342 347 351 355 360 364 367 370 373 375 378 380 383 385 387 389 390 391 391 391 391 391 390 390 389 388 388 387 387 387 388 388 389 389 390 391 393 395 396 398 399 400 402 404 406 408 411 414 417 421 424 427 431 436 442 447 454 460 467 474 482 491 499 508 517 527 537 549
5255 549 561 574 586 599 611 624 636 649 662 674 687 700 713 726 740 753 766 778 791 803 814 824 834 845 856 868 879 891 903 915 928 942 956 972 988
5251 988 1006 1024 1043 1064 1085 1107 1131 1156 1183 1212 1243 1275 1310 1347 1386 1428 1473 1521 1573 1627 1686 1749 1817 1889 1967 2051 2143 2243 2352 2471 2601 2746
5248 2746 2905 3081 3276 3491 3727 3986 4268 4572 4894 5231 5578 5934 6296 6665 7043 7432 7832 8234 8629 9000 9336 9627 9868
5246 9868 10059 10203 10304 10369 10404 10411 10387 10329 10233 10101 9937 9746 9532 9302 9062 8819 8578 8346 8127 7927 7750 7600 7479 7390 7335 7316
5243 7316 7335 7391 7485 7615 7775 7960 8165 8388 8624 8873 9139 9423 9724 10037 10351 10652 10928 11173 11384 11561 11706 11825 11926 12015
5240 12015 12093 12159 12209 12243 12262 12270 12267 12256 12239 12218 12196 12178 12169 12178 12206 12254 12311 12366 12406 12421 12405 12357 12278 12172 12044 11897 11734 11552 11345 11110 10846 10557
5237 10557 10246 9920 9587 9252 8922 8601 8295 8009 7744 7505 7294 7113 6964 6849 6768 6722 6713 6740 6801 6893 7009 7145 7294 7456 7629
5234 7629 7813 8012 8224 8448 8671 8880 9062 9209 9316 9381 9406 9395 9352 9283 9189 9068 8915 8726 8505 8253 7974 7674 7357 7029 6693
5232 6693 6354 6016 5683 5360 5049 4752 4468 4198 3943 3703 3477 3266 3070 2888 2718 2558 2406 2262 2124 1991 1864 1743 1629
5229 1629 1523 1425 1337 1259 1189 1127 1073 1025 981 942 906 874 845 817 793 769 748 727 708 691 675 660 646 632 618 604 591 578 567 555 544 533 523 513
5226 513 503 493 483 474 464 455 446 438 430 423 416 410 405 400 395 390 385 380 377 373 370 366 363 360 356 353 349 345 341 337 334 330 327 323 319 315 312 309 306 303 300 297 294 291 290 288 286 285 284 283 282 280 280 279 278 277 277 277 277 278 279 279 278 277 277
5219 277 276 275 274 273 271 270 269 267 265 263 260 258 256 254 252 250 249 248 246 245 244 243 242 241 240 238 238 237 238 238 239 239 239 238 239 241 242 243 244 245 247 249 251 253 254 256 258 260 261 262 264 265 266 267 269 271 272 274 276 277 278 279 281 282 283 285 286 287 287
5211 287 288 288 289 289 290 290 291 292 292 293 294 294 295 296 296 297 299 299 300 301 301 302 303 303 303 303 304 305 305 306 307 308 309 309 310 311 313 314 315 316 317 319 319 321 323 325 327 330 333 336 339 342 345 348 352 355 358 362 365 368 371 374 376 379 381 383 385 387 388
5204 388 389 391 392 393 394 395 396 396 396 396 396 397 397 397 396 396 396 396 396 396 396 396 396 396 397 398 400 401 403 404 406 408 410 411 412 413 415 417 419 421 424 426 428 431 432 434 436 439 441 443 446 448 450 452 455 457 460 462 465 467 469 470 471 472 474 475 477 480 482
5197 482 485 489 492 496 500 503 507 509 511 514 516 519 521 524 527 530 532 536 539 543 547 551 557 563 569 575 581 588 595 602 610 619 628 637 648 657 667 678 690 701 714 727 741 753 766 779 793 807 822 837 852 868
5191 868 884 900 919 936 954 973 992 1011 1029 1048 1067 1088 1109 1131 1154 1179 1204 1231 1259 1289 1320 1353 1387 1424 1461 1500 1540 1583 1629 1677 1729 1782 1839 1899 1962
5188 1962 2029 2101 2176 2257 2343 2434 2532 2638 2753 2878 3015 3163 3324 3495 3678 3871 4074 4288 4516 4761 5027 5316 5630 5971 6339
5185 6339 6737 7168 7636 8146 8701 9297 9928 10582 11242 11896 12539 13174 13811 14462 15133 15809 16460 17044 17520 17867 18082 18176 18163 18053
5182 18053 17853 17568 17207 16782 16313 15822 15331 14855 14405 13985 13596 13234 12894 12567 12248 11929 11604 11271 10928 10574 10212 9847 9489
5180 9489 9145 8827 8542 8298 8100 7949 7845 7787 7773 7801 7869 7973 8113 8286 8492 8733 9012 9332 9699 10116 10583 11100 11668 12289
5177 12289 12965 13704 14511 15388 16335 17347 18407 19497 20597 21697 22795 23901 25026 26175 27331 28460 29514 30450 31232
5175 31232 31843 32285 32573 32727 32767 32706 32545 32276 31891 31385 30764 30040 29234 28361 27433 26457 25441 24395 23330 22264 21210 20180
5173 20180 19180 18217 17291 16404 15556 14750 13986 13267 12593 11961 11370 10813 10289 9797 9336 8910 8521 8174 7873 7621 7419 7267
5171 7267 7165 7111 7104 7141 7220 7338 7489 7669 7877 8111 8373 8667 8996 9364 9769 10202 10656 11124 11601 12088 12588 13103 13633 14171 14703
5168 14703 15209 15672 16083 16446 16773 17081 17375 17644 17856 17976 17974 17834 17560 17166 16669 16086 15433 14727 13987 13234 12488 11770 11094
5166 11094 10468 9895 9375 8903 8471 8071 7696 7336 6986 6639 6292 5943 5590 5235 4882 4534 4198 3882 3592 3330 3099 2897 2720
5163 2720 2567 2432 2312 2206 2109 2021 1938 1860 1784 1711 1641 1574 1510 1449 1392 1338 1288 1242 1199 1159 1121 1085 1050 1016 984 955 926 898 872 846 820 795
5160 795 771 747 724 702 681 660 641 622 605 590 575 562 550 540 531 522 514 507 501 496 492 489 486 484 482 480 478 477 474 472 470 467 465 463 460 458 456 454 451 448 446 443 440 437 435 432 429 426 423 420 417 414 412 409 406
5154 406 403 400 397 394 390 386 382 378 374 371 367 364 361 356 350 345 339 333 327 321 315 309 303 297 292 288 283 279 275 272 270 268 266 266 267 267 268 269 270 271 272 274 275 276 278 279 281 282 284 286 288 289 290 288 285 283 281 278 275 272 268 264 259 254 250 246 242 238 234
5147 234 232 229 227 225 224 222 219 217 214 212 210 208 205 203 200 199 198 197 196 196 195 194 194 194 193 192 192 192 191 190 190 189 189 189 190 190 189 188 187 187 187 188 188 188 188 188 189 189 189 190 190 191 192 193 195 196 197 199 200 201 202 204 205 206 208 210 211 212 211
5139 211 210 209 207 203 199 196 193 190 187 185 182 179 176 174 173 172 171 170 169 169 168 167 166 166 165 165 164 164 163 163 162 162 162 161 161 161 161 160 160 161 161 161 159 158 157 156 155 154 153 152 151 150 148 147 146 145 143 142 141 139 138 137 137 136 136 134 133 133 133
5132 133 133 132 131 131 131 131 131 130 130 130 130 130 130 131 131 131 130 131 131 132 133 134 135 135 136 136 137 137 138 139 140 142 143 145 146 147 148 149 150 151 151 152 153 153 154 155 156 156 155 155 154 153 152 152 152 151 150 148 147 146 145 144 143 142 141 139 138 137 135
5125 135 134 133 132 131 129 129 129 128 127 127 127 126 126 126 127 127 127 127 127 127 126 126 126 127 128 128 128 128 129 129 129 130 130 130 130 131 132 133 133 133 134 135 135 136 137 138 139 138 138 139 139 140 140 140 140 140 140 139 139 138 137 136 135 135 135 134 133 133 132
5117 132 132 131 131 130 130 129 128 127 127 127 127 126 125 125 124 124 123 123 123 122 122 122 123 122 122 122 122 122 121 121 120 120 120 120 121 121 121 121 122 122 122 122 121 121 122 122 122 122 123 123 123 123 123 123 124 124 124 123 124 124 125 125 125 125 125 125 125 125 126
5110 126 126 126 127 128 128 128 128 126 126 127 127 128 128 129 129 129 129 129 129 130 130 131 131 131 131 132 132 132 132 132 133 133 134 133 133 133 134 135 135 136 136 137 138 139 140 140 141 142 144 145 147 147 148 149 151 154 156 158 162 165 168 171 173 175 177 180 183 187 191
5103 191 195 199 203 206 209 211 214 216 218 220 222 223 224 225 226 226 226 226 225 224 222 219 216 215 213 211 209 208 207 206 204 202 201 199 198 196 195 194 193 192 192 191 189 188 186 184 182 181 181 181 182 183 184 186 190 194 199 203 207 213 219 225 230 235 242 250 257 265 273
5095 273 281 290 299 307 315 323 330 336 341 346 352 357 362 365 367 368 369 369 370 369 368 366 363 361 359 357 355 352 350 348 346 344 342 340 338 335 334 333 333 332 332 332 332 332 333 334 336 338 340 343 346 350 354 359 364 370 376 382 389 397 405 414 424 436 448 460
5088 460 474 489 504 520 538 557 577 599 621 644 667 691 715 740 766 794 822 851 883 917 952 990 1031 1077 1129 1188 1255 1331 1417 1514 1627 1757 1910
5085 1910 2091 2302 2545 2822 3134 3471 3810 4126 4407 4648 4861 5079 5334 5646 6002 6335 6566 6672 6672 6587 6433 6219 5951 5632
5082 5632 5270 4885 4503 4147 3824 3534 3274 3043 2834 2647 2481 2334 2204 2088 1976 1864 1748 1628 1502 1372 1239 1109 987
5080 987 876 781 704 643 595 556 524 496 473 452 433 416 400 387 374 361 349 338 329 320 312 304 297 289 283 276 271 266 261 256 251 247 244 241 237 234 232 229 226 224 221 219 216 215 214 212 211 210 208 207
5075 207 207 206 205 204 203 202 201 200 200 199 198 198 197 196 197 197 197 197 197 196 195 194 193 191 191 191 190 189 188 188 187 187 187 187 186 184 181 180 181 181 182 182 183 183 183 184 184 183 184 185 187 188 190 192 194 196 196 195 194 193 192 191 190 188 186 184 181 179 176
5067 176 173 172 170 167 166 164 162 161 160 158 155 154 153 152 151 150 149 147 146 145 145 145 144 143 142 141 140 140 139 138 138 138 138 137 137 136 136 136 136 135 135 134 133 133 133 133 134 135 135 136 136 136 137 138 139 140 140 141 142 143 143 144 145 146 147 148 148 149 149
5060 149 149 149 149 150 150 150 149 148 147 146 146 145 144 144 143 142 141 140 139 139 138 138 137 136 136 135 134 134 133 132 131 131 131 130 130 129 129 128 128 127 127 126 126 126 126 126 126 126 125 125 124 124 125 125 126 127 127 127 127 127 127 127 127 127 127 128 128 129 129
5053 129 130 132 132 133 133 133 134 134 134 134 134 135 135 135 136 137 137 137 137 138 138 138 138 139 139 139 138 137 137 137 137 138 137 137 138 138 137 137 137 137 138 138 138 139 139 139 139 140 140 140 140 140 140 140 139 139 139 140 140 141 142 142 142 142 142 143 144 144 144
5045 144 144 145 146 146 146 147 147 148 148 149 150 151 151 152 152 152 152 153 153 153 154 154 154 155 155 156 156 157 158 158 159 160 160 161 161 161 161 162 162 163 164 164 164 164 165 165 165 165 166 166 167 167 167 167 167 168 168 168 168 169 170 171 172 172 172 172 173 174 174
5038 174 175 177 178 179 179 180 181 182 183 185 186 187 189 189 190 191 193 195 195 196 198 200 201 202 203 204 205 206 207 207 208 209 210 211 212 212 212 213 213 213 214 215 215 216 218 219 220 222 223 224 224 226 227 229 230 232 233 234 235 236 238 239 241 242 244 245 247 248 248
5031 248 248 249 251 252 253 254 255 255 256 256 257 257 258 258 258 259 259 260 260 261 263 266 268 269 271 272 274 275 276 279 281 283 286 289 291 294 296 297 300 303 306 309 313 317 321 325 329 333 338 343 348 354 359 365 370 376 383 389 395 403 410 418 425 432 440 447 454 461 467
5024 467 474 483 492 501 509 518 528 538 549 559 569 578 590 601 613 625 638 652 667 683 700 718 737 756 776 798 820 844 868 894 922 951 983 1015 1049 1084 1121 1160
5020 1160 1201 1246 1293 1344 1398 1456 1519 1587 1660 1739 1826 1922 2030 2149 2284 2435 2605 2794 3005 3235 3483 3743 4015 4297 4592 4905 5245
5017 5245 5618 6024 6454 6887 7301 7682 8023 8324 8592 8839 9081 9329 9580 9816 10006 10130 10185 10174 10105 9988 9834 9654 9456 9244
5014 9244 9015 8764 8492 8205 7907 7603 7294 6985 6677 6376 6087 5815 5564 5334 5124 4933 4758 4597 4449 4319 4206 4113 4042 3991
5012 3991 3962 3953 3962 3990 4033 4096 4182 4294 4437 4614 4830 5087 5385 5724 6096 6497 6923 7373 7849 8360 8915 9519 10174 10868 11583 12295
5009 12295 12977 13605 14165 14660 15101 15511 15916 16329 16736 17096 17360 17504 17529 17443 17263 17007 16690 16321 15906 15447 14952 14431 13889
5006 13889 13327 12749 12158 11560 10960 10365 9784 9225 8694 8191 7717 7271 6851 6454 6077 5721 5387 5080 4801 4550 4330 4139 3972
5004 3972 3826 3697 3584 3488 3410 3352 3317 3308 3326 3371 3444 3543 3666 3809 3968 4139 4323 4522 4741 4988 5267 5574 5897 6215 6511 6775
5001 6775 7007 7207 7385 7550 7716 7888 8059 8206 8305 8347 8332 8264 8151 8002 7827 7634 7427 7208 6973 6719 6451 6172 5885 5593
4999 5593 5299 5003 4709 4422 4144 3881 3634 3403 3187 2984 2790 2606 2429 2262 2108 1966 1836 1720 1615 1518 1427 1342 1261 1183 1110
4996 1110 1043 981 926 877 833 794 759 728 700 674 651 630 610 592 574 557 539 524 509 495 482 471 459 448 438 428 417 407 396 385 374 364 355 345 336
4992 336 328 319 311 303 295 288 282 275 269 264 258 254 250 247 244 241 238 234 232 231 230 228 227 227 226 226 226 225 224 223 222 220 220 219 218 217 216 215 215 213 212 211 209 208 207 206 206 205 204 203 202 201 199 197 195 195 194 193 193 193 192 191 189 187 185 183 181 178 177
4985 177 175 173 171 169 166 164 162 160 158 156 155 153 152 150 148 147 146 145 144 142 142 141 141 140 140 140 140 140 140 140 139 139 138 138 138 138 137 137 137 136 137 138 138 138 138 137 137 138 138 139 139 139 140 140 141 142 143 143 143 144 146 148 150 152 153 155 157 159 161
4978 161 163 165 166 167 169 171 174 176 177 177 177 177 176 175 173 172 170 168 166 165 163 161 160 159 158 157 157 156 156 155 155 154 154 154 154 153 153 152 152 153 153 153 154 155 156 157 158 160 161 162 163 165 166 168 169 171 173 174 176 178 179 180 181 182 183 185 187 188 189
4970 189 189 189 190 190 191 191 191 192 192 192 192 192 191 191 190 190 189 189 188 187 186 185 184 183 182 181 180 179 178 177 176 175 174 173 172 171 170 169 168 166 166 166 166 165 164 164 165 165 165 165 165 165 165 165 165 166 166 166 167 167 168 169 170 171 171 171 172 173 174
4963 174 175 176 176 177 177 177 177 177 178 178 178 178 178 178 178 177 177 176 175 174 173 172 171 171 170 168 167 165 165 164 162 161 159 158 156 154 152 150 148 146 143 141 139 138 136 135 133 131 129 128 127 125 124 123 122 121 120 119 117 116 115 115 115 115 115 114 113 112 111
4956 111 111 111 111 111 111 111 110 110 110 109 109 109 109 109 110 110 110 111 111 111 110 111 112 112 111 111 111 110 110 109 110 110 110 110 110 110 109 109 109 108 109 108 107 107 106 105 105 105 104 104 104 104 104 103 103 104 104 104 103 102 102 102 103 103 102 101 101 102 102
4948 102 102 102 102 103 103 103 103 104 104 104 104 103 103 103 103 103 103 103 104 104 104 103 102 102 102 102 102 102 102 102 102 102 102 102 102 102 102 101 101 101 100 100 99 100 100 100 100 100 100 101 101 101 101 101 101 101 101 101 101 102 102 103 104 104 104 104 103 103 103
4941 103 103 103 103 103 103 103 103 103 103 104 104 104 104 104 104 104 104 104 103 103 104 104 104 103 103 103 103 103 103 103 104 104 104 104 104 104 104 105 105 105 105 106 105 106 107 108 109 110 112 113 114 115 117 119 120 122 124 125 127 129 131 134 136 138 140 142 144 146 147
4934 147 148 148 149 150 151 150 150 149 148 148 147 146 145 144 142 141 140 138 137 135 133 131 129 128 127 126 124 123 121 120 119 118 117 115 115 115 115 115 115 115 116 116 117 117 118 118 119 120 121 122 125 127 129 131 133 135 138 141 144 147 150 154 159 163 167 171 173 175 178
4926 178 180 182 184 187 189 190 190 189 188 187 185 184 182 180 178 175 171 168 165 161 158 155 152 149 146 143 139 136 134 131 130 128 126 124 122 121 119 117 117 116 116 116 114 113 112 112 111 111 111 112 112 113 113 113 114 114 116 117 118 120 122 123 125 126 126 128 130 130 131
4919 131 133 134 135 136 136 138 139 138 138 137 136 135 134 134 133 131 129 128 126 125 123 122 120 118 116 115 114 114 113 111 110 109 109 108 107 106 105 105 104 103 102 102 102 101 101 100 100 99 99 99 98 98 97 97 96 97 97 96 95 95 96 96 96 97 97 96 96 96 96
4912 96 96 96 95 95 95 95 94 94 95 95 94 94 93 93 93 93 93 93 93 93 93 93 93 93 93 92 91 91 91 91 92 92 92 91 91 91 90 90 91 91 90 91 92 93 93 92 92 92 92 91 91 92 92 93 93 93 92 92 92 91 91 91 92 93 93 92 92 92 92 92
4904 92 92 92 92 92 92 92 92 92 92 92 92 91 91 91 90 90 90 89 89 89 89 89 88 88 89 89 89 89 89 89 88 88 88 87 87 87 87 86 87 87 87 87 87 87 87 87 87 87 87 86 87 87 87 88 87 87 88 88 88 89 89 89 89 90 90 90 91 91 91 92
4897 92 92 92 92 92 92 92 92 92 92 92 92 93 92 92 92 91 91 91 91 91 91 91 91 91 91 91 91 90 90 90 89 89 89 89 88 88 89 89 89 90 89 89 88 88 87 87 87 87 87 87 87 87 87 87 87 87 88 88 88 88 89 89 88 89 89 89 90 90 91 91
4890 91 92 92 92 91 91 91 92 92 92 92 93 93 93 94 93 93 93 93 93 93 93 93 93 94 94 94 93 93 93 93 93 92 92 92 92 92 91 91 90 89 89 89 89 89 89 89 89 88 88 88 88 88 88 89 89 89 89 88 88 88 88 87 87 88 88 88 88 88 88 88
4882 88 88 88 88 88 87 87 87 88 88 89 88 88 88 89 89 89 89 89 89 89 89 88 88 87 88 88 88 89 89 88 88 88 88 88 88 89 88 88 88 88 88 88 88 87 87 86 86 87 87 88 88 88 88 88 87 87 87 87 87 87 88 88 87 88 88 88 88 87 87 87
4875 87 87 87 88 88 88 88 88 88 88 88 88 89 89 87 87 88 88 88 88 88 88 88 88 88 88 89 89 89 89 89 89 89 89 90 90 90 90 90 90 90 89 89 89 89 89 89 89 90 90 90 91 91 91 90 90 90 90 91 91 91 92 91 91 90 90 91 91 91 90 90
4867 90 90 90 90 90 91 91 91 91 91 91 91 91 92 91 92 92 91 91 91 92 92 91 91 91 91 91 91 91 91 92 92 92 92 92 93 93 93 93 93 92 92 92 92 92 92 92 92 92 92 92 92 92 92 92 92 92 92 93 93 93 92 92 92 92 92 92 92 93 93 93
4860 93 92 92 92 93 94 94 94 93 92 92 91 91 91 90 90 90 90 90 90 91 91 91 91 91 91 92 91 91 91 91 91 91 91 91 90 90 90 90 90 90 89 89 89 89 89 89 89 89 89 89 89 89 89 88 89 89 89 89 89 89 89 89 89 90 90 90 90 90 90 90
4853 90 90 90 89 89 89 88 88 87 87 88 88 88 88 88 88 88 89 89 89 89 88 87 86 87 87 87 87 87 86 86 86 86 87 87 87 87 87 87 87 86 87 87 87 87 87 86 86 86 86 86 86 86 86 86 87 87 87 87 87 87 86 86 86 87 87 87 87 87 87 87
4845 87 86 86 86 86 87 87 87 87 88 88 87 87 87 87 87 87 87 87 87 87 87 87 87 87 88 88 88 87 87 87 87 87 86 87 87 86 86 86 86 86 86 86 86 86 86 87 86 86 85 85 86 87 87 87 87 87 87 87 87 87 86 87 87 88 88 89 89 89 89 89
4838 89 88 88 88 89 89 89 89 89 90 90 90 89 89 90 89 89 89 89 89 89 88 89 89 89 89 89 90 89 89 89 89 89 89 88 88 89 89 90 90 91 91 90 90 90 90 90 91 91 91 91 91 92 92 92 92 92 92 92 92 92 92 91 91 91 92 92 92 92 92 92
4830 92 91 90 90 90 90 90 90 91 92 92 91 92 92 92 91 91 91 90 90 91 91 91 91 91 91 92 92 92 92 92 91 91 91 91 90 90 90 90 90 91 90 89 89 89 89 90 90 90 90 90 91 92 93 93 93 93 92 92 91 91 91 91 91 91 91 91 91 91 91 91
4823 91 90 89 89 89 89 88 88 88 88 88 88 88 88 88 88 88 87 87 87 86 86 86 86 86 86 86 86 86 86 87 87 87 87 87 87 88 88 88 88 87 87 87 88 88 88 88 89 88 88 88 88 88 88 88 88 88 88 88 88 88 88 88 87 87 87 87 87 87 87 87
4815 87 87 87 86 86 86 86 86 85 85 84 84 85 85 85 85 84 84 84 84 83 83 83 83 84 83 83 84 84 84 85 84 84 85 85 85 85 85 85 86 86 86 86 86 86 86 86 86 86 86 87 87 88 87 87 87 87 88 89 90 90 89 88 87 87 86 86 87 88 88 88
4808 88 88 88 87 87 87 86 86 87 88 87 87 87 87 86 86 86 86 86 86 86 86 86 86 86 86 86 86 86 86 85 85 85 85 86 87 87 86 86 86 86 86 86 86 86 87 87 86 86 86 86 85 85 86 87 87 87 87 87 87 87 87 88 88 88 88 87 87 88 88 88
4801 88 88 88 88 88 89 89 89 88 87 87 88 88 88 88 88 88 88 88 88 89 89 89 88 87 88 88 88 88 88 87 87 87 86 86 86 87 87 88 88 88 87 87 86 86 86 86 86 86 86 86 87 87 87 88 88 86 86 85 85 85 85 85 85 85 86 86 86 86 86 86
4793 86 87 87 86 86 86 86 86 86 86 86 87 87 87 88 87 87 87 87 87 87 87 87 87 87 88 87 87 87 86 85 85 85 86 86 86 86 85 85 86 86 86 86 86 87 87 87 87 86 86 86 86 86 86 86 86 87 86 86 86 85 85 85 86 85 85 86 86 86 86 86
4786 86 86 86 86 87 86 86 86 86 85 85 85 84 85 85 86 86 86 86 86 86 87 86 86 86 86 86 86 86 85 85 85 86 86 86 86 87 88 88 88 87 86 86 86 86 87 87 86 85 86 87 87 87 87 87 87 87 87 87 87 87 86 86 86 86 86 86 85 85 86 85
4778 85 85 86 86 86 86 86 86 87 87 87 87 87 87 86 85 86 87 87 87 87 87 86 86 85 86 86 87 87 87 87 87 87 87 87 87 87 87 86 86 86 86 87 86 87 87 87 87 88 89 89 89 88 87 87 87 86 86 86 86 86 85 85 85 85 86 87 87 87 87 87
4771 87 87 87 86 86 86 86 86 86 86 86 87 88 88 88 88 87 87 87 87 87 86 86 87 87 87 86 86 87 87 87 87 87 87 87 87 87 87 87 88 88 88 88 89 89 88 88 88 88 88 88 88 88 88 88 88 88 88 88 88 88 88 88 88 88 88 88 88 88 88 88
4764 88 87 87 86 87 87 87 87 88 88 88 88 88 88 88 88 88 88 87 87 87 88 89 90 90 89 88 88 88 88 88 88 88 88 89 89 89 89 88 89 89 89 88 88 89 89 89 89 89 89 89 89 88 88 89 89 89 88 88 89 90 90 90 90 90 91 91 90 90 90 90
4756 90 90 90 89 89 89 89 89 89 90 90 89 88 88 88 88 89 89 90 90 90 90 90 90 91 91 92 91 91 91 91 91 90 91 92 92 92 92 92 92 91 91 90 91 91 91 90 89 90 90 90 90 90 90 91 92 92 91 92 92 92 91 91 91 91 91 91 91 91 91 91
4749 91 91 90 90 90 90 90 90 90 90 90 90 90 89 89 89 90 90 90 91 91 91 91 91 91 91 91 91 90 90 90 90 90 90 91 91 91 91 91 90 90 90 91 90 90 90 91 90 90 90 91 91 91 90 90 90 90 90 91 90 90 90 90 90 90 90 90 90 90 90 89
4741 89 89 89 89 89 89 89 89 89 89 89 89 89 89 89 89 89 89 89 89 89 89 89 89 89 89 88 88 88 88 88 89 89 89 89 90 90 90 89 88 88 89 90 91 91 91 92 92 92 92 91 91 90 90 90 90 90 89 89 88 87 87 87 87 87 87 87 87 86 86 86
4734 86 86 85 85 85 86 86 86 85 84 84 84 84 84 84 85 86 86 85 85 85 85 84 84 85 85 85 84 84 84 84 84 84 85 85 85 85 85 85 86 87 87 87 87 86 87 87 87 87 88 88 88 89 89 89 88 88 88 88 88 88 87 86 87 87 87 87 86 86 86 86
4726 86 86 86 86 86 86 86 86 86 86 86 86 85 85 85 85 85 84 83 82 82 82 82 82 82 82 82 82 83 83 83 83 83 84 84 85 86 86 86 85 85 85 85 86 86 86 85 86 86 86 86 86 87 88 88 88 89 89 90 90 90 90 90 90 90 89 89 89 89 89 88
4719 88 88 88 88 88 89 89 89 88 88 89 88 88 88 88 88 88 88 88 88 88 88 88 87 87 87 86 87 87 87 88 88 87 88 88 87 87 87 87 87 87 87 87 88 88 88 88 88 87 86 86 88 89 89 88 88 88 88 88 88 88 87 87 88 88 87 87 88 89 90 90
4712 90 90 89 89 88 89 89 89 89 89 89 89 89 89 89 89 89 89 89 89 89 89 89 89 88 88 88 88 88 87 88 88 88 87 87 88 88 88 88 88 88 88 89 89 88 87 87 87 87 87 87 88 88 88 88 88 88 88 88 88 89 89 89 89 89 89 89 88 88 87 87
4704 87 87 87 86 86 86 87 86 86 86 86 87 87 87 88 88 88 87 87 87 87 87 87 87 88 88 88 87 87 87 87 87 88 88 88 87 87 86 85 86 86 86 86 86 86 87 87 87 87 87 87 87 88 88 88 88 88 88 88 88 88 88 89 88 88 88 88 88 87 87 87
4697 87 87 87 87 87 87 87 87 87 87 87 87 87 86 86 86 87 87 87 87 87 87 88 88 88 88 89 88 88 88 88 88 87 87 87 87 87 87 87 88 88 88 89 88 88 87 87 87 87 87 86 86 86 86 86 87 88 88 87 87 87 87 87 87 87 87 87 87 87 86 86
4689 86 86 87 87 87 87 86 87 87 87 87 87 86 87 87 87 87 87 87 87 87 87 87 87 87 87 87 87 87 87 87 88 88 87 87 87 86 86 87 87 87 87 87 87 87 87 87 87 88 88 88 88 88 88 88 88 88 88 87 86 87 87 88 88 88 88 88 88 87 87 87
4682 87 87 87 87 87 87 87 87 87 88 88 89 88 88 88 88 88 88 87 87 87 87 88 88 88 88 88 88 88 89 89 89 88 88 88 87 87 87 87 86 86 87 87 88 88 88 87 87 88 89 89 89 89 89 89 89 88 88 88 88 89 89 89 89 89 89 89 88 88 88 89
4674 89 88 88 88 88 89 88 88 88 88 88 88 89 89 89 89 89 89 89 88 88 88 88 88 89 88 88 88 87 87 87 87 87 87 88 88 88 88 88 87 87 87 87 87 88 87 87 87 87 86 86 87 87 88 88 87 86 87 87 87 87 86 86 86 87 87 86 86 86 86 86
4667 86 86 87 87 86 86 86 86 87 87 87 86 86 85 86 86 86 85 86 86 86 86 86 86 86 86 86 86 86 85 85 85 85 86 87 87 87 87 86 86 85 85 85 85 85 86 85 85 86 86 86 86 86 85 85 85 85 85 85 85 85 85 86 86 86 86 85 85 84 85 85
4660 85 85 85 85 86 86 87 86 86 86 86 86 86 85 85 86 86 86 86 85 85 85 85 86 87 87 87 87 87 86 86 86 87 86 86 86 85 85 85 85 85 85 85 85 86 85 85 85 85 84 84 84 85 85 86 85 85 85 85 85 85 84 84 84 84 84 84 83 83 83 83
4652 83 84 85 85 85 85 85 85 85 85 86 86 86 86 86 85 85 85 85 85 85 86 87 87 87 87 87 87 87 86 85 85 84 85 85 85 84 85 85 85 85 84 84 84 83 83 83 84 83 83 84 84 84 84 84 83 83 83 83 83 84 83 82 82 82 82 82 82 83 83 83
4645 83 83 82 82 82 82 82 82 83 83 83 83 84 84 84 83 83 83 83 83 82 83 84 85 85 85 85 85 86 86 86 86 86 86 86 85 85 85 86 86 86 86 85 85 85 84 85 85 85 85 85 85 85 85 85 85 85 85 84 85 85 85 85 85 84 84 84 84 84 84 84
4637 84 84 84 84 84 84 84 84 84 85 85 84 84 84 84 84 84 84 84 84 85 85 85 85 86 86 86 86 86 87 87 86 86 86 87 87 86 85 86 86 86 86 86 86 85 86 86 86 86 87 86 86 86 86 86 87 87 87 87 87 87 86 86 87 87 87 87 87 87 87 87
4630 87 87 86 86 86 86 86 86 86 86 86 87 87 87 87 87 88 88 88 87 86 87 87 87 87 88 88 89 89 89 88 88 87 87 87 87 87 88 88 88 88 88 88 88 88 88 88 88 87 88 89 89 90 90 89 90 89 89 89 89 89 89 89 89 89 89 89 88 88 88 88
4623 88 88 88 87 86 87 88 88 88 89 89 89 89 89 88 89 89 89 89 89 89 89 89 89 89 89 89 89 89 88 88 89 89 89 89 89 89 90 90 90 90 91 91 91 91 90 90 90 90 90 90 91 91 91 91 92 92 92 91 91 91 91 91 91 90 90 90 90 89 89 88
4615 88 89 90 90 90 90 90 90 90 90 91 91 90 90 90 90 90 90 89 89 89 89 90 90 90 90 90 90 90 91 90 90 90 91 91 90 90 89 88 88 88 89 89 89 89 90 90 89 89 89 89 88 89 89 89 88 88 88 88 88 88 88 88 88 88 88 88 87 87 87 86
4608 86 87 88 88 88 88 87 87 87 87 86 86 86 86 86 85 85 84 84 84 84 84 84 85 85 85 86 85 85 84 83 84 84 84 84 84 84 84 84 84 83 83 83 82 82 82 83 84 84 84 83 83 83 84 84 84 83 82 82 81 81 80 81 81 81 81 81 82 81 81 81
4600 81 81 81 82 82 82 82 82 82 82 81 81 81 81 82 82 82 82 81 81 81 81 81 81 81 80 79 79 79 80 80 80 80 80 80 80 80 81 81 81 81 81 81 81 81 81 82 82 82 82 83 83 83 83 83 82 81 81 82 82 82 82 82 82 81 82 82 82 82 82 82
4593 82 82 83 83 82 82 82 82 83 83 83 83 83 83 83 83 83 83 84 84 84 84 84 84 84 84 85 85 84 84 84 84 84 84 84 84 85 85 85 85 85 85 84 85 86 87 87 87 87 86 86 86 86 86 86 87 87 87 87 86 86 87 87 87 87 87 87 87 88 88 88
4585 88 88 88 87 86 86 87 88 88 88 87 88 89 89 89 89 89 89 89 89 89 89 88 89 89 89 90 89 89 89 88 89 89 89 89 89 90 90 89 90 89 89 89 89 90 90 90 89 88 88 88 88 88 88 88 88 89 89 89 88 88 88 88 88 88 88 88 88 88 89 89
4578 89 89 89 89 89 89 89 89 89 89 88 88 88 89 90 90 90 90 89 89 88 88 88 88 88 88 88 88 88 87 88 88 88 88 88 88 89 89 88 88 87 88 88 88 88 88 87 87 87 88 88 88 88 87 87 87 87 87 87 87 87 86 86 86 86 87 87 87 88 88 89
4571 89 89 89 88 88 89 89 88 88 88 88 88 88 87 87 88 87 88 88 88 88 87 87 86 86 86 87 87 87 87 87 87 86 86 86 86 86 86 86 86 87 87 87 87 86 86 86 86 86 86 86 86 86 86 86 86 86 86 86 85 85 85 85 85 85 85 84 85 85 86 86
4563 86 86 86 86 86 86 86 86 86 86 86 86 86 86 86 87 87 87 87 87 87 87 87 87 87 88 87 87 87 87 87 87 87 87 87 87 87 86 86 86 85 85 84 85 85 85 86 86 85 85 85 85 85 86 86 86 86 86 86 86 86 86 86 86 86 86 86 87 87 87 87
4556 87 86 86 86 86 85 85 86 86 85 85 85 85 85 86 86 86 86 85 86 86 86 86 86 86 86 85 86 86 86 86 86 85 85 86 86 86 86 86 86 86 86 86 85 85 85 85 85 85 85 85 85 86 86 86 86 86 85 85 86 86 86 86 85 86 86 86 86 85 86 86
4548 86 86 86 86 85 85 85 86 86 86 86 85 85 85 85 85 85 86 86 86 85 84 84 85 86 86 86 86 85 84 84 84 84 85 85 85 85 86 86 86 86 86 86 86 87 86 85 84 84 84 85 85 85 86 86 85 85 85 85 85 86 86 86 86 86 86 87 87 87 86 86
4541 86 87 87 87 87 86 86 86 86 86 86 87 87 87 86 86 85 85 85 86 86 87 87 87 87 87 87 87 86 86 86 86 85 85 85 85 84 84 85 85 85 85 85 86 85 85 85 85 84 84 85 85 85 85 85 84 84 84 84 84 85 86 86 86 86 86 86 86 86 86 86
4534 86 87 87 86 86 86 86 85 85 86 86 86 87 87 87 87 87 87 87 87 86 86 86 86 86 86 87 87 88 88 88 88 88 88 88 88 88 88 87 88 88 88 88 88 88 87 87 88 88 88 88 88 87 87 87 87 87 87 88 88 88 88 88 88 89 89 89 89 89 89 89
4526 89 90 90 89 89 89 88 88 88 89 90 90 90 90 91 91 90 90 91 91 91 91 91 90 90 90 90 89 90 90 89 89 89 90 90 91 91 91 91 92 92 92 91 91 91 91 90 90 90 91 91 91 91 91 91 90 90 90 91 91 91 91 91 91 90 90 90 89 89 89 89
4519 89 90 90 91 92 93 93 92 92 92 92 92 91 91 90 90 89 89 90 90 90 90 91 90 90 90 90 90 90 90 91 91 91 91 91 91 91 91 91 91 90 91 91 91 91 90 90 90 90 90 90 90 90 90 90 90 90 90 90 90 89 89 89 89 89 89 89 89 89 89 89
4511 89 89 89 89 89 89 89 89 89 89 88 88 89 89 89 88 88 88 88 88 88 88 88 88 88 88 88 88 88 87 87 87 87 87 87 87 87 87 87 87 88 88 87 87 87 87 88 88 88 88 88 88 88 87 87 87 87 87 87 87 87 87 87 88 88 87 87 86 87 87 87
4504 87 87 87 87 87 86 87 87 87 87 87 87 87 86 86 86 87 87 87 88 88 88 87 87 87 87 87 87 87 87 87 87 86 86 86 87 88 88 87 87 87 86 87 87 87 87 87 87 87 87 86 86 87 87 87 87 87 88 88 88 88 88 88 87 87 87 88 87 87 87 87
4496 87 86 87 87 87 86 86 86 86 86 86 86 87 87 87 86 86 85 85 85 86 86 86 87 87 87 87 87 86 86 86 86 86 86 86 85 85 85 86 86 86 86 86 86 86 86 86 86 86 86 85 85 85 85 85 85 86 86 86 86 86 85 85 85 85 85 85 85 85 86 86
4489 86 86 86 86 86 86 86 85 85 84 84 84 84 84 84 84 84 84 85 86 85 85 84 83 83 84 84 84 84 84 85 85 85 85 85 85 84 84 84 84 84 84 83 83 83 83 83 83 83 83 83 84 84 83 83 84 84 83 83 83 83 83 83 84 85 86 86 85 85 84 83
4482 83 83 83 83 83 83 83 84 84 84 83 84 84 84 84 84 84 83 83 84 84 84 84 84 84 84 84 84 84 84 84 85 86 86 85 85 85 84 84 83 83 83 83 83 83 84 84 84 85 85 86 85 85 85 85 85 84 84 84 84 85 84 84 84 84 84 84 84 84 84 83
4474 83 83 83 83 84 84 84 84 84 84 84 84 83 83 82 82 83 83 84 85 85 85 85 85 84 84 84 84 84 85 85 85 85 85 85 85 85 85 85 85 85 85 85 85 84 84 84 84 84 84 83 84 84 84 84 85 85 85 84 85 85 85 85 85 85 85 86 85 85 85 85
4467 85 84 84 84 84 85 85 85 85 85 84 85 85 85 85 85 86 86 86 86 85 85 85 86 85 85 85 84 85 85 85 85 85 84 84 84 84 84 84 84 84 84 85 85 85 85 84 84 84 84 83 83 83 83 83 83 83 83 83 83 82 83 83 83 83 84 85 85 85 85 85
4459 85 86 85 85 85 85 85 85 85 85 86 86 86 85 85 85 85 86 86 85 85 85 85 85 85 84 84 84 84 84 84 85 85 85 85 85 85 85 85 85 85 85 84 85 85 85 84 84 84 85 85 85 85 86 86 86 87 87 87 86 86 86 86 86 87 87 87 87 87 88 89
4452 89 89 89 88 88 88 87 87 87 88 88 88 88 88 88 88 89 89 88 88 87 88 88 88 89 89 89 89 88 88 87 87 86 86 87 87 87 87 87 87 87 87 87 87 88 88 87 87 87 88 88 88 88 88 88 88 88 88 88 88 88 88 88 88 87 87 87 86 86 86 86
4445 86 87 88 88 87 87 87 87 86 87 86 86 86 85 86 86 86 87 87 88 87 87 87 88 88 88 87 87 87 87 87 87 87 87 86 86 86 87 87 86 85 86 86 87 87 87 88 88 87 87 86 86 86 85 84 85 85 86 86 86 85 84 84 84 84 84 84 83 83 83 83
4437 83 84 83 83 83 83 83 83 83 83 83 84 84 84 84 84 84 83 83 82 82 82 83 83 84 84 84 84 85 85 85 85 85 85 85 84 84 84 84 84 84 83 83 83 82 82 82 82 82 82 82 82 82 81 81 81 82 82 82 82 82 82 82 82 82 82 82 82 82 82 82
4430 82 82 82 83 83 83 83 83 82 82 82 83 84 84 84 83 83 83 82 82 81 81 82 83 84 85 85 84 84 85 85 85 84 85 85 85 84 84 85 86 85 85 85 84 84 84 85 85 85 85 85 85 85 85 85 84 84 85 85 85 84 84 84 85 86 86 86 86 86 85 85
4422 85 85 85 85 85 86 86 86 86 86 86 85 85 84 84 84 85 85 85 84 84 85 85 86 86 86 86 85 85 85 87 87 87 86 86 86 86 87 87 87 87 87 87 87 86 85 84 85 85 85 85 85 85 85 85 85 85 85 85 85 85 85 85 85 85 85 85 85 85 86 86
4415 86 86 86 85 85 85 86 86 87 87 87 86 86 87 87 87 87 86 86 86 86 86 85 86 86 86 87 86 86 86 86 86 86 85 85 85 85 84 84 84 84 84 84 84 84 84 85 85 85 85 85 85 85 85 85 85 85 85 85 85 85 85 85 85 85 85 85 85 86 86 85
4407 85 85 85 85 86 86 86 86 87 87 86 86 86 86 86 86 86 86 85 85 85 85 85 85 85 85 85 85 85 85 85 85 85 86 86 85 85 85 86 86 86 86 86 86 86 85 85 85 85 85 85 85 85 85 85 86 86 85 85 85 85 85 85 85 84 84 84 85 85 85 84
4400 84 84 84 84 84 84 84 84 85 84 84 85 85 85 85 84 84 84 84 85 84 84 84 85 86 85 85 85 85 86 86 86 87 86 86 86 85 85 86 86 86 85 85 85 86 85 85 85 84 85 85 85 85 85 85 85 84 85 85 85 85 85 85 85 85 85 85 85 85 85 85
4393 85 84 83 83 83 84 84 85 85 85 84 84 84 83 84 84 85 85 85 86 86 85 85 84 84 84 84 84 85 85 85 85 85 85 85 85 85 86 86 86 85 85 85 85 85 85 85 85 85 85 85 85 85 85 85 84 84 84 84 84 85 85 85 85 85 84 84 84 84 85 85
4385 85 85 85 85 85 85 84 85 85 85 84 84 83 83 84 84 84 84 84 83 83 83 83 83 83 84 84 84 84 85 85 84 83 84 85 85 84 83 83 83 84 84 85 85 85 85 85 84 83 84 84 85 85 85 85 84 84 84 85 85 84 83 83 84 84 84 85 84 84 84 84
4378 84 84 83 84 84 83 83 82 83 83 84 84 84 84 84 84 84 84 84 84 84 84 84 84 84 84 84 84 84 83 83 84 84 85 85 85 85 85 85 85 85 85 86 86 85 85 85 85 85 85 85 84 84 84 84 84 84 84 84 85 85 85 85 85 85 84 84 84 84 84 84
4370 84 85 84 84 84 84 84 84 85 85 85 85 84 84 84 84 83 83 83 83 84 84 84 85 85 86 85 84 83 83 83 84 85 85 85 85 85 85 84 84 84 84 83 84 84 84 84 84 85 85 85 85 85 85 85 85 85 84 84 84 84 85 85 85 86 85 85 85 85 85 84
4363 84 85 85 84 83 82 83 84 84 83 83 83 83 83 83 83 83 83 83 83 83 84 85 85 84 84 84 84 84 84 84 83 83 84 84 85 85 86 85 85 84 84 84 84 84 84 85 85 85 85 86 85 85 84 84 84 84 84 84 84 84 84 84 84 84 84 83 84 84 84 85
4356 85 84 84 84 83 83 83 84 84 84 84 84 84 84 84 84 84 84 84 84 84 84 84 83 83 84 84 83 83 84 84 84 83 83 82 82 83 83 83 82 82 82 83 83 83 83 84 84 84 84 84 84 84 84 84 84 84 84 84 84 84 84 84 84 84 84 84 84 84 84 84
4348 84 84 84 84 85 86 85 85 84 84 84 84 83 84 84 85 85 84 84 84 84 84 84 84 83 84 84 84 84 84 84 84 84 84 84 83 83 84 84 84 84 84 84 84 84 85 85 85 86 85 84 84 85 84 84 84 84 84 84 84 84 83 83 83 83 83 83 83 84 84 85
4341 85 85 85 84 84 83 84 85 85 86 86 85 85 85 85 85 84 84 84 83 83 83 83 83 83 84 84 84 84 83 83 84 84 84 85 85 85 85 85 85 85 85 86 85 85 84 84 84 84 84 84 84 84 84 84 84 84 84 84 83 83 84 84 84 84 83 83 84 84 84 84
4333 84 85 85 85 85 85 84 84 83 83 84 84 84 84 85 85 86 86 86 86 86 86 85 85 84 84 84 84 84 84 84 84 84 83 83 83 82 83 83 83 83 84 84 84 84 83 83 84 84 85 85 85 85 85 85 85 85 85 85 85 85 85 85 84 84 84 85 85 85 84 83
4326 83 84 85 85 85 84 84 85 85 85 85 86 86 85 84 84 84 84 84 84 84 84 84 84 84 84 84 84 83 83 83 83 84 84 84 84 84 84 84 84 83 83 84 84 84 84 84 84 84 84 84 83 83 82 82 82 82 82 83 83 84 85 85 85 85 84 84 84 84 84 83
4318 83 83 84 83 84 84 83 83 83 83 84 84 84 84 83 83 83 83 83 84 84 84 84 84 84 84 84 84 84 84 84 84 83 84 84 84 84 84 84 83 83 83 83 82 82 82 83 83 83 84 84 83 84 84 84 85 85 85 85 84 84 84 84 84 83 83 84 84 84 84 85
4311 85 86 86 86 86 85 84 84 84 84 84 84 85 85 85 85 85 85 85 85 85 85 85 85 85 85 85 85 85 85 85 84 85 85 85 84 84 84 85 85 86 86 86 85 85 85 85 85 86 85 85 84 85 85 85 84 85 85 85 85 85 85 85 85 85 85 84 85 85 86 86
4304 86 86 86 86 86 86 86 87 87 86 86 85 85 85 85 85 86 86 86 86 86 86 85 86 86 86 87 87 87 87 86 87 86 86 87 88 88 88 87 87 87 87 87 87 86 86 86 86 86 86 86 86 86 86 86 86 86 86 86 86 86 86 86 86 86 86 86 86 86 86 86
4296 86 85 85 85 85 86 86 85 85 85 85 85 85 84 84 84 85 85 85 85 85 85 85 85 85 86 86 85 85 85 85 85 85 85 86 86 86 85 85 85 85 85 85 86 86 86 86 85 85 85 85 85 86 86 85 84 84 85 85 85 85 85 85 85 85 85 85 85 84 85 85
4289 85 84 85 85 85 85 84 84 84 85 85 85 85 85 85 85 84 84 84 84 83 84 84 84 84 84 84 84 85 85 85 85 85 86 86 85 85 85 85 85 84 85 86 86 86 87 87 86 86 85 84 85 85 85 86 86 86 86 86 86 86 86 85 85 84 84 84 84 85 85 85
4281 85 85 86 86 85 85 85 85 85 85 85 85 85 85 85 84 84 84 84 84 84 85 85 85 85 85 85 85 85 85 84 84 84 85 85 85 85 86 86 86 85 85 85 85 85 85 86 85 85 85 85 85 85 85 85 85 85 85 85 86 86 86 86 86 85 84 85 85 85 84 84
4274 84 84 84 84 85 85 85 85 85 85 85 85 86 85 85 85 85 85 85 85 85 85 85 86 86 86 85 86 86 86 86 86 85 85 84 84 84 85 85 85 85 84 84 84 84 85 85 85 85 85 84 85 85 85 84 85 85 86 86 86 86 86 85 85 85 84 85 85 85 85 85
4267 85 85 85 85 85 85 85 85 85 85 85 84 84 84 85 85 85 85 85 85 85 85 85 85 85 85 85 85 85 85 84 85 85 85 85 84 85 85 84 84 85 85 85 85 85 85 86 86 85 85 85 85 85 86 86 85 85 85 85 85 85 84 84 84 84 84 84 85 85 85 85
4259 85 85 86 86 86 86 86 86 86 86 86 86 86 86 85 85 85 85 85 86 86 85 85 85 85 85 84 85 85 84 84 84 85 85 85 85 85 85 85 86 86 85 85 84 84 84 84 84 84 85 85 85 85 85 85 85 84 85 85 85 84 84 84 84 85 85 85 85 85 85 84
4252 84 84 84 84 83 84 85 84 84 84 84 85 85 85 85 85 85 85 85 85 85 85 84 84 84 84 84 84 85 85 85 85 85 85 85 85 85 85 85 85 84 84 84 84 84 84 84 84 84 84 84 84 83 84 84 84 83 84 85 85 85 85 85 84 84 84 85 85 86 86 85
4244 85 85 84 85 85 85 85 85 85 85 85 85 85 85 85 84 84 84 85 85 86 86 86 85 84 83 84 84 85 85 85 85 85 85 85 85 85 85 86 86 86 86 86 87 87 86 86 86 85 84 84 84 84 84 85 85 85 85 85 85 85 85 85 85 85 85 85 86 86 86 85
4237 85 85 85 86 86 86 86 86 86 86 86 86 86 86 86 86 86 86 86 86 86 86 86 86 86 86 86 86 85 85 85 85 85 86 85 86 86 86 86 86 86 85 85 85 85 86 86 87 87 87 87 86 86 86 86 86 87 87 87 86 86 86 87 86 86 85 85 85 86 85 85
4229 85 86 86 86 86 85 86 86 86 86 86 85 85 85 85 85 85 85 85 85 86 86 86 85 85 85 85 85 85 84 84 85 85 85 86 86 85 85 84 84 84 84 84 84 83 83 83 83 83 84 83 83 84 84 84 84 84 84 84 84 84 84 84 84 84 84 84 83 83 83 83
4222 83 83 83 83 83 83 83 83 84 83 83 83 82 82 82 82 82 83 83 83 83 83 82 82 82 82 82 83 84 83 83 82 82 82 82 82 82 82 82 82 82 82 82 82 81 81 81 82 82 82 82 81 81 81 81 82 82 83 83 83 84 84 84 84 83 82 82 82 82 81 81
4215 81 81 81 80 80 80 80 80 81 81 82 82 82 82 81 81 81 82 82 81 81 80 80 80 80 80 80 81 81 81 82 82 83 83 83 83 83 83 83 83 82 82 82 81 81 81 81 82 82 82 82 83 83 83 82 82 82 82 82 83 83 83 83 83 82 83 83 83 83 83 82
4207 82 82 82 82 82 83 82 82 82 82 82 82 83 83 83 83 83 83 83 83 83 83 83 83 83 83 82 82 82 82 82 82 82 82 82 83 83 83 83 84 84 84 83 83 83 82 82 82 82 82 82 82 82 82 82 82 82 83 84 84 84 84 83 84 84 84 84 84 84 84 83
4200 83 83 84 84 84 84 84 83 83 83 83 83 83 83 83 83 83 83 83 83 83 83 84 84 84 84 84 84 84 84 84 84 84 84 83 83 83 84 84 84 85 84 84 83 83 83 83 83 83 83 84 84 84 83 83 83 83 82 82 82 82 82 82 83 83 83 84 84 84 83 82
4192 82 82 83 83 83 83 83 83 82 82 82 83 83 84 84 83 83 82 82 82 82 82 82 82 82 82 82 82 82 81 81 82 82 84 84 84 83 83 83 83 83 83 83 83 83 83 83 83 83 83 83 83 83 83 83 83 83 82 82 83 83 83 84 84 83 83 83 83 82 81 81
4185 81 81 80 80 80 81 81 82 82 82 83 82 82 82 82 82 82 81 81 81 82 82 83 83 82 82 82 82 82 82 82 82 82 81 81 81 81 81 81 82 82 81 81 82 82 82 81 81 81 81 81 81 81 82 82 82 82 82 82 82 82 82 82 82 82 82 82 82 82 82 82
4178 82 82 82 82 82 81 82 82 83 82 81 81 81 81 81 81 82 82 82 82 82 83 83 83 83 83 83 83 83 83 83 83 83 83 83 83 83 83 83 82 82 82 82 82 82 82 83 84 84 83 83 83 82 83 83 83 83 83 83 83 83 84 84 84 84 83 82 82 82 82 82
4170 82 83 83 83 83 84 84 84 83 84 84 84 84 84 84 84 84 84 84 84 84 85 84 84 84 85 85 85 84 84 83 83 83 84 84 84 84 84 85 84 84 83 84 84 84 84 84 84 84 84 84 84 84 84 84 84 84 84 85 85 85 85 85 85 85 85 85 85 85 86 85
4163 85 85 85 84 84 84 84 84 84 83 83 83 83 83 83 84 84 84 85 85 85 86 86 86 85 85 85 84 84 84 84 84 84 84 85 84 84 83 83 83 84 84 84 84 84 83 83 83 82 82 82 83 84 84 84 83 82 82 82 83 83 83 83 83 83 83 83 83 83 83 83
4155 83 83 83 83 83 83 83 83 83 83 83 83 82 82 82 82 81 82 82 82 82 82 82 83 83 83 83 83 83 83 82 82 82 82 83 83 83 83 83 83 83 83 83 83 82 82 82 82 82 82 82 82 82 82 82 82 82 82 82 82 83 83 83 83 83 83 83 83 83 83 82
4148 82 82 82 81 81 81 80 80 81 81 81 81 82 82 82 83 83 82 82 82 83 83 82 82 82 82 82 82 82 83 83 82 82 82 82 82 83 83 83 83 83 82 82 83 83 84 84 84 84 83 82 83 83 83 82 82 82 82 82 82 82 82 82 82 82 82 82 82 82 83 83
4140 83 83 83 82 82 82 83 83 83 82 82 82 82 82 83 83 84 84 84 84 84 84 84 83 83 83 83 83 83 84 83 83 82 82 83 83 83 83 83 84 84 83 83 82 82 82 82 83 83 83 83 83 83 82 82 82 82 82 82 82 82 82 82 83 83 83 83 82 82 83 83
4133 83 83 83 83 83 83 83 83 83 84 83 83 83 83 83 83 83 83 83 83 82 83 82 82 82 82 82 82 82 82 82 83 83 83 83 83 83 83 82 82 83 84 83 83 83 83 83 83 83 83 83 83 83 83 83 83 83 83 83 83 83 83 82 82 82 83 83 83 83 83 83
4126 83 82 82 83 83 83 84 84 83 83 83 84 84 85 85 85 84 84 83 84 84 84 83 82 83 83 83 82 82 82 82 83 83 83 82 82 82 82 82 82 82 82 83 83 83 83 82 81 81 81 82 82 82 81 81 82 82 82 82 82 83 82 82 82 82 82 81 82 82 83 83
4118 83 83 83 83 83 83 84 83 83 83 83 83 83 83 83 82 82 83 83 83 83 83 83 83 82 82 83 84 84 83 83 83 83 83 83 83 83 84 84 84 84 83 83 84 84 84 83 83 82 82 82 82 83 83 83 83 83 83 83 83 83 84 84 84 84 84 83 84 84 85 85
4111 85 85 84 83 83 83 83 83 83 84 84 84 84 84 84 84 84 84 84 84 84 83 83 84 84 84 84 84 84 84 84 84 84 84 84 85 85 85 85 85 85 85 85 85 85 85 84 85 85 85 85 85 85 86 85 85 85 85 85 85 85 85 85 85 85 84 84 84 84 84 84
4103 84 84 84 83 83 83 84 85 85 85 84 84 84 84 84 84 84 84 84 84 85 85 85 85 85 85 86 86 86 86 86 86 86 86 85 85 85 85 85 85 84 84 84 84 85 85 84 84 84 84 84 85 85 85 85 85 85 85 85 84 84 84 84 84 84 84 84 84 85 85 85
4096 85 85 85 85 85 85 84 84 84 84 84 84 84 84 84 84 84 84 84 84 83 84 85 85 85 85 84 84 85 85 85 85 84 84 84 85 84 84 84 84 84 84 84 84 84 84 84 84 84 84 85 85 85 86 86 85 85 85 85 84 84 85 86 85 85 85 85 84 84 84 84
4089 84 84 84 84 84 84 84 84 84 84 85 85 85 86 86 86 86 86 85 85 85 85 84 85 85 85 84 84 84 84 85 84 84 84 84 84 84 84 84 84 84 84 84 84 84 84 84 84 83 84 84 84 84 84 84 84 84 84 84 84 84 84 84 84 85 86 85 84 83 83 84
4081 84 84 85 85 84 84 84 85 84 84 84 83 83 84 84 85 85 85 85 85 85 85 85 84 84 84 83 84 84 84 85 85 85 84 84 85 85 85 86 85 84 84 84 84 85 85 84 85 85 85 85 85 85 84 84 85 84 84 84 84 84 84 83 84 84 84 85 85 85 85 85
4074 85 85 86 85 85 85 85 84 84 84 84 84 84 84 83 83 84 84 84 84 84 84 83 83 82 82 83 84 85 84 84 85 85 85 86 86 86 85 85 85 85 85 84 84 84 84 84 84 85 84 84 84 84 84 84 84 85 85 84 84 84 84 84 84 85 85 85 86 87 86 85
4066 85 85 84 85 85 85 85 84 83 83 84 85 84 84 84 84 84 84 84 84 83 83 83 83 84 83 83 83 83 83 82 82 82 82 84 84 84 84 83 83 83 83 83 83 83 83 83 83 83 83 83 83 83 83 83 84 84 84 84 84 84 83 82 82 82 83 83 83 83 82 82
4059 82 83 83 83 83 83 84 84 84 83 83 83 83 83 83 83 84 84 83 83 82 82 82 82 81 81 81 82 82 82 83 82 82 82 83 82 82 82 82 83 83 84 85 84 84 84 83 83 84 84 84 84 84 84 83 83 83 82 82 83 83 83 84 84 84 84 84 84 84 84 83
4051 83 83 82 83 83 83 83 83 83 83 82 82 82 82 82 83 84 84 84 84 84 84 84 84 84 84 84 84 84 85 86 86 85 84 84 84 84 84 84 84 85 84 84 84 84 83 83 83 83 83 83 83 83 84 84 85 84 84 84 84 83 83 83 83 83 83 83 83 83 83 83
4044 83 83 83 83 83 83 83 84 84 84 83 83 83 82 82 82 82 82 82 83 83 83 84 84 84 84 84 83 83 82 81 82 82 83 83 84 84 84 84 84 84 84 84 84 84 85 85 84 84 84 84 83 83 82 82 82 82 82 82 83 83 83 83 83 83 83 83 83 83 83 83
4037 83 83 83 83 83 83 83 83 83 83 84 84 84 83 83 83 84 84 85 84 84 83 82 82 83 83 83 83 83 83 83 83 83 82 82 83 83 83 82 82 83 83 83 83 83 83 84 84 84 84 84 83 83 83 83 83 83 83 82 83 83 84 84 84 84 84 83 83 82 82 82
4029 82 82 83 83 83 83 83 83 84 84 84 84 84 84 84 84 83 83 83 83 83 83 83 83 84 84 84 84 84 84 83 83 82 83 83 83 82 82 82 83 83 84 84 84 84 84 84 84 84 84 83 83 83 83 83 83 84 84 84 84 84 84 83 83 82 83 84 85 84 84 84
4022 84 84 84 85 85 85 85 85 85 84 84 84 83 83 84 84 83 83 82 82 82 82 83 83 83 83 83 83 83 83 84 84 84 84 83 83 83 83 83 83 83 83 82 83 83 83 82 83 83 83 83 83 83 83 83 83 82 82 82 82 82 82 83 83 84 83 83 83 83 83 83
4014 83 82 82 82 82 83 83 83 83 83 83 83 83 82 82 82 82 82 81 81 81 81 81 81 81 81 81 81 81 81 82 82 82 82 82 82 82 82 83 82 82 82 82 82 82 83 83 83 83 82 82 82 82 82 82 82 82 82 82 82 80 80 80 81 81 82 82 81 81 81 81
4007 81 81 81 82 82 82 82 82 82 82 82 82 82 82 82 82 81 81 81 81 82 81 81 82 82 81 81 81 81 81 81 81 81 82 82 82 82 82 83 82 82 82 81 81 81 81 82 82 83 83 82 81 82 82 82 82 82 82 81 81 81 81 80 80 80 80 81 81 81 81 82
4000 82 83 83 83 83 82 81 81 82 82 82 82 82 82 81 82 82 82 82 82 82 82 82 82 82 82 83 82 82 81 80 81 80 80 80 81 80 80 80 80 80 80 80 80 80 80 80 80 80 80 80 81 81 82 82 81 81 81 81 82 82 82 81 82 82 82 82 82 83 82 82
3992 82 81 81 81 81 81 81 81 81 81 81 81 81 81 81 81 80 80 79 79 80 80 81 80 80 80 80 80 80 80 80 80 80 81 81 81 81 81 81 81 81 81 81 81 81 81 81 80 80 81 81 81 81 81 81 81 81 81 81 81 81 81 81 81 81 81 81 81 81 81 80
3985 80 81 81 81 80 80 80 81 81 82 82 82 82 81 81 81 81 81 81 81 81 82 82 82 82 81 81 80 80 80 80 81 81 81 82 82 82 82 82 82 82 82 82 82 81 81 81 81 82 82 82 82 82 82 82 82 81 81 81 81 82 82 82 82 82 82 82 82 82 82 82
3977 82 81 81 81 81 81 81 81 81 80 80 81 82 82 82 83 83 83 84 84 84 84 83 83 83 83 83 83 82 82 82 82 83 83 83 83 83 83 83 83 83 83 83 83 83 82 82 82 82 82 82 82 82 82 82 82 82 82 82 82 81 81 80 80 80 81 81 81 80 81 82
3970 82 82 82 82 82 83 83 83 83 82 82 82 83 83 83 83 83 83 83 83 83 83 83 83 83 83 83 83 83 83 82 82 82 82 81 81 81 81 82 82 83 83 83 83 83 83 83 83 83 83 83 84 84 83 82 82 82 83 83 83 84 84 84 83 83 83 82 83 83 82 82
3962 82 82 82 82 82 82 81 81 81 81 81 81 81 82 82 82 83 83 82 82 82 82 82 82 82 82 83 84 84 84 84 83 83 83 82 82 81 82 82 82 82 82 82 82 82 82 82 82 82 83 83 83 83 83 83 83 82 82 83 83 83 83 83 83 83 83 83 83 83 83 83
3955 83 83 83 83 83 83 83 83 82 82 83 83 83 83 83 83 83 83 83 84 84 84 84 83 83 82 82 82 82 82 83 82 82 83 83 84 83 83 82 82 82 82 83 83 83 84 84 84 84 84 85 84 84 85 85 85 84 84 84 83 83 83 83 83 83 84 84 84 84 84 84
3948 84 84 84 84 83 84 84 84 85 84 84 83 83 83 84 84 84 84 83 83 83 83 83 83 82 82 83 83 83 83 83 83 83 83 83 83 84 84 85 84 84 83 83 83 84 85 85 84 84 83 83 83 83 83 84 83 83 83 83 83 82 83 83 83 84 84 85 84 84 83 83
3940 83 83 83 84 84 84 84 84 84 84 84 84 84 83 83 83 83 83 84 84 84 84 83 84 84 84 84 84 85 84 83 83 83 83 83 83 83 82 81 82 82 82 82 82 82 82 83 83 83 83 83 83 83 82 82 82 82 82 82 82 82 83 82 81 81 82 82 81 81 81 82
3933 82 83 83 83 83 83 83 83 84 84 83 83 83 83 83 83 83 83 83 83 82 82 82 82 82 82 82 82 82 82 82 83 83 83 83 83 83 83 83 83 83 83 83 83 84 83 83 83 83 83 83 83 83 82 83 83 83 84 84 84 83 83 83 83 82 82 82 82 82 82 82
3925 82 82 82 82 81 81 80 80 81 81 81 81 81 81 81 81 82 82 83 83 83 82 81 81 81 81 81 81 81 81 82 83 83 83 82 81 81 82 82 82 81 81 81 82 82 82 81 81 81 82 82 83 83 83 83 83 82 82 82 82 82 82 82 81 82 83 83 83 82 83 83
3918 83 83 83 82 82 82 82 82 82 83 83 83 82 82 82 81 82 82 83 82 82 82 82 82 82 82 82 82 82 82 82 82 82 83 83 84 83 82 83 82 82 82 81 81 82 82 82 82 82 82 82 82 82 82 82 83 83 83 83 83 83 83 84 84 83 82 82 82 82 82 82
3910 82 82 82 83 83 83 83 83 83 83 83 83 83 83 83 83 83 83 83 83 83 83 84 85 85 84 84 84 84 84 83 83 83 83 83 83 84 84 84 84 84 84 83 84 84 84 85 84 83 83 83 84 85 85 85 84 84 84 84 84 84 83 83 83 83 84 84 83 83 84 83
3903 83 83 83 83 82 83 83 83 84 84 83 83 83 83 82 82 81 81 81 82 82 83 84 83 83 83 83 83 83 84 84 84 85 84 83 83 83 83 83 83 84 84 85 85 84 84 85 85 84 84 84 85 84 83 83 83 84 84 84 84 84 83 83 83 83 83 83 83 83 83 84
3896 84 84 84 84 84 84 84 83 84 85 84 83 83 83 83 83 84 83 83 83 83 83 82 82 82 83 83 83 84 84 83 83 82 82 82 83 84 84 84 84 84 84 84 84 84 84 84 84 84 84 83 83 83 83 83 83 83 82 81 81 81 82 82 83 83 83 83 83 84 84 84
3888 84 84 84 84 83 83 83 83 83 82 81 81 81 82 83 83 83 82 82 82 82 82 82 82 83 82 82 82 83 83 82 82 82 82 83 83 83 83 84 83 83 82 82 82 82 82 82 82 82 82 82 82 82 82 82 82 82 82 82 82 82 82 82 82 82 82 82 82 81 81 81
3881 81 81 81 82 82 82 82 81 81 81 81 82 82 81 81 81 82 82 82 81 81 82 82 82 81 81 81 81 81 82 82 82 82 82 82 82 82 81 81 81 81 81 81 81 81 81 81 81 81 81 82 82 82 82 83 83 82 82 82 81 80 81 82 82 82 82 82 82 82 82 82
3873 82 82 82 82 82 82 82 81 80 80 80 80 81 81 81 81 81 81 81 82 82 83 82 82 83 82 82 82 82 82 82 82 82 82 83 83 82 81 82 82 82 82 82 81 81 81 81 81 82 82 82 82 82 82 82 82 82 82 83 83 82 82 82 83 83 83 83 82 82 82 82
3866 82 82 82 82 82 82 82 82 82 83 83 83 83 83 83 83 82 82 82 82 82 82 82 82 82 82 82 82 82 81 81 82 82 82 82 83 83 83 83 83 82 82 82 82 82 82 82 83 83 83 83 83 83 84 84 84 83 83 83 83 83 82 82 82 82 82 81 81 81 81 81
3859 81 82 82 82 82 82 82 82 82 82 82 82 82 82 82 82 81 81 82 82 82 82 83 82 82 82 82 82 82 82 83 82 81 82 82 82 82 82 82 82 82 82 82 82 82 82 82 82 82 82 82 81 81 81 81 81 81 82 82 82 82 82 82 81 81 81 81 81 81 81 81
3851 81 81 81 81 81 80 80 81 82 81 81 81 81 82 82 83 83 82 82 82 81 81 81 81 81 81 81 81 81 81 81 81 82 82 82 82 82 82 82 82 82 81 81 81 81 81 81 82 82 82 82 83 83 82 82 82 81 82 82 82 81 81 81 81 81 81 82 82 82 81 81
3844 81 82 82 83 82 81 81 81 80 80 81 81 81 81 81 81 81 81 81 82 82 82 83 82 82 82 82 82 82 82 82 81 81 81 81 81 81 81 81 80 80 81 81 81 82 82 82 82 82 82 83 83 82 81 81 81 81 81 81 81 80 80 80 81 81 81 81 81 81 81 81
3836 81 81 81 81 81 81 80 81 81 82 82 82 82 82 81 82 83 82 82 82 82 82 81 81 81 81 81 81 80 81 82 82 83 83 83 83 83 83 83 82 82 82 82 82 83 82 82 82 82 82 82 82 82 82 82 82 82 82 82 81 81 81 81 81 82 82 82 82 82 82 81
3829 81 81 81 81 81 82 81 80 80 80 80 81 81 81 81 81 81 81 81 82 82 82 82 82 82 82 82 82 82 82 82 82 82 82 81 81 80 81 80 79 79 80 81 81 81 82 82 82 82 81 81 81 81 81 81 81 81 80 80 80 80 80 80 80 81 81 81 81 82 82 82
3821 82 83 83 83 83 82 81 81 82 82 82 82 82 82 82 82 81 81 81 81 81 81 82 82 81 81 82 81 81 81 81 81 81 82 82 82 82 81 81 80 80 80 81 82 83 83 83 83 83 83 82 82 82 82 82 82 82 83 83 83 83 83 83 83 83 82 82 82 82 82 82
3814 82 82 83 83 83 83 83 82 82 82 82 81 81 82 82 82 83 83 83 82 82 82 82 82 82 83 83 83 83 83 83 83 82 82 81 81 81 82 82 82 82 82 82 82 82 82 82 82 82 82 82 82 82 82 83 82 82 82 82 82 82 82 83 83 83 83 83 83 84 84 84
3807 84 83 83 83 83 82 82 82 82 83 84 84 83 83 83 83 83 82 82 82 82 83 83 83 84 84 83 83 83 83 83 83 83 83 83 83 82 82 83 83 83 83 82 83 83 82 83 83 82 82 82 82 83 83 83 83 83 84 84 84 83 83 82 83 83 82 82 82 82 83 83
3799 83 83 83 83 82 83 83 83 83 83 84 84 84 84 84 84 84 83 83 83 83 83 83 83 84 84 84 84 83 83 82 82 82 83 83 82 82 82 82 83 83 83 83 83 83 83 84 84 83 82 82 82 83 83 83 83 83 84 85 84 84 84 84 83 83 84 84 84 83 84 84
3792 84 84 84 84 84 85 85 85 85 85 85 85 84 84 85 84 84 84 84 84 83 83 84 83 83 83 83 83 82 82 83 84 83 84 84 84 84 84 84 84 85 85 84 84 83 83 82 82 83 83 83 83 83 83 83 83 83 83 84 83 83 83 82 82 82 82 82 82 82 82 83
3784 83 82 82 82 82 82 83 83 83 83 83 83 83 82 83 83 84 84 84 83 83 84 84 84 84 83 83 83 83 83 83 83 83 83 83 84 84 84 83 83 83 83 82 83 83 82 81 82 82 83 84 84 84 84 84 83 82 82 82 81 81 82 82 82 82 83 83 82 82 82 82
3777 82 83 83 82 82 82 83 83 83 83 83 83 82 82 82 82 81 81 82 82 82 82 82 82 83 83 83 83 83 82 82 82 82 82 82 83 83 82 82 82 82 82 82 83 83 83 82 82 82 82 82 82 81 81 81 81 82 82 82 82 82 82 82 81 81 81 81 82 82 82 82
3770 82 82 81 82 82 82 83 82 81 81 81 81 81 80 80 80 80 81 81 81 82 82 82 82 83 82 82 82 82 82 82 82 82 82 81 81 82 82 82 82 82 82 82 82 83 82 82 82 82 82 82 82 82 82 82 82 82 82 82 82 82 82 83 83 83 82 82 80 80 80 80
3762 80 80 80 80 81 81 81 82 82 82 82 82 82 82 82 81 82 82 83 82 81 81 82 82 82 82 82 82 82 82 82 82 82 82 82 81 81 81 80 80 80 81 82 82 82 82 82 82 82 82 82 82 82 82 82 82 82 83 83 82 83 83 82 82 82 82 82 82 82 82 82
3755 82 82 82 82 82 82 82 82 81 81 81 81 81 81 81 81 81 81 81 81 81 81 81 81 82 81 81 81 81 81 81 81 81 81 81 81 81 81 81 81 81 82 83 82 82 82 82 82 82 82 82 82 82 82 82 82 81 82 82 82 82 82 82 82 82 82 82 82 82 82 82
3747 82 82 82 82 82 82 82 82 83 83 83 82 82 81 81 80 81 81 81 81 82 82 82 82 82 82 82 82 82 82 82 82 82 82 81 82 82 83 83 83 82 83 83 83 83 83 83 83 82 81 81 82 82 82 82 82 82 82 82 82 83 83 83 82 82 82 81 82 83 82 82
3740 82 82 82 82 82 82 82 82 82 82 82 82 82 82 81 81 81 81 81 82 82 82 82 82 82 82 82 82 83 83 82 82 81 81 81 81 82 82 82 82 82 82 82 82 82 82 82 82 83 83 83 83 83 83 83 82 82 82 82 82 82 82 82 82 82 82 82 82 82 81 82
3732 82 82 82 82 82 82 83 83 83 83 83 83 82 81 81 81 81 81 81 80 81 81 82 82 82 82 82 82 82 81 81 80 80 80 80 81 81 81 81 81 81 82 82 82 82 82 81 82 82 82 82 82 82 81 81 81 81 81 82 82 82 82 82 82 82 82 82 82 82 81 81
3725 81 82 81 81 81 82 82 83 82 82 82 82 82 82 81 81 81 81 82 83 83 82 82 82 82 82 82 82 82 81 81 82 82 83 83 83 83 83 82 82 82 82 82 82 82 81 81 80 80 80 80 81 81 82 82 82 83 82 82 82 82 82 82 83 83 83 82 82 82 82 83
3718 83 83 83 83 83 83 83 83 82 82 81 81 81 81 81 81 81 81 81 81 82 81 81 81 82 82 83 83 84 83 83 83 83 83 83 83 83 83 83 83 84 85 85 85 85 85 85 85 86 86 87 87 88 87 87 87 87 87 86 86 86 87 87 88 88 88 88 89 89 89 90
3710 90 89 89 89 90 90 90 91 92 93 93 93 93 94 94 95 96 96 97 98 99 100 101 103 104 105 106 108 109 110 112 115 118 120 123 126 130 135 140 146 153 161 170 182 194 207 221 233 244 254 262 270 280 292 305 317 325 328 328 324
3704 324 318 310 299 286 272 258 244 230 218 208 198 189 181 173 167 161 157 153 150 146 142 138 133 128 123 118 113 108 104 101 99 97 96 95 94 93 92 90 90 90 90 89 89 88 88 87 87 87 87 87 87 86 86 86 86 86 85 85 85 84
3698 84 84 84 84 83 83 83 84 84 84 84 84 84 83 83 83 83 83 83 83 82 82 83 84 84 83 83 82 82 82 82 83 83 83 84 84 84 83 83 82 82 83 83 83 83 84 84 84 84 83 84 85 84 84 84 83 83 83 84 83 84 84 83 83 82 81 81 81 81 81 82
3690 82 82 82 82 82 82 82 81 81 81 81 81 81 80 80 80 80 79 79 79 79 80 80 80 81 81 81 81 81 81 81 81 81 81 81 81 81 81 81 81 81 81 81 81 81 81 81 81 81 81 80 80 80 81 82 81 81 80 81 81 81 80 81 82 81 81 80 79 79 80 80
3683 80 80 80 80 80 80 80 80 81 81 81 82 81 80 80 80 80 80 80 80 80 80 80 80 80 80 81 81 81 82 81 81 81 81 81 81 81 81 80 80 80 80 81 81 81 81 81 80 80 80 81 81 81 80 80 80 80 81 80 80 81 81 81 81 81 81 80 80 80 80 80
3675 80 80 80 80 80 80 81 81 81 81 81 81 81 81 81 80 80 80 80 79 78 79 79 79 80 79 79 79 79 79 80 80 80 80 80 80 81 81 81 81 80 79 79 79 79 80 80 80 80 80 81 80 79 79 80 80 79 79 79 79 79 80 80 81 80 80 79 79 78 78 78
3668 78 78 78 77 77 77 77 77 78 78 78 79 79 79 79 79 78 78 78 78 77 77 77 77 77 77 77 77 77 78 78 78 79 79 78 78 78 78 77 78 78 78 78 78 79 79 79 78 78 78 78 79 79 79 79 79 78 78 78 78 78 78 78 78 77 78 78 78 78 79 79
3661 79 79 79 79 78 78 79 78 78 78 78 78 78 78 78 77 77 77 78 78 78 79 79 78 79 79 79 79 79 79 79 79 79 79 78 78 78 78 79 79 79 79 79 79 79 79 79 79 79 79 80 80 80 80 80 80 81 81 81 82 81 81 80 80 79 79 79 79 79 79 78
3653 78 78 78 78 78 79 79 79 79 80 79 78 78 79 79 78 78 78 79 79 79 79 79 80 80 81 81 80 80 80 80 80 80 80 80 80 81 81 81 80 80 80 81 81 81 81 80 80 80 80 80 80 80 80 80 81 81 81 80 79 80 80 80 81 81 82 81 81 81 80 79
3646 79 79 79 80 80 81 80 80 80 79 79 80 80 80 81 82 81 81 81 81 80 79 79 79 79 79 79 80 80 79 80 79 79 79 79 79 79 80 79 79 80 81 81 80 80 80 80 81 81 81 80 80 79 79 79 79 80 80 80 80 80 80 81 81 81 80 80 79 79 80 81
3638 81 81 81 80 80 80 80 80 81 80 79 78 78 78 79 79 79 79 79 79 79 79 79 79 79 79 78 78 78 79 80 79 79 80 79 79 80 80 80 79 80 81 82 82 82 81 81 80 80 80 80 81 81 80 80 80 80 80 79 79 79 80 79 79 79 79 80 81 80 80 79
3631 79 79 79 79 79 79 79 79 79 80 80 80 80 81 81 81 81 81 81 80 80 80 80 80 80 80 80 80 80 80 80 80 80 80 79 79 79 80 80 80 80 80 80 79 80 80 80 80 80 80 80 80 80 80 80 80 81 81 81 81 80 80 80 81 81 81 81 81 81 81 81
3623 81 81 81 81 81 81 81 80 80 79 80 80 80 81 81 81 81 81 81 80 79 79 80 80 80 80 80 79 79 79 80 81 81 81 81 81 80 80 80 80 80 80 80 80 80 80 80 81 81 81 82 81 80 80 80 80 81 81 81 81 81 80 80 80 80 80 80 81 80 80 80
3616 80 80 81 81 81 81 81 80 80 81 81 81 81 82 82 83 83 83 82 82 81 81 81 82 82 83 83 83 82 82 81 81 80 80 79 79 79 79 79 79 80 80 81 81 81 81 81 80 81 81 81 81 81 80 80 80 80 80 80 79 80 80 80 80 80 80 81 81 80 80 80
3609 80 80 80 79 79 79 80 80 80 80 79 79 79 79 79 79 78 78 78 79 79 79 79 78 78 78 78 77 77 76 77 78 79 79 79 79 78 78 78 78 78 79 80 79 78 78 78 78 78 79 79 78 78 78 78 78 77 77 77 78 78 79 78 78 78 77 77 77 77 78 78
3601 78 78 79 79 79 78 78 77 77 77 77 77 77 77 77 77 78 79 79 79 78 77 77 77 78 78 77 77 77 77 78 78 78 78 78 78 78 78 78 78 77 77 77 78 78 78 78 78 78 78 78 77 77 76 76 77 77 77 77 77 77 77 77 77 77 77 76 76 77 78 78
3594 78 79 78 78 78 78 77 77 77 77 77 77 78 78 77 78 78 78 78 78 78 78 78 78 77 77 77 78 78 78 78 77 77 77 77 77 78 78 78 78 78 78 78 78 78 78 78 79 79 79 79 79 78 78 78 78 78 78 78 79 79 79 79 79 79 79 79 79 80 79 79
3586 79 79 79 79 79 79 80 80 80 79 78 78 78 79 79 80 80 79 79 79 79 79 80 80 80 79 80 80 80 80 80 80 80 80 81 81 81 80 80 79 79 79 79 79 80 80 79 79 79 79 79 79 80 80 80 80 80 80 80 80 80 80 80 80 80 80 80 80 81 81 82
3579 82 82 81 82 82 82 81 81 81 81 80 80 80 80 80 80 80 81 81 81 81 82 81 81 81 80 80 80 80 80 80 80 80 80 81 81 82 82 82 81 81 81 80 80 80 80 80 80 80 80 80 79 80 81 81 81 81 81 80 80 80 80 80 80 80 80 81 81 81 80 80
3572 80 80 80 80 80 80 80 80 80 80 80 80 80 79 79 79 79 79 79 80 80 81 81 81 80 80 81 81 81 80 80 80 80 81 81 81 81 80 79 79 79 79 80 81 81 81 81 81 81 81 81 80 79 78 78 79 79 80 80 80 80 80 80 79 79 79 79 79 80 80 80
3564 80 79 79 79 79 79 79 80 81 80 80 80 80 79 79 79 80 79 79 79 79 79 80 80 80 80 80 80 81 81 80 80 80 79 80 80 80 80 79 79 78 78 79 79 79 79 79 79 78 78 78 78 79 79 79 79 79 79 79 79 79 79 79 79 80 79 79 79 78 78 78
3557 78 79 79 79 80 80 80 81 80 80 80 80 80 80 80 80 80 80 80 81 81 81 81 80 80 80 80 79 79 79 79 79 79 79 79 79 79 79 79 79 80 80 80 79 79 79 79 79 78 78 78 78 78 78 79 79 79 79 79 79 79 79 80 80 80 80 80 80 80 80 79
3549 79 79 79 80 80 80 80 79 79 79 79 78 78 78 78 78 78 78 78 79 79 79 79 79 78 78 78 79 79 79 79 79 79 79 79 79 79 79 80 80 80 80 80 80 80 80 80 80 80 80 80 80 79 79 80 80 80 81 80 80 80 79 79 79 79 79 79 80 80 80 80
3542 80 80 80 80 79 79 80 80 80 80 80 81 82 81 80 79 79 79 79 79 79 79 80 81 80 79 79 78 79 79 79 81 82 82 81 80 80 80 81 81 80 80 80 80 81 80 80 80 80 81 81 81 81 80 81 81 81 81 80 80 80 80 80 80 80 80 80 80 80 80 80
3534 80 80 80 80 80 80 80 80 80 80 80 81 81 80 80 80 80 81 81 82 82 81 81 80 80 80 79 79 80 80 80 81 81 81 81 81 81 81 81 80 80 80 80 81 81 81 81 81 81 81 81 81 80 80 80 81 81 80 80 80 80 80 80 80 80 80 80 80 81 81 80
3527 80 80 81 81 81 81 81 81 81 80 81 81 80 80 80 79 79 80 80 80 80 80 79 79 80 81 81 80 80 81 81 81 80 80 80 80 80 81 81 81 81 81 81 81 81 80 81 81 81 81 81 81 81 81 82 82 81 80 80 81 81 81 81 81 80 80 80 81 80 80 80
3520 80 80 80 80 80 80 81 81 81 81 81 81 81 80 80 80 79 79 79 79 80 80 80 80 80 80 81 81 81 81 81 81 81 81 81 81 81 81 81 81 81 81 81 81 81 82 81 81 80 80 80 80 81 81 81 81 80 80 80 81 81 80 80 80 80 81 82 82 81 81 81
3512 81 81 81 80 80 80 80 80 79 79 79 80 80 80 80 79 79 79 79 79 80 80 80 80 79 79 80 80 80 81 81 82 82 82 81 80 80 80 81 81 81 80 80 80 80 80 79 80 80 79 79 79 79 80 80 80 81 81 81 81 81 80 81 81 81 80 80 79 80 80 80
3505 80 80 80 79 80 80 80 80 80 79 79 79 80 80 80 80 80 80 81 81 81 80 80 81 82 81 80 79 78 78 79 80 81 82 82 81 80 80 79 80 80 80 80 80 80 79 79 79 79 80 79 79 78 79 79 79 79 78 78 79 79 79 79 79 80 81 81 80 81 82 82
3497 82 82 80 80 80 81 81 81 81 81 81 80 80 81 81 81 81 81 81 81 81 80 80 80 81 81 81 81 81 81 81 81 80 80 80 80 80 79 79 80 80 80 81 81 81 81 80 80 81 81 81 80 80 79 79 80 80 80 79 80 80 80 80 80 80 81 81 81 81 81 81
3490 81 81 81 81 81 80 79 79 80 81 81 81 81 80 80 81 81 82 81 81 81 81 81 82 82 81 81 80 80 79 79 80 80 80 81 81 81 82 81 81 81 81 80 80 80 80 79 80 80 81 80 80 79 79 79 79 80 80 80 80 80 80 80 79 79 79 79 80 79 79 79
3483 79 79 79 79 79 79 79 79 79 78 79 80 80 80 80 80 81 81 81 80 80 80 80 80 80 80 80 80 81 81 80 79 79 80 80 79 79 78 79 80 80 79 79 79 79 79 79 79 79 79 79 79 79 79 79 80 80 79 79 79 80 80 80 80 80 80 79 78 78 78 79
3475 79 78 78 78 78 78 78 78 78 78 79 79 79 79 79 79 78 79 80 80 79 79 79 80 80 80 80 80 80 79 79 79 79 79 79 78 77 78 78 79 79 80 80 80 79 79 79 79 78 78 78 78 78 79 79 79 79 79 79 79 78 78 78 78 79 79 79 79 78 78 78
3468 78 78 78 79 79 78 77 77 78 79 79 79 79 79 79 79 79 79 79 79 78 78 78 79 79 79 79 79 79 79 79 79 79 79 78 78 79 79 79 78 78 78 78 78 78 78 79 79 79 79 79 79 79 78 78 78 78 78 78 78 78 78 77 77 77 78 78 78 78 78 78
3460 78 77 78 78 78 78 79 79 79 79 79 79 79 79 78 78 78 78 78 79 79 79 79 79 79 79 79 80 79 78 78 78 79 79 79 79 79 79 79 80 79 79 79 80 80 80 79 78 78 78 78 78 78 79 79 79 79 79 78 77 78 78 78 79 78 78 78 78 77 77 77
3453 77 77 78 78 78 79 79 79 80 79 79 78 78 78 79 79 79 79 79 79 79 79 79 79 80 80 80 80 80 80 80 79 79 78 78 78 78 78 78 78 78 78 78 78 78 78 78 79 79 79 79 79 79 78 78 79 78 78 79 79 78 78 78 78 79 79 79 79 78 79 78
3445 78 78 78 78 78 77 78 78 78 78 78 78 78 79 79 79 79 78 78 78 78 78 78 78 78 79 78 78 78 78 78 79 79 79 79 79 78 78 78 78 78 79 79 78 78 78 78 78 78 78 78 77 77 76 76 77 76 76 76 76 76 77 77 77 77 77 78 78 78 78 78
3438 78 79 79 78 78 78 79 79 79 79 79 79 79 79 78 78 79 79 78 78 77 77 77 78 78 78 78 78 78 79 79 80 80 79 79 78 78 79 79 79 79 78 78 78 78 78 78 77 77 78 78 78 78 77 77 76 76 77 78 78 78 78 78 78 77 77 77 77 77 78 78
3431 78 78 78 78 78 79 79 79 78 78 78 77 77 77 77 78 78 78 78 79 79 80 79 79 78 78 78 79 79 79 79 79 78 78 78 78 78 77 77 77 77 77 78 78 79 79 79 80 80 79 79 79 79 79 78 78 78 78 79 79 79 79 79 79 79 79 79 79 79 79 79
3423 79 79 79 79 78 78 78 78 78 79 79 79 79 79 79 78 79 79 79 79 79 80 80 80 80 80 79 79 79 78 78 78 78 78 79 79 79 79 79 80 80 80 80 80 79 79 79 80 79 79 79 79 79 79 79 79 80 80 80 80 80 80 80 80 79 78 78 79 79 79 79
3416 79 79 79 80 80 79 79 78 79 79 79 80 79 79 79 78 79 79 80 79 79 79 80 79 79 80 80 80 81 81 81 81 81 81 81 80 79 79 79 79 79 79 80 80 80 80 80 79 78 79 79 79 80 80 80 80 80 81 81 80 80 80 80 80 80 79 79 79 79 79 78
3408 78 79 79 79 79 78 79 79 80 80 81 82 82 81 80 80 80 80 81 81 81 81 80 80 80 80 81 81 80 80 79 79 79 79 80 80 80 80 80 79 80 80 80 80 80 80 81 81 80 79 80 80 80 80 81 81 81 81 82 82 82 82 81 81 81 81 80 80 80 80 80
3401 80 80 80 80 80 79 80 81 81 81 81 81 81 81 81 81 81 82 81 81 81 81 81 81 81 81 80 80 80 80 80 80 81 81 81 81 80 79 79 79 78 79 79 80 80 79 80 79 78 79 79 79 79 79 79 79 79 80 80 80 80 80 80 80 80 81 81 81 81 80 80
3393 80 80 80 80 80 80 80 80 80 80 81 81 81 81 80 80 80 80 81 80 80 80 80 80 80 80 80 80 80 80 80 80 80 80 80 80 80 80 80 79 80 80 80 80 80 80 80 80 80 80 80 80 80 80 80 80 80 80 80 80 80 80 80 80 80 80 79 79 79 80 80
3386 80 80 79 79 80 79 79 79 79 80 80 79 80 80 80 79 79 78 79 79 79 80 80 79 79 79 79 80 80 80 80 80 80 80 80 80 80 80 80 79 79 80 80 80 81 81 81 80 80 80 80 81 81 81 81 81 81 81 81 81 81 81 81 81 81 81 81 80 80 80 80
3379 80 80 80 80 80 80 81 81 81 81 80 80 79 78 78 79 79 79 79 79 79 79 79 80 80 80 80 80 80 80 79 79 79 80 80 80 80 80 80 80 80 80 81 81 80 80 80 80 79 79 80 79 78 78 78 79 79 79 80 80 80 80 80 81 81 81 80 79 79 79 79
3371 79 80 79 79 80 80 80 81 81 81 81 80 80 79 79 79 79 79 80 80 80 81 81 80 80 80 80 80 80 80 80 80 80 80 81 81 80 80 80 79 79 80 81 81 80 80 79 79 79 79 79 79 79 79 79 79 79 80 79 79 80 79 79 80 80 80 80 80 80 81 81
3364 81 81 81 80 80 80 80 81 81 81 81 81 81 81 81 81 81 81 80 80 80 80 80 80 80 80 80 81 81 80 80 80 80 79 79 79 80 80 79 79 79 79 79 79 79 80 80 80 80 80 80 80 80 81 80 81 81 80 80 80 80 80 80 80 80 79 79 79 80 80 80
3356 80 81 81 80 80 80 81 81 80 80 80 80 80 80 80 80 80 80 79 79 79 79 79 80 80 81 81 81 81 81 81 81 81 82 81 81 80 80 80 80 80 80 80 80 80 79 79 79 79 80 80 80 80 80 80 81 81 81 81 81 80 80 80 79 79 80 80 80 80 80 79
3349 79 79 80 80 80 80 81 81 81 80 80 80 80 80 80 80 80 80 80 80 79 79 79 79 78 78 78 79 79 80 80 80 80 79 79 79 79 79 79 79 79 79 79 79 80 80 80 80 80 80 79 79 79 80 80 80 80 80 80 80 80 80 81 81 81 80 80 80 80 80 80
3342 80 80 80 80 81 81 80 80 79 80 79 79 79 79 79 79 79 80 80 80 79 80 80 81 81 80 80 79 79 79 79 79 79 79 79 79 78 78 78 79 80 79 79 79 79 80 80 80 79 78 79 79 79 79 79 78 78 78 78 78 78 78 78 78 78 77 78 78 79 79 79
3334 79 79 79 79 79 78 78 78 78 78 77 77 77 77 77 76 77 76 76 76 77 77 78 78 79 79 78 78 78 78 78 78 78 78 78 78 78 78 79 79 78 79 79 78 79 79 79 79 79 78 78 78 78 78 78 78 79 79 80 80 80 79 79 79 79 79 79 79 78 78 78
3327 78 78 78 78 78 78 78 77 78 79 78 78 78 78 78 78 78 78 78 77 77 77 78 78 79 79 79 79 78 77 77 77 77 77 77 77 78 78 78 78 78 78 77 77 77 77 77 77 77 77 76 76 77 78 78 79 79 79 78 78 78 78 78 78 78 78 78 78 77 77 77
3319 77 77 77 77 77 76 76 76 77 77 77 77 77 77 77 77 78 78 79 79 79 79 79 79 78 78 78 77 77 77 77 77 77 77 78 78 78 78 78 78 78 77 78 78 78 78 77 76 76 76 77 77 77 77 77 77 77 77 78 78 78 78 79 79 79 78 78 78 78 78 78
3312 78 78 78 78 78 78 78 78 79 79 79 79 79 79 79 79 79 79 79 78 78 78 78 78 78 79 78 78 78 78 78 78 78 79 78 78 78 77 77 78 78 78 78 78 78 78 78 78 77 78 78 78 78 78 78 78 78 78 78 78 78 79 79 79 78 78 78 79 79 79 79
3304 79 79 79 78 78 78 78 78 78 78 78 78 78 79 79 79 79 78 79 78 78 78 79 78 78 79 79 79 79 79 78 78 78 78 78 79 79 79 79 79 79 79 78 78 78 78 79 79 79 79 78 77 77 77 77 77 77 77 78 78 78 78 78 78 78 78 79 79 79 79 78
3297 78 78 78 78 77 77 78 78 78 78 78 78 78 78 78 78 79 79 79 80 80 80 79 78 78 78 78 79 78 78 78 78 78 78 78 79 78 78 79 79 79 79 78 78 78 78 77 76 76 76 76 76 77 77 77 77 77 77 77 77 77 78 78 78 79 79 79 78 78 77 78
3290 78 78 78 78 77 77 77 77 77 77 77 77 77 77 77 77 77 77 77 77 77 77 77 76 76 76 76 76 76 77 77 77 77 77 78 78 78 78 78 78 78 78 78 78 78 78 77 77 77 77 76 76 76 77 77 78 78 78 78 77 76 76 76 76 76 77 77 77 77 77 77
3282 77 77 77 77 77 78 78 78 78 76 76 76 77 77 77 77 77 77 77 77 76 76 76 77 77 77 76 76 76 77 78 79 79 77 77 77 77 77 77 77 78 78 78 79 79 79 78 77 77 77 78 79 79 79 79 79 78 78 78 78 78 78 78 78 78 79 78 78 77 77 77
3275 77 77 78 79 79 78 78 79 79 78 78 77 77 77 77 77 77 78 78 78 78 77 77 78 78 78 78 78 78 78 78 78 79 79 79 80 79 79 79 78 78 78 78 79 78 78 78 78 78 79 79 79 79 79 79 79 79 79 79 80 81 81 80 79 79 79 79 78 79 79 79
3267 79 79 79 79 78 78 79 79 78 78 79 79 80 80 80 80 79 79 78 78 78 78 78 78 78 78 78 79 78 78 79 79 79 80 80 80 80 80 80 80 80 79 79 79 79 78 78 78 78 78 78 78 78 78 78 78 78 78 78 78 78 78 79 79 80 80 80 80 79 79 78
3260 78 78 78 78 78 79 79 79 79 79 79 79 79 79 78 78 78 78 78 78 77 77 77 77 77 77 77 78 78 78 78 78 78 77 77 77 77 77 77 77 76 76 76 76 77 77 78 78 77 77 78 78 78 77 77 77 78 79 79 79 79 79 79 79 79 79 78 78 78 79 78
3253 78 77 78 78 79 79 78 78 78 78 78 79 78 78 78 78 78 77 77 77 77 77 77 78 77 77 77 77 78 78 78 78 78 78 78 78 78 77 77 77 77 77 78 78 78 78 77 77 78 78 79 80 80 80 80 79 79 78 78 78 78 78 78 78 78 78 78 78 79 79 79
3245 79 79 78 78 79 79 79 79 80 80 79 79 78 78 79 78 78 79 79 79 78 79 79 79 79 78 79 80 80 81 81 80 80 80 79 79 79 79 79 79 79 79 79 79 79 79 80 80 80 80 80 80 80 79 79 79 79 79 78 79 79 79 80 80 81 80 80 80 80 80 80
3238 80 80 80 80 80 80 80 80 80 80 80 80 79 80 80 80 80 80 80 80 79 79 79 79 79 79 79 80 80 80 80 80 80 80 80 79 79 79 79 79 79 79 79 80 79 79 80 80 80 79 79 79 80 80 80 81 80 79 79 79 79 80 79 79 80 80 80 80 79 79 79
$$ [...]
-2638F9
##END=		$$ NMR SPECTRUM
##END=		$$ LINK
