##TITLE=	RP330 full char.10.fid
##JCAMP-DX=	6.0	$$ MestReNova 14.3.3-33362
##DATA TYPE=	LINK
##BLOCKS=	1    
##ORIGIN=	Mestrelab Research S.L.
##OWNER=	hrzepa
##$MNOVA/METADATA=	(DOCUMENT,BASE64)
eyJuYW1lIjoiL1VzZXJzL2hyemVwYS9MaWJyYXJ5L01vYmlsZSBEb2N1bWVudHMvY29tfmFwcGxlfkN
sb3VkRG9jcy9TaGVwcGFyZC9OTVIgZmlsZXMgemlwcy0yLzEwLzEwLUgubW5vdmEiLCJwYWdlcyI6W3
siaXRlbXMiOlsiMSIgICAgIF19XX0=
##TITLE=	RP330 full char.10.fid
##JCAMP-DX=	6.0	$$ MestReNova 14.3.3-33362
##DATA TYPE=	NMR SPECTRUM
##DATA CLASS=	XYDATA
##BLOCK_ID=	1
##ORIGIN=	Bruker BioSpin GmbH
##OWNER=	nmrsu
##NUMDIM=	1
##$MNOVA/METADATA=	(ITEM,BASE64)
eyJhbmdsZSI6MCwiYXhlcyI6eyJ4Ijp7Im1heCI6MTYuMDcyNjkwMDAwMDI3NTksIm1pbiI6LTMuNzU
4NTEyNTA2MjQyNTEzfSwieSI6eyJtYXgiOjc1NTYxLjY3Mjg1MTU2MjUsIm1pbiI6LTY4MDkuMjc5ND
QxODMzNDk2fX0sInBvaW50cyI6W3sieCI6NTMyMSwieSI6NTgzNX0seyJ4Ijo4NzIyLCJ5Ijo1ODM1f
Sx7IngiOjg3MjIsInkiOjgyMDh9LHsieCI6NTMyMSwieSI6ODIwOH0seyJ4Ijo1MzIxLCJ5Ijo1ODM1
fV0sInoiOjB9
##.OBSERVE FREQUENCY=	700.35432466099996418
##.OBSERVE NUCLEUS=	^1H
##.SOLVENT NAME=	DMSO
##.PULSE SEQUENCE=	zg30
##LONGDATE=	2023/07/09 14:48:30.000
##.ACQUISITIONMODE=	SIMULTANEOUS (DQD)
##$ORIGINAL FORMAT=	Bruker XWIN-NMR
##$MNOVA/SCALES_VERSION=	9
##$PARAMETER FILE=	(acqus, ASCII, /private/var/folders/f6/rjf_tdyn2v98c5c0wvkgn4s80000gq/T/mP$wa8TxSBuTno9th$PNJA/10/acqus, 0)
$$ ##TITLE= Parameter file, TopSpin 4.1.3
$$ ##JCAMPDX= 5.0
$$ ##DATATYPE= Parameter Values
$$ ##NPOINTS= 1	$$ modification sequence number
$$ ##ORIGIN= Bruker BioSpin GmbH
$$ ##OWNER= nmrsu
$$ $$ 2023-07-09 14:47:36.919 +0100  nmrsu@CZC7167VR1
$$ $$ Z:/700/data/tds/nmr/RP330 full char/10/acqus
$$ $$ process C:\Bruker\TopSpin4.1.3\prog\mod\dirdata.exe
$$ ##$ACQT0= -2.0981556054023
$$ ##$AMP= (0..31)
$$ 100 100 100 100 100 100 100 100 100 100 100 100 100 100 100 100 100 100
$$ 100 100 100 100 100 100 100 100 100 100 100 100 100 100
$$ ##$AMPCOIL= (0..32)
$$ -1 0 0 0 0 0 0 0 0 0 0 0 0 0 0 0 0 0 0 0 0 0 0 0 0 0 0 0 0 0 0 0 0
$$ ##$AQSEQ= 0
$$ ##$AQ_mod= 3
$$ ##$AUNM= <au_zg>
$$ ##$AUTOPOS= <45 >
$$ ##$BF1= 700.349999998
$$ ##$BF2= 700.349999998
$$ ##$BF3= 700.349999998
$$ ##$BF4= 700.349999998
$$ ##$BF5= 700.349999998
$$ ##$BF6= 700.349999998
$$ ##$BF7= 700.349999998
$$ ##$BF8= 700.349999998
$$ ##$BWFAC= (0..63)
$$ 0 0 0 0 0 0 0 0 0 0 0 0 0 0 0 0 0 0 0 0 0 0 0 0 0 0 0 0 0 0 0 0 0 0 0 0
$$ 0 0 0 0 0 0 0 0 0 0 0 0 0 0 0 0 0 0 0 0 0 0 0 0 0 0 0 0
$$ ##$BYTORDA= 0
$$ ##$CHANFCU= (0..24)
$$ 0 1 0 0 0 0 0 0 0 0 0 0 0 0 0 0 0 0 0 0 0 0 0 0 0
$$ ##$CHANREC= (0..24)
$$ 0 0 0 0 0 0 0 0 0 0 0 0 0 0 0 0 0 0 0 0 0 0 0 0 0
$$ ##$CHEMSTR= <none>
$$ ##$CNST= (0..63)
$$ 1 1 1 1 1 1 1 1 1 1 1 1 1 1 1 1 1 1 1 1 1 1 1 1 1 1 1 1 1 1 1 1 1 1 1 1
$$ 1 1 1 1 1 1 1 1 1 1 1 1 1 1 1 1 1 1 1 1 1 1 1 1 1 1 1 1
$$ ##$CPDPRG= (0..8)
$$ <> <> <> <> <> <> <> <> <>
$$ ##$D= (0..63)
$$ 0 1 0 0 0 0 0 0 0 0 0 0 0 0 0 0 0.0002 0 0 0 0 0 0 0 0 0 0 0 0 0 0 0 0
$$ 0 0 0 0 0 0 0 0 0 0 0 0 0 0 0 0 0 0 0 0 0 0 0 0 0 0 0 0 0 0 0
$$ ##$DATE= 1688910510
$$ ##$DATE_START= 1688910467
$$ [...]
$$ ##$ShimPowRng3= (0..63)
$$ 1 1 1 1 1 1 1 1 1 1 1 1 1 1 1 1 1 1 1 1 1 1 1 1 1 1 1 1 1 1 1 1 1 1 1 1
$$ 1 1 1 1 0 0 0 0 0 0 0 0 0 0 0 0 0 0 0 0 0 0 0 0 0 0 0 0
$$ ##$ShimPowType1= 8
$$ ##$ShimPowType2= 8
$$ ##$ShimPowType3= 0
$$ ##$ShimPowType4= 0
$$ ##$ShimPowType5= 0
$$ ##$ShimPowType6= 0
$$ ##$ShimPowType7= 0
$$ ##$ShimPowType8= 0
$$ ##$ShimSysActGrad= (0..63)
$$ 1 2 3 4 13 5 7 11 10 9 6 8 12 18 19 20 21 15 22 23 24 14 25 16 26 17 27
$$ 28 31 32 33 34 35 36 37 38 0 0 0 0 0 0 0 0 0 0 0 0 0 0 0 0 0 0 0 0 0 0
$$ 0 0 0 0 0 0
$$ ##$ShimSysAngle= <>
$$ ##$ShimSysFunc= (0..63)
$$ 1 2 3 4 5 6 7 8 9 10 0 37 38 35 16 15 14 13 12 11 28 27 26 25 24 23 36
$$ 22 30 29 20 21 34 33 32 31 17 18 19 0 0 0 0 0 0 0 0 0 0 0 0 0 0 0 0 0 0
$$ 0 0 0 0 0 0 0
$$ ##$ShimSysMatId= <292722da.dat>
$$ ##$ShimSysMatrix= 1
$$ ##$ShimSysMinMaxUG= 130000
$$ ##$ShimSysOffset= <29 mm>
$$ ##$ShimSysType= 4
$$ ##$ShimUnit= 3
$$ ##$SpectrOsVersion= <4.1.156.20210628>
$$ ##$TCubeEth= <192.168.180.38>
$$ ##$TCubeSeqDevice= <>
$$ ##$TOSITY= <no>
$$ ##$TRIPLO2= 0
$$ ##$TopSpinVersion= <TopSpin 4.1.3>
$$ ##$TrxFreqFormula= (0..23)
$$ <TrxFreqFormula(2.0,700350000.000000,'TRX',Trx(1.0,'TRX 1200.1',1,5.000000,1290.000000))>
$$ <TrxFreqFormula(2.0,700350000.000000,'TRX',Trx(1.0,'TRX 1200.2',1,5.000000,1290.000000))>
$$ <TrxFreqFormula(2.0,700350000.000000,'TRX',Trx(1.0,'TRX 1200.3',1,5.000000,1290.000000))>
$$ <> <> <> <> <> <> <> <> <> <> <> <> <> <> <> <> <> <> <> <> <>
$$ ##$TrxPN= (0..23)
$$ <Z148391> <Z148391> <Z148391> <> <> <> <> <> <> <> <> <> <> <> <> <> <>
$$ <> <> <> <> <> <> <>
$$ ##$TrxSN= (0..23)
$$ <00336> <00337> <00342> <> <> <> <> <> <> <> <> <> <> <> <> <> <> <> <>
$$ <> <> <> <> <>
$$ ##$VCubeEth= (0..23)
$$ <no> <no> <no> <no> <no> <no> <no> <no> <no> <no> <no> <no> <no> <no> <no>
$$ <no> <no> <no> <no> <no> <no> <no> <no> <no>
$$ ##$VTU= 2
$$ ##$VTUETH= <192.168.99.11>
$$ ##$VTUTY= <no>
$$ ##$ValueLine= no
$$ ##$VpuPN= (0..23)
$$ <no> <no> <no> <no> <no> <no> <no> <no> <no> <no> <no> <no> <no> <no> <no>
$$ <no> <no> <no> <no> <no> <no> <no> <no> <no>
$$ ##$VpuSN= (0..23)
$$ <no> <no> <no> <no> <no> <no> <no> <no> <no> <no> <no> <no> <no> <no> <no>
$$ <no> <no> <no> <no> <no> <no> <no> <no> <no>
$$ ##$WBREFAM= (0..31)
$$ 99.8 100 100 100 100 100 100 100 100 100 100 100 100 100 100 100 100 100
$$ 100 100 100 100 100 100 100 100 100 100 100 100 100 100
$$ ##$WBREFLM= (0..31)
$$ 1 0 1 0 0 0 0 0 0 0 0 0 0 0 0 0 0 0 0 0 0 0 0 0 0 0 0 0 0 0 0 0
$$ ##$WBREFPH= (0..31)
$$ 0.05 0 0 0 0 0 0 0 0 0 0 0 0 0 0 0 0 0 0 0 0 0 0 0 0 0 0 0 0 0 0 0
$$ ##$WBSGU= (0..31)
$$ 1 2 4 0 0 0 0 0 0 0 0 0 0 0 0 0 0 0 0 0 0 0 0 0 0 0 0 0 0 0 0 0
$$ ##END=
$$ 
##$DECIM=	1440
##$DSPFVS=	21
##XUNITS=	HZ
##YUNITS=	ARBITRARY UNITS
##FIRSTX=	11256.508643983790535
##LASTX=	-2632.2742810921758974
##DELTAX=	-0.1059638129340278595
##XFACTOR=	1
##YFACTOR=	2.0963896126438186229
##FIRSTY=	95.48834991455078125
##MINY=	60.09258270263671875
##MAXY=	68692.3984375
##NPOINTS=	131072
##XYDATA=	(X++(Y..Y))
$$ [...]
4434G9J%%JJJ%JK%JJ%JJJ%JJJJJ%%%JJ%%%J%%%J%%%%%%%%j%%j%%%jj%jjjj%%j%jkjj%jjjj
$$ 79 80 80 80 81 82 83 83 84 86 86 87 88 88 89 90 91 91 92 93 94 95 96 96 96 96 97 98 98 98 98 99 99 99 99 100 100 100 100 100 100 100 100 100 99 99 99 98 98 98 98 97 96 96 95 94 93 92 92 92 91 91 90 88 87 86 86 85 84 83 82
4426H2%%j%jjj%jj%j%%j%j%j%%%j%%%j%%%%%jJ%j%%j%%%%j%%%%%%%%%%%%j%%Jj%%%jJ%%%%
$$ 82 82 82 81 81 80 79 78 78 77 76 76 75 75 75 74 74 73 73 72 72 72 72 71 71 71 71 70 70 70 70 70 70 69 70 70 69 69 69 68 68 68 68 68 67 67 67 67 67 67 67 67 67 67 67 67 67 66 66 66 67 66 66 66 66 65 66 66 66 66 66
4419F6%%%j%%%J%j%%%%%%%%%%j%%%%J%j%J%%%%%%%j%J%%%%%%%%%%%Jj%j%%%%J%%j%%%%%jJ
$$ 66 66 66 66 65 65 65 65 66 66 65 65 65 65 65 65 65 65 65 65 65 64 64 64 64 64 65 65 64 64 65 65 65 65 65 65 65 65 64 64 65 65 65 65 65 65 65 65 65 65 65 65 66 65 65 64 64 64 64 64 65 65 65 64 64 64 64 64 64 63 64
4412F4%J%%%j%%%%%%%%%%%%%%%%%%%%%%%%%%%%%%%%%%%%%%%%%%j%J%%%%%%j%%J%%j%%%%%%
$$ 64 64 65 65 65 65 64 64 64 64 64 64 64 64 64 64 64 64 64 64 64 64 64 64 64 64 64 64 64 64 64 64 64 64 64 64 64 64 64 64 64 64 64 64 64 64 64 64 64 63 63 64 64 64 64 64 64 64 63 63 63 64 64 64 63 63 63 63 63 63 63
4404F3%%J%%%%jJ%j%%%%J%%%%%%j%Jj%%%%%%%%%%%%%%%%%%%%%%J%%%%j%%%Jj%%%%%%%%%j%
$$ 63 63 63 64 64 64 64 64 63 64 64 63 63 63 63 63 64 64 64 64 64 64 64 63 63 64 63 63 63 63 63 63 63 63 63 63 63 63 63 63 63 63 63 63 63 63 63 63 63 64 64 64 64 64 63 63 63 63 64 63 63 63 63 63 63 63 63 63 63 62 62
4397F2%J%jJ%%%%%%%%%%%%j%J%%%%j%J%j%%%%%%%J%%%%%%%%%%j%%%%%%%%%%%j%%%%%%%J%%
$$ 62 62 63 63 62 63 63 63 63 63 63 63 63 63 63 63 63 63 62 62 63 63 63 63 63 62 62 63 63 62 62 62 62 62 62 62 62 63 63 63 63 63 63 63 63 63 63 63 62 62 62 62 62 62 62 62 62 62 62 62 61 61 61 61 61 61 61 61 62 62 62
4389F2j%%%%%%%jJ%J%%%%%j%%%%%J%%%%%%j%%%%%%%%%%%J%%%%Jj%%%%%j%J%%%%j%%%J%J%%
$$ 62 61 61 61 61 61 61 61 61 60 61 61 62 62 62 62 62 62 61 61 61 61 61 61 62 62 62 62 62 62 62 61 61 61 61 61 61 61 61 61 61 61 61 62 62 62 62 62 63 62 62 62 62 62 62 61 61 62 62 62 62 62 61 61 61 61 62 62 63 63 63
4382F3%%%j%%%%%%%%%%%%%%%%%%%%%%%%j%J%j%j%%J%%%J%%j%%%%%%%%%%%%%jJ%%j%%%J%%%
$$ 63 63 63 63 62 62 62 62 62 62 62 62 62 62 62 62 62 62 62 62 62 62 62 62 62 62 62 62 62 61 61 62 62 61 61 60 60 60 61 61 61 61 62 62 62 61 61 61 61 61 61 61 61 61 61 61 61 61 61 60 61 61 61 60 60 60 60 61 61 61 61
4374F1%%%%%%%%%%%%%j%%%%%%%%%%J%%%%%%j%%%%J%jJ%%%j%%%%%%%%J%%%%%%%%%%%%%%j%J
$$ 61 61 61 61 61 61 61 61 61 61 61 61 61 61 60 60 60 60 60 60 60 60 60 60 60 61 61 61 61 61 61 61 60 60 60 60 60 61 61 60 61 61 61 61 60 60 60 60 60 60 60 60 60 61 61 61 61 61 61 61 61 61 61 61 61 61 61 61 60 60 61
4367F1%%%%%%%%%%%%%J%j%%%%%%%%%J%%j%j%J%%%%%%%J%%%%%%j%%%%%%%%%%%%j%%%%%%%%%
$$ 61 61 61 61 61 61 61 61 61 61 61 61 61 61 62 62 61 61 61 61 61 61 61 61 61 61 62 62 62 61 61 60 60 61 61 61 61 61 61 61 61 62 62 62 62 62 62 62 61 61 61 61 61 61 61 61 61 61 61 61 61 60 60 60 60 60 60 60 60 60 60
4360F0%%%J%%%%jJ%%%%%%%%%%%%%j%Jj%%%%%J%%%j%%%%%%j%%%%%%J%%%%%j%%%%%%%%%%%%%
$$ 60 60 60 60 61 61 61 61 61 60 61 61 61 61 61 61 61 61 61 61 61 61 61 61 60 60 61 60 60 60 60 60 60 61 61 61 61 60 60 60 60 60 60 60 59 59 59 59 59 59 59 60 60 60 60 60 60 59 59 59 59 59 59 59 59 59 59 59 59 59 59
4352E9j%%%%%J%j%%%j%%j%%%%%%jJ%%j%%%%j%%%%%%%%j%%%J%%%%%%%%%%j%%Jj%%%%%%%J%%
$$ 59 58 58 58 58 58 58 59 59 58 58 58 58 57 57 57 56 56 56 56 56 56 56 55 56 56 56 55 55 55 55 55 54 54 54 54 54 54 54 54 54 53 53 53 53 54 54 54 54 54 54 54 54 54 54 54 53 53 53 54 53 53 53 53 53 53 53 53 54 54 54
4345E4jjJ%J%%%%J%%%%%%%%%%J%j%%%J%J%%j%%%%%%J%%%j%J%%%JJ%%%j%%j%%J%j%%J%%%%%
$$ 54 53 52 53 53 54 54 54 54 54 55 55 55 55 55 55 55 55 55 55 55 56 56 55 55 55 55 56 56 57 57 57 56 56 56 56 56 56 56 57 57 57 57 56 56 57 57 57 57 58 59 59 59 59 58 58 58 57 57 57 58 58 57 57 57 58 58 58 58 58 58
4337E8%%%%%%%%J%%J%%j%%J%%%jJ%%%%%%%%%%J%%j%%%%%%Jj%%%%%%%%%Jj%%%%%%J%%%%%%%
$$ 58 58 58 58 58 58 58 58 58 59 59 59 60 60 60 59 59 59 60 60 60 60 59 60 60 60 60 60 60 60 60 60 60 60 61 61 61 60 60 60 60 60 60 60 61 60 60 60 60 60 60 60 60 60 60 61 60 60 60 60 60 60 60 61 61 61 61 61 61 61 61
4330F1j%%%%%%%%%%J%%j%%%%%%%%%%J%%%%%%%%%%%%%%%%%%%%J%j%%j%%%%%%%J%%%%%%%%%%
$$ 61 60 60 60 60 60 60 60 60 60 60 60 61 61 61 60 60 60 60 60 60 60 60 60 60 60 61 61 61 61 61 61 61 61 61 61 61 61 61 61 61 61 61 61 61 61 61 62 62 61 61 61 60 60 60 60 60 60 60 60 61 61 61 61 61 61 61 61 61 61 61
4323F1J%%%%j%%%%%%%%%%J%%j%%%%j%%J%%%%%%%J%%j%%%%%%%%%%%%%%%%%%%%j%%%%%%%%%%
$$ 61 62 62 62 62 62 61 61 61 61 61 61 61 61 61 61 61 62 62 62 61 61 61 61 61 60 60 60 61 61 61 61 61 61 61 61 62 62 62 61 61 61 61 61 61 61 61 61 61 61 61 61 61 61 61 61 61 61 61 61 60 60 60 60 60 60 60 60 60 60 60
4315F0%%%%%%%%%%%%%%%%%%%%%%%%%%Jj%%%%%J%j%%%%J%%%J%j%%%%%%%j%%%%J%%%%%j%%%%
$$ 60 60 60 60 60 60 60 60 60 60 60 60 60 60 60 60 60 60 60 60 60 60 60 60 60 60 60 61 60 60 60 60 60 60 61 61 60 60 60 60 60 61 61 61 61 62 62 61 61 61 61 61 61 61 61 60 60 60 60 60 61 61 61 61 61 61 60 60 60 60 60
4308F0%%%%%%%%%%%%%%%%%%%J%%%J%j%%%%%%J%%j%Jj%j%%J%%%%%%%%%%%%j%%%%%%Jj%%%%%
$$ 60 60 60 60 60 60 60 60 60 60 60 60 60 60 60 60 60 60 60 60 61 61 61 61 62 62 61 61 61 61 61 61 61 62 62 62 61 61 62 61 61 60 60 60 61 61 61 61 61 61 61 61 61 61 61 61 61 60 60 60 60 60 60 60 61 60 60 60 60 60 60
4300F0%%%%%%%%%J%%%%%%%%%%%%%%%%%%%%%%%%%%%%%%%%%%%%%%%%j%%%%%%%J%%%%%j%%%%J
$$ 60 60 60 60 60 60 60 60 60 60 61 61 61 61 61 61 61 61 61 61 61 61 61 61 61 61 61 61 61 61 61 61 61 61 61 61 61 61 61 61 61 61 61 61 61 61 61 61 61 61 61 60 60 60 60 60 60 60 60 61 61 61 61 61 61 60 60 60 60 60 61
4293F1%%%%%%j%%%%%%%%%%%%J%j%%%%%%%%%%%%%%%%%J%%%%%j%%%%%%%%%J%%%%%%%j%%%%J%
$$ 61 61 61 61 61 61 61 60 60 60 60 60 60 60 60 60 60 60 60 60 61 61 60 60 60 60 60 60 60 60 60 60 60 60 60 60 60 60 60 60 61 61 61 61 61 61 60 60 60 60 60 60 60 60 60 60 61 61 61 61 61 61 61 61 60 60 60 60 60 61 61
4285F1j%%%%%Jj%%jJ%%j%%%%%%J%j%%%J%%%j%J%%%%%%J%%%%%jJ%%j%%J%%%%%%%%%%%%%%%j
$$ 61 60 60 60 60 60 60 61 60 60 60 59 60 60 60 59 59 59 59 59 59 59 60 60 59 59 59 59 60 60 60 60 59 59 60 60 60 60 60 60 60 61 61 61 61 61 61 60 61 61 61 60 60 60 61 61 61 61 61 61 61 61 61 61 61 61 61 61 61 61 60
4278F0J%%%%%jJ%%J%%j%%%%%%%%%%%j%%%%%J%%%%%%%%%J%j%%J%%j%J%%%j%%%j%J%%J%j%%%
$$ 60 61 61 61 61 61 61 60 61 61 61 62 62 62 61 61 61 61 61 61 61 61 61 61 61 61 60 60 60 60 60 60 61 61 61 61 61 61 61 61 61 61 62 62 61 61 61 62 62 62 61 61 62 62 62 62 61 61 61 61 60 60 61 61 61 62 62 61 61 61 61
4271F1J%%%%%%%j%J%%%%%%j%%%%%%%%%J%%%%%%%%%%j%%%%%%%%%J%Jj%%j%%%J%%J%j%%%%j%
$$ 61 62 62 62 62 62 62 62 62 61 61 62 62 62 62 62 62 62 61 61 61 61 61 61 61 61 61 61 62 62 62 62 62 62 62 62 62 62 62 61 61 61 61 61 61 61 61 61 61 62 62 63 62 62 62 61 61 61 61 62 62 62 63 63 62 62 62 62 62 61 61
4263F1%%J%%j%%%%%%%%%%%J%j%%J%j%%%%%%%%%%%%%%%%%%%%J%%%j%%%J%%%%%%%j%%%Jj%%%
$$ 61 61 61 62 62 62 61 61 61 61 61 61 61 61 61 61 61 61 62 62 61 61 61 62 62 61 61 61 61 61 61 61 61 61 61 61 61 61 61 61 61 61 61 61 61 61 62 62 62 62 61 61 61 61 62 62 62 62 62 62 62 62 61 61 61 61 62 61 61 61 61
4256F1%J%%%%%%%%%j%%%%%%J%j%J%%%%j%J%%%%j%J%%%J%%jj%%J%%J%%j%%%%%%%%%%j%Jj%%
$$ 61 61 62 62 62 62 62 62 62 62 62 62 61 61 61 61 61 61 61 62 62 61 61 62 62 62 62 62 61 61 62 62 62 62 62 61 61 62 62 62 62 63 63 63 62 61 61 61 62 62 62 63 63 63 62 62 62 62 62 62 62 62 62 62 62 61 61 62 61 61 61
4248F1%%J%%%%%J%%j%%%%jJJj%%%%%%%%%%%%Jj%%%%%%Jj%%%%%%%%%%%%%%%%%%%%%%%J%%%%
$$ 61 61 61 62 62 62 62 62 62 63 63 63 62 62 62 62 62 61 62 63 62 62 62 62 62 62 62 62 62 62 62 62 62 63 62 62 62 62 62 62 62 63 62 62 62 62 62 62 62 62 62 62 62 62 62 62 62 62 62 62 62 62 62 62 62 62 63 63 63 63 63
4241F3%j%%%%%%%J%%%%%%j%%%%%%J%%j%J%%%%%J%%%%%%%%jJ%j%%%%%%%J%j%%%%%Jj%%J%j%
$$ 63 63 62 62 62 62 62 62 62 62 63 63 63 63 63 63 63 62 62 62 62 62 62 62 63 63 63 62 62 63 63 63 63 63 63 64 64 64 64 64 64 64 64 64 63 64 64 63 63 63 63 63 63 63 63 64 64 63 63 63 63 63 63 64 63 63 63 64 64 63 63
4234F3%%%%%%%%%%%%%%J%%%%%%%J%%%%%%j%%%%%%%J%j%%%%%%%%J%%%%%%j%%%%Jj%%J%%%%%
$$ 63 63 63 63 63 63 63 63 63 63 63 63 63 63 63 64 64 64 64 64 64 64 64 65 65 65 65 65 65 65 64 64 64 64 64 64 64 64 65 65 64 64 64 64 64 64 64 64 64 65 65 65 65 65 65 65 64 64 64 64 64 65 64 64 64 65 65 65 65 65 65
4226F5%%j%Jj%%%%%J%%%%%%%%%%%%J%%%%%%%%%J%%%%j%%%%%%%%j%%%%%%%%%%%%%J%%%%%%%
$$ 65 65 65 64 64 65 64 64 64 64 64 64 65 65 65 65 65 65 65 65 65 65 65 65 65 66 66 66 66 66 66 66 66 66 66 67 67 67 67 67 66 66 66 66 66 66 66 66 66 65 65 65 65 65 65 65 65 65 65 65 65 65 65 66 66 66 66 66 66 66 66
4219F6%J%j%%%%%%J%%%Jj%%%%%%%%%%%%%%%%%%%%%J%%%%%%%jJ%%%%%%%J%%%%%%%%j%J%J%%
$$ 66 66 67 67 66 66 66 66 66 66 66 67 67 67 67 68 67 67 67 67 67 67 67 67 67 67 67 67 67 67 67 67 67 67 67 67 67 67 68 68 68 68 68 68 68 68 67 68 68 68 68 68 68 68 68 69 69 69 69 69 69 69 69 69 68 68 69 69 70 70 70
4211G0%%%%%%%%%J%j%%%%%%J%%%%%%%%J%%%J%%%%%%%Jj%%%%J%%%%%%%%%%J%%J%%%%%%%%%%
$$ 70 70 70 70 70 70 70 70 70 70 71 71 70 70 70 70 70 70 70 71 71 71 71 71 71 71 71 71 72 72 72 72 73 73 73 73 73 73 73 73 74 73 73 73 73 73 74 74 74 74 74 74 74 74 74 74 74 75 75 75 76 76 76 76 76 76 76 76 76 76 76
4204G6%%%%J%%%%J%Jj%%%%J%%%%%%%%%%J%%%J%jJ%%%%j%%J%%%%%j%J%%%%jJ%%%j%%jJ%%%%
$$ 76 76 76 76 76 77 77 77 77 77 78 78 79 78 78 78 78 78 79 79 79 79 79 79 79 79 79 79 79 80 80 80 80 81 81 80 81 81 81 81 81 80 80 80 81 81 81 81 81 81 80 80 81 81 81 81 81 80 81 81 81 81 80 80 80 79 80 80 80 80 80
4196H0%%%%%j%%Jj%%j%%%j%%%%%%%%%%%%j%%%%%%%%j%jJ%%%%%%j%%%%%j%%%%%%%%%%%%j%%
$$ 80 80 80 80 80 80 79 79 79 80 79 79 79 78 78 78 78 77 77 77 77 77 77 77 77 77 77 77 77 77 76 76 76 76 76 76 76 76 76 75 75 74 75 75 75 75 75 75 75 74 74 74 74 74 74 73 73 73 73 73 73 73 73 73 73 73 73 73 72 72 72
4189G2%%%%%%%%%%%%%%%%%%j%%%%jJ%%%j%%%j%J%%%j%%%%%%%%%%%%%%%J%%%j%%%%%%%%%%%
$$ 72 72 72 72 72 72 72 72 72 72 72 72 72 72 72 72 72 72 72 71 71 71 71 71 70 71 71 71 71 70 70 70 70 69 69 70 70 70 70 69 69 69 69 69 69 69 69 69 69 69 69 69 69 69 69 70 70 70 70 69 69 69 69 69 69 69 69 69 69 69 69
4182F9%J%%%%%j%%j%Jj%%%%%%%%J%%%%%%%%%%j%J%%%jJ%%%%%%%j%%J%%%%%%J%%%%j%%J%j%
$$ 69 69 70 70 70 70 70 70 69 69 69 68 68 69 68 68 68 68 68 68 68 68 68 69 69 69 69 69 69 69 69 69 69 69 68 68 69 69 69 69 68 69 69 69 69 69 69 69 69 68 68 68 69 69 69 69 69 69 69 70 70 70 70 70 69 69 69 70 70 69 69
4174F9%%%%%%%%%%%J%%j%jJ%J%%%%%%%jJ%j%J%%%%%%Jj%J%%%%j%%%%%%j%%%%%J%j%%%J%%%
$$ 69 69 69 69 69 69 69 69 69 69 69 69 70 70 70 69 69 68 69 69 70 70 70 70 70 70 70 70 69 70 70 69 69 70 70 70 70 70 70 70 71 70 70 71 71 71 71 71 70 70 70 70 70 70 70 69 69 69 69 69 69 70 70 69 69 69 69 70 70 70 70
4167G0%%%%%j%%%%%%%%%%%%%%%%j%J%%j%%J%%%%%j%%%%%%%Jj%%%%jJ%%%%%%%%%%%%J%%j%%
$$ 70 70 70 70 70 70 69 69 69 69 69 69 69 69 69 69 69 69 69 69 69 69 69 68 68 69 69 69 68 68 68 69 69 69 69 69 69 68 68 68 68 68 68 68 68 69 68 68 68 68 68 67 68 68 68 68 68 68 68 68 68 68 68 68 68 69 69 69 68 68 68
4159F8%J%j%%%%%%J%%j%%%%J%%%%j%%%%%%%%j%%J%%%%%%%%Jj%%%j%%%J%%%%%%%%%%%Jj%%%
$$ 68 68 69 69 68 68 68 68 68 68 68 69 69 69 68 68 68 68 68 69 69 69 69 69 68 68 68 68 68 68 68 68 68 67 67 67 68 68 68 68 68 68 68 68 68 69 68 68 68 68 67 67 67 67 68 68 68 68 68 68 68 68 68 68 68 68 69 68 68 68 68
4152F8%%%%%%%%%%%j%%%%jJ%%%%j%%%J%%%%%%%%%J%%j%jJj%%%%%%%%%%%%%J%%%%j%%%%%J%
$$ 68 68 68 68 68 68 68 68 68 68 68 68 67 67 67 67 67 66 67 67 67 67 67 66 66 66 66 67 67 67 67 67 67 67 67 67 67 68 68 68 67 67 66 67 66 66 66 66 66 66 66 66 66 66 66 66 66 66 67 67 67 67 67 66 66 66 66 66 66 67 67
4145F7%%j%%%%%%%%%%J%j%j%%%%%Jj%Jj%%%%J%j%%%%%%%%%%%%%j%%JJ%%%%%%%%jJ%%%%j%J
$$ 67 67 67 66 66 66 66 66 66 66 66 66 66 66 67 67 66 66 65 65 65 65 65 65 66 65 65 66 65 65 65 65 65 66 66 65 65 65 65 65 65 65 65 65 65 65 65 65 65 64 64 64 65 66 66 66 66 66 66 66 66 66 65 66 66 66 66 66 65 65 66
4137F6%%%%%%%%j%%%%%Jj%%%%j%%%%J%%j%%%J%%%%%%j%%%%%%%%%%%%%%%%%%%%%%%Jj%%%%%
$$ 66 66 66 66 66 66 66 66 66 65 65 65 65 65 65 66 65 65 65 65 65 64 64 64 64 64 65 65 65 64 64 64 64 65 65 65 65 65 65 65 64 64 64 64 64 64 64 64 64 64 64 64 64 64 64 64 64 64 64 64 64 64 64 64 65 64 64 64 64 64 64
4130F4%j%%%%J%%%j%J%%%%%j%%%%%%J%%%j%%%%%%%%Jj%%%J%%%%%j%J%%%%%%%%j%%%%%%%%j
$$ 64 64 63 63 63 63 63 64 64 64 64 63 63 64 64 64 64 64 64 63 63 63 63 63 63 63 64 64 64 64 63 63 63 63 63 63 63 63 63 64 63 63 63 63 64 64 64 64 64 64 63 63 64 64 64 64 64 64 64 64 64 63 63 63 63 63 63 63 63 63 62
4122F2%%%%%%J%%%%%j%%%Jj%%%%%%J%%%%%%%%%%jJ%%%%j%%%%%%%%%%%JjJ%j%%%%%j%%J%j%
$$ 62 62 62 62 62 62 62 63 63 63 63 63 63 62 62 62 62 63 62 62 62 62 62 62 62 63 63 63 63 63 63 63 63 63 63 63 62 63 63 63 63 63 62 62 62 62 62 62 62 62 62 62 62 62 63 62 63 63 62 62 62 62 62 62 61 61 61 62 62 61 61
4115F1J%%%%%%%%%%%%%%%%%j%%%%%%%%Jjj%%%%J%%%%%J%%j%%%%%%JjJ%j%%%%%%%%%%%%%%%
$$ 61 62 62 62 62 62 62 62 62 62 62 62 62 62 62 62 62 62 62 61 61 61 61 61 61 61 61 61 62 61 60 60 60 60 60 61 61 61 61 61 61 62 62 62 61 61 61 61 61 61 61 62 61 62 62 61 61 61 61 61 61 61 61 61 61 61 61 61 61 61 61
4107F1%%%%%%%%%%%j%J%%%%J%%j%%Jj%%%%%%%%%%%%%%%j%%%%%%J%%%%%j%%%%%%%%j%%%J%%
$$ 61 61 61 61 61 61 61 61 61 61 61 61 60 60 61 61 61 61 61 62 62 62 61 61 61 62 61 61 61 61 61 61 61 61 61 61 61 61 61 61 61 61 60 60 60 60 60 60 60 61 61 61 61 61 61 60 60 60 60 60 60 60 60 60 59 59 59 59 60 60 60
4100F0j%%%Jj%%%%J%%%%%%%%%%%%%%j%J%%j%%%J%%%j%%%%%%%%J%%%j%J%%j%%%%%%%%%%%%%
$$ 60 59 59 59 59 60 59 59 59 59 59 60 60 60 60 60 60 60 60 60 60 60 60 60 60 60 59 59 60 60 60 59 59 59 59 60 60 60 60 59 59 59 59 59 59 59 59 59 60 60 60 60 59 59 60 60 60 59 59 59 59 59 59 59 59 59 59 59 59 59 59
4093E9j%%%%J%%J%jj%%%%J%%%%%%%%JjJ%j%%%%%%%j%%%%%%%%Jj%%%%%%%%%J%%%%%%%%%%%%
$$ 59 58 58 58 58 58 59 59 59 60 60 59 58 58 58 58 58 59 59 59 59 59 59 59 59 59 60 59 60 60 59 59 59 59 59 59 59 59 58 58 58 58 58 58 58 58 58 59 58 58 58 58 58 58 58 58 58 58 59 59 59 59 59 59 59 59 59 59 59 59 59
4085E9%%%j%%%%%%%%%%%%%%%J%%%%%%%%%%%j%%J%%%%%%%jJ%%%%j%%Jj%%%%%%%%%J%j%%%%%
$$ 59 59 59 59 58 58 58 58 58 58 58 58 58 58 58 58 58 58 58 58 59 59 59 59 59 59 59 59 59 59 59 59 58 58 58 59 59 59 59 59 59 59 59 58 59 59 59 59 59 58 58 58 59 58 58 58 58 58 58 58 58 58 58 59 59 58 58 58 58 58 58
4078E8%%%%%%%J%%%%%%%j%%%%J%%j%%%%%%%%%%%%%%%j%%%J%%%%%%%%%%%j%%%%%%%%%%%%J%
$$ 58 58 58 58 58 58 58 58 59 59 59 59 59 59 59 59 58 58 58 58 58 59 59 59 58 58 58 58 58 58 58 58 58 58 58 58 58 58 58 58 57 57 57 57 58 58 58 58 58 58 58 58 58 58 58 58 57 57 57 57 57 57 57 57 57 57 57 57 57 58 58
4070E8%j%Jj%%%%%%J%%%%%%%%j%j%J%%%%%%%%%%%%%%%%%%%%%%%%%%%jJ%%%%%%%%Jj%%jJ%%
$$ 58 58 57 57 58 57 57 57 57 57 57 57 58 58 58 58 58 58 58 58 58 57 57 56 56 57 57 57 57 57 57 57 57 57 57 57 57 57 57 57 57 57 57 57 57 57 57 57 57 57 57 57 57 56 57 57 57 57 57 57 57 57 57 58 57 57 57 56 57 57 57
4063E7%%%%%%jJ%%%%%%%%%%%%%%%%%%%%Jj%%j%%%%%%%%%%J%%%%%%%%%%jJ%%j%%%%J%%%%%%
$$ 57 57 57 57 57 57 57 56 57 57 57 57 57 57 57 57 57 57 57 57 57 57 57 57 57 57 57 57 57 58 57 57 57 56 56 56 56 56 56 56 56 56 56 56 57 57 57 57 57 57 57 57 57 57 57 56 57 57 57 56 56 56 56 56 57 57 57 57 57 57 57
4056E7%%%%%%%%%j%J%%%%%%%j%%%%%%%%%%%%%%%%%%%J%%%%%%j%%j%%%%%%%%%Jj%J%%%%%%%
$$ 57 57 57 57 57 57 57 57 57 57 56 56 57 57 57 57 57 57 57 57 56 56 56 56 56 56 56 56 56 56 56 56 56 56 56 56 56 56 56 56 57 57 57 57 57 57 57 56 56 56 55 55 55 55 55 55 55 55 55 55 56 55 55 56 56 56 56 56 56 56 56
4048E6%%%%%j%%J%%%%%%j%%%%%%%J%%%%%%%j%%%%J%%%j%%%%J%%j%%%%%J%j%J%%%%jJ%%%%%
$$ 56 56 56 56 56 56 55 55 55 56 56 56 56 56 56 56 55 55 55 55 55 55 55 55 56 56 56 56 56 56 56 56 55 55 55 55 55 56 56 56 56 55 55 55 55 55 56 56 56 55 55 55 55 55 55 56 56 55 55 56 56 56 56 56 55 56 56 56 56 56 56
4041E6j%%%%%%j%%J%J%%%%%%%J%j%%%j%%J%jJ%%%%%j%%J%%%%%J%%%j%%%%%%%%%%%%%%%%%%
$$ 56 55 55 55 55 55 55 55 54 54 54 55 55 56 56 56 56 56 56 56 56 57 57 56 56 56 56 55 55 55 56 56 55 56 56 56 56 56 56 55 55 55 56 56 56 56 56 56 57 57 57 57 56 56 56 56 56 56 56 56 56 56 56 56 56 56 56 56 56 56 56
4033E6jJ%%%%%J%j%%%%%%Jj%%%%%%j%%%%J%%Jj%%%%%%%%J%%%%j%%%%%j%%%%%%%%%J%%%%J%
$$ 56 55 56 56 56 56 56 56 57 57 56 56 56 56 56 56 56 57 56 56 56 56 56 56 56 55 55 55 55 55 56 56 56 57 56 56 56 56 56 56 56 56 56 57 57 57 57 57 56 56 56 56 56 56 55 55 55 55 55 55 55 55 55 55 56 56 56 56 56 57 57
4026E7%%%%%%%j%%%%%%%%%%%%%%%%%%%J%%%%%%%%%%%%%%j%%%%%%j%%J%%%%%%%%j%%J%J%%%
$$ 57 57 57 57 57 57 57 57 56 56 56 56 56 56 56 56 56 56 56 56 56 56 56 56 56 56 56 56 57 57 57 57 57 57 57 57 57 57 57 57 57 57 57 56 56 56 56 56 56 56 55 55 55 56 56 56 56 56 56 56 56 56 55 55 55 56 56 57 57 57 57
4018E7%%j%%%%%%%%%%%%%%%%j%%%%%J%%%%%%%%%%%%%%%Jj%%J%%%%j%%%%%%%%%%%%%%%%%%%
$$ 57 57 57 56 56 56 56 56 56 56 56 56 56 56 56 56 56 56 56 56 55 55 55 55 55 55 56 56 56 56 56 56 56 56 56 56 56 56 56 56 56 56 57 56 56 56 57 57 57 57 57 56 56 56 56 56 56 56 56 56 56 56 56 56 56 56 56 56 56 56 56
4011E6J%%%%%%%%%%%%j%%Jj%%%%%%%%%%%%%%%%%%%%%%%%Jj%%%%%%%%%%%%j%%%%%J%%%j%%%
$$ 56 57 57 57 57 57 57 57 57 57 57 57 57 57 56 56 56 57 56 56 56 56 56 56 56 56 56 56 56 56 56 56 56 56 56 56 56 56 56 56 56 56 56 57 56 56 56 56 56 56 56 56 56 56 56 56 56 55 55 55 55 55 55 56 56 56 56 55 55 55 55
4004E5%%%j%%J%%%%%J%%%%%%%%%%%%%%j%J%%%%%%%%%%%%j%%Jj%%%%%Jj%%%%%%%%%%J%%%%%
$$ 55 55 55 55 54 54 54 55 55 55 55 55 55 56 56 56 56 56 56 56 56 56 56 56 56 56 56 56 55 55 56 56 56 56 56 56 56 56 56 56 56 56 56 55 55 55 56 55 55 55 55 55 55 56 55 55 55 55 55 55 55 55 55 55 55 56 56 56 56 56 56
3996E6j%%%%%J%%j%J%%%%jJj%%J%j%J%%%j%%%%%%J%%%%%%%j%%J%%%%%%%%%j%%%%J%%%j%%%
$$ 56 55 55 55 55 55 55 56 56 56 55 55 56 56 56 56 56 55 56 55 55 55 56 56 55 55 56 56 56 56 55 55 55 55 55 55 55 56 56 56 56 56 56 56 56 55 55 55 56 56 56 56 56 56 56 56 56 56 55 55 55 55 55 56 56 56 56 55 55 55 55
3989E5%J%%%%%%%j%%J%%%%%%j%%%%%%%J%%%%%%%j%%%%%%%%%%%%J%%%%j%%%%%%%%%%j%%J%%
$$ 55 55 56 56 56 56 56 56 56 56 55 55 55 56 56 56 56 56 56 56 55 55 55 55 55 55 55 55 56 56 56 56 56 56 56 56 55 55 55 55 55 55 55 55 55 55 55 55 55 56 56 56 56 56 55 55 55 55 55 55 55 55 55 55 55 54 54 54 55 55 55
3981E5%%%J%%j%%%%%%J%%%%%%j%%%J%%%%j%%%J%j%%jJ%%jJ%%%J%%%%jJ%jJ%%%%j%%J%%j%%
$$ 55 55 55 55 56 56 56 55 55 55 55 55 55 55 56 56 56 56 56 56 56 55 55 55 55 56 56 56 56 56 55 55 55 55 56 56 55 55 55 54 55 55 55 54 55 55 55 55 56 56 56 56 56 55 56 56 55 56 56 56 56 56 55 55 55 56 56 56 55 55 55
3974E5%%%%%%%J%jJ%%%%jJ%%%%%%%%%%%%j%%%%%%J%%%%%%%%j%%%%%%%%%%%j%%J%%%%%%%%%
$$ 55 55 55 55 55 55 55 55 56 56 55 56 56 56 56 56 55 56 56 56 56 56 56 56 56 56 56 56 56 56 55 55 55 55 55 55 55 56 56 56 56 56 56 56 56 56 55 55 55 55 55 55 55 55 55 55 55 55 54 54 54 55 55 55 55 55 55 55 55 55 55
3967E5%%%%%%%%Jj%%J%%%%%%j%%%J%%%%%%%%j%%%%%j%%%%%J%%%%%%J%%%%%%%%%j%%%%%%%%
$$ 55 55 55 55 55 55 55 55 55 56 55 55 55 56 56 56 56 56 56 56 55 55 55 55 56 56 56 56 56 56 56 56 56 55 55 55 55 55 55 54 54 54 54 54 54 55 55 55 55 55 55 55 56 56 56 56 56 56 56 56 56 56 55 55 55 55 55 55 55 55 55
3959E5%%%%%%%%%%%%%%%%J%%j%%%%j%J%%%%%%%Jj%%Jj%%%%%%%%%%%%%j%%J%%%%%%%%%J%%j
$$ 55 55 55 55 55 55 55 55 55 55 55 55 55 55 55 55 55 56 56 56 55 55 55 55 55 54 54 55 55 55 55 55 55 55 55 56 55 55 55 56 55 55 55 55 55 55 55 55 55 55 55 55 55 55 54 54 54 55 55 55 55 55 55 55 55 55 55 56 56 56 55
3952E5%%Jj%%%%%%%%%%%%%j%%%%%%%%J%%%%%%%%j%%%J%Jj%%%%%%%%%%%%%%%%%%%%%%%%%%%
$$ 55 55 55 56 55 55 55 55 55 55 55 55 55 55 55 55 55 55 54 54 54 54 54 54 54 54 54 55 55 55 55 55 55 55 55 55 54 54 54 54 55 55 56 55 55 55 55 55 55 55 55 55 55 55 55 55 55 55 55 55 55 55 55 55 55 55 55 55 55 55 55
3944E5jJ%%%%%%%%j%%%J%%%%%j%%J%%%%%%%%Jj%%%J%%%%%%j%j%%%%%%J%%%%%%%%%%%%%%%%
$$ 55 54 55 55 55 55 55 55 55 55 55 54 54 54 54 55 55 55 55 55 55 54 54 54 55 55 55 55 55 55 55 55 55 56 55 55 55 55 56 56 56 56 56 56 56 55 55 54 54 54 54 54 54 54 55 55 55 55 55 55 55 55 55 55 55 55 55 55 55 55 55
3937E5%j%%%%%%%J%%%%%%%%%j%%%%%%%%%%%%%%%%%%%%%%%%%%%%%%%%%j%%%J%%%%%%%%%%%%
$$ 55 55 54 54 54 54 54 54 54 54 55 55 55 55 55 55 55 55 55 55 54 54 54 54 54 54 54 54 54 54 54 54 54 54 54 54 54 54 54 54 54 54 54 54 54 54 54 54 54 54 54 54 54 54 53 53 53 53 54 54 54 54 54 54 54 54 54 54 54 54 54
3929E4jJ%%%%%J%j%%%%%%%%%%%%%%j%J%%%%%%J%%%%%%%%%%jj%%%JJ%%%%%%%%%j%%%%J%%%j
$$ 54 53 54 54 54 54 54 54 55 55 54 54 54 54 54 54 54 54 54 54 54 54 54 54 54 53 53 54 54 54 54 54 54 54 55 55 55 55 55 55 55 55 55 55 55 54 53 53 53 53 54 55 55 55 55 55 55 55 55 55 55 54 54 54 54 54 55 55 55 55 54
3922E4%%%%J%%j%%%%%%%%J%%%j%%%J%%%%%%%%%%j%%%J%%%j%%%%%%%J%J%%%%j%%j%%%%%J%%
$$ 54 54 54 54 54 55 55 55 54 54 54 54 54 54 54 54 54 55 55 55 55 54 54 54 54 55 55 55 55 55 55 55 55 55 55 55 54 54 54 54 55 55 55 55 54 54 54 54 54 54 54 54 55 55 56 56 56 56 56 55 55 55 54 54 54 54 54 54 55 55 55
3915E5%%%%%%%%%%%%%%%%%%%%%%%j%%%JJ%%j%%%j%J%%j%%%%%%%J%j%%%%%%%%%%%%%%%%%%%
$$ 55 55 55 55 55 55 55 55 55 55 55 55 55 55 55 55 55 55 55 55 55 55 55 55 54 54 54 54 55 56 56 56 55 55 55 55 54 54 55 55 55 54 54 54 54 54 54 54 54 55 55 54 54 54 54 54 54 54 54 54 54 54 54 54 54 54 54 54 54 54 54
3907E4J%%%%%%j%%%J%%%%%%%%%%%%%%%j%%J%%%%j%%%%%%%%%J%%%%%%%%%%J%%%%%%%%%j%%%
$$ 54 55 55 55 55 55 55 55 54 54 54 54 55 55 55 55 55 55 55 55 55 55 55 55 55 55 55 55 54 54 54 55 55 55 55 55 54 54 54 54 54 54 54 54 54 54 55 55 55 55 55 55 55 55 55 55 55 56 56 56 56 56 56 56 56 56 56 55 55 55 55
3900E5%%%%%%%%%%j%%%%%%%J%%%%%%%%%%Jj%%%jJ%%%%%%%%%%%%j%%%J%%%%%%%%%%%%%j%%%
$$ 55 55 55 55 55 55 55 55 55 55 55 54 54 54 54 54 54 54 54 55 55 55 55 55 55 55 55 55 55 55 56 55 55 55 55 54 55 55 55 55 55 55 55 55 55 55 55 55 55 54 54 54 54 55 55 55 55 55 55 55 55 55 55 55 55 55 55 54 54 54 54
3892E4%%%J%%%%%%j%%%%%J%%%%%%%%Jj%%%%%%%%j%%J%%%%%%%%%Jj%%%%%%%%%%%%%%j%J%jJ
$$ 54 54 54 54 55 55 55 55 55 55 55 54 54 54 54 54 54 55 55 55 55 55 55 55 55 55 56 55 55 55 55 55 55 55 55 55 54 54 54 55 55 55 55 55 55 55 55 55 55 56 55 55 55 55 55 55 55 55 55 55 55 55 55 55 55 54 54 55 55 54 55
3885E5%%%%%%%%%%%%%%%%%%J%%%j%%J%j%%%%%%%%%%%%J%%%%%jJ%%%%j%%j%%%%J%%%%%%%%%
$$ 55 55 55 55 55 55 55 55 55 55 55 55 55 55 55 55 55 55 55 56 56 56 56 55 55 55 56 56 55 55 55 55 55 55 55 55 55 55 55 55 55 56 56 56 56 56 56 55 56 56 56 56 56 55 55 55 54 54 54 54 54 55 55 55 55 55 55 55 55 55 55
3878E5%%%%%%%j%%%%%%%J%%%%%%%%%%%%%%%%%%%%%jJ%%j%%J%%%%%%%j%%%J%%%j%J%%%jJ%%
$$ 55 55 55 55 55 55 55 55 54 54 54 54 54 54 54 54 55 55 55 55 55 55 55 55 55 55 55 55 55 55 55 55 55 55 55 55 55 55 54 55 55 55 54 54 54 55 55 55 55 55 55 55 55 54 54 54 54 55 55 55 55 54 54 55 55 55 55 54 55 55 55
3870E5%%%%%%Jj%%%%j%J%%%%%Jj%%%%%%%%%%%%j%%%%%%%%%%%%%%jJ%%J%%jJ%%%%%j%%%%J%
$$ 55 55 55 55 55 55 55 56 55 55 55 55 55 54 54 55 55 55 55 55 55 56 55 55 55 55 55 55 55 55 55 55 55 55 55 54 54 54 54 54 54 54 54 54 54 54 54 54 54 54 53 54 54 54 55 55 55 54 55 55 55 55 55 55 54 54 54 54 54 55 55
3863E5j%%%J%%%%%j%%%%J%%%%%%%%%j%%%%%%%%%%%%%J%j%%%%%%%%%%%%%%%%J%j%%%%J%j%%
$$ 55 54 54 54 54 55 55 55 55 55 55 54 54 54 54 54 55 55 55 55 55 55 55 55 55 55 54 54 54 54 54 54 54 54 54 54 54 54 54 54 55 55 54 54 54 54 54 54 54 54 54 54 54 54 54 54 54 54 54 55 55 54 54 54 54 54 55 55 54 54 54
3855E4%%%%%%%%%%%Jj%%%%J%%%%%j%%%%%%%%%%J%J%j%j%%%%%J%%%j%%j%J%%%%%J%%%%%j%%
$$ 54 54 54 54 54 54 54 54 54 54 54 54 55 54 54 54 54 54 55 55 55 55 55 55 54 54 54 54 54 54 54 54 54 54 54 55 55 56 56 55 55 54 54 54 54 54 54 55 55 55 55 54 54 54 53 53 54 54 54 54 54 54 55 55 55 55 55 55 54 54 54
3848E4%%%jJ%%%jJ%%jJ%%%%%%%%%%%%%%J%%%%%%%%%%j%%%j%%%%%%Jj%J%%%%%%jJ%%%%%%%%
$$ 54 54 54 54 53 54 54 54 54 53 54 54 54 53 54 54 54 54 54 54 54 54 54 54 54 54 54 54 54 55 55 55 55 55 55 55 55 55 55 55 54 54 54 54 53 53 53 53 53 53 53 54 53 53 54 54 54 54 54 54 54 53 54 54 54 54 54 54 54 54 54
3840E4%%%%%J%%%%%%%%%%%j%%%%j%%%%%%%%%%J%%%%%%%J%%%%%%%%%%j%%%Jj%%jJ%%J%jJ%%
$$ 54 54 54 54 54 54 55 55 55 55 55 55 55 55 55 55 55 55 54 54 54 54 54 53 53 53 53 53 53 53 53 53 53 53 54 54 54 54 54 54 54 54 55 55 55 55 55 55 55 55 55 55 55 54 54 54 54 55 54 54 54 53 54 54 54 55 55 54 55 55 55
3833E5%j%%jJ%%%J%%%J%%j%%%%%%%%%j%%J%%%%%%%%%%%%j%%%J%%%%%%j%%%%%%%%%%%%%%%%
$$ 55 55 54 54 54 53 54 54 54 54 55 55 55 55 56 56 56 55 55 55 55 55 55 55 55 55 55 54 54 54 55 55 55 55 55 55 55 55 55 55 55 55 55 54 54 54 54 55 55 55 55 55 55 55 54 54 54 54 54 54 54 54 54 54 54 54 54 54 54 54 54
3826E4%%%J%%%%%j%%J%%%%Jj%%j%%%%%Jj%%%J%%%%%%%%%%%%j%%%%%%J%%%%%%%%j%%%J%%j%
$$ 54 54 54 54 55 55 55 55 55 55 54 54 54 55 55 55 55 55 56 55 55 55 54 54 54 54 54 54 55 54 54 54 54 55 55 55 55 55 55 55 55 55 55 55 55 55 54 54 54 54 54 54 54 55 55 55 55 55 55 55 55 55 54 54 54 54 55 55 55 54 54
3818E4%%%J%j%%%J%%%%%jJ%%%%%%%%%%j%%%J%%%%%%j%%%%%%%%J%%%%%%J%%%jj%%%%%%%%J%
$$ 54 54 54 54 55 55 54 54 54 54 55 55 55 55 55 55 54 55 55 55 55 55 55 55 55 55 55 55 54 54 54 54 55 55 55 55 55 55 55 54 54 54 54 54 54 54 54 54 55 55 55 55 55 55 55 56 56 56 56 55 54 54 54 54 54 54 54 54 54 55 55
3811E5%%%%%%%%%%%%%%%%J%%%j%J%%%jJ%%j%%%%j%%%%%%j%%J%%%%%%%%%%%%%%%%Jj%%%%%%
$$ 55 55 55 55 55 55 55 55 55 55 55 55 55 55 55 55 55 56 56 56 56 55 55 56 56 56 56 55 56 56 56 55 55 55 55 55 54 54 54 54 54 54 54 53 53 53 54 54 54 54 54 54 54 54 54 54 54 54 54 54 54 54 54 55 54 54 54 54 54 54 54
3803E4%%%%%%J%j%%%%%%%%%JjJ%%%%%j%%J%%%%%j%J%%%%j%%%%%%%%%%%%%J%%%%%%%%%%%%%
$$ 54 54 54 54 54 54 54 55 55 54 54 54 54 54 54 54 54 54 54 55 54 55 55 55 55 55 55 54 54 54 55 55 55 55 55 55 54 54 55 55 55 55 55 54 54 54 54 54 54 54 54 54 54 54 54 54 54 55 55 55 55 55 55 55 55 55 55 55 55 55 55
3796E5%j%%%%%%%%%%Jj%%%%%%%J%%%%%j%%%%%JJ%j%j%%%%%%j%%%J%%%%%%%%J%Jj%%%j%%%J
$$ 55 55 54 54 54 54 54 54 54 54 54 54 54 55 54 54 54 54 54 54 54 54 55 55 55 55 55 55 54 54 54 54 54 54 55 56 56 55 55 54 54 54 54 54 54 54 53 53 53 53 54 54 54 54 54 54 54 54 54 55 55 56 55 55 55 55 54 54 54 54 55
3788E5jJ%j%%%%%%%%%%%J%j%%%J%j%%%%%%J%jJ%jJj%J%%%%j%%%%%%%J%%j%j%%J%%%%%%%%%
$$ 55 54 55 55 54 54 54 54 54 54 54 54 54 54 54 54 55 55 54 54 54 54 55 55 54 54 54 54 54 54 54 55 55 54 55 55 54 55 54 54 55 55 55 55 55 54 54 54 54 54 54 54 54 55 55 55 54 54 53 53 53 54 54 54 54 54 54 54 54 54 54
3781E4%%%%%Jj%%%%jJ%%%j%J%%%%%%%%Jj%%j%%%%J%%%%J%j%%%%%%%J%%j%%%%%J%j%%%%%%%
$$ 54 54 54 54 54 54 55 54 54 54 54 54 53 54 54 54 54 53 53 54 54 54 54 54 54 54 54 54 55 54 54 54 53 53 53 53 53 54 54 54 54 54 55 55 54 54 54 54 54 54 54 54 55 55 55 54 54 54 54 54 54 55 55 54 54 54 54 54 54 54 54
3774E4%%%%%%%%J%%%j%%%%J%%%j%%%%%%%J%%jJ%%%%%%%j%%%%%%%%%J%%%%j%%%%%Jj%%%%%J
$$ 54 54 54 54 54 54 54 54 54 55 55 55 55 54 54 54 54 54 55 55 55 55 54 54 54 54 54 54 54 54 55 55 55 54 55 55 55 55 55 55 55 55 54 54 54 54 54 54 54 54 54 54 55 55 55 55 55 54 54 54 54 54 54 55 54 54 54 54 54 54 55
3766E5j%%%%%%J%%j%%%%%%%%%%%%%%%%J%%%%%%%%jJ%%%%%%%%%%%%%%%%%%%%%%%%%jJ%%%%%
$$ 55 54 54 54 54 54 54 54 55 55 55 54 54 54 54 54 54 54 54 54 54 54 54 54 54 54 54 54 55 55 55 55 55 55 55 55 55 54 55 55 55 55 55 55 55 55 55 55 55 55 55 55 55 55 55 55 55 55 55 55 55 55 55 55 54 55 55 55 55 55 55
3759E5%j%Jj%%J%j%%%%jJ%%%%%%%J%%%%%j%%%%%%j%%%%%%%%%%%jJ%%%%%%%%%%%%%%j%Jj%%
$$ 55 55 54 54 55 54 54 54 55 55 54 54 54 54 54 53 54 54 54 54 54 54 54 54 55 55 55 55 55 55 54 54 54 54 54 54 54 53 53 53 53 53 53 53 53 53 53 53 53 52 53 53 53 53 53 53 53 53 53 53 53 53 53 53 53 52 52 53 52 52 52
3751E2J%%j%J%%%%%%%%%J%%%%%j%JJ%%%j%%%%%j%%J%%%%%%Jj%%%%%%%%%%J%j%%%%%%%%%%%
$$ 52 53 53 53 52 52 53 53 53 53 53 53 53 53 53 53 54 54 54 54 54 54 53 53 54 55 55 55 55 54 54 54 54 54 54 53 53 53 54 54 54 54 54 54 54 55 54 54 54 54 54 54 54 54 54 54 54 55 55 54 54 54 54 54 54 54 54 54 54 54 54
3744E4%%%%%%%%%JjJ%%j%%%%%%j%%J%%%%%%%%%%J%%%%%%%%%%j%%%%%%%%%%%%%%%%%%%J%%j
$$ 54 54 54 54 54 54 54 54 54 54 55 54 55 55 55 54 54 54 54 54 54 54 53 53 53 54 54 54 54 54 54 54 54 54 54 54 55 55 55 55 55 55 55 55 55 55 55 54 54 54 54 54 54 54 54 54 54 54 54 54 54 54 54 54 54 54 54 55 55 55 54
3737E4%j%%%%%%J%%%J%%%jJ%%%%j%%%%j%J%%J%%%%%j%%%%%%J%%%%%%j%%%%%%%Jj%%%%%%J%
$$ 54 54 53 53 53 53 53 53 53 54 54 54 54 55 55 55 55 54 55 55 55 55 55 54 54 54 54 54 53 53 54 54 54 55 55 55 55 55 55 54 54 54 54 54 54 54 55 55 55 55 55 55 55 54 54 54 54 54 54 54 54 55 54 54 54 54 54 54 54 55 55
3729E5%j%%%%%%%%j%%%%J%%%%%%%%%%%%%j%%%J%%%%%%%%%%%%%%%%%%%%%J%%%j%%%j%%%%J%
$$ 55 55 54 54 54 54 54 54 54 54 54 53 53 53 53 53 54 54 54 54 54 54 54 54 54 54 54 54 54 54 53 53 53 53 54 54 54 54 54 54 54 54 54 54 54 54 54 54 54 54 54 54 54 54 54 54 55 55 55 55 54 54 54 54 53 53 53 53 53 54 54
3722E4%%%%%%%%%%%%%%%%%%%j%%%%%%%j%J%%%J%%%%j%%%%%J%%%%%j%J%%j%%J%%%%%j%%%%J
$$ 54 54 54 54 54 54 54 54 54 54 54 54 54 54 54 54 54 54 54 54 53 53 53 53 53 53 53 53 52 52 53 53 53 53 54 54 54 54 54 53 53 53 53 53 53 54 54 54 54 54 54 53 53 54 54 54 53 53 53 54 54 54 54 54 54 53 53 53 53 53 54
3714E4%%%%jJj%%J%%%j%J%%%%%%%%%%jJ%%%%%%%%%jJ%%%jJ%%%%%%%%%%j%%%%J%%J%%%j%%%
$$ 54 54 54 54 54 53 54 53 53 53 54 54 54 54 53 53 54 54 54 54 54 54 54 54 54 54 54 53 54 54 54 54 54 54 54 54 54 54 53 54 54 54 54 53 54 54 54 54 54 54 54 54 54 54 54 53 53 53 53 53 54 54 54 55 55 55 55 54 54 54 54
3707E4%%%%%%jJ%j%J%%%%%%%%%%%%%%%%%%%%%%%%%J%j%%J%%%j%%%%J%%%%%%%j%%%%J%Jj%%
$$ 54 54 54 54 54 54 54 53 54 54 53 53 54 54 54 54 54 54 54 54 54 54 54 54 54 54 54 54 54 54 54 54 54 54 54 54 54 54 55 55 54 54 54 55 55 55 55 54 54 54 54 54 55 55 55 55 55 55 55 55 54 54 54 54 54 55 55 56 55 55 55
3699E5%%%%%%j%%%%%%%%%%%%%%%%%%%%%%jJ%%%%%%%%%%%%%j%%%J%%%%%%j%%%%%%%J%%%%%%
$$ 55 55 55 55 55 55 55 54 54 54 54 54 54 54 54 54 54 54 54 54 54 54 54 54 54 54 54 54 54 54 53 54 54 54 54 54 54 54 54 54 54 54 54 54 54 53 53 53 53 54 54 54 54 54 54 54 53 53 53 53 53 53 53 53 54 54 54 54 54 54 54
3692E4%%%%%%%%%%%%%%%%%%%J%%%%j%%%Jj%%%%jJ%%%Jj%%J%%j%%%%%%%%%%%%%%%J%j%%%%j
$$ 54 54 54 54 54 54 54 54 54 54 54 54 54 54 54 54 54 54 54 54 55 55 55 55 55 54 54 54 54 55 54 54 54 54 54 53 54 54 54 54 55 54 54 54 55 55 55 54 54 54 54 54 54 54 54 54 54 54 54 54 54 54 54 55 55 54 54 54 54 54 53
3685E3%%%J%%%%%%%%%%%%%j%%%J%%j%%J%%%%%%%%%%%%%j%J%%%%%%%%%%%%%%%%j%J%%%J%%j
$$ 53 53 53 53 54 54 54 54 54 54 54 54 54 54 54 54 54 54 53 53 53 53 54 54 54 53 53 53 54 54 54 54 54 54 54 54 54 54 54 54 54 54 53 53 54 54 54 54 54 54 54 54 54 54 54 54 54 54 54 54 54 53 53 54 54 54 54 55 55 55 54
3677E4%%%%%%%%%%%%%j%%%%%%%%%J%%j%J%%%%%%j%%%%%%JjJ%%%%%%%%%%%%%%%%%%%%%Jj%%
$$ 54 54 54 54 54 54 54 54 54 54 54 54 54 54 53 53 53 53 53 53 53 53 53 53 54 54 54 53 53 54 54 54 54 54 54 54 53 53 53 53 53 53 53 54 53 54 54 54 54 54 54 54 54 54 54 54 54 54 54 54 54 54 54 54 54 54 54 55 54 54 54
3670E4%%%%%%%%%%%j%%J%%%%%%%%%%%Jj%%%%%%%%%%%%j%%%%%%J%%%j%%%%%%%%%%%%%JJ%j%
$$ 54 54 54 54 54 54 54 54 54 54 54 54 53 53 53 54 54 54 54 54 54 54 54 54 54 54 54 55 54 54 54 54 54 54 54 54 54 54 54 54 54 53 53 53 53 53 53 53 54 54 54 54 53 53 53 53 53 53 53 53 53 53 53 53 53 53 54 55 55 54 54
3662E4%%%%%%%%%%%%%%%%%%%%%%%%j%%%J%%j%%%%%J%%%j%%%%jJ%%J%%j%%%%%%%%J%%%j%%J
$$ 54 54 54 54 54 54 54 54 54 54 54 54 54 54 54 54 54 54 54 54 54 54 54 54 54 53 53 53 53 54 54 54 53 53 53 53 53 53 54 54 54 54 53 53 53 53 53 52 53 53 53 54 54 54 53 53 53 53 53 53 53 53 53 54 54 54 54 53 53 53 54
3655E4%%%j%%%%%J%%%%j%%J%%jJ%j%%JjJ%%%j%%%%%%%%J%%%%j%%J%%%%%%%%j%%%%%%J%%%%
$$ 54 54 54 54 53 53 53 53 53 53 54 54 54 54 54 53 53 53 54 54 54 53 54 54 53 53 53 54 53 54 54 54 54 53 53 53 53 53 53 53 53 53 54 54 54 54 54 53 53 53 54 54 54 54 54 54 54 54 54 53 53 53 53 53 53 53 54 54 54 54 54
3648E4%%%j%%%%%%%%%J%%%%%j%%%%%%J%%j%%%%%%%%J%%%%%j%%%%%%%%%%J%%%%j%J%%%%%%%
$$ 54 54 54 54 53 53 53 53 53 53 53 53 53 53 54 54 54 54 54 54 53 53 53 53 53 53 53 54 54 54 53 53 53 53 53 53 53 53 53 54 54 54 54 54 54 53 53 53 53 53 53 53 53 53 53 53 54 54 54 54 54 53 53 54 54 54 54 54 54 54 54
3640E4j%J%%%%%%%%%%j%%%%%%%%%%%%%%%%%%%%%%%J%j%%J%%J%%j%j%%%%J%%j%%J%%%%%%%j
$$ 54 53 53 54 54 54 54 54 54 54 54 54 54 54 53 53 53 53 53 53 53 53 53 53 53 53 53 53 53 53 53 53 53 53 53 53 53 53 54 54 53 53 53 54 54 54 55 55 55 54 54 53 53 53 53 53 54 54 54 53 53 53 54 54 54 54 54 54 54 54 53
3633E3%%%%J%%%%j%%%%%%J%%%%%%j%%J%%Jj%%%%%j%%%%%%%%%%%%%%%J%%%%%%%%%%%%%%%%%
$$ 53 53 53 53 53 54 54 54 54 54 53 53 53 53 53 53 53 54 54 54 54 54 54 54 53 53 53 54 54 54 55 54 54 54 54 54 54 53 53 53 53 53 53 53 53 53 53 53 53 53 53 53 53 54 54 54 54 54 54 54 54 54 54 54 54 54 54 54 54 54 54
3625E4%%%%%Jj%%%Jj%%jJ%%%%%%%%%%%%%j%%%%%%%%%%%%%%J%%%j%%%J%%%%%%%%%%%j%%%J%
$$ 54 54 54 54 54 54 55 54 54 54 54 55 54 54 54 53 54 54 54 54 54 54 54 54 54 54 54 54 54 54 53 53 53 53 53 53 53 53 53 53 53 53 53 53 53 54 54 54 54 53 53 53 53 54 54 54 54 54 54 54 54 54 54 54 54 53 53 53 53 54 54
3618E4%%%%%%%%%%%%%%%%%%%j%%%%J%%%%%%%%%%%%%%%%%jJ%%%%%%%%%%%%%%%%%j%%%%%%%J
$$ 54 54 54 54 54 54 54 54 54 54 54 54 54 54 54 54 54 54 54 54 53 53 53 53 53 54 54 54 54 54 54 54 54 54 54 54 54 54 54 54 54 54 54 53 54 54 54 54 54 54 54 54 54 54 54 54 54 54 54 54 54 54 53 53 53 53 53 53 53 53 54
3610E4%%%%%%%%%%%%j%%%%%J%%%%%%%%%j%%J%%%%%j%%J%%j%%%%%%%%%%jJ%J%%%%%%%%%%%%
$$ 54 54 54 54 54 54 54 54 54 54 54 54 54 53 53 53 53 53 53 54 54 54 54 54 54 54 54 54 54 53 53 53 54 54 54 54 54 54 53 53 53 54 54 54 53 53 53 53 53 53 53 53 53 53 53 52 53 53 54 54 54 54 54 54 54 54 54 54 54 54 54
3603E4%jJ%%%%%%j%%%%%%%%%%%%%J%%%%%%%%%Jj%%%j%J%%%%%j%%%%%J%%%j%J%%%j%%%%%J%
$$ 54 54 53 54 54 54 54 54 54 54 53 53 53 53 53 53 53 53 53 53 53 53 53 53 54 54 54 54 54 54 54 54 54 54 55 54 54 54 54 53 53 54 54 54 54 54 54 53 53 53 53 53 53 54 54 54 54 53 53 54 54 54 54 53 53 53 53 53 53 54 54
3596E4j%%%%J%j%%%%%J%%%%%%%%%%%%%%%%j%%%%%%%%%J%%%%J%j%%%%jJ%%%j%%%%Jj%%%%%%
$$ 54 53 53 53 53 53 54 54 53 53 53 53 53 53 54 54 54 54 54 54 54 54 54 54 54 54 54 54 54 54 54 53 53 53 53 53 53 53 53 53 53 54 54 54 54 54 55 55 54 54 54 54 54 53 54 54 54 54 53 53 53 53 53 54 53 53 53 53 53 53 53
3588E3%%%%J%%%%%j%J%%%%%%%%%%%%%%%%%%%J%j%%%%%%%%%jJjJ%%%%%%%%%%%%%j%%%%%%%%
$$ 53 53 53 53 53 54 54 54 54 54 54 53 53 54 54 54 54 54 54 54 54 54 54 54 54 54 54 54 54 54 54 54 54 55 55 54 54 54 54 54 54 54 54 54 54 53 54 53 54 54 54 54 54 54 54 54 54 54 54 54 54 54 53 53 53 53 53 53 53 53 53
3581E3%%J%%%jJ%%%%%%%%%%%%%%%J%%%%j%%%j%%%J%%%%j%%J%%%%%%%%%%%%j%%%%%%%%jJ%J
$$ 53 53 53 54 54 54 54 53 54 54 54 54 54 54 54 54 54 54 54 54 54 54 54 54 55 55 55 55 55 54 54 54 54 53 53 53 53 54 54 54 54 54 53 53 53 54 54 54 54 54 54 54 54 54 54 54 54 54 53 53 53 53 53 53 53 53 53 52 53 53 54
3573E4%%%%%%%%%%%%%%%j%%%J%%%%%%%%%%%jJj%%%%%%%%%%Jj%%J%%%%j%%%%%%%%%%%%%J%%
$$ 54 54 54 54 54 54 54 54 54 54 54 54 54 54 54 54 53 53 53 53 54 54 54 54 54 54 54 54 54 54 54 54 53 54 53 53 53 53 53 53 53 53 53 53 53 54 53 53 53 54 54 54 54 54 53 53 53 53 53 53 53 53 53 53 53 53 53 53 54 54 54
3566E4%j%Jj%%%%%%J%%j%%%%%J%%%%%%j%%J%%%%%%%j%%%%J%%%%%j%%%%%%%%J%%%%%%%%j%j
$$ 54 54 53 53 54 53 53 53 53 53 53 53 54 54 54 53 53 53 53 53 53 54 54 54 54 54 54 54 53 53 53 54 54 54 54 54 54 54 54 53 53 53 53 53 54 54 54 54 54 54 53 53 53 53 53 53 53 53 53 54 54 54 54 54 54 54 54 54 53 53 52
3559E2%%JJ%%%j%%%%J%%j%%%%jJ%%%%%%J%j%%%%%%%%%%%%%j%%J%%%%%J%%%%%%%%j%%jJ%%%
$$ 52 52 52 53 54 54 54 54 53 53 53 53 53 54 54 54 53 53 53 53 53 52 53 53 53 53 53 53 53 54 54 53 53 53 53 53 53 53 53 53 53 53 53 53 53 52 52 52 53 53 53 53 53 53 54 54 54 54 54 54 54 54 54 53 53 53 52 53 53 53 53
3551E3%%%%%%J%%%%%%j%%jJ%%J%%%j%%%%%J%%%%%%%%%%%%%%%%%%%%j%j%J%%%%%%%%%%j%%%
$$ 53 53 53 53 53 53 53 54 54 54 54 54 54 54 53 53 53 52 53 53 53 54 54 54 54 53 53 53 53 53 53 54 54 54 54 54 54 54 54 54 54 54 54 54 54 54 54 54 54 54 54 54 53 53 52 52 53 53 53 53 53 53 53 53 53 53 53 52 52 52 52
3544E2%JJ%j%%%%%%%j%%J%%%J%jJj%%J%%%j%%%J%j%%%%%%%J%j%%%%%%%jJ%%%%%%J%j%%%J%
$$ 52 52 53 54 54 53 53 53 53 53 53 53 53 52 52 52 53 53 53 53 54 54 53 54 53 53 53 54 54 54 54 53 53 53 53 54 54 53 53 53 53 53 53 53 53 54 54 53 53 53 53 53 53 53 53 52 53 53 53 53 53 53 53 54 54 53 53 53 53 54 54
3536E4%%%j%%%%%%%Jj%Jj%%%%%%%%%%%%%%%%%%%%%%%%%%%%%%%%jJ%%%%jJ%%%%%%J%j%%%%%
$$ 54 54 54 54 53 53 53 53 53 53 53 53 54 53 53 54 53 53 53 53 53 53 53 53 53 53 53 53 53 53 53 53 53 53 53 53 53 53 53 53 53 53 53 53 53 53 53 53 53 52 53 53 53 53 53 52 53 53 53 53 53 53 53 54 54 53 53 53 53 53 53
3529E3%%%%%%%%%Jj%%%jJ%%%%%%%%%%%%%%%J%j%%J%%j%%%%%J%%j%J%%j%%%%%%%%j%%%%J%%
$$ 53 53 53 53 53 53 53 53 53 53 54 53 53 53 53 52 53 53 53 53 53 53 53 53 53 53 53 53 53 53 53 53 54 54 53 53 53 54 54 54 53 53 53 53 53 53 54 54 54 53 53 54 54 54 53 53 53 53 53 53 53 53 53 52 52 52 52 52 53 53 53
3521E3%J%%%%%%%j%%%%%%%%%%%%%%%%%%%%%J%%%%j%%%%%j%J%%%%%%%%%%%%%J%%%%%%%%%j%
$$ 53 53 54 54 54 54 54 54 54 54 53 53 53 53 53 53 53 53 53 53 53 53 53 53 53 53 53 53 53 53 53 53 54 54 54 54 54 53 53 53 53 53 53 52 52 53 53 53 53 53 53 53 53 53 53 53 53 53 53 54 54 54 54 54 54 54 54 54 54 53 53
3514E3%%%%%J%j%%%%%%J%j%%J%j%%%%%%%%%%%%%%%%%%%%j%J%%%%%%%%%%%%%%J%j%%%%%j%%
$$ 53 53 53 53 53 53 54 54 53 53 53 53 53 53 53 54 54 53 53 53 54 54 53 53 53 53 53 53 53 53 53 53 53 53 53 53 53 53 53 53 53 53 53 52 52 53 53 53 53 53 53 53 53 53 53 53 53 53 53 53 54 54 53 53 53 53 53 53 52 52 52
3507E2J%%%%%%%J%%%%%%j%%%J%%%%j%%%%%%%%%J%%%%%j%%%%J%j%%%Jj%%%%j%%%%%K%%%%%j
$$ 52 53 53 53 53 53 53 53 53 54 54 54 54 54 54 54 53 53 53 53 54 54 54 54 54 53 53 53 53 53 53 53 53 53 53 54 54 54 54 54 54 53 53 53 53 53 54 54 53 53 53 53 54 53 53 53 53 53 52 52 52 52 52 52 54 54 54 54 54 54 53
3499E3%%%%%jJ%%J%%j%%j%%J%%%%%%%%%%%%J%%%%%%%%%%%%%jJ%%%j%%J%%%%%%%%%%j%%%%%
$$ 53 53 53 53 53 53 52 53 53 53 54 54 54 53 53 53 52 52 52 53 53 53 53 53 53 53 53 53 53 53 53 53 54 54 54 54 54 54 54 54 54 54 54 54 54 54 53 54 54 54 54 53 53 53 54 54 54 54 54 54 54 54 54 54 54 53 53 53 53 53 53
3492E3%%%%%%%%jJ%j%%%%%%%%%J%%%%%%%%%%%%%%%%%%%%J%%%%%%%jJj%%%Jj%%%jJ%%%%%%%
$$ 53 53 53 53 53 53 53 53 53 52 53 53 52 52 52 52 52 52 52 52 52 52 53 53 53 53 53 53 53 53 53 53 53 53 53 53 53 53 53 53 53 53 53 54 54 54 54 54 54 54 54 53 54 53 53 53 53 54 53 53 53 53 52 53 53 53 53 53 53 53 53
3484E3%%%%%%%%%%%%%%%%%j%%%%%%%%Jj%%%%%J%J%%%%%%%%j%%%%j%%J%%%%%%j%%J%%%%%%%
$$ 53 53 53 53 53 53 53 53 53 53 53 53 53 53 53 53 53 53 52 52 52 52 52 52 52 52 52 53 52 52 52 52 52 52 53 53 54 54 54 54 54 54 54 54 54 53 53 53 53 53 52 52 52 53 53 53 53 53 53 53 52 52 52 53 53 53 53 53 53 53 53
3477E3J%%%%%j%%%%%J%%jJ%%%jJ%%%%%%%%%%%j%%%%%%%%%%%J%j%%%%%%J%%%%%%%%j%%%%%%
$$ 53 54 54 54 54 54 54 53 53 53 53 53 53 54 54 54 53 54 54 54 54 53 54 54 54 54 54 54 54 54 54 54 54 54 53 53 53 53 53 53 53 53 53 53 53 53 54 54 53 53 53 53 53 53 53 54 54 54 54 54 54 54 54 54 53 53 53 53 53 53 53
3470E3%J%%%j%J%%%%j%%%%%%%%%J%j%jJ%%jJ%%%%%%%%%%%%%%%%J%%%%%j%%%%%Jj%%%%%%%%
$$ 53 53 54 54 54 54 53 53 54 54 54 54 54 53 53 53 53 53 53 53 53 53 53 54 54 53 53 52 53 53 53 52 53 53 53 53 53 53 53 53 53 53 53 53 53 53 53 53 53 54 54 54 54 54 54 53 53 53 53 53 53 54 53 53 53 53 53 53 53 53 53
3462E3%j%%%%%J%%%%%%j%%J%%%%j%%%%%%%J%%%%%%%%%%%%%%%JjJ%%j%%%j%J%%Jj%%%%%j%%
$$ 53 53 52 52 52 52 52 52 53 53 53 53 53 53 53 52 52 52 53 53 53 53 53 52 52 52 52 52 52 52 52 53 53 53 53 53 53 53 53 53 53 53 53 53 53 53 53 54 53 54 54 54 53 53 53 53 52 52 53 53 53 54 53 53 53 53 53 53 52 52 52
3455E2%%%J%%%j%J%%%%%%j%%%%%%J%%%%%%j%%%%%%%%%%J%%%%j%%Jj%%J%%%%%j%%%J%%j%%J
$$ 52 52 52 52 53 53 53 53 52 52 53 53 53 53 53 53 53 52 52 52 52 52 52 52 53 53 53 53 53 53 53 52 52 52 52 52 52 52 52 52 52 52 53 53 53 53 53 52 52 52 53 52 52 52 53 53 53 53 53 53 52 52 52 52 53 53 53 52 52 52 53
3447E3%%%j%%jJ%%%%%J%%%%%%%%%%%%%%%j%%%%%%%%J%%%%j%%%J%j%%%%%%%%%%%%J%%%%%j%
$$ 53 53 53 53 52 52 52 51 52 52 52 52 52 52 53 53 53 53 53 53 53 53 53 53 53 53 53 53 53 53 52 52 52 52 52 52 52 52 52 53 53 53 53 53 52 52 52 52 53 53 52 52 52 52 52 52 52 52 52 52 52 52 52 53 53 53 53 53 53 52 52
3440E2%%%%%%%%J%%%%%j%%%%J%%j%%%%%%J%%%%%j%%J%%j%%%J%%%%%%%%%j%%%%%%%%%%%%J%
$$ 52 52 52 52 52 52 52 52 52 53 53 53 53 53 53 52 52 52 52 52 53 53 53 52 52 52 52 52 52 52 53 53 53 53 53 53 52 52 52 53 53 53 52 52 52 52 53 53 53 53 53 53 53 53 53 53 52 52 52 52 52 52 52 52 52 52 52 52 52 53 53
3432E3%J%%%%j%J%%j%%jJj%%J%%%%%%%%jJ%%%%%%%j%%%%%%%%%J%%%%%%%%jJ%%%%j%%J%j%%
$$ 53 53 54 54 54 54 54 53 53 54 54 54 53 53 53 52 53 52 52 52 53 53 53 53 53 53 53 53 53 52 53 53 53 53 53 53 53 53 52 52 52 52 52 52 52 52 52 52 53 53 53 53 53 53 53 53 53 52 53 53 53 53 53 52 52 52 53 53 52 52 52
3425E2J%%%%%%%%%%%J%%%%j%%%%%%%%%%%%j%%%%%Jj%%%%%%%%J%%%%%Jj%%%%%jJ%%j%J%jJ%
$$ 52 53 53 53 53 53 53 53 53 53 53 53 53 54 54 54 54 54 53 53 53 53 53 53 53 53 53 53 53 53 53 52 52 52 52 52 52 53 52 52 52 52 52 52 52 52 52 53 53 53 53 53 53 54 53 53 53 53 53 53 52 53 53 53 52 52 53 53 52 53 53
3418E3%%%jJ%%%%%%%%%J%j%%%%%%%%%%%%%%%%%%%%%%%%%j%%%%%%%%J%j%Jj%%%J%%%%%%%%%
$$ 53 53 53 53 52 53 53 53 53 53 53 53 53 53 53 54 54 53 53 53 53 53 53 53 53 53 53 53 53 53 53 53 53 53 53 53 53 53 53 53 53 53 53 52 52 52 52 52 52 52 52 52 53 53 52 52 53 52 52 52 52 53 53 53 53 53 53 53 53 53 53
3410E3%j%%%%%%%J%%%%%j%%%%%%J%%%j%%%%%%%J%%%%%%%%j%%J%%%%%%%%%%%%%%%j%%J%jjJ
$$ 53 53 52 52 52 52 52 52 52 52 53 53 53 53 53 53 52 52 52 52 52 52 52 53 53 53 53 52 52 52 52 52 52 52 52 53 53 53 53 53 53 53 53 53 52 52 52 53 53 53 53 53 53 53 53 53 53 53 53 53 53 53 53 52 52 52 53 53 52 51 52
3403E2%%%%%J%%J%%j%j%%%J%j%J%%%%%j%%%%%JjJ%%j%%%%%%%%%%%J%%j%%%%%j%J%%J%%%%%
$$ 52 52 52 52 52 52 53 53 53 54 54 54 53 53 52 52 52 52 53 53 52 52 53 53 53 53 53 53 52 52 52 52 52 52 53 52 53 53 53 52 52 52 52 52 52 52 52 52 52 52 52 53 53 53 52 52 52 52 52 52 51 51 52 52 52 53 53 53 53 53 53
3395E3%%%j%%Jj%%%%J%%%%%%%%%%%%%%%jJ%%%%%j%%%J%%%%j%J%%j%%%%%J%%%%%%%%%%%%%%
$$ 53 53 53 53 52 52 52 53 52 52 52 52 52 53 53 53 53 53 53 53 53 53 53 53 53 53 53 53 53 52 53 53 53 53 53 53 52 52 52 52 53 53 53 53 53 52 52 53 53 53 52 52 52 52 52 52 53 53 53 53 53 53 53 53 53 53 53 53 53 53 53
3388E3j%%%%J%j%%%%%%%%%J%%%j%%%J%j%%%J%j%%%%%%%%%%%%%%J%%%%%j%%%J%%%%jJ%%%j%
$$ 53 52 52 52 52 52 53 53 52 52 52 52 52 52 52 52 52 52 53 53 53 53 52 52 52 52 53 53 52 52 52 52 53 53 52 52 52 52 52 52 52 52 52 52 52 52 52 52 52 53 53 53 53 53 53 52 52 52 52 53 53 53 53 53 52 53 53 53 53 52 52
3381E2%%%%%%%%J%j%%%%%%%%%%j%J%%%%%%%%%%%%%%%%%%%%%%%%%%%J%%%%%%%%%%j%%%%%%%
$$ 52 52 52 52 52 52 52 52 52 53 53 52 52 52 52 52 52 52 52 52 52 52 51 51 52 52 52 52 52 52 52 52 52 52 52 52 52 52 52 52 52 52 52 52 52 52 52 52 52 52 52 52 53 53 53 53 53 53 53 53 53 53 53 52 52 52 52 52 52 52 52
3373E2%%%%J%%%%%%%%%%%%%j%%%%%%%%%%%%j%J%%%%j%%J%%%%j%%J%%%%%%%%%%%J%j%%j%J%
$$ 52 52 52 52 52 53 53 53 53 53 53 53 53 53 53 53 53 53 53 52 52 52 52 52 52 52 52 52 52 52 52 52 51 51 52 52 52 52 52 51 51 51 52 52 52 52 52 51 51 51 52 52 52 52 52 52 52 52 52 52 52 52 53 53 52 52 52 51 51 52 52
3366E2%%%%Jj%%%%%%%J%%%%%%%j%%%%%%%%%%%%j%%%%%J%J%%jJ%j%%%%%%%J%%%%j%%%%%%%J
$$ 52 52 52 52 52 53 52 52 52 52 52 52 52 52 53 53 53 53 53 53 53 53 52 52 52 52 52 52 52 52 52 52 52 52 52 51 51 51 51 51 51 52 52 53 53 53 52 53 53 52 52 52 52 52 52 52 52 53 53 53 53 53 52 52 52 52 52 52 52 52 53
3358E3%%%jJ%j%%%%%%%%%%%%%%%J%%%%j%%%J%%%%%%%%%%J%%j%%%j%%%%%J%%%%%%%%j%J%%%
$$ 53 53 53 53 52 53 53 52 52 52 52 52 52 52 52 52 52 52 52 52 52 52 52 53 53 53 53 53 52 52 52 52 53 53 53 53 53 53 53 53 53 53 53 54 54 54 53 53 53 53 52 52 52 52 52 52 53 53 53 53 53 53 53 53 53 52 52 53 53 53 53
3351E3%%%J%%%%%j%%%%%%%%%%%%%%%%%%%%%%%%%%%%%%%%%%%%%%%%%%jJ%%%%%%%%%j%%%%%J
$$ 53 53 53 53 54 54 54 54 54 54 53 53 53 53 53 53 53 53 53 53 53 53 53 53 53 53 53 53 53 53 53 53 53 53 53 53 53 53 53 53 53 53 53 53 53 53 53 53 53 53 53 53 53 52 53 53 53 53 53 53 53 53 53 53 52 52 52 52 52 52 53
3343E3%%%%%%Jj%%%%%%%%%%j%%%%%%J%%%%%%j%%%%%%%%%%%%%%%%J%%%%%%j%%%%%Jj%%%%%%
$$ 53 53 53 53 53 53 53 54 53 53 53 53 53 53 53 53 53 53 53 52 52 52 52 52 52 52 53 53 53 53 53 53 53 52 52 52 52 52 52 52 52 52 52 52 52 52 52 52 52 52 53 53 53 53 53 53 53 52 52 52 52 52 52 53 52 52 52 52 52 52 52
3336E2%J%jJj%%%%Jj%%%%%%%%%%%%%%%%%%%%J%%%j%%%%Jj%J%j%%%%%%%%%%%%%%%%%%%%Jj%
$$ 52 52 53 53 52 53 52 52 52 52 52 53 52 52 52 52 52 52 52 52 52 52 52 52 52 52 52 52 52 52 52 52 52 53 53 53 53 52 52 52 52 52 53 52 52 53 53 52 52 52 52 52 52 52 52 52 52 52 52 52 52 52 52 52 52 52 52 52 53 52 52
3329E2%%j%J%%%%%%%%%%%%%%%%%%%J%j%%J%%%%%%%%%%%j%Jj%%%J%j%Jj%%%%%%%%%%Jj%%%%
$$ 52 52 52 51 51 52 52 52 52 52 52 52 52 52 52 52 52 52 52 52 52 52 52 52 52 53 53 52 52 52 53 53 53 53 53 53 53 53 53 53 53 53 52 52 53 52 52 52 52 53 53 52 52 53 52 52 52 52 52 52 52 52 52 52 52 53 52 52 52 52 52
3321E2%%%%%%%%Jj%%%%%%j%%J%%%j%%%%%%%%J%%%%%J%J%%j%%%%%%%%%%%%%%j%%J%%j%%Jj%
$$ 52 52 52 52 52 52 52 52 52 53 52 52 52 52 52 52 52 51 51 51 52 52 52 52 51 51 51 51 51 51 51 51 51 52 52 52 52 52 52 53 53 54 54 54 53 53 53 53 53 53 53 53 53 53 53 53 53 53 53 52 52 52 53 53 53 52 52 52 53 52 52
3314E2J%%%%%%j%%J%%%%j%%%%%%%%%%J%%%jJ%%%%%%%j%%%j%%J%%%%%%J%j%%j%%J%%%jJ%%%
$$ 52 53 53 53 53 53 53 53 52 52 52 53 53 53 53 53 52 52 52 52 52 52 52 52 52 52 52 53 53 53 53 52 53 53 53 53 53 53 53 53 52 52 52 52 51 51 51 52 52 52 52 52 52 52 53 53 52 52 52 51 51 51 52 52 52 52 51 52 52 52 52
3306E2%%%%%%%%%%%%%%%%%%%J%%%%%%%%%%%%%%%%%%%%%%%%%%%%%%%%J%j%%%%%%j%%%%%J%%
$$ 52 52 52 52 52 52 52 52 52 52 52 52 52 52 52 52 52 52 52 52 53 53 53 53 53 53 53 53 53 53 53 53 53 53 53 53 53 53 53 53 53 53 53 53 53 53 53 53 53 53 53 53 53 54 54 53 53 53 53 53 53 53 52 52 52 52 52 52 53 53 53
3299E3%%%%%%%%%%%%%j%%J%%%%%%%%%%%%%%%%%j%%%%%%%J%%%%%%%%%%%%j%%%%%%%%%jJ%%%
$$ 53 53 53 53 53 53 53 53 53 53 53 53 53 53 52 52 52 53 53 53 53 53 53 53 53 53 53 53 53 53 53 53 53 53 53 52 52 52 52 52 52 52 52 53 53 53 53 53 53 53 53 53 53 53 53 53 52 52 52 52 52 52 52 52 52 52 51 52 52 52 52
3292E2jJ%%%%%j%%%%%%%%%%%%%j%%%%%%%%%%%%%%%%%%%%%jJ%j%J%%%%%%%%%%%%%%%%%%%%%
$$ 52 51 52 52 52 52 52 52 51 51 51 51 51 51 51 51 51 51 51 51 51 51 50 50 50 50 50 50 50 50 50 50 50 50 50 50 50 50 50 50 50 50 50 50 49 50 50 49 49 50 50 50 50 50 50 50 50 50 50 50 50 50 50 50 50 50 50 50 50 50 50
3284E0J%%%%%j%J%%%%%%%%%%J%j%%%%%J%%J%%%%%%%%j%%%%%%%%J%%%jJ%%j%J%%%%%%%%%%%
$$ 50 51 51 51 51 51 51 50 50 51 51 51 51 51 51 51 51 51 51 51 52 52 51 51 51 51 51 51 52 52 52 53 53 53 53 53 53 53 53 53 52 52 52 52 52 52 52 52 52 53 53 53 53 52 53 53 53 52 52 53 53 53 53 53 53 53 53 53 53 53 53
3277E3j%J%%%jJ%%%%jJ%%%j%%jJ%%%%%%%%%%j%JJ%%%j%J%%j%%%%%%%%%%%%%J%%%j%%%%%%%
$$ 53 52 52 53 53 53 53 52 53 53 53 53 53 52 53 53 53 53 52 52 52 51 52 52 52 52 52 52 52 52 52 52 52 51 51 52 53 53 53 53 52 52 53 53 53 52 52 52 52 52 52 52 52 52 52 52 52 52 52 53 53 53 53 52 52 52 52 52 52 52 52
3269E2%%%%%%%%jJ%%%%%%%%%j%%%Jj%%%J%%%%%%jJ%%%%%%%%%%%%%j%%%%%%%Jj%J%%%%%%%%
$$ 52 52 52 52 52 52 52 52 52 51 52 52 52 52 52 52 52 52 52 52 51 51 51 51 52 51 51 51 51 52 52 52 52 52 52 52 51 52 52 52 52 52 52 52 52 52 52 52 52 52 52 51 51 51 51 51 51 51 51 52 51 51 52 52 52 52 52 52 52 52 52
3262E2%%Jj%%%%%%%%%J%j%%%%%J%%%%%j%%%%%%%%%%%%%%%%%%%%%%%%%%%%%%%%%%%%%%%%%%
$$ 52 52 52 53 52 52 52 52 52 52 52 52 52 52 53 53 52 52 52 52 52 52 53 53 53 53 53 53 52 52 52 52 52 52 52 52 52 52 52 52 52 52 52 52 52 52 52 52 52 52 52 52 52 52 52 52 52 52 52 52 52 52 52 52 52 52 52 52 52 52 52
3254E2%%j%J%%%%%%%%%%%%%%%%%%%%%%%%%%%%%%%%J%%j%%%jJ%%J%j%%%%%%%%%%%%%%%%%%%
$$ 52 52 52 51 51 52 52 52 52 52 52 52 52 52 52 52 52 52 52 52 52 52 52 52 52 52 52 52 52 52 52 52 52 52 52 52 52 52 53 53 53 52 52 52 52 51 52 52 52 53 53 52 52 52 52 52 52 52 52 52 52 52 52 52 52 52 52 52 52 52 52
3247E2%%%%%%%J%j%%%J%%%%j%%%%%Jj%%%%%%%%%%%%%j%%%J%J%%j%%%%%%%%jJ%%%%J%%%%j%
$$ 52 52 52 52 52 52 52 52 53 53 52 52 52 52 53 53 53 53 53 52 52 52 52 52 52 53 52 52 52 52 52 52 52 52 52 52 52 52 52 52 51 51 51 51 52 52 53 53 53 52 52 52 52 52 52 52 52 52 51 52 52 52 52 52 53 53 53 53 53 52 52
3240E2J%%%%j%%%%Jj%%%%%%JjjJ%%%%%%%%%%%%Jj%%%%%j%%J%%%%%%%%j%J%%%%%%%%%%%%%%
$$ 52 53 53 53 53 53 52 52 52 52 52 53 52 52 52 52 52 52 52 53 52 51 52 52 52 52 52 52 52 52 52 52 52 52 52 53 52 52 52 52 52 52 51 51 51 52 52 52 52 52 52 52 52 52 51 51 52 52 52 52 52 52 52 52 52 52 52 52 52 52 52
3232E2%J%%j%%%%%%%%%%%%%%%%%%j%%%%%%%%%%J%%J%j%%%%j%J%J%j%%%%%%%%%%J%j%%%%Jj
$$ 52 52 53 53 53 52 52 52 52 52 52 52 52 52 52 52 52 52 52 52 52 52 52 52 51 51 51 51 51 51 51 51 51 51 51 52 52 52 53 53 52 52 52 52 52 51 51 52 52 53 53 52 52 52 52 52 52 52 52 52 52 52 53 53 52 52 52 52 52 53 52
3225E2%%%%%%j%J%%%%j%%J%%%J%%%%%j%%%%%%%J%%%%j%%j%%J%%j%%%%%%%%%%%%%%%%%%%J%
$$ 52 52 52 52 52 52 52 51 51 52 52 52 52 52 51 51 51 52 52 52 52 53 53 53 53 53 53 52 52 52 52 52 52 52 52 53 53 53 53 53 52 52 52 51 51 51 52 52 52 51 51 51 51 51 51 51 51 51 51 51 51 51 51 51 51 51 51 51 51 52 52
3217E2%%J%%%%%%j%%%%%%%%%%%%%%%J%j%%%%jJ%%%%%%%%%%%%%%j%%%%J%%%%jJ%%%%%%%%%%
$$ 52 52 52 53 53 53 53 53 53 53 52 52 52 52 52 52 52 52 52 52 52 52 52 52 52 52 53 53 52 52 52 52 52 51 52 52 52 52 52 52 52 52 52 52 52 52 52 52 52 51 51 51 51 51 52 52 52 52 52 51 52 52 52 52 52 52 52 52 52 52 52
3210E2%%%%%%%J%%jjJ%%%%%%%%%j%%J%%%%%%%%%%%j%%%J%%%%%%%%%%j%%%%%%%%J%%%%j%J%
$$ 52 52 52 52 52 52 52 52 53 53 53 52 51 52 52 52 52 52 52 52 52 52 52 51 51 51 52 52 52 52 52 52 52 52 52 52 52 52 51 51 51 51 52 52 52 52 52 52 52 52 52 52 52 51 51 51 51 51 51 51 51 51 52 52 52 52 52 51 51 52 52
3203E2%%%%%%%J%%j%%%%%%%%%%%Jj%%%%%%%%%j%J%%%%%%%%%%%j%J%%%%%j%%%J%%%%%%j%%%
$$ 52 52 52 52 52 52 52 52 53 53 53 52 52 52 52 52 52 52 52 52 52 52 52 53 52 52 52 52 52 52 52 52 52 52 51 51 52 52 52 52 52 52 52 52 52 52 52 52 51 51 52 52 52 52 52 52 51 51 51 51 52 52 52 52 52 52 52 51 51 51 51
3195E1%J%%j%%%%%J%J%%%j%%%%j%%%%%Jj%%%J%j%%%J%%%%%%%%%%%%%%%%%j%%%Jj%%%%%%%%
$$ 51 51 52 52 52 51 51 51 51 51 51 52 52 53 53 53 53 52 52 52 52 52 51 51 51 51 51 51 52 51 51 51 51 52 52 51 51 51 51 52 52 52 52 52 52 52 52 52 52 52 52 52 52 52 52 52 52 51 51 51 51 52 51 51 51 51 51 51 51 51 51
3188E1J%%%%%%%j%%%%%%%%%%%%%J%%%%%%%%%%%j%%J%%j%%%%%%%%%%%%%%%%%%%%%%j%J%%%J
$$ 51 52 52 52 52 52 52 52 52 51 51 51 51 51 51 51 51 51 51 51 51 51 51 52 52 52 52 52 52 52 52 52 52 52 52 51 51 51 52 52 52 51 51 51 51 51 51 51 51 51 51 51 51 51 51 51 51 51 51 51 51 51 51 51 50 50 51 51 51 51 52
3180E2%%%%%%%%%%%j%%%%%%J%Jj%%%%%Jj%%%%%%%%%%%jJ%%%J%%%%jJ%%%%j%%%j%%%%%J%%%
$$ 52 52 52 52 52 52 52 52 52 52 52 52 51 51 51 51 51 51 51 52 52 53 52 52 52 52 52 52 53 52 52 52 52 52 52 52 52 52 52 52 52 51 52 52 52 52 53 53 53 53 53 52 53 53 53 53 53 52 52 52 52 51 51 51 51 51 51 52 52 52 52
3173E2%%%j%%J%%%%%%Jj%%%%%%%%%%%%%%%%%%%%%%%%%%%%J%%j%%%%%%%%%%%%%%J%%%%%%%%
$$ 52 52 52 52 51 51 51 52 52 52 52 52 52 52 53 52 52 52 52 52 52 52 52 52 52 52 52 52 52 52 52 52 52 52 52 52 52 52 52 52 52 52 52 52 53 53 53 52 52 52 52 52 52 52 52 52 52 52 52 52 52 52 53 53 53 53 53 53 53 53 53
3165E3%j%%Jj%%jJ%%%%%j%J%%%%%%%%%%%%%%%%%%%%%%%%%j%J%%%%%%%%%%%J%j%%%jJ%J%%%
$$ 53 53 52 52 52 53 52 52 52 51 52 52 52 52 52 52 51 51 52 52 52 52 52 52 52 52 52 52 52 52 52 52 52 52 52 52 52 52 52 52 52 52 52 52 51 51 52 52 52 52 52 52 52 52 52 52 52 52 53 53 52 52 52 52 51 52 52 53 53 53 53
3158E3%%j%%%%%%%%%%%%%%%%%%J%%%j%%%%%%j%J%%%%%%%%j%J%%%%%%%%%%%%%%%%%%%%%%%%
$$ 53 53 53 52 52 52 52 52 52 52 52 52 52 52 52 52 52 52 52 52 52 52 53 53 53 53 52 52 52 52 52 52 52 51 51 52 52 52 52 52 52 52 52 52 51 51 52 52 52 52 52 52 52 52 52 52 52 52 52 52 52 52 52 52 52 52 52 52 52 52 52
3151E2%%%%%%%%%%%%%%%%%%%%%%%%%%%Jj%%j%%%%J%%%%%%%j%%%%%%%%%%%%%J%%%%j%%%%%%
$$ 52 52 52 52 52 52 52 52 52 52 52 52 52 52 52 52 52 52 52 52 52 52 52 52 52 52 52 52 53 52 52 52 51 51 51 51 51 52 52 52 52 52 52 52 52 51 51 51 51 51 51 51 51 51 51 51 51 51 51 52 52 52 52 52 51 51 51 51 51 51 51
3143E1%%%J%%%%%j%%%J%%j%%%%%%%Jj%%%%Jj%%%%%J%%%%%%%j%%%%J%%%%%%%%%%%%%%jJ%%%
$$ 51 51 51 51 52 52 52 52 52 52 51 51 51 51 52 52 52 51 51 51 51 51 51 51 51 52 51 51 51 51 51 52 51 51 51 51 51 51 52 52 52 52 52 52 52 52 51 51 51 51 51 52 52 52 52 52 52 52 52 52 52 52 52 52 52 52 51 52 52 52 52
3136E2j%J%%%j%%%%J%%J%%%%%%j%%jJ%j%%%%%%%%J%%%%j%%%%%%%%%%%%%%%%%%%%j%%J%%%%
$$ 52 51 51 52 52 52 52 51 51 51 51 51 52 52 52 53 53 53 53 53 53 53 52 52 52 51 52 52 51 51 51 51 51 51 51 51 51 52 52 52 52 52 51 51 51 51 51 51 51 51 51 51 51 51 51 51 51 51 51 51 51 51 51 50 50 50 51 51 51 51 51
3128E1%%%%%%%%%%%%J%%%%j%%%%%%J%%%j%%%%%%J%%%%%%%%%%%%%%%%%%%%%%%%%%%jJ%j%%%
$$ 51 51 51 51 51 51 51 51 51 51 51 51 51 52 52 52 52 52 51 51 51 51 51 51 51 52 52 52 52 51 51 51 51 51 51 51 52 52 52 52 52 52 52 52 52 52 52 52 52 52 52 52 52 52 52 52 52 52 52 52 52 52 52 52 51 52 52 51 51 51 51
3121E1%%J%%%%%j%%%%%%%%%%%%%%%%%%%%j%J%%%%%%%%%%%j%J%%%%%%j%%%%%%%%j%%J%j%%%
$$ 51 51 51 52 52 52 52 52 52 51 51 51 51 51 51 51 51 51 51 51 51 51 51 51 51 51 51 51 51 51 50 50 51 51 51 51 51 51 51 51 51 51 51 51 50 50 51 51 51 51 51 51 51 50 50 50 50 50 50 50 50 50 49 49 49 50 50 49 49 49 49
3114D9%%j%%%%%%%%%J%j%%%%%%%%j%%%%%%j%Jj%%%%%%%%%%%%%%%%J%%%%%%%%%J%%j%%j%J%
$$ 49 49 49 48 48 48 48 48 48 48 48 48 48 49 49 48 48 48 48 48 48 48 48 48 47 47 47 47 47 47 47 46 46 47 46 46 46 46 46 46 46 46 46 46 46 46 46 46 46 46 46 47 47 47 47 47 47 47 47 47 47 48 48 48 47 47 47 46 46 47 47
3106D7%%Jj%%%J%%J%%%%%%%%%J%%%%%%%%%%J%%%%%%%%%%%%%%%%%%%%%%%%%%%%%%%%%%%%%%
$$ 47 47 47 48 47 47 47 47 48 48 48 49 49 49 49 49 49 49 49 49 49 50 50 50 50 50 50 50 50 50 50 50 51 51 51 51 51 51 51 51 51 51 51 51 51 51 51 51 51 51 51 51 51 51 51 51 51 51 51 51 51 51 51 51 51 51 51 51 51 51 51
3099E1%%%Jj%%%%%%%%%%J%j%%%%%%%%%%%%%%j%%%%J%%jJ%%%%%%%J%%j%J%%jJ%j%%%%%%J%%
$$ 51 51 51 51 52 51 51 51 51 51 51 51 51 51 51 51 52 52 51 51 51 51 51 51 51 51 51 51 51 51 51 51 51 50 50 50 50 50 51 51 51 50 51 51 51 51 51 51 51 51 52 52 52 51 51 52 52 52 51 52 52 51 51 51 51 51 51 51 52 52 52
3091E2%j%J%%%j%%%%%jJ%%%%%%%%%%%%Jj%%%%J%j%%%%J%%%%%%%%%%j%%%%%%j%J%%%%%Jj%%
$$ 52 52 51 51 52 52 52 52 51 51 51 51 51 51 50 51 51 51 51 51 51 51 51 51 51 51 51 51 52 51 51 51 51 51 52 52 51 51 51 51 51 52 52 52 52 52 52 52 52 52 52 52 51 51 51 51 51 51 51 50 50 51 51 51 51 51 51 52 51 51 51
3084E1%%JjJ%%%%%j%%%%%J%%%%%j%%%%jJ%%%%J%%j%J%%%j%%%%j%%%%J%%jJ%%%J%jJ%j%%%%
$$ 51 51 51 52 51 52 52 52 52 52 52 51 51 51 51 51 51 52 52 52 52 52 52 51 51 51 51 51 50 51 51 51 51 51 52 52 52 51 51 52 52 52 52 51 51 51 51 51 50 50 50 50 50 51 51 51 50 51 51 51 51 52 52 51 52 52 51 51 51 51 51
3076E1%%%j%%%%%J%%%%%%%%%%J%j%%%%%%%%%%%%%jJ%%%%%%%%%%%J%j%%%%%%%%%%%J%%%%%%
$$ 51 51 51 51 50 50 50 50 50 50 51 51 51 51 51 51 51 51 51 51 51 52 52 51 51 51 51 51 51 51 51 51 51 51 51 51 51 50 51 51 51 51 51 51 51 51 51 51 51 51 52 52 51 51 51 51 51 51 51 51 51 51 51 51 52 52 52 52 52 52 52
3069E2j%%%%%%%%%%%%%%%J%%%%%%j%%%%%%%%J%%%%%%j%%%J%%%%%j%%J%%jJ%%%%%%j%%%%J%
$$ 52 51 51 51 51 51 51 51 51 51 51 51 51 51 51 51 51 52 52 52 52 52 52 52 51 51 51 51 51 51 51 51 51 52 52 52 52 52 52 52 51 51 51 51 52 52 52 52 52 52 51 51 51 52 52 52 51 52 52 52 52 52 52 52 51 51 51 51 51 52 52
3062E2%%%%%%%%j%jJ%%J%%%%j%%%%%%j%%J%%%%%%%%%%%%J%%%%%%j%Jj%%%%%%%%%%%Jj%%%j
$$ 52 52 52 52 52 52 52 52 52 51 51 50 51 51 51 52 52 52 52 52 51 51 51 51 51 51 51 50 50 50 51 51 51 51 51 51 51 51 51 51 51 51 51 52 52 52 52 52 52 52 51 51 52 51 51 51 51 51 51 51 51 51 51 51 51 52 51 51 51 51 50
3054E0%%%J%%%%%%%%%%%J%%%%j%%%%%%J%%j%%%%%%J%%%%%%%j%Jj%%%%j%J%%jJ%%%j%%J%%%
$$ 50 50 50 50 51 51 51 51 51 51 51 51 51 51 51 51 52 52 52 52 52 51 51 51 51 51 51 51 52 52 52 51 51 51 51 51 51 51 52 52 52 52 52 52 52 52 51 51 52 51 51 51 51 51 50 50 51 51 51 50 51 51 51 51 50 50 50 51 51 51 51
3047E1%%%%%%%%%%%%%%%%%%%J%%j%%%jJ%%%%%%%%J%%%j%%%%%%%%%%%%%%%J%j%%%%%%%%%%%
$$ 51 51 51 51 51 51 51 51 51 51 51 51 51 51 51 51 51 51 51 51 52 52 52 51 51 51 51 50 51 51 51 51 51 51 51 51 51 52 52 52 52 51 51 51 51 51 51 51 51 51 51 51 51 51 51 51 51 52 52 51 51 51 51 51 51 51 51 51 51 51 51
3039E1%%%%%%%%%%%%%%%%%%Jj%%jJ%%j%%%%%%J%%%%%%%%%%%%%%%%%%%%%%%%%%%%%%%%%%%%
$$ 51 51 51 51 51 51 51 51 51 51 51 51 51 51 51 51 51 51 51 52 51 51 51 50 51 51 51 50 50 50 50 50 50 50 51 51 51 51 51 51 51 51 51 51 51 51 51 51 51 51 51 51 51 51 51 51 51 51 51 51 51 51 51 51 51 51 51 51 51 51 51
3032E1%%J%%%%%%%%j%%%%%%%j%%%J%%%%%%%%%%%%%J%%%%%j%%%%%%%%%%jJ%%%%%%%j%%%J%%
$$ 51 51 51 52 52 52 52 52 52 52 52 52 51 51 51 51 51 51 51 51 50 50 50 50 51 51 51 51 51 51 51 51 51 51 51 51 51 51 52 52 52 52 52 52 51 51 51 51 51 51 51 51 51 51 51 50 51 51 51 51 51 51 51 51 50 50 50 50 51 51 51
3024E1%%%%jJ%%%%%%jJ%%%%%%%%%%%j%J%%%%%%j%%%%%%J%j%%%%%%%J%%%%%%%%%%%%%%%j%%
$$ 51 51 51 51 51 50 51 51 51 51 51 51 51 50 51 51 51 51 51 51 51 51 51 51 51 51 50 50 51 51 51 51 51 51 51 50 50 50 50 50 50 50 51 51 50 50 50 50 50 50 50 50 51 51 51 51 51 51 51 51 51 51 51 51 51 51 51 51 50 50 50
3017E0%%%%%%%%%J%%j%%%J%%%%%%%%%%%%%j%%%J%%%%%%j%%%%%%%%J%%%%%%%%%%%%%j%%%%J
$$ 50 50 50 50 50 50 50 50 50 50 51 51 51 50 50 50 50 51 51 51 51 51 51 51 51 51 51 51 51 51 51 50 50 50 50 51 51 51 51 51 51 51 50 50 50 50 50 50 50 50 50 51 51 51 51 51 51 51 51 51 51 51 51 51 51 50 50 50 50 50 51
3010E1%j%%%%%%J%%%%j%%Jj%%%J%%j%%j%%J%%Jj%%jJ%%J%%j%%%%%%%%%%%%%%J%%jJ%%%%j%
$$ 51 51 50 50 50 50 50 50 50 51 51 51 51 51 50 50 50 51 50 50 50 50 51 51 51 50 50 50 49 49 49 50 50 50 51 50 50 50 49 50 50 50 51 51 51 50 50 50 50 50 50 50 50 50 50 50 50 50 50 50 51 51 51 50 51 51 51 51 51 50 50
3002E0%%%%%%j%J%%%%%J%%j%%%jJ%%J%J%%j%%%%%j%J%%%%%%%%%%%%%%%%%%%%j%%%%J%%%j%
$$ 50 50 50 50 50 50 50 49 49 50 50 50 50 50 50 51 51 51 50 50 50 50 49 50 50 50 51 51 52 52 52 51 51 51 51 51 51 50 50 51 51 51 51 51 51 51 51 51 51 51 51 51 51 51 51 51 51 51 51 51 50 50 50 50 50 51 51 51 51 50 50
2995E0J%%%%%%j%%%%%%%%%j%%%%J%%%%%J%%%j%%J%j%%%%J%%%%%%%%%%%%%%%%%%%jj%%%%%J
$$ 50 51 51 51 51 51 51 51 50 50 50 50 50 50 50 50 50 50 49 49 49 49 49 50 50 50 50 50 50 51 51 51 51 50 50 50 51 51 50 50 50 50 50 51 51 51 51 51 51 51 51 51 51 51 51 51 51 51 51 51 51 51 51 50 49 49 49 49 49 49 50
2987E0%%%%%%%%%%%%%%J%%%%%j%%%%%%J%%%%%%%%%%%%%%%%%%%%jJ%%%%%%%%%%%%%%%Jj%%%
$$ 50 50 50 50 50 50 50 50 50 50 50 50 50 50 50 51 51 51 51 51 51 50 50 50 50 50 50 50 51 51 51 51 51 51 51 51 51 51 51 51 51 51 51 51 51 51 51 51 51 50 51 51 51 51 51 51 51 51 51 51 51 51 51 51 51 51 52 51 51 51 51
2980E1%%%%%%%J%%%%%j%j%%%%%%Jj%%%J%j%%J%%%J%j%%%%%%%%%%%%%%%%%%j%J%%%%%%%%%%
$$ 51 51 51 51 51 51 51 51 52 52 52 52 52 52 51 51 50 50 50 50 50 50 50 51 50 50 50 50 51 51 50 50 50 51 51 51 51 52 52 51 51 51 51 51 51 51 51 51 51 51 51 51 51 51 51 51 51 51 50 50 51 51 51 51 51 51 51 51 51 51 51
2973E1%%%%%%j%jJ%%%%%J%%%j%%%%%%J%%%%%%%%%%%%%%%Jj%%%%%%%%%%%%%%%%j%J%j%%%J%
$$ 51 51 51 51 51 51 51 50 50 49 50 50 50 50 50 50 51 51 51 51 50 50 50 50 50 50 50 51 51 51 51 51 51 51 51 51 51 51 51 51 51 51 51 52 51 51 51 51 51 51 51 51 51 51 51 51 51 51 51 51 51 50 50 51 51 50 50 50 50 51 51
2965E1%%%%j%%%Jj%%%J%%%%J%%j%%%J%%j%%%%%%%%%j%%%%%J%%%%%%%%%%%%%%%%%%%%%j%%%
$$ 51 51 51 51 51 50 50 50 50 51 50 50 50 50 51 51 51 51 51 52 52 52 51 51 51 51 52 52 52 51 51 51 51 51 51 51 51 51 51 50 50 50 50 50 50 51 51 51 51 51 51 51 51 51 51 51 51 51 51 51 51 51 51 51 51 51 51 50 50 50 50
2958E0%%%J%%j%%J%%%%%%%%%%jJ%%%j%J%%j%%%%%J%%%%%%%%%%%%%%%%%%%j%J%%%%%%%%%%%
$$ 50 50 50 50 51 51 51 50 50 50 51 51 51 51 51 51 51 51 51 51 51 50 51 51 51 51 50 50 51 51 51 50 50 50 50 50 50 51 51 51 51 51 51 51 51 51 51 51 51 51 51 51 51 51 51 51 51 50 50 51 51 51 51 51 51 51 51 51 51 51 51
2950E1j%%%J%%%%%%j%%J%%%%%%%%j%%%%%J%%%%%%%j%%%%%%J%j%%%%%%%%%J%%%%j%%%%%%%%
$$ 51 50 50 50 50 51 51 51 51 51 51 51 50 50 50 51 51 51 51 51 51 51 51 51 50 50 50 50 50 50 51 51 51 51 51 51 51 51 50 50 50 50 50 50 50 51 51 50 50 50 50 50 50 50 50 50 50 51 51 51 51 51 50 50 50 50 50 50 50 50 50
2943E0J%%%%%%%%%%%%%%%j%%J%j%%Jj%%%J%j%%%%Jj%%%%%%%%%J%j%%%%%Jj%%%%%%J%%j%%%
$$ 50 51 51 51 51 51 51 51 51 51 51 51 51 51 51 51 51 50 50 50 51 51 50 50 50 51 50 50 50 50 51 51 50 50 50 50 50 51 50 50 50 50 50 50 50 50 50 50 51 51 50 50 50 50 50 50 51 50 50 50 50 50 50 50 51 51 51 50 50 50 50
2935E0%%j%%J%%%%%%%%%%%%%%%%j%%%%J%%j%Jj%%%%Jj%%%%%%%j%%%J%%%%%j%%%J%%%%%%%%
$$ 50 50 50 49 49 49 50 50 50 50 50 50 50 50 50 50 50 50 50 50 50 50 50 49 49 49 49 49 50 50 50 49 49 50 49 49 49 49 49 50 49 49 49 49 49 49 49 49 48 48 48 48 49 49 49 49 49 49 48 48 48 48 49 49 49 49 49 49 49 49 49
2928D9%%%%%%%%J%%%%%%%%j%%%%J%%%%%%%%%%%J%%%j%%%jJ%%%jJ%%%%%%J%%%%%j%%%%%J%%
$$ 49 49 49 49 49 49 49 49 49 50 50 50 50 50 50 50 50 50 49 49 49 49 49 50 50 50 50 50 50 50 50 50 50 50 50 51 51 51 51 50 50 50 50 49 50 50 50 50 49 50 50 50 50 50 50 50 51 51 51 51 51 51 50 50 50 50 50 50 51 51 51
2921E1%%%%%%%%%%%%%jJ%j%%%%%%%%%%J%%%%%%jJ%%%%%%%%%%%j%J%j%%%%%%%%%%%%%%%Jj%
$$ 51 51 51 51 51 51 51 51 51 51 51 51 51 51 50 51 51 50 50 50 50 50 50 50 50 50 50 50 51 51 51 51 51 51 51 50 51 51 51 51 51 51 51 51 51 51 51 51 50 50 51 51 50 50 50 50 50 50 50 50 50 50 50 50 50 50 50 50 51 50 50
2913E0J%j%jJ%%%%%J%%%%jJ%%%%%j%%%%J%%j%%%%%%J%%%%j%%J%%%j%J%%j%J%%%%j%%%j%%%
$$ 50 51 51 50 50 49 50 50 50 50 50 50 51 51 51 51 51 50 51 51 51 51 51 51 50 50 50 50 50 51 51 51 50 50 50 50 50 50 50 51 51 51 51 51 50 50 50 51 51 51 51 50 50 51 51 51 50 50 51 51 51 51 51 50 50 50 50 49 49 49 49
2906D9%%%%%J%%%J%j%%%%%%%%%%%%%%%%%%%%%%%%Jj%%J%j%j%J%%%J%%%%j%%J%%%%%%j%%J%
$$ 49 49 49 49 49 49 50 50 50 50 51 51 50 50 50 50 50 50 50 50 50 50 50 50 50 50 50 50 50 50 50 50 50 50 50 50 50 51 50 50 50 51 51 50 50 49 49 50 50 50 50 51 51 51 51 51 50 50 50 51 51 51 51 51 51 51 50 50 50 51 51
2898E1%%%%%%%%%%j%%%%%%%%J%%%%j%%%%%%%%%%J%%%%%%%%j%J%%%%%j%%%j%%J%%%%%%%%J%
$$ 51 51 51 51 51 51 51 51 51 51 51 50 50 50 50 50 50 50 50 50 51 51 51 51 51 50 50 50 50 50 50 50 50 50 50 50 51 51 51 51 51 51 51 51 51 50 50 51 51 51 51 51 51 50 50 50 50 49 49 49 50 50 50 50 50 50 50 50 50 51 51
2891E1%%%%%%%%j%%%%%%%%J%%%%%%%%%%%%%j%%%%%%%J%%%%%j%J%%%%%%%%%%%%j%%%%%J%%%
$$ 51 51 51 51 51 51 51 51 51 50 50 50 50 50 50 50 50 50 51 51 51 51 51 51 51 51 51 51 51 51 51 51 50 50 50 50 50 50 50 50 51 51 51 51 51 51 50 50 51 51 51 51 51 51 51 51 51 51 51 51 51 50 50 50 50 50 50 51 51 51 51
2884E1J%%%%j%J%%%%%%%%%j%%%%J%%%%j%%J%%%%%%%%%%%%%%%J%%%%%%%%J%%%%%%%%%J%%%%
$$ 51 52 52 52 52 52 51 51 52 52 52 52 52 52 52 52 52 52 51 51 51 51 51 52 52 52 52 52 51 51 51 52 52 52 52 52 52 52 52 52 52 52 52 52 52 52 52 53 53 53 53 53 53 53 53 53 54 54 54 54 54 54 54 54 54 54 55 55 55 55 55
2876E5%%%%%%J%%%Jj%%j%%%%%%%%%%%%%J%J%%%%%%%J%%J%%%%J%%%J%%J%%%%%%%%JjJ%j%j%
$$ 55 55 55 55 55 55 55 56 56 56 56 57 56 56 56 55 55 55 55 55 55 55 55 55 55 55 55 55 55 56 56 57 57 57 57 57 57 57 57 58 58 58 59 59 59 59 59 60 60 60 60 61 61 61 62 62 62 62 62 62 62 62 62 63 62 63 63 62 62 61 61
2869F1%%%j%%%%%%%j%%%%%%%%%%J%%%%JJ%%%%%%%%%J%%%%%%j%j%%%%j%j%%%%j%j%%%%%j%j
$$ 61 61 61 61 60 60 60 60 60 60 60 60 59 59 59 59 59 59 59 59 59 59 59 60 60 60 60 60 61 62 62 62 62 62 62 62 62 62 62 63 63 63 63 63 63 63 62 62 61 61 61 61 61 60 60 59 59 59 59 59 58 58 57 57 57 57 57 57 56 56 55
2861E5%%%%%%%%%%%Jj%J%%%%%%%%%%jj%%%%%%%%%%%%%j%%%j%J%%%%j%%%Jj%%%%%j%%%%Jj%
$$ 55 55 55 55 55 55 55 55 55 55 55 55 56 55 55 56 56 56 56 56 56 56 56 56 56 56 55 54 54 54 54 54 54 54 54 54 54 54 54 54 54 53 53 53 53 52 52 53 53 53 53 53 52 52 52 52 53 52 52 52 52 52 52 51 51 51 51 51 52 51 51
2854E1%%%%%%jJ%%j%%%J%%J%j%%%%%%%%%%%%%j%%%%Jj%%%%%%%%%%%%J%%%%%%%%%%j%%%%%%
$$ 51 51 51 51 51 51 51 50 51 51 51 50 50 50 50 51 51 51 52 52 51 51 51 51 51 51 51 51 51 51 51 51 51 51 50 50 50 50 50 51 50 50 50 50 50 50 50 50 50 50 50 50 50 51 51 51 51 51 51 51 51 51 51 51 50 50 50 50 50 50 50
2846E0%%%%%%%%%%%%%%%%%%%%Jj%%%%%%%%%%%%%%%%%%%%Jj%%%%%%%%%jJ%%%%J%%%j%%%%%%
$$ 50 50 50 50 50 50 50 50 50 50 50 50 50 50 50 50 50 50 50 50 50 51 50 50 50 50 50 50 50 50 50 50 50 50 50 50 50 50 50 50 50 50 50 51 50 50 50 50 50 50 50 50 50 50 49 50 50 50 50 50 51 51 51 51 50 50 50 50 50 50 50
2839E0%%%%%%Jj%%%%j%J%%%%J%j%%%%%%%%%%%%%%%J%%%j%%%J%%j%%%%%%%%%%%%%%j%%%%%%
$$ 50 50 50 50 50 50 50 51 50 50 50 50 50 49 49 50 50 50 50 50 51 51 50 50 50 50 50 50 50 50 50 50 50 50 50 50 50 50 51 51 51 51 50 50 50 50 51 51 51 50 50 50 50 50 50 50 50 50 50 50 50 50 50 50 49 49 49 49 49 49 49
2832D9%%J%%%%%%%%%%%j%%%J%j%%%%%%%J%j%%%%%%J%%%%%%%%j%%%%%%%%%J%%j%%%J%j%%%%
$$ 49 49 49 50 50 50 50 50 50 50 50 50 50 50 50 49 49 49 49 50 50 49 49 49 49 49 49 49 49 50 50 49 49 49 49 49 49 49 50 50 50 50 50 50 50 50 50 49 49 49 49 49 49 49 49 49 49 50 50 50 49 49 49 49 50 50 49 49 49 49 49
2824D9%%%%%%%%%J%%%j%%%%%%%%%%%%%%%%%%%J%j%j%JJ%%%%j%j%%%%J%%%j%Jj%%%%%%%J%%
$$ 49 49 49 49 49 49 49 49 49 49 50 50 50 50 49 49 49 49 49 49 49 49 49 49 49 49 49 49 49 49 49 49 49 49 50 50 49 49 48 48 49 50 50 50 50 50 49 49 48 48 48 48 48 49 49 49 49 48 48 49 48 48 48 48 48 48 48 48 49 49 49
2817D9%%%%%jJ%J%%%%%%%%%%%%%jJj%%%%%%%%%%%J%%%%%%%%j%%%%%%J%%%%%%%%%j%%J%%%j
$$ 49 49 49 49 49 49 48 49 49 50 50 50 50 50 50 50 50 50 50 50 50 50 50 49 50 49 49 49 49 49 49 49 49 49 49 49 49 50 50 50 50 50 50 50 50 50 49 49 49 49 49 49 49 50 50 50 50 50 50 50 50 50 50 49 49 49 50 50 50 50 49
2809D9%%%%%J%%%%%%%%%%%%%%j%%%%%Jj%%%%%%Jj%%%%%%%J%%%%%%%%%j%J%%j%J%%%%j%%%%
$$ 49 49 49 49 49 49 50 50 50 50 50 50 50 50 50 50 50 50 50 50 50 49 49 49 49 49 49 50 49 49 49 49 49 49 49 50 49 49 49 49 49 49 49 49 50 50 50 50 50 50 50 50 50 50 49 49 50 50 50 49 49 50 50 50 50 50 49 49 49 49 49
2802D9Jj%%%%%%%%%%%%%%J%%J%%%j%%%%%%%j%%J%%%%%%%%%%%%%j%%%%J%%Jj%%%%%j%J%%%%
$$ 49 50 49 49 49 49 49 49 49 49 49 49 49 49 49 49 49 50 50 50 51 51 51 51 50 50 50 50 50 50 50 50 49 49 49 50 50 50 50 50 50 50 50 50 50 50 50 50 50 49 49 49 49 49 50 50 50 51 50 50 50 50 50 50 49 49 50 50 50 50 50
2795E0%%%J%j%%%%%%%%%%%%%%%j%%%J%%%j%%%%J%%%%%Jj%%%j%J%%%%%%%%%%%%J%%j%%%%%%
$$ 50 50 50 50 51 51 50 50 50 50 50 50 50 50 50 50 50 50 50 50 50 50 49 49 49 49 50 50 50 50 49 49 49 49 49 50 50 50 50 50 50 51 50 50 50 50 49 49 50 50 50 50 50 50 50 50 50 50 50 50 50 51 51 51 50 50 50 50 50 50 50
2787E0%%%%%%%%J%%%j%%%%%%%%%%%%%%%%%%%%J%%j%%%%%%j%J%%%%%%%%j%%%%%%J%%%%%Jj%
$$ 50 50 50 50 50 50 50 50 50 51 51 51 51 50 50 50 50 50 50 50 50 50 50 50 50 50 50 50 50 50 50 50 50 50 51 51 51 50 50 50 50 50 50 50 49 49 50 50 50 50 50 50 50 50 50 49 49 49 49 49 49 49 50 50 50 50 50 50 51 50 50
2780E0j%J%%%J%%%%%%%%%%%%%%%%%%%%%%j%%%%%j%%J%%J%%j%%%%%%J%j%%%%%%%%%%%%jJ%%
$$ 50 49 49 50 50 50 50 51 51 51 51 51 51 51 51 51 51 51 51 51 51 51 51 51 51 51 51 51 51 51 50 50 50 50 50 50 49 49 49 50 50 50 51 51 51 50 50 50 50 50 50 50 51 51 50 50 50 50 50 50 50 50 50 50 50 50 50 49 50 50 50
2772E0%%%%%%%%%%%%%%%%%%%%%%%%%%j%%%%%J%%%%%%%%%%%%%%J%j%%%%%%%%%%%%%j%%%j%%
$$ 50 50 50 50 50 50 50 50 50 50 50 50 50 50 50 50 50 50 50 50 50 50 50 50 50 50 50 49 49 49 49 49 49 50 50 50 50 50 50 50 50 50 50 50 50 50 50 50 51 51 50 50 50 50 50 50 50 50 50 50 50 50 50 50 49 49 49 49 48 48 48
2765D8%%J%%%%%%%%%%%%%%%%%%%%j%%J%%%%%%%%%%%%%%%%%%%%%%%%J%%%%%%%%%jJ%%%%%%J
$$ 48 48 48 49 49 49 49 49 49 49 49 49 49 49 49 49 49 49 49 49 49 49 49 49 48 48 48 49 49 49 49 49 49 49 49 49 49 49 49 49 49 49 49 49 49 49 49 49 49 49 49 49 50 50 50 50 50 50 50 50 50 50 49 50 50 50 50 50 50 50 51
2757E1%j%%%%%%%%%%j%%J%%j%%%JJ%%j%%%%%%%%%%%j%%%%%%%%J%%%jJ%%%%%%j%%%%%%%%%%
$$ 51 51 50 50 50 50 50 50 50 50 50 50 50 49 49 49 50 50 50 49 49 49 49 50 51 51 51 50 50 50 50 50 50 50 50 50 50 50 50 49 49 49 49 49 49 49 49 49 50 50 50 50 49 50 50 50 50 50 50 50 49 49 49 49 49 49 49 49 49 49 49
2750D9%%%%J%%%Jj%%J%j%%%%%%%%%%J%%j%%%%%%J%%J%%%%j%%j%%%%%%%J%%%%%%%%%%%j%%%
$$ 49 49 49 49 49 50 50 50 50 51 50 50 50 51 51 50 50 50 50 50 50 50 50 50 50 50 51 51 51 50 50 50 50 50 50 50 51 51 51 52 52 52 52 52 51 51 51 50 50 50 50 50 50 50 50 51 51 51 51 51 51 51 51 51 51 51 51 50 50 50 50
2743E0%%%%%%%%%%%%%%%%%%%%Jj%%%J%%j%%%%%%J%%%%%%j%%J%%%%%%%j%J%%%%%%%%%%%%%%
$$ 50 50 50 50 50 50 50 50 50 50 50 50 50 50 50 50 50 50 50 50 50 51 50 50 50 50 51 51 51 50 50 50 50 50 50 50 51 51 51 51 51 51 51 50 50 50 51 51 51 51 51 51 51 51 50 50 51 51 51 51 51 51 51 51 51 51 51 51 51 51 51
2735E1%%%%J%j%%%%J%%%j%%%%%j%%%%%%%%%%%%%%%%%J%%%%j%%%%%%jJ%%jJ%%%%%%%j%%%%%
$$ 51 51 51 51 51 52 52 51 51 51 51 51 52 52 52 52 51 51 51 51 51 51 50 50 50 50 50 50 50 50 50 50 50 50 50 50 50 50 50 50 51 51 51 51 51 50 50 50 50 50 50 50 49 50 50 50 49 50 50 50 50 50 50 50 50 49 49 49 49 49 49
2728D9%%%%%%%%J%%%%%%%%%%%j%%%J%%%%%%%%%%%jJ%J%%%%%%%%%%%%%%%%%%%%%%%%%%%%%%
$$ 49 49 49 49 49 49 49 49 49 50 50 50 50 50 50 50 50 50 50 50 50 49 49 49 49 50 50 50 50 50 50 50 50 50 50 50 50 49 50 50 51 51 51 51 51 51 51 51 51 51 51 51 51 51 51 51 51 51 51 51 51 51 51 51 51 51 51 51 51 51 51
2720E1%%j%%%%%%%%%%%%%%%%J%%%j%%%%%%%%%%%%%%%Jj%%%%%%%%%%%%%%%%%%j%%%J%%%J%%
$$ 51 51 51 50 50 50 50 50 50 50 50 50 50 50 50 50 50 50 50 50 51 51 51 51 50 50 50 50 50 50 50 50 50 50 50 50 50 50 50 50 51 50 50 50 50 50 50 50 50 50 50 50 50 50 50 50 50 50 50 50 49 49 49 49 50 50 50 50 51 51 51
2713E1%j%%%%%%%%%%%%%%%%%j%%%J%%%%%%j%%%%Jj%%%%J%%%%%%%%%%%J%%j%%JJjj%%%%%%%
$$ 51 51 50 50 50 50 50 50 50 50 50 50 50 50 50 50 50 50 50 50 49 49 49 49 50 50 50 50 50 50 50 49 49 49 49 49 50 49 49 49 49 49 50 50 50 50 50 50 50 50 50 50 50 50 51 51 51 50 50 50 51 52 51 50 50 50 50 50 50 50 50
2706E0%j%%%J%%jJ%%%%%%%%%%%%%%j%%%Jj%%%%%%%%%%%%%%%%%%jJ%%%j%%%%j%%%%jJ%%%%%
$$ 50 50 49 49 49 49 50 50 50 49 50 50 50 50 50 50 50 50 50 50 50 50 50 50 50 49 49 49 49 50 49 49 49 49 49 49 49 49 49 49 49 49 49 49 49 49 49 49 49 48 49 49 49 49 48 48 48 48 48 47 47 47 47 47 46 47 47 47 47 47 47
2698D7%%%%%%%%j%%J%j%%%%%%%%%%%%%%J%%%%j%%%%%J%%%J%%%%%%%J%%jJ%%J%%%%%%%j%J%
$$ 47 47 47 47 47 47 47 47 47 46 46 46 47 47 46 46 46 46 46 46 46 46 46 46 46 46 46 46 46 47 47 47 47 47 46 46 46 46 46 46 47 47 47 47 48 48 48 48 48 48 48 48 49 49 49 48 49 49 49 50 50 50 50 50 50 50 50 49 49 50 50
2691E0%%%J%%%%j%%%%%%J%%%%j%%%%Jj%%%%%%%%j%%%J%%%%%%%J%%j%%%%J%%%%%j%%%%%%%J
$$ 50 50 50 50 51 51 51 51 51 50 50 50 50 50 50 50 51 51 51 51 51 50 50 50 50 50 51 50 50 50 50 50 50 50 50 50 49 49 49 49 50 50 50 50 50 50 50 50 51 51 51 50 50 50 50 50 51 51 51 51 51 51 50 50 50 50 50 50 50 50 51
2683E1%%%%%%%%%%%%%%%%%%%jJ%J%j%%%%%%j%%%J%%%%%%%%%%%%%%%%%%%%%%%%%%Jj%%%j%%
$$ 51 51 51 51 51 51 51 51 51 51 51 51 51 51 51 51 51 51 51 51 50 51 51 52 52 51 51 51 51 51 51 51 50 50 50 50 51 51 51 51 51 51 51 51 51 51 51 51 51 51 51 51 51 51 51 51 51 51 51 51 51 51 51 52 51 51 51 51 50 50 50
2676E0%%%%J%%%%%%%%%%%%%%%%Jj%%%%%%%%%%%%%%%%%%%%%%%%Jj%%%%%Jj%%%%j%%J%%%J%j
$$ 50 50 50 50 50 51 51 51 51 51 51 51 51 51 51 51 51 51 51 51 51 51 52 51 51 51 51 51 51 51 51 51 51 51 51 51 51 51 51 51 51 51 51 51 51 51 51 51 52 51 51 51 51 51 51 52 51 51 51 51 51 50 50 50 51 51 51 51 52 52 51
2668E1%%%j%%%%J%%%%J%%jJ%%%%%%%%%%j%J%%%j%%%Jj%%Jj%%J%%%%%Jj%%%%j%%%%%j%%J%%
$$ 51 51 51 51 50 50 50 50 50 51 51 51 51 51 52 52 52 51 52 52 52 52 52 52 52 52 52 52 52 51 51 52 52 52 52 51 51 51 51 52 51 51 51 52 51 51 51 52 52 52 52 52 52 53 52 52 52 52 52 51 51 51 51 51 51 50 50 50 51 51 51
2661E1%J%jJ%%%%%%%%%%J%%%j%%%%%%%%j%%%%%%%%jJ%%%J%%%j%%%%%%%%%%%%Jj%%%%%%%%J
$$ 51 51 52 52 51 52 52 52 52 52 52 52 52 52 52 52 53 53 53 53 52 52 52 52 52 52 52 52 52 51 51 51 51 51 51 51 51 51 50 51 51 51 51 52 52 52 52 51 51 51 51 51 51 51 51 51 51 51 51 51 52 51 51 51 51 51 51 51 51 51 52
2654E2%j%j%J%%%%%%Jj%%J%%j%%%%J%%%%%%J%%%j%%J%j%%%%%%%%%Jj%%%%%J%%%%%%%j%%%%
$$ 52 52 51 51 50 50 51 51 51 51 51 51 51 52 51 51 51 52 52 52 51 51 51 51 51 52 52 52 52 52 52 52 53 53 53 53 52 52 52 53 53 52 52 52 52 52 52 52 52 52 52 53 52 52 52 52 52 52 53 53 53 53 53 53 53 53 52 52 52 52 52
2646E2%%%%%%%JjJ%%%%j%%%J%%%%%%%%%%%%%J%j%%%J%jJ%%jJ%j%%%J%j%J%%%%%%%%jJ%%%%
$$ 52 52 52 52 52 52 52 52 53 52 53 53 53 53 53 52 52 52 52 53 53 53 53 53 53 53 53 53 53 53 53 53 53 54 54 53 53 53 53 54 54 53 54 54 54 53 54 54 53 53 53 53 54 54 53 53 54 54 54 54 54 54 54 54 54 53 54 54 54 54 54
2639E4%%%%%%j%%%%%%%%%%%J%%%%%%%%%%%%%%%%%jJ%%%%%J%%j%%%%%%%J%%J%j%%%%%%%%%%
$$ 54 54 54 54 54 54 54 53 53 53 53 53 53 53 53 53 53 53 53 54 54 54 54 54 54 54 54 54 54 54 54 54 54 54 54 54 54 53 54 54 54 54 54 54 55 55 55 54 54 54 54 54 54 54 54 55 55 55 56 56 55 55 55 55 55 55 55 55 55 55 55
2631E5%J%%j%%%%%%%%%jJ%%%%%%%%J%%%%%%%%%%J%%%j%%%J%%%%%%J%%j%%J%%%%%%%%%%%%J
$$ 55 55 56 56 56 55 55 55 55 55 55 55 55 55 55 54 55 55 55 55 55 55 55 55 55 56 56 56 56 56 56 56 56 56 56 56 57 57 57 57 56 56 56 56 57 57 57 57 57 57 57 58 58 58 57 57 57 58 58 58 58 58 58 58 58 58 58 58 58 58 59
2624E9%%%%%%%%%%J%%%%%%%%%%%%J%%J%%%%%J%J%j%%%%%%%J%%J%J%%Jj%%%%%J%%J%%%J%%%
$$ 59 59 59 59 59 59 59 59 59 59 59 60 60 60 60 60 60 60 60 60 60 60 60 60 61 61 61 62 62 62 62 62 62 63 63 64 64 63 63 63 63 63 63 63 63 64 64 64 65 65 66 66 66 67 66 66 66 66 66 66 67 67 67 68 68 68 68 69 69 69 69
2617F9%Jj%J%%J%%J%J%J%%%%%%J%J%J%%%%%%%J%%J%%J%%%J%%%J%%%J%%%%%%%%J%%%%%%J%%
$$ 69 69 70 69 69 70 70 70 71 71 71 72 72 73 73 74 74 74 74 74 74 74 75 75 76 76 77 77 77 77 77 77 77 77 78 78 78 79 79 79 80 80 80 80 81 81 81 81 82 82 82 82 83 83 83 83 83 83 83 83 83 84 84 84 84 84 84 84 85 85 85
2609H5%%%%%%jJ%%%%%j%%%%%%%j%j%JjjJj%%%%%%j%%%%%j%%%%%j%%%%j%%%%j%%%%%j%%%j%
$$ 85 85 85 85 85 85 85 84 85 85 85 85 85 85 84 84 84 84 84 84 84 84 83 83 82 82 83 82 81 82 81 81 81 81 81 81 81 80 80 80 80 80 80 79 79 79 79 79 79 78 78 78 78 78 77 77 77 77 77 76 76 76 76 76 76 75 75 75 75 74 74
2602G4%%j%%%%j%%%%%j%%%%%%%j%%%j%%%%%%%%%%j%%%%j%%%%%J%j%%j%%%%Jj%%j%J%%%j%%
$$ 74 74 74 73 73 73 73 73 72 72 72 72 72 72 71 71 71 71 71 71 71 71 70 70 70 70 69 69 69 69 69 69 69 69 69 69 69 68 68 68 68 68 67 67 67 67 67 67 68 68 67 67 67 66 66 66 66 66 67 66 66 66 65 65 66 66 66 66 65 65 65
2594F5Jj%%%%%%%%j%%%j%%J%%%%%%%%%%%%%%%%%%%%%%%%%%%%%%%%J%j%%%%J%%%%%%%%%%j%
$$ 65 66 65 65 65 65 65 65 65 65 65 64 64 64 64 63 63 63 64 64 64 64 64 64 64 64 64 64 64 64 64 64 64 64 64 64 64 64 64 64 64 64 64 64 64 64 64 64 64 64 64 65 65 64 64 64 64 64 65 65 65 65 65 65 65 65 65 65 65 64 64
2587F4%%J%%J%%%%%%%%%J%%%%%%%%%%%%%J%%JJ%%JJJ%%J%JJJJJJJKJKJJKKKLKLKLMMMNMNO
$$ 64 64 64 65 65 65 66 66 66 66 66 66 66 66 66 66 67 67 67 67 67 67 67 67 67 67 67 67 67 67 68 68 68 69 70 70 70 71 72 73 73 73 74 74 75 76 77 78 79 80 81 83 84 86 87 88 90 92 94 97 99 102 104 107 111 115 119 124 128 133 139
2579A39NOOOOOOONMMLKJ%%kkkmmnnoonooononnnmmmlllkklkkkjjkjjjjjjjj%%jj%%jjjj%%
$$ 139 144 150 156 162 168 174 180 186 191 195 199 202 204 205 205 205 203 201 199 195 191 186 181 175 169 164 158 152 146 141 135 130 125 120 116 112 108 105 102 99 97 95 92 90 88 86 85 84 82 81 80 79 78 77 76 75 74 74 74 73 72 72 72 71 70 69 68 68 68
2572F8j%%%%j%%%j%%%j%%%%%%%%%j%%%%%%%%%%%%%%%%j%%%%%%%%%%%%j%%J%jj%%Jj%%%j%%
$$ 68 67 67 67 67 67 66 66 66 66 65 65 65 65 64 64 64 64 64 64 64 64 64 64 63 63 63 63 63 63 63 63 63 63 63 63 63 63 63 63 63 62 62 62 62 62 62 62 62 62 62 62 62 62 61 61 61 62 62 61 60 60 60 61 60 60 60 60 59 59 59
2565E9jJj%%%%%J%%J%J%J%JJ%JJ%JKJJJJJ%J%JJ%J%J%J%%%J%%%%J%%%%%%%J%%J%%J%%%J%%
$$ 59 58 59 58 58 58 58 58 58 59 59 59 60 60 61 61 62 62 63 64 64 65 66 66 67 69 70 71 72 73 74 74 75 75 76 77 77 78 78 79 79 80 80 80 80 81 81 81 81 81 82 82 82 82 82 82 82 82 83 83 83 84 84 84 85 85 85 85 86 86 86
2557H6%J%%%jJ%%%J%%%%%%%%%%%%%%J%%%%%j%%%%%%J%%%%J%J%J%%J%%%J%%%J%%%J%%%%%%J
$$ 86 86 87 87 87 87 86 87 87 87 87 88 88 88 88 88 88 88 88 88 88 88 88 88 88 88 89 89 89 89 89 89 88 88 88 88 88 88 88 89 89 89 89 89 90 90 91 91 92 92 92 93 93 93 93 94 94 94 94 95 95 95 95 96 96 96 96 96 96 96 97
2550I7%%J%%%%%%%J%%%j%%%%%%%%%j%j%%%%%J%j%J%%%%%j%j%%j%j%j%%%%%%%J%JKJJJJ%KJ
$$ 97 97 97 98 98 98 98 98 98 98 98 99 99 99 99 98 98 98 98 98 98 98 98 98 98 97 97 96 96 96 96 96 96 97 97 96 96 97 97 97 97 97 97 96 96 95 95 95 94 94 93 93 92 92 92 92 92 92 92 92 93 93 94 96 97 98 99 100 100 102 103
2542A03KKKKJKKKLKLKLKKKKLKLKKJKJKJJJJ%%%%%jjjjj%jj%j%j%%%j%%%%J%J%JJJ%JJKJKJ
$$ 103 105 107 109 111 112 114 116 118 121 123 126 128 131 133 135 137 139 142 144 147 149 151 152 154 155 157 158 159 160 161 161 161 161 161 161 160 159 158 157 156 156 155 154 154 153 153 152 152 152 152 151 151 151 151 151 152 152 153 153 154 155 156 156 157 158 160 161 163 164
2535A64KKJJKJJJJKJJJJJJKJJJJJJ%%%%%%j%%j%%JJJKKLLMMNNOOOPQQQPQRQRQPQRQPQPPPP
$$ 164 166 168 169 170 172 173 174 175 176 178 179 180 181 182 183 184 186 187 188 189 190 191 192 192 192 192 192 192 192 191 191 191 190 190 190 191 192 193 195 197 200 203 207 211 216 221 227 233 239 246 254 262 270 277 285 294 302 311 319 326 334 343 351 358 366 373 380 387 394
2528C94PPOONOOOOOONPOOOPPPPQPQQPRRRRRRRJ0J0J0J1J1J1J1J2J1J3J4J4J5J6J6J7J8J8J9
$$ 394 401 408 414 420 425 431 437 443 449 455 461 466 473 479 485 491 498 505 512 519 527 534 542 550 557 566 575 584 593 602 611 620 630 640 650 661 672 683 694 706 717 730 744 758 773 789 805 822 840 858 877
2522H77K0K1K2K4K5K6K7K9L0L2L4L6L8L9M2M5M7N0N3N5O0O3O8P2P7Q2Q7R4J01J07J15J24J32
$$ 877 897 918 940 964 989 1015 1042 1071 1101 1133 1167 1203 1241 1280 1322 1367 1414 1464 1517 1572 1632 1695 1763 1835 1912 1994 2081 2175 2276 2383 2498 2622 2754
2519B754J42J52J63J74J87K00K15K32K49K69K91L17L45L78M12M53M99N49O04O65P31Q00Q74
$$ 2754 2896 3048 3211 3385 3572 3772 3987 4219 4468 4737 5028 5345 5690 6068 6480 6933 7432 7981 8585 9250 9981 10781 11655
2517A1655R47J020J091J154J209J249J274J279J259J216J148J054R36P98O41M71K90J06q0
$$ 11655 12602 13622 14713 15867 17076 18325 19599 20878 22137 23353 24501 25555 26491 27289 27930 28401 28691 28797 28717
2514B8717k60m31n92p35q63r70j058j125j173j199j209j199j177j142j096j044r86r25q63
$$ 28717 28457 28026 27434 26699 25836 24866 23808 22683 21510 20311 19102 17903 16726 15584 14488 13444 12458 11533 10670
2512A0670q00p38o77o20n65n15m68m26l87l52l22k94k69k48k29k13j97j85j72j61j51j42j33
$$ 10670 9870 9132 8455 7835 7270 6755 6287 5861 5474 5122 4800 4506 4237 3989 3760 3547 3350 3165 2993 2832 2681 2539 2406
2510B406j25j19j11j04r8r2q6q1p6p1o6o3n9n5n1m9m5m3l9l7l5l3l2k9k8k7k5k4k3k2k0j9
$$ 2406 2281 2162 2051 1947 1849 1757 1671 1590 1514 1443 1377 1314 1255 1200 1149 1100 1055 1012 973 936 901 868 836 807 779 752 727 703 680 658 638 619
2507F19j9j8j8j7j6j6j4j4j4j3j3j3j2j2j1j0j1j0j0rrrqqqppqopoononnmmnmmlllllkkkk
$$ 619 600 582 564 547 531 515 501 487 473 460 447 434 422 410 399 389 378 368 358 349 340 331 323 315 307 300 293 285 279 272 266 260 255 249 244 239 235 231 226 222 218 215 212 209 206 203 201 199 197 195
2501A95j%%%JJJLKLKLLMLLKLKKK%J%jjjkllllmlmmmmnmmlmlllklkklkljkjjkjjjjjjj%jjj
$$ 195 194 194 194 194 195 196 197 200 202 205 207 210 213 217 220 223 225 228 230 232 234 234 235 235 234 233 232 230 227 224 221 218 214 211 207 203 199 195 190 186 182 179 175 172 169 166 164 161 159 157 154 152 149 148 146 145 144 142 141 140 139 138 137 136 135 135 134 133 132
2494A32%jjjjk%jjkjjkjkkjkkkkjkkkkkkkjkjkjjjjj%%%%%JJ%JJJJJJJJKJJJKJJJJ%JJJJJ
$$ 132 132 131 130 129 128 126 126 125 124 122 121 120 118 117 115 113 112 110 108 106 104 103 101 99 97 95 93 91 89 88 86 85 83 82 81 80 79 78 78 78 78 78 78 79 80 80 81 82 83 84 85 86 87 88 90 91 92 93 95 96 97 98 99 99 100 101 102 103 104
2487A04J%J%%%%%Jj%jjj%jjjjjjjkjjj%j%j%j%%j%jjjjjj%j%jjjj%jjj%j%j%j%%%%%%j%%j
$$ 104 105 105 106 106 106 106 106 106 107 106 106 105 104 103 103 102 101 100 99 98 97 96 94 93 92 91 91 90 90 89 89 88 88 88 87 87 86 85 84 83 82 81 81 80 80 79 78 77 76 76 75 74 73 73 72 72 71 71 70 70 70 70 70 70 70 69 69 69 68
2479F8%%%%%%%%j%%%%%%j%%%%%%%%%%%%%%%%%%%%j%j%%jj%%%j%%j%%%%j%j%J%%%j%%%%j%%
$$ 68 68 68 68 68 68 68 68 68 67 67 67 67 67 67 67 66 66 66 66 66 66 66 66 66 66 66 66 66 66 66 66 66 66 66 66 66 65 65 64 64 64 63 62 62 62 62 61 61 61 60 60 60 60 60 59 59 58 58 59 59 59 59 58 58 58 58 58 57 57 57
2472E7%%%J%%%j%%%%J%%%%%%%%%%%j%%%%j%%%%%jJJ%JJJJKJJJJKJKJJJJ%%%%%%%%%%%%%%j
$$ 57 57 57 57 58 58 58 58 57 57 57 57 57 58 58 58 58 58 58 58 58 58 58 58 58 57 57 57 57 57 56 56 56 56 56 56 55 56 57 57 58 59 60 61 63 64 65 66 67 69 70 72 73 74 75 76 76 76 76 76 76 76 76 76 76 76 76 76 76 76 75
2465G5j%j%j%jj%%%%%%j%%Jjj%j%%%%%%%%j%%%%j%%%%%j%%%%Jj%%%%%%%%%J%%j%%%jJ%%%%
$$ 75 74 74 73 73 72 72 71 70 70 70 70 70 70 70 69 69 69 70 69 68 68 67 67 67 67 67 67 67 67 67 66 66 66 66 66 65 65 65 65 65 65 64 64 64 64 64 65 64 64 64 64 64 64 64 64 64 64 65 65 65 64 64 64 64 63 64 64 64 64 64
2457F4%%%%%%%%%%%%%%J%%%%%%%J%J%%J%%%J%JJ%JJJJJJJJJKJKKKJKLLKLMLNMNMOONOOPOO
$$ 64 64 64 64 64 64 64 64 64 64 64 64 64 64 64 65 65 65 65 65 65 65 65 66 66 67 67 67 68 68 68 68 69 69 70 71 71 72 73 74 75 76 77 78 79 80 82 83 85 87 89 90 92 95 98 100 103 107 110 115 119 124 128 134 140 145 151 157 164 170 176
2450A76OONMMLKJ%jkkmmnooooooopnonnmmmmlkllklkjkjkjkjjjjjj%j%jjj%j%j%%j%%%%j%
$$ 176 182 188 193 197 201 204 206 207 207 206 204 202 198 194 189 183 177 171 165 159 153 147 140 135 129 124 119 115 111 107 103 100 98 95 92 90 87 85 84 82 81 79 78 76 75 74 73 72 71 70 70 69 69 68 67 66 66 65 65 64 64 64 63 63 63 63 63 62 62
2442F2%j%%%%%j%%%%%j%Jj%j%%%%Jj%J%%J%j%j%%%%%Jj%%j%%%%%J%%j%%%%%%%%J%j%%j%%%
$$ 62 62 61 61 61 61 61 61 60 60 60 60 60 60 59 59 60 59 59 58 58 58 58 58 59 58 58 59 59 59 60 60 59 59 58 58 58 58 58 58 59 58 58 58 57 57 57 57 57 57 58 58 58 57 57 57 57 57 57 57 57 57 58 58 57 57 57 56 56 56 56
2435E6J%%j%J%%%%j%J%%%j%%%%%%%%%Jj%j%%%%%%%J%%%%%%%%j%%%%J%%jJ%%%%%%%%%%%j%J
$$ 56 57 57 57 56 56 57 57 57 57 57 56 56 57 57 57 57 56 56 56 56 56 56 56 56 56 56 57 56 56 55 55 55 55 55 55 55 55 56 56 56 56 56 56 56 56 56 55 55 55 55 55 56 56 56 55 56 56 56 56 56 56 56 56 56 56 56 56 55 55 56
2428E6j%%%j%%%%%%%%%%%J%%%%%%%%j%J%%j%J%%j%%%%%%J%j%%%%%%Jj%%%%%%%%%%%%j%%jJ
$$ 56 55 55 55 55 54 54 54 54 54 54 54 54 54 54 54 54 55 55 55 55 55 55 55 55 55 54 54 55 55 55 54 54 55 55 55 54 54 54 54 54 54 54 55 55 54 54 54 54 54 54 54 55 54 54 54 54 54 54 54 54 54 54 54 54 54 53 53 53 52 53
2420E3%%%jJ%%%%%%%%%%%%%J%%%%jJ%%%%%%%%%%%%%%%%%%%%%%J%j%%%%%%%%%%%%%%%%%%%%
$$ 53 53 53 53 52 53 53 53 53 53 53 53 53 53 53 53 53 53 53 54 54 54 54 54 53 54 54 54 54 54 54 54 54 54 54 54 54 54 54 54 54 54 54 54 54 54 54 54 55 55 54 54 54 54 54 54 54 54 54 54 54 54 54 54 54 54 54 54 54 54 54
2413E4%%%%%j%%%Jj%J%%%%%%%%%%%%%%%%%%j%%J%%%%%%j%J%%%%%%%%%%%%%%%%%%%jJ%%%%%
$$ 54 54 54 54 54 54 53 53 53 53 54 53 53 54 54 54 54 54 54 54 54 54 54 54 54 54 54 54 54 54 54 54 53 53 53 54 54 54 54 54 54 54 53 53 54 54 54 54 54 54 54 54 54 54 54 54 54 54 54 54 54 54 54 54 53 54 54 54 54 54 54
2405E4%%%%%j%%%%J%%%%%%j%%%%J%%%%%%%%j%%%J%j%%%%J%%%%%%J%%%%%j%%%%%%%%%%%j%%
$$ 54 54 54 54 54 54 53 53 53 53 53 54 54 54 54 54 54 54 53 53 53 53 53 54 54 54 54 54 54 54 54 54 53 53 53 53 54 54 53 53 53 53 53 54 54 54 54 54 54 54 55 55 55 55 55 55 54 54 54 54 54 54 54 54 54 54 54 54 53 53 53
2398E3%%%%%%J%%%%j%%%%%%%%J%%%%%%%%j%%%J%%j%%%%%%%%%J%%j%%%%%%%%%%%%%%%%%j%J
$$ 53 53 53 53 53 53 53 54 54 54 54 54 53 53 53 53 53 53 53 53 53 54 54 54 54 54 54 54 54 54 53 53 53 53 54 54 54 53 53 53 53 53 53 53 53 53 53 54 54 54 53 53 53 53 53 53 53 53 53 53 53 53 53 53 53 53 53 53 52 52 53
2391E3%%%j%%%%J%%%%%%%j%J%%%j%%%JJj%%%j%%%%%j%%%j%J%%j%J%%%j%J%jj%%J%J%J%J%J
$$ 53 53 53 53 52 52 52 52 52 53 53 53 53 53 53 53 53 52 52 53 53 53 53 52 52 52 52 53 54 53 53 53 53 52 52 52 52 52 52 51 51 51 51 50 50 51 51 51 50 50 51 51 51 51 50 50 51 51 50 49 49 49 50 50 51 51 52 52 53 53 54
2383E4%%J%%%J%%J%JJ%%J%%%%%%J%J%%%%Jj%%%%%%J%%%%J%J%%%%%j%%%%%J%%%%%%%%J%%%%
$$ 54 54 54 55 55 55 55 56 56 56 57 57 58 59 59 59 60 60 60 60 60 60 60 61 61 62 62 62 62 62 63 62 62 62 62 62 62 62 63 63 63 63 63 64 64 65 65 65 65 65 65 64 64 64 64 64 64 65 65 65 65 65 65 65 65 65 66 66 66 66 66
2376F6%%%%%%j%%%%%%%%%%%%%%%%J%%%%%J%%jJ%%J%%%%Jj%%%%%%%%%%%J%%j%J%J%j%%j%j%
$$ 66 66 66 66 66 66 66 65 65 65 65 65 65 65 65 65 65 65 65 65 65 65 65 65 66 66 66 66 66 66 67 67 67 66 67 67 67 68 68 68 68 68 69 68 68 68 68 68 68 68 68 68 68 68 68 69 69 69 68 68 69 69 70 70 69 69 69 68 68 67 67
2368F7%%j%%%%%%%%%%%J%%%%j%%j%%jjjjj%j%%%J%%%%%%J%J%JJJJJ%JJJJJJKJKJJKJKKLKJ
$$ 67 67 67 66 66 66 66 66 66 66 66 66 66 66 66 67 67 67 67 67 66 66 66 65 65 65 64 63 62 61 60 60 59 59 59 59 60 60 60 60 60 60 60 61 61 62 62 63 64 65 66 67 67 68 69 70 71 72 73 75 76 78 79 80 82 83 85 87 90 92 93
2361I3JJJJJ%%%%%%%j%jj%jjjjj%%j%j%%j%%j%%j%%J%J%JKJJJJ%%%J%%%J%%J%JJJJ%J%%J%
$$ 93 94 95 96 97 98 98 98 98 98 98 98 98 97 97 96 95 95 94 93 92 91 90 90 90 89 89 88 88 88 87 87 87 86 86 86 85 85 85 86 86 87 87 88 90 91 92 93 94 94 94 94 95 95 95 95 96 96 96 97 97 98 99 100 101 101 102 102 102 103 103
2353A03%%j%kjjjjkkjjj%%J%JJ%KKLMMMNMNMMMLMMMNMNNMMMMMLKLKKKKLKKLKKKKKKKLKLLK
$$ 103 103 103 102 102 100 99 98 97 96 94 92 91 90 89 89 89 90 90 91 92 92 94 96 99 103 107 111 116 120 125 129 133 137 140 144 148 152 157 161 166 171 175 179 183 187 191 194 196 199 201 203 205 207 210 212 214 217 219 221 223 225 227 229 231 234 236 239 242 244
2346B44LLLLLKLMLLLMLMLMMNNNNNOOONPOPPOQRRRJ0J0J1J1J2J3J3J4J5J6J6J8J8K0K1K2K3
$$ 244 247 250 253 256 259 261 264 268 271 274 277 281 284 288 291 295 299 304 309 314 319 324 330 336 342 347 354 360 367 374 380 388 397 406 415 425 435 446 457 469 482 495 509 524 540 556 574 592 612 633 655 678
2341F78K4K7K8K9L1L3L5L7L9M3M6N0N4N7O3O9P4Q3R0R9J10J21J35J51J68J91K16K46K82L23
$$ 678 702 729 757 786 817 850 885 922 961 1004 1050 1100 1154 1211 1274 1343 1417 1500 1590 1689 1799 1920 2055 2206 2374 2565 2781 3027 3309 3632
2337C632L74M32N03N86O83P93R15J039J153J236J267J230J127R75P98O18M53L05J74N5n6j61
$$ 3632 4006 4438 4941 5527 6210 7003 7918 8957 10110 11346 12613 13843 14970 15945 16743 17361 17814 18119 18293 18348 18292 18131
2335A8131k57l42m20m92n58o25o87p42p82q00p99p81p51p16o78o42o06n73n41n12m85m57m30
$$ 18131 17874 17532 17112 16620 16062 15437 14750 14008 13226 12426 11627 10846 10095 9379 8701 8059 7453 6880 6339 5827 5342 4885 4455
2333D455m00l67l35l01k67k37k10j84j64j46j30j17j05r6q6q0p2o6o1n5n1m7m4m1l8l5l3l1
$$ 4455 4055 3688 3353 3052 2785 2548 2338 2154 1990 1844 1714 1597 1492 1396 1310 1230 1158 1092 1031 976 925 878 834 793 755 720 687 656
2330F56l0k7k6k5k3k1k0j9j8j8j6j4j4j3j2j1j1j1rrrqqqpqopopponononnnnnnmmmmmlllk
$$ 656 626 599 573 548 525 504 484 465 447 429 413 399 385 372 360 349 338 327 318 309 300 292 284 276 269 261 255 248 242 235 228 222 217 211 206 200 195 190 185 180 175 170 166 162 158 154 150 147 144 141 139
2324A39lkkllllkklkjjjj%%%%j%j%JJKLMMNNNOOONOOPOOONNMMLKKJ%jjkkkmlnmmnnmnmnmn
$$ 139 136 134 132 129 126 123 120 118 116 113 111 110 109 108 107 107 107 107 107 106 106 105 105 106 107 109 112 116 120 125 130 135 141 147 153 158 164 170 177 183 189 195 200 205 209 213 216 218 220 221 221 220 219 217 215 213 209 206 201 197 193 188 183 179 174 170 165 161 156
2317A56nnmnmlmmllkkkkkjjjkjjjjjjj%j%jjjjjjjjjkjjjjjjkjkjkkjjkjjj%%%j%J%%J%JJ
$$ 156 151 146 142 137 133 130 126 122 119 116 114 112 110 108 106 105 104 103 101 100 99 98 97 96 95 94 94 93 93 92 91 90 89 88 87 86 85 84 82 81 80 79 78 77 76 74 73 71 70 68 66 65 64 62 61 60 59 59 59 59 58 58 59 59 59 60 60 61 62
2310F2JJ%J%J%JJJ%J%J%JJJJJJJ%JJ%%%%%%%%j%jjj%j%j%jjjj%j%Jj%jj%%%%j%j%%j%j%%%
$$ 62 63 64 64 65 65 66 66 67 68 69 69 70 70 71 71 72 73 74 75 76 77 78 78 79 80 80 80 80 80 80 80 80 80 79 79 78 77 76 76 75 75 74 74 73 72 71 70 70 69 69 70 69 69 68 67 67 67 67 67 66 66 65 65 65 64 64 63 63 63 63
2302F3%j%j%%%%%j%%j%%j%%%%%%%J%j%%%j%%%%%%%%Jj%%jJ%%%J%%j%%%%%%%j%%j%%%%%%%%
$$ 63 63 62 62 61 61 61 61 61 61 60 60 60 59 59 59 58 58 58 58 58 58 58 58 59 59 58 58 58 58 57 57 57 57 57 57 57 57 57 58 57 57 57 56 57 57 57 57 58 58 58 57 57 57 57 57 57 57 57 56 56 56 55 55 55 55 55 55 55 55 55
2295E5%j%%j%%j%J%%j%%%j%%J%%%%J%%j%J%%%%%%%j%%J%%%%%%%j%jj%%%%%%%%%JJJJJJJJJ
$$ 55 55 54 54 54 53 53 53 52 52 53 53 53 52 52 52 52 51 51 51 52 52 52 52 52 53 53 53 52 52 53 53 53 53 53 53 53 53 52 52 52 53 53 53 53 53 53 53 53 52 52 51 50 50 50 50 50 50 50 50 50 50 51 52 53 54 55 56 57 58 59
2287E9%JJJJ%%J%%%J%j%%j%Jj%%j%%%j%%%j%%%%%%j%%%j%%j%%%j%%%j%%%%Jj%%J%%j%%%%%
$$ 59 59 60 61 62 63 63 63 64 64 64 64 65 65 64 64 64 63 63 64 63 63 63 62 62 62 62 61 61 61 61 60 60 60 60 60 60 60 59 59 59 59 58 58 58 57 57 57 57 56 56 56 56 55 55 55 55 55 56 55 55 55 56 56 56 55 55 55 55 55 55
2280E5%%%%%%%J%j%%%j%%%%%%%%%j%%%J%%%%%j%%%%%%%%%j%%%%J%%%%%%%%%%%%%j%%%%%%%
$$ 55 55 55 55 55 55 55 55 56 56 55 55 55 55 54 54 54 54 54 54 54 54 54 54 53 53 53 53 54 54 54 54 54 54 53 53 53 53 53 53 53 53 53 53 52 52 52 52 52 53 53 53 53 53 53 53 53 53 53 53 53 53 53 52 52 52 52 52 52 52 52
2273E2%%j%%%J%%%%%%jJ%%%%%%%%%%%%J%%%Jj%%jj%%J%%J%%%jJ%j%%%%%J%%%j%%J%%%j%%%
$$ 52 52 52 51 51 51 51 52 52 52 52 52 52 52 51 52 52 52 52 52 52 52 52 52 52 52 52 52 53 53 53 53 54 53 53 53 52 51 51 51 52 52 52 53 53 53 53 52 53 53 52 52 52 52 52 52 53 53 53 53 52 52 52 53 53 53 53 52 52 52 52
2265E2%%%%%%%%%%%%%%%J%%j%%%%%%%%%%Jj%%%%%%%%%%%J%j%%%%%%%%%%%J%%%%%%%%%%%%j
$$ 52 52 52 52 52 52 52 52 52 52 52 52 52 52 52 52 53 53 53 52 52 52 52 52 52 52 52 52 52 52 53 52 52 52 52 52 52 52 52 52 52 52 52 53 53 52 52 52 52 52 52 52 52 52 52 52 52 53 53 53 53 53 53 53 53 53 53 53 53 53 52
2258E2%%jJ%%%Jj%%%%%%%%%%%%%%%%%%j%%%J%%%%%%%%%%%jJ%%%%%%%%%%%j%%%%%%%%%%%%%
$$ 52 52 52 51 52 52 52 52 53 52 52 52 52 52 52 52 52 52 52 52 52 52 52 52 52 52 52 52 51 51 51 51 52 52 52 52 52 52 52 52 52 52 52 52 51 52 52 52 52 52 52 52 52 52 52 52 52 51 51 51 51 51 51 51 51 51 51 51 51 51 51
2250E1J%%j%J%%%j%%%%%%%%%%%%%%J%%j%%%%%%J%%%%jj%%%J%%jJ%%%%%%%J%j%%%J%j%%J%%
$$ 51 52 52 52 51 51 52 52 52 52 51 51 51 51 51 51 51 51 51 51 51 51 51 51 51 52 52 52 51 51 51 51 51 51 51 52 52 52 52 52 51 50 50 50 50 51 51 51 50 51 51 51 51 51 51 51 51 52 52 51 51 51 51 52 52 51 51 51 52 52 52
2243E2%%%j%%j%%%%%%%%%%%%J%J%%%%%%%%j%%%%%%%%%%%%%%%%j%%%J%%%%%%%%%%%%%%%j%j
$$ 52 52 52 52 51 51 51 50 50 50 50 50 50 50 50 50 50 50 50 50 51 51 52 52 52 52 52 52 52 52 52 51 51 51 51 51 51 51 51 51 51 51 51 51 51 51 51 51 50 50 50 50 51 51 51 51 51 51 51 51 51 51 51 51 51 51 51 51 50 50 49
2235D9J%%%J%%%J%j%%j%%Jj%%%%%%%%%%%%%%%%%%%%%%%J%%%%j%%%J%%%%%%%%%%%%%j%%%%%
$$ 49 50 50 50 50 51 51 51 51 52 52 51 51 51 50 50 50 51 50 50 50 50 50 50 50 50 50 50 50 50 50 50 50 50 50 50 50 50 50 50 50 50 51 51 51 51 51 50 50 50 50 51 51 51 51 51 51 51 51 51 51 51 51 51 51 50 50 50 50 50 50
2228E0%%%%%%%%%J%%%%%%%%%%%%%%%%jJ%%%j%%J%%%%%%%%%%%%%%Jj%%J%J%%%jJ%J%%%%%%%
$$ 50 50 50 50 50 50 50 50 50 50 51 51 51 51 51 51 51 51 51 51 51 51 51 51 51 51 51 50 51 51 51 51 50 50 50 51 51 51 51 51 51 51 51 51 51 51 51 51 51 51 52 51 51 51 52 52 53 53 53 53 52 53 53 54 54 54 54 54 54 54 54
2221E4%%%%JJ%%JJ%%JJJJJKJKKKLKLLLMLLMLLLKKKJJ%%%jjjjkkkkkkkjkjjjjj%J%J%%%JKK
$$ 54 54 54 54 54 55 56 56 56 57 58 58 58 59 60 61 62 63 65 66 68 70 72 75 77 80 83 86 90 93 96 100 103 106 109 111 113 115 116 117 117 117 117 116 115 114 113 111 109 107 105 103 101 99 98 96 95 94 93 92 91 91 92 92 93 93 93 93 94 96 98
2213I8JKKKJKKKKJJJ%jjjkkllkllmlmllklkkkkjkjjjjjj%j%j%j%%j%%%%%%jj%J%J%j%%%%j
$$ 98 99 101 103 105 106 108 110 112 114 115 116 117 117 116 115 114 112 110 107 104 102 99 96 92 89 85 82 79 77 74 72 70 68 66 65 63 62 61 60 59 58 57 57 56 56 55 55 54 54 54 53 53 53 53 53 53 53 52 51 51 52 52 53 53 52 52 52 52 52 51
2206E1%%%%%%j%%%jJ%%%%%%%%%%%%%%J%%%%jj%%%%%J%%%%j%%J%jJ%j%%%%%%%%%%%%jJ%%%%
$$ 51 51 51 51 51 51 51 50 50 50 50 49 50 50 50 50 50 50 50 50 50 50 50 50 50 50 50 51 51 51 51 51 50 49 49 49 49 49 49 50 50 50 50 50 49 49 49 50 50 49 50 50 49 49 49 49 49 49 49 49 49 49 49 49 49 48 49 49 49 49 49
2198D9%J%%%j%%%J%%%%%%%%%%%%j%%%J%%%%%j%%%%%%%J%%j%Jj%%%%%%%J%%%%%j%%%%%j%J%
$$ 49 49 50 50 50 50 49 49 49 49 50 50 50 50 50 50 50 50 50 50 50 50 50 49 49 49 49 50 50 50 50 50 50 49 49 49 49 49 49 49 49 50 50 50 49 49 50 49 49 49 49 49 49 49 49 50 50 50 50 50 50 49 49 49 49 49 49 48 48 49 49
2191D9%%J%%%j%J%%%%%%%%%jJ%%%%j%%%J%j%%J%j%%%%%%J%%j%%%%%%%%j%J%%%%%%%%%%%%%
$$ 49 49 49 50 50 50 50 49 49 50 50 50 50 50 50 50 50 50 50 49 50 50 50 50 50 49 49 49 49 50 50 49 49 49 50 50 49 49 49 49 49 49 49 50 50 50 49 49 49 49 49 49 49 49 49 48 48 49 49 49 49 49 49 49 49 49 49 49 49 49 49
2184D9%%%%%j%%J%%%%jJ%%%%%%%%%%%%%%%%%%%%%j%%%%%JjJ%jJ%%%%%%%%%%%%%%%%%%J%%%
$$ 49 49 49 49 49 49 48 48 48 49 49 49 49 49 48 49 49 49 49 49 49 49 49 49 49 49 49 49 49 49 49 49 49 49 49 49 49 48 48 48 48 48 48 49 48 49 49 48 49 49 49 49 49 49 49 49 49 49 49 49 49 49 49 49 49 49 49 50 50 50 50
2176E0%%%%j%%%%%%%%%%%%%Jj%%%%%%%%%%%%%%%%J%%%%%%%%%%%%j%j%J%%%%Jj%%%%jJ%%%%
$$ 50 50 50 50 50 49 49 49 49 49 49 49 49 49 49 49 49 49 49 50 49 49 49 49 49 49 49 49 49 49 49 49 49 49 49 49 49 50 50 50 50 50 50 50 50 50 50 50 50 50 49 49 48 48 49 49 49 49 49 50 49 49 49 49 49 48 49 49 49 49 49
2169D9%%%%%%%%%J%%%%%%%%%%%%jJ%%j%%%%%%%%%%Jj%%j%%%J%%%%%%%%%%Jj%%%%%J%%j%%%
$$ 49 49 49 49 49 49 49 49 49 49 50 50 50 50 50 50 50 50 50 50 50 50 50 49 50 50 50 49 49 49 49 49 49 49 49 49 49 49 50 49 49 49 48 48 48 48 49 49 49 49 49 49 49 49 49 49 49 50 49 49 49 49 49 49 50 50 50 49 49 49 49
2161D9j%%%%%%%%%%j%%J%%%j%%%%%%%%%%j%%%%%%jJ%%%J%j%jJ%%%%%%%%%%%%%%%%J%%%%J%
$$ 49 48 48 48 48 48 48 48 48 48 48 48 47 47 47 48 48 48 48 47 47 47 47 47 47 47 47 47 47 47 46 46 46 46 46 46 46 45 46 46 46 46 47 47 46 46 45 46 46 46 46 46 46 46 46 46 46 46 46 46 46 46 46 46 47 47 47 47 47 48 48
2154D8%%%%%%%%%%%%%JjJ%%j%%%%%%%%%%%%%%%%%j%%%%%%%%%%%J%%%%%%%%%%J%%%%%%%%%%
$$ 48 48 48 48 48 48 48 48 48 48 48 48 48 48 49 48 49 49 49 48 48 48 48 48 48 48 48 48 48 48 48 48 48 48 48 48 48 47 47 47 47 47 47 47 47 47 47 47 47 48 48 48 48 48 48 48 48 48 48 48 49 49 49 49 49 49 49 49 49 49 49
2146D9%%%%%%%%%%%%%%%%%%j%%%%J%%jJ%%J%%%%j%%%%%%j%%%J%%%%%%j%%%%%%%Jj%%%%%%J
$$ 49 49 49 49 49 49 49 49 49 49 49 49 49 49 49 49 49 49 49 48 48 48 48 48 49 49 49 48 49 49 49 50 50 50 50 50 49 49 49 49 49 49 49 48 48 48 48 49 49 49 49 49 49 49 48 48 48 48 48 48 48 48 49 48 48 48 48 48 48 48 49
2139D9%%%%%j%%%J%%%%jJ%%jJ%%%j%%%%J%%%%%j%%%%%%%%J%%j%%Jj%%%%%%%%%%%%%J%%%%j
$$ 49 49 49 49 49 49 48 48 48 48 49 49 49 49 49 48 49 49 49 48 49 49 49 49 48 48 48 48 48 49 49 49 49 49 49 48 48 48 48 48 48 48 48 48 49 49 49 48 48 48 49 48 48 48 48 48 48 48 48 48 48 48 48 48 48 49 49 49 49 49 48
2132D8%%jJ%%%J%%%%%j%%%%jJ%%%%%%%%%%%%%%Jj%%%%J%%%%j%%%%%%%%%%%%%%%%%J%%%j%%
$$ 48 48 48 47 48 48 48 48 49 49 49 49 49 49 48 48 48 48 48 47 48 48 48 48 48 48 48 48 48 48 48 48 48 48 48 49 48 48 48 48 48 49 49 49 49 49 48 48 48 48 48 48 48 48 48 48 48 48 48 48 48 48 48 48 49 49 49 49 48 48 48
2124D8J%%%%j%%%%%%%%%j%%%J%%%%J%%%%j%%%Jj%%%%%J%%%%%j%%%%%%%%%%J%%j%%%J%%j%%
$$ 48 49 49 49 49 49 48 48 48 48 48 48 48 48 48 48 47 47 47 47 48 48 48 48 48 49 49 49 49 49 48 48 48 48 49 48 48 48 48 48 48 49 49 49 49 49 49 48 48 48 48 48 48 48 48 48 48 48 49 49 49 48 48 48 48 49 49 49 48 48 48
2117D8%%%J%%%%%%j%%%%%%%%%%%%%%%Jj%%%%%%%%%%%%%%%%%%%%J%j%%%%J%%%%%%%%%%%%%%
$$ 48 48 48 48 49 49 49 49 49 49 49 48 48 48 48 48 48 48 48 48 48 48 48 48 48 48 48 49 48 48 48 48 48 48 48 48 48 48 48 48 48 48 48 48 48 48 48 48 48 49 49 48 48 48 48 48 49 49 49 49 49 49 49 49 49 49 49 49 49 49 49
2109D9%j%%%%J%%%%%%J%%%%%%jj%J%%%jJ%%%%J%%j%%J%j%%%%Jj%%%%%%%j%J%%j%j%%J%%%%
$$ 49 49 48 48 48 48 48 49 49 49 49 49 49 49 50 50 50 50 50 50 50 49 48 48 49 49 49 49 48 49 49 49 49 49 50 50 50 49 49 49 50 50 49 49 49 49 49 50 49 49 49 49 49 49 49 49 48 48 49 49 49 48 48 47 47 47 48 48 48 48 48
2102D8%%%%%%%%%%%%j%J%%%%%%%%%%%j%J%%%%%%%%%%J%%%%%%%j%%%%%%%j%%%J%%%%%%%%j%
$$ 48 48 48 48 48 48 48 48 48 48 48 48 48 47 47 48 48 48 48 48 48 48 48 48 48 48 48 47 47 48 48 48 48 48 48 48 48 48 48 48 49 49 49 49 49 49 49 49 48 48 48 48 48 48 48 48 47 47 47 47 48 48 48 48 48 48 48 48 48 47 47
2095D7%%J%%%%%%%%%%%%%%%J%%%%%%j%%%%%%%%%%%%J%%%%j%%%%%%%%%%%%%%%%%%%%%%jJ%%
$$ 47 47 47 48 48 48 48 48 48 48 48 48 48 48 48 48 48 48 48 49 49 49 49 49 49 49 48 48 48 48 48 48 48 48 48 48 48 48 48 49 49 49 49 49 48 48 48 48 48 48 48 48 48 48 48 48 48 48 48 48 48 48 48 48 48 48 48 47 48 48 48
2087D8%%%%%%%jJj%%%%%%J%%%%j%%%%%%J%%%%J%%%%%j%%%%%%%%%%%J%%j%%%%%%%%%%%%%%%
$$ 48 48 48 48 48 48 48 48 47 48 47 47 47 47 47 47 47 48 48 48 48 48 47 47 47 47 47 47 47 48 48 48 48 48 49 49 49 49 49 49 48 48 48 48 48 48 48 48 48 48 48 48 49 49 49 48 48 48 48 48 48 48 48 48 48 48 48 48 48 48 48
2080D8J%j%%%%%%%jJ%%%%%J%j%%%%%%%%%%J%jjJ%%%%%%%%%j%%%J%%%%j%%%%%%%J%j%jJ%%%
$$ 48 49 49 48 48 48 48 48 48 48 48 47 48 48 48 48 48 48 49 49 48 48 48 48 48 48 48 48 48 48 48 49 49 48 47 48 48 48 48 48 48 48 48 48 48 47 47 47 47 48 48 48 48 48 47 47 47 47 47 47 47 47 48 48 47 47 46 47 47 47 47
2072D7%%%%%Jj%%%%%Jj%%J%%%j%%%%%%J%%%%%%%j%%%J%%jJ%%%%%%%%%%%%%%%%%%%%%j%%%%
$$ 47 47 47 47 47 47 48 47 47 47 47 47 47 48 47 47 47 48 48 48 48 47 47 47 47 47 47 47 48 48 48 48 48 48 48 48 47 47 47 47 48 48 48 47 48 48 48 48 48 48 48 48 48 48 48 48 48 48 48 48 48 48 48 48 48 48 47 47 47 47 47
2065D7%%%%J%%%%%%%%%%%%%%%%J%%%%%%j%%%%%%%%%J%%j%%%%%%j%%%J%%%%%%j%J%j%%J%%%
$$ 47 47 47 47 47 48 48 48 48 48 48 48 48 48 48 48 48 48 48 48 48 48 49 49 49 49 49 49 49 48 48 48 48 48 48 48 48 48 48 49 49 49 48 48 48 48 48 48 48 47 47 47 47 48 48 48 48 48 48 48 47 47 48 48 47 47 47 48 48 48 48
2057D8%%%%%%%%%%j%%%%%J%Jj%%%%%%%%%%j%%J%%%%%%%J%j%J%%j%%%%J%%%%j%%%%%%%%%%J
$$ 48 48 48 48 48 48 48 48 48 48 48 47 47 47 47 47 47 48 48 49 48 48 48 48 48 48 48 48 48 48 48 47 47 47 48 48 48 48 48 48 48 48 49 49 48 48 49 49 49 48 48 48 48 48 49 49 49 49 49 48 48 48 48 48 48 48 48 48 48 48 49
2050D9%%%j%%%%J%%%%%%%%j%%%%%J%%j%%%%%%%%%J%%%%%%%%%%%%%%%%j%J%%j%%%%%%%%J%%
$$ 49 49 49 49 48 48 48 48 48 49 49 49 49 49 49 49 49 49 48 48 48 48 48 48 49 49 49 48 48 48 48 48 48 48 48 48 48 49 49 49 49 49 49 49 49 49 49 49 49 49 49 49 49 49 48 48 49 49 49 48 48 48 48 48 48 48 48 48 49 49 49
2043D9%j%J%%%j%%%%%%jJ%%%%%jJ%%%%%%%%%j%%%J%%%jJ%%%%%%%%%%%%j%%J%%jJ%J%j%%%%
$$ 49 49 48 48 49 49 49 49 48 48 48 48 48 48 48 47 48 48 48 48 48 48 47 48 48 48 48 48 48 48 48 48 48 47 47 47 47 48 48 48 48 47 48 48 48 48 48 48 48 48 48 48 48 48 48 47 47 47 48 48 48 47 48 48 49 49 48 48 48 48 48
2035D8%%%%%%%%%%%%%%%%%%j%J%%%j%%%%%%%J%%%%%%%%%j%%%%%J%%j%%%%%%%Jj%%%j%J%%%
$$ 48 48 48 48 48 48 48 48 48 48 48 48 48 48 48 48 48 48 48 47 47 48 48 48 48 47 47 47 47 47 47 47 47 48 48 48 48 48 48 48 48 48 48 47 47 47 47 47 47 48 48 48 47 47 47 47 47 47 47 47 48 47 47 47 47 46 46 47 47 47 47
2028D7%%%%%%J%%j%%Jj%J%%%%%%j%%J%j%%%%%%j%%%J%J%%%%%%j%%%J%%%%j%%%%%%%%%%%%%
$$ 47 47 47 47 47 47 47 48 48 48 47 47 47 48 47 47 48 48 48 48 48 48 48 47 47 47 48 48 47 47 47 47 47 47 47 46 46 46 46 47 47 48 48 48 48 48 48 48 47 47 47 47 48 48 48 48 48 47 47 47 47 47 47 47 47 47 47 47 47 47 47
2020D7%J%%%%%%J%%j%%%%%j%%%%%jJ%%J%%%%%%j%J%%%%%%%%%%%%%%j%%%J%j%%Jj%%%Jj%%%
$$ 47 47 48 48 48 48 48 48 48 49 49 49 48 48 48 48 48 48 47 47 47 47 47 47 46 47 47 47 48 48 48 48 48 48 48 47 47 48 48 48 48 48 48 48 48 48 48 48 48 48 48 48 47 47 47 47 48 48 47 47 47 48 47 47 47 47 48 47 47 47 47
2013D7%%%%%J%%%%j%%%%%%%%J%%%%%%Jj%%%%%%%%J%j%%%%%%%j%J%%%%%%%Jj%%%%%%%%%%Jj
$$ 47 47 47 47 47 47 48 48 48 48 48 47 47 47 47 47 47 47 47 47 48 48 48 48 48 48 48 49 48 48 48 48 48 48 48 48 48 49 49 48 48 48 48 48 48 48 48 47 47 48 48 48 48 48 48 48 48 49 48 48 48 48 48 48 48 48 48 48 48 49 48
2006D8%%%%%%%%%%%%%%%j%%%%%%%%Jj%%%J%%%%%jJ%%j%j%%J%%%%%%%%%%J%%%%j%%%%%%%%%
$$ 48 48 48 48 48 48 48 48 48 48 48 48 48 48 48 48 47 47 47 47 47 47 47 47 47 48 47 47 47 47 48 48 48 48 48 48 47 48 48 48 47 47 46 46 46 47 47 47 47 47 47 47 47 47 47 47 48 48 48 48 48 47 47 47 47 47 47 47 47 47 47
1998D7%%%%%%Jj%%%%%%%%J%%%j%%%%%J%%%%%j%%J%%%j%%%%%%J%%jj%%%J%%%%Jj%%%%j%%J%
$$ 47 47 47 47 47 47 47 48 47 47 47 47 47 47 47 47 47 48 48 48 48 47 47 47 47 47 47 48 48 48 48 48 48 47 47 47 48 48 48 48 47 47 47 47 47 47 47 48 48 48 47 46 46 46 46 47 47 47 47 47 48 47 47 47 47 47 46 46 46 47 47
1991D7j%J%%%%J%j%%%%%%%jJ%%J%%%%j%%%%%Jj%%%%%%%%jJ%%%%%%%%%%jJ%%%%%j%%%%%%%%
$$ 47 46 46 47 47 47 47 47 48 48 47 47 47 47 47 47 47 47 46 47 47 47 48 48 48 48 48 47 47 47 47 47 47 48 47 47 47 47 47 47 47 47 47 46 47 47 47 47 47 47 47 47 47 47 47 46 47 47 47 47 47 47 46 46 46 46 46 46 46 46 46
1983D6%%%%%J%%j%J%j%Jj%%%JJ%%j%j%J%%%%j%%J%%J%%%%%%j%%%%%%%%J%%j%%J%%%%%%%j%
$$ 46 46 46 46 46 46 47 47 47 46 46 47 47 46 46 47 46 46 46 46 47 48 48 48 47 47 46 46 47 47 47 47 47 46 46 46 47 47 47 48 48 48 48 48 48 48 47 47 47 47 47 47 47 47 47 48 48 48 47 47 47 48 48 48 48 48 48 48 48 47 47
1976D7%%%%J%%j%%%J%%%jjJ%%%%%%%%%%%%%%jJ%%J%%j%%%J%j%%%%%%%%%%%%%%J%%%%j%%%%
$$ 47 47 47 47 47 48 48 48 47 47 47 47 48 48 48 48 47 46 47 47 47 47 47 47 47 47 47 47 47 47 47 47 47 46 47 47 47 48 48 48 47 47 47 47 48 48 47 47 47 47 47 47 47 47 47 47 47 47 47 47 47 48 48 48 48 48 47 47 47 47 47
1968D7%%%%%%%J%j%Jj%%%%JjJ%%%%%%j%%%%%%%%%%%%%%%%J%%jJ%%j%%%%%%jJ%Jj%%%%%%%j
$$ 47 47 47 47 47 47 47 47 48 48 47 47 48 47 47 47 47 47 48 47 48 48 48 48 48 48 48 47 47 47 47 47 47 47 47 47 47 47 47 47 47 47 47 47 48 48 48 47 48 48 48 47 47 47 47 47 47 47 46 47 47 48 47 47 47 47 47 47 47 47 46
1961D6%%%%%J%J%%%%%jJ%%j%%%%J%%%%%j%%%%%%%J%%%%%%%%%j%%%%jJ%%%J%%%%j%%%J%%%%
$$ 46 46 46 46 46 46 47 47 48 48 48 48 48 48 47 48 48 48 47 47 47 47 47 48 48 48 48 48 48 47 47 47 47 47 47 47 47 48 48 48 48 48 48 48 48 48 48 47 47 47 47 47 46 47 47 47 47 48 48 48 48 48 47 47 47 47 48 48 48 48 48
1954D8%%j%%%%%%%%%%%Jj%%%%%%%%%%%%%%%%%%%%%%jJ%%%%%%%%%%%%%%%%%%%%%%%%%%%%%%
$$ 48 48 48 47 47 47 47 47 47 47 47 47 47 47 47 48 47 47 47 47 47 47 47 47 47 47 47 47 47 47 47 47 47 47 47 47 47 47 47 46 47 47 47 47 47 47 47 47 47 47 47 47 47 47 47 47 47 47 47 47 47 47 47 47 47 47 47 47 47 47 47
1946D7%%%%%%jJ%%%%%%J%%%%%%%%j%%%J%%%%%%j%%Jj%jJ%%%j%%%%J%%%jjJ%%%Jj%%%%%%%%
$$ 47 47 47 47 47 47 47 46 47 47 47 47 47 47 47 48 48 48 48 48 48 48 48 48 47 47 47 47 48 48 48 48 48 48 48 47 47 47 48 47 47 46 47 47 47 47 46 46 46 46 46 47 47 47 47 46 45 46 46 46 46 47 46 46 46 46 46 46 46 46 46
1939D6%%%%%%%%J%%j%%Jj%%%%%J%j%%%%%%%%%j%%J%%%%j%J%%%%%%%%%j%%%%%%J%%%j%%%%%
$$ 46 46 46 46 46 46 46 46 46 47 47 47 46 46 46 47 46 46 46 46 46 46 47 47 46 46 46 46 46 46 46 46 46 46 45 45 45 46 46 46 46 46 45 45 46 46 46 46 46 46 46 46 46 46 45 45 45 45 45 45 45 46 46 46 46 45 45 45 45 45 45
1931D5%j%%j%%%%J%%%%%%%%%%%%%%%j%%%j%Jj%%%%%%j%%%Jj%%%%%%%%%%%%%jJ%%%%%j%Jj%
$$ 45 45 44 44 44 43 43 43 43 43 44 44 44 44 44 44 44 44 44 44 44 44 44 44 44 44 43 43 43 43 42 42 43 42 42 42 42 42 42 42 41 41 41 41 42 41 41 41 41 41 41 41 41 41 41 41 41 41 41 40 41 41 41 41 41 41 40 40 41 40 40
1924D0%%J%%j%J%%jJ%%%J%%%j%J%%%%%%%%J%J%j%J%%%%%%J%%%%%J%%%%%jJ%%%%%%%Jj%%%%
$$ 40 40 40 41 41 41 40 40 41 41 41 40 41 41 41 41 42 42 42 42 41 41 42 42 42 42 42 42 42 42 42 43 43 44 44 43 43 44 44 44 44 44 44 44 45 45 45 45 45 45 46 46 46 46 46 46 45 46 46 46 46 46 46 46 46 47 46 46 46 46 46
1917D6Jj%J%%%%j%J%%%%%%%%%%%%%%%%%%%%%jJ%%%%%jJ%%%%%%%%%J%j%%%%%%%%%%j%J%%%%
$$ 46 47 46 46 47 47 47 47 47 46 46 47 47 47 47 47 47 47 47 47 47 47 47 47 47 47 47 47 47 47 47 47 47 46 47 47 47 47 47 47 46 47 47 47 47 47 47 47 47 47 47 48 48 47 47 47 47 47 47 47 47 47 47 47 46 46 47 47 47 47 47
1909D7%%%%%%%%%%%%%%jJ%%%%%%%j%J%%%%%%J%%%%j%%%%Jj%%%j%%%J%%%%%%%%%%J%j%%%%%
$$ 47 47 47 47 47 47 47 47 47 47 47 47 47 47 47 46 47 47 47 47 47 47 47 47 46 46 47 47 47 47 47 47 47 48 48 48 48 48 47 47 47 47 47 48 47 47 47 47 46 46 46 46 47 47 47 47 47 47 47 47 47 47 47 48 48 47 47 47 47 47 47
1902D7%%J%%%%%%%j%%J%j%%%%J%j%%%%J%%%%j%%%%J%%%%%%%%%j%J%%J%%j%%j%J%j%%%%%%J
$$ 47 47 47 48 48 48 48 48 48 48 48 47 47 47 48 48 47 47 47 47 47 48 48 47 47 47 47 47 48 48 48 48 48 47 47 47 47 47 48 48 48 48 48 48 48 48 48 48 47 47 48 48 48 49 49 49 48 48 48 47 47 48 48 47 47 47 47 47 47 47 48
1894D8%%%%%%%%jJ%%%%j%%%%%%%%j%%%%%J%%%%%%%%j%J%%%%jJ%%%%%%%%%%%%%%%%%%%%%%J
$$ 48 48 48 48 48 48 48 48 48 47 48 48 48 48 48 47 47 47 47 47 47 47 47 47 46 46 46 46 46 46 47 47 47 47 47 47 47 47 47 46 46 47 47 47 47 47 46 47 47 47 47 47 47 47 47 47 47 47 47 47 47 47 47 47 47 47 47 47 47 47 48
1887D8j%%%%%%j%%%%%%%%%%%%%%%%jJ%%%%J%j%%%%%%%%JJ%%%j%%%%J%%j%%J%%%jJ%jJ%%%J
$$ 48 47 47 47 47 47 47 47 46 46 46 46 46 46 46 46 46 46 46 46 46 46 46 46 46 45 46 46 46 46 46 47 47 46 46 46 46 46 46 46 46 46 47 48 48 48 48 47 47 47 47 47 48 48 48 47 47 47 48 48 48 48 47 48 48 47 48 48 48 48 49
1879D9%%%%j%%%%%jJ%%%%%%jJ%%%%%%%%%j%%J%j%%JjJ%%%%%%%%%%j%%J%%%j%%J%%%j%%%%%
$$ 49 49 49 49 49 48 48 48 48 48 48 47 48 48 48 48 48 48 48 47 48 48 48 48 48 48 48 48 48 48 47 47 47 48 48 47 47 47 48 47 48 48 48 48 48 48 48 48 48 48 48 47 47 47 48 48 48 48 47 47 47 48 48 48 48 47 47 47 47 47 47
1872D7J%j%%%J%%%%%%%%%%%%%%%%%%%%%%%%j%%%%%%%J%j%J%%%%%j%%%%%%%J%%%%%%%%%%%%
$$ 47 48 48 47 47 47 47 48 48 48 48 48 48 48 48 48 48 48 48 48 48 48 48 48 48 48 48 48 48 48 48 48 47 47 47 47 47 47 47 47 48 48 47 47 48 48 48 48 48 48 47 47 47 47 47 47 47 47 48 48 48 48 48 48 48 48 48 48 48 48 48
1865D8j%%%%%%J%%j%%J%%%%%%%J%j%%%j%%%%%%%%%jJ%%%J%%%j%%%J%%j%%%%j%J%%j%%J%%%
$$ 48 47 47 47 47 47 47 47 48 48 48 47 47 47 48 48 48 48 48 48 48 48 49 49 48 48 48 48 47 47 47 47 47 47 47 47 47 47 46 47 47 47 47 48 48 48 48 47 47 47 47 48 48 48 47 47 47 47 47 46 46 47 47 47 46 46 46 47 47 47 47
1857D7%%%%%%%%%%%%%%%%jJ%%jJ%%%%%%J%j%%%%%%%%J%%%%j%%%J%%j%%%%%%%%%%%%%%J%%%
$$ 47 47 47 47 47 47 47 47 47 47 47 47 47 47 47 47 47 46 47 47 47 46 47 47 47 47 47 47 47 48 48 47 47 47 47 47 47 47 47 47 48 48 48 48 48 47 47 47 47 48 48 48 47 47 47 47 47 47 47 47 47 47 47 47 47 47 47 48 48 48 48
1850D8%%%jjJ%%%%%%%%%%%%%%%%Jj%%%%%J%%%%%%%j%%%%%%%%%%%%%J%%j%%%%%%J%%j%%%%J
$$ 48 48 48 48 47 46 47 47 47 47 47 47 47 47 47 47 47 47 47 47 47 47 47 48 47 47 47 47 47 47 48 48 48 48 48 48 48 48 47 47 47 47 47 47 47 47 47 47 47 47 47 47 48 48 48 47 47 47 47 47 47 47 48 48 48 47 47 47 47 47 48
1842D8%j%%J%%%%%%%%%%%%%%%%%%j%%%%%%%%%%%%%%%jJ%%%%%J%%%%%%J%j%%j%%%%%%%Jj%%
$$ 48 48 47 47 47 48 48 48 48 48 48 48 48 48 48 48 48 48 48 48 48 48 48 48 47 47 47 47 47 47 47 47 47 47 47 47 47 47 47 47 46 47 47 47 47 47 47 48 48 48 48 48 48 48 49 49 48 48 48 47 47 47 47 47 47 47 47 48 47 47 47
1835D7%J%j%%%%%%%%%%%Jj%%%%%j%%%J%%%%%%%J%%%j%%%%J%%%%%%J%j%%j%J%j%%%%Jj%%%J
$$ 47 47 48 48 47 47 47 47 47 47 47 47 47 47 47 47 48 47 47 47 47 47 47 46 46 46 46 47 47 47 47 47 47 47 47 48 48 48 48 47 47 47 47 47 48 48 48 48 48 48 48 49 49 48 48 48 47 47 48 48 47 47 47 47 47 48 47 47 47 47 48
1828D8%%%%%j%%%%%%J%j%%%%jJJ%%%%%%%%%%%%jJ%%%%%%%%%%%%%%%J%%%%jJ%%j%%%%%%%jJ
$$ 48 48 48 48 48 48 47 47 47 47 47 47 47 48 48 47 47 47 47 47 46 47 48 48 48 48 48 48 48 48 48 48 48 48 48 47 48 48 48 48 48 48 48 48 48 48 48 48 48 48 48 48 49 49 49 49 49 48 49 49 49 48 48 48 48 48 48 48 48 47 48
1820D8%J%j%%J%%%%%%%%Jj%%J%%%%%%%%J%J%J%%J%%JKKJKJKJJKJKKJJJKJKKKKKKKJKKJKJJ
$$ 48 48 49 49 48 48 48 49 49 49 49 49 49 49 49 49 50 49 49 49 50 50 50 50 50 50 50 50 50 51 51 52 52 53 53 53 54 54 54 55 57 59 60 62 63 65 66 67 69 70 72 74 75 76 77 79 80 82 84 86 88 90 92 94 95 97 99 100 102 103 104
1813A04JJJJJKJKJJKJKJJ%j%jjjjj%jjjk%jkjjkjkkjkkkkkjkkjkjkjkjkjkjlkjjjjjjk%jj
$$ 104 105 106 107 108 109 111 112 114 115 116 118 119 121 122 123 123 122 122 121 120 119 118 117 117 116 115 114 112 112 111 109 108 107 105 104 102 100 99 97 95 93 91 89 88 86 84 83 81 80 78 77 75 74 72 71 69 68 65 63 62 61 60 59 58 57 55 55 54 53
1805E3jj%%jj%j%%%%%%%j%%%%Jj%%%Jjj%%j%J%%%%Jj%%%%%%%%%%%%%Jj%%jJ%%%%%%%j%%j%
$$ 53 52 51 51 51 50 49 49 48 48 48 48 48 48 48 48 47 47 47 47 47 48 47 47 47 47 48 47 46 46 46 45 45 46 46 46 46 46 47 46 46 46 46 46 46 46 46 46 46 46 46 46 46 47 46 46 46 45 46 46 46 46 46 46 46 46 45 45 45 44 44
1798D4%%%%%%%%%%%%j%%%%%%%%J%%%%%%j%%%%%%%%%%%%%%%J%%J%%%J%%%J%%J%%J%%%%jJ%J
$$ 44 44 44 44 44 44 44 44 44 44 44 44 44 43 43 43 43 43 43 43 43 43 44 44 44 44 44 44 44 43 43 43 43 43 43 43 43 43 43 43 43 43 43 43 43 44 44 44 45 45 45 45 46 46 46 46 47 47 47 48 48 48 49 49 49 49 49 48 49 49 50
1791E0%J%J%%%J%%%%J%%J%%%%%%J%%J%%%J%%%J%%jJ%%%J%%j%%%%%%%J%j%%%%JjJ%%j%%%%%
$$ 50 50 51 51 52 52 52 52 53 53 53 53 53 54 54 54 55 55 55 55 55 55 55 56 56 56 57 57 57 57 58 58 58 58 59 59 59 58 59 59 59 59 60 60 60 59 59 59 59 59 59 59 59 60 60 59 59 59 59 59 60 59 60 60 60 59 59 59 59 59 59
1783E9%%%%%J%j%%%%J%%%%J%%jjJ%%%%%J%j%%%J%j%%%%%%%%%%%j%%J%j%%j%%j%%j%%%%jJ%
$$ 59 59 59 59 59 59 60 60 59 59 59 59 59 60 60 60 60 60 61 61 61 60 59 60 60 60 60 60 60 61 61 60 60 60 60 61 61 60 60 60 60 60 60 60 60 60 60 60 60 59 59 59 60 60 59 59 59 58 58 58 57 57 57 56 56 56 56 56 55 56 56
1776E6%%%j%%j%%%%%j%%J%%%%%JJ%J%%%%%J%J%JJ%%JJJ%JJJJ%J%J%%JJ%JJ%J%%JJJ%%%J%J
$$ 56 56 56 56 55 55 55 54 54 54 54 54 54 53 53 53 54 54 54 54 54 54 55 56 56 57 57 57 57 57 57 58 58 59 59 60 61 61 61 62 63 64 64 65 66 67 68 68 69 69 70 70 70 71 72 72 73 74 74 75 75 75 76 77 78 78 78 78 79 79 80
1768H0%%%J%jJ%%%%J%%j%%%%%%j%%%%%%%%%%j%%%j%%%%j%%%j%%%%%%JJ%JJJ%%J%JJJJJJJK
$$ 80 80 80 80 81 81 80 81 81 81 81 81 82 82 82 81 81 81 81 81 81 81 80 80 80 80 80 80 80 80 80 80 80 79 79 79 79 78 78 78 78 78 77 77 77 77 76 76 76 76 76 76 76 77 78 78 79 80 81 81 81 82 82 83 84 85 86 87 88 89 91
1761I1KKLJKJKLLLLMNNOONOPNNNMMLLLLMMMMMMMNMMLLLJKKKKLKKLLKLMKLKKKKJJJJJKJJJK
$$ 91 93 95 98 99 101 102 104 107 110 113 116 120 125 130 136 142 147 153 160 165 170 175 179 183 186 189 192 195 199 203 207 211 215 219 223 228 232 236 239 242 245 246 248 250 252 254 257 259 261 264 267 269 272 276 278 281 283 285 287 289 290 291 292 293 294 296 297 298 299 301
1753C01LKLLLNNNOPPQRQJ0J0J2J1J3J3J6J7J8K0K2K4K7L0L3L7M1M7N3N9O7P5Q7R9J13J29J47
$$ 301 304 306 309 312 315 320 325 330 336 343 350 358 367 375 385 395 407 418 431 444 460 477 495 515 537 561 588 618 651 688 729 776 829 888 955 1030 1117 1216 1329 1458 1605
1749A605J67J88K10K31K50K65K76K81K79K74K64K52K42K32K29K30K37K51K69K91L14L39L58
$$ 1605 1772 1960 2170 2401 2651 2916 3192 3473 3752 4026 4290 4542 4784 5016 5245 5475 5712 5963 6232 6523 6837 7176 7534
1747G534L73L79L75L60L35L02K65K30K01J80J70J71J81J97K16K36K54K70K78K75K58K28J81
$$ 7534 7907 8286 8661 9021 9356 9658 9923 10153 10354 10534 10704 10875 11056 11253 11469 11705 11959 12229 12507 12782 13040 13268 13449
1744A3449J24N9ln7j02j36j57j70j76j79j79j76j69j60j53j53j60j79k06k37k67k94l14l27
$$ 13449 13573 13632 13629 13572 13470 13334 13177 13007 12831 12652 12473 12297 12128 11968 11815 11662 11502 11323 11117 10880 10613 10319 10005 9678
1742I678l32l31l30l26l21l14l03k89k75k62k55k54k58k65k73k80k84k85k85k82k78k73k66
$$ 9678 9346 9015 8685 8359 8038 7724 7421 7132 6857 6595 6340 6086 5828 5563 5290 5010 4726 4441 4156 3874 3596 3323 3057
1739C057k57k44k29k12j95j78j62j47j34j23j11j00r0p9p0o2n5m8m2l8l3l0k7k4k3k1j8j7
$$ 3057 2800 2556 2327 2115 1920 1742 1580 1433 1299 1176 1065 965 875 796 726 664 609 561 519 481 448 418 391 367 344 323 305 288
1736B88j6j4j3j2j2j0j0rqqqqoponnnmnmmmllmlklkkjkjjkjjjjjjj%%%%%%J%J%J%J%J%J%J
$$ 288 272 258 245 233 221 211 201 192 184 176 168 160 154 147 141 136 131 126 122 117 113 109 105 102 99 95 92 90 87 85 83 82 80 79 78 76 75 74 73 72 71 70 69 69 69 69 69 69 69 70 70 71 71 72 72 73 73 74 74 75 75 76
1730G6JJJJJJJJJJ%JJJ%%%%J%%J%%%%%%j%%j%%j%j%%%jj%jj%jj%jkj%jjjjjjjjj%jjjjj%j
$$ 76 77 78 79 80 81 82 83 84 85 86 86 87 88 89 89 89 89 89 90 90 90 91 91 91 91 91 91 91 90 90 90 89 89 89 88 88 87 87 87 87 86 85 85 84 83 83 82 81 81 80 78 77 77 76 75 74 73 72 71 70 69 68 68 67 66 65 64 63 63 62
1722F2j%j%jj%%%%jjj%%%%jj%%%j%%%%%%%%%%J%J%%%%J%J%%%%JJ%JJ%%%%JJ%%%%%JJJ%J%%
$$ 62 61 61 60 60 59 58 58 58 58 58 57 56 55 55 55 55 55 54 53 53 53 53 52 52 52 52 52 52 52 52 52 52 52 53 53 54 54 54 54 54 55 55 56 56 56 56 56 57 58 58 59 60 60 60 60 60 61 62 62 62 62 62 62 63 64 65 65 66 66 66
1715F6%j%%%%j%%%%%j%%%%j%%j%%j%j%%j%%j%j%j%%j%%%j%j%%%%%%%%%%%j%j%j%%%%%%%J%
$$ 66 66 65 65 65 65 65 64 64 64 64 64 64 63 63 63 63 63 62 62 62 61 61 61 60 60 59 59 59 58 58 58 57 57 56 56 55 55 55 54 54 54 54 53 53 52 52 52 52 52 52 52 52 52 52 52 52 51 51 50 50 49 49 49 49 49 49 49 49 50 50
1707E0%%j%%%%%%%%%%%%%j%%%%%j%%J%j%j%J%%%jJ%%%j%%%%%%%%j%%%%%%%%%%jJ%%%%%%%%
$$ 50 50 50 49 49 49 49 49 49 49 49 49 49 49 49 49 49 48 48 48 48 48 48 47 47 47 48 48 47 47 46 46 47 47 47 47 46 47 47 47 47 46 46 46 46 46 46 46 46 46 45 45 45 45 45 45 45 45 45 45 45 44 45 45 45 45 45 45 45 45 45
1700D5%%%%J%Jj%%JJ%%%%%%%%%J%%%%%J%%%JJ%%%%J%%J%%%%%%%JJ%J%%%%%%%J%%%%%j%j%%
$$ 45 45 45 45 45 46 46 47 46 46 46 47 48 48 48 48 48 48 48 48 48 48 49 49 49 49 49 49 50 50 50 50 51 52 52 52 52 52 53 53 53 54 54 54 54 54 54 54 54 55 56 56 57 57 57 57 57 57 57 57 58 58 58 58 58 58 57 57 56 56 56
1693E6%Jj%%%%%%j%%%j%%%%%%j%%J%%j%%%%%%%jJ%%%%%%%%j%%%%%%%%j%%%%%%%%%j%J%%%%
$$ 56 56 57 56 56 56 56 56 56 56 55 55 55 55 54 54 54 54 54 54 54 53 53 53 54 54 54 53 53 53 53 53 53 53 53 52 53 53 53 53 53 53 53 53 53 52 52 52 52 52 52 52 52 52 51 51 51 51 51 51 51 51 51 51 50 50 51 51 51 51 51
1685E1%%%%%%%%%%%%%%%%%%%%%%%%%%%%%%%%%%%%%%%%%%%%J%%J%%JJ%%J%JJJJKJKJJJJKKJ
$$ 51 51 51 51 51 51 51 51 51 51 51 51 51 51 51 51 51 51 51 51 51 51 51 51 51 51 51 51 51 51 51 51 51 51 51 51 51 51 51 51 51 51 51 51 51 52 52 52 53 53 53 54 55 55 55 56 56 57 58 59 60 62 63 65 66 67 68 69 71 73 74
1678G4JKJKJJKJKKKLKKKKJJJJJJJKJJKJKKJJJJ%%%j%jjj%jjjjjjkjjjkkkjkkkkkjkkkjjkj
$$ 74 75 77 78 80 81 82 84 85 87 89 91 94 96 98 100 102 103 104 105 106 107 108 109 111 112 113 115 116 118 120 121 122 123 124 124 124 124 123 123 122 121 120 120 119 118 117 116 115 114 112 111 110 109 107 105 103 102 100 98 96 94 92 91 89 87 85 84 83 81 80
1670H0kjkkkjkjjkjjjkjjjj%j%j%%j%%%jj%%%j%%%%%%%%%%%%%%%%%J%j%%%j%%%J%%%%%%%%
$$ 80 78 77 75 73 71 70 68 67 66 64 63 62 61 59 58 57 56 55 55 54 54 53 53 53 52 52 52 52 51 50 50 50 50 49 49 49 49 49 49 49 49 49 49 49 49 49 49 49 49 49 49 50 50 49 49 49 49 48 48 48 48 49 49 49 49 49 49 49 49 49
1663D9%%%%%%%%%%%%j%%%%%%%%%%%%%%%%%%%j%%J%%J%%j%%%%%%%%%%%%%%%%%%%%%%%%%%%%
$$ 49 49 49 49 49 49 49 49 49 49 49 49 49 48 48 48 48 48 48 48 48 48 48 48 48 48 48 48 48 48 48 48 48 47 47 47 48 48 48 49 49 49 48 48 48 48 48 48 48 48 48 48 48 48 48 48 48 48 48 48 48 48 48 48 48 48 48 48 48 48 48
1656D8%%j%%%%%J%%%%%%Jj%%%%%%%%j%%%%J%%%%%%j%%%%%%%J%j%J%%jJ%%%%j%%%%%%J%%%%
$$ 48 48 48 47 47 47 47 47 47 48 48 48 48 48 48 48 49 48 48 48 48 48 48 48 48 48 47 47 47 47 47 48 48 48 48 48 48 48 47 47 47 47 47 47 47 47 48 48 47 47 48 48 48 47 48 48 48 48 48 47 47 47 47 47 47 47 48 48 48 48 48
1648D8%%%%j%Jj%%J%%%%%j%%J%%%%%j%%%%%%%%%%%%j%J%%%%%%%%%%j%%J%%J%%%%%%%%%j%J
$$ 48 48 48 48 48 47 47 48 47 47 47 48 48 48 48 48 48 47 47 47 48 48 48 48 48 48 47 47 47 47 47 47 47 47 47 47 47 47 47 46 46 47 47 47 47 47 47 47 47 47 47 47 46 46 46 47 47 47 48 48 48 48 48 48 48 48 48 48 47 47 48
1641D8%%%%%%j%%%%%%%%%%%%%%%%%%%%%%%%j%J%%%%j%%%%%J%%%%%%%%%%%%%%%J%%%j%%%%%
$$ 48 48 48 48 48 48 48 47 47 47 47 47 47 47 47 47 47 47 47 47 47 47 47 47 47 47 47 47 47 47 47 47 46 46 47 47 47 47 47 46 46 46 46 46 46 47 47 47 47 47 47 47 47 47 47 47 47 47 47 47 47 48 48 48 48 47 47 47 47 47 47
1633D7%%%j%J%%%jJ%%Jj%%%%%%%%%%%%%%%j%%%%%%%J%%%%%%j%%J%%%%j%%%%%%%%%%%%%%%%
$$ 47 47 47 47 46 46 47 47 47 47 46 47 47 47 48 47 47 47 47 47 47 47 47 47 47 47 47 47 47 47 47 46 46 46 46 46 46 46 46 47 47 47 47 47 47 47 46 46 46 47 47 47 47 47 46 46 46 46 46 46 46 46 46 46 46 46 46 46 46 46 46
1626D6%%%J%%j%%%%%%%%%%%%Jj%%%%%%%%%J%%jJ%%j%j%%%jJ%%%%%JJj%%%%%j%%J%%%%%%%%
$$ 46 46 46 46 47 47 47 46 46 46 46 46 46 46 46 46 46 46 46 46 47 46 46 46 46 46 46 46 46 46 46 47 47 47 46 47 47 47 46 46 45 45 45 45 44 45 45 45 45 45 45 46 47 46 46 46 46 46 46 45 45 45 46 46 46 46 46 46 46 46 46
1618D6%%%%%%J%%j%%%%J%%%%j%%%j%%J%%%%%%%%%%%%Jj%%%%J%j%J%%%%%%j%%%%%%%%J%%%%
$$ 46 46 46 46 46 46 46 47 47 47 46 46 46 46 46 47 47 47 47 47 46 46 46 46 45 45 45 46 46 46 46 46 46 46 46 46 46 46 46 46 47 46 46 46 46 46 47 47 46 46 47 47 47 47 47 47 47 46 46 46 46 46 46 46 46 46 47 47 47 47 47
1611D7%j%%J%%%%j%%%%%%%%%%%%%%%%%%%%J%%%%%%%%%j%%%%%jJ%%%J%%jJ%%j%J%%%j%%%J%
$$ 47 47 46 46 46 47 47 47 47 47 46 46 46 46 46 46 46 46 46 46 46 46 46 46 46 46 46 46 46 46 46 47 47 47 47 47 47 47 47 47 47 46 46 46 46 46 46 45 46 46 46 46 47 47 47 46 47 47 47 46 46 47 47 47 47 46 46 46 46 47 47
1604D7%%%%%%%j%%J%%%%jJ%%%%%%%%%j%%%%%%J%%%j%%%j%J%%%%%%%J%%%j%%%%%%%%%%%%%%
$$ 47 47 47 47 47 47 47 47 46 46 46 47 47 47 47 47 46 47 47 47 47 47 47 47 47 47 47 46 46 46 46 46 46 46 47 47 47 47 46 46 46 46 45 45 46 46 46 46 46 46 46 46 47 47 47 47 46 46 46 46 46 46 46 46 46 46 46 46 46 46 46
1596D6%%%%%%%%%%%%j%%J%%%%%%%%%%%%%%%Jj%%%j%%J%%%%%%%%%%%%%%J%%%%j%%%%%J%%%j
$$ 46 46 46 46 46 46 46 46 46 46 46 46 46 45 45 45 46 46 46 46 46 46 46 46 46 46 46 46 46 46 46 46 47 46 46 46 46 45 45 45 46 46 46 46 46 46 46 46 46 46 46 46 46 46 46 47 47 47 47 47 46 46 46 46 46 46 47 47 47 47 46
1589D6%%%%J%%%j%%%%%%%%%%%%%J%%%%jJ%%%%%%%%%jJjJ%%%%j%%%%%%J%%%j%%%%%%J%%%j%
$$ 46 46 46 46 46 47 47 47 47 46 46 46 46 46 46 46 46 46 46 46 46 46 46 47 47 47 47 47 46 47 47 47 47 47 47 47 47 47 47 46 47 46 47 47 47 47 47 46 46 46 46 46 46 46 47 47 47 47 46 46 46 46 46 46 46 47 47 47 47 46 46
1581D6J%%%%%j%%%%J%%%%%%%%%%%%%%j%%%J%%%%%%%%%j%%J%%%J%%j%%%%%%%%%%j%%%%Jj%%
$$ 46 47 47 47 47 47 47 46 46 46 46 46 47 47 47 47 47 47 47 47 47 47 47 47 47 47 47 46 46 46 46 47 47 47 47 47 47 47 47 47 47 46 46 46 47 47 47 47 48 48 48 47 47 47 47 47 47 47 47 47 47 47 46 46 46 46 46 47 46 46 46
1574D6%%%%%%%%%%J%%%%%%j%jJ%%j%j%J%%j%Jj%j%J%%%%j%%j%%J%%j%%%%%%j%%%%%J%%%%%
$$ 46 46 46 46 46 46 46 46 46 46 46 47 47 47 47 47 47 47 46 46 45 46 46 46 45 45 44 44 45 45 45 44 44 45 44 44 43 43 44 44 44 44 44 43 43 43 42 42 42 43 43 43 42 42 42 42 42 42 42 41 41 41 41 41 41 42 42 42 42 42 42
1567D2%%%%%%%j%%%J%%%%%%%%%%%J%%%%%j%%%J%%%%%%%%jJ%%%%J%%%%%%%%%%%%%%%%%%%%%
$$ 42 42 42 42 42 42 42 42 41 41 41 41 42 42 42 42 42 42 42 42 42 42 42 42 43 43 43 43 43 43 42 42 42 42 43 43 43 43 43 43 43 43 43 42 43 43 43 43 43 44 44 44 44 44 44 44 44 44 44 44 44 44 44 44 44 44 44 44 44 44 44
1559D4%%%J%%%%%%%Jj%%%%%%J%j%%%%%%J%%%%%%%%%%%j%%%J%%%%%%J%j%%%%%%%%%jJ%%%%%
$$ 44 44 44 44 45 45 45 45 45 45 45 45 46 45 45 45 45 45 45 45 46 46 45 45 45 45 45 45 45 46 46 46 46 46 46 46 46 46 46 46 46 45 45 45 45 46 46 46 46 46 46 46 47 47 46 46 46 46 46 46 46 46 46 46 45 46 46 46 46 46 46
1552D6%%%%%%%%%%%%%%%%%%%%%%%%%%%%%%%j%%%%%J%%%%%%%%%%%J%j%%%%%%%%%%%%%j%%%J
$$ 46 46 46 46 46 46 46 46 46 46 46 46 46 46 46 46 46 46 46 46 46 46 46 46 46 46 46 46 46 46 46 46 45 45 45 45 45 45 46 46 46 46 46 46 46 46 46 46 46 46 47 47 46 46 46 46 46 46 46 46 46 46 46 46 46 46 45 45 45 45 46
1544D6%jJ%%%%%%J%%%j%%%%%%%%j%J%jJ%%%%J%j%%%j%%%%%%%%J%%%J%%%%%j%%J%j%%%%J%%
$$ 46 46 45 46 46 46 46 46 46 46 47 47 47 47 46 46 46 46 46 46 46 46 46 45 45 46 46 45 46 46 46 46 46 47 47 46 46 46 46 45 45 45 45 45 45 45 45 45 46 46 46 46 47 47 47 47 47 47 46 46 46 47 47 46 46 46 46 46 47 47 47
1537D7j%%%%J%j%%%%%%%%%%%%%%%%%%%%%%%%%%%%%%%%%%%%%%%%%%j%%%Jj%%J%%%%%%%%%%J
$$ 47 46 46 46 46 46 47 47 46 46 46 46 46 46 46 46 46 46 46 46 46 46 46 46 46 46 46 46 46 46 46 46 46 46 46 46 46 46 46 46 46 46 46 46 46 46 46 46 46 46 46 45 45 45 45 46 45 45 45 46 46 46 46 46 46 46 46 46 46 46 47
1529D7j%%j%%J%%%%%j%%J%%%j%%%%%%%J%%%%%%%%%%%%%%%%%%%Jj%%%%jJ%%%j%J%%%%%j%%%
$$ 47 46 46 46 45 45 45 46 46 46 46 46 46 45 45 45 46 46 46 46 45 45 45 45 45 45 45 45 46 46 46 46 46 46 46 46 46 46 46 46 46 46 46 46 46 46 46 46 47 46 46 46 46 46 45 46 46 46 46 45 45 46 46 46 46 46 46 45 45 45 45
1522D5J%%%%J%%%%j%%%%%%%%%%%%%%%%%%%jJ%%%%%%%%%%%j%%J%%%%%%%%%%jJ%%%%%%%J%j%
$$ 45 46 46 46 46 46 47 47 47 47 47 46 46 46 46 46 46 46 46 46 46 46 46 46 46 46 46 46 46 46 46 45 46 46 46 46 46 46 46 46 46 46 46 46 45 45 45 46 46 46 46 46 46 46 46 46 46 46 45 46 46 46 46 46 46 46 46 47 47 46 46
1515D6%%%%%%%%%%%%%%%%%%%%%%%%%j%%J%%%j%J%%%%%%%J%j%%%%%%%%%%%%%%%%%J%j%%jJ%
$$ 46 46 46 46 46 46 46 46 46 46 46 46 46 46 46 46 46 46 46 46 46 46 46 46 46 46 45 45 45 46 46 46 46 45 45 46 46 46 46 46 46 46 46 47 47 46 46 46 46 46 46 46 46 46 46 46 46 46 46 46 46 46 46 47 47 46 46 46 45 46 46
1507D6%%%%j%%%J%%j%%%%J%%%%%%%j%%%J%%%%%%j%%%%J%%%%%j%%%%%%%J%%%%%%%%%j%%%%%
$$ 46 46 46 46 46 45 45 45 45 46 46 46 45 45 45 45 45 46 46 46 46 46 46 46 46 45 45 45 45 46 46 46 46 46 46 46 45 45 45 45 45 46 46 46 46 46 46 45 45 45 45 45 45 45 45 46 46 46 46 46 46 46 46 46 46 45 45 45 45 45 45
1500D5%%%%%%%%%%J%%%%j%%J%%%%%j%%%J%%%%%%%%%%%%%%%%%%%%%%%%%j%%J%%%%%j%J%%%%
$$ 45 45 45 45 45 45 45 45 45 45 45 46 46 46 46 46 45 45 45 46 46 46 46 46 46 45 45 45 45 46 46 46 46 46 46 46 46 46 46 46 46 46 46 46 46 46 46 46 46 46 46 46 46 46 46 45 45 45 46 46 46 46 46 46 45 45 46 46 46 46 46
1492D6%%%jJ%%%J%%j%%%%%%%%j%J%%j%%%%%%%%J%%%j%%%%%J%%%J%%j%%J%%j%jJ%%%%%%%%%
$$ 46 46 46 46 45 46 46 46 46 47 47 47 46 46 46 46 46 46 46 46 46 45 45 46 46 46 45 45 45 45 45 45 45 45 45 46 46 46 46 45 45 45 45 45 45 46 46 46 46 47 47 47 46 46 46 47 47 47 46 46 45 46 46 46 46 46 46 46 46 46 46
1485D6%%%%%j%%%J%Jj%%%%%%%%j%%%%J%%%%%%%j%%J%%%%%%%%%%%%%%%%%J%%%j%J%%j%%%%%
$$ 46 46 46 46 46 46 45 45 45 45 46 46 47 46 46 46 46 46 46 46 46 46 45 45 45 45 45 46 46 46 46 46 46 46 46 45 45 45 46 46 46 46 46 46 46 46 46 46 46 46 46 46 46 46 46 46 47 47 47 47 46 46 47 47 47 46 46 46 46 46 46
1478D6%%%%%%j%%J%%%%%%J%j%j%%%%%%J%%%%%%%j%%%%%%%%J%%%%%jJ%Jj%%%%%%%%%j%%%%%
$$ 46 46 46 46 46 46 46 45 45 45 46 46 46 46 46 46 46 47 47 46 46 45 45 45 45 45 45 45 46 46 46 46 46 46 46 46 45 45 45 45 45 45 45 45 45 46 46 46 46 46 46 45 46 46 47 46 46 46 46 46 46 46 46 46 46 45 45 45 45 45 45
1470D5J%%%%%j%%%%%%%%%%%J%%%%%%%j%%%%J%%%%%%%%%%%%%jJ%%%%%%%j%%J%%%%%%%j%%%%
$$ 45 46 46 46 46 46 46 45 45 45 45 45 45 45 45 45 45 45 45 46 46 46 46 46 46 46 46 45 45 45 45 45 46 46 46 46 46 46 46 46 46 46 46 46 46 46 45 46 46 46 46 46 46 46 46 45 45 45 46 46 46 46 46 46 46 46 45 45 45 45 45
1463D5%%%%%%%J%j%%Jj%%%%%%%j%J%%%J%%%j%%J%J%%j%%%%%%%%%%%%%%%%%%%%%%%j%%J%%%
$$ 45 45 45 45 45 45 45 45 46 46 45 45 45 46 45 45 45 45 45 45 45 45 44 44 45 45 45 45 46 46 46 46 45 45 45 46 46 47 47 47 46 46 46 46 46 46 46 46 46 46 46 46 46 46 46 46 46 46 46 46 46 46 46 46 45 45 45 46 46 46 46
1455D6%%%%%%%%%%j%%J%%%%J%%J%j%%%%%%JJ%JJ%%%%jJ%%%%%j%j%%j%j%%%jJ%%%j%%%%J%j
$$ 46 46 46 46 46 46 46 46 46 46 46 45 45 45 46 46 46 46 46 47 47 47 48 48 47 47 47 47 47 47 47 48 49 49 50 51 51 51 51 51 50 51 51 51 51 51 51 50 50 49 49 49 48 48 47 47 47 47 46 47 47 47 47 46 46 46 46 46 47 47 46
1448D6%%%%%%%%%%J%%%%%J%%%%%%%%%%%%%%JJJJJJJKKKLKKJJJ%%%%jjjjjkkkjkjjjjjj%%j
$$ 46 46 46 46 46 46 46 46 46 46 46 47 47 47 47 47 47 48 48 48 48 48 48 48 48 48 48 48 48 48 48 48 49 50 51 52 53 54 55 57 59 61 64 66 68 69 70 71 71 71 71 71 70 69 68 67 66 64 62 60 59 57 56 55 54 53 52 51 51 51 50
1440E0j%jjj%%%%J%%%%%%%j%%%%%%%%J%%j%%%%%%j%%%J%%%%%%%%%jJ%%%%%j%%J%%%%%%J%%
$$ 50 49 49 48 47 46 46 46 46 46 47 47 47 47 47 47 47 47 46 46 46 46 46 46 46 46 46 47 47 47 46 46 46 46 46 46 46 45 45 45 45 46 46 46 46 46 46 46 46 46 46 45 46 46 46 46 46 46 45 45 45 46 46 46 46 46 46 46 47 47 47
1433D7%j%%%%%%%%%%%%%j%%%J%j%%%%%J%%%%%j%%%%%J%%%%%%%%%%%%%%%%%%%%%%%%%%%%%J
$$ 47 47 46 46 46 46 46 46 46 46 46 46 46 46 46 46 45 45 45 45 46 46 45 45 45 45 45 45 46 46 46 46 46 46 45 45 45 45 45 45 46 46 46 46 46 46 46 46 46 46 46 46 46 46 46 46 46 46 46 46 46 46 46 46 46 46 46 46 46 46 47
1426D7j%%%%%%%%%j%J%%j%%%%Jj%%%%%J%%%%%%%%j%%%%J%j%%%%%%%%%%Jj%Jj%%%%%%%%%%%
$$ 47 46 46 46 46 46 46 46 46 46 46 45 45 46 46 46 45 45 45 45 45 46 45 45 45 45 45 45 46 46 46 46 46 46 46 46 46 45 45 45 45 45 46 46 45 45 45 45 45 45 45 45 45 45 45 46 45 45 46 45 45 45 45 45 45 45 45 45 45 45 45
1418D5%%%J%%j%J%%%j%%%%%%J%%%j%%%%%%%J%j%%%%J%%%%%%%%%%%%%%%%%%%%%%j%%%%%%%%
$$ 45 45 45 45 46 46 46 45 45 46 46 46 46 45 45 45 45 45 45 45 46 46 46 46 45 45 45 45 45 45 45 45 46 46 45 45 45 45 45 46 46 46 46 46 46 46 46 46 46 46 46 46 46 46 46 46 46 46 46 46 46 46 45 45 45 45 45 45 45 45 45
1411D5%%%%%%%%%%%%%%%%%%jJ%%%%J%%%j%%%%%J%%%j%%%%%J%%%%%J%%j%%%%%%%%%J%j%j%%
$$ 45 45 45 45 45 45 45 45 45 45 45 45 45 45 45 45 45 45 45 44 45 45 45 45 45 46 46 46 46 45 45 45 45 45 45 46 46 46 46 45 45 45 45 45 45 46 46 46 46 46 46 47 47 47 46 46 46 46 46 46 46 46 46 46 47 47 46 46 45 45 45
1403D5%%%%%J%%%%%%%%%%%%j%%J%j%%%%%jJ%%%%%%%%%%%J%%%%%%%%%j%%J%%%%%%%%%%%%%%
$$ 45 45 45 45 45 45 46 46 46 46 46 46 46 46 46 46 46 46 46 45 45 45 46 46 45 45 45 45 45 45 44 45 45 45 45 45 45 45 45 45 45 45 45 46 46 46 46 46 46 46 46 46 46 45 45 45 46 46 46 46 46 46 46 46 46 46 46 46 46 46 46
1396D6%%%%%%%%%%%%%%%%%%%%%%%%%%%%%jJJ%j%%%%%%%%%%J%%%j%%%%%%%J%%j%%J%%%%%%%
$$ 46 46 46 46 46 46 46 46 46 46 46 46 46 46 46 46 46 46 46 46 46 46 46 46 46 46 46 46 46 46 45 46 47 47 46 46 46 46 46 46 46 46 46 46 46 47 47 47 47 46 46 46 46 46 46 46 46 47 47 47 46 46 46 47 47 47 47 47 47 47 47
1389D7%Jj%%%%%%%%%%%%%%%%%J%%%%jJ%%%%%%J%J%%%%J%%JJ%J%J%%J%J%%%%%j%%%jj%%jjj
$$ 47 47 48 47 47 47 47 47 47 47 47 47 47 47 47 47 47 47 47 47 47 48 48 48 48 48 47 48 48 48 48 48 48 48 49 49 50 50 50 50 50 51 51 51 52 53 53 54 54 55 55 55 56 56 57 57 57 57 57 57 56 56 56 56 55 54 54 54 53 52 51
1381E1j%%%j%%%j%%j%%%%jJj%%%%%%%%%%J%%%%%%%%%j%J%%%%j%%%%%%%%%%%%%%jJ%%%%%%%
$$ 51 50 50 50 50 49 49 49 49 48 48 48 47 47 47 47 47 46 47 46 46 46 46 46 46 46 46 46 46 46 47 47 47 47 47 47 47 47 47 47 46 46 47 47 47 47 47 46 46 46 46 46 46 46 46 46 46 46 46 46 46 46 45 46 46 46 46 46 46 46 46
1374D6%%J%%%%j%%%%%%%%j%J%%%%%%%%%%%%j%%j%%J%%%J%%%%%%%%%%%%%%j%%%%%%%%%%%%%
$$ 46 46 46 47 47 47 47 47 46 46 46 46 46 46 46 46 46 45 45 46 46 46 46 46 46 46 46 46 46 46 46 46 45 45 45 44 44 44 45 45 45 45 46 46 46 46 46 46 46 46 46 46 46 46 46 46 46 45 45 45 45 45 45 45 45 45 45 45 45 45 45
1366D5%%%%%%%%%%%%%%%%%J%%%j%%%%%%%%%%%%J%%%%%%%%%j%%%%%%%%%%J%j%%%J%%%%%%%%
$$ 45 45 45 45 45 45 45 45 45 45 45 45 45 45 45 45 45 45 46 46 46 46 45 45 45 45 45 45 45 45 45 45 45 45 45 46 46 46 46 46 46 46 46 46 46 45 45 45 45 45 45 45 45 45 45 45 46 46 45 45 45 45 46 46 46 46 46 46 46 46 46
1359D6j%%%J%%%j%%%%%%%%%%%%Jj%%%%%%%J%jJ%%%%%%%%%jJ%%%J%%%j%jJj%%%%%%J%j%%%%
$$ 46 45 45 45 45 46 46 46 46 45 45 45 45 45 45 45 45 45 45 45 45 45 46 45 45 45 45 45 45 45 45 46 46 45 46 46 46 46 46 46 46 46 46 46 45 46 46 46 46 47 47 47 47 46 46 45 46 45 45 45 45 45 45 45 46 46 45 45 45 45 45
1351D5%%%%j%J%%%J%%%j%%%J%%j%j%%%J%jJ%%Jj%J%j%%%%%%%%%%jJ%%%%%%%%%%%%%%%%%%%
$$ 45 45 45 45 45 44 44 45 45 45 45 46 46 46 46 45 45 45 45 46 46 46 45 45 44 44 44 44 45 45 44 45 45 45 46 45 45 46 46 45 45 45 45 45 45 45 45 45 45 45 44 45 45 45 45 45 45 45 45 45 45 45 45 45 45 45 45 45 45 45 45
1344D5%%%%%%J%j%%%%Jj%%%%%%J%%%%%%%%%%j%%%%%J%%%j%%%%%J%%%%%%%%j%J%%%%j%%J%j
$$ 45 45 45 45 45 45 45 46 46 45 45 45 45 45 46 45 45 45 45 45 45 45 46 46 46 46 46 46 46 46 46 46 46 45 45 45 45 45 45 46 46 46 46 45 45 45 45 45 45 46 46 46 46 46 46 46 46 46 45 45 46 46 46 46 46 45 45 45 46 46 45
1337D5J%%j%%%%%%%J%%%j%%%J%%%%%%%%%%%%j%%%J%%%%Jj%%%%%%j%%%%%%%%%%%%%J%%%%%%
$$ 45 46 46 46 45 45 45 45 45 45 45 45 46 46 46 46 45 45 45 45 46 46 46 46 46 46 46 46 46 46 46 46 46 45 45 45 45 46 46 46 46 46 47 46 46 46 46 46 46 46 45 45 45 45 45 45 45 45 45 45 45 45 45 45 46 46 46 46 46 46 46
1329D6J%%%%%%%j%%%J%%%j%%%%%%%%%%%j%%Jj%%Jj%%%%%%%%%%%J%%j%%%%%%%%%%%%%%%%Jj
$$ 46 47 47 47 47 47 47 47 47 46 46 46 46 47 47 47 47 46 46 46 46 46 46 46 46 46 46 46 46 45 45 45 46 45 45 45 46 45 45 45 45 45 45 45 45 45 45 45 45 46 46 46 45 45 45 45 45 45 45 45 45 45 45 45 45 45 45 45 45 46 45
1322D5%%%j%%J%%%%%%j%%%%%J%j%%%%J%j%%J%%%%J%%%%j%%%%%%%%%%J%%%j%%%%%%%%%%%%%
$$ 45 45 45 45 44 44 44 45 45 45 45 45 45 45 44 44 44 44 44 44 45 45 44 44 44 44 44 45 45 44 44 44 45 45 45 45 45 46 46 46 46 46 45 45 45 45 45 45 45 45 45 45 45 46 46 46 46 45 45 45 45 45 45 45 45 45 45 45 45 45 45
1314D5%%%%%j%%%%%J%%%%%%%%j%%%%J%%%%%%%%j%%%%%%%%%%%%%%J%J%%j%%j%%%J%%%%%%%%
$$ 45 45 45 45 45 45 44 44 44 44 44 44 45 45 45 45 45 45 45 45 45 44 44 44 44 44 45 45 45 45 45 45 45 45 45 44 44 44 44 44 44 44 44 44 44 44 44 44 44 44 45 45 46 46 46 45 45 45 44 44 44 44 45 45 45 45 45 45 45 45 45
1307D5%%%%%%%%%%j%%%J%%%j%%%%%J%%j%%%%%%%%%%%J%jJ%%%%%%%%%%%%%%%%%jJ%%jJ%%%j
$$ 45 45 45 45 45 45 45 45 45 45 45 44 44 44 44 45 45 45 45 44 44 44 44 44 44 45 45 45 44 44 44 44 44 44 44 44 44 44 44 44 45 45 44 45 45 45 45 45 45 45 45 45 45 45 45 45 45 45 45 45 45 44 45 45 45 44 45 45 45 45 44
1300D4%%J%%%%%%%%%%j%%Jj%%J%%J%J%%j%j%J%j%%%%%%j%%%%%%%J%%jJ%%%%%jJ%%%%%j%J%
$$ 44 44 44 45 45 45 45 45 45 45 45 45 45 45 44 44 44 45 44 44 44 45 45 45 46 46 47 47 47 46 46 45 45 46 46 45 45 45 45 45 45 45 44 44 44 44 44 44 44 44 45 45 45 44 45 45 45 45 45 45 44 45 45 45 45 45 45 44 44 45 45
1292D5%%%%jJ%%Jj%%%%%%%%Jj%jJ%%%%%jJ%%%%%%%%%%%%%%%%%j%J%%%%%%%%%%%%%%%%%jJ%
$$ 45 45 45 45 45 44 45 45 45 46 45 45 45 45 45 45 45 45 45 46 45 45 44 45 45 45 45 45 45 44 45 45 45 45 45 45 45 45 45 45 45 45 45 45 45 45 45 45 44 44 45 45 45 45 45 45 45 45 45 45 45 45 45 45 45 45 45 45 44 45 45
1285D5%%%J%%%%jJ%%%j%%%%%%%%%%%j%J%%%J%%%j%%%%%%%%%%J%j%%%%%j%%%J%%%%j%%%%%J
$$ 45 45 45 45 46 46 46 46 46 45 46 46 46 46 45 45 45 45 45 45 45 45 45 45 45 45 44 44 45 45 45 45 46 46 46 46 45 45 45 45 45 45 45 45 45 45 45 46 46 45 45 45 45 45 45 44 44 44 44 45 45 45 45 45 44 44 44 44 44 44 45
1277D5j%J%%%%%%%j%%%J%%%%%%%%%%%%%%%%%%%%%jj%%J%%%%%J%%%j%J%%%%%J%%%j%%%%%%%
$$ 45 44 44 45 45 45 45 45 45 45 45 44 44 44 44 45 45 45 45 45 45 45 45 45 45 45 45 45 45 45 45 45 45 45 45 45 45 44 43 43 43 44 44 44 44 44 44 45 45 45 45 44 44 45 45 45 45 45 45 46 46 46 46 45 45 45 45 45 45 45 45
1270D5%%%%%%j%%%J%J%j%%%%%%%%Jj%%%%%%%%%%%%%%%%%%%%%%%%%%%%%%%%%jJ%%%%%%%%%%
$$ 45 45 45 45 45 45 45 44 44 44 44 45 45 46 46 45 45 45 45 45 45 45 45 45 46 45 45 45 45 45 45 45 45 45 45 45 45 45 45 45 45 45 45 45 45 45 45 45 45 45 45 45 45 45 45 45 45 45 45 44 45 45 45 45 45 45 45 45 45 45 45
1262D5%%%%%%%%%%%%%%%%%jJ%%%%j%J%%%%%%%jJ%j%J%%%j%%J%%%%%%%%J%jJj%%%%%%%J%j%
$$ 45 45 45 45 45 45 45 45 45 45 45 45 45 45 45 45 45 45 44 45 45 45 45 45 44 44 45 45 45 45 45 45 45 45 44 45 45 44 44 45 45 45 45 44 44 44 45 45 45 45 45 45 45 45 45 46 46 45 46 45 45 45 45 45 45 45 45 46 46 45 45
1255D5j%%%%%J%%%J%%j%%%%j%%%%%%%%%%J%%j%%J%%%%%%%%%%%%%J%j%%%%%%%%%%%%%%%%%J
$$ 45 44 44 44 44 44 44 45 45 45 45 46 46 46 45 45 45 45 45 44 44 44 44 44 44 44 44 44 44 44 45 45 45 44 44 44 45 45 45 45 45 45 45 45 45 45 45 45 45 45 46 46 45 45 45 45 45 45 45 45 45 45 45 45 45 45 45 45 45 45 46
1248D6%%j%%%%%%j%J%%%%%%%%%%%%%%J%jJj%%J%%%j%%%%%%%%%%%%j%%%J%%%%j%J%%%%%%j%
$$ 46 46 46 45 45 45 45 45 45 45 44 44 45 45 45 45 45 45 45 45 45 45 45 45 45 45 45 46 46 45 46 45 45 45 46 46 46 46 45 45 45 45 45 45 45 45 45 45 45 45 45 44 44 44 44 45 45 45 45 45 44 44 45 45 45 45 45 45 45 44 44
1240D4%%%%%J%%j%J%%%%%%%%%%%%%%%%%j%%%%%%%%%%J%%j%%J%j%%J%%%%%%%%%%%%%%%%%%%
$$ 44 44 44 44 44 44 45 45 45 44 44 45 45 45 45 45 45 45 45 45 45 45 45 45 45 45 45 45 45 44 44 44 44 44 44 44 44 44 44 44 45 45 45 44 44 44 45 45 44 44 44 45 45 45 45 45 45 45 45 45 45 45 45 45 45 45 45 45 45 45 45
1233D5%%%%%Jj%%%%%%%J%%%%jJ%%%%%j%%%%%J%%jJ%j%%%%%%J%%%%%%%%%%%%J%j%%%%%%j%J
$$ 45 45 45 45 45 45 46 45 45 45 45 45 45 45 45 46 46 46 46 46 45 46 46 46 46 46 46 45 45 45 45 45 45 46 46 46 45 46 46 45 45 45 45 45 45 45 46 46 46 46 46 46 46 46 46 46 46 46 46 47 47 46 46 46 46 46 46 46 45 45 46
1225D6%%%%J%jj%JJ%%j%%j%%%%%%J%%%%%j%%%%J%j%%%%%%%%%%%%%%%%%%%%%%J%%%j%J%j%%
$$ 46 46 46 46 46 47 47 46 45 45 46 47 47 47 46 46 46 45 45 45 45 45 45 45 46 46 46 46 46 46 45 45 45 45 45 46 46 45 45 45 45 45 45 45 45 45 45 45 45 45 45 45 45 45 45 45 45 45 45 45 46 46 46 46 45 45 46 46 45 45 45
1218D5%%%%%%%%%%%%%%%%%%%J%j%%%%%%%%%%%%%%%%%%%%%%%j%%%%%%Jj%%%%%Jj%%%%%J%%%
$$ 45 45 45 45 45 45 45 45 45 45 45 45 45 45 45 45 45 45 45 45 46 46 45 45 45 45 45 45 45 45 45 45 45 45 45 45 45 45 45 45 45 45 45 45 45 45 44 44 44 44 44 44 44 45 44 44 44 44 44 44 45 44 44 44 44 44 44 45 45 45 45
1211D5%%%%%%%%%j%J%%%j%%%J%%%%%%jJ%%%%%%%%%j%%%%%%%%%J%%%%j%%J%j%%J%Jj%j%%%%
$$ 45 45 45 45 45 45 45 45 45 45 44 44 45 45 45 45 44 44 44 44 45 45 45 45 45 45 45 44 45 45 45 45 45 45 45 45 45 45 44 44 44 44 44 44 44 44 44 44 45 45 45 45 45 44 44 44 45 45 44 44 44 45 45 46 45 45 44 44 44 44 44
1203D4%J%%%%%%%%%j%%%%%%%%%%%%%%%%J%%j%J%%%j%%%%%%%%%%J%J%j%%%%%%%%j%%%J%%%j
$$ 44 44 45 45 45 45 45 45 45 45 45 45 44 44 44 44 44 44 44 44 44 44 44 44 44 44 44 44 44 45 45 45 44 44 45 45 45 45 44 44 44 44 44 44 44 44 44 44 44 45 45 46 46 45 45 45 45 45 45 45 45 45 44 44 44 44 45 45 45 45 44
1196D4%%%J%%%%%%%%%Jj%%%%%%%j%%J%%%%%%%%j%%%%%%%%%%J%%%j%%%%%%%%%%%%%jJ%%%%%
$$ 44 44 44 44 45 45 45 45 45 45 45 45 45 45 46 45 45 45 45 45 45 45 45 44 44 44 45 45 45 45 45 45 45 45 45 44 44 44 44 44 44 44 44 44 44 44 45 45 45 45 44 44 44 44 44 44 44 44 44 44 44 44 44 44 43 44 44 44 44 44 44
1188D4%J%%%%%%%%%%%%%%%%%%Jj%%%%%%j%%Jj%%J%jJ%%%%%%%%J%%j%j%%%J%%j%%%J%%%%%%
$$ 44 44 45 45 45 45 45 45 45 45 45 45 45 45 45 45 45 45 45 45 45 46 45 45 45 45 45 45 45 44 44 44 45 44 44 44 45 45 44 45 45 45 45 45 45 45 45 45 46 46 46 45 45 44 44 44 44 45 45 45 44 44 44 44 45 45 45 45 45 45 45
1181D5%%j%%J%%%%%%%%%j%%J%%%%%%%%J%%%%%%%%j%%%%%J%%jj%%%%%%J%%jJ%%%%%%%%%%%%
$$ 45 45 45 44 44 44 45 45 45 45 45 45 45 45 45 45 44 44 44 45 45 45 45 45 45 45 45 45 46 46 46 46 46 46 46 46 46 45 45 45 45 45 45 46 46 46 45 44 44 44 44 44 44 44 45 45 45 44 45 45 45 45 45 45 45 45 45 45 45 45 45
1173D5%%%%j%J%%%%%%J%%%%%j%%%%%%%%j%J%%%%j%%Jj%%%%%%%%%%%%JjJ%%%%%%%%%%%%j%%
$$ 45 45 45 45 45 44 44 45 45 45 45 45 45 45 46 46 46 46 46 46 45 45 45 45 45 45 45 45 45 44 44 45 45 45 45 45 44 44 44 45 44 44 44 44 44 44 44 44 44 44 44 44 44 45 44 45 45 45 45 45 45 45 45 45 45 45 45 45 44 44 44
1166D4%%%%%%%J%%j%%%%%j%%J%%%%%J%j%%%%%%%J%j%j%%%J%%%%%%%%%%%%J%j%%%J%j%%%%%
$$ 44 44 44 44 44 44 44 44 45 45 45 44 44 44 44 44 44 43 43 43 44 44 44 44 44 44 45 45 44 44 44 44 44 44 44 44 45 45 44 44 43 43 43 43 44 44 44 44 44 44 44 44 44 44 44 44 44 45 45 44 44 44 44 45 45 44 44 44 44 44 44
1159D4%%%%%%%j%%%%jJ%%%%%jJ%%%%%j%J%%%j%J%%%%%j%%Jj%%%%%%%%%%j%%J%%%%%%%%%%%
$$ 44 44 44 44 44 44 44 44 43 43 43 43 43 42 43 43 43 43 43 43 42 43 43 43 43 43 43 42 42 43 43 43 43 42 42 43 43 43 43 43 43 42 42 42 43 42 42 42 42 42 42 42 42 42 42 42 41 41 41 42 42 42 42 42 42 42 42 42 42 42 42
1151D2%%%%%%%%%J%%%%%%%Jj%%%%%%%%%%%%%%%%%J%%%%%%%%%%%%%%%%J%%%%%%%%%j%%%%%j
$$ 42 42 42 42 42 42 42 42 42 42 43 43 43 43 43 43 43 43 44 43 43 43 43 43 43 43 43 43 43 43 43 43 43 43 43 43 43 44 44 44 44 44 44 44 44 44 44 44 44 44 44 44 44 44 45 45 45 45 45 45 45 45 45 45 44 44 44 44 44 44 43
1144D3%%J%%%%%%%%%%%%%%%%%%%%%%%J%j%%j%%%%%%%%%J%%%jJ%J%%%j%%%%%J%%%j%%%%%%J
$$ 43 43 43 44 44 44 44 44 44 44 44 44 44 44 44 44 44 44 44 44 44 44 44 44 44 44 44 45 45 44 44 44 43 43 43 43 43 43 43 43 43 43 44 44 44 44 43 44 44 45 45 45 45 44 44 44 44 44 44 45 45 45 45 44 44 44 44 44 44 44 45
1136D5%j%%%%%%%%%%J%%%%j%%J%%%j%%%%%%%%J%j%%%%J%%j%%%%%%%J%%%%%%%Jj%j%%%%%%J
$$ 45 45 44 44 44 44 44 44 44 44 44 44 44 45 45 45 45 45 44 44 44 45 45 45 45 44 44 44 44 44 44 44 44 44 45 45 44 44 44 44 44 45 45 45 44 44 44 44 44 44 44 44 45 45 45 45 45 45 45 45 46 45 45 44 44 44 44 44 44 44 45
1129D5%%j%%%J%%%%%j%%%%%%J%%%%%%%%%%%%%%%%%%j%%%J%j%%%%%J%%%%%%%jJ%%%j%%%%%%
$$ 45 45 45 44 44 44 44 45 45 45 45 45 45 44 44 44 44 44 44 44 45 45 45 45 45 45 45 45 45 45 45 45 45 45 45 45 45 45 45 44 44 44 44 45 45 44 44 44 44 44 44 45 45 45 45 45 45 45 45 44 45 45 45 45 44 44 44 44 44 44 44
1121D4%%%%%Jj%%%%%%%%Jj%%%%%%%%%%%j%J%jJ%%%%Jj%%%J%%%%%%%%j%%%%%%J%j%%%%%%jJ
$$ 44 44 44 44 44 44 45 44 44 44 44 44 44 44 44 44 45 44 44 44 44 44 44 44 44 44 44 44 44 43 43 44 44 43 44 44 44 44 44 45 44 44 44 44 45 45 45 45 45 45 45 45 45 44 44 44 44 44 44 44 45 45 44 44 44 44 44 44 44 43 44
1114D4%J%%%%%%j%%%J%j%J%%j%%%j%J%%%jJ%%%%%%%%%%%%jJ%%%%%j%%J%%J%%%%%%j%%%%%%
$$ 44 44 45 45 45 45 45 45 45 44 44 44 44 45 45 44 44 45 45 45 44 44 44 44 43 43 44 44 44 44 43 44 44 44 44 44 44 44 44 44 44 44 44 44 43 44 44 44 44 44 44 43 43 43 44 44 44 45 45 45 45 45 45 45 44 44 44 44 44 44 44
1107D4%%%%J%%%jJj%jJ%%%%%%%%%%%%%%%j%Jj%%%%J%%%%%%%%%J%j%%%%%%%%%%J%%%j%%%%%
$$ 44 44 44 44 44 45 45 45 45 44 45 44 44 43 44 44 44 44 44 44 44 44 44 44 44 44 44 44 44 44 43 43 44 43 43 43 43 43 44 44 44 44 44 44 44 44 44 44 45 45 44 44 44 44 44 44 44 44 44 44 44 45 45 45 45 44 44 44 44 44 44
1099D4%%%jJ%%%%%%%%%J%j%%%%%%%%J%%%%j%%%%J%j%%%%%%%%%%J%%j%%%%j%%%%%%J%%jJ%%
$$ 44 44 44 44 43 44 44 44 44 44 44 44 44 44 44 45 45 44 44 44 44 44 44 44 44 44 45 45 45 45 45 44 44 44 44 44 45 45 44 44 44 44 44 44 44 44 44 44 44 45 45 45 44 44 44 44 44 43 43 43 43 43 43 43 44 44 44 43 44 44 44
1092D4%%%%%%%%%%%%%%%%%%%%J%%%j%%%J%%%%%%%%j%J%%%%%%%%%%%j%%%J%%j%%%%%%%%%%%
$$ 44 44 44 44 44 44 44 44 44 44 44 44 44 44 44 44 44 44 44 44 44 45 45 45 45 44 44 44 44 45 45 45 45 45 45 45 45 45 44 44 45 45 45 45 45 45 45 45 45 45 45 45 44 44 44 44 45 45 45 44 44 44 44 44 44 44 44 44 44 44 44
1084D4%%%%%%%%%%%%j%%%%%%J%%%Jj%%%%%%%%%%%%J%%%%j%%%Jj%J%%%%%%%%%%%%j%%%j%J%
$$ 44 44 44 44 44 44 44 44 44 44 44 44 44 43 43 43 43 43 43 43 44 44 44 44 45 44 44 44 44 44 44 44 44 44 44 44 44 44 45 45 45 45 45 44 44 44 44 45 44 44 45 45 45 45 45 45 45 45 45 45 45 45 45 44 44 44 44 43 43 44 44
1077D4%Jj%%%Jj%J%j%%%Jj%%J%%%%%%%j%%J%%j%%%%%%%%%j%%%J%%%%j%%J%%%%%%%%%%%%%j
$$ 44 44 45 44 44 44 44 45 44 44 45 45 44 44 44 44 45 44 44 44 45 45 45 45 45 45 45 45 44 44 44 45 45 45 44 44 44 44 44 44 44 44 44 44 43 43 43 43 44 44 44 44 44 43 43 43 44 44 44 44 44 44 44 44 44 44 44 44 44 44 43
1070D3%J%%%%%%%%Jj%%%%J%j%%%%%%%%J%%%%%%%%%%%%%%%j%%%%%%J%%%%%j%%%%%%%%%%%%%
$$ 43 43 44 44 44 44 44 44 44 44 44 45 44 44 44 44 44 45 45 44 44 44 44 44 44 44 44 44 45 45 45 45 45 45 45 45 45 45 45 45 45 45 45 45 44 44 44 44 44 44 44 45 45 45 45 45 45 44 44 44 44 44 44 44 44 44 44 44 44 44 44
1062D4%j%%%%%J%%%%%%%%%%%%%%%J%jj%J%%%J%j%%%%%%j%%%%%%%%%J%J%%j%%%%%%%j%%%%J
$$ 44 44 43 43 43 43 43 43 44 44 44 44 44 44 44 44 44 44 44 44 44 44 44 44 45 45 44 43 43 44 44 44 44 45 45 44 44 44 44 44 44 44 43 43 43 43 43 43 43 43 43 43 44 44 45 45 45 44 44 44 44 44 44 44 44 43 43 43 43 43 44
1055D4%%%%%%j%J%%%%J%%%%%j%%%%%%%%%%jJ%%%%%%%JjJ%%%%%%j%%%%%%%%j%J%%%%J%%%%%
$$ 44 44 44 44 44 44 44 43 43 44 44 44 44 44 45 45 45 45 45 45 44 44 44 44 44 44 44 44 44 44 44 43 44 44 44 44 44 44 44 44 45 44 45 45 45 45 45 45 45 44 44 44 44 44 44 44 44 44 43 43 44 44 44 44 44 45 45 45 45 45 45
1047D5%%Jj%%%%%%j%%%%%%%%j%%J%%%%%%%J%j%%%%jJ%%%%%%%%%%%%J%%%j%J%%j%%%%%%j%J
$$ 45 45 45 46 45 45 45 45 45 45 45 44 44 44 44 44 44 44 44 44 43 43 43 44 44 44 44 44 44 44 44 45 45 44 44 44 44 44 43 44 44 44 44 44 44 44 44 44 44 44 44 44 45 45 45 45 44 44 45 45 45 44 44 44 44 44 44 44 43 43 44
1040D4%%%%%%%%jJ%%%%j%J%%%%%%%%%%%%%%%J%jJj%%%J%%%%j%%%%%%%%%%%%%%%%%%%%J%%%
$$ 44 44 44 44 44 44 44 44 44 43 44 44 44 44 44 43 43 44 44 44 44 44 44 44 44 44 44 44 44 44 44 44 44 45 45 44 45 44 44 44 44 45 45 45 45 45 44 44 44 44 44 44 44 44 44 44 44 44 44 44 44 44 44 44 44 44 44 45 45 45 45
1032D5%j%%J%%%j%%%%%%J%%%%j%%%%%%%%jJ%J%%%Jj%%%%%%%%%%%%%J%%%%%J%%%JJ%JJ%JJJ
$$ 45 45 44 44 44 45 45 45 45 44 44 44 44 44 44 44 45 45 45 45 45 44 44 44 44 44 44 44 44 44 43 44 44 45 45 45 45 46 45 45 45 45 45 45 45 45 45 45 45 45 45 45 46 46 46 46 46 46 47 47 47 47 48 49 49 50 51 51 52 53 54
1025E4JKJKKLKKLJKJ%%j%jjjkkjkkkjkjkjjjjjj%%j%j%%%%jj%%%%%%%%%%%j%%%%j%J%%%%%
$$ 54 55 57 58 60 62 65 67 69 72 73 75 76 76 76 75 75 74 73 72 70 68 67 65 63 61 60 58 57 55 54 53 52 51 50 49 49 49 48 48 47 47 47 47 47 46 45 45 45 45 45 45 45 45 45 45 45 45 44 44 44 44 44 43 43 44 44 44 44 44 44
1018D4%%%%%%%jJ%%%%%%%j%%J%J%j%%%%%%%%%%j%%%%%%%%J%%%%%%%%%%%%%%%%%%%%%j%%%%
$$ 44 44 44 44 44 44 44 44 43 44 44 44 44 44 44 44 44 43 43 43 44 44 45 45 44 44 44 44 44 44 44 44 44 44 44 43 43 43 43 43 43 43 43 43 44 44 44 44 44 44 44 44 44 44 44 44 44 44 44 44 44 44 44 44 44 44 43 43 43 43 43
1010D3%%%%%%%%%%%J%%%%%j%%%J%%%%%%%%%%%%j%%%%%%J%%%%%%%%%%%%%j%J%%%%j%J%%%%%
$$ 43 43 43 43 43 43 43 43 43 43 43 43 44 44 44 44 44 44 43 43 43 43 44 44 44 44 44 44 44 44 44 44 44 44 44 43 43 43 43 43 43 43 44 44 44 44 44 44 44 44 44 44 44 44 44 44 43 43 44 44 44 44 44 43 43 44 44 44 44 44 44
1003D4%%%%%J%%%%%%j%j%J%%%%%%%%%%%%%%%%%%%%%%%j%%Jj%%J%%%%%%%%%Jj%%%%%%%%%%%
$$ 44 44 44 44 44 44 45 45 45 45 45 45 45 44 44 43 43 44 44 44 44 44 44 44 44 44 44 44 44 44 44 44 44 44 44 44 44 44 44 44 44 43 43 43 44 43 43 43 44 44 44 44 44 44 44 44 44 44 45 44 44 44 44 44 44 44 44 44 44 44 44
995D4J%%%%%%%%%%%%%J%%%%%%J%%J%%J%%%%j%%%%j%%%%%j%%%%%%%%j%j%%%%%%%%%%%%%J%%
$$ 44 45 45 45 45 45 45 45 45 45 45 45 45 45 45 46 46 46 46 46 46 46 47 47 47 48 48 48 49 49 49 49 49 48 48 48 48 48 47 47 47 47 47 47 46 46 46 46 46 46 46 46 46 45 45 44 44 44 44 44 44 44 44 44 44 44 44 44 44 45 45 45
988D5%%%j%%J%%j%%%%%%%%J%%%%%%%%%%%%%%j%%J%%%jJ%%j%%%%%%%%%%%%%%%%%%%%%%%J%%
$$ 45 45 45 45 44 44 44 45 45 45 44 44 44 44 44 44 44 44 44 45 45 45 45 45 45 45 45 45 45 45 45 45 45 45 44 44 44 45 45 45 45 44 45 45 45 44 44 44 44 44 44 44 44 44 44 44 44 44 44 44 44 44 44 44 44 44 44 44 44 45 45 45
980D5%%j%%%%%%%%%%%%%%%%%j%%%J%%%%%%%%j%%%%%%%%%%J%j%%%%%%%%%%%J%%j%%%%%%%%%
$$ 45 45 45 44 44 44 44 44 44 44 44 44 44 44 44 44 44 44 44 44 44 43 43 43 43 44 44 44 44 44 44 44 44 44 43 43 43 43 43 43 43 43 43 43 43 44 44 43 43 43 43 43 43 43 43 43 43 43 43 44 44 44 43 43 43 43 43 43 43 43 43 43
973D3%%%J%%%%%%J%j%%%J%%%%%%%%J%%%%%%%%%%%%%%J%%jJ%j%%%%%%%%%%J%%J%J%J%%%j%%
$$ 43 43 43 43 44 44 44 44 44 44 44 45 45 44 44 44 44 45 45 45 45 45 45 45 45 45 46 46 46 46 46 46 46 46 46 46 46 46 46 46 46 47 47 47 46 47 47 46 46 46 46 46 46 46 46 46 46 46 47 47 47 48 48 49 49 50 50 50 50 49 49 49
965D9%%j%%j%j%%%%%j%%%%%%%%jJjJ%%%%%%%%j%%%%J%%j%%%%%%J%%%%%%j%%%%%%%%%%%%%%
$$ 49 49 49 48 48 48 47 47 46 46 46 46 46 46 45 45 45 45 45 45 45 45 45 44 45 44 45 45 45 45 45 45 45 45 45 44 44 44 44 44 45 45 45 44 44 44 44 44 44 44 45 45 45 45 45 45 45 44 44 44 44 44 44 44 44 44 44 44 44 44 44 44
958D4%%%%%%%%%%%%%%%%jJj%%%%%%%%%%%%%%%J%%%%%%%%%%%j%%%%%J%%%%%%%j%J%%%%%%%%
$$ 44 44 44 44 44 44 44 44 44 44 44 44 44 44 44 44 44 43 44 43 43 43 43 43 43 43 43 43 43 43 43 43 43 43 43 44 44 44 44 44 44 44 44 44 44 44 44 43 43 43 43 43 43 44 44 44 44 44 44 44 44 43 43 44 44 44 44 44 44 44 44 44
950D4%%%%%%%%%j%%%J%%%%%%%%%j%%%%J%%%%%%%j%%%J%j%%%%%%%%%%%%%%%%%%%%%J%%%j%%
$$ 44 44 44 44 44 44 44 44 44 44 43 43 43 43 44 44 44 44 44 44 44 44 44 44 43 43 43 43 43 44 44 44 44 44 44 44 44 43 43 43 43 44 44 43 43 43 43 43 43 43 43 43 43 43 43 43 43 43 43 43 43 43 43 43 43 44 44 44 44 43 43 43
943D3%J%%%j%%%Jj%%Jj%%%%%%%%%%%J%%%%%%%%%%%%%jJ%%%%j%%%%%%%%Jj%%%%%%%%%%%J%%
$$ 43 43 44 44 44 44 43 43 43 43 44 43 43 43 44 43 43 43 43 43 43 43 43 43 43 43 43 44 44 44 44 44 44 44 44 44 44 44 44 44 44 43 44 44 44 44 44 43 43 43 43 43 43 43 43 43 44 43 43 43 43 43 43 43 43 43 43 43 43 44 44 44
935D4%%%%%%%%%%%%j%%J%%%%%%j%%%%%jJ%%%%%%%%J%J%j%%%%%%j%%%%%%%%%%%%J%%j%%J%%
$$ 44 44 44 44 44 44 44 44 44 44 44 44 44 43 43 43 44 44 44 44 44 44 44 43 43 43 43 43 43 42 43 43 43 43 43 43 43 43 43 44 44 45 45 44 44 44 44 44 44 44 43 43 43 43 43 43 43 43 43 43 43 43 43 44 44 44 43 43 43 44 44 44
928D4%Jj%%%%j%%%%J%%%%%j%%%%%%%%%%%%%J%%j%%%%%%%%%%%%J%j%j%%J%%%%%%%%%%%%%%%
$$ 44 44 45 44 44 44 44 44 43 43 43 43 43 44 44 44 44 44 44 43 43 43 43 43 43 43 43 43 43 43 43 43 43 44 44 44 43 43 43 43 43 43 43 43 43 43 43 43 43 44 44 43 43 42 42 42 43 43 43 43 43 43 43 43 43 43 43 43 43 43 43 43
920D3%jJ%%%J%%j%%%%%%%%%%%%%%%%%%%%%%%%%%J%%%%j%%J%J%j%%%%%%%%%jJ%%%j%%J%%%%
$$ 43 43 42 43 43 43 43 44 44 44 43 43 43 43 43 43 43 43 43 43 43 43 43 43 43 43 43 43 43 43 43 43 43 43 43 43 43 44 44 44 44 44 43 43 43 44 44 45 45 44 44 44 44 44 44 44 44 44 44 43 44 44 44 44 43 43 43 44 44 44 44 44
913D4%%%%%%jj%%J%%%%%J%jJ%%%%%%j%%%%%Jj%%%%%%%J%%%%%%%j%%%%%%%%%%%jJ%%%%%%%%
$$ 44 44 44 44 44 44 44 43 42 42 42 43 43 43 43 43 43 44 44 43 44 44 44 44 44 44 44 43 43 43 43 43 43 44 43 43 43 43 43 43 43 43 44 44 44 44 44 44 44 44 43 43 43 43 43 43 43 43 43 43 43 43 42 43 43 43 43 43 43 43 43 43
905D3%%%%%%%%J%%j%%%%%%jJ%%%jJ%%%%%%%%Jj%%%j%%J%%%%%%%%J%jJ%%%%%%%%%%%%%%%%%
$$ 43 43 43 43 43 43 43 43 43 44 44 44 43 43 43 43 43 43 43 42 43 43 43 43 42 43 43 43 43 43 43 43 43 43 44 43 43 43 43 42 42 42 43 43 43 43 43 43 43 43 43 44 44 43 44 44 44 44 44 44 44 44 44 44 44 44 44 44 44 44 44 44
898D4%%%%%J%%%%%%%%%%j%%%J%%%%%%j%Jj%%%%%%%%j%%%J%%j%J%%j%%J%%%%J%j%%%%%J%%%
$$ 44 44 44 44 44 44 45 45 45 45 45 45 45 45 45 45 45 44 44 44 44 45 45 45 45 45 45 45 44 44 45 44 44 44 44 44 44 44 44 44 43 43 43 43 44 44 44 43 43 44 44 44 43 43 43 44 44 44 44 44 45 45 44 44 44 44 44 44 45 45 45 45
890D5%%%%%j%JJ%%%%%j%%%%%%%%%Jj%j%%%%%J%j%%%%%%j%%J%%%%%%%%%%%%%J%%%%%%%J%%%
$$ 45 45 45 45 45 45 44 44 45 46 46 46 46 46 46 45 45 45 45 45 45 45 45 45 45 46 45 45 44 44 44 44 44 44 45 45 44 44 44 44 44 44 44 43 43 43 44 44 44 44 44 44 44 44 44 44 44 44 44 44 45 45 45 45 45 45 45 45 46 46 46 46
883D6%J%%j%%%%%%%%J%%%%j%%%%jJj%%%%j%%J%%%j%%%%%%%%%%%%%%Jj%J%%%%%J%%%j%J%j%
$$ 46 46 47 47 47 46 46 46 46 46 46 46 46 46 47 47 47 47 47 46 46 46 46 46 45 46 45 45 45 45 45 44 44 44 45 45 45 45 44 44 44 44 44 44 44 44 44 44 44 44 44 44 44 45 44 44 45 45 45 45 45 45 46 46 46 46 45 45 46 46 45 45
875D5%%%%%%%%%J%%j%%%%%j%%%%%J%%%jJ%%%%%j%%%%%%Jj%J%%%%%%%%%%%%j%%J%%%%%%%%%
$$ 45 45 45 45 45 45 45 45 45 45 46 46 46 45 45 45 45 45 45 44 44 44 44 44 44 45 45 45 45 44 45 45 45 45 45 45 44 44 44 44 44 44 44 45 44 44 45 45 45 45 45 45 45 45 45 45 45 45 45 44 44 44 45 45 45 45 45 45 45 45 45 45
867D5j%%%%%%%J%%%%%j%%%%J%%%%%%j%%%%%%%%%J%%%J%%%j%%%jJ%%J%Jj%%%%%%%%jJ%%%%%
$$ 45 44 44 44 44 44 44 44 44 45 45 45 45 45 45 44 44 44 44 44 45 45 45 45 45 45 45 44 44 44 44 44 44 44 44 44 44 45 45 45 45 46 46 46 46 45 45 45 45 44 45 45 45 46 46 47 46 46 46 46 46 46 46 46 46 45 46 46 46 46 46 46
860D6%J%%%%%%%j%%J%%%%%%J%%%%%%J%%%%%%%%j%J%%%jJ%%%%%j%%%%%%%%%%%%%j%%%%%%%%
$$ 46 46 47 47 47 47 47 47 47 47 46 46 46 47 47 47 47 47 47 47 48 48 48 48 48 48 48 49 49 49 49 49 49 49 49 49 48 48 49 49 49 49 48 49 49 49 49 49 49 48 48 48 48 48 48 48 48 48 48 48 48 48 48 47 47 47 47 47 47 47 47 47
852D7%%Jj%%j%%J%%%j%%%j%%%%%%%%%%%%%%j%%%%%%%J%%%%%Jj%%%%j%%%J%%%%%%%%%%%%%%
$$ 47 47 47 48 47 47 47 46 46 46 47 47 47 47 46 46 46 46 45 45 45 45 45 45 45 45 45 45 45 45 45 45 45 44 44 44 44 44 44 44 44 45 45 45 45 45 45 46 45 45 45 45 45 44 44 44 44 45 45 45 45 45 45 45 45 45 45 45 45 45 45 45
845D5%%%%%%%j%%%%%J%%j%%%%%%%%%%%%%%%%%%%%j%%%J%%%%%%%%%%%%%%j%%%J%%Jj%%%%j%
$$ 45 45 45 45 45 45 45 45 44 44 44 44 44 44 45 45 45 44 44 44 44 44 44 44 44 44 44 44 44 44 44 44 44 44 44 44 44 44 43 43 43 43 44 44 44 44 44 44 44 44 44 44 44 44 44 44 44 43 43 43 43 44 44 44 45 44 44 44 44 44 43 43
837D3%%%%%%J%%%%%%%%%%j%%J%%%%%%%j%jJ%%%%%%%%%jJ%%%%%%%%%%%%J%%j%J%%%%j%%%%%
$$ 43 43 43 43 43 43 43 44 44 44 44 44 44 44 44 44 44 44 43 43 43 44 44 44 44 44 44 44 44 43 43 42 43 43 43 43 43 43 43 43 43 43 42 43 43 43 43 43 43 43 43 43 43 43 43 43 44 44 44 43 43 44 44 44 44 44 43 43 43 43 43 43
830D3%%J%%%%%%%%j%Jj%%%%J%j%%J%%%%%%%j%%%%%%%%%%%j%%%%J%%%%%J%%%j%J%%%j%%%%%
$$ 43 43 43 44 44 44 44 44 44 44 44 44 43 43 44 43 43 43 43 43 44 44 43 43 43 44 44 44 44 44 44 44 44 43 43 43 43 43 43 43 43 43 43 43 43 42 42 42 42 42 43 43 43 43 43 43 44 44 44 44 43 43 44 44 44 44 43 43 43 43 43 43
822D3%%%%%%%%%J%%%%j%%%%%%%J%%%%%%j%%%%%%Jj%%J%%%jJ%j%J%%j%j%J%Jj%%%%%%jJ%%%
$$ 43 43 43 43 43 43 43 43 43 43 44 44 44 44 44 43 43 43 43 43 43 43 43 44 44 44 44 44 44 44 43 43 43 43 43 43 43 44 43 43 43 44 44 44 44 43 44 44 43 43 44 44 44 43 43 42 42 43 43 44 43 43 43 43 43 43 43 42 43 43 43 43
815D3%%%%%%%jJ%%J%j%%%J%%j%%%j%J%%j%J%J%Jj%%j%%%%%J%%%j%J%%%%%%%j%%%%%%%J%j%
$$ 43 43 43 43 43 43 43 43 42 43 43 43 44 44 43 43 43 43 44 44 44 43 43 43 43 42 42 43 43 43 42 42 43 43 44 44 45 44 44 44 43 43 43 43 43 43 44 44 44 44 43 43 44 44 44 44 44 44 44 44 43 43 43 43 43 43 43 43 44 44 43 43
807D3%%%%%%%%J%%%%%%%%%%%%%%%%%%%%%%%%%%%%%%%%%%%%%%%jJj%%%%J%%%%%%%%%%%%%%%
$$ 43 43 43 43 43 43 43 43 43 44 44 44 44 44 44 44 44 44 44 44 44 44 44 44 44 44 44 44 44 44 44 44 44 44 44 44 44 44 44 44 44 44 44 44 44 44 44 44 44 43 44 43 43 43 43 43 44 44 44 44 44 44 44 44 44 44 44 44 44 44 44 44
800D4%%%%%J%%%%%%%%%J%%J%J%%JJ%JJJJJJJ%JJJJJJJJ%JJJ%%%%%%j%%%%%jj%jjjjjjjjjj
$$ 44 44 44 44 44 44 45 45 45 45 45 45 45 45 45 45 46 46 46 47 47 48 48 48 49 50 50 51 52 53 54 55 56 57 57 58 59 60 61 62 63 64 65 65 66 67 68 68 68 68 68 68 68 67 67 67 67 67 67 66 65 65 64 63 62 61 60 59 58 57 56 55
792E5jjjj%jjj%j%%j%%%j%%%%%j%%%j%%%jJ%%%%%%%%%%%%%%J%%%%%%%%j%J%%%%%%%%%%%%%
$$ 55 54 53 52 51 51 50 49 48 48 47 47 47 46 46 46 46 45 45 45 45 45 45 44 44 44 44 43 43 43 43 42 43 43 43 43 43 43 43 43 43 43 43 43 43 43 43 44 44 44 44 44 44 44 44 44 43 43 44 44 44 44 44 44 44 44 44 44 44 44 44 44
785D4%%%J%%%%%%%j%%%%%%%%j%%%%%Jj%J%%jJ%%%%%%j%%%%%%%%%%%%%J%j%%%%%%%j%%%%%%
$$ 44 44 44 44 45 45 45 45 45 45 45 45 44 44 44 44 44 44 44 44 44 43 43 43 43 43 43 44 43 43 44 44 44 43 44 44 44 44 44 44 44 43 43 43 43 43 43 43 43 43 43 43 43 43 43 44 44 43 43 43 43 43 43 43 43 42 42 42 42 42 42 42
777D2J%%%%%%%%%%%%%%%%j%J%%%%%%%%%%%%%%j%%%%%J%%J%j%%j%%%%%J%%%%%%%%Jj%%%%%%
$$ 42 43 43 43 43 43 43 43 43 43 43 43 43 43 43 43 43 43 42 42 43 43 43 43 43 43 43 43 43 43 43 43 43 43 43 42 42 42 42 42 42 43 43 43 44 44 43 43 43 42 42 42 42 42 42 43 43 43 43 43 43 43 43 43 44 43 43 43 43 43 43 43
770D3%%%%%%%%%j%%%%%%J%%%%%j%%%%%%%%%%%J%%J%j%%%%%jJ%%%%%Jj%J%%%%%J%j%J%j%%%
$$ 43 43 43 43 43 43 43 43 43 43 42 42 42 42 42 42 42 43 43 43 43 43 43 42 42 42 42 42 42 42 42 42 42 42 42 43 43 43 44 44 43 43 43 43 43 43 42 43 43 43 43 43 43 44 43 43 44 44 44 44 44 44 45 45 44 44 45 45 44 44 44 44
762D4%%%jJ%%%%%%%j%J%%j%%%%%%%J%j%%%%j%%J%%%%%%%J%%%%%%%%%%%%%J%%%%%%%%J%j%%
$$ 44 44 44 44 43 44 44 44 44 44 44 44 44 43 43 44 44 44 43 43 43 43 43 43 43 43 44 44 43 43 43 43 43 42 42 42 43 43 43 43 43 43 43 43 44 44 44 44 44 44 44 44 44 44 44 44 44 44 45 45 45 45 45 45 45 45 45 46 46 45 45 45
755D5j%%%%%J%j%%%j%%%j%%%J%%%%%j%%J%%j%%%%%%%%J%%%%%%%%%%%%%%%J%%%%%%%%%%%%%
$$ 45 44 44 44 44 44 44 45 45 44 44 44 44 43 43 43 43 42 42 42 42 43 43 43 43 43 43 42 42 42 43 43 43 42 42 42 42 42 42 42 42 42 43 43 43 43 43 43 43 43 43 43 43 43 43 43 43 43 44 44 44 44 44 44 44 44 44 44 44 44 44 44
747D4%%%%%j%%%%%%%%%%%%%%j%%%%%%%%J%%%j%%%%J%%%%%%%%%%%%j%%%%%%%%%%%J%%%%%%%
$$ 44 44 44 44 44 44 43 43 43 43 43 43 43 43 43 43 43 43 43 43 43 42 42 42 42 42 42 42 42 42 43 43 43 43 42 42 42 42 42 43 43 43 43 43 43 43 43 43 43 43 43 43 42 42 42 42 42 42 42 42 42 42 42 42 43 43 43 43 43 43 43 43
740D3%j%%%%J%j%%%J%%jJ%%%%%%%%%%j%%J%%%%%%%%j%%%J%%%jJ%%%%%%Jj%%j%%%%%%%%J%%
$$ 43 43 42 42 42 42 42 43 43 42 42 42 42 43 43 43 42 43 43 43 43 43 43 43 43 43 43 43 42 42 42 43 43 43 43 43 43 43 43 43 42 42 42 42 43 43 43 43 42 43 43 43 43 43 43 43 44 43 43 43 42 42 42 42 42 42 42 42 42 43 43 43
732D3%%%%jJ%%%%%%%%%j%%JJ%j%j%J%%j%%%%%%%%%%%J%%%%%%%%%j%%%J%%j%%%%J%%j%%%J%
$$ 43 43 43 43 43 42 43 43 43 43 43 43 43 43 43 43 42 42 42 43 44 44 43 43 42 42 43 43 43 42 42 42 42 42 42 42 42 42 42 42 42 43 43 43 43 43 43 43 43 43 43 42 42 42 42 43 43 43 42 42 42 42 42 43 43 43 42 42 42 42 43 43
725D3%j%%%J%%%%%%%%%%%%%%%%%j%%%%%%%J%%j%%%%%%%J%%%%j%%%%%%%%%%%%%%%%%%%%%%%
$$ 43 43 42 42 42 42 43 43 43 43 43 43 43 43 43 43 43 43 43 43 43 43 43 43 42 42 42 42 42 42 42 42 43 43 43 42 42 42 42 42 42 42 42 43 43 43 43 43 42 42 42 42 42 42 42 42 42 42 42 42 42 42 42 42 42 42 42 42 42 42 42 42
717D2%%%%j%%JJj%Jj%%%%J%j%%%%%%%%%%%%%%%%J%%%jJ%%j%%%J%%%%j%%%%%j%%J%%%%%%%%
$$ 42 42 42 42 42 41 41 41 42 43 42 42 43 42 42 42 42 42 43 43 42 42 42 42 42 42 42 42 42 42 42 42 42 42 42 42 42 43 43 43 43 42 43 43 43 42 42 42 42 43 43 43 43 43 42 42 42 42 42 42 41 41 41 42 42 42 42 42 42 42 42 42
710D2%%Jj%%%%%%J%%%j%%%jJ%%%%%%%%%%%%%%%jJ%%%Jj%%%%%%%%%%%%%%%%%%%%%%%%%%%%%
$$ 42 42 42 43 42 42 42 42 42 42 42 43 43 43 43 42 42 42 42 41 42 42 42 42 42 42 42 42 42 42 42 42 42 42 42 42 41 42 42 42 42 43 42 42 42 42 42 42 42 42 42 42 42 42 42 42 42 42 42 42 42 42 42 42 42 42 42 42 42 42 42 42
702D2%%%%%%%%%%%J%%%J%%%%%j%%%j%J%%%%J%j%%%%%j%%%%%%%%%%%%%J%Jj%%j%%%%%%%%%J
$$ 42 42 42 42 42 42 42 42 42 42 42 42 43 43 43 43 44 44 44 44 44 44 43 43 43 43 42 42 43 43 43 43 43 44 44 43 43 43 43 43 43 42 42 42 42 42 42 42 42 42 42 42 42 42 42 43 43 44 43 43 43 42 42 42 42 42 42 42 42 42 42 43
694D3%%%%%%%%%%%%%%J%J%%%%%j%%%jJ%%%j%%%%%%j%J%%%J%%%j%%%%%j%%%J%j%%Jj%%J%%%
$$ 43 43 43 43 43 43 43 43 43 43 43 43 43 43 43 44 44 45 45 45 45 45 45 44 44 44 44 43 44 44 44 44 43 43 43 43 43 43 43 42 42 43 43 43 43 44 44 44 44 43 43 43 43 43 43 42 42 42 42 43 43 42 42 42 43 42 42 42 43 43 43 43
687D3Jj%%%%%%%%%%%%%j%J%%%%%%%%%%%%%%%%%%%%j%%J%%%%j%%%%%%%%%%%J%j%Jj%%%J%%%
$$ 43 44 43 43 43 43 43 43 43 43 43 43 43 43 43 43 42 42 43 43 43 43 43 43 43 43 43 43 43 43 43 43 43 43 43 43 43 43 43 42 42 42 43 43 43 43 43 42 42 42 42 42 42 42 42 42 42 42 42 43 43 42 42 43 42 42 42 42 43 43 43 43
679D3%j%%%%%%%%%%J%%%%%j%J%%%%%%%%%j%%%%%%%%%%%%%%%%%%%%%%%%%%%%%Jj%%%%%%%%%
$$ 43 43 42 42 42 42 42 42 42 42 42 42 42 43 43 43 43 43 43 42 42 43 43 43 43 43 43 43 43 43 43 42 42 42 42 42 42 42 42 42 42 42 42 42 42 42 42 42 42 42 42 42 42 42 42 42 42 42 42 42 42 43 42 42 42 42 42 42 42 42 42 42
672D2%%%%%%jJ%%%%%%%%%%J%%j%%%%%%%%j%J%%%%%jJ%%%%%%%%%%J%%%%%j%%%j%%J%%%%%%%
$$ 42 42 42 42 42 42 42 41 42 42 42 42 42 42 42 42 42 42 42 43 43 43 42 42 42 42 42 42 42 42 42 41 41 42 42 42 42 42 42 41 42 42 42 42 42 42 42 42 42 42 42 43 43 43 43 43 43 42 42 42 42 41 41 41 42 42 42 42 42 42 42 42
664D2%%%%%J%%%%%%j%%%%%%%%%%%%%%%%j%%J%%%%%%%%%%%%%j%J%%%%%%%%%%%%%%%%j%%%Jj
$$ 42 42 42 42 42 42 43 43 43 43 43 43 43 42 42 42 42 42 42 42 42 42 42 42 42 42 42 42 42 42 41 41 41 42 42 42 42 42 42 42 42 42 42 42 42 42 42 41 41 42 42 42 42 42 42 42 42 42 42 42 42 42 42 42 42 42 41 41 41 41 42 41
657D1%%%J%%%%%J%%%%j%%%%j%J%%%%%%%%jJ%%%%%%%%%%jJ%%%%%%j%%%%%%%J%%%%%%%%%%%%
$$ 41 41 41 41 42 42 42 42 42 42 43 43 43 43 43 42 42 42 42 42 41 41 42 42 42 42 42 42 42 42 42 41 42 42 42 42 42 42 42 42 42 42 42 41 42 42 42 42 42 42 42 41 41 41 41 41 41 41 41 42 42 42 42 42 42 42 42 42 42 42 42 42
649D2%%%%%%%%%%%jJ%%Jj%%%J%j%jJ%%%%%J%jJ%%%%j%%%%%%%%J%%%%%j%%%%%%%%%%%%%%J%
$$ 42 42 42 42 42 42 42 42 42 42 42 42 41 42 42 42 43 42 42 42 42 43 43 42 42 41 42 42 42 42 42 42 43 43 42 43 43 43 43 43 42 42 42 42 42 42 42 42 42 43 43 43 43 43 43 42 42 42 42 42 42 42 42 42 42 42 42 42 42 42 43 43
642D3%%%%%%jJ%%jJ%%%j%%%%%%%%%Jj%%%%%%%%%%%%%j%%J%%%%%%%%%%%%%%%%%%j%%%%%%%J
$$ 43 43 43 43 43 43 43 42 43 43 43 42 43 43 43 43 42 42 42 42 42 42 42 42 42 42 43 42 42 42 42 42 42 42 42 42 42 42 42 42 42 41 41 41 42 42 42 42 42 42 42 42 42 42 42 42 42 42 42 42 42 42 42 41 41 41 41 41 41 41 41 42
634D2%%%%%%%%%%%%%%%%%%%%%%J%%j%Jj%j%%J%%%%%%%J%j%%%%%%%%Jj%%%%%%%%J%%j%%%jJ
$$ 42 42 42 42 42 42 42 42 42 42 42 42 42 42 42 42 42 42 42 42 42 42 42 43 43 43 42 42 43 42 42 41 41 41 42 42 42 42 42 42 42 42 43 43 42 42 42 42 42 42 42 42 42 43 42 42 42 42 42 42 42 42 42 43 43 43 42 42 42 42 41 42
$$ [...]
-2632D9
##END=		$$ NMR SPECTRUM
##END=		$$ LINK
