##TITLE=	RP230 characterise.10.fid
##JCAMP-DX=	6.0	$$ MestReNova 14.3.3-33362
##DATA TYPE=	LINK
##BLOCKS=	1    
##ORIGIN=	Mestrelab Research S.L.
##OWNER=	hrzepa
##$MNOVA/METADATA=	(DOCUMENT,BASE64)
eyJuYW1lIjoiL1VzZXJzL2hyemVwYS9MaWJyYXJ5L01vYmlsZSBEb2N1bWVudHMvY29tfmFwcGxlfkN
sb3VkRG9jcy9TaGVwcGFyZC9OTVIgZmlsZXMgemlwcy0yLzcvNy1ILm1ub3ZhIiwicGFnZXMiOlt7Im
l0ZW1zIjpbIjEiICAgICBdfV19
##TITLE=	RP230 characterise.10.fid
##JCAMP-DX=	6.0	$$ MestReNova 14.3.3-33362
##DATA TYPE=	NMR SPECTRUM
##DATA CLASS=	XYDATA
##BLOCK_ID=	1
##ORIGIN=	Bruker BioSpin GmbH
##OWNER=	nmrsu
##NUMDIM=	1
##$MNOVA/METADATA=	(ITEM,BASE64)
eyJhbmdsZSI6MCwiYXhlcyI6eyJ4Ijp7Im1heCI6MTYuMDcyNjkwMDAwMDI3NTksIm1pbiI6LTMuNzU
4NTEyNTA2MjQyNTEzfSwieSI6eyJtYXgiOjM3MjY5LjQyMjM2MzI4MTI1LCJtaW4iOi0zMzAwLjgxND
QxNDk3ODAyNzN9fSwicG9pbnRzIjpbeyJ4Ijo1MzIxLCJ5Ijo1ODM1fSx7IngiOjg3MjIsInkiOjU4M
zV9LHsieCI6ODcyMiwieSI6ODIwOH0seyJ4Ijo1MzIxLCJ5Ijo4MjA4fSx7IngiOjUzMjEsInkiOjU4
MzV9XSwieiI6MH0=
##.OBSERVE FREQUENCY=	700.35432466099996418
##.OBSERVE NUCLEUS=	^1H
##.SOLVENT NAME=	DMSO
##.PULSE SEQUENCE=	zg30
##LONGDATE=	2023/02/08 19:10:11.000
##.ACQUISITIONMODE=	SIMULTANEOUS (DQD)
##$ORIGINAL FORMAT=	Bruker XWIN-NMR
##$MNOVA/SCALES_VERSION=	9
##$PARAMETER FILE=	(acqus, ASCII, /private/var/folders/f6/rjf_tdyn2v98c5c0wvkgn4s80000gq/T/2ltz5rNDQHC6Sqevou4YBg/10/acqus, 0)
$$ ##TITLE= Parameter file, TopSpin 4.1.3
$$ ##JCAMPDX= 5.0
$$ ##DATATYPE= Parameter Values
$$ ##NPOINTS= 1	$$ modification sequence number
$$ ##ORIGIN= Bruker BioSpin GmbH
$$ ##OWNER= nmrsu
$$ $$ 2023-02-08 19:10:08.533 +0000  nmrsu@CZC7167VR1
$$ $$ Z:/700/data/tds/nmr/RP230 characterise/10/acqus
$$ $$ process C:\Bruker\TopSpin4.1.3\prog\mod\dirdata.exe
$$ ##$ACQT0= -2.0981556054023
$$ ##$AMP= (0..31)
$$ 100 100 100 100 100 100 100 100 100 100 100 100 100 100 100 100 100 100
$$ 100 100 100 100 100 100 100 100 100 100 100 100 100 100
$$ ##$AMPCOIL= (0..32)
$$ -1 0 0 0 0 0 0 0 0 0 0 0 0 0 0 0 0 0 0 0 0 0 0 0 0 0 0 0 0 0 0 0 0
$$ ##$AQSEQ= 0
$$ ##$AQ_mod= 3
$$ ##$AUNM= <au_zg>
$$ ##$AUTOPOS= <32 >
$$ ##$BF1= 700.349999998
$$ ##$BF2= 700.349999998
$$ ##$BF3= 700.349999998
$$ ##$BF4= 700.349999998
$$ ##$BF5= 700.349999998
$$ ##$BF6= 700.349999998
$$ ##$BF7= 700.349999998
$$ ##$BF8= 700.349999998
$$ ##$BWFAC= (0..63)
$$ 0 0 0 0 0 0 0 0 0 0 0 0 0 0 0 0 0 0 0 0 0 0 0 0 0 0 0 0 0 0 0 0 0 0 0 0
$$ 0 0 0 0 0 0 0 0 0 0 0 0 0 0 0 0 0 0 0 0 0 0 0 0 0 0 0 0
$$ ##$BYTORDA= 0
$$ ##$CHANFCU= (0..24)
$$ 0 1 0 0 0 0 0 0 0 0 0 0 0 0 0 0 0 0 0 0 0 0 0 0 0
$$ ##$CHANREC= (0..24)
$$ 0 0 0 0 0 0 0 0 0 0 0 0 0 0 0 0 0 0 0 0 0 0 0 0 0
$$ ##$CHEMSTR= <none>
$$ ##$CNST= (0..63)
$$ 1 1 1 1 1 1 1 1 1 1 1 1 1 1 1 1 1 1 1 1 1 1 1 1 1 1 1 1 1 1 1 1 1 1 1 1
$$ 1 1 1 1 1 1 1 1 1 1 1 1 1 1 1 1 1 1 1 1 1 1 1 1 1 1 1 1
$$ ##$CPDPRG= (0..8)
$$ <> <> <> <> <> <> <> <> <>
$$ ##$D= (0..63)
$$ 0 1 0 0 0 0 0 0 0 0 0 0 0 0 0 0 0.0002 0 0 0 0 0 0 0 0 0 0 0 0 0 0 0 0
$$ 0 0 0 0 0 0 0 0 0 0 0 0 0 0 0 0 0 0 0 0 0 0 0 0 0 0 0 0 0 0 0
$$ ##$DATE= 1675883411
$$ ##$DATE_START= 1675883368
$$ [...]
$$ ##$ShimPowRng3= (0..63)
$$ 1 1 1 1 1 1 1 1 1 1 1 1 1 1 1 1 1 1 1 1 1 1 1 1 1 1 1 1 1 1 1 1 1 1 1 1
$$ 1 1 1 1 0 0 0 0 0 0 0 0 0 0 0 0 0 0 0 0 0 0 0 0 0 0 0 0
$$ ##$ShimPowType1= 8
$$ ##$ShimPowType2= 8
$$ ##$ShimPowType3= 0
$$ ##$ShimPowType4= 0
$$ ##$ShimPowType5= 0
$$ ##$ShimPowType6= 0
$$ ##$ShimPowType7= 0
$$ ##$ShimPowType8= 0
$$ ##$ShimSysActGrad= (0..63)
$$ 1 2 3 4 13 5 7 11 10 9 6 8 12 18 19 20 21 15 22 23 24 14 25 16 26 17 27
$$ 28 31 32 33 34 35 36 37 38 0 0 0 0 0 0 0 0 0 0 0 0 0 0 0 0 0 0 0 0 0 0
$$ 0 0 0 0 0 0
$$ ##$ShimSysAngle= <>
$$ ##$ShimSysFunc= (0..63)
$$ 1 2 3 4 5 6 7 8 9 10 0 37 38 35 16 15 14 13 12 11 28 27 26 25 24 23 36
$$ 22 30 29 20 21 34 33 32 31 17 18 19 0 0 0 0 0 0 0 0 0 0 0 0 0 0 0 0 0 0
$$ 0 0 0 0 0 0 0
$$ ##$ShimSysMatId= <292722da.dat>
$$ ##$ShimSysMatrix= 1
$$ ##$ShimSysMinMaxUG= 130000
$$ ##$ShimSysOffset= <29 mm>
$$ ##$ShimSysType= 4
$$ ##$ShimUnit= 3
$$ ##$SpectrOsVersion= <4.1.156.20210628>
$$ ##$TCubeEth= <192.168.180.38>
$$ ##$TCubeSeqDevice= <>
$$ ##$TOSITY= <no>
$$ ##$TRIPLO2= 0
$$ ##$TopSpinVersion= <TopSpin 4.1.3>
$$ ##$TrxFreqFormula= (0..23)
$$ <TrxFreqFormula(2.0,700350000.000000,'TRX',Trx(1.0,'TRX 1200.1',1,5.000000,1290.000000))>
$$ <TrxFreqFormula(2.0,700350000.000000,'TRX',Trx(1.0,'TRX 1200.2',1,5.000000,1290.000000))>
$$ <TrxFreqFormula(2.0,700350000.000000,'TRX',Trx(1.0,'TRX 1200.3',1,5.000000,1290.000000))>
$$ <> <> <> <> <> <> <> <> <> <> <> <> <> <> <> <> <> <> <> <> <>
$$ ##$TrxPN= (0..23)
$$ <Z148391> <Z148391> <Z148391> <> <> <> <> <> <> <> <> <> <> <> <> <> <>
$$ <> <> <> <> <> <> <>
$$ ##$TrxSN= (0..23)
$$ <00336> <00337> <00342> <> <> <> <> <> <> <> <> <> <> <> <> <> <> <> <>
$$ <> <> <> <> <>
$$ ##$VCubeEth= (0..23)
$$ <no> <no> <no> <no> <no> <no> <no> <no> <no> <no> <no> <no> <no> <no> <no>
$$ <no> <no> <no> <no> <no> <no> <no> <no> <no>
$$ ##$VTU= 2
$$ ##$VTUETH= <192.168.99.11>
$$ ##$VTUTY= <no>
$$ ##$ValueLine= no
$$ ##$VpuPN= (0..23)
$$ <no> <no> <no> <no> <no> <no> <no> <no> <no> <no> <no> <no> <no> <no> <no>
$$ <no> <no> <no> <no> <no> <no> <no> <no> <no>
$$ ##$VpuSN= (0..23)
$$ <no> <no> <no> <no> <no> <no> <no> <no> <no> <no> <no> <no> <no> <no> <no>
$$ <no> <no> <no> <no> <no> <no> <no> <no> <no>
$$ ##$WBREFAM= (0..31)
$$ 99.8 100 100 100 100 100 100 100 100 100 100 100 100 100 100 100 100 100
$$ 100 100 100 100 100 100 100 100 100 100 100 100 100 100
$$ ##$WBREFLM= (0..31)
$$ 1 0 1 0 0 0 0 0 0 0 0 0 0 0 0 0 0 0 0 0 0 0 0 0 0 0 0 0 0 0 0 0
$$ ##$WBREFPH= (0..31)
$$ 0.05 0 0 0 0 0 0 0 0 0 0 0 0 0 0 0 0 0 0 0 0 0 0 0 0 0 0 0 0 0 0 0
$$ ##$WBSGU= (0..31)
$$ 1 2 4 0 0 0 0 0 0 0 0 0 0 0 0 0 0 0 0 0 0 0 0 0 0 0 0 0 0 0 0 0
$$ ##END=
$$ 
##$DECIM=	1440
##$DSPFVS=	21
##XUNITS=	HZ
##YUNITS=	ARBITRARY UNITS
##FIRSTX=	11256.508643983790535
##LASTX=	-2632.2742810921758974
##DELTAX=	-0.1059638129340278595
##XFACTOR=	1
##YFACTOR=	1.0340107329783012613
##FIRSTY=	119.462860107421875
##MINY=	87.29181671142578125
##MAXY=	33881.4296875
##NPOINTS=	131072
##XYDATA=	(X++(Y..Y))
$$ [...]
3252A47j%%j%%J%%%%%%jjJ%J%%%J%%jJ%j%%%%%%%%j%jJJ%jj%%%J%J%%%J%jj%%%jJJ%j%J%%
3245A46%%%%%%%%%%%%%%%%%%%J%j%j%J%%Jj%%j%JJ%%j%J%j%%J%j%%%J%J%jj%j%%%J%%%jjj
3238A43jJ%%%J%J%JJ%%%%%%%J%%jJ%%%J%%%jj%J%jjj%%JJ%j%%J%J%%%%%%jkjJJJ%Jjjj%%%
3230A45%J%jj%JJJJ%%%%j%%J%%%%J%%j%%%%%%KJj%%j%%%j%j%jKJ%%%%%%%%%%J%%%%%%%%%%
3223A50J%%j%%J%%%%JJ%J%%j%JJ%JJ%%JJJJK%JJJKKKJKJKKMLMMLMMMOOLMMNNMKK%%%jklmn
3216B36nnnnmmlllllmkkkkjj%jjj%%JJJJJJKKJKKLLMMNLMLNNNMMLLKKJ%jklmnmnnnmnnnnn
3208A91mllklkkjkkkkj%jk%JjjjjkjJ%%j%jjj%j%%%J%%%j%JJ%%jj%j%j%%%%jj%%%%%%JJj%
3201A46jj%j%%%%kj%j%%%%%J%JJ%J%KKKKKJJ%KKJJ%JJ%%%%J%%%j%jJ%%%j%%kkj%%jj%%jjj
$$ y = [147, 146, 146, 146, 145, 145, 145, 146, 146, 146, 146, 146, 146, 146, 145, 144, 145, 145, 146, 146, 146, 146, 147, 147, 147, 146, 147, 147, 146, 146, 146, 146, 146, 146, 146, 146, 146, 145, 145, 144, 145, 146, 146, 145, 144, 144, 144, 144, 145, 145, 146, 146, 146, 146, 147, 147, 146, 145, 145, 145, 145, 144, 145, 146, 146, 145, 145, 146, 146, 146, 146, 146, 146, 146, 146, 146, 146, 146, 146, 146, 146, 146, 146, 146, 146, 146, 146, 146, 146, 147, 147, 146, 146, 145, 145, 146, 146, 146, 147, 146, 146, 146, 145, 145, 146, 147, 147, 147, 146, 146, 147, 147, 146, 146, 146, 147, 147, 146, 146, 146, 146, 147, 147, 148, 148, 147, 146, 146, 145, 145, 145, 145, 146, 146, 146, 146, 145, 144, 143, 142, 143, 143, 143, 143, 144, 144, 145, 145, 146, 147, 147, 147, 147, 147, 147, 147, 147, 148, 148, 148, 147, 148, 148, 148, 148, 149, 149, 149, 149, 148, 147, 147, 148, 148, 147, 146, 145, 145, 145, 146, 147, 147, 146, 146, 146, 147, 147, 148, 148, 148, 148, 148, 148, 148, 147, 145, 144, 145, 146, 147, 147, 148, 147, 146, 145, 145, 145, 145, 145, 146, 146, 145, 144, 144, 145, 146, 147, 148, 148, 148, 148, 148, 147, 147, 147, 148, 148, 148, 148, 148, 149, 149, 149, 148, 148, 148, 148, 148, 148, 148, 150, 151, 150, 150, 150, 149, 149, 149, 149, 148, 148, 147, 147, 146, 148, 149, 149, 149, 149, 149, 149, 149, 149, 149, 149, 149, 150, 150, 150, 150, 150, 150, 150, 150, 150, 150, 150, 151, 151, 151, 150, 150, 150, 151, 151, 151, 151, 151, 152, 153, 153, 154, 154, 154, 153, 153, 154, 155, 155, 156, 157, 157, 157, 158, 159, 160, 161, 163, 163, 164, 165, 166, 168, 170, 172, 173, 175, 176, 178, 180, 184, 187, 191, 195, 198, 202, 206, 210, 216, 222, 225, 229, 233, 238, 243, 247, 249, 251, 251, 251, 251, 250, 248, 245, 241, 236, 231, 226, 221, 216, 212, 208, 205, 202, 199, 196, 193, 189, 187, 185, 183, 181, 180, 179, 179, 178, 177, 176, 176, 176, 177, 178, 179, 180, 181, 182, 184, 186, 187, 189, 191, 194, 197, 201, 205, 210, 213, 217, 220, 225, 230, 235, 239, 243, 246, 249, 251, 253, 254, 254, 253, 251, 248, 244, 239, 235, 230, 225, 220, 216, 211, 206, 201, 196, 191, 187, 184, 181, 179, 176, 174, 172, 171, 169, 167, 165, 163, 162, 162, 161, 159, 159, 160, 159, 158, 157, 156, 154, 153, 154, 154, 154, 153, 153, 152, 151, 150, 150, 149, 149, 149, 149, 150, 150, 150, 150, 149, 149, 150, 151, 151, 151, 150, 149, 149, 148, 148, 147, 147, 147, 147, 147, 146, 145, 145, 145, 145, 145, 145, 145, 146, 147, 146, 146, 145, 144, 144, 143, 143, 143, 143, 143, 141, 140, 140, 139, 139, 139, 139, 139, 139, 140, 140, 141, 142, 142, 143, 143, 145, 147, 149, 151, 153, 154, 155, 155, 157, 159, 160, 161, 161, 162, 163, 163, 163, 163, 163, 164, 164, 164, 164, 163, 163, 162, 163, 163, 163, 163, 162, 162, 162, 160, 158, 157, 157, 157, 156, 155, 155, 155, 154, 153, 152]
3194A52%J%J%%%J%J%J%JK%JKJKJJK%JJ%JJ%J%%j%%%JJjjj%J%%%j%%%j%%j%%j%%%%J%%J%%%
3187A72%%%%%jJ%Jj%%%%%%J%%%j%%%%%%%%%j%%%J%J%j%jjJ%%J%%jj%%%%j%%%%%j%JKj%%J%
3179A71%J%%%j%JJ%J%JJ%K%%j%j%%%%%jj%J%%%j%jJJjjjJjjjkjj%%%j%%kj%jj%jjkjjj%%%
3172A53%%%jKKJKKKLKLJJ%LKKKKJ%%%jjj%j%jj%j%%%%%%%%%%LJK%%%J%J%JJJKKLLLLMMNON
3165B29NMNNNMKJ%kkllmmlkmk%LKLNOQJ0J0J0J0J0J0J0J0J0QQPPPPOOPPOPOPPPPPOOOOQQP
3158E19PPPOPOOMMNMMLMMOPQJ0J2J4J7J8K0K2K3K5K7K8K9L0L1L2L2L3L4L5L6L7L8M1M3M6M9
3154A380N3N6O1O7P2P9Q6R5J02J13J23J36J49J64J81K00K22K46K75L08L49L95M50N15N89O71
3151G137P61Q53R45J035J118J187J235J261J258J221J150J043R04P34N42L33J14j09l25n32
$$ y = [152, 152, 153, 153, 154, 154, 154, 154, 155, 155, 156, 156, 157, 157, 158, 160, 160, 161, 163, 164, 166, 167, 168, 170, 170, 171, 172, 172, 173, 174, 174, 175, 175, 175, 174, 174, 174, 174, 175, 176, 175, 174, 173, 173, 174, 174, 174, 174, 173, 173, 173, 173, 172, 172, 172, 171, 171, 171, 170, 170, 170, 170, 170, 171, 171, 171, 172, 172, 172, 172, 172, 172, 172, 172, 172, 171, 172, 172, 173, 172, 172, 172, 172, 172, 172, 172, 173, 173, 173, 173, 172, 172, 172, 172, 172, 172, 172, 172, 172, 172, 171, 171, 171, 171, 172, 172, 173, 173, 172, 172, 171, 170, 171, 171, 171, 172, 172, 172, 171, 170, 170, 170, 170, 170, 169, 169, 169, 169, 169, 169, 168, 168, 169, 171, 170, 170, 170, 171, 171, 171, 172, 172, 172, 172, 171, 171, 172, 173, 173, 174, 174, 175, 176, 176, 178, 178, 178, 177, 177, 176, 176, 176, 176, 176, 176, 175, 174, 174, 175, 175, 175, 175, 174, 174, 173, 174, 175, 174, 173, 172, 173, 172, 171, 170, 168, 167, 166, 166, 166, 166, 165, 165, 165, 163, 162, 162, 161, 160, 160, 159, 158, 156, 155, 154, 153, 153, 153, 153, 153, 153, 153, 152, 154, 156, 157, 159, 161, 163, 166, 168, 171, 172, 173, 173, 176, 178, 180, 182, 184, 185, 185, 185, 185, 184, 183, 182, 182, 181, 181, 180, 179, 179, 178, 178, 178, 178, 178, 178, 178, 178, 178, 178, 178, 181, 182, 184, 184, 184, 184, 185, 185, 186, 186, 187, 188, 189, 191, 193, 196, 199, 202, 205, 209, 213, 218, 224, 229, 234, 238, 243, 248, 253, 257, 259, 260, 260, 258, 256, 253, 250, 246, 242, 239, 237, 233, 231, 231, 234, 236, 239, 244, 250, 258, 268, 278, 288, 298, 308, 318, 328, 338, 348, 356, 364, 371, 378, 385, 392, 398, 404, 411, 418, 424, 431, 437, 444, 451, 458, 465, 472, 478, 484, 490, 496, 504, 512, 519, 526, 533, 540, 546, 553, 559, 565, 569, 573, 578, 582, 586, 589, 593, 597, 603, 610, 618, 628, 640, 654, 671, 689, 709, 731, 754, 779, 806, 834, 863, 893, 924, 956, 988, 1021, 1055, 1090, 1126, 1163, 1201, 1242, 1285, 1331, 1380, 1433, 1489, 1550, 1617, 1689, 1768, 1854, 1949, 2051, 2164, 2287, 2423, 2572, 2736, 2917, 3117, 3339, 3585, 3860, 4168, 4517, 4912, 5362, 5877, 6466, 7137, 7898, 8751, 9696, 10731, 11849, 13036, 14271, 15532, 16790, 18011, 19161, 20204, 21108, 21842, 22384, 22717, 22831, 22722, 22397, 21865]
3149B1865p15q75j005j102j166j198j201j176j127j061r82q92p99p07o19n36m61l90l28k72
3147E253k24j79j41j05p2m1qK2N3Q5J17J53J93K34K82L36L97M66N43O28P18Q11R05R94J074
3144A2494J141J188J211J207J168J096R88Q47O77M85K74N4j69l88n93p79r39j067j165j229
3142A6501j261j263j237j188j121j041r53q62p73o85o05n31m66m09l59l16k79k50k24k02j83
3140B293j67j52j37j25j15j04r5q7p9p1o4n9n4m9m5m1l6l2l1k8k5k2k1j7j4j4j3j1j1rrrr
3136E38rrj0j1j1j2j2j3j4j4j4j4j2j2j2j1j0j0qppmmmmmlkkjjj%j%jJJ%J%%JJJJKJKKLMN
3130C00MMMNMKJK%kkmmnpppooommlljjJKKKLLKKKJKJJ%j%%kjjkj%j%kjkjjk%jkjkkkkkkkk
3123B40kklkjj%j%jjj%J%%JKKJ%%KJ%J%%%jjjjjkjklkkkkkklkkkkjkj%jjjkjjjj%%jjkjj%
$$ y = [21865, 21150, 20275, 19270, 18168, 17002, 15804, 14603, 13427, 12300, 11239, 10257, 9365, 8566, 7859, 7240, 6704, 6243, 5853, 5525, 5253, 5029, 4850, 4709, 4604, 4532, 4491, 4483, 4505, 4558, 4643, 4760, 4913, 5106, 5340, 5622, 5958, 6355, 6821, 7364, 7992, 8710, 9521, 10426, 11420, 12494, 13635, 14823, 16034, 17241, 18409, 19505, 20493, 21340, 22017, 22502, 22776, 22830, 22661, 22273, 21680, 20901, 19962, 18895, 17730, 16501, 15240, 13977, 12740, 11552, 10431, 9390, 8437, 7575, 6802, 6117, 5512, 4981, 4515, 4106, 3747, 3431, 3152, 2902, 2678, 2476, 2293, 2126, 1974, 1837, 1712, 1597, 1493, 1398, 1311, 1232, 1161, 1097, 1038, 984, 935, 890, 849, 813, 781, 750, 722, 697, 675, 654, 637, 623, 609, 596, 585, 574, 565, 556, 547, 538, 529, 520, 510, 499, 488, 476, 464, 451, 437, 423, 409, 395, 383, 371, 359, 348, 338, 328, 320, 313, 306, 302, 298, 294, 290, 286, 283, 281, 279, 278, 277, 276, 276, 275, 275, 274, 275, 276, 276, 277, 277, 277, 278, 279, 280, 281, 283, 284, 286, 288, 291, 295, 300, 304, 308, 312, 317, 321, 323, 324, 326, 326, 324, 322, 318, 314, 309, 302, 295, 288, 282, 276, 270, 266, 262, 259, 256, 255, 254, 255, 257, 259, 261, 264, 267, 269, 271, 273, 274, 276, 277, 278, 278, 277, 277, 277, 275, 274, 273, 271, 270, 270, 269, 269, 267, 266, 264, 263, 262, 260, 260, 259, 257, 256, 254, 252, 250, 248, 246, 244, 242, 240, 238, 236, 233, 231, 230, 229, 229, 228, 228, 227, 226, 225, 225, 226, 226, 226, 227, 229, 231, 232, 232, 232, 234, 235, 235, 236, 236, 236, 236, 235, 234, 233, 232, 231, 229, 228, 226, 223, 221, 219, 217, 215, 213, 211, 208, 206, 204, 202, 200, 199, 197, 196, 196, 195, 194, 193, 191, 190, 189, 188, 187, 187, 187, 186, 185, 183, 182, 181, 181]
3116A81j%jk%jjj%kj%%j%%jJ%%%%J%%j%%%Jjjk%%%JJ%jjjjj%Jjjjj%%j%%%j%%j%%jJ%%%%k
3109A56j%%j%jj%%%%J%%jj%j%jJJ%%jjJJ%JjJJj%%j%j%j%%j%%%%jj%%j%jjj%%%%jJj%%%%%
3101A41%%%%JKJJ%JJJJJJJKJ%%%JJ%J%%j%jj%%%%j%%%jj%jj%j%jj%jj%%%%Jj%%%J%JJJJKJ
3094A54JJJJJJJKJ%%J%JJ%J%jjjj%jjk%j%%j%%JJ%j%%%%%j%jjjJ%%%j%%%%%%%J%j%%%%j%%
3087A54%%%J%%%%jj%%J%J%%%j%%%JJJ%jJ%J%%%%%J%%JJJ%J%JJJKKKKKKKKMMMLMNNONMNNMM
3079B44LLKJJjjkmlmnnmnnoomlklllljkjjk%%%%j%%J%JJJLLKLKLLLMNNNMNMLMMMKJJJjklm
3072B42mnnnnnnnmnnlmllkkklkkjkjj%jjjj%j%j%%j%%j%%jj%%J%Jj%jkj%JJ%%j%%%%jJ%j%
3065A45%%%%%J%%%%%j%%jj%J%J%%%%jJ%%%J%%%%jJ%%%%%%Jj%jj%%J%%J%j%%%J%jj%%%%%%%
$$ y = [181, 180, 180, 179, 177, 177, 176, 175, 174, 174, 172, 171, 171, 171, 170, 170, 170, 169, 170, 170, 170, 170, 170, 171, 171, 171, 170, 170, 170, 170, 171, 170, 169, 167, 167, 167, 167, 168, 169, 169, 168, 167, 166, 165, 164, 164, 165, 164, 163, 162, 161, 161, 161, 160, 160, 160, 160, 159, 159, 159, 158, 158, 158, 157, 158, 158, 158, 158, 158, 156, 155, 155, 155, 154, 154, 153, 152, 152, 152, 152, 152, 153, 153, 153, 152, 151, 151, 150, 150, 149, 150, 151, 151, 151, 150, 149, 150, 151, 151, 152, 151, 152, 153, 152, 152, 152, 151, 151, 150, 150, 149, 149, 149, 148, 148, 148, 148, 148, 147, 146, 146, 146, 145, 145, 144, 143, 142, 142, 142, 142, 142, 141, 142, 141, 141, 141, 141, 141, 141, 141, 141, 141, 141, 142, 144, 145, 146, 146, 147, 148, 149, 150, 151, 152, 153, 155, 156, 156, 156, 156, 157, 158, 158, 159, 159, 159, 158, 158, 157, 156, 156, 156, 156, 156, 155, 155, 155, 155, 154, 153, 153, 152, 151, 151, 150, 150, 149, 148, 148, 147, 146, 146, 146, 146, 146, 147, 146, 146, 146, 146, 147, 147, 148, 149, 150, 151, 153, 154, 155, 156, 157, 158, 159, 160, 161, 163, 164, 164, 164, 165, 165, 166, 167, 167, 168, 168, 167, 166, 165, 164, 164, 163, 162, 160, 160, 159, 159, 159, 158, 158, 158, 159, 160, 160, 159, 159, 159, 159, 159, 159, 158, 158, 157, 156, 155, 156, 156, 156, 156, 155, 155, 155, 155, 155, 155, 155, 155, 156, 156, 155, 155, 155, 155, 155, 154, 154, 154, 154, 154, 154, 155, 155, 155, 155, 155, 154, 153, 153, 153, 154, 154, 155, 155, 155, 155, 154, 154, 154, 154, 155, 156, 157, 157, 156, 157, 157, 158, 158, 158, 158, 158, 158, 159, 159, 159, 160, 161, 162, 162, 163, 163, 164, 165, 166, 168, 170, 172, 174, 176, 178, 180, 182, 186, 190, 194, 197, 201, 206, 211, 217, 222, 226, 231, 236, 240, 244, 247, 250, 252, 253, 254, 253, 252, 250, 246, 243, 239, 234, 229, 225, 220, 215, 209, 203, 199, 196, 194, 191, 188, 185, 182, 181, 179, 178, 177, 175, 175, 175, 175, 175, 174, 174, 174, 175, 175, 176, 177, 178, 181, 184, 186, 189, 191, 194, 197, 200, 204, 209, 214, 219, 223, 228, 232, 235, 239, 243, 247, 249, 250, 251, 252, 251, 249, 246, 242, 238, 233, 228, 223, 218, 213, 208, 203, 199, 194, 189, 186, 182, 179, 176, 174, 172, 170, 167, 165, 163, 162, 160, 159, 158, 158, 157, 156, 155, 154, 154, 153, 153, 152, 152, 152, 151, 151, 151, 150, 150, 150, 149, 148, 148, 148, 149, 149, 150, 149, 149, 148, 146, 145, 145, 146, 147, 147, 147, 146, 146, 146, 146, 146, 145, 146, 146, 145, 145, 145, 145, 145, 145, 145, 146, 146, 146, 146, 146, 146, 145, 145, 145, 144, 143, 143, 144, 144, 145, 145, 145, 145, 145, 144, 145, 145, 145, 145, 146, 146, 146, 146, 146, 145, 146, 146, 146, 146, 146, 146, 146, 147, 146, 146, 145, 144, 144, 144, 145, 145, 145, 146, 146, 145, 145, 145, 145, 146, 146, 145, 144, 144, 144, 144, 144, 144, 144, 144]
3057A44%%JJjjj%%%%%J%%%%JJjj%j%%J%%j%%JJ%j%%%%%%%J%%Jjj%%Jj%%%%jJ%Jj%J%%%jjj
3050A42jJ%%%%%%J%%J%%jj%%%jJ%J%%J%%%%%J%%%%j%%jj%JJJj%%%%%%J%%j%%%J%Jj%%%%%%
3043A45%j%jjJ%%%%J%j%%%%%j%j%JJ%%%%jJJ%%%%%%j%%%%%%%j%%J%%%%%j%jJ%%%%Jj%jjJ%
3035A41J%J%%%%j%j%J%J%%%j%%%%J%%j%%%J%%j%%%%%j%%jJJJ%%j%%%%%J%jJ%%Jj%%%%%j%%
3028A42%j%%jJJ%%%%%jJJj%%%%J%jjj%J%%JJ%%%%j%%%%%%%%jj%%J%%%%jJ%%J%%J%%%j%j%%
3021A41%JJjJ%%j%%%%J%%%%%%%%%%%J%%%j%%%j%%%%j%J%%%j%%%J%%%%%%%jj%%j%%%%%%J%%
3013A40%%%%%%J%%%Jj%%%J%%%jJ%%k%J%%%%%%%%J%%%jJ%%J%%%jJJ%%%j%j%j%%J%J%%j%%%J
3006A43jj%J%jj%%jJ%J%%J%jJJ%%%jjj%%JJ%%%%%%J%JJjj%%J%%j%%%j%%j%J%%%%jJ%%%j%%
$$ y = [144, 144, 144, 145, 146, 145, 144, 143, 143, 143, 143, 143, 143, 144, 144, 144, 144, 144, 145, 146, 145, 144, 144, 143, 143, 143, 144, 144, 144, 143, 143, 143, 144, 145, 145, 144, 144, 144, 144, 144, 144, 144, 144, 145, 145, 145, 146, 145, 144, 144, 144, 145, 144, 144, 144, 144, 144, 143, 144, 144, 145, 144, 144, 145, 145, 145, 145, 144, 143, 142, 141, 142, 142, 142, 142, 142, 142, 142, 143, 143, 143, 144, 144, 144, 143, 142, 142, 142, 142, 141, 142, 142, 143, 143, 143, 144, 144, 144, 144, 144, 144, 145, 145, 145, 145, 145, 144, 144, 144, 143, 142, 142, 143, 144, 145, 144, 144, 144, 144, 144, 144, 144, 145, 145, 145, 144, 144, 144, 144, 145, 145, 146, 145, 145, 145, 145, 145, 145, 145, 145, 144, 144, 143, 142, 143, 143, 143, 143, 143, 144, 144, 143, 143, 143, 143, 143, 143, 142, 142, 141, 141, 142, 143, 143, 143, 143, 143, 142, 143, 144, 144, 144, 144, 144, 144, 144, 143, 143, 143, 143, 143, 143, 143, 143, 142, 142, 142, 143, 143, 143, 143, 143, 143, 142, 142, 141, 142, 142, 142, 142, 142, 143, 142, 142, 141, 140, 141, 141, 142, 142, 143, 143, 143, 143, 143, 142, 142, 141, 141, 142, 142, 143, 143, 143, 143, 142, 142, 142, 142, 142, 143, 143, 143, 142, 142, 142, 142, 143, 143, 143, 142, 142, 142, 142, 142, 142, 141, 141, 141, 140, 141, 142, 143, 143, 143, 142, 142, 142, 142, 142, 142, 143, 143, 142, 143, 143, 143, 144, 143, 143, 143, 143, 143, 143, 142, 142, 142, 142, 141, 141, 141, 140, 141, 142, 142, 142, 142, 142, 142, 141, 142, 143, 142, 142, 142, 142, 142, 143, 143, 142, 141, 140, 140, 141, 141, 141, 142, 143, 143, 143, 143, 143, 142, 142, 142, 142, 142, 142, 142, 142, 142, 141, 140, 140, 140, 141, 141, 141, 141, 141, 140, 141, 141, 141, 142, 142, 142, 143, 143, 143, 143, 142, 142, 141, 141, 141, 141, 142, 143, 142, 143, 143, 143, 142, 142, 142, 142, 142, 143, 143, 143, 143, 143, 143, 143, 143, 143, 143, 143, 143, 144, 144, 144, 144, 143, 143, 143, 143, 142, 142, 142, 142, 142, 141, 141, 142, 142, 142, 142, 141, 141, 141, 141, 142, 142, 142, 142, 142, 142, 142, 142, 141, 140, 140, 140, 139, 139, 139, 139, 139, 139, 139, 140, 140, 140, 140, 140, 140, 140, 140, 140, 141, 141, 141, 141, 142, 141, 141, 141, 141, 142, 142, 142, 142, 141, 142, 142, 142, 140, 140, 141, 141, 141, 141, 141, 141, 141, 141, 141, 142, 142, 142, 142, 141, 142, 142, 142, 143, 143, 143, 143, 142, 143, 144, 144, 144, 144, 143, 143, 142, 142, 141, 141, 141, 142, 142, 143, 143, 143, 142, 142, 142, 142, 143, 142, 141, 141, 142, 142, 141, 140, 140, 140, 139, 140, 140, 141, 141, 141, 142, 142, 141, 142, 143, 143, 143, 143, 142, 141, 140, 140, 140, 141, 142, 142, 142, 142, 142, 142, 142, 143, 143, 144, 145, 144, 143, 143, 143, 144, 144, 144, 143, 143, 143, 143, 142, 142, 142, 141, 141, 142, 142, 142, 142, 142, 141, 142, 142, 142, 142, 141, 141, 141]
2999A41%%%%%J%J%j%%J%Jj%jj%%%J%%%%%j%%j%JJ%Jj%%jJ%j%%%%%%%%J%Jj%j%j%JJ%%J%j%
2992A42%%%%J%jjJJj%%J%%%%%%j%J%J%%j%j%j%j%J%%J%%J%jj%J%jj%J%J%j%J%%%%Jj%%j%J
2984A42%%%JJ%j%j%%%%%jj%JJ%jj%%%%J%jjJ%j%%JJ%j%%J%%%JK%j%j%j%JJ%%%%j%j%j%jJ%
2977A40%%JJ%%%j%%%j%%J%J%%j%%j%%%JJjj%%j%%JJ%%%%%%%%j%%%j%%jJJj%jJ%%%jJ%%Jj%
2970A39%j%%J%%%J%%%%%%%%%%J%JjjJj%%JjJ%jjJ%%%%j%%%%%%J%Jj%%%J%%%jjj%jjJJ%%%%
2962A38%Jj%J%J%J%%%j%%%J%%j%%%j%%%%%%%J%%%%J%J%%J%%jjj%J%%%%%%Jj%%%%%%%j%%%%
2955A40j%%%%J%J%J%%%j%jj%J%%J%%%J%%%%j%%j%%%%%%J%%J%%%%%%%%jJ%%J%%%%%j%%%%%%
2948A42%%j%J%%%%jJJ%%jjj%%%%jjJ%%J%%J%%%J%%jjj%J%%%%%%%J%j%%%J%%%%%%%%%%%%%%
$$ y = [141, 141, 141, 141, 141, 141, 142, 142, 143, 143, 142, 142, 142, 143, 143, 144, 143, 143, 142, 141, 141, 141, 141, 142, 142, 142, 142, 142, 142, 141, 141, 141, 140, 140, 141, 142, 142, 143, 142, 142, 142, 141, 142, 142, 141, 141, 141, 141, 141, 141, 141, 141, 141, 142, 142, 143, 142, 142, 141, 141, 140, 140, 141, 142, 142, 142, 143, 143, 142, 142, 142, 142, 142, 142, 143, 143, 142, 141, 142, 143, 142, 142, 142, 143, 143, 143, 143, 143, 143, 143, 142, 142, 143, 143, 144, 144, 144, 143, 143, 142, 142, 141, 141, 140, 140, 141, 141, 141, 142, 142, 142, 143, 143, 142, 141, 141, 142, 142, 141, 140, 140, 141, 141, 142, 142, 141, 141, 142, 142, 142, 142, 142, 143, 142, 142, 142, 141, 141, 142, 142, 142, 142, 143, 144, 144, 143, 143, 142, 142, 142, 142, 142, 142, 141, 140, 140, 141, 142, 142, 141, 140, 140, 140, 140, 140, 141, 141, 140, 139, 140, 140, 139, 139, 139, 140, 141, 141, 140, 140, 140, 141, 141, 141, 141, 142, 144, 144, 143, 143, 142, 142, 141, 141, 142, 143, 143, 143, 143, 143, 142, 142, 141, 141, 140, 140, 139, 140, 140, 140, 140, 141, 142, 142, 142, 142, 141, 141, 141, 141, 140, 140, 140, 141, 141, 142, 142, 142, 141, 141, 141, 140, 140, 140, 140, 141, 142, 141, 140, 140, 140, 139, 139, 139, 140, 141, 141, 141, 141, 141, 141, 141, 141, 141, 140, 140, 140, 140, 139, 139, 139, 138, 139, 140, 139, 139, 138, 139, 139, 139, 139, 138, 139, 139, 139, 140, 139, 139, 139, 138, 138, 138, 139, 139, 139, 139, 140, 140, 140, 140, 140, 140, 140, 140, 140, 140, 140, 141, 141, 142, 141, 140, 141, 140, 140, 140, 141, 140, 141, 141, 140, 139, 140, 140, 140, 140, 140, 139, 139, 139, 139, 139, 139, 139, 140, 140, 141, 140, 140, 140, 140, 141, 141, 141, 141, 140, 139, 138, 138, 137, 136, 137, 138, 138, 138, 138, 138, 138, 139, 138, 138, 139, 139, 140, 140, 141, 141, 141, 141, 140, 140, 140, 140, 141, 141, 141, 140, 140, 140, 140, 139, 139, 139, 139, 139, 139, 139, 139, 140, 140, 140, 140, 140, 141, 141, 142, 142, 142, 143, 143, 143, 142, 141, 140, 140, 141, 141, 141, 141, 141, 141, 141, 142, 141, 141, 141, 141, 141, 141, 141, 141, 140, 140, 140, 140, 140, 139, 139, 139, 139, 139, 140, 140, 141, 141, 142, 142, 142, 142, 141, 141, 140, 139, 139, 140, 140, 140, 141, 141, 141, 141, 142, 142, 142, 142, 142, 141, 141, 141, 140, 140, 140, 140, 140, 140, 140, 141, 141, 141, 142, 142, 142, 142, 142, 142, 142, 142, 142, 141, 142, 142, 142, 143, 143, 143, 143, 143, 143, 142, 142, 142, 142, 142, 142, 142, 142, 142, 141, 141, 142, 142, 142, 142, 142, 141, 142, 143, 143, 143, 142, 141, 140, 140, 140, 140, 140, 139, 138, 139, 139, 139, 140, 140, 140, 141, 141, 141, 141, 142, 142, 142, 141, 140, 139, 139, 140, 140, 140, 140, 140, 140, 140, 140, 141, 141, 140, 140, 140, 140, 141, 141, 141, 141, 141, 141, 141, 141, 141, 141, 141, 141, 141, 141, 141]
2940A41%j%%%J%%%%%%j%%%%%k%Jj%JJ%%%%J%%%jjJ%%%%%j%J%J%J%%%%%j%j%%%J%%%%%%%%%
2933A41%%%%J%jJ%jjjJJJj%Jjj%J%%%%%j%jjJ%%J%%j%%JJ%Jj%%J%%%%%%J%%%%%jjj%%J%%J
2926A42%%%jJ%%%%J%j%jj%JJ%%J%%%j%%%%%j%%%%j%%%J%%j%J%%%%%%%J%%%J%%%Jjj%j%J%%
2918A42jj%J%jjJ%J%J%%%%%%%%%jJjj%%%%jJ%%J%%J%%j%j%Jj%%%%%%%%%%%%J%%J%%%%j%%%
2911A41%j%%%J%%j%%J%%%J%jj%jJ%J%%j%%%%%J%%%%%JJ%j%%jj%J%%%%j%j%JjJ%%JJ%%%Jj%
2904A42j%jJ%%%jJJJ%%jj%%j%J%%%%Jj%J%%jJ%%%j%j%%%%J%%%J%%%J%jJ%%jj%%%%j%%%%%J
2896A41J%%%%%%j%%%J%J%%%J%jjJ%%%%%%j%J%%%%J%jjjJ%J%%%%%%%%%%%%%%J%%%%j%jJ%JJ
2889A45%%%%%%%%%jj%j%JJ%%%%%%%%%j%j%%KJJ%jj%%kjj%JJ%%%Jj%%%%%JJ%jj%%j%jJJ%J%
$$ y = [141, 141, 140, 140, 140, 140, 141, 141, 141, 141, 141, 141, 141, 140, 140, 140, 140, 140, 140, 138, 138, 139, 138, 138, 139, 140, 140, 140, 140, 140, 141, 141, 141, 141, 140, 139, 140, 140, 140, 140, 140, 140, 139, 139, 140, 140, 141, 141, 142, 142, 142, 142, 142, 142, 141, 141, 140, 140, 140, 140, 141, 141, 141, 141, 141, 141, 141, 141, 141, 141, 141, 141, 141, 141, 142, 142, 141, 142, 142, 141, 140, 139, 140, 141, 142, 141, 141, 142, 141, 140, 140, 141, 141, 141, 141, 141, 141, 140, 140, 139, 138, 139, 139, 139, 140, 140, 140, 139, 139, 139, 140, 141, 141, 142, 141, 141, 141, 142, 142, 142, 142, 142, 142, 142, 143, 143, 143, 143, 143, 143, 142, 141, 140, 140, 140, 141, 141, 141, 142, 142, 142, 142, 141, 142, 142, 142, 142, 142, 143, 143, 142, 142, 141, 140, 140, 141, 142, 142, 142, 143, 143, 143, 143, 142, 142, 142, 142, 142, 142, 141, 141, 141, 141, 141, 140, 140, 140, 140, 141, 141, 141, 140, 140, 141, 141, 141, 141, 141, 141, 141, 141, 142, 142, 142, 142, 143, 143, 143, 143, 144, 143, 142, 142, 141, 141, 142, 142, 142, 141, 140, 140, 141, 141, 140, 139, 140, 140, 141, 141, 142, 142, 142, 142, 142, 142, 142, 142, 142, 142, 141, 142, 141, 140, 140, 140, 140, 140, 139, 140, 140, 140, 141, 141, 141, 142, 142, 142, 141, 141, 140, 140, 141, 140, 140, 140, 140, 140, 140, 140, 140, 140, 140, 140, 140, 140, 141, 141, 141, 142, 142, 142, 142, 142, 141, 141, 141, 141, 141, 140, 140, 140, 140, 141, 141, 141, 140, 140, 140, 141, 141, 141, 141, 142, 142, 141, 140, 140, 139, 140, 140, 141, 141, 141, 140, 140, 140, 140, 140, 140, 141, 141, 141, 141, 141, 141, 142, 143, 143, 142, 142, 142, 141, 140, 140, 141, 141, 141, 141, 141, 140, 140, 139, 139, 140, 139, 140, 140, 140, 141, 142, 142, 142, 142, 143, 142, 142, 141, 141, 140, 141, 141, 141, 141, 140, 141, 142, 143, 143, 143, 142, 141, 141, 141, 140, 140, 141, 141, 141, 141, 141, 142, 141, 141, 142, 142, 142, 141, 142, 142, 142, 142, 141, 141, 140, 140, 140, 140, 140, 141, 141, 141, 141, 142, 142, 142, 142, 143, 143, 142, 143, 143, 143, 142, 141, 141, 141, 141, 141, 140, 140, 140, 140, 140, 140, 141, 142, 142, 142, 142, 142, 142, 142, 141, 141, 141, 141, 142, 142, 143, 143, 143, 143, 144, 144, 143, 142, 143, 143, 143, 143, 143, 143, 143, 142, 142, 143, 143, 143, 143, 143, 144, 144, 143, 142, 141, 142, 142, 143, 143, 143, 143, 143, 143, 143, 143, 143, 143, 143, 143, 143, 143, 143, 144, 144, 144, 144, 144, 143, 143, 142, 143, 143, 144, 145, 145, 145, 145, 145, 145, 145, 145, 145, 145, 144, 143, 143, 142, 142, 143, 144, 144, 144, 144, 144, 144, 144, 144, 144, 144, 143, 143, 142, 142, 142, 144, 145, 146, 146, 145, 144, 144, 144, 142, 141, 140, 140, 141, 142, 142, 142, 142, 143, 142, 142, 142, 142, 142, 142, 143, 144, 144, 143, 142, 142, 142, 141, 141, 140, 141, 142, 142, 143, 143]
2882A43%%Jjj%K%%j%%%%Jjjj%%J%%%J%%%%%%%J%%J%%%%j%j%%%jJJ%%Jjj%j%JJJ%%j%%%%%j
2875A43%j%jJ%%%J%%%J%%JJ%%j%j%JJ%%%%JJJ%%j%j%%%%%jj%%JJ%%%%J%%%jjjJ%%%%J%%%%
2867A47%%%j%%J%%j%J%J%jjjJJ%jjJ%%j%%%%%%J%%%%%%j%%J%%j%%jJ%J%%J%JJJ%j%jj%j%j
2860A45%J%%%J%%kj%J%%%JJ%j%%%j%%%J%j%%%%%j%%JJj%%%j%%j%J%%%%JJj%jJ%%%%%%jJjj
2853A43%%J%J%j%%J%%%j%%%%jj%J%%%%J%%%JJ%%%j%%%%j%%%%%J%%j%%%J%J%%%%%jk%%%%%%
2845A43Jj%%%j%%%%%%jj%%J%%%%%%%J%%%%%%%%%%%%JJ%j%jjJ%%%%%%%%%J%%j%jJ%%J%%J%j
2838A43j%j%j%%J%%%%%%%%jJJ%%%%JJ%j%jJJ%%j%%J%Jj%jj%j%%j%%%J%%J%j%%%%J%%jjj%%
2831A39%J%J%%j%%%j%J%%%%J%%%J%j%%JJjj%jJ%%%%jJJ%%%%j%%%%%%%%%%%%%%J%J%JjjJ%%
$$ y = [143, 143, 143, 144, 143, 142, 142, 144, 144, 144, 143, 143, 143, 143, 143, 144, 143, 142, 141, 141, 141, 142, 142, 142, 142, 143, 143, 143, 143, 143, 143, 143, 143, 144, 144, 144, 145, 145, 145, 145, 145, 144, 144, 143, 143, 143, 143, 142, 143, 144, 144, 144, 145, 144, 143, 143, 142, 142, 143, 144, 145, 145, 145, 144, 144, 144, 144, 144, 144, 143, 143, 142, 142, 141, 142, 142, 142, 142, 143, 143, 143, 143, 144, 144, 144, 145, 146, 146, 146, 145, 145, 144, 144, 145, 146, 146, 146, 146, 146, 147, 148, 149, 149, 149, 148, 148, 147, 147, 147, 147, 147, 147, 146, 145, 145, 145, 146, 147, 147, 147, 147, 147, 148, 148, 148, 148, 147, 146, 145, 146, 146, 146, 146, 146, 147, 147, 147, 147, 147, 147, 147, 147, 146, 146, 146, 147, 147, 147, 146, 146, 147, 147, 148, 148, 147, 146, 145, 146, 147, 147, 146, 145, 146, 146, 146, 145, 145, 145, 145, 145, 145, 145, 146, 146, 146, 146, 146, 146, 146, 145, 145, 145, 146, 146, 146, 145, 145, 145, 144, 145, 145, 146, 146, 146, 147, 147, 148, 149, 150, 150, 149, 149, 148, 147, 147, 146, 146, 145, 145, 146, 146, 146, 146, 147, 147, 147, 145, 144, 144, 145, 145, 145, 145, 146, 147, 147, 146, 146, 146, 146, 145, 145, 145, 145, 146, 146, 145, 145, 145, 145, 145, 145, 144, 144, 144, 145, 146, 145, 145, 145, 145, 144, 144, 144, 143, 143, 144, 144, 144, 144, 144, 145, 146, 145, 145, 144, 145, 145, 145, 145, 145, 145, 145, 144, 145, 144, 143, 143, 143, 144, 144, 145, 145, 144, 144, 144, 145, 145, 145, 145, 144, 144, 144, 144, 144, 143, 142, 142, 143, 143, 143, 143, 143, 144, 144, 144, 144, 145, 146, 146, 146, 146, 145, 145, 145, 145, 145, 144, 144, 144, 144, 144, 144, 145, 145, 145, 144, 144, 144, 144, 145, 145, 146, 146, 146, 146, 146, 146, 145, 143, 143, 143, 143, 143, 143, 143, 144, 143, 143, 143, 143, 142, 142, 142, 142, 142, 142, 142, 141, 140, 140, 140, 141, 141, 141, 141, 141, 141, 141, 141, 142, 142, 142, 142, 142, 142, 142, 142, 142, 142, 142, 142, 142, 143, 144, 144, 143, 143, 142, 141, 142, 142, 142, 142, 142, 142, 142, 142, 142, 142, 143, 143, 143, 142, 142, 141, 142, 142, 142, 143, 143, 143, 144, 144, 143, 142, 142, 141, 141, 140, 140, 140, 141, 141, 141, 141, 141, 141, 141, 141, 141, 140, 141, 142, 142, 142, 142, 142, 143, 144, 144, 143, 143, 142, 143, 144, 144, 144, 143, 143, 143, 144, 144, 145, 144, 144, 143, 142, 142, 141, 141, 141, 140, 140, 140, 140, 141, 141, 141, 142, 142, 141, 141, 141, 141, 141, 142, 142, 142, 141, 140, 139, 139, 139, 139, 140, 140, 141, 141, 141, 140, 140, 140, 140, 139, 139, 140, 140, 140, 140, 140, 141, 141, 141, 141, 142, 142, 141, 141, 141, 142, 143, 142, 141, 141, 140, 141, 141, 141, 141, 141, 140, 141, 142, 142, 142, 142, 142, 141, 141, 141, 141, 141, 141, 141, 141, 141, 141, 141, 141, 141, 141, 141, 142, 142, 143, 143, 144, 143, 142, 143, 143, 143]
2823A43jj%jJ%%%JJ%k%%%%%%%%%%jJ%%J%%%%jj%%%%%%%%%J%%%J%%%j%%%%j%%J%%jJ%%%%%J
2816A42j%%%%%%J%%jj%%%%%%%%%j%JJj%%%J%%J%%%%Jjj%%%%%J%%%%%%%%%%%%%%%%%%%jJ%%
2809A42%%j%jJ%j%%%%%%%%J%%%%%j%%%%j%%J%J%%j%J%%%J%%%j%j%JjJ%%J%%%%%%jjjj%JJj
2801A39%%%JJJ%jJ%%jjj%JJ%jJ%%%%%%%%j%%%%%J%%jj%J%%J%jJ%%%%%jjj%jJJJJ%%k%j%%%
2794A38%%%%%%%%%J%%J%%%%%%j%%J%JJ%j%%%j%Jj%J%%j%%%%%%%j%%J%%%j%%JJ%%%j%%%%%J
2787A41%jjJJ%%j%j%JK%%%j%j%jJ%%J%%j%%J%JJj%j%%j%j%J%Jj%j%%%%%J%J%J%j%%%%%%J%
2780A42%j%%%%j%%j%J%%J%%J%%%jj%%%%%%j%%%%k%%JJ%%%%%%%J%J%%%Jj%%%%j%%%%%%%%%%
2772A40j%%j%%J%jjJJ%Jj%%JJj%%j%JJ%%%%%%%j%j%%%%%J%%%%J%%jJ%%%jjJ%%Jjj%J%%%%%
$$ y = [143, 142, 141, 141, 140, 141, 141, 141, 141, 142, 143, 143, 141, 141, 141, 141, 141, 141, 141, 141, 141, 141, 141, 140, 141, 141, 141, 142, 142, 142, 142, 142, 141, 140, 140, 140, 140, 140, 140, 140, 140, 140, 140, 141, 141, 141, 141, 142, 142, 142, 142, 141, 141, 141, 141, 141, 140, 140, 140, 141, 141, 141, 140, 141, 141, 141, 141, 141, 141, 142, 141, 141, 141, 141, 141, 141, 141, 142, 142, 142, 141, 140, 140, 140, 140, 140, 140, 140, 140, 140, 140, 139, 139, 140, 141, 140, 140, 140, 140, 141, 141, 141, 142, 142, 142, 142, 142, 143, 142, 141, 141, 141, 141, 141, 141, 142, 142, 142, 142, 142, 142, 142, 142, 142, 142, 142, 142, 142, 142, 142, 142, 142, 142, 142, 142, 141, 142, 142, 142, 142, 142, 141, 141, 140, 141, 141, 140, 140, 140, 140, 140, 140, 140, 140, 140, 141, 141, 141, 141, 141, 141, 140, 140, 140, 140, 140, 139, 139, 139, 140, 140, 141, 141, 141, 140, 140, 141, 141, 141, 141, 142, 142, 142, 142, 141, 141, 140, 140, 141, 140, 141, 141, 141, 142, 142, 142, 142, 142, 142, 142, 141, 140, 139, 138, 138, 139, 140, 139, 139, 139, 139, 140, 141, 142, 142, 141, 142, 142, 142, 141, 140, 139, 139, 140, 141, 141, 140, 141, 141, 141, 141, 141, 141, 141, 141, 141, 140, 140, 140, 140, 140, 140, 141, 141, 141, 140, 139, 139, 140, 140, 140, 141, 141, 140, 141, 141, 141, 141, 141, 141, 140, 139, 138, 138, 137, 138, 139, 140, 141, 141, 141, 139, 139, 138, 138, 138, 138, 138, 138, 138, 138, 138, 138, 138, 138, 138, 139, 139, 139, 140, 140, 140, 140, 140, 140, 140, 139, 139, 139, 140, 140, 141, 142, 142, 141, 141, 141, 141, 140, 140, 141, 140, 140, 141, 141, 141, 140, 140, 140, 140, 140, 140, 140, 140, 139, 139, 139, 140, 140, 140, 140, 139, 139, 139, 140, 141, 141, 141, 141, 140, 140, 140, 140, 140, 140, 141, 141, 140, 139, 140, 141, 141, 141, 140, 140, 139, 139, 140, 142, 142, 142, 142, 141, 141, 140, 140, 139, 140, 140, 140, 141, 141, 141, 140, 140, 140, 141, 141, 142, 143, 142, 142, 141, 141, 141, 140, 140, 139, 139, 140, 140, 141, 140, 140, 139, 139, 139, 139, 139, 139, 140, 140, 141, 141, 142, 142, 141, 141, 141, 141, 141, 141, 141, 142, 142, 142, 141, 141, 141, 141, 141, 140, 140, 140, 139, 139, 140, 140, 140, 141, 141, 141, 142, 142, 142, 142, 141, 140, 140, 140, 140, 140, 140, 140, 139, 139, 139, 139, 139, 137, 137, 137, 138, 139, 139, 139, 139, 139, 139, 139, 139, 140, 140, 141, 141, 141, 141, 142, 141, 141, 141, 141, 141, 140, 140, 140, 140, 140, 140, 140, 140, 140, 140, 140, 139, 139, 139, 138, 138, 138, 139, 139, 138, 137, 138, 139, 139, 140, 139, 139, 139, 140, 141, 140, 140, 140, 139, 139, 140, 141, 141, 141, 141, 141, 141, 141, 141, 140, 140, 139, 139, 139, 139, 139, 139, 140, 140, 140, 140, 140, 141, 141, 141, 140, 141, 141, 141, 141, 140, 139, 140, 140, 140, 141, 140, 139, 139, 140, 140, 140, 140, 140, 140]
2765A40J%%%j%J%%jk%%KJ%j%%%%%%%%%jJ%%j%%%%%%%J%%j%jJ%%%%%%%JjJ%%jJ%%j%jj%%J%
2758A38%J%%%J%%j%%j%%J%%%J%Jjjj%J%%%%%j%JJJ%jj%j%JJ%Jjj%%%%%%J%%%%J%%%jjj%J%
2750A39%%%J%%%%Jj%j%%J%%jk%%J%%%jJJJJ%%%%%%%%j%%%%j%%%J%%j%%%J%%%%j%%Jj%j%J%
2743A39%%%%j%%J%%%%jJ%j%%%%%%%%%%%J%jJJjj%jKJ%%%%%%%%%j%%Jjj%%JJ%%J%j%%%%%%%
2736A40J%%%%%%jj%%%%%%%%%%%%%%J%J%j%%j%%%%%%J%%j%%jjJJ%J%J%j%%j%J%%Jj%j%%%J%
2728A40j%J%%%%j%j%JJ%j%%%JJ%%j%jJ%%%%%%%%%J%%%j%jJ%j%%%%%%%%%%%%%%%%%%j%%%%J
2721A39%%%%J%Jjj%%j%JJ%J%%j%J%j%j%%%%J%%%%%%%JjjjJJ%%%%%%J%j%%j%%%%%J%JJ%%%j
2714A41jjj%J%j%%J%j%%%jJ%J%%j%%%%JJ%jjJ%%%%%%%%%%%%j%J%%%%%%%%%%%%j%%%%J%%j%
$$ y = [140, 141, 141, 141, 141, 140, 140, 141, 141, 141, 140, 138, 138, 138, 140, 141, 141, 140, 140, 140, 140, 140, 140, 140, 140, 140, 140, 139, 140, 140, 140, 139, 139, 139, 139, 139, 139, 139, 139, 140, 140, 140, 139, 139, 138, 139, 139, 139, 139, 139, 139, 139, 139, 140, 139, 140, 140, 140, 139, 140, 140, 140, 139, 139, 138, 137, 137, 137, 138, 138, 138, 139, 139, 139, 139, 140, 140, 140, 139, 139, 139, 138, 138, 138, 139, 139, 139, 139, 140, 140, 141, 140, 139, 138, 138, 139, 139, 139, 139, 139, 139, 138, 138, 139, 140, 141, 141, 140, 139, 139, 138, 138, 139, 140, 140, 141, 140, 139, 139, 139, 139, 139, 139, 139, 140, 140, 140, 140, 140, 141, 141, 141, 141, 140, 139, 138, 138, 139, 139, 139, 139, 139, 140, 140, 140, 140, 140, 141, 140, 140, 139, 139, 139, 140, 140, 140, 139, 137, 137, 137, 138, 138, 138, 138, 137, 138, 139, 140, 141, 141, 141, 141, 141, 141, 141, 141, 141, 140, 140, 140, 140, 140, 139, 139, 139, 139, 140, 140, 140, 139, 139, 139, 139, 140, 140, 140, 140, 140, 139, 139, 139, 140, 139, 139, 138, 138, 139, 139, 139, 139, 139, 139, 138, 138, 138, 139, 139, 139, 139, 139, 138, 139, 139, 138, 138, 138, 138, 138, 138, 138, 138, 138, 138, 138, 138, 139, 139, 138, 139, 140, 139, 138, 138, 137, 139, 140, 140, 140, 140, 140, 140, 140, 140, 140, 140, 139, 139, 139, 140, 139, 138, 138, 138, 139, 140, 140, 140, 141, 141, 140, 140, 140, 140, 140, 140, 140, 140, 141, 141, 141, 141, 141, 141, 141, 140, 139, 139, 139, 139, 139, 139, 139, 139, 139, 139, 139, 139, 139, 139, 139, 140, 140, 141, 141, 140, 140, 140, 139, 139, 139, 139, 139, 139, 139, 140, 140, 140, 139, 139, 139, 138, 137, 138, 139, 139, 140, 140, 141, 141, 140, 140, 140, 139, 139, 140, 140, 140, 141, 140, 140, 139, 139, 139, 139, 140, 140, 139, 139, 140, 140, 140, 140, 140, 139, 139, 138, 138, 139, 140, 140, 139, 139, 139, 139, 140, 141, 141, 141, 140, 140, 139, 140, 140, 140, 140, 140, 140, 140, 140, 140, 140, 141, 141, 141, 141, 140, 140, 139, 140, 140, 139, 139, 139, 139, 139, 139, 139, 139, 139, 139, 139, 139, 139, 139, 139, 139, 139, 139, 139, 138, 138, 138, 138, 138, 139, 139, 139, 139, 139, 140, 140, 141, 140, 139, 139, 139, 138, 138, 139, 140, 140, 141, 141, 141, 140, 140, 141, 141, 140, 140, 139, 139, 139, 139, 139, 140, 140, 140, 140, 140, 140, 140, 140, 141, 140, 139, 138, 139, 140, 140, 140, 140, 140, 140, 140, 141, 141, 140, 140, 140, 139, 139, 139, 139, 139, 139, 140, 140, 141, 142, 142, 142, 142, 141, 140, 139, 138, 138, 139, 139, 138, 138, 138, 139, 139, 138, 138, 138, 138, 137, 138, 138, 139, 139, 139, 138, 138, 138, 138, 138, 139, 140, 140, 139, 138, 139, 139, 139, 139, 139, 139, 139, 139, 139, 139, 139, 139, 139, 138, 138, 139, 139, 139, 139, 139, 139, 139, 139, 139, 139, 139, 139, 139, 138, 138, 138, 138, 138, 139, 139, 139, 138, 138]
2706A38%j%%%%J%%J%J%%J%jj%%j%j%J%%%J%%%%j%%%%%%%%%%J%%%j%%%%%%%%%%%%%%%J%%%%
2699A39Jj%%%%%%%%%%%%%J%%%jj%%%%%%JJ%%%j%j%%J%%j%%J%%Jj%%%%J%%j%%%%%J%J%k%%J
2692A40j%%%j%JJ%%j%%jJ%%%j%%%%J%%%%%jJ%%%%%j%%%%J%%%%%%%%%%%%%%jJ%j%J%J%%%%j
2684A39%j%JJ%%%J%%%%%j%j%%j%%%%%J%%J%%j%%%%%%%j%Jj%JJ%%J%Jk%%J%%j%j%%%%%%%j%
2677A38J%%%%J%j%j%%jJ%J%%%%%%%%%J%%j%%%jj%%JJJ%%%j%J%%%%%%%%j%%%%%%%%%%jJj%%
2670A38%J%JJ%jj%%%j%J%J%J%jkJ%%%%%%j%J%%JK%%%kj%%J%%%%j%jJ%Jj%j%%%J%Jj%%%%%%
2663A39J%%j%j%%J%%%%%JJ%%j%%j%%J%j%J%%%%%%j%%j%%J%%%%jJj%%%%%%%%%JJ%%j%%%J%%
2655A40%Jj%%%J%j%j%%%%jJ%%%JJj%%%%%%%%%%%%%%%%%jJJ%jj%%%j%JJj%J%%%%j%%J%Jjj%
$$ y = [138, 138, 137, 137, 137, 137, 137, 138, 138, 138, 139, 139, 140, 140, 140, 141, 141, 140, 139, 139, 139, 138, 138, 137, 137, 138, 138, 138, 138, 139, 139, 139, 139, 139, 138, 138, 138, 138, 138, 138, 138, 138, 138, 138, 138, 139, 139, 139, 139, 138, 138, 138, 138, 138, 138, 138, 138, 138, 138, 138, 138, 138, 138, 138, 138, 139, 139, 139, 139, 139, 140, 139, 139, 139, 139, 139, 139, 139, 139, 139, 139, 139, 139, 139, 139, 140, 140, 140, 140, 139, 138, 138, 138, 138, 138, 138, 138, 139, 140, 140, 140, 140, 139, 139, 138, 138, 138, 139, 139, 139, 138, 138, 138, 139, 139, 139, 140, 139, 139, 139, 139, 139, 140, 140, 140, 139, 139, 139, 139, 139, 139, 140, 140, 141, 141, 139, 139, 139, 140, 139, 139, 139, 139, 138, 138, 139, 140, 140, 140, 139, 139, 139, 138, 139, 139, 139, 139, 138, 138, 138, 138, 138, 139, 139, 139, 139, 139, 139, 138, 139, 139, 139, 139, 139, 139, 138, 138, 138, 138, 138, 139, 139, 139, 139, 139, 139, 139, 139, 139, 139, 139, 139, 139, 139, 139, 138, 139, 139, 138, 138, 139, 139, 140, 140, 140, 140, 140, 139, 139, 138, 138, 139, 140, 140, 140, 140, 141, 141, 141, 141, 141, 141, 140, 140, 139, 139, 139, 138, 138, 138, 138, 138, 138, 139, 139, 139, 140, 140, 140, 139, 139, 139, 139, 139, 139, 139, 139, 138, 138, 139, 138, 138, 139, 140, 140, 140, 141, 141, 142, 140, 140, 140, 141, 141, 141, 140, 140, 139, 139, 139, 139, 139, 139, 139, 139, 138, 138, 139, 139, 139, 139, 139, 140, 140, 139, 139, 138, 138, 138, 137, 138, 138, 139, 139, 139, 139, 139, 139, 139, 139, 139, 139, 140, 140, 140, 139, 139, 139, 139, 138, 137, 137, 137, 138, 139, 140, 140, 140, 140, 139, 139, 140, 140, 140, 140, 140, 140, 140, 140, 140, 139, 139, 139, 139, 139, 139, 139, 139, 139, 139, 139, 138, 139, 138, 138, 138, 138, 139, 139, 140, 141, 141, 140, 139, 139, 139, 139, 138, 138, 139, 139, 140, 140, 141, 141, 140, 138, 139, 139, 139, 139, 139, 139, 139, 138, 138, 139, 139, 139, 140, 142, 142, 142, 142, 140, 139, 139, 139, 140, 140, 140, 140, 140, 139, 139, 138, 139, 139, 140, 139, 139, 138, 138, 138, 138, 139, 139, 140, 139, 139, 139, 139, 139, 139, 139, 140, 140, 140, 139, 139, 138, 138, 138, 139, 139, 139, 139, 139, 139, 140, 141, 141, 141, 140, 140, 140, 139, 139, 139, 140, 140, 139, 139, 140, 140, 140, 140, 140, 140, 140, 139, 139, 139, 138, 138, 138, 139, 139, 139, 139, 139, 138, 139, 138, 138, 138, 138, 138, 138, 138, 138, 138, 138, 139, 140, 140, 140, 139, 139, 139, 139, 140, 140, 140, 140, 141, 140, 140, 140, 140, 141, 141, 140, 140, 139, 139, 139, 139, 139, 138, 139, 139, 139, 139, 140, 141, 140, 140, 140, 140, 140, 140, 140, 140, 140, 140, 140, 140, 140, 140, 140, 140, 140, 140, 139, 140, 141, 141, 140, 139, 139, 139, 139, 138, 138, 139, 140, 139, 139, 140, 140, 140, 140, 140, 139, 139, 139, 140, 140, 141, 140, 139, 139]
2648A39%%j%J%%%Jj%%%J%%%%%%%Jk%%%%%j%%%JJ%%%%%%%j%J%%%%j%j%%%%J%%%%%%%J%JJjj
2641A40%jJ%%J%%jj%%j%J%jj%J%%%%%J%%JJJ%jj%jJ%%%%j%%%%%%%%%%j%%%%%%%%%%%J%%%%
2633A39Jj%j%%%J%%%%jJ%j%j%%%%JJJ%%j%j%%%%jJ%%J%%%jj%J%%%%%%J%%%kJ%J%%%%j%%j%
2626A37%%%J%%%J%%%j%Jj%%J%Jj%j%%%%J%%%j%%%j%%JJ%%k%J%J%J%%jj%JJ%%j%J%%J%%%j%
2619A40%jjJjj%j%%%%J%J%J%%J%jjj%%%%%%%%J%%%%%%%%J%%jj%J%J%%J%jj%j%JJ%%j%j%jJ
2611A37JKJJ%%jkjjJJJ%%j%j%j%J%%j%J%%J%%%%%j%%j%J%J%%jj%Jj%%%%J%%J%j%%%%j%JJ%
2604A39%J%%%%j%jJ%%%%Jj%j%%%%%%%J%jj%JJj%%j%J%%%JJ%%jjj%J%%%j%%%%%j%JJ%%%JJ%
2597A40jj%%%J%%j%%%%%%%%J%j%J%%j%J%Jj%%%%%jJ%%%%JJkjj%%j%J%J%%J%%%%%%%J%j%j%
$$ y = [139, 139, 139, 138, 138, 139, 139, 139, 139, 140, 139, 139, 139, 139, 140, 140, 140, 140, 140, 140, 140, 140, 141, 139, 139, 139, 139, 139, 139, 138, 138, 138, 138, 139, 140, 140, 140, 140, 140, 140, 140, 140, 139, 139, 140, 140, 140, 140, 140, 139, 139, 138, 138, 138, 138, 138, 139, 139, 139, 139, 139, 139, 139, 139, 140, 140, 141, 142, 141, 140, 140, 139, 140, 140, 140, 141, 141, 141, 140, 139, 139, 139, 138, 138, 139, 139, 138, 137, 137, 138, 138, 138, 138, 138, 138, 139, 139, 139, 140, 141, 142, 142, 141, 140, 140, 139, 140, 140, 140, 140, 140, 139, 139, 139, 139, 139, 139, 139, 139, 139, 139, 139, 138, 138, 138, 138, 138, 138, 138, 138, 138, 138, 138, 138, 139, 139, 139, 139, 139, 140, 139, 139, 138, 138, 138, 138, 139, 139, 139, 139, 139, 138, 139, 139, 138, 138, 137, 137, 137, 137, 137, 138, 139, 140, 140, 140, 139, 139, 138, 138, 138, 138, 138, 137, 138, 138, 138, 139, 139, 139, 139, 138, 137, 137, 138, 138, 138, 138, 138, 138, 138, 139, 139, 139, 139, 137, 138, 138, 139, 139, 139, 139, 139, 138, 138, 138, 137, 137, 137, 137, 137, 138, 138, 138, 138, 139, 139, 139, 139, 138, 138, 139, 138, 138, 138, 139, 139, 140, 139, 139, 138, 138, 138, 138, 138, 139, 139, 139, 139, 138, 138, 138, 138, 137, 137, 137, 138, 139, 139, 139, 137, 137, 138, 138, 139, 139, 140, 140, 140, 139, 138, 138, 139, 140, 140, 140, 139, 139, 140, 140, 140, 141, 141, 141, 141, 140, 140, 140, 139, 138, 139, 138, 137, 137, 136, 136, 136, 136, 136, 137, 137, 138, 138, 139, 139, 139, 140, 140, 139, 138, 137, 137, 137, 137, 137, 137, 137, 137, 137, 138, 138, 138, 138, 138, 138, 138, 138, 138, 139, 139, 139, 138, 137, 137, 138, 138, 139, 139, 139, 140, 140, 139, 138, 138, 137, 137, 138, 139, 139, 139, 138, 138, 137, 137, 136, 137, 138, 140, 141, 142, 142, 142, 141, 139, 138, 137, 138, 139, 140, 140, 140, 139, 139, 138, 138, 137, 137, 138, 138, 138, 137, 137, 138, 138, 138, 139, 139, 139, 139, 139, 139, 138, 138, 138, 137, 137, 138, 138, 139, 139, 139, 138, 137, 137, 138, 137, 137, 137, 137, 137, 138, 138, 138, 139, 139, 138, 138, 138, 138, 138, 137, 137, 138, 139, 139, 139, 140, 140, 140, 140, 140, 139, 139, 138, 139, 139, 139, 139, 139, 140, 139, 139, 138, 138, 138, 138, 138, 138, 138, 138, 139, 139, 138, 137, 137, 138, 139, 138, 138, 138, 137, 137, 138, 138, 138, 138, 139, 140, 140, 140, 139, 138, 137, 137, 138, 138, 138, 138, 137, 137, 137, 137, 137, 137, 136, 136, 137, 138, 138, 138, 138, 139, 140, 140, 139, 138, 138, 138, 138, 139, 139, 139, 138, 138, 138, 138, 138, 138, 138, 138, 138, 139, 139, 138, 138, 139, 139, 139, 138, 138, 139, 139, 140, 139, 139, 139, 139, 139, 139, 138, 139, 139, 139, 139, 139, 140, 141, 139, 138, 137, 137, 137, 136, 136, 137, 137, 138, 138, 138, 139, 139, 139, 139, 139, 139, 139, 139, 140, 140, 139, 139, 138, 138]
2589A38%J%%j%J%%%%J%%%%j%%%J%%%j%j%%%%%%j%%%%%J%%%%%%j%%%%J%%%J%%%%j%J%%jj%%
2582A37%%%%%%%%j%KJJJj%jj%%%%%%j%%%%%JJ%%j%%%jJj%J%J%J%j%%j%%j%%%%%%%%%%%J%J
2575A39J%%%%j%j%%%J%%%j%%j%jJ%%J%j%%J%%J%%jjj%J%%%%J%%%%%%%%%%%%J%%J%j%%%%%%
2567A39j%%J%jjj%%%%JJ%%%jJJ%%%%%%%%%%Jj%%%%%%%%j%jjJ%%J%%%jJ%%%%j%%JJ%J%%jjj
2560A37%%J%%%%%%J%%%%%%%%%j%%jJ%J%%%jJ%%%j%%%j%%%%J%%J%j%%%%%%%J%%%%Jj%%%jJ%
2553A39%Jj%%j%%%%%%JjJ%jJJ%%%J%j%%J%jj%J%%%%jJJj%j%%%%%J%J%j%%Jj%j%%j%%J%j%%
2546A38%%%%%%%%j%%%%JJ%jkJJJ%%%%%%j%J%j%%%JJJJj%jj%%J%%k%%%j%%%%JjJ%%jJJJjJ%
2538A40%%%j%%%%%%j%%J%%JjjJ%%%%%j%%JJ%%%%%%J%%j%%%%%%%J%Jj%%%j%%%%%%%j%%%%%%
$$ y = [138, 138, 139, 139, 139, 138, 138, 139, 139, 139, 139, 139, 140, 140, 140, 140, 140, 139, 139, 139, 139, 140, 140, 140, 140, 139, 139, 138, 138, 138, 138, 138, 138, 138, 137, 137, 137, 137, 137, 137, 138, 138, 138, 138, 138, 138, 138, 137, 137, 137, 137, 137, 138, 138, 138, 138, 139, 139, 139, 139, 139, 138, 138, 139, 139, 139, 138, 137, 137, 137, 137, 137, 137, 137, 137, 137, 137, 137, 136, 136, 138, 139, 140, 141, 140, 140, 139, 138, 138, 138, 138, 138, 138, 138, 137, 137, 137, 137, 137, 137, 138, 139, 139, 139, 138, 138, 138, 138, 137, 138, 137, 137, 138, 138, 139, 139, 140, 140, 139, 139, 139, 138, 138, 138, 137, 137, 137, 137, 137, 137, 137, 137, 137, 137, 137, 137, 138, 138, 139, 140, 140, 140, 140, 140, 139, 139, 138, 138, 138, 138, 139, 139, 139, 139, 138, 138, 138, 137, 137, 136, 137, 137, 137, 138, 138, 137, 137, 137, 138, 138, 138, 139, 139, 139, 138, 137, 136, 136, 137, 137, 137, 137, 137, 138, 138, 138, 138, 138, 138, 138, 138, 138, 138, 138, 138, 138, 139, 139, 139, 140, 140, 139, 139, 139, 139, 139, 139, 139, 138, 138, 138, 139, 139, 138, 137, 136, 136, 136, 136, 136, 137, 138, 138, 138, 138, 137, 138, 139, 139, 139, 139, 139, 139, 139, 139, 139, 139, 139, 140, 139, 139, 139, 139, 139, 139, 139, 139, 139, 138, 138, 137, 136, 137, 137, 137, 138, 138, 138, 138, 137, 138, 138, 138, 138, 138, 137, 137, 137, 138, 139, 139, 140, 140, 140, 139, 138, 137, 137, 137, 138, 138, 138, 138, 138, 138, 138, 139, 139, 139, 139, 139, 139, 139, 139, 139, 139, 138, 138, 138, 137, 138, 138, 139, 139, 139, 139, 138, 139, 139, 139, 139, 138, 138, 138, 138, 137, 137, 137, 137, 137, 138, 138, 138, 139, 139, 138, 138, 138, 138, 138, 138, 138, 138, 139, 139, 139, 139, 139, 140, 139, 139, 139, 139, 138, 139, 139, 139, 140, 139, 139, 139, 138, 138, 138, 138, 138, 138, 138, 139, 138, 139, 139, 138, 139, 140, 140, 140, 140, 141, 141, 140, 140, 140, 141, 141, 140, 139, 139, 140, 140, 140, 140, 140, 139, 140, 141, 140, 140, 139, 139, 139, 139, 139, 139, 140, 140, 141, 141, 140, 140, 140, 141, 140, 140, 139, 139, 139, 138, 138, 138, 139, 139, 138, 138, 138, 138, 138, 138, 138, 138, 138, 138, 138, 137, 137, 137, 137, 137, 138, 139, 139, 138, 136, 137, 138, 139, 139, 139, 139, 139, 139, 139, 138, 138, 139, 139, 138, 138, 138, 138, 139, 140, 141, 142, 141, 141, 140, 139, 139, 139, 140, 140, 140, 138, 138, 138, 138, 137, 137, 137, 137, 137, 138, 137, 138, 138, 138, 137, 138, 139, 140, 139, 140, 140, 140, 140, 140, 139, 139, 139, 139, 139, 139, 139, 138, 138, 138, 139, 139, 139, 140, 139, 138, 139, 139, 139, 139, 139, 139, 138, 138, 138, 139, 140, 140, 140, 140, 140, 140, 140, 141, 141, 141, 140, 140, 140, 140, 140, 140, 140, 140, 141, 141, 142, 141, 141, 141, 141, 140, 140, 140, 140, 140, 140, 140, 140, 139, 139, 139, 139, 139, 139, 139]
2531A39%J%%jj%J%%j%%%%J%J%%J%%%%%jJ%j%%%jJJ%j%%%%%Jjj%%%J%J%%j%jJ%jj%%%J%%JJ
2524A41%J%%%j%%%%j%%%J%jj%%%J%jj%%%%J%%%%%%%%j%J%%%%%JJjj%%%J%j%%J%%Jj%%%J%j
2516A40%j%%jJJJ%%%%%%%%jj%%J%%%%J%%jjj%%%%%JJ%%J%%J%j%%%%%%%%%J%jk%%J%%%j%JJ
2509A41%jj%%%%%%J%J%%j%%%%%Jj%Jj%%%%%%%j%J%%%jJJ%jJj%%%%j%j%j%%JJJJ%%j%%%%%%
2502A40%%%j%%%%%J%%%%J%j%%%%%%j%%j%J%%%%J%j%%%%%Jj%J%%j%%%%j%jJJJ%%%J%%j%J%J
2494A42JJJ%jj%j%j%%%%jj%jJ%%%J%%%%%%j%%JJ%%j%j%%J%%%%%J%j%%%j%J%%%jJ%J%%Jj%%
2487A41j%%%%jj%%J%J%Jj%J%%%j%%j%j%%%%J%%%J%%%j%J%%J%%j%%%%jjJ%%J%%%%jj%J%%j%
2480A38K%%%%%%%%J%%%%j%%%jj%J%%%%%%J%J%%j%%J%%%%j%%J%%%%%%J%%k%%%%J%%J%j%jJ%
$$ y = [139, 139, 140, 140, 140, 139, 138, 138, 139, 139, 139, 138, 138, 138, 138, 138, 139, 139, 140, 140, 140, 141, 141, 141, 141, 141, 141, 140, 141, 141, 140, 140, 140, 140, 139, 140, 141, 141, 140, 140, 140, 140, 140, 140, 141, 140, 139, 139, 139, 139, 140, 140, 141, 141, 141, 140, 140, 139, 140, 140, 139, 138, 138, 138, 138, 139, 139, 139, 140, 141, 141, 142, 142, 142, 142, 141, 141, 141, 141, 141, 140, 140, 140, 140, 141, 141, 140, 139, 139, 139, 139, 140, 140, 139, 138, 138, 138, 138, 138, 139, 139, 139, 139, 139, 139, 139, 139, 139, 138, 138, 139, 139, 139, 139, 139, 139, 140, 141, 140, 139, 139, 139, 139, 140, 140, 139, 139, 139, 140, 140, 140, 141, 140, 140, 140, 140, 141, 141, 140, 140, 139, 139, 139, 138, 139, 140, 141, 141, 141, 141, 141, 141, 141, 141, 141, 140, 139, 139, 139, 140, 140, 140, 140, 140, 141, 141, 141, 140, 139, 138, 138, 138, 138, 138, 138, 139, 140, 140, 140, 141, 141, 141, 142, 142, 141, 141, 141, 141, 141, 141, 141, 141, 141, 141, 142, 142, 141, 139, 139, 139, 140, 140, 140, 140, 139, 139, 140, 141, 141, 140, 139, 139, 139, 139, 139, 139, 139, 140, 140, 141, 141, 141, 140, 140, 140, 140, 140, 140, 141, 140, 140, 141, 140, 140, 140, 140, 140, 140, 140, 140, 139, 139, 140, 140, 140, 140, 139, 140, 141, 141, 140, 141, 140, 140, 140, 140, 140, 139, 139, 138, 138, 137, 137, 137, 138, 139, 140, 141, 141, 141, 140, 140, 140, 140, 140, 140, 140, 140, 140, 140, 139, 139, 139, 139, 139, 139, 140, 140, 140, 140, 140, 141, 141, 140, 140, 140, 140, 140, 140, 140, 139, 139, 139, 138, 138, 139, 139, 139, 139, 139, 140, 140, 139, 139, 139, 139, 139, 139, 140, 139, 139, 140, 140, 140, 139, 139, 139, 139, 139, 138, 138, 137, 138, 139, 140, 140, 140, 140, 141, 141, 141, 140, 140, 141, 141, 142, 143, 144, 145, 145, 144, 143, 143, 142, 142, 141, 141, 141, 141, 141, 140, 139, 139, 138, 139, 139, 139, 139, 140, 140, 140, 140, 140, 140, 140, 139, 139, 139, 140, 141, 141, 141, 140, 140, 139, 139, 139, 140, 140, 140, 140, 140, 140, 141, 141, 140, 140, 140, 140, 139, 139, 140, 140, 140, 140, 139, 140, 140, 141, 141, 141, 142, 141, 141, 141, 140, 140, 140, 140, 140, 139, 138, 138, 138, 139, 139, 140, 140, 141, 140, 140, 141, 141, 141, 141, 140, 140, 140, 139, 139, 138, 138, 138, 138, 138, 139, 139, 139, 139, 140, 140, 140, 140, 139, 139, 140, 140, 140, 141, 141, 141, 140, 140, 140, 140, 140, 139, 138, 139, 139, 139, 140, 140, 140, 140, 140, 139, 138, 138, 139, 139, 139, 138, 138, 140, 140, 140, 140, 140, 140, 140, 140, 140, 141, 141, 141, 141, 141, 140, 140, 140, 140, 139, 138, 138, 139, 139, 139, 139, 139, 139, 139, 140, 140, 141, 141, 141, 140, 140, 140, 141, 141, 141, 141, 141, 140, 140, 140, 141, 141, 141, 141, 141, 141, 141, 142, 142, 142, 140, 140, 140, 140, 140, 141, 141, 141, 142, 142, 141, 141, 140, 141, 141]
2472A41%%%j%%J%%jjJ%%J%J%%jj%J%%j%J%%%JJ%k%%%J%j%J%%jK%j%j%%%%%jJJJj%%j%j%%J
2465A41%J%%%%j%%J%%%%J%jj%%JJJ%j%%jjjj%J%J%J%%%jjJJj%%JJjjj%jJJ%J%%jJJ%%j%%%
2458A42%%%%%%%%j%JJJj%%jJ%%%J%%%%jj%jJJ%%%%%%j%JJ%j%%Jj%%%%%%%%j%j%%J%J%%J%%
2450A44j%j%%%%%J%%%%JJ%%%J%jj%j%j%%JJ%J%%jJ%jjjJ%J%%Jj%j%j%JJ%%%JJjj%%j%%%J%
2443A44%%%J%j%J%%%jj%%%JjJJ%%J%j%%%%JJ%jjjjJ%%%%%jJJjjjJJJjjj%%J%J%%%%%j%JJ%
2436A45J%jjJJ%%jj%%j%%%%%JJJJjj%j%%J%%Jj%%JJJjjj%%J%j%j%J%%%Jj%%%%J%J%%JjjJ%
2429A47J%%Jj%%%J%%J%%%j%%%%%%%%%%j%jJ%%j%%JjjjJJ%%%%j%JJ%%%%%j%%%%jJ%%J%kj%%
2421A45%%J%%%%%JJj%j%%%%J%%J%J%%%%%j%%J%J%%%%%%%%j%j%j%%J%%%%JJj%j%%J%JJJ%%j
$$ y = [141, 141, 141, 141, 140, 140, 140, 141, 141, 141, 140, 139, 140, 140, 140, 141, 141, 142, 142, 142, 141, 140, 140, 141, 141, 141, 140, 140, 141, 141, 141, 141, 142, 143, 143, 141, 141, 141, 141, 142, 142, 141, 141, 142, 142, 142, 141, 143, 143, 142, 142, 141, 141, 141, 141, 141, 141, 140, 141, 142, 143, 142, 142, 142, 141, 141, 140, 140, 140, 141, 141, 142, 142, 142, 142, 142, 141, 141, 141, 142, 142, 142, 142, 142, 143, 143, 142, 141, 141, 141, 142, 143, 144, 144, 143, 143, 143, 142, 141, 140, 139, 139, 140, 140, 141, 141, 142, 142, 142, 142, 141, 140, 141, 142, 141, 141, 141, 142, 143, 142, 141, 140, 140, 139, 140, 141, 141, 142, 142, 142, 141, 142, 143, 143, 143, 142, 142, 142, 142, 142, 142, 142, 142, 142, 142, 142, 142, 141, 141, 142, 143, 144, 143, 143, 143, 142, 143, 143, 143, 143, 144, 144, 144, 144, 144, 143, 142, 142, 141, 142, 143, 143, 143, 143, 143, 143, 143, 142, 142, 143, 144, 144, 143, 143, 143, 144, 143, 143, 143, 143, 143, 143, 143, 143, 143, 142, 142, 141, 141, 141, 142, 142, 143, 143, 143, 144, 144, 144, 143, 143, 142, 142, 142, 142, 142, 142, 143, 143, 143, 143, 143, 144, 145, 145, 145, 145, 146, 146, 145, 144, 144, 143, 143, 142, 142, 142, 143, 144, 144, 145, 145, 145, 144, 145, 145, 144, 143, 142, 143, 143, 144, 144, 144, 145, 144, 144, 143, 143, 142, 142, 143, 144, 144, 144, 144, 145, 146, 145, 144, 144, 144, 143, 143, 143, 143, 144, 144, 144, 144, 144, 145, 145, 144, 144, 145, 145, 145, 145, 144, 143, 143, 143, 143, 144, 143, 144, 145, 145, 145, 146, 146, 145, 145, 145, 145, 145, 146, 147, 147, 146, 145, 144, 143, 144, 144, 144, 144, 144, 144, 143, 144, 145, 144, 143, 142, 143, 144, 145, 144, 143, 142, 142, 142, 143, 143, 144, 144, 144, 144, 144, 144, 143, 143, 144, 145, 145, 146, 146, 145, 144, 145, 146, 146, 146, 145, 144, 144, 144, 143, 143, 143, 143, 143, 143, 144, 145, 146, 147, 146, 145, 145, 144, 144, 144, 145, 145, 145, 146, 145, 145, 145, 146, 147, 148, 147, 146, 145, 145, 145, 146, 146, 145, 145, 144, 144, 145, 145, 145, 145, 146, 145, 145, 145, 145, 145, 146, 146, 147, 147, 147, 148, 147, 146, 147, 147, 148, 148, 148, 149, 148, 148, 148, 148, 149, 149, 149, 150, 150, 150, 150, 149, 149, 149, 149, 149, 149, 149, 149, 149, 149, 149, 148, 148, 147, 148, 148, 148, 147, 147, 147, 148, 147, 146, 145, 146, 147, 147, 147, 147, 147, 146, 146, 147, 148, 148, 148, 148, 148, 148, 147, 147, 147, 147, 147, 146, 147, 147, 147, 148, 148, 146, 145, 145, 145, 145, 145, 146, 146, 146, 146, 146, 146, 147, 148, 147, 147, 146, 146, 146, 146, 146, 147, 147, 147, 148, 148, 149, 149, 149, 149, 149, 149, 148, 148, 148, 149, 149, 150, 150, 150, 150, 150, 150, 150, 150, 150, 149, 149, 148, 148, 147, 147, 147, 148, 148, 148, 148, 148, 149, 150, 149, 149, 148, 148, 148, 149, 149, 150, 151, 152, 152, 152, 151]
2414A51j%%%%%jJ%%%j%%J%%J%jj%%%%%%%J%%JJ%J%%%j%%j%%j%%%%%%%%J%J%%J%%j%JJ%J%j
2407A54%%%%J%J%jjjJ%%jJj%%%%%j%%%%J%J%%jjJK%%j%%%%j%%%%%%JJ%J%%J%J%JJ%Jj%%j%
2399A59J%Jjj%%%j%j%%jJ%%j%%J%%jJ%%J%%jJ%%%%jJJJ%%%j%%%j%%%%%%%J%J%%%J%JJ%%%%
2392A63J%%jj%%J%%J%%jj%Jj%%J%J%%%%j%J%%%jj%%%JJ%%j%J%%J%%J%j%J%J%%%%%JJ%JJjj
2385A69j%J%%%%%%JJJ%%%%%%j%j%%J%J%%%%%JJ%%%J%%%%%%K%%j%jJJJ%%%J%j%jjJ%JJ%J%%
2377A80%j%JKJ%j%%%J%J%J%jJJj%%%%%%%J%J%%%%%%%J%JJ%%%%%J%%%%J%%%%JJ%J%%J%%%%%
2370A96J%j%%JJ%J%%%%JKJ%%%KJJ%%%%J%%%jJJJJjJ%%J%JKJ%%JJ%JJ%%%%%JJ%J%JJ%J%J%J
2363B28JJ%%%j%JJJJK%JJ%jJJJJJKKJJ%JJ%J%J%J%JJJ%JJJJJJ%JKJJJJKJJJJJ%%JKKKKJ%J
$$ y = [151, 150, 150, 150, 150, 150, 150, 149, 150, 150, 150, 150, 149, 149, 149, 150, 150, 150, 151, 151, 150, 149, 149, 149, 149, 149, 149, 149, 149, 150, 150, 150, 151, 152, 152, 153, 153, 153, 153, 152, 152, 152, 151, 151, 151, 150, 150, 150, 150, 150, 150, 150, 150, 150, 151, 151, 152, 152, 152, 153, 153, 153, 152, 152, 153, 154, 154, 155, 155, 154, 154, 154, 154, 154, 155, 155, 156, 156, 155, 154, 153, 154, 154, 154, 153, 154, 153, 153, 153, 153, 153, 153, 152, 152, 152, 152, 152, 153, 153, 154, 154, 154, 153, 152, 153, 155, 155, 155, 154, 154, 154, 154, 154, 153, 153, 153, 153, 153, 153, 153, 154, 155, 155, 156, 156, 156, 157, 157, 158, 158, 159, 160, 160, 161, 160, 160, 160, 159, 159, 160, 160, 161, 160, 159, 159, 159, 159, 158, 158, 157, 157, 157, 156, 157, 157, 157, 156, 156, 156, 157, 157, 157, 156, 157, 157, 157, 158, 158, 158, 157, 158, 158, 158, 158, 158, 157, 158, 159, 160, 160, 160, 160, 159, 159, 159, 159, 158, 158, 158, 158, 158, 158, 158, 158, 159, 159, 160, 160, 160, 160, 161, 161, 162, 163, 163, 163, 163, 163, 164, 164, 164, 163, 162, 162, 162, 163, 163, 163, 164, 164, 164, 163, 162, 162, 163, 162, 162, 162, 163, 163, 164, 164, 164, 164, 164, 163, 163, 164, 164, 164, 164, 163, 162, 162, 162, 162, 163, 164, 164, 164, 163, 163, 164, 164, 164, 165, 165, 165, 166, 166, 165, 165, 166, 166, 167, 167, 167, 167, 167, 167, 168, 169, 169, 170, 171, 170, 169, 168, 168, 169, 169, 169, 169, 169, 169, 169, 170, 171, 172, 172, 172, 172, 172, 172, 172, 171, 171, 170, 170, 170, 171, 171, 172, 172, 172, 172, 172, 172, 173, 174, 174, 174, 174, 175, 175, 175, 175, 175, 175, 175, 177, 177, 177, 176, 176, 175, 176, 177, 178, 178, 178, 178, 179, 179, 178, 178, 177, 176, 177, 177, 178, 179, 179, 180, 180, 180, 180, 179, 179, 180, 182, 183, 183, 182, 182, 182, 182, 183, 183, 184, 184, 185, 185, 184, 185, 186, 185, 185, 185, 185, 185, 185, 185, 185, 186, 186, 187, 187, 187, 187, 187, 187, 187, 187, 188, 188, 189, 190, 190, 190, 190, 190, 190, 191, 191, 191, 191, 191, 192, 192, 192, 192, 192, 193, 194, 194, 195, 195, 195, 196, 196, 196, 196, 196, 196, 197, 197, 196, 196, 196, 197, 198, 198, 199, 199, 199, 199, 199, 200, 202, 203, 203, 203, 203, 205, 206, 207, 207, 207, 207, 207, 208, 208, 208, 208, 207, 208, 209, 210, 211, 210, 211, 211, 211, 212, 212, 213, 215, 216, 216, 216, 217, 218, 218, 219, 220, 220, 220, 220, 220, 220, 221, 222, 222, 223, 223, 224, 225, 225, 226, 226, 227, 227, 228, 229, 230, 230, 230, 230, 229, 229, 230, 231, 232, 233, 235, 235, 236, 237, 237, 236, 237, 238, 239, 240, 241, 243, 245, 246, 247, 247, 248, 249, 249, 250, 250, 251, 251, 252, 252, 253, 254, 255, 255, 256, 257, 258, 259, 260, 261, 261, 262, 264, 265, 266, 267, 268, 270, 271, 272, 273, 274, 275, 275, 275, 276, 278, 280, 282, 284, 285, 285, 286]
2355B86JKKJJKKJJJJJJKLKLJJJKJJKKJKKJJKKLKKLKKKKKJKKLLLKKLKKLLMLLKKLKLLKLLLLM
2348D29LMMMMMMLLLNMMMMMMMNMMMNMNMNOMMNNNOMNNMNNNOOPOPOOOOOOPPOPPOQPQPQPQPQQQ
2341G98RQQRQQRQQRQJ0J0QRRRJ0RRJ0J0J0J0J0RJ0J0RRRRJ0RRRRJ0J0QRQQRQQQPQPPPPPOO
2335A282NOOMNNMLLKKLKKKJJ%%jjjkkkmlmmnnmonnoooppprrrpqrrqqrj0j0rrrj0rj0rj0j0
2328A055j0j1j1rrj0rj0j0rj0rrj0rj0rj0rrrrqrpprrj0qqqqqqpoppqopqpponpopoononop
2322E96mnonnnnnmonmnmnnmmlmmnmmmmmmllmmlmlllkmlllllklllklkllklkmkkkllkkkjjkm
2315C58llkjjkjkjkkjkkkjkkjkjkkkkjkkkjkjjjjjjkkkkjj%jjjkkjjjk%jkkjj%jjjjjjjjj
2308B60jkj%jjjjj%j%jj%jjj%jkjjjJ%jjjj%%jjj%jj%jj%jjjjj%%jkkj%%%j%%%%%kj%j%jj
$$ y = [286, 287, 289, 291, 292, 293, 295, 297, 298, 299, 300, 301, 302, 303, 305, 308, 310, 313, 314, 315, 316, 318, 319, 320, 322, 324, 325, 327, 329, 330, 331, 333, 335, 338, 340, 342, 345, 347, 349, 351, 353, 355, 356, 358, 360, 363, 366, 369, 371, 373, 376, 378, 380, 383, 386, 390, 393, 396, 398, 400, 403, 405, 408, 411, 413, 416, 419, 422, 425, 429, 432, 436, 440, 444, 448, 452, 456, 459, 462, 465, 470, 474, 478, 482, 486, 490, 494, 498, 503, 507, 511, 515, 520, 524, 529, 533, 538, 544, 548, 552, 557, 562, 567, 573, 577, 582, 587, 591, 596, 601, 606, 612, 618, 625, 631, 638, 644, 650, 656, 662, 668, 674, 681, 688, 694, 701, 708, 714, 722, 729, 737, 744, 752, 759, 767, 774, 782, 790, 798, 807, 815, 823, 832, 840, 848, 857, 865, 873, 882, 890, 900, 910, 918, 927, 936, 945, 955, 964, 973, 983, 993, 1003, 1013, 1023, 1032, 1042, 1052, 1061, 1070, 1079, 1088, 1098, 1107, 1116, 1125, 1134, 1144, 1154, 1162, 1171, 1179, 1187, 1196, 1204, 1212, 1220, 1227, 1235, 1242, 1249, 1256, 1263, 1270, 1276, 1282, 1287, 1293, 1299, 1303, 1308, 1313, 1317, 1320, 1323, 1325, 1327, 1330, 1332, 1334, 1336, 1337, 1338, 1338, 1338, 1337, 1336, 1335, 1333, 1331, 1329, 1325, 1322, 1318, 1314, 1309, 1304, 1300, 1294, 1289, 1284, 1278, 1272, 1266, 1259, 1252, 1245, 1236, 1227, 1218, 1211, 1203, 1194, 1185, 1177, 1169, 1160, 1150, 1140, 1131, 1122, 1113, 1103, 1094, 1084, 1075, 1065, 1055, 1045, 1034, 1023, 1014, 1005, 995, 986, 976, 966, 957, 947, 938, 929, 919, 910, 900, 891, 881, 872, 863, 854, 845, 837, 828, 821, 814, 805, 796, 786, 778, 770, 762, 754, 746, 738, 731, 725, 718, 711, 703, 697, 690, 682, 675, 668, 662, 657, 650, 644, 637, 631, 625, 620, 614, 609, 603, 596, 592, 587, 581, 576, 571, 566, 561, 556, 552, 546, 541, 537, 532, 528, 523, 518, 514, 510, 507, 503, 499, 494, 490, 486, 482, 478, 474, 470, 467, 464, 460, 456, 453, 449, 446, 443, 440, 438, 434, 431, 428, 425, 422, 419, 417, 414, 411, 408, 406, 403, 401, 398, 395, 393, 390, 388, 384, 382, 380, 378, 375, 372, 370, 368, 366, 365, 364, 362, 358, 355, 352, 350, 349, 348, 346, 345, 343, 342, 340, 338, 337, 335, 333, 331, 330, 328, 326, 325, 323, 322, 320, 318, 316, 314, 313, 311, 309, 307, 306, 304, 303, 302, 301, 300, 299, 298, 296, 294, 292, 290, 289, 288, 288, 287, 286, 285, 283, 281, 280, 279, 278, 276, 276, 275, 273, 271, 270, 269, 269, 268, 267, 266, 265, 264, 263, 262, 261, 260, 259, 257, 256, 256, 255, 254, 253, 252, 251, 251, 250, 250, 249, 248, 248, 247, 246, 245, 245, 244, 242, 241, 240, 239, 240, 240, 239, 238, 237, 236, 236, 236, 235, 234, 233, 233, 232, 231, 231, 230, 229, 229, 228, 227, 226, 225, 224, 224, 224, 223, 221, 219, 218, 218, 218, 218, 217, 217, 217, 217, 217, 217, 215, 214, 214, 213, 213, 212, 211]
2300B11%%jj%jj%%%%jjj%%%%%jjjj%%%%%%J%jj%jj%%%jjJ%jjjj%%jj%j%j%%%%%Jj%j%j%%%
2293A86%%J%%%%%j%jjj%j%%%%%j%%Jj%j%%J%jjjjJ%%%%j%%%%Jjjj%J%%jjjj%%%%j%%%JJ%j
2286A72%j%%%j%Jjjj%%%%%%%%j%%J%%%%%j%%%%%%%%%%%%%%%%%%%%%J%jj%%%jJ%j%jjjJJ%%
2278A64%%%j%%%Jj%%j%%%j%%%%%J%%%%%%%j%j%%%%j%%j%%%%%jJ%JJ%jJ%j%%%jj%KJ%j%jjj
2271A56jJ%%JJ%kj%%%%J%%j%%%%%jJ%%j%%%%jj%KJjJ%%%%%jj%%%J%%%j%j%J%kJ%%J%%%%%%
2264A53%%%%j%Jj%%%j%%%%jjJ%%%%Jj%%J%%%j%%%%%j%%%%JJ%%kjJJjJ%Jj%J%j%%%%%j%%%j
2256A48%Jj%%J%%j%%JJj%j%%%%jJ%%%j%J%%%%j%%j%jJ%J%%%j%J%%J%%jj%%j%%%%%%J%J%j%
2249A46%%%%%%%J%%%jjJj%JJj%%%%%jjJ%%%%%%%%%J%%j%%%%J%j%%%%%%%%J%Jj%%%%%%%j%%
$$ y = [211, 211, 211, 210, 209, 209, 208, 207, 207, 207, 207, 207, 206, 205, 204, 204, 204, 204, 204, 204, 203, 202, 201, 200, 200, 200, 200, 200, 200, 200, 201, 201, 200, 199, 199, 198, 197, 197, 197, 197, 196, 195, 196, 196, 195, 194, 193, 192, 192, 192, 191, 190, 190, 189, 189, 188, 188, 188, 188, 188, 188, 189, 188, 188, 187, 187, 186, 186, 186, 186, 186, 186, 187, 187, 187, 187, 187, 187, 186, 186, 185, 184, 183, 183, 182, 182, 182, 182, 182, 182, 181, 181, 181, 182, 181, 181, 180, 180, 180, 181, 181, 180, 179, 178, 177, 178, 178, 178, 178, 178, 177, 177, 177, 177, 177, 178, 177, 176, 175, 175, 176, 176, 176, 175, 174, 173, 172, 172, 172, 172, 172, 171, 171, 171, 171, 172, 173, 173, 172, 172, 171, 171, 171, 171, 170, 170, 171, 170, 169, 168, 168, 168, 168, 168, 168, 168, 168, 168, 167, 167, 167, 168, 168, 168, 168, 168, 168, 167, 167, 167, 167, 167, 167, 167, 167, 167, 167, 167, 167, 167, 167, 167, 167, 167, 167, 167, 167, 167, 167, 168, 168, 167, 166, 166, 166, 166, 165, 166, 166, 165, 165, 164, 163, 162, 163, 164, 164, 164, 164, 164, 164, 163, 163, 163, 163, 164, 163, 163, 163, 162, 162, 162, 162, 161, 161, 161, 161, 161, 161, 162, 162, 162, 162, 162, 162, 162, 162, 161, 161, 160, 160, 160, 160, 160, 159, 159, 159, 158, 158, 158, 158, 158, 158, 157, 158, 158, 159, 160, 160, 159, 160, 160, 159, 159, 159, 159, 158, 157, 157, 159, 160, 160, 159, 159, 158, 157, 156, 155, 156, 156, 156, 157, 158, 158, 156, 155, 155, 155, 155, 155, 156, 156, 156, 155, 155, 155, 155, 155, 155, 154, 155, 155, 155, 154, 154, 154, 154, 154, 153, 152, 152, 154, 155, 154, 155, 155, 155, 155, 155, 155, 154, 153, 153, 153, 153, 154, 154, 154, 154, 153, 153, 152, 152, 153, 153, 151, 152, 152, 152, 153, 153, 153, 153, 153, 153, 153, 153, 153, 153, 153, 152, 152, 153, 152, 152, 152, 152, 151, 151, 151, 151, 151, 150, 149, 150, 150, 150, 150, 150, 151, 150, 150, 150, 151, 151, 151, 151, 150, 150, 150, 150, 150, 150, 149, 149, 149, 149, 149, 150, 151, 151, 151, 149, 148, 149, 150, 149, 150, 150, 151, 150, 150, 151, 151, 150, 150, 150, 150, 150, 150, 149, 149, 149, 149, 148, 148, 149, 148, 148, 148, 149, 149, 149, 148, 148, 148, 149, 150, 149, 149, 148, 148, 148, 148, 148, 147, 148, 148, 148, 148, 147, 147, 148, 148, 148, 148, 148, 147, 147, 147, 146, 146, 145, 146, 146, 147, 147, 147, 147, 146, 146, 147, 147, 147, 148, 148, 148, 147, 146, 146, 146, 145, 145, 145, 145, 145, 145, 145, 146, 146, 147, 147, 146, 146, 146, 146, 146, 146, 146, 146, 146, 147, 147, 147, 147, 146, 145, 146, 145, 145, 146, 147, 146, 146, 146, 146, 146, 146, 145, 144, 145, 145, 145, 145, 145, 145, 145, 145, 145, 145, 146, 146, 146, 145, 145, 145, 145, 145, 146, 146, 145, 145, 145, 145, 145, 145, 145, 145, 145, 146, 146, 147, 146, 146, 146, 146, 146, 146, 146, 146, 145, 145, 145]
2242A45%%%%j%%%%%%%%%%kJJJ%j%%%%%%jjJJ%jJ%JJj%%j%%j%j%%%JJj%%%j%%%%%%%%%%%%J
2235A43JJ%%%%%j%jJ%J%%j%%j%j%j%%%%%%%J%%J%JJ%%j%Jj%%j%%%%%%%%J%%%%Jj%jj%%J%J
2227A44K%kk%%%j%%%%%%%%J%%jJ%J%%J%%JJ%jjJ%%j%%%J%%J%%j%j%%%%%%%%%%J%%j%jJJ%J
2220A46%%%%J%JJ%jj%J%J%J%%J%%%%JJJJ%JJJJ%JJKJKJJLKKLMMMNOOQQJ1J2J5J7K1K6L1L7
2213C93M0M4M3L8L0J8Noj7k6l1l4l6l6l4l2k9k7k3j8j6j3j1rrqonnmllkkkkkljjj%jj%j%j
2208A50%%jjjjj%%%%%%j%%jj%%%%%j%j%%%%%%%J%%%j%%%%%%%%%%%%%%j%%J%%J%jj%%J%%%%
2201A40j%%j%%%JjjJJ%J%J%Jjj%j%j%%%%J%%j%%%%%jJJJJ%j%j%%%j%%j%%JJJj%%%%%j%J%j
2194A38%%J%j%J%%%%%%jJ%%%j%%%%%%J%jj%%JJ%j%%%j%%%J%%Jj%J%%%jjjJ%%%JJJ%jj%J%%
$$ y = [145, 145, 145, 145, 145, 144, 144, 144, 144, 144, 144, 144, 144, 144, 144, 144, 142, 143, 144, 145, 145, 144, 144, 144, 144, 144, 144, 144, 143, 142, 143, 144, 144, 143, 144, 144, 145, 146, 145, 145, 145, 144, 144, 144, 143, 143, 142, 142, 142, 142, 143, 144, 143, 143, 143, 143, 142, 142, 142, 142, 142, 142, 142, 142, 142, 142, 142, 142, 142, 143, 144, 145, 145, 145, 145, 145, 145, 144, 144, 143, 144, 144, 145, 145, 145, 144, 144, 144, 143, 143, 142, 142, 141, 141, 141, 141, 141, 141, 141, 141, 142, 142, 142, 143, 143, 144, 145, 145, 145, 144, 144, 145, 144, 144, 144, 143, 143, 143, 143, 143, 143, 143, 143, 143, 144, 144, 144, 144, 144, 145, 144, 144, 143, 142, 142, 142, 143, 143, 144, 146, 146, 144, 142, 142, 142, 142, 141, 141, 141, 141, 141, 141, 141, 141, 141, 142, 142, 142, 141, 142, 142, 143, 143, 143, 144, 144, 144, 145, 146, 146, 145, 144, 145, 145, 145, 144, 144, 144, 144, 145, 145, 145, 146, 146, 146, 145, 145, 144, 144, 144, 144, 144, 144, 144, 144, 144, 144, 144, 145, 145, 145, 144, 144, 143, 144, 145, 145, 146, 146, 146, 146, 146, 147, 147, 148, 149, 149, 148, 147, 147, 148, 148, 149, 149, 150, 150, 150, 151, 151, 151, 151, 151, 152, 153, 154, 155, 155, 156, 157, 158, 159, 159, 160, 161, 163, 164, 166, 167, 168, 171, 173, 175, 178, 182, 186, 190, 195, 201, 207, 215, 223, 234, 246, 261, 278, 299, 325, 356, 393, 433, 477, 520, 558, 588, 606, 611, 605, 588, 562, 531, 497, 461, 425, 391, 359, 330, 303, 280, 262, 246, 233, 222, 213, 204, 196, 190, 185, 180, 176, 173, 170, 168, 166, 164, 162, 160, 157, 156, 155, 154, 154, 153, 152, 152, 151, 151, 150, 150, 150, 149, 148, 147, 146, 145, 145, 145, 145, 145, 145, 145, 144, 144, 144, 143, 142, 142, 142, 142, 142, 142, 141, 141, 140, 140, 140, 140, 140, 140, 140, 140, 141, 141, 141, 141, 140, 140, 140, 140, 140, 140, 140, 140, 140, 140, 140, 140, 140, 140, 140, 139, 139, 139, 140, 140, 140, 141, 141, 140, 139, 139, 139, 140, 140, 140, 140, 140, 139, 139, 139, 138, 138, 138, 138, 139, 138, 137, 138, 139, 139, 140, 140, 141, 141, 142, 141, 140, 140, 139, 139, 138, 138, 138, 138, 138, 139, 139, 139, 138, 138, 138, 138, 138, 138, 137, 138, 139, 140, 141, 141, 140, 140, 139, 139, 139, 139, 138, 138, 138, 137, 137, 137, 138, 139, 140, 139, 139, 139, 139, 139, 139, 138, 138, 139, 139, 138, 138, 138, 139, 139, 138, 138, 139, 139, 139, 139, 139, 139, 139, 138, 139, 139, 139, 139, 138, 138, 138, 138, 138, 138, 138, 139, 139, 138, 137, 137, 137, 138, 139, 139, 138, 138, 138, 138, 137, 137, 137, 137, 138, 138, 138, 139, 138, 138, 139, 139, 139, 139, 138, 137, 136, 137, 137, 137, 137, 138, 139, 140, 140, 139, 138, 138, 139, 139, 139]
2186A39%jj%%%%%J%%Jj%%%%J%%%%%jJ%jj%%%%%%JJ%%j%%%%jj%%J%J%Jj%j%%%j%%J%%%%%%%
2179A37%%%%%j%%%%JJjJj%%JjJ%jJ%%%Jj%%JJ%%%j%j%%%J%%%%%j%%%j%%%j%%%J%%Jjjj%J%
2172A36%J%%%%j%%%%%JJ%j%%%%J%%%%%j%j%%jJ%J%J%%%%j%jJ%%%%%%jJ%%%%J%%jjjj%j%J%
2164A34%J%J%%j%%%%%%JJ%%j%%%%J%Jjj%J%%j%JjjjJ%J%%%J%%j%j%%%J%%J%%J%j%%%%J%%%
2157A38j%%J%%%jJ%%%%jJ%%%%J%jjj%%Jj%j%JjJJ%j%Jj%%J%%%jJ%%%%%j%%%J%%%%%%%j%%j
2150A35%%Jj%%%J%j%%%%%%%%J%%jjj%%KJ%jj%%%JJ%jJ%J%%%%%%%j%%%%%%%J%j%%%%j%%%%J
2143A36J%%%%%J%%j%j%%%%j%%%j%J%%J%J%%%%%%%%j%%%%%j%j%%J%%%%%%%J%%%%k%%J%j%JJ
2135A36%%j%%j%JJJ%%j%%J%%%j%%j%%%%%%%%J%j%%%%jJJ%%%%%j%j%%%%%J%%JJ%jjj%J%%%j
$$ y = [139, 139, 138, 137, 137, 137, 137, 137, 137, 138, 138, 138, 139, 138, 138, 138, 138, 138, 139, 139, 139, 139, 139, 139, 138, 139, 139, 138, 137, 137, 137, 137, 137, 137, 137, 138, 139, 139, 139, 138, 138, 138, 138, 138, 137, 136, 136, 136, 137, 137, 138, 138, 139, 138, 138, 137, 137, 137, 137, 136, 136, 136, 137, 137, 137, 137, 137, 137, 137, 137, 137, 137, 137, 137, 137, 136, 136, 136, 136, 136, 137, 138, 137, 138, 137, 137, 137, 138, 137, 138, 138, 137, 138, 138, 138, 138, 139, 138, 138, 138, 139, 140, 140, 140, 140, 139, 139, 138, 138, 138, 138, 139, 139, 139, 139, 139, 139, 138, 138, 138, 138, 137, 137, 137, 137, 136, 136, 136, 136, 137, 137, 137, 138, 137, 136, 135, 135, 136, 136, 136, 137, 137, 137, 137, 137, 136, 136, 136, 136, 136, 136, 137, 138, 138, 137, 137, 137, 137, 137, 138, 138, 138, 138, 138, 138, 137, 137, 136, 136, 136, 135, 136, 136, 137, 137, 138, 138, 138, 138, 138, 137, 137, 136, 137, 137, 137, 137, 137, 137, 137, 136, 137, 137, 137, 137, 137, 138, 138, 138, 137, 136, 135, 134, 134, 133, 133, 134, 134, 134, 135, 135, 136, 136, 136, 135, 135, 135, 135, 135, 135, 135, 136, 137, 137, 137, 136, 136, 136, 136, 136, 137, 137, 138, 137, 136, 136, 137, 137, 137, 136, 136, 137, 136, 135, 134, 135, 135, 136, 136, 136, 136, 137, 137, 137, 136, 136, 135, 135, 135, 135, 136, 136, 136, 137, 137, 137, 138, 138, 137, 137, 137, 137, 137, 138, 138, 138, 138, 137, 137, 137, 138, 138, 138, 138, 137, 138, 138, 138, 138, 138, 137, 138, 138, 138, 138, 138, 139, 139, 138, 137, 136, 136, 136, 137, 136, 136, 135, 135, 136, 135, 136, 137, 137, 136, 136, 137, 136, 136, 136, 137, 137, 137, 137, 136, 137, 137, 137, 137, 137, 137, 136, 136, 136, 136, 137, 137, 137, 137, 137, 137, 137, 137, 136, 136, 136, 135, 135, 135, 136, 135, 135, 135, 135, 136, 136, 135, 135, 135, 135, 135, 135, 135, 135, 135, 136, 136, 136, 135, 134, 133, 133, 133, 135, 136, 136, 135, 134, 134, 134, 134, 135, 136, 136, 135, 136, 136, 137, 137, 137, 137, 137, 137, 137, 137, 136, 136, 136, 136, 136, 136, 136, 136, 137, 137, 136, 136, 136, 136, 136, 135, 135, 135, 135, 135, 136, 137, 137, 137, 137, 137, 137, 138, 138, 138, 137, 137, 136, 136, 136, 136, 136, 135, 135, 135, 135, 134, 134, 135, 135, 135, 136, 136, 137, 137, 137, 137, 137, 137, 137, 137, 137, 136, 136, 136, 136, 136, 136, 135, 135, 134, 134, 134, 135, 135, 135, 135, 135, 135, 135, 135, 136, 136, 136, 136, 136, 134, 134, 134, 135, 135, 134, 134, 135, 136, 136, 136, 135, 135, 135, 134, 134, 135, 136, 137, 137, 137, 136, 136, 136, 137, 137, 137, 137, 136, 136, 136, 135, 135, 135, 135, 135, 135, 135, 135, 135, 136, 136, 135, 135, 135, 135, 135, 134, 135, 136, 136, 136, 136, 136, 136, 135, 135, 134, 134, 134, 134, 134, 134, 135, 135, 135, 136, 137, 137, 136, 135, 134, 134, 135, 135, 135, 135, 134]
2128A34%JJ%%jJjj%J%%JJ%jj%J%%%%j%j%%%%J%%%%J%%j%j%jJ%JJ%%%J%j%%%j%%%%J%j%JJ%
2121A37%j%%%%%%j%j%%J%%%%J%J%%%j%j%%J%%%J%j%j%j%%%%%Jj%%J%jjJ%JJ%%j%J%%j%%%j
2113A34%%JJ%%%j%%%%%%%J%Jj%j%%%J%j%%%%Jj%j%%%Jj%J%%%%%%j%Jj%%%%%%%%J%%%%JjjJ
2106A35%%%%%JJj%jJ%%%%%%jj%jjJJJJj%%%J%%%%J%j%%j%%%%%%jJ%%%jJ%%J%%%%jj%%%%%J
2099A35jJJj%%%%%%%%%Jj%%%%j%%Jj%%J%j%%%%Jj%%J%J%%j%jjJ%%J%jJ%J%%jj%%j%%J%Jj%
2091A34Jjj%J%%%J%%j%%jJ%%j%%%J%Jj%%%%j%%%%%J%jJ%%%%%%%%%%%%%%j%J%%Jj%%%%%%%%
2084A34%%%j%%Jj%%J%%%%%j%%%%Jj%KJ%j%%%j%j%%j%%J%j%JJ%JJjjjJ%%jJ%%%%%Jj%%j%%j
2077A32%JjJ%%J%%%%%%K%%j%%%j%J%%jj%%K%%%%j%%%%%J%%j%%j%j%%JJ%Jj%J%%%%%j%%%JJ
$$ y = [134, 134, 135, 136, 136, 136, 135, 136, 135, 134, 134, 135, 135, 135, 136, 137, 137, 136, 135, 135, 136, 136, 136, 136, 136, 135, 135, 134, 134, 134, 134, 134, 135, 135, 135, 135, 135, 136, 136, 136, 135, 135, 134, 134, 133, 134, 134, 135, 136, 136, 136, 136, 137, 137, 136, 136, 136, 136, 135, 135, 135, 135, 135, 136, 136, 135, 135, 136, 137, 137, 137, 136, 136, 136, 136, 136, 136, 136, 135, 135, 134, 134, 134, 135, 135, 135, 135, 135, 136, 136, 137, 137, 137, 137, 136, 136, 135, 135, 135, 136, 136, 136, 136, 137, 137, 136, 136, 135, 135, 134, 134, 134, 134, 134, 134, 135, 134, 134, 134, 135, 135, 134, 133, 134, 134, 135, 136, 136, 136, 135, 135, 136, 136, 136, 135, 135, 135, 135, 134, 134, 134, 135, 136, 136, 136, 136, 135, 135, 135, 135, 135, 135, 135, 135, 136, 136, 137, 136, 136, 135, 135, 135, 135, 136, 136, 135, 135, 135, 135, 135, 136, 135, 135, 134, 134, 134, 134, 135, 134, 134, 135, 135, 135, 135, 135, 135, 135, 134, 134, 135, 134, 134, 134, 134, 134, 134, 134, 134, 134, 135, 135, 135, 135, 135, 136, 135, 134, 135, 135, 135, 135, 135, 135, 136, 137, 136, 136, 135, 136, 136, 136, 136, 136, 136, 136, 135, 134, 134, 133, 132, 133, 134, 135, 136, 135, 135, 135, 135, 136, 136, 136, 136, 136, 137, 137, 136, 136, 136, 135, 135, 135, 135, 135, 135, 135, 134, 135, 135, 135, 135, 134, 135, 135, 135, 136, 136, 136, 136, 136, 135, 134, 134, 134, 134, 134, 134, 135, 134, 135, 136, 135, 135, 135, 135, 135, 135, 135, 135, 135, 135, 136, 135, 135, 135, 135, 135, 134, 134, 134, 135, 134, 134, 134, 135, 135, 134, 134, 134, 134, 134, 135, 134, 134, 134, 135, 135, 136, 136, 136, 135, 135, 134, 133, 134, 134, 134, 135, 135, 134, 135, 135, 136, 136, 136, 135, 134, 134, 134, 133, 133, 133, 134, 134, 135, 134, 134, 135, 134, 133, 133, 134, 134, 134, 134, 135, 135, 135, 134, 134, 134, 133, 134, 134, 134, 133, 133, 133, 133, 134, 134, 135, 134, 134, 134, 134, 134, 133, 133, 133, 133, 133, 133, 134, 134, 133, 134, 134, 134, 134, 134, 134, 134, 134, 134, 134, 134, 134, 134, 134, 134, 133, 133, 134, 134, 134, 135, 134, 134, 134, 134, 134, 134, 134, 134, 134, 134, 134, 134, 133, 133, 133, 134, 133, 133, 133, 134, 134, 134, 134, 134, 134, 133, 133, 133, 133, 133, 134, 133, 133, 135, 136, 136, 135, 135, 135, 135, 134, 134, 133, 133, 133, 132, 132, 132, 133, 133, 132, 132, 133, 134, 134, 135, 136, 135, 134, 133, 134, 134, 134, 133, 134, 134, 134, 134, 134, 134, 135, 134, 134, 134, 133, 133, 133, 132, 132, 133, 132, 133, 133, 133, 134, 134, 134, 134, 134, 134, 134, 136, 136, 136, 135, 135, 135, 135, 134, 134, 135, 135, 135, 134, 133, 133, 133, 135, 135, 135, 135, 135, 134, 134, 134, 134, 134, 134, 135, 135, 135, 134, 134, 134, 133, 133, 132, 132, 132, 133, 134, 134, 135, 134, 134, 135, 135, 135, 135, 135, 135, 134, 134, 134, 134, 135, 136]
2069A36jjj%%J%%%%%%%%%%J%%j%%%%%J%%j%jJ%%J%jj%%J%jj%%%jJJ%J%%%%%%%Jj%%%%j%j%
2062A32%%%%JJj%j%Jj%j%J%%jJ%%J%%jj%%J%JJJJkjj%%%J%JJ%%j%j%jj%jJJ%JJJj%%%j%%%
2055A33J%%%j%j%%%J%%%%%%J%%%jj%%%J%JJ%%j%jjJ%J%%%%%%%%%%j%j%KJ%jJ%j%j%%%Jj%j
2048A32%jJ%J%%J%%%%%jJJJ%jjj%%%%Jj%%%%%%%%%%%j%%%J%j%%J%%%%%%%%%%%J%j%%%%%%%
2040A33J%%%%j%%j%%JJ%%Jj%%j%%%%%%%%%jJ%JJj%j%j%%J%jJJ%j%J%%j%%%%J%Jj%%j%Jjj%
2033A32%%%%%%%%%%%%J%J%%jjjJ%%%%%%JJj%%%j%%J%%%%j%%%JJ%j%%j%%%%J%%j%%Jjj%%%J
2026A32JJ%%J%%jjj%%J%j%jjj%J%JJ%%%%%Jj%Jj%%%j%J%%%%%%J%%%J%j%j%%J%%J%j%jj%J%
2018A32Jj%%Jj%j%%%j%%%%%%%%%%J%%%%%%%%j%%JjjJj%J%%%J%j%%%%%J%J%J%j%j%J%%%j%%
$$ y = [136, 135, 134, 133, 133, 133, 134, 134, 134, 134, 134, 134, 134, 134, 134, 134, 134, 135, 135, 135, 134, 134, 134, 134, 134, 134, 135, 135, 135, 134, 134, 133, 134, 134, 134, 135, 135, 134, 133, 133, 133, 134, 134, 133, 132, 132, 132, 132, 131, 132, 133, 133, 134, 134, 134, 134, 134, 134, 134, 134, 135, 134, 134, 134, 134, 134, 133, 133, 132, 132, 132, 132, 132, 132, 133, 134, 133, 133, 132, 132, 133, 132, 132, 131, 131, 132, 132, 132, 131, 132, 132, 132, 133, 133, 133, 132, 131, 131, 131, 132, 132, 133, 134, 135, 136, 134, 133, 132, 132, 132, 132, 133, 133, 134, 135, 135, 135, 134, 134, 133, 133, 132, 131, 131, 130, 131, 132, 132, 133, 134, 135, 134, 134, 134, 134, 133, 133, 133, 133, 134, 134, 134, 134, 133, 133, 132, 132, 132, 132, 133, 133, 133, 133, 133, 133, 133, 134, 134, 134, 134, 133, 132, 132, 132, 132, 133, 133, 134, 135, 135, 135, 134, 134, 133, 132, 133, 133, 134, 134, 134, 134, 134, 134, 134, 134, 134, 134, 134, 133, 133, 132, 132, 134, 135, 135, 134, 135, 135, 134, 134, 133, 133, 133, 133, 134, 133, 133, 132, 132, 131, 132, 132, 133, 133, 133, 134, 134, 134, 134, 134, 134, 133, 134, 135, 136, 136, 135, 134, 133, 133, 133, 133, 133, 134, 133, 133, 133, 133, 133, 133, 133, 133, 133, 133, 133, 133, 132, 132, 132, 132, 133, 133, 132, 132, 132, 133, 133, 133, 133, 133, 133, 133, 133, 133, 133, 133, 133, 134, 134, 133, 133, 133, 133, 133, 133, 133, 133, 134, 134, 134, 134, 134, 133, 133, 133, 132, 132, 132, 133, 134, 134, 134, 135, 134, 134, 134, 133, 133, 133, 133, 133, 133, 133, 133, 133, 133, 132, 133, 133, 134, 135, 134, 134, 133, 133, 132, 132, 132, 133, 133, 132, 133, 134, 134, 133, 133, 134, 134, 134, 133, 133, 133, 133, 133, 134, 134, 135, 134, 134, 134, 133, 133, 134, 133, 132, 132, 132, 132, 132, 132, 132, 132, 132, 132, 132, 132, 132, 132, 133, 133, 134, 134, 134, 133, 132, 131, 132, 132, 132, 132, 132, 132, 132, 133, 134, 133, 133, 133, 133, 132, 132, 132, 133, 133, 133, 133, 133, 132, 132, 132, 132, 133, 134, 134, 133, 133, 133, 132, 132, 132, 132, 132, 133, 133, 133, 132, 132, 132, 133, 132, 131, 131, 131, 131, 132, 133, 134, 134, 134, 135, 135, 135, 134, 133, 132, 132, 132, 133, 133, 132, 132, 131, 130, 129, 129, 130, 130, 131, 132, 132, 132, 132, 132, 132, 133, 132, 132, 133, 132, 132, 132, 132, 131, 131, 132, 132, 132, 132, 132, 132, 132, 133, 133, 133, 133, 134, 134, 133, 133, 132, 132, 132, 133, 133, 133, 134, 134, 133, 133, 132, 131, 131, 132, 132, 133, 132, 132, 132, 133, 132, 132, 131, 131, 131, 131, 130, 130, 130, 130, 130, 130, 130, 130, 130, 130, 130, 131, 131, 131, 131, 131, 131, 131, 131, 131, 130, 130, 130, 131, 130, 129, 130, 129, 129, 130, 130, 130, 130, 131, 131, 130, 130, 130, 130, 130, 130, 131, 131, 132, 132, 133, 133, 132, 132, 131, 131, 132, 132, 132, 132, 131, 131, 131]
2011A31%J%%j%%J%jj%%J%%%%%%%%%%J%%%jJ%%%%j%%%%%%jj%%J%JJ%%%%jJj%j%%J%J%%j%%j
2004A30JJJ%%%%j%%%%J%%%%%J%%%jk%%%J%%%%%J%%jJJj%%%%%%%%%%%j%%%jJ%JJ%%j%J%%j%
1996A33j%%J%j%%JJ%jj%%JjJ%%j%%%%%j%%jJ%%%J%%j%jJJJ%%%jJJ%j%%jJ%%%jj%J%Jj%%J%
1989A33j%%%%J%%%%%%%%%%%jjJ%Jjj%%K%%%J%%J%%%j%j%%%%%j%jjKJ%Jj%%%%%%%jj%%J%J%
1982A33%J%%j%j%%%%J%%%%%%%J%Jj%j%j%%%J%%%%%j%J%%Jj%j%J%%%J%%jJ%J%jjjj%%%%%%J
1974A32%%%JJjj%%%%J%%j%%J%J%j%%%%j%%%J%%%%j%j%JJ%JJ%jj%%%%%jj%%%j%JJ%%%j%%%J
1967A32%jJJ%j%J%%%%%j%jJ%%J%J%%j%%%j%%%%%j%JJ%j%%jJ%%jJ%J%%jj%JjJ%%%%%%%J%%j
1960A32J%jj%%%%%%%%j%%%%JJ%%%%%%%%%%%%jJ%%J%%J%jjj%%%JJ%%%%j%%%%%%%j%%%J%j%%
$$ y = [131, 131, 132, 132, 132, 131, 131, 131, 132, 132, 131, 130, 130, 130, 131, 131, 131, 131, 131, 131, 131, 131, 131, 131, 131, 132, 132, 132, 132, 131, 132, 132, 132, 132, 132, 131, 131, 131, 131, 131, 131, 131, 130, 129, 129, 129, 130, 130, 131, 132, 132, 132, 132, 132, 131, 132, 131, 131, 130, 130, 130, 131, 131, 132, 132, 132, 131, 131, 131, 130, 131, 132, 133, 133, 133, 133, 133, 132, 132, 132, 132, 132, 133, 133, 133, 133, 133, 133, 134, 134, 134, 134, 133, 131, 131, 131, 131, 132, 132, 132, 132, 132, 132, 133, 133, 133, 132, 133, 134, 133, 133, 133, 133, 133, 133, 133, 133, 133, 133, 133, 133, 132, 132, 132, 132, 131, 132, 132, 133, 134, 134, 134, 133, 133, 134, 134, 134, 133, 133, 132, 132, 132, 133, 133, 132, 132, 132, 133, 134, 134, 133, 132, 132, 132, 133, 132, 133, 133, 133, 132, 132, 132, 132, 132, 132, 131, 131, 131, 130, 131, 131, 131, 131, 132, 132, 132, 131, 131, 130, 131, 132, 133, 133, 133, 133, 132, 133, 134, 134, 133, 133, 133, 132, 133, 133, 133, 133, 132, 131, 131, 132, 132, 133, 132, 132, 132, 133, 133, 132, 132, 132, 132, 132, 133, 133, 133, 133, 133, 133, 133, 133, 133, 133, 133, 133, 132, 131, 132, 132, 133, 132, 131, 131, 131, 133, 133, 133, 133, 134, 134, 134, 135, 135, 135, 135, 134, 134, 133, 133, 133, 133, 133, 133, 132, 132, 131, 130, 132, 133, 133, 134, 133, 133, 133, 133, 133, 133, 133, 133, 132, 131, 131, 131, 132, 132, 133, 133, 133, 134, 134, 134, 133, 133, 132, 132, 132, 132, 132, 133, 133, 133, 133, 133, 133, 133, 133, 134, 134, 135, 134, 134, 133, 133, 132, 132, 132, 132, 133, 133, 133, 133, 133, 133, 132, 132, 133, 133, 133, 134, 133, 133, 132, 132, 133, 133, 133, 133, 134, 134, 134, 133, 134, 134, 135, 135, 134, 133, 132, 131, 131, 131, 131, 131, 131, 131, 132, 132, 132, 132, 133, 134, 133, 132, 132, 132, 132, 132, 133, 133, 133, 132, 132, 132, 133, 133, 134, 134, 133, 133, 133, 133, 133, 132, 132, 132, 132, 133, 133, 133, 133, 133, 132, 132, 131, 131, 132, 133, 133, 134, 135, 135, 134, 133, 133, 133, 133, 133, 133, 132, 131, 131, 131, 131, 130, 130, 131, 132, 132, 132, 132, 131, 131, 131, 131, 132, 132, 131, 132, 133, 133, 132, 132, 133, 133, 133, 133, 133, 133, 132, 132, 131, 132, 132, 132, 133, 133, 134, 134, 134, 133, 133, 133, 133, 132, 132, 132, 132, 132, 132, 131, 131, 132, 133, 133, 132, 132, 132, 131, 132, 132, 132, 131, 132, 132, 133, 133, 133, 132, 131, 131, 132, 131, 132, 132, 132, 132, 132, 132, 132, 132, 133, 133, 133, 132, 133, 133, 132, 131, 131, 131, 131, 131, 131, 131, 131, 131, 130, 130, 130, 130, 130, 131, 132, 132, 132, 132, 132, 132, 132, 132, 132, 132, 132, 132, 132, 131, 132, 132, 132, 133, 133, 133, 134, 134, 133, 132, 131, 131, 131, 131, 132, 133, 133, 133, 133, 133, 132, 132, 132, 132, 132, 132, 132, 132, 131, 131, 131, 131, 132, 132, 131, 131, 131]
1952A31%%%JJ%jj%%%%J%J%j%%JJ%%jjj%%J%jJ%%J%%%j%%%%%%j%%j%j%jKJJJ%j%%J%%Jj%%j
1945A32%%j%jJJJ%%J%%j%%%%%%%%jj%%%j%JJ%%J%jj%j%%J%%J%%%%%%%%j%%j%%%%J%%jJ%%%
1938A31%j%%JJ%j%%%%j%%%%%%J%%%%j%JJj%j%%JJ%j%%%%J%J%%j%%%jj%%%%J%%%%jJ%%%%%%
1931A31%J%%jjj%JJJ%%J%%j%%%%%%j%%%%%%%%%%jJ%%%%jJ%%%%%%j%%%%%J%%JJj%j%%J%%%%
1923A32j%J%%jjJ%%Jj%JJJ%%%%%%%j%%JJ%%j%%j%%%%%%%jJJjj%jKJ%%j%%%%%%%%%%j%J%%%
1916A33j%j%jKJ%%jjJ%JJj%%%%%%%%%%%%%%%J%k%J%%%%J%Jj%j%%j%%%%j%J%%JJJj%%j%jJ%
1909A33%%j%%%%%%J%%%jKJjj%%%%%%%j%%J%j%J%%j%%%%%J%jj%%%%%J%%%%%j%%%J%J%j%%%%
1901A32%JJjj%jJ%%%%%%jJ%%%jjjJJ%JjjJ%%J%%%%%Jjj%%%%J%%%Jj%%%J%j%%%%%j%jJJJ%j
$$ y = [131, 131, 131, 131, 132, 133, 133, 132, 131, 131, 131, 131, 131, 132, 132, 133, 133, 132, 132, 132, 133, 134, 134, 134, 133, 132, 131, 131, 131, 132, 132, 131, 132, 132, 132, 133, 133, 133, 133, 132, 132, 132, 132, 132, 132, 132, 131, 131, 131, 130, 130, 129, 129, 128, 130, 131, 132, 133, 133, 132, 132, 132, 133, 133, 133, 134, 133, 133, 133, 132, 132, 132, 131, 131, 130, 131, 132, 133, 133, 133, 134, 134, 134, 133, 133, 133, 133, 133, 133, 133, 133, 133, 132, 131, 131, 131, 131, 130, 130, 131, 132, 132, 132, 133, 133, 132, 131, 131, 130, 130, 130, 131, 131, 131, 132, 132, 132, 132, 132, 132, 132, 132, 132, 131, 131, 131, 130, 130, 130, 130, 130, 131, 131, 131, 130, 131, 131, 131, 131, 131, 130, 130, 130, 131, 132, 132, 131, 131, 131, 131, 131, 130, 130, 130, 130, 130, 130, 130, 131, 131, 131, 131, 131, 130, 130, 131, 132, 131, 131, 130, 130, 130, 131, 132, 132, 131, 131, 131, 131, 131, 132, 132, 133, 133, 133, 132, 132, 132, 132, 131, 130, 130, 130, 130, 130, 131, 131, 131, 131, 131, 130, 131, 131, 131, 131, 131, 131, 131, 131, 132, 132, 132, 131, 130, 129, 129, 130, 131, 132, 132, 132, 133, 133, 133, 132, 132, 132, 132, 132, 132, 132, 131, 131, 131, 131, 131, 131, 131, 131, 131, 131, 131, 130, 131, 131, 131, 131, 131, 130, 131, 131, 131, 131, 131, 131, 131, 130, 130, 130, 130, 130, 130, 131, 131, 131, 132, 133, 132, 132, 131, 131, 131, 132, 132, 132, 132, 132, 131, 131, 132, 132, 132, 131, 130, 131, 131, 131, 132, 131, 131, 132, 133, 134, 134, 134, 134, 134, 134, 134, 134, 133, 133, 133, 134, 135, 135, 135, 134, 134, 134, 133, 133, 133, 133, 133, 133, 133, 133, 132, 133, 134, 133, 132, 132, 131, 133, 134, 134, 134, 133, 133, 133, 133, 133, 133, 133, 133, 133, 133, 133, 132, 132, 133, 133, 133, 133, 132, 132, 131, 131, 130, 132, 133, 133, 133, 132, 131, 132, 132, 133, 134, 133, 133, 133, 133, 133, 133, 133, 133, 133, 133, 133, 133, 133, 133, 133, 133, 134, 134, 132, 132, 133, 133, 133, 133, 133, 134, 134, 135, 134, 134, 133, 133, 133, 132, 132, 132, 132, 132, 131, 131, 132, 132, 132, 133, 134, 135, 134, 134, 134, 133, 133, 132, 133, 133, 133, 133, 132, 132, 132, 132, 132, 132, 132, 133, 133, 133, 133, 132, 134, 135, 134, 133, 133, 133, 133, 133, 133, 133, 133, 132, 132, 132, 133, 133, 132, 132, 133, 133, 133, 132, 132, 132, 132, 132, 132, 133, 133, 132, 131, 131, 131, 131, 131, 131, 132, 132, 132, 132, 132, 132, 131, 131, 131, 131, 132, 132, 133, 133, 132, 132, 132, 132, 132, 132, 133, 134, 133, 132, 132, 131, 132, 132, 132, 132, 132, 132, 132, 131, 132, 132, 132, 132, 131, 130, 129, 130, 131, 131, 132, 131, 130, 131, 131, 131, 132, 132, 132, 132, 132, 132, 133, 132, 131, 131, 131, 131, 131, 132, 132, 132, 132, 133, 132, 132, 132, 132, 133, 133, 132, 132, 132, 132, 132, 132, 131, 131, 130, 131, 132, 133, 133, 132]
1894A32%%J%%%%%%%%jJ%%%j%%%%J%%%%%%jJJJj%%%%%%%%j%%J%%%j%j%%%%%%J%%jj%%J%%j%
1887A31%%%j%%J%%J%%%J%j%%%%%%%%%%%%J%%%j%j%J%J%%j%j%%%%%%Jj%%Jj%%%JJj%%%j%J%
1879A32jJ%J%Jj%%jJ%%j%%%J%%%%%%%%j%%%%%J%%%J%%j%%%jj%Jjj%%J%%J%J%%%j%%%j%%%J
1872A32%%%%%%%%%%%%%%%j%%J%J%%%%%%%%%j%%%j%J%%J%%%%%jJ%%%%jj%%Jj%%%%J%J%j%%%
1865A32%%%%J%Jjj%j%JJ%j%j%%J%J%%JjjJ%JJj%%j%%j%%J%J%j%%%%J%%%k%%%J%%%%J%%%%%
1857A34JJ%J%%jj%j%j%J%%%%%%j%%%JJ%jJ%j%j%%K%J%%j%j%%J%%Jj%%j%j%%%%%%%%%%J%%j
1850A33%%%jJ%J%J%%j%%%Jjj%%%%%Jjj%j%J%%%jJ%%%%%JJ%%%%j%j%J%%%%Jjj%j%%jJ%J%%J
1843A33%%%%j%j%jJ%J%J%%jj%%%%%%%%jjJ%%J%J%%%%j%%%J%J%%%%%j%%%%%%%%%%%Jj%%%%%
$$ y = [132, 132, 132, 133, 133, 133, 133, 133, 133, 133, 133, 133, 132, 133, 133, 133, 133, 132, 132, 132, 132, 132, 133, 133, 133, 133, 133, 133, 133, 132, 133, 134, 135, 134, 134, 134, 134, 134, 134, 134, 134, 134, 133, 133, 133, 134, 134, 134, 134, 133, 133, 132, 132, 132, 132, 132, 132, 132, 133, 133, 133, 132, 131, 131, 131, 132, 132, 132, 131, 131, 131, 131, 131, 130, 130, 130, 131, 131, 131, 132, 132, 132, 132, 133, 133, 132, 132, 132, 132, 132, 132, 132, 132, 132, 132, 132, 132, 132, 133, 133, 133, 133, 132, 132, 131, 131, 132, 132, 133, 133, 133, 132, 132, 131, 131, 131, 131, 131, 131, 131, 132, 131, 131, 131, 132, 131, 131, 131, 131, 132, 133, 132, 132, 132, 132, 131, 131, 132, 132, 131, 132, 132, 133, 133, 134, 133, 133, 133, 132, 133, 133, 133, 132, 132, 132, 132, 133, 133, 133, 133, 133, 133, 133, 133, 133, 132, 132, 132, 132, 132, 132, 133, 133, 133, 133, 134, 134, 134, 133, 133, 133, 133, 132, 131, 131, 132, 131, 130, 130, 130, 131, 131, 131, 132, 132, 133, 133, 133, 133, 132, 132, 132, 132, 131, 131, 131, 131, 132, 132, 132, 132, 132, 132, 132, 132, 132, 132, 132, 132, 132, 132, 132, 132, 131, 131, 131, 132, 132, 133, 133, 133, 133, 133, 133, 133, 133, 133, 133, 132, 132, 132, 132, 131, 131, 132, 132, 132, 133, 133, 133, 133, 133, 133, 132, 133, 133, 133, 133, 133, 132, 131, 131, 131, 132, 131, 131, 131, 131, 131, 132, 132, 133, 133, 132, 132, 132, 132, 132, 132, 132, 132, 133, 133, 134, 133, 132, 132, 131, 131, 132, 133, 133, 132, 132, 131, 131, 131, 132, 132, 133, 133, 133, 134, 133, 132, 133, 133, 134, 135, 134, 134, 134, 133, 133, 133, 132, 132, 132, 133, 133, 134, 134, 133, 133, 133, 133, 133, 134, 134, 134, 134, 132, 132, 132, 132, 133, 133, 133, 133, 133, 134, 134, 134, 134, 134, 134, 135, 136, 136, 137, 137, 137, 136, 135, 135, 134, 134, 133, 133, 134, 134, 134, 134, 134, 134, 134, 133, 133, 133, 133, 134, 135, 135, 134, 135, 135, 134, 134, 133, 133, 133, 135, 135, 136, 136, 136, 135, 135, 134, 134, 134, 135, 135, 135, 136, 135, 135, 135, 134, 134, 133, 133, 133, 133, 133, 133, 133, 133, 133, 133, 133, 134, 134, 134, 133, 133, 133, 133, 132, 133, 133, 134, 134, 135, 135, 135, 134, 134, 134, 134, 135, 134, 133, 133, 133, 133, 133, 133, 134, 133, 132, 132, 131, 131, 132, 132, 132, 132, 131, 132, 132, 132, 132, 132, 132, 133, 134, 134, 134, 134, 134, 133, 133, 132, 132, 133, 133, 133, 133, 133, 134, 133, 132, 132, 131, 131, 131, 130, 131, 131, 132, 132, 132, 133, 133, 133, 133, 133, 132, 132, 131, 131, 130, 131, 131, 132, 132, 133, 133, 133, 132, 131, 131, 131, 131, 131, 131, 131, 131, 131, 130, 129, 130, 130, 130, 131, 131, 132, 132, 132, 132, 132, 131, 131, 131, 131, 132, 132, 133, 133, 133, 133, 133, 133, 132, 132, 132, 132, 132, 132, 132, 132, 132, 132, 132, 132, 133, 132, 132, 132, 132, 132, 132]
1835A32%%%%JJ%%j%%%jj%%J%jj%J%%%%J%k%J%%%%%J%%%%%%%%j%J%JJ%%%j%%j%%%%J%%%%%%
1828A33J%j%%J%%%j%j%JJj%k%J%JJ%j%JJ%jj%%%J%%%Jj%j%J%%j%jJJ%%%%%%%%%jJ%%%%%j%
1821A33%%JJ%%%%%%%%%J%%%j%%%jJ%%%JJ%JJ%J%%%%%J%J%JJKJKKKLMMLMOOMNMLJJ%%J%JMN
1814B12PQRRRPMKJjkkkkj%KNPQJ0J0QNL%lnpqrqpnmk%KLLK%jlooqqrqonmkjkj%%klmmnmmm
1806A68nmmllklkjj%j%%jj%j%%%j%%j%jjj%%%%%jjJ%KJJ%kj%%%j%j%%%%J%%j%%%%j%%%%jj
1799A26%%jj%jjj%%j%JJ%Jj%jJ%%%%%%%j%jk%%%JJLJJKJK%jjjjJ%JJJLKLKKJJ%%%%j%JJ%J
1792A46JJKKJJKJJ%j%%jJ%J%JJ%JJ%%%j%%j%%j%%JJjj%j%%%J%j%j%jj%J%j%kjj%JJ%%jjj%
1785A50%j%JJ%%%j%%J%j%jj%J%%j%%%%%%JJ%jj%%%%%J%j%%J%%%%J%%%%%%%%%%%%jj%%J%%%
$$ y = [132, 132, 132, 132, 132, 133, 134, 134, 134, 133, 133, 133, 133, 132, 131, 131, 131, 132, 132, 131, 130, 130, 131, 131, 131, 131, 131, 132, 132, 130, 130, 131, 131, 131, 131, 131, 131, 132, 132, 132, 132, 132, 132, 132, 132, 132, 131, 131, 132, 132, 133, 134, 134, 134, 134, 133, 133, 133, 132, 132, 132, 132, 132, 133, 133, 133, 133, 133, 133, 133, 134, 134, 133, 133, 133, 134, 134, 134, 134, 133, 133, 132, 132, 133, 134, 133, 133, 131, 131, 132, 132, 133, 134, 134, 133, 133, 134, 135, 135, 134, 133, 133, 133, 133, 134, 134, 134, 134, 135, 134, 134, 133, 133, 134, 134, 134, 133, 133, 132, 133, 134, 134, 134, 134, 134, 134, 134, 134, 134, 134, 133, 134, 134, 134, 134, 134, 134, 133, 133, 133, 133, 134, 135, 135, 135, 135, 135, 135, 135, 135, 135, 135, 136, 136, 136, 136, 135, 135, 135, 135, 134, 135, 135, 135, 135, 136, 137, 137, 138, 139, 139, 140, 140, 140, 140, 140, 140, 141, 141, 142, 142, 143, 144, 146, 147, 149, 151, 153, 156, 160, 164, 167, 171, 177, 183, 187, 192, 196, 199, 200, 201, 201, 201, 202, 202, 203, 207, 212, 219, 227, 236, 245, 254, 261, 265, 267, 268, 267, 265, 263, 261, 259, 258, 258, 260, 265, 272, 280, 290, 300, 308, 313, 316, 316, 313, 308, 301, 293, 284, 276, 269, 264, 260, 258, 258, 260, 263, 266, 268, 268, 267, 264, 258, 252, 244, 236, 227, 219, 213, 208, 204, 202, 201, 199, 198, 198, 198, 196, 193, 189, 185, 180, 176, 172, 168, 163, 159, 155, 152, 149, 147, 144, 142, 141, 140, 140, 139, 139, 139, 138, 137, 137, 136, 136, 136, 136, 135, 135, 135, 134, 134, 133, 132, 131, 131, 131, 131, 131, 131, 130, 129, 130, 130, 132, 133, 134, 134, 132, 131, 131, 131, 131, 130, 130, 129, 129, 129, 129, 129, 130, 130, 130, 129, 129, 129, 129, 129, 128, 128, 128, 128, 128, 127, 126, 126, 126, 125, 124, 124, 123, 122, 121, 121, 121, 120, 120, 121, 122, 122, 123, 122, 122, 121, 122, 122, 122, 122, 122, 122, 122, 122, 121, 121, 120, 118, 118, 118, 118, 119, 120, 123, 124, 125, 127, 128, 130, 130, 129, 128, 127, 126, 127, 127, 128, 129, 130, 133, 135, 138, 140, 142, 143, 144, 144, 144, 144, 144, 143, 143, 144, 145, 145, 146, 147, 148, 150, 152, 153, 154, 156, 157, 158, 158, 157, 157, 157, 156, 157, 157, 158, 158, 159, 160, 160, 161, 162, 162, 162, 162, 161, 161, 161, 160, 160, 160, 159, 159, 159, 160, 161, 160, 159, 159, 158, 158, 158, 158, 159, 159, 158, 158, 157, 157, 156, 155, 155, 156, 156, 155, 155, 153, 152, 151, 151, 152, 153, 153, 153, 152, 151, 150, 150, 150, 149, 149, 150, 151, 151, 151, 151, 150, 150, 150, 151, 151, 150, 150, 149, 148, 148, 149, 149, 149, 148, 148, 148, 148, 148, 148, 148, 149, 150, 150, 149, 148, 148, 148, 148, 148, 148, 149, 149, 148, 148, 148, 149, 149, 149, 149, 149, 150, 150, 150, 150, 150, 150, 150, 150, 150, 150, 150, 150, 150, 149, 148, 148, 148, 149, 149, 149, 149]
1777A49%%JJ%%%JJj%j%j%%Jjj%%%%%%%JJJJ%Jjk%jjk%jJ%J%JJJJjklj%kkkjj%jJ%%jjjkkk
1770A28kkkj%%%%Jj%j%kljjkjjkJJ%J%J%jjjjk%%%JKKJJJKKKKK%J%J%%JJJJMLLLLMKKKKKJ
1763A60LKLKLKKKJJ%%jjJLMNOPQRRONLL%jj%KPJ3J8K3K5K6K5K1J7J0Llpj1j4j6j4rjQJ8K7
1757D14L0L1K9K6J9J1Lkpj1j2j2j1nKRJ6K1K6K5K3J8J3PKkoppqol%NQJ2J4J7J8J8J6J7J5J6
1752G82J5J7J7J9J9K0K3K6K8L1L1L5L7L9M2M6N1N6O1O8P5Q5R5J06J20J35J55J78K07K43K87
1749C149L41M09M91N83O87P90Q76R27R24Q67P62O25M73L27K06J27R6J17J90L14M90P17R79
1746A5467J241J450J550J505J325J039O94L32kk59m15m66m20k88p5K16N80R78J351J610J678
1744B9091J530J198P37K11l16p82j137j352j439j417j302j106q31m91j26K08M38N15M35K21
$$ y = [149, 149, 149, 150, 151, 151, 151, 151, 152, 153, 152, 152, 151, 151, 150, 150, 150, 151, 150, 149, 149, 149, 149, 149, 149, 149, 149, 150, 151, 152, 153, 153, 154, 153, 151, 151, 150, 149, 147, 147, 146, 147, 147, 148, 148, 149, 150, 151, 152, 151, 149, 146, 145, 145, 143, 141, 139, 138, 137, 137, 136, 137, 137, 137, 136, 135, 134, 132, 130, 128, 126, 124, 122, 121, 121, 121, 121, 121, 122, 121, 121, 120, 120, 118, 115, 114, 113, 111, 110, 109, 107, 108, 109, 109, 110, 110, 111, 111, 110, 109, 108, 107, 105, 105, 105, 105, 106, 108, 110, 111, 112, 113, 115, 117, 119, 121, 123, 123, 124, 124, 125, 125, 125, 126, 127, 128, 129, 133, 136, 139, 142, 145, 149, 151, 153, 155, 157, 159, 160, 163, 165, 168, 170, 173, 175, 177, 179, 180, 181, 181, 181, 180, 179, 180, 183, 187, 192, 198, 205, 213, 222, 231, 237, 242, 245, 248, 248, 247, 246, 246, 248, 255, 268, 286, 309, 334, 360, 385, 406, 423, 433, 436, 433, 426, 415, 401, 385, 371, 362, 361, 369, 387, 414, 444, 475, 504, 530, 549, 560, 563, 561, 554, 543, 531, 519, 508, 503, 505, 514, 530, 551, 577, 602, 625, 643, 656, 663, 665, 663, 657, 650, 643, 635, 629, 626, 626, 631, 639, 651, 665, 682, 700, 718, 734, 751, 766, 782, 797, 814, 831, 850, 869, 889, 912, 938, 966, 997, 1028, 1063, 1100, 1139, 1181, 1227, 1278, 1334, 1395, 1463, 1538, 1623, 1718, 1824, 1944, 2079, 2234, 2412, 2619, 2862, 3149, 3490, 3899, 4390, 4973, 5660, 6450, 7326, 8253, 9177, 10044, 10806, 11431, 11904, 12231, 12437, 12564, 12660, 12777, 12967, 13281, 13771, 14488, 15467, 16708, 18158, 19708, 21213, 22538, 23577, 24271, 24603, 24601, 24342, 23927, 23461, 23041, 22753, 22678, 22894, 23474, 24452, 25803, 27413, 29091, 30621, 31819, 32556, 32767, 32451, 31669, 30532, 29180, 27741, 26324, 25022, 23916, 23085, 22594, 22468, 22676, 23114, 23629, 24064, 24285]
1742B4285p7m13p42j019j211j310j330j285j190j049q70o65m59k80j60j12j35k16l35m67n94
1740A0366p00p70q08q16p99p63p12o48n75m99m25l58k98k50k08j76j50j28j11r9q7p7o9o3
1737G77n7n0m6m1l6l3l0k6k4k2k1k0j9j7j7j6j4j4j1qonljjjjlnpqj1j0rqmlJMPRRRON%ln
1732B11prj0qom%MRJ2J5J4J2J0NJkoprqpomkJMPQJ0QOLJklmmlmkkj%JKLLLKK%j%j%jj%jjj
1726B30J%JJJ%%Jj%KJJKKJJJJJ%%%%kkjjjjJJJKKJ%%kjkklkjjjjjjj%%jkjkkllkkkjkj%%j
1718B03jkkklklllkkj%%jj%klkklkkjj%J%J%j%jjjjjk%jjj%%%%J%%jjkj%%%jjjjJ%%%j%j%
1711A39%J%J%Jj%j%jjj%%Jj%jjJ%J%jj%%%%%j%%%j%%%Jj%%%JJ%%%%%%jj%%jjkjjJ%%J%%%%
1704A29j%J%jj%%k%J%%%%jkj%jj%%%%j%jjjjj%%J%%j%%Jjjj%J%%Jj%JJJ%J%%%%j%%%%J%JJ
$$ y = [24285, 24208, 23795, 23053, 22034, 20823, 19513, 18183, 16898, 15708, 14659, 13789, 13124, 12665, 12385, 12225, 12113, 11978, 11762, 11427, 10960, 10366, 9666, 8896, 8088, 7272, 6473, 5710, 4998, 4350, 3775, 3276, 2851, 2493, 2195, 1945, 1737, 1561, 1411, 1283, 1172, 1073, 986, 909, 840, 777, 720, 670, 624, 583, 547, 514, 484, 458, 434, 412, 391, 371, 352, 335, 318, 302, 288, 274, 263, 255, 249, 244, 241, 240, 239, 238, 237, 234, 229, 222, 214, 203, 193, 184, 176, 172, 169, 170, 174, 181, 190, 199, 208, 214, 219, 219, 216, 211, 204, 195, 185, 177, 171, 167, 167, 171, 180, 192, 207, 221, 233, 243, 248, 249, 247, 241, 234, 225, 217, 210, 204, 200, 198, 199, 203, 210, 218, 228, 236, 242, 245, 246, 244, 241, 237, 233, 230, 226, 224, 222, 221, 221, 222, 224, 227, 230, 233, 235, 237, 237, 236, 236, 235, 235, 234, 233, 233, 232, 231, 230, 231, 231, 232, 233, 234, 234, 234, 235, 234, 234, 236, 237, 238, 240, 242, 243, 244, 245, 246, 247, 247, 247, 247, 247, 245, 243, 242, 241, 240, 239, 240, 241, 242, 244, 246, 247, 247, 247, 245, 244, 242, 240, 237, 235, 234, 233, 232, 231, 230, 229, 228, 228, 228, 227, 225, 224, 222, 220, 217, 214, 212, 210, 208, 207, 205, 204, 204, 204, 203, 202, 200, 198, 196, 193, 191, 188, 185, 182, 180, 178, 177, 177, 177, 176, 175, 175, 173, 170, 168, 166, 163, 161, 159, 158, 157, 157, 158, 158, 159, 159, 158, 158, 157, 156, 155, 154, 153, 151, 151, 150, 149, 148, 148, 148, 148, 148, 149, 149, 149, 148, 147, 145, 144, 144, 144, 144, 143, 142, 141, 140, 141, 141, 141, 141, 140, 140, 139, 139, 139, 140, 140, 141, 141, 142, 141, 141, 140, 140, 139, 138, 137, 137, 137, 138, 137, 137, 136, 135, 136, 136, 137, 137, 136, 135, 135, 135, 135, 135, 135, 134, 134, 134, 134, 133, 133, 133, 133, 134, 133, 133, 133, 133, 134, 135, 135, 135, 135, 135, 135, 135, 134, 133, 133, 133, 132, 131, 129, 128, 127, 128, 128, 128, 129, 129, 129, 129, 129, 128, 128, 129, 129, 128, 127, 127, 127, 125, 125, 126, 126, 126, 126, 126, 125, 123, 122, 122, 121, 120, 120, 120, 120, 120, 119, 119, 118, 117, 116, 115, 114, 114, 114, 115, 115, 115, 114, 114, 114, 115, 114, 113, 112, 112, 113, 113, 113, 114, 113, 113, 114, 115, 116, 116, 117, 117, 117, 117, 117, 116, 116, 116, 116, 116, 117, 117, 118, 119]
1696A19KKJKJJ%Jj%%%%JJJJKKKLJJK%j%%%%j%JJJJJJJJ%Jjjj%jj%j%J%%J%%%j%j%j%j%j%%
1689A43%j%Jjjj%Jj%jjj%JJ%%jJ%%%jj%J%%%j%%jJ%%%%%%%%%%Jj%J%%%%jj%%JJ%j%%%%j%%
1682A36JJ%%J%%JjjJ%%Jj%%J%JJ%JJJ%JKMMMLMNNOMMKKJJJ%JJJKNOQRQROOMKjkkkkj%KMPQ
1675B77RRQPMJlpqrqopoljjKLLK%kknpppqqpnmlmj%j%jllmlmnomnlllkkkkkj%jj%j%j%j%%
1667A32%Jj%%%%%%Jjj%%%%j%j%%j%jJ%%%JJjj%%JJ%%%j%%%%%%J%%%%jjJ%%%%JJj%j%%%%%%
1660A29%%J%%%j%jJJj%%%%jJjjJJ%J%J%jjjj%JJJj%%jJJ%Jj%%%j%%jJ%JJjjJ%%j%%j%%K%%
1653A30%%%%%%j%JJj%%jJ%J%Jjj%%jj%JJ%%%%%%%%jJ%%j%JJjjJ%J%j%%%%%J%JJj%%jj%J%j
1645A30%%j%%J%%%%%%Jj%%%%%%J%jJJ%%%%%jj%%JJ%jj%%%%j%JJ%j%KJ%jj%Jj%jj%JjJJ%j%
$$ y = [119, 121, 123, 124, 126, 127, 128, 128, 129, 128, 128, 128, 128, 128, 129, 130, 131, 132, 134, 136, 138, 141, 142, 143, 145, 145, 144, 144, 144, 144, 144, 143, 143, 144, 145, 146, 147, 148, 149, 150, 151, 151, 152, 151, 150, 149, 149, 148, 147, 147, 146, 146, 147, 147, 147, 148, 148, 148, 148, 147, 147, 146, 146, 145, 145, 144, 144, 143, 143, 143, 143, 142, 142, 143, 142, 141, 140, 140, 141, 140, 140, 139, 138, 137, 137, 138, 139, 139, 139, 138, 139, 139, 139, 139, 138, 137, 137, 138, 138, 138, 138, 137, 137, 137, 136, 137, 137, 137, 137, 137, 137, 137, 137, 137, 137, 137, 138, 137, 137, 138, 138, 138, 138, 138, 137, 136, 136, 136, 137, 138, 138, 137, 137, 137, 137, 137, 136, 136, 136, 137, 138, 138, 138, 139, 139, 139, 140, 139, 138, 139, 139, 139, 140, 139, 139, 139, 140, 140, 141, 142, 142, 143, 144, 145, 145, 146, 148, 152, 156, 160, 163, 167, 172, 177, 183, 187, 191, 193, 195, 196, 197, 198, 198, 199, 200, 201, 203, 208, 214, 222, 231, 239, 248, 254, 260, 264, 266, 265, 263, 261, 259, 257, 256, 256, 258, 262, 269, 277, 286, 295, 303, 310, 314, 315, 312, 305, 297, 288, 280, 274, 267, 261, 258, 257, 256, 258, 261, 264, 266, 266, 264, 262, 257, 250, 243, 236, 228, 220, 213, 208, 204, 201, 197, 196, 196, 195, 195, 194, 191, 188, 184, 181, 177, 172, 166, 162, 157, 154, 151, 148, 146, 144, 142, 140, 138, 137, 137, 136, 135, 135, 134, 134, 133, 133, 132, 132, 132, 132, 133, 132, 132, 132, 132, 132, 132, 132, 133, 132, 131, 131, 131, 131, 131, 130, 130, 129, 129, 129, 128, 128, 127, 128, 128, 128, 128, 129, 130, 129, 128, 128, 128, 129, 130, 130, 130, 130, 129, 129, 129, 129, 129, 129, 129, 130, 130, 130, 130, 130, 129, 128, 129, 129, 129, 129, 129, 130, 131, 130, 130, 129, 129, 129, 129, 129, 129, 129, 129, 129, 130, 130, 130, 130, 129, 129, 128, 129, 130, 129, 129, 129, 129, 129, 128, 129, 128, 127, 128, 129, 129, 130, 130, 131, 131, 130, 129, 128, 127, 127, 128, 129, 130, 129, 129, 129, 128, 129, 130, 130, 131, 130, 130, 130, 130, 129, 129, 129, 128, 129, 129, 130, 131, 130, 129, 130, 130, 130, 129, 129, 129, 128, 128, 128, 130, 130, 130, 130, 130, 130, 130, 130, 130, 129, 129, 130, 131, 130, 130, 130, 129, 130, 130, 131, 131, 132, 131, 130, 130, 130, 129, 128, 128, 129, 130, 130, 130, 130, 130, 130, 130, 130, 130, 129, 130, 130, 130, 129, 129, 130, 131, 130, 129, 130, 130, 131, 131, 130, 130, 130, 130, 130, 130, 131, 131, 132, 133, 132, 132, 132, 131, 130, 130, 131, 131, 130, 130, 130, 129, 129, 129, 130, 130, 130, 130, 130, 130, 130, 131, 130, 130, 130, 130, 130, 130, 130, 131, 131, 130, 131, 132, 132, 132, 132, 132, 132, 131, 130, 130, 130, 131, 132, 132, 131, 130, 130, 130, 130, 130, 129, 129, 130, 131, 131, 130, 130, 132, 133, 133, 132, 131, 131, 132, 131, 131, 130, 129, 129, 130, 129, 130, 131, 131, 130, 130]
1638A30%%%%j%%%%%%%%%%%%%j%%j%%JJ%%J%jjj%%JJ%%j%%j%%%%%%%J%%JJ%JJJKJJjj%%%jj
1631A33j%jjj%%%j%J%j%%j%%J%%jj%%J%J%%%%%%%%%j%%j%%J%%%J%j%%JJ%%j%j%j%%j%JJ%%
1623A27J%%%jjjJ%jJ%%%%%j%JJ%jj%%J%%j%%%%%%%J%J%%%jjJ%JJ%j%J%%%%JJj%%%%%j%%j%
1616A27%%%%%%%%jJJj%j%%%J%JJJjj%j%%%%%%%%J%J%j%%%jjJ%%%%JJ%%j%j%%%%%%%J%%%J%
1609A29J%%j%jJ%%%%%%%%%%%j%%%%%jj%%%j%JJ%J%%%j%J%J%%%%%%%%%%%%%%j%j%J%jjJJ%%
1601A28Jj%%%%Jj%%%%j%j%%j%%%%%J%J%%%%%Jj%%%%%%%%%%JjjJ%J%%%%%%%%%%%%%j%%%%%%
1594A27%%%J%%%%%%%%j%J%%JJ%%%%%j%J%%j%jJJJjJ%%j%%%J%%Jj%Jjjjj%%%%J%J%j%%j%%j
1587A27%J%%J%%J%%%%%%j%%%J%jj%J%%j%%%%J%%%%J%%%%%%j%%j%%%%%J%%J%%%%%%%%%j%%%
$$ y = [130, 130, 130, 130, 130, 129, 129, 129, 129, 129, 129, 129, 129, 129, 129, 129, 129, 129, 129, 128, 128, 128, 127, 127, 127, 128, 129, 129, 129, 130, 130, 129, 128, 127, 127, 127, 128, 129, 129, 129, 128, 128, 128, 127, 127, 127, 127, 127, 127, 127, 127, 128, 128, 128, 129, 130, 130, 131, 132, 133, 135, 136, 137, 136, 135, 135, 135, 135, 134, 133, 132, 132, 131, 130, 129, 129, 129, 129, 128, 128, 129, 129, 128, 128, 128, 127, 127, 127, 128, 128, 128, 127, 126, 126, 126, 127, 127, 128, 128, 128, 128, 128, 128, 128, 128, 128, 128, 127, 127, 127, 126, 126, 126, 127, 127, 127, 127, 128, 128, 127, 127, 127, 128, 129, 129, 129, 128, 128, 127, 127, 126, 126, 126, 125, 125, 126, 127, 127, 127, 128, 128, 128, 128, 127, 126, 125, 126, 126, 125, 126, 126, 126, 126, 126, 126, 125, 125, 126, 127, 127, 126, 125, 125, 125, 126, 126, 126, 125, 125, 125, 125, 125, 125, 125, 125, 126, 126, 127, 127, 127, 127, 126, 125, 126, 126, 127, 128, 128, 127, 127, 128, 128, 128, 128, 128, 129, 130, 129, 129, 129, 129, 129, 129, 128, 128, 128, 127, 127, 127, 127, 127, 127, 127, 127, 127, 127, 126, 127, 128, 127, 127, 126, 126, 126, 126, 127, 127, 128, 129, 130, 129, 128, 128, 127, 127, 127, 127, 127, 127, 127, 127, 127, 128, 128, 129, 129, 128, 128, 128, 128, 127, 126, 127, 127, 127, 127, 127, 128, 129, 129, 129, 128, 128, 127, 127, 127, 127, 127, 127, 127, 127, 128, 128, 128, 128, 129, 129, 130, 130, 130, 129, 129, 128, 129, 129, 129, 129, 129, 129, 129, 129, 129, 129, 129, 129, 128, 128, 128, 128, 128, 128, 127, 126, 126, 126, 126, 125, 125, 126, 127, 127, 128, 128, 128, 128, 127, 127, 128, 128, 129, 129, 129, 129, 129, 129, 129, 129, 129, 129, 129, 129, 129, 129, 129, 128, 128, 127, 127, 128, 128, 127, 126, 127, 128, 128, 128, 129, 128, 128, 128, 128, 128, 129, 128, 128, 128, 128, 128, 127, 127, 126, 126, 126, 125, 125, 125, 125, 125, 125, 126, 126, 127, 127, 127, 127, 127, 127, 128, 127, 127, 127, 127, 127, 127, 127, 127, 127, 127, 127, 128, 127, 126, 127, 127, 128, 128, 128, 128, 128, 128, 128, 128, 128, 128, 128, 128, 128, 128, 127, 127, 127, 127, 127, 127, 127, 127, 127, 127, 128, 128, 128, 128, 128, 128, 128, 128, 128, 127, 127, 128, 128, 128, 129, 130, 130, 130, 130, 130, 130, 129, 129, 130, 130, 130, 129, 129, 128, 129, 130, 131, 130, 131, 131, 131, 130, 130, 130, 130, 131, 131, 131, 132, 131, 131, 132, 131, 130, 129, 128, 128, 128, 128, 128, 129, 129, 130, 130, 129, 129, 129, 128, 128, 128, 127, 127, 128, 128, 128, 129, 129, 129, 130, 130, 130, 130, 130, 130, 130, 129, 129, 129, 129, 130, 130, 129, 128, 128, 129, 129, 129, 128, 128, 128, 128, 128, 129, 129, 129, 129, 129, 130, 130, 130, 130, 130, 130, 130, 129, 129, 129, 128, 128, 128, 128, 128, 128, 129, 129, 129, 130, 130, 130, 130, 130, 130, 130, 130, 130, 130, 129, 129, 129, 129]
1579A29J%jj%j%J%%J%%%j%j%J%%j%J%JJJj%%j%%j%j%%%%%%%%%%%%%%%%j%%%%%%%%j%%J%J%
1572A27Jj%J%%%jj%%%%%%%%%%%%J%jJ%%%%%%%%J%j%%%%j%jJJ%%j%%jjJ%%%%%Jj%J%jJJjjj
1565A24%%%%%J%%%Jj%j%%jJJJ%%%J%%%J%j%%j%%%j%%J%%JJj%J%%j%jJ%JJ%%%%%%%j%jj%%%
1558A26J%%J%jj%%%%%JJ%jj%%%%%%%J%%%jJ%j%J%Jj%J%j%%%%%J%%%%%J%j%%%%%%%%JJ%%j%
1550A29Jjjj%%J%jj%JJJjjj%J%%%%J%%%%%%j%%J%j%jjJ%J%J%%J%j%%%%%%%j%j%%J%%%J%jj
1543A26j%%%%JJ%j%%%%%%%%j%%J%%%J%%%%j%%Jj%%%%%%JJ%%%%%%%%%j%%Jj%J%%%j%%J%jj%
1536A26J%jj%j%JJJ%j%%%%j%%%J%%Jj%%%J%%%%%%j%%%J%J%%j%%%JJjj%j%%Jj%%%%%%%j%J%
1528A26%%j%j%JJJJJjjj%J%j%JJ%%%j%%%%%%%%j%J%%%%%J%J%%%j%%jj%J%%JJJ%%%%j%J%jj
$$ y = [129, 130, 130, 129, 128, 128, 127, 127, 128, 128, 128, 129, 129, 129, 129, 128, 128, 127, 127, 128, 128, 128, 127, 127, 128, 128, 129, 130, 131, 130, 130, 130, 129, 129, 129, 128, 128, 127, 127, 127, 127, 127, 127, 127, 127, 127, 127, 127, 127, 127, 127, 127, 127, 127, 126, 126, 126, 126, 126, 126, 126, 126, 126, 125, 125, 125, 126, 126, 127, 127, 128, 127, 127, 128, 128, 128, 128, 127, 126, 126, 126, 126, 126, 126, 126, 126, 126, 126, 126, 126, 126, 127, 127, 126, 127, 127, 127, 127, 127, 127, 127, 127, 127, 128, 128, 127, 127, 127, 127, 127, 126, 126, 125, 126, 127, 127, 127, 126, 126, 126, 125, 124, 125, 125, 125, 125, 125, 125, 126, 125, 125, 126, 126, 125, 126, 127, 126, 125, 124, 124, 124, 124, 124, 124, 125, 125, 125, 125, 126, 125, 125, 124, 124, 124, 123, 124, 125, 126, 126, 126, 126, 127, 127, 127, 127, 128, 128, 127, 127, 127, 126, 126, 126, 126, 125, 125, 125, 126, 126, 126, 127, 128, 127, 127, 128, 128, 128, 127, 127, 126, 127, 127, 128, 129, 129, 129, 129, 129, 129, 129, 129, 128, 128, 127, 126, 126, 126, 126, 127, 127, 127, 128, 128, 127, 126, 126, 126, 126, 126, 126, 127, 128, 128, 127, 126, 126, 126, 126, 126, 126, 126, 126, 127, 127, 127, 127, 126, 127, 127, 126, 126, 127, 127, 128, 127, 127, 128, 128, 127, 127, 127, 127, 127, 127, 128, 128, 128, 128, 128, 128, 129, 129, 128, 128, 128, 128, 128, 128, 128, 128, 128, 129, 130, 130, 130, 129, 129, 130, 129, 128, 127, 127, 127, 128, 128, 127, 126, 126, 127, 128, 129, 128, 127, 126, 126, 127, 127, 127, 127, 127, 128, 128, 128, 128, 128, 128, 128, 127, 127, 127, 128, 128, 127, 127, 126, 125, 126, 126, 127, 127, 128, 128, 128, 129, 129, 128, 128, 128, 128, 128, 128, 128, 128, 127, 127, 126, 126, 126, 127, 127, 127, 127, 128, 128, 127, 126, 125, 125, 125, 125, 125, 126, 127, 127, 126, 126, 126, 126, 126, 126, 126, 126, 126, 125, 125, 125, 126, 126, 126, 126, 127, 127, 127, 127, 127, 126, 126, 126, 127, 126, 126, 126, 126, 126, 126, 126, 127, 128, 128, 128, 128, 128, 128, 128, 128, 128, 128, 127, 127, 127, 128, 127, 127, 128, 128, 128, 128, 127, 127, 127, 128, 128, 127, 126, 126, 127, 127, 126, 125, 125, 124, 124, 125, 126, 127, 127, 126, 126, 126, 126, 126, 125, 125, 125, 125, 126, 126, 126, 127, 126, 126, 126, 126, 127, 127, 127, 127, 127, 127, 127, 126, 126, 126, 126, 127, 127, 128, 128, 128, 127, 127, 127, 127, 128, 129, 128, 127, 127, 126, 126, 126, 127, 126, 126, 126, 126, 126, 126, 126, 126, 125, 125, 126, 126, 126, 126, 125, 125, 124, 124, 125, 126, 127, 128, 129, 128, 127, 126, 126, 127, 127, 126, 126, 127, 128, 128, 128, 128, 127, 127, 127, 127, 127, 127, 127, 127, 127, 126, 126, 127, 127, 127, 127, 127, 127, 128, 128, 129, 129, 129, 129, 128, 128, 128, 127, 126, 126, 127, 127, 127, 128, 129, 130, 130, 130, 130, 130, 129, 129, 130, 130, 129, 128]
1521A28%%jJJ%%%%%%%%%j%%%JJJ%jj%JJ%jj%%%j%%%J%%Jj%JK%jj%JjkJ%%j%jJJ%%%jJ%J%%
1514A30%j%%%jJJ%%j%%%%J%JJ%JJJJJKJLKKLLJ%%jkjjkkkkkjjjkk%jj%%%J%%j%%j%%%%%%%
1506A29%%%j%%%%%%%JJJ%%%%j%%j%%%jJ%%%%J%%JJ%%j%%%%%%%%%%%jjJJj%jjjj%JJJJj%j%
1499A28jJ%%Jj%j%J%%%%%%%%%J%%%%J%%jj%%%%JJ%%%%%%j%%Jj%%%j%%J%%%J%k%j%%J%%%J%
1492A29%j%%%%j%%%%%%jJJ%j%%%%%j%%%%J%J%%%%%j%j%%%%J%%%%j%%%%%%%%J%%%J%jJ%%j%
1484A27%J%jjJ%j%%%J%%Jj%%%%j%%%%%J%%%%j%%%%JJj%%%jJ%%jjJ%jJJ%jJ%%J%JJjjj%j%%
1477A26JJ%%%%KJJJ%%J%JJ%%j%j%%%jj%%%j%%%%jj%%%j%%%%%JJjjjJJ%j%J%%%%%%jJ%j%jJ
1470A28%%%%Jj%%j%%j%J%%%%%%%%%J%%j%jJ%%jJ%jJ%%j%%%%%JjJ%J%%%j%%j%jjJK%J%%jJj
$$ y = [128, 128, 128, 127, 128, 129, 129, 129, 129, 129, 129, 129, 129, 129, 129, 128, 128, 128, 128, 129, 130, 131, 131, 130, 129, 129, 130, 131, 131, 130, 129, 129, 129, 129, 128, 128, 128, 128, 129, 129, 129, 130, 129, 129, 130, 132, 132, 131, 130, 130, 131, 130, 128, 129, 129, 129, 128, 128, 127, 128, 129, 129, 129, 129, 128, 129, 129, 130, 130, 130, 130, 129, 129, 129, 129, 128, 129, 130, 130, 130, 129, 129, 129, 129, 129, 130, 130, 131, 132, 132, 133, 134, 135, 136, 137, 139, 140, 143, 145, 147, 150, 153, 154, 154, 154, 153, 151, 150, 149, 147, 145, 143, 141, 139, 138, 137, 136, 134, 132, 132, 131, 130, 130, 130, 130, 131, 131, 131, 130, 130, 130, 129, 129, 129, 129, 129, 129, 129, 129, 129, 129, 129, 128, 128, 128, 128, 128, 128, 128, 128, 129, 130, 131, 131, 131, 131, 131, 130, 130, 130, 129, 129, 129, 129, 128, 129, 129, 129, 129, 129, 130, 130, 130, 131, 132, 132, 132, 131, 131, 131, 131, 131, 131, 131, 131, 131, 131, 131, 131, 130, 129, 130, 131, 130, 130, 129, 128, 127, 126, 126, 127, 128, 129, 130, 129, 129, 128, 128, 127, 128, 128, 128, 129, 128, 128, 127, 127, 128, 128, 128, 128, 128, 128, 128, 128, 128, 128, 129, 129, 129, 129, 129, 130, 130, 130, 129, 128, 128, 128, 128, 128, 129, 130, 130, 130, 130, 130, 130, 130, 129, 129, 129, 130, 129, 129, 129, 129, 128, 128, 128, 129, 129, 129, 129, 130, 130, 128, 128, 127, 127, 127, 128, 128, 128, 128, 129, 129, 129, 128, 128, 128, 128, 128, 127, 127, 127, 127, 127, 127, 127, 126, 127, 128, 128, 127, 127, 127, 127, 127, 127, 126, 126, 126, 126, 126, 127, 127, 128, 128, 128, 128, 128, 128, 127, 127, 126, 126, 126, 126, 126, 127, 127, 127, 127, 127, 126, 126, 126, 126, 126, 126, 126, 126, 126, 127, 127, 127, 127, 128, 128, 127, 128, 128, 128, 127, 127, 127, 128, 128, 127, 126, 127, 127, 126, 126, 126, 126, 127, 127, 127, 128, 127, 127, 127, 127, 127, 126, 126, 126, 126, 126, 126, 127, 127, 127, 127, 127, 126, 126, 126, 126, 126, 127, 128, 127, 127, 127, 127, 126, 127, 127, 127, 126, 125, 126, 126, 125, 126, 127, 127, 126, 127, 127, 127, 128, 128, 129, 130, 129, 128, 127, 127, 126, 126, 126, 127, 128, 128, 128, 128, 128, 130, 131, 132, 133, 133, 133, 134, 134, 135, 136, 136, 136, 135, 135, 134, 134, 134, 134, 133, 132, 132, 132, 132, 131, 131, 131, 131, 131, 130, 129, 129, 129, 129, 128, 128, 128, 128, 128, 128, 129, 130, 129, 128, 127, 128, 129, 129, 128, 128, 129, 129, 129, 129, 129, 129, 129, 128, 129, 129, 128, 128, 127, 128, 128, 128, 128, 128, 129, 128, 128, 128, 127, 127, 127, 126, 126, 127, 127, 127, 127, 127, 127, 127, 127, 127, 127, 128, 128, 128, 127, 127, 126, 127, 127, 127, 126, 127, 127, 126, 127, 127, 127, 126, 126, 126, 126, 126, 126, 127, 126, 127, 127, 128, 128, 128, 128, 127, 127, 127, 126, 126, 125, 124, 125, 127, 127, 128, 128, 128, 127, 128, 127]
1462A27%%%%%%J%%%J%jjJ%%%%%j%J%%J%%%j%%%%%%j%%%%J%%%%%%%%%j%%%jJ%%%%%J%%j%%%
1455A27%%J%%%%%%jJ%JJkj%%%J%%%%j%%%%%%JJJKJJ%%jjk%jj%J%%%j%Jj%j%%%J%%%%%%%%%
1448A28%%%%%j%%%%%J%%J%%J%%JJj%%%%%J%JJKJJKJJJJ%Jjkjjjj%%%jkkj%%jj%jjJ%j%%%%
1441A28J%%%%%j%%%%%%%%j%%%%%JJ%%jjj%J%%j%%%%%%%Jj%%%%J%jj%JJ%%J%%%%%%j%%%%J%
1433A28%J%%j%j%%J%J%j%j%%KJ%j%jj%%j%%%%%%J%jJ%%%%jJj%jJJ%%J%%%%j%J%%%%%j%j%j
1426A25%%%%%%J%JK%%%j%j%%%%%%JJJ%%j%%jj%%J%J%%%%%%j%%%%%%j%j%JJ%jj%j%%J%%J%%
1419A27%%%%J%%jJj%%%%jj%%JJ%%%%j%%%%%%%%%%J%%jjJ%%%JJ%J%%%jJ%jj%J%j%j%%%%%J%
1411A27J%j%%%%%%%jJ%%j%J%%%%%%%%%%%j%%%j%J%%J%J%J%jj%jJ%J%j%%%%%%%%%%%%%j%j%
$$ y = [127, 127, 127, 127, 127, 127, 127, 128, 128, 128, 128, 129, 129, 128, 127, 128, 128, 128, 128, 128, 128, 127, 127, 128, 128, 128, 129, 129, 129, 129, 128, 128, 128, 128, 128, 128, 128, 127, 127, 127, 127, 127, 128, 128, 128, 128, 128, 128, 128, 128, 128, 128, 127, 127, 127, 127, 126, 127, 127, 127, 127, 127, 127, 128, 128, 128, 127, 127, 127, 127, 127, 127, 128, 128, 128, 128, 128, 128, 128, 127, 128, 128, 129, 130, 128, 127, 127, 127, 127, 128, 128, 128, 128, 128, 127, 127, 127, 127, 127, 127, 127, 128, 129, 130, 132, 133, 134, 134, 134, 133, 132, 130, 130, 129, 128, 128, 129, 129, 129, 129, 128, 128, 129, 128, 128, 127, 127, 127, 127, 128, 128, 128, 128, 128, 128, 128, 128, 128, 128, 128, 128, 128, 128, 128, 127, 127, 127, 127, 127, 127, 128, 128, 128, 129, 129, 129, 130, 130, 130, 131, 132, 131, 131, 131, 131, 131, 131, 132, 132, 133, 134, 136, 137, 138, 140, 141, 142, 143, 144, 144, 145, 144, 142, 141, 140, 139, 138, 138, 138, 138, 137, 135, 133, 132, 132, 132, 131, 130, 130, 129, 128, 129, 129, 128, 128, 128, 128, 128, 129, 129, 129, 129, 129, 129, 128, 128, 128, 128, 128, 128, 128, 128, 128, 127, 127, 127, 127, 127, 127, 128, 129, 129, 129, 128, 127, 126, 126, 127, 127, 127, 126, 126, 126, 126, 126, 126, 126, 126, 127, 126, 126, 126, 126, 126, 127, 127, 126, 125, 125, 126, 127, 127, 127, 128, 128, 128, 128, 128, 128, 128, 127, 127, 127, 127, 127, 128, 128, 128, 129, 129, 129, 128, 128, 127, 127, 127, 128, 128, 129, 129, 128, 128, 127, 127, 127, 129, 130, 130, 129, 129, 128, 127, 127, 127, 126, 126, 126, 126, 126, 126, 126, 127, 127, 126, 127, 127, 127, 127, 127, 126, 127, 126, 126, 125, 126, 127, 127, 127, 128, 128, 128, 128, 128, 127, 127, 128, 128, 128, 128, 128, 128, 127, 127, 126, 126, 125, 125, 125, 125, 125, 125, 125, 126, 126, 127, 129, 129, 129, 129, 128, 128, 127, 127, 127, 127, 127, 127, 127, 128, 129, 130, 130, 130, 129, 129, 129, 128, 127, 127, 127, 128, 128, 129, 129, 129, 129, 129, 129, 129, 128, 128, 128, 128, 128, 128, 128, 127, 127, 126, 126, 127, 128, 128, 127, 126, 126, 125, 125, 125, 126, 126, 126, 127, 127, 127, 127, 127, 127, 127, 128, 128, 128, 127, 128, 127, 127, 127, 127, 127, 126, 125, 125, 125, 126, 127, 127, 127, 127, 127, 126, 126, 126, 126, 126, 126, 126, 126, 126, 126, 126, 127, 127, 127, 126, 125, 126, 126, 126, 126, 127, 128, 128, 129, 129, 129, 129, 128, 129, 129, 128, 127, 127, 128, 128, 127, 127, 126, 126, 126, 126, 126, 126, 127, 127, 128, 128, 127, 127, 127, 127, 127, 127, 127, 127, 126, 127, 127, 127, 126, 126, 127, 127, 127, 127, 127, 127, 127, 127, 127, 127, 127, 127, 126, 126, 126, 126, 125, 125, 126, 126, 126, 127, 127, 128, 128, 129, 129, 128, 127, 127, 126, 127, 127, 128, 128, 127, 127, 127, 127, 127, 127, 127, 127, 127, 127, 127, 127, 127, 127, 126, 126, 125, 125]
1404A25%%%%%jJ%%J%%%%J%%%%%%%%Jj%%%%J%jj%%%%JJ%%J%%j%%jj%JjjJ%j%%%%J%jJJ%%Jj
1397A27jJ%jjJ%jj%%J%%%%J%%%%%%%%%%%%%%%J%%%J%%%j%%%%J%%%%jJ%%%%j%j%%%%%%%J%%
1389A27%Jj%%jJ%J%%%%%%j%%%%J%%%j%%%%jJ%%%%%J%%%%%%J%%%%%%j%j%jJJK%jjjj%%J%j%
1382A26%%%%%%%%%%%%J%J%%j%J%%%%%J%%%%j%%J%%jj%J%%%J%j%%J%JJJ%J%J%J%%%%Jj%%%%
1375A35%%%%%j%%%%j%j%jj%kj%%jJ%J%%%j%J%j%%J%%%jJJ%j%j%jJ%J%%jj%%J%J%%%%Jj%jJ
1367A28%JJKJJ%JK%%%%%jjjjjjjjjj%Jj%JJj%j%%%%jjJ%J%%%%j%%%%%%%%j%%JJ%jj%%%%KJ
1360A28%%j%k%JJj%%%%%J%J%%%%J%%%%j%j%%%%%%%%%%%%k%j%Jj%%%%%%%%%j%JJ%%J%%%JJj
1353A27%%%%jj%JJ%%j%%%j%%%%Jj%%J%%%J%j%%%%%J%j%JJj%%%%j%%JjjJJ%J%%jj%%%%%Jj%
$$ y = [125, 125, 125, 125, 125, 125, 124, 125, 125, 125, 126, 126, 126, 126, 126, 127, 127, 127, 127, 127, 127, 127, 127, 127, 128, 127, 127, 127, 127, 127, 128, 128, 127, 126, 126, 126, 126, 126, 127, 128, 128, 128, 129, 129, 129, 128, 128, 128, 127, 126, 126, 127, 126, 125, 126, 126, 125, 125, 125, 125, 125, 126, 126, 125, 126, 127, 127, 127, 128, 127, 126, 127, 127, 126, 125, 126, 126, 125, 124, 124, 124, 125, 125, 125, 125, 125, 126, 126, 126, 126, 126, 126, 126, 126, 126, 126, 126, 126, 126, 126, 126, 126, 127, 127, 127, 127, 128, 128, 128, 128, 127, 127, 127, 127, 127, 128, 128, 128, 128, 128, 127, 128, 128, 128, 128, 128, 127, 127, 126, 126, 126, 126, 126, 126, 126, 126, 127, 127, 127, 127, 128, 127, 127, 127, 126, 127, 127, 128, 128, 128, 128, 128, 128, 128, 127, 127, 127, 127, 127, 128, 128, 128, 128, 127, 127, 127, 127, 127, 126, 127, 127, 127, 127, 127, 127, 128, 128, 128, 128, 128, 128, 128, 129, 129, 129, 129, 129, 129, 129, 128, 128, 127, 127, 126, 127, 128, 130, 130, 129, 128, 127, 126, 126, 126, 127, 127, 126, 126, 126, 126, 126, 126, 126, 126, 126, 126, 126, 126, 126, 126, 127, 127, 128, 128, 128, 127, 127, 128, 128, 128, 128, 128, 128, 129, 129, 129, 129, 129, 128, 128, 128, 129, 129, 129, 128, 127, 127, 128, 128, 128, 128, 129, 129, 128, 128, 128, 129, 129, 130, 131, 132, 132, 133, 133, 134, 134, 135, 135, 135, 135, 135, 136, 135, 135, 135, 135, 135, 135, 135, 135, 135, 135, 134, 134, 134, 134, 134, 133, 133, 132, 132, 131, 130, 130, 128, 127, 127, 127, 126, 127, 127, 128, 128, 128, 128, 127, 127, 128, 128, 127, 127, 127, 128, 128, 128, 128, 127, 128, 129, 129, 128, 128, 127, 127, 126, 127, 127, 128, 128, 128, 127, 126, 126, 126, 127, 127, 128, 128, 128, 128, 128, 129, 128, 128, 127, 128, 128, 129, 130, 132, 133, 134, 134, 135, 137, 137, 137, 137, 137, 137, 136, 135, 134, 133, 132, 131, 130, 129, 128, 127, 127, 128, 127, 127, 128, 129, 128, 128, 127, 127, 127, 127, 127, 126, 125, 126, 126, 127, 127, 127, 127, 127, 126, 126, 126, 126, 126, 126, 126, 126, 126, 125, 125, 125, 126, 127, 127, 126, 125, 125, 125, 125, 125, 127, 128, 128, 128, 127, 127, 125, 125, 126, 127, 126, 126, 126, 126, 126, 126, 127, 127, 128, 128, 128, 128, 128, 129, 129, 129, 129, 129, 128, 128, 127, 127, 127, 127, 127, 127, 127, 127, 127, 127, 127, 127, 127, 125, 125, 124, 124, 125, 124, 124, 124, 124, 124, 124, 124, 124, 124, 124, 123, 123, 124, 125, 125, 125, 126, 126, 126, 126, 127, 128, 127, 127, 127, 127, 127, 126, 125, 125, 126, 127, 127, 127, 126, 126, 126, 126, 125, 125, 125, 125, 125, 126, 125, 125, 125, 126, 126, 126, 126, 127, 127, 126, 126, 126, 126, 126, 126, 127, 127, 126, 126, 127, 128, 127, 127, 127, 127, 127, 126, 126, 126, 127, 126, 125, 126, 127, 127, 128, 128, 128, 127, 126, 126, 126, 126, 126, 126, 127, 126, 126]
1346A26j%%%%%%%%J%%%%J%%j%%KJjj%jj%%%%J%Jj%%%%JJ%%%%j%%j%%%%%%%j%JJ%%jjjJJJ%
1338A27%j%%%j%%JJJ%Jj%j%%%j%J%%%J%j%j%%%%Jj%JJj%j%J%%%%%%%%%Jj%JJj%%Jj%%%jJ%
1331A28%%%J%kk%JJ%Jj%%j%%%JJ%%%j%%jJJJ%j%j%%%%%jJ%%%j%J%%J%%%%J%jj%%%%%J%%j%
1324A27%Jjj%%%%%%%%%%%%%%%%jJ%%%%%JJ%J%KJjj%jj%%%%%%%%%J%j%%%%J%%%j%%J%%%j%J
1316A29j%j%%%%J%%%Jj%j%%%%jJ%%%J%%j%J%%j%%jJJJ%%Jj%%j%JJ%jj%%%jJ%J%%%J%%jj%J
1309A29JJJ%%%%%%j%jJJjJ%J%%j%j%%%%%%%%J%%%JJ%%jjj%%%%%%%%jkjJ%%%%%%%J%JJ%%%%
1302A31%%%j%%J%%jj%%j%J%%%%%jj%j%%%%Jj%J%Jj%%%%J%jjJ%%%J%J%J%j%j%jJJjJ%j%j%%
1294A27jJJJjj%%%%%%%J%%%%jj%%J%%%%%jJ%%%%j%J%%j%%%J%J%J%%jj%jj%%%%%%J%%Jj%%%
$$ y = [126, 125, 125, 125, 125, 125, 125, 125, 125, 125, 126, 126, 126, 126, 126, 127, 127, 127, 126, 126, 126, 128, 129, 128, 127, 127, 126, 125, 125, 125, 125, 125, 126, 126, 127, 126, 126, 126, 126, 126, 127, 128, 128, 128, 128, 128, 127, 127, 127, 126, 126, 126, 126, 126, 126, 126, 126, 125, 125, 126, 127, 127, 127, 126, 125, 124, 125, 126, 127, 127, 127, 126, 126, 126, 126, 125, 125, 125, 126, 127, 128, 128, 129, 128, 128, 127, 127, 127, 127, 126, 126, 127, 127, 127, 127, 128, 128, 127, 127, 126, 126, 126, 126, 126, 127, 126, 126, 127, 128, 127, 127, 126, 126, 127, 127, 127, 127, 127, 127, 127, 127, 127, 127, 128, 127, 127, 128, 129, 128, 128, 128, 129, 128, 128, 128, 128, 127, 128, 128, 128, 128, 128, 129, 129, 127, 125, 125, 126, 127, 127, 128, 127, 127, 127, 126, 126, 126, 126, 127, 128, 128, 128, 128, 127, 127, 127, 126, 127, 128, 129, 129, 128, 128, 127, 127, 127, 127, 127, 127, 126, 127, 127, 127, 127, 126, 126, 127, 127, 127, 128, 128, 128, 128, 128, 129, 129, 128, 127, 127, 127, 127, 127, 127, 128, 128, 128, 127, 127, 127, 128, 127, 126, 126, 126, 126, 126, 126, 126, 126, 126, 126, 126, 126, 126, 126, 126, 126, 126, 125, 126, 126, 126, 126, 126, 126, 127, 128, 128, 129, 129, 131, 132, 131, 130, 130, 129, 128, 128, 128, 128, 128, 128, 128, 128, 128, 128, 129, 129, 128, 128, 128, 128, 128, 129, 129, 129, 129, 128, 128, 128, 129, 129, 129, 129, 128, 128, 129, 128, 128, 127, 127, 127, 127, 127, 128, 128, 128, 128, 129, 128, 128, 127, 127, 127, 127, 127, 126, 127, 127, 127, 127, 128, 128, 128, 127, 127, 128, 128, 128, 127, 127, 127, 126, 127, 128, 129, 129, 129, 130, 129, 129, 129, 128, 128, 129, 130, 130, 129, 128, 128, 128, 128, 127, 128, 128, 129, 129, 129, 129, 130, 130, 130, 129, 128, 128, 129, 130, 131, 132, 132, 132, 132, 132, 132, 132, 131, 131, 130, 131, 132, 131, 132, 132, 133, 133, 133, 132, 132, 131, 131, 131, 131, 131, 131, 131, 131, 131, 132, 132, 132, 132, 133, 134, 134, 134, 133, 132, 131, 131, 131, 131, 131, 131, 131, 131, 131, 130, 128, 127, 128, 128, 128, 128, 128, 128, 128, 128, 129, 129, 130, 131, 131, 131, 131, 131, 131, 131, 131, 130, 130, 130, 131, 131, 131, 130, 129, 129, 129, 128, 128, 129, 129, 129, 129, 129, 129, 128, 127, 127, 126, 126, 126, 126, 126, 127, 126, 126, 127, 127, 128, 127, 127, 127, 127, 127, 128, 128, 127, 126, 127, 127, 127, 127, 128, 128, 129, 129, 130, 130, 129, 129, 128, 128, 127, 128, 129, 128, 129, 129, 128, 128, 127, 127, 127, 126, 127, 128, 129, 128, 127, 127, 127, 127, 127, 127, 127, 127, 128, 128, 128, 128, 128, 127, 126, 126, 126, 127, 127, 127, 127, 127, 127, 126, 127, 127, 127, 127, 127, 126, 126, 127, 127, 127, 126, 126, 126, 126, 127, 127, 128, 128, 129, 129, 129, 128, 127, 127, 126, 125, 125, 125, 125, 125, 125, 125, 126, 126, 126, 127, 126, 126, 126, 126]
1287A26J%JJj%%j%%j%jJKJj%%j%jJ%%%JJj%%j%%%jJ%%%%jJ%JJj%j%%%J%%%%j%%%%%%j%%%j
1280A25%JJ%%%%j%%%%%%%jjjJJK%%j%j%%J%J%%%%%jj%%JJ%J%%Jkjj%JJ%%j%%J%%%J%%%%j%
1272A27j%%%%J%%%%%jJJj%%%%JJ%%%%%%J%%J%%%KJJKKK%%j%%Jjjjjjjj%jjjjj%%%j%%%%%%
1265A28jjJJjJJ%Jj%jj%%J%Jjj%kJ%%JJ%jj%J%jj%J%%%%%%Jj%%%%J%jj%%%%%%JJ%J%jj%%j
1258A25j%JJ%%%%%j%%%J%J%J%j%%%%%%%%%J%j%j%%%%J%%%%jJ%%%%%jJ%j%%%%JJjJ%%jj%%j
1250A25%j%J%J%%%%%%%Jj%%%%J%%j%%JK%%j%%%%%%j%%j%%j%%JjJ%%%%J%%JjjJj%%%%j%%%%
1243A25%%%%%%%%J%%j%%%%J%J%j%%%%J%j%%%%%%%j%%j%%JJ%J%j%%J%%%%%j%j%%%Jjj%KJj%
1236A26%%J%%k%J%%%%%%%%%%%%%J%%j%%J%%j%Jj%J%%jj%%J%J%j%%%%j%J%j%%%%J%%%Jj%%%
$$ y = [126, 127, 127, 128, 129, 128, 128, 128, 127, 127, 127, 126, 126, 125, 126, 128, 129, 128, 128, 128, 127, 127, 126, 127, 127, 127, 127, 128, 129, 128, 128, 128, 127, 127, 127, 127, 126, 127, 127, 127, 127, 127, 126, 127, 127, 128, 129, 128, 128, 127, 127, 127, 127, 128, 128, 128, 128, 128, 127, 127, 127, 127, 127, 127, 127, 126, 126, 126, 126, 125, 125, 126, 127, 127, 127, 127, 127, 126, 126, 126, 126, 126, 126, 126, 126, 125, 124, 123, 124, 125, 127, 127, 127, 126, 126, 125, 125, 125, 126, 126, 127, 127, 127, 127, 127, 127, 126, 125, 125, 125, 126, 127, 127, 128, 128, 128, 129, 127, 126, 125, 125, 126, 127, 127, 127, 126, 126, 126, 127, 127, 127, 127, 128, 128, 128, 128, 128, 127, 127, 126, 126, 126, 126, 126, 127, 127, 127, 127, 127, 127, 126, 127, 128, 127, 127, 127, 127, 127, 128, 129, 129, 129, 129, 129, 129, 129, 130, 130, 130, 131, 131, 131, 131, 133, 134, 135, 137, 139, 141, 141, 141, 140, 140, 140, 141, 140, 139, 138, 137, 136, 135, 134, 134, 133, 132, 131, 130, 129, 129, 129, 129, 128, 128, 128, 128, 128, 128, 128, 127, 126, 127, 128, 127, 128, 129, 129, 130, 129, 129, 128, 127, 127, 127, 128, 128, 129, 128, 127, 127, 125, 126, 126, 126, 127, 128, 128, 127, 126, 126, 127, 127, 126, 125, 125, 126, 126, 126, 126, 126, 126, 126, 127, 126, 126, 126, 126, 126, 127, 127, 126, 125, 125, 125, 125, 125, 125, 125, 126, 127, 127, 128, 128, 127, 126, 126, 126, 125, 124, 124, 125, 126, 126, 126, 126, 126, 126, 125, 125, 125, 125, 126, 126, 127, 127, 128, 128, 127, 127, 127, 127, 127, 127, 127, 127, 127, 127, 128, 128, 127, 127, 126, 126, 126, 126, 126, 127, 127, 127, 127, 127, 126, 127, 127, 127, 127, 127, 127, 126, 127, 127, 126, 126, 126, 126, 126, 127, 128, 127, 128, 128, 128, 127, 126, 126, 126, 125, 125, 124, 124, 125, 125, 126, 126, 126, 126, 126, 126, 126, 126, 127, 126, 126, 126, 126, 126, 127, 127, 127, 126, 126, 126, 127, 129, 129, 129, 128, 128, 128, 128, 128, 128, 128, 127, 127, 127, 126, 126, 126, 125, 125, 125, 126, 125, 126, 126, 126, 126, 126, 127, 127, 127, 128, 127, 126, 127, 126, 126, 126, 126, 126, 125, 125, 125, 125, 125, 125, 125, 125, 125, 125, 125, 125, 125, 126, 126, 126, 125, 125, 125, 125, 125, 126, 126, 127, 127, 126, 126, 126, 126, 126, 127, 127, 126, 126, 126, 126, 126, 126, 126, 126, 125, 125, 125, 124, 124, 124, 125, 126, 126, 127, 127, 126, 126, 126, 127, 127, 127, 127, 127, 127, 126, 126, 125, 125, 125, 125, 126, 125, 124, 124, 126, 127, 126, 126, 126, 126, 127, 127, 127, 125, 125, 126, 126, 126, 126, 126, 126, 126, 126, 126, 126, 126, 126, 126, 126, 127, 127, 127, 126, 126, 126, 127, 127, 127, 126, 126, 127, 126, 126, 127, 127, 127, 126, 125, 125, 125, 126, 126, 127, 127, 126, 126, 126, 126, 126, 125, 125, 126, 126, 125, 125, 125, 125, 125, 126, 126, 126, 126, 127, 126, 126, 126, 126]
1229A26JjJ%%%J%j%%%j%%%%JJJjj%j%%%%%%%%%%%%j%%JJ%%j%%%%J%%%%jj%%%J%Jj%%JJj%j
1221A26%%J%j%%%J%%%%%%%%%jj%%jJ%%%JJjj%%JJ%%%%%%%%j%%%%%%%Jj%J%%%%%%%%jJ%%jJ
1214A27J%j%%%jj%%%%J%j%J%%j%J%j%%J%%%%%%%%%%%%%j%Jj%%J%%%%%j%J%%JJ%j%%%%j%%J
1207A27j%%%j%%%%KJ%j%j%%%%%%KJ%j%j%jj%%%%%%%%%%J%%%%%%J%%jJ%J%%%%jj%%%%%J%jj
1199A25%%JJjjJ%%%%%%%%%J%%%%j%%%%%JJJ%%j%JJ%J%Jkjj%Jj%%%J%%%J%%%J%%%Jj%JjjjJ
1192A30%j%%jjjj%J%%%J%j%%%J%JJj%jj%%j%%J%J%j%j%j%jJ%%%J%%J%J%%%j%%%%j%%J%%%%
1185A26%J%%%%%J%jj%j%%%%%%%%%JJ%j%jj%%%JJ%%%%J%%Jj%%j%%%%j%%jJj%J%%%%J%Jj%j%
1177A25J%J%%%Jjj%jJ%%%J%%k%JJ%%%jjJ%%Jj%%JJ%%j%j%%%%J%%%%j%J%J%k%%%%%%%J%%%%
$$ y = [126, 127, 126, 127, 127, 127, 127, 128, 128, 127, 127, 127, 127, 126, 126, 126, 126, 126, 127, 128, 129, 128, 127, 127, 126, 126, 126, 126, 126, 126, 126, 126, 126, 126, 126, 126, 126, 125, 125, 125, 126, 127, 127, 127, 126, 126, 126, 126, 126, 127, 127, 127, 127, 127, 126, 125, 125, 125, 125, 126, 126, 127, 126, 126, 126, 127, 128, 127, 127, 126, 126, 126, 127, 127, 126, 126, 126, 126, 127, 127, 127, 127, 127, 127, 127, 127, 127, 127, 126, 125, 125, 125, 124, 125, 125, 125, 125, 126, 127, 126, 125, 125, 125, 126, 127, 127, 127, 127, 127, 127, 127, 127, 127, 126, 126, 126, 126, 126, 126, 126, 126, 127, 126, 126, 127, 127, 127, 127, 127, 127, 127, 127, 127, 126, 127, 127, 127, 126, 127, 128, 128, 127, 127, 127, 127, 126, 125, 125, 125, 125, 125, 126, 126, 125, 125, 126, 126, 126, 125, 125, 126, 126, 125, 125, 125, 126, 126, 126, 126, 126, 126, 126, 126, 126, 126, 126, 126, 126, 126, 125, 125, 126, 125, 125, 125, 126, 126, 126, 126, 126, 126, 125, 125, 126, 126, 126, 127, 128, 128, 127, 127, 127, 127, 127, 126, 126, 126, 127, 126, 126, 126, 126, 125, 125, 125, 125, 125, 127, 128, 128, 127, 127, 126, 126, 126, 126, 126, 126, 126, 128, 129, 129, 128, 128, 127, 127, 126, 125, 125, 125, 125, 125, 125, 125, 125, 125, 125, 125, 126, 126, 126, 126, 126, 126, 126, 127, 127, 127, 126, 127, 127, 128, 128, 128, 128, 128, 127, 126, 126, 126, 126, 126, 126, 127, 127, 126, 125, 125, 125, 126, 127, 126, 125, 126, 126, 126, 126, 126, 126, 126, 126, 126, 126, 127, 127, 127, 127, 127, 126, 126, 126, 126, 126, 126, 127, 128, 129, 129, 129, 128, 128, 129, 130, 130, 131, 131, 132, 130, 129, 128, 128, 129, 128, 128, 128, 128, 129, 129, 129, 129, 130, 130, 130, 130, 131, 131, 131, 131, 132, 131, 131, 132, 131, 130, 129, 130, 130, 129, 129, 129, 128, 127, 126, 125, 125, 126, 126, 126, 126, 127, 127, 126, 126, 126, 126, 127, 127, 128, 129, 128, 128, 127, 126, 126, 126, 125, 125, 125, 126, 126, 127, 127, 126, 126, 125, 125, 124, 124, 123, 124, 124, 124, 124, 125, 125, 125, 126, 126, 127, 127, 127, 127, 126, 126, 126, 126, 126, 125, 125, 125, 126, 126, 126, 126, 126, 126, 127, 127, 127, 127, 127, 127, 128, 128, 127, 126, 126, 125, 125, 125, 125, 125, 125, 125, 125, 125, 125, 126, 127, 127, 126, 126, 125, 124, 124, 124, 124, 125, 126, 126, 126, 126, 126, 127, 127, 127, 128, 127, 127, 127, 126, 126, 126, 126, 126, 125, 125, 125, 124, 125, 124, 124, 125, 125, 125, 125, 125, 126, 126, 127, 126, 126, 125, 125, 126, 126, 127, 127, 127, 127, 128, 127, 126, 126, 125, 126, 126, 126, 126, 127, 127, 127, 125, 125, 126, 127, 127, 127, 127, 126, 125, 126, 126, 126, 127, 126, 126, 126, 127, 128, 128, 128, 127, 127, 126, 126, 126, 126, 126, 127, 127, 127, 127, 127, 126, 126, 127, 127, 128, 128, 126, 126, 126, 126, 126, 126, 126, 126, 127, 127, 127, 127, 127]
1170A27%%j%J%%Jj%j%%%%%%%%%jJ%J%%%%%%J%jj%JJ%%j%%%J%%%%%%%%j%jjJJJ%%%j%%JjjJ
1163A27%%%%%J%%jJ%%%%%%%%%JJj%jj%%J%%J%J%jjJJJjjjjjj%%J%JJ%%%j%J%%%%J%%jj%J%
1155A28j%%%%J%jJ%%jJ%J%jjjJ%J%%%%j%%%%%%%JJj%j%j%%%%J%%j%%J%j%%%%j%jJJ%%%%JJ
1148A28%%%%j%j%J%%%%J%%j%jJ%%%JJj%j%%%%%J%%J%j%%%%%%%%J%%%%J%j%%%%%%JJJj%j%%
1141A30jj%j%%JJ%J%%j%%j%j%J%J%j%%%%%%%%J%%j%j%%JJ%%%jj%j%JJ%%%%%%%J%J%%%%j%%
1133A29Jjjj%JJ%J%%%%%%%%%Jj%jj%%%%j%%%JJ%j%jJ%%%J%%%%jJ%%%%%jJJ%%%%%j%%%Jj%J
1126A30J%j%J%J%kj%%%%jJ%%%%%%%j%%%%J%%%%%%%j%%%JJ%j%%%%jjJ%J%%%%%%Jjj%%j%Jj%
1119A27J%%%%%j%J%j%%jJJJJj%j%%%%%%J%%%j%J%%%%%j%j%J%J%j%%%J%%%j%%J%%%%%j%%%%
$$ y = [127, 127, 127, 126, 126, 127, 127, 127, 128, 127, 127, 126, 126, 126, 126, 126, 126, 126, 126, 126, 126, 125, 126, 126, 127, 127, 127, 127, 127, 127, 127, 128, 128, 127, 126, 126, 127, 128, 128, 128, 127, 127, 127, 127, 128, 128, 128, 128, 128, 128, 128, 128, 128, 127, 127, 126, 125, 126, 127, 128, 128, 128, 128, 127, 127, 127, 128, 127, 126, 127, 127, 127, 127, 127, 127, 128, 128, 128, 127, 128, 128, 128, 128, 128, 128, 128, 128, 128, 128, 129, 130, 129, 129, 128, 127, 127, 127, 128, 128, 128, 129, 129, 130, 130, 129, 128, 129, 130, 131, 130, 129, 128, 127, 126, 125, 125, 125, 126, 126, 127, 128, 128, 128, 128, 127, 127, 128, 128, 128, 128, 128, 129, 129, 129, 128, 127, 127, 128, 128, 127, 127, 127, 127, 127, 128, 128, 127, 128, 128, 128, 127, 128, 128, 129, 129, 128, 127, 126, 127, 127, 128, 128, 128, 128, 128, 127, 127, 127, 127, 127, 127, 127, 127, 128, 129, 128, 128, 127, 127, 126, 126, 126, 126, 126, 127, 127, 127, 126, 126, 126, 127, 127, 126, 126, 126, 126, 126, 125, 125, 124, 125, 126, 126, 126, 126, 126, 127, 128, 128, 128, 128, 128, 127, 127, 126, 126, 127, 127, 127, 127, 127, 128, 128, 128, 127, 127, 126, 127, 127, 127, 127, 128, 129, 128, 128, 127, 127, 127, 127, 127, 127, 128, 128, 128, 129, 129, 128, 128, 128, 128, 128, 128, 128, 128, 128, 129, 129, 129, 129, 129, 130, 130, 129, 129, 129, 129, 129, 129, 129, 130, 131, 132, 131, 131, 130, 130, 130, 129, 128, 128, 127, 127, 127, 128, 129, 129, 130, 130, 130, 129, 129, 129, 128, 128, 127, 127, 128, 128, 129, 129, 128, 128, 128, 128, 128, 128, 128, 128, 128, 129, 129, 129, 128, 128, 127, 127, 127, 128, 129, 129, 129, 129, 128, 127, 127, 126, 126, 127, 128, 128, 128, 128, 128, 128, 128, 128, 129, 129, 130, 130, 130, 130, 130, 129, 129, 129, 130, 129, 128, 127, 127, 128, 129, 129, 130, 130, 130, 130, 130, 130, 130, 130, 130, 130, 131, 130, 130, 129, 128, 128, 128, 128, 128, 127, 127, 127, 127, 128, 129, 129, 128, 128, 127, 128, 128, 128, 128, 129, 129, 129, 129, 129, 128, 129, 129, 129, 129, 129, 129, 128, 129, 130, 130, 130, 130, 130, 130, 129, 129, 129, 129, 130, 129, 129, 130, 131, 131, 130, 130, 131, 131, 132, 132, 130, 129, 129, 129, 129, 129, 128, 129, 129, 129, 129, 129, 129, 129, 129, 128, 128, 128, 128, 128, 129, 129, 129, 129, 129, 129, 129, 129, 128, 128, 128, 128, 129, 130, 130, 129, 129, 129, 129, 129, 128, 127, 128, 128, 129, 129, 129, 129, 129, 129, 129, 130, 129, 128, 128, 128, 127, 127, 128, 127, 127, 128, 128, 128, 128, 128, 128, 127, 127, 128, 128, 127, 127, 127, 126, 127, 128, 129, 130, 129, 129, 128, 128, 128, 128, 128, 128, 128, 129, 129, 129, 129, 128, 128, 129, 129, 129, 129, 129, 129, 128, 128, 127, 127, 128, 128, 129, 129, 128, 128, 128, 128, 129, 129, 129, 129, 128, 128, 128, 129, 129, 129, 129, 129, 129, 128, 128, 128, 128, 128]
1112A28J%J%jj%%%%j%%j%J%J%J%%jj%%J%jJ%%%%j%%jJj%%JJJ%%%%jj%j%JJ%JJ%j%jj%j%%J
1104A27%JJj%%%%%%%%jj%%%%%%%%%%J%%jJj%%JJ%%%j%%%J%J%J%%j%j%j%jJ%j%JJ%jjj%JJ%
1097A27%J%j%%%%jjJ%%%%j%JJ%%%jJ%%j%%j%%JJj%%J%%%%j%%jJ%%j%%%JJ%%%%%j%J%J%%j%
1090A27j%%%JJj%%%%%%%%%jJJj%%J%%j%%%J%%j%j%%%%%%%%%JJ%%j%j%jJJ%%j%%%%%%J%%%j
1082A26%J%%%%j%%%J%%%J%%%%%J%%%j%jj%%%jJJJ%j%J%%J%%%%%j%%%j%%j%JJ%J%%jJ%%J%%
1075A30%%%%%jj%J%%%%j%J%%jJ%%%Jj%%JJ%jjJ%jJ%%%j%%%%%j%J%%j%%%%%%%%%%j%%JJJ%j
1068A29%%J%%j%j%J%J%%j%J%%%%%%jjJ%%%%%%j%%J%%%%jj%%%%%J%%%%J%%%jj%%%%%%%%%J%
1060A28%j%%%J%JJj%j%%J%J%%%%j%%%%%%%%%jJJJ%%%%%%%j%%j%%%%j%%J%%%j%%%%JjJ%%%%
$$ y = [128, 129, 129, 130, 130, 129, 128, 128, 128, 128, 128, 127, 127, 127, 126, 126, 127, 127, 128, 128, 129, 129, 129, 128, 127, 127, 127, 128, 128, 127, 128, 128, 128, 128, 128, 127, 127, 127, 126, 127, 126, 126, 126, 127, 128, 129, 129, 129, 129, 129, 128, 127, 127, 126, 126, 127, 128, 128, 129, 130, 130, 129, 129, 128, 127, 127, 126, 126, 126, 127, 127, 128, 129, 128, 128, 128, 128, 128, 128, 128, 128, 128, 127, 126, 126, 126, 126, 126, 126, 126, 126, 126, 126, 126, 127, 127, 127, 126, 127, 126, 126, 126, 127, 128, 128, 128, 128, 127, 127, 127, 127, 128, 128, 129, 129, 130, 130, 130, 129, 129, 128, 128, 127, 127, 126, 127, 127, 126, 126, 127, 128, 128, 127, 126, 125, 125, 126, 127, 127, 127, 128, 128, 127, 127, 127, 127, 127, 126, 125, 126, 126, 126, 126, 126, 125, 125, 126, 127, 127, 127, 127, 126, 127, 127, 127, 126, 126, 126, 125, 125, 125, 126, 127, 126, 126, 126, 127, 127, 127, 127, 127, 126, 126, 126, 125, 126, 126, 126, 125, 125, 125, 125, 126, 127, 127, 127, 127, 127, 127, 126, 126, 127, 127, 128, 128, 128, 127, 127, 126, 126, 126, 126, 127, 128, 127, 127, 127, 127, 127, 127, 127, 127, 127, 127, 126, 127, 128, 127, 127, 127, 128, 128, 128, 127, 127, 127, 127, 128, 128, 128, 127, 127, 126, 126, 126, 126, 126, 126, 126, 126, 126, 126, 127, 128, 128, 128, 127, 127, 126, 126, 125, 126, 127, 127, 127, 126, 126, 126, 126, 126, 126, 126, 127, 127, 127, 127, 126, 126, 127, 127, 127, 127, 127, 126, 126, 126, 126, 127, 127, 127, 127, 128, 128, 128, 128, 128, 128, 129, 129, 129, 129, 128, 128, 127, 126, 126, 126, 126, 125, 126, 127, 128, 128, 127, 127, 128, 128, 128, 129, 129, 129, 129, 129, 129, 128, 128, 128, 128, 127, 127, 127, 126, 126, 127, 128, 128, 129, 129, 129, 128, 129, 129, 129, 130, 130, 130, 130, 130, 130, 130, 130, 129, 128, 128, 129, 129, 129, 129, 129, 128, 128, 129, 129, 129, 128, 129, 129, 129, 129, 130, 129, 129, 129, 130, 131, 131, 130, 129, 130, 130, 129, 130, 130, 130, 130, 129, 129, 129, 129, 129, 129, 128, 128, 129, 129, 129, 128, 128, 128, 128, 128, 128, 128, 128, 128, 128, 128, 127, 127, 127, 128, 129, 130, 130, 129, 129, 129, 130, 130, 130, 129, 129, 128, 128, 129, 129, 130, 130, 130, 129, 129, 130, 130, 130, 130, 130, 130, 130, 129, 128, 129, 129, 129, 129, 129, 129, 129, 128, 128, 128, 129, 129, 129, 129, 129, 128, 127, 127, 127, 127, 127, 127, 128, 128, 128, 128, 128, 129, 129, 129, 129, 128, 127, 127, 127, 127, 127, 127, 127, 127, 127, 127, 128, 128, 128, 127, 127, 127, 127, 128, 128, 129, 130, 129, 129, 128, 128, 128, 129, 129, 130, 130, 130, 130, 130, 129, 129, 129, 129, 129, 129, 129, 129, 129, 129, 128, 129, 130, 131, 131, 131, 131, 131, 131, 131, 131, 130, 130, 130, 129, 129, 129, 129, 129, 128, 128, 128, 129, 129, 129, 129, 128, 128, 128, 128, 128, 129, 128, 129, 129, 129, 129, 129]
1053A29J%jJ%jj%%JJ%%%j%%jJ%%%%j%%%%J%JJ%Jj%%%%%%%J%%j%J%%%%jjjJJJ%j%%j%J%%j%
1046A30%j%%%J%%jj%%jJ%J%%%%JK%jJ%j%%jJ%j%%J%j%%%jJ%J%%%%%j%%%%%%J%j%j%%%JJ%j
1038A30%%j%j%%%%JJ%j%%%%J%%%J%%j%%%J%%%%%%%j%%J%%%j%jJ%JJj%j%%%J%%%J%%%%%%%%
1031A32j%%j%%J%jjJJ%j%%%%%j%%%%J%%j%jJJ%j%JJJj%J%%%Jj%%%%%%%%%%Jj%j%%%%%%%%%
1024A31%%%%%j%J%j%%j%%%%JJK%j%j%%%%%%%%%%j%J%%%%k%%%J%Jj%%KJ%jj%%%%%%J%%%%j%
1016A31%jJ%JJJJJJJ%%jj%J%%jk%%%j%%%jj%Jjk%JJ%%%jJ%%J%j%%%%%%%%%%%%%JJJ%j%%%J
1009A34%J%JJ%J%%%Jjjjjjj%j%j%%J%j%j%j%J%%%j%j%%%%%JJ%j%%J%%jj%JJ%%%%J%%j%%%%
1002A30%%%%%%%%%jjKJjjJ%j%J%Jjjj%J%%%j%%j%%JJ%%JJ%%jJ%j%%%%%%j%j%J%%%%%%%%%%
$$ y = [129, 130, 130, 129, 130, 130, 129, 128, 128, 128, 129, 130, 130, 130, 130, 129, 129, 129, 128, 129, 129, 129, 129, 129, 128, 128, 128, 128, 128, 129, 129, 130, 131, 131, 132, 131, 131, 131, 131, 131, 131, 131, 131, 132, 132, 132, 131, 131, 132, 132, 132, 132, 132, 131, 130, 129, 130, 131, 132, 132, 131, 131, 131, 130, 130, 131, 131, 131, 130, 130, 130, 129, 129, 129, 129, 130, 130, 130, 129, 128, 128, 128, 127, 128, 128, 129, 129, 129, 129, 129, 130, 132, 132, 131, 132, 132, 131, 131, 131, 130, 131, 131, 130, 130, 130, 131, 131, 130, 130, 130, 130, 129, 130, 130, 131, 131, 131, 131, 131, 131, 130, 130, 130, 130, 130, 130, 130, 131, 131, 130, 130, 129, 129, 129, 129, 130, 131, 131, 130, 130, 130, 129, 129, 128, 128, 128, 128, 128, 129, 130, 130, 129, 129, 129, 129, 129, 130, 130, 130, 130, 131, 131, 131, 130, 130, 130, 130, 131, 131, 131, 131, 131, 131, 131, 131, 130, 130, 130, 131, 131, 131, 131, 130, 130, 129, 130, 130, 131, 132, 131, 131, 130, 130, 130, 130, 131, 131, 131, 131, 132, 132, 132, 132, 132, 132, 132, 132, 132, 131, 131, 131, 130, 130, 130, 131, 131, 130, 129, 130, 131, 131, 130, 130, 130, 130, 130, 130, 129, 129, 129, 129, 129, 130, 130, 130, 129, 129, 128, 129, 130, 130, 129, 129, 130, 131, 132, 131, 131, 132, 132, 132, 132, 133, 132, 132, 132, 132, 132, 132, 132, 132, 132, 132, 132, 133, 132, 132, 131, 131, 131, 131, 131, 131, 131, 131, 131, 131, 131, 131, 131, 131, 131, 130, 130, 131, 131, 130, 130, 130, 129, 129, 129, 129, 129, 130, 131, 133, 133, 132, 132, 131, 131, 131, 131, 131, 131, 131, 131, 131, 131, 131, 130, 130, 131, 131, 131, 131, 131, 129, 129, 129, 129, 130, 130, 131, 130, 130, 130, 132, 133, 133, 132, 131, 131, 131, 131, 131, 131, 131, 132, 132, 132, 132, 132, 131, 131, 131, 130, 131, 131, 132, 133, 134, 135, 136, 137, 138, 138, 138, 137, 136, 136, 137, 137, 137, 136, 134, 134, 134, 134, 133, 133, 133, 133, 132, 131, 131, 132, 131, 129, 129, 130, 131, 131, 131, 131, 130, 131, 131, 131, 132, 132, 131, 131, 131, 131, 131, 131, 131, 131, 131, 131, 131, 131, 131, 131, 132, 133, 134, 134, 133, 133, 133, 133, 134, 134, 135, 135, 136, 137, 137, 138, 138, 138, 138, 139, 138, 137, 136, 135, 134, 133, 133, 132, 132, 131, 131, 131, 132, 132, 131, 131, 130, 130, 129, 129, 130, 130, 130, 130, 129, 129, 128, 128, 128, 128, 128, 128, 129, 130, 130, 129, 129, 129, 130, 130, 130, 129, 128, 128, 129, 130, 130, 130, 130, 130, 131, 131, 131, 130, 130, 130, 130, 130, 130, 130, 130, 130, 130, 130, 130, 130, 130, 129, 128, 130, 131, 130, 129, 130, 130, 129, 129, 130, 130, 131, 130, 129, 128, 128, 129, 129, 129, 129, 128, 128, 128, 127, 127, 127, 128, 129, 129, 129, 130, 131, 131, 131, 130, 131, 131, 130, 130, 130, 130, 130, 130, 130, 129, 129, 128, 128, 129, 129, 129, 129, 129, 129, 129, 129, 129, 129, 129]
995A29%j%%%%j%J%JJj%%%%%j%%%%%%J%%%j%%%%%%%%%%%%%%%J%J%JJjj%%%j%jJJJ%Jjj%%%%
987A30j%%%%j%%%%%%%J%%%Jj%j%%J%%%%%%j%%%%jJJ%%%%%jj%KJ%%%%%%jjJ%%%%jJJjj%%j%
980A27%%%%J%Jj%%%%%J%%%j%jJ%%Jj%%%%%J%%j%%%%%%J%%%%Jjj%Jj%%%%%%%K%%%jj%%J%%J
972A30j%%%j%%%%%JJjj%J%%jJ%J%%jjj%J%JJJ%jjJ%%%%%%%%JJj%jJJj%jjKJ%j%J%%%%%%J%
965A33%%%JJJK%%%JJ%%kjj%%%%j%jjkjj%J%%%J%%%%j%J%j%%%JjkJ%%%%%%%%jJ%J%j%%%J%J
957A31%%%%j%%%jJ%J%%j%j%%%%%J%%%%%j%%J%%%jj%%%%%J%%%%%%%%%j%%%J%%%J%%j%J%%jJ
950A30%%%%%%%%j%%J%J%j%%%J%%J%j%%j%%%%j%%%Jj%J%%%%%J%j%%%%%%%J%J%j%j%%%JJ%%j
943A31j%JjjJ%JJJ%j%%%%jjJ%%J%%%%%J%J%J%%jj%%%jJ%%%j%%J%jj%%%j%%%%%%j%J%J%Jj%
$$ y = [129, 129, 128, 128, 128, 128, 128, 127, 127, 128, 128, 129, 130, 129, 129, 129, 129, 129, 129, 128, 128, 128, 128, 128, 128, 128, 129, 129, 129, 129, 128, 128, 128, 128, 128, 128, 128, 128, 128, 128, 128, 128, 128, 128, 128, 128, 129, 129, 130, 130, 131, 132, 131, 130, 130, 130, 130, 129, 129, 128, 129, 130, 131, 131, 132, 131, 130, 130, 130, 130, 130, 129, 129, 129, 129, 129, 128, 128, 128, 128, 128, 128, 128, 128, 129, 129, 129, 129, 130, 129, 129, 128, 128, 128, 129, 129, 129, 129, 129, 129, 129, 128, 128, 128, 128, 128, 127, 128, 129, 129, 129, 129, 129, 129, 128, 127, 127, 129, 130, 130, 130, 130, 130, 130, 130, 129, 128, 129, 129, 129, 129, 129, 128, 129, 130, 129, 128, 128, 128, 127, 127, 127, 127, 127, 127, 128, 128, 129, 128, 128, 128, 128, 128, 128, 129, 129, 129, 129, 128, 128, 127, 128, 128, 128, 129, 128, 128, 128, 128, 128, 128, 129, 129, 129, 128, 128, 128, 128, 128, 128, 128, 129, 129, 129, 129, 129, 130, 129, 128, 128, 129, 128, 128, 128, 128, 128, 128, 128, 128, 130, 130, 130, 130, 129, 128, 128, 128, 129, 129, 129, 130, 129, 129, 129, 129, 128, 128, 128, 128, 128, 128, 129, 130, 129, 128, 128, 129, 129, 129, 128, 129, 129, 130, 130, 130, 129, 128, 127, 127, 128, 128, 129, 130, 131, 131, 130, 129, 130, 130, 130, 130, 130, 130, 130, 130, 130, 131, 132, 131, 131, 130, 131, 132, 131, 131, 130, 129, 131, 132, 132, 131, 131, 132, 132, 132, 132, 132, 132, 132, 133, 133, 133, 133, 133, 134, 135, 136, 138, 138, 138, 138, 139, 140, 140, 140, 138, 137, 136, 136, 136, 136, 136, 135, 135, 134, 133, 131, 130, 129, 129, 130, 130, 130, 130, 131, 131, 131, 131, 131, 130, 130, 131, 131, 130, 130, 130, 130, 131, 130, 128, 129, 129, 129, 129, 129, 129, 129, 129, 129, 128, 129, 129, 130, 130, 129, 129, 129, 129, 130, 130, 131, 131, 131, 131, 131, 130, 130, 130, 130, 129, 130, 130, 131, 131, 131, 130, 130, 129, 129, 129, 129, 129, 129, 130, 130, 130, 130, 130, 130, 129, 129, 129, 130, 130, 130, 130, 129, 128, 128, 128, 128, 128, 128, 129, 129, 129, 129, 129, 129, 129, 129, 129, 129, 128, 128, 128, 128, 129, 129, 129, 129, 130, 130, 130, 129, 129, 130, 130, 130, 129, 130, 130, 130, 130, 130, 130, 130, 130, 130, 129, 129, 129, 130, 130, 131, 131, 130, 130, 130, 130, 131, 131, 131, 132, 132, 131, 131, 131, 130, 130, 130, 130, 130, 129, 129, 129, 129, 130, 129, 129, 130, 130, 130, 130, 130, 130, 131, 131, 130, 130, 130, 130, 130, 130, 130, 130, 131, 131, 132, 132, 131, 131, 130, 130, 130, 130, 131, 132, 132, 132, 131, 130, 130, 131, 130, 129, 130, 130, 131, 132, 133, 133, 132, 132, 132, 132, 132, 131, 130, 131, 131, 131, 132, 132, 132, 132, 132, 132, 133, 133, 134, 134, 135, 135, 135, 134, 133, 133, 133, 133, 132, 133, 133, 133, 133, 132, 132, 132, 133, 133, 132, 131, 131, 131, 131, 130, 130, 130, 130, 130, 130, 130, 129, 129, 130, 130, 131, 131, 132, 131, 131]
935A31%%%%%%J%J%j%%%%jj%%J%%%%%%%%j%J%%%j%%J%J%%%%JJ%JJ%%J%JJJj%%J%Jjjjjjj%%
928A35j%%JJ%%%j%jj%%J%j%%%%jj%%J%J%%j%%%j%J%%J%%%%%%j%%%j%%%%%%%J%%%%j%JJ%%J
920A34%%%%jk%%%j%%%jJ%%Jj%%%%J%%%J%J%%%j%j%%J%%%%%%J%%%%%%jjJ%%%%j%%J%%%J%%%
913A33j%%%%Jj%j%%JJJj%%%%%%%%J%%%%%Jj%%jjJ%jj%jJKJjJ%jj%%%%%JJ%jJ%%%JJj%J%%%
906A36%j%j%j%jJ%%J%JJ%J%%jjj%%J%JJJ%JJjj%j%j%j%JJ%%jJ%J%%jjj%%%%%%%%%%J%%%%%
898A36%%%%J%j%%J%%%%J%%%%%%%%j%%%%%%J%%%J%%%%%%%J%%%j%%%J%%%%%%j%%J%%%j%%%%%
891A39%JJ%%j%%%j%%JJ%KJ%jjJ%%%JJ%%%j%J%JJJJK%J%%%%%%jjjj%%%%%%%jjJJJJ%%%j%%%
883A49%%%%%%%%%%%%%JJjjjJ%%%%%%%%Jj%jJJ%%J%%%Jj%%%%JJJj%J%%%jJ%%%JJ%%%J%%%J%
$$ y = [131, 131, 131, 131, 131, 131, 131, 132, 132, 133, 133, 132, 132, 132, 132, 132, 131, 130, 130, 130, 131, 131, 131, 131, 131, 131, 131, 131, 131, 130, 130, 131, 131, 131, 131, 130, 130, 130, 131, 131, 132, 132, 132, 132, 132, 133, 134, 134, 135, 136, 136, 136, 137, 137, 138, 139, 140, 139, 139, 139, 140, 140, 141, 140, 139, 138, 137, 136, 135, 135, 135, 134, 134, 134, 135, 136, 136, 136, 136, 135, 135, 134, 133, 133, 133, 134, 134, 133, 133, 133, 133, 133, 132, 131, 131, 131, 132, 132, 133, 133, 133, 132, 132, 132, 132, 131, 131, 132, 132, 132, 133, 133, 133, 133, 133, 133, 133, 132, 132, 132, 132, 131, 131, 131, 131, 131, 131, 131, 131, 132, 132, 132, 132, 132, 131, 131, 132, 133, 133, 133, 134, 134, 134, 134, 134, 133, 131, 131, 131, 131, 130, 130, 130, 130, 129, 130, 130, 130, 131, 130, 130, 130, 130, 130, 131, 131, 131, 131, 132, 132, 133, 133, 133, 133, 132, 132, 131, 131, 131, 132, 132, 132, 132, 132, 132, 132, 133, 133, 133, 133, 133, 133, 133, 132, 131, 132, 132, 132, 132, 132, 131, 131, 131, 132, 132, 132, 132, 133, 133, 133, 133, 132, 132, 132, 132, 132, 133, 132, 132, 131, 131, 131, 132, 133, 134, 133, 133, 133, 133, 133, 133, 133, 133, 133, 134, 134, 134, 134, 134, 134, 135, 134, 134, 134, 133, 132, 133, 133, 132, 131, 131, 130, 131, 133, 134, 133, 134, 134, 133, 132, 132, 132, 132, 132, 132, 133, 134, 134, 133, 134, 134, 134, 134, 135, 136, 135, 135, 136, 136, 136, 136, 136, 135, 135, 134, 134, 133, 133, 132, 133, 133, 133, 134, 134, 135, 136, 136, 137, 137, 137, 136, 135, 134, 134, 134, 135, 135, 136, 137, 138, 138, 139, 140, 139, 138, 138, 137, 137, 136, 136, 135, 135, 136, 137, 137, 137, 136, 137, 137, 138, 138, 138, 137, 136, 135, 135, 135, 135, 135, 135, 135, 135, 135, 135, 135, 136, 136, 136, 136, 136, 136, 136, 136, 136, 136, 137, 137, 136, 136, 136, 137, 137, 137, 137, 137, 138, 138, 138, 138, 138, 138, 138, 138, 138, 137, 137, 137, 137, 137, 137, 137, 138, 138, 138, 138, 139, 139, 139, 139, 139, 139, 139, 139, 140, 140, 140, 140, 139, 139, 139, 139, 140, 140, 140, 140, 140, 140, 140, 139, 139, 139, 140, 140, 140, 140, 139, 139, 139, 139, 139, 139, 139, 140, 141, 141, 141, 140, 140, 140, 140, 139, 139, 139, 140, 141, 141, 143, 144, 144, 143, 142, 143, 143, 143, 143, 144, 145, 145, 145, 145, 144, 144, 145, 145, 146, 147, 148, 149, 151, 151, 152, 152, 152, 152, 152, 152, 152, 151, 150, 149, 148, 148, 148, 148, 148, 148, 148, 148, 147, 146, 147, 148, 149, 150, 150, 150, 150, 149, 149, 149, 149, 149, 149, 149, 149, 149, 149, 149, 149, 149, 149, 149, 149, 149, 150, 151, 150, 149, 148, 149, 149, 149, 149, 149, 149, 149, 149, 149, 150, 149, 149, 148, 149, 150, 150, 150, 151, 151, 151, 151, 152, 151, 151, 151, 151, 151, 152, 153, 154, 153, 153, 154, 154, 154, 154, 153, 154, 154, 154, 154, 155, 156, 156, 156, 156, 157, 157, 157, 157, 158, 158]
876A58%%%J%JjjJJj%%Jjj%%JJj%%%j%%K%%%%%%%%J%J%%J%%JJJJJ%%j%jJ%%%JJ%%%%JJ%J%J
868A73%j%j%%%%%J%%%%j%%%%JJJj%j%%JJ%%jJ%%%JJJJJJ%%%%%JJ%J%J%JJKJ%%%%J%JJ%%%%
861A92%J%%%%JJJJJJ%jJJJJJKJJJJJKJJJJKJJJKKJ%LLKKKJKKLJKLLKKLMMLLLMMNMMNNONNN
854C31OPOPNNOOMMMLKLKK%jlkmlnnnoooopooopnoomlmlllkmlmnlllllmlllkkklkkkkjkjjk
846B12jjkjj%jjj%j%kjj%%j%j%j%jj%jjj%j%j%Jj%%%%%Jj%j%%jJj%%Jjj%J%j%%%J%%j%%jj
839A83%j%j%%JJj%%%j%%J%%j%%j%JJ%j%j%JJjjjjJ%J%j%j%j%JJ%%%%J%%Jjjjj%%J%%j%J%%
831A78%%j%J%%%%%%j%%%%JJ%%%JjjJ%%%J%%jj%KJj%j%%%%%%Jj%%%%j%%J%%JjJJ%j%%%%%JJ
824A82%%%J%%J%%j%JJ%jJJ%%%%%Jj%%%%%%%%%%%%%JJ%j%jJJJ%j%%j%%jJ%%%%%%jjj%jJ%jj
$$ y = [158, 158, 158, 158, 159, 159, 160, 159, 158, 159, 160, 159, 159, 159, 160, 159, 158, 158, 158, 159, 160, 159, 159, 159, 159, 158, 158, 158, 160, 160, 160, 160, 160, 160, 160, 160, 160, 161, 161, 162, 162, 162, 163, 163, 163, 164, 165, 166, 167, 168, 168, 168, 167, 167, 166, 167, 167, 167, 167, 168, 169, 169, 169, 169, 169, 170, 171, 171, 172, 172, 173, 173, 172, 172, 171, 171, 171, 171, 171, 171, 172, 172, 172, 172, 172, 171, 171, 171, 171, 171, 172, 173, 174, 173, 173, 172, 172, 172, 173, 174, 174, 174, 173, 174, 174, 174, 174, 175, 176, 177, 178, 179, 180, 180, 180, 180, 180, 180, 181, 182, 182, 183, 183, 184, 184, 185, 186, 188, 189, 189, 189, 189, 189, 190, 190, 191, 192, 192, 192, 192, 192, 192, 193, 193, 193, 193, 193, 194, 195, 196, 197, 198, 199, 199, 198, 199, 200, 201, 202, 203, 205, 206, 207, 208, 209, 210, 212, 213, 214, 215, 216, 218, 219, 220, 221, 223, 225, 226, 226, 229, 232, 234, 236, 238, 239, 241, 243, 246, 247, 249, 252, 255, 257, 259, 262, 266, 270, 273, 276, 279, 283, 287, 292, 296, 300, 305, 310, 316, 321, 326, 331, 337, 344, 350, 357, 362, 367, 373, 379, 383, 387, 391, 394, 396, 399, 401, 403, 403, 402, 399, 397, 393, 390, 385, 380, 375, 369, 363, 357, 351, 344, 338, 332, 326, 319, 314, 308, 302, 298, 295, 291, 288, 285, 282, 280, 276, 273, 269, 264, 261, 258, 255, 252, 249, 245, 242, 239, 236, 234, 232, 230, 227, 225, 223, 221, 219, 218, 216, 215, 214, 212, 211, 210, 208, 207, 206, 206, 205, 204, 203, 203, 202, 202, 200, 199, 198, 198, 198, 197, 197, 196, 196, 195, 195, 194, 193, 193, 192, 191, 190, 190, 189, 189, 188, 188, 189, 188, 188, 188, 188, 188, 188, 189, 188, 188, 187, 187, 187, 186, 187, 186, 186, 186, 187, 186, 185, 185, 186, 186, 185, 185, 185, 185, 186, 186, 186, 185, 185, 185, 184, 183, 183, 182, 182, 181, 181, 181, 182, 183, 182, 182, 182, 182, 181, 181, 181, 182, 182, 182, 181, 181, 181, 180, 180, 181, 182, 182, 181, 181, 180, 180, 181, 182, 181, 180, 179, 178, 179, 179, 180, 180, 179, 179, 178, 178, 177, 177, 178, 179, 179, 179, 179, 179, 180, 180, 180, 181, 180, 179, 178, 177, 177, 177, 178, 178, 178, 177, 177, 178, 178, 178, 178, 178, 177, 177, 178, 178, 178, 178, 178, 178, 178, 177, 177, 177, 177, 177, 178, 179, 179, 179, 179, 180, 179, 178, 179, 179, 179, 179, 180, 180, 180, 179, 178, 178, 180, 181, 180, 180, 179, 179, 179, 179, 179, 179, 179, 180, 179, 179, 179, 179, 179, 178, 178, 178, 179, 179, 179, 180, 179, 180, 181, 181, 180, 180, 180, 180, 180, 180, 181, 182, 182, 182, 182, 183, 183, 183, 184, 184, 184, 183, 183, 184, 185, 185, 184, 185, 186, 186, 186, 186, 186, 186, 187, 186, 186, 186, 186, 186, 186, 186, 186, 186, 186, 186, 186, 186, 186, 187, 188, 188, 187, 187, 186, 187, 188, 189, 189, 188, 188, 188, 187, 187, 187, 186, 187, 187, 187, 187, 187, 187, 187, 186, 185, 184, 184, 183, 184, 184, 183, 182]
817A82%jJ%%%j%j%%%%j%%%%%%J%%%jjjJJ%%j%jJJjjj%j%JjjJ%%%%%%j%%%%J%%j%jjj%%%%%
809A71J%jj%%%%%%j%%%%J%%%j%%%%jj%%%%j%%%%%%%%%%%%%%%j%%Jjj%%%%J%%jjj%%Jj%j%%
802A61jJ%%%%jjj%%%JJJJj%%j%J%%%%jjjj%%J%%%%%j%%%JJJ%JJ%J%KJJJJKKKKLKLLKLKLJK
794B01JKKK%JJ%J%%j%jjkkkjj%%jkkjjlmmlmmllkjkkkjjkjjj%%%%J%%%%j%%J%%%jj%%jj%%
787A46%%%%%%%%%%%%%J%%%%j%J%%%%%j%%Jj%%j%j%%%%%%%%Jjj%%J%%J%%j%j%%j%Jj%%Jj%%
779A42j%J%%J%%k%%%%Jj%j%%JJJ%%%%%%%j%%%jJ%J%%jk%J%%%j%j%J%jj%J%%%J%%jJj%%%%%
772A39J%%j%j%%J%%%%%jj%J%%%%%%%jj%J%%%%%%%%%J%jj%%%%%%%%%%J%%%j%%J%%%j%J%%%j
765A36J%%%j%%%j%%%%J%j%%%j%%%%J%%J%%j%%%%jJJ%%Jj%%kjj%J%JJJ%jj%%%jJ%%J%%%%%j
$$ y = [182, 182, 181, 182, 182, 182, 182, 181, 181, 180, 180, 180, 180, 180, 179, 179, 179, 179, 179, 179, 179, 180, 180, 180, 180, 179, 178, 177, 178, 179, 179, 179, 178, 178, 177, 178, 179, 178, 177, 176, 176, 175, 175, 176, 175, 174, 175, 175, 175, 175, 175, 175, 175, 174, 174, 174, 174, 174, 175, 175, 175, 174, 174, 173, 172, 171, 171, 171, 171, 171, 171, 172, 172, 171, 170, 170, 170, 170, 170, 170, 170, 169, 169, 169, 169, 169, 170, 170, 170, 170, 169, 169, 169, 169, 169, 168, 167, 167, 167, 167, 167, 166, 166, 166, 166, 166, 166, 166, 166, 166, 166, 166, 166, 166, 166, 166, 166, 165, 165, 165, 166, 165, 164, 164, 164, 164, 164, 165, 165, 165, 164, 163, 162, 162, 162, 163, 162, 162, 161, 161, 161, 160, 161, 161, 161, 161, 161, 160, 159, 158, 158, 158, 158, 159, 160, 161, 162, 161, 161, 161, 160, 160, 161, 161, 161, 161, 161, 160, 159, 158, 157, 157, 157, 158, 158, 158, 158, 158, 158, 157, 157, 157, 157, 158, 159, 160, 160, 161, 162, 162, 163, 163, 165, 166, 167, 168, 169, 171, 173, 175, 177, 180, 182, 185, 188, 190, 193, 195, 198, 199, 201, 202, 204, 206, 208, 208, 209, 210, 210, 211, 211, 211, 210, 210, 209, 208, 206, 204, 202, 201, 200, 200, 200, 199, 197, 195, 194, 193, 190, 186, 182, 179, 175, 171, 168, 165, 163, 162, 160, 158, 156, 155, 154, 152, 151, 150, 149, 149, 149, 149, 149, 150, 150, 150, 150, 150, 149, 149, 149, 150, 150, 150, 150, 149, 148, 148, 148, 147, 146, 146, 146, 146, 146, 146, 146, 146, 146, 146, 146, 146, 146, 146, 146, 146, 147, 147, 147, 147, 147, 146, 146, 147, 147, 147, 147, 147, 147, 146, 146, 146, 147, 146, 146, 146, 145, 145, 144, 144, 144, 144, 144, 144, 144, 144, 144, 145, 144, 143, 143, 143, 144, 144, 144, 145, 145, 145, 144, 144, 143, 143, 143, 142, 142, 143, 142, 142, 142, 143, 142, 142, 142, 141, 141, 142, 142, 142, 143, 143, 143, 141, 141, 141, 141, 141, 142, 141, 141, 140, 140, 140, 141, 142, 143, 143, 143, 143, 143, 143, 143, 143, 142, 142, 142, 142, 141, 142, 142, 143, 143, 143, 142, 140, 140, 141, 141, 141, 141, 140, 140, 139, 139, 140, 140, 139, 138, 138, 139, 139, 139, 139, 140, 140, 140, 139, 140, 139, 139, 139, 139, 139, 139, 140, 140, 140, 139, 139, 138, 138, 138, 139, 139, 139, 139, 139, 139, 138, 137, 137, 138, 138, 138, 138, 138, 138, 138, 138, 137, 136, 136, 137, 137, 137, 137, 137, 137, 137, 137, 137, 137, 138, 138, 137, 136, 136, 136, 136, 136, 136, 136, 136, 136, 136, 136, 137, 137, 137, 137, 136, 136, 136, 137, 137, 137, 137, 136, 136, 137, 137, 137, 137, 136, 137, 137, 137, 137, 136, 136, 136, 136, 135, 135, 135, 135, 135, 136, 136, 135, 135, 135, 135, 134, 134, 134, 134, 134, 135, 135, 135, 136, 136, 136, 135, 135, 135, 135, 135, 134, 135, 136, 136, 136, 137, 136, 136, 136, 134, 133, 132, 132, 133, 133, 134, 135, 136, 136, 135, 134, 134, 134, 134, 133, 134, 134, 134, 135, 135, 135, 135, 135, 135, 134]
757A34%J%%%%%%jjJJ%%j%%%%%j%%jJ%JJj%%%%%%%%%%%%%%%%%%%%%%%%%j%%%J%%%j%JJ%jjj
750A32J%%JJJj%%%%%jj%JJ%%%J%j%jjj%%%%%%J%%%j%J%%%K%j%%%%%j%J%%%J%jJ%%%J%j%Jj
742A35%%J%%%%%%J%J%jjjjJ%jJJ%%%JJJ%JJ%%%jjjj%%j%%%%%%%j%%jJ%J%%%JjjJ%%%%%j%%
735A35J%J%jj%%j%%%J%J%jJJJ%%JJKKJ%%j%%jjkkjj%%J%j%j%%j%%J%%%%%%%%%%%%%%J%j%%
728A35%%%%jkJ%%K%j%%J%JJ%%%JJJ%%j%jkjjjjJ%%%%%jJ%%%%%%%%%Jj%%%%%%j%J%%j%%jJ%
720A32%J%%%%%%j%%%j%JJjj%%%JK%%j%%%JjjjjJ%J%%%%%j%%%%%%%j%%%%JJJj%%j%%%%j%%J
713A31J%%%j%%%%%%%jj%%%JJ%jj%jJJJ%%%Jj%jJ%j%%J%%%J%%j%j%%%%%%%%J%%J%%j%JJ%%k
705A31jj%jJ%%%%%%jJK%%%%%jj%Jj%%%%%%J%Jj%J%%%%jj%%%%%%%%%J%%J%%%%jj%%K%%%JJ%
$$ y = [134, 134, 135, 135, 135, 135, 135, 135, 135, 134, 133, 134, 135, 135, 135, 134, 134, 134, 134, 134, 134, 133, 133, 133, 132, 133, 133, 134, 135, 134, 134, 134, 134, 134, 134, 134, 134, 134, 134, 134, 134, 134, 134, 134, 134, 134, 134, 134, 134, 134, 134, 134, 134, 134, 134, 133, 133, 133, 133, 134, 134, 134, 134, 133, 133, 134, 135, 135, 134, 133, 132, 133, 133, 133, 134, 135, 136, 135, 135, 135, 135, 135, 135, 134, 133, 133, 134, 135, 135, 135, 135, 136, 136, 135, 135, 134, 133, 132, 132, 132, 132, 132, 132, 132, 133, 133, 133, 133, 132, 132, 133, 133, 133, 133, 135, 135, 134, 134, 134, 134, 134, 134, 133, 133, 134, 134, 134, 134, 135, 135, 134, 135, 135, 135, 135, 136, 136, 135, 135, 136, 135, 135, 135, 136, 136, 136, 136, 136, 136, 136, 137, 137, 138, 138, 137, 136, 135, 134, 135, 135, 134, 135, 136, 136, 136, 136, 137, 138, 139, 139, 140, 141, 141, 141, 141, 140, 139, 138, 137, 137, 137, 136, 136, 136, 136, 136, 136, 136, 136, 135, 135, 135, 134, 135, 135, 136, 136, 136, 136, 137, 136, 135, 136, 136, 136, 136, 136, 136, 135, 135, 135, 136, 136, 137, 137, 136, 135, 135, 135, 134, 134, 134, 134, 135, 135, 136, 136, 135, 136, 137, 138, 138, 138, 139, 140, 142, 144, 145, 145, 145, 144, 144, 144, 143, 142, 140, 138, 137, 136, 136, 136, 137, 137, 136, 136, 135, 135, 135, 134, 134, 134, 135, 135, 135, 135, 135, 135, 135, 135, 135, 135, 135, 135, 135, 135, 135, 136, 136, 135, 135, 135, 135, 135, 135, 135, 134, 132, 133, 133, 133, 135, 135, 134, 134, 134, 135, 135, 136, 137, 137, 137, 137, 138, 139, 140, 140, 140, 139, 139, 138, 136, 135, 134, 133, 132, 133, 133, 133, 133, 133, 133, 132, 133, 133, 133, 133, 133, 133, 133, 133, 133, 133, 134, 133, 133, 133, 133, 133, 133, 133, 132, 132, 133, 133, 133, 132, 132, 132, 131, 132, 132, 132, 133, 133, 133, 133, 133, 133, 133, 132, 132, 132, 132, 131, 131, 132, 133, 132, 131, 131, 131, 131, 132, 134, 134, 134, 133, 133, 133, 133, 134, 133, 132, 131, 130, 131, 131, 132, 132, 132, 132, 132, 132, 131, 131, 131, 131, 131, 131, 131, 131, 130, 130, 130, 130, 130, 131, 132, 133, 132, 132, 132, 131, 131, 131, 131, 131, 130, 130, 130, 131, 132, 132, 132, 132, 131, 131, 131, 131, 131, 131, 131, 131, 130, 129, 129, 129, 129, 130, 131, 131, 130, 129, 129, 128, 129, 130, 131, 131, 131, 131, 132, 131, 131, 130, 131, 131, 130, 130, 130, 131, 131, 131, 131, 132, 132, 132, 131, 131, 130, 130, 130, 130, 130, 130, 130, 130, 130, 131, 131, 131, 132, 132, 132, 131, 131, 132, 133, 133, 133, 131, 130, 129, 129, 128, 129, 129, 129, 129, 129, 129, 129, 128, 129, 131, 131, 131, 131, 131, 131, 130, 129, 129, 130, 129, 129, 129, 129, 129, 129, 129, 130, 130, 131, 130, 130, 131, 131, 131, 131, 131, 130, 129, 129, 129, 129, 129, 129, 129, 129, 129, 129, 130, 130, 130, 131, 131, 131, 131, 131, 130, 129, 129, 129, 131, 131, 131, 131, 132, 133, 133]
698A33j%%%%%%%Jjj%Jjj%j%JJjj%%%%J%%%Jj%%%%j%j%J%jj%JJ%%jjjJ%KJ%J%%JjJ%jj%jJ%
690A30%JJ%j%J%jjjjJJ%%j%%jjJJ%%J%jJ%%%jj%%%%j%JJ%%jjJ%%%%J%%%%j%%%%%%%%J%%%J
683A30%J%%%%%j%jJJJ%%k%J%J%%j%jj%%J%%%j%%%%%j%%%%%%%J%%j%%%%J%J%j%%j%%%%jJ%%
676A28%%%J%%%jk%JJ%J%%%%%%%%jJ%%%%%j%%%j%%%%%%%%%J%j%J%%%%jj%j%%J%%jJ%%%JJ%%
668A28j%%%j%%%J%%%jj%%J%%j%%%%J%%j%%%%jj%JJ%%%J%%%jJ%%%%%%%j%%%%%%j%JJ%j%%j%
661A24j%J%JJJ%j%jj%J%%J%%%%j%%%%%%%%%J%%J%Jjj%j%%%Jj%jJ%%j%%JJ%%j%%%%%J%%j%J
653A26%j%%J%%K%%j%J%%%j%%%j%J%%%j%%%j%%%J%%%J%%%%j%%%%%jJ%j%JJ%j%JK%jjjj%%%J
646A26%j%JJJ%j%%%%%%%%%%%J%%Jjj%jj%JJ%%%%jJJ%%j%%%%%jJ%j%%%JJ%%jJ%j%%%Jj%%J%
$$ y = [133, 132, 132, 132, 132, 132, 132, 132, 132, 133, 132, 131, 131, 132, 131, 130, 130, 129, 129, 130, 131, 130, 129, 129, 129, 129, 129, 130, 130, 130, 130, 131, 130, 130, 130, 130, 130, 129, 129, 128, 128, 129, 129, 128, 127, 127, 128, 129, 129, 129, 128, 127, 126, 127, 127, 129, 130, 130, 131, 131, 131, 132, 131, 132, 132, 131, 130, 130, 129, 130, 130, 130, 131, 132, 132, 131, 131, 132, 132, 131, 130, 129, 128, 129, 130, 130, 130, 129, 129, 129, 128, 127, 128, 129, 129, 129, 130, 130, 129, 130, 130, 130, 130, 129, 128, 128, 128, 128, 128, 127, 127, 128, 129, 129, 129, 128, 127, 128, 128, 128, 128, 128, 129, 129, 129, 129, 129, 128, 128, 128, 128, 128, 128, 128, 128, 128, 129, 129, 129, 129, 130, 130, 131, 131, 131, 131, 131, 131, 130, 130, 129, 130, 131, 132, 132, 132, 130, 130, 131, 131, 132, 132, 132, 131, 131, 130, 129, 129, 129, 130, 130, 130, 130, 129, 129, 129, 129, 129, 129, 128, 128, 128, 128, 128, 128, 128, 128, 129, 129, 129, 128, 128, 128, 128, 128, 129, 129, 130, 130, 129, 129, 129, 128, 128, 128, 128, 128, 127, 128, 128, 128, 128, 128, 128, 129, 129, 129, 129, 128, 126, 126, 127, 128, 128, 129, 129, 129, 129, 129, 129, 129, 129, 129, 128, 129, 129, 129, 129, 129, 129, 128, 128, 128, 128, 127, 127, 127, 127, 127, 127, 127, 127, 127, 127, 128, 128, 127, 127, 128, 128, 128, 128, 128, 127, 126, 126, 125, 125, 125, 126, 126, 126, 125, 126, 126, 126, 126, 127, 128, 128, 128, 127, 127, 127, 127, 126, 126, 126, 126, 127, 127, 127, 127, 126, 125, 125, 125, 126, 126, 126, 125, 125, 125, 125, 125, 126, 126, 126, 125, 125, 125, 125, 125, 124, 123, 123, 124, 125, 125, 125, 125, 126, 126, 126, 126, 125, 126, 126, 126, 126, 126, 126, 126, 126, 125, 125, 125, 125, 125, 125, 125, 124, 124, 125, 126, 126, 125, 125, 125, 124, 124, 123, 123, 124, 124, 125, 126, 127, 127, 126, 126, 125, 124, 124, 125, 125, 125, 126, 126, 126, 126, 126, 125, 125, 125, 125, 125, 125, 125, 125, 125, 125, 126, 126, 126, 127, 127, 128, 127, 126, 126, 125, 125, 125, 125, 126, 125, 125, 124, 125, 125, 125, 124, 124, 124, 125, 126, 126, 126, 125, 125, 125, 125, 125, 125, 126, 126, 126, 125, 125, 126, 126, 125, 125, 125, 126, 126, 126, 128, 128, 128, 127, 127, 128, 128, 128, 128, 127, 127, 127, 127, 126, 126, 127, 127, 127, 127, 126, 126, 126, 126, 125, 125, 125, 125, 126, 126, 126, 126, 127, 127, 127, 127, 127, 126, 126, 126, 126, 126, 126, 125, 126, 126, 125, 125, 126, 127, 127, 126, 126, 127, 129, 129, 128, 127, 126, 125, 125, 125, 125, 126, 126, 125, 125, 126, 127, 128, 128, 127, 127, 127, 127, 127, 127, 127, 127, 127, 127, 127, 127, 128, 128, 128, 129, 128, 127, 127, 126, 125, 125, 126, 127, 127, 127, 127, 127, 126, 127, 128, 128, 128, 127, 127, 127, 127, 127, 127, 126, 127, 127, 126, 126, 126, 126, 127, 128, 128, 128, 127, 128, 128, 127, 127, 127, 127, 128, 127, 127, 127, 128, 128]
639A28%%%%%%J%%jj%%%%J%%%%%J%%%%%%j%jJ%Jj%j%%j%J%%%J%J%j%j%j%%%%%%jJJJ%%jj%J
631A27%%%%%%j%J%%j%jJ%J%%%%j%%J%%%%%J%%j%J%%%j%%jJ%%j%%jJ%j%%J%%%%%%jjJ%%%j%
624A24%J%J%j%%JJJ%jj%%%j%%%%j%%JJ%JjjJ%%%Jj%%%J%%%j%jJ%k%J%jj%%J%%%%JJJj%%J%
616A27jj%%%%j%%J%J%jjJ%J%%%j%%j%%%%JJ%%%%J%%j%J%%%j%%%j%jj%%J%J%JJ%%%jJ%jj%J
609A26J%%j%%%Jj%%%%Jj%%%j%%Jj%%%J%%%%%%J%Jj%%J%jJ%J%%%%%%%%%%%%J%%%%%j%%jJJj
601A29%%%%%%%jJ%JJ%J%J%%%%%j%%%%%%%%%J%%%J%%j%%%JJJ%jJJKJJj%JJJJ%JJJ%%JKKKKJ
594A57JKJ%J%JJjjj%jjjjj%j%j%j%%J%jj%%%%%%%%%%%%%%%KJ%%%KJJJJKKKKKKJLLLLLLLKK
587A99J%%kklkklkllllkj%j%%%j%%%%%%%%%jj%%%J%jj%%%%J%JJ%%%%KJ%%jj%JJJJJJJKJ%j
$$ y = [128, 128, 128, 128, 128, 128, 128, 129, 129, 129, 128, 127, 127, 127, 127, 127, 128, 128, 128, 128, 128, 128, 129, 129, 129, 129, 129, 129, 129, 128, 128, 127, 128, 128, 129, 128, 128, 127, 127, 127, 126, 126, 127, 127, 127, 127, 128, 128, 129, 129, 128, 128, 127, 127, 126, 126, 126, 126, 126, 126, 126, 125, 126, 127, 128, 128, 128, 127, 126, 126, 127, 127, 127, 127, 127, 127, 127, 126, 126, 127, 127, 127, 126, 126, 125, 126, 126, 127, 127, 127, 127, 127, 126, 126, 126, 127, 127, 127, 127, 127, 127, 128, 128, 128, 127, 127, 128, 128, 128, 128, 127, 127, 127, 126, 127, 127, 127, 126, 126, 126, 125, 126, 126, 125, 125, 125, 126, 126, 126, 126, 126, 126, 126, 125, 124, 125, 125, 125, 125, 124, 124, 124, 125, 125, 126, 126, 125, 125, 125, 126, 127, 128, 128, 127, 126, 126, 126, 126, 125, 125, 125, 125, 125, 124, 124, 124, 125, 126, 126, 127, 126, 125, 126, 126, 126, 126, 127, 126, 126, 126, 126, 127, 127, 127, 127, 126, 126, 125, 126, 126, 124, 124, 125, 125, 124, 123, 123, 123, 124, 124, 124, 124, 124, 125, 126, 127, 126, 126, 126, 127, 127, 126, 125, 125, 125, 125, 125, 124, 124, 124, 125, 125, 126, 126, 125, 124, 125, 125, 126, 126, 126, 126, 125, 125, 125, 124, 124, 124, 124, 124, 125, 126, 126, 126, 126, 126, 127, 127, 127, 126, 126, 127, 127, 127, 127, 126, 126, 126, 126, 125, 125, 124, 123, 123, 123, 124, 124, 125, 125, 126, 127, 127, 127, 127, 126, 127, 127, 126, 125, 125, 126, 127, 127, 127, 126, 126, 126, 126, 127, 126, 126, 126, 126, 126, 127, 126, 126, 126, 126, 125, 125, 125, 126, 125, 125, 125, 125, 126, 126, 126, 126, 126, 126, 126, 127, 127, 128, 127, 127, 127, 128, 128, 127, 128, 128, 129, 129, 129, 129, 129, 129, 129, 129, 129, 129, 129, 129, 129, 130, 130, 130, 130, 130, 130, 129, 129, 129, 128, 129, 130, 129, 129, 129, 129, 129, 129, 129, 129, 128, 129, 129, 130, 131, 131, 132, 132, 133, 133, 133, 133, 133, 133, 132, 132, 132, 132, 132, 132, 132, 132, 132, 132, 133, 133, 133, 133, 134, 134, 134, 133, 133, 133, 133, 134, 135, 136, 136, 135, 136, 137, 139, 140, 141, 140, 140, 141, 142, 143, 144, 144, 145, 146, 147, 147, 147, 148, 150, 152, 154, 156, 157, 158, 160, 161, 161, 162, 162, 163, 164, 163, 162, 161, 161, 160, 159, 158, 157, 156, 156, 155, 155, 154, 154, 153, 153, 153, 154, 154, 153, 152, 152, 152, 152, 152, 152, 152, 152, 152, 152, 152, 152, 152, 152, 152, 152, 154, 155, 155, 155, 155, 157, 158, 159, 160, 161, 163, 165, 167, 169, 171, 173, 174, 177, 180, 183, 186, 189, 192, 195, 197, 199, 200, 200, 200, 198, 196, 193, 191, 189, 186, 184, 181, 178, 175, 172, 170, 169, 169, 168, 168, 168, 168, 167, 167, 167, 167, 167, 167, 167, 167, 167, 167, 166, 165, 165, 165, 165, 166, 166, 165, 164, 164, 164, 164, 164, 165, 165, 166, 167, 167, 167, 167, 167, 169, 170, 170, 170, 169, 168, 168, 169, 170, 171, 172, 173, 174, 175, 177, 178, 178, 177]
579A77jjkjj%kljj%jk%%%j%j%%Jjj%%J%J%%%%jJ%%%jjJ%%Jj%j%j%jk%j%%jj%j%%jj%J%%j%
572A48%%J%JJj%J%J%J%%%%Jj%%J%JJ%%%%K%%JJ%%%j%%JJ%%%J%%%j%%J%jj%j%%Jj%%KJ%%JK
564A65%%%JJ%%%J%%%%j%%j%j%j%j%jjjj%j%JJ%%j%%%%J%%jJ%%%Jjj%%%%%%%J%%%%J%%j%%J
557A61%%%%jjjJ%jjjj%jj%jjjj%J%%%j%jj%%%j%J%%%jJ%JJ%%%j%jKJ%j%%%J%%%%%%%%%%%%
550A50jjjKJ%%JjjJ%%jJJ%j%%%j%j%%%jjKJJ%%jjJ%%%J%%%J%jj%%%jJ%%j%%%j%JJ%%%%j%%
542A48%J%%%J%%%%%%%%%%j%j%JJ%jjjJ%%J%%%%%%%%j%%J%j%%j%%%%%j%%%%J%J%%jjJ%j%%%
535A46J%%%%jJ%JJjj%j%%%j%JKJ%%%%j%%%%jJJjj%%%%jjJ%JJjj%%%%%%%%%%%%%%J%j%%J%%
527A47J%%j%J%%%%j%Jj%J%%%%j%%%%%%%%%jJ%%%%%%%%%%j%%jJ%J%jj%J%%j%J%%%%jj%J%%%
$$ y = [177, 176, 175, 173, 172, 171, 171, 169, 166, 165, 164, 164, 163, 161, 161, 161, 161, 160, 160, 159, 159, 159, 160, 159, 158, 158, 158, 159, 159, 160, 160, 160, 160, 160, 159, 160, 160, 160, 160, 159, 158, 159, 159, 159, 160, 159, 159, 158, 158, 157, 157, 156, 154, 154, 153, 153, 153, 152, 151, 151, 150, 150, 150, 149, 148, 148, 149, 149, 149, 148, 148, 148, 148, 149, 149, 150, 151, 150, 150, 151, 151, 152, 152, 153, 153, 153, 153, 153, 154, 153, 153, 153, 154, 154, 155, 156, 156, 156, 156, 156, 158, 158, 158, 159, 160, 160, 160, 160, 159, 159, 159, 160, 161, 161, 161, 161, 162, 162, 162, 162, 161, 161, 161, 162, 162, 161, 160, 160, 159, 159, 159, 160, 159, 159, 159, 161, 162, 162, 162, 163, 165, 165, 165, 165, 166, 167, 167, 167, 167, 168, 168, 168, 168, 168, 167, 167, 167, 166, 166, 165, 165, 164, 164, 163, 163, 162, 161, 160, 159, 159, 158, 158, 159, 160, 160, 160, 159, 159, 159, 159, 159, 160, 160, 160, 159, 160, 160, 160, 160, 161, 160, 159, 159, 159, 159, 159, 159, 159, 159, 160, 160, 160, 160, 160, 161, 161, 161, 160, 160, 160, 161, 161, 161, 161, 161, 160, 159, 158, 159, 159, 158, 157, 156, 155, 155, 154, 153, 153, 152, 151, 150, 149, 149, 150, 150, 150, 150, 149, 149, 148, 147, 147, 147, 147, 146, 146, 147, 147, 147, 147, 146, 147, 147, 148, 149, 149, 149, 149, 148, 148, 147, 149, 150, 150, 149, 149, 149, 149, 150, 150, 150, 150, 150, 150, 150, 150, 150, 150, 150, 150, 150, 149, 148, 147, 149, 150, 150, 150, 151, 150, 149, 150, 150, 150, 149, 150, 151, 151, 150, 150, 150, 150, 149, 149, 148, 148, 148, 148, 147, 146, 148, 149, 150, 150, 150, 149, 148, 149, 149, 149, 149, 150, 150, 150, 150, 151, 151, 150, 149, 149, 149, 149, 148, 149, 149, 149, 148, 148, 148, 148, 147, 147, 148, 149, 149, 149, 149, 149, 148, 148, 148, 148, 149, 149, 149, 149, 150, 150, 150, 150, 150, 150, 150, 150, 150, 150, 150, 149, 149, 148, 148, 149, 150, 150, 149, 148, 147, 148, 148, 148, 149, 149, 149, 149, 149, 149, 149, 149, 149, 148, 148, 148, 149, 149, 148, 148, 148, 147, 147, 147, 147, 147, 147, 146, 146, 146, 146, 146, 147, 147, 148, 148, 148, 147, 146, 147, 147, 146, 146, 146, 146, 147, 147, 147, 147, 147, 146, 147, 147, 148, 149, 148, 147, 147, 146, 146, 146, 146, 145, 145, 146, 148, 149, 149, 149, 149, 149, 148, 148, 148, 148, 148, 147, 148, 149, 148, 147, 147, 147, 147, 147, 146, 145, 146, 146, 147, 148, 147, 146, 146, 146, 146, 146, 146, 146, 146, 146, 146, 146, 146, 146, 146, 146, 147, 147, 146, 146, 146, 147, 147, 147, 148, 148, 148, 147, 147, 148, 148, 148, 148, 148, 147, 147, 148, 147, 147, 148, 148, 148, 148, 148, 147, 147, 147, 147, 147, 147, 147, 147, 147, 147, 146, 147, 147, 147, 147, 147, 147, 147, 147, 147, 147, 147, 146, 146, 146, 145, 146, 146, 147, 147, 146, 145, 145, 146, 146, 146, 145, 145, 146, 146, 146, 146, 146, 145, 144, 144, 145, 145, 145, 145]
520A45%%%j%%J%jj%%%J%%%%%jjjJ%J%%j%%%%j%%%J%jj%J%%%jJ%%%j%%%%%J%%J%jj%%j%%%J
512A40JJjjjj%j%J%%%%J%j%jj%J%Jj%%%%J%j%%j%%J%%%j%%j%jJJ%jJ%j%%%j%%%%%j%%%JJ%
505A35%%%%jj%%Jj%%j%JJ%j%%%%%%%%%%%Jj%%%jj%%%Jj%%jj%%%%J%JJj%%j%%%%%%%%j%%%%
498A29%j%Jj%%%J%jjj%J%%J%%J%%%%%%%%%%%%%j%j%%J%J%%%%%j%j%%JJ%%%%jjj%%%%%%%j%
490A25JJj%j%J%%%%j%jJ%J%%j%%%%J%jjj%J%Jjj%%%%%%%j%J%%J%%jJ%%%%%%jk%%KJ%j%%%%
483A23J%%j%%J%j%%J%j%%%%%%%%%%%J%%J%j%j%%%%%%%%%%%J%%%%j%j%j%%%%jJJ%%%%%%%J%
475A23%%%j%%j%J%%Jj%j%%%J%%%%%%%%%%%%%%J%jj%JJ%J%j%Jjj%%JJ%%%jj%j%%%%Jj%j%%%
468A20%%J%%Jj%j%%%%%%J%%%%jJ%%Jj%j%%JJj%%%j%%%%%J%%%%jj%JJ%%%Jjj%%%%%%%%%%J%
$$ y = [145, 145, 145, 145, 144, 144, 144, 145, 145, 144, 143, 143, 143, 143, 144, 144, 144, 144, 144, 144, 143, 142, 141, 142, 142, 143, 143, 143, 142, 142, 142, 142, 142, 141, 141, 141, 141, 142, 142, 141, 140, 140, 141, 141, 141, 141, 140, 141, 141, 141, 141, 140, 140, 140, 140, 140, 140, 141, 141, 141, 142, 142, 141, 140, 140, 140, 139, 139, 139, 139, 140, 141, 142, 141, 140, 139, 138, 138, 137, 137, 138, 138, 138, 138, 138, 139, 139, 138, 138, 137, 136, 136, 137, 137, 138, 137, 137, 137, 137, 137, 138, 138, 137, 137, 137, 136, 136, 136, 137, 137, 137, 137, 136, 136, 136, 135, 135, 134, 135, 136, 136, 135, 136, 136, 135, 135, 135, 135, 134, 134, 134, 134, 134, 134, 133, 133, 133, 133, 134, 135, 135, 135, 135, 135, 135, 134, 133, 133, 133, 134, 133, 133, 133, 132, 132, 133, 134, 134, 133, 133, 133, 133, 133, 133, 133, 133, 133, 133, 133, 133, 134, 133, 133, 133, 133, 132, 131, 131, 131, 131, 132, 131, 131, 131, 130, 129, 129, 129, 129, 129, 130, 130, 131, 132, 131, 131, 131, 130, 130, 130, 130, 130, 130, 130, 130, 130, 129, 129, 129, 129, 129, 129, 128, 128, 129, 128, 128, 128, 128, 129, 129, 128, 127, 126, 126, 127, 127, 127, 128, 128, 128, 129, 129, 129, 129, 129, 129, 129, 129, 129, 129, 129, 129, 129, 129, 128, 128, 127, 127, 127, 128, 128, 129, 129, 129, 129, 129, 129, 128, 128, 127, 127, 127, 128, 129, 129, 129, 129, 129, 128, 127, 126, 126, 126, 126, 126, 126, 126, 126, 125, 125, 126, 127, 126, 126, 125, 125, 126, 126, 126, 126, 126, 125, 125, 124, 125, 125, 126, 126, 126, 125, 125, 125, 125, 125, 126, 126, 125, 124, 123, 123, 124, 124, 125, 124, 123, 123, 123, 123, 123, 123, 123, 123, 122, 122, 123, 123, 123, 124, 124, 124, 123, 124, 124, 124, 124, 124, 124, 124, 123, 121, 121, 121, 123, 124, 124, 123, 123, 123, 123, 123, 124, 124, 124, 123, 123, 123, 124, 124, 123, 123, 123, 124, 124, 123, 123, 123, 123, 123, 123, 123, 123, 123, 123, 123, 123, 124, 124, 124, 125, 125, 124, 124, 123, 123, 123, 123, 123, 123, 123, 123, 123, 123, 123, 123, 124, 124, 124, 124, 124, 123, 123, 122, 122, 121, 121, 121, 121, 121, 120, 121, 122, 122, 122, 122, 122, 122, 122, 122, 123, 123, 123, 123, 123, 122, 122, 122, 121, 121, 122, 122, 122, 123, 122, 122, 121, 121, 121, 121, 122, 122, 122, 122, 122, 122, 122, 122, 122, 122, 122, 122, 122, 122, 122, 123, 123, 122, 121, 121, 122, 123, 123, 124, 124, 123, 123, 124, 123, 122, 122, 122, 123, 124, 124, 124, 124, 123, 122, 122, 121, 121, 121, 121, 121, 122, 121, 121, 120, 120, 120, 120, 120, 120, 121, 121, 121, 122, 121, 121, 120, 120, 120, 120, 120, 120, 120, 121, 121, 121, 121, 121, 120, 121, 121, 121, 122, 121, 121, 120, 120, 120, 121, 122, 121, 121, 121, 121, 120, 120, 120, 120, 120, 120, 121, 121, 121, 121, 121, 120, 119, 119, 120, 121, 121, 121, 121, 122, 121, 120, 120, 120, 120, 120, 120, 120, 120, 120, 120, 120, 121, 121]
460A21%jJjj%J%%%%jJ%Jjj%%JJ%%jj%J%%j%%j%%%J%J%%%J%%%%%%j%%%%%%jj%%JJj%J%jjJJ
453A20%%jJ%j%%j%%%J%%%%%%J%%j%%%%j%%jJ%%%%J%%%J%%JJ%jjj%%J%%%%%%j%J%%j%jJ%J%
446A20%%%jJ%%j%jJJ%%j%%Jj%j%%%%%j%%%JJJjjJ%%J%%jjjKJ%Jj%%%%jJJj%%jJ%%%J%%%%%
438A21%%%jJJ%Jjjjjj%JJ%J%%jj%Jj%jjJ%j%%J%%%J%Jj%%%%JJjj%%%%%%%%%%J%J%jj%%%j%
431A18%%J%%J%%%%jJ%%%j%j%%J%%J%jj%%J%j%%%jJ%%%%%%%%j%%%Jj%%J%j%JJ%%%%%j%%%%J
423A19%Jj%%%j%j%J%Jj%J%%jj%%JJ%%j%j%%%%%%jJ%JJ%%%%%JJjjj%J%%%%j%J%%%jk%JJj%%
416A17%jJJ%%jjKJ%%jj%%JJ%jj%%%%J%%J%j%%%%%%J%%%j%%%%J%jj%j%J%%%J%Jjj%J%%J%%%
409A19%%%%%j%%%%%JJ%%j%j%%%%%%%%J%j%%%j%jJj%J%J%j%%%%%%%%%%%%J%%%%%jJ%%jJ%%%
$$ y = [121, 121, 120, 121, 120, 119, 119, 120, 120, 120, 120, 120, 119, 120, 120, 121, 120, 119, 119, 119, 120, 121, 121, 121, 120, 119, 119, 120, 120, 120, 119, 119, 119, 118, 118, 118, 118, 119, 119, 120, 120, 120, 120, 121, 121, 121, 121, 121, 121, 121, 120, 120, 120, 120, 120, 120, 120, 119, 118, 118, 118, 119, 120, 119, 119, 120, 120, 119, 118, 119, 120, 120, 120, 119, 120, 120, 119, 119, 119, 118, 118, 118, 118, 119, 119, 119, 119, 119, 119, 119, 120, 120, 120, 119, 119, 119, 119, 119, 118, 118, 118, 117, 118, 118, 118, 118, 118, 119, 119, 119, 119, 120, 120, 120, 121, 122, 122, 121, 120, 119, 119, 119, 120, 120, 120, 120, 120, 120, 120, 119, 119, 120, 120, 120, 119, 119, 118, 119, 119, 120, 120, 120, 120, 120, 119, 120, 120, 120, 119, 119, 118, 119, 120, 120, 120, 119, 119, 119, 120, 119, 119, 118, 118, 118, 118, 118, 118, 117, 117, 117, 117, 118, 119, 120, 119, 118, 119, 119, 119, 120, 120, 120, 119, 118, 117, 119, 120, 120, 121, 120, 120, 120, 120, 120, 119, 120, 121, 120, 120, 120, 119, 120, 120, 120, 120, 121, 121, 121, 121, 121, 121, 121, 121, 121, 120, 121, 122, 122, 123, 122, 121, 120, 119, 118, 118, 119, 120, 120, 121, 121, 121, 120, 119, 119, 120, 119, 119, 118, 117, 118, 118, 117, 117, 117, 118, 118, 118, 118, 119, 119, 120, 119, 119, 119, 119, 119, 120, 121, 120, 119, 119, 119, 119, 119, 119, 119, 119, 119, 119, 119, 120, 120, 121, 121, 120, 119, 119, 119, 119, 118, 118, 118, 118, 119, 119, 119, 120, 120, 120, 120, 120, 119, 120, 120, 120, 120, 119, 119, 118, 118, 118, 119, 119, 119, 120, 120, 119, 118, 118, 118, 119, 119, 118, 118, 118, 118, 117, 118, 118, 118, 118, 118, 118, 118, 118, 118, 117, 117, 117, 117, 118, 117, 117, 117, 118, 118, 117, 117, 118, 119, 119, 119, 119, 119, 119, 118, 118, 118, 118, 118, 119, 119, 120, 119, 119, 119, 119, 118, 118, 117, 117, 118, 118, 119, 118, 118, 119, 119, 119, 118, 117, 117, 117, 118, 119, 119, 119, 118, 118, 117, 117, 117, 117, 117, 117, 117, 116, 117, 117, 118, 119, 119, 119, 119, 119, 119, 120, 121, 120, 119, 118, 118, 119, 119, 119, 119, 119, 118, 118, 119, 119, 119, 119, 118, 116, 116, 117, 118, 117, 117, 117, 117, 116, 117, 118, 118, 118, 117, 116, 118, 119, 119, 119, 118, 117, 117, 117, 118, 119, 119, 118, 117, 117, 117, 117, 117, 118, 118, 118, 119, 119, 118, 118, 118, 118, 118, 118, 118, 119, 119, 119, 119, 118, 118, 118, 118, 118, 119, 119, 118, 117, 117, 116, 116, 117, 117, 117, 117, 118, 118, 119, 118, 117, 117, 118, 118, 118, 119, 119, 119, 119, 119, 119, 119, 119, 119, 118, 118, 118, 118, 118, 118, 119, 120, 120, 120, 119, 119, 118, 118, 118, 118, 118, 118, 118, 118, 118, 119, 119, 118, 118, 118, 118, 117, 117, 116, 117, 116, 116, 117, 117, 118, 118, 117, 117, 117, 117, 117, 117, 117, 117, 117, 117, 117, 117, 117, 118, 118, 118, 118, 118, 118, 117, 118, 118, 118, 117, 118, 118, 118, 118]
401A18%jJJ%j%jj%%J%JjjJJ%%%%J%j%j%j%J%%%jJ%J%%%j%Jj%%%J%%J%%%j%j%Jj%%%jjjJJJ
394A17%%%Jj%j%jJ%J%J%%J%%%%%jjjjJJ%%J%%%%j%%%%%%jj%%%J%%%%%j%J%J%JJ%%%%%%j%j
386A17%%J%jjJj%%j%JJ%%%%%Jj%JJ%j%%J%%jjJ%J%j%j%j%%J%%%%%%Jj%j%jJJ%%%%%%J%j%j
379A16jjJ%%J%J%%JjjjJJJ%%%jj%%J%%%%%j%j%%JJ%%J%j%%%%%%%JjjJ%%%%%%%J%%jj%%%%K
371A18%%%jj%%%j%J%%%J%j%%%J%%j%%%%JJ%%jj%%%j%%J%%J%%%%%%%j%JJ%jJ%j%%%k%JJJ%j
364A17%%%j%%%%j%%J%%%%%jJ%%%%%%%%j%%%J%j%%JJJ%%jj%%%%%%Jjjj%J%JJ%%jj%jJ%%j%%
357A14%%JJJ%Jjj%%j%%J%%j%J%%%Jj%j%J%J%%j%%%Jj%j%%J%%%%%jjj%JJ%j%J%%%j%%%%%Jj
349A14%%j%%%%%%Jj%%J%%%%%%J%%jJJjjjj%%JJ%J%%j%j%j%%%%%%%%J%%J%%j%%%%%J%j%j%J
$$ y = [118, 118, 117, 118, 119, 119, 118, 118, 117, 116, 116, 116, 117, 117, 118, 117, 116, 117, 118, 118, 118, 118, 118, 119, 119, 118, 118, 117, 117, 116, 116, 117, 117, 117, 117, 116, 117, 117, 118, 118, 118, 118, 117, 117, 118, 117, 117, 117, 117, 118, 118, 118, 119, 119, 119, 119, 118, 118, 117, 117, 118, 117, 117, 117, 117, 116, 115, 114, 115, 116, 117, 117, 117, 117, 118, 117, 117, 116, 116, 115, 116, 116, 117, 117, 118, 118, 118, 119, 119, 119, 119, 119, 119, 118, 117, 116, 115, 116, 117, 117, 117, 118, 118, 118, 118, 118, 117, 117, 117, 117, 117, 117, 117, 116, 115, 115, 115, 115, 116, 116, 116, 116, 116, 116, 115, 115, 116, 116, 117, 117, 118, 119, 119, 119, 119, 119, 119, 119, 118, 118, 117, 117, 117, 118, 118, 117, 116, 117, 116, 116, 116, 115, 115, 116, 117, 117, 117, 117, 117, 117, 118, 117, 117, 118, 119, 119, 118, 118, 118, 119, 119, 119, 118, 117, 118, 118, 119, 119, 118, 118, 117, 117, 116, 116, 116, 117, 117, 117, 117, 117, 117, 117, 118, 117, 117, 116, 116, 115, 116, 117, 117, 117, 117, 117, 117, 117, 118, 118, 117, 117, 116, 115, 114, 115, 115, 115, 116, 116, 117, 117, 117, 118, 117, 116, 115, 116, 117, 118, 118, 118, 118, 117, 116, 116, 116, 117, 117, 117, 117, 117, 117, 116, 116, 115, 115, 115, 116, 117, 117, 117, 118, 118, 117, 117, 117, 117, 117, 117, 117, 117, 118, 117, 116, 117, 117, 117, 117, 117, 117, 117, 117, 118, 118, 118, 117, 116, 116, 116, 116, 116, 118, 118, 118, 118, 117, 116, 116, 116, 116, 115, 115, 116, 116, 116, 116, 117, 117, 116, 116, 116, 116, 117, 117, 117, 116, 116, 116, 116, 116, 117, 118, 118, 118, 117, 116, 116, 116, 116, 115, 115, 115, 116, 116, 116, 117, 117, 117, 117, 117, 117, 117, 117, 116, 116, 117, 118, 118, 117, 118, 118, 117, 117, 117, 117, 115, 115, 116, 117, 118, 118, 117, 117, 117, 117, 116, 116, 116, 116, 116, 115, 115, 115, 116, 116, 116, 116, 116, 116, 115, 116, 116, 116, 116, 116, 116, 116, 116, 116, 115, 115, 115, 115, 116, 116, 115, 115, 115, 116, 117, 118, 118, 118, 117, 116, 116, 116, 116, 116, 116, 116, 117, 116, 115, 114, 114, 115, 115, 116, 117, 117, 117, 116, 115, 115, 114, 115, 115, 115, 114, 114, 114, 114, 114, 115, 116, 117, 117, 118, 117, 116, 116, 116, 115, 115, 115, 116, 116, 116, 115, 115, 116, 116, 116, 116, 117, 116, 116, 115, 115, 116, 116, 117, 117, 117, 116, 116, 116, 116, 117, 116, 116, 115, 115, 115, 116, 116, 116, 116, 116, 116, 115, 114, 113, 113, 114, 115, 115, 114, 114, 115, 115, 115, 115, 114, 114, 114, 114, 114, 114, 115, 114, 114, 114, 113, 113, 113, 113, 113, 113, 113, 114, 113, 113, 113, 114, 114, 114, 114, 114, 114, 114, 115, 115, 115, 114, 115, 116, 115, 114, 113, 112, 112, 112, 113, 114, 114, 115, 115, 115, 114, 114, 113, 113, 112, 112, 112, 112, 112, 112, 112, 112, 112, 113, 113, 113, 114, 114, 114, 113, 113, 113, 113, 113, 113, 114, 114, 113, 113, 112, 112, 113]
342A13J%J%%j%J%%%j%J%%%%%jJ%%%%%%%%J%%%%%%j%%jjJ%J%%J%jj%J%%%%J%%J%%%J%Jj%%j
334A17%%%j%Jj%j%%JJ%%%%Jjj%j%%JJJ%jj%j%j%%Jj%J%%%%%jJ%%%%J%%%J%%%%%%%%%%j%j%
327A15%J%Jj%%%%%%jJ%%%J%%%%j%jJ%J%jj%%%JKJ%jj%%%%%%%%jj%j%J%JJJJ%j%%%jJ%j%%j
320A16j%%%%J%%%J%j%J%%%j%%JJJjjjj%%%J%%J%%%jj%%%J%%%%j%%%%j%J%%%J%j%%J%%%%%%
312A16%%%%%%%%JjJ%%%%%j%jj%JJJJ%j%j%%%%J%%%%%j%%J%J%j%%%%%%%%jj%%J%%%%%j%%%J
305A16J%jj%%J%%%%%%%%%%%j%%%%J%%%%%%%%%%%%%%%j%%%J%%j%%Jj%%%j%JJ%%%j%%%%JJj%
297A16jjJ%%J%%%J%%%%%jj%%J%%%jjJ%%%%%%j%%%J%%%%%j%%J%JjJJ%j%%J%j%%%%jjj%%JK%
290A16%j%%j%j%J%J%%%J%j%J%%%%%%%J%%j%%JJ%%kj%%%j%J%%%%%%%Jj%%%%%%J%%%jJJ%%%%
$$ y = [113, 114, 114, 115, 115, 115, 114, 114, 115, 115, 115, 115, 114, 114, 115, 115, 115, 115, 115, 115, 114, 115, 115, 115, 115, 115, 115, 115, 115, 115, 116, 116, 116, 116, 116, 116, 116, 115, 115, 115, 114, 113, 114, 114, 115, 115, 115, 116, 116, 115, 114, 114, 115, 115, 115, 115, 115, 116, 116, 116, 117, 117, 117, 117, 118, 118, 119, 118, 118, 118, 117, 117, 117, 117, 116, 116, 117, 116, 116, 115, 115, 115, 116, 117, 117, 117, 117, 117, 118, 117, 116, 116, 115, 115, 115, 116, 117, 118, 118, 117, 116, 116, 115, 115, 114, 114, 114, 115, 114, 114, 115, 115, 115, 115, 115, 115, 114, 115, 115, 115, 115, 115, 116, 116, 116, 116, 117, 117, 117, 117, 117, 117, 117, 117, 117, 117, 117, 116, 116, 115, 115, 115, 116, 116, 117, 116, 116, 116, 116, 116, 116, 116, 115, 116, 116, 116, 116, 117, 117, 117, 117, 117, 116, 116, 115, 116, 116, 117, 117, 116, 115, 115, 115, 115, 116, 118, 119, 119, 118, 117, 117, 117, 117, 117, 117, 117, 117, 117, 116, 115, 115, 114, 114, 115, 115, 116, 117, 118, 119, 119, 118, 118, 118, 118, 117, 118, 118, 117, 117, 117, 116, 115, 115, 115, 115, 115, 116, 116, 116, 116, 117, 117, 116, 116, 117, 117, 117, 117, 116, 116, 116, 117, 118, 119, 118, 117, 116, 115, 115, 115, 115, 116, 116, 116, 117, 117, 117, 117, 116, 115, 115, 115, 115, 116, 116, 116, 116, 116, 115, 115, 115, 115, 115, 114, 114, 115, 115, 115, 115, 116, 116, 115, 115, 115, 116, 116, 116, 116, 116, 116, 116, 116, 116, 116, 116, 116, 116, 116, 116, 117, 116, 117, 117, 117, 117, 117, 117, 116, 116, 115, 114, 114, 115, 116, 117, 118, 118, 117, 117, 116, 116, 116, 116, 116, 117, 117, 117, 117, 117, 117, 116, 116, 116, 117, 117, 118, 118, 117, 117, 117, 117, 117, 117, 117, 117, 117, 116, 115, 115, 115, 116, 116, 116, 116, 116, 116, 115, 115, 115, 115, 116, 117, 117, 116, 115, 115, 115, 116, 116, 116, 116, 116, 116, 116, 116, 116, 116, 116, 116, 115, 115, 115, 115, 115, 116, 116, 116, 116, 116, 116, 116, 116, 116, 116, 116, 116, 116, 116, 116, 116, 115, 115, 115, 115, 116, 116, 116, 115, 115, 115, 116, 115, 115, 115, 115, 114, 114, 115, 116, 116, 116, 116, 115, 115, 115, 115, 115, 116, 117, 116, 116, 115, 114, 115, 115, 115, 116, 116, 116, 116, 117, 117, 117, 117, 117, 117, 116, 115, 115, 115, 116, 116, 116, 116, 115, 114, 115, 115, 115, 115, 115, 115, 115, 114, 114, 114, 114, 115, 115, 115, 115, 115, 115, 114, 114, 114, 115, 115, 116, 115, 116, 117, 117, 116, 116, 116, 117, 117, 116, 116, 116, 116, 116, 115, 114, 113, 113, 113, 114, 116, 116, 116, 115, 115, 115, 114, 114, 113, 113, 114, 114, 115, 115, 115, 115, 116, 116, 115, 115, 116, 116, 116, 116, 116, 116, 116, 116, 117, 117, 117, 116, 116, 116, 117, 118, 118, 118, 116, 115, 115, 115, 115, 114, 114, 115, 115, 115, 115, 115, 115, 115, 115, 116, 115, 115, 115, 115, 115, 115, 115, 116, 116, 116, 116, 115, 116, 117, 117, 117, 117, 117]
282A17%%%%%%%%j%%Jj%j%%%%jJ%%%%%%%J%j%%j%%%jJ%J%K%jj%%j%%jJ%J%%jJJJJjjjj%%JJ
275A16%%%%J%%k%jJJJJj%%%j%%%j%%%%J%%%%%%J%%j%%%j%%%%%%%jJ%%%%J%%j%%%%J%jj%%%
268A14%%J%%J%%Jj%%%j%j%j%%JJJJj%%%%%%%j%%%%%%JJjJ%j%j%%%j%JJ%j%J%%j%j%%%%%%%
260A14%%%%%jJ%%%%JJ%%%%%%%%%jjJ%%J%%%%%%j%%jJ%%%%%J%jJ%%j%%%%J%%j%%%%J%Jjj%%
253A15J%%%j%Jj%%%j%J%%%%%%J%%%%%j%%%J%%J%%%j%j%%%%%%%%j%%%jJ%j%%%%%JJ%j%%j%J
245A14%%%%%J%%%%%j%%%JJ%%%%%jk%J%%%j%%J%j%J%j%%%%%%J%%%%%%%%%%J%j%%J%%j%%%%%
238A14%%%%%%J%J%j%%%%%%%%%%J%J%j%j%%J%j%%%%%%%%%%%jJ%Jjj%j%JJ%%jj%%%J%%%%%%J
231A15jJ%%J%Jjjjj%J%%%J%jj%%%J%J%J%%%%j%%JJ%jJjjj%J%%%%%%%%j%j%jJJ%%%%J%%%%%
$$ y = [117, 117, 117, 117, 117, 117, 117, 117, 117, 116, 116, 116, 117, 116, 116, 115, 115, 115, 115, 115, 114, 115, 115, 115, 115, 115, 115, 115, 115, 116, 116, 115, 115, 115, 114, 114, 114, 114, 113, 114, 114, 115, 115, 117, 117, 116, 115, 115, 115, 114, 114, 114, 113, 114, 114, 115, 115, 115, 114, 115, 116, 117, 118, 117, 116, 115, 114, 114, 114, 115, 116, 116, 116, 116, 116, 117, 117, 117, 115, 115, 114, 115, 116, 117, 118, 117, 117, 117, 117, 116, 116, 116, 116, 115, 115, 115, 115, 115, 116, 116, 116, 116, 116, 116, 116, 117, 117, 117, 116, 116, 116, 116, 115, 115, 115, 115, 115, 115, 115, 115, 114, 115, 115, 115, 115, 115, 116, 116, 116, 115, 115, 115, 115, 115, 116, 116, 115, 114, 114, 114, 114, 114, 114, 115, 115, 115, 116, 116, 116, 117, 116, 116, 116, 116, 115, 115, 114, 114, 113, 113, 113, 114, 115, 116, 117, 116, 116, 116, 116, 116, 116, 116, 116, 115, 115, 115, 115, 115, 115, 115, 116, 117, 116, 117, 117, 116, 116, 115, 115, 115, 115, 114, 114, 115, 116, 116, 115, 115, 116, 116, 116, 115, 115, 114, 114, 114, 114, 114, 114, 114, 114, 114, 114, 114, 114, 114, 113, 114, 114, 114, 114, 114, 115, 116, 116, 116, 116, 116, 116, 116, 116, 116, 116, 115, 114, 115, 115, 115, 116, 116, 116, 116, 116, 116, 116, 115, 115, 115, 114, 115, 115, 115, 115, 115, 115, 116, 116, 115, 116, 116, 116, 115, 115, 115, 115, 115, 116, 116, 116, 115, 115, 115, 115, 115, 116, 116, 117, 116, 115, 115, 115, 116, 116, 116, 116, 115, 115, 116, 115, 115, 115, 115, 114, 114, 115, 115, 115, 115, 115, 115, 115, 116, 116, 116, 116, 116, 116, 115, 115, 115, 115, 116, 116, 116, 117, 117, 117, 117, 116, 116, 115, 115, 115, 115, 115, 115, 115, 115, 115, 114, 114, 114, 114, 113, 114, 114, 113, 113, 113, 113, 113, 113, 114, 115, 115, 114, 114, 114, 113, 113, 114, 114, 114, 114, 114, 114, 115, 115, 115, 115, 115, 115, 114, 114, 114, 114, 115, 116, 116, 116, 116, 116, 116, 115, 113, 113, 114, 114, 114, 114, 113, 113, 113, 114, 114, 113, 113, 114, 114, 113, 113, 113, 113, 113, 113, 113, 114, 114, 114, 114, 114, 114, 114, 114, 114, 114, 114, 115, 115, 114, 114, 114, 115, 115, 115, 114, 114, 114, 114, 114, 114, 114, 114, 114, 114, 114, 114, 115, 115, 116, 116, 115, 115, 115, 115, 115, 115, 115, 115, 115, 115, 115, 116, 116, 117, 117, 116, 116, 115, 115, 115, 116, 116, 115, 115, 115, 115, 115, 115, 115, 115, 115, 115, 115, 115, 114, 115, 115, 116, 115, 114, 114, 113, 113, 114, 115, 115, 115, 114, 113, 113, 113, 113, 114, 114, 114, 114, 114, 114, 114, 115, 114, 115, 115, 115, 116, 116, 117, 116, 115, 114, 113, 113, 114, 114, 114, 114, 115, 115, 114, 113, 113, 113, 113, 114, 114, 115, 115, 116, 116, 116, 116, 116, 115, 115, 115, 116, 117, 117, 116, 117, 116, 115, 114, 114, 115, 115, 115, 115, 115, 115, 115, 115, 115, 114, 114, 113, 113, 112, 113, 114, 114, 114, 114, 114, 115, 115, 115, 115, 115, 115]
223A15j%j%%%J%j%%JJ%%j%J%%%j%%%%%%%%%%J%J%%j%%jjJ%J%Jj%%JJ%j%j%%%%j%%%%J%%%j
216A14%%%%%%jJJJ%j%%J%J%%%%%%J%kj%%%%%%%jjJJ%j%j%Jj%%J%j%jj%%JJ%%%J%J%%%%%j%
208A14%%%%%j%%J%J%%%%%%%%j%%%%J%jj%J%Jj%%%%Jj%%%JJ%%%%j%jJJ%j%j%%%j%%%%%J%J%
201A15Jj%%j%%%J%j%J%%%%jJ%JJjjjjJ%%%%J%J%%%JjjJ%%%%j%%%j%%%%%%%%%j%j%jJ%%JJ%
193A14%j%%%%J%%%%j%%%%%%%%J%JjjjJJ%%%%%J%%%j%%%J%j%%j%%J%%j%JJJ%j%%%%jJ%%jjj
186A12%J%%%%%%%%%%J%%%%j%%%j%j%%%J%JJ%%JJjjjJ%JJj%%%J%%%Jjjj%JJ%%jj%%%%%%%jJ
179A14J%%j%j%jJJ%%jjJ%%%J%j%J%%%%jJ%%%%jJ%%j%J%%%%%jJ%J%Jj%j%%j%J%jjJ%%%jJ%J
171A14%%%J%%%jJ%%J%%%j%%%%jj%J%Jj%%J%%%%%%%%J%%%%j%JJ%%j%j%%j%%jJJ%%j%J%%%%j
$$ y = [115, 114, 114, 113, 113, 113, 113, 114, 114, 113, 113, 113, 114, 115, 115, 115, 114, 114, 115, 115, 115, 115, 114, 114, 114, 114, 114, 114, 114, 114, 114, 114, 114, 115, 115, 116, 116, 116, 115, 115, 115, 114, 113, 114, 114, 115, 115, 116, 115, 115, 115, 116, 117, 117, 116, 116, 115, 115, 115, 115, 115, 114, 114, 114, 114, 114, 115, 115, 115, 115, 114, 114, 114, 114, 114, 114, 114, 113, 114, 115, 116, 116, 115, 115, 115, 116, 116, 117, 117, 117, 117, 117, 117, 117, 118, 118, 116, 115, 115, 115, 115, 115, 115, 115, 115, 114, 113, 114, 115, 115, 114, 114, 113, 113, 114, 113, 113, 113, 114, 114, 113, 113, 112, 111, 111, 111, 112, 113, 113, 113, 113, 114, 114, 115, 115, 115, 115, 115, 115, 114, 114, 114, 114, 114, 114, 114, 113, 113, 113, 114, 114, 115, 115, 115, 115, 115, 115, 115, 115, 115, 114, 114, 114, 114, 114, 115, 115, 114, 113, 113, 114, 114, 115, 114, 114, 114, 114, 114, 115, 114, 114, 114, 114, 115, 116, 116, 116, 116, 116, 115, 115, 114, 115, 116, 116, 115, 115, 114, 114, 114, 114, 113, 113, 113, 113, 113, 113, 114, 114, 115, 115, 116, 115, 115, 115, 114, 114, 114, 114, 115, 115, 114, 114, 115, 115, 115, 115, 115, 114, 115, 115, 116, 117, 116, 115, 114, 113, 114, 114, 114, 114, 114, 115, 115, 116, 116, 116, 116, 117, 116, 115, 116, 116, 116, 116, 116, 115, 115, 115, 115, 114, 114, 114, 114, 114, 114, 114, 114, 114, 114, 113, 113, 112, 112, 111, 112, 112, 112, 113, 114, 114, 114, 113, 113, 113, 113, 113, 114, 114, 114, 114, 114, 113, 113, 113, 113, 113, 113, 113, 113, 113, 114, 114, 115, 114, 113, 112, 113, 114, 114, 114, 114, 114, 114, 115, 115, 115, 115, 114, 114, 114, 114, 115, 115, 114, 114, 114, 113, 113, 113, 114, 114, 114, 113, 113, 114, 115, 116, 116, 115, 115, 115, 115, 115, 114, 115, 115, 115, 114, 113, 112, 112, 113, 113, 113, 113, 113, 113, 113, 113, 113, 113, 113, 114, 114, 114, 114, 114, 113, 113, 113, 113, 112, 112, 111, 111, 111, 111, 112, 112, 113, 114, 114, 114, 115, 116, 115, 114, 113, 114, 114, 115, 116, 115, 115, 115, 115, 116, 116, 116, 116, 117, 116, 115, 114, 114, 115, 116, 116, 116, 115, 114, 114, 114, 114, 114, 114, 114, 114, 113, 114, 115, 115, 115, 114, 114, 113, 113, 112, 113, 114, 114, 114, 113, 112, 113, 113, 113, 113, 114, 114, 113, 113, 114, 114, 114, 114, 114, 113, 114, 114, 114, 114, 114, 113, 114, 114, 114, 113, 113, 114, 114, 114, 114, 114, 114, 113, 114, 114, 115, 115, 116, 115, 115, 114, 114, 114, 113, 113, 114, 114, 113, 112, 113, 113, 113, 113, 112, 113, 113, 114, 114, 114, 114, 115, 115, 115, 115, 114, 115, 115, 115, 116, 116, 116, 116, 115, 115, 115, 115, 115, 114, 113, 113, 114, 114, 115, 114, 114, 114, 115, 115, 115, 115, 115, 115, 115, 115, 115, 116, 116, 116, 116, 116, 115, 115, 116, 117, 117, 117, 116, 116, 115, 115, 115, 114, 114, 114, 113, 114, 115, 115, 115, 114, 114, 115, 115, 115, 115, 115, 114]
$$ [...]
-2632A21
##END=		$$ NMR SPECTRUM
##END=		$$ LINK
