##TITLE=	T+GYDxuJSXK2lCKFgKfrAg.10.fid
##JCAMP-DX=	6.0	$$ MestReNova 14.3.3-33362
##DATA TYPE=	LINK
##BLOCKS=	1    
##ORIGIN=	Mestrelab Research S.L.
##OWNER=	hrzepa
##$MNOVA/METADATA=	(DOCUMENT,BASE64)
eyJuYW1lIjoiL1VzZXJzL2hyemVwYS9MaWJyYXJ5L01vYmlsZSBEb2N1bWVudHMvY29tfmFwcGxlfkN
sb3VkRG9jcy9TaGVwcGFyZC9OTVIgZmlsZXMgemlwcy0yLzYvNi1ILm1ub3ZhIiwicGFnZXMiOlt7Im
l0ZW1zIjpbIjEiICAgICBdfV19
##TITLE=	T+GYDxuJSXK2lCKFgKfrAg.10.fid
##JCAMP-DX=	6.0	$$ MestReNova 14.3.3-33362
##DATA TYPE=	NMR SPECTRUM
##DATA CLASS=	XYDATA
##BLOCK_ID=	1
##ORIGIN=	Bruker BioSpin GmbH
##OWNER=	nmrsu
##NUMDIM=	1
##$MNOVA/METADATA=	(ITEM,BASE64)
eyJhbmdsZSI6MCwiYXhlcyI6eyJ4Ijp7Im1heCI6MTYuMDY0MjU5OTk5OTM5MTI1LCJtaW4iOi0zLjc
2Njk0MjMzOTE1NjYyMjZ9LCJ5Ijp7Im1heCI6MTA5OTM3LjIwNjA1NDY4NzUsIm1pbiI6LTk5MTAuNz
k1Nzc2MzY3MTg4fX0sInBvaW50cyI6W3sieCI6NTMyMSwieSI6NTgzNX0seyJ4Ijo4NzIyLCJ5Ijo1O
DM1fSx7IngiOjg3MjIsInkiOjgyMDh9LHsieCI6NTMyMSwieSI6ODIwOH0seyJ4Ijo1MzIxLCJ5Ijo1
ODM1fV0sInoiOjB9
##.OBSERVE FREQUENCY=	700.35432466099996418
##.OBSERVE NUCLEUS=	^1H
##.SOLVENT NAME=	CDCl3
##.PULSE SEQUENCE=	zg30
##LONGDATE=	2023/06/06 12:50:19.000
##.ACQUISITIONMODE=	SIMULTANEOUS (DQD)
##$ORIGINAL FORMAT=	Bruker XWIN-NMR
##$MNOVA/SCALES_VERSION=	9
##$PARAMETER FILE=	(acqus, ASCII, /private/var/folders/f6/rjf_tdyn2v98c5c0wvkgn4s80000gq/T/T+GYDxuJSXK2lCKFgKfrAg/10/acqus, 0)
$$ ##TITLE= Parameter file, TopSpin 4.1.3
$$ ##JCAMPDX= 5.0
$$ ##DATATYPE= Parameter Values
$$ ##NPOINTS= 1	$$ modification sequence number
$$ ##ORIGIN= Bruker BioSpin GmbH
$$ ##OWNER= nmrsu
$$ $$ 2023-06-06 12:49:25.716 +0100  nmrsu@CZC7167VR1
$$ $$ Z:/700/data/tds/nmr/RP254 char/10/acqus
$$ $$ process C:\Bruker\TopSpin4.1.3\prog\mod\dirdata.exe
$$ ##$ACQT0= -2.0981556054023
$$ ##$AMP= (0..31)
$$ 100 100 100 100 100 100 100 100 100 100 100 100 100 100 100 100 100 100
$$ 100 100 100 100 100 100 100 100 100 100 100 100 100 100
$$ ##$AMPCOIL= (0..32)
$$ -1 0 0 0 0 0 0 0 0 0 0 0 0 0 0 0 0 0 0 0 0 0 0 0 0 0 0 0 0 0 0 0 0
$$ ##$AQSEQ= 0
$$ ##$AQ_mod= 3
$$ ##$AUNM= <au_zg>
$$ ##$AUTOPOS= <7 >
$$ ##$BF1= 700.349999998
$$ ##$BF2= 700.349999998
$$ ##$BF3= 700.349999998
$$ ##$BF4= 700.349999998
$$ ##$BF5= 700.349999998
$$ ##$BF6= 700.349999998
$$ ##$BF7= 700.349999998
$$ ##$BF8= 700.349999998
$$ ##$BWFAC= (0..63)
$$ 0 0 0 0 0 0 0 0 0 0 0 0 0 0 0 0 0 0 0 0 0 0 0 0 0 0 0 0 0 0 0 0 0 0 0 0
$$ 0 0 0 0 0 0 0 0 0 0 0 0 0 0 0 0 0 0 0 0 0 0 0 0 0 0 0 0
$$ ##$BYTORDA= 0
$$ ##$CHANFCU= (0..24)
$$ 0 1 0 0 0 0 0 0 0 0 0 0 0 0 0 0 0 0 0 0 0 0 0 0 0
$$ ##$CHANREC= (0..24)
$$ 0 0 0 0 0 0 0 0 0 0 0 0 0 0 0 0 0 0 0 0 0 0 0 0 0
$$ ##$CHEMSTR= <none>
$$ ##$CNST= (0..63)
$$ 1 1 1 1 1 1 1 1 1 1 1 1 1 1 1 1 1 1 1 1 1 1 1 1 1 1 1 1 1 1 1 1 1 1 1 1
$$ 1 1 1 1 1 1 1 1 1 1 1 1 1 1 1 1 1 1 1 1 1 1 1 1 1 1 1 1
$$ ##$CPDPRG= (0..8)
$$ <> <> <> <> <> <> <> <> <>
$$ ##$D= (0..63)
$$ 0 1 0 0 0 0 0 0 0 0 0 0 0 0 0 0 0.0002 0 0 0 0 0 0 0 0 0 0 0 0 0 0 0 0
$$ 0 0 0 0 0 0 0 0 0 0 0 0 0 0 0 0 0 0 0 0 0 0 0 0 0 0 0 0 0 0 0
$$ ##$DATE= 1686052219
$$ ##$DATE_START= 1686052176
$$ [...]
$$ ##$ShimPowRng3= (0..63)
$$ 1 1 1 1 1 1 1 1 1 1 1 1 1 1 1 1 1 1 1 1 1 1 1 1 1 1 1 1 1 1 1 1 1 1 1 1
$$ 1 1 1 1 0 0 0 0 0 0 0 0 0 0 0 0 0 0 0 0 0 0 0 0 0 0 0 0
$$ ##$ShimPowType1= 8
$$ ##$ShimPowType2= 8
$$ ##$ShimPowType3= 0
$$ ##$ShimPowType4= 0
$$ ##$ShimPowType5= 0
$$ ##$ShimPowType6= 0
$$ ##$ShimPowType7= 0
$$ ##$ShimPowType8= 0
$$ ##$ShimSysActGrad= (0..63)
$$ 1 2 3 4 13 5 7 11 10 9 6 8 12 18 19 20 21 15 22 23 24 14 25 16 26 17 27
$$ 28 31 32 33 34 35 36 37 38 0 0 0 0 0 0 0 0 0 0 0 0 0 0 0 0 0 0 0 0 0 0
$$ 0 0 0 0 0 0
$$ ##$ShimSysAngle= <>
$$ ##$ShimSysFunc= (0..63)
$$ 1 2 3 4 5 6 7 8 9 10 0 37 38 35 16 15 14 13 12 11 28 27 26 25 24 23 36
$$ 22 30 29 20 21 34 33 32 31 17 18 19 0 0 0 0 0 0 0 0 0 0 0 0 0 0 0 0 0 0
$$ 0 0 0 0 0 0 0
$$ ##$ShimSysMatId= <292722da.dat>
$$ ##$ShimSysMatrix= 1
$$ ##$ShimSysMinMaxUG= 130000
$$ ##$ShimSysOffset= <29 mm>
$$ ##$ShimSysType= 4
$$ ##$ShimUnit= 3
$$ ##$SpectrOsVersion= <4.1.156.20210628>
$$ ##$TCubeEth= <192.168.180.38>
$$ ##$TCubeSeqDevice= <>
$$ ##$TOSITY= <no>
$$ ##$TRIPLO2= 0
$$ ##$TopSpinVersion= <TopSpin 4.1.3>
$$ ##$TrxFreqFormula= (0..23)
$$ <TrxFreqFormula(2.0,700350000.000000,'TRX',Trx(1.0,'TRX 1200.1',1,5.000000,1290.000000))>
$$ <TrxFreqFormula(2.0,700350000.000000,'TRX',Trx(1.0,'TRX 1200.2',1,5.000000,1290.000000))>
$$ <TrxFreqFormula(2.0,700350000.000000,'TRX',Trx(1.0,'TRX 1200.3',1,5.000000,1290.000000))>
$$ <> <> <> <> <> <> <> <> <> <> <> <> <> <> <> <> <> <> <> <> <>
$$ ##$TrxPN= (0..23)
$$ <Z148391> <Z148391> <Z148391> <> <> <> <> <> <> <> <> <> <> <> <> <> <>
$$ <> <> <> <> <> <> <>
$$ ##$TrxSN= (0..23)
$$ <00336> <00337> <00342> <> <> <> <> <> <> <> <> <> <> <> <> <> <> <> <>
$$ <> <> <> <> <>
$$ ##$VCubeEth= (0..23)
$$ <no> <no> <no> <no> <no> <no> <no> <no> <no> <no> <no> <no> <no> <no> <no>
$$ <no> <no> <no> <no> <no> <no> <no> <no> <no>
$$ ##$VTU= 2
$$ ##$VTUETH= <192.168.99.11>
$$ ##$VTUTY= <no>
$$ ##$ValueLine= no
$$ ##$VpuPN= (0..23)
$$ <no> <no> <no> <no> <no> <no> <no> <no> <no> <no> <no> <no> <no> <no> <no>
$$ <no> <no> <no> <no> <no> <no> <no> <no> <no>
$$ ##$VpuSN= (0..23)
$$ <no> <no> <no> <no> <no> <no> <no> <no> <no> <no> <no> <no> <no> <no> <no>
$$ <no> <no> <no> <no> <no> <no> <no> <no> <no>
$$ ##$WBREFAM= (0..31)
$$ 99.8 100 100 100 100 100 100 100 100 100 100 100 100 100 100 100 100 100
$$ 100 100 100 100 100 100 100 100 100 100 100 100 100 100
$$ ##$WBREFLM= (0..31)
$$ 1 0 1 0 0 0 0 0 0 0 0 0 0 0 0 0 0 0 0 0 0 0 0 0 0 0 0 0 0 0 0 0
$$ ##$WBREFPH= (0..31)
$$ 0.05 0 0 0 0 0 0 0 0 0 0 0 0 0 0 0 0 0 0 0 0 0 0 0 0 0 0 0 0 0 0 0
$$ ##$WBSGU= (0..31)
$$ 1 2 4 0 0 0 0 0 0 0 0 0 0 0 0 0 0 0 0 0 0 0 0 0 0 0 0 0 0 0 0 0
$$ ##END=
$$ 
##$DECIM=	1440
##$DSPFVS=	21
##XUNITS=	HZ
##YUNITS=	ARBITRARY UNITS
##FIRSTX=	11250.604788156719223
##LASTX=	-2638.1781369192458442
##DELTAX=	-0.10596381293402784562
##XFACTOR=	1
##YFACTOR=	3.0501068624683371766
##FIRSTY=	141.2210235595703125
##MINY=	83.66249847412109375
##MAXY=	99942.8515625
##NPOINTS=	131072
##XYDATA=	(X++(Y..Y))
$$ [...]
4642F3%%%%%%%%%%jJ%%%%%%%%j%%%%%%%%%%%%J%%%%%%%%%%%jJ%j%J%%%%%%%%j%J%%%%%%%%
4635F3%%%%%%%%%%%%%%%%%%%%%%%%%%%%%%%%%%%%%%%%%%%%%%%%%%%%%%%%j%%J%%%%%%%%%%
4627F3%%%%%%%%%%%%%%%%%%%%%%%%%%%%%%%%%%j%%J%%%%%%%%%%%%%%%Jj%%%%%%%%%%%%%%%
4620F3%%%%%%%%%%%%%%%%%%%%%%%%j%J%%%%%%%%%%%%j%J%%%%%%%%%%%%%%%%%%%%%%%%%%%%
4612F3%%%%%%%%%%%%%%%%%%%%%%%%%%%%%%%%%%%%%%%%%%%%%%%%%%%%%%%%%%%%%%%%%%%%%%
4605F3%%%%%%%%jJ%%%%%%%j%%%%%%%J%%%%%%%%%%jJ%j%%J%%%%%%%%%%%%%%%%%%%%%%%%%%%
4597F3%%%%%%%%%%%%%%%j%%%%%%J%%%%%%%%%%%%%j%%%%%%%J%%%j%%%%%%J%%%%%%j%%%%%%%
4590F2%J%%%%%%%%%%%%%%%%%%%%%j%%%%J%%%%j%%J%%%%%%%%%%%%%%%%%%%%%%%%%%j%J%%%%
$$ plain form
4642 63 63 63 63 63 63 63 63 63 63 63 62 63 63 63 63 63 63 63 63 63 62 62 62 62 62 62 62 62 62 62 62 62 62 63 63 63 63 63 63 63 63 63 63 63 63 62 63 63 62 62 63 63 63 63 63 63 63 63 63 62 62 63 63 63 63 63 63 63 63 63
4635 63 63 63 63 63 63 63 63 63 63 63 63 63 63 63 63 63 63 63 63 63 63 63 63 63 63 63 63 63 63 63 63 63 63 63 63 63 63 63 63 63 63 63 63 63 63 63 63 63 63 63 63 63 63 63 63 63 62 62 62 63 63 63 63 63 63 63 63 63 63 63
4627 63 63 63 63 63 63 63 63 63 63 63 63 63 63 63 63 63 63 63 63 63 63 63 63 63 63 63 63 63 63 63 63 63 63 63 62 62 62 63 63 63 63 63 63 63 63 63 63 63 63 63 63 63 63 64 63 63 63 63 63 63 63 63 63 63 63 63 63 63 63 63
4620 63 63 63 63 63 63 63 63 63 63 63 63 63 63 63 63 63 63 63 63 63 63 63 63 63 62 62 63 63 63 63 63 63 63 63 63 63 63 63 63 62 62 63 63 63 63 63 63 63 63 63 63 63 63 63 63 63 63 63 63 63 63 63 63 63 63 63 63 63 63 63
4612 63 63 63 63 63 63 63 63 63 63 63 63 63 63 63 63 63 63 63 63 63 63 63 63 63 63 63 63 63 63 63 63 63 63 63 63 63 63 63 63 63 63 63 63 63 63 63 63 63 63 63 63 63 63 63 63 63 63 63 63 63 63 63 63 63 63 63 63 63 63 63
4605 63 63 63 63 63 63 63 63 63 62 63 63 63 63 63 63 63 63 62 62 62 62 62 62 62 62 63 63 63 63 63 63 63 63 63 63 63 62 63 63 62 62 62 63 63 63 63 63 63 63 63 63 63 63 63 63 63 63 63 63 63 63 63 63 63 63 63 63 63 63 63
4597 63 63 63 63 63 63 63 63 63 63 63 63 63 63 63 63 62 62 62 62 62 62 62 63 63 63 63 63 63 63 63 63 63 63 63 63 63 62 62 62 62 62 62 62 62 63 63 63 63 62 62 62 62 62 62 62 63 63 63 63 63 63 63 62 62 62 62 62 62 62 62
4590 62 62 63 63 63 63 63 63 63 63 63 63 63 63 63 63 63 63 63 63 63 63 63 63 62 62 62 62 62 63 63 63 63 63 62 62 62 63 63 63 63 63 63 63 63 63 63 63 63 63 63 63 63 63 63 63 63 63 63 63 63 63 63 63 62 62 63 63 63 63 63
4583F3%%%%%%%j%J%%%%%%%%%%%%%%%%%%%%%%%%%%%%%%%%%%%j%%%%%%%%J%%%%%%%%j%J%%j%
4575F2J%%%%%%%%%%%%%%%%%%%%%%%%%%%%%%%%%%%%%%%%%%%%%%%%%%%%%%j%%J%%%%%%%%%%%
4568F3%%%%%%%%jJ%%%%%J%%j%%%%%%%%%Jj%%%%J%%%%%j%%%%%%%%J%%%%j%%%%%J%%j%%%%%%
4560F3%%%%%%%%%J%jJ%%%%%%%%j%%%%%%J%%%%%%%%%%%%%%%%%%%j%J%%J%%%%j%J%%%%%J%%%
4553F6%%%%%%%%%%J%%%%%%%%%%J%J%%J%JJJ%J%JJ%J%%%%j%jjjj%j%j%j%%%%j%%%j%%%j%%%
4546F6%J%%J%%J%J%JJJ%%JJ%JJ%%Jj%%jjj%jj%j%%j%%j%J%J%JJ%JJJJ%%%%%jjj%%jj%jj%j
4538F9%j%%j%%j%%%%%%%J%%J%%%J%J%%%JJ%JJJ%%J%%%%%%j%jjjjj%j%%%j%%j%j%%%%%%%%j
4531F5%%%%%%%%%%%%%j%%%%%%%j%%%%%J%%%%%%%%%%%%%%%%%%%%%%%%%%%j%%%%%%Jj%%%%%%
$$ plain form
4583 63 63 63 63 63 63 63 63 62 62 63 63 63 63 63 63 63 63 63 63 63 63 63 63 63 63 63 63 63 63 63 63 63 63 63 63 63 63 63 63 63 63 63 63 63 63 62 62 62 62 62 62 62 62 62 63 63 63 63 63 63 63 63 63 62 62 63 63 63 62 62
4575 62 63 63 63 63 63 63 63 63 63 63 63 63 63 63 63 63 63 63 63 63 63 63 63 63 63 63 63 63 63 63 63 63 63 63 63 63 63 63 63 63 63 63 63 63 63 63 63 63 63 63 63 63 63 63 63 62 62 62 63 63 63 63 63 63 63 63 63 63 63 63
4568 63 63 63 63 63 63 63 63 63 62 63 63 63 63 63 63 64 64 64 63 63 63 63 63 63 63 63 63 63 64 63 63 63 63 63 64 64 64 64 64 64 63 63 63 63 63 63 63 63 63 64 64 64 64 64 63 63 63 63 63 63 64 64 64 63 63 63 63 63 63 63
4560 63 63 63 63 63 63 63 63 63 63 64 64 63 64 64 64 64 64 64 64 64 64 63 63 63 63 63 63 63 64 64 64 64 64 64 64 64 64 64 64 64 64 64 64 64 64 64 64 64 63 63 64 64 64 65 65 65 65 65 64 64 65 65 65 65 65 65 66 66 66 66
4553 66 66 66 66 66 66 66 66 66 66 66 67 67 67 67 67 67 67 67 67 67 67 68 68 69 69 69 70 70 71 72 73 73 74 74 75 76 76 77 77 77 77 77 76 76 75 74 73 72 72 71 71 70 70 69 69 69 69 69 68 68 68 68 67 67 67 67 66 66 66 66
4546 66 66 67 67 67 68 68 68 69 69 70 70 71 72 73 73 73 74 75 75 76 77 77 77 78 77 77 77 76 75 74 74 73 72 72 71 71 71 70 70 70 69 69 70 70 71 71 72 73 73 74 75 76 77 77 77 77 77 77 76 75 74 74 74 73 72 72 71 70 70 69
4538 69 69 68 68 68 67 67 67 66 66 66 66 66 66 66 66 67 67 67 68 68 68 68 69 69 70 70 70 70 71 72 72 73 74 75 75 75 76 76 76 76 76 76 76 75 75 74 73 72 71 70 70 69 69 69 69 68 68 68 67 67 66 66 66 66 66 66 66 66 66 65
4531 65 65 65 65 65 65 65 65 65 65 65 65 65 65 64 64 64 64 64 64 64 64 63 63 63 63 63 63 64 64 64 64 64 64 64 64 64 64 64 64 64 64 64 64 64 64 64 64 64 64 64 64 64 64 64 64 63 63 63 63 63 63 63 64 63 63 63 63 63 63 63
4523F3%%%%%%%%%%%%%J%%%j%J%%j%%%J%%%%j%%J%%%%j%%%%%%%%%%Jj%%%%%%%%%%%%%%%%%%
4516F3%%%%%%%%%%%%%%%J%j%%%%%%%%%%%%%%%%%%%%%%%%%%%%%%%%%%%%%%%%%%%%%%%%%%%%
4508F3%%%j%%%%%%J%%%j%J%%%%j%%%%J%%%%%%%j%%%%%%%%%%%%%%%%J%%j%%%%%%%%%%%%%%%
4501F2%%%%%%%j%%J%%%%%%%%%%%%%%%%%%%%%%%%%j%%%%%%%%%%%%%%%%J%%%%%%%%%%%%%%%%
4494F2j%%%%%Jj%%J%jJ%%j%%%%%%J%%%%%%j%%%%%%%%%%%%%J%%%%%%j%%%%%Jj%J%%%%%%%%%
4486F2%%%%%%%%%%%%%j%%%%J%%%%%%%%%%%%%%%%%%%%%%%%%%%%%%%%%%%%%%%J%%%%j%Jj%%%
4479F2%%%%%%%%%%%%%%%%%J%%%%%%j%%J%%%%j%%%%%%J%%%%%%%%%j%%%%%%%%%%%%%%%%%%J%
4471F3%%%%j%%%%%%%%%%%%%%%%%%%%%%%%%%%%%%%%%%%%%%%%%%%%%%%%%%j%%%%%%%%%%Jj%%
$$ plain form
4523 63 63 63 63 63 63 63 63 63 63 63 63 63 63 64 64 64 64 63 63 64 64 64 63 63 63 63 64 64 64 64 64 63 63 63 64 64 64 64 64 63 63 63 63 63 63 63 63 63 63 63 64 63 63 63 63 63 63 63 63 63 63 63 63 63 63 63 63 63 63 63
4516 63 63 63 63 63 63 63 63 63 63 63 63 63 63 63 63 64 64 63 63 63 63 63 63 63 63 63 63 63 63 63 63 63 63 63 63 63 63 63 63 63 63 63 63 63 63 63 63 63 63 63 63 63 63 63 63 63 63 63 63 63 63 63 63 63 63 63 63 63 63 63
4508 63 63 63 63 62 62 62 62 62 62 62 63 63 63 63 62 62 63 63 63 63 63 62 62 62 62 62 63 63 63 63 63 63 63 63 62 62 62 62 62 62 62 62 62 62 62 62 62 62 62 62 62 63 63 63 62 62 62 62 62 62 62 62 62 62 62 62 62 62 62 62
4501 62 62 62 62 62 62 62 62 61 61 61 62 62 62 62 62 62 62 62 62 62 62 62 62 62 62 62 62 62 62 62 62 62 62 62 62 62 61 61 61 61 61 61 61 61 61 61 61 61 61 61 61 61 61 62 62 62 62 62 62 62 62 62 62 62 62 62 62 62 62 62
4494 62 61 61 61 61 61 61 62 61 61 61 62 62 61 62 62 62 61 61 61 61 61 61 61 62 62 62 62 62 62 62 61 61 61 61 61 61 61 61 61 61 61 61 61 61 62 62 62 62 62 62 62 61 61 61 61 61 61 62 61 61 62 62 62 62 62 62 62 62 62 62
4486 62 62 62 62 62 62 62 62 62 62 62 62 62 62 61 61 61 61 61 62 62 62 62 62 62 62 62 62 62 62 62 62 62 62 62 62 62 62 62 62 62 62 62 62 62 62 62 62 62 62 62 62 62 62 62 62 62 62 62 63 63 63 63 63 62 62 63 62 62 62 62
4479 62 62 62 62 62 62 62 62 62 62 62 62 62 62 62 62 62 62 63 63 63 63 63 63 63 62 62 62 63 63 63 63 63 62 62 62 62 62 62 62 63 63 63 63 63 63 63 63 63 63 62 62 62 62 62 62 62 62 62 62 62 62 62 62 62 62 62 62 62 63 63
4471 63 63 63 63 63 62 62 62 62 62 62 62 62 62 62 62 62 62 62 62 62 62 62 62 62 62 62 62 62 62 62 62 62 62 62 62 62 62 62 62 62 62 62 62 62 62 62 62 62 62 62 62 62 62 62 62 61 61 61 61 61 61 61 61 61 61 61 62 61 61 61
4464F1%J%%%%jJ%%%%%%%J%%%%%%%j%%%%%%%%%%%%%%%%%%%%%%%%%%%%%%%J%%%%%j%%%%j%J%
4457F2%%%%%%%%%%Jj%%%%%%%%%%%%%%%%%%Jj%%%%%%%%%%%%J%%%%%%%%%%%%%%%%j%%J%%%jJ
4449F3%%%%j%%%%%%%%%%%%%%%%%%%%%J%%%%j%%%%%%%%%%%%%%%%%%%%J%j%J%%%%%%%j%%J%j
4442F2%%%%%%%%%%%%%%%J%%%j%%%%%%%%%%%%%%%%%%%%%%%%%%%%%%%%%J%%%%j%Jj%%%%%%%%
4434F2J%%%%%%%j%%%%%%%%%%%%%%%%%%%%%%J%j%%%%J%%%j%%%%%%%%%%%%%%%%%%%%%%%%%%%
4427F2%%%%%%%%%%%%jJ%%%%%%%%%%%%%%%%%%%%%%%%%%%%%%%%%%%%%%%%%%%%%%%%%%%%%J%%
4419F3%j%%%%%%%%%%%%%%%%%%%J%%%j%%%%%%%%%%%%%%%%%%%%%%%%%%%%%%%%%%j%%%%%%J%%
4412F2%%%%j%%J%%%%%%%%%%%%%%%%%%%%%%%%%%%%%%%%%j%%%J%%%%%%%%%%%%%%%%%%%%%%%%
$$ plain form
4464 61 61 62 62 62 62 62 61 62 62 62 62 62 62 62 62 63 63 63 63 63 63 63 63 62 62 62 62 62 62 62 62 62 62 62 62 62 62 62 62 62 62 62 62 62 62 62 62 62 62 62 62 62 62 62 62 63 63 63 63 63 63 62 62 62 62 62 61 61 62 62
4457 62 62 62 62 62 62 62 62 62 62 62 63 62 62 62 62 62 62 62 62 62 62 62 62 62 62 62 62 62 62 62 63 62 62 62 62 62 62 62 62 62 62 62 62 62 63 63 63 63 63 63 63 63 63 63 63 63 63 63 63 63 63 62 62 62 63 63 63 63 62 63
4449 63 63 63 63 63 62 62 62 62 62 62 62 62 62 62 62 62 62 62 62 62 62 62 62 62 62 62 63 63 63 63 63 62 62 62 62 62 62 62 62 62 62 62 62 62 62 62 62 62 62 62 62 62 63 63 62 62 63 63 63 63 63 63 63 63 62 62 62 63 63 62
4442 62 62 62 62 62 62 62 62 62 62 62 62 62 62 62 62 63 63 63 63 62 62 62 62 62 62 62 62 62 62 62 62 62 62 62 62 62 62 62 62 62 62 62 62 62 62 62 62 62 62 62 62 62 62 63 63 63 63 63 62 62 63 62 62 62 62 62 62 62 62 62
4434 62 63 63 63 63 63 63 63 63 62 62 62 62 62 62 62 62 62 62 62 62 62 62 62 62 62 62 62 62 62 62 62 63 63 62 62 62 62 62 63 63 63 63 62 62 62 62 62 62 62 62 62 62 62 62 62 62 62 62 62 62 62 62 62 62 62 62 62 62 62 62
4427 62 62 62 62 62 62 62 62 62 62 62 62 62 61 62 62 62 62 62 62 62 62 62 62 62 62 62 62 62 62 62 62 62 62 62 62 62 62 62 62 62 62 62 62 62 62 62 62 62 62 62 62 62 62 62 62 62 62 62 62 62 62 62 62 62 62 62 62 63 63 63
4419 63 63 62 62 62 62 62 62 62 62 62 62 62 62 62 62 62 62 62 62 62 62 63 63 63 63 62 62 62 62 62 62 62 62 62 62 62 62 62 62 62 62 62 62 62 62 62 62 62 62 62 62 62 62 62 62 62 62 62 62 62 61 61 61 61 61 61 61 62 62 62
4412 62 62 62 62 62 61 61 61 62 62 62 62 62 62 62 62 62 62 62 62 62 62 62 62 62 62 62 62 62 62 62 62 62 62 62 62 62 62 62 62 62 62 61 61 61 61 62 62 62 62 62 62 62 62 62 62 62 62 62 62 62 62 62 62 62 62 62 62 62 62 62
4405F2%%%%%%%%%%%%%%%%%%%%%%%%%%%%%%%%%%%%%%%%%%%%%%%%%%%%%%%%%%%%%%%%J%j%%%
4397F2%%J%j%%%%%%%%%%%%%%%%%%%%%%%%%Jj%%%%%%%%%%%%%%%%%%%%%%%%%%%%%%%%%%%%%%
4390F2%%%%%%%%%%%%%%%%%%%j%%%%Jj%%%%%J%%j%%%%J%%j%%%%%%J%j%%%J%%%%%j%%J%%j%%
4382F1%%%%%%J%%%%%%%%%%%%%%%%%%%%%%%%%%%%%%%%jJ%%j%%%%J%j%%J%%%%%%%%%%%%J%j%
4375F2%%%%%%%%%%%jJ%%%%%%%%%%%%%%%%%%%jJ%%%%%%%%%%%%%%%%j%%%%J%%%%%%%%%%%%%%
4368F2%%%%%%%j%%%%%%%%%%%%%%%%%%%%%%%%%j%J%%%%%%%%%%%%%%%%%%%%%%%%%%%%%%%%%%
4360F1%%%%%%%%%%%%%%%%%%%%%%%J%%%%%j%%%%%%%%%%%J%j%%%j%J%%%%%J%%%%%%%%%%%%%%
4353F2%%%j%%%%%J%j%%%%%%%%%%%%%%J%%%%%%%%%%%%%%%j%%%%%%%%%%%%jJ%%J%j%%%%%%Jj
$$ plain form
4405 62 62 62 62 62 62 62 62 62 62 62 62 62 62 62 62 62 62 62 62 62 62 62 62 62 62 62 62 62 62 62 62 62 62 62 62 62 62 62 62 62 62 62 62 62 62 62 62 62 62 62 62 62 62 62 62 62 62 62 62 62 62 62 62 62 63 63 62 62 62 62
4397 62 62 62 63 63 62 62 62 62 62 62 62 62 62 62 62 62 62 62 62 62 62 62 62 62 62 62 62 62 62 62 63 62 62 62 62 62 62 62 62 62 62 62 62 62 62 62 62 62 62 62 62 62 62 62 62 62 62 62 62 62 62 62 62 62 62 62 62 62 62 62
4390 62 62 62 62 62 62 62 62 62 62 62 62 62 62 62 62 62 62 62 62 61 61 61 61 61 62 61 61 61 61 61 61 62 62 62 61 61 61 61 61 62 62 62 61 61 61 61 61 61 61 62 62 61 61 61 61 62 62 62 62 62 62 61 61 61 62 62 62 61 61 61
4382 61 61 61 61 61 61 61 62 62 62 62 62 62 62 62 62 62 62 62 62 62 62 62 62 62 62 62 62 62 62 62 62 62 62 62 62 62 62 62 62 61 62 62 62 61 61 61 61 61 62 62 61 61 61 62 62 62 62 62 62 62 62 62 62 62 62 62 63 63 62 62
4375 62 62 62 62 62 62 62 62 62 62 62 62 61 62 62 62 62 62 62 62 62 62 62 62 62 62 62 62 62 62 62 62 62 61 62 62 62 62 62 62 62 62 62 62 62 62 62 62 62 62 62 61 61 61 61 61 62 62 62 62 62 62 62 62 62 62 62 62 62 62 62
4368 62 62 62 62 62 62 62 62 61 61 61 61 61 61 61 61 61 61 61 61 61 61 61 61 61 61 61 61 61 61 61 61 61 61 60 60 61 61 61 61 61 61 61 61 61 61 61 61 61 61 61 61 61 61 61 61 61 61 61 61 61 61 61 61 61 61 61 61 61 61 61
4360 61 61 61 61 61 61 61 61 61 61 61 61 61 61 61 61 61 61 61 61 61 61 61 61 62 62 62 62 62 62 61 61 61 61 61 61 61 61 61 61 61 61 62 62 61 61 61 61 60 60 61 61 61 61 61 61 62 62 62 62 62 62 62 62 62 62 62 62 62 62 62
4353 62 62 62 62 61 61 61 61 61 61 62 62 61 61 61 61 61 61 61 61 61 61 61 61 61 61 61 62 62 62 62 62 62 62 62 62 62 62 62 62 62 62 62 61 61 61 61 61 61 61 61 61 61 61 61 61 60 61 61 61 62 62 61 61 61 61 61 61 61 62 61
4345F1%%%%%%%%%%%%%%%%%%%%%%%%%%jJ%%%j%J%%%%%%%%%%%%%j%J%j%J%%%%%%%j%%%%%%%J
4338F1%j%%%%%%%%%%Jj%%%%%%%%%%J%%%%%%%%%%%%%%%%%%%%%%%%%%%%%%%%%%%%j%%%J%%%%
4330F1%%%%%%%%j%J%j%J%%%%%%%%%%%%J%j%J%%j%%%%%%%%%%%%%%%%%%%%%%%%%%%%%%%%%%%
4323F1%%%j%%%%%%%%%%%%%%%J%j%%%%%%%J%%j%J%j%%%%%%%%%%%%%%%%%%%%%%%%%jJ%j%J%%
4316F0%%%j%%%%J%%jJ%%%%%%%%%%%%%%%%%%%%%%J%%j%%%%%%%%%%%%%%%%%%%%%%J%%%j%%%%
4308F0%%%%%%%%%%%%%%%%%%%%%%Jj%J%%%%%%%%%%%%%%J%j%%%%%J%%%%%%%jJ%%%%j%%%%%%%
4301F1%%%%%%%%%%%%%%%%%%%%%J%%j%%%%%%%%%%%%%%%%%%%%%%%%%%%%%%%%%%%%%%%%%%j%%
4293F0J%%%%%%%%j%%%%%%%%%%%%%%%J%%%%%%%%%%%%%%%%j%%J%%%%%%%%jJ%%j%%%%J%%%%%j
$$ plain form
4345 61 61 61 61 61 61 61 61 61 61 61 61 61 61 61 61 61 61 61 61 61 61 61 61 61 61 61 60 61 61 61 61 60 60 61 61 61 61 61 61 61 61 61 61 61 61 61 61 60 60 61 61 60 60 61 61 61 61 61 61 61 61 60 60 60 60 60 60 60 60 61
4338 61 61 60 60 60 60 60 60 60 60 60 60 60 61 60 60 60 60 60 60 60 60 60 60 60 61 61 61 61 61 61 61 61 61 61 61 61 61 61 61 61 61 61 61 61 61 61 61 61 61 61 61 61 61 61 61 61 61 61 61 61 61 60 60 60 60 61 61 61 61 61
4330 61 61 61 61 61 61 61 61 61 60 60 61 61 60 60 61 61 61 61 61 61 61 61 61 61 61 61 61 62 62 61 61 62 62 62 61 61 61 61 61 61 61 61 61 61 61 61 61 61 61 61 61 61 61 61 61 61 61 61 61 61 61 61 61 61 61 61 61 61 61 61
4323 61 61 61 61 60 60 60 60 60 60 60 60 60 60 60 60 60 60 60 60 61 61 60 60 60 60 60 60 60 60 61 61 61 60 60 61 61 60 60 60 60 60 60 60 60 60 60 60 60 60 60 60 60 60 60 60 60 60 60 60 60 60 60 59 60 60 59 59 60 60 60
4316 60 60 60 60 59 59 59 59 59 60 60 60 59 60 60 60 60 60 60 60 60 60 60 60 60 60 60 60 60 60 60 60 60 60 60 60 61 61 61 60 60 60 60 60 60 60 60 60 60 60 60 60 60 60 60 60 60 60 60 60 60 60 61 61 61 61 60 60 60 60 60
4308 60 60 60 60 60 60 60 60 60 60 60 60 60 60 60 60 60 60 60 60 60 60 60 61 60 60 61 61 61 61 61 61 61 61 61 61 61 61 61 61 61 62 62 61 61 61 61 61 61 62 62 62 62 62 62 62 62 61 62 62 62 62 62 61 61 61 61 61 61 61 61
4301 61 61 61 61 61 61 61 61 61 61 61 61 61 61 61 61 61 61 61 61 61 61 62 62 62 61 61 61 61 61 61 61 61 61 61 61 61 61 61 61 61 61 61 61 61 61 61 61 61 61 61 61 61 61 61 61 61 61 61 61 61 61 61 61 61 61 61 61 60 60 60
4293 60 61 61 61 61 61 61 61 61 61 60 60 60 60 60 60 60 60 60 60 60 60 60 60 60 60 61 61 61 61 61 61 61 61 61 61 61 61 61 61 61 61 61 60 60 60 61 61 61 61 61 61 61 61 61 60 61 61 61 60 60 60 60 60 61 61 61 61 61 61 60
4286F0%%%%%%%%%%%%%%%%Jj%%%%%%%%%%Jj%%%%%%J%%%%%%%%%jJ%%%j%%%J%%j%J%%%%j%%%J
4279F1%%%j%%%%J%%%%%%j%%%%J%%%%j%%%%%%J%%%%%%%%%%%%%%%%%%%%%%%Jj%%%%%%%%%%%%
4271F1%%%%%%%%%%%%%%%%%%%%%%%%%%%%%%%%j%%%%%%%%%%%%%%%%j%%%J%%%J%%%%%%j%%%J%
4264F1%%%j%%%%%%%%J%%%%j%%%%%%%%%J%%jJ%%%%j%%J%%%%%%j%%%%%%%%%%J%%%%%%%%%%%%
4256F1%%%%%%%%%%%%%%%%J%%jJ%%%j%%%%%%%%%%%%%%%%%%%J%%%%%%%%j%%%J%%%%%%%%%%j%
4249F1%%%%%%%%%%%%%%%%%%%%%%%%%%%%%%%%%%%%%%%%%%%%%%%%%%%%%%%j%%%%%%%J%%%j%%
4241F0%J%%%%%%%%%%%%%j%%%J%%%j%J%%%%%j%%%%%%%%J%%%j%%%%%%%%%%%%%%%%%%%%%%%%%
4234F0%%%%%%%%%%%J%%%%%%%%%%%%%%%%%%%%%j%%%%%%%%%%J%%%%%%jJ%%%%%%%%%%j%%%J%%
$$ plain form
4286 60 60 60 60 60 60 60 60 60 60 60 60 60 60 60 60 60 61 60 60 60 60 60 60 60 60 60 60 60 61 60 60 60 60 60 60 60 61 61 61 61 61 61 61 61 61 61 60 61 61 61 61 60 60 60 60 61 61 61 60 60 61 61 61 61 61 60 60 60 60 61
4279 61 61 61 61 60 60 60 60 60 61 61 61 61 61 61 61 60 60 60 60 60 61 61 61 61 61 60 60 60 60 60 60 60 61 61 61 61 61 61 61 61 61 61 61 61 61 61 61 61 61 61 61 61 61 61 61 61 62 61 61 61 61 61 61 61 61 61 61 61 61 61
4271 61 61 61 61 61 61 61 61 61 61 61 61 61 61 61 61 61 61 61 61 61 61 61 61 61 61 61 61 61 61 61 61 61 60 60 60 60 60 60 60 60 60 60 60 60 60 60 60 60 60 59 59 59 59 60 60 60 60 61 61 61 61 61 61 61 60 60 60 60 61 61
4264 61 61 61 61 60 60 60 60 60 60 60 60 60 61 61 61 61 61 60 60 60 60 60 60 60 60 60 60 61 61 61 60 61 61 61 61 61 60 60 60 61 61 61 61 61 61 61 60 60 60 60 60 60 60 60 60 60 60 61 61 61 61 61 61 61 61 61 61 61 61 61
4256 61 61 61 61 61 61 61 61 61 61 61 61 61 61 61 61 61 62 62 62 61 62 62 62 62 61 61 61 61 61 61 61 61 61 61 61 61 61 61 61 61 61 61 61 61 62 62 62 62 62 62 62 62 62 61 61 61 61 62 62 62 62 62 62 62 62 62 62 62 61 61
4249 61 61 61 61 61 61 61 61 61 61 61 61 61 61 61 61 61 61 61 61 61 61 61 61 61 61 61 61 61 61 61 61 61 61 61 61 61 61 61 61 61 61 61 61 61 61 61 61 61 61 61 61 61 61 61 61 60 60 60 60 60 60 60 60 61 61 61 61 60 60 60
4241 60 60 61 61 61 61 61 61 61 61 61 61 61 61 61 61 60 60 60 60 61 61 61 61 60 60 61 61 61 61 61 61 60 60 60 60 60 60 60 60 60 61 61 61 61 60 60 60 60 60 60 60 60 60 60 60 60 60 60 60 60 60 60 60 60 60 60 60 60 60 60
4234 60 60 60 60 60 60 60 60 60 60 60 60 61 61 61 61 61 61 61 61 61 61 61 61 61 61 61 61 61 61 61 61 61 61 60 60 60 60 60 60 60 60 60 60 60 61 61 61 61 61 61 61 60 61 61 61 61 61 61 61 61 61 61 61 60 60 60 60 61 61 61
4227F1%%%%%%%%%%%%%%%%%%%%%%%%%%j%J%%%%J%%%%j%%%%jJ%%%%%%%%J%%j%%%%%%%%J%%%%
4219F2%%%%%%%%j%%%%%%%%J%%%%%%%%%j%%%%%%%%%%%%%%%%%%%%%%Jj%%%%%%%%%%%%%%%%%J
4212F2%%%j%%%%%%%%%%%%J%%%j%%%%%%%Jj%%%J%%j%%%%%%%%%Jj%%%%%%%%J%j%%%%%J%j%%%
4204F1%%J%%%%j%%%%%%%%%J%%%%%%j%%%%%Jj%%%jJ%%%%%%%%%%%%%%%%%jJ%%%%%%%%%%%%%%
4197F1%%%%%%%%%%%%%%%%%%%%%%%%%%%%%%%%%%%%%%%%%%%%%%%%%%%%j%%J%%%%%%%%%j%%Jj
4189F0%%%J%%%%%%%%%j%J%%%%%%%%%%%%%%jJ%%%%%%%%%j%%J%%%%%j%J%%%%%%%%%%%%%%%%%
4182F1%%%%%%Jj%%%%%%%%%%%%%J%%J%%%%%%%%J%%J%%%J%J%%%%%%%%%%%Jj%j%%%%%%%%%%%%
4175F6%%%%%J%%j%%%%%j%%%jJ%%j%j%%%%%%j%%%%j%%%%%%%%%%%%%%%%%%%%%%%%J%%%%j%%%
$$ plain form
4227 61 61 61 61 61 61 61 61 61 61 61 61 61 61 61 61 61 61 61 61 61 61 61 61 61 61 61 60 60 61 61 61 61 61 62 62 62 62 62 61 61 61 61 61 60 61 61 61 61 61 61 61 61 61 62 62 62 61 61 61 61 61 61 61 61 61 62 62 62 62 62
4219 62 62 62 62 62 62 62 62 62 61 61 61 61 61 61 61 61 61 62 62 62 62 62 62 62 62 62 62 61 61 61 61 61 61 61 61 61 61 61 61 61 61 61 61 61 61 61 61 61 61 61 62 61 61 61 61 61 61 61 61 61 61 61 61 61 61 61 61 61 61 62
4212 62 62 62 62 61 61 61 61 61 61 61 61 61 61 61 61 61 62 62 62 62 61 61 61 61 61 61 61 61 62 61 61 61 61 62 62 62 61 61 61 61 61 61 61 61 61 61 62 61 61 61 61 61 61 61 61 61 62 62 61 61 61 61 61 61 62 62 61 61 61 61
4204 61 61 61 62 62 62 62 62 61 61 61 61 61 61 61 61 61 61 62 62 62 62 62 62 62 61 61 61 61 61 61 62 61 61 61 61 60 61 61 61 61 61 61 61 61 61 61 61 61 61 61 61 61 61 61 60 61 61 61 61 61 61 61 61 61 61 61 61 61 61 61
4197 61 61 61 61 61 61 61 61 61 61 61 61 61 61 61 61 61 61 61 61 61 61 61 61 61 61 61 61 61 61 61 61 61 61 61 61 61 61 61 61 61 61 61 61 61 61 61 61 61 61 61 61 61 60 60 60 61 61 61 61 61 61 61 61 61 61 60 60 60 61 60
4189 60 60 60 60 61 61 61 61 61 61 61 61 61 61 60 60 61 61 61 61 61 61 61 61 61 61 61 61 61 61 61 60 61 61 61 61 61 61 61 61 61 61 60 60 60 61 61 61 61 61 61 60 60 61 61 61 61 61 61 61 61 61 61 61 61 61 61 61 61 61 61
4182 61 61 61 61 61 61 61 62 61 61 61 61 61 61 61 61 61 61 61 61 61 61 62 62 62 63 63 63 63 63 63 63 63 63 64 64 64 65 65 65 65 66 66 67 67 67 67 67 67 67 67 67 67 67 67 68 67 67 66 66 66 66 66 66 66 66 66 66 66 66 66
4175 66 66 66 66 66 66 67 67 67 66 66 66 66 66 66 65 65 65 65 64 65 65 65 64 64 63 63 63 63 63 63 63 62 62 62 62 62 61 61 61 61 61 61 61 61 61 61 61 61 61 61 61 61 61 61 61 61 61 61 61 61 61 62 62 62 62 62 61 61 61 61
4167F1%%%%%%%%%%%%%%%%%%%%%%%%%%%%%Jj%%%%%%%%%%%%%%%%%%%%jJ%%%%%%%%%jJ%%%%%%
4160F1%%%%%%%%%%J%j%%%%%%%%%%%%%Jj%%%%%%%%%%%%%%%%%%%%%%%J%%%%%j%%%%jJ%%%%%J
4152F2%%%%j%%%%J%%%j%%%%%Jj%%%%%%%%%%%%%%Jj%%%%%%%%%%%%%%%%%%%%%%%%%%%%%%%%%
4145F1%%%%%%%%%%%%j%J%%%%%%%%%%%j%%%%J%%%%%%%%j%%%%%J%%%%j%%J%%%j%%%%%%%%%%%
4138F0%%%%%%%%J%%%%%j%%%%%JjJ%%j%%%%%%%%%%%%%%%%%%%%%%%%Jj%%%%%%%%%Jj%%%%%%%
4130F0%%%%%%%%%%%%%%%%%%%%%%%%J%%%j%%%%J%%%%%%%%%%%jJ%%%%%%%%%%%%%%%%j%%%%Jj
4123F0%%%%%%%%%%%J%%%%%%%%%%%%%%%%%%%%%%jJj%J%j%%%J%%%%%%%%%%%%%%%%%j%J%%%%%
4115F1%%%%%%%%%%j%J%%%%%%%%%j%%J%%%%%Jj%%%%%%%%%%%j%%%%%%%%%%J%%%%%%%%%%%%%%
$$ plain form
4167 61 61 61 61 61 61 61 61 61 61 61 61 61 61 61 61 61 61 61 61 61 61 61 61 61 61 61 61 61 61 62 61 61 61 61 61 61 61 61 61 61 61 61 61 61 61 61 61 61 61 61 61 60 61 61 61 61 61 61 61 61 61 61 60 61 61 61 61 61 61 61
4160 61 61 61 61 61 61 61 61 61 61 61 62 62 61 61 61 61 61 61 61 61 61 61 61 61 61 61 62 61 61 61 61 61 61 61 61 61 61 61 61 61 61 61 61 61 61 61 61 61 61 61 61 62 62 62 62 62 62 61 61 61 61 61 60 61 61 61 61 61 61 62
4152 62 62 62 62 62 61 61 61 61 61 62 62 62 62 61 61 61 61 61 61 62 61 61 61 61 61 61 61 61 61 61 61 61 61 61 61 62 61 61 61 61 61 61 61 61 61 61 61 61 61 61 61 61 61 61 61 61 61 61 61 61 61 61 61 61 61 61 61 61 61 61
4145 61 61 61 61 61 61 61 61 61 61 61 61 61 60 60 61 61 61 61 61 61 61 61 61 61 61 61 60 60 60 60 60 61 61 61 61 61 61 61 61 61 60 60 60 60 60 60 61 61 61 61 61 60 60 60 61 61 61 61 60 60 60 60 60 60 60 60 60 60 60 60
4138 60 60 60 60 60 60 60 60 60 61 61 61 61 61 61 60 60 60 60 60 60 61 60 61 61 61 60 60 60 60 60 60 60 60 60 60 60 60 60 60 60 60 60 60 60 60 60 60 60 60 60 61 60 60 60 60 60 60 60 60 60 60 61 60 60 60 60 60 60 60 60
4130 60 60 60 60 60 60 60 60 60 60 60 60 60 60 60 60 60 60 60 60 60 60 60 60 60 61 61 61 61 60 60 60 60 60 61 61 61 61 61 61 61 61 61 61 61 61 60 61 61 61 61 61 61 61 61 61 61 61 61 61 61 61 61 61 60 60 60 60 60 61 60
4123 60 60 60 60 60 60 60 60 60 60 60 60 61 61 61 61 61 61 61 61 61 61 61 61 61 61 61 61 61 61 61 61 61 61 61 60 61 60 60 61 61 60 60 60 60 61 61 61 61 61 61 61 61 61 61 61 61 61 61 61 61 61 61 60 60 61 61 61 61 61 61
4115 61 61 61 61 61 61 61 61 61 61 61 60 60 61 61 61 61 61 61 61 61 61 61 60 60 60 61 61 61 61 61 61 62 61 61 61 61 61 61 61 61 61 61 61 61 60 60 60 60 60 60 60 60 60 60 60 61 61 61 61 61 61 61 61 61 61 61 61 61 61 61
4108F1%%%%j%%J%%%%Jj%%%%%%%%%%%%%%%%%%%%%jJ%%%%%%%%%%%%%%%%%%%%%%%j%J%%%%%%%
4100F1%%%%%%%%%%%%%%%%%j%J%%%%%%%%%%%%%%%jJ%%%%%%%%%%%j%%J%j%%%%%J%%%%%%%j%%
4093F0%%J%%%%%%j%J%%%%%%%%%%%%%%%%%%J%j%%%%%%%%%%%%%%%%%%%jJ%%%%%%%j%%J%%j%%
4086F0%%%J%%%%j%%%J%%%%%%%%%%%j%%%J%j%%%%%%%J%%%%%%%%%%%%%%%%%%%%%%%%%j%J%%%
4078F1%%j%J%%%%%%%%%%%%%%%%%%%j%%%%%%J%%j%%%%%%J%%%%j%J%%%J%%j%%%%%%%%jJ%%j%
4071F0%%%%%%%%%%%%%%J%%%%%%%%%%%jJ%%%%%j%%%%%%%%%%J%%%%j%J%%%%j%%%%%%%%%%%%%
4063F0%%J%%%%%%%%%%%%%%%%%%%%%%%%%%%%%%%%%%j%%%J%%%%%%%%%%%%%%%%%%%%%%%%%%jJ
4056F1%%%%%%%%%%%%Jj%%%%%%%%%%%%%%%%jJ%%%%%%%%j%%%%%%%%%J%%%%%%%%%%%%%%%%%%%
$$ plain form
4108 61 61 61 61 61 60 60 60 61 61 61 61 61 62 61 61 61 61 61 61 61 61 61 61 61 61 61 61 61 61 61 61 61 61 61 61 60 61 61 61 61 61 61 61 61 61 61 61 61 61 61 61 61 61 61 61 61 61 61 61 61 60 60 61 61 61 61 61 61 61 61
4100 61 61 61 61 61 61 61 61 61 61 61 61 61 61 61 61 61 61 60 60 61 61 61 61 61 61 61 61 61 61 61 61 61 61 61 61 60 61 61 61 61 61 61 61 61 61 61 61 61 60 60 60 61 61 60 60 60 60 60 60 61 61 61 61 61 61 61 61 60 60 60
4093 60 60 60 61 61 61 61 61 61 61 60 60 61 61 61 61 61 61 61 61 61 61 61 61 61 61 61 61 61 61 61 62 62 61 61 61 61 61 61 61 61 61 61 61 61 61 61 61 61 61 61 61 61 60 61 61 61 61 61 61 61 61 60 60 60 61 61 61 60 60 60
4086 60 60 60 60 61 61 61 61 61 60 60 60 60 61 61 61 61 61 61 61 61 61 61 61 61 60 60 60 60 61 61 60 60 60 60 60 60 60 60 61 61 61 61 61 61 61 61 61 61 61 61 61 61 61 61 61 61 61 61 61 61 61 61 61 61 60 60 61 61 61 61
4078 61 61 61 60 60 61 61 61 61 61 61 61 61 61 61 61 61 61 61 61 61 61 61 61 61 60 60 60 60 60 60 60 61 61 61 60 60 60 60 60 60 60 61 61 61 61 61 60 60 61 61 61 61 62 62 62 61 61 61 61 61 61 61 61 61 60 61 61 61 60 60
4071 60 60 60 60 60 60 60 60 60 60 60 60 60 60 60 61 61 61 61 61 61 61 61 61 61 61 61 60 61 61 61 61 61 61 60 60 60 60 60 60 60 60 60 60 60 61 61 61 61 61 60 60 61 61 61 61 61 60 60 60 60 60 60 60 60 60 60 60 60 60 60
4063 60 60 60 61 61 61 61 61 61 61 61 61 61 61 61 61 61 61 61 61 61 61 61 61 61 61 61 61 61 61 61 61 61 61 61 61 61 61 60 60 60 60 61 61 61 61 61 61 61 61 61 61 61 61 61 61 61 61 61 61 61 61 61 61 61 61 61 61 61 60 61
4056 61 61 61 61 61 61 61 61 61 61 61 61 61 62 61 61 61 61 61 61 61 61 61 61 61 61 61 61 61 61 61 60 61 61 61 61 61 61 61 61 61 60 60 60 60 60 60 60 60 60 60 61 61 61 61 61 61 61 61 61 61 61 61 61 61 61 61 61 61 61 61
4049F1%%%%%%%j%J%%%%%%%j%%J%%%%%%%%%%%%jJj%%Jj%%%%%%%J%%%%%%%%%%%j%%J%%%%%%%
4041F1%%%%%%%%%%jJ%%%%%j%%%J%%%j%%%J%%%%j%%%J%j%%%%%%%J%%%%%%%%j%%J%jJ%%j%%%
4034F0%%%%%%J%%%%%j%%%%%%%%%%%%%%%%%%%%%J%%%%%%%%j%%%%%%%%%%%%%%Jj%%%%%J%%j%
4026F0Jj%%%%%%%%J%j%%%%%Jj%%%%%%%%%%%Jj%%%%%%%%%%%%%J%%%j%%%%%%%%%%%%%%%%%%%
4019F0%%%%%%%%%%%%%%%%%%%%%%%%%%%%%%%%Jj%%%%%%Jj%%%%%%%%%%%%%%%%%%%%%%%%%%%%
4011F0%%%%%%%%%%%%%%%%%%%%%%%%%j%%%%%%%J%%%%%%%%Jj%%%%%%%%%%%%%%%%%jJ%%%%%%%
4004F0%%%%%%%%%%%%%%j%%%%%%%J%%%j%%%J%%%j%Jj%%J%%%%%%%%%%j%%%Jj%%%%%%%%J%%%%
3997F0%%j%J%%%%%%%%%%%j%%%J%%%j%%%%%%%%%%%%J%%%%%%%j%%J%%%%%%%%j%%%Jj%%J%%%%
$$ plain form
4049 61 61 61 61 61 61 61 61 60 60 61 61 61 61 61 61 61 61 60 60 60 61 61 61 61 61 61 61 61 61 61 61 61 61 60 61 60 60 60 61 60 60 60 60 60 60 60 60 61 61 61 61 61 61 61 61 61 61 61 61 60 60 60 61 61 61 61 61 61 61 61
4041 61 61 61 61 61 61 61 61 61 61 61 60 61 61 61 61 61 61 60 60 60 60 61 61 61 61 60 60 60 60 61 61 61 61 61 60 60 60 60 61 61 60 60 60 60 60 60 60 60 61 61 61 61 61 61 61 61 61 60 60 60 61 61 60 61 61 61 60 60 60 60
4034 60 60 60 60 60 60 60 61 61 61 61 61 61 60 60 60 60 60 60 60 60 60 60 60 60 60 60 60 60 60 60 60 60 60 60 61 61 61 61 61 61 61 61 61 60 60 60 60 60 60 60 60 60 60 60 60 60 60 60 61 60 60 60 60 60 60 61 61 61 60 60
4026 60 61 60 60 60 60 60 60 60 60 60 61 61 60 60 60 60 60 60 61 60 60 60 60 60 60 60 60 60 60 60 60 61 60 60 60 60 60 60 60 60 60 60 60 60 60 60 61 61 61 61 60 60 60 60 60 60 60 60 60 60 60 60 60 60 60 60 60 60 60 60
4019 60 60 60 60 60 60 60 60 60 60 60 60 60 60 60 60 60 60 60 60 60 60 60 60 60 60 60 60 60 60 60 60 60 61 60 60 60 60 60 60 60 61 60 60 60 60 60 60 60 60 60 60 60 60 60 60 60 60 60 60 60 60 60 60 60 60 60 60 60 60 60
4011 60 60 60 60 60 60 60 60 60 60 60 60 60 60 60 60 60 60 60 60 60 60 60 60 60 60 59 59 59 59 59 59 59 59 60 60 60 60 60 60 60 60 60 61 60 60 60 60 60 60 60 60 60 60 60 60 60 60 60 60 60 60 59 60 60 60 60 60 60 60 60
4004 60 60 60 60 60 60 60 60 60 60 60 60 60 60 60 59 59 59 59 59 59 59 59 60 60 60 60 59 59 59 59 60 60 60 60 59 59 60 59 59 59 60 60 60 60 60 60 60 60 60 60 60 59 59 59 59 60 59 59 59 59 59 59 59 59 59 60 60 60 60 60
3997 60 60 60 59 59 60 60 60 60 60 60 60 60 60 60 60 60 59 59 59 59 60 60 60 60 59 59 59 59 59 59 59 59 59 59 59 59 59 60 60 60 60 60 60 60 60 59 59 59 60 60 60 60 60 60 60 60 60 59 59 59 59 60 59 59 59 60 60 60 60 60
3989F0%%%j%%J%%%%%%%%%%%%%%%jJ%%%%%%%%%%%%%%j%J%%jJ%%%%%%%%%%%%%%%%%%%%%%%J%
3982F1%%%%%%j%%%%%%%%%%%%%%%%%%%j%%%J%%%%%%%%%%%%%%%%%%%%%%%%%%%%%%%%%Jj%%%%
3974F0%%%%%%%%%%%%%%%%%%%%%J%%j%%%%%%%%%%%J%%%j%%%%%%j%J%%%%J%j%%%%%%%%%%%%%
3967F0%%%%%%%%%%%%%%%%%%%%%%%%%%j%J%%%%%%%%%%%%%%%%%j%J%%%%%%%%%%%%%%%%%%%%%
3960F0%%%%%%%%%%%%%%%%%%%%J%%%%%j%%%%%%%%%%%%%%%j%J%%%%%%%%%%%%%%%%%%%%%%%%%
3952F0%%%%%%%%%%%%%%%%%%%%%%%%%%%%%%%jJ%%%%%%%j%%%%J%%%%%%%%%%%%%%jJ%%%%%j%%
3945E9%%J%%%%%%%%%%%%%%%%%%%%%%%%%%%%%%%j%%%%J%%%%%%%%%%%%%%%%%%%%%%%%j%J%%%
3937F0%%%%%%%%%%%%%%%%%j%%%%%%%J%%%%%j%J%%%%%%%%%%%%%%%%%%%j%%%%%%%%%%J%%%%%
$$ plain form
3989 60 60 60 60 59 59 59 60 60 60 60 60 60 60 60 60 60 60 60 60 60 60 60 59 60 60 60 60 60 60 60 60 60 60 60 60 60 60 60 59 59 60 60 60 59 60 60 60 60 60 60 60 60 60 60 60 60 60 60 60 60 60 60 60 60 60 60 60 60 61 61
3982 61 61 61 61 61 61 61 60 60 60 60 60 60 60 60 60 60 60 60 60 60 60 60 60 60 60 60 59 59 59 59 60 60 60 60 60 60 60 60 60 60 60 60 60 60 60 60 60 60 60 60 60 60 60 60 60 60 60 60 60 60 60 60 60 60 61 60 60 60 60 60
3974 60 60 60 60 60 60 60 60 60 60 60 60 60 60 60 60 60 60 60 60 60 60 61 61 61 60 60 60 60 60 60 60 60 60 60 60 60 61 61 61 61 60 60 60 60 60 60 60 59 59 60 60 60 60 60 61 61 60 60 60 60 60 60 60 60 60 60 60 60 60 60
3967 60 60 60 60 60 60 60 60 60 60 60 60 60 60 60 60 60 60 60 60 60 60 60 60 60 60 60 59 59 60 60 60 60 60 60 60 60 60 60 60 60 60 60 60 60 60 60 59 59 60 60 60 60 60 60 60 60 60 60 60 60 60 60 60 60 60 60 60 60 60 60
3960 60 60 60 60 60 60 60 60 60 60 60 60 60 60 60 60 60 60 60 60 60 61 61 61 61 61 61 60 60 60 60 60 60 60 60 60 60 60 60 60 60 60 60 59 59 60 60 60 60 60 60 60 60 60 60 60 60 60 60 60 60 60 60 60 60 60 60 60 60 60 60
3952 60 60 60 60 60 60 60 60 60 60 60 60 60 60 60 60 60 60 60 60 60 60 60 60 60 60 60 60 60 60 60 60 59 60 60 60 60 60 60 60 60 59 59 59 59 59 60 60 60 60 60 60 60 60 60 60 60 60 60 60 60 59 60 60 60 60 60 60 59 59 59
3945 59 59 59 60 60 60 60 60 60 60 60 60 60 60 60 60 60 60 60 60 60 60 60 60 60 60 60 60 60 60 60 60 60 60 60 59 59 59 59 59 60 60 60 60 60 60 60 60 60 60 60 60 60 60 60 60 60 60 60 60 60 60 60 60 60 59 59 60 60 60 60
3937 60 60 60 60 60 60 60 60 60 60 60 60 60 60 60 60 60 60 59 59 59 59 59 59 59 59 60 60 60 60 60 60 59 59 60 60 60 60 60 60 60 60 60 60 60 60 60 60 60 60 60 60 60 60 59 59 59 59 59 59 59 59 59 59 59 60 60 60 60 60 60
3930F0%%%%j%%%%%%%%%%%%%%%%%%%%%%%%%%%%%%%%%%%%%%%%%%%J%%%%%%%%j%%%%%%%%%%%%
3922E9%%%%%%%%%J%%j%%J%%%%%%%j%%%%%J%%%%%%%%j%%J%%%%%j%%%%%%%%%%%%J%%%%%%%%%
3915F0%jJ%%%%j%%%%J%%%%%%%jJ%%%%%%%%%%%%%%%%%%%%%%%%%%%%%%%%%%%%%%%%%%%%%%%%
3908F0%%%%%%%%j%J%%%%%%%%%%%%%%%%%%%%%jJ%%%%%%%%Jj%%%%%%%%%%%%%%%%%%%%%%%%%%
3900F0%%%%%%%%%%%%%%%%%%J%%%%j%%%%%%%%J%%j%%%%%%%%%%%%%%%%%%%%%%%%%%%%j%%%J%
3893F0%%%%%%%%%%j%J%%%%%%%%%jJ%%%%%%%%%%%%%%%%%%%%%%%%%%%%%%%%%%%%%%%%%%%%%%
3885F0%%%%%%%%%%%%%%%J%j%%%%%%%%%%%%%%%%J%%%%%%%%%%j%%%%Jj%%%%%%%%%%%J%j%%Jj
3878F0%%%%%%%%j%%J%%%%%%Jj%%%%%%%%j%%%%%J%%%%%%%%%%%%%%j%%%J%%%%%%%%%%%%%%%%
$$ plain form
3930 60 60 60 60 60 59 59 59 59 59 59 59 59 59 59 59 59 59 59 59 59 59 59 59 59 59 59 59 59 59 59 59 59 59 59 59 59 59 59 59 59 59 59 59 59 59 59 59 59 60 60 60 60 60 60 60 60 60 59 59 59 59 59 59 59 59 59 59 59 59 59
3922 59 59 59 59 59 59 59 59 59 59 60 60 60 59 59 59 60 60 60 60 60 60 60 60 59 59 59 59 59 59 60 60 60 60 60 60 60 60 60 59 59 59 60 60 60 60 60 60 59 59 59 59 59 59 59 59 59 59 59 59 59 60 60 60 60 60 60 60 60 60 60
3915 60 60 59 60 60 60 60 60 59 59 59 59 59 60 60 60 60 60 60 60 60 59 60 60 60 60 60 60 60 60 60 60 60 60 60 60 60 60 60 60 60 60 60 60 60 60 60 60 60 60 60 60 60 60 60 60 60 60 60 60 60 60 60 60 60 60 60 60 60 60 60
3908 60 60 60 60 60 60 60 60 60 59 59 60 60 60 60 60 60 60 60 60 60 60 60 60 60 60 60 60 60 60 60 60 60 59 60 60 60 60 60 60 60 60 60 61 60 60 60 60 60 60 60 60 60 60 60 60 60 60 60 60 60 60 60 60 60 60 60 60 60 60 60
3900 60 60 60 60 60 60 60 60 60 60 60 60 60 60 60 60 60 60 60 61 61 61 61 61 60 60 60 60 60 60 60 60 60 61 61 61 60 60 60 60 60 60 60 60 60 60 60 60 60 60 60 60 60 60 60 60 60 60 60 60 60 60 60 60 60 59 59 59 59 60 60
3893 60 60 60 60 60 60 60 60 60 60 60 59 59 60 60 60 60 60 60 60 60 60 60 59 60 60 60 60 60 60 60 60 60 60 60 60 60 60 60 60 60 60 60 60 60 60 60 60 60 60 60 60 60 60 60 60 60 60 60 60 60 60 60 60 60 60 60 60 60 60 60
3885 60 60 60 60 60 60 60 60 60 60 60 60 60 60 60 60 61 61 60 60 60 60 60 60 60 60 60 60 60 60 60 60 60 60 60 61 61 61 61 61 61 61 61 61 61 61 60 60 60 60 60 61 60 60 60 60 60 60 60 60 60 60 60 60 61 61 60 60 60 61 60
3878 60 60 60 60 60 60 60 60 60 59 59 59 60 60 60 60 60 60 60 61 60 60 60 60 60 60 60 60 60 59 59 59 59 59 59 60 60 60 60 60 60 60 60 60 60 60 60 60 60 60 59 59 59 59 60 60 60 60 60 60 60 60 60 60 60 60 60 60 60 60 60
3871F0%%%%%%Jj%%%%%%%%%%%%%%%%%%%%%%%%%%J%j%%J%j%%%%%%%%%%%%%%%%%%%%%%jJ%%%%
3863F0%%%J%j%%%%%%%%%%%%J%j%%%%%%%%%%%%%%%%%%%%%%%%%%j%J%%%j%%%%J%%%%%%%%%jJ
3856F0%%%%j%%J%%%%%%%%%%%%%%%%%%%%%%%j%J%%%%%%%%%j%%%%%%%J%%%%%%%%%%%%jJ%%%%
3848F0%%%%%%%%%%j%%%J%%%%%%j%%%%%%%%%%%J%%j%J%%j%J%%%%%%%%%%%%%%%%%%%%%%%%%%
3841F0%%%%%%j%J%%%%%%%%%%%%%%%%j%J%%%%j%%%%Jj%%J%%%%%%%%%%%%%%%%%%%%%%%%%%%%
3833F0%%%%%%%%%%%%%%%%%%%%%%%%%%%%%%%%%%%%jJ%%%%j%%%%%%%%%%%J%j%%%%%%J%%%%%%
3826F0jJ%%%%%%%%%%%%%%%jJ%%j%%%%%%J%%%%%%%%%%%%j%J%%%%%%%%%%%%%%%%%%%%%%%%%%
3819F0j%%%%%J%%%%%j%%%%%%J%%%%%%%%%%%%%%%%%%%%%%%%%%%%%%%%%%%j%J%%%%%j%%%%%%
$$ plain form
3871 60 60 60 60 60 60 60 61 60 60 60 60 60 60 60 60 60 60 60 60 60 60 60 60 60 60 60 60 60 60 60 60 60 60 60 61 61 60 60 60 61 61 60 60 60 60 60 60 60 60 60 60 60 60 60 60 60 60 60 60 60 60 60 60 60 59 60 60 60 60 60
3863 60 60 60 60 61 61 60 60 60 60 60 60 60 60 60 60 60 60 60 61 61 60 60 60 60 60 60 60 60 60 60 60 60 60 60 60 60 60 60 60 60 60 60 60 60 60 60 60 59 59 60 60 60 60 59 59 59 59 59 60 60 60 60 60 60 60 60 60 60 59 60
3856 60 60 60 60 60 59 59 59 60 60 60 60 60 60 60 60 60 60 60 60 60 60 60 60 60 60 60 60 60 60 60 60 59 59 60 60 60 60 60 60 60 60 60 60 59 59 59 59 59 59 59 59 60 60 60 60 60 60 60 60 60 60 60 60 60 59 60 60 60 60 60
3848 60 60 60 60 60 60 60 60 60 60 60 59 59 59 59 60 60 60 60 60 60 60 59 59 59 59 59 59 59 59 59 59 59 59 60 60 60 59 59 60 60 60 59 59 60 60 60 60 60 60 60 60 60 60 60 60 60 60 60 60 60 60 60 60 60 60 60 60 60 60 60
3841 60 60 60 60 60 60 60 59 59 60 60 60 60 60 60 60 60 60 60 60 60 60 60 60 60 60 59 59 60 60 60 60 60 59 59 59 59 59 60 59 59 59 60 60 60 60 60 60 60 60 60 60 60 60 60 60 60 60 60 60 60 60 60 60 60 60 60 60 60 60 60
3833 60 60 60 60 60 60 60 60 60 60 60 60 60 60 60 60 60 60 60 60 60 60 60 60 60 60 60 60 60 60 60 60 60 60 60 60 60 59 60 60 60 60 60 59 59 59 59 59 59 59 59 59 59 59 59 60 60 59 59 59 59 59 59 59 60 60 60 60 60 60 60
3826 60 59 60 60 60 60 60 60 60 60 60 60 60 60 60 60 60 60 59 60 60 60 59 59 59 59 59 59 59 60 60 60 60 60 60 60 60 60 60 60 60 60 59 59 60 60 60 60 60 60 60 60 60 60 60 60 60 60 60 60 60 60 60 60 60 60 60 60 60 60 60
3819 60 59 59 59 59 59 59 60 60 60 60 60 60 59 59 59 59 59 59 59 60 60 60 60 60 60 60 60 60 60 60 60 60 60 60 60 60 60 60 60 60 60 60 60 60 60 60 60 60 60 60 60 60 60 60 60 59 59 60 60 60 60 60 60 59 59 59 59 59 59 59
3811E9%%%%%%%%J%%%%%%%%%%%%%%%%%%%%%%%%%%%%%%%%%%%%jJ%j%%%%%%%%%%%%%%%J%j%%%
3804E9J%%%j%%%%%%%J%j%%%Jj%J%%j%%%J%%%%%%%%%%%%%%%%j%%%%%%%%J%%%j%%%%%J%%%%%
3796F0%j%%%%%%%%%%%%%J%j%%%%%%%%%%%%%%J%%%%%%%%%%%%%jJ%%%%%%%%%%%%%%%%%%%%%%
3789F0j%%%%%%J%j%%%%%%%%%J%%%%%%%%%%%%%%%%%%%%%%%%%%%%%%%%%%%%%%%%%%%%%j%%%%
3782E9J%%%%%%%%j%%%%%%%%J%%%%%jJ%%%%%%%%%%%%%%%%%j%%%%%%%%J%%jJ%%jJ%%%%%%j%J
3774F0%%%jJ%%%%%%%%%%%%%%%%%%%%j%J%%%%%%%%%%%%%j%%%%%%%%%%%%J%%%%%%%%%%%%%%%
3767F0%%%%%%%%%%%%%%%%j%Jj%J%%%%%%%%%%%%%%%%%%%%%%j%%J%%%%%%%%%%%%%%%jJ%%%%%
3759F0%%%%%%%%%%%%%%%%%%%%%j%J%%%%%%%%%%%%%%jJ%%%%%%%%%J%%j%%%%%%Jj%%%%%%%%%
$$ plain form
3811 59 59 59 59 59 59 59 59 59 60 60 60 60 60 60 60 60 60 60 60 60 60 60 60 60 60 60 60 60 60 60 60 60 60 60 60 60 60 60 60 60 60 60 60 60 60 59 60 60 59 59 59 59 59 59 59 59 59 59 59 59 59 59 59 59 60 60 59 59 59 59
3804 59 60 60 60 60 59 59 59 59 59 59 59 59 60 60 59 59 59 59 60 59 59 60 60 60 59 59 59 59 60 60 60 60 60 60 60 60 60 60 60 60 60 60 60 60 60 59 59 59 59 59 59 59 59 59 60 60 60 60 59 59 59 59 59 59 60 60 60 60 60 60
3796 60 60 59 59 59 59 59 59 59 59 59 59 59 59 59 59 60 60 59 59 59 59 59 59 59 59 59 59 59 59 59 59 59 60 60 60 60 60 60 60 60 60 60 60 60 60 60 59 60 60 60 60 60 60 60 60 60 60 60 60 60 60 60 60 60 60 60 60 60 60 60
3789 60 59 59 59 59 59 59 59 60 60 59 59 59 59 59 59 59 59 59 59 60 60 60 60 60 60 60 60 60 60 60 60 60 60 60 60 60 60 60 60 60 60 60 60 60 60 60 60 60 60 60 60 60 60 60 60 60 60 60 60 60 60 60 60 60 60 59 59 59 59 59
3782 59 60 60 60 60 60 60 60 60 60 59 59 59 59 59 59 59 59 59 60 60 60 60 60 60 59 60 60 60 60 60 60 60 60 60 60 60 60 60 60 60 60 60 60 59 59 59 59 59 59 59 59 59 60 60 60 59 60 60 60 59 60 60 60 60 60 60 60 59 59 60
3774 60 60 60 60 59 60 60 60 60 60 60 60 60 60 60 60 60 60 60 60 60 60 60 60 60 60 59 59 60 60 60 60 60 60 60 60 60 60 60 60 60 60 59 59 59 59 59 59 59 59 59 59 59 59 59 60 60 60 60 60 60 60 60 60 60 60 60 60 60 60 60
3767 60 60 60 60 60 60 60 60 60 60 60 60 60 60 60 60 60 59 59 60 59 59 60 60 60 60 60 60 60 60 60 60 60 60 60 60 60 60 60 60 60 60 60 60 60 59 59 59 60 60 60 60 60 60 60 60 60 60 60 60 60 60 60 60 59 60 60 60 60 60 60
3759 60 60 60 60 60 60 60 60 60 60 60 60 60 60 60 60 60 60 60 60 60 60 59 59 60 60 60 60 60 60 60 60 60 60 60 60 60 60 60 59 60 60 60 60 60 60 60 60 60 60 61 61 61 60 60 60 60 60 60 60 61 60 60 60 60 60 60 60 60 60 60
3752F0J%%j%%%%%%%%%%%%%%%%%%%%%%%%%%%%%%%%%%%%%%%%%%%%%%%%%%%%%%%%j%%%J%%%%%
3744F0%%%%%%%%%%jJ%%%%%%%%%%%%%%%%%%j%%%%%J%%%%%j%%%%%%%%%%%J%j%%%%%%%%%%%%%
3737E9%%%%%%%%%%%%%%%%%%%%%%%%%%%%%%%%%%%%%%%%%%%%%J%j%%%%%%%J%j%%%%%%%%%%%%
3730E9%%%%jJ%%%%%%%%%%%%%%Jj%%%%%%%%%%%%%J%%%%%%%%%%%%%%%%%%%j%%%%%%%%%%%%%%
3722E9%J%%%%%%%%%%%j%%%%%%%%%J%%%j%%%J%%%%%%%%%%%%%%%%%%%%%%%%%%%%%%%%%%%%%%
3715F0%%%%%%%%%%%%%%%%%%%%%%%%%%%%%%%%%%%%%%%%%Jj%%%J%%%j%%%%%%%%%%%%%%%%%%%
3707F0%%%%%%%%%%jJ%%%%J%%%%%%%%%j%%%%%%%%%%%%%%%j%%J%%%%%%%%%%%%%%%%%%%j%%J%
3700F0%%j%%%%J%%j%%J%%%%%%%%%%%%%%%%%%%%j%%%%%%%%%%%%%%%%%%%J%%j%%jJ%%%%%%%j
$$ plain form
3752 60 61 61 61 60 60 60 60 60 60 60 60 60 60 60 60 60 60 60 60 60 60 60 60 60 60 60 60 60 60 60 60 60 60 60 60 60 60 60 60 60 60 60 60 60 60 60 60 60 60 60 60 60 60 60 60 60 60 60 60 60 59 59 59 59 60 60 60 60 60 60
3744 60 60 60 60 60 60 60 60 60 60 60 59 60 60 60 60 60 60 60 60 60 60 60 60 60 60 60 60 60 60 60 59 59 59 59 59 59 60 60 60 60 60 60 59 59 59 59 59 59 59 59 59 59 59 59 60 60 59 59 59 59 59 59 59 59 59 59 59 59 59 59
3737 59 59 59 59 59 59 59 59 59 59 59 59 59 59 59 59 59 59 59 59 59 59 59 59 59 59 59 59 59 59 59 59 59 59 59 59 59 59 59 59 59 59 59 59 59 59 60 60 59 59 59 59 59 59 59 59 60 60 59 59 59 59 59 59 59 59 59 59 59 59 59
3730 59 59 59 59 59 58 59 59 59 59 59 59 59 59 59 59 59 59 59 59 59 60 59 59 59 59 59 59 59 59 59 59 59 59 59 59 60 60 60 60 60 60 60 60 60 60 60 60 60 60 60 60 60 60 60 60 59 59 59 59 59 59 59 59 59 59 59 59 59 59 59
3722 59 59 60 60 60 60 60 60 60 60 60 60 60 60 59 59 59 59 59 59 59 59 59 59 60 60 60 60 59 59 59 59 60 60 60 60 60 60 60 60 60 60 60 60 60 60 60 60 60 60 60 60 60 60 60 60 60 60 60 60 60 60 60 60 60 60 60 60 60 60 60
3715 60 60 60 60 60 60 60 60 60 60 60 60 60 60 60 60 60 60 60 60 60 60 60 60 60 60 60 60 60 60 60 60 60 60 60 60 60 60 60 60 60 60 61 60 60 60 60 61 61 61 61 60 60 60 60 60 60 60 60 60 60 60 60 60 60 60 60 60 60 60 60
3707 60 60 60 60 60 60 60 60 60 60 60 59 60 60 60 60 60 61 61 61 61 61 61 61 61 61 61 60 60 60 60 60 60 60 60 60 60 60 60 60 60 60 60 59 59 59 60 60 60 60 60 60 60 60 60 60 60 60 60 60 60 60 60 60 60 60 59 59 59 60 60
3700 60 60 60 59 59 59 59 59 60 60 60 59 59 59 60 60 60 60 60 60 60 60 60 60 60 60 60 60 60 60 60 60 60 60 60 59 59 59 59 59 59 59 59 59 59 59 59 59 59 59 59 59 59 59 59 60 60 60 59 59 59 58 59 59 59 59 59 59 59 59 58
3693E8%%%J%j%%%%%%%%%J%%%%%j%%%%%%%%%%%%%%%%%%%%%%%%%%%%%%%%%%%%j%%%%%%%%%%%
3685E7%%JjJ%%%j%%jJ%j%%%%%%%%J%%%%%%%%%J%%j%%%J%%%%%%%%%%%%%%%%%%%%%%%%%%%j%
3678E7%%%%Jj%%%%%%Jj%%%%J%%%%%%j%Jj%J%%%%%%%%%J%%%%%%%%%%%%%%%%%%%%%Jj%%%%%%
3670E9J%jJ%%%%j%%%J%%%%%%%%%%%%%%%%%%%%%%%%%%%%%%%%j%%%%J%%%%%%j%%%%%%%%J%j%
3663E9%%%%%%%%J%j%%%%%%%%%%%%%%j%%%J%%jJ%%%%%%%%%%%%%J%j%%%JjJ%%%j%%%%%%%%%%
3655E9%%%%%%%%%%%%%%%j%%%%%%jJ%%jJ%%%%%%%%%%%%%%%%%%%%%J%%%%%%%%%%%%%J%%%%%%
3648F0%%j%%%%%%%%%%%%%%%%%%%%%%%%%%%j%%%%%%%%%Jj%%%%%%%%J%%%%%j%Jj%%%%%%%J%%
3641E9%%%%%j%%%%%%%%%%%%%%%%%j%J%%%%%%%%%%%%%%%%%%%%%%%%%%j%%%%%%%%%%%%j%J%%
$$ plain form
3693 58 58 58 58 59 59 58 58 58 58 58 58 58 58 58 58 59 59 59 59 59 59 58 58 58 58 58 58 58 58 58 58 58 58 58 58 58 58 58 58 58 58 58 58 58 58 58 58 58 58 58 58 58 58 58 58 58 58 58 57 57 57 57 57 57 57 57 57 57 57 57
3685 57 57 57 58 57 58 58 58 58 57 57 57 56 57 57 56 56 56 56 56 56 56 56 56 57 57 57 57 57 57 57 57 57 57 58 58 58 57 57 57 57 58 58 58 58 58 58 58 58 58 58 58 58 58 58 58 58 58 58 58 58 58 58 58 58 58 58 58 58 57 57
3678 57 57 57 57 57 58 57 57 57 57 57 57 57 58 57 57 57 57 57 58 58 58 58 58 58 58 57 57 58 57 57 58 58 58 58 58 58 58 58 58 58 59 59 59 59 59 59 59 59 59 59 59 59 59 59 59 59 59 59 59 59 59 59 60 59 59 59 59 59 59 59
3670 59 60 60 59 60 60 60 60 60 59 59 59 59 60 60 60 60 60 60 60 60 60 60 60 60 60 60 60 60 60 60 60 60 60 60 60 60 60 60 60 60 60 60 60 60 60 59 59 59 59 59 60 60 60 60 60 60 60 59 59 59 59 59 59 59 59 59 60 60 59 59
3663 59 59 59 59 59 59 59 59 59 60 60 59 59 59 59 59 59 59 59 59 59 59 59 59 59 59 58 58 58 58 59 59 59 58 59 59 59 59 59 59 59 59 59 59 59 59 59 59 60 60 59 59 59 59 60 59 60 60 60 60 59 59 59 59 59 59 59 59 59 59 59
3655 59 59 59 59 59 59 59 59 59 59 59 59 59 59 59 59 58 58 58 58 58 58 58 57 58 58 58 57 58 58 58 58 58 58 58 58 58 58 58 58 58 58 58 58 58 58 58 58 58 58 59 59 59 59 59 59 59 59 59 59 59 59 59 59 60 60 60 60 60 60 60
3648 60 60 60 59 59 59 59 59 59 59 59 59 59 59 59 59 59 59 59 59 59 59 59 59 59 59 59 59 59 59 59 58 58 58 58 58 58 58 58 58 58 59 58 58 58 58 58 58 58 58 58 59 59 59 59 59 59 58 58 59 58 58 58 58 58 58 58 58 59 59 59
3641 59 59 59 59 59 59 58 58 58 58 58 58 58 58 58 58 58 58 58 58 58 58 58 58 57 57 58 58 58 58 58 58 58 58 58 58 58 58 58 58 58 58 58 58 58 58 58 58 58 58 58 58 58 57 57 57 57 57 57 57 57 57 57 57 57 57 56 56 57 57 57
3633E7%%%%%j%%%%J%%%%%%%%%%%%%%Jj%%%%%%%%%%%%%%%J%%%%%%%%%%%%%j%%%%%%%%%%%%J
3626E8%%j%%%%%%%%J%%%%%%%%%%%J%%%%%%%%%%%%J%%%j%%%%J%%j%%%%%%%%%%%%%%%%%%%%J
3618F0j%%%J%%%%%%%%%%%%%%%%%%%%%%%%%%%%%%j%%J%%%%%jJ%%%j%%j%J%%%%%%%%%%j%%%%
3611E8%%%%J%%j%%%%%%%%%%%%%%%%%%%%%%%%%%j%%J%%%%%j%%%%%%%%%%%%%%%%%%%%%%%%%%
3604E7%%%%%%%%%%%J%%%%%%%%%%%%%%J%%%%%%%%j%%%%%%%%J%%%%%%%%%%%%%%%%%jJ%%%%j%
3596E8%%%%%%%%%%%J%%%%%%%%%%%%%%%%%%%%%J%%%%%%%%%%j%%%%%%%%%%%%%%%%%%%%%%%%%
3589E9%%%%%%%%%%%%%%%%%%%%%%%%%j%%%%%%%%%%Jj%%%J%%j%%%%%%%%%%%%%%%%%%%%%%%%J
3581E9%%%%%%j%%%%%%%%%%%%%%%%%%%%%%%%%%%J%%%%%%%jJ%%%%%%%%%%%%%%%%%%%%J%j%%%
$$ plain form
3633 57 57 57 57 57 57 56 56 56 56 56 57 57 57 57 57 57 57 57 57 57 57 57 57 57 57 58 57 57 57 57 57 57 57 57 57 57 57 57 57 57 57 57 58 58 58 58 58 58 58 58 58 58 58 58 58 58 57 57 57 57 57 57 57 57 57 57 57 57 57 58
3626 58 58 58 57 57 57 57 57 57 57 57 57 58 58 58 58 58 58 58 58 58 58 58 58 59 59 59 59 59 59 59 59 59 59 59 59 59 60 60 60 60 59 59 59 59 59 60 60 60 59 59 59 59 59 59 59 59 59 59 59 59 59 59 59 59 59 59 59 59 59 60
3618 60 59 59 59 59 60 60 60 60 60 60 60 60 60 60 60 60 60 60 60 60 60 60 60 60 60 60 60 60 60 60 60 60 60 60 60 59 59 59 60 60 60 60 60 60 59 60 60 60 60 59 59 59 58 58 59 59 59 59 59 59 59 59 59 59 59 58 58 58 58 58
3611 58 58 58 58 58 59 59 59 58 58 58 58 58 58 58 58 58 58 58 58 58 58 58 58 58 58 58 58 58 58 58 58 58 58 58 57 57 57 58 58 58 58 58 58 57 57 57 57 57 57 57 57 57 57 57 57 57 57 57 57 57 57 57 57 57 57 57 57 57 57 57
3604 57 57 57 57 57 57 57 57 57 57 57 57 58 58 58 58 58 58 58 58 58 58 58 58 58 58 58 59 59 59 59 59 59 59 59 59 58 58 58 58 58 58 58 58 58 59 59 59 59 59 59 59 59 59 59 59 59 59 59 59 59 59 59 58 59 59 59 59 59 58 58
3596 58 58 58 58 58 58 58 58 58 58 58 58 59 59 59 59 59 59 59 59 59 59 59 59 59 59 59 59 59 59 59 59 59 59 60 60 60 60 60 60 60 60 60 60 60 59 59 59 59 59 59 59 59 59 59 59 59 59 59 59 59 59 59 59 59 59 59 59 59 59 59
3589 59 59 59 59 59 59 59 59 59 59 59 59 59 59 59 59 59 59 59 59 59 59 59 59 59 59 58 58 58 58 58 58 58 58 58 58 58 59 58 58 58 58 59 59 59 58 58 58 58 58 58 58 58 58 58 58 58 58 58 58 58 58 58 58 58 58 58 58 58 58 59
3581 59 59 59 59 59 59 59 58 58 58 58 58 58 58 58 58 58 58 58 58 58 58 58 58 58 58 58 58 58 58 58 58 58 58 58 59 59 59 59 59 59 59 59 58 59 59 59 59 59 59 59 59 59 59 59 59 59 59 59 59 59 59 59 59 59 60 60 59 59 59 59
3574E9%%%%%%Jj%%%J%j%J%%%%%%%%j%%%%%%%%%%%%%Jj%%%jJ%%%%%%%%%%%%%%%%%j%%J%%%%
3566E9%%%%%%%%%%%%%%%%%%%%%%%%%%%%%%%%%%%%j%%%%%J%%%%%%%%%%%%%%%%%j%%%%%J%%%
3559E9%J%%j%%%%%%%J%%%%%%%%%%%%%%%%J%J%%%%%%%%%j%%j%%%%j%%%%%%%%%%Jj%%%%%%%%
3552E9%%%%%%%%%%%%%%j%%%%%%J%%%%%%%%%%j%%%%J%%%%j%%%%%%%%%%%%%%%%%%%%%%%%%%%
3544E8Jj%%%%%%%%J%%%%%%%%j%%%%%%%%%%%%J%%%j%%%%J%%%%%%%%j%%%%J%%%%%j%%%%%%J%
3537E9%j%%%%%J%%%j%%%%%%%%%%J%%j%%%Jj%J%%%%%%%%%%%%j%%%J%%%%%%%%%J%%%%%%%%%J
3529F1%%J%JJ%J%J%J%%%%j%jj%jj%j%%j%%%%%%%%%J%%%J%J%J%JJ%J%%%%j%%jjj%j%j%j%%%
3522F0j%%%J%j%%%%%%%%%j%%%%%%%%%%%%J%%%%j%%J%j%%J%%%%%%%jJ%%%j%%%%%%%J%%%%%j
$$ plain form
3574 59 59 59 59 59 59 59 60 59 59 59 59 60 60 59 59 60 60 60 60 60 60 60 60 60 59 59 59 59 59 59 59 59 59 59 59 59 59 59 60 59 59 59 59 58 59 59 59 59 59 59 59 59 59 59 59 59 59 59 59 59 59 59 58 58 58 59 59 59 59 59
3566 59 59 59 59 59 59 59 59 59 59 59 59 59 59 59 59 59 59 59 59 59 59 59 59 59 59 59 59 59 59 59 59 59 59 59 59 59 58 58 58 58 58 58 59 59 59 59 59 59 59 59 59 59 59 59 59 59 59 59 59 59 58 58 58 58 58 58 59 59 59 59
3559 59 59 60 60 60 59 59 59 59 59 59 59 59 60 60 60 60 60 60 60 60 60 60 60 60 60 60 60 60 60 61 61 62 62 62 62 62 62 62 62 62 62 61 61 61 60 60 60 60 60 59 59 59 59 59 59 59 59 59 59 59 60 59 59 59 59 59 59 59 59 59
3552 59 59 59 59 59 59 59 59 59 59 59 59 59 59 59 58 58 58 58 58 58 58 59 59 59 59 59 59 59 59 59 59 59 58 58 58 58 58 59 59 59 59 59 58 58 58 58 58 58 58 58 58 58 58 58 58 58 58 58 58 58 58 58 58 58 58 58 58 58 58 58
3544 58 59 58 58 58 58 58 58 58 58 58 59 59 59 59 59 59 59 59 59 58 58 58 58 58 58 58 58 58 58 58 58 58 59 59 59 59 58 58 58 58 58 59 59 59 59 59 59 59 59 59 58 58 58 58 58 59 59 59 59 59 59 58 58 58 58 58 58 58 59 59
3537 59 59 58 58 58 58 58 58 59 59 59 59 58 58 58 58 58 58 58 58 58 58 58 59 59 59 58 58 58 58 59 58 58 59 59 59 59 59 59 59 59 59 59 59 59 59 58 58 58 58 59 59 59 59 59 59 59 59 59 59 60 60 60 60 60 60 60 60 60 60 61
3529 61 61 61 62 62 63 64 64 65 65 66 66 67 67 67 67 67 66 66 65 64 64 63 62 62 61 61 61 60 60 60 60 60 60 60 60 60 60 61 61 61 61 62 62 63 63 64 64 65 66 66 67 67 67 67 67 66 66 66 65 64 63 63 62 62 61 61 60 60 60 60
3522 60 59 59 59 59 60 60 59 59 59 59 59 59 59 59 59 59 58 58 58 58 58 58 58 58 58 58 58 58 58 59 59 59 59 59 58 58 58 59 59 58 58 58 59 59 59 59 59 59 59 59 58 59 59 59 59 58 58 58 58 58 58 58 58 59 59 59 59 59 59 58
3515E8%%J%%%%%%%%j%%%J%%j%%%%%%%%J%%j%%%%%J%%%%%%%%%%%%%%%%%%%j%J%%%j%%%%%%%
3507E8%%%%%%%%%%%%%%%%%%%%%%%%%%%%%%%%j%%%%%%J%%%%%%%%%%%%%%%%%%%%j%%%%%%J%%
3500E8%j%%%%J%%%%%%%%%%%%%%%%%%%%%%%%%%%%%%%%%%%%%%%%%%%%%%%%%%%%%%%%%%%%%%%
3492E8%%%%%%%%%%%%%%%%%%j%J%%%%%%%%%%%%%%%%%%%%%%%%%%%j%%%%J%%%%%%%j%Jj%J%%%
3485E8%%%%%%%%%%%%%%%%%%%j%%%J%%%%%%%%%%%%%%%%%%%%%%%j%J%%jJ%%%%jJ%%%%j%%%%%
3477E7%%%J%%%%%%%%%%j%%J%%%%%%%%%%%%%%%%%%%%%%%%j%%%%%%%%%%%%%%%%%%%%%%%%%%%
3470E7%%%%%J%%%%%j%%%%%%%Jj%%%%J%%%%%%%%j%%%%J%%%%%%jJ%j%%%%J%%%j%%%J%%j%%%J
3463E8%%%%%%%%%%%%%%%%%%%%%%%%%%%%%%%%%%%%%%j%%J%%%%%%%%%%%%j%%%Jj%%%%%%%%%%
$$ plain form
3515 58 58 58 59 59 59 59 59 59 59 59 59 58 58 58 58 59 59 59 58 58 58 58 58 58 58 58 58 59 59 59 58 58 58 58 58 58 59 59 59 59 59 59 59 59 59 59 59 59 59 59 59 59 59 59 59 59 58 58 59 59 59 59 58 58 58 58 58 58 58 58
3507 58 58 58 58 58 58 58 58 58 58 58 58 58 58 58 58 58 58 58 58 58 58 58 58 58 58 58 58 58 58 58 58 58 57 57 57 57 57 57 57 58 58 58 58 58 58 58 58 58 58 58 58 58 58 58 58 58 58 58 58 58 57 57 57 57 57 57 57 58 58 58
3500 58 58 57 57 57 57 57 58 58 58 58 58 58 58 58 58 58 58 58 58 58 58 58 58 58 58 58 58 58 58 58 58 58 58 58 58 58 58 58 58 58 58 58 58 58 58 58 58 58 58 58 58 58 58 58 58 58 58 58 58 58 58 58 58 58 58 58 58 58 58 58
3492 58 58 58 58 58 58 58 58 58 58 58 58 58 58 58 58 58 58 58 57 57 58 58 58 58 58 58 58 58 58 58 58 58 58 58 58 58 58 58 58 58 58 58 58 58 58 58 58 58 57 57 57 57 57 58 58 58 58 58 58 58 58 57 57 58 57 57 58 58 58 58
3485 58 58 58 58 58 58 58 58 58 58 58 58 58 58 58 58 58 58 58 58 57 57 57 57 58 58 58 58 58 58 58 58 58 58 58 58 58 58 58 58 58 58 58 58 58 58 58 58 57 57 58 58 58 57 58 58 58 58 58 57 58 58 58 58 58 57 57 57 57 57 57
3477 57 57 57 57 58 58 58 58 58 58 58 58 58 58 58 57 57 57 58 58 58 58 58 58 58 58 58 58 58 58 58 58 58 58 58 58 58 58 58 58 58 58 58 57 57 57 57 57 57 57 57 57 57 57 57 57 57 57 57 57 57 57 57 57 57 57 57 57 57 57 57
3470 57 57 57 57 57 57 58 58 58 58 58 58 57 57 57 57 57 57 57 57 58 57 57 57 57 57 58 58 58 58 58 58 58 58 58 57 57 57 57 57 58 58 58 58 58 58 58 57 58 58 57 57 57 57 57 58 58 58 58 57 57 57 57 58 58 58 57 57 57 57 58
3463 58 58 58 58 58 58 58 58 58 58 58 58 58 58 58 58 58 58 58 58 58 58 58 58 58 58 58 58 58 58 58 58 58 58 58 58 58 58 58 57 57 57 58 58 58 58 58 58 58 58 58 58 58 58 58 57 57 57 57 58 57 57 57 57 57 57 57 57 57 57 57
3455E7%%%%J%j%%%%%j%%J%%%%%%%%%%%%%%%J%%%%%%%%%%%%j%%J%%%%jJ%%%%%%%%%%%%%%%%
3448E8j%%%%%%%%%%%%%%%%J%j%%%%%%%%%%%%%%%%%%J%%%%%%%%j%%%%%%%%J%j%%%%J%j%%%%
3440E7%%%%Jj%%%%%%J%%j%%%%%%%%%%%%%%%%%%%J%jJ%%j%%%%%%%%%%%%%%%%J%%j%%%J%%%%
3433E8%%%%%j%%%J%%%j%%%%%%%%%%%%%%%%%%%%%%%%%Jj%%%%%%%%%%%%%%%%j%J%%%%%%%%%%
3425E7J%j%%%%%%%%%%J%%%%%%%%j%%%%%%%%%%%%%%%%J%%%%%%%%%%%%%%%%%%%%%%%%%j%%%%
3418E7J%%j%J%%%j%%J%%%j%%%%%%%%%%%%%%%%%%%%%J%%%%%%%%%%%%%%%%%%%%%%%j%J%%%%%
3411E8%%%%%%%%%%%%%%%%%%%%%%%%J%%%%%j%%%%%%%%%%j%J%%%%%%%%%%%%%%%%jJ%%%%J%%%
3403E9j%%%%%%%%%%%%%%%%%%%%%%%%%%j%%%%%%%%%%%%%%%J%%%%%%%%%%j%J%%%%%%j%%%%J%
$$ plain form
3455 57 57 57 57 57 58 58 57 57 57 57 57 57 56 56 56 57 57 57 57 57 57 57 57 57 57 57 57 57 57 57 57 58 58 58 58 58 58 58 58 58 58 58 58 58 57 57 57 58 58 58 58 58 57 58 58 58 58 58 58 58 58 58 58 58 58 58 58 58 58 58
3448 58 57 57 57 57 57 57 57 57 57 57 57 57 57 57 57 57 57 58 58 57 57 57 57 57 57 57 57 57 57 57 57 57 57 57 57 57 57 57 58 58 58 58 58 58 58 58 58 57 57 57 57 57 57 57 57 57 58 58 57 57 57 57 57 58 58 57 57 57 57 57
3440 57 57 57 57 57 58 57 57 57 57 57 57 57 58 58 58 57 57 57 57 57 57 57 57 57 57 57 57 57 57 57 57 57 57 57 57 58 58 57 58 58 58 57 57 57 57 57 57 57 57 57 57 57 57 57 57 57 57 57 58 58 58 57 57 57 57 58 58 58 58 58
3433 58 58 58 58 58 58 57 57 57 57 58 58 58 58 57 57 57 57 57 57 57 57 57 57 57 57 57 57 57 57 57 57 57 57 57 57 57 57 57 57 58 57 57 57 57 57 57 57 57 57 57 57 57 57 57 57 57 57 56 56 57 57 57 57 57 57 57 57 57 57 57
3425 57 58 58 57 57 57 57 57 57 57 57 57 57 57 58 58 58 58 58 58 58 58 58 57 57 57 57 57 57 57 57 57 57 57 57 57 57 57 57 57 58 58 58 58 58 58 58 58 58 58 58 58 58 58 58 58 58 58 58 58 58 58 58 58 58 58 57 57 57 57 57
3418 57 58 58 58 57 57 58 58 58 58 57 57 57 58 58 58 58 57 57 57 57 57 57 57 57 57 57 57 57 57 57 57 57 57 57 57 57 57 57 58 58 58 58 58 58 58 58 58 58 58 58 58 58 58 58 58 58 58 58 58 58 58 58 57 57 58 58 58 58 58 58
3411 58 58 58 58 58 58 58 58 58 58 58 58 58 58 58 58 58 58 58 58 58 58 58 58 58 59 59 59 59 59 59 58 58 58 58 58 58 58 58 58 58 58 57 57 58 58 58 58 58 58 58 58 58 58 58 58 58 58 58 58 58 57 58 58 58 58 58 59 59 59 59
3403 59 58 58 58 58 58 58 58 58 58 58 58 58 58 58 58 58 58 58 58 58 58 58 58 58 58 58 58 57 57 57 57 57 57 57 57 57 57 57 57 57 57 57 57 58 58 58 58 58 58 58 58 58 58 58 57 57 58 58 58 58 58 58 58 57 57 57 57 57 58 58
3396E8jJ%%%%%%%%j%%%J%%%j%%%%J%%%%%%%%%%%%%%%%%%%%%j%%%%%%%%%JjJ%%%%%%%%%%%%
3388E8%j%%%%%%%%%%J%%%%%%%%%%%%%%%%%%%%%%%%%%%%%%%j%%%J%%%%%%%%%%%%%%%%%%%%%
3381E8%%%%%%%%%%%%%%%%%%%%%%J%%%%%%%%J%J%J%J%%%%j%%j%j%%jJ%%%%%%%%J%%%J%%JJ%
3374F4J%%%%%%%j%%%j%j%j%j%%%%%%%%%%%%%%J%%J%%%%%%%j%%j%j%%%%%%j%%%%%%%%%%%%%
3366E8%%%%%%%%%%%%%j%%%%%%%%%%%J%%j%%J%%%%%%%%%%%%%%%%%j%%%%%J%%%%j%%%%J%%%%
3359E8%%%%%%%%%%%%%%%%%%j%%%%%%%%%%J%%%j%%%J%%%%%j%J%j%%%%%%%%%J%%%%%j%%%J%%
3351E8j%%%%%%%%%Jj%%%%%J%%%%%%%%%%%%j%%%%J%%j%%%J%%%j%%%%%%%%%J%j%%%%%%%J%%%
3344E8j%%%Jj%%%%%%%%%%%%%%%Jj%%%%%%%%%%J%%%%j%%%J%%%%%%%%%j%%%%%%%%%%%Jj%%%%
$$ plain form
3396 58 57 58 58 58 58 58 58 58 58 58 57 57 57 57 58 58 58 58 57 57 57 57 57 58 58 58 58 58 58 58 58 58 58 58 58 58 58 58 58 58 58 58 58 58 58 57 57 57 57 57 57 57 57 57 57 58 57 58 58 58 58 58 58 58 58 58 58 58 58 58
3388 58 58 57 57 57 57 57 57 57 57 57 57 57 58 58 58 58 58 58 58 58 58 58 58 58 58 58 58 58 58 58 58 58 58 58 58 58 58 58 58 58 58 58 58 58 57 57 57 57 58 58 58 58 58 58 58 58 58 58 58 58 58 58 58 58 58 58 58 58 58 58
3381 58 58 58 58 58 58 58 58 58 58 58 58 58 58 58 58 58 58 58 58 58 58 58 59 59 59 59 59 59 59 59 59 60 60 61 61 62 62 63 63 63 63 63 62 62 62 61 61 60 60 60 59 60 60 60 60 60 60 60 60 60 61 61 61 61 62 62 62 63 64 64
3374 64 65 65 65 65 65 65 65 65 64 64 64 64 63 63 62 62 61 61 60 60 60 60 60 60 60 60 60 60 60 60 60 60 60 61 61 61 62 62 62 62 62 62 62 62 61 61 61 60 60 59 59 59 59 59 59 59 58 58 58 58 58 58 58 58 58 58 58 58 58 58
3366 58 58 58 58 58 58 58 58 58 58 58 58 58 58 57 57 57 57 57 57 57 57 57 57 57 57 58 58 58 57 57 57 58 58 58 58 58 58 58 58 58 58 58 58 58 58 58 58 58 58 57 57 57 57 57 57 58 58 58 58 58 57 57 57 57 57 58 58 58 58 58
3359 58 58 58 58 58 58 58 58 58 58 58 58 58 58 58 58 58 58 58 57 57 57 57 57 57 57 57 57 57 57 58 58 58 58 57 57 57 57 58 58 58 58 58 58 57 57 58 58 57 57 57 57 57 57 57 57 57 57 58 58 58 58 58 58 57 57 57 57 58 58 58
3351 58 57 57 57 57 57 57 57 57 57 57 58 57 57 57 57 57 57 58 58 58 58 58 58 58 58 58 58 58 58 58 57 57 57 57 57 58 58 58 57 57 57 57 58 58 58 58 57 57 57 57 57 57 57 57 57 57 58 58 57 57 57 57 57 57 57 57 58 58 58 58
3344 58 57 57 57 57 58 57 57 57 57 57 57 57 57 57 57 57 57 57 57 57 57 58 57 57 57 57 57 57 57 57 57 57 57 58 58 58 58 58 57 57 57 57 58 58 58 58 58 58 58 58 58 58 57 57 57 57 57 57 57 57 57 57 57 57 58 57 57 57 57 57
3336E7%%Jj%%%%%%%%%%%%%%%%%%%%%J%j%%%%%%%%%%%%%%%%%%%%%%J%%%j%%%%%%%%%%%%%%%
3329E7%%%%%%%J%%%j%%%%%%%%%%%%%%%%%%%%%%%%%%%%%%%%%%%%%%%%%%%%%%%%%%%%%%%%%%
3322E7%%%%%%%%%%%%%%%%%%%%%%%%%%%%%%%%%%%%%%%%%%%%J%%%j%%J%%jJ%%%%%%j%%%%J%%
3314E8%j%%J%j%%%%%%%%J%%%%%%%%%%%%%j%J%%%%%%%%%j%%%J%%%j%J%%%%%%j%%%%%J%j%%%
3307E7%%%%%%%%%%%%%%%%%%%%Jj%%%%%%%%%%%%%%%%%%%J%%%j%%%%%%Jj%%%%%%%%%%%J%%j%
3299E7%%%%%%%%%%%%%%%%%%%%%%J%j%%%Jj%%%%J%%%%%%%%j%%%%%%%%%%%%%%%%%%%%%%%%%%
3292E7%%%%%%%J%j%%%%%%%%%%J%%%%%%j%%%%%%%%%%%%%%%%%%%%%%%%J%jJ%%%%%j%%%%%%%%
3285E7%%%%%%%%%%J%j%%%%%%%%%%%%%%%%%%%%%%%%%%%%%%%%%%%%%%%%%%%%%%%%%%%%%%%%%
$$ plain form
3336 57 57 57 58 57 57 57 57 57 57 57 57 57 57 57 57 57 57 57 57 57 57 57 57 57 57 58 58 57 57 57 57 57 57 57 57 57 57 57 57 57 57 57 57 57 57 57 57 57 57 57 58 58 58 58 57 57 57 57 57 57 57 57 57 57 57 57 57 57 57 57
3329 57 57 57 57 57 57 57 57 58 58 58 58 57 57 57 57 57 57 57 57 57 57 57 57 57 57 57 57 57 57 57 57 57 57 57 57 57 57 57 57 57 57 57 57 57 57 57 57 57 57 57 57 57 57 57 57 57 57 57 57 57 57 57 57 57 57 57 57 57 57 57
3322 57 57 57 57 57 57 57 57 57 57 57 57 57 57 57 57 57 57 57 57 57 57 57 57 57 57 57 57 57 57 57 57 57 57 57 57 57 57 57 57 57 57 57 57 57 58 58 58 58 57 57 57 58 58 58 57 58 58 58 58 58 58 58 57 57 57 57 57 58 58 58
3314 58 58 57 57 57 58 58 57 57 57 57 57 57 57 57 57 58 58 58 58 58 58 58 58 58 58 58 58 58 58 57 57 58 58 58 58 58 58 58 58 58 58 57 57 57 57 58 58 58 58 57 57 58 58 58 58 58 58 58 57 57 57 57 57 57 58 58 57 57 57 57
3307 57 57 57 57 57 57 57 57 57 57 57 57 57 57 57 57 57 57 57 57 57 58 57 57 57 57 57 57 57 57 57 57 57 57 57 57 57 57 57 57 57 57 58 58 58 58 57 57 57 57 57 57 57 58 57 57 57 57 57 57 57 57 57 57 57 57 58 58 58 57 57
3299 57 57 57 57 57 57 57 57 57 57 57 57 57 57 57 57 57 57 57 57 57 57 57 58 58 57 57 57 57 58 57 57 57 57 57 58 58 58 58 58 58 58 58 58 57 57 57 57 57 57 57 57 57 57 57 57 57 57 57 57 57 57 57 57 57 57 57 57 57 57 57
3292 57 57 57 57 57 57 57 57 58 58 57 57 57 57 57 57 57 57 57 57 57 58 58 58 58 58 58 58 57 57 57 57 57 57 57 57 57 57 57 57 57 57 57 57 57 57 57 57 57 57 57 57 57 58 58 57 58 58 58 58 58 58 57 57 57 57 57 57 57 57 57
3285 57 57 57 57 57 57 57 57 57 57 57 58 58 57 57 57 57 57 57 57 57 57 57 57 57 57 57 57 57 57 57 57 57 57 57 57 57 57 57 57 57 57 57 57 57 57 57 57 57 57 57 57 57 57 57 57 57 57 57 57 57 57 57 57 57 57 57 57 57 57 57
3277E7%%%%%%%%%J%j%%%%%%%%jJ%%%%%j%J%%j%J%%%%%%%%%j%%%%J%%%%%%%J%%%j%%J%%%%%
3270E8%%%j%%%%%%%%J%j%%%%%%%%%J%%j%%%%%%%jJ%jJ%%%%%%%%%J%%j%%%%%%%J%%j%%J%%%
3262E8j%%%Jj%J%%%%%%%%%%%%%%%%%%%%%%%J%%%%J%%J%%%%J%%%j%%%%j%%%%j%%j%%%%%%%%
3255E8%%%%j%%%%%J%%%%%%%%%%%%%%%%%%%%jJ%%%%%%%%%%%%%%%%%%%%j%%%%%%J%%%%%%%j%
3247E7%%%%%%%J%j%%%%%%J%%j%J%%%%%%j%%%%%%%Jj%%%%%%%%%%%%%%%%%%jJ%%%%%%j%%J%%
3240E7%%%%%%%%%%%%%%%%jJ%%%%%j%%%Jj%%%%%J%%%%%j%%%Jj%%%%Jj%%%%%%%%%%%%%%%%%%
3233E6%j%J%%j%%%J%%j%%%%%%%%%%%%%%%%%J%j%%%%%%%%j%%%J%%j%J%%%%J%%%%%%%%%%%%%
3225E6%%%J%j%%%%%%%%%%%%%%%%%%%%%%%%%%j%%%%%%%%%%%%%%%%%J%%jJ%%%%%J%%%%%%%%%
$$ plain form
3277 57 57 57 57 57 57 57 57 57 57 58 58 57 57 57 57 57 57 57 57 57 56 57 57 57 57 57 57 56 56 57 57 57 56 56 57 57 57 57 57 57 57 57 57 57 56 56 56 56 56 57 57 57 57 57 57 57 57 58 58 58 58 57 57 57 58 58 58 58 58 58
3270 58 58 58 58 57 57 57 57 57 57 57 57 57 58 58 57 57 57 57 57 57 57 57 57 57 58 58 58 57 57 57 57 57 57 57 57 56 57 57 56 57 57 57 57 57 57 57 57 57 57 58 58 58 57 57 57 57 57 57 57 57 58 58 58 57 57 57 58 58 58 58
3262 58 57 57 57 57 58 57 57 58 58 58 58 58 58 58 58 58 58 58 58 58 58 58 58 58 58 58 58 58 58 58 58 59 59 59 59 59 60 60 60 61 61 61 61 61 62 62 62 62 61 61 61 61 61 60 60 60 60 60 59 59 59 58 58 58 58 58 58 58 58 58
3255 58 58 58 58 58 57 57 57 57 57 57 58 58 58 58 58 58 58 58 58 58 58 58 58 58 58 58 58 58 58 58 58 57 58 58 58 58 58 58 58 58 58 58 58 58 58 58 58 58 58 58 58 58 58 57 57 57 57 57 57 57 58 58 58 58 58 58 58 58 57 57
3247 57 57 57 57 57 57 57 57 58 58 57 57 57 57 57 57 57 58 58 58 57 57 58 58 58 58 58 58 58 57 57 57 57 57 57 57 57 58 57 57 57 57 57 57 57 57 57 57 57 57 57 57 57 57 57 57 57 56 57 57 57 57 57 57 57 56 56 56 57 57 57
3240 57 57 57 57 57 57 57 57 57 57 57 57 57 57 57 57 57 56 57 57 57 57 57 57 56 56 56 56 57 56 56 56 56 56 56 57 57 57 57 57 57 56 56 56 56 57 56 56 56 56 56 57 56 56 56 56 56 56 56 56 56 56 56 56 56 56 56 56 56 56 56
3233 56 56 55 55 56 56 56 55 55 55 55 56 56 56 55 55 55 55 55 55 55 55 55 55 55 55 55 55 55 55 55 55 56 56 55 55 55 55 55 55 55 55 55 54 54 54 54 55 55 55 54 54 55 55 55 55 55 56 56 56 56 56 56 56 56 56 56 56 56 56 56
3225 56 56 56 56 57 57 56 56 56 56 56 56 56 56 56 56 56 56 56 56 56 56 56 56 56 56 56 56 56 56 56 56 56 55 55 55 55 55 55 55 55 55 55 55 55 55 55 55 55 55 55 56 56 56 55 56 56 56 56 56 56 57 57 57 57 57 57 57 57 57 57
3218E7%%%%%%%%%%%%%%%%%%%%J%%%j%%%%%%%%%%%%%%%%%%%%%%%%%%%%%%%%j%%%J%%%%%%%%
3210E7%%%%%%%%%%%%%%%%%%%%%%%%%j%%%%%%%%J%%j%%%%%%%%%%%%%%%%%%%%%%%J%%%%%j%%
3203E6%%%%%%%%%%J%%%%j%%%%%%%%%%%%%%%j%%%%Jj%%%%%%%j%%%%J%%%%%%%%%jJ%%%%%Jj%
3196E5J%%%%%%%%%%%%J%%%%%%%%%%j%%%J%%jJ%%%%%%%%%%%%%%%%%%%%%%%%%%%%%%%%%%j%%
3188E6%%J%%%%%%%%%%%%j%%%%Jj%%%%%%%%%%%%%%%J%%%%%%jJ%%j%%J%%%%%%j%J%%%%%%%%%
3181E7%j%J%%%j%%%Jj%%%%%%%%%%%%%%%%%%%%%%%%%%%%%%%%%%%J%%%%%%%%%%%%%%%%%%%%%
3173E7%%%%%%%%%%%%%%%%%%%%%%%%%%%%%%%%%%%%%%%%%%%%%%%%%j%J%%%%%%%%%%%%%%%%%%
3166E7%Jj%%%%%%%%%%%%%%%%%%jJ%%%J%j%%%%%%%%%%%%%%%%%%%%%%%%%%%%%j%J%%%%%%%%%
$$ plain form
3218 57 57 57 57 57 57 57 57 57 57 57 57 57 57 57 57 57 57 57 57 57 58 58 58 58 57 57 57 57 57 57 57 57 57 57 57 57 57 57 57 57 57 57 57 57 57 57 57 57 57 57 57 57 57 57 57 57 57 56 56 56 56 57 57 57 57 57 57 57 57 57
3210 57 57 57 57 57 57 57 57 57 57 57 57 57 57 57 57 57 57 57 57 57 57 57 57 57 57 56 56 56 56 56 56 56 56 56 57 57 57 56 56 56 56 56 56 56 56 56 56 56 56 56 56 56 56 56 56 56 56 56 56 56 56 57 57 57 57 57 57 56 56 56
3203 56 56 56 56 56 56 56 56 56 56 56 57 57 57 57 57 56 56 56 56 56 56 56 56 56 56 56 56 56 56 56 56 55 55 55 55 55 56 55 55 55 55 55 55 55 55 54 54 54 54 54 55 55 55 55 55 55 55 55 55 55 54 55 55 55 55 55 55 56 55 55
3196 55 56 56 56 56 56 56 56 56 56 56 56 56 56 57 57 57 57 57 57 57 57 57 57 57 56 56 56 56 57 57 57 56 57 57 57 57 57 57 57 57 57 57 57 57 57 57 57 57 57 57 57 57 57 57 57 57 57 57 57 57 57 57 57 57 57 57 57 56 56 56
3188 56 56 56 57 57 57 57 57 57 57 57 57 57 57 57 57 56 56 56 56 56 57 56 56 56 56 56 56 56 56 56 56 56 56 56 56 56 56 57 57 57 57 57 57 57 56 57 57 57 56 56 56 57 57 57 57 57 57 57 56 56 57 57 57 57 57 57 57 57 57 57
3181 57 57 56 56 57 57 57 57 56 56 56 56 57 56 56 56 56 56 56 56 56 56 56 56 56 56 56 56 56 56 56 56 56 56 56 56 56 56 56 56 56 56 56 56 56 56 56 56 56 57 57 57 57 57 57 57 57 57 57 57 57 57 57 57 57 57 57 57 57 57 57
3173 57 57 57 57 57 57 57 57 57 57 57 57 57 57 57 57 57 57 57 57 57 57 57 57 57 57 57 57 57 57 57 57 57 57 57 57 57 57 57 57 57 57 57 57 57 57 57 57 57 57 56 56 57 57 57 57 57 57 57 57 57 57 57 57 57 57 57 57 57 57 57
3166 57 57 58 57 57 57 57 57 57 57 57 57 57 57 57 57 57 57 57 57 57 57 56 57 57 57 57 58 58 57 57 57 57 57 57 57 57 57 57 57 57 57 57 57 57 57 57 57 57 57 57 57 57 57 57 57 57 57 57 56 56 57 57 57 57 57 57 57 57 57 57
3158E7%%j%%%%%%%%%%%%%%%%%%%%%%%%%%%%J%%%j%%%%%%%%%J%%%%%%%%%%%%J%j%%%%%%%%%
3151E7j%J%j%%%%%%%%%%%%%%%%%%%%%jJ%%%%J%%j%%%J%%%%%%%%%%%%%%%%%%%%%%%j%%%%%%
3144E6%%%%%%%%%%%J%%%%j%%%%%%%%%%%%%%%%%%j%%%%%%J%%%%%%%%%J%%j%%%%%%%%%%%%%%
3136E6%%%%%%%%%j%%%%%%%%%%J%%%%%%%%%%%%%%%%%%%%%%%%%%j%J%%%%jJ%%%%%%%%%%%%%%
3129E6%%%%%%%%%%%%%%%%%%%%%%%J%%%%%%%%%%%%%%%%%%%%jJ%%j%%%%%%%%J%%jJ%%J%%j%%
3121E7%%%%%%jJ%%%%%%%%%%%%%%%%%%%%%%%%%%%%%%%j%%J%%%%%%%%%%%%%%%%%%%%%%j%%%J
3114E7%%%%%%%%%%%%%%j%J%%%%%%%%%%%%j%%J%j%%%%%%%%J%%%%%%%%%%%%%%%%%%%%j%J%%j
3107E6%%%%%%%%%%%%%%%%%%%%%%%J%%j%%%%Jj%%%%%%%%%%%%%J%%%%%%%%%j%%%%%%J%%%%%%
$$ plain form
3158 57 57 57 56 56 56 56 56 56 56 56 56 56 56 56 56 56 56 56 56 56 56 56 56 56 56 56 56 56 56 56 56 57 57 57 57 56 56 56 56 56 56 56 56 56 56 57 57 57 57 57 57 57 57 57 57 57 57 57 58 58 57 57 57 57 57 57 57 57 57 57
3151 57 56 56 57 57 56 56 56 56 56 56 56 56 56 56 56 56 56 56 56 56 56 56 56 56 56 56 55 56 56 56 56 56 57 57 57 56 56 56 56 57 57 57 57 57 57 57 57 57 57 57 57 57 57 57 57 57 57 57 57 57 57 57 57 56 56 56 56 56 56 56
3144 56 56 56 56 56 56 56 56 56 56 56 56 57 57 57 57 57 56 56 56 56 56 56 56 56 56 56 56 56 56 56 56 56 56 56 56 55 55 55 55 55 55 55 56 56 56 56 56 56 56 56 56 56 57 57 57 56 56 56 56 56 56 56 56 56 56 56 56 56 56 56
3136 56 56 56 56 56 56 56 56 56 56 55 55 55 55 55 55 55 55 55 55 55 56 56 56 56 56 56 56 56 56 56 56 56 56 56 56 56 56 56 56 56 56 56 56 56 56 56 56 55 55 56 56 56 56 56 55 56 56 56 56 56 56 56 56 56 56 56 56 56 56 56
3129 56 56 56 56 56 56 56 56 56 56 56 56 56 56 56 56 56 56 56 56 56 56 56 56 57 57 57 57 57 57 57 57 57 57 57 57 57 57 57 57 57 57 57 57 57 56 57 57 57 56 56 56 56 56 56 56 56 56 57 57 57 56 57 57 57 58 58 58 57 57 57
3121 57 57 57 57 57 57 57 56 57 57 57 57 57 57 57 57 57 57 57 57 57 57 57 57 57 57 57 57 57 57 57 57 57 57 57 57 57 57 57 57 56 56 56 57 57 57 57 57 57 57 57 57 57 57 57 57 57 57 57 57 57 57 57 57 57 57 56 56 56 56 57
3114 57 57 57 57 57 57 57 57 57 57 57 57 57 57 57 56 56 57 57 57 57 57 57 57 57 57 57 57 57 57 56 56 56 57 57 56 56 56 56 56 56 56 56 56 57 57 57 57 57 57 57 57 57 57 57 57 57 57 57 57 57 57 57 57 57 56 56 57 57 57 56
3107 56 56 56 56 56 56 56 56 56 56 56 56 56 56 56 56 56 56 56 56 56 56 56 56 57 57 57 56 56 56 56 56 57 56 56 56 56 56 56 56 56 56 56 56 56 56 56 57 57 57 57 57 57 57 57 57 57 56 56 56 56 56 56 56 57 57 57 57 57 57 57
3099E7j%%%%%%J%%%%%%j%%%%%J%%%%%%%%j%%%%%%%%%%J%%j%%%%Jj%%%%%%J%%%%%%j%%%%%%
3092E6Jj%%%%J%%%%%%%%j%%%%%%%J%%%%j%%%Jj%%%%%%%%%%%%%%%%%%%%J%%%%%%%%%%j%%%%
3084E6%%%%%%%%%%%%%%%%%%%%%%%%%%%%J%%%%%%%%j%%%%%%%%%%%%%%%%%%%J%%j%Jj%%%%Jj
3077E6%%%%%%%%%%%%J%%j%%%%J%%%%%%j%%%%%%J%%jJj%%%%%%%%%J%j%%%%%%jJ%%%%%%%%%%
3069E6%%%%%%%%%%%%%%%%%%%%%%%%%%%%%%%%%%%%%%%%%%%%%%%%%%%%%%%%%%%%%%%%%%%%%%
3062E6%%%%%%%%%%%%%%%%%J%%%%%%%%j%%%%%%%%%%%%%%%%%%J%%%j%%%%%%%%%%%%%%%J%%%%
3055E7j%%J%%%%j%%%J%%j%%%%%%%%%%%%%%%%%%%%%%%%jJ%%%%%%%%%%jJ%%%%%%%%%%%%%%%%
3047E6%%%%%%%%%%%%%%jJ%%%%j%%J%%%%%%%%j%J%%%%%%%%%%%%%%%%%%%%%%%%%%%%%%%%%%%
$$ plain form
3099 57 56 56 56 56 56 56 56 57 57 57 57 57 57 57 56 56 56 56 56 56 57 57 57 57 57 57 57 57 57 56 56 56 56 56 56 56 56 56 56 56 57 57 57 56 56 56 56 56 57 56 56 56 56 56 56 56 57 57 57 57 57 57 57 56 56 56 56 56 56 56
3092 56 57 56 56 56 56 56 57 57 57 57 57 57 57 57 57 56 56 56 56 56 56 56 56 57 57 57 57 57 56 56 56 56 57 56 56 56 56 56 56 56 56 56 56 56 56 56 56 56 56 56 56 56 56 56 57 57 57 57 57 57 57 57 57 57 57 56 56 56 56 56
3084 56 56 56 56 56 56 56 56 56 56 56 56 56 56 56 56 56 56 56 56 56 56 56 56 56 56 56 56 56 57 57 57 57 57 57 57 57 57 56 56 56 56 56 56 56 56 56 56 56 56 56 56 56 56 56 56 56 56 57 57 57 56 56 57 56 56 56 56 56 57 56
3077 56 56 56 56 56 56 56 56 56 56 56 56 56 57 57 57 56 56 56 56 56 57 57 57 57 57 57 57 56 56 56 56 56 56 56 57 57 57 56 57 56 56 56 56 56 56 56 56 56 56 57 57 56 56 56 56 56 56 56 55 56 56 56 56 56 56 56 56 56 56 56
3069 56 56 56 56 56 56 56 56 56 56 56 56 56 56 56 56 56 56 56 56 56 56 56 56 56 56 56 56 56 56 56 56 56 56 56 56 56 56 56 56 56 56 56 56 56 56 56 56 56 56 56 56 56 56 56 56 56 56 56 56 56 56 56 56 56 56 56 56 56 56 56
3062 56 56 56 56 56 56 56 56 56 56 56 56 56 56 56 56 56 56 57 57 57 57 57 57 57 57 57 56 56 56 56 56 56 56 56 56 56 56 56 56 56 56 56 56 56 56 57 57 57 57 56 56 56 56 56 56 56 56 56 56 56 56 56 56 56 56 57 57 57 57 57
3055 57 56 56 56 57 57 57 57 57 56 56 56 56 57 57 57 56 56 56 56 56 56 56 56 56 56 56 56 56 56 56 56 56 56 56 56 56 56 56 56 56 55 56 56 56 56 56 56 56 56 56 56 56 55 56 56 56 56 56 56 56 56 56 56 56 56 56 56 56 56 56
3047 56 56 56 56 56 56 56 56 56 56 56 56 56 56 56 55 56 56 56 56 56 55 55 55 56 56 56 56 56 56 56 56 56 55 55 56 56 56 56 56 56 56 56 56 56 56 56 56 56 56 56 56 56 56 56 56 56 56 56 56 56 56 56 56 56 56 56 56 56 56 56
3040E6%%%%%%%%%%%%jJ%%%%%%j%J%%%%%%%%%%%%%%%%%%%%%%%%%%%%%%%%%%%%%J%%%j%%%%%
3032E6%%%%%%%%%%%%%%%%%%%%%%%%%%%%%%%Jj%%%%%%%%%%%%%%%%%%%%%%%%%%%%%%%%%%%%%
3025E6%%%%Jj%%%%%%%%%%%%%%%%%%%%%%%%%%%%%%%%%%%%%%J%j%%Jj%%Jj%%%%%%%%%%%%%%%
3018E6%%jJ%%%%%j%%%J%%%%%%%%%%%%%%%%%%%%%%%%%%%%%%%%%%%%%%%%%%%%%%%j%%%%J%%%
3010E6%%%%%%%%%%%%%%%%%%%%%%%%%%%%%%%%%%%%%jJ%%%%%%%%%%%%%%%%%%%%%%%%%%%Jj%%
3003E6%%%jJ%%j%%%%J%%%%%%%%%%jJ%%%%%%%%%%%%%%%jJ%j%%J%%jJ%%%j%%%%%J%%%%j%%%J
2995E6%%%%%%%%%%%%%%%%%%%%jJ%%%%%%%%j%%%%%J%%%%%%%%%%%%%%%%%%%%%%%%j%%J%%%%%
2988E6%%%%%%%%%%%%%%%%%%%%%%%%%%%%%%%%%%%%%%%%%%%%%%%%%%%%%%%%%%%%%%%%%%%%%%
$$ plain form
3040 56 56 56 56 56 56 56 56 56 56 56 56 56 55 56 56 56 56 56 56 56 55 55 56 56 56 56 56 56 56 56 56 56 56 56 56 56 56 56 56 56 56 56 56 56 56 56 56 56 56 56 56 56 56 56 56 56 56 56 56 56 57 57 57 57 56 56 56 56 56 56
3032 56 56 56 56 56 56 56 56 56 56 56 56 56 56 56 56 56 56 56 56 56 56 56 56 56 56 56 56 56 56 56 56 57 56 56 56 56 56 56 56 56 56 56 56 56 56 56 56 56 56 56 56 56 56 56 56 56 56 56 56 56 56 56 56 56 56 56 56 56 56 56
3025 56 56 56 56 56 57 56 56 56 56 56 56 56 56 56 56 56 56 56 56 56 56 56 56 56 56 56 56 56 56 56 56 56 56 56 56 56 56 56 56 56 56 56 56 56 57 57 56 56 56 57 56 56 56 57 56 56 56 56 56 56 56 56 56 56 56 56 56 56 56 56
3018 56 56 56 55 56 56 56 56 56 56 55 55 55 55 56 56 56 56 56 56 56 56 56 56 56 56 56 56 56 56 56 56 56 56 56 56 56 56 56 56 56 56 56 56 56 56 56 56 56 56 56 56 56 56 56 56 56 56 56 56 56 56 55 55 55 55 55 56 56 56 56
3010 56 56 56 56 56 56 56 56 56 56 56 56 56 56 56 56 56 56 56 56 56 56 56 56 56 56 56 56 56 56 56 56 56 56 56 56 56 56 55 56 56 56 56 56 56 56 56 56 56 56 56 56 56 56 56 56 56 56 56 56 56 56 56 56 56 56 56 57 56 56 56
3003 56 56 56 56 55 56 56 56 55 55 55 55 55 56 56 56 56 56 56 56 56 56 56 56 55 56 56 56 56 56 56 56 56 56 56 56 56 56 56 56 56 55 56 56 55 55 55 56 56 56 55 56 56 56 56 55 55 55 55 55 55 56 56 56 56 56 55 55 55 55 56
2995 56 56 56 56 56 56 56 56 56 56 56 56 56 56 56 56 56 56 56 56 56 55 56 56 56 56 56 56 56 56 56 55 55 55 55 55 55 56 56 56 56 56 56 56 56 56 56 56 56 56 56 56 56 56 56 56 56 56 56 56 56 56 55 55 55 56 56 56 56 56 56
2988 56 56 56 56 56 56 56 56 56 56 56 56 56 56 56 56 56 56 56 56 56 56 56 56 56 56 56 56 56 56 56 56 56 56 56 56 56 56 56 56 56 56 56 56 56 56 56 56 56 56 56 56 56 56 56 56 56 56 56 56 56 56 56 56 56 56 56 56 56 56 56
2980E6%%%%%%%%%j%J%%%%%%%%%%%%%%%%%%%%%%%%%%%j%J%%%%%%%%%%%%%%%%%%j%J%%%%%j%
2973E5%%%%%%%%%%%%%%%J%%%%%%%%%%%%%%%%j%%%J%%%%%%%%%%%%%%%%%%%%%%%j%%%%J%%%%
2966E6%%%%jJ%%%%%%%%%j%%%%%J%%%j%%%%%J%%%%%%%%%%j%%%J%%%%%%%%%%%%%j%%J%%%%%%
2958E6%%%%%%%%%%%%%%%%%%%%%%%%%%J%%%j%%J%%j%%%%%%%%%%%%%%%jJ%%%j%%%%%%%%%%J%
2951E6%%%%%%%%%%%%%%%%%%%%%%%%%%%%%%%%%%%%%%%%j%%%J%%%%%%%%%%%%%%%%%%%%%%%%%
2943E6%%%%%j%%J%%%%j%%%%J%%%%%%%%%%j%%J%%j%%J%%%%%%%%%%%%%%%%%%%%%%%%%%j%%%%
2936E5%%Jj%%%%%%Jj%%%%%%J%%%%%%%%%j%%%%%%J%%%%%%%%%jJ%%%jJ%%%%%%%%%%%%%%%jJ%
2929E6%%%%%%%%%%%%%%%%%J%%%%j%%%%%%%%%%%%%%%%%%%%%%%%%%%%%%%%%%%%%j%%%%J%%%%
$$ plain form
2980 56 56 56 56 56 56 56 56 56 56 55 55 56 56 56 56 56 56 56 56 56 56 56 56 56 56 56 56 56 56 56 56 56 56 56 56 56 56 56 56 55 55 56 56 56 56 56 56 56 56 56 56 56 56 56 56 56 56 56 56 56 55 55 56 56 56 56 56 56 55 55
2973 55 55 55 55 55 55 55 55 55 55 55 55 55 55 55 55 56 56 56 56 56 56 56 56 56 56 56 56 56 56 56 56 56 55 55 55 55 56 56 56 56 56 56 56 56 56 56 56 56 56 56 56 56 56 56 56 56 56 56 56 56 55 55 55 55 55 56 56 56 56 56
2966 56 56 56 56 56 55 56 56 56 56 56 56 56 56 56 56 55 55 55 55 55 55 56 56 56 56 55 55 55 55 55 55 56 56 56 56 56 56 56 56 56 56 56 55 55 55 55 56 56 56 56 56 56 56 56 56 56 56 56 56 56 55 55 55 56 56 56 56 56 56 56
2958 56 56 56 56 56 56 56 56 56 56 56 56 56 56 56 56 56 56 56 56 56 56 56 56 56 56 56 57 57 57 57 56 56 56 57 57 57 56 56 56 56 56 56 56 56 56 56 56 56 56 56 56 56 55 56 56 56 56 55 55 55 55 55 55 55 55 55 55 55 56 56
2951 56 56 56 56 56 56 56 56 56 56 56 56 56 56 56 56 56 56 56 56 56 56 56 56 56 56 56 56 56 56 56 56 56 56 56 56 56 56 56 56 56 55 55 55 55 56 56 56 56 56 56 56 56 56 56 56 56 56 56 56 56 56 56 56 56 56 56 56 56 56 56
2943 56 56 56 56 56 56 55 55 55 56 56 56 56 56 55 55 55 55 55 56 56 56 56 56 56 56 56 56 56 56 55 55 55 56 56 56 55 55 55 56 56 56 56 56 56 56 56 56 56 56 56 56 56 56 56 56 56 56 56 56 56 56 56 56 56 56 55 55 55 55 55
2936 55 55 55 56 55 55 55 55 55 55 55 56 55 55 55 55 55 55 55 56 56 56 56 56 56 56 56 56 56 55 55 55 55 55 55 55 56 56 56 56 56 56 56 56 56 56 55 56 56 56 56 55 56 56 56 56 56 56 56 56 56 56 56 56 56 56 56 56 55 56 56
2929 56 56 56 56 56 56 56 56 56 56 56 56 56 56 56 56 56 56 57 57 57 57 57 56 56 56 56 56 56 56 56 56 56 56 56 56 56 56 56 56 56 56 56 56 56 56 56 56 56 56 56 56 56 56 56 56 56 56 56 56 56 55 55 55 55 55 56 56 56 56 56
2921E6%%%%%%%%%%%%%%%%%%%%%%%%%j%%%J%j%%%J%%%%%%%%%%%%%%%%%%j%%%%%%%%%%%%%%%
2914E5J%%%%%%%%%j%J%%%%j%%%%%%Jj%%%%%%%%%%%%%%%j%%%JjJ%%%%%%%%%%%%%Jj%%%%%J%
2906E6%%%%j%J%%%%%%%%%%%%%J%j%%%%%%%%%%%%%%%%%%%%%%%%%%%%%%%%%jJ%%%%%%%%%%%%
2899E6%%%%%%%%%%%%%%%%%%%J%j%%%%%%%%%%%%%%%%%%%%%%%%J%j%%%%%%%%%%%J%%%%%%%%%
2891E7%%j%%%%%%%%%%%J%%j%%jJ%jJ%%%%%%%%j%%%%%J%%Jj%%%%%%%j%%%J%%%%%%%%%%J%j%
2884E6%%%J%%%%j%%%%j%%%%%J%%%%%%%%%%%%%%j%%%%%%%%%J%%%%%%%J%%%%%%%%%%%%%%%%%
2877E7%%%%j%J%%%%%%%%%%%%%%%%j%%%%%%%%%%%%%%%%%%%Jj%%Jj%JjJ%%%%%%%%%jJ%%%%%j
2869E6J%%%%%%%%%%%j%%%%%Jj%%%J%%j%%%J%%%%%%%%%%%%%%%%%%%%%%j%%%J%%%j%%%%%%%%
$$ plain form
2921 56 56 56 56 56 56 56 56 56 56 56 56 56 56 56 56 56 56 56 56 56 56 56 56 56 56 55 55 55 55 56 56 55 55 55 55 56 56 56 56 56 56 56 56 56 56 56 56 56 56 56 56 56 56 56 55 55 55 55 55 55 55 55 55 55 55 55 55 55 55 55
2914 55 56 56 56 56 56 56 56 56 56 56 55 55 56 56 56 56 56 55 55 55 55 55 55 55 56 55 55 55 55 55 55 55 55 55 55 55 55 55 55 55 55 54 54 54 54 55 54 55 55 55 55 55 55 55 55 55 55 55 55 55 55 56 55 55 55 55 55 55 56 56
2906 56 56 56 56 56 55 55 56 56 56 56 56 56 56 56 56 56 56 56 56 56 57 57 56 56 56 56 56 56 56 56 56 56 56 56 56 56 56 56 56 56 56 56 56 56 56 56 56 56 56 56 56 56 56 56 56 56 55 56 56 56 56 56 56 56 56 56 56 56 56 56
2899 56 56 56 56 56 56 56 56 56 56 56 56 56 56 56 56 56 56 56 56 57 57 56 56 56 56 56 56 56 56 56 56 56 56 56 56 56 56 56 56 56 56 56 56 56 56 56 57 57 56 56 56 56 56 56 56 56 56 56 56 56 57 57 57 57 57 57 57 57 57 57
2891 57 57 57 56 56 56 56 56 56 56 56 56 56 56 56 57 57 57 56 56 56 55 56 56 55 56 56 56 56 56 56 56 56 56 55 55 55 55 55 55 56 56 56 57 56 56 56 56 56 56 56 56 55 55 55 55 56 56 56 56 56 56 56 56 56 56 56 57 57 56 56
2884 56 56 56 56 57 57 57 57 57 56 56 56 56 56 55 55 55 55 55 55 56 56 56 56 56 56 56 56 56 56 56 56 56 56 56 55 55 55 55 55 55 55 55 55 55 56 56 56 56 56 56 56 56 57 57 57 57 57 57 57 57 57 57 57 57 57 57 57 57 57 57
2877 57 57 57 57 57 56 56 57 57 57 57 57 57 57 57 57 57 57 57 57 57 57 57 57 56 56 56 56 56 56 56 56 56 56 56 56 56 56 56 56 56 56 56 56 57 56 56 56 57 56 56 57 56 57 57 57 57 57 57 57 57 57 57 56 57 57 57 57 57 57 56
2869 56 57 57 57 57 57 57 57 57 57 57 57 57 56 56 56 56 56 56 57 56 56 56 56 57 57 57 56 56 56 56 57 57 57 57 57 57 57 57 57 57 57 57 57 57 57 57 57 57 57 57 57 57 57 56 56 56 56 57 57 57 57 56 56 56 56 56 56 56 56 56
2862E6%%%J%%%%%%%%%%%%Jj%%%%%%j%%J%%j%%%%J%%%%%%%%%j%%%%%%%J%%%%%%%%Jj%%J%%%
2854E8%J%%%%%%%%%%%%%%j%%%%j%%%%Jj%%%%%%%%%%%%%%%%%%%%%%%%%%%%%%%%%%%%%%%%%J
2847E8%%Jj%%j%%%%%%%%%j%%%%%%%%%%J%%%%%%%%%%j%%%%%%J%%%%%%%%%%%%%%%%%%%%%Jj%
2840E7%%%%%%%%%%%%%%%%%%%%%jJ%%%%%%%%%%%j%%%%%%%%%%J%%%J%%%%%%%%j%%%%%%%%%%%
2832E7J%%%%%%%%%%J%%%%%%%%J%%%%j%%%%%%%%%%%%%%j%%%%%%%%%%%j%%%%%%%%%%%%%%%Jj
2825E7%%%%%%%%J%%%%j%%J%%%%%J%j%%%%%%%%%%%%%%%%%Jj%%%%%J%%%%%%%%%%%j%%%%%%%%
2817E8%%%%%%%%%%J%%%j%J%%%%jJ%%%%j%%%j%%%%%%j%%%%%J%%%%%%%%%%%%%%%%%%%%%%%%%
2810E7%%%%%%%%J%%%%%%%%%%%%%%%%%%%%%%%%%%%%%%%%%%%%%%%%%%%%%%%%J%%%%%%%%%%%%
$$ plain form
2862 56 56 56 56 57 57 57 57 57 57 57 57 57 57 57 57 57 58 57 57 57 57 57 57 57 56 56 56 57 57 57 56 56 56 56 56 57 57 57 57 57 57 57 57 57 57 56 56 56 56 56 56 56 56 57 57 57 57 57 57 57 57 57 58 57 57 57 58 58 58 58
2854 58 58 59 59 59 59 59 59 59 59 59 59 59 59 59 59 59 58 58 58 58 58 57 57 57 57 57 58 57 57 57 57 57 57 57 57 57 57 57 57 57 57 57 57 57 57 57 57 57 57 57 57 57 57 57 57 57 57 57 57 57 57 57 57 57 57 57 57 57 57 58
2847 58 58 58 59 58 58 58 57 57 57 57 57 57 57 57 57 57 56 56 56 56 56 56 56 56 56 56 56 57 57 57 57 57 57 57 57 57 57 57 56 56 56 56 56 56 56 57 57 57 57 57 57 57 57 57 57 57 57 57 57 57 57 57 57 57 57 57 57 58 57 57
2840 57 57 57 57 57 57 57 57 57 57 57 57 57 57 57 57 57 57 57 57 57 57 56 57 57 57 57 57 57 57 57 57 57 57 57 56 56 56 56 56 56 56 56 56 56 56 57 57 57 57 58 58 58 58 58 58 58 58 58 57 57 57 57 57 57 57 57 57 57 57 57
2832 57 58 58 58 58 58 58 58 58 58 58 58 59 59 59 59 59 59 59 59 59 60 60 60 60 60 59 59 59 59 59 59 59 59 59 59 59 59 59 59 59 58 58 58 58 58 58 58 58 58 58 58 58 57 57 57 57 57 57 57 57 57 57 57 57 57 57 57 57 58 57
2825 57 57 57 57 57 57 57 57 57 58 58 58 58 58 57 57 57 58 58 58 58 58 58 59 59 58 58 58 58 58 58 58 58 58 58 58 58 58 58 58 58 58 58 59 58 58 58 58 58 58 59 59 59 59 59 59 59 59 59 59 59 59 58 58 58 58 58 58 58 58 58
2817 58 58 58 58 58 58 58 58 58 58 58 59 59 59 59 58 58 59 59 59 59 59 58 59 59 59 59 59 58 58 58 58 57 57 57 57 57 57 57 56 56 56 56 56 56 57 57 57 57 57 57 57 57 57 57 57 57 57 57 57 57 57 57 57 57 57 57 57 57 57 57
2810 57 57 57 57 57 57 57 57 57 58 58 58 58 58 58 58 58 58 58 58 58 58 58 58 58 58 58 58 58 58 58 58 58 58 58 58 58 58 58 58 58 58 58 58 58 58 58 58 58 58 58 58 58 58 58 58 58 58 59 59 59 59 59 59 59 59 59 59 59 59 59
2802E9%%%%%%%%jJj%%%%%%%%%%%%%J%%%%%%%J%%%%J%%J%%%%%J%%J%%%J%%%%JJ%J%JJ%J%JJ
2795G3JJJJJKKJLKLLMNNPQQJ0J1J1J2J2J2J1J0RPMK%mnqj0j2j2j3j2j3j1j1j0qpoomlllkk
2789G7jjjkjj%jjjj%j%jj%j%%j%%j%j%%%%%%%%%j%%%%%%%%%%%j%%%j%%%%j%%%%%%%%%%%%%
2782E5%j%%%%%%%%j%%%%%%%%%%%j%%%%%%%%j%%%%j%j%%%%%%J%JKJJKJKJKKJJJJJJJ%J%%%%
2775G3%j%%%%j%%%j%j%%%j%%%%%%J%%%J%%%%J%%%%%%%%%%%%%J%%%%J%%%j%%%Jj%j%j%%j%%
2767F9j%%j%%j%J%%J%%%J%J%%J%%%%%%%%%%%J%%%J%%%J%%J%%J%%J%J%J%%%%%%j%%j%%jjj%
2760G4jj%j%j%jjjjj%%j%%%%JJ%%JJJJKJKJKJKJKJJJ%%%%%%j%j%%%j%j%j%%%j%jj%%%j%%%
2752G8%J%JJJJJKJKJKJKJJJJJ%%%%%%%%j%j%%%j%%%%%%j%%%%JJKKKLMMNOOOPOOONNMMKLJJ
$$ plain form
2802 59 59 59 59 59 59 59 59 59 58 59 58 58 58 58 58 58 58 58 58 58 58 58 58 58 59 59 59 59 59 59 59 59 60 60 60 60 60 61 61 61 62 62 62 62 62 62 63 63 63 64 64 64 64 65 65 65 65 65 66 67 67 68 68 69 70 70 71 71 72 73
2795 73 74 75 76 77 78 80 82 83 86 88 91 94 98 103 108 115 123 131 141 152 163 175 187 199 210 220 229 236 240 242 242 238 233 225 215 203 191 178 166 153 142 131 121 113 106 100 94 90 87 84 81 79 77
2789 77 76 75 74 72 71 70 70 69 68 67 66 66 65 65 64 63 63 62 62 62 61 61 61 60 60 59 59 59 59 59 59 59 59 59 59 58 58 58 58 58 58 58 58 58 58 58 58 57 57 57 57 56 56 56 56 56 55 55 55 55 55 55 55 55 55 55 55 55 55 55
2782 55 55 54 54 54 54 54 54 54 54 54 53 53 53 53 53 53 53 53 53 53 53 53 52 52 52 52 52 52 52 52 52 51 51 51 51 51 50 50 49 49 49 49 49 49 49 50 50 51 53 54 55 57 58 60 61 63 65 66 67 68 69 70 71 72 72 73 73 73 73 73
2775 73 73 72 72 72 72 72 71 71 71 71 70 70 69 69 69 69 68 68 68 68 68 68 68 69 69 69 69 70 70 70 70 70 71 71 71 71 71 71 71 71 71 71 71 71 71 71 72 72 72 72 72 73 73 73 73 72 72 72 72 73 72 72 71 71 70 70 70 69 69 69
2767 69 68 68 68 67 67 67 66 66 67 67 67 68 68 68 68 69 69 70 70 70 71 71 71 71 71 71 71 71 71 71 71 71 72 72 72 72 73 73 73 73 74 74 74 75 75 75 76 76 76 77 77 78 78 79 79 79 79 79 79 79 78 78 78 77 77 77 76 75 74 74
2760 74 73 72 72 71 71 70 70 69 68 67 66 65 65 65 64 64 64 64 64 65 66 66 66 67 68 69 70 72 73 75 76 78 79 81 82 84 85 86 87 87 87 87 87 87 87 86 86 85 85 85 85 84 84 83 83 82 82 82 82 81 81 80 79 79 79 79 78 78 78 78
2752 78 78 79 79 80 81 82 83 84 86 87 89 90 92 93 95 96 97 98 99 100 100 100 100 100 100 100 100 100 99 99 98 98 98 98 97 97 97 97 97 97 97 96 96 96 96 96 97 98 100 102 104 107 111 115 120 126 132 138 145 151 157 163 168 173 177 181 183 186 187 188
2745A88%%%jjkkllmnopqj0j0j0j2j1j1rqoljJMPRJ1J3J4J5J6J6J6J6J5J4J3J3J1J2J0J0RR
2740C09QPPPNNNMLLLKLLMMNOOPQRRRRJ0RRRQRQQQQQRJ0J1J2J4J4J6J7J9K1K2K3K5K6K8K8K9
2734H68L1L2L4L6L9M2M6N0N6O3O9P8Q6R5J04J13J22J32J40J49J56J64J72J81J90K03K19K38
2731C908K66L00L46M03M77N68O79Q11R63J135J321J515J704J879K021K118K153K119K011J825
2729B8522J570J251Q81M80O3l54p56j127j454j726j936k078k153k160k105j998j848j671j479
2727I922j283j096r22p70o37n27m36l64l05k59k23j95j74j56j44j33j26j18j13j08j04j01
2725A628r6r3q9q4q1p6p2o7o3n7n3m7m3l8l4k9k5k2j8j6j2j1rrqprrj1j2j4j5j8j8j9k0j9
2721C05j9j7j5j3j2j0rpnnnmmmmnnmnnmnmllkkj%KJLLLMNNOOOPPQPQPPPONMLK%klnopqrj0
$$ plain form
2745 188 188 188 188 187 186 184 182 179 176 172 167 161 154 146 136 126 116 104 93 82 73 65 59 56 55 56 60 67 76 87 100 114 129 145 161 177 193 208 222 235 248 259 271 281 291 300 309
2740 309 317 324 331 338 343 348 353 357 360 363 366 368 371 374 378 382 387 393 399 406 414 423 432 441 450 460 469 478 487 495 504 512 520 528 536 544 553 563 574 586 600 614 630 647 666 687 709 732 757 783 811 839 868
2734 868 899 931 965 1001 1040 1082 1128 1178 1234 1297 1366 1444 1530 1625 1729 1842 1964 2096 2236 2385 2541 2705 2877 3058 3248 3451 3670 3908
2731 3908 4174 4474 4820 5223 5700 6268 6947 7758 8721 9856 11177 12692 14396 16275 18296 20414 22567 24686 26697 28522
2729 28522 30092 31343 32224 32704 32767 32413 31657 30530 29076 27350 25414 23336 21183 19023 16918 14920 13072 11401 9922
2727 9922 8639 7543 6621 5851 5214 4687 4251 3887 3582 3323 3100 2905 2731 2575 2431 2298 2172 2054 1941 1833 1729 1628
2725 1628 1532 1439 1350 1266 1185 1109 1037 970 907 850 797 750 707 669 635 606 581 559 541 525 513 502 493 484 476 469 460 451 440 428 414 399 381 363 344 324 305
2721 305 286 269 254 241 229 219 210 203 198 193 188 184 180 176 172 167 162 158 153 148 144 139 135 132 129 127 125 124 124 126 127 130 133 136 140 145 150 156 162 168 175 182 190 197 205 212 219 226 232 237 241 244 246 246 244 241 236 230 223 215 206 196
2714A96j0j1j0j0rrqppopnonmmlkjj%KKMLNONONNMMMKKJJjjjjkkkkkkkkkjkjkkjkjkjkjjj
2707I0kj%%%%J%J%JJ%J%J%J%%%%j%%jjjjjjjjjj%jj%%J%%%J%JJJJJJJJ%J%%%%%%%j%%j%jj
2700H8%j%jjjkjjjjjjjkjjjk%jjjj%j%j%jj%j%%%j%%J%J%%J%%J%%J%%%J%%%%%%%J%%%%%%%
2693F5%%%%%%%%%%J%%j%%j%%%j%%j%%j%%j%%%%%j%%%%j%%%j%j%j%%%%%%%%%%%j%J%%%%%J%
2685E6j%%%%%%j%%%jj%jj%jj%j%%j%%%%%%JJJKJKKLKKKKKJJJJ%%%jjj%jj%jj%j%j%j%%%J%
2678F4%%%j%%%%%%%%%%%%%%%%%%%%%%%%jJ%%%%%%%%%j%%%%%%%%j%%%%%%%%%%J%%%%%%%%%%
2670F2J%%j%%J%%%%%%%%%J%%J%j%%%J%J%J%JJJ%JJ%JJJJJKJKKLLLMNNPPRJ0J1J1J2J3J2J1
2664B10J0RPNKjmopj0j2j2j3j3j2j2j1j0qppnmmlkkkjjjjjjjj%jjj%%%j%j%j%j%j%%%%j%%
$$ plain form
2714 196 186 175 165 155 146 137 129 122 115 109 102 97 91 86 82 78 75 73 72 71 71 73 75 79 82 87 93 98 104 109 114 118 122 126 128 130 131 132 131 130 129 128 126 124 122 120 118 116 114 112 110 109 107 106 104 102 101 99 98 96 95 93 92 91 90
2707 90 88 87 87 87 87 87 88 88 89 89 90 91 91 92 92 93 93 94 94 94 94 94 93 93 93 92 91 90 89 88 87 86 85 84 83 83 82 81 81 81 82 82 82 82 83 83 84 85 86 87 88 89 90 91 91 92 92 92 92 92 92 92 92 91 91 91 90 90 89 88
2700 88 88 87 87 86 85 84 82 81 80 79 78 77 76 75 73 72 71 70 68 68 67 66 65 64 64 63 63 62 62 61 60 60 59 59 59 59 58 58 58 59 59 60 60 60 61 61 61 62 62 62 63 63 63 63 64 64 64 64 64 64 64 64 65 65 65 65 65 65 65 65
2693 65 65 65 65 65 65 65 65 65 65 65 66 66 66 65 65 65 64 64 64 64 63 63 63 62 62 62 61 61 61 60 60 60 60 60 60 59 59 59 59 59 58 58 58 58 57 57 56 56 55 55 55 55 55 55 55 55 55 55 55 55 54 54 55 55 55 55 55 55 56 56
2685 56 55 55 55 55 55 55 55 54 54 54 54 53 52 52 51 50 50 49 48 48 47 47 47 46 46 46 46 46 46 46 47 48 49 51 52 54 56 59 61 63 65 67 69 70 71 72 73 73 73 73 72 71 70 70 69 68 68 67 66 66 65 65 64 64 63 63 63 63 64 64
2678 64 64 64 64 63 63 63 63 63 63 63 63 63 63 63 63 63 63 63 63 63 63 63 63 63 63 63 63 63 62 63 63 63 63 63 63 63 63 63 63 62 62 62 62 62 62 62 62 62 61 61 61 61 61 61 61 61 61 61 61 62 62 62 62 62 62 62 62 62 62 62
2670 62 63 63 63 62 62 62 63 63 63 63 63 63 63 63 63 63 64 64 64 65 65 64 64 64 64 65 65 66 66 67 67 68 69 70 70 71 72 72 73 74 75 76 77 79 80 82 84 87 90 93 97 102 107 114 121 130 140 151 162 174 187 199 210
2664 210 220 229 236 241 243 242 238 232 225 215 203 191 178 165 153 141 130 120 112 105 98 93 89 85 82 80 78 76 75 74 73 72 71 70 69 68 68 67 66 65 65 65 65 64 64 63 63 62 62 61 61 60 60 60 60 60 59 59 59
2657E9j%J%%%%%%j%%%%%%%%j%%%%%%j%%%%%%J%%%%%%%%%%%%%%%%%%%%%%%%%%%%%%%%%%%%%
2650E7%%J%%%%%j%%%%%%%%%%j%%%%%%%%%%%%%%%%Jj%%%%%J%%%%J%%jJ%j%%%%%%%%%%%%%%%
2643E7%%%%%%%%%%%%%%%%%%%%%%%%%%%%%%%%%%%j%%%%%%%%%%%%%%%J%%%j%%%%%%%%%%%%%J
2635E7j%%%%%J%%%%%j%%%%%%%J%%%%%%j%J%%%%%%%%%%%%j%%%%Jj%%%%%%%%%%%%%%%j%%%%%
2628E5%%%%%%%%%%%%Jj%%%%%%%%%%%%%%%%%j%J%%%%%%%%%%%%j%J%%%%%%%%%%%%%%%J%%%%j
2620E5%%Jj%%%%J%%%%%%%%%%j%%%%%J%%%j%%%%%%%%%%%J%%%%%%%jJ%%%j%%%%%%%%%%%%%%%
2613E5%%%%%%%%%%%%%%J%%%j%%J%%%%%%%j%%%%%%%%%%%%%%jJ%%%j%%%%J%%%%j%%%%%J%%%%
2606E5%j%%J%%%%j%%%%%J%%%%%%%%%%%%%%%%%%%j%%%%%%%%%%%%%%%%%%%%%%%%%%J%%%%%%%
$$ plain form
2657 59 58 58 59 59 59 59 59 59 59 58 58 58 58 58 58 58 58 58 57 57 57 57 57 57 57 56 56 56 56 56 56 56 57 57 57 57 57 57 57 57 57 57 57 57 57 57 57 57 57 57 57 57 57 57 57 57 57 57 57 57 57 57 57 57 57 57 57 57 57 57
2650 57 57 57 58 58 58 58 58 58 57 57 57 57 57 57 57 57 57 57 57 56 56 56 56 56 56 56 56 56 56 56 56 56 56 56 56 56 57 56 56 56 56 56 56 57 57 57 57 57 58 58 58 57 58 58 57 57 57 57 57 57 57 57 57 57 57 57 57 57 57 57
2643 57 57 57 57 57 57 57 57 57 57 57 57 57 57 57 57 57 57 57 57 57 57 57 57 57 57 57 57 57 57 57 57 57 57 57 57 56 56 56 56 56 56 56 56 56 56 56 56 56 56 56 56 57 57 57 57 56 56 56 56 56 56 56 56 56 56 56 56 56 56 57
2635 57 56 56 56 56 56 56 57 57 57 57 57 57 56 56 56 56 56 56 56 56 57 57 57 57 57 57 57 56 56 57 57 57 57 57 57 57 57 57 57 57 57 57 56 56 56 56 56 57 56 56 56 56 56 56 56 56 56 56 56 56 56 56 56 56 55 55 55 55 55 55
2628 55 55 55 55 55 55 55 55 55 55 55 55 55 56 55 55 55 55 55 55 55 55 55 55 55 55 55 55 55 55 55 55 54 54 55 55 55 55 55 55 55 55 55 55 55 55 55 54 54 55 55 55 55 55 55 55 55 55 55 55 55 55 55 55 55 56 56 56 56 56 55
2620 55 55 55 56 55 55 55 55 55 56 56 56 56 56 56 56 56 56 56 56 55 55 55 55 55 55 56 56 56 56 55 55 55 55 55 55 55 55 55 55 55 55 56 56 56 56 56 56 56 56 55 56 56 56 56 55 55 55 55 55 55 55 55 55 55 55 55 55 55 55 55
2613 55 55 55 55 55 55 55 55 55 55 55 55 55 55 55 56 56 56 56 55 55 55 56 56 56 56 56 56 56 56 55 55 55 55 55 55 55 55 55 55 55 55 55 55 55 54 55 55 55 55 54 54 54 54 54 55 55 55 55 55 54 54 54 54 54 54 55 55 55 55 55
2606 55 55 54 54 54 55 55 55 55 55 54 54 54 54 54 54 55 55 55 55 55 55 55 55 55 55 55 55 55 55 55 55 55 55 55 55 54 54 54 54 54 54 54 54 54 54 54 54 54 54 54 54 54 54 54 54 54 54 54 54 54 54 54 55 55 55 55 55 55 55 55
2598E5%%%%%%%%%%%%%%%%%%%%%%%%%%%%%%%%%%%%%%%%%%%%%%j%%J%%j%%%%%%%J%j%%%%%%%
2591E4%%%%%%%J%%%%%%%%j%%Jj%%%%J%%%%%%%%j%%J%%%%%%j%%%J%%j%%J%%%%%%%%%%%%%%%
2583E5%j%%%%%%%%%%%%%%%%%%%%%%%%%%%%%%%%%jJ%%%%%%%J%%%%%%%%%%%%%%%%%%%%%j%%%
2576E4%%%%%%%%%%%%%%%%%%%%%%%%%%%%%%%%%Jj%J%%%%jJ%%jJ%j%%%%%%%%%Jj%%%%%%%%%%
2568E4%%%%%%%%%%%%%%%%%%%%%%%%%%%J%%j%%%Jj%%%%%%%%%%jJ%%%%%%%%%%%%%%%%%%%%%%
2561E4%%%%%%jJ%%%%%%%%%j%%%%J%%%%%%%%%%%%%%%%jJ%%%%%%%%%%%%%%%%%%%%j%%%J%%%%
2554E4%%%%%%%%%%%%%%%%%%%%%%%%J%%%%%%%%%j%Jj%%%Jj%Jj%%J%%%%%%%%%%%%%Jj%%%%j%
2546E4%%%%%%j%%%J%%%%%%%%%%%%%jJ%%%%%%%%%%%%%%%%%%%%%%%%%%%%%%%%%%%%%%%%%%%%
$$ plain form
2598 55 55 55 55 55 55 55 55 55 55 55 55 55 55 55 55 55 55 55 55 55 55 55 55 55 55 55 55 55 55 55 55 55 55 55 55 55 55 55 55 55 55 55 55 55 55 55 54 54 54 55 55 55 54 54 54 54 54 54 54 54 55 55 54 54 54 54 54 54 54 54
2591 54 54 54 54 54 54 54 54 55 55 55 55 55 55 55 55 55 54 54 54 55 54 54 54 54 54 55 55 55 55 55 55 55 55 55 54 54 54 55 55 55 55 55 55 55 54 54 54 54 55 55 55 54 54 54 55 55 55 55 55 55 55 55 55 55 55 55 55 55 55 55
2583 55 55 54 54 54 54 54 54 54 54 54 54 54 54 54 54 54 54 54 54 54 54 54 54 54 54 54 54 54 54 54 54 54 54 54 54 53 54 54 54 54 54 54 54 54 55 55 55 55 55 55 55 55 55 55 55 55 55 55 55 55 55 55 55 55 55 55 54 54 54 54
2576 54 54 54 54 54 54 54 54 54 54 54 54 54 54 54 54 54 54 54 54 54 54 54 54 54 54 54 54 54 54 54 54 54 54 55 54 54 55 55 55 55 55 54 55 55 55 54 55 55 54 54 54 54 54 54 54 54 54 54 55 54 54 54 54 54 54 54 54 54 54 54
2568 54 54 54 54 54 54 54 54 54 54 54 54 54 54 54 54 54 54 54 54 54 54 54 54 54 54 54 54 55 55 55 54 54 54 54 55 54 54 54 54 54 54 54 54 54 54 54 53 54 54 54 54 54 54 54 54 54 54 54 54 54 54 54 54 54 54 54 54 54 54 54
2561 54 54 54 54 54 54 54 53 54 54 54 54 54 54 54 54 54 54 53 53 53 53 53 54 54 54 54 54 54 54 54 54 54 54 54 54 54 54 54 54 53 54 54 54 54 54 54 54 54 54 54 54 54 54 54 54 54 54 54 54 54 54 53 53 53 53 54 54 54 54 54
2554 54 54 54 54 54 54 54 54 54 54 54 54 54 54 54 54 54 54 54 54 54 54 54 54 54 55 55 55 55 55 55 55 55 55 55 54 54 55 54 54 54 54 55 54 54 55 54 54 54 55 55 55 55 55 55 55 55 55 55 55 55 55 55 56 55 55 55 55 55 54 54
2546 54 54 54 54 54 54 54 53 53 53 53 54 54 54 54 54 54 54 54 54 54 54 54 54 54 53 54 54 54 54 54 54 54 54 54 54 54 54 54 54 54 54 54 54 54 54 54 54 54 54 54 54 54 54 54 54 54 54 54 54 54 54 54 54 54 54 54 54 54 54 54
2539E4%%%%%%%%%%%%%%%Jj%%%%%%%%%%%%j%%%J%%%%%%%%%%%%%%%%%%%%%%%%%%j%%J%%%%%J
2531E5j%%%%jJ%j%%J%%%%%j%%%%%%%%%%%J%%%%%%%%%%%%%%%%%%%%%%%%%%%%%j%%%J%%%%%%
2524E4%%%%%%%%%%%%%%%%%%%%%%%%%%%%%%%%%%%%%%%%%%%%%%%%%%%%%%%%%%%%%%%%%%%%%%
2517E4%%%%%J%%%j%%%%%%%j%Jj%%%%%%%%%%%%%%%%%J%%j%%%%%%%%%%%%%%%%%%J%%j%%%%%%
2509E3%%%%%J%%%%%%%%%%%%j%%%J%%%%%%%%%%%%%%%%%%%%%%j%%%%J%%%%%%j%%%%%%J%%%%%
2502E4%j%%%J%%%%%%%%%%j%%%%%%%%J%%%%j%%%%%%%%J%%%%%%%%j%%%J%%%j%%%%%%%%%%J%%
2494E4%%%%%%%%%%%%%%%%%j%%%%%%%%%%%%%%%%%%%%%%%%%%J%%%jJ%%%%%%j%%%Jj%%%%%%%%
2487E3%%%%%%%%J%%%%%%%%%%j%J%%%j%%%J%j%%%%%%J%%%%%%%%j%%%J%%%%%%%j%%%%%J%j%%
$$ plain form
2539 54 54 54 54 54 54 54 54 54 54 54 54 54 54 54 54 55 54 54 54 54 54 54 54 54 54 54 54 54 54 53 53 53 53 54 54 54 54 54 54 54 54 54 54 54 54 54 54 54 54 54 54 54 54 54 54 54 54 54 54 54 53 53 53 54 54 54 54 54 54 55
2531 55 54 54 54 54 54 53 54 54 53 53 53 54 54 54 54 54 54 53 53 53 53 53 53 53 53 53 53 53 53 54 54 54 54 54 54 54 54 54 54 54 54 54 54 54 54 54 54 54 54 54 54 54 54 54 54 54 54 54 54 53 53 53 53 54 54 54 54 54 54 54
2524 54 54 54 54 54 54 54 54 54 54 54 54 54 54 54 54 54 54 54 54 54 54 54 54 54 54 54 54 54 54 54 54 54 54 54 54 54 54 54 54 54 54 54 54 54 54 54 54 54 54 54 54 54 54 54 54 54 54 54 54 54 54 54 54 54 54 54 54 54 54 54
2517 54 54 54 54 54 54 55 55 55 55 54 54 54 54 54 54 54 54 53 53 54 53 53 53 53 53 53 53 53 53 53 53 53 53 53 53 53 53 53 54 54 54 53 53 53 53 53 53 53 53 53 53 53 53 53 53 53 53 53 53 53 54 54 54 53 53 53 53 53 53 53
2509 53 53 53 53 53 53 54 54 54 54 54 54 54 54 54 54 54 54 54 53 53 53 53 54 54 54 54 54 54 54 54 54 54 54 54 54 54 54 54 54 54 54 54 54 54 54 53 53 53 53 53 54 54 54 54 54 54 54 53 53 53 53 53 53 53 54 54 54 54 54 54
2502 54 54 53 53 53 53 54 54 54 54 54 54 54 54 54 54 54 53 53 53 53 53 53 53 53 53 54 54 54 54 54 53 53 53 53 53 53 53 53 53 54 54 54 54 54 54 54 54 54 53 53 53 53 54 54 54 54 53 53 53 53 53 53 53 53 53 53 53 54 54 54
2494 54 54 54 54 54 54 54 54 54 54 54 54 54 54 54 54 54 54 53 53 53 53 53 53 53 53 53 53 53 53 53 53 53 53 53 53 53 53 53 53 53 53 53 53 53 54 54 54 54 53 54 54 54 54 54 54 54 53 53 53 53 54 53 53 53 53 53 53 53 53 53
2487 53 53 53 53 53 53 53 53 53 54 54 54 54 54 54 54 54 54 54 54 53 53 54 54 54 54 53 53 53 53 54 54 53 53 53 53 53 53 53 54 54 54 54 54 54 54 54 54 53 53 53 53 54 54 54 54 54 54 54 54 53 53 53 53 53 53 54 54 53 53 53
2479E3%%%%%%%%%%Jj%%%%%%%%%%%%%%%%%%%%%%%%%%%%%%%%%%%%J%%%%%j%%%%%%%%%%%%%%%
2472E3%%%%J%j%%%%%%%%%%%%%%%%%%%%%%%%%%%%%%%%%%%%%%%%%%%%%%%%%%%%%%%%%%%%%%%
2465E3%%%%%%%%%%%%Jj%%%%J%%%%%%%j%%%%%%%%%%%%%%%%%%%%%%%%%%%%%%%%%%%%%%%%%%%
2457E3%%%%%%%%%%%%%%%J%%%%j%%%jJ%%%%%%%%j%%%J%%%%%%%%%%%%%%%%%%%%J%%j%%%%%%j
2450E2J%Jj%%J%%j%%%%%%%%%%%%%%J%%%%j%%%%%%%%%%%%%J%%j%%%%%J%%j%%%%Jj%%%%%%%J
2442E4%%%%%%jJ%%%%j%Jj%%%%Jj%%%%J%%j%%%%%%%J%%%%%j%%%%%%%%%%j%J%%%%jJ%%%%%%%
2435E3%%%J%j%%%%%%%%%%%%%%%%%%%%%%%%%%jJ%%%%%%%%%%%%%%%%%%%%%%%%%%%%%%%%%%%%
2428E3%%%j%%%J%j%%%%J%%%%%%%%%%%%jJ%%%%%%j%%%%J%%%%%%%%%%J%j%%%%%%%%Jj%%%%%%
$$ plain form
2479 53 53 53 53 53 53 53 53 53 53 53 54 53 53 53 53 53 53 53 53 53 53 53 53 53 53 53 53 53 53 53 53 53 53 53 53 53 53 53 53 53 53 53 53 53 53 53 53 53 54 54 54 54 54 54 53 53 53 53 53 53 53 53 53 53 53 53 53 53 53 53
2472 53 53 53 53 53 54 54 53 53 53 53 53 53 53 53 53 53 53 53 53 53 53 53 53 53 53 53 53 53 53 53 53 53 53 53 53 53 53 53 53 53 53 53 53 53 53 53 53 53 53 53 53 53 53 53 53 53 53 53 53 53 53 53 53 53 53 53 53 53 53 53
2465 53 53 53 53 53 53 53 53 53 53 53 53 53 54 53 53 53 53 53 54 54 54 54 54 54 54 54 53 53 53 53 53 53 53 53 53 53 53 53 53 53 53 53 53 53 53 53 53 53 53 53 53 53 53 53 53 53 53 53 53 53 53 53 53 53 53 53 53 53 53 53
2457 53 53 53 53 53 53 53 53 53 53 53 53 53 53 53 53 54 54 54 54 54 53 53 53 53 52 53 53 53 53 53 53 53 53 53 52 52 52 52 53 53 53 53 53 53 53 53 53 53 53 53 53 53 53 53 53 53 53 53 53 54 54 54 53 53 53 53 53 53 53 52
2450 52 53 53 54 53 53 53 54 54 54 53 53 53 53 53 53 53 53 53 53 53 53 53 53 53 54 54 54 54 54 53 53 53 53 53 53 53 53 53 53 53 53 53 53 54 54 54 53 53 53 53 53 53 54 54 54 53 53 53 53 53 54 53 53 53 53 53 53 53 53 54
2442 54 54 54 54 54 54 54 53 54 54 54 54 54 53 53 54 53 53 53 53 53 54 53 53 53 53 53 54 54 54 53 53 53 53 53 53 53 53 54 54 54 54 54 54 53 53 53 53 53 53 53 53 53 53 53 52 52 53 53 53 53 53 52 53 53 53 53 53 53 53 53
2435 53 53 53 53 54 54 53 53 53 53 53 53 53 53 53 53 53 53 53 53 53 53 53 53 53 53 53 53 53 53 53 53 53 52 53 53 53 53 53 53 53 53 53 53 53 53 53 53 53 53 53 53 53 53 53 53 53 53 53 53 53 53 53 53 53 53 53 53 53 53 53
2428 53 53 53 53 52 52 52 52 53 53 52 52 52 52 52 53 53 53 53 53 53 53 53 53 53 53 53 53 52 53 53 53 53 53 53 53 52 52 52 52 52 53 53 53 53 53 53 53 53 53 53 53 54 54 53 53 53 53 53 53 53 53 53 54 53 53 53 53 53 53 53
2420E3%%%%j%%%J%%%%%%%%j%%J%%%%%%%%%%%%%%%%%%%%%%%%%%%%%%%%J%%%j%%%%%%%%%%%%
2413E3%%%%%%%%jJ%%%%%%%%%%%%%%%%%%%%%%%%%%%%%%%%%%%%%%%%%%%%%%%%%%%%%%%%%%%%
2405E3%%%%%%%%%%%%%%%%%%%%%%%%%%%%%%%%%%j%%%%%%%%%%J%%%%%%%%%%%%%%%%%%%%%%%%
2398E3%%%%%%%%%%j%%%J%%%%%%%%%%Jj%%%%%%%%j%J%%%%%%%%%%%%%%%%%%%%%%%%%%%%%%%%
2390E3%%%%%%%%%%%%%%%%%%%%%%%%J%j%%%%%%%%%%%%%%%%%%%%%%%%%%%Jj%%%%%%%%%%%%%%
2383E3%%%%%%%%%%j%%J%%%%%%%%%%%%%%%%%%%%%%%%%%%%%%%%%%%%%%%%%%%%%%J%j%%%%%%%
2376E3%%%%%%%%%%%%%%%%%%%%%%%%%%%%%%%%%%%%%%%j%%%J%%%%%%%%%%%%%%%%%%%%Jj%%%J
2368E4%%%j%%%%%%Jj%%%%%%%%%%%%%%%%%%%%%%%J%j%%%%%%%%%%%%%%%%%%%%%%%%%%%%%%%%
$$ plain form
2420 53 53 53 53 53 52 52 52 52 53 53 53 53 53 53 53 53 53 52 52 52 53 53 53 53 53 53 53 53 53 53 53 53 53 53 53 53 53 53 53 53 53 53 53 53 53 53 53 53 53 53 53 53 53 54 54 54 54 53 53 53 53 53 53 53 53 53 53 53 53 53
2413 53 53 53 53 53 53 53 53 53 52 53 53 53 53 53 53 53 53 53 53 53 53 53 53 53 53 53 53 53 53 53 53 53 53 53 53 53 53 53 53 53 53 53 53 53 53 53 53 53 53 53 53 53 53 53 53 53 53 53 53 53 53 53 53 53 53 53 53 53 53 53
2405 53 53 53 53 53 53 53 53 53 53 53 53 53 53 53 53 53 53 53 53 53 53 53 53 53 53 53 53 53 53 53 53 53 53 53 52 52 52 52 52 52 52 52 52 52 52 53 53 53 53 53 53 53 53 53 53 53 53 53 53 53 53 53 53 53 53 53 53 53 53 53
2398 53 53 53 53 53 53 53 53 53 53 53 52 52 52 52 53 53 53 53 53 53 53 53 53 53 53 54 53 53 53 53 53 53 53 53 53 52 52 53 53 53 53 53 53 53 53 53 53 53 53 53 53 53 53 53 53 53 53 53 53 53 53 53 53 53 53 53 53 53 53 53
2390 53 53 53 53 53 53 53 53 53 53 53 53 53 53 53 53 53 53 53 53 53 53 53 53 53 54 54 53 53 53 53 53 53 53 53 53 53 53 53 53 53 53 53 53 53 53 53 53 53 53 53 53 53 53 53 54 53 53 53 53 53 53 53 53 53 53 53 53 53 53 53
2383 53 53 53 53 53 53 53 53 53 53 53 52 52 52 53 53 53 53 53 53 53 53 53 53 53 53 53 53 53 53 53 53 53 53 53 53 53 53 53 53 53 53 53 53 53 53 53 53 53 53 53 53 53 53 53 53 53 53 53 53 53 54 54 53 53 53 53 53 53 53 53
2376 53 53 53 53 53 53 53 53 53 53 53 53 53 53 53 53 53 53 53 53 53 53 53 53 53 53 53 53 53 53 53 53 53 53 53 53 53 53 53 53 52 52 52 52 53 53 53 53 53 53 53 53 53 53 53 53 53 53 53 53 53 53 53 53 53 54 53 53 53 53 54
2368 54 54 54 54 53 53 53 53 53 53 53 54 53 53 53 53 53 53 53 53 53 53 53 53 53 53 53 53 53 53 53 53 53 53 53 53 54 54 53 53 53 53 53 53 53 53 53 53 53 53 53 53 53 53 53 53 53 53 53 53 53 53 53 53 53 53 53 53 53 53 53
2361E3%%j%%%J%J%%j%%%%%%%%%%%%%%%%%%%%%%%%%%%%%%%%%%%%%%%%%%%%%%%%%%%%%%%%%%
2353E3%%%%%%%%%%Jj%%%%%%%%%%%%%%%%%%%%%%%%%%%%%%%%%%%%%%%%%%%Jj%%%%%%%%%%%%%
2346E3%%%%%J%%%%%j%%%%jJ%%%%%%%%%%%%%%%%%%%%%%%%%%%%%%%%%%%%%%%J%%%%j%%%%%%%
2339E3%J%%j%%%%%%%%%%%%j%J%%%%%%%%%%%%%%%%%%%%%%%%%%%%j%Jj%%%%Jj%%%%%J%%j%%%
2331E2%%J%%%%j%%J%j%J%%%%%%%%%%%%%%%%%%%%%%%%%%%J%j%%%%%%%%%%%%j%%%%%%J%j%%%
2324E2%%%%%%%%%%%%%%%%%%%%%%Jj%%J%%j%J%%%%%j%J%%%%%%j%%%%J%%%%%%%%%%J%j%%%%J
2316E4%%%%%%%%j%%%%%%%%%%J%%%j%%%%%%%%%%%%%%%%%%%%j%%%%%%%%%%%%%%%%%%%%%J%%%
2309E3%%%%%j%J%%%%%%%%%%%%%%%%%%%%%%%%%%%%%%%Jj%%jJ%%j%%%%%%%%%%%%%%%%%J%%%%
$$ plain form
2361 53 53 53 52 52 52 52 53 53 54 54 54 53 53 53 53 53 53 53 53 53 53 53 53 53 53 53 53 53 53 53 53 53 53 53 53 53 53 53 53 53 53 53 53 53 53 53 53 53 53 53 53 53 53 53 53 53 53 53 53 53 53 53 53 53 53 53 53 53 53 53
2353 53 53 53 53 53 53 53 53 53 53 53 54 53 53 53 53 53 53 53 53 53 53 53 53 53 53 53 53 53 53 53 53 53 53 53 53 53 53 53 53 53 53 53 53 53 53 53 53 53 53 53 53 53 53 53 53 54 53 53 53 53 53 53 53 53 53 53 53 53 53 53
2346 53 53 53 53 53 53 54 54 54 54 54 54 53 53 53 53 53 52 53 53 53 53 53 53 53 53 53 53 53 53 53 53 53 53 53 53 53 53 53 53 53 53 53 53 53 53 53 53 53 53 53 53 53 53 53 53 53 53 54 54 54 54 54 53 53 53 53 53 53 53 53
2339 53 53 54 54 54 53 53 53 53 53 53 53 53 53 53 53 53 53 52 52 53 53 53 53 53 53 53 53 53 53 53 53 53 53 53 53 53 53 53 53 53 53 53 53 53 53 53 53 53 52 52 53 52 52 52 52 52 53 52 52 52 52 52 52 53 53 53 52 52 52 52
2331 52 52 52 53 53 53 53 53 52 52 52 53 53 52 52 53 53 53 53 53 53 53 53 53 53 53 53 53 53 53 53 53 53 53 53 53 53 53 53 53 53 53 53 54 54 53 53 53 53 53 53 53 53 53 53 53 53 53 52 52 52 52 52 52 52 53 53 52 52 52 52
2324 52 52 52 52 52 52 52 52 52 52 52 52 52 52 52 52 52 52 52 52 52 52 52 53 52 52 52 53 53 53 52 52 53 53 53 53 53 53 52 52 53 53 53 53 53 53 53 52 52 52 52 52 53 53 53 53 53 53 53 53 53 53 53 54 54 53 53 53 53 53 54
2316 54 54 54 54 54 54 54 54 54 53 53 53 53 53 53 53 53 53 53 53 54 54 54 54 53 53 53 53 53 53 53 53 53 53 53 53 53 53 53 53 53 53 53 53 53 52 52 52 52 52 52 52 52 52 52 52 52 52 52 52 52 52 52 52 52 52 52 53 53 53 53
2309 53 53 53 53 53 53 52 52 53 53 53 53 53 53 53 53 53 53 53 53 53 53 53 53 53 53 53 53 53 53 53 53 53 53 53 53 53 53 53 53 54 53 53 53 52 53 53 53 52 52 52 52 52 52 52 52 52 52 52 52 52 52 52 52 52 52 53 53 53 53 53
2301E3%%%j%J%%%%%%%%%%%%%%%%%%%%%%%%%%%%%J%%%%j%%%%%%%%%%%%%%%%j%%J%%%%%%%j%
2294E2%%%Jj%%%%%%%%%J%%%%%%j%%J%%%%%%%j%%%%%%%%%%%%%%%%%%%%%%%%%%%%%J%%j%%%%
2287E2%%%%%%%%%%%%%%%%%Jj%%%%%%%%%%%j%%%%J%%%%%%%%j%%%%%%%%%%%%%%J%%%%%%%%%%
2279E2%%Jj%%%J%j%%%%%%%%%%%%%%J%j%%%j%%%Jj%%%%Jj%%%%J%j%%%%%%%J%%%%%%%%%%%%%
2272E2j%%J%%%%%%%%%%%%%%%%%%%%%%%%%%%%%%j%%%%%J%%%%%%%%%%%%%%%%%%%%%%%j%%%J%
2264E2%%%j%%%%%%%%%%%%%%j%%%%%%%%%J%%%%%J%%%%%%%%%%%%%%%%%%%%J%%%%%%%%%%%%%%
2257E3%%j%J%%%%j%%%J%j%%%%%%%%%%%%%%jJ%%%%Jj%%%%%%%%%%%J%%j%J%%%%%%%%%%%%%%%
2250E3%%%%%%%%j%%%J%%%%%jJ%%%j%%%%%%%%%%J%%j%%%%%%%%%%J%%%%%j%%%%%%%J%j%%J%j
$$ plain form
2301 53 53 53 53 52 52 53 53 53 53 53 53 53 53 53 53 53 53 53 53 53 53 53 53 53 53 53 53 53 53 53 53 53 53 53 53 54 54 54 54 54 53 53 53 53 53 53 53 53 53 53 53 53 53 53 53 53 53 52 52 52 53 53 53 53 53 53 53 53 52 52
2294 52 52 52 52 53 52 52 52 52 52 52 52 52 52 52 53 53 53 53 53 53 53 52 52 52 53 53 53 53 53 53 53 53 52 52 52 52 52 52 52 52 52 52 52 52 52 52 52 52 52 52 52 52 52 52 52 52 52 52 52 52 52 52 53 53 53 52 52 52 52 52
2287 52 52 52 52 52 52 52 52 52 52 52 52 52 52 52 52 52 52 53 52 52 52 52 52 52 52 52 52 52 52 52 51 51 51 51 51 52 52 52 52 52 52 52 52 52 51 51 51 51 51 51 51 51 51 51 51 51 51 51 51 52 52 52 52 52 52 52 52 52 52 52
2279 52 52 52 53 52 52 52 52 53 53 52 52 52 52 52 52 52 52 52 52 52 52 52 52 52 53 53 52 52 52 52 51 51 51 51 52 51 51 51 51 51 52 51 51 51 51 51 52 52 51 51 51 51 51 51 51 51 52 52 52 52 52 52 52 52 52 52 52 52 52 52
2272 52 51 51 51 52 52 52 52 52 52 52 52 52 52 52 52 52 52 52 52 52 52 52 52 52 52 52 52 52 52 52 52 52 52 52 51 51 51 51 51 51 52 52 52 52 52 52 52 52 52 52 52 52 52 52 52 52 52 52 52 52 52 52 52 52 51 51 51 51 52 52
2264 52 52 52 52 51 51 51 51 51 51 51 51 51 51 51 51 51 51 51 50 50 50 50 50 50 50 50 50 50 51 51 51 51 51 51 52 52 52 52 52 52 52 52 52 52 52 52 52 52 52 52 52 52 52 52 52 53 53 53 53 53 53 53 53 53 53 53 53 53 53 53
2257 53 53 53 52 52 53 53 53 53 53 52 52 52 52 53 53 52 52 52 52 52 52 52 52 52 52 52 52 52 52 52 51 52 52 52 52 52 53 52 52 52 52 52 52 52 52 52 52 52 52 53 53 53 52 52 53 53 53 53 53 53 53 53 53 53 53 53 53 53 53 53
2250 53 53 53 53 53 53 53 53 53 52 52 52 52 53 53 53 53 53 53 52 53 53 53 53 52 52 52 52 52 52 52 52 52 52 52 53 53 53 52 52 52 52 52 52 52 52 52 52 52 53 53 53 53 53 53 52 52 52 52 52 52 52 52 53 53 52 52 52 53 53 52
2242E2%%j%%J%j%%%%%%%j%%%%%%%%%%Jj%%%J%%%j%J%%%%%%%%%%J%%j%Jj%%J%%%%%%jJ%%%%
2235E2%%%%%%%%%%%%j%Jj%%%%%%%%%%%%%%%%%%%%%%%%%%%%%J%%jJ%%%%%%%J%%J%%JJ%JJ%J
2227E9J%%%%jj%jj%jj%%%%j%%%%%%%%%%%%%%j%%J%%%%j%%%%%%Jj%%%%%%%%%%%%%%%%J%%j%
2220E2%%%%%%J%%%%%%%%%%%%J%j%%%%%%%%%%%%%%%%%%%%%%%%%%%%%%%%%%%%%%%%%%%%%%%%
2212E3%%%%j%%%J%%%%%%%%%%%%%%%%%%%%%%%%%%%%%%%%%%j%Jj%%%%%%J%%%%%%%%%%%%%j%%
2205E2%%%%%%J%%%%%%%%%%%j%%%J%%%j%J%%%%%%%%%%%%%%%%%%%%%%%%%%%%%%%%%%%%%j%%%
2198E2J%j%%%%%%%%%%%%%%%%%%%%%%%%%%%%%%%%%%%%%%J%%j%%j%%J%%%%%%%%%%%%%%%%%%%
2190E2%%%%%%%%%%%%%%%%%%%%%%%%%%%j%%%%%%%%%%%%%%%%J%%%%%%%%jJ%%%%%%%%%%%%%%%
$$ plain form
2242 52 52 52 51 51 51 52 52 51 51 51 51 51 51 51 51 50 50 50 50 50 50 50 50 50 50 50 51 50 50 50 50 51 51 51 51 50 50 51 51 51 51 51 51 51 51 51 51 51 52 52 52 51 51 52 51 51 51 52 52 52 52 52 52 52 51 52 52 52 52 52
2235 52 52 52 52 52 52 52 52 52 52 52 52 52 51 51 52 51 51 51 51 51 51 51 51 51 51 51 51 51 51 51 51 51 51 51 51 51 51 51 51 51 51 51 51 51 51 52 52 52 51 52 52 52 52 52 52 52 52 53 53 53 54 54 54 55 56 56 57 58 58 59
2227 59 60 60 60 60 60 59 58 58 57 56 56 55 54 54 54 54 54 53 53 53 53 53 53 53 53 53 53 53 53 53 53 53 52 52 52 53 53 53 53 53 52 52 52 52 52 52 52 53 52 52 52 52 52 52 52 52 52 52 52 52 52 52 52 52 52 53 53 53 52 52
2220 52 52 52 52 52 52 52 53 53 53 53 53 53 53 53 53 53 53 53 53 54 54 53 53 53 53 53 53 53 53 53 53 53 53 53 53 53 53 53 53 53 53 53 53 53 53 53 53 53 53 53 53 53 53 53 53 53 53 53 53 53 53 53 53 53 53 53 53 53 53 53
2212 53 53 53 53 53 52 52 52 52 53 53 53 53 53 53 53 53 53 53 53 53 53 53 53 53 53 53 53 53 53 53 53 53 53 53 53 53 53 53 53 53 53 53 53 52 52 53 52 52 52 52 52 52 52 53 53 53 53 53 53 53 53 53 53 53 53 53 53 52 52 52
2205 52 52 52 52 52 52 52 53 53 53 53 53 53 53 53 53 53 53 53 52 52 52 52 53 53 53 53 52 52 53 53 53 53 53 53 53 53 53 53 53 53 53 53 53 53 53 53 53 53 53 53 53 53 53 53 53 53 53 53 53 53 53 53 53 53 53 53 52 52 52 52
2198 52 53 53 52 52 52 52 52 52 52 52 52 52 52 52 52 52 52 52 52 52 52 52 52 52 52 52 52 52 52 52 52 52 52 52 52 52 52 52 52 52 52 53 53 53 52 52 52 51 51 51 52 52 52 52 52 52 52 52 52 52 52 52 52 52 52 52 52 52 52 52
2190 52 52 52 52 52 52 52 52 52 52 52 52 52 52 52 52 52 52 52 52 52 52 52 52 52 52 52 52 51 51 51 51 51 51 51 51 51 51 51 51 51 51 51 51 51 52 52 52 52 52 52 52 52 52 51 52 52 52 52 52 52 52 52 52 52 52 52 52 52 52 52
2183E2%%%%%%%%j%%%%J%%%%%%%j%%%%%%%%Jj%%%%%%%%%%%%Jj%%%J%%%%%j%J%%%%%%%%%%%%
2175E2%%%%%%%%%%%%%%%%%%%j%%%%%%J%%%%%%%%%%%%%%%%%%%%%%%%%%%%%%%%%%%%%%%%%%%
2168E2%%%%%%%%%%%%%%%%%%%%%%%%%%j%J%%%%%%%%%%%%%%%%%%%%%%JjJ%%%%%%j%Jj%%%%%%
2160E2%%%J%j%%%%%%%%%%j%%%J%%%%%%j%%%%%%J%%%%%%%%%%%%%%%%%%%%%%%%%%%%%%%%%%%
2153E2%%%%%%%%j%J%jJ%%%%%%%%%%%%%%%%%%%%%%%j%J%%%%%%%%%%%%%%%%%%jJ%%%%%%%%%%
2146E2%%%%%%%%%%%%%%%%%%%%%%%%%%%%%%%%%%%jJ%j%%%%%%%%%J%%%%%jJ%%%%%%%%%%%%%%
2138E2%%%j%%%%%%J%%%%%%%%j%%%%%%%%%%%%%%%%%%%%%%%%%j%%J%%%%%J%%%j%%%%%%%J%%%
2131E2j%%%J%%%j%%%%%%%%%J%%%%%j%%%%%%%%%%%%%Jj%%%%%%%%%%%%%%%%%%%%%%%%%%%%%%
$$ plain form
2183 52 52 52 52 52 52 52 52 52 51 51 51 51 51 52 52 52 52 52 52 52 52 51 51 51 51 51 51 51 51 51 52 51 51 51 51 51 51 51 51 51 51 51 51 51 52 51 51 51 51 52 52 52 52 52 52 51 51 52 52 52 52 52 52 52 52 52 52 52 52 52
2175 52 52 52 52 52 52 52 52 52 52 52 52 52 52 52 52 52 52 52 52 51 51 51 51 51 51 51 52 52 52 52 52 52 52 52 52 52 52 52 52 52 52 52 52 52 52 52 52 52 52 52 52 52 52 52 52 52 52 52 52 52 52 52 52 52 52 52 52 52 52 52
2168 52 52 52 52 52 52 52 52 52 52 52 52 52 52 52 52 52 52 52 52 52 52 52 52 52 52 52 51 51 52 52 52 52 52 52 52 52 52 52 52 52 52 52 52 52 52 52 52 52 52 52 52 53 52 53 53 53 53 53 53 53 52 52 53 52 52 52 52 52 52 52
2160 52 52 52 52 53 53 52 52 52 52 52 52 52 52 52 52 52 51 51 51 51 52 52 52 52 52 52 52 51 51 51 51 51 51 51 52 52 52 52 52 52 52 52 52 52 52 52 52 52 52 52 52 52 52 52 52 52 52 52 52 52 52 52 52 52 52 52 52 52 52 52
2153 52 52 52 52 52 52 52 52 52 51 51 52 52 51 52 52 52 52 52 52 52 52 52 52 52 52 52 52 52 52 52 52 52 52 52 52 52 52 51 51 52 52 52 52 52 52 52 52 52 52 52 52 52 52 52 52 52 52 52 51 52 52 52 52 52 52 52 52 52 52 52
2146 52 52 52 52 52 52 52 52 52 52 52 52 52 52 52 52 52 52 52 52 52 52 52 52 52 52 52 52 52 52 52 52 52 52 52 52 51 52 52 51 51 51 51 51 51 51 51 51 51 52 52 52 52 52 52 51 52 52 52 52 52 52 52 52 52 52 52 52 52 52 52
2138 52 52 52 52 51 51 51 51 51 51 51 52 52 52 52 52 52 52 52 52 51 51 51 51 51 51 51 51 51 51 51 51 51 51 51 51 51 51 51 51 51 51 51 51 51 51 50 50 50 51 51 51 51 51 51 52 52 52 52 51 51 51 51 51 51 51 51 52 52 52 52
2131 52 51 51 51 51 52 52 52 52 51 51 51 51 51 51 51 51 51 51 52 52 52 52 52 52 51 51 51 51 51 51 51 51 51 51 51 51 51 51 52 51 51 51 51 51 51 51 51 51 51 51 51 51 51 51 51 51 51 51 51 51 51 51 51 51 51 51 51 51 51 51
2123E1J%%j%%%%%%%%%J%%%%%%%%%%%%j%%%%J%j%%%%%J%%%j%%%%%%%J%%%%%%%%%j%%%%%%%%
2116E1J%%%%j%%%%J%%%%%j%%%%J%%j%%%%%%%%%%%%%%%%J%%%j%%%%%%J%%%%%%%%%j%%J%%%j
2109E1%J%%%%%%j%%%%%J%%%j%%%%%Jj%%%Jj%%Jj%%%%%%%%%%%%%%%%%%%%%%%%%%%%J%%%%%%
2101E2%%%%%%%%j%%%%J%%%j%%J%%%%%%%%j%%%%%%%%%%J%j%%%%%Jj%%%%%%%%%%%%%%%%%%%%
2094E1%%%%%%%%%J%j%%%%%%%%%%%%%%%%%%%%%%%%%%%%%%%%%%Jj%%%J%%%%%%j%%%%J%%%%j%
2086E1%%%%%%%%%%Jj%%%%%%%%%%%%%%%%%%%%%%%%%%%%%%%%%%Jj%%%%%%%%%%%%%%%%%%%%%%
2079E1%%%%%%%%%%%%%%%%%%%%%%%%%%%%%%%%%%%%%%%%%%%%%%%%%%%%%%%%%%%%%%%%%%%%%%
2071E1%%%%%%%%%%%%%%%%%%%%%%%%%%J%%%j%%%%%%%%%%%%%J%%%%%j%%%%%%J%%%%%%%%%%%j
$$ plain form
2123 51 52 52 52 51 51 51 51 51 51 51 51 51 51 52 52 52 52 52 52 52 52 52 52 52 52 52 51 51 51 51 51 52 52 51 51 51 51 51 51 52 52 52 52 51 51 51 51 51 51 51 51 52 52 52 52 52 52 52 52 52 52 51 51 51 51 51 51 51 51 51
2116 51 52 52 52 52 52 51 51 51 51 51 52 52 52 52 52 52 51 51 51 51 51 52 52 52 51 51 51 51 51 51 51 51 51 51 51 51 51 51 51 51 51 52 52 52 52 51 51 51 51 51 51 51 52 52 52 52 52 52 52 52 52 52 51 51 51 52 52 52 52 51
2109 51 51 52 52 52 52 52 52 52 51 51 51 51 51 51 52 52 52 52 51 51 51 51 51 51 52 51 51 51 51 52 51 51 51 52 51 51 51 51 51 51 51 51 51 51 51 51 51 51 51 51 51 51 51 51 51 51 51 51 51 51 51 51 51 52 52 52 52 52 52 52
2101 52 52 52 52 52 52 52 52 52 51 51 51 51 51 52 52 52 52 51 51 51 52 52 52 52 52 52 52 52 52 51 51 51 51 51 51 51 51 51 51 51 52 52 51 51 51 51 51 51 52 51 51 51 51 51 51 51 51 51 51 51 51 51 51 51 51 51 51 51 51 51
2094 51 51 51 51 51 51 51 51 51 51 52 52 51 51 51 51 51 51 51 51 51 51 51 51 51 51 51 51 51 51 51 51 51 51 51 51 51 51 51 51 51 51 51 51 51 51 51 52 51 51 51 51 52 52 52 52 52 52 52 51 51 51 51 51 52 52 52 52 52 51 51
2086 51 51 51 51 51 51 51 51 51 51 51 52 51 51 51 51 51 51 51 51 51 51 51 51 51 51 51 51 51 51 51 51 51 51 51 51 51 51 51 51 51 51 51 51 51 51 51 52 51 51 51 51 51 51 51 51 51 51 51 51 51 51 51 51 51 51 51 51 51 51 51
2079 51 51 51 51 51 51 51 51 51 51 51 51 51 51 51 51 51 51 51 51 51 51 51 51 51 51 51 51 51 51 51 51 51 51 51 51 51 51 51 51 51 51 51 51 51 51 51 51 51 51 51 51 51 51 51 51 51 51 51 51 51 51 51 51 51 51 51 51 51 51 51
2071 51 51 51 51 51 51 51 51 51 51 51 51 51 51 51 51 51 51 51 51 51 51 51 51 51 51 51 52 52 52 52 51 51 51 51 51 51 51 51 51 51 51 51 51 51 52 52 52 52 52 52 51 51 51 51 51 51 51 52 52 52 52 52 52 52 52 52 52 52 52 51
2064E1%%%%%%%%%%Jj%%%%%%%%%%%%%%%%%%%%%%%%%%%%%%%%jJ%%%%%%%%%%%%%%%%%%%%%%%%
2057E1%%%%%%%%%%%%%%%%%%%%%%%%%%%%%%%%J%%%j%%%%%%%%%%%%%%%%%%%%%%%%%j%J%%%%%
2049E1%%%j%%J%%%%%%%%%%%%%%%%J%j%%%%%%%%%%%%%%%%%%%%%%%%%%%%%%%%%%%%%%%%J%j%
2042E1%%%%%%%%%%%%%%%%%%J%%j%%%%%%%%%Jj%%%%%%%%%%%%%%%%%%%J%%%j%%%%%%%J%j%%%
2034E1jJ%%%%%%%%%%%%%%%%%%%%%%%%%%%%%%%%%%%%%%%%%J%j%%%%%%%%%%%%%%%%%%%%j%%J
2027E1%%j%%%J%%%%%%%%%%%%%%%%%%%%%%%%%J%%%%%%%%%J%j%%%%%%%%%%%%%%%%%%%%%%%%%
2020E2%j%%%%%%%%%%%%%%%J%%%%%%%%%%%%%%%%%%%%%J%%%%%%%%%%%%%%%%%%j%%%%%%%%%%%
2012E2%%%%jJ%%%%%%j%%%%%%%%%%J%%%j%%%%J%j%%%%%%J%%%%%%%%%%J%%%%%j%%j%J%%%%%%
$$ plain form
2064 51 51 51 51 51 51 51 51 51 51 51 52 51 51 51 51 51 51 51 51 51 51 51 51 51 51 51 51 51 51 51 51 51 51 51 51 51 51 51 51 51 51 51 51 51 50 51 51 51 51 51 51 51 51 51 51 51 51 51 51 51 51 51 51 51 51 51 51 51 51 51
2057 51 51 51 51 51 51 51 51 51 51 51 51 51 51 51 51 51 51 51 51 51 51 51 51 51 51 51 51 51 51 51 51 51 52 52 52 52 51 51 51 51 51 51 51 51 51 51 51 51 51 51 51 51 51 51 51 51 51 51 51 51 51 51 50 50 51 51 51 51 51 51
2049 51 51 51 51 50 50 50 51 51 51 51 51 51 51 51 51 51 51 51 51 51 51 51 51 52 52 51 51 51 51 51 51 51 51 51 51 51 51 51 51 51 51 51 51 51 51 51 51 51 51 51 51 51 51 51 51 51 51 51 51 51 51 51 51 51 51 51 52 52 51 51
2042 51 51 51 51 51 51 51 51 51 51 51 51 51 51 51 51 51 51 51 52 52 52 51 51 51 51 51 51 51 51 51 51 52 51 51 51 51 51 51 51 51 51 51 51 51 51 51 51 51 51 51 51 51 52 52 52 52 51 51 51 51 51 51 51 51 52 52 51 51 51 51
2034 51 50 51 51 51 51 51 51 51 51 51 51 51 51 51 51 51 51 51 51 51 51 51 51 51 51 51 51 51 51 51 51 51 51 51 51 51 51 51 51 51 51 51 51 52 52 51 51 51 51 51 51 51 51 51 51 51 51 51 51 51 51 51 51 51 51 51 50 50 50 51
2027 51 51 51 50 50 50 50 51 51 51 51 51 51 51 51 51 51 51 51 51 51 51 51 51 51 51 51 51 51 51 51 51 51 52 52 52 52 52 52 52 52 52 52 53 53 52 52 52 52 52 52 52 52 52 52 52 52 52 52 52 52 52 52 52 52 52 52 52 52 52 52
2020 52 52 51 51 51 51 51 51 51 51 51 51 51 51 51 51 51 51 52 52 52 52 52 52 52 52 52 52 52 52 52 52 52 52 52 52 52 52 52 52 53 53 53 53 53 53 53 53 53 53 53 53 53 53 53 53 53 53 53 52 52 52 52 52 52 52 52 52 52 52 52
2012 52 52 52 52 52 51 52 52 52 52 52 52 52 51 51 51 51 51 51 51 51 51 51 51 52 52 52 52 51 51 51 51 51 52 52 51 51 51 51 51 51 51 52 52 52 52 52 52 52 52 52 52 52 53 53 53 53 53 53 52 52 52 51 51 52 52 52 52 52 52 52
2005E2%%%%%%j%%%%%%%%%%%%%%%%%%%%%%%%%%%%%%%%%%%%%%%%%%%%j%%%%J%%j%%%J%j%%%%
1997E0J%%%%%%%%%%%%%j%%%%%%%%J%%%%%%%%%%%%%%%%%%%%%%%%%%%%%%%%%%%%%%%%%%%%%%
1990E1j%%%%%%J%%%%%%%%%%%%%%%%%%%%%%%%%%%%%%j%J%%%%%%%%%%%%%%%%%%%%%%%%j%J%%
1982E1%%Jj%%%%%%%%%%%%%%%%%%%%%%%%%%%%%%%%%%%%%%%%%%%%%%%%%%%%%%%%J%%%j%%%%%
1975E1%%%%%%%%%%%%%%%%%%%%%%%%%%%%%%%%%%%%%%%%%%%%%%%%%%%%%%%%%J%%j%%%J%%%j%
1968E1%%%%%%%j%J%%%%%%%%%%%%%%%%%%%%%jJ%%j%J%%%%%%%%Jj%%%%%%%%%%%%%%%%%%%%%%
1960E1%%%%%%%%%j%%%%J%%%%%%%%%%%%%%%%%%%%%%%%%%%%%%%%%%%%%%%%%%%%%%%%%%%%%%%
1953E1%%%%%%%%%%%%%%J%jJj%%%%%%%%%%%%%%%%%%%Jj%%%%%%%%%%%%%%%%%%%%Jj%%%%%%%%
$$ plain form
2005 52 52 52 52 52 52 52 51 51 51 51 51 51 51 51 51 51 51 51 51 51 51 51 51 51 51 51 51 51 51 51 51 51 51 51 51 51 51 51 51 51 51 51 51 51 51 51 51 51 51 51 51 50 50 50 50 50 51 51 51 50 50 50 50 51 51 50 50 50 50 50
1997 50 51 51 51 51 51 51 51 51 51 51 51 51 51 51 50 50 50 50 50 50 50 50 50 51 51 51 51 51 51 51 51 51 51 51 51 51 51 51 51 51 51 51 51 51 51 51 51 51 51 51 51 51 51 51 51 51 51 51 51 51 51 51 51 51 51 51 51 51 51 51
1990 51 50 50 50 50 50 50 50 51 51 51 51 51 51 51 51 51 51 51 51 51 51 51 51 51 51 51 51 51 51 51 51 51 51 51 51 51 51 51 50 50 51 51 51 51 51 51 51 51 51 51 51 51 51 51 51 51 51 51 51 51 51 51 51 51 51 50 50 51 51 51
1982 51 51 51 52 51 51 51 51 51 51 51 51 51 51 51 51 51 51 51 51 51 51 51 51 51 51 51 51 51 51 51 51 51 51 51 51 51 51 51 51 51 51 51 51 51 51 51 51 51 51 51 51 51 51 51 51 51 51 51 51 51 52 52 52 52 51 51 51 51 51 51
1975 51 51 51 51 51 51 51 51 51 51 51 51 51 51 51 51 51 51 51 51 51 51 51 51 51 51 51 51 51 51 51 51 51 51 51 51 51 51 51 51 51 51 51 51 51 51 51 51 51 51 51 51 51 51 51 51 51 51 52 52 52 51 51 51 51 52 52 52 52 51 51
1968 51 51 51 51 51 51 51 51 50 50 51 51 51 51 51 51 51 51 51 51 51 51 51 51 51 51 51 51 51 51 51 51 50 51 51 51 50 50 51 51 51 51 51 51 51 51 51 52 51 51 51 51 51 51 51 51 51 51 51 51 51 51 51 51 51 51 51 51 51 51 51
1960 51 51 51 51 51 51 51 51 51 51 50 50 50 50 50 51 51 51 51 51 51 51 51 51 51 51 51 51 51 51 51 51 51 51 51 51 51 51 51 51 51 51 51 51 51 51 51 51 51 51 51 51 51 51 51 51 51 51 51 51 51 51 51 51 51 51 51 51 51 51 51
1953 51 51 51 51 51 51 51 51 51 51 51 51 51 51 51 52 52 51 52 51 51 51 51 51 51 51 51 51 51 51 51 51 51 51 51 51 51 51 51 52 51 51 51 51 51 51 51 51 51 51 51 51 51 51 51 51 51 51 51 51 51 52 51 51 51 51 51 51 51 51 51
1945E1%%%%%%%%%%%J%%%%j%%%%%%%%%%%%%%%%%%%%%%%Jj%%%%%%%%%%%%%%%%%%%%%%%%%%%%
1938E1%%%%%%%%%%%%%%%%%%%%%%%J%%%%%%%j%%%%j%J%%%%%%%J%j%%%%%%%J%%%j%%%%%%%%%
1931E1%%%%%%%%%%%%%%%%%%%%%%%%%%%%Jj%%%%%%%%%%J%j%%%%%J%%%%%j%%%%%%%%%%%%%%%
1923E1%%%%%%%%%%%%%%%%%%%%%%%%%%%%%%j%%%J%%%%%%%%%%%%%%j%%J%%%%%%%j%%J%%%%%%
1916E1%%%%%%%%%%%%%%%%%%%%%%%%%%%%%%%%%%%%%%%%%%%%%%%%%%%%%%%%%%%%%%J%j%%%%%
1908E1%%%%%%%%%%%%%%%%%%%%%%%%%%%j%%%%%%%%%%Jj%%%%%%%%%%%%%%%%J%%%j%J%j%%%%%
1901E0%J%%j%%%J%j%%%%%Jj%J%%%%jJ%%%%%%%%%%%%j%J%j%%J%%%%%%%%%%%%%%%%%%%%%%%%
1893E1%%%%%%%%%J%%j%JjJ%%j%%%%%%%%J%%%%%%%%%%%%%%%%%%%%%%%%%%%%%%%%%%%%j%%%%
$$ plain form
1945 51 51 51 51 51 51 51 51 51 51 51 51 52 52 52 52 52 51 51 51 51 51 51 51 51 51 51 51 51 51 51 51 51 51 51 51 51 51 51 51 51 52 51 51 51 51 51 51 51 51 51 51 51 51 51 51 51 51 51 51 51 51 51 51 51 51 51 51 51 51 51
1938 51 51 51 51 51 51 51 51 51 51 51 51 51 51 51 51 51 51 51 51 51 51 51 51 52 52 52 52 52 52 52 52 51 51 51 51 51 50 50 51 51 51 51 51 51 51 51 52 52 51 51 51 51 51 51 51 51 52 52 52 52 51 51 51 51 51 51 51 51 51 51
1931 51 51 51 51 51 51 51 51 51 51 51 51 51 51 51 51 51 51 51 51 51 51 51 51 51 51 51 51 51 52 51 51 51 51 51 51 51 51 51 51 51 52 52 51 51 51 51 51 51 52 52 52 52 52 52 51 51 51 51 51 51 51 51 51 51 51 51 51 51 51 51
1923 51 51 51 51 51 51 51 51 51 51 51 51 51 51 51 51 51 51 51 51 51 51 51 51 51 51 51 51 51 51 51 50 50 50 50 51 51 51 51 51 51 51 51 51 51 51 51 51 51 51 50 50 50 51 51 51 51 51 51 51 51 50 50 50 51 51 51 51 51 51 51
1916 51 51 51 51 51 51 51 51 51 51 51 51 51 51 51 51 51 51 51 51 51 51 51 51 51 51 51 51 51 51 51 51 51 51 51 51 51 51 51 51 51 51 51 51 51 51 51 51 51 51 51 51 51 51 51 51 51 51 51 51 51 51 51 52 52 51 51 51 51 51 51
1908 51 51 51 51 51 51 51 51 51 51 51 51 51 51 51 51 51 51 51 51 51 51 51 51 51 51 51 51 50 50 50 50 50 50 50 50 50 50 50 51 50 50 50 50 50 50 50 50 50 50 50 50 50 50 50 50 50 51 51 51 51 50 50 51 51 50 50 50 50 50 50
1901 50 50 51 51 51 50 50 50 50 51 51 50 50 50 50 50 50 51 50 50 51 51 51 51 51 50 51 51 51 51 51 51 51 51 51 51 51 51 51 50 50 51 51 50 50 50 51 51 51 51 51 51 51 51 51 51 51 51 51 51 51 51 51 51 51 51 51 51 51 51 51
1893 51 51 51 51 51 51 51 51 51 51 52 52 52 51 51 52 51 52 52 52 51 51 51 51 51 51 51 51 51 52 52 52 52 52 52 52 52 52 52 52 52 52 52 52 52 52 52 52 52 52 52 52 52 52 52 52 52 52 52 52 52 52 52 52 52 52 51 51 51 51 51
1886E1%%%%%J%j%%%J%j%%%%%%%%%%%%j%%J%%j%%%%%%%%%%%J%%%%%%%%%%%%%j%%J%%%j%%%%
1879E0J%%%%%j%%%%J%%%%%%%%%%%%jJ%%%%%%%%%j%%%J%%%%%%%%%%%%%%%%j%%%%%%%%%%%J%
1871E1%%jJ%%%%%%%%%j%%%%%%%%%%%%%%%%%%%%%J%%j%%%%%%%%%%%%%%%%%%%%%%%%%%%%%%%
1864E0%%%%%%%%%jJ%%%%%%%%j%%J%%%Jj%%%%j%%%%%%%%%%%%%%%J%%%%j%%%%%%%%%%jJ%%%%
1856D9%j%%J%%%%j%J%%%%%%%%%%%%J%jJj%%%%%%%%J%%%%%%%%%%%%%%%%jJ%%J%%j%%%J%%%%
1849E1%%%%%%%%%%%%%%%j%%%%%%%%J%%%%%%%%%%%%%%%%J%%j%%%%J%%%%%%%%%%%%j%%%%%%%
1842E1%%%j%%%%%%%%%%%%%%%%%%%%%%%%%%%%%%%%%%%%J%j%%%%%%%%%%%%j%%%%%%%%%%%%%%
1834D9%%%%%%%%j%%%%J%%%%%%%%J%%%%%%%%%%%%%%%%%J%%%j%%%%%%%j%%%%%%%%%%%%%%%%%
$$ plain form
1886 51 51 51 51 51 51 52 52 51 51 51 51 52 52 51 51 51 51 51 51 51 51 51 51 51 51 51 50 50 50 51 51 51 50 50 50 50 50 50 50 50 50 50 50 50 51 51 51 51 51 51 51 51 51 51 51 51 51 51 50 50 50 51 51 51 51 50 50 50 50 50
1879 50 51 51 51 51 51 51 50 50 50 50 50 51 51 51 51 51 51 51 51 51 51 51 51 51 50 51 51 51 51 51 51 51 51 51 51 50 50 50 50 51 51 51 51 51 51 51 51 51 51 51 51 51 51 51 51 51 50 50 50 50 50 50 50 50 50 50 50 50 51 51
1871 51 51 51 50 51 51 51 51 51 51 51 51 51 51 50 50 50 50 50 50 50 50 50 50 50 50 50 50 50 50 50 50 50 50 50 50 51 51 51 50 50 50 50 50 50 50 50 50 50 50 50 50 50 50 50 50 50 50 50 50 50 50 50 50 50 50 50 50 50 50 50
1864 50 50 50 50 50 50 50 50 50 50 49 50 50 50 50 50 50 50 50 50 49 49 49 50 50 50 50 51 50 50 50 50 50 49 49 49 49 49 49 49 49 49 49 49 49 49 49 49 49 50 50 50 50 50 49 49 49 49 49 49 49 49 49 49 49 48 49 49 49 49 49
1856 49 49 48 48 48 49 49 49 49 49 48 48 49 49 49 49 49 49 49 49 49 49 49 49 49 50 50 49 50 49 49 49 49 49 49 49 49 49 50 50 50 50 50 50 50 50 50 50 50 50 50 50 50 50 50 49 50 50 50 51 51 51 50 50 50 50 51 51 51 51 51
1849 51 51 51 51 51 51 51 51 51 51 51 51 51 51 51 51 50 50 50 50 50 50 50 50 50 51 51 51 51 51 51 51 51 51 51 51 51 51 51 51 51 51 52 52 52 51 51 51 51 51 52 52 52 52 52 52 52 52 52 52 52 52 52 51 51 51 51 51 51 51 51
1842 51 51 51 51 50 50 50 50 50 50 50 50 50 50 50 50 50 50 50 50 50 50 50 50 50 50 50 50 50 50 50 50 50 50 50 50 50 50 50 50 50 51 51 50 50 50 50 50 50 50 50 50 50 50 50 50 49 49 49 49 49 49 49 49 49 49 49 49 49 49 49
1834 49 49 49 49 49 49 49 49 49 48 48 48 48 48 49 49 49 49 49 49 49 49 49 50 50 50 50 50 50 50 50 50 50 50 50 50 50 50 50 50 50 51 51 51 51 50 50 50 50 50 50 50 50 49 49 49 49 49 49 49 49 49 49 49 49 49 49 49 49 49 49
1827D9%%%%%%%%%%%%%%%%%%%J%%%%%%%%%%%J%%%%%%%%%J%%%J%%%%%j%%%%%%%j%%%J%%j%%%
1819E1%%%%%%%%%%%%%%J%%j%%%%%%j%%%%%Jj%%%%J%%j%J%%%J%%%%%%%%%%%%%%%%%j%J%%%%
1812E2%%%%%j%%%%%%%%%%j%%%%%%%%%%%%%%%%%%%%%%%%%%%%%%%%%%%%%%%%%%%%%%%J%%%j%
1804E0J%%%%%%%%%%%%%%%%%%%%j%%%%%%%%%J%%j%%J%%j%%%%%%%%J%j%%jJ%%%%%J%%%%%%jJ
1797E1%%%%%%%%%%%%%%%%%%%%%%%%%%%%%%%%%%%%%j%%%%%%%%%%%%%%%%%%%%%%%%J%%%j%%%
1790E0%%%%%%%%%%j%%%J%%%%%j%%%%%%%%%J%j%%%%%%%%j%%%%%%%%%%%%%%%%%%%%%%%%%%%%
1782D8%%%%%J%%%%%%%%%J%%j%%%%j%%%%J%j%%%%%%%%%%%%%%%%%J%%%%j%%%%%%%%%%%%%%Jj
1775D8%%%%%%%J%%%%Jj%%%J%%%%%%%%%%jJ%%%%j%%%%%%J%%%%jJ%%%%%%%%%%%%%%%%%%%%%%
$$ plain form
1827 49 49 49 49 49 49 49 49 49 49 49 49 49 49 49 49 49 49 49 49 50 50 50 50 50 50 50 50 50 50 50 50 51 51 51 51 51 51 51 51 51 51 52 52 52 52 53 53 53 53 53 53 52 52 52 52 52 52 52 52 51 51 51 51 52 52 52 51 51 51 51
1819 51 51 51 51 51 51 51 51 51 51 51 51 51 51 51 52 52 52 51 51 51 51 51 51 51 50 50 50 50 50 50 51 50 50 50 50 50 51 51 51 50 50 51 51 51 51 52 52 52 52 52 52 52 52 52 52 52 52 52 52 52 52 52 52 51 51 52 52 52 52 52
1812 52 52 52 52 52 52 51 51 51 51 51 51 51 51 51 51 51 50 50 50 50 50 50 50 50 50 50 50 50 50 50 50 50 50 50 50 50 50 50 50 50 50 50 50 50 50 50 50 50 50 50 50 50 50 50 50 50 50 50 50 50 50 50 50 50 51 51 51 51 50 50
1804 50 51 51 51 51 51 51 51 51 51 51 51 51 51 51 51 51 51 51 51 51 51 50 50 50 50 50 50 50 50 50 50 51 51 51 50 50 50 51 51 51 50 50 50 50 50 50 50 50 50 51 51 50 50 50 49 50 50 50 50 50 50 51 51 51 51 51 51 51 50 51
1797 51 51 51 51 51 51 51 51 51 51 51 51 51 51 51 51 51 51 51 51 51 51 51 51 51 51 51 51 51 51 51 51 51 51 51 51 51 51 50 50 50 50 50 50 50 50 50 50 50 50 50 50 50 50 50 50 50 50 50 50 50 50 50 51 51 51 51 50 50 50 50
1790 50 50 50 50 50 50 50 50 50 50 50 49 49 49 49 50 50 50 50 50 50 49 49 49 49 49 49 49 49 49 49 50 50 49 49 49 49 49 49 49 49 49 48 48 48 48 48 48 48 48 48 48 48 48 48 48 48 48 48 48 48 48 48 48 48 48 48 48 48 48 48
1782 48 48 48 48 48 48 49 49 49 49 49 49 49 49 49 49 50 50 50 49 49 49 49 49 48 48 48 48 48 49 49 48 48 48 48 48 48 48 48 48 48 48 48 48 48 48 48 48 48 49 49 49 49 49 48 48 48 48 48 48 48 48 48 48 48 48 48 48 48 49 48
1775 48 48 48 48 48 48 48 48 49 49 49 49 49 50 49 49 49 49 50 50 50 50 50 50 50 50 50 50 50 49 50 50 50 50 50 49 49 49 49 49 49 49 50 50 50 50 50 49 50 50 50 50 50 50 50 50 50 50 50 50 50 50 50 50 50 50 50 50 50 50 50
1767E0%%%%%%%J%%jJ%%%%%%%%%%j%J%%%%%%j%%%%%%J%%%%%%%%%%%%%%%%%%%%%%%%%%%%%%%
1760E1%Jj%%%%%%%%%%%%%%%%%%%%%%%%%%%%J%%%%%j%%%%%%%%%%%%%%%%%%%%%%%%%j%J%%%%
1753E1%%%%%j%%%%Jj%%%J%%j%%%%%%%J%%j%%%%%%J%%%%%%%%j%%%%J%%%%%%j%%%%%%%%%%%J
1745E1%j%%%%%%%%%%%%%%%%%%Jj%%%%%%%%%%%%%%%%%%%%%%%%Jj%%%%%%%%%%%%%%%%%%jJ%%
1738E0%%%%%j%%%J%%%%%%J%j%%%%%%%j%J%%%%%%%%%%%%j%%%%%%%%jJ%%%%%j%J%%%%jJ%%%%
1730D9%%%%%%%J%%%%%j%%%%%%%%%%%%%%%%%%%%%%%j%%J%%%%%j%J%%%%%%%%%%%J%%%%%%%j%
1723D9J%j%%J%%j%J%%%%%%%%%%%%%%%%%%%%%j%%%%%J%%%%%%%%%%%j%%J%%%%J%j%%%%%%%%J
1715E1%%%%Jj%J%%%j%%%%%j%%%%%%%%%%%%%%%%%%%%%%%%%%j%%J%%%%%j%%J%%%%%%%%%%%%%
$$ plain form
1767 50 50 50 50 50 50 50 50 51 51 51 50 51 51 51 51 51 51 51 51 51 51 51 50 50 51 51 51 51 51 51 51 50 50 50 50 50 50 50 51 51 51 51 51 51 51 51 51 51 51 51 51 51 51 51 51 51 51 51 51 51 51 51 51 51 51 51 51 51 51 51
1760 51 51 52 51 51 51 51 51 51 51 51 51 51 51 51 51 51 51 51 51 51 51 51 51 51 51 51 51 51 51 51 51 52 52 52 52 52 52 51 51 51 51 51 51 51 51 51 51 51 51 51 51 51 51 51 51 51 51 51 51 51 51 51 51 50 50 51 51 51 51 51
1753 51 51 51 51 51 51 50 50 50 50 50 51 50 50 50 50 51 51 51 50 50 50 50 50 50 50 50 51 51 51 50 50 50 50 50 50 50 51 51 51 51 51 51 51 51 51 50 50 50 50 50 51 51 51 51 51 51 51 50 50 50 50 50 50 50 50 50 50 50 50 51
1745 51 51 50 50 50 50 50 50 50 50 50 50 50 50 50 50 50 50 50 50 50 51 50 50 50 50 50 50 50 50 50 50 50 50 50 50 50 50 50 50 50 50 50 50 50 50 50 51 50 50 50 50 50 50 50 50 50 50 50 50 50 50 50 50 50 50 50 49 50 50 50
1738 50 50 50 50 50 50 49 49 49 49 50 50 50 50 50 50 50 51 51 50 50 50 50 50 50 50 50 49 49 50 50 50 50 50 50 50 50 50 50 50 50 50 49 49 49 49 49 49 49 49 49 48 49 49 49 49 49 49 48 48 49 49 49 49 49 48 49 49 49 49 49
1730 49 49 49 49 49 49 49 49 50 50 50 50 50 50 49 49 49 49 49 49 49 49 49 49 49 49 49 49 49 49 49 49 49 49 49 49 49 49 48 48 48 49 49 49 49 49 49 48 48 49 49 49 49 49 49 49 49 49 49 49 49 50 50 50 50 50 50 50 50 49 49
1723 49 50 50 49 49 49 50 50 50 49 49 50 50 50 50 50 50 50 50 50 50 50 50 50 50 50 50 50 50 50 50 50 50 49 49 49 49 49 49 50 50 50 50 50 50 50 50 50 50 50 50 49 49 49 50 50 50 50 50 51 51 50 50 50 50 50 50 50 50 50 51
1715 51 51 51 51 51 52 51 51 52 52 52 52 51 51 51 51 51 51 50 50 50 50 50 50 50 50 50 50 50 50 50 50 50 50 50 50 50 50 50 50 50 50 50 50 50 49 49 49 50 50 50 50 50 50 49 49 49 50 50 50 50 50 50 50 50 50 50 50 50 50 50
1708E0%%%%%%%%%%%%%%%%%%%%%%%%%j%%J%%%%%%%%%%%%%%%%%%%%%%%%%%%%%%%%%j%%%J%%%
1701E0%%%%%%%%%%%%%%%%%%%%%%jJ%%%%%%%%%%%%%%%j%%%%%%Jj%Jj%%J%%%%%%%%%j%%J%%%
1693E0%%j%%%%%%%%%%%%J%%j%%%%J%%%%%%%%j%J%%%%%%%j%%%%%%%J%%%%j%%J%%%%%%%%%%%
1686E0%%%%%j%%%%%J%%%%%%%%%%%%%%%%%%%%%%%%j%%%%%%%%%%%%%%%%%%%%%%%%%%%%%%%jJ
1678D9%%J%jJ%%%%%%%%%%%j%J%%%%%j%%J%%%%%%%j%%%%%%%%%%%%J%%%%%%%j%%%%%%%%%%%%
1671D9%%%%%%%%%%%%%%%J%%%%%%%%%%%%%%%%%%%%%%%%j%%%%%%%J%%%%%%j%%%%%%%%%%%%%%
1664D9%J%%%%%%%%%%%%%%%%%j%J%%%%%%%%%%%%%j%%%%%%%%Jj%J%%%%%%%%%%%%%%%%%%%%jJ
1656E0%%%%%J%%%J%%j%%%%%%j%%%%%%%%%%j%%J%%%j%%%%J%%%%%%%%%%J%%%%%j%%%%%%%%%%
$$ plain form
1708 50 50 50 50 50 50 50 50 50 50 50 50 50 50 50 50 50 50 50 50 50 50 50 50 50 50 49 49 49 50 50 50 50 50 50 50 50 50 50 50 50 50 50 50 50 50 50 50 50 50 50 50 50 50 50 50 50 50 50 50 50 50 50 49 49 49 49 50 50 50 50
1701 50 50 50 50 50 50 50 50 50 50 50 50 50 50 50 50 50 50 50 50 50 50 50 49 50 50 50 50 50 50 50 50 50 50 50 50 50 50 50 50 49 49 49 49 49 49 49 50 49 49 50 49 49 49 50 50 50 50 50 50 50 50 50 50 49 49 49 50 50 50 50
1693 50 50 50 49 49 49 49 49 49 49 49 49 49 49 49 49 50 50 50 49 49 49 49 49 50 50 50 50 50 50 50 50 50 49 49 50 50 50 50 50 50 50 50 49 49 49 49 49 49 49 49 50 50 50 50 50 49 49 49 50 50 50 50 50 50 50 50 50 50 50 50
1686 50 50 50 50 50 50 49 49 49 49 49 49 50 50 50 50 50 50 50 50 50 50 50 50 50 50 50 50 50 50 50 50 50 50 50 50 50 49 49 49 49 49 49 49 49 49 49 49 49 49 49 49 49 49 49 49 49 49 49 49 49 49 49 49 49 49 49 49 49 48 49
1678 49 49 49 50 50 49 50 50 50 50 50 50 50 50 50 50 50 50 49 49 50 50 50 50 50 50 49 49 49 50 50 50 50 50 50 50 50 49 49 49 49 49 49 49 49 49 49 49 49 49 50 50 50 50 50 50 50 50 49 49 49 49 49 49 49 49 49 49 49 49 49
1671 49 49 49 49 49 49 49 49 49 49 49 49 49 49 49 49 50 50 50 50 50 50 50 50 50 50 50 50 50 50 50 50 50 50 50 50 50 50 50 50 50 49 49 49 49 49 49 49 49 50 50 50 50 50 50 50 49 49 49 49 49 49 49 49 49 49 49 49 49 49 49
1664 49 49 50 50 50 50 50 50 50 50 50 50 50 50 50 50 50 50 50 50 49 49 50 50 50 50 50 50 50 50 50 50 50 50 50 50 49 49 49 49 49 49 49 49 49 50 49 49 50 50 50 50 50 50 50 50 50 50 50 50 50 50 50 50 50 50 50 50 50 49 50
1656 50 50 50 50 50 50 51 51 51 51 52 52 52 51 51 51 51 51 51 51 50 50 50 50 50 50 50 50 50 50 50 49 49 49 50 50 50 50 49 49 49 49 49 50 50 50 50 50 50 50 50 50 50 50 51 51 51 51 51 51 50 50 50 50 50 50 50 50 50 50 50
1649E0%%%%%%%%%%%J%%%%j%%%%jJ%j%J%%%j%%%J%%%%%%%%%%%%%J%j%%%%%%%%%%%%%%%%%%%
1641E0%%%%%%j%J%%%jJ%%%%%%%%%%%%%%%%%%%%%%%%%%%%%%%%%%%j%%%%%%J%%%%%%%j%%%%J
1634E0%%%%jJ%%%%%%jJ%%%%%%%j%%%%J%%%%%%%%j%%%J%%%%j%%%%%%%%%%%%%%%%%%%%%%%%%
1626D9%J%%%%%%j%%%%%%%jJ%%%%%%%%%%%%%%%%%%%%%j%%%%J%%%%%%%%%%%%%%%%%%%%%%%%%
1619D9Jj%%%%%%%%%%%%%%%%%%%J%%%%%%%%%j%%%%%%%%%%%%%%%%%%%J%%j%%%%%%%%%%%%%%%
1612D9%%%%%%%%%%%%%J%%%j%J%%j%%%%%%%%%%%%%%%%%%%%%%%%%%%%%%%%%%%%%%%J%j%%%%%
1604D9%%%%%%%%%%%%%%%%%%%%%%%%%%jJ%%%%%%%%%%%%%%%%%%%%%%%%%%%%Jj%j%%J%%%%%%%
1597D9%%%%%%%%%%%%%%j%%J%%%%%%%%%%%%%%%%%%%%%%%%%%%%%%%%%%%J%%%%%%%%%%%%j%J%
$$ plain form
1649 50 50 50 50 50 50 50 50 50 50 50 50 51 51 51 51 51 50 50 50 50 50 49 50 50 49 49 50 50 50 50 49 49 49 49 50 50 50 50 50 50 50 50 50 50 50 50 50 50 51 51 50 50 50 50 50 50 50 50 50 50 50 50 50 50 50 50 50 50 50 50
1641 50 50 50 50 50 50 50 49 49 50 50 50 50 49 50 50 50 50 50 50 50 50 50 50 50 50 50 50 50 50 50 50 50 50 50 50 50 50 50 50 50 50 50 50 50 50 50 50 50 50 49 49 49 49 49 49 49 50 50 50 50 50 50 50 50 49 49 49 49 49 50
1634 50 50 50 50 50 49 50 50 50 50 50 50 50 49 50 50 50 50 50 50 50 50 49 49 49 49 49 50 50 50 50 50 50 50 50 50 49 49 49 49 50 50 50 50 50 49 49 49 49 49 49 49 49 49 49 49 49 49 49 49 49 49 49 49 49 49 49 49 49 49 49
1626 49 49 50 50 50 50 50 50 50 49 49 49 49 49 49 49 49 48 49 49 49 49 49 49 49 49 49 49 49 49 49 49 49 49 49 49 49 49 49 49 48 48 48 48 48 49 49 49 49 49 49 49 49 49 49 49 49 49 49 49 49 49 49 49 49 49 49 49 49 49 49
1619 49 50 49 49 49 49 49 49 49 49 49 49 49 49 49 49 49 49 49 49 49 49 50 50 50 50 50 50 50 50 50 50 49 49 49 49 49 49 49 49 49 49 49 49 49 49 49 49 49 49 49 49 50 50 50 49 49 49 49 49 49 49 49 49 49 49 49 49 49 49 49
1612 49 49 49 49 49 49 49 49 49 49 49 49 49 49 50 50 50 50 49 49 50 50 50 49 49 49 49 49 49 49 49 49 49 49 49 49 49 49 49 49 49 49 49 49 49 49 49 49 49 49 49 49 49 49 49 49 49 49 49 49 49 49 49 50 50 49 49 49 49 49 49
1604 49 49 49 49 49 49 49 49 49 49 49 49 49 49 49 49 49 49 49 49 49 49 49 49 49 49 49 48 49 49 49 49 49 49 49 49 49 49 49 49 49 49 49 49 49 49 49 49 49 49 49 49 49 49 49 49 49 50 49 49 48 48 48 49 49 49 49 49 49 49 49
1597 49 49 49 49 49 49 49 49 49 49 49 49 49 49 49 48 48 48 49 49 49 49 49 49 49 49 49 49 49 49 49 49 49 49 49 49 49 49 49 49 49 49 49 49 49 49 49 49 49 49 49 49 49 49 50 50 50 50 50 50 50 50 50 50 50 50 50 49 49 50 50
1589E0%j%%%%%%%%%%%%%J%%j%%%%%%%%%%%%%%%%%%%%%%%%%%%%%%%%%%%%%%%%%%%%%%%%%%%
1582D9%%%%%%%%%%%%%%%%%%%%%%%%%%%%%%jJ%%%%%%%%%%%jJ%%%%%%%%%%%J%%%%%j%%%%%%%
1575D9%%%%%%%%%%%%%%%%%%%%%%%%%%%%%%%%jJ%%%%%%%%%%%%%%%%%%%%%%%%%%%%%%%%%%%%
1567D9%%%%%%%%%%%%%j%J%%%%%%%%%%%%%%%%%%%jJ%%%j%%%%%%%%J%%j%%%%%%%%J%j%%%%%J
1560D9%%%%%%%%%%%%%%%%J%j%%%%%%%%%%%%%%%%%%%%%%%%%%%%%%%%%%%%%%%%%%%%%%%%%%%
1552D9%%%%%%%%%%%%%%jJ%%%%%%%%%%%%%%%%%%%J%%%%%%%%j%%%%%J%j%%%Jj%%%%%%%%%%%%
1545D9%%%j%%J%%%%%%%%%%%%%%%%%%%%%%%%%%J%%%%j%%%%%%%%%%%%%%%%%%%%%%%%%%%%%%%
1537D9%%%%%%%%%%%%%%%%%%%%%%%%%%%%%%%%%%%%%%%%%%%%%%%%%%%%%j%%%J%j%%J%%%%%%%
$$ plain form
1589 50 50 49 49 49 49 49 49 49 49 49 49 49 49 49 49 50 50 50 49 49 49 49 49 49 49 49 49 49 49 49 49 49 49 49 49 49 49 49 49 49 49 49 49 49 49 49 49 49 49 49 49 49 49 49 49 49 49 49 49 49 49 49 49 49 49 49 49 49 49 49
1582 49 49 49 49 49 49 49 49 49 49 49 49 49 49 49 49 49 49 49 49 49 49 49 49 49 49 49 49 49 49 49 48 49 49 49 49 49 49 49 49 49 49 49 49 48 49 49 49 49 49 49 49 49 49 49 49 49 50 50 50 50 50 50 49 49 49 49 49 49 49 49
1575 49 49 49 49 49 49 49 49 49 49 49 49 49 49 49 49 49 49 49 49 49 49 49 49 49 49 49 49 49 49 49 49 49 48 49 49 49 49 49 49 49 49 49 49 49 49 49 49 49 49 49 49 49 49 49 49 49 49 49 49 49 49 49 49 49 49 49 49 49 49 49
1567 49 49 49 49 49 49 49 49 49 49 49 49 49 49 48 48 49 49 49 49 49 49 49 49 49 49 49 49 49 49 49 49 49 49 49 49 48 49 49 49 49 48 48 48 48 48 48 48 48 48 49 49 49 48 48 48 48 48 48 48 48 48 49 49 48 48 48 48 48 48 49
1560 49 49 49 49 49 49 49 49 49 49 49 49 49 49 49 49 49 50 50 49 49 49 49 49 49 49 49 49 49 49 49 49 49 49 49 49 49 49 49 49 49 49 49 49 49 49 49 49 49 49 49 49 49 49 49 49 49 49 49 49 49 49 49 49 49 49 49 49 49 49 49
1552 49 49 49 49 49 49 49 49 49 49 49 49 49 49 49 48 49 49 49 49 49 49 49 49 49 49 49 49 49 49 49 49 49 49 49 49 50 50 50 50 50 50 50 50 50 49 49 49 49 49 49 50 50 49 49 49 49 50 49 49 49 49 49 49 49 49 49 49 49 49 49
1545 49 49 49 49 48 48 48 49 49 49 49 49 49 49 49 49 49 49 49 49 49 49 49 49 49 49 49 49 49 49 49 49 49 49 50 50 50 50 50 49 49 49 49 49 49 49 49 49 49 49 49 49 49 49 49 49 49 49 49 49 49 49 49 49 49 49 49 49 49 49 49
1537 49 49 49 49 49 49 49 49 49 49 49 49 49 49 49 49 49 49 49 49 49 49 49 49 49 49 49 49 49 49 49 49 49 49 49 49 49 49 49 49 49 49 49 49 49 49 49 49 49 49 49 49 49 49 48 48 48 48 49 49 48 48 48 49 49 49 49 49 49 49 49
1530D9%%%j%%J%%%%%%%%%%%%%j%%%%%%%J%%%%%%%%%%%%%%%%%%%%%%%%%%%%%%J%j%%%%%%%%
1523D9%%%%%j%J%%%%%%%J%%j%%Jj%%%%%%%%%%%J%%%J%%%%%%%%%j%%%j%%%%%%%j%%J%%%%%%
1515D9%%%%%%%%%%%%%%%%%%%%%%%%%%%%%%%%J%j%%%%%%%%%%%%%%%%%%%jJ%%%%%%jJ%%%%%%
1508D9%%%J%%%%j%%%%Jj%%%%%%%%%%%%%%%%%%%%%%%%%%%%%%%%%%%%%%%%%%%%%%%%%%%%j%J
1500D9%%%%%%%%%%j%%%%%%J%jJ%%%%%%%%j%%%%%%Jj%%%%%%%%J%%j%J%%%%%jJ%%%%%%%%%%%
1493D9%%%%%%%%%%%%%%%%J%%%%%%%%%%J%J%J%%%%%j%%j%j%j%%%%%%%%j%%%%%%%J%%%%%%%j
1486D8%%%J%%j%%%%%%%%J%%%%%%%%%%%%%jJ%jJ%%j%%%J%%%%%j%%J%%j%%%J%%%%%%%%%%j%%
1478D8J%%%%%%%%%%%%%%%%%%%%%%%%%%%J%%J%%%J%%J%%%%j%j%%j%%j%%%%%%%%%%%%%%j%%%
$$ plain form
1530 49 49 49 49 48 48 48 49 49 49 49 49 49 49 49 49 49 49 49 49 49 48 48 48 48 48 48 48 48 49 49 49 49 49 49 49 49 49 49 49 49 49 49 49 49 49 49 49 49 49 49 49 49 49 49 49 49 49 49 49 50 50 49 49 49 49 49 49 49 49 49
1523 49 49 49 49 49 49 48 48 49 49 49 49 49 49 49 49 50 50 50 49 49 49 50 49 49 49 49 49 49 49 49 49 49 49 49 50 50 50 50 51 51 51 51 51 51 51 51 51 51 50 50 50 50 49 49 49 49 49 49 49 49 48 48 48 49 49 49 49 49 49 49
1515 49 49 49 49 49 49 49 49 49 49 49 49 49 49 49 49 49 49 49 49 49 49 49 49 49 49 49 49 49 49 49 49 49 50 50 49 49 49 49 49 49 49 49 49 49 49 49 49 49 49 49 49 49 49 49 48 49 49 49 49 49 49 49 48 49 49 49 49 49 49 49
1508 49 49 49 49 50 50 50 50 50 49 49 49 49 49 50 49 49 49 49 49 49 49 49 49 49 49 49 49 49 49 49 49 49 49 49 49 49 49 49 49 49 49 49 49 49 49 49 49 49 49 49 49 49 49 49 49 49 49 49 49 49 49 49 49 49 49 49 49 48 48 49
1500 49 49 49 49 49 49 49 49 49 49 49 48 48 48 48 48 48 48 49 49 48 49 49 49 49 49 49 49 49 49 48 48 48 48 48 48 48 49 48 48 48 48 48 48 48 48 48 49 49 49 48 48 49 49 49 49 49 49 48 49 49 49 49 49 49 49 49 49 49 49 49
1493 49 49 49 49 49 49 49 49 49 49 49 49 49 49 49 49 49 50 50 50 50 50 50 50 50 50 50 50 51 51 52 52 53 53 53 53 53 53 52 52 52 51 51 50 50 49 49 49 49 49 49 49 49 49 48 48 48 48 48 48 48 48 49 49 49 49 49 49 49 49 48
1486 48 48 48 48 49 49 49 48 48 48 48 48 48 48 48 48 49 49 49 49 49 49 49 49 49 49 49 49 49 49 48 49 49 48 49 49 49 48 48 48 48 49 49 49 49 49 49 48 48 48 49 49 49 48 48 48 48 49 49 49 49 49 49 49 49 49 49 49 48 48 48
1478 48 49 49 49 49 49 49 49 49 49 49 49 49 49 49 49 49 49 49 49 49 49 49 49 49 49 49 49 49 50 50 50 51 51 51 51 52 52 52 53 53 53 53 53 52 52 51 51 51 50 50 50 49 49 49 49 49 49 49 49 49 49 49 49 49 49 49 48 48 48 48
1471D8%%%%%%%%%%%%%%%%%%%%j%J%%%j%%%J%%%%%%%%%%%%%%%%%%%%%%%%%%%%%%%%%%%%%%%
1463D8%%%%%%%J%j%%Jj%%Jj%%%%J%j%%%%%%%%%%%%%%%%%%%%%%%%%%%%%%%%%J%%j%%J%%%%%
1456D9%%%%%%jJ%%%%%%%%%%%%%%%%%%j%%J%%%%%%%%%%%%j%%J%%jJ%j%%J%%%j%J%%%jJ%%%%
1448D9%%%%%%%%%%%%%%%%%%%%%%%%%%%%%%%%%%%%%j%J%%%%%%j%%%%J%%%%%%%%%%%%%J%%j%
1441D9%%%%%%%%%%%%j%J%%%%%%%%%%jJ%%%%%%%%%%%%%%%J%%%%%%%%%%%%%%%%%%%J%%%%%%%
1434E1J%%%%j%%j%%%%%%%%%%%%%%%%%%j%Jj%%%J%j%%%%%%%%%%%%%J%%%%%%%%%%%%j%%%%J%
1426E0%%%%%%%%%j%%%%%%%%%%%%jJ%%%%%%%%%%%%%%%%%%%%%%%%%%%%%%%J%jJ%j%%%%%%%j%
1419D8J%%%%%%%%%%%%%Jj%%%%%%%%%%%%%%%%%%%%%%j%J%%%%%j%%%%%%%%J%%j%%%J%%%j%%%
$$ plain form
1471 48 48 48 48 48 48 48 48 48 48 48 48 48 48 48 48 48 48 48 48 48 47 47 48 48 48 48 47 47 47 47 48 48 48 48 48 48 48 48 48 48 48 48 48 48 48 48 48 48 48 48 48 48 48 48 48 48 48 48 48 48 48 48 48 48 48 48 48 48 48 48
1463 48 48 48 48 48 48 48 48 49 49 48 48 48 49 48 48 48 49 48 48 48 48 48 49 49 48 48 48 48 48 48 48 48 48 48 48 48 48 48 48 48 48 48 48 48 48 48 48 48 48 48 48 48 48 48 48 48 48 48 49 49 49 48 48 48 49 49 49 49 49 49
1456 49 49 49 49 49 49 49 48 49 49 49 49 49 49 49 49 49 49 49 49 49 49 49 49 49 49 49 48 48 48 49 49 49 49 49 49 49 49 49 49 49 49 49 48 48 48 49 49 49 48 49 49 48 48 48 49 49 49 49 48 48 49 49 49 49 48 49 49 49 49 49
1448 49 49 49 49 49 49 49 49 49 49 49 49 49 49 49 49 49 49 49 49 49 49 49 49 49 49 49 49 49 49 49 49 49 49 49 49 49 49 48 48 49 49 49 49 49 49 49 48 48 48 48 48 49 49 49 49 49 49 49 49 49 49 49 49 49 49 50 50 50 49 49
1441 49 49 49 49 49 49 49 49 49 49 49 49 49 48 48 49 49 49 49 49 49 49 49 49 49 49 48 49 49 49 49 49 49 49 49 49 49 49 49 49 49 49 49 50 50 50 50 50 50 50 50 50 50 50 50 50 50 50 50 50 50 50 50 51 51 51 51 51 51 51 51
1434 51 52 52 52 52 52 51 51 51 50 50 50 50 50 50 50 50 50 50 50 50 50 50 50 50 50 50 50 49 49 50 49 49 49 49 50 50 49 49 49 49 49 49 49 49 49 49 49 49 49 49 50 50 50 50 50 50 50 50 50 50 50 50 50 49 49 49 49 49 50 50
1426 50 50 50 50 50 50 50 50 50 50 49 49 49 49 49 49 49 49 49 49 49 49 49 48 49 49 49 49 49 49 49 49 49 49 49 49 49 49 49 49 49 49 49 49 49 49 49 49 49 49 49 49 49 49 49 49 50 50 49 50 50 49 49 49 49 49 49 49 49 48 48
1419 48 49 49 49 49 49 49 49 49 49 49 49 49 49 49 50 49 49 49 49 49 49 49 49 49 49 49 49 49 49 49 49 49 49 49 49 49 49 49 48 48 49 49 49 49 49 49 48 48 48 48 48 48 48 48 48 49 49 49 48 48 48 48 49 49 49 49 48 48 48 48
1411D8J%%%%%%%%%%%%%%%%%%%%%%%%%%%%%%%%%%%%%%%%%%%%%%%%%%%%%%%%%%%%%%%%%%%%%
1404D9%%%J%%%%%%%%j%%%%%%%%%%j%%J%%%%%%%%%%%%%%%j%%J%%j%%%%%%%J%%%%%%jJ%%%%%
1397D9%j%%%%%J%%%%%%%%%%%%%%%%%%%%%%%%%%%%%%%%%%%%%%%%%%%%%j%%J%%%%%%%%%%%%%
1389D9%%J%j%%%%%%%%%j%%%%%J%%%%%%%%j%%J%%%j%%%%J%%%%%%%%%%%%%%%J%%%%%j%%%%%%
1382D9%%%%%%%%%%%Jj%%%%%%%%%%%J%j%%%%%%%%%%%%%%%%%%%j%%J%%%%jJ%%Jj%%%%%%%%%%
1374D9%J%%%%%%j%%%%%%%%%%%%%%%%%%%%%%%%%%%%%%%%%%%%%%%%%%%%%%%%%%%%%%%%j%%J%
1367D9%%J%%j%%%%%%%%%%%%%%%%%%%%%%%%j%%J%%%j%J%%%%%%%%%%%%%%j%%%%%%%%J%%%%%%
1359D9%%%%%%%%j%%%%%%%%%%%J%%%%%%%j%%%%J%%%%%%%%%%%j%%%J%%%%%%%%%%%%%%%%%%%%
$$ plain form
1411 48 49 49 49 49 49 49 49 49 49 49 49 49 49 49 49 49 49 49 49 49 49 49 49 49 49 49 49 49 49 49 49 49 49 49 49 49 49 49 49 49 49 49 49 49 49 49 49 49 49 49 49 49 49 49 49 49 49 49 49 49 49 49 49 49 49 49 49 49 49 49
1404 49 49 49 49 50 50 50 50 50 50 50 50 50 49 49 49 49 49 49 49 49 49 49 49 48 48 48 49 49 49 49 49 49 49 49 49 49 49 49 49 49 49 49 48 48 48 49 49 49 48 48 48 48 48 48 48 48 49 49 49 49 49 49 49 48 49 49 49 49 49 49
1397 49 49 48 48 48 48 48 48 49 49 49 49 49 49 49 49 49 49 49 49 49 49 49 49 49 49 49 49 49 49 49 49 49 49 49 49 49 49 49 49 49 49 49 49 49 49 49 49 49 49 49 49 49 49 48 48 48 49 49 49 49 49 49 49 49 49 49 49 49 49 49
1389 49 49 49 50 50 49 49 49 49 49 49 49 49 49 49 48 48 48 48 48 48 49 49 49 49 49 49 49 49 49 48 48 48 49 49 49 49 48 48 48 48 48 49 49 49 49 49 49 49 49 49 49 49 49 49 49 49 49 50 50 50 50 50 50 49 49 49 49 49 49 49
1382 49 49 49 49 49 49 49 49 49 49 49 49 50 49 49 49 49 49 49 49 49 49 49 49 49 50 50 49 49 49 49 49 49 49 49 49 49 49 49 49 49 49 49 49 49 49 49 48 48 48 49 49 49 49 49 48 49 49 49 50 49 49 49 49 49 49 49 49 49 49 49
1374 49 49 50 50 50 50 50 50 50 49 49 49 49 49 49 49 49 49 49 49 49 49 49 49 49 49 49 49 49 49 49 49 49 49 49 49 49 49 49 49 49 49 49 49 49 49 49 49 49 49 49 49 49 49 49 49 49 49 49 49 49 49 49 49 49 49 48 48 48 49 49
1367 49 49 49 50 50 50 49 49 49 49 49 49 49 49 49 49 49 49 49 49 49 49 49 49 49 49 49 49 49 49 49 48 48 48 49 49 49 49 48 48 49 49 49 49 49 49 49 49 49 49 49 49 49 49 49 48 48 48 48 48 48 48 48 48 49 49 49 49 49 49 49
1359 49 49 49 49 49 49 49 49 49 48 48 48 48 48 48 48 48 48 48 48 48 49 49 49 49 49 49 49 49 48 48 48 48 48 49 49 49 49 49 49 49 49 49 49 49 49 48 48 48 48 49 49 49 49 49 49 49 49 49 49 49 49 49 49 49 49 49 49 49 49 49
1352D9%%%%%%%%%%%%%%%%%%%%%%%%%j%%J%j%%%%%%%J%%%%%j%%%%%%%J%%%%%%%%%%%%%%%%%
1345D9%%J%%%%%%j%%%%jJ%%%%%%%%j%%%%%%%J%%%%%%%%%%%%%%%%%%%%%%%%%%%%%%%%%%%J%
1337E0%%%j%%%%%jJ%%%%%%%%%J%j%%%%%%%%%%%%%%%%%%%%%%%%%%%%%%%J%%j%%%%%%%%%%%%
1330D9%%%%%%%%%%%%J%%%j%%%J%%j%%%%%%%%%%%%J%j%%%%%%J%%%%%%j%%%%%%%%%%%%%%%%%
1322D9%%%%%%%%%%J%%%%%%%%%%%j%%%%%%%%%%Jj%%%%%%%%%J%%j%%%%%%%%%%%%%%%%%%%%%%
1315D9%%%%%%%%%%%%%%%%%%%%%%%%%%%%%%%%%%%%%%%%J%%%%%%%%%%%%%%%%%J%%%%J%%%%%%
1307E2J%%j%%j%%%j%%%%%%%%j%%%%%J%%%%%%%%%%%%%%%%%%%%%%%%%%%%%%jJ%%%%%%%%j%%%
1300D9%%%%J%%%%%%%j%%%J%%%%j%%%%J%%%%%%%%%%%%%%%%j%%%J%%%%%%%%%%%%%j%%%J%%%%
$$ plain form
1352 49 49 49 49 49 49 49 49 49 49 49 49 49 49 49 49 49 49 49 49 49 49 49 49 49 49 48 48 48 49 49 48 48 48 48 48 48 48 48 49 49 49 49 49 49 48 48 48 48 48 48 48 48 49 49 49 49 49 49 49 49 49 49 49 49 49 49 49 49 49 49
1345 49 49 49 50 50 50 50 50 50 50 49 49 49 49 49 48 49 49 49 49 49 49 49 49 49 48 48 48 48 48 48 48 48 49 49 49 49 49 49 49 49 49 49 49 49 49 49 49 49 49 49 49 49 49 49 49 49 49 49 49 49 49 49 49 49 49 49 49 49 50 50
1337 50 50 50 50 49 49 49 49 49 49 48 49 49 49 49 49 49 49 49 49 49 50 50 49 49 49 49 49 49 49 49 49 49 49 49 49 49 49 49 49 49 49 49 49 49 49 49 49 49 49 49 49 49 49 49 50 50 50 49 49 49 49 49 49 49 49 49 49 49 49 49
1330 49 49 49 49 49 49 49 49 49 49 49 49 49 50 50 50 50 49 49 49 49 50 50 50 49 49 49 49 49 49 49 49 49 49 49 49 49 50 50 49 49 49 49 49 49 49 50 50 50 50 50 50 50 49 49 49 49 49 49 49 49 49 49 49 49 49 49 49 49 49 49
1322 49 49 49 49 49 49 49 49 49 49 49 50 50 50 50 50 50 50 50 50 50 50 50 49 49 49 49 49 49 49 49 49 49 49 50 49 49 49 49 49 49 49 49 49 49 50 50 50 49 49 49 49 49 49 49 49 49 49 49 49 49 49 49 49 49 49 49 49 49 49 49
1315 49 49 49 49 49 49 49 49 49 49 49 49 49 49 49 49 49 49 49 49 49 49 49 49 49 49 49 49 49 49 49 49 49 49 49 49 49 49 49 49 49 50 50 50 50 50 50 50 50 50 50 50 50 50 50 50 50 50 50 51 51 51 51 51 52 52 52 52 52 52 52
1307 52 53 53 53 52 52 52 51 51 51 51 50 50 50 50 50 50 50 50 50 49 49 49 49 49 49 50 50 50 50 50 50 50 50 50 50 50 50 50 50 50 50 50 50 50 50 50 50 50 50 50 50 50 50 50 50 50 49 50 50 50 50 50 50 50 50 50 49 49 49 49
1300 49 49 49 49 49 50 50 50 50 50 50 50 50 49 49 49 49 50 50 50 50 50 49 49 49 49 49 50 50 50 50 50 50 50 50 50 50 50 50 50 50 50 50 50 49 49 49 49 50 50 50 50 50 50 50 50 50 50 50 50 50 50 49 49 49 49 50 50 50 50 50
1293E0%%%%%j%%%%%J%%%%%%%%%%%%%%%%%%%%%%%j%%J%%%%%%%%%%%%j%%J%%%%%%%%%%%%%%%
1285E0%%%%%%%%%%j%%%%%J%%%%%%%%%%%%%%%%%%%%%%%%%%%%%%%%%%%%%%%%%%%%%%%%J%%%%
1278E1%%%%j%%J%j%%%%%%%%%%%%J%j%%%%%%%%%j%%J%%%%j%J%%%%%%%%%%%%%%%%%%%%%%%%J
1270E1%%%%%%%%%%%%%%%j%%J%%%%%%%%%%j%%%%%%%J%%%%%%%%%%%%%%%%j%%%%%%%%%J%%%%%
1263E1%%%%%%%%%%%j%%J%%J%%j%%%%%%%%%%%%%%%%%%%%%%%%%%%%%%%%%Jj%%%%%%%%J%%jJ%
1256E2%%%%j%J%j%%%%%%%%J%%%%%j%%%%%%%%%%%%%%%J%%%%%%%%J%%j%%%%%%%%%%Jj%%J%%%
1248E3%%%%%%%%%%%%%%%j%%%%%J%%%%%%%%%%jJ%%%%%%%%%%%%%%Jj%%J%%%%%%%%j%%%J%%%%
1241E4%%%%%%%%%%%%%%%%%%%J%jJ%%%%j%%J%%%%%%%%%%%%%%%%%%%%J%%j%%%J%%%%%%j%%%%
$$ plain form
1293 50 50 50 50 50 50 49 49 49 49 49 49 50 50 50 50 50 50 50 50 50 50 50 50 50 50 50 50 50 50 50 50 50 50 50 50 49 49 49 50 50 50 50 50 50 50 50 50 50 50 50 50 49 49 49 50 50 50 50 50 50 50 50 50 50 50 50 50 50 50 50
1285 50 50 50 50 50 50 50 50 50 50 50 49 49 49 49 49 49 50 50 50 50 50 50 50 50 50 50 50 50 50 50 50 50 50 50 50 50 50 50 50 50 50 50 50 50 50 50 50 50 50 50 50 50 50 50 50 50 50 50 50 50 50 50 50 50 50 51 51 51 51 51
1278 51 51 51 51 51 50 50 50 51 51 50 50 50 50 50 50 50 50 50 50 50 50 50 51 51 50 50 50 50 50 50 50 50 50 50 49 49 49 50 50 50 50 50 49 49 50 50 50 50 50 50 50 50 50 50 50 50 50 50 50 50 50 50 50 50 50 50 50 50 50 51
1270 51 51 51 51 51 51 51 51 51 51 51 51 51 51 51 51 50 50 50 51 51 51 51 51 51 51 51 51 51 51 50 50 50 50 50 50 50 50 51 51 51 51 51 51 51 51 51 51 51 51 51 51 51 51 51 50 50 50 50 50 50 50 50 50 50 51 51 51 51 51 51
1263 51 51 51 51 51 51 51 51 51 51 51 51 50 50 50 51 51 51 52 52 52 51 51 51 51 51 51 51 51 51 51 51 51 51 51 51 51 51 51 51 51 51 51 51 51 51 51 51 51 51 51 51 51 51 51 52 51 51 51 51 51 51 51 51 51 52 52 52 51 52 52
1256 52 52 52 52 52 51 51 52 52 51 51 51 51 51 51 51 51 51 52 52 52 52 52 52 51 51 51 51 51 51 51 51 51 51 51 51 51 51 51 51 52 52 52 52 52 52 52 52 52 53 53 53 52 52 52 52 52 52 52 52 52 52 52 53 52 52 52 53 53 53 53
1248 53 53 53 53 53 53 53 53 53 53 53 53 53 53 53 53 52 52 52 52 52 52 53 53 53 53 53 53 53 53 53 53 53 52 53 53 53 53 53 53 53 53 53 53 53 53 53 53 53 54 53 53 53 54 54 54 54 54 54 54 54 54 53 53 53 53 54 54 54 54 54
1241 54 54 54 54 54 54 54 54 54 54 54 54 54 54 54 54 54 54 54 54 55 55 54 55 55 55 55 55 54 54 54 55 55 55 55 55 55 55 55 55 55 55 55 55 55 55 55 55 55 55 55 55 56 56 56 55 55 55 55 56 56 56 56 56 56 56 55 55 55 55 55
1233E5J%%%%%%%%%%%%%%J%%%j%%J%%%%%j%J%%%%%%%%%%%%%%%%%%%J%%%%%%%%%%%J%%%%%%j
1226E8%%J%%%%%%%%J%%%%%%%%%%%%%%%%%%%%%%%%%%%%%J%%%%%%%%%%J%%%%%%%J%%%%j%J%%
1218F3%%%%%%%J%%%%%J%%%%%%%%%%%%%%%%J%%%J%%%%%%%%%%%%J%%%%J%%%%%%%%%%%J%%%J%
1211G1%%%%%J%%%%%%%%%J%%%%J%%%%%%%J%J%%%%%J%%%%%%J%%%%J%%J%%%%%J%%J%%J%%J%%%
1204H4J%%%J%%J%%%J%J%J%J%%J%J%%%J%J%J%%J%%JJ%JJ%%%J%%JJ%JJJ%J%J%J%JJ%JJ%J%JJ
1196A17JJJ%JJ%JJJJJJJJJ%JK%JJJKJJJJJJJJJJJKJKJJKJJKJKKJKJKKKJKJKKKKKKKLKKKKL
1189B10KKLKLLKLKLLLLLLMLLLMLLMMLMMMLMNMMMMNMNMNNNNNNNNNONOONOONOOOOOOOONOOOO
1182E09PNOOOONNONNNNNMMMMLMLLLKKKJKJ%J%%jjjjjklklllmmmmmnmnnnnonoonpooooooop
$$ plain form
1233 55 56 56 56 56 56 56 56 56 56 56 56 56 56 56 56 57 57 57 57 56 56 56 57 57 57 57 57 57 56 56 57 57 57 57 57 57 57 57 57 57 57 57 57 57 57 57 57 57 57 57 58 58 58 58 58 58 58 58 58 58 58 58 59 59 59 59 59 59 59 58
1226 58 58 58 59 59 59 59 59 59 59 59 59 60 60 60 60 60 60 60 60 60 60 60 60 60 60 60 60 60 60 60 60 60 60 60 60 60 60 60 60 60 60 61 61 61 61 61 61 61 61 61 61 61 62 62 62 62 62 62 62 62 63 63 63 63 63 62 62 63 63 63
1218 63 63 63 63 63 63 63 63 64 64 64 64 64 64 65 65 65 65 65 65 65 65 65 65 65 65 65 65 65 65 65 66 66 66 66 67 67 67 67 67 67 67 67 67 67 67 67 67 68 68 68 68 68 69 69 69 69 69 69 69 69 69 69 69 69 70 70 70 70 71 71
1211 71 71 71 71 71 71 72 72 72 72 72 72 72 72 72 72 73 73 73 73 73 74 74 74 74 74 74 74 74 75 75 76 76 76 76 76 76 77 77 77 77 77 77 77 78 78 78 78 78 79 79 79 80 80 80 80 80 80 81 81 81 82 82 82 83 83 83 84 84 84 84
1204 84 85 85 85 85 86 86 86 87 87 87 87 88 88 89 89 90 90 91 91 91 92 92 93 93 93 93 94 94 95 95 96 96 96 97 97 97 98 99 99 100 101 101 101 101 102 102 102 103 104 104 105 106 107 107 108 108 109 109 110 110 111 112 112 113 114 114 115 115 116 117
1196 117 118 119 120 120 121 122 122 123 124 125 126 127 128 129 130 131 131 132 134 134 135 136 137 139 140 141 142 143 144 145 146 147 148 149 150 152 153 155 156 157 159 160 161 163 164 166 168 169 171 172 174 176 178 179 181 182 184 186 188 190 192 194 196 199 201 203 205 207 210
1189 210 212 214 217 219 222 225 227 230 232 235 238 241 244 247 250 254 257 260 263 267 270 273 277 281 284 288 292 296 299 303 308 312 316 320 324 329 333 338 342 347 352 357 362 367 372 377 382 387 393 398 404 410 415 421 427 432 438 444 450 456 462 468 474 480 485 491 497 503 509
1182 509 516 521 527 533 539 545 550 555 561 566 571 576 581 586 590 594 598 602 605 609 612 615 618 620 622 624 625 627 628 628 629 629 629 628 627 626 625 624 622 619 617 614 611 608 604 600 596 592 588 583 579 574 569 564 559 553 548 542 536 531 524 518 512 506 500 494 488 482 475
1174D75ooooponooonononononnnnnnmnmnmnmmmmmmmmmmlmllmlllllllllklklkjlklklkkkk
1167A96kkkkkkkkjkkjkkjkjjkjjjkjjjkjjjkjjjjjjjjjjjjjjj%jjjjjjj%jjj%%jj%jjj%jj
1160A16%jj%j%jjj%j%jj%j%j%j%j%j%j%j%%j%j%j%%%jj%j%%j%%j%%%j%%%jj%%%j%%j%%%j%
1152H6%j%%j%%j%%j%%j%%%%%%j%%j%%j%%%j%%%%%%j%%j%%%%j%%%j%%%%%%j%%j%%%%J%j%%j
1145G0%%%%%j%%j%%%%j%%%%%%j%%%%%%%%%%%%%%j%%%j%%%%%%%%%%%%%%%%%%%%j%%%%%%%%%
1138F3%%%j%%%%%%%%%j%%%%%j%%%%%%%%%%%j%%%%%J%%%%%%%%%%%%%%%%%%%%%%%%%%%%%%%%
1130F0j%%jJ%%%j%%%%%%%%%%%j%%%%%%%%J%j%%%%%jJ%%%%%%%%%%%%%%%%%%%%%%%%%%%%%j%
1123E6%%%%%%%%j%%%%%%%%%%j%J%%%%%%%%%%%%%%%%%%%%%%j%J%%%%%%%%%%%%j%%%%%%%%%%
$$ plain form
1174 475 469 463 457 451 444 438 433 427 421 415 410 404 399 393 388 382 377 371 366 361 356 351 346 341 337 332 328 323 319 314 310 306 302 298 294 290 286 282 278 274 271 267 264 261 257 254 251 248 245 242 239 236 233 230 228 225 223 220 218 217 214 212 209 207 204 202 200 198 196
1167 196 194 192 190 188 186 184 182 180 179 177 175 174 172 170 169 167 166 165 163 162 161 160 158 157 156 155 153 152 151 150 148 147 146 145 144 143 142 141 140 139 138 137 136 135 134 133 133 132 131 130 129 128 127 126 126 125 124 123 123 123 122 121 121 120 119 118 118 117 116
1160 116 116 115 114 114 113 113 112 111 110 110 109 109 108 107 107 106 106 105 105 104 104 103 103 102 102 101 101 100 100 100 99 99 98 98 97 97 97 97 96 95 95 94 94 94 93 93 93 92 92 92 92 91 91 91 91 90 89 89 89 89 88 88 88 87 87 87 87 86 86
1152 86 86 85 85 85 84 84 84 83 83 83 82 82 82 81 81 81 81 81 81 81 80 80 80 79 79 79 78 78 78 78 77 77 77 77 77 77 77 76 76 76 75 75 75 75 75 74 74 74 74 73 73 73 73 73 73 73 72 72 72 71 71 71 71 71 72 72 71 71 71 70
1145 70 70 70 70 70 70 69 69 69 68 68 68 68 68 67 67 67 67 67 67 67 66 66 66 66 66 66 66 66 66 66 66 66 66 66 66 65 65 65 65 64 64 64 64 64 64 64 64 64 64 64 64 64 64 64 64 64 64 64 64 64 63 63 63 63 63 63 63 63 63 63
1138 63 63 63 63 62 62 62 62 62 62 62 62 62 62 61 61 61 61 61 61 60 60 60 60 60 60 60 60 60 60 60 60 59 59 59 59 59 59 60 60 60 60 60 60 60 60 60 60 60 60 60 60 60 60 60 60 60 60 60 60 60 60 60 60 60 60 60 60 60 60 60
1130 60 59 59 59 58 59 59 59 59 58 58 58 58 58 58 58 58 58 58 58 58 57 57 57 57 57 57 57 57 57 58 58 57 57 57 57 57 57 56 57 57 57 57 57 57 57 57 57 57 57 57 57 57 57 57 57 57 57 57 57 57 57 57 57 57 57 57 57 57 56 56
1123 56 56 56 56 56 56 56 56 56 55 55 55 55 55 55 55 55 55 55 55 54 54 55 55 55 55 55 55 55 55 55 55 55 55 55 55 55 55 55 55 55 55 55 55 55 54 54 55 55 55 55 55 55 55 55 55 55 55 55 55 54 54 54 54 54 54 54 54 54 54 54
1115E4%%%j%%%%%%%%%%%%%%%%%%%%%%%%%%J%j%%J%j%%%%%%%%%%J%j%%%%%%%%%%%%%J%%%%%
1108E4%%%%%%%%j%%%%%%%%%%j%%%%%%%%%%%J%%%%%%j%%%%%%jJ%%%%%%%%%%%j%%%J%%%j%%%
1100E1%%%%Jj%%%%%%%%%%%%%%%%%%%%%%%%%%%%Jj%%%%%%%%%%%%%%%%%%%%%%%%%%%%%%%%%j
1093E0%J%%%%%%%%%%%%j%%%%%%%%%%%%%Jj%%%%%%%J%%j%%%%%%%%%%%%%%%%%J%%j%%%%%%%%
1086E0%%%%%%%%%J%%%j%%%%%%%%%%%j%%J%%%%%%jJ%%%%%%%%%%%%%%%%%%%%%%%%%%%%%%%%%
1078E0%%j%%J%%%%%%%%%%%%%%%%%%j%%%%%%%%%J%%%j%%%%%%%%%%%Jj%%%%%%%%%%%%%%%%%%
1071D9%%%%j%J%%%%%%%%%Jj%%%%%jJ%%%%%%%%%%%%%%%%%%%%%%%%%%%%%%%J%%%%%j%%%%%%%
1063D9%%%%%%%%%%j%Jj%%%J%%%%%%%%%j%%%%%J%%%%%%%%%%%%J%%%%%%%%%%%jJ%j%%%%j%%%
$$ plain form
1115 54 54 54 54 53 53 53 53 53 53 53 53 53 53 53 53 53 53 53 53 53 53 53 53 53 53 53 53 53 53 53 54 54 53 53 53 54 54 53 53 53 53 53 53 53 53 53 53 53 54 54 53 53 53 53 53 53 53 53 53 53 53 53 53 53 54 54 54 54 54 54
1108 54 54 54 54 54 54 54 54 54 53 53 53 53 53 53 53 53 53 53 53 52 52 52 52 52 52 52 52 52 52 52 52 53 53 53 53 53 53 53 52 52 52 52 52 52 52 51 52 52 52 52 52 52 52 52 52 52 52 52 51 51 51 51 52 52 52 52 51 51 51 51
1100 51 51 51 51 51 52 51 51 51 51 51 51 51 51 51 51 51 51 51 51 51 51 51 51 51 51 51 51 51 51 51 51 51 51 51 52 51 51 51 51 51 51 51 51 51 51 51 51 51 51 51 51 51 51 51 51 51 51 51 51 51 51 51 51 51 51 51 51 51 51 50
1093 50 50 51 51 51 51 51 51 51 51 51 51 51 51 51 50 50 50 50 50 50 50 50 50 50 50 50 50 50 51 50 50 50 50 50 50 50 50 51 51 51 50 50 50 50 50 50 50 50 50 50 50 50 50 50 50 50 50 50 51 51 51 50 50 50 50 50 50 50 50 50
1086 50 50 50 50 50 50 50 50 50 50 51 51 51 51 50 50 50 50 50 50 50 50 50 50 50 50 49 49 49 50 50 50 50 50 50 50 49 50 50 50 50 50 50 50 50 50 50 50 50 50 50 50 50 50 50 50 50 50 50 50 50 50 50 50 50 50 50 50 50 50 50
1078 50 50 50 49 49 49 50 50 50 50 50 50 50 50 50 50 50 50 50 50 50 50 50 50 50 49 49 49 49 49 49 49 49 49 49 50 50 50 50 49 49 49 49 49 49 49 49 49 49 49 49 50 49 49 49 49 49 49 49 49 49 49 49 49 49 49 49 49 49 49 49
1071 49 49 49 49 49 48 48 49 49 49 49 49 49 49 49 49 49 50 49 49 49 49 49 49 48 49 49 49 49 49 49 49 49 49 49 49 49 49 49 49 49 49 49 49 49 49 49 49 49 49 49 49 49 49 49 49 49 50 50 50 50 50 50 49 49 49 49 49 49 49 49
1063 49 49 49 49 49 49 49 49 49 49 49 48 48 49 48 48 48 48 49 49 49 49 49 49 49 49 49 49 48 48 48 48 48 48 49 49 49 49 49 49 49 49 49 49 49 49 49 50 50 50 50 50 50 50 50 50 50 50 50 49 50 50 49 49 49 49 49 48 48 48 48
1056D8%%%%%%%%%%%%Jj%%%%J%%%%%%%%j%%%J%%%%%%%%%%%%%J%%%J%%%%%%j%%j%%%j%%%%%%
1049D8%%%%%%%%%%%%%%%%%%%%%%%%%%J%%%j%%%%J%%%%%%%%%%%J%%%%%%%%%j%%J%j%%%j%%%
1041D8%%%%%%Jj%%%%%%%%J%%%%j%%%%%%%%%%%%%%%%%%%%%%%%%%%J%%%%%%%%%%%%%j%%%%%%
1034D8%%%%%%%%%%%%%%%%%%%%%%%%%%%%%%Jj%%%%%%%%%%j%%%J%%%%%%%%%%%%%%%%%%%%%%%
1026D8%%%%%%%%%%J%%j%%%%%%%%%%%j%%J%%%%%%%%%%%%%%j%%J%%%j%%%%J%%%%%j%%%%%%%J
1019D8%%%%%%%%%%%%%%%%%%%%%%j%%%%%%%%%%%%J%%%%%%%%%%%%%%%%%%%%%J%%%%%%%%%%%%
1011D9J%%%J%%%J%J%%%%%%%j%%%j%%%j%%%Jj%%%%%%%%J%%J%jJ%%J%J%J%%%JJJJJJKKJKLLL
1004G7MNNNNNMLKJjkmmnmnmmllkkjkjjjjjjjjjjjjjjjj%j%j%j%%j%%%%%%j%%%j%%%%%%%%%
$$ plain form
1056 48 48 48 48 48 48 48 48 48 48 48 48 48 49 48 48 48 48 48 49 49 49 49 49 49 49 49 49 48 48 48 48 49 49 49 49 49 49 49 49 49 49 49 49 49 49 50 50 50 50 51 51 51 51 51 51 51 50 50 50 49 49 49 49 48 48 48 48 48 48 48
1049 48 48 48 48 48 48 48 48 48 48 48 48 48 48 48 48 48 48 48 48 48 48 48 48 48 48 48 49 49 49 49 48 48 48 48 48 49 49 49 49 49 49 49 49 49 49 49 49 50 50 50 50 50 50 50 50 50 50 49 49 49 50 50 49 49 49 49 48 48 48 48
1041 48 48 48 48 48 48 48 49 48 48 48 48 48 48 48 48 48 49 49 49 49 49 48 48 48 48 48 48 48 48 48 48 48 48 48 48 48 48 48 48 48 48 48 48 48 48 48 48 48 48 49 49 49 49 49 49 49 49 49 49 49 49 49 49 48 48 48 48 48 48 48
1034 48 48 48 48 48 48 48 48 48 48 48 48 48 48 48 48 48 48 48 48 48 48 48 48 48 48 48 48 48 48 48 49 48 48 48 48 48 48 48 48 48 48 48 47 47 47 47 48 48 48 48 48 48 48 48 48 48 48 48 48 48 48 48 48 48 48 48 48 48 48 48
1026 48 48 48 48 48 48 48 48 48 48 48 49 49 49 48 48 48 48 48 48 48 48 48 48 48 48 47 47 47 48 48 48 48 48 48 48 48 48 48 48 48 48 48 48 47 47 47 48 48 48 48 47 47 47 47 47 48 48 48 48 48 48 47 47 47 47 47 47 47 47 48
1019 48 48 48 48 48 48 48 48 48 48 48 48 48 48 48 48 48 48 48 48 48 48 48 47 47 47 47 47 47 47 47 47 47 47 47 47 48 48 48 48 48 48 48 48 48 48 48 48 48 48 48 48 48 48 48 48 48 48 49 49 49 49 49 49 49 49 49 49 49 49 49
1011 49 50 50 50 50 51 51 51 51 52 52 53 53 53 53 53 53 53 53 52 52 52 52 51 51 51 51 50 50 50 50 51 50 50 50 50 50 50 50 50 50 51 51 51 52 52 51 52 52 52 53 53 54 54 55 55 55 55 56 57 58 59 60 61 63 65 66 68 71 74 77
1004 77 81 86 91 96 101 106 110 113 115 116 115 113 109 105 100 96 91 87 83 80 77 75 73 72 70 69 68 67 66 65 64 63 62 61 60 59 58 57 56 55 54 54 53 53 52 52 51 51 51 50 50 50 50 50 50 50 49 49 49 49 48 48 48 48 48 48 48 48 48 48
997D8%%%%%%j%%%jJ%%%%j%%%J%%%%%%%%%%%%%jJ%%%%jJ%%j%%%J%%%%%%%J%%%j%%%%%%%%%%
989D7%%%%%%J%%%%%%%%%%%%%%%j%%%%%%%J%%j%J%j%%%%%%%%%%%%%%J%%j%%%%%%%%%%%%%%%
982D7%%%%jJ%%%%%%%%%Jj%%%%%%%%%%%%%jJ%%%%%%%%%%j%%J%%j%%%J%jJ%%%%%%%%%%%%%%%
974D7%%%Jj%%%%%%%%%%%%%%%%%%%%%%%%%%%%%%%%%%%%%%%%%%%%%%%%%%%%%%%%%%%%%%%%%J
966D8%%%j%J%%j%%%J%j%%J%%%%%%%%%%%%%%%%%%%%%%%%%%%%%%%%%%%%%%%%%%J%%%%%%%j%%
959D8%%%%%%J%%%%%%%%%%%%%%%%%Jj%%%%%%%%J%%%%%%J%%j%%j%%%%%%%%%%%%%%%%jJ%%%%%
951D9%%%%%%%%%%%%%%%%J%%j%%%%%%J%j%%%%%%Jj%%%%%%%%%%%%%%%%%%%J%%%%%%%%%%%%%%
944E0%%%%%%J%%%%%%%J%J%%%J%JJ%JJKJJ%JJ%%%jjjjjjjjjj%j%%j%%j%%%%%j%J%%j%%%%%%
$$ plain form
997 48 48 48 48 48 48 48 47 47 47 47 46 47 47 47 47 47 46 46 46 46 47 47 47 47 47 47 47 47 47 47 47 47 47 47 46 47 47 47 47 47 46 47 47 47 46 46 46 46 47 47 47 47 47 47 47 47 48 48 48 48 47 47 47 47 47 47 47 47 47 47 47
989 47 47 47 47 47 47 47 48 48 48 48 48 48 48 48 48 48 48 48 48 48 48 48 47 47 47 47 47 47 47 47 48 48 48 47 47 48 48 47 47 47 47 47 47 47 47 47 47 47 47 47 47 47 48 48 48 47 47 47 47 47 47 47 47 47 47 47 47 47 47 47 47
982 47 47 47 47 47 46 47 47 47 47 47 47 47 47 47 47 48 47 47 47 47 47 47 47 47 47 47 47 47 47 47 46 47 47 47 47 47 47 47 47 47 47 47 46 46 46 47 47 47 46 46 46 46 47 47 46 47 47 47 47 47 47 47 47 47 47 47 47 47 47 47 47
974 47 47 47 47 48 47 47 47 47 47 47 47 47 47 47 47 47 47 47 47 47 47 47 47 47 47 47 47 47 47 47 47 47 47 47 47 47 47 47 47 47 47 47 47 47 47 47 47 47 47 47 47 47 47 47 47 47 47 47 47 47 47 47 47 47 47 47 47 47 47 47 48
966 48 48 48 48 47 47 48 48 48 47 47 47 47 48 48 47 47 47 48 48 48 48 48 48 48 48 48 48 48 48 48 48 48 48 48 48 48 48 48 48 48 48 48 48 48 48 48 48 48 48 48 48 48 48 48 48 48 48 48 48 48 49 49 49 49 49 49 49 49 48 48 48
959 48 48 48 48 48 48 48 49 49 49 49 49 49 49 49 49 49 49 49 49 49 49 49 49 49 50 49 49 49 49 49 49 49 49 49 50 50 50 50 50 50 50 51 51 51 50 50 50 49 49 49 49 49 49 49 49 49 49 49 49 49 49 49 49 49 48 49 49 49 49 49 49
951 49 49 49 49 49 49 49 49 49 49 49 49 49 49 49 49 49 50 50 50 49 49 49 49 49 49 49 50 50 49 49 49 49 49 49 49 50 49 49 49 49 49 49 49 49 49 49 49 49 49 49 49 49 49 49 49 49 50 50 50 50 50 50 50 50 50 50 50 50 50 50 50
944 50 50 50 50 50 50 50 51 51 51 51 51 51 51 51 52 52 53 53 53 53 54 54 55 56 56 57 58 60 61 62 62 63 64 64 64 64 63 62 61 60 59 58 57 56 55 54 54 53 53 53 52 52 52 51 51 51 51 51 51 50 50 51 51 51 50 50 50 50 50 50 50
936E0%%j%%%%%%%%%%%%%%%%%%%J%j%%%%%%%%%%%%%%%%%%%%J%%%%%j%%%%%%%%%%%%%%%%%%J
929E0%%%%%%%%j%%%%%%J%%%%%%%%%j%%%%%%%%%jJ%%%%%%%%%%%%%%%%%%%%%%%%J%%%%%%%%%
921E0%%%J%%j%jJ%%%%%%J%%%%%%%%%%%%%%%%%%%%%%%%J%%%%j%%Jj%%%%%%%%%Jj%%%%J%%%%
914E2%J%%%%%%%%%%%%%%%%%%%%J%%%%%%%%%%%%%%%%%%jJ%%%%%%%%%%j%%%J%%%%%%%%%Jj%%
906E4J%%%%%%J%%%J%%%J%%%J%%%JJJJKJJKJJJ%Jj%jkkkjkjjj%j%j%%j%%%%%%%%%%%%%%%%%
899E6%%%%%%%%%%J%%j%J%%%%%%%%%%%%%%%%%%%%%%%%%%%%%%J%%%%%%%%%%%%%%%%%%J%%J%%
891F0%%%%%%%%%J%%J%%%%J%%%J%%%%J%%J%%J%J%JJ%JJ%JJJ%JJJJKJJJKJKKJKKKKKKLKLKLK
884A19LLLLLLLLKKKKJ%%jjkkkmlmmmmmmlmlmlklkkkkkkkkjjjjkj%jjjjjj%%j%j%j%j%%j%j
$$ plain form
936 50 50 50 49 49 49 49 49 49 49 49 49 49 49 49 49 49 49 49 49 49 49 49 50 50 49 49 49 49 49 49 49 49 49 49 49 49 49 49 49 49 49 49 49 49 49 50 50 50 50 50 50 49 49 49 49 49 49 49 49 49 49 49 49 49 49 49 49 49 49 49 50
929 50 50 50 50 50 50 50 50 50 49 49 49 49 49 49 49 50 50 50 50 50 50 50 50 50 50 49 49 49 49 49 49 49 49 49 49 48 49 49 49 49 49 49 49 49 49 49 49 49 49 49 49 49 49 49 49 49 49 49 49 49 49 50 50 50 50 50 50 50 50 50 50
921 50 50 50 50 51 51 51 50 50 49 50 50 50 50 50 50 50 51 51 51 51 51 51 51 51 51 51 51 51 51 51 51 51 51 51 51 51 51 51 51 51 51 52 52 52 52 52 51 51 51 52 51 51 51 51 51 51 51 51 51 51 52 51 51 51 51 51 52 52 52 52 52
914 52 52 53 53 53 53 53 53 53 53 53 53 53 53 53 53 53 53 53 53 53 53 53 54 54 54 54 54 54 54 54 54 54 54 54 54 54 54 54 54 54 54 53 54 54 54 54 54 54 54 54 54 54 54 53 53 53 53 54 54 54 54 54 54 54 54 54 54 55 54 54 54
906 54 55 55 55 55 55 55 55 56 56 56 56 57 57 57 57 58 58 58 58 59 59 59 59 60 61 62 63 65 66 67 69 70 71 72 72 73 72 72 71 69 67 65 64 62 61 60 59 59 58 58 57 57 57 56 56 56 56 56 56 56 56 56 56 56 56 56 56 56 56 56 56
899 56 56 56 56 56 56 56 56 56 56 56 57 57 57 56 56 57 57 57 57 57 57 57 57 57 57 57 57 57 57 57 57 57 57 57 57 57 57 57 57 57 57 57 57 57 57 57 58 58 58 58 58 58 58 58 58 58 58 58 58 58 58 58 58 58 58 59 59 59 60 60 60
891 60 60 60 60 60 60 60 60 60 60 61 61 61 62 62 62 62 62 63 63 63 63 64 64 64 64 64 65 65 65 66 66 66 67 67 68 68 69 70 70 71 72 72 73 74 75 75 76 77 78 79 81 82 83 84 86 87 89 91 92 94 96 98 100 102 104 107 109 112 114 117 119
884 119 122 125 128 131 134 137 140 143 145 147 149 151 152 152 152 151 150 148 146 144 140 137 133 129 125 121 117 113 110 106 103 99 96 94 91 89 87 85 83 81 79 77 75 74 73 72 71 69 68 68 67 66 65 64 63 62 62 62 61 61 60 60 59 59 58 58 58 57 57 56
876E6%%%%%%j%%%%j%%%%j%%%%j%%J%%j%%%%%%j%Jj%%%%%%%%%%%%%%%%Jj%%%%%%J%%%%%%%j
869E1%%%%%%%%j%%%%%%%%%%%Jj%%%%%%j%J%%%%%%j%%%%%%%j%%%%%%%%%%J%%%%%%%%j%%%%%
861D8%%%Jj%%%%%%%%%%%%%%%%%%%J%j%%%%%%%%%%%%j%%%%%J%%%%%%%%%%%%%%%%%%%%%%%%%
854D8%%%%j%%%%%%%%%%%%%%J%%j%J%%%j%%J%j%%%%%%%%%%%%%%%%%%%%j%J%%%%%%%%%%%%J%
846D8%j%%%%%%%%%J%%%%j%%%%%%%%%%%jJ%%%%%%%jJ%%%%%%%%%%%j%%%%J%%j%%%%%%%J%%j%
839D6%J%%%%%%%%%%%%j%%%J%%%%%%j%%%%%%%%%%%%%J%%%%%%%%%%%j%%%%%%%%%%%%%%%%%J%
831D7%%%%%%%j%J%%%%%j%%%%%%%%%%%%%%%%%%%%%%%%%J%%%j%Jj%%%%%%J%%%%%%%%%%%%%jJ
824D7%%%j%%%%%%%%%%J%%%%j%%%%%%%%%%%%%%%%%%%%%%J%j%%%J%%%%%%%%%%%j%%%%%%%%%%
$$ plain form
876 56 56 56 56 56 56 56 55 55 55 55 55 54 54 54 54 54 53 53 53 53 53 52 52 52 53 53 53 52 52 52 52 52 52 52 51 51 52 51 51 51 51 51 51 51 51 51 51 51 51 51 51 51 51 51 52 51 51 51 51 51 51 51 52 52 52 52 52 52 52 52 51
869 51 51 51 51 51 51 51 51 51 50 50 50 50 50 50 50 50 50 50 50 50 51 50 50 50 50 50 50 50 49 49 50 50 50 50 50 50 50 49 49 49 49 49 49 49 49 48 48 48 48 48 48 48 48 48 48 48 49 49 49 49 49 49 49 49 49 48 48 48 48 48 48
861 48 48 48 48 49 48 48 48 48 48 48 48 48 48 48 48 48 48 48 48 48 48 48 48 48 49 49 48 48 48 48 48 48 48 48 48 48 48 48 48 47 47 47 47 47 47 48 48 48 48 48 48 48 48 48 48 48 48 48 48 48 48 48 48 48 48 48 48 48 48 48 48
854 48 48 48 48 48 47 47 47 47 47 47 47 47 47 47 47 47 47 47 47 48 48 48 47 47 48 48 48 48 47 47 47 48 48 47 47 47 47 47 47 47 47 47 47 47 47 47 47 47 47 47 47 47 47 47 46 46 47 47 47 47 47 47 47 47 47 47 47 47 47 48 48
846 48 48 47 47 47 47 47 47 47 47 47 47 48 48 48 48 48 47 47 47 47 47 47 47 47 47 47 47 47 46 47 47 47 47 47 47 47 47 46 47 47 47 47 47 47 47 47 47 47 47 47 46 46 46 46 46 47 47 47 46 46 46 46 46 46 46 46 47 47 47 46 46
839 46 46 47 47 47 47 47 47 47 47 47 47 47 47 47 46 46 46 46 47 47 47 47 47 47 47 46 46 46 46 46 46 46 46 46 46 46 46 46 46 47 47 47 47 47 47 47 47 47 47 47 47 46 46 46 46 46 46 46 46 46 46 46 46 46 46 46 46 46 46 47 47
831 47 47 47 47 47 47 47 47 46 46 47 47 47 47 47 47 46 46 46 46 46 46 46 46 46 46 46 46 46 46 46 46 46 46 46 46 46 46 46 46 46 46 47 47 47 47 46 46 47 46 46 46 46 46 46 46 47 47 47 47 47 47 47 47 47 47 47 47 47 47 46 47
824 47 47 47 47 46 46 46 46 46 46 46 46 46 46 46 47 47 47 47 47 46 46 46 46 46 46 46 46 46 46 46 46 46 46 46 46 46 46 46 46 46 46 46 47 47 46 46 46 46 47 47 47 47 47 47 47 47 47 47 47 47 46 46 46 46 46 46 46 46 46 46 46
816D6%%%%%%%%%j%%%%J%%%%%%%%%%%%j%%%%%%%%%J%%%%%%%%%%%%j%%J%%%%%%j%%J%%%%%%%
809D6%%%%%%%%%%%jJ%%j%%%%%%%%%%%%%%%%%%%%%%%%%%J%%j%%%%%%%%%%%%%%%J%%%%%%%%%
$$ plain form
816 46 46 46 46 46 46 46 46 46 46 45 45 45 45 45 46 46 46 46 46 46 46 46 46 46 46 46 46 45 45 45 45 45 45 45 45 45 45 46 46 46 46 46 46 46 46 46 46 46 46 46 45 45 45 46 46 46 46 46 46 46 45 45 45 46 46 46 46 46 46 46 46
809 46 46 46 46 46 46 46 46 46 46 46 46 45 46 46 46 45 45 45 45 45 45 45 45 45 45 45 45 45 45 45 45 45 45 45 45 45 45 45 45 45 45 45 46 46 46 45 45 45 45 45 45 45 45 45 45 45 45 45 45 45 45 46 46 46 46 46 46 46 46 46 46
$$ [...]
-2638D9
##END=		$$ NMR SPECTRUM
##END=		$$ LINK
