##TITLE=	RP237 char_2.10.fid
##JCAMP-DX=	6.0	$$ MestReNova 14.3.3-33362
##DATA TYPE=	LINK
##BLOCKS=	1    
##ORIGIN=	Mestrelab Research S.L.
##OWNER=	hrzepa
##$MNOVA/METADATA=	(DOCUMENT,BASE64)
eyJuYW1lIjoiL1VzZXJzL2hyemVwYS9MaWJyYXJ5L01vYmlsZSBEb2N1bWVudHMvY29tfmFwcGxlfkN
sb3VkRG9jcy9TaGVwcGFyZC9OTVIgZmlsZXMgemlwcy0yLzQvSC5tbm92YSIsInBhZ2VzIjpbeyJpdG
VtcyI6WyIxIiAgICAgXX1dfQ==
##TITLE=	RP237 char_2.10.fid
##JCAMP-DX=	6.0	$$ MestReNova 14.3.3-33362
##DATA TYPE=	NMR SPECTRUM
##DATA CLASS=	XYDATA
##BLOCK_ID=	1
##ORIGIN=	Bruker BioSpin GmbH
##OWNER=	nmrsu
##NUMDIM=	1
##$MNOVA/METADATA=	(ITEM,BASE64)
eyJhbmdsZSI6MCwiYXhlcyI6eyJ4Ijp7Im1heCI6MTYuMDY2NDU5OTk5OTc0OTQsIm1pbiI6LTMuNzY
0NzQyMzgyNzQ4NzU1fSwieSI6eyJtYXgiOjc3MTY2LjI4OTA2MjUsIm1pbiI6LTY5NTEuNzI1NDM3MT
Y0MzA3fX0sInBvaW50cyI6W3sieCI6NTMyMSwieSI6NTgzNX0seyJ4Ijo4NzIyLCJ5Ijo1ODM1fSx7I
ngiOjg3MjIsInkiOjgyMDh9LHsieCI6NTMyMSwieSI6ODIwOH0seyJ4Ijo1MzIxLCJ5Ijo1ODM1fV0s
InoiOjB9
##.OBSERVE FREQUENCY=	700.35432466099996418
##.OBSERVE NUCLEUS=	^1H
##.SOLVENT NAME=	CDCl3
##.PULSE SEQUENCE=	zg30
##LONGDATE=	2023/06/06 12:43:22.000
##.ACQUISITIONMODE=	SIMULTANEOUS (DQD)
##$ORIGINAL FORMAT=	Bruker XWIN-NMR
##$MNOVA/SCALES_VERSION=	9
##$PARAMETER FILE=	(acqus, ASCII, /private/var/folders/f6/rjf_tdyn2v98c5c0wvkgn4s80000gq/T/YqYGWuLYQvW2wLpRcbmr6A/10/acqus, 0)
$$ ##TITLE= Parameter file, TopSpin 4.1.3
$$ ##JCAMPDX= 5.0
$$ ##DATATYPE= Parameter Values
$$ ##NPOINTS= 1	$$ modification sequence number
$$ ##ORIGIN= Bruker BioSpin GmbH
$$ ##OWNER= nmrsu
$$ $$ 2023-06-06 12:42:29.724 +0100  nmrsu@CZC7167VR1
$$ $$ Z:/700/data/tds/nmr/RP237 char_2/10/acqus
$$ $$ process C:\Bruker\TopSpin4.1.3\prog\mod\dirdata.exe
$$ ##$ACQT0= -2.0981556054023
$$ ##$AMP= (0..31)
$$ 100 100 100 100 100 100 100 100 100 100 100 100 100 100 100 100 100 100
$$ 100 100 100 100 100 100 100 100 100 100 100 100 100 100
$$ ##$AMPCOIL= (0..32)
$$ -1 0 0 0 0 0 0 0 0 0 0 0 0 0 0 0 0 0 0 0 0 0 0 0 0 0 0 0 0 0 0 0 0
$$ ##$AQSEQ= 0
$$ ##$AQ_mod= 3
$$ ##$AUNM= <au_zg>
$$ ##$AUTOPOS= <6 >
$$ ##$BF1= 700.349999998
$$ ##$BF2= 700.349999998
$$ ##$BF3= 700.349999998
$$ ##$BF4= 700.349999998
$$ ##$BF5= 700.349999998
$$ ##$BF6= 700.349999998
$$ ##$BF7= 700.349999998
$$ ##$BF8= 700.349999998
$$ ##$BWFAC= (0..63)
$$ 0 0 0 0 0 0 0 0 0 0 0 0 0 0 0 0 0 0 0 0 0 0 0 0 0 0 0 0 0 0 0 0 0 0 0 0
$$ 0 0 0 0 0 0 0 0 0 0 0 0 0 0 0 0 0 0 0 0 0 0 0 0 0 0 0 0
$$ ##$BYTORDA= 0
$$ ##$CHANFCU= (0..24)
$$ 0 1 0 0 0 0 0 0 0 0 0 0 0 0 0 0 0 0 0 0 0 0 0 0 0
$$ ##$CHANREC= (0..24)
$$ 0 0 0 0 0 0 0 0 0 0 0 0 0 0 0 0 0 0 0 0 0 0 0 0 0
$$ ##$CHEMSTR= <none>
$$ ##$CNST= (0..63)
$$ 1 1 1 1 1 1 1 1 1 1 1 1 1 1 1 1 1 1 1 1 1 1 1 1 1 1 1 1 1 1 1 1 1 1 1 1
$$ 1 1 1 1 1 1 1 1 1 1 1 1 1 1 1 1 1 1 1 1 1 1 1 1 1 1 1 1
$$ ##$CPDPRG= (0..8)
$$ <> <> <> <> <> <> <> <> <>
$$ ##$D= (0..63)
$$ 0 1 0 0 0 0 0 0 0 0 0 0 0 0 0 0 0.0002 0 0 0 0 0 0 0 0 0 0 0 0 0 0 0 0
$$ 0 0 0 0 0 0 0 0 0 0 0 0 0 0 0 0 0 0 0 0 0 0 0 0 0 0 0 0 0 0 0
$$ ##$DATE= 1686051802
$$ ##$DATE_START= 1686051759
$$ ##$DE= 6.901845
$$ [...]
$$ ##$ShimPowRng3= (0..63)
$$ 1 1 1 1 1 1 1 1 1 1 1 1 1 1 1 1 1 1 1 1 1 1 1 1 1 1 1 1 1 1 1 1 1 1 1 1
$$ 1 1 1 1 0 0 0 0 0 0 0 0 0 0 0 0 0 0 0 0 0 0 0 0 0 0 0 0
$$ ##$ShimPowType1= 8
$$ ##$ShimPowType2= 8
$$ ##$ShimPowType3= 0
$$ ##$ShimPowType4= 0
$$ ##$ShimPowType5= 0
$$ ##$ShimPowType6= 0
$$ ##$ShimPowType7= 0
$$ ##$ShimPowType8= 0
$$ ##$ShimSysActGrad= (0..63)
$$ 1 2 3 4 13 5 7 11 10 9 6 8 12 18 19 20 21 15 22 23 24 14 25 16 26 17 27
$$ 28 31 32 33 34 35 36 37 38 0 0 0 0 0 0 0 0 0 0 0 0 0 0 0 0 0 0 0 0 0 0
$$ 0 0 0 0 0 0
$$ ##$ShimSysAngle= <>
$$ ##$ShimSysFunc= (0..63)
$$ 1 2 3 4 5 6 7 8 9 10 0 37 38 35 16 15 14 13 12 11 28 27 26 25 24 23 36
$$ 22 30 29 20 21 34 33 32 31 17 18 19 0 0 0 0 0 0 0 0 0 0 0 0 0 0 0 0 0 0
$$ 0 0 0 0 0 0 0
$$ ##$ShimSysMatId= <292722da.dat>
$$ ##$ShimSysMatrix= 1
$$ ##$ShimSysMinMaxUG= 130000
$$ ##$ShimSysOffset= <29 mm>
$$ ##$ShimSysType= 4
$$ ##$ShimUnit= 3
$$ ##$SpectrOsVersion= <4.1.156.20210628>
$$ ##$TCubeEth= <192.168.180.38>
$$ ##$TCubeSeqDevice= <>
$$ ##$TOSITY= <no>
$$ ##$TRIPLO2= 0
$$ ##$TopSpinVersion= <TopSpin 4.1.3>
$$ ##$TrxFreqFormula= (0..23)
$$ <TrxFreqFormula(2.0,700350000.000000,'TRX',Trx(1.0,'TRX 1200.1',1,5.000000,1290.000000))>
$$ <TrxFreqFormula(2.0,700350000.000000,'TRX',Trx(1.0,'TRX 1200.2',1,5.000000,1290.000000))>
$$ <TrxFreqFormula(2.0,700350000.000000,'TRX',Trx(1.0,'TRX 1200.3',1,5.000000,1290.000000))>
$$ <> <> <> <> <> <> <> <> <> <> <> <> <> <> <> <> <> <> <> <> <>
$$ ##$TrxPN= (0..23)
$$ <Z148391> <Z148391> <Z148391> <> <> <> <> <> <> <> <> <> <> <> <> <> <>
$$ <> <> <> <> <> <> <>
$$ ##$TrxSN= (0..23)
$$ <00336> <00337> <00342> <> <> <> <> <> <> <> <> <> <> <> <> <> <> <> <>
$$ <> <> <> <> <>
$$ ##$VCubeEth= (0..23)
$$ <no> <no> <no> <no> <no> <no> <no> <no> <no> <no> <no> <no> <no> <no> <no>
$$ <no> <no> <no> <no> <no> <no> <no> <no> <no>
$$ ##$VTU= 2
$$ ##$VTUETH= <192.168.99.11>
$$ ##$VTUTY= <no>
$$ ##$ValueLine= no
$$ ##$VpuPN= (0..23)
$$ <no> <no> <no> <no> <no> <no> <no> <no> <no> <no> <no> <no> <no> <no> <no>
$$ <no> <no> <no> <no> <no> <no> <no> <no> <no>
$$ ##$VpuSN= (0..23)
$$ <no> <no> <no> <no> <no> <no> <no> <no> <no> <no> <no> <no> <no> <no> <no>
$$ <no> <no> <no> <no> <no> <no> <no> <no> <no>
$$ ##$WBREFAM= (0..31)
$$ 99.8 100 100 100 100 100 100 100 100 100 100 100 100 100 100 100 100 100
$$ 100 100 100 100 100 100 100 100 100 100 100 100 100 100
$$ ##$WBREFLM= (0..31)
$$ 1 0 1 0 0 0 0 0 0 0 0 0 0 0 0 0 0 0 0 0 0 0 0 0 0 0 0 0 0 0 0 0
$$ ##$WBREFPH= (0..31)
$$ 0.05 0 0 0 0 0 0 0 0 0 0 0 0 0 0 0 0 0 0 0 0 0 0 0 0 0 0 0 0 0 0 0
$$ ##$WBSGU= (0..31)
$$ 1 2 4 0 0 0 0 0 0 0 0 0 0 0 0 0 0 0 0 0 0 0 0 0 0 0 0 0 0 0 0 0
$$ ##END=
$$ 
##$DECIM=	1440
##$DSPFVS=	21
##XUNITS=	HZ
##YUNITS=	ARBITRARY UNITS
##FIRSTX=	11252.145533468179565
##LASTX=	-2636.6373916077859576
##DELTAX=	-0.1059638129340278595
##XFACTOR=	1
##YFACTOR=	2.1409130184331797153
##FIRSTY=	132.1877593994140625
##MINY=	63.39566802978515625
##MAXY=	70151.296875
##NPOINTS=	131072
##XYDATA=	(X++(Y..Y))
$$ [...]
4486H8j%%%%%%j%%j%%%j%%%%%%%%%%%%%%j%%%J%%jJ%%%%%%JJ%J%%J%J%%%%%j%j%j%j%j%J%
4479H5%%j%%%J%J%%J%%%%%%%%%j%%%j%%%j%%%%%j%%%%%%%%%J%%%%%%%%%J%J%%%%%J%%%%Jj
4472H7%%%%%j%j%J%j%%j%%%%%%j%%j%%%%J%%%%%%Jj%%%%%%j%%%%j%%J%J%j%%%J%%%%%j%J%
4464H3%j%%%%Jj%%jJ%J%%%%%%%%%%j%%%%%%%%%%%%%%%%%j%%%%%%%%J%j%%%%%%%%%%%%J%%j
4457H1J%%%%j%%J%%%j%%%%J%%%%%%%%%%%%%%%%%%%%%%%%%%j%J%%%%%%%%%%%%%%%%j%%%%%J
4449H2%%j%%%%%%%%Jj%J%%%%%j%%%%%%%%%%%J%jJ%%Jj%%%%%%%%%%%%%%%%%%%%%%%%%%%j%%
4442H1%J%%%%%%%%%%%%jJ%%%%%%%%%%jJ%%%%jJ%%%%jJ%%%%%j%%%jJ%%%J%%%%%%%%%%%%%%%
4435H2%j%%%%%%%%J%%%%%%%%%%%%J%j%%%%%%j%%%%%%%%%%J%%%%J%%j%%%%%%%%%%%%jJ%%%%
$$ plain form
4486 88 87 87 87 87 87 87 87 86 86 86 85 85 85 85 84 84 84 84 84 84 84 84 84 84 84 84 84 84 84 83 83 83 83 84 84 84 83 84 84 84 84 84 84 84 85 86 86 87 87 87 88 88 89 89 89 89 89 89 88 88 87 87 86 86 85 85 84 84 85 85
4479 85 85 85 84 84 84 84 85 85 86 86 86 87 87 87 87 87 87 87 87 87 87 86 86 86 86 85 85 85 85 84 84 84 84 84 84 83 83 83 83 83 83 83 83 83 83 84 84 84 84 84 84 84 84 84 84 85 85 86 86 86 86 86 86 87 87 87 87 87 88 87
4472 87 87 87 87 87 87 86 86 85 85 86 86 85 85 85 84 84 84 84 84 84 84 83 83 83 82 82 82 82 82 83 83 83 83 83 83 83 84 83 83 83 83 83 83 83 82 82 82 82 82 81 81 81 82 82 83 83 82 82 82 82 83 83 83 83 83 83 82 82 83 83
4464 83 83 82 82 82 82 82 83 82 82 82 81 82 82 83 83 83 83 83 83 83 83 83 83 83 82 82 82 82 82 82 82 82 82 82 82 82 82 82 82 82 82 82 81 81 81 81 81 81 81 81 81 82 82 81 81 81 81 81 81 81 81 81 81 81 81 81 82 82 82 81
4457 81 82 82 82 82 82 81 81 81 82 82 82 82 81 81 81 81 81 82 82 82 82 82 82 82 82 82 82 82 82 82 82 82 82 82 82 82 82 82 82 82 82 82 82 82 81 81 82 82 82 82 82 82 82 82 82 82 82 82 82 82 82 82 82 81 81 81 81 81 81 82
4449 82 82 82 81 81 81 81 81 81 81 81 81 82 81 81 82 82 82 82 82 82 81 81 81 81 81 81 81 81 81 81 81 81 82 82 81 82 82 82 83 82 82 82 82 82 82 82 82 82 82 82 82 82 82 82 82 82 82 82 82 82 82 82 82 82 82 82 82 81 81 81
4442 81 81 82 82 82 82 82 82 82 82 82 82 82 82 82 81 82 82 82 82 82 82 82 82 82 82 82 81 82 82 82 82 82 81 82 82 82 82 82 81 82 82 82 82 82 82 81 81 81 81 80 81 81 81 81 82 82 82 82 82 82 82 82 82 82 82 82 82 82 82 82
4435 82 82 81 81 81 81 81 81 81 81 81 82 82 82 82 82 82 82 82 82 82 82 82 82 83 83 82 82 82 82 82 82 82 81 81 81 81 81 81 81 81 81 81 81 82 82 82 82 82 83 83 83 82 82 82 82 82 82 82 82 82 82 82 82 82 81 82 82 82 82 82
4427H2%%%%%%J%%%%%%%%j%%%%%%%%%%%%%%J%%%%j%%j%JjJ%Jj%%%%%%J%j%%%%%%%%j%%J%%%
4420H2%j%J%J%%%%%%j%%J%%%%%%j%%%%%%%%%%J%%%%%%%%%%%%%%%%j%%%Jj%%%%%J%%%jJ%%%
4412H3%%%%%%j%%%%%%%%J%%%%%%j%%%%%%%%%%J%%%%%%%%%jJ%%%%%%J%%%%J%%%J%J%%%%JJJ
4405I0JKKJKKJJ%%%jjjjkjk%jj%%%%%%JJ%J%J%KKKLLLMMLLLKJ%jjkjjjJ%KLLNOOQQQPPOOP
4397B06OPRJ0J3J4J5J5J2J0OJlpj1j4j6j6j6j6j4j1j0ponlkjjkkkllklllkjj%JKLMNOOQPQ
4392A88PPPQQJ0J2J4J5J5J4J2PMjnrj3j4j7j6j6j5j3j1rpnlkJKNOQJ0J1J4J5J6J7J6J4J1Q
4387C26Kkoj0j1j3j4j3j1j0rrqqqpqpqoommkkj%JKLLLMLLLJKJJKLLMOQJ0J2J4J5J5J6J5J2
4381C06RO%lpj1j1j3j3j1j1rqpppppqqqppnnmmljjJJJJK%Jjjlkllmlllllkjkjj%%%%j%%%%
$$ plain form
4427 82 82 82 82 82 82 82 83 83 83 83 83 83 83 83 83 82 82 82 82 82 82 82 82 82 82 82 82 82 82 82 83 83 83 83 83 82 82 82 81 81 82 81 82 82 83 82 82 82 82 82 82 82 83 83 82 82 82 82 82 82 82 82 82 81 81 81 82 82 82 82
4420 82 82 81 81 82 82 83 83 83 83 83 83 83 82 82 82 83 83 83 83 83 83 83 82 82 82 82 82 82 82 82 82 82 82 83 83 83 83 83 83 83 83 83 83 83 83 83 83 83 83 83 82 82 82 82 83 82 82 82 82 82 82 83 83 83 83 82 83 83 83 83
4412 83 83 83 83 83 83 83 82 82 82 82 82 82 82 82 82 83 83 83 83 83 83 83 82 82 82 82 82 82 82 82 82 82 82 83 83 83 83 83 83 83 83 83 83 82 83 83 83 83 83 83 83 84 84 84 84 84 85 85 85 85 86 86 87 87 87 87 87 88 89 90
4405 90 91 93 95 96 98 100 101 102 102 102 102 101 100 99 98 96 95 93 93 92 91 91 91 91 91 91 91 92 93 93 94 94 95 95 97 99 101 104 107 110 114 118 121 124 127 129 130 130 129 128 126 125 124 123 124 124 126 129 132 137 143 149 157 165 173 180 187 193 199 206
4397 206 212 219 228 238 251 265 280 295 307 317 323 324 321 314 303 289 273 257 241 225 211 200 190 183 177 172 169 167 166 165 163 161 159 156 153 151 148 145 142 140 139 138 138 139 141 144 148 153 159 165 173 180 188
4392 188 195 202 209 217 225 235 247 261 276 291 305 317 324 328 327 322 313 300 286 269 253 237 222 209 198 189 182 177 174 172 173 175 180 186 194 204 215 229 244 260 277 293 307 318 326
4387 326 328 326 320 310 299 286 272 259 248 238 229 220 212 204 196 189 181 174 166 160 154 150 146 144 142 141 141 142 144 147 150 153 157 160 163 166 167 169 170 171 173 176 179 183 189 197 207 219 233 248 263 279 294 306
4381 306 315 321 321 318 311 300 289 276 263 252 241 232 224 217 210 203 196 189 181 173 165 158 151 146 141 137 133 130 129 128 129 130 131 132 134 134 135 134 133 130 128 125 122 118 115 112 109 106 103 101 100 98 97 96 96 96 96 96 95 95 95 95 95
4375I5J%KJJJJJK%%%%jjkkjkkjkjjj%j%j%%j%%Jj%%%%%%%%%%%J%%j%%%%%%j%%%j%%%J%%%%
4367H4j%%%%%%%%%%%%%%jJj%%J%j%%J%%%%%%%%j%%%%%%%%%%j%%%J%%%%%%%%%%%%%%%%%J%%
4360H3%%%j%%%%%%%%%%%%Jj%%%%%%%%Jj%J%%j%%%%%%J%%%%%%%%%%%%%J%%%%%%%j%%%%%%J%
4352H4%%j%%J%j%%J%J%JJ%%J%J%%%j%%%%%jJ%J%%JJ%JJJJJ%JJJJKKLJKJJ%jjjjkkkjkjjjj
4345I5jj%%%%j%j%%j%j%%%%%%J%J%JJ%JJJJJJJJKKKKKJJ%%jkjklkkjjjjjjj%%JJJJKKJKKK
4338A08JK%Jjjjkjkjjjjjjjjjjjjj%j%%j%%J%%%J%J%%%%%J%J%%KJJJKKKKKJJ%%jjkjjkjjj
4330A00jjjjjj%jjjjjj%%j%%%%%%%J%%%j%j%%j%j%%%%j%%%%%%%%%%%%%J%%%%%%%%%%%j%%%
4323H3%j%%%%%%%%%%%%%%%%%%%%%%%j%%J%%%%%%j%J%%%%%%%%%%%%%%%j%%%%%J%%j%%J%%j%
$$ plain form
4375 95 96 96 98 99 100 101 102 103 105 105 105 105 105 104 103 101 99 98 96 94 93 91 90 89 88 88 87 87 86 86 86 85 85 85 86 85 85 85 85 85 85 85 85 85 85 85 85 86 86 86 85 85 85 85 85 85 85 84 84 84 84 83 83 83 83 84 84 84 84 84
4367 84 83 83 83 83 83 83 83 83 83 83 83 83 83 83 83 82 83 82 82 82 83 83 82 82 82 83 83 83 83 83 83 83 83 83 82 82 82 82 82 82 82 82 82 82 82 81 81 81 81 82 82 82 82 82 82 82 82 82 82 82 82 82 82 82 82 82 82 83 83 83
4360 83 83 83 83 82 82 82 82 82 82 82 82 82 82 82 82 82 83 82 82 82 82 82 82 82 82 82 83 82 82 83 83 83 82 82 82 82 82 82 82 83 83 83 83 83 83 83 83 83 83 83 83 83 83 84 84 84 84 84 84 84 84 83 83 83 83 83 83 83 84 84
4352 84 84 84 83 83 83 84 84 83 83 83 84 84 85 85 86 87 87 87 88 88 89 89 89 89 88 88 88 88 88 88 87 88 88 89 89 89 90 91 91 92 93 94 95 96 96 97 98 99 100 102 104 107 108 110 111 112 112 111 110 109 108 106 104 102 101 99 98 97 96 95
4345 95 94 93 93 93 93 93 92 92 91 91 91 90 90 89 89 89 89 89 89 89 90 90 91 91 92 93 93 94 95 96 97 98 99 100 101 103 105 107 109 111 112 113 113 113 112 110 109 107 104 102 100 99 98 97 96 95 94 93 93 93 94 95 96 97 99 101 102 104 106 108
4338 108 109 111 111 112 111 110 109 107 106 104 103 102 101 100 99 98 97 96 95 94 93 92 91 91 90 90 90 89 89 89 90 90 90 90 91 91 92 92 92 92 92 92 93 93 94 94 94 96 97 98 99 101 103 105 107 109 110 111 111 111 110 109 107 106 105 103 102 101 100
4330 100 99 98 97 96 95 94 94 93 92 91 90 89 88 88 88 87 87 87 87 87 87 87 87 88 88 88 88 87 87 86 86 86 85 85 84 84 84 84 84 83 83 83 83 83 83 83 83 83 83 83 83 83 83 84 84 84 84 84 84 84 84 84 84 84 84 83 83 83 83
4323 83 83 82 82 82 82 82 82 82 82 82 82 82 82 82 82 82 82 82 82 82 82 82 82 82 82 81 81 81 82 82 82 82 82 82 82 81 81 82 82 82 82 82 82 82 82 82 82 82 82 82 82 82 82 81 81 81 81 81 81 82 82 82 81 81 81 82 82 82 81 81
4316H1%%J%%%%%%%%j%%%Jj%%%%%%%%%%%%%%%%%%%J%%jJ%%%%%j%%%%%%%%%%%%j%J%j%%%J%%
4308H1%%%%%%%%%%%%J%%j%%%%%%%%%%%%%%%j%%J%%%%j%%%%%%%%%%%%J%%%%%%j%%%%J%%j%%
4301H0%%J%%%j%%%%J%%j%%%%%%%J%%%%%jJ%%%%%%%%%%J%%j%%%%%%%%%%%%%%%%%%%%j%%%%%
4293H0%%%%%%%%%%%%%%%%%%%%%%%%%%J%%%%%%j%%%%J%%%%%%Jj%%%%%j%%%J%%%%%j%%%%%J%
4286H1%%%j%%%%%%J%%%%%%%%%%j%%J%%%%%%%J%%j%%%%J%%jJ%%%%%%j%%%J%j%%%%%%%%%%%J
4278H2j%%%J%j%%%%%%%%J%%j%%%%%%%%%%Jj%%%j%%J%%%%%j%%%%%%J%%%%%%%j%%%J%%%%%%%
4271H1%%%%j%%%%J%%%%%%%%%%%%%%%j%%J%%%%%%%%%%%%%j%%J%%%%%%%jJ%%%%%j%JJ%%j%%%
4264H1j%J%%%%%%%%%%%%%%%%%%%%%%%Jj%%%%%%%jJ%%%%%%%%%%Jj%%jJ%%%%%%%%%j%%%%J%%
$$ plain form
4316 81 81 81 82 82 82 82 82 82 82 82 82 81 81 81 81 82 81 81 81 81 81 81 81 81 81 81 81 81 81 81 81 81 81 81 81 81 82 82 82 81 82 82 82 82 82 82 81 81 81 81 81 81 81 81 81 81 81 81 81 80 80 81 81 80 80 80 80 81 81 81
4308 81 81 81 81 81 81 81 81 81 81 81 81 81 82 82 82 81 81 81 81 81 81 81 81 81 81 81 81 81 81 81 81 80 80 80 81 81 81 81 81 80 80 80 80 80 80 80 80 80 80 80 80 80 81 81 81 81 81 81 81 80 80 80 80 80 81 81 81 80 80 80
4301 80 80 80 81 81 81 81 80 80 80 80 80 81 81 81 80 80 80 80 80 80 80 80 81 81 81 81 81 81 80 81 81 81 81 81 81 81 81 81 81 81 82 82 82 81 81 81 81 81 81 81 81 81 81 81 81 81 81 81 81 81 81 81 81 81 80 80 80 80 80 80
4293 80 80 80 80 80 80 80 80 80 80 80 80 80 80 80 80 80 80 80 80 80 80 80 80 80 80 80 81 81 81 81 81 81 81 80 80 80 80 80 81 81 81 81 81 81 81 82 81 81 81 81 81 81 80 80 80 80 81 81 81 81 81 81 80 80 80 80 80 80 81 81
4286 81 81 81 81 80 80 80 80 80 80 80 81 81 81 81 81 81 81 81 81 81 81 80 80 80 81 81 81 81 81 81 81 81 82 82 82 81 81 81 81 81 82 82 82 81 82 82 82 82 82 82 82 81 81 81 81 82 82 81 81 81 81 81 81 81 81 81 81 81 81 82
4278 82 81 81 81 81 82 82 81 81 81 81 81 81 81 81 81 82 82 82 81 81 81 81 81 81 81 81 81 81 81 82 81 81 81 81 80 80 80 81 81 81 81 81 81 80 80 80 80 80 80 80 81 81 81 81 81 81 81 81 80 80 80 80 81 81 81 81 81 81 81 81
4271 81 81 81 81 81 80 80 80 80 80 81 81 81 81 81 81 81 81 81 81 81 81 81 81 81 81 80 80 80 81 81 81 81 81 81 81 81 81 81 81 81 81 81 80 80 80 81 81 81 81 81 81 81 81 80 81 81 81 81 81 81 80 80 81 82 82 82 81 81 81 81
4264 81 80 80 81 81 81 81 81 81 81 81 81 81 81 81 81 81 81 81 81 81 81 81 81 81 81 81 82 81 81 81 81 81 81 81 81 80 81 81 81 81 81 81 81 81 81 81 81 82 81 81 81 80 81 81 81 81 81 81 81 81 81 81 80 80 80 80 80 81 81 81
4256H1%%%%%%%%%%%j%%%%J%%%%%J%j%%%%%%%%%%%%%%%%%%%%%%%%%%%%%%%Jj%J%%j%%J%%j%
4249H1%%%%Jj%%%%%J%%%%%j%%%%j%J%%%%%%%%%%%J%%%%%%%%%%%%%%%j%%%%%%%%%%%%%%%%%
4241H1%%%%%%%%%%%%%%%%%%%%%%%%%%%%%%%%%%%%%%%J%%%%%%%%j%%%%%%%j%%%%%%j%%%%J%
4234H0%%J%%%%%%%%j%%%%J%%%j%J%%%%%%%J%j%%%%%%%%%J%%%%j%Jj%%%%%%%%%%j%%J%%%%%
4227H1%jJ%%%%%%%j%%jJ%%%%%%%%%%J%%%%%%j%%%%Jj%%%%%%%%%J%%%%%%%%%%%%%%%j%Jj%%
4219H0%%%%%%%%%%%%%%%%J%%%%%%%%%%%%%j%%%%%J%%%%%%%%j%%%%%%%%%%j%%J%%%%Jj%%%%
4212H0%%%%%%%%%%%%%J%%%%%%%j%%%%%%%%%%%J%j%%%J%j%%%%%%J%j%%%%%%%%%%%%%%%J%j%
4204H0J%%j%%%%%%jJJ%%j%%%%%%%%%J%%%j%%%%%%%%%%j%%J%%%%%%%%%%%%%%%%%%%%%%J%%%
$$ plain form
4256 81 81 81 81 81 81 81 81 81 81 81 81 80 80 80 80 80 81 81 81 81 81 81 82 82 81 81 81 81 81 81 81 81 81 81 81 81 81 81 81 81 81 81 81 81 81 81 81 81 81 81 81 81 81 81 81 81 82 81 81 82 82 82 81 81 81 82 82 82 81 81
4249 81 81 81 81 81 82 81 81 81 81 81 81 82 82 82 82 82 82 81 81 81 81 81 80 80 81 81 81 81 81 81 81 81 81 81 81 81 82 82 82 82 82 82 82 82 82 82 82 82 82 82 82 82 81 81 81 81 81 81 81 81 81 81 81 81 81 81 81 81 81 81
4241 81 81 81 81 81 81 81 81 81 81 81 81 81 81 81 81 81 81 81 81 81 81 81 81 81 81 81 81 81 81 81 81 81 81 81 81 81 81 81 81 82 82 82 82 82 82 82 82 82 81 81 81 81 81 81 81 81 80 80 80 80 80 80 80 79 79 79 79 79 80 80
4234 80 80 80 81 81 81 81 81 81 81 81 81 80 80 80 80 80 81 81 81 81 80 80 81 81 81 81 81 81 81 81 82 82 81 81 81 81 81 81 81 81 81 81 82 82 82 82 82 81 81 82 81 81 81 81 81 81 81 81 81 81 81 80 80 80 81 81 81 81 81 81
4227 81 81 80 81 81 81 81 81 81 81 81 80 80 80 79 80 80 80 80 80 80 80 80 80 80 80 81 81 81 81 81 81 81 80 80 80 80 80 81 80 80 80 80 80 80 80 80 80 80 81 81 81 81 81 81 81 81 81 81 81 81 81 81 81 81 80 80 81 80 80 80
4219 80 80 80 80 80 80 80 80 80 80 80 80 80 80 80 80 80 81 81 81 81 81 81 81 81 81 81 81 81 81 81 80 80 80 80 80 80 81 81 81 81 81 81 81 81 81 80 80 80 80 80 80 80 80 80 80 80 79 79 79 80 80 80 80 80 81 80 80 80 80 80
4212 80 80 80 80 80 80 80 80 80 80 80 80 80 80 81 81 81 81 81 81 81 81 80 80 80 80 80 80 80 80 80 80 80 80 81 81 80 80 80 80 81 81 80 80 80 80 80 80 80 81 81 80 80 80 80 80 80 80 80 80 80 80 80 80 80 80 80 81 81 80 80
4204 80 81 81 81 80 80 80 80 80 80 80 79 80 81 81 81 80 80 80 80 80 80 80 80 80 80 81 81 81 81 80 80 80 80 80 80 80 80 80 80 80 79 79 79 80 80 80 80 80 80 80 80 80 80 80 80 80 80 80 80 80 80 80 80 80 80 80 81 81 81 81
4197H1j%%%%J%%%%%%%%j%%%%%%%%%%%%%%%%%%%%%%%%%%%%%%%%j%J%%%%%%%%%%%%%%%%%%%%
4189H0%%%%%%%%%%%%%j%%%%%J%%%%%%%%%%%%%%%%%%%%%%%%%%%%%%%%%%%%%%%j%%%%J%%%%%
4182H0%%%%%%j%%%%%%%%%%%%%J%%j%%%%J%j%%%%%%%%%%%%%%%%J%%J%%j%%%j%%%%%%%Jj%%%
4175G9%%%%Jj%%jJ%%%Jj%%%%%%%%%%J%%%%%%%j%%%%%%%%%%%%%%%%J%%j%%%%j%%J%%%%Jj%%
4167G9%%J%%j%%%%%%%%%%%%%%J%j%%%%%%%%%j%J%%%%%%%J%j%%%%%%%%%%%%%%%%%%%%jJ%%%
4160G9%%%%%%%%%%%j%%%%J%%%%%%%J%%%%%j%%%%%%%%J%%%j%%%Jj%%%%%%%%%%%%J%%%j%%%J
4152H0%%%%%%j%%%%%%jJ%%%%%%%%%%%%%J%j%%j%%%%%%%Jj%Jj%J%%j%%%%%%%%%%J%j%%%%%J
4145G9j%%%%%%%%%%%%%%%%%jJ%%j%J%%J%j%%%%%%j%%%%%%J%%%%j%%J%%%%%j%J%%%%%%%%%%
$$ plain form
4197 81 80 80 80 80 80 81 81 81 81 81 81 81 81 81 80 80 80 80 80 80 80 80 80 80 80 80 80 80 80 80 80 80 80 80 80 80 80 80 80 80 80 80 80 80 80 80 80 79 79 80 80 80 80 80 80 80 80 80 80 80 80 80 80 80 80 80 80 80 80 80
4189 80 80 80 80 80 80 80 80 80 80 80 80 80 80 79 79 79 79 79 79 80 80 80 80 80 80 80 80 80 80 80 80 80 80 80 80 80 80 80 80 80 80 80 80 80 80 80 80 80 80 80 80 80 80 80 80 80 80 80 80 79 79 79 79 79 80 80 80 80 80 80
4182 80 80 80 80 80 80 80 79 79 79 79 79 79 79 79 79 79 79 79 79 79 80 80 80 79 79 79 79 79 80 80 79 79 79 79 79 79 79 79 79 79 79 79 79 79 79 79 79 80 80 80 81 81 81 80 80 80 80 79 79 79 79 79 79 79 79 80 79 79 79 79
4175 79 79 79 79 79 80 79 79 79 78 79 79 79 79 80 79 79 79 79 79 79 79 79 79 79 79 80 80 80 80 80 80 80 80 79 79 79 79 79 79 79 79 79 79 79 79 79 79 79 79 79 80 80 80 79 79 79 79 79 78 78 78 79 79 79 79 79 80 79 79 79
4167 79 79 79 80 80 80 79 79 79 79 79 79 79 79 79 79 79 79 79 79 79 80 80 79 79 79 79 79 79 79 79 79 79 78 78 79 79 79 79 79 79 79 79 80 80 79 79 79 79 79 79 79 79 79 79 79 79 79 79 79 79 79 79 79 79 79 78 79 79 79 79
4160 79 79 79 79 79 79 79 79 79 79 79 79 78 78 78 78 78 79 79 79 79 79 79 79 79 80 80 80 80 80 80 79 79 79 79 79 79 79 79 79 80 80 80 80 79 79 79 79 80 79 79 79 79 79 79 79 79 79 79 79 79 79 80 80 80 80 79 79 79 79 80
4152 80 80 80 80 80 80 80 79 79 79 79 79 79 79 78 79 79 79 79 79 79 79 79 79 79 79 79 79 79 80 80 79 79 79 78 78 78 78 78 78 78 78 79 78 78 79 78 78 79 79 79 78 78 78 78 78 78 78 78 78 78 78 79 79 78 78 78 78 78 78 79
4145 79 78 78 78 78 78 78 78 78 78 78 78 78 78 78 78 78 78 78 77 78 78 78 77 77 78 78 78 79 79 78 78 78 78 78 78 78 77 77 77 77 77 77 77 78 78 78 78 78 77 77 77 78 78 78 78 78 78 77 77 78 78 78 78 78 78 78 78 78 78 78
4138G8j%%%%%%Jj%%J%%%%%%%%%%%jJ%%%j%J%%%%%%%%j%Jj%%J%J%%j%%%%J%%%%%j%%%%%%%%
4130G8%%%%J%%j%%%%%%%%J%%%%%j%%%%%J%%%%%%%%%%%%%%%Jj%%%%J%%%%j%%%jJ%%%%%%%%%
4123G9%%J%%j%%%%%%j%%%%%%%%%%%J%%%%%%%%j%%%J%jJ%%j%%%%%Jj%Jj%%%%J%%j%%%%%%%%
4115G8%%Jj%%%%%%%%%%%%%%Jj%%%j%%%%%%J%%%%j%%%Jj%%%%%%Jj%%%%%%%%%j%%%%%J%%%%%
4108G7%%%%%J%j%%%%J%%%%j%%%%%%%%%%%%%%%%%%%%%%J%%jJ%%%j%%%J%%%%%%%%%%%%%%%%%
4100G8%%J%%%%%j%%%%%%%%%J%%%%Jj%j%%%%%%J%%%%%%%jJ%%%%%%%Jj%j%%J%%%%%%J%%%%%%
4093H0%%%j%%J%%%j%J%%%%%%%%%%%%%%J%j%J%%j%%%jJ%%J%%%J%%%%%%%j%%%%%%%%jJ%%%%%
4086H1%j%%J%%%%%%%%j%%%J%j%%%j%%%%j%J%%%%%%%%%j%%%%%%J%%%%%jJ%%%%%%%%%%%%j%J
$$ plain form
4138 78 77 77 77 77 77 77 77 78 77 77 77 78 78 78 78 78 78 78 78 78 78 78 78 77 78 78 78 78 77 77 78 78 78 78 78 78 78 78 78 77 77 78 77 77 77 78 78 79 79 79 78 78 78 78 78 79 79 79 79 79 79 78 78 78 78 78 78 78 78 78
4130 78 78 78 78 78 79 79 79 78 78 78 78 78 78 78 78 78 79 79 79 79 79 79 78 78 78 78 78 78 79 79 79 79 79 79 79 79 79 79 79 79 79 79 79 79 80 79 79 79 79 79 80 80 80 80 80 79 79 79 79 78 79 79 79 79 79 79 79 79 79 79
4123 79 79 79 80 80 80 79 79 79 79 79 79 79 78 78 78 78 78 78 78 78 78 78 78 78 79 79 79 79 79 79 79 79 79 78 78 78 78 79 79 78 79 79 79 78 78 78 78 78 78 79 78 78 79 78 78 78 78 78 79 79 79 78 78 78 78 78 78 78 78 78
4115 78 78 78 79 78 78 78 78 78 78 78 78 78 78 78 78 78 78 78 79 78 78 78 78 77 77 77 77 77 77 77 78 78 78 78 78 77 77 77 77 78 77 77 77 77 77 77 77 78 77 77 77 77 77 77 77 77 77 77 76 76 76 76 76 76 77 77 77 77 77 77
4108 77 77 77 77 77 77 78 78 77 77 77 77 77 78 78 78 78 78 77 77 77 77 77 77 77 77 77 77 77 77 77 77 77 77 77 77 77 77 77 77 77 78 78 78 77 78 78 78 78 77 77 77 77 78 78 78 78 78 78 78 78 78 78 78 78 78 78 78 78 78 78
4100 78 78 78 79 79 79 79 79 79 78 78 78 78 78 78 78 78 78 78 79 79 79 79 79 80 79 79 78 78 78 78 78 78 78 79 79 79 79 79 79 79 79 78 79 79 79 79 79 79 79 79 80 79 79 78 78 78 79 79 79 79 79 79 79 80 80 80 80 80 80 80
4093 80 80 80 80 79 79 79 80 80 80 80 79 79 80 80 80 80 80 80 80 80 80 80 80 80 80 80 80 81 81 80 80 81 81 81 80 80 80 80 79 80 80 80 81 81 81 81 82 82 82 82 82 82 82 82 81 81 81 81 81 81 81 81 81 80 81 81 81 81 81 81
4086 81 81 80 80 80 81 81 81 81 81 81 81 81 81 80 80 80 80 81 81 80 80 80 80 79 79 79 79 79 78 78 79 79 79 79 79 79 79 79 79 79 78 78 78 78 78 78 78 79 79 79 79 79 79 78 79 79 79 79 79 79 79 79 79 79 79 79 79 78 78 79
4078G9%%%%%%%%Jj%%%%%%%%%%%%%j%%J%%%%%%%%%%%%j%%%%%%%J%j%%%%%%J%j%J%%%%%j%%J
4071G9%%%j%%%%J%%%%%%%%%j%%%J%%%%%%%%%%Jj%%J%%%j%%%%%%%%%%%%%%%%%%%j%%%%J%J%
4063H0j%%%%J%%%%%%j%%%%%%%J%j%%J%%%%%%%%%%%%%%%%jJ%%%%%%%%%%%%%%%%%%%%%%%%%%
4056H0%%%%%%%%%%%%j%%%%J%%%jJ%j%%J%%%%%%%%%J%j%%%%%%j%J%%j%%%%%%%%%%%J%%%%%%
4049H0%%%%%%j%%%%%%%%%%Jj%%%%%%%%%j%%J%%%%%%%%%%%%%j%J%%%Jj%%%%%%%%%%%%%%%%%
4041G9%%%%%%%%%%%%%%%%%%%%%%%%%%%%%jJ%%%J%%%j%%%%%%%%%%%%%%%%Jj%%jJ%%%%%%J%%
4034H0j%%%J%%%%%%%%%%%%j%%%%J%%%j%J%%%j%%%%%j%J%%%J%%%%j%%J%j%%%J%%%j%%%%%%%
4026G9%%%J%j%%%%%%%%%%%j%%%J%%%%%%%%%%jJ%%%jJ%%%%%%%%%%%%Jj%%%%%%%%%J%jJ%%j%
$$ plain form
4078 79 79 79 79 79 79 79 79 79 80 79 79 79 79 79 79 79 79 79 79 79 79 79 79 78 78 78 79 79 79 79 79 79 79 79 79 79 79 79 79 78 78 78 78 78 78 78 78 79 79 78 78 78 78 78 78 78 79 79 78 78 79 79 79 79 79 79 78 78 78 79
4071 79 79 79 79 78 78 78 78 78 79 79 79 79 79 79 79 79 79 79 78 78 78 78 79 79 79 79 79 79 79 79 79 79 79 80 79 79 79 80 80 80 80 79 79 79 79 79 79 79 79 79 79 79 79 79 79 79 79 79 79 79 79 78 78 78 78 78 79 79 80 80
4063 80 79 79 79 79 79 80 80 80 80 80 80 80 79 79 79 79 79 79 79 79 80 80 79 79 79 80 80 80 80 80 80 80 80 80 80 80 80 80 80 80 80 80 79 80 80 80 80 80 80 80 80 80 80 80 80 80 80 80 80 80 80 80 80 80 80 80 80 80 80 80
4056 80 80 80 80 80 80 80 80 80 80 80 80 80 79 79 79 79 79 80 80 80 80 79 80 80 79 79 79 80 80 80 80 80 80 80 80 80 80 81 81 80 80 80 80 80 80 80 79 79 80 80 80 79 79 79 79 79 79 79 79 79 79 79 79 80 80 80 80 80 80 80
4049 80 80 80 80 80 80 80 79 79 79 79 79 79 79 79 79 79 79 80 79 79 79 79 79 79 79 79 79 79 78 78 78 79 79 79 79 79 79 79 79 79 79 79 79 79 79 78 78 79 79 79 79 80 79 79 79 79 79 79 79 79 79 79 79 79 79 79 79 79 79 79
4041 79 79 79 79 79 79 79 79 79 79 79 79 79 79 79 79 79 79 79 79 79 79 79 79 79 79 79 79 79 79 78 79 79 79 79 80 80 80 80 79 79 79 79 79 79 79 79 79 79 79 79 79 79 79 79 79 80 79 79 79 78 79 79 79 79 79 79 79 80 80 80
4034 80 79 79 79 79 80 80 80 80 80 80 80 80 80 80 80 80 80 79 79 79 79 79 80 80 80 80 79 79 80 80 80 80 79 79 79 79 79 79 78 78 79 79 79 79 80 80 80 80 80 79 79 79 80 80 79 79 79 79 80 80 80 80 79 79 79 79 79 79 79 79
4026 79 79 79 79 80 80 79 79 79 79 79 79 79 79 79 79 79 79 78 78 78 78 79 79 79 79 79 79 79 79 79 79 79 78 79 79 79 79 78 79 79 79 79 79 79 79 79 79 79 79 79 79 80 79 79 79 79 79 79 79 79 79 79 80 80 79 80 80 80 79 79
4019G9%%%%%%%%%%%%%%j%%J%%%%%%jJ%%%%%%%%Jj%%J%j%J%%%%%%%j%%%%%%%%%%%j%%J%%%J
4011H0j%%%%%%%%jJ%%%%J%%%j%%%%%Jj%%%%%%%%%%%%%%j%%JjJ%%%%%%%%%%%%jJ%%%%j%J%%
4004G9%%%%%%%%%%jJ%%%%%Jj%%%j%%%%%%%J%%jJj%%%%%%%%%%%%J%%%j%%%%%%%%%%%%J%%j%
3997G8%%%%%J%%j%%%%%%%j%%%J%%%%%%%%%%%%%J%%%%j%%%%%%%J%%%j%%%%%%%%%%%%%%%J%%
3989G9%%%jJ%%%j%%%%%j%%J%%%%%%%%%J%%%%%%%%%%%%%%%%%j%J%%%%%%j%J%jJ%j%J%%%%%%
3982G9%%%%%%%%%jJ%%%%%%%%%j%%%%%J%%%%%%%%%%%%%j%%%%%%%%%%%%%%%%%%%%%J%%%%%j%
3974G8%%J%%Jj%%j%%J%j%%%%%%%%%%Jj%%%%%%%%%%%%%%%%%J%%%%%j%J%%%%%%%%%%%%J%j%%
3967G9%%%%j%%j%J%%%%%%%%%%%%%%%%%Jj%%%%%%JjJ%%%j%%%%%%%%%%%%%J%%%%%%j%J%%%%%
$$ plain form
4019 79 79 79 79 79 79 79 79 79 79 79 79 79 79 79 78 78 78 79 79 79 79 79 79 79 78 79 79 79 79 79 79 79 79 79 80 79 79 79 80 80 79 79 80 80 80 80 80 80 80 80 79 79 79 79 79 79 79 79 79 79 79 79 78 78 78 79 79 79 79 80
4011 80 79 79 79 79 79 79 79 79 79 78 79 79 79 79 79 80 80 80 80 79 79 79 79 79 79 80 79 79 79 79 79 79 79 79 79 79 79 79 79 79 79 78 78 78 79 78 79 79 79 79 79 79 79 79 79 79 79 79 79 78 79 79 79 79 79 78 78 79 79 79
4004 79 79 79 79 79 79 79 79 79 79 79 78 79 79 79 79 79 79 80 79 79 79 79 78 78 78 78 78 78 78 78 79 79 79 78 79 78 78 78 78 78 78 78 78 78 78 78 78 78 79 79 79 79 78 78 78 78 78 78 78 78 78 78 78 78 78 79 79 79 78 78
3997 78 78 78 78 78 78 79 79 79 78 78 78 78 78 78 78 78 77 77 77 77 78 78 78 78 78 78 78 78 78 78 78 78 78 78 79 79 79 79 79 78 78 78 78 78 78 78 78 79 79 79 79 78 78 78 78 78 78 78 78 78 78 78 78 78 78 78 78 79 79 79
3989 79 79 79 79 78 79 79 79 79 78 78 78 78 78 78 77 77 77 78 78 78 78 78 78 78 78 78 78 79 79 79 79 79 79 79 79 79 79 79 79 79 79 79 79 79 79 78 78 79 79 79 79 79 79 79 78 78 79 79 78 79 79 78 78 79 79 79 79 79 79 79
3982 79 79 79 79 79 79 79 79 79 79 78 79 79 79 79 79 79 79 79 79 79 78 78 78 78 78 78 79 79 79 79 79 79 79 79 79 79 79 79 79 79 78 78 78 78 78 78 78 78 78 78 78 78 78 78 78 78 78 78 78 78 78 78 79 79 79 79 79 79 78 78
3974 78 78 78 79 79 79 80 79 79 79 78 78 78 79 79 78 78 78 78 78 78 78 78 78 78 78 79 78 78 78 78 78 78 78 78 78 78 78 78 78 78 78 78 78 78 79 79 79 79 79 79 78 78 79 79 79 79 79 79 79 79 79 79 79 79 79 80 80 79 79 79
3967 79 79 79 79 79 78 78 78 77 77 78 78 78 78 78 78 78 78 78 78 78 78 78 78 78 78 78 78 79 78 78 78 78 78 78 78 79 78 79 79 79 79 78 78 78 78 78 78 78 78 78 78 78 78 78 78 79 79 79 79 79 79 79 78 78 79 79 79 79 79 79
3960G9%%%%%%j%%%%%%J%%j%J%%%%%%%%%%%%%%%%%%%%%%%%%%%%j%%Jj%J%%j%%%%J%%jJ%%%%
3952G9%%%%%%%%%%%%%%%%%%%%%%j%%J%%%%%%%%%%%%%%%%%%%%%%%%%%%%%J%%Jj%%%%j%%%%%
3945G9%%%%%%%J%%%%%j%%%%%%j%J%%%%%%jJ%%%%%%%%%%%%%%%%%%%%%j%%J%%%%%%%%%%%%%%
3937G9%%%%%%%%%j%%%%%%%%%Jj%%%%J%%%%%%%%%jJ%%%%%%%%%%%%%%jJ%%%%%%%%%%%%%j%%%
3930G8%J%%jJ%%%%%%%%%%%%%%%%jJ%%%%%jJ%%%%%%%%%%jJ%%%%%j%%%%%J%%j%%J%%%%%%%%%
3922G9%%%%%Jj%%%%%%j%%J%%%%j%J%%%%%%Jj%j%J%%%%%%%%%%%%%%%%%%%%%%%J%j%J%%%%%j
3915G9%%%%%%%%%%%%%%%%%%%%J%j%%J%%%%%%%j%J%%%%%jJ%%%%j%%%%%J%%%%j%%%%%%%%%%%
3908G9jJ%%%%j%J%%%%%%%%%%%%%%%%%%%%%%%%%%%%%%%%%%%%%%%%%%j%%%%%%%%%J%%%%%%%%
$$ plain form
3960 79 79 79 79 79 79 79 78 78 78 78 78 78 78 79 79 79 78 78 79 79 79 79 79 79 79 79 79 79 79 79 79 79 79 79 79 79 79 79 79 79 79 79 79 79 79 79 79 78 78 78 79 78 78 79 79 79 78 78 78 78 78 79 79 79 78 79 79 79 79 79
3952 79 79 79 79 79 79 79 79 79 79 79 79 79 79 79 79 79 79 79 79 79 79 79 78 78 78 79 79 79 79 79 79 79 79 79 79 79 79 79 79 79 79 79 79 79 79 79 79 79 79 79 79 79 79 79 79 80 80 80 81 80 80 80 80 80 79 79 79 79 79 79
3945 79 79 79 79 79 79 79 79 80 80 80 80 80 80 79 79 79 79 79 79 79 78 78 79 79 79 79 79 79 79 78 79 79 79 79 79 79 79 79 79 79 79 79 79 79 79 79 79 79 79 79 79 79 78 78 78 79 79 79 79 79 79 79 79 79 79 79 79 79 79 79
3937 79 79 79 79 79 79 79 79 79 79 78 78 78 78 78 78 78 78 78 78 79 78 78 78 78 78 79 79 79 79 79 79 79 79 79 79 78 79 79 79 79 79 79 79 79 79 79 79 79 79 79 79 78 79 79 79 79 79 79 79 79 79 79 79 79 79 79 78 78 78 78
3930 78 78 79 79 79 78 79 79 79 79 79 79 79 79 79 79 79 79 79 79 79 79 79 78 79 79 79 79 79 79 78 79 79 79 79 79 79 79 79 79 79 79 78 79 79 79 79 79 79 78 78 78 78 78 78 79 79 79 78 78 78 79 79 79 79 79 79 79 79 79 79
3922 79 79 79 79 79 79 80 79 79 79 79 79 79 79 78 78 78 79 79 79 79 79 78 78 79 79 79 79 79 79 79 80 79 79 78 78 79 79 79 79 79 79 79 79 79 79 79 79 79 79 79 79 79 79 79 79 79 79 79 79 80 80 79 79 80 80 80 80 80 80 79
3915 79 79 79 79 79 79 79 79 79 79 79 79 79 79 79 79 79 79 79 79 79 80 80 79 79 79 80 80 80 80 80 80 80 80 79 79 80 80 80 80 80 80 79 80 80 80 80 80 79 79 79 79 79 79 80 80 80 80 80 79 79 79 79 79 79 79 79 79 79 79 79
3908 79 78 79 79 79 79 79 78 78 79 79 79 79 79 79 79 79 79 79 79 79 79 79 79 79 79 79 79 79 79 79 79 79 79 79 79 79 79 79 79 79 79 79 79 79 79 79 79 79 79 79 79 78 78 78 78 78 78 78 78 78 78 79 79 79 79 79 79 79 79 79
3900G9%%Jj%%j%%%%%J%%%%%%J%j%%%%%%%%%%%%%%%%%%%%%%%%%j%%J%j%J%%j%J%%%%j%%%%%
3893G8%Jj%%%J%%%%%j%J%%%%%%%%%%%%%%%%%%%%%%j%%%%%%%%%%J%%%j%%%%%%J%%%%Jj%%%j
3885G8J%%%%%j%%%J%j%%%%Jj%J%%%%%%%J%%%%%%%%%%%%%%%j%J%%%%%J%%%%%%J%%J%J%J%JJ
3878H7%KJKLLMNOOPQPPNNLK%kmnoppppoomnllkjj%jj%j%%%j%%%j%j%%%j%%%%j%%%jJ%%%%%
3870G9%%j%%J%%%%%%%%%%%%%%%%j%%%%%%%%%J%%%%%%%%%%%%J%j%%%%%%%%j%%%%%%%Jj%%%%
3863G8%%%J%%%%%%%%%j%%%%%Jj%%%%%j%%J%%%%%%J%%%%jj%%%%JJ%j%j%%%J%%%%%%J%%%%%%
3856G9j%%%%%%%J%%j%%%%%%%J%%j%%%%%%%%%%%%J%j%%%%%%%%%%%%%%%%%%J%%%j%J%%%%%%%
3848G9%j%%%%%%%%%%%%J%%%%%%%%%%%%j%%J%j%%%%%%%%J%%J%%j%%%jJ%%jJ%%%%%%J%%j%%J
$$ plain form
3900 79 79 79 80 79 79 79 78 78 78 78 78 78 79 79 79 79 79 79 79 80 80 79 79 79 79 79 79 79 79 79 79 79 79 79 79 79 79 79 79 79 79 79 79 79 79 79 79 78 78 78 79 79 78 78 79 79 79 78 78 79 79 79 79 79 78 78 78 78 78 78
3893 78 78 79 78 78 78 78 79 79 79 79 79 79 78 78 79 79 79 79 79 79 79 79 79 79 79 79 79 79 79 79 79 79 79 79 79 79 79 78 78 78 78 78 78 78 78 78 78 78 79 79 79 79 78 78 78 78 78 78 78 79 79 79 79 79 80 79 79 79 79 78
3885 78 79 79 79 79 79 79 78 78 78 78 79 79 78 78 78 78 78 79 78 78 79 79 79 79 79 79 79 79 80 80 80 80 80 80 80 80 80 80 80 80 80 80 80 80 79 79 80 80 80 80 80 80 81 81 81 81 81 81 81 82 82 82 83 83 84 84 85 85 86 87
3878 87 87 89 90 92 95 98 102 107 113 119 126 134 141 148 153 158 161 163 163 161 157 152 146 139 132 125 118 112 106 102 97 94 91 89 88 87 87 86 85 85 84 84 84 84 83 83 83 83 82 82 81 81 81 81 80 80 80 80 80 79 79 79 79 78 79 79 79 79 79 79
3870 79 79 79 78 78 78 79 79 79 79 79 79 79 79 79 79 79 79 79 79 79 79 79 78 78 78 78 78 78 78 78 78 78 79 79 79 79 79 79 79 79 79 79 79 79 79 80 80 79 79 79 79 79 79 79 79 79 78 78 78 78 78 78 78 78 79 78 78 78 78 78
3863 78 78 78 78 79 79 79 79 79 79 79 79 79 79 78 78 78 78 78 78 79 78 78 78 78 78 78 77 77 77 78 78 78 78 78 78 78 79 79 79 79 79 78 77 77 77 77 77 78 79 79 78 78 77 77 77 77 78 78 78 78 78 78 78 79 79 79 79 79 79 79
3856 79 78 78 78 78 78 78 78 78 79 79 79 78 78 78 78 78 78 78 78 79 79 79 78 78 78 78 78 78 78 78 78 78 78 78 78 79 79 78 78 78 78 78 78 78 78 78 78 78 78 78 78 78 78 78 78 78 79 79 79 79 78 78 79 79 79 79 79 79 79 79
3848 79 79 78 78 78 78 78 78 78 78 78 78 78 78 78 79 79 79 79 79 79 79 79 79 79 79 79 79 78 78 78 79 79 78 78 78 78 78 78 78 78 78 79 79 79 80 80 80 79 79 79 79 78 79 79 79 78 79 79 79 79 79 79 79 80 80 80 79 79 79 80
3841H0%%%%%%J%%%%%%J%J%%J%J%JJ%J%JJ%%%j%%j%j%jj%j%%j%%j%%%%jj%%%%%%%%j%%%%%J
3833H0%%%%j%%%%jJ%%%%%%%%%%%%%j%%%%%%%%J%%%%%%%%j%%%%J%%%%%j%%%%%%J%jJ%j%%%%
3826G8J%%j%%%%%%%%%%%%j%%%%%J%%j%%%%J%%%%%%%J%%%%j%%%%%J%%%%%%%j%%%%%%%%%%%j
3819G7J%%%%%%jJ%%%%%%%%%%%%jJ%%%%Jj%%%%%J%j%%%%%%%%%%%%%%%%jJ%%%%%J%%%j%%%J%
3811G9j%%J%%%%j%%%%%j%J%%J%j%%%%%%%%%j%%J%%%%%%%%%%%%%%%%%%%%%%%%%%%%%%%Jj%%
3804G8j%%%Jj%J%%%%%%j%J%%%%%%%%%%%J%%%%%%jJ%%%%j%%%%%%%%%%%%%%J%%%%%%%%%%%j%
3796G8%%%%%%%%%%%J%j%%%%J%%%%%%%%%J%JJJJ%%%%%jj%jj%%j%%%%%j%%%%%%%%%%%%%%%%%
3789G8%%%%Jj%%%%%%%%j%J%%%%%%%J%%%%%%%%%%%%%%%%j%%J%%%%%%%%%%%j%%%%jJ%%%%%%%
$$ plain form
3841 80 80 80 80 80 80 80 81 81 81 81 81 81 81 82 82 83 83 83 84 84 85 85 86 87 87 88 88 89 90 90 90 90 89 89 89 88 88 87 87 86 85 85 84 84 84 83 83 83 82 82 82 82 82 81 80 80 80 80 80 80 80 80 80 79 79 79 79 79 79 80
3833 80 80 80 80 80 79 79 79 79 79 78 79 79 79 79 79 79 79 79 79 79 79 79 79 79 78 78 78 78 78 78 78 78 78 79 79 79 79 79 79 79 79 79 78 78 78 78 78 79 79 79 79 79 79 78 78 78 78 78 78 78 79 79 78 79 79 78 78 78 78 78
3826 78 79 79 79 78 78 78 78 78 78 78 78 78 78 78 78 78 77 77 77 77 77 77 78 78 78 77 77 77 77 77 78 78 78 78 78 78 78 78 79 79 79 79 79 78 78 78 78 78 78 79 79 79 79 79 79 79 79 78 78 78 78 78 78 78 78 78 78 78 78 77
3819 77 78 78 78 78 78 78 78 77 78 78 78 78 78 78 78 78 78 78 78 78 78 77 78 78 78 78 78 79 78 78 78 78 78 78 79 79 78 78 78 78 78 78 78 78 78 78 78 78 78 78 78 78 78 77 78 78 78 78 78 78 79 79 79 79 78 78 78 78 79 79
3811 79 78 78 78 79 79 79 79 79 78 78 78 78 78 78 77 77 78 78 78 79 79 78 78 78 78 78 78 78 78 78 78 77 77 77 78 78 78 78 78 78 78 78 78 78 78 78 78 78 78 78 78 78 78 78 78 78 78 78 78 78 78 78 78 78 78 78 79 78 78 78
3804 78 77 77 77 77 78 77 77 78 78 78 78 78 78 78 77 77 78 78 78 78 78 78 78 78 78 78 78 78 79 79 79 79 79 79 79 78 79 79 79 79 79 78 78 78 78 78 78 78 78 78 78 78 78 78 78 78 79 79 79 79 79 79 79 79 79 79 79 79 78 78
3796 78 78 78 78 78 78 78 78 78 78 78 78 79 79 78 78 78 78 78 79 79 79 79 79 79 79 79 79 79 80 80 81 82 83 84 84 84 84 84 84 83 82 82 81 80 80 80 79 79 79 79 79 79 78 78 78 78 78 78 78 78 78 78 78 78 78 78 78 78 78 78
3789 78 78 78 78 78 79 78 78 78 78 78 78 78 78 78 77 77 78 78 78 78 78 78 78 78 79 79 79 79 79 79 79 79 79 79 79 79 79 79 79 79 79 78 78 78 79 79 79 79 79 79 79 79 79 79 79 79 78 78 78 78 78 77 78 78 78 78 78 78 78 78
3781G8%%%%%%%%%%%%%%%%%%%jJ%%%%%%%%%%J%%j%%%%%%%%%%%%%%%%%%%%%%J%j%%%%J%j%%%
3774G8jJ%%%%%j%%%J%%%%%%%%%%%%%%%%%j%%%J%%%%%%j%%J%%%%%%%%%%%%jJ%%%j%%%%%J%%
3767G8jJ%%%%%%%jJ%%%%%%Jj%%%%%j%%%%%%J%%%j%%%%%%%J%%%%%jJ%%j%%%%J%%j%%J%%%%%
3759G8%j%%J%%%%%%%%%%%%%%j%J%%%%%%%%%%%%%%%%%%%%%%%J%%%%%%j%%%%%%%%%j%%J%%%j
3752G7%J%%%%%%%jJ%%%%%%%%Jj%%%%%%%%%%%%%%%%j%%%%%J%%%j%%%J%%%%%Jj%%%%%%%%%J%
3744G9%%j%%%%%%%%J%%%%%%j%j%%J%%J%j%%%%%%%%%%%%%%%%%%%%%%%%%%%%%%jJ%%%%%%%%%
3737G8%%%j%%%Jj%jJ%J%%%%%%%%%j%%%J%%%%%J%j%jJ%%%%%%%j%%%j%%%%%%J%%J%%%j%J%%j
3730G7%%%%%%%%%%J%%%%%%%%%%%%%%%%%%%%%%%%%%%%J%%%jJ%%%j%J%%%%%j%%%jJj%J%%%%J
$$ plain form
3781 78 78 78 78 78 78 78 78 78 78 78 78 78 78 78 78 78 78 78 78 77 78 78 78 78 78 78 78 78 78 78 78 79 79 79 78 78 78 78 78 78 78 78 78 78 78 78 78 78 78 78 78 78 78 78 78 78 78 79 79 78 78 78 78 78 79 79 78 78 78 78
3774 78 77 78 78 78 78 78 78 77 77 77 77 78 78 78 78 78 78 78 78 78 78 78 78 78 78 78 78 78 78 77 77 77 77 78 78 78 78 78 78 78 77 77 77 78 78 78 78 78 78 78 78 78 78 78 78 78 77 78 78 78 78 77 77 77 77 77 77 78 78 78
3767 78 77 78 78 78 78 78 78 78 78 77 78 78 78 78 78 78 78 79 78 78 78 78 78 78 77 77 77 77 77 77 77 78 78 78 78 77 77 77 77 77 77 77 77 78 78 78 78 78 78 77 78 78 78 77 77 77 77 77 78 78 78 77 77 77 78 78 78 78 78 78
3759 78 78 77 77 77 78 78 78 78 78 78 78 78 78 78 78 78 78 78 78 77 77 78 78 78 78 78 78 78 78 78 78 78 78 78 78 78 78 78 78 78 78 78 78 78 78 79 79 79 79 79 79 79 78 78 78 78 78 78 78 78 78 78 77 77 77 78 78 78 78 77
3752 77 77 78 78 78 78 78 78 78 78 77 78 78 78 78 78 78 78 78 78 79 78 78 78 78 78 78 78 78 78 78 78 78 78 78 78 78 78 77 77 77 77 77 77 78 78 78 78 77 77 77 77 78 78 78 78 78 78 79 78 78 78 78 78 78 78 78 78 78 79 79
3744 79 79 79 78 78 78 78 78 78 78 78 78 79 79 79 79 79 79 79 78 78 77 77 77 78 78 78 79 79 78 78 78 78 78 78 78 78 78 78 78 78 78 78 78 78 78 78 78 78 78 78 78 78 78 78 78 78 78 78 78 77 78 78 78 78 78 78 78 78 78 78
3737 78 78 78 78 77 77 77 77 78 77 77 76 77 77 78 78 78 78 78 78 78 78 78 78 77 77 77 77 78 78 78 78 78 78 79 79 78 78 77 78 78 78 78 78 78 78 78 77 77 77 77 76 76 76 76 76 76 76 77 77 77 78 78 78 78 77 77 78 78 78 77
3730 77 77 77 77 77 77 77 77 77 77 77 78 78 78 78 78 78 78 78 78 78 78 78 78 78 78 78 78 78 78 78 78 78 78 78 78 78 78 78 78 79 79 79 79 78 79 79 79 79 78 78 79 79 79 79 79 79 78 78 78 78 77 78 77 77 78 78 78 78 78 79
3722G9%%J%J%%%%%%jJ%%%%%%jj%j%jj%%j%%%%J%%%%%%%j%%%%%%%%%%%%J%%J%%J%%%%%%%%%
3715G8%%%%J%%%%%j%%%j%%%JJ%%J%%%%%%%J%%J%%j%%%j%%JJJJJ%JJJ%KJJJJJKKKKLMMOOPR
3707A42J2J6J9K7L6M9O8R3J25J55J68J57J22P7K9j5n7r7j31j50j46j29j09q8o9n1l8k7j9j4
3704A55j1qponmlmkkkkjkjjjjjj%j%j%%j%%j%%jj%j%%%%%%j%%%%j%%J%Jj%%%%j%%%%%%%%%
3697H1%j%%%%%%%%%%%%%%%Jj%%%%J%%%%%%jj%%%%%J%JjJ%J%%%%jjjjj%j%%j%%j%%%J%%J%J
3690G7%J%J%%%%%%j%%j%%%j%%%%%%%%J%%%%%%%%J%%%%%%%%%j%%%j%%J%%%%Jj%J%%%%%%%%%
3682G8%%%%%%j%%%%%%J%%J%%%j%j%%%%%%j%%J%%%%%%j%%%%%%%%%%J%%%%%%%%%J%%%%%%%%%
3675G8j%%%%%%%%%%%%%%%%jJ%%%%%%%%%%%%%%%%%%%%%%J%j%%%%%%%%%J%j%%%%%%%Jj%%%%%
$$ plain form
3722 79 79 79 80 80 81 81 81 81 81 81 81 80 81 81 81 81 81 81 81 80 79 79 78 78 77 76 76 76 75 75 75 75 75 76 76 76 76 76 76 76 76 75 75 75 75 75 75 75 75 75 75 75 75 75 76 76 76 77 77 77 78 78 78 78 78 78 78 78 78 78
3715 78 78 78 78 78 79 79 79 79 79 79 78 78 78 78 77 77 77 77 78 79 79 79 80 80 80 80 80 80 80 80 81 81 81 82 82 82 81 81 81 81 80 80 80 81 82 83 84 85 85 86 87 88 88 90 91 92 93 94 95 97 99 101 103 106 110 114 120 126 133 142
3707 142 154 170 189 216 252 301 369 462 587 742 910 1067 1189 1266 1295 1280 1223 1126 995 845 699 570 461 373 304 253 215 188 169 155
3704 155 144 136 129 123 118 114 111 107 105 103 101 99 98 96 95 94 93 92 91 90 90 89 89 88 88 88 87 87 87 86 86 86 85 84 84 83 83 83 83 83 83 83 82 82 82 82 82 81 81 81 82 82 83 82 82 82 82 82 81 81 81 81 81 81 81 81 81 81
3697 81 81 80 80 80 80 80 80 80 80 80 80 80 80 80 80 80 80 81 80 80 80 80 80 81 81 81 81 81 81 81 80 79 79 79 79 79 79 80 80 81 80 81 81 82 82 82 82 82 81 80 79 78 77 77 76 76 76 75 75 75 74 74 74 74 75 75 75 76 76 77
3690 77 77 78 78 79 79 79 79 79 79 79 78 78 78 77 77 77 77 76 76 76 76 76 76 76 76 76 77 77 77 77 77 77 77 77 77 78 78 78 78 78 78 78 78 78 78 77 77 77 77 76 76 76 77 77 77 77 77 78 77 77 78 78 78 78 78 78 78 78 78 78
3682 78 78 78 78 78 78 78 77 77 77 77 77 77 77 78 78 78 79 79 79 79 78 78 77 77 77 77 77 77 77 76 76 76 77 77 77 77 77 77 77 76 76 76 76 76 76 76 76 76 76 76 77 77 77 77 77 77 77 77 77 77 78 78 78 78 78 78 78 78 78 78
3675 78 77 77 77 77 77 77 77 77 77 77 77 77 77 77 77 77 77 76 77 77 77 77 77 77 77 77 77 77 77 77 77 77 77 77 77 77 77 77 77 77 77 78 78 77 77 77 77 77 77 77 77 77 77 78 78 77 77 77 77 77 77 77 77 78 77 77 77 77 77 77
3667G7%%%%%%%%%%%%%%%J%j%%%J%j%%J%%%%%%%%j%%%%J%%j%%%%%J%%%j%%%%%%%%%%%%J%%j
3660G7J%%%%jJ%%%Jj%%%%j%%%%%j%%J%%%%%%%%%%%%%%%%%j%J%%%%%%%%%jJ%%%%%%%J%%%j%
3652G7%%Jj%%%%J%%%%%%%%j%%%j%%%%J%%%%%J%%jJ%%%%%%j%%Jj%%J%%%j%%Jj%%j%%%J%%%%
3645G7%%J%%%j%%%J%%%j%%%%%%%%%j%J%%%%%%%%Jj%%J%%%%j%J%%j%%%%%%%%%%%%%j%J%%%%
3638G7%%%%%%%j%%J%%%%%%%j%%J%%%%%%J%j%Jj%%j%%%J%%%%%%%%%%%%%%%%%j%%J%%%%%%%%
3630G7%%%%%%%%%%%%%%%%%%%%j%J%%%%%%%%%%%%%%%%%%%%%%%%%%%%%%%%j%%%%%%%%%%%%%%
3623G6jJ%%%%%%%%%%%J%%%%%%%Jj%%%%%%%%%%J%%%%j%%%%%%%%%%%%%%%%%%j%J%%J%J%J%JJ
3615H2%%%%%j%jj%%jj%%%%j%%%%J%%%%Jj%%%%%%%%%j%JjJ%%%%%%j%%J%%%%%%%%%%j%%%%J%
$$ plain form
3667 77 77 77 77 77 77 77 77 77 77 77 77 77 77 77 77 78 78 77 77 77 77 78 78 77 77 77 78 78 78 78 78 78 78 78 78 77 77 77 77 77 78 78 78 77 77 77 77 77 77 78 78 78 78 77 77 77 77 77 77 77 77 77 77 77 77 77 78 78 78 77
3660 77 78 78 78 78 78 77 78 78 78 78 79 78 78 78 78 78 77 77 77 77 77 77 76 76 76 77 77 77 77 77 77 77 77 77 77 77 77 77 77 77 77 77 77 76 76 77 77 77 77 77 77 77 77 77 77 76 77 77 77 77 77 77 77 77 78 78 78 78 77 77
3652 77 77 77 78 77 77 77 77 77 78 78 78 78 78 78 78 78 78 77 77 77 77 76 76 76 76 76 77 77 77 77 77 77 78 78 78 77 78 78 78 78 78 78 78 77 77 77 78 77 77 77 78 78 78 78 77 77 77 78 77 77 77 76 76 76 76 77 77 77 77 77
3645 77 77 77 78 78 78 78 77 77 77 77 78 78 78 78 77 77 77 77 77 77 77 77 77 77 76 76 77 77 77 77 77 77 77 77 77 78 77 77 77 78 78 78 78 78 77 77 78 78 78 77 77 77 77 77 77 77 77 77 77 77 77 77 77 76 76 77 77 77 77 77
3638 77 77 77 77 77 77 77 77 76 76 76 77 77 77 77 77 77 77 77 76 76 76 77 77 77 77 77 77 77 78 78 77 77 78 77 77 77 76 76 76 76 77 77 77 77 77 77 77 77 77 77 77 77 77 77 77 77 77 77 76 76 76 77 77 77 77 77 77 77 77 77
3630 77 77 77 77 77 77 77 77 77 77 77 77 77 77 77 77 77 77 77 77 77 76 76 77 77 77 77 77 77 77 77 77 77 77 77 77 77 77 77 77 77 77 77 77 77 77 77 77 77 77 77 77 77 77 77 77 76 76 76 76 76 76 76 76 76 76 76 76 76 76 76
3623 76 75 76 76 76 76 76 76 76 76 76 76 76 76 77 77 77 77 77 77 77 77 78 77 77 77 77 77 77 77 77 77 77 77 78 78 78 78 78 77 77 77 77 77 77 77 77 77 77 77 77 77 77 77 77 77 77 77 76 76 77 77 77 78 78 79 79 80 80 81 82
3615 82 82 82 82 82 82 81 81 80 79 79 79 78 77 77 77 77 77 76 76 76 76 76 77 77 77 77 77 78 77 77 77 77 77 77 77 77 77 77 76 76 77 76 77 77 77 77 77 77 77 76 76 76 77 77 77 77 77 77 77 77 77 77 77 76 76 76 76 76 77 77
3608G7%%j%%Jj%%%%%%%%J%%%%%%%%%%j%%%%%%%%%%%%%%%%%%%%%%%%%%%%%J%%j%%%%%%%%%%
3600G6j%%%%%%J%%%%%%j%%%J%%%%%%%%%%%%j%Jj%%%%%%%%%%J%%%j%%%%%%%%J%%%%j%%%%%%
3593G5%Jj%%%%%%%%J%%%%%%%j%%%J%%%j%%%%%%%%%%%%J%%j%%%%%%%%jJ%J%%j%%%%%%jJ%%%
3586G5J%%%%%%%%%%%j%J%%j%JjJ%j%%%%%%%%%%%%J%%%%%%%%%%%j%J%%%%%%j%J%%%%%%%%%%
3578G6J%%j%%%%%%%%%%%%%%%%%%%%%%%%%%J%j%%%%%%%%%%%%J%%%%%%%%%%%j%%%%%%J%%%%%
3571G7%%%j%%%%%%%%%%J%%%j%J%j%%%jJ%%%%%%%jJ%%%%%%%%%%%%%%%%%%%j%%J%%%jJ%%%%%
3563G6jJ%Jj%%%%%%%%%%%%%J%%%%%%%%%%%%J%JJJJJJJJJ%%%jjjjjjjjj%j%j%%%%%%%%%j%J
3556G6%%%%%%j%%%%J%%J%j%%%%%%%%%%J%j%%%j%%%%%%%%%J%%%%%%%%%J%%j%%%%%%%%%%%%%
$$ plain form
3608 77 77 77 76 76 76 77 76 76 76 76 76 76 76 76 76 77 77 77 77 77 77 77 77 77 77 77 76 76 76 76 76 76 76 76 76 76 76 76 76 76 76 76 76 76 76 76 76 76 76 76 76 76 76 76 76 76 77 77 77 76 76 76 76 76 76 76 76 76 76 76
3600 76 75 75 75 75 75 75 75 76 76 76 76 76 76 76 75 75 75 75 76 76 76 76 76 76 76 76 76 76 76 76 76 75 75 76 75 75 75 75 75 75 75 75 75 75 75 76 76 76 76 75 75 75 75 75 75 75 75 75 76 76 76 76 76 75 75 75 75 75 75 75
3593 75 75 76 75 75 75 75 75 75 75 75 75 76 76 76 76 76 76 76 76 75 75 75 75 76 76 76 76 75 75 75 75 75 75 75 75 75 75 75 75 75 76 76 76 75 75 75 75 75 75 75 75 75 74 75 75 76 76 76 75 75 75 75 75 75 75 74 75 75 75 75
3586 75 76 76 76 76 76 76 76 76 76 76 76 76 75 75 76 76 76 75 75 76 75 76 76 75 75 75 75 75 75 75 75 75 75 75 75 75 76 76 76 76 76 76 76 76 76 76 76 76 75 75 76 76 76 76 76 76 76 75 75 76 76 76 76 76 76 76 76 76 76 76
3578 76 77 77 77 76 76 76 76 76 76 76 76 76 76 76 76 76 76 76 76 76 76 76 76 76 76 76 76 76 76 76 77 77 76 76 76 76 76 76 76 76 76 76 76 76 76 77 77 77 77 77 77 77 77 77 77 77 77 76 76 76 76 76 76 76 77 77 77 77 77 77
3571 77 77 77 77 76 76 76 76 76 76 76 76 76 76 76 77 77 77 77 76 76 77 77 76 76 76 76 75 76 76 76 76 76 76 76 76 75 76 76 76 76 76 76 76 76 76 76 76 76 76 76 76 76 76 76 76 76 75 75 75 76 76 76 76 75 76 76 76 76 76 76
3563 76 75 76 76 77 76 76 76 76 76 76 76 76 76 76 76 76 76 76 77 77 77 77 77 77 77 77 77 77 77 77 77 78 78 79 80 81 82 83 84 85 86 87 87 87 87 86 85 84 83 82 81 80 79 78 78 77 77 76 76 76 76 76 76 76 76 76 76 75 75 76
3556 76 76 76 76 76 76 76 75 75 75 75 75 76 76 76 77 77 76 76 76 76 76 76 76 76 76 76 76 77 77 76 76 76 76 75 75 75 75 75 75 75 75 75 75 76 76 76 76 76 76 76 76 76 76 77 77 77 76 76 76 76 76 76 76 76 76 76 76 76 76 76
3549G6%%%j%%%%%J%%%%j%%J%%%%%j%%Jj%%%%%%%J%%%%%%%%%jJ%%%%%%J%j%%%jJ%%%%%%%%%
3541G6%%%%%Jj%%%%%%%%%%%%%%%%%%%%%%%%%%%%%%%%%%J%j%%%%%%%%%%%%%%%%J%%j%%%%%%
3534G6%%%%%%%%%J%%%%j%%%%%J%%%%%j%%%%%%%%%%%%Jj%%%%%%%%%%%%%%%%%J%%jJ%j%%%%%
3526G6%%%%%%%%%%j%%J%%%%%%%Jj%%Jj%%%%%%%%%%%%%%%%%%%%%%%%%%Jj%%%%J%%%%%j%%%%
3519G6%%%Jj%%%%%J%j%%J%%%j%%Jj%%J%%%j%%%%%%%%%%%%%J%j%%%J%%j%%%%%Jj%%%%%%jJ%
3511G6%%%%%%%%%%%%%%%%%jJ%%%%%%%%%%%J%%j%%%J%j%%%%%%%%%%%%%%%%%%%%%%%%%%%%%%
3504G6%%%%%%%%%J%%%%%%j%%%J%%%%%%%j%%%%%%%%%%Jj%%%%%%%%%J%%j%%%%%%%%J%%%%%j%
3497G6%%%%%%%%Jj%%%%%%%%%%%%%%%%jJ%%%%%J%%%%%j%%%%%J%%%j%%%%%%%%%%J%%%%j%%%%
$$ plain form
3549 76 76 76 76 75 75 75 75 75 75 76 76 76 76 76 75 75 75 76 76 76 76 76 76 75 75 75 76 75 75 75 75 75 75 75 75 76 76 76 76 76 76 76 76 76 76 75 76 76 76 76 76 76 76 77 77 76 76 76 76 75 76 76 76 76 76 76 76 76 76 76
3541 76 76 76 76 76 76 77 76 76 76 76 76 76 76 76 76 76 76 76 76 76 76 76 76 76 76 76 76 76 76 76 76 76 76 76 76 76 76 76 76 76 76 77 77 76 76 76 76 76 76 76 76 76 76 76 76 76 76 76 76 76 77 77 77 76 76 76 76 76 76 76
3534 76 76 76 76 76 76 76 76 76 76 77 77 77 77 77 76 76 76 76 76 76 77 77 77 77 77 77 76 76 76 76 76 76 76 76 76 76 76 76 76 77 76 76 76 76 76 76 76 76 76 76 76 76 76 76 76 76 76 76 77 77 77 76 77 77 76 76 76 76 76 76
3526 76 76 76 76 76 76 76 76 76 76 76 75 75 75 76 76 76 76 76 76 76 76 77 76 76 76 77 76 76 76 76 76 76 76 76 76 76 76 76 76 76 76 76 76 76 76 76 76 76 76 76 76 76 76 77 76 76 76 76 76 77 77 77 77 77 77 76 76 76 76 76
3519 76 76 76 76 77 76 76 76 76 76 76 77 77 76 76 76 77 77 77 77 76 76 76 77 76 76 76 77 77 77 77 76 76 76 76 76 76 76 76 76 76 76 76 76 76 77 77 76 76 76 76 77 77 77 76 76 76 76 76 76 77 76 76 76 76 76 76 76 75 76 76
3511 76 76 76 76 76 76 76 76 76 76 76 76 76 76 76 76 76 76 75 76 76 76 76 76 76 76 76 76 76 76 76 77 77 77 76 76 76 76 77 77 76 76 76 76 76 76 76 76 76 76 76 76 76 76 76 76 76 76 76 76 76 76 76 76 76 76 76 76 76 76 76
3504 76 76 76 76 76 76 76 76 76 76 77 77 77 77 77 77 77 76 76 76 76 77 77 77 77 77 77 77 77 76 76 76 76 76 76 76 76 76 76 76 77 76 76 76 76 76 76 76 76 76 76 77 77 77 76 76 76 76 76 76 76 76 76 77 77 77 77 77 77 76 76
3497 76 76 76 76 76 76 76 76 76 77 76 76 76 76 76 76 76 76 76 76 76 76 76 76 76 76 76 75 76 76 76 76 76 76 77 77 77 77 77 77 76 76 76 76 76 76 77 77 77 77 76 76 76 76 76 76 76 76 76 76 76 77 77 77 77 77 76 76 76 76 76
3489G6%jJ%%%%jJ%%%%%%%%%%%j%%%%%%%%%%%%%%J%%%%%%%%%%%%jJ%%j%%%%J%%%j%%%%%%%%
3482G5J%j%%%%%j%%%%%%%%J%%j%%%%j%%Jj%%%%%%%J%%j%J%%%%%%%%j%%%%J%%%%%%%J%%j%%
3474G4%%%%%%%j%J%%j%%J%%%%%j%%%%%%%%%%JJ%j%%%J%%j%%%%jJ%%%%%J%j%%%%%%%%J%%%j
3467G4J%%%%%%%%%%%%j%%J%%%%%%%J%j%%%%%J%j%%%%j%J%JjJ%j%%%%J%%%%j%%J%%%%%%%%%
3460G6%j%%%j%%%%%J%%%j%%%%%%%%%%%%%%%%%%%%j%%%%%%%%%%jJ%%%%%%j%%%%%%%%%%j%%%
3452G1%%%%%%%%%%%%%%%%%%%%%%%%%%%Jj%J%%%%j%%%%%%%%%%%%%%%%%%%%%%%%%%%%%%%%%%
3445G1%%%%%jJ%%%%%%%%%%%%J%%%%%%%%%Jj%%J%j%%%%%%%J%%j%%%J%%%%J%%j%J%%%%%%%jJ
3437G4%j%%%%%J%%%%%%%J%%jJ%%%%%%%%%%%%%%J%%%%%j%%%%%%J%%%%%J%j%%%%%%%%j%%J%%
$$ plain form
3489 76 76 75 76 76 76 76 76 75 76 76 76 76 76 76 76 76 76 76 76 76 75 75 75 75 75 75 75 75 75 75 75 75 75 75 75 76 76 76 76 76 76 76 76 76 76 76 76 76 75 76 76 76 75 75 75 75 75 76 76 76 76 75 75 75 75 75 75 75 75 75
3482 75 76 76 75 75 75 75 75 75 74 74 74 74 74 74 74 74 74 75 75 75 74 74 74 74 74 73 73 73 74 73 73 73 73 73 73 73 73 74 74 74 73 73 74 74 74 74 74 74 74 74 74 73 73 73 73 73 74 74 74 74 74 74 74 74 75 75 75 74 74 74
3474 74 74 74 74 74 74 74 74 73 73 74 74 74 73 73 73 74 74 74 74 74 74 73 73 73 73 73 73 73 73 73 73 73 74 75 75 74 74 74 74 75 75 75 74 74 74 74 74 73 74 74 74 74 74 74 75 75 74 74 74 74 74 74 74 74 74 75 75 75 75 74
3467 74 75 75 75 75 75 75 75 75 75 75 75 75 75 74 74 74 75 75 75 75 75 75 75 75 76 76 75 75 75 75 75 75 76 76 75 75 75 75 75 74 74 75 75 76 75 76 76 75 75 75 75 75 76 76 76 76 76 75 75 75 76 76 76 76 76 76 76 76 76 76
3460 76 76 75 75 75 75 74 74 74 74 74 74 75 75 75 75 74 74 74 74 74 74 74 74 74 74 74 74 74 74 74 74 74 74 74 74 74 73 73 73 73 73 73 73 73 73 73 73 72 73 73 73 73 73 73 73 72 72 72 72 72 72 72 72 72 72 72 71 71 71 71
3452 71 71 71 71 71 71 71 71 71 71 71 71 71 71 71 71 71 71 71 71 71 71 71 71 71 71 71 71 72 71 71 72 72 72 72 72 71 71 71 71 71 71 71 71 71 71 71 71 71 71 71 71 71 71 71 71 71 71 71 71 71 71 71 71 71 71 71 71 71 71 71
3445 71 71 71 71 71 71 70 71 71 71 71 71 71 71 71 71 71 71 71 71 72 72 72 72 72 72 72 72 72 72 73 72 72 72 73 73 72 72 72 72 72 72 72 72 73 73 73 72 72 72 72 73 73 73 73 73 74 74 74 73 73 74 74 74 74 74 74 74 74 73 74
3437 74 74 73 73 73 73 73 73 74 74 74 74 74 74 74 74 75 75 75 74 75 75 75 75 75 75 75 75 75 75 75 75 75 75 75 76 76 76 76 76 76 75 75 75 75 75 75 75 76 76 76 76 76 76 77 77 76 76 76 76 76 76 76 76 76 75 75 75 76 76 76
3430G6%%J%%%%%%j%%%%%%%%%%%%%%%%%%%%%%%%%%%%%%%%%%jJ%%%j%%%%%%%%%%%%%jJ%%%%%
3422G5%j%%%%%%%%%%%%%%%%%%%%%%%jJ%%%%%%%%%j%%J%J%%j%%%%%%%%j%j%%j%%JJ%%%%%%%
3415G3%%%j%j%%J%%%%%%%%%J%%%%%%%%%%%%%%Jj%J%%%%%%%%%%%%%%%%%%%%j%%J%%%%%%%%%
3408G4%%J%%%%%j%%%%%%%J%%%%%j%%%J%%%%j%%J%%%%%%%j%%%%%J%%Jj%%%J%%%%j%%%J%j%%
3400G5%%%%%%%%j%J%J%%%%j%%%Jj%%%%%%%%%%%%%%%%%%%%%%%%%%%%%%%%%%%%%%%%%%%%j%J
3393G5%%J%j%%%%%%%%%J%%j%%%J%jJ%%%%%%%%%%%%j%%%%%%%%%%%%Jj%%%%%%%%%%%%%%%%%%
3385G5J%%j%%%%%%%%%%%J%%%%%j%%%%%%%%%%%%%%%%%%%%%%%%%%J%%%%%%j%%%%%%J%%%%%%%
3378G6%j%%%%%%%%%%%%%%%%%%%%%%%%%%%%%%%%%%%%%Jj%%%%%%%%%%%%%%%%%%%J%%%%%%%%%
$$ plain form
3430 76 76 76 77 77 77 77 77 77 77 76 76 76 76 76 76 76 76 76 76 76 76 76 76 76 76 76 76 76 76 76 76 76 76 76 76 76 76 76 76 76 76 76 76 76 75 76 76 76 76 75 75 75 75 75 75 75 75 75 75 75 75 75 75 74 75 75 75 75 75 75
3422 75 75 74 74 74 74 74 74 74 74 74 74 74 74 74 74 74 74 74 74 74 74 74 74 74 74 73 74 74 74 74 74 74 74 74 74 74 73 73 73 74 74 75 75 75 74 74 74 74 74 74 74 74 74 73 73 72 72 72 71 71 71 72 73 73 73 73 73 73 73 73
3415 73 73 73 73 72 72 71 71 71 72 72 72 72 72 72 72 72 72 72 73 73 73 73 73 73 73 73 73 73 73 73 73 73 73 74 73 73 74 74 74 74 74 74 74 74 74 74 74 74 74 74 74 74 74 74 74 74 74 73 73 73 74 74 74 74 74 74 74 74 74 74
3408 74 74 74 75 75 75 75 75 75 74 74 74 74 74 74 74 74 75 75 75 75 75 75 74 74 74 74 75 75 75 75 75 74 74 74 75 75 75 75 75 75 75 75 74 74 74 74 74 74 75 75 75 76 75 75 75 75 76 76 76 76 76 75 75 75 75 76 76 75 75 75
3400 75 75 75 75 75 75 75 75 75 74 74 75 75 76 76 76 76 76 75 75 75 75 76 75 75 75 75 75 75 75 75 75 75 75 75 75 75 75 75 75 75 75 75 75 75 75 75 75 75 75 75 75 75 75 75 75 75 75 75 75 75 75 75 75 75 75 75 75 74 74 75
3393 75 75 75 76 76 75 75 75 75 75 75 75 75 75 75 76 76 76 75 75 75 75 76 76 75 76 76 76 76 76 76 76 76 76 76 76 76 76 75 75 75 75 75 75 75 75 75 75 75 75 75 76 75 75 75 75 75 75 75 75 75 75 75 75 75 75 75 75 75 75 75
3385 75 76 76 76 75 75 75 75 75 75 75 75 75 75 75 75 76 76 76 76 76 76 75 75 75 75 75 75 75 75 75 75 75 75 75 75 75 75 75 75 75 75 75 75 75 75 75 75 75 76 76 76 76 76 76 76 75 75 75 75 75 75 75 76 76 76 76 76 76 76 76
3378 76 76 75 75 75 75 75 75 75 75 75 75 75 75 75 75 75 75 75 75 75 75 75 75 75 75 75 75 75 75 75 75 75 75 75 75 75 75 75 75 76 75 75 75 75 75 75 75 75 75 75 75 75 75 75 75 75 75 75 75 75 76 76 76 76 76 76 76 76 76 76
3371G6j%%jJ%%%%%%%%%%%%%%j%%%%%Jj%J%jJ%%%%%%%%%%%Jj%%%%%Jj%%%%J%%%%%j%%%%%%%
3363G5%%%%J%j%J%j%%%%%%%%%%%%%%Jj%%%%%%%%%%%%%J%%j%%J%%%%%%%%%%j%%%%J%%%%%j%
3356G5%%%%%%J%%%j%j%J%%J%%j%%%J%%j%Jj%%%%%%%%%%%%%%%%%%%%%Jj%%%%%%%%%%%%%%%%
3348G5%%%%%%%%%%%%%J%j%%%%J%%j%%%%%Jj%Jj%%%%%%%%%%%%%%%%J%%%%j%%%%%%%%%%%%J%
3341G6%%%%%%%j%%%%%%%%j%%%%J%%%%%%%%%%%%JjJ%%%%%%%%j%%%%%%%J%%%%%%%%j%%%%%%%
3333G5%%%%%%%%%%%J%%%j%%%%%%%j%%J%%Jj%%%%J%%%%%j%%%J%%%%J%j%%%%jJ%j%%%%%J%%j
3326G5%%%%J%%%j%j%%J%%%%%%%%%%%%%%%%%%%%%%%%%%%%%%%%%%%%%%%J%%j%%%%%%%%%%%%j
3319G4%J%%%%%%J%%%%%j%%%%%%%%%%%J%j%%%j%%J%jJ%%JjJ%%%%j%j%J%%%%J%%%j%%%%%J%%
$$ plain form
3371 76 75 75 75 74 75 75 75 75 75 75 75 75 75 75 75 75 75 75 75 74 74 74 74 74 74 75 74 74 75 75 74 75 75 75 75 75 75 75 75 75 75 75 75 76 75 75 75 75 75 75 76 75 75 75 75 75 76 76 76 76 76 76 75 75 75 75 75 75 75 75
3363 75 75 75 75 75 76 76 75 75 76 76 75 75 75 75 75 75 75 75 75 75 75 75 75 75 75 76 75 75 75 75 75 75 75 75 75 75 75 75 75 75 76 76 76 75 75 75 76 76 76 76 76 76 76 76 76 76 76 75 75 75 75 75 76 76 76 76 76 76 75 75
3356 75 75 75 75 75 75 75 76 76 76 76 75 75 74 74 75 75 75 76 76 76 75 75 75 75 76 76 76 75 75 76 75 75 75 75 75 75 75 75 75 75 75 75 75 75 75 75 75 75 75 75 75 75 76 75 75 75 75 75 75 75 75 75 75 75 75 75 75 75 75 75
3348 75 75 75 75 75 75 75 75 75 75 75 75 75 75 76 76 75 75 75 75 75 76 76 76 75 75 75 75 75 75 76 75 75 76 75 75 75 75 75 75 75 75 75 75 75 75 75 75 75 75 75 76 76 76 76 76 75 75 75 75 75 75 75 75 75 75 75 75 75 76 76
3341 76 76 76 76 76 76 76 76 75 75 75 75 75 75 75 75 75 74 74 74 74 74 75 75 75 75 75 75 75 75 75 75 75 75 75 76 75 76 76 76 76 76 76 76 76 76 75 75 75 75 75 75 75 75 76 76 76 76 76 76 76 76 76 75 75 75 75 75 75 75 75
3333 75 75 75 75 75 75 75 75 75 75 75 75 76 76 76 76 75 75 75 75 75 75 75 75 74 74 74 75 75 75 76 75 75 75 75 75 76 76 76 76 76 76 75 75 75 75 76 76 76 76 76 77 77 76 76 76 76 76 75 76 76 75 75 75 75 75 75 76 76 76 75
3326 75 75 75 75 75 76 76 76 76 75 75 74 74 74 75 75 75 75 75 75 75 75 75 75 75 75 75 75 75 75 75 75 75 75 75 75 75 75 75 75 75 75 75 75 75 75 75 75 75 75 75 75 75 75 76 76 76 75 75 75 75 75 75 75 75 75 75 75 75 75 74
3319 74 74 75 75 75 75 75 75 75 76 76 76 76 76 76 75 75 75 75 75 75 75 75 75 75 75 75 76 76 75 75 75 75 74 74 74 75 75 74 75 75 75 76 75 76 76 76 76 76 75 75 74 74 75 75 75 75 75 76 76 76 76 75 75 75 75 75 75 76 76 76
3311G6j%%%%%%%%%%%%%%%%%%J%%%%j%j%J%J%j%%%%%%%%%%%%%%J%%%Jj%%%%%%%j%%J%j%%%%
3304G5%%%%%%%%%%%%%%%%%%%%%%%%%%J%j%%%%%%%%%%%%%%%%%%%%%%%%%J%%%%%J%%%JJ%%J%
3296H0%%%%j%%j%j%%%%j%%%%%%%%%%%%%%j%%%%%%%%%Jj%J%J%%%J%%J%%%%%J%%%%j%%%%j%%
3289G8j%%j%%%%j%%J%%%%%%%%j%%%%%%%%%%%%%J%%%j%%%%%%%%%%%%Jj%%%%%%%%%%J%%%%%%
3282G6jJ%%%%%%%%%%%j%%%%%%%%%J%%%%%%%%j%%%%Jj%%%%%%jJ%%%%%%%J%%%%%%%%%%jJ%%%
3274G6%%j%%Jj%%jJ%%%%%%%%%%J%%%j%jJ%%%%J%j%%%%%%%%%%%%%%%%%%%%%%J%j%%%%%%%%%
3267G5%%%J%j%%%%%%%j%%%%J%%%%%%%%%%j%%%%%%%%J%j%%%%%%J%%%%j%%%%%%%%%%j%J%%%%
3259G4%%%%%%%%j%%%%%%%%J%%j%%%%%%%%%%%%%%%J%j%%%%%%%%%%%%%%%%%%%%%%J%j%%%%%%
$$ plain form
3311 76 75 75 75 75 75 75 75 75 75 75 75 75 75 75 75 75 75 75 75 76 76 76 76 76 75 75 74 74 75 75 76 76 75 75 75 75 75 75 75 75 75 75 75 75 75 75 75 76 76 76 76 77 76 76 76 76 76 76 76 76 75 75 75 76 76 75 75 75 75 75
3304 75 75 75 75 75 75 75 75 75 75 75 75 75 75 75 75 75 75 75 75 75 75 75 75 75 75 75 76 76 75 75 75 75 75 75 75 75 75 75 75 75 75 75 75 75 75 75 75 75 75 75 75 75 75 75 76 76 76 76 76 76 77 77 77 77 78 79 79 79 80 80
3296 80 80 80 80 80 79 79 79 78 78 77 77 77 77 77 76 76 76 76 76 76 76 76 76 76 76 76 76 76 76 75 75 75 75 75 75 75 75 75 75 76 75 75 76 76 77 77 77 77 78 78 78 79 79 79 79 79 79 80 80 80 80 80 79 79 79 79 79 78 78 78
3289 78 77 77 77 76 76 76 76 76 75 75 75 76 76 76 76 76 76 76 76 76 75 75 75 75 75 75 75 75 75 75 75 75 75 75 76 76 76 76 75 75 75 75 75 75 75 75 75 75 75 75 75 76 75 75 75 75 75 75 75 75 75 75 75 76 76 76 76 76 76 76
3282 76 75 76 76 76 76 76 76 76 76 76 76 76 76 75 75 75 75 75 75 75 75 75 75 76 76 76 76 76 76 76 76 76 75 75 75 75 75 76 75 75 75 75 75 75 75 74 75 75 75 75 75 75 75 75 76 76 76 76 76 76 76 76 76 76 76 75 76 76 76 76
3274 76 76 76 75 75 75 76 75 75 75 74 75 75 75 75 75 75 75 75 75 75 75 76 76 76 76 75 75 74 75 75 75 75 75 76 76 75 75 75 75 75 75 75 75 75 75 75 75 75 75 75 75 75 75 75 75 75 75 75 76 76 75 75 75 75 75 75 75 75 75 75
3267 75 75 75 75 76 76 75 75 75 75 75 75 75 75 74 74 74 74 74 75 75 75 75 75 75 75 75 75 75 75 74 74 74 74 74 74 74 74 74 75 75 74 74 74 74 74 74 74 75 75 75 75 75 74 74 74 74 74 74 74 74 74 74 74 73 73 74 74 74 74 74
3259 74 74 74 74 74 74 74 74 74 73 73 73 73 73 73 73 73 73 74 74 74 73 73 73 73 73 73 73 73 73 73 73 73 73 73 73 73 74 74 73 73 73 73 73 73 73 73 73 73 73 73 73 73 73 73 73 73 73 73 73 73 73 74 74 73 73 73 73 73 73 73
3252G3%%%%%%%%%%%J%j%%%%%j%%%%%%J%j%%%%j%%%%J%%j%%%J%J%%%j%%%%J%%%%%%%J%j%%%
3244G3%%%%%%%%%%%%%%%%Jj%%%%%%%%%%%%J%%%%%%%%%%j%%%%J%%Jj%%%%%%%%%%%%J%j%%%J
3237G5%%%%%%%%%%%%%%%%j%%%%%%%%%J%%Jj%%%J%j%%Jj%%%%%%%%%%%%%j%%%%%J%%%%%%%%%
3230G5%%%j%J%%%%jJ%%%%%%j%J%%%%%%%%J%%j%%%%%%%%%%%%%%%%%%%%%%%%%%%Jj%%%%%%%%
3222G5J%j%%%%%%%%%%%%%%%%%%%%%%%%%%%%%%%%%%%%%j%%J%%jJ%%%%%%%%%%%%%%%%%%%%j%
3215G4%%%%%%Jj%%%%%%%%J%%%%%%%%%%%%%%%%%%%%%%%%%%%%%%%%%%%j%%%%%%%%%%%%%%%%%
3207G4%%%%%%J%%%%j%%%%%%%%%%%%%%%%%%%%J%%j%%%%%%%%%j%%%%J%%%J%%%jJ%%%%%%%%j%
3200G4%%J%%j%%%%%%%%%%%%%%%%%%%%%%%%%%%%%%%%%%%%%%%%%%%%%%%%%Jj%%J%%%%j%Jj%%
$$ plain form
3252 73 73 73 73 73 73 73 73 73 73 73 73 74 74 73 73 73 73 73 73 72 72 72 72 72 72 72 73 73 72 72 72 72 72 71 71 71 71 71 72 72 72 71 71 71 71 72 72 73 73 73 73 72 72 72 72 72 73 73 73 73 73 73 73 73 74 74 73 73 73 73
3244 73 73 73 73 73 73 73 73 73 73 73 73 73 73 73 73 73 74 73 73 73 73 73 73 73 73 73 73 73 73 73 74 74 74 74 74 74 74 74 74 74 74 73 73 73 73 73 74 74 74 75 74 74 74 74 74 74 74 74 74 74 74 74 74 75 75 74 74 74 74 75
3237 75 75 75 75 75 75 75 75 75 75 75 75 75 75 75 75 75 74 74 74 74 74 74 74 74 74 74 75 75 75 76 75 75 75 75 76 76 75 75 75 76 75 75 75 75 75 75 75 75 75 75 75 75 75 75 74 74 74 74 74 74 75 75 75 75 75 75 75 75 75 75
3230 75 75 75 75 74 74 75 75 75 75 75 74 75 75 75 75 75 75 75 74 74 75 75 75 75 75 75 75 75 75 76 76 76 75 75 75 75 75 75 75 75 75 75 75 75 75 75 75 75 75 75 75 75 75 75 75 75 75 75 75 75 76 75 75 75 75 75 75 75 75 75
3222 75 76 76 75 75 75 75 75 75 75 75 75 75 75 75 75 75 75 75 75 75 75 75 75 75 75 75 75 75 75 75 75 75 75 75 75 75 75 75 75 75 74 74 74 75 75 75 74 75 75 75 75 75 75 75 75 75 75 75 75 75 75 75 75 75 75 75 75 75 74 74
3215 74 74 74 74 74 74 74 75 74 74 74 74 74 74 74 74 74 75 75 75 75 75 75 75 75 75 75 75 75 75 75 75 75 75 75 75 75 75 75 75 75 75 75 75 75 75 75 75 75 75 75 75 75 74 74 74 74 74 74 74 74 74 74 74 74 74 74 74 74 74 74
3207 74 74 74 74 74 74 74 75 75 75 75 75 74 74 74 74 74 74 74 74 74 74 74 74 74 74 74 74 74 74 74 74 74 75 75 75 74 74 74 74 74 74 74 74 74 74 73 73 73 73 73 74 74 74 74 75 75 75 75 74 75 75 75 75 75 75 75 75 75 74 74
3200 74 74 74 75 75 75 74 74 74 74 74 74 74 74 74 74 74 74 74 74 74 74 74 74 74 74 74 74 74 74 74 74 74 74 74 74 74 74 74 74 74 74 74 74 74 74 74 74 74 74 74 74 74 74 74 74 75 74 74 74 75 75 75 75 75 74 74 75 74 74 74
3193G4%%%%%%J%%j%%%%%%%%j%J%%j%J%%%%%%%%J%jJ%jJ%%j%%j%%%J%%%%%%%%%%%%%%%%%%%
3185G4%%J%j%%%%%%%%%%J%%%%j%%Jj%%%Jj%%%%%%%%%%j%%J%%%%%%%%%%%%%%%%%%J%j%%%%%
3178G4%%%%J%%%%%%j%%J%j%%%%%%%%%%j%%%%%%%%J%%%%%%%%%%%%%%%%j%%%%%%%%J%%%%%%%
3170G4%%%%%%%%%%%%%%%%%%%%%%%%%%%%Jj%j%%%%%J%%%%%%%%%J%%%%%%%%%%%j%%j%%J%%%%
3163G4%%J%j%j%J%%%%%%%%%%%%j%%%%J%%%%%%%j%%%%%J%%%%%%%%%%%%Jj%%%%%%%%%%%%%%%
3155G4%%%%j%%J%Jj%%%%%%%%%J%jJ%%%%%%%j%%%Jj%%J%%%%%%%%%%j%%%%%%%%%%%%%%%%%%%
3148G4%%J%j%%%%%%%%%%%%%%%%%J%j%%j%%J%%%%%%%%%%%J%%j%%%%%%%J%%%%%J%j%j%J%j%%
3141G4%%%%%%%%%%%%%j%JJ%%%%%%j%%%%%%%%%%%%%%%%%%%%%%%%%%%%%%%%%%%%%%%j%%J%%%
$$ plain form
3193 74 74 74 74 74 74 74 75 75 75 74 74 74 74 74 74 74 74 74 73 73 74 74 74 73 73 74 74 74 74 74 74 74 74 74 75 75 74 75 75 74 75 75 75 74 74 74 73 73 73 73 74 74 74 74 74 74 74 74 74 74 74 74 74 74 74 74 74 74 74 74
3185 74 74 74 75 75 74 74 74 74 74 74 74 74 74 74 74 75 75 75 75 75 74 74 74 75 74 74 74 74 75 74 74 74 74 74 74 74 74 74 74 74 73 73 73 74 74 74 74 74 74 74 74 74 74 74 74 74 74 74 74 74 74 74 75 75 74 74 74 74 74 74
3178 74 74 74 74 74 75 75 75 75 75 75 75 74 74 74 75 75 74 74 74 74 74 74 74 74 74 74 74 73 73 73 73 73 73 73 73 73 74 74 74 74 74 74 74 74 74 74 74 74 74 74 74 74 74 73 73 73 73 73 73 73 73 73 74 74 74 74 74 74 74 74
3170 74 74 74 74 74 74 74 74 74 74 74 74 74 74 74 74 74 74 74 74 74 74 74 74 74 74 74 74 74 75 74 74 73 73 73 73 73 73 74 74 74 74 74 74 74 74 74 74 75 75 75 75 75 75 75 75 75 75 75 75 74 74 74 73 73 73 74 74 74 74 74
3163 74 74 74 75 75 74 74 73 73 74 74 74 74 74 74 74 74 74 74 74 74 74 73 73 73 73 73 74 74 74 74 74 74 74 74 73 73 73 73 73 73 74 74 74 74 74 74 74 74 74 74 74 74 74 75 74 74 74 74 74 74 74 74 74 74 74 74 74 74 74 74
3155 74 74 74 74 74 73 73 73 74 74 75 74 74 74 74 74 74 74 74 74 74 75 75 74 75 75 75 75 75 75 75 75 74 74 74 74 75 74 74 74 75 75 75 75 75 75 75 75 75 75 75 74 74 74 74 74 74 74 74 74 74 74 74 74 74 74 74 74 74 74 74
3148 74 74 74 75 75 74 74 74 74 74 74 74 74 74 74 74 74 74 74 74 74 74 74 75 75 74 74 74 73 73 73 74 74 74 74 74 74 74 74 74 74 74 74 75 75 75 74 74 74 74 74 74 74 74 75 75 75 75 75 75 76 76 75 75 74 74 75 75 74 74 74
3141 74 74 74 74 74 74 74 74 74 74 74 74 74 74 73 73 74 75 75 75 75 75 75 75 74 74 74 74 74 74 74 74 74 74 74 74 74 74 74 74 74 74 74 74 74 74 74 74 74 74 74 74 74 74 74 74 74 74 74 74 74 74 74 74 73 73 73 74 74 74 74
3133G4%%j%%%%%%%%%%%%%%%%%%%%%%%%%%%%J%j%%%%%%J%jJ%j%%%%j%J%%%%%%%J%jJ%%%%%j
3126G3%%%%%%%%%%%%%%j%%J%Jj%%%%%%%%%%%%%%%%%%%%j%%%%%%%%J%j%%%%%J%%%%%%j%J%%
3118G3%%%%%%%jJ%%J%%j%%%%%J%%%%%%%%%%%%%%%%j%%%%%%%%%j%%%%J%%%j%%J%%%%%%%%j%
3111G2%J%%%%%%%%%J%%%%%%%%%%%%%%%j%%%%%%%J%%%%%j%%%%J%%%%%%%%%%%%%%%%j%%%%J%
3104G4%%j%%%%%%%%%%%%J%%%%%%jj%J%%%%%%%%J%%%%%%%%jJ%%%%%%j%%%%%%J%%%%%%jJ%%j
3096G3J%%%jJ%j%%%%jJ%%%J%j%%%%%%%%%%%%%%%%%%%%%%%jJ%%%j%%%%%%%%%%%%%J%%%%%%j
3089G2%%j%%J%%%%%%%%%j%%%%%%%%%%%%%%%%%%%%%%%%%%%%%%%%%%%%%J%%%%%%%%%%%%%%%%
3081G2%%%%%%%%%jJ%%%%%%j%%%%%%%%%%%%%J%%%%%%%%%Jj%%%%%J%%%%%%%%%%%%%%%%%%%%%
$$ plain form
3133 74 74 74 73 73 73 73 73 73 73 73 73 73 73 73 73 73 73 73 73 73 73 73 73 73 73 73 73 73 73 73 73 74 74 73 73 73 73 73 73 73 74 74 73 74 74 73 73 73 73 73 72 72 73 73 73 73 73 73 73 73 74 74 73 74 74 74 74 74 74 73
3126 73 73 73 73 73 73 73 73 73 73 73 73 73 73 73 72 72 72 73 73 74 73 73 73 73 73 73 73 73 73 73 73 73 73 73 73 73 73 73 73 73 73 72 72 72 72 72 72 72 72 72 73 73 72 72 72 72 72 72 73 73 73 73 73 73 73 72 72 73 73 73
3118 73 73 73 73 73 73 73 73 72 73 73 73 74 74 74 73 73 73 73 73 73 74 74 74 74 74 74 74 74 74 74 74 74 74 74 74 74 74 73 73 73 73 73 73 73 73 73 73 72 72 72 72 72 73 73 73 73 72 72 72 73 73 73 73 73 73 73 73 73 72 72
3111 72 72 73 73 73 73 73 73 73 73 73 73 74 74 74 74 74 74 74 74 74 74 74 74 74 74 74 74 73 73 73 73 73 73 73 73 74 74 74 74 74 74 73 73 73 73 73 74 74 74 74 74 74 74 74 74 74 74 74 74 74 74 74 74 73 73 73 73 73 74 74
3104 74 74 74 73 73 73 73 73 73 73 73 73 73 73 73 73 74 74 74 74 74 74 74 73 72 72 73 73 73 73 73 73 73 73 73 74 74 74 74 74 74 74 74 74 73 74 74 74 74 74 74 74 73 73 73 73 73 73 73 74 74 74 74 74 74 74 73 74 74 74 73
3096 73 74 74 74 74 73 74 74 73 73 73 73 73 72 73 73 73 73 74 74 73 73 73 73 73 73 73 73 73 73 73 73 73 73 73 73 73 73 73 73 73 73 73 73 72 73 73 73 73 72 72 72 72 72 72 72 72 72 72 72 72 72 72 73 73 73 73 73 73 73 72
3089 72 72 72 71 71 71 72 72 72 72 72 72 72 72 72 72 71 71 71 71 71 71 71 71 71 71 71 71 71 71 71 71 71 71 71 71 71 71 71 71 71 71 71 71 71 71 71 71 71 71 71 71 71 71 72 72 72 72 72 72 72 72 72 72 72 72 72 72 72 72 72
3081 72 72 72 72 72 72 72 72 72 72 71 72 72 72 72 72 72 72 71 71 71 71 71 71 71 71 71 71 71 71 71 71 72 72 72 72 72 72 72 72 72 72 73 72 72 72 72 72 72 73 73 73 73 73 73 73 73 73 73 73 73 73 73 73 73 73 73 73 73 73 73
3074G3%%jJ%J%%j%%%%%%%%jJ%%%%J%%%%%%%j%%%%J%j%%%%%%%%%%%%%J%%j%J%%%%%%%%j%%J
3066G4j%%%J%%%%%j%%%%%%%%%%%J%%%%J%j%%%%%%%%%%%j%J%%J%j%%%%%J%%%%%%%%%%j%%%%
3059G4%%%%%j%%%%J%%%%j%%%%j%J%%%%jJ%%%%%%%%%%%%%%%%%J%j%%%%%%%%%J%%%%%%%%j%%
3052G3%%%Jj%%%%%%j%%%J%%%%j%%%%%%%%%%%%%%%%%%%%%%%%%%%%%%%%%%%%J%%%Jj%%J%%j%
3044G3%%J%%%j%J%%%%%%jJ%%%%%%%j%%J%%%%%%%%%%%%%%%%%%jJ%%%%%%%%j%%%J%%%%j%%%%
3037G3%J%%%%%j%%%%%%%J%%j%%%%%J%JjJj%j%%J%%jJ%%%j%J%J%%%%j%%%%%%%%%%%%%%%%%%
3029G4Jj%%%%%jJ%%%%%%%%%%%%%%J%%%j%%%%%%%Jj%%%%%%%%%J%%J%%j%%%%%j%%%%%%%%%J%
3022G5%%%j%%%%J%%%j%%%%%%%%J%%%%%j%%%%%%%%%%%%%%%J%%%%%%%%%%%%%%%%%%%j%%%%%%
$$ plain form
3074 73 73 73 72 73 73 74 74 74 73 73 73 73 73 73 73 73 73 72 73 73 73 73 73 74 74 74 74 74 74 74 74 73 73 73 73 73 74 74 73 73 73 73 73 73 73 73 73 73 73 73 73 73 74 74 74 73 73 74 74 74 74 74 74 74 74 74 73 73 73 74
3066 74 73 73 73 73 74 74 74 74 74 74 73 73 73 73 73 73 73 73 73 73 73 73 74 74 74 74 74 75 75 74 74 74 74 74 74 74 74 74 74 74 74 73 73 74 74 74 75 75 74 74 74 74 74 74 75 75 75 75 75 75 75 75 75 75 75 74 74 74 74 74
3059 74 74 74 74 74 74 73 73 73 73 73 74 74 74 74 74 73 73 73 73 73 72 72 73 73 73 73 73 72 73 73 73 73 73 73 73 73 73 73 73 73 73 73 73 73 73 73 74 74 73 73 73 73 73 73 73 73 73 73 74 74 74 74 74 74 74 74 74 73 73 73
3052 73 73 73 73 74 73 73 73 73 73 73 73 72 72 72 72 73 73 73 73 73 72 72 72 72 72 72 72 72 72 72 72 72 72 72 72 72 72 72 72 72 72 72 72 72 72 72 72 72 72 72 72 72 72 72 72 72 72 73 73 73 73 74 73 73 73 74 74 74 73 73
3044 73 73 73 74 74 74 74 73 73 74 74 74 74 74 74 74 73 74 74 74 74 74 74 74 74 73 73 73 74 74 74 74 74 74 74 74 74 74 74 74 74 74 74 74 74 74 74 73 74 74 74 74 74 74 74 74 74 73 73 73 73 74 74 74 74 74 73 73 73 73 73
3037 73 73 74 74 74 74 74 74 73 73 73 73 73 73 73 73 74 74 74 73 73 73 73 73 73 74 74 75 74 75 74 74 73 73 73 74 74 74 73 74 74 74 74 73 73 74 74 75 75 75 75 75 74 74 74 74 74 74 74 74 74 74 74 74 74 74 74 74 74 74 74
3029 74 75 74 74 74 74 74 74 73 74 74 74 74 74 74 74 74 74 74 74 74 74 74 74 75 75 75 75 74 74 74 74 74 74 74 74 75 74 74 74 74 74 74 74 74 74 74 75 75 75 76 76 76 75 75 75 75 75 75 74 74 74 74 74 74 74 74 74 74 75 75
3022 75 75 75 75 74 74 74 74 74 75 75 75 75 74 74 74 74 74 74 74 74 74 75 75 75 75 75 75 74 74 74 74 74 74 74 74 74 74 74 74 74 74 74 74 75 75 75 75 75 75 75 75 75 75 75 75 75 75 75 75 75 75 75 75 74 74 74 74 74 74 74
3015G4%%%%%%%%%j%%%%J%%J%%%%%%j%%j%%J%%%%%%%%%%%%j%%J%%J%%j%%%%%%%%%%%%j%%%%
3007G3%%J%%%j%J%%%j%J%J%%%%%%%%%j%J%%%j%J%%%%j%%%%%%%%%%%%%%%%%%%%%jJ%%%%J%%
3000G5j%%%%%%%%%%%%%%%%%%%%%%%%%j%%%%%%%%jJ%%J%%%j%%%%%j%%%J%%%%%%%%jJ%%j%%J
2992G3%%%%j%%%%%%J%j%%%%%%%%%%%%%%%%%%%%%%%j%%%%%%%%%%%%%%%%%j%J%%%%%%%j%%%%
2985G0%%%%%%%%%%%J%%%%%%%%%%%%%%%%%%%%%%%J%%%%j%%%%%%J%%%%%%jJ%%%%%%%%%%%%%j
2977G1%%%J%j%%J%%%%%jJ%%J%%%j%J%%%j%%%%%%%%%%J%%%%%%%%%Jj%%%%%%%%%%%%%%J%%%%
2970G4%%%%j%J%%%%%%%%%j%Jj%%%%%%%%Jj%%%%%J%%Jj%%%%%%%%%%%Jj%%%%%%%%%%%%%%%%%
2963G4%%%%Jj%%J%%%%j%%%%%J%%%%%%j%J%%%%%j%%%jJ%%%%%%%%J%%%j%%%%%%J%%%%j%Jj%%
$$ plain form
3015 74 74 74 74 74 74 74 74 74 74 73 73 73 73 73 74 74 74 75 75 75 75 75 75 75 74 74 74 73 73 73 74 74 74 74 74 74 74 74 74 74 74 74 74 73 73 73 74 74 74 75 75 75 74 74 74 74 74 74 74 74 74 74 74 74 74 73 73 73 73 73
3007 73 73 73 74 74 74 74 73 73 74 74 74 74 73 73 74 74 75 75 75 75 75 75 75 75 75 75 74 74 75 75 75 75 74 74 75 75 75 75 75 74 74 74 74 74 74 74 74 74 74 74 74 74 74 74 74 74 74 74 74 74 74 73 74 74 74 74 74 75 75 75
3000 75 74 74 74 74 74 74 74 74 74 74 74 74 74 74 74 74 74 74 74 74 74 74 74 74 74 74 73 73 73 73 73 73 73 73 73 72 73 73 73 74 74 74 74 73 73 73 73 73 73 72 72 72 72 73 73 73 73 73 73 73 73 73 72 73 73 73 72 72 72 73
2992 73 73 73 73 73 72 72 72 72 72 72 72 73 73 72 72 72 72 72 72 72 72 72 72 72 72 72 72 72 72 72 72 72 72 72 72 72 72 71 71 71 71 71 71 71 71 71 71 71 71 71 71 71 71 71 71 70 70 71 71 71 71 71 71 71 71 70 70 70 70 70
2985 70 70 70 70 70 70 70 70 70 70 70 70 71 71 71 71 71 71 71 71 71 71 71 71 71 71 71 71 71 71 71 71 71 71 71 71 72 72 72 72 72 71 71 71 71 71 71 71 72 72 72 72 72 72 72 71 72 72 72 72 72 72 72 72 72 72 72 72 72 72 71
2977 71 71 71 71 72 72 71 71 71 72 72 72 72 72 72 71 72 72 72 73 73 73 73 72 72 73 73 73 73 72 72 72 72 72 72 72 72 72 72 72 73 73 73 73 73 73 73 73 73 73 74 73 73 73 73 73 73 73 73 73 73 73 73 73 73 73 74 74 74 74 74
2970 74 74 74 74 74 73 73 74 74 74 74 74 74 74 74 74 74 73 73 74 73 73 73 73 73 73 73 73 73 74 73 73 73 73 73 73 74 74 74 75 74 74 74 74 74 74 74 74 74 74 74 74 75 74 74 74 74 74 74 74 74 74 74 74 74 74 74 74 74 74 74
2963 74 74 74 74 74 75 74 74 74 75 75 75 75 75 74 74 74 74 74 74 75 75 75 75 75 75 75 74 74 75 75 75 75 75 75 74 74 74 74 73 74 74 74 74 74 74 74 74 74 75 75 75 75 74 74 74 74 74 74 74 75 75 75 75 75 74 74 75 74 74 74
2955G4%%%%%%%%%%%%%%%%%%%%%%%%%%%%%%J%%%%%%%%%%%%%%jJ%%%%%%%%%%%%%%%%%%J%j%%
2948G5%%%%%%%%jJj%J%%%%%Jj%%%%%%J%%%%j%%%%%%%%%%%%%%j%J%%%%%%jJ%j%%%%%%%%%%%
2940G4%%%%%%%%%%j%J%%%%%%%%%%%%%%%%%%%%jJ%%%%%%%%%%%%%%%%%%%%%%%%j%%%J%%%%%%
2933G4%j%%%J%%%%%%%%j%%%%%%%%J%%%%%%%%%%%%Jj%%%jJ%%%%%%%%%%%J%%%%%%j%%%%%%%%
2926G4%%%j%J%J%%%j%%%J%j%%%%%j%%%J%%j%%%%J%%%%%%j%J%%%%%%%%%J%%%%%%%j%%%%%%%
2918G4%%%%%%%j%%J%%%%%%jJ%%%%%%%%%%%%Jj%%%%j%%J%%%%%%%%%%%%%%%%%%%%%%%%%j%%%
2911G3%J%%%%%%%%%jJ%J%j%%%jJ%%%jJ%%j%%%J%jJ%j%%J%%j%%%%%%%%%%%J%%%%%Jj%%%%%%
2903G4%%%%%Jj%%%%%%%%%%%%%%%%%%%jJ%jJ%%jJ%j%%%%%%J%%%j%%%%%%%%%%%%%%%%%J%%%%
$$ plain form
2955 74 74 74 74 74 74 74 74 74 74 74 74 74 74 74 74 74 74 74 74 74 74 74 74 74 74 74 74 74 74 74 75 75 75 75 75 75 75 75 75 75 75 75 75 75 75 74 75 75 75 75 75 75 75 75 75 75 75 75 75 75 75 75 75 75 75 76 76 75 75 75
2948 75 75 75 75 75 75 75 75 75 74 75 74 74 75 75 75 75 75 75 76 75 75 75 75 75 75 75 76 76 76 76 76 75 75 75 75 75 75 75 75 75 75 75 75 75 75 75 74 74 75 75 75 75 75 75 75 74 75 75 74 74 74 74 74 74 74 74 74 74 74 74
2940 74 74 74 74 74 74 74 74 74 74 74 73 73 74 74 74 74 74 74 74 74 74 74 74 74 74 74 74 74 74 74 74 74 74 73 74 74 74 74 74 74 74 74 74 74 74 74 74 74 74 74 74 74 74 74 74 74 74 74 74 73 73 73 73 74 74 74 74 74 74 74
2933 74 74 73 73 73 73 74 74 74 74 74 74 74 74 74 73 73 73 73 73 73 73 73 73 74 74 74 74 74 74 74 74 74 74 74 74 74 75 74 74 74 74 73 74 74 74 74 74 74 74 74 74 74 74 74 75 75 75 75 75 75 75 74 74 74 74 74 74 74 74 74
2926 74 74 74 74 73 73 74 74 75 75 75 75 74 74 74 74 75 75 74 74 74 74 74 74 73 73 73 73 74 74 74 73 73 73 73 73 74 74 74 74 74 74 74 73 73 74 74 74 74 74 74 74 74 74 74 75 75 75 75 75 75 75 75 74 74 74 74 74 74 74 74
2918 74 74 74 74 74 74 74 74 73 73 73 74 74 74 74 74 74 74 73 74 74 74 74 74 74 74 74 74 74 74 74 74 75 74 74 74 74 74 73 73 73 74 74 74 74 74 74 74 74 74 74 74 74 74 74 74 74 74 74 74 74 74 74 74 74 74 74 73 73 73 73
2911 73 73 74 74 74 74 74 74 74 74 74 74 73 74 74 75 75 74 74 74 74 73 74 74 74 74 73 74 74 74 73 73 73 73 74 74 73 74 74 73 73 73 74 74 74 73 73 73 73 73 73 73 73 73 73 73 73 74 74 74 74 74 74 75 74 74 74 74 74 74 74
2903 74 74 74 74 74 74 75 74 74 74 74 74 74 74 74 74 74 74 74 74 74 74 74 74 74 74 74 73 74 74 73 74 74 74 73 74 74 73 73 73 73 73 73 73 74 74 74 74 73 73 73 73 73 73 73 73 73 73 73 73 73 73 73 73 73 73 74 74 74 74 74
2896G4%%%%J%%%%%%%%%j%%%%jJ%%j%%%%%%%%%j%%%%%JJj%%%%j%%%%%%%%%%%%Jj%J%%%%J%J
2888G5%JJJ%%%j%%j%j%%jJ%j%%%j%%%%%%%%%%j%%%J%%%%%%%%%%%%%%j%%%%%J%%J%%%%J%JJ
2881G7JJ%%%j%j%j%j%j%%%%%%j%%J%%%%%%jJ%%%%%%%%%%j%%J%%%j%%%J%%%%%%%%%%J%%J%%
2874G6%%%j%%%%%%j%Jj%%%%%%%%%%%%%%%%%J%%%j%%J%%j%J%%%%%%%J%%%%%%%J%%%%%J%%%j
2866G7%%%J%j%%%%%%%%%%jJ%%%j%%%%%%j%%%%%%%%%%%%%%%J%%j%%%J%%%%j%%%%%%%%%J%%j
2859G5%%%%%%%%J%%%J%%%%%J%J%%J%%JJJKJ%JJ%J%J%%%%%%%%%%jj%jj%jjjj%j%j%j%j%%%%
2851G8%%j%%%%%J%%%%%%%J%JJJJJJ%J%%jj%jkjjjj%j%%%%%%j%%%j%%%%%J%%%%%%%Jj%%%%J
2844G6%%%J%%%%%%%%%%J%%J%J%%%%jj%%jj%%%%%%j%%j%%%%%%%J%%%%%%%%%%%%%%%%%jJ%%%
$$ plain form
2896 74 74 74 74 74 75 75 75 75 75 75 75 75 75 75 74 74 74 74 74 73 74 74 74 73 73 73 73 73 73 73 73 73 73 72 72 72 72 72 72 73 74 73 73 73 73 73 72 72 72 72 72 72 72 72 72 72 72 72 72 73 72 72 73 73 73 73 73 74 74 75
2888 75 75 76 77 78 78 78 78 77 77 77 76 76 75 75 75 74 75 75 74 74 74 74 73 73 73 73 73 73 73 73 73 73 73 72 72 72 72 73 73 73 73 73 73 73 73 73 73 73 73 73 73 73 72 72 72 72 72 72 73 73 73 74 74 74 74 74 75 75 76 77
2881 77 78 79 79 79 79 78 78 77 77 76 76 75 75 74 74 74 74 74 74 74 73 73 73 74 74 74 74 74 74 74 73 74 74 74 74 74 74 74 74 74 74 74 73 73 73 74 74 74 74 73 73 73 73 74 74 74 74 74 74 74 74 74 74 74 75 75 75 76 76 76
2874 76 76 76 76 75 75 75 75 75 75 75 74 74 75 74 74 74 74 74 74 74 74 74 74 74 74 74 74 74 74 74 74 75 75 75 75 74 74 74 75 75 75 74 74 75 75 75 75 75 75 75 75 76 76 76 76 76 76 76 76 77 77 77 77 77 77 78 78 78 78 77
2866 77 77 77 77 78 78 77 77 77 77 77 77 77 77 77 77 77 76 77 77 77 77 76 76 76 76 76 76 76 75 75 75 75 75 75 75 75 75 75 75 75 75 75 75 75 76 76 76 75 75 75 75 76 76 76 76 76 75 75 75 75 75 75 75 75 75 75 76 76 76 75
2859 75 75 75 75 75 75 75 75 75 76 76 76 76 77 77 77 77 77 77 78 78 79 79 79 80 80 80 81 82 83 85 86 86 87 88 88 89 89 90 90 90 90 90 90 90 90 90 90 90 89 88 88 87 86 86 85 84 83 82 82 81 81 80 80 79 79 78 78 78 78 78
2851 78 78 78 77 77 77 77 77 77 78 78 78 78 78 78 78 78 79 79 80 81 82 83 84 85 85 86 86 86 85 84 84 83 81 80 79 78 77 77 76 76 76 76 76 76 76 75 75 75 75 74 74 74 74 74 74 75 75 75 75 75 75 75 75 76 75 75 75 75 75 76
2844 76 76 76 76 77 77 77 77 77 77 77 77 77 77 77 78 78 78 79 79 80 80 80 80 80 79 78 78 78 77 76 76 76 76 76 76 76 75 75 75 74 74 74 74 74 74 74 74 75 75 75 75 75 75 75 75 75 75 75 75 75 75 75 75 75 75 74 75 75 75 75
2836G5%J%%%%%j%%%Jj%%%%%%J%%j%%%%%%%%%%j%%J%%%%%%%%%%%%%%%%%%%%%%%%%J%%%%%j%
2829G5%%%%%%%%%%%%%%%%J%%%j%%J%%%%%%%%%%%%%%%%%j%%%Jj%%%%%%%%%%%%%%%%j%%%%%J
2822G5%%%%%%j%%%%%%%%%J%Jj%%%%%J%%%%j%J%%%%%%%%%%j%%%%%%%j%%%%%%%%%%%%J%%%%%
2814G5%%%%%%%%%%%%%%%%%%%%%j%%%%J%J%%%%%%%%%%%%%%%%%%J%%j%%%%%%%%%%%%%j%%%j%
2807G4%JJ%%%%%%%%%%%%%j%%J%%%%%%%%%%%%%%%%%j%%J%J%%%%jJ%j%%%%%%%%J%%%%%%%%%%
2799G7%J%%%%%%%%%%j%%%%%%%%%%j%%%%%%%%%%%%J%j%%%%%%%%%%%%%%%%%%%%%%%Jj%%%%J%
2792G7%%j%%%%Jj%%%%%%%%%J%%%%j%%%%%%%%%%%J%%j%%%%J%%%%%%%%%%%%%%j%j%%%%%%%%%
2785G5%%%%%%%%%%%%%%%%%%%%%%%%%%J%%%%%%%%jJ%%J%%%%j%%%%%%%%%%%j%%J%%%j%%%%j%
$$ plain form
2836 75 75 76 76 76 76 76 76 75 75 75 75 76 75 75 75 75 75 75 75 76 76 76 75 75 75 75 75 75 75 75 75 75 75 74 74 74 75 75 75 75 75 75 75 75 75 75 75 75 75 75 75 75 75 75 75 75 75 75 75 75 75 75 76 76 76 76 76 76 75 75
2829 75 75 75 75 75 75 75 75 75 75 75 75 75 75 75 75 75 76 76 76 76 75 75 75 76 76 76 76 76 76 76 76 76 76 76 76 76 76 76 76 76 76 75 75 75 75 76 75 75 75 75 75 75 75 75 75 75 75 75 75 75 75 75 75 74 74 74 74 74 74 75
2822 75 75 75 75 75 75 75 74 74 74 74 74 74 74 74 74 74 75 75 76 75 75 75 75 75 75 76 76 76 76 76 75 75 76 76 76 76 76 76 76 76 76 76 76 75 75 75 75 75 75 75 75 74 74 74 74 74 74 74 74 74 74 74 74 74 75 75 75 75 75 75
2814 75 75 75 75 75 75 75 75 75 75 75 75 75 75 75 75 75 75 75 75 75 75 74 74 74 74 74 75 75 76 76 76 76 76 76 76 76 76 76 76 76 76 76 76 76 76 76 76 77 77 77 76 76 76 76 76 76 76 76 76 76 76 76 76 76 75 75 75 75 74 74
2807 74 74 75 76 76 76 76 76 76 76 76 76 76 76 76 76 76 75 75 75 76 76 76 76 76 76 76 76 76 76 76 76 76 76 76 76 76 76 75 75 75 76 76 77 77 77 77 77 76 77 77 76 76 76 76 76 76 76 76 76 77 77 77 77 77 77 77 77 77 77 77
2799 77 77 78 78 78 78 78 78 78 78 78 78 78 77 77 77 77 77 77 77 77 77 77 77 76 76 76 76 76 76 76 76 76 76 76 76 76 77 77 76 76 76 76 76 76 76 76 76 76 76 76 76 76 76 76 76 76 76 76 76 76 76 76 77 76 76 76 76 76 77 77
2792 77 77 77 76 76 76 76 76 77 76 76 76 76 76 76 76 76 76 76 77 77 77 77 77 76 76 76 76 76 76 76 76 76 76 76 76 77 77 77 76 76 76 76 76 77 77 77 77 77 77 77 77 77 77 77 77 77 77 77 76 76 75 75 75 75 75 75 75 75 75 75
2785 75 75 75 75 75 75 75 75 75 75 75 75 75 75 75 75 75 75 75 75 75 75 75 75 75 75 75 76 76 76 76 76 76 76 76 76 75 76 76 76 77 77 77 77 77 76 76 76 76 76 76 76 76 76 76 76 76 75 75 75 76 76 76 76 75 75 75 75 75 74 74
2777G4%%%J%%%j%J%J%%%%%J%%%J%J%JJ%JJ%J%J%%J%j%%j%j%%j%%jjj%%j%%%j%j%j%Jj%%%%
2770G5%%%%%%%%%%%%%%J%%%%%%%%%%%%%%%%%%%%%j%%%J%%%%%%%%%%%%%%%%%%jJ%%J%%%%%%
2762G7%%%%%%%%%%%J%%%%%%%J%J%J%%J%%%%%j%%%%j%j%%j%%%j%J%%j%%%%%%%%%%%%%%%%%%
2755G7%%J%j%%%%%%%%%%%%%%J%%%%j%%%%%%%%%%%%%J%%j%J%%%%%%%%%%%%%%%%%%J%%%%%%%
2747G9j%%%%J%%%%%%Jj%J%%%J%J%%%%J%%JJKJKLKLLLKLLKJJJ%jjkllklllkkkkjkjj%%%jJ%
2740H3j%%j%%%%%%%%%%jJ%%%j%%%%%%j%%jJ%%%%%%J%%%%%j%j%%J%%%%%%%j%%J%J%%%%%%%%
2733H0%%%%%%%%%%%%%%%%%%J%%%%%%%%%%%%%%%%jJ%%j%%%%%%%%%%J%%%Jj%%%%%%j%%J%%%%
2725H1%%j%%%%J%%%%%%%j%%%J%%%%%%%%%%%%J%%%%%j%%%%%%J%%%%%%%J%j%%%%J%%j%jJ%%%
$$ plain form
2777 74 74 74 74 75 75 75 75 74 74 75 75 76 76 76 76 76 76 77 77 77 77 78 78 79 79 80 81 81 82 83 83 84 84 85 85 85 86 86 85 85 85 84 84 83 83 83 82 82 82 81 80 79 79 79 78 78 78 78 77 77 76 76 75 75 76 75 75 75 75 75
2770 75 75 75 75 75 75 75 75 75 75 75 75 75 75 75 76 76 76 76 76 76 76 76 76 76 76 76 76 76 76 76 76 76 76 76 76 76 75 75 75 75 76 76 76 76 76 76 76 76 76 76 76 76 76 76 76 76 76 76 76 75 76 76 76 77 77 77 77 77 77 77
2762 77 77 77 77 77 77 77 77 77 77 77 77 78 78 78 78 78 78 78 78 79 79 80 80 81 81 81 82 82 82 82 82 82 81 81 81 81 81 80 80 79 79 79 78 78 78 78 77 77 78 78 78 77 77 77 77 77 77 77 77 77 77 77 77 77 77 77 77 77 77 77
2755 77 77 77 78 78 77 77 77 77 77 77 77 77 77 77 77 77 77 77 77 78 78 78 78 78 77 77 77 77 77 77 77 77 77 77 77 77 77 77 78 78 78 77 77 78 78 78 78 78 78 78 78 78 78 78 78 78 78 78 78 78 78 78 79 79 79 79 79 79 79 79
2747 79 78 78 78 78 78 79 79 79 79 79 79 79 80 79 79 80 80 80 80 81 81 82 82 82 82 82 83 83 83 84 85 87 88 90 93 95 98 101 104 106 109 112 114 115 116 117 117 116 115 113 110 107 105 102 99 96 94 92 90 88 87 85 84 83 83 83 83 82 83 83
2740 83 82 82 82 81 81 81 81 81 81 81 81 81 81 81 80 81 81 81 81 80 80 80 80 80 80 80 79 79 79 78 79 79 79 79 79 79 79 80 80 80 80 80 80 79 79 78 78 78 79 79 79 79 79 79 79 79 78 78 78 79 79 80 80 80 80 80 80 80 80 80
2733 80 80 80 80 80 80 80 80 80 80 80 80 80 80 80 80 80 80 80 81 81 81 81 81 81 81 81 81 81 81 81 81 81 81 81 81 80 81 81 81 80 80 80 80 80 80 80 80 80 80 80 81 81 81 81 82 81 81 81 81 81 81 81 80 80 80 81 81 81 81 81
2725 81 81 81 80 80 80 80 80 81 81 81 81 81 81 81 81 80 80 80 80 81 81 81 81 81 81 81 81 81 81 81 81 81 82 82 82 82 82 82 81 81 81 81 81 81 81 82 82 82 82 82 82 82 82 83 83 82 82 82 82 82 83 83 83 82 82 81 82 82 82 82
2718H2J%%%%%j%J%Jj%%%%%%%%%%j%Jj%%%%%%%%%J%%%%%J%%%%j%%%%%%%%%%%%%%%%%%%%%J%
2710H4%%%%%%%%%Jj%%%%jJJ%%%%%%%%%%%j%%J%j%%%J%J%%%%%%%jJ%Jj%J%J%%J%%%%%%j%%%
2703H8%%%%jj%%J%j%%%%%%%J%%%%%%%%%%%%%%%j%%J%%%%%%%%%%%%%%%%%J%%%%%%%%%%%J%%
2696H9%%%J%%%%%%%%%j%%J%%Jj%jJ%%%%J%%%%%%%%%%%%%J%%%%J%%%%%%%%%%J%%%%%J%J%J%
2688I7%%%%J%%J%%%J%J%%JJ%%JJJ%JJ%KJJJJJJJJKKKKKKKLKLLMMMMNONPOPPQQPQQPPONNLK
2681B76%jklmonopqpqqpqpoonnnmmllmklkjkkkjjjjjjj%j%%%%jj%j%jj%jjjj%jj%j%%%%%%
2673A10%%%%%%%%%%%%%%%%%%%J%%%%J%%%%%%%%%%J%%%J%J%%J%%%J%%J%%%J%JJ%j%%Jj%%%%
2666A20%%j%j%j%jjjj%j%jjj%%j%j%%%%%J%J%JJJJJJ%JJJ%J%%J%J%J%%%%%J%%J%j%%%%%%%
$$ plain form
2718 82 83 83 83 83 83 83 82 82 83 83 84 83 83 83 83 83 83 83 83 83 83 83 82 82 83 82 82 82 82 82 82 82 82 82 82 83 83 83 83 83 83 84 84 84 84 84 83 83 83 83 83 83 83 83 83 83 83 83 83 83 83 83 83 83 83 83 83 83 84 84
2710 84 84 84 84 84 84 84 84 84 84 85 84 84 84 84 84 83 84 85 85 85 85 85 85 85 85 85 85 85 85 84 84 84 85 85 84 84 84 84 85 85 86 86 86 86 86 86 86 86 85 86 86 87 86 86 87 87 88 88 88 89 89 89 89 89 89 89 88 88 88 88
2703 88 88 88 88 88 87 86 86 86 87 87 86 86 86 86 86 86 86 86 87 87 87 87 87 87 87 87 87 87 87 87 87 87 87 87 86 86 86 87 87 87 87 87 87 87 87 87 87 87 87 87 87 87 87 87 87 88 88 88 88 88 88 88 88 88 88 88 88 89 89 89
2696 89 89 89 89 90 90 90 90 90 90 90 90 90 90 89 89 89 90 90 90 91 90 90 89 90 90 90 90 90 91 91 91 91 91 91 91 91 91 91 91 91 91 91 92 92 92 92 92 93 93 93 93 93 93 93 93 93 93 93 94 94 94 94 94 94 95 95 96 96 97 97
2688 97 97 97 97 97 98 98 98 99 99 99 99 100 100 101 101 101 102 103 103 103 104 105 106 106 107 108 108 110 111 112 113 114 115 116 117 118 120 122 124 126 128 130 132 135 137 140 143 147 151 155 159 164 170 175 182 188 195 202 210 218 225 233 241 248 255 261 266 271 274 276
2681 276 276 275 273 270 266 260 255 249 242 234 227 219 211 204 196 189 183 177 172 167 162 158 154 151 148 144 142 139 137 136 134 132 130 129 128 127 126 125 124 123 123 122 122 122 122 122 121 120 120 119 119 118 117 117 116 115 114 113 113 112 111 111 110 110 110 110 110 110 110
2673 110 110 110 110 110 110 110 110 110 110 110 110 110 110 110 110 110 110 110 110 111 111 111 111 111 112 112 112 112 112 112 112 112 112 112 112 113 113 113 113 114 114 115 115 115 116 116 116 116 117 117 117 118 118 118 118 119 119 120 121 121 120 120 120 121 120 120 120 120 120
2666 120 120 120 119 119 118 118 117 117 116 115 114 113 113 112 112 111 110 109 109 109 108 108 107 107 107 107 107 107 108 108 109 109 110 111 112 113 114 115 115 116 117 118 118 119 119 119 120 120 121 121 122 122 122 122 122 122 123 123 123 124 124 123 123 123 123 123 123 123 123
2659A23J%J%%%j%%%J%j%%%%%%%%J%%JJ%%%J%%J%J%%J%JJ%%J%J%J%JJ%JJJJJJJJ%J%KJ%J%J
2651A52%J%JJ%%J%%jJ%%%JJ%%%%%%%%%%%J%%%JJJJJJJJKKJKJKJKJKJKKJKKKKJJJJJ%JJ%%J
2644B05%J%J%JJJJ%KJKKKKKKLLMMOOQJ0J2J5J9K4K9L3M0M4N0N3N4N4N1M5L7K8J7Mqk1l0l9
2639G81m5m9n0m9m6m2l8l2k7k2j8j3j0pnlkk%%%JJJKJJKJJ%JJJ%JJJJJKKLLLMNNOOOOPOON
2633D15ONNLLKJ%%klmmnnnonnonnmklkk%%JKLMMMNOOOQPQRRJ0J0J2J2J2J3J3J4J4J5J6J7J6
2627F23J7J8J8J8J9J9K0K0K0K1K1K3K2K4K3K5K6K7K9K9L2L3L4L6L8L9M2M3M6M8N0N2N6N8O1
2623A730O4O7P2P5P9Q4Q9R5J01J07J15J23J31J41J51J61J73J84J97K11K24K39K55K72K89L09
2621E738L28L52L75M03M33M67N05N47N94O47P04P67Q35R08R84J061J137J210J275J331J370
$$ plain form
2659 123 124 124 125 125 125 125 124 124 124 124 125 125 124 124 124 124 124 124 124 124 124 125 125 125 126 127 127 127 127 128 128 128 129 129 130 130 130 131 131 132 133 133 133 134 134 135 135 136 136 137 138 138 139 140 141 142 143 144 145 146 146 147 147 149 150 150 151 151 152
2651 152 152 153 153 154 155 155 155 156 156 156 155 156 156 156 156 157 158 158 158 158 158 158 158 158 158 158 158 158 159 159 159 159 160 161 162 163 164 165 166 167 169 171 172 174 175 177 178 180 181 183 184 186 188 189 191 193 195 197 198 199 200 201 202 202 203 204 204 204 205
2644 205 205 206 206 207 207 208 209 210 211 211 213 214 216 218 220 222 224 226 229 232 236 240 246 252 260 270 282 297 316 340 369 402 442 486 536 589 643 697 748 793 830 858 875 879 871 850 820 781
2639 781 736 687 637 588 542 500 462 430 403 381 363 350 340 333 328 325 323 321 321 321 321 322 323 324 326 327 328 330 331 332 332 333 334 335 335 336 337 338 339 340 342 344 347 350 353 357 362 367 373 379 385 391 398 404 410 415
2633 415 421 426 431 434 437 439 440 440 440 438 435 431 427 422 417 412 406 401 396 390 385 380 376 374 371 369 367 367 367 368 370 373 377 381 385 390 396 402 408 416 423 431 440 449 459 469 481 493 505 518 531 545 559 574 590 607 623
2627 623 640 658 676 694 713 732 752 772 792 813 834 857 879 903 926 951 977 1004 1033 1062 1094 1127 1161 1197 1235 1274 1316 1359 1405 1453 1503 1555 1611 1669 1730
2623 1730 1794 1861 1933 2008 2087 2171 2260 2355 2456 2563 2678 2801 2932 3073 3224 3385 3558 3742 3939 4150 4374 4613 4868 5140 5429 5738
2621 5738 6066 6418 6793 7196 7629 8096 8601 9148 9742 10389 11093 11860 12695 13603 14587 15648 16785 17995 19270 20601 21971
2618B1971J391J390J363J308J223J110R69Q05O18M16K03j5k30m40o36q15r71j104j210j288
2616B6058j341j366j370j350j313j263j200j131j058r83r08q36p67p02o43n89n39m95m54m19
2614G331l87l58l32l10k89k71k54k39k25k12k00j89j79j70j60j52j43j34j28j21j14j08j01
2612B555r6r1q5q0p6p1o8o4o0n7n4n1m8m7m4m2m0l9l6l6l3l3l0l0k9k6k6k5k3k3k2k0k0j8
2608A012j8j7j5j6j4j4j3j2j2j2j0j1j0j0j0rrrj0rqj0rqrqpqpppoooopopqj0rj1j2j3j4j6
2603E47j7j7j9j8j8j9j8j7j6j5j4j3j1j0qpnmlkjjj%j%jkjllmlnmnonnnmllllkkjjkjjjj%
2597B12%j%jjj%jjkjjj%%jjj%j%%%%%%%j%%j%jjjjjjjjjjjjjjkkjkkkkklkkllllllklklkl
2590A26kkkkjjjj%%j%%j%%%J%%JJ%J%JJ%J%%%%j%j%j%jjjjjjjjjjjjjj%jjj%jj%j%%%%j%%
$$ plain form
2618 21971 23362 24752 26115 27423 28646 29756 30725 31530 32148 32564 32767 32752 32522 32082 31446 30631 29660 28556 27346 26058
2616 26058 24717 23351 21981 20631 19318 18055 16855 15724 14666 13683 12775 11939 11172 10470 9827 9238 8699 8204 7750 7331
2614 7331 6944 6586 6254 5944 5655 5384 5130 4891 4666 4454 4254 4065 3886 3716 3556 3404 3261 3127 2999 2878 2764 2656 2555
2612 2555 2459 2368 2283 2203 2127 2056 1988 1924 1864 1807 1753 1702 1654 1607 1563 1521 1481 1442 1406 1370 1337 1304 1274 1244 1215 1189 1163 1138 1115 1092 1070 1050 1030 1012
2608 1012 994 977 962 946 932 918 905 893 881 869 859 848 838 828 818 809 800 791 781 772 764 754 745 737 728 720 713 705 698 691 684 678 672 666 660 653 647 640 632 622 613 602 590 577 563 547
2603 547 530 513 494 476 458 439 421 404 388 373 359 346 335 325 317 310 305 301 298 296 295 294 293 293 292 292 291 289 288 285 282 278 275 270 266 261 255 250 245 240 236 233 230 227 224 222 220 219 218 216 215 214 213 212 212
2597 212 212 211 211 210 209 208 208 207 206 204 203 202 201 201 201 200 199 198 198 197 197 197 197 197 197 197 197 196 196 196 195 195 194 193 192 191 190 189 188 187 186 185 184 183 182 181 179 177 176 174 172 170 168 166 163 161 159 156 153 150 147 144 141 139 136 134 131 129 126
2590 126 124 122 120 118 117 116 115 114 114 114 113 113 113 112 112 112 112 113 113 113 114 115 115 116 116 117 118 118 119 119 119 119 119 118 118 117 117 116 116 115 114 113 112 111 110 109 108 107 106 105 104 103 102 102 101 100 99 99 98 97 97 96 96 96 96 96 95 95 95
2583I5%%%%%%J%%J%%%J%%J%J%J%J%j%%%%%%%%%%%j%%%%j%%%j%%j%%j%%j%%%j%%j%%%%j%j%
2575I1%j%%%%%%%%%%%%%%J%%J%J%J%%%JJ%J%J%J%J%J%%%%%%jjjjjkjkjkkjjjjjkj%j%j%%%
2568G6%JJ%j%J%%J%J%%J%J%%%J%%J%%%%%%j%%j%j%%%%%j%%%%%%%%%%%%%%J%%%%j%J%%J%%%
2561H2J%%j%%J%%J%%%%%JJ%%%%%JJ%J%%J%%%%%J%%%%%JJ%JJJJJJJJJKJKKKKKLLLMLMMMNNN
2553A58NOPPPQQQQPPOOMLJJ%klmnooqpqqpqppooonmnlmmmklklkkkkjjjkjjj%j%jj%%jj%jj
2546I1%jj%j%j%%jj%j%%%j%%j%j%j%%%%%j%%%%%%%%j%Jj%%Jj%%jJ%%%%%%%%J%j%%%%%%%%%
2538G8%%%%%J%%j%%j%j%%%%%%%j%J%%j%%%%%%%%%%%%j%%%%%%%%%%%%%%%%%%%%%%%%%%%%%%
2531G4%J%%%%%%%%%%%j%%%%%jJ%j%%%%J%j%%%%%%%%%%%j%%J%%%%%%%%%%%%%%%%%%%%%j%%J
$$ plain form
2583 95 95 95 95 95 95 95 96 96 96 97 97 97 97 98 98 98 99 99 100 100 101 101 102 102 101 101 101 101 101 101 101 101 101 101 101 101 100 100 100 100 100 99 99 99 99 98 98 98 97 97 97 96 96 96 95 95 95 95 94 94 94 93 93 93 93 93 92 92 91 91
2575 91 91 90 90 90 90 90 90 90 90 90 90 90 90 90 90 90 91 91 91 92 92 93 93 94 94 94 94 95 96 96 97 97 98 98 99 99 100 100 101 101 101 101 101 101 101 100 99 98 97 96 94 93 91 90 88 86 85 84 83 82 81 79 78 78 77 77 76 76 76 76
2568 76 76 77 78 78 77 77 78 78 78 79 79 80 80 80 81 81 82 82 82 82 83 83 83 84 84 84 84 84 84 84 83 83 83 82 82 81 81 81 81 81 81 80 80 80 80 80 80 80 80 80 80 80 80 80 80 80 81 81 81 81 81 80 80 81 81 81 82 82 82 82
2561 82 83 83 83 82 82 82 83 83 83 84 84 84 84 84 84 85 86 86 86 86 86 86 87 88 88 89 89 89 90 90 90 90 90 90 91 91 91 91 91 91 92 93 93 94 95 96 97 98 99 100 101 102 104 105 107 109 111 113 115 118 121 124 128 131 135 139 143 148 153 158
2553 158 163 169 176 183 190 198 206 214 222 229 236 242 248 252 255 256 257 257 255 252 248 243 237 231 223 216 208 200 193 185 178 171 165 159 153 148 144 139 136 132 128 124 122 119 117 114 112 110 108 106 105 104 103 101 100 99 98 98 97 97 96 95 95 95 94 93 93 92 91
2546 91 91 90 89 89 88 88 87 87 87 86 85 85 84 84 84 84 83 83 83 82 82 81 81 80 80 80 80 80 80 79 79 79 79 79 79 79 79 79 78 78 79 78 78 78 79 78 78 78 77 78 78 78 78 78 78 78 78 78 79 79 78 78 78 78 78 78 78 78 78 78
2538 78 78 78 78 78 78 79 79 79 78 78 78 77 77 76 76 76 76 76 76 76 76 75 75 76 76 76 75 75 75 75 75 75 75 75 75 75 75 75 75 74 74 74 74 74 74 74 74 74 74 74 74 74 74 74 74 74 74 74 74 74 74 74 74 74 74 74 74 74 74 74
2531 74 74 75 75 75 75 75 75 75 75 75 75 75 75 74 74 74 74 74 74 73 74 74 73 73 73 73 73 74 74 73 73 73 73 73 73 73 73 73 73 73 73 72 72 72 73 73 73 73 73 73 73 73 73 73 73 73 73 73 73 73 73 73 73 73 73 73 72 72 72 73
2524G3%%%%%%%%%%%j%J%%%%%%%%%%%%%%%%%%%%%%%j%J%%j%%%%j%Jj%%J%%jJ%%%%%%%%%J%j
2516G2%%%%%%%%%%J%%%%j%%%%%%jJ%%%%%%%%%%%%%%%j%%%%%J%%J%j%%%%%%%%%J%%%%%%j%%
2509G2%%j%%j%J%%Jj%%%%%%%%%%%j%J%%%%%%%%%%%J%%%%%J%%%%%j%%%%%%%%j%%%j%%%%j%%
2501F9J%%%%%%%%%Jj%%%%%%%%%%%Jj%%J%%%j%%%%%%J%%%j%%%%%J%j%%%%%%%%%%%%%%%%%%%
2494G0%%%%%%%%%j%JJ%%jJj%%%%%%%%%%%%%%%J%%%%%%%%%%%%%%%%%%j%%%%%%%%%%%%%%%%%
2487G0%%%%%j%%%%%J%%%%%%%j%%%%%%%%%%%%%%%%%%%%%%%%%%%%%%%%%%%j%%%J%%%%%%j%%%
2479F8%%%%%J%%%%%%%%%%%%%%%%j%%%Jj%%%%%%%%%J%%%%j%%%%%%%%J%%%j%%J%%%%%%%%%%%
2472F9j%%J%%%j%%%%%%%%%%%%%%J%%j%%%%J%%%%%%%%%jJ%%%%%%%%%J%j%%%%%%%%j%%%%J%%
$$ plain form
2524 73 73 73 73 73 73 73 73 73 73 73 73 72 72 73 73 73 73 73 73 73 73 73 73 73 73 73 73 73 73 73 73 73 73 73 73 73 73 72 72 73 73 73 72 72 72 72 72 71 71 72 71 71 71 72 72 72 71 72 72 72 72 72 72 72 72 72 72 73 73 72
2516 72 72 72 72 72 72 72 72 72 72 72 73 73 73 73 73 72 72 72 72 72 72 72 71 72 72 72 72 72 72 72 72 72 72 72 72 72 72 72 72 71 71 71 71 71 71 72 72 72 73 73 72 72 72 72 72 72 72 72 72 72 73 73 73 73 73 73 73 72 72 72
2509 72 72 72 71 71 71 70 70 71 71 71 72 71 71 71 71 71 71 71 71 71 71 71 71 70 70 71 71 71 71 71 71 71 71 71 71 71 71 72 72 72 72 72 72 73 73 73 73 73 73 72 72 72 72 72 72 72 72 72 71 71 71 71 70 70 70 70 70 69 69 69
2501 69 70 70 70 70 70 70 70 70 70 70 71 70 70 70 70 70 70 70 70 70 70 70 70 71 70 70 70 71 71 71 71 70 70 70 70 70 70 70 71 71 71 71 70 70 70 70 70 70 71 71 70 70 70 70 70 70 70 70 70 70 70 70 70 70 70 70 70 70 70 70
2494 70 70 70 70 70 70 70 70 70 70 69 69 70 71 71 71 70 71 70 70 70 70 70 70 70 70 70 70 70 70 70 70 70 70 71 71 71 71 71 71 71 71 71 71 71 71 71 71 71 71 71 71 71 70 70 70 70 70 70 70 70 70 70 70 70 70 70 70 70 70 70
2487 70 70 70 70 70 70 69 69 69 69 69 69 70 70 70 70 70 70 70 70 69 69 69 69 69 69 69 69 69 69 69 69 69 69 69 69 69 69 69 69 69 69 69 69 69 69 69 69 69 69 69 69 69 69 69 69 68 68 68 68 69 69 69 69 69 69 69 68 68 68 68
2479 68 68 68 68 68 68 69 69 69 69 69 69 69 69 69 69 69 69 69 69 69 69 69 68 68 68 68 69 68 68 68 68 68 68 68 68 68 68 69 69 69 69 69 68 68 68 68 68 68 68 68 68 69 69 69 69 68 68 68 69 69 69 69 69 69 69 69 69 69 69 69
2472 69 68 68 68 69 69 69 69 68 68 68 68 68 68 68 68 68 68 68 68 68 68 68 69 69 69 68 68 68 68 68 69 69 69 69 69 69 69 69 69 69 68 69 69 69 69 69 69 69 69 69 69 70 70 69 69 69 69 69 69 69 69 69 68 68 68 68 68 69 69 69
2464F9%%%%%%Jj%%j%%%Jj%%%%%%%%J%%%%%%%%%%%%%%%%%%%%%%%%J%j%J%%%%jJ%%%%%%%%%%
2457G0%%%%%j%%%%%%%%%%j%%%%%%J%jJ%j%%%%%%%%%%%%%%J%%%%%%%%%%%%%%%%jJ%%%%%%J%
2449G0%%j%%%%%%%%%Jj%%%%%%j%%%%%%%%J%%%%%%%j%%%%%%%%J%%%%%%%jJ%%%J%%%%%%%%%%
2442G0%%%%%%%j%%%%%%%%%%%J%j%%%%jJ%Jj%%%%%%%%%%j%J%%%%%%%%%%%J%%%%%%%%%%J%JJ
2435G3%j%%%%%j%%j%%j%Jj%%%%%j%%%%%%%%%%%%%%%%%%%%%%%%%%%J%%j%j%J%%%%%%%%%%%%
2427F8%%Jj%%%%%j%J%J%%%%%%%%%j%%%%j%J%%%%%%%%%%%%%%%j%%%%%%%%%J%%j%%J%%J%j%%
2420F8%J%j%%%J%%%jJ%j%%%%%%%%%%%%%%%%j%%%%J%%%%%%%j%%%J%%%%%%%%%%%%%J%%%%%%%
2412F9%%j%J%%%%%%%%%%%%%%%%%%%j%%JJ%%jJjJ%%j%%%J%%%%%%%j%%%%%%%%J%%j%J%%%j%J
$$ plain form
2464 69 69 69 69 69 69 69 70 69 69 69 68 68 68 68 69 68 68 68 68 68 68 68 68 68 69 69 69 69 69 69 69 69 69 69 69 69 69 69 69 69 69 69 69 69 69 69 69 69 69 70 70 69 69 70 70 70 70 70 69 70 70 70 70 70 70 70 70 70 70 70
2457 70 70 70 70 70 70 69 69 69 69 69 69 69 69 69 69 69 68 68 68 68 68 68 68 69 69 68 69 69 68 68 68 68 68 68 68 68 68 68 68 68 68 68 68 69 69 69 69 69 69 69 69 69 69 69 69 69 69 69 69 69 68 69 69 69 69 69 69 69 70 70
2449 70 70 70 69 69 69 69 69 69 69 69 69 69 70 69 69 69 69 69 69 69 68 68 68 68 68 68 68 68 68 69 69 69 69 69 69 69 69 68 68 68 68 68 68 68 68 68 69 69 69 69 69 69 69 69 68 69 69 69 69 70 70 70 70 70 70 70 70 70 70 70
2442 70 70 70 70 70 70 70 70 69 69 69 69 69 69 69 69 69 69 69 69 70 70 69 69 69 69 69 68 69 69 70 69 69 69 69 69 69 69 69 69 69 69 68 68 69 69 69 69 69 69 69 69 69 69 69 69 70 70 70 70 70 70 70 70 70 70 70 71 71 72 73
2435 73 73 72 72 72 72 72 72 71 71 71 70 70 70 69 69 70 69 69 69 69 69 69 68 68 68 68 68 68 68 68 68 68 68 68 68 68 68 68 68 68 68 68 68 68 68 68 68 68 68 68 69 69 69 68 68 67 67 68 68 68 68 68 68 68 68 68 68 68 68 68
2427 68 68 68 69 68 68 68 68 68 68 67 67 68 68 69 69 69 69 69 69 69 69 69 69 68 68 68 68 68 67 67 68 68 68 68 68 68 68 68 68 68 68 68 68 68 68 68 67 67 67 67 67 67 67 67 67 67 68 68 68 67 67 67 68 68 68 69 69 68 68 68
2420 68 68 69 69 68 68 68 68 69 69 69 69 68 69 69 68 68 68 68 68 68 68 68 68 68 68 68 68 68 68 68 68 67 67 67 67 67 68 68 68 68 68 68 68 68 67 67 67 67 68 68 68 68 68 68 68 68 68 68 68 68 68 68 69 69 69 69 69 69 69 69
2412 69 69 69 68 68 69 69 69 69 69 69 69 69 69 69 69 69 69 69 69 69 69 69 69 69 68 68 68 69 70 70 70 69 70 69 70 70 70 69 69 69 69 70 70 70 70 70 70 70 70 69 69 69 69 69 69 69 69 69 70 70 70 69 69 70 70 70 70 69 69 70
2405G0%%%%%j%%%%J%j%%%%%%j%J%%%%J%%%%j%J%%%%%%%j%%%%%%%%%%%%J%%%%%%j%%%%%%%%
2397F9J%%%%%%j%%J%%%%%%jJ%%j%%%%J%%%%%%%%j%%%%%%%J%%%%%%%%%j%%%%%%J%j%%%%%%%
2390F9%J%%%j%%%J%%%j%J%%%%%%%%%%J%%j%%%%%%%%J%%%%j%%%%%%J%j%%%j%J%%%%jJ%%%%%
2383G0%%%J%%%%%%jJ%%%%%j%%%%%%%%%%%%%%%jJ%j%%%Jj%%%J%%%%%%%%J%%%jJ%%%%%%%j%%
2375G0%%%%%%%%%%%%J%%%j%J%%%%j%%%%%%J%j%%%%J%%%%j%%jJ%%%%%%%j%%J%J%%%j%%%%%%
2368G0%Jj%%%%%%J%%%%%%%%%%%%j%%%%%%%%J%%%%%%%j%j%%Jj%%Jj%j%%J%%jJ%%%%%J%%jJ%
2360G0%%%%%%J%j%%%%%%%%%%jJ%%%jJ%%%%%%%%%%%%j%%%%%%%%%%%%%%%%%%%J%%j%J%%%%%%
2353G0%%%%%%%%%%%%j%J%%%%%%%%%%%%%%%%%%%%%%%%%%%%%%j%%%J%j%%%%%%%%%%%%%%%%%%
$$ plain form
2405 70 70 70 70 70 70 69 69 69 69 69 70 70 69 69 69 69 69 69 69 68 68 69 69 69 69 69 70 70 70 70 70 69 69 70 70 70 70 70 70 70 70 69 69 69 69 69 69 69 69 69 69 69 69 69 70 70 70 70 70 70 70 69 69 69 69 69 69 69 69 69
2397 69 70 70 70 70 70 70 70 69 69 69 70 70 70 70 70 70 70 69 70 70 70 69 69 69 69 69 70 70 70 70 70 70 70 70 70 69 69 69 69 69 69 69 69 70 70 70 70 70 70 70 70 70 70 69 69 69 69 69 69 69 70 70 69 69 69 69 69 69 69 69
2390 69 69 70 70 70 70 69 69 69 69 70 70 70 70 69 69 70 70 70 70 70 70 70 70 70 70 70 71 71 71 70 70 70 70 70 70 70 70 70 71 71 71 71 71 70 70 70 70 70 70 70 71 71 70 70 70 70 69 69 70 70 70 70 70 69 70 70 70 70 70 70
2383 70 70 70 70 71 71 71 71 71 71 71 70 71 71 71 71 71 71 70 70 70 70 70 70 70 70 70 70 70 70 70 70 70 70 69 70 70 69 69 69 69 70 69 69 69 69 70 70 70 70 70 70 70 70 70 71 71 71 71 70 71 71 71 71 71 71 71 71 70 70 70
2375 70 70 70 70 70 70 70 70 70 70 70 70 70 71 71 71 71 70 70 71 71 71 71 71 70 70 70 70 70 70 70 71 71 70 70 70 70 70 71 71 71 71 71 70 70 70 69 70 70 70 70 70 70 70 70 69 69 69 70 70 71 71 71 71 70 70 70 70 70 70 70
2368 70 70 71 70 70 70 70 70 70 70 71 71 71 71 71 71 71 71 71 71 71 71 71 70 70 70 70 70 70 70 70 70 71 71 71 71 71 71 71 71 70 70 69 69 69 70 69 69 69 70 69 69 68 68 68 69 69 69 68 69 69 69 69 69 69 70 70 70 69 70 70
2360 70 70 70 70 70 70 70 71 71 70 70 70 70 70 70 70 70 70 70 70 69 70 70 70 70 69 70 70 70 70 70 70 70 70 70 70 70 70 70 69 69 69 69 69 69 69 69 69 69 69 69 69 69 69 69 69 69 69 69 70 70 70 69 69 70 70 70 70 70 70 70
2353 70 70 70 70 70 70 70 70 70 70 70 70 70 69 69 70 70 70 70 70 70 70 70 70 70 70 70 70 70 70 70 70 70 70 70 70 70 70 70 70 70 70 70 70 70 70 69 69 69 69 70 70 69 69 69 69 69 69 69 69 69 69 69 69 69 69 69 69 69 69 69
2346F9%%%J%%%%%jJ%%%%%%%%%%%%%jJ%%%J%%%%%%%%%%%j%%%%%%%%%%jJ%%Jj%%%%jJ%%%%%J
2338G1%%j%%%%%j%J%%%%%J%j%%%%%%%%%%%%%%J%j%%%%J%%%%j%J%%%%%%%%%%%%%%%%%%%%%%
2331G1%%%%J%j%%J%%%%%%%%%j%%%%%%J%j%%J%%%%%%%%%j%%%%Jj%%%%%%J%%%%%%%%%%%%j%%
2323G1J%%%%%%%%%%%%%%%%j%%%%%%%%%%%%%Jj%%%J%%%%j%%%%%%%%%J%%%%%%%%%%%%%%%%%%
2316G2%%%%%j%%%%J%%j%%%%%%%%%%%%J%%%%%%%%%%%%%%%%%%j%%%%J%%%%%%%%%%%j%%%%%%J
2308G2j%%%%%J%%%%%j%J%%%%%%%%%J%%j%J%%%%%j%%%%%%%J%%%%%%%j%%%J%%%%%%%%%%%%%%
2301G3%%%%J%j%%%%%%%%%%%%%%%%%jJ%%%%%%%%%j%%%%%%%%%%%%%%%%%%Jj%%j%%J%%J%%%%%
2294G3%%%%%%%%%%%%%%J%%%%%%%%%%%%j%%%%%%J%%%%%j%%%%%%%j%%J%%%%%%%%%%%%%%%%%%
$$ plain form
2346 69 69 69 69 70 70 70 70 70 70 69 70 70 70 70 70 70 70 70 70 70 70 70 70 70 69 70 70 70 70 71 71 71 71 71 71 71 71 71 71 71 71 70 70 70 70 70 70 70 70 70 70 70 69 70 70 70 71 70 70 70 70 70 69 70 70 70 70 70 70 71
2338 71 71 71 70 70 70 70 70 70 69 69 70 70 70 70 70 70 71 71 70 70 70 70 70 70 70 70 70 70 70 70 70 70 70 71 71 70 70 70 70 70 71 71 71 71 71 70 70 71 71 71 71 71 71 71 71 71 71 71 71 71 71 71 71 71 71 71 71 71 71 71
2331 71 71 71 71 71 72 72 71 71 71 72 72 72 72 72 72 72 72 72 72 71 71 71 71 71 71 71 72 72 71 71 71 72 72 72 72 72 72 72 72 72 72 71 71 71 71 71 72 71 71 71 71 71 71 71 72 72 72 72 72 72 72 72 72 72 72 72 72 71 71 71
2323 71 72 72 72 72 72 72 72 72 72 72 72 72 72 72 72 72 72 71 71 71 71 71 71 71 71 71 71 71 71 71 71 72 71 71 71 71 72 72 72 72 72 71 71 71 71 71 71 71 71 71 71 72 72 72 72 72 72 72 72 72 72 72 72 72 72 72 72 72 72 72
2316 72 72 72 72 72 72 71 71 71 71 71 72 72 72 71 71 71 71 71 71 71 71 71 71 71 71 71 72 72 72 72 72 72 72 72 72 72 72 72 72 72 72 72 72 72 72 71 71 71 71 71 72 72 72 72 72 72 72 72 72 72 72 72 71 71 71 71 71 71 71 72
2308 72 71 71 71 71 71 71 72 72 72 72 72 72 71 71 72 72 72 72 72 72 72 72 72 72 73 73 73 72 72 73 73 73 73 73 73 72 72 72 72 72 72 72 72 73 73 73 73 73 73 73 73 72 72 72 72 73 73 73 73 73 73 73 73 73 73 73 73 73 73 73
2301 73 73 73 73 73 74 74 73 73 73 73 73 73 73 73 73 73 73 73 73 73 73 73 73 73 72 73 73 73 73 73 73 73 73 73 73 72 72 72 72 72 72 72 72 72 72 72 72 72 72 72 72 72 72 72 73 72 72 72 71 71 71 72 72 72 73 73 73 73 73 73
2294 73 73 73 73 73 73 73 73 73 73 73 73 73 73 73 74 74 74 74 74 74 74 74 74 74 74 74 74 73 73 73 73 73 73 73 74 74 74 74 74 74 73 73 73 73 73 73 73 73 72 72 72 73 73 73 73 73 73 73 73 73 73 73 73 73 73 73 73 73 73 73
2286G3%%%%%%%%%%%%%%%%%%%%%j%%%J%J%%%%%j%%%%%%J%%j%%%j%J%%%%%%%%%%%%%%%%%%%J
2279G4j%%%%%%%%%%%%%Jj%%%%%J%%%%%%%%%%%j%%%%J%%%%%%%%%%%%%%%%%%%%J%%%%jj%%J%
2271G4%%%%%%%%%%j%%J%%%j%%%%%%%%j%%%%J%%%%%%%%%%%%%%%%%%%J%j%J%%j%%%%%%%%%%%
2264G3%%%%%%%%%j%J%j%%%%%%%%J%%%j%%%%%%%%j%J%%%%j%%%%J%%%%%%%%%%%%%%%%%J%%%%
2257G3%%%%%%%%%%%j%%%%J%%%%%%%jJ%jJ%%%%%j%%%%J%%%%%%%%%%Jj%%%%%%jJ%%J%%j%J%%
2249G4%j%%J%%%%J%%%%%%j%%%%%%%%%J%%%%%%%%%j%J%%%%J%jJ%%j%%%%%%%%%%J%Jj%%%%j%
2242G5%%J%%J%j%%J%%%%%%%%jJ%%%%%%%%j%%%%%J%%%%%%%%Jj%%%%%%%%%Jj%%%%%J%%j%%%%
2234G7%%J%%%j%%%J%%jJ%%%%%%%%%%%%%%%%%%%%%%%%%%%%%%%%%%%%%%%%%%%%%%%%%J%%jJ%
$$ plain form
2286 73 73 73 73 73 73 73 73 73 73 73 73 73 73 73 73 73 73 73 73 73 73 72 72 72 72 73 73 74 74 74 74 74 74 73 73 73 73 73 73 73 74 74 74 73 73 73 73 72 72 73 73 73 73 73 73 73 73 73 73 73 73 73 73 73 73 73 73 73 73 74
2279 74 73 73 73 73 73 73 73 73 73 73 73 73 73 73 74 73 73 73 73 73 73 74 74 74 74 74 74 74 74 74 74 74 74 73 73 73 73 73 74 74 74 74 74 74 74 74 74 74 74 74 74 74 74 74 74 74 74 74 74 75 75 75 75 75 74 73 73 73 74 74
2271 74 74 74 74 74 74 74 74 74 74 74 73 73 73 74 74 74 74 73 73 73 73 73 73 73 73 73 72 72 72 72 72 73 73 73 73 73 73 73 73 73 73 73 73 73 73 73 73 73 73 73 73 74 74 73 73 74 74 74 73 73 73 73 73 73 73 73 73 73 73 73
2264 73 73 73 73 73 73 73 73 73 73 72 72 73 73 72 72 72 72 72 72 72 72 72 73 73 73 73 72 72 72 72 72 72 72 72 72 71 71 72 72 72 72 72 71 71 71 71 71 72 72 72 72 72 72 72 72 72 72 72 72 72 72 72 72 72 72 73 73 73 73 73
2257 73 73 73 73 73 73 73 73 73 73 73 73 72 72 72 72 72 73 73 73 73 73 73 73 73 72 73 73 72 73 73 73 73 73 73 72 72 72 72 72 73 73 73 73 73 73 73 73 73 73 73 74 73 73 73 73 73 73 73 72 73 73 73 74 74 74 73 73 74 74 74
2249 74 74 73 73 73 74 74 74 74 74 75 75 75 75 75 75 75 74 74 74 74 74 74 74 74 74 74 75 75 75 75 75 75 75 75 75 75 74 74 75 75 75 75 75 76 76 75 76 76 76 75 75 75 75 75 75 75 75 75 75 75 76 76 77 76 76 76 76 76 75 75
2242 75 75 75 76 76 76 77 77 76 76 76 77 77 77 77 77 77 77 77 77 76 77 77 77 77 77 77 77 77 77 76 76 76 76 76 76 77 77 77 77 77 77 77 77 77 78 77 77 77 77 77 77 77 77 77 77 78 77 77 77 77 77 77 78 78 78 77 77 77 77 77
2234 77 77 77 78 78 78 78 77 77 77 77 78 78 78 77 78 78 78 78 78 78 78 78 78 78 78 78 78 78 78 78 78 78 78 78 78 78 78 78 78 78 78 78 78 78 78 78 78 78 78 78 78 78 78 78 78 78 78 78 78 78 78 78 78 78 79 79 79 78 79 79
2227G9%%%%%j%%%J%%%%%%J%%%%j%%%%%J%%J%%%%J%JKJJKKKK%%jjjjkkjkjjj%j%%%%%%%%%%
2219H0%%%%%%Jj%%J%%%j%%%%%jJ%%%%%%%%J%%j%%%%%%%%j%%J%%%%%%%%J%%j%%%%%%%J%%%j
2212H0%%J%%%jJ%%%%j%%%J%%%%%%%%%%%%%%%%%%%J%%%jJ%%j%J%%%%%j%%%%%%J%%%%%%%%%J
2205H3%j%%%%%%%%%%%J%%%j%%Jj%J%%%Jj%%%%%%%%%j%%%%%%%J%%%%%%%%%%j%J%J%%%j%%J%
2197H4j%%%%%J%%%%%%%%%%%%j%Jj%%%%%J%%%%J%%%%%%j%%%%J%%%%%%%%%%%%jJ%%j%%%%%%%
2190H4%%%%%%%%%J%%%%%%J%%%%%J%%%%%%j%%%J%%%%%%%%j%J%%%%%%%%%%%%%%%%%%%%%jJ%%
2182H7%%%%%%%j%%J%%%%%%%%%%%%%%J%J%%jJ%%%jJ%%%J%%J%%%%j%%%%%%%%J%%%%j%%%J%%%
2175I1%J%j%%%%%%%%%%%%Jj%%%%%J%%%%%%%J%j%%%%%%J%J%%%%j%%%J%%%%%%%%%%%%j%J%%J
$$ plain form
2227 79 79 79 79 79 79 78 78 78 78 79 79 79 79 79 79 79 80 80 80 80 80 79 79 79 79 79 79 80 80 80 81 81 81 81 81 82 82 83 85 86 87 89 91 93 95 95 95 94 93 92 91 89 87 86 84 83 82 81 81 80 80 80 80 80 80 80 80 80 80 80
2219 80 80 80 80 80 80 80 81 80 80 80 81 81 81 81 80 80 80 80 80 80 79 80 80 80 80 80 80 80 80 80 81 81 81 80 80 80 80 80 80 80 80 80 79 79 79 80 80 80 80 80 80 80 80 80 81 81 81 80 80 80 80 80 80 80 80 81 81 81 81 80
2212 80 80 80 81 81 81 81 80 81 81 81 81 81 80 80 80 80 81 81 81 81 81 81 81 81 81 81 81 81 81 81 81 81 81 81 81 81 82 82 82 82 81 82 82 82 81 81 82 82 82 82 82 82 81 81 81 81 81 81 81 82 82 82 82 82 82 82 82 82 82 83
2205 83 83 82 82 82 82 82 82 82 82 82 82 82 82 83 83 83 83 82 82 82 83 82 82 83 83 83 83 84 83 83 83 83 83 83 83 83 83 83 82 82 82 82 82 82 82 82 83 83 83 83 83 83 83 83 83 83 83 82 82 83 83 84 84 84 84 83 83 83 84 84
2197 84 83 83 83 83 83 83 84 84 84 84 84 84 84 84 84 84 84 84 84 83 83 84 83 83 83 83 83 83 84 84 84 84 84 85 85 85 85 85 85 85 84 84 84 84 84 85 85 85 85 85 85 85 85 85 85 85 85 85 84 85 85 85 84 84 84 84 84 84 84 84
2190 84 84 84 84 84 84 84 84 84 84 85 85 85 85 85 85 85 86 86 86 86 86 86 87 87 87 87 87 87 87 86 86 86 86 87 87 87 87 87 87 87 87 87 86 86 87 87 87 87 87 87 87 87 87 87 87 87 87 87 87 87 87 87 87 87 87 87 86 87 87 87
2182 87 87 87 87 87 87 87 87 86 86 86 87 87 87 87 87 87 87 87 87 87 87 87 87 87 87 88 88 89 89 89 88 89 89 89 89 88 89 89 89 89 90 90 90 91 91 91 91 91 90 90 90 90 90 90 90 90 90 91 91 91 91 91 90 90 90 90 91 91 91 91
2175 91 91 92 92 91 91 91 91 91 91 91 91 91 91 91 91 91 92 91 91 91 91 91 91 92 92 92 92 92 92 92 92 93 93 92 92 92 92 92 92 92 93 93 94 94 94 94 94 93 93 93 93 94 94 94 94 94 94 94 94 94 94 94 94 94 93 93 94 94 94 95
2168I5%%%%%jJ%%%Jj%%J%%j%%J%%%%%%%%%%%J%%%%%%%%%%%%%%%%%%j%%J%%%%j%%J%%%%%%%
2160I7%%%%%%Jj%%%%%J%%jJ%%J%%%%%%%%%%%%%J%J%%j%J%%J%j%j%%J%%%%%%%%%J%%%%%%%%
2153A02%%%%%%%%%%%%%%J%%%%%J%%j%%J%J%%J%%Jj%%%J%%%%%%%J%%%%%%%%%%%%%%%%%J%%%
2145A09%%%Jj%%J%%%%J%%%%%J%%%%%%J%%%%%%%%J%%%%J%%%%%%%%J%%%%J%%%%%%%%%%%J%%%
2138A18%%%%%J%%%%%%%%%%%J%%J%%%%%%%%%%%J%%%%%%%%J%%J%%%j%J%%J%%J%%%%%%%J%%%%
2131A27J%%%%%%%%J%%%%%%%%J%%%%%%%%J%%J%%j%%Jj%J%%%J%%%J%%%%%%J%J%j%J%%J%%%%%
2123A37%%J%J%J%J%%%%%%%%%%%J%%J%%%%%J%%%J%%%%J%J%%j%%J%%%%J%%%%%J%%J%%%%%J%%
2116A51%%J%%J%%%%J%%%%%J%%%JJ%%%%%%%J%jJ%%%%%J%%J%J%%%J%%J%%J%%J%%%%%J%%%J%%
$$ plain form
2168 95 95 95 95 95 95 94 95 95 95 95 96 95 95 95 96 96 96 95 95 95 96 96 96 96 96 96 96 96 96 96 96 96 97 97 97 97 97 97 97 97 97 97 97 97 97 97 97 97 97 97 97 96 96 96 97 97 97 97 97 96 96 96 97 97 97 97 97 97 97 97
2160 97 97 97 97 97 97 97 98 97 97 97 97 97 97 98 98 98 97 98 98 98 99 99 99 99 99 99 99 99 99 99 99 99 99 99 100 100 101 101 101 100 100 101 101 101 102 102 101 101 100 100 100 101 101 101 101 101 101 101 101 101 101 102 102 102 102 102 102 102 102 102
2153 102 102 102 102 102 102 102 102 102 102 102 102 102 102 102 103 103 103 103 103 103 104 104 104 103 103 103 104 104 105 105 105 106 106 106 107 106 106 106 106 107 107 107 107 107 107 107 107 108 108 108 108 108 108 108 108 108 108 108 108 108 108 108 108 108 108 109 109 109 109
2145 109 109 109 109 110 109 109 109 110 110 110 110 110 111 111 111 111 111 111 112 112 112 112 112 112 112 113 113 113 113 113 113 113 113 113 114 114 114 114 114 115 115 115 115 115 115 115 115 115 116 116 116 116 116 117 117 117 117 117 117 117 117 117 117 117 117 118 118 118 118
2138 118 118 118 118 118 118 119 119 119 119 119 119 119 119 119 119 119 119 120 120 120 121 121 121 121 121 121 121 121 121 121 121 121 122 122 122 122 122 122 122 122 122 123 123 123 124 124 124 124 123 123 124 124 124 125 125 125 126 126 126 126 126 126 126 126 127 127 127 127 127
2131 127 128 128 128 128 128 128 128 128 128 129 129 129 129 129 129 129 129 129 130 130 130 130 130 130 130 130 130 131 131 131 132 132 132 131 131 131 132 131 131 132 132 132 132 133 133 133 133 134 134 134 134 134 134 134 135 135 136 136 135 135 136 136 136 137 137 137 137 137 137
2123 137 137 137 138 138 139 139 140 140 141 141 141 141 141 141 141 141 141 141 141 141 142 142 142 143 143 143 143 143 143 144 144 144 144 145 145 145 145 145 146 146 147 147 147 146 146 146 147 147 147 147 147 148 148 148 148 148 148 149 149 149 150 150 150 150 150 150 151 151 151
2116 151 151 151 152 152 152 153 153 153 153 153 154 154 154 154 154 154 155 155 155 155 156 157 157 157 157 157 157 157 157 158 158 157 158 158 158 158 158 158 159 159 159 160 160 161 161 161 161 162 162 162 163 163 163 164 164 164 165 165 165 165 165 165 166 166 166 166 167 167 167
2109A67%%%%J%%J%J%J%%%%JjJ%J%%%%%%%J%%%J%J%%%%%%%%J%%%J%%J%%%%%%J%J%%%J%%J%%
2102A83%%%%%%J%%%%J%%%J%J%%J%J%J%%%%j%%J%%%J%J%%%J%%%%%J%%%%%J%%Jj%J%%%%J%%%
2094A97%J%%%%%J%%%%J%%%%%J%%%%J%%J%%%%%Jj%%Jj%J%%%%%%%J%%J%%%%%J%%%%%%%J%Jj%
2087B08%%%%%%%jJ%%%%J%%%%%J%%%%%%J%%%%%j%%J%%%%%%%%J%j%%%%%%%%%%jJ%%%%%%%%%%
2080B11%%%%%%%%j%J%%%%%%%%%%%%%%%%%%%%%%j%%%j%%%%%%jJ%%%%jJ%%j%%%%%%%%%%%%%%
2072B08%%j%%j%%%%%%j%%%%%%j%%%%%%%%%%%%j%j%%%%%%j%%%%%%j%%%%j%%%%j%%%j%%%%%j
2065A96%%%%j%j%%%%%Jj%%%j%%%%%j%%j%%%%%j%%%%%%j%%%j%j%%%j%%%j%%%j%%%%%%j%%%j
2058A82%%%j%%%%%%%%jj%%%%j%%%j%%%j%%%%%%jj%%j%%%%j%%%%%%jj%%j%%%%j%%%%%%%j%%
$$ plain form
2109 167 167 167 167 167 168 168 168 169 169 170 170 171 171 171 171 171 172 171 172 172 173 173 173 173 173 173 173 173 174 174 174 174 175 175 176 176 176 176 176 176 176 176 176 177 177 177 177 178 178 178 179 179 179 179 179 179 179 180 180 181 181 181 181 182 182 182 183 183 183
2102 183 183 183 183 183 183 183 184 184 184 184 184 185 185 185 185 186 186 187 187 187 188 188 189 189 190 190 190 190 190 189 189 189 190 190 190 190 191 191 192 192 192 192 193 193 193 193 193 193 194 194 194 194 194 194 195 195 195 196 195 195 196 196 196 196 196 197 197 197 197
2094 197 197 198 198 198 198 198 198 199 199 199 199 199 200 200 200 200 200 200 201 201 201 201 201 202 202 202 203 203 203 203 203 203 204 203 203 203 204 203 203 204 204 204 204 204 204 204 204 205 205 205 206 206 206 206 206 206 207 207 207 207 207 207 207 207 208 208 209 208 208
2087 208 208 208 208 208 208 208 208 207 208 208 208 208 208 209 209 209 209 209 209 210 210 210 210 210 210 210 211 211 211 211 211 211 210 210 210 211 211 211 211 211 211 211 211 211 212 212 211 211 211 211 211 211 211 211 211 211 211 210 211 211 211 211 211 211 211 211 211 211 211
2080 211 211 211 211 211 211 211 211 211 210 210 211 211 211 211 211 211 211 211 211 211 211 211 211 211 211 211 211 211 211 211 211 211 211 210 210 210 210 209 209 209 209 209 209 209 208 209 209 209 209 209 208 209 209 209 208 208 208 208 208 208 208 208 208 208 208 208 208 208 208
2072 208 208 208 207 207 207 206 206 206 206 206 206 206 205 205 205 205 205 205 205 204 204 204 204 204 204 204 204 204 204 204 204 204 203 203 202 202 202 202 202 202 202 201 201 201 201 201 201 201 200 200 200 200 200 199 199 199 199 199 198 198 198 198 197 197 197 197 197 197 196
2065 196 196 196 196 196 195 195 194 194 194 194 194 194 195 194 194 194 194 193 193 193 193 193 193 192 192 192 191 191 191 191 191 191 190 190 190 190 190 190 190 189 189 189 189 188 188 187 187 187 187 186 186 186 186 185 185 185 185 184 184 184 184 184 184 184 183 183 183 183 182
2058 182 182 182 182 181 181 181 181 181 181 181 181 181 180 179 179 179 179 179 178 178 178 178 177 177 177 177 176 176 176 176 176 176 176 175 174 174 174 173 173 173 173 173 172 172 172 172 172 172 172 171 170 170 170 169 169 169 169 169 168 168 168 168 168 168 168 168 167 167 167
2050A67%%%%j%j%j%%%%j%j%%Jj%%j%%%j%%%j%%%%%j%%%j%%%%j%%%jJ%%%j%j%j%%%%%j%%%%
2043A52%j%%j%%%%%%%j%%%j%j%%%%%j%%%%j%%%%%%j%%j%%%j%J%j%%j%%%j%%%%j%Jj%%%%j%
2036A38%%%%j%%%%%j%j%%%%%jJ%j%%%%%j%%j%%Jj%j%%%%%%%j%%j%J%%j%%%j%%%%j%%%%%j%
2028A26%%%%%%%j%%%%j%%%%%%j%%%%%j%%%%%%%%%%j%%%j%%%%%%%%%%j%%%%j%%%%j%%j%J%%
2021A17%%%j%%%%j%%%%%J%j%%j%%jJ%%%%%%j%%%%%%%%%%%%%%%%%%%J%J%%j%%%%jj%j%%j%%
2014A10%%%j%j%Jj%j%%%%%%%%%j%%%%%%J%%%%j%%J%%J%j%%%%J%%%%jJ%J%%%%%%%%j%j%j%%
2006A06%j%%j%%%%%%%%%j%%%%%j%%j%%%%j%%j%%%%%%%%%%%%%%%j%%%%%%J%j%J%%J%%%%J%%
1999A01%j%%%j%%%%j%jj%%%%%%%%j%%%j%%%j%%%%%%%%%%%%%j%%%%%j%%%%%J%j%%%%%j%%%j
$$ plain form
2050 167 167 167 167 167 166 166 165 165 164 164 164 164 164 163 163 162 162 162 163 162 162 162 161 161 161 161 160 160 160 160 159 159 159 159 159 159 158 158 158 158 157 157 157 157 157 156 156 156 156 155 156 156 156 156 155 155 154 154 153 153 153 153 153 153 152 152 152 152 152
2043 152 152 151 151 151 150 150 150 150 150 150 150 150 149 149 149 149 148 148 147 147 147 147 147 147 146 146 146 146 146 145 145 145 145 145 145 145 144 144 144 143 143 143 143 142 142 143 143 142 142 142 141 141 141 141 140 140 140 140 140 139 139 140 139 139 139 139 139 138 138
2036 138 138 138 138 138 137 137 137 137 137 137 136 136 135 135 135 135 135 135 134 135 135 134 134 134 134 134 134 133 133 133 132 132 132 133 132 132 131 131 131 131 131 131 131 131 130 130 130 129 129 130 130 130 129 129 129 129 128 128 128 128 128 127 127 127 127 127 127 126 126
2028 126 126 126 126 126 126 126 126 125 125 125 125 125 124 124 124 124 124 124 124 123 123 123 123 123 123 122 122 122 122 122 122 122 122 122 122 122 121 121 121 121 120 120 120 120 120 120 120 120 120 120 120 119 119 119 119 119 118 118 118 118 118 117 117 117 116 116 117 117 117
2021 117 117 117 117 116 116 116 116 116 115 115 115 115 115 115 116 116 115 115 115 114 114 114 113 114 114 114 114 114 114 114 113 113 113 113 113 113 113 113 113 113 113 113 113 113 113 113 113 113 113 113 114 114 115 115 115 114 114 114 114 114 113 112 112 111 111 111 110 110 110
2014 110 110 110 110 109 109 108 108 109 108 108 107 107 107 107 107 107 107 107 107 107 106 106 106 106 106 106 106 107 107 107 107 107 106 106 106 107 107 107 108 108 107 107 107 107 107 108 108 108 108 108 107 108 108 109 109 109 109 109 109 109 109 109 108 108 107 107 106 106 106
2006 106 106 105 105 105 104 104 104 104 104 104 104 104 104 104 103 103 103 103 103 103 102 102 102 101 101 101 101 101 100 100 100 99 99 99 99 99 99 99 99 99 99 99 99 99 99 99 99 98 98 98 98 98 98 98 99 99 98 98 99 99 99 100 100 100 100 100 101 101 101
1999 101 101 100 100 100 100 99 99 99 99 99 98 98 97 96 96 96 96 96 96 96 96 96 95 95 95 95 94 94 94 94 93 93 93 93 93 93 93 93 93 93 93 93 93 93 92 92 92 92 92 92 91 91 91 91 91 91 92 92 91 91 91 91 91 91 90 90 90 90 89
1992H9J%%%%%%%%%%j%jJ%%%%%%Jj%%%j%%%%%%%%%%%%%%%%%%%%%jJ%%%%%%%%%%%%%%%%%j%%
1984H7%%%%%%%%%%%%%%%%jJ%%%j%%%j%%%%%%%%%%%%%J%%%%%%%%%%%%%%%%%%%%%%j%%%%%%%
1977H5%%%%%%%%Jj%%%%%%%%%%%%%%%%%%%%%%%%jJ%%%%%%j%%%%%%%%J%jj%J%%%j%%%%%%%%%
1970H3%J%%%%%%%%%%%j%%%%j%%%%%%%%J%j%%%%%%%%%%%%j%%%%%%J%%%%%J%j%j%%Jj%%J%%j
1962H1%%%%%%%%%%j%%J%%%%%%%%%%%%%%%%j%%%%%%J%%%%j%%%%%%J%%j%%%Jj%%j%%%J%%j%%
1955G9%%%%%JjJ%%%%%%%j%%%%j%%%%Jj%%%%%%%%%%J%%j%%j%J%%%%%%%%Jj%j%%%%%%%%%%%%
1947G7%J%%%j%%%%j%J%j%%%%%%%%%%%%%Jj%%%%%j%%J%%%%%%%%%%%%%%%%%%%%%j%j%%%J%%J
1940G6%j%jJ%%%%J%j%%%%%J%%%%jJ%%j%%%%%%%%%%%%%%%%j%%%%J%J%j%%%%%%%%%j%%%%%J%
$$ plain form
1992 89 90 90 90 90 90 90 90 90 90 90 90 89 89 88 89 89 89 89 89 89 89 90 89 89 89 89 88 88 88 88 88 88 88 88 88 88 88 88 88 88 88 88 88 88 88 88 88 88 87 88 88 88 88 88 88 88 88 88 88 88 88 88 88 88 88 88 88 87 87 87
1984 87 87 87 87 87 87 87 87 87 87 87 87 87 87 87 87 87 86 87 87 87 87 86 86 86 86 85 85 85 85 85 85 85 85 85 85 85 85 85 85 86 86 86 86 86 86 86 86 86 86 86 86 86 86 86 86 86 86 86 86 86 86 86 85 85 85 85 85 85 85 85
1977 85 85 85 85 85 85 85 85 85 86 85 85 85 85 85 85 85 85 85 85 85 85 85 85 85 85 85 85 85 85 85 85 85 85 85 84 85 85 85 85 85 85 85 84 84 84 84 84 84 84 84 84 85 85 84 83 83 84 84 84 84 83 83 83 83 83 83 83 83 83 83
1970 83 83 84 84 84 84 84 84 84 84 84 84 84 84 83 83 83 83 83 82 82 82 82 82 82 82 82 82 83 83 82 82 82 82 82 82 82 82 82 82 82 82 82 81 81 81 81 81 81 81 82 82 82 82 82 82 83 83 82 82 81 81 81 82 81 81 81 82 82 82 81
1962 81 81 81 81 81 81 81 81 81 81 81 80 80 80 81 81 81 81 81 81 81 81 81 81 81 81 81 81 81 81 81 80 80 80 80 80 80 80 81 81 81 81 81 80 80 80 80 80 80 80 81 81 81 80 80 80 80 81 80 80 80 79 79 79 79 80 80 80 79 79 79
1955 79 79 79 79 79 79 80 79 80 80 80 80 80 80 80 80 79 79 79 79 79 78 78 78 78 78 79 78 78 78 78 78 78 78 78 78 78 78 79 79 79 78 78 78 77 77 78 78 78 78 78 78 78 78 78 79 78 78 77 77 77 77 77 77 77 77 77 77 77 77 77
1947 77 77 78 78 78 78 77 77 77 77 77 76 76 77 77 76 76 76 76 76 76 76 76 76 76 76 76 76 76 77 76 76 76 76 76 76 75 75 75 76 76 76 76 76 76 76 76 76 76 76 76 76 76 76 76 76 76 76 76 76 76 75 75 74 74 74 74 75 75 75 76
1940 76 76 75 75 74 75 75 75 75 75 76 76 75 75 75 75 75 75 76 76 76 76 76 75 76 76 76 75 75 75 75 75 75 75 75 75 75 75 75 75 75 75 75 75 74 74 74 74 74 75 75 76 76 75 75 75 75 75 75 75 75 75 75 74 74 74 74 74 74 75 75
1933G5J%%%%%%j%j%J%%%%Jj%%%%%j%%%J%%%j%%%%%%%%%%%%%%%%%%%%j%J%%Jj%%%%%%%%%%%
1925G4j%%%%%J%%j%%%Jj%%%J%%%j%%%%%%%%%%%J%j%%%J%%%j%j%J%%%%%%%%j%%J%%%%%%%%%
1918G3%%%%%%%%%%%%%%%%%%jJ%%%%%%%%%%%j%%%%jJ%%j%JjJ%%%%%%%%%%j%%%%Jj%%J%%%%%
1910G2j%%%JJj%%%%%j%%J%%%%Jj%%%%%%j%J%%%j%%%%%%%%%%%J%j%%%%%%%%%%%Jj%%%%%%%J
1903G2%%j%%%%j%J%%%%%%%%%Jj%%%%%j%%J%%J%%%%%j%%%%%%%%%%%jJ%%%%%%%%%j%%%%%J%j
1895G0%%%%%%%%%%%%%%%%%%%%jJ%%%%%%%%%%%%%J%%%%j%%%%%j%Jj%J%%%%%j%%%%%%%%%%J%
1888G0%j%J%%%%%%%%%%%%%%%%%%j%%%%%%J%%%%%%%j%%%%%j%%J%%%%%%J%%%%%%%%%j%%%J%%
1881G0j%%%%%%%%%%%%%%%%j%%%%J%J%j%j%%%%%%%%%%%%%%%%%%%%J%%%%%%%%%%j%%%%J%%%%
$$ plain form
1933 75 76 76 76 76 76 76 76 75 75 74 74 75 75 75 75 75 76 75 75 75 75 75 75 74 74 74 74 75 75 75 75 74 74 74 74 74 74 74 74 74 74 74 74 74 74 74 74 74 74 74 74 74 73 73 74 74 74 75 74 74 74 74 74 74 74 74 74 74 74 74
1925 74 73 73 73 73 73 73 74 74 74 73 73 73 73 74 73 73 73 73 74 74 74 74 73 73 73 73 73 73 73 73 73 73 73 73 74 74 73 73 73 73 74 74 74 74 73 73 72 72 73 73 73 73 73 73 73 73 73 72 72 72 73 73 73 73 73 73 73 73 73 73
1918 73 73 73 73 73 73 73 73 73 73 73 73 73 73 73 73 73 73 73 72 73 73 73 73 73 73 73 73 73 73 73 73 72 72 72 72 72 71 72 72 72 71 71 72 71 72 72 72 72 72 72 72 72 72 72 72 71 71 71 71 71 72 71 71 71 72 72 72 72 72 72
1910 72 71 71 71 71 72 73 72 72 72 72 72 72 71 71 71 72 72 72 72 72 73 72 72 72 72 72 72 72 71 71 72 72 72 72 71 71 71 71 71 71 71 71 71 71 71 71 72 72 71 71 71 71 71 71 71 71 71 71 71 71 72 71 71 71 71 71 71 71 71 72
1903 72 72 72 71 71 71 71 71 70 70 71 71 71 71 71 71 71 71 71 71 72 71 71 71 71 71 71 70 70 70 71 71 71 72 72 72 72 72 72 71 71 71 71 71 71 71 71 71 71 71 71 70 71 71 71 71 71 71 71 71 71 71 70 70 70 70 70 70 71 71 70
1895 70 70 70 70 70 70 70 70 70 70 70 70 70 70 70 70 70 70 70 70 70 69 70 70 70 70 70 70 70 70 70 70 70 70 70 70 71 71 71 71 71 70 70 70 70 70 70 69 69 70 69 69 70 70 70 70 70 70 69 69 69 69 69 69 69 69 69 69 69 70 70
1888 70 70 69 69 70 70 70 70 70 70 70 70 70 70 70 70 70 70 70 70 70 70 70 69 69 69 69 69 69 69 70 70 70 70 70 70 70 70 69 69 69 69 69 69 68 68 68 69 69 69 69 69 69 69 70 70 70 70 70 70 70 70 70 70 69 69 69 69 70 70 70
1881 70 69 69 69 69 69 69 69 69 69 69 69 69 69 69 69 69 69 68 68 68 68 68 69 69 70 70 69 69 68 68 68 68 68 68 68 68 68 68 68 68 68 68 68 68 68 68 68 68 68 69 69 69 69 69 69 69 69 69 69 69 68 68 68 68 68 69 69 69 69 69
1873F9%%%%J%%j%%jJ%%%%%%%%%%%jJ%%%%%%j%Jj%J%%%%%%%%%%%%%%j%%%%J%j%%%%Jj%%%J%
1866F9%%%jJ%%j%%Jj%%%%%%%Jj%%%%J%%j%%%%%%%%J%j%%%%%%%%%%%%%%%%%%%%j%%%J%jJ%%
1858F8%%%%%%%%%j%J%%%%%%j%%%J%%%%j%%%%%%%%%%%%%%%J%%%%j%%%J%%%J%%j%%%%%%j%%%
1851F7%%%%%%%%%%Jj%%%%%%%%%%jJ%%%%%%%Jj%%%%%jJ%%%jJ%%%j%%%%%%J%%%j%%%%%%%%%%
1844F6%%%J%%%%%%%%%%%%%%%j%%%%%%%J%%%j%%%%%%J%%%j%J%%%%%%%%%%%jJ%%%%%%%%%%%%
1836F7%%%%%%%%%%%%%%%%j%%%%%%%%%%J%%%%j%%%%j%%%J%jJ%%%j%%%j%%%J%%%%%%%%%%%%%
1829F5%j%%%%%%%%%%%%%%%%%%%%%%%J%%%%%%%%J%JJJ%J%%%%%j%j%j%jj%%j%%%%%%%%%%%%%
1821F4%%%%J%%%J%%j%%%J%%%%%%%%%J%%%%J%%%J%%%%%%%%%J%%%J%J%%%j%%%%%%jj%%j%%%j
$$ plain form
1873 69 69 69 69 69 70 70 70 69 69 69 68 69 69 69 69 69 69 69 69 69 69 69 69 68 69 69 69 69 69 69 69 68 68 69 68 68 69 69 69 69 69 69 69 69 69 69 69 69 69 69 69 68 68 68 68 68 69 69 68 68 68 68 68 69 68 68 68 68 69 69
1866 69 69 69 69 68 69 69 69 68 68 68 69 68 68 68 68 68 68 68 68 69 68 68 68 68 68 69 69 69 68 68 68 68 68 68 68 68 68 69 69 68 68 68 68 68 68 68 68 68 68 68 68 68 68 68 68 68 68 68 68 68 67 67 67 67 68 68 67 68 68 68
1858 68 68 68 68 68 68 68 68 68 68 67 67 68 68 68 68 68 68 68 67 67 67 67 68 68 68 68 68 67 67 67 67 67 67 67 67 67 67 67 67 67 67 67 67 68 68 68 68 68 67 67 67 67 68 68 68 68 69 69 69 68 68 68 68 68 68 68 67 67 67 67
1851 67 67 67 67 67 67 67 67 67 67 67 68 67 67 67 67 67 67 67 67 67 67 67 66 67 67 67 67 67 67 67 67 68 67 67 67 67 67 67 66 67 67 67 67 66 67 67 67 67 66 66 66 66 66 66 66 67 67 67 67 66 66 66 66 66 66 66 66 66 66 66
1844 66 66 66 66 67 67 67 67 67 67 67 67 67 67 67 67 67 67 67 67 66 66 66 66 66 66 66 66 67 67 67 67 66 66 66 66 66 66 66 67 67 67 67 66 66 67 67 67 67 67 67 67 67 67 67 67 67 66 67 67 67 67 67 67 67 67 67 67 67 67 67
1836 67 67 67 67 67 67 67 67 67 67 67 67 67 67 67 67 67 66 66 66 66 66 66 66 66 66 66 66 67 67 67 67 67 66 66 66 66 66 65 65 65 65 66 66 65 66 66 66 66 65 65 65 65 64 64 64 64 65 65 65 65 65 65 65 65 65 65 65 65 65 65
1829 65 65 64 64 64 64 64 64 64 64 64 64 64 64 64 64 64 64 64 64 64 64 64 64 64 64 65 65 65 65 65 65 65 65 65 66 66 67 68 69 69 70 70 70 70 70 70 69 69 68 68 67 67 66 65 65 65 64 64 64 64 64 64 64 64 64 64 64 64 64 64
1821 64 64 64 64 64 65 65 65 65 66 66 66 65 65 65 65 66 66 66 66 66 66 66 66 66 66 67 67 67 67 67 68 68 68 68 69 69 69 69 69 69 69 69 69 69 70 70 70 70 71 71 72 72 72 72 71 71 71 71 71 71 71 70 69 69 69 68 68 68 68 67
1814F7J%%%j%%%%%%%%%j%J%%%%%%%%%%%%%%%%%%%%%%%%%%%%J%%%JJJ%%%J%j%%%j%%j%j%%%
1806F8j%%j%%%%%j%%%%%%J%%%%%j%%%%%%%%%%%j%%%%%%%%%%%%%%%%%%%%%%%%j%J%%%j%j%%
1799F2%%J%j%%%%%%J%j%%J%%%%%j%%%%%%%%j%%%%%%%%%%%%j%%%%%%J%j%%%%%%%JjJ%j%%%%
1792F0%%%%J%%%j%%%jJ%%J%j%J%%%%%%%%%%%%j%JjJ%%%%%%%%%%%%%%%J%%jJj%%%%%%%%%%J
1784F2%%j%J%J%%%%%%%J%%%%j%%J%%%%%%%J%%%j%J%%%%%%%%%%%%%%%%j%%%%%%%%%J%%%%%%
1777F5J%j%%%%%%%%%%%%%%j%%%%J%j%%%%%j%%%%J%%J%%%%%%%%%%%j%j%J%%j%J%%%%%J%%%%
1769F5j%%%%%%%%%%%%%%%%%%%%%j%%%J%j%%Jj%J%%%%%j%%%%%%J%j%%%%Jj%J%%jJ%%j%%%%J
1762F4%%%%j%%%%%J%%%j%%%%%Jj%%Jj%%%%%%%J%%%j%%%%%%%%%%%%%%%J%%%%Jj%%%%%%%%%%
$$ plain form
1814 67 68 68 68 68 67 67 67 67 67 67 67 67 67 67 66 66 67 67 67 67 67 67 67 67 67 67 67 67 67 67 67 67 67 67 67 67 67 67 67 67 67 67 67 67 67 68 68 68 68 69 70 71 71 71 71 72 72 71 71 71 71 70 70 70 69 69 68 68 68 68
1806 68 67 67 67 66 66 66 66 66 66 65 65 65 65 65 65 65 66 66 66 66 66 66 65 65 65 65 65 65 65 65 65 65 65 65 64 64 64 64 64 64 64 64 64 64 64 64 64 64 64 64 64 64 64 64 64 64 64 64 64 63 63 64 64 64 64 63 63 62 62 62
1799 62 62 62 63 63 62 62 62 62 62 62 62 63 63 62 62 62 63 63 63 63 63 63 62 62 62 62 62 62 62 62 62 61 61 61 61 61 61 61 61 61 61 61 61 61 60 60 60 60 60 60 60 61 61 60 60 60 60 60 60 60 60 61 60 61 61 60 60 60 60 60
1792 60 60 60 60 60 61 61 61 61 60 60 60 60 59 60 60 60 61 61 60 60 61 61 61 61 61 61 61 61 61 61 61 61 61 60 60 61 60 61 61 61 61 61 61 61 61 61 61 61 61 61 61 61 61 62 62 62 61 62 61 61 61 61 61 61 61 61 61 61 61 62
1784 62 62 62 61 61 62 62 63 63 63 63 63 63 63 63 64 64 64 64 64 63 63 63 64 64 64 64 64 64 64 64 65 65 65 65 64 64 65 65 65 65 65 65 65 65 65 65 65 65 65 65 65 65 65 64 64 64 64 64 64 64 64 64 64 65 65 65 65 65 65 65
1777 65 66 66 65 65 65 65 65 65 65 65 65 65 65 65 65 65 65 64 64 64 64 64 65 65 64 64 64 64 64 64 63 63 63 63 63 64 64 64 65 65 65 65 65 65 65 65 65 65 65 65 64 64 63 63 64 64 64 63 63 64 64 64 64 64 64 65 65 65 65 65
1769 65 64 64 64 64 64 64 64 64 64 64 64 64 64 64 64 64 64 64 64 64 64 64 63 63 63 63 64 64 63 63 63 64 63 63 64 64 64 64 64 64 63 63 63 63 63 63 63 64 64 63 63 63 63 63 64 63 63 64 64 64 63 64 64 64 63 63 63 63 63 64
1762 64 64 64 64 64 63 63 63 63 63 63 64 64 64 64 63 63 63 63 63 63 64 63 63 63 64 63 63 63 63 63 63 63 63 64 64 64 64 63 63 63 63 63 63 63 63 63 63 63 63 63 63 63 63 64 64 64 64 64 65 64 64 64 64 64 64 64 64 64 64 64
1755F4%%%%%%Jj%%%%J%%%%%%j%%J%%%%j%%%%%%%%%%%J%%%%%%j%%%%%%Jj%Jj%%%%%%%J%%%%
1747F5%%%j%Jj%J%%j%J%%%%%%%%%%%%%%%%%%%%j%%%%J%%J%%%%j%%%%%%%%%j%%%J%%%%%j%%
1740F4%%%%%%%%%%%%Jj%%%%%%%%J%%%%%%%%%%%%%%%j%J%%%%%%%%%%j%%%%%J%%%%j%%%J%%%
1732F5%%%j%%J%%%%%%%%%j%%%%%%%%%%%%%%%%J%%j%Jj%j%%%%J%%%%%Jj%%%%jJ%%%%J%j%%J
1725F5j%%%%%%%J%%j%%%%%%J%%%%j%%%%%%%%%%%%%%%%%%%%%%%J%%%%%j%%%%J%%%j%%%%%%%
1717F4%%%J%%%%j%%%Jj%%%%%J%%%%%JJJ%%%%%%j%%%j%j%%%%%%%%%j%%%J%%%j%%%%%%j%J%%
1710F4%%%%%%%%j%%%%%%J%%%%j%%%%%%%%%%%%%%%J%%%%%%%%%%%%%%%%%jJ%%%%%%%%%%%%%%
1703F4j%%%%%%%%%%%%%%%%%%%%J%%%%%%%%%%%%%%%%%%%j%%J%%%%%%%%%%%%%%%%%%%%%%%%%
$$ plain form
1755 64 64 64 64 64 64 64 65 64 64 64 64 64 65 65 65 65 65 65 65 64 64 64 65 65 65 65 65 64 64 64 64 64 64 64 64 64 64 64 64 65 65 65 65 65 65 65 64 64 64 64 64 64 64 65 64 64 65 64 64 64 64 64 64 64 64 65 65 65 65 65
1747 65 65 65 65 64 64 65 64 64 65 65 65 64 64 65 65 65 65 65 65 65 65 65 65 65 65 65 65 65 65 65 65 65 65 65 64 64 64 64 64 65 65 65 66 66 66 66 66 65 65 65 65 65 65 65 65 65 65 64 64 64 64 65 65 65 65 65 65 64 64 64
1740 64 64 64 64 64 64 64 64 64 64 64 64 64 65 64 64 64 64 64 64 64 64 64 65 65 65 65 65 65 65 65 65 65 65 65 65 65 65 65 64 64 65 65 65 65 65 65 65 65 65 65 65 64 64 64 64 64 64 65 65 65 65 65 64 64 64 64 65 65 65 65
1732 65 65 65 65 64 64 64 65 65 65 65 65 65 65 65 65 65 64 64 64 64 64 64 64 64 64 64 64 64 64 64 64 64 64 65 65 65 64 64 65 64 64 63 63 63 63 63 64 64 64 64 64 64 65 64 64 64 64 64 63 64 64 64 64 64 65 65 64 64 64 65
1725 65 64 64 64 64 64 64 64 64 65 65 65 64 64 64 64 64 64 64 65 65 65 65 65 64 64 64 64 64 64 64 64 64 64 64 64 64 64 64 64 64 64 64 64 64 64 64 64 65 65 65 65 65 65 64 64 64 64 64 65 65 65 65 64 64 64 64 64 64 64 64
1717 64 64 64 64 65 65 65 65 65 64 64 64 64 65 64 64 64 64 64 64 65 65 65 65 65 65 66 67 68 68 68 68 68 68 68 67 67 67 67 66 66 65 65 65 65 65 65 65 65 65 65 64 64 64 64 65 65 65 65 64 64 64 64 64 64 64 63 63 64 64 64
1710 64 64 64 64 64 64 64 64 64 63 63 63 63 63 63 63 64 64 64 64 64 63 63 63 63 63 63 63 63 63 63 63 63 63 63 63 63 64 64 64 64 64 64 64 64 64 64 64 64 64 64 64 64 64 64 63 64 64 64 64 64 64 64 64 64 64 64 64 64 64 64
1703 64 63 63 63 63 63 63 63 63 63 63 63 63 63 63 63 63 63 63 63 63 63 64 64 64 64 64 64 64 64 64 64 64 64 64 64 64 64 64 64 64 64 63 63 63 64 64 64 64 64 64 64 64 64 64 64 64 64 64 64 64 64 64 64 64 64 64 64 64 64 64
1695F4%%j%J%%%%%jJ%j%%J%j%%%%J%%%%%j%Jj%%%Jj%%%J%%jJ%%J%j%%%%%%Jj%%%%%%%%%%%
1688F4%j%J%%%%%%%%%%%%%%%%%%%%%%%%J%jJ%%%%%j%%%J%%%%%%%j%%%%%%%%%%%j%%%%%J%%
1680F4%%%%%%%j%%jJ%J%%%jJ%%%j%Jj%%%%%%%%J%%%%%%%J%%%j%%%%%%%j%%%%%%%j%%%%J%%
1673F3J%%%j%%%%%%%%%%%%%%%%J%%j%%%%%%%J%%j%%%%%%Jj%%%%%%j%%%J%%%%%%%%%Jj%%%%
1665F3%%%%%%%%%%%%%%%%%%%%%%%%jJ%%%%%j%Jj%%Jj%j%J%J%%%%%%%%%%%%%%%%j%%%%%%%J
1658F3j%Jj%J%%j%%%J%%%j%%%%%%%%%%%%%%%%%%%%%%%%%%%j%%J%J%%j%%%%%%%%%%%%%%j%%
1651F1J%%%%%%%%%%%%%%%%%%j%%%%J%%%%%j%%%%%%J%%%%%%%%%J%%%%%%%%%%%%j%%%%%J%%%
1643F3%%%%j%%%J%%%Jj%%%%%%%%j%%%%%%%%%%%%%Jj%%%J%%%%%%%%%%j%%%%%%%J%%%%%%%%%
$$ plain form
1695 64 64 64 63 63 64 64 64 64 64 64 63 64 64 63 63 63 64 64 63 63 63 63 63 64 64 64 64 64 64 63 63 64 63 63 63 63 64 63 63 63 63 64 64 64 63 64 64 64 65 65 64 64 64 64 64 64 64 65 64 64 64 64 64 64 64 64 64 64 64 64
1688 64 64 63 63 64 64 64 64 64 64 64 64 64 64 64 64 64 64 64 64 64 64 64 64 64 64 64 64 64 65 65 64 65 65 65 65 65 65 64 64 64 64 65 65 65 65 65 65 65 65 64 64 64 64 64 64 64 64 64 64 64 64 63 63 63 63 63 63 64 64 64
1680 64 64 64 64 64 64 64 64 63 63 63 62 63 63 64 64 64 64 63 64 64 64 64 63 63 64 63 63 63 63 63 63 63 63 63 64 64 64 64 64 64 64 64 65 65 65 65 64 64 64 64 64 64 64 64 63 63 63 63 63 63 63 63 62 62 62 62 62 63 63 63
1673 63 64 64 64 64 63 63 63 63 63 63 63 63 63 63 63 63 63 63 63 63 63 64 64 64 63 63 63 63 63 63 63 63 64 64 64 63 63 63 63 63 63 63 64 63 63 63 63 63 63 63 62 62 62 62 63 63 63 63 63 63 63 63 63 63 64 63 63 63 63 63
1665 63 63 63 63 63 63 63 63 63 63 63 63 63 63 63 63 63 63 63 63 63 63 63 63 63 62 63 63 63 63 63 63 62 62 63 62 62 62 63 62 62 61 61 62 62 63 63 63 63 63 63 63 63 63 63 63 63 63 63 63 63 63 62 62 62 62 62 62 62 62 63
1658 63 62 62 63 62 62 63 63 63 62 62 62 62 63 63 63 63 62 62 62 62 62 62 62 62 62 62 62 62 62 62 62 62 62 62 62 62 62 62 62 62 62 62 62 62 61 61 61 62 62 63 63 63 62 62 62 62 62 62 62 62 62 62 62 62 62 62 62 61 61 61
1651 61 62 62 62 62 62 62 62 62 62 62 62 62 62 62 62 62 62 62 62 61 61 61 61 61 62 62 62 62 62 62 61 61 61 61 61 61 61 62 62 62 62 62 62 62 62 62 62 63 63 63 63 63 63 63 63 63 63 63 63 63 62 62 62 62 62 62 63 63 63 63
1643 63 63 63 63 63 62 62 62 62 63 63 63 63 64 63 63 63 63 63 63 63 63 63 62 62 62 62 62 62 62 62 62 62 62 62 62 62 63 62 62 62 62 63 63 63 63 63 63 63 63 63 63 63 62 62 62 62 62 62 62 62 63 63 63 63 63 63 63 63 63 63
1636F3%%%%%%%Jj%%%%%%%%%%%%%%%jJ%%%%j%%%%J%%%%%%%%%%%%%%%%%%%%%%%%%%%%%%%%%%
1628F3J%%%%j%%J%j%%%%%%%j%%%%%%%J%%%%J%%%%%%j%%%%%%%%%%%%%%j%%%%%%%%%%%%J%%%
1621F3%%j%%%%%%%%%%%%%%%%%J%%%%%%j%%J%%%%%%j%%%%%%%%%%%%%%j%%%%%%J%%%%%%J%j%
1614F2%%%%%%J%%%%%j%%%%%%%%J%%%%%%%%Jj%%%%Jj%%%%%J%%%JJJJJJJJ%Jj%%jjk%jj%j%j
1606F4%%jJj%%%%j%%%%%%J%%%%%Jj%%%%%%%%j%%%Jj%J%%%%j%%J%%%j%%%%%J%%%%%%%%%%%%
1599F3%%%%%%j%J%%%%%jJ%%%j%%%%%%J%%%%%%%%%%j%%%%%J%%Jj%%%%j%%%%%%J%%%%%%%%j%
1591F2%%%%%%J%%%%%%%J%%J%%j%%J%%j%%%j%%%%%%j%%%J%%%%%j%J%%%%%%%%%%%%%%%%%%%%
1584F3j%%%j%J%%%J%%%%%%%%%jJj%J%%%%j%%J%%%%j%%%%%%%%%%J%%Jj%%%%%j%J%%%%%jJ%%
$$ plain form
1636 63 63 63 63 63 63 63 63 64 63 63 63 63 63 63 63 63 63 63 63 63 63 63 63 63 62 63 63 63 63 63 62 62 62 62 62 63 63 63 63 63 63 63 63 63 63 63 63 63 63 63 63 63 63 63 63 63 63 63 63 63 63 63 63 63 63 63 63 63 63 63
1628 63 64 64 64 64 64 63 63 63 64 64 63 63 63 63 63 63 63 63 62 62 62 62 62 62 62 62 63 63 63 63 63 64 64 64 64 64 64 64 63 63 63 63 63 63 63 63 63 63 63 63 63 63 63 62 62 62 62 62 62 62 62 62 62 62 62 62 63 63 63 63
1621 63 63 63 62 62 62 62 62 62 62 62 62 62 62 62 62 62 62 62 62 62 63 63 63 63 63 63 63 62 62 62 63 63 63 63 63 63 63 62 62 62 62 62 62 62 62 62 62 62 62 62 62 62 61 61 61 61 61 61 61 62 62 62 62 62 62 62 63 63 62 62
1614 62 62 62 62 62 62 62 63 63 63 63 63 63 62 62 62 62 62 62 62 62 62 63 63 63 63 63 63 63 63 63 64 63 63 63 63 63 64 63 63 63 63 63 63 64 64 64 64 65 66 67 68 69 70 71 72 72 73 72 72 72 71 70 68 68 67 66 66 65 65 64
1606 64 64 64 63 64 63 63 63 63 63 62 62 62 62 62 62 62 63 63 63 63 63 63 64 63 63 63 63 63 63 63 63 63 62 62 62 62 63 62 62 63 63 63 63 63 62 62 62 63 63 63 63 62 62 62 62 62 62 63 63 63 63 63 63 63 63 63 63 63 63 63
1599 63 63 63 63 63 63 63 62 62 63 63 63 63 63 63 62 63 63 63 63 62 62 62 62 62 62 62 63 63 63 63 63 63 63 63 63 63 63 62 62 62 62 62 62 63 63 63 64 63 63 63 63 63 62 62 62 62 62 62 62 63 63 63 63 63 63 63 63 63 62 62
1591 62 62 62 62 62 62 62 63 63 63 63 63 63 63 63 64 64 64 65 65 65 64 64 64 65 65 65 64 64 64 64 63 63 63 63 63 63 63 62 62 62 62 63 63 63 63 63 63 62 62 63 63 63 63 63 63 63 63 63 63 63 63 63 63 63 63 63 63 63 63 63
1584 63 62 62 62 62 61 61 62 62 62 62 63 63 63 63 63 63 63 63 63 63 62 63 62 62 63 63 63 63 63 62 62 62 63 63 63 63 63 62 62 62 62 62 62 62 62 62 62 62 63 63 63 64 63 63 63 63 63 63 62 62 63 63 63 63 63 63 62 63 63 63
1576F3%%%jJ%j%%%%%%%%%%%%%%%%%%%%%%%%%%%%%%%%%%%%%%%%j%%J%%%%J%%%%%%%%%%%j%%
1569F2%%%%%%J%%%%%j%%%%%%%J%%%%%%%jJj%%%%J%%%%%j%%j%%J%%%%%%J%%%%%%%%%%%%%%%
1562F3%%%%%j%%%%%%%%J%%%%j%Jj%J%j%%%%%%%%%J%%%%j%j%J%%%%%%%%%J%%%j%%%%%%%%%%
1554F2%J%%%j%%%%%%%%J%j%%%%j%%%%%%%%%%%%J%%%J%%jJ%j%%%%%%jJ%%%%%%%%%%%%%%%%%
1547F2%%%%%J%j%%%%%j%J%%%j%%%J%%%%%%%%%%%%%%%%%%%%%%%%%%j%%%%%J%%%Jj%%%%%%%%
1539F2%%%%%%%%%%%%%%%jJ%%%%%%jJ%%%%%%%%%%%%%j%%J%%%%%J%j%%%%%%%%%%%%j%%J%%%%
1532F2%%%%j%%J%%Jj%%%j%J%%%%%%%%%%%%%%%%J%%%j%%%%j%%%%%%%%%J%%%%%Jj%%%%%J%j%
1525F2%%%%%J%%j%%%%%%%%%%%%%%%%%%%%%%%J%%%%%%%%%%%%j%%J%j%%J%%%J%%JJ%J%j%%j%
$$ plain form
1576 63 63 63 63 62 63 63 62 62 62 62 62 62 62 62 62 62 62 62 62 62 62 62 62 62 62 62 62 62 62 62 62 62 62 62 62 62 62 62 62 62 62 62 62 62 62 62 62 61 61 61 62 62 62 62 62 63 63 63 63 63 63 63 63 63 63 63 63 62 62 62
1569 62 62 62 62 62 62 62 63 63 63 63 63 63 62 62 62 62 62 62 62 62 63 63 63 63 63 63 63 63 62 63 62 62 62 62 62 63 63 63 63 63 63 62 62 62 61 61 61 62 62 62 62 62 62 62 63 63 63 63 63 63 63 63 63 63 63 63 63 63 63 63
1562 63 63 63 63 63 63 62 62 62 62 62 62 62 62 62 63 63 63 63 63 62 62 63 62 62 63 63 62 62 62 62 62 62 62 62 62 62 63 63 63 63 63 62 62 61 61 62 62 62 62 62 62 62 62 62 62 63 63 63 63 62 62 62 62 62 62 62 62 62 62 62
1554 62 62 63 63 63 63 62 62 62 62 62 62 62 62 62 63 63 62 62 62 62 62 61 61 61 61 61 61 61 61 61 61 61 61 61 62 62 62 62 63 63 63 62 63 63 62 62 62 62 62 62 62 61 62 62 62 62 62 62 62 62 62 62 62 62 62 62 62 62 62 62
1547 62 62 62 62 62 62 63 63 62 62 62 62 62 62 61 61 62 62 62 62 61 61 61 61 62 62 62 62 62 62 62 62 62 62 62 62 62 62 62 62 62 62 62 62 62 62 62 62 62 62 62 61 61 61 61 61 61 62 62 62 62 63 62 62 62 62 62 62 62 62 62
1539 62 62 62 62 62 62 62 62 62 62 62 62 62 62 62 62 61 62 62 62 62 62 62 62 61 62 62 62 62 62 62 62 62 62 62 62 62 62 62 61 61 61 62 62 62 62 62 62 63 63 62 62 62 62 62 62 62 62 62 62 62 62 62 61 61 61 62 62 62 62 62
1532 62 62 62 62 62 61 61 61 62 62 62 63 62 62 62 62 61 61 62 62 62 62 62 62 62 62 62 62 62 62 62 62 62 62 62 63 63 63 63 62 62 62 62 62 61 61 61 61 61 61 61 61 61 61 62 62 62 62 62 62 63 62 62 62 62 62 62 63 63 62 62
1525 62 62 62 62 62 62 63 63 63 62 62 62 62 62 62 62 62 62 62 62 62 62 62 62 62 62 62 62 62 62 62 62 62 63 63 63 63 63 63 63 63 63 63 63 63 63 62 62 62 63 63 62 62 62 63 63 63 63 64 64 64 65 66 66 67 67 66 66 66 65 65
1517F5j%j%j%%%%%%%Jj%%J%%j%%%J%%J%J%JKJKJJJ%%%jkjkjjj%jj%j%%%j%J%%%%%Jj%%%%%
1510F2%%J%j%%%%%%j%%%J%%%%%%j%J%%%%%%%Jj%%%%j%%%%%%%%J%%J%%%%%%%%%%%j%%%%%%%
1502F2%%%%%%%%%Jj%%%%%%%j%%%%%%J%%%j%%%%%%%%J%%%%%%%%%%%%%%%%%%%%%%%%%%%%J%j
1495F2%%j%%%%%%J%%%%%j%%%%J%%%%%%%%J%%%%j%%%j%%%%%%%%%%J%%j%%%%%J%%%%%%%%%%%
1487F2%j%%%J%%j%%%%J%%%%j%%%J%%%%%%%j%%%%%%%%%%%%%Jj%%%%%%%%%%%%%%%%J%%%%%%%
1480F2%%%%%%%j%%%%%%%%Jj%%%%%%%%%J%%%j%%J%j%%%%%%%%%%%%%%%%%%%%%j%J%%%%%Jj%%
1473F1%%%Jj%%%%%%%%%%j%%J%%%%%%%j%%%%%%%%%%%%%%%%%%%%J%%%%%%%%%%%%%j%%%%J%%%
1465F1%%%%%%%%%Jj%%%%%%%%%%%%j%%%%j%%J%j%%J%%%J%j%%%%%%%%%%J%%%%%%%%%%J%%j%%
$$ plain form
1517 65 64 64 63 63 62 62 62 62 62 62 62 62 63 62 62 62 63 63 63 62 62 62 62 63 63 63 64 64 65 65 66 68 69 71 72 73 74 74 74 74 73 71 70 68 67 66 65 65 64 63 63 62 62 62 62 61 61 62 62 62 62 62 62 63 62 62 62 62 62 62
1510 62 62 62 63 63 62 62 62 62 62 62 62 61 61 61 61 62 62 62 62 62 62 62 61 61 62 62 62 62 62 62 62 62 63 62 62 62 62 62 61 61 61 61 61 61 61 61 61 62 62 62 63 63 63 63 63 63 63 63 63 63 63 63 62 62 62 62 62 62 62 62
1502 62 62 62 62 62 62 62 62 62 62 63 62 62 62 62 62 62 62 62 61 61 61 61 61 61 61 62 62 62 62 61 61 61 61 61 61 61 61 61 62 62 62 62 62 62 62 62 62 62 62 62 62 62 62 62 62 62 62 62 62 62 62 62 62 62 62 62 62 63 63 62
1495 62 62 62 61 61 61 61 61 61 61 62 62 62 62 62 62 61 61 61 61 61 62 62 62 62 62 62 62 62 62 63 63 63 63 63 62 62 62 62 61 61 61 61 61 61 61 61 61 61 61 62 62 62 61 61 61 61 61 61 62 62 62 62 62 62 62 62 62 62 62 62
1487 62 62 61 61 61 61 62 62 62 61 61 61 61 61 62 62 62 62 62 61 61 61 61 62 62 62 62 62 62 62 62 61 61 61 61 61 61 61 61 61 61 61 61 61 61 62 61 61 61 61 61 61 61 61 61 61 61 61 61 61 61 61 61 62 62 62 62 62 62 62 62
1480 62 62 62 62 62 62 62 62 61 61 61 61 61 61 61 61 61 62 61 61 61 61 61 61 61 61 61 61 62 62 62 62 61 61 61 62 62 61 61 61 61 61 61 61 61 61 61 61 61 61 61 61 61 61 61 61 61 61 61 60 60 61 61 61 61 61 61 62 61 61 61
1473 61 61 61 61 62 61 61 61 61 61 61 61 61 61 61 61 60 60 60 61 61 61 61 61 61 61 61 60 60 60 60 60 60 60 60 60 60 60 60 60 60 60 60 60 60 60 60 60 61 61 61 61 61 61 61 61 61 61 61 61 61 61 60 60 60 60 60 61 61 61 61
1465 61 61 61 61 61 61 61 61 61 61 62 61 61 61 61 61 61 61 61 61 61 61 61 61 60 60 60 60 60 59 59 59 60 60 59 59 59 60 60 60 60 61 61 60 60 60 60 60 60 60 60 60 60 60 61 61 61 61 61 61 61 61 61 61 61 62 62 62 61 61 61
1458F1%%%%%%%%%%%%%%%%%%j%%%%%J%%%%%jJ%%%%%%%J%%%%%J%%%j%%j%%%%%Jj%%Jj%%%%%%
1450F1%%J%j%%%%%%%%%%%%%j%%%%%%%%%%%%J%%%%%%%%%%%%%jJ%%jJ%%%%%J%%%j%j%J%%%%%
1443F1%%%%%%%%%%Jj%%%%%%j%%%%J%%Jj%%%%Jj%%%%%%%%%%%%%%%%%%%%%%%%%%%%%%%%%%%%
1436F1%Jj%%Jj%J%%j%%%%%%%%J%%%%%j%%%%%J%%%J%%%%J%JJKKMLLLLJ%%kkllllkkjjjj%j%
1428F2%%%%%%%%%%j%J%%%%%%%%%%%j%%%%%%J%j%%%%%%%%%%%%%%%%%%%%%%J%j%%%%%%%%jJ%
1421F1%%%%%j%J%%%%%%%%%%%%%%j%%%J%%%%j%%%%%%jJ%%%%%%%%%J%%j%%J%%%%%%J%j%j%%J
1413F1%%%%%%%%%%%%%%%%%j%%%%%%%J%%j%%%%%%%%%%%%%J%%%%%%%j%J%%%%%%%%%j%%%%J%%
1406F1%%j%%%%%J%%%%%%%%%%J%j%%j%%J%%%%%%%j%%%J%%%%%%%%%%%%J%J%%%%%%%%j%%%%%j
$$ plain form
1458 61 61 61 61 61 61 61 61 61 61 61 61 61 61 61 61 61 61 61 60 60 60 60 60 60 61 61 61 61 61 61 60 61 61 61 61 61 61 61 61 62 62 62 62 62 62 63 63 63 63 62 62 62 61 61 61 61 61 61 62 61 61 61 62 61 61 61 61 61 61 61
1450 61 61 61 62 62 61 61 61 61 61 61 61 61 61 61 61 61 61 61 60 60 60 60 60 60 60 60 60 60 60 60 60 61 61 61 61 61 61 61 61 61 61 61 61 61 61 60 61 61 61 60 61 61 61 61 61 61 62 62 62 62 61 61 60 60 61 61 61 61 61 61
1443 61 61 61 61 61 61 61 61 61 61 61 62 61 61 61 61 61 61 61 60 60 60 60 60 61 61 61 62 61 61 61 61 61 62 61 61 61 61 61 61 61 61 61 61 61 61 61 61 61 61 61 61 61 61 61 61 61 61 61 61 61 61 61 61 61 61 61 61 61 61 61
1436 61 61 62 61 61 61 62 61 61 62 62 62 61 61 61 61 61 61 61 61 61 62 62 62 62 62 62 61 61 61 61 61 61 62 62 62 62 63 63 63 63 63 64 64 65 66 68 70 74 77 80 83 86 87 87 87 85 83 80 77 74 71 69 67 66 65 64 63 63 62 62
1428 62 62 62 62 62 62 62 62 62 62 62 61 61 62 62 62 62 62 62 62 62 62 62 62 62 61 61 61 61 61 61 61 62 62 61 61 61 61 61 61 61 61 61 61 61 61 61 61 61 61 61 61 61 61 61 61 61 62 62 61 61 61 61 61 61 61 61 61 60 61 61
1421 61 61 61 61 61 61 60 60 61 61 61 61 61 61 61 61 61 61 61 61 61 61 61 60 60 60 60 61 61 61 61 61 60 60 60 60 60 60 60 59 60 60 60 60 60 60 60 60 60 60 61 61 61 60 60 60 61 61 61 61 61 61 61 62 62 61 61 60 60 60 61
1413 61 61 61 61 61 61 61 61 61 61 61 61 61 61 61 61 61 61 60 60 60 60 60 60 60 60 61 61 61 60 60 60 60 60 60 60 60 60 60 60 60 60 60 61 61 61 61 61 61 61 61 60 60 61 61 61 61 61 61 61 61 61 61 60 60 60 60 60 61 61 61
1406 61 61 61 60 60 60 60 60 60 61 61 61 61 61 61 61 61 61 61 61 62 62 61 61 61 60 60 60 61 61 61 61 61 61 61 61 60 60 60 60 61 61 61 61 61 61 61 61 61 61 61 61 61 62 62 63 63 63 63 63 63 63 63 63 62 62 62 62 62 62 61
1398F1%j%%%%%J%%%%%%%%%%%%%%%%%%%%%%%Jj%j%J%%%%%%j%%%%J%%%%%j%%%%%%J%%%%%%%%
1391F1%%%%%%J%%%%j%%jJj%J%%%%%%%%%%%%%j%%J%%%%%%%J%%%%%%J%j%%%j%%%J%%j%%%%%%
1384F1%%%%jJ%%%J%%%%j%%%jJ%%%%%%%%%%%%%%%%%%j%%%%%%%%%%%%%%%%%%%%%%%%J%%%J%%
1376F2%%%%j%%%%%%%%%%%%%%%%%%%jJ%%%%%%%%%%jJ%%%%%%%%%%j%%%%%%%%%%J%%%%%%%%%%
1369F1%j%%%%%%J%%%%%%j%J%%%%%j%%J%%%%%%%j%%%%%J%%%%%%%%%%%j%%%%%J%%%%%%%%%%%
1361F1%%%%j%%%%%%J%%%%%%%%jJ%jJj%%%%%%%%jJ%%%%%J%%%j%%%j%%%%%J%J%%%%%j%%%%%%
1354F0%%%J%%Jj%%%%%%%j%%%%%%jJ%%%%%%%%%%%%%%%%%J%%%%j%%%%%%%%%%%%j%%%J%%%%%%
1347F0%%%%%%%%%jJ%Jj%j%J%%%%%%%J%%%j%%%%J%%%%%%j%%%%%%%J%%j%%Jj%%J%%%%j%%%%%
$$ plain form
1398 61 61 60 60 60 60 60 60 61 61 61 61 61 61 61 61 61 61 61 61 61 61 61 61 61 61 61 61 61 61 61 61 62 61 61 60 60 61 61 61 61 61 61 61 60 60 60 60 60 61 61 61 61 61 61 60 60 60 60 60 60 60 61 61 61 61 61 61 61 61 61
1391 61 61 61 61 61 61 61 62 62 62 62 62 61 61 61 60 61 60 60 61 61 61 61 61 61 61 61 61 61 61 61 61 61 60 60 60 61 61 61 61 61 61 61 61 62 62 62 62 62 62 62 63 63 62 62 62 62 61 61 61 61 62 62 62 61 61 61 61 61 61 61
1384 61 61 61 61 61 60 61 61 61 61 62 62 62 62 62 61 61 61 61 60 61 61 61 61 61 61 61 61 61 61 61 61 61 61 61 61 61 61 61 60 60 60 60 60 60 60 60 60 60 60 60 60 60 60 60 60 60 60 60 60 60 60 60 60 61 61 61 61 62 62 62
1376 62 62 62 62 62 61 61 61 61 61 61 61 61 61 61 61 61 61 61 61 61 61 61 61 61 60 61 61 61 61 61 61 61 61 61 61 61 60 61 61 61 61 61 61 61 61 61 61 61 60 60 60 60 60 60 60 60 60 60 60 61 61 61 61 61 61 61 61 61 61 61
1369 61 61 60 60 60 60 60 60 60 61 61 61 61 61 61 61 60 60 61 61 61 61 61 61 60 60 60 61 61 61 61 61 61 61 61 60 60 60 60 60 60 61 61 61 61 61 61 61 61 61 61 61 61 60 60 60 60 60 60 61 61 61 61 61 61 61 61 61 61 61 61
1361 61 61 61 61 61 60 60 60 60 60 60 60 61 61 61 61 61 61 61 61 61 60 61 61 60 61 60 60 60 60 60 60 60 60 60 59 60 60 60 60 60 60 61 61 61 61 60 60 60 60 59 59 59 59 59 59 60 60 61 61 61 61 61 61 60 60 60 60 60 60 60
1354 60 60 60 60 61 61 61 62 61 61 61 61 61 61 61 61 60 60 60 60 60 60 60 59 60 60 60 60 60 60 60 60 60 60 60 60 60 60 60 60 60 60 61 61 61 61 61 60 60 60 60 60 60 60 60 60 60 60 60 60 59 59 59 59 60 60 60 60 60 60 60
1347 60 60 60 60 60 60 60 60 60 60 59 60 60 61 60 60 59 59 60 60 60 60 60 60 60 60 61 61 61 61 60 60 60 60 60 61 61 61 61 61 61 61 60 60 60 60 60 60 60 60 61 61 61 60 60 60 61 60 60 60 61 61 61 61 61 60 60 60 60 60 60
1339F0%%%%%%%%%%%J%%%%%%j%J%j%%%%%%%%J%j%%%%%%%J%%jJ%%%%%%%%%j%%%%%%%%J%%%j%
1332F0%J%%%j%%%%J%%%jJ%%%%%%%%j%%%J%%j%J%%%%j%%%%%%J%j%%%%%J%j%%%%jJ%%%%%%%%
1324F0Jj%%Jjj%%%%%J%J%%%%j%J%%%%%%%%%j%%%%%%%J%%%%%%%%%J%%J%K%J%%%%%jj%j%jj%
1317F1%Jj%%j%%j%J%%%%%%%%%%%%%%J%%%%%%j%%%%%%%%%%%%%j%%J%%%%%%%%%%%%%%%%%%%%
1309F0Jj%%%%%%%%%J%%%%%j%%%%%j%J%%%%%%%%%J%j%%J%%%%j%%%j%J%%%%%%%%%%%J%%%j%J
1302F1%%%%%%%%%%%%%%j%j%%%%%%%%%%%J%%%%J%%%j%%%j%%J%%%%%J%%%j%%%%%J%%%j%%%%%
1295F0%%%%%%%%%%%J%j%%%%%%%%%j%%J%jJ%%%%%%%%%%%%%J%%%j%%%Jj%%%%%%%%%%%%%%%%J
1287F1j%%%%%%%%%%%%%%%%%%%%%%%%%%%%%%%%%%%%%%%%%%%%%%%%%%%%j%%J%%%%j%%%%%%J%
$$ plain form
1339 60 60 60 60 60 60 60 60 60 60 60 60 61 61 61 61 61 61 61 60 60 61 61 60 60 60 60 60 60 60 60 60 61 61 60 60 60 60 60 60 60 60 61 61 61 60 61 61 61 61 61 61 61 61 61 61 60 60 60 60 60 60 60 60 60 61 61 61 61 60 60
1332 60 60 61 61 61 61 60 60 60 60 60 61 61 61 61 60 61 61 61 61 61 61 61 61 61 60 60 60 60 61 61 61 60 60 61 61 61 61 61 60 60 60 60 60 60 60 61 61 60 60 60 60 60 60 61 61 60 60 60 60 60 59 60 60 60 60 60 60 60 60 60
1324 60 61 60 60 60 61 60 59 59 59 59 59 59 60 60 61 61 61 61 61 60 60 61 61 61 61 61 61 61 61 61 61 60 60 60 60 60 60 60 60 61 61 61 61 61 61 61 61 61 61 62 62 62 63 63 65 65 66 66 66 66 66 66 65 64 64 63 63 62 61 61
1317 61 61 62 61 61 61 60 60 60 59 59 60 60 60 60 60 60 60 60 60 60 60 60 60 60 60 61 61 61 61 61 61 61 60 60 60 60 60 60 60 60 60 60 60 60 60 60 59 59 59 60 60 60 60 60 60 60 60 60 60 60 60 60 60 60 60 60 60 60 60 60
1309 60 61 60 60 60 60 60 60 60 60 60 60 61 61 61 61 61 61 60 60 60 60 60 60 59 59 60 60 60 60 60 60 60 60 60 60 61 61 60 60 60 61 61 61 61 61 60 60 60 60 59 59 60 60 60 60 60 60 60 60 60 60 60 60 61 61 61 61 60 60 61
1302 61 61 61 61 61 61 61 61 61 61 61 61 61 61 61 60 60 59 59 59 59 59 59 59 59 59 59 59 59 60 60 60 60 60 61 61 61 61 60 60 60 60 59 59 59 60 60 60 60 60 60 61 61 61 61 60 60 60 60 60 60 61 61 61 61 60 60 60 60 60 60
1295 60 60 60 60 60 60 60 60 60 60 60 60 61 61 60 60 60 60 60 60 60 60 60 60 59 59 59 60 60 59 60 60 60 60 60 60 60 60 60 60 60 60 60 60 61 61 61 61 60 60 60 60 61 60 60 60 60 60 60 60 60 60 60 60 60 60 60 60 60 60 61
1287 61 60 60 60 60 60 60 60 60 60 60 60 60 60 60 60 60 60 60 60 60 60 60 60 60 60 60 60 60 60 60 60 60 60 60 60 60 60 60 60 60 60 60 60 60 60 60 60 60 60 60 60 60 60 59 59 59 60 60 60 60 60 59 59 59 59 59 59 59 60 60
1280F0%%j%%%jJ%%%J%%%%%%j%%%%%%jJ%%%%%%%%J%%j%%%%%%%J%%%%%%%%%j%%%%%%%%%%%%J
1272F0%%%%%%%%%%%j%%%%J%%%j%%J%%%%%%j%jJ%%%%%%%%Jj%%j%%J%%%%%%%%%%J%%%j%%%%%
1265E9%%%%%%%%%%j%J%%j%%%%J%%%%%%%JjJ%%%j%%%%%%%%%jJ%%J%%%%%%%j%%%%%%%%%%J%%
1258F0%j%%%J%j%%%%j%J%%%J%j%%%%J%%%%j%%%%j%%%%%%J%%%%%%J%%%%%%%%j%%%%%%%%%jJ
1250E9%%%J%%j%%%%%%%%%%%%%%%%%%%%%%%%%%J%%%%%j%J%%j%%%%%%%J%%j%%%%%j%J%%%%%%
1243E9%%%%%J%%%%%%%%%%%jJ%%j%%%%J%%%%j%%%j%%J%%%%%%%%%%%%%%%%%%%%%Jj%%j%%%J%
1235E9%J%%%%%%%%%j%%%%%jJ%%%%%j%%%J%%%%%%%%%J%j%%%%%%%%jJ%J%%%%%j%%%%%%%Jj%J
1228F0%j%%%%%%%%J%%%%j%%%%Jj%%%J%%%%j%J%%%%%%j%%%%%%J%%%%%%%j%%%%%%%J%%%%%%%
$$ plain form
1280 60 60 60 59 59 59 59 58 59 59 59 59 60 60 60 60 60 60 60 59 59 59 59 59 59 59 58 59 59 59 59 59 59 59 59 59 60 60 60 59 59 59 59 59 59 59 59 60 60 60 60 60 60 60 60 60 60 59 59 59 59 59 59 59 59 59 59 59 59 59 60
1272 60 60 60 60 60 60 60 60 60 60 60 60 59 59 59 59 59 60 60 60 60 59 59 59 60 60 60 60 60 60 60 59 59 58 59 59 59 59 59 59 59 59 59 60 59 59 59 58 58 58 59 59 59 59 59 59 59 59 59 59 59 60 60 60 60 59 59 59 59 59 59
1265 59 59 59 59 59 59 59 59 59 59 59 58 58 59 59 59 58 58 58 58 58 59 59 59 59 59 59 59 59 60 59 60 60 60 60 59 59 59 59 59 59 59 59 59 59 58 59 59 59 60 60 60 60 60 60 60 60 59 59 59 59 59 59 59 59 59 59 59 60 60 60
1258 60 60 59 59 59 59 60 60 59 59 59 59 59 58 58 59 59 59 59 60 60 59 59 59 59 59 60 60 60 60 60 59 59 59 59 59 58 58 58 58 58 58 58 59 59 59 59 59 59 59 60 60 60 60 60 60 60 60 60 59 59 59 59 59 59 59 59 59 59 58 59
1250 59 59 59 59 60 60 60 59 59 59 59 59 59 59 59 59 59 59 59 59 59 59 59 59 59 59 59 59 59 59 59 59 59 59 60 60 60 60 60 60 59 59 60 60 60 59 59 59 59 59 59 59 59 60 60 60 59 59 59 59 59 59 58 58 59 59 59 59 59 59 59
1243 59 59 59 59 59 59 60 60 60 60 60 60 60 60 60 60 60 60 59 60 60 60 59 59 59 59 59 60 60 60 60 60 59 59 59 59 58 58 58 59 59 59 59 59 59 59 59 59 59 59 59 59 59 59 59 59 59 59 59 59 59 60 59 59 59 58 58 58 58 59 59
1235 59 59 60 60 60 60 60 60 60 60 60 60 59 59 59 59 59 59 58 59 59 59 59 59 59 58 58 58 58 59 59 59 59 59 59 59 59 59 59 60 60 59 59 59 59 59 59 59 59 59 58 59 59 60 60 60 60 60 60 59 59 59 59 59 59 59 59 60 59 59 60
1228 60 60 59 59 59 59 59 59 59 59 59 60 60 60 60 60 59 59 59 59 59 60 59 59 59 59 60 60 60 60 60 59 59 60 60 60 60 60 60 60 59 59 59 59 59 59 59 60 60 60 60 60 60 60 60 59 59 59 59 59 59 59 59 60 60 60 60 60 60 60 60
1220F0%%%%%%%j%%%Jj%%j%J%%%%%%%%%%%%%%%%%%J%%%j%J%%%%j%%%J%%%%j%%J%%j%%J%%%j
1213E9%J%%%%%%%%Jj%%%%%%%%j%%%J%j%J%%%j%%%%%%%J%%%%%%%%%%%%%%%%%%%%%jJ%%%J%%
1206F1%j%%%%%%%%J%%%%%%%%j%%%%%J%%%%%%%%%j%%%%%%%Jj%%%%%%%%%%J%%%%%J%%%%j%%%
1198F1%%%%J%j%%j%J%%j%%%%%%%%%%%%%j%J%%%%%%%%%%J%%%%j%%%j%%%%J%%%%%%%%%%%%%%
1191F0%%jJ%%%%J%%%%%%%%%%%%%%%%j%%J%j%j%%%J%j%%%%%%%J%%%%Jj%%%%%%%%%%%Jj%%%%
1183F0Jj%j%%%%%%%%J%%%%%%%%%%%%%%jJj%%J%%%%%%%%%%%j%J%%%Jj%%%%%%%%%%%%%%%%%%
1176F0%%%%%%Jj%%%%%%%%%%%%%%%%%%%%%%%%%%%%%%%%%%J%j%%%%%%%%%%%%%%%%%%%%%%%%%
1169F0%%%%J%%%%%j%%J%j%%%%%%%%%%%%%%%%%%%%%%%%%%%%j%%JJ%%%%j%%%jJ%%%%%%%jJ%%
$$ plain form
1220 60 60 60 60 60 60 60 60 59 59 59 59 60 59 59 59 58 58 59 59 59 59 59 59 59 59 59 59 59 59 59 59 59 59 59 59 59 60 60 60 60 59 59 60 60 60 60 60 59 59 59 59 60 60 60 60 60 59 59 59 60 60 60 59 59 59 60 60 60 60 59
1213 59 59 60 60 60 60 60 60 60 60 60 61 60 60 60 60 60 60 60 60 60 59 59 59 59 60 60 59 59 60 60 60 60 59 59 59 59 59 59 59 59 60 60 60 60 60 60 60 60 60 60 60 60 60 60 60 60 60 60 60 60 60 60 59 60 60 60 60 61 61 61
1206 61 61 60 60 60 60 60 60 60 60 60 61 61 61 61 61 61 61 61 61 60 60 60 60 60 60 61 61 61 61 61 61 61 61 61 61 60 60 60 60 60 60 60 60 61 60 60 60 60 60 60 60 60 60 60 60 61 61 61 61 61 61 62 62 62 62 62 61 61 61 61
1198 61 61 61 61 61 62 62 61 61 61 60 60 61 61 61 60 60 60 60 60 60 60 60 60 60 60 60 60 60 59 59 60 60 60 60 60 60 60 60 60 60 60 61 61 61 61 61 60 60 60 60 59 59 59 59 59 60 60 60 60 60 60 60 60 60 60 60 60 60 60 60
1191 60 60 60 59 60 60 60 60 60 61 61 61 61 61 61 61 61 61 61 61 61 61 61 61 61 61 60 60 60 61 61 60 60 59 59 59 59 60 60 59 59 59 59 59 59 59 59 60 60 60 60 60 61 60 60 60 60 60 60 60 60 60 60 60 60 61 60 60 60 60 60
1183 60 61 60 60 59 59 59 59 59 59 59 59 59 60 60 60 60 60 60 60 60 60 60 60 60 60 60 60 59 60 59 59 59 60 60 60 60 60 60 60 60 60 60 60 60 59 59 60 60 60 60 61 60 60 60 60 60 60 60 60 60 60 60 60 60 60 60 60 60 60 60
1176 60 60 60 60 60 60 60 61 60 60 60 60 60 60 60 60 60 60 60 60 60 60 60 60 60 60 60 60 60 60 60 60 60 60 60 60 60 60 60 60 60 60 60 61 61 60 60 60 60 60 60 60 60 60 60 60 60 60 60 60 60 60 60 60 60 60 60 60 60 60 60
1169 60 60 60 60 60 61 61 61 61 61 61 60 60 60 61 61 60 60 60 60 60 60 60 60 60 60 60 60 60 60 60 60 60 60 60 60 60 60 60 60 60 60 60 60 60 59 59 59 60 61 61 61 61 61 60 60 60 60 59 60 60 60 60 60 60 60 60 59 60 60 60
1161F0%J%%%%%%%j%%%%%%Jj%%%%%%%%%%%%%%%%%%%%%j%J%%%%%%%%%%j%%%%%%%%%%J%%%j%%
1154E9%%%%%%%%%%%%%%%J%%%j%%%%%%%J%%%%%j%%%J%%%%%j%%%J%%%%j%%%%%%%%%%%J%%%%%
1146F0%%Jj%%%%%%%%jJ%%%%%%%%%%%%%%%j%%jJ%%%%%J%%%%J%%j%%%%%%%%%J%J%%j%%%%%%%
1139F1%%%%%%%%%%%%%%%j%%%%%%J%%%%%%%%%%%%%%%J%%%%%%%%%%J%%%%%%Jj%%%%%%%%%j%%
1131F2%%%%%%%%%%%%%%%%j%J%%%%%%%%%J%%%j%%J%%%%%%J%%%%%%%%%%%%%%%J%%%%j%j%%%%
1124F3%%%%%j%%%%%%%%%%%%%%%%%j%%J%%%%%%%%%jJ%%%%%%%%%%J%%%%%%J%%%j%%%%%%j%%%
1117F2%%%%%j%%%%%%%%J%%j%%j%%%J%%%%%%%%%%%%jJ%%J%%%%%%%J%%%%j%J%j%%%%J%%j%%%
1109F2%%j%%J%%%%%%%%%%%%%%%%%%%%%%%%%%%%%%%%%%%%%j%J%%%%%%J%%%j%%%%%%%%%%J%j
$$ plain form
1161 60 60 61 61 61 61 61 61 61 61 60 60 60 60 60 60 60 61 60 60 60 60 60 60 60 60 60 60 60 60 60 60 60 60 60 60 60 60 60 60 59 59 60 60 60 60 60 60 60 60 60 60 60 59 59 59 59 59 59 59 59 59 59 59 60 60 60 60 59 59 59
1154 59 59 59 59 59 59 59 59 59 59 59 59 59 59 59 59 60 60 60 60 59 59 59 59 59 59 59 59 60 60 60 60 60 60 59 59 59 59 60 60 60 60 60 60 59 59 59 59 60 60 60 60 60 59 59 59 59 59 59 59 59 59 59 59 59 60 60 60 60 60 60
1146 60 60 60 61 60 60 60 60 60 60 60 60 60 59 60 60 60 60 60 60 60 60 60 60 60 60 60 60 60 60 59 59 59 58 59 59 59 59 59 59 60 60 60 60 60 61 61 61 60 60 60 60 60 60 60 60 60 60 61 61 62 62 62 61 61 61 61 61 61 61 61
1139 61 61 61 61 61 61 61 61 61 61 61 61 61 61 61 61 60 60 60 60 60 60 60 61 61 61 61 61 61 61 61 61 61 61 61 61 61 61 61 62 62 62 62 62 62 62 62 62 62 62 63 63 63 63 63 63 63 64 63 63 63 63 63 63 63 63 63 63 62 62 62
1131 62 62 62 62 62 62 62 62 62 62 62 62 62 62 62 62 62 61 61 62 62 62 62 62 62 62 62 62 62 63 63 63 63 62 62 62 63 63 63 63 63 63 63 64 64 64 64 64 64 64 64 64 64 64 64 64 64 64 64 65 65 65 65 65 64 64 63 63 63 63 63
1124 63 63 63 63 63 63 62 62 62 62 62 62 62 62 62 62 62 62 62 62 62 62 62 62 61 61 61 62 62 62 62 62 62 62 62 62 62 61 62 62 62 62 62 62 62 62 62 62 62 63 63 63 63 63 63 63 64 64 64 64 63 63 63 63 63 63 63 62 62 62 62
1117 62 62 62 62 62 62 61 61 61 61 61 61 61 61 61 62 62 62 61 61 61 60 60 60 60 61 61 61 61 61 61 61 61 61 61 61 61 61 60 61 61 61 62 62 62 62 62 62 62 62 63 63 63 63 63 62 62 63 63 62 62 62 62 62 63 63 63 62 62 62 62
1109 62 62 62 61 61 61 62 62 62 62 62 62 62 62 62 62 62 62 62 62 62 62 62 62 62 62 62 62 62 62 62 62 62 62 62 62 62 62 62 62 62 62 62 62 61 61 62 62 62 62 62 62 62 63 63 63 63 62 62 62 62 62 62 62 62 62 62 62 63 63 62
1102F2%%J%%%j%%J%%%%%%%jJ%%j%%Jj%J%%%%%%%%j%%%%%j%%%%Jj%jJ%%%J%%%%%%j%J%%%%%
1094F2jJ%%%J%j%%%%%%j%%J%%%%%J%%%j%%%%%%j%%%%%%J%%%%j%%%%%%%%%%%%%jJ%%%%%%J%
1087F2j%%%%%%%%j%%%%%%J%%%%%%%%%%j%j%J%%%%%%%%%%J%%%%%j%%%J%%%%%%%%%j%%%%%%%
1080F0%%%%%%%%J%%%%%%%j%%J%%%%%j%%%%%j%JjJ%%%%%%%%%%%%%j%%%J%%%%%%%j%%%J%%%J
1072F1j%%%%%%j%%%%%%%%%%J%j%%%%%J%j%%%J%%%%%%%%%j%%%%%%%%%%j%%%%%J%%%%%%%%%%
1065E9%%%%%%%%%%%J%%%%%%j%%%J%%%%%%%j%%%%%%%%%J%%j%%J%%j%%%J%%%%%%JjJ%j%%Jj%
1057F0%%%%jJ%%%%%%%%%%%%%%%%%%%%%%%jJ%%%%J%%%%%j%%%%%%%%%%j%%%%%%%%J%%%%%%%%
1050F0%j%%%%J%%%%%%%%%%%%%%%%%%%%%J%%%%JJ%%%%%j%%%j%%%%j%%%J%%%j%%J%%%%%j%J%
$$ plain form
1102 62 62 62 63 63 63 63 62 62 62 63 63 63 63 63 63 63 63 62 63 63 63 62 62 62 63 62 62 63 63 63 63 63 63 63 63 63 62 62 62 62 62 62 61 61 61 61 61 62 61 61 60 61 61 61 61 62 62 62 62 62 62 62 61 61 62 62 62 62 62 62
1094 62 61 62 62 62 62 63 63 62 62 62 62 62 62 62 61 61 61 62 62 62 62 62 62 63 63 63 63 62 62 62 62 62 62 62 61 61 61 61 61 61 61 62 62 62 62 62 61 61 61 61 61 61 61 61 61 61 61 61 61 61 60 61 61 61 61 61 61 61 62 62
1087 62 61 61 61 61 61 61 61 61 61 60 60 60 60 60 60 60 61 61 61 61 61 61 61 61 61 61 61 60 60 59 59 60 60 60 60 60 60 60 60 60 60 60 61 61 61 61 61 61 60 60 60 60 61 61 61 61 61 61 61 61 61 61 60 60 60 60 60 60 60 60
1080 60 60 60 60 60 60 60 60 60 61 61 61 61 61 61 61 61 60 60 60 61 61 61 61 61 61 60 60 60 60 60 60 59 59 60 59 60 60 60 60 60 60 60 60 60 60 60 60 60 60 59 59 59 59 60 60 60 60 60 60 60 60 59 59 59 59 60 60 60 60 61
1072 61 60 60 60 60 60 60 60 59 59 59 59 59 59 59 59 59 59 59 60 60 59 59 59 59 59 59 60 60 59 59 59 59 60 60 60 60 60 60 60 60 60 60 59 59 59 59 59 59 59 59 59 59 59 58 58 58 58 58 58 59 59 59 59 59 59 59 59 59 59 59
1065 59 59 59 59 59 59 59 59 59 59 59 59 60 60 60 60 60 60 60 59 59 59 59 60 60 60 60 60 60 60 60 59 59 59 59 59 59 59 59 59 59 60 60 60 59 59 59 60 60 60 59 59 59 59 60 60 60 60 60 60 60 61 60 61 61 60 60 60 61 60 60
1057 60 60 60 60 60 59 60 60 60 60 60 60 60 60 60 60 60 60 60 60 60 60 60 60 60 60 60 60 60 60 59 60 60 60 60 60 61 61 61 61 61 61 60 60 60 60 60 60 60 60 60 60 60 59 59 59 59 59 59 59 59 59 60 60 60 60 60 60 60 60 60
1050 60 60 59 59 59 59 59 60 60 60 60 60 60 60 60 60 60 60 60 60 60 60 60 60 60 60 60 60 60 61 61 61 61 61 62 63 63 63 63 63 63 62 62 62 62 61 61 61 61 61 60 60 60 60 61 61 61 61 60 60 60 61 61 61 61 61 61 60 60 61 61
1042F1%%jJ%%%%%%%%%%%%%%%%%%%%jJ%%%%J%%%%J%%Jj%%j%%%%j%%%%j%%Jj%%%Jj%%%J%%j%
1035F0%%%%%%%Jj%%%J%%%%%%%%%%%%%%%%jJ%%%j%%%%J%J%%%j%%%%%j%jJ%%%%J%%%j%%%%J%
1028F1%%%%%%%%%%%%%%%j%%%%%%%j%J%%%%%%%%%%%%J%%j%%%%%j%J%%%%%%%%J%%%%%%%%%%j
1020F0%%%%%J%j%%%%%%J%%%%%j%j%%J%%%%%%%%%%%%jJ%%J%%j%%%%%%%%%%%%j%J%%%%%%%%%
1013F0%%%J%%%%%%%J%%%j%j%%%%%%%%%%%%%%%%j%%J%j%%%%%%%%%%%%J%%%%%%%%%%%%%j%%%
1005E9%%J%%%%%%%%%J%%%%J%%%%jJ%%%%%%%%Jj%%%%%J%%%%J%%J%%JJJJJJJJJJKJJJKJKKKK
998I1MNOQJ0J3J6K0K3K5K4K1J4QJoj2j7k1k2k3k0j8j4j3rronlkkkkjkjjjjkj%jjjj%%j%%%
992F8j%%j%j%%%%%%%j%j%%%%%%%%%%%%jJ%%%%%%j%J%%%%%%%%%%%j%J%%j%%%%%%%%%%%%J%%
$$ plain form
1042 61 61 61 60 61 61 61 61 61 61 61 61 61 61 61 61 61 61 61 61 61 61 61 61 61 60 61 61 61 61 61 62 62 62 62 62 63 63 63 64 63 63 63 62 62 62 62 62 61 61 61 61 61 60 60 60 61 60 60 60 60 61 60 60 60 60 61 61 61 60 60
1035 60 60 60 60 60 60 60 60 61 60 60 60 60 61 61 61 61 61 61 61 61 61 61 61 61 61 61 61 61 61 60 61 61 61 61 60 60 60 60 60 61 61 62 62 62 62 61 61 61 61 61 61 60 60 59 60 60 60 60 60 61 61 61 61 60 60 60 60 60 61 61
1028 61 61 61 61 61 61 61 61 61 61 61 61 61 61 61 61 60 60 60 60 60 60 60 60 59 59 60 60 60 60 60 60 60 60 60 60 60 60 60 61 61 61 60 60 60 60 60 60 59 59 60 60 60 60 60 60 60 60 60 61 61 61 61 61 61 61 61 61 61 61 60
1020 60 60 60 60 60 60 61 61 60 60 60 60 60 60 60 61 61 61 61 61 61 60 60 59 59 59 60 60 60 60 60 60 60 60 60 60 60 60 60 59 60 60 60 61 61 61 60 60 60 60 60 60 60 60 60 60 60 60 60 59 59 60 60 60 60 60 60 60 60 60 60
1013 60 60 60 60 61 61 61 61 61 61 61 61 62 62 62 62 61 61 60 60 60 60 60 60 60 60 60 60 60 60 60 60 60 60 60 59 59 59 60 60 59 59 59 59 59 59 59 59 59 59 59 59 59 60 60 60 60 60 60 60 60 60 60 60 60 60 60 59 59 59 59
1005 59 59 59 60 60 60 60 60 60 60 60 60 60 61 61 61 61 61 62 62 62 62 62 61 62 62 62 62 62 62 62 62 62 63 62 62 62 62 62 62 63 63 63 63 63 64 64 64 65 65 65 66 67 68 69 70 71 72 73 74 75 77 78 79 80 82 83 85 87 89 91
998 91 95 100 106 114 124 137 153 173 196 221 245 266 280 288 289 283 271 254 233 211 188 168 150 136 123 114 105 99 94 91 89 87 85 83 82 80 79 78 77 76 74 73 73 72 71 70 69 69 69 68 68 68 68
992 68 67 67 67 66 66 65 65 65 65 65 65 65 65 64 64 63 63 63 63 63 63 63 63 63 63 63 63 63 62 63 63 63 63 63 63 63 62 62 63 63 63 63 63 63 63 63 63 63 63 63 62 62 63 63 63 62 62 62 62 62 62 62 62 62 62 62 62 62 63 63 63
985F3%%%J%%%%%%%%j%%J%jJJJJJJ%%%%%jj%jjjj%j%%%%%%%%j%%%%%%%%%%%%%j%%%%%J%%%%
977F1J%%%%%%Jj%j%%%jJ%%%%%j%%%%%Jj%%%%J%%%%%%J%j%%Jj%j%%%J%%%%%%%%%%%%%%%%%%
970F1%%J%%%%%%%J%%j%%%%%%%%%%%%%%%%%%%%%%j%%%%%%%%%%%%%%%J%%%j%%%%%%%%%j%%J%
962F1%%%%%%%%J%jJ%%%%j%%%%%%%%%%%%%%%%%%%%%J%j%j%J%J%%%%%J%j%%%%%%%j%J%%%%j%
955F1%%%%%%%%%Jj%J%%%%%j%%J%%%J%%%%%%%%%%%%%j%%%J%%%%%%%%%%%%%%%%%%%%%%%%%%J
947F4%%%Jj%%%%%%%j%%J%%j%%%%J%Jj%%%%J%%%%J%%%JJJJJ%KJKJJJ%%%j%jjjjkjjj%j%%j%
940F7%%%%%%j%%%%J%j%%%%%%%%JjJ%j%%%JJ%%%%%%%J%J%J%J%JJJJKKLLMMNOPPONLJjklnoo
932A11onommlklkjjjj%j%%j%j%%%%%j%%%%%%j%%%%%%%%%%%%%j%J%%%%%%%%J%%%%%%%%%%j%
$$ plain form
985 63 63 63 63 64 64 64 64 64 64 64 64 64 63 63 63 64 64 63 64 65 66 67 68 69 69 69 69 69 69 68 67 67 66 65 64 63 63 62 62 62 62 62 62 62 62 62 61 61 61 61 61 61 61 61 61 61 61 61 61 61 60 60 60 60 60 60 61 61 61 61 61
977 61 62 62 62 62 62 62 62 63 62 62 61 61 61 61 60 61 61 61 61 61 61 60 60 60 60 60 60 61 60 60 60 60 60 61 61 61 61 61 61 61 62 62 61 61 61 62 61 61 60 60 60 60 61 61 61 61 61 61 61 61 61 61 61 61 61 61 61 61 61 61 61
970 61 61 61 62 62 62 62 62 62 62 62 63 63 63 62 62 62 62 62 62 62 62 62 62 62 62 62 62 62 62 62 62 62 62 62 62 62 61 61 61 61 61 61 61 61 61 61 61 61 61 61 61 61 62 62 62 62 61 61 61 61 61 61 61 61 61 61 60 60 60 61 61
962 61 61 61 61 61 61 61 61 61 62 62 61 62 62 62 62 62 61 61 61 61 61 61 61 61 61 61 61 61 61 61 61 61 61 61 61 61 61 61 62 62 61 61 60 60 61 61 62 62 62 62 62 62 63 63 62 62 62 62 62 62 62 62 61 61 62 62 62 62 62 61 61
955 61 61 61 61 61 61 61 61 61 61 62 61 61 62 62 62 62 62 62 61 61 61 62 62 62 62 63 63 63 63 63 63 63 63 63 63 63 63 63 63 62 62 62 62 63 63 63 63 63 63 63 63 63 63 63 63 63 63 63 63 63 63 63 63 63 63 63 63 63 63 63 64
947 64 64 64 64 65 64 64 64 64 64 64 64 64 63 63 63 64 64 64 63 63 63 63 63 64 64 65 64 64 64 64 64 65 65 65 65 65 66 66 66 66 67 68 69 70 71 71 73 74 76 77 78 79 79 79 79 78 78 77 76 75 74 72 71 70 69 69 68 68 68 67 67
940 67 67 67 67 67 67 67 66 66 66 66 66 67 67 66 66 66 66 66 66 66 66 66 67 66 67 67 66 66 66 66 67 68 68 68 68 68 68 68 68 69 69 70 70 71 71 72 72 73 74 75 76 78 80 83 86 90 94 99 105 112 119 125 130 133 134 133 131 128 123 117 111
932 111 105 100 94 90 86 83 81 78 76 75 74 73 72 72 71 71 71 70 70 69 69 69 69 69 69 68 68 68 68 68 68 68 67 67 67 67 67 67 67 67 67 67 67 67 67 67 66 66 67 67 67 67 67 67 67 67 67 68 68 68 68 68 68 68 68 68 68 68 67 67
925F7%%%J%%j%%%%%%%%%%%%J%%%%j%j%J%J%%%%%%%J%j%%%%%%%%%%%%J%%%j%%Jj%J%%%J%%j
917F9%%%%%J%%%%%Jj%%J%%%%%%%%J%%%%%%%%J%J%%%%%jJ%%J%%%%J%%%%J%%%%j%%%%%%%%%%
910G6%%%j%%%%%J%%%%J%%%%JJ%J%%JJ%J%%J%J%%J%%%j%%j%J%%%%%j%%%%%%%%j%%%%%%Jj%J
902H4%j%%%%Jj%%%%%%%%%J%%J%%%J%JJ%J%%%%%J%JJ%JJ%JJJ%JJKKLLNOPQRRQNKjknoqqqpo
895A17mlkjjjjj%kkjjjkj%j%%j%%%%J%j%%%%J%%j%%%j%%J%%%j%%%%%%%%%%%%J%%%%%J%%%%
887I2J%%%J%JJ%J%JJJKJJJJJJ%%%%%j%%JJ%JJJ%JJJJKJJKJKKJKKKKKKKLLKLLLLMNNMNNNOO
880B07ONPOPPPQQQQRQRRPPOONNMNNMNNMNMNMLJJklnprj1j3j3j5j5j5j4j5j3j3j2j0j0qqpp
874A85oonmnmlmllmlklkljkkkjjjj%kjjjkkjjjkj%jjjj%jjj%%%jj%%j%j%jj%j%%%%%j%j%%
$$ plain form
925 67 67 67 67 68 68 68 67 67 67 67 67 67 67 67 67 67 67 67 67 68 68 68 68 68 67 67 66 66 67 67 68 68 68 68 68 68 68 68 69 69 68 68 68 68 68 68 68 68 68 68 68 68 68 69 69 69 69 68 68 68 69 68 68 69 69 69 69 70 70 70 69
917 69 69 69 69 69 69 70 70 70 70 70 70 71 70 70 70 71 71 71 71 71 71 71 71 71 72 72 72 72 72 72 72 72 72 73 73 74 74 74 74 74 74 73 74 74 74 75 75 75 75 75 76 76 76 76 76 77 77 77 77 77 76 76 76 76 76 76 76 76 76 76 76
910 76 76 76 76 75 75 75 75 75 75 76 76 76 76 76 77 77 77 77 77 78 79 79 80 80 80 81 82 82 83 83 83 84 84 85 85 85 86 86 86 86 85 85 85 84 84 85 85 85 85 85 85 84 84 84 84 84 84 84 84 84 83 83 83 83 83 83 83 84 83 83 84
902 84 84 83 83 83 83 83 84 83 83 83 83 83 83 83 83 83 83 84 84 84 85 85 85 85 86 86 87 88 88 89 89 89 89 89 89 90 90 91 92 92 93 94 94 95 96 97 97 98 99 101 103 106 109 114 120 127 135 144 153 161 166 168 167 165 160 154 146 138 130 123 117
895 117 113 110 108 107 106 105 104 103 103 101 99 98 97 96 94 93 93 92 92 92 91 91 91 91 91 92 92 91 91 91 91 91 92 92 92 91 91 91 91 90 90 90 91 91 91 91 90 90 90 90 90 90 90 90 90 90 90 90 90 91 91 91 91 91 91 92 92 92 92 92
887 92 93 93 93 93 94 94 95 96 96 97 97 98 99 100 102 103 104 105 106 107 108 108 108 108 108 108 107 107 107 108 109 109 110 111 112 112 113 114 115 116 118 119 120 122 123 125 127 128 130 132 134 136 138 140 142 145 148 150 153 156 159 162 166 171 176 180 185 190 195 201 207
880 207 213 218 225 231 238 245 252 260 268 276 284 293 301 310 319 326 333 339 345 350 355 359 364 369 373 378 383 387 392 396 401 405 408 409 410 408 405 400 393 384 373 360 347 332 317 302 288 273 260 247 235 225 215 207 199 192 185
874 185 179 173 168 164 159 155 152 148 145 142 138 135 133 130 128 125 124 122 120 118 117 116 115 114 114 112 111 110 109 107 105 104 103 102 100 99 99 98 97 96 95 95 94 93 92 92 92 92 91 90 90 90 89 89 88 88 87 86 86 85 85 85 85 85 85 84 84 83 83 83
866H3%%j%%%%%%J%%%%j%%%J%%J%JJJKKKKJJ%%%jkjkkkkjkjjjjjj%%%%JJ%J%J%Jjjjj%jj%j
859G4j%j%j%%%%%%%%%J%j%%%j%%J%j%%%%%J%J%%%J%%%%%jj%%%j%jJ%%%%%j%j%%%%%%%%%%j
851F7%%%%%%j%J%%%%J%jj%%%%j%J%%%%%jJ%%%%%%%j%%%%J%%%%%%%%J%%%%%%j%%%%%%%%%%%
844F6J%%%%%%%j%%%j%%%%%%J%j%%j%%Jj%%%%%%%%%%%%%%%%%%%%%%J%%%j%%%%j%%%%%%%j%J
836F3%%%%%%%%%%%%%%%%%%%%%%%%%%%%j%%%%%%%Jj%%%%J%%%%%%%j%%%J%%%j%j%%%%%%%%%%
829F1%%%%%%%%%%%J%%jJ%jj%%J%%%%%%J%%%%%%%%%%%J%%j%j%%j%%%J%%%%%%%%%%%%%%%%%%
821F1%%%%%%%%%%%j%%%J%%%%%%j%J%%j%%%%%%%j%J%%%%%%%%%%%%%%%%%%%Jj%%%%%%%%%%%%
814F0%%%%%%%%%%%%%j%%Jj%%%J%%j%%J%%j%%%%%%%%J%j%%%%%%%%%%%%%%%%%%%%%%%%%%%%%
$$ plain form
866 83 83 83 82 82 82 82 82 82 82 83 83 83 83 83 82 82 82 82 83 83 83 84 84 85 86 87 89 91 93 95 96 97 97 97 97 96 94 93 91 89 87 85 84 82 81 80 79 78 77 76 76 76 76 76 77 78 78 79 79 80 80 81 80 79 78 77 77 76 75 75 74
859 74 73 73 72 72 71 71 71 71 71 71 71 71 71 71 72 72 71 71 71 71 70 70 70 71 71 70 70 70 70 70 70 71 71 72 72 72 72 73 73 73 73 73 73 72 71 71 71 71 70 70 69 70 70 70 70 70 70 69 69 68 68 68 68 68 68 68 68 68 68 68 67
851 67 67 67 67 67 67 67 66 66 67 67 67 67 67 68 68 67 66 66 66 66 66 65 65 66 66 66 66 66 66 65 66 66 66 66 66 66 66 66 65 65 65 65 65 66 66 66 66 66 66 66 66 66 67 67 67 67 67 67 67 66 66 66 66 66 66 66 66 66 66 66 66
844 66 67 67 67 67 67 67 67 67 66 66 66 66 65 65 65 65 65 65 65 66 66 65 65 65 64 64 64 65 64 64 64 64 64 64 64 64 64 64 64 64 64 64 64 64 64 64 64 64 64 64 64 65 65 65 65 64 64 64 64 64 63 63 63 63 63 63 63 63 62 62 63
836 63 63 63 63 63 63 63 63 63 63 63 63 63 63 63 63 63 63 63 63 63 63 63 63 63 63 63 63 63 62 62 62 62 62 62 62 62 63 62 62 62 62 62 63 63 63 63 63 63 63 63 62 62 62 62 63 63 63 63 62 62 61 61 61 61 61 61 61 61 61 61 61
829 61 61 61 61 61 61 61 61 61 61 61 61 62 62 62 61 62 62 61 60 60 60 61 61 61 61 61 61 61 62 62 62 62 62 62 62 62 62 62 62 62 63 63 63 62 62 61 61 61 60 60 60 60 61 61 61 61 61 61 61 61 61 61 61 61 61 61 61 61 61 61 61
821 61 61 61 61 61 61 61 61 61 61 61 61 60 60 60 60 61 61 61 61 61 61 61 60 60 61 61 61 60 60 60 60 60 60 60 60 59 59 60 60 60 60 60 60 60 60 60 60 60 60 60 60 60 60 60 60 60 60 61 60 60 60 60 60 60 60 60 60 60 60 60 60
814 60 60 60 60 60 60 60 60 60 60 60 60 60 60 59 59 59 60 59 59 59 59 60 60 60 59 59 59 60 60 60 59 59 59 59 59 59 59 59 59 60 60 59 59 59 59 59 59 59 59 59 59 59 59 59 59 59 59 59 59 59 59 59 59 59 59 59 59 59 59 59 59
806E9%%%%%%%%%%Jj%%%%%%%%%%%%%%%j%%%%J%%%%%%%%%%%%%%%%%%%%j%%%%%%%%%%%%%J%j%
798E8%%%%J%%%%%%%%%%%%%%j%%%%%%%%%%%%%%%%%%%%%%%%%j%%%J%%%%%%%%%%%%%%%j%%J%%
791E8%%%%%%%%%jJ%%J%%j%J%j%%%%%J%%%J%%J%JJJKKLLMLLKJJjkllllmkkjjjjj%j%%j%%%%
783E8%%%%%%%%%%%%%%Jj%%%%%j%J%%%%%Jj%%%j%%J%%%%%%%J%j%%%%%J%%j%%J%%%%J%%%j%%
776E9%%J%j%%%%%%%%%j%%%J%jJ%%%Jj%%%%%%%%%%%%%%%%%%%%%%%%j%%%%%%%%%%%%%%%%%%%
768E8%%%%%%%%%%%%j%%%%J%J%j%%j%%%Jj%%J%%%%%%%%%%%J%%%%%j%%%%%%%%%%%%%jJ%%%%%
761E8%%%%%%%%j%%%J%%%%%%%%j%%%J%%%%%J%%%%%%%%%%%%%%%%%%J%%%%jJ%%j%%%%%%%%%%j
753E8%%J%Jj%j%%%%%%%%%%%%%%%%%%%%%%%%%%J%%%j%%%%%%J%%j%%%%%%%%%J%%%%%%%%j%%%
$$ plain form
806 59 59 59 59 59 59 59 59 59 59 59 60 59 59 59 59 59 59 59 59 59 59 59 59 59 59 59 59 58 58 58 58 58 59 59 59 59 59 59 59 59 59 59 59 59 59 59 59 59 59 59 59 59 59 58 58 58 58 58 58 58 58 58 58 58 58 58 58 59 59 58 58
798 58 58 58 58 58 59 59 59 59 59 59 59 59 59 59 59 59 59 59 59 58 58 58 58 58 58 58 58 58 58 58 58 58 58 58 58 58 58 58 58 58 58 58 58 58 58 57 57 57 57 58 58 58 58 58 58 58 58 58 58 58 58 58 58 58 58 57 57 57 58 58 58
791 58 58 58 58 58 58 58 58 58 58 57 58 58 58 59 59 59 58 58 59 59 58 58 58 58 58 58 59 59 59 59 60 60 60 61 61 62 63 64 66 68 71 74 78 81 84 86 87 88 87 85 82 79 76 73 69 67 65 64 63 62 61 60 60 59 59 59 58 58 58 58 58
783 58 58 58 58 58 58 58 58 58 58 58 58 58 58 58 59 58 58 58 58 58 58 57 57 58 58 58 58 58 58 59 58 58 58 58 57 57 57 58 58 58 58 58 58 58 58 59 59 58 58 58 58 58 58 59 59 59 58 58 58 59 59 59 59 59 60 60 60 60 59 59 59
776 59 59 59 60 60 59 59 59 59 59 59 59 59 59 59 58 58 58 58 59 59 58 59 59 59 59 60 59 59 59 59 59 59 59 59 59 59 59 59 59 59 59 59 59 59 59 59 59 59 59 59 59 58 58 58 58 58 58 58 58 58 58 58 58 58 58 58 58 58 58 58 58
768 58 58 58 58 58 58 58 58 58 58 58 58 58 57 57 57 57 57 58 58 59 59 58 58 58 57 57 57 57 58 57 57 57 58 58 58 58 58 58 58 58 58 58 58 58 59 59 59 59 59 59 58 58 58 58 58 58 58 58 58 58 58 58 58 58 57 58 58 58 58 58 58
761 58 58 58 58 58 58 58 58 58 57 57 57 57 58 58 58 58 58 58 58 58 58 57 57 57 57 58 58 58 58 58 58 59 59 59 59 59 59 59 59 59 59 59 59 59 59 59 59 59 59 59 60 60 60 60 60 59 60 60 60 59 59 59 59 59 59 59 59 59 59 59 58
753 58 58 58 59 59 60 59 59 58 58 58 58 58 58 58 58 58 58 58 58 58 58 58 58 58 58 58 58 58 58 58 58 58 58 58 59 59 59 59 58 58 58 58 58 58 58 59 59 59 58 58 58 58 58 58 58 58 58 58 59 59 59 59 59 59 59 59 59 58 58 58 58
746E8%%%%%%%%j%J%%%%%%jJ%%%%%%%%%J%j%%%%%%%%%%%%jJ%%%%%%%%%%%J%j%%%%%%%%%%%%
738E8%%%%%%%%%%%%J%%%%%%j%%%%%%%%%%%j%Jj%%%J%%%%%J%%%%%%j%%%%%%J%%%%%%%%%J%%
731F0%%%%J%%%%%j%%%j%%%%%j%%%%%j%%%%Jj%%%%%%Jj%%%%%%%%%%%%%%%%%j%%%J%%%%%j%J
723E7%J%j%%%%%%%%%%%%%%%j%J%%%%%%%%%%%%%%%%%%%%%j%%%%%%%%%%%%J%%j%%%%%%J%%%%
$$ plain form
746 58 58 58 58 58 58 58 58 58 57 57 58 58 58 58 58 58 58 57 58 58 58 58 58 58 58 58 58 58 59 59 58 58 58 58 58 58 58 58 58 58 58 58 58 57 58 58 58 58 58 58 58 58 58 58 58 58 59 59 58 58 58 58 58 58 58 58 58 58 58 58 58
738 58 58 58 58 58 58 58 58 58 58 58 58 58 59 59 59 59 59 59 59 58 58 58 58 58 58 58 58 58 58 58 58 57 57 58 57 57 57 57 58 58 58 58 58 58 59 59 59 59 59 59 59 58 58 58 58 58 58 58 59 59 59 59 59 59 59 59 59 59 60 60 60
731 60 60 60 60 60 61 61 61 61 61 61 60 60 60 60 59 59 59 59 59 59 58 58 58 58 58 58 57 57 57 57 57 58 57 57 57 57 57 57 57 58 57 57 57 57 57 57 57 57 57 57 57 57 57 57 57 57 57 57 56 56 56 56 57 57 57 57 57 57 56 56 57
723 57 57 58 58 57 57 57 57 57 57 57 57 57 57 57 57 57 57 57 57 56 56 57 57 57 57 57 57 57 57 57 57 57 57 57 57 57 57 57 57 57 57 57 57 56 56 56 56 56 56 56 56 56 56 56 56 56 57 57 57 56 56 56 56 56 56 56 57 57 57 57 57
$$ [...]
-2637F4
##END=		$$ NMR SPECTRUM
##END=		$$ LINK
