##TITLE=	13C
##JCAMP-DX=	6.0	$$ MestReNova 14.3.3-33362
##DATA TYPE=	LINK
##BLOCKS=	1    
##ORIGIN=	Mestrelab Research S.L.
##OWNER=	hrzepa
##$MNOVA/METADATA=	(DOCUMENT,BASE64)
eyJuYW1lIjoiRG9jdW1lbnQgMSIsInBhZ2VzIjpbeyJpdGVtcyI6WyIxIiAgICAgXX1dfQ==
##TITLE=	13C
##JCAMP-DX=	6.0	$$ MestReNova 14.3.3-33362
##DATA TYPE=	NMR SPECTRUM
##DATA CLASS=	XYDATA
##BLOCK_ID=	1
##ORIGIN=	Varian
##OWNER=	hrzepa
##NUMDIM=	1
##$MNOVA/METADATA=	(ITEM,BASE64)
eyJhbmdsZSI6MCwiYXhlcyI6eyJ4Ijp7Im1heCI6MjM0LjI2NDY1NzgxNzc5Nzc0LCJtaW4iOi0xNC4
yNjE1NDgyMzExMTU2NjF9LCJ5Ijp7Im1heCI6MjI2LjgyMjQzMTU2NDMzMTA1LCJtaW4iOi0yMi4yMD
A0NzUzMzUxMjExNTV9fSwicG9pbnRzIjpbeyJ4Ijo1MzIxLCJ5Ijo1ODM1fSx7IngiOjg3MjIsInkiO
jU4MzV9LHsieCI6ODcyMiwieSI6ODIwOH0seyJ4Ijo1MzIxLCJ5Ijo4MjA4fSx7IngiOjUzMjEsInki
OjU4MzV9XSwieiI6MH0=
##.OBSERVE FREQUENCY=	125.75317950000000167
##.OBSERVE NUCLEUS=	^13C
##.SOLVENT NAME=	cdcl3
##.PULSE SEQUENCE=	s2pul
##LONGDATE=	2019/04/27 10:27:35.000
##.ACQUISITIONMODE=	SIMULTANEOUS
##$ORIGINAL FORMAT=	Varian
##$MNOVA/SCALES_VERSION=	9
##$PARAMETER FILE=	(datafile, ASCII, /private/var/folders/bp/m_4195y96sx1d256lqvkcvym0000gq/T/aBHQ2iLfT8axxPZ7LXmKIw/13C/fid, 0)
$$ 
##$PARAMETER FILE=	(header, BASE64, /private/var/folders/bp/m_4195y96sx1d256lqvkcvym0000gq/T/aBHQ2iLfT8axxPZ7LXmKIw/13C/fid, 0)
AAAAAQAAAAEAAQAAAAAABAAEAAAABAAcAAAAyQAAAAE=
##$PARAMETER FILE=	(log, ASCII, /private/var/folders/bp/m_4195y96sx1d256lqvkcvym0000gq/T/aBHQ2iLfT8axxPZ7LXmKIw/13C/log, 0)
$$ Sat Apr 27 10:27:40 2019: Experiment started
$$ Sat Apr 27 10:29:56 2019: BS 1 completed
$$ Sat Apr 27 10:32:06 2019: BS 2 completed
$$ Sat Apr 27 10:34:18 2019: BS 3 completed
$$ Sat Apr 27 10:36:28 2019: BS 4 completed
$$ Sat Apr 27 10:38:39 2019: BS 5 completed
$$ Sat Apr 27 10:40:50 2019: BS 6 completed
$$ Sat Apr 27 10:43:01 2019: BS 7 completed
$$ Sat Apr 27 10:45:12 2019: BS 8 completed
$$ Sat Apr 27 10:47:23 2019: BS 9 completed
$$ Sat Apr 27 10:49:35 2019: BS 10 completed
$$ Sat Apr 27 10:51:46 2019: BS 11 completed
$$ Sat Apr 27 10:53:59 2019: BS 12 completed
$$ Sat Apr 27 10:56:08 2019: BS 13 completed
$$ Sat Apr 27 10:58:19 2019: BS 14 completed
$$ Sat Apr 27 11:00:30 2019: BS 15 completed
$$ Sat Apr 27 11:02:41 2019: BS 16 completed
$$ Sat Apr 27 11:04:52 2019: BS 17 completed
$$ Sat Apr 27 11:07:03 2019: BS 18 completed
$$ Sat Apr 27 11:09:15 2019: BS 19 completed
$$ Sat Apr 27 11:11:26 2019: BS 20 completed
$$ Sat Apr 27 11:13:37 2019: BS 21 completed
$$ Sat Apr 27 11:15:48 2019: BS 22 completed
$$ Sat Apr 27 11:17:59 2019: BS 23 completed
$$ Sat Apr 27 11:20:10 2019: BS 24 completed
$$ Sat Apr 27 11:22:21 2019: BS 25 completed
$$ Sat Apr 27 11:24:32 2019: BS 26 completed
$$ Sat Apr 27 11:26:43 2019: BS 27 completed
$$ Sat Apr 27 11:28:55 2019: BS 28 completed
$$ Sat Apr 27 11:31:06 2019: BS 29 completed
$$ Sat Apr 27 11:33:17 2019: BS 30 completed
$$ Sat Apr 27 11:35:28 2019: BS 31 completed
$$ Sat Apr 27 11:37:39 2019: BS 32 completed
$$ Sat Apr 27 11:39:50 2019: BS 33 completed
$$ [...]
$$ 0 
$$ wqinit 2 2 8 0 0 4 1 0 1 64
$$ 1 ""
$$ 0 
$$ wshim 4 2 4 0 0 2 1 1 1 64
$$ 1 "n"
$$ 15 "e" "f" "g" "n" "s" "0" "1" "2" "3" "4" "5" "6" "7" "8" "9" 
$$ wtfile1 2 2 15 0 0 3 2 1 1 64
$$ 1 ""
$$ 0 
$$ wtfile 2 2 15 0 0 3 1 1 1 64
$$ 1 ""
$$ 0 
$$ wtune 4 2 4 0 0 2 1 0 1 64
$$ 1 "st12"
$$ 11 "s" "t" "e" "i" "n" "o" "v" "1" "2" "3" "4" 
$$ xy 7 1 19 19 19 2 1 8192 1 64
$$ 1 681 
$$ 0 
$$ x3 7 1 19 19 19 2 1 8192 1 64
$$ 1 7587 
$$ 0 
$$ x2y2 7 1 19 19 19 2 1 8192 1 64
$$ 1 -284 
$$ 0 
$$ x4 7 1 19 19 19 2 1 8192 1 64
$$ 1 0 
$$ 0 
$$ xz2 7 1 19 19 19 2 1 8192 1 64
$$ 1 -1561 
$$ 0 
$$ xz 7 1 19 19 19 2 1 8192 1 64
$$ 1 6948 
$$ 0 
$$ y1 7 1 19 19 19 2 1 8192 1 64
$$ 1 797 
$$ 0 
$$ z3x 7 1 19 19 19 2 1 8192 1 64
$$ 1 476 
$$ 0 
$$ z2 7 1 19 19 19 2 1 8192 1 64
$$ 1 -609 
$$ 0 
$$ yz2 7 1 19 19 19 2 1 8192 1 64
$$ 1 -2835 
$$ 0 
$$ yz 7 1 19 19 19 2 1 8192 1 64
$$ 1 -2906 
$$ 0 
$$ y4 7 1 19 19 19 2 1 8192 1 64
$$ 1 0 
$$ 0 
$$ z1 7 1 19 19 19 2 1 8192 1 64
$$ 1 -18585 
$$ 0 
$$ z0_ 1 1 19 19 19 2 1 73744 1 64
$$ 1 3362 
$$ 0 
$$ z1c 7 1 19 19 19 2 1 8192 1 64
$$ 1 -1044 
$$ 0 
$$ z2xy 7 1 19 19 19 2 1 8192 1 64
$$ 1 5183 
$$ 0 
$$ z2x2y2 7 1 19 19 19 2 1 8192 1 64
$$ 1 -2701 
$$ 0 
$$ z2c 7 1 19 19 19 2 1 8192 1 64
$$ 1 196 
$$ 0 
$$ z2x3 7 1 19 19 19 2 1 8192 1 64
$$ 1 0 
$$ 0 
$$ z3 7 1 19 19 19 2 1 8192 1 64
$$ 1 2543 
$$ 0 
$$ z2y3 7 1 19 19 19 2 1 8192 1 64
$$ 1 0 
$$ 0 
$$ z3c 7 1 19 19 19 2 1 8192 1 64
$$ 1 0 
$$ 0 
$$ z4y 7 1 19 19 19 2 1 8192 1 64
$$ 1 4212 
$$ 0 
$$ z4c 7 1 19 19 19 2 1 8192 1 64
$$ 1 0 
$$ 0 
$$ z3xy 7 1 19 19 19 2 1 8192 1 64
$$ 1 0 
$$ 0 
$$ z3x3 7 1 19 19 19 2 1 8192 1 64
$$ 1 0 
$$ 0 
$$ z3x2y2 7 1 19 19 19 2 1 8192 1 64
$$ 1 0 
$$ 0 
$$ z3y3 7 1 19 19 19 2 1 8192 1 64
$$ 1 0 
$$ 0 
$$ z3y 7 1 19 19 19 2 1 8192 1 64
$$ 1 1029 
$$ 0 
$$ z4 7 1 19 19 19 2 1 8192 1 64
$$ 1 6630 
$$ 0 
$$ z4x2y2 7 1 19 19 19 2 1 8192 1 64
$$ 1 0 
$$ 0 
$$ z4x 7 1 19 19 19 2 1 8192 1 64
$$ 1 -13017 
$$ 0 
$$ z4xy 7 1 19 19 19 2 1 8192 1 64
$$ 1 0 
$$ 0 
$$ z8 7 1 19 19 19 2 1 8192 1 64
$$ 1 0 
$$ 0 
$$ z6 7 1 19 19 19 2 1 8192 1 64
$$ 1 -5568 
$$ 0 
$$ z5x 7 1 19 19 19 2 1 8192 1 64
$$ 1 0 
$$ 0 
$$ z5 7 1 19 19 19 2 1 8192 1 64
$$ 1 -359 
$$ 0 
$$ z5y 7 1 19 19 19 2 1 8192 1 64
$$ 1 0 
$$ 0 
$$ z7 7 1 19 19 19 2 1 8192 1 64
$$ 1 339 
$$ 0 
$$ zx2y2 7 1 19 19 19 2 1 8192 1 64
$$ 1 698 
$$ 0 
$$ zoom 7 1 32767 0 0 4 1 0 1 64
$$ 1 0 
$$ 0 
$$ zxy 7 1 19 19 19 2 1 8192 1 64
$$ 1 -1576 
$$ 0 
$$ zx3 7 1 19 19 19 2 1 8192 1 64
$$ 1 4844 
$$ 0 
$$ zy3 7 1 19 19 19 2 1 8192 1 64
$$ 1 -2037 
$$ 0 
$$ 
##$PARAMETER FILE=	(text, ASCII, /private/var/folders/bp/m_4195y96sx1d256lqvkcvym0000gq/T/aBHQ2iLfT8axxPZ7LXmKIw/13C/text, 0)
$$ 
$$ 
##XUNITS=	HZ
##YUNITS=	ARBITRARY UNITS
##FIRSTX=	29456.285383729999012
##LASTX=	-1793.2377791117969537
##DELTAX=	-0.476837158203125
##XFACTOR=	1
##YFACTOR=	0.0062929840837628175931
##FIRSTY=	0.072812870144844055176
##MINY=	-1.5802532434463500977
##MAXY=	206.20220947265625
##NPOINTS=	65536
##XYDATA=	(X++(Y..Y))
$$ [...]
15571g8J7K0qK7j2j5l4L0K5Rjk4j6J7M6M2l2k7j3k1roOn3J6M9k3l2PJ8QK9J5j0n0jJ5L1k3
15552f1j1K7O3jq6m8J6k1J0L2L4L0m9l8LJ9N2L3J9j0r2N4j9J5Nj8J7j6K4j6ol2N7J0pl7j7
15535f5RK6L5N7mn3j0k4K6mk9J4k5KNn9J12Mn0L5l3M0J5rnLl7L7l9j9m8M4L2K5o9lJ3n6m3
15516a50R8J9J5j3jM8l3J9j3k6K4mm2kNJ7P0K1k9mj4p2j8J1R7j8p7L9L9M9J5l2Ljm8k6K0l8
15498e2O3mj2k0Oj0J1j7kL0p7K7l8L4J6k6N1J2J6M7o1m5kL2Q7j2n1J8k1o0O2mn8K6QN6n2p4
15480i6M9L5j8K8l2J7j4L1l8L6N2o5L0K3%p6J7m7MQ7P3J8q6k2M0J1j7j5P6oJ5J06K47J63L98
15463A024R53L777K369l119l107r97l81j46j75j47J8k0k0m6m1J0J1J1J0k0J7o8P1L0K9J4n8
15450am3lP8j29mR6nj9J0j5l9K3pL1K1m9m4j8oK2N2Jj6M4O4ko3l5nL4j8K3m7K1P6n3m4J4K4
$$ plain form
15571 -78 -61 -41 -49 -22 -34 -49 -83 -53 -28 -19 -20 -44 -60 -43 3 45 13 -14 -27 -48 -57 -63 -57 -110 -94 -45 -68 -100 -93 -75 -67 -38 -23 -33 -83 -84 -69 -38 -61
15552 -61 -72 -45 18 17 -69 -117 -101 -122 -112 -80 -46 -16 -65 -103 -100 -81 -29 4 23 13 -79 -25 -44 -29 -24 -42 -25 -41 -17 -33 -39 -71 -14 -4 -11 -48 -65
15535 -65 -56 -30 5 62 58 5 -5 -29 -3 -7 -36 -22 -47 -45 -40 -99 13 17 -33 2 -31 9 24 15 10 13 -24 13 -26 -45 -93 -49 -17 8 -61 -64 -51 -107 -150
15516 -150 -52 -33 -18 -31 -32 16 -17 2 -11 -37 -13 -17 -59 -61 -56 -39 31 52 23 19 5 -67 -85 -74 23 5 -72 -33 6 55 70 38 41 40 -8 -34 -14 -52
15498 -52 11 7 -5 -25 -19 -29 -18 -35 -37 -7 -84 -57 -95 -61 -45 -71 -20 -8 8 55 -6 -51 -53 -21 66 54 3 21 0 -60 2 -2 -60 -34 -26 30 -22 -96
15480 -96 -47 -12 -30 -2 -34 -17 -31 0 -38 -2 50 -15 15 38 38 -38 -21 -68 -64 23 96 114 28 6 46 57 40 25 101 95 110 216 463 626 1024
15463 1024 1977 5754 8123 5004 1897 900 519 373 198 51 69 49 29 -17 -58 -48 -37 -26 -16 -36 -19 -87 -16 14 43 57 -1
15450 -1 -44 -47 31 -98 -102 -6 -11 -30 -20 -35 -74 -51 -58 -27 -6 -55 -99 -117 -123 -101 -49 -48 -64 -20 44 42 -21 -56 -61 -27 -45 -22 -69 -48 28 -25 -69 -55 -31
15432c1j2mP0l4KM6mPk7qL8p4m8m0P0Qk1N6J4m9J3l1l7L1M8kK9J3n1L3j3Mqlm6N2K1l3j2k8
15412f1%m9k7L8M4LN3PJ7j1m3L8K1o6j5LL5%j4K3k1m7N4nm1K0Q4m6m3L9QK0k2qo1l3J06k2
15394b2k9J5L2K9j2m4Mm7O8L7j7p2q8J7M1N9k9J9n4M4L6nKl3k1L4mpK6J9n2J5Nj1k8kl0l1
15376a36NL7K3Rk9M3l1M4l0K6n3K4j7J7PM2j7K1j3l4j4m3M3M1jj8rO3l2k6J8L6Pl9l4K5k6
15359g1jrl4O7J1J9qm8J1L2K3Kn6K2J4l0N1m7J0p7N8Q7m0j6O4Qj1m5j5m0M0K0l0l7k1J9k4
15341a02m0L0P3Rj1Rrk9M9K6n5O0nJ7k6n2P2n5NRj7K3Rm1m8jM0m9J4LJ6j4oO7pjO8k6m1m4
15322h0j1K4L0Rm7kJ8P5qm5L9k1o2rO9rL1J5p0r3P4K7L9k0L9J9m2j4Pk0l3NL9j6j0l0n0N5
15304g8l9L2N8l4k3k9O2MM2K2pn2m6K0J5k7J5KL4O2K9o4k0qo8J3J8K9O8l0M3o5JN5M0j0j31
$$ plain form
15432 -31 -43 -47 23 -11 -9 37 33 40 13 5 43 -31 -79 -119 -49 -41 -62 -6 8 -41 -28 -59 -96 -65 -17 -19 10 23 -28 5 -8 -4 -12 -15 -61 -9 12 -21 -33 -61
15412 -61 -61 -110 -137 -99 -55 -52 1 8 25 14 -29 9 30 -36 -51 -48 -13 -13 -27 -4 -25 -72 -18 -23 -64 -44 40 -6 -49 -10 -2 18 -4 -12 -73 -106 0 -22
15394 -22 -51 -36 -4 25 13 -31 -27 -74 -6 31 14 -58 -146 -129 -88 -29 -58 -39 -93 -49 -13 -18 -16 -49 -70 -36 -40 -47 -21 -2 -54 -39 -34 -45 -73 -75 -105 -136
15376 -136 -131 -94 -71 -62 -91 -48 -79 -35 -65 -39 -92 -68 -85 -68 -61 -19 -36 -15 -28 -62 -76 -119 -76 -35 -36 -54 -63 0 -32 -58 -40 -4 3 -36 -70 -45 -71
15359 -71 -72 -81 -115 -48 -37 -18 -26 -74 -63 -31 -8 -6 -62 -40 -26 -56 -5 -52 -42 -119 -61 26 -14 -30 34 42 31 -14 -29 -69 -29 -9 -39 -76 -97 -78 -102
15341 -102 -142 -112 -39 -30 -41 -32 -41 -70 -21 5 -50 10 5 22 -4 -56 16 -39 -34 -25 -42 -19 -10 -51 -99 -100 -60 -109 -95 -92 -76 -90 -96 -29 -36 -37 31 5 -36 -80
15322 -80 -91 -67 -37 -28 -75 -77 -59 16 8 -37 2 -19 -81 -90 -21 -30 1 16 -54 -147 -73 -46 -7 -27 12 31 -11 -25 -18 -38 -71 -66 -27 -43 -53 -83 -133 -78
15304 -78 -117 -85 -27 -61 -84 -113 -51 -47 -5 17 10 -42 -88 -68 -53 -80 -65 -63 -29 33 62 -2 -22 -30 -98 -85 -67 -38 30 0 43 -22 -21 34 74 64 -67
15286f7lJ8J8o0k2J9M9O0k2J5o4Qk5mmK4K3k4L7P0k8o2OL9J0l2k8K8k6lLq6L5L3j1M4N1n3
15268c4OOOjn2k4K6n5PQ9L0m1rL3o0j5j7j8QN7J5j5Q2j9kn0q5Q4kj9J8LPm5QM7n0L0L7n8j
15248g3J6n2O8J2K3p1N6j0jk9M9O5Lo2l2M1mj9k5p2Q0k4j2L9k4J8J9j7J6p4K2K1KqJ4J4k8
15231e9k8m7pK7Q9P5l7j3l2Kk2k5l7N8k4J8Q0om4Rl5M4m4m3K8j0N7J0m8J4mP9K4m6kk3Onj2
15212c3m2JK6J6J9Oj7Mm2J5J8j8KL4j1NK4m0qM1J2n3rpN1m3LOk5jJ6qL4mj7M5j0Qj0j1k4J6
15192c1J2L3l3%l8k2M8K1Ol%J5j1K8m3OmJ0K3Jn6ql5L3k4N6O8j9j9mj5k2Mm4N1L9J4q3PP5
15173C6Ln9N5km6k4k6mJ8j14N7M7J2K2l6LL2o5J0P9k7k0LmK1J2l9Oj8J5l7kJ4M9J9J6Jq5j
15155g9lK6n8l1O7j7J2P6k5l2L0K0j2k2J4l9J0M5n2%P7j2Pj7j5J7mK2J4k5j8K1Ql2J8pK8J7
$$ plain form
15286 -67 -70 -52 -34 -94 -116 -97 -48 12 -10 5 -59 -51 -76 -80 -84 -60 -37 -61 -24 46 18 -44 -38 1 11 -21 -49 -21 -47 -50 -47 -133 -98 -65 -76 -32 19 -34
15268 -34 -28 -22 -16 -17 -69 -93 -67 -122 -115 -26 4 -37 -46 -13 -73 -88 -105 -123 -115 -58 -43 -58 24 5 3 -47 -132 -48 -50 -69 -51 -48 -41 -86 -78 -31 -81 -51 -14 -72 -73
15248 -73 -57 -109 -41 -29 -6 -77 -21 -31 -32 -61 -12 53 56 -6 -38 3 -1 -20 -45 -117 -37 -61 -73 -34 -58 -40 -21 -38 -22 -96 -74 -53 -51 -59 -45 -31 -59
15231 -59 -87 -134 -141 -114 -25 50 13 0 -32 -30 -52 -77 -114 -56 -80 -62 18 12 -32 -23 -58 -14 -58 -101 -73 -83 -26 -16 -64 -50 -54 25 49 3 1 -22 -16 -21 -33
15212 -33 -75 -74 -48 -32 -13 -7 -24 -20 -62 -47 -29 -47 -45 -11 -22 -17 7 -33 -41 0 12 -41 -50 -57 -6 -49 -46 -40 -65 -66 -50 -58 -24 -28 -45 0 -10 -2 -12 -23 -47 -31
15192 -31 -19 14 -19 -19 -57 -79 -31 -10 -4 -7 -7 8 -3 25 -18 -12 -16 -6 17 18 -38 -46 -81 -48 -72 -16 52 33 14 10 -5 -27 -23 -67 -16 23 37 -46 -39 36
15173 36 39 -20 35 33 -13 -37 -63 -67 -49 -163 -106 -59 -47 -25 -61 -58 -26 -91 -81 -2 -29 -49 -46 -50 -29 -17 -56 -50 -68 -53 -90 -92 -78 -29 -10 6 7 -78 -79
15155 -79 -82 -56 -114 -145 -78 -95 -83 -7 -32 -64 -34 -14 -26 -48 -34 -73 -63 -18 -70 -70 7 -5 2 -15 -30 -13 -17 5 19 -6 -24 -3 5 -27 -9 -16 12 29
15136B9Ln3j0J4k4J6npJ6Nj5J1J7n5K4M0Mj8l4qk9m1J4Q6j8l6QM7Qn9Ml8J8M9K4M5m3n8kJ9
15117e2M9n6j1k6n9O2pKk1N8N9j4k1L5j1l2n5L2J05no0k9K5nM5J8Kk6n5K5l3L1L6n3L5j6J4
15100a4K1p9Rj1jpN7qjJL2l9k8N8Q6j02k2J0lL1k6J2k1M3j6l3j6K0l1J07p8n9L2m9K8K7Kq6
15082a54QRK1M6K7k1J2J8mK5l3k9N9J0j3M0k4jk8n5k2M0J9m3j3k2J1N9L3k2J2L5p3m3J2O7
15064c7M5k9j3N2J0l8L5n3n6j1mmR4kp4k6K7J7KJ9L1Pl7Jn0L3L3O4L5n2o%j4K5nqJ7o1%L5
15045BOj9qp0N9L6k5k7m8L5K1L8j03M5J8J6M7pql4j0k0nL4L5l8QJ6J1k4m1k8R8N1j7n2n5J8
15027d5N2pJ2J5M2k2p2M2O3o9o9J7j9K6L5mM3JkP5l6p5k0M9L0jm3o3N1J4l4j0M2N9m1kJ3n4
15009gk5k3M9J8N7O1m4q2r9P0P6l2J9qj7K2J5K2l0k5N4L7N2pn5J9P9l2P7R0J58J90J86L46
$$ plain form
15136 29 32 -21 -31 -17 -41 -25 -30 -37 -21 -16 -31 -20 -3 -58 -34 6 10 -8 -42 -50 -79 -120 -106 -20 -38 -74 -66 -19 -11 -70 -66 -104 -86 -37 -13 32 -11 -69 -71 -52
15117 -52 -3 -59 -70 -96 -155 -93 -100 -98 -119 -61 -2 -16 -37 -2 -13 -45 -100 -68 37 32 -28 -57 -32 -37 8 26 28 2 -53 -28 -61 -30 6 -47 -12 -28 -14
15100 -14 7 -72 -63 -74 -75 -82 -25 -33 -34 -33 -1 -40 -68 -10 76 -26 -48 -38 -41 -10 -36 -24 -45 -2 -18 -51 -67 -47 -78 29 -49 -108 -76 -125 -97 -70 -68 -154
15082 -154 -146 -137 -116 -70 -43 -64 -52 -34 -38 -13 -46 -75 -16 -6 -19 21 -3 -4 -32 -87 -109 -69 -50 -93 -106 -128 -117 -58 -25 -47 -35 0 -73 -116 -104 -37
15064 -37 8 -21 -34 18 28 -10 25 -28 -84 -95 -99 -103 -9 -11 -85 -111 -84 -67 -65 -46 -15 -8 -45 -44 -94 -61 -28 36 71 19 13 13 -1 24 19 11 28 -33 -33 2
15045 2 8 -11 -19 -89 -30 6 -19 -46 -94 -59 -38 0 -103 -58 -40 -24 23 16 8 -26 -36 -56 -61 -27 8 -30 -22 -6 5 -19 -60 -88 10 61 44 -8 -63 -45
15027 -45 7 0 12 27 69 47 -25 17 80 11 -58 -41 -60 -34 1 -3 40 41 39 114 78 3 -17 32 62 61 18 -45 6 20 -14 -24 18 77 36 34 47 -7
15009 -7 -32 -55 -6 12 69 130 86 4 -95 -25 51 19 38 30 13 35 50 72 42 17 71 108 160 153 98 117 196 164 241 331 489 679 865 1211
14993A211M55R53J988M544N743j131n918l869j608q51m65l37j71j08j60n2k1p9J5l5l0M6J3
14982A33Oq9l8N1j6q2k3L3O7M6l8l1NL2K7m3n2J3J1nn7OO6J0k9J1m0J4Ro0M1J6m5m2K2l8L8
14964g1N1J3k0p0kO6K2j3j5J2K7K1l4j0KN4k0q3m1Q5O7No1O4p5J4j3L2l6lj2JO2m8ll2j2R
14946f7J6k9m7M1L3l3K8K6j7nN2Mm1M4L0K2o7o6qj8nM1J02o4k2M7L9kl2l9lK5p6M3K6mOrK5
14928dJ9q1O6k1j9j2L0j3L3L8l2K1k5o5l2j7L6jM8qp0N7qo0K3j8O7J2n1n5l1L9O5K5L6L5o5
14910c8L6L2o1PmLm4m0L8K5rJ6j4L6k5m9JJ1k6LMKL7K2K6N4j4l8mpk8Rj5P%m5R9NPk0l6j0
14890d7N1k0l5QK2l0LO0m4m2rM4K2k1k7PK2J6l2k0P9Nk9M3J1m9K6o0N4lp5j5KK9k3Qjl4J8
14871h6J5m9j7J05j0N8j1l7omRKm1l9L3O7J1l4j6L5J2J5klm9n2lP3j6KP1j9m5o7K2J7pJj2
$$ plain form
14993 1211 1666 2619 4607 9151 14894 13763 7845 3976 2368 1517 1052 715 544 436 276 224 203 124 139 104 74 120 133
14982 133 139 50 12 63 47 -35 -58 -25 42 88 50 19 24 56 83 40 -12 1 12 7 -50 -44 22 32 3 14 -26 -12 -3 -63 -22 -6 -51 -93 -71 -109 -71
14964 -71 -20 -7 -27 -97 -99 -33 -11 -24 -39 -27 0 21 -13 -23 -21 33 13 -70 -111 -26 41 46 -15 49 -26 -12 -25 7 -29 -32 -44 -43 19 -29 -32 -64 -76 -67
14946 -67 -51 -80 -127 -86 -53 -86 -58 -32 -49 -54 -2 2 -39 5 35 57 -10 -76 -84 -102 -107 -66 36 -28 -50 -3 36 34 2 -37 -40 -15 -91 -48 -22 -26 -20 -29 -4
14928 -4 15 -66 0 -21 -40 -52 -22 -35 -2 36 4 25 0 -65 -97 -114 -78 -79 -31 -39 -109 -52 -60 -120 -97 -115 -48 -36 -87 -142 -173 -134 -69 -44 -8 27 -38
14910 -38 -2 30 -31 -24 -28 -25 -69 -109 -71 -46 -55 -39 -53 -17 -42 -91 -90 -79 -105 -102 -98 -96 -59 -37 -11 43 29 -9 -13 -20 -48 -39 -54 -47 -47 -92 7 12 19 -1 -37 -47
14890 -47 4 -16 -51 -43 -21 -51 -48 12 -32 -74 -83 -39 -17 -38 -65 -58 -36 -20 -52 -72 7 12 -17 26 37 -12 14 -46 8 5 -70 -85 -83 -54 -77 -69 -70 -104 -86
14871 -86 -71 -120 -137 -32 -42 16 5 -32 -38 -42 -33 -31 -72 -111 -78 -11 0 -34 -50 -15 -3 12 10 7 -42 -94 -97 -24 -40 -38 33 14 -31 -98 -76 -59 -66 -65 -77
14853g7K7Kk9PM5l8M1mk2K4j9QJk3O7K2Qq0J0N6N7k2p8j6jrk8M0J6N9o9l0RK9L7Jj3l2Nkk8
14833d9%K8ok3M9m8P2Lkm9On0JJ4qK4j3K6k1J8Plkm4K7O4K1K4Rq9k3l4N9J1Po4J8n1N3L4p1
14814g5J7L4J6J3P2n4j4n3K1M3kok9p6K1K3m3L0L6m8lQ7K1j01j7M8o0K4J9j8M5kjJ2n1%%L5
14795c6j5pK1j07M0O8k8j0LO1Rlm3L3M5n0pj7ml6L8k8j6P0M8Jp5m8j7MP9N2p7J3qkj2J6JO6
14776B2j4n0nl1l0J4N4PM6K3p0k5J8j5j03Q5M9l9j0O7pl2k6J9N8l0l0L4K2n9L9m0m3K0L3j4
14759f3J1k0rL4K7Mlj5J9J6l6k2J9o6L4pO0k2pN6n5OJ5L1%j01K9M6l0mK1K7l1j8K4J3k4J0
14741c1j4O0p3l6L5j4oj5L9P2o9j2P0m5om%Kj8O6J3j1%j3L0m4j7K8K1k2Okm9n8oO8k1l0J8
14722h8N4j3OO6j02k8O9K9l1j2j8J3j2l4K3m0lJ13L9m6l5J6J07k4n3K2o6m2J3M1M4l0n3m2
$$ plain form
14853 -77 -50 -48 -77 -70 -25 -63 -22 -26 -48 -24 -43 -35 -34 -57 10 32 40 -40 -30 26 83 61 -17 -33 -34 -43 -71 -31 -15 44 -25 -55 -46 -17 20 21 8 -24 -19 -21 -49
14833 -49 -49 -21 -27 -50 -1 -49 23 26 24 -25 -19 -69 -68 -54 -62 -38 -51 -25 -46 -28 -21 -24 -26 -70 -43 21 42 66 75 -14 -37 -71 -12 -1 6 -58 -40 -91 -38 -4 -75
14814 -75 -58 -24 -8 5 77 23 9 -44 -23 20 18 12 -17 -93 -72 -49 -92 -62 -26 -74 -77 10 31 -70 -87 -39 -99 -75 -56 -74 -29 -31 -32 -20 -71 -71 -71 -36
14795 -36 -51 -58 -37 -144 -104 -36 -64 -74 -71 -10 -1 -4 -47 -14 31 -19 -26 -43 -47 -83 -45 -73 -89 -19 29 30 -45 -93 -110 -106 -27 25 -52 -39 -47 -49 -61 -45 -44 22
14776 22 8 -42 -47 -78 -108 -94 -40 -33 13 36 -34 -59 -41 -56 -159 -74 -25 -64 -74 -7 -14 -46 -72 -53 5 -25 -55 -21 1 -58 -19 -59 -102 -82 -49 -63
14759 -63 -52 -72 -81 -47 -20 -16 -19 -34 -15 1 -35 -57 -38 -104 -70 -77 -17 -39 -46 10 -45 -39 -24 7 7 -94 -65 -19 -49 -53 -32 -5 -36 -54 -30 -17 -41 -31
14741 -31 -45 15 -58 -94 -59 -73 -79 -94 -55 17 -52 -64 6 -39 -45 -49 -49 -47 -65 1 14 3 3 -10 20 -24 -41 -13 8 -14 -8 -10 -59 -117 -123 -55 -76 -106 -88
14722 -88 -34 -47 -41 25 -77 -105 -36 -7 -38 -50 -68 -55 -67 -101 -78 -118 -121 -8 31 -15 -50 -34 73 49 -4 18 -48 -90 -77 -36 8 -22 -75 -117
14706a17o7QM2M2O2Ok0j3K7Jo0k4O2mnK5J0k3JM8M5j8rq9L7m8K8L1l5P0j3p0nL6J0o2j2M5
14688e8Nj1k3J3O1m3L1j0k8%PK8RK2l6k6L0j8OM8MjPm2J2M9m2l7k7j2J4J2PNn5J1l1J1K9k9
14669a08R8l1k4k3j1L0L8nmk7J6mJ9L6Mn1rN4k0J1p9l3J2N2L1o4K7P8lm7Rm2%L9p1J5k7M0
14651g4Q1j5L8j6m4k9MO9pk2K1m8N%J6qOm3p1N8K5J6l3l8j2Q2L1m8j3QJ2J7J5m8j3Jl7R1j2
14632c5RJ3n3j1nj1J9M7Mon2L5M4lJ1J0Ml4j6mK2K4J7K1n9jkJ2m5qJ0J1nlJ4L8o6Ol6LM3K2
14612a6j7m4L3P2j12J8K5j5l1RJ3K1J8K8j03M3mLrkPO3n5O5K0n6K7m1M4n8m7Ml6K8L6NK1o
14594d9jj8Mk3P0ko8L8Om4L7n1M3M3M5ko8k8jL9L0l4qJ2p5L1lM6L5K9l0p8K2m0j5QJ9K5L6
14576b0L1p0N4ll2k5K6J1o4N9j7o8PLN6J1L4o7j1L3k4LpK6K5k3p%K1N1N5k7m5j5k7NPL1J3
$$ plain form
14706 -117 -184 -176 -134 -92 -30 -24 -44 -57 -30 -29 -89 -113 -51 -55 -60 -35 -25 -48 -47 1 46 28 19 -70 -33 -81 -53 -22 -57 13 0 -70 -75 -39 -29 -91 -103 -58
14688 -58 -53 -64 -87 -74 -13 -56 -25 -35 -63 -63 -56 -28 -19 3 -33 -59 -29 -47 -41 7 11 10 17 -25 -13 36 -6 -43 -70 -82 -68 -56 -49 -44 -99 -88 -119 -108 -79 -108
14669 -108 -10 -41 -65 -88 -99 -69 -31 -36 -40 -67 -51 -55 -36 0 4 -47 -56 -2 -22 -11 -90 -123 -111 -59 -28 -92 -65 13 10 -37 -28 -70 -70 -31 -102 -87 -114 -74
14651 -74 7 -8 30 14 -30 -59 -55 14 7 -15 6 -42 -37 -37 -21 -29 -23 -66 -137 -79 -54 -38 -71 -109 -121 -39 -8 -56 -69 -61 -49 -32 -17 -65 -78 -77 -114 -23 -35
14632 -35 -26 -13 -66 -77 -82 -93 -74 -27 -23 -29 -81 -46 -2 -5 6 16 20 -14 -30 -34 -12 12 29 50 -9 -10 -12 0 -45 -53 -43 -32 -37 -40 -26 12 -54 -48 -84 -81 -38 -16
14612 -16 -33 -77 -44 28 -84 -66 -41 -56 -87 -78 -65 -44 -26 2 -101 -58 -62 -59 -68 -70 -63 0 -55 10 30 -26 1 -40 4 -54 -101 -97 -133 -105 -69 -64 -43 -49
14594 -49 -50 -68 -64 -87 -17 -19 -87 -49 -43 -87 -50 -101 -58 -15 30 28 -40 -68 -69 -30 0 -34 -42 -30 -105 -74 -77 -31 4 33 3 -75 -53 -93 -108 -100 -81 -56 -20
14576 -20 11 -59 -5 -8 -40 -65 -39 -28 -92 -33 -50 -118 -111 -108 -52 -41 -7 -74 -85 -52 -76 -73 -80 -54 -29 -52 -59 -59 -38 13 68 41 -4 -19 -46 -41 -34 -3 10
14557A0pk5j8rnj2j4j7J9j4L0o1m4J18Jn7O2N1J06j24m2J4j02J3L9Q9k0j7Kj1LJ1j1Lk0m5
14540a04O8L9p8j6M8K8j5nl6L6ll8M5K7n6J3j3l3mO7J3j0j2m2R2o7%k3J1M2J2n8J4Jm1rO6
14522d1J6l5M1j6j1j1j4m4P0K5L1n6K8k0m5K3K0P0mm7q5mM4m9LL9Nj8l1M2L7K4n1K3l3PP1
14505Dj9Ro7Q2o7l4K7O5J7m3o2l3P4j4l3qO2J0l0K5M7m2k0M4J1J2p9L2J6%l5l4K8j3m0%L8
14487g0n7k7N0M6M6Mj4l7n9M7JO2o5J6K1l2j4nJ7k2L9%n6N2M9n0kM7m4Rmm4K1J7J6K0J6Nn
14468fJk5Ol8k3J5J0m3O8oo1M9O0j7j2J3q0Jk6k1K3L1K2J3k5j5L2J5k4Q8l5k1KM3Qk5q7M2
14450d8K9p8L3K0L2k4k4PrK4J9l5J06o7o9M9L1M9p6nL6o3n0KJ6k0%J4N3%rk2k5J2olO5M7m6
14432c5J2oj6k2qj0l4JQ6k5m3M0m8J7O5j0k2J2PJ1k6l8N9K5p7LK7O1M5q3n1K3%K7k9K8o1m4
$$ plain form
14557 10 3 -22 -40 -49 -54 -66 -80 -97 -78 -92 -62 -123 -167 -49 -48 -105 -43 8 114 -10 -52 -38 -140 -127 -88 1 -19 -36 -34 -45 -42 -31 -42 -39 -59 -104
14540 -104 -36 3 -75 -91 -43 -15 -30 -35 -71 -35 -38 -76 -31 -4 -60 -47 -60 -93 -97 -30 -17 -27 -39 -81 11 -56 -56 -79 -68 -26 -14 -72 -58 -57 -98 -107 -41
14522 -41 -25 -60 -19 -35 -46 -57 -71 -115 -45 -20 11 -45 -17 -37 -82 -59 -39 31 27 -20 -105 -109 -65 -114 -111 -72 -67 -85 -116 -74 -37 -13 -64 -41 -74 -67 4
14505 4 -15 -6 -73 9 -58 -92 -65 0 17 -26 -88 -121 -47 -61 -94 -102 -40 -30 -60 -35 12 -30 -50 -6 5 17 -62 -30 -14 -14 -49 -83 -55 -68 -108 -108 -70
14487 -70 -127 -154 -104 -58 -12 -8 -22 -59 -118 -71 -70 -8 -73 -57 -36 -68 -82 -87 -70 -92 -53 -53 -109 -57 -8 -58 -60 -13 -57 -48 -52 -96 -75 -58 -42 -22 -6 -1 -6
14468 -6 -5 -30 -24 -62 -85 -70 -60 -103 -35 -41 -102 -53 7 -10 -22 -9 -89 -88 -114 -135 -112 -81 -59 -46 -71 -86 -54 -39 -63 25 -10 -31 -29 14 22 -3 -90 -48
14450 -48 -19 -97 -64 -44 -12 -36 -60 -53 -62 -38 -19 -54 52 -15 -84 -35 -4 45 -31 -36 0 -63 -113 -111 -95 -115 -115 -101 -48 -48 -57 -79 -104 -92 -98 -101 -36 11 -35
14432 -35 -23 -29 -45 -67 -75 -85 -119 -118 -32 -57 -100 -60 -108 -91 -26 -36 -58 -46 -39 -28 -54 -92 -33 -8 -85 -82 -55 6 51 -32 -83 -60 -60 -33 -62 -34 -95 -139
14414a39O0L8ojl0Pm9K4NK9L7Pk8pm5L9N8j7N9K9p6NJ8j5lJ8Kk2n0K6o4L5j8K8QKK8o0L1%
14394c7kj6Mj6Lk6N1l6K0L4n6J0J4q2K2O0j8l6Q4K3pl1r3l0J42k1k1KJ30k0m7L3m2K1on1L
14377c8L8O0m7L7p9j7O6n6j5Q1m0rom9P4j0K8j6o0kk7o1N3M2O5J2n3qL1K1k3%K3Pl4k0o2K0
14359g4k1K2J01m5k6p2Jj1J0N9J2mk6J7m6M3q%L5M6l1r2PK7L0k7mO5k1L3M3q2n5L2L7pK0l6
14341d8Kn3P1mM0r6M1n3J3K7qK0kJ7N8q8m7j2J6L4N1J2O8o3j4k3l1QPO0k8rK7j9j8k6KOl6
14322i8M4MM2k9rn3M0M6l8j6L3k3m8L8k4q%L0QJ3k1PL6M1Nn7m1K8nL2j3o4N3j7%QK1o6lP9
14303b5ml5l4P2k5QJn2k0QL9J4J1LMpl5O0j6J5J3m8K0O0o9j5k3nK2O1N3q0m2l2j1N8l7j8l5
14284a46J15J0n0k7j5K7Q1k8j0J9k8j6qM8J4pn7K6M9n0K6Jj2j9M0Pj12O1moJ8J8n9l4M4O7
$$ plain form
14414 -139 -79 -41 -47 -48 -78 -71 -120 -96 -91 -62 -25 -18 -46 -53 -98 -59 -1 -18 41 70 -6 -1 17 2 -1 17 19 -3 -53 -27 -91 -56 -74 -46 -38 -36 -8 -68 -37 -37
14394 -37 -39 -55 -51 -67 -64 -90 -39 -75 -55 -21 -77 -67 -53 -135 -113 -53 -71 -107 -23 0 -7 -38 -131 -161 -19 -40 -61 -59 71 51 4 37 -5 16 10 -41 -38
14377 -38 0 60 13 50 -29 -46 20 -36 -51 30 -10 -19 -25 -74 0 -10 18 2 -58 -60 -87 -148 -95 -53 12 24 -29 -37 -6 15 -8 -8 15 22 -12 -32 -94 -74
14359 -74 -95 -73 28 -17 -43 -115 -114 -125 -115 -56 -44 -48 -74 -57 -103 -60 -68 -68 -33 13 -18 -110 -103 -76 -46 -73 -77 -12 -33 0 43 -39 -94 -62 -25 -32 -12 -48
14341 -48 -46 -99 -28 -32 8 -88 -47 -100 -87 -60 -68 -48 -50 -33 25 -63 -110 -122 -106 -72 -21 -9 59 -4 -18 -41 -72 -64 -57 3 -25 -34 -7 -26 -44 -70 -68 -62 -98
14322 -98 -54 -50 -8 -37 -46 -99 -59 -13 -51 -67 -34 -57 -105 -67 -91 -99 -99 -69 -61 -48 -69 -62 -26 15 20 -37 -78 -50 -55 -23 -36 -100 -47 -64 -64 -56 -35 -101 -104 -25
14303 -25 -29 -64 -98 -26 -51 -43 -42 -94 -114 -106 -67 -53 -42 -39 -35 -42 -77 -17 -33 -18 -5 -53 -33 27 -42 -57 -80 -85 -63 -2 51 -29 -71 -103 -114 -56 -93 -111 -146
14284 -146 -31 -21 -71 -98 -113 -86 -5 -33 -43 -24 -52 -68 -76 -28 -14 -21 -78 -52 -3 -53 -27 -26 -38 -57 -17 -10 -122 -61 -65 -71 -53 -35 -94 -128 -84 -17
14267a7J9o6J8Ok2OJK2mqL0L5m7k1J7j3j0RpM3j9n8K9j5p0O1jK6K5L3L3p6%L8J7J8m5j5l1
14249e9L2k2jN8m6m6N6K0j1J6J1m4k2l4P1l6KK0l1kRJ1k6N5Pk5qPO6q3KNl0L9O2j0p8n5P5
14230d5k1K7P7l5J3j3j2l0M1N4r3k6J3k9N0J5MlL5q6k0K7j2j5Lk1J5O0pm0K6Nn3N2j4j0J6
14212e2qK4nL7o0j4JP1Pj6M2r0oN2l4kPj3j2j0l6K5j4j6M5k0O4k9k3J4J10n5j0O4o0L1qj8
14194a7N4k3k2j6QKLK4%m9%l2L6K0J6Pj8k9L7o3QP6q2m5K5j3K4k7L3jk2M4K0K5j3n4Q3O6j7
14176F8m2j9Rl0k1Ml1Rk6N6N2n2K2k4k1K0o2J4J4n8Q4pl7M2L1r9k1Q2O5Jo1L1m7k8J5L0oj8
14157f1O8l7m7j4K1l3jolO8Jj9N6j2J1m4j9K3m0L3K3n4M7L9J0J0n7m1J1k7N1M2k9n7K8O2q
14140ekm0K1l7n4N2j6k9K6j9K5O5J5l7J2N2r5L4L1l6l9N9k7o4K6N0J9K7o2p1l1PJ11M5m7j7
$$ plain form
14267 -17 2 -64 -46 -40 -62 -56 -55 -33 -37 -45 -15 20 -27 -48 -31 -44 -54 -45 -52 -9 -28 -86 -57 -72 -142 -81 -82 -56 -31 2 35 -41 -41 -3 14 32 -13 -28 -59
14249 -59 -27 -49 -50 8 -38 -84 -28 -8 -19 -3 8 -36 -58 -92 -21 -57 -55 -35 -66 -68 -59 -48 -74 -19 -12 -37 -45 -38 28 -55 -53 -48 -78 -39 23 13 -65 -120 -45
14230 -45 -66 -39 38 3 16 3 -9 -39 2 56 -37 -63 -50 -79 -29 -14 -10 -13 22 -64 -84 -57 -69 -84 -81 -102 -87 -27 -34 -74 -48 -43 -96 -44 -58 -68 -52
14212 -52 -60 -36 -41 -4 -64 -78 -77 -6 1 -15 27 -63 -69 -17 -51 -53 -46 -59 -71 -81 -117 -92 -106 -122 -77 -97 -33 -62 -85 -71 39 -16 -26 38 -22 9 1 -17
14194 -17 37 14 -8 -24 -16 -14 -11 13 13 -36 -36 -68 -32 -12 4 11 -7 -36 1 -62 -54 22 -60 -105 -80 -93 -69 -96 -63 -64 -86 -42 -22 3 -10 -64 19 85 68
14176 68 26 7 16 -14 -35 -31 -62 -53 -79 -23 29 -23 -1 -25 -46 -26 -88 -74 -60 -118 -34 -41 -78 -36 -5 -104 -125 -43 22 23 -38 -7 -54 -82 -67 -37 -43 -61
14157 -61 7 -30 -77 -91 -70 -103 -104 -110 -113 -45 -44 -63 -7 -19 -8 -52 -71 -48 -88 -55 -32 -86 -39 0 10 20 -37 -78 -67 -94 -43 -1 -30 -87 -59 3 -5
14140 -5 -7 -47 -26 -63 -117 -65 -81 -110 -84 -103 -78 -13 2 -35 -23 29 -66 -32 -1 -37 -76 -17 -44 -108 -82 -32 -13 14 -48 -119 -150 -143 -32 13 -34 -51
14123e1k7M5j8Ml1k6N4KK0m0oL%j4M1Jl0j6O8N7n5%K9Kj22K6Q9n1k1N7Ro4m8K2L3J2%l5k3
14104a04M2M9K4j0Ok9jm8l6L8L9l9nO1m6l4l4Q5Nn1L6K4m6m2Q8n7k8N9k4l8K9j2K0M8k4J1
14087d4j4J9MP2n9PoQJ4l7j7QK7K8%n8Rm1%L9nj0oJ5J3o0oP7pK6o3MPM6Nk3j3jn0J0L6kp5
14066a23qJ3N8L4k1jL1Kl1Nl3Q0k4j00Q2L7j1k6J2l2n5ON5pn3kO8j5PK5j4k5RR3pm8m1ON8
14048DJ1k5k5M1n9k4RM2K2m2Oj2QP%j7K8L2l3q3pP7L3QK9o5k1OL8Jk2m7rQ9J0jm3l8m3J5M7
14028e3j8J7J7M3n1M5j1JK5k4l3q7P6O4%nK0lj5o8K2o0O5N5K8j4r1J3k4N2k5o9j2L5j8rK1
14011i1M2O2l5Lj8O3k6l9N7L0k7m7nk9%K8K5N9n4o8n4L4%n0M5J1K1J8kk9J9rK7Ln3J5j3N0
13992c7J1j9L0kK0ro6k4L0M6ql4L4O9j00J5j1L5pJ4Ro5l0O0n4k0M5m3M8K8pk1j4K7m6O3N8
$$ plain form
14123 -51 -78 -33 -51 -47 -78 -104 -50 -48 -28 -68 -74 -71 -71 -85 -44 -43 -73 -89 -21 36 -19 -19 10 12 -110 -84 5 -46 -67 -10 -1 -65 -113 -91 -58 -46 -46 -81 -104
14104 -104 -62 -13 11 1 7 -22 -23 -71 -107 -69 -30 -69 -74 -13 -59 -93 -127 -42 -37 -88 -52 -28 -74 -116 -28 -85 -113 -54 -78 -116 -87 -99 -79 -31 -55 -44
14087 -44 -58 -39 -35 37 -22 -15 -21 -13 1 -36 -53 -45 -18 10 10 -48 -39 -80 -80 -41 -46 -56 -62 -47 -34 -94 -100 -23 -30 -4 -67 -63 -56 -10 -5 -28 -41 -42 -92 -82 -46 -48 -123
14066 -123 -131 -118 -60 -26 -47 -48 -17 -15 -46 -41 -74 6 -18 -118 -36 1 -10 -36 -24 -56 -111 -105 -50 -57 -110 -112 -44 -59 -52 -27 -41 -66 -57 36 29 -19 -60 -54 4
14048 4 15 -10 -35 6 -53 -77 -68 -26 -4 -46 -40 -52 -44 -37 -37 -54 -26 6 -27 -110 -117 -40 -7 1 30 -35 -56 -50 -12 -11 -33 -80 -89 0 10 9 -34 -72 -115 -100 -53
14028 -53 -71 -54 -37 6 -45 0 -11 -10 15 -9 -42 -129 -53 11 11 6 26 23 8 -60 -38 -98 -33 22 50 36 -55 -42 -66 -14 -39 -108 -120 -85 -103 -112 -91
14011 -91 -49 13 -22 -19 -37 26 0 -39 18 48 21 -26 -31 -60 -60 -32 -7 52 -2 -70 -124 -90 -90 -140 -95 -84 -63 -45 -47 -76 -57 -66 -39 -36 -89 -74 -87 -37
13992 -37 -26 -45 -15 -17 3 -6 -72 -96 -66 -20 -28 -62 -28 41 -59 -44 -55 -20 -27 -13 -4 -69 -99 -39 -93 -113 -68 -111 -63 -35 -42 -63 -77 -50 -96 -33 25
13975B5p2L2nk6mk3N3L0j4O6l7m5k3L6Ok1qrmPL1l3o6L4N7o5l7j2M8L2mk7oPOMk4L7K8J1Q
13955gn4J1l8N0O5m3k2L3k0k1M5RmJ6Nk1Ll4k9Mjn3J7O9pj6n6k7L8nL8M8j0K2n3O9p8mM2n5
13936g4l5L3k3K1N0K4k9j06P1L0K7j8q1N2K6j5oK5K7J1l4j0Ro0L5K1m5Kj2N0M2nkl5J8L0m0
13919b6m5J9j1Qo4n4k0P2M6j1%k3M5K3%m7R0m6oK7J5m8L0m2k7N4J1J8K5k6j4pL0J8K6p6k0
13901e6j9M3lm5j6K1L6k7mrk5P7O6J7k1j04J4%J5m2k7M4lK2J4Rrm3kj4P3L8o1JL6Qqk5J7k4
13882c6M2k4m8K2K4j4j06N2j4o%L7J1M4m4j4Pj3L0N6k2k3p1K1L7M0K1K8Jo2l7lK2%k0j3L1
13864d4K3%Opn5rJ7j2%L1JnjK8j2k9Q5j0m3m6%K4K2J8l5n4j3M9rJ6K6K5k6n5N3kl8m5N1R2
13845A7mK1m0j09K8J8%m8L4K2jK3n1pjJ7K7k3K7k7lj4km3L9m2Kj11O7K18m7O7pn8rL6m1n0
$$ plain form
13975 25 -47 -15 -20 -46 -50 -73 -20 10 -4 62 25 -20 -43 -7 -1 -22 -30 -39 -43 -36 -5 -38 -104 -70 -13 -78 -115 -127 -79 -47 -51 -78 -84 -77 -71 -67 -91 -54 -26 -15 -7
13955 -7 -61 -50 -88 -38 27 -16 -38 -5 -25 -46 -1 8 4 20 25 4 7 -27 -56 -52 -53 -106 -89 -20 -27 -43 -99 -126 -88 -93 -55 -7 -17 5 -48 21 -57 -61 -19 -74
13936 -74 -109 -76 -99 -78 -28 -4 -33 -139 -68 -38 -11 -29 -110 -58 -32 -47 -53 -28 -1 10 -24 -34 -25 -85 -50 -29 -74 -72 -84 -34 8 3 1 -34 -16 14 -26
13919 -26 -71 -52 -63 -55 -119 -173 -193 -121 -75 -86 -86 -109 -64 -41 -41 -88 2 -44 -50 -23 -8 -56 -26 -68 -95 -41 -30 -12 13 -13 -27 -34 -4 14 40 -36 -56
13901 -56 -75 -32 -35 -80 -96 -75 -39 -66 -70 -79 -104 -27 39 56 35 -69 -55 -55 -40 -82 -109 -65 -68 -46 -32 -23 -32 -75 -77 -91 -18 20 -41 -40 -4 4 -4 -29 -12 -36
13882 -36 6 -18 -66 -44 -20 -34 -140 -88 -102 -108 -108 -71 -60 -16 -60 -74 -67 -80 -50 6 -16 -39 -110 -89 -52 -12 9 37 38 -24 -61 -64 -42 -42 -62 -75 -44
13864 -44 -21 -21 -15 -22 -77 -86 -69 -81 -81 -50 -49 -54 -55 -27 -39 -68 17 7 -36 -82 -82 -58 -36 -18 -53 -107 -120 -71 -80 -64 -38 -13 -39 -94 -41 -43 -81 -126 -75 17
13845 17 13 34 -6 -115 -87 -69 -69 -117 -83 -61 -62 -39 -90 -97 -98 -81 -54 -77 -50 -77 -80 -94 -96 -139 -100 -142 -140 -251 -184 34 -13 54 47 -11 -20 16 -25 -75
13827g5N2K6m3J4M6m8j2L8m3%OOj2j5j7L9l2L4J2J7J6n9n8J2N7M7m0j6j3K4rjRJ4M%j2m2j
13808g5O9l8kK1m6l5j9pL2N4j9%pO1J0op3k6L3O6L8l8m5O2k8j7M2j6k7M8k7l4%rj1qmL4j2
13790e9j6M0jL3K7m3m8j9M1Nm7%K9m8k3kO5QMr0L0M9O2l1j8l5J2N8M7l4j7j1l1l4L8K7OL1
13772Ek1ln9j9P6M5rmp0l4k6K1P3L7l0m8j2o5J4M9J6K6M8p1L4J1KL8rj1o8N0j4nm4L0lK4j1
13753c7J0L4l0Rk2Rl8Q0l5k3k1M0j7rk4k1J18J5rl6k4n6n1O4N4l4l8Q1jj1N2n7mJ9K3j5j5
13735b0n2M8L2no7ql2KL5k3M5rlK9l6n1M0M5K5k8P1m2j4m1k0J7Po1P0P8o2j2k4JO6nl6o5K8
13717g7j2mO5mMN0j0m4l3NK8J2m2JJ2OMrk1j5n3N6lm2QL2k3k1pN2lK8QqK5K7k5j4%j3O6M7
13697E3q9r0L2nJ2J04k2rl1r2N6o8O8k7J6K9j4k1L9joL9J5M5p3p1P2K3n2k9k6J1L5l9P0j5
$$ plain form
13827 -75 -23 3 -40 -26 20 -28 -40 -2 -45 -45 -39 -33 -45 -60 -77 -38 -70 -36 -24 -7 9 -50 -108 -96 -39 8 -32 -48 -61 -37 -46 -47 -38 -24 -20 -20 -32 -74 -75
13808 -75 -6 -44 -46 -25 -71 -106 -125 -132 -100 -46 -65 -65 -72 -11 -1 -7 -80 -106 -73 -7 31 -7 -52 10 -18 -35 7 -9 -36 12 -15 -49 -49 -58 -69 -77 -81 -47 -59
13790 -59 -75 -35 -36 -3 24 -19 -67 -86 -45 -40 -87 -87 -58 -106 -129 -131 -66 -58 -54 -144 -114 -65 -3 -34 -52 -87 -75 -17 30 -4 -21 -32 -63 -97 -59 -32 -26 5
13772 5 -16 -19 -78 -97 -21 24 15 11 -59 -93 -119 -98 -25 12 -18 -66 -78 -143 -129 -80 -64 -38 10 -61 -27 -16 -14 24 15 4 -64 -14 -28 -33 -77 -47 -50 -26 -37
13753 -37 -27 7 -23 -14 -36 -27 -65 15 -20 -43 -64 -24 -41 -50 -74 -95 23 38 29 -7 -31 -87 -138 -74 -20 -54 -92 -11 -12 -23 29 -28 -32 -13 10 -5 -20
13735 -20 -72 -24 8 3 -64 -72 -104 -102 -67 -90 -45 -54 -57 -28 -64 -115 -75 -30 -5 -33 38 -4 -18 -59 -79 -62 -55 -116 -46 32 -30 -42 -66 -65 1 -4 -40 -105 -77
13717 -77 -89 -93 -28 -32 -28 22 12 -32 -65 -60 -32 -20 -62 -61 -49 -43 -39 -48 -69 -84 -137 -81 -84 -126 -118 -86 -109 -130 -137 -85 -88 -60 -52 -60 -35 -8 -33 -47 -47 -60 6 53
13697 53 -36 -126 -94 -99 -87 17 -5 -14 -45 -137 -81 -149 -81 -108 -92 -63 -77 -98 -59 -60 -66 -27 -12 33 -40 -111 -39 -16 -68 -97 -123 -112 -77 -116 -46 -61
13680f1J8j5p5J8Q1Lm8J9M6j2K1j2lk4K8n2O1J9lJ7j3r7m7NK6k3M7L6M8o4l0k4K4J9K2L2m3
13662e6o0M6m6M7LJ4O5p3k8N6L6j9n7L2j7KJ0m5Mm8Q6N7m6l8J1K1oP6j0j3q0K9lJ6K1J0pJ5
13644El6m1J9nK9l5l3J0J4j6PqQM5j2k6p5N8L7q1O3k0%K4KK8J8ok2Nm9L2l1J6K4j4pJ6j2R
13625f0j4RM3o6K4LO9m1Q4k2o0l6qJ7k3l1J5pK2L4N6qj4l5o9K4n3j3J9M4O1L8J0j9PN7l2p3
13607d8J9j2P9m9l6n7J0QolL8P2l4k4j0J9PJ4n3K1k2l9L3J5l3L5q0NQ4k8rk6P2rl5K2K3k8
13589f5OM3j3Nj8L6n5k2L9j2M8j2l8j2L1k4j2l1k3L2N6j1n3L4kj0P4n8J7j6L0k8L4ok1J9k4
13571f2k4rM7P%Pj9J9RL8n8j6k4L4k2k7M6P2n1l0K3J3J5j1%j2k5m2k5j7N0nJ6ml0rO2K7o4
13552a01j9qM9K2l9P7j9%n2pK8Pm5J0O4L0n0j2K4PK5L2o1%k6m4PP5KJ6J2k6m6N2j8o4M3KJ
$$ plain form
13680 -61 -43 -58 -133 -115 -34 -31 -79 -60 -14 -26 -5 -17 -20 -44 -16 -68 -7 12 9 26 13 -84 -131 -126 -100 -123 -76 -40 8 -56 -86 -110 -86 -67 -45 -13 -56
13662 -56 -116 -70 -116 -69 -66 -52 13 -60 -88 -32 4 -15 -72 -40 -57 -55 -45 -90 -86 -134 -48 9 -37 -75 -64 -43 -49 27 17 4 -76 -47 -50 -34 -13 -3 -10 5
13644 5 -31 -72 -53 -58 -29 -64 -97 -87 -73 -89 -82 -90 -82 -37 -49 -75 -150 -92 -55 -136 -73 -93 -93 -69 -67 -39 -21 -27 -49 -44 -93 -61 -92 -76 -52 -66 -73 -57 -69 -60
13625 -60 -74 -65 -22 -88 -64 -61 8 -33 51 29 -31 -67 -75 -58 -81 -112 -97 -104 -82 -48 8 0 -14 -49 -118 -94 -147 -160 -141 -97 -36 2 12 -7 0 57 25 -48
13607 -48 -29 -41 38 -11 -47 -104 -94 -86 -92 -95 -57 15 -19 -43 -53 -34 -27 -13 -66 -45 -67 -106 -73 -58 -91 -56 -136 -131 -47 -75 -84 -110 -38 -47 -82 -60 -37 -65
13589 -65 -59 -16 -29 -24 -42 -6 -61 -83 -44 -56 -8 -20 -58 -70 -39 -63 -75 -106 -129 -97 -41 -52 -105 -71 -73 -83 -9 -67 -50 -66 -36 -64 -30 -36 -57 -38 -62
13571 -62 -86 -95 -48 -41 -41 -34 -53 -34 -25 13 -45 -61 -85 -51 -73 -100 -54 18 -33 -63 -40 -27 -12 -23 -23 -35 -60 -102 -127 -144 -94 -99 -83 -87 -117 -126 -64 -37 -101
13552 -101 -120 -128 -79 -57 -96 -19 -38 -38 -90 -97 -69 -62 -107 -97 -33 -3 -53 -65 -41 -34 -9 23 -38 -38 -64 -108 -101 -26 -24 -8 4 -22 -68 -16 -34 -98 -55 -53 -52
13534e2nn6N1N6k9k3K3K1OKk0QML0l6l9L9K6Ok3l7p1R6N4m6r1O2K4pl3O0P5j2r2j3k9OK4J9
13515b2o1LL4k0l2NP0k2j3l0k1O4j6k9L6M1L5n5qM6k1r3J1N3PON2m9n3m1O3L7nn2l6j1M6O8
13497a3kj6rk4M3l4nO7%L2j6j25K0O2K7qq6ok4J3K6k9K8M2j7l8j1J5NOk7%J3J7rN9k2n0P7
13478a9l5J7K6J6M7m2j5o3k4O0M0Nn7n0M4L8mLJ0j5N9n7n8N8n5pj6PK0j6K5Qm7J4M5N5l0l1
13460d4p8LP6k2%L4J7n5J1M8o4m0KN9k6J0Lj7M3mk9l4P2mq1RP3NMj00PM9km8N2l3rlO9l2m3
13441a22j6QM4M2l1L5o8N0J9l2j4J4J2J1Kl6p7O8J4M1Lo9k0O5N5o7j4N3L0p0L2P8L5j11M2
13424Fk0m6J0m8RL1nk3K7j7J6j2l6N7J9Kj4m3L6O5n3nlJl8r1QM6K0L1K4oM3m5K7j7Kj0J0m9
13405i1J5R3j9r1M0O3j7k2l6J0K8L3j3k7m8P9m1J2jm5L4L8n4jK8j0n6k0pP0l1L5O1K6q6k6
$$ plain form
13534 -52 -57 -113 -62 -6 -35 -58 -35 -14 -8 -6 -26 -18 -14 16 -20 -59 -20 6 12 -11 -48 -119 -23 31 -15 -106 -44 -20 -27 -60 0 75 63 -29 -42 -71 -65 -41 -22
13515 -22 -83 -80 -46 -66 -98 -93 -23 -45 -58 -88 -109 -45 -61 -90 -54 -13 22 -33 -41 5 -16 -109 -98 -45 -38 -32 20 -29 -82 -123 -60 -23 -28 -80 -116 -127 -81 -13
13497 -13 -15 -31 -40 -64 -21 -55 -60 7 7 39 23 -102 -82 -20 7 -1 -87 -93 -117 -104 -78 -107 -79 -37 -54 -92 -103 -88 -83 -77 -104 -104 -91 -74 -83 -24 -46 -96 -19
13478 -19 -54 -37 -11 5 52 10 -5 -68 -92 -32 8 13 -44 -94 -50 -12 -16 -13 -3 -18 41 -16 -74 -16 -71 -78 -94 -87 -67 -83 -58 -50 -97 -83 -38 17 -13 -44
13460 -44 -122 -119 -43 -65 -65 -31 -14 -69 -58 -10 -74 -114 -112 -53 -79 -69 -66 -83 -40 -44 -73 -107 -35 -39 -120 -111 -38 -33 -29 -129 -122 -73 -75 -123 -71 -104 -113 -116 -47 -79 -122
13441 -122 -138 -130 -86 -44 -75 -40 -108 -58 -39 -71 -85 -71 -59 -48 -46 -82 -159 -91 -77 -36 -33 -102 -122 -57 -2 -69 -83 -30 0 -70 -38 40 75 -36 6
13424 6 -14 -60 -50 -98 -89 -58 -63 -86 -59 -76 -60 -72 -108 -51 -32 -30 -44 -87 -51 14 -39 -44 -47 -46 -84 -175 -167 -121 -101 -70 -46 -52 -9 -54 -27 -44 -42 -52 -42 -91
13405 -91 -76 17 -2 -93 -53 10 -7 -29 -65 -55 -27 6 -7 -34 -82 -3 -44 -32 -33 -78 -44 -6 -60 -61 -33 -43 -99 -119 -126 -56 -87 -52 9 35 -51 -77
13388g7L9k6J%rMPk1K0J5N2q7M1KK4L9o9k9PJ8L7j0OJ0k1j8j9RK0k5l0M3M5N0Kj0l2l1n3M
13369g2j2j7J9K2J3P2n1m1Oo4J6N1nL1J1QK2m7KJ07jm2j4m6j2K3O1l0l2k2L5kl0n4KL0l1J5
13351g9L8j6o7N8L8j8q4N2J26Oj19k3R6p4k7J8km1N2Q9m3k7Ql9j6jK8L0m9l3J08j9mN8n2K
13333b6n9K7P8p3n0KM6QJn2K2M1K4m5mJ6l3O2O4n4r3K3j8L2N7Pn1l0L2P6l8J1n2J3j7j9M7
13316b5l0Nj8l1P2N1m1M6L4j3o2l7L6J2m8poJ2J5K7Nj1k1n2L7L9j9j5L1m8k8N0%rj4k9L5K
13298e5m8K8qJO6K6p2L4l9p5K4L6j2K1rJ0p0O0j8J3N5k0J0M8l1j6j3K5JRk2K4OK9k6p1j7J
13280i5K5Qj3J5m1J5j3J3j6k6M1N2k5j7j6Q9kj7l3JK7m1qk3qM6j7j1K2l5l4J18L2M5p0knm1
13261f0K7l0%J6n1K6PL0R2k5n1l4K5J0k6k9K6J2J1jPok7l2l1L5OL6j1k2LM7l9k5J3J1jj8j9
$$ plain form
13388 -77 -38 -64 -63 -63 -72 -68 -61 -82 -62 -47 5 -82 -41 -39 -15 24 -45 -74 -67 -49 -12 -22 -16 -6 -27 -45 -64 -55 -35 -60 -90 -47 -2 48 50 40 8 -23 -76 -72
13369 -72 -84 -101 -82 -60 -47 25 -26 -67 -61 -125 -109 -58 -63 -32 -21 -13 9 -38 -36 71 70 28 14 -32 -44 -21 40 10 -22 -44 -9 -11 -41 -95 -93 -63 -94 -79
13351 -79 -41 -57 -124 -66 -28 -46 -130 -78 48 54 -65 -88 8 -66 -93 -75 -77 -118 -66 23 -20 -47 -39 -78 -94 -95 -67 -37 -86 -119 -11 -30 -34 24 -28 -26
13333 -26 -85 -58 20 -53 -103 -101 -55 -47 -46 -98 -76 -35 -11 -56 -60 -44 -77 -15 49 -5 -98 -75 -93 -61 -4 3 -48 -78 -46 30 -8 3 -49 -36 -53 -72 -25
13316 -25 -55 -50 -68 -99 -27 24 -17 29 63 50 -12 -49 -13 -1 -49 -56 -62 -50 -35 -8 -3 -14 -35 -87 -50 -11 -30 -45 -14 -62 -90 -40 -40 -49 -63 -92 -57 -55
13298 -55 -103 -75 -83 -82 -16 10 -62 -28 -67 -142 -118 -82 -94 -73 -82 -72 -142 -82 -100 -87 -32 -52 -42 6 -25 -41 -54 -29 -28 -19 -41 -17 -11 18 -8 -79 -96 -95
13280 -95 -70 -62 -75 -60 -101 -86 -99 -86 -102 -128 -87 -35 -60 -77 -93 -4 -6 -23 -56 -55 -28 -69 -77 -100 -108 -62 -79 -90 -68 -103 -137 -19 13 58 -12 -14 -19 -60
13261 -60 -33 -63 -63 -47 -98 -72 -65 -35 57 32 -19 -53 -28 -18 -44 -73 -47 -35 -24 -25 -18 -24 -51 -83 -114 -79 -73 -37 -48 -70 -67 -20 -59 -84 -71 -60 -61 -79 -98
13243i8K5L0k1L0l5LL0klJ2l0l4Ql6RM8l1j4Qk5K0Q5L6p5k4nl1L1M1L2l6kJ4Kj5j1K1M3o4
13224f4k3j6kM0j1oM7k2kj4K4L9K9k6n6k8L7k4o7k8M1oN3L8m5M0M6q7LOn9L3O0L9m3L8O6m8
13206Bm1m6PM0Qo1jK9M0l1K1l1O3rM7K8n6m4L8n1mpj2J5N6k6k9l1rO8K4k8l3nl7K6J7mp3Q4
13187e6N8K8m7l0K9j9m9k1l2P0j3n1J8L5J0M2R0j6n9n4kO6n6J2k8K3J2k5k6R2k1M2k7j2L4
13170A7m8pK4l2L3K8l5j1L5j9J0J2l3M7m3kM4k2k7J1j5p3O4N5L8p3k1K3M1k9l8M9K7J3k3p9
13153e9k5nJ8N1j3lKn1j2J5p6M0K5l5L0k7O4M0j14m2J1O5Q2nl0j1J6M7k1j6m0L4K7l1L3kl7
13136e5J2nq2L4N8k3K5l5kk0J4L0J7m1O9O7k4k8k7j9Ql4pL1M1m6n4j7J6N6m5n3J5k8L6Jj1
13118a26M4L8N6qm7K2O0k5n8J8k8ojK7L3n4J0J8RQo2L7J0nl3kn4J3L1Mk7L0j1J5j6k1Q4J5
$$ plain form
13243 -98 -73 -43 -64 -34 -69 -66 -36 -38 -41 -29 -59 -93 -85 -121 -112 -64 -95 -109 -101 -126 -106 -21 15 -60 -84 -89 -120 -89 -48 -16 -52 -54 -40 -38 -53 -64 -43 0 -64
13224 -64 -87 -103 -105 -65 -76 -82 -35 -57 -59 -73 -49 -10 19 -7 -63 -91 -54 -78 -145 -173 -132 -138 -85 -47 -92 -52 -6 -93 -90 -84 -143 -110 -50 -11 -54 -16 50 2
13206 2 -39 -85 -78 -38 -30 -91 -92 -63 -23 -54 -33 -64 -1 -10 37 65 9 -35 3 -48 -52 -59 -71 -56 0 -26 -55 -86 -95 -27 -3 -31 -64 -69 -106 -80 -63 -67 -140 -56
13187 -56 2 30 -17 -47 -18 -37 -86 -107 -139 -69 -82 -133 -115 -80 -70 -28 62 46 -13 -67 -69 -3 -59 -47 -75 -52 -40 -65 -91 1 -20 22 -5 -17 17
13170 17 -31 -38 -14 -46 -13 15 -20 -31 4 -15 -5 7 -26 21 -22 -24 20 -2 -29 -18 -33 -106 -42 13 51 -22 -43 -20 21 -8 -46 3 30 43 20 -59
13153 -59 -84 -89 -71 -20 -33 -36 -34 -85 -97 -82 -158 -118 -93 -128 -98 -125 -61 -21 -135 -177 -166 -101 -19 -24 -54 -65 -49 -2 -23 -39 -79 -45 -18 -49 -16 -18 -55
13136 -55 -43 -48 -130 -96 -38 -61 -36 -71 -73 -93 -79 -49 -32 -73 -4 63 39 11 -16 -35 -27 -61 -68 -37 4 -42 -96 -113 -97 -41 -86 -139 -124 -152 -116 -115 -126
13118 -126 -82 -44 12 4 -43 -21 39 14 -44 -26 -54 -60 -61 -34 -1 -55 -45 -27 -18 -10 -72 -35 -25 -30 -63 -65 -119 -106 -75 -71 -98 -68 -79 -64 -80 -101 -17 -2
13100b%l7K6L2j6L3n0m5K7Jj0k2O8p4N3M2j5m0o1K6OLN9j0o5J2K2n9l7L7O2p2K4nQN5p9m7
13082a50j2M6M8J1l7K2O0p1m3k5L6L3K4J7rm8K3P3J1o2k0K2K4k3oj3K2J4Qk1M1o2l4J4M3k9
13065g3%O1l1QmL2o1j9k4P4l1j8Rk3M5N7j8Nm7j9P7k9m7O3ol6M9l8j1N5ko8j5R7K7k6m8l4
13046f9LL3k6K1J1j4k5j8qOk6k3Q0j8k4PL6lPn1o0P1L0jKj1m8m2N9J9lJ09%l9L9l8Rk9n6O9
13027b1k4k5k7L8M8j24lK5jK4LPJ2m5NL3l9O5j6m0N7k7M0J1l1m9j2P8l0l1R4qK1J8o2k4j2
13010g2k3lK6L1J6rl5L3P6pJ2J1n1n3N7%m0j0l8k1l3N2M5L9j7j8k7K4k7K6J3k9n1N5L1o0K6
12992e1rk9P4mK5m3Mj3rJ6oL4L5q6N4j4k6J4MK7j5m7j8n6J5P0k0L5qL5l3J2Rj7mj4oj7n4J9
12973a17J8Q8m9J6l0k9L9J4P5Rp9L3J3p2l1P1lK4N7m8Ko3l5j7L4N0M3l7L6j3m7K0J8J1j8m9
$$ plain form
13100 -2 -2 -39 -13 19 3 36 -14 -59 -32 -31 -41 -63 5 -69 -16 26 11 -29 -90 -64 -58 -55 4 -6 -71 -59 -37 -96 -133 -96 -34 -106 -82 -87 -79 -24 -103 -150
13082 -150 -162 -116 -68 -57 -94 -72 -12 -83 -126 -151 -115 -82 -58 -41 -50 -98 -75 -2 9 -53 -73 -51 -27 -50 -56 -69 -47 -33 -25 -46 -5 -67 -101 -87 -44 -73
13065 -73 -73 -12 -43 -35 -39 -7 -68 -87 -111 -37 -68 -86 -77 -100 -55 2 -16 -11 -58 -77 0 -29 -76 -13 -19 -55 -6 -44 -55 0 -2 -70 -85 12 39 13 -35 -69
13046 -69 -66 -33 -59 -38 -27 -41 -66 -84 -92 -86 -112 -135 -55 -73 -97 -90 -54 -57 -50 -101 -161 -90 -60 -61 -59 -70 -118 -160 -101 -82 -85 24 24 -15 24 -14 -5 -34 -90 -21
13027 -21 -45 -70 -97 -59 -11 -135 -138 -113 -114 -90 -87 -80 -68 -113 -108 -75 -114 -49 -65 -105 -48 -75 -35 -24 -55 -104 -116 -38 -68 -99 -5 -13 8 26 -36 -60 -72
13010 -72 -95 -98 -72 -41 -25 -34 -69 -36 40 33 45 56 5 -48 9 9 -31 -41 -79 -100 -133 -81 -36 3 -14 -32 -59 -35 -62 -36 -23 -52 -103 -48 -17 -77 -51
12992 -51 -60 -89 -15 -19 6 -37 -33 -46 -55 -39 -45 -11 24 -62 -8 -22 -48 -34 -30 -3 -18 -65 -83 -139 -124 -54 -74 -39 -47 -12 -45 -33 -24 -41 -45 -59 -65 -82 -136 -117
12973 -117 -99 -11 -60 -44 -74 -103 -64 -50 25 34 -45 -12 1 -71 -102 -31 -34 -10 47 -1 1 -62 -97 -114 -80 -30 13 -24 12 -1 -48 -28 -10 1 -17 -66
12956f6j7lo2J01L2j2k3Mm4K0J5K1O3m6Kp4J4J1nO8%k4k8l6O4jm4j7O0J6kr5nN5MKj2RlpO5
12936@m3lLp0kK8J4j4jL5M2Kr5pM7OP8q1k5K1l8K1j7N6ql9L9K8j0l0LR0J2q9k9Pl4k1J3M8
12917f3jp1K0K1J4m2m%j6l2J10N0om1N7J6j09O3Ok1J0PL8o6ml6Q7l1NJ7n1lj6RM2J8p0K3M4
12899b6K8Okm7j5M3J8J8mNj1m7P7%Qj18l0jM3j7m3nnK1J4K7L4J7K0K8j14M0M9pml1j9L2M3
12880B5ko9K3l1j7k0kR3K4j4j7Jm1Mj3M7K4j3o7K9Mm4j0N1L1J4o0k8j8M8J5K9J6l1L9K5n2
12862gpo3J9rkN7J2k2m1Nk1oj3j2M6K3j9l8PM0M2l4kJ2J6m6M3o2j23Q7L5jK2J5J7l6J0J7o8
12844a07P9k1J7m2O1k1p5M1l5L4%n2L4m5o0P3KK9ML2J0o5L3O1J3o0k1L7pJ4j7J7L5m7l2r2
12827a73j5R7M5j3No1L2M4p8j0J8J2N5L4j1QK6m5m3L3KlNn1Nmo0KP1J3N5%m5j2J5ORL0L7m2
$$ plain form
12956 -66 -83 -86 -148 -47 -15 -27 -50 -46 -90 -70 -55 -34 29 -17 -15 -89 -75 -64 -69 -1 -1 -25 -53 -89 -25 -26 -70 -87 -27 -11 -13 -108 -113 -58 -54 -52 -64 -55 -58 -65 0
12936 0 -43 -46 -43 -113 -115 -87 -73 -87 -88 -53 -11 -9 -104 -111 -64 -58 20 -61 -86 -65 -103 -82 -99 -43 -51 -90 -51 -23 -33 -63 -60 30 42 -47 -76 -69 -103 -124 -111 -63
12917 -63 -64 -135 -115 -94 -80 -122 -126 -126 -142 -174 -64 -14 -20 -61 -4 12 -97 -34 -28 -49 -39 -32 6 -60 -64 -100 -13 -44 -39 -22 -73 -76 -92 -83 -41 -23 -93 -70 -26
12899 -26 2 8 6 -41 -56 -13 5 23 19 24 13 -34 43 43 51 -67 -97 -98 -55 -72 -115 -120 -125 -104 -90 -63 -29 -12 8 36 -78 -38 11 4 0 -31 -50 -18 25
12880 25 23 -46 -23 -54 -71 -91 -93 0 24 10 -7 -6 -47 -43 -56 -9 15 2 -65 -36 -32 -76 -86 -35 -4 10 -50 -78 -96 -48 -33 -4 12 -19 20 45 -7
12862 -7 -14 -77 -58 -67 -69 -12 0 -22 -63 -58 -79 -85 -98 -110 -64 -41 -60 -98 -91 -51 -9 -43 -45 -33 -17 -63 -20 -82 -205 -118 -83 -84 -62 -47 -30 -66 -56 -39 -107
12844 -107 -28 -49 -32 -74 -13 -34 -109 -68 -103 -69 -69 -121 -87 -132 -192 -119 -117 -88 -84 -52 -42 -107 -74 -13 0 -60 -81 -44 -51 -37 -54 -37 -2 -49 -81 -173
12827 -173 -188 -91 -46 -59 -54 -115 -83 -39 -117 -127 -109 -97 -42 -8 -19 -11 15 -30 -73 -40 -38 -41 -36 -87 -82 -86 -146 -144 -73 -60 -5 -5 -50 -62 -47 -41 -32 -2 35 -7
12808gm4M8k3r2j9O1L1J5j2j0L6k0J2M9o0o7N3k8jl8K3L7K9rr8J8KO5ml0JO7L7j06J8K9l8
12790g5j8J1J5l4l5Q8m8K6J8K4k0j1O3m8k0J6n1j2L3P1k2j4M7J0nO0q5m0K4k2kj0k4k4J3L0
12773g1pn5P5L8o1O9k7q7N7o3K1L5J4J5L5qk4o3Oj8m1J04M1m8j0Jl5J7L7J5l6L6j7m9L1L3
12756d0m5M6lk2l6k4N1kpL4J3mj9J2oM5k9m8lL3M6l4L5j7k1J0jL1l2j9m4J1J7LL2ok1J9L5
12737a0j5p3m5%J6m8l6J4Q3qL4Q3N4l8m1k8j1l2m0O0M9o0k9J21L0j7np3K6Lj1Jp8J9K8O4k0
12719c3J5j6l7OK0qK7RK7J1J1l9RJ6l3K0L8J3r1m8l9NO5J3l1M0J3K5J9j7k6o0k5N2K3L5k6
12702a7Rom2PN0m3k1mn0J4j6Q8L5m0q5oK4P7PM3l0K7m6QP5n9l4k1l3N1K7j6k9J3n1j4RkN3
12683d8J6PJ6l4Ok9RM2l7k0L8PJ0k1J4j0qQm3p1P0%m0J9M4k9n2oLNJ9lK4k0P2L3M7l8J3j6
$$ plain form
12808 -7 -51 -3 -26 -118 -137 -76 -45 -30 -42 -52 -16 -36 -24 25 -35 -102 -49 -77 -78 -116 -93 -56 -27 -36 -134 -116 -114 -49 -53 -83 -82 -15 22 -84 -66 -37 -75
12790 -75 -93 -82 -67 -101 -136 -48 -96 -70 -52 -28 -48 -59 4 -44 -64 -48 -99 -111 -78 -7 -29 -43 4 14 9 69 -16 -56 -32 -54 -56 -66 -90 -114 -101 -71
12773 -71 -78 -133 -58 -20 -81 -12 -39 -126 -69 -132 -111 -76 -62 -47 -12 -20 -44 -107 -101 -119 -160 -56 -15 -63 -73 -72 -107 -90 -53 -38 -74 -38 -55 -104 -73 -40
12756 -40 -85 -39 -42 -64 -100 -124 -73 -75 -82 -48 -35 -39 -58 -46 -52 -7 -36 -84 -87 -54 -8 -42 -7 -24 -45 -35 -36 -5 -37 -56 -100 -89 -72 -69 -37 -43 -64 -45 -10
12737 -10 -25 -98 -143 -143 -127 -175 -211 -197 -114 -122 -88 -5 49 11 -30 -58 -69 -101 -141 -81 -32 -92 -121 0 30 13 8 -65 -39 -36 -47 -46 -124 -105 -77 -13 -33
12719 -33 -18 -34 -71 -65 -45 -53 -26 -17 10 21 32 -7 2 18 -15 5 43 56 -35 -83 -122 -117 -52 -39 -70 -30 -17 8 27 10 -16 -76 -101 -49 -26 9 -17
12702 -17 -8 -14 -56 -49 1 -42 -63 -67 -117 -103 -119 -31 4 -36 -121 -127 -103 -26 -19 24 -6 21 -25 -17 58 -1 -35 -56 -89 -38 -11 -27 -56 -43 -94 -108 -99 -101 -48
12683 -48 -32 -25 -9 -43 -37 -66 -57 -15 -52 -72 -34 -27 -17 -38 -24 -34 -42 -34 -77 -148 -78 -78 -118 -99 -55 -84 -136 -142 -139 -134 -115 -118 -94 -114 -42 -9 38 0 13 -3
12664cj8M3J5l8J6m8Pk0k2m4L5J3pL1m9kP8Kj9L6o4j8K2m1P0k0J6l5j4L2mj1K2M6m6k4jM2
12646b2j7J0k1q1L4oJ8R5m2ml8rKK5k5L4K0j3L8rj7m1k9Ok9M2K1l1K0MM0L3j7n6J6k1nL3K7
12627a5n2J4K6m3m7N5k1L2P5k4q2J7P2n1k3k6O8J3m9m1L5J0%Rj0K7j3J0k0n0K8RM7pnJ6o6
12610h2n9J4J1N7p%M7N1m6o5l0QN1NQM2Pj01qO3p2j8n4N1M2L1n2n0K1L2J2l4K8L7LkL2J0k6
12591d3j5p4N7l6K6J6k1M6l5o1N4N1j5RM4L2p3%K6j5m6k1R4k2Qk6LK0l1lN6l9q1M4K9j7P2
12573A3l4j6M2m8L4L0q9nO9Ok0j1m4J4K0LK6Om4p7L5N8j8J3K8No4k2K2l9L9K1K1J0p2K6j3
12556g5LM8k4l7jL4o7jM3N6j5l9j0Om3J5P3k5K0j5m2O1K8J2QOl3R8l8j06l3K7m6N0P7rp4j8
12538h6jk4K2nnL8k6K9O6K4p0j4N7L0K3q8RJ6j8J1l8k1J9Po1LN0J9mrk3l3j3L5MLpl2K8L1
$$ plain form
12664 -3 -21 22 37 -1 15 -33 -26 -46 -68 -112 -77 -64 -71 -40 -89 -91 -13 -11 -30 6 -58 -76 -54 -95 -25 -45 -29 -64 -78 -46 -50 -61 -39 7 -39 -63 -64 -22
12646 -22 -39 -29 -50 -131 -97 -103 -85 10 -32 -36 -74 -83 -81 -56 -81 -47 -27 -40 -2 -11 -28 -69 -98 -92 -121 -79 -58 -89 -69 -65 -25 8 -9 -65 -49 -70 -75 -42 -15
12627 -15 -67 -53 -27 -70 -117 -62 -83 -51 24 0 -82 -65 7 -44 -67 -93 -25 -12 -61 -102 -67 -57 -57 -48 -58 -31 -44 -34 -54 -104 -76 -67 -20 -27 -32 -16 -82
12610 -82 -141 -127 -116 -59 -66 -66 -19 32 -14 -79 -109 -101 -50 -45 -37 5 12 -89 -97 -34 -106 -124 -178 -127 -85 -54 -106 -156 -135 -103 -91 -125 -97 -60 -57 -59 -27 -17 -43
12591 -43 -58 -132 -75 -111 -85 -69 -90 -44 -79 -140 -86 -35 -50 -41 3 35 -38 -38 -12 -27 -73 -94 0 -22 -14 -40 -37 -17 -48 -51 5 -34 -115 -71 -42 -59 13
12573 13 -21 -37 5 -43 -9 21 -68 -73 -4 2 -18 -29 -73 -59 -39 -36 -10 -4 -48 -125 -90 -32 -50 -37 -9 -4 -68 -90 -68 -107 -68 -47 -26 -16 -88 -62 -75
12556 -75 -72 -24 -48 -85 -86 -52 -119 -120 -77 -21 -36 -75 -85 -79 -122 -107 -34 -59 -39 -54 -96 -35 -7 5 13 19 -14 84 46 -60 -93 -66 -112 -62 15 6 -68 -86
12538 -86 -87 -111 -89 -94 -99 -61 -87 -58 8 32 -38 -52 5 35 58 -30 -21 -5 -23 -12 -50 -71 -52 -45 -106 -103 -53 -34 -38 -47 -70 -103 -116 -81 -77 -74 -81 -113 -85 -54
12519e4J7J0L5L6m2l7OK5m5J2Mm7M9pJ9R5n7p9o1O7K1n9KJ1N6J0r3O9Qm2ol1PL0r%j7p2K8
12500a41J13J6P9q9l1N5q5K1%J2pJ3K4k1J5k6l0k3MM2N1LkRL6K1r9n2K8QK2LK1Mj9l8k5Q2
12482fm6j5mK6J8l1k8K4n5J6K9L1l9NN0j3MO4l9Rl5%l1MJ6j1K2j2o0K0K8J1M7Mn3j4K5M7m5
12463c7l7M4J7j6l7K0rlk0M0J3m8pM2o9k3M4L9n9ml1J27K1l9N4k6K0p6l4M9j1%k2KN3L1k0
12446a2mo3k9lR0J2k7l6J1M7K9J7m1oOo9NJ06J9r6n6m3P3K4PPl4M2kJ3L2l4pk6q9J4K7K1L2
12427d3j6j0J3n8M0oK5LJ3N2l0Qk1m3qJ7N3MOnq1N1J3k7K3l8J7jo6K8mk2JkK1J9l7J7J5J8
12408f1lj1M0J7k5l2m9K3P9J1k1o8M5L3QJ0Jp6P4M4j0n4o9PQL4K4o3J8mJ9j1M7Rl9k1n3n0
12390a69L7M7j8jM4jJ5L2J0o7l3M7O6k7k4j3n8P1o8L8j0M2ok8K4Jj6J4j9J0J6l5o5P9N4m0
$$ plain form
12519 -54 -37 -27 8 44 2 -35 -29 -4 -49 -37 -33 -80 -31 -38 -19 76 19 -60 -121 -54 -33 -92 -90 -79 -23 -13 -106 -37 -29 -71 -77 -108 -101 -71 -80 -80 -97 -169 -141
12500 -141 -28 -12 67 -22 -53 2 -83 -62 -62 -50 -57 -44 -20 -41 -26 -52 -82 -105 -101 -59 -8 -5 -7 2 38 59 -40 -92 -64 -56 -34 -31 -10 -6 -25 -63 -88 -6
12482 -6 -52 -67 -71 -45 -27 -58 -86 -62 -117 -101 -72 -41 -80 -75 -25 -38 -34 30 -9 0 -35 -35 -66 -62 -46 -57 -35 -47 -107 -87 -59 -48 -1 3 -50 -64 -39 8 -37
12463 -37 -74 -30 -13 -29 -66 -46 -55 -58 -78 -38 -25 -73 -80 -38 -107 -130 -86 -47 -106 -110 -141 -14 7 -32 22 -4 16 -60 -94 -45 -56 -56 -78 -76 -23 8 -12
12446 -12 -16 -79 -108 -111 -21 -9 -36 -72 -61 -14 15 32 -9 -15 -9 -78 -73 33 52 -44 -100 -143 -70 -46 -39 -32 -66 -24 -26 -13 19 -15 -22 -48 -137 -123 -96 -75 -43
12427 -43 -59 -69 -56 -114 -74 -80 -55 -52 -39 13 -17 -9 -30 -73 -81 -64 -11 -7 -1 -6 -87 -36 -23 -50 -27 -65 -48 -49 -115 -87 -91 -113 -112 -114 -93 -74 -111 -94 -79 -61
12408 -61 -64 -75 -35 -18 -43 -75 -124 -101 -22 -11 -32 -100 -55 -22 -14 -4 -3 -79 -5 39 29 -25 -94 -87 -79 -45 -21 -84 -66 -70 -51 -62 -15 -6 -45 -66 -119 -169
12390 -169 -132 -85 -103 -104 -60 -61 -46 -14 -4 -71 -104 -57 9 -18 -42 -55 -113 -42 -110 -72 -82 -40 -46 -74 -50 -49 -65 -51 -70 -60 -44 -79 -144 -65 -11 -51
12373e1K4j8K9L8k0J3o6L0n1o2N2M1k8N8M2o7K9l6K1l0%j9L5L9K4K1o4p9N8L3j0J5k8j5qK1
12355b9l9l8L6M6L5o0K8Lm1kQrP5l0p0kO7l4m1K3K8K3k8pj9J7K5m9L0k6K5Q3o7j1M4q7JK5
12337f7m4rP7j5l0j3P2J9l6Kq4M4J9J5J2m7l2K8KN6L2j5j1k8j5O1n6q2L9N6l9J2N2p3J3J9
12320f6k1M8lJ6k4N7K5m8m6j8M8K2j6J0l3N0K1k2j0n1M3kMKp8k2N7k7K9J3K4OJ6n9MKlk2q0
12302a54j1N0N4J1k4m7qM1N6j0j5J3K7j4m0J7m5N9Qj4l2J9k8N1P8Nq2n4m4L0K1L3j8j5Kl3
12284a13nO1pL1m3L3MK0K1l0N0L3j09q8J07M7j5k1m7l3m0N9J2l7M5O1L2k4o3k6k9M1Jl9P6
12268c5Nk0%k0m0jK3L7J3J1j2lpl2M7k1k1L9jlL5l1rM5m5K5K0l3kk4j5K4m8K6%J02Kp0L6n8
12249f1p6J03K4m8K0N0k6l7K8L5p9l2P8m1j2k6J7K3j3N0j07M4J7J0kj1mK0j8jqrl7M4K0J9
$$ plain form
12373 -51 -27 -45 -16 22 2 15 -51 -21 -72 -134 -82 -41 -69 -11 31 -36 -7 -43 -22 -52 -52 -71 -36 3 27 48 -16 -95 -37 -4 -14 1 -27 -42 -50 -29
12355 -29 -68 -106 -70 -24 11 -49 -21 -18 -59 -61 -53 -62 13 -17 -87 -89 -22 -56 -97 -74 -46 -23 -51 -58 -77 -60 -35 -84 -54 -80 -55 28 -39 -50 -6 -93 -92 -67
12337 -67 -111 -120 -43 -58 -88 -101 -29 -10 -46 -44 -128 -84 -65 -50 -38 -85 -117 -89 -87 -31 1 -14 -25 -53 -68 -7 -63 -145 -106 -50 -89 -77 -25 -98 -85 -66
12320 -66 -87 -39 -42 -26 -50 7 32 -16 -62 -80 -32 -10 -26 -16 -49 1 22 0 -10 -61 -18 -20 -16 -14 -92 -114 -57 -84 -55 -42 -18 -12 4 -55 -51 -49 -52 -74 -154
12302 -154 -165 -115 -61 -50 -74 -121 -129 -88 -32 -42 -57 -44 -17 -31 -71 -54 -99 -40 -32 -46 -78 -59 -87 -36 42 47 -35 -89 -133 -103 -82 -49 -67 -82 -80 -113
12284 -113 -118 -57 -64 -33 -76 -43 -39 -19 2 -28 22 55 -54 -142 -35 12 -3 -24 -71 -104 -144 -85 -73 -110 -65 -4 28 4 -59 -85 -114 -73 -72 -111 -35
12268 -35 -30 -50 -50 -70 -110 -111 -88 -51 -38 -27 -39 -42 -49 -81 -34 -55 -76 -37 -38 -41 -6 -37 -46 -1 -46 -21 -1 -34 -36 -60 -75 -51 -99 -73 -73 29 31 -39 -3 -61
12249 -61 -137 -34 -10 -58 -38 12 -14 -51 -23 12 -67 -99 -21 -62 -74 -100 -83 -60 -73 -23 -130 -86 -69 -59 -61 -72 -76 -56 -74 -75 -83 -92 -129 -85 -65 -46
12231d6j2QN8l5m1L8L2l2QJ1J5J8j5j7k3m7n6O3j1K2m1MJ9M2P1j7k7k9mk1j4k6P2L8k9L9p8
12214f3L0k8n7K5P0%n5M2K5j8KrpM1K6j7l0K2l5K6l3n4P4nk3lok1pLM6Nl1o7N8K1OM9l0l0
12195e8nkN2k8k6K8l9qJ1K3NPk3J6K1K2l5K7l4L7l4LJ3k3LOj1m1j6L7K2J0Mj1r4N7R0j0k9
12176c3n0L8j9J4K1rL8o0OK5J7jNk0k4j3k4O1k2L0l3j4k4N9L9k3nkl1p3l7R6j6Kj3O2P8j32
12158h7l1M6j0l2pJ8O5J9k5l4L7j4J5j4j4p9oL7l0M4M9o3JQ7L2K2l6j2Ol8m7K8j4L0M4Ql1
12140c6J9n4k9M2L5N2p0k1j5j1%R0J1o3oJj0L0m9N1J1ql9rM6P2l2j7j6M4j1r1J7j4kJ03M7
12123F8p0k0pm9Kl2N7J3n1J6L0K3Ol4O1n4l9L1K7qj7krM2o0l1j0L0O3Nl1J5m2k6J2LJ6N4k2
12104d0m1Jj1P3j5o5NJ9m3L4P0Nj9o2J4M8m9Pk0LL3j5l8J5j2J5J9mJ1K2m4j2O0J1Pk2K3n8
$$ plain form
12231 -46 -58 -50 8 -27 -68 -30 2 -30 -22 -11 4 22 7 -10 -33 -80 -136 -73 -84 -62 -103 -99 -80 -38 33 16 -11 -40 -44 -65 -79 -105 -33 5 -24 15 -63
12214 -63 -33 -61 -118 -93 -23 -23 -78 -36 -11 -29 -27 -36 -43 -2 24 7 -23 -1 -36 -10 -43 -97 -23 -28 -51 -54 -60 -81 -88 -85 -39 -34 -65 -132 -74 -53 -47 2 -28 -58
12195 -58 -63 -65 -13 -41 -67 -39 -78 -86 -75 -52 -47 -40 -63 -47 -26 -4 -39 -12 -46 -9 -43 -40 -27 -50 -47 -41 -52 -93 -109 -72 -50 -40 -36 -47 -141 -84 6 -4 -33
12176 -33 -83 -45 -64 -50 -29 -38 0 -60 -54 -29 -12 -13 -8 -28 -52 -65 -89 -28 -50 -20 -53 -67 -91 -32 7 -16 -21 -23 -54 -127 -164 -68 -84 -82 -95 -33 45 -87
12158 -87 -118 -72 -82 -114 -121 -103 -38 -19 -44 -78 -41 -55 -40 -54 -68 -147 -153 -116 -146 -102 -53 -116 -115 -28 4 26 -10 -22 -16 -54 -101 -73 -87 -57 -13 -5 -36
12140 -36 -17 -71 -100 -58 -23 29 -41 -62 -77 -88 -88 2 13 -50 -56 -55 -65 -35 -84 -33 -22 -30 -69 -78 -32 40 8 -9 -25 19 8 -83 -66 -80 -82 21 68
12123 68 -2 -22 -29 -78 -76 -108 -51 -38 -89 -73 -43 -20 -14 -48 13 -41 -80 -49 -22 -30 -47 -49 -58 -16 -76 -107 -117 -87 -24 -19 -50 -35 -77 -103 -91 -88 -72 -18 -40
12104 -40 -81 -80 -91 -18 -33 -98 -93 -74 -117 -83 -13 -8 -27 -89 -75 -27 -76 -69 -89 -86 -53 -68 -106 -91 -103 -88 -69 -73 -62 -40 -84 -96 -36 -25 -18 -40 -17 -75
12086g5K0J9K0l0LJ4olK5n0lqNl5%L1M0j0l6lj6j7J1M8o9L9O6N3o7n3nK8J5mK3pK2Nj5j8M9
12067Fqk4k7m1m0K9P8Jq0j0J0O1N7K7n9p1O4k7Q9m3k6rm7L5l6QM4K2l3j5lJ4j1O4n1j6Jj4
12048h1K3O4N5o1l8K1N0p9l5K9j4l6M4pj2%J1qkLk3nN5K0k5j2J0p5N9M2J4p4k8M8K3J3mj7
12030e2L0jp4N2oqJ3j8k3Q1N3o8j3l2l0K9Mll0L0J6j9k5K6L7O9o5j5Pm4J1K9k2j8n5L6L2K0
12012d6m1M2m4K4%L2n3M5O3%rm9N4jp5MO2Kn2J7p3J4pj6K3j0K6k6j01L4Q1j4OL2ll6Q0J7m2
11994d0Ql1M9L7n7J8J0j0k1k0lm0ol5Q9l0L4l7nO3j8pk2o9JnM7L8k2L4M3olj01NP0KL1j14
11975a23PR4k1%J7o4n4P0P9J9m6L8j1k3j08L2O7J1j1m1m1kN1K1l3L7M3k8L4k4n6O7Ql4p5%
11958a00PlJ8O4k6L8n9KP7k1l7l6k7J7ml5M1jK1j5Q6j2m2rK8K1nJ6no7PN2k9j3o4K6N2j0m1
$$ plain form
12086 -75 -55 -36 -16 -46 -43 -29 -35 -38 -13 -63 -66 -74 -69 -104 -104 -73 -33 -43 -79 -82 -98 -115 -104 -56 -125 -86 -20 33 -34 -87 -92 -64 -49 -53 -30 -37 -15 -10 -25 -43 6
12067 6 -2 -26 -53 -94 -134 -105 -27 -26 -106 -116 -106 -45 12 39 -20 -91 -27 -54 35 -8 -34 -43 -90 -55 -91 -83 -39 -17 -50 -65 -68 -54 -65 -1 -52 -68 -67 -81
12048 -81 -58 6 61 0 -38 -17 33 -46 -81 -52 -66 -102 -58 -65 -77 -77 -66 -74 -76 -73 -96 -101 -46 -26 -51 -63 -53 -128 -69 -27 -13 -87 -115 -67 -44 -31 -35 -52
12030 -52 -22 -23 -97 -45 -51 -59 -46 -64 -87 -6 47 -21 -34 -66 -96 -67 -63 -66 -96 -66 -50 -69 -94 -68 -31 38 -27 -42 -35 -79 -68 -39 -61 -79 -134 -98 -66 -46
12012 -46 -87 -45 -89 -65 -65 -33 -86 -41 22 22 13 -36 18 17 -58 -54 8 10 -42 -25 -98 -84 -91 -107 -84 -94 -68 -94 -195 -161 -80 -94 -88 -56 -59 -95 -15 2 -40
11994 -40 -32 -63 -14 23 -34 -16 -6 -16 -37 -57 -60 -100 -106 -141 -52 -82 -48 -85 -90 -27 -45 -52 -74 -143 -142 -147 -100 -62 -84 -50 -7 -13 -16 -117 -112 -42 -40 -9 -123
11975 -123 -116 -22 -43 -43 -26 -90 -144 -74 5 24 -22 16 5 -18 -126 -94 -27 -16 -27 -68 -109 -111 -60 -39 -72 -35 8 -20 14 -10 -66 1 9 -25 -100 -100
11958 -100 -93 -96 -78 -14 -40 -2 -61 -59 18 -3 -40 -76 -103 -86 -90 -125 -84 -85 -64 -79 7 -5 -47 -56 -28 -7 -12 4 -1 -68 -61 -9 -38 -51 -115 -89 -37 -47 -88
11939h8M5J8J8m5j9K9l1K5k0N4k3k2m%K5K8n6l5ok1QK4L6L1M4j3j0j5k1Lm2M0L2k3K3K3l8
11922b6l8L0j8k8l7J5M1K0j1j3K4O3k3n0mJ9J4J7mm5J2j4o2O3J2Q3K6q3%n5NoK8J3m1M3m5
11904g5J1K7J7o2N3L4J8m8j6rM1m7O4rn3MK2Lk2j0n2J2jQM4k6L8L1l5N4k3J1m8KM4k5o0m5
11886a28J11k3J7j1Nl2l0J0pJ5M4l5M5n8Prl4O6p5j4Q0j4J5j0j7k7j5Q7k3m3K4Lm0J9K8nL2
11868d2%k0O1jJ6m9j5qMJ4PJ5r9N8M6m8j7K1K8k1Qk2n0l4pN2J9k7K8mK6K3rj5J6j2m1N2M0
11850gn3j2l7J2n0M0J0l8J9Q2J7pj6pq6J0ml0L9J0L5K5k9P8j3kk2j9j5jLJ8N7j8o6N2l2k5
11831h2K6KL0j7J2L7j4l4j9L5l5KmP8Npo7N6l7oQLj8rO1m0L9%m1K7o6%oK4L2Jk9j1K4PJ9M
11811a0Ql2M2l6l0Qk7J2o0P6j4m8K4lj1K2K9K6m3L2m9oQ7l5p8M2m4l4R9L1lj0k4m5m3j7R1
$$ plain form
11939 -88 -43 -25 -7 -52 -71 -42 -73 -48 -68 -14 -37 -59 -63 -63 -38 -10 -66 -101 -107 -128 -120 -96 -60 -29 15 2 -8 -23 -44 -41 -83 -43 -11 -34 -11 12 -26
11922 -26 -64 -34 -52 -80 -117 -102 -61 -41 -52 -65 -41 22 -1 -51 -55 -36 -22 -5 -9 -54 -42 -56 -118 -55 -43 40 66 -17 -17 -72 -67 -73 -45 -32 -73 -30 -75
11904 -75 -64 -37 -20 -82 -29 5 23 -25 -41 -50 -9 -56 8 -1 -54 -50 -28 -25 -47 -57 -109 -97 -98 -90 -46 -72 -34 -3 -38 16 -7 4 -44 -42 2 -23 -83 -128
11886 -128 -17 -40 -23 -34 -29 -61 -91 -81 -88 -73 -29 -64 -19 -77 -70 -79 -113 -47 -122 -136 -56 -70 -55 -65 -82 -109 -124 -37 -60 -103 -79 -76 -116 -97 -69 -74 -42
11868 -42 -42 -62 -1 -2 14 -35 -50 -58 -54 -40 -33 -18 -117 -59 -13 -61 -78 -57 -29 -50 -42 -64 -114 -148 -155 -103 -84 -111 -83 -87 -61 -38 -47 -62 -46 -58 -99 -47 -7
11850 -7 -60 -72 -109 -97 -147 -107 -97 -135 -116 -34 -17 -24 -40 -47 -133 -123 -127 -157 -118 -108 -73 -48 -77 1 -12 -14 -36 -55 -70 -71 -68 -50 7 -11 -77 -25 -57 -82
11831 -82 -56 -54 -24 -41 -29 8 -6 -40 -59 -24 -59 -57 -61 17 22 15 -52 4 -33 -39 -31 -28 -46 -55 6 -34 5 5 -36 -9 -75 -75 -81 -57 -25 -24 -53 -64 -40 -33 -14 -10
11811 -10 -2 -34 8 -28 -58 -50 -77 -65 -125 -49 -63 -111 -87 -90 -101 -79 -50 -24 -67 -35 -84 -90 -3 -38 -116 -74 -118 -152 -53 -22 -25 -35 -59 -104 -147 -164 -73
11794g3N2m9j3J0Pj9kL9M2k4j3p4J5J2J2nJ7J3%K7omK3M0j7k9pl1K4Rj1q5M4N5m0L6RL5k9
11775a0l3l4J4o7M9K0lN9rj3j4j3j6KO4L1J1l4o4QM7k4JM3J8mj4l9n1J3m2k7LO4k2k8O3N6
11757El9j6L8o6L1M1n8l2J0jqmL4l0k9k6J18O9k6l1l8L9nLj1ML9o5OL0M3m5k4N2l2q6L8M9
11739b3p1O1J9qJ7m7L1r4KPL1l2L3N0n0l9J5L2pJ2Ppk9l4Q4J9L8k8n2M9N0q2MM3m3mm7M7J
11720d5LOo3j9M7L8pK8krl4J2%k4j7rk3P2j6rJ4M3l4j8kP1j2m2J0k0J6m6RL1m7K6M5j1j2o9
11701a19j6Q2om0J7j8MK3J9m4k7J1J5K1j1J2L8l3K0O2k3k8K5Jm6m3L9jJ2RJ6rM1J9ok7m6j
11683e8n5j0J06nkJ7n2kQK3J4J1pl5oJ2k6L4j3Ln3J1L0K3j9k0K0l3J8KJ0O8Jo1n7l5K4oP1
11665d9j5M9J6m4j6P%J4l1lRM5k0j7J2j6j02M4N5NQ0j9j8M8l0Ll0p2pL4N2kk6j8J8M2Ok8O
$$ plain form
11794 -73 -21 -70 -83 -73 -66 -85 -87 -48 -6 -30 -43 -117 -102 -90 -78 -83 -66 -53 -53 -26 -32 -36 -13 27 10 -19 -26 -57 -33 -24 -35 -120 -76 -21 -61 -25 -16 19 -10
11775 -10 -43 -77 -63 -130 -81 -61 -64 -5 -14 -27 -41 -54 -70 -68 -4 27 38 4 -60 -52 -5 -29 -28 15 33 29 15 -24 -75 -62 -104 -131 -128 -64 -86 -114 -51 5
11757 5 -34 -50 -12 -78 -47 -6 -64 -96 -86 -87 -95 -99 -65 -95 -124 -150 -32 37 11 -20 -58 -19 -24 -21 -32 -28 11 -54 -48 -18 25 -20 -44 8 -24 -110 -72 -23
11739 -23 -94 -33 -14 -22 -5 -52 -21 -115 -113 -106 -75 -107 -74 -24 -74 -113 -98 -66 -73 -61 -54 -61 -90 -124 -40 -21 17 -11 -63 -14 36 -46 -42 1 -42 -46 -93 -46 -45
11720 -45 -42 -36 -99 -118 -71 -33 -40 -12 -14 -23 -57 -45 -45 -69 -86 -95 -118 -46 -62 -71 -57 -14 -48 -66 -68 3 -9 -51 -41 -61 -45 -91 -82 -51 -98 -72 -27 -38 -50 -119
11701 -119 -135 -53 -59 -99 -82 -100 -96 -73 -54 -98 -125 -114 -99 -78 -89 -77 -39 -72 -52 10 -13 -41 -16 -15 -61 -104 -65 -66 -54 -45 -29 -38 3 22 16 -11 -57 -58
11683 -58 -113 -123 -17 -22 -24 -7 -59 -61 -53 -30 -16 -5 -12 -47 -53 -41 -67 -33 -46 -43 -96 -85 -55 -32 -51 -71 -51 -84 -66 -64 -54 14 15 -46 -103 -138 -114 -120 -49
11665 -49 -64 -15 1 -43 -59 -52 -52 -38 -69 -72 -63 -18 -38 -55 -43 -59 -161 -117 -62 -57 23 4 -14 34 4 7 -23 -95 -102 -68 -16 -18 -44 -62 -44 -2 4 -24 -18
11646a8l5J1j7k5j1M4rPl5k0J1MK2n2L0%L8q8lK5N2O8k0pn3M6J4jm9k7Q4j3q6PO8P3m3j5l1
11627e4k2j6k5O0K9k0m2k7J4O5L5l8K2k3n5LpJ9J9K3%P2j4m3K1L6m5m0n4l2l1N7K4N2N9K1
11610D3n2NJ1Rmn4omj3M4n4J0K8l9L7j1l4K3l3k1pnL2N0K0j9onl%m8N9OmJ1l8q5L0PK9LKJ0
11590g6K4L1rJ9o3r3P2Q7J0j9l7%J5l1K0K0l5m9J14K3l7j6m9p5L1J08Ko5Mj5J0J1o6K7j8O8
11573e7M9o1m7NlQ3Jj6q1KO5j2M7K9J4n7Rl6KJ0k4m9L8N3N5o4K2J5n4L6mRm1M3p0M2j8o1M1
11554h5L1m0j6K7M5j1J8j0lM4j3k7M0l3K9J1j5l5Ll4j1l2k3L9N7Kl0J6K0p0L7Mk4P3L7Kq1
11536e8nm3ON0m5M5L5l6l4k9M2N2J8n3rqm8M5N2o8n5L3K9K3Q5L0k3n4k8k5K1l3J06l3o1k3
11519i9M4M8n4MJJ6K0r1L9K1l0j2K9lj3OlqKM7K1pq4QJ8O0J8k9M8j18j8K4K5j7j5K6L4knj7
$$ plain form
11646 -18 -53 -42 -59 -84 -95 -51 -60 -53 -88 -108 -97 -93 -71 -123 -93 -93 -55 -143 -146 -121 -69 -1 -21 -28 -81 -35 -21 -22 -71 -98 -14 -27 -113 -106 -38 35 -8 -23 -54
11627 -54 -76 -92 -117 -57 -28 -48 -90 -117 -103 -38 -3 -41 -19 -42 -97 -94 -101 -82 -63 -40 -40 32 18 -25 -4 32 -13 -53 -107 -139 -170 -113 -89 -37 22 43
11610 43 -9 -4 7 16 12 -42 -48 -52 -65 -21 -75 -65 -37 -76 -39 -50 -84 -61 -94 -115 -122 -127 -95 -45 -25 -44 -50 -55 -58 -58 -106 -47 -41 -45 -34 -72 -157 -127 -120 -91 -88 -86 -76
11590 -76 -52 -21 -30 -11 -74 -167 -95 -8 2 -17 -54 -54 -39 -70 -50 -30 -65 -114 0 23 -14 -30 -79 -154 -123 -15 -13 -78 -74 -89 -79 -68 -134 -107 -125 -57
11573 -57 -8 -69 -116 -111 -114 -31 -30 -46 -127 -125 -60 -72 -25 4 18 -39 -30 -66 -64 -54 -78 -127 -89 -36 19 -45 -23 -8 -62 -26 -30 -21 -62 -19 -89 -47 -65 -126 -85
11554 -85 -54 -94 -110 -83 -38 -49 -31 -41 -44 0 -13 -40 0 -33 -4 7 -8 -43 -40 -74 -85 -117 -140 -101 -44 -42 -72 -56 -36 -106 -69 -65 -89 -16 21 23 -58
11536 -58 -63 -106 -100 -50 -95 -50 -15 -51 -85 -114 -72 -20 -2 -55 -64 -72 -120 -75 -23 -91 -146 -113 -84 -61 24 54 31 -23 -51 -76 -55 -88 18 -15 -76 -99
11519 -99 -55 -7 -61 -57 -56 -40 -20 -111 -72 -51 -81 -93 -64 -67 -80 -74 -77 -85 -83 -36 -15 -22 -106 -98 -80 -20 -2 -31 17 -101 -119 -95 -70 -87 -102 -76 -42 -44 -49 -66
11500f6rK0N1j2J4ql8J1lRl1k0KM7j8OK4j8K8J6n7J4o0P3l9LO4n8pl9JN2P9k6l2L5n2J3j3
11481d4k4Pk6K6J7l1K8l1j0Q8l3j3j1K3OJ2j8k8Jj6j5kl4N9O2k5K0l4J8J1Mp9k6M3m7N4QK9
11463c1q4KO2J9M4j7n6L5o5k5j7P7J7lo0k2L5L6l5M3J9no1m6M9J6m9M0J00k9k7k1J7p1N2l7
11446i8O3L6l0j4M3q6OKn9l2J13N2J2m4o0k3M6J4q6J4L9K0N2J8k6j3lK5k1n3m8J7N5Ql1M0
11429e2J6l2K4Q6l0r4l0k4N4M0Qj6m5L6K6k8O5k1J4l8J7m2pPJ6K5m3K4o5L3m6L9P6k8n7KK4
11411f6jo3N4J8Kj8J0n9k1L8R3m4r3J8Q9r5O5J0k3J2K7M6JPm5j8omj2qO8j2nm2nM6k3K5NM6
11392A7m7l3K4k6L1K2qJ2l9r6PN8L6rk2k9j4Q4O9q8o2O9oJ1j4K7j0l0M6l5n3o5RP8M5l3o2
11375a36M3MM6K0m6j0k0N5qk1Nk3J7K3L7L7j9q0PM8m3oJ4lQK2n0j6L0K5N9k6j5J0j1j8k3p
$$ plain form
11500 -66 -75 -55 -4 -16 -2 -10 -48 -37 -40 -31 -62 -82 -80 -33 -51 -45 -21 -39 -11 5 -52 -38 -98 -25 -64 -61 3 -55 -62 -101 -100 -48 31 5 -27 8 -44 -31 -44
11481 -44 -68 -61 -87 -61 -44 -75 -47 -78 -88 0 -33 -46 -57 -34 -28 -16 -34 -62 -61 -77 -92 -94 -128 -69 -7 -32 -12 -46 -28 -17 -13 -92 -118 -75 -122 -68 -60 -31
11463 -31 -115 -113 -51 -32 12 -5 -61 -26 -91 -116 -133 -56 -39 -42 -102 -124 -89 -53 -88 -45 -26 -31 -92 -138 -89 -73 -122 -82 18 -11 -38 -59 -42 -113 -61 -98
11446 -98 -35 1 -29 -43 0 -86 -80 -78 -137 -169 -56 -4 8 -36 -96 -119 -73 -59 -145 -131 -92 -72 -20 -2 -28 -41 -44 -19 -40 -93 -141 -124 -69 -61 -92 -52
11429 -52 -36 -68 -44 42 12 -82 -112 -136 -82 -42 -34 -50 -95 -59 -33 -61 4 -17 -3 -41 -24 -66 -73 -66 -50 -25 -68 -44 -109 -76 -122 -83 -7 -35 -92 -90 -66
11411 -66 -67 -130 -76 -58 -56 -74 -64 -123 -144 -106 -13 -57 -150 -132 -43 -138 -73 -63 -86 -74 -47 -1 0 7 -38 -56 -62 -66 -78 -86 -18 -30 -35 -77 -82 -36 -59 -34 -29 17
11392 17 -30 -63 -39 -65 -34 -12 -20 -8 -47 -143 -136 -78 -42 -51 -73 -102 -116 -32 37 -51 -113 -44 -50 -39 -53 -26 -36 -66 -20 -55 -108 -173 -164 -86 -41 -74 -136
11375 -136 -93 -89 -43 -23 -69 -79 -99 -44 -52 -73 -68 -91 -74 -51 -14 23 4 -76 -69 -21 -64 -70 -56 -59 -51 -29 -79 -95 -65 -40 19 -7 -22 -12 -23 -41 -64 -71
11357g1K1oo3j0J08m5l3L6J0j6j9M5o0o8P5J2K3k7J2Q5K1o2Qo1l5j5K9O6nk4J2OJ1k1Pm1N0
11339d5L1m1k5k9K0N3K6r6j7N0O7k9m1L4Rk6K0KkK1qK1j3J9J6l6k1K8Rn0Lk1k9M9k9J8L6K5
11321aj3K3o3qQ4m0j07N7P8M8l7m5l3L1nk3K9k3M8k4m4KK6lj1rjJ7l9J9k9J8J7Qm6K3K6m4
11303i4j1L7j6Jk4nK9l6J2M9l8L1J7QK9k1j9K7L7j8n5rl4K6L2N1q9k6K4O2J9J5k9n7k5J6%
11285h4O7n7L5J3n7N1O2o6K2j4o8k5K2O4L1l4Lj5m3M8L0k2NJ8o2J9k4qO7m6L7M3k9kk1m5K6
11267e9L5l9k2Q3K5po5m5p0k1J1R8j7j5M3O4kk6p7lL3pM5ml2L4k7k2M2J4j3M3mj3J5km5k2
11249g4jmL1M0k3k1J7OJ2k5L0o7K3J2j5mp6K9K3m0L0k7R8M8j27J5J3JM6j0j1k3O6Jk1kJ7n
11231a8n2L2m0L4PK6Pj0p0M2N%J2p1O7P0j40k0kM1QM9M3m2r6M3M3lj7l7l7oJ5O3P1j16K7j2
$$ plain form
11357 -71 -50 -56 -119 -129 -21 -66 -99 -63 -53 -69 -88 -43 -103 -171 -96 -84 -61 -88 -76 9 30 -32 -24 -85 -120 -135 -106 -40 -45 -69 -57 -51 -40 -61 -54 -95 -45
11339 -45 -14 -55 -80 -109 -89 -36 -10 -106 -123 -73 -6 -35 -76 -42 -33 -59 -39 -37 -39 -18 -26 -5 -18 1 17 -19 -40 -12 -3 -53 -50 -71 -100 -51 -80 -62 -26 -1
11321 -1 -14 9 -54 -62 22 -18 -125 -68 10 58 21 -24 -57 -26 -31 -54 -25 -48 0 -24 -68 -66 -40 -43 -54 -63 -64 -47 -86 -67 -96 -78 -61 -53 -99 -76 -50 -94
11303 -94 -105 -68 -84 -83 -107 -112 -83 -119 -107 -58 -96 -65 -48 -40 -11 -32 -51 -24 13 -5 -60 -69 -103 -77 -45 6 -83 -109 -85 -23 -4 11 -18 -75 -100 -84 -84
11285 -84 -17 -74 -39 -26 -83 -32 30 -36 -14 -28 -96 -121 -99 -35 -4 -38 -35 -50 -93 -45 -15 -37 -32 -14 -76 -57 -81 -89 -22 -68 -31 12 -17 -19 -40 -85 -59
11267 -59 -24 -63 -85 -2 23 16 -49 -94 -164 -185 -174 -76 -93 -108 -65 -1 -3 -29 -106 -109 -76 -83 -38 -42 -74 -40 -67 -89 -47 -33 -46 -3 -7 -20 -5 -7 -52 -74
11249 -74 -75 -79 -48 -8 -31 -52 -35 -29 -17 -42 -12 -79 -56 -44 -59 -63 -139 -110 -87 -127 -97 -124 -26 22 -105 -90 -77 -76 -30 -40 -51 -74 -8 -7 -28 -30 -13 -18
11231 -18 -70 -38 -78 -44 -37 -11 -4 -14 -84 -42 -37 -37 -25 -96 -29 41 -99 -119 -121 -80 -72 -23 20 -22 -118 -75 -32 -35 -52 -89 -126 -132 -117 -54 17 -99 -72 -84
11213h4J3K2k4k7K3k5L9K0k3l5J5j6L7J1M9lm8m4Pl5N7M9K4m6mo5QL7K5K8%Kpl2nk9L9N1p
11194cj1k4oj4nl5K3P7l8J5Mo7M4j5p0l9P4K5pp2P4O1l7k2LJ3kl4J3k7Qk5K5J4N6l0p2%O3
11176f3m3JK5J3n7K0N7L2J5o7J9k6JMn3P7j0ONm1P4l5l5l2K5k2M7O0r6K2QN5J6n3rJ1l4K7
11158e6M9K2m6m5M8L3j4o2j0L3J6M9r6n6L8K0K8M7l7P2L0m9k9m2k0l7Ro9j9P0RKL4m8M5MJ6
11140f1Qj6L0Kl6J7N5m7J1n6P5Rqo9l9J8O0j2rJ7j7j7l8m4M4O1nN1Npn6J5K8kl9oj3Q9m1m4
11121h7j8O4M1p8k6NL3M9m5L9J7m7K1k0k8k2L0nL1K2qk0M9Pjq0j6OO4jj7k6%K5J2%KN7K5j4
11102D0j6l1k4o0O3k3k3K9k5M0K1j1l4J3Ll3Q5lj6j2o2M4Pj5K7k2L2l5pK0j2j1j9K7J2M2j4
11084cll4l0N2RJ6qK3j7l2k4m9j1N8kk2J6N5m5l3J0K8K0Qm8K2J4k9l2M7o8N4N6p4l4K1j7K8
$$ plain form
11213 -84 -71 -49 -73 -100 -77 -102 -63 -43 -66 -101 -86 -102 -65 -54 -5 -8 -56 -100 -93 -128 -71 -22 2 -44 -48 -113 -105 -68 -43 -15 -15 -13 -20 -52 -57 -86 -47 4 -3
11194 -3 -14 -38 -44 -58 -63 -98 -75 2 -36 -21 -17 -84 -40 -55 -125 -164 -90 -65 -72 -144 -70 -9 -46 -68 -65 -52 -54 -88 -75 -102 -94 -119 -94 -80 -24 -54 -126 -126 -63
11176 -63 -106 -105 -80 -67 -124 -104 -47 -15 0 -67 -48 -74 -73 -69 -122 -45 -55 -49 -44 -85 -11 -46 -81 -113 -88 -110 -63 -3 -99 -77 -69 -14 2 -51 -60 -49 -83 -56
11158 -56 -7 15 -31 -76 -28 5 -9 -71 -81 -48 -32 17 -79 -135 -97 -77 -49 -2 -39 33 63 14 -15 -57 -77 -114 -105 -174 -193 -123 -114 -112 -78 -126 -81 -77 -61
11140 -61 -53 -69 -39 -37 -73 -56 -1 -48 -37 -93 -18 -9 -17 -86 -125 -107 -47 -59 -68 -51 -68 -85 -123 -167 -123 -62 -67 -16 -11 -18 -74 -59 -31 -33 -72 -78 -91 -2 -43 -87
11121 -87 -105 -41 0 -78 -104 -99 -66 -17 -62 -23 -6 -53 -32 -52 -80 -102 -72 -77 -46 -24 -32 -52 -3 4 3 -77 -93 -87 -23 -24 -41 -67 -67 -42 -30 -30 -28 29 54 40
11102 40 24 -7 -31 -91 -28 -51 -74 -45 -70 -30 -9 -20 -54 -41 -38 -71 14 11 -5 -17 -79 -35 -28 -43 -16 -38 -6 -41 -48 -28 -40 -51 -70 -43 -31 11 -3
11084 -3 -6 -40 -70 -18 -9 7 -1 22 5 -27 -51 -100 -111 -53 -55 -77 -61 -6 -51 -84 -74 -46 -26 -18 -66 -44 -30 -59 -91 -44 -112 -58 -2 -76 -110 -89 -106 -78
11066g8PJ8l1M2L8j1%o%m8k4oQ2M7n8k6J7L1j6m9K7l8jMM2K4J7m8lN5k8q6M6K5l9k4j0N8L0
11048b0n8L2n4J1QjN5L3J0p3rK0o3K2L4n5L9J4rRJ3l5ql5j6L0P3J04l4l2l9n5k0O2k6m6J5
11030a04Q3j3k6j9n7l5k0P2M3O1J9om3k0J8j3o4ML0K9O0j32PNP1k9OoN6Rl8L6k2k1QOM2l2
11012c5k3LM0k3PL6l9m6k4M4K3j7m5J8L6NK5j0n8K8J1O2p2p4j8M8L1J2k1j5j8QJ6j5nJ6Lj7
10994a03J8m7K6OQQ8j1m6J8J1m2k1L2K7j0K8M8j3k9j1lj5N1jo7M3L7k6m9J3%N7n3K8K9l0k3
10976c2k1k4O1r9M3Q4n5q5L5kj1K8ql5L4L7M9j2l2N0Pq8n1M5J6qL1j2N1k4K8k6n9L1J7r6L4
10958i9N7l7Kl3O3N6n8K9Nm7k9lM3M9K7ono1pO8p1n9L0j7K9M1PK5q3k2P4o5n4nM1J7Rj6K7
10940g8LjNK0Kk6J2J7N1Kk6n8JnqL5KJ4k2N2l1k6m3M2J5M0L2o3j2Ll7N0ln0l4M3P6q7RK1R
$$ plain form
11066 -78 -71 -53 -84 -42 -4 -15 -15 -21 -21 -69 -93 -99 -17 30 -28 -54 -37 -6 -22 -71 -44 -82 -83 -79 -37 -13 4 -44 -47 8 -20 -106 -60 -35 -74 -98 -108 -50 -20
11048 -20 -78 -46 -100 -89 -81 -82 -27 6 16 -57 -66 -46 -109 -87 -53 -108 -69 -55 -64 -55 -42 -77 -85 -120 -136 -106 -33 71 37 5 -34 -89 -109 -47 -73 -119 -104
11030 -104 -21 -34 -60 -79 -136 -171 -191 -119 -76 -15 4 -2 -45 -65 -47 -60 -124 -120 -90 -61 -1 -133 -126 -121 -50 -79 -73 -79 -23 -14 -52 -16 -38 -59 -51 -45 -3 -35
11012 -35 -58 -55 -15 -38 -31 5 -34 -80 -104 -60 -37 -54 -99 -81 -45 -40 -15 -25 -83 -55 -44 18 -54 -128 -146 -98 -67 -55 -76 -91 -109 -101 -85 -100 -105 -89 -86 -103
10994 -103 -85 -132 -106 -100 -92 -4 -15 -61 -43 -32 -74 -95 -63 -36 -46 -18 30 17 -12 -23 -26 -41 10 9 -58 -15 22 -4 -53 -40 -40 17 -36 -8 21 -9 -32
10976 -32 -53 -77 -16 -115 -72 12 -43 -128 -93 -95 -106 -78 -86 -121 -87 -50 -1 -13 -45 5 12 -76 -127 -82 -66 -74 -43 -55 -4 -28 0 -26 -85 -54 -37 -133 -99
10958 -99 -42 -79 -77 -110 -47 9 -49 -20 -15 -62 -91 -94 -51 -2 25 19 14 -47 -54 14 -57 -116 -86 -103 -74 -33 -26 -1 -84 -106 -32 -97 -151 -156 -115 -98 -89 -105 -78
10940 -78 -75 -76 -71 -51 -49 -75 -63 -46 5 7 -19 -77 -76 -81 -89 -54 -52 -38 -60 -8 -39 -65 -108 -66 -51 -11 21 -42 -54 -51 -88 -38 -41 -91 -125 -82 -6 -93 -84 -63 -54
10920e4m5j1j3lQ3L9j3m3J3pmP1m0POk2j2m3pK5k7M2M7o8K9k2K4J5L6o7K5K4L2m2K9kk9m3
10902g0pl1M6j2o7M7O1l1J2m3qR2j3l6j5JL1M8k9k9lJ9k6K0n3L2K4k9M7J2o3N5n4PJ5k1j9
10884i0qJ0k9K7M0mj6M9m5m4j2N4MJ3Kj0Om8l2O1k0M2lj9K2N0Kj2o8M6L1k8j1K3j9p5qj0p
10866a36LM3J5qjL2l6L0k6L4K3L0j9n7oL5M3j8n6k7l7N2O6m8mR6K0r2J1jK2n0LJ8KMJ5o7M4
10847d8qm5n0j6k0k7J0J04L2olo0Jk2M7QN9k4Pjj4j2l6l1J3nM4m1J7M7j0P8K1o7k8N0m2k8
10829a06J1o8m0N7M2k5K6M5L0k5m4Q7n1JJ00qr5J0j4l3k6M6L8L0M3L5n5q0o2j8L3L9J5O5N2
10812E5m9r4KK9olRr%K4m3K5M1m2k6M1J6j0j00LM3N7l5L8O0m4nM5l1k9l3j6J9pK5j2J8l4m2
10794a20ML8L2L5Oq0L3J8j0j5l7M1QOj6J0m3L6K8p5k3M0R9N6q8k6pk3K3N9M1l8L3n7l2m5O
$$ plain form
10920 -54 -99 -110 -123 -126 -43 -4 -17 -60 -47 -54 -58 13 -27 -20 -14 -36 -48 -91 -98 -73 -100 -58 -11 -79 -50 -72 -48 -33 3 -64 -39 -15 17 -25 4 2 -27 -70
10902 -70 -77 -108 -62 -74 -141 -94 -33 -64 -52 -95 -103 -11 -24 -60 -75 -74 -43 5 -24 -53 -56 -37 -63 -43 -96 -64 -40 -69 -22 -10 -73 -18 -72 -65 -50 -71 -90
10884 -90 -98 -88 -117 -90 -50 -54 -70 -21 -66 -110 -122 -68 -64 -51 -49 -59 -53 -101 -133 -72 -92 -50 -53 -72 -50 0 2 -10 -78 -32 -1 -29 -40 -17 -36 -111 -119 -129 -136
10866 -136 -133 -90 -75 -83 -84 -52 -88 -58 -84 -50 -27 3 -16 -73 -79 -44 -1 -19 -75 -102 -139 -87 -21 -69 -73 23 43 -49 -38 -39 -17 -67 -64 -46 -44 -40 -25 -92 -48
10847 -48 -56 -101 -151 -167 -187 -214 -204 -100 -68 -74 -77 -137 -136 -158 -111 -103 -44 -68 -61 -62 -76 -88 -124 -155 -142 -147 -103 -144 -127 -80 -90 -12 9 -58 -86 -36 -78 -106
10829 -106 -95 -163 -203 -146 -104 -129 -103 -58 -28 -53 -97 -10 -61 -60 40 32 -63 -53 -67 -100 -126 -80 -42 -12 31 66 11 -69 -131 -149 -116 -77 -62 3 55
10812 55 6 -88 -86 -57 -63 -66 -57 -66 -66 -42 -85 -60 -19 -61 -87 -46 -30 -40 -140 -137 -94 -37 -72 -34 26 -18 -23 22 -9 -38 -71 -87 -68 -75 -50 -62 -44 -78 -120
10794 -120 -116 -78 -46 -11 -5 -85 -52 -34 -44 -59 -96 -55 -47 -41 -57 -47 -90 -54 -26 -101 -124 -84 15 71 -17 -43 -50 -73 -50 9 50 12 45 -12 -44 -89 -83
10776h3L2O3J1j4Jo9j2Mp0N5R5o3k1J4k8l7N2Lk9%J9n7J4L7j5kk9P1Jm7N7Ol7RQJ6n2L4q5
10758a48l2M6O6O1q2n2N0N7l7j2Jj3l1J6l5K4J9O2j1k8Nj3m6M1j7J4J0K5J6j5%mK8pl1L7m9
10740h5J5qJ7%m6PR6o9mj8M5J4K4n9L9om8l0P3JNJ0M9r1l8M3j1mk5Q8K6Qm8o8k4NM7P1ml5
10721c8j4J6J6m6M9j7l7m3P6K6m7Ml7N7l1l5L0j8j4J0l9M0L4%j4K9rj6L6J1m7nk3P3M7p9q
10703f3o7j1N6o5RO7L9k7m4N7qpnL8M1m4J7j2j3qrJ8K6K2l1m1pJ1N9k6n3k9J2L0L0j0n5K4
10685g9M1J1n7oL5j7j5m8P9lj0j1M4L2n1OlM5l3K2ml8M4n0J5OrMk2j4L9J5Lkp6L6l9JJ7jm1
10666a34J7MkN1n0J3RJ4j4N4rkk8P7J3k3jm3K6p2%K9L6n2L2L6Nk0J6m1n3M6J2MN0n6m0K3q5
10647a58L7L5LJRNK4pL9lLk5j7l9L3J7qRj8k9K9%K6j9Ok8l5l2J7M1K6j0j5L9Op2J2j2O0k2
$$ plain form
10776 -83 -51 12 23 9 10 -59 -71 -67 -137 -82 13 -50 -71 -57 -85 -122 -70 -67 -96 -96 -77 -134 -120 -83 -98 -100 -129 -58 -57 -104 -47 -41 -78 -69 -61 -45 -97 -63 -148
10758 -148 -180 -134 -68 -7 -89 -141 -91 -34 -71 -83 -82 -95 -126 -110 -145 -121 -102 -40 -51 -79 -74 -87 -133 -92 -109 -95 -85 -60 -44 -59 -59 -63 -35 -42 -73 -36 -85
10740 -85 -70 -78 -61 -61 -107 -100 -4 -73 -77 -95 -50 -36 -12 -71 -32 -38 -86 -116 -43 -42 -37 -27 22 -69 -107 -64 -75 -79 -104 -16 10 18 -30 -98 -122 -117 -70 1 -3 -38
10721 -38 -52 -36 -20 -66 -17 -34 -71 -114 -38 -12 -59 -55 -92 -35 -66 -101 -71 -89 -103 -93 -132 -92 -58 -58 -72 -43 -52 -68 -32 -21 -68 -73 -96 -23 24 -55 -63
10703 -63 -130 -141 -85 -150 -141 -74 -35 -62 -106 -49 -57 -64 -69 -31 10 -34 -17 -29 -42 -50 -59 -41 -15 7 -24 -65 -72 -61 -2 -28 -81 -110 -98 -68 -38 -48 -103 -79
10685 -79 -38 -27 -84 -90 -55 -72 -87 -135 -56 -59 -69 -80 -36 -4 -55 -49 -52 -7 -40 -18 -22 -60 -16 -66 -51 -45 -54 -50 -72 -86 -47 -32 -29 -31 -107 -71 -110 -109 -92 -93 -134
10666 -134 -117 -113 -115 -64 -114 -101 -92 -78 -92 -38 -47 -49 -77 0 13 -10 -11 -54 -28 -100 -100 -71 -35 -87 -55 -19 -14 -34 -18 -59 -112 -66 -54 -50 0 -56 -96 -73 -158
10647 -158 -121 -86 -83 -82 -73 -68 -44 -51 -12 -15 -12 -37 -54 -93 -60 -43 -51 -42 -60 -89 -60 -60 -34 -53 -47 -75 -110 -142 -125 -84 -58 -68 -83 -44 -38 -110 -98 -110 -50 -72
10628g2O0k6m5O4oJ4l7L8K1r5L6l3J2k2lL7p5QL0L9Ko5oM4kN1J2l3l5M1O7l3o0LN2j4l3l3
10610i7m5P6k0Kj5q3O5M6M7n9OJJ3m5M1m0M6j0j2kJ1K1o8nk9N9Q6K6l7L7l2K3k1o0L2KN6n1
10592c5o4k9J10j9p0Kj1NJ0O3jo5N3m3jj3O0%on3J8l0k1J0J6P3j7o2M6l6l1N1m0L8QK4l7O8
10574b9j9o4QN3n2qnp2L0O8RMK9M0j4k3j8k0LJ8M9o6q1O7Lk0k1N2M5k2N8L0k7n0m8J8N9K5
10555Il7k8M8kPRm8K6m0Oj3J3Km1j6L4J5J6k1MM1M2l8m5m7L2N2j8rl7n5Q2j9K7l6L1k6l1m5
10537a56O3Rj9J2Ol4M5M9n0j7j1RL0RK5Mj4l5j0j2rK6O6k1m1q0MO7k0M0L6R3o6m4MQL0J1J2
10518A9j6rq5N6J7m3PJ3j4k6M9l6NK3k3o7kM4l1N7pm5P7j0o5J2OL1J8pK3%j5qQj0L6jL0o6
10499e5J5L0L0p0j3j1k7M4K7Jl1Ql7K9K7m9k2P0L2o5l5P5N6o9L7j5n2%pj7K9J8M5%j02J7N9
$$ plain form
10628 -72 -12 -38 -83 -19 -25 -11 -48 -10 11 -84 -48 -81 -69 -91 -94 -57 -132 -124 -94 -55 -53 -118 -124 -80 -82 -31 -19 -52 -87 -46 21 -12 -72 -69 -17 -31 -64 -97
10610 -97 -142 -66 -86 -84 -99 -182 -117 -71 -24 -83 -77 -76 -63 -108 -67 -107 -61 -71 -83 -85 -74 -53 -121 -126 -155 -96 -10 16 -21 16 -16 7 -14 -74 -42 -40 16 -35
10592 -35 -99 -128 -18 -37 -107 -105 -116 -111 -101 -38 -39 -104 -51 -94 -95 -108 -48 -48 -54 -107 -89 -119 -140 -130 -114 -41 -58 -120 -74 -110 -141 -90 -130 -92 -84 -60 -97 -29
10574 -29 -48 -112 -104 -51 -103 -111 -116 -188 -158 -90 -81 -77 -48 -8 -22 -45 -63 -83 -80 -62 -13 -79 -160 -93 -90 -110 -131 -79 -34 -56 2 32 5 -45 -93 -75 -16 9
10555 9 -28 -56 -8 -10 -3 6 -42 -16 -56 -50 -63 -50 -48 -89 -105 -71 -56 -40 -61 -57 -16 26 -12 -57 -104 -72 -20 -38 -47 -84 -139 -57 -76 -49 -85 -54 -80 -111 -156
10537 -156 -93 -84 -103 -91 -85 -119 -74 -25 -75 -92 -103 -94 -64 -55 -30 -26 -40 -75 -85 -97 -106 -80 -14 -35 -76 -156 -152 -85 -105 -65 -29 64 -2 -46 -42 -34 -4 7 19
10518 19 3 -6 -91 -35 -18 -61 -54 -41 -55 -81 -32 -68 -63 -40 -63 -130 -132 -88 -119 -62 -69 -114 -37 -47 -112 -100 -94 -63 -45 -52 -29 -29 -44 -52 -44 -54 -18 -19 11 -55
10499 -55 -40 -10 20 -50 -63 -74 -101 -57 -30 -29 -60 -52 -89 -60 -33 -82 -104 -34 -2 -67 -102 -27 29 -40 -3 -18 -70 -70 -77 -94 -65 -47 -2 -2 -104 -87 -28
10482b8j8m9K0l3J3R1No5L8o3M2M5m3j9K9%m9J3K3L1j5Pjj3J1k0k6m1L3M9j9LJl0l1M9m6j4
10463a20M8Kk2qJ7N2K2Op9k2K0l3M2M5n0K3M5m0k3K0M3JL4q4n6j4M2K6M3j5m8j0L7K2J6kJ1
10446il4K1j0mJ9j9j6j8N1l6m9l2R7l4J8k8L7K1n4%m4L2R5m9J9m9LM9Jp8N0j8m0Q0l9M3j6
10428d0Lkmm0lK2K5l6j9K0j5K2O5J4rMj0r1J9N8mj4M8l4k7M2j5P6l7n2p6M9Nk0RK4j4l5N5
10410c7M1j3L1J9j9kK0j7po3l3LO0Qrq9NK9j6M8J3Kn8k4M8k5LJ7Q3oq6K2K6k8k2k2M1j8jq
10390h4nrL0j5N1n7j6L3m8K6N8M9l8p7N7K1n6l6m7M2L5nk6M1l2k9M0M2L3k9k3k6QQj1K4L7
10373c4J4kk7nlrJ7M8n0J5k7k4M5L6p0k4J8L6j8K1RJ5K9Pn7j8L1L3k1mn1PM0J8J3M1n7n8J8
10354d8Om0N0Ml4j7p5N7N2qM1l4ol9j1L9k7L7J6j9oP4n8j1j2QJ3k7J2O9k5m5O6M5n1j28M7
$$ plain form
10482 -28 -46 -95 -75 -108 -95 -4 1 -64 -26 -89 -47 -2 -45 -64 -35 -35 -84 -71 -48 -17 -32 -25 -26 -39 -28 -48 -74 -115 -82 -33 -52 -49 -48 -78 -109 -60 -106 -120
10463 -120 -72 -70 -92 -100 -83 -31 -9 -3 -82 -104 -84 -117 -75 -30 -80 -57 -12 -52 -75 -55 -12 -11 23 -61 -117 -131 -89 -63 -20 -35 -83 -93 -56 -34 -18 -20 -9
10446 -9 -43 -22 -32 -36 -17 -36 -52 -70 -19 -55 -104 -136 -39 -73 -55 -83 -46 -25 -79 -79 -123 -91 4 -45 -26 -75 -72 -23 -22 -100 -50 -68 -108 -28 -67 -24 -40
10428 -40 -37 -39 -43 -83 -86 -64 -39 -75 -94 -74 -89 -67 -2 12 3 7 -3 -94 -75 -17 -21 -35 13 -21 -48 -6 -21 55 18 -34 -110 -61 -56 -76 -67 -43 -57 -92 -37
10410 -37 4 -9 22 41 22 20 40 23 16 -47 -80 -77 -17 -9 -18 -107 -102 -73 -89 -41 -28 -26 -84 -108 -60 -85 -82 -65 18 12 -74 -52 -26 -54 -76 -98 -57 -75 -76 -84
10390 -84 -89 -98 -68 -83 -32 -89 -105 -72 -120 -94 -36 13 -25 -102 -45 -24 -80 -116 -163 -121 -86 -91 -117 -76 -108 -137 -97 -55 -22 -51 -74 -100 -92 -84 -95 -71 -34
10373 -34 -20 -22 -49 -54 -57 -66 -49 -1 -51 -36 -63 -87 -42 -6 -76 -100 -82 -46 -64 -43 -34 -19 10 17 -40 -58 -27 6 -15 -19 -70 -63 -23 -5 8 49 -8 -66 -48
10354 -48 -42 -82 -32 -28 -62 -79 -154 -97 -45 -53 -12 -46 -52 -91 -102 -63 -90 -53 -37 -56 -62 12 -46 -57 -69 -61 -48 -75 -63 6 -19 -64 2 47 -4 -132 -85
10337h5K8M1m7m7PQ1ql3J08n1ll3j0J4k7M2k5kLJ8n0L0j9j6MM2J6nK0l5n2l0N9M4rp4L1p2
10318a45J09K9l8k6L2L6J0k1l1J4p7Ql7N1K7K0k8m9rJ5L9rmJ4jl0j1L9J6qjk5j4l0L3J6O2
10301b4poK0pN7n7k6K5O5j05n8JK0K6j7M3k4L5Qm9L1L7l5K6qk6O1l6J8m8mP6oj0k1m5Q7lk7
10282a3n9k6M0M1Ln5j3K1k5j5N2J0l2n6J1N6Rjl6j5M7J4Nk7k0J4n4R7k6PO5j2Ol7n6M8JOm7
10264g2l4P9pl9k3k0j2L2P7oJ0J6J0k3p3j8J6N5%n1K0J8K0j0J4k2J2J7k3j8MpRKkl7N9pn0
10245h4o1M6M4JM6J7k8q1j2L5J7RJ3l4K8j9l6L1P4j2r5L6M5K6Pl8M1q5l6N3O7l5j3n4l2%K8
10227i1L2J0k9L9j1L1j0%k3L2l0L7J6j8M0l9M0m6m6l8J2K3L3L8l3ml7k3K9lQM2Lp8P3LJ0o
10209a4m3M2k4j8M4J2PJ4n4%L8k8j3NqK7l4J8N5m9p5O2j9k7MP9qj1J4p4j2J24m7j6kqL3n4
$$ plain form
10337 -85 -57 -16 -63 -110 -103 -22 -30 -63 45 -6 -9 -42 -52 -38 -65 -23 -48 -50 -47 -29 -79 -49 -68 -84 -80 -38 -22 -27 -7 -42 -94 -124 -65 -21 -30 -104 -73 -145
10318 -145 -36 -7 -45 -71 -39 -3 7 -14 -45 -31 -108 -100 -137 -86 -59 -39 -67 -116 -125 -110 -71 -80 -84 -70 -71 -101 -112 -73 -57 -65 -66 -91 -105 -135 -102 -86 -24
10301 -24 -31 -37 -17 -24 33 -24 -50 -25 40 -65 -123 -122 -102 -76 -93 -50 -74 -39 -31 -80 -49 -12 -47 -21 -29 -55 6 -30 -12 -60 -64 12 6 -4 -25 -70 17 14 -13
10282 -13 -72 -98 -58 -17 -14 -69 -82 -61 -86 -101 -49 -39 -71 -127 -116 -60 -51 -52 -88 -103 -56 -42 -37 -64 -84 -70 -124 -27 -53 -46 19 7 13 -24 -80 -32 -31 -25 -72
10264 -72 -106 -27 -34 -73 -96 -116 -128 -96 -19 -25 -15 1 11 -12 -85 -103 -87 -32 -32 -83 -63 -45 -25 -35 -21 -43 -31 -14 -37 -55 -51 -58 -49 -47 -49 -86 -27 -34 -84
10245 -84 -145 -99 -55 -54 -8 9 -19 -100 -112 -77 -60 -51 -38 -72 -44 -63 -99 -68 6 -6 -101 -65 -20 6 13 -25 16 -69 -105 -52 15 -20 -33 -87 -119 -119 -91
10227 -91 -59 -49 -78 -39 -50 -19 -29 -29 -52 -20 -50 -13 3 -15 25 -14 26 -20 -66 -104 -92 -69 -36 2 -31 -35 -72 -95 -66 -69 -61 -19 -16 -94 -21 -18 -8 -14
10209 -14 -57 -15 -39 -57 -13 -1 6 20 -34 -34 4 -24 -37 -32 -40 -13 -47 -29 26 -23 -98 -36 -55 -82 -78 1 -7 -18 -4 -78 -90 34 -13 -29 -31 -39 -6 -60
10191f0p0O0J7N5mn7Rj7J8L9m0K2l6J6j3J5rl9l5NM7k9ML5O5l3j9k0N2ql4j4N2K6lqm3P0l7
10173b1n8j2k0k0M4L1j1J3j6Jql5O8pj2k7LjK1N6n9r6qQ4J04l8L3j7o2L6Jq8N0O7ll6pl5P
10154g8J6K3nj9ONl9K9K1Pj0Jl7J3P3j6k2n2j6J5K6L3O9m5o0l1J3J5J7%j2K6o8j3J03n2M2
10136b2K5pJ3Ro8nM2J8m3OJ0j6n4K2l1N3l9N3m7l5P4Jj4L3j9J1M9jo3lK7l2K5m9j1M6K4l9
10118e7j2m1L0k1j1OK2Nm6O0J7pj5k6k8k4K8N1k9L3M9QK2L9p8k8K7j7%M5m5m1L4o5Q0L2k6
10101b9k5q9J0K7P1n1rN6L1l6J3Rj4k9l5j9M6Q4Pn6j5M8m7JM2r8m0P7K7L7Om8k2L9k9j7r0
10083a67O2K6lRN3Rj5j5Qm7N9mk8J9m2K0M5k9PKm3K6N9k3r1J4Q7P2p7l0L5m4J1k5QK5k3M5
10065ej4L5J5j3r3l4Q1%Lqj9P7Rp2ML1o5l4P4l4J9Q6p0j7Mp9k4O5K0jpJ1j2K0j7K1k2k8Qm1
$$ plain form
10191 -60 -130 -70 -53 2 -2 -59 -50 -67 -49 -10 -50 -28 -64 -48 -61 -46 -55 -94 -129 -124 -77 -106 -102 -67 -2 -35 -54 -74 -22 -30 -64 -78 -26 0 -3 -11 -54 16 -21
10173 -21 -79 -91 -111 -131 -87 -56 -67 -54 -70 -69 -77 -112 -44 -51 -63 -90 -87 -88 -67 -11 -70 -166 -174 -90 14 -24 9 -8 -70 -34 -33 -121 -71 -4 -7 -43 -50 -85 -78
10154 -78 -62 -39 -44 -63 -57 -52 -91 -62 -41 -34 -44 -43 -80 -67 6 -10 -32 -84 -100 -85 -59 -26 43 -2 -62 -93 -80 -65 -48 -48 -60 -34 -102 -115 -12 -64 -22
10136 -22 3 -4 9 18 -50 -55 -13 5 -38 -32 -22 -38 -92 -70 -101 -48 -87 -34 -81 -116 -42 -41 -55 -22 -41 -30 19 18 -45 -48 -21 -53 -28 -77 -88 -42 -18 -57
10118 -57 -69 -110 -80 -101 -112 -106 -84 -79 -125 -65 -48 -55 -70 -96 -124 -148 -120 -69 -98 -65 -16 -8 14 53 -25 -53 -26 -43 -43 2 -43 -84 -50 -115 -35 -3 -29
10101 -29 -54 -143 -133 -106 -35 -86 -95 -39 -8 -44 -31 -22 -36 -65 -100 -119 -73 11 18 -38 -53 -5 -52 -51 -9 -107 -147 -70 -43 -6 0 -48 -70 -31 -60 -77 -167
10083 -167 -105 -79 -82 -73 -20 -11 -26 -41 -33 -80 -21 -25 -53 -34 -76 -56 -11 -40 -33 -31 -74 -48 11 -12 -103 -89 -2 70 -7 -37 -2 -46 -35 -60 -52 -27 -50 -5
10065 -5 -19 16 31 18 -75 -109 -28 -28 -25 -33 -52 25 34 -38 -34 -3 -68 -102 -28 -62 -43 43 -27 -44 -40 -119 -143 -78 -58 -59 -66 -55 -67 -47 -64 -43 -65 -93 -85 -126
10046a26J2M5N1k2m8%k5MJ8N8l4j4M5rq3J9P0j41M3O7k0L9M4l8p3jQ4L6j1K1Qj01P3J5j6k
10029a2n2j6j0J00m0J5j1L8m2k1K3k2Oq8L9K5NN7m7n1M3L0K4r8L3J3KpK4on0k6mO0l6K1M6
10011c5j4m5R7j9o2J0J4N4j01Pj0k3Q3K7rkl2k0k4M8p5NP7Pj4k0N4PQPon0K0J6k3p9m3J06
9993e9j7L0J6k1j6JJ19k7n9ln1L9M8k6l0l9Ok8N4m2K7P2k2n9J3O7l0j4l6l7M0L6qJ0Ol3k9
9975a02K5j0N5k0M9L0m2L6n7M7lK5n5j4k7L7n2oM2L7L4k5k7k2n7nM7l6mK5o2N8N2K1JK8rP
9957B1J0k2J9p9L8jp1j1l5N9m9M9R9j1J8j7n0L1%o4J9j6O3J5o5j4Q7n1k0Rj4K9K6l8N2K7q5
9939d2l8N4j4M9l7o2J9j04jQ2J2K8N0o6K9q2k1KM1M6m6j5L8Oj6N0m1O7J8k9k5j9O3J2m6j2
9922e0L6M7k2r2L1M4km6K4M4j08M0K8L1pQn0q1l1O6RN1L1Nn6J8%JqJ2K4o4km5J4M7mK7PmK8
$$ plain form
10046 -126 -114 -69 -18 -40 -88 -88 -113 -109 -91 -33 -67 -81 -36 -45 -128 -109 -39 -180 -137 -70 -90 -51 -7 -45 -118 -119 -35 1 -10 11 19 -82 -9 6 -10 -12
10029 -12 -64 -80 -90 10 -30 -15 -26 12 -30 -51 -28 -50 -44 -132 -93 -68 -63 -6 -53 -104 -61 -31 -7 -105 -72 -59 -57 -64 -40 -46 -96 -122 -126 -66 -102 -81 -35
10011 -35 -49 -94 3 -16 -78 -68 -54 0 -101 -94 -104 -127 -44 -17 -26 -28 -60 -80 -104 -56 -131 -126 -49 -42 -56 -76 -22 -15 -7 0 -6 -56 -36 -20 -43 -122 -165 -59
9993 -59 -76 -46 -30 -51 -67 -66 53 26 -33 -36 -87 -48 0 -26 -56 -95 -89 -117 -63 -105 -78 -6 -28 -87 -74 -7 -37 -51 -87 -124 -84 -48 -56 -46 -40 -73 -102
9975 -102 -77 -87 -32 -52 -3 27 -15 21 -36 11 8 33 -22 -36 -63 -26 -78 -84 -42 -5 29 4 -23 -45 -102 -107 -60 -96 -100 -75 -137 -79 -27 -6 -5 23 14 21
9957 21 31 9 28 -51 -13 -14 -85 -96 -131 -72 -121 -72 27 16 34 17 -33 -2 -2 -66 -47 -63 0 15 -50 -64 23 -28 -48 -39 -53 -24 2 -36 16 43 -42
9939 -42 -80 -26 -40 9 -28 -90 -71 -175 -176 -94 -82 -54 -4 -70 -41 -123 -144 -142 -101 -55 -101 -116 -78 -72 -88 -38 -79 -12 6 -23 -48 -67 -4 8 -38 -50
9922 -50 -14 33 11 -81 -50 -6 -8 -54 -30 14 -94 -54 -26 5 -2 6 -44 -125 -156 -90 -81 -30 1 6 -50 -32 -32 -31 -39 -27 -3 -67 -69 -114 -100 -53 -57 -30 -23 -27 1
9903APl4Pk9l5M4K5q9R5J0J9o5k4Oj7j6L1N8J7L4k0o6k0m9N8%l1OK2jL1L6rkp4J5J1o8O9k
9884d9j1j6Pk2J8O9m7j0j8l7Pj8J13pk0j4qJ9m2m1l9O8P0O6l7m1k4m8MO9j9Qm8M1l1L3m8j9
9865a22k8O9M7j1pm0m9N2j1P2Op0rO1PM0Qp3j3OPM0lL4o5n0j8O4J0J5M7Mk2J2m4j5j5l1K2
9847g3KjK2K6J8l1j9L9rN6l2j03R1K2k7n9j8K9O3j2j7J0J0j3q0j2JQ4j2j9M4P1k5p1ko9lL4
9829h5k7%N2M1K0o8m8OLK9q0k9R3nMLK0n5K6J6OK0M8lp2nJ3J5N4j4l4m5K2O4m1L3o8mM3l8
9810i0J5J7P5K0k8k8m1mp5LQ9L1J1K2n0N4J0o4J4j3O5K7p1o2mJ2K7j5qK3M6j7j6K2q5j6k1
9792a25K5R0K0Jj5rJ1l2m4K0K7k8j4M0J9K2m6lL9L5o7J0j6j8j7l9K2l7J0L2N6Kk2J1l4j5k4
9774a13kO3l9j4N1L2M2rk3mp6K0J15MM7k9m4K9rp6n6R2O4J2k3p1l3oJ1j06R3N4Oj2M7RQl8
$$ plain form
9903 1 8 -26 -19 -48 -83 -39 -14 -103 -8 2 21 -44 -68 -62 -79 -95 -64 -6 11 45 25 -41 -61 -110 -52 -52 -83 -77 -55 -56 -25 11 2 0 -74 -59 -48 -116 -47 -49
9884 -49 -60 -76 -69 -91 -73 -4 -51 -61 -79 -116 -109 -127 -14 -21 -41 -55 -63 -44 -86 -127 -166 -98 -28 38 1 -40 -64 -112 -108 -39 -58 -50 -98 -57 -88 -55 -103 -122
9865 -122 -150 -81 -34 -45 -52 -92 -141 -89 -100 -28 -22 -92 -101 -40 -33 7 15 -58 -71 -65 -58 -18 -21 13 -52 -102 -120 -56 -46 -31 16 20 -2 10 -34 -49 -64 -95 -73
9847 -73 -71 -72 -50 -24 -6 -37 -56 -17 -26 30 -2 -105 -14 8 -19 -78 -96 -67 -4 -16 -33 -23 -13 -26 -106 -118 -117 -33 -45 -64 -20 51 26 -45 -47 -116 -119 -85
9829 -85 -112 -112 -60 -19 1 -67 -115 -109 -106 -77 -157 -186 -93 -98 -94 -91 -71 -126 -100 -84 -78 -58 -10 -13 -85 -90 -77 -62 -8 -22 -56 -101 -79 -15 -56 -23 -91 -95 -52 -90
9810 -90 -75 -58 17 37 9 -19 -60 -64 -139 -136 -47 -16 -5 17 -33 21 31 -33 -19 -32 33 60 -11 -73 -77 -65 -38 -53 -61 -38 8 -9 -25 -3 -88 -104 -125
9792 -125 -100 -10 10 11 -4 -13 -2 -34 -78 -58 -31 -59 -73 -33 -14 8 -38 -41 -2 33 -34 -24 -40 -58 -75 -114 -92 -129 -119 -87 -31 -29 -51 -40 -74 -89 -113
9774 -113 -115 -52 -91 -105 -54 -22 20 11 -12 -16 -92 -72 43 47 94 65 21 50 41 -35 -91 1 65 77 54 -17 -50 -56 -45 -151 -58 -4 2 -10 37 46 54 16
9756A6l4J0NrP8k9p1J7k1M0JL7Kn9O0L1j4k4K9j9m0N4JlKk3n4K8M1n3jM4l5j9K8K6j7j3n1
9738c9M1l0K8L0M9K6N8j9k8Kp6k1P7M2R9k8kj01j3R7J6M4J1K2m2M3R9k9LJ11J51P5J26J51
9721I73J91K06L20M58O23R94J498K659M971Q230Q488K371n094q124o908m340k545j506q79
9712B586n32l90k24J7J4L5p4l15k39j69j82j06m4Pk2Jl7NJ3q6k4J4n3m1LK7K3k0J4N5l5k0
9697B01K4M8npM9P4QM9j2P8P6N3k7N6J66J57J32K28L05M35O02R55J559K729N073Q521Q868
9684C0395K372n321q534p117m495k529j483q58n67m02k50k62j94j08q2l1or5j19m8M4l4n5
9673B21M0J0n0k8jM1O0m9o8m9N0J1K7n4Qk8k1J00K1OP3n3K5L9j0R3Q9k4Q2N4Q8P6J72J71K28
9657A350L32M15N93J037J508K814N088Q264Q550K415n264q290o865m437k621j508r33n85l73
$$ plain form
9756 16 -18 -8 -3 -12 66 37 -34 -17 -38 2 3 40 42 -17 43 74 60 36 65 46 6 60 61 58 60 37 -17 11 52 -1 -2 42 7 -12 16 42 25 12 -39
9738 -39 2 -28 0 30 79 105 163 144 116 118 42 21 98 140 239 211 209 108 95 192 208 252 263 285 243 286 385 356 359 470 621 696 822 973
9721 973 1164 1370 1690 2148 2771 3765 5263 7922 12893 21123 29611 31982 26888 18764 11856 7516 4971 3465 2586
9712 2586 2054 1664 1440 1457 1471 1506 1432 1117 878 709 527 421 377 384 362 363 326 331 344 258 234 248 195 154 157 184 207 187 201 256 221 201
9697 201 225 273 268 261 310 384 392 441 429 507 583 636 609 665 831 988 1120 1348 1653 2088 2690 3645 5204 7933 13006 21527 30395
9684 30395 32767 27446 18912 11795 7300 4771 3288 2430 1863 1461 1211 949 755 647 565 534 528 433 314 266 310 276 221
9673 221 261 271 221 193 192 233 293 244 176 127 177 188 215 161 169 141 120 220 241 247 320 267 292 331 321 414 503 479 561 615 703 779 951 1122 1350
9657 1350 1682 2097 2690 3727 5235 8049 13137 21401 29951 32366 27102 18812 11947 7510 4889 3381 2448 1863 1490
9648A490l35k80j37j66j14o3n1k1o2L3j17l1j7j3P4m7p7k7n8L1m2P4lm4mnK5lj8ol9K8j3m8
9631h6M2qK1l0Q2Jo5J5N6m7l7Jj7N5k6l2K5k3KO0%p2RJ8J8nk9q6j0P5k2j4Q8k8%k7p6N4%j6
9612a34N9RM4k2o2J3N4l1k3kl8rk4M4J1N6l6K1l5j9M3J3p0J3L2kK2%o3K4k3M6J0l0M6j9N4
9595b8m5k4oMPK2O8k3ok7K3n3J9J9k9j0oQJ4K2l5K3J0K7j1M5K9n1n5m9O8l4M4K6L6k2j6km1
9576e9%K2l0O2o2Mj7n0mL7L3o1J9N1l4N9n0k8JrmQ5jo8L4J7Rj5k2j7LN3k2Nk3m0RL0L3L7l2
9556d5q1M8Q0o6k9N2L0J6pl7Oj0p5M6J6m0j6K4N1j6oJ9l1l6Nj0K2L2qj3n5j0L3L0O4J3j8l2
9538e4l0j4j5N6J0k1M4j2p8NN0m4oK2J6K2m8m4J0L0Qj5N1K3Kl9j4pN1J2m6Nj9jM3M1KRMn0
9519d1k1N0r6Rj2K6O8j9j6K2K6o8k8O5j3J3m1k5J6n1M6oK5L0p4%L5k3LL6J1rKpM6k4q4PL9
$$ plain form
9648 1490 1155 875 738 572 458 395 344 323 261 294 177 146 129 116 190 143 66 39 -19 12 -30 44 41 -3 -7 -12 13 10 -8 -14 -53 -25 -38 -86
9631 -86 -44 -52 -31 -61 21 22 -43 -28 28 -19 -56 -55 -72 -17 -43 -75 -50 -73 -71 -11 -11 -83 -74 -56 -38 -43 -72 -158 -168 -93 -115 -129 -41 -69 -69 -96 -172 -118 -118 -134
9612 -134 -75 -66 -22 -44 -106 -93 -39 -70 -93 -95 -133 -142 -166 -122 -111 -55 -91 -70 -105 -124 -81 -68 -138 -125 -93 -95 -73 -73 -136 -112 -135 -89 -79 -109 -63 -82 -28
9595 -28 -73 -97 -103 -99 -92 -70 -2 -25 -31 -58 -35 -88 -69 -50 -79 -89 -95 -87 -73 -51 -86 -63 -53 -26 -37 8 37 -14 -69 -118 -50 -84 -40 -14 22 0 -16 -18 -59
9576 -59 -59 -37 -67 -5 -67 -63 -80 -130 -134 -97 -64 -125 -106 -55 -89 -30 -80 -108 -107 -116 -120 -35 -36 -104 -70 -53 -44 -59 -81 -98 -95 -42 -64 -59 -82 -122 -113 -83 -50 -13 -45
9556 -45 -126 -78 2 -64 -93 -41 -11 5 -2 -39 -33 -43 -118 -72 -56 -96 -112 -88 -37 -53 -59 -40 -71 -107 -102 -112 -90 -58 -66 -79 -134 -144 -111 -81 -17 -4 -22 -54
9538 -54 -84 -98 -113 -57 -47 -68 -24 -36 -114 -109 -59 -103 -109 -87 -71 -49 -97 -141 -131 -101 -93 -108 -57 -34 -32 -71 -85 -92 -41 -29 -75 -70 -89 -90 -47 -6 -4 5 9 -41
9519 -41 -62 -12 -108 -99 -111 -85 -17 -36 -52 -30 -4 -72 -100 -35 -48 -35 -76 -101 -85 -136 -90 -96 -71 -41 -115 -115 -80 -103 -100 -64 -53 -62 -60 -67 -21 -45 -129 -122 -83
9501h3j2k3N4k6J6J1rQOlol5N4L2m5k0O7m2k2L0k9J1l5M4j2jk6J0N8p0L5n6PM6L1l2PmK4J1
9482b9l8J0k3J4M0M8m6p0Jl0j0N2L7n0K4p0jK5M9L1j9j6K1m4q7P4P1p9J4OL9j3oj5PJ2O5k8
9463c4l0M4n0n6j0lL3rN6k7j3L1O7Pl9k2L2J9j4j2l9PM6k1n0qkM6k3L9k8k2j3J3l9j5P0k6
9445i5M2J9l2q4kJ0NK9M2k5K0J7j3l0k0J3J2J6K7n8m4N0K9j6LN3%j0MQk6K8J3n0J0K7L8p3
9427f3k4k8N9Mk3P6P6l6j12l6O4k3j3k0M0j0k6m1L4M1k3m2k4L8N0j7K8M8rq1n6L4Q3J5mn9
9410h0K5o0J7K1Nj3N0L9k9Nj3Lj20M4K1QO3n4J1q2O2K1k5M3lM5K0p3l7nJ2L4K8qKnJ4m4M0
9391a8k8N5ok9K7l4q9m0N8J5O8M0l3M0p5k8lk1PM6Qk1jK5Jk7n3l0k1P5qo9P9J05qn4k4ljp
9372h2J7mj7N0k0J1o3K0J5k6L4k9N0oLQ5k2k9L1nj9j15P0l9M2J4q9OM3L0k6LJ14K9q9ol3n1
$$ plain form
9501 -83 -95 -118 -64 -90 -74 -63 -72 -64 -58 -61 -67 -102 -48 -16 -61 -81 -14 -56 -78 -48 -77 -66 -101 -57 -69 -70 -96 -86 -28 -98 -63 -119 -112 -66 -35 -67 -60 -64 -40 -29
9482 -29 -67 -57 -80 -66 -26 22 -24 -94 -93 -123 -133 -81 -44 -94 -70 -140 -141 -116 -67 -36 -55 -71 -50 -94 -181 -107 -36 -115 -101 -95 -56 -69 -75 -90 -83 -71 -6 -34
9463 -34 -64 -20 -70 -126 -136 -139 -106 -115 -59 -86 -99 -68 -1 6 -33 -55 -23 -4 -18 -30 -69 -62 -16 -37 -87 -95 -97 -51 -74 -35 -63 -85 -98 -85 -124 -139 -69 -95
9445 -95 -53 -34 -66 -150 -152 -142 -137 -108 -66 -91 -71 -54 -67 -97 -117 -104 -92 -76 -49 -107 -151 -101 -72 -88 -85 -32 -32 -42 -38 -30 -56 -28 -15 -65 -55 -28 10 -63
9427 -63 -87 -115 -56 -52 -75 1 77 41 -71 -107 -43 -66 -79 -99 -59 -69 -95 -136 -102 -61 -84 -126 -150 -112 -62 -79 -51 -3 -12 -93 -149 -115 -32 -17 -21 -80
9410 -80 -55 -115 -98 -77 -72 -85 -35 4 -25 -20 -33 -30 -150 -106 -85 -77 -14 -68 -57 -139 -77 -56 -81 -38 -41 4 24 -49 -86 -91 -79 -45 -17 -25 -23 -28 -14 -58 -18
9391 -18 -46 9 3 -26 1 -33 -122 -162 -104 -89 -21 19 -14 26 -49 -77 -80 -101 -94 -48 -40 -61 -62 -37 -36 -63 -116 -146 -167 -92 -100 -169 -90 15 7 -47 -71 -74 -75 -82
9372 -82 -65 -69 -86 -36 -56 -45 -108 -88 -73 -99 -65 -94 -44 -50 -47 38 16 -13 18 13 -6 -121 -51 -90 -48 -34 -123 -117 -74 -44 -70 -67 47 76 -13 -19 -52 -103
9354a03O4j1j8K3K1k9j7k2M7M6j7l5K3K3p7l7K6L3k6Rj6N1m1o6j4L7M5jM2Rp0k9MkK5N7l5
9337h1O5lj3l4k4j5J1N1J0j5m9k6J8j0L1l7J9k3O1K5Rnm0J6nJ6L0l7m1PJ03k2o3O2N1j06K1
9319d3M3qL0l2j4l8k7K3pOPj1K3J7J4Qq0%J7N0jo0K5j0j0J1l6K7Nk1J5N6k2N5K4p1m1qJ4M9
9300b1J7l3J9J6J5K3L0o8L3J2p9lPm0QM4K0NLj9k9m0mjJ5L8k2o4M7j2J9Pn5J1L5k9J6k8L2
9281g5L7j2K4L5qp4j9K2M1m5L0rK4J8n5l5K3noL8o5LM1R0l7k7K9l6k3L5j8J9K2pl0J2m5J3
9263g5PL3RmJ5k4m7NL7j1rl6qK2K8K8l6K2M5o0J8on3K4J6l1Jj9N3jJ7l0l0Q0j5o3L6J02q8
9245d8K4j9n8n8R5k5lN6J8l0L1J6j4k9l6N3qp1QL6j6J6K4L6l0j7k3nL0l0j0mJ8jL6J03ql3
9226B4m6Jo7Q9L9o8l0l0OO0K8l8o8K2M1K9m4k1m6k9MN1J7J9J9j2k7J7N2j7mJ0k5J7p9k1Q8
$$ plain form
9354 -103 -39 -50 -68 -45 -24 -53 -70 -92 -45 1 -16 -51 -28 -5 -82 -119 -93 -60 -86 -77 -93 -42 -83 -149 -163 -126 -81 -82 -40 -31 -101 -130 -126 -128 -103 -46 -81
9337 -81 -16 -19 -32 -66 -90 -105 -94 -43 -33 -48 -97 -123 -105 -115 -84 -121 -102 -125 -64 -39 -30 -35 -75 -59 -64 -48 -18 -55 -96 -89 14 -8 -71 -9 42 -64 -43
9319 -43 0 -8 22 -10 -24 -62 -89 -66 -73 -67 -60 -71 -48 -31 -17 -9 -89 -89 -72 -22 -23 -83 -58 -68 -78 -67 -103 -76 -71 -92 -77 -21 -43 12 36 -35 -76 -84 -70 -21
9300 -21 -4 -37 -18 -2 13 36 66 -2 31 43 -36 -39 -32 -72 -64 -20 0 5 8 -11 -40 -80 -84 -85 -70 -32 -54 -118 -71 -83 -64 -57 -112 -101 -66 -95 -79 -107 -75
9281 -75 -38 -50 -26 9 1 -73 -92 -70 -29 -74 -44 -53 -29 -11 -66 -101 -78 -83 -89 -51 -116 -113 -72 18 -19 -46 -17 -53 -76 -41 -59 -40 -18 -25 -55 -43 -88 -75
9263 -75 -68 -35 -26 -30 -15 -39 -86 -81 -44 -55 -64 -100 -108 -86 -58 -30 -66 -44 1 -59 -41 -47 -100 -76 -60 -91 -90 -109 -56 -57 -40 -70 -100 -20 -35 -98 -62 40 -48
9245 -48 -24 -43 -101 -159 -64 -89 -92 -36 -18 -48 -17 -1 -15 -44 -80 -27 -35 -106 -98 -62 -78 -62 -38 -2 -32 -49 -72 -77 -47 -77 -87 -91 -73 -74 -38 65 57 24
9226 24 -22 -21 -88 1 40 -28 -58 -88 -82 -22 6 -32 -100 -78 -37 -8 -52 -73 -119 -148 -144 -93 -76 -57 -38 -50 -77 -60 -8 -25 -29 -19 -44 -27 -106 -127 -39
9209c9K9M6J0m2r4K1L5QK0j1L3Prj2j8j35P8L1j4k4qJ1M0k3K1K2nQp4nrJ3Nl0K4M1K1j0Q7
9190D9l1k5M8j7ol3K1J4K2L3m3k1Q8l8J0m4j9K7J1l6o6P7k8j9J3N7m6l9J10k5M4Nk0N1ll0
9173I1j9O1J03L0J11O6J67J84L62O47R50J884M127M959j79n107m045j807q84o04l61j81j37
9162D18m4j04r7k6Kk4k5j2k8J1KM2m9p3jj4N8L6rj8m0j2j4K9N0m4o0qK4J17Kq2%L1J6o9l5
9144e0l8L1K1J0O3kl1n1m8O8l8J7L7N5Om9J1%m4j5L5j8n5L5J2j4J5J5M1Rl1j5Lk1ML5Rn4l8
9126h0K1L7j1L3o2p6N0L0j6p5N1M4k2k9l0M5N3K7J8j4m5m7J5L3Ol6K3RK6k9J1o3o5O1K7K8
9109e2K7K5k7m1n0j6P4j4m7K0k8POn5K4O2L8l2L4M9lL2n3l9%N5rm9k3K0QJ5l3K3j07O0J6J3
9091g0J7o4MN3J9k4Kj4K9ql8j7L6L3K1kn7j1PJ6nJ0j0J1M3m2rp0KN5L0J4j9jP2l1l5LQ9r4
$$ plain form
9209 -39 -10 36 46 4 -90 -69 -34 -26 -6 -17 16 23 14 2 -16 -151 -73 -42 -56 -80 -88 -77 -37 -60 -39 -17 -22 -14 -88 -93 -102 -89 -84 -114 -90 -49 -28 -38 49
9190 49 18 -7 41 24 18 -15 6 20 42 75 32 11 99 61 71 27 8 35 46 10 -56 21 -7 -26 -13 44 -2 -41 69 44 88 93 73 124 121 91
9173 91 72 133 236 266 377 443 610 794 1156 1803 2753 4637 8764 13723 13544 8437 4392 2585 1701 1097 736 555 418
9162 418 374 270 173 147 149 125 100 88 60 71 73 115 66 -7 -8 -22 36 72 63 45 5 -7 -21 8 58 14 -46 -54 -30 87 89 7 7 38 54 -15 -50
9144 -50 -88 -57 -36 -26 37 35 4 -47 -95 -27 -65 -48 -11 44 50 1 12 12 -32 -47 -12 -30 -85 -50 -38 -52 -37 -22 19 28 -3 -18 -15 -36 -32 3 12 -42 -80
9126 -80 -59 -22 -33 0 -62 -138 -88 -58 -74 -149 -98 -54 -76 -105 -135 -90 -37 -10 8 -6 -51 -98 -83 -50 -44 -80 -57 -48 -22 -51 -40 -103 -168 -107 -80 -52
9109 -52 -25 0 -27 -68 -118 -134 -60 -74 -121 -101 -129 -122 -116 -171 -147 -85 -47 -79 -45 4 1 33 -20 -59 -59 -4 -13 -62 -85 -65 -57 -42 -75 -52 -159 -99 -83 -70
9091 -70 -53 -117 -113 -60 -41 -65 -63 -77 -48 -56 -94 -111 -75 -42 -21 -23 -80 -91 -84 -68 -73 -63 -73 -62 -19 -61 -70 -140 -138 -83 -53 -39 -58 -59 13 -18 -53 -50 39 -55
9071e5q3J12jrm5L4p5K5k0N8l4K9K2k8KK3O0n5k2Mnmk7L2L4n6k4J6J3L1j7l4J1P7J7p4M9J7
9053brm0ljk2K7pj8lk2L4K9j3nK8l5l5K6J5j2jL5m2m4L3ml0J2RK1k6jO7m0r9m4R2K8jM7Qm7
9033i5jK8K6j3k3n2M7QkK6J3j9K0p0K3L2L0m6L2J5MK0ljp2M3o1K0k0M0K0p0J9j6J8M7K6o0
9015f7r5lL4M6ljj4R5q3MPjK9o8K8K4O1l6k3K7j5m3Rj2L0%l6O6k4m9M0l0K1J5M4k0n3rqkK4
8996i1QK7l1L7QL1m5QJ0k9N5l2o2k2N3J4n1N4Lj7N5Jm6k2L2Kk3J3l8n9R3K8Pj6j8Nk8J5L1
8977d0m2l5NL8K1k1n0K7M9k6Pk0qk5j1N0J2J3rK6kKn9jLl5M8K5QRk6j5K5Qj2M0K9l3j8J0j1
8958d4l6l9O1J8N4q0K9J5L3n1m3q3J03K9%j3j7K6J8JLk9K9o7k8J4L3K4pk5LL7M1lmm3q5m7
8939a73K6R3nn8OJ3L9lm9m5J7nj0J07K6j13l8N1J5l5N1J2j9K3k8M6N1k1K8p6m1L6k7J3j0O3
$$ plain form
9071 -55 -138 -26 -27 -36 -81 -47 -122 -97 -117 -59 -93 -64 -42 -70 -68 -45 15 -40 -62 -58 -63 -67 -94 -62 -28 -84 -108 -92 -79 -48 -65 -99 -88 -11 6 -68 -19 -2
9053 -2 -11 -51 -54 -55 -77 -50 -57 -75 -78 -100 -66 -37 -50 -55 -27 -62 -97 -71 -56 -68 -69 -34 -76 -120 -87 -91 -121 -109 -100 -79 -105 -106 -39 -79 -178 -222 -130 -102 -103 -56 -48 -95
9033 -95 -96 -68 -42 -55 -78 -130 -83 -75 -77 -51 -38 -57 -37 -107 -84 -52 -22 -68 -36 -21 -17 3 0 -1 -73 -30 -91 -71 -91 -51 -31 -101 -82 -98 -80 -33 -7 -67
9015 -67 -162 -165 -131 -85 -88 -89 -103 -8 -91 -87 -80 -81 -52 -120 -92 -68 -7 -43 -66 -39 -54 -97 -88 -100 -70 -70 -106 -40 -64 -113 -73 -103 -82 -67 -23 -43 -96 -105 -113 -115 -91
8996 -91 -83 -56 -87 -50 -42 -11 -56 -48 -38 -67 -12 -44 -106 -128 -75 -61 -112 -58 -55 -72 -17 -16 -62 -84 -52 -50 -73 -60 -98 -157 -64 -36 -29 -45 -63 -58 -86 -71 -40
8977 -40 -82 -117 -112 -74 -53 -74 -124 -97 -48 -74 -67 -87 -95 -120 -131 -81 -69 -56 -65 -39 -41 -39 -98 -99 -96 -131 -83 -58 -50 -41 -67 -82 -57 -49 -61 -21 8 -25 -43 -33 -44
8958 -44 -80 -119 -58 -40 14 -66 -37 -22 11 -40 -83 -166 -63 -34 -34 -47 -64 -38 -20 -19 -16 -45 -16 -83 -111 -97 -64 -40 -47 -72 -69 -32 9 6 2 -41 -126 -173
8939 -173 -147 -54 -59 -117 -111 -98 -59 -62 -111 -156 -139 -144 -154 -47 -21 -134 -172 -121 -106 -141 -90 -78 -97 -74 -102 -56 -5 -26 2 -74 -115 -79 -106 -93 -103 -40
8922d0J4o6j1N5l9L7KK8K5j8QP6o9l4k3pK9K4mM2k9j7l3J1l4O7Kq9k9MN2M5Jm1pM3k1p8M0
8904h4N1K8n3Kl6j4L4l2N0j9mO9m1N1Jp2J0N2M0o8l8J8k5m7jK3M4p9O2O5r6M2jP1k1j8l8O
8886f8l2k6K5N7N7K4l6kRl9n3j2m2MR4J5n9Q6l0n6J4PK9QP7j9ln1Pl5K9nJ2m8L2M5m6KJ1k7
8866d5k0j2om1K2L9l6RQLk2R7M5k8l9pK5n7rk8K8K4N7j5K7o6j3J18j4r4n9M9Pj5jK5j1K1L1
8848cm6LL7k4K0J5l9o3M7NJ6M3p8l1O6L7L9k4q0n7J4K0O4l8L0K6L5o1K0l4l3k1Rk4J1k8K6
8830a01K7K5P3M6j06m4J9OP3l3l4J6K7lj15K7M7L6k5QOj1Nj2J8QLLNp1J7Mn6M6L1n1L3L1k6
8812d8NO4K2o1j8LoKJ0q4J6l0j0O2rm3l6L1L8qk2N3PK3%o6kJ6knPJ3l6J7%PL0n5rP5O2o3l4
8791h4j5j7Ml6O1N6l7l1M7M5l9m7pPJ3rj3O0j7K2n2k6J2L3M7k9k4J1M5K8j5M7p5Rn0oQ6k6
$$ plain form
8922 -40 -26 -92 -103 -48 -87 -50 -48 -20 5 -13 -5 71 2 -32 -55 -62 -33 -9 -13 29 0 -17 -50 -39 -73 -6 -4 -93 -122 -118 -66 -21 -20 -61 -68 -25 -46 -124 -84
8904 -84 -33 -5 -58 -56 -92 -106 -72 -104 -54 -73 -77 -8 -49 2 3 -69 -59 -7 33 -35 -73 -55 -80 -127 -128 -105 -61 -140 -78 -13 -109 -67 -68 3 -18 -36 -74 -68
8886 -68 -100 -126 -101 -44 13 37 1 -1 8 -31 -84 -96 -138 -134 -40 -25 -84 2 -28 -84 -70 -63 -34 -26 51 32 29 -22 -15 -50 -21 -26 -14 -62 -30 15 -31 -29 -18 -45
8866 -45 -65 -77 -83 -124 -102 -63 -99 -90 -82 -79 -101 -4 41 13 -26 -33 -8 -65 -74 -102 -74 -50 7 -8 19 -47 -60 58 44 -50 -109 -60 -53 -68 -69 -44 -55 -34 -3
8848 -3 -49 -46 -9 -33 -13 2 -37 -100 -53 -48 -32 11 -67 -98 -32 5 44 20 -60 -117 -103 -83 -19 -57 -27 -1 34 -27 -7 -41 -74 -95 -86 -110 -99 -127 -101
8830 -101 -74 -49 24 70 -36 -80 -61 -55 18 -15 -49 -33 -6 -9 -124 -97 -50 -14 -39 -31 -25 -36 -31 -43 -25 -17 -14 -11 -6 -77 -60 -56 -112 -66 -35 -86 -53 -22 -48
8812 -48 -43 21 43 -18 -36 -33 -39 -37 -27 -111 -95 -125 -135 -73 -82 -125 -161 -130 -92 -100 -122 -69 -62 -39 -39 -105 -107 -91 -93 -98 -91 -78 -114 -97 -97 -90 -60 -115 -124 -49 13 -50 -84
8791 -84 -99 -116 -112 -148 -87 -31 -68 -99 -52 -7 -46 -93 -100 -93 -80 -89 -102 -42 -59 -37 -89 -115 -103 -70 -23 -52 -76 -65 -20 8 -7 40 -35 -26 -76 -82 4 -22
8773b2j6ML4l3kj4JM2k2mm5rK9m6K5L8Rj4K5q7Roj0K8M8M7L2j00K3m4M2L2K0k0k2k5j7j6R1
8754Ej6k2k0ML4p7KM2p4mO0N1%p7M3J6k2m9M3J2qK7j7rm9N6JO4Mn0o2J%M0Nl7mMJ6l6j7L4
8734h6Jj4N9J4l2j6k3j8K0L2N2k2nj07l8K3mj7M8J7J5JO6q7jL4L4N3j3K3j4l5kk5j9pKM3m
8716e2J5Qo1KO4n6j8k1J1J5M7o5Q4Q0j08L4l7L4l4J6qJ2pk6L2l5K6l7NP3m6l8l4PNN1n0oO6
8697e2j0L3Ml6L5n5j1O8k0L5nnm4L%O9n1M0kp6k6JQ0j3Nj6KJ2n0o0M1J6j2N1M1k6n5NK2L8
8678b4k4M1Lj4m6J9l8J0N3J8L2m1j8K8qm7J8n2M6M4j3l7kj7j8j1K2l1M6J0KJ4Jj9Kpm9k3O9
8660f1J6oJ5J8j7k2j8O3l1L3j3p1P9l1o4j4L6O0n0ol2M3P9l4Kon2N3L7p1L1p3N3L8J6qk3l
8641c4%j5j9J6o8J7m3L6Q5o4j3L8m7K3J32o4n8K3L2l4j7L4j2q1J0J6m4P1M3K6M6m6l0j5j6
$$ plain form
8773 -22 -38 -34 0 -33 -35 -49 -48 -6 -28 -32 -77 -86 -57 -103 -78 -40 -31 -45 -20 -107 -98 -104 -114 -86 -38 9 41 -59 -36 -80 -38 -6 14 -6 -28 -53 -70 -86 5
8754 5 -11 -33 -53 -49 -15 -92 -90 -48 -122 -126 -66 -15 -15 -92 -49 -33 -55 -104 -61 -49 -57 -30 -47 -56 -105 -49 -48 16 20 -30 -92 -91 -91 -51 -46 -83 -87 -83 -67 -103 -120 -86
8734 -86 -85 -99 -40 -26 -58 -74 -97 -115 -95 -63 -11 -33 -38 -145 -183 -160 -164 -181 -133 -116 -101 -100 -34 -121 -122 -88 -54 -1 -14 9 -5 -40 -42 -67 -86 -93 -91 -48 -52
8716 -52 -37 -29 -90 -88 -24 -80 -98 -119 -108 -93 -46 -111 -27 53 -55 -21 -58 -24 -58 -42 -50 -38 -45 -71 -39 -74 -48 -85 -80 -7 -53 -91 -125 -118 -113 -62 -112 -118 -52
8697 -52 -62 -29 -25 -61 -26 -81 -92 -24 -44 -9 -14 -19 -63 -60 -60 9 -42 -2 -4 -80 -106 -105 -25 -38 -33 -49 -47 -35 -85 -145 -104 -88 -100 -49 -8 -34 -89 -84 -62 -24
8678 -24 -48 -7 -4 -18 -64 -45 -83 -73 -20 -2 30 -11 -29 -1 -9 -56 -38 -90 -44 0 -13 -50 -52 -69 -87 -98 -76 -107 -61 -51 -49 -35 -34 -53 -51 -58 -107 -130 -61
8660 -61 -45 -51 -36 -18 -35 -57 -75 -12 -43 -10 -23 -94 -15 -46 -110 -124 -88 -28 -78 -84 -116 -73 6 -28 -26 -32 -84 -31 6 -65 -34 -107 -54 -16 0 -8 -31 -34
8641 -34 -34 -49 -68 -52 -120 -103 -146 -110 -25 -89 -102 -64 -111 -88 44 -20 -78 -55 -23 -57 -74 -40 -52 -133 -123 -107 -151 -80 -37 -11 35 -11 -41 -56 -72
8625g2MK3M4K6r4j1k4L8k0j9L4K8k5m3N5M0Qk2n7J8l2J4O1no4j3L1ON8k0l3NK9p4n0O8l9Q6
8607d1o1N3L8Rk8l4N1n5K1l3n7K9j6K9L0k6M2Q6j6n2jJj3rj05Q4J8l5N4Mn5J2K5N2L5l8l7
8589c9k8J7k8K6k3N7k2K0j2q2k2O4m3j9R4n3o2QO5L1lrj5k0o2L7L5L2j2j9ol8J14lK3l6j4
8571d7L3j4K1Qk6m7l6J00k6k4k3J0Q8j10J5J5J3L7k4kK6L4n3m7j6K2M4l6K4Lo6L5L8k6kK3
8554c6k5k9K7Ok7M1L8rl7o7K7N3nL3k1M4j19j7K8rN9j1o3QM4j5K1K4l6n7k7M9N3l8joL7ro
8536g8j7n3L9K0J1N9m2l9M3j4J7MKqmrMo5J3n1M3K3M6J7K4N0J3r0K7p4pL8k5oM2q2k9K9J9
8517a10N9N3m6p4P9k2K7RK9k3K3Om3J8m9LM2L4j2j9No0J6L5J8j0Kk1n4M3l0oK1j9k8k3N4l9
8499a12jK9K5kMK6n4ON1J9k2oJ3m5j4Qk0k9rjO0L7l4OJKQn5O2l9N1j1km3L6p4J2Q8n1j7j2
$$ plain form
8625 -72 -68 -45 -1 25 -69 -80 -104 -66 -86 -105 -71 -43 -68 -111 -56 -16 -8 -30 -87 -69 -101 -87 -26 -31 -95 -108 -77 -71 -13 -33 -66 -61 -32 -106 -156 -88 -127 -41
8607 -41 -102 -49 -11 -2 -30 -64 -13 -68 -47 -80 -137 -108 -124 -95 -65 -91 -49 37 21 -31 -32 -31 -44 -53 -158 -74 -56 -91 -37 -33 -88 -76 -51 1 36 -2 -39
8589 -39 -67 -50 -78 -52 -75 -18 -40 -20 -32 -114 -136 -72 -115 -134 -40 -93 -155 -147 -82 -51 -54 -63 -78 -98 -160 -123 -88 -56 -68 -87 -93 -131 -17 -20 3 -33 -47
8571 -47 -14 -28 -7 1 -25 -72 -108 -8 -34 -58 -81 -71 17 -93 -78 -63 -50 -13 -37 -39 -13 21 -32 -79 -95 -73 -29 -65 -41 -38 -104 -69 -31 -57 -59 -36
8554 -36 -61 -90 -63 -57 -84 -43 -5 -14 -51 -118 -91 -38 -43 -10 -31 13 -106 -123 -95 -104 -45 -56 -119 -111 -67 -82 -61 -37 -73 -130 -157 -108 -55 -93 -94 -100 -63 -72 -78
8536 -78 -95 -148 -109 -89 -78 -19 -61 -100 -57 -71 -54 -50 -48 -56 -60 -69 -65 -130 -117 -168 -125 -102 -56 -39 -15 35 48 -42 -15 -89 -96 -58 -83 -89 -47 -129 -158 -129 -110
8517 -110 -51 2 -44 -118 -39 -61 -34 -25 4 -19 4 10 -33 -15 -64 -61 -19 15 3 -16 -11 -71 -55 -20 -2 -12 -10 -31 -85 -42 -72 -78 -57 -76 -104 -127 -73 -112
8499 -112 -113 -84 -59 -61 -57 -31 -85 -79 -28 -9 -31 -37 -24 -69 -83 -75 -95 -124 -133 -134 -74 -37 -71 -65 -64 -62 -54 -109 -47 -86 -35 -46 -48 -91 -55 -129 -117 -29 -80 -97 -109
8479a09K1J3M1Q5j03n6m9j4J9P9n6l7K5%N6M6JK8m7NN1%l0n7k1j0O7k5J3JpL7ll5j1j2R8k2
8461a8J5j5K0k5j19P2N3J4l8lPq4OP3mK5m3M0l2l5L6j6j2K5j0M6L1n1OOn3N6lm7N4L3n1J2
8443b9k7n6L6J02l2o9mRk3L7K9L4K2q5nL1j6K9po9K6j4j2K1K2k7l5O9L2J6j6l1klLL0r9OJ1
8424i6j9M5MQN2QL1p1J2%K0rK8N7l3o8j9l9M5lJK9J1k2l2j9M4O4k0Ok3M2o7k9N7o6l0k4K9
8406i6P8m5O5n3l4o3K1N2qn5M7L0n5PK9J3K2n6n1Oj2L9M7OK5J7M2k0KLNl5nJ1J4KK6k9Kn2
8387e8N2K6m1pK7k8nl5L2J5%L8o4o3L3L0o2m3RMn6O1N7M7Jn9l9K0pR7L5Qn8o3J8J7L3L5o7
8368f0lj2K6K2K2p0M0K9k5okM7p8L2k8K8m5O3N5m3j6Rn9N5K6j1j1OJ3o4j6M9n1K5M2Jo7kL2
8350d7k1n9k4L4L2k1LM0N0L5q3l2K8oJ5LL0jm0m1M2j2p5L4J5j2K2J15m6m6Rk0m2n7J0L8P2
$$ plain form
8479 -109 -88 -75 -34 51 -52 -108 -157 -171 -152 -73 -129 -166 -141 -141 -85 -39 -38 -10 -57 -52 -1 -1 -31 -88 -109 -119 -52 -77 -64 -63 -70 -33 -36 -71 -82 -94 4 -18
8461 -18 -3 -18 2 -23 -142 -70 -17 -3 -41 -44 -37 -121 -115 -42 -46 -21 -64 -24 -56 -91 -55 -71 -83 -58 -68 -22 9 -42 -36 -30 -83 -27 -30 -77 -23 10 -41 -29
8443 -29 -56 -112 -76 26 -6 -75 -79 -70 -93 -56 -27 7 29 -56 -61 -30 -46 -17 -24 -93 -67 -81 -93 -72 -50 -77 -112 -43 -11 5 -11 -42 -44 -47 -44 -14 -113 -107 -96
8424 -96 -115 -70 -66 -58 -6 2 33 -38 -26 -26 -6 -15 13 70 37 -31 -50 -89 -44 -47 -46 -17 -6 -28 -60 -79 -35 29 9 15 -8 34 -33 -62 -5 -71 -101 -125 -96
8406 -96 -18 -63 2 -51 -85 -148 -127 -75 -83 -138 -91 -61 -116 -109 -80 -67 -45 -101 -152 -146 -158 -119 -72 -66 -41 -24 18 -2 0 3 8 -27 -32 -21 -7 -5 21 -8 -6 -58
8387 -58 -6 20 -21 -28 -1 -29 -34 -69 -37 -22 -22 16 -48 -111 -78 -48 -110 -153 -144 -140 -196 -135 -78 -31 -30 -89 -128 -108 -115 -18 17 25 -33 -96 -78 -61 -28 7 -60
8368 -60 -63 -75 -49 -27 -5 -75 -35 -6 -31 -37 -39 8 -70 -38 -66 -38 -83 -20 35 -8 -24 -15 -74 -19 7 -4 -15 -9 4 -60 -76 -27 -78 -53 -11 -10 -77 -79 -47
8350 -47 -68 -127 -151 -117 -85 -106 -103 -63 -13 22 -61 -93 -65 -71 -56 -53 -23 -24 -64 -105 -63 -75 -150 -116 -101 -113 -91 24 -22 -68 -59 -79 -121 -178 -168 -130 -58
8332e8L2l1rm6LK4P9J6m7k6L%qK6Nm8L1k3M0K3j1j1L4l3L5K8qk5L1j3k0kk9m0K0n8K4O4L5
8313GK2J4rk8k7j6L3%mJ5Kq9n6J6R1K1j22moM6O8J1m5K9p6m5N8j1O2L5J4K8j0n1l0n4mO2R
8295d4O8n8L0M0o3k6qRn1M0k3j1jjJ5oL7Q4j8m4m2lK4l3j2M8NRk6MK2K4J0n3L7pm6j8oK6N8
8275a0l8j2j6Mm9N2Ln5M0RoO2o0l0K8O8lq8j9K7j0J2m6J6P5O3l1on3Qj1J3l5jJ7j8L2P2J4
8257A8m3l3QJ7l1l2R4P5r2o6KO8N3n2j5N9o7n7l0M1J3l0lJ8N1j9K6J7K2n2L8r3%M9n3klKM
8238i8Q2K9m9J2Qn8K8pj3j1K1lk0l7K0N2o4M8O1o4q3M0Qj6L4j9P0qj0Pk2k0l4NM2L7L6k8n3
8219g7J4j4R3J7np6lL5q7j8O8K9K7Jl3J7Nj1L9LJo5j4oq0P6J0O6J9k7l3Po5O8o8k4M3mK0j4
8200f6K4Q5J3N5q5l3J2k5mJ0M9L5n6jL1JJ1NK4K6nK3jJ01J68M2n3K0Q5P6N2J14K98N32P36
$$ plain form
8332 -58 -26 -57 -66 -112 -109 -85 -6 10 -37 -63 -60 -60 -68 -42 -37 -85 -54 -77 -37 -14 -25 -36 -2 -35 0 28 20 -5 26 13 -7 -9 -38 -78 -58 -116 -92 -28 7
8313 7 29 43 34 6 -21 -37 -4 -4 -8 7 9 -80 -136 -120 -29 -8 -130 -134 -140 -94 -26 -15 -60 -31 -107 -152 -94 -105 -43 -8 6 34 24 -27 -57 -111 -115 -53 -44
8295 -44 24 -34 -4 36 -27 -53 -61 -52 -103 -63 -86 -97 -98 -99 -84 -90 -53 31 13 -31 -73 -76 -52 -85 -97 -49 -44 -35 -61 -57 -35 -11 -1 -54 -17 -24 -70 -88 -94 -68 -10
8275 -10 -48 -60 -76 -72 -121 -69 -66 -121 -81 -72 -78 -16 -76 -106 -78 -10 -13 -101 -120 -93 -103 -91 -137 -121 -46 17 -14 -20 -73 -65 -76 -63 -98 -99 -82 -100 -68 4 18
8257 18 -25 -58 -50 -33 -64 -96 -2 73 -19 -85 -83 -15 38 -14 -29 30 -37 -94 -124 -83 -70 -100 -103 -85 -34 -53 -27 -10 12 -40 -2 -95 -95 -46 -99 -101 -104 -102 -98
8238 -98 -16 13 -36 -24 -16 -74 -46 -53 -66 -77 -56 -59 -79 -116 -96 -44 -108 -60 1 -63 -146 -106 -98 -114 -80 -99 -29 -37 -47 -40 -62 -82 -116 -111 -69 -32 4 -24 -77
8219 -77 -63 -77 16 33 28 -48 -51 -16 -103 -121 -53 -24 3 4 -29 -12 -7 -18 21 24 25 -40 -54 -60 -140 -64 -54 12 31 4 -29 -22 -87 -19 -87 -111 -68 -72 -52 -66
8200 -66 -42 43 56 111 26 -7 5 -20 -24 -14 35 70 14 13 44 45 56 61 85 111 106 129 128 229 397 439 386 406 491 567 619 733 1031 1563 2299
8184B299J592L882P211J884o147n589k461r66n59m00k83j30p3n3r8p7j7M2J8J3m0ok6o6l5
8172h5J9J1N5k6L8k9K9rn9M4NL5l3n1N8L7J9r2o1R7J0l8L9m1Kjl5k2N5j6J8M8l1n5N9K0j1
8154CJ6n1J2%n0L6%M5j5k8jrk6k7J3J0k1m0J26K0o6l7K6mk0jO7jj4p5M3jj0L3Ml2JM1m9j7
8135i9l9K8L5m0j4K6K8N7k5Jn4rP3q9K5Q2jm7m5O0pk7j8P1k5o0K5N9K8K0q8j1M0j1Lk6j9J5
8117g8Qnn0O4lJ2M7l3k8J5m0KN4J3n4l7L6qPj7J4l5M2j4j6J7%K3o5L5LM1j2M1l4JmpLjL4j2
8097d1k0jJ5J8Jp4P8r3MM6rN0oLJ2m0N2nk7k6k7M1M7rM6n9n6M1k7J9j9JJ2j0Rj7k4L6q0K4
8078a15R6n4%j6M4l3k1L0nM7j6l4L4Nr7J8M5J6K9l2j9K0rrM9k0K6J5l2ll3K1j8L2j2l1J0q
8060h0K6R%p3N1J2rK6N9p6L9%m2M7J6k8o3j0j2M7n1K0L6nm3oJ3j4N0O1n2j0oLoL8l1k8K2q
$$ plain form
8184 2299 3891 7773 14984 16868 10721 5132 2671 1705 1146 746 463 333 260 207 109 32 15 57 75 88 48 42 16 -50 -85
8172 -85 -66 -55 0 -26 12 -17 12 3 -56 -12 -7 28 -5 -56 2 39 58 -34 -95 2 12 -26 13 -28 -26 -27 -62 -84 -29 -45 -27 21 -10 -65 -6 14 3
8154 3 19 -32 -20 -20 -70 -34 -34 11 -4 -32 -33 -42 -68 -95 -82 -72 -93 -133 -7 13 -53 -90 -64 -68 -88 -89 -22 -23 -37 -112 -69 -70 -80 -47 -43 -75 -74 -33 -82 -99
8135 -99 -138 -110 -75 -115 -129 -103 -75 -18 -43 -42 -96 -105 -32 -121 -96 -14 -15 -62 -107 -47 -54 -81 -99 -28 -53 -113 -88 -29 -1 19 -69 -80 -40 -51 -48 -74 -93 -78
8117 -78 -70 -75 -125 -61 -64 -52 -5 -38 -66 -51 -91 -89 -35 -22 -76 -113 -77 -85 -78 -95 -81 -116 -74 -88 -104 -87 -87 -64 -129 -94 -91 -50 -62 -21 -55 -54 -58 -65 -62 -63 -29 -41
8097 -41 -61 -62 -47 -29 -28 -102 -24 -117 -113 -67 -76 -26 -32 -29 -17 -57 -5 -10 -37 -63 -90 -49 -2 -11 35 -24 -80 -39 -66 -47 -66 -65 -53 -63 -54 -71 -95 -59 -139 -115
8078 -115 -19 -73 -73 -89 -45 -78 -99 -69 -74 -27 -43 -77 -43 -38 -135 -117 -72 -56 -27 -59 -78 -58 -67 -76 -27 -47 -21 -6 -38 -41 -74 -53 -71 -39 -51 -82 -72 -80
8060 -80 -54 -45 -45 -118 -67 -55 -64 -38 21 -55 -16 -16 -58 -11 5 -23 -86 -96 -108 -61 -112 -92 -56 -61 -104 -110 -97 -111 -61 0 -52 -62 -68 -65 -71 -33 -64 -92 -70 -78
8041g8rK0P3Jq0J4J9K4l4m1M2o0J3M8j3nP5k1J2r4K0M5%Ko9k7RO0k5oK9N4j7J7l0k7M0j7n7
8022i3n8j7L3K2M3l6L7k5j5M7L8l2kj1N2j6m9K3j1j2O6J1j0k4k3K7M1p0oL4mj4nm3k1L0M7
8004d6K6p0Jl4K2K0K0k7J5l2P6pn2j0K7KOk1J3j2qj2P4J1k5Mk9j2Qk0J9K3l5p4M2J9NQ4l8
7986d7m4n7O7lK7J8K5m6j7P9o1j6M6rn1Q3p9k5K3N3m4k6M2l6k8M9N2j7j4m3l2J9L6L2o3l8
7969a45QO9M0k1o6rN4n3RL3J3OPj2k5K7N5k0L0l7K9k0l3rN7M1r4k1N0mm7P5LL7Qj2k7n0K0
7950c4l2L1k7n8L9Q3j6Jk1Ro8K0L3m4%j7J7k3N7K2k2K7J7o4k1K4k0m7M2N2lm6QJ3L9j3K8%
7932a4k9n4J6L9M4o9jM5J9k8K0m3n8N7L5kl1lqQK7N0%q5M8k2k0RqJ6K5J8Qm8k8K1M1n0QJ0
7913c7n4L3Rj7j8j8M0N2k2m7Lk9L6M1k4r4N4L2LN9O0n8q4NM0O4RK5K6J45M68J539O99j442
$$ plain form
8041 -78 -87 -67 6 7 -73 -59 -40 -16 -50 -91 -49 -109 -96 -48 -61 -66 9 -12 0 -94 -74 -29 -29 -27 -96 -123 -114 -54 -79 -85 -56 -2 -19 -2 -32 -59 -19 -36 -93
8022 -93 -151 -168 -135 -113 -70 -106 -69 -94 -109 -62 -24 -56 -58 -69 -17 -33 -82 -59 -70 -82 -16 -5 -15 -39 -62 -35 6 -64 -70 -36 -40 -54 -59 -102 -123 -93 -46
8004 -46 -20 -90 -89 -123 -101 -81 -61 -88 -73 -105 -29 -36 -88 -98 -71 -69 -63 -84 -71 -83 -91 -103 -29 -18 -43 -39 -68 -80 -72 -92 -73 -50 -85 -159 -117 -98 -93 -9 -47
7986 -47 -91 -148 -81 -84 -57 -39 -14 -60 -77 2 -59 -75 -29 -38 -89 -6 -85 -110 -87 -34 -78 -104 -62 -98 -126 -77 -25 -42 -56 -99 -131 -112 -76 -44 -107 -145
7969 -145 -137 -68 -28 -49 -115 -124 -70 -123 -114 -81 -68 -62 -55 -67 -92 -65 -10 -30 0 -37 -8 -28 -61 -70 -13 28 -66 -87 -37 -41 -88 -13 -10 27 35 23 -4 -54 -34
7950 -34 -66 -35 -62 -120 -81 2 -14 -13 -34 -25 -93 -73 -40 -84 -84 -101 -84 -107 -50 -28 -50 -23 -6 -70 -91 -67 -87 -134 -92 -40 -43 -89 -81 -68 -29 -42 -14 -14
7932 -14 -43 -97 -81 -42 2 -67 -68 -23 -4 -32 -12 -55 -113 -56 -21 -23 -54 -57 -65 -57 -30 20 20 -65 -17 -39 -59 -50 -58 -42 -17 1 9 -39 -67 -46 -5 -55 -47 -37
7913 -37 -91 -58 -49 -66 -84 -102 -62 -10 -32 -79 -76 -105 -69 -28 -52 -146 -92 -60 -57 2 62 4 -80 -75 -35 29 38 63 89 234 702 2241 2940 1498
7897A498j032k65r7n3o0l7Rk5nJ2qo1M7J7L4K2n6k0kO9MJ9k2rL1K9L7m0m0k0k7k7J4ln0M3
7879g4pQ6Pk5J1n3k0K7J6L7m8k6k1K5O2nk5Nl9J4M3qPq3K3K2p6L8j9L7J0L%N3J3MJ5o6k9L4
7860c2J6l2rJ9j1N1j7n5L4K8On0j1Nl6P7n7q0R2L2K5m5p4N3J1l0N2k1l8k3L4jl1L6k6oj2P5
7842e1RKl4N4m4P3%j9l5j1k1J2J6K2J8k1j0j4%j08L1J6K3P2Po3M4Mk2J7l5KMml2%L1N%k8O1
7823b9J0J2n9J3K1J3M9M4p6m7l6L2l0K5j1qnn6l1M8jJ16lp0N7r8LN8j5n4LN5Nk2l6m1P1M9
7805d4l1J4OK2J8om2lQJ3K6m1o6RK5L0M6QJ3J6o2J7O8o2p5nM2M7j7J8l3ML4k4K6n5nn7L1n1
7785a38M8M6m0K6m7LK3pM6mj3j9L4j2l1qL4j5KJ8l2m0j2R5nQKK5m6%J9N0p8j3J1j2J1L7k6
7767f0Ln5J3LN5Rj9k5jJ4L3L4n2K1M4l9k1L2j6n0M1j9J0lj5Ko7k4J0l0K8M4j9NJ7L5RK3Jj6
$$ plain form
7897 1498 466 201 104 51 -9 -46 -37 -62 -67 -55 -63 -124 -77 -60 -26 -4 -60 -80 -82 -13 -9 10 -12 -21 10 39 76 36 -4 -24 -51 -78 -64 -67 -117 -74
7879 -74 -81 5 12 -13 -2 -55 -75 -48 -32 5 -43 -69 -90 -65 -3 -8 -33 -28 -67 -53 -10 -18 -11 -94 -71 -49 -125 -87 -106 -69 -59 -56 -56 -3 10 14 29 -37 -66 -32
7860 -32 -16 -48 -57 -38 -49 2 -15 -70 -36 -8 -2 -52 -63 -58 -94 -17 -74 -154 -62 -30 -5 -50 -124 -71 -60 -90 -38 -59 -97 -120 -86 -87 -118 -82 -108 -114 -126 -51
7842 -51 -42 -40 -74 -20 -64 9 9 -10 -45 -56 -77 -65 -49 -27 -9 -30 -40 -54 -54 -162 -131 -115 -92 -20 -13 -76 -32 -28 -50 -33 -68 -66 -62 -66 -98 -98 -67 -62 -62 -90 -29
7823 -29 -19 -7 -66 -53 -32 -19 30 74 -2 -49 -85 -53 -83 -58 -69 -77 -82 -138 -169 -121 -122 -6 -9 -79 -22 -120 -117 -59 -74 -128 -125 -70 -65 -87 -123 -164 -93 -44
7805 -44 -75 -61 -55 -33 -15 -21 -63 -66 -58 -45 -19 -60 -126 -117 -92 -62 -16 -8 5 21 -41 -24 44 -18 -93 -98 -56 -9 -26 -8 -41 -37 -3 -27 -1 -56 -61 -118 -87 -138
7785 -138 -90 -44 -84 -58 -105 -102 -79 -86 -40 -44 -57 -76 -42 -54 -85 -93 -59 -74 -72 -54 -86 -126 -138 -43 -48 -40 -38 -13 -59 -59 -40 10 -68 -81 -70 -82 -71 -34 -60
7767 -60 -57 -112 -99 -96 -41 -32 -51 -76 -77 -63 -30 4 -48 -27 17 -22 -43 -11 -27 -77 -36 -55 -45 -48 -63 -61 -128 -152 -142 -172 -144 -100 -119 -114 -97 -62 -53 -30 -29 -45
7748d5J3m7O0M2Mo7q4M1l2K9lKK4ml5pj2k2L1P3L8m1qj6j8K7QRk0q%J7l2M2j1j6J0K7n5k6
7729a12NN2L3L7l7m8KK5n3Q1l3l6M9Pm7j7K7mk9P7Qk5n0J1L0n3j3kO0J2l3M9k1m8O5M5o5l7
7711h8K5l8J7j7L0J3L3j0J9ln0%l3K5OO7k5o6J0J5m9L6M2q8m5O9N2Kj3L5mL2j4m1k9m4k2j8
7692a69P0K1m3K0Q7j0l1M7J3J1n8k0K6Jn1PJ7J0pJ5N7rk9M6j22P5l4l5K1Nj1M7k4JK2M7L2
7675D5k0qm6M2o2k1J8j7k7kRJ6J6%K8Po6n8L2J4K4R2m1p4Q0MJo4J5J5mj8K3o5NJL7L3Rk6q0
7655a33P3N4n4J8L3L3k9k3nl3M9J9Rm1l1JLn3K7j3N4J3nJ6K2j5n4nJ3M3j3l5k7m3J2L3N3L
7637c1j4qk0l5M3m6j8P4j1M5lmoPM1m5k1JN8n3lN0j0oo4Rk4j3L2m5nP3j6Qok0l0M7J5N4j3
7618a3n5j6K0k9J4K7k5L7q5M5O3r4L2J5o5OP4M9l5KK8n7l5k0NR3kL8l6m3M1K7l2j0L9J2m2
$$ plain form
7748 -45 -32 -79 -19 23 27 -40 -124 -83 -115 -86 -89 -87 -63 -67 -102 -109 -121 -143 -112 -39 -1 -42 -50 -66 -84 -57 -49 -40 -60 -68 -68 -51 -83 -41 -52 -68 -58 -31 -86 -112
7729 -112 -107 -55 -22 15 -22 -70 -68 -43 -96 -15 -48 -84 -35 -28 -75 -92 -65 -69 -98 -21 -13 -38 -88 -77 -47 -100 -113 -115 -55 -43 -76 -27 -48 -96 -31 14 -51 -88
7711 -88 -63 -101 -84 -101 -71 -58 -25 -35 -16 -19 -69 -69 -102 -77 -71 -4 -29 -95 -85 -70 -119 -83 -41 -129 -174 -105 -53 -51 -64 -29 -33 -1 -15 -56 -85 -129 -151 -169
7692 -169 -99 -78 -121 -101 -14 -24 -55 -8 5 16 -42 -62 -36 -35 -86 -79 -62 -52 -59 -44 13 4 -25 21 -101 -26 -60 -95 -74 -69 -80 -33 -57 -56 -34 13 45
7675 45 25 17 -29 13 -49 -70 -52 -69 -96 -98 -89 -73 -57 -57 -29 -22 -88 -146 -114 -100 -76 16 -25 -99 -19 -15 -14 -78 -63 -48 -52 -70 -47 -112 -107 -106 -69 -36 -27 -53 -133
7655 -133 -60 -6 -60 -42 -9 24 -5 -28 -33 -66 -17 2 11 -30 -61 -60 -57 -110 -83 -96 -42 -29 -34 -18 4 -11 -65 -70 -57 -14 -27 -62 -89 -132 -120 -87 -34 -31
7637 -31 -45 -53 -73 -108 -65 -111 -129 -55 -66 -21 -24 -28 -34 -27 14 -31 -52 -51 7 -46 -49 1 -9 -15 -79 -70 -94 -107 -75 -120 -125 -52 -68 -60 -66 -86 -116 -69 -54 0 -13
7618 -13 -68 -84 -64 -93 -79 -52 -77 -40 -125 -80 -17 -111 -79 -64 -129 -123 -49 0 -35 -33 -5 -62 -97 -117 -112 -19 -21 17 -19 -62 -21 6 -26 -36 3 15 -27
7600b7l0Ml5pk8J2K5kj7N6Q8Qo5p4J4J6L7l7pN0j7OmJ3k5j3J1K5%l5k1R3oj7l0nM5r2m8Q7
7581e2N5k4m4M8l4j4k7o5R7P0J6m5o1jJn5J9j5ON4j7O2m2QK5n3l8N4J5n3K9L4nM9p2m8%K5
7563i8ML7mNj1k0j7K4rL1%L4pk8kj0M4k0k9k1J8j1p5j2M6M3k0O4N9m4J4n2k2J9L0k4N4M1p6
7544d5j9N3l1Lo4J1J5pm3J3N0O3q0JJ2O6Lj5l3qpM3Rk6n4o5k0R2k1OM0L9j5o4J8L5N4l5J0
7526a6k1Ol6J4q2j0N1P5L6m3r1N1J8j1QrJ9l2j9K3L1m7L8k4j9J6J6L0MJ5nk5nn4L7O9j2k7
7507c1k9O9l3o6M3n3M6M5p0q7M9L0MJ1L8l9j6k0L8k3N6o6K0P2k7L4l0p0l7R3RJ3lk2o5QPR3
7489imK9m3l1m9j7M8J0N2Nj4JO5o4m5J1k4JK7j7K3N3j6jj2Mrk6J7MQ7l5mLr5JKJ3k4K3L5k
7469b7j7oK5Kk9p1J7N4om0qL0k0J0J9j1L6o3j6R8Mk5j4J4Lm8OK3l8K4N1j09K2J9mL0k6M1K8
$$ plain form
7600 -27 -57 -53 -88 -95 -123 -111 -86 -88 -105 -49 39 47 -18 -92 -78 -62 -25 -62 -69 -19 -36 -30 -34 -21 -46 -59 -48 -23 -23 -58 -79 14 8 -9 -39 -44 1 -91 -139 -52
7581 -52 3 -21 -65 -17 -51 -65 -92 -157 -60 10 26 -19 -80 -81 -80 -135 -116 -131 -125 -71 -88 -26 -68 -60 -35 -88 -126 -72 -57 -110 -81 -47 -52 -3 -75 -123 -123 -98
7563 -98 -94 -57 -61 -56 -67 -87 -104 -80 -89 -58 -58 -24 -31 -59 -61 -71 -27 -47 -76 -97 -79 -90 -165 -177 -131 -88 -108 -44 15 -29 -15 -67 -89 -70 -40 -64 -10 31 -45
7544 -45 -64 -11 -42 -39 -103 -92 -77 -84 -127 -114 -64 -1 -81 -80 -68 -2 1 -14 -47 -55 -62 -19 -10 -36 -90 -155 -175 -83 -104 -98 -58 -19 -34 -98 -80 -45 9 -26 -16
7526 -16 -37 -31 -67 -53 -135 -145 -94 -19 17 -26 -117 -66 -48 -59 -51 -60 -41 -73 -92 -69 -38 -85 -47 -71 -90 -74 -58 -28 -24 -9 -14 -39 -44 -98 -61 8 -4 -31
7507 -31 -60 9 -24 -90 -47 -100 -54 -9 -79 -166 -117 -87 -83 -72 -34 -73 -89 -109 -71 -94 -38 -104 -84 -12 -39 -5 -35 -105 -142 -49 -40 -27 -30 -52 -117 -109 -102 -9
7489 -9 -13 16 -27 -58 -107 -124 -76 -66 -14 -9 -23 -22 43 -21 -66 -55 -79 -78 -51 -68 -45 8 -8 -9 -21 -17 -26 -52 -35 -31 56 21 17 20 -75 -74 -72 -59 -83 -60 -25 -27
7469 -27 -44 -50 -25 -23 -52 -123 -106 -52 -58 -98 -106 -76 -96 -86 -67 -78 -42 -105 -121 -23 -19 -44 -58 -44 -41 -89 -83 -60 -98 -74 -23 -132 -110 -91 -95 -65 -91 -50 -22
7451b2L4n4n7k0K8j3k4O9K3k9k4k5K2P7j0jk7j6mRK7m1OM7L9k2j2l8n7L4l7P2l0K3K6m1J3
7433e5j3m4k8L1K3J0k1j8L4nmP9Lr8o4N6M3K8l2n6P2M0l0j7J3M9j4j9m7l8J02m7L1Mj7k9K9
7415d9M2L5ql5J0qK7Jm2O4n0o0J0Jj4LjN6m8j6l5Rj0K9kK0o0j9P4J5jj2KM5L9n4o4QKO0N6
7396B0kp2j2J9qJ3kJ2j0M3M0n1m8P5l1L3r0k6P1J0Lj1l1j9m6L0K4Nj8M0K1n2m2kK0m9J0J8
7378a15pj2nM1jOk0j2N7k0njNK9nN0j9q1J5N4K2l8n5K4Q9Mp5r8N7K2l8j9N3P5k1j4LO4J0l7
7359a8k4l1j7N5n6K4Qk1K5Jm8Qj2P4Lo9L6k5N4M7Lr2RM7o2JO9k9m5J8o0M4mK8Joml3N7L7L5
7339B8r2k7K4J3O0j4k5qp4J7L2J6R9k2K7p6kk3l6qQLJ3j5J6Nn8J9J2pRQm6l7L6O0J06l7J9
7321B3l3o9j5M5N0J8k9n2n5M7J3pJ7pK9k5l6Rm4N6K8Pmn6O5Om5m0k7J4Q7Kl1K5l5M8k6p3l5
$$ plain form
7451 -22 12 -42 -99 -119 -91 -104 -128 -59 -36 -65 -89 -114 -92 -15 -25 -26 -53 -69 -73 -64 -37 -78 -72 -25 14 -8 -20 -58 -115 -81 -118 -46 -76 -53 -27 -68 -55
7433 -55 -68 -112 -140 -109 -86 -76 -97 -115 -81 -86 -90 -11 -8 -106 -170 -114 -71 -43 -75 -131 -59 -19 -49 -66 -53 -4 -18 -37 -84 -122 -20 -67 -36 -32 -49 -78 -49
7415 -49 -7 28 20 -15 -5 -13 14 15 -27 37 -13 -73 -63 -62 -76 -73 -74 -18 -66 -82 -117 -108 -118 -89 -91 -71 -131 -150 -76 -61 -62 -74 -72 -27 12 -42 -106 -98 -96 -36 20
7396 20 18 -54 -66 -47 -55 -42 -44 -32 -42 1 41 -10 -58 17 -14 19 -71 -97 -26 -16 -13 -24 -55 -74 -120 -90 -66 -61 -79 -39 -18 -70 -112 -114 -94 -143 -133 -115
7378 -115 -122 -134 -139 -98 -99 -93 -113 -125 -68 -88 -93 -94 -89 -60 -65 -15 -34 -115 -100 -46 -24 -62 -117 -93 -4 0 -75 -173 -116 -94 -132 -151 -98 -23 -44 -58 -55 9 19 -18
7359 -18 -42 -73 -90 -35 -91 -67 -59 -80 -55 -54 -102 -94 -106 -32 -29 -98 -62 -87 -33 14 17 -75 -66 -19 -81 -80 -11 -40 -85 -67 -127 -83 -87 -59 -58 -64 -68 -101 -44 -7 28
7339 28 -64 -91 -67 -54 6 -8 -33 -41 -115 -98 -66 -50 49 27 54 -22 -24 -47 -83 -91 -83 -80 -67 -82 -66 -61 -119 -100 -88 -95 -86 -78 -124 -161 -125 -65 41 4 23
7321 23 -10 -79 -94 -49 1 19 -10 -62 -117 -70 -57 -64 -47 -54 -25 -50 -86 -77 -121 -65 -37 -30 -34 -90 -25 -19 -64 -104 -131 -117 -30 -28 -59 -34 -69 -21 -47 -120 -155
7302a55L7J1NL8jrK2qn3P9j7nK3J1K9q0j1j9k1P0J0O5n4n6K1J7jN2Oj4j8o9K6n6N0P5L9j8
7284B1J0q3K2Jl9Pj8PPoJ5%j0L7p5J3Q4o5OP9m1l9j9J2L9p1k8R2j4ql2j0n1MO9J6NL3k1M6
7265eML5p8k6J0l4K1L9o3O3lqJ7j9jm3L3L5j5l0L7k8k8O7J9n2o8N2O8q3o9oJ7M9Q2%nl0mJ1
7246c9jo1KK5Mr3k7M6J00NM0K5J2r1J6N3o7n8J8K6qj4qL5m9j5ML4jN7l6On9K5l1N3M9pq1M
7227a07L2J8Lj6K%K9j2j1lm6N2P8n9L5l8KR4no7r6J06L0r6k5N0P0j5n4K9k0K0k4oj2J8k7M9
7208b2J7k2M5l8m1o7K6M6j6j6O0N7m0m2j4J8j3J6j2qJ8o4j3N7j1j7MN1pMk9k9k9L3R7om0M3
7190dm8jpj6J4O2Lk1jnk9kK5L6j6Qpm8m4pK6K7L2j4k1J9M4j4pJl6L5n6M6n2M1Qk3K6m8m2L2
7170h4j3mM7l4j7p1N5k9P4K0k4L2LK7n0L0J2K0j2m7kQ2km1j2JN4o6q0M0JK3j3j0N3nrRk6K4
$$ plain form
7302 -155 -118 -107 -102 -64 -65 -74 -52 -60 -113 -34 -51 -56 -33 -22 7 -73 -84 -103 -124 -54 -44 21 -33 -89 -68 -51 -52 0 6 -8 -26 -95 -69 -125 -75 0 39 21
7284 21 31 -52 -30 -29 -68 -61 -79 -72 -65 -71 -56 -56 -66 -29 -104 -91 -7 -72 -66 13 -28 -67 -86 -74 -35 -106 -134 -42 -56 -64 -96 -106 -157 -153 -84 -68 -63 -30 -51 -5
7265 -5 -1 34 -44 -70 -60 -94 -73 -34 -97 -34 -37 -45 -28 -47 -48 -91 -58 -23 -38 -68 -31 -59 -87 -20 -1 -53 -121 -69 -1 -84 -153 -159 -142 -93 -11 -11 -16 -46 -50 -39
7246 -39 -40 -101 -99 -74 -70 -163 -190 -144 -44 -39 1 26 38 -53 -37 16 -51 -109 -91 -65 -73 -87 -95 -60 -109 -124 -120 -86 -87 -30 -66 -60 -119 -94 -125 -72 -23 -30 -111 -107
7227 -107 -75 -57 -54 -70 -68 -68 -39 -51 -62 -65 -111 -59 19 -40 -5 -43 -41 53 48 -19 -115 -9 21 -75 -100 -50 20 5 -49 -20 -40 -20 -44 -50 -62 -44 -71 -22
7208 -22 -5 -27 18 -20 -61 -128 -102 -56 -72 -88 -28 29 -11 -53 -67 -49 -62 -46 -58 -66 -48 -112 -125 -68 -79 -96 -92 -41 -48 -44 -73 -102 -131 -98 -1 -7 -47 -4
7190 -4 -52 -53 -60 -76 -62 0 3 -18 -19 -24 -53 -55 -30 6 -10 -2 -9 -57 -101 -108 -82 -55 -23 -37 -58 -39 5 -9 -16 -15 -51 -16 -72 -26 -78 -37 -29 -52 -26 -74 -116 -84
7170 -84 -97 -101 -54 -88 -105 -176 -121 -150 -76 -56 -80 -48 -45 -18 -68 -38 -26 -6 -18 -65 -67 15 13 -28 -40 -39 15 -51 -131 -91 -90 -67 -80 -90 -37 -42 -51 -42 -68 -44
7151d4k3m0RkP5Ll7J1jn1jN8Ol0j7QL5L1K0m5k8K3K3k0k3m4K1M6m1K8l0LJ4L4mjJRkmJ3l8
7131e5l1N6j5m9l7J4Q8k5o0L1OM1LPq4M6P7j6n6mK0pJ9k4k7L7o7QK6km3Rk8N1j4K6N3mk6K5
7112c1k1JP5j3L7k8L3p3J6L2k1p7lML6OO1l9pm2o1J6J9N5o6m6OQ2K4K0pn2M8mj0j2J0k7KO
7093e1L1j1p0O1j3m3k4oL9L5l3l3L4PJ3M7NrL0m5j8J8K1lj2Mk6mrJ6n9KMnR0J6m4m3M2N3j0
7074cl1j8K1n6jM7P6l4l8K0M1l3l5k9M6n9j1J3j1j9lN8k2oJ4J1k2M1j7N2M6p0n1k0kPK7l5
7055a06l4R8oj2K0k1k2J4L1Nj7k3j0j6O9l7K5OK5mm2K6Q4l8l7Jo1N0J1k0L5L2p1o3Qk3N5l9
7037a07K4j9J0K4P8l3k5L2kM8%Pm6o5K0j2M3NJ2N2l0j2Jn6j2k5M5m3M7M8j2j9K3p6m7L3K9
7020f0O6q2KP2m8n9J2%KK9k9MKm1j5L8P1M8n7l8J5K1j4M8p0M0qJ8p7M9jo3Q5Lk0L3j7k5K7
$$ plain form
7151 -44 -67 -107 -98 -100 -25 -22 -59 -48 -49 -100 -101 -43 -37 -67 -84 -76 -41 -10 10 -35 -63 -40 -17 -37 -60 -104 -83 -37 -78 -50 -80 -77 -63 -29 -33 -34 -33 -24 -26 -30 -17 -55
7131 -55 -86 -30 -45 -94 -131 -117 -29 -54 -114 -83 -77 -36 -33 -26 -110 -64 13 -3 -59 -63 -43 -50 -31 -55 -82 -45 -112 -104 -78 -80 -123 -114 -142 -91 -105 -79 -26 -30 -56 -31
7112 -31 -52 -51 24 11 48 20 53 -20 -4 28 7 -70 -73 -69 -33 -27 34 -5 -12 -54 -115 -99 -80 -25 -91 -137 -131 -49 -25 -5 -12 -64 -16 -20 -30 -42 -32 -59 -57 -51
7093 -51 -20 -31 -101 -40 -53 -96 -120 -126 -87 -52 -85 -118 -84 -77 -64 -17 -12 -21 9 -36 -54 -36 -15 -18 -30 -26 -52 -56 -65 -49 -108 -106 -102 -107 -17 -1 -45 -88 -46 7 -3
7074 -3 -34 -52 -31 -87 -88 -41 35 1 -37 -17 24 -9 -44 -73 -27 -86 -97 -84 -95 -114 -117 -59 -81 -87 -73 -62 -84 -43 -60 -8 38 -32 -83 -103 -105 -98 -71 -106
7055 -106 -140 -42 -48 -60 -40 -61 -83 -69 -38 -33 -50 -73 -83 -99 -30 -67 -42 -36 -11 -15 -57 -31 53 15 -22 -21 -82 -32 -21 -41 -6 26 -45 -108 -100 -123 -68 -107
7037 -107 -83 -102 -92 -68 10 -23 -48 -16 -18 30 30 37 -9 -74 -54 -66 -23 -18 -6 46 16 4 5 -51 -63 -88 -43 -86 -39 9 -3 -22 1 -75 -122 -89 -60
7020 -60 6 -76 -74 -2 -50 -109 -97 -97 -95 -66 -95 -91 -89 -130 -145 -107 -36 12 -45 -83 -68 -47 -61 -13 -83 -43 -51 -33 -110 -61 -62 -125 -40 -37 -57 -24 -41 -66 -39
7001c9N8m3L9m2k8l2NL0M8k6M7Nk8r7l4j4M5P7M0Jo1L2m0J9%r0J5K5KP0Jl2k2N0l5l6PQ8j1
6982f%l7kj2M5o0Pqm4N5J6k5Qkm1M7Mk1J2L6k7J0J9m2k8j9M9P5k4j0j4l2J3l7k8M7J2R6j3
6964A9j9k0j6l5jM5J4L4o3n1L6l1O5m8n6Q4K0NKp6Q8m5K1n1K1NoL3p8j1J06J8n3oK2n0K6R
6946d3jJ1M4%o9M5ok8%j0pl3n4L1N2L2J9l0Q4p1k6M9l0K7o0j2rM0l1LL9l0j7o4N3J3l6M0K0
6927f5N2m0n6K2j7M6L7rPL0m3m9K4j8rO0j4J9J2L3m1m8J5O6K4o5N1Nj8K1p9j8m8Rn9k6N9J19
6909a1k6k2j9ppK1k0k1L6O3j8k9k3L7L2L8j7ro1l8J9Lk1N7K0LJ7j1l9L7o6k0N8M9n4KQN0P
6890A8k6m6nlrK4j7J7N1Ol6m8M1L6o3lj7K7l0J5L0j9POk5o8N0k4O6%n0J0N0Ok0jkMj0N2j1
6871a7K0o0m0O3j0M7n4k0L2K1n4lj7M2m7jk2M5J8N2J3p6k0J6Jo4n4K1J02M4n7K0N2j3Nj4p5
$$ plain form
7001 -39 19 -24 15 -27 -55 -87 -82 -52 -4 -30 17 22 -6 -103 -137 -151 -106 -29 11 12 -49 -17 -57 -38 -38 -128 -113 -88 -86 -16 -15 -47 -69 -19 -54 -90 -83 5 -6
6982 -6 -6 -43 -45 -57 -12 -72 -65 -73 -117 -62 -46 -71 -63 -65 -106 -59 -55 -76 -64 -28 -55 -45 -26 -68 -96 -115 -66 9 -15 -25 -39 -71 -58 -95 -123 -76 -64 32 19
6964 19 0 -20 -36 -71 -72 -27 -13 21 -42 -93 -57 -88 -23 -71 -127 -43 -23 -18 -16 -92 -4 -49 -28 -79 -58 -53 -59 -26 -104 -115 -9 9 -44 -50 -28 -78 -52 -43
6946 -43 -44 -33 11 11 -58 -13 -19 -47 -47 -57 -64 -97 -151 -120 -68 -36 -17 -47 37 -34 -60 -11 -41 -14 -74 -86 -95 -55 -86 -83 -44 -74 -91 -155 -102 -89 -125 -85 -65
6927 -65 -13 -53 -109 -87 -104 -58 -21 -30 -23 7 -36 -85 -61 -79 -88 -28 -42 -23 -11 22 -19 -67 -52 14 38 -27 24 29 11 32 -47 -65 -113 -104 -163 -189 -130 -11
6909 -11 -37 -59 -78 -85 -92 -71 -91 -112 -76 -13 -31 -60 -83 -46 -14 24 7 -2 -63 -101 -82 -79 -100 -43 -23 -20 -3 -14 -53 -16 -82 -102 -44 5 -49 -47 -39 11 18
6890 18 -8 -54 -59 -62 -71 -47 -64 -47 4 10 -26 -74 -33 3 -60 -63 -80 -53 -83 -68 -38 -57 -50 -44 -69 -137 -87 -111 -45 -45 -95 -85 -35 -29 -49 -50 -52 -48 -58 -6 -17
6871 -17 3 -57 -97 -34 -44 3 -51 -71 -39 -18 -72 -75 -92 -50 -97 -98 -120 -75 -57 -5 8 -68 -88 -72 -71 -135 -189 -168 -66 -22 -79 -59 -7 -20 -15 -29 -104
6853a04J8N6j8m5K3L7qj2K6k9m3p1J22k5J9j0j4M1j2K3L4Rn1Q8m4j06M3O0J4o2J1j4k6J6N8
6837Do0pRqk8M2LK1m3rK8O5o6Pkl7J0m7K4L0%K5O0m5n0Q1NKk7m6J7k1k1J8n2M9k0qk1O8R8
6817D8j9n1%l4jM5m5oQn0M3OL1l1n6mqj2O7Qk3M6q6rO2k0N5J1j2k2pKl8m1OO9k5KM0K8N6k0
6797A3k3M6m9m2mL7p6L7mj6J6lN1%o4l0K6L0k2L6m5K7K4Ll7J7l3ol0L5J9j2oJ8M0ok4jK7o9
6778a00lQ1kk8L1l3mM9kp1O1k4j9O2j0OJLk1q5N0M1J4Ln7l9j7K8L3K3j6l4ML1j0lO2L8j8p4
6759d9Rk2K5K1p4K0M6n3J4K8l1Q1k2Mp6M4L9Pm5kl6k8L1J00k0J2k0n0j8M4L7n2l3m6K9P4R
6741cn4kjK6L6n2n0O9j7p2P9m2m3M9N4rk3r5O0J1N8P3J1n5m2J1r8L8KJ0J2O7l8J4L9p8j5J7
6723e3m9OMJ0M9l9j9M0l6M%K3lM0L1L7K7r1n1k0J8J6%%NJ7N1lPk8k1j2j0l5J5%Qj5l4jJ1q5
$$ plain form
6853 -104 -86 -30 -48 -93 -70 -33 -41 -53 -27 -56 -99 -170 -48 -73 -54 -64 -78 -37 -49 -26 8 17 -34 54 10 -96 -53 7 21 -41 -30 -44 -70 -54 4
6837 4 -56 -63 -54 -62 -90 -48 -45 -24 -67 -76 -48 17 -49 -42 -44 -81 -71 -118 -94 -64 -64 -39 21 -24 -74 7 12 14 -13 -59 -42 -63 -84 -66 -118 -69 -89 -97 -118 -50 48
6817 48 29 -22 -22 -56 -57 -12 -57 -63 -55 -105 -62 -56 -25 -56 -112 -116 -124 -136 -69 -61 -84 -38 -124 -133 -71 -91 -36 -25 -37 -59 -66 -64 -102 -143 -137 -68 -93 -91 -51 -23 33 13
6797 13 -10 36 -13 -55 -59 -22 -98 -61 -65 -81 -65 -68 -17 -17 -81 -111 -85 -55 -77 -41 -86 -59 -35 -32 -69 -52 -85 -91 -121 -86 -67 -79 -85 -67 -27 -33 -57 -58 -31 -100
6778 -100 -103 -22 -24 -52 -21 -54 -58 -9 -11 -82 -21 -45 -64 -2 -12 -6 -5 -2 -23 -108 -58 -17 -3 0 -57 -96 -113 -85 -52 -29 -45 -79 -75 -44 -54 -57 5 43 25 -49
6759 -49 -40 -62 -37 -16 -90 -70 -24 -77 -63 -35 -66 15 -7 -3 -79 -35 4 11 -34 -36 -72 -100 -69 31 11 23 3 -47 -65 -21 16 -36 -69 -115 -86 -12 -3
6741 -3 -57 -59 -60 -34 2 -50 -100 -31 -48 -120 -41 -83 -126 -77 -23 -32 -55 -150 -90 -79 -21 52 63 8 -34 -23 -121 -83 -81 -71 -59 8 -30 -16 23 -55 -70 -53
6723 -53 -102 -96 -92 -82 -33 -72 -91 -51 -87 -83 -83 -60 -63 -23 8 45 72 -19 -70 -90 -72 -56 -56 -56 -51 -34 17 14 21 -7 -28 -40 -50 -85 -70 -70 -62 -77 -111 -112 -101 -186
6703a86J9P6P7k1j4M9nj6k2j8j7J2PJ8j7n3M0Qj6k1L9njj4k6L2Qm1J4L5m0K4QJ6LJ1m2L0L8
6684a1jk5m3m5M7O8l3j6k1K2K4n2O0r0k0M7L0N4j4k4j7K6k4j5J9J7%L9m1J2L2l6q1N8K8%l5
6667f1m9O6K9l4j4N7j0K8r5n9P6N5n1q7P5K9m%J5QJ6%K5q4k9N6K1q7J6k1P1mkK7m4j4j4mJ0
6648h7J8M2j2J8l0k1K8M3rn4l2j2K8j3l3N0Q4P%m3n1kMK6kP2jm9n3m7R3l6L0l1j4P3kkn2K0
6629e2K5Op8K2J9k3oj2M3k5J8J5j5n0JN4L8k9k7N1l2m8kR6j2nL8l4J8M7l7j02J4M9k0M3Pm8
6611e3J1J6j0QQ8o0p7M5J01l0k8j4j4k5k9Nm5k7j5J6M6Lk2l6J4L4K1J3P5K4m1J3l3l7K0K1
6594b2pl9n9L0J8Q1j3k7Rj3M3j6Pj6j4N2m2m8L2K3n8jJ5N2K9J3n5k7m7j7Q8J9N5p8pJ1JL0
6576Bo3nJ6J1L1j8OQK9r6j5N7n5Q2N9m8j2pm6n0K4J3J3L9OM2j4p5J7NK1m0j11Q9R3j1o6j5
$$ plain form
6703 -186 -167 -91 -14 -35 -49 0 -5 -21 -43 -61 -78 -66 -59 -41 -58 -111 -71 -63 -79 -100 -61 -66 -67 -81 -107 -75 -67 -108 -94 -59 -99 -75 -67 -51 -48 -37 -79 -49 -11
6684 -11 -12 -37 -80 -125 -78 -10 -43 -59 -80 -58 -34 -86 -26 -116 -136 -89 -59 -5 -19 -43 -60 -34 -58 -73 -54 -37 -37 2 -39 -27 5 -31 -112 -54 -26 -26 -61
6667 -61 -110 -44 -15 -49 -63 -6 -16 12 -83 -142 -66 -11 -62 -149 -74 -45 -49 -49 -34 -26 -10 -10 15 -69 -98 -42 -21 -108 -92 -113 -42 -46 -48 -21 -65 -79 -93 -97 -87
6648 -87 -69 -27 -39 -21 -51 -72 -44 -1 -10 -64 -96 -108 -80 -93 -126 -76 8 15 15 -28 -79 -81 -77 -51 -53 19 18 -31 -84 -131 -38 -74 -44 -75 -89 -16 -18 -20 -72 -52
6629 -52 -27 -21 -99 -77 -58 -81 -87 -99 -56 -81 -63 -48 -63 -113 -112 -58 -20 -49 -76 -25 -57 -105 -107 -11 -23 -28 10 -24 -6 41 4 -98 -84 -35 -55 -12 -5 -53
6611 -53 -42 -26 -36 -28 60 0 -77 -32 69 39 11 -3 -17 -42 -71 -66 -111 -138 -153 -137 -91 -88 -110 -146 -132 -98 -77 -64 11 35 -6 7 -26 -63 -43 -22
6594 -22 -29 -68 -127 -97 -79 2 -11 -38 -29 -42 1 -15 -8 -24 -38 14 -28 -76 -44 -21 -79 -80 -65 -13 16 29 -26 -53 -100 -117 -29 -10 45 -33 -40 -29 -28 2
6576 2 -61 -66 -50 -39 -8 -26 -20 -12 17 -79 -94 -37 -92 -10 49 1 -11 -18 -64 -114 -90 -77 -64 -25 -19 23 9 -66 -49 -44 -23 -63 -174 -85 8 -3 -69 -84
6558h4K8kRQlJ4N4q5QK9j5jk3OJ2K3J2j20JP5L2Rm8L1o3LLN9K5k9L2j6J2m9J4n2J9j8J9oM2
6538c5n2J1N3P3o2o1j1M2K9K6L7l2p9K6lkK9l9m5nk3N9L4l2M3jo9L3j3j8P1l2n2P1m9K7L6
6520a5l3k2M3m0K2M2m2pk3J7k0JJ9j0k8K2K8lr5N1J35p6o1N7l2Pj5K7qN8Mn1K7l2p0KMJ3K4
6502h0k3MJ7MkO7p5O3M1q1M5k4J2jKp4M3N8j2l0n9K5J1O8j4m8L9kl9K8M1Ln4m0L6mN0j4L2
6483A3m8p8K6L4K0o9M6K3k7lL5j8k9%M8J6k8K2m8MK2l7j3k8L5LOK4K9j1Pk6lK1Qm2K7RqMj14
6464a48J5Q4N1L9l8m4k0K7M7n4o1J2N4L9Rk6l3L2jmm3rO8o1k6jjM7L2k7K0l3Lo2K4O9o7j2
6446i9j6O2no4N7mkO7J0Rn3k8N5J9J2k5n1MJ8Jk3m1O4K9m7K0m9l8K6L9k3J4M8p2l0M8K1rJ6
6427d0M7l1q4j5M7j6m0M9L8N0n3J0K4o1O2l8O1rj09L1Q3Rp8l1l4N1J0N4l7m8JO9l1K3m4n0
$$ plain form
6558 -84 -56 -58 -49 -41 -44 -30 24 -61 -53 -24 -39 -40 -63 -57 -45 -22 -10 -130 -129 -54 -22 -13 -61 -30 -93 -90 -87 -28 -3 -32 0 -16 -4 -53 -39 -91 -72 -90 -71 -77 -35
6538 -35 -87 -76 -23 50 -12 -73 -84 -42 -13 13 50 18 -61 -35 -38 -40 -11 -50 -95 -100 -123 -64 -30 -62 -19 -20 -89 -56 -69 -87 -16 -48 -100 -29 -78 -51 -15
6520 -15 -48 -70 -27 -67 -45 -3 -45 -52 -75 -58 -78 -77 -58 -68 -96 -74 -46 -49 -144 -93 42 -34 -95 -38 -70 -63 -78 -51 -59 -1 3 -48 -21 -53 -123 -121 -117 -104 -80
6502 -80 -103 -99 -82 -78 -80 -13 -88 -25 16 -65 -20 -44 -32 -33 -31 -105 -62 -4 -16 -46 -105 -80 -69 -1 -15 -63 -24 -26 -65 -37 4 7 -47 -87 -51 -55 -5 -19 13
6483 13 -35 -113 -87 -53 -33 -102 -56 -33 -60 -63 -28 -46 -75 -75 -27 -11 -39 -17 -65 -61 -39 -76 -89 -117 -82 -79 -73 -49 -20 -31 -24 -50 -53 -32 -24 -66 -39 -30 -38 -34 -148
6464 -148 -133 -49 2 41 3 -41 -61 -34 13 -41 -102 -90 -36 3 12 -14 -47 -15 -16 -20 -63 -72 -4 -65 -91 -92 -93 -46 -14 -41 -21 -54 -51 -113 -89 -20 -87 -99
6446 -99 -115 -53 -58 -122 -65 -69 -71 -4 6 15 -38 -66 -11 8 20 -5 -56 -52 -34 -33 -56 -97 -33 -4 -51 -31 -80 -118 -92 -53 -76 -62 -14 -86 -116 -68 -47 -56 -40
6427 -40 7 -24 -108 -123 -76 -92 -132 -83 -45 5 -48 -38 -14 -75 -13 -51 10 1 -108 -77 6 15 -63 -94 -128 -77 -67 -13 -50 -98 -97 -28 -59 -36 -80 -130
6410a30J6L6K0K4j9K1K3M6m7j2L1m8jPo0k9j4M6N1jp5P3Pn2l3L8O5q4K4J6lM2kl0J9%k4j2
6392g1M3JKm7ML2Nk7Q7qPKq1J1m7M2j3l8K0Q8m5K4PK3N1l9o5k2M4k0q0P5Rk8K7l3M1n6l8%
6373a13Q5rm2j4K0NO8m2%J0mj2n4N1j6K9pol5J0RQ8l1k4m1j9RoJ8L4j9L2k2N7k8Nl9L7j4o4
6354i4pP0kk4j5J0J1j8K0OPl2KK5M4j5k6L3Kl4J1J1m0m2K6K4l3M5Lk1N0j2k8L7mnj8J9J6l6
6334c4o3k4L2l1m9N6J1k8KN6%mJ6L1k5Ok4O1%m4%ol4JrQ3L9J8k5l2n4K3P0Rj5k9j09KJ23n7
6315e7j7J3Rj1oJ9Pj7k2L3N6l7J2k5l4K6J8j3m4lkM5K0Nm3J4OK0K4m0J5j4m4K3m9k2O2j7Q1
6297iK6j04k0L8L6n5j5N1K2k7N7q8oR1k9l1J1p2%j5K1J8J8rQJ8Mk2j7MLmO0K6o4k2N2J3K2
6278a0M9j7n1lj2K3K4n0J2K6k5N2Qp4m4Oj0K4J0l8M7KL1jo8%JJ7K7n3O3o3mL0k7M6j6J7j6
$$ plain form
6410 -130 -114 -78 -58 -34 -53 -32 -9 37 -10 -22 9 -39 -40 -33 -93 -122 -136 -90 -39 -40 -115 -42 -35 -87 -120 -82 -17 -101 -77 -61 -64 -22 -24 -54 -35 -35 -59 -71
6392 -71 -28 -27 -25 -72 -68 -36 -31 -58 29 21 28 30 -51 -40 -87 -45 -58 -96 -76 12 -33 -9 -2 21 72 33 -32 -54 -10 -30 -110 -35 -26 -54 -27 -60 -19 -75 -113 -113
6373 -113 -28 -37 -79 -93 -73 -68 0 -42 -42 -32 -36 -48 -102 -51 -67 -38 -45 -51 -86 -76 -67 21 -10 -34 -75 -94 -85 -91 -73 -39 -58 -26 -48 9 -19 -14 -53 -16 -30 -94
6354 -94 -101 -31 -33 -57 -72 -62 -51 -69 -49 -43 -36 -68 -66 -41 3 -12 -38 -5 -3 -37 -26 -15 -55 -97 -71 -47 -80 -35 -32 -53 -3 -15 -43 -6 -10 -15 -33 -14 2 -34
6334 -34 -97 -121 -89 -120 -169 -113 -102 -130 -128 -72 -72 -76 -60 -29 -54 -48 -72 -11 -11 -55 -55 -61 -95 -94 -103 -20 19 37 12 -20 -74 -51 19 28 13 -16 -125 -123 0 -57
6315 -57 -74 -61 -52 -63 -69 -50 -43 -60 -82 -49 7 -30 -18 -43 -77 -51 -33 -46 -90 -93 -95 -50 -30 -25 -68 -54 -48 -28 -4 -44 -29 -43 -87 -64 -113 -135 -73 -90 -9
6297 -9 17 -87 -107 -69 -33 -88 -103 -52 -30 -57 0 -88 -94 -3 -32 -63 -52 -124 -124 -139 -118 -100 -82 -91 -83 -65 -61 -83 -100 -96 -93 -97 -37 -11 -75 -97 -45 -32 -10
6278 -10 39 22 -29 -32 -44 -21 3 -47 -35 -9 -34 18 26 -48 -92 -86 -96 -72 -62 -100 -53 -51 -20 -21 -89 -89 -88 -71 -44 -97 -34 -97 -101 -71 -98 -52 -68 -51 -67
6260f7J9O0k2o0J8k0j0j4j2J1Pjn2L9K0pN9j7J6j0j1J3r5R8m9m1N0j0L0k0jnP0KJ1j4k9Q0
6241C6q6n4M9P7oK0n6%K1pK2r2l6OK7M4rl3N7Nj7j1n4K4PK3QJ8M8m1n1LJ8o6m7RM7O3mk7M5
6222b0n6J01j7o8p2J1O7%j9j0nJ0K8j3j7pn1M5oO2O2r6jK6o7JPO1O6l5K6K5n1k7J5p1l0L9
6204h7QJ2K8Jk7L0N5M1k1k7j4j3m7NK3m5K0N1K5o1qpK9l4j2l1M3Nj2N7rJl7J8o3KkK3N9k4
6185d5m4K9j1l0PK9jL3M1k2o8L1L3Qm8m0L0M6n6N1N0L4n7r6p0L8R3n0k6L1K8O2L4J7o5K0l3
6167a7m4R5M4j04m0rL0J0K5K3p1ML6Lkj5n7l4N9L4j6L0o0p0P2K6M8n6l3P1n1J1mm2qJ7MJ6
6149g5M0l2K7qj9j3R9m0n1K7P5ol4J0m8J7L3p6J7Lj8l9j6M6M1OJ0K7j0m4K3mk5N4l9j8J7Q
6131c5NPJ9Lm7n5K6m1o6L4M7JN8L6l8J0MKq2j4l6M9k4J2P9M9k4p6m0m1P5P1J2m4J3J5rj1j8
$$ plain form
6260 -67 -48 12 -10 -70 -52 -72 -82 -96 -108 -97 -90 -91 -143 -104 -84 -91 -32 -49 -33 -43 -54 -41 -136 -38 -87 -128 -78 -88 -58 -78 -79 -84 -14 -12 -1 -15 -44 36
6241 36 -50 -104 -55 22 16 36 -20 -20 1 -6 16 -76 -112 -106 -79 -35 -44 -77 -20 -15 -32 -43 -97 -73 -66 -43 -35 -17 31 -10 -61 -58 -40 -106 -153 -144 -97 -34 -38 -65 -20
6222 -20 -76 25 8 -60 -132 -121 -54 -54 -73 -83 -88 -78 -50 -63 -80 -87 -138 -93 -99 -37 25 -71 -72 -46 -113 -112 -105 -44 22 -13 13 38 -13 -40 -25 -96 -126 -87
6204 -87 -79 -67 -39 -38 -65 -35 20 61 40 13 -1 -14 -61 -56 -33 -78 -58 -7 18 -43 -51 -58 -29 -63 -75 -106 -63 -58 -70 -13 -22 -21 -58 -40 -103 -101 -103 -80 -21 -45
6185 -45 -89 -60 -71 -101 -94 -65 -66 -33 8 -14 -82 -51 -18 -10 -58 -98 -68 -22 -78 -27 23 57 0 -96 -166 -128 -35 -85 -111 -80 -52 10 44 61 -4 16 -17
6167 -17 -61 34 78 -26 -66 -75 -45 -35 -10 13 -58 -54 -18 -15 -17 -32 -89 -123 -64 -30 -46 -16 -76 -146 -74 -48 0 -56 -89 -18 -69 -58 -62 -104 -112 -95 -91 -75
6149 -75 -35 -67 -40 -48 -67 -80 19 -21 -72 -45 30 24 -10 0 -48 -31 2 -74 -57 -54 -72 -111 -127 -81 -40 -34 -24 3 -7 -51 -28 -32 -57 -3 -42 -60 -43 -35
6131 -35 -30 -23 -4 -1 -48 -103 -77 -118 -184 -150 -103 -102 -44 -8 -46 -36 -32 -30 -112 -126 -162 -113 -137 -125 -46 3 -21 -97 -137 -178 -103 -32 -20 -64 -51 -36 -45 -56 -74
6112g4Q0kp2K9j1Mj0K5n5J7Q3Q9m9j15j0JL7M5o1l1J0j1K3L7l3K1n3m1J2O6J5l1M9o7K4j6
6095g5RK5J8L2o1m0N9p5oM0N5qp1L8k2Pk8M2j6o1K8O1Oj3kokL8l6m8m7j6K7J3K1J0M4l8on
6076a09N6J0Oj7j1n7L7M0Mk8o0O8k4l0O2M1J%l5j2j5K0m3J8P1J7J0m6N7om4n0j7K8N1ko3K4
6058d8j2J8%k0nK3k5n5N8kj4qJ0%O9J5p5PL9K4r7nP4j1k5k6pM0K7j4l0JJ5Q6M0j06K7Ql2j6
6039e2j0l1M1J1qKk9L2Nj8j4l8j1kK3Q9K6p4rmlM8l5k8J6LM6k1j3j7K4p8J4L0k5pM9M5Rl4
6020d8N7L2n6Jm3Lj5%pl4K7L0K4J7m0K5QJ5J2p9J3K7p2M3pj8P2Jl0oK3J6l7Lk8j1RJ9mL6p9
6000a01M0P2Qn5J2J4p2K8n0l0N2J3Rj0J9%k3l1N7K9L5m5p0K1J8J9Rk1p2PN3K8L0J0o9k5J5
5983g6k6M2j0Q7l8l6J1m4J8O1o8q3Q3O8k6r1O2L2q8J8K9j1K9K7rj9k6M0m1O1k7j0j7oM8oj7
$$ plain form
6112 -74 6 4 -68 -39 -50 -46 -56 -31 -86 -69 14 103 54 -61 -71 -70 -33 12 -49 -80 -70 -81 -58 -21 -54 -33 -86 -127 -115 -49 -34 -65 -16 -83 -59 -75
6095 -75 -66 -41 -23 9 -52 -92 -33 -108 -114 -74 -19 -27 -98 -60 -82 -75 -103 -61 -77 -138 -110 -49 -43 -56 -58 -64 -66 -28 -64 -112 -159 -175 -148 -135 -114 -104 -60 -98 -104 -109
6076 -109 -53 -43 -37 -54 -65 -122 -85 -45 -41 -69 -129 -61 -85 -115 -53 -12 -11 -11 -46 -58 -73 -53 -96 -78 -7 10 20 -26 31 25 -19 -69 -86 -58 -7 -9 -72 -48
6058 -48 -60 -42 -42 -62 -67 -44 -69 -124 -66 -68 -82 -90 -80 -80 -11 4 -71 -64 -25 -1 -98 -103 -29 -40 -65 -91 -98 -58 -31 -45 -75 -74 -59 27 67 -39 -12 -4 -36 -52
6039 -52 -62 -93 -52 -41 -49 -47 -76 -44 -39 -57 -71 -109 -120 -122 -99 -10 16 -58 -67 -71 -74 -26 -61 -89 -73 -70 -24 -45 -58 -75 -51 -129 -115 -85 -110 -117 -68 -23 -14 -48
6020 -48 9 41 -15 -14 -57 -54 -69 -69 -76 -110 -83 -53 -29 -12 -52 -27 -19 -4 8 -71 -58 -31 -103 -60 -67 -85 -13 -12 -42 -48 -25 -9 -46 -43 -71 -82 -73 -54 -58 -22 -101
6000 -101 -61 11 19 -36 -24 -10 -82 -54 -104 -134 -82 -69 -60 -70 -51 -51 -74 -105 -48 -19 16 -29 -99 -78 -60 -41 -32 -53 -125 -118 -65 -37 -7 3 -66 -91 -76
5983 -76 -102 -60 -70 17 -21 -57 -46 -90 -72 -11 -79 -162 -79 -11 -37 -128 -66 -34 -122 -104 -75 -86 -57 -30 -39 -58 -84 -44 -85 -24 -51 -61 -78 -84 -36 -42 -59
5965e9k9J1RlmL9N4J4l4Jl9nMOJ1L5o1l5pj6L2J01J6p9L0l5J1NK5m0OL3m4NK5k8Ln3J0J1J9
5945e5Jk0L%O4J4n0m7P4l5m7L8rK1J8ol5o9N7K0J8mj9m9Q4K8j0K3m2j07j8L7J2J2J5o3rK7
5927a28m1J05K7J6j8q1J9M4j4o8J8MJ9J8LK0j1lL6l3O3n4M5m1m5P0pm6L1j6k1LpM8K1M0L9
5910E5Nm6n1K2j2j9jk4N9lJ0L1j0j7K0p9j3nM8j0l7L0N5k1jL0o2m4K4M9M8j6l2P5l7o4n9L7
5891f5rj6L6L2qMOk8j9o0K5M6J7r8l3Q5O8L5k7Jn4j1LK1qnO3m9q1M1N9l5n8Q1k0l2L0n8QP2
5872d1KrJ3k3K3J9n7K6l7m9q1M0O1L2nKJ4k7K3m0k3P3J01Jr4M8nj4j05Q6J6n5j7NjR0kl7K7
5854b0L2m0k2L2lL2K4p7J0L2n0l2n0Q0K3n5M2J0k4m3k1K2k2K2K5J7K6k5P5k1l2l0Rl6q0jQ1
5836i0M5nJ6j5J1jj2k9J7R3Ml6o8o2mQ3N1k2ml2rPRk4pJ4l5PKK8j9M4L7k7j4L2p3MM2P4k9
$$ plain form
5965 -59 -88 -77 -68 -71 -75 -36 18 32 -2 -1 -40 -45 -41 -35 -24 11 -50 -85 -92 -108 -76 25 41 -38 -8 -43 -32 -27 -2 -42 -36 -3 -47 -42 -17 -45 -42 -95 -85 -74 -55
5945 -55 -54 -74 -71 -71 -7 7 -43 -90 -16 -51 -98 -60 -69 -48 -30 -36 -71 -140 -83 -63 -45 -49 -68 -117 -33 -5 -15 8 -34 -141 -159 -122 -110 -98 -83 -146 -155 -128
5927 -128 -169 -64 -37 -21 -39 -120 -101 -57 -71 -139 -121 -117 -98 -80 -77 -57 -68 -71 -35 -68 -5 -59 -14 -55 -100 -30 -37 -83 -52 -68 -89 -86 -93 -45 -24 16 55
5910 55 60 14 -37 -15 -27 -46 -47 -71 -12 -15 -5 26 16 -1 19 -60 -73 -78 -30 -40 -77 -47 8 -13 -14 16 -46 -90 -66 -17 31 15 -17 58 21 -43 -102 -65
5891 -65 -74 -90 -54 -22 -30 -26 -20 -48 -67 -127 -102 -56 -39 -137 -170 -85 -17 18 -9 -8 -62 -73 -70 -49 -57 -62 1 -48 -129 -88 -29 -64 -122 -41 -61 -93 -63 -121 -113 -41
5872 -41 -39 -48 -35 -58 -35 -16 -73 -47 -84 -133 -214 -174 -113 -81 -86 -84 -70 -97 -74 -114 -137 -64 37 38 -56 -8 -13 -27 -132 -46 -30 -85 -102 -97 -98 -8 -10 -47 -20
5854 -20 12 -28 -50 -18 -21 11 35 -42 -32 0 -50 -82 -132 -52 -29 -84 -42 -32 -56 -99 -120 -98 -120 -98 -73 -56 -30 -55 20 -1 -33 -63 -54 -90 -170 -171 -90
5836 -90 -45 -50 -34 -49 -38 -39 -51 -80 -63 30 34 -2 -70 -132 -136 -53 -2 -24 -28 -60 -69 -62 -53 -77 -84 -70 -105 -98 -96 -68 -87 -43 -6 -33 -47 -15 -88 -84 -42 32 3
5817Crl0p2j3N0nM8K5j5m9k1NmK2L6k3J2%J9o5k3K7N9l2k2O1kNN1Lp0qL1Qk9q9N1L6Lm4KK9
5797c9q8K5rk0K0J2l0R5J2moLkp2pQ8L3n%r9j5K7J4N2J3o6J0J5%k0nP0k7rK3o1p4O5M9%Qp
5777c1l1m7l0RQ2M8k5l3K2J7qJ5kJ9l8m5J4J8JK1k1pj7J7J5rJ4M3J4j02M0N6l9K8J4m3Ko7
5758h6LO5m7j6M2k5M1N3l6nk5%K6L0j2k1k8l1L5M1l0k2L9Lk6ko2K2K4L0%j2qM7Ok1PJ9j8j5
5739a5q9qL6L8m5J8Qj0K5KK6nrl8j0N8m5k0L1L8l4k6N0jl6J2rooj5N5j9o5L1k7N0K6QLlMO
5719a6J3j1o0On8L8M3NJ7K4L5m7k0M8l2m0k1j8P6L2m3MK7j9J1j6nj1NL7k1Po9K0ql1K3l9k1
5701a35N8L1K2kj8J9J0l4L0K5n8k8nJ3L4RJ4J5kp9j0K3K6K4l5j4N1Km9n3K1K1o4J8J6Q4K3
5683Cn4k4j1K6M7l0k9lJ1J9o5K2P1k1L4L1m2l1MQP3k8q7j1k7oQ6K7rn7L6L6l2k3m0KPJ3J6
$$ plain form
5817 3 -6 -36 -108 -121 -71 -76 -28 -3 -18 -67 -88 -83 -87 -65 -29 -52 -40 -40 -21 -86 -109 -82 -23 -55 -77 -16 -18 -13 38 41 -29 -37 -6 2 -27 -116 -65 -29 -26 -70 -68 -39
5797 -39 -127 -102 -111 -131 -111 -99 -129 -34 -22 -26 -32 -29 -31 -103 -110 -22 11 6 6 -93 -108 -81 -67 -15 -2 -68 -58 -43 -43 -63 -68 2 -25 -34 -11 -72 -146 -81 -32 -32 -24 -31
5777 -31 -62 -109 -139 -130 -48 0 -25 -58 -36 -19 -27 -12 -14 5 -33 -78 -64 -46 -45 -24 -45 -52 -69 -52 -37 -46 -32 11 25 -77 -37 19 -20 8 22 -21 -19 -86
5758 -86 -83 -18 -65 -81 -39 -64 -23 30 -6 -11 -36 -36 -10 20 8 -13 -41 -72 -37 4 -26 -48 -9 -6 -32 -34 -96 -74 -50 -20 -20 -32 -40 7 13 -8 -1 18 0 -15
5739 -15 -104 -112 -76 -38 -83 -65 -57 -67 -42 -40 -14 -19 -28 -66 -76 -18 -63 -83 -52 -14 -48 -74 -24 -25 -61 -49 -58 -64 -70 -85 -30 -49 -114 -83 -110 -60 -34 -26 -23 -26 -22 -16
5719 -16 -3 -14 -74 -68 -126 -88 -45 -40 -23 1 36 -11 -31 17 -15 -55 -76 -94 -18 14 -29 -25 2 -17 -6 -22 -27 -38 -33 4 -17 -10 -79 -59 -67 -98 -75 -114 -135
5701 -135 -77 -46 -24 -26 -44 -25 -15 -49 -19 6 -52 -80 -85 -72 -38 -29 -15 0 -2 -81 -91 -68 -42 -18 -53 -67 -16 -14 -63 -116 -95 -74 -138 -120 -104 -20 3
5683 3 -51 -75 -86 -60 -13 -43 -72 -75 -64 -45 -110 -88 -17 -38 -4 27 -15 -46 -42 -34 39 11 -76 -87 -114 -120 -34 -7 -16 -73 -37 -1 -33 -56 -96 -94 -87 -74 -58
5664e8M0K7l5l4O1n4l6M9k0M7j7L0M5o9p1Q5l9n2JjJ17o2l3L3m8J6P9m2k3oK3J3K8oo3J7O4
5647Fr4J5N7Rqk1Kl1p2N4J6kJ5j1q4NQ9J8r0K1M3k2kM2j2k1L1pK3N0p6l1N7L3j2o5J8N0lk8
5628c8n6N3J5k0J9O8l1l5k6MJ5n0J3K6k2K0L0J2o0l0K5j4O2RK7qLo0J8Mj5Jp9LM4kJ6M9m9
5609e9j7N0j1m2J3L7J7m0l0N1m2j6N9M1L3m7l0pj9%K2K9m5o6L4n2N4P2l3J5Rk8j2o4M7k8j5
5592a20N8K5k2j4PnRJ0L2Mk6k6K1M1q4lJ8J02j6j4l1m9J5m3n3O1rkJ3M1Pl0LJ7k2k4J3M6J8
5573c2rk6Qm3m0O1j5k1j5M5rM3J0m6K1P3k2k5K2l8%N0K7q2m3JK9j4L6qK5K2k8NoO2p1l2Rj7
5554i3j3N0M4nl9M9j5LMl9j2Jk8L1PJ4K2n7k0K3lOm7mK6K3j4m8M4K0Q2J5l6J8lj9K8j6J4K3
5535C6n2O3l2n2l5J6M1j5l2N2k0MJ0k7L9m2j2rOj5LP9l8m3K4lj5Q1o3j5N2K6o1m7pL3nm8L2
$$ plain form
5664 -58 -18 9 -26 -60 1 -53 -89 -40 -60 -13 -30 0 45 -24 -95 -10 -49 -101 -100 -101 16 -46 -79 -46 -94 -78 1 -41 -64 -70 -47 -34 -6 -12 -75 -58 6
5647 6 -88 -73 -16 -7 -15 -36 -34 -65 -137 -83 -67 -69 -54 -65 -149 -144 -55 -37 -127 -106 -63 -85 -87 -45 -57 -78 -47 -54 -31 19 -57 -88 -31 2 -10 -75 -57 -7 -10 -38
5628 -38 -94 -41 -26 -46 -27 41 10 -25 -51 -47 -32 -82 -69 -43 -65 -45 -15 -3 -63 -93 -68 -82 -20 -11 16 8 11 -49 -31 -27 -42 -41 -120 -117 -73 -75 -59 -10 -59
5609 -59 -76 -26 -37 -79 -66 -29 -12 -52 -82 -31 -73 -89 -30 11 44 -3 -33 -40 -59 -59 -37 -8 -53 -119 -85 -137 -83 -11 -44 -29 -20 -48 -60 -124 -77 -105 -120
5592 -120 -62 -37 -59 -73 -66 -71 -62 -52 -20 -16 -42 -68 -47 -6 -90 -93 -75 27 11 -3 -34 -83 -68 -111 -164 -103 -112 -114 -101 -60 -53 -83 -80 -63 -85 -109 -96 -50 -32
5573 -32 -41 -67 -59 -102 -142 -81 -96 -117 -132 -87 -96 -53 -43 -89 -68 5 -17 -42 -20 -58 -58 -8 19 -63 -106 -105 -76 -90 -54 -62 -37 -15 -43 -38 -44 18 -53 -85 -76 -93
5554 -93 -106 -56 -12 -17 -56 -7 -22 -19 -15 -54 -66 -65 -93 -62 -55 -41 -19 -76 -96 -73 -76 -70 -117 -121 -95 -72 -86 -134 -90 -70 12 27 -9 9 6 -13 15 -1 13 36
5535 36 -16 47 15 -37 -72 -56 -15 -30 -62 -10 -30 -26 -16 -43 -4 -46 -58 -67 -61 -76 -73 6 -32 -75 -51 -54 -69 12 -51 -66 -14 12 -49 -96 -103 -70 -75 -123 -91
5516i1K8k0M4j9k5P5jnKj2K7m9K3o0M4qn1P9jJ4K1o4j2Q2n5k7j7K6l6J9N0n7QL0k1L7J0K7
5498A5l6j9ll4l8L4K1J5j6j2j9L2K5lj9j4%j0K0j4L9M0o0l9lK2N9j1p8k0P4POO2On2k6K0K2
5479gj1L0K4l6n2k6J0J05k7j8M3o6n8N7n3N4j1M2%q5M3M7Nn9j8L8m8j2O2J6l3j3Nk7L5oj3
5462f3N0l8Rj2J1J7l7o8j7J23No6m7M9Pk8oO0L6ok1k0O0q5PO4J6l8m7MN2L8j7j1l9K1j0K4
5444b3lj18M3N4L1l0qK2np3J5k5N0K0L2J5n6N5n3l8P2m5qO7l6K8L2j2p5N5m2k0K4JM5lm7O3
5426DO1n6j4J3o0j7K2kj2l2J3O9Prok9J3K8n5m2J7k5K8N0MK3j3K5Ol7j6j7K0p0N1L7l1L2n6
5407g6qO1o8P8m1K3jk3J6L3Lr3K3M4Kl5m0L3M9M5m7p6L2l4rL3j6K6k3J8k1M3m2j6jK5m9O7
5389f5jjk7J8M3NMk6k2K6m1L2K6k8J8k7j7J9L3j8o1O7J2l1L3m9NJJ9O6j1o6M3ql4j7O1Ql2
$$ plain form
5516 -91 -63 -83 -39 -58 -83 -8 -9 -14 -12 -24 3 -46 -23 -83 -39 -47 -98 -19 -20 -6 15 -49 -61 21 -34 -61 -78 -52 -88 -69 -19 -76 -68 -38 -59 -22 -12 15
5498 15 -21 -40 -43 -77 -115 -81 -60 -45 -61 -73 -92 -60 -35 -38 -57 -71 -71 -81 -61 -75 -36 4 -56 -95 -98 -76 -17 -28 -106 -126 -52 -45 -39 23 29 -23 -49 -29 -7
5479 -7 -18 12 36 0 -52 -78 -68 37 10 -8 35 -31 -89 -32 -85 -31 -42 0 0 -85 -42 5 10 -49 -67 -29 -77 -89 -27 -11 -44 -57 -52 -79 -44 -50 -63
5462 -63 -13 -51 -42 -54 -43 -26 -63 -131 -148 -25 -20 -86 -133 -84 -77 -105 -111 -51 -15 -21 -42 -62 -2 -87 -80 -16 0 -38 -85 -81 -29 9 -8 -19 -58 -37 -47 -23
5444 -23 -26 -144 -101 -47 -16 -46 -54 -32 -37 -110 -95 -120 -70 -50 -18 -3 -59 -4 -57 -95 -23 -68 -76 -9 -45 -17 15 3 -72 -17 -59 -79 -55 -54 -9 -12 -59 4
5426 4 65 9 -5 8 -52 -69 -47 -49 -61 -93 -80 -11 -4 -13 -19 -48 -35 -7 -62 -104 -87 -112 -84 -34 -30 -7 -20 5 11 -26 -42 -59 -39 -109 -58 -21 -52 -20 -76
5407 -76 -84 -23 -91 -13 -54 -31 -32 -55 -39 -6 -3 -96 -73 -29 -27 -62 -102 -69 -20 25 -22 -98 -66 -100 -109 -76 -92 -66 -89 -71 -92 -49 -91 -107 -108 -83 -132 -65
5389 -65 -66 -67 -94 -76 -33 -28 -24 -50 -72 -46 -87 -55 -29 -57 -39 -66 -83 -64 -31 -49 -110 -43 -31 -62 -29 -78 -73 -72 -53 13 2 -64 -21 -29 -63 -80 -19 -11 -43
5370d3k8l3k4nJ2M0J2J3L1l2q6j0O3pRL0Rk5L6p1P9M9o0J1j0K6J2l6J1J5m3m9K9N0k1l3o2
5353a41K9kk6N6j4jNM4l0rN0k7L1K4m6KJ7L4n0l4K0P7m4j0k0k4N2lJ9n7L1%m1l3M4O2K7j01
5335h9l2M4J6l0Q6k5k8LK3k2j2L4Mj8m7j3lQ1l6L6Pj9l0m1J5OP5M3k1n1l9L8ML7Mk6MJ6j5
5316b1m0j1o7j3L6J1Rl7j9QJ0M9K5M2k7q7J02J5q5j6J3O8l5p2M4j4P0M7o9l7J8N7%O0l3k4
5299b3n5l2M7K7o1M0O1k2n1K2j4J7j5Jk8K7M4j3kN5l9j8J1m8n7M5K5qk7MM0N8j7J2J1q6j0
5281g9K3JQ1J1l8j3jm4nK9k0K5k5KQKj7l7K5LL8K7k8k4N8l6Lm5j9R5Jl8JoQnR3L8j9m3n2n2
5261g4N5N5n4Ljpj4K4lp3n1N6OL7pNm6R9j8l0M8J2pn6j4qL6j0MM0l3p1R0L6q5J6mK2j1K5k9
5242c7m9L8j3k0M4J1OJ5lk2pJm8mNK8L6M9p4l3k9Q3L2jJ3n9QL9J6n2l7%J9n1K7M0ml8l1k0
$$ plain form
5370 -43 -71 -104 -128 -133 -121 -81 -69 -56 -25 -57 -143 -153 -90 -97 -88 -58 -49 -74 -38 -109 -30 19 -41 -30 -40 -14 -2 -38 -27 -12 -55 -104 -75 -25 -46 -79 -141
5353 -141 -112 -114 -140 -84 -98 -99 -94 -50 -80 -89 -39 -66 -35 -11 -57 -55 -38 -4 -54 -88 -68 9 -35 -45 -65 -89 -37 -40 -21 -78 -47 -47 -88 -121 -77 -15 12 -89
5335 -89 -121 -77 -61 -91 -5 -30 -58 -55 -32 -54 -66 -32 -28 -46 -93 -106 -109 -28 -64 -28 -21 -40 -70 -111 -96 -90 -15 28 7 -44 -83 -45 -41 -4 0 -26 -22 -6 -21
5316 -21 -61 -72 -139 -152 -116 -105 -96 -133 -152 -144 -134 -85 -60 -18 -45 -132 -30 -15 -100 -116 -103 -35 -70 -142 -98 -112 -42 5 -64 -101 -83 -26 -26 34 1 -23
5299 -23 -78 -110 -63 -36 -97 -57 4 -18 -69 -47 -61 -44 -59 -58 -86 -59 -15 -28 -30 25 -14 -32 -21 -69 -126 -81 -56 -64 -91 -87 -47 11 -6 6 17 -69 -79
5281 -79 -56 -55 26 37 -1 -14 -15 -59 -64 -35 -55 -30 -55 -53 -45 -43 -60 -97 -72 -69 -31 -4 -32 -56 2 -34 -31 -76 -95 0 1 -37 -36 -42 -34 -39 54 92 73 30 -22 -74
5261 -74 -19 36 -18 -15 -16 -23 -37 -13 -16 -89 -140 -84 -78 -41 -48 -43 -89 10 -8 -38 10 22 15 -41 -55 -63 -27 -37 -33 7 -26 -97 -7 29 -56 -40 -44 -22 -33 -8 -37
5242 -37 -86 -48 -61 -81 -37 -26 -20 -5 -8 -30 -37 -36 -84 -88 -83 -55 -19 30 -44 -77 -106 -23 9 8 21 -38 -30 9 25 -27 -64 -64 -45 -96 -69 -29 -33 -71 -102 -122
5222a22P3l4P4J9j3n7K5L5Kl6k8j3K1L2J7onM1J1k9l0n9j6O7K1q4L2k8m6K8K2M4N2J2j5m0
5205c3P6Qk9o2m7k6j6Q2N2p3l8J5K4J7n5QP0LKMK7o6OL6J21p6j13M4M9kp4o2K2qnJ0P7Rk6
5187d9Qn5J7M6k7J8L5j7m6jm2M4NN7n3jK3m3QJ8J6oK6Qpk6J3j0l0O7rJK9l0q9N6K5L0Jl4m8
5167g2pN5L1o8L1pJ2J5k4l2j0J9OQj6P5o1L0j7j7m2q4K7M6Q6L9p8MJ7k5L7j1o0j8n9Q5K7K6
5149c2j4M6n%kqM4o7k6K5J4n9J2J3l0PM6o8Q0Q0j6Ko5j8K5n9l4O2M6o0k7j6N5j3jrRK1l5n
5130h2L4l1kO1K1n8n3L0%j3O1l3Jl4m1k5M7R0k2j1L5l3M9K3l1o9pPJ1K3L0k1k3J4k8jL2J9
5112c0N2m4m0O0l5m9K0J4L6j0k7M5l7K4L7n4n0M2qk3M8N9q1J8J4Ln1o2L9J3J5j9Ok8N7RoK4
5094a9M5l2o8P4K2k9l2j4M7ll9K9L9k8l2m5k0j4K1N5K6j8j8m4J2N6K8K1k9K2n2l7JL5Km4K6
$$ plain form
5222 -122 -49 -83 -9 10 -3 -60 -35 0 2 -34 -62 -75 -54 -22 -5 -11 -16 25 36 7 -23 -82 -98 -31 -10 -94 -62 -90 -136 -108 -86 -42 10 22 7 -33
5205 -33 43 51 22 -40 -87 -113 -129 -47 5 -68 -106 -91 -67 -50 -105 -97 -27 -24 -22 -18 9 -57 -51 -15 106 30 -83 -39 10 8 -66 -128 -106 -114 -119 -109 -32 -23 -49
5187 -49 -41 -96 -79 -33 -60 -42 -7 -24 -70 -71 -113 -69 -64 -7 -60 -61 -38 -81 -73 -55 -39 -45 -19 -11 -18 -44 -31 -41 -71 -4 -13 -12 17 -13 -102 -46 -21 9 10 -24 -72
5167 -72 -79 -24 7 -61 -30 -37 -25 -10 -34 -66 -76 -57 -51 -43 -59 16 -45 -15 -32 -49 -91 -175 -148 -102 -16 23 -55 -51 -34 -59 -22 -33 -93 -111 -170 -85 -58 -32
5149 -32 -46 0 -5 -5 -7 -15 29 -38 -64 -39 -25 -84 -72 -59 -89 -82 -36 -104 -24 56 40 42 -23 -41 -16 -75 -109 -47 -1 -61 -88 -104 -49 -62 -63 -72 -63 -42 -77 -82
5130 -82 -48 -79 -81 -20 1 -57 -110 -80 -80 -93 -32 -65 -64 -98 -139 -164 -117 -27 -49 -60 -25 -58 -9 14 -17 -86 -93 -86 -75 -52 -22 -43 -66 -52 -80 -81 -49 -30
5112 -30 22 -22 -62 -2 -37 -86 -66 -52 -16 -26 -53 -8 -45 -21 16 -38 -88 -46 -54 -77 -29 30 -51 -33 -19 -16 -67 -129 -90 -77 -62 -81 -75 -103 -46 -37 -43 -19
5094 -19 26 -6 -74 0 22 -7 -39 -53 -6 -9 -48 -19 20 -8 -40 -85 -105 -119 -98 -43 -17 -35 -53 -97 -85 -29 -1 20 -9 13 -39 -76 -75 -40 -38 -82 -56
5076e6l2M1M5k3J9k8RqNPJ3%J4m4l4PO6j2k4j7m6LK4l0N0L7k1j4rN7m0l6L3L9m0n0O0J3L1
5057Ij08k1M2j3J7l6J8J4O6J2l8J5J0nk5J2M5p8JK1k0OrJ4o5jK1%N5l8j4Q5q8j7k5NM8N2j
5039c4M3J0o3j2J7l1PL4N9l4k7m2kk1QK2J7o6k3K3L2l2J0QJ6K1K5j3M7L2k0n1N5q8k6N5j7
5021f1K0l5J6N4qj2K4J3p8KoL7j1K5m6o3N5M1l5M1J6p3J7Q1jn9K4koL5p9N8L6k3o8J8J7l3
5003f9K0K9J5n7j8N9o1k9P2OKk1m3n8J16O9o0J8l6o3J5Q6j8o2Jl4J27k9n5J7pQ6j1KL1j1P7
4985A06l0j5o9m9lnL7K6k3m0j5M7Mm3p5M2%P8K6k7J6k8J0K4l0m2M9k1J3j6r7L6ol3P2j5lJ6
4967h3j6Q8N3k7l3k7p0L7j2l5M5l4PK9RMk3L4L4J4Jj2j4K2O4Kr1k7l6L8J2n7o9J17N3m3PK
4949c7k4J09K3p5o9J9lJ4j6jj2J0K1n7n2LN9Q6j1m1K2K7l5Lk8j7j6j1M2L3M2m5J2M9l8m0l0
$$ plain form
5076 -56 -88 -47 -2 -25 -6 -34 -25 -33 -28 -21 -8 -8 6 -38 -72 -65 1 -11 -35 -52 -98 -95 -71 -101 -51 -14 -35 -49 -58 -1 -41 -77 -44 -5 -45 -95 -35 -22 9
5057 9 -99 -120 -78 -91 -74 -110 -92 -78 -12 0 -38 -23 -13 -18 -43 -31 14 -64 -63 -42 -62 -56 -65 -51 -116 -117 -96 -96 -41 -79 -93 -8 -96 -113 -138 -133 -85 -33 -34
5039 -34 9 19 -44 -56 -39 -70 -63 -29 30 -4 -31 -73 -75 -96 -88 -66 -49 -115 -138 -115 -83 -115 -105 -97 -81 -60 -35 -48 -1 31 11 -40 15 -73 -99 -44 -61
5021 -61 -41 -76 -60 -6 -14 -26 -2 11 -67 -65 -71 -34 -45 -20 -66 -129 -74 -33 -68 -27 -11 -84 -67 14 13 -46 -22 -24 -30 5 -74 -16 20 -3 -71 -53 -36 -69
5003 -69 -49 -20 -5 -62 -80 -21 -82 -111 -39 -33 -31 -52 -95 -153 -37 32 -28 -10 -46 -109 -94 -8 -26 -88 -87 -121 6 -23 -78 -61 -68 18 7 9 40 29 106
4985 106 76 61 -8 -57 -60 -65 -28 -2 -25 -65 -80 -33 -29 -72 -147 -105 -105 -27 -1 -28 -12 -40 -30 -6 -36 -78 -29 -50 -37 -53 -150 -114 -120 -153 -81 -96 -99 -83
4967 -83 -99 -11 42 15 -18 -45 -115 -78 -90 -125 -80 -114 -107 -78 -69 -65 -88 -54 -20 -6 -5 -17 -31 -9 55 57 -34 -61 -97 -59 -47 -104 -173 -56 -3 -46 -39 -37
4949 -37 -61 48 71 -4 -73 -54 -57 -43 -59 -60 -72 -62 -41 -98 -150 -147 -88 -2 -13 -54 -32 -5 -40 -37 -65 -82 -98 -109 -67 -34 8 -37 -25 24 -14 -54 -84
4932h4j5K9J6P2l8m0j0lRn1P5NK2j8MJ9MJj07l8O5J9RNmk5PJ0K3m6L7k6k6L7l6QP9n0k9LK5
4912f3M5k0l6K6MJ1l9m1J5M6Qo8O7l5nK6K0j2l7O0oJ2K2Kk7L%J0m1k5k4K9O3n9j3K4NPn0L1
4893f5N3J5Lm0LJ7M7nk5r5J1N3J2j4j4J3n6M6j3p5J18l8L5kk0J2kPm3N3L2n9K2J9p0nK7J5
4875b8k4MN3m4k0J5k9P6nm9l1K7l7QL7Pkk8j5mJ2P1p5L3k0MN9LQm3PJ8k5N0p0L4L0k5l3P7
4856B6l6p5N5J8l1j4ol2Q2j5M9o6j9J0J1Lk4K7j5N7k8L5q3j0Q2m4J5m9O8K2j05PO8J0k1oM
4838c0j7LkL8n2J2pK7L0lqn0J3Ml5KM5j1q0J09L0r4K2L2K9rm3J6Pk0M5L9m0l1L8mj2kj9lL1
4819@n9L2K8n0PpJ6K2J0l9J5j5j3qM2J2m0K7%K4pK9k4o9j5O5k3K6%m7QK0M2L7k3k3L5jqol0
4799a0n9J5N9k6N4m3o3NO8KJ3n6j0J7L2O9k9m2om2j7L4j9K6pm1l4P4Rn3k5lQ9K1J0k7k8j9
$$ plain form
4932 -84 -99 -70 -54 18 -20 -60 -70 -73 -64 -115 -40 -35 -13 -31 -27 -8 -4 -3 -110 -148 -83 -64 -55 -50 -54 -79 -72 -62 -39 -85 -48 -74 -100 -63 -99 -91 -12 -62 -91 -88 -63
4912 -63 -18 -38 -74 -48 -44 -33 -72 -113 -98 -52 -44 -112 -45 -80 -85 -59 -39 -51 -88 -28 -34 -22 0 2 -25 -22 -22 -12 -53 -78 -102 -73 -10 -69 -82 -58 -53 -46 -96 -65
4893 -65 -12 3 6 -34 -31 -14 33 28 3 -92 -81 -28 -16 -30 -44 -31 -87 -41 -54 -129 -11 -49 -14 -16 -36 -24 -26 -19 -62 -9 23 -36 -14 5 -65 -70 -43 -28
4875 -28 -52 -48 5 -39 -59 -44 -73 3 -2 -51 -82 -55 -92 -84 -47 -40 -42 -70 -85 -89 -77 -6 -81 -48 -68 -64 -5 -2 6 -37 -30 -12 -37 13 -57 -23 7 -18 -51 26
4856 26 -10 -85 -30 -12 -43 -57 -63 -95 -13 -28 21 -45 -64 -54 -43 -40 -64 -37 -52 5 -23 12 -71 -81 1 -43 -28 -77 -9 13 -92 -85 -17 -7 -28 -34 -30
4838 -30 -47 -44 -46 -8 -60 -48 -55 -28 2 -1 -9 -59 -46 -42 -77 -75 -30 -41 -121 -12 18 -76 -54 -22 7 -2 -45 -29 -22 -42 3 42 2 -29 9 5 -7 -9 -28 -31 0
4819 0 -59 -27 1 -49 -42 -49 -33 -11 -1 -40 -25 -40 -53 -61 -19 -7 -47 -20 -20 4 -3 26 2 -67 -82 -17 -40 -14 -14 -61 -53 -33 9 46 23 0 35 34 26 20 -10
4799 -10 -69 -54 5 -21 33 -10 -73 -68 0 2 15 -41 -51 -34 -2 67 38 -4 -10 -52 -69 -35 -54 -28 -35 -76 -110 -36 -27 -80 -105 -108 -19 2 12 -15 -43 -62
4781f2J0N1q2N3K2K8q5KL0j0o3L4QJj9rM2k7J4J4j8%k5j2j0k5P2J5K7J9K0J6n1l5k1p3QO4
4763g7OqL6J6Km2l6K9OJ4l9Kj5L6k2NL5J2K5K9n1j7K3J7j1Pj0L1n9n1LK4K7J2L5J4j7OJ8J4
4744B9KJn1m5jL7L1n5L9l5l0K8o8k1L6J9M2LJ1nM4n2M4N4m2o2J0L0o4k0JJ3k6K6Q3K3L7o6
4726@q3J4L8QNMol6n9J0kqL0KQ7l5M7Kn6N2m0l0N9l9N2q2m9P4Nj9k8O8nK8m0k0k5K7l3mK5
4706f2N7OkPrk3J1L8j7Poj6k1M9j50J5m4M1O2L9K8l6j2L2m2j5Q0nj7k4K6MK4l8k8pl8J0Ln8
4687a31K9M5K6m5L5rK3%lj4j0ppK7N0kj3L6p7j7k8qK1O0o1j7qO7L1k8k0kK1j2lj0N4m6p2N4
4668g1Q0j3j3l7MQ2k5m7l2j0m0kL8M2L4Rl0m5N9j3nn0J4L8J8L4j8J0pl3n9n8K5K7J0O6j5o6
4650i9JKJ3JP7J6k1j02K3J0J9M6K0Jn2K0K1qq0L7k6k6M6L5l6l1L4oL8K9k3Jk0L7l2Lj1kN1
$$ plain form
4781 -62 -52 -1 -83 -30 -8 20 -65 -63 -33 -43 -106 -72 -64 -63 -82 -91 -49 -76 -62 -48 -66 -66 -91 -103 -113 -138 -66 -51 -24 -5 15 31 -20 -55 -76 -149 -141 -77
4763 -77 -71 -79 -43 -27 -25 -67 -103 -74 -68 -54 -93 -91 -106 -70 -92 -87 -52 -40 -15 14 -37 -54 -31 -14 -25 -18 -28 3 -56 -107 -104 -80 -53 -41 -6 8 -9 -3 15 29
4744 29 31 32 -19 -64 -65 -28 3 -52 -13 -48 -78 -50 -118 -139 -103 -84 -42 -39 -28 -33 11 -41 3 57 15 -47 -37 -7 -71 -91 -90 -77 -103 -77 6 29 66 0
4726 0 -83 -69 -31 -23 -18 -14 -20 -56 -115 -105 -107 -115 -85 -83 4 -31 16 18 -38 14 -26 -56 3 -36 16 -66 -115 -41 -36 -55 -83 -15 -20 8 -32 -52 -77 -50 -83 -87 -62
4706 -62 -5 1 -1 6 -3 -26 -15 23 6 13 7 -9 -30 19 -131 -116 -160 -119 -57 -18 10 -26 -38 -6 -48 -63 17 12 -5 -29 -3 1 25 -13 -41 -48 -86 -76 -73 -131
4687 -131 -102 -57 -31 -76 -41 -50 -27 -27 -30 -44 -54 -61 -68 -41 9 7 -6 30 -47 -64 -92 -100 -79 -19 -80 -97 -105 -38 -7 -35 -55 -57 -36 -48 -51 -61 -7 -53 -125 -71
4668 -71 9 -4 -17 -54 -50 32 7 -40 -72 -82 -122 -124 -86 -44 -10 -1 -31 -76 -17 -30 -35 -85 -71 -33 -15 19 1 11 4 -29 -88 -146 -121 -94 -84 -18 -33 -99
4650 -99 -98 -96 -83 -82 -5 11 -10 -112 -89 -79 -60 -14 6 7 -45 -25 -4 -12 -92 -55 -81 -107 -61 -26 -62 -93 -59 -65 -27 2 -21 -20 -40 -3 -35 -32 -43 -45 6
4631Fj5mN3n3n2j1J7j2qKl8J00P3n1j7k7j8o5M6O5k5l0l1M6j2PO1no4K7j3Jk6L4qmL5J8r0
4613h8k2R6K0k5qKPR0m8j9l1J2o0oRm4K0KN7P5m2k1K6mo4OJ0k0L8l6k0O1M1l5QM6m6m5j2L9
4594c1L3k0Krk2mL6k3J5K6nk4k3l5l6K1K4J3K3L7j7Nlp0J3PN0L2n3j5L1o1L3j2k4K4k3j1P7
4575a9Jqj0L7mp1L6mk7olrJJO2k3k7k4L6j1Mm3LM6M2J9k0ln8QQK7L7J0Pj4l9L6o2L2J0k6m3
4554i1J4J5Jk8nM1j8M5j5j5MM9k4q4J1k8RM1KM4J4nL0j5q4L7j8k9J4P8J2q3M0J6m7J6m0Q7
4536ij6rLmj5N1O5r1k1k3N5K8J5q0j4rk6k0J0P2J8n0J6L6J3l3pK8Kp4k7O1Nm0qL2mO6K2m6
4517b8Ok%k7l3L3L3l3K8pl3O5j3j4j9j3j3N0j3n8kO5P7j5j8j3mJ1l4J0n0N6n5n8L7L3k9M8
4499c2P4l7k4P2p1j4r3M5M8l1L8J7qK2ll0K5k9m2L3j8k9N9N3l1L3k1Jk3oK3k4J9J4n8l6L2
$$ plain form
4631 6 -9 -13 40 -13 -65 -76 -59 -71 -79 -77 -115 -15 58 7 -10 -37 -55 -120 -74 -9 -34 -64 -95 -49 -61 -54 7 2 -62 -35 -48 -47 -73 -39 -47 -51 -16 2 -88
4613 -88 -110 -14 6 -19 -27 -25 -18 72 24 5 -26 -14 -74 -80 -71 -115 -95 -93 -36 39 -3 -24 2 -2 -66 -60 -50 -70 -32 -68 -88 -27 14 -21 -13 33 -13 -58 -70 -31
4594 -31 2 -18 -16 -25 -47 -51 -15 -38 -23 3 -2 -26 -49 -84 -120 -99 -75 -62 -39 -2 -19 -14 -17 -87 -74 -67 -17 15 -38 -53 -22 -83 -50 -62 -86 -62 -85 -96 -19
4575 -19 -18 -26 -36 1 -3 -74 -38 -42 -69 -75 -78 -87 -86 -85 -23 -46 -73 -97 -61 -72 -68 -111 -108 -62 -20 -1 -21 -24 -82 -74 -66 -39 -2 8 15 1 -38 -2 -64 -32 -22 -48 -91
4554 -91 -77 -62 -61 -89 -94 -53 -71 -26 -41 -56 -52 -3 -27 -111 -100 -128 -119 -78 -76 -32 -18 -23 7 -8 -92 -55 -73 -102 -88 -10 2 -81 -41 -25 -72 -56 -96 -9
4536 -9 -25 -34 -31 -35 -50 1 66 -25 -46 -69 -14 14 29 -51 -65 -74 -100 -120 -110 -38 -20 -70 -54 -18 -5 -38 -45 -17 -15 -89 -116 -55 -50 -90 -98 -66 -70 -4 18 -28
4517 -28 -22 -24 -24 -51 -84 -51 -18 -51 -23 -30 -63 2 -11 -25 -44 -57 -70 -20 -33 -91 -93 -28 49 34 16 3 -1 10 -24 -14 -64 -8 -63 -121 -84 -51 -80 -32
4499 -32 42 5 -19 53 -18 -32 -125 -80 -32 -63 -25 -8 -16 6 3 -27 -2 -31 -73 -40 -58 -87 -28 25 -6 27 6 7 -16 -22 1 -23 -4 10 -48 -84 -52
4481e2MK7m8l9nP8J3Om5N8k2PN3n2o7j6K8L2n7j7L9J2K8LRl0n9L6N7j3j4K9OkLJ4J4n1n1K3
4462f1O4ol8oK5Lk3j4l4j8N2mM0N2k4k2l8l0N9%p3M2l9J0j7j2J0J0j6k1O4j5k7P0OL5j5j13
4444a24k6J7J0Q5K5lLl2J6J6On6N1j2l7J6L6j7m2k9K5lO2n6k4OL7N1K0o7L3K3n4n7PN%K0J22
4426E3l9j5k3p1OM8K2J2j7K0M9l2k9k7mj3jJ4J4p1rQ5J5J4J9K3j5k3lo3l3J7M6k2l7j0Rk6
4408a17N9K3RJP4n4m7l6l6k7Q8k9L0O9m6l4K5k4L4L1m5K3j7M6L2l4j1J4QK4l9k5m0j1J7k5
4390i0J32q1n9L4L8k7jqK1MJ6j1lm1l0Q0Rjl1K3m7l6k2N2K9j5k5N6j5K3k8J1j0L6Qm4Rj9L4
4372b9olnLqk1p2M2O3K4rpl5L4m3O2K8m4M1%o7l3qK0Q2kMP5j4p1l1k0J6j5l4QRM5O0k1q9%
4352g1Mn%O1j0k5k7nj1K5N2L3pl6j4%j7J8L1n5k1JN9l5j5jrK6K2K1j1J3j1JN0o9j2mN8qn1
$$ plain form
4481 -52 -48 -21 -69 -108 -113 -35 -22 -16 -61 -3 -25 -18 35 -17 -84 -100 -72 -40 -97 -114 -75 -63 -35 -32 -23 -53 -112 -76 -19 -32 -46 -17 -11 -13 -10 4 18 -33 -84 -61
4462 -61 3 -3 -41 -47 -22 -19 -42 -56 -90 -108 -56 -60 -20 32 8 -14 -52 -82 -23 -23 -96 -54 -93 -83 -100 -112 -102 -92 -108 -129 -65 -80 -107 -37 -31 4 -11 -124
4444 -124 -150 -133 -123 -38 -13 -16 -13 -45 -29 -13 -7 -63 -12 -24 -61 -45 -9 -26 -68 -97 -72 -75 -13 -69 -93 -87 -50 1 21 -46 -13 10 -44 -101 -94 -89 -89 -69 53
4426 53 14 -1 -24 -95 -89 -41 -19 -7 -24 -4 45 13 -16 -43 -47 -60 -61 -47 -33 -104 -113 -28 -13 1 20 43 28 5 2 -61 -94 -77 -31 -53 -90 -100 -91 -117
4408 -117 -58 -35 -26 -25 49 -5 -52 -88 -124 -151 -63 -92 -62 7 -39 -73 -48 -72 -38 -7 -52 -29 -46 0 32 -2 -13 1 9 33 -6 -31 -71 -82 -65 -90
4390 -90 42 -39 -98 -64 -26 -53 -54 -62 -41 -37 -21 -32 -35 -76 -106 -26 -17 -18 -49 -26 -73 -109 -131 -79 -50 -65 -90 -34 -49 -26 -54 -43 -53 -17 -9 -53 -44 -63 -29
4372 -29 -35 -38 -43 -40 -48 -69 -141 -99 -36 -12 -21 -28 -63 -29 -72 -10 18 -26 15 15 -52 -85 -93 -73 9 7 11 86 72 1 -30 -50 -34 -49 -83 -75 -66 -21 39 18 -71 -71
4352 -71 -67 -72 -72 -11 -21 -46 -73 -78 -89 -64 -12 21 14 -22 -36 -36 -53 -35 -4 -59 -80 -79 -20 -55 -70 -71 -80 -54 -32 -11 -22 -9 -20 -19 31 -38 -50 -54 4 -4 -55
4332e5kM6n3QM1L8j1jK2o8j8L3n6L6J6l0L8lk6J01r6J4Nm3k6M9qJ9L4oo8Kl7R2J5n3o2jrK5
4313i8M5nJ4k3J4K6L3m1J3Lj05J6O9N9k4J6M2j2n6k1jl5j6L9J8K6j5KMPr8ON6J2l7j3O0K8
4295Hk0m0Km5l4Rk2M8O4m1N8q6J6M0l6k3L7j9K1P1l6o5N0O2j22J7L5L4q3PJ01Ol2L7Qnj9m8
4277d5j00O5L4L8nm6k9K7M2rpk5k0p6L2K4M2J4k8j9L8M0J1n9K6k4rJ9JO7K6j5o8m8O6L5lJ6
4259B8n5lp0K1OL4MJ6q1Q4k7p7L9rj9N9K4Ml6k6N0L1o6LJ2m6J33m1nL9K5l6n5k0rJ8j5k2Q2
4240fL4l8J9l6jk7J8J4k3Kq5KM5K6l0K8OJ7N1l9l2M1n6oJ0o1O8j6n8P6N3m0Mk6mk9LL6kj7
4221g9m5N0L0LK7j9j7k6L1K0k7m1j8J19m6J2j4k2pL2qJ2pL3%J0p1J9J5OLo2M3J6J4k8l4k6
4203a02jP3K4p7jl9R2J6m1n5K5N7N8o5Ll9n7L8Q1o1J4n8nL1K8mOk1l4L8M1J7j6pJroj8k8N3
$$ plain form
4332 -55 -57 -11 -64 -56 -15 23 12 11 33 -35 -53 -20 -76 -40 -24 -54 -16 -19 -45 56 -40 -26 -21 -64 -90 -41 -49 -30 4 -2 -70 -68 -105 -13 2 -51 -113 -114 -123 -98
4313 -98 -53 -58 -44 -67 -53 -27 6 -35 -22 -19 -124 -108 -39 20 -4 12 54 42 -14 -35 -36 -71 -87 -48 -30 -4 -19 -17 -13 -6 -104 -98 -42 -30 -67 -80 -20 8
4295 8 -12 -52 -50 -95 -129 -120 -142 -94 -30 -71 -13 -99 -83 -43 -79 -102 -65 -84 -63 8 -28 -93 -43 19 -103 -86 -51 -17 -100 -93 8 14 -18 19 27 22 3 -45
4277 -45 -145 -80 -46 -8 -13 -59 -88 -61 -19 -28 -35 -60 -80 -156 -124 -100 -58 -44 -72 -91 -53 -13 -2 -61 -35 -59 -68 -49 -48 19 45 30 -38 -86 -20 15 12 28
4259 28 -27 -30 -100 -79 -73 -39 -35 -19 -100 -16 -43 -120 -81 -90 -109 -50 -26 -22 -58 -84 -34 -3 -69 -66 -54 -100 33 -8 -13 26 51 15 -40 -60 -69 -51 -66 -88 -6
4240 -6 28 -10 9 -27 -28 -55 -37 -23 -46 -44 -129 -127 -82 -56 -86 -58 -52 -35 16 -23 -55 -14 -70 -76 -66 -127 -59 -75 -133 -57 -4 -44 -40 -66 -70 -99 -96 -60 -62 -79
4221 -79 -124 -74 -44 -41 -14 -33 -50 -76 -45 -25 -52 -93 -111 8 -38 -26 -40 -62 -69 -37 -45 -33 -40 -7 -7 3 -68 -49 -34 -28 -25 -87 -44 -28 -14 -42 -76 -102
4203 -102 -103 -30 -6 -83 -84 -123 -31 -15 -56 -111 -86 -29 29 -36 -33 -72 -129 -91 -10 -71 -57 -115 -120 -89 -61 -65 -59 -80 -114 -76 -35 -18 -34 -41 -40 -49 -55 -73 -101 -48
4184d8J7n7N1K7j4L2j4J7J8j5K3J4nn6l9j7N8Or0kL4O4k8N4o8m4O2l8pMl0N5MN0on9K2J06
4166H1m5l1oo4J6M2l6j9rK7L0J4n5LJ7K8J5n1N4J0MJ9o8l7nJ0J8J7n5nL1NL7L4n2K9ol4Qk6
4147e5j6M0pl8l2lK4JN3Nl8K7NK6M5n6N0j2o9k9L5L1J1Pk9M2p6l6K4K3l5KM7M0j3kPp1N5o
4128b3k2rL3J1kMK7p0l2N9M6l0k6K5ql5l3L6N3k1J1j2m3m5j0M7K9n9j%J1k7L2M1j2Ql4K0J7
4109d4M8Pq0RJ6nO6J3k7kmk8l6K7K1JJ3q6N6k2k1lP0n2L7K2ko6J5N0k1J2rnJ4N9m5n5J7k4
4090f4Kj5l4O1J5J2O6o7l7ll3N7OJ5j1K0qj4l7MJ7%j5jRJ4M9n5J8M3MMl6l6L1p7j5K8J1L2
4071d0oM1mj9%J0j1K1Nm2pj2m1kN2rJ9L5j2M6J4k8n9j3o8R9J9mJ3J7k9j8MJ0N8j17n4J5P3
4052d4Q1J9j10q9M6L9k8Q4j7lj1R%M6k8o6k2k3R5J0m3K9l7M2k9pO4m2k9L0LL0jMJ9k8n3L4
$$ plain form
4184 -48 -31 -88 -37 -10 -24 8 -6 11 29 14 37 51 46 -10 -49 -66 -8 -2 -92 -94 -60 4 -24 30 -38 -82 -20 -58 -65 -61 -91 -36 -32 18 12 -47 -25 81
4166 81 36 5 -1 -65 -49 -7 -43 -62 -71 -44 -14 0 -55 -52 -35 -7 8 -43 11 21 25 44 -24 -61 -66 -56 -38 -21 -76 -81 -50 -45 -8 26 -26 3 -3 -37 -29 -55
4147 -55 -71 -31 -38 -76 -108 -111 -87 -86 -33 -28 -66 -39 -34 -8 37 -19 31 19 -50 -79 -44 -13 -2 5 -24 18 -58 -94 -70 -47 -82 -80 -33 7 -6 -8 -1 -72 -17 -23
4128 -23 -45 -54 -21 -10 -12 -8 19 -51 -83 -24 22 -8 -34 -9 -17 -52 -85 -49 4 -17 -6 -18 -61 -106 -116 -69 -40 -99 -100 -100 -89 -116 -84 -43 -55 -47 -81 -61 -44
4109 -44 4 11 -69 -60 -44 -49 17 30 3 1 -3 -31 -67 -40 -19 -18 -5 -91 -35 -57 -78 -81 -11 -63 -26 -4 -6 -72 -57 -7 -28 -16 -25 -30 -16 43 -2 -57 -40 -64
4090 -64 -62 -77 -111 -50 -35 -23 43 -24 -61 -64 -97 -40 -34 -19 -30 -10 -18 -32 -69 -65 -48 -48 -63 -64 -55 -41 8 -47 -29 14 18 22 -14 -50 -19 -96 -111 -83 -72 -40
4071 -40 -46 -5 -9 -28 -28 -18 -29 -8 -3 -45 -52 -64 -105 -107 -55 -64 -45 -10 -22 24 38 10 -49 -62 -130 -31 -12 -16 -3 14 -15 -33 -29 -19 39 -78 -132 -117 -44
4052 -44 37 56 -54 -143 -97 -58 -86 -2 -19 -22 -33 -24 -24 22 -6 -72 -94 -117 -22 -12 -55 -26 -63 -21 -50 -57 7 -35 -64 -34 -31 -1 -2 2 21 -7 -60 -26
4034b6j5L4o1j1lK3O0J4n2lP5l2k6m6j6m6N5R3l5mJ5l4K4L0l3n9oK2M9Jk7l7l1O3P5p5KK2
4016b1j0J1j1N8M6m7j4M0lq4j4k9O8o4Mj0l9P0J6L9lMo9k2N5K0Rr8MR6k2M0j6r3N8O4l4lk8
3997c2l1P9j01k7L3M4P1q2OO4m4k4n4M1N5m4J0J8L2n6l8Jj7K2m0%L1N9lL8K9r6J5K6o0L2L4
3980iQN9k4m4nm4J9L0K7KRm1L1K1k9j8J3m1roM4J7l0J2m6l4k8O4O9k2l2MM0J3m6m0K4k7J5
3961e4O0qj36O0J3kj3K4l3J9K0Km9K7m2M0J4N4o5J3J0%K7j7L4m7n1J6M%J1M7J2l2MRm1m5j3
3943a28M1n1K3O9nK1L2l5l5M7K4j2j0j0l4%j0K0J3L2j7k8L3P3m4m2m5Q1l5J8j8n0pO0%J3q
3925b4k9J0L0ml4LJ0K3J0m7l3K4Q2K7n1%K0l2J9Pk8L4Km6k7j6J3M5p5N2p5L8Q7n6k2Qj3J7
3907e1k6Kj3N2N0q6P4J0l4Kl1l4J6k1M7L2KK0o3K5Jl4M4p7NK0L6l3K9MO2j3n2Nj1N9j7j0N
$$ plain form
4034 -26 -41 -7 -68 -79 -82 -59 1 15 -37 -40 35 3 -23 -69 -85 -131 -76 17 -18 -22 -7 -41 -17 13 -20 -79 -85 -63 -14 -13 -40 -77 -108 -45 30 -45 -43 -21
4016 -21 -31 -20 -31 27 73 26 12 52 49 -35 -49 -78 -10 -74 -70 -80 -119 -49 -33 6 3 7 -62 -84 -29 -9 0 -98 -94 2 -20 20 4 -89 -31 33 -1 -4 -32
3997 -32 -63 16 -85 -112 -79 -35 36 -46 -40 24 -20 -44 -98 -57 -2 -46 -36 -18 14 -42 -80 -79 -96 -74 -114 -114 -83 -24 -27 11 40 -56 -41 -15 -75 -43 -9
3980 -9 -1 58 34 -10 -15 -59 -40 -10 17 19 28 -13 18 39 10 -8 5 -36 -45 -51 -7 10 -20 -8 -54 -88 -116 -52 17 -5 -37 -33 7 20 -26 -66 -42 -69 -54
3961 -54 6 -2 -138 -78 -65 -67 -80 -56 -89 -70 -50 -48 -97 -70 -112 -72 -58 -4 -69 -56 -46 -46 -19 -36 -2 -49 -100 -84 -80 -80 -69 -22 -10 -42 -38 -29 -70 -115 -128
3943 -128 -87 -138 -115 -46 -51 -30 2 -33 -68 -21 3 -9 -19 -29 -63 -63 -73 -53 -40 -8 -25 -53 -20 53 9 -33 -78 3 -32 -14 -32 -82 -89 -29 -29 -16 -24
3925 -24 -53 -43 -13 -17 -51 -48 -38 -15 -5 -52 -85 -61 21 48 -3 -3 17 -15 4 11 -17 17 19 -27 -54 -70 -57 -12 -87 -35 -110 -72 15 -41 -63 -55 -68 -51
3907 -51 -77 -75 -88 -36 14 -72 2 12 -22 -20 -51 -85 -69 -90 -43 -11 -9 11 -52 -27 -26 -60 -16 -93 -88 -68 -32 -65 -36 -32 30 17 -35 -30 -41 18 1 -9 -4
3888dPn1K3J1l1k8%%nj8p8O4M0NJ6j1l2JO8J2lpo8Q0k4K5m5rk7M0j9j3J3k0K0M4L2n2M0j4
3869a8j3o8L4n2N6n2k5P6L9k5p2K6O8K1J4qn7k3l7k4Q9L8l4L8OJ5J3jl8j8n6qK4O2m5j3K5
3852d3Nj1k0M0MK7q2nN3N0j1j4O9j18J0J0k5nK6l7LpJ12mm4j5KJ1k3K1%K0lJ5m0L7p9L8PK6
3832@J0k1K4NK6p6M4o4p7J00m9m4O0Q5m7p7J3P8Kk0L3p9KNL7l0K1K9lJ0K1k3l9m9K9O5k9n8
3814h6L7P1l8r5L8N2N2lK7k9j6l4J1k6k2J6J9K2m1J3O2l1n5P3jrO3m0j03qo1O2O%l0L2M4n
3796c3M2l3L9J4k9Lj1l1J4J2N9jq4p0N2O5k0J4Mm3ppP8qj3kj2j5l8J4NL1j4j3L1n6m0l3Q5
3778e1N9p5n7N2K3l8j0l0Pn4R6J25k2p4K7j1j9L5O7pl8m4M1Pn4k6Q4jj3l0k4M0j0M0Kj8NM1
3760D5K0m4MOoLl4PJ1pO4P9J02L06J148J519j001j569m01j49l2j73l0K0L1N9L5k7op2L1M8
$$ plain form
3888 -4 3 -48 -25 -14 -45 -73 -73 -73 -78 -96 -174 -110 -70 -65 -49 -60 -92 -91 -23 -11 -14 -21 -89 -9 -33 -8 -53 -62 -89 -49 -68 -81 -68 -88 -68 -24 8 -44 -4 -18
3869 -18 -31 -99 -65 -117 -61 -113 -138 -62 -23 -48 -120 -94 -26 -5 9 1 -56 -79 -116 -140 -51 -13 -47 -9 -3 12 25 24 -14 -32 -88 -96 -72 -10 -55 -68 -43
3852 -43 -38 -49 -69 -29 -25 2 -80 -85 -32 18 7 -7 62 -56 -46 -36 -61 -66 -40 -77 -74 -81 31 27 -17 -32 -30 -19 -42 -21 -21 -1 -4 11 -29 8 -71 -33 -26 0
3832 0 10 -11 13 18 44 -32 12 -52 -129 -29 -78 -122 -62 23 -24 -101 -88 -10 -8 -28 5 -74 -72 -67 -30 -60 -39 -10 -13 -3 18 -5 -44 -93 -64 1 -28 -86
3814 -86 -49 22 -16 -111 -73 -21 31 28 55 26 10 -24 -13 -39 -61 -45 -26 -4 -45 -32 30 -1 -56 17 16 7 70 30 -73 -81 -142 -80 -74 -74 -104 -72 -28 -33
3796 -33 9 -24 15 29 0 3 -8 -39 -25 -13 46 45 -39 -109 -57 8 -12 2 6 -37 -44 -51 27 19 6 4 -8 -23 -61 -47 -42 -11 -25 -38 -7 -63 -103 -136 -51
3778 -51 8 -67 -124 -72 -49 -87 -97 -127 -120 -174 -78 47 25 -49 -22 -33 -52 -17 50 43 5 -39 2 9 -45 -71 13 12 -1 -31 -55 -15 -25 15 17 -1 4 45
3760 45 65 21 25 31 25 28 -6 1 12 5 69 148 250 556 1704 3223 2222 653 252 103 71 -102 -132 -112 -81 -22 13 -14 -20 -92 -61 -13
3744a3J5k2j2j1MJ4L9j4l1K3k3l6mJ06lp4J5J3l5O3M9pJ4k4m0m0L7K6J4j7nL0nk9Jl0k7N5
3726A6m0N2J8Mr4m3N7rJ8KM4j5o9M7L3LkNJ3j0n7K2M6q8q6M6L4K7qJj8m3M0j9J2l6J5N8n8
3708h2L3orPj4k5L7j7K7K4j7k3j0mJ4J8m8K1qO0L4j6k9k9j2L6L4l0J9N2J0m4l3L2M1n5qqJ
$$ plain form
3744 -13 2 -20 -32 -43 -39 -25 14 0 -31 -8 -31 -67 -71 35 32 -42 -27 -14 -49 14 63 56 70 46 6 -34 3 29 43 26 21 51 46 17 18 -12 -39 16
3726 16 -24 28 46 50 -44 -87 -30 -39 -21 -19 25 10 -59 -12 21 24 22 27 40 30 -27 -5 41 -47 -133 -87 -53 -26 -34 -33 -51 -94 -54 -73 -61 -97 -82 -24 -82
3708 -82 -49 -55 -64 -57 -71 -96 -59 -76 -49 -25 -42 -65 -75 -79 -65 -47 -95 -74 -82 -22 12 -4 -33 -62 -74 -38 -4 -34 -15 37 47 3 -30 2 43 -12 -20 -28 -27
$$ [...]
-1793F6
##END=		$$ NMR SPECTRUM
##END=		$$ LINK
