##TITLE=	13C
##JCAMP-DX=	6.0	$$ MestReNova 14.3.3-33362
##DATA TYPE=	LINK
##BLOCKS=	1    
##ORIGIN=	Mestrelab Research S.L.
##OWNER=	hrzepa
##$MNOVA/METADATA=	(DOCUMENT,BASE64)
eyJuYW1lIjoiRG9jdW1lbnQgMSIsInBhZ2VzIjpbeyJpdGVtcyI6WyIxIiAgICAgXX1dfQ==
##TITLE=	13C
##JCAMP-DX=	6.0	$$ MestReNova 14.3.3-33362
##DATA TYPE=	NMR SPECTRUM
##DATA CLASS=	XYDATA
##BLOCK_ID=	1
##ORIGIN=	Varian
##OWNER=	hrzepa
##NUMDIM=	1
##$MNOVA/METADATA=	(ITEM,BASE64)
eyJhbmdsZSI6MCwiYXhlcyI6eyJ4Ijp7Im1heCI6MjM0LjI2NDY1NzgxNzc5Nzc0LCJtaW4iOi0xNC4
yNjE1NDgyMzExMTU2NjF9LCJ5Ijp7Im1heCI6MjcwLjcyMjM0MzQ0NDgyNDIsIm1pbiI6LTI1LjkwMj
g2NDY5NDU5NTMzN319LCJwb2ludHMiOlt7IngiOjUzMjEsInkiOjU4MzV9LHsieCI6ODcyMiwieSI6N
TgzNX0seyJ4Ijo4NzIyLCJ5Ijo4MjA4fSx7IngiOjUzMjEsInkiOjgyMDh9LHsieCI6NTMyMSwieSI6
NTgzNX1dLCJ6IjowfQ==
##.OBSERVE FREQUENCY=	125.75317950000000167
##.OBSERVE NUCLEUS=	^13C
##.SOLVENT NAME=	cdcl3
##.PULSE SEQUENCE=	s2pul
##LONGDATE=	2019/04/27 07:28:52.000
##.ACQUISITIONMODE=	SIMULTANEOUS
##$ORIGINAL FORMAT=	Varian
##$MNOVA/SCALES_VERSION=	9
##$PARAMETER FILE=	(datafile, ASCII, /private/var/folders/bp/m_4195y96sx1d256lqvkcvym0000gq/T/zusSSkPLR0CDzrqXwbe6bQ/13C/fid, 0)
$$ 
##$PARAMETER FILE=	(header, BASE64, /private/var/folders/bp/m_4195y96sx1d256lqvkcvym0000gq/T/zusSSkPLR0CDzrqXwbe6bQ/13C/fid, 0)
AAAAAQAAAAEAAQAAAAAABAAEAAAABAAcAAAAyQAAAAE=
##$PARAMETER FILE=	(log, ASCII, /private/var/folders/bp/m_4195y96sx1d256lqvkcvym0000gq/T/zusSSkPLR0CDzrqXwbe6bQ/13C/log, 0)
$$ Sat Apr 27 07:28:56 2019: Experiment started
$$ Sat Apr 27 07:31:11 2019: BS 1 completed
$$ Sat Apr 27 07:33:22 2019: BS 2 completed
$$ Sat Apr 27 07:35:33 2019: BS 3 completed
$$ Sat Apr 27 07:37:44 2019: BS 4 completed
$$ Sat Apr 27 07:39:55 2019: BS 5 completed
$$ Sat Apr 27 07:42:06 2019: BS 6 completed
$$ Sat Apr 27 07:44:17 2019: BS 7 completed
$$ Sat Apr 27 07:46:28 2019: BS 8 completed
$$ Sat Apr 27 07:48:40 2019: BS 9 completed
$$ Sat Apr 27 07:50:51 2019: BS 10 completed
$$ Sat Apr 27 07:53:02 2019: BS 11 completed
$$ Sat Apr 27 07:55:13 2019: BS 12 completed
$$ Sat Apr 27 07:57:24 2019: BS 13 completed
$$ Sat Apr 27 07:59:35 2019: BS 14 completed
$$ Sat Apr 27 08:01:46 2019: BS 15 completed
$$ Sat Apr 27 08:03:57 2019: BS 16 completed
$$ Sat Apr 27 08:06:09 2019: BS 17 completed
$$ Sat Apr 27 08:08:20 2019: BS 18 completed
$$ Sat Apr 27 08:10:31 2019: BS 19 completed
$$ Sat Apr 27 08:12:42 2019: BS 20 completed
$$ Sat Apr 27 08:14:53 2019: BS 21 completed
$$ Sat Apr 27 08:17:04 2019: BS 22 completed
$$ Sat Apr 27 08:19:15 2019: BS 23 completed
$$ Sat Apr 27 08:21:26 2019: BS 24 completed
$$ Sat Apr 27 08:23:37 2019: BS 25 completed
$$ Sat Apr 27 08:25:48 2019: BS 26 completed
$$ Sat Apr 27 08:28:00 2019: BS 27 completed
$$ Sat Apr 27 08:30:11 2019: BS 28 completed
$$ Sat Apr 27 08:32:22 2019: BS 29 completed
$$ Sat Apr 27 08:34:33 2019: BS 30 completed
$$ Sat Apr 27 08:36:44 2019: BS 31 completed
$$ Sat Apr 27 08:38:55 2019: BS 32 completed
$$ Sat Apr 27 08:41:06 2019: BS 33 completed
$$ [...]
$$ 0 
$$ wqinit 2 2 8 0 0 4 1 0 1 64
$$ 1 ""
$$ 0 
$$ wshim 4 2 4 0 0 2 1 1 1 64
$$ 1 "n"
$$ 15 "e" "f" "g" "n" "s" "0" "1" "2" "3" "4" "5" "6" "7" "8" "9" 
$$ wtfile1 2 2 15 0 0 3 2 1 1 64
$$ 1 ""
$$ 0 
$$ wtfile 2 2 15 0 0 3 1 1 1 64
$$ 1 ""
$$ 0 
$$ wtune 4 2 4 0 0 2 1 0 1 64
$$ 1 "st12"
$$ 11 "s" "t" "e" "i" "n" "o" "v" "1" "2" "3" "4" 
$$ xy 7 1 19 19 19 2 1 8192 1 64
$$ 1 681 
$$ 0 
$$ x3 7 1 19 19 19 2 1 8192 1 64
$$ 1 7587 
$$ 0 
$$ x2y2 7 1 19 19 19 2 1 8192 1 64
$$ 1 -284 
$$ 0 
$$ x4 7 1 19 19 19 2 1 8192 1 64
$$ 1 0 
$$ 0 
$$ xz2 7 1 19 19 19 2 1 8192 1 64
$$ 1 -1561 
$$ 0 
$$ xz 7 1 19 19 19 2 1 8192 1 64
$$ 1 6948 
$$ 0 
$$ y1 7 1 19 19 19 2 1 8192 1 64
$$ 1 797 
$$ 0 
$$ z3x 7 1 19 19 19 2 1 8192 1 64
$$ 1 476 
$$ 0 
$$ z2 7 1 19 19 19 2 1 8192 1 64
$$ 1 -664 
$$ 0 
$$ yz2 7 1 19 19 19 2 1 8192 1 64
$$ 1 -2835 
$$ 0 
$$ yz 7 1 19 19 19 2 1 8192 1 64
$$ 1 -2906 
$$ 0 
$$ y4 7 1 19 19 19 2 1 8192 1 64
$$ 1 0 
$$ 0 
$$ z1 7 1 19 19 19 2 1 8192 1 64
$$ 1 -18497 
$$ 0 
$$ z0_ 1 1 19 19 19 2 1 73744 1 64
$$ 1 3381 
$$ 0 
$$ z1c 7 1 19 19 19 2 1 8192 1 64
$$ 1 -1044 
$$ 0 
$$ z2xy 7 1 19 19 19 2 1 8192 1 64
$$ 1 5183 
$$ 0 
$$ z2x2y2 7 1 19 19 19 2 1 8192 1 64
$$ 1 -2701 
$$ 0 
$$ z2c 7 1 19 19 19 2 1 8192 1 64
$$ 1 196 
$$ 0 
$$ z2x3 7 1 19 19 19 2 1 8192 1 64
$$ 1 0 
$$ 0 
$$ z3 7 1 19 19 19 2 1 8192 1 64
$$ 1 2579 
$$ 0 
$$ z2y3 7 1 19 19 19 2 1 8192 1 64
$$ 1 0 
$$ 0 
$$ z3c 7 1 19 19 19 2 1 8192 1 64
$$ 1 0 
$$ 0 
$$ z4y 7 1 19 19 19 2 1 8192 1 64
$$ 1 4212 
$$ 0 
$$ z4c 7 1 19 19 19 2 1 8192 1 64
$$ 1 0 
$$ 0 
$$ z3xy 7 1 19 19 19 2 1 8192 1 64
$$ 1 0 
$$ 0 
$$ z3x3 7 1 19 19 19 2 1 8192 1 64
$$ 1 0 
$$ 0 
$$ z3x2y2 7 1 19 19 19 2 1 8192 1 64
$$ 1 0 
$$ 0 
$$ z3y3 7 1 19 19 19 2 1 8192 1 64
$$ 1 0 
$$ 0 
$$ z3y 7 1 19 19 19 2 1 8192 1 64
$$ 1 1029 
$$ 0 
$$ z4 7 1 19 19 19 2 1 8192 1 64
$$ 1 6565 
$$ 0 
$$ z4x2y2 7 1 19 19 19 2 1 8192 1 64
$$ 1 0 
$$ 0 
$$ z4x 7 1 19 19 19 2 1 8192 1 64
$$ 1 -13017 
$$ 0 
$$ z4xy 7 1 19 19 19 2 1 8192 1 64
$$ 1 0 
$$ 0 
$$ z8 7 1 19 19 19 2 1 8192 1 64
$$ 1 0 
$$ 0 
$$ z6 7 1 19 19 19 2 1 8192 1 64
$$ 1 -5568 
$$ 0 
$$ z5x 7 1 19 19 19 2 1 8192 1 64
$$ 1 0 
$$ 0 
$$ z5 7 1 19 19 19 2 1 8192 1 64
$$ 1 -998 
$$ 0 
$$ z5y 7 1 19 19 19 2 1 8192 1 64
$$ 1 0 
$$ 0 
$$ z7 7 1 19 19 19 2 1 8192 1 64
$$ 1 339 
$$ 0 
$$ zx2y2 7 1 19 19 19 2 1 8192 1 64
$$ 1 698 
$$ 0 
$$ zoom 7 1 32767 0 0 4 1 0 1 64
$$ 1 0 
$$ 0 
$$ zxy 7 1 19 19 19 2 1 8192 1 64
$$ 1 -1576 
$$ 0 
$$ zx3 7 1 19 19 19 2 1 8192 1 64
$$ 1 4844 
$$ 0 
$$ zy3 7 1 19 19 19 2 1 8192 1 64
$$ 1 -2037 
$$ 0 
$$ 
##$PARAMETER FILE=	(text, ASCII, /private/var/folders/bp/m_4195y96sx1d256lqvkcvym0000gq/T/zusSSkPLR0CDzrqXwbe6bQ/13C/text, 0)
$$ 
$$ 
##XUNITS=	HZ
##YUNITS=	ARBITRARY UNITS
##FIRSTX=	29456.285383729999012
##LASTX=	-1793.2377791117969537
##DELTAX=	-0.476837158203125
##XFACTOR=	1
##YFACTOR=	0.0075109476398045769627
##FIRSTY=	0.33207905292510986328
##MINY=	-1.2917425632476806641
##MAXY=	246.1112213134765625
##NPOINTS=	65536
##XYDATA=	(X++(Y..Y))
$$ [...]
15815iJ5o6M4k4K2L2l8Lj0lLoRK9K9J4ol7j9L1j5K2kk4%L4k9n1L6Oj4j8RM4K1k7n5L1K2l2
$$ -9 6 -60 -16 -40 -18 14 -24 -21 -31 -34 -31 -37 -28 1 30 44 38 1 -18 13 -2 20 18 -6 -6 28 -1 -52 -16 -10 -24 -42 -33 11 32 5 -50 -19 3 -29
15796b9L3ol9j6NPM2l6oP5L7l8p2K2j6K4K1K3J7J6j2o2j8l3Qjk6N1LK3k2L1om0M7k9k7J0M5
$$ -29 4 -2 -41 -57 -52 -45 -3 -39 -45 30 67 29 -43 -21 -37 -13 8 31 48 64 52 -10 -28 -61 -53 -54 -80 -29 -26 -3 -25 6 0 -40 7 -22 -49 -39 6
15777FnmJ4J1j3L8ql6KK6pnjj2j1M8m1n9R4k3l2N5m4J8m3O3P3n5J5n3Ok2l5N5Q8L1J88L40
$$ 6 1 -3 11 22 9 47 39 3 5 31 24 19 18 6 -5 43 2 -57 37 14 -18 37 -7 11 -32 31 104 49 64 11 17 -5 -40 15 103 134 322 662
15759F62J202R39q35j128m48j84n4n3q1pk4j8K9j7K3Mk8J5rj8lM6k0k7K6k9K5j6j1K2j3L2
$$ 662 1864 2803 1968 840 392 208 154 101 20 13 -11 -29 0 -17 6 10 -18 -3 -12 -30 -33 13 -7 -34 -8 -37 -12 -28 -39 -17 -30 2
15744Bm0J4l3Knk4O3j2L1Qm5jJ0opJKk1J5L0lm2J7J3K4K8j6m4k5J4M8LK8k2l8L5J3rk5QM3
$$ 2 -38 -24 -57 -55 -60 -84 -21 -33 -2 6 -39 -40 -30 -36 -43 -42 -40 -61 -46 -16 -19 -61 -44 -31 -7 21 5 -39 -64 -50 -2 1 29 7 -31 4 17 8 -17 -9 34
15724C4l8jJl1KNO3m6Pm5m5O6Pk2Qj2M5J0kk7j3M7J6n8K5kK7k2j5mlqk0J9J4N1Lq2joJ2OM7
$$ 34 -4 -5 -4 -35 -33 -28 35 -11 -4 -49 -94 -28 -21 -43 -35 -47 -2 8 6 -21 -34 13 29 -29 -4 -6 21 -1 -16 -20 -23 -31 -51 -32 -18 33 36 -46 -47 -53 -41 -35 12
15704A2m6j5L4Kl6KK4mkk2N0K1m7k1J8J1kN7k6jN3k8m2LK5k2n7J01j5p4N0l6m2L3RL9qJ7k1
$$ 12 -34 -49 -15 -13 -49 -47 -23 -27 -29 -51 -1 20 -27 -48 -30 -19 -21 36 10 9 62 34 -8 -5 20 -2 -59 42 27 -47 3 -33 -75 -42 -33 6 -2 15 -6
15685fPK6m1J5N2rm6K4J8m1K6M2m7o0m6M3m1J9L0J9J0MK3ll3k2L8pn2L0Oj5J1L6k8m9kO3N0
$$ -6 1 27 -14 1 53 44 -2 22 40 -1 25 67 20 -40 -86 -43 -84 -65 -35 -16 -6 -2 21 18 -15 -37 1 -6 -58 -28 -22 -37 -26 10 -18 -67 -69 -6 44
15667D4n0jK3j5k4j4J9j7j2k2K5L4J0J6k1k6k8lj3M6j0Jm7L4O4L2nl4k9j6m8J0K4K4M0j9j3
$$ 44 -6 -7 16 1 -23 -37 -18 -35 -47 -69 -44 -10 0 16 -5 -31 -59 -62 -75 -29 -39 -38 -85 -51 13 45 40 6 -23 -39 -87 -77 -53 -29 11 -8 -21
15649b1M0o0k3M8K0qkm1K3o8l0M8K5L4J4K3l4L6p5J3J9j3K0j5M2m9k3K2L7K8j2j9J0o5n8M6
$$ -21 19 -41 -64 -16 4 -4 -6 -47 -24 -92 -122 -74 -49 -15 -1 22 -12 24 -51 -38 -19 -32 -12 -27 15 -34 -57 -35 2 30 18 -1 9 -56 -114 -68
15632f8J8LJ6Nl3J4lJ9L4Qk9l6J0NK8MJ5k0KJ6k4L8k7J0k0l7Ml3P9P4kk1q7j2%m5k5K5L3L5
$$ -68 -50 -47 -31 -26 -59 -45 -48 -29 5 13 -16 -52 -42 -37 -9 -5 10 -10 -8 8 -16 22 -5 5 -15 -52 -48 -81 -2 72 70 49 -38 -50 -50 -95 -120 -95 -62 -27
15613b7n4nL9L8k7J8npQM2k2m2K3L2m9k2P9L6Ll9oKJ3nmm7k7mPplM7K2mJ3k4j9L5j6l2Kl7
$$ -27 -81 -86 -47 -9 -36 -18 -23 -30 -22 20 -2 -44 -21 11 -38 -60 19 55 58 19 13 15 28 23 19 -28 -55 -59 -52 -59 -62 -15 7 3 16 -8 -27 8 -8 -40 -38 -75
15593g5L6J7lj6QNk5JJ3J0M2j9j1n1M4L7L2k3j7L0j7m3noJl4Nk8J7%L3L2j7l2K6K5k7J8k5
$$ -75 -39 -22 -25 -41 -33 -28 -53 -52 -39 -29 13 -6 -17 -68 -24 13 45 22 5 35 18 -25 -30 -36 -35 -69 -64 -92 -75 -75 -42 -10 -27 -59 -33 -8 -35 -17 -42
15574d2%jk6J4mPQJ2%J1rJ0m4k5O7N6j3m1mk8K6j6k7M8L0m4k2j0J5J6K9Kj8m1J3N6k3%Nn4
$$ -42 -42 -43 -69 -55 -59 -52 -44 -32 -32 -21 -30 -20 -64 -89 -22 34 21 -20 -24 -52 -26 -42 -69 -21 9 -35 -57 -67 -52 -36 -7 -5 -23 -64 -51 5 -18 -18 -13 -67
15555f7J5L1j1L9j2RK6l9J8j7l3J2J4N4o2Rm1k9N2M1l3LK6M2l9m7K9R6l6m8pLm1N1k0J4J2
$$ -67 -52 -21 -32 7 -5 4 30 -9 9 -8 -41 -29 -15 39 -23 -14 -55 -84 -32 9 -24 -21 5 47 8 -39 -10 86 50 2 -5 -2 -43 8 -12 2 14
15537A4j0pJ0l7OPl0L3J9j2m6lK4j4J3K0L4k9l4K5J4j7LJ8j3LL6N4l6k9J6m1j8jl3k2M8J5
$$ 14 4 -3 7 -30 -24 -17 -47 -14 5 -7 -53 -56 -32 -46 -33 -13 21 -8 -42 -17 -3 -20 -17 1 -12 -9 27 81 45 16 32 -9 -27 -28 -61 -83 -35 -20
15519b0J6o4K0lp3P3K5m7O2mK1K0k1qPK4k9K0J3n9N5k3Pm1m9O9k7L4n8L3l5O1ok2J8Qm4l8
$$ -20 -4 -68 -48 -51 -124 -51 -26 -73 -11 -15 6 26 5 -3 4 28 -1 19 32 -27 28 5 12 -29 -78 -9 -36 -2 -60 -27 -62 -1 -7 -29 -11 -3 -47 -85
15501h5mN9J8J5j8M4J2k1j9k6k5OML6K4j1J5k1m0J4K0Nl8L7k7rJ07m3k8l9LMJ8j2k1PrJ9j4
$$ -85 -89 -30 -12 3 -15 29 41 20 1 -25 -50 -44 -40 -4 20 9 24 3 -37 -23 -3 2 -36 1 -26 -35 72 29 1 -38 -35 -31 -13 -25 -46 -39 -48 -29 -43
15483d3J0j5l3J7qj3NN5J1lLM2Pl3Qj0k9MJ3l8J5mm5P5N5m6k1k2nK0J4Nj7P0K5rl9R1J20J78
$$ -43 -33 -48 -81 -64 -72 -85 -80 -25 -14 -17 -14 28 35 2 10 0 -29 -25 -12 -50 -35 -39 -84 -9 46 0 -21 -43 -48 -28 -14 -9 -26 44 69 60 21 112 232 410
15463D10O28J556M71j269j128m07j06p6Jm4Nk8k9rL9L6q1j9nLJ8M1l8ROk6K2K9J9ok5m0k3
$$ 410 1038 2594 3065 1796 668 261 155 79 80 36 41 13 -16 -25 14 50 -31 -50 -55 -52 -34 7 -31 -22 -16 -42 -20 9 28 22 -3 -43 -66
15448f6M7rL1J2j9kl2%O8n0Rp2K1O6n4M6%k3l2m8N0N%LL2K2J2NJ0j0Pq5pL4L2j2K8Ro6L7k
$$ -66 -19 -28 3 15 -4 -6 -38 -38 30 -20 -11 -83 -62 4 -50 -4 -4 -27 -59 -107 -57 -52 -52 -49 -17 5 17 22 32 22 29 -56 -63 -29 3 -9 19 28 -38 -1 -3
15428ck2k6M6J5j0m1l0K1K1j0N8m5j7QK8j3n5O4M5j20J3j0O3J9Kl4LJL9qjk1Pj1%pJ7Mj1k3
$$ -3 -25 -51 -5 10 0 -41 -71 -50 -29 -39 19 -26 -43 -35 -7 -20 -75 -11 34 -86 -73 -83 -20 -1 1 -33 -30 -29 10 2 1 -20 -13 -24 -24 -31 -14 -10 -21 -44
15409d4J5K4j6l1K6l2L3K4j4oj7kQJ0j6J9k0J3MO7mk4j8k9N1k4l0MON0k%qJ2k7n8k3L5M1K8
$$ -44 -29 -5 -21 -52 -26 -58 -25 -1 -15 -21 -38 -40 -32 -22 -38 -19 -39 -26 -22 45 41 17 -1 -30 21 -3 -33 -29 -23 27 25 25 17 29 2 -56 -79 -44 -3 25
15390B5K8k4l4qK7Qq4JO9Mp9oM3KJ4l7lM7J8l2j8LkNRk3K0M4j8NMn5nK2qNN4J2l8o3M1O6K
$$ 25 53 29 -5 -13 14 22 -62 -61 8 12 -67 -73 -30 -28 -14 -51 -54 -7 11 -21 -39 -36 -38 -33 -24 -47 -27 17 -1 4 8 -47 -52 -30 -38 -33 21 33 -5 -68 -27 39 41
15370D1k4j1l9k6N4nk7kl2J5O6O1l0l4Jjp5lL1k0M5L4Rl3j4J4m6J4L7J5km4M6Po4lL1L4m1
$$ 41 17 6 -33 -59 -5 -10 -37 -39 -71 -56 10 71 41 7 8 7 -68 -71 -40 -60 -15 19 28 -5 -19 -5 -51 -37 0 15 13 -31 15 22 -42 -45 -14 20 -21
15351b1l9oJ1k8N2K4On2J3k3J8j0RL9k6k3M1l0j7M7L0j6K2j3m9J9jN2k9l8j2J5L1m4qJ6JK5
$$ -21 -60 -66 -55 -83 -31 -7 -1 -53 -40 -63 -45 -55 -46 -7 -33 -56 -15 -45 -62 -15 15 -1 21 8 -41 -22 -23 29 0 -38 -50 -35 -4 -48 -56 -40 -39 -14
15333a4K8k1J5JL2m4j5p9k7J01l6J6K2J3LMj6k4O5k7Rl4k8M6LL1Pp9M7N2n3jK2k9j7k6PN4
$$ -14 14 -7 8 9 41 -3 -18 -97 -124 -23 -59 -43 -21 -8 -5 -1 -17 -41 24 -3 6 -28 -56 -10 -7 24 31 -48 -1 51 -2 -3 19 -10 -27 -53 -46 8
15315HL3J6m0n3j6J3k8K7j9k3K5k9L4M9J1NK7l3JL5K2m0k3n0J9k6M1K0j1RJ0j3J3Jl7rQJ8
$$ 8 41 57 17 -36 -52 -39 -67 -40 -59 -82 -57 -86 -52 -3 8 13 40 7 8 43 65 25 2 -48 -29 -55 -14 6 -5 4 14 1 14 15 -22 -31 -23 -5
15297eJ9Kl0l1K7l3K4Jk7J9P4kql2nN0l5J8l0l2K4pj9L9k9Ml2k6J5J9M4m5j1L8nN8jk7l1K
$$ -5 14 16 -14 -45 -18 -51 -27 -26 -53 -34 40 38 30 -2 -7 43 8 26 -4 -36 -12 -19 -38 1 -28 -24 -56 -82 -67 -48 -4 -49 -60 -22 -27 31 30 3 -28 -26
15278b6J4J2km6J8K6K9o1l3L9j7K5NJ9j2J7lrk3Mj5l4L1K3J9Kkpl1J6K6L0K4n9l5M3ok0nJ6
$$ -26 -12 0 -2 -48 -30 -4 25 -36 -69 -30 -47 -22 -17 2 -10 7 4 -5 -28 -24 -39 -73 -42 -19 0 2 0 -7 -38 -22 4 34 58 -1 -36 7 1 -19 -24 -8
15258hj2LN7q5k6N9K1J9J0j1j3l1qN5q9oM9j1KK8J2J7Pm7n7J8LPj5K1l3K6K6Qok1Rj0MkJ3
$$ -8 -20 -17 40 -45 -71 -12 9 28 38 27 14 -17 -25 30 -59 -65 -16 -27 -25 3 15 32 39 -8 -65 -47 -44 -37 -52 -31 -64 -38 -12 -4 -10 -31 -22 -32 -28 -30 -17
15239a7Nm9k2RKJ6j1J2L8P2k3n1k5N1K0l0o8L0K6%l1M1K2m4k4JJ0M5K5L1p8m3OKL9oPrJ7R
$$ -17 -12 -61 -83 -74 -72 -56 -67 -55 -17 55 32 -19 -44 7 27 -3 -71 -41 -15 -15 -46 -5 17 -27 -51 -50 -40 5 30 61 -17 -60 -54 -52 -13 -19 -12 -21 -4 5
15220ERm9J5n3J5O9l4l2PK6Ook2K1N9n9m3l7oO2qL0pK5j7l3P2L0n0L6l4k6M1oq4L9N1%Mj3
$$ 5 14 -35 -20 -73 -58 11 -23 -55 -48 -22 -16 -22 -44 -23 36 -23 -66 -103 -109 -47 -55 -25 -32 -7 -24 -57 15 45 -5 31 -3 -29 12 6 -78 -39 12 12 16 3
15201Co7M1J5kj6KK4j3MLl4QN3j6k1J3Ok9J1j7m1N7M3n0K9l0l1l9K3j4O3jK0jO2q1o2O3k3
$$ 3 -64 -23 -8 -10 -26 -24 0 -13 -9 -6 -40 -32 21 5 -16 -3 3 -26 -15 -32 -73 -16 27 -23 6 -24 -55 -94 -71 -85 -22 -23 -3 -4 58 -23 -85 -22 -45
15182d5PJ2jjk0K2L8k5OJ3pmm8R4Lm3J3L1j3k8L3ol6j6J7l8J9nM9L2k7m3k0K3k8M6K2J7l9
$$ -45 -38 -26 -27 -28 -48 -26 12 -13 -7 6 -1 -5 -53 41 44 1 14 45 32 4 37 31 -5 -21 -4 -42 -23 -28 21 53 26 -17 -37 -14 -42 4 26 43 4
15164DLK8l9pnPm7J3O2J9m9k8Oj1k7K4J3J5j6ML1mJ4l8k3Pqj6K8lj1J0N1rPm6NQk5L0nk8K1
$$ 4 7 35 -4 -11 -16 -9 -56 -43 19 38 -11 -39 -33 -44 -71 -47 -34 -19 -35 -31 0 -4 10 -28 -51 -44 -52 -68 -40 -43 -54 -44 7 -2 5 -41 -36 -28 -53 -23 -28 -56 -35
15143c5m2K7nLL6j6N9jk7o6M0M1k0nj7lQMn7jO5j9K2k8jnJ0RonJ5rj5L0rJ4J2J2l5j6QM2m4
$$ -35 -77 -50 -55 -52 -16 -32 27 26 -1 -67 -27 14 -6 -11 -28 -31 -23 -19 -76 -77 -12 -31 -9 -37 -38 -43 -33 -24 -30 -35 -20 -29 -44 -14 -23 -9 3 15 -20 -36 -28 14 -30
15123c0j6j0N5qrm6QQMkqL4J0m6L9k4N1j9Jl4Q1Ml6jk7J1pM0j1K9j5j6lqM9km9pJ2j4Rk5m4
$$ -30 -46 -56 -1 -9 -18 -64 -56 -48 -44 -46 -54 -20 -10 -56 -17 -41 10 -9 -8 -42 39 43 7 6 -21 -10 -17 23 12 41 26 10 7 -1 48 46 -3 -10 2 -12 -3 -28 -72
15102g2M7k7o9O0K5j0J00k1KK3n1M7j4l9L6K1qmk8m3OK0ok9J1lj5N1j8kl7l3K1J1J2l3K2L3
$$ -72 -25 -52 -121 -61 -36 -46 54 33 35 58 7 54 40 1 37 58 50 46 18 -25 -19 1 -5 -34 -23 -26 -41 10 -8 -10 -47 -80 -59 -48 -36 -69 -47 -14
15084a4RlOOk1j1Jj4qJ9K8MJ9Oj9l2m3qO1J0JJ3n7m0j6%k0N4J2K7L0k1l1L5rm3K6O7Mj4Mo9
$$ -14 -5 -8 -2 4 -17 -28 -27 -41 -49 -30 -2 2 21 27 8 -24 -67 -75 -14 -4 -3 10 -47 -87 -103 -103 -123 -69 -57 -30 0 -21 -52 -17 -26 -69 -43 24 28 14 18 -51
15064e1k9J4L4J1l7Ro1K8M1l8J08M1k9rk6n9JoM1J3l6K0j6K2MpJ0j2Mk0l6L4L3L6m1l6l0j2
$$ -51 -80 -66 -32 -21 -58 -49 -110 -82 -41 -79 29 70 41 32 6 -53 -52 -58 -17 -4 -40 -20 -36 -14 -10 -17 -7 -19 -15 -35 -71 -37 -4 32 -9 -45 -75 -87
15046h7M2M9N1oo0l3lK9j2K0L4J5l5Kj4j1k8J2k5K7L6m4K1l8P3l1m1QJ9K6j7n0KP7MK7n3K2
$$ -87 -45 4 55 49 -11 -44 -47 -18 -30 -10 24 39 4 6 -8 -19 -47 -35 -60 -33 3 -41 -20 -58 15 -16 -57 -49 -30 -4 -21 -71 -69 8 12 39 -14 8
15028HjoJ4o0oM3l4N0RMnm8rL4K7l7lK7j0l2lK2L3jl3lk3K4M0l2On2N0K8l7lRL0nm4Rkk4J0
$$ 8 7 1 15 -45 -51 -8 -42 8 17 21 16 -32 -41 -7 20 -17 -20 7 -3 -35 -38 -16 17 16 -17 -20 -43 -19 21 -11 -5 -57 -7 21 -16 -19 -10 20 15 -29 -20 -22 -46 -36
15007c6J7j8lM2L7k7j6J2%JJ7Km5j0k4L8M3JL0J4j7l7K8M3K2k9N4J43MJ11J75L25O08J446
$$ -36 -19 -37 -40 2 39 12 -4 8 8 9 26 28 -17 -27 -51 -13 30 31 61 75 58 21 49 92 114 85 139 282 286 397 572 897 1505 2951
14990B951K592O97k163k004r23m66k44o0q4q1p5o8N5k5j03PkK8Rj3Qn4k2J1L7j6j2k8MOO9
$$ 2951 5543 6240 4077 2073 1150 684 440 380 296 215 140 72 127 102 -1 6 4 32 41 28 36 -18 -40 -29 8 -8 -20 -48 -44 -38 31
14976C1Mk5L5j5L7l8m7L1oqNPJ7Qj0k0Pl9kN2pMl4K6K4M9m1j4K6l3Lm1nJ9P5k2mJ2o9l5j2
$$ 31 35 10 45 30 67 29 -18 13 7 -1 4 11 28 36 26 6 13 -26 -28 24 17 21 -13 13 37 86 45 31 57 24 27 -14 -19 0 75 53 49 61 -8 -43 -55
14956e5N1L7nL5j8K8j5k6l1K0n3M1L4n8j3j3K1J5n4j6L0J27m0p7l4pK4Ok2JR4k6l3K6K7m5
$$ -55 -4 33 28 63 45 73 58 32 1 21 -32 9 43 -15 -28 -41 -20 -5 -59 -75 -45 82 42 -35 -69 -76 -52 -46 -68 -67 27 1 -32 -6 21 -24
14939b4J1n3n6M9J8l%nL3qJ7k2NPL6J7nj6k5M4K4m6kj8L9L0J1l0p2k3K6K5j9N4m5k5K2J8J1
$$ -24 -13 -66 -122 -73 -55 -58 -58 -63 -30 -38 -21 -43 -38 -31 5 22 17 1 -24 20 44 -2 -4 -22 17 47 58 28 -44 -67 -41 -16 -35 19 -26 -51 -29 -11 0
14920@j9k3K2JLJ0ronk6K3J9mn9K4J4J2k8K4Oj1mL8J9n0QK7l9Nk7K7k2N4j0j0k3k2L3P8ln5
$$ 0 -19 -42 -20 -19 -16 -6 -15 -21 -26 -52 -29 -10 -14 -73 -49 -35 -23 -51 -27 -21 -32 -36 2 21 -29 -21 6 -33 -28 -55 -28 -50 4 -6 -16 -39 -61 -28 50 47 -8
14901hL9j3j0J3q2rMj0NJ5K0j5Q2J7k0l3l2K7J9J3k4K3pm8OJ6J9N1j5m9j8k0M7k5L2L4p5j5
$$ -8 31 18 8 21 -61 -70 -66 -76 -71 -56 -36 -51 31 48 28 -5 -37 -10 9 22 -2 21 14 -34 -28 -12 7 58 43 -6 -24 -44 3 -22 10 44 -31 -46
14883d6K1K0J5p9N0QJ7K1j9M1Jn7K1K0k9l1j3M7k7o3K3M0J1j7POJ4K8j5m9N7k7o4K9P1j2J3
$$ -46 -25 -5 10 -69 -19 -11 6 27 8 49 50 -7 14 34 5 -26 -39 8 -19 -82 -59 -19 -8 -25 -18 -12 2 30 15 -34 23 -4 -68 -39 32 20 33
14865C3j2j8k6j8Nk1K8L9L2l6m4j5J2k8J2J04J1k5p7m3L0O3Jj8m2l1J5jK1l9K4O5k6kl9K2
$$ 33 21 3 -23 -41 -36 -57 -29 10 42 6 -38 -53 -41 -69 -57 47 58 33 -44 -87 -57 6 7 -11 -53 -84 -69 -70 -49 -88 -64 1 -25 -27 -66 -44
14848d4K1L7K0j5J4J2n0m4L1k0JL5k7K2nj4K6nlmj4m5L3j5K0M3k4m2M4J9l7l6L1j0L3p0j2
$$ -44 -23 14 34 19 33 45 -5 -49 -18 -38 -37 -2 -29 -7 -12 -26 0 -5 -8 -12 -26 -71 -38 -53 -33 10 -14 -56 -12 7 -30 -66 -35 -45 -12 -82 -94
14830i4N1qNl0RN7K9l5j2K1J4m1Lm2%J7L7KJ3k0k4l4L7j7J4J7l7L5jK2L0j1k2n5L8mklRL7
$$ -94 -43 -51 -46 -76 -67 -10 19 -16 -28 -7 7 -34 -31 -73 -73 -56 -19 -17 -4 -24 -48 -82 -45 -62 -48 -31 -68 -33 -34 -12 18 7 -15 -70 -32 -36 -38 -41 -32 5
14811Ej7k2M1K5l6NM5k7QL9m3l0oj1K5m3j3%L8K6oMj9l6lj0J5Nk9K8J5j9j2K2J4qk8K1L3j
$$ 5 -12 -34 7 32 -4 1 46 19 27 66 23 -7 -13 -24 1 -42 -55 -55 -17 9 3 7 -12 -48 -51 -61 -46 -41 -70 -42 -27 -46 -58 -36 -22 -30 -58 -37 -4 -5
14792ekMNL2n4J7k1K4Pk0jjkm0K6j2qM2k2Klk2J8MJ9n4K2%l4j3L0K7j0j5M0L6Oo4kK3L2j5
$$ -5 -7 -3 2 34 -20 -3 -24 0 7 -13 -14 -15 -17 -57 -31 -43 -51 -9 -31 -29 -32 -54 -36 -32 -13 -67 -45 -45 -79 -92 -62 -35 -45 -60 -20 16 22 -42 -44 -21 11 -4
14772dM0k6q8K4J0j1L5N0M7n4k8m5L8l0j9m3L6K6j3oK7j1K7ok0pnj9O3J2Jk1J4j0l3Ql6LK1
$$ -4 36 10 -78 -54 -44 -55 -20 30 77 23 -5 -50 -12 -42 -61 -104 -68 -42 -55 -61 -34 -45 -18 -24 -44 -51 -56 -75 -12 0 1 -20 -6 -16 -49 -41 -77 -74 -53
14753e3J3K8Ml2L7K3q5l7J9M7QK3j7Lkj4n8j7K8N5rJ3l2k4K8K4k4KMM0k2RM7k3Np6l4L6K6
$$ -53 -40 -12 -8 -40 -3 20 -65 -102 -83 -36 -28 -5 -22 -19 -21 -35 -93 -110 -82 -27 -36 -23 -55 -79 -51 -27 -51 -49 -45 -5 -27 -18 29 6 11 -65 -99 -63 -37
14735c7%qkl2M1M5j2J9j5q0L6J3L3K3lj5k4J0k3jJ4n0k3M3M3K2l0l1m3P7M0l1m3K7L0k1m4
$$ -37 -37 -45 -47 -79 -38 7 -5 14 -1 -81 -45 -32 1 24 21 6 -18 -8 -31 -32 -18 -68 -91 -48 -5 17 -13 -44 -87 -10 30 -1 -44 -17 13 -8 -52
14717e2KK5N3o4J7j0L2K0j6O1Lk1l8mL6j8j2rmj2L0mpj8lmk1M3Jn6m8NP2lk8M0J8J5km2LQ
$$ -52 -50 -25 28 -36 -19 -29 3 23 7 68 71 50 12 8 44 26 14 5 1 -11 19 15 8 -10 -13 -17 -38 5 6 -50 -98 -93 -21 -24 -52 -12 6 21 19 -23 -20 -12
14697a2nKK0J4k5l8J3k1j3L8N4l2m4k8K1Q0M9n1n0k8L9l9K6L0j7J6j9Oj6J1KoLpn0N0K6l2
$$ -12 -17 -15 5 19 -6 -44 -31 -52 -65 -27 27 -5 -49 -77 -56 24 73 22 -28 -56 -17 -56 -30 0 -17 -1 -20 -14 -30 -19 -17 -23 -20 -27 -77 -27 -1 -33
14679c3k3M2l4nL1rM8o5K4lj5JOj9M6j5Qj0J4j6n1O2j8L1ppn8N9Jj4K2PJJ4m3mK4K7Mm3J5
$$ -33 -56 -14 -48 -53 -22 -31 17 -48 -24 -27 -42 -41 -35 -54 -8 -23 -15 -25 -11 -27 -78 -16 -34 -3 -10 -17 -75 -16 -15 -29 -7 0 1 15 -28 -32 -8 19 23 -20 -5
14660eLn6l1N1K1l9m9R2k9K2Nj5pk0L7K3o1M9Plm3nM3m2j8J2l6k8J6N2L5J1k0qPlm6L2PJ8
$$ -5 -2 -58 -89 -38 -17 -56 -105 -13 -42 -20 -15 -30 -37 -57 -20 3 -58 -9 -2 -5 -48 -53 -10 -52 -70 -58 -94 -122 -106 -54 -19 -8 -28 -36 -29 -32 -78 -46 -39 -21
14640b1qpL5K1K0l1m6M0j3k5K5Ol2k4qO1Rm0nLL9l3K2J4Oj2Kk7k4j5L1J6rk4L6ok7l1K5M7
$$ -21 -29 -36 -1 20 40 9 -37 3 -10 -35 -10 -4 -36 -60 -68 -7 2 -38 -43 -40 -1 -34 -12 2 8 -4 -2 -29 -53 -68 -37 -21 -30 -54 -18 -24 -51 -82 -57 -10
14621a0%k7ol7J8M2rj6%P5Ll7K0K4k1k1k0j6j7k6mJ3K2O1Nm8pj0QL1l2rL3k3LK2np0K8M2K
$$ -10 -10 -37 -43 -80 -62 -20 -29 -45 -45 30 33 -4 16 40 19 -2 -22 -38 -55 -81 -85 -72 -50 11 16 -32 -39 -49 -41 -10 -42 -51 -18 -41 -38 -16 -21 -91 -63 -21 -19
14602a9qk1L7K5Pk9n0K0j7L9Nk3j7J0Jk6K7j9L3P7K7o9l0l3L4j6Rl0mK8L3kJ8J3p9J3J7j4
$$ -19 -27 -48 -11 14 21 -8 -58 -38 -55 -16 -11 -34 -51 -41 -40 -66 -39 -58 -25 52 79 10 -20 -53 -19 -35 -26 -56 -60 -32 1 -1 17 30 -49 -36 -19 -33
14584c3lM3LOql7j0L2K3k6j1J9m7j4j4K7K6k8J6K3k1J5K6m0K4LL0lp1J3M2j2m0NQQlm0N2p
$$ -33 -36 7 10 16 8 -29 -39 -7 16 -10 -21 -2 -49 -63 -77 -50 -24 -52 -36 -13 -34 -19 7 -33 -9 -6 24 21 -50 -37 5 -7 -47 -42 -34 -26 -29 -69 -17 -24
14565b4J7J2K5l0K0l0jj6K0O4k9n3J7KrlL9J0p2k1O3Rn0j5l5M7Mql6J1L7K8p2J0QrNNJ3j3
$$ -24 -7 5 30 0 20 -10 -11 -27 -7 57 28 -25 -8 -6 -15 -18 21 31 -41 -62 1 10 -40 -55 -90 -43 -39 -47 -83 -72 -35 -7 -79 -69 -61 -70 -65 -60 -47 -60
14546f0J7L2l3L5mJ6qo3L5Pm8L0QJ1k9%k8K3k0L5L0jjkRk6jK1N2q0k8O2pj0k5N4J6o2j4j7
$$ -60 -43 -11 -44 -9 -13 3 -5 -68 -33 -26 -74 -44 -36 -25 -54 -54 -82 -59 -79 -44 -14 -15 -16 -18 -9 -35 -36 -15 37 -43 -71 -9 -16 -26 -51 3 19 -43 -57 -74
14527g4OjJ0K7J7pl0N8lq0K2J4K7L4l1lqOK7L1j1n8J8J5l5P3o3mJ5J8j2k6j0j4M9l0pJ9Pn5
$$ -74 -68 -69 -59 -32 -15 -22 -52 6 3 -77 -55 -41 -14 20 -11 -14 -22 -16 11 42 31 -27 -9 6 -29 44 -19 -23 -8 10 -2 -28 -38 -52 -3 -33 -40 -21 -14 -69
14507f9P8K4j8n0J7O8ql7m4j1Rl9m4N4R5rn3j1P2J1l9j7k5J9L7l0L1K7Oo0K7k9K3Lk5RM5k9
$$ -69 9 33 15 -35 -18 50 42 5 -39 -50 -41 -80 -124 -70 25 16 -37 -48 24 35 -4 -21 -46 -27 10 -20 11 38 44 -16 11 -18 5 8 -17 -8 37 8
14489Hjl0j8L4Kk4kRK4l5K1o0J1M4J8rm8Jk3qK4k5K6K1p2K4K3J1J7L2n6j9L2N4N3p9MN8Rm1
$$ 8 7 -23 -41 -7 -5 -29 -31 -22 2 -33 -12 -72 -61 -17 1 -8 -56 -55 -78 -86 -62 -87 -61 -40 -112 -88 -65 -54 -37 -5 -61 -80 -48 6 59 -20 -16 42 51 10
14470A0l4L1l3n0P0jpj8K0j0k4j7M7o6M6j1Mm2L1K8K3Rl2J2l0oJ6k1L1ml1P2m8oK2L8Qk2l4
$$ 10 -24 7 -26 -76 -6 -7 -14 -32 -12 -22 -46 -63 -16 -82 -36 -47 -43 -85 -54 -26 -3 6 -26 -14 -44 -50 -34 -55 -24 -28 -59 13 -35 -41 -19 19 27 5 -29
14452b9j7L7J5k2m4k1J6RLK1j4j9L5l2L2N3k7qJ6j3J6j5kRqmJj8%l7K9pL2kp3%M7NNk3k8O6
$$ -29 -46 -9 6 -16 -60 -81 -65 -56 -53 -32 -46 -65 -30 -62 -30 23 -4 -12 4 -9 7 -8 -10 -1 -9 -13 -12 -30 -30 -67 -38 -45 -13 -15 -88 -88 -41 -36 -31 -54 -82 -16
14432a6l0j1M2L8m8J0np5J6K3L3K8N2j1pn7qrK5mn3j4KjP6km4k4K1j2M0lK1l9NQ1rl6m1l4
$$ -16 -46 -57 -15 23 -25 -15 -20 -95 -79 -56 -23 5 57 46 39 -18 -26 -35 -10 -14 -67 -81 -79 -80 -4 -6 -50 -74 -53 -65 -25 -28 -7 -46 -41 40 31 -5 -46 -80
14413h0J0k8K6RO1l1n1N2J5QJ7N4Qn4%l6qj4j4O6j8lj0q5R3O1%m7m5pL4l7L8l1m6K0O9m6j0
$$ -80 -70 -98 -72 -63 -2 -33 -84 -32 -17 -9 8 62 70 16 16 -20 -28 -42 -56 10 -8 -11 -21 -106 -13 48 48 1 -44 -51 -17 -54 -16 -47 -93 -73 -4 -50 -60
14394f0qRM5N2rl2L%mLk4qJ5j4K4j9kQ1l6rk8PLk0nMk2j3L6M4n2j1n8K0M0j1k2J1L2M8Lm9
$$ -60 -68 -59 -14 38 29 -3 0 0 -4 -1 -25 -33 -18 -32 -8 -27 -29 52 16 7 -21 -14 -11 -31 -36 -32 -54 -67 -31 13 -39 -50 -108 -88 -48 -59 -81 -70 -38 10 13 -36
14374c6%JqM4k0nj3J4l1R6j9o0K2J2k0Q1l2n9NK0K8n2k7M6L7l6K1l5JK8J0m3K1QM9nn3K9r5
$$ -36 -36 -35 -43 1 -19 -24 -37 -23 -54 42 23 -37 -15 -3 -23 58 26 -33 -28 -8 20 -32 -59 -13 24 -12 9 -26 -25 3 13 -30 -9 -1 48 43 -10 19 -76
14355g6K1O6l6Om5J3j0k1L6K9ML1j1l7mK8oJ9m4K4o6lP9K9l0k0J6L8K6l7q0L6m0jO3l5k8N9
$$ -76 -55 11 -25 -19 -64 -51 -61 -82 -46 -17 -13 18 7 -30 -34 -6 -12 7 -37 -13 -79 -82 -3 26 -4 -24 -8 30 56 19 -61 -25 -65 -66 -3 -38 -66 -7
14337gj5KK0l0k6K5K7qLKll1L6J7m6J0K6o7M0Kk6M5k3o6M0K7l4K7Pl4L1J5k0PJJ1N7j7m2P
$$ -7 -22 -20 0 -30 -56 -31 -4 -12 -9 -7 -10 -41 -5 12 -34 -24 2 -65 -25 -23 -49 -4 -27 -93 -53 -26 -60 -33 -26 -60 -29 -14 -34 -27 -26 -15 42 25 -17 -10
14318a0M2K3j9k4l8OK7M3l9J4rm8j0l2RKJ7M2p5K7kn5K7L9L5qj3N2l1K7lj0po9L2K5k0kKp
$$ -10 32 55 36 12 -26 -20 7 50 11 25 16 -32 -42 -74 -65 -63 -46 -4 -79 -52 -54 -109 -82 -43 -8 -16 -29 23 -8 19 16 6 -1 -70 -38 -13 -33 -35 -33 -40
14299d0K8L9lk7j5j6k8L8j2nQj6kJ2l3nK7K6L2k6m0L2KJ1n0j8K9L2j0l7NK9lj6J3lqL1MJ0
$$ -40 -12 27 24 -3 -18 -34 -62 -24 -36 -41 -33 -49 -51 -39 -72 -77 -50 -24 8 -18 -58 -26 -24 -13 -63 -81 -52 -20 -30 -67 -62 -33 -36 -52 -39 -42 -50 -19 -15 -5
14280el5k3k2K7P6m2l6%M6rN3l6mj6M3l1k6mk8M1L2j9L6K3Ln3j1j3J9J9L4n6o3J7L0K9J2J4
$$ -5 -40 -63 -85 -58 18 -24 -60 -60 -14 -23 30 -6 -10 -26 17 -14 -40 -44 -72 -31 1 -18 18 41 44 -9 -20 -33 -14 5 39 -17 -80 -63 -33 -4 8 22
14262B2lLn9PjJ2lm6M7jJ6NoJ9Qp1j6M4rJK5J8J0m4k0k9L2K6Jl2PKj6N0k8%k3j7n2M4k6K1
$$ 22 19 22 -37 -30 -31 -19 -22 -68 -21 -22 -6 -1 -7 12 20 -51 -67 -23 -32 -31 -6 12 22 -22 -42 -71 -39 -13 -12 -44 -37 -35 -51 -1 -29 -29 -52 -69 -121 -77 -103 -82
14242h2M6olk2L6J8L6j7m7L3K3M5mk2l4n1nKL7N1L3m5r8lK9L0%MJj7o1L6J1N2pkK5no6jnJ3
$$ -82 -36 -42 -45 -67 -31 -13 23 6 -41 -8 15 60 56 34 0 -51 -56 -54 -17 34 67 22 -76 -79 -50 -20 -20 -16 -15 -32 -93 -57 -46 6 -1 -3 22 17 -49 -50 -55 -42
14222d2L2rKL2rn4JJ8L4j2k2qK2oL4o2j9M9Lm3K0k6l0M0O6m8jN2%l4m8l5KP9k6qL3J0JK5l9
$$ -42 -10 -19 -17 15 6 -48 -47 -29 5 -7 -29 -37 -15 -21 13 -49 -68 -19 -16 -59 -39 -65 -95 -55 11 -37 -38 14 14 -20 -68 -103 -101 -22 -48 -56 -23 -13 -12 13 -26
14202b6l6jm0J6N9K0K1J6j2j7o8L9M0J8K6m2m9j5jqK7K7rk2oKkj9J9l4k5M3lJ9J1OM2k5j7
$$ -26 -62 -63 -103 -87 -28 -8 13 29 17 0 -68 -29 11 29 55 13 -36 -51 -52 -60 -33 -6 -15 -37 -43 -41 -43 -62 -43 -77 -102 -59 -62 -43 -32 -26 16 -9 -26
14184b6k1Nj9K2k2oRrj4O8l5j8M0K4j3qJl3N1K2o7M0K5j7l0j7Ok2N7J1k7p3LJ3J5M3l2j3j2
$$ -26 -47 -42 -61 -39 -61 -67 -58 -67 -81 -13 -48 -66 -26 -2 -15 -23 -22 -55 -4 18 -49 -9 16 -1 -31 -48 -42 -64 -7 4 -23 -96 -93 -80 -65 -22 -54 -67 -79
14165g9M9M3K8mk2j4m8j3j3L9RL0J0l0pl4Oj7N7Nl1M5Ml2L7m3l8J1N6K9n2k9J1K7Jl5J3N4
$$ -79 -30 13 41 37 15 1 -47 -60 -73 -34 -25 5 15 -15 -22 -56 -50 -67 -10 -5 -36 9 13 -19 18 -25 -63 -52 4 33 -19 -48 -37 -10 -9 -44 -31 23
14147B3k4J7J0k7m5k3K6M8l1j6M8K8l2k3M6p6J8L6kj4n6rL7J4Q1j4n9l0K8M0l9MJ3pJ8K2J5
$$ 23 -1 16 26 -1 -46 -69 -43 5 -26 -42 6 34 2 -21 25 -51 -33 3 1 -13 -69 -78 -41 -27 54 40 -19 -49 -21 19 -20 -16 -3 -10 8 30 45
14129D5o2j7K6l5J5J6K4K8j8m3QL6K6Klk3qj8nLl2L7nr3l7P0J4N2n9ON0j4j4K4ml0mK%K1K7
$$ 45 -17 -34 -8 -43 -28 -12 12 40 22 -21 -13 23 49 51 48 25 17 -1 -6 -3 -35 2 -3 -96 -133 -63 -49 3 -56 -50 0 -14 -28 -4 -8 -38 -42 -40 -40 -19 8
14110Hmnj3l3Q2O3j9m9k7rj2%L2k5l5L0J0nj5K1j0K5JJM1o0m0MqpL7l9k5O4N4Qm3k5rm8Q2
$$ 8 4 -1 -14 -47 35 98 79 30 3 -6 -18 -18 14 -11 -46 -16 -6 -11 -26 -5 -15 10 11 12 53 -7 -47 -43 -51 -58 -21 -60 -85 -21 33 41 -2 -27 -36 -84 -2
14090bN3j5k6l1%k5J9K5k5K1K7k1rl8M5jj2k8j0M5j0jm5j9K2K8j4K0mL9L2oM3l0p3L0q3J8
$$ -2 51 36 10 -21 -21 -46 -27 -2 -27 -6 21 0 -9 -47 -2 -3 -15 -43 -53 -8 -18 -19 -64 -83 -61 -33 -47 -27 -31 8 40 34 77 47 -26 4 -79 -61
14072f1N3m3j5P6l3l2lj0M1nk4N6l5l9J4M7k5k2MM0k1j0K7oK4j8l9K9Op1j3Q3lN0K1J2m9m
$$ -61 -8 -51 -66 10 -23 -55 -58 -68 -27 -32 -56 0 -35 -74 -60 -13 -38 -60 -56 -16 -37 -47 -20 -26 -2 -20 -59 -30 -24 -95 -108 -25 -28 22 43 55 6 2
14054Bm3J5rK7oL2j7m4l8N9j6Q3m2n4N4J3l4nK8Nk6%L7K9m6l3q3O9k0O1No5PK2M5J8K1L2j07
$$ 2 -41 -26 -35 -8 -14 18 1 -43 -81 -22 -38 45 3 -51 3 16 -18 -23 5 10 -16 -16 21 50 4 -29 -112 -43 -63 -2 3 -62 -55 -33 12 30 51 83 -24
14035b4N0mq3J6j9jK8k1K6J3Pn8lQJ4j8M8k5K5j2L1k5QMk0K3Ol8K6K6l4K1m5J5J5rM2O3q3
$$ -24 26 22 -61 -45 -64 -65 -37 -58 -32 -19 -12 -70 -73 -65 -51 -69 -21 -46 -21 -33 -2 -27 -19 -15 -35 -12 -6 -44 -18 8 -26 -5 -50 -35 -20 -29 13 76 -7
14017go4nQ9Rrlk0K6rL1m5l5L7J1j7nk2mn5N0K8j4M8KN5j3J1%n5l7MM6Rm8l3L1M6Jq1J4M7
$$ -7 -71 -76 13 22 13 10 -10 16 7 38 -7 -42 -5 6 -11 -16 -38 -42 -97 -47 -19 -33 15 17 72 59 70 70 15 -22 -18 28 37 -11 -44 -13 33 34 -47 -33 14
13997A4mk9Pk2J9L0Rl1l8K6JML3J0l6l5nL4K5j8j1Nl3L8L3n1J7L0k8j7jK0Nj3K1qq0N4RPo
$$ 14 10 -19 -12 -34 -15 15 24 -7 -45 -19 -18 -14 19 29 -7 -42 -47 -13 12 -6 -17 -12 -45 -7 26 -25 -8 22 -6 -23 -24 -4 1 -12 9 1 -79 -25 -16 -9 -15
13978a5o0J2L6lN6j0Rpl7K0j5qM2m0N6l5k5m9K3M3jpm6N2j9j1l0K0L8Rk7qK1n8L9K6l2k4j4
$$ -15 -75 -63 -27 -30 26 16 25 18 -19 1 -14 -22 20 -20 36 1 -24 -73 -50 -7 -8 -15 -61 -9 -28 -39 -69 -49 -11 -2 -29 -37 -16 -74 -35 -9 -41 -65 -79
13959g9R2J2m5rJ9J3nk6lL0K1k5kj6Jk4J6m4M2N1m2p1M0M0PkJMn4PQJ6NK2o7p1M9P9J6k0l1
$$ -79 13 25 -20 -29 -10 3 -2 -28 -31 -1 20 -5 -7 -23 -22 -46 -30 -74 -32 19 -23 -94 -54 -14 -7 -9 -8 -4 -58 -51 -43 -27 -22 0 -67 -138 -89 -10 6 -14 -45
13940d5J2K3jl5J6Lk0JK8k4mM3J7PPJ2r1L0j1K6l9l7%P7N7n9l3R8j0r0qK1k4n9L3N4k1kk3
$$ -45 -33 -10 -11 -46 -30 -27 -47 -46 -18 -42 -46 -3 14 21 28 40 -51 -21 -32 -6 -45 -82 -82 -5 52 -7 -40 58 48 -42 -50 -29 -53 -112 -79 -25 -46 -48 -71
13921g1l3J3K3KN9qm2pj4L4j6K6j1nk1J3J0K3j9m1K7%k0j5M5J8k9oJ01joj3j5m7l5LN9j9j7
$$ -71 -104 -91 -68 -66 -7 -15 -57 -64 -78 -44 -60 -34 -45 -50 -71 -58 -48 -25 -44 -85 -58 -58 -78 -93 -48 -30 -59 -65 36 35 29 16 1 -46 -81 -78 -19 -38 -55
13902e5L0O9m8pO3o0o7RJ0J2l2RK1L5m6j02K7O4Opj9K2K1KJ8J4j0K4l6K8N7j3n3n0n5M4O3
$$ -55 -25 44 -4 -11 52 -8 -75 -66 -56 -44 -76 -67 -46 -11 -57 -159 -132 -68 -62 -69 -88 -66 -45 -43 -25 -11 -21 3 -33 -5 52 39 -14 -64 -119 -75 -12
13885a2%L3J3m8l2j1j2ORL8j6l1M9j5J6l0K8Qk3k2j2L5RM4om9J7K1k5m1J5J4l3NN2M4m3m8
$$ -12 -12 21 34 -14 -46 -57 -69 -63 -54 -16 -32 -63 -14 -29 -13 -43 -15 -7 -30 -52 -64 -29 -20 24 18 -31 -14 7 -18 -59 -44 -30 -63 -58 -6 38 -5 -53
13867e3LKK3J4RN8om7m7K0Njp8M3K3J7ml4M1k0k6m2J9N6j5L0l9j0l7MJ9L9K2J3Jp5M0K4k9
$$ -53 -50 -48 -25 -11 -2 56 50 3 -44 -24 -19 -20 -98 -55 -32 -15 -19 -53 -12 -32 -58 -100 -81 -25 -40 -10 -49 -59 -96 -92 -73 -34 -12 1 2 -73 -33 -9 -38
13848c8Lj4M3l5pL7Nl0LK5J0oJk5K9k1k3P1k2k1J5Kl7J1M5n2M1j1qn9M1Pl5q1J01J12o5Jm2
$$ -38 -35 -49 -6 -41 -48 -11 -6 -36 -33 -8 2 -4 -3 -28 1 -20 -43 28 6 -15 0 2 -35 -24 21 -31 10 -1 -9 -68 -27 -20 -55 -136 -35 77 12 13 -29
13829b9mM2L8m6K2k8m3Ok3M8Kl3M0l7L1O8J0l0l3j8L7J5k0j4l0j8rRJ1PNm5QL2L8Ppl6m9N4
$$ -29 -33 9 47 1 23 -5 -48 -42 -65 -17 -15 -48 -8 -45 -14 54 64 34 1 -17 20 35 15 1 -29 -47 -56 -47 -36 -29 -24 -69 -61 -29 9 16 9 -27 -76 -22
13810b2k1k3K1J5J5L3Ln5j6pN7j8K0J8m4rj1Oj3oL3K1K1j4j5KRORl9l0M8NQl4ML8nkk1j2K0
$$ -22 -43 -66 -45 -30 -15 18 21 -34 -50 -57 0 -18 2 20 -24 -33 -44 -38 -51 -57 -24 -3 18 4 -11 -9 0 6 15 -24 -54 -6 -1 7 -27 -23 15 10 8 -13 -25 -5
13790el6k1K6M3om1l8J0j2NN2qk8O0KrL1k9M5m2m1j8k2J9NK0N2l2J3j8qLl8N8J6L7J5j8r0
$$ -5 -41 -62 -36 7 1 -40 -78 -68 -80 -75 -23 -31 -59 1 3 -6 25 -4 41 -1 -42 -60 -82 -63 -58 -38 14 -18 -5 -23 -31 -28 -66 -8 8 45 60 42 -48
13772d8MJ7k4K7L6k1j6QJ9l8M2k4L2j8j8K9j8nJ1k3N5k9J8l6j2P9k7l6pj1j6j0k%k6N4K2L3
$$ -48 -44 -27 -51 -24 12 -9 -25 -17 2 -36 6 -18 14 -4 -22 7 -11 -16 -5 -28 27 -2 16 -20 -32 47 20 -16 -23 -34 -50 -60 -62 -62 -88 -34 -12 21
13754B1o5j4LL7J1j1J6j1k6J2k7K3k5OQ%K2l5J6Mo0K1J5mp1L0K5n4j8M0N1Qj1L4Q0n3K0ln1
$$ 21 -44 -58 -55 -18 -7 -18 -2 -13 -39 -27 -54 -31 -56 -50 -42 -42 -20 -55 -39 -35 -95 -74 -59 -63 -134 -104 -79 -133 -151 -111 -60 -52 -63 -29 51 -2 18 15 -36
13735c6Kk0k3N2oj3JL8Oj6j0j4Ml4k4oK5Q0l1l7ok8P0rlK9K6l5K3o5j7M0J3J7k6l6j8lL0M8
$$ -36 -34 -54 -77 -25 -31 -44 -43 -5 1 -15 -25 -39 -35 -69 -93 -99 -74 6 -25 -62 -68 -96 -26 -35 -38 -9 17 -18 5 -60 -77 -37 -24 -7 -33 -69 -87 -90 -60 -12
13716a2O1K4J6p6m3%l1L1L4K8ol5j0m6qJ1M1Q2J3o4K8k1j9j8j9J1M0n1J1Rj0Rl9O9Q4k2k3
$$ -12 49 73 89 13 -30 -30 -61 -30 4 32 26 -9 -19 -65 -73 -62 -21 61 74 10 38 17 -2 -20 -39 -28 12 -39 -28 -19 -29 -20 -59 10 94 72 49
13698D9p7K0ll6MK8k9jNQK0k1OK7m5P1J4j1m6j8k6O4jo1K4j7J6%K0K1L7o7j5M9M3n3o1pJ6
$$ 49 -28 -8 -11 -47 -43 -15 -44 -45 -40 -32 -12 -33 -27 0 -45 26 40 29 -17 -35 -61 3 2 -59 -35 -52 -36 -36 -16 5 42 -25 -40 9 52 -1 -62 -69 -53
13680e3M2j4K0k5J8k7ooJ5K3J6pm1Oj3j0L3l0L5o1j0M4J7N3n3QpK4KPj8n3MM3K2l2MprRJ7
$$ -53 -11 -25 -5 -30 -12 -39 -45 -51 -36 -13 3 -4 -45 -39 -52 -62 -29 -59 -24 -85 -95 -51 -34 19 -34 -26 -33 -9 -7 0 -18 -71 -67 -24 -2 -34 -30 -37 -46 -37 -20
13660b0j0j9NK7k7K7pl7OjO6l8l6K3j5M3J0m0MLk1J1j1K3J7oM0k1l0L9%m2J7K2Nk8J4m8k7
$$ -20 -30 -49 -44 -17 -44 -17 -24 -61 -55 -56 10 -28 -64 -41 -56 -13 -3 -43 -39 -36 -57 -46 -57 -34 -17 -23 17 -4 -34 5 5 -37 -20 2 7 -21 -7 -55 -82
13642h2j9M2J6JM2j5m6M0j4j9P0m8k4j2OM7K5m2joJ5J9j6oq%jM1k3N9L7n4q4N7M4Kp4j3L8
$$ -82 -101 -59 -43 -42 0 -15 -61 -21 -35 -54 16 -32 -56 -68 -62 -15 10 -32 -33 -39 -24 -5 -21 -27 -35 -35 -36 5 -18 41 78 24 -60 -3 41 43 -31 -44 -6
13623fNJ2O3r0n6j3oK1rNK4RJK9l6Rk9L1NK2k6K7K7j8j8K0L1l8J4m6j5J7k4M4rj5mN5j5QJ5
$$ -6 -1 11 74 -16 -72 -85 -91 -70 -79 -74 -50 -41 -40 -11 -47 -38 -67 -36 -31 -9 -35 -8 19 1 -17 3 34 -4 10 -36 -51 -34 -58 -14 -23 -38 -42 13 -2 6 21
13603B1l8K4nNm8k8j5J5O7M3k5k4j3k6L4ql5J8N3l1pM0p7J2Mn1L8J1j2j7L5J0k5K0j6l7j4
$$ 21 -17 7 2 7 -41 -69 -84 -69 -2 41 16 -8 -21 -47 -13 -21 -56 -38 15 -16 -23 17 -60 -48 -44 -95 -57 -46 -58 -75 -40 -30 -55 -35 -51 -88 -102
13586a02N0L0K5Jm5jl3PLK1ln3M5j9J7K5J5J5L2m0qm3L9Jl6M8njJ2K6j6K3m2j5%Mk9j4L1k5
$$ -102 -52 -22 3 4 -41 -42 -75 -68 -65 -44 -47 -100 -55 -74 -57 -32 -17 -2 30 -10 -18 -61 -22 -21 -57 -9 -14 -15 -3 23 7 30 -12 -27 -27 -23 -52 -66 -35 -60
13567f0j5L7J6lNl9%J1pj2j4K2j6k2L5N6nm5oRK1lPK9K8m3M7j7k4l0J7k1n2L0J0l0J2M5L8
$$ -60 -75 -38 -22 -25 -20 -59 -59 -48 -55 -67 -81 -59 -75 -97 -62 -6 -11 -56 -62 -53 -32 -35 -28 1 29 -14 33 16 -8 -38 -21 -42 -94 -64 -54 -84 -72 -27 11
13548A1l0l3j1l1K8N2j8j0kL8P7j3q2l8k5P5k7j2K1n3PQKL4kKjj7NJ5J5%l5L8Lj4j3l9N6O7
$$ 11 -19 -52 -63 -94 -66 -14 -32 -42 -44 -6 71 58 -24 -62 -87 -12 -39 -51 -30 -83 -76 -68 -66 -32 -34 -32 -33 -50 -45 -30 -15 -15 -50 -12 -9 -23 -36 -75 -19 48
13529D8j1p4P2%k9%j4jm1QRJ4m5N9K3p7m0jN5J9j3n2RK1J3M2J3QNm3l5PJ4L3l0j7M3mm7J5
$$ 48 37 -37 35 35 6 6 -8 -9 -50 -42 -33 -19 -64 -5 18 -59 -99 -100 -45 -26 -39 -91 -82 -61 -48 -6 7 15 20 -23 -58 -51 -37 -4 -34 -51 -8 -12 -59 -44
13510d4j0L4oj6J3K0M2p9M8k7M0L7k6k1m3J2qJ0J0j1n1K8Ql4L1L4J5p0KNK6J9j8K2j1o9L1
$$ -44 -54 -20 -26 -42 -29 -9 33 -46 2 -25 15 52 26 5 -38 -26 -34 -24 -14 -25 -76 -48 -40 -74 -43 -9 6 -64 -62 -57 -31 -12 -30 -8 -19 -88 -57
13492e7L0L1nj2J0Mm3j3K9Mm4j1Q7ll4l4P6L7k6k6l0m3NM6L0k2L9Lk4k9kK4k6j6K7K2L0j4
$$ -57 -27 4 -1 -13 -3 1 -42 -55 -26 -22 -66 -77 10 7 -27 -61 15 52 26 0 -30 -73 -68 -22 8 -14 25 28 4 -25 -27 -3 -29 -45 -18 4 34 20
13474B0J0l4n3K0L9l1K8K0l4J0k6l2L6mJ8M0m5N1k4j7J8Rj8k8NJ0j5K1l7J4K2K9k9m7K0K9
$$ 20 30 -4 -57 -37 2 -29 -1 19 -15 -5 -31 -63 -27 -31 -13 27 -18 33 9 -8 10 19 1 -27 -22 -12 -27 -6 -43 -29 -7 22 -7 -54 -34 -5
13457ek8J6O1j0k6k9k8M6k5M8j6l4JrJ3N8Oq5oRl2O0J0j4%j6K0l7M3N7%k3l7j2J1l4l1M2j6
$$ -5 -33 -17 44 34 8 -21 -49 -3 -28 20 4 -30 -29 -38 -25 33 39 -46 -52 -43 -75 -15 -5 -19 -19 -35 -15 -52 -9 48 48 25 -12 -24 -13 -47 -78 -36 -52
13438e2M7N6l4jnm9j0O5l2m0N4pk6L0j0k9J0l1k9J0M7N9l1m2k8J9P1j0j7Mj1l8J2lPM6qK6
$$ -52 -5 51 17 16 11 -38 -48 17 -15 -55 -1 -8 -34 -4 -14 -43 -33 -64 -93 -83 -36 23 -8 -50 -78 -59 12 2 -15 -11 -22 -60 -48 -51 -44 2 -6 20
13420B0n1q3L1L6l9JK7M3J6Lmpm2k1J1M4N6n2OJ8l9M0n5N8K4l8n5KPN5L2l7l3L3L9j4K5Kk8
$$ 20 -31 -114 -83 -47 -86 -85 -58 -15 1 4 0 -7 -49 -70 -59 -15 41 -11 -5 13 -26 14 -41 17 41 3 -52 -50 -43 12 44 7 -26 7 46 32 57 59 31
13402C1rk5j0l3j4K0jjO1k4l5k8M9J0k5k0M0kl1K9J7L8J1kl2M2k5q2kk9P0J5k7RK6k5j5l6
$$ 31 22 -3 -13 -46 -60 -40 -41 -42 19 -5 -40 -68 -19 -9 -34 -54 -14 -16 -47 -18 -1 37 48 46 14 56 31 -51 -53 -82 -12 3 -24 -15 11 -14 -29 -65
13384f5J2L5m%qL5L1JLm1p8oPJ5K6m3N4%k0KK5Ok4k3k8Nk1P6J7k5J8l3J9J4J5J0m4%OL2qj39
$$ -65 -53 -18 -22 -22 -30 5 36 37 40 -1 -79 -85 -78 -63 -37 -80 -26 -26 -46 -44 -19 -13 -37 -60 -88 -83 -104 -28 -11 -36 -18 -51 -32 -18 -3 7 -37 -37 -31 1 -7 -146
13364a46L2M1L2kJN5j6l0J3O1l3rK5k5l1K9j7n2RrK9J1l8K3j1rJ5K3m1K3J7k2J5NJ9NP0l0
$$ -146 -114 -73 -41 -43 -42 13 -3 -33 -20 41 8 -1 24 -1 -32 -3 -20 -72 -63 -72 -43 -32 -70 -47 -58 -67 -52 -29 -70 -47 -30 -52 -37 -32 -13 -8 62 32
13345C2l2L0onn2m8qJM4Qk7K6k2K7RJ3m7l4O8M7k0k4k3oO8Mp4J9O1Lq4k7N9JM0n3QJ3nmk1
$$ 32 0 30 24 19 -33 -81 -89 -88 -44 -36 -63 -37 -59 -32 -23 -10 -57 -91 -23 24 4 -20 -43 -49 19 23 -51 -32 29 32 -52 -79 -20 -19 21 -32 -24 -11 -16 -20 -41
13326d1K5k3k4J1J5ll5M0k9NM0k0j2nK2k0J6rJ2j8K3K8k1l1lN6L2m9QmL3m0k3M3o8L2lo4O
$$ -41 -16 -39 -63 -52 -37 -40 -75 -35 -64 -59 -19 -39 -51 -56 -34 -54 -38 -47 -35 -53 -30 -2 -23 -54 -57 -1 31 -18 -10 -14 19 -21 -44 -1 -69 -37 -40 -104 -98
13307i8K0M4L2l8kJ3J4qNl8J4J9k9j3K4L9K6l4l0K0Ml4L3rQj5J4M2pj5K6l4L1n3l3j6M9J9
$$ -98 -78 -34 -2 -40 -42 -29 -15 -23 -18 -56 -42 -23 -52 -65 -41 -2 24 -10 -40 -20 -16 -50 -17 -26 -18 -33 -19 23 16 1 27 -7 24 -29 -62 -78 -29 -10
13289a0n6J3K3k7L4k0qJ1J4J8LK8Mj4k9m2J6L1qm8K1k6k3K6M1k1N2n2J5P7j0m5Pm0%RK3m4
$$ -10 -66 -53 -30 -57 -23 -43 -51 -40 -26 -8 -5 23 27 13 -16 -58 -42 -11 -19 -67 -46 -72 -95 -69 -28 -49 3 -49 -34 43 33 -12 -5 -45 -45 -36 -13 -57
13271e7J4PQRJ8K3o3m0L0K9k2j0L5L5kK4j7oM5p9N7o4j3M3m1L5jk9J2nl9ROJ6qJ2l4j0K9K4
$$ -57 -43 -36 -28 -19 -1 22 -41 -81 -51 -22 -44 -54 -19 16 14 38 21 15 60 -19 38 -26 -39 4 -37 -2 -3 -32 -20 -25 -64 -55 -49 -33 -41 -29 -63 -73 -44 -20
13252b0moj0l2K0L3PM6L5o9m3O7n6m2N3jl3M7j6M1ql5m1ooJ6M0ROQl2J7Lp7M5K1k2J2j6J5
$$ -20 -24 -30 -40 -72 -52 -19 -12 34 69 0 -43 24 -32 -74 -21 -22 -55 -8 -24 17 9 -26 -67 -73 -79 -63 -23 -14 -8 0 -32 -15 -12 -89 -44 -23 -45 -33 -49 -34
13233c4L3k1PJ6LjL1k1j7k6L3M7kn2m2l1KM6N8m9M2j2J2j8rj1p1qK1J0J1M4J6k7k0j4lM9n2
$$ -34 -1 -22 -15 1 4 3 34 13 -4 -30 3 50 48 -4 -46 -77 -75 -29 29 -20 22 10 22 4 -5 -16 -87 -95 -74 -64 -53 -9 7 -20 -40 -54 -57 -8 -60
13214f0k0L4j4j9K4L1k2QOJ9j6kl3K4LK7K5no6K4N8qo2j6L7L1rM2l5%M9j8n7MKk0n1mM1K1
$$ -60 -80 -46 -60 -79 -55 -24 -46 -38 -32 -13 -29 -31 -64 -40 -37 -10 15 10 -56 -32 26 18 -44 -60 -23 8 -1 41 6 6 55 37 -20 -16 -14 -34 -85 -89 -48 -27
13195b7K1J4Lm2l8K4mM9J0o2p7R2K4m9Kn5L9L6RNl3K5k9j5M3J2J5p3KNLM2O1J7q6k4rK5M2
$$ -27 -6 8 11 -31 -69 -45 -49 0 10 -52 -129 -37 -13 -62 -60 -115 -76 -40 -31 -26 -59 -34 -63 -78 -35 -23 -8 -81 -79 -74 -71 -29 32 49 -37 -61 -70 -45 -3
13177cOm7J5PJ1n0j9lK7K0j6k1mON2N1n4j8kQJ8k6k4%M3J0J2l3O1J7l2j2JK6nk6lm6L6M8l
$$ -3 3 -44 -29 -22 -11 -61 -80 -83 -56 -36 -52 -73 -77 -71 -19 32 -22 -40 -42 -34 -16 -42 -66 -66 -23 -13 -1 -34 27 44 12 0 1 27 22 -4 -7 -53 -17 31 28
13157B8p3nN8k7k1K3K5jOn0qj3K1K3Nj8pj4%M2LK8j6k7K3lk6Kl2jqL5jl2K8lj2rk2K5j4QN
$$ 28 -45 -50 8 -19 -40 -17 8 7 13 -37 -45 -58 -37 -14 -9 -27 -34 -48 -48 -6 -3 25 9 -18 5 2 -24 -22 -54 -55 -63 -28 -29 -61 -33 -36 -48 -57 -79 -54 -68 -60 -55
13137e5kK9M1j7m3O0l5p2JK8mP0l3l6pN7J2n6N2Nl1j8M4J2k1o7MR6M3l7n0j6jRmk6m1J6M0
$$ -55 -57 -28 13 -4 -47 13 -22 -94 -93 -65 -69 1 -32 -68 -75 -18 -6 -62 -10 -5 -36 -54 -10 2 -19 -86 -82 14 57 20 -30 -46 -47 -38 -42 -68 -109 -93 -53
13118e3O7Nj8j9J8k1l4k3oL5Q0j0l6k5M1Qjo9J7N7KlL4p2J0J5k3P4n8n6N1P6p3k%l4J2L5K0
$$ -53 14 19 1 -18 0 -21 -55 -78 -84 -49 31 21 -15 -40 1 9 8 -61 -44 13 15 12 46 -26 -16 -1 -24 50 -8 -64 -13 63 -10 -12 -12 -46 -34 1 21
13099B1l8k8NM0m4l5qK0J2R7j9m0rJ7j7l5nL6Q3l6l6j7M0l7m4M5l2O8K8k3o4mJJ2K6j3M0K
$$ 21 -17 -45 -40 0 -44 -79 -87 -67 -55 42 23 -17 -26 -9 -26 -61 -66 -30 53 17 -19 -36 4 -33 -77 -32 -64 4 32 9 -55 -59 -58 -46 -20 -33 7 9
13081Ip1j7J7L8l1k0K3K1k5M0j7J8M6j1m9Jk2K4%J3j6mNk6J7Kj7JMLLL1O0Jp7l9OK4N7n0L
$$ 9 -62 -79 -62 -24 -55 -75 -52 -31 -56 -16 -33 -15 31 20 -29 -28 -50 -26 -26 -13 -29 -33 -28 -54 -37 -35 -52 -51 -47 -44 -41 -10 50 51 -26 -65 -59 -35 22 -28 -25
13062b5LJ3N7m6m3oPj4Pj5RJ5L6Nl1J4Jm4N8j4o0K2L3K5n4J3kJ4j0K1L3j3j3k2l7L2K6oK7
$$ -25 -22 -9 48 2 -41 -47 -40 -54 -47 -62 -53 -38 -2 3 -28 -14 -13 -57 1 -13 -73 -51 -18 7 -47 -34 -36 -22 -32 -11 22 9 -4 -26 -63 -31 -5 -11 16
13043A6l6J6k8k9nk8L3QJ4j1k8J8M2Pl8M5j7k5l7kK1M8o5J4J9pN3k0nm8RL4K2Ml6qN2J0J8
$$ 16 -20 -4 -32 -61 -66 -94 -61 -53 -39 -50 -78 -60 -18 -11 -49 -4 -21 -46 -83 -85 -64 -16 -81 -67 -48 -55 -2 -22 -27 -75 -66 -32 -10 -6 -42 -50 2 12 30
13024C0p1j5L1m2O6M1k8K0m3n1Pj0m5K2M0j6J7M3M4k1M1o1l2Lmo0k2Q0M5k3J3m2j8J6K8L7
$$ 30 -41 -56 -25 -67 -1 40 12 32 -11 -62 -55 -65 -110 -88 -48 -64 -47 -4 40 19 60 -1 -33 -30 -34 -94 -116 -36 9 -14 -1 -43 -61 -45 -17 20
13007B0j9k2Pj6L3Pk4m8j3J5K0L4K8Mn5QJ7m6l7LM0Mj9J9J3l4LOqK1Ll2%J4j2L9N8n7l1J3
$$ 20 1 -21 -14 -30 3 10 -14 -62 -75 -60 -40 -6 22 26 -29 -21 -4 -50 -87 -84 -44 -40 -59 -40 -27 -61 -58 -52 -60 -39 -36 -68 -68 -54 -66 -27 31 -26 -57 -44
12988d4J9j1l0J3K2kn3j6K2K3K4J3K6p9M5M4o3j7l0rL0M8Jl6j8OO7l2J1o0J4L6j6j2J3K7J8
$$ -44 -25 -36 -66 -53 -31 -33 -86 -102 -80 -57 -33 -20 6 -73 -28 16 -47 -64 -94 -103 -73 -25 -24 -60 -78 -72 -5 -37 -26 -86 -72 -36 -52 -64 -51 -24 -6
12971fJ1Ol4O4j1j04j8M1M9%l9J3K1l0rj4m8P1j4K6K4m0oJ7J0J3kK7j0o9l3N3M7o2J2oL1M7
$$ -6 5 11 -23 41 30 -74 -92 -51 -2 -2 -41 -28 -7 -37 -46 -60 -108 -37 -51 -25 -1 -41 -47 -30 -20 -7 -9 18 8 -61 -94 -41 6 -56 -44 -50 -19 28
12952B8pk1m7MQK7M3m3k8L4n3qK2n3QM9M1pj9Jj2j5N3Ol4RK3J2L0jm8Mk7M7k8J2Kk1NJ8k6
$$ 28 21 0 -47 -43 -35 -8 35 -8 -36 -2 -55 -63 -41 -94 -86 -37 4 -3 -22 -21 -33 -48 5 11 -23 -14 9 21 51 50 2 6 -21 26 -2 10 12 -9 -4 14 -12
12933a2j2j9pM5J9l3j9j1l7L0PN7Jj6J2k9j7QK2kK2%k8l5m4L0J7L3l5O0J5m2n0K1k2j9K6L8
$$ -12 -24 -43 -50 -5 14 -19 -38 -49 -86 -56 -49 8 9 -7 5 -24 -41 -33 -11 -13 9 9 -19 -54 -98 -68 -51 -18 -53 7 22 -20 -70 -49 -71 -90 -64 -26
12915b6j5K9%noj3k7K7l7M3k9L6kK8k0l8K1l1O7Mm8m6Q7M1m3k0l4K6k0M3L7j3n5L0l8J9J2
$$ -26 -41 -12 -12 -17 -23 -36 -63 -36 -73 -30 -59 -23 -25 3 -17 -55 -34 -65 2 6 -42 -88 -1 40 -3 -23 -57 -31 -51 -8 29 16 -39 -9 -47 -28 -16
12897a6pJ3Nm0%L3Lj5JK3J1po6K7pl2j0J9M3J5kL9k9ql4OJ7Oj4k7KK2k3k1n2K1RRJ8k8N4J4
$$ -16 -23 -10 -5 -45 -45 -12 -9 -24 -23 0 11 4 -62 -35 -42 -74 -84 -65 -22 -7 -9 30 1 -7 -41 -35 -18 -12 -26 -53 -51 -29 -52 -73 -125 -104 -95 -86 -68 -96 -42 -28
12877b8j2J3ML9K6m1k6nPmk0Ln8PK1L2l3ML9m4k1M0K3jm2O8J2Pk1k1RK3j3l2J5KoKj3n8N0
$$ -28 -40 -27 -23 16 42 1 -25 -30 -23 -27 -47 -44 -102 -95 -74 -42 -75 -71 -32 -76 -97 -57 -34 -35 -77 -9 3 10 -11 -32 -23 0 -13 -45 -30 -28 -34 -32 -45 -103 -53
12858e3l5K9N4Nl1k3L4N7k3m8j4jJ2l3M4L5k7qK1j7K6l4k5K4oJ1o9kM1j8K8oJL6QJ6J7J9q3
$$ -53 -88 -59 -5 0 -31 -54 -20 37 14 -34 -48 -49 -37 -70 -26 9 -18 -26 -5 -22 4 -30 -55 -31 -37 -26 -95 -97 -56 -74 -46 -52 -51 -15 -7 9 26 45 -38
12839c8k0rl3L7K4L8kJ2k6o7nL7L1k7L6p1L5l2M4j3J1m8L8L8j1k2J7J1j1J2lrj1L1l%pK0o
$$ -38 -58 -67 -100 -63 -39 -1 -3 9 -17 -84 -89 -52 -21 -48 -12 -83 -48 -80 -36 -49 -38 -86 -48 -10 -21 -43 -26 -15 -26 -14 -17 -26 -37 -6 -9 -9 -16 4 -2
12820bL4n1o1Mk5N8J6k7K4K4j3rJ8mJ7q8K5L5ojpJ3J1k0mL0l9qLjJ8M3jj2o8j8k4L4K4L2%
$$ -2 32 -19 -80 -76 -101 -43 -27 -54 -30 -6 -19 -28 -10 -14 3 -85 -60 -25 -31 -32 -39 -26 -15 -35 -39 -9 -48 -56 -53 -54 -36 7 6 -6 -74 -92 -116 -82 -58 -26 -26
12801b6m0K4j8K9K1Jl4k2J7M5%J3j5j4L2n3k9L3m0oN8j1%j7m0P2k1L5l8L6Jkj9l3K3j7K4J1
$$ -26 -66 -42 -60 -31 -10 -9 -43 -65 -48 -3 -3 10 -5 -19 13 -40 -69 -36 -76 -82 -24 -35 -35 -52 -92 -20 -41 -6 -44 -8 -7 -9 -28 -61 -38 -55 -31 -20
12783b0qK7k5L7j8l1k2K6M9j6pqk8m1jK2L2k9j4P6mj0L8J3k4J1j3J2qo0k2M3k0nKM6J8l6R
$$ -20 -28 -1 -26 11 -7 -38 -60 -34 15 -1 -8 -16 -44 -85 -86 -64 -32 -61 -75 1 -3 -13 25 38 14 25 12 24 16 -44 -66 -23 -43 -48 -46 0 18 -18 -9
12764ijj7J9K2q2K1l1OL9K8l0m2K3J6k4L9k4K4Rk0OqL9m7N2Nk6rl0K8l2%K8L8m3Nk9l0K1M4
$$ -9 -10 -27 -8 14 -68 -47 -78 -72 -33 -5 -35 -77 -54 -38 -62 -23 -47 -23 -14 -34 -28 -36 3 -44 8 13 -13 -22 -52 -24 -56 -56 -28 10 -33 -28 -57 -87 -66 -22
12745b2Rll2K6k3K1qj5M9n0O3nn8M6rj4K2l6JolO8J9l3oN0j3o3j3m5L2L7J7J3p9N7K8m9J2
$$ -22 -13 -16 -48 -22 -45 -24 -32 -47 2 -48 15 10 -48 -2 -11 -25 -3 -39 -38 -44 -47 21 40 7 1 51 38 -25 -38 -83 -51 -14 3 16 -63 -6 22 -27 -15
12726a5L2jn5PM7m0j9k4j4J7QJ1L9kk0j0M9p6k2J1O7l2j3O0m7j2N4l9pQJ3K3N1n2l9Kl8KK1
$$ -15 17 16 -39 -32 15 -25 -44 -68 -82 -65 -57 -46 -7 -9 -29 -39 10 -66 -88 -77 -10 -42 -55 5 -42 -54 0 -39 -46 -38 -25 -2 49 -3 -42 -40 -78 -76 -55
12708e5J9j1MqL7l0n0P9L2n2L1Oj3lJ3k9j7M1%J7pl6m4pO2J6m0O5qjj6K2j5j8j3k4J6N2m2
$$ -55 -36 -47 -43 -51 -14 -44 -94 -15 17 -35 -4 2 -11 -14 -1 -30 -47 -6 -6 11 4 -32 -76 -83 -21 -5 -45 20 12 11 -5 17 2 -16 -29 -53 -37 15 -27
12689b7n6K8Q0k8n7QL9k9K8Lj0l0k9Mj2M4%m1kO9J6J6KooK9o3ml5L3L2nm8m2O6K5l3nJ9j9
$$ -27 -83 -55 25 -3 -60 -52 -13 -42 -14 -11 -21 -51 -80 -76 -88 -44 -44 -85 -87 -18 -2 14 16 10 4 33 -30 -34 -69 -36 -4 -9 -57 -99 -33 -8 -41 -46 -27 -46
12670d6K2l9O0K6k2ql5nK7L1ol3k3K0Mj4J8POk0J3Ll7Q8l3k8Lj6k2km1L9J9L2K7m2k0J9j2
$$ -46 -24 -63 -3 23 1 -7 -42 -47 -20 11 5 -28 -51 -31 -27 -41 -23 -16 -10 -30 -17 -14 -51 37 4 -24 -21 -37 -59 -61 -102 -63 -44 -12 15 -27 -47 -28 -40
12652d0PO4j0m3K0Lm9M5QPml4k0pJL1m7J5M7L0J6pn7K3m2j6j4J8K6L1j0NL0m3j4N9j5j6Rm1
$$ -40 -33 31 21 -22 -2 1 -48 -3 5 12 8 -26 -46 -53 -52 -21 -68 -53 -6 24 40 33 -24 -1 -43 -59 -73 -55 -29 2 -8 -3 27 -16 -30 29 14 -2 7 -34
12633c4l3J4J1Qmj7M0PKJ1j9j9n0l1M8J6K3m3%RJ8n1M8O5Ok0j2K5j7n5Nj4J3J4K5LJ5M2qn
$$ -34 -67 -53 -42 -34 -38 -55 -15 -8 -6 5 -14 -33 -83 -114 -66 -50 -27 -70 -70 -61 -43 -94 -46 19 25 5 -7 18 1 -54 -49 -63 -50 -36 -11 -8 7 49 41 36
12613C6k1J1k9N2m2k0K6k9n4M9j3k1M1Pj4LJ6n2pJ9mM3om8K3QK9l8Jk3lJL5J2K5Jn4L7p1L2
$$ 36 15 26 -3 49 7 -13 13 -16 -70 -21 -34 -55 -14 -7 -21 -18 -2 -54 -61 -42 -46 -3 -9 -57 -34 -26 3 -35 -34 -57 -60 -59 -24 -12 13 14 -40 -3 -74 -42
12594d2J4k7J2j5L3NKm2%k8RN4j4j4kK9l4k0j8LKL3M7k7Pm1j4R4ok8MK5K5j5k1k3JPm4J5K5
$$ -42 -28 -55 -43 -58 -25 -20 -18 -60 -60 -88 -79 -25 -39 -53 -55 -26 -60 -80 -98 -95 -93 -60 -13 -40 -33 -74 -88 6 0 -28 -24 1 26 11 -10 -33 -32 -25 -69 -54 -29
12575b9l4nqK4P1m0o6L3j3OR0l7n6j7L9L4K4k4m4Kk7nJ3l2P0L7n9jk3K8P1l4mJ0j6l5K6kJ1
$$ -29 -63 -68 -76 -52 19 -21 -87 -54 -67 -61 29 -8 -64 -81 -42 -8 16 -8 -52 -50 -77 -82 -69 -101 -31 6 -53 -54 -77 -49 22 -12 -16 -6 -22 -57 -31 -33 -22
12556b2K5K4l0ql5l8N3j3j0O4j1n6L6J3L0Joj1m7N9J6mk6%ol1k0j7N2J3J0O4k8k5k7m2j1J6
$$ -22 3 27 -3 -11 -46 -84 -31 -44 -54 10 -1 -57 -21 -8 22 23 17 6 -41 18 34 30 4 4 -2 -33 -53 -70 -18 -5 5 69 41 16 -11 -53 -64 -48
12538d8RK7mk7%pJ1J1n3pL7L0J4J7M6Jmj3l9klm7n3L9oJ8Qm0J2J8k3K2J0J0Jm5N7jk1J7m4
$$ -48 -39 -12 -16 -43 -43 -50 -39 -28 -81 -88 -51 -21 -7 10 56 57 53 40 1 -1 -4 -51 -104 -65 -71 -53 -45 -85 -73 -55 -78 -56 -46 -36 -35 -80 -23 -24 -45 -28 -72
12519g2O1Pk6%L8L3j8J1l7k9k4lpJ7J9l9J0L4J7JJo1J7MN0L9p3l1j0M4Q1Rp9p7MO9K3k4ql1
$$ -72 -11 -4 -30 -30 8 41 23 34 -3 -32 -56 -59 -66 -49 -30 -69 -59 -25 -8 -7 -6 -67 -50 -46 4 43 -30 -61 -71 -27 54 63 -16 -93 -89 -20 3 -21 -29 -60
12499f0m7N8J0k5KK7k2j0l4oK0J4M3L3%q8k1R5jp1j5L3J0j2L6m4JJ9L1l6JJ0mJ3M2k0k2k1
$$ -60 -107 -49 -39 -64 -62 -35 -57 -67 -101 -107 -87 -73 -30 3 3 -85 -106 -11 -12 -83 -98 -65 -55 -67 -31 -75 -74 -55 -24 -60 -59 -49 -53 -40 2 -18 -40 -61
12481f1K6j0o7ML3K5J7M7j6m5l2N1M4l5N3k4J4km3l6%M1L3l4m7lRJQL2m4k7O8l9M3J0j07L5
$$ -61 -35 -45 -112 -108 -75 -50 -33 14 -2 -47 -79 -28 16 -19 34 10 24 22 -21 -57 -57 -16 17 -17 -64 -67 -58 -57 -49 -17 -61 -88 -20 -59 -16 -6 -113 -78
12463g8N6k8J2NlK0K1P4m1o3j4oo8L8jL3l0M1K0pnm1K6K3K4j8kL1m6M5K1l2k6mlK9l4pL8J7
$$ -78 -22 -50 -38 -33 -36 -16 5 79 38 -25 -39 -45 -113 -75 -76 -43 -73 -32 -12 -19 -24 -65 -39 -16 8 -10 -12 19 -27 18 39 7 -19 -23 -26 3 -31 -38 0 17
12444A7l5k3j6l3L6O5l2oM7ok6k4m7M1L3j9j6K2Opl3L9lj1k4J2J2J8j9l4L2k8j6N2K7l1J1
$$ 17 -18 -41 -57 -90 -54 11 -21 -27 20 14 -12 -36 -83 -42 -9 -28 -44 -22 -16 -23 -56 -17 -20 -31 -55 -43 -31 -13 -32 -66 -34 -62 -78 -26 1 -30 -19
12427a9L3k2k1OrnK7l7LK8%l8J2O0m3l0M7j2l7l6L5J5K8l1Qp0J6L4MkML2L7k9l9qM1M2m8K7
$$ -19 14 -8 -29 -23 -32 -37 -10 -47 -44 -16 -16 -54 -42 18 -25 -55 -8 -20 -57 -93 -58 -43 -15 -46 -38 -108 -92 -58 -54 -56 -52 -20 17 -12 -51 -59 -18 24 -24 3
12407Ck2m2M1j9J8m4O2K7l9K7J1qmj1l1nK2m1j7L4mJ7J0n4j9K4P8j2Nk6qm2K5J4pm2M3N0n3
$$ 3 -19 -61 -20 -39 -21 -65 -3 24 -15 12 23 15 11 0 -31 -36 -14 -55 -72 -38 -42 -25 -15 -69 -88 -64 14 2 7 -19 -27 -69 -44 -30 -37 -79 -36 14 -39
12389c9l8K8Mj6K7L7j1l3J5N7Jl1MM1k2J6m7l3j8rJ3O6Mj7kk2m8L3k0k2O7J1l7LK7mLJqJ7
$$ -39 -77 -49 -45 -61 -34 3 -8 -41 -26 31 32 1 5 46 24 40 -7 -40 -58 -67 -54 12 16 -1 -3 -25 -73 -40 -60 -82 -15 -4 -41 -38 -11 -15 -12 -11 -19 -2
12370bmj5m0%J9l1L9L8j9JN1m2l4M2lnJ9p3j7JK6M6K9Lm8j4j0qm4M8Rj1K3j9K3p4NK3L3m2
$$ -2 -6 -21 -61 -61 -42 -73 -34 4 -15 -14 37 -5 -39 3 0 -5 14 -59 -76 -75 -49 -3 26 29 -19 -33 -43 -51 -95 -47 -38 -49 -26 -45 -22 -96 -91 -68 -35 -77
12351g7J4j5qM0L7J0Mk2m8LK7L1K4M6j1l1j5K4p7Ok8J8L1l3RL6o3k5QOJ7N4k0k6M5m3J1K0
$$ -77 -63 -78 -86 -46 -9 1 5 -17 -65 -62 -35 -4 20 66 55 24 9 33 -44 -38 -66 -48 -17 -50 -41 -5 -68 -93 -85 -79 -62 -8 -28 -54 -9 -52 -41 -21
12333b1N8m4o0K6%j7p0N5LK7rqK5J9k4K2lo1K5L3J2J8jk6nl5jk5L7oNO0l7m4L8Jj6M5KOJ4
$$ -21 37 -7 -67 -41 -41 -58 -128 -73 -70 -43 -52 -60 -35 -16 -40 -18 -21 -82 -57 -24 -12 6 5 -21 -26 -61 -62 -87 -50 -56 -51 9 -28 -72 -34 -33 -49 -4 -2 4 18
12313A8j6m4n7K4M3J7j3L0JNp9oJ5L5K3J8n4Qj9j3J03pj9k7Rm4rN2l1j1L3k2J6k1m8M0OPl3
$$ 18 2 -42 -99 -75 -32 -15 -28 2 3 8 -71 -77 -62 -27 -4 14 -40 -32 -51 -64 39 32 13 -14 -5 -49 -58 -6 -37 -48 -15 -37 -21 -42 -90 -50 -44 -37 -70
12294g0K3M9k2lon5M0Rn%Ll1J3j2M1N5k8nJ5J5n2M5j5m0Jl5rN2l5j3k5L3M7n0j5nL4L5J6p6
$$ -70 -47 2 -20 -23 -29 -84 -44 -35 -40 -40 -37 -68 -55 -67 -26 29 1 -4 11 26 -26 19 4 -36 -35 -70 -79 -27 -62 -75 -100 -67 -20 -70 -85 -90 -56 -21 -5 -81
12275h1qM0K1k0P9j6o8L3n7JjK6L3J0n1j9m8LQj5N2J8J3PJJ5Ok4OPL9m8l2O6j4k4k8L0j5n7
$$ -81 -89 -49 -28 -48 31 15 -53 -20 -77 -76 -77 -51 -18 -8 -59 -78 -126 -123 -115 -130 -78 -60 -47 -40 -39 -24 -18 -42 -36 -29 10 -38 -70 -4 -18 -42 -70 -40 -55 -112
12256a12O5J8J7J4j1l0J6k3K7K8rJK4j1o6j8L8M8K7k6m5PJ0m4L9oL8Rl6o4RM2l6j4j6O8j6
$$ -112 -47 -29 -12 2 -9 -39 -23 -46 -19 9 0 1 25 14 -52 -70 -32 16 43 17 -28 -21 -11 -55 -16 -22 16 25 -11 -75 -66 -24 -60 -74 -90 -22 -38
12239c8J6Q3l4l0j5K1K4lj9n6J9l7k8L2P5J6l9J3%l4j0MJ8L9No2k7M7j8J5K0j1k0O0ln2J1
$$ -38 -22 61 27 -3 -18 3 27 24 5 -51 -32 -69 -97 -65 10 26 -13 0 0 -34 -44 -40 -22 17 22 -40 -67 -20 -38 -23 -3 -14 -34 26 23 -29 -18
12221a8rj3M4k5L6l4L1l8k7K9j3K5l0n9O5k0M5l6k9jl2Q8j4klOl2M2m4j9O7j5ko5J9M5rJ1
$$ -18 -27 -40 4 -21 15 -19 12 -26 -53 -24 -37 -12 -42 -101 -36 -56 -11 -47 -76 -77 -109 -21 -35 -37 -40 -34 -66 -24 -68 -87 -20 -35 -37 -102 -83 -38 -47 -36
12203c6k0k7J8N8j9k2L1N0m2k0k7M6nn1M4k9J6jJ0RK9j7l4l9J2L9L3n3Jj7J1J6J9l1oK0L3
$$ -36 -56 -83 -65 -7 -26 -48 -17 33 -9 -29 -56 -10 -15 -66 -22 -51 -35 -36 -26 -17 12 -5 -39 -78 -66 -27 6 -47 -46 -63 -52 -36 -17 -48 -54 -34 -1
12185aNj8N3o6%N7l3pN1l8l5k9l1M7j7N0K9k1j8n0K7NJ8J5n4L2nj8jk4L1J6K%K5j9m5nm8O8
$$ -1 4 -14 39 -27 -27 30 -3 -10 41 3 -32 -61 -92 -45 -62 -12 17 -4 -22 -72 -45 -40 -22 -7 -61 -29 -34 -52 -53 -77 -46 -30 -28 -28 -3 -22 -67 -72 -120 -52
12166e2J4K5l8m1RN3N1k4j1l2RL0m0q8N0L9QK3j9n0L3rk7L1L5J0Ml4Mj6P6K7j8o6lK4K5K6
$$ -52 -38 -13 -51 -92 -83 -30 21 -3 -14 -46 -37 -7 -47 -135 -85 -46 -38 -15 -34 -84 -51 -60 -87 -56 -21 -11 -7 -41 -37 -53 23 50 32 -34 -37 -13 12 38
12148C8l1Mj4M0K6o2%j7j6J7K2j5L6Km3j5qL7j0k7M1l7l9L9lNj4lL3K2k5l7L0J5n2N2Qm7M3
$$ 38 7 11 -3 37 63 1 1 -16 -32 -15 7 -8 28 30 -13 -28 -36 1 -9 -36 5 -32 -71 -32 -35 -30 -44 -47 -14 8 -17 -54 -24 -9 -61 -9 -1 -48 -5
12129el4rj1J1J0N2J2J0k3r8M7K1K9l6J6j6Rk4l0N7j0l5j3M5Pk0j5NJ1J8L8j6J6l4J2L1l3
$$ -5 -39 -48 -59 -48 -38 14 26 36 13 -85 -38 -17 12 -24 -8 -24 -15 -39 -69 -12 -22 -57 -70 -25 -18 -38 -53 -48 -37 -19 19 3 19 -15 -3 28 -5
12112em3qM7j1l6Q0ol8pL2k8K3ml1k1J6Mq2M5O8kj1qoK2lm5l1R0k6OMn6O0K3m0l6K0ll5lM4
$$ -5 -48 -56 -9 -20 -56 24 18 -20 -27 5 -23 0 -4 -35 -56 -40 -36 -118 -73 -5 -7 -18 -26 -32 -10 -13 -58 -89 1 -25 -19 -15 -71 -11 12 -28 -64 -44 -47 -82 -85 -41
12092d1O1j1k0k9j2l7M7K0j4o0QJ38p3k1l9j8M3LK8Nm5l2j8M0j5K3M0M0rk7%j5K8o1K4k5%
$$ -41 20 9 -11 -40 -52 -89 -42 -22 -36 -96 -88 50 -23 -44 -83 -101 -58 -55 -27 -22 -67 -99 -117 -77 -92 -69 -29 11 2 -25 -25 -40 -12 -73 -49 -74 -74
12074g4M2Ql1jO8j1K2J6o0M1J3o3rj2RKk7oK7M3lKn1J7L8L2ln2Nmm9J1K5pj8j1JJ6kJ2O3j
$$ -74 -32 -24 -55 -56 12 1 23 39 -21 20 33 -30 -39 -51 -42 -40 -67 -73 -46 -3 -6 -4 -55 -38 0 32 29 -23 -18 -22 -71 -60 -35 -42 -60 -71 -70 -54 -56 -44 19 18
12054A8j7k2n9L8J7L1n6k2M1J7J1J8oo2J9l2J2J9L0Ml1k4JK2q1j9N7J2k5pM8Pl0l1j2J20l8
$$ 18 1 -21 -80 -42 -25 6 -50 -72 -31 -14 -3 15 9 -53 -34 -66 -54 -35 -5 -1 -32 -56 -55 -33 -114 -133 -76 -64 -89 -96 -48 -41 -71 -102 -114 6 -32
12036c2l8RL3LRLm3j6M8pj5K2L9J0j0m9l8kL1Nj3OK0J9n0L8L6k6Qp0KK9K6Oo0K8J7%mn8l9
$$ -32 -70 -61 -28 -25 -16 -13 -56 -72 -24 -31 -46 -24 15 25 15 -34 -72 -74 -43 -38 -51 -45 -25 -6 -56 -18 18 -8 0 -70 -68 -39 -13 -7 -67 -39 -22 -22 -26 -84 -123
12017a23pK2M9K3Ro3J4Pj1nl3J2O9J2k2K1j6k9K2opML0JN8m7o3L3J1l1M1l5Ol6J3L9Qj5J0
$$ -123 -130 -108 -59 -36 -27 -90 -76 -69 -80 -85 -118 -106 -37 -25 -47 -26 -42 -71 -49 -55 -62 -58 -28 -27 31 -16 -79 -46 -35 -66 -25 -60 -54 -90 -77 -38 -30 -45 -35
11998c5l9p2L1N4nmN6l2J5RrJ3l5O0Oj3L3L5nr2oPp8L1K1oM8mq3J9K4J7J7J0J7nm5j5K6L3
$$ -35 -74 -146 -115 -61 -66 -70 -14 -46 -31 -22 -31 -18 -53 7 13 0 33 68 63 -29 -35 -28 -106 -75 -54 -60 -12 -16 -99 -80 -56 -39 -22 -12 5 0 -45 -60 -34 -1
11979ajj1j2J9%Jj0j8j0L0ql0J8m6P8k1k2N3M2l2m5J1m7j0J02l4k3N5K4l2jq4K9J1k2lO6o
$$ -1 -2 -13 -25 -6 -6 -5 -15 -33 -43 -13 -21 -51 -33 -79 -1 -22 -44 9 51 19 -26 -15 -62 -72 30 -4 -27 28 52 20 19 -65 -36 -25 -47 -50 16 10
11961A0p6M6N9j7Jj2jk0j0Qk6j6m4Lj0M6L6j8j7J4K6Rlj0k8%O6k1Mj5j9ML0J6k9Jpj1l6k6
$$ 10 -66 -20 39 22 23 11 10 -10 -20 -12 -38 -54 -98 -95 -105 -59 -23 -41 -58 -44 -18 -9 -12 -22 -50 -50 16 -5 -1 -16 -35 -31 -1 15 -14 -13 -20 -31 -67 -93
11942i3K2N6l2kJ2j3L5k4j0km3N3M0l0j4J5rL4J9Ok0k0M2k0m1J6j6O6j4m8LK2K1M9p2n2L0
$$ -93 -71 -15 -47 -49 -37 -50 -15 -39 -49 -51 -94 -41 -1 -31 -45 -30 -39 -5 14 20 0 -20 22 2 -39 -23 -39 27 13 -35 -32 -10 11 60 -12 -64 -34
11924c4l0K1n5K2O3km1J7LL5j3J2Nq2K7n1M6K6nk0Kk6MM0j4J2l3J1J9j3Lo9j3O8N0k7Mm1K7
$$ -34 -64 -43 -98 -76 -13 -15 -56 -39 -36 -1 -14 -2 3 -79 -52 -103 -57 -31 -36 -56 -54 -80 -76 -36 -50 -38 -71 -60 -41 -54 -51 -120 -133 -65 -15 -42 -38 -79 -52
11906e2O3jq0j2L7J7Jnn1Mj1K1K5k0K7qlK3K1kn9moN4j7K3K0j1Lj2MO7k3l1m6m7QP9M7p0L0
$$ -52 11 10 -70 -82 -45 -28 -27 -32 -83 -79 -90 -69 -44 -64 -37 -45 -48 -25 -4 -6 -65 -69 -75 -21 -38 -15 5 -6 -3 -15 -11 56 33 2 -44 -91 -83 -4 43 -27 3
11886Cj9pn6L5k5n0LM3L8J2Nl1QM2m3k0L2mk0Q3K1r1L6m3j%j0M1J5J1m0n3K8L7Ok7%j8Rl1
$$ 3 -16 -23 -79 -44 -69 -119 -116 -73 -35 -23 -18 -49 -41 1 -42 -62 -30 -34 -54 29 50 -41 -5 -48 -49 -49 -59 -18 -3 8 -32 -85 -57 -20 -14 -41 -41 -59 -50 -81
11867h1j9j7l0N4K3pM5J2l5J8M0j5j3Mj4l2K9j5l8M1L5j1PJ4o3kL3k3L6L7o1k2K9K1nmk4M
$$ -81 -100 -117 -147 -93 -70 -77 -32 -20 -55 -37 3 -12 -25 -21 -35 -67 -38 -53 -91 -50 -15 -26 -19 -5 -68 -70 -37 -60 -24 13 -48 -70 -41 -20 -25 -29 -53 -49
11849d9jNK7l3mM7k0l1K4%qj0M0j2j0J5j7l4M0Mk3k5J8J9Ql6jK1k5J6RJ8K2L9q1j7K9nLQM
$$ -49 -50 -45 -18 -51 -55 -8 -28 -59 -35 -35 -43 -53 -13 -25 -35 -20 -37 -71 -31 -27 -50 -75 -57 -38 -30 -66 -67 -46 -71 -55 -46 -28 -6 33 -48 -65 -36 -41 -38 -30 -26
11830b6j2N3km5%kOJ0Nj2l0J6j6l9K4PM2N1l2m3K0m0M0J6jQo2M4qM1l7j8j9RQ5k9m2L0K2k
$$ -26 -38 15 13 -32 -32 -34 -28 -18 -13 -25 -55 -39 -55 -94 -70 -63 -21 30 -2 -45 -25 -65 -25 -9 -10 -2 -64 -20 -28 13 -24 -42 -61 -52 33 4 -38 -8 14 12
11810A2k3J1l4K3K4Pm8m2k0R6M5m3qm1j2k4pJ1O1p1j9O8J5k4m0K8J4L6j8j1J4J5M8k9n4pJ7
$$ 12 -11 0 -34 -11 13 20 -28 -70 -90 6 51 8 0 -41 -53 -77 -84 -73 -12 -83 -102 -34 -19 -43 -83 -55 -41 -5 -23 -34 -20 -5 43 14 -40 -47 -30
11793c0l4K1K1J6Jj9J9k5q5K7k6J8L5K0j2J5MK8l4n8j6j5Q2J7L8j1k3m3QRJ2KM8j0l6K4K7
$$ -30 -64 -43 -22 -6 -5 -24 -5 -30 -115 -88 -114 -96 -61 -41 -53 -38 -34 -6 -40 -98 -114 -129 -47 -30 8 -3 -26 -69 -61 -52 -40 -38 10 0 -36 -12 15
11775A5p1J7l7pmJ0j2K2L7p7K8O0MK2k4k2K8Oj3PK7%Pj1oK7n3n0M3K6j6n6j3L7L5o6M5L1j0
$$ 15 -56 -39 -76 -83 -87 -77 -89 -67 -30 -107 -79 -19 -15 7 -17 -39 -11 -5 -18 -11 16 16 23 12 6 33 -20 -70 -27 -1 -17 -73 -86 -49 -14 -80 -35 -4 -14
11757a4j8ML9l6m1M8o7jP3k7L7j7n6J0N0j4Qjk7J5QPj3k5J2k2l9j0M2qJ4Ln2M8J1ON5k3lj2
$$ -14 -32 -28 11 -25 -66 -18 -85 -86 -13 -40 -3 -20 -76 -66 -16 -30 -22 -23 -50 -35 -27 -20 -33 -58 -46 -68 -107 -117 -75 -83 -69 -66 -118 -70 -59 -53 2 -21 -24 -36
11737c6k5K2K3J5l6m3J4NKM3k1J0l1M6k5j4qj5j2O0Okj6j6K5mJ2J1l4kj4K1NJ7pl3l7J5M6
$$ -36 -61 -39 -16 -1 -37 -80 -66 -61 -59 -16 -37 -27 -58 -12 -37 -51 -59 -74 -86 -26 -20 -22 -38 -54 -29 -33 -21 -10 -44 -46 -60 -39 -34 -17 -24 -57 -94 -79 -33
11719c3omk9l9mR6jk5k0j7Oj6N7lJ0k4J7K3j0J4lm3J2l3ML1M2l2%L2K8j8pk7m8J7Rk3N3M5
$$ -33 -39 -43 -72 -111 -115 -19 -20 -45 -65 -82 -76 -92 -35 -38 -28 -52 -35 -12 -22 -8 -11 -54 -42 -75 -71 -40 2 -30 -30 2 30 12 5 -22 -70 -53 -44 -67 -14 31
11700C1o9p2M6P5NJ4n6k2k2QRJ0jJj1j7N7LJ1rJ4j9k1J7n7J5L0L0l2Kk1n9OP5J3k2k1K9NK0
$$ 31 -38 -110 -64 11 16 30 -26 -48 -70 -62 -53 -43 -44 -43 -54 -71 -14 -11 0 -9 5 -14 -35 -18 -75 -60 -30 0 -32 -30 -51 -110 -104 -29 -16 -38 -59 -30 -25 -5
11681ek8m1jL4N5J2k4k7k5J2K5%o3m3M7Q9j0k9M1l0j4K1k2m2K3J2l8rK3L6r%k6m4K7P5j1m6
$$ -5 -33 -74 -75 -41 14 26 2 -25 -50 -38 -13 -13 -76 -119 -72 17 7 -22 19 -11 -25 -4 -26 -68 -45 -33 -71 -80 -57 -21 -30 -30 -56 -100 -73 2 -9 -55
11663e5j7k4PL9N1K5l0m1Q9j1m6L4L5K2l1Jm6r1J%J5l1M4ML4k3l8K2K4m6j9K6PK2J3j6K3j0
$$ -55 -72 -96 -89 -50 1 26 -4 -45 44 33 -13 21 56 78 47 48 2 -89 -88 -88 -73 -104 -60 -56 -22 -45 -83 -61 -37 -83 -102 -76 -69 -47 -34 -50 -27 -37
11645c7k8j5K9M7Kj3O3l4m0QM0J1m6m9l9O6K8Nl0k9j5P3k2Nj6m2Lk4M0J5j4L5j5j9m7J7kk1
$$ -37 -65 -80 -51 -4 -2 -15 48 14 -26 -18 22 33 -13 -62 -101 -35 -7 -2 -32 -61 -76 -3 -25 -20 -36 -78 -75 -99 -59 -44 -58 -23 -38 -57 -104 -87 -89 -110
11626a10O9l1k2M5oM3J1k9k5JJ9qko3L1rO4Ll9K6J9Jk1o0LL2J2j1K4l5l7M0J4j5M6j1J1On
$$ -110 -41 -72 -94 -49 -55 -12 -1 -30 -55 -54 -35 -43 -45 -108 -77 -86 -22 -19 -58 -32 -13 -12 -33 -93 -90 -58 -46 -57 -33 -68 -105 -65 -51 -66 -20 -31 -20 -14 -19
11608a9oj6l5JjO7oqlK9m6L7j1rm6%M3k8nL8mNm3L0j7J4M0k3m2JN7K7n5RN2k8m9J2RN0MJ6
$$ -19 -25 -41 -76 -75 -76 -9 -15 -23 -26 3 -43 -6 -17 -26 -72 -72 -29 -57 -62 -24 -28 -23 -66 -36 -53 -39 1 -22 -64 -63 -6 21 -34 -25 27 -1 -50 -38 -29 21 25 41
11588D1j3j0j1m1M9j3m7J5mLM5k2k5l4K8L4qj9KO4k1o1L2k6LlK6J0m6MK7PP9l8n9mn3M7N7
$$ 41 28 18 7 -34 15 2 -45 -30 -34 -31 14 -8 -33 -67 -39 -5 -13 -32 -30 34 13 -48 -16 -42 -39 -42 -16 -6 -52 -48 -21 -14 65 27 -32 -36 -89 -42 15
11569A5o8J6Lk2j0qP9Mn9k7K8L9l4j4q%K1Rk7K6L6M7l3n0m3J9k1K4P0q2m3M3M5M2k6j7L7k
$$ 15 -53 -37 -34 -56 -66 -74 5 9 -50 -77 -49 -10 -44 -58 -66 -66 -45 -36 -63 -37 -1 46 13 -37 -80 -61 -82 -58 12 -70 -113 -70 -25 17 -9 -26 11 9
11551Ij2k4K5J9j3J0p6M5nj0KK6k0m3N6K8o7K1m2j4K2k5J1M5M9m2QK7Om8j3j1J0J6k0J1M5
$$ 9 -3 -27 -2 17 4 14 -62 -17 -22 -32 -30 -4 -24 -67 -11 17 -50 -29 -71 -85 -63 -88 -77 -32 17 -25 -17 10 16 -32 -45 -56 -46 -30 -50 -39 6
11533FMn4PL5M7o0l6K5j6K3kJ9n8k4N6J2K3p6J9ol5RP7p2NM2m1K4m6j7R3L4o4j6L2J6M2p3
$$ 6 10 -44 -37 -2 45 -15 -51 -26 -42 -19 -21 -2 -60 -84 -28 -16 7 -69 -50 -56 -91 -82 -5 -77 -72 -30 -71 -47 -93 -110 -17 17 -47 -63 -31 -15 27 -46
11515d6l7j7J7P3p4j8L0M1K3rk0K8K1KKj0JK5j4nj5K0k4k5k2NqL1jJ0k6k3K0K8Rk3K2k2qp
$$ -46 -83 -100 -83 -10 -84 -102 -72 -31 -8 -17 -37 -9 12 14 16 6 7 32 18 13 -2 18 -6 -31 -53 -48 -56 -25 -26 -16 -42 -65 -45 -17 -8 -31 -9 -31 -39 -46
11496d6Mkl3k0K3P1j2j7lJ3qk9J0j1k9K3K9J8m6j8J8ll1k3M3L9N8l6L5l6j3K4l7J8OL9mQJ2
$$ -46 -42 -44 -77 -97 -74 -3 -15 -32 -35 -22 -30 -59 -49 -60 -89 -66 -37 -19 -65 -83 -65 -68 -99 -122 -79 -40 18 -18 17 -19 -32 -8 -45 -27 -21 18 14 22 34
11478C4k0nK5l9k6J1rk4L1L1j7j3l4L1M1Pp4k6kN6J3l2j2pN7n1j7L5K1M9n4J9pj6L9Ol0p1
$$ 34 14 9 34 -5 -31 -20 -29 -53 -22 9 -8 -21 -55 -24 17 24 -50 -76 -78 -22 -9 -41 -53 -60 -3 -54 -71 -36 -15 34 -20 -1 -8 -24 15 21 -9 -80
11459h0L0L3j3l6L0m6K2nl2J5l7L6JJ3k6K8J1j1J0NL7l9k8M8J2K0l7o8lN1J2KJ9l1j2PLJ7
$$ -80 -50 -17 -30 -66 -36 -82 -60 -65 -97 -82 -119 -83 -82 -69 -95 -67 -56 -67 -57 -52 -15 -54 -82 -34 -22 -2 -39 -107 -110 -59 -47 -45 -26 -57 -69 -62 -59 -42
11441d2M0k4L3l1pMn3LJ02j7k7j9P2J7q9LJ0k6j9N2l7l5M6m3o%L7J6K7%l3J5j0K5m8roK2O4
$$ -42 -2 -26 7 -24 -31 -27 -80 -77 25 8 -19 -38 34 51 -38 -35 -25 -51 -70 -18 -55 -90 -44 -87 -93 -93 -56 -40 -13 -13 -46 -31 -41 -16 -64 -73 -79 -57 7
11423GP0m8n5j6Oj8L0k8j9j0PJ1k6K2K5K2j8K1Km8Kk8LPL3J3k3j4L0K1LK4j1n0NL3l2J9MJ3
$$ 7 77 29 -26 -42 -36 -54 -24 -52 -71 -81 -74 -63 -89 -67 -42 -20 -38 -17 -15 -63 -61 -89 -86 -79 -46 -33 -56 -70 -40 -19 -16 8 -3 -53 -48 -15 -47 -28 -24 -11
11404a1Mk4J0kl3j1k1QPk1Oo0P1Q5jKq0k4L8j2J3J6l0J5j3J8L2K3k3l1k4j4Q0l5Lm4L8J6K3
$$ -11 -7 -31 -21 -23 -56 -67 -88 -80 -73 -94 -88 -148 -77 8 7 9 -71 -95 -57 -69 -56 -40 -70 -55 -68 -50 -18 5 -18 -49 -73 -87 -7 -42 -39 -83 -45 -29 -6
11385fK7j09J9L1k0j0J3K6j1pJ1k1mL2j4J3pJ8K3pl9J4L0QK7l0l8K7n7k7j8O2Rrl2l2j7Q5
$$ -6 21 -88 -69 -38 -58 -68 -55 -29 -40 -47 -36 -57 -61 -29 -43 -30 -37 -19 4 -3 -42 -28 2 10 37 7 -31 -4 -61 -88 -106 -44 -35 -44 -76 -108 -125 -40
11367d0K4j0L7j7k8K0n4N2Mm0L6l3kj5J4M5N8n9k8O2Kmk4n0J2l2N8L3J0o3j9K3Kj9K8l0k4
$$ -40 -16 -26 11 -6 -34 -14 -68 -16 -12 -52 -16 -49 -51 -66 -52 -7 51 -8 -36 26 28 24 0 -50 -38 -70 -12 21 31 -32 -51 -28 -26 -45 -17 -47 -71
11349g1PL2J3NJ9KL4l2QkJ9k3m0j9j7K9ko0J6N6l2m0Q7L9n8j8K8J5l4J8Qpk4Rm6j8M4J6j5
$$ -71 -64 -32 -19 -14 5 7 41 9 17 15 34 11 -29 -48 -65 -36 -38 -98 -82 -26 -58 -98 -11 28 -30 -48 -20 -5 -39 -21 -13 -20 -44 -35 -81 -99 -55 -39 -54
11331e4PL8l2lL6k4K5%L2J8n3o5K0M0k9onM1n0jL2RjRJk4l9Kj4N2Kl4J3NQK0pk8k0j7Rk1N
$$ -54 -47 -9 -41 -44 -8 -32 -7 -7 25 43 -10 -75 -55 -15 -44 -50 -55 -14 -64 -65 -33 -24 -25 -16 -15 -39 -78 -76 -90 -38 -36 -70 -57 -52 -44 -24 -31 -59 -79 -96 -87 -108 -103
11310a03K7J4L9J8q0K9J8LL3K0k0p5ppM7M0Rk1k4Kj6OM0N1n6m9J8Mk4j4nqJ8M0J7j1Q6k1K2
$$ -103 -76 -62 -23 -5 -85 -56 -38 -35 -2 18 -2 -77 -84 -91 -44 -4 5 -16 -40 -38 -54 -48 -8 43 -13 -62 -44 -40 -64 -78 -83 -91 -73 -33 -16 -27 59 38 60
11292F0n3o4m1L3K2k3OJJ2J1n2K2Rl5L3l5O4K3n8%N1k2J6m7lOL0mj7L6k9k8k6Q3LJ2Nj7m8
$$ 60 7 -57 -98 -65 -43 -66 -60 -59 -47 -36 -88 -66 -57 -92 -59 -94 -30 -7 -65 -65 -14 -36 -20 -67 -70 -64 -34 -38 -55 -19 -48 -76 -102 -19 -16 -4 1 -16 -64
11273f4J9J0j3L5l1pl3QJ2J4j7j4j4j1L7K2J8K0J1L2p6%j0P9oNo3mk0JpqO3l2%M4K5l8k0L3
$$ -64 -45 -35 -48 -13 -44 -51 -84 -76 -64 -50 -67 -81 -95 -106 -69 -47 -29 -9 2 34 -42 -42 -52 27 21 26 -37 -41 -61 -60 -67 -75 -12 -44 -44 0 25 -13 -33 0
11254@m4j2K8lm3n6M8K8L8qn0J5oK4K2o5K5M3K9n0L3l4M5J2k5o4J4J4L2Oq9k3N1J8L3kONl
$$ 0 -44 -56 -28 -31 -74 -130 -82 -54 -16 -24 -74 -59 -65 -41 -19 -84 -59 -16 13 -37 -4 -38 7 19 -6 -70 -56 -42 -10 -4 -93 -116 -65 -47 -14 -16 -10 -5 -8
11235hm5m3M3K8J5n2qL6J5QM2p0p2L3J3Kk1L5L2L1l4j3L1Qj7N7m8l6Qk5j6m5Q0l7N2K4J1m8
$$ -8 -53 -96 -53 -25 -10 -62 -70 -34 -19 -11 31 -39 -111 -78 -65 -63 -84 -49 -17 14 -20 -33 -2 6 -11 46 -2 -38 -30 -55 -71 -116 -36 -73 -21 3 14 -34
11217c4NmOOl9M3l3k2J08k0Ll9J6K7o6o1oPP8M5kj4Pl0K%l1M6j2jJ7k7j2o0K4QL0K1k3nk0
$$ -34 -29 -33 -27 -21 -60 -17 -50 -72 36 16 19 -20 -4 23 -43 -104 -110 -103 -25 20 18 4 11 -19 -17 -17 -48 -2 -14 -15 2 -25 -37 -97 -73 -65 -35 -14 -37 -42 -62
11198f2J8J9j7n1K2N3jl5j0k2K2K2nnK4N0l0k3j1j1K4k4k1j1K2M5Nl3j0K0J6J4mj1K4Qk6m8
$$ -62 -44 -25 -42 -93 -71 -18 -19 -54 -64 -86 -64 -42 -47 -52 -28 22 -8 -31 -42 -53 -29 -53 -74 -85 -63 -18 -13 -46 -56 -36 -20 -6 -10 -21 3 11 -15 -63
11180f3PMpJ9j9K6lk3K6nOM1K8m9k9J2m4j2lN3oJ9l2k4j9%M7JJj1k1L3J7k4nk8O5Rl6M5M0
$$ -63 -56 -52 -59 -40 -59 -33 -36 -59 -33 -38 -32 9 37 -12 -41 -29 -73 -85 -88 -35 -41 -22 -54 -78 -97 -97 -50 -49 -48 -59 -80 -47 -30 -54 -59 -87 -22 -13 -49 -4 36
11160C6m2l1m0n5L1O8J5Lk8L9j7O6l2j2k2J4K9m0l5l5J4K0J8%Jk2K3Rk5k8N6j2N0k0%k8J4
$$ 36 -6 -37 -77 -132 -101 -33 -18 -15 -43 -4 -21 45 13 1 -21 -7 22 -18 -53 -88 -74 -54 -36 -36 -35 -57 -34 -25 -50 -78 -22 -34 16 -4 -4 -32 -18
11142a8m2m9Q2N6n9m5N1n6j2L1k4N2K3n6L7L1k7Lj8K9mJ5qn7K7O3k8p1K4L1m8j0M0l8RK8n
$$ -18 -60 -109 -27 29 -30 -75 -24 -80 -92 -61 -85 -33 -10 -66 -29 2 -25 -22 -40 -11 -15 0 -8 -65 -38 25 -3 -74 -50 -19 -67 -77 -37 -75 -66 -38 -43
11125d3L7k3OO1m1l4K8oj1N7k2jknJ6lm5m5O1k3OL2k0n1M2Nj2k7L3J6j5P6n4j5j7N8l4J1K0
$$ -43 -6 -29 -23 38 -3 -37 -9 -15 -26 31 9 8 6 1 17 14 -31 -76 -15 -38 -32 0 -20 -71 -29 -24 -36 -63 -30 -14 -29 47 -7 -22 -39 19 -15 -4 16
11106A6l3k3JJ1k4J7K9L9mj1o0J9J8m0rL4l4K4p2QoK9M9qOm4K5k0L7M4o5K9l8l2N5j6rL9p4
$$ 16 -17 -40 -39 -28 -52 -35 -6 33 29 18 -42 -23 -5 -45 -54 -20 -54 -30 -102 -94 -100 -71 -22 -30 -24 -68 -43 -63 -26 18 -47 -18 -56 -88 -33 -49 -58 -19 -93
11088i3K1N1k3m6K2J5jmk4J2M9m2j4J8kK9k4ol2pPN2J7M7mQJl2n3K1j9K6nL8n5rk1k7M6J2
$$ -93 -72 -21 -44 -90 -68 -53 -54 -58 -82 -70 -21 -63 -77 -59 -61 -32 -56 -62 -94 -101 -94 -42 -25 22 18 26 27 -5 -58 -37 -56 -30 -35 3 -52 -61 -82 -109 -63 -51
11068e1j1J9Qj4k6M5J7J9o5oQ9q8j1J0jL5lk3J9OK8l8l7K7O8L2m1k7M1k6J5k1k5N8n0lN3p
$$ -51 -62 -43 -35 -49 -75 -30 -13 6 -59 -65 24 -64 -75 -65 -66 -31 -34 -57 -38 -32 -4 -42 -79 -52 16 48 7 -20 21 -5 10 -11 -36 22 -28 -31 22 15
11050A5kL3j5m0m2RoJ3k1k0L1L5k3j8J6J7o4O5J0n7J9L3j2m9O6N1nm9j0%rmM2n4j4Qj5N1m
$$ 15 13 46 31 -9 -51 -42 -48 -35 -56 -76 -45 -10 -33 -51 -35 -18 -82 -17 -7 -64 -45 -12 -24 -73 -7 44 39 -10 -20 -20 -29 -33 9 -45 -59 -51 -66 -15 -19
11032a9J1k8j7j7JNK9m0j1M3J0J1l1KK9J3j1j3J2l2K1k2rL1nj4M5k3j3J9j7nk5N3J6k9kKM
$$ -19 -8 -36 -53 -70 -69 -64 -35 -75 -86 -43 -33 -22 -53 -51 -22 -9 -20 -33 -21 -53 -32 -54 -63 -32 -37 -51 -6 -29 -42 -23 -40 -45 -70 -17 -1 -30 -32 -30 -26
11013b6%J8Rk1l2J5k5K0L9l9Mn8K3QK0K7l6J7k8L6pl0J5OL0ok7m6OpL8L1l1O4m3j6oJ3L3L8
$$ -26 -26 -8 1 -20 -52 -37 -62 -42 -3 -42 -38 -96 -73 -65 -45 -18 -54 -37 -65 -29 -36 -66 -51 -45 -15 -21 -48 -94 -88 -95 -57 -26 -57 7 -36 -52 -58 -45 -12 26
10994B6k5m7NJ9l8l5j4O0QK6mM0m5Qk2Nl1K4MJ8M9j7n9l2J7%J1L9L5o5Jj8M6J0m9Ml8N9KP
$$ 26 1 -46 -41 -22 -60 -95 -109 -49 -41 -15 -19 21 -24 -16 -38 -33 -64 -40 -36 -18 31 14 -45 -77 -60 -60 -49 -10 25 -40 -39 -57 -11 -1 -50 -46 -84 -25 -23 -16
10975a6ro0n4K4L7OLL4K7j7J2k4ok9j4N0qL3rm0o1L1M2Lk6L9k3pl2J8J7L9j3kK1qM4prJ6j5
$$ -16 -25 -85 -139 -115 -78 -72 -69 -35 -8 -25 -13 -37 -43 -72 -86 -36 -44 -11 -20 -60 -121 -90 -48 -45 -71 -32 -55 -62 -94 -76 -59 -20 -33 -35 -14 -22 22 15 6 22 7
10955Gj2j3j8J1p1p6K4N6N9Nn3N0L0m7j7JPM0K3l5K4J5l8j5qJ4m2l4N2N4Mj7nj5Ql2K8qKL0
$$ 7 -5 -18 -36 -25 -96 -172 -148 -92 -33 -28 -81 -31 -1 -48 -65 -64 -57 -17 6 -29 -5 10 -28 -43 -51 -37 -79 -113 -61 -7 -3 -20 -25 -40 -32 -64 -36 -44 -42 -12
10936a2k1k4K8j1M1l8l2oL3j7J9l6K7M8rl2K9k0k8M2rMM3m7pl2N4K5o5Q1j6q2RK0m3%K1N8
$$ -12 -33 -57 -29 -40 1 -37 -69 -75 -42 -59 -40 -76 -49 -1 -10 -42 -13 -33 -61 -19 -28 -24 19 -28 -35 -67 -13 12 -53 28 12 -70 -61 -41 -84 -84 -63 -5
10918eM0m8k8K0j5kMJ0m4J2j8L6K3qj9j9J5K9K2m1pL8j2K9m4j1m0qJ2k4M4O0K1k2K1o7j0L5
$$ -5 35 -13 -41 -21 -36 -38 -34 -24 -68 -56 -74 -38 -15 -23 -42 -61 -46 -17 5 -36 -43 -5 -17 12 -32 -43 -83 -91 -79 -103 -59 1 22 0 21 -46 -56 -21
10900b1K2l5l6RL6l3Jk7NL3o2Kk6rN1j9L0pJ6J9k6j0K4J1J4k5K9k7J2M7n7m1KJ8K2M4kn0l2
$$ -21 1 -34 -70 -61 -25 -58 -57 -84 -79 -46 -108 -106 -132 -141 -90 -109 -79 -86 -70 -51 -77 -87 -63 -52 -38 -63 -34 -61 -49 -2 -59 -100 -98 -80 -58 -14 -16 -66 -98
10882i8P4lpl0J6MK6k5K9O5j9qj2j0pj9k7N1ll1k1K9j1m8M8L1pm1J%j2pL0jJ9Nk6NJ8j4Nj3
$$ -98 -24 -27 -34 -64 -48 -44 -18 -43 -14 51 32 24 12 2 -5 -24 -51 0 -3 -34 -55 -26 -37 -85 -37 -6 -13 -54 -53 -53 -65 -72 -42 -43 -24 -19 -45 -40 -22 -36 -31 -44
10862d4jl1j2mK6K1mJ3O7m4K3J6m0oJ4l4j0l0Q0m9Lj8j8MJ2L5l6K6k7l9N6j8N3nl0j9NN7l4
$$ -44 -45 -76 -88 -92 -66 -45 -49 -36 31 -13 10 26 -14 -20 -6 -40 -50 -80 0 -49 -46 -64 -82 -78 -66 -31 -67 -41 -68 -107 -51 -69 -16 -21 -51 -70 -65 -8 -42
10843d2j4k2JK0J0J1Mpk3RJ2J9Jqk6m0J7j3O9PpL1l1m8K1k6N0N7l3n5KJ2k8j1OM1L7l5Rmp2
$$ -42 -56 -78 -77 -57 -47 -36 -32 -39 -62 -53 -41 -22 -21 -29 -55 -95 -78 -91 -22 -15 -22 9 -22 -70 -49 -75 -25 32 -1 -56 -54 -42 -70 -81 -75 -34 3 -32 -23 -27 -99
10823i9K8NRJ7oM1J6j6n5K0K2MN8o9k5oJ5k4mjJ8l7K7QK7J3M8j1l8L4o3LK8LqJ4n3J1j3K1
$$ -99 -71 -66 -57 -40 -46 -5 11 -5 -60 -40 -18 -14 44 -25 -50 -56 -41 -65 -69 -70 -52 -89 -62 -54 -27 -14 34 23 -15 19 -44 -41 -13 -10 -18 -4 -57 -46 -59 -38
10804c8K0J9K3l6n2L2m9%K2M1m8L7M7l9n3K5L0LOl2K2Kjk1Ko1M1rl5PK5K8nJ0L6l6L5Qj2J
$$ -38 -18 1 24 -12 -64 -32 -81 -81 -59 -18 -66 -29 18 -21 -74 -49 -19 -16 -10 -42 -20 -18 -19 -40 -38 -99 -58 -67 -102 -95 -70 -42 -47 -37 -1 -37 -2 6 -6 -5
10785eJ9l9j2N2j0Njmp0L3L1k4K2k0L8J8j4J4j5j4K7Ml3P%K1Jr1k8L8pl3M6j8lNK3l9J1l0
$$ -5 14 -25 -37 15 5 10 9 5 -65 -32 -1 -25 -3 -23 15 33 19 33 18 4 31 35 2 9 9 30 31 -60 -88 -50 -57 -90 -44 -62 -65 -60 -37 -76 -65 -95
10766i5K5JK7kL8j2kj3l6N5J2n2L1jOjj3m0O4j3l7J8k7J2Ol9k4M5J7mM2ko6QJ2N9m7j9plN6
$$ -95 -70 -69 -42 -44 -6 -18 -20 -33 -69 -14 -2 -54 -23 -24 -18 -19 -32 -72 -8 -21 -58 -40 -67 -55 -49 -88 -112 -67 -50 -54 -12 -14 -80 -72 -60 -1 -48 -67 -74 -77 -21
10747b1k4m4M7M1Pj3j8M5n4J4kL5J7l8j0JNq7N2n%K0NLlJ6j9m6mP5j7m5J0K8%p0lN9m3j5j1
$$ -21 -45 -89 -42 -1 6 -7 -25 20 -34 -20 -22 13 30 -8 -18 -17 -12 -99 -47 -52 -52 -32 -27 -24 -27 -11 -30 -76 -80 -5 -22 -67 -57 -29 -29 -99 -102 -43 -86 -101 -112
10727a12M9J1J4j7M7k3m3m0j3NOK2JK8K1j1k2J2K7J3k3oMl9K0J5M8K2r7Rj4J4j2QL2K5l9J6
$$ -112 -63 -52 -38 -55 -8 -31 -74 -114 -127 -122 -116 -94 -93 -65 -44 -55 -77 -65 -38 -25 -48 -54 -50 -89 -69 -54 -6 16 -81 -72 -86 -72 -84 -76 -44 -19 -58 -42
10709d2K3PQn8M7L0k7l1L2lj0m8L3L8Pl2%J9%Mk6J3l0K6J9n4JJ6qj9j9L3L3J5j3J2j5k7J2
$$ -42 -19 -12 -4 -62 -15 15 -12 -43 -11 -14 -24 -72 -39 -1 6 -26 -26 -7 -7 -3 -29 -16 -46 -20 -1 -55 -54 -38 -46 -65 -84 -51 -18 -3 -16 -4 -19 -46 -34
10690c4M2k9l1m2L6l0J2L0NlK8pMk0L6o0nN9l2j0NK9kJ2Lk9L5rK0k5m6J0K3j0n1J1MN4J1l8
$$ -34 8 -21 -52 -94 -58 -88 -76 -46 -41 -44 -16 -23 -19 -39 -3 -63 -68 -9 -41 -51 -46 -17 -19 -7 -4 -33 2 -7 13 -12 -58 -48 -25 -35 -86 -75 -71 -17 -6 -44
10671d4JJ4J3n0J2K1qoj4j3J5k3O1L4m1Km1N7m7p4kkL0L3L2NpJk0J4l4O6j9K2Mnj7J6pl9M
$$ -44 -43 -29 -16 -66 -54 -33 -41 -47 -61 -74 -59 -82 -21 13 -28 -26 -67 -10 -57 -131 -133 -135 -105 -72 -40 -35 -42 -41 -61 -47 -81 -15 -34 -12 -8 -13 -30 -14 -21 -60 -56
10652e6J1J5k6L6jj7NK1l0K5l0k8L0l0m1N9J9m5M0k6Pj6M8L8KK1q5l0M5Rk0Kk1J7Mj1qL2j4
$$ -56 -45 -30 -56 -20 -21 -38 -33 -12 -42 -17 -47 -75 -45 -75 -116 -57 -38 -83 -43 -69 -62 -78 -30 8 10 31 -54 -84 -39 -30 -50 -48 -69 -52 -48 -59 -67 -35 -49
10633d9j4M0j1m1qM3K4lK5j2k3j4k8L9l0L5Kl5K4RN0j7Nm6m3pL7Pj1k9k5L3k2l0K9J6MQ%J7
$$ -49 -63 -23 -34 -75 -83 -40 -16 -19 6 -6 -29 -43 -71 -32 -62 -27 -25 -60 -36 -27 23 6 11 -35 -78 -85 -48 -41 -52 -81 -106 -73 -95 -125 -96 -80 -76 -68 -68 -51
10614e1oJ8j7KOLj2j3K6K9J7m0L7l7p2M0O7k0Kj1j8M7kk2nk2J0l2o0K2Q5K8m9k1M0Pk4Jk2
$$ -51 -57 -39 -56 -54 -48 -45 -57 -70 -44 -15 2 -38 -1 -38 -110 -70 -3 -23 -21 -32 -50 -3 -5 -27 -32 -54 -44 -76 -136 -114 -29 -1 -50 -71 -31 -24 -48 -47 -69
10595f9RJ5pNK1j7j4M6j4K6k8J4K4OK6J0j2j2l8jJJ5Qm3k2Pk1K1J6L2n0j4oJ0K5j0j0J0k1
$$ -69 -60 -45 -52 -47 -26 -43 -57 -11 -25 1 -27 -13 11 17 43 53 41 29 -9 -10 -9 6 14 -29 -51 -44 -65 -44 -28 4 -46 -60 -66 -56 -31 -41 -51 -41 -62
10577f2K6k6k4N6m9J4K7J1k0KO5k4j1L0lpJ4n2J9N0l3m7Qn5P6j7N1k6l2k0K6j0j5M2rm7L3
$$ -62 -36 -62 -86 -30 -79 -65 -38 -27 -47 -45 20 -4 -15 15 12 5 19 -33 -14 36 3 -44 -36 -91 -15 -32 19 -7 -39 -59 -33 -43 -58 -16 -25 -72 -39
10559c9j5J8qRj2RK0k1K0l0L4NjM1m0m8j3L3qMM1J6k3k1k6JJJK9kn2l4L6j8K9M5j0k1Mj3L5
$$ -39 -54 -36 -44 -35 -47 -38 -18 -39 -19 -49 -15 -10 -11 30 -10 -58 -71 -38 -46 -42 -1 15 -8 -29 -55 -54 -53 -52 -23 -25 -77 -111 -75 -93 -64 -19 -29 -50 -46 -59 -24
10540b4Om6j3j2P%M3M1J9jn2k7j3N2J3o1J4J7K4J0L1l5K4M5j1r8k0NK0j1j8M3j2m7L4nm8M5
$$ -24 -18 -64 -77 -89 -82 -82 -39 2 21 20 -32 -59 -72 -20 -7 -68 -54 -37 -13 -3 28 -7 17 62 51 -47 -67 -62 -42 -53 -71 -28 -40 -87 -53 -58 -106 -61
10522f1J4j0K7n1%L7j2k2O0j0J5m6LL6j4j1N0m9jl6k4P0K6l5lL3p5M4j0J3k4O7k1NM2j7Lr
$$ -61 -47 -57 -30 -81 -81 -44 -56 -78 -18 -28 -13 -59 -56 -20 -34 -45 5 -44 -45 -81 -105 -35 -9 -44 -47 -14 -89 -45 -55 -42 -66 1 -20 -15 27 10 13 4
10503Dm9K3Jrj0k0lN2l7n1L7K5nJ4J5k1%q1J8N8j0N3l4%j5j1l4kP2j5RJ3l7pPPl7Mo6L1K9
$$ 4 -45 -22 -21 -30 -40 -60 -63 -11 -48 -99 -62 -37 -42 -28 -13 -34 -34 -115 -97 -39 -49 4 -30 -30 -45 -56 -90 -92 -20 -35 -26 -13 -50 -57 -50 -43 -80 -76 -142 -111 -82
10484h2mM9Jj1K6k4j7J1rK3M6K2n9l5kj1PN0k6p0M5J9K9j5K2K5p6J4k6J9J2Lk4rM9R2m2j09
$$ -82 -86 -37 -36 -47 -21 -45 -62 -51 -60 -37 9 31 -28 -63 -65 -76 -69 -19 -45 -115 -70 -51 -22 -37 -15 10 -66 -52 -78 -59 -47 -44 -68 -77 -28 64 22 -87
10466h7K9N3l5j8RK6j9K3J6l9j6N1Kl8K0RJ5KJ6p5J4J3J3Mm9j0O7m8NL3N2l1Jl0l7kN9k6l5
$$ -87 -58 -5 -40 -58 -49 -23 -42 -19 -3 -42 -58 -7 -5 -43 -23 -14 1 3 19 -56 -42 -29 -16 -12 -61 -71 -4 -52 -47 -14 38 7 8 -22 -59 -61 -2 -28 -63
10447f3j4M9mj6Q4l4p7j3K9K1J5o7j5K7RkL8qj8K3L9pm3l4J2LJ2L7N9L4j01p9K6K0P2J1m2
$$ -63 -77 -28 -32 -48 36 2 -75 -88 -59 -38 -23 -90 -105 -78 -69 -71 -33 -41 -59 -36 3 -4 -47 -81 -69 -66 -54 -17 42 76 -25 -104 -78 -58 14 25 -17
10430a7qL5o0K0jk7QK7L1n4K6N1l1oK8kn9MJ7k2%pk8k6M3J1j2Mk4j6J0k4M5k0JM6j1L3L5J4
$$ -17 -25 10 -50 -30 -31 -58 -50 -23 8 -46 -20 31 0 -6 22 20 -39 -35 -18 -40 -40 -47 -75 -101 -58 -47 -59 -55 -79 -95 -85 -109 -64 -84 -83 -37 -48 -15 20 34
10410C4l8Pn5K4K4l9kl1K1j9k0MK4M1n6m7Q2K5Jm6K5K1j2R%l1J2rP4Ponp9j4N3l2L8J9k2k6
$$ 34 -4 3 -52 -28 -4 -43 -45 -76 -55 -74 -94 -90 -66 -25 -81 -128 -46 -21 -20 -66 -41 -20 -32 -23 -23 -54 -42 -51 23 30 24 19 -60 -74 -21 -53 -15 4 -18 -44
10391d4M0k4j7RL3J5Nk8k8J3j8j2j9k2mQ2m4j6MM5pJK1MJ6m6j9n1J1P1Qm2l3N3L4n7j2K2J9
$$ -44 -4 -28 -45 -36 -3 12 17 -11 -39 -26 -44 -56 -75 -97 -101 -19 -63 -79 -75 -30 -37 -36 -15 -11 5 -41 -60 -111 -100 -29 -21 -63 -96 -43 -9 -66 -78 -56 -37
10373c7j0M2ol1QO6j8p2M7J0Nj9l3noJ2m3lJ1N2k3qM1o5o4L8Q0N1k5j7Pj7k3N9qJ3Om6M7j7
$$ -37 -47 -5 -11 -42 -34 32 14 -58 -11 -1 4 -15 -48 -53 -59 -47 -90 -93 -82 -30 -53 -61 -20 -85 -149 -111 -31 20 -5 -22 -15 -32 -55 4 -4 9 15 -31 16 -1
10354aJ2l2NQk0JM5j2k4j8LL1n5l6j4K9L0L2J7m8L4k2L1m0J0k2L0j4J4j5k8M7L6j6l7j4K5
$$ -1 11 -21 -16 -8 -28 -27 18 6 -18 -36 -33 -2 -57 -93 -107 -78 -48 -16 1 -47 -13 -35 -4 -44 -34 -56 -26 -40 -26 -41 -69 -22 14 -2 -39 -53 -28
10336b8LK7K6m7j0l1mK6j2oj4L2l2L7K8m5J6K1K1l2l5mP0l5k0L8L4o0LOK2m4J8%Lk8m3L6P
$$ -28 -25 2 28 -19 -29 -60 -64 -38 -50 -56 -70 -38 -70 -33 -5 -50 -34 -13 8 -24 -59 -63 7 -28 -48 -10 24 -36 -33 -27 -5 -49 -31 -31 -28 -56 -99 -63 -56
10317e6L1Pp4M1J0L0j6rL0Oj1p1LJ0m4L1J2jMl2J3rJ0RK0J3k1M%N9J8l1L1J7l5J7j6k0%j4
$$ -56 -25 -18 -92 -51 -41 -11 -27 -36 -6 0 -11 -82 -79 -69 -113 -82 -70 -71 -67 -99 -86 -95 -85 -76 -56 -43 -64 -60 -60 -1 17 -14 17 34 -1 16 0 -20 -20 -34
10298c4K5n3l3M3pm3L6kJ0L5LL2rn3Q1n2OQK7j1k8%oJ7J0Nl9j2qK0Ol5L1k7K0L2m3n9P0Qm4
$$ -34 -9 -62 -95 -52 -59 -102 -66 -68 -58 -23 -20 12 3 -50 31 -21 -15 -7 20 9 -19 -19 -25 -8 2 7 -32 -44 -52 -32 -26 -61 -30 -57 -37 -5 -48 -107 -37 -29 -73
10279g3j7M5k1L2K7p7J5K6NJJ7j6M7nNl7l0N7k2j0J8K4noo5M7m4K2L0j%k8j8LL1pQqpk7J2
$$ -73 -90 -45 -66 -34 -7 -84 -69 -43 -38 -37 -20 -36 11 6 11 -26 -56 1 -21 -31 -13 11 6 0 -65 -18 -62 -40 -10 -11 -11 -39 -57 -54 -23 -30 -22 -30 -37 -64 -52
10259e2kJk3P6Nj8k9nl8J3P6n1j3k1JlK4l3k2N2M7k3M9o8L6j5j4M6J7k5n3N7K%JNK0l1j0k1
$$ -52 -54 -53 -76 0 5 -13 -42 -47 -85 -72 4 -47 -60 -81 -80 -83 -59 -92 -114 -62 -15 -38 11 -57 -21 -36 -50 -4 13 -12 -65 -8 -6 -6 -5 0 20 -11 -21 -42
10240d2p2R3K9n6J6L9m6l3j4M4L1k5%J4J1l0Mm1KoN7J3oK1j8J3k2jK7q1j1J6J5lJ8p%m2RM2
$$ -42 -114 -21 8 -48 -32 7 -39 -72 -86 -42 -11 -36 -36 -22 -11 -41 -37 -78 -76 -82 -25 -12 -18 3 -15 -2 -24 -25 2 -79 -90 -74 -59 -62 -44 -51 -51 -93 -84 -42
10221d2K6m5J0M8rRjk0k3J5m5NpKM1L7m8kl6j9K8KNN0k1j9K7J0k1Rl1j8K1q3J4M1L5M7NJ5
$$ -42 -16 -61 -51 -3 -12 -3 -4 -24 -47 -32 -77 -72 -79 -77 -36 1 -47 -49 -85 -104 -76 -74 -69 -19 -40 -59 -32 -22 -43 -34 -65 -83 -62 -145 -131 -90 -55 -8 -3 12
10202A2o3m4Q4l6l5J2j1M4j7pJ6Rk8J2K4l8j1K2J2k2j6J8L2k7L1J3j6J3j6j2J8J9l9k8RQ8
$$ 12 -51 -95 -11 -47 -82 -70 -81 -37 -54 -61 -45 -36 -64 -52 -28 -66 -77 -55 -43 -65 -81 -63 -31 -58 -27 -14 -30 -17 -33 -45 -27 -8 -47 -75 -66 22
10185B2j3o5Rm0lM6l6lJ7L7KJ5j7k8j3j0M4J1L3q3k3K2j0J6J5K0L7JRm1J2j3L0J8l6k6m6L3
$$ 22 9 -56 -47 -87 -90 -44 -80 -83 -66 -29 -27 -12 -29 -57 -70 -80 -36 -25 8 -75 -98 -76 -86 -70 -55 -35 2 3 12 -29 -17 -30 0 18 -18 -44 -90 -57
10167e7J7M5l7J2J0j2k7J1J1mJ7N4n9p6k3K1L1K1M1Qmoj0L5j5j7j6k1L8j9j7pJ8L4J7Jk2J3
$$ -57 -40 5 -32 -20 -10 -22 -49 -38 -27 -31 -14 40 -19 -95 -118 -97 -66 -45 -4 4 0 -6 -16 19 4 -13 -29 -50 -12 -31 -48 -55 -37 -3 14 15 -7 6
10149Fql8MK6m4K8K0K1n7j7k6M2J2MK1K5qokJ7j9l1k7L0oKk4nL4J8rpk9%K2K1j4l5J4J8L0
$$ 6 -2 -40 -36 -10 -54 -26 -6 15 -42 -59 -85 -43 -31 -27 -6 19 11 5 3 20 1 -30 -57 -27 -33 -31 -55 -60 -26 -8 -17 -24 -53 -53 -31 -10 -24 -59 -45 -27 3
10129Cj2m0qk8QL2RK1k8qj7KL8rpO4l6k1k5J9K0op0J5k8J1J6O2l5KK0K0m7j6LL4J0l1jl0L
$$ 3 -9 -49 -57 -85 -77 -45 -36 -15 -43 -51 -68 -66 -28 -37 -44 20 -16 -37 -62 -43 -23 -29 -99 -84 -112 -101 -85 -23 -58 -56 -36 -16 -63 -79 -76 -42 -32 -63 -64 -94 -91
10110i1K8K9j1JM0l2Qn2j5M6l1K0J5j5qK8K4Rk1jK5rk3l9o5O2J5N7j1L3k1k2j4Mm9L7J5k4
$$ -91 -63 -34 -45 -44 -4 -36 -28 -80 -95 -49 -80 -60 -45 -60 -68 -40 -16 -7 -28 -29 -4 -13 -36 -75 -140 -78 -63 -6 -17 16 -5 -27 -41 -37 -86 -49 -34 -58
10091e8j3Q6l5j2lk7j2L9NK4k1L1m2l4M9O9m6o6NL2m3M4m5J5oJ1j6LN9L7n4n2J4rQj7O0Nm6
$$ -58 -71 15 -20 -32 -35 -62 -74 -35 -30 -6 -27 4 -38 -72 -23 46 0 -66 -61 -29 -72 -28 -73 -58 -64 -53 -69 -66 -7 30 -24 -76 -62 -71 -63 -80 -20 -15 -61
10073f1l6L2lL8l5K0O2lm4K4J2m9M6jk2L5j7o2j7L9oL3m3k1k3oM3J8L2ml4k9M9K0l8K6k0m
$$ -61 -97 -65 -68 -30 -65 -45 17 14 -30 -6 6 -43 3 2 -20 15 -2 -64 -81 -42 -48 -15 -58 -79 -102 -108 -65 -47 -15 -19 -53 -82 -33 -13 -51 -25 -45 -49
10055d9L2j0k1K2K6J0l8l1n7KJ1M5P1j5j9RMjK7qk7J4k5k9Ll2Jj4K1M0j0J4l8J0J6J9K7l5
$$ -49 -17 -27 -48 -26 0 10 -28 -59 -116 -114 -103 -58 13 -2 -21 -12 -8 -9 18 10 -17 -3 -28 -57 -54 -86 -85 -99 -78 -38 -48 -34 -72 -62 -46 -27 0 -35
10037c5J0K8p8rO3K0n4J3KpK9j6M4J4n9K2K1n7l7J9LN6j5pLk0O3o1J2l8O0K6Nl0o0m3L4L0
$$ -35 -25 3 -75 -84 -21 -1 -55 -42 -40 -47 -18 -34 10 24 -35 -13 8 -49 -86 -67 -64 -8 -23 -30 -27 -47 16 -45 -33 -71 -11 15 20 -10 -70 -113 -79 -49
10018d9p9O2J10q2l8KL4NO9J2l8L7Lk3n9jK9N1p9n1l0J8JK0m7M5N%kKM3nj1j8L7M4L0m6l6
$$ -49 -128 -66 44 -38 -76 -74 -40 -35 34 46 8 45 48 25 -34 -35 -6 45 -34 -85 -115 -97 -96 -76 -123 -78 -73 -73 -75 -73 -30 -35 -46 -64 -27 17 47 1 -35
10000c5k1J1oJ6mqj2j9j2L5J6j0nL7j3p4N4m4N0jjj6j1L1k5p7NN4M7mNkj3Qk8K1N7l9K2rk4
$$ -35 -56 -45 -51 -35 -39 -47 -59 -78 -90 -55 -39 -49 -54 -17 -30 -104 -50 -94 -44 -45 -46 -62 -73 -42 -67 -144 -139 -85 -38 -42 -37 -39 -52 -44 -72 -51 6 -33 -11 -20 -44
9980d4k3k9M8P9k0J4km7j4J8k0P%m5MK9J1k2kn8J3L8k2l1L6L0m5l1O2K1mk8L8l3KJ0oJ6k1
$$ -44 -67 -96 -48 31 11 25 23 -24 -38 -20 -40 -33 -33 -78 -74 -45 -34 -56 -58 -116 -103 -65 -87 -118 -82 -52 -97 -128 -66 -45 -49 -77 -39 -72 -70 -60 -66 -50 -71
9962g1%L6NJ8ll9M6j1k2j2Mj0K0L6L8qp6N3kMl1L4j2J6o0%N4J4l7N6l9k7M0J9m4k9k4j1K0
$$ -71 -71 -35 -30 -12 -15 -54 -8 -19 -41 -53 -49 -59 -39 -3 35 27 -49 4 2 6 -25 9 -3 13 -47 -47 7 21 -16 40 1 -26 14 33 -11 -40 -64 -75 -55
9943e5J9m0jK6nk9L2J2k5M4K1j8k7k1n7J3L5N6qJ5K7j5k3l7j4K5J0L6kp1oLK2oM3lj2O6k2
$$ -55 -36 -76 -77 -51 -56 -85 -53 -41 -66 -22 -1 -19 -46 -67 -124 -111 -76 -20 -28 -13 14 -1 -24 -61 -75 -50 -40 -4 -6 -77 -83 -80 -58 -64 -21 -24 -36 30 8
9925Hn4M6m6j5M5n9j0P7M0k7l9L2j5l1N0n4L4Jm0m2K7J6L9QmMl9J9K8l7oL2K4k5m6j4K8L1
$$ 8 -46 0 -46 -61 -16 -75 -85 -8 32 5 -34 -2 -17 -48 2 -52 -18 -17 -57 -99 -72 -56 -17 -9 -13 -9 -48 -29 -1 -38 -44 -12 12 -13 -59 -73 -45 -14
9906a4J5om3K1K8o9L1N1nl3p2M0J7N3l4m9j5K8K5j7J5K1p2K5N1J1n6k9j1M1J7PL6j1jl7J3
$$ -14 1 -5 -48 -27 1 -68 -37 14 9 -24 -96 -56 -39 14 -20 -69 -84 -56 -31 -48 -33 -12 -84 -59 -8 3 -53 -82 -93 -52 -35 -28 8 -3 -4 -41 -28
9889b8Opk8NNPLJ2j0l1k3K6lK7M3rqj3ql1J2Q0pKl1n4k2J7NJ2pP1j9j0Oj6RoK1J1p4JN6O4
$$ -28 -22 -29 -57 -52 -47 -40 -37 -25 -35 -66 -89 -63 -66 -39 4 -5 -13 -26 -34 -65 -53 27 20 22 -9 -63 -85 -68 -63 -51 -58 13 -6 -16 -10 -26 -17 -23 -2 9 -65 -64 -8 56
9868E6Rn9l3K1K4m2k1k2M5K9k4MJ4p0J3P6k2m7oK2lk8N1l4L1J9k8K2k3l0K6J9Ok1K7o3J2P
$$ 56 65 6 -27 -6 18 -24 -45 -67 -22 7 -17 -13 1 -69 -56 20 -2 -49 -55 -33 -36 -64 -13 -47 -16 3 -25 -3 -26 -56 -30 -11 -5 -26 1 -62 -50 -43
9850d3Ml7K2NK1m3j4O2%J2J8l0Nj8kK6j8Mk0qL4nl3oJ%J4L9J0m0L0M1k0o2K6J6j2%k1Qm6Q9
$$ -43 -39 -76 -54 -49 -28 -71 -85 -23 -23 -11 7 -23 -18 -36 -38 -12 -30 -26 -46 -54 -20 -25 -58 -64 -63 -63 -49 -10 0 -40 -10 31 11 -51 -25 -9 -21 -21 -42 -34 -80 9
9830Il5m3N3o6J6J4J0%mK7ml8PO1Ml0k7p%K1oPJ2J4Jl1Mj5lJ6K9j6O7m8k1N2L8m5j0n5Pl7
$$ 9 -26 -69 -16 -82 -66 -52 -42 -42 -46 -19 -23 -61 -54 7 11 -19 -46 -53 -53 -32 -38 -31 -19 -5 -4 -35 -31 -46 -49 -33 -4 -20 47 -1 -22 30 68 23 13 -42 -35 -72
9810g2J0K2j0K9N4j03k1N2L0J0joO6Om6p1qJJ4L9k5qP5M3J3p5o4k5P0L9oJ4pm6j7J2K4J5j8
$$ -72 -62 -40 -50 -21 33 -70 -91 -39 -9 1 0 -6 60 66 20 -51 -59 -58 -44 -5 -30 -38 37 80 93 18 -46 -71 -1 38 32 46 39 -7 -24 -12 12 27 9
9791Im4j0k1K5K8K6k8m4J1oJ8j3J1m6K9L6l0M9M0p1k9j4M3j9K5nL6J0j2m6m0O2Jj7k8mM7M6
$$ 9 -35 -45 -66 -41 -13 13 -15 -59 -48 -54 -36 -49 -38 -84 -55 -19 -49 0 40 -31 -60 -74 -31 -50 -25 -30 6 16 4 -42 -82 -20 -19 -36 -64 -68 -21 25
9773B5M7pj5m8Oj9nJ1L1K3l8j4l0k3M6k0J9On0K3J3K0MJ3nL2l0K5k5%n0Pj5kJ3J2rL9K1j0
$$ 25 72 65 50 2 8 -11 -16 -5 26 49 11 -3 -33 -56 -10 -30 -11 -5 -55 -32 -19 1 5 18 13 45 15 40 15 15 -35 -28 -43 -45 -32 -20 -29 10 31 21
9754B1l6lL3N4l7n6kK4k3j1QOK3J4m9m6L3P5J3J2j3j6k5j3P2j0K6L4j0l1p0j0L6P0KJ4k9k7
$$ 21 -15 -18 15 69 32 -24 -26 -2 -25 -36 -28 -22 1 15 -34 -80 -47 28 41 53 40 24 -1 -14 58 48 74 108 98 67 -3 -13 23 93 95 109 80 53
9736E3K6L3pL3n7m5K2L3Nj6L6Q0KqmJ6J6L8l7mN0j6K5O2L5RL1P2K0O1J36J47J90K70L00M58
$$ 53 79 112 105 138 81 36 58 91 96 80 116 196 198 190 186 202 218 256 219 215 265 249 274 336 371 380 411 483 503 564 700 847 1037 1307 1607 2065
9719B065O19Q69J486K518M790Q077Q667K910m808q155o939m543k634j482r05n75l38k21j12
$$ 2065 2684 3553 5039 7557 12347 20424 29091 32001 27193 19038 12099 7556 4922 3440 2535 1960 1622 1401 1289
9710A289O9J08j20k68k61k03j34o6n4n0k9l9j5L7Lk1l2rJ9n2orK2J2L9O2Qn7K7l6l7O9QkP0
$$ 1289 1358 1466 1346 1078 817 614 480 414 360 310 281 242 227 264 267 246 214 205 224 172 166 157 179 191 230 292 300 243 270 234 197 266 274 272 342
9693C42M6JM0O9M2O1M2J29J13K00K26K92M09N93R06J449K620M863Q310R105K909n071q481
$$ 342 388 389 429 498 540 601 643 772 885 1085 1311 1603 2012 2605 3511 4960 7580 12443 20753 29858 32767 27696 19215
9682A9215p176m552k583j462r20o06m93k88j85j58r0o3q7m9p7m8o8K1j1q4k2RNl3J8l4M0q
$$ 19215 12039 7487 4904 3442 2522 1916 1423 1135 950 792 702 639 552 503 426 378 310 331 320 236 214 223 228 195 213 179 219 211
9668B11jj8l7K9J4Nk0n8N2Q4j8K1P6J2RK6pJ4K0j0Q3Q4J28O1J04J81K36L36M45N99R23J542
$$ 211 210 192 155 184 198 203 183 125 177 261 243 264 340 352 361 387 380 394 414 404 487 571 699 760 864 1045 1281 1617 2062 2661 3584 5126
9653E126K637M815Q137Q746K818m996q253p020m568k613j526q92n66m17k73k24j55j40j44
$$ 5126 7763 12578 20715 29461 32279 27283 19030 12010 7442 4829 3303 2411 1845 1428 1155 931 776 636 492
9644D92r6m0m4j6J1K0j20n8k7M6k4Jo1n2N8L8l6l8K9l2NRprj1Om7k6n2J9L9J3J0pl9OK5QP
$$ 492 396 356 312 296 307 327 207 149 122 168 144 145 84 32 90 128 92 54 83 51 56 65 58 49 38 44 -3 -29 -81 -62 -23 -10 0 -7 -46 -40 -15 -7 0
9626@m5K9K4Qlm7l3M8l3k0M1mK7qk5k1RL3lK2l2k5J3j7L3J0L2l3Rj9Mm0j5O8j2j6Ppj8mL6
$$ 0 -45 -16 8 16 13 -34 -67 -19 -52 -72 -31 -35 -8 -16 -41 -62 -53 -20 -23 -1 -33 -58 -45 -62 -29 -19 13 -20 -11 -30 -26 -66 -81 -13 -25 -41 -34 -41 -59 -63 -27
9606b7O8jk9m1NJ4J0j4Pj2O%j4K2k4kK1K1p2L2K1RJk5On0Nj4L0L9l0jJ7o0l1L3j4M4L2J0J8
$$ -27 41 40 11 -30 -25 -11 -1 -15 -8 -20 -14 -14 -28 -6 -30 -32 -11 10 -62 -30 -9 0 1 -24 -18 -68 -63 -77 -47 -8 -38 -39 -22 -82 -113 -80 -94 -50 -18 -8 10
9586A0kp0nQL2o0J9L5oN7kp5K4J1o6j9K6L5N9j2m0K4j3n5M6M0J8L3n6k6k8L5LpJ2l8nl3M3
$$ 10 8 -62 -67 -59 -27 -87 -68 -33 -39 18 16 -59 -35 -24 -90 -109 -83 -48 11 -1 -41 -17 -30 -85 -39 1 19 52 -4 -30 -58 -23 -20 -27 -15 -53 -58 -91 -48
9568d8qL3mm5O4ql0P2l3m0rM2n2n7N3K7orlLj3L2lp3oK9N9k2j6NPol4L2M1p4Q2km7lK5K8J3
$$ -48 -56 -23 -27 -72 -8 -16 -46 26 -7 -47 -56 -14 -66 -123 -70 -43 -49 -58 -61 -58 -71 -39 -42 -115 -121 -92 -33 -55 -71 -66 -59 -65 -99 -67 -26 -100 -18 -20 -67 -70 -45 -17 -4
9547do2k2M5k7J7J2ok6K8j9j0M8J0J8m8kj9Kqnk1j3L6M2J2o1l9P0J7l5K1l3k8L5L3K7OK3j9
$$ -4 -66 -88 -43 -70 -53 -41 -47 -73 -45 -64 -74 -26 -16 2 -46 -48 -67 -65 -73 -78 -99 -112 -76 -34 -22 -83 -122 -52 -35 -70 -49 -82 -110 -75 -42 -15 -9 14 -5
9529eo3%K4K3L1l2k5oK7j3L9mm6Nj7j7n7K0O4J5J1L8m1j4k1j3J5K9K8kj1kK6n1k7L9Ln1j6
$$ -5 -68 -68 -44 -21 10 -22 -47 -53 -26 -39 0 -4 -50 -45 -62 -79 -136 -116 -52 -37 -26 12 -29 -43 -64 -77 -62 -33 -5 -7 -18 -20 6 -45 -72 -33 -30 -81 -97
9510i7PQ%j6QlL7M9m1j3l1K2K1j6l8M2L7QMLK2k0l1J9J0j5l1J5J5lj4Lj0J7MK7K2m4ol4Oj3
$$ -97 -90 -82 -82 -98 -90 -93 -56 -7 -48 -61 -92 -70 -49 -65 -103 -61 -24 -16 -12 -9 13 -7 -38 -19 -9 -24 -55 -40 -25 -28 -42 -39 -49 -32 -28 -1 21 -23 -29 -63 -57 -70
9490g0k5LNL5k2j2O0J1j5l4l6N1Q2j1Jj9k7j5K3k7QK2nl5J7J0p3N7j6n4L1K7Pm8M7K1k6K8
$$ -70 -95 -92 -87 -52 -74 -86 -26 -15 -30 -64 -100 -49 33 22 23 4 -23 -38 -15 -42 -34 -12 -17 -52 -35 -25 -98 -41 -57 -111 -80 -53 -46 -94 -47 -26 -52 -24
9472b4Mm0J1o1K4rML7J7j1L6l5K1RK0l4QMl9l3k5K9M2Jm0J0L5K2Qj2o1j7J7K9l5K4P0j5l1
$$ -24 -20 -60 -49 -110 -86 -95 -91 -54 -37 -48 -12 -47 -26 -17 3 -31 -23 -19 -58 -91 -116 -87 -45 -44 -84 -74 -39 -17 -9 -21 -82 -99 -82 -53 -88 -64 6 -9 -40
9453d0j3Mo2O2qm2N5Rn1M2j4K3J6O1n2n9j2L0O3NQj3k1Ql7j5rjpnl3L1L7M4j8Qm5J0J3j5J5
$$ -40 -53 -49 -111 -49 -57 -99 -44 -35 -86 -44 -58 -35 -19 42 -10 -69 -81 -51 12 17 25 12 -9 -1 -38 -53 -62 -63 -70 -75 -108 -77 -40 4 -14 -6 -51 -41 -28 -43 -28
9434b8nn8k3k2J15M2k7l2M4m9Nj4K1Qrn4k0J2M5O3n5n7J0K8J1O3k3l0QLm7K3%kL1qk8j6J1
$$ -28 -33 -91 -114 -136 -21 21 -6 -38 6 -43 -38 -52 -31 -23 -32 -86 -106 -94 -49 14 -41 -98 -88 -60 -49 14 -9 -39 -31 -28 -75 -52 -52 -54 -23 -31 -59 -75 -64
9415f4L0K9Qj9qqj6J0jK4k5k2ml0%P0J2k3j0j6j3L3L5J4L9K3j15n2kM7pN5l1lj6l0N9Ml9m2
$$ -64 -34 -5 3 -16 -24 -32 -48 -38 -39 -15 -40 -62 -66 -96 -96 -26 -14 -37 -47 -63 -76 -43 -8 6 45 68 -47 -99 -101 -54 -61 -6 -37 -40 -56 -86 -27 -23 -62 -104
9396a04K0N1m4PJ6Qn0k5N6J5Oj4MK7N8m0rJ7L9r5OL7k%J6Mj8j9m4J1j6j3M1L1j7Ok9k0nL5
$$ -104 -84 -33 -77 -70 -54 -46 -96 -121 -65 -50 -44 -58 -54 -27 31 -9 -18 -1 38 -57 -51 -14 -16 -16 0 4 -14 -33 -77 -66 -82 -95 -54 -23 -40 -34 -63 -83 -88 -53
9377e3J8J8J0l2n7J8K8L7k2Lqj7j2K2nL7Lj5m4J6O5n5L8K8m9K6j2L1k1q2N4j4%pj7K1k8K5
$$ -53 -35 -17 -7 -39 -96 -78 -50 -13 -35 -32 -40 -57 -69 -47 -52 -15 -12 -27 -71 -55 10 -45 -7 21 -28 -2 -14 17 -4 -86 -32 -46 -46 -53 -70 -49 -77 -52
9359e2J5MJL8j8m5J2j1K3L0%n7l7K9K5K3kn0L5k3QL0Pj9j4Pn4J6J9j0L3k9L8P2n7oj1j5R5
$$ -52 -37 -33 -32 6 -12 -57 -45 -56 -33 -3 -3 -60 -97 -68 -43 -20 -22 -72 -37 -60 -52 -22 -15 -34 -48 -41 -95 -79 -60 -70 -37 -66 -28 44 -13 -19 -30 -45 50
9340E0l2k2n5L8lK0k3j5mj4K4J8oLM1r0j7jN5L6qj0k8L2rJ4M5k3k9m0M2J2%Nj7Rl6pL0j5l3
$$ 50 18 -4 -59 -21 -24 -4 -27 -42 -46 -60 -36 -18 -24 -21 20 -70 -87 -88 -33 3 -5 -15 -43 -11 -20 -6 39 16 -13 -53 -11 1 1 6 -11 -2 -38 -45 -15 -30 -63
9321f3j3mL7N0l5k9K4j6oqL2m5k9m6L3R5l5Jk4N0m6mJ7kj2M2j8rL5k2rL0k6k5J3K2MoK0n8
$$ -63 -76 -80 -43 7 -28 -57 -33 -49 -55 -63 -31 -76 -105 -151 -118 -23 -58 -57 -81 -31 -77 -81 -64 -66 -78 -36 -54 -63 -28 -50 -59 -29 -55 -80 -67 -45 -41 -47 -27 -85
9302h5j0j2L8L9pk5M4Nk1N0J2Rm8pL3o4l2l3lJ6L4N0L3q6l2L4Kj6Nj7L1j1J0K1J1Pj3o9M1
$$ -85 -95 -107 -69 -30 -37 -62 -18 -13 -34 16 28 37 -11 -18 15 -49 -81 -114 -117 -101 -67 -17 16 -70 -102 -68 -66 -82 -77 -94 -63 -74 -64 -43 -32 -25 -38 -107 -66
9283f6L1LL5j1k5k0k7pM7J4l6l5J5K3j2L7Ln4k3M8M2l5j9mkK0k5K5Rqk8qM8Rk7N2m8m3j7Q
$$ -66 -35 -32 3 -8 -33 -53 -80 -87 -40 -26 -62 -97 -82 -59 -71 -34 -31 -85 -108 -60 -18 -53 -72 -76 -78 -58 -83 -58 -49 -57 -85 -93 -45 -36 -63 -11 -59 -102 -119 -111
9264a11L0J0k7N3rRknRj5m7J4oM7lJ7J2k6J5rj5qN0J1K2kk7j0m8Jj1L4O0q4L3j3j9J6k1K6
$$ -111 -81 -71 -98 -45 -54 -45 -47 -52 -43 -58 -105 -91 -97 -50 -53 -36 -24 -50 -35 -44 -59 -67 -17 -6 16 14 -13 -23 -71 -70 -81 -47 13 -71 -38 -51 -70 -54 -75 -49
9245d9M8k8k1j8K9K9L0k0%K3J5n0mJ6l9l0rkL4K2j3jPj2j3m1m7N1L1l2j8K6%K1jJ6M8l0Qj3
$$ -49 -1 -29 -50 -68 -39 -10 20 0 0 23 38 -12 -16 0 -39 -69 -78 -80 -46 -24 -37 -38 -31 -43 -56 -97 -144 -93 -62 -94 -112 -86 -86 -65 -66 -50 -2 -32 -24 -37
9226c7pJ9Lj1J0J0j7k9jL9J3Lj7m2k3j6kM7J0Jkpl6J1L7J4J6m8%k3J4K6Lom0Ql3oN0L1L9k2
$$ -37 -44 -25 -22 -33 -23 -13 -30 -59 -60 -21 -8 -5 -22 -64 -87 -103 -105 -58 -48 -47 -49 -56 -92 -81 -44 -30 -14 -62 -62 -85 -71 -45 -42 -48 -88 -80 -113 -119 -69 -38 1 -21
9206b1l6J3k6M3l4nkj4O3j3j5j9J0j1j6RJ0l3kK0J6M9n1J7j3M0N4K3p0l2JK8KN3k0l8qm0l8
$$ -21 -57 -44 -70 -27 -61 -66 -68 -82 -19 -32 -47 -66 -56 -67 -83 -74 -64 -97 -99 -79 -63 -14 -65 -48 -61 -21 33 56 -14 -46 -45 -17 -15 38 18 -20 -28 -68 -106
9187a06M4J3RJ3L3N5Qm1j5k1m8L4L2Rn0k3M5M3q5J7K1K1K0m5l4kP6L2k8P6l0oK5%OP1P0R3
$$ -106 -62 -49 -40 -27 6 61 69 28 13 -8 -56 -22 10 19 -31 -54 -9 34 -51 -34 -13 8 28 -17 -51 -53 23 55 27 103 73 67 92 92 98 169 239 332
9169C32J48K07M12Q34J647J998n4j983j699q27l69k09q0r8p8k1o7k7m6K7m5l1MK6L5l4pk1
$$ 332 480 687 1099 1933 3580 5578 5524 3541 1842 1015 646 437 357 259 181 160 93 66 20 47 2 -29 -25 1 36 2 -5 -26
9156b6L3J7j4N0l4Lnm0OL2K9p0qP1m8j2K9QJ5q4L1N8l5J3l0m0K8Mj6L3J3m9Lo5j1N4k5L8j7
$$ -26 7 24 10 60 26 29 24 -16 -10 22 51 -19 -27 44 -4 -16 13 21 36 -48 -17 41 6 19 -11 -51 -23 -19 -35 -2 11 -38 -35 -100 -111 -57 -82 -44 -61
9137f1QqK8ql3ML6j8L5k6m9j4OL5k6M2k3mpL8%J0j4n%J6n8J7NJ4qPlqrKRJ6M6j9j0Oj1M6l
$$ -61 -53 -61 -33 -41 -74 -70 -34 -52 -17 -43 -92 -106 -100 -65 -91 -49 -72 -76 -83 -45 -45 -35 -49 -54 -54 -38 -96 -79 -74 -60 -68 -61 -64 -72 -81 -79 -70 -54 -8 -27 -37 -31 -42 4 1
9116ApRq8QJ9l9O7j3J8J0k8k2k8J4J7k1RL1l6J1L2j7k4RLoj9jk6J1K3qN8k0jj9J3k6M6J3j8
$$ 1 -6 3 -85 -77 -58 -97 -30 -43 -25 -15 -43 -65 -93 -79 -62 -83 -74 -43 -79 -68 -36 -53 -77 -68 -65 -71 -90 -91 -117 -106 -83 -91 -33 -53 -54 -73 -60 -86 -40 -27 -45
9096d5m8L9P3l9j6%k4rK0L8L0l3J1J0k2M1Mm2k4j8J2oj5M3J4m5M9j3j3kk7j2k7M5m6k9K1K9
$$ -45 -93 -54 19 -20 -36 -36 -60 -69 -49 -11 19 -14 -3 7 -15 26 30 -12 -36 -54 -42 -48 -63 -20 -6 -51 -2 -15 -28 -30 -57 -69 -96 -51 -97 -126 -105 -76
9078g6j8J9qk5L0M9l4K6j5J2j5M3lk1M0k1L1l1m6K1J3k5j6p2mN3J5k8nM6k1K7LlN0k0l3l3
$$ -76 -94 -75 -83 -108 -78 -29 -63 -37 -52 -40 -55 -12 -15 -36 4 -17 14 -17 -63 -42 -29 -54 -70 -142 -146 -93 -78 -106 -111 -65 -86 -59 -56 -59 -9 -29 -62 -95
9060i5M8m1j3J01Qk0J0%l1QQLK4K2o5qL5k4M1M8l1j9o0K5K0l3k3K6JMJm5J3oJ8J6j2k4J7l1
$$ -95 -47 -88 -101 0 8 -12 -2 -2 -33 -25 -17 -14 10 32 -33 -41 -6 -30 11 59 28 9 -51 -26 -6 -39 -62 -36 -35 -31 -30 -75 -62 -68 -50 -34 -46 -70 -53 -84
9041h4M4k9K8Oj6K0J2L6k5n2J6l5K8Q1o3K4%k9O8ll6j5l1K0N9k9pk2M2M8n6k4j9K2oJ1J1l0
$$ -84 -40 -69 -41 -35 -51 -31 -19 17 -8 -60 -44 -79 -51 30 -33 -9 -9 -38 30 27 -9 -24 -55 -35 24 -5 -12 -34 8 56 0 -24 -43 -21 -27 -16 -5 -35
9023c5J0P0n4k5j9O7po1nqMJ1l2J4OL1n1n1qR1J8Ok9N0Rj6n8j2J8J9M2NOr3K1J0K1k9M1K1
$$ -35 -25 45 -9 -34 -53 14 7 -54 -59 -67 -63 -52 -84 -70 -64 -33 -84 -135 -143 -52 -34 -28 -57 -7 2 -14 -72 -84 -66 -47 -5 0 6 -87 -66 -56 -35 -64 -23 -2
9004bJ0j1l9K8Qj0j1J9L6n8nJ5j6OJ2m2j8j3M5L6j7p5R0L2k0m9ok8N3Om6RM2K7j0k8k5lM8
$$ -2 8 -3 -42 -14 -6 -16 -27 -8 28 -30 -35 -20 -36 -30 -18 -60 -78 -91 -46 -10 -27 -102 -12 20 0 -49 -55 -83 -30 -24 -70 -61 -19 8 -2 -30 -55 -58 -10
8985a0k4Lj8MjM6k7jK8m9j5k5NM9j4j5mKJ9K5Rl2l5J8OJ3l7N3k3J4ok3OL0L5k0l1K6J6ll3
$$ -10 -34 -31 -49 -45 -46 0 -27 -28 0 -49 -64 -89 -84 -35 -49 -64 -68 -66 -47 -22 -13 -45 -80 -62 -56 -43 -80 -27 -50 -36 -42 -65 -59 -29 6 -14 -45 -19 -3 -6 -39
8966c9P2o1J6k4l0JJ4rl0O1j9Jk4OnL6L7JLl4pJ3j7lJ8m1LK3oj9%J8nM0j0n6k4P0J7J1j7k7
$$ -39 33 -28 -12 -36 -66 -65 -51 -60 -90 -29 -48 -47 -71 -65 -70 -34 3 4 7 -27 -34 -21 -38 -41 -23 -64 -61 -38 -44 -63 -63 -45 -50 -10 -20 -76 -100 -30 -13 -2 -19 -46
8946d6l5J6K3J9nk8mL1j4k6J5L5j0Jn9K2NOQL1J6jnl9M1pj6K4n6K5kj7j3K8j2L1j5K0j7j8
$$ -46 -81 -65 -42 -23 -28 -56 -60 -29 -43 -69 -54 -19 -29 -28 -87 -65 -60 -54 -46 -15 1 0 -5 -44 -3 -10 -26 -2 -58 -33 -35 -52 -65 -37 -49 -18 -33 -13 -30 -48
8927d8K%k1L%J5RL4J1j7n1M6K5nj3J6k4m5M1j2k3LLJ2KJ6j0o1K3M3N8j2k7oJ9j9J6l1L1j8
$$ -48 -46 -46 -67 -64 -64 -49 -40 -6 5 -12 -63 -17 8 3 -10 6 -18 -63 -22 -34 -57 -54 -51 -39 -37 -21 -31 -92 -69 -26 32 20 -7 -13 6 -13 3 -28 3 -15
8907a5MJ1p8oJ6k1J3K0j5lQ1Rk9m0N0ml5rJ9L7lk7K6nl6PJ2K7j9KJ9k5Km9mMJrM5Nj2L7k9
$$ -15 -11 0 -78 -84 -68 -89 -76 -56 -71 -74 7 16 -13 -53 -3 -7 -42 -51 -32 5 2 -25 1 -4 -40 -33 -21 6 -13 -11 8 -17 -15 -64 -68 -64 -63 -72 -27 -22 -34 3 -26
8887b6K2K6K7k4p1K1j5j7L4m1%L1K7k9j8rm8K7M8m7NJ6K8K2Ql6j2k1l0LOO4J2jQll1J5j0N
$$ -26 -4 22 49 25 -46 -25 -40 -57 -23 -64 -64 -33 -6 -35 -53 -62 -110 -83 -35 -82 -77 -61 -33 -11 -3 -39 -51 -72 -102 -99 -93 -29 -17 -18 -10 -13 -44 -29 -39 -34
8868c4j6J2K8Rl9QM8m2k6qm3J4J2l1L2J0O0n3L4k2J2K4l1n1L2J7k4M4n1p0P0M5J6k3pJ9k9
$$ -34 -50 -38 -10 -1 -40 -32 16 -26 -52 -60 -103 -89 -77 -108 -76 -66 -6 -59 -25 -47 -35 -11 -42 -93 -61 -44 -68 -24 -75 -145 -75 -30 -14 -37 -44 -25 -54
8850e4K5j9K2J1K3r2J5KM3Jk1j0P%lJ3kj0l6K1lJ1J8K7m7RK4p3K9J0K0K0J4m4l4k3K2L2J7
$$ -54 -29 -48 -26 -15 8 -84 -69 -67 -24 -23 -44 -54 -47 -47 -50 -37 -39 -49 -85 -64 -67 -56 -38 -11 -58 -49 -25 -98 -69 -59 -39 -19 -5 -49 -83 -106 -84 -52 -35
8832c5o7m7M8M0M5l6QJ3o3L0lJ7j6KO3M4m4n7n3N3N7j4l1K7k7ll8l3K1Q6K4m0l0N8l6o3nK2
$$ -35 -102 -149 -101 -61 -16 -52 -44 -31 -94 -64 -67 -50 -66 -64 -1 43 -1 -58 -111 -58 -1 -15 -46 -19 -46 -49 -87 -120 -99 -13 11 -29 -59 -1 -37 -100 -105 -83
8814h3O1j5k3Lm0RM2j4k4j5j4pO3j3N0J6j7J2n2mL7O%rPk8k5j3qkL4mJ8J9K2J8m8K0k2qN3
$$ -83 -22 -37 -60 -57 -97 -88 -46 -60 -84 -99 -113 -120 -57 -70 -20 -4 -21 -9 -61 -65 -28 -22 -22 -31 -24 -52 -77 -90 -98 -100 -66 -70 -52 -33 -11 7 -41 -21 -43 -51 2
8794Bm8k8K0K4K2l2j8J2K5l4Qj3J3O7l1k4n0rM8Pn3L0o1J7J10rpJ6%L6nm2m6oL2j4k5L1K5
$$ 2 -46 -74 -54 -30 -8 -40 -58 -46 -21 -55 -47 -60 -47 20 -11 -35 -85 -94 -46 -39 -92 -62 -123 -106 4 -5 -12 4 4 40 35 -7 -53 -59 -27 -41 -66 -35 -10
8775a0J8j1o0L2lnj0OK5p2K4N3k4q6L1O4N8J4n2JM6k5m9Qk4k9K7L3l9nM3L4l7k6Kqj5j2R4
$$ -10 8 -3 -63 -31 -34 -39 -49 -43 -18 -90 -66 -13 -37 -123 -92 -28 30 44 -8 -7 39 14 -35 -27 -51 -80 -53 -20 -59 -64 -21 13 -24 -50 -48 -56 -71 -83 11
8757A1N8k1k9l0Kk2MPk4n3l1M2L2qOoM9L6r0k3L7l6L5l3J4j5j1J9K0N3j8k2J3k2J8Nj2L2p
$$ 11 69 48 19 -11 -9 -31 -27 -20 -44 -97 -128 -86 -54 -62 -56 -62 -13 23 -67 -90 -53 -89 -54 -87 -73 -88 -99 -80 -60 -7 -25 -47 -34 -56 -38 -33 -45 -13 -20
8738b0n0Mj4Jk0P3Oj5k1N9L8m3J5k4kl3j9JRJ4J8P0J6m2m3m9N7KJ2o4lkN8L4o9n1PnJ0M4j1
$$ -20 -70 -66 -80 -79 -99 -26 -20 -35 -56 3 41 -2 13 -11 -13 -46 -65 -64 -55 -41 -23 47 63 21 -22 -71 -14 -12 0 -64 -67 -69 -11 23 -46 -97 -90 -95 -85 -41 -52
8719e2Lm2L6J1K7j3k6L9m0mM6ro4j5J4Rl6LL8j5j3L0L0j3OJ6L7k1l4J5J8j5M2kj1o5%qML6
$$ -52 -49 -91 -55 -44 -17 -30 -56 -17 -57 -61 -15 -24 -88 -103 -89 -80 -116 -113 -75 -90 -103 -73 -43 -56 -50 -34 3 -18 -52 -37 -19 -34 8 6 -5 -70 -70 -78 -74 -38
8700c8j8LK2L5n9k0K2OJ0J5K8j6J5Qk0n0M6R2r5m4Q0k1l5J0jqK0Km0pK0j0lK0k8J8k1j8L7
$$ -38 -56 -53 -31 4 -55 -75 -53 -47 -37 -22 6 -10 5 13 -7 -57 -11 81 -14 -58 22 1 -34 -24 -25 -33 -13 -11 -51 -58 -38 -48 -51 -31 -59 -41 -62 -80 -43
8681d3k8L7j2LJ3%j8K0K3Jk2q3L3M9L8o3l8K3L4Lj6J1poOK1L7l9j9M0l9M6l5kj5J2j8K6j8
$$ -43 -71 -34 -46 -43 -30 -30 -48 -28 -5 -4 -26 -109 -76 -27 11 -52 -90 -67 -33 -30 -46 -35 -42 -48 -42 -21 16 -23 -42 -2 -41 5 -30 -32 -47 -35 -53 -27 -45
8662d5J9l0j9%P8m3nJ8jk3J0lk4jj8%K6L1k6K3n9L9K3Qk5l6j7M5M3k4k4j9J3J2J8n6MJL3J9
$$ -45 -26 -56 -75 -75 3 -40 -45 -27 -28 -51 -41 -44 -68 -69 -87 -87 -61 -30 -56 -33 -92 -53 -30 -22 -47 -83 -100 -55 -12 -36 -60 -79 -66 -54 -36 -92 -88 -87 -54 -35
8643c5jj2L0Mj0kn4J4J7mM3ko8N3K8J5o9J8J5o7N9J5l1K0k4K4J3pJ0p8QK1%mL7l0L5JK6o3
$$ -35 -36 -48 -18 -14 -24 -26 -80 -66 -49 -53 -10 -12 -80 -27 1 16 -53 -35 -20 -87 -28 -13 -44 -24 -48 -24 -11 -18 -8 -86 -78 -57 -57 -61 -24 -54 -19 -18 8 -55
8624e5l0J2rK9J4RjNl6j2K3j2l2M0K4o4nL2J1N5J8Qk9k6L6j8Oj2ql2j4Rk2L7qj0J4k7K8Lj8
$$ -55 -85 -73 -82 -53 -39 -30 -31 -26 -62 -74 -51 -63 -95 -55 -31 -95 -100 -68 -57 -2 16 24 -5 -31 5 -13 -7 -19 -27 -59 -73 -64 -86 -49 -57 -67 -53 -80 -52 -49 -67
8605f7k5k9L5L0K3k3J6L1n0J1K6m3M5Pn3m2k1K9R7j0o7l1P4L1J2k2K4l4l6K1jKJ7%l4K3pM
$$ -67 -92 -121 -86 -56 -33 -56 -40 -9 -59 -48 -22 -65 -20 -13 -66 -108 -129 -100 -3 -13 -80 -111 -37 -6 6 -16 8 -26 -62 -41 -42 -40 -23 -23 -57 -34 -41 -37
8587c7Rk1Kk3J2l0L4l1M0L7qJ3j4j8M3n9q2L8N1L7Qk3J7m5m5K5oj5L4M9k6j4J3J8n1k9M2O0
$$ -37 -28 -49 -47 -70 -58 -88 -54 -85 -45 -8 -16 -3 -17 -35 8 -51 -133 -95 -44 -7 1 -22 -5 -50 -95 -70 -76 -91 -57 -8 -34 -48 -35 -17 -68 -97 -55 5
8568Ej1l6m0N6onK4M5m3k0K8nrk3l5K2M2nm6NQ4m4nj5Jl4lL1m0K3K2o1O1L5mj5J0oj5l4M0
$$ 5 -6 -42 -82 -26 -32 -37 -13 32 -11 -31 -3 -8 -17 -40 -75 -53 -11 -16 -62 -57 27 -17 -22 -37 -36 -70 -73 -42 -82 -59 -37 -98 -37 -2 -6 -21 -11 -17 -32 -66 -26
8549b6K2K7k4o0k9j2qL1j2qP5Pj3K4j4j2p6L0L3k4J6j4K2K4m0lk2nM4j1oK7%l9j8J7K1J0l9
$$ -26 -4 23 -1 -61 -90 -102 -110 -79 -91 -99 -24 -17 -30 -6 -20 -32 -108 -78 -45 -69 -53 -67 -45 -21 -61 -64 -86 -91 -47 -58 -64 -37 -37 -76 -94 -77 -56 -46 -85
8530h5L6J4K3rJ7l9j4K3m1mO2Jl3Mm1O0J9o3mk1O2L6o3L5mo1K2N7k3J8K4jk0l3m0J5k0K4j1
$$ -85 -49 -35 -12 -21 -4 -43 -57 -34 -75 -79 -17 -16 -49 -45 -86 -26 -7 -70 -74 -95 -33 3 -60 -25 -29 -90 -68 -11 -34 -16 8 7 -13 -46 -86 -71 -91 -67 -78
8512g8N0L6Mk8Kj0k3K7J3K1KJ2n8J2PK5J6o0j8M7k9n5P0rm0K5k6K6j7j8qK4j9nN3%l0p0J7
$$ -78 -28 8 12 -16 -14 -24 -47 -20 -7 14 16 28 -30 -18 -11 14 30 -30 -48 -1 -30 -85 -15 -24 -64 -39 -65 -39 -56 -74 -82 -58 -77 -82 -29 -29 -59 -129 -112
8493a12L4k9M3M6Nm7j9jk0K5N7k7J4m0K5l3K8L1j8j0K9k6m3J9M5j0K8l0l7L1QNpMpk0k8M7
$$ -112 -78 -107 -64 -18 -13 -60 -79 -80 -100 -75 -18 -45 -31 -71 -46 -79 -51 -20 -38 -48 -19 -45 -88 -69 -24 -34 -6 -36 -73 -42 -34 -29 -36 -32 -39 -59 -87 -40
8475d0J5n6J6J7J8L2k7l3O1J8pp9mM6k6j4k8K7M3Lj5j7J9j3mJ8M7l5Mm9l1jK7L1j6L4nJ7j7
$$ -40 -25 -81 -65 -48 -30 2 -25 -58 3 21 14 -65 -69 -23 -49 -63 -91 -64 -21 -18 -33 -50 -31 -44 -48 -30 17 -18 -14 -63 -94 -95 -68 -37 -53 -19 -24 -7 -24
8456b4J1m0k0M6mL0o0k3L0J5N6M7o2q2KM1k7pk6NK7J1j7K1M4j0jk0k7J9Jj9J6K3J5mm9l0n
$$ -24 -13 -53 -73 -27 -31 -1 -61 -84 -54 -39 17 64 2 -80 -78 -37 -64 -71 -97 -92 -65 -54 -71 -50 -6 -16 -17 -37 -64 -45 -44 -63 -47 -24 -9 -13 -62 -92 -97
8438i7M6k9N3M0J6k6k3mkM7K3p7l0QMQL3K0j3k9LO3L4j9n1m5OK5o3PQrkPL4N4j5ORl8K9k2
$$ -97 -51 -80 -27 13 29 3 -20 -24 -26 21 44 -33 -63 -55 -51 -43 -10 10 -3 -32 -29 34 68 49 -2 -47 -41 -16 -79 -72 -64 -73 -75 -68 -34 20 5 11 20 -18 11 -11
8418a1Nm5MM8j1j0j9j6K2K7l4j4p3J7M3M0j0j4o5l0J2L9j7K6M3m3Lrk8J4O7J3N5l8Kj2k7j6
$$ -11 -6 -51 -47 1 -10 -20 -39 -55 -33 -6 -40 -54 -127 -110 -67 -27 -37 -51 -116 -146 -134 -95 -112 -86 -43 -86 -83 -92 -120 -106 -39 -26 29 -9 -7 -19 -46 -62
8400f2LNn1J3N0j2M6l8l7j2K9k9jM7M4m5J6l2lj9JM3L7k0k0m9K7L5K4n0Ml0K0L3k3rj7njN7
$$ -62 -59 -54 -105 -92 -42 -54 -8 -46 -83 -95 -66 -95 -96 -49 -5 -50 -34 -66 -69 -88 -87 -44 -7 -27 -47 -96 -69 -34 -10 -60 -56 -86 -66 -33 -56 -65 -82 -87 -88 -31
8381c1K8m3j0K7M6l1n3qqlO0j0jnk5M1%n3K3k7k2O6JLkm4rk0P2J7kj0%lK2k1k3K9l1rK9j4
$$ -31 -3 -46 -56 -29 17 -14 -67 -75 -83 -86 -26 -36 -37 -42 -67 -26 -26 -79 -56 -83 -105 -39 -38 -35 -37 -81 -90 -110 -38 -21 -23 -33 -33 -36 -14 -35 -58 -29 -60 -69 -40 -54
8361e4k2M7n0K5L2J8k8k8L1Ql0m3L8N8L6p4kK7j8qj2j3M%J3M3Pj1k8rJ5j5J6m8M3L9L1k3m
$$ -54 -76 -29 -79 -54 -22 -4 -32 -60 -29 -21 -51 -94 -56 2 38 -36 -38 -11 -29 -37 -49 -62 -58 -58 -45 -2 5 -6 -34 -43 -28 -43 -27 -75 -32 7 38 15 11
8342A1l1Nl2l9j9M9nl7J1J6K8k9J8L2l7J4kqKkK1j6K3mJ9ok6L1N0p2n4K4N3k4n3J2J8lk9R
$$ 11 -20 -15 -47 -86 -105 -56 -61 -98 -87 -71 -43 -72 -54 -22 -59 -45 -47 -55 -53 -55 -34 -50 -27 -31 -12 -18 -44 -13 37 -35 -89 -65 -12 -36 -89 -77 -59 -62 -91 -82
8323h2oL6l4K7l9L6N5n7kpK6L2m1j7PM2l6l8K6M1n0l5M8J8j1oKJ2Ql8M3K7m7KM4n5L6qj7l7
$$ -82 -88 -52 -86 -59 -98 -62 -7 -64 -66 -73 -47 -15 -56 -73 -66 -24 -60 -98 -72 -31 -81 -116 -68 -50 -61 -67 -65 -53 -45 -83 -40 -13 -60 -58 -14 -69 -33 -41 -58 -95
8304i5ppO5m2l7P8oj8L6k0m7O2L8j1l0j7lk4MO9k7k1OjM5m6K8J8k1Qk4k8j6O6K2j3Lk7k2O
$$ -95 -102 -109 -44 -86 -123 -45 -51 -69 -33 -53 -100 -38 0 -11 -41 -58 -61 -85 -81 -12 -39 -60 -54 -55 -10 -56 -28 -10 -31 -23 -47 -75 -91 -25 -3 -16 -13 -40 -62 -56
8285e6K9M2J2m8oPoj8K8o0LQ2nq0K0K7Qj2J1lo0Mk1L1Nm7L7M0l6j4j2L6oo2K5P0Nj8NL3ll5
$$ -56 -27 15 27 -21 -27 -20 -26 -44 -16 -76 -73 9 4 -76 -56 -29 -21 -33 -22 -25 -85 -81 -102 -71 -66 -113 -76 -36 -72 -86 -98 -62 -68 -130 -105 -35 -30 -48 -43 -10 -13 -48
8265d8k7M1QJ2l4j8Pj8J7PJ7k4PK5k0JJ7l6N8n2j7N5K0j5k1Lm6j0j8mO0j1n9K3L6j3kp%J2
$$ -48 -75 -34 -26 -14 -48 -66 -59 -77 -60 -53 -36 -60 -53 -28 -48 -47 -30 -66 -8 -60 -77 -22 -2 -17 -38 -35 -81 -91 -109 -113 -53 -64 -123 -100 -64 -77 -79 -86 -86 -74
8246g4M6k8lQ7k4n1K1Rj0j6M3L5k7o5L0k5k9O6qL5m4J0K4k9Rmqk2%J5K8j2o8j7O2M7k0o2j7
$$ -74 -28 -56 -59 28 4 -47 -26 -17 -27 -43 0 35 8 -57 -27 -52 -81 -15 -23 12 -32 -22 2 -27 -18 -22 -30 -52 -52 -37 -9 -21 -89 -106 -44 3 -17 -79 -96
8227i6N5j3PO2m8j9noN5prNJ8j1LJ5o4lLM7Rjn9K8nj5J4Qj0K0k6qK6L1j7lk2oj1J1Nj5om5
$$ -96 -41 -54 -47 15 -33 -52 -57 -63 -8 -15 -24 -19 -1 -12 -9 6 -58 -61 -58 -11 -2 -3 -62 -34 -39 -54 -40 -32 -42 -22 -48 -56 -30 1 -16 -19 -41 -47 -58 -47 -42 -57 -63 -108
8206a08K2J03l3k3j0KM3m7k0P1J5m2NK9K3Rj1m2plM1l6Lk7L0M4M1Lk6qR6L0n4L2M0OJ3P8J27
$$ -108 -86 17 -16 -39 -49 -47 -4 -51 -71 0 15 -27 -22 7 30 39 28 -14 -21 -24 17 -19 -16 -43 -13 31 72 75 49 41 137 167 113 145 185 191 204 282 409
8187D09K28L51O35J763K891N93k480k288r51l61k65k39j01n0j4l0J0j8m7j8j4j4K5k3P0k7
$$ 409 637 988 1623 3386 6277 6870 4390 2102 1151 790 525 286 185 135 121 91 101 83 36 18 4 -10 15 -8 62 35
8175C5r7m0L6J6Rk8M5l3L7Lj4qk0Q8k9l8M6k1k9l5kK3J8j5k7J8K0mJ9RJ8K1n4k5K2J8k9jM5
$$ 35 -62 -102 -66 -50 -41 -69 -24 -57 -20 -17 -31 -39 -59 29 0 -38 8 -13 -42 -77 -79 -56 -38 -53 -80 -62 -42 -46 -27 -18 0 21 -33 -58 -36 -18 -47 -48 -3
8156cn2l8N5Rm4OJ2K3KJ2m0qKlL1l5k1nJJ0J4K2J1PJ2m6Pj2l2K3J0J8%k6rJ2P9j6l3nk0M7
$$ -3 -55 -93 -38 -29 -73 -67 -55 -32 -30 -18 -58 -66 -64 -67 -36 -71 -92 -97 -96 -86 -72 -50 -39 -32 -20 -66 -59 -71 -103 -80 -70 -52 -52 -78 -87 -75 4 -12 -45 -50 -70 -23
8136b3k9L5L5l7J2Ok3K6J4l8k8RL1o7%k8NJ3M3k3K4n4K8rm0kL0KJ2P7m4J0j7n0K9J2j8J4M2
$$ -23 -52 -17 18 -19 -7 -1 -24 2 16 -22 -50 -41 -10 -77 -77 -105 -100 -87 -44 -67 -43 -97 -69 -78 -118 -120 -90 -88 -76 1 -43 -33 -50 -100 -71 -59 -77 -63 -21
8118b1K1lk2j3K8m0J2Rnj1l5Rj%J8LN8j2p7J3k2N0j8o7K8K5K8Mj4%jk3Q5l7k3k0L3L1k5rJ4
$$ -21 0 -3 -25 -38 -10 -50 -38 -29 -34 -45 -80 -71 -72 -72 -54 -51 7 -5 -82 -69 -91 -41 -59 -126 -98 -73 -45 -41 -55 -55 -56 -79 6 -31 -54 -74 -41 -10 -35 -44 -30
8098c0L2M0q0j3j0J9J5mk4K8j0oPl8j3K4J8m0K4L6m0L6kn3l4L6N2K7pK0j0k3knL1jj9PL9m5
$$ -30 2 42 -38 -51 -61 -42 -27 -31 -55 -27 -37 -43 -36 -74 -87 -63 -45 -85 -61 -25 -65 -29 -31 -84 -118 -82 -30 -3 -10 10 0 -23 -25 -30 1 0 -19 -12 27 -18
8079a8l8N2K4On1j9j1J5K2ll2nL4Lj0j6Ql3k8K8Nj1j3mnLQj9K0m0L3M6l4k5J5Qk6M9J1J9J2
$$ -18 -56 -4 20 26 -25 -44 -55 -40 -18 -21 -53 -58 -24 -21 -31 -47 -39 -72 -100 -72 -67 -78 -91 -95 -100 -97 -89 -108 -88 -128 -95 -49 -83 -108 -93 -85 -111 -62 -51 -32 -20
8060b0n7O2L0m5n5M3l8m2O2j4m0k9L7K8Qj7j8m9J7O8L8nMj9K2J1K1k8J9LOj6j1L7Nk0Ok0M3
$$ -20 -77 -15 15 -30 -85 -42 -80 -122 -60 -74 -114 -143 -106 -78 -70 -87 -105 -154 -137 -69 -31 -36 -32 -51 -29 -18 3 -25 -6 -3 3 -13 -24 13 18 -2 4 -16 27
8041B7pm9ol4%k6m3K6R1k9l8JL7NK5lJ9K4J1q6L2lk9pL2j2RK4k7k0N6l6p0P3mk4k0J2K4L9
$$ 27 20 -29 -35 -69 -69 -95 -138 -112 -21 -50 -88 -87 -50 -45 -20 -23 -4 20 31 -55 -23 -26 -55 -62 -30 -42 -33 -9 -36 -56 0 -36 -106 -33 -37 -61 -81 -69 -45 -6
8022fo3m5K6O0j6O2n1n8L4Nj3j1N3K1j9NOo4PK3J5qK0k0J6QnJ9o0K4K6m7L5j6L0Jj3o8L8L4
$$ -6 -69 -114 -88 -28 -44 18 -33 -91 -57 -52 -65 -76 -23 -2 -21 -16 -10 -74 -67 -44 -29 -37 -17 -37 -21 -13 -18 1 -59 -35 -9 -56 -21 -37 -7 -6 -19 -87 -49 -15
8003a5m8L4j9l1K7M8o2nM7L1o6l0mjK3K5K6l8o5M1nK0J3OM6K5L4p5n4l7J7M0JKlRj8l3k6L5
$$ -15 -63 -29 -48 -79 -52 -4 -66 -71 -24 7 -59 -89 -93 -94 -71 -46 -20 -58 -123 -82 -87 -67 -54 -48 -2 23 57 -18 -72 -109 -92 -52 -51 -49 -52 -43 -61 -94 -120 -85
7984h5k1O2KK5j5MK8j9l8O7k2m2lrm3RL3JJ0mM4L2j5om7Lk9J2j1K2pO2j2n9K2QJ3N8l3l6J4
$$ -85 -106 -44 -42 -17 -32 -28 0 -19 -57 10 -12 -54 -57 -66 -109 -100 -67 -66 -56 -60 -16 16 1 -5 -52 -49 -78 -66 -77 -55 -62 0 -12 -71 -49 -41 -28 30 -3 -39 -25
7964b5k1NkJ3J8l9L0l6j4K1m5M1Kl7M2M8k2p2K0O0m6rK5K7J7k5J2k1k8L3j1k5L9j9j8O6J0
$$ -25 -46 -41 -43 -30 -12 -51 -21 -57 -71 -50 -95 -54 -52 -89 -47 1 -21 -93 -73 -13 -59 -68 -43 -16 1 -24 -12 -33 -61 -28 -39 -64 -25 -44 -62 4 14
7947A4l7nj2K8%k1%Jj8l6K2N2J6r1ML0K5j4K7n2JNO3j0l7K3j1rk9j2K0P8k7nJm5Pj5ml8l6
$$ 14 -23 -28 -40 -12 -12 -33 -33 -32 -50 -86 -64 -12 4 -87 -83 -53 -28 -42 -15 -67 -66 -61 2 -8 -45 -22 -33 -42 -71 -83 -63 15 -12 -17 -16 -61 -54 -69 -73 -111 -147
7927a47K1K7K5j8k5O2L9n5P6J0K2l4m0J5NjJ5k3j0K1N0J4nl3k8J0mL3pr2M7L7p7L3J8m4J4
$$ -147 -126 -99 -74 -92 -117 -55 -16 -71 5 15 37 3 -37 -22 -17 -18 -3 -26 -36 -15 35 49 44 11 -17 -7 -11 22 15 -77 -30 7 -70 -37 -19 -63 -49
7909d9L4N2j5m9k4Ml0M6KK1K1j2J1OM7pj0R1J11K62R14K323P29k226j557m33q1j38m8O8n9
$$ -49 -15 37 22 -27 -51 -47 -77 -31 -29 -8 13 1 12 18 65 58 48 139 250 512 1426 3749 4478 2252 695 262 181 43 -5 63 4
7895Dj3L9n0P4o5l4K4m6k5L2j6M0J1qQN8nJ1J1n4mMk3m1L7O1j8nj04rPN3JmL1L6k7l7pJ7K9
$$ 4 -9 30 -20 54 -11 -45 -21 -67 -92 -60 -76 -36 -25 -33 -25 33 28 39 50 -4 -8 -4 -27 -68 -31 30 12 7 -97 -106 -99 -46 -45 -49 -18 18 -9 -46 -53 -36 -7
7875gO6n5o5m2J3NkK4PM9k7o2L8N1j1Nj9m0K7J4Kk6RK5j4m5Nj8M4QOJ8k3l1K7n3rP7jlj2j7
$$ -7 59 4 -61 -103 -90 -85 -87 -63 -56 -7 -34 -96 -58 -7 -18 -13 -32 -72 -45 -31 -29 -55 -46 -21 -35 -80 -75 -93 -49 -41 -35 -17 -40 -71 -44 -97 -106 -29 -30 -33 -45 -62
7855f2L5J7Ojj0n9M9m2J1Lkl5M9LM2J4l9k9l1O5n6l0NN3j4p0P2K7%K9m2j4L3jKQK3k5m1j7
$$ -62 -27 -10 -4 -5 -15 -74 -25 -67 -56 -53 -55 -90 -41 -38 4 18 -21 -50 -81 -16 -72 -102 -97 -44 -58 -128 -56 -29 -29 0 -42 -56 -23 -24 -22 -14 9 -16 -57 -74
7836g4R5k4o2L7n3rR4L0%q3rJ3M%LoK3j4lL5K4j6j5l0K0L1r3l1J7j0qP2j1j3J7m7K0N6j5k3
$$ -74 21 -3 -65 -28 -81 -90 4 34 34 -49 -58 -45 -41 -41 -38 -44 -21 -35 -38 -3 21 5 -10 -40 -20 11 -82 -113 -96 -106 -114 -42 -53 -66 -49 -96 -76 -20 -35 -58
7817e8L3%n1j8M3JrPM1n7J0lkJ1jk0K6J2m3pL3j4J0nP1n3J2j3J2k3pN4Kk5l5k2J0j9L5L5O
$$ -58 -25 -25 -76 -94 -51 -50 -59 -52 -11 -68 -58 -61 -63 -52 -53 -73 -47 -35 -78 -85 -52 -66 -56 -61 10 -43 -31 -44 -32 -55 -62 -8 -6 -31 -66 -88 -78 -97 -62 -27 -21
7797b1j2k1J7J8J1k2l0k2k7RO0j4L0m9L0%L8l0QOl4k3M4m2K1k2L5K2m0%%L1M3o5M1k4m8L3
$$ -21 -33 -54 -37 -19 -8 -30 -60 -82 -109 -100 -40 -54 -24 -73 -43 -43 -5 -35 -27 -21 -55 -78 -34 -76 -55 -77 -42 -20 -60 -60 -60 -29 14 -51 -10 -34 -82 -49
7779d9k4mN2jK2l4k8K3k5l5K6RL1lOk5K9k3J2jNJJ9K4Ok5k3l6K2L2j9J5k0kL0%Ok7k1j1L5
$$ -49 -73 -77 -25 -26 -4 -38 -66 -43 -68 -103 -77 -68 -37 -40 -34 -59 -30 -53 -41 -42 -37 -36 -17 7 13 -12 -35 -71 -49 -17 -36 -21 -41 -43 -13 -13 -7 -34 -55 -66 -31
7760c1j3J4Pl1M3m5Km2nN7oK5jn7k3L1K8Pj7J9Nnk9P6Mn8j0LJ%l8l0M8Nk9J2M5lj4J1ll9N
$$ -31 -44 -30 -23 -54 -11 -56 -54 -96 -101 -44 -50 -25 -26 -83 -106 -75 -47 -40 -57 -38 -33 -38 -67 9 13 -45 -55 -52 -51 -51 -89 -119 -71 -66 -95 -83 -38 -41 -55 -44 -47 -86 -81
7739h1L3k6J0k3lj7O3P1o4k5L9K6n8OJ7k1j9oK0J6N1l7Ok2k1j5P7Lo0mN2jm9K9J4l8o3M8M6
$$ -81 -48 -74 -64 -87 -90 -107 -44 27 -37 -62 -23 3 -55 -49 -32 -53 -72 -78 -58 -42 9 -28 -22 -44 -65 -80 -3 0 -60 -64 -12 -13 -62 -33 -19 -57 -120 -72 -26
7721b6m7K4kL3J5k3m0j5M9k6K9j1j5Qm4l6L6M4k3l5O6L6m8K1K2j9PQj2nj6j5PM3q1LQ5l0m4
$$ -26 -73 -49 -51 -18 -3 -26 -66 -81 -32 -58 -29 -40 -55 -47 -91 -127 -91 -47 -70 -105 -39 -3 -51 -30 -8 -27 -20 -12 -24 -29 -45 -60 -53 -10 -91 -88 -3 -33 -77
7702g7l3L1N1J5k4O0m6mNk0m2O0m1l2N6j0P9K9r2n2J4QNK9L9J5k1l4PKo8k8O1J2L6o0NK2j3
$$ -77 -110 -79 -28 -13 -37 23 -23 -27 -22 -42 -84 -24 -65 -97 -41 -51 28 57 -35 -87 -73 -65 -60 -31 8 23 2 -32 -25 -23 -91 -119 -58 -46 -10 -70 -65 -43 -56
7683e6j1N1K7j9j3j9K1l0mJ4j5M4m1k5L0L9k9J2k1J2l1QPo7K9N8n0KP4pj2k3K0m2lL1jMK0
$$ -56 -67 -16 11 -8 -21 -40 -19 -49 -53 -39 -54 -10 -51 -76 -46 -7 -36 -24 -45 -33 -64 -56 -49 -116 -87 -29 -79 -77 -3 -10 -22 -45 -25 -67 -70 -39 -40 -36 -16
7665a6mM5j0m7RK9%k2j0rJ5J1j7K5m1j3m9K0K4L1%k2j0%J6Oqj9Ok4L7J2J7lM1JJ7%o0j7nO
$$ -16 -20 25 15 -32 -23 6 6 -16 -26 -35 -20 -9 -26 -1 -42 -55 -104 -84 -60 -29 -29 -51 -61 -61 -45 -39 -47 -66 -60 -84 -47 -35 -18 -21 20 21 38 38 -22 -39 -44 -38
7645c8J9l2rK2N6p0J7N1p3k8J8OqM6Pm5%K0qk1L2J2j5m4PL1l4N3O3m9l4J4K2k6j3j0K7k4J9
$$ -38 -19 -51 -60 -38 18 -52 -35 16 -57 -85 -67 -61 -69 -23 -16 -61 -61 -41 -49 -70 -38 -26 -41 -85 -78 -47 -81 -28 35 -14 -48 -34 -12 -38 -51 -61 -34 -58 -39
7626c9K5K9J0l6l4L8l2JJlJ3JNjJ5l9oJ7jk7jk3PM4Jk8j5K6Ol6JRN1J8p1O5kj7Nj0J9l2j1
$$ -39 -14 15 25 -11 -45 -7 -39 -38 -37 -40 -27 -26 -21 -22 -7 -46 -52 -35 -36 -63 -64 -87 -80 -36 -35 -63 -78 -52 -46 -82 -81 -72 -21 -3 -74 -9 -11 -28 -23 -33 -14 -46 -57
7606e7N7j00K6Nk6QJ3J2%P2j9o3K8JJ5QK9j8p6k8L1K4J5PL8Rq8j4O5M5j4rpPj3j9j3l4K6K
$$ -57 0 -100 -74 -69 -95 -87 -74 -62 -62 10 -9 -72 -44 -43 -28 -20 9 -9 -85 -113 -82 -58 -43 -36 2 11 -77 -91 -26 19 5 -4 -11 -4 -17 -36 -49 -83 -57 -55
7587e5J3Qj6k9j0L1j4M7L0Jl7PK3nn4L2j7q2N0O5p%n7N5k3m4O8J8m4J4k2J9K6j6k2Nk1rl4
$$ -55 -42 -34 -50 -79 -89 -58 -72 -25 5 6 -31 -24 -1 -6 -60 -28 -45 -127 -77 -12 -19 -19 -76 -21 -44 -88 -20 -2 -46 -32 -54 -35 -9 -25 -47 -42 -63 -72 -106
7568a06OL6OM1k0K0J3k7K3K2q2N7J6o2j5jM5k0%O9%l4lj0j7J3j4l4K7M4J6n5j7j3M7J7o7J3
$$ -106 -100 -64 -58 -17 -37 -17 -4 -31 -8 14 -68 -11 5 -57 -72 -73 -28 -48 -48 21 21 -13 -16 -26 -43 -30 -44 -78 -51 -7 9 -46 -63 -76 -29 -12 -79 -66
7550f6J2l3L9K2K5l6l3k3K0N9l5l8P3PJ5n4l7JK0K8J4K6K9k8rk2k8rL5J0M3l9m8k9k1M9m5
$$ -66 -54 -87 -48 -26 -1 -37 -70 -93 -73 -14 -49 -87 -14 -7 8 -46 -83 -82 -62 -34 -20 6 35 7 -2 -24 -52 -61 -26 -16 27 -12 -60 -89 -110 -61 -106
7532a06K3J5pM4rL8L3j1m5qk2K4K1m0lk1j8n1N4N8o8K3J4L5Mn1nJ0MmO5K7lJ6mm2n2k9J6J3
$$ -106 -83 -68 -75 -31 -40 -2 31 20 -25 -33 -55 -31 -10 -50 -53 -74 -92 -143 -89 -31 -99 -76 -62 -27 -23 -74 -79 -69 -65 -69 -4 23 20 36 32 -10 -62 -91 -75 -62
7513f2L1K3o5L2n2K8M8l2l3K1Nl9j5N8J0j4k3KJ6n2M7L3J4o3J7K7K4m4m6Q8j1J7N4o0pj3m1
$$ -62 -31 -8 -73 -41 -93 -65 -17 -49 -82 -61 -56 -95 -110 -52 -42 -56 -79 -77 -61 -113 -66 -33 -19 -82 -65 -38 -14 -58 -104 -16 -27 -10 44 -16 -23 -36 -77
7496g7j6jj0O5L2rj3j9j0K6j2kJ9knk5k4lN8k7k2L9K7K4k4M4n8j6mJ9O0k3q3L1Ol3L8M8k6
$$ -77 -93 -94 -104 -39 -7 -16 -29 -48 -58 -32 -44 -46 -27 -29 -34 -59 -83 -86 -28 -55 -77 -38 -11 13 -11 33 -25 -41 -45 -26 34 11 -72 -41 -35 -68 -30 18 -8
7477hl7k1M6KM7J4q3J2n5k3P3k4n3M6NJ5j1l4Rj7J7jj0rL3O1K1jm2j4j9N6JNJ1j12J7J4K1
$$ -8 -45 -66 -20 -18 29 43 -40 -28 -83 -106 -33 -57 -110 -64 -59 -44 -55 -89 -80 -97 -80 -81 -91 -100 -67 -6 15 14 -28 -42 -61 -5 -4 1 12 -100 -83 -69 -48
7458d8lk0K5j2k4L2Nl7J5M1%l2J4N9o3j8K1M6j5j3j9l0L6O1l0n8K0m0K0j2Lj3l3M3L4K1l0
$$ -48 -51 -71 -46 -58 -82 -50 -45 -82 -67 -26 -26 -58 -44 15 -48 -66 -45 1 -14 -27 -46 -76 -40 21 -9 -67 -47 -87 -67 -79 -76 -89 -122 -79 -45 -24 -54
7441e4M0j7p7K5KL9j0J8j3L7j2j0J6J3L5m3j4M1j2n1l8kJ2mM8MQk7j9K7jj0K9n4OL1M6J6m0
$$ -54 -14 -31 -108 -83 -81 -42 -52 -34 -47 -10 -22 -32 -16 -3 32 -11 -25 16 4 -47 -85 -87 -75 -79 -31 -27 -19 -46 -65 -38 -39 -49 -20 -74 -68 -37 9 25 -15
7422a5j7l3j1j7j3k0J2O3k3K9mJ0L3k6LO1mk8o3L3PJ2o3j2M2m3l7K4j2K0J0J3Pl9K6J6N7p
$$ -15 -32 -65 -76 -93 -106 -126 -114 -51 -74 -45 -49 -39 -6 -32 -29 32 28 0 -63 -30 -23 -11 -74 -86 -44 -87 -124 -100 -112 -92 -82 -69 -62 -101 -75 -59 -2 -9
7404ik0Qj8Kl4j5J2K4J3k6l4m8O4N8m4J4J1M4j3o6nl1R4K8k2l6j6JNj5k4M9L4m5j1M8p3j0
$$ -9 -29 -21 -39 -37 -71 -86 -74 -50 -37 -63 -97 -145 -81 -23 -67 -53 -42 2 -11 -77 -82 -113 -19 9 -13 -49 -65 -64 -59 -74 -98 -49 -15 -60 -71 -23 -96 -106
7386a06P9K9n8k3Q8k0k9P1kq7J2N5mL6n2qJ8J5k2Lj1J4J1J5o1K5Nl2RJ8L5j9q1O1l6k7mK2
$$ -106 -27 2 -56 -79 9 -11 -40 31 29 -58 -46 9 5 41 -11 -19 -1 14 -8 -5 -16 -2 9 24 -37 -12 -7 -39 -30 -12 23 4 -77 -16 -52 -79 -83 -61
7368f1RJ5J5j9l6K6Ql5m1L0M7k3J3j7L1Pl8K3K6m2K1k6J3k2l3j0J02j2L5J2op4l3L2L0nm4
$$ -61 -52 -37 -22 -41 -77 -51 -43 -78 -119 -89 -42 -65 -52 -69 -38 -31 -69 -46 -20 -62 -41 -67 -54 -76 -109 -119 -17 -29 6 18 12 -62 -95 -63 -33 -38 -82
7350h2Q2rm0L2Ol1Nj4K6qj7JK1Pm8%RJ8m0k1kJ2N5J6M8l3K0j0k5k5l5LM2M9j1Rm2NN5m3n2
$$ -82 0 -9 -49 -17 -11 -42 -37 -51 -25 -33 -50 -49 -28 -21 -69 -69 -60 -42 -82 -103 -105 -93 -38 -22 26 -7 13 3 -22 -47 -82 -79 -37 12 1 10 -32 -27 28 -15 -67
7331f7MK5o2M3K1k7NkM4l4K7kn3n4K4J9M7nL9Kj9K8n9n4L7k2Rrj0J20k7n2L1J6k2k1rK5kN3
$$ -67 -63 -38 -100 -57 -36 -63 -58 -60 -16 -50 -23 -25 -78 -132 -108 -89 -42 -47 -8 -6 -25 3 -56 -110 -73 -95 -86 -95 -105 15 -12 -64 -33 -17 -39 -60 -69 -44 -46 7
7311Gn9L1J3Kl0L5rj6Np5L1N1rj1L5J2j9j8j5m7jj0%JN5L5J9kk6m0%J6j8J1Ko8K6Lk3L0J4
$$ 7 -52 -21 -8 -6 -36 -1 -10 -26 -21 -96 -65 -14 -23 -34 1 13 -6 -24 -39 -86 -87 -97 -97 -96 -41 -6 13 11 -15 -55 -55 -39 -57 -46 -44 -112 -86 -83 -106 -76 -62
7292f2K6L1m2j6K8M4m5l3JQK2K8j7nK0nJ5K7k5n2J6K1m5K8Oj5rK4lRk4M9m8J0o9qM4M3mNk9
$$ -62 -36 -5 -47 -63 -35 9 -36 -69 -68 -60 -38 -10 -27 -32 -12 -17 -2 25 0 -52 -36 -15 -60 -32 -26 -41 -50 -26 -29 -20 -44 5 -43 -33 -102 -110 -66 -23 -27 -22 -51
7272e1JK7j6M1k7mK2k7j9kl2LQ5nj4K4l8L1j4m6J7j0N4kk4m3J6M5l1J7K0k5L0Qr9l0J19k8
$$ -51 -50 -23 -39 2 -25 -29 -7 -34 -53 -55 -87 -84 1 -4 -18 6 -32 -1 -15 -61 -44 -54 0 -2 -26 -69 -53 -8 -39 -22 -2 -27 3 11 -88 -118 1 -27
7254b7k9j1K1M1KJr3L6K6m0J4k6j8LM5M0l6K1J0rk4k0QJJ1nk9mM0M2o4J7M5k8o2PJ8N4K4j7
$$ -27 -56 -67 -46 -5 -3 -2 -95 -59 -33 -73 -59 -85 -103 -100 -55 -15 -51 -30 -20 -29 -53 -73 -65 -64 -53 -58 -87 -91 -51 -9 -73 -56 -11 -39 -101 -94 -76 -22 2 -15
7235a5n2N5N1n9m5k8O3Pj6m2K6rk2K6J1%k8Q3M3o3l9j4Qj5P9m8j0M6p5L7L2l7j9pM5l3n8L
$$ -15 -67 -12 39 -20 -65 -93 -30 -23 -39 -81 -55 -64 -86 -60 -49 -49 -77 6 49 -14 -53 -67 -59 -74 5 -43 -53 -7 -82 -45 -13 -50 -69 -76 -31 -64 -122 -119
7217a19J3L8M3L4j3k6RPk6J0j8J5nl4K4N2j1Kj8M3j5k7lK0rj%j6KmlL1Ll8K1Kjj3kK7mL1J2
$$ -119 -106 -68 -25 9 -4 -30 -21 -14 -40 -30 -48 -33 -38 -72 -48 4 -7 -5 -23 20 5 -22 -25 -5 -14 -15 -15 -31 -29 -33 -36 -5 -2 -40 -19 -17 -18 -31 -33 -6 -10 21 33
7197C3Ll8pJ9K0m9o3l5N6O8J5lJ4J3m8q3K5QL1Kj8O1q6k4K8L9k1nL3n6K5K4m6PJl2N3L6rJ
$$ 33 36 -2 -9 10 30 -19 -82 -117 -61 7 22 19 33 46 -2 -85 -60 -52 -21 -19 -37 24 -62 -86 -58 -19 -40 -45 -12 -68 -43 -19 -65 -58 -57 -89 -36 0 -9 -8
7177hK2l0p3J9R1l1m2j1L1j3k5L5k8M8Jo4ML3rkJ2k8k4K6K9J3K4rl9k8K7mk7J8L3J5klJ8m8
$$ -8 14 -16 -89 -70 21 -10 -52 -63 -32 -45 -70 -35 -63 -15 -14 -78 -74 -41 -50 -52 -40 -68 -92 -66 -37 -24 0 -9 -48 -76 -49 -53 -80 -62 -29 -14 -16 -19 -1 -49
7158d9kk2M3Kl3MPoJ2k1j7l2K9K8j4QQ5MRj4k5l0J1mJ2pMJ7l1l1kL7k0qK0m0L9k5m0M5l2M
$$ -49 -51 -73 -30 -28 -61 -57 -50 -56 -44 -65 -82 -114 -85 -57 -71 -63 22 26 35 21 -4 -34 -23 -27 -15 -22 -18 -1 -32 -63 -65 -28 -48 -56 -36 -76 -37 -62 -102 -57 -89 -85
7138h5j2K4L5QK8pRK3k8o0k3Q7lOjl6J9j9J1N0ok6n1MK7l5J3oJ7L7l2J2l8jj5L9o7L5K1pn
$$ -85 -97 -73 -38 -30 -2 -9 0 23 -5 -65 -88 -1 -4 2 1 -35 -16 -35 -24 26 20 -6 -57 -53 -26 -61 -48 -54 -37 0 -32 -20 -58 -59 -74 -35 -102 -67 -46 -53 -58
7119e8mL5j0L6Rm4qJ2o1M9RK7k7J9Pn5l9R8l0kmLj6j5k5L3k5M8K2l1j1J8K5j4n5JM8%%L1l1
$$ -58 -62 -27 -37 -1 8 -36 -44 -32 -93 -44 -35 -8 -35 -16 -9 -64 -103 -5 -35 -37 -41 -38 -54 -69 -94 -61 -86 -38 -16 -47 -58 -40 -15 -29 -84 -83 -35 -35 -35 -4 -35
7099c5j3L6J5l7Nk4LL7Jk3j3J3K2M4pm9J1rm5%k7J3M2N2Ok3J1j0J3m3j9N2j4l9k9M6j0j5K7
$$ -35 -48 -12 3 -34 -29 -53 -50 -13 -12 -35 -48 -35 -13 31 24 -25 -14 -23 -68 -68 -95 -82 -40 12 18 -5 6 -4 9 -34 -53 -1 -15 -54 -83 -37 -47 -62 -35
7081c5K9l7k0p7ON5N8m7j9j6J8N2J4j3M1Pj3j4l2L1J3m9lJ0MqM3k8jN4j8j8n4K0R3qo5m4J4
$$ -35 -6 -43 -63 -140 -134 -79 -21 -68 -87 -103 -85 -33 -19 -32 9 16 3 -11 -43 -12 1 -48 -51 -41 -37 -45 -2 -30 -31 23 5 -13 -67 -47 46 38 -27 -71 -57
7062e7K9k9oPqK1L0j4j0L7qnJ5J9j3l2Rl4j7K1O6Kl0J9l7K4Kj0J1n4o1jJ7K6l6N4k3QpP2k1
$$ -57 -28 -57 -63 -56 -64 -43 -13 -27 -37 0 -8 -13 2 21 8 -24 -15 -49 -66 -45 21 23 -7 12 -25 -1 1 -9 2 -52 -113 -114 -97 -71 -107 -53 -76 -68 -75 -3 -24
7043b4q9jN5l9M2N1n3K0n2l7K4J4L7k6ROJ4k1M7Pm3QK0k4j06O3L4j2l3L7r%M0O3j7p8k4N2
$$ -24 -113 -114 -59 -98 -56 -5 -58 -38 -90 -127 -103 -89 -52 -78 -69 -63 -49 -70 -23 -16 -59 -51 -31 -55 -161 -98 -64 -76 -109 -72 -81 -81 -41 22 5 -73 -97 -45
7024d5K9m5O2Qm0j3j8K8N6j8k1o0L5M9l5j4l1K2J6k4j6N6J7k0K8l8rK6J1j2l5j7%L3K5l4Q
$$ -45 -16 -61 1 9 -31 -44 -62 -34 22 4 -17 -77 -42 7 -28 -42 -73 -51 -35 -59 -75 -19 -2 -22 6 -32 -41 -15 -4 -16 -51 -68 -68 -35 -10 -44 -36
7007c6J2rJ7l2Qm9J0qJ6l9oL4nL8k9k0K9O3K1m9l8Ql7j4N4J1j4jK8k2j9lR6M0n6K9q4M0Ll5
$$ -36 -24 -33 -16 -48 -40 -89 -79 -87 -71 -110 -116 -82 -87 -49 -78 -98 -69 -6 15 -34 -72 -64 -101 -115 -61 -50 -64 -65 -37 -59 -78 -81 15 55 -1 28 -56 -16 -13 -48
6988d8oj1KRl4K0k8lO9j6kRJ8jjn9J8J8J6L3k0m4J3K5l1JJ8l4Nop3L7P0Rm3K9%Nn7PpJ8M6
$$ -48 -54 -65 -63 -54 -88 -68 -96 -99 -30 -46 -48 -39 -21 -22 -23 -82 -64 -46 -30 3 -17 -61 -48 -23 -54 -53 -35 -69 -64 -70 -143 -106 -36 -27 -70 -41 -41 -36 -93 -86 -93 -75 -29
6967b9l0m8P4RPK5k6l1J1nO7Oo2n4K2jl8M5K2K2k2K4mNl3m3J8M1Kk8MK2l9l2O9J4n4jL4l3
$$ -29 -59 -107 -33 -24 -17 8 -18 -49 -38 -43 24 30 -32 -86 -64 -65 -103 -58 -36 -14 -36 -12 -16 -11 -44 -87 -69 -28 -26 -54 -50 -28 -67 -99 -30 -16 -70 -71 -37 -70
6948g0RK4jm4N2K1Oj7j0K8k3L6o4K0jk4J9j7ol9K0pRJj9j3M0lk7P3J1l9j0J8oj3ML4Ok0mK0
$$ -70 -61 -37 -38 -82 -30 -9 -3 -20 -30 -2 -25 11 -53 -33 -34 -58 -39 -56 -62 -101 -81 -88 -79 -78 -97 -110 -70 -73 -100 -27 -16 -55 -65 -47 -53 -66 -62 -28 -22 -42 -46 -26
6928b6qm7O1k1p9J2P5K0L9o0O2o5rJ4%rM9k4Pqqj5Rk0J8r%oo2M0KL8ll5P9k9kM1J3p2k7N7
$$ -26 -34 -81 -20 -41 -120 -108 -33 -13 26 -34 28 -37 -46 -32 -32 -41 8 -16 -9 -17 -25 -40 -31 -51 -33 -42 -42 -48 -110 -70 -68 -30 -33 -68 11 -18 -20 21 34 -38 -65 -8
6908hmj7l2K5L8K8j9m0n1o8K0L0M0k4K4O5n1p5K6M4%k0LMM1mk6m0K8L4l3J7mj6L8N3MK2m6
$$ -8 -12 -29 -61 -36 2 30 11 -29 -80 -148 -128 -98 -58 -82 -58 7 -44 -119 -93 -49 -49 -69 -66 -62 -21 -25 -51 -91 -63 -29 -62 -45 -49 -65 -27 26 30 52 6
6889FKM1m9o5kL3J0j4L1M2o3J2j2m1nj5L4L6J8onRJ3m4k1L1M3kJ2l4n3K4K5J8NmK8k8k8jL
$$ 6 8 49 0 -65 -67 -34 -24 -38 -7 35 -28 -16 -28 -69 -74 -89 -55 -19 -1 -7 -12 -3 10 -34 -55 -24 19 17 29 -5 -58 -34 -9 9 14 10 38 10 -18 -19 -16
6870a6j1k1j2Rj3oO8L4j7j6K5n5k0l3PM5M4rm3L0kk3O2K3m4j4n5pN4L0m2K9J4l6L2m3j0L6
$$ -16 -27 -48 -60 -51 -64 -70 -2 32 15 -1 24 -31 -51 -84 -77 -32 12 3 -40 -10 -12 -35 27 50 6 -8 -63 -70 -16 14 -28 1 15 -21 11 -32 -42 -6
6852fqk9LK8j1n6j6J2K5n4mL8lJ0J8m5J3K4K9k6mL9J5l0l4N7j2j3l2oj0R4J5l7nk9m3noK7
$$ -6 -14 -43 -40 -12 -23 -79 -95 -83 -58 -112 -116 -78 -81 -71 -53 -98 -85 -61 -32 -58 -62 -23 -8 -38 -72 -15 -27 -40 -72 -78 -88 6 21 -16 -21 -50 -93 -98 -104 -77
6833g7K2M2Kk7m1j4L1l2J8O0ROJ1L1p8l6M7L5n5l5M4N6m2n9M0j9jqK1LRJ4KNLjj0k1M3J0k7
$$ -77 -55 -13 -11 -38 -79 -93 -62 -94 -76 -16 -7 -1 10 41 -37 -73 -26 9 -46 -81 -37 19 -23 -82 -42 -61 -62 -70 -49 -46 -37 -23 -21 -16 -13 -14 -24 -45 -2 8 -19
6813a9k0K3J2K5m1J6m0J3M2L1k6k2Nl2j2J3pm8O1Kn4J1K0j9N8M6k7l8j7mM2j0Qk7o6P4J8n8
$$ -19 -39 -16 -4 21 -20 -4 -44 -31 11 42 16 -6 -1 -33 -45 -32 -39 -87 -26 -24 -78 -67 -47 -66 -8 38 11 -27 -44 -48 -6 -16 -8 -35 -101 -27 -9 -67
6795f7N4j5M3L3p4l6k5M0j8K1OK1ml3j9N7J6lj4n1J9j4j6J00Oj4m7J7mJ8l6m9n0J0R0M9J3
$$ -67 -13 -28 15 48 -26 -62 -87 -47 -65 -44 -38 -17 -21 -54 -73 -16 0 -3 -17 -68 -49 -63 -79 21 27 13 -34 -17 -21 -3 -39 -88 -138 -128 -38 11 24
6777B4l3j5j3M8Jnl5nJ9l8k3PM6n0j1MPM0J5K0%On8M0l2l1j6J9l6k1M9k8N5J9M2Rp7J5k4j7
$$ 24 -9 -24 -37 11 12 7 -28 -33 -14 -52 -75 -68 -22 -72 -83 -79 -72 -32 -17 3 3 9 -49 -9 -41 -72 -88 -69 -105 -126 -77 -105 -50 -31 11 20 -57 -42 -66 -83
6758h3O0K8o5mM3L2n8l4OL9m6L7OOK5j7ml1KQM0K4k6l3n0jqRQ4%j5l0k0P7J9l0k2Oj8j0N3
$$ -83 -23 5 -60 -64 -21 11 -47 -81 -75 -36 -82 -45 -39 -33 -8 -25 -29 -60 -58 -50 -10 14 -12 -45 -95 -96 -104 -95 -11 -11 -26 -56 -76 1 20 -10 -32 -26 -44 -54 -1
6739aol1ok1K8onL5ol5j2K4j5j2qJ4k2K0L8k0J4j0k0M6K2k2LJ0jj0m3j5K4%j3ONkJ6m5N5J5
$$ -1 -7 -38 -44 -65 -37 -43 -48 -13 -19 -54 -66 -42 -57 -69 -77 -63 -85 -65 -27 -47 -33 -43 -63 -17 5 -17 -14 -4 -5 -15 -58 -73 -49 -49 -62 -56 -51 -53 -37 -82 -27 -12
6719a2j1j4n1OQ8j3J0m2J2o0M4L2J1J0k2jpm8K4j4L4j5m4L2MML3l6q4N4N5J6j5k5lJ3K7Rp2
$$ -12 -23 -37 -88 -82 6 -7 3 -39 -27 -87 -43 -11 0 10 -12 -13 -20 -68 -44 -58 -24 -39 -83 -51 -47 -43 -10 -46 -130 -76 -21 -5 -20 -45 -48 -35 -8 1 -71
6700g1JRJol1M8j3J0KL1M0K5%k3n7N2l9QK1j3k2o3kL3j6j8Kj3N2m9N6L8jl7j4m8L4kK3l2J3
$$ -71 -70 -61 -60 -66 -97 -49 -62 -52 -50 -19 21 46 46 23 -34 18 -21 -13 8 -5 -27 -90 -92 -59 -75 -93 -91 -104 -52 -101 -45 -7 -8 -45 -59 -107 -73 -75 -52 -84 -71
6681g1J1J2oN5l9k9N6MJ4j0Lj6k0J4k5j3J4j7j9L3P7m9j7J8L0K1q6n1K2j1J1N0j6k2j1N4J1
$$ -71 -60 -48 -54 1 -38 -67 -11 -7 7 -3 0 -16 -36 -22 -47 -60 -46 -63 -82 -49 28 -21 -38 -20 10 31 -55 -106 -84 -95 -84 -34 -50 -72 -83 -29 -18
6663a8Njj9L3oqj5okm7LJ1o0LPN8J5j5J9ol6J5K7k1J0K1j5Oj2nJ4PJ0m4k3K9K8J5m8j1kNL6
$$ -18 -13 -14 -33 0 -6 -14 -29 -35 -37 -84 -81 -70 -130 -127 -120 -62 -47 -62 -43 -49 -85 -70 -43 -64 -54 -33 -48 -42 -54 -59 -45 -38 -28 -72 -95 -66 -38 -23 -71 -82 -84 -79 -43
6642d3J8j5k3LL2J9l5K3pj9N3k5RJ8k3k5mL2k2k3mpK3k4nJ9RRm1l4J2L6rJ4kJ2Mk5J4j4J6
$$ -43 -25 -40 -63 -60 -28 -9 -44 -21 -28 -47 6 -19 -10 8 -15 -40 -44 -12 -34 -57 -61 -68 -45 -69 -74 -55 -46 -37 -78 -112 -100 -64 -73 -59 -61 -49 -45 -70 -56 -70 -54
6623e4j6K6k2M5K2nml6QL0l0l5J8kk3N2m2L0L3J5l2Qk7j2Pj1N2kl0J4olK8n3RO2l1K1J8k4
$$ -54 -70 -44 -66 -21 1 -4 -8 -44 -36 -6 -36 -71 -53 -55 -78 -26 -68 -38 -5 10 -22 -14 -41 -53 -46 -57 -5 -7 -37 -23 -29 -32 -4 -57 -48 14 -17 4 22 -2
6604bml2J0K7p8O8k8l2K3L3p0moR4K2k6k5QNm5M8n2M3j3k0J0n4J0N8l7M7l2j%QK4O4n5q4K2
$$ -2 -6 -38 -28 -1 -79 -11 -39 -71 -48 -15 -85 -89 -95 -1 21 -5 -30 -22 -17 -62 -14 -66 -23 -36 -56 -46 -100 -90 -32 -69 -22 -54 -55 -55 -47 -23 41 -14 -98 -76
6585g6K6Qk6J1M1J8l0PK1j0J2p1OL6jl5j7MMm2M1K6km8Q2nm2M6m3l2mKL0K3M7j5Pmm0M1K2
$$ -76 -50 -42 -68 -57 -16 2 -28 -21 0 -10 2 -69 -63 -27 -28 -63 -80 -76 -72 -114 -73 -47 -49 -97 -15 -20 -62 -16 -59 -91 -95 -93 -63 -40 7 -8 -1 -5 -45 -4 18
6565A8j14l4M8K9k8jnL1O7L1jj18l4J0M6J5jj3L7j1M2m0o4mj5J1L9L0j1KJ2J9Jp2L7k7L4K6
$$ 18 -96 -130 -82 -53 -81 -82 -87 -56 11 42 41 -77 -111 -101 -55 -40 -41 -54 -17 -28 14 -26 -90 -94 -109 -98 -59 -29 -40 -38 -26 -7 -6 -78 -41 -68 -34 -8
6547ho5K3J2o4J0K4K4o6J0L5L2jk9k4k7P5L8k8j3L6k3j7k2k0rK6K8Pj3KL1k3j1J6Oj9mJ9R
$$ -8 -73 -50 -38 -102 -92 -68 -44 -110 -100 -65 -33 -34 -63 -87 -114 -39 -1 -29 -42 -6 -29 -46 -68 -88 -97 -71 -43 -36 -49 -47 -16 -39 -50 -34 -28 -47 -51 -32 -23
6529b3j5oMkj4J2Lk0qL5pnL5J8K0Rjj2l2j2m8J2RNJr5L3k8O1L3k9k9J7l0N5k1j2k4J8O1K2
$$ -23 -38 -44 -40 -42 -56 -44 -41 -61 -69 -34 -41 -46 -11 7 27 36 35 23 -9 -21 -69 -57 -48 -43 -42 -137 -104 -132 -71 -38 -67 -96 -79 -109 -54 -75 -87 -111 -93 -32 -10
6509a0m5KqK7kKj3k3k6L3M7K3n2l1j7M7p0nj5M4L0J3kK4M8k9n4J7K5%l0J4K0Rk8J5n3k7M5
$$ -10 -55 -53 -61 -34 -36 -34 -47 -70 -96 -63 -16 7 -45 -76 -93 -46 -116 -121 -136 -92 -62 -49 -51 -27 21 -8 -62 -45 -20 -20 -50 -36 -16 -7 -35 -20 -73 -100 -55
6490e5P1pm8J1pj2j6J8M6j7POn3J6L6j1LK2k9j0Jln6L1M7k9LL5rJ3K6n9p9MQ8J9o5L9j3KP
$$ -55 16 9 -39 -28 -35 -47 -63 -45 1 -16 -9 -3 -56 -40 -4 -15 -12 10 -19 -29 -28 -31 -87 -56 -9 -38 -35 0 -9 4 30 -29 -108 -104 -16 3 -62 -23 -36 -34 -27
6471b7p7K2Q5o5K2l3K1OK6L2nk3k7J3L1J3o9KJ8N2Oj3J8j8l0j1Rk2j1rJn8%O0L7kj9QL0K2
$$ -27 -104 -82 3 -62 -40 -73 -52 -46 -20 12 7 -16 -43 -30 1 14 -55 -53 -35 17 23 10 28 10 -20 -31 -22 -44 -55 -64 -63 -121 -121 -61 -24 -26 -45 -37 -7 15
6452A5%pj6QNm6l8LKJ7j3J1OK7n1j%%O9oM7k7m2K1J0n0M0kK1j9p4K2j3rN3j9j1QM1L1jJ5o4
$$ 15 15 8 -8 0 5 -41 -79 -76 -74 -57 -70 -59 -53 -26 -77 -78 -78 -78 -9 -15 32 5 -37 -16 -6 -56 -16 -18 3 -16 -90 -68 -81 -90 -37 -56 -67 -59 -18 13 12 27 -37
6431c7j9k5JK0K3jk4l3j4rM0N3J8Pl0mJ0l2o1M6M9J9n5MN6j6n7j3j9OL9K4l2QQ6k0o3KjK8
$$ -37 -56 -81 -80 -60 -37 -38 -62 -95 -109 -118 -78 -25 -7 0 -30 -34 -24 -56 -117 -71 -22 -3 -58 -54 2 -14 -71 -84 -103 -97 -58 -34 -66 -58 28 8 -55 -53 -54 -26
6412b6J6qk1L2km5n1K2K6K6j4l1j6KJ1J0K7m0PN1L6l7j7K4p2j4O7l8K5K9k3j8J4J7k4j9J8
$$ -26 -10 -18 -39 -7 -9 -54 -105 -83 -57 -31 -45 -76 -92 -90 -79 -69 -42 -82 -75 -24 12 -25 -42 -18 -90 -104 -37 -75 -50 -21 -44 -62 -48 -31 -55 -74 -56
6395e6j7M3M0n3k6PK0j5M1k0l2k8N4j6J7J8J3j4l8j7K2k8JjkQk8K9L8j6J3k6j5QK5M3p1j3
$$ -56 -73 -30 10 -43 -69 -62 -42 -57 -16 -36 -68 -96 -42 -58 -41 -23 -10 -24 -62 -79 -57 -85 -84 -85 -87 -79 -107 -78 -40 -56 -43 -69 -84 -76 -51 -8 -79 -92
6376i2J8L5L1l0m0M2j0l0J6jN3k3j9J9K9%K3k6Pj8j1j6j4MK0K8J2J8Jo8kl5k0nM1l7L9L0m4
$$ -92 -74 -39 -8 -38 -78 -36 -46 -76 -60 -61 -8 -31 -50 -31 -2 -2 21 -5 2 -16 -27 -43 -57 -53 -33 -5 7 25 26 -42 -44 -79 -99 -104 -63 -100 -61 -31 -75
6358g5j5rK2O8k6K6k5k3kn9N7j6L4%Lj2NN2j4JOkoj3k1K0K3Jk0m2qK5J7nJ3n3K0j1NokQJ1
$$ -75 -90 -99 -77 -9 -35 -9 -34 -57 -59 -118 -61 -77 -43 -43 -40 -52 -47 5 -9 -8 -2 -4 -10 -23 -44 -24 -1 0 -20 -62 -70 -45 -28 -33 -20 -73 -53 -64 -59 -65 -67 -59 -48
6337d8NM0qn2J3NLJ2k8JKlK0jl7K6k5J3L1J0RM9j1n0M8nq0K2k2lRqqK0Po8jK1nK8Oj0O9J6
$$ -48 -43 -3 -11 -63 -50 -45 -42 -30 -58 -57 -55 -58 -38 -39 -76 -50 -75 -62 -31 -21 -12 37 26 -24 24 19 -61 -39 -61 -64 -55 -63 -71 -51 -44 -112 -113 -92 -97 -69 -63 -73 -4 12
6316A2J1l2p6K3Q3k1o8k0J6P0j5Lk1k9j1O9j6m3k0P5M2p0p6L8K3J2m9L5m8k4PJ0k7K7M9J1
$$ 12 23 -9 -85 -62 21 0 -68 -88 -72 -2 -17 -14 -35 -64 -75 -6 -22 -65 -85 -10 32 -38 -114 -76 -53 -41 -90 -55 -103 -127 -120 -110 -137 -110 -61 -50
6299e0j4Mj4j8J6l4J4j1j4Q5l2j0L8m4K2J8J7n6l6K8J6k3K9l5MjK6j2j3j2N1L6k3j7j3J0J7
$$ -50 -64 -60 -74 -92 -76 -110 -96 -107 -121 -36 -68 -78 -40 -84 -62 -44 -27 -83 -119 -91 -75 -98 -69 -104 -100 -101 -75 -87 -100 -112 -61 -25 -48 -65 -78 -68 -51
6282e1MKJ0k7nK4%j6N3Nj6K9m0p5L4Nj2M7k0K5J5m0jj6J5l0M9J4l8n1L8L8l4%K0o1K6J5L4
$$ -51 -47 -45 -35 -62 -67 -43 -43 -59 -6 -1 -17 12 -28 -103 -69 -64 -76 -29 -49 -24 -9 -49 -50 -66 -51 -81 -32 -18 -56 -107 -69 -31 -65 -65 -45 -106 -80 -65 -31
6263c1Oo3K2J8l2ppL2lL0n4M0j5L0K2j8n9J5k4N1j3M6K9n3l4P3m8jN9m4J9J7j4l8N3l9n3j1
$$ -31 -25 -88 -66 -48 -80 -87 -94 -62 -65 -35 -89 -49 -64 -34 -12 -30 -89 -74 -98 -47 -60 -14 15 -38 -72 1 -47 -48 11 -33 -14 3 -11 -49 4 -35 -88 -99
6245i9K3J3l0O7M4n8RMJ0ql7k5J2M2l0MQj0M4j3Ok3K6J5j0m5KQj9N0o0K7llJ6Oj8m4O1j9K3
$$ -99 -76 -63 -93 -26 18 -40 -31 -27 -17 -25 -62 -87 -75 -33 -63 -59 -51 -61 -17 -30 -24 -47 -21 -6 -16 -61 -59 -51 -70 -20 -80 -53 -56 -59 -43 -37 -55 -99 -38 -57 -34
6225c4J3k0K6j3l5m6L3J3K6K6Jl3J1L6m5J7K9Kj1n0j0J6l1rK2L2j1j3J4J6k5j7j1M4k6l4l3
$$ -34 -21 -41 -15 -28 -63 -109 -76 -63 -37 -11 -10 -43 -32 4 -41 -24 5 7 -4 -54 -64 -48 -79 -88 -66 -34 -45 -58 -44 -28 -53 -70 -81 -37 -63 -97 -130
6208a30R0j6J7N0o3L5O2L9n5j3j8l3Mk2K0k5k5k8O1J06p5j6P1k0o0nl0J6K4k2K1M2M0p8k1
$$ -130 -40 -56 -39 11 -52 -17 45 84 29 16 -2 -35 -31 -53 -33 -58 -83 -111 -50 56 -19 -35 36 16 -44 -49 -79 -63 -39 -61 -40 2 42 -36 -57
6191e7RJ9N9m2J2J1j0p3l3J9j3K1RM8l3j0M7L0n3L4j0l0l1N5J5%M1o9l2K0OlJj1QK6j0j1L
$$ -57 -48 -29 30 -12 0 11 1 -72 -105 -86 -99 -78 -69 -21 -54 -64 -17 13 -40 -6 -16 -46 -77 -22 -7 -7 34 -35 -67 -47 -41 -44 -43 -54 -46 -20 -30 -41 -38
6172c8m3lmJ1%O1J3j8K4k0OL8po3K1m1NK4LmkJok4PJ0oL7k9j4M5J5Qm6J9J0K0k9m1l2J2l0
$$ -38 -81 -84 -88 -77 -77 -16 -3 -21 3 -17 -11 27 20 -43 -22 -63 -58 -34 -31 -35 -37 -36 -42 -66 -59 -49 -55 -18 -47 -61 -16 -1 7 -39 -20 -10 10 -19 -60 -92 -80 -110
6152a10M1Jk8J3LM9m0JQOJ3Ln8N2j2M6j2j2j9PL5L0k1m9K2qL6k7j8J5K4j7LJ9l7o5rJ4M2l5
$$ -110 -69 -68 -96 -83 -80 -31 -71 -70 -62 -56 -43 -40 -98 -46 -58 -12 -24 -36 -55 -48 -13 17 -4 -53 -31 -39 -3 -30 -48 -33 -9 -26 -23 -4 -41 -106 -115 -101 -59 -94
6133i4K3M9J2kl1o0K6J5j9LN2L8pJ0k8n2RRJ7MK5lo0L3m1J8L9k3L9j2L4m8k9Kk7N2N8j2kk8
$$ -94 -71 -22 -10 -12 -43 -103 -77 -62 -81 -78 -26 12 5 15 -13 -65 -56 -47 -30 -26 -1 -4 -64 -31 -72 -54 -15 -38 1 -11 23 -25 -54 -52 -79 -27 31 19 17 -11
6114a1m6O6m6oJ5n2M0k6K3J7K1m0OjN6j7j6J3l7j1mJ4K8m9L2k7l1K7L1K8k0j6M4MPj3m2J5
$$ -11 -57 9 -37 -43 -28 -80 -40 -66 -43 -26 -5 -45 -39 -40 16 -1 -17 -4 -41 -52 -56 -42 -14 -63 -31 -58 -89 -62 -31 -3 -23 -39 5 9 16 3 -39 -24
6096b4j0k3J3K8L4r4nM5k1L3oJ9K9k4n2j3N8l0l2l5Q4mKk5N4l8K9K6k0l4n0L9m%k8O5J6m1
$$ -24 -34 -57 -44 -16 18 -76 -81 -36 -57 -24 -30 -11 18 -6 -58 -71 -13 -43 -75 -110 -26 -30 -28 -53 1 -37 -8 18 -2 -36 -86 -47 -51 -51 -79 -14 2 -39
6078c9KL2O7jp5MpK2nj7rJ2N0L5m6L1m5m6m9pN2qj3MN2qm0j4L8K8J2k9j6J2Ol7l4QN8M1l1
$$ -39 -37 -5 62 61 -14 -10 -17 5 0 -17 -26 -14 36 71 25 56 11 -35 -84 -91 -39 -47 -60 -56 -4 -12 -52 -66 -28 0 12 -17 -33 -21 -15 -52 -86 -78 -20 21 -10
6058a0l9n4N3k2n0R2J3m0m0K7k8N6K8k8l7j1M6j8n6L2J2m0M9j2%L3l1k9k1K5K0L2l7jL6j1
$$ -10 -49 -103 -50 -72 -122 -30 -17 -57 -97 -70 -98 -42 -14 -42 -79 -90 -44 -62 -118 -86 -74 -114 -65 -77 -77 -44 -75 -104 -125 -100 -80 -48 -85 -86 -50 -61
6041f1l0N5K3Kj1pj1M5q5O%k4M1orJ2N2J9n1n2k0j3L5k8PN1L0J7lNn2n3RK5J3LL8Nk0n7N0
$$ -61 -91 -36 -13 -11 -22 -29 -40 5 -80 -74 -74 -98 -57 -63 -72 -60 -8 11 -40 -92 -112 -125 -90 -118 -111 -60 -30 -13 -16 -11 -63 -116 -107 -82 -69 -66 -28 -23 -43 -100 -50
6022e0L5k7okL5J5K7L3Jn2l4J7Kn0j1L0ML3k0M0N0l3k8m3oo2n7L9L9O6J1k1MJJ4K2l4K0m8
$$ -50 -15 -42 -48 -50 -15 0 27 60 61 9 -25 -8 -6 -56 -67 -37 -33 0 -20 20 70 37 9 -34 -40 -102 -159 -120 -81 -15 -4 -25 -21 -20 -6 16 -18 2 -46
6003d6m4k1QJ2k3L3K4L1J0j8l8lM8p4O5JnK9lm0k9O5J3l6j5l9P4PL6m7j4K5qlJ8m0L2j9j6
$$ -46 -90 -111 -103 -91 -114 -81 -57 -26 -16 -34 -72 -75 -27 -101 -36 -35 -40 -11 -14 -54 -83 -18 -5 -41 -56 -95 -21 -14 22 -25 -39 -14 -22 -25 -7 -47 -15 -34 -50
5984e0K0N3m1j8J0J3J2J5n7qj0LK3k2k9N0L3n3j2m1N2Ol5L4J0J8k6n2L4N4L9o7q0N8K9r4j4
$$ -50 -30 23 -18 -36 -26 -13 -1 14 -43 -51 -61 -58 -35 -57 -86 -36 -3 -56 -68 -109 -57 -51 -86 -52 -42 -24 -50 -102 -68 -14 25 -42 -122 -64 -35 -129 -143
5967a43O5K3J7j1l6nM2j8jJ7M3j6o1j2ON9K3K2J4m2k6J5j6lj8j3K7ORj6L4j0J0n7J9J4J3O
$$ -143 -78 -55 -38 -49 -85 -90 -48 -66 -67 -50 -7 -23 -84 -96 -90 -31 -8 14 28 -14 -40 -25 -41 -44 -62 -75 -48 -42 -33 -49 -15 -25 -15 -72 -53 -39 -26 -20
5949b0K3k8n3M0J5l1K6M2n1k9j1KJ5J3J1%L4Pp4lJ0Nmm3RL5%m5L1k1OM0OJj5K2L3K0j7k3R
$$ -20 3 -25 -78 -38 -23 -54 -28 14 -37 -66 -77 -75 -60 -47 -36 -36 -2 5 -69 -72 -62 -57 -61 -104 -95 -60 -60 -105 -74 -95 -89 -49 -43 -42 -57 -35 -2 18 1 -22 -13
5929a3k5j2j4qM4R0k9M5K0q0m0l3j2Qrj0M0J1k8mj6JPK0L6J0L%k1M4l0J0J1m2j9R4nq3%j2
$$ -13 -38 -50 -64 -72 -28 62 33 78 98 18 -22 -55 -67 -59 -68 -78 -38 -27 -55 -59 -75 -74 -67 -47 -11 -1 2 2 -19 25 -5 5 16 -26 -45 49 44 -39 -39 -51
5910e1PpJ8j7k9K4ol9J7OM0O1J5pk3J0p6P1M9o8J1l3j4o1L5M8n1kL0k9K2K4MO%k2L9j0l0J8
$$ -51 -44 -51 -33 -50 -79 -55 -61 -100 -83 -77 -37 24 39 32 9 19 -57 14 63 -5 6 -27 -41 -102 -67 -19 -70 -72 -42 -71 -49 -25 -21 -15 -15 -37 2 -8 -38 -20
5891b0K5o2J3L5k1j0l1j7K5NL3p0L9K8kk5L4j7lK0Nl9PK9m4L6Pj8l7M0L3p2k7K2j8L8m5O2
$$ -20 5 -57 -44 -9 -30 -40 -71 -88 -63 -58 -25 -95 -56 -28 -30 -55 -21 -38 -41 -21 -16 -55 -48 -19 -63 -27 -20 -38 -75 -35 -2 -74 -101 -79 -97 -59 -104 -42
5873d2J9ML8n6OL0K1l4k3k5Ml6rN7pK4mm9l3J5n1M5N8m3j4O0OL9M3k7l8joM2J3n0l1L9Qj1
$$ -42 -23 -19 19 -37 -31 -1 20 -14 -37 -62 -58 -94 -103 -46 -53 -29 -33 -82 -115 -100 -151 -106 -48 -91 -105 -45 -39 0 43 16 -22 -23 -29 13 26 -24 -55 -16 -8 -19
5854a9L0m0pk9j2j1K4k3jK6j4K8k2m0P1l0LJ0RN3nrj3j9K6q4M6O7l5n0Nk6L7P5lm4Pk6%Lk1
$$ -19 11 -29 -36 -65 -77 -88 -64 -87 -88 -62 -76 -48 -70 -110 -39 -69 -66 -56 -47 6 1 -8 -21 -40 -14 -98 -52 15 -20 -70 -65 -91 -54 21 18 -26 -19 -45 -45 -42 -63
5834f3N3k2L5K8n5j3j8K5K6J3j0j6n1M1qk9KqJ1M0K0l5%J3M8k6j9l8j2L0L9Kj0l9j3mj1j9
$$ -63 -10 -32 3 31 -24 -37 -55 -30 -4 9 -1 -17 -68 -27 -35 -64 -62 -70 -59 -19 1 -34 -34 -21 27 1 -18 -56 -68 -38 1 3 -7 -46 -59 -63 -74 -93
5816i3O4j1m2N4l4l2M0l7RM7LJ2Kk0K4l7K6K0j7J6j7J1J7j1K0k6n7J9k3K1J0k9K8m1O7nl6
$$ -93 -29 -40 -82 -28 -62 -94 -54 -91 -82 -35 -32 -20 -18 -38 -14 -51 -25 -5 -22 -6 -23 -12 5 -6 14 -12 -69 -50 -73 -52 -42 -71 -43 -84 -17 -22 -58
5798e8J2kqM7l7k8M8K9K9j8o1j2k0L4km1j2rK6K4J7N1lj3j7k3o4K9O0J1pNj1m4%N5%L8j1p1
$$ -58 -46 -48 -56 -9 -46 -74 -26 3 32 14 -47 -59 -79 -45 -47 -88 -100 -109 -83 -59 -42 9 6 -7 -24 -47 -111 -82 -22 -11 -18 -13 -24 -68 -68 -13 -13 25 14 -57
5779e7L5l3M0J4m6KJk6O4K9J6m2k5k3L0k8j4J9n0K6O7Kk8K0qJ4Kjk6mL5l3j2Ol0J5KPj8l3
$$ -57 -22 -55 -15 -1 -47 -45 -44 -70 -6 23 39 -3 -28 -51 -21 -49 -63 -44 -94 -68 -1 1 -27 -7 -15 -1 1 0 -26 -30 5 -28 -40 -34 -64 -49 -47 -40 -58 -91
5760i1k1L2L6J5oj7N3k9k5j2j7N9k9N2oj3m3j4M0j0J3oL6M2jq6Kk5NOJ7M7l0mJ6pKL1o6k4
$$ -91 -112 -80 -44 -29 -35 -52 1 -28 -53 -65 -82 -23 -52 0 -6 -19 -62 -76 -36 -46 -33 -39 -3 39 38 -48 -46 -71 -66 -60 -43 4 -26 -30 -14 -21 -19 12 -54 -78
5741g8M8J1L8n6m0ML2%k8MjK8K1k2jRjL3lk0o8nK8L2kL3J8Rn9jK7l9L2K1Lk4MJk7LJj1k1j
$$ -78 -30 -19 19 -37 -77 -73 -41 -41 -69 -65 -66 -38 -17 -39 -40 -31 -32 1 -2 -22 -90 -95 -67 -35 -37 -4 14 23 -36 -37 -10 -49 -17 4 7 -17 -13 -12 -39 -36 -35 -46 -67 -68
5720f8rO4Jj4LJ1K9k3m5k1kL4LL8k9j0K0ln1M4N3j5J4m1J5J6l2mN7k7n8QK9kp3j7J02j9l0
$$ -68 -77 -13 -12 -26 -23 -12 17 -6 -51 -72 -74 -40 -37 1 -28 -38 -18 -21 -72 -28 25 10 24 -17 -2 14 -18 -22 35 8 -50 -42 -13 -15 -88 -105 -3 -22 -52
5702e2L4p6l1J9J4J9N6m6L7L2o4m0P3m1n8K5O0l6j7K0J6lj2l0RN0J2oJ6mK3k0L1pJ3k6q0N8
$$ -52 -18 -94 -125 -106 -92 -73 -17 -63 -26 6 -58 -98 -25 -66 -124 -99 -39 -75 -92 -72 -56 -59 -71 -101 -92 -42 -30 -36 -20 -24 -1 -21 10 3 16 -10 -90 -32
5684c2J9%k7J5M8m1m1m7K6M1j2k2JJK7Jk7L2l5m0M9J1k8N3l4k1J3J3M0PL0m7mNk3L2L0nJl1
$$ -32 -13 -13 -40 -25 23 -18 -59 -106 -80 -39 -51 -73 -72 -71 -44 -43 -70 -38 -73 -113 -64 -53 -81 -28 -62 -83 -70 -57 -17 -10 20 -27 -31 -26 -49 -17 13 8 9 -22
5664b2K3jl8n3ML7l5LK9k1rM2NJ6K3K3n0j4N1j1j2n2k5M4k5J8Pl3ok1O4J4j9j6PN2k7k6L2
$$ -22 1 0 -38 -91 -87 -50 -85 -82 -53 -74 -83 -41 -36 -20 3 26 -24 -38 13 2 -10 -62 -87 -43 -68 -50 -43 -76 -82 -103 -39 -25 -44 -60 -53 -1 -28 -54 -22
5646b2l7K2Qj8K6l7J3K1K1o1OkPjk5K5pj3K0k5lM3M8O9j05p1QO3oM2j1j4K3lj4L1j0J7n4k9
$$ -22 -59 -37 -29 -47 -21 -58 -45 -24 -3 -64 -58 -60 -53 -54 -79 -54 -61 -74 -54 -79 -82 -39 9 78 -27 -98 -90 -27 -33 9 -2 -16 7 4 -10 21 11 28 -26 -55
5627e5J1K4kj5l7o6K9N3j2Kj5L7J3J4Mk1l5J2oJ6MJRk1nJ7L7m5p1L5N4N0j6qLk9m6J6nK3L7
$$ -55 -44 -20 -22 -37 -74 -140 -111 -58 -70 -68 -83 -46 -33 -19 -15 -36 -71 -59 -65 -49 -45 -44 -35 -56 -61 -44 -7 -52 -123 -88 -34 16 0 -8 -5 -34 -80 -64 -69 -46 -9
5607ik4J4Qm6l9O1QmJ8j7kJ3J7oj6j9l1l4N2O3Jm4RLMJ3n6j0nM4K5%m5J9R6m4o7K2O0k7n5
$$ -9 -33 -19 -11 -57 -96 -35 -27 -31 -13 -30 -32 -19 -2 -8 -24 -43 -74 -108 -56 7 8 -36 -27 -24 -20 -7 -63 -73 -78 -34 -9 -9 -54 -35 61 17 -50 -28 32 5 -50
5588e0Lk9O4k9j2M8M8n3k9%Q0nr2J1L8O9m8p5L3K1j3m1KQ1l2l8J7qK0K5k0J7n8l8K6K7K9m
$$ -50 -47 -76 -12 -41 -53 -5 43 -10 -39 -39 41 36 -56 -45 -7 62 14 -61 -28 -7 -20 -61 -59 22 -10 -48 -31 -39 -19 6 -14 3 -55 -93 -67 -40 -11 -15
5570a5j1M1p2l8M4M1L7n1K6j5k6M8kk8lo5lm7L4N5J8K0l0Nl1L2L2j5J5k1Rko6O9m1J7mj9k
$$ -15 -26 15 -57 -95 -51 -10 27 -24 2 -13 -39 9 7 -21 -24 -89 -92 -139 -105 -50 -32 -12 -42 -37 -68 -36 -4 -19 -4 -25 -16 -18 -84 -15 -56 -39 -43 -62 -64
5551f4L4L8K4lo5m9k0L1L6k6K6jPNj1k2JP9j7l4J1J9k0l8k6K9L8j7j8N2Ln9L4K4k7m4K9lm8
$$ -64 -30 8 32 29 -36 -85 -105 -74 -38 -64 -38 -39 -32 -27 -38 -60 -59 20 3 -31 -20 -1 -21 -59 -85 -56 -18 -35 -53 -1 2 -57 -23 1 -26 -70 -41 -44 -92
5532i2M2K3NL2j5j2m0J7K6pNJ2o7l8M9k4J4lL1M5m2l1k7O0L9qp9K9k5K4L3M8m5m5oL1p5N2
$$ -92 -50 -27 -22 10 -5 -17 -57 -40 -14 -21 -16 -4 -71 -109 -60 -84 -70 -73 -42 3 -39 -70 -97 -37 2 -6 -85 -56 -81 -57 -24 24 -21 -66 -72 -41 -116 -64
5514f4M1m1j7J00m2l1lK5m6K0J5nk6k4J03l7j9K9K8j2o5m0Q2j1nL0j9nmM8k3Qm9MmqQl6J3
$$ -64 -23 -64 -81 19 -23 -54 -57 -32 -78 -58 -43 -48 -74 -98 5 -32 -51 -22 6 -6 -71 -111 -29 -40 -45 -15 -34 -39 -43 5 -18 -10 -59 -55 -59 -67 -59 -95 -82
5496h2P0jk5m0K6QL2kkk3j2K6Pj9Q4k3k9jKl5k1J1k6O0%n0J9Nm4RJ3k9K5J9N0rk6j3NN9j6
$$ -82 -12 -13 -38 -78 -52 -44 -12 -14 -16 -39 -51 -25 -18 -37 47 24 -5 -6 -4 -39 -60 -49 -75 -15 -15 -65 -46 -41 -85 -76 -63 -92 -67 -48 2 -7 -33 -46 -41 18 2
5476Bj1J8Jj0pk2l6K0knj1l4K5M5r%JO2m9p3K1L0K5l8KkJ3O8n8Qom2KK0k3J1K1M1oJ6j8J9
$$ 2 -9 9 10 0 -7 -29 -65 -45 -47 -52 -63 -97 -72 -27 -36 -36 -35 27 -22 -95 -74 -44 -19 -57 -55 -57 -44 24 -34 -26 -32 -74 -72 -52 -75 -64 -43 -2 -8 8 -10 9
5456Inmj8J1l7j2M9j8M0ol9j5j0J6K7L1n4KjL5p3lL3n4J0J9j3K7nj9qk2N3K3j6N8m8K1k3J0
$$ 9 4 0 -18 -7 -44 -56 -7 -25 15 9 -30 -45 -55 -39 -12 19 -35 -33 -34 1 -72 -75 -42 -96 -86 -67 -80 -53 -58 -77 -85 -107 -54 -31 -47 11 -37 -16 -39 -29
5437b9L2J6ql4oK2J7q1k0K3QkJ5M7m7J9L3k0k4j6K6lk2K9lL9n9Rn6J7Q1Nl0l9k6L2kqN4k7
$$ -29 3 19 11 -23 -29 -7 10 -71 -91 -68 -60 -62 -47 0 -47 -28 5 -15 -39 -55 -29 -32 -54 -25 -28 11 -48 -39 -95 -78 3 8 -22 -61 -87 -55 -57 -65 -11 -38
5418c8JRk5pK8j5M4%m7n5N7J6N0n5J1K5O6n6m9j7l0M1RK4mj9m8lJ8J4K1L7n4l6%J6J2j8Oj8
$$ -38 -37 -28 -53 -60 -32 -47 -3 -3 -50 -105 -48 -32 18 -37 -26 -1 65 9 -40 -57 -87 -46 -37 -13 -17 -36 -84 -87 -69 -55 -34 3 -51 -87 -87 -71 -59 -77 -71 -89
5399h9QPmkM4LjO0NJ6l9j4k4JK5J9j3j9j7k6L2K2j2m2Pmk0N5k2J2K3k1%NJj8Jj0pj6J4%m0
$$ -89 -81 -74 -78 -80 -36 -33 -34 26 31 47 8 -6 -30 -29 -4 15 2 -17 -34 -60 -28 -6 -18 -60 -53 -57 -77 -22 -44 -32 -9 -30 -30 -25 -24 -42 -41 -51 -58 -74 -60 -60 -100
5378a00j6Q0lj7J2J5J6K4k6j7k7J7L8k3pL4l2j9J5l2lrJ3NO2m4K8Nl2j3J2J8j3J1l2K8j0m0
$$ -100 -116 -36 -39 -56 -44 -29 -13 11 -15 -32 -59 -42 -4 -27 -34 0 -32 -51 -36 -68 -71 -80 -67 -62 0 -44 -16 -11 -43 -56 -44 -26 -39 -28 -60 -32 -42 -82
5360h2L6M4j5j8L4Qp2Kk5o0R1J5J0N8n2k6NJ0j1L7n0K1oJ5J5m5J0M1Oj1m7K0%K2k0%k3j6K4
$$ -82 -46 -2 -17 -35 -1 7 -65 -63 -88 -148 -57 -42 -32 26 -26 -52 -47 -37 -48 -11 -61 -40 -46 -31 -16 -61 -51 -10 -4 -15 -62 -42 -42 -20 -40 -40 -63 -79 -55
5342e5kl6N6j3K0N4n5K5M0ql2rj7k5j0L3M3n8j9mN3Nr4N1O2K1n7l8k3OL3N1o9j4k5L5P6m0
$$ -55 -57 -93 -37 -50 -30 24 -31 -6 34 26 -6 -15 -32 -57 -67 -34 9 -49 -68 -72 -19 -14 -108 -57 5 26 -31 -69 -92 -86 -53 -2 -71 -85 -110 -75 1 -39
5324c9K3l1QK8l6pj6n4K1P0l4k9R9kK5rm3j9N4Qj5k7J6Mk8m2K8Oo5N1J6L1Lj9LlK8l7j3k5
$$ -39 -16 -47 -39 -11 -47 -54 -70 -124 -103 -33 -67 -96 3 1 26 17 -26 -45 9 17 2 -25 -9 -5 -33 -75 -47 -41 -106 -55 -39 -8 -5 -24 -21 -24 4 -33 -46 -71
5304g1OK1rk3R5Kn2K8N9k6k4o1J8K4j7J7k6K1j1jk4m4J2K1L0jl2nL3K6k1%j0l9P1J4k0j5j2
$$ -71 -65 -44 -53 -76 19 21 -31 -3 56 30 6 -55 -37 -13 -30 -13 -39 -18 -29 -30 -54 -98 -86 -65 -35 -36 -68 -73 -40 -14 -35 -35 -45 -84 -13 1 -19 -34 -46
5286d6L2Pj5n1mL9m7M3M3Pm0k9J5j0N5K8j6n0J1k0n3JJ9J3N9Rm9k2J9j1N8l6m0L8l9K6m2P9
$$ -46 -14 -7 -22 -73 -77 -38 -85 -42 1 8 -32 -61 -46 -56 -1 27 11 -39 -28 -48 -101 -100 -81 -68 -9 0 -49 -71 -52 -63 -5 -41 -81 -43 -82 -56 -98 -19
5268a9J4j2%Pj8j0l4K5K6Oj4k7m4L3l2L0RJ4l1o9M8M5Ml4J4Nkl1L8j1l5L8J6K9mpJ4m6K5l2
$$ -19 -5 -17 -17 -10 -28 -38 -72 -47 -21 -15 -29 -56 -100 -67 -99 -69 -60 -46 -77 -146 -98 -53 -49 -83 -69 -64 -66 -97 -59 -70 -105 -67 -51 -22 -26 -33 -19 -65 -40 -72
5249g2prJ2P1k3j%k5j2Mn6R8M3Jl5j5p9qQ9ol4M1l2j9M2k5M9K5l3J2Qn2m5N3pJ3m2K2J5nj3
$$ -72 -79 -88 -76 -5 -28 -29 -29 -54 -66 -62 -118 -20 23 24 -11 -26 -105 -113 -24 -30 -64 -23 -55 -74 -32 -57 -8 17 -16 -4 4 -48 -93 -40 -47 -34 -76 -54 -39 -44 -57
5229e7j9J7J8J6LqmJ7l9J8o9N2k4k0O7K6MK3J1l0k3mOKj8k6nL5J9o2rP1mj8J0l4M1J4n5rM9
$$ -57 -76 -59 -41 -25 -22 -30 -34 -17 -56 -38 -107 -55 -79 -99 -32 -6 -2 21 32 2 -21 -25 -19 -17 -35 -61 -66 -31 -12 -74 -83 -12 -16 -34 -24 -58 -17 -3 -58 -67 -18
5210a8j7k6m2m8N6rJ2M6ROLj4NJ0PqPk0l4L2NK7m4N5J2j9Kn7K2J0J5J5k4K0rj3N2J7r9k4O
$$ -18 -35 -61 -103 -151 -95 -104 -92 -46 -37 -31 -28 -42 -37 -27 -20 -28 -21 -41 -75 -43 -38 -11 -55 0 12 -7 -5 -62 -40 -30 -15 0 -24 -4 -13 -26 26 43 -56 -80 -74
5190g4Kk1N5k8K2j7l6N8L0oLo2k0oqQL1Mk0Ln2K9J3OJ0J0O8Kr7L7j4l5M2j3M2PK0n1jP7j4
$$ -74 -72 -93 -38 -66 -44 -61 -97 -39 -9 -15 -12 -74 -94 -100 -108 -100 -69 -65 -85 -82 -134 -105 -92 -86 -76 -66 2 4 -93 -56 -70 -105 -63 -76 -34 -27 -7 -58 -59 18 4
5170Dp6J6n6jN9K6j8K4K6kk5j7pK6L1kJ2j00L6lm0J0M6j4Kql0K3L2k7N5K5q6k7O9J4Oj9J9
$$ 4 -72 -56 -112 -113 -54 -28 -46 -22 4 2 -23 -40 -47 -21 10 8 20 -80 -44 -47 -87 -77 -31 -45 -43 -51 -81 -58 -26 -53 2 27 -59 -86 -17 -3 3 -16 3
5152Ck4jMLn5J3M4l6jNj1K5oqL5OJ3J8l0n2K1Jm4K6K0J7J1l0K0pLKl4J3lRj9L9K4OL6k9o3
$$ 3 -21 -22 -18 -15 -70 -57 -13 -49 -50 -45 -56 -31 -37 -45 -10 -4 9 27 -3 -55 -34 -33 -77 -51 -31 -14 -3 -33 -13 -20 -17 -15 -49 -36 -39 -30 -49 -10 14 20 56 27 -36
5131c6j4J2j8jM4l2k0k0K8N5m2K9M2j9J9m1k8m0OL2l4L0K2J0QLo7M3L0m6j9L2j0J7rl1LQL4
$$ -36 -50 -38 -56 -57 -13 -45 -65 -85 -57 -2 -44 -15 27 8 27 -14 -42 -82 -76 -44 -78 -48 -26 -16 -8 -5 -72 -29 1 -45 -64 -32 -42 -25 -34 -65 -62 -54 -20
5113b0L4m6m0k7j4K8LQmJ1M0nl0J0K0K3k9J7lk5n3O5k4o9L6L0L7J9k4%lj4j1M9j0M8m9J0l1
$$ -20 14 -32 -72 -99 -113 -85 -82 -74 -78 -67 -27 -32 -62 -52 -32 -9 -38 -21 -24 -49 -102 -37 -61 -130 -94 -64 -27 -8 -32 -32 -35 -49 -60 -11 -21 27 -22 -12 -43
5094d3l7L8N5k3Jrmk7n1J08j0o0pj3M8k1Jn0N6QJ7jl6J9jm9N1J4j3QK8j7lm5M3MRl0Q1j6m8
$$ -43 -80 -42 13 -10 -9 -18 -22 -49 -100 8 -2 -62 -69 -82 -34 -55 -54 -104 -48 -40 -23 -24 -60 -41 -42 -91 -40 -26 -39 -31 -3 -20 -23 -68 -25 -21 -12 -42 39 23 -25
5075b5J5mK3J1m2km3nJ8j7O7j4n3Opm4M1k3k6L3l4L3K2l1R6K9o2mJ1k7K2K8Qj9k5QK7rk8K3
$$ -25 -10 -14 9 20 -22 -24 -67 -72 -54 -71 -4 -18 -71 -65 -72 -116 -75 -98 -124 -91 -125 -92 -70 -101 -5 24 -38 -42 -31 -58 -36 -8 0 -19 -44 -36 -9 -18 -46 -23
5056b3M7K3o1pp5OLK8M8J1L2j6nk3mK5pm0M5lm1m9K2j6j0L1jK3rj1J2K9k8mj2OL3m9L3mK9
$$ -23 24 47 -14 -21 -96 -90 -87 -59 -11 0 32 16 11 -12 -16 9 2 -38 7 4 -37 -86 -64 -80 -90 -59 -60 -37 -46 -57 -45 -16 -44 -48 -60 -54 -21 -70 -37 -41 -12
5036a2l6L2K8n0oL8kJ6PJ1j1l9l8M3K1RORK4p3m8M1m4J3O3K7N9j09j6K7k0k4j3O9m2J1L0L9
$$ -12 -48 -16 12 -38 -44 -6 -8 8 15 26 15 -24 -62 -19 2 11 17 26 50 -23 -71 -30 -74 -61 2 29 88 -21 -37 -10 -30 -54 -67 2 -40 -29 1 40
5018D0k9l1J8n4MJ5L0j1n2L5NOL3q5l6P9l3j8kl9J1M6J7L0k4J6kj0kkl3j8L0j6K3K2J2JL4
$$ 40 11 -20 -2 -56 -52 -37 -7 -18 -70 -35 -30 -24 9 -76 -112 -33 -66 -84 -86 -125 -114 -68 -51 -21 -45 -29 -31 -41 -43 -45 -78 -96 -66 -82 -59 -37 -25 -24 10
4999A0j1mJ6k5m7L7j1m6K0k2J9pj2K8l8jP5Ol0LN9k6m1j3Jl0K1J8K9n9Qj5L3L4l6j0J2J4q
$$ 10 -1 -5 11 -14 -61 -24 -35 -81 -61 -83 -64 -71 -83 -55 -93 -94 -19 -13 -43 -40 19 -7 -48 -61 -60 -90 -69 -51 -22 -81 -73 -88 -55 -21 -57 -67 -55 -41 -49
4981d9K5k4J7j7K3L0n3PM7m7m1M3J0O1K9o0l2kK3K3m0K5pm3j4N1rk7K5n5JK3J3j3M0j9j06
$$ -49 -24 -48 -31 -48 -25 5 -48 -41 6 -41 -82 -39 -29 32 61 1 -31 -33 -10 13 -27 -2 -9 -52 -66 -15 -24 -51 -26 -81 -80 -57 -44 -57 -17 -36 -142
4963a42L9PlK8L5j5L7L5j2m3Omk2MnJ1Pl7J5On3J2J9k4J8Pj4R5J3j8jL1m3J6J3r2L4l1lQO4
$$ -142 -103 -96 -99 -71 -36 -51 -14 21 9 -34 -28 -32 -54 -50 -55 -44 -37 -74 -59 -53 -106 -94 -75 -99 -81 -74 -88 7 20 2 1 32 -11 5 18 -74 -40 -71 -74 -66 -2
4944bK0NPl0l2jPj2k1K4J9rj6J3jj8L3j6j5j8k3RJ0J1L6Km6N9j7o8K4J3qJ9L0MM7k2n1j9N8
$$ -2 18 23 30 0 -32 -33 -26 -38 -59 -35 -16 -25 -41 -28 -29 -47 -14 -30 -45 -63 -86 -77 -67 -56 -20 -18 -64 -5 -22 -90 -66 -53 -61 -42 -12 -8 39 17 -34 -53 5
4924Em4K5NK5j1ql8o3j4L2N5nK2nk2LJ7K9k7L7k2r1j0P1k2J1krl7j1J2J0oO9j2Mk6QK4j2j5
$$ 5 -39 -14 -9 16 5 -3 -41 -104 -118 -86 -31 -36 -14 -19 -41 -38 -21 8 -19 18 -4 -95 -105 -34 -56 -45 -47 -56 -93 -104 -92 -82 -88 -19 -31 -27 -53 -45 -21 -33 -48
4904d8k5j3L9RPJ2Kk0k9J5qNjL3j1j3JL3j5Q1o3j0J0k2PnJ6jJ5NLj7m8Jj8j6K4o0N3L3k8L0
$$ -48 -73 -86 -47 -38 -31 -19 -17 -37 -66 -51 -59 -54 -55 -22 -33 -46 -45 -12 -27 54 -9 -19 -9 -31 -24 -29 -13 -14 1 6 9 -8 -56 -55 -73 -89 -65 -125 -72 -39 -67 -37
4884c7J8k6oj9J%N6p4j0MK1lM8k4m7M5kJ6K0J0l2%l6K7R5k7m8K1n1M8kj0qj9lJ1j0K0nJL2
$$ -37 -19 -45 -51 -70 -69 -69 -13 -87 -97 -93 -72 -75 -27 -51 -98 -53 -55 -39 -19 -9 -41 -41 -77 -50 45 18 -30 -9 -60 -12 -14 -24 -32 -51 -54 -43 -53 -33 -38 -37 -5
4865ej0j5K0l0N0qk1l1m0K8K5n7j7M7k0M2L3Qp8K8N6n6l8kjj0QK9M3N4j9K9r0kk8l4K0O5m0
$$ -5 -15 -30 -10 -40 10 2 -19 -50 -90 -62 -37 -94 -111 -64 -84 -42 -9 -1 -79 -51 5 -51 -89 -91 -92 -102 -94 -65 -22 32 13 42 -48 -50 -78 -112 -92 -27 -67
4846f7n0nL3J9krJ3K6J%j4k0J9L3j0J9J8j2J1k9ll9j5l4L9L6M9nOp0oM3j3l2K4K1j1J0M3m2
$$ -67 -117 -122 -89 -70 -72 -81 -68 -42 -41 -41 -55 -75 -56 -23 -33 -14 4 -8 3 -26 -29 -68 -83 -117 -78 -42 7 2 8 -62 -68 -25 -38 -70 -46 -25 -36 -26 17 -25
4827b5j0k1Mk9M2k8L5LmM1Jm1L7Mj3j1K8k7K3m7kJJ4n0L0J1L2m0k4J4L0L7p2pJ6L1Lj5LLJ
$$ -25 -35 -56 -52 -81 -39 -67 -32 -29 -33 8 9 -32 5 9 -4 -15 13 -14 9 -38 -40 -39 -25 -75 -45 -34 -2 -42 -66 -52 -22 15 -57 -64 -48 -17 -14 -29 -26 -23 -22
4808b2lKK1k4k7kLK4j3PL3J6k5j3j7Ok0j0M6J0l8L0k0j7L3K3m5nJ7K4Jorn2J8K3J25l7m4K8
$$ -22 -25 -23 -2 -26 -53 -55 -52 -28 -41 -34 -1 15 -10 -23 -40 -34 -54 -64 -18 -8 -46 -16 -36 -53 -20 3 -42 -47 -30 -6 -5 -11 -20 -72 -54 -31 94 57 13 41
4789D1ol7K6n0mJ7j3N%Rpn3lK1M0%LJ1j3j9J3K4k6K5Kl1NPj2o0K3M2Lk6JJ5MKK6m1k4M5j3
$$ 41 35 -2 24 -26 -30 -13 -26 -21 -21 -12 -19 -72 -75 -54 -14 -14 -11 0 -13 -32 -19 5 -21 4 6 -25 -20 -13 -25 -85 -62 -20 -17 -43 -42 -27 -23 -21 5 -36 -60 -15 -28
4768b8O0m2m8lR8k8o3MJ5k0K3j3k7k0j2O1L3K5j8n3K9%k5%M1m6l4O4L4l1n7k8O1L2M3Ml9m2
$$ -28 32 -10 -58 -61 37 9 -54 -50 -35 -55 -32 -45 -72 -92 -104 -43 -10 15 -3 -56 -27 -27 -52 -52 -11 -57 -91 -27 7 -24 -81 -109 -48 -16 27 31 -8 -50
4750e0j6M6j8NL4k5nMl4j0P1J0l7j0j7L9k9m1K9m0J0%k2%M7JJ2L9m7Rk6mN0J0k6J3mm0MK1
$$ -50 -66 -20 -38 -33 1 -24 -29 -25 -59 -69 2 12 -25 -35 -52 -13 -42 -83 -54 -94 -84 -84 -106 -106 -59 -58 -46 -7 -54 -45 -71 -75 -25 -15 -41 -28 -32 -72 -68 -47
4731d7K5nJ5m0NK6K7n4j1LM1k0jp0k0k1P8ol4L7KkO2l5j1M2nj5Mn2O3K3l1L1j3j3j6K4J8l4
$$ -47 -22 -27 -12 -52 -47 -21 6 -48 -59 -56 -15 -35 -36 -106 -126 -147 -69 -75 -109 -72 -70 -72 -10 -45 -56 -14 -19 -34 -30 -82 -19 4 -27 4 -9 -22 -38 -14 4 -30
4712c0n3M6l0rK7qJ4l4N1K5nj0j0lj0KL5j8L9j1k3oJ8Qk3QJ1J1l4J2lj4ko5N3kL0n4O5m1o
$$ -30 -83 -37 -67 -76 -49 -57 -43 -77 -26 -1 -6 -16 -26 -29 -39 -37 -2 -20 19 8 -15 -21 -3 5 -18 -10 1 12 -22 -10 -13 -27 -29 -94 -41 -43 -13 -67 -2 -43 -49
4692d9J9K1l2j2M2J2M3%p0m2qj7K0J3M6m2L7J9k4Lk0K6j0k8L0Om9j5K8L7k5M9l7kL1k7j8q
$$ -49 -30 -9 -41 -53 -11 1 44 44 -26 -68 -76 -93 -73 -60 -14 -56 -19 0 -24 -21 -41 -15 -25 -53 -23 -17 -66 -81 -53 -16 -41 8 -29 -31 0 -27 -45 -53
4674e3L6J0m6n4O6O1pl8o1LK8RK9Lk7L3m7K3K2k4L1j5kjm3OQj9K0LN9k2k0J0k9OmK7j3l6K8
$$ -53 -17 -7 -53 -107 -41 20 13 -25 -86 -83 -55 -46 -17 -14 -41 -8 -55 -32 -10 -34 -3 -18 -20 -21 -64 -58 -50 -69 -49 -46 13 -9 -29 -19 -48 -42 -46 -19 -32 -68 -40
4655d0LJ4k6Lj3J8l7M7J7k7n7M0Rk1k7jM7J7lK2M0m9k6M1j6jPoQj1nj6J9K5j9j9L0J2l5or
$$ -40 -37 -23 -49 -46 -59 -41 -78 -31 -14 -41 -98 -58 -49 -70 -97 -98 -51 -34 -37 -15 25 -24 -50 -9 -25 -26 -19 -25 -17 -28 -33 -49 -30 -5 -24 -43 -13 -1 -36 -42 -51
4635e1J6lpK8M2k1l6qK7L0K6j7l3ORMp8l5P5l6RRk2J4ln5O0L1n7L0J3l1J04rj6Rm7J6k6m5
$$ -51 -35 -38 -45 -17 25 4 -32 -40 -13 17 43 26 -7 -1 8 12 -66 -101 -26 -62 -53 -44 -66 -52 -55 -110 -50 -19 -76 -46 -33 -64 40 31 15 24 -23 -7 -33 -78
4616g8N5M6Kl7qL7Lk0m9K6L1n7m9N0L7k6j2J9K4j9l0J8L7l4pj0RM1K6k1mL2L9o1n5N8k4jj
$$ -78 -23 23 25 -12 -20 17 20 0 -49 -23 8 -49 -98 -48 -11 -37 -49 -30 -6 -25 -55 -37 0 -34 -41 -51 -42 -1 25 4 0 32 71 10 -45 13 -11 -12 -13
4597a3n1j6%J0nj4M0nppQk1j0L6J7L2j1k2nlm6%K5N9l0NJ2l1NM1ok5J4j8Pk4K5Rp2M7K0L8
$$ -13 -64 -80 -80 -70 -75 -89 -49 -54 -61 -68 -60 -81 -91 -55 -38 -6 -17 -39 -44 -47 -93 -93 -68 -9 -39 -34 -22 -53 -48 -7 -13 -38 -24 -42 -35 -59 -34 -25 -97 -50 -30 8
4577Hrl8K8K9k5J9J4jm4o4N2M0l1m5O0l1k9K2J8KM2m3k5L2L3Pm0j7j6lL3%j6O2k4K3kk4l4
$$ 8 -1 -39 -11 18 -7 12 26 25 -19 -83 -31 9 -22 -67 -7 -38 -67 -45 -27 -25 17 -26 -51 -19 14 21 -19 -36 -52 -55 -22 -22 -38 24 0 23 21 -3 -37
4559c7N1N0j04LO6J5n4pJ4OM7m9j4J4l1j5m5N8Jj4O9ll0kn7rK6jLj8J2LoP7l2k0M3K6n4Jj2
$$ -37 14 64 -40 -37 29 44 -10 -17 -3 3 50 1 -13 1 -30 -45 -90 -32 -31 -45 24 21 -9 -11 -68 -77 -51 -52 -49 -67 -55 -52 -58 19 -13 -33 10 36 -18 -17 -29
4539b9L4ln3P1n9lnOM8j0j1J4j0l5j3l1nM0J8l2K0k0N1L6m1l2lJ8JlO3l9k7OJ4O2o0J5k5m1
$$ -29 5 2 -51 20 -39 -42 -47 -41 7 -3 -14 0 -10 -45 -58 -89 -94 -54 -36 -68 -48 -68 -17 19 -22 -54 -57 -39 -38 -41 22 -17 -44 -38 -24 38 -22 -7 -32 -73
4520g3K6L9l8L2L4j8j9Nk8o3N5o3KO9M3K4k0J3j2m5JRj0K7K5j3m3k0%K0J3N5k9om1rk4PRK6
$$ -73 -47 -8 -46 -14 20 2 -17 -12 -40 -103 -48 -111 -109 -40 3 27 7 20 8 -37 -36 -27 -37 -10 15 2 -41 -61 -61 -41 -28 27 -2 -8 -49 -58 -82 -75 -66 -40
4501d0N2j8j4K4lj2j7oK3j0J1j8nJ8k5J1J4oqK6J8kQl3l5J9m6M2N5kK5j6K2m0l1J5J1K0j4
$$ -40 12 -6 -20 4 1 -11 -28 -34 -11 -21 -10 -28 -33 -15 -40 -29 -15 -21 -29 -3 15 13 21 -12 -47 -28 -74 -32 23 21 46 30 52 12 -19 -4 7 27 13
4482A3j3mk6k0Ll8jL7K0Mlo6K5M0krL7J6qq5J9Jk3PL5M9j1k7j2M7l2n2lqj3J0M0N8l1k3LK
$$ 13 0 -4 -30 -50 -47 -85 -86 -49 -29 -25 -28 -94 -69 -29 -31 -40 -3 13 5 -80 -61 -60 -83 -76 -41 8 -3 -30 -42 5 -27 -79 -82 -90 -103 -93 -53 5 -26 -49 -46 -44
4462d4n4P5J3%m3LJ4JqrK7Nj3j0pJ4J7j6j3J0Kj4Ln8mRL4K6m4j5J8kJ2NL3k8L9J6MpN7l2p1
$$ -44 -98 -23 -10 -10 -53 -50 -36 -35 -43 -52 -25 -20 -33 -43 -50 -36 -19 -35 -48 -38 -36 -50 -47 -105 -109 -100 -66 -40 -84 -99 -81 -83 -71 -66 -33 -61 -22 -6 -2 -9 48 16 -55
4442e5J9j7L2ok6KpN6N4o1n5k4rK6j6Q2pk8M6J3o3qkk5l8O2J6K3k2rN8ql5l9RJ0J2QJ6Rk1
$$ -55 -36 -53 -21 -27 -53 -51 -58 -2 52 -9 -64 -88 -97 -71 -87 -5 -12 -40 6 19 -44 -52 -54 -79 -117 -55 -39 -16 -38 -47 11 3 -32 -71 -62 -52 -40 -32 -16 -7 -28
4422b8L0j3m3L5Lp0L2M7k7J1l4J6l2L8k2L2J3m3J6k0L8Ql5KljNM6k5M4k6L6%p0L1L2oJ2p6
$$ -28 2 -11 -54 -19 -16 -86 -54 -7 -34 -23 -57 -41 -73 -35 -57 -25 -12 -55 -39 -59 -21 -13 -48 -46 -49 -50 -45 1 -24 20 -6 30 30 -40 -9 23 17 29 -47
4404d7j2kJnK1K8N0qj7m6k4k1J5J6j6qN0L5l4n7nQ9k2J8j2l4j0NN1m2ojk7J2K5l3m5K0L6L7
$$ -47 -59 -61 -60 -65 -44 -16 34 26 9 -37 -61 -82 -67 -51 -67 -75 -25 10 -24 -81 -86 3 -19 -1 -13 -47 -57 -52 -1 -43 -49 -50 -77 -65 -40 -73 -118 -98 -62 -25
4385b5o5K5j0N2j9L7L0l0J8L2j6p2J6l3Km8J0P7J0mj4k2L6n8KM3rNm1J8kkO2Ol6k0K0Mk1N
$$ -25 -90 -65 -75 -23 -42 -5 25 -5 13 45 29 -43 -27 -60 -58 -106 -96 -19 -9 -13 -27 -49 -13 -71 -69 -26 -35 -30 -71 -53 -55 -57 5 11 -25 -45 -25 -21 -42 -37
4366c7j8j3O9jNl2o9N5K6N2l2J5n3l6j9M1jKj5M2l2lnOJ6nK0l6j9OJ0J8k8l0O2L7jJ4l3k7
$$ -37 -55 -68 1 0 5 -27 -96 -41 -15 37 5 20 -33 -69 -88 -47 -48 -46 -61 -19 -51 -54 -59 -53 -37 -42 -22 -58 -77 -71 -61 -43 -71 -101 -39 -2 -3 11 -22 -49
4347d9jQj0rN7k9k8J9k6ML6mroM3k6j0K4J2J8K7k6K9L1p8M6k1k6j5pk5pJ2%%RKmL1Rn1m7N6
$$ -49 -50 -42 -52 -61 -4 -33 -61 -42 -68 -64 -28 -32 -41 -47 -4 -30 -40 -16 -4 14 41 15 44 75 -3 43 22 -4 -19 -26 -51 -58 -46 -46 -46 -37 -35 -39 -8 1 -50 -97 -41
4326d1RQj7m3J6L3l3N4oQk8mJ7J0lql4o5N5J8nMpj7oJ0J2J1L7K6k3pk7oKJ0NlpJ4Rl5l0j9
$$ -41 -32 -24 -41 -84 -68 -35 -68 -14 -20 -12 -40 -44 -27 -17 -20 -28 -62 -127 -72 -54 -59 -55 -62 -79 -85 -75 -63 -52 -15 11 -12 -19 -46 -52 -50 -40 -35 -38 -45 -31 -22 -57 -87 -106
4305a06L1N1k7J7Km6M9j5O3lo4j5m4M2M7j4NKKl7k3j8K6J4L1l7JL8K8n9k9L9L0Jjm1N1j1l5
$$ -106 -75 -24 -51 -34 -32 -78 -29 -44 19 16 -48 -63 -107 -65 -18 -32 -27 -25 -23 -60 -83 -101 -75 -61 -30 -67 -66 -28 0 -59 -88 -49 -19 -18 -19 -60 -9 -20 -55
4286e5k0pL0N6pj8k9mk4mN5k8J8l3M4k2Jl0N3oj1J8j0L9k2Jj6l3lM3M4l0m2n3K3J5%L2N5n4
$$ -55 -75 -82 -52 4 -3 -21 -50 -54 -78 -82 -27 -55 -37 -70 -26 -48 -47 -77 -24 -30 -41 -23 -33 6 -16 -15 -31 -64 -67 -24 20 -10 -52 -105 -82 -67 -67 -35 20 -34
4267c4Ojj3O2j8k3K4n1K2M4l3j4J8k3ML5n2l4M8pl3k2PJ8qK5K1NPJ6k4l3J7N5L4qk9j9Lqk3
$$ -34 -28 -29 -42 20 2 -21 3 -48 -26 18 -15 -29 -11 -34 -30 5 -47 -81 -33 -40 -73 -95 -88 -70 -78 -53 -32 -27 -20 -4 -28 -61 -44 11 45 37 8 -11 -8 -16 -39
4248c9j1M3M2q9n2K7N2j7KMK4M6l9k9j5j9J0P6J1l7j4o5O8Nm5mk2J3J2N1L5j1j0k6oNM1n7
$$ -39 -50 -7 35 -54 -106 -79 -27 -44 -42 -38 -14 32 -7 -36 -51 -70 -60 16 27 -10 -24 -89 -21 -16 -61 -65 -87 -74 -62 -11 24 13 3 -23 -29 -24 17 -40
4230d0j4LK6k6L5L2l4oK6jqo8J4Q8jl5%k3o2j2P2N1J1J9qo8jkqj6J5L1No4m3M0N6lJPK1kl0
$$ -40 -54 -51 -25 -51 -16 16 -18 -24 2 1 -7 -75 -61 27 26 -9 -9 -32 -94 -106 -34 17 28 47 39 -29 -30 -32 -40 -56 -41 -10 -5 -69 -112 -72 -16 -19 -18 -11 10 8 -22
4209b2l0J1l3L7K8k1j8RM7p8L1l7K2N3m1j7J4Nkk8lML8N7k1k1k0KJ2k0J3R0o2l9L1J0Oj0l5
$$ -22 -52 -41 -74 -37 -9 -30 -48 -39 8 -70 -39 -76 -54 -1 -42 -59 -45 -40 -42 -70 -73 -69 -31 26 5 -16 -36 -34 -22 -42 -29 61 -1 -40 -9 1 7 -3 -38
4191c8o3K1j4QO8j8MK9Qj7l3j7K0K4l7MPkJ2l4j6j1O2j0PKQ1m4l3K8o3ro0J11KJ2k4K4jm2
$$ -38 -101 -80 -94 -86 -18 -36 -32 -3 5 -12 -45 -62 -42 -18 -55 -51 -44 -46 -34 -68 -84 -95 -33 -43 -36 -34 47 3 -30 -2 -65 -74 -134 -23 -21 -9 -33 -9 -10 -52
4172e2k4m6J05jl6N2j0M3j0j8k1K1k4K4o4KL9k1l5j0MJ8L3K5j6k4M9k8k5j3J0jK5n5K0j5J9
$$ -52 -76 -122 -17 -18 -54 -2 -12 31 21 3 -18 3 -21 3 -61 -59 -20 -41 -76 -86 -82 -64 -31 -6 -22 -46 3 -25 -50 -63 -53 -54 -29 -84 -64 -79 -60
4154f0R1J5l4j8P2k1k4r4k4Q3M8J7l8l3k8k5KJ3J3k1KM0j6l9N4l1o2L5Q1nj8Jn1J8J2J2k7
$$ -60 31 46 12 -6 66 45 21 -73 -97 -14 34 51 13 -20 -48 -73 -71 -58 -45 -66 -64 -24 -40 -79 -25 -56 -118 -83 -2 -7 -25 -24 -75 -57 -45 -33 -60
4136f0k1J4J8j6PkK4RmL0k5k7K5J8Qm6J8k0J7j8QK2J4l8j2j7J9L0k2L6qj1N9o8j1Mj3P3J5
$$ -60 -81 -67 -49 -65 -58 -60 -36 -27 -31 -1 -26 -53 -28 -10 -2 -48 -30 -50 -33 -51 -43 -21 -7 -45 -57 -74 -55 -25 -47 -11 -19 -30 29 -39 -50 -46 -59 14 29
4118B9J1J%k4L4Pm4l9l4kMJ5l4NJ2N9k3k1N8l7m2OL4rl4lN4K0k7J9K0nl7L3m4n6K6K4L3j8
$$ 29 40 41 41 17 51 58 14 -25 -59 -61 -57 -42 -76 -71 -59 0 -23 -44 14 -23 -65 -59 -25 -34 -68 -71 -17 3 -24 -5 15 10 -27 6 -38 -94 -68 -44 -11 -29
4099b9j4k3L0M3j5J4j1pLKn0J9K6J1ol0kL1r3L0L7L3J5J4o3j6L9rl2K8N2M2j4r0n1Q4N4j8
$$ -29 -43 -66 -36 7 -8 6 -5 -12 -9 -7 -57 -38 -12 -1 -7 -37 -39 -8 -101 -71 -34 -1 14 28 -35 -51 -12 -21 -53 -25 27 69 55 -35 -86 -2 52 34
4080C4m9k1lJ3K3lm8RMrk1l0j5L6J3K0K1k8K0L7q4J4O3NK8K2n0k5J0Rk8%k8qk0K6K7MjpM1
$$ 34 -15 -36 -39 -26 -3 -6 -54 -45 -41 -50 -71 -101 -116 -80 -67 -47 -26 -54 -34 3 -81 -67 -4 1 29 51 1 -24 -14 -5 -33 -33 -61 -69 -89 -63 -36 -32 -33 -40 1
4061AK0j9Pm1J5K4rm2O4J9j6n3J0J6k1kj5pOK5l7K3m2K6O9m8K4M5k2n6J3K8J6j4K1o0j4L4
$$ 1 21 2 9 -32 -17 7 -2 -44 20 39 23 -30 -20 -4 -25 -27 -42 -49 -43 -18 -55 -32 -74 -48 21 -27 -3 42 20 -36 -23 5 21 7 28 -32 -46 -12
4043a2l3pL9nm3K2l1J9J4J8k9J1N6o4n9K5Q3m0LN2nk3J0m0k4jlk6K3N3J7j2m7%K3M1o2m2L2
$$ -12 -45 -52 -13 -18 -61 -39 -70 -51 -37 -19 -48 -37 19 -45 -104 -79 4 -36 -33 19 14 -9 1 -39 -63 -64 -67 -93 -70 -17 0 -12 -59 -59 -36 5 -57 -99 -67
4024f7L3J0j0pK5l5L6O0o2n7N4qn6L2m4O5j9J6J9P6k9LK4l3k6Rnj9k0%oKMl4RM5RNL9m8m0
$$ -67 -34 -24 -34 -41 -16 -51 -15 45 -17 -74 -20 -28 -84 -52 -96 -31 -50 -34 -15 61 32 35 59 26 0 9 4 -15 -35 -35 -41 -39 -35 -69 -60 -15 -6 -1 38 -10 -50
4005e0K1Qpl2J0K8m3N0j0Pj0l4j1J2kOlO9L6o7j6K6J1qk1j8JK1J1J2nRm7nj3j8Qmn8L3Q1m6
$$ -50 -29 -21 -28 -60 -50 -22 -65 -15 -25 -18 -28 -62 -73 -61 -63 -57 -60 9 45 -22 -38 -12 -1 -9 -30 -48 -47 -26 -15 -3 -8 1 -46 -51 -64 -82 -74 -78 -136 -103 -22 -68
3985f8kQ4l3%m0j2L8k8J19K2l2J6q6Jnj6oL1ql6JO1j0J0ml6j3K1k4J4ok8L0K9j2K5m0K9k9
$$ -68 -70 14 -19 -19 -59 -71 -33 -61 58 80 48 64 -22 -21 -26 -42 -48 -17 -25 -61 -60 1 -9 1 -3 -39 -52 -31 -55 -41 -47 -75 -45 -16 -28 -3 -43 -14 -43
3966d3l4j9PlM8K5L6qjql8KK4J3PK4Ql6k4m5j9M5L7k5ML7Kj3rk2k6k9k1N6N4rPNj5j5qLrk
$$ -43 -77 -96 -89 -92 -44 -19 17 9 8 0 -38 -36 -12 1 8 32 40 4 -20 -65 -84 -39 -2 -27 -23 14 16 3 -6 -28 -54 -83 -104 -48 6 -3 4 9 -6 -21 -29 -26 -35 -37
3945c7j2J0K8Qn1k2L8qM8rj0l3LN3j5j4OOk1mknj5N9j4ol5k2P5l8pnLJ9m4M8j4M8j1lRJ7j09
$$ -37 -49 -39 -11 -3 -54 -76 -38 -46 2 -7 -17 -50 -47 6 -9 -23 -17 -11 -32 -36 -38 -43 -58 1 -13 -19 -54 -76 -1 -39 -46 -51 -48 -29 -73 -25 -39 9 -2 -5 4 21 -88
3925h8pQ5m8K1o2KQ0ql8l1K2l6qK6j4Q1M8k8K0j6k9L1kmM2j0j8Ol6Mk5kL7kj2j4n3K3M9p6
$$ -88 -95 -10 -58 -37 -99 -97 -17 -25 -63 -94 -72 -108 -116 -90 -104 -23 25 -3 17 1 -28 3 1 -3 39 29 11 17 -19 -15 -40 -42 -5 -7 -19 -33 -86 -63 -14 -90
3905i0JJ4K3l1J7J2K4N7n0j4l0N2K3l0N8Po3l9k3J4J6j4j0Nq2K0N6M4J2p8LL9J0J2MK6K2j0
$$ -90 -89 -75 -52 -83 -66 -54 -30 27 -23 -37 -67 -15 8 -22 36 43 -20 -59 -82 -68 -52 -66 -76 -71 -153 -133 -77 -33 -21 -99 -96 -57 -47 -35 -31 -5 17 7
3887Gk4qK0k6j6Lj4PNl8J7LN2%k7L2L3k1J0j2K3n1m4j3k7M0L7k8P2nk8Jl0NJ7Jj2k2j7M0j1
$$ 7 -17 -25 -5 -31 -47 -44 -58 -51 -46 -84 -67 -64 -12 -12 -39 -7 26 5 15 3 26 -25 -69 -82 -109 -69 -32 -60 12 7 -21 -20 -50 -45 -28 -27 -39 -61 -78 -38 -49
3868d9J4L6M6m4n3j9k2RN1kMLk0nj0J9J0nJ0Nm7oN6%J0J8pJ5mL7m6K2nn0L1Lj6k7nK9k2k7
$$ -49 -35 1 47 3 -50 -69 -91 -82 -31 -33 -29 -26 -46 -51 -61 -42 -32 -37 -27 -22 -69 -75 -19 -19 -9 9 2 17 13 50 4 26 21 -29 2 5 -11 -38 -43 -14 -36 -63
3848f3LNm6K2N9mL2j4j3rJ2K6m9m1QL5J2L9NJ9J1l4m1j5J8k1oJ8J3j3npM1J0k9K2k6k5J2O
$$ -63 -60 -55 -101 -79 -20 -24 8 -6 -19 -28 -16 10 -39 -80 -72 -37 -25 14 19 38 49 15 -26 -41 -23 -44 -50 -32 -19 -32 -37 -44 -3 7 -22 0 -26 -51 -39 -33
3829c3m4J9j3M0K2n4J6J7j5l0KpO2NL2j6o6RP1k2p5L2L7nJ1j0M1jn6qL3K0l7L1J1l0RM4%k5
$$ -33 -77 -58 -71 -31 -9 -63 -47 -30 -45 -75 -73 -80 -18 -13 19 3 -63 -54 17 -5 -80 -48 -11 -16 -5 -15 26 25 -31 -39 -6 14 -23 8 19 -11 -2 42 42 17
3810A7o2PM0%k5J2JL0M0mm7rk9JlJ2J1k5K9K6J9k8k0j0m8K9j5k3q%K2K7M0JKj0k1Lj6K5rr
$$ 17 -45 -38 2 2 -23 -11 -10 20 60 56 9 0 -29 -28 -31 -19 -8 -33 -4 22 41 13 -7 -17 -65 -36 -51 -74 -82 -82 -60 -33 7 8 10 0 -21 -18 -34 -9 -18 -27
3790b7O9J9k2q5N1o7K8l2NJ3j3J4J9M8J1j1l5k5%MO7m4k3Mj0PkO0l2lK7k1l2k3k1K9Q4k6M2
$$ -27 42 61 39 -46 5 -62 -34 -66 -61 -48 -61 -47 -28 20 31 20 -15 -40 -40 -36 31 -13 -36 -32 -42 -35 -37 23 -9 -12 15 -6 -38 -61 -82 -53 31 5 47
3771D7j8j9Ol6l6N4k2K8k1J7j9OO6l4l9J5K4j9%O8kk5Lj6m3QlMk8rK7kJ2P9k9K5mR5J12L42
$$ 47 29 10 16 -20 -56 -2 -24 4 -17 0 -19 -13 53 19 -20 -5 19 0 0 68 66 41 44 28 -15 -7 -10 -6 -34 -43 -16 -18 -6 73 44 69 65 160 272 614
3752F14R99K780L91k728j301m39j63q3Kj03J3J8K4j0j1RJ6n2j8J5K3J5L6m7J4m8Pj7J12l2
$$ 614 1613 4393 4784 2056 755 316 153 70 72 -31 -18 0 24 14 3 12 28 -24 -42 -27 -4 11 47 0 14 -34 -27 -44 68 36
3738C6k7M4j9lL9P6R0M0J6J3j09j24m%o6l8O4j3O8Pk6l4mn4NK1k4J7J5j6Pn7Q3J4J7kr7l9
$$ 36 9 53 34 31 70 146 236 276 292 305 196 72 68 68 2 -36 28 15 83 90 64 30 26 -28 -23 -2 -26 -9 6 -10 -3 -60 23 37 54 52 -45 -84
3719h4m7Q0nL2L3m2L5n2RK0k4pJ8L3m0j0K5qk6QK2j9m5L4Q3j4l5l2J1K6l3k8N3Mj3nJ7n0L
$$ -84 -131 -51 -56 -24 9 -33 2 -50 -41 -21 -45 -52 -34 -1 -41 -51 -26 -34 -60 -52 -30 -49 -94 -60 23 9 -26 -58 -47 -21 -54 -82 -29 -25 -38 -43 -26 -76 -73
3701g3P0ql2M4Ll0Jk8j3P2K1K5l4o3M0k7K5P0r3Q4K7m6n7L2j3rJ3KpO3k2l6Pl1J4k4RK1j7
$$ -73 -3 -11 -43 1 4 -26 -25 -53 -66 6 27 52 18 -45 -5 -32 -7 63 -30 54 81 35 -22 10 -3 -12 1 3 -4 59 37 1 8 -23 -9 -33 -24 -3 -20
3682b0j8K0j0mN0k4J6K%m1K1k1%kQ3k5j1j2m0j3j2J4L4J0K2Rk3j0l0K8j1l2J5k3M3mk9J2L3
$$ -20 -38 -18 -28 -32 18 -6 10 12 12 -29 -8 -29 -29 -31 52 27 16 4 -36 -49 -61 -47 -13 -3 19 28 5 -5 -35 -7 -18 -50 -35 -58 -15 -19 -48 -36 -3
3664cj5P%l0J7o9J8J8j1K3OL4k0K3k5k0J1L5PKk4jL0l7l7M4j0l4j2Q0p5k0Rj7M8k7j6P3J9
$$ -3 -18 -11 -11 -41 -24 -93 -75 -57 -68 -45 -39 -5 -25 -2 -27 -47 -36 -1 6 8 -16 -17 13 -24 -61 -17 -27 -61 -73 7 -68 -88 -79 -96 -48 -75 -91 -18 1
3645Aj3o5L0J4k7K1L1n1l0M7K3J1nj8j7J8JL1J5q7N6l3l0R0k9kml5J2jO0K8j15j2J6kJ2K6
$$ 1 -12 -77 -47 -33 -60 -39 -8 -59 -89 -42 -19 -8 -13 -31 -48 -30 -29 2 17 -70 -14 -47 -77 13 -16 -18 -22 -57 -45 -46 14 42 -73 -85 -69 -71 -59 -33
3627c3lJ2K5k2L1n4k2L5l1M3k0K9J7j9K1j2J2n5J0k2%N5l0K2K6k9rj9k0k5NM0M8m9m2k9K0
$$ -33 -36 -24 1 -21 10 -44 -66 -31 -62 -19 -39 -10 7 -12 9 -3 9 -46 -36 -58 -58 -3 -33 -11 15 -14 -23 -42 -62 -87 -82 -42 6 -43 -85 -114 -94
3609i4N8K8Ok8o8K5O2j6J5k7qL6qml2j2J7LLl5j2L2jMj5k1M5N1k6m2k4L3l7j7N6p3K7L5L7
$$ -94 -36 -8 -2 -30 -98 -73 -11 -27 -12 -39 -47 -11 -19 -23 -55 -67 -50 -47 -44 -79 -91 -59 -60 -56 -71 -92 -47 4 -22 -64 -88 -55 -92 -109 -53 -126 -99 -64 -27
3591b7m5M7Nj6k4L0M1LLj1J4n5K1l2lJ1k8J2LM3j6pn2L0M1k2J2l9J1L9M2mm2k6n7N%P0L5K0
$$ -27 -72 -25 -20 -36 -60 -30 11 14 17 6 20 -35 -14 -46 -49 -38 -66 -54 -51 -8 -24 -31 -83 -53 -12 -34 -22 -61 -50 -11 31 27 -15 -41 -98 -93 -93 -23 12 32
3572C2K0k3J3l6l0K4RJn3l2K0K5k2ll8M2j1L1M9L2rj1m5j0k7k2L2K0K5qoJ7j8pRmj0k8K6n
$$ 32 52 29 42 6 -24 0 9 10 -43 -75 -55 -30 -52 -55 -93 -51 -62 -31 18 50 41 30 -15 -25 -52 -74 -42 -22 3 -5 -11 6 -12 -19 -10 -14 -24 -52 -26 -31
3553c1k2L1J1m0K4k4JnK3qK4J2RJ9j2Mm4K3ro3OK7K6j8LLn0J4nO4No2LmJ9O7Jk4n8K5j4j6
$$ -31 -53 -22 -11 -51 -27 -51 -50 -55 -32 -40 -16 -4 5 24 12 16 -28 -5 -14 -77 -71 -44 -18 -36 -33 -30 -80 -66 -71 -7 -2 -64 -61 -65 -46 21 22 -2 -60 -35 -49 -65
3533f5K2J5Lm9M2k6J5L1j4mk6OJ1n2RJ4k8J6O6NL1L3nl4j8%k0JJ6m0jJ4L5M4q7j1n3L7Q7O
$$ -65 -43 -28 -25 -74 -32 -58 -43 -12 -26 -30 -56 -50 -39 -91 -82 -68 -96 -80 -14 -9 22 55 50 16 -2 -2 -22 -21 -5 -45 -46 -32 3 47 -40 -51 -104 -67 20 26
3513B6k0Qj4RL7k7j9l3K9J4l7pom3L6P2j5k7m1k9M9m3k6K6L0k0N9n3LM0QpK9pk6J5N8m7n3
$$ 26 6 14 0 9 46 19 0 -33 -4 10 -27 -34 -40 -83 -47 25 10 -17 -58 -87 -38 -81 -107 -81 -51 -71 -12 -65 -62 -22 -14 -21 8 1 -25 -10 48 1 -52
3495e2K8j9J4Lj8kJ2jk1M7n3kL8NmL9Kn5L3J4n7J3ORk0Rlj3K3M%Kj1k5OQJ3kn1L6J3L8m6j8
$$ -52 -24 -43 -29 -26 -44 -46 -34 -35 -56 -9 -62 -64 -26 -21 -25 14 16 -39 -6 8 -49 -36 -30 -21 -41 -32 -35 -48 -25 -21 -21 -19 -30 -55 -49 -41 -28 -30 -81 -45 -32 6 -40 -58
3474e8N3j8l3K4l8QMJ6PjK9m7l0L2M5m8N2J0k7MKl7J8L9j3L7J0l0K7m5k3NK8MjJ7K2o4L2j7
$$ -58 -5 -23 -56 -32 -70 -62 -58 -42 -35 -36 -7 -54 -84 -52 -7 -55 -3 7 -20 -16 -14 -51 -33 6 -7 30 40 10 37 -8 -31 -26 2 6 5 22 44 -20 12 -5
3455elLn6J6M3k8j5OM9n2o0L1K2m6L1L0j6J0l0L4L2l5Ql7OK1l3QJ6K7j1J2J8l6L9Kj7K1J6
$$ -5 -8 -5 -61 -45 -2 -30 -45 -39 10 -42 -102 -71 -49 -95 -64 -34 -50 -40 -70 -36 -4 -39 -31 -68 -62 -41 -74 -66 -50 -23 -34 -22 -4 -40 -1 1 -16 5 21
$$ [...]
-1793E2
##END=		$$ NMR SPECTRUM
##END=		$$ LINK
