##TITLE=	Apr22-2021-lemw22.10.fid
##JCAMP-DX=	6.0	$$ MestReNova 14.3.3-33362
##DATA TYPE=	LINK
##BLOCKS=	1    
##ORIGIN=	Mestrelab Research S.L.
##OWNER=	hrzepa
##$MNOVA/METADATA=	(DOCUMENT,BASE64)
eyJuYW1lIjoiRG9jdW1lbnQgMSIsInBhZ2VzIjpbeyJpdGVtcyI6WyIxIiAgICAgXX1dfQ==
##TITLE=	Apr22-2021-lemw22.10.fid
##JCAMP-DX=	6.0	$$ MestReNova 14.3.3-33362
##DATA TYPE=	NMR SPECTRUM
##DATA CLASS=	XYDATA
##BLOCK_ID=	1
##ORIGIN=	Bruker BioSpin GmbH
##OWNER=	nmr
##NUMDIM=	1
##$MNOVA/METADATA=	(ITEM,BASE64)
eyJhbmdsZSI6MCwiYXhlcyI6eyJ4Ijp7Im1heCI6MjEuMDg0NzA5OTk5OTc2MjU1LCJtaW4iOi04LjY
2NTgxMjI2MDkwNjYyOX0sInkiOnsibWF4IjoyODEzOTY2Ny43NSwibWluIjotMjU1OTc2OC42NDY3Mj
g1MTU2fX0sInBvaW50cyI6W3sieCI6NTMyMSwieSI6NTgzNX0seyJ4Ijo4NzIyLCJ5Ijo1ODM1fSx7I
ngiOjg3MjIsInkiOjgyMDh9LHsieCI6NTMyMSwieSI6ODIwOH0seyJ4Ijo1MzIxLCJ5Ijo1ODM1fV0s
InoiOjB9
##.OBSERVE FREQUENCY=	400.15247108400001252
##.OBSERVE NUCLEUS=	^1H
##.SOLVENT NAME=	CDCl3
##.PULSE SEQUENCE=	zg30
##LONGDATE=	2021/04/22 11:13:11.000
##.ACQUISITIONMODE=	SIMULTANEOUS (DQD)
##$ORIGINAL FORMAT=	Bruker XWIN-NMR
##$MNOVA/SCALES_VERSION=	9
##$PARAMETER FILE=	(acqus, ASCII, /private/var/folders/bp/m_4195y96sx1d256lqvkcvym0000gq/T/oc98ygkRTLmvnHFY0drrhA/1H/acqus, 0)
$$ ##TITLE= Parameter file, TopSpin 4.1.1
$$ ##JCAMPDX= 5.0
$$ ##DATATYPE= Parameter Values
$$ ##NPOINTS= 8	$$ modification sequence number
$$ ##ORIGIN= Bruker BioSpin GmbH
$$ ##OWNER= nmr
$$ $$ 2021-04-22 11:13:07.787 +0100  nmr@chpc-nmr400a
$$ $$ D:/data/lemw22/nmr/Apr22-2021-lemw22/10/acqus
$$ $$ process C:\Bruker\TopSpin4.1.1\prog\mod\xwish3.exe
$$ ##$ACQT0= -1.70581753891579
$$ ##$AMP= (0..31)
$$ 100 100 100 100 100 100 100 100 100 100 100 100 100 100 100 100 100 100
$$ 100 100 100 100 100 100 100 100 100 100 100 100 100 100
$$ ##$AMPCOIL= (0..32)
$$ -1 0 0 0 0 0 0 0 0 0 0 0 0 0 0 0 0 0 0 0 0 0 0 0 0 0 0 0 0 0 0 0 0
$$ ##$AQSEQ= 0
$$ ##$AQ_mod= 3
$$ ##$AUNM= <au_zg>
$$ ##$AUTOPOS= <14 >
$$ ##$BF1= 400.15
$$ ##$BF2= 400.15
$$ ##$BF3= 400.15
$$ ##$BF4= 400.15
$$ ##$BF5= 400.15
$$ ##$BF6= 400.15
$$ ##$BF7= 400.15
$$ ##$BF8= 400.15
$$ ##$BWFAC= (0..63)
$$ 0 0 0 0 0 0 0 0 0 0 0 0 0 0 0 0 0 0 0 0 0 0 0 0 0 0 0 0 0 0 0 0 0 0 0 0
$$ 0 0 0 0 0 0 0 0 0 0 0 0 0 0 0 0 0 0 0 0 0 0 0 0 0 0 0 0
$$ ##$BYTORDA= 0
$$ ##$CHANFCU= (0..24)
$$ 0 0 1 0 0 0 0 0 0 0 0 0 0 0 0 0 0 0 0 0 0 0 0 0 0
$$ ##$CHANREC= (0..24)
$$ 0 0 0 0 0 0 0 0 0 0 0 0 0 0 0 0 0 0 0 0 0 0 0 0 0
$$ ##$CHEMSTR= <none>
$$ ##$CNST= (0..63)
$$ 1 1 145 1 1 1 1 1 1 1 1 1 1 1 1 1 1 1 1 1 1 1 1 1 1 1 1 1 1 1 1 1 1 1 1
$$ 1 1 1 1 1 1 1 1 1 1 1 1 1 1 1 1 1 1 1 1 1 1 1 1 1 1 1 1 1
$$ ##$CPDPRG= (0..8)
$$ <> <> <> <> <mlev> <mlev> <mlev> <mlev> <mlev>
$$ ##$D= (0..63)
$$ 0 0.1 0 0 0 0 0 0 0 0.06 0 0 0 0 0 0 0.0002 0 0 0 0 0 0 0 0 0 0 0 0 0 0
$$ 0 0 0 0 0 0 0 0 0 0 0 0 0 0 0 0 0 0 0 0 0 0 0 0 0 0 0 0 0 0 0 0 0
$$ ##$DATE= 1619086391
$$ ##$DATE_START= 1619086298
$$ ##$DE= 8.794183
$$ ##$DECBNUC= <off>
$$ ##$DECIM= 1680
$$ ##$DECNUC= <off>
$$ ##$DECSTAT= 4
$$ ##$DIGMOD= 3
$$ ##$DIGTYP= 17
$$ ##$DR= 32
$$ ##$DS= 0
$$ [...]
$$ 1 1 1 1 0 0 0 0 0 0 0 0 0 0 0 0 0 0 0 0 0 0 0 0 0 0 0 0
$$ ##$ShimPowRng3= (0..63)
$$ 1 1 1 1 1 1 1 1 1 1 1 1 1 1 1 1 1 1 1 1 1 1 1 1 1 1 1 1 1 1 1 1 1 1 1 1
$$ 1 1 1 1 0 0 0 0 0 0 0 0 0 0 0 0 0 0 0 0 0 0 0 0 0 0 0 0
$$ ##$ShimPowType1= 8
$$ ##$ShimPowType2= 8
$$ ##$ShimPowType3= 0
$$ ##$ShimPowType4= 0
$$ ##$ShimPowType5= 0
$$ ##$ShimPowType6= 0
$$ ##$ShimPowType7= 0
$$ ##$ShimPowType8= 0
$$ ##$ShimSysActGrad= (0..63)
$$ 1 2 3 4 13 5 7 11 10 9 6 8 12 18 19 20 21 15 22 23 24 14 25 16 26 17 27
$$ 28 31 32 33 34 35 36 37 38 0 0 0 0 0 0 0 0 0 0 0 0 0 0 0 0 0 0 0 0 0 0
$$ 0 0 0 0 0 0
$$ ##$ShimSysAngle= <>
$$ ##$ShimSysFunc= (0..63)
$$ 1 2 3 4 5 6 7 8 9 10 0 37 38 35 16 15 14 13 12 11 28 27 26 25 24 23 36
$$ 22 30 29 20 21 34 33 32 31 17 18 19 0 0 0 0 0 0 0 0 0 0 0 0 0 0 0 0 0 0
$$ 0 0 0 0 0 0 0
$$ ##$ShimSysMatId= <292722aa.dat>
$$ ##$ShimSysMatrix= 1
$$ ##$ShimSysMinMaxUG= 130000
$$ ##$ShimSysOffset= <37mm>
$$ ##$ShimSysType= 4
$$ ##$ShimUnit= 3
$$ ##$SpectrOsVersion= <4.1.148.20201202>
$$ ##$TCubeEth= <192.168.180.22>
$$ ##$TCubeSeqDevice= <>
$$ ##$TOSITY= <no>
$$ ##$TRIPLO2= 0
$$ ##$TopSpinVersion= <TopSpin 4.1.1>
$$ ##$TrxFreqFormula= (0..23)
$$ <TrxFreqFormula(2.0,400150000.000000,'TRX',Trx(1.0,'TRX 1200.1',2,5.000000,1290.000000))>
$$ <TrxFreqFormula(2.0,400150000.000000,'TRX',Trx(1.0,'TRX 1200.2',2,5.000000,1290.000000))>
$$ <> <> <> <> <> <> <> <> <> <> <> <> <> <> <> <> <> <> <> <> <> <>
$$ ##$TrxPN= (0..23)
$$ <Z148391> <Z148391> <> <> <> <> <> <> <> <> <> <> <> <> <> <> <> <> <>
$$ <> <> <> <> <>
$$ ##$TrxSN= (0..23)
$$ <02953> <02954> <> <> <> <> <> <> <> <> <> <> <> <> <> <> <> <> <> <> <>
$$ <> <> <>
$$ ##$VCubeEth= (0..23)
$$ <no> <no> <no> <no> <no> <no> <no> <no> <no> <no> <no> <no> <no> <no> <no>
$$ <no> <no> <no> <no> <no> <no> <no> <no> <no>
$$ ##$VTU= 2
$$ ##$VTUETH= <192.168.99.11>
$$ ##$VTUTY= <no>
$$ ##$ValueLine= no
$$ ##$VpuPN= (0..23)
$$ <no> <no> <no> <no> <no> <no> <no> <no> <no> <no> <no> <no> <no> <no> <no>
$$ <no> <no> <no> <no> <no> <no> <no> <no> <no>
$$ ##$VpuSN= (0..23)
$$ <no> <no> <no> <no> <no> <no> <no> <no> <no> <no> <no> <no> <no> <no> <no>
$$ <no> <no> <no> <no> <no> <no> <no> <no> <no>
$$ ##$WBREFAM= (0..31)
$$ 142.7 107.1 100 100 100 100 100 100 100 100 100 100 100 100 100 100 100
$$ 100 100 100 100 100 100 100 100 100 100 100 100 100 100 100
$$ ##$WBREFLM= (0..31)
$$ 0 0 0 0 0 0 0 0 0 0 0 0 0 0 0 0 0 0 0 0 0 0 0 0 0 0 0 0 0 0 0 0
$$ ##$WBREFPH= (0..31)
$$ 72.61 -67.16 0 0 0 0 0 0 0 0 0 0 0 0 0 0 0 0 0 0 0 0 0 0 0 0 0 0 0 0 0
$$ 0
$$ ##$WBSGU= (0..31)
$$ 2 0 1 0 0 0 0 0 0 0 0 0 0 0 0 0 0 0 0 0 0 0 0 0 0 0 0 0 0 0 0 0
$$ ##END=
$$ 
##$DECIM=	1680
##$DSPFVS=	21
##XUNITS=	HZ
##YUNITS=	ARBITRARY UNITS
##FIRSTX=	8437.0464201291888457
##LASTX=	-3467.6246585073376991
##DELTAX=	-0.090826125372023752691
##XFACTOR=	1
##YFACTOR=	780.70973845637377053
##FIRSTY=	1600.421875
##MINY=	-1616.896728515625
##MAXY=	25581516
##NPOINTS=	131072
##XYDATA=	(X++(Y..Y))
$$ [...]
3291 1 2 1 1 1 0 0 1 0 0 1 0 0 0 -1 0 0 1 1 1 1 3 1 1 2 1 1 1 0 1 1 1 2 2 2 1 0 0 1 1 1 1 1 1 2 0 0 1 2 2 3 3 2 3 3 4 5 5 5 6 5 4 4 5 7 8 7 7 5 5 5 5
3285 5 4 6 7 6 7 7 7 7 7 6 9 10 11 11 13 15 15 15 14 14 14 16 17 16 16 16 19 20 21 23 24 24 26 28 30 30 30 31 33 34 36 37 38 40 41 42 44 46 47 49 52 56 59 62 68 73 79 86 94 105 120 141 167 198 238
3279 238 289 349 420 503 597 707 827 963 1115 1273 1424 1559 1670 1736 1752 1728 1667 1555 1408 1254 1108 976 860 777 727 704 706 730
3276 730 783 862 958 1072 1206 1358 1511 1653 1776 1863 1894 1873 1815 1714 1563 1384 1205 1031 867 720 598 500 419 352 299 260 232 209
3274 209 192 178 164 153 143 136 129 121 115 109 102 96 90 85 81 78 74 70 66 63 60 58 56 54 51 49 46 45 43 40 37 35 34 32 31 30 28 27 25 23 21 20 19 19 18 18 17 17 18 18 17 16 16 15 14 15 16 17 16 15 14 14 13 13
3268 13 12 12 11 12 11 11 12 12 11 11 10 10 12 12 11 10 11 11 10 11 11 11 11 9 10 9 10 9 9 9 8 9 9 9 9 8 7 8 9 9 9 9 9 9 8 9 8 8 8 8 8 8 7 7 7 7 7 8 7 9 8 8 6 7 8 7 8 7 9 10
3261 10 9 8 6 6 7 7 7 7 6 5 6 6 8 7 7 8 8 8 7 6 6 6 6 7 7 6 6 7 7 7 6 7 6 6 5 5 5 6 7 6 5 5 5 6 6 6 6 6 6 5 5 5 5 6 6 6 6 5 5 6 6 5 5 6 7 6 7 7 5 5
3255 5 5 6 5 5 4 4 3 3 4 5 6 7 5 5 5 5 4 3 4 6 6 7 5 5 7 5 6 6 6 6 5 7 8 7 6 5 6 6 6 5 5 5 5 6 7 5 5 6 8 8 6 6 6 6 7 6 4 5 5 4 4 4 3 2 4 5 4 5 5 5 4
3249 4 4 5 5 4 5 4 5 5 5 6 7 6 5 5 6 6 6 7 6 8 9 11 11 10 10 10 9 9 8 8 7 6 6 6 6 6 6 6 7 7 8 9 8 9 9 10 11 11 10 10 10 9 9 8 6 6 6 7 6 5 5 5 5 6 5 5 4 4 3 3 5
3242 5 5 4 3 4 4 3 3 4 5 4 4 4 4 4 5 4 6 5 4 4 4 4 4 3 3 4 4 4 6 6 5 4 5 6 6 7 5 5 5 5 6 6 6 7 9 9 10 10 10 9 10 9 9 8 8 8 8 7 6 7 6 7 8 7 7 8 8 8 9 10 11
3236 11 12 12 12 11 10 9 9 8 7 7 5 5 5 4 5 4 5 5 5 5 3 4 4 4 3 2 3 4 5 5 5 5 5 4 4 4 3 4 5 5 5 4 3 4 4 4 4 3 4 4 4 3 3 3 3 3 3 3 3 1 3 3 3 4 4 3 3 2 2 3
3229 3 3 4 3 2 2 3 4 4 3 4 4 3 2 3 4 4 3 2 3 3 3 3 4 4 3 3 3 3 3 4 4 4 4 4 3 3 3 3 3 3 4 3 3 4 3 3 4 4 5 5 5 5 5 4 4 4 5 4 4 5 5 5 5 5 6 6 5 4 4 4 5
3223 5 4 6 7 5 5 6 5 5 4 3 2 4 4 3 3 3 3 2 2 3 2 1 1 2 1 1 1 1 2 2 1 2 4 3 2 2 2 2 4 3 3 4 4 3 3 1 2 3 3 2 2 3 3 3 4 4 5 5 2 2 3 3 3 4 5 4 4 4 4 2 3
3216 3 3 1 1 1 2 2 3 4 5 5 5 3 3 4 4 3 3 3 6 5 4 4 4 3 4 3 3 3 3 3 3 2 2 1 2 3 3 3 3 3 4 4 3 4 3 2 3 4 4 3 3 1 2 5 5 4 5 3 3 4 4 4 3 3 4 3 3 3 5 6 4
3210 4 5 6 5 5 7 7 7 8 7 8 9 10 9 10 11 13 13 13 14 15 15 14 14 14 13 14 14 14 15 16 18 18 20 20 21 22 22 24 25 26 26 25 26 29 30 33 35 37 41 46 51 58 65 75 87 104 125 151 183 223 269 316
3204 316 369 434 505 582 668 762 853 930 980 995 963 892 808 719 627 543 474 418 377 348 336 339 356 381 415 458 510 571 638 714 796 870 926 958 951 902
3201 902 823 734 642 549 464 390 327 274 228 192 167 148 134 122 113 105 99 92 88 84 79 76 75 72 69 68 66 64 62 61 60 59 57 56 55 54 52 50 51 52 53 53 54 55 56 58 61 65 71 77 83 91 101 117
3196 117 137 163 194 230 275 323 377 438 507 587 672 767 867 953 1016 1051 1042 984 900 808 711 618 539 475 423 387 365 361 373 396 428 470 522 581 649
3193 649 725 811 896 966 1014 1028 995 921 828 730 628 534 451 381 319 266 222 190 167 149 136 124 115 106 98 92 86 82 78 72 68 64 61 58 54 51 48 45 42 39 38 37 35 33 30 29
3189 29 27 27 27 25 24 24 23 23 24 24 23 23 21 20 20 21 18 17 17 16 16 15 15 15 14 14 13 13 13 12 12 11 12 12 11 11 10 10 10 10 11 12 11 11 11 12 13 13 12 13 14 16 16 16 16 17 19 20 22 23 24 24 23 22 22 20 18 16 14 13
3182 13 14 15 15 13 13 14 15 16 15 17 18 20 20 21 22 22 22 21 20 20 18 17 16 14 14 13 11 12 12 10 9 8 9 8 8 8 7 8 9 9 8 7 8 8 9 8 9 8 8 10 10 8 8 8 9 7 7 8 8 9 8 8 8 8 9 8 7 6 6 6
3176 6 6 6 8 8 8 8 6 6 8 7 7 7 7 5 6 7 4 6 6 6 5 6 7 7 6 7 6 6 7 6 8 8 6 4 6 5 5 5 5 6 5 5 5 5 6 6 5 6 6 6 5 4 5 6 5 5 7 5 4 5 5 5 5 6 6 5 5 6 5 6 7
3170 7 6 7 6 5 6 6 6 6 6 5 5 5 4 4 4 5 5 6 6 5 6 5 6 6 5 5 5 4 5 5 5 5 6 5 6 6 6 6 6 6 6 3 4 4 4 5 5 5 4 5 5 5 5 5 5 5 5 5 4 5 5 5 5 5 5 5 5 5 5 4 5
3163 5 4 5 5 5 4 4 5 5 3 4 4 4 4 4 4 4 4 4 4 4 4 4 4 4 4 5 6 6 6 4 4 4 5 4 4 6 4 4 3 5 4 4 5 6 5 5 4 4 4 2 3 3 4 4 5 4 5 5 5 4 4 4 5 4 3 3 3 3 3 5 5
3157 5 5 5 3 4 4 5 5 5 5 6 6 4 4 4 5 5 5 4 4 4 4 3 2 3 3 4 4 5 6 6 6 5 6 5 4 5 5 4 4 4 5 5 4 4 5 6 5 2 4 4 5 5 5 5 3 3 3 2 4 5 6 6 5 4 4 4 4 5 5 4 4
3150 4 5 4 4 4 4 4 4 5 5 5 6 6 5 5 5 5 4 5 4 4 4 4 4 4 5 4 5 4 5 5 5 5 6 6 7 5 5 5 6 5 4 5 4 4 3 4 4 4 4 3 3 3 4 4 4 4 5 5 5 4 3 4 4 4 4 3 4 3 3 4 4
3144 4 5 3 4 5 5 5 4 5 4 4 4 5 6 5 3 4 4 4 5 5 5 4 4 4 4 3 4 4 4 4 4 4 4 4 4 5 4 4 4 4 4 4 4 4 4 4 4 4 3 4 4 5 4 4 4 3 3 4 5 4 5 6 5 4 3 3 3 4 4 3 4
3137 4 4 4 4 5 5 4 5 4 5 5 4 4 4 4 5 4 5 4 4 4 4 3 3 3 4 4 4 4 4 4 4 5 4 3 4 4 2 3 3 4 5 5 4 3 4 4 4 4 3 4 4 4 4 3 3 4 4 5 4 3 4 5 6 6 5 5 6 4 3 3 3
3131 3 4 3 3 4 4 4 4 5 4 5 4 3 2 2 2 5 5 4 4 5 4 3 4 4 3 3 4 4 6 4 2 4 5 5 4 5 5 4 3 5 5 5 4 4 5 3 3 5 5 4 4 5 5 5 5 5 5 5 4 4 4 4 5 3 4 4 4 3 4 5 6
3125 6 6 4 3 4 4 4 4 4 4 4 4 5 4 3 3 3 3 4 4 4 5 4 4 6 6 5 4 4 4 5 5 5 5 6 6 6 7 7 7 6 8 8 9 9 10 9 8 8 7 7 6 5 6 6 5 6 6 5 8 8 8 8 9 8 8 8 9 8 8 8 6
3118 6 7 7 9 9 7 6 5 5 6 6 7 5 5 6 5 4 4 5 5 4 5 4 4 5 5 5 4 4 4 5 3 3 4 3 3 3 4 3 4 3 3 3 3 3 3 4 4 5 4 6 6 5 4 4 4 5 6 6 6 7 6 5 6 5 7 7 8 9 10 10 9
3112 9 9 7 7 8 8 8 7 7 6 5 6 6 7 7 6 8 8 8 8 8 8 9 9 9 10 9 7 7 7 6 6 6 5 5 6 4 3 4 5 6 5 5 5 6 5 4 4 4 5 5 5 5 4 2 4 4 3 3 3 4 4 4 4 3 2 2 4 3 4 4 3
3105 3 5 4 4 5 5 6 5 5 6 5 5 4 3 3 5 5 4 5 4 4 5 4 5 6 4 3 5 4 3 3 3 3 3 3 2 4 4 3 3 4 4 3 3 4 4 4 4 4 4 4 4 4 4 4 4 4 4 4 5 4 5 4 4 6 4 4 4 4 4 5 6
3099 6 5 3 3 2 3 2 3 3 4 5 5 5 5 4 4 3 4 5 4 3 3 2 2 3 4 3 3 3 3 4 4 4 4 4 4 4 4 4 5 4 4 3 3 3 3 4 4 5 3 3 1 1 3 4 5 5 4 4 4 4 3 3 4 3 5 3 2 3 3 3 5
3092 5 5 4 6 4 2 3 3 4 4 4 4 3 3 4 4 4 4 3 3 3 3 4 6 5 5 4 3 3 4 6 5 4 5 5 4 4 5 5 5 4 4 3 2 2 4 5 4 3 3 2 2 3 2 3 3 3 4 4 4 3 4 3 3 2 3 5 5 4 4 4 4
3086 4 4 4 3 2 3 3 4 4 5 5 4 4 4 4 3 4 3 2 3 4 4 4 4 5 5 3 3 4 3 3 4 4 4 4 3 3 3 4 3 3 3 3 3 5 4 4 3 4 3 2 4 4 4 4 3 4 4 3 3 3 3 2 3 3 3 4 4 3 3 4 3
3079 3 3 2 3 3 4 4 4 3 3 3 3 5 5 4 4 3 4 4 4 3 4 4 3 3 3 2 3 3 4 3 4 3 4 3 2 5 3 3 4 5 4 4 4 4 4 3 2 2 2 1 3 4 3 2 2 2 3 3 3 3 4 5 4 4 4 4 4 4 4 3 3
3073 3 4 4 4 4 4 5 5 3 3 3 4 5 5 4 4 2 3 2 3 4 4 4 3 3 3 3 3 3 3 2 2 2 2 2 2 2 2 3 2 3 5 3 2 3 4 4 4 4 4 4 4 4 4 2 2 2 2 3 3 2 4 3 3 3 3 3 2 3 3 3 1
3066 1 3 3 3 2 3 3 3 3 4 4 3 3 3 3 4 4 3 2 4 4 3 2 3 3 2 3 2 3 3 4 3 2 2 2 2 1 1 1 2 3 3 2 3 3 3 3 2 3 3 4 4 5 4 5 5 5 4 2 3 4 4 3 2 2 4 3 4 4 3 4 3
3060 3 3 3 4 4 3 2 2 2 3 5 5 4 3 3 3 3 3 3 3 4 3 4 4 4 3 2 1 2 4 4 3 2 3 4 3 2 3 2 2 3 3 2 2 2 2 2 2 3 3 2 2 3 3 3 4 4 5 3 3 2 2 2 3 4 3 2 3 3 4 3 3
3054 3 3 3 2 2 3 3 3 4 5 4 3 3 3 3 4 4 4 2 2 3 4 3 3 4 5 4 2 2 3 4 3 2 3 3 4 4 4 3 4 3 3 4 4 3 2 2 3 3 3 3 2 3 2 2 3 3 3 2 3 4 4 3 1 2 3 3 5 4 3 4 4
3047 4 4 4 4 5 5 5 3 2 4 3 3 3 3 3 2 2 5 5 4 4 3 2 3 3 4 4 4 3 3 3 4 4 4 4 4 3 3 3 4 6 6 6 6 6 4 4 4 3 2 3 4 3 4 4 4 4 4 3 2 2 3 4 4 3 3 3 4 5 3 3 3
3041 3 3 4 3 3 3 3 3 3 3 2 3 3 2 2 2 2 4 3 4 4 4 4 5 4 4 5 4 4 3 4 4 4 3 4 4 5 5 2 4 5 4 4 4 4 3 4 4 4 4 3 3 3 3 3 3 3 4 4 4 3 4 4 3 3 2 4 4 3 4 4 4
3034 4 4 4 3 3 3 3 5 4 4 5 6 7 9 9 10 10 10 12 13 14 15 15 15 14 11 10 9 8 7 6 6 4 5 6 4 4 4 4 4 5 4 3 5 5 4 5 4 4 3 3 3 3 3 3 4 3 3 3 3 4 3 4 4 4 4 4 3 2 3 3 4
3028 4 4 5 5 3 3 3 4 3 3 2 2 4 5 4 4 3 2 3 3 3 2 2 3 3 5 3 4 4 3 4 3 3 2 4 3 2 2 2 3 2 2 4 4 4 4 2 3 4 4 4 3 2 4 5 5 5 6 5 4 5 4 5 4 4 4 4 4 4 4 5 4
3021 4 4 4 2 1 1 2 2 2 3 4 4 2 2 3 3 3 4 3 3 4 4 4 3 3 3 4 4 3 4 3 3 4 4 4 4 4 4 3 3 4 3 3 2 3 3 3 2 3 3 4 5 4 4 4 3 2 2 3 4 4 3 3 4 4 3 3 4 5 4 4 4
3015 4 3 3 3 3 3 4 4 3 3 3 3 3 2 3 3 2 2 3 3 3 4 4 3 3 3 3 2 2 4 5 4 3 3 3 3 3 5 5 4 4 2 4 4 3 3 3 4 4 3 4 5 4 4 3 2 3 3 3 3 3 3 2 3 4 4 3 3 3 4 4 5
3008 5 4 3 2 4 4 3 2 3 3 3 2 2 2 3 3 2 3 2 1 2 2 4 2 2 2 3 3 3 4 4 4 5 5 4 4 4 3 2 3 4 3 3 3 3 3 4 3 4 4 4 3 3 3 3 3 2 1 2 2 3 3 4 5 4 5 4 4 4 3 3 4
3002 4 5 4 3 4 3 3 2 2 2 3 3 4 4 4 3 3 4 3 3 3 4 4 4 4 4 4 4 3 3 3 4 4 4 3 4 4 3 3 3 4 4 3 2 3 3 4 4 4 3 3 4 4 3 3 3 2 4 4 4 4 4 4 4 4 4 2 2 2 4 3 3
2996 3 3 4 4 3 3 3 4 3 1 2 4 4 3 3 4 4 3 2 1 2 3 4 4 3 2 2 3 4 3 3 3 2 1 2 3 3 2 2 3 4 4 3 3 3 4 4 3 3 4 4 5 5 5 4 4 5 5 4 5 4 4 5 5 4 4 4 3 2 4 4 4
2989 4 3 4 3 2 3 2 3 3 4 5 3 4 4 3 3 2 2 2 2 2 2 3 3 3 3 4 3 3 4 3 2 2 2 1 1 2 2 2 2 3 3 4 4 3 3 4 3 5 5 4 3 4 5 5 5 6 4 4 4 4 4 4 3 3 4 4 5 4 3 3 4
2983 4 3 2 2 2 3 2 2 3 4 4 4 4 3 3 3 4 4 3 4 4 4 3 4 3 4 4 4 4 2 1 3 3 4 4 3 3 3 2 4 4 4 4 2 3 3 3 4 3 3 2 2 3 3 3 3 2 4 4 3 2 1 0 1 2 4 3 3 4 4 4 2
2976 2 2 3 3 2 2 2 2 1 2 3 4 4 3 3 3 3 3 2 3 4 3 2 2 2 1 2 3 4 3 2 3 3 3 4 5 4 3 3 3 4 4 3 2 2 1 2 3 2 3 2 2 3 2 3 2 2 3 3 4 3 3 4 3 3 4 3 3 2 3 3 2
2970 2 2 2 3 2 2 2 2 2 1 2 2 2 2 1 2 2 3 2 3 3 2 2 2 1 2 3 2 3 3 3 2 1 0 0 2 3 3 3 3 3 3 2 2 2 1 2 2 2 3 3 3 2 2 3 3 2 2 3 3 4 3 2 3 3 2 2 3 3 3 3 3
2963 3 2 3 2 2 3 4 2 4 3 2 2 2 3 3 3 3 3 2 2 3 3 1 2 2 2 3 3 3 3 2 3 3 2 4 4 4 5 4 4 4 3 3 3 3 1 3 2 1 2 2 2 2 1 1 2 1 2 2 3 2 3 3 3 3 3 3 3 2 3 3 2
2957 2 2 3 2 3 2 1 2 2 2 4 4 4 3 3 2 2 2 2 3 2 2 3 3 5 5 3 2 4 4 4 4 5 6 7 6 7 8 9 10 10 11 11 11 11 10 11 10 10 10 9 9 8 8 6 7 7 5 5 4 3 3 4 4 4 3 2 3 3 3 2 2
2950 2 2 2 3 3 3 2 3 4 3 2 3 2 2 3 3 2 2 2 2 1 1 3 3 2 2 3 3 2 1 2 2 3 3 2 3 2 0 1 2 2 3 3 3 2 1 2 4 2 2 3 4 3 2 3 4 3 4 5 5 5 5 5 7 7 7 9 10 10 10 10 10
2944 10 9 9 8 8 9 9 8 7 6 5 5 5 4 3 4 3 3 4 3 2 2 2 1 1 2 3 3 1 2 2 2 1 2 2 3 2 1 2 1 1 1 1 1 1 2 2 2 3 3 2 2 3 2 2 2 3 2 1 0 2 3 2 1 1 2 3 3 3 2 3
2938 3 3 2 3 3 4 2 3 4 4 3 3 3 4 5 7 6 5 5 5 5 4 4 4 5 4 6 6 5 5 4 5 5 5 5 6 7 7 6 6 8 8 8 9 9 9 9 9 10 10 12 13 13 13 11 12 13 13 13 14 16 16 16 19 19 20 20 21 23 25 26 26
2931 26 28 31 35 40 47 55 65 78 94 116 145 183 233 298 379 466 559 668 796 938 1093 1272 1477 1683 1854 1973 2016 1940 1761 1553 1342 1120
2928 1120 913 746 606 483 379 298 242 207 181 161 143 130 119 109 101 93 87 82 77 72 67 64 60 57 52 49 46 44 41 38 35 33 30 29 27 25 23 20 21 19 19 17 16 17 16 14 13 12 13
2924 13 12 12 12 12 13 12 11 11 11 11 11 10 11 10 8 8 7 8 9 9 8 8 8 8 7 7 6 7 8 7 7 7 8 8 8 9 8 8 8 8 8 8 8 7 9 10 9 8 8 7 7 8 8 8 7 8 8 9 10 10 9 9 9 9 9 10 8 8 9 10
2917 10 8 7 7 7 7 6 6 6 5 5 6 6 6 6 6 6 5 5 6 6 5 4 6 6 6 5 6 7 5 5 5 4 5 5 5 5 4 5 5 5 3 4 5 5 5 5 4 4 4 4 6 6 4 4 4 5 5 4 6 7 5 4 5 4 3 4 3 4 4 4
2911 4 5 4 5 5 4 4 4 6 6 7 7 7 8 7 6 6 5 5 5 6 5 4 4 3 4 4 4 4 4 5 4 4 6 6 5 3 3 4 4 4 4 4 4 4 3 2 4 5 4 4 3 4 4 4 4 4 4 4 4 4 4 3 4 4 4 5 4 3 3 2 2
2905 2 3 4 4 4 4 4 4 4 4 5 5 5 3 4 3 4 4 4 4 4 3 3 4 4 6 5 5 5 6 5 6 6 5 5 5 5 6 5 5 6 7 6 5 5 6 6 6 4 4 4 6 5 5 6 5 3 4 5 6 7 7 6 6 6 7 8 9 11 12 12 14
2898 14 14 16 17 18 18 19 21 22 23 22 21 22 21 18 16 14 12 12 11 10 11 10 9 8 8 8 8 8 8 8 8 7 7 7 7 7 6 7 7 6 7 7 7 7 7 6 6 5 5 6 7 6 7 6 6 6 6 6 4 5 6 7 6 7 6 6 6 5 5 5
2892 5 6 5 5 7 7 7 6 5 6 7 6 7 8 8 6 7 8 8 8 9 10 9 9 11 13 13 14 16 17 19 19 19 20 20 19 19 19 19 19 17 17 16 14 12 11 11 10 9 9 8 8 9 9 8 7 8 8 6 6 6 6 7 8 7 8 7 7 6 5 4 6
2885 6 5 5 3 3 3 5 5 5 4 4 4 3 3 3 3 2 4 4 2 2 4 3 2 3 4 5 4 3 3 5 6 5 4 3 3 3 2 3 3 5 5 4 4 5 6 7 6 6 6 6 5 5 5 4 6 7 7 5 5 6 7 7 8 9 8 9 8 10 10 9 8
2879 8 8 9 10 10 9 9 11 11 9 10 11 11 10 12 12 12 12 14 12 13 14 14 15 16 16 18 20 21 23 25 25 27 28 29 30 32 34 35 34 35 36 37 38 37 39 42 42 42 45 48 51 56 64 72 84 99 115 138 167 204 248 302 365
2873 365 437 522 618 727 849 982 1124 1270 1412 1541 1646 1718 1748 1738 1688 1600 1476 1328 1174 1019 870 734 617 518 434 366 312
2871 312 268 235 209 188 170 155 142 131 122 115 108 102 97 92 88 84 81 78 75 72 70 67 62 60 59 58 56 55 53 51 50 50 50 48 48 48 49 48 48 49 50 49 49 50 49 49 50 50 49 49 49 50 51 52 51 53 56 62 67 74 83
2865 83 95 109 128 151 183 219 264 319 382 456 540 639 747 866 997 1135 1272 1403 1517 1606 1658 1669 1643 1579 1478 1349 1204 1053 905
2863 905 766 644 540 451 378 319 272 236 206 184 164 149 137 127 117 108 101 96 90 86 82 78 73 70 67 64 62 60 58 53 51 49 47 45 43 40 38 35 34 33 31 27 24 24 24 22 21 20 19 17 17
2858 17 17 17 16 17 16 15 16 16 16 16 14 14 14 13 14 13 12 12 12 14 13 12 11 10 12 13 11 12 11 11 10 11 11 10 11 11 12 12 11 11 10 11 11 11 12 10 10 9 10 11 11 10 10 9 11 11 8 9 10 10 9 8 10 10 8 8 8 9 10 10
2852 10 10 10 10 10 10 10 9 9 9 10 11 11 11 11 11 11 11 10 10 9 8 9 7 7 7 6 6 7 9 8 7 7 7 8 8 8 8 8 7 7 7 8 8 8 8 9 10 10 9 9 8 7 8 7 7 7 6 7 7 8 7 7 8 8 7 7 6 7 8 8
2845 8 8 6 6 7 8 7 8 8 8 8 8 7 6 6 7 7 8 7 7 5 5 6 6 6 7 6 6 8 8 8 6 7 7 6 6 6 7 7 8 9 9 7 7 8 7 7 7 7 7 5 4 5 6 6 6 7 7 7 6 8 7 9 8 7 7 7 7 6 6 6 6
2839 6 6 6 6 7 7 7 7 6 7 7 7 6 7 7 6 5 4 6 6 6 6 5 4 5 6 5 7 5 5 5 6 6 7 6 6 6 6 5 6 6 6 4 6 6 6 6 6 7 7 8 8 7 6 5 5 6 5 4 5 5 6 5 6 7 7 7 5 6 7 6 6
2832 6 6 4 5 3 5 7 7 7 6 6 6 6 6 5 4 4 5 5 5 4 5 4 5 4 4 5 5 5 5 6 5 5 5 5 5 6 6 7 8 6 3 4 5 4 4 5 5 5 5 4 4 4 5 6 6 7 6 5 4 5 6 6 6 5 5 5 4 4 5 6 5
2826 5 6 4 4 5 6 7 7 5 5 5 5 5 5 6 6 5 5 6 7 6 8 9 10 12 12 12 13 15 16 17 16 15 13 13 12 10 11 10 9 8 6 6 6 6 6 5 4 5 5 5 5 4 4 3 5 7 6 4 4 5 7 6 5 5 5 5 6 6 5 5 7
2819 7 6 6 6 5 5 4 4 5 4 6 4 4 5 6 6 5 6 5 5 5 5 4 5 6 5 4 5 4 4 4 4 5 6 5 5 6 5 4 4 5 5 5 5 5 5 4 4 4 4 5 5 4 3 3 3 4 5 5 5 5 5 5 5 5 5 6 6 4 3 4 4
2813 4 4 5 4 5 4 3 4 4 2 3 4 4 4 4 4 5 5 4 5 5 5 2 4 4 4 4 4 6 6 4 3 3 4 4 4 3 3 4 4 5 5 4 4 4 4 4 5 4 3 3 4 5 5 4 4 4 5 4 4 4 4 4 5 3 4 4 4 4 4 4 3
2807 3 3 4 3 3 4 5 5 5 3 4 4 3 4 5 4 4 4 5 5 4 4 4 4 5 4 3 4 4 4 4 3 4 4 5 4 5 5 5 4 3 4 4 3 5 5 5 5 4 2 2 3 3 5 5 5 5 5 5 5 5 5 4 4 4 5 4 4 5 5 4 5
2800 5 4 5 5 4 4 3 5 5 5 5 4 4 3 3 3 4 4 6 4 5 5 6 5 4 3 4 4 4 4 4 4 4 4 4 3 3 3 3 3 3 5 4 5 5 6 5 5 6 5 5 4 2 2 2 5 4 4 3 3 5 5 3 4 5 5 6 5 5 5 4 4
2794 4 4 4 3 3 4 3 3 3 4 3 3 4 3 4 4 6 6 5 5 4 5 5 5 6 6 7 6 4 5 6 7 8 9 10 11 10 11 12 13 14 14 13 13 12 12 11 10 10 9 9 9 8 7 7 7 6 5 5 5 5 3 3 3 2 4 5 5 5 5 5 4
2787 4 4 5 5 5 4 4 5 5 5 6 5 5 5 4 3 4 4 4 3 5 4 3 3 4 5 4 5 5 6 6 6 6 5 4 3 2 3 4 4 4 4 5 5 5 5 4 3 3 3 5 6 7 6 6 5 6 6 9 9 10 10 9 9 11 11 12 12 12 12 12 12
2781 12 12 11 10 8 7 8 6 6 7 5 4 4 5 5 5 4 4 5 5 5 5 5 5 5 6 5 3 4 5 5 5 4 5 5 5 3 3 5 5 4 4 5 5 5 5 4 5 5 5 4 5 4 4 4 5 5 4 5 4 4 3 3 4 3 3 4 4 5 4 3
2774 3 4 5 5 4 5 5 6 5 5 5 4 4 4 4 3 4 4 5 6 3 3 2 2 3 2 3 5 4 3 3 3 4 5 5 5 4 4 4 5 5 4 3 3 4 4 5 3 3 4 4 5 5 5 4 3 4 3 4 4 3 3 2 3 4 2 3 4 4 4 5 4
2768 4 5 5 4 4 4 3 4 4 2 3 5 5 4 4 4 3 3 4 4 5 4 3 4 3 4 5 4 4 5 4 4 3 3 4 5 5 4 4 4 3 3 3 3 2 2 3 3 3 3 3 4 3 2 3 5 5 5 4 4 5 5 4 4 3 2 3 3 3 3 3 3
2762 3 4 4 5 4 3 3 3 4 4 4 3 4 4 4 4 2 3 3 3 3 3 2 3 4 5 5 5 5 5 4 4 5 4 4 3 5 4 3 4 4 4 4 5 5 5 4 5 5 6 5 4 4 4 4 5 6 5 4 4 4 3 4 3 4 5 5 6 4 3 3 3
2755 3 4 3 5 4 4 4 5 5 4 3 4 3 2 3 3 3 3 2 3 3 4 6 5 4 3 4 5 4 3 2 4 5 4 3 2 1 3 3 3 4 3 5 4 4 4 4 4 4 4 4 5 4 4 4 4 4 4 5 4 4 4 3 4 4 4 5 3 3 4 3 4
2749 4 4 6 5 3 3 3 3 3 3 4 4 4 4 4 4 5 4 3 3 3 3 3 3 4 5 5 5 4 4 3 4 3 3 4 5 3 4 2 3 4 5 5 4 3 5 4 4 5 4 3 3 2 2 3 3 4 5 5 5 4 4 3 3 3 3 4 4 3 3 3 3
2742 3 4 4 4 3 3 3 4 4 4 3 3 5 4 2 3 5 5 4 4 4 5 5 4 4 5 5 4 5 5 4 4 5 5 5 4 4 4 3 3 3 3 4 4 2 2 3 4 4 3 4 4 4 4 3 4 4 5 4 5 5 4 4 3 4 3 3 3 3 4 5 4
2736 4 3 3 3 3 3 5 3 3 4 5 5 5 4 3 3 3 3 4 4 4 4 4 3 3 3 3 4 4 3 3 4 5 3 4 5 5 4 4 4 4 3 4 4 4 4 4 5 4 3 4 5 3 4 4 3 3 3 3 3 5 4 3 4 4 5 5 4 3 3 4 4
2729 4 5 4 3 3 4 5 5 4 4 3 4 4 3 4 5 5 5 4 4 4 4 4 4 4 3 3 3 4 3 3 3 3 4 3 3 3 3 2 3 4 6 5 3 4 3 4 5 5 5 3 3 3 3 4 4 5 4 3 3 3 2 3 2 3 4 3 4 6 6 4 4
2723 4 3 2 3 5 5 4 5 4 4 5 5 5 5 5 4 4 4 5 4 3 2 3 4 3 2 3 3 4 4 4 5 4 5 5 5 5 5 4 4 5 4 4 3 3 3 4 3 3 3 5 5 3 4 4 4 5 5 4 4 4 3 3 4 4 4 4 4 4 4 4 2
2716 2 4 4 3 3 1 1 1 3 3 3 3 4 4 3 3 4 4 5 5 4 4 4 3 3 3 3 4 4 4 4 3 3 4 4 4 4 4 4 3 3 4 3 4 4 5 5 4 4 4 4 4 4 4 5 5 4 3 4 4 3 3 4 5 3 3 4 3 4 3 3 4
2710 4 4 3 3 2 2 4 4 3 3 4 5 5 5 4 4 3 4 4 4 5 3 3 3 3 3 2 2 2 5 3 3 3 2 3 3 4 4 3 3 4 3 3 3 6 5 5 6 4 4 4 3 2 2 2 2 3 3 3 4 3 4 3 4 3 4 5 5 5 4 3 2
2703 2 3 3 3 5 4 5 5 4 4 5 4 3 4 4 3 5 4 3 3 3 3 3 4 4 4 4 3 3 4 3 3 2 2 3 3 3 4 4 5 4 4 3 3 4 3 4 3 3 2 4 4 3 3 4 5 4 4 4 4 3 3 5 5 4 5 5 4 4 3 4 4
2697 4 5 5 5 4 3 2 2 3 3 4 3 3 4 5 4 4 4 4 3 2 3 3 4 4 3 4 4 4 4 4 3 3 5 4 4 3 3 4 4 3 3 3 2 2 4 3 3 3 3 4 5 5 4 3 4 3 3 3 3 3 3 3 4 4 4 4 5 6 6 6 5
2691 5 4 3 3 5 4 4 3 4 5 5 5 4 4 3 3 3 3 4 4 3 4 3 3 3 4 4 4 5 5 5 4 3 3 4 4 5 4 4 4 3 3 4 3 3 3 4 5 5 4 4 4 3 4 4 4 4 5 5 5 4 3 3 2 3 4 4 5 5 6 6 6
2684 6 5 5 4 4 5 5 4 3 3 3 3 3 5 7 4 4 3 4 5 4 4 3 3 3 3 3 3 4 3 2 3 3 5 5 4 3 4 3 3 2 1 1 2 2 2 4 4 4 4 3 3 4 4 4 4 4 3 3 3 4 4 2 3 2 2 4 4 3 2 2 3
2678 3 5 4 4 3 3 4 3 3 2 3 3 4 3 3 2 4 5 4 4 5 4 4 3 3 4 4 4 5 5 4 3 2 3 4 5 4 4 5 4 4 4 4 4 3 4 4 4 3 4 3 5 4 4 4 3 4 4 4 3 2 2 2 3 3 3 4 4 2 3 4 4
2671 4 4 4 4 4 3 3 5 4 4 3 4 3 3 4 4 4 3 3 3 3 2 4 4 5 5 4 2 2 3 4 3 3 3 4 3 2 2 2 4 3 4 4 4 4 3 4 4 5 4 5 4 4 3 2 4 3 2 4 3 3 3 3 4 4 5 4 3 2 2 2 3
2665 3 4 4 5 5 4 4 4 3 4 3 3 4 5 4 3 4 3 4 4 5 6 5 3 3 4 4 3 4 2 2 3 3 3 3 3 3 3 3 4 2 3 3 3 2 3 3 4 3 3 3 3 3 4 3 3 4 4 3 3 4 4 3 3 2 3 4 3 4 3 4 3
2658 3 3 4 3 4 3 4 3 4 3 3 4 3 4 5 5 4 3 4 4 5 4 4 3 4 5 3 2 2 3 3 2 2 2 2 2 3 3 4 4 3 4 3 3 4 4 3 4 4 5 4 3 3 3 3 3 4 5 2 2 3 4 3 3 3 3 4 4 5 5 4 3
2652 3 4 4 4 4 4 4 3 2 4 4 4 5 4 4 4 4 3 4 4 4 4 4 3 4 6 6 4 5 4 4 4 3 2 2 3 5 4 4 4 4 2 2 3 3 4 3 3 2 3 3 2 3 4 4 4 4 4 3 3 3 2 3 4 3 3 4 5 5 4 5 4
2645 4 5 5 5 4 3 2 2 4 3 2 2 3 4 4 3 3 3 4 3 4 3 4 4 5 3 3 4 3 3 3 4 3 4 5 4 5 5 3 5 5 4 3 3 2 3 3 4 3 3 4 3 4 4 3 4 4 3 3 5 5 4 3 3 4 4 4 4 3 5 5 5
2639 5 4 4 4 5 3 4 4 3 1 2 3 4 3 3 5 6 5 4 5 4 5 3 3 4 4 3 4 4 4 4 4 5 4 4 4 4 3 4 4 3 3 4 3 2 2 2 3 3 3 3 4 4 3 1 1 2 1 2 3 2 3 3 4 3 4 4 3 4 3 4 4
2633 4 4 3 3 3 4 3 4 4 2 3 3 3 2 3 3 3 3 4 4 4 4 3 4 4 5 5 4 4 5 4 2 3 3 2 4 5 5 5 4 4 3 4 5 3 4 5 3 2 3 4 5 4 3 3 5 4 2 3 4 4 4 4 4 4 4 4 4 4 3 4 3
2626 3 3 3 3 3 4 4 5 5 4 3 3 3 3 3 3 4 3 4 4 5 4 4 5 4 5 5 3 3 4 3 2 3 1 2 3 3 3 3 3 2 3 3 4 4 4 4 4 3 2 4 4 3 3 2 2 3 4 3 1 1 3 4 6 5 3 4 4 4 3 4 4
2620 4 3 4 3 2 4 3 3 3 3 4 4 4 3 4 4 3 4 4 4 5 5 5 4 4 4 4 4 5 5 3 3 3 3 4 3 3 4 5 4 4 2 2 2 3 4 4 3 2 2 3 4 4 4 3 3 4 4 3 3 4 4 3 3 3 2 2 3 4 4 3 5
2613 5 5 4 4 4 3 3 4 3 3 3 3 2 3 3 4 3 3 3 2 2 3 3 4 3 3 4 3 2 3 4 3 3 3 4 4 4 4 4 5 4 3 3 3 3 2 4 5 5 5 4 3 3 4 4 3 3 3 3 4 3 3 2 3 4 3 4 6 6 5 3 3
2607 3 3 3 2 3 3 3 2 3 4 3 3 4 2 2 3 3 3 3 3 3 4 3 3 3 3 2 3 2 3 3 3 3 4 3 4 2 2 2 2 3 4 5 5 4 3 3 4 4 3 4 5 5 5 5 5 4 4 4 2 3 3 3 3 3 2 3 3 5 4 3 3
2600 3 3 3 2 2 3 3 3 3 4 5 4 4 2 4 3 1 4 5 4 3 4 5 4 4 4 3 4 5 5 5 4 3 2 4 6 4 4 3 3 3 3 2 2 3 2 1 2 2 2 2 4 5 4 5 3 2 2 3 4 4 3 5 5 5 3 3 3 2 3 4 5
2594 5 4 3 3 2 3 2 3 3 5 5 4 5 3 3 4 4 3 2 3 3 2 1 3 3 3 3 4 4 4 4 4 5 5 3 4 4 3 2 4 4 3 3 4 4 3 4 4 4 3 3 3 3 4 3 3 3 4 3 3 3 2 1 2 3 3 2 2 4 5 4 4
2587 4 3 3 3 2 3 4 4 4 5 4 4 4 3 4 3 3 4 3 3 2 3 3 4 4 5 4 3 4 3 4 4 4 4 4 5 6 4 5 5 4 4 4 3 3 2 4 4 5 5 4 5 3 3 4 3 3 3 3 2 2 3 2 2 4 4 3 3 4 5 5 3
2581 3 2 2 3 2 3 3 3 4 3 2 3 4 4 2 1 3 4 5 4 4 4 4 5 4 4 3 2 3 4 4 4 3 3 2 3 4 4 3 3 4 4 3 4 3 3 4 4 4 3 4 3 2 2 1 3 3 4 4 5 4 3 3 3 3 4 3 4 4 4 3 3
2574 3 2 3 2 3 3 3 3 3 3 4 3 3 3 2 4 3 4 4 4 5 5 5 3 3 3 3 3 4 3 4 3 4 4 4 4 5 3 3 3 2 3 3 4 4 5 5 4 3 4 4 4 4 4 3 3 2 2 4 4 3 3 2 2 3 2 2 2 3 4 5 3
2568 3 3 2 2 3 3 3 3 3 3 3 3 4 4 3 4 3 2 2 3 3 3 2 2 2 2 2 4 5 3 3 3 4 4 3 2 2 3 2 2 2 2 2 3 4 4 4 4 3 3 3 3 3 4 4 4 4 3 4 4 3 3 3 4 3 3 4 3 2 4 4 5
2562 5 5 4 4 3 3 3 3 2 3 3 4 4 4 4 4 4 2 2 2 2 2 3 3 4 4 4 5 4 4 3 2 4 4 4 4 4 2 3 3 4 3 3 3 5 4 3 3 4 3 4 4 3 2 2 1 2 3 3 3 2 2 3 4 4 3 4 4 3 3 3 3
2555 3 3 4 4 4 3 3 2 2 2 2 3 5 5 5 5 5 4 4 3 3 4 4 4 3 2 3 3 3 4 4 4 5 4 5 3 3 2 3 4 4 4 5 5 5 4 3 3 4 4 4 4 5 4 4 4 5 5 4 4 3 2 3 3 4 2 3 3 3 3 4 4
2549 4 3 2 1 2 2 3 4 4 4 5 3 3 4 4 3 3 2 3 4 4 2 2 2 4 4 3 5 5 4 3 4 5 5 4 4 2 3 3 3 4 3 2 3 4 3 5 5 4 3 3 3 3 5 5 4 4 4 3 3 3 3 3 4 3 2 3 4 4 3 4 4
2542 4 3 3 2 3 2 3 4 4 4 4 3 3 2 3 2 2 3 4 5 4 4 4 2 3 4 3 4 4 3 4 3 3 4 5 3 3 5 5 4 4 3 3 3 2 2 2 2 3 3 3 3 3 3 4 4 4 4 3 3 3 2 3 2 2 4 4 3 3 5 4 3
2536 3 4 3 4 3 4 4 3 4 3 3 3 4 3 2 4 4 3 3 2 3 3 3 4 3 2 4 4 3 2 2 3 3 3 4 4 4 3 2 3 3 3 2 3 3 2 3 3 5 4 4 4 4 5 3 3 4 5 4 3 4 5 5 4 4 3 3 3 4 4 4 4
2529 4 3 2 1 2 3 3 3 3 3 3 3 3 4 4 4 3 3 3 4 3 4 3 4 3 4 4 4 4 3 4 3 3 2 1 2 3 3 3 3 2 2 3 3 2 4 4 4 4 4 3 2 4 4 3 3 2 2 2 2 2 2 3 3 2 3 4 4 4 4 3 3
2523 3 3 5 5 3 4 4 3 2 2 2 3 4 3 3 3 3 4 4 4 4 3 4 4 4 3 2 3 2 2 2 3 3 3 4 4 3 4 4 3 3 2 3 3 3 4 4 2 3 3 4 4 4 4 5 4 3 3 4 3 4 3 3 4 4 4 3 2 2 3 4 3
2516 3 4 4 3 4 4 4 2 4 4 4 3 3 4 4 4 4 3 3 2 2 3 4 3 3 4 3 4 4 2 3 4 4 2 3 3 4 3 4 4 4 4 2 1 2 3 3 4 4 3 4 4 3 3 4 4 2 3 2 4 4 2 2 3 4 4 4 4 3 3 4 4
2510 4 4 4 3 3 2 3 4 5 4 3 3 4 4 3 3 4 3 3 3 3 3 3 3 4 4 3 3 3 3 3 4 4 4 3 3 4 4 4 3 3 3 3 4 4 3 2 4 3 2 3 3 2 3 4 3 2 1 3 3 3 2 2 2 3 2 3 3 3 2 2 4
2504 4 4 3 3 2 1 3 3 3 3 4 5 4 3 2 2 3 5 4 3 3 4 4 5 4 4 3 4 4 4 4 3 3 3 4 4 4 3 3 3 4 3 4 4 3 3 3 2 2 1 2 3 3 3 4 4 3 4 4 4 4 4 4 4 3 2 2 2 2 3 3 2
2497 2 3 4 4 3 3 2 3 3 2 3 4 4 4 3 3 2 3 2 2 4 3 4 3 2 2 2 2 2 1 3 4 3 3 4 4 4 4 5 4 3 3 3 4 4 4 2 2 3 3 4 3 2 2 4 3 3 3 3 3 3 3 4 3 3 4 4 2 2 4 4 3
2491 3 4 4 4 3 3 3 3 2 3 2 3 3 2 3 4 5 4 4 2 2 3 2 1 3 3 4 3 3 3 3 2 2 2 3 3 3 5 3 3 3 4 4 4 3 3 3 4 3 1 3 4 3 3 5 4 3 4 3 3 3 4 3 3 2 3 3 3 4 4 4 3
2484 3 3 2 4 4 3 4 3 3 3 3 2 3 4 3 3 4 4 3 3 3 4 5 5 3 5 4 4 4 4 3 4 3 3 3 3 3 3 4 4 4 3 4 3 2 3 4 3 4 4 4 3 3 2 1 2 3 3 3 2 4 3 3 2 3 4 3 3 5 4 3 4
2478 4 4 4 4 4 3 4 4 3 3 3 4 4 3 3 3 4 3 4 3 3 3 4 4 3 5 5 4 4 5 4 3 2 3 4 3 4 4 4 3 3 3 3 2 3 3 2 3 3 3 3 2 2 3 4 4 5 5 5 4 4 3 4 4 3 3 3 4 5 5 4 4
2471 4 4 5 5 4 3 4 3 2 3 3 3 4 3 3 3 3 3 2 3 2 3 3 3 4 3 4 4 5 3 4 3 4 4 4 4 4 4 4 4 4 3 4 3 3 4 4 4 3 3 3 4 4 4 3 3 3 4 3 3 3 1 2 3 4 3 2 2 4 5 3 3
2465 3 3 3 2 3 3 3 4 3 2 2 3 3 3 3 4 5 4 4 4 4 4 3 3 4 3 4 4 3 4 4 3 3 2 3 3 3 2 2 3 4 3 2 2 2 3 3 4 3 3 3 2 2 2 2 2 2 2 3 3 3 2 4 4 4 5 4 4 4 3 3 4
2458 4 3 4 3 4 3 3 4 3 4 4 4 4 3 3 2 3 3 3 3 3 3 3 3 4 5 5 3 3 3 3 3 4 2 3 3 4 4 3 4 4 4 4 4 4 4 4 4 3 2 3 3 2 1 3 4 4 4 3 3 3 4 4 3 4 4 3 4 3 4 4 4
2452 4 5 5 4 3 3 4 4 4 4 3 3 4 4 2 3 4 5 5 4 3 3 5 4 4 4 3 4 4 3 3 4 3 4 5 4 4 4 3 4 3 4 5 4 4 3 4 4 4 4 4 4 3 2 2 3 2 3 4 3 3 3 2 2 3 4 5 5 4 4 4 4
2446 4 4 3 4 3 3 4 3 3 3 4 4 4 4 3 3 3 3 4 4 4 4 6 5 5 4 4 5 5 5 4 4 3 1 1 3 4 4 3 3 3 3 4 4 3 4 4 3 3 3 4 3 4 4 5 4 4 3 3 5 3 3 4 4 4 4 3 4 4 3 4 3
2439 3 2 0 1 2 2 2 2 3 2 1 1 2 3 3 2 2 5 4 2 3 3 3 3 3 3 2 3 2 3 3 3 3 4 5 4 3 4 5 4 3 3 3 4 4 4 3 5 5 4 3 3 3 3 4 4 3 4 3 3 3 2 4 3 2 3 4 4 3 4 4 4
2433 4 5 3 3 3 3 4 4 2 1 2 2 2 2 3 3 3 3 3 4 4 4 4 3 2 2 3 3 2 2 2 3 3 4 4 3 3 3 3 3 4 3 2 2 3 3 4 4 3 3 3 2 2 4 4 3 2 4 5 4 5 5 4 4 4 4 4 4 3 3 3 4
2426 4 4 4 4 4 3 2 3 3 3 2 3 2 4 4 3 3 3 3 3 3 2 4 3 3 3 4 3 3 4 4 3 3 4 4 4 4 3 4 4 4 4 4 4 3 4 4 5 5 4 4 3 3 3 3 3 2 2 3 2 3 3 2 4 2 2 3 3 4 4 4 4
2420 4 3 3 3 3 3 3 2 4 5 4 4 3 3 3 3 4 3 2 3 3 3 2 2 3 3 3 3 4 2 2 3 4 3 2 2 2 3 3 3 5 4 4 5 3 4 4 3 3 4 3 4 4 4 4 3 3 2 3 2 3 3 4 3 3 3 2 3 3 3 3 3
2413 3 3 3 4 4 3 3 3 3 5 4 4 4 4 3 3 4 4 4 3 2 3 3 3 2 3 2 4 3 2 1 3 4 3 3 4 4 3 2 2 3 2 2 3 5 4 3 3 2 3 3 2 4 4 3 4 4 4 3 1 2 3 3 3 4 4 3 3 2 2 3 4
2407 4 3 2 3 4 4 3 3 4 5 3 5 3 2 2 3 4 3 2 4 5 6 4 4 3 2 2 3 4 2 3 2 2 3 4 3 3 1 1 1 1 4 4 2 4 4 3 3 3 4 4 4 4 3 3 5 4 4 3 2 2 2 4 5 5 4 2 3 4 3 3 3
2400 3 2 3 3 2 3 3 4 5 3 4 4 3 4 4 4 2 1 2 2 3 4 4 3 2 3 4 5 4 3 5 6 6 4 3 2 3 3 3 3 2 2 3 4 5 5 4 4 4 4 3 4 4 2 3 3 3 3 3 4 4 3 3 3 4 4 3 4 3 3 4 5
2394 5 3 3 3 3 3 3 3 3 2 2 2 3 3 3 3 3 5 4 3 3 3 3 2 2 3 3 3 3 4 3 3 4 4 5 3 4 3 3 2 3 4 3 2 3 3 3 4 3 3 4 4 4 3 4 3 2 2 2 2 2 3 3 2 1 2 2 2 4 3 3 2
2387 2 3 4 4 4 3 3 3 2 3 3 3 3 3 3 4 3 2 2 3 3 2 1 2 1 1 3 3 4 3 4 3 4 4 3 2 2 2 3 3 3 5 5 5 5 3 3 3 3 3 3 3 3 2 4 5 4 4 4 4 5 3 4 4 4 4 3 4 3 2 4 4
2381 4 5 4 3 2 2 3 3 2 4 4 2 2 3 3 3 4 6 5 3 2 4 4 3 2 3 3 3 4 4 3 2 3 2 2 2 3 3 3 3 3 3 4 4 4 4 3 4 4 4 4 4 3 3 3 3 3 3 2 3 5 3 3 3 3 4 4 2 3 4 3 3
2375 3 3 3 3 2 2 3 2 2 2 3 3 2 2 3 4 3 2 3 4 4 3 3 3 2 1 2 3 4 4 3 2 3 3 2 2 2 3 3 4 4 2 3 3 4 3 3 3 3 3 2 2 2 2 3 2 2 2 2 3 3 5 5 4 3 3 2 2 3 2 2 3
2368 3 4 4 4 4 4 4 4 3 2 2 2 2 3 3 4 4 3 3 3 3 3 3 4 5 5 4 3 4 4 3 3 3 2 2 2 3 4 4 5 4 3 3 3 3 3 3 3 4 5 4 3 2 3 4 3 3 2 2 3 3 3 3 3 3 3 2 1 2 4 4 4
2362 4 4 2 2 3 3 4 4 3 3 4 3 3 3 3 3 3 2 2 4 4 3 3 3 3 2 2 3 4 3 3 4 2 2 2 3 3 3 2 2 3 4 5 4 3 3 2 1 2 2 3 4 3 2 2 3 3 3 4 4 4 3 3 3 3 3 3 2 2 1 2 2
2355 2 3 3 3 2 3 3 3 3 3 3 3 3 2 3 5 4 5 3 1 3 2 2 3 4 4 3 3 2 2 2 1 2 3 3 2 2 3 2 1 2 2 4 5 4 2 3 3 4 3 3 3 3 4 4 4 3 3 3 3 2 2 3 3 3 3 3 3 3 2 3 2
2349 2 3 4 4 3 2 4 3 4 4 4 3 5 5 5 3 2 3 2 3 3 4 4 4 4 4 3 3 3 3 4 4 4 4 4 3 2 2 3 3 4 3 3 2 3 3 3 3 3 4 4 4 4 2 3 3 4 3 2 3 3 3 3 4 3 3 3 2 3 3 1 1
2342 1 3 2 2 5 6 4 4 3 3 2 2 2 3 3 2 2 2 3 3 2 3 3 3 4 3 3 2 2 2 2 1 1 2 2 2 3 3 4 4 3 2 3 3 4 4 5 5 4 4 3 3 3 3 3 3 2 2 2 3 4 4 3 3 2 3 3 4 3 3 4 3
2336 3 2 3 3 3 3 3 3 3 4 2 2 3 4 3 3 3 3 2 2 3 2 1 1 2 3 3 4 4 2 2 2 2 1 4 4 3 3 2 3 2 3 2 3 3 3 3 3 3 3 4 3 2 3 2 3 2 2 2 2 2 2 3 4 3 3 4 5 3 3 2 3
2329 3 4 3 2 3 4 2 3 3 4 2 1 2 3 3 3 2 2 2 2 3 3 4 4 1 2 4 5 5 5 5 4 2 2 2 4 4 5 4 3 4 3 3 3 4 3 3 5 4 2 3 3 3 3 4 3 3 3 5 4 3 3 3 4 3 3 4 5 5 5 4 4
2323 4 4 4 5 4 3 3 4 3 4 2 2 2 2 2 3 3 3 2 2 2 3 3 2 3 3 3 3 3 3 3 3 3 2 2 2 3 3 4 4 5 5 3 2 3 2 3 3 3 3 3 4 4 4 2 2 1 2 2 2 3 4 3 4 4 3 2 1 2 2 2 2
2317 2 2 3 3 3 3 2 3 3 3 3 3 2 4 4 5 3 3 3 4 3 2 2 3 4 3 3 3 3 3 3 2 3 3 2 3 3 2 2 3 3 3 3 3 4 3 2 3 4 4 3 3 3 4 3 3 3 3 4 3 3 3 3 3 4 3 3 4 4 3 4 3
2310 3 3 3 1 1 2 2 2 3 3 2 2 3 3 2 3 4 4 3 3 4 4 3 3 4 5 3 4 3 4 2 1 1 1 1 2 3 2 3 3 4 4 4 3 2 2 3 4 4 4 4 3 3 3 3 3 3 4 4 3 3 4 4 4 2 3 4 4 4 3 3 3
2304 3 3 4 4 4 3 3 3 3 3 2 2 2 1 2 2 1 2 3 4 3 3 2 3 3 4 3 3 3 2 1 1 3 4 3 3 2 2 2 3 2 2 3 2 3 2 1 1 2 3 5 4 3 2 3 3 3 4 4 4 3 3 3 3 3 3 3 3 4 2 3 3
2297 3 3 2 3 4 3 3 2 3 2 2 2 3 3 2 2 2 2 2 2 3 4 2 3 4 4 2 2 4 3 3 3 3 3 2 2 3 3 4 3 3 4 3 4 3 3 1 2 2 3 3 3 3 3 3 2 2 2 3 2 2 3 4 4 3 4 4 2 3 2 2 3
2291 3 2 3 3 2 3 2 3 3 3 3 3 3 4 3 2 2 3 3 3 4 3 3 3 3 3 3 3 2 2 3 2 2 3 2 2 2 3 3 3 4 4 3 3 3 2 3 3 4 5 4 3 3 3 4 5 3 2 2 3 3 3 3 4 5 4 4 4 4 4 3 3
2284 3 3 4 4 3 3 3 4 3 3 5 2 2 2 2 2 2 3 3 2 3 3 4 4 3 2 3 3 2 3 3 3 3 4 3 3 2 2 3 2 2 3 2 3 5 4 3 3 2 3 4 4 3 3 4 3 2 3 4 4 3 2 2 2 2 2 3 3 3 3 3 3
2278 3 4 5 4 4 4 4 3 3 3 4 4 3 2 3 3 3 4 4 4 3 3 1 2 3 4 4 3 3 3 2 3 3 2 2 3 2 3 2 2 2 2 2 4 4 4 3 3 3 4 4 3 2 2 2 3 3 3 4 4 3 3 4 3 3 3 4 3 1 1 2 3
2271 3 3 4 4 3 2 2 2 3 3 3 4 2 2 3 3 3 2 2 1 1 2 2 3 3 3 3 4 4 5 5 4 5 5 2 2 3 3 3 2 2 3 4 4 3 3 3 3 2 2 2 3 1 1 2 3 4 4 3 3 3 4 3 3 4 3 3 4 4 3 4 3
2265 3 3 3 3 2 2 4 5 4 4 4 3 2 3 3 3 4 3 3 3 3 3 3 3 3 3 3 2 2 2 3 2 1 3 4 3 4 4 3 2 1 0 1 2 2 3 3 4 5 4 3 3 3 3 2 2 3 3 3 3 3 3 4 3 3 3 3 3 1 1 2 3
2259 3 3 5 4 4 4 4 4 2 3 2 3 4 5 3 2 2 2 3 3 3 3 3 3 2 2 2 2 2 3 4 4 3 3 4 4 3 2 3 3 3 3 3 4 5 4 3 3 2 3 4 3 2 3 3 2 2 2 2 2 2 3 2 3 3 3 3 2 2 3 2 1
2252 1 2 3 3 2 3 3 2 3 4 4 4 3 3 2 2 2 2 2 4 4 3 4 4 3 2 3 3 2 2 2 3 3 3 3 2 2 3 4 3 2 4 4 3 4 4 2 3 4 3 2 3 3 3 3 1 1 1 3 4 3 2 3 2 3 3 2 2 2 2 2 2
2246 2 2 2 2 2 3 3 3 2 2 2 2 1 2 3 3 2 3 4 4 3 2 3 3 3 3 3 2 2 3 3 2 2 2 1 2 3 3 3 2 2 2 1 3 4 3 3 3 4 4 4 3 4 3 4 4 5 4 3 2 2 4 4 3 3 3 3 3 3 3 2 4
2239 4 4 2 2 2 1 2 2 3 4 4 5 4 4 4 3 2 3 3 2 2 3 4 2 2 4 3 3 3 2 3 3 3 2 1 2 2 2 3 3 2 2 1 2 2 3 4 3 3 4 3 3 3 2 3 4 3 3 3 3 2 2 2 2 3 4 5 4 3 4 3 2
2233 2 1 2 3 4 3 3 4 4 3 3 2 1 2 4 4 3 4 4 4 4 3 3 3 2 1 1 2 3 3 3 5 4 4 4 4 3 5 4 3 4 4 3 2 3 3 3 3 2 3 3 3 4 4 3 4 4 4 5 5 4 4 3 4 3 3 3 4 4 3 4 4
2226 4 5 4 3 5 5 6 5 4 5 4 4 4 5 6 6 6 5 6 6 8 9 10 12 14 15 17 20 22 25 26 29 31 33 35 36 37 36 34 32 29 26 23 20 17 16 14 13 12 11 10 8 8 7 8 8 7 6 6 5 6 5 4 4 4 3 3 4 4 4 3 3
2220 3 4 3 3 3 3 2 3 4 4 3 2 2 2 2 3 4 3 3 3 3 3 3 3 3 3 2 4 4 4 2 2 3 2 2 3 3 5 5 3 3 3 3 4 3 3 3 3 4 4 3 3 3 2 3 3 3 3 3 3 3 3 2 2 1 3 4 3 3 3 3 3
2213 3 2 3 3 2 2 2 1 1 2 2 3 4 2 1 1 2 3 2 2 3 2 1 2 3 2 2 3 2 2 3 3 3 3 4 5 4 3 4 4 3 2 4 5 3 3 3 2 3 4 4 3 4 2 3 4 4 5 6 6 5 5 4 3 3 4 4 2 3 4 3 3
2207 3 3 3 3 2 3 3 4 3 3 4 3 2 2 2 2 2 4 3 3 3 4 3 2 3 4 3 3 5 4 4 4 2 3 3 3 5 4 3 4 5 3 2 2 2 1 1 1 2 2 4 2 2 3 3 3 3 3 3 3 3 2 2 2 1 2 2 3 3 3 4 2
2200 2 2 3 3 3 3 3 3 2 1 1 1 1 2 2 2 1 3 3 2 2 3 3 3 3 3 4 4 4 4 3 3 3 3 2 2 2 2 2 4 4 4 3 3 3 3 3 4 4 3 2 3 3 3 3 2 2 3 4 3 3 2 2 3 4 5 4 3 4 5 6 6
2194 6 7 8 9 10 11 10 11 12 13 13 12 12 11 12 11 9 8 7 6 5 5 5 5 4 3 3 3 3 3 5 4 4 4 4 3 4 4 4 3 3 2 2 1 2 3 3 2 3 3 3 2 0 1 2 3 3 4 3 2 3 2 1 2 4 4 4 3 2 2 3 3
2188 3 3 3 2 1 2 2 3 2 3 3 4 3 3 4 4 3 2 2 2 2 3 3 3 3 2 2 2 2 2 2 2 1 1 3 3 3 2 4 4 4 3 3 4 3 2 2 2 3 2 2 1 2 2 2 2 2 3 3 3 4 3 3 4 3 3 3 3 3 2 2 4
2181 4 4 4 4 3 2 3 3 3 3 2 3 2 1 1 2 3 3 2 2 1 1 2 3 2 1 2 2 1 2 2 1 2 3 2 2 3 3 3 3 3 6 4 3 2 3 3 4 2 2 2 3 3 2 1 3 3 3 4 5 5 4 4 4 4 3 2 2 2 2 2 2
2175 2 4 3 2 2 3 2 2 3 3 3 3 4 5 3 3 3 3 3 4 4 3 2 2 3 3 3 2 2 2 2 4 4 3 3 2 3 4 4 4 4 3 3 3 3 2 2 2 3 2 1 3 3 3 3 3 1 1 2 2 2 3 3 3 4 3 3 3 4 4 4 5
2168 5 4 3 2 2 3 4 3 2 3 4 2 2 2 1 1 1 1 1 2 2 1 1 3 2 3 2 2 2 2 2 4 3 3 3 3 4 4 4 4 4 3 3 4 3 3 3 5 5 4 4 4 4 4 4 4 4 2 2 3 4 4 3 4 4 4 4 4 5 5 5 5
2162 5 5 5 5 4 4 4 4 3 3 3 2 3 4 3 3 2 2 4 3 3 2 2 3 3 2 3 2 2 0 1 2 2 2 1 2 2 2 3 3 1 1 3 4 4 3 2 3 3 4 3 3 4 4 3 3 4 2 2 2 2 3 3 4 4 5 5 4 5 6 7 7
2155 7 7 7 7 7 8 8 7 6 6 6 7 7 9 8 7 6 7 7 8 9 10 10 11 10 10 12 13 14 13 14 12 12 11 10 11 10 9 9 9 10 9 9 9 11 11 13 12 12 13 12 13 12 13 13 12 13 13 12 13 14 15 16 17 17 18 19 18 20 21 22 22
2149 22 21 21 22 23 24 23 23 23 23 23 25 26 26 25 26 26 27 28 30 32 34 35 38 39 40 42 46 49 53 55 57 58 61 63 65 67 69 72 72 75 80 84 89 95 101 109 119 130 144 157 172 188 205 224 242 262 283 305
2144 305 326 345 362 372 374 372 372 374 380 397 424 463 513 580 668 782 926 1105 1323 1583 1884 2224 2605 3032 3501 4016 4571 5153 5728 6254
2141 6254 6674 6927 6969 6787 6408 5874 5250 4597 3960 3364 2831 2367 1973 1648 1387 1182 1024 900 802 721 656 600 553 514 479 449
2139 449 423 400 379 361 344 326 310 295 280 264 250 235 222 208 194 180 167 154 141 131 120 110 102 94 88 83 78 74 71 68 65 63 62 59 57 55 53 53 50 49 47 46 45 43 43 40 38
2134 38 38 36 34 35 33 31 32 31 31 30 30 30 30 30 30 30 30 31 33 32 33 36 36 38 39 40 40 41 41 39 39 38 37 35 33 31 29 27 27 26 25 25 25 25 26 25 25 24 26 25 25 25 25 25 25 25 24 24 23 22 22 21 21 21 21 21 21 19 18 19
2128 19 18 19 18 18 18 17 16 14 14 15 16 14 13 14 15 14 13 14 15 16 15 15 15 15 17 18 19 20 20 19 21 21 21 21 21 22 21 20 18 19 18 16 16 16 15 14 14 13 12 14 14 13 14 13 13 14 15 14 13 13 13 13 14 15 14 13 14 14 13 12
2122 12 12 12 12 12 11 10 11 11 11 10 10 11 10 10 9 9 9 9 8 8 8 7 7 8 7 7 7 7 7 7 7 8 9 9 9 8 8 8 8 7 6 6 7 8 8 8 8 7 7 7 8 7 8 8 8 8 9 7 8 7 8 9 8 9 8 8 8 8 9 10
2115 10 10 10 11 11 10 10 11 11 11 13 13 12 13 13 11 10 9 9 9 9 9 8 8 9 9 8 10 7 8 9 7 8 8 7 7 7 7 8 8 8 7 7 5 6 7 7 7 6 6 6 6 7 7 7 8 7 6 6 7 8 7 5 6 6 6 7 7 7 8 7
2109 7 6 7 6 7 7 6 6 7 7 8 7 6 6 6 7 6 5 6 6 7 7 6 8 8 8 7 7 6 6 7 6 5 6 7 6 6 7 6 5 6 5 6 6 7 7 6 5 6 7 6 6 5 5 7 6 7 8 7 8 7 6 6 6 7 7 7 6 6 6 6 7
2102 7 7 6 7 7 8 8 8 8 8 9 8 7 6 6 6 6 6 6 6 5 5 6 7 6 6 7 5 6 6 5 6 6 5 6 6 6 6 7 7 8 6 6 5 5 6 6 7 6 6 6 6 6 7 7 7 5 5 5 6 6 7 7 7 6 5 4 6 6 6 6 6
2096 6 6 7 7 7 7 6 6 6 5 6 6 6 6 5 5 5 4 4 5 6 4 4 5 5 5 5 5 5 4 4 5 6 7 6 7 7 7 7 5 6 7 7 7 5 4 5 5 6 6 5 5 5 5 4 5 5 5 6 5 6 5 5 5 3 3 4 5 6 5 4 5
2089 5 6 5 5 5 5 5 4 5 5 6 6 5 5 6 6 4 3 4 4 3 3 5 6 6 5 5 3 4 5 5 7 6 5 5 6 5 4 5 5 4 5 4 5 6 5 5 5 5 5 5 6 6 4 5 5 4 4 4 4 4 5 5 5 6 6 5 5 5 6 4 4
2083 4 5 5 4 4 4 4 4 3 4 5 5 5 5 4 4 4 3 2 4 4 5 5 5 4 3 4 5 5 5 5 5 4 4 4 4 5 6 6 6 6 6 5 6 6 5 5 5 6 5 5 5 5 4 4 4 6 4 4 4 7 7 5 5 5 5 5 6 6 7 6 5
2077 5 4 4 4 4 4 3 5 4 4 4 4 4 5 6 6 5 4 5 4 5 5 6 7 6 5 5 5 4 5 4 5 5 5 5 5 5 4 3 5 5 4 5 4 2 4 4 4 4 5 5 4 4 3 4 4 3 4 4 4 4 4 4 4 4 5 5 5 4 5 6 5
2070 5 5 5 5 6 4 5 6 5 5 4 5 6 5 4 4 5 5 5 5 5 5 4 5 6 4 2 3 4 5 5 4 4 4 5 4 3 4 3 3 3 5 5 4 3 5 6 4 4 5 5 5 5 5 4 5 3 4 5 4 4 5 6 6 6 5 4 4 5 7 5 4
2064 4 4 4 5 5 5 5 5 5 6 6 6 5 7 6 5 5 5 5 3 4 4 4 4 3 3 5 5 5 4 4 5 4 4 4 4 4 4 5 3 4 3 4 4 5 6 7 6 5 6 5 6 6 5 5 6 6 7 8 6 6 6 7 8 8 10 10 10 10 11 13 14
2057 14 17 18 20 24 26 27 29 33 35 36 36 36 36 34 32 31 30 25 22 20 17 15 14 13 13 11 10 9 7 7 8 7 6 7 9 9 9 9 9 8 6 7 7 6 6 6 6 6 5 5 5 6 6 5 4 5 5 5 6 6 5 5 6 5 5 5 4 3 3 4
2051 4 4 4 4 4 6 7 7 5 5 5 6 6 4 5 5 4 5 5 4 5 5 5 5 3 2 4 5 5 6 7 6 5 5 5 6 5 5 5 5 5 6 5 6 5 4 4 4 4 3 5 5 5 5 5 4 5 4 4 4 5 5 6 5 4 4 5 5 5 4 5 4
2044 4 5 5 5 5 5 5 5 5 4 4 5 5 5 4 4 4 4 4 5 5 5 4 5 6 5 4 4 4 5 6 5 5 4 4 4 4 4 5 5 4 4 5 5 4 5 3 3 4 4 4 5 4 4 5 5 4 5 5 4 5 5 6 5 4 4 2 2 3 4 4 5
2038 5 4 4 4 5 4 5 5 4 5 4 5 5 4 4 4 4 4 4 2 3 4 4 4 4 4 4 3 4 4 5 4 4 4 4 4 5 5 5 4 4 4 4 5 4 4 5 4 3 4 4 4 6 5 4 5 5 5 3 5 5 4 5 4 3 3 3 5 4 4 4 4
2032 4 4 3 3 3 3 4 5 5 5 5 4 4 4 4 4 4 5 3 3 4 5 5 3 3 3 3 4 5 5 4 5 5 2 4 3 4 5 5 3 4 4 4 4 4 4 4 5 5 4 4 5 5 6 4 2 3 4 5 4 3 3 5 4 5 4 3 4 2 3 4 4
2025 4 3 3 4 4 4 3 3 4 4 4 4 4 4 3 3 4 4 5 4 3 2 3 3 4 5 5 6 5 4 3 4 4 4 4 4 3 3 4 4 5 5 4 4 4 5 3 4 4 6 5 4 4 6 5 4 3 4 4 3 3 4 5 4 3 3 4 5 6 5 5 5
2019 5 5 4 5 4 4 4 4 5 4 4 3 3 4 4 5 4 3 4 3 3 3 3 3 4 3 3 4 5 4 3 3 3 5 5 5 5 4 3 3 2 4 3 4 3 4 3 3 3 3 4 4 5 4 5 4 4 4 3 3 3 3 3 3 3 4 4 4 4 4 4 6
2012 6 5 5 5 4 3 4 4 4 4 4 4 4 4 4 3 3 4 4 3 3 3 3 3 4 4 4 3 3 3 3 4 5 4 2 4 2 3 3 3 5 5 5 4 3 5 5 5 4 4 3 2 3 4 4 4 4 5 5 4 3 4 4 3 4 4 3 4 4 4 4 5
2006 5 5 4 3 3 4 3 3 4 5 3 3 4 4 3 3 4 5 4 3 3 3 3 4 4 4 4 4 4 4 4 3 4 4 4 3 4 4 5 4 4 2 3 5 5 2 4 5 5 5 5 5 5 4 4 4 4 4 4 3 4 4 4 4 3 3 4 5 5 5 4 3
1999 3 3 4 5 4 3 4 5 4 4 5 6 5 6 5 4 5 5 4 3 5 4 5 5 5 4 4 4 3 4 5 4 3 4 3 3 3 3 4 4 4 4 4 4 5 4 5 4 4 3 4 4 3 4 4 4 3 3 3 2 3 3 4 4 3 3 3 4 4 3 4 3
1993 3 3 3 2 2 2 2 3 3 2 2 2 3 3 3 4 4 3 4 3 3 2 4 4 5 5 4 3 3 3 3 4 5 5 5 3 3 3 2 3 4 3 4 3 4 6 5 4 4 4 4 4 4 4 4 5 4 3 3 5 5 4 4 4 4 3 4 5 5 5 4 4
1986 4 3 4 5 4 4 4 4 4 3 2 2 4 4 5 5 5 5 4 4 4 3 4 3 3 2 2 3 3 2 3 4 3 4 3 1 2 3 3 4 3 4 4 4 5 4 5 6 7 6 4 4 4 5 4 4 4 4 4 5 4 3 4 4 4 3 2 3 4 3 4 4
1980 4 3 3 4 4 3 3 4 3 5 4 4 4 3 4 4 5 6 5 2 3 4 4 4 4 3 3 3 4 4 4 3 3 4 2 3 4 4 4 4 4 4 5 3 2 3 4 4 4 3 3 5 6 5 4 5 5 5 5 4 4 4 5 5 5 4 2 2 3 4 4 4
1973 4 4 4 3 3 3 3 5 5 4 3 3 2 2 3 2 3 4 4 5 4 3 4 4 5 3 3 3 4 4 4 5 4 4 4 5 5 5 5 4 3 3 3 3 4 3 2 2 3 4 3 2 3 3 3 3 3 4 4 4 4 4 3 3 4 4 4 4 4 3 4 4
1967 4 4 5 5 4 4 4 3 5 5 3 4 5 5 3 4 3 3 4 4 4 4 4 4 4 3 3 4 4 4 3 3 3 3 4 3 3 3 3 2 2 3 3 2 3 3 3 2 4 4 3 2 3 4 4 5 5 5 5 5 6 6 6 7 8 8 10 11 11 11 13 14
1961 14 15 14 12 14 14 12 12 11 10 9 8 7 7 6 6 6 4 4 4 5 5 5 4 4 5 3 4 4 4 4 6 5 4 6 6 3 4 5 4 4 5 5 4 5 4 3 4 4 4 5 5 5 5 3 2 3 3 2 3 2 3 4 4 4 4 3 4 4 4 4
1954 4 3 4 4 3 3 3 3 3 4 4 3 5 6 4 3 3 3 4 4 5 4 3 2 2 3 4 4 3 4 5 4 5 5 4 3 3 3 4 4 3 3 4 4 3 3 4 4 4 4 5 5 4 3 3 2 2 4 4 6 5 4 4 5 3 3 3 3 3 2 4 4
1948 4 3 1 3 4 3 3 3 3 3 4 5 5 5 5 5 4 4 3 3 5 5 5 4 3 3 3 4 3 3 3 4 4 3 3 5 5 3 3 3 4 4 4 3 3 3 3 5 5 5 5 5 5 5 5 5 5 4 4 4 3 3 3 3 4 4 3 4 3 2 3 4
1941 4 4 3 4 2 1 2 3 2 2 3 3 3 4 4 3 4 5 4 3 3 4 4 5 4 4 5 5 5 5 4 4 4 4 3 2 3 2 4 4 4 4 5 4 3 2 2 3 3 3 5 5 5 4 3 2 4 4 3 4 4 3 2 3 4 4 3 4 3 3 3 4
1935 4 4 4 4 4 5 5 4 4 3 4 4 2 3 3 3 4 4 4 3 3 3 3 3 3 4 4 4 4 4 2 3 4 3 3 3 3 3 3 3 3 3 3 2 3 3 4 4 4 4 3 2 2 4 3 3 4 4 4 4 5 5 5 4 5 4 4 4 3 3 3 4
1928 4 4 4 4 3 3 4 4 3 3 3 4 4 4 5 4 3 3 3 4 4 5 5 4 5 4 2 3 4 3 3 2 3 3 4 4 4 4 3 2 3 3 4 3 3 4 4 5 4 4 4 4 3 3 3 4 4 3 4 3 4 4 4 4 4 4 5 4 3 3 4 4
1922 4 3 3 3 3 3 2 3 3 2 3 4 4 3 3 2 3 3 2 3 3 4 4 4 4 3 4 3 3 4 3 3 3 3 4 4 4 2 3 5 4 4 3 3 4 4 4 4 5 5 4 3 4 4 4 3 4 5 5 5 4 3 3 3 4 5 4 4 3 3 4 4
1916 4 4 4 4 4 4 4 5 5 4 4 4 2 2 3 3 3 2 2 3 3 4 3 3 4 4 4 3 3 3 4 2 2 3 2 2 2 2 3 3 3 4 5 4 4 4 4 4 4 4 3 3 3 4 4 3 2 3 3 4 4 2 2 2 3 3 3 3 3 2 2 4
1909 4 4 4 3 4 3 2 3 3 3 4 4 3 2 2 3 3 2 3 3 2 3 4 4 3 3 4 6 4 4 4 4 3 3 3 3 3 4 4 3 2 2 4 5 4 5 6 4 3 2 3 3 5 4 3 4 3 4 4 3 3 4 3 2 2 2 2 2 4 4 3 4
1903 4 4 3 4 5 4 5 4 3 4 3 4 3 2 4 3 2 3 3 3 3 3 3 3 3 3 2 3 4 4 2 1 2 2 3 4 5 6 5 4 3 3 5 4 3 3 3 4 4 3 3 2 4 3 3 4 4 4 4 3 3 4 5 4 4 4 4 3 4 5 4 5
1896 5 5 4 5 5 5 6 4 3 2 2 3 2 3 4 3 3 4 4 4 3 2 3 4 4 4 5 4 4 3 3 4 3 3 4 4 4 3 3 4 3 4 3 3 4 5 5 4 3 2 3 4 4 4 3 3 4 3 4 4 4 4 3 3 4 3 3 3 4 4 3 2
1890 2 4 3 2 2 3 4 4 3 4 3 4 4 4 3 2 3 4 4 3 3 4 4 4 5 4 3 5 6 5 4 4 3 3 3 2 3 3 2 3 3 3 3 3 4 4 3 3 4 3 3 3 3 3 2 2 3 3 4 4 4 4 2 2 2 2 2 3 3 3 3 3
1883 3 4 4 4 4 4 5 4 4 4 4 5 4 2 2 4 4 4 3 3 3 4 4 4 5 3 3 4 3 4 3 2 4 4 4 5 4 3 3 3 3 3 4 4 2 4 6 4 4 4 3 4 3 2 4 5 4 5 4 3 6 5 4 4 4 4 3 2 2 3 3 5
1877 5 4 4 4 4 4 5 4 4 3 3 3 2 3 4 5 4 3 3 4 4 4 4 3 3 3 3 4 5 4 4 4 3 3 4 4 4 4 4 4 4 4 4 4 3 3 5 4 5 5 5 4 5 4 3 3 3 4 5 5 5 5 5 5 4 3 3 3 2 3 4 2
1870 2 2 2 4 5 6 5 4 5 3 3 3 3 3 3 3 3 3 4 4 4 3 3 3 3 3 4 4 3 4 4 5 4 4 4 4 4 2 3 4 4 3 3 3 3 4 5 4 4 5 4 3 3 2 3 3 3 4 4 3 3 3 3 4 3 2 3 3 3 3 4 5
1864 5 3 3 3 4 4 3 3 3 2 3 5 5 4 3 3 4 3 2 3 3 4 4 3 3 3 5 3 3 3 2 1 2 4 3 4 4 3 2 3 4 3 3 3 3 4 3 2 3 4 4 4 4 4 4 5 4 4 4 4 4 3 3 4 3 3 3 3 2 3 3 3
1858 3 3 4 4 4 3 5 4 4 3 2 3 4 3 4 3 3 3 4 4 5 5 4 2 3 4 3 4 5 6 4 3 3 3 2 3 4 3 3 4 4 3 6 4 3 3 3 4 4 4 2 2 3 2 2 3 4 3 2 3 3 3 4 5 4 3 2 2 2 3 4 4
1851 4 4 2 3 4 3 2 3 4 4 4 3 4 5 5 4 3 4 4 4 4 3 4 4 4 4 4 4 4 4 3 3 3 3 3 4 5 4 3 4 3 1 2 3 5 5 6 4 3 4 3 3 4 5 4 3 3 3 2 3 4 3 4 3 4 4 4 3 3 4 3 4
1845 4 4 4 4 4 4 4 2 2 2 2 2 2 3 4 4 3 3 2 1 1 2 2 2 3 3 3 2 2 2 2 3 3 2 2 2 3 5 5 4 3 3 3 3 3 3 2 3 3 4 5 4 4 4 4 3 4 5 5 4 5 5 4 4 3 4 4 3 4 4 4 4
1838 4 3 2 3 4 4 5 4 3 4 3 3 4 4 4 3 2 3 4 4 5 5 4 3 4 3 4 5 3 3 4 3 3 4 2 2 3 2 3 6 5 4 4 4 4 5 4 3 4 6 4 2 3 3 3 4 4 3 3 3 2 3 4 3 3 3 4 4 3 1 2 2
1832 2 2 1 3 3 2 3 3 4 5 4 4 3 3 3 4 3 2 3 4 4 3 3 3 3 3 2 3 4 3 4 3 3 3 4 3 3 5 4 4 5 5 4 3 3 3 3 4 4 3 2 5 3 3 3 3 3 4 4 3 3 3 3 3 4 3 3 4 3 3 3 3
1825 3 3 3 4 5 4 5 4 2 2 3 2 2 2 3 3 4 4 3 3 4 4 3 4 4 4 4 4 4 3 1 2 3 3 3 3 4 4 5 5 3 4 4 4 5 5 4 5 4 3 3 4 3 4 4 4 3 3 2 1 3 2 3 3 4 4 3 4 4 4 2 3
1819 3 4 5 3 5 4 4 3 3 3 5 4 3 5 4 4 4 3 3 4 3 2 3 3 3 3 3 2 3 3 3 4 4 4 4 4 4 4 4 4 3 4 3 3 4 3 4 5 2 3 3 4 4 3 3 5 4 3 4 4 3 3 4 3 4 2 3 4 3 3 4 2
1812 2 2 3 3 3 4 4 4 4 4 4 4 5 5 4 4 4 4 4 4 4 4 4 4 3 5 5 3 1 2 3 3 2 3 2 1 3 3 4 4 3 3 3 4 4 4 4 3 4 2 2 3 3 3 3 4 4 3 4 5 4 3 3 4 3 2 2 2 3 4 3 3
1806 3 3 3 3 3 5 4 5 4 3 4 2 2 2 2 3 4 3 3 3 2 2 3 3 3 3 2 2 2 3 2 3 2 3 3 4 3 4 3 3 3 3 4 4 4 4 2 3 3 3 3 2 2 2 3 4 5 5 4 4 4 4 4 4 4 3 3 3 3 3 3 4
1799 4 3 2 2 2 2 3 3 4 3 3 4 4 4 3 3 3 3 4 3 3 4 5 5 3 4 4 3 4 4 3 2 3 4 3 3 3 3 3 5 5 4 4 4 3 3 6 5 4 3 3 3 3 4 4 4 3 4 5 4 3 2 3 4 4 3 3 3 3 4 3 3
1793 3 4 3 3 2 2 3 2 3 3 3 3 3 3 2 2 4 4 4 3 3 3 2 3 3 4 3 4 3 3 4 3 3 2 3 3 3 3 3 3 4 4 4 4 4 4 3 3 3 2 3 3 4 4 3 3 3 3 3 3 3 2 4 5 4 5 4 2 1 1 2 4
1787 4 4 4 4 3 3 4 3 3 3 3 3 3 3 3 3 4 4 5 4 4 2 2 3 3 2 3 3 3 3 4 3 3 4 4 4 4 4 3 3 3 3 2 4 4 3 3 3 4 4 5 3 2 2 4 4 4 4 5 4 4 5 3 3 3 4 4 4 3 1 1 2
1780 2 3 3 3 4 3 3 3 3 3 3 3 3 2 2 2 2 2 3 3 3 3 4 3 3 3 2 2 3 3 3 2 3 3 3 1 1 2 2 2 3 3 2 2 1 1 3 4 4 4 4 4 3 4 3 3 4 4 3 3 2 3 2 2 2 1 3 4 4 3 3 4
1774 4 3 3 4 2 2 3 3 3 4 4 4 4 3 3 3 2 3 3 5 5 4 3 3 3 3 2 3 3 3 2 3 5 5 4 3 4 5 3 4 4 5 5 4 4 3 3 4 5 5 4 4 3 4 4 3 4 5 4 3 4 3 3 2 4 5 4 4 2 2 3 3
1767 3 3 2 3 3 3 4 5 4 4 4 3 3 2 3 3 2 1 0 3 3 2 3 2 5 5 5 4 3 4 4 4 3 3 4 2 2 3 3 3 4 5 4 2 3 4 4 5 4 3 4 3 4 4 3 3 3 3 3 3 3 3 3 3 3 2 2 2 2 3 4 5
1761 5 4 3 4 3 3 4 5 4 3 4 4 3 3 4 4 3 3 4 3 5 4 4 4 3 3 2 3 4 5 4 4 2 2 3 3 3 2 2 3 3 2 3 3 3 3 3 5 5 5 5 5 4 2 4 5 5 4 4 4 4 3 2 3 3 3 3 4 4 4 4 4
1754 4 4 4 3 5 3 2 4 2 2 3 3 3 4 3 4 3 4 4 3 3 3 3 3 3 3 2 2 4 4 2 2 2 2 3 3 4 5 5 4 3 3 4 4 3 3 3 3 3 3 3 3 4 3 3 3 3 4 4 3 2 4 4 4 2 2 3 3 5 4 2 1
1748 1 2 2 2 2 3 3 3 3 3 3 4 4 3 3 3 3 4 4 5 6 5 4 4 4 3 3 2 3 3 5 3 3 4 4 4 5 5 5 3 3 1 3 3 3 3 4 3 4 3 3 2 2 3 2 2 2 3 3 4 3 2 4 5 5 4 2 3 4 4 2 2
1741 2 3 2 3 4 3 4 4 4 2 2 2 1 1 2 3 3 3 2 3 4 3 3 3 3 3 2 1 1 2 3 3 3 4 3 3 1 3 3 1 3 3 3 5 4 4 3 3 2 2 2 2 3 2 3 4 3 3 4 4 4 4 3 2 3 4 3 2 2 2 3 3
1735 3 3 3 2 2 2 3 4 3 2 2 3 3 3 3 3 3 2 2 3 3 3 3 3 3 3 2 2 3 3 3 3 3 2 3 4 3 3 2 2 3 3 3 4 4 3 3 4 3 2 2 2 4 4 3 4 3 3 3 3 2 2 2 2 1 2 3 4 4 3 3 3
1729 3 3 3 3 3 3 3 3 3 3 3 3 3 3 3 3 3 3 3 3 4 5 3 3 3 3 3 3 4 3 4 3 3 3 3 3 5 4 4 3 3 3 2 3 4 3 3 3 3 3 3 4 3 3 4 4 4 4 4 3 4 2 3 3 3 4 4 3 3 2 2 2
1722 2 3 4 3 2 2 2 2 3 3 2 1 1 1 3 3 4 4 2 4 4 4 4 2 2 3 4 4 3 3 3 3 3 3 3 3 2 2 2 1 3 3 2 3 4 4 3 3 3 4 4 3 4 4 4 3 3 3 3 2 2 3 2 4 4 2 1 2 4 4 4 4
1716 4 2 2 3 3 3 4 3 2 4 4 4 3 3 4 3 3 3 2 2 2 3 4 3 3 3 3 4 3 3 5 2 3 3 3 3 3 4 3 3 4 4 3 3 2 3 3 4 4 2 3 3 3 3 3 3 4 4 4 4 4 4 2 2 2 3 3 3 2 3 3 4
1709 4 3 4 5 4 3 4 4 5 3 3 3 3 3 3 4 2 1 3 3 5 4 3 2 3 2 3 3 3 3 3 4 3 3 3 2 2 3 3 2 3 3 2 2 3 4 3 3 2 2 3 4 3 3 5 5 3 3 3 5 4 4 5 4 4 5 4 4 3 3 3 4
1703 4 4 4 3 3 3 2 3 4 3 2 3 3 3 2 2 3 3 4 4 2 1 2 3 2 3 3 3 4 3 3 3 3 4 3 3 3 2 3 4 4 4 3 4 4 4 3 3 2 1 2 3 2 3 4 4 3 3 3 3 3 3 3 3 3 4 3 2 2 3 3 3
1696 3 4 5 3 3 3 3 3 4 3 2 3 3 2 2 3 4 4 5 3 2 2 3 4 3 4 3 2 3 2 4 3 2 3 3 3 4 3 2 2 2 3 3 4 4 3 4 4 3 4 5 4 3 4 2 3 4 4 3 3 3 2 3 2 2 3 3 3 2 4 4 3
1690 3 2 2 2 2 2 1 2 2 3 2 2 3 4 3 2 3 3 4 3 2 2 2 3 3 2 2 3 5 4 4 3 3 3 3 3 3 3 3 3 3 2 3 4 4 4 3 2 2 2 3 4 4 4 5 5 6 6 5 4 5 5 5 4 4 4 5 7 6 6 8 8
1683 8 9 9 11 12 12 12 12 12 12 11 11 11 11 10 8 7 7 5 5 5 6 5 5 4 4 3 4 4 4 4 4 4 3 3 4 3 3 2 3 4 3 4 4 4 2 2 3 3 3 2 2 2 2 3 2 2 3 3 4 4 3 4 3 5 4 5 5 4 5 7 7
1677 7 9 9 9 11 14 15 17 19 19 22 25 28 32 33 34 32 31 28 26 22 19 17 16 14 10 8 8 6 6 5 5 6 6 6 7 6 5 6 5 4 3 3 2 3 3 2 3 4 3 4 3 4 3 3 4 3 3 3 4 5 5 3 3 4 5 5 3 4 5 5 5
1671 5 4 4 4 5 5 5 6 7 9 10 11 14 14 16 17 19 23 25 27 29 31 32 32 31 29 27 24 21 18 16 14 12 10 9 8 8 7 7 6 6 5 5 5 5 5 5 5 5 4 6 6 5 4 4 4 4 4 4 5 5 4 4 4 4 5 6 6 4 3 4 3
1664 3 4 5 5 4 4 4 3 3 4 5 5 4 5 6 5 5 4 6 6 7 7 8 9 10 11 11 11 12 12 12 11 12 11 10 10 10 8 7 7 6 6 6 5 5 5 5 4 3 4 3 3 3 3 3 4 4 3 3 2 4 4 4 4 4 5 4 2 2 3 3 3
1658 3 3 3 3 4 3 3 2 3 2 2 3 3 3 3 3 5 5 4 4 4 4 3 2 3 4 4 5 5 5 4 4 3 4 5 5 4 4 4 5 4 4 3 3 4 4 6 6 5 6 6 7 7 9 10 9 10 11 14 17 21 24 26 29 34 38 42 46 53 58 59 61
1651 61 60 57 53 48 42 37 31 27 24 20 17 14 13 11 10 9 9 9 7 7 7 7 6 6 6 5 5 5 5 3 5 5 5 4 4 5 4 4 4 4 5 4 4 4 4 4 3 3 2 3 4 4 4 3 3 3 2 2 1 1 3 3 3 2 2 2 3 3 4 5
1645 5 4 4 3 2 3 3 3 3 3 4 5 6 5 3 3 2 3 3 1 2 2 3 3 4 3 3 2 2 2 2 3 4 3 4 4 3 2 2 3 2 3 2 3 3 2 1 1 2 3 3 3 5 3 3 3 3 3 2 3 4 1 1 2 3 2 3 3 4 3 4 5
1638 5 5 5 5 3 2 3 3 4 3 4 4 4 3 4 4 4 4 3 3 5 5 4 3 4 4 4 5 4 3 3 2 3 4 4 3 4 3 3 3 3 4 4 3 3 1 2 3 3 2 3 4 3 2 2 2 3 3 2 3 3 3 3 2 3 3 2 2 2 3 3 3
1632 3 3 2 3 4 3 4 3 3 3 2 2 2 2 3 2 2 3 3 2 3 3 2 2 2 3 4 4 3 2 3 3 3 4 3 2 3 2 2 2 2 2 3 2 3 3 3 3 2 2 4 4 3 3 4 3 3 2 1 2 3 3 4 3 2 3 3 2 3 4 2 2
1625 2 3 4 3 3 4 3 2 3 2 2 2 3 4 3 3 3 4 5 5 4 3 3 3 4 4 2 3 2 2 2 3 3 4 3 1 2 3 3 2 2 3 2 2 2 2 2 2 1 2 4 3 2 3 2 2 2 2 2 3 2 4 5 4 4 3 3 3 3 3 3 2
1619 2 2 2 3 3 3 2 3 2 1 1 2 2 2 2 2 2 0 0 1 2 3 2 4 3 3 3 2 2 2 1 0 1 3 1 2 2 1 2 2 2 2 2 1 2 2 2 1 3 3 3 3 3 3 3 3 2 3 2 3 2 4 4 3 3 3 3 3 3 3 2 2
1613 2 1 2 3 4 4 4 5 6 5 4 4 3 3 3 3 3 4 4 5 5 5 4 5 4 5 4 4 4 4 4 4 2 2 3 2 3 4 2 2 3 3 4 4 3 2 2 2 2 3 3 2 4 4 4 5 4 5 6 5 4 3 4 4 4 5 5 4 5 4 5 6
1606 6 5 6 5 4 3 3 5 5 4 3 3 3 3 4 4 4 4 4 4 3 3 4 3 3 3 3 3 4 4 4 5 4 4 5 5 4 5 5 5 5 4 4 4 3 4 5 5 5 5 5 5 5 6 5 5 7 6 5 5 5 5 6 6 6 7 6 5 5 5 5 6
1600 6 5 5 4 5 5 5 5 4 5 5 5 4 4 4 5 4 3 4 3 2 1 1 2 2 2 1 1 1 2 1 2 2 2 1 2 4 4 5 5 5 6 5 5 5 5 5 5 5 4 4 4 4 5 4 2 3 5 5 3 4 4 4 5 5 5 5 7 7 7 8 8
1593 8 8 9 9 8 8 9 10 9 8 9 9 8 8 8 6 5 5 5 5 6 7 5 5 5 6 7 6 6 7 7 7 6 6 8 9 9 9 9 10 10 10 13 14 15 16 15 16 17 17 16 17 17 18 17 17 17 16 17 17 18 17 18 19 19 20 20 21 23 23 23 25
1587 25 26 27 28 30 31 32 34 35 36 36 37 38 40 41 42 42 45 47 50 54 57 62 67 73 79 85 92 102 112 122 133 142 150 152 151 146 143 140 138 135 133 133 134 135 137 140 144 150 156 160 167 172 178 185 193 202 212 223 237 252 270
1581 270 292 315 345 379 421 472 534 605 692 794 919 1079 1288 1550 1878 2282 2763 3298 3881 4538 5286 6109 7000 7971 9009 9998
1579 9998 10793 11308 11441 11067 10247 9224 8127 6972 5867 4909 4076 3350 2732 2237 1865 1594 1391 1232 1104 1000 915 845
1577 845 783 731 683 635 588 545 503 465 429 396 366 340 313 289 268 248 228 211 194 178 166 155 143 132 123 115 108 101 95 91 86 82 79 76 75 73 70 67 65 63 62 59 56 55 54
1573 54 52 51 50 48 46 45 43 41 40 40 39 37 36 34 34 34 32 32 32 32 31 29 30 32 30 32 32 32 32 30 30 30 28 28 28 27 26 27 26 26 25 24 23 22 21 21 20 22 22 20 21 21 21 22 21 21 22 23 23 23 24 24 25 23 22 20 20 22 21 20
1566 20 19 20 20 20 20 20 20 19 19 18 18 18 17 15 14 14 13 13 13 13 13 12 13 13 14 14 14 15 16 16 16 17 16 15 14 14 16 16 16 15 16 16 16 16 16 15 15 14 13 14 15 13 13 13 14 13 13 13 13 14 14 15 15 15 15 16 16 15 14 14
1560 14 15 17 16 14 15 15 14 14 13 11 11 10 11 12 11 10 10 10 11 10 10 9 9 10 8 8 8 9 8 7 7 8 7 7 7 8 8 8 8 7 7 7 8 7 6 6 7 9 8 8 7 7 7 6 5 6 7 9 8 7 8 7 7 8 8 8 9 8 8 9
1554 9 9 9 9 9 10 12 11 10 9 9 8 8 9 8 7 8 9 7 8 7 7 8 7 6 7 8 8 7 7 7 8 8 8 8 8 8 8 8 6 7 6 7 8 7 8 8 7 6 6 6 7 8 8 8 6 7 6 6 5 5 6 8 7 7 7 7 7 7 6 6 7
1547 7 6 7 6 7 5 5 4 6 6 5 6 6 6 6 6 5 6 6 6 6 6 6 6 7 7 7 7 6 7 7 7 8 8 6 6 6 6 5 6 5 5 6 5 5 6 8 7 7 8 8 7 5 5 5 6 7 7 6 6 6 7 7 7 6 7 7 7 8 6 7 9
1541 9 8 8 8 7 7 6 6 8 9 8 8 7 7 7 7 7 7 6 7 8 7 6 7 6 6 6 6 6 6 4 6 7 6 7 6 5 6 6 7 7 7 6 5 6 6 6 6 5 6 5 5 5 6 7 7 8 7 7 6 6 5 5 6 6 6 6 6 5 6 5 4
1534 4 5 5 6 6 7 7 7 7 5 6 4 6 8 7 7 7 6 7 7 8 6 6 7 7 7 7 5 5 6 6 5 5 5 6 7 6 6 6 6 6 5 6 5 4 5 5 5 6 5 6 6 6 6 5 4 5 5 6 5 5 6 6 5 5 5 5 5 5 5 5 4
1528 4 4 5 5 6 5 5 5 6 6 6 7 7 7 6 5 5 4 5 4 6 5 4 5 6 5 5 4 4 4 5 4 4 6 6 7 6 6 6 6 7 5 5 4 6 5 4 4 3 4 5 5 5 5 4 4 5 5 5 6 6 5 4 4 4 4 6 6 6 6 5 5
1521 5 4 4 3 3 4 6 5 5 5 5 5 4 5 6 5 4 4 5 5 5 5 5 5 4 4 5 6 5 4 3 4 4 4 4 4 4 5 5 6 6 6 4 5 5 5 6 5 4 4 5 5 4 3 4 5 4 4 4 3 3 5 5 5 4 5 5 5 4 4 5 6
1515 6 5 5 5 4 3 4 4 6 5 5 4 5 6 5 4 4 4 4 4 5 5 6 4 5 6 5 4 5 5 5 5 5 5 4 5 5 5 5 6 5 5 6 7 5 5 6 5 5 6 6 5 5 5 5 6 5 5 4 6 6 6 6 6 6 5 5 7 7 5 6 5
1509 5 6 7 7 7 6 5 5 6 5 7 10 10 9 9 11 13 14 17 19 22 26 29 33 38 44 50 56 62 67 70 72 71 67 64 58 54 51 48 45 44 44 46 47 51 56 61 64 67 68 66 61 57 53 47 41 36 31 27 22 20 18 15 13 12 12 12 10 10 9 8 9
1502 9 8 7 6 6 7 8 7 6 6 7 7 6 7 7 5 5 5 6 6 6 6 5 5 6 5 4 4 5 4 4 5 4 4 4 5 6 6 5 4 4 4 4 5 5 5 5 5 5 4 3 4 5 5 4 3 4 5 4 3 3 4 5 5 5 5 5 5 5 4 5 5
1496 5 6 6 6 6 5 4 5 5 7 7 6 6 6 6 4 5 6 4 4 5 6 5 5 6 6 5 5 5 4 4 5 5 5 5 4 4 5 5 5 5 6 5 4 5 5 5 4 3 4 5 5 4 6 5 3 5 5 5 5 5 5 5 5 4 4 4 3 3 4 4 4
1489 4 4 4 5 4 5 4 3 5 5 6 6 5 3 3 3 4 4 4 5 4 5 4 3 2 4 4 4 2 3 5 5 5 4 5 5 4 4 5 5 3 3 3 3 3 3 4 5 3 5 4 3 4 4 4 5 4 3 4 4 4 4 5 4 4 3 3 4 5 5 4 4
1483 4 4 4 4 4 3 5 5 4 3 4 5 6 3 4 5 5 4 3 3 4 4 4 4 4 4 4 5 4 4 3 2 4 4 5 6 5 5 4 5 6 4 4 4 4 4 4 4 5 5 5 4 3 3 3 2 3 4 3 4 5 3 5 4 3 3 4 2 4 4 3 3
1476 3 3 4 4 5 4 4 4 3 3 4 5 4 5 5 4 4 3 3 2 3 4 4 4 4 4 4 4 4 4 4 3 4 4 3 4 3 1 3 2 3 2 2 2 2 3 4 3 3 3 4 5 5 4 2 2 3 3 3 4 4 5 5 5 6 6 5 5 5 4 4 3
1470 3 5 5 5 5 5 5 4 4 5 5 5 5 6 6 5 5 5 5 5 5 4 4 6 7 6 5 4 5 5 4 5 4 4 4 5 5 5 5 5 4 7 7 5 5 5 5 5 5 6 5 6 5 4 4 4 4 4 4 4 4 5 5 6 6 4 5 4 4 4 4 3
1463 3 4 5 3 2 4 5 5 5 5 6 5 4 5 5 4 5 6 4 5 5 5 5 5 5 4 4 4 3 3 3 4 5 4 3 3 3 3 5 4 5 5 5 5 5 5 4 4 5 6 7 6 5 7 6 5 6 6 5 5 5 6 7 7 6 6 5 6 5 6 5 5
1457 5 5 6 6 7 8 7 7 7 8 7 7 5 5 6 6 6 5 4 4 5 4 4 3 4 3 4 5 4 3 1 1 2 3 2 1 1 1 2 2 2 1 1 2 3 5 6 6 5 5 5 5 5 5 4 4 4 5 4 4 4 4 4 5 5 4 3 3 3 4 3 5
1451 5 5 4 4 4 6 5 7 8 9 9 8 8 9 10 9 8 8 8 7 7 5 5 5 6 6 5 4 3 4 5 5 6 6 6 6 7 7 6 6 7 7 6 6 7 8 8 9 10 10 10 12 14 14 14 13 13 14 13 14 14 13 13 12 12 13 14 15 14 13 13 13
1444 13 13 15 17 17 17 19 19 18 17 19 23 24 24 25 26 26 27 27 30 31 29 29 29 30 32 33 33 34 33 35 35 36 37 38 40 41 44 46 48 51 53 56 59 62 64 67 71 74 77 82 86 90 95 99 105 111 118 125 131 137 144 151 160 170 179 191 205
1438 205 220 236 255 276 299 324 351 384 425 476 539 619 719 847 1020 1248 1536 1902 2354 2882 3449 4073 4795 5615 6508 7484 8586
1436 8586 9756 10800 11584 12030 11968 11275 10189 9016 7785 6516 5394 4449 3634 2926 2336 1889 1576 1354 1184 1052 944
1434 944 856 783 722 670 628 589 555 525 496 469 443 421 397 370 343 317 291 266 244 222 201 183 169 156 143 133 123 116 111 104 99 95 92 88 83 78 74 71 69 67 64 62
1430 62 60 57 53 52 50 47 46 44 44 42 39 39 38 36 35 34 34 34 33 32 33 32 33 32 32 33 34 34 34 35 36 37 36 36 35 35 34 32 31 30 30 28 28 28 28 28 26 24 24 23 23 23 22 20 19 21 23 23 25 26 27 28 27 29 32 32 33 34 38 42
1423 42 44 48 53 58 64 72 79 85 93 100 104 105 101 96 87 76 68 58 50 43 38 33 31 28 26 25 25 24 25 26 26 28 29 29 29 31 30 31 31 29 27 26 24 23 24 23 22 19 19 18 17 16 17 17 16 16 17 16 16 18 18 18 19 19 20 21 23 24
1417 24 23 25 26 24 24 23 22 21 20 21 21 18 16 14 14 13 13 12 12 11 10 11 12 11 11 11 11 10 11 10 10 10 11 9 10 9 8 7 7 8 8 8 8 9 9 8 8 8 8 7 9 8 8 7 7 7 8 9 9 8 7 8 8 8 8 9 10 10 9 10
1411 10 10 11 10 9 10 11 11 10 10 10 11 10 10 9 8 8 8 9 9 10 10 9 8 9 8 8 9 9 10 8 7 7 7 9 8 8 8 8 7 8 7 8 8 8 9 8 8 7 7 8 8 8 9 9 10 10 10 8 8 7 7 7 7 7 7 7 7 8 9 8
1405 8 8 8 8 8 8 7 7 7 6 5 6 7 6 6 7 7 7 6 7 7 7 6 6 6 7 6 6 7 6 6 7 7 8 8 7 8 8 7 7 7 7 7 7 7 7 8 9 9 8 7 6 7 7 7 6 5 6 7 8 8 8 8 8 7 7 6 6 8 8 8 7
1398 7 8 9 8 8 8 7 7 8 8 7 7 7 7 9 8 8 8 8 9 7 8 9 8 9 9 8 8 6 6 6 8 8 8 7 7 7 6 6 6 6 7 6 8 7 8 8 8 7 7 8 7 8 8 10 11 12 12 12 15 16 17 18 19 22 23 24 25 23 20 19 17
1392 17 16 15 14 12 10 10 10 10 9 8 7 7 6 7 7 8 7 7 8 7 7 6 6 8 7 7 7 8 7 7 7 7 6 5 7 6 6 5 5 6 6 6 6 6 7 6 6 6 6 7 7 7 8 6 5 6 6 6 6 5 5 7 6 6 6 6 7 7 6 6
1385 6 6 6 6 5 5 7 5 5 5 5 6 7 7 7 7 6 6 6 6 5 5 5 4 5 5 5 5 6 6 4 4 4 5 5 6 6 4 4 4 3 6 7 6 7 6 6 6 5 4 5 5 6 6 5 6 5 5 4 5 5 4 5 6 5 5 5 5 5 4 5 5
1379 5 5 6 5 6 7 6 5 4 5 5 5 6 5 6 6 5 5 7 6 6 6 6 4 3 5 5 5 4 4 5 6 6 6 6 5 5 5 5 6 7 5 5 6 6 6 5 7 7 6 7 6 5 5 6 5 6 5 6 6 5 6 6 5 5 5 4 5 4 5 6 6
1372 6 6 5 4 5 5 6 6 6 5 6 6 6 5 5 5 6 6 6 7 7 6 6 6 6 5 6 6 6 6 7 6 7 8 6 5 5 6 6 4 5 5 5 5 6 6 5 5 5 5 5 5 6 6 6 6 5 5 5 5 7 6 7 8 6 5 6 4 5 6 6 6
1366 6 6 5 5 7 7 8 7 7 8 9 9 8 7 7 7 8 9 9 10 11 11 13 16 18 22 24 27 31 35 39 46 52 57 62 67 69 69 65 58 53 47 40 34 29 24 20 17 16 15 13 11 11 11 11 10 9 8 8 8 8 8 7 7 6 6 6 5 6 8 7 8
1360 8 7 6 7 6 5 6 5 5 7 6 5 6 5 4 5 7 6 5 4 5 5 4 4 6 7 6 6 7 6 6 6 7 6 6 6 4 4 5 5 5 6 6 6 5 4 3 3 4 5 5 4 5 4 5 5 5 5 4 5 4 4 4 5 6 5 4 5 5 4 5 5
1353 5 5 5 5 4 3 3 3 2 3 4 4 4 4 6 7 7 5 5 6 5 6 6 6 5 5 5 5 5 6 6 6 6 6 5 5 6 6 6 5 5 5 5 4 4 4 3 4 4 2 3 3 4 4 4 5 5 4 4 5 6 6 6 7 5 5 4 4 6 5 5 5
1347 5 5 5 5 5 7 7 8 6 6 6 7 6 6 4 5 5 4 4 4 5 5 6 6 5 5 5 5 6 5 6 6 5 5 4 4 5 5 6 7 6 6 6 5 6 6 6 5 4 4 4 3 2 3 3 4 4 5 5 4 5 5 3 2 4 4 4 4 3 3 3 4
1340 4 5 5 5 5 5 5 4 5 5 4 5 5 5 6 6 6 5 5 4 5 5 5 4 4 4 5 5 5 4 4 3 4 5 5 4 5 6 6 5 5 5 5 4 3 4 5 5 4 4 3 3 3 3 3 5 5 5 4 4 4 4 4 4 4 4 5 5 5 5 5 5
1334 5 5 5 5 6 6 5 5 5 5 5 5 4 5 6 5 5 6 5 4 5 5 5 5 4 4 4 5 5 6 5 5 4 4 4 4 5 6 5 5 6 5 4 5 5 5 4 3 3 3 4 5 4 4 5 4 5 6 5 5 5 6 5 4 4 4 4 5 5 5 5 5
1327 5 5 6 5 5 5 3 3 5 4 4 5 5 5 5 6 6 6 5 5 6 5 4 5 5 4 5 5 5 5 3 3 3 3 3 4 4 4 4 5 6 5 4 4 5 4 4 5 6 6 6 4 4 4 6 6 5 6 5 5 5 4 4 4 5 6 6 5 5 4 5 5
1321 5 4 5 5 4 3 5 5 6 5 5 4 4 5 6 5 5 5 5 7 6 5 4 5 5 4 5 6 5 5 5 6 5 6 5 5 6 5 5 6 5 4 3 3 5 5 6 6 5 4 6 6 5 5 5 4 5 4 3 3 4 4 5 5 5 5 5 4 5 5 5 4
1314 4 5 5 4 3 4 4 5 5 5 4 4 5 5 6 7 6 6 5 5 5 5 5 5 4 3 5 5 4 5 5 3 3 4 4 5 5 4 5 5 6 7 6 5 5 4 4 4 5 4 5 6 4 4 4 4 5 5 5 4 5 5 4 3 4 4 5 5 5 4 4 4
1308 4 4 3 4 4 4 4 4 5 5 5 5 5 4 4 4 4 4 3 3 4 5 4 4 4 4 3 3 4 5 5 5 5 5 5 4 4 4 4 4 3 4 4 5 4 4 3 3 3 3 4 5 5 5 5 5 4 4 4 6 5 5 5 3 4 4 5 5 4 4 5 6
1301 6 5 5 5 3 3 5 5 5 5 5 4 4 4 3 4 4 3 3 4 4 4 5 6 4 4 5 6 4 5 4 4 5 6 5 6 6 5 5 5 4 3 3 4 4 3 3 3 4 5 5 4 6 6 6 7 6 6 6 5 4 6 4 4 3 5 5 5 5 5 5 4
1295 4 4 4 4 5 6 5 6 6 5 4 5 5 4 5 5 4 5 5 3 3 4 4 5 5 4 5 4 3 3 3 4 4 4 4 3 4 4 3 3 3 5 5 5 5 3 3 4 4 4 5 4 3 3 5 4 6 5 5 5 5 5 4 5 4 5 5 5 4 3 3 4
1289 4 4 5 5 5 4 5 5 5 5 5 5 6 5 4 5 5 6 5 4 5 5 5 7 6 5 5 4 3 4 4 4 3 5 4 5 5 4 5 6 5 5 4 5 5 5 4 4 4 4 3 4 4 4 5 3 3 2 4 5 5 5 4 4 4 4 4 6 5 4 5 6
1282 6 4 5 4 5 6 5 4 5 5 5 4 3 3 4 4 2 3 3 4 5 5 5 4 4 5 4 4 4 3 4 5 4 4 3 3 4 5 5 5 5 4 3 5 5 4 4 5 5 4 5 5 5 4 3 4 4 4 3 3 3 4 5 4 5 3 3 2 4 6 5 4
1276 4 4 5 6 6 7 5 5 4 3 4 4 5 5 4 5 5 5 5 4 5 4 5 5 4 4 3 5 5 5 4 4 5 5 5 4 3 4 5 4 6 5 4 5 3 3 5 5 4 5 5 5 5 5 5 5 4 3 4 4 4 4 3 4 3 4 4 3 4 4 3 4
1269 4 4 3 4 4 6 5 3 3 4 5 4 4 4 4 4 3 3 4 5 4 4 4 5 4 3 3 3 4 4 4 4 4 5 5 5 3 4 5 5 5 5 5 4 4 4 4 4 4 5 5 4 4 5 4 4 5 4 3 5 5 4 5 5 4 5 4 5 4 5 6 5
1263 5 4 3 5 5 5 5 5 5 5 5 5 4 3 3 4 4 5 4 5 5 6 6 5 6 5 4 5 6 5 5 4 4 3 4 4 4 5 5 6 5 4 5 4 4 3 4 3 4 5 5 5 5 4 4 4 5 4 4 4 4 3 2 3 3 3 4 4 4 4 5 5
1256 5 5 5 5 6 3 3 4 2 4 4 4 4 4 4 5 5 5 4 3 2 3 4 4 4 4 4 5 4 4 4 5 5 3 3 4 4 5 5 4 3 6 5 5 5 4 4 3 3 4 3 3 3 3 3 3 4 4 4 4 4 4 3 3 3 4 4 4 4 3 2 4
1250 4 5 4 4 4 4 5 4 5 5 4 4 4 5 5 5 4 5 5 5 5 3 3 3 3 4 5 3 4 5 5 6 5 5 4 3 2 2 3 2 2 3 3 4 4 5 5 5 4 5 4 4 5 5 5 5 4 5 5 3 4 5 6 6 7 7 6 5 4 4 4 5
1243 5 5 4 3 3 3 3 3 3 4 5 4 5 5 5 6 6 6 4 2 3 4 4 3 5 5 5 5 4 4 5 3 3 4 3 4 5 2 3 3 3 4 4 4 3 3 4 4 3 4 4 4 4 5 4 3 4 5 4 4 5 4 4 4 4 5 5 6 5 4 5 4
1237 4 4 5 5 4 5 5 4 3 3 4 6 5 5 6 5 5 4 4 4 4 5 4 4 4 4 4 5 5 4 4 5 5 4 4 4 3 4 5 4 2 1 4 4 4 4 3 5 6 6 5 2 3 4 4 5 5 4 5 5 5 5 5 4 4 5 5 6 6 4 4 5
1231 5 5 4 4 4 4 4 4 4 4 5 5 6 6 4 3 3 4 4 3 4 4 4 4 4 4 4 5 4 6 6 5 4 5 3 2 3 5 4 5 5 4 4 4 4 3 3 3 4 3 3 3 4 3 4 4 4 4 4 4 4 5 5 4 4 3 3 2 2 4 4 2
1224 2 2 4 4 3 3 4 4 4 4 4 4 4 5 4 3 2 3 4 3 3 4 3 4 1 1 4 3 4 4 3 4 5 5 5 4 4 4 5 5 4 5 5 3 3 3 4 3 3 3 4 3 4 4 4 4 5 5 4 4 5 5 4 3 4 3 3 4 3 4 3 3
1218 3 4 4 3 3 4 4 5 3 5 7 6 4 4 3 3 3 3 3 4 3 4 5 4 4 4 4 3 4 5 4 5 5 4 4 4 5 5 4 4 5 5 5 5 5 3 4 4 4 4 5 4 3 4 4 4 5 4 3 4 5 4 3 3 5 4 4 3 3 3 4 4
1211 4 4 3 4 4 5 4 4 4 4 4 4 4 4 4 4 4 4 4 4 5 5 5 3 4 3 3 4 4 4 3 5 5 5 4 5 4 5 5 5 4 3 3 3 4 4 4 3 4 4 5 6 5 4 3 3 3 3 3 4 3 3 4 4 4 4 4 5 4 3 4 5
1205 5 4 3 4 4 3 3 3 3 4 4 4 5 5 5 4 5 5 3 4 5 5 4 5 5 5 5 5 4 4 5 5 4 4 4 3 3 4 4 5 5 5 4 5 5 4 3 4 5 6 5 5 5 5 4 4 4 3 3 2 4 4 4 3 3 4 4 3 3 4 4 4
1198 4 4 4 4 4 4 4 4 4 4 4 5 4 4 4 3 4 4 6 6 4 4 5 4 3 4 4 6 5 4 3 3 3 2 4 5 4 4 3 4 3 3 5 5 4 3 4 5 6 5 3 4 3 4 4 3 2 3 3 4 3 3 4 4 5 5 4 4 4 2 2 2
1192 2 3 4 4 4 3 4 5 4 4 4 3 3 4 5 4 4 5 4 3 3 3 4 4 3 3 3 3 4 4 4 5 5 4 5 4 5 6 5 4 5 5 4 4 4 4 2 3 3 3 4 3 3 3 3 4 3 2 2 3 3 3 4 4 4 4 4 5 5 4 5 5
1185 5 4 5 5 5 5 4 3 4 5 3 4 5 4 4 5 4 4 4 4 3 5 5 4 4 4 6 6 5 5 5 4 4 4 3 3 2 2 4 4 4 4 2 2 2 3 3 4 4 3 3 4 3 4 5 4 5 4 4 4 5 5 3 2 2 2 3 3 4 5 5 5
1179 5 5 5 3 4 5 5 3 3 3 4 4 3 4 4 5 5 5 4 4 4 3 3 3 5 4 4 3 5 5 4 3 3 4 4 6 6 5 4 4 3 4 4 3 3 3 3 4 5 6 6 6 7 5 4 5 5 5 4 4 5 4 4 4 4 3 3 3 4 4 4 5
1173 5 5 6 5 5 5 5 4 4 4 3 3 3 4 4 5 5 4 3 4 4 4 5 6 6 6 5 4 5 5 3 3 4 5 5 5 5 4 4 3 5 5 5 5 5 5 6 5 4 5 5 5 4 4 4 5 6 6 6 5 4 5 5 4 3 3 3 4 3 3 4 3
1166 3 3 5 4 3 4 4 3 5 5 4 5 5 5 4 5 5 6 5 4 5 4 3 3 3 5 4 3 4 3 3 4 5 6 5 4 3 2 3 3 2 3 3 3 4 4 3 3 4 4 4 5 5 4 4 4 3 4 5 3 5 5 3 4 5 5 4 3 4 3 4 3
1160 3 4 5 3 4 4 4 5 4 6 5 5 5 6 6 6 5 5 4 5 4 3 4 5 4 5 6 5 4 4 4 3 4 5 4 4 4 5 4 3 2 3 4 3 2 2 3 3 3 4 5 5 4 5 4 4 4 4 4 4 4 3 4 4 5 5 6 5 4 5 5 4
1153 4 4 3 3 4 4 4 5 3 2 2 1 2 3 4 4 3 4 4 4 2 3 3 4 3 4 5 4 4 4 3 4 5 5 2 4 5 5 5 5 4 4 5 6 5 4 5 5 4 5 5 5 6 6 5 3 3 4 4 4 3 4 4 5 5 4 5 4 4 3 4 4
1147 4 4 4 5 4 4 5 4 3 5 5 6 6 4 3 4 5 4 4 4 4 4 5 4 4 3 3 4 4 4 3 3 4 5 4 4 5 5 4 4 3 4 4 4 4 3 3 3 3 3 4 4 4 3 4 4 3 4 5 6 5 3 3 3 3 4 4 4 4 4 4 3
1140 3 2 4 3 3 4 5 4 4 5 4 4 3 3 4 4 4 3 3 3 3 4 3 4 6 5 4 4 4 4 3 3 3 4 3 3 4 4 5 3 2 3 4 5 5 4 4 4 4 5 5 3 3 4 4 4 4 3 3 3 3 3 4 3 3 4 4 5 5 4 6 6
1134 6 5 5 5 4 4 4 4 4 3 3 3 4 4 4 4 2 3 3 2 3 3 4 4 4 3 4 3 3 3 4 4 4 2 3 3 4 4 3 4 3 4 3 3 4 4 4 5 5 5 4 5 5 4 4 4 3 3 4 3 3 3 4 4 5 4 5 4 4 4 5 5
1127 5 5 4 4 4 4 2 2 2 2 3 3 4 3 2 4 2 2 3 3 3 4 3 3 3 3 3 5 4 4 4 5 5 4 4 3 3 3 4 4 4 4 5 4 2 3 4 4 4 3 3 3 2 2 2 3 3 3 3 5 4 2 3 3 4 6 5 5 5 4 3 2
1121 2 2 3 5 4 5 5 5 5 4 4 4 4 4 4 4 4 3 3 3 3 4 4 3 4 4 4 5 4 4 5 4 3 3 3 4 4 4 4 5 5 3 4 4 3 3 3 4 4 4 4 4 3 3 4 3 3 5 4 4 5 5 4 3 4 4 4 4 4 4 4 5
1114 5 4 4 4 4 3 3 4 3 4 5 3 3 3 3 4 3 4 5 4 4 4 2 2 3 3 4 4 4 3 4 4 5 3 3 3 3 4 4 3 3 4 5 4 4 4 3 4 4 5 5 6 4 2 3 3 4 5 4 5 4 3 5 5 5 4 4 5 5 5 3 4
1108 4 3 3 4 4 5 5 5 4 5 4 4 6 5 4 5 4 5 4 3 4 5 5 5 3 3 4 3 2 2 2 4 4 5 6 5 5 5 5 5 4 4 4 3 3 3 4 4 5 3 4 5 3 3 5 5 5 3 3 5 5 3 3 3 3 3 4 4 4 3 4 5
1102 5 5 5 4 4 5 5 4 4 4 4 3 3 4 4 5 5 4 3 3 3 4 4 4 4 5 5 4 4 3 3 4 4 3 4 3 3 2 3 4 4 5 4 4 3 3 4 5 6 5 5 5 5 4 4 4 3 3 3 4 5 5 3 2 3 3 3 2 3 3 4 5
1095 5 5 4 4 5 4 4 3 4 5 4 4 4 4 4 4 5 5 5 4 3 5 6 4 3 3 3 3 3 5 4 4 4 3 3 3 4 4 3 3 3 3 3 3 2 3 4 4 4 3 3 3 4 4 4 4 4 3 3 4 4 4 4 4 4 3 4 3 2 3 3 4
1089 4 3 4 4 4 5 4 3 3 5 5 4 3 4 5 6 4 4 4 4 3 2 2 3 3 3 3 4 4 5 5 6 4 4 3 4 4 2 3 4 3 5 5 4 4 4 4 4 4 4 5 5 4 4 4 4 4 4 3 4 4 4 3 3 4 5 5 5 4 4 4 4
1082 4 4 4 4 4 4 4 4 3 3 5 4 4 4 5 4 4 4 3 2 4 4 3 2 1 2 2 3 4 4 3 4 4 4 5 4 4 3 3 3 4 3 3 4 3 4 5 4 5 4 4 4 4 4 5 4 5 4 5 5 5 5 5 4 3 2 3 3 4 5 5 5
1076 5 4 4 4 4 3 3 3 2 3 5 3 3 3 4 4 4 5 4 3 4 4 4 4 3 2 3 3 4 4 4 3 4 4 4 4 5 5 4 3 3 3 3 4 3 3 3 4 5 4 4 3 3 5 5 4 3 3 3 3 3 4 3 3 3 2 2 3 3 3 4 4
1069 4 4 4 5 4 5 5 5 5 5 5 5 4 5 6 5 6 6 3 3 3 3 5 4 4 3 3 6 4 3 4 4 4 4 4 3 5 5 5 5 6 4 2 4 4 4 3 2 3 3 4 5 4 4 5 3 3 3 4 3 4 5 3 3 3 4 4 4 4 4 3 4
1063 4 4 5 4 3 4 4 3 3 3 2 2 3 4 4 4 4 4 5 5 5 4 5 5 3 3 2 2 3 3 4 4 5 4 4 5 5 5 4 4 5 3 2 3 4 4 3 4 3 3 3 4 4 5 5 4 4 5 4 5 4 4 3 5 4 4 5 5 4 4 5 4
1056 4 4 4 5 4 3 3 3 4 4 4 4 5 5 4 4 4 3 4 5 4 4 4 2 3 4 4 4 3 4 4 3 3 4 4 3 2 2 3 3 2 3 4 4 5 4 4 4 3 4 4 4 4 5 5 5 5 5 4 4 4 4 4 4 4 4 4 4 4 4 3 3
1050 3 5 4 3 3 3 3 2 3 3 4 3 2 3 4 4 4 3 4 4 4 4 5 5 5 4 4 5 4 4 5 5 4 3 3 4 4 4 3 4 3 2 4 3 4 4 3 4 4 3 3 3 3 3 4 3 3 3 4 3 4 4 4 4 3 3 4 4 2 3 3 4
1044 4 5 4 4 4 5 4 3 3 3 2 3 4 5 5 3 4 4 3 3 3 3 2 2 2 3 3 3 5 5 4 4 4 4 3 4 3 2 3 3 4 4 4 3 3 4 3 3 4 3 3 3 4 4 4 3 3 3 4 3 3 2 3 4 5 4 3 4 4 4 5 5
1037 5 4 3 3 3 4 3 3 4 5 6 4 4 5 3 4 5 4 3 3 4 4 4 3 3 4 5 4 4 4 3 3 3 4 4 4 4 4 3 3 4 6 4 4 4 4 5 5 6 5 4 3 4 5 4 2 4 4 3 4 4 3 4 4 4 3 4 2 2 3 3 3
1031 3 3 3 2 2 2 3 4 3 4 5 4 4 5 5 4 4 3 3 3 3 3 3 4 4 3 4 5 5 4 4 3 5 4 3 3 2 3 3 4 5 4 3 4 4 4 3 3 3 5 3 4 4 2 3 4 4 3 3 4 3 3 2 3 3 2 4 3 2 2 3 2
1024 2 2 3 4 5 4 5 5 3 3 3 4 4 4 4 4 3 3 4 3 3 4 4 4 4 3 3 2 3 4 4 4 3 5 4 4 4 3 4 4 3 3 3 4 4 4 4 4 4 4 5 4 3 5 4 3 3 2 2 2 3 4 4 4 4 4 4 4 4 3 3 2
1018 2 4 5 4 5 4 4 3 3 3 2 2 2 1 2 4 3 2 4 4 4 4 4 4 5 4 4 3 4 4 4 4 4 3 5 4 4 3 4 4 3 4 3 4 4 5 4 4 4 5 5 4 3 3 2 3 3 4 5 5 5 4 4 5 5 2 3 3 3 4 4 4
1011 4 4 4 3 3 4 3 3 4 4 3 5 4 3 4 5 4 3 2 2 4 3 4 4 5 4 5 5 3 5 6 5 5 5 5 5 4 5 5 4 4 4 3 4 5 4 4 4 3 4 4 5 5 5 4 4 5 6 5 4 4 5 4 4 4 4 4 4 4 6 4 3
1005 3 3 4 5 5 4 5 6 6 4 4 3 3 4 3 4 4 4 5 4 4 5 5 5 4 4 6 4 3 4 4 3 3 4 3 3 3 3 4 5 4 4 3 3 3 3 3 3 3 4 3 2 3 4 4 4 4 3 4 3 3 4 4 4 4 4 4 4 3 2 4 3
998 3 4 5 4 3 2 2 3 4 3 3 3 4 4 5 4 4 4 4 5 5 4 4 3 3 4 4 3 3 4 4 6 5 5 3 2 2 3 4 3 3 4 4 4 4 4 3 3 4 4 4 4 5 5 4 3 3 3 4 3 4 5 4 4 3 3 3 2 3 3 3 3 4
992 4 5 5 4 3 2 2 3 4 4 5 4 3 4 4 4 4 3 4 3 4 2 3 4 3 2 2 3 3 4 3 4 3 4 4 4 3 2 4 4 4 3 3 3 4 3 3 3 4 4 4 4 3 3 4 5 5 4 5 3 2 3 4 5 5 5 4 4 5 4 5 4 3
985 3 3 4 4 4 3 3 3 3 3 4 4 4 4 3 4 3 3 3 4 4 4 3 3 3 3 4 4 3 4 4 4 3 3 3 3 3 3 3 3 3 4 4 3 3 3 3 3 3 4 4 3 3 3 4 5 4 2 4 4 4 5 4 3 3 4 4 4 5 5 4 4 3
979 3 3 2 3 3 4 5 4 5 3 3 4 4 5 5 4 5 5 4 3 3 3 4 4 4 4 4 3 4 5 4 4 4 4 4 5 4 4 4 4 4 5 6 6 4 4 4 5 5 4 3 3 3 4 4 3 3 3 3 4 3 4 4 4 7 4 3 4 4 3 4 3 4
972 4 4 3 4 4 3 2 3 3 3 4 5 5 4 4 3 3 3 2 2 3 3 4 5 3 4 4 5 5 4 3 4 3 3 4 4 4 4 4 4 3 2 3 4 4 4 4 5 3 4 5 5 6 5 5 4 5 4 5 5 6 8 9 9 10 10 12 13 14 15 17 18 18
966 18 19 19 19 20 19 19 19 19 18 18 16 15 13 13 12 12 11 11 10 10 10 9 8 6 6 7 6 6 6 6 6 5 5 4 5 5 5 5 6 5 3 4 4 4 4 5 4 6 6 4 4 5 5 5 6 6 5 7 6 5 5 6 5 4 6 5 5 5 5 4 5
959 5 6 4 4 4 3 4 5 4 4 3 4 4 4 4 3 3 3 4 5 5 5 4 4 4 5 4 3 4 5 4 4 3 3 3 3 2 4 3 4 4 3 4 4 3 3 3 3 4 3 3 4 3 3 3 2 2 4 4 3 3 4 4 3 4 4 4 4 4 4 5 4 3
953 3 3 4 3 4 4 4 3 5 6 5 5 4 4 5 5 4 4 5 4 4 4 4 3 4 3 3 5 4 4 4 4 3 4 3 2 2 4 4 2 2 3 3 3 4 3 4 4 4 4 3 4 4 5 4 3 4 4 4 3 4 4 5 4 4 3 4 4 5 4 2 2 3
946 3 5 3 3 4 4 3 3 3 3 3 3 3 4 4 4 2 2 3 3 3 4 4 5 3 3 3 4 3 3 4 4 4 4 5 4 4 3 3 3 4 5 4 4 4 3 4 4 5 5 4 5 5 5 5 4 4 3 3 2 2 4 4 5 5 4 4 4 4 3 4 4 4
940 4 4 5 4 4 2 3 4 4 6 6 5 3 3 4 4 5 5 4 3 4 4 4 3 3 3 4 4 4 5 4 4 4 4 3 3 4 4 4 4 3 5 4 3 4 4 4 4 4 4 4 3 3 3 4 4 4 4 5 4 4 4 4 4 3 3 2 3 3 4 4 5 4
933 4 4 4 4 6 6 4 4 3 4 4 4 4 5 5 4 3 2 1 2 2 3 3 4 4 4 4 3 2 2 4 3 3 4 3 3 5 5 5 4 4 4 4 5 4 3 2 3 2 3 1 3 4 4 3 3 2 2 2 2 3 3 2 3 4 5 4 4 4 4 5 3 2
927 2 3 3 2 3 3 3 3 3 3 4 4 3 3 3 3 5 5 4 5 4 4 2 3 5 6 4 3 3 3 3 3 3 4 4 5 3 3 4 3 3 3 4 5 2 2 3 4 4 3 3 4 3 3 3 3 4 4 4 4 4 4 4 5 6 4 4 4 3 2 2 3 3
920 3 3 3 3 3 3 3 3 2 2 2 2 3 3 4 3 2 2 2 5 5 3 4 4 5 3 4 6 5 4 4 5 4 3 3 4 4 4 5 5 2 2 3 4 4 6 4 3 3 6 6 4 4 4 4 3 3 4 3 3 2 2 4 4 3 3 3 4 4 4 4 3 4
913 4 4 4 4 5 5 4 5 5 4 4 4 3 3 4 5 5 5 5 4 3 3 4 4 4 4 3 3 3 2 2 3 3 4 4 4 5 5 5 4 5 5 4 4 4 4 3 3 3 3 4 3 4 4 4 4 4 5 5 5 4 4 5 4 4 3 4 5 4 3 3 4 4
907 4 3 3 4 4 3 3 5 4 4 5 5 3 2 4 3 4 4 3 4 4 4 4 6 5 4 3 4 4 3 4 4 4 3 4 4 4 5 3 3 2 2 3 4 3 5 3 3 3 3 5 5 5 5 4 3 5 4 4 4 4 3 3 2 2 2 3 3 4 4 4 3 4
900 4 4 2 3 2 2 3 5 3 4 4 1 2 4 4 4 3 5 5 3 3 3 3 4 5 5 5 4 2 2 2 3 3 4 4 3 3 3 3 3 3 3 3 4 4 3 3 4 3 3 4 4 4 4 4 5 4 3 3 3 3 4 3 2 2 4 4 3 4 5 6 4 4
894 4 6 6 6 5 4 6 5 5 3 4 5 4 5 6 5 4 4 5 5 5 6 6 8 8 9 10 9 9 9 8 7 7 6 7 7 6 4 5 5 3 4 3 3 3 3 3 4 4 4 4 4 4 4 3 4 5 4 4 5 4 4 5 4 4 3 4 4 2 4 4 3 4
887 4 4 3 4 4 4 4 3 3 2 3 5 5 5 4 4 4 4 3 3 4 3 4 5 4 4 2 2 3 3 3 4 4 2 4 3 2 2 4 5 4 4 3 4 4 4 5 4 3 3 2 4 4 4 5 5 6 5 4 4 4 5 5 4 3 4 2 4 5 5 5 3 3
881 3 3 3 4 4 4 5 5 5 4 4 4 4 3 3 4 4 4 4 3 3 3 3 3 3 2 3 5 5 4 4 3 3 4 4 4 3 2 5 5 4 4 5 3 3 3 3 3 3 4 4 4 3 2 3 4 3 3 2 2 3 4 4 4 4 3 3 2 2 3 3 4 4
874 4 4 4 5 5 4 4 3 5 4 5 6 5 3 3 3 4 3 3 2 4 3 3 4 5 7 5 5 5 4 4 3 4 4 4 4 4 3 3 4 3 4 4 3 3 4 4 5 5 3 3 4 4 5 3 3 3 3 3 4 4 3 3 3 4 4 5 5 4 4 4 4 4
868 4 3 4 5 6 4 4 4 4 5 5 4 4 3 4 4 3 3 3 2 3 3 3 3 3 3 3 3 3 4 3 4 5 4 3 3 2 4 5 4 2 3 4 4 4 5 4 3 3 4 4 3 3 3 3 3 5 4 4 4 4 6 5 3 2 2 3 3 4 3 3 4 4
861 4 4 5 5 4 4 4 5 5 4 4 3 3 4 5 4 4 4 3 3 4 3 3 4 3 2 4 5 6 5 5 5 4 4 4 3 2 3 3 3 3 3 3 3 4 4 5 4 3 4 4 4 4 2 2 2 3 4 4 4 3 3 3 3 4 4 4 2 3 3 4 4 4
855 4 4 3 3 3 3 3 2 2 3 4 3 3 3 4 4 4 3 3 4 5 4 4 3 3 3 2 3 4 4 3 4 4 4 4 3 4 4 5 3 3 3 3 5 5 5 5 4 4 4 5 4 3 3 3 5 5 5 3 3 3 4 3 3 4 4 3 4 5 5 4 4 4
848 4 4 4 3 3 3 2 2 3 4 4 4 4 5 6 4 5 3 3 3 4 4 4 4 4 4 3 3 3 4 4 5 6 5 5 5 4 5 5 6 6 5 5 6 7 5 5 6 6 6 5 6 5 5 6 8 8 8 8 8 10 11 12 16 18 22 26 31 37 43 51 60 69
842 69 80 92 104 116 126 133 135 132 124 111 98 84 70 58 47 37 30 24 19 16 15 14 13 12 11 10 10 9 9 9 9 8 8 8 7 8 7 7 7 6 7 8 7 7 7 7 7 7 7 6 7 8 7 5 5 5 4 4 3
836 3 4 6 5 4 4 5 5 4 4 5 5 5 4 5 4 4 5 5 4 4 4 5 4 3 3 3 3 4 4 3 4 5 5 4 5 5 5 5 5 4 4 4 4 4 2 2 4 4 3 3 5 5 5 4 5 5 4 4 3 3 2 5 5 5 4 4 4 5 4 4 3 4
830 4 5 4 3 5 5 5 5 5 5 5 5 4 3 2 3 4 5 5 4 4 4 4 5 6 5 5 4 4 4 4 4 3 3 3 3 3 4 5 5 4 6 5 4 4 3 5 5 4 5 4 4 5 4 4 4 4 3 3 4 4 3 3 4 3 4 4 3 2 3 3 4 5
823 5 5 5 4 5 4 4 4 4 5 5 5 5 5 5 4 4 4 5 5 4 4 5 5 4 4 4 4 3 3 6 6 6 5 4 5 5 5 5 4 5 4 3 4 4 4 3 3 3 3 4 3 4 4 4 4 3 3 5 4 5 4 5 6 6 5 4 3 3 3 4 3 3
817 3 4 3 4 4 5 3 3 4 3 3 4 5 4 5 5 3 4 5 4 2 2 3 5 5 3 5 4 3 3 3 2 2 3 4 4 4 3 4 4 4 4 4 3 3 3 4 4 3 5 4 4 3 4 4 4 4 5 5 4 4 4 3 3 3 2 4 4 2 3 4 4 4
810 4 5 4 4 4 3 4 3 3 5 5 5 4 3 3 3 3 4 4 4 2 3 4 3 4 4 4 5 4 4 4 5 5 5 4 4 4 4 4 3 4 3 4 3 3 4 4 5 3 3 3 4 4 3 3 3 3 3 4 4 5 3 3 3 3 2 3 2 3 3 3 3 3
803 3 3 4 4 4 4 4 4 6 5 5 3 4 3 2 3 5 4 4 5 4 4 3 2 3 3 4 5 4 3 5 5 5 4 4 4 3 4 5 5 4 5 3 4 4 4 3 3 4 4 4 3 3 3 4 4 5 4 4 4 3 3 3 4 4 4 4 3 3 5 4 4 5
797 5 5 3 4 4 3 2 2 2 3 3 3 4 4 5 4 2 3 4 5 5 5 3 2 2 3 3 3 3 3 5 4 5 5 4 3 4 3 2 2 3 3 3 6 6 4 3 4 5 4 3 2 3 3 2 2 3 3 2 4 5 5 5 3 3 4 3 2 3 4 4 5 5
790 5 4 3 3 4 3 4 5 4 4 3 4 5 3 3 4 3 4 3 3 5 5 5 4 4 4 4 4 4 4 4 5 5 4 3 3 5 5 3 2 4 5 4 4 4 4 4 5 5 4 4 4 3 5 5 4 3 4 4 4 4 4 3 2 2 4 4 3 3 4 5 3 4
784 4 5 5 4 3 3 3 2 3 4 3 4 3 4 5 5 5 5 5 4 4 4 4 3 3 3 3 4 5 5 4 5 5 4 4 4 4 4 4 6 5 4 5 5 5 5 5 5 4 3 3 4 4 4 4 6 4 4 4 4 3 4 4 4 3 3 3 4 4 4 4 5 3
777 3 4 5 4 5 4 3 3 3 4 5 4 3 3 3 4 4 4 4 4 4 4 4 5 5 5 5 5 4 4 4 4 4 3 4 5 5 4 5 5 4 3 3 4 4 4 4 3 4 5 4 4 3 4 4 3 3 4 4 3 4 4 4 4 3 3 4 4 4 4 4 4 4
771 4 3 4 5 5 5 5 5 4 4 3 4 5 5 4 4 5 4 4 4 4 3 2 2 3 3 3 3 4 3 4 4 4 4 3 1 2 3 3 4 4 6 4 4 5 4 5 6 5 4 4 3 4 5 4 4 3 4 3 4 5 5 4 4 3 4 4 3 4 3 3 4 3
764 3 3 2 3 3 3 3 4 4 4 4 3 4 3 3 3 3 5 6 5 4 4 5 5 4 4 4 4 4 4 4 4 5 5 5 4 4 3 4 4 3 4 4 4 5 5 5 5 4 4 3 3 3 2 3 4 4 3 4 4 4 4 4 5 4 3 3 3 4 4 2 1 2
758 2 4 4 3 3 4 2 3 4 5 4 4 3 4 4 5 4 4 4 4 3 2 4 4 4 4 6 5 4 4 4 5 4 3 3 3 2 3 1 2 3 4 4 5 4 2 3 4 4 3 3 4 4 4 4 3 3 3 3 3 2 4 4 3 5 3 3 5 4 3 3 3 5
751 5 4 4 4 4 4 4 4 4 4 4 4 5 5 3 4 5 5 5 5 5 4 4 4 4 3 4 4 3 4 4 4 3 4 4 5 5 3 3 2 2 3 2 3 4 3 5 5 5 6 6 5 3 3 5 5 4 3 3 4 4 3 3 3 3 3 3 3 3 5 4 3 3
745 3 3 3 4 3 2 3 4 3 4 5 4 4 4 3 4 4 4 4 4 3 5 4 4 3 3 4 5 5 3 3 2 3 4 5 4 3 3 3 4 3 2 3 4 4 3 3 3 4 5 4 4 4 5 5 4 4 4 5 5 4 4 2 3 4 4 4 5 5 4 3 4 5
738 5 5 3 6 5 5 5 5 4 4 3 4 4 4 4 4 4 4 5 4 4 4 4 3 4 4 4 4 3 3 3 2 4 2 3 5 4 3 3 3 3 3 4 5 4 3 4 3 4 4 5 5 4 2 2 3 4 3 3 3 4 6 6 4 3 3 4 3 4 3 3 4 3
732 3 4 5 4 3 3 3 4 4 4 5 3 3 3 4 3 4 4 3 3 4 4 4 5 5 4 4 4 3 4 5 4 4 3 3 4 5 5 5 4 4 4 3 2 3 4 3 4 5 4 3 3 3 3 3 4 4 4 4 4 4 4 4 4 3 2 2 2 3 3 4 5 3
725 3 3 4 4 4 4 5 4 4 4 5 5 4 3 3 3 4 6 5 4 4 5 5 5 4 3 4 4 4 4 4 5 4 4 4 4 4 3 3 4 5 4 4 3 4 4 5 5 4 5 5 4 3 4 3 4 4 4 3 4 4 5 4 2 3 4 3 3 4 5 6 6 6
718 6 4 4 4 5 5 5 4 4 4 5 3 4 5 4 4 5 5 5 4 4 4 4 3 3 4 4 3 4 4 4 4 3 2 2 3 4 4 4 5 5 3 3 4 5 3 3 3 4 5 4 3 2 2 4 5 5 4 3 2 2 3 4 4 4 5 4 4 3 4 6 5 4
712 4 4 3 4 5 4 4 5 6 5 6 4 3 5 4 4 5 5 5 4 3 4 4 4 3 4 5 4 4 3 4 4 3 4 5 5 4 3 3 4 3 3 4 3 4 4 3 3 3 4 3 3 3 3 4 4 4 4 2 2 3 3 5 4 4 5 5 4 5 4 5 4 4
705 4 4 3 3 4 3 3 3 3 3 2 3 4 6 5 4 4 5 4 3 3 4 3 3 3 3 3 3 3 3 3 3 2 3 4 4 4 4 3 4 4 5 4 4 5 5 5 6 4 4 5 3 3 3 3 4 5 5 5 5 5 5 5 4 4 4 4 4 4 4 2 3 3
699 3 3 3 3 4 5 4 5 5 4 5 6 5 4 5 5 4 4 4 5 5 4 4 4 5 4 5 4 4 4 4 4 4 3 3 3 3 4 6 6 5 5 4 4 4 4 3 3 4 2 2 3 3 2 3 4 4 5 6 4 4 4 3 4 4 5 4 5 5 4 5 5 5
692 5 5 5 4 4 5 5 5 4 3 4 4 5 5 4 4 5 5 4 4 4 4 5 6 5 2 2 3 4 5 4 4 5 5 3 3 3 3 4 4 4 5 4 4 3 4 5 5 5 5 6 6 6 5 4 3 4 3 3 5 5 3 5 5 3 3 5 5 5 4 4 4 3
686 3 4 5 4 4 4 6 5 5 4 4 4 4 5 6 5 4 5 4 4 5 4 5 5 4 4 3 3 6 5 4 4 5 5 4 4 5 4 4 4 4 5 5 5 5 5 5 5 5 4 5 4 3 5 5 4 5 5 6 6 5 5 4 4 4 4 4 4 5 5 5 4 5
679 5 5 4 4 4 4 5 6 4 4 6 5 4 5 6 5 5 4 5 6 6 5 5 4 5 7 6 5 5 5 4 4 5 6 6 5 6 4 4 5 6 6 4 5 6 6 5 6 7 7 7 7 6 6 7 6 6 5 5 4 4 4 5 5 5 5 4 4 6 6 6 5 7
673 7 7 6 5 6 5 5 6 7 7 6 7 6 6 5 4 5 5 5 5 6 7 5 6 6 6 5 6 7 5 4 5 6 5 4 6 5 5 6 6 6 6 6 6 6 5 5 5 6 7 6 6 6 6 6 7 6 7 6 6 6 6 7 6 7 7 7 7 6 7 8 9 8
666 8 7 7 5 5 6 6 7 7 7 7 7 6 7 7 8 8 8 8 8 7 7 7 7 7 7 8 8 8 6 6 7 8 10 10 10 10 9 8 8 8 8 9 9 10 10 9 10 11 12 12 12 12 11 11 12 12 12 13 13 13 12 13 14 13 12 12 12 12 14 13 13 13
660 13 13 14 15 15 14 15 16 16 16 17 17 18 18 17 17 18 18 17 19 20 19 19 19 19 21 20 21 21 22 24 25 24 24 26 26 26 27 28 29 31 32 33 34 35 36 37 38 40 42 43 44 46 48 51 53 54 57 61 63 66 70 75 78 81 85 91 96 101 109 117 125
653 125 133 144 155 167 182 200 219 242 268 299 332 370 416 467 523 589 659 734 814 898 981 1065 1145 1217 1275 1317 1338 1335 1308 1259 1194 1114 1027 937 847 761
650 761 680 606 539 481 430 387 351 317 289 263 241 222 205 190 176 164 154 143 134 125 118 111 105 98 92 87 83 79 74 71 67 64 60 57 56 55 53 52 50 49 48 47 45 45 45 46 44 43 42 41 40 38
645 38 36 35 31 31 30 29 28 28 27 24 24 24 23 22 21 22 21 22 20 20 19 18 18 17 17 18 18 17 16 15 15 16 16 15 15 15 14 14 13 14 14 15 15 14 12 13 13 13 12 13 13 15 14 15 15 14 14 15 16 16 17 17 17 18 18 20 21 22 23 23 23
639 23 23 23 22 21 19 17 17 15 16 15 12 12 12 12 12 12 11 11 12 12 12 11 12 11 10 12 11 11 12 11 10 10 10 10 9 10 10 10 10 10 10 10 10 10 9 8 10 9 9 9 8 9 9 8 9 9 9 9 11 10 10 12 12 14 13 13 14 13 14 15 15
632 15 15 16 17 14 15 14 13 12 11 11 11 11 12 12 11 10 9 11 10 9 9 7 7 8 8 8 7 6 6 6 7 7 7 7 7 6 6 6 6 6 6 7 7 7 7 8 8 8 7 7 10 10 10 9 9 10 11 11 11 12 11 11 11 12 13 12 13 13 11 11 10
626 10 11 11 12 13 13 13 14 13 14 15 16 18 18 19 21 22 25 28 28 28 26 24 22 21 17 15 13 12 10 8 9 9 7 7 7 7 7 6 6 7 7 6 5 6 7 6 5 6 6 5 6 6 6 7 7 6 6 6 7 6 6 5 7 7 7 6 6 6 6 5 6
619 6 7 7 7 7 7 7 7 6 8 7 6 5 4 6 6 6 6 6 6 6 4 4 3 4 4 5 4 4 4 4 4 4 5 6 4 4 5 4 5 5 4 5 5 5 5 6 5 5 6 5 5 5 5 4 5 4 2 3 4 4 6 6 6 4 5 5 5 4 5 6 4 5
613 5 4 5 5 5 4 6 6 6 4 3 4 5 5 4 5 6 5 6 4 4 5 5 5 5 5 5 5 4 5 5 5 5 4 4 5 5 5 5 7 5 4 4 5 5 5 5 4 4 4 4 5 4 3 3 3 3 4 3 2 3 3 2 4 6 6 5 4 4 3 3 4 4
606 4 5 5 5 4 3 3 4 3 4 5 5 5 4 3 3 3 4 5 5 6 6 6 6 6 5 4 6 5 6 5 4 5 5 4 4 5 5 5 5 5 5 4 5 6 6 4 3 4 5 4 3 4 5 6 6 4 4 4 4 4 4 4 5 5 5 5 5 5 5 6 7 6
600 6 5 4 4 5 4 5 5 3 4 4 4 4 5 4 5 5 4 5 6 5 6 6 7 6 5 6 6 5 5 5 5 5 6 6 6 5 5 5 6 6 6 6 6 5 6 6 6 5 5 5 6 6 5 5 6 6 7 7 6 6 7 7 6 7 6 6 7 7 7 7 7 6
593 6 5 6 7 8 8 7 6 7 7 7 7 6 7 6 8 7 8 8 6 7 8 8 6 7 6 6 8 7 8 9 9 8 8 6 7 7 6 6 6 6 6 6 7 6 7 5 5 5 5 5 5 6 6 5 6 7 8 7 7 7 7 7 6 6 7 7 5 5 6 8 8 6
587 6 6 6 6 6 7 7 8 8 7 8 8 8 7 7 6 6 6 6 6 7 7 6 7 6 5 6 8 7 8 7 7 6 6 6 6 6 6 7 6 6 6 6 6 6 6 5 6 7 7 6 6 6 6 6 8 6 5 6 7 7 7 8 7 8 7 6 7 7 7 7 6 6
580 6 5 5 5 5 5 6 6 5 6 7 6 6 7 6 5 5 4 5 5 6 6 5 5 4 6 6 6 6 6 6 6 6 6 6 5 5 5 5 5 5 7 6 7 6 6 7 7 6 7 6 6 6 6 8 7 7 8 8 7 6 7 8 7 6 7 7 6 6 6 4 5 5
574 5 4 4 4 4 5 6 5 6 5 6 6 5 6 8 7 8 6 5 5 6 6 6 6 6 6 6 5 6 7 6 6 5 6 6 7 8 9 8 7 8 8 8 9 8 8 8 8 8 7 8 9 8 8 8 7 7 6 7 8 8 6 7 6 4 5 5 5 6 5 6 6 6
567 6 5 6 7 6 5 4 5 5 4 5 5 5 6 6 6 7 8 9 8 6 7 8 8 9 9 10 11 11 11 10 10 10 9 9 7 9 8 9 8 7 8 9 8 10 9 7 7 9 9 9 9 10 10 9 8 8 7 7 8 8 8 7 7 8 7 7 7 7 6 6 7 7
561 7 7 7 7 8 7 7 7 8 8 8 7 7 7 9 9 8 6 8 8 8 8 9 9 8 8 8 10 9 8 8 9 10 11 12 13 13 13 13 13 13 14 13 13 14 13 13 12 12 12 11 10 10 10 9 9 9 10 10 10 12 13 14 13 14 13 12 12 12 12 12 12 11
554 11 11 11 11 11 11 12 12 10 10 10 9 10 11 11 10 10 9 9 10 10 11 11 12 12 11 11 12 12 12 12 12 12 11 11 10 11 11 10 11 11 10 10 10 11 12 11 12 12 14 14 14 13 14 13 13 13 14 14 14 14 13 12 13 13 14 14 15 16 14 13 14
548 14 15 15 16 18 18 18 17 17 16 16 17 18 17 19 19 17 17 16 15 14 14 14 13 13 12 13 12 12 14 14 14 15 16 15 14 15 16 15 16 17 16 16 16 17 16 15 14 13 12 12 11 11 10 11 11 11 10 11 12 11 12 12 12 12 12 11 10 10 12 12 13
541 13 13 13 14 15 15 15 16 14 16 16 15 17 17 16 17 19 19 19 20 21 21 22 21 21 21 21 20 20 19 19 18 17 17 17 15 14 13 13 14 13 12 12 14 15 16 16 15 15 15 16 15 16 15 14 15 15 14 14 14 14 14 13 12 12 13 14 15 16 17 18 20
535 20 22 24 26 29 32 34 38 42 45 45 44 43 40 36 33 30 26 25 23 20 19 19 18 19 19 19 20 20 20 20 20 21 20 21 22 22 21 20 21 20 19 19 19 18 18 18 17 17 17 15 16 15 15 15 15 15 17 17 17 16 16 16 17 17 18 18 20 21 20 21 22
528 22 22 23 25 27 29 31 34 38 42 49 54 57 63 70 78 84 88 90 88 83 76 72 65 60 57 53 48 45 43 41 42 43 43 44 45 44 45 46 46 46 46 44 42 42 41 40 38 38 37 34 32 31 29 28 27 26 25 25 22 21 19 19 19 18 19 18 17 16 16 14 15
522 15 14 14 12 12 12 13 13 13 11 13 14 15 15 17 19 21 23 25 27 30 33 36 39 41 43 43 42 39 37 33 28 25 23 21 19 16 14 13 12 12 12 11 12 13 12 11 9 8 9 9 10 9 9 10 10 10 9 9 8 8 9 8 8 8 8 9 9 7 7 6 7
515 7 8 7 8 8 8 8 6 7 8 8 6 8 8 7 9 8 8 8 8 9 9 10 10 10 11 11 10 11 11 11 11 11 12 12 11 12 12 12 13 14 15 14 12 12 12 12 12 13 11 10 13 13 13 14 17 18 20 22 25 28 32 36 39 43 48 52 55 57 58 56 52 49
509 49 43 38 33 28 24 22 18 15 13 12 12 12 12 12 11 10 11 11 9 9 8 10 10 9 9 9 11 11 10 9 9 9 8 9 8 6 8 8 8 10 10 10 9 9 8 9 9 9 10 11 10 10 10 10 9 9 8 7 7 7 7 8 7 8 5 5 6 6 5 5 5
502 5 6 6 6 5 5 5 4 4 6 4 5 5 5 4 4 5 5 5 5 4 4 5 5 4 5 5 4 5 5 4 5 6 7 7 5 5 6 7 7 6 5 5 6 5 4 6 6 4 5 6 5 6 6 6 6 7 7 8 8 7 6 7 8 7 7 7 7 5 5 6 6 6
496 6 5 5 5 5 4 4 5 4 3 4 4 4 5 6 5 5 6 7 6 6 6 6 6 5 5 7 7 7 8 8 9 9 9 8 8 9 10 10 11 12 13 14 16 16 16 15 15 15 15 17 17 17 16 15 14 14 14 14 14 13 15 15 15 16 19 22 24 27 30 32 35 38
489 38 40 40 38 36 33 28 24 21 18 17 16 14 12 10 10 10 9 9 9 8 9 10 10 12 12 14 13 13 14 16 17 18 18 19 18 16 16 16 16 17 17 16 17 17 18 18 19 18 19 20 19 20 20 20 19 18 18 18 16 16 15 15 16 15 15 14 14 14 15 15 14
483 14 15 14 13 14 14 14 14 13 13 13 13 13 11 11 11 10 11 11 10 9 10 10 11 12 12 13 12 13 13 14 17 18 19 22 22 23 23 24 25 25 23 22 23 23 21 20 18 17 16 15 15 14 14 13 13 13 13 13 14 15 14 14 15 16 16 16 17 18 17 17 18
476 18 19 18 19 20 19 18 17 17 16 16 16 17 17 15 15 14 12 11 12 11 9 10 9 9 9 8 9 8 8 7 8 8 10 9 9 10 10 10 9 9 11 12 11 10 10 10 9 10 10 9 9 9 9 10 10 10 9 10 10 10 9 9 8 10 9 9 10 10 9 10 10
470 10 10 11 12 11 10 10 10 11 11 10 10 10 10 10 9 8 7 8 8 8 7 7 6 6 5 5 7 7 6 6 6 7 8 6 6 5 6 7 7 8 8 9 9 9 10 10 10 9 10 9 9 9 10 9 8 9 8 8 7 7 8 7 7 8 8 7 7 7 6 5 4
463 4 4 5 5 4 4 4 3 4 5 3 4 4 5 4 5 4 5 4 4 5 4 4 4 5 5 5 5 4 4 4 4 3 4 4 4 4 5 4 5 5 3 3 5 6 5 6 6 5 6 7 8 8 7 8 6 6 7 8 9 9 9 8 7 6 6 6 5 6 5 5 4 3
457 3 4 4 3 5 4 2 2 2 3 3 4 3 4 4 4 3 4 5 3 3 4 4 3 3 3 3 4 4 3 3 4 4 4 5 5 6 4 3 4 3 3 4 4 4 4 4 4 4 3 3 5 8 7 5 5 4 4 3 4 4 5 5 5 6 5 5 6 5 3 4 5 5
450 5 5 5 5 5 5 5 4 3 5 6 4 5 6 6 5 5 4 4 5 4 4 4 5 4 5 5 6 5 5 5 5 5 4 3 3 3 2 3 3 3 3 4 3 5 5 4 4 3 3 4 4 5 4 5 5 4 5 6 5 5 5 4 3 3 3 4 3 4 4 4 4 5
444 5 5 5 5 4 5 4 4 5 4 3 3 5 4 4 6 6 5 4 4 4 5 5 4 4 5 4 4 4 4 4 4 5 5 4 3 4 4 4 4 3 3 3 4 3 2 2 2 4 3 3 4 5 4 5 4 3 3 4 4 5 4 4 5 5 5 5 5 4 4 3 3 3
437 3 3 4 4 4 4 4 4 4 4 4 5 4 5 4 3 5 5 4 4 4 3 3 4 4 4 4 5 4 5 5 4 3 3 3 2 3 5 4 4 4 3 4 3 4 3 3 5 5 5 4 4 5 5 5 5 6 5 6 5 4 3 3 3 4 4 4 6 5 3 3 3 4
431 4 4 4 3 4 5 5 4 4 4 4 4 4 3 3 2 3 4 5 5 4 4 5 4 4 4 4 4 5 4 3 3 3 4 5 5 5 4 4 4 4 4 3 4 5 5 5 5 4 6 5 5 5 5 4 4 4 4 5 4 4 5 4 3 4 5 4 4 4 5 4 4 4
424 4 5 5 5 4 4 5 4 4 4 4 5 4 5 6 6 5 5 3 4 4 3 5 5 5 6 6 4 5 6 5 5 5 6 7 6 4 4 4 5 4 4 5 4 5 4 4 4 4 4 5 3 4 5 3 2 2 3 3 3 3 5 5 4 4 5 5 4 4 3 3 5 5
418 5 3 4 5 4 3 3 4 5 6 5 4 4 3 5 6 4 4 4 3 3 4 5 4 5 5 4 4 4 5 4 4 3 3 5 5 5 6 5 5 5 3 4 5 4 4 6 5 3 4 5 4 3 4 5 5 5 4 4 4 4 3 4 3 3 4 4 3 3 3 4 5 3
411 3 4 3 3 3 3 2 3 4 4 5 3 4 4 5 4 4 3 3 3 2 3 5 4 3 5 5 5 5 4 4 3 4 4 4 4 2 3 4 4 5 4 3 3 3 3 3 3 2 3 4 5 6 5 5 4 4 4 3 3 4 4 3 4 4 4 3 3 3 3 3 3 4
405 4 5 4 5 4 4 4 6 6 5 6 5 4 5 3 2 4 5 5 5 5 5 5 6 7 7 7 7 8 9 10 11 11 10 9 10 10 10 9 9 8 8 8 8 6 6 6 4 4 4 4 4 4 4 4 4 4 3 5 5 5 5 3 4 5 5 6 5 6 6 5 6 5
398 5 5 4 6 7 6 7 7 5 5 5 5 5 5 4 4 5 4 4 5 5 6 6 5 6 5 4 6 7 7 7 7 7 9 9 10 12 13 13 14 14 15 16 17 17 17 17 17 15 12 11 10 8 8 8 8 7 7 7 7 7 6 5 5 6 5 5 6 6 5 6 6 6
391 6 6 6 6 5 5 5 6 6 6 5 5 5 6 6 5 6 6 7 7 9 8 7 9 11 11 11 14 15 16 18 19 21 22 22 22 21 20 19 17 16 14 12 12 12 11 11 11 12 12 13 13 12 12 12 12 11 10 10 10 9 7 8 9 9 7 6 7 7 7 7 7 7
385 7 9 8 7 7 8 8 8 8 9 10 12 13 13 13 14 15 17 16 14 15 15 16 17 16 16 15 16 17 18 18 19 22 25 27 28 31 33 36 38 40 41 43 43 43 45 46 47 46 46 45 42 38 34 30 27 24 22 20 17 14 14 12 12 12 11 10 10 11 10 9 9 10
378 10 10 12 12 12 10 11 11 11 12 11 12 13 13 13 14 15 16 16 19 21 24 25 27 28 28 30 32 31 31 29 28 26 25 24 24 24 22 21 21 22 22 24 27 30 33 39 44 50 53 62 71 79 87 95 102 108 111 112 110 107 101 96 91 87 86 86 85 85 87 94 100
372 100 108 118 130 144 154 159 161 156 145 129 113 99 83 70 60 49 41 35 31 29 27 24 22 23 22 21 22 22 21 22 23 24 25 23 24 24 24 23 23 23 23 23 23 23 23 22 21 22 21 21 21 25 27 29 33 36 40 45
367 45 50 57 64 71 81 90 98 108 118 129 139 149 158 166 174 181 187 195 205 212 218 220 216 207 194 181 164 146 130 113 100 88 77 71 67 64 64 64 65 65 63 61 57 53 50 47 42 38 35 33 30 30 30 30 30
362 30 30 32 35 38 42 46 51 57 62 66 71 72 71 68 62 56 52 48 43 40 36 35 34 32 32 32 33 35 35 37 39 41 42 44 45 47 48 47 47 47 45 43 41 41 40 40 39 38 38 39 41 43 46 47 50 51 53 53 50 48 45 41 38 34 35 33 32 31 30 29 29
355 29 30 33 34 35 36 40 43 47 52 58 61 63 63 62 58 53 48 41 35 30 27 22 18 15 14 12 12 12 11 9 10 10 9 8 8 8 9 11 12 12 11 13 13 13 14 16 17 15 15 14 15 16 14 12 12 11 9 8 8 9 9 7 7 7 7 6 6 6 7 7 7
349 7 5 6 6 6 6 5 4 5 6 4 4 5 5 3 4 3 3 4 5 5 4 5 4 3 5 4 3 3 3 4 3 4 4 3 3 3 3 3 4 4 4 3 3 4 5 5 4 5 5 6 5 5 5 5 5 6 7 7 8 7 7 8 7 7 7 6 5 5 6 4 5 5
342 5 4 4 4 5 5 5 5 5 5 5 6 5 4 4 4 3 4 4 4 5 4 5 4 3 3 3 4 5 5 5 4 4 4 4 4 6 5 4 3 3 4 4 3 2 2 3 3 4 5 5 4 3 2 4 3 3 4 4 5 5 3 4 4 4 4 4 3 4 4 4 5 5
336 5 4 4 5 4 3 4 4 4 3 4 4 3 3 4 4 4 2 3 2 3 5 5 6 4 4 4 3 4 4 4 5 3 4 5 5 4 4 3 4 3 5 4 4 3 4 5 5 4 4 4 3 3 5 5 5 4 4 4 4 4 5 4 4 5 5 4 3 4 4 4 4 3
329 3 4 4 4 4 4 3 4 4 3 2 2 2 3 4 4 4 3 4 5 3 4 4 2 3 3 2 3 3 3 4 4 3 3 3 2 2 3 3 4 4 3 3 3 3 3 4 4 4 2 3 4 3 2 2 2 4 4 2 2 3 4 4 4 3 4 4 4 3 3 3 3 4
323 4 5 4 4 4 4 5 3 4 4 3 4 4 4 3 2 2 2 3 3 3 3 4 4 4 3 3 4 5 5 5 6 6 5 4 4 5 4 3 3 3 3 4 4 3 3 3 3 4 3 3 3 4 5 3 3 3 3 3 3 3 4 5 4 4 4 4 4 4 3 3 4 3
316 3 5 5 4 3 3 4 3 3 3 4 4 3 3 3 2 3 4 5 4 5 4 5 4 2 2 4 4 5 5 4 3 3 3 4 6 6 5 5 5 3 3 4 5 3 3 3 3 3 2 3 4 4 4 4 5 5 4 3 2 3 3 3 3 4 5 5 5 5 5 5 4 3
310 3 3 4 3 3 4 6 7 6 4 5 5 5 6 5 4 4 4 5 5 6 5 4 4 4 4 5 3 3 3 3 3 4 4 4 4 3 4 3 4 4 4 4 3 5 4 4 3 2 2 3 5 6 4 3 3 3 4 3 3 3 3 3 4 4 4 3 4 5 5 5 4 3
303 3 4 4 5 4 4 5 5 4 5 5 4 3 2 3 3 5 3 3 4 4 4 5 4 4 3 3 4 5 3 4 4 4 4 3 2 3 4 3 3 3 3 3 3 3 4 3 4 4 4 3 3 4 4 4 5 4 4 3 4 4 4 4 4 2 2 2 3 4 5 5 4 5
296 5 5 5 3 3 4 4 4 5 4 3 3 4 4 3 3 3 5 6 5 4 3 4 5 4 4 3 4 4 4 3 3 5 4 3 4 5 4 4 4 5 4 4 5 4 3 3 3 4 4 4 3 4 3 2 3 3 3 3 3 4 5 6 5 5 5 5 5 4 4 3 3 6
290 6 6 5 5 4 4 4 4 4 4 4 4 5 5 4 3 3 4 3 3 2 3 3 1 2 3 3 3 3 3 2 3 3 4 3 4 2 2 3 3 3 3 3 3 3 4 5 4 4 4 3 3 4 3 4 4 4 3 4 4 5 4 3 3 3 4 5 4 4 4 3 4 5
283 5 4 3 4 4 4 5 5 4 3 3 3 3 3 3 3 4 4 2 3 2 2 2 2 4 3 4 4 3 3 3 3 3 3 3 3 4 3 3 4 3 3 4 5 4 4 4 4 5 6 5 4 3 3 4 4 3 3 4 3 3 3 3 4 4 3 3 3 3 3 2 3 4
277 4 5 5 3 3 3 2 2 3 3 3 2 2 3 3 3 4 5 4 4 3 4 3 3 2 2 3 4 5 4 3 4 5 4 4 4 3 3 4 4 5 4 4 3 2 2 3 4 3 4 4 2 2 3 3 4 4 4 5 4 4 4 4 5 5 4 5 4 3 3 3 3 3
270 3 5 4 4 3 4 5 4 3 3 4 3 3 2 2 3 3 3 2 3 3 3 2 3 3 2 2 4 5 5 5 5 4 4 4 3 3 4 4 4 4 4 4 4 4 3 4 5 5 4 4 4 4 2 3 4 3 3 3 4 4 3 3 3 4 3 4 4 4 3 3 2 3
264 3 4 5 5 4 3 3 2 3 4 4 4 4 4 4 6 5 4 3 3 4 4 4 3 3 4 4 5 4 4 5 5 3 3 3 3 2 3 3 2 4 4 3 4 4 4 3 4 3 2 3 4 3 4 5 4 3 2 3 5 5 5 4 4 4 4 4 4 4 4 3 3 4
257 4 4 4 4 6 4 5 4 4 3 3 2 2 3 3 4 5 4 4 5 5 4 2 3 3 4 4 4 4 3 3 5 6 3 3 4 4 3 3 3 3 3 4 3 3 3 3 3 5 4 4 3 2 3 3 4 3 3 4 2 3 4 4 3 3 3 4 5 4 4 3 2 3
251 3 4 3 2 3 4 3 4 4 3 4 5 4 5 4 5 6 4 4 4 4 4 4 5 3 2 2 3 5 5 5 4 5 4 3 3 4 5 5 5 4 5 4 2 2 5 3 3 3 3 3 3 2 4 4 4 3 3 3 4 4 3 4 4 4 3 3 4 4 4 4 4 4
244 4 4 4 3 3 5 5 6 5 4 4 4 3 3 4 4 4 5 4 3 3 3 5 5 4 2 3 4 3 3 3 2 4 3 3 4 4 4 4 4 4 4 4 3 2 3 4 4 4 5 5 5 4 3 4 3 4 3 3 3 4 3 3 3 2 2 4 4 3 3 3 4 3
238 3 4 3 3 3 3 4 3 4 4 5 5 6 5 5 5 5 4 4 5 5 3 4 4 4 3 4 4 3 3 4 3 4 5 3 3 5 5 6 5 4 3 3 5 4 4 5 5 4 4 4 4 3 4 4 4 3 4 4 3 3 3 2 2 2 5 4 4 4 5 3 4 4
231 4 2 2 3 2 4 4 4 4 3 4 3 4 4 3 4 3 3 3 4 5 3 3 4 3 5 5 5 3 4 5 5 6 4 4 4 4 3 3 3 2 2 1 2 4 5 4 4 4 3 3 2 3 4 4 4 4 5 5 5 4 5 4 3 4 4 5 5 6 4 4 3 3
225 3 4 4 3 3 2 4 4 4 3 5 3 3 3 4 4 4 4 4 4 5 5 3 4 5 4 3 5 5 4 3 3 3 3 3 2 3 4 5 5 4 5 5 4 3 4 4 3 2 3 4 4 4 4 5 5 5 5 4 4 5 4 5 5 5 4 4 2 2 3 5 5 5
218 5 4 3 3 3 3 5 3 2 3 4 3 3 4 5 4 4 4 4 4 4 4 4 5 4 4 4 4 3 5 5 5 5 4 5 4 4 4 5 5 5 3 4 4 4 5 5 4 4 5 6 5 4 4 3 3 4 4 4 5 5 5 4 4 4 3 4 5 5 4 4 5 4
211 4 4 3 5 5 4 6 5 3 3 4 5 5 5 5 5 4 4 4 4 4 5 5 5 4 3 3 4 4 4 4 5 6 5 6 6 5 3 3 5 4 4 5 5 5 5 4 5 4 4 4 4 4 3 4 4 3 4 4 5 6 5 4 4 5 5 6 6 3 3 5 6 4
205 4 5 3 5 5 4 5 6 5 6 5 5 6 6 5 4 4 4 4 6 6 6 6 5 4 5 5 6 7 8 7 6 6 6 6 7 6 4 5 6 5 4 4 4 5 5 3 3 4 5 4 5 5 5 5 5 7 7 6 5 6 6 6 6 7 8 9 10 12 15 16 16 19
198 19 21 23 25 28 32 34 35 34 33 29 26 22 21 18 16 14 11 10 9 10 9 8 8 7 8 8 7 7 7 7 6 6 6 7 7 6 6 7 7 5 5 7 6 6 7 8 7 7 7 8 7 7 7 7 8 7 7 7 7 7 7 6 7 7 8 8 8 9 10 12 12
192 12 10 11 11 10 10 9 10 10 10 10 9 10 10 11 12 12 13 13 14 17 19 22 25 30 33 38 46 54 63 72 83 94 107 121 134 148 159 166 168 167 161 150 137 122 107 91 78 66 55 47 39 33 30 27 25 22
187 22 20 20 19 17 17 16 15 15 14 14 14 15 14 13 13 14 14 14 15 15 14 14 15 16 16 17 18 18 20 22 23 24 28 32 34 39 42 44 46 45 42 37 34 30 26 24 22 19 17 14 12 11 10 10 8 8 8 10 10 8 9 10 9 8 6 6 7 6 7 7 7
180 7 8 7 7 6 8 7 7 7 7 7 7 7 8 7 6 6 5 4 4 5 5 5 6 6 4 5 6 8 7 7 6 7 7 5 6 7 6 6 6 7 6 6 7 6 7 5 6 8 8 6 6 7 6 7 6 4 6 6 6 7 7 6 5 4 4 4 4 5 6 5 5 5
174 5 5 5 5 5 5 5 5 6 7 6 7 7 6 5 4 5 6 5 6 6 6 6 6 6 5 5 5 6 7 8 9 8 8 8 8 7 5 5 6 5 6 7 6 7 7 6 7 7 7 6 6 6 5 5 5 5 5 5 4 4 4 3 3 3 3 4 4 4 4 3 4 4
167 4 5 5 5 5 5 4 5 6 4 4 5 5 5 6 7 6 6 6 7 7 7 7 6 6 7 8 7 7 8 8 8 9 7 6 7 7 7 8 8 7 7 7 6 7 8 8 7 8 9 8 8 9 9 8 8 8 10 11 10 12 12 11 11 12 12 12 11 9 10 11 10 10
161 10 11 10 10 11 11 10 10 9 10 10 10 9 9 10 10 9 9 9 9 9 8 9 8 9 10 11 9 8 8 9 10 10 9 9 9 9 9 9 10 10 10 10 10 10 11 10 9 10 10 10 10 11 11 11 11 11 11 11 10 10 10 10 10 10 9 8 7 9 10 10 9
154 9 9 9 11 11 11 12 13 13 14 14 14 14 16 15 14 14 14 15 16 17 16 16 17 15 15 17 17 17 17 17 18 19 20 20 19 19 20 19 20 19 20 20 20 20 18 19 19 18 17 16 15 15 15 15 16 15 15 15 15 14 13 15 12 11 11 10 10 9 9 9 8 8
148 8 7 7 7 5 6 6 7 8 9 10 12 13 14 15 17 17 18 18 17 16 16 17 17 16 16 16 16 15 16 16 16 17 17 17 15 15 18 18 18 20 21 21 23 25 26 28 29 32 32 31 31 32 33 32 31 31 30 30 28 27 25 23 22 23 23 24 24 24 24 25 27 26
141 26 27 28 29 28 27 27 29 30 31 33 34 36 37 40 43 45 48 49 51 53 55 56 55 56 56 55 55 54 53 54 55 54 56 57 58 60 61 62 64 67 69 70 73 75 80 84 87 89 93 96 101 105 109 112 115 117 120 122 125 127 129 130 133 136 139 143 146 150 155 161 167
135 167 173 182 191 202 216 230 246 267 288 315 345 380 422 469 520 575 639 710 786 870 965 1069 1164 1239 1289 1301 1263 1195 1126 1058 991 942 913 899 899 918 954
131 954 1014 1092 1194 1324 1490 1694 1943 2244 2618 3092 3706 4471 5416 6571 7955 9482 11080 12846 14886 17139 19539 22166
129 22166 25111 28031 30414 32060 32767 32024 29761 26812 23768 20486 17185 14368 11962 9853 8007 6502 5399 4627
128 4627 4058 3606 3223 2895 2612 2374 2167 1991 1840 1709 1592 1491 1405 1337 1282 1240 1205 1183 1171 1170 1180 1206 1240 1274 1293 1290 1251 1166 1056
125 1056 943 829 714 613 527 455 396 347 309 281 259 241 226 215 203 192 184 176 165 155 147 139 132 126 121 115 110 105 101 97 92 88 84 80 77 74 71 69 68 66 64 62 61 60 60 59 60
121 60 60 59 59 59 58 57 56 55 53 53 53 51 50 50 46 44 43 42 41 38 37 36 36 38 39 39 40 42 45 47 50 52 53 53 52 54 53 51 49 46 44 41 40 40 40 38 38 37 37 37 37 36 36 34 33 31 29 27 25 23 22 20 18 18 16 17 17 18 18 19 21
114 21 22 23 25 27 27 28 29 30 31 30 32 31 31 31 32 32 32 33 33 31 32 31 29 28 27 26 25 24 23 22 21 22 23 24 26 26 27 29 30 29 29 29 28 26 26 25 24 23 23 22 20 19 19 19 17 16 16 16 16 15 15 15 14 13 11 11 10 10 10 9 7
108 7 7 7 8 7 6 6 6 6 5 6 7 6 7 7 5 7 6 7 8 8 9 9 9 8 8 8 7 9 8 7 7 7 6 7 8 7 7 9 10 10 10 11 12 12 12 13 13 12 12 12 12 11 12 11 10 11 10 9 10 9 9 10 9 8 8 8 8 8 9 8 8 8
101 8 9 9 9 9 9 9 9 10 10 11 10 10 10 9 9 9 9 9 8 8 10 9 9 9 9 10 10 10 9 7 7 8 8 9 8 8 8 9 8 8 8 7 7 6 5 4 4 5 5 4 5 4 4 4 4 5 5 6 5 5 6 6 7 7 6 7 7 6 6 7 6 8
95 8 8 8 8 7 7 6 6 6 6 5 6 5 6 8 7 7 6 6 6 6 8 8 7 7 8 7 7 8 8 8 8 8 8 8 8 9 8 8 8 8 9 10 11 11 11 10 9 9 10 11 11 11 11 10 9 9 9 9 7 7 7 7 7 7 7 8 6 7 7 6 6 6 6
88 6 6 6 6 7 7 6 6 7 9 9 7 8 8 7 6 7 7 9 10 10 10 11 12 11 12 13 13 16 17 18 18 18 16 13 13 13 10 7 8 8 8 9 7 6 6 6 6 6 7 6 7 7 7 6 6 7 7 6 7 6 6 6 7 8 6 6 6 6 6 6 6 6 6
82 6 5 5 5 5 5 5 6 7 7 7 7 7 7 6 5 6 5 5 6 5 6 7 6 5 6 5 5 6 4 4 4 5 6 6 7 7 6 6 7 6 8 8 10 9 8 7 8 8 7 6 6 5 6 5 5 5 4 4 3 4 6 6 5 4 5 5 6 6 5 7 7 6 7
75 7 7 7 8 7 6 6 7 7 6 5 6 6 6 6 6 6 5 6 6 5 6 7 7 6 7 8 7 7 8 7 8 9 9 10 11 11 9 8 10 10 11 12 12 12 11 11 11 11 10 11 11 12 13 15 16 18 21 25 30 35 39 46 54 63 73 84 96 110 123
69 123 135 147 158 165 167 166 159 149 135 120 105 90 77 65 55 47 40 34 29 26 24 21 20 18 16 15 15 14 14 12 12 12 13 12 12 13 11 11 12 12 11 12 13 13 12 11 11 9 8 9 10 10 9 10 9 10 10 10 10 9
63 9 9 9 8 8 6 6 6 6 5 6 5 5 5 5 6 5 5 5 4 4 4 4 4 3 4 3 3 4 5 4 4 4 5 6 6 6 5 6 4 5 6 5 5 6 6 6 6 6 6 6 5 5 5 6 5 5 5 5 5 5 6 6 7 7 6 6 6 5 5 4 5 4 5
57 5 5 7 6 5 6 5 4 3 5 6 4 4 4 4 5 5 5 6 6 6 4 5 5 4 5 5 5 4 4 6 4 5 5 6 4 5 6 6 6 5 5 4 4 5 6 7 9 8 8 10 10 10 12 15 17 19 19 21 23 24 26 28 28 28 27 25 23 21 18 16 14 12 10
50 10 9 9 8 7 7 7 6 7 6 6 6 7 7 6 5 4 4 5 6 5 4 3 3 5 6 5 6 6 6 5 4 4 5 5 5 4 5 5 5 4 4 4 4 5 5 5 4 3 4 4 4 4 4 4 4 4 3 4 3 3 4 4 3 2 2 4 5 4 2 3 4 4
44 4 4 4 5 4 3 4 3 4 4 4 3 3 3 2 3 3 4 4 5 4 4 4 5 4 4 4 4 4 5 5 5 4 4 4 5 4 4 5 6 6 6 5 4 4 4 5 4 2 3 4 3 3 4 4 5 4 4 4 2 3 3 3 3 2 3 3 3 3 5 4 4 4 5
37 5 6 5 5 4 3 4 4 4 3 3 2 3 3 2 3 4 3 3 4 4 4 4 4 3 5 6 6 7 6 5 5 4 5 5 4 4 3 3 4 5 5 5 4 4 5 4 4 2 3 4 5 4 4 4 5 5 4 4 3 4 4 3 4 4 5 5 4 5 5 5 6 4 3
30 3 3 5 4 5 5 4 4 3 4 5 5 4 2 3 4 4 4 4 4 4 3 4 4 3 3 4 4 3 2 3 3 3 3 3 2 3 5 4 3 4 4 4 5 4 4 5 6 5 4 3 4 3 3 4 4 3 4 5 4 4 4 4 5 5 4 3 3 3 3 2 3 3 5
24 5 4 4 5 4 4 4 5 3 4 3 4 3 4 4 4 4 5 5 5 4 5 5 4 5 4 4 3 2 4 4 2 3 2 4 3 3 3 3 3 3 4 4 5 4 3 3 3 3 2 3 4 4 4 4 3 5 5 5 4 2 2 4 4 3 3 5 6 5 4 4 3 4 3
17 3 2 2 3 4 5 4 3 3 4 4 5 3 3 4 4 6 4 4 5 4 4 5 3 3 4 4 4 3 3 5 4 4 4 4 4 4 5 5 4 4 4 4 3 3 4 4 4 4 2 3 4 3 4 5 4 4 3 3 3 3 4 5 5 4 4 4 5 4 5 3 4 5 6
10 6 5 4 4 5 5 4 4 4 5 5 5 4 4 3 4 3 2 2 3 3 3 3 3 3 4 5 4 6 5 5 4 4 5 5 5 6 6 6 8 8 9 8 9 8 8 9 9 9 9 8 7 9 6 6 7 6 5 5 5 5 7 7 8 8 7 7 7 7 9 10 9 9 11
4 11 12 13 14 13 13 13 13 12 11 9 10 10 9 8 10 10 11 11 11 12 14 17 20 23 27 32 38 46 55 65 77 90 104 120 138 157 180 205 226 242 251 248 232 208 185 159 131 109 92 76 62 50
-1 50 42 37 33 28 26 24 20 20 18 16 15 15 14 13 12 12 13 13 12 12 12 12 13 14 14 12 12 13 13 11 10 10 8 8 8 7 6 5 5 5 6 5 4 5 6 5 5 5 5 5 5 5 4 5 5 5 4 4 5 4 4 4 4 4 4 4 4 4 4 3 4 5
-8 5 5 5 4 3 3 4 4 4 4 4 3 3 4 4 3 3 3 3 4 4 4 5 6 6 6 5 4 3 4 5 4 4 4 4 3 3 3 4 5 6 6 6 6 7 7 8 8 8 8 7 7 7 8 7 6 6 6 6 4 5 4 5 5 4 3 4 3 4 5 4 4 3 2
-14 2 3 3 2 3 2 2 3 4 5 5 4 5 4 5 5 3 3 4 4 3 3 3 4 4 4 4 5 5 4 4 4 4 3 2 3 3 3 3 3 2 2 3 4 3 3 3 3 2 3 4 4 4 4 4 4 3 2 2 2 3 3 2 2 4 3 3 4 4 4 4 4 4
-21 4 2 2 4 5 4 3 3 3 3 3 4 3 3 3 4 4 4 4 4 4 5 3 3 2 2 2 2 3 3 3 4 3 3 2 3 4 4 5 6 5 3 5 4 4 4 2 3 3 3 3 3 3 4 4 4 5 4 4 4 4 3 4 4 4 3 3 3 3 4 4 4 4
-27 4 4 4 4 3 3 4 3 3 3 2 2 2 3 2 3 4 4 4 4 4 3 1 2 2 2 2 2 1 3 3 4 4 3 3 4 4 4 3 3 2 2 4 4 4 4 4 3 3 3 3 4 4 5 4 3 3 3 3 4 4 4 3 3 3 4 4 3 4 4 4 4 3
-34 3 2 4 4 2 4 3 3 3 3 3 4 3 3 3 3 5 4 4 5 5 5 5 4 4 4 4 4 5 5 4 4 5 5 5 3 2 2 4 5 4 4 4 4 5 4 5 5 5 5 4 3 3 3 3 3 3 4 4 3 3 3 5 4 3 3 3 3 3 3 1 1 3
-40 3 3 3 4 3 4 4 3 3 4 2 2 3 3 3 3 4 2 2 3 3 3 3 3 3 3 3 3 3 2 3 3 4 4 3 3 4 4 3 3 3 4 4 4 5 3 3 3 4 4 4 4 3 3 3 5 5 5 4 3 3 4 4 3 3 3 3 4 4 3 2 3 3
-47 3 2 2 2 2 3 3 2 1 3 2 2 2 2 2 2 3 3 3 4 4 5 4 3 3 3 3 2 1 2 3 2 3 4 3 3 2 3 3 4 3 2 3 5 4 2 4 4 3 3 3 4 3 3 4 4 3 4 4 4 3 3 3 3 3 4 5 5 4 3 2 3 4
-53 4 3 3 3 4 3 3 3 3 2 2 3 3 3 2 2 2 2 2 2 3 3 3 3 4 4 4 3 3 3 4 5 4 4 3 4 5 4 3 3 3 4 3 3 3 4 4 3 3 3 2 3 5 4 3 3 4 4 3 3 3 3 3 4 4 3 3 3 3 2 3 3 3
-60 3 5 4 3 5 4 4 4 4 3 3 4 3 5 5 5 4 4 3 3 3 3 4 4 4 3 3 3 3 2 4 4 4 5 5 4 4 4 3 3 5 4 4 4 4 3 4 4 3 2 3 4 3 4 5 5 5 3 3 4 5 4 4 4 4 3 2 2 3 3 4 4 4
-66 4 3 4 5 4 4 4 4 4 4 4 4 4 3 3 4 3 4 4 3 2 3 3 3 2 2 3 3 2 3 4 2 3 3 3 3 3 3 4 4 5 3 3 3 2 2 2 3 4 4 4 4 3 3 3 4 4 4 4 4 3 2 4 3 2 2 3 4 3 3 2 2 3
-73 3 4 5 4 4 3 4 3 2 2 3 3 4 3 3 2 3 3 5 4 4 3 2 2 4 3 3 3 3 4 4 4 3 3 4 3 3 5 4 3 4 4 3 3 4 4 4 3 3 3 3 3 3 4 4 3 3 3 4 4 4 3 3 3 3 2 4 5 4 4 4 3 2
-80 2 2 3 3 3 4 4 4 2 2 3 5 5 4 5 5 3 2 4 3 2 3 5 4 2 2 2 2 3 2 2 3 3 4 4 4 3 4 4 3 4 4 4 3 3 3 4 4 2 3 3 2 3 2 2 3 2 3 3 2 3 3 2 2 3 4 3 2 3 3 3 2 2
-86 2 3 4 3 4 4 3 3 4 4 5 4 5 4 3 2 2 2 4 5 5 3 2 4 3 3 3 4 4 3 3 4 3 4 4 3 4 2 3 3 3 4 3 3 3 2 2 3 3 3 2 2 4 4 2 3 3 5 3 3 3 2 3 3 2 3 2 3 3 3 2 4 4
-93 4 3 3 3 2 3 4 3 3 4 3 4 4 3 2 1 3 4 4 3 3 2 3 3 3 3 3 3 3 3 3 2 2 3 2 2 3 3 2 2 3 3 3 3 2 2 3 3 2 2 3 3 3 2 2 2 2 2 2 2 2 2 2 2 2 3 3 3 3 3 2 3 3
-99 3 3 3 3 4 4 2 1 1 1 3 2 2 3 3 3 4 5 4 3 2 3 3 2 4 3 3 2 2 3 3 2 3 5 3 3 3 3 4 3 3 3 4 5 4 5 4 3 3 3 2 2 2 2 2 3 3 3 4 3 3 4 3 3 3 3 4 5 4 4 3 2 2
-106 2 3 3 3 3 2 1 1 2 2 3 2 2 2 3 4 4 4 2 1 1 2 2 3 3 2 2 2 1 1 2 4 3 2 3 4 4 3 3 4 3 2 4 4 4 3 4 3 2 2 2 3 3 5 4 4 5 5 4 4 4 4 4 3 4 4 3 3 3 3 2 3
-112 3 4 4 4 3 3 4 3 3 3 2 3 4 4 3 2 2 3 3 3 2 3 3 3 3 2 2 3 3 2 2 3 3 2 2 2 2 3 3 3 3 4 4 3 2 3 3 3 3 2 3 4 4 2 1 2 2 3 3 2 4 4 4 4 5 4 5 4 2 3 3 3
-119 3 3 4 5 4 3 3 2 2 2 2 2 3 3 4 3 3 2 4 4 4 3 1 2 2 3 4 3 3 3 3 3 3 2 2 4 3 2 3 3 2 3 4 3 4 3 3 3 3 4 4 3 4 5 3 1 2 3 4 4 3 3 3 5 4 4 5 4 3 3 3 2
-125 2 2 2 3 4 3 2 3 3 4 4 3 3 3 3 3 3 2 3 3 4 4 3 2 3 4 3 3 2 2 2 3 4 3 2 2 3 2 3 4 4 3 3 5 5 2 2 2 3 3 2 3 3 2 2 3 3 3 3 2 1 1 2 4 4 3 4 4 4 4 3 3
-131 3 3 3 2 2 4 4 3 3 4 4 5 4 4 3 3 4 4 5 3 3 3 3 3 4 5 4 4 4 4 4 3 4 4 4 3 4 4 3 3 3 3 3 3 4 2 2 3 4 4 4 4 3 2 1 2 3 2 2 3 3 3 4 3 3 2 3 2 3 1 2 3
-138 3 1 2 3 2 2 3 3 3 2 3 4 3 2 2 2 3 3 1 2 3 2 2 4 3 2 2 2 2 3 3 2 3 4 3 3 1 2 3 3 2 4 4 3 3 2 3 4 4 4 4 5 5 4 3 4 3 4 2 2 3 2 2 4 4 4 3 2 4 5 5 4
-144 4 4 5 4 3 3 3 2 3 4 3 2 2 3 3 3 4 5 4 3 3 3 3 3 3 4 4 4 4 5 4 3 3 4 3 4 3 2 3 2 2 2 2 2 3 4 3 4 4 4 3 2 3 4 3 2 3 3 2 2 2 2 2 2 3 3 3 4 4 3 3 4
-151 4 4 4 4 3 2 3 4 3 2 3 3 3 3 3 3 2 2 2 3 3 4 2 2 3 2 2 3 4 4 3 4 5 4 4 3 3 3 3 4 5 4 4 3 3 4 3 2 2 2 3 3 2 2 3 4 3 3 2 2 2 2 3 3 3 3 3 3 4 3 4 4
-157 4 3 3 3 3 4 3 4 3 3 3 3 4 4 3 2 2 3 3 2 2 2 2 4 3 2 2 2 2 3 3 3 3 3 3 4 3 3 4 3 4 3 3 3 3 3 4 3 4 3 3 4 4 3 3 3 3 3 5 4 4 4 4 4 4 5 3 2 2 3 3 3
-164 3 2 2 3 4 5 4 3 3 3 4 3 3 4 3 4 4 3 3 2 2 3 3 3 4 3 3 4 3 3 5 4 4 4 4 4 3 3 1 3 2 2 2 3 3 4 3 3 3 3 5 4 4 3 2 4 3 4 5 3 2 3 3 4 4 5 5 5 3 4 4 4
-170 4 3 3 2 1 2 2 2 3 4 3 3 4 3 3 3 3 3 4 3 2 3 3 4 3 3 4 4 4 3 2 3 3 4 4 5 4 4 4 4 4 5 3 2 3 3 3 3 3 2 2 2 2 2 3 3 2 2 4 3 3 3 3 3 4 3 4 4 4 3 2 3
-177 3 2 3 4 4 3 3 4 3 3 2 2 3 3 4 2 3 4 3 3 2 2 2 2 2 2 4 5 4 5 3 3 5 3 2 2 3 3 4 3 3 4 4 3 4 3 2 3 4 3 5 5 6 5 4 2 1 3 3 3 2 2 3 2 3 3 3 2 2 1 0 2
-183 2 3 2 2 2 2 3 3 3 3 3 2 3 3 3 3 3 2 2 1 1 3 3 3 3 3 3 2 3 3 3 3 3 3 4 5 5 6 5 3 4 4 3 3 4 3 3 4 3 3 2 2 2 2 2 3 2 3 3 2 3 4 4 3 4 3 2 2 4 3 4 3
-190 3 2 4 3 4 4 4 5 3 3 2 3 4 3 3 3 3 3 3 3 2 3 3 2 2 1 3 2 3 2 3 3 4 3 2 3 4 4 4 3 3 3 4 4 4 5 4 4 4 2 1 2 2 1 3 4 3 3 2 2 3 2 3 3 3 3 3 3 2 2 2 2
-196 2 1 2 3 2 3 2 2 2 3 3 2 4 4 3 3 4 3 4 4 3 3 2 2 2 3 3 3 2 2 2 2 3 3 3 4 2 3 4 3 3 3 3 3 4 4 3 3 2 2 2 2 2 3 2 4 4 5 4 3 4 4 4 4 4 4 3 3 3 3 3 2
-202 2 3 4 4 3 3 4 5 4 3 3 3 3 3 3 4 4 3 2 2 3 4 2 2 3 5 4 3 4 3 4 5 5 5 4 4 3 2 3 4 4 4 3 4 3 3 2 3 3 3 3 3 3 3 3 4 3 2 2 2 2 2 4 3 2 1 2 3 2 3 3 2
-209 2 2 3 2 3 3 3 3 4 2 3 2 2 3 3 3 3 3 4 3 2 3 3 4 4 3 3 3 2 2 3 3 4 2 2 3 4 4 3 3 2 2 3 4 3 3 4 4 2 2 2 2 3 3 5 3 2 2 2 3 4 4 3 3 3 4 4 3 3 3 3 3
-215 3 3 3 2 2 4 4 3 3 3 2 1 2 2 2 3 3 4 3 2 1 1 3 3 3 2 2 2 1 2 2 2 2 3 3 4 4 3 4 4 3 4 4 4 5 4 3 4 4 4 3 2 1 1 2 3 3 2 2 3 3 3 3 3 5 3 3 3 3 3 2 3
-222 3 3 3 3 2 2 1 1 2 3 3 2 2 2 2 2 3 3 2 3 3 3 2 3 4 3 2 2 1 3 2 3 3 3 3 2 2 2 3 3 3 2 3 3 2 3 3 3 3 3 3 2 3 4 2 1 2 2 4 4 3 3 2 3 3 3 4 3 2 2 2 2
-228 2 3 4 4 4 3 2 2 3 3 3 3 4 4 3 2 3 4 3 3 2 3 2 2 3 3 4 3 4 4 4 4 4 3 3 3 2 3 4 5 4 3 3 3 4 3 2 2 3 3 2 2 2 2 2 3 3 2 2 2 3 3 4 3 4 2 3 3 4 4 3 3
-235 3 4 3 3 3 2 2 2 2 1 3 2 2 2 2 3 3 2 2 3 3 3 3 2 2 2 2 2 3 2 2 3 3 3 3 5 4 4 4 2 3 5 5 5 3 2 3 3 2 2 2 2 3 3 2 3 4 3 3 4 4 4 3 2 3 4 3 4 4 4 4 3
-241 3 4 3 3 4 4 4 2 2 2 2 2 2 4 4 2 2 2 3 2 2 3 3 3 3 3 3 5 4 3 4 4 2 3 3 4 3 3 2 2 3 2 2 3 3 3 3 4 3 2 3 3 3 3 3 3 4 4 4 5 5 3 3 3 3 3 3 5 3 2 3 3
-248 3 3 4 3 3 4 3 3 2 3 3 2 3 2 2 2 3 3 2 3 3 2 3 4 4 4 4 3 4 4 4 4 5 4 4 3 3 4 3 4 4 3 3 3 2 2 2 2 2 3 4 3 4 4 3 2 1 2 3 4 3 3 3 3 3 4 5 5 5 3 1 3
-254 3 2 2 3 4 4 3 5 5 4 4 3 2 2 3 2 2 2 3 2 2 1 2 3 4 3 1 2 3 2 3 4 4 4 3 4 3 3 3 4 5 5 5 3 3 4 3 4 3 3 3 3 2 3 4 3 3 4 3 4 3 3 3 2 2 2 3 3 4 4 3 3
-260 3 3 2 3 3 3 3 3 2 2 2 2 2 2 2 2 2 3 3 3 3 2 3 3 3 1 3 3 2 2 2 2 2 2 2 2 2 3 3 2 2 1 1 2 3 3 2 2 3 3 2 4 3 3 3 1 1 3 4 5 4 3 4 3 3 3 3 2 1 2 1 3
-267 3 4 3 3 3 4 4 3 3 4 3 3 3 4 2 2 4 4 3 3 2 3 2 4 5 5 3 2 2 3 3 3 4 4 4 3 3 2 3 4 2 3 4 5 5 5 4 3 4 4 3 3 4 4 4 3 4 4 4 4 4 3 2 2 2 3 3 3 2 3 3 3
-273 3 2 2 3 4 4 4 2 2 3 2 2 2 3 3 3 4 3 2 2 3 2 3 4 5 4 3 2 3 3 2 3 3 2 3 3 3 4 3 3 3 2 2 3 3 3 3 3 3 3 3 3 4 5 4 4 4 2 4 4 4 3 3 2 2 2 2 3 4 3 3 2
-280 2 2 2 3 2 2 3 4 3 3 3 3 3 3 4 4 4 3 3 3 4 3 5 4 4 4 3 4 3 2 1 1 3 3 2 4 3 2 3 3 2 3 3 3 3 4 3 4 5 4 3 2 3 3 4 2 3 3 3 2 3 4 3 3 4 3 2 2 3 4 3 4
-286 4 3 3 2 1 2 3 5 4 3 4 3 3 2 3 3 3 2 3 4 2 3 2 2 3 2 3 3 3 3 3 4 4 2 2 3 3 2 2 2 1 1 2 3 2 2 2 2 2 3 4 4 4 3 3 3 3 3 3 4 4 3 4 4 3 2 2 4 4 5 4 4
-293 4 4 3 3 2 2 2 3 4 3 3 3 1 2 3 3 3 4 3 3 3 3 4 4 3 2 3 2 3 4 3 4 4 3 4 4 2 2 3 2 3 3 3 4 2 2 1 1 3 5 4 3 3 3 3 2 3 2 1 1 1 1 1 2 2 2 2 2 3 3 3 4
-299 4 4 3 2 2 3 3 4 4 3 2 3 3 4 3 3 3 2 2 2 3 5 4 3 2 4 4 3 2 2 2 2 4 4 3 4 4 3 4 4 4 3 4 3 3 4 3 2 3 4 3 3 2 3 2 2 3 5 4 3 3 4 3 3 3 3 2 2 1 1 2 2
-306 2 3 3 3 2 2 2 2 1 1 2 2 3 4 4 4 3 2 2 3 4 4 4 4 4 3 3 4 3 3 2 3 3 3 4 4 3 4 3 4 4 4 5 5 3 4 3 3 3 3 2 2 3 3 2 3 3 3 4 5 4 3 3 3 2 3 3 1 3 2 3 2
-312 2 2 3 5 5 3 4 3 4 4 4 4 3 3 3 3 3 3 3 3 4 4 3 3 2 2 2 2 3 4 3 3 2 3 2 3 2 2 1 2 3 3 5 4 4 3 3 3 2 3 2 2 3 2 0 1 3 3 2 2 2 3 5 4 2 3 4 4 3 2 1 2
-319 2 4 4 4 3 1 1 3 4 3 2 2 2 3 3 4 3 2 3 3 3 2 3 3 2 3 3 4 4 4 5 4 3 3 2 3 2 1 2 3 2 3 3 2 2 1 3 3 3 4 4 3 3 3 3 3 3 3 4 2 2 2 3 3 2 2 3 3 2 3 3 2
-325 2 2 2 3 3 3 4 3 2 2 4 4 4 4 3 2 3 3 3 4 4 3 4 3 3 3 3 3 3 4 4 2 2 2 3 3 2 2 3 4 3 3 3 4 3 3 3 3 3 3 4 5 5 3 3 4 3 3 4 3 3 3 2 2 3 2 4 5 4 3 2 3
-331 3 3 4 4 5 3 2 2 2 1 2 1 1 3 5 4 3 4 4 4 3 3 2 1 2 1 1 1 2 2 3 3 2 1 2 2 3 4 4 4 3 3 3 2 2 3 4 3 3 2 3 3 2 2 2 1 2 2 3 3 3 2 1 3 4 4 4 4 4 4 4 4
-338 4 4 4 3 2 1 2 2 2 3 4 3 3 3 3 3 3 4 4 3 2 2 4 3 1 2 3 3 4 3 3 2 2 2 3 4 4 3 1 2 3 2 2 3 2 2 2 2 2 2 3 3 4 3 3 4 5 5 4 3 2 3 4 4 4 3 3 3 4 4 3 3
-344 3 3 3 2 2 3 3 3 3 3 3 3 2 2 3 3 3 2 4 4 3 3 3 3 3 2 3 2 2 2 3 3 3 3 2 3 4 3 2 2 2 2 2 2 3 3 1 1 1 2 4 4 3 2 4 3 3 3 2 2 2 2 2 2 2 1 3 4 3 3 1 1
-351 1 2 3 2 2 2 3 4 3 1 3 4 3 3 3 2 3 3 3 2 3 3 4 4 3 3 2 2 3 2 3 4 4 4 2 2 1 2 3 2 2 2 2 4 6 5 2 1 1 4 4 3 3 3 3 2 2 3 3 3 3 4 3 2 2 2 2 2 3 3 2 3
-357 3 3 4 5 3 3 4 4 3 2 2 2 1 2 3 3 3 2 3 3 4 4 4 3 4 4 3 2 2 3 2 2 3 3 3 4 4 4 3 3 4 4 4 4 5 4 3 3 3 3 2 3 4 4 2 2 2 3 3 2 4 3 3 2 2 3 3 4 3 2 2 2
-364 2 2 2 2 3 3 3 2 3 4 4 2 3 1 2 3 2 2 1 2 2 2 3 3 2 3 2 3 3 3 2 2 2 2 3 3 3 3 3 3 3 3 3 3 3 3 1 2 2 3 4 4 4 2 3 4 5 4 3 2 3 4 4 3 3 3 3 4 3 3 4 3
-370 3 2 2 3 3 3 3 3 4 4 5 5 5 4 3 3 3 3 3 3 3 2 2 1 2 3 3 3 3 4 4 4 5 3 4 3 2 3 2 2 2 3 3 3 3 2 2 3 3 3 4 3 3 3 3 3 2 3 3 1 3 3 2 2 3 4 4 3 4 4 2 3
-377 3 4 3 3 2 3 2 1 1 1 2 3 3 3 1 2 3 3 3 2 2 3 4 4 3 3 4 3 3 2 2 4 4 3 2 2 2 3 3 3 2 2 3 3 4 3 2 3 3 4 3 2 3 3 2 2 2 2 2 4 4 4 3 3 3 3 4 4 3 3 3 4
-383 4 4 3 4 3 2 2 3 3 3 1 2 2 4 4 3 3 4 3 3 3 3 4 4 4 3 3 2 2 3 2 3 4 4 4 3 3 1 1 3 4 3 2 4 5 5 3 4 4 3 3 3 2 3 2 4 3 3 2 2 2 3 4 3 2 2 1 2 2 3 3 2
-389 2 2 2 2 3 1 2 3 2 2 2 4 2 3 2 3 3 2 2 3 4 4 5 3 3 2 3 4 2 2 2 2 3 3 3 3 4 3 3 3 4 3 3 2 3 3 3 2 2 2 2 2 3 3 3 4 3 2 2 3 4 3 4 4 2 3 3 3 3 3 2 2
-396 2 2 3 3 2 2 3 2 2 2 3 4 5 3 3 4 4 3 3 3 2 3 3 3 3 2 2 1 2 2 3 3 3 3 2 3 3 3 3 3 4 3 3 3 3 2 2 2 2 2 2 2 2 3 3 3 3 3 3 4 4 3 3 3 3 3 2 2 2 2 3 2
-402 2 1 3 3 3 4 4 4 4 3 3 2 2 2 3 3 3 3 2 1 3 3 3 3 2 3 2 2 3 3 2 3 3 3 3 2 2 2 2 2 3 3 4 3 2 2 1 2 3 2 1 2 2 3 2 1 2 3 3 3 3 3 3 3 2 1 2 3 3 2 2 2
-409 2 2 3 3 2 3 3 1 0 2 3 3 2 3 3 3 4 5 5 3 4 2 3 4 3 3 2 2 3 4 5 4 4 4 4 4 4 3 1 1 2 3 4 4 3 2 2 3 5 3 3 3 2 3 2 3 3 3 2 3 3 2 1 2 2 2 3 3 3 2 3 4
-415 4 4 3 3 4 4 3 3 3 3 2 2 2 2 2 2 2 3 2 3 3 4 3 3 4 2 2 2 3 3 3 3 2 2 2 3 2 4 4 2 2 3 2 3 3 4 4 4 3 3 1 2 2 2 1 2 4 2 1 3 4 2 3 4 3 3 3 3 3 3 4 2
-422 2 2 2 2 3 4 4 4 4 4 4 3 2 2 2 2 1 1 2 3 2 3 3 4 4 4 3 3 3 3 3 3 3 3 3 3 4 4 4 4 4 3 3 3 3 2 2 3 3 3 2 3 3 2 2 3 3 2 3 3 2 3 2 2 3 5 5 4 3 3 1 1
-428 1 3 3 4 4 3 2 2 3 3 4 4 3 2 2 3 3 3 3 3 2 2 3 3 2 2 2 2 2 2 2 2 3 5 3 3 3 3 4 4 4 3 3 2 4 5 3 4 4 5 3 4 5 5 3 2 3 2 2 1 2 2 3 3 1 4 5 4 3 2 3 4
-435 4 4 3 1 0 1 2 3 3 3 3 3 3 3 4 4 3 2 2 2 3 2 3 4 3 4 5 4 3 3 3 3 3 2 2 3 3 4 3 4 3 2 3 2 2 3 2 3 2 3 2 2 2 2 2 3 4 3 4 4 3 4 4 3 3 2 2 3 4 3 3 3
-441 3 3 3 4 3 4 4 3 3 1 2 3 2 3 3 3 4 4 4 3 4 4 2 3 4 3 4 5 4 3 3 2 2 3 3 2 4 4 3 1 3 3 4 2 2 3 2 2 2 4 4 3 3 2 2 2 3 3 4 3 3 4 4 4 3 3 2 3 3 3 2 2
-447 2 3 4 2 2 3 3 3 3 3 3 3 2 3 3 3 3 3 3 3 2 2 3 4 3 3 3 3 2 2 2 3 3 2 4 2 3 3 3 3 4 3 3 3 3 3 2 2 3 3 2 2 3 3 3 2 3 4 3 4 3 2 1 1 3 3 3 3 2 2 2 2
-454 2 3 4 3 3 1 2 2 4 4 4 4 3 3 4 3 4 2 3 3 2 3 3 3 5 4 4 3 3 4 4 3 1 2 3 3 4 4 4 5 4 4 3 3 4 4 3 2 3 3 4 4 4 4 4 4 3 3 2 2 3 2 1 2 3 2 3 3 3 2 2 3
-460 3 5 5 4 3 3 2 2 3 3 4 4 3 3 2 2 2 3 3 2 3 3 3 3 3 3 2 2 3 4 4 4 3 2 2 1 0 0 1 2 3 4 3 3 2 2 2 3 3 2 3 2 2 2 3 3 2 3 3 3 4 4 3 3 2 2 2 2 3 3 3 3
-467 3 4 3 1 2 3 3 3 3 3 1 1 2 3 2 3 4 3 2 3 2 3 4 3 2 1 2 2 2 2 3 2 2 2 2 4 3 2 3 3 2 3 3 3 3 2 1 1 2 2 2 1 1 2 2 2 2 1 2 2 2 3 4 4 3 2 2 3 3 3 3 4
-473 4 4 3 3 4 5 3 2 3 3 3 3 3 2 2 2 3 2 2 3 2 2 2 3 2 1 3 3 3 4 3 2 3 3 2 2 3 3 3 3 4 3 3 3 2 2 2 2 3 3 4 3 2 3 3 3 4 3 2 2 3 3 2 2 3 4 3 3 3 2 3 3
-480 3 4 4 3 4 5 3 2 2 3 3 3 2 4 4 3 3 2 3 3 4 4 4 3 3 3 3 3 2 1 2 3 2 3 3 3 4 4 3 3 4 3 2 4 3 3 3 3 3 2 2 3 2 1 2 2 2 3 3 3 3 2 3 3 2 1 2 2 2 3 2 2
-486 2 2 4 3 3 2 2 2 2 2 1 1 2 1 2 2 2 2 3 4 5 3 3 4 3 4 4 3 2 2 3 4 4 3 4 3 3 3 3 3 2 2 3 2 2 2 1 1 2 3 3 3 3 3 3 2 3 3 3 3 4 2 3 5 4 4 4 3 2 2 4 3
-493 3 2 2 2 2 3 2 3 4 3 3 2 4 3 2 3 3 3 2 2 2 3 3 3 2 3 3 3 3 3 3 2 2 2 3 4 4 3 3 3 4 4 3 2 3 4 3 2 3 3 3 4 3 2 2 2 2 4 5 4 4 4 3 2 2 4 2 2 4 4 2 2
-499 2 2 2 2 3 4 4 3 2 3 3 3 2 2 2 2 1 2 4 4 4 4 3 2 2 2 2 3 3 3 2 2 2 3 4 4 3 2 3 2 3 2 3 2 2 3 3 3 4 3 4 4 3 2 3 3 2 1 2 3 3 3 2 4 4 3 3 3 3 3 3 4
-506 4 3 3 2 2 2 1 1 1 2 3 2 2 2 1 2 4 5 4 4 4 2 2 2 3 4 4 2 3 4 4 3 3 2 2 2 2 2 2 3 4 3 4 3 3 2 2 2 3 3 3 3 2 2 2 3 3 3 3 3 4 3 3 2 2 4 3 3 3 4 4 4
-512 4 4 2 3 4 4 2 3 4 3 3 3 3 4 3 2 3 3 3 3 2 3 3 2 3 3 3 3 3 3 4 4 3 3 3 3 3 4 4 4 3 5 5 3 3 3 3 2 3 3 4 4 4 4 4 3 2 2 2 2 3 3 2 3 2 2 2 3 3 2 3 2
-518 2 2 1 2 2 3 4 4 3 4 4 3 4 3 2 3 3 3 2 3 2 3 4 3 2 3 2 2 3 3 3 3 2 3 4 4 4 3 3 3 2 2 2 1 2 3 3 4 3 3 3 3 3 4 3 2 3 4 2 1 2 3 2 3 3 4 2 2 3 4 4 3
-525 3 3 4 5 3 2 2 2 3 2 2 2 3 2 2 2 3 4 5 5 3 2 3 3 2 4 5 4 4 4 3 3 2 2 2 4 3 3 4 3 2 2 2 4 4 4 4 3 3 4 3 4 4 2 2 2 2 2 3 1 1 1 3 4 4 3 5 4 2 3 2 3
-531 3 2 2 3 2 2 2 1 2 3 3 3 2 2 4 3 1 1 2 3 3 4 3 4 3 2 2 2 2 2 3 3 3 3 3 2 2 2 4 4 4 3 3 2 3 3 4 4 3 3 2 3 4 2 0 2 3 2 2 4 2 2 2 2 3 2 1 2 3 3 3 4
-538 4 4 4 4 2 2 3 3 3 3 3 3 3 4 5 4 3 2 2 2 3 2 3 3 2 4 3 2 3 3 2 3 4 4 3 4 3 4 3 2 2 1 3 3 4 4 5 3 3 2 2 1 1 3 2 3 4 3 2 2 1 3 4 4 3 3 3 2 4 3 2 3
-544 3 3 1 2 3 2 1 2 2 2 3 2 3 4 4 5 4 2 3 3 1 2 3 3 3 3 3 3 3 2 2 2 2 2 1 2 3 3 2 2 3 3 3 3 3 2 3 5 4 3 2 1 2 3 3 4 4 3 3 4 3 3 2 3 3 3 3 2 2 2 2 2
-551 2 3 3 3 3 4 4 3 3 3 2 3 3 4 4 2 1 1 3 3 2 3 3 3 3 3 2 2 2 3 4 4 5 4 4 2 3 2 2 3 3 3 3 3 2 3 3 2 3 4 4 3 3 2 2 3 3 2 2 2 3 2 3 3 2 2 3 3 3 2 2 3
-557 3 2 3 3 3 2 3 3 3 4 4 4 2 2 3 3 4 4 3 2 3 2 3 4 3 2 2 2 3 2 3 2 3 4 3 3 3 3 3 4 3 3 4 5 3 3 3 4 2 1 2 4 3 3 2 2 3 2 1 1 2 3 2 1 1 2 1 2 3 4 4 4
-564 4 4 3 2 3 3 2 3 4 3 3 2 1 3 3 3 3 4 3 2 3 3 4 2 3 4 4 3 4 4 5 2 1 2 2 3 3 2 2 2 3 3 3 3 3 2 2 3 2 3 3 3 2 1 2 3 4 5 4 4 4 3 4 3 3 3 3 2 3 4 3 3
-570 3 3 2 3 4 3 3 2 3 3 2 2 2 3 3 3 3 2 2 3 3 2 3 3 3 4 2 1 3 4 3 3 3 3 2 3 2 1 2 3 3 3 3 3 3 4 4 4 3 3 3 3 3 2 1 1 3 3 3 3 3 3 3 5 4 3 2 3 3 2 2 2
-576 2 2 3 3 2 2 4 3 3 4 4 3 2 2 2 1 1 2 2 2 3 3 3 2 2 2 3 3 4 3 1 3 2 2 1 2 2 2 3 4 4 3 2 3 2 2 2 2 2 2 2 3 3 2 2 3 4 4 3 3 3 2 1 2 1 2 3 3 2 2 1 2
-583 2 3 3 3 3 2 2 4 4 3 3 3 2 2 2 3 3 3 2 1 2 3 3 2 2 1 1 2 2 3 3 3 3 2 3 4 3 3 3 3 3 3 3 2 2 2 3 4 4 3 3 3 3 2 2 2 2 3 2 3 4 3 3 3 2 2 1 0 1 2 2 2
-589 2 2 2 3 3 2 3 3 3 3 4 4 4 3 3 3 3 3 2 3 4 4 3 2 3 3 3 3 3 3 3 4 3 3 3 2 3 4 4 3 3 3 3 3 4 3 2 0 1 2 2 3 4 4 3 3 2 1 2 3 3 3 3 3 2 2 3 3 4 2 3 2
-596 2 1 2 2 3 3 3 3 2 2 2 1 2 3 3 3 4 4 4 3 2 3 3 4 4 1 1 2 2 3 3 3 4 4 3 4 4 4 3 3 3 2 2 2 2 2 2 4 3 2 3 4 3 2 3 3 2 3 2 2 1 2 3 3 2 4 4 4 3 3 3 3
-602 3 5 5 4 4 4 4 4 3 4 3 3 4 4 3 2 2 3 2 1 3 3 5 4 3 3 3 3 1 2 3 4 3 3 2 3 3 2 3 4 3 2 3 3 4 4 5 4 3 4 3 4 4 3 3 4 3 3 2 2 3 3 3 3 3 4 4 4 4 2 2 3
-609 3 3 3 2 2 1 2 2 1 0 1 2 3 3 2 2 3 3 4 4 3 3 3 2 3 4 4 3 3 2 2 3 3 2 2 3 2 3 3 2 3 3 3 3 4 4 4 4 3 3 4 3 3 3 4 4 3 4 4 2 1 2 3 3 2 2 3 3 2 2 1 3
-615 3 3 2 2 3 3 2 3 3 3 2 2 3 2 2 2 3 3 0 1 1 2 2 2 2 3 4 3 4 3 3 3 2 2 2 1 2 2 2 2 3 3 2 2 2 2 3 2 3 4 2 2 3 3 3 3 3 4 4 3 2 2 2 2 3 3 2 4 4 3 2 1
-622 1 2 4 3 3 3 2 1 3 3 2 3 3 2 4 5 4 4 4 3 3 2 2 2 2 3 2 3 3 4 3 4 3 3 3 2 2 1 2 3 2 3 3 3 4 3 2 2 2 2 2 3 2 1 3 3 2 2 2 3 3 2 3 3 3 3 4 4 3 4 3 2
-628 2 3 4 4 3 2 2 3 2 4 3 3 3 2 2 4 4 2 3 4 4 3 2 2 3 3 3 3 3 3 1 1 3 3 4 4 4 3 3 4 4 4 3 3 4 3 3 3 2 2 2 2 2 2 4 3 3 2 2 3 3 2 2 2 2 3 3 4 3 3 3 3
-634 3 3 3 2 3 3 3 3 3 3 3 3 3 1 2 2 3 3 2 3 3 3 2 2 2 2 2 4 3 4 4 3 4 3 4 3 3 3 3 1 2 3 3 3 2 2 2 1 2 2 2 2 3 1 1 3 4 3 2 2 2 2 2 2 1 1 1 2 4 4 3 3
-641 3 3 3 4 4 3 1 2 3 3 3 3 2 3 3 2 2 3 2 3 3 3 3 3 2 3 4 3 3 5 4 5 5 3 3 2 2 3 2 2 2 3 3 3 3 3 2 2 1 2 3 4 3 2 3 3 2 2 1 0 1 2 3 3 2 2 3 3 4 3 2 3
-647 3 4 3 4 2 3 3 3 4 2 2 2 2 2 3 3 2 3 2 3 3 3 2 2 2 3 2 3 4 3 5 4 4 4 4 3 3 3 3 4 3 3 4 3 4 3 3 2 2 2 2 5 4 4 5 4 2 3 3 3 3 3 2 3 3 2 2 3 2 2 2 2
-654 2 2 3 3 3 3 4 4 5 4 4 4 3 4 4 3 3 3 3 1 2 3 2 3 3 3 3 2 2 2 2 4 4 3 3 2 2 3 3 2 2 2 1 1 3 3 2 3 3 2 3 4 3 4 3 3 3 3 4 4 2 2 3 4 3 3 4 3 3 2 2 2
-660 2 3 2 2 2 3 3 3 3 3 4 4 2 3 2 2 2 3 3 3 3 3 2 3 4 3 2 3 3 4 3 2 3 4 4 3 3 2 2 3 3 2 2 3 2 2 1 2 2 1 1 2 3 2 2 2 3 3 4 3 3 2 2 3 4 4 4 3 3 4 4 3
-667 3 2 2 3 3 2 2 3 3 3 2 2 1 1 2 2 1 2 2 0 0 2 2 2 2 2 3 2 2 3 3 4 4 4 3 3 2 3 2 3 3 3 2 3 4 3 3 4 3 3 3 3 3 2 4 4 3 3 2 2 2 2 3 3 5 6 5 4 2 1 2 2
-673 2 1 2 4 4 3 4 3 2 4 3 2 1 2 2 1 1 2 3 3 3 1 1 2 3 3 2 2 3 2 2 1 1 1 2 3 4 3 2 2 2 2 2 1 2 3 4 4 3 1 2 2 2 4 4 3 2 2 3 2 2 3 3 4 3 3 4 3 3 3 2 2
-680 2 3 3 4 4 5 4 3 3 3 1 1 3 2 3 3 3 2 3 2 2 2 2 3 4 3 3 4 2 2 3 4 3 3 3 3 3 3 3 2 3 3 2 2 2 3 2 2 3 4 4 2 2 2 3 3 3 2 2 3 4 4 4 3 3 3 3 4 3 3 3 3
-686 3 3 2 3 4 4 3 2 3 3 2 2 2 2 1 2 2 3 2 3 3 4 2 2 2 2 3 4 4 4 3 2 3 3 2 2 1 2 2 2 4 4 4 3 2 2 3 3 3 2 2 3 3 3 3 2 3 3 2 2 2 2 3 4 3 3 3 2 0 0 2 4
-693 4 4 4 2 2 2 4 3 3 3 3 2 3 2 2 2 3 3 2 3 2 2 3 3 3 3 4 3 3 4 3 3 3 4 4 5 3 4 4 3 3 3 2 2 2 3 3 3 4 3 3 3 4 4 3 4 4 4 4 3 3 3 3 1 2 3 3 2 3 3 3 3
-699 3 1 2 3 3 3 3 3 3 3 3 2 3 3 2 3 3 2 2 4 3 3 2 2 2 2 2 2 2 2 3 3 2 2 2 3 4 4 3 3 2 3 3 4 2 1 2 3 2 2 2 3 2 2 3 3 3 2 3 3 3 2 3 3 3 2 1 1 3 3 3 4
-705 4 4 4 4 3 3 4 3 3 2 3 3 3 2 1 1 3 3 2 3 3 2 2 3 3 3 4 4 3 4 3 3 4 3 2 2 2 3 4 4 3 3 2 2 2 2 2 2 2 2 3 1 3 4 3 3 3 2 2 2 2 2 1 2 3 2 2 2 2 2 3 4
-712 4 4 5 3 3 3 2 3 3 3 3 4 4 2 2 3 3 3 3 1 1 3 3 2 2 2 4 3 3 3 3 3 1 1 1 2 2 2 2 2 2 2 1 2 3 4 3 3 3 3 2 3 3 2 2 3 2 2 2 2 2 3 2 3 3 2 2 3 3 2 2 2
-718 2 3 3 2 3 3 3 4 3 3 3 2 2 3 2 3 4 3 3 1 3 4 4 4 4 4 3 3 3 3 3 2 3 2 3 2 2 4 5 4 4 3 3 3 3 2 2 2 2 4 3 2 2 2 2 3 3 3 4 3 2 2 1 2 4 3 2 3 4 2 3 2
-725 2 2 2 1 2 2 3 1 2 2 1 1 1 1 0 1 2 1 2 3 4 4 2 2 3 3 4 3 3 2 1 2 1 2 2 3 3 3 3 2 4 3 3 4 4 3 2 2 3 2 2 2 2 3 3 3 3 3 3 3 2 2 2 2 2 2 3 3 3 2 2 3
-731 3 2 1 3 3 4 5 4 2 2 2 1 3 3 2 2 2 3 3 3 2 2 3 4 2 2 2 3 2 2 2 1 2 2 1 3 2 2 2 1 1 1 1 1 2 2 2 2 2 3 3 3 3 4 3 2 2 3 3 4 2 1 1 1 1 1 2 3 2 2 2 2
-738 2 1 2 2 2 3 3 3 1 2 2 2 3 3 4 4 2 1 2 3 2 1 2 3 3 4 3 3 3 2 3 3 2 1 1 1 1 3 3 3 2 4 3 3 3 4 4 4 3 2 2 2 3 3 3 3 3 0 2 2 2 1 3 3 4 2 2 3 3 2 1 1
-744 1 3 3 3 2 1 3 4 3 4 3 2 3 2 2 3 4 4 3 3 4 3 3 2 2 4 4 3 2 4 2 1 2 4 3 2 3 2 3 3 2 2 2 3 3 2 3 2 2 2 2 2 1 1 2 3 4 4 2 2 1 1 2 2 3 4 4 4 3 2 2 2
-751 2 4 3 3 4 4 3 3 2 2 2 2 2 3 3 3 4 3 3 3 2 2 2 3 3 2 3 4 4 4 3 4 3 2 3 3 3 3 2 2 3 2 1 2 2 3 3 3 3 2 2 2 2 2 1 2 3 2 3 3 2 2 2 2 2 3 3 3 3 3 4 3
-757 3 2 2 3 3 3 3 4 3 3 3 3 3 3 4 2 1 0 1 3 3 2 3 4 2 2 2 2 1 3 3 2 2 2 2 2 3 4 3 3 2 2 3 3 2 2 3 3 3 3 3 2 3 2 2 3 2 2 3 2 2 2 1 2 3 4 3 4 5 4 3 2
-763 2 3 3 2 2 3 3 2 2 3 3 4 3 2 2 3 3 2 2 2 2 4 3 4 4 3 3 2 2 2 3 3 2 2 3 3 3 2 2 2 2 3 3 2 2 2 3 3 2 1 2 2 3 3 3 3 2 2 3 3 3 4 2 1 2 3 2 2 2 2 2 2
-770 2 2 1 2 2 2 3 3 3 2 2 2 3 4 3 3 3 3 2 2 3 4 3 3 2 3 2 3 3 2 3 3 2 3 4 4 2 2 4 3 2 3 2 3 4 5 4 3 2 2 3 4 3 3 3 2 1 2 3 2 2 3 2 2 3 2 1 2 3 2 3 3
-776 3 2 3 3 3 4 5 5 4 2 1 0 1 2 3 4 3 2 3 2 2 2 2 2 1 2 2 3 3 2 0 2 3 2 4 2 2 3 3 3 3 3 3 2 4 4 3 3 3 2 2 3 3 2 2 3 2 2 2 3 4 3 3 2 2 2 2 3 3 2 2 2
-783 2 3 2 2 2 2 3 3 3 2 2 1 2 2 3 3 2 0 1 3 4 4 4 4 4 3 4 5 4 2 4 4 3 4 4 2 2 2 2 2 2 3 3 2 3 4 2 3 3 3 4 2 4 3 3 2 4 2 2 3 3 3 3 3 2 3 4 4 3 3 4 4
-789 4 4 3 4 3 3 3 3 3 3 2 2 2 2 3 3 3 3 4 4 4 4 4 2 2 2 3 3 3 3 4 3 3 3 3 3 4 3 2 1 2 3 3 3 4 2 3 3 3 3 4 4 3 4 3 3 3 3 3 3 3 3 3 5 4 3 3 2 4 4 3 2
-796 2 2 3 3 4 4 4 3 4 3 2 3 4 4 2 1 1 1 1 1 1 0 2 1 1 2 2 3 3 3 3 3 3 3 3 2 2 2 2 1 2 2 1 2 3 3 3 3 3 3 3 3 3 4 3 3 2 1 2 3 2 2 2 2 3 4 3 3 2 2 2 3
-802 3 3 3 3 3 4 2 1 2 3 3 2 2 1 2 2 2 2 3 4 3 3 2 2 2 2 1 2 3 2 3 3 2 2 2 2 3 3 2 3 2 2 2 2 3 1 1 2 2 3 4 4 3 3 3 3 3 2 2 3 1 1 3 4 4 3 2 3 3 2 1 1
-809 1 2 4 2 2 3 2 2 2 2 2 2 2 2 3 3 4 4 3 3 3 4 3 3 2 1 2 2 2 2 2 1 0 1 2 1 2 2 3 2 2 3 3 3 3 2 2 3 2 2 3 3 3 3 2 4 2 2 3 3 2 2 0 0 2 3 3 2 3 3 2 2
-815 2 2 3 2 2 3 3 3 4 4 5 3 2 2 2 1 2 2 2 2 3 5 3 2 2 3 3 2 3 3 2 2 2 2 2 2 1 2 2 2 3 2 2 3 3 4 4 3 3 3 3 3 2 1 3 3 2 2 2 2 3 3 2 2 3 4 4 3 3 2 3 3
-821 3 3 3 2 3 2 1 3 4 4 4 3 2 1 1 2 1 2 2 2 2 2 2 3 4 4 3 3 4 3 3 2 2 3 2 2 2 3 4 4 3 3 2 1 1 2 2 2 2 2 1 2 2 3 4 4 4 4 3 2 3 2 2 4 3 4 4 3 3 3 4 4
-828 4 2 2 2 1 2 1 2 3 4 4 3 2 2 2 2 2 3 3 3 3 5 4 3 4 4 4 4 4 3 3 3 3 2 3 3 3 2 2 3 1 2 3 3 2 3 4 3 2 3 2 1 2 2 3 2 3 3 3 4 4 2 3 2 2 3 3 2 3 2 2 3
-834 3 2 2 2 3 4 3 2 2 3 3 4 3 3 3 3 4 5 5 4 3 2 1 3 2 2 2 2 3 3 2 2 3 4 3 2 1 1 2 2 2 3 3 4 3 4 3 3 2 2 3 3 3 2 1 1 2 3 3 3 3 4 3 2 2 3 3 2 2 3 4 3
-841 3 3 3 1 0 1 2 1 2 2 2 2 2 3 4 4 3 2 3 4 4 2 2 2 2 3 2 2 2 1 3 2 2 2 3 2 3 3 4 4 4 3 3 4 3 2 2 3 3 4 4 4 3 4 5 4 2 2 1 1 2 2 2 2 3 3 3 2 2 2 2 4
-847 4 3 4 4 3 4 3 2 2 2 3 4 3 2 2 4 4 3 2 2 3 3 3 3 2 2 3 4 5 4 3 4 4 5 5 3 5 5 4 3 2 3 4 3 2 3 4 3 2 1 0 2 2 2 2 1 3 3 2 2 2 1 2 2 3 3 4 3 3 3 3 3
-854 3 3 2 2 3 2 2 2 2 1 2 4 4 4 4 4 3 1 2 2 2 2 2 1 3 3 4 4 2 2 2 3 2 2 1 1 1 1 2 4 4 3 3 4 4 3 4 4 2 2 2 2 1 2 3 4 2 2 2 2 3 2 2 2 2 2 2 2 2 2 3 3
-860 3 3 3 3 3 3 4 4 2 3 3 2 2 2 3 2 2 2 1 1 2 3 2 2 4 4 3 1 1 2 1 2 1 2 2 2 4 4 4 4 3 4 4 3 2 2 4 3 3 2 2 3 2 2 2 4 3 2 2 5 4 3 2 2 3 4 4 3 4 4 3 3
-867 3 2 2 3 3 2 2 2 3 4 3 3 2 2 3 3 3 2 2 2 2 2 3 3 2 2 2 3 3 3 3 3 2 1 2 3 1 2 3 3 3 3 3 3 3 3 2 2 2 2 3 2 2 3 4 3 2 3 2 0 1 1 1 2 2 3 2 2 1 1 2 2
-873 2 2 2 2 3 3 3 2 2 3 3 2 2 3 3 3 2 2 3 1 2 3 2 3 3 3 3 3 2 1 0 2 3 3 2 3 3 3 4 4 2 3 3 2 3 3 4 1 0 1 2 3 3 3 3 3 3 3 2 1 1 2 3 3 2 3 2 3 3 3 2 2
-880 2 2 2 3 3 2 2 2 3 4 3 3 3 3 2 1 3 3 2 1 2 3 3 4 4 3 3 2 3 3 3 3 3 4 4 3 3 2 3 3 3 3 4 4 4 2 2 3 2 2 3 2 2 3 4 2 2 2 2 3 3 2 1 2 3 2 2 3 4 4 2 3
-886 3 2 3 4 4 3 3 2 3 2 2 2 2 2 1 2 4 3 2 2 3 2 1 2 2 3 4 4 3 3 3 3 2 3 4 4 3 3 4 4 3 2 3 3 3 3 4 3 3 3 2 3 3 3 3 2 3 3 3 2 3 4 3 2 3 3 3 3 3 3 3 3
-892 3 3 4 6 4 4 3 3 3 3 2 3 2 3 3 3 3 3 3 4 3 2 3 3 2 3 2 1 2 2 2 1 3 4 4 2 3 3 3 3 3 5 4 2 2 2 2 3 4 2 2 2 2 3 3 4 4 3 4 3 3 4 4 4 3 2 4 4 4 4 2 2
-899 2 2 3 3 2 4 3 3 2 2 4 3 4 3 2 2 3 2 2 3 3 2 2 2 3 4 2 2 2 2 3 3 3 3 3 3 3 2 3 3 4 5 6 5 4 2 2 3 3 4 3 3 2 2 3 2 1 3 2 3 3 2 3 3 2 3 2 3 4 4 3 3
-905 3 3 3 3 4 3 2 1 3 2 2 2 3 3 3 2 3 3 2 2 2 2 2 2 2 1 2 2 1 3 2 3 3 4 4 2 3 3 3 3 3 2 2 2 3 3 3 4 3 4 4 3 2 2 3 3 3 4 3 3 4 2 2 4 4 2 1 2 3 3 4 4
-912 4 3 3 3 2 4 3 4 4 4 3 2 3 3 3 4 2 2 2 2 2 1 3 3 2 2 2 3 3 2 3 2 2 3 2 1 2 3 2 2 1 1 1 1 0 2 2 2 2 3 3 2 2 2 3 2 2 2 1 3 3 3 2 0 1 3 2 2 4 3 3 3
-918 3 3 2 2 2 2 2 1 1 2 3 3 2 3 2 2 2 2 1 1 2 1 2 2 2 2 2 2 3 3 4 4 4 4 3 3 3 2 2 3 2 3 3 3 3 3 3 3 3 3 4 3 3 3 3 3 2 1 3 3 3 3 3 2 2 2 3 3 2 3 4 3
-925 3 3 3 4 4 2 3 3 2 3 3 3 2 2 3 3 3 3 0 1 3 3 1 3 3 3 2 2 2 2 2 3 2 2 2 2 2 2 3 3 2 3 3 3 3 2 2 2 3 3 3 3 3 3 4 2 3 2 2 2 3 3 2 2 2 2 1 2 2 2 2 2
-931 2 3 3 2 3 4 2 2 3 3 3 3 3 3 2 2 3 3 2 2 2 3 3 3 4 4 3 4 3 3 3 2 2 1 2 1 1 2 2 2 2 1 2 3 3 2 1 1 1 2 2 2 3 3 3 3 2 3 3 2 4 3 2 4 3 1 2 2 3 3 3 3
-938 3 2 1 2 3 4 4 4 3 3 4 5 4 2 2 2 2 2 4 3 2 2 3 3 3 3 2 2 3 2 3 1 1 2 3 2 2 2 1 2 2 3 1 2 1 2 2 2 1 2 2 2 1 2 2 2 3 2 2 3 3 3 3 4 4 2 2 4 3 4 4 3
-944 3 4 2 3 3 2 3 2 2 2 2 2 2 2 1 1 1 1 2 2 3 2 2 2 1 2 2 1 3 3 2 2 3 2 4 3 3 3 3 3 3 4 3 1 3 4 3 2 3 3 2 2 2 4 3 3 4 3 4 4 3 3 2 1 2 3 2 2 2 2 2 3
-950 3 4 3 2 3 3 2 1 3 3 3 3 3 2 2 3 3 3 2 2 2 2 2 2 3 3 3 2 2 3 4 3 3 2 3 2 2 3 3 2 3 2 2 1 1 2 5 4 3 3 2 1 2 3 2 2 1 3 2 1 1 1 1 2 2 2 3 3 3 3 3 2
-957 2 2 1 2 2 1 2 3 3 3 2 3 3 2 3 3 2 3 3 3 3 2 3 3 3 2 2 3 3 3 2 4 2 1 2 2 3 1 1 2 2 4 4 3 4 3 2 3 3 2 2 2 3 4 4 2 2 3 4 2 2 2 3 2 3 3 2 2 3 4 3 3
-963 3 3 2 2 3 2 1 1 2 2 2 2 2 4 4 4 2 2 3 4 4 4 4 3 2 2 2 2 2 1 2 3 3 2 2 3 3 3 3 3 3 3 2 2 1 2 3 2 3 2 2 3 3 2 2 2 2 1 2 2 2 2 2 2 2 1 1 2 2 1 1 1
-970 1 2 2 2 2 2 3 3 3 2 1 1 3 4 3 4 3 3 3 3 3 3 3 2 3 3 2 2 2 3 3 2 2 2 0 1 3 2 3 3 3 2 2 2 1 2 2 2 2 3 3 3 3 4 3 2 1 3 3 4 2 1 0 0 1 3 2 1 1 2 3 4
-976 4 2 4 4 3 3 3 3 3 3 3 2 2 3 2 2 2 2 1 1 1 1 1 1 1 1 2 2 2 2 3 4 3 3 3 2 2 2 2 2 2 3 4 3 3 3 3 3 2 2 3 3 3 3 3 2 2 1 4 3 3 3 2 2 3 3 3 2 3 3 4 3
-983 3 3 3 3 2 3 3 2 3 3 2 1 1 1 2 3 1 2 3 3 3 3 4 3 3 3 4 4 3 2 1 2 5 4 3 3 3 3 3 3 3 2 2 2 2 3 2 2 3 5 5 4 3 3 3 3 3 5 3 2 2 2 2 3 2 3 3 2 3 3 3 2
-989 2 3 3 4 4 3 2 3 4 3 2 3 3 2 2 3 2 3 4 3 2 2 3 2 3 2 2 2 2 3 3 4 3 3 3 3 3 4 3 2 3 3 3 2 2 2 3 4 3 3 4 2 3 4 4 4 5 4 2 2 1 2 2 3 2 3 2 1 1 3 1 2
-996 2 2 3 4 5 4 5 3 3 2 3 4 3 3 5 4 3 2 2 2 2 2 3 3 3 4 3 2 3 3 3 3 0 1 1 2 2 3 4 4 3 3 2 2 2 3 1 1 3 4 3 5 3 4 3 3 2 1 3 3 2 2 2 3 2 1 2 3 4 5 3 3
-1002 3 3 2 3 3 3 3 4 3 4 3 3 3 4 3 3 3 4 3 2 2 2 2 3 3 3 4 3 3 2 3 4 3 2 4 3 2 3 2 3 3 4 4 4 3 3 3 3 3 2 2 2 3 3 2 3 3 4 3 1 1 0 2 2 3 3 2 3 1 2 2
-1008 2 2 2 1 2 1 1 2 2 2 2 3 3 4 4 2 1 2 3 3 1 2 1 2 3 2 2 1 1 1 2 3 4 3 2 2 2 1 3 4 3 3 5 3 1 1 1 1 3 3 2 1 3 3 3 2 2 2 2 2 4 4 4 3 2 2 2 3 3 3 3
-1015 3 2 2 3 3 3 3 2 3 2 2 2 3 3 3 3 3 3 4 5 5 4 3 3 3 2 3 2 3 3 4 4 2 2 3 3 2 1 0 1 2 3 2 3 3 3 2 2 2 3 3 2 1 2 3 2 2 3 2 2 3 2 2 4 3 3 3 3 3 2 2
-1021 2 2 4 3 3 4 3 3 3 1 4 3 1 1 2 2 2 1 1 2 2 2 3 3 3 2 4 4 4 4 4 3 2 3 2 2 1 2 2 2 2 3 3 2 2 2 3 3 2 3 3 2 1 3 4 2 3 3 3 3 4 4 2 2 1 1 3 3 2 1 1
-1027 1 3 2 3 3 3 3 3 2 2 3 2 3 2 1 2 2 3 3 3 4 4 3 2 3 2 3 2 2 1 2 3 2 3 3 1 2 1 1 0 1 2 1 2 2 1 1 2 3 3 2 2 1 2 2 2 2 1 2 1 0 1 1 1 3 3 3 3 3 4 4
-1034 4 4 3 3 2 2 3 3 3 2 2 2 2 2 1 2 3 3 2 2 2 1 1 2 2 3 3 2 1 2 2 2 3 3 3 3 2 1 2 3 3 2 3 2 1 1 1 3 5 3 1 2 3 4 3 3 4 4 3 3 2 2 2 2 4 4 3 1 1 2 2
-1040 2 3 4 3 3 2 1 2 3 3 3 3 3 2 3 4 5 5 2 2 3 3 2 3 3 2 3 3 3 3 2 2 2 1 1 2 1 1 3 4 4 4 3 2 3 3 4 3 3 2 4 3 3 3 2 3 4 4 3 4 3 3 2 3 4 3 3 3 2 3 2
-1047 2 3 3 3 3 3 3 2 2 3 4 3 3 2 4 4 3 3 3 3 3 4 3 1 2 3 4 3 4 4 3 3 3 3 2 2 2 2 3 3 4 5 4 3 3 2 2 2 1 1 2 3 4 2 1 2 2 3 3 2 2 3 3 3 3 3 3 3 5 4 3
-1053 3 2 1 3 2 2 2 1 1 1 3 3 4 4 3 2 2 3 3 3 2 2 1 1 2 2 1 1 2 2 2 4 2 3 4 3 2 2 2 2 2 1 1 2 2 3 3 2 4 3 2 2 2 2 3 4 2 2 2 2 1 3 3 3 2 2 2 3 3 3 2
-1059 2 2 2 3 3 2 2 3 3 3 3 3 3 2 2 2 2 2 3 3 3 3 3 2 2 2 0 0 2 3 3 2 2 2 2 2 2 2 3 3 3 2 2 2 3 4 4 2 1 2 2 1 0 1 2 1 1 1 2 4 3 2 3 2 1 2 2 2 2 3 4
-1066 4 3 3 3 3 3 2 3 3 2 2 3 3 2 2 2 2 2 2 1 2 3 2 3 2 3 4 2 3 4 2 3 5 3 2 3 3 3 3 2 2 2 3 2 2 3 2 2 2 3 3 2 3 3 2 2 2 3 3 2 3 3 2 2 3 2 2 2 2 3 2
-1072 2 3 3 2 2 3 3 2 2 2 2 2 1 2 2 3 2 4 4 2 2 3 3 3 2 2 3 2 2 1 1 3 2 2 2 2 2 2 2 3 5 4 4 3 3 3 3 2 3 2 2 4 3 3 2 2 4 4 3 3 3 3 4 3 2 3 1 2 4 3 2
-1078 2 3 3 3 3 3 3 4 4 3 2 2 2 3 2 2 2 2 2 2 1 0 2 2 1 2 2 1 1 2 3 3 3 2 1 2 3 3 3 3 4 4 4 4 4 4 4 3 3 2 2 2 3 3 4 4 3 3 2 2 3 2 3 2 2 2 3 3 2 3 4
-1085 4 2 2 4 3 4 4 2 1 2 2 2 2 2 2 1 2 2 2 2 2 2 2 2 1 1 1 2 2 2 2 2 2 2 3 3 1 1 1 2 2 2 3 3 2 2 2 2 3 4 3 3 3 3 3 3 3 3 2 2 2 3 4 3 3 3 3 2 2 2 2
-1091 2 3 3 5 4 4 4 3 3 3 2 2 2 2 3 4 3 2 2 2 2 4 5 4 3 2 1 1 2 1 1 1 1 1 2 3 2 1 2 1 3 4 4 4 4 4 4 4 2 3 4 4 3 4 4 3 2 4 4 3 3 2 1 2 1 2 1 2 3 2 3
-1097 3 3 2 1 2 2 1 2 2 2 2 1 3 3 2 2 2 2 2 3 3 3 3 4 4 5 4 4 3 3 2 2 3 3 1 0 1 2 2 2 3 2 2 4 4 2 3 2 1 2 2 3 2 2 2 3 2 3 4 4 4 4 3 3 2 3 4 4 3 2 2
-1104 2 2 3 3 3 2 5 5 5 4 3 3 3 3 3 3 3 3 4 2 1 2 3 3 3 3 1 2 3 3 3 1 2 2 2 1 1 3 4 3 1 1 3 2 2 3 3 4 4 3 4 3 4 3 4 3 4 4 3 4 3 2 3 4 3 3 3 2 2 2 2
-1110 2 2 3 2 1 1 1 2 1 2 2 3 3 3 2 2 2 2 3 3 2 3 3 1 2 2 1 2 2 2 2 2 1 1 3 4 4 4 3 3 3 2 2 2 3 2 3 3 4 3 2 2 3 4 3 2 2 2 3 2 2 2 2 3 3 2 1 2 2 2 2
-1116 2 3 3 3 2 1 1 3 3 4 4 4 2 2 3 4 4 3 2 2 3 4 3 3 4 4 3 3 3 2 1 2 3 3 2 1 2 3 3 3 3 3 3 3 3 4 3 3 2 3 2 1 3 3 2 2 1 2 3 4 4 2 2 3 2 3 3 2 1 2 4
-1123 4 3 3 3 3 3 2 2 2 3 3 4 4 4 2 3 2 2 3 4 3 3 3 2 2 2 2 3 2 2 2 2 2 2 1 1 0 0 0 1 1 2 2 3 3 2 3 2 2 2 2 1 2 2 1 1 1 2 2 2 1 0 1 1 2 3 3 2 3 2 2
-1129 2 2 2 4 3 2 2 3 2 2 2 3 2 2 1 1 2 2 2 2 2 4 3 3 3 3 2 2 2 2 1 1 2 3 3 3 2 3 4 2 3 2 1 2 3 3 3 3 2 3 3 3 3 3 3 3 3 4 3 3 2 1 2 3 3 3 3 3 4 4 2
-1136 2 3 2 2 3 3 1 2 3 3 3 2 3 3 2 2 2 3 3 3 4 5 3 2 2 3 2 2 2 2 3 3 3 3 3 3 4 4 3 2 3 4 4 2 2 2 2 2 2 3 3 1 2 2 2 3 2 2 3 2 2 3 3 3 2 2 2 2 1 2 2
-1142 2 3 2 2 1 1 1 2 3 2 4 4 2 3 3 1 0 2 2 2 2 2 4 4 4 3 4 2 2 3 1 2 2 2 2 3 2 1 3 3 3 2 3 3 2 1 2 3 3 3 3 4 4 4 3 3 3 2 2 2 1 3 2 2 2 1 2 3 3 2 2
-1148 2 2 2 2 2 2 2 4 3 3 3 3 1 1 2 2 2 3 4 3 3 3 2 2 3 2 3 3 2 2 2 1 2 1 2 2 2 2 2 2 3 3 2 2 3 2 3 3 3 3 4 3 3 3 4 3 2 2 2 1 2 2 2 2 3 4 4 4 3 3 2
-1155 2 2 2 2 3 3 3 3 3 4 3 2 3 3 4 4 3 3 2 4 2 2 3 4 3 5 5 4 3 2 3 2 3 3 3 3 3 2 3 3 3 3 2 3 3 2 2 3 3 3 2 3 4 2 3 2 2 2 1 2 2 2 2 1 2 3 3 4 4 3 2
-1161 2 1 1 2 1 2 3 4 3 2 1 1 0 2 2 2 3 3 3 4 3 2 2 2 1 1 2 1 2 2 2 3 3 2 1 2 2 2 2 3 3 3 2 2 2 3 4 3 4 3 3 3 3 3 3 2 1 1 3 2 2 3 3 2 2 1 1 1 2 2 3
-1167 3 2 2 3 4 3 2 2 2 3 2 3 4 5 3 2 3 3 2 2 1 2 2 2 4 3 5 5 4 2 2 3 3 2 3 3 2 2 3 3 2 1 1 2 4 3 2 2 2 3 2 2 3 3 3 4 4 3 2 2 1 3 4 2 1 2 2 2 2 3 4
-1174 4 4 4 3 2 2 2 2 1 2 2 2 1 2 3 4 3 3 3 2 2 2 2 2 2 5 4 3 3 2 1 3 4 3 2 2 2 2 2 2 2 1 1 1 2 3 4 4 2 2 2 2 0 2 3 3 2 3 4 3 3 4 4 3 3 3 4 3 2 2 3
-1180 3 2 2 2 2 2 1 1 0 1 2 3 3 2 2 1 2 2 2 2 1 2 3 2 3 3 3 4 3 3 3 2 2 3 3 2 2 2 3 3 2 1 1 1 1 2 3 4 3 1 2 1 2 3 2 3 3 3 2 1 2 3 3 2 3 3 4 3 4 2 2
-1186 2 2 2 2 1 1 2 2 2 2 1 1 2 3 2 1 2 2 3 3 4 3 2 2 3 1 1 2 2 2 2 2 2 2 2 2 2 2 3 3 2 2 1 2 1 2 2 3 3 3 2 2 1 1 1 2 3 4 3 2 2 3 2 2 4 3 3 2 2 0 1
-1193 1 3 2 2 4 3 3 1 1 2 3 4 2 2 2 2 2 3 4 4 2 1 1 3 3 2 3 2 1 2 1 1 2 2 2 2 2 2 2 2 1 1 1 3 2 3 4 3 2 3 4 4 4 4 4 2 2 3 3 2 3 4 3 3 3 3 3 3 3 2 3
-1199 3 3 2 2 2 3 3 3 3 3 4 3 3 3 3 3 2 2 3 3 3 2 1 2 2 2 4 5 3 2 3 3 4 4 3 2 3 3 3 2 2 3 1 1 2 3 3 3 2 3 3 2 2 1 3 3 3 3 3 2 2 2 2 2 2 3 3 2 3 3 3
-1206 3 3 3 4 4 4 4 3 1 1 3 2 2 3 3 3 2 2 1 1 2 3 3 1 2 2 3 3 2 1 2 3 2 3 4 4 2 2 2 1 2 3 2 2 3 2 2 2 2 2 2 3 4 2 1 1 3 3 3 3 2 1 2 2 2 1 2 2 1 1 2
-1212 2 1 2 1 2 2 2 3 2 3 4 5 3 2 2 3 3 2 2 3 2 2 3 3 1 2 2 2 3 3 3 3 3 4 3 4 5 4 3 3 3 3 2 3 3 1 1 1 1 1 2 2 2 3 3 3 3 2 2 2 1 2 2 3 3 3 2 2 2 2 2
-1218 2 1 2 3 3 2 3 2 2 2 3 3 2 2 3 2 2 3 3 3 1 1 2 3 2 1 1 0 1 1 2 2 3 2 2 3 3 1 2 2 2 2 2 2 2 3 4 3 3 2 2 1 1 3 4 3 2 1 1 2 0 2 3 2 1 1 1 1 2 1 2
-1225 2 3 3 3 3 3 3 2 2 4 3 2 2 2 2 2 1 0 2 2 1 1 2 3 3 2 2 2 1 2 2 2 2 2 3 3 3 4 3 2 4 4 3 3 3 2 2 2 1 1 1 1 1 1 0 1 2 3 3 3 2 1 1 1 2 2 3 3 4 2 2
-1231 2 2 3 3 3 4 3 2 3 2 1 2 3 4 3 3 2 0 1 2 1 2 2 2 3 3 1 2 2 2 3 3 3 3 2 2 2 4 3 3 4 4 4 3 2 2 1 1 2 3 2 3 3 4 4 4 3 3 2 3 4 4 3 3 2 2 3 3 3 3 3
-1237 3 3 4 3 4 4 3 2 2 2 2 2 1 1 1 3 3 3 2 2 3 3 4 4 3 4 4 3 3 2 3 3 2 2 3 3 3 2 2 3 3 2 1 1 2 2 2 3 4 4 3 2 3 2 2 3 2 2 3 2 2 3 3 3 3 3 3 3 2 2 3
-1244 3 2 2 2 2 1 2 1 1 2 1 1 1 2 2 2 2 2 3 4 4 4 3 3 3 5 4 3 3 3 3 2 2 3 2 4 3 3 3 2 2 2 3 3 3 2 2 2 3 3 4 2 1 2 3 2 2 3 1 0 1 2 2 1 2 2 2 2 2 2 2
-1250 2 2 1 2 1 2 3 3 2 3 4 5 3 4 4 3 2 2 2 2 2 3 2 2 3 2 3 3 2 3 2 2 2 3 3 1 2 3 4 3 2 2 3 3 3 4 3 3 3 2 3 3 3 2 3 4 2 1 2 3 3 4 3 2 2 2 3 2 1 1 2
-1256 2 2 2 1 2 2 2 3 3 3 3 4 4 3 3 3 2 2 2 2 3 2 2 3 1 2 2 3 3 2 3 2 2 1 2 3 3 2 1 3 4 4 3 3 2 2 2 3 3 3 3 3 3 4 2 2 1 1 2 2 1 1 2 3 3 3 1 1 2 3 1
-1263 1 1 2 3 2 2 1 3 3 3 3 2 1 2 3 2 2 2 3 4 4 3 2 4 4 3 2 2 2 2 2 2 3 2 2 3 3 1 1 1 2 3 3 1 4 3 2 2 4 5 4 3 2 2 3 2 4 4 3 3 3 3 4 4 4 3 3 2 2 2 2
-1269 2 3 3 3 2 2 3 4 3 4 4 3 2 2 4 5 3 3 3 4 4 3 2 3 3 2 3 3 1 3 3 1 2 3 2 3 3 3 3 3 2 1 2 3 3 2 2 2 3 2 1 2 4 3 2 2 2 3 3 3 2 1 3 3 4 3 3 3 3 3 2
-1275 2 3 4 3 3 3 4 3 3 1 1 2 2 3 3 2 2 3 2 4 3 2 2 3 3 2 2 2 2 2 2 2 2 2 1 1 1 2 2 2 1 1 2 2 3 4 4 4 3 4 4 3 3 3 3 3 3 2 3 4 3 3 3 2 2 2 2 3 3 2 3
-1282 3 3 3 4 2 3 2 2 3 2 2 3 3 3 4 4 3 2 3 3 2 2 3 2 3 3 2 3 3 3 2 3 3 1 3 3 3 3 3 3 2 3 2 1 2 2 2 1 2 3 2 1 2 2 2 1 2 1 2 3 4 4 2 2 2 2 2 2 1 2 2
-1288 2 3 3 4 3 2 3 2 2 3 3 3 4 3 3 3 3 2 0 1 1 1 3 2 0 1 1 1 1 1 3 3 2 2 2 2 2 2 2 1 1 1 2 2 2 3 2 2 4 3 3 2 3 3 3 2 2 1 3 3 2 2 3 2 2 1 3 3 3 4 4
-1295 4 3 2 2 3 3 2 2 2 3 2 3 3 4 4 3 2 2 2 2 3 3 2 3 3 3 4 3 2 2 2 2 3 2 2 2 1 1 1 1 1 1 2 2 2 3 3 3 4 4 4 4 4 2 2 2 2 3 2 3 3 3 3 2 2 1 2 1 1 3 3
-1301 3 3 3 3 2 1 1 2 2 2 2 1 2 4 2 2 2 2 3 1 2 2 1 1 2 1 1 1 2 3 2 2 2 2 3 2 2 3 3 3 2 2 4 3 3 3 2 3 3 2 2 2 2 2 3 4 4 3 2 3 2 2 3 2 2 3 2 2 1 1 3
-1307 3 2 2 3 4 3 3 3 3 3 2 3 4 4 4 4 4 2 4 4 4 3 2 1 1 1 1 2 2 4 3 1 2 3 3 3 3 2 2 2 2 3 3 3 2 2 1 1 2 3 3 2 2 1 1 2 3 4 3 3 2 1 2 1 3 2 2 1 0 3 3
-1314 3 3 3 3 3 3 2 3 2 1 1 2 1 2 3 3 3 2 0 0 2 2 2 4 2 1 2 4 4 3 2 2 3 2 3 3 3 2 2 1 2 1 2 2 3 3 2 4 3 2 3 3 3 3 3 3 3 4 3 2 2 2 2 3 2 2 1 2 3 3 2
-1320 2 3 2 2 3 4 2 2 3 2 3 3 3 2 2 3 3 4 4 2 2 2 2 3 3 3 3 3 3 1 2 2 2 2 1 1 2 3 2 2 2 2 2 3 2 1 1 3 3 4 3 4 2 1 2 2 4 4 3 2 2 3 2 1 2 3 1 2 3 2 2
-1326 2 2 3 3 2 2 3 2 2 3 2 2 2 3 2 2 2 2 1 2 2 3 2 3 3 2 4 3 3 2 3 3 3 4 3 3 1 2 2 1 2 2 4 2 2 4 4 4 3 3 3 3 3 3 2 1 2 3 3 3 3 2 4 4 2 2 3 4 3 2 2
-1333 2 3 3 2 1 2 2 2 1 2 2 1 2 3 3 3 2 3 3 2 2 2 2 3 3 3 2 2 3 2 3 2 1 1 3 3 2 3 3 2 2 2 3 4 3 1 3 3 2 2 3 2 1 2 3 2 4 4 4 4 3 3 3 2 2 3 2 2 2 3 2
-1339 2 3 3 3 3 2 2 3 3 4 3 2 2 3 3 3 2 3 2 3 3 2 3 4 3 2 2 2 2 3 4 3 3 3 3 3 3 2 3 3 2 1 1 2 3 3 3 3 2 2 3 1 1 2 2 2 3 2 1 1 2 2 2 2 2 4 3 3 3 2 1
-1345 1 2 2 2 3 3 3 0 1 2 3 2 2 3 2 1 1 2 3 4 5 4 3 3 3 3 2 3 3 2 2 2 2 2 2 2 2 2 2 3 4 3 3 4 3 2 1 2 2 3 3 3 2 2 2 2 2 2 2 2 2 2 2 2 2 2 3 1 0 1 3
-1352 3 3 2 2 3 3 3 3 2 1 2 2 4 4 3 2 3 3 3 4 4 2 1 2 2 2 2 3 4 3 3 3 3 5 3 2 2 2 2 1 1 2 3 1 2 2 3 4 3 3 3 3 3 3 2 4 3 2 3 3 2 2 2 2 2 2 2 3 2 2 3
-1358 3 2 2 3 4 5 4 3 3 2 3 4 3 2 2 3 3 2 1 1 1 2 4 3 3 3 1 3 4 2 2 1 2 2 1 2 3 3 2 1 0 1 2 1 1 1 0 0 2 2 0 1 3 3 2 3 2 2 1 2 1 2 1 2 2 3 2 4 4 2 2
-1364 2 1 2 1 2 4 3 4 3 2 3 3 3 3 2 4 4 3 2 0 2 1 2 3 3 3 2 2 2 3 3 2 4 3 3 2 2 3 3 2 2 4 5 4 3 2 3 2 2 3 3 3 2 2 2 2 3 2 3 2 2 2 2 1 1 2 3 2 1 1 0
-1371 0 3 4 3 2 3 4 3 1 2 3 3 4 3 3 3 2 3 3 3 4 2 2 2 2 1 0 2 2 3 3 3 2 3 1 2 2 2 3 2 2 3 4 3 3 3 2 1 2 3 2 3 3 3 4 4 2 2 1 2 2 2 2 2 2 1 2 2 3 1 2
-1377 2 4 4 3 2 3 4 4 4 3 3 2 2 3 2 2 3 2 1 2 3 3 2 2 2 3 2 4 4 3 3 3 4 3 2 2 2 2 4 3 3 1 1 2 2 2 3 3 2 2 2 2 3 3 3 2 2 2 3 3 3 2 2 2 1 1 2 4 3 2 2
-1384 2 2 2 3 3 4 3 2 1 3 3 3 3 2 2 2 2 2 3 3 2 2 2 2 2 2 2 1 3 3 2 2 2 2 3 2 2 4 2 3 3 2 2 3 2 2 3 3 2 2 4 3 2 3 3 3 4 3 3 4 4 3 4 3 3 3 2 1 1 2 1
-1390 1 0 1 3 2 1 1 1 1 1 3 3 2 2 3 2 2 1 1 2 3 2 3 3 4 3 3 2 2 2 3 3 3 2 3 2 2 2 2 2 1 2 2 2 3 2 3 3 4 5 3 2 1 2 3 2 2 3 3 2 1 1 2 1 2 3 1 2 2 3 3
-1396 3 2 3 2 3 3 3 2 2 3 3 2 2 2 1 1 3 3 2 3 3 3 2 2 2 2 2 2 2 3 2 2 2 2 2 3 4 3 3 3 3 2 2 2 3 4 2 3 2 2 3 1 0 2 2 2 3 2 1 3 3 3 2 2 3 2 3 4 3 1 2
-1403 2 3 5 4 4 3 3 2 2 2 3 3 3 3 2 2 2 2 2 2 1 2 2 2 3 2 2 2 1 2 3 2 2 1 2 2 3 3 3 2 2 2 3 2 1 3 4 4 3 4 2 2 3 2 3 2 2 2 2 1 1 1 1 2 2 2 3 2 1 1 2
-1409 2 3 1 2 2 2 3 1 2 3 3 4 3 2 2 0 1 0 0 2 2 2 3 4 2 1 2 3 4 3 2 2 1 2 2 2 2 3 3 3 3 2 4 4 2 2 1 2 1 2 2 2 2 2 2 2 1 2 2 2 2 3 2 3 3 3 2 1 2 1 2
-1415 2 2 3 5 4 3 4 3 3 4 4 3 2 2 3 2 2 2 2 3 3 1 2 3 3 3 3 2 1 2 2 2 2 2 1 1 3 2 2 3 3 3 1 1 2 2 1 1 1 2 3 1 2 3 1 1 2 3 2 1 3 3 3 3 3 3 3 3 1 1 3
-1422 3 3 3 3 3 4 5 4 3 2 3 3 3 3 3 3 3 3 3 3 3 4 5 4 2 2 2 1 2 3 3 2 1 2 3 3 2 3 3 2 2 3 4 4 3 3 2 1 2 2 2 2 3 2 2 3 3 3 2 2 2 2 1 2 1 0 2 2 3 3 4
-1428 4 3 2 2 2 3 3 3 1 2 2 2 3 3 2 2 2 3 3 4 4 4 4 4 3 2 2 4 3 2 2 3 3 3 3 3 3 3 3 3 2 3 2 2 2 2 4 3 3 4 4 4 4 2 1 2 3 3 2 2 1 3 3 2 2 3 2 2 1 1 2
-1434 2 3 2 2 2 1 2 4 4 3 4 4 4 3 2 2 3 3 3 4 3 2 2 2 1 1 2 1 1 1 2 1 1 2 1 0 0 1 2 2 3 2 3 3 3 3 3 3 3 3 3 3 3 3 4 3 2 3 3 3 3 4 2 3 3 2 2 3 2 4 4
-1441 4 2 2 3 2 2 2 0 1 1 1 1 2 2 2 3 1 2 2 2 1 1 2 2 3 3 2 1 1 1 0 2 3 3 2 3 3 4 3 3 2 1 1 2 2 2 2 2 2 2 3 2 3 3 2 2 2 2 2 2 2 2 3 5 3 3 2 2 3 3 3
-1447 3 3 3 2 1 2 2 3 2 2 3 3 3 2 2 3 3 2 3 2 1 1 1 2 2 2 2 3 2 3 3 2 3 3 2 3 2 2 3 3 4 3 2 2 3 4 3 2 2 3 3 2 2 2 1 1 2 2 2 3 3 3 3 2 2 3 3 2 3 3 2
-1453 2 2 2 2 1 1 3 2 1 2 3 3 3 3 2 2 2 1 1 2 2 1 3 3 3 4 4 3 2 1 1 3 2 2 2 2 2 2 1 2 4 3 1 2 2 3 2 1 2 1 0 0 1 2 1 2 3 3 2 2 2 3 3 2 2 2 1 3 3 3 3
-1460 3 4 3 3 4 3 3 2 2 2 2 2 2 2 2 2 3 3 4 4 3 2 1 3 3 3 2 2 2 4 3 2 4 4 4 3 3 4 4 3 3 2 1 1 2 0 1 2 2 2 3 2 3 3 2 3 2 3 3 2 2 2 1 3 3 2 3 3 3 3 2
-1466 2 3 3 2 2 1 2 2 2 2 2 2 1 2 3 2 3 3 3 4 2 2 2 2 3 2 1 3 3 2 1 1 3 3 3 4 4 3 4 3 2 2 2 1 2 2 1 1 3 0 2 3 3 3 3 2 3 3 3 2 2 3 3 3 3 2 1 2 4 3 3
-1473 3 2 2 2 1 1 2 1 2 2 2 1 2 3 3 3 3 2 2 2 2 2 3 3 2 2 3 2 2 3 3 1 1 1 2 2 2 3 3 3 3 1 2 2 1 2 2 3 2 2 2 2 2 2 2 2 2 3 4 3 3 3 3 4 4 3 3 3 1 1 2
-1479 2 1 1 2 3 3 3 2 2 2 2 3 3 3 2 1 1 2 3 2 2 1 2 3 2 3 3 2 1 1 2 3 2 2 2 2 3 2 1 2 2 2 2 3 3 4 4 4 3 3 2 3 3 3 1 1 1 2 1 3 3 2 2 2 1 2 1 1 1 1 2
-1485 2 2 2 2 1 2 2 2 2 3 2 3 3 2 3 3 2 2 2 2 3 3 2 3 2 3 3 3 3 3 4 3 2 4 4 3 2 1 3 2 2 3 2 2 2 2 1 2 2 1 2 3 2 3 3 3 2 1 1 2 2 2 1 0 1 3 3 3 3 2 1
-1492 1 1 2 1 2 2 2 3 3 3 3 4 3 3 2 0 0 0 1 2 2 3 2 3 4 3 3 3 4 3 3 3 2 2 3 3 4 3 2 2 2 2 3 4 3 3 2 3 4 4 2 3 3 3 3 3 2 2 2 1 1 3 4 4 3 2 2 2 2 2 3
-1498 3 2 2 3 4 3 3 3 2 1 0 2 1 1 3 2 2 1 2 2 2 3 3 2 3 3 2 2 1 0 1 3 3 3 3 1 2 2 2 2 3 3 2 2 2 2 2 2 2 2 3 3 4 2 1 1 2 3 2 3 3 2 1 1 2 3 2 3 3 2 1
-1504 1 1 1 1 2 3 3 2 3 3 2 3 4 4 4 3 4 4 3 2 2 2 2 2 3 4 2 3 3 3 2 1 2 3 2 3 3 2 2 2 4 3 2 3 1 2 3 3 3 2 2 1 3 4 3 3 3 3 3 3 3 2 1 2 2 2 2 3 4 2 3
-1511 3 4 3 3 2 1 2 2 2 3 3 3 4 3 2 2 3 3 2 2 1 1 2 2 3 4 4 3 2 2 2 1 1 3 3 2 1 1 2 2 1 1 1 2 1 1 2 3 4 4 3 3 3 4 4 3 3 4 3 1 2 1 1 2 2 0 1 3 4 3 3
-1517 3 3 4 3 3 3 2 2 4 4 3 2 1 2 2 2 3 2 2 3 4 2 2 4 4 3 2 3 3 3 2 3 2 1 2 3 4 2 2 3 3 2 1 1 2 3 3 3 3 2 2 2 2 1 0 1 1 2 2 2 3 3 3 4 3 1 2 4 3 2 2
-1523 2 2 3 3 2 2 1 2 1 1 1 2 1 1 1 1 1 3 3 4 3 2 2 2 1 1 3 4 3 2 3 3 2 3 3 2 2 3 4 2 2 2 2 2 2 2 4 5 4 3 3 3 3 2 2 2 3 2 3 1 2 4 2 1 2 2 3 2 1 1 3
-1530 3 3 3 4 3 1 2 2 1 2 0 0 1 2 2 2 2 3 2 2 1 2 2 1 2 2 2 2 3 4 3 2 2 1 2 1 1 1 1 2 2 3 4 3 3 2 1 1 0 0 1 2 2 2 2 3 2 2 2 3 2 1 1 1 1 2 1 2 2 1 1
-1536 1 2 4 3 2 2 3 2 3 3 2 3 3 3 2 1 0 2 2 2 1 2 2 2 2 1 1 1 0 2 3 3 1 1 1 2 2 3 4 3 2 3 4 2 1 2 1 1 1 2 2 2 3 1 1 1 2 2 3 3 3 0 0 1 1 1 1 1 1 2 2
-1542 2 1 2 1 0 2 3 4 3 2 3 4 3 2 2 2 3 3 2 2 2 2 2 2 3 2 2 2 3 3 2 2 2 2 2 1 2 1 1 1 1 0 0 1 2 2 2 1 1 3 3 3 3 4 4 3 2 3 3 2 1 2 3 3 2 1 1 2 1 1 1
-1549 1 2 3 3 2 3 3 3 3 3 2 3 3 3 3 2 2 2 3 3 4 5 3 4 3 2 2 2 3 4 3 2 3 2 3 2 1 1 1 2 3 4 2 2 2 1 1 2 1 2 3 2 3 2 3 3 3 4 3 3 4 4 4 3 2 3 3 3 4 3 3
-1555 3 3 2 2 2 2 2 3 1 1 2 2 3 2 2 3 2 2 3 3 3 3 3 2 2 3 2 2 3 2 2 3 3 2 2 3 3 3 3 3 3 3 2 1 1 2 2 2 2 3 3 4 4 4 4 3 3 1 2 2 1 2 2 3 2 2 4 3 3 2 3
-1562 3 2 2 3 4 3 2 3 2 1 2 2 1 2 2 2 2 3 2 2 2 1 2 4 4 2 2 1 0 1 2 2 2 1 1 2 2 1 1 1 2 3 3 4 2 2 2 0 1 2 2 3 2 1 2 2 1 1 3 2 0 2 4 4 3 3 2 2 2 3 2
-1568 2 1 2 3 2 1 1 3 3 2 3 3 3 4 3 3 4 3 2 1 0 1 3 2 1 2 2 4 4 3 2 2 1 1 4 3 2 1 1 2 2 3 2 2 3 3 3 3 4 2 1 1 1 3 3 2 2 2 2 2 2 3 3 3 3 2 3 3 3 3 3
-1574 3 2 2 1 1 2 2 3 3 2 3 3 2 3 3 3 4 3 3 2 1 2 2 2 2 3 3 2 1 2 3 2 2 3 2 2 1 3 3 3 2 3 3 3 4 5 4 4 3 3 3 3 4 3 1 1 1 2 3 3 2 2 3 3 3 1 1 2 3 3 3
-1581 3 3 3 3 3 3 2 2 3 3 3 3 3 2 1 1 2 3 4 4 3 2 3 2 1 2 2 2 2 2 3 3 4 4 3 2 3 1 1 3 2 3 1 2 3 3 2 2 2 1 0 0 3 3 2 3 2 2 3 3 3 4 4 4 2 2 2 2 1 3 4
-1587 4 3 3 3 3 2 2 2 2 2 2 2 2 3 2 2 2 1 1 1 2 2 1 1 2 2 2 2 1 0 2 3 2 1 1 2 3 2 1 2 2 2 2 2 2 2 3 3 3 3 3 2 2 3 3 2 3 3 2 2 1 2 2 2 2 2 2 3 2 2 2
-1593 2 2 1 1 3 3 3 3 3 4 4 1 0 2 2 0 2 2 2 3 3 4 2 2 2 1 3 2 2 2 3 3 2 1 2 2 1 1 2 1 1 3 3 2 3 3 2 3 2 2 2 0 0 0 0 1 2 1 3 3 3 3 4 4 2 2 2 3 4 3 2
-1600 2 2 3 4 2 2 2 3 3 4 3 4 4 2 2 1 2 2 1 1 2 2 3 3 2 2 2 1 2 1 2 1 1 1 2 2 3 1 0 0 0 1 2 1 2 2 1 1 2 1 0 1 3 2 2 1 2 2 2 2 3 2 2 3 3 3 2 2 2 2 2
-1606 2 1 1 2 3 3 2 2 2 2 2 3 4 3 3 2 2 3 2 3 3 3 4 3 3 2 2 3 3 2 1 2 2 3 3 3 2 3 4 3 3 3 2 2 4 3 3 2 2 2 3 3 2 2 1 2 3 4 2 0 2 3 1 2 2 2 2 3 3 4 5
-1612 5 2 1 3 2 2 2 1 2 3 2 1 2 2 1 1 1 2 3 4 2 2 1 2 3 3 3 2 1 3 4 3 3 3 3 5 3 2 3 3 3 3 2 1 1 2 3 3 2 2 1 1 2 2 1 1 2 2 2 2 2 2 1 1 0 1 1 1 1 2 2
-1619 2 1 2 1 2 2 3 3 2 1 0 1 3 3 2 2 2 2 1 1 1 1 2 1 3 4 3 2 1 1 2 3 3 2 3 3 3 3 2 3 4 2 3 3 1 2 1 1 2 3 4 3 3 2 2 1 3 4 2 2 2 2 2 1 3 2 2 3 2 2 3
-1625 3 3 1 0 1 2 2 2 2 2 3 4 4 4 3 3 2 4 3 2 1 1 2 3 2 2 3 2 3 2 3 3 3 3 4 2 3 2 2 2 2 3 4 4 3 3 3 3 2 3 1 2 4 3 3 3 3 3 2 2 2 3 2 3 3 3 4 3 4 5 3
-1631 3 4 3 2 3 4 3 3 4 3 3 3 2 2 2 2 2 3 3 3 4 4 4 4 3 4 4 3 2 3 3 3 3 2 3 2 2 1 4 3 0 1 0 1 2 2 2 2 3 2 1 1 2 2 2 1 3 3 2 3 2 2 2 1 3 3 2 2 3 4 3
-1638 3 3 3 2 2 2 3 3 2 1 1 1 3 2 2 2 2 1 3 2 1 1 1 2 3 2 1 2 2 2 2 2 2 2 2 3 4 4 5 5 5 4 2 3 3 3 3 3 2 3 2 3 2 0 0 0 1 3 2 2 3 3 1 2 2 2 1 1 2 3 4
-1644 4 2 3 3 2 3 2 2 3 2 1 0 0 1 1 2 2 3 3 2 2 2 2 2 2 2 2 2 3 3 2 3 3 2 2 3 3 2 1 2 2 2 3 3 3 3 4 3 2 3 3 3 2 2 3 2 2 2 4 5 4 4 2 2 1 1 2 3 3 2 2
-1651 2 2 2 2 2 3 2 2 1 2 1 3 2 2 2 3 3 3 2 2 2 2 3 3 2 1 2 2 2 3 3 2 2 2 3 3 3 4 4 4 3 3 3 3 3 2 1 1 2 2 2 3 3 3 2 1 2 2 2 3 3 2 2 2 1 1 2 2 2 1 2
-1657 2 2 2 2 3 2 2 4 3 2 2 3 3 2 1 1 2 1 2 2 1 3 3 3 3 3 3 3 2 3 2 2 2 3 2 2 1 2 1 3 3 4 4 3 3 2 2 1 1 1 1 1 2 2 1 0 2 1 1 1 1 1 1 2 2 2 3 2 2 3 2
-1663 2 1 2 1 1 2 2 3 3 3 4 3 3 2 3 4 3 2 2 1 1 3 3 3 3 4 3 2 1 1 0 0 1 1 3 3 3 3 2 2 2 3 2 2 2 2 1 1 2 2 2 1 3 3 2 1 0 -1 2 2 3 3 3 1 1 2 1 1 1 1 0
-1670 0 0 1 1 3 2 2 2 2 3 2 2 3 3 3 3 2 1 1 2 2 2 0 1 2 1 1 3 4 2 2 2 2 2 3 3 2 2 2 3 2 3 3 3 3 4 3 3 4 4 3 4 4 3 3 3 3 2 2 1 1 2 2 1 3 3 3 2 2 3 4
-1676 4 3 3 2 2 3 3 2 3 2 2 2 1 2 3 2 1 2 2 2 2 2 2 2 1 2 3 2 2 2 3 3 2 2 2 4 4 4 3 3 2 2 3 2 1 2 2 2 2 3 2 2 3 2 2 3 3 2 1 1 1 2 1 1 1 2 3 2 3 3 3
-1682 3 3 2 3 3 3 2 2 3 3 2 2 3 4 4 3 2 2 3 3 2 3 2 3 2 3 4 3 2 1 1 2 3 3 3 3 3 3 3 2 2 2 2 1 1 1 2 1 2 2 2 2 2 2 2 2 2 2 2 3 2 2 3 1 0 -1 1 1 2 2 1
-1689 1 1 3 2 1 2 3 3 3 3 3 3 1 2 3 2 1 1 2 2 1 1 2 2 3 3 2 1 2 2 2 2 2 3 2 2 3 2 2 2 2 3 2 1 1 1 2 2 1 0 0 2 3 3 3 2 2 3 5 5 3 2 1 2 3 3 2 2 2 2 3
-1695 3 3 4 2 1 3 4 3 3 3 3 2 1 1 2 2 1 1 1 1 3 3 3 3 2 2 3 2 2 2 3 2 2 3 3 4 3 2 2 2 1 2 3 2 2 3 2 1 2 2 2 2 2 3 2 1 1 2 1 1 2 3 3 3 3 3 2 2 3 3 3
-1701 3 3 3 2 3 2 2 3 2 2 1 1 2 2 2 2 2 3 3 2 2 2 1 2 2 2 2 2 3 3 3 1 3 3 2 2 1 2 2 2 3 2 1 2 3 2 2 3 3 2 2 2 2 1 1 2 1 2 2 3 3 1 2 3 3 3 2 3 3 3 4
-1708 4 4 4 3 3 3 3 2 2 3 3 2 2 2 2 2 2 2 2 3 1 3 2 2 2 3 2 2 1 2 3 2 2 3 3 3 4 3 3 3 3 2 1 2 3 3 2 3 3 3 1 1 2 1 2 2 2 1 2 3 3 3 2 2 3 3 2 2 2 3 2
-1714 2 3 4 3 4 3 4 4 2 0 1 1 2 2 2 3 3 3 3 3 3 4 4 2 2 3 3 2 1 0 0 2 3 3 2 1 1 1 1 3 2 3 3 2 3 3 3 4 3 4 4 2 2 2 2 2 3 3 3 2 1 2 3 4 2 2 3 3 2 1 2
-1720 2 2 3 2 2 2 2 3 3 3 3 3 2 1 1 3 2 2 1 2 2 2 2 3 3 3 3 3 2 2 2 3 2 2 2 2 3 3 2 2 1 2 2 1 2 3 2 2 2 2 2 2 3 3 2 1 1 2 2 2 2 1 1 1 3 3 3 3 2 1 2
-1727 2 2 2 0 2 2 1 2 2 3 2 2 2 2 2 2 2 2 3 1 2 2 2 1 1 2 2 3 2 2 1 2 2 1 1 1 2 2 2 2 3 3 3 4 4 3 2 2 2 2 3 4 3 3 3 4 3 1 1 2 2 1 1 2 1 2 2 2 1 1 2
-1733 2 2 2 2 2 2 2 2 3 3 2 2 3 3 3 3 3 3 2 1 1 1 2 3 2 2 1 2 4 3 3 2 2 3 2 3 4 3 2 3 2 1 2 3 2 2 3 3 2 2 3 3 2 2 2 3 2 3 3 3 2 2 3 3 3 3 4 3 2 0 1
-1740 1 3 2 0 2 3 2 3 4 3 2 3 3 3 1 1 2 1 2 3 1 2 2 2 2 3 3 2 3 3 3 5 3 2 2 1 3 3 3 2 3 2 1 0 0 1 0 1 3 1 1 1 1 3 4 3 3 3 3 3 4 4 3 3 3 3 2 1 1 3 2
-1746 2 1 2 2 1 1 2 2 2 1 1 2 2 1 2 2 1 2 3 3 2 2 2 2 2 1 3 2 3 3 3 3 2 1 2 3 2 2 1 1 3 3 3 2 2 3 4 3 3 2 1 2 2 3 3 2 2 2 2 2 3 4 2 2 1 2 2 3 3 2 2
-1752 2 3 3 2 2 2 2 1 2 3 1 1 1 2 3 2 0 0 1 2 3 2 2 2 2 1 2 2 3 4 3 2 2 3 3 3 2 1 1 1 1 1 2 3 1 1 2 1 2 2 2 2 3 3 2 1 3 3 2 1 1 2 2 2 2 2 2 2 1 2 2
-1759 2 2 2 3 3 3 3 2 2 2 2 3 3 3 2 2 2 3 3 2 2 2 2 2 2 2 2 2 3 2 2 2 2 1 2 2 2 2 2 1 0 2 2 1 2 1 1 3 3 3 3 2 1 1 2 2 3 1 1 3 2 3 3 3 2 2 2 1 2 2 3
-1765 3 2 3 2 1 2 2 2 2 3 3 3 1 1 3 3 3 2 1 2 2 2 2 1 1 1 1 2 2 2 2 2 2 2 2 1 1 2 3 3 3 3 3 3 2 2 2 1 1 2 2 3 3 3 4 4 3 3 3 3 3 2 2 2 1 1 2 3 3 3 4
-1771 4 3 2 3 3 3 3 2 2 3 2 2 3 2 3 3 2 2 3 3 2 1 3 5 4 4 3 2 2 3 3 3 3 1 2 2 3 2 2 2 3 1 2 2 1 2 2 1 0 2 3 2 1 2 3 2 2 1 2 2 2 2 2 2 2 3 3 3 2 3 2
-1778 2 1 3 3 4 3 2 2 3 3 3 2 3 3 3 2 2 2 2 2 2 2 2 2 2 2 2 1 1 2 3 2 2 3 3 1 1 1 0 2 2 3 3 2 2 3 2 2 4 2 2 2 2 3 3 4 4 3 3 3 2 3 3 3 3 2 3 3 1 1 1
-1784 1 2 3 3 3 4 3 3 4 2 2 2 2 3 3 3 1 1 2 3 3 4 4 3 3 2 2 2 2 2 1 2 1 1 2 1 1 1 3 4 3 2 2 2 2 1 2 2 3 3 1 0 1 2 1 2 2 2 1 1 1 1 1 1 2 2 3 2 1 1 3
-1790 3 4 4 4 4 3 2 3 3 3 3 2 3 2 3 2 1 2 3 3 3 2 2 2 3 3 3 2 1 1 3 3 3 3 3 3 3 3 2 2 3 2 2 2 3 3 2 2 2 3 3 2 2 2 3 3 4 3 3 3 3 3 3 1 3 3 3 3 4 3 3
-1797 3 2 2 4 4 4 4 4 3 1 1 2 2 1 1 3 3 2 2 2 1 2 2 1 2 2 1 3 3 2 2 2 3 3 2 2 2 1 2 3 2 2 1 2 2 1 2 1 1 1 2 1 0 2 2 2 2 2 2 4 3 3 2 2 1 2 1 2 3 3 2
-1803 2 1 2 2 2 2 1 1 2 2 3 3 1 1 2 3 2 2 2 2 3 3 2 3 1 0 2 2 2 4 3 3 3 2 3 1 1 1 1 1 1 2 3 2 2 1 2 3 3 2 2 1 1 1 3 2 2 3 3 3 3 3 2 3 2 4 4 4 4 3 2
-1810 2 2 2 2 1 1 1 2 1 2 2 2 2 2 2 3 2 2 1 2 2 1 2 2 2 2 2 2 3 2 2 1 2 1 1 1 1 1 1 0 2 1 2 3 2 2 2 2 1 2 2 2 2 2 3 2 1 2 1 2 2 2 3 2 3 1 0 1 2 2 1
-1816 1 1 2 2 2 3 2 2 3 4 3 2 2 2 3 3 2 2 2 2 3 2 2 1 1 3 2 1 2 2 2 2 2 2 2 2 1 1 3 3 3 3 3 4 4 2 2 4 3 4 3 2 2 3 2 2 2 1 2 1 1 2 1 1 1 2 3 2 2 1 1
-1822 1 1 3 3 2 2 1 2 2 2 1 1 2 2 1 3 2 2 3 2 2 2 2 2 2 3 2 1 2 3 3 2 2 2 3 4 2 3 3 2 1 1 3 3 2 2 2 2 4 4 3 2 2 1 2 2 1 2 3 2 2 2 3 2 2 3 3 2 2 2 2
-1829 2 2 1 1 1 2 2 3 2 2 1 1 0 0 1 1 1 1 1 1 1 1 1 2 2 0 0 2 2 1 2 3 3 3 3 2 0 2 2 1 1 2 3 2 2 1 0 2 2 3 2 1 1 2 2 3 3 3 3 2 1 2 2 1 1 2 2 3 3 1 1
-1835 1 2 1 3 4 4 2 2 3 3 2 2 1 2 3 2 2 2 2 3 1 1 1 0 1 3 4 4 4 3 2 2 1 2 2 2 2 3 3 3 3 3 3 3 1 1 2 2 2 2 3 2 1 2 1 2 2 2 2 2 2 3 3 3 3 2 3 2 3 3 2
-1841 2 2 3 2 3 2 2 2 1 0 1 1 2 1 1 1 3 2 1 2 3 3 1 1 1 2 2 3 3 2 1 2 1 1 2 2 3 4 2 2 2 2 3 1 2 2 2 3 4 3 2 3 4 3 2 1 1 3 1 2 3 2 2 2 2 2 1 3 3 3 3
-1848 3 1 2 2 2 3 2 2 2 2 2 2 2 3 1 1 2 3 3 3 3 3 2 2 2 2 3 4 4 3 3 2 1 1 2 1 1 1 1 1 1 2 2 1 2 2 3 2 0 2 2 2 1 2 1 2 3 2 2 2 2 3 1 1 1 3 3 4 3 3 3
-1854 3 3 2 2 3 3 3 3 3 2 4 2 2 1 2 3 3 3 3 3 4 2 3 2 4 3 3 3 4 4 3 3 3 2 3 2 3 3 2 1 2 3 3 3 2 2 3 2 2 2 1 1 2 3 3 2 1 2 3 2 2 3 2 2 3 3 3 3 2 2 3
-1860 3 3 3 3 3 3 3 4 1 1 2 2 1 0 -1 0 1 0 1 1 2 2 3 4 3 2 1 1 3 4 4 2 3 3 4 4 2 2 1 2 3 3 3 2 3 2 2 3 2 2 2 2 1 2 1 1 2 2 3 3 2 1 1 1 1 1 1 1 1 1 2
-1867 2 3 2 2 1 3 4 3 3 2 2 1 3 3 2 2 3 2 3 1 1 1 1 2 2 2 2 2 2 2 3 2 2 1 1 2 3 3 3 3 2 2 2 2 1 3 3 2 3 4 2 2 2 3 3 2 3 3 3 3 3 3 2 3 3 3 4 2 2 2 2
-1873 2 2 3 3 4 2 2 3 3 3 3 3 3 3 2 2 2 2 1 2 3 2 1 2 2 1 2 1 3 2 2 2 4 4 2 2 2 2 3 3 3 2 2 2 2 2 3 3 3 3 2 1 2 2 2 3 3 3 3 3 3 4 3 2 2 3 3 3 3 3 2
-1879 2 1 2 2 3 2 2 2 0 1 3 3 2 2 2 1 1 1 2 1 1 2 2 3 4 4 3 3 3 4 4 2 1 1 2 1 0 2 2 3 3 4 2 2 2 3 3 3 2 2 3 2 1 1 2 3 2 2 1 2 4 3 2 2 2 2 1 2 2 3 3
-1886 3 3 1 2 3 3 3 3 3 2 1 2 2 3 3 2 2 2 2 2 2 3 2 1 2 1 3 2 2 3 3 2 2 1 1 1 2 2 2 1 0 1 2 1 1 0 0 2 3 1 2 3 2 3 3 3 2 3 1 2 3 1 2 2 1 1 2 2 2 2 3
-1892 3 3 2 3 3 3 2 3 3 2 2 2 3 2 2 2 2 3 2 2 2 3 3 2 2 2 2 2 2 1 0 0 2 3 3 3 3 2 2 2 2 1 1 1 3 2 1 2 1 2 2 2 1 2 2 1 2 2 3 5 3 3 3 3 2 2 4 3 3 3 2
-1899 2 3 3 2 2 1 1 2 2 3 2 2 5 4 3 3 3 2 3 3 3 3 2 2 3 3 3 2 3 3 2 1 2 1 2 3 2 2 2 1 2 3 2 3 3 2 2 2 3 3 2 1 1 2 2 2 2 4 3 3 2 3 3 2 2 2 2 2 3 3 2
-1905 2 4 4 3 2 2 2 3 4 3 2 2 2 2 1 3 4 3 3 3 3 2 2 2 2 2 1 2 3 2 3 2 1 1 2 3 2 2 3 3 3 1 0 3 3 2 1 1 2 2 2 3 3 2 3 2 3 2 3 3 4 3 3 3 2 3 4 2 1 1 2
-1911 2 1 2 2 1 1 0 2 3 2 2 3 2 3 3 3 2 2 4 3 3 2 1 2 3 3 3 2 3 3 2 2 1 2 2 2 3 2 2 1 2 2 2 2 3 3 2 1 3 4 3 3 3 2 3 2 2 2 3 3 2 0 0 2 2 2 1 1 3 2 2
-1918 2 1 1 1 2 2 2 1 2 2 1 3 2 2 2 2 2 2 4 3 2 4 4 3 3 3 3 2 3 2 1 1 3 1 0 1 0 0 1 0 1 1 0 0 1 3 3 3 2 2 3 3 3 3 3 3 2 1 2 2 2 2 2 2 2 1 2 2 3 3 2
-1924 2 2 3 1 2 3 3 1 1 2 2 4 3 3 3 2 1 3 4 3 2 2 2 1 3 2 1 1 2 2 2 1 2 3 3 3 2 3 3 3 2 2 2 3 3 1 2 1 2 2 3 4 3 1 2 3 3 3 2 3 3 2 3 3 3 3 4 3 3 3 3
-1930 3 2 2 2 1 3 3 4 4 3 2 4 3 3 3 3 1 1 2 1 2 3 2 2 2 1 2 2 3 2 2 2 1 2 3 3 1 1 3 2 2 1 2 4 3 2 3 2 2 0 2 2 3 3 3 4 3 3 2 2 1 2 3 2 2 2 1 2 4 3 3
-1937 3 2 3 3 3 2 3 4 3 2 2 3 2 3 3 2 2 2 3 1 2 3 2 2 1 2 3 3 2 2 3 2 1 1 1 2 2 2 3 2 2 1 1 2 1 1 3 3 3 2 3 3 3 2 1 1 1 1 2 2 2 2 2 2 2 2 3 3 2 2 2
-1943 2 2 2 1 1 1 1 2 0 0 1 3 3 1 1 2 2 1 2 3 4 3 2 2 0 1 2 3 2 1 2 2 3 2 2 2 4 3 3 3 2 2 1 2 3 3 3 2 3 4 3 3 3 5 4 3 4 4 2 2 3 3 1 2 3 2 1 2 2 2 2
-1949 2 2 2 2 2 2 2 2 2 2 3 2 2 2 3 2 2 2 1 2 3 2 3 3 3 4 4 1 1 1 2 2 2 1 1 2 1 1 1 2 2 1 2 3 4 3 1 2 3 2 1 1 1 2 2 2 2 1 2 1 2 2 1 2 3 3 3 2 2 3 3
-1956 3 3 3 4 3 2 2 2 2 2 1 2 3 3 2 3 2 2 1 1 3 4 3 1 1 1 3 4 4 4 3 2 1 0 1 2 1 3 2 2 1 1 1 1 2 3 3 3 2 1 2 3 3 4 2 2 2 2 2 2 2 1 2 2 2 3 4 5 3 3 2
-1962 2 2 3 3 2 3 2 2 2 2 0 2 2 2 2 2 2 3 3 2 1 2 1 2 3 3 2 1 2 2 4 3 2 1 3 2 2 2 1 0 1 2 2 2 2 3 3 4 3 3 3 3 4 4 3 3 1 2 0 1 2 1 1 1 2 2 1 2 3 2 2
-1968 2 2 2 2 2 2 2 2 2 2 3 2 2 3 4 4 3 4 2 1 1 1 3 2 2 3 2 1 2 1 1 2 0 2 3 2 2 2 3 2 2 2 2 1 2 3 2 2 2 2 2 2 2 2 3 3 2 2 3 3 2 1 1 3 2 2 1 0 1 2 2
-1975 2 2 2 2 2 3 2 2 2 2 3 3 3 1 3 4 3 2 1 2 2 3 2 2 1 2 2 3 4 3 3 3 5 4 2 3 2 2 2 1 1 1 2 1 1 2 2 2 0 2 2 1 1 2 3 2 2 3 3 3 2 3 2 2 2 1 1 2 2 3 3
-1981 3 2 2 2 1 1 1 2 3 2 2 2 2 2 3 3 3 4 4 3 2 3 3 3 2 1 1 2 2 1 2 3 3 1 2 1 1 1 1 1 1 1 1 2 2 1 1 2 1 1 2 3 2 2 2 1 1 2 1 2 2 2 2 2 2 1 3 3 2 2 1
-1988 1 1 2 1 0 1 1 1 2 2 2 2 4 3 3 4 3 3 3 3 2 2 3 2 3 3 3 2 2 2 2 2 2 2 1 1 2 2 3 2 2 2 2 3 3 3 3 2 1 0 0 1 1 0 1 3 1 1 3 3 3 1 3 3 3 4 3 3 1 1 1
-1994 1 2 2 2 2 2 1 1 0 0 2 2 3 3 3 1 1 1 2 2 3 3 3 2 3 4 2 2 1 1 2 1 2 2 1 1 2 1 2 4 4 2 1 1 1 3 4 4 3 3 3 3 3 1 2 2 3 3 4 4 3 3 3 3 3 3 3 2 2 2 2
-2000 2 2 3 3 2 3 2 2 2 2 2 1 1 2 1 1 1 1 2 1 1 3 3 2 2 2 3 3 2 2 2 2 2 4 2 3 4 4 3 2 2 3 2 1 2 2 4 4 2 2 2 2 1 2 1 3 5 3 2 2 2 3 1 1 2 2 3 3 2 1 2
-2007 2 3 3 5 3 2 2 1 1 2 1 3 3 3 3 3 3 2 2 2 2 3 4 3 2 2 2 2 2 3 2 2 2 2 2 2 2 2 3 3 1 1 2 2 3 3 2 2 2 3 3 3 3 4 4 3 2 1 2 1 0 0 1 2 2 2 2 2 2 2 2
-2013 2 2 1 1 2 1 1 2 2 2 1 2 2 3 3 3 2 3 1 1 2 2 3 3 4 2 2 1 1 3 4 3 2 2 2 1 1 1 0 0 1 2 2 1 2 3 2 2 3 3 4 3 3 2 2 2 2 2 2 3 3 3 2 3 2 1 2 2 1 2 2
-2019 2 1 0 0 2 2 2 3 2 1 1 1 2 2 2 1 1 2 2 2 3 1 2 1 0 2 1 1 0 2 1 1 2 1 1 2 1 0 1 1 2 2 3 2 1 2 3 3 3 2 2 1 0 0 2 3 3 3 3 2 2 1 2 3 3 2 2 2 3 3 2
-2026 2 3 2 2 1 1 0 1 1 2 2 1 1 1 1 2 2 2 2 2 2 1 3 3 3 1 2 2 3 4 3 3 2 1 1 2 1 0 1 2 3 3 2 2 3 4 4 3 2 2 2 2 2 3 2 3 2 2 2 2 2 1 1 2 2 3 3 2 2 2 2
-2032 2 2 2 2 2 1 2 4 2 1 1 1 1 1 3 2 2 3 2 2 2 1 1 2 1 2 2 2 2 3 2 2 2 3 3 3 4 2 2 2 2 3 4 3 3 2 2 2 2 2 3 2 2 2 1 1 2 2 2 3 3 2 2 2 1 1 3 3 2 2 2
-2038 2 2 2 1 1 2 1 0 2 2 2 2 1 2 1 1 2 2 2 2 2 2 2 2 1 1 1 1 2 3 2 2 3 4 4 4 3 2 2 1 3 4 3 3 2 3 4 4 2 2 1 2 3 3 1 1 3 3 2 2 3 3 2 2 1 1 1 3 3 2 1
-2045 1 1 3 2 2 2 2 2 0 2 2 2 2 3 2 2 2 3 2 2 2 2 2 2 3 2 1 3 3 3 2 3 3 4 3 2 2 3 4 2 3 2 2 2 2 3 3 2 3 3 3 2 4 4 3 4 3 2 3 2 2 2 2 2 3 4 3 1 1 2 2
-2051 2 3 3 3 2 2 3 1 1 2 4 2 1 1 2 2 0 1 3 1 1 2 2 2 2 2 1 1 1 1 2 3 2 2 3 1 1 1 1 1 3 2 3 2 2 2 2 3 2 1 3 4 4 3 2 1 1 2 1 1 1 2 1 1 1 1 2 2 2 2 2
-2057 2 2 2 1 2 3 3 2 1 2 3 3 3 3 1 2 2 2 3 2 1 1 2 1 1 2 2 2 2 2 3 3 4 3 3 3 2 3 3 2 1 1 2 2 1 2 1 1 2 3 3 3 2 2 3 2 2 2 3 1 1 1 1 1 1 2 2 3 3 3 3
-2064 3 2 1 1 2 2 2 3 3 1 2 3 3 3 2 2 2 3 2 1 2 2 2 2 2 2 1 1 2 2 2 2 2 3 3 3 3 2 1 2 3 1 1 1 2 2 2 1 2 1 1 2 3 1 1 1 1 2 2 2 2 2 2 2 0 1 2 2 3 2 0
-2070 0 1 1 2 2 2 2 1 2 2 2 2 2 2 2 1 1 3 3 2 1 1 2 2 3 2 1 1 1 0 1 2 2 2 2 2 2 2 2 2 1 1 2 2 1 3 4 4 1 1 1 2 2 1 2 2 3 3 3 3 3 3 2 1 1 1 1 1 1 0 0
-2077 0 2 2 1 1 0 2 2 2 3 4 3 2 3 2 2 2 3 2 1 2 1 1 1 1 1 2 2 1 1 2 2 3 2 2 2 2 3 2 1 2 2 3 3 2 3 3 2 2 2 3 4 2 2 2 3 2 1 2 2 2 3 3 3 2 2 3 2 2 3 3
-2083 3 2 1 2 3 4 4 4 2 3 2 1 2 2 1 2 2 3 2 3 3 2 3 2 0 2 3 2 1 2 2 3 3 2 2 2 2 2 2 2 1 0 1 2 1 2 2 2 3 3 2 4 3 3 2 2 2 1 1 1 2 2 1 1 1 1 3 3 1 1 2
-2089 2 2 1 1 1 2 2 3 1 1 1 2 2 3 3 2 1 1 1 1 1 1 2 3 2 1 1 0 1 2 3 3 3 2 2 0 2 3 2 1 2 2 2 3 3 4 2 2 4 3 4 3 2 2 2 2 2 3 3 2 2 3 2 2 2 2 3 2 3 3 3
-2096 3 4 2 3 2 3 3 2 2 2 3 2 2 2 2 2 2 3 2 3 1 1 2 1 3 3 3 2 2 2 2 2 4 3 4 3 3 3 2 3 3 3 3 1 1 1 3 2 2 1 1 1 3 3 1 1 1 1 2 2 2 3 2 1 2 1 2 2 2 3 2
-2102 2 2 1 1 2 3 2 1 1 1 1 2 2 2 1 2 3 3 2 3 3 3 4 4 3 2 3 3 3 3 2 2 2 3 4 4 3 1 2 3 3 3 2 3 2 2 2 2 3 3 4 3 1 1 2 1 2 2 2 2 1 1 1 1 1 1 2 2 1 2 1
-2108 1 2 2 1 2 2 2 2 3 1 1 1 3 2 2 2 2 3 2 2 3 1 1 3 3 3 3 2 3 2 1 2 1 2 2 2 2 3 3 2 2 2 3 3 2 3 1 1 3 4 2 2 2 1 2 2 1 2 2 2 2 3 2 2 3 2 2 2 2 2 2
-2115 2 2 2 2 2 1 1 2 2 1 1 2 3 1 1 1 2 3 2 1 3 3 2 3 2 2 2 3 3 2 2 1 2 1 2 3 3 3 3 1 2 2 3 4 3 3 2 1 1 1 2 2 2 2 1 1 2 1 3 4 3 3 2 1 2 2 1 1 1 1 2
-2121 2 2 2 2 2 2 2 2 2 1 1 2 2 2 1 1 1 1 3 2 2 1 2 3 2 2 3 3 1 1 2 2 2 1 3 2 2 2 3 3 2 4 3 2 3 3 2 2 3 3 3 3 3 2 3 2 1 0 1 1 2 3 2 2 1 2 2 3 3 2 2
-2127 2 2 1 2 2 2 2 1 2 3 2 1 1 1 1 2 1 2 3 2 2 3 3 2 2 2 3 4 2 2 3 3 3 3 2 3 4 3 2 1 2 1 2 2 2 2 2 2 2 3 3 3 3 2 2 3 2 2 3 3 2 3 3 3 2 2 2 2 2 2 1
-2134 1 1 2 2 1 0 0 2 3 3 3 3 3 3 2 1 2 1 2 2 2 1 2 2 3 3 3 1 1 2 2 2 2 2 2 3 2 2 2 2 2 2 2 2 3 3 3 3 3 3 4 3 2 3 2 1 2 3 3 2 2 2 2 2 3 3 3 3 3 2 0
-2140 0 2 3 3 4 4 3 3 3 3 2 1 2 1 1 1 2 2 2 1 1 2 2 2 2 2 2 2 2 1 0 2 3 3 2 2 2 3 3 3 2 3 3 1 1 2 2 3 3 3 2 3 2 1 2 2 2 1 2 2 2 2 1 2 2 2 1 2 4 3 3
-2146 3 3 3 2 3 3 1 2 2 1 2 2 3 3 2 3 3 3 3 2 2 3 3 2 1 2 4 3 1 2 2 2 2 3 3 2 3 4 3 3 3 1 2 2 1 1 2 2 2 1 0 0 1 1 1 1 2 2 2 3 2 2 3 2 4 3 1 2 2 3 2
-2153 2 2 2 2 2 1 1 1 2 1 2 1 2 2 2 1 1 2 2 2 1 1 1 1 3 3 2 1 1 2 3 3 1 0 1 1 1 2 1 2 2 2 2 2 1 1 1 2 2 1 2 2 1 1 1 2 2 2 2 2 2 2 1 1 3 2 1 1 1 1 1
-2159 1 1 2 3 3 3 3 3 3 3 3 1 1 2 2 2 1 1 3 2 1 1 0 -1 -1 2 1 0 1 2 2 3 2 2 2 2 1 2 2 1 1 2 3 2 2 3 3 4 3 4 3 1 2 2 1 1 2 3 3 2 1 2 1 1 3 3 3 3 3 2 3
-2166 3 3 1 2 2 2 2 3 3 2 2 2 2 2 2 1 1 2 2 1 2 3 3 2 2 1 1 1 2 3 3 2 2 2 1 1 3 3 2 2 2 2 2 2 1 1 1 1 2 2 2 2 1 2 0 3 2 2 3 2 3 3 3 1 2 3 3 3 3 3 3
-2172 3 3 2 3 3 3 2 2 3 3 2 2 2 2 3 4 4 3 2 3 3 3 3 2 3 2 1 1 1 1 1 1 2 2 2 1 1 2 1 2 3 2 2 1 2 2 0 0 2 3 2 2 2 2 1 2 2 2 1 1 1 2 2 1 2 2 1 1 1 1 2
-2178 2 3 2 2 0 2 3 2 2 3 3 3 2 2 3 2 2 3 2 2 3 3 2 2 3 2 2 2 3 2 1 2 3 2 0 -1 1 2 2 2 1 2 2 3 3 3 2 1 1 1 2 3 2 2 2 3 3 2 2 1 0 2 3 2 2 2 3 2 2 3 2
-2185 2 1 1 2 0 0 1 2 2 1 2 1 1 2 2 2 1 0 1 0 1 2 3 3 1 2 2 2 2 2 2 3 4 2 1 1 1 2 2 1 2 3 2 2 3 2 4 5 4 2 2 2 3 2 2 2 2 2 2 3 2 3 3 3 3 4 3 2 1 0 -1
-2191 -1 0 1 1 1 2 2 2 2 2 1 1 2 2 2 3 3 2 3 3 3 4 3 2 2 3 3 1 0 1 1 1 1 2 4 2 2 3 3 2 2 2 3 2 2 3 2 0 2 1 0 2 2 2 2 2 2 2 2 1 2 3 3 2 2 2 1 1 1 1 1
-2197 1 3 3 3 3 3 3 2 2 3 3 3 3 2 2 2 2 2 4 4 2 1 1 2 2 2 3 3 2 2 2 2 2 2 2 3 3 3 3 2 2 3 3 3 3 3 2 2 3 3 2 2 3 3 3 3 2 2 2 2 3 4 4 3 2 2 1 2 2 2 3
-2204 3 2 2 2 2 3 1 2 3 3 3 3 4 3 1 2 1 1 2 2 2 2 2 2 2 3 3 2 1 2 2 1 2 2 1 0 0 2 2 0 0 1 0 1 2 3 3 2 1 1 1 1 2 3 2 3 3 2 3 3 3 2 2 3 3 3 3 2 2 1 1
-2210 1 1 2 2 2 1 2 1 2 2 1 0 0 0 2 3 2 1 2 3 3 3 2 2 2 1 1 2 2 5 3 2 3 1 1 2 2 2 1 1 3 3 3 2 1 2 3 2 2 3 3 2 1 1 2 1 2 3 2 2 1 0 1 2 2 2 1 2 4 1 1
-2216 1 2 2 2 2 2 1 2 3 3 1 1 1 0 1 2 0 2 3 2 2 2 2 2 1 1 0 2 3 1 2 3 3 1 2 1 2 1 1 1 2 3 2 1 1 1 2 2 2 2 2 2 2 1 3 4 2 2 3 1 1 1 3 2 2 3 2 1 1 2 2
-2223 2 1 2 4 4 3 3 3 3 3 3 3 3 3 3 2 2 3 3 3 2 2 1 1 1 1 2 2 1 1 1 2 2 2 1 3 2 2 3 2 2 2 2 2 3 1 1 3 3 2 1 2 2 2 1 2 2 1 2 2 2 2 2 2 3 3 3 2 2 1 1
-2229 1 1 1 1 2 2 3 3 2 2 1 1 2 2 2 3 2 2 2 2 2 1 1 2 3 2 1 2 1 1 2 3 4 3 1 2 2 2 3 3 3 3 3 4 3 2 3 2 2 1 1 1 1 1 3 2 2 2 1 2 1 2 2 3 3 3 3 3 3 3 3
-2235 3 4 3 3 2 2 2 2 2 2 2 3 3 3 3 4 4 3 2 2 2 3 3 2 2 2 2 3 2 1 1 1 2 2 1 1 2 2 2 2 2 2 1 1 1 1 1 1 1 2 2 4 4 3 4 3 2 3 4 2 3 2 2 2 1 2 4 5 4 2 2
-2242 2 2 2 2 2 1 2 3 1 1 1 3 4 3 2 1 1 2 2 1 2 2 2 3 2 1 1 2 1 1 1 1 1 1 1 1 0 0 0 2 2 2 2 2 3 4 3 3 3 3 3 3 4 1 1 2 2 3 2 2 2 2 1 1 2 1 1 2 2 2 2
-2248 2 1 1 1 0 1 2 2 1 2 2 2 2 1 1 1 0 1 2 2 1 2 3 1 1 0 2 1 1 2 1 1 3 2 2 2 3 2 2 3 3 2 1 1 2 2 1 2 1 2 2 1 1 1 2 3 3 3 2 3 2 2 2 1 1 2 3 1 1 2 3
-2255 3 1 2 2 2 2 1 1 1 1 1 2 2 2 2 3 2 1 2 2 3 2 2 2 2 1 2 3 3 1 1 2 2 2 2 3 2 2 2 4 3 4 4 3 2 2 2 1 2 2 2 3 2 2 2 3 3 2 2 1 2 3 1 2 1 0 2 4 3 2 3
-2261 3 3 3 3 2 2 3 3 1 2 2 3 4 3 3 2 2 3 2 2 2 2 2 2 1 2 1 2 1 2 3 2 2 3 3 3 2 1 2 2 3 2 3 2 2 3 3 3 2 1 1 2 1 1 1 1 1 3 2 2 2 2 2 2 3 3 4 2 3 2 3
-2267 3 2 2 3 3 3 1 1 2 1 2 4 3 2 2 1 3 1 3 2 1 1 3 2 1 2 2 3 3 3 2 2 2 1 3 1 0 1 1 2 3 3 3 1 1 2 2 3 2 3 3 3 3 3 3 3 1 1 3 2 3 3 4 3 4 2 2 1 2 3 3
-2274 3 2 3 3 2 2 1 1 1 2 2 2 2 2 1 1 2 2 2 2 3 2 1 1 0 0 2 1 0 1 1 2 3 2 1 2 1 2 3 2 3 2 3 3 3 3 2 2 3 3 3 3 2 1 2 1 2 3 2 2 2 1 2 3 3 3 3 3 3 3 3
-2280 3 2 2 3 3 3 3 3 3 2 1 2 2 2 2 3 1 2 1 2 2 1 1 2 2 2 2 1 3 3 2 2 2 2 2 3 3 3 2 2 1 2 3 4 3 2 3 4 3 2 2 3 4 3 4 2 1 2 2 1 1 0 1 1 3 2 2 3 3 1 1
-2286 1 2 3 2 2 2 2 1 0 1 2 2 2 1 1 1 3 3 1 1 2 0 0 1 2 3 2 2 2 1 2 1 1 3 1 1 0 2 2 2 2 1 1 1 1 1 3 3 4 2 3 2 3 2 2 2 2 2 2 1 1 2 3 2 0 1 2 3 2 2 3
-2293 3 3 2 1 3 3 3 3 3 3 2 2 2 2 2 2 2 1 1 1 2 3 2 3 3 2 2 1 1 2 0 3 4 2 2 3 3 2 1 0 0 0 2 3 3 2 1 0 1 1 2 1 1 1 1 2 1 2 2 1 2 3 2 2 2 3 2 2 3 4 3
-2299 3 3 2 1 2 3 2 2 2 3 2 1 1 2 2 2 2 2 2 2 2 1 1 1 2 2 2 2 2 1 0 1 2 3 3 2 3 2 3 3 1 2 2 3 3 3 2 2 1 1 2 3 3 3 3 2 1 2 2 3 2 1 1 1 1 0 0 0 2 3 3
-2305 3 3 3 3 1 1 1 1 1 2 1 1 1 2 2 2 2 2 1 2 1 3 3 2 2 1 2 2 2 3 2 2 2 2 3 2 0 1 2 4 3 3 3 2 2 1 2 1 2 2 1 1 2 3 2 2 1 2 1 2 1 1 1 0 1 1 1 2 2 2 1
-2312 1 2 3 2 1 1 2 3 2 2 2 2 1 2 3 3 3 3 3 3 1 1 3 3 1 1 1 2 2 2 2 2 1 2 3 2 1 1 1 2 3 2 2 2 2 1 3 3 2 2 3 2 2 2 2 3 3 2 3 3 1 2 2 3 3 2 3 3 2 2 3
-2318 3 2 3 2 2 3 2 2 2 2 3 2 2 2 1 2 3 2 2 3 5 3 3 4 3 2 1 1 2 2 2 2 1 2 2 1 1 1 1 0 1 2 1 1 1 2 2 3 2 2 2 2 2 2 2 1 2 2 2 1 1 1 0 1 2 2 0 0 1 2 4
-2324 4 4 3 1 1 1 2 3 3 3 2 1 2 2 2 3 3 2 2 2 1 1 1 3 3 3 4 3 3 3 3 1 1 2 3 3 3 2 2 4 2 2 3 4 3 2 2 2 3 2 2 2 2 2 1 1 2 2 2 2 2 3 3 3 2 2 2 1 2 2 2
-2331 2 1 1 1 3 3 3 2 2 2 3 3 2 1 2 3 1 1 2 4 3 3 1 1 2 3 2 2 2 2 3 2 3 2 0 1 3 3 2 2 2 2 2 3 3 3 2 2 3 1 1 0 1 1 2 3 3 2 2 3 2 2 3 2 1 1 0 1 1 0 2
-2337 2 2 2 2 1 2 3 2 2 2 2 2 2 2 2 1 3 2 2 2 3 3 4 3 3 3 2 3 3 2 2 2 2 2 1 0 2 3 3 2 2 1 1 2 3 1 2 2 1 0 1 2 2 2 2 2 1 2 2 3 3 2 3 2 1 1 2 2 2 2 2
-2344 2 2 1 1 1 1 3 3 2 2 4 5 4 3 1 2 1 0 2 2 0 0 0 2 2 1 2 3 2 2 1 3 2 2 2 1 1 2 3 3 3 2 1 2 2 1 3 3 3 3 2 1 2 2 1 1 2 1 1 1 1 2 2 2 1 1 1 2 2 0 2
-2350 2 1 0 1 1 2 2 2 1 2 3 3 1 1 1 1 1 1 1 1 0 1 3 3 3 3 3 3 2 3 3 2 2 2 2 1 1 2 1 2 1 1 3 2 2 2 1 2 2 2 3 3 1 1 1 3 4 2 2 1 1 1 3 2 1 1 1 2 2 2 1
-2356 1 1 2 2 2 2 2 2 1 1 2 0 0 2 2 3 4 2 2 2 2 2 1 2 2 3 2 1 2 2 2 1 1 1 3 2 1 1 2 1 2 3 2 1 1 1 2 2 1 2 2 1 2 2 2 2 2 2 2 2 1 2 3 1 0 2 3 4 4 3 3
-2363 3 3 3 3 2 1 2 3 3 3 2 3 3 2 2 2 1 2 2 1 3 3 3 3 3 1 1 2 3 2 2 2 2 3 3 2 2 3 1 2 2 2 2 2 2 2 2 4 3 3 2 1 3 3 1 2 1 2 2 1 3 2 2 2 2 1 2 2 2 1 2
-2369 2 2 2 2 3 4 3 1 2 2 1 2 3 4 1 0 0 1 1 2 2 3 3 2 3 2 2 2 2 2 0 1 1 2 2 1 1 3 3 2 2 2 1 1 1 2 4 2 2 2 3 2 2 2 1 2 3 3 2 2 3 3 3 2 1 3 2 1 2 2 1
-2375 1 -1 0 1 1 2 1 1 1 3 2 2 2 1 1 1 3 2 2 2 3 3 3 2 2 1 1 0 1 2 2 1 3 3 2 2 3 3 4 4 3 3 3 2 3 2 1 2 1 1 1 1 1 2 4 3 2 1 1 2 2 2 1 2 1 1 2 2 2 1 2
-2382 2 1 1 1 2 2 2 2 3 1 0 1 1 1 1 1 1 2 3 2 3 2 2 2 2 2 0 2 2 2 2 1 1 3 2 1 3 2 3 3 2 2 2 3 2 2 2 2 1 2 2 2 3 3 3 3 2 3 2 2 2 1 3 3 2 1 2 3 2 1 1
-2388 1 2 2 2 2 3 3 2 1 1 1 1 0 1 3 2 3 1 0 0 1 2 1 2 2 1 2 2 2 2 1 2 1 1 3 2 2 1 0 0 1 2 1 0 1 1 1 2 4 2 3 3 2 2 2 2 1 2 1 1 1 1 2 1 0 0 1 1 1 2 2
-2394 2 2 2 1 1 1 1 1 2 2 2 2 2 2 2 1 1 1 2 2 2 2 2 2 2 2 2 1 0 2 2 2 1 1 3 3 3 3 4 3 3 3 3 3 1 1 2 2 3 3 1 2 1 1 1 1 1 1 2 3 3 3 3 3 1 1 1 1 1 1 2
-2401 2 3 3 3 1 1 3 1 0 1 2 2 1 1 1 2 1 1 2 2 0 0 2 1 1 2 2 1 1 2 3 3 2 2 1 1 1 1 1 0 1 2 2 2 2 2 1 2 1 2 1 1 2 2 3 3 2 1 2 3 3 2 2 0 1 2 1 1 1 2 1
-2407 1 2 2 0 1 1 2 2 2 2 3 2 2 2 1 1 1 1 2 3 2 3 1 1 3 3 2 2 2 2 1 3 2 0 1 3 3 3 3 3 3 2 2 2 2 1 2 4 3 2 2 1 1 2 4 3 2 2 2 2 2 2 3 3 3 2 0 1 1 1 1
-2413 1 1 1 2 2 1 1 1 1 2 1 1 0 0 2 2 2 3 2 1 2 2 2 1 0 1 0 1 2 1 1 1 1 1 1 2 2 2 2 1 2 2 2 2 1 2 1 2 2 2 2 3 2 2 4 4 4 4 2 2 1 2 3 2 2 2 1 2 2 2 1
-2420 1 0 2 2 1 1 3 2 1 1 1 2 1 0 1 2 1 2 2 3 3 2 1 3 3 3 2 1 2 1 2 1 1 2 1 1 1 1 0 2 2 2 1 2 2 1 1 2 3 1 1 2 2 2 2 2 2 3 2 3 3 3 4 3 2 1 1 2 2 2 1
-2426 1 2 2 4 4 2 1 2 2 3 3 2 1 1 1 1 1 0 0 1 1 1 0 1 2 2 2 2 3 2 3 3 2 2 2 2 2 2 1 0 0 2 3 3 1 1 2 2 3 3 2 2 2 2 2 1 1 0 0 2 2 3 2 1 2 2 2 2 1 2 2
-2433 2 2 2 2 3 2 2 3 0 1 2 2 1 2 2 1 1 1 2 3 2 2 3 3 2 1 1 2 0 1 1 3 3 1 2 1 2 2 2 2 1 1 2 1 2 3 3 2 2 1 1 1 2 2 2 3 3 3 2 2 1 2 3 2 3 2 2 2 3 1 2
-2439 2 1 1 2 2 1 2 2 2 2 2 2 1 1 1 2 2 2 2 2 2 2 2 2 3 3 2 2 2 3 3 2 3 1 0 1 0 1 1 2 2 2 3 2 1 3 2 0 1 3 1 1 2 1 3 4 3 3 3 3 3 3 2 1 3 3 3 2 3 2 2
-2445 2 2 1 1 3 3 1 2 4 4 2 2 3 3 3 1 1 1 2 3 3 2 1 1 1 1 1 1 3 3 2 2 3 2 1 1 2 2 2 3 2 1 2 2 1 1 2 1 2 1 0 2 2 0 0 1 3 2 1 2 3 2 1 2 2 3 2 2 3 2 2
-2452 2 2 3 2 2 2 2 3 2 2 3 2 2 2 3 1 2 2 1 3 3 2 2 2 0 2 2 2 2 3 2 1 2 3 2 2 1 1 2 1 2 2 2 2 2 3 2 2 3 3 3 3 4 4 2 1 1 0 0 1 2 3 2 2 2 2 3 3 3 3 3
-2458 3 2 1 1 1 1 1 3 4 3 3 2 1 1 2 3 2 1 1 1 1 0 1 3 3 2 2 2 2 1 1 1 2 1 2 2 1 2 2 3 2 1 2 2 2 2 2 4 4 3 3 3 3 2 0 1 1 1 0 1 1 3 2 1 0 1 2 2 2 2 2
-2464 2 2 1 2 3 1 1 1 1 2 2 2 1 2 3 3 3 3 1 3 3 2 1 2 2 1 0 1 2 2 2 2 2 2 2 1 1 1 1 2 2 1 1 2 4 5 3 3 3 2 2 1 2 1 1 1 -1 0 1 0 0 1 1 2 3 1 0 1 1 1 0
-2471 0 1 1 1 2 1 3 3 3 1 2 3 1 2 2 2 3 2 2 2 1 1 0 0 0 1 3 3 2 3 3 2 2 2 2 3 3 2 1 2 1 2 2 2 2 2 3 3 3 2 2 3 2 1 1 2 2 1 1 2 2 1 1 1 2 2 2 1 3 2 3
-2477 3 3 3 2 2 2 2 2 2 2 2 1 2 2 1 1 2 2 3 3 3 2 2 1 2 3 3 1 3 3 3 2 3 2 1 2 2 2 2 2 2 3 2 2 3 3 2 3 3 2 2 2 1 1 1 2 2 1 1 2 3 3 2 2 2 2 2 3 3 3 4
-2483 4 3 2 3 2 3 3 3 3 3 3 2 3 1 2 2 2 3 2 2 2 1 2 2 2 3 2 1 1 1 2 2 1 1 2 1 1 3 3 2 1 2 1 1 3 4 2 4 3 1 1 2 2 2 1 1 2 2 1 3 2 2 2 2 1 2 2 3 2 2 2
-2490 2 1 2 2 3 3 3 2 1 1 1 1 2 2 3 4 3 2 2 1 2 3 3 3 1 1 2 1 1 1 1 2 3 3 2 2 0 1 1 3 3 3 2 2 2 1 1 2 2 2 3 3 2 1 2 1 2 0 1 2 1 0 1 1 1 2 1 2 2 1 2
-2496 2 3 4 3 2 2 2 2 2 1 1 1 2 3 1 1 1 1 1 2 2 2 1 1 2 2 2 3 3 2 2 3 4 4 2 2 2 1 -1 0 1 0 0 1 2 3 3 2 2 2 2 3 2 1 2 2 2 3 0 1 2 2 1 2 2 2 1 1 2 2 2
-2503 2 1 2 3 3 3 2 3 2 3 4 3 3 3 3 1 1 1 2 2 2 2 2 2 2 1 0 1 2 1 2 3 3 3 2 1 2 2 2 2 2 3 4 2 1 2 1 2 2 0 0 1 1 1 2 2 1 1 2 3 3 3 2 2 3 3 1 3 3 3 3
-2509 3 3 2 2 1 2 1 2 1 1 2 2 2 3 2 1 2 2 2 2 2 1 1 2 1 1 2 1 2 1 1 1 1 1 1 1 1 0 1 1 1 2 1 2 2 2 1 1 3 2 2 3 4 4 4 2 1 3 3 3 2 2 1 1 1 1 2 3 1 1 1
-2515 1 2 0 0 2 2 2 2 2 1 1 2 3 3 2 1 2 2 3 3 3 4 3 4 2 1 1 1 2 3 3 2 2 1 2 1 1 2 2 2 2 2 2 0 1 2 2 2 2 2 2 3 3 3 2 2 2 1 2 2 2 1 1 0 1 1 0 1 2 2 3
-2522 3 2 2 2 2 3 2 1 1 3 3 3 3 2 3 3 3 3 3 2 1 1 3 3 2 0 2 2 2 2 1 0 1 3 3 3 3 4 2 2 2 3 2 1 1 1 2 3 3 2 2 1 1 1 2 2 2 3 2 2 3 2 2 1 1 2 2 1 2 2 2
-2528 2 3 3 2 2 2 3 3 3 3 3 2 2 2 2 1 1 2 1 1 3 3 3 2 2 2 2 2 3 2 1 2 1 1 1 1 2 2 2 1 2 2 0 0 1 0 1 0 1 2 2 3 2 2 1 1 1 1 1 2 2 1 1 2 2 3 3 3 4 3 2
-2534 2 1 2 3 2 2 2 3 3 2 3 3 2 1 1 2 2 2 3 4 3 2 2 2 3 3 3 2 2 1 2 2 3 2 3 2 3 3 2 2 1 2 3 2 2 3 2 1 2 2 1 1 2 3 2 1 2 2 1 1 2 3 2 1 3 2 3 3 4 5 2
-2541 2 1 2 3 3 3 2 2 2 1 3 3 2 3 2 3 3 2 1 1 1 2 2 3 4 5 3 3 1 1 1 1 2 2 1 1 1 1 2 1 1 1 1 1 1 1 2 3 3 2 3 3 2 1 2 1 1 1 1 2 0 1 2 1 2 2 2 3 1 2 2
-2547 2 2 3 3 2 4 3 2 2 2 1 2 2 2 1 1 1 2 2 2 4 3 1 2 3 2 3 2 2 3 2 3 2 2 2 1 2 3 2 1 1 2 3 1 1 2 1 1 1 2 3 3 3 2 2 1 1 0 1 2 2 1 3 2 1 1 1 1 1 1 1
-2553 1 2 2 3 2 2 2 3 2 4 4 3 3 2 2 1 1 1 2 2 2 2 3 3 3 2 2 2 2 2 2 2 3 3 3 2 1 1 1 2 0 1 1 2 3 3 2 1 2 2 3 3 2 2 4 2 1 2 1 1 1 2 3 2 1 2 1 1 2 2 2
-2560 2 3 2 2 3 2 2 2 2 2 3 2 2 2 2 1 2 3 3 3 3 3 3 2 2 3 3 3 3 3 3 2 2 1 2 1 0 1 1 0 1 2 3 3 1 0 1 3 2 2 3 2 3 2 1 2 2 2 1 1 2 3 3 3 4 3 3 2 1 1 1
-2566 1 2 2 2 1 2 2 2 1 1 0 0 1 2 2 3 3 3 3 2 2 2 2 2 2 2 2 2 2 2 2 3 2 3 2 2 2 1 1 2 1 2 1 0 0 0 0 1 2 1 2 2 2 1 0 0 1 1 2 2 1 2 1 2 1 1 1 0 1 1 1
-2572 1 2 0 1 1 1 1 1 1 1 1 2 2 2 1 1 1 1 2 1 2 2 1 1 1 1 1 3 2 3 2 1 2 2 3 1 1 3 3 3 2 2 2 2 2 1 2 2 2 3 2 3 4 3 3 4 4 2 1 1 3 2 3 2 2 2 2 2 3 2 2
-2579 2 2 3 2 1 2 2 3 2 2 1 1 2 1 0 1 2 2 2 2 2 1 1 2 1 2 1 1 2 1 1 1 2 3 2 2 2 2 2 3 4 3 2 1 1 1 1 1 1 1 2 2 1 1 2 2 2 2 2 2 1 1 2 2 3 3 3 3 2 1 2
-2585 2 3 2 2 1 1 1 1 2 2 2 2 2 2 3 3 2 1 3 3 2 2 3 3 2 1 2 2 1 1 1 1 2 2 2 3 4 3 2 2 1 2 3 1 1 2 4 2 2 1 1 2 3 2 1 2 1 2 2 1 2 3 3 2 2 2 3 2 1 2 2
-2592 2 2 3 3 2 2 3 2 2 2 1 2 1 2 3 2 2 3 2 3 3 4 4 4 3 2 1 1 3 3 2 1 1 1 0 0 0 0 1 3 3 3 1 1 2 3 1 1 2 1 2 1 1 1 2 2 2 2 1 1 2 0 2 3 3 2 2 1 2 2 2
-2598 2 0 1 1 2 3 4 2 3 3 2 2 2 2 2 2 2 2 2 2 2 2 3 2 2 1 2 2 3 2 1 2 1 3 4 2 1 1 1 3 2 2 1 2 1 2 1 2 3 1 1 2 2 0 2 3 3 2 2 2 2 2 1 1 1 2 1 1 2 2 2
-2604 2 2 3 3 2 2 2 2 0 1 1 1 2 2 2 1 1 2 2 2 1 1 1 2 2 2 3 3 3 2 2 2 2 2 1 2 3 2 2 1 2 3 3 3 2 3 2 2 3 3 3 3 2 1 1 2 2 3 2 1 1 3 3 3 3 2 2 2 0 0 1
-2611 1 1 2 3 3 2 2 2 2 2 2 2 0 1 1 2 1 1 2 1 1 3 2 1 0 0 2 1 1 2 3 3 3 2 3 3 3 1 2 1 1 2 2 2 2 1 1 3 3 3 2 2 2 2 3 2 2 1 1 0 1 3 4 4 5 3 3 3 3 3 2
-2617 2 0 1 2 2 2 1 2 3 3 2 2 1 1 3 3 1 2 2 2 2 3 2 1 1 1 1 1 1 1 2 1 0 1 2 2 3 3 3 3 2 3 2 3 2 1 1 1 1 1 2 1 1 2 3 4 2 2 3 3 3 2 2 2 2 3 2 1 1 2 2
-2623 2 1 3 3 2 1 1 1 1 2 1 2 2 2 2 2 2 2 2 2 3 2 1 1 2 3 1 0 1 2 2 3 3 3 2 1 1 1 2 3 3 4 2 1 2 2 1 2 2 2 2 1 1 1 1 1 1 3 2 2 1 1 0 1 2 1 2 3 3 3 4
-2630 4 2 2 2 1 1 2 2 2 2 2 2 2 2 2 2 2 2 2 3 4 1 2 3 3 3 3 3 3 3 3 1 1 2 2 1 0 2 2 2 1 1 2 2 2 1 2 2 2 2 3 2 2 2 3 2 1 2 2 2 2 2 2 2 2 1 2 2 2 2 1
-2636 1 2 2 2 3 4 3 2 1 1 3 3 3 2 1 2 2 1 3 2 2 1 1 0 0 2 2 3 2 3 3 2 1 2 2 2 2 2 1 2 2 2 1 2 2 2 3 3 4 4 3 3 2 2 2 2 2 1 1 1 1 1 2 3 2 0 1 2 2 2 3
-2642 3 2 2 1 2 1 1 3 3 1 2 2 2 3 3 2 2 2 2 3 2 1 1 1 1 0 1 3 3 4 3 3 3 1 1 1 2 3 3 2 2 3 2 2 3 2 3 3 3 2 2 2 1 2 2 2 2 2 1 0 2 1 1 1 1 1 2 1 0 1 1
-2649 1 0 1 1 1 2 1 2 2 2 3 2 2 2 2 1 1 1 1 0 1 2 2 2 3 2 3 2 1 3 1 2 2 2 2 1 1 2 2 3 3 3 3 2 1 2 2 1 3 2 2 2 1 1 1 1 1 2 3 3 3 2 1 2 3 2 2 3 3 2 1
-2655 1 0 1 1 2 2 1 2 2 1 2 2 3 1 2 2 2 3 3 2 1 2 1 0 2 3 2 2 2 1 2 2 2 2 2 2 3 3 1 2 2 1 2 2 2 2 2 2 2 2 3 2 1 1 0 0 -1 1 2 1 1 2 3 3 2 1 1 2 2 1 1
-2661 1 2 2 3 3 3 2 2 3 2 1 2 3 3 2 2 2 2 2 2 3 3 2 2 0 1 2 3 2 2 2 2 3 2 2 3 2 2 2 3 3 4 3 2 2 2 2 2 2 1 3 3 0 0 1 2 2 2 1 1 2 2 3 2 1 2 3 1 1 2 3
-2668 3 4 3 0 0 2 2 2 2 2 3 3 4 2 2 2 2 2 2 3 2 1 0 0 0 1 1 0 1 1 3 2 0 1 3 2 1 1 2 1 1 1 1 3 3 4 3 3 2 3 3 2 2 2 3 2 2 2 3 3 1 2 1 1 1 1 1 2 2 1 2
-2674 2 2 2 2 1 2 2 2 2 1 2 3 3 1 1 2 1 3 2 2 1 2 2 3 3 2 2 2 0 1 2 1 0 1 1 1 2 3 3 3 3 3 1 2 1 2 2 1 2 2 2 0 2 2 2 3 3 3 2 1 2 3 3 2 3 3 3 2 2 2 1
-2681 1 2 3 1 0 0 -1 2 2 1 1 0 1 2 3 3 3 2 2 2 2 3 3 3 3 2 1 1 1 2 3 2 1 0 2 2 1 1 1 1 2 3 3 3 1 1 0 1 1 2 3 3 3 3 2 1 1 1 3 3 3 3 2 3 3 2 2 2 2 1 2
-2687 2 2 3 3 3 3 3 3 2 2 2 2 1 2 1 2 1 0 0 0 0 2 2 2 1 0 1 2 2 2 1 1 3 3 2 1 1 2 4 4 2 2 2 2 3 2 3 2 1 2 1 3 2 1 1 1 3 3 2 2 1 2 3 3 3 4 3 2 2 1 1
-2693 1 2 2 1 1 1 0 1 2 1 0 0 1 2 1 1 1 0 1 0 1 1 1 1 2 4 3 1 2 2 3 2 1 2 2 2 1 0 1 1 2 2 3 3 3 3 2 2 2 3 2 2 2 1 2 2 3 3 3 3 3 3 2 2 1 -1 0 1 1 2 1
-2700 1 2 2 2 2 2 2 3 1 1 1 2 2 1 2 2 3 1 1 1 2 2 2 2 2 2 3 3 2 1 2 3 2 3 2 1 1 1 1 1 2 2 2 2 3 3 3 4 4 3 1 1 1 2 2 2 2 1 1 2 2 1 1 2 3 2 2 2 1 1 3
-2706 3 2 1 1 2 2 2 2 3 3 1 2 2 2 2 3 2 1 1 3 2 2 1 1 2 2 1 0 0 2 1 2 2 0 1 1 1 2 1 1 2 2 2 2 3 2 2 2 2 2 2 1 2 2 2 1 2 2 1 3 4 3 3 2 2 3 3 2 4 3 3
-2712 3 2 2 2 2 3 3 1 1 1 2 2 2 2 1 1 2 1 2 2 2 2 2 2 3 2 1 1 1 2 1 2 2 2 1 2 3 3 2 2 2 2 1 1 1 2 2 3 3 2 3 4 2 1 2 3 3 3 2 2 3 2 1 2 3 3 1 1 2 2 3
-2719 3 3 3 2 1 2 1 0 1 3 2 2 1 2 4 3 3 3 3 4 3 3 3 2 2 1 2 1 0 1 1 1 2 2 2 2 2 3 2 1 1 1 3 2 2 2 2 2 3 1 2 1 1 2 3 2 1 1 1 1 2 2 3 3 2 1 1 2 2 2 3
-2725 3 2 2 2 1 1 0 0 1 1 2 1 0 1 2 2 2 2 2 3 2 3 3 2 2 1 1 2 2 2 3 2 2 3 3 3 3 2 1 1 0 1 2 3 2 3 2 2 2 3 3 2 2 2 3 3 1 2 1 2 2 2 1 1 2 1 1 1 0 1 2
-2731 2 2 1 2 1 2 2 2 2 2 2 2 2 2 2 2 3 3 2 1 1 2 2 1 1 2 2 2 3 1 2 3 3 3 1 0 0 1 3 2 2 2 1 2 2 2 1 2 2 2 2 0 0 0 2 3 2 1 1 2 2 1 0 1 1 0 1 0 0 1 2
-2738 2 3 3 2 3 3 2 1 2 3 2 1 1 1 2 2 3 2 1 2 1 0 0 1 0 1 2 1 2 2 1 2 3 2 3 3 1 1 1 2 2 2 2 2 3 3 3 4 3 4 4 2 2 1 2 2 3 2 1 1 1 2 2 2 2 2 2 1 2 2 3
-2744 3 3 2 2 3 1 1 2 2 0 2 3 1 1 2 1 1 3 3 2 2 2 2 1 2 3 3 1 0 1 1 1 3 2 1 2 3 1 2 2 2 1 1 1 2 2 2 3 3 4 4 3 3 3 2 2 2 2 2 1 1 1 1 1 1 2 2 3 2 2 2
-2750 2 3 2 1 2 3 3 2 0 0 0 1 2 2 2 1 1 2 3 2 2 3 3 3 2 2 1 3 3 3 2 3 3 2 1 3 3 3 1 1 1 3 2 2 1 1 1 1 1 2 2 1 2 2 2 3 3 3 4 4 2 2 2 2 3 3 1 2 3 3 2
-2757 2 1 1 2 2 2 1 2 4 4 2 2 2 2 3 2 2 2 3 3 2 2 3 3 3 3 2 1 1 2 2 2 2 1 1 1 2 2 2 1 2 3 3 3 4 3 2 0 1 1 2 2 1 1 2 3 1 1 0 1 2 2 2 2 1 1 2 2 2 3 2
-2763 2 2 3 2 2 1 0 2 2 2 1 2 2 3 3 3 2 2 0 1 1 2 2 1 2 1 2 3 1 2 3 2 1 2 3 3 3 3 2 2 2 2 2 2 2 2 2 3 2 2 2 1 2 1 2 2 1 2 2 2 2 1 2 3 2 1 0 2 2 0 2
-2770 2 2 2 1 2 1 1 0 0 1 1 2 3 2 1 0 0 0 0 0 0 1 3 4 2 2 2 2 1 0 2 2 1 1 1 2 1 1 2 3 2 1 2 2 2 3 3 2 0 -1 0 1 1 2 3 2 1 0 1 0 1 1 1 0 2 2 2 2 2 3 2
-2776 2 2 2 3 3 2 3 2 3 3 2 1 1 2 2 2 2 1 1 1 2 1 2 1 1 1 1 2 1 1 2 3 3 2 2 1 0 -1 0 1 2 2 2 4 3 3 2 2 2 3 3 2 1 0 1 2 3 2 2 2 1 2 3 2 2 3 3 3 3 3 2
-2782 2 2 2 3 2 2 2 3 2 2 2 1 1 1 1 1 1 2 2 2 2 2 2 2 2 2 2 2 2 2 1 0 0 1 0 1 2 2 3 2 2 2 2 2 2 1 1 1 1 2 3 2 0 1 2 1 1 0 0 0 2 2 3 3 2 0 1 1 2 1 1
-2789 1 1 1 1 0 1 1 0 1 1 1 0 1 1 1 1 2 2 2 3 2 2 1 1 1 1 -1 1 3 3 1 1 2 2 3 3 2 2 1 2 1 0 1 1 2 2 2 1 2 2 2 1 2 2 3 3 2 2 2 2 2 3 2 3 2 3 3 3 2 2 1
-2795 1 2 2 2 2 3 2 3 4 4 3 1 0 1 2 2 1 2 2 1 2 3 2 2 2 3 4 3 2 2 1 1 2 3 2 1 2 2 2 3 2 1 1 2 2 2 2 1 1 0 0 2 1 3 3 3 2 2 3 2 2 1 1 2 2 3 4 3 2 4 4
-2801 4 2 2 2 1 1 2 2 1 1 2 1 0 2 1 2 1 1 1 2 1 2 2 2 3 3 2 1 2 3 1 0 2 3 2 2 1 2 1 1 2 3 2 1 3 3 2 2 3 3 2 1 2 3 3 2 3 3 1 1 2 3 2 3 3 2 2 3 2 2 1
-2808 1 1 2 3 3 1 2 2 2 2 2 2 2 2 2 1 0 0 0 1 2 2 2 0 1 1 1 1 1 1 2 2 2 1 2 2 2 2 2 2 2 1 2 2 2 2 3 2 2 1 2 2 2 2 2 2 2 2 2 1 1 2 1 1 1 0 1 2 2 2 2
-2814 2 2 1 1 0 2 1 1 1 1 2 2 3 2 2 1 1 2 2 2 1 1 2 3 3 2 3 3 1 2 2 2 2 3 2 2 4 2 2 2 2 1 2 2 2 1 2 2 2 2 2 2 2 4 2 1 2 2 1 0 1 2 2 2 1 1 2 2 2 1 1
-2820 1 1 0 2 2 3 2 2 1 2 3 3 2 2 1 2 1 2 1 0 1 2 1 1 3 3 3 2 2 2 2 2 1 2 2 1 1 0 0 1 2 3 2 2 3 2 2 2 2 2 1 1 0 0 1 1 1 1 1 1 0 0 1 0 1 1 1 2 1 1 2
-2827 2 1 1 1 2 2 1 2 1 1 1 2 3 1 2 2 1 1 2 1 2 3 2 2 2 1 1 2 2 1 2 2 2 3 3 2 2 2 1 2 3 3 3 4 3 3 3 2 2 1 1 2 4 3 3 2 1 2 2 2 2 2 3 2 2 1 0 2 3 2 2
-2833 2 3 3 1 2 3 3 2 2 2 2 2 2 1 3 3 3 3 2 2 2 1 1 2 1 2 3 2 2 1 1 2 3 1 1 1 1 2 1 2 2 2 1 1 1 1 2 1 1 1 1 0 0 2 2 2 1 3 3 2 3 3 3 1 1 2 2 3 2 3 1
-2839 1 2 2 3 3 2 3 2 3 4 4 3 2 2 3 4 3 2 2 1 0 1 2 3 3 2 3 3 2 2 1 1 1 2 2 3 3 2 2 1 0 1 2 2 2 3 3 2 1 2 2 1 2 3 2 2 2 2 1 1 2 2 1 1 3 3 2 2 2 1 0
-2846 0 2 3 2 3 3 2 3 2 2 3 2 1 1 1 1 2 2 1 1 1 0 0 1 1 1 2 1 3 3 3 3 2 3 4 2 2 1 2 2 1 1 1 0 1 2 3 3 2 2 1 2 2 1 2 2 2 2 2 4 3 2 1 2 2 2 2 2 1 1 2
-2852 2 3 2 1 2 3 3 2 3 3 2 2 -1 0 1 1 1 0 1 0 0 -1 1 1 1 1 1 1 2 2 3 3 3 2 2 3 3 1 1 2 1 -1 1 1 2 3 3 3 1 1 1 1 1 0 1 1 1 3 3 1 2 2 3 2 1 2 1 1 2 2 2
-2859 2 2 1 1 3 3 3 2 2 3 1 1 1 2 1 2 2 2 3 4 2 1 2 4 2 1 2 1 1 2 2 1 0 0 1 2 3 2 1 2 1 0 0 1 2 2 1 0 1 1 1 1 1 1 1 1 2 2 3 3 1 1 2 1 2 2 2 1 2 2 1
-2865 1 1 1 1 1 2 2 2 2 1 1 2 2 2 1 1 2 3 2 2 1 2 3 3 3 4 3 2 1 1 2 2 3 3 3 3 3 1 2 2 3 2 3 3 2 3 3 2 2 2 2 1 1 1 2 2 2 2 2 3 3 3 4 3 3 2 1 1 2 2 2
-2871 2 1 1 1 1 2 2 1 1 1 0 2 2 2 2 1 1 2 2 2 1 1 2 2 2 2 1 1 1 2 2 1 1 2 2 1 1 1 2 1 0 2 1 1 2 3 2 1 0 0 1 1 3 3 2 3 3 2 1 2 3 2 2 2 2 1 0 1 1 1 2
-2878 2 2 2 3 2 0 2 1 4 4 3 2 1 -1 1 1 1 1 2 2 1 3 2 1 0 0 1 2 1 0 2 2 2 2 2 1 0 1 1 2 2 0 0 1 0 0 0 0 0 1 1 1 1 2 3 2 2 2 3 2 1 0 2 1 2 2 2 2 1 2 3
-2884 3 3 2 2 2 1 1 2 2 3 3 2 1 2 3 1 1 1 3 3 2 2 2 1 1 2 1 2 2 2 1 2 1 2 1 1 2 2 2 3 3 1 0 0 1 3 3 3 2 0 1 2 3 2 1 1 2 3 2 1 1 1 2 3 2 2 3 1 0 1 1
-2890 1 0 1 2 2 2 1 2 2 2 2 1 0 1 0 1 1 2 0 1 2 2 3 4 2 3 3 2 3 2 2 2 2 1 0 1 2 3 3 1 0 1 3 4 2 1 0 0 1 1 2 3 2 2 2 2 2 2 2 3 2 2 1 1 1 2 3 3 2 1 2
-2897 2 2 3 4 2 2 2 1 0 0 0 1 1 2 1 0 1 1 2 1 2 2 1 3 3 3 4 3 3 2 2 1 2 2 1 1 2 2 2 2 3 1 1 2 2 1 1 1 2 2 2 3 2 1 2 3 3 3 1 3 3 3 3 4 3 3 3 1 1 0 1
-2903 1 2 2 3 4 4 2 2 3 3 2 2 2 1 2 2 2 2 1 1 1 1 2 2 2 2 3 3 1 2 2 1 1 1 -1 1 1 1 1 2 1 1 2 2 3 3 3 2 2 2 2 2 1 2 1 1 3 3 2 1 2 2 1 0 2 2 2 2 2 1 2
-2909 2 2 2 3 3 3 3 3 2 1 2 1 1 1 2 2 2 2 3 3 2 2 1 0 1 0 1 1 2 3 2 1 1 2 3 2 1 1 2 2 1 2 1 1 2 2 3 2 2 1 1 2 2 1 -1 1 3 3 3 2 2 2 3 4 3 2 2 2 1 1 1
-2916 1 1 0 1 1 1 2 2 2 1 0 2 2 1 1 2 2 1 1 0 0 2 3 3 3 2 2 2 2 2 2 2 1 2 2 1 1 2 3 2 1 2 2 1 1 1 3 2 1 1 2 2 3 3 3 4 3 2 2 2 2 1 1 1 1 2 2 2 1 1 2
-2922 2 2 2 2 1 0 2 2 3 4 2 2 2 1 1 0 0 0 2 2 2 1 0 0 0 1 0 1 3 3 2 2 2 3 3 3 3 2 2 3 4 3 3 1 2 2 1 2 2 2 1 2 1 1 2 2 1 1 2 2 0 1 2 2 2 1 1 3 4 3 0
-2928 0 0 1 2 2 2 2 3 2 2 1 1 1 1 1 1 0 0 2 3 2 1 1 1 0 1 2 2 2 2 2 2 2 1 1 2 3 2 2 2 3 3 1 1 0 1 1 1 2 1 1 2 2 2 1 1 2 2 4 4 4 3 3 2 2 2 2 3 2 2 2
-2935 2 3 2 2 1 1 2 1 2 3 3 1 2 3 3 2 2 1 2 2 3 3 2 2 2 3 3 2 3 1 1 1 1 2 3 3 3 3 2 2 2 1 2 2 2 1 0 1 2 1 1 1 2 2 2 1 1 1 2 2 1 2 2 2 1 2 2 3 2 2 2
-2941 2 2 0 1 1 1 2 1 1 1 2 2 3 3 2 2 3 2 1 1 0 2 2 1 2 1 1 2 1 1 2 1 1 1 2 0 0 1 1 1 1 1 1 3 2 1 2 2 2 2 2 2 3 2 2 1 1 2 2 2 2 1 1 2 2 2 3 2 1 1 1
-2948 1 1 1 1 1 1 1 1 1 2 3 2 1 0 1 1 2 2 2 2 2 2 2 2 1 1 1 1 1 1 1 0 -1 0 3 3 2 1 0 1 1 1 0 2 2 1 0 1 0 -1 1 3 2 2 2 1 2 1 0 0 0 1 1 2 1 1 2 3 2 1 2
-2954 2 3 3 3 2 3 3 1 2 2 3 2 2 2 1 1 2 1 2 2 2 2 1 1 1 1 1 1 2 1 2 2 2 1 1 1 1 1 0 1 1 0 1 2 1 2 2 1 1 1 0 1 2 2 1 0 1 2 2 1 2 2 1 3 3 2 2 2 2 3 3
-2960 3 2 2 3 4 3 2 2 2 1 2 2 0 1 1 3 2 1 -1 -1 2 2 1 2 2 1 1 1 1 2 2 2 3 2 1 1 1 2 2 1 2 1 1 0 1 2 2 2 2 2 2 2 2 3 4 3 2 1 2 3 3 2 3 2 3 3 2 2 2 2 3
-2967 3 2 1 2 1 2 1 3 2 1 1 2 2 1 1 1 2 3 4 3 2 3 3 1 2 2 2 1 1 1 1 0 1 2 2 0 3 3 0 0 2 2 1 3 1 1 2 1 2 2 2 3 4 4 3 3 3 1 1 2 3 2 1 0 0 0 2 3 1 1 1
-2973 1 1 2 2 1 1 1 2 1 0 1 1 2 1 1 0 2 2 1 1 2 2 2 2 2 1 0 0 1 1 1 2 4 3 2 3 3 2 2 2 1 2 2 1 2 3 2 1 1 1 1 2 2 3 3 1 2 1 1 2 2 1 0 0 0 2 2 1 2 1 1
-2979 1 1 0 1 1 2 2 3 2 1 1 1 2 1 1 0 1 1 0 0 1 1 0 0 0 0 2 3 2 2 2 0 1 2 3 3 2 1 2 2 1 1 0 0 1 2 2 3 3 2 2 2 2 3 3 2 2 0 0 1 1 2 3 3 2 3 2 2 1 1 2
-2986 2 2 3 3 1 1 2 1 1 2 2 3 1 0 1 2 3 3 2 3 3 4 3 2 1 1 3 2 3 3 2 2 1 1 1 0 1 2 2 3 3 3 1 1 2 2 2 2 1 1 1 2 1 2 2 1 1 3 3 4 3 3 3 2 1 1 2 2 1 2 2
-2992 2 3 2 2 2 2 2 1 1 2 2 2 2 2 2 3 3 3 3 1 2 2 2 3 3 2 2 1 1 1 1 0 1 3 2 1 2 2 2 1 2 2 2 2 4 3 3 3 3 2 3 2 3 2 1 1 2 1 1 2 1 0 1 3 2 2 2 1 2 2 3
-2998 3 2 1 2 2 3 3 3 2 1 1 2 2 2 2 1 2 3 1 1 2 2 1 1 1 1 1 2 1 0 1 2 1 1 0 0 0 1 2 3 2 1 1 0 1 1 2 2 1 1 0 1 2 2 2 3 2 2 1 0 1 2 1 2 1 1 2 1 2 1 2
-3005 2 1 2 2 2 1 1 1 0 1 2 0 1 1 0 1 1 1 1 1 1 1 2 3 2 1 1 2 2 2 3 4 3 2 2 2 2 3 3 3 2 1 2 2 3 3 2 2 2 3 2 2 3 2 2 2 1 1 0 2 2 1 1 2 2 2 2 2 2 1 2
-3011 2 2 2 2 1 2 1 1 2 2 2 2 1 1 1 0 0 2 1 1 1 2 1 2 1 2 2 1 1 2 2 0 2 2 2 2 1 2 2 0 2 2 2 1 1 1 1 2 3 2 2 4 3 1 1 1 1 3 1 1 1 1 2 2 2 3 3 2 2 2 3
-3017 3 1 1 1 0 0 2 1 1 1 1 2 2 2 2 2 2 2 2 0 1 3 3 2 1 1 1 1 2 1 2 2 2 3 1 1 2 2 2 2 2 3 2 2 3 2 2 2 2 1 1 1 2 3 2 2 2 4 4 3 3 1 1 2 1 1 2 2 1 2 1
-3024 1 1 2 3 3 1 2 3 2 2 2 3 2 1 3 4 3 3 3 4 3 2 2 2 2 1 1 1 1 0 0 1 2 1 1 2 2 1 0 2 2 1 0 1 1 2 2 3 3 3 2 2 3 3 2 1 2 2 2 2 2 3 3 2 2 2 2 2 2 1 1
-3030 1 1 2 3 3 2 2 1 1 -1 1 1 0 3 3 1 1 2 2 1 2 1 1 1 2 3 2 2 3 2 1 1 1 1 1 1 1 2 2 1 1 1 0 1 3 4 3 2 1 2 3 1 1 0 0 2 2 1 2 1 2 2 1 1 2 3 2 2 1 2 2
-3037 2 1 2 3 1 2 3 3 1 1 1 1 2 2 2 2 2 1 1 3 3 3 4 3 2 2 2 1 1 2 2 2 1 2 2 1 1 2 1 2 1 2 1 1 1 1 2 3 2 2 3 2 3 3 3 3 3 3 2 2 1 1 2 3 2 3 2 2 2 2 2
-3043 2 3 3 3 3 4 2 2 3 3 2 2 1 1 2 1 1 1 1 1 1 2 2 2 2 3 3 2 2 2 2 2 1 1 2 4 4 4 3 2 3 3 3 0 1 3 3 3 2 2 1 3 1 2 2 1 1 0 1 1 2 2 2 2 2 2 3 4 3 2 2
-3049 2 3 3 3 2 2 2 2 2 2 3 4 3 2 2 3 2 1 1 2 1 -1 1 2 2 1 0 -1 1 1 2 2 2 2 1 1 3 2 3 2 2 2 0 0 0 2 2 2 2 2 2 2 0 1 2 2 0 1 1 1 1 1 1 1 1 1 2 1 1 1 1
-3056 1 0 1 3 3 3 2 2 1 2 2 1 1 1 1 1 0 1 2 3 3 2 2 1 2 2 2 2 1 2 2 2 2 2 2 2 3 2 1 1 2 2 4 3 2 1 1 3 2 1 1 1 1 2 2 2 2 3 3 2 2 2 2 1 0 0 0 1 1 0 1
-3062 1 0 1 2 2 2 2 3 1 1 1 2 2 2 3 2 3 2 2 4 2 2 2 2 3 1 1 2 1 1 1 1 2 2 2 2 2 2 2 2 2 2 1 1 2 2 1 2 1 2 2 2 3 2 3 4 2 2 2 2 3 2 3 4 2 1 1 -1 1 1 0
-3068 0 2 2 2 2 2 2 1 1 2 1 1 1 1 3 2 2 3 3 3 2 1 0 1 2 2 1 2 1 0 -1 1 1 2 1 0 2 2 2 1 2 2 2 2 3 1 1 1 0 1 1 1 2 2 3 3 3 2 2 3 4 2 1 2 3 2 2 2 1 1 1
-3075 1 1 2 2 2 2 1 2 2 1 2 1 1 1 1 0 2 1 2 1 1 1 1 3 1 0 1 1 0 1 1 2 1 2 1 2 3 3 3 2 3 2 2 2 1 1 1 1 1 2 2 1 2 1 2 3 2 2 3 3 2 2 2 2 2 1 1 2 2 1 1
-3081 1 1 1 1 1 3 3 2 1 2 3 2 3 3 3 2 2 2 2 0 1 2 3 3 3 3 2 2 2 2 2 3 1 1 1 1 1 0 1 0 1 1 1 1 1 1 2 0 1 2 2 1 3 2 3 2 1 1 1 2 1 2 2 3 2 1 1 0 1 3 4
$$ [...]
-3468B
##END=		$$ NMR SPECTRUM
##END=		$$ LINK
