##TITLE=	Jul30-2014-fpc.10.fid
##JCAMP-DX=	6.0	$$ MestReNova 14.3.3-33362
##DATA TYPE=	LINK
##BLOCKS=	1    
##ORIGIN=	Mestrelab Research S.L.
##OWNER=	hrzepa
##$MNOVA/METADATA=	(DOCUMENT,BASE64)
eyJuYW1lIjoiL1VzZXJzL2hyemVwYS9MaWJyYXJ5L01vYmlsZSBEb2N1bWVudHMvY29tfmFwcGxlfkN
sb3VkRG9jcy9CYXRoL0ZBSVIgTk1SIFN1Ym1pc3Npb24vQ29tcG91bmQgUzEvMTNDLm1ub3ZhIiwicG
FnZXMiOlt7Iml0ZW1zIjpbIjEiICAgICBdfV19
##TITLE=	Jul30-2014-fpc.10.fid
##JCAMP-DX=	6.0	$$ MestReNova 14.3.3-33362
##DATA TYPE=	NMR SPECTRUM
##DATA CLASS=	XYDATA
##BLOCK_ID=	1
##ORIGIN=	Bruker BioSpin GmbH
##OWNER=	nmr
##NUMDIM=	1
##$MNOVA/METADATA=	(ITEM,BASE64)
eyJhbmdsZSI6MCwiYXhlcyI6eyJ4Ijp7Im1heCI6MjQ5LjIxNDk5OTk5Njc3ODI2LCJtaW4iOi0yMC4
wMjMxODkxMTM1MDY5M30sInkiOnsibWF4Ijo0MDM4Mi44MzA1NjY0MDYyNSwibWluIjotNDEwNi4wND
c3Mjk0OTIxODc1fX0sInBvaW50cyI6W3sieCI6NTMyMSwieSI6NTgzNX0seyJ4Ijo4NzIyLCJ5Ijo1O
DM1fSx7IngiOjg3MjIsInkiOjgyMDh9LHsieCI6NTMyMSwieSI6ODIwOH0seyJ4Ijo1MzIxLCJ5Ijo1
ODM1fV0sInoiOjB9
##.OBSERVE FREQUENCY=	75.499030390135004609
##.OBSERVE NUCLEUS=	^13C
##.SOLVENT NAME=	C6D6
##.PULSE SEQUENCE=	zgpg30
##LONGDATE=	2014/07/30 23:57:00.000
##.ACQUISITIONMODE=	SIMULTANEOUS (DQD)
##$ORIGINAL FORMAT=	Bruker XWIN-NMR
##$MNOVA/SCALES_VERSION=	9
##$PARAMETER FILE=	(acqus, ASCII, /private/var/folders/bp/m_4195y96sx1d256lqvkcvym0000gq/T/AtmAdpopRJyFM7dk4ChsUw/13C/acqus, 0)
$$ ##TITLE= Parameter file, TOPSPIN		Version 2.1
$$ ##JCAMPDX= 5.0
$$ ##DATATYPE= Parameter Values
$$ ##NPOINTS= 12	$$ modification sequence number
$$ ##ORIGIN= Bruker BioSpin GmbH
$$ ##OWNER= nmr
$$ $$ 2014-07-30 23:57:27.982 +0100  nmr@CHPC-NMR300
$$ $$ C:\u/data/fpc/nmr/Jul30-2014-fpc/10/acqus
$$ $$ process C:\Bruker\TOPSPIN2.1\prog\mod\shimcntl.exe
$$ ##$ACQT0= -1.57563025210084
$$ ##$AMP= (0..31)
$$ 100 100 100 100 100 100 100 100 100 100 100 100 100 100 100 100 100 100
$$ 100 100 100 100 100 100 100 100 100 100 100 100 100 100
$$ ##$ANAVPT= -1
$$ ##$AQSEQ= 0
$$ ##$AQ_mod= 1
$$ ##$AUNM= <au_zgt>
$$ ##$AUTOPOS= <21 >
$$ ##$BF1= 75.490349
$$ ##$BF2= 300.22
$$ ##$BF3= 75.490349
$$ ##$BF4= 500.13
$$ ##$BF5= 500.13
$$ ##$BF6= 500.13
$$ ##$BF7= 500.13
$$ ##$BF8= 500.13
$$ ##$BYTORDA= 1
$$ ##$CFDGTYP= 0
$$ ##$CFRGTYP= 5
$$ ##$CHEMSTR= <none>
$$ ##$CNST= (0..63)
$$ 1 1 145 1 1 1 1 1 1 1 1 1 1 1 1 1 1 1 1 1 1 1 1 1 1 1 1 1 1 1 1 1 1 1 1
$$ 1 1 1 1 1 1 1 1 1 1 1 1 1 1 1 1 1 1 1 1 1 1 1 1 1 1 1 1 1
$$ ##$CPDPRG= <waltz16>
$$ ##$CPDPRG1= <>
$$ ##$CPDPRG2= <waltz16>
$$ ##$CPDPRG3= <>
$$ ##$CPDPRG4= <mlev>
$$ ##$CPDPRG5= <mlev>
$$ ##$CPDPRG6= <mlev>
$$ ##$CPDPRG7= <mlev>
$$ ##$CPDPRG8= <mlev>
$$ ##$CPDPRGB= <>
$$ ##$CPDPRGT= <>
$$ ##$D= (0..63)
$$ 0 2 0.00345 0 0 0 0 0 0 0.06 0 0.03 2e-005 3e-006 0 0 0.0002 0 0 0 0 0
$$ 0 0 0 0 0 0 0 0 0 0 0 0 0 0 0 0 0 0 0 0 0 0 0 0 0 0 0 0 0 0 0 0 0 0 0 0
$$ 0 0 0 0 0 0
$$ ##$DATE= 1406761039
$$ ##$DBL= (0..7)
$$ 120 120 120 120 120 120 120 120
$$ ##$DBP= (0..7)
$$ 150 150 150 150 150 150 150 150
$$ ##$DBP07= 0
$$ ##$DBPNAM0= <>
$$ ##$DBPNAM1= <>
$$ ##$DBPNAM2= <>
$$ ##$DBPNAM3= <>
$$ ##$DBPNAM4= <>
$$ [...]
$$ -1 -1 -1 -1 -1 -1 -1 -1 -1 -1 -1 -1 -1 -1 -1 -1 -1 -1 -1 -1 -1 -1 -1 -1
$$ -1 -1 -1 -1 -1 -1 -1 -1 -1 -1 -1 -1 -1 -1 -1 -1
$$ ##$RG_tab8= (0..255)
$$ -1 -1 -1 -1 -1 -1 -1 -1 -1 -1 -1 -1 -1 -1 -1 -1 -1 -1 -1 -1 -1 -1 -1 -1
$$ -1 -1 -1 -1 -1 -1 -1 -1 -1 -1 -1 -1 -1 -1 -1 -1 -1 -1 -1 -1 -1 -1 -1 -1
$$ -1 -1 -1 -1 -1 -1 -1 -1 -1 -1 -1 -1 -1 -1 -1 -1 -1 -1 -1 -1 -1 -1 -1 -1
$$ -1 -1 -1 -1 -1 -1 -1 -1 -1 -1 -1 -1 -1 -1 -1 -1 -1 -1 -1 -1 -1 -1 -1 -1
$$ -1 -1 -1 -1 -1 -1 -1 -1 -1 -1 -1 -1 -1 -1 -1 -1 -1 -1 -1 -1 -1 -1 -1 -1
$$ -1 -1 -1 -1 -1 -1 -1 -1 -1 -1 -1 -1 -1 -1 -1 -1 -1 -1 -1 -1 -1 -1 -1 -1
$$ -1 -1 -1 -1 -1 -1 -1 -1 -1 -1 -1 -1 -1 -1 -1 -1 -1 -1 -1 -1 -1 -1 -1 -1
$$ -1 -1 -1 -1 -1 -1 -1 -1 -1 -1 -1 -1 -1 -1 -1 -1 -1 -1 -1 -1 -1 -1 -1 -1
$$ -1 -1 -1 -1 -1 -1 -1 -1 -1 -1 -1 -1 -1 -1 -1 -1 -1 -1 -1 -1 -1 -1 -1 -1
$$ -1 -1 -1 -1 -1 -1 -1 -1 -1 -1 -1 -1 -1 -1 -1 -1 -1 -1 -1 -1 -1 -1 -1 -1
$$ -1 -1 -1 -1 -1 -1 -1 -1 -1 -1 -1 -1 -1 -1 -1 -1
$$ ##$RG_tabA= (0..255)
$$ 1 1.1 1.3 1.4 1.6 1.8 2 2.2 2.5 2.8 3.2 3.6 4 4.5 5 5.7 6.3 7.1 8 9 10.1
$$ 11.3 12.7 14.3 16 18 20.2 22.6 25.4 28.5 32 35.9 40.3 45.3 50.8 57 64 71.8
$$ 80.6 90.5 101.6 114 128 143.7 161.3 181 203.2 228.1 256 287.4 322.5 362
$$ 406.4 456.1 512 574.7 645.1 724.1 812.7 912.3 1024 1149.4 1290.2 1448.2
$$ 1625.5 1824.6 2048 2298.8 2580.3 2896.3 3251 3649.1 4096 4597.6 5160.6
$$ 5792.6 6502 7298.2 8192 9195.2 10321.3 11585.2 13004 14596.5 16384 18390.4
$$ 20642.5 23170.5 26008 29193 32768 36780.8 41285.1 46341 -1 -1 -1 -1 -1
$$ -1 -1 -1 -1 -1 -1 -1 -1 -1 -1 -1 -1 -1 -1 -1 -1 -1 -1 -1 -1 -1 -1 -1 -1
$$ -1 -1 -1 -1 -1 -1 -1 -1 -1 -1 -1 -1 -1 -1 -1 -1 -1 -1 -1 -1 -1 -1 -1 -1
$$ -1 -1 -1 -1 -1 -1 -1 -1 -1 -1 -1 -1 -1 -1 -1 -1 -1 -1 -1 -1 -1 -1 -1 -1
$$ -1 -1 -1 -1 -1 -1 -1 -1 -1 -1 -1 -1 -1 -1 -1 -1 -1 -1 -1 -1 -1 -1 -1 -1
$$ -1 -1 -1 -1 -1 -1 -1 -1 -1 -1 -1 -1 -1 -1 -1 -1 -1 -1 -1 -1 -1 -1 -1 -1
$$ -1 -1 -1 -1 -1 -1 -1 -1 -1 -1 -1 -1 -1 -1 -1 -1 -1 -1 -1 -1 -1 -1 -1 -1
$$ -1 -1 -1 -1 -1 -1 -1 -1 -1 -1 -1 -1 -1
$$ ##$ROUT14= (0..7)
$$ 0 0 0 0 0 0 0 0
$$ ##$ROUTER= 3
$$ ##$RX22TY= <tty10>
$$ ##$RXFMAX= (0..7)
$$ -1 -1 -1 -1 -1 -1 -1 -1
$$ ##$RXFMIN= (0..7)
$$ -1 -1 -1 -1 -1 -1 -1 -1
$$ ##$RXINTLV= (0..7)
$$ 0 0 0 0 0 0 0 0
$$ ##$RXMSTY= <no>
$$ ##$SCMTY= <no>
$$ ##$SGUC1= (0..15)
$$ 0 0 0 0 0 0 0 0 0 0 0 0 0 0 0 0
$$ ##$SGUC2= (0..15)
$$ 0 0 0 0 0 0 0 0 0 0 0 0 0 0 0 0
$$ ##$SPECTR= 5
$$ ##$SY2FLAG= 0
$$ ##$TFXNUM= 0
$$ ##$TRIPLO2= 0
$$ ##$VTUTY= <tty05>
$$ ##$WBREFAM= (0..15)
$$ 100 100 100 100 100 100 100 100 100 100 100 100 100 100 100 100
$$ ##$WBREFPH= (0..15)
$$ 0 0 0 0 0 0 0 0 0 0 0 0 0 0 0 0
$$ ##$XFAC= 2
$$ ##END=
$$ 
##$DECIM=	6
##$DSPFVS=	10
##XUNITS=	HZ
##YUNITS=	ARBITRARY UNITS
##FIRSTX=	18813.33496592497977
##LASTX=	-1511.5581481184447057
##DELTAX=	-0.31013798907520295778
##XFACTOR=	1
##YFACTOR=	1.1203852675710317399
##FIRSTY=	74.1153564453125
##MINY=	-440.26593017578125
##MAXY=	36711.6640625
##NPOINTS=	65536
##XYDATA=	(X++(Y..Y))
$$ [...]
9745d8M4M5M6l5l5j1j1j1j1L2L2L2L3j5j4j2j1n1ll0l0J5J6J8J9PN6N9J1k4K5ooq2q3k9J9
9734d9O7O6J9l0kM6M0m0m0J0N5N4j8o6OOQm0j3j3l4l4o1j3L2L1J0J0M1M1l7l7l3J4J2J2K2
9722D2K2K2K3k7k7k7k7j7j8j8j7J3J2O2O1M4M5l7l7J8J7M2M2j2j3o1o1PON5N5k7k7K2K1qq
9711A62n7n7m2m2j7j8klK2K2k5k5K3K3K6K5JJQPQPj5j6j5j5L9M0rrnmnnk3k3K5K6N2N2o2o1
9698A4l3l3l3l2J7J8J8J8LKN1N1M7M8K3K3l3l4l3l4k8k7N3N4KJk2k2k1k0m5m5K9K8K9K8J7
9686G9J7l2l2l6l5M5M5k4k3K5K5M6M7l4q3q3kL1L0n1n1kkk4k4k0O0O3O2J9J9k3k4K5K5J5J4
9675H7l5l4j6j6QQklK2K2j5j6L2L3j5j4RJ0ppppJ1J1J2J1m4m4L7L7ooonm8m8JJN1N1K7K6l0
9661G6l1l0l0l3l2M9M9L5L5J1J0m1m1m1m1l8l7M3M3K4K4K3K4j4j4j3j4nnmnJKJKMNNNJ%lk
$$ plain form
9745 -48 -4 41 87 52 17 6 -5 -16 -27 5 37 69 102 87 73 61 50 -1 -4 -34 -64 -49 -33 -15 4 11 67 126 137 113 138 132 126 44 -39 -68 -49
9734 -49 18 84 103 73 71 117 157 117 77 87 142 196 178 112 118 124 132 92 79 66 32 -2 -63 -76 -44 -13 -3 7 48 89 52 15 -18 -4 8 20 42
9722 42 64 86 109 82 55 28 1 -16 -34 -52 -69 -56 -44 18 79 123 168 131 94 112 129 171 213 201 188 127 66 73 79 134 189 162 135 157 178 170 162
9711 162 105 48 6 -36 -53 -71 -73 -76 -54 -32 -57 -82 -59 -36 -10 15 16 17 25 32 40 47 32 16 1 -14 25 65 56 47 42 38 33 28 5 -18 7 33 85 137 75 14
9698 14 -19 -52 -85 -117 -100 -82 -64 -46 -43 -41 10 61 108 156 179 202 169 135 102 68 40 13 66 120 122 123 101 79 58 38 -7 -52 -23 5 34 62 79
9686 79 96 64 32 -4 -39 6 51 27 4 29 54 100 147 113 30 -53 -55 -24 6 -45 -96 -98 -100 -124 -148 -168 -108 -45 17 36 55 32 8 33 58 73 87
9675 87 52 18 2 -14 -6 2 0 -3 19 41 26 10 42 75 60 46 55 65 58 51 44 37 48 59 71 82 38 -6 31 68 62 56 50 45 -3 -51 -50 -49 2 53 80 106 76
9661 76 45 15 -15 -48 -80 -31 18 53 88 99 109 68 27 -14 -55 -93 -130 -87 -44 -20 4 27 51 37 23 10 -4 -9 -14 -18 -23 -22 -20 -19 -17 -13 -8 -3 2 3 3 0 -2
9648bK7k0k0O1J03K3m0m0m2m3j8j8M0M1rqJ3J4l6l5J5J6J5J6RJ0RJ0m1m1m1m1qqnnJ1N9O0
9636C1J1QQNNj0rrj0k3k3k0k0ON5N0M9L6j2l4l3l9l8l8l8QRQRK6K7j9j9j2L6j2o1K3K3J7J7
9623a2M4ln5n4j6L2L6j3m8Jk6k7n3mM7M6N9J0qpJ4O3O3J4q3q3onk1k0K8K8j%J8O6O5J6kjl3
9611F9l2l6J3L9L9mml9QL0n1k0K8K2k5j4j5N9N8K4n7o1o0r9r9L8L9mlmlKLKKrj0M7M6M2M2
9598CKJQRL3L2n2n3K1K0K8K7LLnmL5L6jjn8n7j2j2K8K9j3j3l8l7L3L3ppo0o0j9j9L8L9l5l4
9585a36J07J07L5L4%Jk4k4j3j2j3j2l9l9JKj%jjJ2J1K0k9l4M6O8j4m6m6NNRRL4L4k8k8mmp
9572a5pm8m8k2k1k2k2K1K1K0K1j0j0L0L0OOOOL2L2QQl9l8KKPOL1L1k9k8M4M4KKk2k2m3m3l
9559g4lN9N8J8J8j3j4p0p0RQN0M9MMMMl8l8J8J9LKLKm2m2M8M7mmm4m4LLM4M4K3K4jjK0K0k0
$$ plain form
9648 -2 25 5 -15 46 149 172 132 92 50 7 -11 -29 11 52 43 35 48 62 26 -9 6 22 37 53 62 72 81 91 50 9 -32 -73 -81 -89 -94 -99 -88 -29 31
9636 31 42 50 58 63 68 58 49 40 30 7 -16 -36 -56 -50 5 55 104 140 128 94 61 22 -16 -54 -92 -84 -75 -67 -58 -32 -5 -24 -43 -55 -19 -31 -92 -69 -46 -29 -12
9623 -12 32 29 -26 -80 -96 -64 -28 -41 -89 -88 -114 -141 -194 -198 -151 -105 -46 -36 -44 -51 -37 26 89 103 20 -63 -69 -74 -95 -115 -87 -59 -60 -60 -42 24 89 105 103 102 69
9611 69 37 1 14 53 92 88 84 45 53 83 32 12 40 62 37 23 8 67 125 149 92 31 -29 -128 -227 -189 -150 -154 -157 -161 -164 -162 -159 -157 -155 -164 -174 -127 -81 -39 3
9598 3 5 6 14 23 56 88 36 -17 4 24 52 79 82 85 80 76 111 147 146 145 87 30 18 6 34 63 50 37 -1 -38 -5 28 21 14 -46 -106 -125 -144 -106 -67 -102 -136
9585 -136 -29 78 113 147 147 148 124 100 87 75 62 50 11 -28 -27 -25 -26 -26 -27 -28 -16 -5 15 -14 -48 -2 66 52 6 -40 -35 -30 -21 -12 22 56 28 0 -4 -8 -15
9572 -15 -22 -70 -118 -140 -161 -183 -205 -184 -163 -143 -122 -132 -142 -112 -82 -76 -70 -64 -58 -26 6 14 22 -17 -55 -53 -51 -44 -38 -7 24 -5 -33 11 55 57 59 37 15 -28 -71 -74
9559 -74 -77 -18 40 58 76 63 49 -21 -91 -82 -74 -24 25 29 33 37 41 3 -35 -17 2 5 7 10 12 -30 -72 -24 23 19 15 -29 -73 -70 -67 -23 21 44 68 67 66 86 106 86
9545H6k1j0j1l4l5M6M7ONj5j5n6n6%JK5K5OPL1L1OPl3l4o8o7j1j1ononK7K7LLK2K1j9j9J6
9532h9J5M0L9L9L8j8j8o0n9l6l5N4N4J4J4k2k1L5L5J0J1j4j3J7J7ppLMLLNNNNnnk4p2m6LK6
9519e7k2l7J1N9N9O9K1j%K8K9Pm1p3p4k3K6N9N8M1ql3l3J3J2l8l9m1PL1L1j2j2l1J7K0k9k1
9508b7K8llJ%K5K5K9K9Pm1o1o0j5j5O4O4M0M1jjj8o8kM7J6J6K0K1jm9o8o9n3nL7j2k6k7j3
9495a28L6QRPPPPJ6J6j2j1M7jn4n5JJ%JL7L7L7L7ppl2l1K4K5k5k4K8K9MMl3l3J6J6J7J7J7
9482E5J8j6j6j5j6J0J0RJ0n1n0klkkK2K3k3k2m7m7K3K4jjO2O1j9j9L2L2j6j7J0Rj6j5l9l9
9470h4l9l9J4J4J3J4M1M1qpk0k0k0k1o1o2N2N2R2R3n3n3l8l8j3j4M2M2J8J8J0J1J1J0qrrr
9458c7o9p0M4M4N4N4ONK2K2K2K2j5j6j5j5rrrrlklkQQj6j7K1K1k8k7K7K7k2k2KJK5K6l7l6
$$ plain form
9545 86 65 55 44 10 -25 21 68 74 79 64 49 -7 -63 -63 -62 -37 -12 -6 1 32 63 69 76 43 9 -59 -126 -137 -148 -154 -159 -165 -170 -143 -116 -113 -110 -88 -67 -86 -105 -89
9532 -89 -74 -34 5 44 82 64 46 -14 -73 -109 -144 -90 -36 -22 -8 -30 -51 -16 19 29 40 26 13 30 47 40 33 36 40 43 46 51 56 61 66 61 56 32 -40 -86 -83 -57
9519 -57 -79 -116 -105 -46 13 82 103 102 102 130 159 166 125 52 -22 -45 -19 40 98 139 131 98 65 78 90 52 13 -28 -21 10 41 29 17 -14 3 23 -6 -27
9508 -27 1 -2 -5 -4 -4 21 46 75 104 111 70 9 -51 -66 -81 -17 47 87 128 127 126 108 40 38 85 101 117 137 158 157 108 40 -29 -82 -87 -50 -62 -88 -115 -128
9495 -128 -92 -84 -75 -68 -61 -54 -47 -31 -15 -27 -38 9 8 -46 -101 -100 -99 -99 -98 -61 -24 13 50 43 36 4 -27 -3 22 -3 -27 1 30 34 38 5 -28 -12 4 21 38 55
9482 55 73 57 41 26 10 20 30 39 49 -2 -52 -54 -57 -59 -61 -39 -16 -39 -61 -108 -155 -132 -108 -109 -110 -48 13 -6 -25 7 39 23 6 16 25 9 -6 -45 -84
9470 -84 -123 -162 -148 -134 -121 -107 -66 -25 -33 -40 -60 -80 -100 -121 -182 -244 -192 -140 -48 45 -8 -61 -99 -137 -150 -164 -122 -80 -62 -44 -34 -23 -12 -2 -10 -19 -28 -37
9458 -37 -106 -176 -132 -88 -34 20 26 31 53 75 97 119 104 88 73 58 49 40 31 22 19 17 14 12 20 28 12 -5 16 37 9 -18 9 36 14 -8 -6 -5 20 46 9 -27
9445b7M4M4L4L3L3L4l2l3l2l2j0rrj0J2J2J2J2n1n1lkKLm6m6qqP4P3j8j8j7j8J6J6J6J6j9
9433a3k0j9j9k2k2K4K4j9o8l8M3J02J02ooj2j1j1j1m4m5P0O9QRQRK1K2k7k7J4J5o7o6j5j4
9422f2L4L4K2K3k6k5J6J6J7J6l7l7l7l7J2J2J2J2k6k7k6k6J5J4J5J5RQRRooooM9M8M9M9k6
9410I9k5k6k5j7j8L2L1QQm0m1j0j0j0j0K8K9K9K9J7J8l1l1k4k4k4k4LLMLonnoL6L6j2j3M1
9397A7M2M1M1j4j3j4j3n5n5ooj0j1j0j0M5M5mmJ4J5O3O3k8k8k8k7k5k5k5k4L9M0L9M0j2j2
9386H5j2j2k9k8J9K0j0j1j0j1m3m3NOQRQQJ7J7J8J7j1j0j0j1k7k7K1K1k0k0k1k0J9J8J9J9
9374c2J8J9J8J9n5n5n4n5j6j5L3L3K3K3K3K3j9k0K9L0J6J7J7J7M7M6klm1m1M0M1J1J1j3j3
9363A20j4j3j3j4j1j1J2J3K8K9n3n3m3m2L9L8l0l0J9J8J0J1J0J0M1M1M1M1kjkjn4n4n3n4j1
$$ plain form
9445 -27 17 61 95 128 161 195 163 130 98 66 56 47 38 28 40 52 64 76 25 -26 -29 -31 -29 -26 -72 -118 -126 -134 -60 13 -5 -23 -40 -58 -42 -26 -10 6 -13
9433 -13 -33 -52 -71 -93 -115 -91 -67 -86 -154 -192 -149 -47 55 49 43 31 20 9 -2 -46 -91 -21 48 56 65 73 82 103 125 98 71 85 100 33 -33 -48 -62
9422 -62 -28 6 28 51 25 0 16 32 49 65 28 -9 -46 -83 -71 -59 -47 -35 -61 -88 -114 -140 -125 -111 -96 -81 -72 -64 -55 -46 -52 -58 -64 -70 -21 27 76 125 99
9410 99 74 48 23 6 -12 20 51 59 67 27 -14 -24 -34 -44 -54 -26 3 32 61 78 96 65 34 10 -14 -38 -62 -59 -56 -52 -49 -55 -60 -65 -71 -35 1 -11 -24 17
9397 17 59 100 141 127 114 100 87 32 -23 -29 -35 -45 -56 -66 -76 -31 14 10 6 20 35 98 161 133 105 77 50 25 0 -25 -49 -10 30 69 109 97 85
9386 85 73 61 32 4 23 43 33 22 12 1 -42 -85 -80 -74 -66 -57 -49 -41 -24 -7 11 28 17 7 -3 -14 -41 -68 -47 -26 -46 -66 -87 -107 -88 -70 -51 -32
9374 -32 -14 5 23 42 -13 -68 -122 -177 -193 -208 -175 -142 -119 -96 -73 -50 -69 -89 -60 -30 -14 3 20 37 84 130 128 125 84 43 83 124 135 146 133 120
9363 120 106 93 80 66 55 44 56 69 97 126 73 20 -23 -65 -26 12 -18 -48 -29 -11 -1 10 20 30 71 112 153 194 192 191 189 188 134 80 27 -27 -38
9351c8j1j2j1ppqpqpn0n0nR1Q6Q5lklkO4O5M1n5r0m0k6k5k0k0J4l5n2M4L6L6K0K0K0K1M3M3
9339A35o3o4q6J2P0P0%jj%j2j2j1j2jjn0m9l7l7j2j3N3N2P7P6L8L7L8L8N6N6J24J73K24M51
9327A318Q57J278K94j163j016n96l11j98p3QJ1l8n4n4o0o1j1j2kkK1K2J1J1j4j4m1m2j7j7
9318C5O1O1J3J2l7l8l7l8mmmmmmmmOPPOM2M1ppk6k6jklln1n1M3M4K0J9ONm2m3%%M9M9J6J5
9304A13J5J6j5j5o4o3j0j0j0j0J2J2J1J2J8J7M2M1M2M2ppKJm7m8ool0l1n0n0kkK0K0k9k9J5
9292i0J5rj0RQQQj6j7j7j6L7L7Q6Q6l4l4M8M7l0l1l0l1RRRRj0rrj0mmnmm1m0M1M0j5j5j5j6
9278e6J6J5J5J6L3L4L3L4MLMMj9k0ONj05j05k5k4M9M8M8M8K8K9n3mL3m8k7K2L2L2J1J0l8l9
9267D9J0J0K7K8MLl8l7l8l7K0K0k9k9QQj7j7J4J3L7L7J8J9o3o3k2k1N9O0jjn0m9POL1L1L4
$$ plain form
9351 -38 -49 -61 -72 -79 -86 -94 -101 -109 -116 -166 -216 -221 -130 -44 41 38 36 33 31 95 160 201 146 56 16 -10 -35 -55 -75 -61 -96 -148 -104 -68 -32 -12 8 28 49 92 135
9339 135 72 8 -78 -66 4 74 74 73 72 72 60 48 37 25 24 23 -27 -76 -113 -150 -162 -175 -122 -70 7 83 121 158 196 234 290 346 470 643 867 1318
9327 1318 2175 3453 3747 2584 1568 972 661 463 390 398 409 371 317 263 203 142 131 119 117 115 136 158 169 180 166 152 111 69 52 35
9318 35 96 157 170 182 145 107 70 32 28 24 20 16 12 8 4 0 6 13 20 26 68 109 102 95 69 43 42 40 37 34 -17 -68 -25 19 39 58 64 69 27 -16 -16 -16 33 82 98 113
9304 113 128 144 129 114 50 -13 -23 -33 -43 -53 -41 -29 -18 -6 12 29 71 112 154 196 189 182 184 185 138 90 84 78 48 17 -33 -83 -85 -87 -67 -47 -76 -105 -90
9292 -90 -75 -84 -94 -85 -77 -69 -61 -77 -94 -111 -127 -90 -53 33 119 85 51 99 146 116 85 55 24 33 42 51 60 50 41 32 22 18 14 9 5 -36 -76 -35 5 -10 -25 -40 -56
9278 -56 -40 -25 -10 6 39 73 106 140 144 147 151 155 136 116 122 127 22 -83 -108 -132 -83 -35 13 61 89 118 65 61 94 46 19 41 73 105 116 126 88 49
9267 49 59 69 96 124 128 131 93 56 18 -19 1 21 -8 -37 -29 -21 -38 -55 -41 -28 9 46 64 83 20 -43 -65 -86 -27 33 32 31 -19 -68 -61 -55 -24 7 41
9255D1L4RJ0K4K3K3K4j%j7o5n8K3Km7j4j5j7j8kkM6M6J0J0J0J0M9M8%%m7m8%Jl5l4n9n9M5
9242e0M6K1K1k8k9K1K0k3k3o6o6l5M5J08O0J7J8J4J4qrqqJ0J0J0J0k4k4k3k4J9J9J9J8JJJ
9230G5Jk1k1k1k2NMMNK7K8K7K8RQl9m0RRj6j5JKK6K6n6n6N7N7L0K9j9j9L3L4m7m8rqL9M0m
9217A52mk9k9p3p4QPj4j3L4L5L2L1PPm1m2j8j8O1O0L6L6m0m0j6j6L1L1j8j7J4J5rj0l0l0l1
9206a5l0QQQQj%pM1Q7L9l6l7j6j6m7Jj3o1j8L0KKK9L0j3j2K8K8K3K4kjJ3J2m4m4J2J1J2J1
9193E4m2m3m2m3j0j0j0j1ppON5M8M8noQQK9K8L2j7j4j4j7j7PQL1L2PQm2m1m2m2j9j9K2K1R
9180e9QL6j3n0m9N2N3RRM7M6pn5k8k9l8l7M8M8N4OOOM2om7KRRk9k9j7j6j1n9n4oK1K1L4L5
9167c8L4L4k5k4k8K0MMl0l0L2Q0J05N6qpn2n1k3k3j4L6K6k2j6j7j3j4mM5K1k9k8K0K5k3m9
$$ plain form
9255 41 75 84 94 118 141 164 188 187 187 170 105 47 70 72 25 11 -4 -21 -39 -41 -43 3 49 59 69 79 89 138 186 186 186 139 91 91 92 57 23 -36 -95 -50
9242 -50 -4 17 38 10 -19 2 22 -1 -24 -90 -156 -191 -146 -38 22 39 57 71 85 77 68 60 52 62 72 82 92 68 44 21 -3 16 35 54 72 73 74 75
9230 75 76 55 34 13 -9 -4 0 4 9 36 64 91 119 128 136 97 57 66 75 59 44 45 47 73 99 43 -13 44 101 131 160 141 122 155 189 142 94 85 77 116 156 152
9217 152 148 119 90 17 -57 -49 -42 -56 -69 -35 0 32 63 70 77 36 -6 -24 -42 19 79 115 151 111 71 55 39 70 101 83 66 80 95 86 76 46 16 -15
9206 -15 -45 -37 -29 -21 -13 -14 -14 -21 20 107 146 110 73 57 41 -6 -5 -18 -79 -97 -67 -65 -63 -34 -4 -17 -29 -1 27 50 74 72 71 84 96 52 8 20 31 43 54
9193 54 12 -31 -73 -116 -126 -136 -146 -157 -164 -171 -165 -110 -62 -14 -19 -25 -17 -9 20 48 80 63 49 35 18 1 8 16 47 79 86 94 52 11 -31 -73 -92 -111 -89 -68 -59
9180 -59 -51 -15 -28 -78 -127 -75 -22 -13 -4 43 89 82 27 -1 -30 -68 -105 -57 -9 45 51 57 63 105 99 52 54 63 72 43 14 -3 -19 -30 -89 -143 -149 -128 -107 -73 -38
9167 -38 -4 30 5 -19 -47 -27 -23 -19 -49 -79 -47 33 138 194 186 179 127 76 53 30 16 52 78 56 40 23 10 -4 -8 37 58 29 1 21 46 23 -26
9156b6n0j0rK1k8JN0J9J9j6j7J3O1K3K3K1K1L2n0q7m0rj0J8J7QQj6j6lm%%k3K5kjj2j2j2j2
9143h5OOPOJ1J1OPmq5o4j5j1L8M1pJ2J3J0RK0J9J9J9M8M7L8j2j9K9Om4m0J0k2k1k3k3j9k0
9131g6L4Q3N6N5j9k0m4m4o2o2no%%%%M8M7N1KJJM4M3Km7n0kj6o5J3J4j1j1L4L5J8l1l1l0J0
9118d1l8m2QM0qn4nKJK9K9L9M0J8l1n0n1nnj0j0J4J4POk0K8PQj7L3M9M9Q0L1j1j0k9p8m9L3
9105AL2L3K2K2m1j22o9J2M2M2L0L0j6j5m4MK6K6l0k9o0j1L3j5J5J5j0rL5L6M7lk6K2K2K3k4
9094D6k3m6m5o7o7n4oM8M8M2M2O6O6L1L1j8j7rqn7n6rrqrnnmnN1N1KKrrooj0L8N7k5l4l5l9
9080g9m0N1N1N2N1J%m8m8rj0P2P1L4L4K9K9J9o1r2m4M4M3l4l4j2j2j2j2j9k0k0k0j2j3j2j3
9069i5NOK9L0O1O2n1n2%j%jk1k2k1k1k2k2KLN2N2k8k9J4J5J4J5O7O8j4o2o1K0K0K0RQl9m0
$$ plain form
9156 -26 -76 -86 -95 -74 -102 -101 -51 -32 -13 -29 -46 -33 28 51 74 95 116 148 98 11 -29 -38 -48 -30 -13 -5 3 -13 -29 -32 -36 -36 -36 -59 -34 -36 -37 -49 -61 -73 -85
9143 -85 -79 -73 -66 -60 -49 -38 -32 -25 -29 -114 -178 -193 -204 -166 -125 -132 -120 -107 -97 -88 -68 -49 -30 -11 37 84 122 110 91 120 126 82 42 52 30 9 -14 -37 -56 -76
9131 -76 -42 41 97 152 133 113 69 25 -37 -99 -104 -110 -110 -110 -110 -110 -62 -15 36 38 39 40 84 127 129 82 32 30 14 -51 -38 -24 -35 -46 -12 23 41 10 -21 -51 -41
9118 -41 -79 -121 -113 -73 -81 -135 -140 -138 -137 -108 -79 -40 0 18 -13 -63 -114 -119 -124 -134 -144 -130 -116 -109 -103 -123 -95 -88 -80 -97 -64 -15 34 114 145 134 124 95 17 -32 1
9105 1 33 66 88 110 69 -53 -122 -110 -68 -26 4 34 18 3 -41 -37 -11 15 -15 -44 -104 -115 -82 -97 -82 -67 -77 -86 -51 -15 32 29 3 25 47 70 46
9094 46 23 -23 -68 -135 -202 -256 -262 -214 -166 -124 -82 -16 50 81 112 94 77 68 60 3 -53 -62 -71 -79 -88 -93 -98 -102 -107 -56 -5 -3 -1 -10 -19 -25 -31 -41 -3 54 29 -5 -40 -79
9080 -79 -119 -68 -17 35 86 87 87 39 -9 -18 -28 44 115 149 183 212 241 260 199 107 63 107 150 116 82 70 58 46 34 15 -5 -25 -45 -57 -70 -82 -95
9069 -95 -90 -84 -55 -25 36 98 47 -5 -5 -6 -6 -7 -28 -50 -71 -92 -114 -136 -134 -131 -79 -27 -55 -84 -70 -55 -41 -26 41 109 95 33 -28 -8 12 32 41 49 10 -30
9056c0J4J3J4J4J9J9Lm5k6N6N5N6L0K9L0K9k2k2p0p1n1n1L0L0J4J4J4J4j1j1L0L0KLK7K7J3
9045B19J4o0o0m4m5J2J2J4J4j1j1n7n8L1L1J9J8j2L7P3K5n0m9l1l0k4p2m1Qk0j9j3L6M5M6
9034e3M7jk8k7M1R0N4k7J6O4j4o2kkm6m6n1n0k5K4J00N2QRL2L2k5k5n0n0m7m7k4K6L8L9P6
9023D6P5j3j3LLk2k1p1p1k3K6J1N9Q1jj4j3j9j9K5K5j6j6K2K3o4o4l3J7N8N9K9k0l3l3j2j2
9011d1J2J2LLM9l3o5o5L5L5L6L6nnRRl1l1j6j5j5j5K7K6j3j4l4l4K2K3K5K5j6j5j%j%M4M4
8999A0M4M4l3l3L9M0J1J1m6m6k8k8J3J2%jk4k5%%%jk0k0NMN0N0k2k3llL8L7j8j8j8j8k3k3
8986f6JJmmnmM4M4Lp8l1J8N8N8J6J5m1m1k6k6L0L1M0M0%jj2j3j3j3k0k0m5m4k8k8K9K8j9k0
8974a46L7L7J4J4N4N5P0P1L0L0p0p0l0l0k9k9nnJ5J4k6k7L6L6k0k1k2k2k3k2K3K3l4l4J5J6
$$ plain form
9056 -30 -16 -3 11 25 44 63 66 21 -5 51 106 162 192 221 251 280 258 236 166 95 44 -7 23 53 67 81 95 109 98 87 117 147 149 152 179 206 219
9045 219 233 173 113 69 24 36 48 62 76 65 54 -3 -61 -30 1 20 38 26 63 136 161 111 62 31 1 -23 -95 -136 -128 -148 -167 -180 -144 -99 -53
9034 -53 -6 -7 -35 -62 -21 69 123 96 112 176 162 100 98 96 50 4 -47 -97 -122 -98 2 54 62 71 103 135 110 85 35 -15 -62 -109 -133 -107 -69 -30 46
9023 46 121 108 95 98 101 79 58 -13 -84 -107 -81 -70 -11 70 69 55 42 23 4 29 54 38 22 44 67 3 -61 -94 -77 -19 40 69 49 16 -17 -29 -41
9011 -41 -29 -17 -14 -11 38 5 -60 -125 -90 -55 -19 17 12 7 16 25 -6 -37 -53 -68 -83 -98 -71 -45 -58 -72 -106 -140 -118 -95 -70 -45 -61 -76 -77 -77 -78 -78 -34 10
8999 10 54 98 65 32 71 111 122 133 87 41 13 -15 -2 10 10 9 -15 -40 -40 -40 -40 -41 -61 -81 -76 -72 -22 28 6 -17 -20 -23 15 52 34 16 -2 -20 -43 -66
8986 -66 -65 -64 -68 -72 -77 -81 -37 7 10 -68 -99 -81 -23 35 51 66 25 -16 -42 -68 -38 -7 33 73 73 72 60 47 34 21 1 -19 -64 -108 -136 -164 -135 -107 -126 -146
8974 -146 -109 -72 -58 -44 10 65 135 206 236 266 196 126 96 66 37 8 3 -2 13 27 1 -26 10 46 26 5 -17 -39 -62 -84 -61 -38 -72 -106 -91 -75
8963g5rrN7N8JJrqL1L2l8l8J8J9JJk3k2m5m4k0k0QPL1L2J1J1j3j3qpO5O5KLk2k2n1n1K1K1
8950e1M1M0%jjjjkK5K4j%j8j9j8j8KLl7l8mmmmk5k5%jN6N7j7j7j0j1O2O2K9K8NMJ5J6p4p4
8936gk7k7klK3K3K3K3J0Rj5j4K4K4j6j7l9m0J%kkL8L8o0o1k0k1O0O0LLK1K1M0M1K6n5p9KL5
8923D1L5j%j0rj0rlkl0J8K4K4L1j9l3l3l3l3p0k3L8j2l8RL6L7L3L3N4N4L3j6k9k9m5m6L3Q0
8911H0M7M6M9M9k0k1k0k1p3p4o3j5J6l2nM3L7L6jjJ4J3J3J4k7k7n4oN1N1M1pq1q0k1K7J2J1
8899Aj1o0k0K8K2K2%%K1K1L1j7o1o0%M8M8%MMJJk3k2JKJ0J1NON0l1m2m2j0j1qpMN2K5K6on
8886Honk3k3KKM0M0J5l5n5orrK5P3J13O6p4p4p1p2j3O8O7j3opm8m9j4L4Q0Q0L6L5K3k7k1k1
8873A26J6J6o7o7l8J1O4O3N3Nk2k1k8K1N2N3m7m7m2Ok1k1K2K1j8j9n1n0m0M2L8L8J9J9J4J3
$$ plain form
8963 -75 -84 -93 -36 22 23 24 15 7 38 70 32 -6 12 31 32 33 10 -12 -57 -101 -121 -141 -133 -126 -95 -63 -52 -41 -54 -67 -75 -82 -17 48 50 53 31 9 -42 -93 -72 -51
8950 -51 -10 30 30 29 28 27 26 24 49 73 72 72 54 35 17 -1 1 4 -33 -71 -75 -79 -83 -87 -112 -137 -137 -138 -82 -25 -42 -59 -69 -80 -18 44 73 101 106 110 125 141 67 -7
8936 -7 -34 -61 -63 -66 -43 -20 3 26 36 45 30 16 40 64 48 31 -8 -48 -47 -47 -49 -51 -13 25 -35 -96 -116 -137 -77 -17 -14 -11 10 31 71 112 138 83 4 6 41
8923 41 76 75 75 65 56 46 37 34 32 2 20 44 68 99 80 47 14 -19 -52 -122 -145 -107 -119 -157 -148 -112 -75 -42 -9 45 99 132 116 87 58 13 -33 0 80
8911 80 127 173 222 271 251 230 210 189 116 42 -21 -36 -20 -52 -57 -14 23 59 58 57 71 84 97 111 84 57 3 -3 48 99 140 133 52 -28 -49 -22 -10 1
8899 1 -10 -70 -90 -62 -40 -18 -18 -18 3 24 55 38 -23 -83 -83 -35 13 13 17 21 22 23 0 -22 -21 -19 -9 2 7 13 63 32 -10 -52 -62 -73 -81 -88 -84 -32 -7 19 13 8
8886 8 2 -3 -26 -49 -47 -45 -5 35 50 15 -40 -46 -55 -64 -39 34 147 213 139 65 -6 -78 -91 -23 44 31 25 18 -30 -79 -93 -59 21 101 137 172 195 168 147 126
8873 126 142 158 91 24 -14 -3 61 124 177 182 160 139 111 132 184 237 190 143 101 107 86 65 87 108 90 71 20 -30 -70 -28 10 48 67 86 100 113
8862A13J4J3L8L7l5l5m2m2J5J4n0n1N5N5NONOL2L1l7j18j11KO8O9J9k9kjPQj6o5m6L5P2P3
8850A12K7k0j8j8k3k4MMK0O8K8k1k4k5l0l0L2j6j9L0L3j5m1m2ppL3L3m6m6J2O2R1M2o2o1j0
8839B6L9J2J2j0rl3l3J0J0Km6q5lK0K1K0K1K0K0j4j5L7j1n3n2k6K2nnP0P1J6J7J7J7j1j0n0
8827B9n1l9l9L1L0L0j9j6j5j%K1K0L8j1j1L7M9M9k0k1oonop5p5j00n1N0R9P1P1N7Ron5m8%
8815A5J1J0k3k3JJN9O0ln1m9n0q0l1jkKJqpqqL9M0J5J4k1k1L0P8M5mKKlm%jJ1N9N9J0k9l0
8801A07k5p3p0J1M1pn9j1J1l8j4j4O4O4K8K9k0k1l0l0J8J9K5K6Mm4j2j2L6Q4N8J0qrk8k8K1
8790A03K0JJk4k3k0k1K8K8k4k4k7K2J4J4M4mp8p8k7K1J0RJ2J2POPOjjjjJ4J5j0rl8l7J1O0
8777A7M6l6o4o5j3L5QRL2L2J4l5j0L8QQL4L3j5j5j8j7j8j8j2j3l7l7M9M9%%ONONrj0rj0J8
$$ plain form
8862 113 127 140 178 215 180 145 103 61 76 90 40 -11 44 99 104 110 115 121 153 184 147 29 -82 -80 -12 57 76 47 45 44 51 59 43 -22 -68 -33 39 112
8850 112 139 119 101 83 60 36 40 44 64 132 160 139 115 90 60 30 62 46 27 57 90 75 34 -8 -15 -22 11 44 -2 -48 -36 26 117 159 97 36 26
8839 26 65 77 89 79 70 37 4 14 24 26 -20 -105 -108 -88 -67 -47 -26 -6 14 0 -15 22 11 -42 -94 -120 -98 -103 -108 -38 33 49 66 83 100 89 79 29
8827 29 -22 -61 -100 -69 -39 -9 -28 -44 -59 -60 -60 -39 -19 19 8 -3 34 83 132 112 91 85 79 74 68 -7 -82 -182 -233 -183 -84 -13 58 115 124 118 63 15 15
8815 15 26 36 13 -10 -9 -8 51 111 108 57 8 -42 -122 -153 -154 -156 -154 -153 -161 -168 -176 -184 -145 -105 -90 -76 -97 -118 -88 -10 35 31 33 35 32 28 28 27 38 97 156 166 137 107
8801 107 82 9 -61 -50 -9 -16 -75 -86 -75 -113 -127 -141 -77 -13 15 44 24 3 -27 -57 -39 -20 5 31 35 -9 -21 -33 3 87 145 155 147 138 110 82 103
8790 103 123 124 125 101 78 58 37 65 93 69 45 18 40 54 68 112 108 30 -48 -75 -54 -44 -35 -23 -11 -4 2 9 15 14 13 12 11 25 40 30 21 -17 -54 -43 17
8777 17 63 27 -37 -102 -115 -80 -72 -63 -31 1 15 -20 -30 8 16 24 58 91 76 61 43 26 8 -10 -22 -35 -72 -109 -60 -11 -11 -11 -5 0 6 11 2 -8 -17 -27 -9
8765iJ8J7J8j0j1j1j0PQQPL0L0P8P9mmn2n2q9r0qqK1K2lkK1K2k7k7lmk7k8J2J1J2J1K4K4K3
8752B4K4l7l7l7l7K4K4K4K4L0L0L0L0k9k8k9k9k3k2K5K6jjn0n0L6L5J2J1K2K2k7k6p0o9k1
8740a70k1K2K2P1P1j0j1L8L8M2M3J7J8l4l4l5l4m4m4m5m4L3L4QRm0m1PQM4M5M4M4l6l6L4L4
8729D7L7j2k5k5ONL3j5m6m5NNJ2l7n0m9M4M4K0K0L3L3k3k4qqL2L2N5N5J2l6q8m0J8J9kkk7
8717Ek6L5L4J1J0qqqqJKM2M2RQl1l2m7m8K3K2nn3n4nJ1J1M1qk8k8nn2j8j7M9N0M7kk9k8k4
8704a19K4O5J6m4m5RJ0M4M4P1K3nml2l2j2j2l7l6m1m1K9K9K5k4K8K7k2k3J8O6M5l7m5m5L9
8693d4L8l4l4k0j9k0j9m0m0K2P0L7L7j7j6L0L0K8K7L2j8m1Pj7j6j4j3j1j1l6l5RJ0N0N0K0
8681a8J9M1M1N1Km4m4J0R%m9%M9M7lJ1J1j7j6j3j2j2j2pqmnrL9J3J2QRj6j6k2k3k3k2M0M1
$$ plain form
8765 -9 9 26 44 34 23 12 2 9 17 25 32 62 92 170 249 245 241 189 137 48 -42 -50 -58 -37 -15 -18 -20 1 23 -4 -31 -34 -38 -65 -93 -81 -70 -58 -47 -23 1 24
8752 24 48 11 -26 -63 -100 -76 -52 -28 -4 26 56 86 116 87 59 30 1 -22 -44 -19 7 6 5 -45 -95 -59 -24 -12 -1 21 43 16 -10 -80 -149 -170
8740 -170 -191 -169 -147 -76 -5 -15 -26 12 50 92 135 152 170 136 102 67 33 -11 -55 -100 -144 -111 -77 -69 -60 -100 -141 -134 -126 -82 -37 7 51 15 -21 13 47
8729 47 84 72 47 22 28 33 66 51 5 -40 -35 -30 -18 -55 -105 -154 -110 -66 -46 -26 7 40 17 -7 -15 -23 9 41 96 151 163 127 39 -1 17 36 34 32 5
8717 5 -21 14 48 59 69 61 53 45 37 38 40 82 124 133 141 110 78 31 -17 6 28 23 -30 -84 -89 -78 -67 -26 -34 -62 -90 -95 -147 -165 -182 -133 -83 -36 -38 -67 -95 -119
8704 -119 -95 -30 -14 -58 -103 -94 -84 -40 4 75 98 93 89 57 25 13 1 -36 -72 -113 -154 -125 -96 -71 -95 -67 -40 -62 -85 -67 -1 44 7 -38 -83 -44
8693 -44 -6 -40 -74 -94 -113 -133 -152 -192 -232 -210 -140 -103 -66 -83 -99 -69 -39 -11 16 48 30 -11 -4 -21 -37 -51 -64 -75 -86 -122 -157 -148 -138 -88 -38 -18
8681 -18 1 42 83 134 136 92 48 58 67 67 18 18 67 114 111 122 133 116 100 87 75 63 51 44 36 32 27 18 57 70 82 90 99 83 67 45 22 -1 -23 17 58
8669E8M4nm2m1m7JJ2J1M3pl5l5J8J8L9L8J1l6n3mPOL5L6L5L6J2J2L6j3n0r9p9KM4M4m0m0J4
8657a4J5j0j0k5k4n1lO3O2k3k3j8j8j9j8OOM7M6k5k6k6k6K7K7N1N2K3K4k5k5qrl3l3ppppM2
8644b9M3J8J8LKp8p9%%%%J3J3J4J3lkk7k7l8l8M3M3N9N9J0J0m3m3L9L8n7n7qrJ8J8O7O6k2
8632D7k2k2k2K1K2mlN9N9J0J0mmk9k8m4m3L7L8J1J1L5L5M3M3l8l8J1J1R1R2J82J83J90L53
8621A293N48Q40J422J973R96j174j906j356q45m88k72j75r4r5q9q8r1r0rrk3k4k3k3oom8m9
8612H9pR1O5l1l2l2o3o2ppppJ5J4l4l4K3K4M7M7J4J3l6l5J4J5J5J4K1K1o0o0M7M7K2K3J1J1
8600A89l8l7k1k1k1k1o6o7J4J5M0M0J6J6L2L3m8m8K2K2k7k6j2j2O8O9J7J6l2l3kjM6M7LLM
8589A79Lnmn3n3J9K0J9K0M4M5K1K0j2j2O9O8N8N8J34K97N31Q88L61p07p45m53k69j72o1o0
$$ plain form
8669 58 102 97 55 14 -33 -32 -20 -9 34 27 -8 -43 -25 -7 32 70 81 45 -8 -12 -5 1 36 72 107 143 155 167 203 190 140 41 -38 -36 8 52 12 -28 -14
8657 -14 1 -9 -19 -44 -68 -119 -122 -59 3 -20 -43 -61 -79 -98 -116 -110 -104 -57 -11 -36 -62 -88 -114 -87 -60 -9 43 66 90 65 40 32 23 -10 -43 -50 -57 -64 -71 -29
8644 -29 14 32 50 53 55 -23 -102 -102 -102 -102 -102 -89 -76 -62 -49 -52 -54 -81 -108 -146 -184 -141 -98 -39 20 30 40 -3 -46 -7 31 -26 -83 -91 -100 -82 -64 3 69 47
8632 47 25 3 -19 2 24 20 17 76 135 145 155 151 147 118 90 46 3 40 78 89 100 135 170 213 256 218 180 191 202 293 385 567 750 940 1293
8621 1293 1841 2681 4103 6076 7072 5898 3992 2636 1791 1303 1031 856 762 667 578 490 399 309 300 291 268 244 221 198 192 186 138 89
8612 89 82 173 238 207 175 143 80 18 11 4 -3 -10 5 19 -15 -49 -26 -2 45 92 106 119 83 48 62 77 92 106 127 148 88 28 75 122 144 167 178 189
8600 189 151 114 93 72 51 30 -36 -103 -89 -74 -34 6 22 38 70 103 55 7 29 51 24 -2 -14 -26 42 111 128 144 112 79 77 76 122 169 172 175 179
8589 179 182 177 173 120 67 86 106 125 145 189 234 255 275 263 251 320 388 446 504 638 935 1466 2354 2715 2008 1263 810 541 369 308 248
8579B48ooj%p6p5o6L1K4K5MMMMqrn7n6K4K4K5K4l6l6l6l5M0M1%%j9j8m2m3L2L2L3L2j7j6j7
8567b4j6k9k8K8K8K0K0K1K0m4m3J8O7L6L6L9L9jkjjn6n5m2OJ1J2J1J1L7j3k5k6onr2r1n5n
8555b00K4K3L7L6J2J2nnnnJ1J1L8j0l3l4l7l6L7L7L7L7k0k0J7J8M1qK0K0%J%JjkK5P4L3j6
8542A65rrk1k0k4k4Om4m3NM2M1M5M5j%j%l5l4l8J1M1M1L0j7m1m1jM7N3Ml9l9j7j6PPj1j2l5
8529A8l6K3K3K3K3J8J8J8J8J0J0m6m7nnnol5l5K1K1l4l4rj0L5L5k2k2j7j8Q2Q3P0j2l8l8%
8518G5J%JJ0J1m7m6j4j4j4j5LMLLk2k3J9J8K7K7j3j4OOOOkjkjnnonj8j9K2K1l1l1M1M2L5L5
8504G4k1k2RRRRm0m0m0m0J9J9J8J9J2J3J2J2l1l2ppO2O2n9n9mmmlJ6J6J6J6J2J3J2J3K5K6
8491A10l1l1K4K3j6j7j0j0rj0J3J3j1j2m0m0j6j6%jK4K3k0k0NM%%L7L7K4k4m3L8M3M2k5k5
$$ plain form
8579 248 242 236 235 235 159 84 18 49 73 98 102 106 110 114 106 97 40 -16 8 32 57 81 45 9 -27 -62 -22 19 19 19 0 -18 -60 -103 -71 -39 -6 26 9 -7 -24
8567 -24 -40 -69 -97 -69 -41 -21 -1 20 40 -4 -47 -29 38 74 110 149 188 187 185 184 183 127 72 30 36 47 59 70 81 118 105 80 54 48 43 -49 -140 -195 -200
8555 -200 -176 -153 -116 -80 -68 -56 -61 -66 -71 -76 -65 -54 -16 -26 -59 -93 -130 -166 -129 -92 -55 -18 -38 -58 -41 -23 18 10 30 50 50 51 51 52 51 49 74 148 181 165
8542 165 156 147 126 106 82 58 64 20 -23 -18 24 65 110 155 154 154 153 153 118 84 46 57 98 139 169 152 111 70 69 116 169 173 134 95 78 62 69 76 65 53 18
8529 18 -18 5 28 51 74 92 110 128 146 156 166 120 73 68 63 58 52 17 -18 3 24 -10 -44 -53 -63 -28 7 -15 -37 -54 -72 10 93 163 151 113 75 75
8518 75 76 76 77 87 98 51 5 -9 -23 -37 -52 -49 -45 -42 -39 -61 -84 -65 -47 -20 7 -6 -20 -14 -8 -2 4 2 1 -1 -2 -7 -12 -18 -23 -41 -60 -38 -17 -48 -79 -38 4 39 74
8504 74 53 31 40 49 58 67 27 -13 -53 -93 -74 -55 -37 -18 -6 7 19 31 0 -32 -39 -46 16 78 19 -40 -44 -48 -52 -55 -39 -23 -7 9 21 34 46 59 84 110
8491 110 79 48 72 95 79 62 52 42 33 23 36 49 38 26 -14 -54 -70 -86 -86 -87 -63 -40 -60 -80 -75 -71 -71 -71 -34 3 27 3 -40 -2 41 83 58 33
8480C3m1m2J5J5kllkooo2o2m9m8M0M0L6L6nnK3K3N8N8K4n7n7K4Q0P9PPk5j07j06k5P2P2MN
8467C8onnoJ2J2m5m4J6J7J6J7j8j8j8j8RRO3O3o9j17p9JP9P8N4N4J4o7m9jNNl3l3J8J7N9N8
8455H3K3K2K3K3J2J2k8k8k0k0j7o6p3p4l1J7K2K1J9O7M3om8m9j7j7K3K3O2O3j2o1k7K2O2O1
8444A09j1o1l3l3K8K9n8n7j8L1N7N7on6l6M5M0j0m9n0K2K2K3K2L1L1PPK2K2J9J9Pm2jM7J9
8432A95J8M9Jn3n3k7K2j8j7j4j5ppppm2m1J5J5m1m2K8K8M1om8KN0N1M4no7j9onJ1O0K5n7q7
8420c6m0J8J7k2k1k2k2M6M6OOm0l9J7J7L1L1L4j5j3j2j6j6PPPOrj0j0j0J3J4J1N9L7L7J3l5
8408I2k0K7kkMML1j7j4j5j7j7m2m2j7j7m3m3j3L5K3K4K6K7M8M8Km6m3m3noK4K5K4K5k6k5k5
8395e1k5nnL5L6KLLKopopL8L8K8k0j6L4Rm0m7KL0P9P9L1j5j5pn5r6m8k3k4K0K0K6K6K9j9J
$$ plain form
8480 33 -8 -50 -35 -20 -22 -25 -28 -30 -36 -42 -104 -166 -215 -263 -223 -183 -147 -111 -116 -121 -98 -75 -17 41 65 8 -49 -25 55 134 141 148 123 16 -90 -115 -43 29 33 38
8467 38 32 27 22 16 28 40 -5 -49 -33 -16 0 17 -1 -19 -37 -55 -46 -37 26 89 20 -97 -176 -175 -96 -18 36 90 104 37 -12 -13 -8 -3 -36 -69 -51 -34 25 83
8455 83 106 128 151 174 186 198 170 142 122 102 85 19 -54 -128 -159 -142 -120 -99 -80 -13 30 24 -24 -73 -90 -107 -84 -61 1 64 52 -9 -36 -14 48 109
8444 109 98 37 4 -29 -1 28 -30 -87 -105 -74 -17 40 34 -22 -58 -13 27 17 -32 -82 -60 -38 -15 7 38 69 76 83 105 127 146 165 172 130 129 176 195
8432 195 213 262 263 210 157 130 152 134 117 103 88 81 74 67 60 18 -23 -8 7 -34 -76 -48 -20 21 15 -33 -31 19 70 114 109 42 23 17 12 23 83 108 51 -36
8420 -36 -76 -58 -41 -63 -84 -106 -128 -82 -36 -30 -24 -64 -103 -86 -69 -38 -7 27 12 -1 -13 -29 -45 -38 -31 -24 -18 -27 -37 -47 -57 -44 -30 -19 40 77 114 127 92
8408 92 72 99 97 95 99 103 134 117 103 88 71 54 12 -30 -47 -64 -107 -150 -163 -128 -105 -81 -55 -28 20 68 70 24 -19 -62 -67 -73 -49 -24 0 25 -1 -26 -51
8395 -51 -76 -81 -86 -51 -15 -13 -10 -7 -5 -11 -18 -24 -31 7 45 73 53 37 71 80 40 -7 -5 25 104 183 214 199 184 177 122 26 -22 -45 -69 -49 -29 -3 23 52 33 34
8382C4Kk6k5j8j7p0k0M9N0J2J3qpL3L3J0RJ0J0K8K9MMJ3J4j7o4q8q8l4l4j4j4M4R1R2J1j4
8371C7j3m2m2j8j7K9K9L0K9PPq3q2kkkkL5L5L6L5j2j1oo%Q2Q1Jk4k3k9k9n4n4n4n4%jM0M0
8358a09L9M0kjJ9J8J9J8P4P4j5j5k4k4k4k4K1K1n2n1K1K1llM0M0L9M0n5n6n5n6PPK6K6O2j9
8346H4l0l0M0M0J5J6l3l3l4l3j7j8j8j7J9J8n4n4NMK9K9M7M7M6M7rqm9m8p1p0j4j4K5K5J7
8335a01O5N0l2o6j8K7K8L1L0k3k4k3k4QPPQL6L7j2o0q7oK7K7j4j3J1J1k9k8N3N2L9L9L9L9
8323A11k5k5k4k5k5k4p1J1O6O5j0j0m3m3j8j9K9K9NNJ0J0J0J0L0L0L0L1l3l3l2l3J7J7J7J7
8312E7PPPPpoopJ0J0p0p1j6j5QRL2L3L2L2k1k2k2k2P8P8L0K9k2k3KKn3n2mlpoooj4j4L5L4
8298D4L6L5J1J1k7k7k4k4j8L1N1k9r4m5k9l0M1M1L6L6K7n3o0j1N1N2OOm3m2L8L9J7J7M1M1
$$ plain form
8382 34 36 10 -15 -33 -50 -120 -140 -91 -41 -29 -16 -24 -31 2 35 45 54 64 74 102 131 135 139 152 166 149 85 -3 -91 -125 -159 -173 -187 -143 -52 40 51 37
8371 37 24 -18 -60 -78 -95 -66 -37 -7 22 29 36 -47 -129 -131 -133 -135 -137 -102 -67 -31 4 -8 -19 -25 -31 -31 51 132 133 109 86 57 28 -26 -80 -134 -188 -188 -189 -149 -109
8358 -109 -70 -30 -32 -33 -14 4 23 41 115 189 174 159 135 111 87 63 84 105 53 2 23 44 41 38 78 118 157 197 142 86 31 -25 -18 -11 15 41 103 84
8346 84 54 24 64 104 119 135 102 69 35 2 -15 -33 -51 -68 -49 -31 -85 -139 -134 -130 -101 -72 -25 22 68 115 106 98 49 1 -70 -140 -154 -168 -143 -118 -101
8335 -101 -36 14 -18 -84 -102 -75 -47 -16 14 -9 -33 -56 -80 -72 -65 -58 -50 -14 23 11 -49 -136 -142 -115 -88 -102 -115 -104 -93 -122 -150 -97 -45 -6 33 72 111
8323 111 86 61 37 12 -13 -37 -108 -97 -31 34 24 14 -29 -72 -90 -109 -80 -51 -46 -41 -31 -21 -11 -1 29 59 89 120 87 54 22 -11 6 23 40 57
8312 57 64 71 78 85 78 72 66 59 69 79 9 -62 -78 -93 -85 -76 -44 -11 21 53 32 10 -12 -34 44 122 152 181 159 136 138 140 87 35 31 28 21 15 9 3 -11 -25 10 44
8298 44 80 115 126 137 110 83 59 35 17 48 99 70 -24 -69 -98 -128 -87 -46 -10 26 53 0 -60 -71 -20 32 38 44 1 -41 -3 36 53 70 111 152
8287A52o3o4o3o4Q8Q8OPm1m1PQ%jm9m9L8L7J4J3K5K5K5K4K6K5n5n6l5l4J3J4k4k5p3p3L4L5
8275a06j4j4M3M4J9K0j4j3J1J0K3K3n8j06l7M5J05N5qpk8p5n6K6K5K5mnmmJ0J0j4O7P1K3k6
8264F2k5n7n6k7N5Q7OQQRRl9l9k2k2LKL2L2q2q1qpppj3j2LN3P6mo4j6J0J1O1O2k0j9MNJ6J5
8251BO4O4k0k1k0k1opopK4K4K4K4k3k2k3k2J7J8J8J7k0j9NMK9K8k0k0j6j5j6j6k9k9k9k8L1
8239f2L1L1L1L1L1q2q2k2k2K7K7P2P2qrj6j5j6j6j8j8L1L1K4K4K4K4jkkjn1n2k3k4L8Q8L7
8227A32o1n9j2k0k0j2j2L7L7j9j9K9P7Q2j5p1p0j5j5L3L4j8j7j7j8QQL2L3J0J1l8l8k2k3K6
8216b2K7n4n4k9l0N5N5L0L0J0Rj5j4l7l7M4M5N7N7RRqql2l2p1p1l6M5M8M7MMK4K4j%m2m3m2
8203d5m2KKKJk2k2K6K7KLk2k1PPPPJ3J3l6l5N4N4L0K9J7J8J7J7J8J8o2o3l6l7j3j2O2O2J4
$$ plain form
8287 152 89 25 -38 -102 -14 74 80 87 46 5 12 20 20 19 -30 -79 -41 -4 10 23 48 73 98 122 148 173 118 62 27 -7 6 20 -4 -29 -102 -175 -141 -106
8275 -106 -120 -134 -91 -47 -28 -8 -22 -35 -24 -14 9 32 -26 -132 -169 -124 -19 36 28 21 -7 -82 -138 -112 -87 -62 -66 -71 -75 -79 -69 -59 -73 -6 65 88 62
8264 62 37 -20 -76 -103 -48 39 45 53 61 70 79 40 1 -21 -43 -40 -38 -6 26 -56 -137 -145 -152 -159 -166 -179 -191 -188 -135 -59 -63 -127 -143 -133 -122 -61 1 -19 -38 -34 -29 -13 2
8251 2 66 130 110 89 69 48 42 35 29 22 46 70 94 118 95 73 50 28 45 63 81 98 78 59 64 68 97 125 105 85 69 54 38 22 -7 -36 -65 -93 -62
8239 -62 -31 0 31 62 93 11 -71 -93 -115 -88 -61 11 83 75 66 50 35 19 3 -15 -33 -2 29 53 77 101 125 124 122 120 119 68 16 -7 -31 7 95 132
8227 132 71 12 0 -20 -40 -52 -64 -27 10 -9 -28 1 78 160 145 74 4 -11 -26 7 41 23 6 -11 -29 -21 -13 19 52 62 73 35 -3 -25 -48 -22
8216 -22 5 -49 -103 -132 -162 -107 -52 -22 8 18 27 12 -2 -39 -76 -32 13 70 127 136 145 137 129 97 65 -6 -77 -113 -68 -20 27 31 35 59 83 82 82 40 -3 -45
8203 -45 -87 -85 -83 -81 -80 -102 -124 -98 -71 -69 -66 -88 -109 -102 -95 -88 -81 -68 -55 -91 -126 -72 -18 12 41 58 76 93 110 128 146 84 21 -15 -52 -65 -77 -15 47 61
8191F1J4j6j7j6j6jjjjmmmmNMN3N3L4L5j4j4j6j7j6j6k0j9k0j9OON4N5j2j3l6l7noJ9J9J6
8178F9J6o5o5K6K7k2k2J4J4L9L9kkm2m2l0l0K6K7K4K5j6j6qpqqJ7J6j6L3M4l7j5O6N4k7n0
8166D6n0o1o0nmK5K4j5j6J9K0O0O0J9J9k1k1K0K0l6l6n1n2N5N4L0K9j0j1k3k3JJl2l2QRj4
8154e4j4j4j5KKLKk6k5L1L1J2J3N3N3%%m0m1j5j4M1M2j6j5QRJ4J5j0n8r9j9K2K2O2O3k7k7
8142b9l4l4L8L9J3J3k7k8K8K9MLj3j4j4j4poJ7J8L4L4J0J0l7l8k8K1M9%n9n9k5k4%%J9J9J9
8130g3K0j2j2j4j5K5k3K6K5J8l1l1J8K6K5K9K9j4j5K6K6j4j3j4j4j7j6J0J0j2L5L6j3k5k5
8119a9n3n2K9L0NNLMLMk7k7n5nK9K9QQL1L1k9k9mn2NN3N4N5K8k0j4j4j6j7mll4J4N0Km1m1
8106g6nmj1L7M0rllRRj5j6J4J3J0J1L2j6p2k4J3J4j1L8N3N2J6J5RQm7m8k1k1LLJ0Rl9l9KJ
$$ plain form
8191 61 75 59 42 26 10 9 8 7 6 2 -2 -6 -10 -5 -1 52 105 139 174 160 146 130 113 97 81 61 42 22 3 9 15 69 124 112 99 63 26 21 15 34 53 69
8178 69 85 20 -45 -19 8 -14 -36 -22 -8 31 70 68 66 24 -18 -48 -78 -52 -25 -1 24 8 -8 -16 -23 -31 -39 -22 -6 -22 11 55 18 3 69 123 96 46
8166 46 -4 -65 -125 -130 -134 -109 -85 -100 -116 -97 -77 -17 43 62 81 60 39 59 79 43 7 -44 -96 -41 13 43 72 62 51 28 5 6 7 -25 -57 -49 -40 -54
8154 -54 -68 -82 -97 -95 -93 -90 -88 -114 -139 -108 -77 -65 -52 1 54 54 54 14 -27 -42 -56 -15 27 11 -4 4 13 27 42 32 -26 -125 -144 -122 -100 -38 25 -2 -29
8142 -29 -63 -97 -59 -20 -7 6 -21 -49 -21 8 12 15 2 -12 -26 -40 -47 -53 -36 -18 16 50 60 70 33 -5 -33 -12 37 37 -22 -81 -106 -130 -130 -130 -111 -92 -73
8130 -73 -53 -65 -77 -91 -106 -81 -104 -78 -53 -35 -66 -97 -79 -53 -28 1 30 16 1 27 53 39 26 12 -2 -19 -35 -25 -15 -27 8 44 31 6 -19
8119 -19 -72 -124 -95 -65 -60 -55 -52 -48 -45 -41 -68 -95 -150 -155 -126 -97 -89 -81 -50 -19 -48 -77 -81 -133 -128 -75 -21 34 62 42 28 14 -2 -19 -23 -26 -60 -46 4 6 -35 -76
8106 -76 -81 -85 -96 -59 -19 -28 -31 -34 -25 -16 -31 -47 -33 -20 -10 1 33 17 -55 -79 -66 -52 -63 -25 28 80 96 111 120 128 81 33 12 -9 -6 -3 7 16 -23 -62 -60 -59
8093e9KJj8j7POJ6J6l3l2KKK4K4J9l0kP9N2Lj3j2k4k4K4K5l4l3J5J5J7J7J6J7j7j6j7j7RR
8081A9J0Rk2k1k2k2K7K8L0L0j2L7L3m7j08n8K2P1N6k6%jj6j5o4o4MNp6p6M3M4M4M3M2M1J7
8069EJ6k3k3K6K5MLLMl3l4M8M8j1j1j1j1K4K4k4k4k2k2K7K6K8K9k1k0mmk8k8mlmlk9k8k9k9
8057a43NNMNJ%M9N0nmkjkM6M6kLLK7k1j7j6k0j9k4k4%%M6M5qn6K0K0o1o1n1lJ9J9J4J5j0j0
8043a18p4p4l8M2N4N3L7j2J8J7J2J1J2l7RN7L7j0J9K0j8j7PPn0n0mmL4j4J3J3N1N1N3Oqqn5
8031D2n4l5M6N3Lk9l0n0n0k1R3N6Pj9j8k2k1pqppJ9J9J9J9nmnmj2j2j0rJ2O0L6j2q1q1J4R4
8018b1R8N0K9k0mlppnonoK8K8K8K8m8m9%%llP2P3K5n6o5j6l5q4r7r7l4M7N0N0J1J1j3j3k8
8005i7k7K1K2L1L1PQLLN1N2m7m7JKj9j9j8j9k2k2k2k1k4k4k4k4M7M6P1P1m2m2L9L9K3K4n8
$$ plain form
8093 -59 -57 -56 -74 -91 -84 -78 -62 -46 -79 -111 -109 -107 -83 -59 -40 -70 -72 7 59 62 49 37 13 -11 13 38 4 -29 -14 1 18 35 51 68 51 35 18 1 10 19
8081 19 29 38 16 -5 -27 -49 -22 6 36 66 54 91 124 77 -31 -89 -67 4 60 34 34 33 17 2 -62 -126 -122 -117 -193 -269 -226 -182 -138 -95 -53 -12 5
8069 5 21 -2 -25 1 26 30 33 36 40 7 -27 21 69 58 47 36 25 49 73 49 25 3 -19 8 34 62 91 70 50 46 42 14 -14 -18 -21 -25 -28 -57 -85 -114 -143
8057 -143 -138 -133 -129 -124 -123 -123 -74 -24 -29 -33 -35 -36 -38 8 54 52 55 58 85 64 47 31 11 -8 -32 -56 -56 -56 -10 35 27 -29 -9 11 -50 -111 -162 -165 -146 -127 -113 -98 -108 -118
8043 -118 -192 -266 -304 -262 -208 -155 -118 -130 -112 -95 -83 -72 -60 -97 -88 -31 6 -4 15 35 17 0 7 14 -36 -86 -90 -94 -60 -74 -61 -48 3 54 107 113 105 97 42
8031 42 -12 -47 -1 52 55 26 -4 -54 -104 -125 -32 24 31 12 -6 -28 -49 -56 -64 -71 -78 -59 -40 -21 -2 -7 -11 -16 -20 -32 -44 -54 -63 -51 9 45 33 -48 -129 -115 -21
8018 -21 77 127 156 136 132 129 122 115 110 104 99 93 121 149 177 205 157 108 108 108 105 102 174 247 272 216 151 135 100 16 -81 -178 -212 -165 -115 -65 -54 -43 -56 -69 -97
8005 -97 -124 -103 -81 -50 -19 -12 -4 -1 2 53 105 58 11 12 14 -5 -24 -42 -61 -83 -105 -127 -148 -172 -196 -220 -244 -197 -151 -80 -9 -51 -93 -54 -15 8 32 -26
7994b6n8K0K0k8k9k6k7N5N4N1N2l0l0pqJ6J6k9k9K0K0K2K3k9k9j4o3n7K5J00J00N7N6pql2
7982A41l2j9j9m3m3nnM3M3l6l6opn1K9L6j3o1o2j5j6O6O6J7J8J5J5L9L9o3o3m4MK1k8KLPQ
7970e5k0K9L1L2L2L1Qm2m1PL4L4J3J3K5K5k4k3k7k7l2J6Om3l9RK2K1K5K5OPK2P2L4m6m6m6
7959F8j4j4J7l2l9RK8K8K3K4k2k2j6L3L2j6o3o3l3q2J6R6P6K7rrj3j2m8m7m5m5j7L1N3N2r
7947e7rrj0M6M5K4k4j9j9K6K6L0K9K6K7J3l5n4n3l7J2j6j5J3J3l5l5J6J5J0N8J5l4llj4j4
7936e1j4j3K1K2J2l7kM8L8L8K4k6LKk0k0NMQQL3L2O2O2o0n9m6m7j9j9j1L8R5M6l4l3l6l6K1
7923C9K0K1K0l7l7j1L8M5mm4NM2nl2l2l6l6m1PM3nl2l1PQO5O4M6M5KLl8q6q5l8M7M7M9N0J
7911H4%K2K2kn0q7l9KN1N4ONMKJNMK6K5k5p4p3k5n5n6NMN3N4K4k5l4l4K4P3J8J8K1K1j6j5
$$ plain form
7994 -26 -84 -64 -44 -72 -101 -127 -154 -99 -45 6 58 28 -2 -9 -17 -1 15 -14 -43 -23 -3 19 42 13 -16 -30 -93 -150 -125 -25 75 132 188 181 173 141
7982 141 109 90 71 28 -15 -20 -25 18 61 25 -11 -17 -24 -75 -46 -10 -23 -84 -146 -161 -177 -111 -45 -28 -10 5 20 59 98 35 -28 -72 -68 -47 -75 -73 -70 -63 -55
7970 -55 -75 -46 -15 17 49 80 88 46 5 12 46 80 93 106 131 156 132 109 82 55 23 39 45 2 -37 -28 -6 15 40 65 71 78 100 172 206 160 114 68
7959 68 54 40 57 25 -14 -5 23 51 74 98 76 54 38 71 103 87 24 -39 -72 -154 -138 -42 34 61 52 43 30 18 -30 -77 -122 -167 -184 -153 -100 -48 -57
7947 -57 -66 -75 -85 -39 6 30 6 -13 -32 -6 20 50 79 105 132 145 110 56 3 -34 -22 -38 -53 -40 -27 -62 -97 -81 -66 -56 2 17 -17 -20 -23 -37 -51
7936 -51 -65 -78 -57 -35 -23 -60 -62 -14 24 62 86 60 63 65 45 25 30 34 42 50 83 115 177 239 179 120 74 27 8 -11 -22 16 111 157 123 90 54 18 39
7923 39 59 80 100 63 26 15 53 98 94 50 55 97 92 60 28 -8 -44 -85 -78 -35 -40 -72 -103 -96 -88 -23 41 87 132 134 137 99 13 -72 -110 -63 -16 33 83 84
7911 84 84 106 128 126 76 -11 -50 -48 3 57 63 68 72 74 75 80 84 110 135 110 36 -37 -62 -117 -173 -168 -164 -111 -57 -33 -58 -92 -126 -102 -29 -11 7 28 49 33 18
7898A8M1M1o3o2QP%m9o7J4M1M0M6M6QPQQk7k7k6k7nnnoJ0J0j4j4jjK3K3J0J1j6o5NN4K3K3
7885D5j9j9NOK4K5%%J1J0J1J1j8j7LMM3ollj0j1n1n1K7K6Jm8o5j7M3M2O5O4Om3o7j8QQjjK7
7872D7k2l3l2MNL2L2K1k7m9jN3Mk1k1J7J6m4m4m7KL9M0%m9k9K0j0j1J1J2M8M9l1p9k3K6L7
7860e8L7J5J6K6K6JKj6j6p2p2OPl4l4%j%jj2j2j1j2R9J00l9l8m0m1J6J6L1L1L1L0%jn7n7J
7848a33JM1M1K5K5JJJ6J6k5p3L0J11L9m3l0J9N5Ok2k2jjn4n5j4j3lkk7k6J6J7J6J7K2K2J4
7836Go8q4l7PN5P9L1%m9k5k5k8k8M3M2LKLKLKO0O0j3j3K4K3%%j9j9N4N4j1j1j0j1k6k6k6k6
7823arj0J5J6k4k3Ql9n3K9L7L6MLl7l7qpL3L3J1J0J0J0L8L8l5l5LKk1k2l2l2qqM5M4M5M4J6
7811H9J6k0k0m9L2P5P5%%m0m0j34j34o1o1N2N2J2J2K1K2O2O2mmk9k8%%%%j2j1j2j2j0j0j1
$$ plain form
7898 18 59 100 37 -25 -17 -10 -10 -59 -126 -112 -71 -31 15 61 69 76 84 92 65 38 12 -15 -20 -25 -30 -36 -26 -16 -30 -44 -45 -46 -23 0 10 21 5 -60 -55 -1 22 45
7885 45 26 7 12 18 42 67 67 67 78 88 99 110 92 75 78 82 125 119 116 113 103 92 41 -10 17 43 44 -4 -69 -86 -43 -1 64 128 134 91 24 6 14 22 21 20 47
7872 47 25 -8 -40 -36 -31 1 33 54 27 -22 -23 30 34 13 -8 9 25 -19 -63 -110 -108 -69 -29 -29 -78 -107 -87 -97 -108 -97 -85 -37 12 -19 -98 -121 -95 -58
7860 -58 -21 -6 10 36 62 63 65 49 33 -39 -111 -105 -98 -132 -166 -166 -167 -167 -168 -180 -192 -203 -215 -116 -16 -55 -93 -133 -174 -158 -142 -111 -80 -49 -19 -19 -20 -77 -134 -133
7848 -133 -132 -91 -50 -25 0 1 2 18 34 9 -64 -34 77 116 73 43 62 117 123 101 79 78 77 23 -32 -46 -59 -62 -64 -91 -117 -101 -84 -68 -51 -29 -7 7
7836 7 -61 -145 -182 -175 -120 -41 -10 -10 -59 -84 -109 -137 -165 -122 -80 -77 -75 -72 -70 -67 -65 -5 55 42 29 53 76 76 76 57 38 92 146 135 124 114 103 77 51 25 -1
7823 -1 -10 -20 -5 11 -13 -36 -28 -67 -120 -91 -54 -18 -14 -11 -48 -85 -93 -100 -67 -34 -23 -13 -3 7 45 83 48 13 16 18 -3 -25 -57 -89 -97 -105 -60 -16 29 73 89
7811 89 105 85 65 16 48 123 198 198 198 158 118 -16 -150 -211 -272 -220 -168 -156 -144 -123 -101 -39 23 19 15 -14 -42 -42 -42 -42 -42 -54 -65 -77 -89 -99 -109 -120
7799a20j0M0M1M0M0K6K6K6K6m9m9qrk8k8J3J2o4o4qqj5j4RJ0J1J0j3j4JJN3N3M7l4m0Qk0k0
7787a22M0M0N7N6%%m8m8m7m8M1M2J7J8L9M0j7j7J2J3M8M8M9l2j4L4J2J1m2m1j5j5n6n5K9K9
7776E8L2j7NNJKK2K1llk8k8r6m7M3M4OPl0l0K7K6m7m7L1P9L7L7m9m9l0l0J1J1j8j8L6L6K6
7763C3k3jM7M9%k6k6mnk9k9n9o0k9J8M5M5MNj2o1l6J2J9K0l1l1J3O1L1L1M0qk1k1J6J6N2N2
7751I7M4l7l2l2j8j9j5j6l8J1j7j6K6K6j0rqP3Q1Q1J3l5p6k7L1L0Qm2o1j3O2O1l6l6RN8MN
7740A27m9m8m0m0k6K2K8K8OPl1l0K6K6K8K9k8k8%%K4K5m4m4m4m3L8L8L8L9j9j8ONk8k8mlj7
7727g2j6J0N9O9K1l7l8k4k4%%J9K0J9J9l2l2l3l2k6k6O3O2O2O1K1K1l9l9m2PO5O5j0n8n2n2
7716b1m3PK2K2l5l5L3j6J2J2K3K4N1Ko0n9qn7m5LJ3J4NNNOOPk1K8J9J9M9Jl7l7J7J7K2K2k
$$ plain form
7799 -120 -130 -90 -49 -9 31 57 83 109 135 86 37 29 20 -8 -36 -23 -11 -75 -139 -147 -155 -170 -184 -175 -165 -154 -144 -157 -171 -170 -169 -116 -63 -16 -50 -90 -82 -102 -122
7787 -122 -82 -42 15 71 71 71 23 -25 -72 -120 -79 -37 -20 -2 37 77 60 43 55 68 116 164 213 181 167 201 213 224 182 141 126 111 55 0 29 58
7776 58 90 73 78 83 84 86 108 129 126 123 95 67 -29 -76 -33 11 17 24 -6 -36 -9 17 -30 -77 -46 33 70 107 58 9 -21 -51 -40 -29 -47 -65 -29 7 33
7763 33 10 9 56 105 105 79 53 49 44 15 -14 -73 -133 -162 -144 -99 -54 -50 -45 -57 -118 -154 -142 -123 -103 -134 -165 -152 -91 -60 -29 11 3 -18 -39 -23 -7 45 97
7751 97 141 104 72 40 22 3 -12 -28 -66 -55 -72 -88 -62 -36 -46 -55 -63 10 91 172 185 150 74 47 78 108 116 74 13 0 62 123 87 51 60 118 122 127
7740 127 78 30 -10 -50 -76 -54 -26 2 8 15 -16 -46 -20 6 34 63 35 7 7 7 31 56 12 -32 -76 -119 -81 -43 -5 34 15 -3 3 8 -20 -48 -52 -55 -72
7727 -72 -88 -78 -19 50 71 34 -4 -28 -52 -52 -52 -33 -13 6 25 -7 -39 -72 -104 -130 -156 -93 -31 31 92 113 134 95 56 14 21 86 151 141 83 31 -21
7716 -21 -64 -57 -35 -13 -48 -83 -50 -66 -54 -42 -19 5 56 58 -2 -61 -69 -126 -171 -168 -155 -141 -136 -131 -126 -120 -114 -107 -128 -100 -81 -62 -13 -12 -49 -86 -69 -52 -30 -8 -10
7703a0kJ0J1%m8m1QL1L2L4j5j7L1K0k8l9l8K2K3K3K2K4K4j%l0l0k9l0k4k4M9M8k8k8lmmnm
7691g0mO3O3L9L9j5j5j5j4k3k3L3L4J5J6rrl7l7l7l8L9L9kjl1l1l1l0L9M0jjk0k0o0j09l2
7679b56M9P3P3Q2Q2pqk4k5o6o5KKKKM1M2J8J8J3J3j0j1K5K6l1l1K5K6KJn2n3k8k9MLLMK8K9
7666hO9O9j6j6k0j9j1n9l7M4P2P3K0K1m5m5mnM9M9n6n6o4o4K5K5K7K8LMnnm5m5l5l4L5L6L7
7654hj1o8j9N3N3M6ll8J0k0k0J3J2J2J3QRRRQPm8m9j9j9J1N9M2M3j1j1PPj5j4o9k2L6j3j9
7642b9j8M6M6K7n3l6J4ppmmOPL0L1KJKJJ0J0M8M7pn7n0n0j5L3L0L0qqqqq3q4K4P2O2J2l4q4
7629f3rqj2j2QQl3l2rqJ7O7O5J7K2K3lmJ8J7K2k7n3n3K4P3O6j4m2m1p0p1J3J3J2J3POPPqq
7615e5J6J6L6L5m5m5l2l1ppl0k9J9J8J02J01j1j2%J%%J6J6J6J6opopjkjkJ1J0l8l8o8o9j5
$$ plain form
7703 -10 -12 -2 9 9 -39 -80 -72 -41 -9 25 10 -7 24 44 16 -23 -61 -39 -16 7 29 53 77 76 76 46 16 -13 -43 -67 -91 -42 6 -22 -50 -53 -57 -61 -66 -70
7691 -70 -74 -11 52 91 130 115 100 85 71 48 25 58 92 107 123 114 105 68 31 -6 -44 -5 34 32 31 0 -31 -62 -92 -53 -13 -14 -15 -35 -55 -115 -224 -256
7679 -256 -207 -134 -61 21 103 96 88 64 39 -27 -92 -90 -88 -86 -84 -43 -1 17 35 48 61 51 40 65 91 60 29 54 80 82 83 31 -22 -50 -79 -75 -72 -69 -65 -37 -8
7666 -8 61 130 114 98 78 59 48 -11 -48 -4 68 141 161 182 137 92 88 83 132 181 125 69 5 -59 -34 -9 18 46 49 53 48 43 -2 -47 -82 -116 -81 -45 -8
7654 -8 -19 -87 -106 -53 0 46 43 5 15 -5 -25 -12 0 12 25 33 42 51 60 68 75 27 -22 -41 -60 -49 10 52 95 84 73 80 87 72 58 -11 -33 3 -10 -29
7642 -29 -47 -1 45 72 19 -17 -3 -10 -17 -21 -25 -19 -12 18 49 51 52 54 55 65 75 123 170 163 106 56 6 -9 24 54 84 76 68 60 52 -31 -115 -91 -19 43 55 21 -63
7629 -63 -72 -80 -92 -104 -96 -88 -121 -153 -162 -170 -153 -86 -21 -4 18 41 38 34 52 69 91 64 11 -42 -18 55 121 107 65 24 -46 -117 -104 -91 -79 -66 -59 -53 -46 -39 -47 -55
7615 -55 -39 -23 13 48 3 -42 -74 -105 -112 -119 -149 -178 -159 -141 -39 62 51 39 39 40 40 40 56 72 88 104 98 91 85 78 77 75 74 72 83 93 55 17 -51 -120 -135
7603a35Q1N3m4o5o4llM5M6O0O0J1J1k5k6N6N6l4l4l4l4l5l5j0j0qpM1M1M2M1O6O6k8k8k8k8
7591E8rrrrk6k6jkl1l2J8J7j5j4RJ0J0J0L5L4k6k6N4N5k1k1K8K7j8j8o6o7k0k0k0k0N5N5O
7579d5OnmnnkkkkjjjjJ8J7l1l2J9J8l0l0rqJ6J6L3L4j5j5J1J1J1J1PPm2m2n2n2K8K9rj0J5
7566a46J4k2k3K6K6N9O0L5L5k7k7k7k7J6J6J6J6QPQPpqJ7J6m8m9L2L3j1j1j1j1mmM5M5P1P2
7553B17rj0M2M1J29J30J15K29M02P10L92n63o59l83k14j32j08n9j2j3n7n8l6l6J3J2k4k3l
7544C3kj3o2n5K6O0O0M0M1k1k1m6m5l6l6l6l6k1k1L5L6L1L1k6k6k4k4J%M1M1R7R8%%M1M1k8
7533A74k8k7k8N1N1J1J0p1p1l0l1K2K3j9j8K6K5JJm4m4mM4L7o0l5O1M4nj1j2J9K0K0J9j1j1
7521I9j1j1jj%jM0M0j7j7k7k8k7k7k2k1k1k1K5K5K6K5j%j%J5J4rj0m4m4k0k0K8K9K8K8J2J3
$$ plain form
7603 -135 -54 -1 -45 -110 -174 -177 -180 -135 -89 -29 31 42 53 28 2 58 114 80 46 12 -22 -57 -92 -102 -112 -120 -127 -86 -45 -3 38 104 170 142 114 86 58
7591 58 49 40 31 22 -4 -30 -31 -33 -64 -96 -78 -61 -76 -90 -81 -71 -61 -51 -16 18 -8 -34 20 75 54 33 61 88 70 52 -14 -81 -101 -121 -141 -161 -106 -51 -45
7579 -45 -39 -44 -48 -53 -58 -60 -62 -64 -66 -67 -68 -69 -70 -52 -35 -66 -98 -79 -61 -91 -121 -130 -138 -122 -106 -73 -39 -54 -69 -58 -47 -36 -25 -18 -11 -53 -95 -147 -199 -171 -142 -151 -161 -146
7566 -146 -132 -154 -177 -151 -125 -66 -6 29 64 37 10 -17 -44 -28 -12 4 20 28 35 43 50 43 35 52 68 20 -29 3 36 25 14 3 -8 -12 -16 29 74 145 217
7553 217 208 198 240 281 410 540 655 884 1286 1996 2388 1825 1166 783 569 437 329 270 258 245 188 130 94 58 71 83 59 36 33
7544 33 31 18 -44 -99 -73 -13 47 87 128 107 86 40 -5 -41 -77 -113 -149 -170 -191 -156 -120 -89 -58 -84 -110 -134 -158 -157 -157 -116 -75 22 120 120 120 161 202 174
7533 174 146 119 91 142 193 204 214 143 72 42 11 33 56 37 19 45 70 71 72 28 -16 -20 24 61 1 -34 27 71 66 55 43 62 82 102 121 110 99
7521 99 88 77 76 75 75 74 114 154 137 120 93 65 38 11 -11 -32 -53 -74 -49 -24 2 27 26 26 25 25 40 54 45 35 -9 -53 -73 -93 -65 -36 -8 20 32 45
7509D5l8l9j6Q0Q4j3rM0PPrrl0J9J07K05L31O22N65l08n72m11k51j53j05n5l0l0k7k7n6n6
7499a32M9M9K2K3o2o2n2K9N7N6M7M7j0j0%%%%m4m5K9K8MMMNm8m8QRL5L6no%jN7N6j2j1j2j2
7486H2n8n8L1L1j5j4j5j5K6K6m8m7O0N9N5N4Rp1j28m8J7J6l5l5K7K7O7O7L5L4noK9L0k7k7
7475A30p9p9poOPOOl6l6NMlmmlN9N8KLNNj9j9rrrrO2O2j0j1n3n4k9k9N8N7L3L4k4k4k4k4K5
7461A4K6JJpqM1M1k0j9k0j9k0k0K9K9J7J6pqj%K3K4o3o3l9l8M9M9o4o5JJJKj%%%k4k4k4k4
7447b13M8M9K5K5J3J3o8o8J7J6J7J7m2m2m2m2M3M3noL6L6J1J1L1L1L1L2m8m8k4k3j3j4L6L5
7436h2j3j3L6L6M5M5l5l6M4M5K1K0MNMNq1q0n7n6l3l3M7M8M9N0%JJ2J1J2J2JKm7m8k9l0k9
7424a47l0J4J5j0j0R3R4J3J2k1k0m5m5J9K0K0K0KLLKj3j3l7l7M0M1m1m1k1k1k2k1K6K6K5K6
$$ plain form
7509 45 7 -32 -48 32 116 103 94 134 141 148 139 130 100 119 226 431 762 1384 1949 1641 1069 658 407 254 149 94 64 34 7 -20 -76 -132
7499 -132 -83 -34 -12 11 -51 -113 -165 -136 -79 -23 24 71 61 51 51 51 51 51 7 -38 -9 19 23 27 31 36 -12 -60 -52 -43 -8 28 23 17 17 16 73 129 117 106 94 82
7486 82 24 -34 -3 28 13 -1 -16 -31 -5 21 -27 -74 -14 45 100 154 163 92 -36 -84 -67 -51 -86 -121 -94 -67 0 67 102 136 131 125 154 184 157 130
7475 130 51 -28 -35 -41 -35 -28 -22 -16 -52 -88 -83 -79 -82 -86 -90 -93 -34 24 26 29 34 39 20 1 -8 -17 -26 -35 27 89 79 68 15 -39 -68 -97 -39 18 51 85 61 37 13 -11 14
7461 14 40 41 42 35 27 68 109 89 70 50 31 11 -9 20 49 66 82 75 67 66 66 89 113 50 -13 -52 -90 -41 8 -56 -121 -120 -119 -118 -116 -117 -117 -117 -117 -141 -165 -189 -213
7447 -213 -165 -116 -91 -66 -53 -40 -108 -176 -159 -143 -126 -109 -151 -193 -235 -277 -234 -191 -196 -202 -166 -130 -119 -108 -77 -46 -15 17 -31 -79 -103 -126 -139 -153 -117 -82
7436 -82 -95 -108 -72 -36 9 54 19 -17 27 72 93 113 117 122 126 131 50 -30 -87 -143 -176 -209 -162 -114 -65 -15 -15 -14 -2 9 21 33 34 36 -11 -59 -88 -118 -147
7424 -147 -177 -163 -148 -158 -168 -75 19 32 44 23 3 -42 -87 -68 -48 -28 -8 -6 -3 0 2 -11 -24 -61 -98 -58 -17 -58 -99 -120 -141 -163 -184 -158 -132 -107 -81
7413h1j4j4J0J0O9O9K1K0q6q7K7K6M5M4K0K0l4l5l4l5J1J0J0J1kjjkJ8J8J8J7kkn1n1K3K3
7401Hjjm3m3NOk1k1K9K8J4J3J4J4LLLKl8l9l9l8K5K4k4k4L6L5O0O0L5L5p8p9ppM1M2JJJ%o
7388B9ppoo6o5j7j7P9P9kkp3p3k4k5k3k2K5K6N4N3NNl8l8M1Q8O2O2J9k9k7k8J0R%jK3K4KL
7375A08LKLKo8o7m3NL5L5J5J5m2m1M4M5M4M4k6k6M3M3l4q2q3l4J9J9k9J9L6L6l3l4J1J2J1
7363GJ2L2L3m1m0k1k2m5LO7J15N2o1j05n6j8j8k3k3%JK4K4J7O4M5l7m1m2ON5M9M8k3p2m7J
7352h0ppO3J6kkJ9K0K5K6l2l1l7l6J9K0j%KKm6KM5M4K0k8n3nN7N7J8l2o2j3J3J3k3k3k2k3
7339h4K8K7m5m5LKKKj7j8j7j7j3j2M4M4M0L9J6J6poopj2j3j2j3J6J5L9M0KKKKrqL3L2K3K2
7326A30l3l4j9k0L8L8K9L0o0n9m4m3J4J4L2L3qpm7m7RJ0N7N8L3L2J8J7k3k3m1m1l8l8L4Q3
$$ plain form
7413 -81 -95 -109 -99 -89 -20 49 70 90 4 -83 -56 -30 15 59 79 99 65 30 -4 -39 -28 -18 -8 3 1 0 -1 -3 15 33 51 68 66 64 13 -38 -15 8
7401 8 7 6 -37 -80 -75 -69 -90 -111 -82 -54 -40 -27 -13 1 4 7 10 12 -26 -65 -104 -142 -117 -93 -117 -141 -105 -70 -10 50 85 120 42 -37 -44 -51 -10 32 33 34 35 35 29
7388 29 22 15 9 -57 -122 -139 -156 -77 2 0 -2 -75 -148 -172 -197 -220 -242 -217 -191 -137 -84 -79 -74 -112 -150 -109 -21 41 103 122 93 66 38 48 57 57 56 79 103 105 108
7375 108 111 113 116 118 50 -17 -60 -55 -20 15 30 45 3 -38 6 51 95 139 113 87 130 173 139 57 -26 -60 -41 -22 -51 -32 4 40 7 -27 -16 -4 7
7363 7 19 51 84 43 3 -18 -40 -85 -82 -15 100 152 91 -14 -70 -88 -106 -129 -152 -152 -151 -127 -103 -86 -22 23 -14 -55 -97 -91 -36 13 61 38 -34 -81 -80
7352 -80 -87 -94 -31 -15 -17 -19 0 20 45 71 39 8 -29 -65 -46 -26 -27 -27 -25 -23 -69 -67 -22 22 42 14 -39 -44 13 70 88 56 -6 -19 -6 7 -16 -39 -61 -84
7339 -84 -56 -29 -74 -119 -116 -114 -112 -110 -127 -145 -162 -179 -192 -204 -160 -116 -76 -37 -21 -5 -12 -18 -24 -31 -43 -56 -68 -81 -65 -50 -11 29 31 33 35 37 28 20 53 85 108 130
7326 130 97 63 44 24 62 100 129 159 99 40 -4 -47 -33 -19 13 46 38 31 -16 -63 -54 -44 13 71 104 136 154 171 148 125 84 43 5 -33 1 84
7315H4K8n3m6m6OOj0j1j1j0NNO1O2kkj0n9r3j1O1O1j1j1j0j1L4L5poN3N3mmn7n7%%MLMMM8
7302G5M7rqo5o4k4k3J8J9nonmO5O5L4j4J3J3NNn4j03r1m2%%l4l4J0RJ4O2Q0jj4j4j7j6L8Q6
7289A1N6N6J2l6l4l3%%QN6K2o0l8J1RJ0k8k8K3K3N0KNMk3k3m6m6no%jK4K4l8l8PN6P6P7L3
7277A72L4nq7j09o0j6j7K7K7M9M8Om2o8k0j3j2j4o2o2j4qqJ9J9N3N4%jQN6Lm6o4j7P5P5L3
7265A3L2L3L2o3o2o0o0K0O9Q2Q2qrL2L2l4l4n8n8k8k8K9K9J9J8k2k2L9L9M0L9l1l1ppJ7J7
7253I1l9m0ooooj5j6j6j5J0J1M6M6J0p1p4k5mM4P7P7J9J9k2k2noo2o2L2L3k5k4k3k2k2k3J8
7241a24J8J8J8J4J3n9n9ppJ7J7K6K5K5K5k6k6k6k6K4K5K4K4J8J8J5J5L4j4l2M9L9M0MMo3o3
7230A7k2k2%%%jj4j4j4j4j7j6QRN9N9KLk7k8J4J3j8j8K3K3L5L6L5L5QPNMj1o0o0j2J7J7n8
$$ plain form
7315 84 112 59 13 -33 -27 -21 -31 -42 -53 -63 -58 -53 8 70 68 66 56 -3 -96 -107 -46 15 4 -7 -17 -28 6 41 34 28 81 134 130 126 69 12 12 12 16 19 23 27 75
7302 75 122 113 105 40 -24 -48 -71 -53 -34 -39 -45 -50 -54 11 76 110 96 109 122 127 132 78 -25 -116 -158 -158 -158 -192 -226 -216 -207 -193 -131 -51 -52 -66 -80 -97 -113 -75 11
7289 11 67 123 135 99 65 32 32 32 40 96 118 58 20 31 40 50 22 -6 17 40 90 92 97 101 78 55 9 -37 -42 -48 -48 -49 -25 -1 -39 -77 -70 -14 62 139 172
7277 172 206 201 114 5 -55 -71 -88 -61 -34 15 63 69 27 -41 -61 -74 -86 -100 -162 -224 -238 -246 -254 -235 -216 -163 -109 -109 -110 -102 -46 -43 -89 -153 -170 -95 -20 13
7265 13 45 78 110 47 -15 -75 -135 -115 -46 36 118 110 101 133 165 131 97 39 -19 -47 -75 -46 -17 2 20 -2 -24 15 54 94 133 102 71 64 57 74 91
7253 91 52 12 6 0 -6 -12 -27 -43 -59 -74 -64 -53 -7 39 49 -22 -96 -121 -125 -81 -4 73 92 111 89 67 62 56 -6 -68 -36 -3 -28 -52 -75 -97 -119 -142 -124
7241 -124 -106 -88 -70 -56 -43 -102 -161 -168 -175 -158 -141 -115 -90 -65 -40 -66 -92 -118 -144 -120 -95 -71 -47 -29 -11 4 19 53 39 7 56 95 135 139 143 80 17
7230 17 -5 -27 -27 -27 -27 -28 -42 -56 -70 -84 -101 -117 -109 -100 -41 18 20 23 -4 -32 -18 -5 -23 -41 -18 5 40 76 111 146 154 161 166 170 159 99 39 27 44 61 3
7217Cn8m3NK7K6M7M7J4o7r0m2k2k3k5K3M5M5N2N2K7K8opooOOL3j5k3k3k6k7mnM1M1L2j6j4
7205E2j3j3j3J7l1j9K9K4K3J3J3l6l5k1k1lM6K0k8k4K3KJNMn4n4K4K4K8k0l9l9n0kN2N2L9
7193b4L8M1pl8l9J1J0J5O4M0rk3k3k6k5j4j4pn6n4mJ3J4JKKKK2K2K0J9jn0k2k3ooM3M3K1K1
7180gK2K1qpqpk3k3k4k3O2O2L7L8K1K0k7k8M1M2qpl1l1n5n6J6J6l3l3n7n6k5N7P8L0J4J4L
7168A7Mm5m5j9j9j4j3KQ3M0qj2j3L3L3PQPPl4l5l1N0L6L7M1M2j2j2o1o0ppJ7J8M8M8P2P2Q4
7156C59Q3J46J95K89M35N99R71J511J754M84j346j694j193p19m44l48k67j82j82r7r6j16j15
7148B7j03k2P8P8opopM8M8J7o3lP8P1m4n4nj3o2n1n2J8J8j7j7PQL7L8llL0K9NOm1m1L2L1L4
7136A18L4l9l9k2k2L4L4K1K0K0K0n7n7n7n8PQM7M8k7k7k6k7j8j7j8j7k2k3N1R9N5k6mM4J4
$$ plain form
7217 3 -55 -98 -93 -66 -40 7 54 68 1 -89 -131 -153 -176 -201 -178 -133 -88 -36 16 43 71 65 58 52 46 52 58 91 76 53 30 4 -23 -27 -32 9 50 82 66 52
7205 52 39 26 13 30 -1 -20 9 33 56 69 82 46 11 -10 -31 -34 12 32 4 -20 3 5 6 11 15 -39 -93 -69 -45 -17 -37 -76 -115 -165 -167 -115 -63 -24
7193 -24 14 55 48 10 -29 -18 -8 7 71 111 102 79 56 30 5 -9 -23 -30 -86 -140 -144 -131 -117 -116 -114 -112 -110 -88 -66 -46 -27 -28 -78 -100 -123 -129 -135 -92 -49 -28 -7
7180 -7 15 36 28 21 13 6 -17 -40 -64 -87 -25 37 74 112 133 153 126 98 139 181 173 166 135 104 49 -7 9 25 -8 -41 -98 -154 -179 -122 -44 -14 0 14 17
7168 17 21 -24 -69 -88 -107 -121 -134 -132 -49 -9 -17 -29 -42 -9 24 31 39 46 53 19 -16 -47 3 39 76 117 159 147 135 74 14 7 0 17 35 83 131 203 275 359
7156 359 442 588 783 1072 1507 2106 3077 4588 6342 6826 5480 3786 2593 1874 1430 1082 815 633 451 354 258 142 27
7148 27 -76 -98 -20 58 52 45 39 32 80 128 145 82 79 157 228 184 130 125 112 50 -1 -53 -35 -17 -34 -51 -44 -36 1 39 36 33 63 92 97 103 62 21 53 84 118
7136 118 152 113 74 52 30 64 98 119 139 159 179 122 65 8 -50 -43 -35 12 60 33 6 -20 -47 -65 -82 -100 -117 -139 -162 -111 -12 43 17 13 57 71
7125G1J4J7J7j3j3q6q7NNJ3R4M9Jk4k3K6K5l1l1k5k5J5J5kjjkRRQR%jm1m1p0o9L8L9NN4L2
7112a6m9NMjjK7K7j3j3mmK0K0ooookjl7l7mP8L5j4n5n6J5J4N3N2l0l1l3O5N0N1MNk0k0rj0
7098D1rj0J%JJl0l0l0k9MMMMNNM6M6llm4m3KLKLM7M7l6l6o2L5P5k1k1k1klK8K7N2N2r1r1j6
7084i6j5O6J15M3n3j21k4N3N4%Jm0m0m5m5nmO2O3O3O2j1j1n2n2J9J9k2k2l0k9J1J2QQQQJ4
7072b8J4J3J4PQPQk9k8Nm4o7L1M0qK7K6K3K3K4K4m8m9K8K9K8K8klkljkjjjkjjJ1J0J1J1n2
7059G7n2n2n2k9k9k8k9lklkL4L5L4L4K8K7k1k1kjjjK4K5K4K5jkk5k5%%m3m3m6L5L7L8J3J2
7046a1J3J2mlmmrrj2j2n3j02m3L8N4Nj1j1jkjjJJK6K5M7M6kkL9L9m2m2o1o2K0J9QRN7N7nn
7032BnmOPN6N5llJ6J6J1o9n2kk5k5k2k2K1K1K2K1K8K7k1k1o6o6j7j8OO%M9L5j4j1L8J6J6K0
$$ plain form
7125 71 85 102 119 106 93 7 -80 -75 -70 -57 37 86 87 63 40 66 91 60 29 4 -21 -6 9 7 6 5 3 12 21 29 38 38 37 -4 -45 -115 -184 -146 -107 -102 -48 -16
7112 -16 -65 -60 -56 -57 -58 -31 -4 -17 -30 -34 -38 -18 2 -4 -10 -16 -22 -24 -25 -62 -99 -103 -25 10 -4 -59 -115 -100 -86 -33 19 -11 -42 -75 -10 40 91 95 100 80 60 51 41
7098 41 32 22 23 23 24 25 -5 -35 -65 -94 -90 -86 -82 -78 -73 -68 -22 24 21 18 -26 -69 -67 -64 -62 -59 -12 35 -1 -37 -99 -64 11 -10 -31 -52 -54 -57 -29 -2 50 102 11 -80 -96
7084 -96 -111 -45 70 113 60 -61 -85 -32 22 22 23 -17 -57 -102 -147 -152 -156 -94 -31 32 94 83 72 20 -32 -13 6 -16 -38 -68 -97 -86 -74 -66 -58 -50 -42 -28
7072 -28 -14 -1 13 20 28 35 43 14 -14 -9 -53 -120 -89 -49 -57 -30 -4 19 42 66 90 42 -7 21 50 78 106 104 101 99 96 95 93 92 91 90 88 87 86 97 107 118 129 77
7059 77 25 -27 -79 -108 -137 -165 -194 -197 -199 -202 -204 -170 -135 -101 -67 -39 -12 -33 -54 -56 -57 -58 -59 -35 -10 14 39 38 36 11 -14 -14 -14 -57 -100 -146 -111 -74 -36 -23 -11
7046 -11 2 14 10 7 3 -1 -10 -19 -31 -43 -96 -198 -241 -203 -149 -144 -155 -166 -167 -169 -170 -171 -170 -169 -143 -118 -71 -25 -27 -29 10 49 7 -35 -96 -158 -138 -119 -111 -102 -45 12 7 2
7032 2 -3 -7 -1 6 62 117 114 111 127 143 154 85 33 31 6 -19 -41 -63 -42 -21 1 22 50 77 56 35 -31 -97 -114 -132 -126 -120 -120 -71 -36 -50 -61 -23 -7 9 29
7020B9J9J9K0J6J6l1q0q0l1K1K2K1K2Rm0m3OL4j6j5L3O7J9o5o4l3l3J6J6K8K8MMl0l0l0l0
7008a82K7K8K7K7L6L6J2J2k9k9N2N1NNp3p3p5k6K5K4J5l3J2O1Q3L4k1p0k2k2K4K3J8J7ppl9
6997e4l9J2O0L5j4J7J6K1K1o1o0l3l3J2J2M0rl3J6mmK4K4KJK7K6m3m3M0Q8N1Km8m9m9m9j4
6985i2O7JKM9M9M1n7q2q3%jj%M0M1pqk2k2K7K7%JJJj7j8j7j7J9J9k9k9ooM3M2P0O9m4m4k3
6972a6k3K6K6k2k2k2k2J6J5J6J6L2L2L2L1j7j8j7j8J1J2l7l7mmmlj5j4j4j5K0K0K0K0K6K6
6960E3K6K6J4J5l4l4k8k8k8k8m0m0QRjkjjklM7M6kjn0n1J8J7l1l1lmmlN6N6N6N6j2j2j2j1
6947Fjj%jM7M7N4m4k1k1k6k7m4m4m3m4LMN2N3RJ0RJ0L2L2m4m5j8O3M4mm9n0mmM1M2L9m3nm
6934A0j0j0kjjjl6l6l5l6K1K1k5N7N0N1k6k6qrrrL3L2L3L3%JJJJKm7m6ppopK2K1K2K2J1J2
$$ plain form
7020 29 48 67 87 103 119 88 8 -72 -103 -82 -60 -39 -17 -8 -48 -91 -85 -51 -67 -82 -49 18 37 -28 -92 -125 -158 -142 -126 -98 -70 -66 -62 -92 -122 -152 -182
7008 -182 -155 -127 -100 -73 -37 -1 11 23 -6 -35 17 68 73 78 5 -68 -143 -169 -144 -120 -105 -138 -126 -65 18 52 31 -39 -61 -83 -59 -36 -18 -1 -8 -15 -54
6997 -54 -93 -81 -21 14 0 17 33 54 75 14 -46 -79 -112 -100 -88 -48 -57 -90 -74 -78 -82 -58 -34 -32 -31 -4 22 -21 -64 -24 64 115 117 69 20 -29 -78 -92
6985 -92 -25 -24 -22 27 76 117 60 -22 -105 -105 -106 -107 -107 -67 -26 -33 -41 -63 -85 -58 -31 -31 -30 -29 -28 -45 -63 -80 -97 -78 -59 -88 -117 -123 -129 -86 -44 26 95 51 7 -16
6972 -16 -39 -13 13 -9 -31 -53 -75 -59 -44 -28 -12 20 52 84 115 98 80 63 45 56 68 31 -6 -10 -14 -18 -21 -36 -50 -64 -79 -59 -39 -19 1 27 53
6960 53 79 105 119 134 100 66 38 10 -18 -46 -86 -126 -118 -109 -110 -112 -113 -114 -116 -119 -72 -26 -28 -29 -79 -130 -112 -95 -126 -157 -160 -164 -168 -171 -115 -59 -3 53 41 29 17 6
6947 6 5 4 4 3 50 97 151 107 86 65 39 12 -32 -76 -119 -163 -160 -156 -104 -51 -42 -32 -23 -13 19 51 7 -38 -56 7 51 47 -2 -52 -56 -60 -19 23 62 19 14 10
6934 10 0 -10 -12 -13 -14 -15 -51 -87 -122 -158 -137 -116 -141 -84 -34 17 -9 -35 -43 -52 -61 -70 -37 -5 28 61 61 62 63 64 65 67 20 -26 -33 -40 -46 -53 -31 -10 12 34 45 57
6921E7l7l7j2j3j3j2N0N0KKk5k4k5k5J8J7l1l1m9m9jjJ4J3J4J4L8L9L9L9J3J3J3J3QQQQL2
6909A37L2m8m9n1n0n1n1k3k3K6K5JKM9N0j4j3j4j4LLk1k2L2L2L1L2RRL3L4j2j2l6l6%jj%K4
6896B2K5K4K5l0l0p1p0k8k7R4R4L3L2m0m1J2J2m5m5n0n0L8L9K8K7j3j3j2j1j2j1kkK2K2J2
6885d2J2m4m5L3L2L3L2L1L0OOl4l4l4l5K3K2K2K3mlm4m4J7J6J7J7l5l6j1j1j6j6j6j6K8K9
6874i1k4k3P8J58J04ro1o1j1j1k6k6k6k6j6j7RQJ5J6Qm1j1P0M6M6m6m5qqN5Ol7l7J1N9MMn
6862C1n4p2RO9O9J2l6o6o6n6pN4N4Q1L3m0q7o9J3L4L5PN6L9m3l4l4j9j9n6n6j5L4O2O3P8P8
6850H2K1K2l0k9j9K9J7l2kjl6l6j2j1j8j7k5N5M2pj5j6O0O0J4l4l8l7%%M1M2kkj3o2j0j0J
6838b8JJ%j2j2J2J2L3L2QQNNNNk7k7K9L0LMK5K4M3nj9j9o5o5NN4pj21o2N2O6O5J1l8l7l7m0
$$ plain form
6921 57 20 -17 -29 -42 -55 -67 -17 33 35 37 12 -12 -37 -62 -44 -27 -58 -89 -138 -187 -188 -189 -175 -162 -148 -134 -96 -57 -18 21 34 47 60 73 81 89 97 105 137
6909 137 169 121 72 21 -29 -80 -131 -154 -177 -151 -126 -125 -123 -74 -24 -38 -51 -65 -79 -76 -73 -94 -116 -84 -52 -21 11 20 29 62 96 84 72 36 0 0 -1 -2 -2 22
6896 22 47 71 96 66 36 -35 -105 -133 -160 -66 28 61 93 53 12 24 36 -9 -54 -104 -154 -116 -77 -49 -22 -35 -48 -60 -71 -83 -94 -96 -98 -76 -54 -42
6885 -42 -30 -74 -119 -86 -54 -21 11 42 72 78 84 50 16 -18 -53 -30 -8 14 37 33 30 -14 -58 -41 -25 -8 9 -26 -62 -73 -84 -100 -116 -132 -148 -120 -91
6874 -91 -115 -138 -60 98 202 193 132 71 60 49 23 -3 -29 -55 -71 -88 -79 -71 -56 -40 -32 -73 -84 -14 32 78 32 -13 -21 -29 26 32 -5 -42 -31 28 32 36 31
6862 31 -23 -95 -86 -17 52 64 28 -38 -104 -160 -167 -113 -59 22 55 15 -72 -141 -128 -94 -59 -52 4 43 0 -34 -68 -87 -106 -162 -218 -233 -199 -137 -74 4 82
6850 82 103 125 95 66 47 76 93 61 59 58 22 -14 -26 -37 -55 -72 -97 -42 0 -7 -22 -38 22 82 96 62 24 -13 -13 -13 28 70 68 66 53 -9 -19 -29 -28
6838 -28 -27 -26 -26 -38 -50 -38 -26 7 39 47 55 60 65 70 75 48 21 50 80 83 87 112 136 179 174 155 136 71 6 11 65 58 -63 -125 -73 -7 58 69 31 -6 -43 -83
6825h3m0k2k3N9N8k1k0k1k0kkM7M6k0k0K9K8qrrqLMLMO4O3J6J5n7n6qqL8L9j0j0R0R0k4k3
6812A72m1m1m1m1k8k8N3N3kln1n1L1L1PPQPQPJ8J8o3o3l0l0J8J8j3j3KN0N7m1n9j0QQj4j3
6800i5lmK1K1j0rL9L9K6K7K6K7JJm7m7pqn5n6K7K7N1N1l5l6J2J3PPQPK6K7K6K7n1n0m4m5r
6787f7Q7R1ok9J9L8j1j1j1o2o3J2J1j2j3m9m9%%N8N8k3k3kln1n1l4l5P2P3O6l0k4k5ppppN2
6775g5N2k9k9J4J4J3J4mnn3n3J1J1N9N9j8j8L1L0K5K5n6n6m5m6k1k1J5J5M0M0K8K9K9K8J4
6764F7J3o7o8N0N0K6K5n5n4l1l0l1l1opK0J9K0J9j7j8PPj9k0L0L0P6P6N1m8p0p0p0p1q2J6
6752b63P4P3J8J8ponnnnN1N2l0l0N4N4N4N4j2j2o1o0k8k8N4N3rqrrK3K3J9o1n3n3j0j0J4J4
6740g7l6l5mnM4M4l7l8M4M4K2K2k6k6j3j2j3j3K6K5K6K6k5k5K4K4L0L0j9j8J%JJJ0RL4L4M
$$ plain form
6825 -83 -123 -145 -168 -109 -51 -72 -92 -113 -133 -135 -137 -90 -44 -64 -84 -55 -27 -35 -44 -53 -61 -58 -54 -51 -47 17 80 96 111 54 -2 -10 -18 20 59 49 39 129 219 195 172
6812 172 131 90 49 8 -20 -48 5 58 56 53 2 -49 -18 13 20 27 35 42 50 57 75 93 30 -33 -63 -93 -75 -57 -70 -83 -81 -31 26 -15 -74 -84 -76 -68 -82 -95
6800 -95 -98 -102 -81 -60 -70 -79 -40 -1 25 52 78 105 106 107 60 13 6 -2 -57 -113 -86 -59 -8 43 8 -28 -16 -3 4 11 19 26 52 79 105 132 81 31 -13 -58 -67
6787 -67 20 111 105 76 95 133 122 111 100 38 -25 -13 -2 -14 -27 -76 -125 -125 -125 -67 -9 -32 -55 -57 -60 -111 -162 -196 -231 -159 -86 -20 -50 -74 -99 -106 -113 -120 -127 -75
6775 -75 -23 -52 -81 -67 -53 -40 -26 -30 -35 -88 -141 -130 -119 -60 -1 -19 -37 -6 24 49 74 18 -38 -83 -129 -150 -171 -156 -141 -101 -61 -33 -4 25 53 67
6764 67 80 13 -55 -5 45 71 96 41 -13 -44 -74 -105 -136 -142 -149 -129 -110 -90 -71 -88 -106 -99 -92 -111 -131 -101 -71 5 81 132 84 14 -56 -126 -197 -279 -263
6752 -263 -189 -116 -98 -80 -87 -93 -98 -103 -108 -113 -62 -10 -40 -70 -16 38 92 146 134 122 61 1 -27 -55 -1 52 43 35 26 17 40 63 82 21 -32 -85 -95 -105 -91 -77
6740 -77 -113 -148 -152 -157 -113 -69 -106 -144 -100 -56 -34 -12 -38 -64 -77 -89 -102 -115 -89 -64 -38 -12 -37 -62 -38 -14 16 46 27 9 10 10 11 12 22 31 65 99 103
6728A03Mp6p7j5j6L3L2j6j6m0m0k3k4Q5Q5L6m4p5k7O9O8K3K3l0k9n4n3n7n6pqJ8J9J8J9K2
6716a26K2lkL4L3j5j5m4m5L6L6QPNMJ2l7n5K5K6K6L0L1M7M6kkqpl2l2k5k4j%K6K6jM7L9L9
6704A29K0k8q3q4K7K6j0rj0j0j7j7j7j7L0K9K5K4j3r5p6k8j1j1M0M1K0J9M5M4MMMMK9K8k0
6692C6k1k7k8llKKK4K3Lm6NOQQL6j3l4l3rrl1J7L5L5J0l8o3j5K3K4K6K6P9P9on6m1m1m4m5
6679i9LKk5K3PQJ0J0jjjjj2j2L4L4O1J3rn7o7J4M1qLKk8K1L1L1j1j1m4OKLk7k6k7k6L3L4K9
6666c8K8L3m8klJ3J2l6l6ooJ2O1M4nn0jJ0J1L5L5L1j7l8l8K7K7Om3mnJ7J6J7J7J4J4Jm8m4
6654A3m5o6o6J7O6O2J4nnPPPOL7L7j1j1l0l0k7k7l5J3j0j1j3L5PQrrrrKKk2k3M5M5mlK5K6
6640AN2Mn1n2mM5L7j2k6k7PN6L1j7m6m7LKn5oM8M8M5M6K1K2n9n8nM4J7J6l1J7M2M2l2l3j9
$$ plain form
6728 103 107 31 -46 -61 -77 -44 -12 -28 -44 -84 -124 -147 -171 -86 -1 35 -9 -84 -111 -42 26 49 72 42 13 -41 -94 -151 -207 -214 -222 -204 -185 -167 -148 -126
6716 -126 -104 -107 -109 -75 -42 -57 -72 -116 -161 -125 -89 -81 -74 -69 -65 -53 -90 -145 -120 -94 -68 -38 -7 40 86 84 82 74 67 35 3 -22 -46 -47 -47 -21 5 4 51 90 129
6704 129 149 121 38 -46 -19 7 -3 -12 -22 -32 -49 -66 -83 -100 -70 -41 -16 8 -5 -100 -176 -204 -215 -226 -186 -145 -125 -106 -61 -17 -13 -9 -5 -1 28 56 36
6692 36 15 -12 -40 -43 -46 -44 -42 -18 5 8 -38 -33 -27 -19 -11 25 12 -22 -55 -64 -73 -104 -87 -52 -17 -7 -45 -108 -123 -100 -76 -50 -24 55 134 128 72 31 -10 -54 -99
6679 -99 -96 -94 -119 -96 -89 -81 -71 -61 -62 -63 -64 -65 -77 -89 -55 -21 40 53 44 -13 -80 -66 -25 -33 -30 -28 -56 -35 -4 27 16 5 -39 -33 -31 -28 -55 -81 -108 -134 -101 -67 -38
6666 -38 -10 23 -25 -27 -30 -17 -5 -41 -77 -83 -89 -77 -16 28 23 -27 -28 -18 -7 28 63 94 77 39 1 28 55 61 18 14 9 26 42 59 76 90 104 105 57 13
6654 13 -32 -98 -164 -147 -81 -19 -5 -10 -15 -8 -1 6 12 49 86 75 64 34 4 -23 -50 -85 -72 -82 -93 -106 -71 -64 -56 -65 -74 -83 -92 -90 -88 -110 -133 -88 -43 -47 -50 -25 1
6640 1 53 57 6 -46 -50 -5 32 20 -6 -33 -26 30 61 44 -2 -49 -46 -44 -99 -105 -57 -9 36 82 103 125 66 8 3 47 64 80 49 66 108 150 118 85 66
6628F6K9Nm4q1q0l0J8N2N3OPk0j9k0j9j6j5j6j6P4P3K5K5m0m1QQj1j0P0P1o5o5j6j6M6M6l
6617C9l%%k4k4k6k5kjmlK1K1LKLLmmmmj7j7j7j6J0J1L5L5O4O4J6J5j9j9o7o7NON4N4nmn3n3
6603b1j7j7QPMMK8K8N9N8k2k3lln2n1n1n1kkk3k2k3k3L0L0k3k4K4n8l9RO1O1J5J5J6J5k8k9
6590a35n1K9O5O5J4J5l4l4NOK9L0j3j2l2l2o8J2M9M8K3K3K0o1o2o1J4J5K0K0M4M4k6k6k7k6
6579a10O0O0J1J2k4k5k4k4mmnmOOON%j%jJJJJm3m3j8j8O8O9K0K0J2J2j5j6n0r9o8J2J2J2J7
6566a72J7J7J6J7J7K3K2k6k6QPPQj5j4j5j4RRRQK3K3k6k6k6k5k6N5R9M9o3j12p1RP4P4K4K3
6554a0K3K3K7K7k1k2k2k2k3k2L3L3j5j5L7L7j2j1l7l7l7l6Q8Q8M0L9k3k3JJK2K3lkOOm2m3
6542G6m2m2m2m2n4n4K7K8OOj8j8o0o0j2j1P9P8L1L0j1j2n9o0N1N2N1N2L3L3j5j5KKKKJ1J0
$$ plain form
6628 66 95 100 56 -25 -105 -135 -117 -65 -12 -6 1 -19 -38 -58 -77 -93 -108 -124 -140 -66 7 32 57 17 -24 -16 -8 -19 -29 41 112 47 -18 -34 -50 -4 42 39
6617 39 36 36 36 12 -12 -38 -63 -65 -66 -70 -73 -52 -31 -28 -26 -23 -20 -24 -28 -32 -36 -53 -70 -87 -103 -93 -82 -47 -12 52 116 132 147 128 109 42 -25 -20 -14 40 94 89 85 32 -21
6603 -21 -38 -55 -47 -40 -36 -32 -4 24 83 141 119 96 93 90 38 -13 -64 -115 -117 -119 -142 -164 -187 -210 -180 -150 -173 -197 -173 -231 -270 -261 -200 -139 -124 -109 -93 -78 -106 -135
6590 -135 -186 -157 -92 -27 -13 2 -32 -66 -61 -55 -26 4 -9 -21 -53 -85 -153 -141 -92 -44 -21 2 22 -39 -101 -162 -148 -133 -113 -93 -49 -5 -31 -57 -84 -110
6579 -110 -50 10 21 33 9 -16 -40 -64 -68 -72 -77 -81 -75 -69 -63 -58 -58 -59 -59 -60 -59 -58 -57 -56 -99 -142 -160 -178 -110 -41 -21 -1 11 23 8 -8 -58 -157 -225 -213 -201 -189 -172
6566 -172 -155 -138 -122 -105 -88 -65 -43 -69 -95 -87 -80 -73 -65 -80 -94 -109 -123 -114 -105 -96 -88 -65 -42 -68 -94 -120 -145 -171 -116 -17 32 -31 -143 -214 -205 -131 -57 -33 -10
6554 -10 13 36 63 90 69 47 25 3 -20 -42 -9 24 9 -6 31 68 56 45 8 -29 -66 -102 -14 74 114 153 130 107 108 109 131 154 151 149 155 161 119 76
6542 76 34 -8 -50 -92 -146 -200 -173 -145 -139 -133 -151 -169 -229 -289 -301 -312 -233 -155 -124 -94 -105 -117 -176 -236 -185 -133 -82 -30 3 36 21 6 8 10 12 14 25 35
6530C5J1J1k5k5jjL7L6j3j2J3J4l6l5%jk4k5k9k9K0K0K9K9NNJ1J0j3j4p1p0M2M3N4N3k7k7
6518@K6K6KKk1k1MLL3L3m8m9p5p5OON3N3K9K9N2N1LMk5k5k4k5mmn2n3L0L0L0L0o6o7k1K7R1
6506bR0M8%l4l3MMpqL0L0Om3j5j5j8j8POK7K8j3j3j4j4l5l6n1kK7K7K6K7J6l2l8J0Qm1q9q9
6493b39o2j4M4M4M6M7RJ0RRK9K9j4j5j6o5l5l5j5L4P4K5lkj2L7N5Pmmnmkk%M8M9%MM%Jj2j2
6479D2l9RklJ%J9J8k3k2J7J7k3k3mlmlk0k0j9k0M4M4L5m5n5pL7Q4O2J3j3j3RRm7m8J9J9M3
6466H5M3o0o1mmj0j0j1j0%jj%k1k1j6j6j5O5O8j3k1K8K2k6m7m8k6k6klP0P1N1N1l8l8k9k8
6454e2M4M4j5j6j5j5M5M5o0o0k7k8k8k7j8j7L9L9K7K8KLnoonnmnnJ0J0N0N0RQk3K5M8l2o7
6442a5j9k0j9QQk0j9j4O8P8lQPl4l4l4l4J6J6J5J6NOl6l5K2K2K2K2J2J2QRl8q7j07k7J3l6
$$ plain form
6530 35 46 57 32 7 6 5 42 78 65 53 66 80 44 9 9 8 -16 -41 -70 -99 -79 -59 -30 -1 4 9 20 30 17 3 -68 -138 -96 -53 1 54 27 0
6518 0 26 52 54 56 35 14 18 21 54 87 39 -10 -85 -160 -154 -148 -95 -42 -13 16 68 119 122 126 101 76 52 27 23 19 -33 -86 -56 -26 4 34 -32 -99 -120 -93 -2
6506 -2 88 136 136 102 69 73 77 70 62 92 122 128 85 70 55 37 19 26 32 59 87 74 61 47 33 -2 -38 -89 -91 -64 -37 -11 16 32 0 -38 -28 -20 -61 -150 -239
6493 -239 -301 -315 -271 -227 -181 -134 -125 -115 -106 -97 -68 -39 -53 -68 -84 -149 -184 -219 -234 -200 -126 -101 -104 -106 -118 -81 -26 -19 -23 -27 -32 -36 -38 -40 -40 8 57 57 61 65 65 66 54 42
6479 42 3 12 10 7 8 8 27 45 22 0 17 34 11 -12 -16 -19 -23 -26 -46 -66 -85 -105 -61 -17 18 -27 -82 -89 -52 32 94 107 94 81 90 99 52 4 23 42 85
6466 85 128 68 7 3 -1 -11 -21 -32 -42 -42 -43 -44 -44 -65 -86 -102 -118 -133 -68 0 -13 -34 -6 16 -10 -57 -105 -131 -157 -159 -162 -92 -21 30 81 43 5 -24 -52
6454 -52 -8 36 21 5 -10 -25 20 65 5 -55 -82 -110 -138 -165 -183 -200 -161 -122 -95 -67 -65 -62 -67 -73 -79 -84 -89 -93 -98 -103 -93 -83 -33 17 26 34 11 36 84 52 -15
6442 -15 -34 -54 -73 -65 -57 -77 -96 -110 -42 36 33 41 48 14 -20 -54 -88 -72 -56 -41 -25 -20 -14 -50 -85 -63 -41 -19 3 15 27 35 44 6 -81 -188 -215 -202 -238
6430b38m8L2Q8Q8j1j2LLN1N2J6J6qql3l3J5J5qpM1M1k9k8K0K0l2l2qqkjkkNNm4m4K9K8K9K8
6416a3k8k8lmj6j6L2L2M8M8jjk9k9k9k9j7j8L1L0L3L2m8m9M2M1O5O6k1k0k0k0j%j%j8j9j8
6404Dj9mmmn%%%%l5l4J4J4jjM8M8l4l5rj0K4K4%%RJ0j5j5J9J9o2o2j7j6O5O5N2N2o1o2l8l8
6391a14J1J0K3K3K2K3MMm5m5k2k3JKm9m9NN4Q4Q4L3j5j7j6NNJ6J5L7L7P3K4o1o2jkkjJJJK
6378G6qql8J0M2pn7n8JJK8k0KKkjOOONj3j3j4j3j5j4ON6j1j0n3n4nM3J6J6RJ0J0Rppopppm
6363i9mLN2O9j1pqj0rk9J9M4mn5n5N6N5M6M6K5k4n2n2poJ2J3J3J3m7m7m4m4j1L7L8j1jjM5
6351e2M5L9L9o9o9j4O7M3l9l4l3RJ0N1N1KKK3K3K3K3ppn6n6j9k0j9k0K0K0k8k9K5K6k4k3m2
6339a19m2P1P2K3K3kjn3n4K8K7kkq3q2K5K5k3k3LMLM%%J%OOOOj9j8L0L0O4O4J5J5o4o3M9N0
$$ plain form
6430 -238 -286 -254 -166 -78 -89 -101 -98 -95 -44 8 24 40 32 24 -9 -42 -27 -12 -20 -27 14 55 26 -2 18 38 6 -26 -34 -42 -44 -45 -47 -49 -44 -39 -83 -127 -98 -70 -41 -13
6416 -13 -41 -69 -72 -76 -92 -108 -76 -44 4 52 51 50 21 -8 -37 -66 -83 -101 -70 -40 -7 25 -23 -72 -30 11 76 142 121 101 81 61 60 60 59 59 41 22 4
6404 4 -15 -19 -23 -27 -32 -32 -32 -32 -32 -67 -101 -87 -73 -74 -75 -27 21 -13 -48 -57 -67 -43 -19 -19 -19 -10 0 -15 -30 -11 8 -54 -116 -133 -149 -84 -19 33 85 24 -38 -76 -114
6391 -114 -103 -93 -70 -47 -25 -2 2 6 -39 -84 -106 -129 -128 -126 -175 -224 -219 -165 -81 3 36 21 4 -12 -7 -2 14 29 66 103 176 200 139 77 76 74 72 71 72 73 74 76
6378 76 68 60 22 32 74 67 10 -48 -47 -46 -18 -38 -36 -34 -36 -37 -31 -25 -19 -14 -27 -40 -54 -67 -82 -96 -90 -34 -45 -55 -108 -162 -167 -124 -108 -92 -83 -73 -63 -54 -61 -68 -74 -81 -88 -95 -99
6363 -99 -103 -100 -48 21 10 3 -5 -15 -24 -53 -34 10 6 -49 -104 -48 7 53 99 124 100 48 -4 -11 -17 -5 8 21 34 -13 -60 -104 -148 -159 -122 -84 -95 -96 -97 -52
6351 -52 -7 32 71 2 -67 -81 -14 29 -10 -44 -77 -68 -58 -7 44 46 48 71 94 117 140 133 126 70 14 -5 -25 -44 -64 -44 -24 -52 -81 -56 -30 -54 -77 -119
6339 -119 -161 -90 -18 5 28 26 25 -28 -82 -54 -27 -29 -31 -114 -196 -171 -146 -169 -192 -189 -185 -182 -178 -178 -178 -177 -177 -171 -165 -159 -153 -172 -190 -160 -130 -66 -2 13 28 -36 -99 -50 0
6326@M0L9rrrrrrj5j4j5j5L7L7L7L7L1L0j8j8l8l7J1J1N0N0l2l1k3k2k3k3LLk1k2K9K9k0k0
6314A3m3m3ONNMK8K9K7K7K8K7n2n3n2n3NOK9K9K0K0k9k8p4p3L9M0J3J3l2l3K6P4P1j0n5oJ0
6301d2J1jjK3K4M8M7j%rqJ6J7l1l1ppllK0K1J8J8l1l0LLMLl8l8l8l8llllJ0J0J0J0o6o7j8
6288b04j8J1J0J0J1L8L8j0j1L4L5L4L4M7M8J5o6n9j0L6j2m5Lk6k7J8J8J7J8K9K9K9K9l7l6
6277C0j2j2l3l2J6J6K4K4n4n4jM7M4l7o1j2MMJ0RJ0J0KLKLMMMNm7m6p1p0j5j5K6K6K6K5JK
6264a91J6J6J6J6QQRQLLMLl9m0O6O6J2J1j2j3N3N3j9k0p9p9opJ0J0m6m7J6J7P3P3mlmln2n2
6251a46k8k7L2L2rqqqqqRRL3L3m1m0%jL5L4J0J0L4L3m0l9o4o4RRO9O9mml6l6MNMNNMRJ0L3
6237h0L4j3j3n3n4l1l2M2M1L2L1L2L2j%k4k5L0K9k7k8mnK0K0K9K9L0K9m2m3m3m2llK1K1J7
$$ plain form
6326 0 40 79 70 61 52 43 34 25 10 -4 -19 -34 3 40 77 114 145 175 157 139 101 64 75 86 136 186 154 123 100 78 55 32 35 38 17 -5 24 53 33 13
6314 13 -30 -73 -67 -62 -57 -53 -25 4 31 58 86 113 61 8 -44 -97 -92 -86 -57 -28 -8 12 -17 -45 -119 -192 -153 -113 -100 -87 -119 -152 -126 -52 19 9 -46 -52 -42
6301 -42 -31 -32 -33 -10 14 62 109 108 108 99 91 107 124 93 62 55 48 45 42 62 83 101 119 88 58 61 64 68 71 33 -5 -43 -81 -84 -87 -90 -93 -83 -73 -63 -53 -119 -186 -204
6288 -204 -222 -211 -201 -191 -180 -142 -104 -114 -125 -91 -56 -22 12 59 107 122 56 -3 -13 23 11 -34 -31 -57 -84 -66 -48 -31 -13 16 45 74 103 66 30
6277 30 18 6 -27 -59 -43 -27 -3 21 -33 -87 -88 -41 3 -34 -95 -107 -103 -99 -89 -80 -70 -60 -58 -55 -53 -50 -46 -42 -38 -33 -80 -126 -197 -267 -282 -297 -271 -245 -219 -194 -193 -191
6264 -191 -175 -159 -143 -127 -119 -111 -102 -94 -91 -88 -84 -81 -120 -160 -94 -28 -16 -5 -17 -30 23 76 57 37 -42 -121 -127 -134 -124 -114 -160 -207 -191 -174 -101 -28 -32 -35 -39 -42 -94 -146
6251 -146 -174 -201 -169 -137 -146 -154 -162 -170 -178 -186 -177 -168 -135 -102 -143 -183 -183 -184 -149 -115 -105 -95 -61 -28 -68 -107 -171 -235 -226 -217 -148 -79 -83 -87 -123 -159 -155 -150 -146 -141 -136 -132 -123 -113 -80
6237 -80 -46 -59 -72 -125 -179 -210 -242 -200 -159 -127 -96 -64 -32 -33 -33 -57 -82 -52 -23 -50 -78 -82 -87 -67 -47 -18 11 41 70 28 -15 -58 -100 -103 -106 -85 -64 -47
6225d7J7k1k1J9O7K9n2j2j3j7j7L7L7j9k0k0k0K0J9J1J0J0J0K0K0J1l7n2K9L5j4l1J7J7l1
6214ik7K1L1L1K6K6K6K5JKJJm1m1J6J6n9n9n9n9N2N1N1N1J6J6n7n8MLMLk1k1o2o1poL3L4L8
6202f8L9j9j9J6J6J6J6PPQPnonnK2K3j8j8p7p6K9K8K8K7K7K8nmm5m5mlK1K1k6k6k6k5K3K4
6189i2K3K4lkkkm0m0L3L3L5L5L4L5l8l8l8l8K1K1J8J7on5n5pL7L6M3ok2k2k4k5RJ0L3L4k5
6177d9k6J6J5qql3l2K5K5MMl1J7L1L0k7k7J4J3n8n9j3L5J6J6J8J9mmL3L4O5J6k9k9qrK1O9
6165H2L6L6J1J2Qm1o8o7m0QK2K1k4k5k4k5l5l6oM2J2J3k3k2k9J9nnkM7M4l7o0j2j5L4J1J1
6153a32j3L5L7L7M7l3m3MM0qk6k5M4M4llk8k8j4j4L8L8Qp3n1n2J5J6P1P2L5L6n4n4m9m9k0
6141a55j9RR0P1K4j4j4n7n7j6j6M1M0j7j7ON6O0k2n7qj3j4J4J4rrJ4J5L1L1j0j0J7J6P3P3
$$ plain form
6225 -47 -30 -51 -72 -53 14 43 -9 -21 -34 -51 -68 -31 6 -13 -33 -53 -73 -53 -34 -23 -13 -3 7 27 47 58 21 -31 -2 33 19 -12 5 22 -9
6214 -9 -36 -15 16 47 73 99 125 150 151 153 154 155 114 73 89 105 46 -13 -72 -131 -79 -28 23 74 90 106 49 -9 -5 -2 2 5 -16 -37 -99 -160 -167 -173 -140 -106 -68
6202 -68 -29 -48 -67 -51 -35 -19 -3 4 11 19 26 21 15 10 5 27 50 32 14 -63 -139 -110 -82 -54 -27 0 28 23 19 -26 -71 -75 -78 -57 -36 -62 -88 -114 -139 -116 -92
6189 -92 -69 -45 -48 -50 -52 -54 -94 -134 -101 -68 -33 2 36 71 33 -5 -43 -81 -60 -39 -21 -4 -10 -65 -120 -127 -90 -54 -11 -17 -39 -61 -85 -110 -101 -91 -58 -24 -49
6177 -49 -75 -59 -44 -52 -60 -93 -125 -100 -75 -71 -67 -98 -81 -50 -20 -47 -74 -60 -47 -105 -164 -177 -142 -126 -110 -92 -73 -77 -81 -48 -14 51 67 38 9 1 -8 13 82
6165 82 118 154 165 177 185 144 76 9 -31 -23 -1 20 -4 -29 -53 -78 -113 -149 -155 -113 -101 -88 -111 -133 -162 -143 -148 -153 -155 -108 -64 -101 -161 -173 -188 -154 -143 -132
6153 -132 -145 -110 -73 -36 11 -22 -65 -61 -21 -29 -55 -80 -36 8 5 2 -26 -54 -68 -82 -44 -6 2 -71 -122 -174 -159 -143 -72 0 35 71 17 -37 -86 -135 -155
6141 -155 -174 -165 -75 -4 20 6 -8 -65 -122 -138 -154 -113 -73 -90 -107 -101 -45 15 -7 -64 -72 -85 -99 -85 -71 -80 -89 -75 -60 -29 2 -8 -18 -1 15 88 161
6130A61L9L9r8r8m3m3J4J3J1J2m6m6l5l6NN%jN6N6J6J6m0m1LLLLJ3J3J3J3l7l8J9J9J5J5r
6118c6rj0rrrk5k5k5k5L4L4L4L5JKk2k3j2j3O0O0J%JJl7l8j3j3P9P8kkl3l4j0rKKk2k2j1j0
6105h4l4l5NNj1o0n8K3K4K3J2J1L1L1O5j6j8j9K8K8LMM6M6l4l5n2n2J2R3N7Rqq%%m8m9k7k6
6092a18k7k7K5K5K5K5L1L2L1L2K0K0nmn4n4oM4L1m9p7k8J2J2k8k9j8O3O5O6QPQPm4m4NML6
6080B2L7m5m5J0J0J0Rj5j5j0j0lP9O0J2k2k2j%J4J4J4o7l6J3k0k0k0j9k0k0J6J5J5J6J0J0
6069b4j5j4M7M7l4l4j7j8OPJ2J2J3J2J5J5J6J5l2l2qqLKN2N1N4N4o0n9q4q3kkqqJ6J7J7J6
6056d3ppk7k6kkk6k6k7k6O0O0O6l1j2j2POj9j9NNK5K5JJqqqqk6k7K2K2k0k1k0k0O6O6J8J8
6043ek7k8klL5L5L5L5K1K0K1K1J0J0J1J0o8o8o8o9k3k4K5K5P6P5J7q0l2l3J0J0kkkkk7k8K1
$$ plain form
6130 161 200 239 141 43 0 -43 -29 -16 -5 7 -39 -85 -120 -156 -151 -146 -146 -147 -91 -35 -19 -3 -43 -84 -81 -78 -75 -72 -59 -46 -33 -20 -57 -95 -76 -57 -42 -27 -36
6118 -36 -45 -55 -64 -73 -82 -107 -132 -157 -182 -148 -114 -80 -45 -44 -42 -64 -87 -99 -112 -52 8 9 9 10 11 -26 -64 -77 -90 -11 67 65 63 30 -4 -14 -23 -21 -19 -41 -63 -74 -84
6105 -84 -118 -153 -148 -143 -154 -214 -272 -249 -225 -202 -190 -179 -148 -117 -52 -68 -86 -105 -77 -49 -46 -42 4 50 16 -19 -71 -123 -111 -18 39 48 40 32 32 32 -16 -65 -92 -118
6092 -118 -145 -172 -147 -122 -97 -72 -41 -9 22 54 74 94 89 85 31 -23 -29 15 46 -3 -80 -108 -96 -84 -112 -141 -159 -96 -31 35 43 50 58 65 21 -23 -18 -14 22
6080 22 59 14 -31 -21 -11 -1 8 -7 -22 -32 -42 -45 34 94 106 84 62 61 61 75 89 103 36 0 13 -7 -27 -47 -66 -86 -106 -90 -75 -60 -44 -34 -24
6069 -24 -39 -53 -6 41 7 -27 -44 -62 -56 -49 -37 -25 -12 0 15 30 46 61 29 -3 -11 -19 -16 -14 38 89 143 197 137 78 -6 -89 -91 -93 -101 -109 -93 -76 -59 -43
6056 -43 -50 -57 -84 -110 -112 -114 -140 -166 -193 -219 -159 -99 -33 -64 -76 -88 -81 -75 -94 -113 -108 -103 -78 -53 -52 -51 -59 -67 -75 -83 -109 -136 -114 -92 -112 -133 -153 -173 -107 -41 -23 -5
6043 -5 -32 -60 -62 -65 -30 5 40 75 96 116 137 158 168 178 189 199 131 63 -5 -74 -97 -121 -96 -71 5 80 97 17 -15 -48 -38 -28 -30 -32 -34 -36 -63 -91 -70
6031g0K0M3M3J9J9l8l8l8l8m1m1j7j6k2k2O8O7J3J3J3J2j6j7j9k0j2o0k2N8Q8Q8LMm3m3j00
6020a62j00O3O3L9L9m2m2J5J5M8M8rqk1k0K0O9Q4Kon4l0N0L0k0j2j2j5j5m7m7opnnL5L5KK
6008b6LKKJk2k3l3l3N6N6m3m3J4J3k7k7J4J4J8J8ooJJJKmmmmN7N8%Jk2k2k2k2qrqqj6j5K5
5994a00K5J2J3k8k8k7k6k4k4jM7O0O0klkkl0l0l1l0nnL6L5QPl3l2LMM4M4N3N2k0k0l1l1l1
5981i3l2K0K0J9K0j0rJ7O6Rm0l6J2M2M2K1K0l6l7LN2N6k6n0n0l9l9j7O4N3k9onL0j9n9j1K4
5970e3K5K7K7K1K1Pm1LKk3k2j7L2N7Pn5n6kkL9L8L8L8L0L0L5j2q4l5K2k7m7JM0M1kn0k3k2
5957Hk6k6J5J4k6k6k7k6lkK2P0L1m9NQ6P9jo8o9K2P1M9l3q5q5m4MN7N6LLJ5J5k6k5L0L0m3
5945em2k0j9L4L4J1l7%M8L6j3q2l4J6J6J9J9qpKN1O8J9J0RJ5J4k6k6k8k8m9m9k2K6O8O7k9
$$ plain form
6031 -70 -50 -7 36 55 74 36 -2 -40 -78 -119 -160 -177 -193 -215 -237 -169 -102 -89 -76 -63 -51 -67 -84 -103 -123 -135 -195 -217 -159 -71 17 20 24 -19 -62 -162
6020 -162 -262 -199 -136 -97 -58 -100 -142 -127 -112 -64 -16 -25 -33 -54 -74 -54 15 99 101 95 41 11 61 91 71 59 47 32 17 -30 -77 -83 -90 -95 -100 -65 -30 -28 -26
6008 -26 -23 -21 -19 -18 -40 -63 -96 -129 -73 -17 -60 -103 -89 -76 -103 -130 -116 -102 -84 -66 -72 -78 -77 -76 -75 -73 -77 -81 -85 -89 -32 26 26 27 5 -17 -39 -61 -69 -78 -86 -94 -110 -125 -100
5994 -100 -75 -63 -50 -78 -106 -133 -159 -183 -207 -208 -161 -101 -41 -43 -46 -48 -50 -80 -110 -141 -171 -176 -181 -145 -110 -102 -95 -128 -160 -157 -153 -109 -65 -12 40 20 0 -31 -62 -93
5981 -93 -125 -105 -85 -66 -46 -56 -65 -48 18 27 -13 -49 -37 5 47 68 88 52 15 18 70 126 100 50 0 -39 -78 -95 -31 22 -7 -13 -18 12 -7 -66 -77 -53
5970 -53 -28 -1 26 47 68 75 34 37 39 16 -6 -23 9 66 73 18 -38 -40 -42 -3 35 73 111 141 171 206 194 110 75 97 70 23 24 64 105 103 53 30 8
5957 8 -18 -44 -29 -15 -41 -67 -94 -120 -123 -125 -103 -33 -2 -51 -46 40 119 118 50 -19 3 74 123 90 5 -80 -124 -120 -63 -7 -4 -1 14 29 3 -22 8 38 -5
5945 -5 -47 -67 -86 -52 -18 -7 -44 -44 4 40 27 -55 -89 -73 -57 -38 -19 -27 -34 -32 19 87 106 116 125 140 154 128 102 74 46 -3 -52 -74 -48 20 87 58
5934E8j09o7j8KKM5M5N8N8J7J8J5J5J8l0n8n8j8L0K6k2l3l2ooJ5J6K0k7n2mMLPPJ2J2L7L6
5922C6M4M4m5m5J7J6J6J6K2K1m8m8n0jK8K8M4M5M7jJ%j3o1l2J7J7l2j6L3K6K7%JM1M1n5n6
5910A25n5n5pqnmM4R3N4k7j3j3K2K2QQj6j6n8n9J5J4K3K2kjNNj9j9J4J5L8L9NOn1n1J9J9p0
5897F6p0k6k5M7M8MNMMM5M5MMNNMNj3j4j3j3J5J6J5J6k1k0m4m5m6m5onO1O2K2K1J%m1m0l2
5884El2qqL1L0L1L0l0l0l0l0j%N6J04M8l3k5k4J0J0J0J0m7m8M2M2J4J5k6k6J8J7J8J8KKM3
5872B08M3j2j2j2j3K5K5j6j6l5l6p6p6k0k1O9O9L0K9n3n3l0O8N3N3OOj2j2j9P8N0KO8O7O4
5861D89O5PPPQJKK6K6m6m7N8N9J27J28J27J28K48K48K31K30K43L41L81L81M75N72P45R71J275
5852G513J632K223L032M030M968N090L310k8l234m892m940m178l174k345j730j241r49p47
$$ plain form
5934 58 -51 -118 -136 -134 -132 -87 -42 16 74 91 109 124 139 157 127 69 11 -7 23 49 27 -6 -38 -44 -50 -35 -19 1 -26 -78 -82 -78 -75 -68 -61 -49 -37 0 36
5922 36 80 124 79 34 51 67 83 99 121 142 94 46 -4 -5 23 51 95 140 187 186 187 187 174 113 81 98 115 83 67 100 126 153 153 154 195 236 181 125
5910 125 70 15 8 0 -5 -9 35 128 182 155 142 129 151 173 181 189 173 157 99 40 55 69 92 114 112 111 116 121 102 83 97 112 150 189 194 200 149 98 117 136 66
5897 66 -4 -30 -55 -8 40 44 49 53 57 102 147 151 155 160 165 169 174 161 147 134 121 136 152 167 183 162 142 98 53 7 -38 -44 -49 12 74 96 117 118 118 77 37 5
5884 5 -27 -35 -43 -12 18 49 79 49 19 -11 -41 -42 -42 14 118 166 133 108 84 94 104 114 124 77 29 71 113 127 142 116 90 108 125 143 161 163 165 208
5872 208 251 239 227 215 202 227 252 236 220 185 149 73 -3 -23 -44 25 94 124 153 100 47 17 85 138 191 197 203 191 179 160 238 288 290 358 425 489
5861 489 554 561 568 575 583 584 586 612 638 592 545 603 662 789 917 1044 1172 1420 1668 1899 2129 2372 2713 3094 3475 3950 4522 5267 6238 7513
5852 7513 9145 11368 14400 18430 23398 28488 31798 31770 28536 23644 18704 14526 11352 9007 7277 6036 5087 4340
5846D340n85m75l77l09k60k21j72j73j72j38j37o5o5p4p4l4l3q8q7l0l1l0l1J1J0J5J5n7n8
5837F15n2n3L6L7L2L2L2L2Q8Q8J11J60J34L7m8r6j15j14q7q7p7K0P0P1k9k9k9k9j4j5J0J0
5827G41j2j3M5M4N5N6L1L1P8P9J08J09J59K55L06L06L39L39L99M97O04P66R48J239J636K186
5819A1331L033M100N175N401L628R9l337n118n135m325l348k474j734j313j002p12n36m39
5814C294l69l20k59j62j07j07j57j58j30j30n7n8p0p1j11j11l4l3l3l3j9j8j8j8m8m9m8m9
5805E17k2k2k2k2LKLLJ8J8opK5K4j6j7J4J3J3J3ppqpj5j4j5j4k0j9nR3J39R0N0N1M1M1Q1Q1
5793A068J07J07J87J88K38K37L19L19L92L92M90O51P20Q82J182J602K212L022L985M923N137
5786B8360L485K39l096m865m963m266l263k445j830j349r92p63o01m78l82k79k30k30j81j23
$$ plain form
5846 4340 3755 3280 2903 2594 2334 2113 1941 1768 1596 1458 1321 1256 1191 1117 1043 1009 976 888 801 771 740 710 679 690 700 715 730 673 615
5837 615 563 510 546 583 615 647 679 711 799 887 998 1158 1292 1329 1281 1185 1070 956 869 782 705 725 795 866 837 808 779 750 736 721 731 741
5827 741 729 716 761 805 860 916 947 978 1056 1135 1243 1352 1511 1766 2072 2378 2717 3056 3455 3952 4556 5322 6270 7509 9145 11331
5819 11331 14364 18464 23639 29040 32668 32767 29430 24312 19177 14852 11504 9030 7296 5983 4981 4269 3733 3294
5814 3294 2925 2605 2346 2184 2077 1970 1813 1655 1525 1395 1338 1280 1210 1139 1028 917 883 850 817 784 765 747 729 711 663 614 566 517
5805 517 495 473 451 429 432 434 437 440 458 476 470 463 488 512 496 479 493 506 519 532 525 518 510 503 488 474 459 445 425 406 401 494 633 723 773 824 865 906 987 1068
5793 1068 1175 1282 1469 1657 1895 2132 2451 2770 3162 3554 4044 4695 5415 6297 7479 9081 11293 14315 18300 23223 28360
5786 28360 31845 32084 28988 24123 19160 14894 11631 9186 7356 6007 5015 4252 3651 3173 2791 2512 2282 2052 1871 1748
5780A748j23j44j43j42j41j18k1on4j29q0LKm2m3p1p0J0J1L1L2j7j7l6l7l7l6N7N7k3k4m8
5770C49m8K6K7K6p0m3Nl1l2K1K0O2O1J3J3k3k2m7m6j6j5L4L3l8l8j6j7J5l4m0N7K8k0J3J2
5759B19opppj4j5j4j4j6j6j6j6L8L9J4J4l9l9J0Rl9l9J0J0K1K2K1K1ooJ8J8nnM4M4J1J2J1
5747B80J1K2K1K2K1k4k5p2p3J8J9M3M3p7p6k8k8j3j3l7l7M9M9%%k5k4k5k4j3j4j3j3j3j3j3
5736i5j3J3J2J3J2J6J5J6J5K2K2K2K2j7j7j6j7L3L3L3L3qqJ6J7J2J2o9o9j8j7PPK9K9K9K9
5724A55j9j9k0j9K7K7k1k2j2j2l6l7O7O7j5j4J2J1j3j3opl1l1j7j7L2L2K0K1O3O2Pr1l7l6
5713E8NONOk8k9K3P1O2J3l8l8K6K6k3k3k3k3m7m8L8L8O2O2MNj4o2o8k0jkK2K3L0j9k4N7N4
5701A66k7p9p9KN0K9K9J1l7q7q6q7nM2M2kjK6K7Qm1JM9onJ7J8jn0o5j7PN5N5N5Nm4l2l1j1
$$ plain form
5780 1748 1625 1481 1338 1196 1055 937 916 910 856 727 647 650 652 610 567 496 426 436 447 478 510 493 476 440 403 366 330 387 444 421 397 349
5770 349 301 327 354 380 310 267 272 241 209 230 250 312 373 386 399 376 354 307 261 245 230 264 297 259 221 205 188 203 169 129 186 214 194 207 219
5759 219 213 206 199 192 178 163 149 135 119 103 87 71 109 148 162 176 137 98 108 117 78 39 49 59 80 102 123 144 138 132 150 168 163 158 202 246 257 269 280
5747 280 291 313 334 356 377 353 328 256 183 201 220 263 306 229 153 125 97 84 71 34 -3 46 95 95 95 70 46 21 -3 -16 -30 -43 -56 -69 -82 -95
5736 -95 -108 -95 -83 -70 -58 -42 -27 -11 4 26 48 70 92 75 58 42 25 58 91 124 157 149 141 157 174 186 198 129 60 42 25 32 39 68 97 126 155
5724 155 136 117 97 78 105 132 111 89 77 65 29 -8 59 126 111 97 109 120 107 94 88 81 50 19 2 -15 17 49 69 90 153 215 222 131 94 58
5713 58 63 69 74 80 52 23 46 117 179 192 154 116 142 168 145 122 99 76 29 -19 19 57 119 181 185 190 176 114 46 26 25 23 45 68 98 79 55 112 166
5701 166 139 60 -19 -17 33 62 91 102 65 -22 -108 -195 -200 -158 -116 -118 -119 -93 -66 -58 -99 -98 -49 -55 -60 -43 -25 -26 -76 -141 -158 -151 -96 -41 14 19 -25 -57 -88 -99
5689i9j0L6L5j4o4l1J7L6L6N0N1K6K6j4j3L8L9qM1O6J6rrj2j2OOm0l9l8J1K9L0n3j01n3mJ6
5677a2J6J9K0J2J2J2J2ooool5l5l4l5M7M8kjk9l0k7k6pM2R0M2k5k5mmjjK1K0K1k8m7m6J6O5
5664C7L4L4P0K0o5o5l2l1J9K0L7Q6Q5L7j0j0j3j4ppl2l2L2L1q2q1k0j9J3l5l4M8K6k2k3k2
5653b7Pm2l6M4K3k5j3j2j6j5RRJ0RMMk0k0k5k4K7P4L6j2pok1k2j8j8k0K8JKLMK8K8L6L7m2
5640a8m2m2PK7K8N0N0KJJ3J4M1qm1m1MMk0j9m4m4k0k1k0k0K9K9L0K9L0K9k7k7j6j6j1j1OQ8
5628CJ11L1l8l8ll%%j%l6l6l3l4J8O6O9K1K0O8Qm0l5l6j5j4K8K9MMm3m4p0k2M5M4k5k5qqK2
5615a6k6l6J3L7j2j7L1K5K5J5J6k6k5QRM9M9opopj5j5j6j5nnjn1k6k7n8qk6k6J8J7M5M5M5
5603c1M5K8K7k9l0j4j3jM8ppl2J8l9l9j1j1QQk3K6O8J8k3k4K5K5K5K5l5l4L8L8NMn2n2j7j6
$$ plain form
5689 -99 -109 -73 -38 -52 -116 -147 -130 -94 -58 -8 43 69 95 81 68 106 145 137 178 244 260 251 242 230 218 224 230 190 151 113 124 153 183 130 29 -24 -28 -12
5677 -12 4 23 43 55 67 79 91 85 79 73 67 32 -3 -37 -72 -25 23 21 20 -9 -39 -66 -92 -99 -57 33 75 50 25 21 17 16 15 36 56 77 49 2 -44 -28 37
5664 37 71 105 175 195 130 65 33 2 21 41 78 164 249 286 276 266 253 239 232 225 193 161 193 224 142 61 41 22 35 0 -34 14 40 18 -5 -27
5653 -27 -20 -62 -98 -54 -31 -56 -69 -81 -97 -112 -103 -94 -84 -75 -71 -67 -87 -107 -132 -156 -129 -55 -19 -31 -38 -44 -65 -87 -105 -123 -143 -115 -114 -112 -109 -105 -77 -49 -13 24 -18
5640 -18 -60 -102 -95 -68 -40 10 60 62 63 76 90 131 123 82 41 45 49 29 10 -34 -78 -98 -119 -139 -159 -130 -101 -71 -42 -12 17 -10 -37 -53 -69 -80 -91 -85 3
5628 3 114 145 107 69 66 63 63 63 62 62 26 -10 -43 -77 -59 7 76 97 117 185 193 153 118 82 67 53 81 110 114 118 75 31 -39 -61 -16 28 3 -22 -30 -38 -16
5615 -16 -42 -78 -65 -28 -40 -57 -26 -1 24 39 55 29 4 12 21 70 119 113 106 100 93 78 63 47 32 27 22 21 -30 -56 -83 -141 -149 -175 -201 -183 -166 -121 -76 -31
5603 -31 14 42 69 40 10 -4 -17 -18 30 23 16 -16 2 -37 -76 -87 -98 -90 -82 -105 -79 -11 7 -16 -40 -15 10 35 60 25 -9 29 67 72 76 24 -28 -45 -61
5591f1P2P2mlmlNOOOk9k8J2J2J2J3j2j1n5n4m9m9j9O2M4nl3l2j1j1L4L4k3k2J4J4J5J4M9M9
5579B7QRj3j2M4M5KKk3k2nonnOOOOK8K9j2j1m0l9l9m0l5l4L8L8L1L2N5N6lkk7k7qrqqJ2J3
5565F0J2J2l4l3l4l4j4j3j3j3O7O8M3M3qql3l3llllj8j7L8L9L2L3k5k5k7k7L0K9k2k3k3k3
5553fJ5J5J6J5j7j7j7j6kjK2K3K1K2o8o7j9j9K1K2J3J4L8L9k8k7k7k7l4l4L9L9K5K4%%j6j7
5541c6pn6m7M9L2L2M4M4k8k9J6J5qro2o2K7K7L9L9l4l4k4k5M9M9k8k7n1n2K7K6LKK3K2j8j8
5530i0KKN8N9OOOOj5j4j2j1kM6P4k3onj1j1L2L1L1L2m4m4m3m4K3K3K3K3n9o0n9o0K7K8N2N1
5517B8J4J3k7k7klllj8j9j2j2l2O6J06Rl0k9j2j1j1j1j1j1K3K2j8j8k5k4%jO9O9M4M5k5k4
5505H9J6J6m6m6k2k2N5N5J4J5J3J3j1j1p8p8l0O7N9J1k7K2J8l2j%l7l7K0K0lklkK9K8m4m5
$$ plain form
5591 -61 11 83 79 76 72 69 74 80 86 92 63 35 47 59 71 84 72 61 6 -48 -97 -146 -165 -103 -59 -64 -97 -129 -140 -151 -117 -83 -106 -128 -114 -100 -85 -71 -22 27
5579 27 35 44 31 19 63 108 110 112 89 67 62 56 51 46 52 58 64 70 98 127 115 104 64 25 -14 -54 -89 -123 -85 -47 -16 16 71 127 124 122 95 68 60 51 43 35 47 60
5565 60 72 84 50 17 -17 -51 -65 -78 -91 -104 -37 31 74 117 109 101 68 35 32 29 26 23 5 -12 26 65 97 130 105 80 53 26 56 85 63 40 17 -6
5553 -6 9 24 40 55 38 21 4 -12 -14 -15 7 30 51 73 5 -62 -81 -100 -79 -57 -44 -30 8 47 19 -8 -35 -62 -96 -130 -91 -52 -27 -3 -3 -3 -19 -36
5541 -36 -43 -99 -146 -97 -65 -33 11 55 27 -2 14 29 21 12 -50 -112 -85 -58 -19 20 -14 -48 -72 -97 -48 1 -27 -54 -105 -157 -130 -104 -101 -99 -76 -54 -72 -90
5530 -90 -88 -86 -28 31 37 43 49 55 40 26 14 3 1 47 121 98 92 87 76 65 97 128 159 191 147 103 60 16 39 62 85 108 49 -11 -70 -130 -103 -75 -23 28
5517 28 42 55 28 1 -1 -4 -7 -10 -28 -47 -59 -71 -103 -37 69 78 48 19 7 -4 -15 -26 -37 -48 -25 -3 -21 -39 -64 -88 -88 -89 -20 49 93 138 113 89
5505 89 105 121 75 29 7 -15 40 95 109 124 137 150 139 128 50 -28 -58 9 68 79 52 74 92 60 59 59 22 -15 5 25 22 20 17 15 44 72 28 -17
5494a7l1l1ppQPQPnnnnj5j5j5j5M0L9L6L7j4o2l5O1O6J6k3k3rqL1L2j4j4j4j4M1M1M1M1k1
5481A28k2k1k2poppk5k6kjM6M7m2m2n8n8J5J5L8L7L5L4J2l7pol0J8rrm8m8m5m6lM4J8J8M5
5468h4M5mmjkjkmmnmk9k9k8k9J4J4j4L5P5P4K9K8l9l9on5m9L3K9L0L5j4J3J4m9m9m8m9LLL
5455a64KM6M5K5k5RROOn4n3mM5K6k2k0K9N1N0KKL3j6l6l7l5l5l5l5jkM4M4L6j3l4l5N8N8M
5443b6NN8k2n3n2j7O5M6kN6N6MMj9k0j9j9j5j5j3j2k1K7K8k2n9o0j5j4K7K7k1k2OON4N5j1
5431b5j0j0j1J2J1J1J2l9l8J0J1QQRQl4l4J4J5LLLMOPOOL7L8j2j1nmM4M5L8L8j1j0l4l3l4
5418E2l4m5m6L5L5M4M4M5M4m0m1m0m0PPN6N5m3m4m4m4K6K6n5n5n5n5poM8M9N1N1%M8O7j5n7
5406B4n7j3j4O1O2k0k0J0Rl9l9KJMMLN0P0j2l4l3J0J0M6M5l5l5k1k1K8K8K4K3k5k5o4o4l7
$$ plain form
5494 -17 -48 -79 -86 -93 -85 -78 -70 -63 -68 -73 -78 -83 -98 -113 -128 -143 -103 -64 -28 9 -5 -67 -102 -41 25 41 18 -5 -14 -22 9 41 27 13 -1 -15 26 67 108 149 128
5481 128 106 85 63 56 50 43 36 11 -15 -17 -18 28 75 33 -9 -67 -125 -110 -95 -57 -20 15 49 61 24 17 11 -19 -1 -10 -19 -67 -115 -160 -206 -209 -165 -147 -129 -84
5468 -84 -39 -43 -47 -48 -50 -51 -53 -57 -61 -66 -70 -99 -128 -156 -185 -171 -157 -171 -136 -61 13 42 70 31 -8 -14 -69 -118 -85 -56 -26 9 -5 8 22 -27 -76 -124 -173 -170 -167 -164
5455 -164 -162 -116 -71 -46 -71 -62 -53 -47 -41 -95 -148 -152 -107 -81 -103 -123 -94 -43 7 9 11 44 28 -8 -45 -80 -115 -150 -185 -186 -188 -144 -100 -64 -77 -111 -146 -88 -30 -26
5443 -26 -21 37 15 -38 -90 -107 -42 4 2 58 114 118 122 103 83 64 45 30 15 2 -10 -31 -4 24 2 -57 -117 -132 -146 -119 -92 -113 -135 -129 -123 -69 -14 -25
5431 -25 -35 -45 -56 -44 -33 -22 -10 -49 -87 -77 -66 -58 -50 -41 -33 -67 -101 -87 -72 -69 -66 -63 -59 -53 -46 -40 -34 3 41 29 18 13 9 53 98 136 174 163 153 119 86 52
5418 52 18 -27 -73 -38 -3 41 85 130 174 134 93 53 13 20 27 83 138 95 51 7 -37 -11 15 -40 -95 -150 -205 -212 -218 -170 -121 -70 -19 -19 29 96 81 24
5406 24 -33 -46 -60 1 63 43 23 33 42 3 -36 -34 -33 -29 -25 -22 28 98 86 52 19 29 39 85 130 95 60 39 18 46 74 98 121 96 71 7 -57 -94
5395i4J1L1j7l9J0j4j5j1j1j0j0ppPN6K8K8K8K8j3j2L6L5Pm2k0k1k0k0l9J0L6L6P2K4K4k4
5383F1q4l6k3k3PN6N5PNNn1n2rM0J3J3J2J3J0ROm4n6n7PPPQL0L1j0j0J3J4J4J4qqK2k7k9J9
5370b9J3J3k9k9J4O2M7kk9k8k7k8k8k7K4K4j7j6J4J4J7J7L2Q0M0rrrj2j2PPl1l0p1k1K4K4
5358b0j9j8J4l5m5L7M0rk7k7J1J0K1K1k0j9J8J9l3J6M5M6L5j3j6j6j9j9l0k9onL6L6l4l4j0
5347i8L8O2J4J3J3j4j4J%J%n7n8L1L2LMk1k1JKk4k3K4K3K4K3L1L1K7K8Lm5m8%Rl9l7J2JJL1
5334a6j7j4j5j7j7JJ%JPPPPJ2J2j9L0K8j9o3o2l4l4k4K5K4k4J0RJ7O5L7L8M6M5j2j1J0RL4
5321H4L3lko0n9qqqpmml7J2O9j3o4j6K1K1K4K4j4j5L0K9J5o7m8%M6M6l2l2m4m5MNJ0J0J0J0
5309h7l3l3%m9k5N6PQNOONJ9J9J9J9l5l4J3J4qqrqk0j9K9P7M6l5j7L1L3j5rrm2m1PPj8j9m3
$$ plain form
5395 -94 -83 -52 -69 -108 -98 -112 -127 -138 -149 -159 -169 -176 -183 -176 -120 -92 -64 -36 -8 -21 -33 3 38 45 3 -17 -38 -58 -78 -117 -107 -71 -35 37 61 85 61
5383 61 -23 -59 -82 -105 -98 -42 13 20 25 30 -21 -73 -82 -42 -29 -16 -4 9 19 28 34 -10 -66 -123 -116 -109 -102 -94 -64 -33 -43 -53 -40 -26 -12 2 -6 -14 8 -19 -48 -29
5370 -29 -16 -3 -32 -61 -47 15 62 60 31 3 -24 -52 -80 -107 -83 -59 -76 -92 -78 -64 -47 -30 2 82 122 113 104 95 83 71 78 85 54 24 -47 -68 -44 -20
5358 -20 -39 -57 -43 -78 -123 -86 -46 -55 -82 -109 -98 -88 -67 -46 -66 -85 -67 -48 -81 -65 -20 26 61 48 32 16 -3 -22 -52 -81 -87 -92 -56 -20 -54 -88 -98
5347 -98 -60 2 16 29 42 28 14 15 15 16 16 -41 -99 -68 -36 -33 -29 -50 -71 -70 -68 -92 -115 -91 -68 -44 -21 10 41 68 96 99 54 6 6 15 -24 -61 -49 -48 -47 -16
5334 -16 -33 -47 -62 -79 -96 -95 -94 -94 -93 -86 -79 -72 -65 -53 -41 -60 -30 -2 -21 -84 -146 -180 -214 -238 -213 -189 -213 -203 -194 -177 -112 -75 -37 9 54 42 31 41 50 84
5321 84 117 114 112 52 -7 -15 -23 -31 -38 -42 -46 -83 -71 -2 -15 -79 -95 -74 -53 -29 -5 -19 -34 -4 25 40 -27 -75 -75 -29 17 -15 -47 -91 -136 -132 -127 -117 -107 -97 -87
5309 -87 -120 -153 -153 -202 -227 -171 -164 -156 -151 -145 -139 -134 -115 -96 -77 -58 -93 -127 -114 -100 -108 -116 -125 -133 -153 -172 -143 -66 -20 -55 -72 -41 -8 -23 -32 -41 -83 -124 -117 -110 -128 -147 -190
5295a90m3k9k9N1N2L0L1L0L0M6M5lln1n0L0L1K6K6JKJ6J6J6J6n8n9n9n9k1k1LLM5M4nmK6K6
5283d2k3k2K5K5KJk1k1k1k1n6n5R0R0L8L7J3J4OOj9j8n1n1l0J8K3K2JKJ8J9J5J6jn0n0jJ9
5271e3J9k6k7J9J9J6J6J4l5l8J1O8J8l1l2jjjjQQNNJ4l4l4J5M9M9LMl4l3J6J5NMQQj8L0K5
5258G2K4L6j2o6o6j5j5j2j1l3J5L7L7NNNNn2n2jM8L8j0k6k5j9K9Om3j9j8j8j8rM0L6L7J1J1
5246d3l3l3j4O6K0K1K6K6K6K6OOm3m2n2n2K7k2k6K3J6J7L2L2j6j6J6J7K0k9m1m2J3J2JJKJ
5234e1pqpql9m0L3L3J9J9nnk9k9k9k9R3R3L3L4M8%l0l0l1l1POj0n9n6pL5Q4M6kppl2l1j5L3
5221a8O3O3J4J4J1J1l0p8p9l0J9J9K1K2ppppnnm5m6L1L0j3j3j5o4l9RLKO2O2LLLLMNl6l6O
5208i7ONON0N0ook1k1n9n9k6K1J9J9M9M9qqK1K1j9k0J5J5j1o0m0RK1O9M8jK9K9KJl9l9k3k2
$$ plain form
5295 -190 -233 -262 -291 -240 -188 -158 -127 -97 -67 -21 24 21 18 -33 -83 -53 -22 4 30 31 33 49 65 81 97 39 -20 -79 -138 -159 -180 -177 -174 -129 -85 -90 -94 -68 -42
5283 -42 -65 -87 -62 -37 -35 -34 -55 -76 -97 -118 -174 -229 -139 -49 -11 26 39 53 59 65 46 28 -23 -74 -104 -86 -63 -41 -40 -38 -20 -1 14 30 29 -21 -71 -72 -53
5271 -53 -34 -60 -87 -68 -49 -33 -17 -3 -38 -76 -65 3 21 -10 -42 -43 -44 -45 -46 -38 -30 -25 -20 -6 -40 -74 -59 -10 39 42 46 12 -21 -5 10 15 19 27 35 17 47 72
5258 72 96 132 120 54 -12 -27 -42 -54 -65 -98 -83 -46 -9 -4 1 6 11 -41 -93 -94 -46 -8 -18 -44 -69 -88 -59 -53 -96 -115 -133 -151 -169 -178 -138 -102 -65 -54 -43
5246 -43 -76 -109 -123 -57 -37 -16 10 36 62 88 94 100 57 15 -37 -89 -62 -84 -110 -87 -71 -54 -22 10 -6 -22 -6 11 31 2 -39 -81 -68 -56 -55 -54 -52 -51
5234 -51 -58 -66 -73 -81 -120 -160 -127 -94 -75 -56 -61 -66 -95 -124 -153 -182 -89 4 37 71 119 119 89 59 28 -3 4 10 0 -59 -115 -122 -87 -3 43 41 34 27 -5 -36 -51 -18
5221 -18 45 108 122 136 147 158 128 50 -29 -59 -40 -21 0 22 15 8 1 -6 -11 -16 -61 -107 -76 -46 -59 -72 -87 -151 -190 -181 -178 -176 -114 -52 -49 -46 -43 -40 -36 -31 -67 -103 -97
5208 -97 -91 -86 -80 -30 20 14 8 -13 -34 -93 -152 -178 -157 -138 -119 -70 -21 -29 -37 -16 5 -14 -34 -19 -4 -15 -75 -115 -106 -85 -16 32 31 60 89 91 92 53 14 -9 -31
5195c1o3o3L3L3N7N8J8J9J9J9j1j0j1j0K6K7K3K4j6o5m7L3M5l6n3mJ3J4k5k4K8K7N2N2j8j8
5184A15m2m1m3m3j9j8j8j7M0L9LLMLj4j3j3j4k2k3L4L5l8l9L5L5K0J9K0J9L7L6L6L6rro6o6
5172Bklm3m3M3M3KLOOL0L0ppJ7J7rj0l4l3j6j5QRj6j7K4K4J%M2M1L7L8J6J7n8rJ1o9o8j9K0
5159IK1l6l5L7L7%%j%QPQPn1n2l3J5M5mn3mN4NNN4N5Pj1j1j13j14k7K1L8L8L8L9L1j7J0J0
5146C7%%j8o7m7KK0K1L0L0j8j8qqqqqqM1M1l6l5l6l5K6K6K3K3K0l0kkL2L3j6j7k4k4k2k1L8
5133g3Q6N5k5j0j0m2OM5M5on4oopon2lJ8J8j8j7j8j8qrl6J3M0M1nnRQQRJJJJm1m1PPk5k6K3
5119a25K4nmmnM8M8%jL7L6m4r3l0N1LKK2K2K1K2KJm5r4n9N5L7L7j8j8L0L0K8K7K8K7j1j0L8
5107A10L8N6N6n7n7k7k7k8k7NONNo0o0K1K1L5L5L5L6L7L7j1j2l8l9l9l8KKKKj4j3j3j3j3j3
$$ plain form
5195 -31 -94 -157 -124 -91 -34 24 42 61 80 99 88 78 67 57 83 110 133 157 141 76 29 62 107 71 18 14 27 41 16 -8 20 47 99 151 133 115
5184 115 73 32 -11 -54 -73 -91 -109 -126 -86 -47 -44 -41 -37 -34 -48 -61 -74 -88 -110 -133 -99 -64 -102 -141 -106 -71 -51 -32 -12 7 44 80 116 152 143 134 68 2
5172 2 0 -3 -46 -89 -46 -3 -1 2 8 14 44 74 67 60 77 94 85 75 41 8 -8 -23 -15 -6 -22 -39 -15 9 10 10 52 93 130 168 184 201 143 134 145 76 8 -11 9
5159 9 30 -6 -41 -4 33 33 33 32 32 40 47 55 62 11 -41 -74 -59 -14 -18 -71 -75 -21 -16 -11 43 98 105 94 83 -30 -144 -171 -150 -112 -74 -36 3 34 17 27 37
5146 37 37 37 19 -48 -95 -93 -73 -52 -22 8 -10 -28 -36 -44 -52 -60 -68 -76 -35 6 -30 -65 -101 -136 -110 -84 -61 -38 -18 -48 -50 -52 -20 13 -3 -20 -44 -68 -90 -111 -73
5133 -73 13 68 43 33 23 -19 -13 32 77 71 17 11 5 -2 -8 -60 -63 -45 -27 -45 -62 -80 -98 -106 -115 -151 -138 -98 -57 -62 -67 -58 -50 -42 -33 -32 -31 -30 -29 -70 -111 -104 -97 -122 -148 -125
5119 -125 -101 -106 -110 -114 -119 -71 -23 -23 -24 13 49 5 -88 -118 -67 -64 -62 -40 -18 3 25 27 28 -17 -111 -170 -115 -78 -41 -59 -77 -47 -17 11 38 66 93 82 72 110
5107 110 148 204 260 203 146 119 92 64 37 42 48 53 58 -2 -62 -41 -20 15 50 85 121 158 195 184 172 134 95 56 18 20 22 24 26 12 -1 -14 -27 -40 -53
5095e3L6L6LMLML6L6Kq0k0j9k4k4j5j5j5j5o0o1K1K1JKKJj1j1j2j1K9L0L0K9M0M0M0M0kjj
5082C6jRRRRm2m3m2m2j6j6L2L3L0L0n1n1J5J4j0rM7M7kjk2k3K7K6M0L9m1m1n3n3k9k9%%%J
5069a64L6L6L6L6NONOj%j%j8j8j8j8N6N7k2k1mM4L9m2n1n1qpJ9J9J9K0K3K3k5k6QPPPm1m1
5056f3m2m1L1L1j8j7L3L4RRNMNMM0L9p4p4l2l2J6J6NMMMj5j6j6j5L6L7j2j2j7j6m1m1K4K5
5044a79M8M9J%K5K5j0j1j0j1j2j2L7L6ool1l1j1j0O7O7K9j9m0m0pprL8MMj4j5jM7P2K3ppl4
5031C2l4qrqrk8k9mnN3N2jn0m7m8n0L1N6PrrLLK4K4L6j3j0j0l8l9J0J1j4j3O4O4K2k7m8m7
5018a15K4K4K4K4K9L0KKM6ln3n3ON5L4j5l2J7o0n9k0K8P7K8PPm5m4L4L3J0RMML5j4n6pJ1J1
5006C9n1n1k6k7qrM0M1j3j2J2J2oollo4j6O9P0rrrrkkklL8L8L8L8m1m2j7j7MMl7l7J5J5M0
$$ plain form
5095 -53 -17 19 22 26 29 33 69 105 107 27 7 -12 -36 -60 -75 -90 -105 -120 -180 -241 -220 -199 -198 -196 -194 -193 -204 -215 -227 -238 -209 -179 -149 -120 -80 -40 0 40 38 37 36
5082 36 35 44 53 62 71 29 -14 -56 -98 -114 -130 -98 -65 -35 -5 -56 -107 -92 -78 -88 -97 -50 -3 -5 -6 -28 -51 -24 2 42 81 40 -1 -54 -107 -136 -165 -165 -165 -165 -164
5069 -164 -128 -92 -56 -20 -15 -9 -4 2 1 1 0 0 -18 -36 -54 -72 -16 41 19 -2 -6 38 77 35 -16 -67 -75 -82 -63 -44 -25 -5 18 41 16 -10 -2 5 12 19 -22 -63
5056 -63 -105 -146 -115 -84 -102 -119 -86 -52 -43 -34 -29 -25 -20 -16 24 63 -11 -85 -117 -149 -133 -117 -112 -108 -104 -100 -115 -131 -147 -162 -126 -89 -101 -113 -130 -146 -187 -228 -204 -179
5044 -179 -131 -82 -81 -81 -56 -31 -41 -52 -62 -73 -85 -97 -60 -24 -30 -36 -67 -98 -109 -119 -52 15 44 25 -15 -55 -62 -69 -78 -40 -36 -32 -46 -61 -62 -15 57 80 73 66 32
5031 32 -2 -10 -19 -27 -36 -64 -93 -97 -102 -49 3 2 -48 -95 -143 -193 -162 -106 -99 -108 -117 -114 -111 -87 -63 -27 -40 -50 -60 -98 -137 -127 -116 -130 -143 -79 -15 7 -20 -68 -115
5018 -115 -91 -67 -43 -19 10 40 42 44 90 87 34 -19 -13 42 76 61 29 46 -14 -73 -93 -65 12 40 47 54 9 -35 -1 32 42 51 55 59 94 80 24 17 28 39
5006 39 -12 -63 -89 -116 -124 -133 -93 -52 -65 -77 -65 -53 -59 -65 -68 -71 -135 -151 -82 -12 -21 -30 -39 -48 -50 -52 -54 -57 -19 19 57 95 54 12 -5 -22 -18 -14 -51 -88 -73 -58 -18
4993a8L9L3L3ppl1l1p1p1j%j%J8J8J8J8k2k2k2k2J1J0j3j4L4L5ook5k5j%lllkMMNMLKLLK1
4978a11K1llK2K3n0n0j%K4K3KJk2k3k2k1N1N2P2P2%jj9j8j9j9j3j3j3j3K0J9K0K0KKK7P5P4
4966A88oo4o4k5k6KJmM4O2j9p8p8j0j0K1K0lll0l0o7o7l8J2M0M0K4K5J1l8nnJ6J6mmj0L8N5
4954g3Pj7j7n5nL9M0L6L6K3k6j6j6k6p6k9N1M0M1Ql9j3j2KJjkM3oo3j4k0j9j4j3jM7N1KL0
4941g6P8P5K7k4k5J3J3j5j6j5j6lllkJ1J2J1J2JKkkon5n5pL2L2M1po4j6J1J1L5L6L8j0j9j9
4928C1KLoom3m3k9K0L4L3j3j2l6l7j%m1m1J2J2j2j2J2J2J2J2K1K0oM2N3N4QQLKm2m3K1O9P3
4916A46k5l2l2l8l8o8o9k2k3J9k9n7M1L1L0O1O1K6K5k3k3rj0J4J5l3l2l3l3RQQQJ7J7l1l1
4904a55QQRQJ2J1J1J2J8J9J8J8k0k0k0k0KJJJM4M4K0K0k2k1K7K7k8k8n2n2N3N3k8k8k0k1K9
$$ plain form
4993 -18 21 54 87 80 73 42 11 -60 -131 -132 -132 -133 -133 -115 -97 -79 -61 -83 -105 -127 -149 -138 -128 -141 -155 -121 -86 -92 -98 -123 -148 -149 -149 -152 -155 -158 -160 -156 -152 -147 -143 -140 -138 -135 -132 -111
4978 -111 -90 -93 -96 -74 -51 -101 -151 -152 -152 -128 -105 -103 -102 -124 -147 -169 -190 -139 -87 -15 57 57 56 37 19 0 -19 -32 -45 -58 -71 -51 -32 -12 8 10 12 39 114 188
4966 188 182 118 54 29 3 5 6 2 46 108 89 11 -67 -77 -87 -66 -46 -49 -52 -82 -112 -179 -246 -284 -272 -232 -192 -168 -143 -132 -170 -175 -180 -164 -148 -152 -156 -166 -128 -73
4954 -73 -66 -83 -100 -155 -160 -121 -81 -45 -9 14 -12 -28 -44 -70 -146 -175 -124 -84 -43 -35 -74 -87 -99 -97 -96 -97 -99 -56 -62 -125 -139 -159 -178 -192 -205 -206 -159 -108 -106 -76
4941 -76 2 77 104 80 55 68 81 66 50 35 19 16 13 10 8 19 31 42 54 55 57 55 53 47 -8 -63 -70 -38 -6 35 28 -36 -52 -41 -30 5 41 79 69 50 31
4928 31 33 36 30 24 -19 -62 -91 -71 -37 -4 -17 -29 -65 -102 -103 -103 -144 -185 -173 -161 -173 -185 -173 -161 -149 -137 -116 -96 -102 -60 -7 47 55 63 66 68 26 -17 4 73 146
4916 146 121 89 57 19 -19 -87 -156 -178 -201 -182 -211 -268 -227 -196 -166 -105 -44 -18 7 -16 -39 -48 -58 -44 -29 -62 -94 -127 -160 -151 -143 -135 -127 -110 -93 -124 -155
4904 -155 -147 -139 -130 -122 -110 -99 -88 -76 -58 -39 -21 -3 -23 -43 -63 -83 -81 -80 -79 -78 -34 10 30 50 28 7 34 61 33 5 -47 -99 -46 7 -21 -49 -69 -90 -61
4892f1K8j0j0J5J4mmK1K0K6K6K6K6L9M0rrJ4J4o7o6k1k1LL%%k5k4OOOOj9j9o8o8K3K2kkL0
4879i5K9ONm5m5L6L7K4K4M8M9M9M9%Jl5l6l5l5o2o1J9K0K0K1K1K0L1L0OOk8k9M7M8l3j14m5
4867e2m4j0j0J4J5J7J8J8J8J4J4L8L8OPp5p5l8l8J0J1J5J5L9L9k8k8k8k8L2L3QRl2l1J8J7
4856e4j0j0K3k7l7M3J9J9K9K9n2n3n5n5ppP2P2P2P2m2m1m2m2rj0J5J4l5l5J3J3J9J8ooJ4J3
4844f6O3O2L0L1q3q3j0rj0j0LLLML8L8K5k3j6j6ONK1K2J1l8n7rL3L3%jn4n4qM0L7L8M1M1O5
4831A46J7kn0k7k6k0k0k1k0j0j0j3j3J3l6nok1K7LLJ3O1O2J3%Jn2L0P0K1l2l3m8JJm7k4k4
4819g8J4J4J8J8J5J5L8ro7j7K4K4L0j8n5n6JJJ5O3K3k6nnrqm2m2kk%%K4K4N6N5ln1r4m5j4
4807a76L5M8M8J0J1N0N0Qm0n1kQQJ7J8rn7j1L7M7M8l2l2k9k9k9J9P6K7PPn3n3KJjkK9j9m8
$$ plain form
4892 -61 -33 -43 -53 -38 -24 -28 -32 -11 9 35 61 87 113 152 192 183 174 188 202 135 69 48 27 30 33 33 33 8 -16 -10 -4 2 8 -11 -30 -98 -166 -143 -121 -123 -125 -95
4879 -95 -66 -60 -55 -100 -145 -109 -72 -48 -24 24 73 122 171 171 172 137 101 66 31 -31 -92 -73 -53 -33 -12 9 29 60 90 96 102 74 45 92 140 107 -7 -52
4867 -52 -96 -106 -116 -102 -87 -70 -52 -34 -16 -2 12 50 88 94 101 26 -49 -87 -125 -115 -104 -89 -74 -35 4 -24 -52 -80 -108 -76 -43 -35 -26 -58 -89 -71 -54
4856 -54 -64 -74 -51 -78 -115 -72 -53 -34 -5 24 -28 -81 -136 -191 -198 -205 -133 -61 11 83 41 0 -42 -84 -93 -103 -88 -74 -109 -144 -131 -118 -99 -81 -87 -93 -79 -66
4844 -66 -3 59 89 120 37 -46 -56 -65 -75 -85 -82 -79 -76 -72 -34 4 29 6 -10 -26 -20 -15 6 28 39 1 -56 -65 -32 1 1 0 -54 -108 -116 -76 -39 -1 40 81 146
4831 146 163 161 111 84 58 38 18 -3 -23 -33 -43 -56 -69 -56 -92 -97 -103 -124 -97 -94 -91 -78 -17 45 58 58 59 7 37 107 128 96 63 15 16 17 -30 -54 -78
4819 -78 -64 -50 -32 -14 1 16 54 45 -22 -39 -15 9 39 21 -34 -90 -89 -88 -73 -10 13 -13 -18 -23 -32 -40 -82 -124 -126 -128 -128 -128 -104 -80 -24 31 28 -23 -117 -162 -176
4807 -176 -141 -93 -45 -35 -24 26 76 84 44 -7 -9 -1 7 24 42 33 -24 -35 2 49 97 65 33 4 -25 -54 -35 41 68 75 82 29 -24 -22 -21 -22 -24 5 -14 -62
4794f2m9POPOPQPPJ4J5j6L3O6J7m2m1RRj6j5J6J6J6J6qpqqnoooJ1J1J1J1ooL4L4n4n5NNk8
4780d0K0ppj0j1j1j1J0Rl3q1n4nL8L7L2L2qqnnK0J9NNNNQ9R0J8o2m4L8L9j0n0m9j2j2l9l8
4767a01KKJ8J7ppQQL8Q6O0N9K3K2k5k4mlK8k1q3q3j3j4j3j3n1n1kkK1K2llK3K4kjpqJ7J7K9
4754a7K9k0j9nnM4M4K8K9k1k0j7j6PQj8j8m2m2K8K8K8K8J1J0l8l9j3j4L4L5rrrqL2L1j6j7
4742B2k4k3k4k4J9K0J9J9j2j2j2j2l1l0J8J8L8L9j0j0%%k5k4l8l9M3M3O6O7j4j5J6J6l2l3
4731A9L0K9n1n2qrrrK5K5k3k4opJ8J7K3K2k6k6PPPPJ4J5j0j1L4L4j5j4n6n5l7J1L4j6rrj3
4718a17j4j3j3L5L5L5L4j2j3ON4O1J2l8l8m1m1o2o2ON5M8M9Nm4k3K6Pm1j5L5L2L3j3j3J7J7
4706a1M2M1J2J2l7l6m4m4j6j7PN5K9K8n5n4n1n2pM1J4J5M9N0M7M7J2l7l3l4L9L8J8l2r8r8
$$ plain form
4794 -62 -111 -104 -98 -91 -85 -78 -70 -63 -56 -42 -27 -43 -10 56 73 31 -10 -1 8 -8 -23 -7 9 25 41 33 26 18 10 5 -1 -7 -13 -2 9 20 31 25 19 53 87 33 -22 -17 -12 -40
4780 -40 -20 -27 -34 -44 -55 -66 -77 -67 -58 -91 -172 -226 -231 -193 -156 -124 -92 -100 -108 -113 -118 -98 -79 -74 -69 -64 -59 30 120 138 76 32 70 109 99 49 0 -12 -24 -63 -101
4767 -101 -99 -97 -79 -62 -69 -76 -68 -60 -22 64 124 183 206 228 203 179 175 172 200 179 96 13 0 -14 -27 -40 -91 -142 -144 -146 -125 -103 -106 -109 -86 -62 -64 -65 -72 -80 -63 -46 -17
4754 -17 12 -8 -27 -32 -37 7 51 79 108 87 67 50 34 41 49 31 13 -29 -71 -43 -15 13 41 52 62 24 -15 -28 -42 -8 27 18 9 0 -8 24 55 39 22
4742 22 -2 -25 -49 -73 -54 -34 -15 4 -8 -20 -32 -44 -75 -105 -87 -69 -31 8 -2 -12 -12 -12 -37 -61 -99 -138 -95 -52 14 81 67 52 68 84 52 19
4731 19 49 78 27 -25 -33 -42 -51 -60 -35 -10 -33 -57 -63 -70 -52 -35 -12 10 -16 -42 -35 -28 -21 -14 0 15 5 -6 28 62 47 33 -23 -78 -115 -104 -70 -86 -95 -104 -117
4718 -117 -131 -144 -157 -122 -87 -52 -18 -30 -43 -37 17 78 90 52 14 -27 -68 -130 -192 -186 -131 -83 -34 -29 -73 -96 -70 -63 -104 -119 -84 -52 -19 -32 -45 -28 -11
4706 -11 31 72 84 96 59 23 -21 -65 -81 -98 -91 -36 -7 21 -34 -88 -139 -191 -198 -157 -143 -128 -79 -29 18 65 77 40 7 -27 12 50 68 36 -62 -160
4695a60J3J2j2j2l9RL8L7pqM6M5M6M6k7k7Jm8o9p0J2J2N2J01N2MK1K2K1k7o3o3j7j7j2j2L6
4684f4L6%jk5k4onM4M3qrqrLMLLM8M8Pp3r3m3mlK6K6l0l1K0J9K0J9M9M9k5k4o7o7k7k7O0N9
4670h7J9K0LLl8l7j4j3K8K7QQl2l2K6K6N1N0L5L4L4L5kkjkppm4m4k1K7K5n6o7j8L9L9rrJ6
4658A1J6JKM2M2K1K1mlRRm8m8j2j2l6l7J2J2L7L6m4m5k0k0lklko9o8j2j2k8k9mnN5N4L0L0
4645a26L0K9L0K9mnk8k9j8j8K2K3m9m9k4k5M4M5K0K0j3j2J2O1P7mm4m4J5J5J5J5k1k1k1k0
4634g3popol0k9J1J1J7J7J7J7ppppl1l0l0l1J7J6J6J6LMLLJ4J3J4J3jkjkL5L4L4L5K5K6j5
4620H2j5mml9m0k0O0O3j7o3j5J0J0m5m4m4m4Q0Q0rrLMLLk6k7J4J4J3J3j1j2k8k8K8K8K2K2
4608Hkkl2l2M1M1l3l4l3l3nnJ9J9m4m4mmo5o6rqN4N4P9P8N1N1k2k2MNNMnnJN1J6q0n0jj0j0
$$ plain form
4695 -160 -147 -135 -147 -159 -198 -189 -151 -114 -121 -129 -83 -38 8 54 27 0 1 -47 -116 -186 -174 -162 -110 -9 43 47 68 90 111 84 21 -42 -59 -76 -88 -100 -64
4684 -64 -28 -28 -29 -54 -78 -84 -89 -45 -2 -10 -19 -27 -36 -33 -29 -26 -23 25 73 80 7 -86 -129 -133 -136 -110 -84 -114 -145 -125 -106 -86 -67 -18 31 6 -18 -85 -152 -179 -206 -146 -87
4670 -87 -68 -48 -45 -42 -80 -117 -131 -144 -116 -89 -81 -73 -105 -137 -111 -85 -34 16 51 85 119 154 152 150 149 147 140 133 89 45 24 51 76 20 -47 -65 -26 13 4 -5 11
4658 11 27 28 30 72 114 135 156 152 149 158 167 119 71 59 47 11 -26 -14 -2 35 71 27 -18 -38 -58 -61 -63 -66 -68 -137 -205 -217 -229 -257 -286 -290 -295 -240 -186 -156 -126
4645 -126 -96 -67 -37 -8 -12 -17 -45 -74 -92 -110 -88 -65 -114 -163 -187 -212 -168 -123 -103 -83 -96 -108 -96 -35 42 38 -6 -50 -35 -20 -5 10 -11 -32 -53 -73
4634 -73 -80 -86 -93 -99 -129 -158 -147 -136 -119 -102 -85 -68 -75 -82 -89 -96 -127 -157 -187 -218 -201 -185 -169 -153 -150 -146 -143 -140 -126 -113 -99 -86 -87 -89 -90 -92 -57 -23 11 46 71 97 82
4620 82 67 63 59 20 -20 -40 20 83 66 3 -12 -2 8 -37 -81 -125 -169 -89 -9 -18 -27 -24 -20 -17 -14 -40 -67 -53 -39 -26 -13 -24 -36 -64 -92 -64 -36 -14 8
4608 8 6 4 -28 -60 -19 22 -11 -45 -78 -111 -116 -121 -102 -83 -127 -171 -175 -179 -244 -310 -319 -327 -273 -219 -140 -62 -11 40 18 -4 0 5 10 14 9 4 5 56 72 -8 -58 -59 -69 -79
4595g9ppj0j0j1j0N3N2N3N2ooooj4j5j4j5j0rn1n0J1J1J1J1L7L6L7L6%j%%M8M8QPm8m9qqJ1
4581G2J1j4j3m6m6onK2K3l5l4N1N1N0N1m4m4m4m4n2n2NNP7P7L6L7j1j1n2n1l9m0KJ%Jk4k4
4569a59L3L2k4k3MMMML5L5noMNM5J41J35k8j28p9k5k5J9J9n0m9rj0J4J3J3J3rrqrN9N9LKo
4557C4oJ9J8K8K8m5m5m0m0l9m0k2k3N1N0j8j7j8j7NNNNK5K5K6K5PPPOK0K0K0K0l4l3L9L9k2
4544G5k2o3o3J3J3J3J3k4k3JJj8j9L8L8j8j7L9L8J3J2m5m4J2J2J2J2RQRQrrrrmlL6L7kjK3
4531H3K3k4k5m9m8m5m4K8K8NNL0K9K7K7LKj6j7j7j6qqqqK3K2K3K2k2k2k2k2J5J4J4J5l1l0
4519d4l1l0NOOOJ2J1J2J2M0M0M0M0k1k1k0k1m1m1m1m1O9O8O9O9J1J0o1o2n0m9qrL2L3L3L3
4507F6RRQRK2K1k0j9m0l9j6j5K0J9k1k1j7j8j8j7ononl2l3QQO7O6K6K5j3j3n3n4p7p8nnL4
$$ plain form
4595 -79 -86 -93 -103 -113 -124 -134 -81 -29 24 76 70 64 58 52 38 23 9 -6 -16 -25 -76 -126 -115 -104 -93 -82 -45 -9 28 64 64 63 63 63 111 159 167 174 126 77 69 61 72
4581 72 83 69 56 10 -36 -42 -47 -25 -2 -37 -71 -20 31 81 132 88 44 0 -44 -96 -148 -143 -138 -61 16 52 89 78 67 15 -36 -75 -115 -113 -112 -112 -111 -135 -159
4569 -159 -126 -94 -118 -141 -137 -133 -129 -125 -90 -55 -60 -66 -62 -57 -12 129 264 236 108 29 4 -21 -2 17 -33 -82 -91 -101 -87 -74 -61 -48 -57 -66 -74 -83 -24 35 38 40 34
4557 34 28 47 65 93 121 76 31 -9 -49 -88 -128 -150 -173 -122 -72 -90 -107 -125 -142 -137 -132 -127 -122 -97 -72 -46 -21 -14 -7 0 6 26 46 66 86 52 19 58 97 75
4544 75 53 -10 -73 -60 -47 -34 -21 -45 -68 -67 -66 -84 -103 -65 -27 -45 -62 -23 15 28 40 -5 -49 -37 -25 -13 -1 8 16 25 33 24 15 6 -3 -7 -10 26 63 61 60 83
4531 83 106 82 57 8 -40 -85 -129 -101 -73 -68 -63 -33 -4 23 50 53 55 39 22 5 -11 -19 -27 -35 -43 -20 2 25 47 25 3 -19 -41 -26 -12 2 17 -14 -44
4519 -44 -75 -105 -100 -94 -88 -82 -70 -59 -47 -35 5 45 85 125 104 83 63 42 1 -40 -81 -122 -53 15 84 153 164 174 113 51 1 -48 -56 -65 -33 0 33 66
4507 66 75 84 92 101 123 144 124 105 65 26 10 -5 15 34 13 -8 -25 -43 -61 -78 -84 -89 -95 -100 -132 -165 -157 -149 -82 -16 10 35 22 9 -44 -98 -175 -253 -258 -263 -229
4495b29L3P5P4J0J1j4j4l8l7j4j3J6J6J6J6L1L2L1L1m4m4mmk3k4k4k4PPPPk4k4k4k3L6L7L7
4483a15L7j%j%k1k0L6L6QPQPK4K3j8j7K8K9N0M9j5o5q8m0M3M2M3M2J1l8q0q1m3MJ8J8jkpM1
4470d9P0K2J0l8rM0L8j2m4m4m8m7n0n0opL5Q4Q3L5m8m8j0j1J2J2J2J3QRM6M6K9k0m9m8p6p5
4458a85LN1K0J9kkJ4J5n7qM6lMLM5M5L1j6l8l7j6j6k3k2L4L5K1K0j9k0k2k1k2k2L2L3L2L2
4447a6L5L5ook2k2Qm0m3Nk4k5L2L2L2L2L1L1j7j8k8k7k8k8O8O9j2j2l0l0noRJ0N7N8n2n1n2
4434e6n1LMK8K8J1J1l7l8j0rn8n9O5O5O4O5MMm4m5K0K0K0K0RRl9l9j1j1J3J4m5m4MNLMk1k0
4422a44MMK8K9RRL4L3J1J1J1J0m8m9k4k4Q1Q1l2l2k9l0J9J9j3j2j2j3jjM7M7m1m1j7j7L5L6
4410b2j3j3k1k0K8K7RQm0m1JJJ%K1K1mlL0L1n1n0O4O5j6j6k6k7K3K2K8K8k1k1L0L0n1n1n4
$$ plain form
4495 -229 -196 -121 -47 -37 -26 -40 -54 -92 -129 -143 -156 -140 -124 -108 -92 -61 -29 2 33 -11 -55 -59 -63 -86 -110 -134 -158 -151 -144 -137 -130 -154 -178 -202 -225 -189 -152 -115
4483 -115 -78 -79 -79 -80 -80 -101 -121 -85 -49 -41 -34 -26 -19 5 28 10 -7 21 50 100 149 134 69 -19 -59 -16 26 69 111 122 84 4 -77 -120 -116 -98 -80 -81 -83 -90 -49
4470 -49 21 43 53 15 6 46 84 72 28 -16 -64 -111 -161 -211 -217 -224 -189 -105 -22 13 -35 -83 -93 -104 -92 -80 -68 -55 -47 -38 8 54 83 63 14 -34 -110 -185
4458 -185 -182 -131 -111 -92 -94 -96 -82 -67 -124 -132 -86 -89 -85 -82 -37 8 39 23 -15 -52 -68 -84 -107 -129 -95 -60 -39 -19 -38 -58 -80 -101 -123 -145 -113 -80 -48 -16
4447 -16 19 54 48 42 20 -2 6 -34 -77 -72 -96 -121 -89 -57 -25 7 38 69 52 34 6 -21 -49 -77 -9 60 48 36 6 -24 -29 -35 -26 -16 41 99 47 -4 -56
4434 -56 -107 -104 -100 -72 -44 -33 -22 -59 -97 -107 -116 -174 -233 -168 -103 -39 26 30 34 -10 -55 -35 -15 5 25 34 43 4 -35 -46 -57 -44 -30 -75 -119 -115 -110 -107 -103 -124 -144
4422 -144 -140 -136 -108 -79 -70 -61 -27 6 17 28 39 49 1 -48 -72 -96 -15 66 34 2 -27 -57 -38 -19 -32 -44 -56 -69 -70 -71 -24 23 -18 -59 -76 -93 -58 -22
4410 -22 -35 -48 -69 -89 -61 -34 -25 -17 -57 -98 -97 -96 -95 -95 -74 -53 -57 -60 -30 1 -50 -100 -36 29 13 -3 -29 -56 -33 -11 17 45 24 3 33 63 12 -39 -93
4398i3n4ooJ5J5J4J5k0k1k0k0J1J1J1J1Q0Q1jjKLN1N1LMm5m4qpn6n6M3M3M3M3j3j2o2o1m4
4385a00m4L7L7k8k8K0K0KJk3k3%%j%L3L3L3L3L2L1n0n0o0n9K1K2L7L7J3J3lklkmmmnk4k4k4
4372a10k5J1J1J0J1J2J2j2j2L1L0j8j8k0k0MNllmlK4K3k5k5O9O8j3j3j3j2j2j3L8L7L7L7k2
4361G4k2k2k2l5l5j0j1l4l4K9J09Q1%o0o0m0RJ1l7n2lK0O8O0O0M1p%jk7k8rrj2j2l2p9l2J8
4348a45j3j3j3L6N7N7k0k0J1J1J2J1L4L4L4L5k2k2k4K4J7J6k8p7n4K7LLkjkkm5m6PQj1O9R4
4336D0J2jjJ8J7o5o5J9J9J9O8J9k9m5m6n1kK0K0n5n5O8J16R0M0k2p1m9jj7j6j0j0n2kl1l0
4325a41J2J1J1J2M1M2M1M2P2P3p3p3L0L0L0L0n0n1n0n0M3M3M3M2k3k3k3k3j7j8o7o6PPQPj
4313g2%jjJ4J3J4J3j5j5j6j5J5J5J6J5%%%%K6K6k2k3j9k0m4m4K8K8N2N2k2k2k3k2JKJJnnn
$$ plain form
4398 -93 -147 -153 -159 -144 -129 -115 -100 -120 -141 -161 -181 -170 -159 -148 -137 -57 24 23 22 24 27 78 129 132 136 91 47 39 32 -24 -80 -37 6 49 92 79 67 5 -56 -100
4385 -100 -144 -107 -70 -98 -126 -106 -86 -84 -83 -106 -129 -129 -129 -130 -130 -97 -64 -31 2 34 65 15 -35 -95 -154 -133 -111 -74 -37 -24 -11 -14 -16 -19 -21 -25 -29 -33 -38 -62 -86 -110
4372 -110 -135 -124 -113 -103 -92 -80 -68 -80 -92 -61 -31 -49 -67 -87 -107 -103 -98 -101 -104 -108 -111 -87 -64 -89 -114 -45 23 10 -3 -16 -28 -40 -53 -15 22 59 96 74
4361 74 52 30 8 -27 -62 -72 -83 -117 -151 -122 -13 68 68 8 -52 -92 -83 -72 -109 -161 -164 -144 -76 -16 44 85 78 78 77 50 22 13 4 -8 -20 -52 -131 -163 -145
4348 -145 -158 -171 -184 -148 -91 -34 -54 -74 -63 -52 -40 -29 5 39 73 108 86 64 40 64 81 97 69 -8 -62 -35 -32 -29 -31 -32 -34 -36 -81 -127 -120 -112 -123 -54 40
4336 40 52 51 50 68 85 20 -45 -26 -7 12 80 99 70 25 -21 -72 -74 -54 -34 -89 -144 -76 40 130 170 148 77 28 27 10 -6 -16 -26 -78 -80 -111 -141
4325 -141 -129 -118 -107 -95 -54 -12 29 71 143 216 143 70 100 130 160 190 140 89 39 -11 32 75 118 160 137 114 91 68 51 33 -34 -100 -93 -86 -78 -71 -72
4313 -72 -72 -73 -74 -60 -47 -33 -20 -35 -50 -66 -81 -66 -51 -35 -20 -20 -20 -20 -20 6 32 10 -13 -32 -52 -96 -140 -112 -84 -32 20 -2 -24 -47 -69 -68 -66 -65 -64 -69 -74 -79
4300g9nkkkkj1j1L7L8K4K5k5k4l0l1N0N1J2J2l6l6m3m3j9j8J7J7l1l1M7M7l3l4qqM0M0OOO
4288h9Nj7j8j7j7LLMLMLLMj6j6j6j5J%JJL2L2M0Q7O3l4%jk2k3L5L5K3K3K4K3n6n6n7n6m6m6
4275a66ooM7M7K3K2K1K0P7P7R2R1K1K1M0Q8J50K46M26P81J316K125J803j144k318j508q19
4266A567l98k73k25k09j12q6l7k7k7k3k4j5j4j5j5j4j4K7K6J3J3o0o0o1o0M5M5J9K0k1k1k5
4256f1k5jjL8L7L8L8j6j6j6j6j8j8n9n8j%K3K4ONL0L0K4K5M8M9RRm7m8r4r5l0O6L5j4l2J7
4244a15MNPQJ9J9J8J9j2j2K8K8j4j3J0J1K9K9n9o0j%j%k1k1MLN3N4llKKl8l9M7M7k7k6k9k9
4231g7J2J2L6L6nnj1j1l5l5k0k0j9k0k0j9N3N3K6K6JKklkkKKl8l8J8J8k2k2L0L1L1L1QQj6
4219fj6l9l8L4L4L6L6J2J2l1l1l2l1N2N2J1J2l9l9o4o3j3j2j3j3j5j5K6K5j8j8L9L9O2O3m3
$$ plain form
4300 -79 -84 -86 -88 -90 -92 -103 -114 -77 -39 -15 10 -15 -39 -69 -100 -50 1 13 25 -11 -47 -90 -133 -152 -170 -153 -136 -167 -198 -151 -104 -137 -171 -179 -187 -147 -107 -101 -95 -89
4288 -89 -84 -101 -119 -136 -153 -150 -147 -143 -140 -136 -133 -130 -126 -142 -158 -174 -189 -188 -188 -187 -186 -154 -122 -82 5 68 34 34 33 11 -12 23 58 81 104 128 151 95 39 -18 -74 -120 -166
4275 -166 -172 -178 -131 -84 -61 -39 -18 2 79 156 248 339 360 381 421 509 659 905 1331 2112 3428 5553 7356 6212 3894 2386 1567
4266 1567 1169 896 671 462 350 264 227 200 173 150 126 111 97 82 67 53 39 66 92 105 118 58 -2 -63 -123 -78 -33 -14 6 -15 -36 -61
4256 -61 -86 -87 -88 -50 -13 25 63 47 31 15 -1 -19 -37 -96 -154 -155 -155 -132 -108 -102 -97 -67 -37 -13 12 60 109 118 127 80 32 -62 -157 -187 -121 -86 -100 -132 -115
4244 -115 -111 -106 -99 -91 -72 -53 -35 -16 -28 -40 -12 16 2 -11 -1 10 39 68 9 -51 -52 -52 -53 -53 -74 -95 -91 -88 -35 19 16 13 15 17 -21 -60 -13 34 7 -19 -48 -77
4231 -77 -65 -53 -17 19 14 9 -2 -13 -48 -83 -103 -123 -142 -162 -182 -201 -148 -95 -69 -43 -42 -40 -42 -45 -47 -49 -47 -45 -83 -121 -103 -85 -107 -129 -99 -68 -37 -6 2 10 -6
4219 -6 -22 -61 -99 -65 -31 5 41 53 65 34 3 -29 -60 -8 44 55 67 28 -11 -75 -138 -151 -163 -176 -189 -204 -219 -193 -168 -186 -204 -165 -126 -64 -1 -44
4207d4m3k4k4k5k4L4L3L3L4l2l2qpL4L4ooJ4J4ppk2K7K6k1rqnn4q2l3J5O3L9L9j4j5N6N6j
4195bjj1j1j1j2J6J7J6J6k2k1J9O8M4l7k8k9J2J3N2N3ppj8o6m4Lk3k4kM5K2k7n0m9j2j2P9
4183e1P9k7k6j3j3J2J1J5J4n3nL2L2ooJ5J4J1J2k5p4p6k8Nm4m1QM0L9J8J9k6k6M7M7K6K6J2
4171fl6l3l3j01n2J9O8O5O6j4o2l9M1P3P2P5P4K0k9m2m2k4k4k4k5J3J3m4m4ooJ8J9J5J5J5
4160eJ6L7L8L7L8m2m2m2m2k8k7K9K9j0j1j0j0J3J3N3N4qqpqrrj0rrrrrj8j8j8j8J3J3j0j1
4148h3l0k9K8K7J9J9J8J9k5k6J5J5L7L8L7L7o0o0k0k0J8J8pok9k8k9k8j3j4j3j3L2L3P3P3
4136B3j7j6PQMLK9K8PQm9m9j8j8j0L8N0l1n0jRRJ3J2M4M5M4M4m5m5m5m5J1J1J1J1L7L8mlk6
4124G2k5k6k5RRl2l2j7j8K3K3j3j4j3j4k7k7M6M5M7M6K2K2K7K6K6K6m0m0l9m0J2J2J3J2o6
$$ plain form
4207 -44 -87 -111 -135 -160 -184 -150 -117 -84 -50 -82 -114 -122 -129 -95 -61 -67 -73 -59 -45 -52 -59 -81 -54 -28 -49 -58 -66 -71 -125 -207 -240 -225 -162 -123 -84 -98 -113 -57 -1 -2
4195 -2 -3 -14 -25 -36 -48 -32 -15 1 17 -5 -26 -7 61 105 68 40 11 23 36 88 141 134 127 109 43 -1 2 -21 -45 -47 -2 20 -7 -57 -106 -118 -130 -51
4183 -51 28 1 -25 -38 -51 -39 -28 -13 1 -52 -57 -25 7 1 -5 10 24 35 47 22 -52 -128 -156 -151 -195 -236 -228 -188 -149 -131 -112 -138 -164 -117 -70 -44 -18 -6
4171 -6 -42 -75 -108 -209 -261 -242 -174 -109 -43 -57 -119 -158 -117 -44 28 103 177 197 168 126 84 60 36 12 -13 0 13 -31 -75 -81 -87 -69 -50 -35 -20 -5
4160 -5 11 48 86 123 161 119 77 35 -7 -35 -62 -33 -4 -14 -25 -35 -45 -32 -19 34 88 80 72 65 57 48 39 29 20 11 2 -7 -16 -34 -52 -70 -88 -75 -62 -72 -83
4148 -83 -113 -142 -114 -87 -68 -49 -31 -12 -37 -63 -48 -33 4 42 79 116 56 -4 -24 -44 -26 -8 -15 -21 -50 -78 -107 -135 -148 -162 -175 -188 -156 -123 -50 23
4136 23 6 -10 -3 5 9 12 41 69 76 84 35 -14 -32 -50 -60 -22 28 -3 -53 -54 -45 -36 -23 -11 33 78 122 166 121 76 31 -14 -3 8 19 30 67 105 101 98 72
4124 72 47 21 -4 5 14 -18 -50 -67 -85 -62 -39 -52 -66 -79 -93 -120 -147 -101 -56 -9 37 59 81 108 134 160 186 146 106 67 27 39 51 64 76 10
4112A0o7m2m2K0K0l6l7m3m3M6M6O5O6K2K2kn1o9J2J2J1J7J6mmmmm9m9QQN0N0J0Rj3j3j3j4
4100g9m0m0M9M8jjkjJ4J3J4J4kkkkj8j7K3K3J9J8J9J8rqrrm3m3m3m4K1K0K0K1L8L9L8L9m9
4088D4m9m9m9NNNNk2k2L4L4K5K5J9K0Kp9o1j3JJNMj9j9L8L8N6N6%jqqqqj2j1j2j2kklkK3K4
4074bK4K4n2n1n2n2J7J6QN6Q6Nm6KJ3J3qqk4k4%JRQj5j5N0N1N1N1m2m2m2m2k0k0k0k0j4j4
4061a40j4j4N4N3N4N4j0j0j1j0KLk2k2QPl4q2k9N2O0O0J1J0l0l0m8m9k4k5L0L1NOJ9J9noK8
4049d9K8j2j3l5l5L8L8QQm8m9MMMLKJk3k3K1K2M5M6k6k7l4J4M9l2q6nL2L3L7L8k2k1k2k1j1
4037a19j2j1j1L5L5L6L5l5l4OOR1R1J9J8noo2o2j2j2j2j2J3J2J2J3j6j6n2n1LQ4O6J7l7l8
4025b3j6j6j5j5RJ0j2j1l6l6M1M1J7J7J7J6k3k4J3J3J3J4l7l7n8K3M6M6ook5k5L1L2j5j6l9
$$ plain form
4112 10 -57 -99 -141 -121 -101 -137 -174 -217 -260 -214 -168 -103 -37 -15 7 5 -46 -115 -103 -91 -80 -63 -47 -51 -55 -59 -63 -112 -161 -153 -145 -95 -45 -35 -26 -39 -52 -65 -79
4100 -79 -119 -159 -110 -62 -63 -64 -66 -67 -53 -40 -26 -12 -14 -16 -18 -20 -38 -55 -32 -9 10 28 47 65 56 48 39 30 -13 -56 -99 -143 -122 -102 -82 -61 -23 16 54 93 44
4088 44 -5 -54 -103 -98 -93 -88 -83 -105 -127 -93 -59 -34 -9 10 30 32 -47 -108 -121 -120 -119 -114 -110 -129 -148 -110 -72 -16 40 40 39 31 23 15 7 -5 -16 -28 -40 -42 -44 -47 -49 -26 -2
4074 -2 22 46 -6 -57 -109 -161 -144 -128 -120 -64 22 27 -19 -17 -4 9 1 -7 -31 -55 -55 -54 -45 -37 -52 -67 -17 34 85 136 94 52 10 -32 -52 -72 -92 -112 -126 -140
4061 -140 -154 -168 -114 -61 -7 47 37 27 16 6 8 11 -11 -33 -25 -18 -52 -134 -163 -111 -51 9 20 30 0 -30 -78 -127 -151 -176 -146 -115 -110 -104 -85 -66 -71 -77 -49
4049 -49 -21 -33 -46 -81 -116 -78 -40 -32 -24 -72 -121 -117 -113 -109 -106 -104 -103 -126 -149 -128 -106 -61 -15 -41 -68 -102 -88 -39 -71 -157 -162 -130 -97 -60 -22 -44 -65 -87 -108 -119
4037 -119 -131 -142 -153 -118 -83 -47 -12 -47 -81 -75 -69 22 113 132 150 145 139 77 15 3 -9 -21 -33 -20 -8 4 17 1 -15 -67 -118 -115 -31 35 52 15 -23
4025 -23 -39 -55 -70 -85 -76 -66 -78 -89 -125 -161 -120 -79 -62 -45 -28 -12 -35 -59 -46 -33 -20 -6 -43 -80 -138 -115 -69 -23 -29 -35 -60 -85 -54 -22 -37 -53 -92
4014i2m0J3J3L8L7ONj8j9M3M3j4j3l3l3K3K4M4M4j0j0lM5O3j7m4m4PQj5j4j4j5K2K2K2K2J4
4002A10J3j1j1j4j3j4j4lmk7k8l0l1M2M2L3L3n6n7j0rJ4J4K8K8j2j3l8l8l9l8PPL1L1llk7
3990a10k7K1K0M4R2P7k1q0l1j0j0J8J7K6K6l1l1j7j7m1m1j9j8NOKKM3M3k0k0k0k0N7N7J%n
3979c2nmnJ4J5k6k6K6K6K6K6j3j3l8l8klllL4L4J0J0m3m4klJ2J2J1J2l0l0M3M2ONj9j9MMM
3965b5MKJl9l9J5J4j0j0l4l4L9L8J0J0o3o3J4J4L8L8NOM6M6NOj9j9m6m5k2k2K6K6m7m6j0r
3953a99M8M7N1N1K7K6m5m5m5m5PPl4l4l9l9L4L4L1L1N6N5llklJ2J1L6L7JKn5n5k0j9K1K1M3
3941DM3J9J9lmL8L7P4P3N6N6Q2J79K54M16P28J280K052J826q36k164j565r50n11l50j79j30
3933E44r4r4r1r2jkm2m2PPL2L1llm4m4n1n1NOJ5J5J5J5KKM3M3K8K8k9k8o9o9j2j2opopK3K3
$$ plain form
4014 -92 -132 -119 -106 -68 -31 -25 -20 -38 -57 -14 29 15 2 -31 -64 -41 -17 27 71 61 51 48 93 156 139 95 51 58 66 51 37 23 8 30 52 74 96 110
4002 110 123 112 101 87 74 60 46 43 39 12 -16 -46 -77 -35 7 40 73 17 -40 -50 -59 -45 -31 -3 25 13 0 -38 -76 -115 -153 -146 -139 -108 -77 -80 -83 -110
3990 -110 -137 -116 -96 -52 40 117 96 16 -15 -25 -35 -17 0 26 52 21 -10 -27 -44 -85 -126 -145 -163 -158 -152 -150 -148 -105 -62 -82 -102 -122 -142 -85 -28 -27 -27 -32
3979 -32 -37 -41 -46 -32 -17 -43 -69 -43 -17 9 35 22 9 -29 -67 -69 -72 -75 -78 -44 -10 0 10 -33 -77 -79 -82 -70 -58 -47 -35 -65 -95 -52 -10 -4 1 -18 -37 -33 -29 -25
3965 -25 -21 -19 -18 -57 -96 -81 -67 -77 -87 -121 -155 -116 -78 -68 -58 -121 -184 -170 -156 -118 -80 -75 -69 -23 23 28 34 15 -4 -50 -95 -117 -139 -113 -87 -134 -180 -190 -199
3953 -199 -151 -104 -53 -2 25 51 6 -39 -84 -129 -122 -115 -149 -183 -222 -261 -227 -193 -162 -131 -75 -20 -23 -26 -28 -31 -19 -8 28 65 66 68 13 -42 -62 -81 -60 -39 4
3941 4 47 66 85 82 78 116 153 227 300 356 412 494 673 927 1343 2071 3351 5403 7229 6393 4229 2664 1714 1203 853 674 544
3933 544 450 356 265 173 172 170 128 86 93 100 132 163 160 157 113 69 18 -33 -28 -22 -7 8 23 38 40 42 85 128 156 184 155 127 58 -11 -23 -35 -41 -48 -54 -61 -38 -15
3920a5K2K3l1l2K6K5l6l6j1j2J7J6N7N7j5j5j4j5nnnnQQL2L2k5k6k5k6o3o3RJ0mmK0K1NNj9
3907a14j9k2k2J8J8N1N0J0J0l9l9J7J7k8k8J2J3j7j7PPN5N4klmmmnJ5J4J5J4LMLLj3j3J2J1
3894D0J3J3k8k7qql2l2k1k1k0k1k0k0L7L6K8K8K7K8J5J5n8n8j2j2J2J2K6K5K6K6J8J9k2k2
3883Bk7k6J3J4J8J7opk0k1k0k0o2o1J2J2N1N1N1N1L4L4ppp6p6O2O2J9J9n4n4j2j3j3j3l4l5
3872a42j0j0K0K0K1K0J9K0M3M4l0k9onk1k2N2N1l8l7L5L5NMK9K8N0N0n5n5j9j8OOm0m1J6J6
3860A2O5O4rqp5p4l4l4k9k9K8K8J1J1J1J1L5L5J0J1j5j4j5j5k9l0K7K7l8l8j4j4L7L6J3J3
3849b9m2m2kjpoM7M7j7o6o0o0lM5N8N9J1J1RQL7j2o5j7j4L5O6O7K3K2k1k2Mm6n9n8ooMN3P0
3836A5K2j8j8K8P7M0p3m7m6n3n4k2k2J9J8NMMNl0l0k0K9P2K3l5l6j4j4J1J0L1L1L1L1mnK0
$$ plain form
3920 -15 7 30 -1 -33 -7 18 -18 -54 -65 -77 -60 -44 13 70 55 40 26 11 6 1 -4 -9 -1 7 39 71 46 20 -5 -31 -94 -157 -148 -138 -142 -146 -126 -105 -100 -95 -114
3907 -114 -133 -155 -177 -159 -141 -90 -40 -30 -20 -59 -98 -81 -64 -92 -120 -108 -95 -112 -129 -122 -115 -60 -6 -8 -11 -15 -19 -23 -28 -13 1 16 30 33 37 40 43 30 17 29 40
3894 40 53 66 38 11 3 -5 -37 -69 -90 -111 -131 -152 -172 -192 -155 -119 -91 -63 -36 -8 7 22 -36 -94 -106 -118 -106 -94 -68 -43 -17 9 27 46 24 2
3883 2 -25 -51 -38 -24 -6 11 5 -2 -22 -43 -63 -83 -145 -206 -194 -182 -131 -80 -29 22 56 90 83 76 0 -76 -14 48 67 86 32 -22 -34 -47 -60 -73 -107 -142
3872 -142 -152 -162 -142 -122 -101 -81 -62 -42 1 45 15 -14 -20 -25 -46 -68 -16 35 -3 -40 -5 30 35 39 68 96 146 196 141 86 67 49 55 61 21 -20 -4 12
3860 12 77 141 132 124 49 -25 -59 -93 -122 -151 -123 -95 -84 -73 -62 -51 -16 19 29 40 25 11 -4 -19 -48 -78 -51 -24 -62 -100 -114 -128 -91 -55 -42 -29
3849 -29 -71 -113 -115 -116 -123 -129 -82 -35 -52 -118 -178 -238 -241 -196 -138 -79 -68 -57 -48 -40 -3 -15 -80 -97 -111 -76 -10 57 80 102 81 59 63 17 -42 -100 -106 -112 -108 -55 15
3836 15 37 19 1 29 106 146 73 26 -20 -73 -127 -149 -171 -152 -134 -129 -125 -121 -116 -146 -176 -196 -167 -95 -72 -107 -143 -157 -171 -160 -150 -119 -88 -57 -26 -30 -35 -15
3824a5J9J0Rj4j5k1k0k1k1O0N9O3J4l3l4r3r4l6l7MLj5j5o6j9P5P5O5J7J0J0K8K8K1k7K1K1
3813A6L0j9j6j6jjKm6l5l6O3O2Np5n9j2J5l3k5k4l9RN2N2M6kk8k8j3L5R2M4k0k0JJm9m9k5
3800a46k5M1M0L7L7J2l6l7J2L0L1ppK2K3on6m4m4O0J08M1qk0o8j19p0qqL3Q2Ql9MNN8N8N0
3789D4N1K7K7j3j2RRpn6o9o9m4m4J2J3K8K7k9k9k0k1ON4M5ml0l0K4K4K4K4N8N9j4j4jjj5o3
3777b0n5n6J5J4J8J8j3L6O2J3J6J7%m9q9m0L0K9j1j1M4nj8j7P0P0N7QJ3J2m8m7o4o4l9m0K6
3765a18K6KJj0j0j0j0NNO1O2M2M1l1l1L8L9lkn0m9n0m9o1o0K8K9j5j6N8N7N2N2mnnmo1o1k8
3753a45k7J3J3OPj8j8J2J2J2J2J9J9J8J9mnk9k9k0k0K0K1J0J0J0J0pqJ8J7J1J2J2J2l1l1M2
3741b5M2opopj4j5l9l8K2K3K3K2M4M3k9k9m8m7J0RM5M5j1j2L2L2N6N6M2M1o5o4r0q9n6M2K4
$$ plain form
3824 -15 4 14 23 9 -6 -27 -47 -68 -89 -29 30 93 107 74 40 -53 -147 -183 -220 -216 -213 -228 -243 -309 -328 -253 -178 -113 -96 -86 -76 -48 -20 1 -26 -5 16
3813 16 46 27 11 -5 -6 -7 -5 -51 -86 -122 -59 3 8 -67 -126 -138 -123 -156 -181 -205 -244 -235 -183 -131 -85 -87 -115 -143 -156 -121 -29 15 -5 -25 -24 -23 -72 -121 -146
3800 -146 -171 -130 -90 -53 -16 -4 -40 -77 -65 -35 -4 -11 -18 4 27 21 -35 -79 -123 -63 45 86 78 58 -10 -129 -199 -207 -215 -182 -100 -92 -131 -127 -122 -64 -6 44
3789 44 95 122 149 136 124 133 142 135 79 10 -59 -103 -147 -135 -122 -94 -67 -96 -125 -145 -166 -160 -106 -61 -65 -95 -125 -101 -77 -53 -29 29 88 74 60 59 58 43 -20
3777 -20 -75 -131 -116 -102 -84 -66 -79 -43 19 32 48 65 65 16 -73 -113 -83 -54 -65 -76 -32 -37 -55 -72 -2 68 125 133 146 158 110 63 -1 -65 -104 -144 -118
3765 -118 -92 -90 -89 -99 -109 -119 -129 -124 -119 -58 4 46 87 56 25 63 102 99 97 47 -2 -52 -101 -162 -222 -194 -165 -180 -196 -138 -81 -29 23 19 14 9 5 -56 -117 -145
3753 -145 -172 -159 -146 -140 -133 -151 -169 -157 -145 -133 -121 -102 -83 -65 -46 -50 -55 -84 -113 -133 -153 -133 -112 -102 -92 -82 -72 -79 -87 -69 -52 -41 -29 -17 -5 -36 -67 -25
3741 -25 17 11 4 -2 -9 -23 -38 -77 -115 -93 -70 -47 -25 19 62 33 4 -44 -91 -81 -72 -27 18 7 -5 27 59 115 171 213 254 189 125 35 -54 -110 -68 -44
3729d4K4OOJ9J8l0l0M1M2qpk1k2k1k1OOOOl2l2l3l2k2k3k2k2K1K1K1K1J1J2O1O0KKKKpooo
3716c1JJN0N0k0j9k0k0k2k3k2k2QQQQllllj6j6L2L2rrrrNMNNK1K0k8k9l8l8J0J0J4J4J5J4
3702g7J4J4J5J4L5L5j3j4o5o5j6j7K5K4P3P2k3k3k3k4m0m0QQj9j9j9j9NOONJ2J2J2J2J8J8
3690g3J9J8j5j5j6j5N0M9JJK8K9k3p1l4J5j6j6J8J8J7J8j3j3O8O8qqqqk1k1k0k1k0k1j7j8
3679i4j4L4PPL0K9m9m8pM1J2J1K5k3k3K5rrpoL1L2j8j7L4L4N9J0J4l5j20j21jM9M8jm2m2L6
3667a18L6O4O5j7j7m4m4NNL0L1N8Rk4k4n4oK1K1K4K4l6l6l3l3l0J9O7J8n8n9K0J9LLKLllm
3654i6lQQN4N4%m8j9j8L7Q5L6j2j7j8k0k1kkK2P1K4n7o5o6RQl2l2J3J3J3J3M4M4k9k9j5j5
3642f0RRk3k3N0N0K5K4%%m5m5m5m5RJ0N0N1NNNNl7l6l7l6J0J1j3j4m9n0K4K3L9L9kjPQPPj2
$$ plain form
3729 -44 -20 -14 -8 11 29 -1 -31 10 52 44 37 16 -6 -27 -48 -42 -36 -30 -24 -56 -88 -121 -153 -175 -198 -220 -242 -221 -200 -179 -158 -147 -135 -74 -14 -12 -10 -8 -6 -13 -19 -25 -31
3716 -31 -30 -29 21 71 51 32 12 -8 -30 -53 -75 -97 -89 -81 -73 -65 -68 -71 -74 -77 -93 -109 -77 -45 -54 -63 -72 -81 -76 -72 -67 -62 -41 -21 -49 -78 -116 -154 -144 -134 -120 -106 -91 -77
3702 -77 -63 -49 -34 -20 15 50 37 23 -42 -107 -123 -140 -115 -91 -18 54 31 8 -15 -39 -79 -119 -111 -103 -122 -141 -160 -179 -174 -168 -162 -157 -145 -133 -121 -109 -91 -73
3690 -73 -54 -36 -51 -66 -82 -97 -47 2 3 4 32 61 38 -33 -67 -52 -68 -84 -66 -48 -31 -13 -26 -39 29 97 89 81 73 65 44 23 3 -18 -38 -59 -76 -94
3679 -94 -108 -74 -67 -60 -30 -1 -50 -98 -105 -64 -52 -41 -16 -39 -62 -37 -46 -55 -62 -68 -37 -5 -23 -40 -6 28 87 97 111 76 -44 -165 -166 -117 -69 -70 -112 -154 -118
3667 -118 -82 -18 47 30 13 -31 -75 -70 -65 -35 -4 54 63 39 15 -39 -45 -24 -3 21 45 9 -27 -60 -93 -123 -104 -37 -19 -77 -136 -116 -97 -94 -91 -89 -86 -89 -92 -96
3654 -96 -99 -91 -83 -29 25 25 -23 -42 -60 -23 62 98 86 69 51 31 10 8 6 28 99 123 66 1 -65 -56 -48 -80 -112 -99 -86 -73 -60 -16 28 -1 -30 -45 -60
3642 -60 -51 -42 -65 -88 -38 12 37 61 61 61 16 -29 -74 -119 -110 -100 -50 1 6 11 16 21 -16 -52 -89 -125 -115 -104 -117 -131 -180 -230 -206 -183 -144 -105 -107 -108 -101 -93 -86 -79 -91
3629i1j3j3j3J6J6k4k5ppppO8O8K7K8ppppLKKKnnJ9K0OOl5l4l0l0l0l0j5j4j4j5N0M9M9N0
3615a1j6j6j6j6LLK7K8K7K8l0k9J0RJ0RK3K2kkRRj7o6n3ol5l5J2J2J2J3L5L5onl0k9k6k6p
3603a43M2M5mj4L5K6K5L8j0l6l7J6O5M1qj9k0KKj1j1j5j4l0p8k5K4N9J0m5m6l3J5M5M5M4M4
3591B4K1K0QRQRJ2J3k8k8l2l1qpj0j1J4J4k2k2Nm4k9l0rqOOJ7O5L8j0j8j7lM5M6mMMK8k1l6
3578a2l6KJk3k4J6J7L3L3k4k4l0l0L9M0L7j1m0m1%jm0m1K0K0O0O0kkm2m3l9m0k8N2N2N2L3
3566fL2%jjjrqrrK2K1lkj3j3K8K7l2l2K5K4k8k9J2J2n3n3k9k9J2J2j2j3j5j6j5j6M5M5M5M4
3553d1J1J0J1J0NNONl7l8L6L6j9j9m4m3klllK3K2K3K2j2j2j2j2M2M2M1M2K0J9K0J9l6l5l6
3541F3l5J7J8J7J8onk9l0rj0n0n0n0m9L9M0J9K0K0K0P1P1n1r9p7MM4M4k0k0L6L7nmnmK5K4
$$ plain form
3629 -91 -104 -117 -130 -114 -98 -122 -147 -154 -161 -168 -175 -107 -39 -12 16 9 2 -5 -12 -9 -7 -5 -3 -8 -13 6 26 32 38 3 -31 -61 -91 -121 -151 -166 -180 -194 -209 -159 -110 -61 -11
3615 -11 -27 -43 -59 -75 -72 -69 -42 -14 13 41 11 -18 -8 1 11 20 43 65 63 61 70 79 62 -4 -57 -63 -98 -133 -121 -109 -97 -84 -49 -14 -20 -25 -55 -84 -110 -136 -143
3603 -143 -101 -56 -60 -74 -39 -13 12 50 40 4 -33 -17 48 89 81 62 42 44 46 35 24 9 -5 -35 -113 -138 -114 -55 -45 -90 -136 -169 -154 -109 -64 -20 24
3591 24 45 65 73 82 90 99 111 124 96 68 36 5 -3 -10 -20 -31 -17 -3 -25 -47 -42 -86 -115 -145 -154 -162 -156 -150 -133 -68 -30 -40 -58 -75 -78 -33 13 9 13 17 45 24 -12
3578 -12 -48 -46 -45 -68 -92 -76 -59 -26 7 -17 -41 -71 -101 -62 -22 15 4 -36 -77 -77 -78 -118 -159 -139 -119 -59 1 -1 -3 -45 -88 -127 -167 -195 -143 -91 -39 -6
3566 -6 26 26 25 24 23 14 6 -3 -12 10 31 28 26 13 0 28 55 23 -9 16 40 12 -17 -5 7 -46 -99 -128 -157 -145 -133 -145 -158 -173 -189 -204 -220 -175 -130 -85 -41
3553 -41 -30 -20 -9 1 6 11 17 22 -15 -53 -17 19 0 -19 -63 -106 -108 -111 -114 -117 -94 -72 -49 -27 -39 -51 -63 -75 -33 9 50 92 112 131 151 170 134 99 63
3541 63 28 45 63 80 98 92 87 58 28 19 9 -41 -91 -141 -190 -151 -111 -92 -72 -52 -32 39 110 59 -40 -117 -113 -69 -25 -45 -65 -29 8 3 -1 -6 -10 15 39
3529C9j5o5n7K3J5J5M5M5j1j2K1K0K0K1K8K9j2j2NMn1n2l8l9L5L5j6j6j6j5j3j3j2j3L6L7
3518eL6L6k2k2m7m6M2M2j5j5q5q5j2j3J0J0L4L5J8J9M3M3N3N3J3J3mnmnpppqj1j2j1j1poL4
3505F2L4m5m5k1k0j7j8J6l4n5K6O1J3j6j6j9j8K8K8j2j3NNNNJ7J6p3p2M7M6PORRQRkklkkk
3492d5K2K3K1K2j8j9m0m0L3L3MNk0k0j1j1J3J3j8j8OOK8K7j3j3lmk8k8oom7m7j7j7L4L4N5
3480a10k7m9%L2L3L6L5K4K5l3l2ppopj4j5j4j5J3J3L7L7j8j8K2K3k5k6k5k5J1J0J1J1MNMN
3468h2QQQQLMLLN2N1k2k2K0K0k1k1kjkjLLML%%m1m0n7n8j7j6K4K4j6j6L4L4L4L4j8j8K3K3
3454d0NOONq0q0RRk4k3L2L3J1J1j3j3J4J4J7J7qM0N8k2k1k1M6M7k1k0k1k1RQRRk3k2J8J9J6
3441eJ7qpK8K9j3j2J9J8k3k2l2l1M1M1m2m2J4J5k8k8J3J2LKM3M3qqm8m8j7j7j6j7LMMLj8j9
$$ plain form
3529 39 24 -41 -98 -75 -60 -45 0 45 34 22 43 63 83 104 132 161 149 137 142 146 95 43 5 -34 1 36 20 4 -12 -27 -40 -53 -65 -78 -42 -5
3518 -5 31 67 45 23 -24 -70 -28 14 -1 -16 -101 -186 -198 -211 -201 -191 -157 -122 -104 -85 -42 1 54 107 120 133 129 124 120 115 108 101 94 86 75 63 52 41 34 28 62
3505 62 96 51 6 -15 -35 -52 -70 -54 -88 -143 -117 -56 -43 -59 -75 -94 -112 -84 -56 -68 -81 -76 -71 -66 -61 -44 -28 -101 -173 -126 -80 -73 -67 -58 -49 -41 -32 -34 -36 -39 -41 -43 -45
3492 -45 -23 0 21 43 25 6 -34 -74 -41 -8 -4 1 -19 -39 -50 -61 -48 -35 -53 -71 -65 -59 -31 -4 -17 -30 -33 -37 -65 -93 -99 -105 -152 -199 -216 -233 -199 -165 -110
3480 -110 -137 -186 -186 -154 -121 -85 -50 -26 -1 -34 -66 -73 -80 -86 -93 -107 -122 -136 -151 -138 -125 -88 -51 -69 -87 -65 -42 -67 -93 -118 -143 -132 -122 -111 -100 -96 -91 -87 -82
3468 -82 -74 -66 -58 -50 -47 -43 -40 -37 15 66 44 22 42 62 41 20 18 17 15 14 17 20 24 27 27 27 -14 -54 -111 -169 -186 -202 -178 -154 -170 -186 -152 -118 -84 -50 -68 -86 -63 -40
3454 -40 -35 -29 -23 -18 -98 -178 -169 -160 -184 -207 -175 -142 -131 -120 -133 -146 -132 -118 -101 -84 -92 -52 6 -16 -37 -58 -12 35 14 -6 -27 -48 -39 -31 -22 -13 -36 -58 -40 -21 -5
3441 -5 12 4 -3 25 54 41 29 48 66 43 21 -11 -42 -1 40 -2 -44 -30 -15 -43 -71 -58 -46 -43 -41 2 45 37 29 -19 -67 -84 -101 -117 -134 -131 -127 -123 -120 -138 -157
3429a57ONL5L5noj6j5j6j5MMNML5L6L5L5M2M2j5j5j9j9n9o0k0k1k0k1K6K6K6K6M8M8K4K4j3
3417E9j4p0p0J0J0J0J0J6J7J6J7l2l2l2l2K7K7K7K7k5k4k4k5K1K0K1K1k8k7j4L4M6M6K1K2
3406G6ln2r2m3L2L2P0P0Rp3n4ol1l1n2lKN2P8L1l7l6j7O4O5j5l5l6o5j7J3J2lln5oL0L0N7
3394d2N8K4K5j6j6m5m4K9K8J1J0j4j4JJl7l6MN3P4pl7J2k1k1m6m6k1k2k8k9K5K5K4k4m3L8
3382a67K1K0N3Nk1k1n1lK5K5K8K8MMMMkjN2N2Rm0m0Q%jn1n1k0K8KJJ7J6pqqrL1L2M3M3KKJ7
3368G5J7m2r0m1RL1L2%m8j7j8k0K7JJM5M6L3j6k3k2mlK3k5k4K3JJMMj8j9J4l5p8LP0K2j0j1
3355h2J0J1j6j6j6j6J3J2J3J2K7K6j0j1j8L0K5K5J9k9l2J6rn8k8k7ooooN1N0K7K6k5k5KN0
3344Cj1n9n3n3kjN0Jk0k1NN4Q3Q2M5l6n7q%%N7N8jn0j8L1m0m0l1l1n9rll%%OPOOj2j1j2j1
$$ plain form
3429 -157 -151 -146 -111 -76 -81 -87 -103 -118 -134 -149 -145 -141 -136 -132 -97 -61 -26 9 51 93 78 63 44 25 -34 -94 -114 -135 -155 -176 -150 -124 -98 -72 -24 24 48 72 59
3417 59 45 -25 -95 -85 -75 -65 -55 -39 -22 -6 11 -21 -53 -85 -117 -90 -63 -36 -9 -34 -58 -82 -107 -86 -66 -45 -24 -52 -79 -93 -59 -13 33 54 76
3406 76 73 21 -71 -114 -82 -50 20 90 99 26 -28 -34 -65 -96 -148 -151 -149 -97 -19 12 -25 -61 -78 -14 51 36 1 -35 -100 -117 -104 -92 -95 -98 -153 -159 -129 -99 -42
3394 -42 16 40 65 49 33 -12 -56 -27 1 12 22 8 -6 -5 -4 -41 -77 -73 -20 54 47 10 22 1 -20 -66 -112 -133 -155 -183 -212 -187 -162 -138 -162 -205 -167
3382 -167 -146 -126 -73 -68 -89 -110 -161 -164 -139 -114 -86 -58 -54 -50 -46 -42 -44 -45 7 59 68 28 -12 -4 -4 -5 -56 -107 -127 -99 -97 -96 -79 -63 -70 -78 -86 -95 -64 -32 11 54 56 58 75
3368 75 92 50 -40 -81 -72 -41 -9 -9 -57 -74 -92 -112 -85 -84 -83 -38 8 41 25 2 -20 -24 -27 -4 -29 -53 -30 -29 -28 -24 -20 -38 -57 -43 -78 -156 -153 -83 -61 -71 -82
3355 -82 -72 -61 -77 -93 -109 -125 -112 -100 -87 -75 -48 -22 -32 -43 -61 -31 -6 19 38 9 -23 -7 -16 -74 -102 -129 -135 -141 -147 -153 -102 -52 -25 1 -24 -49 -47 3
3344 3 -8 -67 -120 -173 -175 -176 -126 -125 -145 -166 -161 -107 -24 58 103 67 10 2 2 2 59 117 116 66 48 79 39 -1 -32 -63 -122 -131 -134 -137 -137 -137 -131 -124 -118 -112 -124 -135 -147 -158
3330a58K8K9K8K8QQL2L3j1j0L0L0j9j9j8j9PPQPkkK3K2RRl1l1J1J1POLp7n6n6m7m8m0M2Q4
3317a34L6J2J1L0K9L0K9J6J5Pm1k3N7L4j5qn7n9j1LLL0L0J3J3k8k7RJ0J0J0m7m6K6K6O7O8
3306A28J0p0q8l8n8rK4K4K7K7J7J6N7N7N4N3q4q5n3n3MMJ7J6k4k3ppJ8J8kjk6k6J0J1L4L4
3294Fk9l0k9l0J1J1O3O2L5m7k8K0J6J5J8J9m3m3m6LL9M0ln2m2m3j9j8K2P0M7lk4k4p9p9j8
3283b32O2M5mM4M4M0M1J3J3J0J0on4j4L5RJ0J2J2POl4l4m4m3M3M2j8o7o7j8kkJJj6j5K4K5
3270a21L3L2qqj1j2J3J3K5K6k9k9n5qOOj0j0J4J3J9J8K4k4k3K5L6L5jjL6L6M4mm7m6n5oQP
3258c9J0RRJ0ONOOk9k9%M9M3M2M3M3Qm0n3n4n1n0klL4L4J3l6rqL4L4kn1k6K3M1M1M4M4j8j8
3245A13j8j8m2m2OOj2j3J5l4k2k3jjJ0J1O0N9pql2l2o0o1rrMN4K6K6M1M1K3k6l6J3L1L1NM
$$ plain form
3330 -158 -130 -101 -73 -45 -37 -29 3 36 25 15 45 75 56 37 19 0 7 14 22 29 27 25 48 70 79 88 57 26 37 48 55 61 64 -13 -69 -125 -172 -220 -260 -218 -134
3317 -134 -98 -86 -75 -45 -16 14 43 59 74 81 40 17 74 108 93 85 28 -31 -42 -39 -36 -6 24 37 50 22 -5 4 14 24 34 -13 -59 -33 -7 60 128
3306 128 138 68 -20 -58 -116 -125 -101 -77 -50 -23 -6 10 67 124 178 231 147 62 9 -44 -40 -36 -19 -3 -27 -50 -57 -64 -46 -28 -30 -31 -57 -83 -73 -62 -28 6
3294 6 -23 -53 -82 -112 -101 -90 -27 35 70 23 -5 15 31 46 64 83 40 -3 -49 -46 -7 33 30 -22 -64 -107 -126 -144 -122 -52 -5 -8 -32 -56 -135 -214 -232
3283 -232 -170 -125 -129 -85 -41 -1 40 53 66 76 86 80 26 12 47 56 66 78 90 97 103 69 35 -9 -52 -9 33 15 -52 -119 -137 -139 -141 -140 -139 -155 -170 -146 -121
3270 -121 -88 -56 -64 -72 -83 -95 -82 -69 -44 -18 -47 -76 -131 -139 -133 -127 -137 -147 -133 -120 -101 -83 -59 -83 -106 -81 -45 -10 -11 -12 24 60 104 100 53 7 -48 -54 -46 -39
3258 -39 -29 -20 -11 -1 5 10 16 22 -7 -36 -36 13 56 98 141 184 192 152 99 45 -6 -56 -58 -61 -27 7 20 -16 -25 -33 1 35 33 -18 -44 -21 20 61 105 149 131 113
3245 113 95 77 35 -7 -1 5 -7 -20 -5 -39 -61 -84 -85 -86 -76 -65 -5 54 47 39 7 -25 -85 -146 -155 -164 -160 -106 -80 -54 -13 28 51 25 -11 2 33 64 69 73
3233G3J0l8k3K6K3k6RROOk3k3k3k3k2k3k3k3J2J1J1J2J4J5J4J5m8m7k6K2K9K9N3N3K9k0k1
3221D9K9qqk9k9o5o4J6J6j1j2L8L7K1K1M9%m7m6jjk9l0M9M9J9k9kkk1k1k1k1K9K9k0k0RQR
3209f0Q%J%%M4M4l6l7j6j7m0m0l0l0l0l0j4j3L4L5Q4Q3N9N9k3k3k3k4j8j8j8j8j8j8j9j8j5
3197a95j6j5j6M8M8M8M9M5M6mlNNONl2l2J8J7j%%%MNMNkkkjj4j4j3j4J0J1l8l8j6j6L3L3R
3183c0J0RJ0ONm3m3K0J9nnk6k7K2K2K1K1K0K1L5L6j3j3p8p7k9k9L6L6J1J2M8M9%jj7j7L1L2
3171G9ooooo4o4j6j5kkk6k6J6J7l3l2j5j4O6O6J7J6o5o5L1L1N6N5l4l3l4l3j6j6L3L2N0N1
3159a3JKl8l8j3j4qrl2l3L0K9j9j9l0l1ooK8K9MMj3j3L6L5llmlKKJKj6j7j6j7RJ0RRL3L2L3
3145g4L2M1M1pql9l8RJ0k4k4K4K4K9K9NMk8k9N2N2J3J4o8o8k9l0N2N2J6J5l3l2l2l2pqJ3J3
$$ plain form
3233 73 83 45 22 48 71 45 54 63 69 75 52 29 6 -17 -39 -62 -85 -108 -96 -85 -74 -62 -48 -33 -19 -4 -52 -99 -125 -103 -74 -45 8 61 90 70 49
3221 49 78 70 62 33 4 -61 -125 -109 -93 -104 -116 -78 -41 -20 1 50 50 3 -43 -44 -45 -74 -104 -55 -6 13 -16 -18 -20 -41 -62 -83 -104 -75 -46 -66 -86 -77 -69 -60
3209 -60 -52 -52 -51 -51 -51 -7 37 1 -36 -52 -69 -109 -149 -179 -209 -239 -269 -283 -296 -262 -227 -143 -60 -1 58 35 12 -11 -35 -53 -71 -89 -107 -125 -143 -162 -180 -195
3197 -195 -211 -226 -242 -194 -146 -98 -49 -4 42 38 35 40 45 51 56 24 -8 10 27 26 26 26 26 30 35 39 44 42 40 38 37 23 9 -4 -18 -8 3 -35 -73 -89 -105 -72 -39 -30
3183 -30 -20 -11 -1 5 10 -33 -76 -56 -37 -42 -47 -73 -100 -78 -56 -35 -14 6 27 62 98 85 72 -6 -83 -112 -141 -105 -69 -58 -46 2 51 51 50 33 16 47 79
3171 79 73 67 61 55 -9 -73 -89 -104 -106 -108 -134 -160 -144 -127 -160 -192 -207 -221 -155 -89 -72 -56 -121 -186 -155 -124 -68 -13 -47 -80 -114 -147 -163 -179 -146 -114 -64 -13
3159 -13 -12 -10 -48 -86 -99 -113 -121 -130 -162 -195 -165 -136 -155 -174 -204 -235 -241 -247 -219 -190 -186 -182 -195 -208 -172 -137 -140 -143 -147 -150 -148 -146 -145 -143 -159 -176 -192 -209 -200 -190 -181 -172 -139 -107 -74
3145 -74 -42 -1 40 33 25 -14 -52 -43 -33 -57 -81 -57 -33 -4 25 30 34 6 -23 29 81 94 108 40 -28 -57 -87 -35 17 33 48 15 -17 -49 -81 -88 -96 -83 -70
3133g0l5l5MNMNN6N6k5k5k6k6J9K0J9l0o0L8K2k6j8j7N8N7k4k4J6J6J7J6K7K8MLj3j3o1o2
3122a00j7j8O4O3Q6Q6k8k7m4m4NNQQm1m0lkK1K2k0j9K9L0k6k6k6k6o1o1K0J9K1K1K1K1k3k3
3110a25k3k3MLLMjkjjM5M5M5M6j6j5j6j5l4l3m3N4M6lj3j2o5L1N5N5j6o5o8L0L8L8K0K1k9
3098c6k8K1K0m6m6LKK0K0K0K0lmlmPPPQj1j0L9L8l7l7l7l7QRQRPPPPk9k8K0K0O0N9k1k1kk
3084A1kkl8l7M3M3JJ%JllllPPPPqqqpM1M2p1p2POOPJ6J7%m8n1L1L0L1j0j1n8n9NNONJ2J2J2
3069h3J3rrrrk3k3k3k3K4K5K5K4K7K7J0l8k2N8N9k3l2J6L2L2k2k2k2k2jjj%JJKJm8m8j8O3
3056i1Q4Kk3K5J0J1l5l6j2j2j3j2LLLKL7L7L7L6K0K0o2o1K3K4K3K4j6j6j6j6j1j1j1j1k0k0
3044h1K9K8MNMMJ3J4J3J3klkk%J%Jm8m7J%k0k0k1k0LLN2N2J3J4J3J3n1n2llJ3J2J2J2rrrj0
$$ plain form
3133 -70 -105 -140 -136 -131 -127 -122 -66 -10 -35 -60 -86 -112 -93 -73 -54 -84 -144 -106 -84 -110 -128 -145 -87 -30 -54 -78 -62 -46 -29 -13 14 42 46 49 36 23 -38 -100
3122 -100 -117 -135 -71 -8 78 164 136 109 65 21 26 31 39 47 6 -34 -37 -39 -18 4 -16 -35 -6 24 -2 -28 -54 -80 -141 -202 -182 -163 -142 -121 -100 -79 -102 -125
3110 -125 -148 -171 -167 -164 -161 -157 -158 -160 -161 -162 -117 -72 -27 19 3 -12 -28 -43 -77 -110 -153 -99 -53 -56 -69 -81 -146 -115 -60 -5 -21 -86 -154 -124 -86 -48 -28 -7 -36
3098 -36 -64 -43 -23 -69 -115 -112 -110 -90 -70 -50 -30 -33 -37 -40 -44 -37 -30 -23 -15 -26 -36 3 41 4 -33 -70 -107 -99 -90 -82 -73 -66 -59 -52 -45 -74 -102 -82 -62 -2 57 36 15 13 11
3084 11 9 7 -31 -68 -25 18 19 20 20 21 18 15 12 9 16 23 30 37 29 21 13 6 47 89 18 -54 -47 -41 -35 -28 -12 5 5 -43 -94 -63 -33 -2 -12 -23 -81 -140 -135 -130 -124 -119 -107 -95 -83
3069 -83 -70 -79 -88 -97 -106 -129 -152 -175 -198 -174 -149 -124 -100 -73 -46 -36 -74 -96 -38 21 -2 -34 -18 14 46 24 2 -20 -42 -43 -44 -45 -45 -44 -43 -41 -40 -88 -136 -154 -91
3056 -91 -7 -5 -28 -3 7 18 -17 -53 -65 -77 -90 -102 -99 -96 -93 -91 -54 -17 20 56 76 96 34 -27 -4 20 43 67 51 35 19 3 -8 -19 -30 -41 -61 -81
3044 -81 -52 -24 -20 -15 -11 -7 6 20 33 46 44 41 39 37 37 38 38 39 -9 -56 -55 -55 -75 -95 -116 -136 -133 -130 -78 -26 -13 1 14 27 -24 -76 -79 -82 -69 -57 -45 -33 -42 -51 -60 -70
3030g0K2K3K2K2m6m6L5L5RRRQkln1n1j5j5j4j5j6j6L2L3J1J1J2J1j1j0j1j1j6j7j7j7N2N3
3018f1N2N2m2m2m2m1j1j1o0o0L1L0L1L0KKKKK4K3k5k6L2L1L2L1l4l5J4J4N2N2k9k9j2j2j2
3007d5j2J8J8o2o3ooJ8J8L5L5J1J1kkk6k7mln3n2j3j2L6L6l2l1J7J7K4K3K3K3L4L4L3L4k0
2995B7k0k0k0L7L8j2j1jjkjM7M7kkl1l1l1l0L6L7J2J2m3m3OOOPm2m2M6M5K2K1o6o6J5J5J5
2982b0J4J5J4j5j6j5j6n4n5K6K6K1K0K1K1KLm7m6k4k3k4k4K0J9k6k6p6k8M1J21J45O4KK%J
2971F3%JRRQRo4o5J7J7N1N1l0l0kkkjNNm3m4mmmP7L6j3J9J9NNm4m4k8k7k8k8k5k5K3K4k1k0
2957a45MLM0M0rrJ7J7ppj2j2J2J3QRQQL0K9j9j9KKKKkklkl7l6l7l7K1K0K1K0l0l0l0l0ppq
2943b09pK8K7K7K7rj0j0j0J0J0N8N8l0k9k9k9k0j9L0K9%%%%J2J2O0O0K0K1k0k0POj7j8n2n2
$$ plain form
3030 -70 -48 -25 -3 19 -27 -73 -38 -3 6 15 24 32 30 27 -24 -75 -90 -105 -119 -134 -150 -166 -134 -101 -90 -79 -67 -56 -67 -77 -88 -99 -115 -132 -149 -166 -114 -61
3018 -61 -9 43 1 -41 -83 -124 -135 -146 -206 -266 -235 -205 -174 -144 -142 -140 -138 -136 -112 -89 -114 -140 -108 -77 -45 -14 -48 -83 -69 -55 -3 49 20 -9 -21 -33 -45
3007 -45 -57 -39 -21 -83 -146 -152 -158 -140 -122 -87 -52 -41 -30 -32 -34 -60 -87 -91 -94 -147 -199 -212 -224 -188 -152 -184 -215 -198 -181 -157 -134 -111 -88 -54 -20 13 47 27
2995 27 7 -13 -33 4 42 30 19 18 17 15 14 61 108 106 104 73 42 11 -19 17 54 66 78 35 -8 -2 4 10 17 -25 -67 -21 24 46 67 1 -65 -50 -35 -20
2982 -20 -6 9 23 8 -8 -23 -39 -93 -148 -122 -96 -75 -55 -34 -13 -11 -8 -55 -101 -125 -148 -172 -196 -176 -157 -183 -209 -285 -313 -272 -151 -6 58 60 62 62 63
2971 63 63 64 73 82 90 99 35 -30 -13 4 55 106 76 46 44 42 40 39 44 49 6 -38 -42 -46 -50 27 63 50 69 88 93 98 54 10 -18 -45 -73 -101 -126 -151 -128 -104 -125 -145
2957 -145 -141 -138 -98 -58 -67 -76 -59 -42 -49 -56 -68 -80 -68 -55 -47 -38 -30 -22 8 37 18 -1 1 3 5 7 5 3 0 -2 -39 -75 -112 -149 -128 -108 -87 -67 -97 -127 -157 -187 -194 -201 -209
2943 -209 -216 -188 -161 -134 -107 -116 -126 -136 -146 -136 -126 -68 -10 -40 -69 -98 -127 -147 -166 -136 -107 -107 -107 -107 -107 -95 -83 -23 37 57 78 58 38 45 51 34 16 -36 -88
2931h8k8k8J8J9M2M2L7L7L6L7j4j5l9l8r3r4k0k0M1M0J7J6J4J4j0j0JKKKnoooK0J9M4M4PO
2919C7n0m9nmK0K0M2M2l0l0k3k2k2k3M0L9L9M0m0m0JJk7k6J4J3RRl2l2k4k4J7J6M2M2JJn0
2907f8n0k6k6J3J3J2J3j3j3qqK0J01P7mk9k9POJ0J0j5j4j3j4j3j3K7K8K7K8lllllllkJ6J6
2894D5J7J6o5o6rqK8K8k8k8J1J2m6m5k9k9n4n3M3M3J8J9jjK3K4K4K5K5K5L4L4J0Rkkm2m2m8
2882h5m7opJ8J9J8J9j7j8j7j8J6J5J5J6nmk9k9L0K9j1j1j2j3M5M4K2K2klool0l0qqJ6J7oo
2869g3J8J8qpqql5l4l5l5ppN0M9k4k4M8M9jkk5k6L0L0L0L0K8K8K9K8m0l9m0m0jjjkJ6J5J5
2856a2J5l4l4l4l4RQL3L3M9M8l3l3l8l8j4j3j7j6L2L3K1K2k7k7poM4R3L2j6j0j0j0rn8n8o
2845a22ollK7P5P5K7o2o2o2o2l2J8J4J5Q4Q4kn0j7j6o8o9N7N6QQj8j7L1L1K6K7K7K7j7j7k0
$$ plain form
2931 -88 -116 -144 -126 -107 -65 -23 14 51 87 124 110 95 56 18 -75 -169 -189 -209 -168 -128 -111 -95 -81 -67 -77 -87 -86 -84 -82 -80 -85 -91 -97 -103 -83 -64 -20 24 31 37
2919 37 -13 -62 -67 -71 -51 -31 11 53 23 -7 -30 -52 -74 -97 -57 -18 21 61 21 -19 -18 -17 -44 -70 -56 -43 -34 -25 -57 -89 -113 -137 -120 -104 -62 -20 -19 -18 -68
2907 -68 -118 -144 -170 -157 -144 -132 -119 -132 -145 -153 -161 -141 -40 37 33 4 -25 -18 -12 -2 8 -7 -21 -34 -48 -61 -74 -47 -19 8 36 33 30 27 24 21 18 15 13 29 45
2894 45 62 78 13 -53 -62 -70 -42 -14 -42 -70 -59 -47 -93 -138 -167 -196 -250 -303 -260 -217 -199 -180 -181 -182 -159 -135 -111 -86 -61 -36 -2 32 42 51 49 47 5 -37 -85
2882 -85 -132 -138 -145 -127 -108 -90 -71 -88 -106 -123 -141 -125 -110 -95 -79 -84 -88 -117 -146 -116 -87 -98 -109 -121 -134 -89 -45 -23 -1 -3 -6 -12 -18 -48 -78 -86 -94 -78 -61 -67 -73
2869 -73 -55 -37 -45 -52 -60 -68 -103 -137 -172 -207 -214 -221 -171 -122 -146 -170 -122 -73 -74 -76 -101 -127 -97 -67 -37 -7 21 49 78 106 66 27 -13 -53 -54 -55 -56 -58 -42 -27 -12
2856 -12 3 -31 -65 -99 -133 -124 -116 -83 -50 -1 47 14 -19 -57 -95 -109 -122 -139 -155 -123 -90 -69 -47 -74 -101 -108 -114 -70 23 55 39 29 19 9 0 -58 -116 -122
2845 -122 -128 -131 -134 -107 -32 43 70 8 -54 -116 -178 -210 -192 -178 -163 -79 5 3 -47 -64 -80 -148 -217 -160 -104 -96 -88 -106 -123 -92 -61 -35 -8 19 46 29 12 -8
2833hj9mn3n2mmnK3K3L8L8j1j1k2k2K6K7j9j8OOL3L2L3L3l1l1j2L6L9rn5pLLONOOOOj5j5M
2819A1N2M5mk1k2o7o7j8j8JJK6K6N2N2LMm8m7L3L3j5j5j5j6j7j7j7j8l9m0RJ0rqqqM6M6M7
2807e7M6j4j4j4j4J8J7ppm1m2PPL5L5j3j3j0rP2P2J2J3l6l6qrqrM8M7l3l4j8j8o2o2l8M3P8
2794g6P9M5M6o8o8m5m5k1k1j1j1L8L7N7N6k4k4qrj1j2j7o5o0K2N1N1PQJ2J2L6L6J4J3J4J3
2783E1k7k7k7k7j6j6K8K7J2p0p0J1P1P0K8K7KLm6m6n2n2L0K9K5K6j6j5k8k8RRj0n8p7NK3K4
2771a98K9K8M7M7m2m2J5J5k5k5J2J3N3N3RRm8m7L1L1L1L1J8J7J8J7l1l2l1l1rrj0rj1j2j2
2760a00j2POOPJJKJllmlK0K1M4M5K6K7J6o6o2o3j1j2K5K4K1K1Jm8o6J5O9O9j6j5J3J3L7L7
2747I1RQo4o5l4l4l4l4m2m3J5J4J6J5M1M0j8j8OOj5j6j6j5M7M7OPK0K0K1K0J2J2J3J2L3L3
$$ plain form
2833 -8 -27 -31 -84 -136 -140 -144 -149 -126 -103 -65 -27 -38 -49 -71 -93 -67 -40 -59 -77 -71 -65 -32 0 33 66 35 4 -8 28 67 58 3 -4 -1 2 8 13 19 25 31 37 22 7 11
2819 11 63 108 104 83 61 -6 -73 -91 -109 -108 -107 -81 -55 -3 49 52 56 8 -39 -6 27 12 -3 -18 -34 -51 -68 -85 -103 -142 -182 -173 -163 -172 -180 -188 -196 -150 -104 -57
2807 -57 -11 -25 -39 -53 -67 -49 -32 -39 -46 -87 -129 -122 -115 -80 -45 -58 -71 -81 -90 -18 54 66 79 43 7 -1 -10 -18 -27 21 68 35 1 -17 -35 -97 -159 -197 -154 -76
2794 -76 3 48 94 26 -42 -87 -132 -153 -174 -185 -196 -158 -121 -64 -8 -32 -56 -64 -73 -84 -96 -113 -178 -238 -216 -165 -114 -107 -99 -87 -75 -39 -3 11 24 38 51
2783 51 24 -3 -30 -57 -73 -89 -61 -34 -22 -92 -162 -151 -80 -10 18 45 47 50 4 -42 -94 -146 -116 -87 -62 -36 -52 -67 -95 -123 -114 -105 -115 -173 -250 -245 -222 -198
2771 -198 -169 -141 -94 -47 -89 -131 -116 -101 -126 -151 -139 -126 -73 -20 -11 -2 -50 -97 -66 -35 -4 27 45 62 80 97 66 34 3 -28 -37 -46 -56 -65 -76 -88 -100
2760 -100 -112 -105 -99 -93 -86 -85 -84 -82 -81 -84 -87 -91 -94 -74 -53 -9 36 62 89 105 39 -23 -86 -97 -109 -84 -60 -39 -18 -17 -65 -131 -116 -47 22 6 -9 4 17 54 91
2747 91 100 108 44 -21 -55 -89 -123 -157 -199 -242 -227 -213 -197 -182 -141 -101 -119 -137 -131 -125 -140 -156 -172 -187 -140 -93 -87 -80 -60 -40 -19 1 13 25 38 50 83 116
2735A16n6n5o6o5PPL1L0m3m2M4M4M4M4j%M0M1l2l2K4K5K2K3l4l4j6j5j2j3RN8L8m2o1j3k1
2724fk0j8j8OOK8K8LLPPL1L1j4j5j4j5J0J0J0J0ooooL8L8n2n1m3m2kkK8K8K7K8j2j2J2J2J
2711D2Kl8l9L6L7L6L6j4j5j4j5k7k7k8k7K7K6N1N1M9M9q8q9n2n1L7L7M3M2KKm1m0l2q1r4j3
2699b20K7K7M6M5JKl5q2o1K0P5P5L2L1k0k0k0k0NNL0L0l1l1J7J8kkk2k1j7O4J9o3o0j2L6L7
2687i7J1J0L5L5j0j1L8L9M4M5mmJ8J7j5r5p9l1j4j4M8M9P2P3j6j6j5j6j1j1o0n9k4k3k4k4
2676a39N0M9K6K5n4n3rqJ1l8l2M9M7M7K8K8kkn1n1K6K6k3k3L7L6j2j3k0k0NMj9k0j9k0m2m2
2664b18OOK2K1P1P0M9M9l2l2l7l6l6l7j8j8L0L1J1J0J1J1L8L8j1j0l6l6J3J3m7m7m4m4M0Q8
2653a11M0ro8o9J3J2l1J7J00J01Qm0l8l7qrJ6J6J9K0ln0l1l0o1j2P3P3K4K4O2J4p3p3L4L3
$$ plain form
2735 116 60 5 -61 -126 -119 -112 -81 -51 -94 -136 -92 -48 -4 40 39 39 79 120 88 56 80 105 127 150 116 82 66 51 39 26 35 93 131 89 28 15 -6
2724 -6 -26 -44 -62 -56 -50 -22 6 9 12 19 26 57 88 74 59 45 30 40 50 60 70 64 58 52 46 84 122 70 19 -24 -66 -68 -70 -42 -14 13 41 29 17 29 41 42
2711 42 44 6 -33 3 40 76 112 98 83 69 54 27 0 -28 -55 -28 -2 49 100 149 198 110 21 -31 -82 -45 -8 35 77 79 81 40 0 -32 -113 -207 -220
2699 -220 -193 -166 -120 -75 -74 -72 -107 -189 -250 -230 -155 -80 -48 -17 -37 -57 -77 -97 -92 -87 -57 -27 -58 -89 -72 -54 -56 -58 -80 -101 -118 -54 -35 -98 -158 -170 -134 -97
2687 -97 -86 -76 -41 -6 -16 -27 11 50 94 139 135 131 149 166 151 56 -23 -54 -68 -82 -34 15 87 160 144 128 113 97 86 75 15 -44 -68 -91 -115 -139
2676 -139 -89 -40 -14 11 -43 -96 -105 -113 -102 -140 -172 -123 -76 -29 -1 27 25 23 -28 -79 -53 -27 -50 -73 -36 0 -12 -25 -45 -65 -60 -56 -75 -95 -114 -134 -176 -218
2664 -218 -212 -206 -184 -163 -92 -22 27 76 44 12 -25 -61 -97 -134 -152 -170 -140 -109 -98 -88 -77 -66 -28 10 -1 -11 -47 -83 -70 -57 -104 -151 -195 -239 -199 -111
2653 -111 -71 -80 -148 -217 -204 -192 -223 -206 -106 -5 3 -37 -75 -112 -120 -129 -113 -97 -78 -58 -61 -111 -142 -172 -233 -245 -172 -99 -75 -51 11 25 -48 -121 -87 -54
2642e4L3L3m1m1m4NO6O7J8J9J7l1m9n0k1K8P8P8N1Lj9j8n5n4l7J3J9l0K5K6MLk0k0p3p2j9
2631a62L0J6J6k7k6j5L5N5N6OONOQQPQKJjjRl9m0RPPOPln2k8K1M3M4J1p0j5j5k1k0L8L8j1
2617d1j1kkK3K2J7J7nmJN1K8n2l9l8J3J3onLN1L7m5k3K6J7J6k0k1m1m1J5J6k0j9K2K1j1j2
2605d9j1j2M1M1j5j6j1j2J3J3L6L5L6L6q5q6k9k9K4K4J8J9J9o3q4l6K0K0K3K3j1j1J3J4N0
2594d2N1ooJ7J7J7J7j4j4j4j4k3k3k2k3LKK7K7LLn3n4O1O1NMk2k3J8J7j8j7n8n9MLM4M4M3
2582a7M2j4j4l7l8L6L5k0k1MMM6M6QQJ1O0J6l2p4j23o9k1NMQQRRL3L3K2K1j9j9L7L7J3J3j0
2569D0j1j0j1k1k2Om3n2n2k6K2O0N9L2j5rqj1j2K2K2N9N9L2j6j5o4l2J7j4j4j1j1j2j1QQP
2557e0QN4N5M3l8r1r2pP4J7l2k7K2KKNNL6L6rn7l6l5l6l5l7J2N7N8M4M4P2K3l6l6j4j5k2k2
$$ plain form
2642 -54 -21 12 -29 -70 -114 -109 -43 24 42 61 78 47 -2 -52 -73 -45 33 111 162 165 146 128 73 19 -18 -5 14 -16 9 35 39 42 22 2 -71 -143 -162
2631 -162 -132 -116 -100 -127 -153 -168 -133 -78 -22 -16 -10 -5 1 9 17 24 32 34 35 34 33 42 3 -37 -28 -21 -14 -8 -1 -4 -56 -84 -63 -20 24 35 -35 -50 -65 -86 -106 -68 -30 -41
2617 -41 -52 -54 -56 -33 -11 6 23 18 14 15 66 94 42 3 -35 -22 -9 -15 -20 -17 34 71 26 3 29 46 62 42 21 -20 -61 -46 -30 -50 -69 -47 -26 -37 -49
2605 -49 -60 -72 -31 10 -5 -21 -32 -44 -31 -18 18 53 89 125 40 -46 -75 -104 -80 -56 -38 -19 0 -63 -147 -183 -163 -143 -120 -97 -108 -119 -106 -92 -42
2594 -42 9 3 -3 14 31 48 65 51 37 23 9 -14 -37 -59 -82 -79 -77 -50 -23 -20 -17 -70 -124 -63 -2 3 7 -15 -38 -20 -3 -21 -38 -96 -155 -151 -148 -104 -60 -17
2582 -17 25 11 -3 -40 -78 -42 -7 -27 -48 -44 -40 6 52 60 68 79 139 155 123 49 -74 -143 -164 -159 -155 -147 -139 -130 -121 -88 -55 -33 -12 -31 -50 -13 24 37 50 40
2569 40 29 19 8 -13 -35 -29 -72 -124 -176 -202 -180 -120 -61 -29 -44 -53 -61 -72 -84 -62 -40 19 78 110 94 79 15 -17 0 -14 -28 -39 -50 -62 -73 -65 -57 -50
2557 -50 -42 12 67 110 72 -19 -111 -118 -44 -27 -59 -86 -64 -62 -60 -55 -50 -14 22 13 -44 -80 -115 -151 -186 -223 -211 -154 -96 -52 -8 64 87 51 15 1 -14 -36 -58
2545e8k2k2J7J8J7J8j1j2qql2J7J4J5JJJJK2K2j8j8n3n4j4j3L9L9J5J5NNM5M6L2L3k4k4n7
2533a0n7o2J8M8M7mmLMK8K8k3k2o4o3n0m9M0M0N6N6J5J5L5L5oon9n9j9j9k2k2J8J9L6L6J1
2521c2J2QQQQk7k8J4J3PQL2L2o7o6OPLLK8K8O3O3j3j2k4p3o6J5OPj3j3LKLKppqpK1K1j9j9
2508g0PPo6o6n3n4N2N2J2J3M7M8N6k5lml3l4K4K3JKKJQPL2L2L4L3k3k3k6k6kkj7j7m1m1l4
2495a67l3M0Q8N9k3j4j5nnnnN1N2N1N2k3k3p9p9k8k8k8k8JJm0l9k1k1K0J9Q0Q0K4K3ooN1N1
2483B2o2o3k1k2j1j0M6M6N0N1k3k2l9l9o3J8K5k3j5j6j9k0k0k0qrJ6J6O1O1L6L7p2p1L4L3
2472a16P0O9k0k0l7l7K0K0M1M1Q2Q2j8j7m1m2l5l6l6l6n1n0OOM1M0M1M1pppprqrrj%k6k5N5
2459e2N5kkk7k7k7k7M3M3M3M4o5o4J6O5J6o5k3K7K4k5m2m3k6k5K2K3K7K7K7K7K7K7k2k1m6
$$ plain form
2545 -58 -80 -102 -85 -67 -50 -32 -43 -55 -63 -71 -103 -86 -72 -57 -56 -55 -54 -53 -31 -9 -27 -45 -98 -152 -166 -179 -140 -101 -86 -71 -66 -61 -16 30 62 95 71 47 -10
2533 -10 -67 -129 -111 -63 -16 -20 -24 -21 -17 11 39 16 -6 -70 -133 -183 -232 -192 -152 -96 -40 -25 -10 25 60 54 48 -11 -70 -89 -108 -130 -152 -134 -115 -79 -43 -32
2521 -32 -20 -12 -4 4 12 -15 -43 -29 -16 -9 -1 31 63 -4 -70 -64 -57 -54 -51 -23 5 68 131 118 106 82 9 -57 -42 -36 -29 -42 -55 -52 -50 -47 -45 -52 -59 -67 -74 -53 -32 -51 -70
2508 -70 -63 -56 -122 -188 -241 -295 -243 -191 -179 -166 -119 -71 -15 -40 -43 -47 -80 -114 -90 -67 -66 -64 -62 -61 -53 -46 -14 18 52 85 62 39 13 -13 -15 -17 -34 -51 -92 -133 -167
2495 -167 -200 -160 -72 -13 -36 -50 -65 -70 -75 -80 -85 -34 18 69 121 98 75 -4 -83 -111 -139 -167 -195 -194 -193 -233 -272 -293 -314 -294 -275 -195 -115 -91 -68 -74 -80 -29 22
2483 22 -40 -103 -124 -146 -157 -167 -121 -75 -25 26 3 -19 -58 -97 -160 -142 -117 -140 -155 -171 -190 -210 -230 -250 -258 -267 -251 -235 -174 -113 -77 -40 -112 -183 -149 -116
2472 -116 -46 23 3 -17 -54 -91 -71 -51 -10 31 113 195 177 160 119 77 42 6 -30 -66 -117 -167 -161 -155 -114 -74 -33 8 1 -6 -13 -20 -29 -37 -46 -55 -56 -56 -82 -107 -52
2459 -52 3 1 -1 -28 -55 -82 -109 -66 -23 20 64 -1 -65 -49 16 32 -33 -56 -29 -5 -30 -72 -115 -141 -166 -144 -121 -94 -67 -40 -13 14 41 19 -2 -48
2448d8m6j4o2j1P1P0P0K5K4k7k7k8p6m8L2Om4QN6L8j1J9K0K7K8n4n4k1k2LKJ%%JKKJKMNMM
2434f8J9J9onn2n2J2R4L0j9j0j1K7K7K7K7RRl9m0O5O4j7j7p3p4n0m9poP4P5M4M4K0K0m0m0
2423C1m0m0LLN1N2O1O1mq4l9J1k2k2j5j4j5j5K7K7K7K7k8k7K1K2k9k9K0J9JJk3k3n6n6l1l1
2411a78jkM8M8j9j8L0L1K9K9N4N4nnl0k9l1l2M9N0J4J4l5l5k2k3m8m7M4M4K0J9j9k0j9j9q
2399f8rqqK6K6KKRQm0m0j1j2j2j2j5j5j4j5j7j6j6j7L0L1L0L0K5K5K5K5M9N0l2l2noP1P0O0
2387A74k1q9q9l2l2qqj6j5QQM1M1M1M1j2j2j3j2k2k2k3k2K0K1k9k8O3O2n1n1l8l9M2M2L4L4
2375a2j4j4n1n1O2O3M6M5l5l5l8l9J0J0j5j5RJ0k2k2k2k2OOL0L0j4j4O8O7K2K3k6k6m9m8L3
2364d4L2QQm1m1l9l8RJ0K6K6k3k3K2K2K2K1OOOOmlllQ0Q0L2L1k1k1k1k1o8o9k0k0J2J2j3j2
$$ plain form
2448 -48 -94 -108 -170 -181 -110 -40 30 55 79 52 25 -3 -79 -127 -95 -89 -133 -125 -69 -31 -42 -23 -3 24 52 -2 -56 -77 -99 -96 -94 -93 -93 -93 -92 -90 -88 -87 -85 -81 -76 -72 -68
2434 -68 -49 -30 -36 -41 -93 -145 -133 -39 -9 -28 -38 -49 -22 5 32 59 68 77 38 -2 63 127 110 93 20 -54 -104 -153 -160 -166 -92 -17 27 71 91 111 71 31
2423 31 -9 -49 -46 -43 8 60 121 182 178 94 55 66 44 22 7 -7 -22 -37 -10 17 44 71 43 16 37 59 30 1 21 40 41 42 19 -4 -60 -116 -147 -178
2411 -178 -179 -181 -133 -85 -104 -122 -92 -61 -32 -3 51 105 100 95 65 36 5 -27 22 72 86 100 65 30 8 -15 -63 -110 -66 -22 -2 17 -2 -22 -41 -60 -68
2399 -68 -77 -85 -93 -67 -41 -39 -37 -28 -20 -60 -100 -111 -123 -135 -147 -162 -177 -191 -206 -223 -239 -255 -272 -242 -211 -181 -151 -126 -101 -76 -51 -2 48 16 -16 -21 -27 44 114 174
2387 174 153 64 -25 -57 -89 -97 -105 -121 -136 -128 -120 -79 -38 3 44 32 20 7 -5 -27 -49 -72 -94 -74 -53 -82 -110 -47 15 -36 -87 -125 -164 -122 -80 -46 -12
2375 -12 -26 -40 -91 -142 -80 -17 29 74 39 4 -34 -73 -63 -53 -68 -83 -74 -64 -86 -108 -130 -152 -146 -140 -110 -80 -94 -108 -40 27 49 72 46 20 -29 -77 -44
2364 -44 -12 -4 4 -37 -78 -117 -155 -146 -136 -110 -84 -107 -130 -108 -86 -64 -43 -37 -31 -25 -19 -23 -26 -29 -32 48 128 160 191 170 149 128 107 39 -30 -50 -70 -58 -46 -59 -71
2351g1rrM0L9K8K9k1k1OOONj9k0j9k0rrrrJ5J5J5J5RJ0K8K8P1k6n3n2L9L8m2m2j3j2L6L6K1
2338E0K2K5k4j7j7k0k1n4n4K6K7K3K4K0K1Qm0j3j3J6J5J2J3L2j5l7l7J9J9k6k7RN7N4k7k8
2327B2K2L8L7rrJ2J2J4l3n8rnmkjN4N5J9o1q0q0q5mN0JL3L4ppk6p4o3j4MMO4O4M3oo6o6J2
2314a75J2L3L2QQRRJ1J2JM9K2K2k3k2k0j9j7L1N3N3k9k9k6k5p5k7k9l0J2J1N7N7K0k9k9J9
2303f3k4k4m8%MMN2N2N8J0m9r8j8j8k1k1PQPQJ1J0L5L5J2J3k9k8l1l2RRM1M1M1M1O0O0k8k9
2290F7o4o3ppj6j6QRj1j0L0L0rrrqOPM7M8mnm4m5O1O1MMK7K7j3j4m5m6nnm5m4M5M4J1J1j4
2277a1j3OPPOnmnnk4k3k4k4ool1l1KKN8N8N6N5jkk4k5m8m9nmL6L7M8M9K5K5n6n7J7J6MLk2
2263A2k1n0n1OOO6O7k3k3M7M7rj0n5n4p6p6j5L4N8J0L1L1N5Pk1k0k4k3j0rJM9O8J8qpL3L3
$$ plain form
2351 -71 -80 -89 -49 -10 18 47 26 5 11 17 23 28 9 -11 -30 -50 -59 -68 -77 -86 -71 -56 -41 -26 -17 -7 21 49 120 94 41 -11 28 66 24 -18 -31 -43 -7 29 50
2338 50 72 97 73 56 39 19 -2 -56 -110 -84 -57 -34 -10 10 31 39 -1 -14 -27 -11 4 16 29 61 46 9 -28 -9 10 -16 -43 -34 23 77 50 22
2327 22 44 82 119 110 101 113 125 139 106 48 39 34 30 28 27 81 136 155 94 14 -66 -151 -155 -105 -104 -71 -37 -44 -51 -77 -151 -214 -228 -224 -220 -156 -92 -49 -55 -121 -187 -175
2314 -175 -163 -130 -98 -90 -82 -73 -64 -53 -41 -40 9 31 53 30 8 -12 -31 -48 -17 36 89 60 31 5 -20 -95 -122 -151 -181 -169 -158 -101 -44 -24 -53 -82 -63
2303 -63 -87 -111 -159 -159 -155 -151 -99 -47 11 21 -28 -126 -144 -162 -183 -204 -197 -189 -182 -174 -163 -153 -118 -83 -71 -58 -87 -115 -146 -178 -169 -160 -119 -78 -37 4 64 124 96 67
2290 67 3 -60 -67 -74 -90 -106 -98 -89 -100 -110 -80 -50 -59 -68 -77 -85 -79 -72 -25 23 19 14 -30 -75 -14 47 51 55 82 109 96 82 37 -9 -14 -19 -64 -108 -63 -19 -8 3 -11
2277 -11 -24 -18 -11 -4 2 -3 -7 -12 -17 -41 -64 -88 -112 -118 -124 -155 -186 -184 -182 -124 -66 -10 45 44 42 18 -7 -55 -104 -109 -113 -77 -40 8 57 82 107 51 -6 11 27 31 34 12
2263 12 -9 -59 -110 -104 -98 -32 35 12 -11 36 83 74 64 9 -45 -121 -197 -212 -178 -120 -110 -79 -48 7 14 -7 -27 -51 -74 -84 -93 -92 -43 25 43 35 28 61 94
2251I4k9p7n3n2j5j5L3L4L4L4oonoP5P4J6J5J6l2r1r0n9j0J9J9J2J2k6k5K4P3M8JJJl2p9m5
2239a18m4M2M2K5K4K1K1J2l6m6m7j3L5P5K7j9k0MN3L1j7j4j4M0pp0o9LLK5K5Km5m0m0k8K1
2228a56M7M7L2j7QPJ3l6qrL7L7l6l6j4j4j4j4l6l6K1K0J0J0R4M5m7m8k6k6P7P6K1K0opl0l1
2216b5PQj7j7J2J3J3J2k3k3k4k3mmmnJ9J9J8J9L2L2k5k5l2l1RRj0j0l4l4j1j1K9L0P6P6k8
2204A3p7r0PK3K2M1M1MLKN2M0n6m7JM1M0L5L5l7l8rj0rrm8m8m9m8J5J5J8J8lM5N4m3r9lJ0
2191a48RL6L5k1k1RJ0J0J0j%%jl3l3K3K4M1M1l2l1j9j9K1K2K0K0mlj2j2l7l6k4k5J6J6L9L9
2179g1O6J8n0n1j2j3k3k3n0kO1O0K3K3%jK7K7n0jkn0opj0j0mnj1L8M4mj5j4l2l2RRM4M4M7
2167ikK0J9J7J6NMNMj7j6MNl6q5j7j6JKL0k0k8k8K6K6k6k6k6k6M4M4K0K0L8L8lkk7k7k7k7
$$ plain form
2251 94 65 -12 -65 -117 -132 -147 -114 -80 -46 -12 -18 -24 -29 -35 40 114 130 145 161 129 38 -52 -111 -121 -102 -83 -71 -59 -85 -110 -86 -13 35 36 37 38 6 -73 -118
2239 -118 -162 -120 -78 -53 -29 -8 13 25 -11 -57 -104 -117 -82 -7 20 1 -19 -15 38 69 52 38 24 64 57 -13 -82 -79 -76 -51 -26 -24 -69 -109 -149 -177 -156
2228 -156 -109 -62 -30 -47 -39 -32 -19 -55 -63 -72 -35 2 -34 -70 -84 -98 -112 -126 -162 -198 -177 -157 -147 -137 -43 2 -45 -93 -119 -145 -68 8 29 49 43 36 6 -25
2216 -25 -18 -10 -27 -44 -32 -19 -6 6 -17 -40 -64 -87 -91 -95 -99 -104 -85 -66 -48 -29 3 35 10 -15 -47 -78 -69 -60 -70 -80 -114 -148 -159 -170 -141 -111 -35 41 13
2204 13 -64 -154 -147 -124 -102 -61 -20 -16 -13 -11 41 81 25 -22 -21 20 60 95 130 93 55 46 36 27 18 -30 -78 -127 -175 -160 -145 -127 -109 -112 -67 -13 -56 -155 -158 -148
2191 -148 -139 -103 -68 -89 -110 -101 -91 -81 -71 -72 -72 -72 -73 -106 -139 -116 -92 -51 -10 -42 -73 -92 -111 -90 -68 -48 -28 -32 -35 -47 -59 -96 -132 -156 -181 -165 -149 -110 -71
2179 -71 -5 13 -37 -88 -100 -113 -136 -159 -209 -211 -150 -90 -67 -44 -44 -45 -18 9 -41 -42 -44 -94 -100 -107 -117 -127 -131 -136 -147 -109 -65 -69 -84 -98 -130 -162 -153 -144 -100 -56 -9
2167 -9 -11 9 28 45 61 66 70 75 79 62 46 50 55 19 -66 -83 -99 -98 -96 -66 -86 -114 -142 -116 -90 -116 -142 -168 -194 -150 -106 -86 -66 -28 10 7 5 -22 -49 -76 -103
2154a03N4N4K5k4l3l4l3l3j4L6O1O2pn6p4PQPj7L1L1j6J3J4oopoL8L7K7k1o7j7J9k9n1n1q
2142a89M0KKLN0J1J1J4J4KJKJJ6J5J6J5ONONmlmmJ3J3k7k8nmnnl7l7j2j3L2L2O7O7mq4k8N3
2128B1J0J0rj0l6l6l6l6OPM6M7K5K5m8m8L6L5J1J2j1j0j1j0n6n6J%L6L5k1k1QQP6P6Op6p5
2116f9NK0J9J%J9J9p0p0RRL3L4j7j6j6j6L2L3L2L3L6L6L6L6n2n3MMJ1J1J0J1RRQR%jn7n7J
2103C5%qn7o0K0K4K3k0j01k8N3N4N4J9J9j1j1j1j1j2j2j2j2J0J0o3o3m0m0M9M9M8M8QPJ9K0
2091cJ9J9K2K2q3q4kln4n4k9N2OOK9L0K9L0m6m5J1J1QRM9M9ooJ8J8l0k9mnppppL3L3L3L3l5
2078B3l5l5l5QQPQl6l6l2l1j7O4M6lK0J9J6J7MLMMj6j6RQN7N7J%k8k8k8k7mmL7L7l2l1l1l2
2065h0lmL7L7k5k5jjj1j2j2j2K3K2K3K2m3m3NOL6L7L7L7m3m4r1r2l5l5M7M6J1J2j3j3M6M6
$$ plain form
2154 -103 -49 5 30 6 -27 -61 -94 -127 -141 -105 -44 18 11 -45 -119 -112 -104 -97 -114 -83 -52 -68 -55 -41 -47 -53 -60 -66 -28 9 36 15 -52 -69 -50 -79 -130 -181 -189
2142 -189 -149 -147 -145 -142 -92 -81 -70 -56 -42 -40 -39 -37 -36 -20 -5 11 26 32 37 43 48 44 41 37 33 46 59 32 4 -1 -5 -10 -15 -52 -89 -101 -114 -82 -50 17 84 80 -4 -32 21
2128 21 31 41 32 22 -14 -50 -86 -122 -116 -109 -63 -16 9 34 -14 -62 -26 9 20 32 21 11 0 -10 -66 -122 -121 -121 -85 -50 -71 -92 -84 -76 0 76 82 6 -69
2116 -69 -64 -44 -25 -24 -24 -5 14 -56 -126 -117 -108 -75 -41 -58 -74 -90 -106 -74 -41 -9 24 60 96 132 168 116 63 67 71 82 93 103 114 123 132 140 149 149 148 91 34 35
2103 35 35 27 -30 -90 -70 -46 -23 -43 -144 -172 -119 -65 -11 8 27 16 5 -6 -17 -29 -41 -53 -65 -55 -45 -108 -171 -211 -251 -202 -153 -105 -57 -49 -42 -23 -3
2091 -3 16 35 57 79 -4 -88 -90 -93 -147 -201 -230 -178 -172 -166 -137 -107 -78 -48 -94 -139 -128 -117 -109 -100 -51 -2 -8 -14 4 22 -8 -37 -41 -46 -53 -60 -67 -74 -41 -8 25 58 23
2078 23 -12 -47 -82 -74 -66 -59 -51 -87 -123 -155 -186 -203 -139 -93 -96 -76 -57 -41 -24 -20 -17 -13 -9 -25 -41 -32 -24 33 90 91 91 63 35 7 -20 -24 -28 9 46 14 -17 -48 -80
2065 -80 -83 -87 -50 -13 -38 -63 -64 -65 -76 -88 -100 -112 -89 -67 -44 -22 -65 -108 -103 -97 -61 -24 13 50 7 -37 -128 -220 -255 -290 -243 -197 -186 -174 -187 -200 -154 -108
2053a08J01Lp1p1L6L6J4J5mmn9L7N9J0KJk6k6n7n6qqN7N8L3L3%jj%MMNMl8l9qrn9L7R1M3k7
2040Ck8ooPPm2m2J1J2l7l8N9N8J0J0n6n6qpO5O5O5O5K8K7k1k1o4o4j6j6K5K4k4k4J6J6l2l3
2027f8nnnnMNm4m3jkM8M7kjkjM2M3J8J8%%m9m8opJ8J8j6j7j7j7j4j4j4j4J9K0M3M4NNm4m3
2014a07J8J8ooP0P0m4m3J5J6M0L9J4J3l5l5j6j7PPk5k6K3K3m4m5L6L6LLk2k1mmK0K0j9j9N
2002d2Nkln1L0N3NJ0N8K2K2n3n3j07n8k0O0O9K0MNM1M2ppl4l5q3q3nmJ9K0n0n0L0L1K1K2K1
1989a37K1KKKLK8K9K8K9QQQQrrM0L9JKJJj3j4j4j4k1k1k2k1NONNmmmmJ8J9l1l0l7l6M4M4O
1975c3ONOkkjkk3k3k3k3l0k9N2N2j6j6j6j6n6n6n6n6P9Q0L0L1k2k3N3N2J1q6l8N9O2O2O9O8
1963A29k4k4k4k4J4J4J4J4J7J7J7J7qqqqm4m4MMK3K2k6k5k6k6k6k6PPPQK8K8k0k0j6j5j6j6
$$ plain form
2053 -108 -7 -4 -75 -146 -110 -74 -60 -45 -49 -53 -112 -75 -16 -6 -4 -3 -29 -55 -112 -168 -176 -184 -127 -69 -36 -3 -3 -4 -5 -5 -1 3 8 12 -26 -65 -73 -82 -141 -104 -13 30 3
2040 3 -25 -31 -37 -30 -23 -65 -107 -96 -84 -121 -159 -100 -42 -32 -22 -78 -134 -142 -149 -84 -19 46 111 139 166 145 124 60 -4 -20 -36 -11 13 -11 -35 -19 -3 -35 -68
2027 -68 -73 -78 -83 -88 -84 -79 -123 -166 -167 -169 -121 -74 -76 -77 -79 -80 -38 5 23 41 41 41 -8 -56 -62 -69 -51 -33 -49 -66 -83 -100 -114 -128 -142 -156 -137 -117 -74 -30 -25 -20 -64 -107
2014 -107 -89 -71 -77 -83 -13 57 13 -30 -15 1 41 80 94 107 72 37 21 4 11 18 -7 -33 -10 13 -31 -76 -40 -4 -1 2 -20 -41 -45 -49 -29 -9 -28 -47 -42
2002 -42 -37 -39 -42 -93 -63 -10 -5 5 63 85 107 54 1 -106 -164 -184 -124 -55 -35 -31 -26 15 57 50 43 9 -26 -109 -192 -197 -201 -182 -162 -212 -262 -232 -201 -180 -158 -137
1989 -137 -116 -114 -112 -110 -107 -79 -50 -22 7 15 23 31 39 30 21 61 100 101 103 104 105 92 78 64 50 29 8 -14 -35 -30 -24 -19 -14 -18 -22 -26 -30 -12 7 -24 -54 -91 -127 -83 -39 -33
1975 -33 -27 -22 -16 -18 -20 -21 -23 -46 -69 -92 -115 -145 -174 -122 -70 -86 -102 -118 -134 -190 -246 -302 -358 -279 -199 -169 -138 -160 -183 -130 -78 -67 -153 -191 -132 -70 -8 61 129
1963 129 105 81 57 33 47 61 75 89 106 123 140 157 149 141 133 125 81 37 41 45 68 90 64 39 13 -13 -39 -65 -58 -51 -44 -36 -8 20 0 -20 -36 -51 -67 -83
1951h3K0K0J9K0NOONRQp2p3qqqrRRk4K4Q8ro4o4L5L6L6L6J7J7J7J8j7j8o5o6k4k4N7N7M0M0
1937A8L9M0L4L3q0q0l0k9l0k9K7K7k1k1L2L2L2L3m1m1m1m1opop%J%%M7M7M7M7j2j2j2j2j8
1925d0j9j8j8QPQQk1k1O1O0J9J8j2r3n1L0K7K8rqqrj2j2j3j2k3k2K6K6J7J7J7J6rj0j0j0j4
1913h1j4L4L5L2L1j6j7j3j3j3j3lmlmj0j1j1j0k4k4K5K5k1k1k0k1M5M6M5M6K7K8K7K7k5k6
1902E5k5k6l5l5K2K1j5j5j5j5NNNOllk7k7PPn0m9J9J9onj6j7K4K4L0L0NNK5K5JJK6K7K6K7
1888F3OPPOj0j0j1j0ooJ8J8o2o3qrNm3K5J06Q6L9klk9l0k9l0m1m1m1m1K5K6N0N0K8K9j2j2
1876D5l8l8j4j4QQL2L3J7J7l9m0M8M9k5k4onnok9k9k8k9j9j8j8j8P4P4K1K0j9L0M8l3m3m3
1864e6QRNOo2o1o3J9J7J6K3P1P2K3j3j2j6j5J0J0j5j4j8j7n7n8j5j6M2M1j3j4K7K7K1K1K1
$$ plain form
1951 -83 -63 -43 -24 -4 1 7 13 18 27 35 -37 -110 -118 -126 -134 -143 -134 -125 -149 -125 -37 -46 -110 -174 -139 -103 -67 -31 -14 3 20 38 21 3 -62 -128 -152 -176 -119 -62 -22 18
1937 18 57 97 131 164 84 4 -26 -55 -85 -114 -87 -60 -81 -102 -70 -38 -6 27 -14 -55 -96 -137 -143 -150 -156 -163 -163 -162 -162 -162 -115 -68 -21 26 14 2 -10 -22 -40
1925 -40 -59 -77 -95 -87 -80 -72 -64 -85 -106 -45 15 34 52 40 -53 -104 -74 -47 -19 -28 -36 -44 -53 -65 -77 -90 -102 -125 -147 -121 -95 -78 -61 -44 -28 -37 -47 -57 -67 -81
1913 -81 -95 -61 -26 6 37 21 4 -9 -22 -35 -48 -51 -55 -58 -62 -72 -83 -94 -104 -128 -152 -127 -102 -123 -144 -164 -185 -140 -94 -49 -3 24 52 79 106 81 55
1902 55 30 4 -31 -66 -44 -23 -38 -53 -68 -83 -78 -73 -68 -62 -65 -68 -95 -122 -115 -108 -158 -207 -188 -169 -175 -180 -196 -213 -189 -165 -135 -105 -100 -95 -70 -45 -44 -43 -17 10 36 63
1888 63 69 76 83 89 79 69 58 48 42 36 54 72 10 -53 -61 -70 -65 -108 -83 23 109 148 146 143 114 84 55 25 -16 -57 -98 -139 -114 -88 -38 12 40 69 57 45
1876 45 7 -31 -45 -59 -51 -43 -11 22 39 56 17 -23 25 74 49 25 19 14 9 3 -26 -55 -83 -112 -131 -149 -167 -185 -111 -37 -16 4 -15 15 63 30 -13 -56
1864 -56 -48 -39 -34 -28 -90 -151 -214 -195 -178 -162 -139 -68 4 27 14 2 -14 -29 -19 -9 -24 -38 -56 -73 -130 -188 -203 -219 -177 -136 -149 -163 -136 -109 -88 -67 -46
1853d6K2l1l2mM4N2Mk0j9k7K2L5L5nmk9k9o1o1l8M4P4K4J%M4M5k9k8j2j2j2j1nnJ7J7M2on2
1840e6n2o0o1o3j5N6N6KKk0j9L9Q7N4Nn3n4K8K7K4K5k5p4j7L1jjKJJ3J3J3J3O1O2K0K1K6K5
1828A35K8k0n6n7jM8M6ll1q0l6J4p4p4m7m6j8L1QRJ1J1M0M0M0L9J9J8ook7k8J3J3n3n3L6L6
1817h1J3J3J0J1mn3l5M5N9k2k3K5KLONN6N5J6J5j7j8m1m1n1n1K3K2N0N0l9l9pom2m2k5N5L5
1804f8L5L4L4L4L4o9o9MMm3m3m3m3M1M1M0M1l3l2QPL0L0L0L0NOn1n2j8j8j8j9m5m5J2J2N2
1793a45N3l6l7M8M8K3K3L8L8n1n1k3k3J8J8jjM0M0K3K3K3K3RRl2l1k5k6m9n0j5j4j5j5J0R
1781a24J2l6j4j4N6N6M9M9L8rj4L6N6Qk3k3M6M7k7k6l3J7M1pn0m9l2l3K5K5J9K0Om2k9k8q
1770a5pppJ7J8ooonk2k1j%M6ll0k9m9jJ3J3K6K6K6K6L5L5k4p2k0L0N0Kk0k0J7J7j6j7L7L7
$$ plain form
1853 -46 -24 -55 -87 -91 -47 5 9 -11 -30 -57 -35 0 35 30 26 -3 -32 -93 -154 -192 -148 -74 -50 -49 -49 -5 40 11 -17 -29 -41 -53 -64 -69 -74 -57 -40 2 -4 -56
1840 -56 -108 -168 -229 -292 -307 -251 -195 -193 -191 -211 -230 -191 -104 -50 -45 -98 -152 -124 -97 -73 -48 -73 -147 -164 -133 -134 -135 -133 -132 -119 -106 -93 -80 -19 43 63 84 110 135
1828 135 163 143 87 30 29 77 123 120 89 9 -27 -13 -87 -161 -208 -254 -272 -241 -233 -224 -213 -202 -162 -122 -82 -43 -24 -6 -12 -18 -45 -73 -60 -47 -100 -153 -117 -81
1817 -81 -68 -55 -45 -34 -38 -91 -126 -81 -22 -44 -67 -42 -40 -37 -31 -26 30 85 101 116 99 81 40 -1 -52 -103 -80 -58 -8 42 3 -36 -43 -49 -91 -133 -158 -103 -68
1804 -68 -33 1 35 69 103 34 -35 -31 -27 -70 -113 -156 -199 -158 -117 -77 -36 -69 -101 -93 -86 -56 -26 4 34 39 45 -6 -58 -76 -94 -112 -131 -176 -221 -209 -197 -145
1793 -145 -92 -128 -165 -117 -69 -46 -23 15 53 2 -49 -72 -95 -77 -59 -60 -61 -21 19 42 65 88 111 120 129 97 66 41 15 -34 -84 -99 -113 -128 -143 -133 -124
1781 -124 -112 -148 -162 -176 -120 -64 -15 34 72 63 49 85 141 149 126 103 149 196 169 143 110 127 168 161 111 62 30 -3 22 47 66 86 92 50 21 -7 -15
1770 -15 -22 -29 -36 -19 -1 -7 -13 -19 -24 -46 -67 -68 -68 -22 -25 -55 -84 -133 -134 -121 -108 -82 -56 -30 -4 31 66 42 -30 -50 -20 30 32 12 -8 9 26 10 -7 30 67
$$ [...]
-1512a4
##END=		$$ NMR SPECTRUM
##END=		$$ LINK
