##TITLE=	13C
##JCAMP-DX=	6.0	$$ MestReNova 14.3.3-33362
##DATA TYPE=	LINK
##BLOCKS=	1    
##ORIGIN=	Mestrelab Research S.L.
##OWNER=	hrzepa
##$MNOVA/METADATA=	(DOCUMENT,BASE64)
eyJuYW1lIjoiRG9jdW1lbnQgMSIsInBhZ2VzIjpbeyJpdGVtcyI6WyIxIiAgICAgXX1dfQ==
##TITLE=	13C
##JCAMP-DX=	6.0	$$ MestReNova 14.3.3-33362
##DATA TYPE=	NMR SPECTRUM
##DATA CLASS=	XYDATA
##BLOCK_ID=	1
##ORIGIN=	Varian
##OWNER=	hrzepa
##NUMDIM=	1
##$MNOVA/METADATA=	(ITEM,BASE64)
eyJhbmdsZSI6MCwiYXhlcyI6eyJ4Ijp7Im1heCI6MjM0LjI2NDY1NzgxNzc5Nzc0LCJtaW4iOi0xNC4
yNjE1NDgyMzExMTU2NjF9LCJ5Ijp7Im1heCI6MTY4Ljk4MzE1MzM0MzIwMDY4LCJtaW4iOi0xNi41Nj
A2NjIxNTAzODI5OTZ9fSwicG9pbnRzIjpbeyJ4Ijo1MzIxLCJ5Ijo1ODM1fSx7IngiOjg3MjIsInkiO
jU4MzV9LHsieCI6ODcyMiwieSI6ODIwOH0seyJ4Ijo1MzIxLCJ5Ijo4MjA4fSx7IngiOjUzMjEsInki
OjU4MzV9XSwieiI6MH0=
##.OBSERVE FREQUENCY=	125.75317950000000167
##.OBSERVE NUCLEUS=	^13C
##.SOLVENT NAME=	cdcl3
##.PULSE SEQUENCE=	s2pul
##LONGDATE=	2019/05/18 17:20:05.000
##.ACQUISITIONMODE=	SIMULTANEOUS
##$ORIGINAL FORMAT=	Varian
##$MNOVA/SCALES_VERSION=	9
##$PARAMETER FILE=	(datafile, ASCII, /private/var/folders/bp/m_4195y96sx1d256lqvkcvym0000gq/T/PEi7Stn$TXWoxq57JS37pg/13C/fid, 0)
$$ 
##$PARAMETER FILE=	(header, BASE64, /private/var/folders/bp/m_4195y96sx1d256lqvkcvym0000gq/T/PEi7Stn$TXWoxq57JS37pg/13C/fid, 0)
AAAAAQAAAAEAAQAAAAAABAAEAAAABAAcAAAAyQAAAAE=
##$PARAMETER FILE=	(log, ASCII, /private/var/folders/bp/m_4195y96sx1d256lqvkcvym0000gq/T/PEi7Stn$TXWoxq57JS37pg/13C/log, 0)
$$ Sat May 18 17:20:07 2019: Experiment started
$$ Sat May 18 17:22:29 2019: BS 1 completed
$$ Sat May 18 17:24:40 2019: BS 2 completed
$$ Sat May 18 17:26:51 2019: BS 3 completed
$$ Sat May 18 17:29:02 2019: BS 4 completed
$$ Sat May 18 17:31:13 2019: BS 5 completed
$$ Sat May 18 17:33:24 2019: BS 6 completed
$$ Sat May 18 17:35:36 2019: BS 7 completed
$$ Sat May 18 17:37:47 2019: BS 8 completed
$$ Sat May 18 17:39:58 2019: BS 9 completed
$$ Sat May 18 17:42:09 2019: BS 10 completed
$$ Sat May 18 17:44:20 2019: BS 11 completed
$$ Sat May 18 17:46:31 2019: BS 12 completed
$$ Sat May 18 17:48:42 2019: BS 13 completed
$$ Sat May 18 17:50:53 2019: BS 14 completed
$$ Sat May 18 17:53:04 2019: BS 15 completed
$$ Sat May 18 17:55:16 2019: BS 16 completed
$$ Sat May 18 17:57:27 2019: BS 17 completed
$$ Sat May 18 17:59:38 2019: BS 18 completed
$$ Sat May 18 18:01:49 2019: BS 19 completed
$$ Sat May 18 18:04:00 2019: BS 20 completed
$$ Sat May 18 18:06:11 2019: BS 21 completed
$$ Sat May 18 18:08:22 2019: BS 22 completed
$$ Sat May 18 18:10:33 2019: BS 23 completed
$$ Sat May 18 18:12:44 2019: BS 24 completed
$$ Sat May 18 18:14:55 2019: BS 25 completed
$$ Sat May 18 18:17:07 2019: BS 26 completed
$$ Sat May 18 18:19:18 2019: BS 27 completed
$$ Sat May 18 18:21:29 2019: BS 28 completed
$$ Sat May 18 18:23:40 2019: BS 29 completed
$$ Sat May 18 18:25:51 2019: BS 30 completed
$$ Sat May 18 18:28:02 2019: BS 31 completed
$$ Sat May 18 18:30:13 2019: BS 32 completed
$$ Sat May 18 18:32:24 2019: BS 33 completed
$$ [...]
$$ wqinit 2 2 8 0 0 4 1 0 1 64
$$ 1 ""
$$ 0 
$$ wshim 4 2 4 0 0 2 1 1 1 64
$$ 1 "n"
$$ 15 "e" "f" "g" "n" "s" "0" "1" "2" "3" "4" "5" "6" "7" "8" "9" 
$$ wtfile1 2 2 15 0 0 3 2 1 1 64
$$ 1 ""
$$ 0 
$$ wtfile 2 2 15 0 0 3 1 1 1 64
$$ 1 ""
$$ 0 
$$ wtune 4 2 4 0 0 2 1 0 1 64
$$ 1 "st12"
$$ 11 "s" "t" "e" "i" "n" "o" "v" "1" "2" "3" "4" 
$$ xy 7 1 19 19 19 2 1 8192 1 64
$$ 1 681 
$$ 0 
$$ x3 7 1 19 19 19 2 1 8192 1 64
$$ 1 7587 
$$ 0 
$$ x2y2 7 1 19 19 19 2 1 8192 1 64
$$ 1 -284 
$$ 0 
$$ x4 7 1 19 19 19 2 1 8192 1 64
$$ 1 0 
$$ 0 
$$ xz2 7 1 19 19 19 2 1 8192 1 64
$$ 1 -1561 
$$ 0 
$$ xz 7 1 19 19 19 2 1 8192 1 64
$$ 1 6948 
$$ 0 
$$ y1 7 1 19 19 19 2 1 8192 1 64
$$ 1 797 
$$ 0 
$$ z3x 7 1 19 19 19 2 1 8192 1 64
$$ 1 476 
$$ 0 
$$ z2 7 1 19 19 19 2 1 8192 1 64
$$ 1 -2148 
$$ 0 
$$ yz2 7 1 19 19 19 2 1 8192 1 64
$$ 1 -2835 
$$ 0 
$$ yz 7 1 19 19 19 2 1 8192 1 64
$$ 1 -2906 
$$ 0 
$$ y4 7 1 19 19 19 2 1 8192 1 64
$$ 1 0 
$$ 0 
$$ z1 7 1 19 19 19 2 1 8192 1 64
$$ 1 -16454 
$$ 0 
$$ z0_ 1 1 19 19 19 2 1 73744 1 64
$$ 1 3440 
$$ 0 
$$ z1c 7 1 19 19 19 2 1 8192 1 64
$$ 1 -1044 
$$ 0 
$$ z2xy 7 1 19 19 19 2 1 8192 1 64
$$ 1 5183 
$$ 0 
$$ z2x2y2 7 1 19 19 19 2 1 8192 1 64
$$ 1 -2701 
$$ 0 
$$ z2c 7 1 19 19 19 2 1 8192 1 64
$$ 1 196 
$$ 0 
$$ z2x3 7 1 19 19 19 2 1 8192 1 64
$$ 1 0 
$$ 0 
$$ z3 7 1 19 19 19 2 1 8192 1 64
$$ 1 5809 
$$ 0 
$$ z2y3 7 1 19 19 19 2 1 8192 1 64
$$ 1 0 
$$ 0 
$$ z3c 7 1 19 19 19 2 1 8192 1 64
$$ 1 0 
$$ 0 
$$ z4y 7 1 19 19 19 2 1 8192 1 64
$$ 1 4212 
$$ 0 
$$ z4c 7 1 19 19 19 2 1 8192 1 64
$$ 1 0 
$$ 0 
$$ z3xy 7 1 19 19 19 2 1 8192 1 64
$$ 1 0 
$$ 0 
$$ z3x3 7 1 19 19 19 2 1 8192 1 64
$$ 1 0 
$$ 0 
$$ z3x2y2 7 1 19 19 19 2 1 8192 1 64
$$ 1 0 
$$ 0 
$$ z3y3 7 1 19 19 19 2 1 8192 1 64
$$ 1 0 
$$ 0 
$$ z3y 7 1 19 19 19 2 1 8192 1 64
$$ 1 1029 
$$ 0 
$$ z4 7 1 19 19 19 2 1 8192 1 64
$$ 1 -1120 
$$ 0 
$$ z4x2y2 7 1 19 19 19 2 1 8192 1 64
$$ 1 0 
$$ 0 
$$ z4x 7 1 19 19 19 2 1 8192 1 64
$$ 1 -13017 
$$ 0 
$$ z4xy 7 1 19 19 19 2 1 8192 1 64
$$ 1 0 
$$ 0 
$$ z8 7 1 19 19 19 2 1 8192 1 64
$$ 1 0 
$$ 0 
$$ z6 7 1 19 19 19 2 1 8192 1 64
$$ 1 -5568 
$$ 0 
$$ z5x 7 1 19 19 19 2 1 8192 1 64
$$ 1 0 
$$ 0 
$$ z5 7 1 19 19 19 2 1 8192 1 64
$$ 1 -12000 
$$ 0 
$$ z5y 7 1 19 19 19 2 1 8192 1 64
$$ 1 0 
$$ 0 
$$ z7 7 1 19 19 19 2 1 8192 1 64
$$ 1 339 
$$ 0 
$$ zx2y2 7 1 19 19 19 2 1 8192 1 64
$$ 1 698 
$$ 0 
$$ zoom 7 1 32767 0 0 4 1 0 1 64
$$ 1 0 
$$ 0 
$$ zxy 7 1 19 19 19 2 1 8192 1 64
$$ 1 -1576 
$$ 0 
$$ zx3 7 1 19 19 19 2 1 8192 1 64
$$ 1 4844 
$$ 0 
$$ zy3 7 1 19 19 19 2 1 8192 1 64
$$ 1 -2037 
$$ 0 
$$ 
##$PARAMETER FILE=	(text, ASCII, /private/var/folders/bp/m_4195y96sx1d256lqvkcvym0000gq/T/PEi7Stn$TXWoxq57JS37pg/13C/text, 0)
$$ 
$$ 
##XUNITS=	HZ
##YUNITS=	ARBITRARY UNITS
##FIRSTX=	29456.285383729999012
##LASTX=	-1793.2377791117969537
##DELTAX=	-0.476837158203125
##XFACTOR=	1
##YFACTOR=	0.0046882854082959321551
##FIRSTY=	-0.24113343656063079834
##MINY=	-1.1985567808151245117
##MAXY=	153.6210479736328125
##NPOINTS=	65536
##XYDATA=	(X++(Y..Y))
$$ [...]
15614e9J7J14ol0Kj3O8k3qlm7k1J2n2k7k3L6R6m4K0O2n6J2j00j4Q4O7q2j4J6r0mQ8R9r7n9
15597g9NlR5P2j19n7J6jm1P2J20j9p3k3Rl7P1LM9n0k0lP1K3n3k5r1L6Q9J4N0nj9j50oL2O1
15579A4l1k7NrmJ0J04q5LNl4J2L4Jln9j9OJ7N7n3Jr4P4JM4L0l4j9M9l4k8L7j3L0M1k2j6L3
15560B4P4r7p5Q2M1L4k9l8K4r6j1R6k6J3m2K5R2n8o3NQ6Ok0K8l4j5j5J4k5P7o5m9M1j10L0
15544g6OO7j1M3M4r6L9q0M2Q8l2m6l9jJll0o1jO9L6M2j6j5K2Mj8k0Kl6j14J8R2M3QN1ln7l9
15525g7k4OP4l5j4n8mP9k8l3O9N1L0j09k4J6J8J35j46N5K5L5n7J1L9q1K5K7Qp7J3L3RN3j12
15508f8Q2m5rK1jJ1L4q3p5P3J6J08L5l7o4k7KmO9L7J4k8j3k9K5k0M3l9o4R1K4p8o3J2J4LK3
15491a0J7L6k2j2Qj36N1k9o0L3O4k4K4N1J6N4j0q6k0M2Q5J9n6l8j1J4n7J3Lr6j5J45O2o0J1
$$ y = [-59, -42, 72, 66, 36, 38, 25, 93, 70, 62, 59, 12, -9, 3, -49, -76, -99, -63, 33, -11, 9, 71, 15, 27, -73, -87, -3, 64, -18, -32, -16, -106, -110, -22, 77, -20, -79, -74, -77, 18, 90, -29, -86, -70, -71, -112, -40, 80, 61, -12, -35, -26, -63, 8, 11, 60, 10, -10, -13, 58, 81, 28, 3, -88, -52, 37, 51, 101, 96, 77, -73, -79, -47, 14, -17, -44, -39, -48, -52, -42, 62, -23, -20, -15, -49, -37, -3, -2, -5, -64, -83, -77, -60, -3, -56, -55, -149, -75, -74, -30, 0, -34, -53, -4, -38, -66, -29, -42, -12, 29, 7, -9, 24, 98, 1, -74, 8, 49, 83, 54, 16, 40, -56, -67, 29, 3, 16, -26, -1, 91, 33, -30, -25, 61, 67, 47, 75, 41, 26, 11, 25, 0, 77, 12, -37, 4, -106, -76, -70, -3, -14, 29, 73, -23, 16, -64, -22, 66, 34, -12, -51, -52, -51, -54, -84, -145, -146, -77, -41, 1, -15, -30, -8, -4, -22, -42, -40, -76, -190, -172, -80, -37, -29, 22, 19, -38, -77, -101, -95, -21, -56, -70, -128, -132, -53, -81, -114, -45, 6, 36, -73, -97, -81, -63, 72, -74, -19, 6, 41, -16, -5, 34, -47, -22, 5, 13, -64, -51, -18, -9, 44, -68, 14, -31, -40, -19, -20, -9, 25, -58, -133, -60, -44, 64, 99, 62, -2, -29, -27, -31, 38, 75, 89, 61, 48, 19, 44, 24, 67, 28, -36, 55, 79, 1, -62, -50, -36, -33, -10, 7, 43, 21, 9, 17, -119, -68, -97, -157, -124, -60, -84, -60, -9, 7, 61, 51, -35, -55, -13, 72, 91, 35, -3, -14, 0, -57, -44, -41, -137, -152, -7, 55, -5, 6]
15474Flk2L3J4n8M8j26L0R7r2J4K2R8n6j13M6N9o0R9N1j09K8j2j3R0L7m2r6j5jL9%k3q3J9
15457i4M7J2M2m3m6m1J4P1l8jQ1l1N5J8K0mm2Qk3K4o5J21j21n5M5o2oJ02J5o1m5jJ28k5O2
15441F1j9M3n9k5k2j7kkJ7RKk0o3J74N7l8p4j5km2qK1j9O6J40q8m4R3K2j11m6L2l1mk6Pk9
15423f2N2l0O3P4p4K8j13N4N2N1O0j02r8j3Rn7L2K3M2O3m0p5K7l5O4K1pl1l0P7J8o4M3N1k7
15406D6j9L2l7Kk8l7p7M5J32Rj35M9J06j10n2O7M3N6J8j52k3j6Q9J6k9r3j8N9J0lK8L3m7K1
15390a5j10R3kn6j1M8O3o0J14qj16m2J5r1J89OrJj22NR6K8R4rq3l1J2M4q3L1P9j8m1r4K6j8
15373g5J6Q8Nnk9n8J2M7K0K0P5oq1j6J2K3P4l9M9L2j2J45L60M58j69m49k43j56o3M8J4l3L3
15357I7n4l3l4lk8l1j6L6L1Q1j3M3p1l7j6o1J27k7m6Pj2P6k1m4J41q6L9KJ5k4q3O4L9p3n9
$$ y = [6, 3, -19, 14, 28, -30, 18, -108, -78, 19, -73, -59, -37, 61, 5, -108, -62, -3, -63, 36, 87, -22, 6, -6, -19, 71, 108, 66, -30, -45, -46, -7, -7, -30, -113, -94, -47, -35, 7, -36, -82, -123, -109, -38, -76, -77, 4, -27, 28, 46, 66, 62, 20, 28, 5, 29, -36, 85, -36, -91, -46, -108, -114, -12, 3, -58, -103, -104, 24, -1, 61, 42, 85, 26, 1, -21, -38, -40, -42, -25, -16, -14, -34, -97, 77, 134, 96, 22, 7, 5, -37, -45, -24, -43, 23, 163, 75, 31, 124, 146, 35, -11, 21, -10, -14, -40, -33, -62, -10, -40, 23, 97, 23, 51, -62, -8, 44, 95, 155, 53, -45, -58, -49, -106, -74, -51, -9, 54, 14, -61, -34, -69, -5, 16, 9, -22, -52, 25, 43, -21, 22, 73, 46, 27, 59, 22, 24, -4, -41, -118, -73, 59, 68, -67, -18, 88, -22, -74, -7, 36, 92, 110, -42, -65, -81, 8, 24, -5, -98, -116, -57, -47, -50, -22, 11, -36, -15, -125, -32, -34, -90, -101, -53, 10, -50, 64, 56, -60, -102, -87, -178, 11, 17, 8, 9, -113, -108, -12, 16, 110, 101, 18, -13, -1, 43, -40, -9, 70, 52, 11, -83, -57, -75, -59, 29, 34, 29, 0, -58, -46, 1, 21, 41, 116, 110, 29, 13, 25, 48, 122, 83, 132, 164, 152, 297, 657, 1115, 946, 497, 254, 98, 35, 83, 97, 64, 97, 43, 10, -24, -27, -55, -86, -102, -66, -35, 46, 33, 76, 5, -32, -48, -109, 18, -9, -55, -48, -60, 16, -5, -49, 92, 6, 45, 47, 62, 38, -45, 19, 58, -15, -74]
15340g4k1N5L1j4q1J4j2M6N9M3m6J0o1Pl7O2q3j34O9kP3R4j0pm3r4Q2R8l8J1k5N0j05j7J07
15324Gk8j8J6L5N9q0m4L8K7q3L3O6J6q5j00j6P6P0pk0Pk1J37j50K6K7N0L2j06OP4j9p8J0J46
15307A03o4p7O2M2j00L9n9j08N7K8M9jL9o1KJ9l4K9N2J7r0j27J19M4J1K2L1l8l9J1N8o3l8
15291f5K5L9lK6J1n7M3N4p3n7K5M4j0j5Lj4L7q3l9P3Rj8P5k3O8J0o3q3l5l8R6Q8j4o0l2K0
15274c6L6P7n6j00O1J5J1o4N3p7KP5Jo9Q7lm0oM1M4j6j22J13k7o5m3M4J21J6k1J8n2j1l0K6
15258CJ1L8m1L0K0p5O5Krj7m7P3J9n0j4L8q8Q4nLRO4m2p3N2m1k6j30K5N0L9K4q0Q9RM0p9M2
15239A2K5j06J4K3K4k6m7J7R2j1r1r5J51J9p3O0Rj3j5K9K2M3M1m4m1L8Kj52J2J05mo9L6l2
15223d5M5J7p7P1j8l9n1L5L8L7KR0OjQj04J4j4n4j2P0K6r1mN7L0m3L3l6oJQk2L2rJ9j1ok1
$$ y = [-74, -95, -40, -9, -23, -104, -90, -102, -56, 3, 46, 0, 10, -51, -44, -81, -19, -102, -236, -167, -169, -96, -2, -12, -19, -62, -156, -74, 24, -14, -3, -28, 22, -83, -100, 7, -21, -39, -23, 12, 71, -9, -53, -15, 12, -71, -38, 28, 44, -41, -141, -157, -81, -11, -18, -38, -31, -52, 85, -65, -39, -12, 38, 70, -36, -30, 44, 25, -53, -43, 103, 39, -38, 24, 66, -34, 5, -54, -162, -105, -77, -28, -29, 10, -51, -49, -30, -64, -35, 17, 34, -56, -183, -64, -20, -9, 13, 44, 6, -33, -22, 36, -27, -65, -40, -1, -4, 22, 33, -24, 19, 73, 0, -57, -32, 12, 2, -13, -10, -24, 13, -70, -109, -36, -27, -45, 30, 7, 75, 85, 22, -61, -96, -134, -38, 50, 36, -24, -56, -36, 0, 77, 21, -79, -18, -3, 8, -56, -3, -80, -78, -3, -2, -71, 16, 13, -27, -33, 8, 52, 36, -86, 27, 0, -65, -108, -64, 57, 73, 52, 70, 18, 7, -23, 3, 14, 52, 11, 41, 61, -14, 51, 53, 44, 27, -20, 53, 72, 22, 8, 46, -42, 42, 37, 40, 49, 113, 71, -2, 50, 9, -17, -147, -122, -72, -33, -9, -89, 0, 9, 49, -30, 12, 37, -69, -55, -32, -8, -34, -81, -64, 28, 17, -74, -169, -18, 1, -72, -12, -3, -16, -31, -2, 20, 63, 104, 60, 19, 57, 59, -93, -81, 24, 20, -49, -13, -45, 0, 17, -60, 11, -7, -46, -97, -62, -24, 13, 15, 105, 111, 110, 118, 14, 28, 14, -40, -52, 18, 44, -47, -51, 6, 36, -7, 26, -10, -16, -15, -7, -29, 3, -6, 13, 2, -4, -25]
15205b5m9Q4lL2L7M%l6l6L5L4q7j5q6qJ5lL6l5L9RKN0N0J8p7l4J4O8Lj0j6L9p2p7P9P7p4q4
15186a02NK0L7Nm3KP1L8o8K1N8p1O1K1N2J6j6p0l9L0k6N4PJ5k6n2P9K6n8Jk7p8M9jl4N2MJ2
15168B5L0m0j8ml9O6J7o9j2k4nN2N5n0j4N3jL3o3j00j23P1J46k7k1K0J7OP1P3n4Km3r9n6J11
15151a4Q5p7k5M6L2m9m9K8N6J7k8k4l8J24j8l8m7nj5QO8m1L5K6k9J5Mj08M1L8n1rO5O5n0J8
15134E6j02l1l1J7J10O7j4l8L1j6p2J5M3k7L3M6o7n5O5j1L2Nl6O0j9k6J29o7k7K3o5j1l8J
15117b0O1j5Ml7R6Ln8o5j8Q9k4j1jn8L6N6M2k7l4n5k6R1omM7p2j7p7P1%K4P0k6M0M5l7p1L9
15099E5L4j1j6K5l4MQ5J05J5O7J81K73L25M32P1l25l96k99k20j96n8K4l9oL2J6m1j4M8L0m0
15084A27q5l4RJO8N2NL2n1r2jJ1m5RJ46KJ4j6kJ8q7o2Q7n1p3o3M7J4r5RJ12j6O9M9K2o1m8
$$ y = [-25, -74, 10, 7, 39, 76, 80, 80, 44, 8, 43, 77, -10, -25, -111, -119, -104, -107, -71, -106, -67, -58, -56, -6, 44, 62, -15, -49, -35, 33, 36, 26, 10, 49, -23, -100, -21, 56, -18, -102, -97, -77, -40, -35, -78, -76, -5, 33, -35, -14, 44, -27, 34, 55, 107, 123, 107, 37, -2, 28, 2, 56, 63, 78, 52, 0, 79, 105, 47, 48, 21, -57, -8, -9, -43, 9, 13, 25, 55, 15, -3, -7, -46, 20, 37, -32, -44, -68, -73, -21, 34, -16, -30, 23, 22, 55, -8, -108, -231, -160, -14, -41, -62, -42, -25, -19, 52, 125, 71, 73, 30, -69, -125, -14, 71, -6, -31, 15, 47, -2, -51, -23, 33, 50, 22, -2, -40, 84, 66, 28, -19, -24, -39, -31, 37, -4, 31, 57, 28, 43, 47, -61, -20, 18, -33, -42, 23, 88, 38, 56, -46, -77, -108, -91, 19, 86, 72, 34, 65, 49, -23, -8, 35, 8, 41, 87, 20, -35, 30, 19, 51, 56, 20, 80, 61, 35, 164, 97, 70, 93, 28, 17, -21, -20, 41, 26, 30, -7, 89, 92, 34, -31, -49, 40, 16, 5, 4, -54, -18, 38, 80, 53, 19, -36, -62, 29, 23, 19, 66, -6, -23, -100, -29, -29, -5, 65, 39, 79, 124, 87, 16, 55, 89, 78, 62, 87, 53, 57, 142, 247, 262, 329, 510, 783, 1108, 1540, 1611, 1286, 890, 591, 371, 175, 117, 141, 102, 96, 128, 144, 103, 89, 137, 167, 127, 42, 8, 17, 18, 86, 138, 143, 175, 124, 32, 31, 42, -3, 6, 152, 154, 168, 152, 150, 168, 81, 19, 106, 55, -18, -81, -34, -20, -115, -106, 6, -10, 59, 108, 130, 69, 21]
15067B1o6k9m6J3J09M1N9J3l9p0lJ6n5J2M1J08l0l5J9l0o3qJ8K0Jm1q7L5Rnj7R1J2J3M7l8
15050C6j6o3L7K2j2O9p0jl9oRR1L7J1n7M0o5J4j6j0j8l1R9m0j4jJ7m7J3Mq3P2L0nL0m1M2K8
15031F6m1rk8L6M2L7m4j27O7Mk8m6j7j8L7O3Pk0J3l7L8N1k6p9rk5P4n5N7n6M2MJ5j1L7n6j9
15014f1kM9QP8o0K2n7oJ05m2l8K5l6q6k0J19Q8j26l4O5K4k5J9j4kq3q8%J09qn6J73k3K7n7
14997a3p4NO5K9J4J3Pk1ol7p1%K0L3m3J01Q7k0k1n1K8o2j4o4m7N5P5N9j38mN7l1l8Q9k0j17
14980a55J8J59Q0m2m0P6l0k2l4p8L7j9mq3J5L1J7k3O8k2l6J01mK2Q1Lj28J1qj7N3q1M5Q7q2
14963dm5K5j9L3N6k8p4J03N3r2o0j0J9L1j7O3K8m3q6j04P3O0L0M4j02JpL6O8J04j2n3n4p4
14947e7M0K5l8K1p0%N1oN5Rl3j1j3M0n9qJ3O3kj7Jk4O3k1j47l4J21M4m0Q6p0j9P6K8m1k7j4
$$ y = [21, -45, -74, -120, -107, 2, 43, 102, 115, 76, 6, 3, 19, -36, -24, 17, 125, 95, 60, 79, 49, -14, -22, -4, 16, 17, -24, -111, -76, -67, -72, -89, 2, 14, 27, 74, 36, 20, -43, -6, 16, 4, 73, 3, 2, -37, -43, -34, 57, 94, 105, 48, 88, 23, 37, 21, 11, -7, -38, 61, 21, 7, 6, 23, -24, -11, -7, -90, -18, 12, 7, 37, -4, 38, 66, 25, 16, -12, 24, 66, 103, 59, -68, -1, 3, -25, -71, -88, -106, -69, -6, 1, -19, -6, -43, -5, 46, 20, -59, -68, -93, -19, -74, -17, -73, -31, -27, -12, -23, 14, -42, -61, -63, -14, -6, 72, 12, 34, -23, -29, 76, 34, -4, 21, -15, -101, -121, -2, 86, -40, -74, -9, 15, -10, 9, -5, -7, -90, -178, -178, -69, -77, -133, 40, 17, 44, -13, -87, -82, -17, 12, 26, 39, 46, 25, 19, -18, -89, -89, -69, -36, -79, 22, 109, 89, 68, 17, 45, -17, -31, -95, -142, -87, -12, 47, -91, -95, -38, -69, -107, -18, -38, -155, -137, 22, 102, 60, 20, 96, 66, 44, 10, -68, -31, -50, -54, -137, -122, -91, -74, -97, -29, -51, -87, 14, 10, 32, 113, 116, -12, -1, -9, -26, 27, -54, -9, 78, -4, -49, -24, -43, -10, 46, 18, -56, 47, 100, 8, -52, -62, -43, -12, -29, 34, 62, 19, -67, -171, -98, -38, -8, 36, -66, -65, -72, -36, 32, 136, 124, 71, 17, -57, -17, 8, -30, -9, -79, -79, -28, -34, 21, 30, -3, -14, -27, 13, -46, -54, -41, 22, 20, 3, 4, -20, 43, 22, -125, -159, -38, 6, -34, 52, -18, -37, 39, 67, 26, -1, -15]
14929a5k6M6k5oP5o9mrk6l8K7L1N7J5j6J3l0K5J0p3J0L4L3K5r1J0%l8N3j2R4n5p6lj4O2n2
14912e8oo0m3J24%q3JO4M1k1l0L7n7O7o6q0Q1k9J19l6RQ5k7l0p6j2N0M7k0kq7lJ18jn8L4L
14894eM3m4k6P9p7l7K3P4J4j6L2n2m5K5J5k7o5M1N8P7q5j2K6m3KK8P4L0n2j38Q0R4j82J4L8
14877c9P4o3O7nk6nM0k3Mm9rQ5k4L6q6K8n2L1K1q0pP2Mp0k4K3qM1M6j7O3j6M3L9o9j10j2J6
14859f1j27K2J5J14l5L5O8j29N4Q9%J12m4r4O4L5K2o9l2%oN5q3q7ml0N8J6M6M9j3j5nk5l8
14843d3l9N4r4Q2K6q4R5n2j6lj0M9NQOj04N3N4r8K4kQ4L5p1kRM6k4p2qL8nJ5l0O9j38k9J39
14825c3oN2n6l6m7Q7L8nn3J06O3m2n9J5q2M7M2m8r3Q4N2n9K7J1k3m2L4K3K6p5M3Q0m8p2j2
14808f1k0M3O7K4m4ol1K6oq4k7R8o8J4N3jK0KN8p9J07Mp5r9QmmL9L1Pn0J8M9q0L8P6k3pk7
$$ y = [-15, -41, 5, -20, -26, 49, -20, -24, -33, -59, -97, -70, -39, 18, 33, 17, 30, 0, 25, 35, -38, -28, 6, 39, 64, -27, -17, -17, -55, -2, -14, 80, 25, -51, -54, -68, -6, -58, -64, -124, -167, -43, -43, -126, -125, -61, -20, -41, -71, -34, -91, -24, -90, -170, -89, -118, 1, -35, -26, 59, 32, 2, -74, -86, -36, 11, -9, -11, -98, -101, 17, 16, -42, -8, -5, 38, -6, -32, 47, -30, -67, -44, 30, 44, 28, 60, 8, -37, -12, 3, -24, -89, -48, 10, 87, 2, -10, 16, -27, -25, 3, 77, 107, 55, -83, -3, 91, -91, -77, -39, 35, -28, 39, 34, 8, 3, 43, 20, 24, -25, -34, 51, 27, 63, -23, 5, -47, -16, 5, -75, -82, -10, -6, -76, -100, -77, -85, -44, 2, -15, 48, 32, 75, 114, 45, -65, -77, -61, -188, -166, -151, -37, -72, -37, 31, -98, -44, 45, 45, 157, 113, 19, 83, 118, 140, 71, 39, 39, 33, 88, 5, -82, -86, -116, -58, -42, 4, 53, 40, 25, 20, -5, -43, -82, -28, -122, -40, -14, -98, -3, -55, -71, -74, -84, -35, -30, -22, -16, -120, -67, -13, -111, -87, -89, -5, 30, -41, -43, -34, 12, -12, -84, -92, -54, -59, -44, -74, -5, -143, -172, -33, -39, 13, -43, -79, -126, -39, -1, -6, -59, 47, 110, 68, 9, 24, -58, -11, 31, -17, -110, -26, 26, -33, -6, 5, -18, -60, -26, -3, 23, -52, -9, 71, 23, -49, -61, -81, -38, 29, 53, 9, 3, -28, -2, -8, -92, -119, -21, -89, -75, -22, -23, -3, -1, 57, -22, 85, 89, 14, -85, -77, -81, -85, -46, -15, -8, -58, -40, 9, -71, -33, 43, 20, 13, -14]
14789a4JP6p5p4K3jnq3K2J06k6JL0j4NmoP2qO6L2m9k0p4l7l6N8k1Jkj2J8L7K2J8m7l1j0m9
14771a10O0J5ql3K8O1l0k6m0Q3pj2l0L2K2rm2RO2J28P8j08j31p6oJ5P8K9J00Oj13p8O7n0n9
14754i5L1rR8l4j7R3n6j30N2O5K6k6J0J7j5q0N9N5k3o0o1M3jP2L4n6k6J1ql4L4rp6K7M0j05
14737a54J36Q5o9lnnkL7m7k0j6N6m7jj6K4K6k8J7M5pn2p8L7P9J8M2N6m0o7Ml8mp5N9N3p4k5
14719i9J11l8p5N1O2j8K9j7j3q0L3O4j07Lk0L0k3l4J19L2K2k3L8n9rN2j6N2q9n6J1m3J16O6
14702G2m7r6n3J12j6PK9n0M4Nm3j5j2L9k9L4J1n5J2mo1K0J20P1p0j9m8Ml3j3Q8N3m7J4k0Q5
14685H9l4n8r0q2L7P4k0P5M6j6n3LO0OoK1J9r3l1O4J16k7q3N5r2K2%n4j8M4jm1NM5pm4PK1
14667d1M9ln0K7M4l8J0l9k3qJ0M4N3Q6Lk1Rk5J2q2l3Q1j2k3M0o0o1m4oJ8M1j7J7MJ27j1J3
$$ y = [-14, -13, 63, -12, -86, -63, -64, -69, -152, -130, -24, -50, -49, -19, -33, -28, -32, -38, 34, 26, 92, 124, 75, 55, -19, -56, -92, -34, -55, -54, -56, -68, -50, -13, 9, 27, -20, -51, -61, -110, -50, -35, -43, -76, -48, 13, -17, -43, -83, 0, -7, -19, -49, -17, 5, -4, -46, -37, 25, 153, 231, 123, -8, -84, -90, -75, 3, 32, 132, 138, 25, -53, 14, -36, -95, -64, -73, 25, -9, -26, 67, 11, -119, -67, -2, 24, -2, 8, 25, 10, -70, -11, 44, 21, -39, -100, -57, -58, 14, 48, -8, -34, -23, -31, -65, -31, -40, -116, -89, -49, -154, -18, 67, -2, -5, -10, -15, -17, 20, -27, -47, -63, -7, -54, -55, -71, -47, -21, -49, -32, 13, 6, -46, -124, -87, -8, 10, 52, 108, 68, 1, 5, -33, -37, -112, -53, 0, -74, -99, 12, -26, -101, -50, 12, -6, 23, 6, -7, -87, -54, 10, -97, -94, -114, -84, -107, -141, -22, 10, 32, 9, 47, -12, -21, 31, 15, 67, -22, -78, -67, -110, 6, 72, 25, -71, -124, -12, -28, -21, 8, -42, 2, 7, -36, -51, -63, -24, -53, -19, -8, -63, -51, -55, -116, -96, 24, 95, 25, 6, -42, -38, -71, -84, 4, 57, 10, 24, 4, 89, 55, -3, -93, -175, -138, -64, -84, -9, 37, 21, -32, -29, 31, 37, 31, 52, 71, -22, -53, 11, 127, 100, 17, 72, -20, 2, 2, -52, -70, -26, -27, -68, -63, -18, -25, -69, -62, -41, 8, 5, -45, -18, 26, -12, -2, -41, -64, -72, -62, -18, 35, 121, 124, 103, 112, 87, 99, 17, -16, 65, 53, 30, 70, 10, -51, -95, -101, -83, -42, -59, -42, -38, 89, 78, 91]
14650I1j5j27pk9k3O5k8l1L6J31j18j6L7N9l0n4J1K0k5M6J7p2L0K0N3l3n9M5J1r1O1M8l6j6
14633b9O8L5k1k5r4N5j1o2K6K2N3K2L1m1pm8RJ7J5M0M5p0j17J2O8R1Jj11Q7o3L5k2pl5J05
14617G4l1j5o0K6L2qN8k9M1Jp3k8j13J08M0o4q8J02Q0J4K8Oj34PN5kk4L2j8Lq9M4N9j3p8r
14599f6m0N5O1J0p0n5K2K5k6MM2k5R9Rol3m0K3p4j5oJ37j00pP2j5j6J7n4N9L7j57N6j0k2o8
14582a77M7J07N0o0L4K2LJ5j29J0R9j4o5k0k0Q3n1K3J8np0Q2l4j8M2RO4Nk6j5m4N9o7mP2p0
14565d5oJ56r2j0n2l3J07N7o9j10P9K3P7k4o4k5n3J7N6r3m6R6P1j0k8l7o0J15Q1l1Ro0K9K3
14549D8k0m1n9M7N1Q8n9m2O3n8j4%J1j0K7L6j9j29j4O2J07J7l9l6k8m4L0J8Q8q3L8r6j9M1
14533c8L3K2n5rlk8R5K7r4M0j0%k6M9L0RM1q1k5n4J05K1P0o8q0RL8N5j24O3m1L9%m7o5mQ1
$$ y = [91, 76, -51, -58, -87, -110, -45, -73, -104, -68, 63, -55, -71, -34, 25, -5, -59, -48, -28, -53, -7, 10, -62, -32, -12, 41, 8, -51, -6, 5, -86, -25, 23, -13, -29, 39, 74, 53, 28, -66, -11, -22, -84, -58, -36, 17, 39, 70, 29, 22, -26, -17, 0, 15, 55, 100, 30, -87, -75, -7, 84, 85, -26, 61, -2, 33, 11, 4, -31, 74, 43, 28, -32, -6, 26, 18, 76, 47, 88, 89, 16, -12, -125, -17, 23, -41, -129, -27, 53, 67, 95, 101, -33, -26, 29, 27, 3, 35, 17, 20, -69, -25, 34, 21, -57, -66, -106, -51, 10, 20, -50, -105, -83, -58, -84, -80, -38, -63, 36, 45, 39, 6, -34, -11, -85, -100, -106, 31, -69, -76, -4, -19, -35, -18, -72, -13, 24, -133, -77, -87, -109, -177, -130, -23, 27, -33, 1, 23, 26, 41, -88, -78, 21, 7, -58, -78, -98, -15, -66, -43, -25, -30, -100, -18, -52, -70, -28, -19, 45, 50, 24, 9, -35, 24, -43, -47, 25, -45, -51, 105, 13, 3, -49, -82, 25, 82, 13, -97, -18, 5, 82, 58, -6, -31, -84, -67, -11, -104, -150, -54, 17, 7, -21, -58, -118, -3, 78, 47, 56, -4, 25, 48, 28, -13, -72, -25, 26, 114, 55, 13, 76, 18, 4, 4, 15, 5, 32, 68, 49, -80, -94, -32, 75, 92, 53, 17, -11, -55, -25, -7, 81, -2, 36, -60, -79, -38, -5, 17, -38, -47, -50, -78, 17, 44, -50, -10, -20, -20, -46, 3, 33, 42, 83, 2, -23, -77, 28, 49, 119, 51, -29, -20, 18, 73, -51, 12, -29, 10, 10, -37, -102, -106, -25]
14515b5k9R9k8k6l4j3M2K1K2m9O2K0p5Lj1l2QL3O3L2n5q0N1mn6M3lqO3j5K2p4j9K7ll5k9M2
14497e0K3P2l6m0J5k5N9n3K9K7mL7k7o0PO5J2j14K4nQ3p2O3K9j4j6j10k5J3J2R3j4q4k7O5
14480d8L9k0p1pP6L9j29Q1J25j35l0k3N9J7k2n4Q3J6n1J6P1m3n1k0J05R2n6m5l7l1L0R2N9
14465A27j43kkJ4n0MrQK9J4qp2M7L8J11oj61l4N9n6OL5rM8o0n1N8O7j37m4J27k4j3J9M2K4
14447dn3K4NLL6k6q1k1R3M5l7N6m0r4K7n6Q4o0OJ3jK0JR2o2k3JL7J29j18P0o3J6K3j00j1K8
14430d1Rm8oJ28L8n1m8J2ln0J1N2M8q9p5l0Q7M4o8P4R1m5n9o5J6m6K7M1m5mJ4o8M3R3lpQ3
14412F0K4r3m7O5O2K1r8k3M0ol2m9M1Q1l6R6r9q5O6J1k4p4P4JJ4M4q7L4Rm6R1O4p3o6n9J98
14395I9p3N7j2j76Kol2Q1N8qj8jpqM4j20PO3m4P9Mj9l7O7J15m7lj0o4m5N4n2K2J1pk4J00k0
$$ y = [-25, -54, 45, 17, -9, -43, -56, -14, 7, 29, -20, 42, 62, -13, -10, -21, -53, -45, -12, 51, 83, 28, -52, -1, -5, -61, -18, -21, -29, 34, 19, 41, -33, -52, -25, -28, -63, -92, -50, -27, 45, 9, -31, -16, -41, 18, -35, -6, 21, 17, 54, 27, -33, -26, 39, 51, -63, -39, -44, 39, -33, 30, 59, 45, 29, -81, -106, -93, -81, 12, -2, -86, -113, -48, -9, -29, -100, -107, -31, 8, -121, -40, 85, -50, -80, -103, -44, -27, -49, -103, -20, -4, -55, -39, 32, -11, -62, -82, 23, 115, 59, 14, -23, -54, -24, 68, 127, -16, -18, -20, -6, -56, -52, -61, -53, -24, -10, -18, -90, -43, -5, 106, 100, -61, -95, -36, -92, -86, -51, -60, -12, -72, -123, -65, 2, -135, -179, -52, -76, -89, -70, -28, -4, -57, -33, -28, -25, 11, -15, -96, -117, -24, 21, -16, 40, 0, -94, -67, -123, -39, -99, -93, -80, -81, -61, -60, 32, -30, -53, -52, -15, 114, -4, 66, 3, 19, 42, -58, -69, -41, -32, -80, -86, 42, 80, 29, -19, -7, -10, -60, -49, 3, 51, -38, -113, -143, -56, -12, -80, -6, 85, 40, -19, -84, -68, -114, -87, -46, -91, -95, -81, -149, -106, -13, -16, -23, 60, 84, -9, -56, 9, 71, 92, -6, -29, 11, 5, -27, -76, -35, 46, 10, 106, 7, -78, -12, -1, -25, -99, -25, -24, -10, 34, -53, -19, -10, -56, 35, 99, 26, -40, -99, 99, 26, 83, 71, -105, -103, -109, -141, -60, -2, -10, -28, -29, -36, -44, 0, -120, -113, -50, -94, -15, -11, -30, -67, 0, 115, 68, 65, 55, -9, -54, 0, -52, -30, -19, -26, -50, 50, 30]
14377C0j05%L0M3q0kL5J9QN2j9j14p9J36L8M1o2%m5L0rM0l5P3l1mKK3q4k0R7pj07L4R0jl3
14359a6j8k2L7R0k4Jl3O0K4o9o9j7L5ONP3J0j3j2jNj7j6Pk8m3JM9j1j46N0J1QQ4J4L4RJ4J
14341G3p6J8j9k0l3mJ28p3O6jm0RM1P6o6j09k6oJ06o3j6O8Q4jl5n7N0Qj03M4J1n9O0N3r7J6
14323GOl8k8j3pLpMN6J6RJj0RJ1M9ql3j4J3N3p7m0Q6M8m0rkPj01L1K9q3q2n0J11J9N5N3jn9
14304b6J9q5Q6L3k8M2l4j0l9n5O2L3k1O6j00N3o7k3N8N8K8m1K2j4l1R3p2k8j9L6J0r1K7J4
14288d4l5Oj2k5Q5L9l8m1O9l2L4M7k4r4k9K9l3O2L4L7k9j7%M3j3o1j1N0K2rJM4Nj19l0Q8N5
14270E4k7M1N7j56m7M0R5n0M9k5o3K6L0pl5L9Q0j08N9Q1j12l8K3l1k4j3Q0oj4J1j1J4l4q1
14254a03O1R7M9l5k1k5r6L1o3L5M8l2jK6LO9r0j9J1%n9J05M6QLn2o2j5j7L8L9Jk9rK2m3M1
$$ y = [30, -75, -75, -45, -2, -82, -84, -49, -30, -22, 30, 11, -103, -182, -46, -8, 33, -29, -29, -74, -44, -53, -13, -48, 25, -6, -10, -8, 15, -69, -89, 8, 1, -106, -72, 18, 17, -16, -34, -56, -19, 71, 47, 48, 15, 75, 99, 30, -39, -56, -21, -15, -10, 63, 73, 60, 48, 47, 52, 35, 19, 26, -2, -45, -44, 5, -6, -152, -102, -91, -83, 1, 15, 49, 58, 72, 73, -3, 15, -4, -24, -57, -61, 67, -6, 60, 59, 19, 28, 69, 145, 79, -30, -56, -62, 44, -19, -35, 33, 117, 116, 81, 24, 74, 82, -21, 23, 34, -25, 35, 88, -9, 7, 13, -25, -53, -66, -73, -70, -77, -73, -17, -1, 8, 9, -1, 8, 19, 68, 60, 27, 13, 26, 79, 2, -38, 48, 96, 56, 47, 45, 52, -49, -18, 11, -72, -154, -204, -93, -74, -19, 34, 33, -26, -7, -92, -6, 27, -1, 41, 7, -3, -42, -97, -35, -2, -23, 43, -57, -4, -71, -94, -36, 22, 50, 9, 31, 17, -14, 79, 7, -21, -40, -4, 6, -85, -58, -44, -79, -73, -85, -110, -25, 14, -24, -65, 4, -28, 6, 53, 29, -65, -94, -65, -98, -36, -2, 35, 6, -11, -11, 32, 19, -42, -53, -3, 19, 10, 11, 55, 60, -59, -89, -1, 54, 27, 68, 125, -31, -78, -38, 57, 7, 56, 31, -32, -6, 24, 17, -18, 21, 101, -7, 52, 133, 21, -17, 6, -25, -49, -62, 18, 12, -2, 9, -2, 12, -22, -103, -42, 55, 104, 69, 48, 23, -73, -42, -105, -70, -22, -54, -55, -29, -26, 43, -47, -66, -55, -55, -114, -9, 37, 45, 48, -4, -66, -81, -98, -60, -21, -20, -49, -58, -36, -79, -38]
14236c8l0J00j7J8m3m7k6J09MoK4J9j4l4l3j3p4P0J15Jj7L7m4n0K2j3oK8N9%k0j01Km8l1o5
14219a62Q4M1Q4jK3p7M9L5m9k3qLJ6R1n7lk3J0n3q3jJ08l7k7J7N6l9M6q1p0O8OJ7N4r1o0J23
14201a4K6J2O1K4n7m4J9KLk3o3k2R2Kl5M5ko8l5P5rl6k0k0N1J4Nqk4j5Q1m7O2l1m9R9pj2K9
14183F1n4o5L0K0k9K9l4m0m3J9M3P4pkQ7q7J9M6m2k4o2K2O5k1n9Qm0MP7l7q5N1KK7L2M0ML4
14165F3J4k0k8p5l7Q1m3k7N5O4J6J0r8K1m7O7N6l9l1k7Pj0n9qonL7Lk0N5j8N6m0N0J25n5P
14147I4j06j23pP1P8j7Pk5K2K4l6l4N2L2p0K9j2P8oNk3k9L7n3m3O4J2j5k1rn3k9M0L5o0Q0
14130a1j0o9L0P3M2k4J04l9p5p4j1mn5P5K7Q7j9o0R1rr3Nj3L7k1j03O4N0lK1m3Jj01M6R6L
14113A5q6J08JK4L6q3k6J4L6L0o1l6l7L9N2j5o1%J7N4N2r4k1n4R1M0n3lm3K8pL8Q1p1k8LQ
$$ y = [-38, -68, 32, 15, 33, -10, -57, -83, 26, 30, 24, 48, 67, 53, 19, -14, -27, -101, -31, 84, 85, 68, 105, 61, 11, 33, 20, 14, 42, 101, 101, 81, -20, -18, -66, -97, -162, -78, -37, 47, 46, 69, -8, 41, 76, 27, 4, -4, -1, 15, 106, 49, 46, 23, 33, -20, -103, -104, 4, -33, -60, -43, 13, -26, 20, -61, -131, -63, -57, -40, 14, -77, -137, -14, 12, 24, 85, 109, 52, 8, 27, 29, 32, 9, -54, -76, 16, 18, -17, 28, 26, -42, -77, -2, -11, -47, -67, -87, -36, -22, -17, -25, -49, -64, 17, -30, 32, 1, -48, 51, 44, 32, 61, 7, -58, -28, -8, -37, -8, -42, -82, -125, -106, -63, 11, 4, 2, 89, 2, 21, 67, 25, 1, -61, -39, 26, 5, -54, -46, -86, -82, -5, -42, -127, -76, -74, -47, -15, 25, 29, 63, 77, 57, 29, -46, -83, -2, -45, -72, -17, 47, 63, 73, -25, -4, -51, 16, 72, 33, 2, -25, -18, -28, -87, -95, -101, -106, -69, -66, -86, -31, -49, 7, -33, 17, 142, 87, 94, -12, -135, -142, -71, 7, -10, -3, -28, -6, 18, -18, -52, 0, 32, -38, -9, -21, 57, 51, 56, 33, 4, 41, -12, -55, 9, 21, 6, -15, -24, -77, -106, -66, -31, -91, -11, -21, -90, -60, 13, 55, 31, 135, 96, 21, -53, -64, -68, -123, -48, -21, 66, 47, -13, 78, 69, -24, -19, -32, 5, -16, -119, -55, -5, -8, 13, -30, -29, -130, -84, 12, 15, -71, 37, 38, 62, 98, 15, -11, 3, 39, 69, 8, -28, -65, -26, 26, 11, -50, -50, -33, 21, 73, -21, -42, -96, -5, 35, -18, -21, -64, -36, -43, -5, 76, 5, -23, -20, -12]
14095a2J0m9J0K3j8J5l3NP0l2J0o3K9m8N6P5k9m5L6m7N6n2KN9n4L2j0Qo4L3O7k8p7l6O2N2
14078A3Qj35Q0K8MJ0j03Q8M0j8n3K1%l8k1m2m1P7O2N1k8J2N7m3o7J6M3n4n8O0J8L6mOL1n1
14061EJ4k0k5L0lm6N2J04j1Ko9q0J8K3l1L9On9qL6o2M6LM0J00n5p2J7KJ9j8P8o0K1o5m1pj7
14043i4N9L4J6J42p7k7kj08N7m9L7m1MQ2k4o0j9J7M2Q3n9M6K2j4n9pkj17J19l2l5Q3O2o9M
14026A4P4On5O0j5m7k5n8N4P8n1r7l4MQ5M7k3k8l3l7M7NRJ6q8k9K0J60q7j6J08m9J4nj40p
14009a23J63Pm6M4j22Q2L4p7ORj8RN1m1O8j04%L4R1l5n9j3J1j8m5R7K9o2o5J77Rj2J0p8j9
13992foJ07%m4k5J3n9J6J9j16KNJ33J4J8Ro3k9J3l6L4L5k4mm6L0m5J7R2N9n6q9k8l4N0O1K6
13974D3l6j7m1M9O5qp9q8oP2L7ko9j5R8m1M6k6l0L3pk0P0J6q7j9P7o4L4KNrQn0pJ06l3o2K5
$$ y = [-12, -2, -51, -41, -18, -36, -21, -54, -49, 21, -11, -1, -64, -35, -83, -27, 48, 19, -26, 10, -37, 19, -33, -31, 28, -26, 6, -4, 4, -60, -27, 40, 12, -65, -101, -39, 13, 21, -114, -34, -6, -2, 8, -95, -7, 33, 15, -38, -17, -17, -55, -76, -118, -159, -82, -20, 31, 3, 15, 72, 29, -38, -22, 21, -33, -91, -31, -13, 23, 19, 25, 56, 5, 19, -1, -26, 4, 1, -45, 7, 111, 100, 102, 33, -47, -29, -6, -37, 2, 8, -51, -59, -23, -85, -39, -36, 4, 104, 49, -23, -6, -4, 15, -3, 75, 15, 36, -29, -70, -77, -94, -35, -1, 15, 157, 80, 53, 51, -57, 0, -49, -12, -53, -49, 33, 9, -51, -70, -53, -11, 72, 13, 59, 81, 67, 8, 1, -1, -118, 1, -31, -66, 17, 79, 10, 14, 88, 94, 39, 99, 84, 37, 12, -46, 8, 86, 35, -62, -96, -92, -7, 40, 17, -11, -44, -81, -34, -29, -20, -4, -92, -121, -101, 59, -28, -44, 64, 15, 29, 24, -116, -123, 40, 47, 1, 45, -77, 5, 39, -38, -32, -23, -41, -32, 19, -22, 46, -58, -58, -24, 67, 32, -27, -40, -29, -47, -92, 5, 34, -28, -93, 84, 93, 81, 91, 13, -6, -12, 95, 95, 51, 26, 39, -20, -4, 15, -101, -99, -94, 39, 53, 71, 80, 17, -12, 1, -35, -1, 34, 10, 6, -40, -10, -55, -38, 54, 113, 57, -32, -60, -94, -44, 17, 43, 7, -10, -51, -2, 63, 55, -24, -112, -118, -46, -9, -11, -80, -95, 3, -38, 8, -18, -48, -15, -22, -42, 28, 44, -43, -62, 15, -49, -15, -13, -8, -17, -9, -59, -66, 40, 7, -55, -30]
13956c0J12K3Or3J9l8n6j2J51q7J1J4l6MK7p8rK0M3O6j22j5n7P2J66o9j18M5o7L5M7P8m6o2
13940e6J09rj14Rj1L2J8kk5p4M9j4O8on3j4JP0p1jj2N4K7lkN7n1L1j27nP0J2l8k2qN9N6l6
13921c2N1o1j1Q5mk5K7o2rpJ5m9K9m8j9J7K4j9o0R9J51ok1j34l1R4P3k0rj20k0P3J29m0k9
13905C1L0%m2J6L1no2l5j6P7l7k2P8J6j04k4m3N8R3p5M0M9p1Q3p2K2J6Po2PO8j30O1N4k6J2
13888B3j0l6j6m6K8M0n8j24M6J58k9j11K8O4n2K2No6N2O4rkp4L5L2K8N9n1nn1M3pkK2N0N7
13870A07Pj36j58M5Q1K6Ql8kL4l7l8M4P8J6pk8n8k4OO5j06m3L6l6O1J12nJ3q2N2J3km7LK2
13853a8m3J11k7r9l4K2N2J02j28NN2L8o5%j2j5j03K8Q4rN8KJ6k7Nj6j1k2Kn8OJ25j35l2J31
13837a5L8o9l5O5M9o2L6j26k4j10O0K21K3L0p9L1m5o6R2Rm8NP0L1p4J03lj59KN3n7R4k5p0
$$ y = [-30, 82, 105, 111, 18, 37, -1, -57, -69, 82, -5, 6, 20, -16, -12, 15, -63, -72, -52, -9, 57, -65, -80, -137, -65, 101, 32, -86, -41, -108, -73, -26, 52, 6, -56, 53, 44, -70, -61, -72, -40, -22, -24, -49, -123, -74, -88, -20, -26, -79, -93, -92, -22, -93, -94, -106, -52, -25, -28, -30, 27, -24, 7, -120, -125, -55, -43, -81, -103, -111, -52, 4, -32, 19, -42, -53, 32, 28, 3, 30, -32, -41, -48, -33, -82, -53, -101, -120, -103, -79, -98, -158, -59, 92, 86, 65, -69, -100, -6, 67, 47, 38, -82, -102, -29, 100, 60, 31, 61, 61, 19, 35, 66, 61, -1, -36, -52, 25, -12, -34, 44, 60, -44, -68, -111, -53, 40, -35, 5, 54, -17, 66, -6, 16, 32, 39, -23, -16, 52, -78, -17, 37, 11, 23, 13, -23, -39, -85, -57, -17, -75, -199, -153, 5, -24, -135, -107, -43, -95, -73, -68, -134, -82, -18, -27, -29, -103, -68, -36, -8, 51, 0, -5, -56, -13, -20, -22, 0, 50, 107, 114, -22, -180, -135, -54, -28, -20, -58, -60, -26, -63, -101, -57, 21, 37, 30, 2, -56, -80, -74, -9, -115, -158, -122, -158, -97, 15, 10, 23, -59, -7, 6, 4, -43, -40, -18, -61, 50, 23, -76, -110, -88, -36, 66, -62, -57, -5, 33, -32, -32, -44, -59, -162, -134, -50, -59, -1, 1, 17, -10, -5, -21, -32, -54, -52, -110, -104, 21, -114, -146, -15, 23, -46, -81, -16, 33, -29, 7, -119, -143, -253, -193, 28, 51, 81, 2, 33, -12, -78, 14, 23, -25, -20, 50, 81, 7, 110, 107, -52, -50, 3, -54, 40, 15, -55]
13820e5j2k5p3O8Qn9N6K3N9o7M0rK7kPq2O7l0p9L0Q0q0M2K1j2N0q2NR6L2K8j5j22Mj3j1n7
13803a42O6o5P0M6rQ3ok0Jo1N1JK6pq3j1K7M8p3k4J12%l1j2j4L1o8k3N6N3n1m2Q6l8jl4n8
13785a16J5M2O3l7j0J9P2p6l5M4O8m1j05OoJ1P7J1l4j4M4Q0m6k9J2P3p2P0Pj08m6J5q7Q1J27
13768G5p1k3J0J0j66J19P2K6o8J1L1k0m1K6N5m2n3l6Q7M7p3n7o9N8L4KK3L7q1K3Q1p5qp2M
13752a24N8mmO0j9K8J4n4k8m5M4L8m0L7N7n2j5%N6LJ4J5l2k1llp1M2O2Ro7J4rJ3L6L1j39j6
13734a15J2P2J%pj8jJ5l2O4J08l7k1m3J8%O8l9n8K3j01M4j9NK7kk0k9L2qm7K6l2J3J9N7j8
13716d3K5O9M9J2j14rk2qK4m3l0K9J1J0oP7P1m9r8k0J10Q0r0r5M1K5nj4l5O3o5k4K8J4M5M2
13699E5k7Mn0o0loJ9kOJ10N6j14K9l0k9j8k0j1P4j3J1K5j28L1N9m2M1j11k0J16Lm2P1l1mK6
$$ y = [-55, -67, -92, -165, -97, -89, -148, -92, -69, -10, -77, -37, -46, -19, -21, -14, -96, -29, -59, -138, -108, -28, -108, -66, -45, -57, -7, -89, -84, 12, 44, 72, 57, -65, -61, -74, -85, -142, -76, -141, -71, -25, -34, 49, 43, 23, 24, -37, 14, 15, 41, 34, -49, -60, -33, 15, -58, -82, 30, 30, -1, -13, -27, 4, -64, -87, -31, 22, -29, -71, 15, -23, -24, -58, -116, -101, -59, 4, -33, -43, -24, 48, -28, -63, -19, 49, 8, -97, -91, -97, -86, -9, 2, -32, -46, -2, 78, 32, 3, 15, 88, 16, 86, 93, -15, -61, -46, -133, -52, 75, 4, -19, -9, 1, -165, -46, 26, 52, -16, -5, 26, 6, -35, -9, 46, 4, -49, -85, 2, 49, -24, -81, -150, -92, -58, -56, -33, 4, -77, -54, 27, -48, -56, -128, -124, -66, -70, -74, -14, -33, -5, 9, -45, -73, -118, -74, -36, -76, -39, 18, -34, -49, -49, 7, 10, 24, 39, 7, -14, -17, -20, -91, -49, 13, 22, -45, -31, -40, -27, 9, 40, -99, -115, -103, -31, -30, -30, -37, -55, -56, -41, -73, -9, 99, 62, 41, -2, 16, 16, 84, 45, -13, 10, -91, -47, -66, -61, -34, -36, -56, -85, -53, -61, -108, -82, -114, -101, -82, -25, -43, -18, 51, 100, 112, -2, -11, -33, -41, -17, -60, -90, -61, -50, -40, -46, 31, 102, 53, -45, -65, 45, 125, 35, -60, -19, 6, 1, -13, -48, 15, -50, -74, -46, -32, 13, 55, 28, 32, -18, -78, -81, -87, -68, -70, -64, 46, 102, -12, 17, -13, -42, -60, -80, -91, -17, -30, -19, 6, -122, -91, -32, -74, -33, -144, -164, -48, -45, -87, -16, -47, -51, -25]
13682b5M0l3mJkm4L6k0N5J1m7j01J2O6Rn9l4J8J02n7OL2k2L9m0p1P6NO0o1J8p7m7J38N5L5
13664G0k1j64K2k5J4k6N5L5l8mlJ6K5j4N1K0L4k5K1j8N9n9k6m1j4P9J8o9J3L5k4p%m8n0M1
13647f8M4L5o5l1M0j9P0J77r1k6N9q8Ol1n7j9N4om5K8P2m8r4k2O9QM3m9m7K9L4K3mJ5n0J9
13630c5P5o1JN2m4p6J09L0m2j5j01J0M5n2m4L3k8K2M5P1n5oR7o7p9j4lQ4m6k1P1k5P8kNP0
13613H2k9j11N4p3k6lL9L0PO1l1pJ4M8Kq3NOM4p0k7L3O9R4m9k3N8j42l8Ql9K7L7K7l6m9M7
13595d4j8K9M0rmO1n2l2L6N8q6l2n6OR2J83j31j06j17J31l0L2N3%n5j9R4l5N8rm7j05J3P9
13579b2m6%K5k3l0kK2J3O2o9OM7n9j0K5M4M0q2ol7J06N3p9Ql5L4J15n2n6l4J4M8L1ORo2j2
13561hn6R0k8J7N9Np9k8J0J0l7N3n4L8OJ9j04pK4k3O7O2n7K6k5J05o1q8M6j0q5jL6O1l6Jp3
$$ y = [-25, 15, -18, -22, -21, -23, -67, -31, -51, 4, 15, -32, -133, -121, -55, -46, -105, -139, -121, -19, -76, -70, -38, -60, -21, -61, -132, -56, -51, 9, -52, -34, -111, -158, -20, 35, 70, 49, -115, -93, -118, -104, -130, -75, -40, -78, -82, -85, -69, -44, -58, -7, 13, 47, 22, 43, 25, 84, 25, -1, -42, -56, 23, 41, -28, -15, 20, -4, -11, -11, -59, -109, -68, -24, 11, -54, -85, -45, -64, 6, 183, 92, 66, 125, 37, 43, 12, -45, -64, -10, -16, -61, -33, 39, -9, -103, -125, -56, -48, -5, -54, -101, -72, -38, -15, -19, -4, -54, -35, 40, -21, -20, 32, -12, -88, 21, 51, 9, -6, -107, -97, -52, -104, -148, -115, -143, -121, -76, -5, -60, -66, 31, -36, -115, -129, -132, -48, -94, -115, -44, -69, 9, 7, 12, 82, 53, -58, -4, -77, -103, -106, -67, -37, -30, 31, 0, -7, 7, 55, 57, -26, -21, -15, 29, -41, -68, -35, 34, 128, 79, 56, 114, -28, -66, -58, -97, -70, -33, -6, -42, -91, -44, -62, -33, 7, -2, -6, 55, 3, -29, 7, 65, -21, -53, -109, -103, -11, 172, 41, -65, -182, -51, -81, -49, 4, 4, -51, -70, 24, -11, 47, 38, -9, -114, -101, -22, -68, -68, -43, -66, -96, -98, -76, -63, -1, -70, -64, -17, -76, -86, -61, -17, 23, -59, -65, -102, 4, 57, -22, -14, -49, -15, 100, 48, -8, -42, -28, 20, 51, 57, 66, 4, -8, -64, 26, -2, 15, 74, 79, 0, -28, -18, -8, -45, 8, -46, -8, -2, 17, -87, -94, -70, -93, -26, 36, -21, 5, -20, 85, 24, -64, -18, -28, -113, -114, -78, -17, -53, -52, -125]
13544a25K1R7j4m7M5N4J7q5rK1J3l1l1n0P4J81K3m7q4rk9k4P9r6n2O9N2J0O1j06mO3l3m7K9
13527a4M4L6p2m5L8M2j7l5P6o7n4N0k8K6K1o5K4O8J5j08mK0N7K6l3Rj7J8j27J02L1n3qN3Q5
13510I4L5m9k6QK1k6l5J2L2k0j12P6%k6p2L1M6J8j7k0PJ3r6J15J4o2k3L3j4M1j0l7J5L6L9
13494D1M6j14k9J0k9O6K1lm0l8K5N2o3k7m2N1L7J08k0oK8j44m5j0j0J46K8l2k1p3J4M3M5l2
13477a7J0p5K5P2NOLn3l5j9n5L1J48k3j22M4K4Rj2m5R9%j4q9M0O8N1j52J4n4O4L6N1nm3Q9
13460G6J8o2o7J0k8M8j3o5K4P8k4M3L9k1Pm3k9m1Rm3J2O3m2n2P5J1l8RO5lp5J31k6n8l5m0
13443h7L0%J0m5L1J04J4N3qj26k0N4N0n2O5l6k5L2p7K2O5k6p7M7L2M3q7nPN0M0L1q0qk0J3
13426A4L3k2m4pL9m1L3o8Q5j5rL5N4q8p3O1Pk2K3Nl9L3l1K6Q1o5p0o2Q2K6K4l7l1J13p5oj1
$$ y = [-125, -104, -7, -21, -68, -23, 31, 48, -37, -46, -25, -12, -43, -74, -124, -50, 131, 154, 107, 23, 14, -15, -39, 40, -56, -108, -39, 13, 23, 84, -22, -26, 37, 4, -43, -14, 30, 66, -6, -51, -13, 29, 12, -23, 53, -14, -68, -18, -46, -20, 1, -64, -40, 28, 43, -65, -69, -49, 8, 34, 1, 10, -7, 11, -116, -14, 17, -36, -44, 9, 94, 129, 80, 54, 62, 83, 57, 22, 34, 66, 46, -66, 10, 10, -16, -88, -57, -11, 7, -10, -30, -23, -10, -106, 9, 23, -39, -62, -29, -43, -2, -12, -49, -34, 2, 41, 87, -27, -56, -46, -75, -9, 12, 9, -31, -69, -44, 8, -55, -82, -124, -73, -36, 72, 52, 46, 74, -70, -115, -125, -135, 11, 39, 7, -14, -87, -73, -30, 15, -17, -7, -82, -57, 15, 20, 26, 29, -24, -59, -78, -133, -102, 46, 23, -99, -55, -31, -22, -34, -79, 20, 20, 6, -83, -43, 25, 76, -76, -62, -116, -52, -16, 35, 30, -13, 76, 94, 32, -35, -25, -53, -5, -18, -83, -59, 19, -5, 38, 77, 56, 63, 20, -9, -50, -41, -84, -72, -9, -51, -103, -28, -17, -55, -46, 19, 16, -59, 72, 46, -12, -47, -87, -57, -57, -47, -92, -61, 43, 57, 110, 102, -24, -44, 10, 60, 8, 73, 37, 12, 44, -33, -11, 54, 28, -49, -2, 30, 73, -14, -19, -12, 38, 78, 109, 29, 21, 1, 14, 47, 25, -19, -26, 13, -28, 5, -63, 22, 7, -2, 33, 87, -1, -74, -13, -6, -28, -5, 0, -39, -6, -37, -11, 70, 5, -65, -127, -45, -19, 5, -32, -63, 50, -25, -31, -42]
13408d2q8J04L5N6j7l3k7kp4j6m2J0K2J8l8N2N5N1p4l1PN1m0JOl6K4Q3j12J7N6O1l1Qk4K9
13391A9k0mL0l2n6M7oj7l4Mn7Q5J6j3L7J1p3J5J5N4J5p7N7k9l3nl2L0Q3p4L4J2K3K6p2P5m6
13374Hl3m3J1K6ql4J5PL1o3K3K3pj5M5k1l9M6J5p5KP7MK9m6m0oMjmO2m1O3m9MR1l8m5R6n0
13354B4L8J6l3n8LL9%l9j01J08M7lk8Ro0p9J1r0P7O7Q3J7l2q8%J14o3M3j6m0On4J03kl4k7
13337d2P2p4J7J9r6k9M9O0J4oL7m9M5J2p6N2km9K5Rr0J8J03pl6p6nJ3Lj6L8QO1n0M9ro3J01
13319C0K4n7l3M9j9j23J6n1N7Q0k4J1m3J1PK9jnP5M0ok0qJ2j3n0K0l3j0no8k6NJ00P3l7k3
13302a6M2n1L9K5m8m9P6J7o7p4M4M9r0N5J6j19P9R7q8nJ9P1oj3j09K0R1O7ln4k8l0jL3LK8
13284B0j9l4j3Q6l4n8O8N2o8k9K8l1%kO6M3k7q7P8o6k3k0K5qj12J01jK5O0j9n0rO2L0m1j04
$$ y = [-42, -130, -26, 9, 65, 48, 15, -12, -14, -88, -104, -146, -136, -114, -96, -134, -82, -27, 24, -50, -81, -74, -23, -63, -62, -56, -92, -68, 15, -97, -80, -24, 37, 6, 14, -10, 19, -1, -5, 25, -7, -63, -16, -22, -39, -73, -69, -126, -41, -25, -38, -1, 10, -63, -48, -33, 21, 36, -41, 16, -13, -46, -51, -83, -53, 30, -44, -10, 2, 25, 51, -21, 54, 8, -25, -68, -57, -31, -39, -73, -58, -51, -20, -83, -60, -37, -44, -59, -14, -35, -74, -28, -13, -88, -86, -9, -5, 24, -22, -62, -68, -64, -65, -69, -7, -48, 15, -34, -30, 61, 23, -22, 74, 24, 62, 78, 45, -13, -10, 29, 29, -10, -111, -3, 44, 41, 13, 22, -38, -117, -106, -196, -119, -52, 31, 48, 16, -72, -72, 42, -21, 22, 6, -34, -28, -82, 21, 19, -15, -42, 30, -44, -27, -8, -104, -133, -84, -24, -10, -16, 21, -28, 17, 29, -47, 5, 3, -46, -21, -12, -102, -84, 19, 12, -24, -100, -105, -92, -89, -105, -67, -59, 2, -48, 1, -8, -71, 30, 54, -3, -36, 13, -6, -129, -113, -164, -107, -27, -51, -40, -83, -72, -65, -36, -37, -42, 33, 73, 67, 47, 39, 51, 38, -12, 8, -25, -35, -40, -108, -134, -129, -29, 44, 7, -16, 26, -25, 14, 39, -9, -58, 18, 35, -32, -106, -62, -13, -103, -48, -32, -151, -72, 25, -63, -68, -49, 22, 16, 3, -106, -86, 5, 72, 69, 15, -13, -43, -44, -11, -8, 20, 1, -33, -46, 40, 6, -52, 16, 68, 0, -29, -1, -32, -32, -34, 32, 75, 48, -39, 39, -27, -50, -70, -45, -53, -165, -64, -65, -40, 20, 1, -49, -58, 4, 34, -7, -111]
13267a11k5J43nl5j9L9J0K0L0m8j00J07j4n9K2J9M0J4p2k0J0LJ7M1J4j0j07N8K1q0K1N1K8
13251CN1K5m2k2K5l6p7l8O8K3lJ2N4J9l1l6M6m1j8J7q2P4Oj03L8K9Q9Kj40rl9k3j5O1O1l1
13234h3N1k1n8pk4R4k5K8L4q3M3k7N2J3m3O1M6m2k7J3km9j5J5J12r6M4N9k1O3n8l4k2J2q0
13218g7K3P3M9n3o0O6q7p7rQ4M4j5j25N5J02L1Qq0L1L4J6Pk6L3j30m0J21J9k6R9lr0p7N6O3
13201C9n5n4N9j04k5J10k8n6N0L5l3P3oLRLk8lM3Q6j40Pk8pQK0L1j5N1n9K2%J5M6k9JM3L2
13183A16m3p3j1K5K9k7m1q5P3K0n7M8Q2l2q4j6P4O5j5N0j52N9N7l3j10Q5l8j05N5N8m2K9m
13167d3n8n5L3Q3l8J7o3L0M4k%K9N9N2p0k9N7m1m6K6j1N6m3N3n2K2k2j8L8K9P3j80o9O0L5
13150d4n7J11K21p5r0n6l5JQL3k1j7rP5J7Ol6k7m0j9K1R6loJ7n3j1Ln9nm0O9JN2N9kk2k4n4
$$ y = [-111, -136, 7, 2, -33, -52, -13, -3, 17, 47, -1, -101, 6, -8, -67, -45, -26, 14, 28, -44, -64, -54, -51, -34, 7, 21, 11, -96, -38, -17, -97, -76, -25, 3, 54, 79, 37, 15, 40, 4, -73, -111, -43, -20, -23, -11, 43, 62, 31, -5, 41, 0, -18, -1, -83, -9, -3, -106, -68, -39, 50, 52, -88, -97, -136, -159, -174, -113, -52, -83, -32, -53, -111, -118, -142, -48, -73, -45, -11, -94, -51, -78, -26, -13, -56, 5, 51, 9, -18, -5, -7, -56, -71, -56, 56, -40, 4, 63, 42, 105, 47, 13, -9, 3, -77, -54, 19, 68, 15, -45, 21, -66, -143, -152, -68, -24, -39, -164, -109, -7, 24, 32, -48, -17, 17, 33, 40, 14, 47, -83, -123, -2, 17, -9, 90, 87, -3, -80, -24, 39, -16, -70, -11, -115, -140, -30, -58, -114, -64, -29, -62, 11, 5, 8, 17, 20, -8, -11, 32, 118, -22, -15, -43, -50, -42, -22, 9, -6, 45, -14, 8, 8, 23, 69, 40, 41, 84, 116, 73, 0, -11, 14, 43, 16, -25, -110, -37, -17, -74, -26, 56, 24, -60, -76, -2, 63, 48, 98, -54, 5, 62, 29, -81, 4, -34, -139, -84, -26, -68, -39, -43, -101, -156, -123, -40, -78, -61, -124, -94, -50, -52, -52, -23, 36, 88, 18, -11, 46, 5, -41, -15, -26, 30, -13, 40, -12, 10, -12, -30, 8, 37, 110, -70, -139, -79, -44, -101, 10, 231, 156, 66, 10, -25, -24, -16, 17, -4, -21, -30, 45, 62, 68, 32, 5, -35, -54, -33, 63, 60, 54, 71, 18, 7, 10, -49, -54, -94, -25, -24, 28, 87, 85, 63, 39, -15]
13132a5rM3o2k2nM8J5j16Q6k9OO3J6l7p8P9n7r5R1O9P8J2j0l1j8R%q6M9Q3n5m3rl8P5K6k7
13114F%mo0N1O9M1p4M4j11oL3N1J8or2n7N7Q1n3pN9l6n8j06Q2J2kP0N2KN7o0j39r4k0J17J18
13096C5k7Kn9k3j8rN8K2j8l4J19k3p5Q0P8k5j35K0J1nJ4o9l8OL4j5oR7J5r4J02l8J7LJ7lJ1
13079B7N8O4r1j14MO6p4Q2k0k1M4n3K7m8J4K6rJ2k8K0L0k5k7J34m9k5J08p1j05L4n6m9LJ02
13063a0j3j3k1P8ln0p7Q4mM5rk4M0J4k04nR6n4N3M5o9K7J6QK8r6M6L2QO4M1q3j10J33m2M6
13045A7O0r6o3L3k5K3J8J9M8lMj5j2j7l5L1O9r2l8J1O3k2n6J29on0j04M9J9J4k4K8l0k4P0
13029gN3mk4r2m5LJ06rL5m8j12L6J00M0L8q8n6lO2K0m6K7m1j6P1q2Q6r2K2K4k0L0J7n3j6R6
13012A2K7J6q0j7j1pJ12jn0k4m7oL3L1p4N2jm8k4L1Nl2K6O0L3j7mJ3l2kp5J3J1R2J14j7p2
$$ y = [-15, -24, 19, -43, -65, -70, -22, -7, -123, -37, -66, -60, 3, 19, -18, -96, -17, -74, -169, -78, -9, 69, 81, 71, 40, 22, 31, 31, -55, -6, 77, 22, -21, -30, -68, 7, 33, 6, 6, 2, -58, -7, 62, 103, 29, 73, -38, -44, -11, 40, 58, 52, -40, -97, -40, 41, -12, -19, 40, 4, -54, -160, -78, -66, -68, 2, 54, 56, 113, 53, -86, -180, -200, -83, 35, 8, 10, -49, -72, -90, -99, -41, -19, -37, -71, 48, 25, -50, 30, 108, 83, -52, -32, -21, -26, -12, -81, -119, -113, -79, -94, -100, -3, 12, -82, 20, -18, -1, 2, 19, 16, 27, 85, 149, 58, -56, -52, 14, -60, 22, 2, -19, 25, -28, -1, -49, -35, -9, -18, -6, -34, -14, 16, -9, -36, 98, 49, 24, 132, 61, -44, -10, -66, -115, -112, -10, -23, -36, -57, 21, 18, -32, -109, -25, -29, 16, 7, -17, 23, 37, -167, -172, -76, -130, -77, -32, -101, -74, -58, -50, -22, -118, -72, -40, -32, 32, 73, -10, -120, 13, -29, 17, 77, -19, -82, -49, -74, -51, -33, -14, 34, 31, 35, 20, 8, -9, -44, -13, 56, -36, -74, -63, 0, -22, -78, 51, 45, -5, -109, -60, -41, -27, -51, -23, -53, -77, -7, 46, 42, 18, -74, -119, -116, -10, -19, 16, -32, -144, -108, -8, 32, 70, -18, -74, -77, -15, 5, -41, -14, -55, -71, 0, -82, 4, -88, -66, -42, -62, -32, -15, -68, -84, 12, 39, 55, -25, -42, -53, -60, 52, 51, 1, -23, -70, -76, -43, -12, -86, -34, -35, -83, -107, -76, -71, -103, -77, -17, 16, -1, -5, 8, -24, -26, -101, -88, -77, 15, 129, 112, 40]
12994D0j26m9J53q1O3O6j5nK8Pm8n7oL8Q5n2p5m7K8l8M6RO4P5n6K8l1K6pj9j18J1K6O4L6J8
12977H1r9M7j7l2Q1o0n4n3k2O1L1l4J4j6O4Rl3J16M5k2o1n5K6k2N3J0m7J5q5p6n5R4R3K8l
12960B2m9J12p9j0J3K2o9M5P4n4m4M7m2O1kn7l2l1M5N8O0j18ON9n0o7QkN8M2o6lj9k9j2K8
12943g5J0l9Q2J6j42J26k4M3%M8rn5K3rl1K5M6rK8j%jm2j0K1M1Op9q2q3J08J29L4m8j2j00
12926f5M4m1KK6K4Pn0Kj0q3L4rK9K5q5l1L7J95m0Pk1N6J8m7o9m3P4L8N7j01q7O6N0Qj4pP9
12908G5k0j0m8k2pm8L4L3Rl5P1q8k7n0N8nK1p7J55K7o1o7j4P4o3M0k2n1R3J15P0K9j23j39
12892g3L6Q6J9r6j12rO0P4j1K7K6N9l1jQm0l1L5j16P2K7o3o8JJ29m0J8K3j9m8LN9q6KKN8p3
12874i3m9L4J08J07j12J8K2k7M8j8j8K0J04q1o4l0O7ln1l7k3O7K2j1M4n5J7j13q1R4J26%o0
$$ y = [40, -86, -135, 18, -63, 0, 66, 51, 46, 74, 81, 33, -24, -30, 8, 93, 41, -34, -81, -53, -91, -45, -36, 28, 103, 47, 75, 44, 70, 63, 44, -74, -63, -37, 27, 63, 81, -18, 29, 12, -20, 61, 1, -53, -106, -128, -67, -36, -70, -56, -72, -8, 1, -32, 84, 129, 107, 46, -9, 17, -5, 48, 58, 11, 26, -59, -135, -190, -96, -3, 25, 22, -27, 85, 6, -4, 9, 31, -38, 7, 81, 27, -17, 30, -12, 49, 47, -10, -42, -73, -28, 30, 90, -28, -22, 37, -13, -80, -72, -74, -16, 26, -40, -43, -62, -91, -103, -75, -65, -104, -22, -6, -148, -22, -46, -3, -3, 45, 36, -19, 4, -5, -36, -11, 35, 26, 54, 53, 53, 52, 10, 0, 21, 62, 68, -11, -93, -176, -68, 61, 95, 47, 35, -65, -21, -62, -60, -34, -10, -3, -53, -51, -61, -144, -110, -119, -90, -65, -150, -181, -144, 51, 11, 18, -3, 53, 71, 24, -45, -88, -14, 24, 81, -20, -107, -41, 9, 17, 3, -4, 75, 55, 45, -3, -25, -32, -80, -46, -13, -4, -39, 32, -56, -83, -133, -75, -80, -59, -136, 19, 46, -15, -82, -96, -22, -85, -45, -67, -118, -25, 90, 160, 189, 66, -73, -37, 49, 68, -28, -140, -149, -89, -15, -26, 1, 27, 86, 55, 54, 62, 22, -9, 26, -90, -18, 9, -54, -122, -121, 8, -32, -14, 9, -10, -58, -55, 4, -82, -80, -78, -20, -93, -142, -108, 0, 107, -5, 13, 35, 8, 56, 38, 20, 40, 144, 63, -1, -31, 36, 33, -18, -55, -78, -11, 11, 0, 44, -11, 6, -107, -188, -94, 32, 32, -28]
12859b8k0P5L9J4m1l3J6o4P5p3o2k3j16O4P1J20K8m2l1l1M4N5ll4Kl9L8%l8p4J23q0k7j9N9
12842e5Op4J4R3K5kk3O7L4l9m2K4M7l3j10l2R9m6K5M9L3j4p2R7j26M3J7kn2J5j6qQQ0m8q7
12825a05R0J5o6J1P2K3o0%P8j03%P9J3Lk7k5K9M5r6j6Kl2L4%Nj6Pn4O4L7J0l5M6L6p9J9j5
12807a1n0L8M6p0m4m0N5N1J20q8m2m3O7nO4j26L9J15m0p8n6K4J0N8k4o2QK4L0N8p0J35l9j00
12791d6l1rM5Q9k1m7m1O1j20N7Q9nmo2k2N6L5Pk0O5L7p2J8o1n5n4O5J01N3j47l1L1oK0j6j6
12774e7k9l0l1Q1M2K7J0pMl5l4KM6L7qq4oPN8l3o6oJ57p5l6k9Q3OK3j8l1n4Q4l8l3N2P5o2
12756hL8rk2L8L0q6J4L6m6q3M3On3N4O1mR3J7mk9j63L5nK4nJ5J7l3N0K8l0K8j07K0L2p5R0
12738Gj16L7J05p4M2L6K1j8j58J7J36j06M4jj8K5O9l3r1j4R9K3o1M1ll9Pl3M6l9M4l5n3J5
$$ y = [-28, -48, 27, 66, 80, 39, 6, 22, -42, 33, -40, -102, -125, -241, -177, -106, 14, 42, 0, -31, -62, -18, 37, 34, 0, 2, -37, 1, 1, -37, -111, 12, -68, -95, -114, -55, -49, -123, -109, -16, 9, 7, -16, 51, 85, 46, 4, 28, 75, 42, -68, -100, -1, -47, -22, 27, 60, 46, -26, 71, -55, -12, 5, 3, -49, -34, -50, -58, -50, 30, -18, -105, -15, 0, -66, -55, 17, 40, -20, -20, 58, -45, -45, 34, 47, 50, 23, -2, 27, 72, -24, -40, -38, -70, -36, -36, -31, -47, -40, -94, -30, 7, 17, -18, 28, 64, -15, 4, -11, -61, -23, 23, -47, -91, -131, -76, -25, 95, 7, -35, -78, -11, -16, 48, -78, -39, 76, 36, -42, -98, -74, -64, -6, -30, -92, -84, -60, -30, 28, -42, 93, 54, -46, -77, -86, -41, 48, 27, -20, -61, 0, -120, -63, 26, 21, 17, -45, -67, -11, 24, 31, 11, 76, 113, 41, 59, -2, -57, -111, -46, 55, 108, -39, -70, -39, -45, -25, -41, -57, -86, -116, -147, -66, -24, 3, 13, 6, 10, -25, -59, -57, -11, 26, 18, -66, -72, -65, -7, -40, -106, -112, 45, -30, -66, -95, -12, -6, 17, -1, -32, -86, -2, -40, -73, -21, 54, -8, 30, 21, -1, 37, 67, -19, -5, 31, -15, -98, -55, -49, -102, -48, 13, 9, 102, 119, 115, 86, -77, -42, -47, -23, -28, -13, 4, -29, 21, 49, 19, 47, -60, -40, -8, -83, 7, -109, -72, 33, -41, 1, 37, 58, 40, -118, -101, 35, -71, -27, -28, -46, -21, 48, 15, -76, -90, 9, 32, -29, 12, 9, -30, -23, -56, -10, -49, -5, -40, -93, -78]
12722g8J4pn5P9Q2n6q9N1p5qQ1J12j06l1L6L8Nk1m9n0j3M7%L4J7J9nK0r7J7O4K0%M7r4j0P4
12704A3p5O7M1m0K6J2m6L7l1k6j1N1j8k0N4j22JK5nK3k2m0PJ0j55O2J0L8O9l2Q2L3n0r9O0
12687g1R9K0k6K9j6j9K7M4p3rN2K3j44k2M6J6JO7o1N3L3p0l3LP4Ql7m0M3p2N8m1k4P6M9j5
12670D8j3n1M5n2L5o2o0k7J13rl4J29j9k0J04m8p3rM2N5M7p2o6n2q4R4Q3m8l7J16j6l1l3L0
12654B5J2o6l9J01m9Mmj09Q9K1J7%jo0NJ9l3K2j5Q5o0k1J1J00j20m7QJ9kL8J3J1j7J02qn0
12637AL0l0p4L8j3l7J03K7p9M7j8O0lr8p7R7K7Mk4jL4p8K5k5O2J5L3j10oLJ1M1Q9o2l9l2j3
12619g2MmK7NO8p5p6J00M2Q6j22pL6pK8r4j00N5J14o4J0l0K0K2l6r7O1M4n1R5l7p6j1J05O7
12602C0L0q4j6k6%%J9J04r7p2O6J7PQm6m9K5QMJ53k0p5N3n2m1K1J1L6L6k5L4kn0l2n1M3m1
$$ y = [-78, -64, -71, -126, -47, 35, -21, -110, -59, -134, -142, -61, 51, -55, -86, -50, -12, -7, -28, -77, -127, -140, -93, -93, -59, -42, -23, -28, -8, -105, -88, -24, -4, -4, 43, -51, -61, 13, -62, 5, 46, 6, 32, 44, -2, 35, 4, -22, -33, 18, 0, -20, 34, -88, -87, -62, -67, -44, -66, -106, -99, -89, -244, -182, -172, -134, -65, -97, -15, 18, -32, -131, -71, 28, 48, 22, 51, 35, 16, 43, 87, 14, 5, 57, 80, -64, -86, -40, -24, -23, 44, -17, 36, 69, -1, -34, -31, 43, 51, 14, -26, 17, -55, 3, -38, -62, 14, 63, 48, 35, -16, 29, -23, 12, -50, -110, -137, -24, -33, -67, 62, 43, 23, 127, 79, 6, -3, 39, 94, 141, 69, 3, -49, -133, -39, 44, -4, -41, 75, 59, 28, -5, 25, 37, -29, -68, 33, -16, -12, -16, -125, -36, -15, 2, 2, 1, -59, -54, -35, -68, -46, -61, 24, -36, -57, -46, 54, -66, -113, -105, -86, -88, -50, -37, -26, -43, 59, 51, 1, 31, 1, -73, -35, -48, -85, 18, 45, -34, 13, -5, 55, 52, -46, -123, -26, 1, 5, -19, -20, 14, -64, -39, -64, -2, 13, 46, -64, -70, -67, -56, -15, 74, 12, -27, -59, -72, -68, -72, -45, -40, 28, -47, -123, -23, 19, 105, -17, -24, 12, 5, 33, -61, -161, -106, 8, -56, -46, -76, -56, -34, -70, -167, -106, -62, -113, -18, -55, -131, -142, -37, 30, 60, -24, -40, -66, -66, -66, -47, 57, -40, -112, -46, -29, -22, -14, -60, -109, -84, -76, -72, 81, 61, -14, 39, -13, -54, -33, -22, 14, 50, 25, 59, 57, 7, -25, -76, -33, -74]
12585g4J4R6j8l1p4M1kJ2o0l3M4R9o0k5M1k2J5M0K0Q4p2n4oj8j2n4O4j3K1N3J1Pj05r4M2J
12568a22J4jQkK4n5N2N2kj8k6O9N2pp2q0M7j8O6%n3l2m5jL3L5P8K9j09M5O6J7q7j6j9k6M8
12550e6M0J27n1o7k9M4L8Jo2%n1M9l8M9MK7L6J7j37k9K5n0M2k9k4m6K6J49M4j08mP6m3o6m8
12533a44pJ08J6p6M3jp3P6J39lr2j1n2L8n1N4N3o4J2J0j13J0kQ7K3p4L1J9n2M0M2M4K5n6o6
12517f7j6Q9k5k5q9mM3n7M0k6J07K9k1QM0j15k1N0K5j2j3Q3M9r0q1J03L6q5r4L7M5K2j07K8
12500a14j2rR8K2qkj2L3m6N3j00k7J21m0K4L9o5NL5K2ro8j9J2M6Q3l6JJ8l8N6k9J5O6r5o7
12483d7j7M3lk1M2M7l8pKn0Mn9Q3M5j7j5J4l6R0k7p5l1M4P6j3n7L4R8K5j21n9L6j2JL4N5o5
12466Cq4L0L3Pl6q0J8Q7n5qN2L8L4K6%%k2j17L7m3K0M8nm9J2K3k3L6L9Rp8o0l4O1Q3lk7O0
$$ y = [-74, -60, 36, 18, -13, -87, -46, -48, -36, -96, -129, -85, 14, -46, -71, -30, -52, -37, 3, 23, 107, 35, -19, -25, -43, -55, -109, -45, -58, -37, 16, 27, 34, -71, -165, -123, -122, -108, -109, -101, -103, -79, -134, -82, -30, -32, -50, -76, -7, 45, 38, -34, -114, -67, -85, -19, -19, -72, -104, -149, -150, -117, -82, -4, 25, -84, -39, 27, 44, -43, -59, -78, -104, -56, -16, 111, 60, -7, -36, 8, 46, 47, -15, -15, -66, -17, -55, -6, -2, 25, 61, 78, -59, -88, -63, -113, -71, -100, -124, -170, -144, 5, 49, -59, -63, 13, -30, -96, -144, -151, -43, -27, -103, -60, -61, -134, -58, 81, 78, -14, -25, -77, -39, -90, -36, 17, -47, -35, -25, -138, -128, -130, -43, -20, -94, -63, -44, -96, -56, -14, 30, 55, -1, -67, -83, 6, -19, -44, -133, -137, -94, -151, -111, -137, -30, -1, -22, -14, 26, -89, -110, -60, -35, -47, -60, 23, 72, -18, -99, 4, 40, -45, -139, -102, -57, -35, -142, -114, -126, -135, -37, -15, -23, -25, -37, -4, -50, 3, -97, -124, -3, -43, -19, 20, -45, -40, -5, 17, 8, -60, -79, -67, -21, 62, 26, 27, 45, 7, 63, 34, 49, 115, 20, -47, -64, -21, -24, -45, -3, 44, 6, -1, 1, -49, -45, -104, -21, 24, 7, -8, 6, -30, 60, 33, -42, -73, -29, 47, 34, -23, 11, 109, 134, 13, -46, -10, -22, -21, 13, 68, 3, -81, -51, -18, -11, -47, -127, -109, -22, -77, -85, -33, 5, 39, 65, 65, 65, 43, -74, -37, -80, -60, -12, -17, -66, -54, -31, -54, -18, 21, 30, -48, -108, -142, -81, 2, -1, -28, 32]
12448C2l4p7l5j9L6P6j2J16l0q6N7k9J0L9%l7k6J9K6L3oj16pk4O3k7Nk0l0o2K7J24O6n8O3
12431E7k1l4m5l8O6l2k0qP9p4m0R0n8j0Q2Nl2L4q4O6l2m7J33o3o4J05j4K0J7J7q8QP4M9k5
12414G3k9qo0om5R6N2r1J0j28P4M2O2N7j3prJ26j84j02O2o9M1j0K9M9j00M0K5J0K3j1Jp0J0
12397f0Qj2K4j1p7PJ41q5l6k0NJ60n3q8kQ3j1M8K6r8j0K5J6o5P9O8n5Nj0q9j9M3Nl2M6L4n6
12380f6L9r0L6J05q7J2J63q6J7J0n1J7ro8K4K3l5j6M2k1nL9q4MR4m5kO5Ol9o8MJ3l8N2K2O0
12362C7RK2k7j48L2N9q7J4Q3L3q1k5O9MMK2pn9m8J09n8l0%m6K1O9J2L8r3LRl2j6N1l9Lk4l9
12344a56J18L0l3o1j0N9J3k9RL2N4k9m4K0L5j4nL9oJ9m3k1o2L8J6o2m3K8K6k8J2K9Mk5l9N1
12327g8n3K7k9L6R8M5k6k4k0L0J4J9km0k6n3L9K6j4l1j0n6L5jk1R8L1q2p4J57O1j36M5K1K0
$$ y = [32, -2, -79, -114, -133, -97, -21, -33, 83, 53, -33, 24, -5, 5, 44, 44, 7, -19, 0, 26, 59, 53, -63, -70, -94, -31, -58, -53, -73, -103, -165, -138, -14, 52, -6, 57, 36, 2, -43, -81, -15, -47, -67, -75, 4, -70, -110, -20, -78, -88, -6, -1, -33, 1, -83, -17, -49, -96, 37, -26, -90, 15, 1, 21, 38, 55, -33, -25, 49, 98, 73, 44, 36, -24, -30, -75, 21, 73, -18, -8, -136, -62, -20, 42, 99, 86, 79, 70, 196, 12, -90, -28, -97, -56, -66, -37, 12, -88, -48, -23, -13, 10, -1, 0, -70, -60, -52, -64, -40, -51, -128, -121, 20, -65, -101, -121, -116, 44, -9, -97, -99, -16, -27, 21, 47, -51, -61, -36, -20, -85, -6, 62, 7, 12, 2, -87, -106, -63, -58, -90, -44, -10, -66, -27, -117, -81, 24, -63, -51, 112, 26, 43, 53, 2, 19, 10, -58, -34, -11, -46, -62, -20, -41, -46, -7, -91, -87, 7, -38, -40, 25, 31, -8, -76, -72, -59, -97, -45, -23, 37, 46, 68, 41, -107, -75, -16, -103, -89, -6, 27, -54, -79, -10, -6, -2, 20, 13, -46, -94, 15, -43, -73, -73, -119, -98, -29, -17, 21, -72, -69, -60, -92, -108, -57, -96, -93, -117, -156, -38, -8, -41, -102, -112, -53, -40, -69, -60, -28, 26, -3, -47, -27, 8, -6, -11, 28, 22, 41, -2, -23, -85, -47, -31, -93, -136, -108, -82, -110, -98, -69, -65, -90, -129, -78, -131, -104, -133, -97, 1, 46, 20, -4, -24, 6, 20, 39, 37, -3, -29, -82, -43, -17, -31, -62, -72, -128, -93, -94, -115, -17, 14, -68, -142, 15, 76, -60, -15, 6, 26]
12310B6q3Q8nm3L2m5n6O6Jo2J29NqjN7o8j23K4j6J0K1k5L7R8l2n0K3N3r0L1Km6Ll1R6m3l7
12293f2j0j6o5L2P4PL3rk8N8k7p3Q0ok8KO3p1M5kNj6r5j2Q3k3k8n2L6P6N0m1N7j2m6K2Q6m3
12274D4Nl6K5K6j16j9L2k2j1o1R9M1j01K4J4N3p8k7m8M2QJ5k7k1N3K7N2k5J6k3j4M3L0j05
12258h5N0nl6J8j9Q6l4q6J56O9o6k3qM1o3n3P0m3l1MM5l0o5J9N1ln6j4k5L9K2kNlOkL7lP6
12240C9kn5m9qm6qJ07j2j7M3k2K3K5J5KjQ9Kj05p1J1M7p2K2j2L3OJ7m2K5l4n4P7k2K0M4k4
12222ik2j2l7M0n4oK4O2n1pk7J5o8m4N0L6N1%M5m8n7l8J07K8o7RM3K6j5M2q1o2N4O7PL5K4
12204F0l9L3l3qo6J8N4K7n6j3j4o9N4k0K3N3L6j02l3N7p6m3J0J6N0rl7N7p4K4M6P4k8n0k9
12188a07P1J3L0K2M7k8j02J6P1j8p4kj1LkJ4n8J27j14K5Q6o2j9j0P1J65j16Ql2o9k7MK4O1
$$ y = [26, -57, 31, 26, -17, 15, -30, -86, -20, -19, -81, 48, 53, 45, 44, 101, 33, -90, -66, -82, -72, -51, -76, -39, 59, 27, -23, 0, 53, -37, -6, -4, -50, -47, -78, 18, -25, -62, -72, -88, -153, -121, -47, -40, -7, -16, -44, 14, -13, -86, -6, -12, -40, -38, 25, -46, -1, -3, 2, -14, -109, -121, -38, -61, -89, -141, -105, -29, 21, -20, 37, 25, -21, 1, 87, 44, 49, 13, 38, 64, -52, -71, -39, -61, -72, -133, -34, 7, -94, -70, -56, -3, -81, -108, -156, -114, -106, -91, -118, -139, -86, -59, -7, -32, -16, -39, -53, -10, 20, -85, -35, -40, -76, -58, -77, 9, -25, -111, 45, 114, 48, 25, 17, 58, -5, -58, 12, -31, -62, -58, -13, -43, -108, -89, -38, -41, -97, -111, -136, -97, -75, -77, -72, -75, -69, -71, -34, -37, 39, 37, -18, -67, -75, -121, -129, -22, -34, -51, -8, -30, -7, 18, 33, 35, 34, 123, 125, 20, -51, -40, 7, -65, -43, -55, -22, -16, 1, -41, -16, -50, -104, -27, -49, -29, 15, -9, -31, -43, -80, -40, -94, -100, -76, -14, -65, -72, -99, -84, -152, -196, -146, -110, -59, -59, -14, -62, -119, -157, -50, -22, -89, -80, -37, -11, -26, 16, -65, -127, -73, -6, 1, 36, 60, 21, 54, 21, 13, -53, -35, 19, 46, -10, -23, -37, -106, -52, -72, -49, 4, 40, -62, -95, -38, -114, -157, -147, -131, -81, -90, -127, -70, -144, -120, -74, 0, -28, -78, -107, -36, -23, 7, 29, 76, 48, -54, -38, 33, 15, -59, -61, -72, -69, -71, -57, -115, 12, -102, -77, 9, -53, -72, -82, -11, 154, 38, 46, 14, -55, -82, -78, -54, 7]
12171Go4o5K3P4o0k6PJ9N0O1l7J7L2j4j1K6k6n9m7j8K8KJ8Q4o4j8K0KK9Pj03J0l9J01N6M7
12154F9M8J1j30j27P4Lj7L9J13j03J6L3j12oJ17NL5m3o8M7l5kl6L3K8L2J9o0L1P8j18K4M3
12139D1l6r7MP8n3K6L7l8m4lJ9n3OR4M2m6o4J4k6j6l6Q5J04m4L7j4l1jp5n9P1P0m3MKoL3K1
12120Cn1M9p9K8QL9o5l0O5j16N7QN1o8N0O7j8o2N2M3n8J3QM2J3J7r1R6j2r4J3M3m8J09j18
12104c6OOm1M8mj1o4L6N8mJ4N1q7J4K6L2ml0n2P7QKn4J0l9n2l4K4K6N6L4o6k4N9JN5j22lj1
12085i5R0p5kO0N3k8p0O7o3m5%k1l7J0J08j2K7j0k2lK7L4m5m1k7P3N2j9o8J11M5l1l3Pq2m9
12068a14K3K4N3N2Plm0q9O0kR1K5p6p3o0M7J9lJ29j08P4Mj20LL1Q0j5k9M9l5N0j5l4l3r7j6
12051a41J04O8K5q4J9J0p1k8O5l6k5Q0M3Rk2M1r3j5J9m8J8mk9L9Q2M0m3k7mj9M5jk1M8o5J01
$$ y = [7, -57, -122, -99, -25, -85, -111, -104, -85, -35, 26, -11, 6, 38, 24, 13, 39, 13, -46, -93, -111, -83, -81, -63, 21, -43, -61, -41, -39, -10, -3, -106, -96, -135, -34, 22, 69, 117, 128, -2, -129, -55, -52, -69, -30, 83, -20, -4, 29, -83, -89, 28, 33, 68, 25, -43, 4, -31, -33, -69, -36, -8, 24, 43, -17, 14, 92, -26, -2, 41, 5, -92, -88, -10, -63, -37, 0, -38, -82, -85, -66, -119, -113, -19, 23, -23, -87, -73, -99, -115, -151, -66, 38, -6, 31, 17, -14, -15, -90, -149, -78, -8, -51, -47, -45, -51, -18, 3, -48, 1, -78, -50, -42, -3, -68, -98, -33, -149, -92, -84, -33, -101, -51, 16, -2, -64, -12, 31, -27, -14, -6, 36, 49, 66, -25, 71, 59, -35, -22, 21, -27, 82, -36, -30, -24, -65, -17, -21, -32, -96, -60, -2, -6, 8, 59, -28, -14, 12, 44, 40, 10, -42, 35, 43, 45, -9, 1, -38, -90, -124, -100, -74, -18, 16, -50, -74, -15, -14, 41, -81, -84, -95, -5, -80, -82, -22, 31, 3, -67, 0, -63, -108, -108, -129, -166, -156, -48, -60, -33, -43, -65, -68, -41, -7, -52, -93, -120, -47, 5, -14, -82, 29, 74, 43, 10, 17, -65, -114, -91, -67, -14, 38, 45, 42, 2, -87, -27, -29, 62, 87, 11, -62, -122, -75, -56, -59, 70, -38, 36, 40, -80, -77, -46, 34, 19, -10, 39, 4, 54, 39, 5, -28, -125, -141, -37, 31, 56, -28, -9, 1, -70, -98, -33, -69, -94, -14, 29, 38, 16, 57, -36, -51, -32, -80, -62, -66, -95, -56, 26, 66, 23, -4, -8, -27, 18, 17, -4, 44, -21, 80]
12034H0m6n0j3pJ18L0pl8m7n0j0M7l5j0N8n6j4K0rmm4m6L9J3M7K9j3ol8p1jN0k2J28mL0J9
12016F7q4q3j3J7N9j3o0L3K3N1l0N7l9K1n6k7M6m5k0O1M1o9L7N2j1l6m3Qj0mO8l5j7n3MN9
11999d4K8JJj0m3j5Q3Q3l3k3m8RP9m5K2m9jP5n6q3L6PJ1l6N8J0L6J0q7q8l5O6J0l0Q8n2rJ9
11981e5J7Ln1J5N5O6l0l8n3O8K7P1o3K5l8j26M0K2K7J6J2k1k0k3J6l9J5jO6%j5j16%J06l0
11964e2m1K1M1j8J8O0K5l7k8%N2J4k6j8J0k7K7nlk6J6O1j1j3rj22R5k3j8q3N9l7ok9J5P0m7
11946i5m4J02k9k9L4l3K5j2j7J8J2MK5KLp1j3M9L2K2k4m5O0l0q7Q2K4Ml8m5L8l0N6n1M0L3
11929b8J7M7M0jr2n4J03K3n1L8p0n3K6l0M7m4KO7l0M%q5o8Q0K6m9J04K8M3r4o8j4OQ9j2j7
11912g0N8N3j04Q8j5j5k6n2o3O2l4M0Q4o4N8O4m2L2O5n7o6K8K5M3j29q4P6L3O2J2j29J6L6
$$ y = [80, 34, -16, -29, -36, 82, 112, 105, 67, 20, -30, -40, 7, -28, -38, 20, -36, -50, -30, -39, -43, -87, -133, -94, -81, -34, -5, -18, -24, -62, -133, -134, -84, -106, 22, 18, 48, 67, -17, -100, -113, -96, -37, -50, -110, -77, -54, -3, -33, 24, -15, 6, -50, -77, -31, -76, -96, -35, 6, -63, -26, 26, 15, -21, -64, -56, -66, -70, -2, -37, -54, -107, -103, -44, -16, -15, -14, -24, -67, -82, 1, 84, 51, 28, -20, -11, 68, 23, 45, -4, -5, 70, 14, -69, -33, -26, -15, -51, 7, 17, 53, 63, -24, -112, -147, -81, -71, -101, -13, -65, -74, -55, -38, -35, -86, -71, -16, 50, 20, -18, -71, -3, 24, 95, 32, 57, 19, -107, -67, -45, -18, -2, 10, -11, -31, -54, -38, -77, -62, -63, 3, 3, -12, -128, -128, -22, -52, -93, -72, -31, -49, -31, 29, 54, 17, -11, -11, 41, 55, 29, 11, 21, -6, 21, 16, 13, -13, 3, 64, 53, 40, 31, -91, 4, -19, -37, -120, -61, -98, -104, -133, -118, -48, -95, -139, -37, -66, -95, -61, -94, -69, -81, -98, -80, -68, -64, -39, -37, -34, -105, -118, -69, -37, -15, -39, -84, -24, -54, -141, -59, -35, -31, -69, -114, -76, -106, -50, -101, -61, -28, -11, 36, 76, 75, -17, -71, 32, 55, 4, 42, -28, -81, -55, -85, -38, -82, -80, -13, -43, -39, -39, -124, -192, -112, -86, -135, -31, -3, 40, -54, -122, -136, -130, -41, -53, -70, -12, 41, -63, 25, 10, -5, -31, -83, -146, -84, -118, -78, 6, -58, 0, 64, 22, 54, 119, 62, -4, 24, 49, 92, -37, -121, -45, -12, 50, 62, -67, -51, -15]
11896a5Ol1J3N4q0J3m4R6L2m1K5M9n6l6N1mj8j44kJ30L4m3O2j0q2o1NJ36m9m4pJ9m5pP2Jo
11879b7k4M1p5l5Q0L3Ok5o2N7N0N5p3r0Qj6l1Q5p6L7R4o1q6N6N0Qk2O0MPl2K3k0J7m4N9J5
11861D6J4J3K0m6Rj16K5rl1nKL2l1KL3k1l8K9m5m5j0J30P5q4OP5K8k3m9k8J8N8o3rj4l7m4
11843a33P7N1j6o5MJ00R0p7k0k2k8k9J0N9j7M3o0J7m4j5N7P5on0r5P0L1Q2m3J5k3n6R1mo1
11827Hj4j01Q4mK0o5o3j1N1Q6m6MM9M5ko1J6J2J9o6J0P8q9q3k7Q3P9J09Kn1p1mK1qr2J6J11
11809D5O0j21n6kKl5J8K6k3j9L3On1J05o0n0N7P1p2L9m1O6O9j22l1R2pj38l3J28P4k5J3m8
11793c0o4L6O3j13M6J4K6m4mJ6R4n3K3l5J01n2m7O3l4J0n0l6j1J2jKl0L6K5qk3m4L0N1ko5
11776i8L8k4n3O7R5%Q9p0l7o3N7K1k7j8QpM4L9L1p3K9K8q9rJ6m3lj6N9m0L5m9kK6N1QJ7k8
$$ y = [-15, -9, -40, -27, 27, -53, -40, -84, 12, 44, 3, 28, 77, 21, -15, 36, 32, 14, -130, -132, -2, 32, -11, 51, 41, -41, -102, -97, 39, -10, -54, -61, -42, -87, -94, -22, -21, -27, -51, -10, -85, -120, -40, -7, -1, -26, -88, -31, 19, 74, 1, -89, -81, -97, -128, -43, -119, -82, 12, -49, -135, -79, -29, -21, -43, 17, 21, 28, -4, 19, -1, 16, -28, 31, 46, 60, 73, 93, 47, 56, -60, -35, -44, -75, -80, -78, -46, -77, -75, -42, -63, -101, -72, -117, -162, -172, -42, 33, -51, -45, 30, 58, 35, -14, -42, -24, 34, -29, -38, -52, -89, -133, -56, -5, -21, -86, -82, 18, 108, 31, 11, -11, -39, -68, -58, 1, -16, 27, -33, -16, -60, -75, -18, 57, 51, 1, -94, -24, 7, 89, 46, 61, 38, -18, 73, 69, 8, -6, -107, -23, -27, -7, -72, -135, -146, -95, -9, -55, -51, -2, 43, 41, -20, -4, 8, 27, -39, -29, 49, -40, -123, -150, -67, 12, 121, 123, 72, 1, -3, 18, 10, -82, -66, 45, 105, -16, -72, -74, -72, -107, -89, -63, -86, -105, -72, -66, -117, -12, -72, -122, -65, 6, -66, -27, -68, -2, 67, -55, -86, 6, -1, -139, -172, -44, 30, 5, 18, -30, -94, -58, 5, -108, -62, -48, -22, -66, -70, -54, 40, -13, 10, -25, 76, 24, -23, 40, 6, 16, -34, -70, -81, -69, -70, -68, -98, -62, -37, -45, -68, -112, -82, -31, -33, -98, -60, -84, -137, -70, 25, 25, 114, 44, 7, -56, 1, 22, -5, -23, -15, -22, 22, 61, 92, 19, 48, 76, -13, -22, -6, -49, -52, -68, -9, -49, -14, -63, -65, -39, 12, 20, 37, 9]
11758Ip8K1m8q3mO5J18L3l6o4J6J58o4Rn4n7J12rj10Q1j9RL0j16N0N9n5PjJ3j7m1J2N1J5l5
11740b3K4k7qQL0j0J7m1p1K7%J0N8OK7K6j00%N3m0N3K0l3Nq2K0R2n9j13j3K8N1P3p4n3j4O1
11723g2Q0O4k4mj8p1j4j9J29j5j71N2l7lk4P9j1k0pN0N1K7m0J0p2K1Q4j0j8j8m2K6q1j0Q5
11706d3J3J16m0p3k1l3j1N5M8k3O1km4m0m9M9j5Om6L3P4L9j5n7k6p2P2J7j2%P6K3k2no5k8
11689f0Q5j2j7K5N9n5Q1Lr1k5l7R0K8o8j17L7J05l0P0J1r0Rmj8k1K9N9N2N3l4m6j16p5J08
11673a2l2O7Qj3l9n7P1Mn6q8N7K5J7m9K8L5O8Rk7q2MM2Nj4l9M8M1L7j04p2K1P4p7OK5l6K2
11655h3M3M1q2j0N8l1OM6j4J0n3j3K1OK2P1k3j12O5Rm7M7l3p8Q5M0n5qP4j5n0j0k3O2K0j3
11638b7M7P4PJ7l5m3p0j8p1qN4m4J17O6l5m8j58QO7J11K2p4mRP2l7j7Op5R0M8m1J27n0p3P
$$ y = [9, -69, -48, -96, -179, -183, -118, 0, 33, -3, -67, -51, 107, 43, 52, -2, -59, 53, 44, -66, 15, -4, 5, 35, -81, -31, 28, -27, -20, -21, -8, -25, -66, -54, -3, 12, -23, 1, -26, -34, -26, 4, -6, 11, -30, -101, -74, -74, -64, -6, 0, 27, 53, -47, -47, 6, -34, 19, 39, 6, 11, -71, -51, 41, -18, -131, -144, -116, -65, 8, -66, -119, -133, -72, 8, 72, 48, 44, 26, -45, -59, -78, 51, 36, -135, -83, -120, -123, -147, -68, -79, -99, -106, -56, -5, 22, -18, -8, -80, -59, 25, 15, -3, -21, -63, -37, -118, -128, -43, -30, 86, 46, -27, -48, -81, -92, -37, 11, -12, 49, 47, 3, -37, -86, -37, -52, -46, -92, -59, 15, 54, 39, -18, -44, -116, -44, -27, -39, -39, 37, 60, 38, 33, -32, -60, 25, 13, -4, 21, 80, 25, 106, 109, 18, -7, -44, 46, 74, 6, -111, -74, 31, 1, 71, 82, -8, 1, -3, -21, -42, -13, 46, 98, 151, 117, 71, -45, -120, -12, -44, 23, 31, 18, -21, -78, -7, -3, -59, -147, -90, -65, -48, -97, -69, -34, 34, 43, 16, -66, -62, -20, -15, -29, -68, -20, 21, 58, -46, -118, -97, -23, -100, -94, -69, -105, -83, -40, 1, -81, -91, -33, -64, -58, -12, -26, -16, -69, -82, -61, -55, -33, 38, 15, -97, -32, -23, -70, -23, -56, -134, -49, -9, -64, -72, 2, -13, -63, -73, -96, -34, -14, -27, 20, 94, 101, 118, 83, 40, -30, -48, -119, -127, -73, -117, 0, 66, 31, -17, -175, -167, -100, 11, 33, -41, -45, -36, 36, -1, -18, -12, -87, 3, 51, 10, 137, 87, 14, 21]
11621B1l2K7J6p0l5m8O4M9l2M1%q6K5L8o3R9J7l9l1K0k3m1OO3K2j03j6j3KK5K7J9n1lR8p3
11604h0k8P8j0R8o5p0N9K8o7k5M0K5oJL1o9l3J06p2j4j22J4J33M4j15l4KN9K8O4L1k8p6q7
11587a60Q6K8ml6M9%L0L4oJ3m0mK6l0N2q5m4J63KK6r4j51M1k8J02N4k3j02M8l2K7J2KO6LO3
11570H8r4J8O6p2n4M2m7l9N3k0L3j25J09N3q6RM6k3jn9qK3%pJ0n8K5Q4j9m8j3Q5L4R2k0k3
11553E4p4O0rpkqo3jM2m7K6k1M4k4j13Q8M6l5Q4N0j11J4M0j1m6n6K9k4p6o8J00M7M3KL7n0
11536d0NJq2J18m2K0K9q1k2J4L3l4m3Q2RLLj00M0j1P4n0j5k3jJ5J9l1N2O1j6MJ2J3l2L2n0
11518c4J1L9n2Kj9nm2L8k2P5J3l9m5P1KK3L1p9o3P6K0n7M6j6J06n6q3m0P1j7L2Po1j7n4N0
11501h8P8m8Oj1PN7k8q7O5LKJn9J22pn4j5n4J16l4k1j53L9J54p9n2M6M1n6RM3L0N5Kq0o6P4
$$ y = [21, -11, 16, 32, -38, -73, -121, -57, -8, -40, 1, 1, -85, -60, -22, -85, 14, 31, -8, -39, -19, -42, -83, -77, -14, 8, -95, -111, -124, -122, -97, -70, -51, -102, -105, -7, -80, -108, -30, -40, 58, -7, -77, -18, 10, -57, -82, -42, -17, -23, -22, 9, -60, -93, 13, -59, -73, -195, -181, -48, -4, -119, -153, -151, -92, -64, 0, 31, 3, -73, -160, -74, -46, -50, -86, -37, -37, -7, 27, 21, 34, -6, -10, 16, -14, 38, -47, -91, 72, 74, 100, 6, -145, -104, -132, -30, 24, 1, -101, -53, -85, -58, -46, -44, 22, 25, 88, -6, 12, 78, 6, -48, -6, -53, -92, -39, -59, -26, -151, -42, 11, -75, -66, -20, -43, -44, -103, -111, -88, -88, -95, -85, -143, -118, -34, -53, -101, -114, -29, 5, 97, 77, 54, -20, 40, 31, 24, 22, 14, -49, -50, -8, -55, -29, -50, -6, -30, -143, -55, -9, -44, 40, 90, -21, -7, 33, 22, -24, -80, -51, -75, -151, -219, -119, -72, -29, -27, 10, -40, -35, -34, -116, 2, -40, -20, 9, -72, -94, -80, -47, -81, -124, -42, -33, -30, -27, -127, -87, -98, -24, -74, -89, -112, -113, -98, -79, -110, -58, 3, -13, -9, 3, 16, -16, 16, -34, -23, 16, -36, -34, -53, -58, -100, -62, -84, -9, 4, -35, -80, -9, -7, 16, 47, -32, -95, -19, 1, -56, -10, -26, 80, 24, -59, -99, -28, -45, -13, -6, -67, -84, -138, -88, -10, -58, -52, -63, -56, 1, -27, -114, -49, -46, -44, -43, -102, 20, 13, -41, -56, -110, 6, -28, -49, -202, -163, -9, -88, -140, -94, -53, -109, -100, -57, -27, 28, 30, -50, -116, -42]
11483d2Oo8M0K7m3N1J31j25j00NO8K8k3M9K6L7kJm1p5j3j5N8J2L1q2K2l5k7NM3PJ6j7O6n6
11466c5M5j9n2qN0m0J8l0M5oK5%oL8n3k7k9KK5J2O0j6o0nJ01J7j23O1m5j6O5p0m5kJ01MJo5
11448h2n8R7Jl1j6P3m2L3L8Kn8N0o9K3kj1K1j0l2j41J29l2J10K8n0L9l5jk9L1J17l2n9J4k3
11431gL1k4o7k9j7m5K8M8nk6R1p1kM7o2J7N3Pk7l7j7LJ2K2L1m0O0J07kK6k2q1r7N9qn1J12
11414A7k2K0L1N7l6p5mJ00lo7m3k9nj9k5J8j5L3L5J4po6M4O6n4n2k4j8P0l0JJ9Kj22Q7J21
11397A9n4K1k0K6j4m1OpJ9j9L4j0J2Lj1lj27O5J2n4O0J14L7j4M4k19PK2R5N5l6p9q1rN1PL3
11379e6N8j6rJ1m9O4o4J5L3M3o0p9n1L2N0L5olQ0K7q2l2l5K1O1r7l5j8M1Q6m7k4o7J9P7P3
11362dn8L9l4k1l7J5J4J10r6O3K7m6O3l9n1O6K0n2q1M8l8K3j8P3m9M2Q5%o2p7k1n6Q5N8n8
$$ y = [-42, -36, -104, -64, -37, -80, -29, 102, -23, -123, -118, -50, -22, -45, 4, 30, 67, 65, 66, 25, -50, -63, -78, -20, -8, 23, -59, -37, -72, -99, -94, -51, -44, -28, -45, 21, -35, 10, -9, -61, -69, -19, -59, -41, -71, -26, -32, -7, -7, -13, 25, -28, -55, -84, -82, -57, -45, 15, -1, -61, -66, 35, 52, -71, -10, -55, -71, -6, -76, -121, -123, -22, -18, -17, -82, -140, -43, -42, -73, -89, -16, -58, -25, 13, 15, -43, 7, -62, -39, -41, -52, -31, -41, -73, -214, -85, -117, -7, 21, -29, 10, -25, -26, -55, -24, 93, 61, 2, 16, -7, 24, 0, -67, -96, -113, -158, -130, -82, -87, -113, -22, -93, -95, -48, -110, -93, -40, -33, -60, -97, -114, -111, -99, -77, -46, -86, -26, 81, 79, 105, 83, 2, -95, -36, -44, -95, 17, -5, 15, 46, 103, 67, -8, -12, 88, 85, 18, -25, -54, -59, -78, -103, -85, -100, -67, -32, -18, -25, -91, -47, 19, -35, -87, -111, -129, -59, -89, -88, -69, -67, -189, -102, 19, -35, -14, -34, -8, -22, -63, -57, -64, -45, -64, -30, -40, -28, -25, -36, -39, -166, -101, -89, -143, -83, 31, 68, 54, 98, -121, -114, -92, 3, 58, 22, -57, -138, -147, -96, -89, -56, 2, -14, -23, -12, -61, 3, -61, -46, -13, 30, -30, -109, -160, -128, -78, -43, -49, -52, 28, 55, -27, -59, -94, -73, -12, -109, -144, -162, -121, -35, -82, -106, -173, -154, -77, -4, -62, -23, -57, -78, -115, -100, -86, 24, -72, -9, 18, -28, 35, -4, -55, 11, 31, -21, -102, -54, -92, -69, -87, -14, -63, -21, 64, 64, 2, -75, -96, -152, -67, -9, -67]
11345f7r9N1Q7l7K2L4j35PJ00M7j1m5j5o8L4N2Rqo8QK6J02n9mKrp0mL7OLO9K7j8NK0l0p7n3
11326a29K2J8M1J1p2PN6P4kk5m4m9J2O6K4Nk5n6L1K2o3J8m1Q5K2M2rq8Mo2O8M3K4k7q0l1K3
11309h5O0K9Jk5n9j02R0J5m1N5P4l8N1j36J04kqR7M5n0n7n7j05K1k6j4O7J05j30j0qM9K2N9
11293iO7j8o5N7MJ3K7j9j09L1K3k6N1k0Pk7n7N4K4o1K7J6m8K3k0Qkk3%m6M7L2j24J6J24nn1
11275g9J3ll6N7k5M2N6o6o2JK8O3K2n7n3M6R4n0No3J9k3j9k8RK3N5K9Pj17m4O5R3Q6n0POo4
11257a3mk3%N4m5NN2O5m6m7mM1J6k0j4k8m8LO9j7r9O9j6L4nm7P3L3r6l7j8Q2l5kJ1N2J5k1
11239a1r2n8L4ql1pP8N6K5M4m3p9k8L1P0L8J0n5l3RJ32q6l2k3j0L7L9K3OO8m9K2o2L3k1n3
11222b6j2o6O4k1QJ5J11K6r8j4P1j4j10J1L0j02k1J7P2J7PN5j2o7q6M8P7rJ0L6L6p7k2n2K6
$$ y = [-67, -166, -115, -28, -65, -43, -9, -144, -137, -37, 10, -1, -46, -61, -129, -95, -43, -34, -42, -110, -102, -76, 26, -33, -37, -35, -44, -114, -118, -81, -75, -72, -3, 24, 6, 11, 31, 1, -76, -129, -107, -89, -48, -37, -109, -102, -46, 28, 26, 1, -43, -92, -80, -14, 10, 15, -10, -66, -35, -13, -76, -58, -99, -14, 8, 50, 41, -47, -43, -105, -37, 6, 30, 3, -77, -108, -85, -25, 4, 5, -20, -79, -181, -91, -76, -117, -62, 12, -26, 25, -111, -7, -9, -17, 80, 125, 75, 18, -39, -144, -123, -149, -163, -96, 9, -121, -131, -139, -90, -68, -9, 58, 40, -25, 32, 36, 49, 76, 57, -52, -21, 2, -24, 27, 7, 14, -13, -70, -16, 8, -53, -26, -10, -58, -35, -55, -47, -49, -72, -72, -118, -71, -39, -163, -147, -23, -28, -79, -66, -69, -105, -48, -73, -31, 25, -41, -103, -102, -74, -11, 11, -46, -99, -53, 41, -9, -4, -67, -48, -71, -90, -118, -109, -86, -31, -2, 5, -112, -156, -91, 2, 88, 38, 45, 51, -13, -17, -40, -40, 14, -31, -26, 26, 91, 45, -2, -6, 35, 51, 31, 17, -11, -59, -56, 13, -4, -103, -34, -50, -16, -21, -68, 5, 38, -58, -95, -113, -31, -66, -68, -57, -5, 10, -11, -103, -161, -127, -135, -166, -173, -95, -39, -14, 30, -13, -92, -120, -89, -19, 19, 29, -26, -59, -50, 82, -4, -36, -59, -69, -32, 7, 30, 36, 104, 55, 77, 15, 48, 27, -26, -38, -104, -40, -61, -53, -38, 73, 99, 1, -13, 58, 44, -66, -55, -25, -127, -148, -131, -59, -42, -35, 20, 8, -59, -145, -97, -20, -29, -19, 17, 53, -24, -46, -98, -72]
11205g2O7O5K9o3MJl0M6m4J8r3K0J02j5j9n6l5JK1o8Q1l8n9O1j12O3L3l3P5mM5l1l8J35mr2
11188c9o0N3J1k9R4oK5p1j11n8P6L9m6Qk3QJ13J0j06J9K3k7Q7j6O0k0m2M0m0l6l8k5l9K2l9
11171a83RJ37J0m3oR0n7pk5J4k8O8P5N8qk5o5p6%J5N6Jkm8n8L2k4pJ4J04j30K5P7Oj00j3n0
11153a64K4P8m2L2J2K2l4L7j2K3m4j05L0K7P9pm1nJ4OkL5M3j7P5K8j06k4L1n9O0k1k1K3j00
11137a25o1M3Q1j7m5J26k6q2L8m8l6O9QN7p3k3J12K3o1l9N7l3R5L7n3l5KM9n0j0KK1M7jq5
11120c6q3M5j2N2L8K2j7N5k7m3j7O0k0l6j7j7L3L9OK7j45K3pK2k5n2K5P7L7j8Lo9M3N0jK6
11103D1j5j8k4ll7oP0m6N4m0l4QJ3qP%nN9N4j01j01M0k6Q4pk6Q6J9Nl3j02L3P1N5n5J4l7k1
11085c2j1J6l5J1K1j5N8p5k4R0j1j19k1o1JJ15L8RO3j21L7K2j7J22N0p5O1%n0k6j5N5n9o1
$$ y = [-72, -5, 60, 89, 26, 30, 31, 1, 47, 3, 21, -72, -52, 50, 35, 16, -40, -75, -74, -53, -121, -40, -78, -137, -76, -188, -125, -92, -125, -50, -54, -9, -40, -78, 57, 53, -39, -99, -46, -35, -64, 30, 24, 49, -22, -133, -191, -115, -76, -122, -114, -137, -129, -16, -6, -112, -93, -70, -97, -10, -26, 34, 14, -28, 12, -28, -64, -102, -127, -166, -144, -183, -174, -37, -27, -70, -76, 14, -43, -50, -75, -61, -89, -21, 54, 112, 104, 79, 14, -62, -62, -47, 9, 10, 8, -40, -98, -66, -90, -97, -83, 21, -109, -84, -7, -1, -101, -114, -164, -140, -62, -104, -72, -60, -38, -72, -35, -47, -24, -68, -173, -143, -116, -37, -44, -85, -90, -76, -70, -72, -37, 6, -11, 64, 92, -14, -38, -7, -66, -6, -27, -48, -25, -125, -186, -143, -62, -79, -124, 2, -24, -106, -68, -116, -152, -83, -75, -18, -91, -114, -2, 21, -40, -79, -22, -55, 40, 77, 24, -11, -9, 40, -10, -20, -18, 3, 50, 49, -36, -119, -74, -86, -34, 4, 26, 9, 64, 37, -6, -23, 37, 17, -19, -36, -53, -20, 19, 25, 52, -93, -70, -77, -55, -80, -132, -107, -30, 7, -11, -8, -77, -34, 16, 15, 41, 26, 8, -16, -19, -56, -62, 8, -38, 16, -24, -58, -50, -37, -45, -38, -38, -43, 16, 70, -31, -132, -92, -118, -34, -41, -67, 19, 38, 43, 10, -92, -59, 12, 67, 12, 26, -11, -32, -43, -27, -62, -51, -30, -45, 13, -62, -86, 4, -7, -126, -147, -208, -207, -92, -54, -45, 18, -103, -66, -44, -61, 61, 111, 36, 97, 97, 47, 21, 6, 61, 2, -59]
11068e9J2o2M0rr1k7Q2K1k3M9M2Kk8Q3nOrO5o3J2q0k4K6O0km9P5K9k0m2j0Nr8P5K6l0kp2J8
11050g7J81m4j9M5j9j26l8N4N6n0m5l2O2P3Kk7%qo8m0K5j0R4j1n7L9J7m3p0M3Q3K5L0k8m1
11033b4o3M6N0m8M4j11N8m7O9o6m4N5M5MJ4m1k0P9l0r5P1J1rj9n5RK9K8k2k7J2J40mk4pj3
11016el2m0N0jk3JQ2l5k9J8N0Lj3j7p8J3OJ1M2k4o9l5O8M3Q3mj3O7j20n7Q1j0J9o3j8k2j6
10998h7L5K0K2K7J0j5m9l4N2pl6Q2L4p5p5m6J21J0J9n4j8m2J24M4k9M9o2QL1p9n6O0k1J5L6
10982A4p0m0K5O2QLj7o6j3L3JQ5K6k7J18n3n5j21oL9pj2J00o4K0N9p5k4M1ML7m7r1K3k2N0
10965f2L1m9K8m5N3km5PN3l9J0K4l0rJ49p4m3l6j9L0Qm1l4j9R3N8m5km8Q2oO1p1m5Q9nm4j9
10946e6m3J4j3o1O9J8L2P0m6o4M8P2p6m2KO0J6L1mn7K6l5j5K8p5M0l7K3L3l5qN9Rrk8JJ8r5
$$ y = [-59, -47, -109, -69, -78, -169, -196, -114, -93, -116, -67, -25, -23, -51, 32, 27, 33, 24, 89, 26, 38, -42, -66, -40, 20, 18, -31, 44, 73, 53, 11, 1, 6, -92, -17, 9, -21, -23, -95, -77, 104, 60, 41, 86, 67, -59, -97, -43, 13, -37, -82, -114, -52, 21, 23, -4, -4, -12, -80, -120, -95, -105, -11, -22, -79, -40, -23, -66, -136, -93, -10, 15, 45, 17, -24, -87, -41, 9, -39, 5, -106, -48, -95, -26, -92, -136, -81, -36, -32, -18, -59, -79, 0, -30, -125, -54, -43, -52, -71, -126, -117, -88, -60, -82, -109, -97, 43, 39, 15, 8, -5, -37, -77, -27, -28, -51, -50, 32, -3, -32, -14, 36, 39, 26, 9, -69, -56, -50, -39, 3, -21, -90, -125, -57, -14, 69, 65, 52, 119, -1, -58, 23, 13, 32, -31, -49, -71, -87, -52, -32, -10, 17, 27, 12, -37, -71, -19, -26, -62, 20, 54, -21, -96, -142, -21, -11, 8, -46, -64, -106, 18, 62, 33, 82, 20, 28, 59, -20, -76, -16, -37, -22, 14, -56, -96, -71, -9, -1, 2, -15, -81, -94, -61, -60, 25, 51, 24, 142, 89, 34, -87, -93, -54, -61, -73, 27, -37, -17, 42, -33, -57, -16, -12, 25, -22, -113, -90, -112, -62, -31, -80, -52, -97, -44, -46, -91, -84, -31, -70, -60, -36, -66, -75, 74, 0, -43, -79, -98, -68, -60, -101, -135, -154, -61, -3, -48, -50, -98, -16, -22, 39, -32, -77, 12, 7, -37, -56, -99, -85, -98, -159, -90, -72, -40, 30, -16, -80, -32, 40, -36, -78, -76, -16, 0, 31, 27, -30, -4, -39, -54, -26, -101, -61, -98, -75, -42, -77, -85, -26, -17, -26, -54, -53, -35, -130]
10928a30J03N3k2k4k4km7P8J4j02m8M6kk7R4j0o7J3P0Jo4N9J08o1o4L5j2K6L3rq9J7L3k0j6
10912e7J22K5j1l3q7Pk1m6J8O7J12r6l2n9N8o7M2M4K9M5m2J9o1Jko3M0N6l6P1m2j51mJ10j
10895d5M7j7l2K5l7M4l2K8N1l5o5J3j3N0o0k6M8L1L9J1r1J8Q7l5J2j07n4K9J7J06l3k8Q6o3
10879c1q5m8N2O7k3R5N6j03m5L5J6o7Q9J0Jp1L1o5m4M2N0L6p7N0k9qm7O5K9k7l7L8Q6k8j13
10862a00O0l4LJ1o4J02j7%K9n6m6Q7O2j12K6LM6k6L5l4j5l4L7n7N4j6m7Q2j7J9J5M6q1o8L0
10845g7m2N8J7l0J7Ll8M2J7L2Lm6Mm8Ok2JL3j5j9N8O5q1j3J9rK3J7O2No6L8rL8Lj03L7K1p8
10827g7j3J30q8O6MM0k5q0J9j8l7l6J04k4K9n0KQ2j0p4n1M0J5J02L3j30L6L7q5m0j7qP6l6
10811h4nm5m1P9JMK7j2K2o2M1p0M7l8OJ2K9M8K3nm6l1J5PQ1N2j05lp1O3N0kjn4P3Np8k2m7
$$ y = [-130, -27, 26, 4, -20, -44, -46, -93, -15, -1, -103, -151, -105, -107, -134, -40, -50, -117, -104, -34, -33, -97, -38, 70, 9, -55, -20, -32, -6, 27, 18, -71, -54, -21, -41, -57, 65, 90, 79, 46, -41, -34, -55, -101, -83, -16, 96, 0, -32, -91, -33, -100, -58, -14, 15, 60, 18, 37, -24, -23, -25, -88, -48, 8, -28, 43, 1, -150, -154, -44, -45, 2, -15, -47, -22, -59, -15, -47, -19, 32, -3, -68, -55, -68, -18, -78, -104, -56, -25, 14, 25, -66, -48, 39, 4, 16, -91, -145, -116, -99, 7, -26, -54, 32, -31, -116, -164, -112, -45, -68, 27, 83, -20, -65, -30, -14, -81, 8, 18, 19, -52, -21, -86, -130, -88, -38, -2, -79, -29, -58, -66, -113, -48, -19, -46, -83, -45, 41, 13, -100, -40, -74, -71, -60, -124, -22, -39, -39, -10, -66, -112, -25, 37, -75, -49, -46, 0, -26, 9, -25, -40, -74, -37, -94, -40, -56, -103, -21, -38, -19, -4, 42, -39, -107, -77, -119, -61, -44, -74, -57, -54, -92, -50, -33, -1, 2, -44, -40, -88, -82, -104, -103, -70, -85, -104, -46, 19, -62, -75, -56, -65, -42, -25, 37, 42, -24, 14, 5, 43, 46, -57, -20, 1, -77, -90, 40, -48, 18, 22, 62, 37, -43, -24, -42, -79, -115, -11, -35, -6, -56, -54, 28, 18, -56, -107, -67, -52, 50, 83, -47, -11, 26, -59, -99, -116, -124, -48, -84, -89, -134, -175, -96, -95, -91, -64, -76, -54, -116, -75, -145, -98, -136, -130, -118, -89, -41, -18, -23, -69, -100, -85, -78, 3, 55, -50, -53, -124, -61, -11, -13, -14, -68, 5, 10, -68, -90, -137]
10792a37J3Q6J4q3Jk4M5P6J2r0P0Ql0k9J8QjJj5l6K1o1M8J4l1olQ2j6P2l8K4p8j8j6M9j0K8
10774c2J8q4L1M4rK7o0k8K3L1K0O4o7pj4J4ol9jJ0K5k5j9N9%m4k9n6O8N2K4mj20P9j2l0k3
10756a20M0O9P8p2Rj7k1k9k2Q9J3l2j9p2R5Jj9M5p8M8N7q3k6P0l7N8k6j7l0n4k8P3Mnq9JK7
10739a19j9MN4J14K7o1p5Rj3J2pN3K7j06o6J22%p8rJ4J20j9n7k2L4j10J08Q8m4M2m3J7O2p6
10722a7j22P5m2r8N5M2J1L6OL9j04p2M9J5M8m3j0P4K8rJ9jm0J3L1J6K2LRn0q5K6PPq8k6L9
10705a37J39j3l8m2%L3k5k5j5N6J05K1n7Lm7J06%p3k2m3j3J07n7p5J9K5J1k9L8J6L6L2k5R4
10688A05n5j36n3M2J10p2n3K9L4M0J9k4j4j5L7l2L9olJ3p8n1P5N3r7m5L5J08K3K0p9l6J5O3
10672A1L8k0j34l6Q6Q3K6nj28k6pP7J3l6Rn6k5m9J0P5O6o1K3o5k4L9J00kn8N4m3L2J0M2j19
$$ y = [-137, -124, -38, -24, -107, -106, -130, -85, -9, 3, -87, -17, -9, -39, -68, -50, -42, -43, -42, -57, -93, -72, -133, -85, -71, -102, -108, -111, -29, -45, 27, -11, 13, -65, -83, -99, -50, -60, -32, -14, -98, -67, -23, -32, -5, -65, -93, -70, -39, -19, 45, -22, -29, -43, -29, -35, -74, -75, -65, -40, -65, -84, -25, -25, -69, -98, -154, -86, -34, -10, -14, -134, -55, -67, -97, -120, -80, -11, 67, -5, 4, -13, -34, -63, -85, 4, 17, -15, -34, -106, -11, -10, -29, 16, -62, -14, 43, -40, -66, 4, -33, 25, -1, -18, -48, -102, -130, -57, -53, -58, -147, -146, -119, -138, -134, -80, 34, 61, 0, -75, -66, -79, -67, -74, -21, 6, -100, -166, -44, -44, -122, -131, -117, 3, -16, -73, -95, -61, -171, -63, 25, -19, 23, -20, -3, 59, -17, -139, -64, -106, -204, -149, -107, -96, -60, -54, -15, -119, -191, -142, -127, -79, -122, -132, -58, -30, -39, -20, -21, -61, -48, -17, -1, 21, 24, 33, -17, -102, -76, -69, -62, -150, -176, -137, 2, -11, -49, -91, -91, -58, -83, -108, -123, -67, 38, 59, 2, 5, -42, 64, 64, -9, -31, -74, -87, 20, -37, -112, -93, -68, -57, -86, -48, -32, 4, 36, 11, 105, 50, -86, -139, -97, 13, -59, -112, -83, -49, -9, 10, -14, -28, -43, -6, -38, 1, -5, -8, 5, -73, -124, -49, 4, -93, -138, -103, 5, 28, 48, -31, -67, -52, 11, 49, 29, -105, -141, -55, 28, 54, 49, -79, -105, -112, -35, -22, -58, -49, -105, -130, -179, -169, -94, -28, -89, -66, -131, -155, -116, -16, -18, -76, -22, -65, -33, -23, 19, -100]
10656a00j8M2L1j1L8L4n2k1J36o1q0o8L3R6q2M4K5rj4P7j0k6n9J2n7K9rj19L8mL1J03j9J0
10639d0j7M7j8j4n6k3O5L9k2m4n1O2L2M4Rp0r1OJ22om5j9J2J4Jl7J9Qj7J21p8r2L7J07n4j1
10622f0l2K9k4MK3J11p4j5k3K5N3m5jK2k5j2j5l5L9k1k6k0Q7j0P7L8j38k7J6N4K2m0k1l7J9
10605h2J03n7k8JKJ0L7m8L9k0NN3M9o0O1k8n8M3n0n9rJ2R0M7p5m9l5lJ4k5J20K5L1J9j03j8
10588d6K3R6k2m5K5p7Pj6m7K6K7n6n0K7O9O5o2K2L7p7k0N4K5q4l3L9M5J2kN6K9k4Kn0o2l1
10571a18J12l5K8Mj2N4n2Kn7k2k6J3Q3p9o9J01J6j33O6Q7j0m2N4p6L0l1m4M9K8L7o0j3k6J15
10555b6J06p1o7j1Qp7O5M7n9m1K0K4J05p4M3K9q6p0K3O0N4%k5m5k8N1o6O5N4k4O9L0n7l5M7
10538C8q0j0J5K1Q%q9M0O8J2m5J06Lr1j24j6M9J21Nj00J8M7P9j8j8l0o4NK6K8l7K2O4r4k2
$$ y = [-100, -118, -76, -45, -56, -18, 16, -36, -57, 79, 18, -62, -130, -97, -1, -83, -39, -14, -23, -37, 40, 30, 4, -55, -43, -100, -71, -80, -199, -161, -165, -134, -31, -50, -40, -57, -10, -28, -42, -98, -121, -56, -17, -39, -83, -134, -72, -40, 4, 13, -57, -148, -142, -20, -26, -71, -90, -78, -64, -63, -100, -81, -73, -90, 31, -47, -139, -102, 5, -49, -60, -92, -63, -87, -83, -60, 51, -23, -38, -61, -36, 17, -28, -29, -7, -32, -44, -59, -94, -55, -76, -102, -122, -35, -45, 32, 70, -68, -95, -79, -25, -3, -43, -64, -101, -82, 21, -36, -64, -63, -61, -51, -14, -62, -23, -43, -38, 15, 64, 4, 65, 37, -21, 22, -28, -87, -96, -84, 6, 53, -22, -71, -106, -109, -95, -120, 0, 25, 56, 75, -28, -46, -23, 73, 51, 6, 31, -46, -39, -55, -102, -76, -49, -105, -155, -128, -59, 6, -56, -34, 3, -74, -94, -40, -15, -99, -132, -93, -48, -36, -38, 18, 47, 23, 25, -25, -87, -118, -6, -41, -13, -9, -21, 33, -19, -17, -74, -96, -122, -109, -26, -105, -174, -73, -57, -190, -124, -37, -47, -89, -35, -111, -81, -112, -156, -107, -79, -42, -102, -115, -141, -26, 80, 9, -58, -69, -61, -138, -73, -26, -85, -126, -106, -82, 23, -51, -8, 21, -65, -135, -112, -52, 2, 2, -23, -68, -96, -45, -111, -46, 8, -16, 53, 83, 26, -9, 38, -42, -52, -37, -16, -8, -8, -97, -57, 11, 23, -22, 84, 87, -4, -128, -144, -95, 26, 31, -69, -51, -4, 75, 57, 39, 9, -55, -50, -24, 4, -33, -11, 53, -41, -63]
10522f3N9j2P1n0k8n6O5J0qJ7kj6lm1L0m2P3O5n1PPp1J24rj05r4O4j7J7M1J1n1k5L8Qj9k5
10504h1L1M1J07p2K4l4n5O4pn1O0n3m1K6o2j1L2L3N6o2j0O6l3m7K5k2k5R5j8M3m5N0L2j34
10488g8lL6J3PLK4q7m1M0K0M3j32K4N1P3J8J8o6r9K0N3o4Q1N6n6L9j9l6K5J15o1q8n8J03m6
10471g2m0mJ09l5l5J2K4p0nJ12R9l8p6q9J01pn8o5O4l2M5p3K9K7O8m2Kk8Ll5o9K7J31J4q9
10454i5k7NJ39Jj4o4k7n1p9P5K5k0j4J59o7J3j6q7K2J4L9J2Llk7m9L3J0O6M6p5m5L1J25k5
10438C3j14PJ0M0Lk6k0M6jj8p2J2O5K2l2M7L2J7n4q0L8nK0Pr4N7M9m6m1L2Qj39N4J30N6j07
10420f4J9n3Ln3L3Q5N6l3j8k3m0M3L1K2k2lj22O3J3q2K2K4p1O2L4l3J21l4p2M6L1K3N1j27
10404f8R0M8m8q6l2J1P3n4j4Nj08J02j2K9J2L3L5k8Q2j7r8l4k9J4l2O8Q6m8k7LL3K8M9l9k5
$$ y = [-63, -4, -16, 55, 5, -23, -79, -14, -4, -12, 5, 3, -13, -16, -57, -27, -69, 4, 69, 18, 25, 32, -39, 85, 76, -29, -123, -59, -76, -59, -18, -7, -58, -83, -45, -37, -56, -81, -50, -9, 98, 26, 50, 16, -39, 25, 18, -33, 27, -26, -67, -41, -103, -114, -82, -49, 7, -55, -65, 1, -32, -79, -54, -76, -101, -6, -24, 19, -26, 24, 56, -78, -81, -45, -32, -25, -22, 2, -85, -126, -86, -66, -23, -155, -131, -80, -7, 11, 29, -37, -136, -116, -63, -127, -46, 10, -46, -7, -26, -62, -37, 78, 17, -71, -129, -26, -72, -112, -116, -7, -42, -77, -65, -41, -111, -116, -4, 95, 57, -19, -108, -7, -14, -72, -137, -73, -105, -60, -133, -104, -77, -9, -51, -49, -77, -74, -109, -178, -151, -20, -6, -95, -122, -117, 22, 23, 9, -55, -82, -133, -212, -137, -112, -132, -146, 13, -54, -41, -57, -144, -122, -108, -69, -57, -54, -57, -84, -133, -100, -90, -24, 22, -53, -98, -67, 58, 33, -81, -74, -64, -24, -21, -47, -67, -21, -22, -40, -112, -100, -35, -13, -45, 2, 34, 51, -3, -83, -45, -50, -30, -23, -117, -60, -11, -57, -98, -66, -58, -197, -143, -13, 43, -64, -45, -98, -95, -148, -115, -30, 26, -7, -25, -48, -88, -45, -14, 8, -14, -17, -139, -76, -63, -145, -123, -99, -170, -108, -74, -107, 14, -20, -92, -46, -15, 8, 59, -68, 22, 70, 22, -64, -96, -85, -12, -66, -80, -75, -183, -81, -93, -64, -52, -19, 16, -12, 70, 53, -45, -79, -108, -94, -126, -58, 28, -20, -47, -44, -11, 17, 66, 27, 2]
10388Bj13o3J42lJrl5R2o2q1M1O9K1p1PMJ7J9N1q0p0OR0k0p6Q9J2Km5n5O3R8l6L0o7p0J7o0
10369a43P2J0N6J3n3m2M1Kp3n2O6k6q3M4R1M9J0m2k0K0%p6P1k5J9LL4N1p0q4j8N4J4K6P1k3
10352a3q1L7m1J18K0n9p4O6M8l3K1qK7l5j26K0N3R3L7o1K6o3K2o5M0P8PNj23qM4q9J10K5l9
10336b1j45N4N3o3N2K2O1L8l9n1L3k1j1K4mOp8o4Q7P3J9r3op3L2K3J17J4Rk7l2Rq6J34o0K8
10318A4J6q9q5J4O6j2Jj3J2J7j4l5j4N1j2N8k3m1J2P6J0p8m5N9j1J7k6J3j38O7Q9m5K6j7k
10302h2K3l5J2j1K8J27k8q4l5m1jM5n0l4J27j3pOl1N4O5l4q3JP0LL9k3j1j1m6N1q6j4K3j3
10285i9L7Mo7ORQ3k7M9n1p1J12N0k5QJ1j27J9m0m8J39on9mOJ1L2j1pO3r5kL4M3J8n4N9k3M8
10266B5Kl9j42R5O0J9m7O1k3j35RrJ8L6Q4j0j59J7O6K0mL1k4n0M3m6P9R4o1o2P1l5k1Q6l9
$$ y = [2, -111, -174, -32, -35, -34, -43, -78, 14, -48, -129, -88, -19, 2, -69, -62, -58, -41, -22, 29, -51, -121, -115, -25, -45, -121, -32, -20, -18, -63, -118, -55, 43, 7, 37, -30, -100, -83, -143, -71, -61, -5, 8, -45, -87, -46, -44, -117, -169, -103, -129, -212, -168, -77, -28, -18, -60, -80, -60, -60, -136, -65, -90, -71, -68, -34, 17, -53, -137, -155, -101, -87, -61, 10, -13, -94, -57, -98, 20, 40, -19, -93, -27, 21, -12, 9, 1, 28, -7, -133, -113, -60, 33, 70, 9, 35, -28, -6, -71, -31, 47, 54, 59, -64, -72, -28, -117, -7, 18, -21, -166, -112, -59, -122, -70, -48, 13, 51, 12, -39, -6, -27, -38, -14, -18, -12, -90, -154, -67, 6, 25, -68, -74, -147, -115, -92, 25, 39, 48, 21, -11, -2, -88, 46, -14, 14, 30, -59, -144, -130, -64, -76, -75, -88, -76, -59, -73, -108, -122, -71, -83, -25, -48, -89, -77, -1, 9, -69, -114, -55, -66, -49, -75, -62, -200, -133, -44, -89, -63, -80, -82, -59, -94, -82, -93, -65, 62, 34, -50, -85, -126, -127, -82, -132, -166, -39, -52, -59, -53, -84, -30, 35, 1, -82, -81, -11, -8, 31, 8, -3, -14, -60, -9, -95, -109, -86, -99, -62, -58, -125, -119, -110, -27, -54, -5, -56, -127, -15, 35, 10, 18, 29, -98, -79, -119, -167, -28, -34, -93, -97, -91, -80, -48, -59, -66, -3, -98, -100, -66, -23, -5, -59, 0, -23, 25, 27, -12, -154, -59, 1, 20, -27, 34, 11, -124, -115, -124, -106, -70, 14, 4, -155, -138, -72, -52, -56, -25, -49, -99, -56, -102, -23, 71, 10, -52, 19, -16, -37, 49, 10]
10250A0r6O7l1m3Q3m9l4O0J3m0J6K1J1J7n0M3Qk7j0jJ4OpPp5o9K0M1j7Q7j3rj9M5q8Qk2l0
10232a53P2M2k0m4j4N4QL7l7j02O9N5%n9pJ0QJ6ml2P6P3j2n5Mpj7o2q4J67L8Rj8j9l3M8j5
10214hl4k9q8M9N6M4mm0J08o4l2KJ8p7o1J2J7P0J42j19M2J4l0o0o9K2Q8j4NQ3j04lJ15m5J9
10197B5K2J8n9j7j5k1J8O4q3Jj0j4MONj4J01n5l4K8LK4K1k0n2K4J4p2K0L3l3l9L9O9MK5j4
10180A6j18N9p4K6P6k0nm2O3l0LM5n6p0O0P5l5kl3p0oP2l3J6J9J7qj6oq2pJ16M2j8Q3o9k5
10162c7O5p0n5M3k4L5o3n9N7R2n4L7m0m9LO7K6l3nM4J6mOL2q3j0Q5o4k5m1L5M4m7Nl5j8Q7
10144c7q7J2l6J5L7k4j6L1K5P9M1m9j7Pj4M2k3n5k1P0J9n4O1j1q5j4kJ3J9K8j6j4n1RL8Qj1
10127h3N8M8o9j0J17j22l1P5o0M6q2J27R1j04n6MQo6L1K9k1pql6O8n1m9J13J3%l2J17J2q1
$$ y = [10, -86, -19, -50, -93, -10, -59, -93, -33, -20, -60, -44, -23, -12, 5, -45, -2, 6, -21, -31, -32, -18, -12, -19, -12, -87, -156, -136, -95, -112, -25, -38, -47, -66, -21, -109, -101, -123, -153, -81, -39, -59, -103, -117, -63, -55, -18, -55, -157, -88, -33, -33, -92, -99, -89, -81, -65, -69, -101, -25, 48, 36, -19, -15, -22, -39, -101, -185, -18, 20, 29, 11, -8, -41, 7, -8, -42, -71, -159, -110, -54, -10, -14, -54, 54, -10, -42, -40, -22, -99, -160, -148, -131, -61, 81, -38, 4, 18, -12, -72, -141, -119, -31, -45, -40, 43, -61, -64, 51, 6, 25, 47, 65, 6, -11, -26, -47, -29, 35, -48, -47, -57, -71, -67, -61, -56, -70, 31, -24, -58, -30, -27, -3, 18, -2, -54, -30, -16, -88, -68, -35, -68, -107, -68, 1, 5, 30, 16, -102, -43, -117, -91, -15, -35, -40, -82, -19, -49, -46, -1, -57, -127, -67, 8, -27, -29, -62, -132, -138, -66, -99, -83, -64, -47, -55, -71, -77, -159, -166, -50, -8, -26, 57, -12, -37, 28, -42, -97, -54, -78, -43, -106, -165, -108, -16, -70, -33, -73, -122, -119, -52, -26, -59, -64, -20, -4, -8, -2, 30, -53, -63, 22, -42, -67, -108, -73, -29, -76, -71, -106, -124, -37, -124, -112, -148, -133, -96, -120, -136, -105, -80, -1, 40, -9, -26, -19, -33, 9, -14, -69, -90, -20, -1, -55, 6, -5, -90, -104, -106, -93, -74, -46, -62, -76, -127, -118, -80, -72, -83, -25, 23, -46, -56, 61, -61, -92, -17, -77, -31, -113, 14, 105, 1, -55, -51, -43, -109, -78, -49, -70, -77, -85, -121, -53, -104, -153, -40, -27, -27, -59, 58, 70, -11]
10111a1j6K6j3qJ5O4M0n8k6k2m5rj8l6Q7j4n5J5O4l2l5l3Q7o3O7m6mK0j0QN6J2n0j20m7P5
10093a35m7K2P3L5PK1k7K2kn6L4O4j3m9J26p9L1l7n3P5M4j3j12k3L2k3J0J3L6O2n2p4M5R2
10077D9q4r2N0K8j00J1RK4J2pj1K2N6M6n3o6l3M0J06l2Q8o2j02o3Q4qL0p2M3k8MpNJ4j6O3
10060e2k2L0k3l9J8P4l8O6J8m7j6lR0kl5J5m0J6l7K6m4m8N8k0j7n3M3N8k0N1N3j6K6j6n0r2
10043h8l7P5M2n2J1Pl5J9j5ln0K5QO9j8L9m6m0J13j04p3J19j4K7p9OP9J8j56l6J14R2n5j7
10027e5K4K2L2J4nj11l3M0JN1Lj2l7M2k9K7L1p2M5oj3K3q8j7k2J5M5N5o5NO2JO9l7n3l8J06
10009B0o6K3O8o2n1L3l5r3M9J7oJ8J5M3L7l3k7n9R0m6o0j2l2QN7M9L7l3p1j6J4m2L6N1l7L9
9992g7Ol5M2J8%J5o8k8M3Lm9J9N5R7n5j1L0lr7O7ln6jL4N7K1J9j1m1j44qQ1n6l7Q2j6n5M2
$$ y = [-11, -27, -1, -14, -22, -7, 57, 97, 39, 13, -9, -54, -63, -81, -117, -30, -44, -99, -84, -20, -52, -87, -120, -33, -96, -29, -75, -79, -59, -69, -61, -5, 7, -43, -163, -210, -135, -182, -160, -87, -52, -45, -24, -51, -29, -31, -87, -53, 11, -2, -51, 75, -4, 27, -10, -63, 12, 56, 43, -69, -92, -60, -83, -73, -60, -24, 38, -14, -88, -43, 49, -35, -127, -77, -49, -149, -138, -129, -105, -93, -100, -111, -89, -33, 13, -40, -106, -139, -99, 7, -25, 63, 1, -101, -164, -80, -88, -58, -130, -87, -115, -111, -118, -113, -99, -115, -52, -74, -44, -67, -106, -88, -14, -52, 14, 32, -15, -31, -34, 56, 54, 19, 34, -6, 10, -27, -1, -45, -93, -35, -55, -72, -125, -82, -24, -44, 7, 60, 44, 70, 54, 4, -88, -125, -50, -8, -60, -49, -42, -77, -58, -73, -76, -126, -101, -93, -24, -42, -3, -49, -89, 24, -80, -153, -34, -48, -21, -100, -94, -15, 3, -153, -189, -75, 17, -38, -55, -31, -9, 23, 37, 32, -79, -112, -72, -71, -20, -17, -29, -66, -24, -53, -26, 5, -67, -22, -28, -41, -18, -106, -123, -145, -130, -85, -30, -95, -90, -28, -27, 42, 5, -48, -86, 20, -46, -23, 45, -17, -68, -35, -70, -163, -114, -97, -103, -85, -70, -27, 10, -23, -50, -109, -19, -65, -125, -137, -169, -161, -104, -55, -18, -51, -122, -138, -124, -166, -130, -79, -116, -77, -71, -106, -64, -46, -46, -31, -99, -127, -84, -81, -130, -111, -56, 41, -14, -25, 5, 2, -95, -28, -31, -87, -88, -54, 3, 24, 43, 32, -9, -153, -161, -80, -136, -173, -91, -107, -162, -120]
9974a20j2L8K2j4M1p8K7P6KL3r0l2lL2J0MN4po7L6k9j7pP4L6nj1l8m6M3NJ5k3J03o8j13J48
9956A9N8j11mr3J28j7l4N1Nk7O4n7mk6j0l1M6L3k4J10k0j34N4j9J0n3K7P7q6J9L6Q8N0r1n0
9939a6J3n4K6n2k9j0J0K5l3M0J1O2N3j3k3k8Rk3k2k0J7N7K7o1m6l7P9Nm7nR5mo6m0k9M8j5
9922i6r8J24P2N1qj19M7j3L3k2L8n3N6K9p2j4P0j5Kp1l9p1K9P7J66M2r9m4o7n6Q6l0Q8l5k6
9905c8P5N0p3M0Jp4j3ln4OK8j9L8K4n4N4K3l4M3m6n0M9M1l0p4k3j7j5j5J54OL1m8P3n1r9N0
9887d4KJ0L5L1k8q4jJ3j14K2M0J9J9l0K8p8N7Q9l3n2Q2j6Q2l3m0o0k3R1j1r4l6K1o2O6L4m2
9870a40L2O6q0l2N2J1L3j0K0NL7j2n6Q4L3k9N2o5O2o3l2P6m8j1N5n8o3R0j7lK3m6k4j0P4N8
9853F4p2N4K0q7kj16J4mrQ9l9o2L6M4K7O4nO2r2m5j2K6N4o4l8J7K1L3pN1J3j37R4kP5o6m9
$$ y = [-120, -132, -94, -72, -86, -45, -123, -96, -20, -18, 15, -75, -107, -110, -78, -68, -64, -10, -17, -84, -48, -77, -94, -101, -27, 9, 4, -7, -45, -91, -48, -43, -28, -51, 52, -16, -129, 19, 77, -34, -38, -131, -3, -20, -54, -3, 2, -25, 39, -18, -22, -48, -58, -89, -43, -10, -34, 76, 56, -78, -24, -43, -33, -86, -59, 18, -68, -49, -13, 75, 125, 34, -16, -3, -57, -31, -83, -112, -122, -112, -87, -120, -80, -69, -7, 46, 33, 10, -18, -9, -32, -54, -74, -57, 0, 27, -34, -80, -117, -38, -33, -80, -85, 10, 6, -60, -100, -129, -81, -96, -194, -70, 2, 53, 45, -74, -27, -40, -7, -29, 9, -44, 12, 41, -31, -45, 25, 10, 12, -59, -98, -169, -140, -63, 103, 145, 46, 2, -65, -121, -35, -65, 23, -12, -38, 37, 87, 14, 54, 55, -19, -32, -35, -89, -83, -55, -74, -36, -12, -66, -12, 11, -23, 20, -26, -76, -27, 14, -16, -90, -113, -130, -145, -160, -6, 0, 31, -17, 56, 5, -94, -44, -42, -32, 3, 34, 6, -78, -79, -66, -180, -158, -118, -99, -80, -110, -82, -160, -103, -14, -47, -99, -17, -33, 49, 16, -24, -84, -107, -16, -27, -121, -157, -136, -198, -132, -98, -140, -108, -42, -122, -154, -102, -91, -58, -68, -48, -43, -6, -18, -74, 10, 43, 14, 66, 1, 63, 0, -32, 44, -4, -15, 40, -18, -81, 9, -8, -11, 12, -34, -58, -68, 6, 64, -8, 46, 66, -21, -23, -139, -125, -129, -138, -49, -88, -150, -114, -70, -43, 21, 16, 78, -14, -59, -71, -45, 9, -55, -93, -76, -55, -22, -29, 22, 35, -102, -8, -10, 65, -1, -50]
9835e0J7oL9pPJ3J8K0m1oO0n2K1l0q8P2m6K6k5J1o8n0O8K0k1K7n7P3l2P8M3q1J5q2M5Q5K8
9818D4o9q4l5M1M2L9j14LP6L9L0j9j1j1l0RN3M2m2m8RO2n6j1KL0p1N1Q7j5m1j2k1j4N9J2P6
9800A02m0o9M3k1l1M1j11K7m2j9L6J2L7l9J7k1j3O5Q6mr3n8M3M1K6r1Q2j08l6J5J03j4M5m3
9784c2r6%N6N4K3O0J00Rj19N4p2l4o3L8K8k9k0P2P7n7l1L4L3K5j24J0k7n4l8J4M9j0L7P5n0
9767hO0Jk2K7Pl5lL8j4pP6J06j16PN0q0J8l9O%l6P7N2p4K8J1K6O8ll3j23n5K6m1K5Q6R6qK
9749A96j1r2L7N5O0K9l4j30P0l2P4J2o8l4O1n8J8K5lL4R5r1L3N8M0M4P6n3Q1k6K9kp4k4N2
9732D47p2J09J9K7M8N5Nl2L5k3p6J24N2pO7L7M9J30J3Q5P5J66R8N9K33J87K49K97M44N42Q47
9717D289J247J906L122N243P827P105J303n122p531o336m228k544j611j019o32l88k48j34
$$ y = [-50, -33, -39, 0, -7, 0, 13, 31, 51, 10, 4, 64, 12, 33, 3, -85, -13, -59, -33, -58, -47, -115, -165, -97, -77, -98, -71, -128, -55, -87, -9, 34, -47, -32, -114, -69, 16, 44, -25, -109, -144, -103, -61, -22, -136, -133, -57, -18, 12, -7, -18, -29, -59, -50, 3, 45, 3, -45, -36, 26, -30, -41, -39, -9, -80, -29, 58, 43, 2, -10, -31, -45, 14, 26, 102, 62, -7, 36, 15, -16, 25, -86, -59, -101, -120, -84, -72, -35, -74, -57, -78, -91, -26, 60, 56, -37, -95, -52, -11, 15, -76, 6, -102, -138, -123, -20, -34, 11, -32, -128, -128, -72, -18, 5, 65, 165, 174, 55, 109, 37, 3, -60, -22, 6, -23, -43, 29, 106, 49, 18, 52, 85, 110, -14, -4, -31, -85, -123, -109, -60, -70, -33, 42, -8, 52, 53, 31, 58, 65, 30, 27, 65, 51, 44, 120, 226, 110, 117, 167, 87, 105, 66, 72, 72, 36, 113, 165, 91, 119, 130, 156, 224, 221, 188, 65, 10, 36, -5, 20, 106, 202, 194, 196, 185, 93, 130, 185, 245, 274, 240, 110, 180, 148, 222, 234, 166, 132, 193, 135, 153, 178, 175, 209, 304, 213, 246, 304, 344, 388, 464, 411, 492, 466, 495, 493, 419, 395, 447, 375, 484, 503, 530, 578, 633, 638, 606, 641, 618, 542, 666, 718, 711, 778, 815, 864, 994, 1007, 1092, 1167, 1333, 1431, 1490, 1723, 1910, 2159, 2456, 2900, 3442, 4289, 5536, 7442, 10564, 15807, 23634, 30739, 32042, 26920, 19389, 13053, 8825, 6281, 4670, 3651, 3019, 2631, 2383, 2249]
9709B249RJ7j57l18l12k34j58p3q4m1q4nr6o3Q7j6m6m6M9R6m5m4qpR8rM6n4j8J4J12M9O1p7
9692H92NP7J06J16Q5J63J06N0J26K17K87K16M36P40Q30J187J854L363N325P934P394J258n367
9681B7400p810o542m377k600j516r85o70m91l46l52k30j09n3q4q6p2j11o4k8r5QK3n9n5J1
9669G07R1n7K5p2j3J02k7n6j5K8KO6K8MP9N4pNj4KJ49J01l3R2J09M4J20J04K79K41K51M92
9654B881O51Q54J283J989L230N337P851P124J096n354p667o366m343k536j575j122o14n57
9646B162l55j34j77k67q1j53j63m7j27q7m8k2M2Oq7m7L3o9k6L5KL3Or6n3M7J0j42N1N9o7k3
9630B15j76O0P5N5N8n4j18l5l7J7L0P2R3l2r3q2m7O9nj9K7N7q6j2L2l8J21l7n2N4o1K2lJ4
9614H4o8J1j7M0LrnJ20j8rn9j6J93j05r9KO7j36K5k7J12J0p7j02jJ04RJ0nl8J16j3mRj53K6
$$ y = [2249, 2258, 2275, 2118, 1800, 1488, 1254, 1096, 1023, 939, 898, 814, 809, 713, 650, 737, 721, 675, 629, 678, 774, 729, 685, 677, 670, 768, 759, 805, 751, 733, 747, 859, 908, 969, 892, 897, 974, 1080, 1196, 1281, 1444, 1550, 1600, 1726, 1943, 2230, 2446, 2882, 3622, 4452, 5639, 7493, 10856, 16181, 24115, 31509, 32767, 27400, 19590, 13048, 8671, 6071, 4555, 3570, 2900, 2409, 2063, 1711, 1481, 1372, 1319, 1235, 1149, 1077, 966, 902, 874, 779, 787, 810, 751, 696, 707, 798, 741, 766, 694, 681, 783, 756, 700, 685, 713, 715, 781, 809, 813, 892, 946, 939, 944, 930, 932, 1081, 1182, 1149, 1241, 1350, 1394, 1514, 1618, 1897, 2138, 2389, 2881, 3532, 4386, 5669, 7658, 10888, 16225, 24076, 31200, 32296, 26942, 19275, 12909, 8566, 6030, 4455, 3333, 2719, 2162, 1807, 1673, 1496, 1229, 1148, 995, 832, 785, 658, 571, 523, 501, 543, 549, 462, 415, 448, 379, 353, 388, 390, 423, 429, 333, 280, 327, 337, 195, 246, 305, 238, 215, 39, 99, 174, 229, 287, 233, 115, 80, 43, 60, 90, 162, 255, 223, 130, 48, 1, 70, 65, 46, 73, 130, 44, 32, 64, 26, 147, 110, 58, 112, 51, 73, 70, 84, 16, 27, 10, 50, 53, 44, 39, 159, 141, 132, 73, 57, 250, 145, 46, 48, 115, -21, 4, -23, 89, 99, 22, -80, -81, 23, 32, 42, 37, -1, 115, 102, 98, 107, -46, -20]
9597b0PL5O4q3OL0j0L7K8k8j2J8j4q8j6rpK2N4l2m2jK4MJo6J7Q4O6p7o6M9M9l0l6J0O4N5r
9578G8Ll2J2k2m8o6o0R1Q2M9m7R0o3j09k9J05l4k6Rn8K8rk1Q0M0jn8K4j2P8j5o8J26O0o3n8
9561E6l7M4Rn6K9j0K5n1q3M7j8LO8j5P1Or8j1j7%L7J1K2l0J00k6l2NO9mp9J3K9q2m7J22J3
9544H3o9k3Nn6M6Q1r0K1K9J24k7j04n2j29K0O9Q6O4pm0n7m8J2L1K8J7k0p6P3M7m9r9J8P0j7
9527c9j43O8L5j1M0j0oK0L7Qk7J18n5n8K9%k3K3j1j1k7r5J7L5L0mM8L0k1k5O1N2l6n3J5k2
9510a1P3k2n2K1M6L1p6n6M7j6km1m4K3J4j7N3L2n0mP6K8j26j2P5m5J1m7K6N4N3k5m0rJJ3k9
9492d7l7M6J22n1l9RqN6p6L9J0p6K9J0J9jl4O8j3m6M5l0l0MQ0n7O7J7j9q6k5m7qQ0j6K8M4
9474B7o7k6Q1k6lj1j3j1M9j0n8K2M9L5o2P5j15RN7n3j5P8n1q8J8L3j4M9K1m9M0L2n5K4J0l0
$$ y = [-20, -13, 22, 86, 3, 9, 39, 29, 66, 94, 66, 54, 72, 58, -30, -46, -55, -62, -40, 14, -18, -60, -61, -37, -33, -32, -98, -81, 3, 69, -8, -74, -25, 24, -6, -42, -32, 32, 87, 78, 81, 49, 61, 39, -9, -75, -135, -44, 38, 87, 40, 130, 67, -42, -71, 34, 0, -26, -17, -75, -47, -56, -77, 3, 43, 42, -16, 8, -4, 74, 59, -9, 117, 177, 114, 56, 19, 63, 72, 16, 45, 35, 60, 9, -74, -27, -45, -42, 26, 11, 82, 88, -10, -21, -38, -38, -1, 10, 32, 2, 102, 76, 44, 49, 118, 114, 35, 48, 77, -5, -52, 70, 83, 14, -9, -4, -60, -14, 67, -23, -2, 27, 151, 124, 20, -32, -161, -141, -72, 14, 78, 71, 31, -26, -74, -62, -31, -3, 14, -6, -82, -9, 38, -11, -110, -92, -22, -39, -182, -114, -79, -90, -50, -60, -66, -46, -9, -1, -28, 90, 35, -23, 6, 6, -17, 6, -5, -16, -43, -138, -121, -86, -56, -60, -12, 18, -3, -28, 33, 85, 49, -4, 11, -11, 62, 40, -12, 9, 55, 86, 10, -46, 1, -15, -17, -58, -102, -79, -65, -82, -29, 3, -47, -51, 25, 53, -73, -85, -10, -55, -44, -91, -65, -11, 42, 17, -23, -32, -31, -18, -47, -84, -38, 84, 33, -6, 3, -5, 51, -25, 14, 24, -52, -23, -13, 6, 5, -29, 39, 26, -20, 25, -5, -35, -31, 49, -8, 59, 76, 57, -29, -54, -101, -109, -29, -45, -17, 27, -40, -66, 15, -11, -14, -25, -38, -49, 0, -10, -68, -46, 3, 38, -24, 51, -64, -55, 2, -51, -66, 12, -39, -127, -109, -76, -90, -41, -20, -69, -29, 3, -52, -28, -18, -48]
9457d8L0K2K4o6M5no2qR8j7NK1o7j2j0P4l7j6RMJ8K8q6p2M1P2N8p8j3J06J3n5m5K3O1l8J7
9440C4j9o6mJ3J07Jn2j3j19M4Q0O3k6n3k7J1L2N3n6J1P3n8mK0j41n7R2R3ko4l8pR1l0k7oL3
9422a8k5N0R9m3o8m2p1J6M0oOk6Q5K3J6p9nR2N7l3p9O6%j63J4R2N9RJ5K0k5m3n5n5M9Mo1N0
9404c5j0o0P9L2n8M2q7K7J17j4ln0Pj5M9M0m3pq5K8O6J3M8lk9n1P8j00P8N5p6m7j7m3N8k6
9387d2Jn3O9j9M3K0k0p1j8L5L8M2k5L1L9k8M4l9r7k9P9L2o5J9K%Q0q0j0l6K1k3J5J29r7n3
9370f6nM2j8Ml2M8j2LP6n3KJ3j3R6l3p4Q1j9n6L3l4m4p0J9J06O3m1j16J4J14M1n1o9N6L7q4
9352d2K8m6P5o3m8M1P6o1jN2O8m3M8l3j13J08Q7j75K9P2j3k5j1N8M7j30l3O1J8j1M2p6k8M
9336c8j7m0qM7K0q4LOM2M6n5o0PL4m9K3j1J5J02rn5J36L4r2J6k6kn9OP3O4j9n3n8N3o1P7J99
$$ y = [-48, -18, 4, 28, -38, 7, 2, -60, -68, 30, 13, 18, 39, -28, -40, -50, 24, -13, -29, -20, -16, 2, 30, -56, -128, -87, -15, 43, -35, -48, 58, 71, 16, -29, -6, 55, 17, 34, 15, -51, -55, -42, 65, 66, 14, 1, -118, -74, 6, 69, 43, -10, -37, -26, 6, 59, 3, 14, 87, 29, 25, 45, -96, -153, -61, 32, 30, -34, -72, -79, 12, -18, -45, -51, -18, -43, 7, 106, 63, -5, -47, -118, -102, -62, -68, -62, -88, -3, 20, 36, -43, -48, 44, 101, 68, -11, 55, 55, -108, -94, -2, 57, 66, 81, 101, 76, 33, -22, -77, -28, -24, -85, -35, -45, -105, -26, 6, -52, -10, -97, -70, 47, 33, 30, -20, -13, -28, 21, 61, 18, 11, -74, -46, 20, 33, 81, 78, 49, -2, 76, -24, 54, 109, 33, -14, -31, -74, -16, -42, -41, -94, -25, -44, -1, 19, -1, -72, -90, -55, -17, 25, 0, 31, 70, 42, 86, 47, -50, -79, 0, 32, -33, -14, -12, -12, 68, -12, -22, -58, -37, -60, -45, 84, -13, -66, -71, -29, -47, -43, -75, -27, -39, -36, 40, -13, -11, 2, -11, 85, 52, -22, 59, 40, -16, 17, -17, -61, -131, -112, -6, 57, 16, -100, -86, 28, 69, 18, -51, 5, 42, -42, -14, -60, 15, -48, -96, -55, 21, -40, -41, 11, 79, 36, 84, 51, -62, 46, 133, -42, -13, 59, 46, 21, 10, 68, 115, -15, -48, 13, 31, 20, 62, -14, -42, -38, -55, -95, -103, -56, -36, -120, -117, -111, -69, -23, -78, -138, -131, -97, -146, -123, -134, -119, -17, -26, -81, 55, 89, -3, 13, -13, -15, -74, -68, 5, 69, 50, -3, -61, -8, -69, 8, 207]
9318B07j73j1N4q9K6q5L6N5m0l0m2k4P9O2k6r9J10R3n5j8l5J5lr3K3j9J05n9l5J45L0n4n7
9302gOp1M1M4n0j1k7J5j0N2j2%L3Rj16k5J05m5l0lL4L1J6n3J2k3Q9J20j23o7k6P2L7oM2qr3
9285d8l7R4l7l4J06k8j02l6J5O8k9m7J08l7O8l7J7o8n4J04J2q0J6P1K0Lq0m7N3J1O2q3M8M0
9268C2o0O1n5L4Q0m2j04R2M6j6q8n5J28l2L3n2rq1N0Q2l7m9j4Q2O4o0n8k8k2K7K4k0k3K2J8
9252c0K8lnM5m8p6J12M0j7k4j2m5nN5j3%o3MM5N5r6j9L6K4k4j6J07K2Pj0q9O8N2m4J7m1j13
9234g6N4J62rj04K9O4K3k2Q4m6K0Qo4l5J20O2Q1P5L2R5K62L40K97J52j99m92m64m1j14n9m3
9219A92N2j12p5l8M7j4l2j3J1Mk6R9l3j10K1N1m8j2P0L5r2m5l2Q7M5l2j5L3k0k5j2K1l8O5
9203IM6J9m9K9O6%j12nk8N6q2k9P0O8Qo9Rk5R6k7Qj05P0nj49M6J10m5j4K3K9O1k6jJ1n2j1
$$ y = [207, 34, 23, 77, -12, 14, -71, -35, 20, -20, -50, -92, -116, -37, 25, -1, -100, 10, 103, 48, 30, -5, 10, 7, -86, -63, -82, 23, -36, -71, 74, 104, 50, -7, -1, -72, -31, 13, -37, -48, -75, -60, -70, -18, -30, -30, 3, 12, -104, -129, -24, -69, -99, -102, -68, -37, -21, -74, -62, -85, 4, 124, 1, -66, -92, -20, 17, 11, 53, 45, -48, -85, 9, -28, -62, 44, 16, -86, -122, -107, -39, -68, -115, -7, -44, 24, -13, 4, -64, -118, -14, -2, -82, -66, 5, 25, 28, -52, -99, -46, -35, 27, -56, -8, 32, -28, 33, -22, 12, 92, 50, -54, 38, 84, 68, -20, -75, 53, 21, 54, 2, -7, -88, -38, 44, 7, -42, -56, 26, 90, 30, -28, -56, -78, -51, -27, -47, -70, -48, -30, -2, -5, -10, 35, -13, -89, 23, 63, 46, 22, 10, -35, -40, 15, 2, 2, -61, -57, -12, 43, -53, -72, -36, -12, -36, -52, 55, 77, 84, 74, -15, 53, 105, 61, 78, 37, -76, -22, 140, 131, 27, 56, 120, 143, 121, 205, 159, 179, 187, 123, 88, 208, 270, 351, 426, 458, 553, 815, 1155, 1452, 1604, 1405, 913, 449, 408, 294, 235, 192, 244, 132, 57, 19, 66, 52, 20, 7, 18, 22, -4, 95, 62, -48, -27, 24, -24, -36, 34, 69, -23, -68, -100, -13, 32, 0, -15, 18, -2, -27, -39, -18, -56, 9, 55, 74, 25, 54, 120, 120, 8, 3, -25, 31, -51, -80, -10, 58, 66, -3, 6, -19, 77, 50, 58, -47, 23, 18, -131, -85, 25, -20, -34, -11, 18, 79, 53, 52, 63, 11, 0]
9185@m0L4j7J7N3j8nL9qm1k1q8mM3L5l7J2K2lMK7r8L3LJ9m0M3P8o1R6k2n6R3j29m1J0l2K0
9167h0P5j6O6r5P1Q9q8J7L5r0l0J0k8nR1N6q5l3Pj8L0J06k4p5n6N8N1l7M5o3q9J2J8L9N7j9
9150BmM8l9j9%K8om4L8m7J7l5m2P7R8o5j6O4j23q8j3O7O2O1Lpj8m3O2j1L1q1N8nj24L9P3q7
9132h9qJ55j9m6l0q2M0k6K1M2k0PK3K0j6qN6p6M6R1Lm1Pk2MQ1p0n1l1n4p9OO8m3Q3M6k6m3
9114h1J8M7k3j28J1M5J24J8M2j4j09l2N5K5J9Jm7J4N9m1j01n2Q5R5L9r0m2J8l4J9q5L9M9N7
9098@Lr3J4R6l7PK4n0K7m2kl2K7P9m0k7M2l2l0O1j9%j6pr0K9J06n3l1P0j3mRm9j1pJ07L5k0
9079C1R1l0j02Nl6O7p0R1L0m5o5j4k5L2j02Q0J4J3J01r4m2rm9L5j5kR6K0N4m6j19J04K5r1
9063f7M4K3j2p0L0J5q0K0J27p1m3kM0J6P3j32L2L1m9J57jj11r1K0Q0j48J03J10oJ2o2N8n5
$$ y = [0, -40, -6, -23, -6, 47, 29, 24, 63, 55, 14, -7, -95, -99, -56, -21, -58, -46, -24, -27, -23, 4, -94, -61, -58, -39, -79, -36, 42, -19, 77, 55, -1, 92, -37, -78, -68, -100, -80, -5, -21, 45, -50, 21, 110, 22, 39, 74, -16, -46, -36, -64, -69, 22, 78, -7, -40, -33, -51, -21, 85, 61, -14, -70, -12, 39, 2, 47, -16, -105, -93, -75, -36, 21, 2, -2, 46, 7, -12, -12, 16, 10, -34, 4, -43, -26, -61, -103, -26, 72, 7, -9, 55, -68, -156, -169, -102, -40, 21, 24, 17, -1, -44, 18, 7, 38, -43, 15, 10, -114, -75, -2, -89, -97, 58, 39, -7, -37, -119, -79, -105, -84, -42, -62, -55, -32, -12, -28, -36, 20, -56, -10, 81, 84, 43, 50, 28, 32, 113, 43, -8, -39, -93, -172, -166, -98, -141, -58, -12, -38, -81, -63, -16, -39, -167, -156, -111, 13, 31, 73, 59, -50, -82, -27, -2, 17, 18, -29, -15, 44, 3, -98, -150, -65, 30, 69, -21, -63, -45, -79, -60, -145, -106, -57, 0, 3, -90, -76, 20, -17, -10, 14, -36, -9, -51, -53, -85, -58, 21, -19, -46, -4, -36, -66, -5, -24, -24, -40, -47, -137, -108, -2, -55, -86, -16, -29, -33, -24, -73, -84, -91, 16, 51, 31, 122, 92, -10, -5, -41, 26, -44, 47, 77, 32, -33, -47, -72, -40, -142, -62, -48, -35, 66, -28, -70, -79, -128, -93, -108, -110, -14, 6, 60, 14, -105, -1, 24, -67, -23, 0, -12, -82, -52, -37, -117, -97, 30, -41, -84, -86, -46, -30, 43, -89, -57, -26, -75, 82, 81, -30, -121, -101, -21, -169, -66, 44, 38, 50, -12, 46, -9]
9047iR9m5p1n8l5N1j5J0p8P1P5PJ8n4n9J1r2J2L4N7L7k4j09L0mM9M3J2M6k9o0L0L2n4j2Q7
9030Cl1o0N2N6p6J4k5P4J06o6q7j5K7j1l6L2N7Kp8l6j4Q4J0p3k1P8l5m5N4N2p5J14%j04oj4
9013i3j02R5O9Q1p4nM0P0n3K8j18o9J6K1J2Q0k2p7K6O7K8o9j0K0O5p3j7K6J1N1j1j7k8p0J04
8996Bk4m2Q6n3%m3Q2ol0ml6q7Q7j9k5M2O1L6qN0j7m3Qj02lR5qj0k1K1M5K8Rk1pm1r0k0J16
8978HL6p9j12Qj5LR6L8J2j39P1L1j0N4k9N5j8j00l2J3q2k1O2Q2L2NL7j2K3r1qlL9N0m6j5l5
8960i2L8J5l6K0j2j4Qj7M2P7L0n4Jq6k4J5K5j0j04J18L9q6P7q8L1M8R5r7PM9p5l5K0m0L2M6
8943c7J0qm1MK4L9kK4l1L9o7m4n2k0O9R1o3J5K9K7J3k1%l4m2%M3q7jPL1J01q5j16L6LQ5J9
8925d2J4n0N3Lj3lK3p1n1O3N0N8oJ0L6j04q2J26m7j6P1j7j3J9k4j1m8lk3j3M9L1l3l1k2Pj9
$$ y = [-9, 90, 45, -26, -84, -119, -68, -83, -73, -151, -80, -5, 2, 20, -34, -93, -82, -174, -162, -128, -71, -34, -58, -167, -137, -141, -92, -49, -37, 9, -20, -80, -50, -18, -72, -84, 3, -28, -88, -36, 20, -56, -42, -67, 7, 113, 47, -40, -55, -28, -39, -75, -43, 14, 16, -62, -98, -112, -28, -18, -91, -112, -34, -69, -114, -60, -8, -83, 31, 31, -73, -79, -93, -195, -100, -31, 50, -24, -29, 11, 81, 28, 56, -62, -131, -115, -94, -82, -2, -24, -101, -75, -8, 20, -49, -59, -39, 26, -47, -64, -38, -27, 24, 13, -4, -32, -102, 2, -22, -64, 22, -31, -31, -74, 8, 2, -28, -32, -68, -155, -68, -87, -112, -70, -9, 27, 19, 69, 52, 9, 17, -85, -88, 7, -1, -11, -32, -11, 34, 62, 71, 50, 43, 2, -88, -108, 8, 44, -35, -147, -139, -154, -151, -55, -17, -5, -144, -73, -42, -52, 2, -27, 28, 10, -90, -122, -109, -191, -212, -150, -68, -36, -31, 6, -6, 17, -74, -82, -85, -46, 4, -42, -57, -92, -54, -39, -75, -55, -67, -81, -73, -90, -48, 29, 59, 5, 6, -80, -104, -89, -64, -74, -178, -60, -21, -107, -30, -118, -87, -39, 56, -41, -34, 15, -60, -95, -75, -115, -83, -37, -27, -35, -76, -72, -48, -9, -11, 13, -18, 21, -46, -90, -142, -162, -93, -2, -65, -50, -21, 6, 19, -2, -2, -36, -78, -78, -35, -122, -123, -116, -85, 16, -69, -185, -149, -146, -61, -42, -28, -78, -25, -22, -35, -38, -15, -86, -137, -74, -24, 34, 28, 38, 74, -30, -112, 14, -33, -49, 22, 5, -8, 11, -13, -24, -72, -75, -98, -111, -62, -31, -64, -95, -117, -110, -129]
8907a29l2K8j2P0R6l3m3m4O9K3l5%N4N2J2Nql1m2p6M2N1q2l5J33oK9Oj11n9O8Q4l3p1J45m2
8890D3p8n1J7M0K3L3q1J5N1J3j16L7M1Lp5M8N0k4rJ5o2n2P5L6l0P6m8m3L5r8J2M1J5L2n0L9
8873b7o1N8M1j2Nk1j5J20n9n4J21nq7Jn8o2L6%Lj09Q7R0p1J9J8q1J9j7L8Q9j34l4O3m1M8O6
8855b6j3k9J02Q8m7j16M5q6QOM7M0q9K7O9J5Pj14L4j0J3m6r3J4Q0R0p4j0q0mN3n3R0k9Q2k8
8838c7PL7l0j4J1n6n0L0P9L3n0%K8pK1qK5o2n4rp7O5O3O0q3J0j3L5Mj3m0k3P4j4J4m0Nj2J2
8820g9L3K9J5l9P3QOp6m8M9O1o4J7k5j15R6J2m6L2O3K7m7M4j1lo2l4m2J00o3l9M7n5O7K8n4
8803i5J9J4j7Mok3k8O8lM1n3r0K6J09P5K9q2j08J1L2L4j7j4ml1k3K7J02m2O7j0l6L6Jr7P0
8785a4Pp5qj02k7R9R1P9n1J1l4L9o2j55qQ8J8j9j3k4J38k9K8k0P3Q6r3j20o4M9O1o8L7K3n7
$$ y = [-129, -161, -133, -145, -75, 21, -12, -55, -99, -30, -7, -42, -42, 12, 64, 76, 81, 73, 42, 0, -76, -34, 17, -65, -100, 33, 27, 56, 62, -49, -108, -40, 44, 11, -60, 85, 43, -35, -86, -69, -29, -6, 27, -54, -39, 12, 25, -91, -54, -13, -10, -85, -37, 13, -11, -20, -5, -67, -119, -44, -8, -38, 38, -10, -53, -18, -116, -104, -63, -48, -16, -66, -27, -88, -30, 11, -1, 4, -17, -32, 88, 29, -25, 96, 91, 4, 5, -53, -115, -79, -79, -76, -185, -98, -8, -79, -60, -42, -123, -104, -121, -83, 6, -128, -162, -99, -140, -92, -26, -39, -68, 34, 122, 75, -41, 4, -82, -74, -68, -21, 19, -70, -43, 26, 41, 48, -66, -32, -42, -29, -75, -168, -154, -74, 16, -58, -68, -148, -152, -99, -152, -62, -91, -9, -37, -30, 7, -23, -37, -26, -82, -132, -102, -23, 10, -40, -40, -12, -19, 2, -6, 19, -43, -97, -106, -183, -118, -55, 5, -78, -68, -81, -46, -42, -55, -95, -118, -44, -58, -44, -84, -79, -91, -79, -46, -17, -2, -41, 32, 40, 46, -30, -78, -29, 32, -32, -15, -40, -155, -59, -47, -93, -61, 2, 29, -18, 26, 15, 12, -50, -84, -126, -26, -89, -128, -81, -136, -69, -41, -95, -76, -62, -79, -75, -81, -104, -132, -64, -67, -26, -79, -169, -143, -34, 41, 70, -12, -120, -109, -77, -43, -60, -74, -78, -109, -132, -105, -3, -45, 22, 12, -24, 12, 13, -84, -14, -7, -82, -90, -192, -219, -120, -29, 50, -1, 10, -24, 15, -47, -202, -210, -122, -104, -123, -136, -160, -22, -51, -23, -43, 30, 116, 23, -97, -161, -112, -51, -119, -82, -59, -116]
8769a16l4J15M3k6J5k7o5L5q5Q1NKj9j05J07M3N2n2jJ4Q3mjk0k8j32OO1KJ36n7j39P8M8j21
8752a06m9Q0J12m2m6J03L2q4p9r7O8J4PK9nJ4p6L4K1j1k3J3o0Q0R0k7Nml9KnL8m3P9N1N8n7
8734G7o6k7j1L9K5l1k7NMJ5Om2k8o7L3j5kO8k3lpJ06n4q4K1j3l5M4J1l1k2j1P8M5J2l1J%n
8716d5N7Ml9m9r5J4K0R4ln1K1q5M2L5qm4J7J7J30j2n4j3M1K2j7nK3J1q6j42J22O3J6J6m2K2
8699cm3Q5m7l0Jo3k5J6K6M4M9R7k4j31r1M2M6k2N6P4l2jj00OO4j16O1qN6K8K0r9k6R4p2j6
8681h4m0qO3Q4m1q0PJ19K3L6jj30n9qo6o0L5k3M5L9J28M0Q3r1r6%R0j7L3j1Q0p8pk3l2J0O5
8664B5k5j8o6Q7pj40Q2Jn6N7jpM4q2Q1k1lj4J6J18l9p0l9O9l2k3L4j4Q1k9j13O7l4J0L4ln1
8646h1k2j2m1M3k9Q1JL8l0j6m4J00Jq5m2P8K7K2Kp2j5N1J2m2OKJ26m1q4Q0L0p1n6N6k1M0M6
$$ y = [-116, -150, -35, 8, -18, -3, -30, -95, -60, -145, -64, -59, -57, -76, -181, -74, -31, 21, -31, -32, -18, 65, 61, 60, 40, 12, -120, -114, -53, -51, 85, 28, -111, -33, 15, -106, -155, -75, 37, -5, -51, 52, 84, 0, -79, -176, -108, -94, -87, -58, -63, -49, -125, -91, -70, -81, -104, -91, -151, -71, 19, -8, -3, -7, -46, -44, -49, -11, -54, 25, 76, 134, 77, 11, -16, -27, 12, 37, 6, -21, -16, -12, 3, 9, -33, -61, -128, -95, -110, -112, -44, -67, -70, -77, 29, -25, -109, -88, -101, -136, -92, -81, -112, -134, -145, -67, -22, -10, -41, -40, -40, -45, 12, 16, -23, -72, -167, -153, -133, -39, -42, -93, -72, -157, -115, -80, -88, -132, -115, -98, 32, 20, -34, -47, -6, 16, -1, -6, 17, 28, -58, -200, -78, -15, 1, 17, -25, -3, -46, 39, -8, -38, -37, -100, -125, -109, -83, -39, 10, 107, 83, -48, -139, -97, -51, -73, -17, 57, 25, 24, -76, -70, -6, -122, -61, -69, -13, 15, 35, -64, -90, 4, -68, -84, -124, -132, -69, 15, -26, -106, -99, 20, 43, 79, 78, -52, -111, -119, -185, -245, -210, -233, -188, -149, -21, 19, 102, 11, -85, -85, 5, -12, 21, 10, 90, 12, 5, -18, -50, -40, 25, 0, -18, -84, 3, -4, -144, -62, -61, -117, -60, -61, -68, -24, -106, -25, -46, -49, -63, -47, 71, 32, -38, -77, -8, -40, -63, -29, -43, 38, 9, -104, -37, -71, -61, -27, -30, -81, -103, -115, -156, -113, -142, -61, -60, -22, -52, -68, -112, -12, -11, -96, -138, -60, -33, -11, -9, -81, -96, -45, -33, -75, -69, -67, 59, 18, -66, 14, 44, -27, -83, -27, -48, -8, 38]
8629C8q5n8K3l6L1N3n0n9K6J20n6p4N8j3J2j04Q3K0q2j6K2RL9R1m3q4P0KJ2J3K4j4m5n6J19
8612a0l4l5p2m4Q2Q2k2o3O8JKOkJ00m5k7M2M4o4q2P6J00qn4j21n1K7JMjK7Nm%q0L6O7j2K7
8593c4l1K3J1l8nLo9P7m9j8O2R9o4l0no5qK0n6J23K1N8r3K5M7n1k6l4P1l8Lj8k1MJ48m8l5
8576d1k4q4O2M5j2m6P0K2l3J0om9L9O7mo4J1k5k2m3M9J14Km1r8m8J26k4k1L6m0K3K3Po6Nl3
8558a13P8LJ00qN9r1r6N2M3m5K8ok4L4k8K0J0j20Q3N7n9Kk3l5n2k8K2J4N8j20M1Q6k3K0M8
8541a3L2ro1O5J6n0P5j7l1o0J04J3L2j0j10M2P6o9k7o2m3P2K4k0j0P8p4n0J1L1J3K5p5oM7
8525d1O4n4qpK6j05P6n8JMrrK4P1n4o8J15ol3M1mk7L5Qj2o2m7O0M7j00l7K32jj06K2j3M4p8
8506f9n8j9J1J17Ol1N0m6l3K4m8J11n2p0j9P2P6pK8m8kp8J8K7nJ06m9n1M2q6p7K0k3nN0M9
$$ y = [38, -47, -105, -82, -118, -87, -34, -84, -143, -117, 3, -53, -127, -69, -82, -70, -174, -91, -71, -153, -169, -147, -138, -99, -8, -51, -135, -65, -63, -51, -38, -14, -28, -73, -129, -10, -44, -79, -151, -195, -113, -31, -53, -116, -48, -47, -45, -39, -41, 59, 14, -13, 29, 73, 9, -73, 3, 103, 95, 41, -80, -131, -104, -103, -99, -100, -73, -68, -72, -72, -152, -116, -49, -61, -34, -65, -42, -31, -69, -74, -71, -140, -63, -112, -130, -68, 31, -33, -63, -68, -133, -141, -121, -177, -54, -33, 25, -68, -43, 4, -47, -73, -107, -36, -74, -71, -89, -110, -106, 42, -6, -41, -65, -149, -87, -42, -54, -100, -30, -8, -41, -31, -37, -86, -47, 20, 16, -48, -37, -62, -84, -127, -78, 36, 38, -3, -101, -149, -23, -47, -68, -32, -72, -49, -26, -19, -85, -80, -113, -35, -32, 68, 60, 119, 28, -68, -16, 27, -18, 10, 4, -20, 14, -14, 6, 16, -104, -21, 36, -23, -21, -44, -79, -131, -159, -137, -123, -65, -185, -144, -58, -81, -61, -13, 19, 10, -51, 14, 30, -20, 55, 38, 7, -53, 51, 64, 96, 86, -24, 18, 94, 25, -2, -64, -107, -35, -11, -31, -41, 37, -37, -87, -76, -45, -32, -7, -82, -88, -41, 23, -31, -39, -46, -20, -125, -49, -107, -106, -102, -111, -120, -96, -25, -79, -147, -32, -38, -71, -30, -34, -61, -26, -18, -30, -92, -139, -79, -32, -132, -169, 63, 62, -44, -22, -35, 9, -69, -127, -146, -135, -18, -12, -43, 7, -39, -72, -48, -96, 15, -37, -107, -126, -54, 22, 15, 43, -5, -7, -85, -67, -40, -45, 61, 12, -39, 3, -83, -160, -140, -163, -168, -118, -69]
8489f9J7j1rM0M7P4ko2nj33m2j8N1j7k2j4J16lo0j4pMo8R2%K6J1nmj7n5R5J11N7k2j19l1J2
8471e6M9n2N1k9M7M1j46K1l1N2Q1K1m1j36k3L0J9Q2M0o0j1Q0O2l4j3k8l0K7jk9M1J3p2o5Q3
8454a7o4LN1j5j2J8k6k2kK2M6J0j8P0l8o4M5k7Rl7j5N4OM7Kk7J2m8N0K3l2j5m6K6L7j3j03
8437a10RJ12J4m0n0n1O2j3l1L9j4L7l8K5lN8m0km5j9O0Lp9K0L5j2R1n3K0k6q3L5k6O0M0O9
8420E4n5pN8o8Ok7J04j3o0N3pn2LL2KK5Q0l3j1j60o6J10P0l7k0km0pJ19k2om9o5j5K2L9K5
8402b0k8j7M9K4j8p4Q2M8j3nk9l0k0M9kj6O3j11k4O1o5J1O2n2J5N0J3L2K3j7Qq9l9M5%m9j
8384h4M7l4q2N0M2L8Ml2m6nL7P1L9j8j8j12m4K3R2nm9m1QJ26M0l3l0p3Q2K7r7%L0J5Jo1M0
8367e2J4N7n4P0l5j14j0N9R1N4l9lm8n2M5L6n0m1PN5m0k7J34L8p1L1j00Jj9J5Pn9J13j0l5
$$ y = [-69, -52, -63, -72, -32, 15, 89, 87, 25, 20, -113, -155, -173, -122, -139, -161, -175, -59, -62, -122, -136, -143, -139, -207, -115, -115, -89, -78, -83, -87, -104, -159, -64, 47, 104, 82, -37, -68, -56, -7, -59, -8, -37, 10, 51, -95, -74, -105, -53, 28, 49, 8, -128, -151, -121, -102, -20, 20, -40, -51, 29, 91, 57, 44, 16, -14, 13, 12, -17, 24, 37, -35, -100, -17, -81, -78, -27, -42, -54, -36, -62, -84, -86, -64, -18, -8, -26, 44, 6, -58, -13, -40, -31, -68, -83, -29, -23, 24, 26, -1, 11, -37, 13, 36, 4, -11, -57, -31, 6, -7, -110, -101, 11, 25, -15, -65, -116, -54, -67, -98, -59, -73, -36, -74, -49, -52, 6, -34, -36, -81, -100, -40, -37, -116, -96, -61, -73, 18, -35, -15, -41, -124, -89, -115, -55, -15, 54, -1, -8, 50, -18, -12, -39, 65, 52, -8, 45, 38, -14, -11, 21, 23, 48, 128, 95, 84, -76, -142, -32, 38, 1, -19, -21, -61, -68, 51, 29, 23, -26, -91, -106, -84, -45, -20, -48, -65, -16, 8, -10, -84, -2, 46, 33, 28, -1, -31, -51, -2, -4, -20, 43, -68, -92, -31, -96, -85, -23, -75, -60, -10, 3, 35, 58, 41, 49, -40, -79, -34, -34, -83, -84, -37, -71, -153, -103, -61, -23, -19, -51, -97, -102, -65, 6, 45, 27, 9, -103, -147, -124, -32, -37, -86, -127, -119, 7, 47, 14, -16, -89, -7, 20, -77, -77, -47, -32, -31, -92, -52, -38, 19, -35, 35, 0, -114, -124, -65, 26, 80, 41, 38, -10, -62, -17, 19, -31, -72, -65, -10, -50, -77, 57, 95, 24, 55, -45, -44, -63, -48, -41, -100, 13, 3, -32]
8350c2p8Qk5L9N6N2Q4J3K9o4q3P6O9p5j8n8kq6n2k0k9R0K3J5l7M8O7q7J9J0mpM1K1k9j7m5
8332h8jJ01o1K8L1Qp9r3P8K2j3M7J03r8MLJ3k9J0k9L8m4q5mP3J0O3J8m9l9Q2p6l7O6L7k9P8
8315E9l6j19K1N5k3J1n5l1N1mk3N7k0l2J5m6J2j4L2M3m6N0kn4R2L8q0k1N0n2j4k3K8m2M8L0
8298d5j5K7l0n0M1k5O0rN6o5j1O6l4j3K4J09m9j05L9O7j18n6N5N2m0lN5J4LKK6r8l3L2K8O
8280c7J12k8p3M5K2m3m8M7o9m8M1j6R6NK1j00o7K6J1p1P9J16jq9J0O1J2q0j10N1K9k4M4N5
8264b1OJl6j06j4Q1M3M4l8k1j4O9rjk8J25j9j72N2J18m2j0Mj2L3k5Qk0p4pN3kj13J9O9J1P7
8247B9N3mj3pKj15Q8l7%q6J4kJo1R6O7n8k8l8J6Q0qj5N7On2j2k0k9j1J8J2J8j5M3LL0n8l5
8228g1J7J0j09J1N0K3l8kP1p0L6L7M8n3J7O6m2p3k6J16o0m7n4P6OPJ09o6N1R7q3j34J5KK7
$$ y = [-32, -110, -102, -127, -88, -32, 20, 104, 117, 146, 82, -1, 75, 144, 69, 51, -7, -9, -95, -147, -167, -196, -106, -83, -68, -105, -57, 10, -77, -58, -48, -52, -59, -18, 3, -26, -43, -88, -89, 12, -49, -21, 10, 18, -61, -154, -76, -54, -67, -20, 83, -15, -11, -8, 5, -24, -14, -43, -5, -49, -134, -138, -65, -55, 8, 26, -23, -62, 20, -56, -93, -27, 10, -19, 59, 23, -96, -75, -20, -43, -32, -87, -118, -67, -71, -94, -37, -57, -89, -74, -120, -108, -122, -90, -47, -93, -43, -45, -99, -7, 31, -49, -70, -20, -72, -86, -109, -81, -123, -75, -45, -60, -33, -63, -113, -72, -97, -37, -46, 10, -55, -66, 0, -34, -47, -23, 86, 37, -68, -29, 38, -80, -136, -81, -29, -69, -72, -17, -3, 0, 2, 28, -70, -103, -71, -43, -37, 75, 47, -26, 19, 41, -2, -50, -3, -72, -120, -79, -95, 1, 6, 27, -73, -140, -114, -103, -174, -95, 21, 20, -69, -59, 2, 14, -66, -176, -125, -96, -120, -76, -21, -15, -14, -50, -156, -170, -89, -46, -2, -40, -61, -75, -6, -15, -16, -44, 81, 62, -110, -58, 60, 18, 8, 12, 0, 33, 8, 16, -4, -78, -85, -32, -34, -147, -128, -59, -48, 29, 82, 78, 65, 58, 60, -55, 33, -4, -4, -90, -76, -78, -77, -138, -42, 25, -33, -61, -99, -83, -3, -11, -26, 31, 37, -15, -27, -47, -76, -87, -69, -57, -39, -54, -11, -8, 22, -36, -71, -54, -44, -153, -142, -92, -69, -107, -109, -38, -108, -72, -35, 13, -40, -23, 43, 1, -72, -98, 18, -42, -89, -143, -67, -61, -54, 55, -11, 40, 137, 54, -80, -65, -63, -36]
8211c6lo8j1k4k3J51O5p0M7jm6r9N9j0J2Q4o5j3j8o2P4R0m2J3K7r7k2J5J0N2l9M2n8N5r5Q9
8194a7j0k1j01K4K3J3R0l3K0k8N0m5M4qqNk7j3jM3o0P0Rj26K3o6L6J6J7N3j20J23M5l4njj3
8176c3l5kK1L9l6j0O4Q7j21m8K5R8M5m6q3k4jPQ1k2M6kj43L9rj1j4L7K6j6o8N7J0N1J3P2l6
8159E8q0N2m5n3j%N0n7j4M1N7l2M0n1J0K0oJ0q6O1l1o5PK8Q1No5N9qJ4P1n6J8m5j09n4R0O1
8141b5Q4Rk3oj4l4J3O6k0o6J9n1j3Jj8N7Lj3L9K0M4po9N0l7m2M1Qm0O7l9O8n2l0m4j3M0m0
8123f7k3K1m8O4ML2l5o7J22J08j6j4l5Nk3p0j7pj5O2j38R6J23m6j7k5M5o4R8N5m3q1jl1K9
8106a9k2j9N4o3m0k8k9Q8J15J2j26l7J25R4o1o1l8q8J38j2P1n6p6O2N4j1r0J9jO9j6J6k4L5
8090C5j8j20L6O8n8m0j7K4L8K8l1K8j5p0P7O0j5N2mKj17L8l2Ll7j4J07J9o5o6JL1L8n7qj5
$$ y = [-36, -39, -107, -118, -142, -165, -14, 51, -19, 28, 27, -19, -118, -59, -69, -57, 27, -38, -51, -69, -131, -57, 33, -9, 4, 31, -66, -88, -73, -63, -11, -50, -8, -66, -11, -106, -17, -27, -48, -149, -125, -102, -89, 1, -32, -12, -40, 10, -35, 9, 1, -7, -2, -29, -42, -43, 0, -60, 10, 19, -107, -84, -150, -114, -98, -81, -28, -148, -25, 20, -14, -19, -20, -33, -68, -70, -49, -10, -46, -56, 8, 95, -26, -74, -49, 49, 94, 48, -35, -59, -60, -53, 28, 6, 52, 50, -93, -54, -63, -74, -88, -51, -25, -41, -109, -52, -42, 9, 22, 94, 58, -22, 30, -15, -68, -69, -69, -19, -76, -90, -49, 8, -24, 16, -35, -25, -5, -11, -1, -87, -26, -57, -122, -115, -87, -6, -1, -66, -7, -15, -1, 70, 14, 32, -13, -122, -176, -86, -25, 59, 68, 45, 39, 25, -9, 4, 70, 50, -16, 3, -48, -61, -60, -78, -21, -18, -31, 8, 28, 72, 65, -4, 46, 9, -33, 8, 16, -24, 43, 4, 72, 20, -10, -54, -67, -27, -67, -90, -69, -117, -53, -49, -17, -52, -119, 3, 111, 95, 81, 46, 51, 28, -42, -59, -66, -81, -19, -157, -61, 62, 16, -1, -26, 19, -45, 53, 108, 65, -16, -17, -48, -19, -41, -60, -6, -69, -109, -137, -166, -78, 37, 49, -77, -114, 11, 105, 44, -17, -55, -143, -5, -17, 54, -2, -78, -16, 38, 27, -63, -44, -45, 24, 8, 24, 0, 35, 17, -103, -67, 1, -57, -97, -114, -90, -52, -24, -55, -27, -42, -112, -35, 25, 10, 62, 58, 60, -57, -19, -51, -48, -85, -99, 8, 27, -38, -104, -103, -72, -34, -91, -99, -114]
8073a14M4%k5Q7M4n9l6l6m6J08J8r3p0L7J20N5K9m1m3pk9JM8J5l1J2l0J6j2MP6q1p6K8O2n0
8055g5L3kJ9OmM1Kq2l9l6L3kk7M2Q2p4J8k0o3O3j1O1K9l5k5K4M9m9p1K8J2qnpp1k6Q3Q3J4
8037a0q6k1J16m6m3ln5J08lk7P3nj7qo7qN6O7J4NM0pj5r1qR1q6l8j0J6o2N8k2j15K7J25O1
8019Dp8N3K2n6j4O6m3q8K2j8MpJ7k5O8QP0j3j1n9l6L6L1j9Rpl5j0J12ko2k7k0M0K5n7L3NJ3
8001d9j6M9M5Mo6N6k8K1J8k6j06P9n4j0L3o4J7j0O2J12oo0m6k6JQM3l8N6ok8O1r7O2om7L9
7983b3rk2p2M4j4n4J20l8P6p4l0o6O9R5Jo9m3M1J01J0j00K2o2K3L1o4o0O3J5L8k5k8PL2N3
7966a2l6k5P1l9j21L6L5m2J31K3m9k0j5MM5j0n3L1L9q0lL0mJ9m4o4N0qO7q3J2J3J7p4P5Rk8
7949a03n2Q2N4o2l5Q2m1m6O3L1J08o1q5J06M2o4j7N5n5q6L7J6l7R8%J3j0j6l1r9L8K2J4%n3
$$ y = [-114, -70, -70, -95, -8, 36, -23, -59, -95, -141, -33, -15, -108, -178, -141, -21, 34, 63, 22, -21, -28, -57, -56, -8, 7, -24, -12, -42, -26, -38, -34, 42, -39, -115, -87, -25, -75, -42, -44, -25, -19, -23, 18, 20, -62, -101, -137, -104, -106, -133, -91, -9, -83, -65, -85, -148, -85, -96, -35, -6, -41, -66, -42, 7, -42, -113, -85, -73, -81, -86, -93, -164, -190, -107, -24, -10, -96, -117, -1, -47, -90, -93, -148, -40, -43, -70, 3, -2, -19, -27, -94, -102, -46, 21, 35, 40, 80, 73, 58, -33, -41, 50, -36, -74, -84, -68, -130, -72, -94, -209, -182, -57, 4, -74, -21, 1, -55, -69, -3, -46, -134, -112, -130, -126, -133, -116, -141, -73, -65, 5, -8, -19, -78, -114, -78, -47, -66, -57, -64, -99, -109, 3, 1, -61, -88, -108, -68, -43, -100, -67, -62, -49, -65, -16, 29, 33, -33, 23, -5, 16, 34, 8, -98, -19, -73, -83, -50, -114, -97, -107, -45, 67, 61, 1, -45, -71, -70, -62, -19, -57, -1, -7, -35, 26, -71, -9, -15, -62, -23, -32, -54, -126, -82, -96, -150, -30, -68, 8, -66, -96, -162, -93, 2, 3, -66, -109, -68, 33, 43, -57, -35, -97, -74, -43, -107, -167, -104, -89, -51, -76, -104, -97, -65, -12, -48, -73, -2, -41, -162, -126, -91, -133, -2, 21, -28, -48, -63, -59, -14, -24, -77, -46, -7, -87, -90, -60, -64, -45, -89, -153, -103, -111, -44, -127, -115, -102, -85, -159, -84, -75, -103, -155, -73, -19, -81, -116, -34, -75, -121, -58, -27, 81, 20, -65, 41, 83, 19, 2, 57, 2, -84, -47, -31, -68, 30, 30, 43, 33, 17, -14, -113, -75, -53, -39, -39, -92]
7932i2K7r1K5LR8N0mJ8l0j00mP6l8m6J2O4O0l1n5j9K5pN5k9M3o3o7Q9m4r4k1P9J3N0M7pq9
7914i7O2l4m5K5K8k6p3P2M1No4n4O2M5L2L2R8J0r1r6l3l5O9l9P0j3nL0LK5n3M9l2K0k7m5m1
7897a25Q3QMK3p0j9N6L8o4j6R1l7k9n3Q0%n0Mm6P1Q6k4r6K6J01m5m0k5K2pK8PJ0j1Q4j08m0
7879h3j6N1j0L0J0K1k0m0K0j5N4j9j03J3jl1J1M9L2n0m4j1Q6Q9n7J9Mj9L7P3j07n7O3rj4j2
7862e6q9J3N6J6pm3M1L3Ooj9j9QJ06n0K5l5j4ol4Q0L8j19L2j8J35Oo5p8L6m2O9k2K2r0K2J01
7844C3j05LJ1K0L1%No8j0ln4J1P8OO4r9n6K01j33J16nj8L4o1k1j10K8L5m1O7K2M6m1l8n0J24
7827B2m5k7J1pL6M3%j8l7j8L5j8q8l2%J03nnN8p2m3R2j4J0Ql1K3j1J7o0p6m1Q9P6L6n6n2m1
7809a38J22o4k8J05j8rL1L4Qq7NN4J0m3j0p5KR1q1R4j5Km0nJ8mK1J3j8L9k3k2OL4J0o3kL1
$$ y = [-92, -65, -156, -131, -128, -30, 20, 16, 34, 4, -96, -100, -24, -62, -108, -96, -32, 28, -3, -58, -77, -52, -59, -4, -33, 10, -53, -120, -31, -75, -169, -190, -111, -98, -48, -1, -8, -97, -35, -69, -114, -89, -61, -87, -160, -88, -47, -42, -106, -160, -98, -53, -21, 11, 109, 119, 28, -68, -101, -136, -67, -106, -36, -49, -54, -24, -21, 4, -49, 0, -32, -12, -39, -84, -125, -42, -34, -30, -7, -77, -96, -40, -2, -66, -82, 9, -28, -57, -110, -30, -30, -80, -76, -122, -51, 35, 11, -85, -59, 42, -3, -43, -68, -46, -53, -25, -18, -8, -19, 65, -43, -83, -99, -48, -58, -28, -18, 3, -17, -57, -37, -52, 2, -17, -120, -107, -108, -139, -128, -79, -47, -97, -141, -152, -66, 23, -34, -15, -11, -30, 7, 80, -27, -84, -21, -30, -44, -56, -145, -132, -76, -60, -67, -110, -69, -36, -30, -36, -55, -74, -66, 40, -10, 15, -20, -34, -40, -74, 6, 44, -75, -43, -61, 74, 80, 15, -63, -27, -69, 0, -22, 0, -90, -68, 33, -72, -69, -58, -38, -7, -7, -2, -70, -80, -83, -137, -126, -48, -42, 22, -77, -133, 68, -65, 51, 46, 28, 62, 1, -20, -130, -102, -67, -108, -41, -19, 27, -14, -52, -102, 22, -23, -50, -39, -46, -10, 33, 33, 15, -22, -40, -5, -23, -111, -143, -143, -40, -45, -50, 8, -64, -107, -15, -29, -19, -11, -42, -19, -30, -13, -73, -149, -190, -101, -25, 11, -45, -97, -138, -16, -80, -108, -3, -21, -30, 1, 35, 43, -44, -39, 15, 25, -18, -28, -103, -101, -10, -91, 3, -12, -10, -50, -55, -37, -41, -20, -7, -25, 14, -9, -31, -25, 9, 19, -44, -46, -15]
7791a5n0PjQJ8l5Q1m8kK7Q0m2r3k7j3N0l6K4K6m2j6J23Lo8j5l4M7j8q5K8RL4P1L3j07M0qj02
7773a48O8J3P3N8n3o7J7m4QN4O5m3Oo0J9N4K7J12j05J9n2o0k2J02N5j33K1J15J2p9j00k8J39
7757D3P8q0r0j00Q2L3j3L4j20J9L0K2j4l6j3lN7l3O6J4Nj3Nkl1o8n%O4M6J23o3o8k0poL7l1
7739e8k2Nm8L2K5K4Jn3j1J19Om2P3m5o4Op1NR2n2N4j4n1L5j1j9j30kO4J09N8l3M3L2n5k0l1
7721d9j7N6m0k2M7K2m5M7p1j03N3M1l3R8LJJ2o0K0O6N9r9n4j4m8m9J8l0J07k3j1N9P2n2l7
7704g6J8N2Kk7J6L7J5P7K4r0K4J6k1j10j60J15O2M7p0p3Q7K9q8L5N2l3K4OMPm8J3KJ7j48r
7687a72O6n4P9P6j9Lm5k4L7p5m1K0O9j4J5k1O3M7n8m2p5L0M7N9K8Q8M0q7o0k0O2m6l6O6m8
7671d2l5lq3M1K3m4L8Jk7j9J03%pRRo2n3k1J07K9m4O4l0n1M8J9j2m5l1Q8J5lo7J04K5M4r1
$$ y = [-15, -65, -58, -59, -51, -33, -68, 13, -35, -37, -10, 70, 28, -65, -92, -105, -55, -91, -67, -41, -83, -99, 24, 27, -41, -56, -90, -43, -61, -146, -118, -109, -75, -4, 29, -78, -38, -46, -148, -80, -67, 6, 64, 11, -56, -39, -83, -75, -21, 44, 1, 7, -53, -34, 20, 47, 159, 54, 73, 21, -39, -61, 41, 96, -37, -16, 99, 111, 32, -68, -96, 43, 121, 41, -49, -149, -67, -34, -47, -13, -133, -114, -84, -62, -76, -112, -125, -128, -71, -104, -38, -24, -19, -32, -27, -29, -60, -128, -133, -133, -69, -23, 100, 37, -31, -51, -58, -64, -27, -58, -80, -75, -123, -91, -66, -42, -41, -94, -105, 14, 20, -22, 51, 6, -58, -52, -123, -118, -26, -78, -24, -38, -89, -54, -65, -84, -214, -216, -152, -43, 15, -18, 25, 57, 2, -18, -49, -66, -10, -50, -72, -25, -3, -48, -1, -72, -175, -122, -81, -114, -16, -13, -12, 0, -60, -40, 26, 85, -14, -68, -82, -130, -179, -161, -191, -84, -107, -118, -59, 13, -39, -76, -58, -6, -4, -31, -15, 22, 37, 114, 138, 48, 72, 88, 67, -43, -203, -88, -26, 21, -49, -122, -35, -6, -94, -59, -7, -40, -16, -10, -6, 1, -47, -34, -32, -15, -163, -172, -106, -160, -81, -5, -24, -21, -66, -90, -53, -128, -169, -149, -80, -94, -79, -100, -37, 10, -48, -90, -165, -135, -88, -29, -1, 87, 127, 40, -20, -40, 22, -24, -60, 6, -42, -77, -80, -163, -122, -99, -143, -105, -104, -131, -150, -47, -47, -54, -45, -36, -98, -151, -172, -65, -36, -80, -16, -46, -97, -49, -30, -42, -87, -118, -30, -15, -18, -85, 19, 44, 88, -3]
7653co7O0n3O4o1oJ5k1QmRK8M7n0r7JJ03L2q5RqL0K8j41M8Om6M7j6Mn1L0K6J3j2J33j1o6L7
7634b0l0M6j6k7M5p4q0O4R4L3L1k9p4J0L0l1l7K7o8P1P4l8j7NJ7n2o3R6K0l0n0L3oM6m3mN0
7617CJ3k3p0PK7k0N6j1r1L4L5R8J8o7l0j0m4n2N8QL1r6k0K9P9O4J7l4J5J7n9k2R5K3j15O6
7600B9o3l9M4m2l6J00k7p8R7j9l5q5J05Qq8oM8O7m4m4mL7O5j5MQj2M1k4l1J2NPm1j7o2J23
7582a2n3j05j6O0j5lO7j14P6J90m2L5qj25p4K7M6O6J4o3k0M9j5O2m9M6Kr6Qk4k6N0j5J2qP8
7565Ej6Qr3j08P5N9j3M0K5M7l7n8n3L8jPO7J0KJ5o2j11k1Q6oj2J35j6L4o1l9J7J6M6j11l1
7548a17%M9L4oJ5K6j9q1RK1Lk4J1k4K3k2M3K7Lj1O4Rj12k3O0mL8kJ8n4r4N0O5OK6No2P9J1
7529D0J3j07NR1L7o4p9O0O5n4l8P7l1n5KpqL7K9m1N5Q4p2rj40NlJ38Pl1l9Ro2l4MJK8L6k9
$$ y = [-3, -70, -10, -63, 1, -60, -66, -51, -72, -64, -68, -59, -31, 16, -34, -131, -130, -27, 5, -80, -71, -79, -49, -21, -162, -114, -108, -154, -107, -123, -119, -170, -140, -114, -101, -113, 20, 9, -57, -20, -50, -4, -20, -47, -2, -76, -156, -92, 2, 35, 66, 37, -37, -27, 3, -28, -65, -38, -106, -35, 39, 1, -16, -11, 6, -46, -109, -13, 7, -23, -73, -40, -46, 0, -43, -47, 3, 16, -7, -77, -70, -43, -63, -7, -18, -109, -75, -40, 58, 76, 9, -21, -31, -75, -127, -69, -61, -30, -126, -146, -117, -38, 26, 43, 9, 24, 41, -18, -40, 55, 78, -37, 29, -34, -73, -29, -71, -107, -7, -34, -112, -15, -34, -69, -154, -49, -41, -129, -135, -87, -20, -64, -108, -112, -75, -10, -25, -21, -13, -25, 16, -8, -39, -27, -22, -15, -56, -73, -135, -12, -65, -170, -186, -126, -141, -144, -77, -191, -115, 75, 33, 68, 60, -65, -139, -112, -66, 0, 14, -49, -69, -20, -35, 27, -22, 24, 26, -70, -62, -86, -112, -62, -77, -65, -73, 5, -11, -3, -96, -204, -129, -70, -83, -43, -18, 29, -8, -66, -119, -81, -82, -75, -8, 2, 4, 19, -43, -154, -175, -89, -95, -107, 28, 12, 46, -15, -54, -37, -21, 25, -86, -117, -117, -68, -34, -40, -25, 1, -18, -99, -90, -69, -66, -90, -79, -103, -80, -102, -59, -32, -29, -40, 24, 33, -79, -102, -42, -46, -8, -10, 8, -46, -140, -90, -25, -19, 7, 12, -50, 29, 40, 53, -54, -49, 42, 79, 15, -64, -4, 61, 7, -31, 46, 15, -40, -38, -45, -53, -16, 13, -28, 27, 111, 39, 30, -110, -105, -108, 30, 37, 6, -33, -24, -86, -120, -116, -115, -87, -51, -80]
7510h0R9k6O3J6j18m4k0JR0K2k6j8n7l5J11J2n4J6nn1N2K3Nj01J27K2o0M7Mo9M2r1J7N5l1
7494f2O7j16N3L8K2Lj4qk4m7L7l7k3P8J9j8j20K8M2L9m1R4q9q0l7j9O8J38P8j4J8n2m9l3M
7477e7M2L7J0n8LO2p4M5k4n5K1P2o3qJl2o3J6R8jn3Rk9j13k8R9O0m8N9nm1O6K6J2nj1RM2o3
7458d2L7K2J2n1o9J03J7l3LM3k0j5l1J07Kj9k5k7l2Rn1%N5Qj6N5l6k1o7lJ09Ko1O3l2K5p3
7441e2r1N4O2k4J8J1m6j4J7qK0k7k6K2J8Mk8l1J6L0J8P0mp5QR1O0m5q4n8O9K2o0LJ9n8k8j5
7423a42P5k6j5k4M6kp7R4J7j1M0o3N6N2j05l3N0Ok2M8r1k8l6P1O1jN2L9j17o2k3J25K9o7P
7406g7m4Q8K2k8J8M1l7m5J7JO4j14K3Q1p3Qj4J25k3j9o1p6k6J3pj0oRL6N9K3k7j7J11o0q6
7389a11J1O7m6M1R5Lj7l6j47K0Oo7Q5K9lQ4n1K1k2O0JP5l2r9n0R6m2L6o6q2K2P5QJ5j3l7l8
$$ y = [-80, 19, -7, 56, 72, -46, -90, -110, -109, -19, 3, -23, -41, -98, -133, -22, -10, -64, -48, -53, -104, -52, -29, -24, -125, 2, 24, -36, 11, 15, -54, -12, -103, -86, -31, -62, 5, -111, -58, -20, 2, 5, -9, -17, -41, -88, -51, -88, -111, -33, -14, -32, -152, -124, -82, -43, -84, 10, -79, -159, -196, -215, -147, -9, 69, 55, 73, 21, -28, -61, -57, -15, 22, 32, -26, -23, 39, -35, 10, -14, -69, -48, 24, -39, -47, -46, -78, -141, -125, -27, -28, -81, -72, -101, -214, -242, -143, -83, -131, -72, -77, -118, -52, -26, -14, -19, -30, -21, 21, -42, -5, 17, 29, -22, -91, 12, 29, -4, -1, 42, 22, 7, -24, 83, 85, 66, 41, 14, -18, -9, -60, -60, -5, 3, -13, 42, 6, -15, -82, -85, 24, 26, -35, 28, -4, 21, -52, -143, -89, -27, -51, -33, -22, -68, -82, -65, -73, -53, -80, -106, -84, -66, -62, -90, -121, -105, -75, -57, 13, 9, -66, -58, 33, 93, 48, -36, -94, -25, -3, -63, -60, -41, -99, -127, -142, -67, -93, -108, -132, -86, -88, -165, -71, -54, -65, -25, -88, -32, 20, -85, -118, -68, -62, -84, -36, -127, -155, -191, -120, -59, -60, -8, 31, -86, -148, -171, -46, -17, -84, -77, -121, -33, -11, -39, -21, 20, -17, -62, -45, -44, 20, -94, -71, 10, -63, -55, -69, 56, 33, 14, -47, -123, -149, -136, -143, -153, -159, -150, -114, -55, -32, -59, -76, 35, -25, -111, -100, -33, -79, -38, 57, 60, 43, 7, -140, -120, -114, -181, -96, -67, -70, 14, -37, -16, -38, 22, 23, 98, 66, -33, -83, 13, -29, 7, -59, -141, -119, -44, -36, -21, -34, -71, -109]
7371a09J7j3O0l3l5J9P6%o8m5O2K2m5K3l5n8J63K2l6L1M0m1n5n9R1Lj13l9J19o7J0n1P0J6
7355e8J24j09k2L3J0M1q8l9mQ9K7m1k4J6K3p5L8J6L9l8oq3m1j1Q6P2m7N4k0K0KN6r6o3Q3K3
7338a3j1n5K6J0r1J5nQ2L7j6O1j07J4r4P7Q8n2q6J2K7M9k2j8lJ6J3j4L8R4l6L5j44MP4O7j8
7321E4o0m4N1Qq9o7L4J09j7n9L3k8L4j5PN9K4J3m8j07L7P5J0n1rj2Oj04j6M7M1J8N3n5J2O4
7303HJm5l2q3P8Qlm8lQ2J0r6J4J0K2L7M7k8J27m0j7q5m5K3K0L5j0p6j0N7j9K5o2M9L9o4N9
7286a5P0rk7k6j08q8Q5O8N9l7O3k3qp8j3M2J4J7J3k7n3K4MKk8l2l2K6J30M0k4l0m1N2j8K3
7269A5n3K7M6o7j14K4O6nN1K1j2mm4L6k0k6J0m8J00k7k3R9L2q8j0mj10N0OK7P1p8M7P6Lo7
7251Gl8m5l2Qn4PQN7LM3J29Jl4n2mk0N1m3K0o1KR7Ll4m8n7M5q6RJ64K4p2q6O3Q8n3j04K2l1
$$ y = [-109, -92, -105, -45, -78, -113, -94, -18, -18, -86, -131, -69, -47, -92, -69, -104, -162, 1, 23, -13, 18, 58, 17, -38, -97, -6, -3, -116, -155, -36, -103, -93, -144, -74, -58, 66, -43, -65, -32, -22, 19, -69, -108, -112, -23, 4, -37, -61, -45, -22, -97, -59, -43, -4, -42, -48, -131, -172, -183, -97, -25, -72, -18, -38, -18, -16, 40, -56, -119, -36, -13, -24, -79, -53, -43, -134, -119, -124, -42, -5, -21, 40, -67, -53, -147, -70, 18, -34, -120, -108, -81, -32, -54, -72, -75, -59, -46, -60, -22, 72, 36, 71, -73, -69, 5, 72, 54, -6, -50, 1, 9, -80, -147, -113, -4, -21, -80, -47, -75, -41, -56, -49, 10, 34, 47, -1, -108, -71, 4, 14, -37, -46, -58, -52, -156, -172, -125, -84, -66, -13, -68, -56, 8, 9, -36, -68, -151, -73, -65, -68, -116, -119, -37, -27, -123, -109, -99, -77, -40, 7, -21, 106, 66, 49, -36, -81, -58, -38, -3, -13, -89, -99, -42, -61, -36, -98, -49, -10, -74, -15, 55, 46, 19, -7, -115, -203, -118, -50, 9, -28, 35, 12, 4, -74, -87, -45, -31, -14, -1, -28, -81, -57, -53, -51, -79, -111, -143, -117, 13, 53, 29, -1, -42, 10, -8, 15, -38, -11, 35, -32, -146, -122, -56, -61, -10, 11, -1, -5, -49, -13, -33, -59, -49, -97, 3, -24, -47, 52, 84, -4, -14, -18, -128, -78, -72, -45, 26, -52, -5, 71, 74, 7, -31, -76, -108, -100, -154, -147, -139, -82, -79, -36, 93, 94, 60, 8, 4, -16, 35, -8, 12, -49, -47, 50, 53, 19, -29, -86, -41, -127, -118, 46, 70, -2, -88, -25, 63, 10, -94, -72, -103]
7233a03j5O5k1j1J4%J7K1M7m9l3j2J8Mn3N1oL2l6k3J07m2n8K6p1O4rJ8j9n3M2nL5L8jL6q4
7215f9qO8l6r1O1l5j2m9M3J01L6q0M6P2n9j2J09Lj83k6L8N1l2l5j2OP9O4q0JMM2p8o7K5JJ2
7198a02R1n8M8J7m6L0J1k8J03o0J3k9j39K4p5J44J6p9P2nj0l6R8L5Pn8P5r6K1o1K3K0K2k0
7181c2LM6Q1k5K7l7m2pj5Qo6O3n7k0mk2R6p0m2O8K1J1%m9k7L2J1RM2N7l7q0lo5K4q2K0J10
7163e3N8J7q6k6O5n6L2m3qN7kn0P2K9j2l7N3q2qk0J32k1n2o0JL1n0P8P8pK3o0n6q5Q3L0M7
7146A2j31O2J7n2K2m1j0N0M2K0j00k2K8L6j00l9O5J07j0k7k7L9m1O2O7n7jj9n8P5R1o8m2R
7129d1M7m6j2J02j11kP9p7J1O3k9m0j0o1O7j3l4kP1Qj22K0O6J4KRJ5JM8o4m3n6j4J8P1o6m6
7112a77j2N1J07j3n4L7pn7L9O1K5m4j3P2k1n1qpk9Q3N0K6m0p2m2m7M8j3l7R0Q0qPp6pk6m2
$$ y = [-103, -118, -53, -74, -85, -71, -71, -54, -33, 14, -35, -68, -80, -62, -58, -111, -60, -66, -34, -70, -93, 14, -28, -86, -60, -131, -67, -76, -58, -77, -130, -88, -93, -58, -20, -21, 15, -69, -77, -9, -45, -136, -75, -110, -122, -171, -128, -27, 9, -71, -25, 47, -12, -24, 85, 88, -95, -121, -83, -32, -64, -99, -111, -105, -26, 38, -42, -41, -37, 5, -73, -140, -115, -114, -102, -11, -69, -21, -4, -50, -20, -9, -37, 66, 6, 19, -10, -149, -125, -200, -56, -40, -119, -47, -52, -62, -98, 0, 35, 42, -16, 59, -37, -16, -77, -54, -34, -12, -32, -29, 17, 98, 73, 100, 63, 21, 14, -1, 7, -59, 4, -53, -73, -77, -99, -3, -73, -115, -47, -26, -15, -15, -64, -91, -59, -48, -39, 3, 60, 23, -57, -60, -125, -101, -183, -163, -53, 5, 22, -64, -90, -25, -81, -49, -92, -100, -43, -45, -95, -23, 6, -6, -43, 10, -72, -80, -100, 32, 11, -41, -101, -100, -69, -119, -41, 37, 30, 53, -7, -63, -148, -65, -35, 12, -119, -57, -40, -92, -70, -111, -121, -71, -29, -9, -109, -131, -103, -67, -167, -206, -141, -34, -44, -71, -98, -59, -100, -38, 29, -28, -29, -48, -106, -31, 60, -8, -50, -41, 6, -40, -52, 50, -61, -63, 16, -61, -50, 13, -16, -56, -66, -127, -60, -73, -107, -109, -38, -30, -152, -132, -66, -52, -50, -41, -26, -25, 23, -41, -84, -140, -154, -136, -65, -131, -177, -189, -138, -31, -44, -98, -61, -68, -125, -86, -25, 0, -44, -57, 15, -6, -57, -65, -72, -101, -18, 32, 58, 18, -54, -96, -143, -95, -108, -145, -55, 25, 17, 24, -52, -59, -85, -127]
7094a27N0L9o7NJ57m8Pn3k7K0N4Mj7j3M9M7j9l6k0k7l3K1L2P6K6n5m1j8N6o5k4K9l2J5o2Q6
7077a1L3j1j22K8mO1L3o7J7j0n8J8L0M7L6k6j02K8M5j6K8q1R7L3k5j5j05KO2j0L8k5o4n1J7
7060a50J16J27p7n8k9P1Lq2k1K7L8lo5P9K2Qlm1J7n5L8Oj7P9L2j59L3N1Qpqp1L3M3J2l1MJ2
7042a8oJ09p2n6k8L5L3L2Lm2k1JL8k3k4l0p2N4O3n1m0J06m7n0mK5M9N4o5r7L0M2P2o5k9o2
7025a56N9rJ4N4l9k5Q8j2N2M9m4K1m9p5M1k3j3P3j01k8m3P6R9j8j0j02Nr0P3N2L2o7O5J9L
7008b9P3m5q3M5K5L8k1o4L7J3j7J8Jj2j26K9M3J8L6L0m5p4k6J41O1k2o7kj3j7o3O6oj25R7
6992h6QL6M1R7j4q8l0pN2J0J4l6J9j04N1k8q2n5M1P1N1p4n2O0J02p2J3qK5L7ko1J0k0k0k1
6974a22Kj0J9K0O6K6o2%M5K3j61P3J6M3LJn2P5Jp0Q3L7q6K6k2J4lPM6n5k8k1Ko7M0M4Qj8K0
$$ y = [-127, -77, -38, -105, -100, 57, 9, 16, -37, -64, -44, 10, 14, -3, -16, 33, 80, 61, 25, 5, -22, -55, -34, -2, 74, 100, 45, 4, -14, 42, -23, -47, -18, -50, -35, -97, -11, 22, 11, -111, -83, -87, -26, 7, -60, -43, -53, -111, -93, -63, -16, 20, -6, -108, -80, -35, -51, -23, -104, -7, 26, 1, -14, -119, -117, -55, -65, -27, -52, -116, -167, -150, -34, 93, 16, -42, -71, 0, 3, -79, -100, -73, -35, -38, -103, -24, -2, 6, 3, -38, -21, -76, -38, -32, -49, 30, 62, -97, -64, -13, -5, -12, -20, -91, -58, -15, -3, -34, -30, -18, -24, 85, 13, -43, -71, -36, -3, 29, 32, -10, -31, -30, 8, -15, -39, -69, -141, -87, -24, -75, -115, -9, -56, -106, -110, -85, -36, 18, -47, -144, -114, -72, 0, -65, -94, -156, -97, -106, -92, -38, -77, -102, -14, -26, 26, 75, 31, 52, 3, -72, -31, -54, -67, 6, -95, -123, -166, -90, 9, -9, -19, -121, -116, -206, -133, -81, -49, -116, -51, -32, -29, 44, -1, -84, -39, -14, 24, 3, -61, -24, -11, -28, -10, -9, -21, -147, -118, -75, -57, -21, 9, -36, -110, -136, 5, 66, 44, -23, -25, -38, -55, -118, -52, -58, -183, -86, -78, -42, -1, 96, 82, -6, -36, -43, 9, 19, 33, -3, 16, -88, -37, -65, -147, -202, -161, -90, -39, -113, -165, -105, -3, -75, -62, -70, -45, -8, -10, -71, -61, -81, -101, -122, -120, -130, -111, -91, -25, 1, -61, -61, -16, 7, -154, -81, -65, -22, -19, -18, -70, 5, 6, -64, 19, 56, -30, -4, -26, -12, -15, -8, 38, -17, -45, -66, -64, -131, -91, -47, -39, -57, -37]
6956c7j4Rk6L4JQ0nl2Nn2ok2O0N5nj29r5Q4lP3j22M1Ml7Q7O8L5n1o3j7J8K9Nj3m3O9oN4K3
6937E6j4q6O1o4J6l8l1P8N6m4p3M7L5Oj5P3l0p4p9O2K4l5MN6k5n8k3j8L0P2L8k5l0l3L2j9
6920f8n9JrM1O8j01J10J5j02N1M4m0P0J8L8p0j7Pj02Pnj3O9o1Q0Mj6R1k6p9J6P3q1j20K2Q6
6903e8k4P4No6p0L9K5K7M8oK1j15k6L2j3r2M4J22J7Rk8kL3lJPm6J9N9k7p5L0J4l1J7n5K1j5
6885h8j8m3R8no7L9K3L4n8J28Q9k7r8On2o9K5N6P4m0l0M9J3J2l6m9q9n3N7N8N0PK0M4p0MQ
6867Bk8M6J3o0m5KM5m9l9J36j6J8n4l1L9k6m9N9J05k2l9m4L6N0r9k5R3l8L3m4m2J4k3LL1n
6850e3L2Lr3l2O7k9K6J4NJ9N1n4q7m0L4R4l0N0nj4Q3J0p3%J8PK3p4K6K3K8k2O5r1m6j1J6O5
6832El9j9PmN0j8K3j33j13J7Q8L9JJ6qN7P7m7KK0j1k3o6n4k0P0m3J5J6O5k0o4l0m2J15J62
$$ y = [-37, -51, -42, -68, -34, -33, 47, 42, 10, 15, -37, -43, -65, -5, 50, 45, -84, -179, -95, -98, -25, -147, -106, -102, -139, -52, 16, 51, 0, -63, -80, -62, -33, -28, -41, -84, -15, -21, 33, 56, 42, -44, 17, -47, -31, -69, -100, -22, 34, -10, -83, -36, -1, 5, -10, 63, 33, -41, -120, -58, -34, -69, -65, -9, -34, -92, -115, -133, -103, -31, 7, -18, -48, -81, -49, -68, -127, -126, -135, -94, -26, -127, -17, -2, -104, -53, -9, -49, 21, 39, 77, 7, -10, -3, -105, -98, -103, -116, -47, -108, -28, -24, -40, 51, 25, -54, -38, 35, -46, -166, -144, -58, -82, -8, -3, -69, -139, -100, -75, -48, 0, -6, 15, -100, -126, -94, -107, -199, -155, -33, -16, -7, -35, -37, -4, -7, -6, 1, -45, -26, 33, 6, -69, -39, -25, -56, -39, -94, -73, -88, -106, -149, -51, -56, -123, -84, -61, -27, -85, 43, 132, 105, 7, 13, -39, -108, -83, -27, 47, 7, -23, 26, 39, 51, 15, -34, -123, -176, -119, -61, -11, -4, 16, 60, -10, -6, 2, -26, 20, 33, -27, -72, -70, -25, -74, -113, 23, 7, 25, -29, -60, -21, -47, -96, -37, 68, 46, 7, -37, -1, 49, -50, -75, 18, -20, 13, -31, -73, -59, -82, -79, -48, -53, -21, -18, -111, -143, -76, -105, -79, -65, -60, -41, 10, -44, -131, -171, -137, -43, -73, -23, -28, -42, 41, 51, -22, -22, -4, 3, 26, -48, -22, 1, 29, 7, 72, -19, -65, -76, -60, 5, -34, -53, -46, -50, 0, -18, 5, -128, -241, -224, -136, -97, -96, -80, -88, -31, 46, -1, 1, 21, 10, -13, -79, -133, -153, -83, -126, -111, -95, -30, -50, -114, -144, -186, -71, 91]
6815I1j1j8l9j7N6j2l5j0jJ4M5j8J1j8m2K8Nk3qk5l4R7Ok3j2P4Oj03K7N1J7j08r7j5K0J8N5
6797d8m9K5L8k4R6j6q4p1O2L6l7n7k2K3n0O0J14lm7l8R8m8o9j6M9O3p0qqK2mN7j5PnL7L1j
6779B8K0l9j29n2R3P5J2l0j3o1j4J15Rm7k9J1m4Or0PM7M5L7O0K0Pj39O6q0k9P2k1N7lpk2K2
6761d0J7j0lr1Q7K5j0M3j9l0M0Q2m8n0M3kl8r3N5Q3l8Km3J5p3j3o7K4N5QM5k0j9R6m8J7q%
6743b6jl3%k5m4rk5N9P5M1N1m0k3m8l5P2M0J9m3m1k8J4qk7M4J8o6Nj0J18L0ok3j04l8L4j6
6725i9k4LM7J4J4k0OJ9JJ8j3qpK0m1m4M4O5l0L6L2m4oJ1J9m0oM9j6l1p4M7K2q5P2q1R0O4j04
6707h0O1k1r3P0K6j8NQ5m8L9nJ7j0o6Nl9k0k5nM0K1rQ8J3K9o6k9l0K5k9P4k5M0n8oj4m7K6
6689g9j7J4mQm5N7M7o9j0M1P1J9o0jj6l6O3M6k0o2O7m7J9q4O5MkJ5r6Q1l2n5P8%j0O3L1J2
$$ y = [91, 80, 62, 23, 6, 62, 50, 15, 5, 4, 18, 63, 45, 56, 38, -4, 24, 29, 6, -2, -27, -61, 36, 42, 19, 7, 81, 87, -16, 11, 62, 79, -29, -126, -141, -121, -103, -48, -97, -72, -34, -58, 38, 22, -62, -133, -71, -35, -72, -129, -151, -128, -178, -118, -4, -7, -54, -92, 6, -42, -111, -127, -78, -15, -85, -93, -101, -79, -83, -26, -41, -34, -39, -2, 29, 28, 48, 9, -120, -172, -79, -4, 8, -22, -35, -96, -110, 5, 14, -33, -62, -51, -95, -89, -179, -172, -125, -80, -43, 17, 37, 44, -95, -29, -109, -138, -66, -87, -30, -33, -40, -62, -40, -23, -33, -36, -127, -40, -15, -25, 18, -1, -31, 9, 91, 43, -7, 36, 34, -4, -97, -42, 41, 3, 5, -38, -23, -96, -109, -176, -152, -97, -89, -44, -64, -83, 13, -35, -18, -26, -26, -27, -60, -60, -85, -129, -138, -163, -104, -29, 12, 63, 23, 0, -48, -83, -11, 29, 48, 5, -36, -64, -50, -58, -85, -41, -23, -89, -84, -94, 24, 54, 48, 25, -79, -117, -83, -99, -123, -120, -73, -59, -45, -65, -59, -40, -39, -21, -34, -42, -49, -29, -70, -114, -70, -5, -35, 1, 33, -11, -17, -6, 13, -27, -33, 16, 0, -31, -105, -58, -36, -121, -49, -130, -40, 24, -80, -19, -40, -133, -63, -37, -55, -50, 35, -13, 26, 21, 38, 28, -38, -33, -72, -92, -117, -122, -82, -61, -70, 18, 31, 60, -6, -35, -65, -40, -69, 5, -20, 20, -38, -44, -58, -105, -79, -96, -82, -86, -78, -123, -66, -19, -88, -98, -57, 14, 33, -27, -28, -44, -80, -17, 29, 9, -53, 14, -33, -14, -98, -33, -29, -31, -16, -112, -31, -63, -118, -40, -40, -50, 13, 44, 56]
6671E6o8p0M9MK5pn1M4L4m2rJ2k0pn1j1J00m8n9J28o3l5M3o5Mqk5R0j2K5M5o6M9J2mm3p6J17
6653cK9k4k1R3j4m8k6o9L7O9j3n4N2p2k2J9l3P8o0NJ0L2P0j27jK5nO3l0j2j8P2j02O8K5N6
6635D9%K0po9k6rm4j9L6K6lJ26k0N7q2q5O2r7j7q2P3J41jo7k0o5j1Q6R0qk1J0K9m6Nj7J7O2
6617G3p9p8l1K5k9l9QN4P9m9m2J14j7k7k3k3j6R5r5K8j9K3O7rp4L3L0j6%J7l4o3N4N6L9m8
6600a6j1L1j1j02q9J2O6P7o7qJ05m5n3P7J9l8O3j29r9Q4P3n9O5K1p9l2P0M4M3Op1j1L2k0N9
6583GM6j31J0L4N5jJ8o4o8OJ7qqM3k1o6M8M6Kl0p8Q4p9O7J0K7J3l5nm2O6K4l0N2K0kk8%k7
6565b8m5L5K6m3k0q4N7O9l8qK7O4N2j25L4k7N4l2j0J4k1j5J6N0k0k3J0Nq6K8R6p0k0j1K3L5
6548c1Mp8J07K4n3m6n2M8ql2Q8Nk1M8l6O0j11j3J29J3n9o2N7oJ6o6j7N5kl5oK4O0n0Rrn1N2
$$ y = [56, -12, -82, -33, -29, -4, -11, -62, -18, 16, -26, -35, -23, -43, -50, -101, -112, -12, -60, -119, 9, -54, -89, -46, -111, -107, -115, -140, -50, -62, -37, 8, -58, -9, 3, -1, -44, -120, -3, 26, 2, -19, 74, 60, 12, -14, -83, -46, 23, 10, -44, 8, -64, -86, -67, -100, -22, -82, -77, -67, -35, 35, -92, -93, -68, -73, -10, -40, -52, -70, 2, -100, -32, -7, 49, 49, 69, 62, -7, -33, -42, -86, -105, -69, -43, -46, 80, 60, 117, 35, -50, 12, -85, -102, -184, -111, 30, 29, -38, -58, -123, -134, -48, 42, 34, 13, 23, 52, 6, 11, -6, 11, 73, -6, -84, -115, -90, -119, -158, -150, -96, -17, -66, -108, 6, -11, -38, -61, -84, -100, -5, -100, -72, -91, -68, -1, -10, -84, -51, -21, -37, -37, -20, -54, -117, -63, -7, 32, -16, -27, 4, -7, -109, -198, -186, -120, -43, -110, -118, -13, -58, -111, -34, -15, -53, 10, -119, -218, -134, -61, -120, -55, -34, -113, -145, -75, -31, 12, 18, -53, -64, -32, -52, 7, 53, -78, -68, -34, 21, 20, 38, -26, -94, -88, -71, -79, -87, -44, -65, -131, -83, -37, -35, -65, -143, -59, -138, -71, -61, -34, -21, -56, -61, -103, -37, -13, -43, 9, 29, 27, -1, -1, -28, -73, -38, -12, -55, -75, -159, -102, -33, -71, -79, -52, 12, 64, -61, -27, -54, 0, -32, -42, -28, -49, -64, -48, 2, -18, -41, -31, -26, -112, -84, 12, -58, -78, -89, -66, -31, -27, -105, 2, 26, -27, -73, -125, -77, -85, -117, -29, -24, -45, 3, -33, 27, -84, -97, 32, 45, -14, -76, -19, -25, -9, -75, -92, -37, -39, -74, -80, -56, 4, -46, -37, -46, -97, -45]
6529d5r5J8L9LJJ4O9k7p3ok2N2J5N5LO3m0p0N4j9j07N1j4P2%n9K6j0k8QK5J3o4L3M6N4j4J2
6511C3q4n6K5L1j0Oo0L2m2J33pm4l7J24j5j53J04K6q9j1J28J2p5m4M1R7j4j2k4NpJp1K1J7
6495a9L8M1j21OL2n9J05Q0o2k1l3k1p5k6M7O9j7kL7j03p6J0P1qL9l2N2R6p7p8N9M1J2o7j4
6478g6L5JK4n6L1O3m2j6KQj0K7jn2L6k1j03N9k2p4O6K3N2p8Q0O7m3n0Q0J0M0n3j4J7k0r1J06
6460EM1qj30J7O3j6lP6j00n3R8m6knK4K4N1M9r8J1%K8j3k5n1j57R1L8j8k2L6M6K3J0K6L9o0
6443a1l3K9lj12J0J12Nj02%J0rN5K2l3l4o1QJ9L3q9J21LJ3P9m1k5Mm5N0P2Rk2J7r5l4j3L4
6425e7L1L1M1J2j3jmj07o1Q6PL6j9j8K5M1m0m8mM5o9M7qo1K0po7K6J03L2m2l5k8P7l1KJ2q
6407e4L0N8Np0l4Lj77O8Q2On9j4J21k4l5QK6K2m7L4p8P1k4pMJ8K3L2r0k1O3rQ7p1m3oP9R0
$$ y = [-45, -140, -122, -83, -80, -79, -65, 4, -23, -96, -102, -124, -72, -57, -2, 1, 64, 24, -46, 8, -11, -118, -67, -81, -9, -9, -68, -42, -52, -80, -72, -47, -34, -98, -65, -19, 35, 21, 33, -51, -107, -82, -51, -61, -55, -115, -83, -125, 8, 1, -43, -80, 44, 29, -124, -20, 6, -83, -94, 34, 46, -29, -73, -32, 65, 51, 39, 15, 20, 13, 14, -57, -36, -19, 19, 60, -61, -55, -23, -82, 23, 103, 41, 20, -13, -34, -109, -135, -88, -19, -36, -38, -1, -104, -180, -170, -99, -107, -68, -100, -48, 48, -29, -107, -48, -7, 5, -62, -76, -41, -40, -16, -72, -41, 22, -20, -36, -34, -26, -36, -9, -10, -62, -26, -47, -150, -91, -113, -187, -121, -98, -46, -124, -44, 23, -20, -70, 10, 20, 60, 7, -7, 10, -10, -101, 5, 46, 38, -92, -75, -12, -28, -31, 45, -55, -108, -10, -56, -58, -63, -39, -15, 36, 85, -13, -2, -2, 26, 13, -12, -63, -220, -129, -91, -109, -131, -95, -49, -26, -16, 10, 49, -11, -44, -15, -18, -130, -120, -8, -3, -105, -105, -95, -104, -49, -27, -60, -94, -155, -147, -128, -95, -184, -63, -60, -47, 32, -9, -34, -30, -75, -25, 47, 56, 34, 51, -44, -78, -91, -57, -26, 5, 46, 58, 45, 44, 40, -67, -128, -42, -35, 1, -18, -36, -11, 30, -10, -58, -62, -17, -86, -39, -47, -108, -88, -95, -162, -136, -33, -1, -43, -78, -106, -29, -60, -58, -46, -54, -24, 34, 39, -31, -65, -62, -239, -171, -89, -83, -142, -156, -35, -59, -94, -86, -60, -38, -85, -51, -129, -58, -82, -89, -85, -67, -44, -12, -102, -123, -60, -69, 18, -53, -96, -102, -23, 67]
6389F7o8N4q9J8L4n1m6L1kJ8j17K0%j2J27N4r7l2L4Mk9P4l9RK4j4l9k9R1J1p0o2j0M7K7N5
6372gO2k0r7k9L7N4l0L4pn7n0Q6J22r6Qn9l8k8K8J8K2j04l4Q2P5m6j6K0mL4j5L2m5Lq1L5j1
6354a22R6N7L9n2j50J51J5n2NP7m6l1pq0L4j4O1K2K2j6kr6OJ5o4k2N9L0K5l7Q4J0q2K2J8M0
6337A5l1Q2r7q4R8P9l1Rr1J6L5ol8L6pl6N1l9M2p5K8N3m5k2l8p2kL4jJ02l3r3%MQ4M0M5J6
6319B8l8P5o5n9m0L7JM5P9m0n6K9NN2Q3p2p8j9lM5qM9j4p0nJM9Kq8n0m6P6PM0K9n3J1p4P1
6300f4j5M7p4m8J16m0q0L0N6l3qpQ2MRn5J3mpK5j0k6k5M8NJ8j0oJ23L1p3m7k2L2qn0lpo8O3
6281h8k6N6Oj01N8j6L6l1N9L6m4o1qJ8J7O5q8p6J24L9n9m6n2PQ1N6K5K2m3k0N4Pm1n7M1J20
6264G0p9M0k6q4J1L2Kj8j7N1m1J6jm1j2oP1K1n1k5J2m0L8L1Pn2j4K5K7L4L5L1l2Jo5o4L9J34
$$ y = [67, -1, 53, -36, -18, 16, -35, -81, -50, -52, -34, -151, -131, -131, -143, -16, 38, -59, -91, -57, -53, -82, -8, -47, -38, -14, -28, -67, -96, -5, 6, -64, -126, -136, -89, -62, -7, 55, 35, -62, -91, -54, 0, -30, 4, -3, -60, -110, -24, 98, 2, 10, -49, -87, -115, -87, -69, -47, -151, -185, -103, -28, -74, -90, -70, -74, -40, -55, -23, -68, -65, -146, -111, -122, -26, 31, 70, 18, -132, 19, 34, -18, -13, 64, 18, -13, -20, -100, -66, -80, -19, 3, 25, 9, 7, -89, -83, -68, -132, -154, -95, -65, -40, -77, 7, 17, -65, -43, -25, 15, -16, 66, -31, -115, -17, 62, 31, 40, -51, -35, 0, -6, -44, -8, -15, -51, 0, -39, 3, -72, -44, 9, -36, -58, -96, -168, -170, -136, -137, -35, -68, -161, -161, -157, -73, -33, 12, 28, -10, 65, 0, -59, -99, -62, -61, -16, 63, 23, -33, -4, 1, 53, 136, 64, -14, -33, -36, 9, 1, 50, 36, -34, -39, -38, 11, 13, -75, -125, -171, -95, -88, -48, -19, -72, -61, -135, -64, -79, -32, -106, -154, -38, -78, -158, -128, -72, -105, -113, -120, -38, -34, -25, -80, -67, -71, -78, -53, -63, -89, -114, -66, -61, -43, -53, -59, 64, 95, 22, -25, -47, -15, -23, -73, -76, -83, -151, -88, -114, -58, -52, -153, -95, -111, -75, -106, -47, -11, -55, -116, -124, -106, -89, -24, -112, -188, -64, -25, -84, -130, -182, -175, -94, -38, -13, 9, -34, -54, 0, 7, -34, -91, -50, 70, -9, 31, 5, -79, -68, -36, -34, -52, -69, -18, -59, -43, -44, -85, -97, -103, -32, -11, -62, -87, -75, -115, -77, -46, -39, -91, -105, -80, -53, -19, 16, 47, 15, 16, -49, -113, -74, 60]
6246F0j60j9O9P6L1j54L9RJ0M2l4J3j4q0K9N1pp2N0o3J8Q3J6j6n7L4J2p4J6M4m2N6M0M2k5
6229B3K5oj06k5R0n4nO9q1j8m7j5Q6L9pj8l3L3Ok1Qm2k3k9Q2O1J7n1j31K0K4J38nq2K3J0K1
6211b4l6K8n8m3K0N6O3j08Q8N6o6M8O1l2m7r9O8m5k4R5Q9j01o0K1M8p8k2RM1RM8p9p3J51o7
6195f3K4j7P1o7J9K5M5p3o8oM9L7l3p9M6k5QK8k4j9L0PP1Lj7L6jn8nJ2mL4P4m7r7mJ0J4K5
6176c9l4N5J7K4r6J04m7n2M1Mn4K4M5J06Rl2q6p2N2m6P1k8M7O3q7p5QJ10M8l8o0oJ9j03l7
6159a45Q4J60nm5p1o6j3K4j7P1r2p8R8J09rJN6J4j14L4m8kl1OL6M3PL0qn1r5K9q9O1N7N8O5
6142F4r8J8k2l9N8l8q0M1P6M0m8Oj7m9L0K1Ln8L1J04n4N4p8J2k3m2k4l9R7m9l3M2j7J10j36
6125a37l9J2J09OK3K0M1m0o6j3O2l1M6ln5Kk9J4P8n6M9n7l3J5kM5nn3L4R1k7j12j3L9M3j8
$$ y = [60, -100, -119, -50, 26, 57, -97, -58, -49, -39, 3, -31, -18, -32, -112, -83, -32, -39, -111, -61, -124, -106, -23, -7, -23, -80, -46, -34, -108, -92, -48, -90, -34, 6, 48, 23, 48, 42, -64, -89, 1, -53, -58, 11, -70, -88, -135, -150, -64, -25, -32, -50, -83, -50, -44, -65, -57, -99, -122, -151, -69, -8, 9, -42, -173, -153, -129, 9, 4, -78, -55, -45, -24, -60, -32, -90, -133, -113, -57, 6, -102, -14, 42, -24, 24, 85, 53, 6, -93, -25, -70, -94, 1, 90, -11, -71, -50, -2, -80, -102, -93, -52, -43, 5, -74, -147, 4, -63, -39, -56, 15, -52, -33, -8, 37, -36, -104, -110, -61, -24, -57, -136, -90, -115, -107, -79, -103, -122, -92, -85, -14, -11, -28, 8, 7, -51, -56, -44, -48, -14, 60, 13, -84, -88, -78, -64, -39, -73, -18, -1, 23, -73, 31, -16, -68, -27, -23, -77, -53, -8, 98, 107, 75, -11, -83, -31, -77, -6, -34, 13, 76, -11, -86, -78, 32, 80, 42, -18, -24, -5, -108, -145, -61, 99, 94, 49, -22, -88, -101, -77, -94, -23, -115, -193, -95, 14, 5, 6, 62, 76, -38, -4, -52, -54, -85, -79, -43, 0, 7, 37, 29, -22, -117, -88, -177, -116, -59, -1, 64, -34, -16, -38, -77, -19, -57, -137, -96, -20, 20, -28, -22, -39, -88, -58, -37, -34, -92, -61, 43, -11, 43, -35, -23, -46, -88, -112, -151, -54, -103, -136, -94, -111, -1, -137, -176, -164, -55, -49, -26, -6, 35, -5, -71, -84, -22, -53, -7, -10, -65, -63, -92, -78, 0, -56, -7, -64, -97, -82, -84, -39, -44, -97, -63, 28, 1, -111, -124, -85, -42, -60]
6108f0M3m3j2j0j6N8k5N4R2o5Mp0m9j1n0J8J11km2O0K8m0nn4J05j3m0k7j0o9P3j8KJ2P1k5
6091b5o2L8K4n2r9mlR4N1p4O5MJ8oJ10N6j36J0n7j0m6P2M1l3m1jK8j4k5L7m3L3k6kQ3n6K2
6073b9J9QO9j8j0rn8Q2n6r1m0K4M4l0Q1J7L4o5m4K0N0k9L4nLo4J23m9j33l8PJ0J46k1Q8m3
6056B7k7O2j18j8N7j7Jj9n4K1J2L5M5jK9Np0J1l8QN1j53M3P2L1kn3OL8m6N0L2j7J9L3nM2M
6038I6oo4o2j8j8k2n8L8P4p9J2J02l5r8M1J50m8m8o5J03ko1K5L4j4l6J2J54m2j79m2J41n9
6022g4m1K6N3K7m3l2l5L7m2K3L6L8o3L6m3M7J4jJ7pl4LMP7k8n5k2N4p8J6N2J6Pj02K2L6J1
6004d8pk0l9j6M7k1L8l0M9M1j9q5K0JKK7l6m7Q5O5L6n3r2J18m6j4L1k6O1o4J1J4O5n5P3k4
5987D2q1k8n1J0J56Ol2p6O2O9r9qpJk0Q6J3l2n4J1m7q5J11L9p8K9L5r0M9N3QL3m6p4N0l3R9
$$ y = [-60, -17, -60, -72, -82, -98, -40, -65, -11, 81, 16, 20, -50, -99, -110, -160, -142, -31, -33, -75, -15, 13, -27, -32, -86, 19, 6, -34, -61, -71, -140, -67, -85, -83, -71, 0, -25, -87, -49, -25, -77, -176, -180, -183, -89, -38, -112, -47, -43, -25, -31, 79, 135, -1, 9, -48, -58, -104, -32, 9, -24, -65, -66, -38, -52, -77, -40, -83, -50, -76, -78, 5, -51, -29, -10, -2, 67, 49, 39, 30, -28, 54, -2, -93, -133, -109, -65, -95, -14, 3, 37, -28, -72, -52, -2, -31, 3, -2, 1, -63, 60, 11, -122, -160, -153, -143, 3, -18, 70, 27, 0, 62, -56, -74, -17, -34, -33, -52, -106, -85, -73, -38, 7, 6, 35, 40, -30, -19, -57, -49, 2, -151, -108, -36, -5, -7, -60, -54, -16, -62, -12, 20, 3, 22, 55, 50, 92, 96, 90, 26, -36, -54, -72, -94, -152, -114, -40, -119, -107, -5, -40, -138, -97, 53, 5, -43, -108, -5, -7, -68, -43, -9, -23, -59, -47, 107, 65, -114, -156, -15, -74, -115, -89, -36, -9, -52, -84, -119, -82, -124, -101, -65, -27, -90, -54, -97, -50, -36, -37, -20, -27, -61, -58, -54, 23, -5, -60, -82, -28, -106, -90, -38, -22, -15, -117, -95, -59, -48, -55, -75, -114, -130, -83, -104, -66, -96, -47, -6, -25, -110, -90, -89, -87, -60, -96, -143, -58, 7, 43, -10, -102, 16, -30, -44, -13, -39, 22, -42, -31, -17, 48, -7, 66, 42, -39, -67, -118, -108, 48, 54, 22, -54, 8, 77, -22, -30, -37, -36, -56, 30, 43, 11, -43, -32, -79, -164, -53, -14, -92, -63, -28, -118, -69, -16, -8, 25, -21, -95, -45, -78, 21]
5970B1l9nm9P5q3j3Q2k0p2L3L5q2K2k9N3J22m4j10J0jLLQ6ko2J8k2nN5m3l0kl4K9l9k0M9L5
5952g5J1Pm1n4L7o6MJ16N3L1k9p5n0M9k7k1k9O9kk4M9j5Rk0k6L0M7m0j18J27M6qJ4M6Qm2j3
5934b2l9l2J05M4n5j13l6M3Q7m3j3k8k3q5O8N2l7Kj1K7N9m3j5J09K2p6o6J6K1o5MR6J9%j25
5917a53K8L3j21Q8NO9P0Rk7o5r8j1M6O2ll6j1N5Q0r3o4R1N5j9p5Q8n4L0J04ln0k3j7p4k0q8
5900a92N1J12J53p3o4Q0K9l9j17QL2j3K7N7m3m5l7P2m2M1l7l4l7L7J9j9J25J3j06N2Oo0j06
5884a50L5L5J5L8L5p5n6J45Ko6mnp4J10m4p0N0K2l2QL0J7l6o1l2J05N2J9n9m4o7P4L5j04n1
5868b03R9J9M2j0K5k9p8N6L0k5QK7K8J3%r0l4J01J5j8O8l9j01L2R9j5o2j4L2P2pRj09p8R0
5851d7J3pq7r2R1O6rr5N9L3O5J9k2J3Rl9l4j1L3j02J42kL0j10Qk5l0j3J4J3M1J2MQ7M6j2k8
$$ y = [21, -18, -23, -72, 3, -80, -93, -11, -31, -103, -70, -35, -117, -95, -124, -71, 51, 7, -103, -93, -94, -91, -88, -2, -4, -66, -48, -70, -75, -20, -63, -93, -95, -129, -100, -139, -159, -110, -75, -64, -57, -98, -152, -115, -181, -177, -61, -8, 23, -6, -81, -131, -82, -109, -130, -159, -90, -92, -116, -67, -82, -73, -93, -119, -89, -42, -82, -200, -73, -27, -35, -21, 25, 33, -9, -22, -61, -93, 12, 56, 1, -112, -148, -105, -18, -61, -74, -102, -125, -210, -142, -90, -127, -125, -136, -109, -50, -93, -108, 1, 23, -53, -119, -103, -82, -147, -143, -47, -28, -28, -153, -125, -92, -213, -125, -120, -51, 19, 28, 1, -64, -162, -173, -127, -65, -68, -104, -115, -60, 20, -73, -137, -46, 9, -10, -85, 3, -51, -21, 83, 80, 30, 7, -10, -84, -104, -192, -141, -29, 124, 51, -13, 67, 96, 57, -60, -52, -20, -33, -6, 51, 8, -37, -74, -2, -44, -3, -40, -74, -111, -74, -55, -74, 51, 64, -42, 10, 16, -44, -150, -115, -80, -65, -27, 8, -67, -123, 22, 24, -42, -46, -51, -125, -15, -59, -129, -79, -57, -89, -81, -51, -34, -70, -131, -163, -58, -6, 13, -46, -90, -157, -83, -48, -152, -203, -104, -85, -43, -53, -28, -57, -135, -79, -49, -74, -66, -39, -11, 2, 2, -88, -122, -21, -6, -24, 44, 5, -96, -64, 35, 20, -42, -56, -24, 48, 41, 50, -59, -137, -47, -34, -41, -128, -220, -129, -63, -72, -167, -108, -75, -10, 9, -13, 0, 9, -30, -64, -75, -42, -144, -2, -4, 26, -84, -76, -101, -131, -144, -130, -117, -76, -64, -60, 27, 73, 61, 33]
5833C3M5Pj37lJ1l8k0J6k2J15N4knr5o6L9N1J7Qj9qj21K7J00L3k9OJ12j78n6L0M7KJ2Q3m7
5816Bm8m0M3p7j0N9l6L3o8P5K6j9O9M4j35L2P6n0o6N7m4K7P6l6n2M1n7L9j0q7N9k4J0J17q5
5799e9j1K6o0JR2M8Nj35MJ45j28K1M2N3l5j2p7K3K1k1J9n%K4kJ5m3k8J9M3M5l0k3m5k8J8j1
5782h9qO4Ro9O0K5q4j4J1qO5N1r1n0Q2M6j2n7O4K5j17l0M1N4j4O7jj9r4j4M3QL8l9p1M0L2
5764e6Plj34rQ0QM9q1M4P1k6l5N3q8O0J28j32j4K7%oL8K0j16M1Q9J3l6N5J5n5L6j16JNnj0
5747h2K9J0o8M9Qj3Ok8N2q0K0P9k2q0O1O4l0k8j0ON6n5J7J3n6Q4n3L9m7K9O7o8oK4L0m7oj7
5728e3l5Q1p1n9jM2R1nJ3k9r7J05Q2njo6K2k3j26jK5P2L0k9k9j%l3k3P0J5M7k2k8K3n9J8J25
5710F5o7j2J9m4O0M0j03L6N4p3j9J34p1J1j22QK4K9%M3L8n1j9j3J5k0k8Pj36NM6N0J01J5n3
$$ y = [33, 78, 85, -52, -55, -44, -82, -102, -86, -108, 7, 61, 59, 54, -41, -107, -68, -17, 0, 8, -11, -19, -140, -113, -13, 20, -9, -3, 109, -69, -125, -95, -48, -46, -34, 49, 2, -46, -86, -43, -120, -130, -71, -107, -74, -142, -67, -41, -60, 9, 53, -82, -50, 26, -24, -90, -33, -77, -50, 26, -10, -62, -21, -78, -39, -49, -136, -77, -101, -91, 26, -59, -70, -44, -104, -103, -11, 37, 42, -93, -89, 56, -72, -51, -9, 44, 9, -3, -80, -57, -36, -57, -38, -43, -43, -19, -21, -6, -49, -77, -58, -15, 30, 0, -23, -68, -96, -78, -89, -97, -33, -24, -93, -33, -8, -92, -106, -95, -103, -38, 13, -78, -128, -46, 0, -12, -69, -5, 20, -97, -127, -86, -32, -46, 21, 20, 1, -93, -107, -64, -56, -18, -57, -128, -88, -56, -49, -52, -186, -195, -115, -107, -58, -139, -95, -24, -50, -85, -32, -120, -60, 68, -64, -78, -51, -51, -57, -19, 1, -115, -74, 15, 28, -8, 47, 62, 7, 43, -73, -72, -67, -72, -82, -53, -43, -111, -62, -54, -67, -61, -89, -37, -117, -97, -18, -40, -120, -59, 5, -25, -53, -63, -57, -1, -56, -39, -26, -82, 2, -51, -12, -59, -30, 37, -31, -37, -13, 17, -30, -36, -53, -88, -7, -78, -137, -138, -96, -5, -10, 3, -26, -123, -18, 64, 59, 58, -8, 14, -9, -135, -136, -111, -39, -9, -38, -67, -68, -68, -101, -124, -54, -39, 8, -14, -42, -19, -78, -60, 65, -2, -14, 5, -39, 21, 61, -42, -6, 48, -25, -44, 90, 19, 30, -92, -84, -60, -31, -31, 12, 50, -1, -20, -33, -18, -38, -66, -59, -195, -190, -144, -94, 7, 22, -31]
5694c1p8J9J1J05O9n5k9q7L9KL4J3Jo2m7Rn3O7K2Q1j5j15L1oq5N4J3L8MJ2K8L4q7M2M5k7J6
5676A2j6q9M0P1K5K4p4M5J44q7j02K1n7Q0l1n1m7L5K2K1R7l9l1j5o1N4Kk7K2r5k8K5Q4Q6m3
5659A7j13K7LNO6o5k4j4lo9P9k1K6Q2k3k2l2Ol5Q8N6j09n4N8%kOK3j5M1ml7%K8O7N0n3j26
5641i3L2L2N3k6M5l2o9M0k2m0L0k7l9k6R3Qj09J8nP2J6lQJ1j2J0K9N5j8r0J4NJ04q5j9k0N6
5623dJ5Ql0K2qpLq2j9J06O7o5k8K9nj8n2J1M9m2Q4j3m0%j1p8k5R1K0k1%n3P0M8m1q0P4qJ1
5605b2J8l2l8m9L2N2P0L3m0j8j4NO4M3oj11o5N3L6m3q0N7J3K0k6K7j7j1jj04L4N0j1O8M0Q
5588C5K4p8o3l1O4Kj2Q4L8o5k4ll0N9j4l7K6Qj14K0Q9l5k8L9r1J0J04n3m2Q6L3M1o7o8j5O9
5571c9Om6N1j0nj05Q0P0Mk3J8O3j39m0O4j5j12J30n1J0P8l1K2J7N6p7qk2qJ3O3oj1j5l8qj6
$$ y = [-31, -109, -90, -79, 26, 95, 40, 11, -76, -37, -35, -1, 12, 13, -49, -96, -87, -140, -73, -51, 30, 15, -100, -69, -75, -160, -106, -93, -55, -51, -39, -11, 23, -64, -22, 23, -4, 12, -4, -93, -53, 18, 43, 67, -7, 38, 182, 95, -7, 14, -43, 37, 6, -45, -92, -57, -35, -14, 83, 44, 13, -2, -63, -9, -7, -34, -12, -107, -135, -110, -26, 60, 17, -96, -69, -66, -61, 5, -60, -84, -98, -101, -170, -91, -112, -86, -4, -27, -49, -81, -75, -110, -22, 34, -75, -129, -71, -71, -73, -67, -44, -59, -18, -22, -59, -59, -31, 36, 86, 33, -93, -61, -29, 24, -2, 43, 11, -58, -18, -40, -80, -50, -77, -116, -142, -49, -41, -150, -132, -137, -65, -49, -52, -44, -33, -45, -35, -6, 49, 31, -59, -45, -40, 64, -21, -40, -60, -4, 11, 19, -11, 11, 3, -4, -1, -83, -102, 4, 71, 6, -22, 7, 2, -16, -68, -57, -8, -50, 34, 21, -19, -19, -30, -108, -133, -42, -22, -43, -43, -96, -26, 22, -19, -99, -25, -33, -22, -4, -36, -74, -123, -91, -39, 31, 64, 24, 6, -8, -3, 61, 104, 98, -13, -78, -25, 11, -32, -112, -55, -42, -22, -48, -21, -38, -49, -50, -154, -120, -70, -81, -13, 27, 35, 59, -19, -82, -113, -49, -47, -59, 25, 63, -2, -26, -29, -59, 0, -14, -51, -25, -17, -131, -111, -22, -57, -85, -46, -137, -127, -23, -76, -118, -32, 1, 42, -25, -93, -108, -39, -33, -79, -28, -38, -43, -148, -68, 2, 6, -17, 1, 64, -75, -115, -51, -66, -178, -48, -99, -89, -11, -42, -20, -3, 53, -24, -32, -54, -62, -49, 14, 8, -3, -18, -56, -64, -80]
5553h0L9K1Mqj66P7K7P1Qqm4M3j5j3J01j9n4k6np1J6L7l7J6m5O6J34L3j02q1K1qlK6L2r0k8
5535a31R5J09j15l0J24m7l2k9k5j0O7J6Mj17J0Q7n8J0o2n7Q7O3j7k8k0M2lj9JR2o9o8K0K2
5519h8Q8M9q6L1L6J9j5n7n2l3K0j8O7R5K0m3N9o2j8l6K0J2k7rj9l3m6N6P7J0Rn1l7O7r6Rl
5501h5N8Q4j44j6J05l6k9L5oll3o2O4J20n0M2j06OK0K8pm3RL3Jr8m1N4J36r8k0P2K6m7o6N4
5484d3L7k0k5o3k5kL8kN1k4J1Kj10o0J33nQ8nq7L7j6l5P9j01K8J00o5N6k7p0O7L1l1l9%pJ1
5467i3K2l9J8J00m5kJ3N9m0J3m1k9Q8R6r5r7m3k7J54o7j22R3N5N5j9r6OM6m1L0l9M2qj2P2
5450Gk6Q2jj9MK3o0k6j7l0j4N7K1L9o3o7ljl5J7J0n5K4MO6n0o1O4Kl6P2L1m3n3PJ14j1k1m
5431e2K1p4K0QK1JoL8l7J7m7N6N2o0o2J7o0K7J02P8l2m8J8j0j8j8J8K1L8m3NN6o5n5k6N1k
$$ y = [-80, -41, -20, -16, -24, -190, -113, -86, -15, -7, -15, -59, -16, -31, -44, 57, 38, -16, -42, -47, -118, -102, -65, -102, -86, -131, -65, 69, 102, 0, -81, -60, -68, -71, -45, -13, -103, -131, -36, 73, -42, -72, 52, 5, -27, -56, -81, -91, -24, -8, -4, -121, -111, -24, -82, -72, -134, -191, -104, -41, -58, -86, -106, -64, -67, -86, -85, 7, -62, -130, -110, -88, 0, 49, -37, -6, 30, 49, 34, -23, -75, -108, -88, -106, -39, 56, 76, 33, 92, 30, 12, -24, -4, 8, -19, -28, -47, -80, -126, -70, 7, 17, 26, -25, -62, 5, -91, -82, -85, -27, 57, -87, -103, 2, -34, -63, -28, -34, -37, -70, -132, -68, 52, 2, 44, -62, -56, -36, -8, -15, -58, -49, -16, -15, -113, -154, -100, 36, -62, -82, -10, 16, -31, -97, -43, -6, -26, -51, -114, -139, -141, -103, -105, -54, -78, -67, -65, -175, -235, -102, -107, -19, -24, -111, -74, -90, -125, -46, -147, -119, -19, -84, -28, -55, -125, -58, -27, -58, -97, -97, -104, -93, -71, -110, -92, 8, -37, -39, -26, 33, -7, 6, -35, -64, 24, 120, 25, -72, -115, -142, 12, -55, -177, -84, -29, 26, 7, -89, -83, -37, -78, -48, -87, -45, -53, -65, 7, -19, 63, 62, 43, 47, 70, 10, -16, -33, -63, -77, -20, 1, 40, -23, -90, -93, -94, -129, -112, -102, -157, -133, -129, -63, -113, -174, -110, -108, -144, -72, -41, -84, -137, -130, -16, -27, -48, -52, -31, -105, -85, -77, -56, -55, -61, -23, -60, -43, -90, -34, 18, -42, -104, -87, -147, -120, -18, 60, 28, -20, -2, -12, -30, -48, -30, -9, 29, -14, -9, 47, -18, -73, -99, -48, -50]
5414e0j3m9R4j2Q3n2j13J00O0k7o0l3k0M2L7J4N8pj0Pk5o4o3J0J60l3n6J1K7J2m9J7L0m1p7
5397i2l7M0K9Q9n3l2N4k3K7m5j1L5j5PmP6K0j06n1J47k9o8R6Mm7m2p8J7j0j9lQ5j5o7M0P3
5380hR4L0o9o8Qqj3q0K5Q0r7L3J2j6J01r0K4K9K0J8J4k3Mp5j0o8J6N5j9k8o7kJ10j5K1N6M4
5362C8J8q1q1M5L3N2m1O0j27J6ON4Lk2O6o4k7R1k7k8M2m3M8j8o7j9j3K8L4K0o5k9O2j3j39
5345a88N2J29k0m1k5P6LRN1m7Qp2L7J6Qj3K9R7r2j40l5J47K9k4n0L4p0n3J0M9O7l9p0MJ2M0
5328g2nM1N3l4O1Kq9m3M2r0QJ01LPm2o3l0L2oN7QP4l5o6L2O1L3L8q5k3l5M3j5o4J08j7K4l4
5310b0j3P1j4J3k4N9j5k4p4J8l9K9n9j2L6k8l3Q1Ln2M7K7J7M4pj3m1p2n8O7P4j4r5rR1l2O3
5293hn8k2J51n7p0M9k9l3J1N7J7m2j8k9J4K7p3O0J42r8qn7j0L0j5Lj02J9M8pqP4M4j5K0P5
$$ y = [-50, -63, -112, -18, -30, 53, 1, -112, -12, 48, 21, -39, -72, -92, -50, -13, 1, 59, 52, 42, 49, 24, -40, -103, -93, 67, 34, -22, -11, 16, 28, -21, -4, 26, -15, -92, -129, -89, -60, 29, -24, -56, -2, -25, 2, -43, -54, -19, -34, -27, -31, 45, 65, -41, -92, 55, 26, -42, 54, 58, 11, -31, -109, -92, -102, -121, -124, -39, -54, -121, -81, -8, 86, 116, 47, -21, -13, -21, -34, -114, -89, -9, -106, -73, -61, -77, 24, -66, -42, -13, 7, 25, 39, 16, 20, -55, -65, -133, -117, -62, -81, -109, -176, -178, -68, -83, -62, -6, 38, 56, -25, -106, -61, -28, 24, -17, 43, -84, -68, -62, -8, -5, -27, 39, -25, -52, 39, 12, -16, 26, -17, 31, 13, -54, -73, -86, -58, -24, -4, -69, -98, -36, -49, -188, -136, -7, -27, -68, -93, -17, -14, -5, 46, -1, 7, -65, -28, -12, -4, -17, 12, 109, 17, -123, -158, -11, 18, -6, -56, -22, -92, -145, -135, -86, -19, -58, -128, -124, -112, -72, -77, -36, 17, -17, 44, 46, -43, -86, -44, -134, -126, -25, -22, -15, -57, -120, -150, -118, -124, -67, -59, 15, -20, -86, -54, 7, 40, 78, -7, -30, -65, -22, -37, -101, 7, -10, 14, -20, -33, 38, 24, 37, 13, 72, 57, 33, -41, -23, -62, -33, -92, -104, -68, -96, -129, -48, -45, -97, -50, -23, -6, 38, 31, 18, -23, -95, -153, -86, -12, -26, -121, -130, -39, -71, -8, -66, -88, 63, 6, -64, -15, -44, -77, -66, -9, 8, -34, -52, -81, -67, -40, -113, -53, 89, -9, -17, -74, -84, -54, -69, -66, -168, -149, -101, -108, -116, -42, 2, -13, 7, 82]
5275H2r9l3k2n8j7J2J14r3O9J26r9j4J3n3R9M9j15J3O0m1M0n3Jk3k6LM4m9l1n6M9LJ0J39n
5259C9r3O0QN2m7j66O3J16j5j3Jj42K1j2M1l4rOm6J4O1l5J21lK6j3o7r1K7M7jN4P0k8k1l4
5242d3k3j3l7J0J5m9MN8K1O8l6K5P7m0%o8j8l2P7p5LQ2k5p0N5p5J1R3rj6k7K4JM1J0m4Jp6
5223a00J2n1l6J70M0m6NK9p1l7N3L5mK5n8K9O5n9m9m1K3J6O9j6j0J19l8q7j0p2m5OO4NN5l2
5206d2l7p6J8J54j1O0o1j6l2J1LL9nr7k4O0M0m0o0K3L5KN1j9k2J2Mk9m3j0m2j02O8J23M7N2
5189C4Om4n7oM0n5J2MMJ9q5m6M1Ml4K6M8%%N8P3m9j7l8l7R1j2p2o3%Q9Q3r2l3K3R3r4q2Q6
5170h2R7k9lm0o9N8M0N8nk3r6K6Q3K9j06m6O3rJ8l7kROn2J5Q3L4m1L8n9j21J5P9K6L4k4oJ6
5152b3Nn3n5NL1L0n7L7l8N1Q2o2PNJ5nj7o0O1L8Q0J1o6o0k2L6q0m5J07L6k0l6N9j7J40L7k12
$$ y = [82, -17, -50, -72, -130, -147, -135, -21, -114, -45, 81, -18, -32, -19, -72, 27, 76, -39, -26, 34, -7, 33, -20, -19, -42, -68, -65, -21, -70, -101, -157, -108, -105, -95, 44, 39, -54, 6, 14, 66, 19, -147, -84, 32, 17, 4, 5, -137, -116, -128, -87, -121, -130, -124, -170, -156, -95, -130, -9, -12, 14, 1, -66, -157, -130, -83, -84, -30, 40, 12, -9, -43, -66, -79, -116, -106, -91, -140, -136, -78, -57, 11, -25, 0, 77, 37, 37, -31, -49, -81, -4, -79, -76, 6, -19, -89, -34, -109, -98, -5, -14, -30, -57, -33, -32, 9, 19, -25, -24, -100, -88, -139, -175, -5, 35, -11, -6, 23, -48, -85, -32, 3, -1, 24, -34, -5, 60, 1, -48, -89, -66, -50, 19, 3, -7, 112, 74, -13, -23, -95, -140, -134, -70, -65, -10, -42, -79, -155, -137, 17, 6, 66, 5, -11, -43, -32, -29, 10, 5, -92, -116, -56, -16, -56, -116, -93, -58, -56, -5, -24, -46, -34, -30, -59, -102, -112, -154, -256, -188, -65, -18, 34, 40, -4, -61, -67, -27, -82, -70, -66, -62, -43, -128, -174, -133, -129, -163, -137, -89, -89, -89, -31, 42, -7, -24, -62, -99, -8, -20, -92, -155, -155, -66, 17, -75, -108, -85, 8, -86, -168, -82, 15, -14, -17, -57, -126, -68, -28, 30, 25, 2, -94, -68, 15, 44, -62, -108, -45, -54, -36, -73, -75, -66, -60, -112, -97, -14, 20, -21, 17, -42, -163, -148, -69, -43, -9, -33, -39, -23, -18, -71, -126, -121, -90, -60, -117, -80, -118, -67, 15, -47, -40, -35, -20, -25, -42, -102, -41, -3, 77, 88, 22, -38, -60, -24, -104, -149, -42, -6, -26, -62, -3, -20, 120, 157, -55]
5135e5j0k7l1M6j4j3J4j4mo4QJ14N9n9N8M3m2J0Rl0j1k5K5RRp5J5J7P3J1M%J4J6k8r5O1n3
5117c5k6M4p1L1L2OR8N1j37o9J6pk0jn4K4nr4J4L6Q1n4K4J13kn5JL0l9M7j0Lk8L2N3l6n2M8
5098a1j2q0k3L9k7L3P3Q7r9q1P5n9k3J0K9k5n7k7N1J32k4Jn0nM2M3kN3k8r9K6pk6JM4l0m7
5081a03n5J12j2j04L3Q3K4mN9%L8M0r9n6jQ2r3lKJ2K4K8Rm0j4K4n1p6J3O4K1P9j7l8j6K7m3
5063e1j3L0o2R2m5oq5%O7m8J8P9P8p2O4j03j0Mk8M8m1Ml4n7LO4j8J8M9P3K5kQ5k2j4j24r7
5046a31P2J07r9%kj0O3O2k3j36QM1L4L4Oj1o3l2k3P4Q7J3On3j8lj2K7M1r1J11m5m9L3m9m5
5028g6K4LjJ4%P0n7p9L1M1j6r8M8J09p5J7q5J5M8L0Q0q4nj8k1oO0M9nn6l2P1Pjj08jP6OM1
5010A6l8j19N5lo1N2N6L6l2K9P8j3n4M1Q3j2n0m9j13O6L0L6l3q2Rnq6J09J5o3nK6M5KK6p6
$$ y = [-55, -65, -92, -123, -77, -91, -104, -90, -104, -108, -172, -164, -50, 9, -50, 8, 51, 9, 19, 28, -2, -13, -38, -13, -4, 5, -70, -55, -38, 35, 46, 50, 50, 64, 80, 52, -43, 18, -35, -61, -17, -88, -57, -25, -19, 79, 130, -7, -76, -60, -67, -87, -88, -142, -118, -123, -217, -203, -167, -86, -140, -116, -3, -5, -60, -59, -29, -68, -21, -31, -28, -56, -24, 29, -7, -59, -11, -23, -103, -126, -87, -114, -81, -8, 79, -20, -101, -26, -85, -108, -98, -69, -94, -151, -178, -127, 5, -19, -18, -68, -73, -31, 12, 10, 63, 35, -64, -38, -45, -71, -70, -26, -56, -103, -158, -46, -58, -162, -129, -46, -22, -26, 33, 33, 71, 111, 12, -44, -45, 37, -56, -59, -57, -45, -21, 7, 16, -24, -38, -14, -65, -141, -128, -64, -43, 36, 19, -19, -35, -8, -51, -64, -34, -96, -4, -49, -55, -140, -140, -73, -121, -103, -24, 54, -18, 46, -57, -67, -63, -91, -43, -84, -80, -114, -171, -168, -104, -122, -104, -55, 18, 43, 41, 126, 104, 90, -34, -131, -59, 48, -51, -51, -53, -63, 0, 62, 39, -97, -89, -48, -14, 20, 26, 15, -48, -80, -103, -29, 58, 71, 77, 24, 6, 3, -9, 18, 59, -32, 79, 34, -15, 18, -31, -76, -52, -49, -50, -36, -36, 34, -23, -102, -71, -30, -46, -144, -96, 13, -62, -45, -130, -115, -67, -37, 43, -41, -46, -64, -85, -91, -31, 18, 13, -43, -75, -4, 3, 2, -106, -107, -31, -25, 16, -22, -141, -86, -89, -150, -98, -42, -6, -38, -9, 69, 56, 2, 43, 126, 114, 64, 15, -98, -32, -2, 34, 1, -81, -72, -77, -163, -54, -39, -102, -107, -81, -36, -34, -8, -84]
4993h4M3Mm1lN3p4Q2m5O3l1L3Kj10j9O9N2pj31Q5J2l2J9ll6k2J3K1Q5J1o4L4J6L0o6r0qP2
4975f7J7ql1Jm6O3O8j8Np1q0k3K1Q4j1Q0mn5j7O2N5n3J13J2q1p5lQ5m4k0O6M5Pn6j7K3J1K4
4957F2J7n8j4jNNo0mR2K8l8r3R0Jmnm7j6L0l3k6L9K2j66RP1LOL8L5M8M8l2p3n2Q6j0o3l2L8
4938e4J0L0p0OJ7R5j24r5O6J8l5LN6M8M7m0l4J5Q7k6q8j9J2N5m6nL1Jn3l4r3J3P3O8J07l9
4921Cko0o7O3%M9J5L6Rm6J4L0M7p8p7JJ2k2o0P7l8m6M6JkM5K4N2n6q2j2P1k5l7J2J38m3K2
4903A4n0o2o9N1J06o5pK3j7QP4k8Nn5J04n3m5ORRm5L4l3nO0Q2j9o6j7Rn3mL3O6n4O8j1j8j6
4884c1JQ0l6ML4p8k9O8n7j3m4J6n0P6l7M8L8KL5J9j20M9J27k8p6n7J8P5m5O5O0o7nj0r1K0
4867c9m8J4Q2qL0o6kj4L7q8k9L1M7jR5J3l4o2n4o0J18lL0j5J3M1M4mp3NK2p9N8J6n6M6n9k6
$$ y = [-84, -41, -37, -78, -81, -28, -102, -20, -65, -2, -33, 0, 2, -108, -127, -58, -6, -13, -144, -59, -47, -79, -60, -63, -99, -121, -108, -87, -2, 9, -55, -21, -5, 25, -41, -131, -139, -67, -50, -58, -89, -88, -134, -71, -3, -21, -16, -87, -167, -190, -169, -85, -96, -16, -20, -75, -92, -30, 25, -28, 85, 97, 16, -59, -62, 23, -21, -41, 25, 70, 77, 21, 4, 27, 38, 62, 79, 21, 7, 6, 11, 16, -44, -48, 44, 72, 34, -59, 31, 32, 28, 23, -24, -40, -10, -43, -69, -30, -8, -174, -165, -94, -91, -85, -47, -12, 36, 84, 52, -21, -73, 13, 3, -60, -92, -54, -44, -14, -84, -78, -61, 34, -90, -185, -119, -101, -136, -133, -77, -29, 18, -22, -56, -41, 46, 20, -68, -87, -75, -20, -66, -71, -40, -39, -92, -126, -219, -206, -133, -65, 42, 3, 1, -59, -126, -63, -63, -14, 1, 37, 46, 0, 14, 44, 91, 13, -64, -63, -51, -73, -133, -56, -94, -140, -94, -93, -95, -50, -26, 26, -30, -112, -124, -53, -78, -115, -103, 35, -8, 14, -36, -98, -167, -116, -10, -75, -82, -59, -76, -68, 6, -22, -17, -72, 32, -21, -66, -60, -51, -42, -87, -53, -86, -91, -31, 51, 32, -34, -51, -42, -95, -99, -66, 0, -54, 14, 3, -15, -31, -30, 50, 14, 18, 52, -26, -55, 13, -44, -57, -101, -85, -135, -59, -96, -48, -10, -8, 27, 46, -74, -25, 102, 74, -2, -59, -41, 34, -11, 54, 114, 47, 42, 32, -59, -39, -87, -73, 9, 1, 31, -35, -37, -51, -14, -102, -131, -100, -53, -54, 41, 54, 20, -42, -96, -156, -38, -41, -11, -26, -13, 28, 72, 68, -5, 0, 22, -57, 1, 17, -39, 7, -52, -78]
4849g8P9L8Pn0Q4m4p4J9J27n4j11K8J7J7J5M0k6n4M8l9K6L0n3m4K5o2j08J28M7K3m5k5K6P7
4832C4j1oj04k4N1K0M2p6r4p3N0O1J8M0P9J0m3k9J6r9K5J26l3L5JL9j0o9M5o6l3K0N8M0kl4
4815DJ6m8j5M3Q8k8l7Lm4o4N5P7J8o8n4PL9N1J2k6o4P1k0n0l9RK2K7l9kl3j0J06Km8K5M0m4
4797a8L6K5P4j1j40m2n8l1L5L4OO2o8MJ16J2m2L4n0n4N4j5rO4j1mp0l2K3J9J0P2m9K3K6o3
4780c8m4m4j2R9K3M4p8O0m5L2M2nL0l0k6n9J8R2j50O6M6ll4J9Q0o9rj9JP4q6r3J5K4Q9L5n0
4762ej1K5Oj2Lj4N4n9p3K4m1qK4k4N6L5j0k1kJ28L1m3q1o8k4L9nK1Q2K1k6o4p1N8N9N2q1m0
4744f5l9O1R4p8lK6P5n1K0k0k8M0RJ6q1m5J25Rj06J6L5M0M2Jl6J10m1j06p0O9L1k5j0Lk0p1
4727g3j0l5o7R4j9oN6K4K4m1m9KJ34j5j0j9m5lQ6m6Q9J5p8m3mOJ9j0L7P9p1l0K1J5mnj9Mk0
$$ y = [-78, 1, 39, 46, -4, 80, 36, -38, -19, 108, 54, -57, -29, -12, 5, 20, 60, 34, -20, 28, -11, 15, 45, -8, -52, -27, -89, -197, -69, -22, 1, -44, -69, -43, 34, 23, 17, -87, -111, -60, -40, 2, -74, -168, -241, -191, -130, -112, -72, 7, 17, -26, -55, -39, -138, -113, 13, -20, 15, 16, 55, 45, -24, 21, -45, -78, -58, 0, 40, 38, 4, 20, -28, -43, 0, 88, 60, 23, 26, -18, -82, -27, 50, 68, 0, -54, -47, -8, 43, 55, 29, -35, 36, 16, -34, -73, -64, -42, -15, -54, -56, -89, -99, 7, 9, -39, -14, 26, -18, 18, 43, 117, 106, -34, -76, -134, -165, -130, -96, -90, -28, -96, -92, 24, 36, -6, 28, -22, -76, -22, -37, -46, 18, 7, 3, -67, -99, -76, -57, -47, 25, -24, -1, 25, -38, -82, -126, -138, -39, -16, 28, -50, 10, -35, -3, 39, 34, 64, 34, 8, -51, -33, 59, -91, -25, 21, 18, -16, 3, 83, 14, 5, -14, -13, 61, -25, -118, -103, -79, 10, 45, -5, -16, 9, 15, 3, 6, -8, 46, -13, -86, -62, -103, -111, -87, -111, -55, -20, -30, -51, -53, 75, 106, 63, -18, -86, -110, -71, -76, -55, 27, 48, 22, -42, -113, -55, 4, 56, -25, -65, -104, -43, 51, -27, -30, -4, 71, 20, 40, 20, -8, 32, 41, 57, -24, -69, 56, 65, -41, -25, 10, 50, 92, 93, 57, 167, 126, 20, -50, 19, 50, 25, 15, 18, -2, -73, -83, -118, -185, -91, -110, -116, -60, -36, -12, -53, -102, -100, 34, 19, 9, -10, -55, -58, 28, -18, 71, 86, 8, -35, -39, -33, -14, -24, 13, 92, 21, -9, 12, 27, 23, 18, -1, 3, -17]
4708a7J5M8q2m6N6j3k4O3o7J9M1j9O1j3m0J00J3j04j22J10L4K1M9l3k0l4l7N9J9q9Q2o4OM2
4692A4kJj12N4K0orL0n8mP0M2k6n7J3LL1jrQ5q9K4l6L1O4j1j19n5J5L4O7l4kJ25k0q3Oql2
4674d4MR7k7j52o7j1L0O5M3J12l9LNN5q7k1m9j4J06MJ6rq7p3jO9K3J3N1k0k1O7j14o6J43P6
4656H0o0m5qNOo1k9R6n7O0NQn9k1O4n9M2N5l7Rm7l9K2O4k5M1N0l7L5m4LJ9j9l6l3J37O3j60
4638a2k3n4J27n6j7L3mK0r8MO8o3lMlj47J78R1m1QP8m4m6l4j4pO0N1j29k1jN8M1Po6l7M4N8
4620A0n6l2O0J08l7q3L4L0o9j8J4P8k0j48L2R9ll7l%l5M2L7mJ6j15O0L7n0o4Q2K3k5p1j2J73
4603E3n1p6l7l5J53k5k9n3J41k7mj23RK6m8K7jL9N8n0K3OM0n2QP8k4K0q6o4j8J14o5lM1K8
4586gn2j7j3j1J1l8M0O1J8L0R1l8j32l0J08m4n1J5kK6L1N0n9j1jo4m2l3R8oJ4O0l9M9k0m0
$$ y = [-17, -2, 46, -36, -82, -26, -39, -63, 0, -67, -48, -7, -26, 35, 22, -18, 82, 95, -9, -131, -21, 13, 34, 83, 50, 30, -4, -41, 18, 37, -52, 30, -34, -28, 14, 12, 13, -99, -45, -25, -31, -40, -10, -68, -72, -2, 40, 14, -43, -30, -27, 4, 3, -6, 79, -10, 14, -22, 9, 73, 62, -57, -112, -97, -63, 4, -30, -32, 93, 73, -10, -4, -12, -44, -40, 57, 30, -122, -189, -200, -170, -105, -62, 50, 11, 14, 19, 74, -13, -34, -83, -97, 9, 13, 29, 20, -67, -140, -141, -72, -49, -36, 15, -5, -26, 41, -73, -139, 4, 80, 20, -25, -33, -28, -22, -83, -112, -16, -73, -13, -8, 0, -59, -80, -16, -75, -33, 22, -15, -6, -53, -92, -70, -6, -31, 10, 60, 23, 58, 14, 17, 36, 17, -19, -52, 85, 148, -12, -35, -89, 38, -18, -35, -2, -6, 14, -84, -80, -12, -75, -78, -74, -77, -224, -46, 45, 4, 12, 90, 46, 0, -34, -48, -55, 5, 56, -73, -94, -95, -37, 4, 11, -55, -92, -48, 10, -46, -78, -18, 90, 53, -30, 4, 34, -35, -53, -39, 39, 19, -129, -97, 2, -1, -38, -41, -41, -76, -34, 3, -1, 15, -100, -40, -3, -53, -117, -35, -12, -37, -108, -120, 53, 2, -74, -111, -146, 7, -18, -47, -100, 41, 14, 10, -113, -104, -78, -126, -99, -100, -61, -3, -53, -30, -24, 16, -36, -28, 50, 26, 46, -40, -104, -122, -8, -73, -76, -35, -7, -59, -76, -89, -100, -89, -127, -87, -26, -8, 22, 113, 75, -57, -87, 21, -23, -74, -59, -61, -35, -4, 46, -13, -24, -25, -89, -131, -164, -66, -72, -58, 2, -37, 12, -8, -48]
4569d8OJ8m7QK8N5j8mN7q1o1N5L5%QO%p9J1j8J2L4J01o4m9K7o4oP0K3rl8Jl8j7K2Q8o2l0K7
4550d1L3m7M1N3j2k4M1O5q8o9N1n7j6O3J7Rj6Mn3j9P4k4k5nK1RkNOQK6l2k3p0P2o8J3M0m4
4531h4k4l9Q7L9R2O4Ok7l0j44k9M9K0qO5n0N3k8l5l7K7Jk2M1J15j21m9L0jJ2j56N5N9Q2n7
4514d4k9N8k0N0l0p9L5O6r2k0O0L3m0m9lR7L8jo0L5j0J4n2K8m7n8K3L2R5l9o2l0k1J8K0M2
4497d2l6L2J3k9Q5L8m6ORj5l0N8q2m3P1Oj5K8m0k8j6J00k4m4Q4q3p6P2Q2k0m3r3nJ5R8K3l5
4480b5OM4k6m4M5N7l3r6N9P0qRmJ5j81k2M0R5km7M5K1j4M0q7N0m0q5N1N7K1o1L0J3L3O9r8
4462co5J39Nk7J%j7L4j25k6Q3N4l5l7k6o9L5J07j0m2m6L5M9m9j3k4Po6N2O9k0l7O9o0J5LL1
4444ik6N3J3p3o8J5QQ0j8l3P3p2L4J9n2j7L6mM1n5J5J7L3m4m5%K7J2J3k3K8J6l6j9L5p7M6
$$ y = [-48, -42, -24, -71, -63, -35, 20, 2, -2, 55, -26, -87, -32, 3, 3, 11, 17, 17, -62, -51, -69, -57, -23, 78, 14, -35, -8, -72, -78, -8, 15, 6, -32, -31, -69, -86, -64, 24, -38, -68, -41, -8, -55, -14, 39, 27, 3, 44, 109, 21, -48, 3, -54, -70, -7, 10, 19, 3, 7, -46, -65, 9, -15, -40, -45, -24, -15, -17, -12, -6, 2, 28, -4, -27, -97, -25, -93, -80, -40, -84, -108, -147, -60, -21, 71, 135, 141, 114, 84, -60, -89, -40, -20, -28, 37, -13, 40, 12, -23, -60, -33, -32, -54, -13, 102, -19, -68, -38, -39, -27, -183, -128, -69, 13, -44, -73, -15, -35, 15, -15, -94, -59, 7, -85, -105, -45, -12, -52, -101, -104, -7, 31, 30, -30, 5, -5, 9, -43, -15, -62, -120, -97, -65, 30, -9, -71, -101, -122, -104, -84, -42, -78, -46, -33, -62, 23, 61, 15, 21, 30, 15, -15, 43, -39, -82, -11, -5, -20, 8, -32, -60, -76, 24, 0, -44, 40, -43, -119, -47, 35, 15, -28, -121, -126, -111, -13, 10, -25, -19, 25, -1, -45, 0, 57, 24, -72, -13, 57, 49, 58, 54, 69, -112, -134, -94, 1, -1, -48, -3, 18, 4, 44, -43, 7, -33, -118, -67, -10, 11, -50, -20, -7, 26, 95, -3, -68, 71, 76, 49, 50, 50, 33, 67, -58, -84, -1, 53, 18, -19, -45, -114, -79, 28, 18, -24, -70, -35, 14, -35, -48, -72, -65, -131, -79, -10, -30, -67, 2, -58, -43, -40, -9, -35, 18, 31, -42, -110, -95, -87, -7, -25, -58, 15, -57, -23, -4, -56, -73, -37, -41, 0, -55, -40, -23, 10, -34, -79, -79, -52, -40, -27, -50, -22, -6, -42, -61, -26, -103, -57]
4427e7L2p9M2q5N4J4J7m8N8M1RL8p0kM7jm1j14J6M4K0J6j7O3n6n8O0pR0O0j00l0M1r7Kj9L9
4409g8J8Qq3M3J00K0j13j9qJ2k1J48O1r5ol7j5J7o7JJ43j08Q5N5L9j09OJ3MmKM1j8n5p1K7
4392f4K4K3m5jM0N2k3pl6p1K6J22L9q6j3Lk6pM7L9r2J6R7k1mM6r2l5J4m1n9M3N9N5k7K8o1
4374c8J9L5m5L4l6j9K9Mk0j0J21K9j80O5J4k6J60r2m7k5L9K2j19QL1no0J0J2QJ12N7m0m5l7
4357c5lmL9k2n8n2jJ02k6%M6N5kk4j2mM4l7j09M3l2O4M9j04l1K6M8k7O7j9n3K9%J42J7j43
4340b7q5QJ20l9J6N4j15m7J17M7k7L4M8k2q9M5p4l2M6j21k6J02OM8M0L8L7q9j13N7K1j04O4
4325f2N1M4k6K1j6K4j41k3O9J3L3l5k0n9J04Nl4QJ38l4j23MQ9J2j63p1J08k4K8J51n2n8O4
4309B5n3q3N0n5N3M7m9M2n4K7N8n8L0KnL9q5K6k0R1nnp1J4O2j1n7K4L0q9O0l4QJ1j7O9Lp0
$$ y = [-57, -25, -104, -62, -147, -93, -79, -62, -110, -52, -11, -2, 36, -34, -36, 11, 10, -31, -145, -129, -85, -65, -49, -66, -3, -59, -117, -57, -64, 26, 86, -14, -44, -3, -100, -98, -117, -78, -60, -52, -135, -92, 8, 28, -85, -104, -112, -100, -121, 27, 88, -7, -13, -50, -65, -48, -115, -114, 29, -79, 6, 61, 100, -9, -3, 10, 14, 10, 12, 53, 35, -20, -91, -64, -40, -17, -62, -63, -23, 29, 6, -1, -37, -108, -82, 40, 79, -7, -20, -17, -43, -50, -3, 36, -56, -40, 57, 36, 32, 78, -14, -49, -35, -76, -135, -92, -33, 22, -5, 23, -38, -19, 16, -29, 5, -31, -50, -21, -17, -37, -47, 74, 103, -77, -12, 2, -24, 136, 44, -3, -28, 11, 33, -86, -78, -47, -52, -112, -102, -90, -82, 30, 87, 47, 2, -35, -38, -42, -3, -25, -83, -135, -136, -34, -60, -60, -14, 41, 39, 15, 3, -1, 43, 6, -103, -60, -92, -28, 21, -83, -114, -88, -40, -67, 0, -19, -72, -43, -43, 99, 116, -27, -112, -104, 16, -23, -7, 47, -68, -115, 2, 49, 22, 56, 104, 82, -7, 38, -36, -68, -22, -143, -169, -67, -61, -13, 27, 65, 102, 13, -100, -43, -22, -126, -62, -11, 33, 7, 28, 12, 36, -105, -128, -59, -46, -13, -48, -68, -127, -23, -18, -52, -44, 94, 60, -63, -59, 30, 42, -121, -192, -84, -108, -80, 71, 19, -39, 25, -28, -111, -61, -116, -63, -16, -65, -23, -77, -50, 8, -50, -20, -18, -23, 16, -69, -43, -63, 28, 23, 18, -53, -39, 23, 12, -45, -21, 9, -80, -20, -54, -46, -35, -52, 17, 20, -50]
4291e0o9J54L2r9L2o4On2pN6o6O9n2RR2k2lr4J04l0l5K0O8loJ6Nj9n4K5o9lk3kJ2j2R7O0j1
4272A2J5Qp3q4Q7OoL5J5P8n2p0k8L8Q9q1k5%o4j7Q1l5JK1q0O4L7k0L5pQ8l1k2j0JJ3j7K4L6
4254F2m7l4m4MJ6j41M2O4l0l8kK6j0j8J36k5q1j5j0K5P4L8M2m3q2O1Q0J05q9p1K1K1p5q1Q7
4237c2J02qn8Oj4J7n8L8L8j7J0n8N7j6m2k0rO7o1p1P6R3l4o6Lk8Rm8M3M5N4p4j7k6kR7m2o
4219e2J6M6M6oj9L2l5j9L8q7K3l1m8J4P6Q7Rj3m8o9kML5P3KJ0n1j1r4r3J2N9l8M9oP6J4j0
4201a1l1J0K0k2p0L6O1j11m1P0J5L2pK0n6M2J4kL5j0J2j39p9Q8J7N1M2m1L6N5m2k7m4M7p5
4184a05r7O4P8J5P6%m9k8j5K8K3kj4P3q2J4j8Ll9NJ4M2mj6J1K7J7m6k4K1M8Lk3m5qjK5l6j9
4165h4N2J5O3n5r0j7L2j8R5k5m6k1K7J28p9k9Q2m8K1j3p0QOML2j4m6m6R9j7j6J9R0k0o1J1
$$ y = [-50, -119, 35, 67, -32, 0, -64, -58, -110, -117, -61, -127, -58, -110, -101, -9, -31, -34, -128, -24, -54, -89, -69, -1, -4, -10, 6, 11, -8, -62, -37, -106, -109, -132, -134, -122, -134, -37, 23, 12, 27, 35, -38, -122, -35, -29, -35, 0, 15, 93, 41, -29, -57, -19, 70, -11, -36, -36, -100, -117, -36, -71, -70, -49, -129, -65, -28, -48, -13, -20, 68, 37, 15, 5, 6, 19, 2, 26, 62, 15, -19, -63, -59, -43, -184, -142, -78, -108, -146, -148, -122, -132, -150, -14, -39, -120, -135, -145, -120, -46, -8, 34, -9, -91, -30, 50, 155, 66, -5, 16, 37, -38, -119, -32, 70, 62, 4, 10, -4, 13, -45, -7, 31, 14, 24, -34, 23, 7, -35, -55, -64, 3, -58, -129, -53, 40, 6, -60, -57, -85, -76, -124, -81, -36, 18, -56, -73, -99, -101, -4, -46, -52, -36, 10, 56, 50, 31, 63, 28, 9, 47, -40, -17, -48, -96, -82, -6, 81, 90, 77, 29, -40, -42, -38, -3, 70, 72, 82, 31, 20, -74, -167, -155, -96, -134, -85, -91, -15, -1, -11, -42, -32, -12, -34, -104, -68, -7, -118, -159, -89, -74, -42, -49, -29, -85, -43, -29, -31, 4, -6, 6, -133, -212, -124, -107, -56, -14, -55, -19, 36, -6, -33, -77, -30, -105, -202, -138, -60, -45, 31, 31, -18, -46, -61, -33, -10, -12, -26, 47, -35, -21, -39, -36, -75, -70, -56, -14, -18, -34, -23, 4, 21, -25, -49, -28, 20, 23, 0, -45, -53, -54, -29, -65, -84, -32, -17, 46, -9, -99, -116, -84, -102, -7, -32, -78, -99, -72, 56, -23, -52, 30, -18, 3, -10, -80, -72, -66, -62, -30, -44, -90, -136, -37, -54, -70, -51, 39, 19, -42, -31]
4148c1L5L3k9p1p2O1J1M6Rk6L0J16o7k4n9j9J08l0j11M1J18K6J6n2l1K1O8m4Ol0j26n0J21
4132fL1m9k2Qj9m8M2K0K3PqJ7K1qN9m2o6l9M6qN1l8N7m1Kj0j6O0M1q1J7m5QM4N8K3k5K1k7
4114E8n9J3L5l0l3n4M1l2n1n7P7O4L2Pp1K1M1K3l4n2k7L1J2P4Qj01J4K5J1P6k0k1k3l2k6K5
4097c5L5o2o1O4L4n6m0J16qK%lJ1r6L4rn4JQ2j5nO4KO4mK7j04o5R6m9l1Oj3N9p2lk2j2PL8
4078g7Q5J1m9O%K3N5o3ko9l8N0n2O9m0L0J14On7n4J3n2R6J7q1o0J13j7M2J4mj12J20j03LL
4060f0j1KM6j7j46Q8K3Mm2N1K2q8M7k8J0L9mL2p4o5N1M8Q9Jl0k4q8J05M1j9r1R8k2m9n5P9
4043c7L7nn7j9M2k5N1J7J9J5k7J2j1Qk5j2%o0O0L8j8MJ7Mj20QJ6j1J06n9j7Lj8O9M7lO8o5
4025E2r2Pk8J08K1j27jJ2NKK0K3K6L6n3m8O5j09q6J03J87L3J03Q6j31j28j27r8K4L0L4M3K7
$$ y = [-31, 4, 37, 8, -63, -135, -74, -63, -17, -8, -34, -4, 112, 45, 21, -38, -57, 51, 21, -90, -49, 69, 95, 111, 59, 28, 49, 117, 73, 79, 49, -77, -127, -6, 25, -24, -46, -38, -57, -105, -63, -43, -20, -13, -21, -4, 17, 9, 68, 26, -40, -79, -33, -41, 10, -28, 29, -12, -10, -20, -36, 24, 65, -16, 1, -44, -36, 8, 66, 89, 64, 85, 58, -1, 12, 47, 17, -16, -70, -29, -61, -112, -169, -92, -28, 4, 11, -60, -39, 2, 25, -9, -61, -88, -57, -45, 29, 37, -64, -50, -25, -14, 62, 42, 21, -2, -34, -60, -35, 0, -62, -123, -59, -25, -81, -121, -5, -13, -11, -11, -14, -3, -99, -65, -74, -128, -127, -45, -60, -65, -1, 1, 65, 61, 88, -16, -81, 15, -34, -65, -59, -72, -13, -85, -88, -110, -122, -115, -77, 8, 19, -30, -24, -24, -1, 54, -9, -11, -80, -118, -68, -120, -51, -91, -61, 53, 59, 2, -52, -39, -91, 5, 22, -59, -119, -6, -23, 19, 33, 29, -83, 37, -66, -63, -60, -71, -69, -23, -40, -186, -98, -75, -71, -113, -62, -40, -128, -81, -109, -99, -60, -64, -32, -106, -171, -120, -72, 17, 18, -12, -36, -124, -19, 22, 3, -88, 10, -12, -61, -116, -37, 0, -5, -62, -81, -39, -64, -13, 4, 23, 38, 11, 23, 12, 20, -5, -17, -17, -77, -17, 21, 3, 7, 24, 28, -92, -84, -68, -79, 27, -32, -49, -46, -64, 5, 52, 49, 117, 52, -40, -33, -61, 47, 68, -59, -60, -48, -43, -41, -21, 2, 28, 64, 11, -37, 28, -81, -167, -64, 123, 156, 259, 345, 214, 86, -41, -139, -115, -85, -51, -8, 19]
4009A9j06l5J03l2J4q4Q4L4m2n5L5J5OJq1k5J23N3k7m0P3OKK3k6o9m2O8n8L9k1pl1n0l7M6
3992a24L0K8K4K2j07P4n0n6O0q0O5L4J18p8J8L9o1K1K6n7j6lK6O3r2k8RK9J2L4O1K5r1p3K
3976i6k1O6K9p0O5l9J1l1L4N2n0n0Ml2J3J41l1m0o0L8K6k6L3L5Mj15NJ08k8lK7l0o0N1J7n7
3958h0m1N1k0J23j2n7J5J6k2rJ46k5%L2r9o6p2N6M4l4K3j08M3M1k2K7j8K1L0L6o6o8O4k7j3
3942i1P1O4l0oJ2l4Jr0N4j2Mj7J3j17L4P9L3Nk3k5k1O2Ok2%P8k7j0o0l4J9pn5Q4N7l5R4n1
3924CK9o9k9j4RPQ8j33JJ9k6J4R2Ln6M3L5p2lP7j34jM1K3j24P9M0O2nq1p3K8L1J09k3r5j3
3906a18L8lpR1n0k5L5J12k8l7K0N8m4l7rp4j5M8l0Q2M6k9n5J6l5k8m5O8L5n5n4J66o5j44O3
3889a09P2J3q9O0N2l7q2q8J04KO3L3o9%P4O6K8n1l5m2p0N0O3M9J8N3q6p7L8nNj7n8o9K4M3
$$ y = [19, -87, -122, -19, -51, -37, -121, -37, -3, -45, -100, -65, -50, -44, -43, -124, -149, -26, 27, 0, -40, 33, 39, 41, 64, 38, -31, -73, -5, -63, -24, -45, -52, -83, -133, -170, -124, -94, -66, -42, -20, -127, -53, -103, -159, -99, -179, -114, -80, 38, -40, -22, 17, -44, -23, 3, -54, -70, -73, -47, 16, -76, -104, -95, -66, -54, -20, 41, 66, -25, -98, -96, -117, -51, -22, -92, -27, -66, -55, -86, -52, 0, -50, -100, -96, -128, -115, 26, -5, -45, -105, -67, -41, -67, -34, 1, 5, -110, -105, 3, -25, -28, -1, -31, -91, -40, -23, -80, -121, -70, -90, 33, 21, -36, -21, -5, -27, -36, 110, 85, 85, 117, 18, -48, -120, -64, -20, -54, -31, -139, -96, -55, -77, -50, -68, -47, -17, 19, -47, -115, -51, -78, -91, -20, 44, 14, 8, 20, -14, -13, -103, -49, -61, -57, -74, -61, -178, -144, -65, -32, -27, -50, -75, -96, -34, -28, -50, -50, 28, 1, -9, -69, -103, -84, -91, -146, -62, -5, -40, 54, 3, 32, -37, -66, -80, -71, -64, 24, -109, -108, -89, -115, -101, -9, -6, -62, -19, 16, -56, -59, 18, -116, -117, -76, -53, -177, -98, -58, 4, -1, -82, -155, -127, -96, 13, -10, -105, -118, -80, -83, -90, 1, -49, -74, -39, 73, 45, 8, 28, 86, 42, 5, -4, -78, -93, -45, -75, 7, 53, 24, -31, -15, -50, -78, -123, -55, -20, -75, -129, 37, -28, -172, -109, -37, -24, -113, -53, -1, -38, -120, -208, -104, -102, -39, -6, -75, -75, -1, 65, 93, 42, 7, -35, -105, -55, 8, 57, 75, 128, 42, -35, 3, -2, 3, -14, -72, -141, -117, -74]
3872g4P1K5J7K7o8L7K0j2L1K5j13r4P3J05q1n2M9P5n4r8N6R6J9l8q9K5Q4j13l3N5qK1o2k9
3856a07M2K6J05q4l6Q9j13k8P9K6o3Q8l9L6m5K4l2Qk2M5L1j07MO2l3k8MM2J9L2J9M5m0m6N0
3839E3l7p5QO1m8J0p8J1KN9n5J8J7J4RoM0K8l2k6n4P4lJ2p4M1J0lM2Q3j18JK3j0ln2N2P3q2
3821a5K1o4n0O6M2k1J7q9L6Q0J1k0k9m4M7P6k8n6Or2J5N1QP2j9l4N5qrj11l6J4N2J0J5L9k7
3803a9k3Nn5L0P0mN1l6j2rj7J62Q4p4m0m7KK7m1L4k4J8p3M5J27n4n2l3NN5o7r1K8K0M1j8k3
3785hk2oJ0o0M7R1j15RN2M5N0p0K5P6j18j4N0l4L7o2L3L4J2p2l9lN5j2m1MJ0k3n3J7P4n0K9
3768d2RQ5J3n2K3l7Ml1O8nm2mMJ16o0p0l4K5j3R2N2j20K4J2L2o2MQ4j8l8j1k3nn1J48n2nJ
3750B1j1K3n5PJ28L6q7k3P4m0q7m8J23k0j4R6LPOJ43O0J44J10NN5Q2J52J93K49K58K88L60
$$ y = [-74, -3, 22, 39, 66, -2, 35, 55, 43, 74, 99, -14, -108, -35, 70, -11, -63, -14, 61, 7, -91, -35, 61, 80, 42, -47, -22, 62, -51, -84, -29, -37, -16, -78, -107, -65, -39, 66, -18, -54, 35, -78, -106, -27, -1, -64, 24, -15, 21, -24, 0, -32, -24, -46, -1, 30, -77, -73, -11, -44, -72, -68, -26, -7, 25, 44, 89, 49, 3, 53, 16, -59, -51, 10, -38, -28, -106, -95, -93, -34, -89, -71, -54, -40, -31, -37, 3, 31, -1, -27, -81, -7, -10, 2, -72, -31, -21, -24, 18, 101, -17, -16, 7, -3, -6, -58, -6, 67, -15, 6, -58, -108, -42, 0, -21, -4, -93, -57, 23, 34, 14, -15, -59, -12, 64, 36, -20, -14, -106, -91, -40, -32, 40, 21, -13, 42, 34, 25, -86, -122, -108, -56, -46, -31, 8, -19, -42, -37, -92, -62, 8, 4, 55, 19, 7, -2, -19, 143, 227, 153, 113, 66, 68, 95, 54, 88, 64, 82, 9, 54, 181, 127, 75, 42, 47, 102, 35, -56, -28, -8, 33, 15, -8, -30, -36, -26, -86, -39, 52, -63, -54, -2, 43, 93, 23, 48, 124, 6, -8, 42, 8, 45, -17, 16, 50, 62, -10, -49, -52, 3, -9, -50, -46, -36, -59, -112, -95, -21, -71, -42, -33, 52, 65, 13, 36, -1, 3, -28, 40, 35, -7, -11, -7, 109, 49, -21, -55, -30, -43, 49, 101, -19, 5, 17, 49, -13, -9, 75, 57, 19, 8, -15, -20, -71, 77, 25, 20, 21, 10, 33, -22, -15, 113, 149, 62, 39, 113, 73, -14, -62, 61, 41, 27, 123, 126, 133, 139, 282, 342, 486, 596, 601, 656, 738, 890, 1083, 1332, 1590, 1878, 2238]
3734B238J96k63o08n08k98k08j22o0KM6qJ6k6n6l4n4p6L1k7j21m1K4j2m9J31k2K0K9p5K6k4
3719F7m0J0K4J7m1n3K1l3n4M7m3P0J4NK8o5M6P6j8Kk9n6l7l5J0R4l9oJ2N7M5n8p6L3M6O0R4
3702A95l1m8M1N3j22j35l6n1J23QL4j0pJ0K1Nn6J04n2K6P5j5J19N7j55r5N0lj22m2N1J5k3
3686a6l7P2qP1n6j60J5N1%m1R6OK2n4Jk1J36J11J6j31j12J6k2k9JJ5J7jL2k2JL3j4j13NQ2
3669c8L4K9O1j1m5o4j1M0%k1R4K3m7k4NkJ4M4q5M2K7Ml7l0n7%Q1L2m9o9m0N3P0N4r3k6mN7
$$ y = [2238, 2434, 2171, 1563, 1055, 757, 549, 427, 367, 369, 415, 407, 423, 397, 341, 307, 253, 177, 208, 181, 60, 19, 43, 31, -18, 113, 91, 111, 140, 65, 91, 67, 27, 37, 61, 78, 37, -16, 5, -28, -82, -35, -78, -8, 6, 11, 39, -26, 20, 96, 78, 80, 51, -5, -42, -77, -67, 27, -12, -18, -6, 51, 96, 38, -38, -5, 41, 101, 195, 164, 116, 157, 210, 88, -47, -83, -134, -11, -3, 31, 21, 14, 24, 45, 50, -6, 98, 46, 72, 147, 132, 251, 308, 153, 58, 108, 105, -17, -59, -8, 7, -16, -53, 19, 11, 82, 26, -134, -119, -68, -68, -109, -13, -7, 15, -39, -38, -59, 77, 188, 204, 73, -39, -23, -45, -74, -73, -58, -41, -42, -10, -32, -31, 2, -12, -125, -120, -38, -4, 25, 86, 75, 30, -34, -45, -5, -5, -26, 68, 91, 44, 20, 25, 23, 37, 81, -4, 38, 65, 69, 32, 2, -55, -55, 26, 58, 9, -60, -100, -47, 23, 77, -16, -42, -46, 11]
$$ [...]
-1793a00
##END=		$$ NMR SPECTRUM
##END=		$$ LINK
