##TITLE=	13C
##JCAMP-DX=	6.0	$$ MestReNova 14.3.3-33362
##DATA TYPE=	LINK
##BLOCKS=	1    
##ORIGIN=	Mestrelab Research S.L.
##OWNER=	hrzepa
##$MNOVA/METADATA=	(DOCUMENT,BASE64)
eyJuYW1lIjoiL1VzZXJzL2hyemVwYS9MaWJyYXJ5L01vYmlsZSBEb2N1bWVudHMvY29tfmFwcGxlfkN
sb3VkRG9jcy9CYXRoL0ZBSVIgTk1SIFN1Ym1pc3Npb24vQ29tcG91bmQgOC9QX1AvMTNDLm1ub3ZhIi
wicGFnZXMiOlt7Iml0ZW1zIjpbIjEiICAgICBdfV19
##TITLE=	13C
##JCAMP-DX=	6.0	$$ MestReNova 14.3.3-33362
##DATA TYPE=	NMR SPECTRUM
##DATA CLASS=	XYDATA
##BLOCK_ID=	1
##ORIGIN=	Varian
##OWNER=	hrzepa
##NUMDIM=	1
##$MNOVA/METADATA=	(ITEM,BASE64)
eyJhbmdsZSI6MCwiYXhlcyI6eyJ4Ijp7Im1heCI6MjM0LjI2NDY1NzgxNzc5Nzc0LCJtaW4iOi0xNC4
yNjE1NDgyMzExMTU2NjF9LCJ5Ijp7Im1heCI6MTc2LjA5NTUzOTA5MzAxNzU4LCJtaW4iOi0xNy4zMj
Q3NzA4MDgyMTk5MX19LCJwb2ludHMiOlt7IngiOjUzMjEsInkiOjU4MzV9LHsieCI6ODcyMiwieSI6N
TgzNX0seyJ4Ijo4NzIyLCJ5Ijo4MjA4fSx7IngiOjUzMjEsInkiOjgyMDh9LHsieCI6NTMyMSwieSI6
NTgzNX1dLCJ6IjowfQ==
##.OBSERVE FREQUENCY=	125.75317950000000167
##.OBSERVE NUCLEUS=	^13C
##.SOLVENT NAME=	cdcl3
##.PULSE SEQUENCE=	s2pul
##LONGDATE=	2019/06/06 19:04:08.000
##.ACQUISITIONMODE=	SIMULTANEOUS
##$ORIGINAL FORMAT=	Varian
##$MNOVA/SCALES_VERSION=	9
##$PARAMETER FILE=	(datafile, ASCII, /private/var/folders/bp/m_4195y96sx1d256lqvkcvym0000gq/T/79ew83UTTTumA2kobxtB4w/13C/fid, 0)
$$ 
##$PARAMETER FILE=	(header, BASE64, /private/var/folders/bp/m_4195y96sx1d256lqvkcvym0000gq/T/79ew83UTTTumA2kobxtB4w/13C/fid, 0)
AAAAAQAAAAEAAQAAAAAABAAEAAAABAAcAAAAyQAAAAE=
##$PARAMETER FILE=	(log, ASCII, /private/var/folders/bp/m_4195y96sx1d256lqvkcvym0000gq/T/79ew83UTTTumA2kobxtB4w/13C/log, 0)
$$ Thu Jun  6 19:04:10 2019: Experiment started
$$ Thu Jun  6 19:06:32 2019: BS 1 completed
$$ Thu Jun  6 19:08:43 2019: BS 2 completed
$$ Thu Jun  6 19:10:54 2019: BS 3 completed
$$ Thu Jun  6 19:13:05 2019: BS 4 completed
$$ Thu Jun  6 19:15:16 2019: BS 5 completed
$$ Thu Jun  6 19:17:27 2019: BS 6 completed
$$ Thu Jun  6 19:19:38 2019: BS 7 completed
$$ Thu Jun  6 19:21:50 2019: BS 8 completed
$$ Thu Jun  6 19:24:01 2019: BS 9 completed
$$ Thu Jun  6 19:26:12 2019: BS 10 completed
$$ Thu Jun  6 19:28:23 2019: BS 11 completed
$$ Thu Jun  6 19:30:34 2019: BS 12 completed
$$ Thu Jun  6 19:32:45 2019: BS 13 completed
$$ Thu Jun  6 19:34:56 2019: BS 14 completed
$$ Thu Jun  6 19:37:07 2019: BS 15 completed
$$ Thu Jun  6 19:39:18 2019: BS 16 completed
$$ Thu Jun  6 19:41:29 2019: BS 17 completed
$$ Thu Jun  6 19:43:41 2019: BS 18 completed
$$ Thu Jun  6 19:45:52 2019: BS 19 completed
$$ Thu Jun  6 19:48:03 2019: BS 20 completed
$$ Thu Jun  6 19:50:14 2019: BS 21 completed
$$ Thu Jun  6 19:52:25 2019: BS 22 completed
$$ Thu Jun  6 19:54:36 2019: BS 23 completed
$$ Thu Jun  6 19:56:47 2019: BS 24 completed
$$ Thu Jun  6 19:58:58 2019: BS 25 completed
$$ Thu Jun  6 20:01:09 2019: BS 26 completed
$$ Thu Jun  6 20:03:21 2019: BS 27 completed
$$ Thu Jun  6 20:05:32 2019: BS 28 completed
$$ Thu Jun  6 20:07:43 2019: BS 29 completed
$$ Thu Jun  6 20:09:54 2019: BS 30 completed
$$ [...]
$$ wqinit 2 2 8 0 0 4 1 0 1 64
$$ 1 ""
$$ 0 
$$ wshim 4 2 4 0 0 2 1 1 1 64
$$ 1 "n"
$$ 15 "e" "f" "g" "n" "s" "0" "1" "2" "3" "4" "5" "6" "7" "8" "9" 
$$ wtfile1 2 2 15 0 0 3 2 1 1 64
$$ 1 ""
$$ 0 
$$ wtfile 2 2 15 0 0 3 1 1 1 64
$$ 1 ""
$$ 0 
$$ wtune 4 2 4 0 0 2 1 0 1 64
$$ 1 "st12"
$$ 11 "s" "t" "e" "i" "n" "o" "v" "1" "2" "3" "4" 
$$ xy 7 1 19 19 19 2 1 8192 1 64
$$ 1 681 
$$ 0 
$$ x3 7 1 19 19 19 2 1 8192 1 64
$$ 1 7587 
$$ 0 
$$ x2y2 7 1 19 19 19 2 1 8192 1 64
$$ 1 -284 
$$ 0 
$$ x4 7 1 19 19 19 2 1 8192 1 64
$$ 1 0 
$$ 0 
$$ xz2 7 1 19 19 19 2 1 8192 1 64
$$ 1 -1561 
$$ 0 
$$ xz 7 1 19 19 19 2 1 8192 1 64
$$ 1 6948 
$$ 0 
$$ y1 7 1 19 19 19 2 1 8192 1 64
$$ 1 797 
$$ 0 
$$ z3x 7 1 19 19 19 2 1 8192 1 64
$$ 1 476 
$$ 0 
$$ z2 7 1 19 19 19 2 1 8192 1 64
$$ 1 -1620 
$$ 0 
$$ yz2 7 1 19 19 19 2 1 8192 1 64
$$ 1 -2835 
$$ 0 
$$ yz 7 1 19 19 19 2 1 8192 1 64
$$ 1 -2906 
$$ 0 
$$ y4 7 1 19 19 19 2 1 8192 1 64
$$ 1 0 
$$ 0 
$$ z1 7 1 19 19 19 2 1 8192 1 64
$$ 1 -17115 
$$ 0 
$$ z0_ 1 1 19 19 19 2 1 73744 1 64
$$ 1 3374 
$$ 0 
$$ z1c 7 1 19 19 19 2 1 8192 1 64
$$ 1 -1044 
$$ 0 
$$ z2xy 7 1 19 19 19 2 1 8192 1 64
$$ 1 5183 
$$ 0 
$$ z2x2y2 7 1 19 19 19 2 1 8192 1 64
$$ 1 -2701 
$$ 0 
$$ z2c 7 1 19 19 19 2 1 8192 1 64
$$ 1 196 
$$ 0 
$$ z2x3 7 1 19 19 19 2 1 8192 1 64
$$ 1 0 
$$ 0 
$$ z3 7 1 19 19 19 2 1 8192 1 64
$$ 1 4630 
$$ 0 
$$ z2y3 7 1 19 19 19 2 1 8192 1 64
$$ 1 0 
$$ 0 
$$ z3c 7 1 19 19 19 2 1 8192 1 64
$$ 1 0 
$$ 0 
$$ z4y 7 1 19 19 19 2 1 8192 1 64
$$ 1 4212 
$$ 0 
$$ z4c 7 1 19 19 19 2 1 8192 1 64
$$ 1 0 
$$ 0 
$$ z3xy 7 1 19 19 19 2 1 8192 1 64
$$ 1 0 
$$ 0 
$$ z3x3 7 1 19 19 19 2 1 8192 1 64
$$ 1 0 
$$ 0 
$$ z3x2y2 7 1 19 19 19 2 1 8192 1 64
$$ 1 0 
$$ 0 
$$ z3y3 7 1 19 19 19 2 1 8192 1 64
$$ 1 0 
$$ 0 
$$ z3y 7 1 19 19 19 2 1 8192 1 64
$$ 1 1029 
$$ 0 
$$ z4 7 1 19 19 19 2 1 8192 1 64
$$ 1 1433 
$$ 0 
$$ z4x2y2 7 1 19 19 19 2 1 8192 1 64
$$ 1 0 
$$ 0 
$$ z4x 7 1 19 19 19 2 1 8192 1 64
$$ 1 -13017 
$$ 0 
$$ z4xy 7 1 19 19 19 2 1 8192 1 64
$$ 1 0 
$$ 0 
$$ z8 7 1 19 19 19 2 1 8192 1 64
$$ 1 0 
$$ 0 
$$ z6 7 1 19 19 19 2 1 8192 1 64
$$ 1 -5568 
$$ 0 
$$ z5x 7 1 19 19 19 2 1 8192 1 64
$$ 1 0 
$$ 0 
$$ z5 7 1 19 19 19 2 1 8192 1 64
$$ 1 -8525 
$$ 0 
$$ z5y 7 1 19 19 19 2 1 8192 1 64
$$ 1 0 
$$ 0 
$$ z7 7 1 19 19 19 2 1 8192 1 64
$$ 1 339 
$$ 0 
$$ zx2y2 7 1 19 19 19 2 1 8192 1 64
$$ 1 698 
$$ 0 
$$ zoom 7 1 32767 0 0 4 1 0 1 64
$$ 1 0 
$$ 0 
$$ zxy 7 1 19 19 19 2 1 8192 1 64
$$ 1 -1576 
$$ 0 
$$ zx3 7 1 19 19 19 2 1 8192 1 64
$$ 1 4844 
$$ 0 
$$ zy3 7 1 19 19 19 2 1 8192 1 64
$$ 1 -2037 
$$ 0 
$$ 
##$PARAMETER FILE=	(text, ASCII, /private/var/folders/bp/m_4195y96sx1d256lqvkcvym0000gq/T/79ew83UTTTumA2kobxtB4w/13C/text, 0)
$$ 
$$ 
##XUNITS=	HZ
##YUNITS=	ARBITRARY UNITS
##FIRSTX=	29456.285383729999012
##LASTX=	-1793.2377791117969537
##DELTAX=	-0.476837158203125
##XFACTOR=	1
##YFACTOR=	0.0048840525938527619421
##FIRSTY=	-0.33095937967300415039
##MINY=	-1.2448170185089111328
##MAXY=	160.0357513427734375
##NPOINTS=	65536
##XYDATA=	(X++(Y..Y))
$$ [...]
15560d0NOm4N3K9o7k1k1K1K2qqM6n0K8K7qrjr8O3O4O0l7p4Q8m2m2J6J6l6l6J37M1o5L2l5l4
$$ -40 -35 -29 -73 -20 9 -58 -79 -100 -79 -57 -65 -73 -27 -77 -49 -22 -30 -39 -40 -138 -75 -11 49 12 -62 26 -16 -58 -42 -26 -62 -98 39 80 15 47 12 -22
15542b2P8j8m5m5J6J7J6J6m7m6O6O7j7j6j1j0q0J8P6k0p6Q5M3n4rj0p0K7O6O5j9j16K8K7k1
$$ -22 56 38 -7 -52 -36 -19 -3 13 -34 -80 -14 53 36 20 9 -1 -81 -63 13 -7 -83 2 45 -9 -18 -28 -98 -71 -5 60 41 -75 -47 -20 -41
15525d1k1l3O3J0RK6K5p7J9OPJ3J2j1j0nmm2N4%JjjR0p2k1k1m3N4L1o5j1j1K3p4J16J9l2l3
$$ -41 -62 -95 -32 -22 -13 13 38 -39 -20 -14 -7 6 18 7 -3 -8 -12 -54 0 0 1 0 -1 89 17 -4 -25 -68 -14 17 -48 -59 -70 -47 -121 -5 14 -18 -51
15507e1L6L6J3q3p2R0P0O9j20k3P0P0p0o9J3J2J2J3K0K1k8k8ppo1L5J3J2m3N5J3q4j3j4k8
$$ -51 -15 21 34 -49 -121 -31 39 108 -12 -35 35 105 35 -34 -21 -9 3 16 36 57 29 1 -6 -13 -74 -39 -26 -14 -57 -2 11 -73 -86 -100 -128
15490a28J33l8l8O9O8Mr2L6o1o7L0K6K6k3P4m2m2M4M5qqqql1l1N0M9j0j1nmj6Q1l2l2O4r7
$$ -128 5 -33 -71 -2 66 70 -22 14 -47 -114 -84 -58 -32 -55 19 -23 -65 -21 24 16 8 0 -8 -39 -70 -20 29 19 8 3 -1 -17 64 32 0 64 -33
15473c3opJ4J4m1N6M4M4K4p3J2J1r8jqqkkj4j3OJ03L8o0rqO3r7ppJ5J4J05n6MLm8m9oR0o6
$$ -33 -39 -46 -32 -18 -59 -3 41 85 109 36 48 59 -39 -40 -48 -56 -58 -60 -74 -87 -81 22 60 0 -9 -17 46 -51 -58 -65 -50 -36 69 13 17 20 -28 -77 -83 7 -59
15453e9L0K2K2K9K8j8j9j9j9j0rj00O1l4l4P9j7Q1Q0l8l8l0l0P8j8q4J2j0j1P6q6m9M7L8L8
$$ -59 -29 -7 15 44 72 54 35 16 -3 -13 -22 -122 -61 -95 -129 -50 -67 14 94 56 18 -12 -42 36 18 -66 -54 -64 -75 1 -85 -134 -87 -49 -11
15436a1J2q5Q4j3L6L6m7m7KKJ3J4QQO9k8m7m8l5O2QQJ0J0J0J0j7j7P9q1o1L7K0K0KKn2M4l3
$$ -11 1 -84 0 -13 23 59 12 -35 -33 -31 -18 -4 4 12 81 53 6 -42 -77 -15 -7 1 11 21 31 41 24 7 86 5 -56 -19 1 21 23 25 -27 17 -16
15418a6l3Q2j6o0L6N3j09p1R1K0p6K4K4L1o7l7N9R6jK4p2%%L6L6m3N4PPr6JP0k7j11j5K01
$$ -16 -49 33 17 -43 -7 46 -63 -134 -43 -23 -99 -75 -51 -20 -87 -124 -65 31 30 54 -18 -18 -18 18 54 11 65 72 79 -17 -16 54 27 -84 -99 102
15401A02M0p3p3J5J6K2p5j2j1PQ%%n4n4N3m3N8N9J6J6qrj5j6k2P4l1l2K3K3K5K4k3k4M4M4
$$ 102 142 69 -4 11 27 49 -26 -38 -49 -42 -34 -34 -34 -88 -142 -89 -132 -74 -15 1 17 9 0 -15 -31 -53 21 -10 -42 -19 4 29 53 30 6 50 94
15383I4j4j11jjJ7J8l2l1l8N9M5M6LLKJq0p9rrP2P2J1J1l8l8J1J0p0p1P6P6J42j8JJk7k7N1
$$ 94 80 -31 -32 -33 -16 2 -30 -61 -99 -40 5 51 54 57 59 60 -20 -99 -108 -117 -45 27 38 49 11 -27 -16 -6 -76 -147 -71 5 147 129 130 131 104 77 128
15364A28J48L3J94N24J008N44q44r59m10j65kj34l6j%m2m2k4k4R9KL0o6JKJ10n1o0n9J03P
$$ 128 276 309 503 1027 2035 2579 1735 776 366 201 199 65 29 28 28 -14 -56 -80 -104 -5 -3 27 -39 -38 -36 74 23 -37 -96 7 14
15350A4k1P5K5j37K6K6J5J6l4l5J8J15L2o5n8L8m8m9J3J2OJ02k6k7n5M1NNK4p2J2J2k6P1K3
$$ 14 -7 68 93 -44 -18 8 23 39 5 -30 -12 103 135 70 12 50 2 -47 -34 -22 -16 86 60 33 -22 19 24 29 53 -19 -7 5 -21 50 73
15333G3p4K1K1J5J5qpqqL9L9J8p8o2L4kkk1k2K7K6no%Jo9K7K8K8j25k8kR6J06n5LLp4Q8lm
$$ 73 -1 20 41 56 71 63 56 48 40 79 118 136 58 -4 30 28 26 5 -17 10 36 31 25 25 26 -43 -16 12 40 -85 -113 -115 -19 87 32 35 38 -36 52 49 45
15313D5m2m3K8K8M3j19N3N3m2m2OON0N0K3p3l9m0J0Ro6L1K4K5J2J2l6l7K5K4O1l6o5L2kR4
$$ 45 3 -40 -12 16 59 -60 -7 46 4 -38 -32 -26 24 74 97 24 -15 -55 -45 -36 -102 -71 -47 -22 -10 2 -34 -71 -46 -22 39 3 -62 -30 -32 62
15296F2l8l9l2l3L6L6j2j3k5k5k5k6P5P5l9l8l4l4J5J5P1P2rrj8j8OPl7l6J2J1j5j5M5M5j00
$$ 62 24 -15 -47 -80 -44 -8 -20 -33 -58 -83 -108 -134 -59 16 -23 -61 -95 -129 -114 -99 -28 44 35 26 8 -10 -4 3 -34 -70 -58 -47 -62 -77 -32 13 -87
15278h7R4j5j6j0j1j0j1J9K0J9J9jjK3K3l5l5J3J3k0k1K8K8mmk9k8K3K4jjJ8J8pol5l6o3J30
$$ -87 7 -8 -24 -34 -45 -55 -66 -47 -27 -8 11 10 9 32 55 20 -15 -2 11 -9 -30 -2 26 22 18 -11 -39 -16 8 7 6 24 42 35 29 -6 -42 -105 25
15260B5n0n0J19p4M4M3m9m9K2K1k7k7M0M0m1m0mmM4M5l7l7J03r1l1O7N5m2l7l7NOL8L9m2m2
$$ 25 -25 -75 44 -30 14 57 8 -41 -19 2 -25 -52 -12 28 -13 -53 -57 -61 -17 28 -9 -46 57 -34 -65 2 57 15 -22 -59 -54 -48 -10 29 -13 -55
15243e5M5M5l6l6k4k4K4K4K3K2jkjjk5k5O4O3j30l4q4J2P7P7K7K7p5K1jjj3j2j6Q1k7k8Kr6
$$ -55 -10 35 -1 -37 -61 -85 -61 -37 -14 8 7 5 4 3 -22 -47 17 80 -50 -84 -168 -156 -79 -2 25 52 -23 -2 -3 -4 -17 -29 -45 36 9 -19 -17 -113
15225a13L3L4L4o3M5n1L0L0k5k5K1K2K1K1J6J6L2o4j26L5K0J9N8N8k3k3l4l3J5J6k1k2L4L3
$$ -113 -80 -46 -12 -75 -30 -81 -51 -21 -46 -71 -50 -28 -7 14 30 46 78 14 -112 -77 -57 -38 20 78 55 32 -2 -35 -20 -4 -25 -47 -13 20
15208B0o6L0K4K4k5k4J15m7l9l8O4O4n5n5o1L5l5l5Q3Q4n4n3L3L3k9O7l6l5J1J1j3j3L8L7
$$ 20 -46 -16 8 32 7 -17 98 51 12 -26 38 102 47 -8 -69 -34 -69 -104 -21 63 9 -44 -11 22 -7 60 24 -11 0 11 -2 -15 23 60
15192F0m3m3k1k0Q2j4JJmnMMn6M1M7n0p0R1j15M7K7p0j5Q2J12m9k1k0l1l1RJ0O4l3k6k7N8
$$ 60 17 -26 -47 -67 15 1 2 3 -1 -6 -2 2 -54 -13 34 -16 -86 5 -110 -63 -36 -106 -121 -39 73 24 3 -17 -48 -79 -70 -60 4 -29 -55 -82 -24
15175b4N8j57NJ14J7n7n8N0N0j1j0J4J4J0Rqj03l2J30J4J5q7J1L6L6%jj%k2k2k8O9K2K3n3
$$ -24 34 -123 -118 -4 13 -44 -102 -52 -2 -13 -23 -9 5 15 24 16 -87 -119 11 25 40 -47 -36 0 36 36 35 34 34 12 -10 -38 31 53 76 23
15157B3n2m4m4J01J01l0l0k3j21P4P4M9N0r1Oj6Q1j11j5J8J8l3l3RRN1m6K7K7Rq9J5J4m4m5
$$ 23 -29 -73 -117 -16 85 55 25 2 -119 -45 29 78 128 37 43 27 108 -3 -18 0 18 -15 -48 -39 -30 21 -25 2 29 38 -51 -36 -22 -66 -111
15141a11MML1L2L1L1k9k9k9k9P8P7r4r4rQ7O9k8o9K7J6J5J7J7k6k5j2Q6j2j1l9N7j5j4j9P9
$$ -111 -107 -103 -72 -40 -9 22 -7 -36 -65 -94 -16 61 -33 -127 -136 -49 20 -8 -77 -50 -34 -19 -2 15 -11 -36 -48 38 26 15 -24 33 18 4 -15 64
15124F4L4j28N0M9qrn6n5jJ61m2m2k5k6o7L0j%P7P8k6P2k7k8k1k1j0j1L9L8RJ0O2j00j02N9
$$ 64 98 -30 20 69 61 52 -4 -59 -60 101 59 17 -8 -34 -101 -71 -72 -72 5 83 57 129 102 74 53 32 22 11 50 88 97 107 169 69 -33 26
15106B6n8L8R8o4L3L3m9m9J23l9q0q1J15J9j0Q8k2k1O1O2L1J29J17J18J76K73M48Q67R83J11
$$ 26 -32 6 104 40 73 106 57 8 131 92 12 -69 46 65 55 143 121 100 161 223 254 383 500 618 794 1067 1515 2382 3365 3476
15092C476r28r28n40l79j84j83j15j8n2n2n6J05k5k5RR%Jr7Jo8K9Q3j4nmr0Pk3k2Q6j1l0l0
$$ 3476 2548 1620 1080 701 517 334 219 201 149 97 41 146 121 96 105 114 114 115 18 19 -49 -20 63 49 44 40 -50 -43 -66 -88 -2 -13 -43 -73
15076g3P9q3K6K7qrM2M2K6j36l3O4P7j9p6p6N7N7k8j24J47p8o8R3J2J2P1P1m3m2nonoPOJ%
$$ -73 6 -77 -51 -24 -32 -41 1 43 69 -67 -100 -36 41 22 -54 -130 -73 -16 -44 -168 -21 -99 -167 -74 -62 -50 21 92 49 7 2 -4 -9 -15 -8 -2 -1 -1
15058aM9m7m8M9K0K1l8N9N6j06o4L4mmL2o5N8N8o7o7N1m6KR9n0n0QJ05qj05lkP0k7k7O9JJ
$$ -1 48 1 -47 2 22 43 5 64 120 14 -50 -16 -20 -24 8 -57 1 59 -8 -75 -24 -70 -68 31 -19 -69 -61 44 36 -69 -72 -74 -4 -31 -58 11 12 13
15040A3L1L2m6m6KLLMLMk2k2KKN4N3jjmj02KKM8M8L2j29o6L1k7k7rQ9j5j4%Jj2Q6M2n5N4N5
$$ 13 44 76 30 -16 -14 -11 -8 -4 -1 3 -19 -41 -39 -37 17 70 69 68 64 -38 -36 -34 14 62 94 -35 -101 -70 -97 -124 -133 -44 -59 -73 -73 -72 -84 2 44 -11 43 98
15020I8m2m2r6JL5L5o7K9J02Nl7N9k3k3k3k3L9n8LLl0O6j2j2j7j7k2P4mmn2n3Q3j5O4O5l6
$$ 98 56 14 -82 -81 -46 -11 -78 -49 53 58 21 80 57 34 11 -12 27 -31 -28 -25 -55 11 -1 -13 -30 -47 -69 5 1 -3 -55 -108 -25 -40 24 89 53
15002E3l5l5O2k4P2k4k4j1j1J3J3m4m4L7L7l3l2pR0%%o0L6P4j20m1m1J40n4k5k6ooP5P4l7
$$ 53 18 -17 45 21 93 69 45 34 23 36 49 5 -39 -2 35 2 -30 -37 53 53 53 -7 29 103 -17 -58 -99 41 -13 -38 -64 -70 -76 -1 73 36
14985C6l8l8l8LKk1k2M0L9rrJKJJj4j4O7O6k5k6p4p5O5O5r2J02m7m6P8P9n5n4ooJ%k7J66j1
$$ 36 -2 -40 -78 -75 -73 -94 -116 -76 -37 -46 -55 -54 -52 -51 -50 -64 -78 -11 55 30 4 -70 -145 -80 -15 -107 -5 -52 -98 -20 59 4 -50 -56 -62 -61 -61 -88 78 67
14966F7j1k3k3l9m0M1M1k6k6K2K3J9J9o2o1PPj6j7N8N7k2k3J2J2l7l6J6J6J6J6j5j5j5j5J2
$$ 67 56 33 10 -29 -69 -28 13 -13 -39 -17 6 25 44 -18 -79 -72 -65 -81 -98 -40 17 -5 -28 -16 -4 -41 -77 -61 -45 -29 -13 -28 -43 -58 -73 -61
14949f1J2J2J2n3n3K7K7K4K4K4K4J0J0l8l8J9J8nok5k6L6L5q3J10m7m7J3J3L7L7L1L0n0n0
$$ -61 -49 -37 -25 -78 -131 -104 -77 -53 -29 -5 19 29 39 1 -37 -18 0 -5 -11 -36 -62 -26 9 -74 36 -11 -58 -45 -32 5 42 73 103 53 3
14932Cl5l6J3J3M3M3l7l8MLMLl9l9L5L6P4k2p0K6K7K6j6j6l4l4J4J5rqP8P8j18k0L1L2J10
$$ 3 -32 -68 -55 -42 1 44 7 -31 -27 -24 -20 -17 -56 -95 -60 -24 50 28 -42 -16 11 37 21 5 -29 -63 -49 -34 -43 -51 27 105 -13 -33 -2 30 140
14914A40J3j73N4K7K7l9m0k6k6P7k0q2q3N1N0Q0j7nnn4M2M3n5M8M8K6j36o8K9J03n7LLJ3J10
$$ 140 153 -20 34 61 88 49 9 -17 -43 34 14 -68 -151 -100 -50 30 13 8 3 -51 -9 34 -21 27 75 101 -35 -103 -74 29 -28 -25 -22 -9 101
14897A01j7j14n4n3L4L5L4L5l5l4N4m3r2O9J47p9ook1k0j2j2J23K7o0n9K1K2r7%poN2N3j21
$$ 101 84 -30 -84 -137 -103 -68 -34 1 -34 -68 -14 -57 -149 -80 67 -12 -18 -24 -45 -65 -77 -89 34 61 1 -58 -37 -15 -112 -112 -119 -125 -73 -20 -141
14881a41k5J23K6k7k7m0m1J26L0k9l0M6M5K0K0q3J4j5j6M0n8P9j8j8j8j3j2j8P8J7J6n6M1
$$ -141 -166 -43 -17 -44 -71 -111 -152 -26 4 -25 -55 -9 36 56 76 -7 7 -8 -24 16 -42 37 19 1 -17 -30 -42 -60 18 35 51 -5 36
14865C6m6m6m6N1l5l4J4J4R1oJ%K5K5l0k9M4n3L1L2o7K9R0p2rqJ5J6n7J05l4j31r1P1N3m4
$$ 36 -10 -56 -102 -51 -86 -120 -106 -92 -1 -7 -6 -6 19 44 14 -15 29 -24 7 39 -28 1 91 19 10 2 17 33 -24 81 47 -84 -175 -104 -51 -95
14848i5M8M8o1L6l6l6J8J9J4J3j6Q0J4J3k3k3o3L3l9l9l8N9NNO0O1m6m7l7O0m9M8l2l2J6J7
$$ -95 -47 1 -60 -24 -60 -96 -78 -59 -45 -32 -48 32 46 59 36 13 -50 -17 -56 -95 -133 -74 -69 -64 -4 57 11 -36 -73 -13 -62 -14 -46 -78 -62 -45
14831d5J9p8Q0j8RQk2k2ppj3j3N4m3N3m5q2P9R5R5l4l3N7j04n2n1m9M7J27r9L5L4QQJ4J4k5
$$ -45 -26 -104 -24 -42 -33 -25 -47 -69 -76 -83 -96 -109 -55 -98 -45 -90 -172 -93 2 97 63 30 87 -17 -69 -120 -169 -122 5 -94 -59 -25 -17 -9 5 19 -6
14813fP2o3o3M0M0l2O4r1NONk9k9k2k3l2O5R1R1o3o4j5j6N1N0mmM2n4%%k8k8kR5k0k1o8K8
$$ -6 66 3 -60 -20 20 -12 52 -39 -34 -28 -23 -52 -81 -103 -126 -158 -93 -2 89 26 -38 -53 -69 -18 32 28 24 66 12 12 12 -16 -44 -46 49 29 8 -60 -32
14794c2J8J9k4k5J7J7m3N3L3o4llL8L7Or2Q1j6j30J59k4k4poK4K4k4k4l0k9P3k3J3J3PPnm
$$ -32 -14 5 -19 -44 -27 -10 -53 0 33 -31 -34 -37 1 38 44 -48 33 17 -113 46 22 -2 -9 -15 9 33 9 -15 -45 -74 -1 -24 -11 2 9 16 11 7
14776Gr6O6K2K2Nr1O6O6j12N0K5K4m0l9m0N8R4o7MMooj2j2j3j2K1K1o0o0L4L4J24l7l6l7N6
$$ 7 -89 -23 -1 21 26 -65 1 67 -45 5 30 54 14 -25 -65 -7 87 20 24 28 22 16 4 -8 -21 -33 -12 9 -51 -111 -77 -43 81 44 8 -29 27
14759B7m1PPnoN3m5J0J0lkllk0k0p4K3M7M7J0J1n6M1k0j9M5n2j00mM0M0klj1j1k1J41k7k8
$$ 27 -14 -7 0 -5 -11 42 -3 7 17 14 12 9 6 -14 -34 -108 -85 -38 9 19 30 -26 15 -5 -24 21 -31 -131 -135 -95 -55 -57 -60 -71 -82 -103 38 11 -17
14740a7k3k3N6m2m1N5L7L7nnl6l7m2N4K5K5j7j7nnj6j5N1j11O0O1j9j8K9L0QPQPj7j7k7k7
$$ -17 -40 -63 -7 -49 -90 -35 2 39 34 29 -7 -44 -86 -32 -7 18 1 -16 -21 -26 -42 -57 -6 -117 -57 4 -15 -33 -4 26 34 41 49 56 39 22 -5 -32
14722c2P2q9n2M4l4l4m0N7O2l5k3k3O9P0m4m3J7J7J7J7popoJ6J6P6k1q3J4j01mJ0RO5O4J5
$$ -32 40 -49 -101 -57 -91 -125 -165 -108 -46 -81 -104 -127 -58 12 -32 -75 -58 -41 -24 -7 -14 -20 -27 -33 -17 -1 75 54 -29 -15 -116 -120 -110 -101 -36 28 43
14704D3J5l3l3K1K1k7k7K6K5L2o4l4l4m9J11l2l3L2o5O8O9j3j2n0M7j8j8J25l5q1J7o3o2M
$$ 43 58 25 -8 13 34 7 -20 6 31 63 -1 -35 -69 -118 -7 -39 -72 -40 -105 -37 32 19 7 -43 4 -14 -32 93 58 -23 -6 -69 -131 -127
14688a27r3N8J54j9j9m9m9J24K7n0M8o2L6m8N0nmO4l3l2l3M4n4J5J5N9j02k4P3N2m6L2o5m5
$$ -127 -220 -162 -8 -27 -46 -95 -144 -20 7 -43 5 -57 -21 -69 -19 -24 -28 36 3 -29 -62 -18 -72 -57 -42 17 -85 -109 -36 16 -30 2 -63 -108
14672a08J18o1o0L1L2J22l9m3m2l5l4J15J8m0m0J3J2j8j8O4l3K8K8q4J2O5O5Jr6j7j8m2m2
$$ -108 10 -51 -111 -80 -48 74 35 -8 -50 -85 -119 -4 14 -26 -66 -53 -41 -59 -77 -13 -46 -18 10 -74 -62 3 68 69 -27 -44 -62 -104 -146
14656a46OPN6N6k5k4N4N4OOl7l6J2J2l6l7OOO5l1k6k6K6K5n3M3JJk0j16L3L2J16J8q3P8OO
$$ -146 -140 -133 -77 -21 -46 -70 -16 38 44 50 13 -23 -11 1 -35 -72 -66 -60 5 -26 -52 -78 -52 -27 -80 -37 -36 -35 -55 -171 -138 -106 10 28 -55 23 29 35
14638C5J5J6qrk3k2m7m7JJN0N0m1m0K2K2n2J74o6o6PQL3L2j2j2nom5N2j05rN7N7J4J4pql2
$$ 35 50 66 58 49 26 4 -43 -90 -89 -88 -38 12 -29 -69 -47 -25 -77 97 31 -35 -28 -20 13 45 33 21 16 10 -35 17 -88 -97 -40 17 31 45 38 30 -2
14619bl2OOn3n2Q2q0J7J8K6J23o6L0L1L0j45Q1Q8j0n4n4j7j6l2J29M9m7K3p4j4j5j4j4PJ04
$$ -2 -34 -28 -22 -75 -127 -45 -125 -108 -90 -64 59 -7 23 54 84 -61 20 108 98 44 -10 -27 -43 -75 54 103 56 79 5 -9 -24 -38 -52 -45 59
14603E9l2l1m0m0L5L4O8l0JJl4l5J4J4klLMk6P0P1k6o8o9P1P1p3p3L3L4N6m1l5l5P2P2rrj4
$$ 59 27 -4 -44 -84 -49 -15 53 23 24 25 -9 -44 -30 -16 -18 -21 -18 -14 -40 30 101 75 7 -62 9 80 7 -66 -33 1 57 16 -19 -54 18 90 81 72 58
14584E8j4j5j4j0j0O5O5K7p0j18k1J5J5L6o0r6O5K3K3o3L5J56p1l8l8n8L8L1L0j2j2M2M2l2
$$ 58 44 29 15 5 -5 60 125 152 82 -36 -57 -42 -27 9 -51 -147 -82 -59 -36 -99 -64 92 21 -17 -55 -113 -75 -44 -14 -26 -38 4 46 14
14568A4l2p5K2P1P1L1j31M0M1o7o6O3l5O7l0l0l0k3k2O8O8q5P7L4L4p0p0M3M2l9m0L5L4M6
$$ 14 -18 -93 -71 0 71 102 -29 11 52 -15 -81 -18 -53 14 -16 -46 -76 -99 -121 -53 15 -70 7 41 75 5 -65 -22 20 -19 -59 -24 10 56
14552E6n1j31l5J02J03l7l7L3L3j5j6m8m9L2L2nnnnppkjl5O3j7j6N2N1k8k9J5J5r4LJ08J1
$$ 56 5 -126 -161 -59 44 7 -30 3 36 21 5 -43 -92 -60 -28 -33 -38 -43 -48 -55 -62 -64 -65 -100 -37 -54 -70 -18 33 5 -24 -9 6 -88 -85 23 34
14534C4j5j5k3j21K5J21%%j8j8JJJJqqpQ8p7J9mnRQj5j5J1J2j2j3JJK0J9O0l6n3n2n9J03L6
$$ 34 19 4 -19 -140 -115 6 6 6 -12 -30 -29 -28 -27 -26 -34 -42 -49 39 -38 -19 -23 -28 -19 -11 -26 -41 -30 -18 -30 -43 -42 -41 -21 -2 58 22 -31 -83 -142 -39 -3
14515cL6j7j7j1j08N2N2llK0K0k9k8K4K5P9j8j0j0m0m1j6j7k2P4L5L4r4Kk2k2L3L2J1J0l8
$$ -3 33 16 -1 -12 -120 -68 -16 -19 -22 -2 18 -11 -39 -15 10 89 71 61 51 11 -30 -46 -63 -85 -11 24 58 -36 -34 -56 -78 -45 -13 -2 8 -30
14497c0l8N1N0LKk4k3K5K5k1k1q7P4NNJ5J5m6m6J00o2o0L7K1K1M1M1J4q2J2J2p9J8K8o9J0
$$ -30 -68 -17 33 36 38 14 -9 16 41 20 -1 -88 -14 -9 -4 11 26 -20 -66 34 -28 -88 -51 -30 -9 32 73 87 5 17 29 -50 -32 -4 -73 -63
14480f3J0K1p6K7K7n5n5K5K6O2O1j2j3n9L8J4J4m2N4%%J1J1J0J1m7m8m7M9o2L4N5m2Q4p7P
$$ -63 -53 -32 -108 -81 -54 -109 -164 -139 -113 -51 10 -2 -15 -74 -36 -22 -8 -50 4 4 4 15 26 36 47 0 -48 -95 -46 -108 -74 -19 -61 23 -54 -47
14463d7PJ7J8K7K7j07N5L0j31R2R1l1l2k6k7k0k1m1N5L5L5J47p9r7r7N7N6KKj5j11o3L3O0
$$ -47 -40 -23 -5 22 49 -58 -3 27 -104 -12 79 48 16 -10 -37 -57 -78 -119 -64 -29 6 153 74 -23 -120 -63 -7 -5 -3 -18 -129 -192 -159 -99
14447i9O1p0K8K4K3k5k5O5l3kkO3O3Mr2K1K1J5J5m9m8N5m3qqj4j4N5N4q2J6O1O1m5m6k4k4
$$ -99 -38 -108 -80 -56 -33 -58 -83 -18 -51 -53 -55 8 71 75 -17 4 25 40 55 6 -42 13 -30 -38 -46 -60 -74 -19 35 -47 -31 30 91 46 0 -24 -48
14429d8K5K4lmn8L9k6k5L6o2M7M6R3o8q5P7L1o6k9k9P8j9l8J24l2l2R9o3l1l1Q1q1m5N2KL
$$ -48 -23 1 -2 -6 -64 -25 -51 -76 -40 -102 -55 -9 84 16 -69 8 39 -27 -56 -85 -7 -26 -64 60 28 -4 95 32 1 -30 51 -30 -75 -23 -21 -18
14412a8J05n5q1J7P9j47K2K3QRJ3J2O8l0QQKKJ9J9o2o1QRq2Q0K1K0m9n0O5O5l8N9j6j7mmn7
$$ -18 87 32 -49 -32 47 -100 -78 -55 -47 -38 -25 -13 55 25 33 41 43 45 64 83 21 -40 -32 -23 -105 -25 -4 16 -33 -83 -18 47 9 68 52 35 31 27 -30
14393c0M0j5j4l9l9J03Nj21k5O1O0JJJJJ2J3l6l7O8O8j3j3j5j5rrn4M2j8j8P3k4q6J0J40q6
$$ -30 10 -5 -19 -58 -97 6 11 -110 -135 -74 -14 -13 -12 -11 -10 2 15 -21 -58 10 78 65 52 37 22 13 4 -50 -8 -26 -44 29 5 -81 -71 69 -17
14376a7NNr0Pn7J04L2L2M8m9qrp5K2N0m6PQJ4q3K0K0M0M0j4j5L8o0j1j2K3p3K9K9j5j4K8K8
$$ -17 -12 -7 -97 -90 -147 -43 -11 21 69 20 12 3 -72 -50 0 -46 -39 -31 -17 -100 -80 -60 -20 20 6 -9 29 -31 -42 -54 -31 -104 -75 -46 -61 -75 -47 -19
14358a9N5m3q4J2j0Q7j0j0n6n6M8M7P7q4O8l0m8M9j2j1rrqrL2L2j7j6K8K7K8K8p5p5NOmml
$$ -19 36 -7 -91 -79 -89 -2 -12 -22 -78 -134 -86 -39 38 -46 22 -8 -56 -7 -19 -30 -39 -48 -56 -65 -33 -1 -18 -34 -6 21 49 77 2 -73 -68 -62 -66 -70 -73
14339g3mllrrP3k4k4k4R2nN0N0p0o9L3o3MLkkM0M0n7M0o0L6nol0O7l6l6j1j2j1j1L7L7R1n
$$ -73 -77 -80 -83 -92 -101 -28 -52 -76 -100 -8 -13 37 87 17 -52 -19 -82 -78 -75 -77 -79 -39 1 -56 -16 -76 -40 -45 -51 -81 -14 -50 -86 -97 -109 -120 -131 -94 -57 34 29
14320B9n0n1o7R5K5K4J1J0K5K5o6R5n0n0O1j01o5R6J17m5o9K8J2j49J0J06l2l3k0P7kkl5l6
$$ 29 -21 -72 -139 -44 -19 5 16 26 51 76 10 105 55 5 66 -35 -100 -4 113 68 -1 27 39 -110 -100 6 -26 -59 -79 -2 -4 -6 -41 -77
14303g7L9L9L8n9o0L8M0M0lklkj12j4O4l3K7K8KKm6m6P0P0l7l8n8L9QQjjj6j6oJ55J5J6o0
$$ -77 -38 1 39 -20 -80 -42 -2 38 35 33 30 28 -84 -98 -34 -67 -40 -12 -10 -8 -54 -100 -30 40 3 -35 -93 -54 -46 -38 -39 -40 -56 -72 -78 77 92 108 48
14285D8o0K0K1m8m9L3L3L0L0p3K4j9k0k5P2N9l7l1O5lmKKl9l9l9l9N9N9L3o4K6K7mmQRm0m0
$$ 48 -12 8 29 -19 -68 -35 -2 28 58 -15 9 -10 -30 -55 17 76 39 8 73 70 66 68 70 31 -8 -47 -86 -27 32 65 1 27 54 50 46 54 63 23 -17
14266a7J1J2M8j14L5o2k4P3POJ9J8n3M3J3J3K8K8j46m9Q8rLLKKJ2J3j16M5N7m0L2L1j25J00
$$ -17 -6 6 54 -60 -25 -87 -111 -38 -31 -25 -6 12 -41 2 15 28 56 84 -62 -111 -23 -32 -29 -26 -24 -22 -10 3 -113 -68 -11 -51 -19 12 -113 -13
14249a3j1j1k7P0o6o6M7M7L2o4J5J5m4m4P5P5o9K7n7M0k0k0j04N6M4M4OOKKj00mP9P9l4l5
$$ -13 -24 -35 -62 8 -58 -124 -77 -30 2 -62 -47 -32 -76 -120 -45 30 -39 -12 -69 -29 -49 -69 -173 -117 -73 -29 -23 -17 -15 -13 -113 -117 -38 41 7 -28
14232b8Q3j4pqkkJ0q6r3MJ11J4L4L5m6m6o8K9n5M1L2L1K8K8K7j35L8L7pqM2n6O0l8j34K8J24
$$ -28 55 41 34 26 24 22 32 -54 -147 -143 -32 -18 16 51 5 -41 -109 -80 -135 -94 -62 -31 -3 25 52 -83 -45 -8 -15 -23 19 -37 23 -15 -149 -121 3
14214CK7m3N4k1k0j4j4J0J1k7k7n6J05RJ05n8n9K8K7j4j5j5j5j4j4L5L4rrn7J04Pr0jjK5K5
$$ 3 30 -13 41 20 0 -14 -28 -18 -7 -34 -61 -117 -12 -3 102 44 -15 13 40 26 11 -4 -19 -33 -47 -12 22 13 4 -53 51 58 -32 -33 -34 -9 16
14197A6k3k3poj%l0O7O8l0l4l4P0k8l3O4J6q1l2O5r8kL7L6k2P5N0j12M0n8K3K3l8N9n2n2k3
$$ 16 -7 -30 -37 -43 -44 -44 -74 -7 61 31 -3 -37 33 5 -28 36 52 -29 -61 4 -94 -96 -59 -23 -45 30 80 -32 8 -50 -27 -4 -42 17 -35 -87 -110
14179a10J38J3J4j9j8q7RL6L6K1K1q2J5j%R7o5K7K6k5k6p7J9K4K4j01O0J8J8kkN2m4j7j7k2
$$ -110 28 41 55 36 18 -69 -60 -24 12 33 54 -28 -13 -14 -14 83 18 45 71 46 20 -57 -38 -14 10 -91 -31 -13 5 3 1 53 9 -8 -25 -47
14162d7k3J5J6J28L2j20M1poJ0J0j31l4M0n6MMN1N0N7m0j4j4q0J6R6jQ0q1r4O8J16m5j20M2
$$ -47 -70 -55 -39 89 121 1 42 35 29 39 49 -82 -116 -76 -132 -128 -124 -73 -23 34 -6 -20 -34 -114 -98 -2 -3 77 -4 -98 -30 86 41 -79 -37
14145c7j1j1k4k4L0L0k6P1p5Q7l1l2k1k1L9M0llp3K4N1N1o7o6m7N1R6%n3n3L1L1k9O7K1p6
$$ -37 -48 -59 -83 -107 -77 -47 -73 -2 -77 10 -21 -53 -74 -95 -56 -16 -19 -22 -95 -71 -20 31 -36 -102 -149 -98 -2 -2 -55 -108 -77 -46 -75 -8 13 -63
14128f3L3L3j0j0L2L2k5j21m1N6M9M9OPppppppj3j3J4q3O8k8L2o5L2L1MMLMk9k8m5J17N7m0
$$ -63 -30 3 -7 -17 15 47 22 -99 -140 -84 -35 14 20 27 20 13 6 -1 -8 -15 -28 -41 -27 -110 -42 -70 -38 -103 -71 -40 -36 -32 -29 -25 -54 -82 -127 -10 47 7
14109GK4K5l2l2J7J6j7j7j0j1l2O5P1k6m5N2j4j4O7k9p8J9PQO8k8l0l0l6l5NMO0l8L2L2k2
$$ 7 31 56 24 -8 9 25 8 -9 -19 -30 -62 3 74 48 3 55 41 27 94 65 -13 6 13 21 89 61 31 1 -35 -70 -65 -61 -1 -39 -7 25 3
14091CP4j21k4P2P3l4l3N7j04KKo3L4PPJ3J3m3m3P0P0LMLMJ2J2l7l6m9n0n9J01K4K3J3q4l
$$ 3 77 -44 -68 4 77 43 10 67 -37 -35 -33 -96 -62 -55 -48 -35 -22 -65 -108 -38 32 35 39 42 46 58 70 33 -3 -52 -102 -161 -60 -36 -13 0 -84 -87
14073h7R4m8m7K8K8p6K2POJ3J2L0L0j9j8l4l4jR5l3O4K1p5j5j5K7K8m2m2P1P1l6l7l7l7k7
$$ -87 7 -41 -88 -60 -32 -108 -86 -79 -73 -60 -48 -18 12 -7 -25 -59 -93 -94 1 -32 32 53 -22 -37 -52 -25 3 -39 -81 -10 61 25 -12 -49 -86 -113
14056a13k7M8M7R0oo2L6J0q6k6k6O3O3j2j2m1N6KKk7k7K8o9k1k2N4N3K0K0k8k9j8j8J4J11
$$ -113 -140 -92 -45 45 39 -23 13 23 -63 -89 -115 -52 11 -1 -13 -54 2 4 6 -21 -48 -20 -89 -110 -132 -78 -25 -5 15 -13 -42 -60 -78 -64 47
14039D7p2K5k9l0M1n6R6kK5p2k3k4k8k9K0K0j5j4J20K4%JMMj09N1l9l9qqo9K8J00Mj7j7PO
$$ 47 -25 0 -29 -59 -18 -74 22 20 45 -27 -50 -74 -102 -131 -111 -91 -106 -120 0 24 24 25 29 33 -76 -25 -64 -103 -111 -119 -188 -160 -60 -56 -73 -90 -83 -77
14021g7pqq1Q0k2P4L3o3l3O3NMJJQ2p9J2J1pqppl2l1J08n3J0RM8M8l4l4n9n8K7K7LLL8L8M9
$$ -77 -84 -92 -173 -93 -115 -41 -8 -71 -104 -41 -36 -32 -31 -30 52 -27 -15 -4 -11 -19 -26 -33 -65 -96 12 -41 -31 -22 26 74 40 6 -53 -111 -84 -57 -54 -51 -13 25 74
14002G4j13J0J1n4M3PQj3j09P0P1j6j6J0J1qpn8L9L4L3m4m4MMj4j4K9K8M4n3n6n7J67Om3m3
$$ 74 -39 -29 -18 -72 -29 -22 -14 -27 -136 -66 5 -11 -27 -17 -6 -14 -21 -79 -40 -6 27 -17 -61 -57 -53 -67 -81 -52 -24 20 -33 -89 -146 21 27 -16 -59
13984e9q2J4k4J38L9n8k3P3rj0lmm1m1rQ8q3J4q3J4K2J19nmm3N4ppK2p5L3L4o1L6j3j2k2P5
$$ -59 -141 -127 -151 -13 26 -32 -55 18 9 -1 -4 -8 -49 -90 -99 -11 -94 -80 -163 -149 -127 -8 -13 -17 -60 -6 -13 -20 2 -73 -40 -6 -67 -31 -44 -56 -78 -3
13966cK1K1j2j2onl8N8N9l8j5j4k1k1j2j2N3m4j07N5O0l6j6j5QRj7Q0k3k3J6J5K2p5N8N7k9
$$ -3 18 39 27 15 9 4 -34 24 83 45 30 16 -5 -26 -38 -50 3 -41 -148 -93 -33 -69 -85 -100 -92 -83 -100 -20 -43 -66 -50 -35 -13 -88 -30 27 -2
13948bk9l1l1nR2RJ0j0j08K0K0O8k8j2j2j8j7N3N4ONk7k7L4o3l3O4lkN9l6l1l1J0J1J0J1o
$$ -2 -31 -62 -93 -98 -6 3 13 3 -105 -85 -65 3 -25 -37 -49 -67 -84 -31 23 29 34 7 -20 14 -49 -82 -18 -21 -23 36 0 -31 -62 -52 -41 -31 -20 -26
13930b6oQ5p6ooj6j6NMNMOPOOj0rJ11n0o6L1q2P9M6n0M4n3M3M3j2j2l4l4J4J4o4o5J7J6K8
$$ -26 -32 53 -23 -29 -35 -51 -67 -62 -58 -53 -49 -43 -36 -30 -24 -34 -43 68 18 -48 -17 -99 -20 26 -24 20 -33 10 53 41 29 -5 -39 -25 -11 -75 -140 -123 -107 -79
13911g9K7k7k7J03Nk1k1M0L9o9K7M3n3j38K3J52N6j16j15K6J23p0p0mR2Q7j0M5n2m3N3R2o8
$$ -79 -52 -79 -106 -3 2 -19 -40 0 39 -30 -3 40 -13 -151 -128 24 80 -36 -151 -125 -2 -72 -142 -146 -54 33 23 68 16 -27 26 118 50
13895E0q5q4O5O5k2k1Q0j5p5K3J05n6o7o6j7Q0P5P4j11j11L4L4j5j5QRPQO1l5r0q9M9M9J6
$$ 50 -35 -119 -54 11 -11 -32 48 33 -42 -19 86 30 -37 -103 -120 -40 35 109 -2 -113 -79 -45 -60 -75 -67 -58 -51 -43 18 -17 -107 -196 -147 -98 -82
13878h2J6qqL4L3J5J6l6O0l6l6n7L9j5j5k2k3K0K1P7k0qqnR2o5L2j1j0JKm4N4N3m3LMl3l3
$$ -82 -66 -74 -82 -48 -15 0 16 -20 40 4 -32 -89 -50 -65 -80 -102 -125 -105 -84 -7 -27 -35 -43 -48 44 -21 11 0 -10 -9 -7 -51 3 56 13 16 20 -13 -46
13860d6O8k8o1o0Q4j2j2Q4L8L8r6O6k7k7n4M3K2p4O4l2M7M8m0l9K2K1llrro4L3ppK3K3p1p1
$$ -46 22 -6 -67 -127 -43 -55 -67 17 55 93 -3 63 36 9 -45 -2 20 -54 10 -22 25 73 33 -6 16 37 34 31 22 13 -51 -18 -25 -32 -9 14 -57 -128
13842a28O5O4L6j26k0k1J49j3j7j7J00j27J5J5j45Q2Q9pL4L3J29j61k32N9JR7k5k6O1O2k2
$$ -128 -63 1 37 -89 -109 -130 19 6 -11 -28 72 -55 -40 -25 -170 -88 1 -6 28 61 190 29 -203 -144 -143 -46 -71 -97 -36 26 4
13827Dk2K0K1j1j08m2J20N5j07J3J2P3k5j8j8K0K1j08j2l8N8k0P7J%%R8k4k4j1j09M1M0J6
$$ 4 -18 2 23 12 -96 -138 -18 37 -70 -57 -45 28 3 -15 -33 -13 8 -100 -112 -150 -92 -112 -35 -34 -34 -34 64 40 16 5 -104 -63 -23 -7
13811gJ6o1L5jjL5o2ppK1K2L3o3k7P0O5l3JJm7m8m3N3K9K9o5L2K0K0N6m1o5L2j9j9l6l7L0
$$ -7 9 -52 -17 -18 -19 16 -46 -53 -60 -39 -17 16 -47 -74 -4 61 28 29 30 -17 -65 -108 -55 -26 3 -62 -30 -10 10 66 25 -40 -8 -27 -46 -82 -119 -89
13793h9K9K4K4N3m4n4M3P5q6j4j4M9M8r7%J18m5p6K0l5O2m7M9Mr2M8M9kln0n1K1K1rQ7l6l7
$$ -89 -60 -36 -12 41 -3 -57 -14 61 -25 -39 -53 -4 44 -53 -53 65 20 -56 -36 -71 -9 -56 -7 -3 -95 -47 2 0 -3 -53 -104 -83 -62 -71 16 -20 -57
13775e7KR9q5J3n4n5j3Q4n0M7KKj7j6N8N8k2k2K0K0k8k8K7K6j5j6o3L4OJ02OOklQ6j41ppp1
$$ -57 -55 44 -41 -28 -82 -137 -150 -66 -116 -69 -67 -65 -82 -98 -40 18 -4 -26 -6 14 -14 -42 -15 11 -4 -20 -83 -49 -43 59 65 71 69 66 152 11 4 -3 -74
13756g4K7N1m7LLn1n2P5P5j1j2M3n3m8M9o3L4j5j5J0J0j4Q2j13j7K2K1m4N2NMp6K1J12J5m5
$$ -74 -47 4 -43 -40 -37 -88 -140 -65 10 -1 -13 30 -23 -71 -22 -85 -51 -66 -81 -71 -61 -75 7 -106 -123 -101 -80 -124 -72 -67 -63 -139 -118 -6 9 -36
13739c6J17jr7o7L0J40k0o1o1j%R8o3k1J41m6j43QQj0Q7M2j19k1k1J04PKLKKm3N4j2Q4Nr1
$$ -36 81 80 -17 -84 -54 86 66 5 -56 -57 -57 41 -22 -43 98 52 -91 -83 -75 -85 2 44 -75 -96 -117 -13 -6 -4 -1 1 3 -40 14 2 86 91 0
13722@ppJ2J1J2J2lkn7n7P3k4N5N4m5m4R0oo8o7K9o7N2N3kkk0k0k0k0M3M4nnL3L4j39K4nn
$$ 0 -7 -14 -2 9 21 33 30 28 -29 -86 -13 -37 18 72 27 -17 73 67 -1 -68 -39 -106 -54 -1 -3 -5 -25 -45 -65 -85 -42 2 -3 -8 25 59 -80 -56 -61 -66
13703f6NNK2K2K2K2l0k9P1r0q0Q1k6P1l1l1N5N6m2m2PONMMNK8K7k7P0m8m8J%K8o9k1k1Q3j3
$$ -66 -61 -56 -34 -12 10 32 2 -27 44 -46 -126 -45 -71 0 -31 -62 -7 49 7 -35 -28 -22 -17 -13 -9 -4 24 51 24 94 46 -2 -1 -1 27 -42 -63 -84 -1 -14
13683a4qqm4m5M1M2j04qN7N7k9O8O2l5M5n1n1n1mmmll3l4K6J22j8j9k8O8Q6p5l3l2M4n2R9
$$ -14 -22 -30 -74 -119 -78 -36 -140 -148 -91 -34 -63 5 67 32 77 26 -25 -76 -80 -84 -88 -91 -124 -158 -132 -10 -28 -47 -75 -7 79 4 -29 -61 -17 -69 30
13666C0Kj2j09qQ9mj01J1J09L0o7n5n4P2P3m7m6L5o1J3J10L1o6N6m2l0O6J6J6j14M8m9m9M7
$$ 30 32 20 -89 -97 -8 -12 -113 -102 7 37 -30 -85 -139 -67 6 -41 -87 -52 -113 -100 10 41 -25 31 -11 -41 25 41 57 -57 -9 -58 -107 -60
13650f0n0kjN9l8k6J36J2J3K8o8j3j3j46P9L6L5R8o4m8M9rj0p8J9M5M5j1j1mmn5M2o7o7O1
$$ -60 -110 -112 -113 -54 -92 -118 18 30 43 71 3 -10 -23 -169 -90 -54 -19 79 15 -33 16 7 -3 -81 -62 -17 28 17 6 2 -2 -57 -15 -82 -149 -88
13632h8l5p2R0QQJ15m6k1P7J2J2p6p7L6L7K1K1l3l4N7m1j25L6nnNOM4M4K9o9l9J23j7j7o6
$$ -88 -123 -195 -105 -97 -89 26 -20 -41 36 48 60 -16 -93 -57 -20 1 22 -11 -45 12 -29 -154 -118 -123 -128 -123 -117 -73 -29 0 -69 -108 15 -2 -19 -85
13615h5L1K5K4pppqJ3J3J9J9n1M6n6n7KJN0N0j5j5j6j5k0j9L5L5m3N5opL3o5j0j0j6j7L3L2
$$ -85 -54 -29 -5 -12 -19 -26 -34 -21 -8 11 30 -21 25 -31 -88 -86 -85 -35 15 0 -15 -31 -46 -66 -85 -50 -15 -58 -3 -9 -16 17 -48 -58 -68 -84 -101 -68 -36
13597c6k0k1k0k0N5N5q0J6L6L6l9l9l7l7J7J7m1N7KKQ5Q5k8k8p5p5m9M8K3K3k6k5J22K5jj
$$ -36 -56 -77 -97 -117 -62 -7 -87 -71 -35 1 -38 -77 -114 -151 -134 -117 -158 -101 -99 -97 -12 73 45 17 -58 -133 -182 -134 -111 -88 -114 -139 -17 8 7 6
13580Fl2l1J07n4j0j1K2K2L1o6j2j1klklnmn4M4L7J34l7j34K8K7K2p5K8o8l2O5O4l2l3O5O3
$$ 6 -26 -57 50 -4 -14 -25 -3 19 50 -16 -28 -39 -41 -44 -46 -49 -54 -58 -112 -68 -31 103 66 -68 -40 -13 9 -66 -38 -106 -138 -73 -9 -41 -74 -9 54
13562E4l4k7k7L8n8m6J16k3k2j3j3M1M0m0m0N7N8n6n5K7K7j08j1N7N7j7j7k8k8K0K1M8M9o4
$$ 54 20 -7 -34 4 -54 -100 16 -7 -29 -42 -55 -14 26 -14 -54 3 61 5 -50 -23 4 -104 -115 -58 -1 -18 -35 -63 -91 -71 -50 -2 47 -17
13546a7o5K6K5rrj03J22nnnmKJj9P7k0j9n2M5j0rk2k2K7K7NMr2O9Q4j2k9k9K0K0K6p1l4l5
$$ -17 -82 -56 -31 -40 -49 -152 -30 -35 -40 -45 -49 -47 -46 -65 12 -8 -27 -79 -34 -44 -53 -75 -97 -70 -43 -38 -34 -126 -57 27 15 -14 -43 -23 -3 23 -48 -82 -117
13527a17M0M0j6j6O4O5l2l1l1l1K9L0j9j9L6L6o8L0J1J2p3Q8J7J6m8m8n6M1kr9QJ04R2o9o0
$$ -117 -77 -37 -53 -69 -5 60 28 -3 -34 -65 -36 -6 -25 -44 -8 28 -40 -10 1 13 -60 28 45 61 13 -35 -91 -50 -52 -151 -143 -39 53 -16 -76
13510g6L7k1k1l3O3l3l3l3O3RROOm8M8j3j4pqL4L4L3L4n2n3L9L8q0Q2Q2q0qqj8j8n9n8N4N5
$$ -76 -39 -60 -81 -114 -51 -84 -117 -150 -87 -78 -69 -63 -57 -105 -57 -70 -84 -91 -99 -65 -31 2 36 -16 -69 -30 8 -72 10 92 12 4 -4 -22 -40 -99 -157 -103 -48
13492d8j6j6k8O8N3m5m2m2J56oj7P9n6n7m5m5K0J17O8k8j5j4j5j4l0O6o3o2o3L5Q2j4j1j1
$$ -48 -64 -80 -108 -40 13 -32 -74 -116 40 34 17 96 40 -17 -62 -107 -87 30 98 70 55 41 26 12 -18 48 -15 -77 -140 -105 -23 -37 -48 -59
13476e9j8j7j6j6J19K2k1k1jR5k0k0j11N1Q5j1n5M1L1o5NNn8J03l6l6ONK2p6o8R2j6Q0K8p0
$$ -59 -77 -94 -110 -126 -7 15 -6 -27 -28 67 47 27 -84 -33 52 41 -14 27 58 -7 -2 3 -55 48 12 -24 -18 -13 9 -67 -135 -43 -59 21 49 -21
13458b1j5Q1j0rmmj3j3j3j2j5j4j5j4OONOJ4J4J4J4l6l6J2J2K4K4k5k4NOONJ0J0RJ0M6M6l5
$$ -21 -36 45 35 26 22 18 5 -8 -21 -33 -48 -62 -77 -91 -85 -79 -74 -68 -54 -40 -26 -12 -48 -84 -72 -60 -36 -12 -37 -61 -56 -50 -44 -39 -29 -19 -10 0 46 92 57
13439E7l5k7k7K1K1K3K2k6k6qqpqj2j2o0o0M6M6n1J10O2l5j9j8j6j5j5j5J7J7p4Q7K7K7j1
$$ 57 22 -5 -32 -11 10 33 55 29 3 -5 -13 -20 -28 -40 -52 -112 -172 -126 -80 -131 -21 41 6 -13 -31 -47 -62 -77 -92 -75 -58 -132 -45 -18 9 -2
13422bj2n8n8K3K3LLJ3J3m6J16k3k3LLLLPQm2m1J9K0J9J9MNm5m4K0K0k9k9J9J9p2Q9M0M0o4
$$ -2 -14 -72 -130 -107 -84 -81 -78 -65 -52 -98 18 -5 -28 -25 -22 -19 -16 -9 -1 -43 -84 -65 -45 -26 -7 -3 2 -43 -87 -67 -47 -76 -105 -86 -67 -139 -50 -10 30 -34
13403c4o3L4L3L4L3m9m9n9J03J3J4k5k5J4J3p7Q4m0m0P3k3kjqR0p1K6p7J9L6L7N2j09n4n4
$$ -34 -97 -63 -30 4 37 -12 -61 -120 -17 -4 10 -15 -40 -26 -13 -90 -6 -46 -86 -13 -36 -38 -39 -47 43 -28 -2 -79 -60 -24 13 65 -44 -98 -152
13386a52M4M3Q2j5m1m2L2L1J29l4m6N1o8K9j3j3n5M2j02nN9O0mmn3n2PQN5N6o0o0M8m8k7O9
$$ -152 -108 -65 17 2 -39 -81 -49 -18 111 77 31 82 14 43 30 17 -38 4 -98 -103 -44 16 12 8 -45 -97 -90 -82 -27 29 -31 -91 -43 -91 -118 -49
13369d9O4l4k2k2J04n6K0p6oR1K8K8p6K2K3p4k3k4L8j23J6J6N6N6k5k5PPqpQ7j38M4M4k6P0
$$ -49 15 -19 -41 -63 41 -15 5 -71 -77 14 42 70 -6 16 39 -35 -58 -82 -44 -167 -151 -135 -79 -23 -48 -73 -66 -59 -67 -74 13 -125 -81 -37 -63 7
13352Gl2l2k8k8N2N3m1m0QQN3N3k8k8m4m3N8l7J5J5l9l9J1J2J1J1NNNNQQJ8J8j03N7J6J5l5
$$ 7 -25 -57 -85 -113 -61 -8 -49 -89 -81 -73 -20 33 5 -23 -67 -110 -52 -89 -74 -59 -98 -137 -126 -114 -103 -92 -87 -82 -77 -72 -64 -56 -38 -20 -123 -66 -50 -35 -70
13333g0l5M5M6j2j3j2j3K0K0k8k9j0j1P4q7P6k2K3K3k0k1J07j19K0K0m2m3%%Q1Q1j2j2j2j2
$$ -70 -105 -60 -14 -26 -39 -51 -64 -44 -24 -52 -81 -91 -102 -28 -115 -39 -61 -38 -15 -35 -56 51 -68 -48 -28 -70 -113 -113 -113 -32 49 37 25 13 1
13316AMNMMj4j4j05N7jjRRooM2M2k6k6O5r6l7l7J1J1pJ53Nr2rrL0o7J16m6m1m2L4L4q3J4J51
$$ 1 5 10 14 18 4 -10 -115 -58 -59 -60 -51 -42 -48 -54 -12 30 4 -22 43 -53 -90 -127 -116 -105 -112 41 46 -46 -55 -64 -34 -101 15 -31 -72 -114 -80 -46 -129 -115 36
13297C6p6k2k3L9L9L9L8n5n5K6K6l0l0K5K5r7%J17m5J2J2N1j11o6L1M8M7J5J5l3l3k7k6K2
$$ 36 -40 -62 -85 -46 -7 32 70 15 -40 -14 12 -18 -48 -23 2 -95 -95 22 -23 -11 1 52 -59 -125 -94 -46 1 16 31 -2 -35 -62 -88 -66
13281f6K2j6j7MJ01Mr3K1K2j8P8o3o3Q4j3M7n0l7l8NNk2k3O5O4o1L6j9j8j7j7k3k3R9MRRq
$$ -66 -44 -60 -77 -73 28 32 -61 -40 -18 -36 42 -21 -84 0 -13 34 -16 -53 -91 -86 -81 -103 -126 -61 3 -58 -22 -41 -59 -76 -93 -116 -139 -40 -36 -27 -18 -26
13262b6pjr9L3L3K7K7mlN1m6k3k3J09j18q3P7K2K1k5k5o8R4l7l8N8j04J00LppL8n9JKk6P1
$$ -26 -33 -34 -133 -100 -67 -40 -13 -17 -20 31 -15 -38 -61 48 -70 -153 -76 -54 -33 -58 -83 -151 -57 -94 -132 -74 -178 -78 -75 -82 -89 -51 -110 -109 -107 -133 -62
13245f2J7J7j9j8j9j9L4L4L4L4k1k1j5j5n2M4L9L8k6k6K8o8MMjkN4N4k0k1j16k0PPL4L5r4
$$ -62 -45 -28 -47 -65 -84 -103 -69 -35 -1 33 12 -9 -24 -39 -91 -47 -8 30 4 -22 6 -62 -58 -54 -55 -57 -3 51 31 10 -106 -126 -119 -112 -78 -43 -137
13227a37Kl0O7J2J10m0l9Q0j6m8J14j18k2j0rK6p0j1j2RJ06o2o2O2O3J1J07q2J4K6K7p1K7
$$ -137 -135 -165 -98 -86 24 -16 -55 25 9 -39 75 -43 -65 -75 -84 -58 -128 -139 -151 -142 -36 -98 -160 -98 -35 -24 83 1 15 41 68 -3 24
13211B4RRJ5J6l4l3RRM1n5kjm0m0N1N1j06N6k9k9l0O8J3J3n2n2k7k8N9N9K7o9lj00O2O2LM
$$ 24 33 42 57 73 39 6 15 24 65 10 8 7 -33 -73 -22 29 -77 -21 -50 -79 -109 -41 -28 -15 -67 -119 -146 -174 -115 -56 -29 -98 -101 -201 -139 -77 -74 -70
13193g0lR4PQj22k5M5M4LKK9K8j3j4m4N3n6n6Q1j6l6l6k2P5o1o0O3O3L7o0ppJ1J2jjk5k5P5
$$ -70 -73 21 28 36 -86 -111 -66 -22 -19 -17 12 40 27 13 -31 22 -34 -90 -9 -25 -61 -97 -119 -44 -105 -165 -102 -39 -2 -62 -69 -76 -65 -53 -54 -55 -80 -105 -30
13175c0P5l8l9m5m4L6L5l3l4pR0j1j1L8L7Rq8llJ4J12m6N0QPj22k5M8M8P4q8o0J01m8m8mn
$$ -30 45 7 -32 -77 -121 -85 -50 -83 -117 -124 -34 -45 -56 -18 19 28 -60 -63 -66 -52 60 14 64 72 79 -43 -68 -20 28 102 14 -46 55 7 -41 -45 -50
13157e0K6K6o9K7O4O4j62%K2K2J8J8o3o3jkP9P9m2m2L7o0J6J7j4j4RQN0j10M3M3R7Jj31L1
$$ -50 -24 2 -67 -40 24 88 -74 -74 -52 -30 -12 6 -57 -120 -121 -123 -44 35 -7 -49 -12 -72 -56 -39 -53 -67 -58 -50 0 -110 -67 -24 73 74 -57 -26
13140b6N2N3p6K1rj0n2n3k0P6mR4l6l6n1n0O2O3o3o3J09n3M2M3QQJ5J5p3K3Q1q1q6J0J6J5
$$ -26 26 79 3 24 15 5 -47 -100 -120 -44 -48 46 10 -26 -77 -127 -65 -2 -65 -128 -19 -72 -30 13 21 29 44 59 -14 9 90 9 -77 -67 -51 -36
13123c6K2K2OPO1l6K0K1J4J4p1p0J4q2LJ00m1m1K4K4J03Om8m8nnJ1J2j9j8O6l0n7n6L0L0j8
$$ -36 -14 8 14 21 82 46 66 87 101 115 44 -26 -12 -94 -91 9 -32 -73 -49 -25 78 84 36 -12 -17 -22 -11 1 -18 -36 30 0 -57 -113 -83 -53 -71
13105g1j8L3L3j6j6k6k6jkM5M5j3j4R0p1K5K5p5K3J6J6p0p1M3M3KLJ4q2J7J14o0n9K2K2l8
$$ -71 -89 -56 -23 -39 -55 -81 -107 -108 -110 -65 -20 -33 -47 43 -28 -3 22 -53 -30 -14 2 -68 -139 -96 -53 -51 -48 -34 -116 -99 15 -45 -104 -82 -60 -98
13088i8N8P5k3nmq0J6R8%jjL5L5k8j24NNR0pk8k7m8M8ooK6K6m9m9J1J07q6P5m2m2l7N8j9k0
$$ -98 -40 35 12 7 3 -77 -61 37 37 36 35 70 105 77 -47 -42 -37 53 46 18 -9 -57 -9 -15 -21 5 31 -18 -67 -56 51 -35 40 -2 -44 -81 -23 -42 -62
13069f2qj04K2K3M3J39l5l5k3k2k6P1k6k6j0Q6Nr1opR1pJ8J8l7l7N5N5k6k5j3j3j8j9J26K9
$$ -62 -70 -174 -152 -129 -86 53 18 -17 -40 -62 -88 -17 -43 -69 -79 7 12 -79 -85 -92 -1 -8 10 28 -9 -46 9 64 38 13 0 -13 -31 -50 76 105
13052A05jr8p5K1K1p5n5M2J54qk8k9J6q0J3J4N5N6l2l2J6J7l7l7m3N4KLr5LL1L1j7P9llll
$$ 105 104 6 -69 -48 -27 -102 -157 -115 39 31 3 -26 -10 -90 -77 -63 -8 48 16 -16 0 17 -20 -57 -100 -46 -44 -41 -136 -133 -102 -71 -88 -9 -12 -15 -18 -21
13034b1P6k1j07j1Q5j2%JN0N0o2o3k0k1K8K8kkLr3KJQ7p6J7J7OPk2k1l2J30m6m6P8P7n1n2
$$ -21 55 34 -73 -84 1 -11 -11 -10 40 90 28 -35 -55 -76 -48 -20 -22 -24 -21 -114 -112 -111 -24 -100 -83 -66 -60 -53 -75 -96 -128 2 -44 -90 -12 65 14 -38
13016c8o8R4R6%m9m9l0l1J8J7L6L5m5m5k2k2N2N3M2n4N5m3m9m9J12J5kkj05qm0N7O4l4k3k3
$$ -38 -106 -12 84 84 35 -14 -44 -75 -57 -40 -4 31 -14 -59 -81 -103 -51 2 44 -10 45 2 -47 -96 16 31 29 27 -78 -86 -126 -69 -5 -39 -62 -85
12999h5lR4lln2M6k3k3o5o6J09J10J8p8k3k3J3J4O3l4l4O3K1K2q1J5L2o5n9L7rqN1N2j10j3
$$ -85 -88 6 3 0 -52 -6 -29 -52 -117 -183 -74 36 54 -24 -47 -70 -57 -43 20 -14 -48 15 36 58 -23 -8 24 -41 -100 -63 -72 -80 -29 23 -87 -100
12982a00O8k9jkqqQ6Q6k7k7p3p3PQM0M0O0j66n9L8Q3Q3J2J3o2o2m5N2P6k1n9o0M7M8o1o1j8
$$ -100 -32 -61 -62 -64 -72 -80 6 92 65 38 -35 -108 -101 -93 -53 -13 47 -119 -178 -140 -57 26 38 51 -11 -73 -118 -66 10 -11 -70 -130 -83 -35 -96 -157 -175
12964a75j8J13J6J17j09K4K4m4m4O3l3l3O4L2L2N1m7p2K4p9Q3NMJ4J5m5m5R1pj6j7q3P8m6
$$ -175 -193 -80 -64 53 -56 -32 -8 -52 -96 -33 -66 -99 -35 -3 29 80 33 -39 -15 -94 -11 -6 -2 12 27 -18 -63 28 21 5 -12 -95 -17 -63
12948f3N0OON1N1o2o2j0j1K0K0o5L3KKn1n0Q4j2J2J2j2j2J1J08k7k8j9j9q5P6J6J5K6K6pq
$$ -63 -13 -7 -1 50 101 39 -23 -33 -44 -24 -4 -69 -36 -34 -32 -83 -133 -49 -61 -49 -37 -49 -61 -50 58 31 3 -16 -35 -120 -44 -28 -13 13 39 32 24
12930B4j10j4%jO9k7p5Q7J3J4RJ0m0l9J8J8J8J8nmn9L8K8K7m1m2l2O5m5m4M5n1lR3rrn1J10
$$ 24 -86 -100 -100 -101 -32 -59 -134 -47 -34 -20 -11 -1 -41 -80 -62 -44 -26 -8 -13 -17 -76 -38 -10 17 -24 -66 -98 -33 -78 -122 -77 -128 -131 -38 -47 -56 -107 3
12912CJ1q5N4N4M2n5m3m3J9J16l5j32K8p0K2K1J17J9l8l9OPOPJ%n3n4P6k1m5N2j4j5qqM5M5
$$ 3 14 -71 -17 37 79 24 -19 -62 -43 73 38 -94 -66 -136 -114 -93 24 43 5 -34 -28 -21 -15 -8 -7 -7 -60 -114 -38 -59 -104 -52 -66 -81 -89 -97 -52 -7
12894gp6Q6kr8K1K1kR5rqJ%j35l9R5R5oor5KK8K9l5l5J4J3LLM0n8o9K8M8M8n0n0L1L0k7k8
$$ -7 -83 3 1 -97 -76 -55 -57 38 29 21 22 22 -113 -152 -57 38 32 26 -69 -67 -39 -10 -45 -80 -66 -53 -50 -47 -7 -65 -134 -106 -58 -10 -60 -110 -79 -49 -76 -104
12875a04K1K0K8K7k7k7Q5j2nok5k4K3p3R2onoj9k0K9L0J6J7o3o4P4P5J6q1j8j9J8J8M6n1m5
$$ -104 -83 -63 -35 -8 -35 -62 23 11 6 0 -25 -49 -26 -99 -7 -13 -18 -24 -43 -63 -34 -4 12 29 -34 -98 -24 51 67 -14 -32 -51 -33 -15 31 -20 -65
12857f5m4J2J2j03N9P5P5r2r3P1P0K2K2NMm3m4MNMMQQQQrrrrL6L6m5m4LMMLmmM4M4m8m8L3
$$ -65 -109 -97 -85 -188 -129 -54 21 -71 -164 -93 -23 -1 21 26 30 -13 -57 -53 -48 -44 -40 -32 -24 -16 -8 -17 -26 -35 -44 -8 28 -17 -61 -58 -54 -50 -47 -51 -55 -11 33 -15 -63 -30
12836c0L3n8n8K3K3j1j0j1j0O3O3j7j8j4j5L4L4non4n4K0K0K0K0l0l0J8J9J5J6l3l3M9N0J
$$ -30 3 -55 -113 -90 -67 -78 -88 -99 -109 -46 17 0 -18 -32 -47 -13 21 16 10 -44 -98 -78 -58 -38 -18 -48 -78 -60 -41 -26 -10 -43 -76 -27 23 24
12819B4Jl1l0K2j39l5J26K6K5K0J9k9k8LLMLkllkJ3J4l5l4l5l5J4J4lkllrj0L9L8N2N1o2o1
$$ 24 25 -6 -36 -14 -153 -188 -62 -36 -11 9 28 -1 -29 -26 -23 -19 -16 -18 -21 -24 -26 -13 1 -34 -68 -103 -138 -124 -110 -113 -115 -118 -121 -130 -140 -101 -63 -11 40 -22 -83
12799h3L8L8m2m2K6K6K7K6J3J4l5l5l9l8M3M2k9k9Q4Q4j3j3j3j3ooooklklk4k5o7R4L1L1m0
$$ -83 -45 -7 -49 -91 -65 -39 -12 14 27 41 6 -29 -68 -106 -63 -21 -50 -79 5 89 76 63 50 37 31 25 19 13 11 8 6 3 -21 -46 -113 -19 12 43 3
12781Cm0J5J5l4l4k0k1K8K7J9J9o2o2L1L2L2L2j4j4j3j4J2J2J2J1OON4N4j7j8o6o6K5K5k3
$$ 3 -37 -22 -7 -41 -75 -95 -116 -88 -61 -42 -23 -85 -147 -116 -84 -52 -20 -34 -48 -61 -75 -63 -51 -39 -28 -22 -16 38 92 75 57 -9 -75 -50 -25 -48
12764d8k4M3M2p1p0J7J7m7M9J24l7J1J1p6p7MMO3O3J4J5k6k6k6k6ppJ21j06l0l1O9O9PQq3
$$ -48 -72 -29 13 -58 -128 -111 -94 -141 -92 32 -5 6 17 -59 -136 -132 -128 -65 -2 12 27 1 -25 -51 -77 -84 -91 30 -76 -106 -137 -68 1 8 16 -67
12746f7P8l0l0k0j9K4K5m3N3R8j27ONL9L8j0j1k3k3k4k3ONNO%J%%L7L7l8l7p1K6N2N2OOr7
$$ -67 11 -19 -49 -69 -88 -64 -39 -82 -29 69 -58 -52 -47 -8 30 20 9 -14 -37 -61 -84 -78 -73 -68 -62 -62 -61 -61 -61 -24 13 -25 -62 -133 -107 -55 -3 3 9 -88
12727h8JJJJ04PN5m2OPo3o4J8J7j3j4k0P7K3K2j9k0L2L3J7q0j03N9O5l2m4m5Q5j2ooM2n5K0
$$ -88 -87 -86 -85 19 26 81 39 45 52 -11 -75 -57 -40 -53 -67 -87 -10 13 35 16 -4 28 61 78 -2 -105 -46 19 -13 -57 -102 -17 -29 -35 -41 1 -54 -34
12709c4K0K0K0j06qM6n1n4M3K5K5Q3j3j05j04N2N1J4J3o6R6N4m3M0n7o3L4K0J9l8N8L8j24
$$ -34 -14 6 26 -80 -88 -42 -93 -147 -104 -79 -54 29 16 -89 -193 -141 -90 -76 -63 -129 -33 21 -22 18 -39 -102 -68 -48 -29 -67 -9 29 -95
12694i5k6k7N2N3N8l9K3K3n4n4n8J02J2J2k8k8K0K1J7J8j18k1N3N2J0J0K1K0K0K0klQPj27
$$ -95 -121 -148 -96 -43 15 -24 -1 22 -32 -86 -144 -42 -30 -18 -46 -74 -54 -33 -16 2 -116 -137 -84 -32 -22 -12 9 29 49 69 67 64 72 79 -48
12677d8L3P8j8p2p2L5L5qpM1M1n7n7M6n1qpK8K9L6o2opj8j7J17K1l7l6m3N4m4N2M6M6J0q8
$$ -48 -15 63 45 -27 -99 -64 -29 -37 -44 -3 38 -19 -76 -30 -81 -89 -96 -68 -39 -3 -65 -71 -78 -96 -113 4 25 -12 -48 -91 -37 -81 -29 17 63 73 -15
12659a5P0k8j5j5k1k1M4M5M4M4o4o5L9n9M2M2kkj33K9K5K5n0M6qqn0n1j05qO4O4K1K2llN2
$$ -15 55 27 12 -3 -24 -45 -1 44 88 132 68 3 42 -17 25 67 65 63 -70 -41 -16 9 -41 5 -3 -11 -61 -112 -217 -225 -161 -97 -76 -54 -57 -60 -8
12642hm5L1L2n5n5L2L3k2k2N0m7M2M1R9j26N5m3K4K3p9J7oR0l9l9J2J2J3J2l2l2J6J7j4j4
$$ -8 -53 -22 10 -45 -100 -68 -35 -57 -79 -29 -76 -34 7 106 -20 35 -8 16 39 -40 -23 -29 61 22 -17 -5 7 20 32 0 -32 -16 1 -13 -27
12625b7qqo8K9K4K3L9L9J3q4j8j8j9j8m2N6M3M3L1o6j7P9j9j9o7K9ONNOJ7p9P8j9lmN1m6m8
$$ -27 -35 -43 -111 -82 -58 -35 4 43 56 -28 -46 -64 -83 -101 -143 -87 -44 -1 30 -36 -53 26 7 -12 -79 -50 -44 -39 -34 -28 -11 -90 -12 -31 -34 -38 13 -33 -81
12606h1M8M2n4opj8j8P6k2J30l1n0M6o7o6kkR6o6o9K9P7P7m9m8n5n5Q3j3qpJ9J9k9k9J7J7
$$ -81 -33 9 -45 -51 -58 -76 -94 -18 -40 90 59 9 55 -12 -78 -80 -82 14 -52 -121 -92 -15 62 13 -35 -90 -145 -62 -75 -83 -90 -71 -52 -81 -110 -93 -76
12589g6P2k5K6K6l4O3llm1N5j22L9R9o2n7L9l6l6M6j16N0N0M7n0q6P5J7J6o4R8lkl1l1r0P1
$$ -76 -4 -29 -3 23 -11 52 49 46 5 60 -62 -23 76 14 -43 -4 -40 -76 -30 -146 -96 -46 1 -49 -135 -60 -43 -27 -91 7 4 2 -29 -60 -150 -79
12571g9Q2q0n1J10R5j32o2L4J4J4J5J6p2p2P8j9M2M2o9K9l2O5j6j6n8n9L5L4Q9pj5j4k1k0
$$ -79 3 -77 -128 -18 77 -55 -117 -83 -69 -55 -40 -24 -96 -168 -90 -109 -67 -25 -94 -65 -97 -32 -48 -64 -122 -181 -146 -112 -23 -30 -45 -59 -80 -100
12555a00N9N9J1J1j1j2o0L7j61o5O4O4m2m2J68On1M6k5k5M1n6M7M7J2J3j22k6K2K3K9K8l7
$$ -100 -41 18 29 40 29 17 -43 -6 -167 -232 -168 -104 -146 -188 -20 -14 -65 -19 -44 -69 -28 -84 -37 10 22 35 -87 -113 -91 -68 -39 -11 -48
12540d8l7L8L8J4q2N9N9q1J6J5J6o6L2j7j7n4M4j1j1k8k8K0K1jj%jK0K0Q0j6o9K8l6J25r8
$$ -48 -85 -47 -9 5 -77 -18 41 -40 -24 -9 7 -59 -27 -44 -61 -115 -71 -82 -93 -121 -149 -129 -108 -109 -110 -110 -111 -91 -71 9 -7 -76 -48 -84 41 -57
12522e7%N8l9QRN7m0m4m3jjL5L5K9L0J1q5l7O0k2k2L9n8L2L2K5K6n9n9J6J5M6n2Q4Q4m0l9
$$ -57 -57 1 -38 -30 -21 36 -4 -48 -91 -92 -93 -58 -23 6 36 47 -38 -75 -15 -37 -59 -20 -78 -46 -14 11 37 -22 -81 -65 -50 -4 -56 28 112 72 33
12505C3m5m6O0l8J7J7K3K3j84M1M6M5J2J1k6k7j3j3j19J06k1k0L2L1n9J03l9l8k8k8Q6Q7n8
$$ 33 -12 -58 2 -36 -19 -2 21 44 -140 -99 -53 -8 4 15 -11 -38 -51 -64 -183 -77 -98 -118 -86 -55 -114 -11 -50 -88 -116 -144 -58 29 -29
12489b9n9L7L6M3n5l6l6L9L8nnM3M3n8n7K3K3l7l7O5l1RQn2M4L9L9l0l0o7L1J8J9N1m5m6N2
$$ -29 -88 -51 -15 28 -27 -63 -99 -60 -22 -27 -32 11 54 -4 -61 -38 -15 -52 -89 -24 -55 -46 -38 -90 -46 -7 32 2 -28 -95 -64 -46 -27 24 -21 -67 -15
12471a5j2j2opppj3j3O0l6J09n3L2L2j46m9N0N0j9j8l0O7O7l0k7k6K1K2q0J7n0M7O2l5K6K6
$$ -15 -27 -39 -45 -52 -59 -66 -79 -92 -32 -68 41 -12 20 52 -94 -143 -93 -43 -62 -80 -110 -43 24 -6 -33 -59 -38 -16 -96 -79 -129 -82 -20 -55 -29 -3
12454cm1m1L9M0m8m8L2L3j8j9K0K0Q2p8m9M8N1m6l9N7j6j5M5n2ONOOn9L8L2L2n6n6K4K4J0
$$ -3 -44 -85 -46 -6 -54 -102 -70 -37 -55 -74 -54 -34 48 -30 -79 -31 20 -26 -65 -8 -24 -39 6 -46 -40 -35 -29 -23 -82 -44 -12 20 -36 -92 -68 -44 -34
12437c4J1MMJ7q0L9n7j6J45o5o4KLKKM3M3onRRLLK7p1k2k2Q1j5j6Q2l7l7l6O0j1j1nmJ8J8
$$ -34 -23 -19 -15 2 -78 -39 -96 -112 33 -32 -96 -94 -91 -89 -87 -44 -1 -7 -12 -3 6 9 12 39 -32 -54 -76 5 -10 -26 56 19 -18 -54 6 -5 -16 -21 -25 -7 11
12417A1J3J2Lr4m0l9K4K4P2q9QJ04M0M1m2m2L9M0n3n3L4L4o8K9k5k6j6j6P1P1p4K4l1l2j0
$$ 11 24 36 39 -55 -95 -134 -110 -86 -14 -103 -95 9 49 90 48 6 45 85 32 -21 13 47 -21 8 -17 -43 -59 -75 -4 67 -7 17 -14 -46 -56
12400e6j1mnJ4J10n1n1n6M1o3J00J02Nj12N0L8j24j3j3n0J12K0K1rqqrK0K0J3J4L3o3rrj8
$$ -56 -67 -71 -76 -62 48 -3 -54 -110 -69 -132 -32 70 75 -37 13 51 -73 -86 -99 -149 -37 -17 4 -5 -13 -21 -30 -10 10 23 37 70 7 -2 -11 -29
12383b9j9L7o1K6K6k9k9J6J6K5K6n6J05N6j04m0m1jkQRm6N1j5j5j0rL4L4j5j4mmN0m7K7K8
$$ -29 -48 -11 -72 -46 -20 -49 -78 -62 -46 -21 5 -51 54 110 6 -34 -75 -76 -78 -70 -61 -107 -56 -71 -86 -96 -105 -71 -37 -52 -66 -70 -74 -24 -71 -44 -16
12365a6Jr6n8M0K1K1O1l5J9J9k4k5P9j8m2m1L3L3k5k4J8J7M7n0NNnnM0n7R1p1l5O3n5M2k3
$$ -16 -15 -111 -169 -129 -108 -87 -26 -61 -42 -23 -47 -72 7 -11 -53 -94 -61 -28 -53 -77 -59 -42 5 -45 -40 -35 -40 -45 -5 -62 29 -42 -77 -14 -69 -27 -50
12348e0P5J6j44%JmmN1m6J0RR4o7j6j5K2K3j5j4j4j4P3P3jjl5O1p4p3N9N9j1j1j32K9J16m6
$$ -50 25 41 -103 -103 -102 -106 -110 -59 -105 -95 -86 8 -59 -75 -90 -68 -45 -60 -74 -88 -102 -29 44 43 42 7 68 -6 -79 -20 39 28 17 -115 -86 30 -16
12330a6m4N2k2k3J03n9k1j17J8J14k1k0j6Q1K6K6l5l5r0PK3K2K9K9K1K0m4j40M8m8m9J13O2
$$ -16 -60 -8 -30 -53 50 -9 -30 -147 -129 -15 -36 -56 -72 9 35 61 26 -9 -99 -92 -69 -47 -18 11 32 52 8 -132 -84 -132 -181 -68 -6
12314fl6o1J00k2k1L6L7k9l0l6l6Rq8M7M7L8L8nmq5J3J03n8p1K5M2M1ONO0l7onP5P5j30l2
$$ -6 -42 -103 -3 -25 -46 -10 27 -2 -32 -68 -104 -95 -183 -136 -89 -51 -13 -18 -22 -107 -94 9 -49 -120 -95 -53 -12 -6 -1 59 22 16 11 86 161 31 -1
12297aj2j3K9o9j4j5L3L4j6Q2o4L3rrn4M2j8j8R3lQQp3K4P3k5k3k4q2Q0M4j17p1K6L2L3L3
$$ -1 -13 -26 3 -66 -80 -95 -62 -28 -44 38 -26 7 -2 -11 -65 -23 -41 -59 34 31 39 47 -26 -2 71 46 23 -1 -83 -3 41 -76 -147 -121 -89 -56 -23
12279b3L3K0p7k8k9Q3j5n1J11j0rj01O1Q1q0K1K0j7j7o6L1m8M8m9M9J4J11j8j8m9n0L2L1m2
$$ -23 10 30 -47 -75 -104 -21 -36 -87 24 14 5 -96 -35 46 -34 -13 7 -10 -27 -93 -62 -110 -62 -111 -62 -48 63 45 27 -22 -72 -40 -9 -51
12263e1m2J7J14l6l6k9l0KKn8L8K6p0L2L2L2o5L8L8J6J5j0j08M7M7j4j4M3n3j02nJ2J1J7J8
$$ -51 -93 -76 38 2 -34 -63 -93 -91 -89 -147 -109 -83 -153 -121 -89 -57 -122 -84 -46 -30 -15 -25 -133 -86 -39 -53 -67 -24 -77 -179 -184 -172 -161 -144 -126
12246a26M7M8N3m3j1j1j08N3J2J2K2K2j8j8j8j7L2L3k8O9M4n2q9P3M6n2J3J4n4n4nnO0O1k1
$$ -126 -79 -31 22 -21 -32 -43 -151 -98 -86 -74 -52 -30 -48 -66 -84 -101 -69 -36 -64 5 49 -3 -92 -19 27 -25 -12 2 -52 -106 -111 -116 -56 5 -16
12230a6k0L7L7N3j08l5O2klj4j4K8j33M0M0L1L0l5l4J4J4M0L9rrl4l3N3N3j24k7Q5j1J0J0
$$ -16 -36 1 38 91 -17 -52 10 8 5 -9 -23 5 -128 -88 -48 -17 13 -22 -56 -42 -28 12 51 42 33 -1 -34 19 72 -52 -79 6 -5 5 15
12213A5q3q3R1ol0O7%j%R6j9j9o1o1O7O7J4q2j0Q8l2l2J04n7j06N6qpLLpqJ8J7l5l4j4Q3K0
$$ 15 -68 -151 -60 -66 -96 -29 -29 -30 -30 66 47 28 -33 -94 -27 40 54 -28 -38 50 18 -14 90 33 -73 -17 -25 -32 -29 -26 -33 -41 -23 -6 -41 -75 -89 -6 14
12194A4p7J8J9q1Q2j6Q1mmJKJ2J3l6O1q3J4M5n2l0k9J3J3k8k8K0K1j4j4O1O1j2j08NJ02l1
$$ 14 -63 -45 -26 -107 -25 -41 40 36 32 33 35 47 60 24 85 2 16 61 9 -21 -50 -37 -24 -52 -80 -60 -39 -53 -67 -6 55 43 -65 -60 42 11
12177A1l1j%l0k9k9k9R8R9m7m7J2J2J2J2l4l3l4l3K7K7o3R8J1J1k7k7M1M0qqj1j1p1K5P6k2
$$ 11 -20 -21 -21 -51 -80 -109 -138 -40 59 12 -35 -23 -11 1 13 -21 -54 -88 -121 -94 -67 -130 -32 -21 -10 -37 -64 -23 17 9 1 -10 -21 -92 -67 9 -13
12159a3l1l1p9Q3l1l2JJM0M0P1r1k9O7K9L0j3j2l4l5J4J4L9L8nmp1K5nmn1n0P2P3o4R8j7j7
$$ -13 -44 -75 -154 -71 -102 -134 -133 -132 -92 -52 19 -72 -101 -34 -5 25 12 0 -34 -69 -55 -41 -2 36 31 27 -44 -19 -24 -28 -79 -129 -57 16 -48 50 33 16
12141A6l9l9LLJ5q2N3N4j3j3K9K9M7n1j35K6qqKKO1O1L5o1j2j2M4M5j67N8J3J2L3L3p9q0O1
$$ 16 -23 -62 -59 -56 -41 -123 -70 -16 -29 -42 -13 16 63 12 -123 -97 -105 -113 -111 -109 -48 13 48 -13 -25 -37 7 52 -115 -57 -44 -32 1 34 -45 -125 -64
12124f4O2J3J3L4L3j43m7J66Mr8kj9j9j4j3M3M2ooL2L3r0r1R6o6l0O7J4J5K0K1J2J1J2J1o8
$$ -64 -2 11 24 58 91 -52 -99 67 71 -27 -29 -48 -67 -81 -94 -51 -9 -15 -21 11 44 -46 -137 -41 -107 -137 -70 -56 -41 -21 0 12 23 35 46 -22
12107b2o7k0j9K2K2K2K1J6J6J5J6n8n8K3K2ONNNj7j7L1L2LMLLl2l3NNQ9p2J8J8n9o0K2K1l1
$$ -22 -89 -109 -128 -106 -84 -62 -41 -25 -9 6 22 -36 -94 -71 -49 -43 -38 -33 -28 -45 -62 -31 1 4 8 11 14 -18 -51 -46 -41 48 -24 -6 12 -47 -107 -85 -64 -95
12087i5l1J8J8PQQP%J%%M8M7j%k9k9k9k9L5L5j4j4j2j3L5L6p7p6O8O9noonJ5J6J6J5j0j0j0
$$ -95 -126 -108 -90 -83 -75 -67 -60 -60 -59 -59 -59 -11 36 35 35 6 -23 -52 -81 -46 -11 -25 -39 -51 -64 -29 7 -70 -146 -78 -9 -14 -20 -26 -31 -16 0 16 31 21 11 1
12067Aj0M8M9OOr9kQ3p8l8l7M4j18L6L6k3k2L0L0L6L6q7QR0pn8n8K3K3k1P5J12m9k6k5l0k9
$$ 1 -9 39 88 94 100 1 -1 82 4 -34 -71 -27 -145 -109 -73 -96 -118 -88 -58 -22 14 -73 -65 25 18 -40 -98 -75 -52 -73 2 114 65 39 14 -16 -45
12050d5M9J46j02np6K1l9N7K7p0j0rmlN1N1n6M2j3j3p8p8llJ04Pk9J32J3J3j62O3O9r2O7l0
$$ -45 4 150 48 43 -33 -12 -51 6 33 -37 -47 -56 -60 -63 -12 39 -17 25 12 -1 -79 -157 -160 -163 -59 -52 -81 51 64 77 -85 -22 47 -45 22 -8
12033hKLmln6n6M7n0N9N9l4l4M8m8OOK3K3K3K4j4j4j4j4Q6Q5%r7j08j2k4k4M5M5mmk9k8J9
$$ -8 -6 -3 -7 -10 -66 -122 -75 -125 -66 -7 -41 -75 -27 -75 -69 -63 -40 -17 6 30 16 2 -12 -26 60 145 145 48 -60 -72 -96 -120 -75 -30 -34 -38 -67 -95 -76
12014g6J9J8J7K4K3p7K0m9m8J53p3k1k0k2P4o0o1LMN1N1j7j8j8j7NONOkkpqP1k5J6J14jr9
$$ -76 -57 -39 -22 2 25 -52 -32 -81 -129 24 -49 -70 -90 -112 -38 -98 -159 -156 -152 -101 -50 -67 -85 -103 -120 -115 -109 -104 -98 -100 -102 -109 -117 -46 -71 -55 59 58 -41
11995d1o8K9K8K9o2L5o8K9NNM7M6j24L6L8L8opK6p2PPl6l6M5M4j4j5K8K8K5p2k7k8R4o8L3
$$ -41 -109 -80 -52 -23 -85 -50 -118 -89 -84 -79 -32 14 -110 -74 -36 2 -4 -11 15 -57 -50 -43 -79 -115 -70 -26 -40 -55 -27 1 26 -46 -73 -101 -7 -75 -42
11978d2L3k4J38qpJ1q6J1J2K9o8l7l7K1K0k7k8K6K6J6J5R8o3m7m8o1L5NNL0L1o0o0J52rK3
$$ -42 -9 -33 105 97 90 101 15 26 38 67 -1 -38 -75 -54 -34 -61 -89 -63 -37 -21 -6 92 29 -18 -66 -127 -92 -87 -82 -52 -21 -81 -141 11 2 25
11961B5p4k0k1rqM3n3nnO8k9K6K6j9j9L6L5k0P7k7k6LMj06N6m3N5j6j14P0O9J5J5j4j4k0k0
$$ 25 -49 -69 -90 -99 -107 -64 -117 -122 -127 -59 -88 -62 -36 -55 -74 -38 -3 -23 54 27 1 4 8 -98 -42 -85 -30 -46 -160 -90 -21 -6 9 -5 -19 -39 -59
11943e9L0o7J2J1k2k3Q0j7J1J1k0k0M1M0J6J7j8j7PPn9n9K2K2N3N2k9k8j0j1J4J4k4k5%jj4
$$ -59 -29 -96 -84 -73 -95 -118 -38 -55 -44 -33 -53 -73 -32 8 24 41 23 6 13 20 -39 -98 -76 -54 -1 51 22 -6 -16 -27 -13 1 -23 -48 -48 -49 -63
11925f3j4J0J0%%J%J6J7J7J6k0k0K8K9k2k1KLj%o1J32k4k5K4K3j33O1%%kjM7M6n9o0j2j1J4
$$ -63 -77 -67 -57 -57 -57 -56 -56 -40 -23 -6 10 -10 -30 -2 27 5 -16 -14 -11 -12 -12 -73 59 35 10 34 57 -76 -15 -15 -15 -17 -18 29 75 16 -44 -56 -67 -53
11906e3J5l4l3mlM6M5nonnmmmmopppN3N3MMp9p9JKn2n2mmO2O2O2O2n7n7qrJ7J7J7J7OOOOP
$$ -53 -38 -72 -105 -109 -112 -66 -21 -26 -32 -37 -42 -46 -50 -54 -58 -64 -71 -78 -85 -32 21 25 29 -50 -129 -128 -126 -178 -230 -234 -238 -176 -114 -52 10 -47 -104 -112 -121 -104 -87 -70 -53 -47 -41 -35 -29 -22
11883b2QQPrrJ4J5J7J6k6k6m6N0mnJ1J1J7J7n6M0qpp4K4k5k5p5K3J6J6L2L1j7j7J5J6N8j04
$$ -22 -14 -6 1 -8 -17 -3 12 29 45 19 -7 -53 -3 -7 -12 -1 10 27 44 -12 28 20 13 -61 -37 -62 -87 -162 -139 -123 -107 -75 -44 -61 -78 -63 -47 11 -93
11865i3%%rj0N3N3q3J5K6K6Or1j3j3m9M7J8J8M8M9l7l7L8L8K8o8k0P6J0J0o4o5J4J3J4J3l0
$$ -93 -93 -93 -102 -112 -59 -6 -89 -74 -48 -22 -16 -107 -120 -133 -182 -135 -117 -99 -51 -2 -39 -76 -38 0 28 -40 -60 16 26 36 -28 -93 -79 -66 -52 -39 -69
11847f9l1j2j3J01Lk8k9P9j8m8M8Mr3K1K2l8N9NMJKJKk3k2k8k9J45M9r1Op2K5J5J5L0j33m7
$$ -69 -100 -112 -125 -24 -21 -49 -78 1 -17 -65 -17 -13 -106 -85 -63 -101 -42 -37 -33 -32 -30 -29 -27 -50 -72 -100 -129 16 65 -26 -20 -92 -67 -52 -37 -7 -140 -187
11829a87M9M4M3l1l2O0N9Jr5M8M8M8m9rqq9r0J7J13O4l2kkL1L0K8j34m9M8M3M2L7j25n5J06
$$ -187 -138 -94 -51 -82 -114 -54 5 6 -89 -41 7 55 6 -3 -11 -100 -190 -173 -60 4 -28 -30 -32 -1 29 57 -77 -126 -78 -35 7 44 -81 -136 -30
11812c0L0L0j%k5k4l1l0J8J8k3k3K5K6k5k4J7J8N0m7R9o3rrL5o1L4L3Qq9o2L4N3m4rrL3L3
$$ -30 0 30 29 29 4 -20 -51 -81 -63 -45 -68 -91 -66 -40 -65 -89 -72 -54 -4 -51 48 -15 -24 -33 2 -59 -25 8 16 -73 -135 -101 -48 -92 -101 -110 -77 -44
11794d4j4j5qqq3J4R4kK5K5K6K5n2M4j6j6M7n1m4N3m9M7L5o1r5KK3K2M2M2o4o5m9M7L6L5P7
$$ -44 -58 -73 -81 -89 -172 -158 -64 -66 -41 -16 10 35 -17 27 11 -5 42 -9 -53 0 -49 -2 33 -28 -123 -121 -98 -76 -34 8 -56 -121 -170 -123 -87 -52 25
11777B5j9m0l9n4M4l6l5J6J6J5J6KKqqJ00o2L0K9l9l9L6L6J6q1N3m5j0j0L2L3l0l0N1N1kj
$$ 25 6 -34 -73 -127 -83 -119 -154 -138 -122 -107 -91 -89 -87 -95 -103 -3 -65 -35 -6 -45 -84 -48 -12 4 -77 -24 -69 -79 -89 -57 -24 -54 -84 -33 18 16 15
11759A5n0n0j9j8k5P2k5k6M5n1l7J25P0r1k2k2J6J6j6j7L3L2m8m8Q8j0M1M0J5q3n0M6l2l3
$$ 15 -35 -85 -104 -122 -147 -75 -100 -126 -81 -132 -169 -44 26 -65 -87 -109 -93 -77 -93 -110 -77 -45 -93 -141 -53 -63 -22 18 33 -50 -100 -54 -86 -119
11743a19j5Q3Q2j5l3l2RJ0J3J3p2K5M5n2L9n8O8O7p9J7K0p6QQjjK4K4l5l5M4n3j2j1L1L1R
$$ -119 -134 -51 31 16 -17 -49 -40 -30 -17 -4 -76 -51 -6 -58 -19 -77 -9 58 -21 -4 16 -60 -52 -44 -45 -46 -22 2 -33 -68 -24 -77 -89 -100 -69 -38 -29
11725b9RM5n2n1M6NJ02k2j19j0j0NNNMJ2J2o1L6j1Q6Q9p1j09N3N4m2k4k3l5O1j2j3M7m9L5
$$ -29 -20 25 -27 -78 -32 -27 75 53 -66 -76 -86 -81 -76 -71 -67 -55 -43 -104 -68 -79 7 96 25 -84 -31 23 -19 -43 -66 -101 -40 -52 -65 -18 -67 -32
11708c2L5n0M7j0j1p4p5n9J02N9O0J9J9q4J3j7j6l5l5J8J8M2M2L0L0Lr3lmj0j0K0J9l5O2j7
$$ -32 3 -47 0 -10 -21 -95 -170 -229 -127 -68 -8 11 30 -54 -41 -58 -74 -109 -144 -126 -108 -66 -24 6 36 39 -54 -57 -61 -71 -81 -61 -42 -77 -15 -32
11691c2j7nnl2O6NNL2o4j6j6P3k4j8j8m5m5P4P4m6N0J3J4L3o5l4O3m3N4r2Ok2P5K7K6l3l4
$$ -32 -49 -54 -59 -91 -25 -20 -15 17 -47 -63 -79 -6 -30 -48 -66 -111 -156 -82 -8 -54 -4 9 23 56 -9 -43 20 -23 31 -61 -55 -77 -2 25 51 18 -16
11673a6m0m0P5k3j6j6k6k5P8k0L5L5k0k0PQr6JK9K9L0K9L1o6j1j1M1M2l9l9J7J8P8j9p3K4
$$ -16 -56 -96 -21 -44 -60 -76 -102 -127 -49 -69 -34 1 -19 -39 -32 -24 -120 -119 -90 -61 -31 -2 29 -37 -48 -59 -18 24 -15 -54 -37 -19 59 40 -33 -9
11656iL4L3K5j37L5L5j9j8pj03l0O7mlJ31k9J2J3ppn5n5L4L4j4j5M9N0onL5o2kjp1K5k8k9
$$ -9 25 58 83 -54 -19 16 -3 -21 -28 -131 -161 -94 -98 -101 30 1 13 26 19 12 -43 -98 -64 -30 -44 -59 -10 40 34 29 64 2 0 -1 -72 -47 -75 -104
11638a04K9L0K9K9m1m1L3L4P0k7j08j0K0K0N6m0L3L3K8p0O0l6J8J7l2O4o1o1m0J21j7j8%j
$$ -104 -75 -45 -16 13 -28 -69 -36 -2 68 41 -67 -77 -57 -37 19 -21 12 45 73 3 63 27 45 62 30 94 33 -28 -68 53 36 18 18 17
11622A7M9j14n5M1POj1Q6PPl2l3M9M8p1p0J6J6p5K3J6J6l3l4J6J5K0K0N1m7opNOP1k6k6P1
$$ 17 66 -48 -103 -62 -55 -49 -60 26 33 40 8 -25 24 72 1 -69 -53 -37 -112 -89 -73 -57 -90 -124 -108 -93 -73 -53 -2 -49 -55 -62 -57 -51 20 -6 -32 39
11604C9k3k3L7n9nnj1j1qqqqL1L1OPK4K5p9J9J4J4k9k8K9L0L6o1j9j8K3K4n0n0NNp2K5N1N1
$$ 39 16 -7 30 -29 -34 -39 -50 -61 -69 -77 -85 -93 -62 -31 -25 -18 6 31 -48 -29 -15 -1 -30 -58 -29 1 37 -24 -43 -61 -38 -14 -64 -114 -109 -104 -176 -151 -100 -49
11584d9j6j6j6Q1p1K5L2o6N7N6n2M4m0m0RRM5n1k1k1J8J8J8J8%J%JJ1J1j3j3J7J7l2l2L4L3
$$ -49 -65 -81 -97 -16 -87 -62 -30 -96 -39 17 -35 9 -31 -71 -62 -53 -8 -59 -80 -101 -83 -65 -47 -29 -29 -28 -28 -27 -16 -5 -18 -31 -14 3 -29 -61 -27 6
11566Fj5j5rrrj0K7K6n5n4O5O4m8m8J4J4J3J4l1l1J8J8lkJ0Ro4J28o1o1O4O3q2q2M0M0rqM4
$$ 6 -9 -24 -33 -42 -51 -61 -34 -8 -63 -117 -52 12 -36 -84 -70 -56 -43 -29 -60 -91 -73 -55 -58 -60 -50 -41 -105 23 -38 -99 -35 28 -54 -136 -96 -56 -65 -73 -29
11548b9M4nmo7o7M7M6K7K6N5j39RQK0K0mnk9k9K0J9QQJ07q7q6J07k7k7j5j4K2K2lkl0l0J9
$$ -29 15 10 6 -61 -128 -81 -35 -8 18 73 -66 -57 -49 -29 -9 -13 -18 -47 -76 -56 -37 -29 -21 86 -1 -87 20 -7 -34 -49 -63 -41 -19 -22 -24 -54 -84 -65
11530f5J8j%K3K4m7m7JJPOj8j7N2N2J6J6j06Q7k2k2K3K3k5k5qqK8K8L4j61L0K9NNNMQPk9O7
$$ -65 -47 -48 -48 -25 -1 -48 -95 -94 -93 -86 -80 -98 -115 -63 -11 5 21 -85 2 -20 -42 -19 4 -21 -46 -54 -62 -34 -6 28 -133 -103 -74 -69 -64 -59 -55 -47 -40 -69 -2
11510bJ6q0%R7L4o2K2K2j9k0o4L3j20M2N9l7J8J9p3K4O7l0PO%JM2M3j8j16j2j2K8K8M4n3n3
$$ -2 14 -66 -66 31 65 3 25 47 28 8 -56 -23 -143 -101 -42 -79 -61 -42 -115 -91 -24 -54 -47 -41 -41 -40 2 45 27 -89 -101 -113 -85 -57 -13 -66 -119
11492a19J08N4j08L9M0n7n8P0k8p0K7k0P5MLk1k1K8K7k2k3L2o5N0M9j1j1O7l0L0o6onL0L1
$$ -119 -11 43 -65 -26 14 -43 -101 -31 -59 -129 -102 -122 -47 -43 -40 -61 -82 -54 -27 -49 -72 -40 -105 -55 -6 -17 -28 39 9 39 -27 -33 -38 -8 23
11476B3M9m8m1m2k1k0K1K2O6l1n7n7J2J1N9O0l7l7L8L8J4q2rj0P5k1QRn9n9mmqQ9L4L5k9k9
$$ 23 72 24 -17 -59 -80 -100 -79 -57 9 -22 -79 -136 -124 -113 -54 6 -31 -68 -30 8 22 -60 -69 -79 -4 -25 -17 -8 -67 -126 -130 -134 -142 -53 -19 16 -13 -42
11458d2J05n7L7o0L8L9r6%j03N9N2m5J9K0j4j4L5L4kjn0n1K8K7K7K7k1k1LMJ4J5l4l4M5M4
$$ -42 63 6 43 -17 21 60 -36 -36 -139 -80 -28 -73 -54 -34 -48 -62 -27 7 5 4 -46 -97 -69 -42 -15 12 -9 -30 -27 -23 -9 6 -28 -62 -17 27
11440B7o8o8QRj6j6L1L2j8j7L8L8p5p5N8N9J0J0rj0J5J5PPj7j8N2N1k9k9o6o6M6M7N1N2m0
$$ 27 -41 -109 -101 -92 -108 -124 -93 -61 -79 -96 -58 -20 -95 -170 -112 -53 -43 -33 -42 -52 -37 -22 -15 -8 -25 -43 9 60 31 2 -64 -130 -84 -37 14 66 26
11423B6m0M9j13KLN5N5k6k5j0rl4l3RJ0J0J0l7l8M4M3J0RJ0Ro4o4Q1Q2l3l3p5Q6J3J4K4K3
$$ 26 -14 35 -78 -76 -73 -18 37 11 -14 -24 -33 -67 -100 -91 -81 -71 -61 -98 -136 -92 -49 -39 -30 -20 -11 -75 -139 -58 24 -9 -42 -117 -31 -18 -4 20 43
11405D3k0k1k1k0L4L4J1J0n5n5K6K5k2k3k2k3J9J8onL6L7j2j1j0rJ5J5m4m4jkQ1j6j6j6M8
$$ 43 23 2 -19 -39 -5 29 40 50 -5 -60 -34 -9 -31 -54 -76 -99 -80 -62 -68 -73 -37 0 -12 -23 -33 -42 -27 -12 -56 -100 -101 -103 -22 -38 -54 -70 -22
11387b2m8m2m2O1O1l0k9J36k4nmj08N4l8l7K6K7J07n5P1r1%%o1J00RRn4n4onJ6J7J0J0N8m0
$$ -22 -70 -112 -154 -93 -32 -62 -91 45 21 16 12 -96 -42 -80 -117 -91 -64 43 -12 59 -32 -32 -32 -93 7 16 25 -29 -83 -89 -94 -78 -61 -51 -41 17 -23
11370b3l3l3kjN4m4m0m0k6P1R2nm7N0NON4j08lmM1n6M9N0l8l7J5J5RRN8l9nj02l4O3qqJ09
$$ -23 -56 -89 -91 -92 -38 -82 -122 -162 -188 -117 -25 -30 -77 -27 -22 -16 38 -70 -73 -77 -36 -92 -43 7 -31 -68 -53 -38 -29 -20 38 -1 -6 -108 -142 -79 -87 -95 14
11351A4n2L8L9j9j9j9j9m0l9R5jN4N4n5n4j08N3J1J2JJO5l1r2O9O2r8k5k5J4J3ooooN6N5n3
$$ 14 -38 0 39 20 1 -18 -37 -77 -116 -21 -22 32 86 31 -23 -131 -78 -67 -55 -54 -53 12 -19 -111 -42 20 -78 -103 -128 -114 -101 -107 -113 -119 -125 -69 -14 -67
11333f7M3O9k8p6K0Q7rk0k0j10N1%jM0j21J2J3M8m9OOM5M5l5l5L7L7j7j7M8m8OOp1p0K0J18
$$ -67 -24 45 17 -59 -39 48 39 19 -1 -111 -60 -60 -61 -21 -142 -130 -117 -69 -118 -112 -106 -61 -16 -51 -86 -49 -12 -29 -46 2 -46 -40 -34 -105 -175 -155 -37
11315c7LLl9l9L7L6m4m4M1M0m6m6Q0j7j0j1K0K1K0K1J8J9o3o2K8K7j4j5j0Q7j6j6K6K5q7q7
$$ -37 -34 -31 -70 -109 -72 -36 -80 -124 -83 -43 -89 -135 -55 -72 -82 -93 -73 -52 -32 -11 7 26 -37 -99 -71 -44 -58 -73 -83 4 -12 -28 -2 23 -64 -151
11298a51L1L1L1L1k2k1L3o4K7K7k2k2j6Q1k2P5q6J1J30L4o1o1J4J4q4q4K9K8Q0Q1K1p5k7k6
$$ -151 -120 -89 -58 -27 -49 -70 -37 -101 -74 -47 -69 -91 -107 -26 -48 27 -59 -48 82 116 55 -6 8 22 -62 -146 -117 -89 -9 72 93 18 -9 -35
11282c5k6k7q1J6M2M2QPppJ15j10p5Q7opn7L9O0l7K3K4%JnnM3n4n4M3MMO5l3J0J0MMl3l3K1
$$ -35 -61 -88 -169 -153 -111 -69 -61 -54 -61 -68 47 -63 -138 -51 -57 -64 -121 -82 -22 -59 -36 -12 -12 -11 -16 -21 22 -32 -86 -43 -39 -35 30 -3 7 17 21 25 -8 -41 -20
11263b0p5M5M5N0m6n4M3L7o0j5j5J8J7J25l6q1J6o3o4N5N6j2j2M3n4L4L5k0j9RJ0J0RK9K9
$$ -20 -95 -50 -5 45 -1 -55 -12 25 -35 -50 -65 -47 -30 95 59 -22 -6 -69 -133 -78 -22 -34 -46 -3 -57 -23 12 -8 -27 -18 -8 2 11 40 69
11246F9j9k0QQj28l0P8P9o1o1LLN8N7j16j9k5k5M5M6llJ5J5J5J6onnnl4l3O9k7k1k0O4O4j29
$$ 69 50 30 38 46 -82 -112 -34 45 -16 -77 -74 -71 -13 44 -72 -91 -116 -141 -96 -50 -53 -56 -41 -26 -11 5 -1 -6 -11 -16 -50 -83 -14 -41 -62 -82 -18 46 -83
11227h3L2k1k0J11n1q9Qj3Q4Q9pl6l5m8M9j4j3qpn8n9N5N4M5M4n8L8j8j9j3j2jj%jL0L0n0
$$ -83 -51 -72 -92 19 -32 -121 -113 -126 -42 47 40 4 -31 -79 -30 -44 -57 -65 -72 -130 -189 -134 -80 -35 9 -49 -11 -29 -48 -61 -73 -74 -75 -75 -76 -46 -16 -66
11209f6n1J3J3K5p2J1J08jjNMkknj01n4M4L7L8M4M3m0l9M0M1mnKKo3L5j4j4l6O1n4M3J8p9
$$ -66 -117 -104 -91 -66 -138 -127 -19 -20 -21 -16 -12 -14 -16 -21 -122 -176 -132 -95 -57 -13 30 -10 -49 -9 32 28 23 25 27 -36 -1 -15 -29 -65 -4 -58 -15 3 -76
11191g6j9j8J2J1J2J2l1l1k5k5K3J21k1k1O1l6k9l0PPlmR4o8L3L3j20M1K5K4Rq9J02Mk9k9
$$ -76 -95 -113 -101 -90 -78 -66 -97 -128 -153 -178 -155 -34 -55 -76 -15 -51 -80 -110 -103 -96 -99 -103 -9 -77 -44 -11 -131 -90 -65 -41 -32 -121 -19 -15 -44 -73
11173g3m7N0K6p1M5n2R2R3n8n9J8J7l7O0j7j8j8P9p1p0N4N4o0L6j2j3l9N8N8l9l9l9n2M6N8
$$ -73 -120 -70 -44 -115 -70 -122 -30 63 5 -54 -36 -19 -56 4 -13 -31 -49 30 -41 -111 -57 -3 -63 -27 -39 -52 -91 -33 25 -14 -53 -92 -144 -98 -40
11157d0N8l9N8l8l8J1J1L1o6o6L1L7L7nnkjMNo2L4j9k0N7N6r5r5R5lL4L4l5O3o3o3j16M6R0
$$ -40 18 -21 37 -1 -39 -28 -17 14 -52 -118 -87 -50 -13 -18 -23 -25 -26 -22 -17 -79 -45 -64 -84 -27 29 -66 -161 -66 -69 -35 -1 -36 27 -36 -99 -215 -169 -79
11139g9pk9k9O8k9J9J8J3J2l5l6J03n8K6K7J07n4o2o2L0o6L5L4L5o2jjqpJ7J6J7J6jjk5k5
$$ -79 -86 -115 -144 -76 -105 -86 -68 -55 -43 -78 -114 -11 -69 -43 -16 91 37 -25 -87 -57 -123 -88 -54 -19 -81 -82 -83 -91 -98 -81 -65 -48 -32 -33 -34 -59 -84
11121h4j5j6J24l8l6l6L4L5j5j5K7K8O4l3K1K2r8r8J00o2M8m8K0K0nmnnK0J9J9J9j%ppL6o1
$$ -84 -99 -115 9 -29 -65 -101 -67 -32 -47 -62 -35 -7 57 24 45 67 -31 -129 -29 -91 -43 -91 -71 -51 -56 -60 -65 -70 -50 -31 -12 7 6 6 -1 -8 28 -33
11103c3j2j2M2n5n4M2J0J0J6J6kkq3q2N4N4%jJ11J4k3j19J7J8N9O0l1l0n5n5P3P2n1n1J00
$$ -33 -45 -57 -15 -70 -124 -82 -72 -62 -46 -30 -32 -34 -117 -199 -145 -91 -91 -92 19 33 10 -109 -92 -74 -15 45 14 -16 -71 -126 -53 19 -32 -83 17
11086A7o1o7R4Mr2k7k8N1N1k9l0N6N6k5k5L4L5p9p8L8L8L8L9l5l4k8k9K9J25nmq5J1M3M3r7
$$ 17 -44 -111 -17 -13 -105 -132 -160 -109 -58 -87 -117 -61 -5 -30 -55 -21 14 -65 -143 -105 -67 -29 10 -25 -59 -87 -116 -87 38 33 29 -56 -45 -2 41 -56
11069e6%opO7O6M6n0j18k1N4m3O8O9n1n0j3j2J3J2J5J6qrNMj9k0l0k9j4Q3P8q3N5j05J5J5
$$ -56 -56 -62 -69 -2 64 110 60 -58 -79 -25 -68 0 69 18 -32 -45 -57 -44 -32 -17 -1 -9 -18 -13 -9 -28 -48 -78 -107 -121 -38 40 -43 12 -93 -78 -63
11051f3K9L0j1j0J4J3k8k9l5O3k2k2Q7j0k9k8l5l5l6l6m2N5N7N6L9L9l2l3qqqqqQ9n8L8p4
$$ -63 -34 -4 -15 -25 -11 2 -26 -55 -90 -27 -49 -71 16 6 -23 -51 -86 -121 -157 -193 -235 -180 -123 -67 -28 11 -21 -54 -62 -70 -78 -86 -94 -5 -63 -25 -99
11034i9K2Q5p7J4J4P7k0j4j5k9l0onN6N7KKj7j14m0N7P9j7o0L7K6K5P5q7%%j00O1nnN4N4j8
$$ -99 -77 8 -69 -55 -41 36 16 2 -13 -42 -72 -78 -83 -27 30 32 34 17 -97 -137 -80 -1 -18 -78 -41 -15 10 85 -2 -2 -2 -102 -41 -46 -51 3 57 39
11016C9j7K5K5M4n3n3M5l4l4P6k2m4m5klm8m7L2L3qrM0M0j8j7j8j7lmN2m6K5K6k3k3M0J38
$$ 39 22 47 72 116 63 10 55 21 -13 63 41 -3 -48 -50 -53 -101 -148 -116 -83 -91 -100 -60 -20 -38 -55 -73 -90 -93 -97 -45 -91 -66 -40 -63 -86 -46 92
10998I2r5r5P6P5o0o0o0J01L5L4RRK5p1j05N6KKK9o7NON0m7R8o2k6k5rQ8o9o9K7J25J0Ro3
$$ 92 -3 -98 -22 53 -7 -67 -127 -26 9 43 52 61 86 15 -90 -34 -32 -30 -1 -68 -63 -57 -7 -54 44 -18 -44 -69 -78 10 -59 -128 -101 24 34 43 -20
10980b0L4j4j4J8J15p5p5k1k0K6K7n9L9O3l4M3n4p2Q9qplkK8o9M2M1o7L0PPK6p2o0L6poN3
$$ -20 14 0 -14 4 119 44 -31 -52 -72 -46 -19 -78 -39 24 -10 33 -21 -93 -4 -12 -19 -22 -24 4 -65 -23 18 -49 -19 -12 -5 21 -51 -111 -75 -82 -88 -35
10962c5m3r9R6J6J7k0k0N0N1l0l0J9K0J9J9p6p7L7L6J5J5j0rk6k7k6k6O6O7j3j4J%l5l6r3
$$ -35 -78 -177 -81 -65 -48 -68 -88 -38 13 -17 -47 -28 -8 11 30 -46 -123 -86 -50 -35 -20 -30 -39 -65 -92 -118 -144 -78 -11 -24 -38 -37 -37 -72 -108 -201
10945b01J01P1k6j9j9N6N5k7k7lll2l2J6J6j9k0K9K9n9n9K1K2J9J8J9J9lkM6M6lln2n2J1J1
$$ -201 -100 -29 -55 -74 -93 -37 18 -9 -36 -39 -42 -74 -106 -90 -74 -93 -113 -84 -55 -114 -173 -152 -130 -111 -93 -74 -55 -58 -60 -14 32 29 26 -26 -78 -67 -56
10927e6N9O0m6m5LLJ8J8l1l0L2L2j6j7l0l0p0J23N0j45J04r0N3m3o1L5J16J8k3P3o8o7N1N2
$$ -56 3 63 17 -28 -25 -22 -4 14 -17 -47 -15 17 1 -16 -46 -76 -146 -23 27 -118 -14 -104 -51 -94 -155 -120 -4 14 -9 64 -4 -71 -20 32
10911C2nmk9k8J9K0k8k8K3K3j4j3J01r2J0J1J2q3n8J36p7p7M8M8m6m5O4l3k0P7pqOPOOk4k5
$$ 32 27 23 -6 -34 -15 5 -23 -51 -28 -5 -19 -32 69 -23 -13 -2 10 -73 -131 5 -72 -149 -101 -53 -99 -144 -80 -113 -133 -56 -63 -71 -65 -58 -52 -46 -70 -95
10893i5J8J8N8l9M0n7Jr6L3L4n4n4noQ1Q0k6k6j0Q8n7J03L0L0m7m7M1n5n5M2k0k0o2R9N3m3
$$ -95 -77 -59 -1 -40 0 -57 -56 -152 -119 -85 -139 -193 -198 -204 -123 -43 -69 -95 -105 -17 -74 29 59 89 42 -5 36 -19 -74 -32 -52 -72 -134 -35 18 -25
10876b5k7k7rqM6M6p2K5M9m8jkN8j02poMJ00N2m5M5M6j00lr3LN4m3J18m3p1R0j0j0j0j0J6
$$ -25 -52 -79 -88 -96 -50 -4 -76 -51 -2 -50 -51 -53 5 -97 -104 -110 -106 -6 46 1 46 92 -8 -11 -104 -101 -47 -90 28 -15 -86 4 -6 -16 -26 -36 -20
10858b0J13n6n5jjk8k7K1K1ooM9m9PPj1Q6L3o5l3l4P3k3q2J5J14m6l1l0M1M1n2M5P9j47j4
$$ -20 93 37 -18 -19 -20 -48 -75 -54 -33 -39 -45 4 -45 -38 -31 -42 44 77 12 -21 -55 18 -5 -87 -72 42 -4 -35 -65 -24 17 -35 10 89 -58 -72
10841g2j4L0L1j8j8RRLLL4o2o3L4poK3K4J0J0l8l9J8J8p3Q8POl8l7Q0j7k0k1J21m0N6m0j6
$$ -72 -86 -56 -25 -43 -61 -52 -43 -40 -37 -3 -65 -128 -94 -101 -107 -84 -60 -50 -40 -78 -117 -99 -81 -154 -66 -59 -53 -91 -128 -48 -65 -85 -106 15 -25 31 -9 -25
10823b5j5n2M5MMJ0J0n0n0R5R6m3m3j03oR4lJ24l7l0k9m6N1l7l7poL3L3k1k1K8o9J2J09o4
$$ -25 -40 -92 -47 -43 -39 -29 -19 -69 -119 -24 72 29 -14 -117 -123 -29 -32 92 55 25 -4 -50 1 -36 -73 -80 -86 -53 -20 -41 -62 -34 -103 -91 18 -46
10806d6o5K9K9n3M3J4J4J6J7n6M2p2K5Or0PPK6K5N5N6k0j9p5K3l9l8J18K1j2j1L0o7L5L6m0
$$ -46 -111 -82 -53 -106 -63 -49 -35 -19 -2 -58 -16 -88 -63 -57 -147 -140 -133 -107 -82 -27 29 9 -10 -85 -62 -101 -139 -21 0 -12 -23 7 -60 -25 11 -29
10789b9m1QQj2j2J2J2J3J4j7j7O9k8KKk8k8J4J4K1p7K7K6rrrrk6k7Q7Q6p9p9k1P7MMJ0J1L
$$ -29 -70 -62 -54 -66 -78 -66 -54 -41 -27 -44 -61 8 -20 -18 -16 -44 -72 -58 -44 -23 -100 -73 -47 -56 -65 -74 -83 -109 -136 -49 37 -42 -121 -142 -65 -61 -57 -47 -36 -33
10770c3Ln1M5QRm0N6k5k5P2r0k1k2l7N9QQq3P8L4o3JJM1M1l4l4l8N9J1J1n4M3M4n4K4K5qj04
$$ -33 -30 -81 -36 -28 -19 -59 -3 -28 -53 19 -71 -92 -114 -151 -92 -84 -76 -159 -81 -47 -110 -109 -108 -67 -26 -60 -94 -132 -73 -62 -51 -105 -62 -18 -72 -48 -23 -31 -135
10751a35MMM7M7rqo3L4O7O7m5m6P1k6l0j27N9N8n0M7l6l5P3k4k1k2J5J5Q7j1o9o9L3L3L9n7
$$ -135 -131 -127 -80 -33 -42 -50 -113 -79 -12 55 10 -36 35 9 -21 -148 -89 -31 -81 -34 -70 -105 -32 -56 -77 -99 -84 -69 18 7 -62 -131 -98 -65 -26 -83
10734h3nmj0j1N3N3J1J1j08j1K8p0J03n8k8O9K2K2q5q5N6N5O6O5j07N4l7l7j4j3P7q5klL6
$$ -83 -88 -92 -102 -113 -60 -7 4 15 -93 -104 -76 -146 -43 -101 -129 -60 -38 -16 -101 -186 -130 -75 -9 56 -51 3 -34 -71 -85 -98 -21 -106 -108 -111 -75
10717g5L5j7j6j7j7j7j7L1L2J3J3J3J3o8o8k4J37O8r3PQk4k5j4j4J5J75k8k8M4M4l6l6r2r2
$$ -75 -40 -57 -73 -90 -107 -124 -141 -110 -78 -65 -52 -39 -26 -94 -162 -186 -49 19 -74 -67 -59 -83 -108 -122 -136 -121 54 26 -2 42 86 50 14 -78 -170
10700a70N3N4JJJJlkkkJ4J4J4J3l3l4J5J5OOOOo4o3N9O0j26L5P8q3N8l9m9M8K5K6L2L2l7l6
$$ -170 -117 -63 -62 -61 -60 -59 -62 -64 -66 -68 -54 -40 -26 -13 -46 -80 -65 -50 -44 -38 -32 -26 -90 -153 -94 -34 -160 -125 -47 -130 -72 -111 -160 -112 -87 -61 -29 3 -34 -70
10681g0J1J2j8j8L1L0J6J5j18M4m3N5N4m3P6q6n6M1MNJ0J0j8j8j8j8L7L6L7L7RRQRn1n2n1
$$ -70 -59 -47 -65 -83 -52 -22 -6 9 -109 -65 -108 -53 1 -42 34 -52 -108 -67 -63 -58 -48 -38 -56 -74 -92 -110 -73 -37 0 37 46 55 63 72 21 -31 -82
10664h2n1J06J06pj68k1P7l7l7PPOPj1j1J22l9J3q3M1M1k4k5L6o1k4P2NOM6n1j3Q4K9j33J2
$$ -82 -133 -27 79 72 -96 -117 -40 -77 -114 -107 -100 -94 -87 -98 -109 13 -26 -13 -96 -55 -14 -38 -63 -27 -88 -112 -40 -35 -29 17 -34 -47 37 66 -67 -55
10646e5J3j7j7RJ06j1j1o0n9P0k6L4o3J%JJL3J31j5j12K1K2l3l3j%%jM2M2l2l3l4O4n2M5N2
$$ -55 -42 -59 -76 -67 39 28 17 -43 -102 -32 -58 -24 -87 -86 -86 -85 -84 -51 80 65 -47 -26 -4 -37 -70 -71 -71 -71 -72 -30 12 -20 -53 -87 -23 -75 -30 22
10628B2m5m4N2K9o8kjk4P3K5p2J8J7l7l6jj%jNOR6o5M8M8m3m3K5K6L1o5m6m7K9K8jj%jM9N0
$$ 22 -23 -67 -15 14 -54 -56 -57 -81 -8 17 -55 -37 -20 -57 -93 -94 -95 -95 -96 -91 -85 11 -54 -6 42 -1 -44 -19 7 38 -27 -73 -120 -91 -63 -64 -65 -65 -66 -17 33
10609C3k5k6l7O0ONonooj9j8L5o1l2l2M3M3QPq2P8%%kR4Or2K4p3L4L4K1K2Mr2m4N3poNOl8
$$ 33 8 -18 -55 5 11 16 10 5 -1 -7 -26 -44 -9 -70 -102 -134 -91 -48 -40 -33 -115 -37 -37 -37 -39 55 61 -31 -7 -80 -46 -12 9 31 35 -57 -101 -48 -55 -61 -56 -50 -88
10588h8N9n0M7n0n0j8P9j2j3L6L6nj03L3L3KJQPn2M5Q2q1j9j9K5p1L7L7o5R6M1n5O4l4m8m8
$$ -88 -29 -79 -32 -82 -132 -150 -71 -83 -96 -60 -24 -29 -132 -99 -66 -64 -63 -55 -48 -100 -55 27 -54 -73 -92 -67 -138 -101 -64 -129 -33 8 -47 17 -17 -65 -113
10571a13O5O4o9K7k7k8NNO0l8J4J3m1m1K4K3J7J8Q4j2o5o5k7P0O4l3O0l8l8l7j6j7j0j0k9
$$ -113 -48 16 -53 -26 -53 -81 -76 -71 -11 -49 -35 -22 -63 -104 -80 -57 -40 -22 62 50 -15 -80 -107 -37 27 -6 54 16 -22 -59 -75 -92 -102 -112 -141
10554a41O8m2N6l8l8M3M2O6l2p4Q8L0o7lklmn8L9l6l6N1N1K8K8p5K1N3N3q6q6J0J0J9K0j46
$$ -141 -73 -115 -59 -97 -135 -92 -50 16 -16 -90 -2 28 -39 -42 -44 -47 -51 -109 -70 -106 -142 -91 -40 -12 16 -59 -38 15 68 -18 -104 -94 -84 -65 -45 -191
10537a91J6ONK8K8J8J8Q6p6K1p6N2N2m2m1Q1j6l6l6l8N9MMj5j5j5j6K9K9K3K2L5o2pQ9j12
$$ -191 -175 -169 -164 -136 -108 -90 -72 14 -62 -41 -117 -65 -13 -55 -96 -15 -31 -67 -103 -141 -82 -78 -74 -89 -104 -119 -135 -106 -77 -54 -32 3 -59 -66 23 -89
10520h9j5M9N0k2k2K7K7j0rk8k8l1O7j3j3M6M5o7o8L4L4L3L4m5m4MLllj0rO1l5K5K5j02nN3
$$ -89 -104 -55 -5 -27 -49 -22 5 -5 -14 -42 -70 -101 -34 -47 -60 -14 31 -36 -104 -70 -36 -3 31 -14 -58 -54 -51 -54 -57 -67 -76 -15 -50 -25 0 -102 -107 -54
10502e4N3mmm2m3o5R6NNK9K8k0j9J1J2l7l7j6j6J19K2o2o3J1J2J5J5j6j5O2l5mmP0P0j36l9
$$ -54 -1 -5 -9 -51 -94 -159 -63 -58 -53 -24 4 -16 -35 -24 -12 -49 -86 -102 -118 1 23 -39 -102 -91 -79 -64 -49 -65 -80 -18 -53 -57 -61 9 79 -57 -96
10484i6Q3j3NNr0PN5m2k4k4K9J26K4K4k8j25J2J2N5N4K1K2o0n9JJJJoopok4k5k5k4NNK9K9
$$ -96 -13 -26 -21 -16 -106 -99 -44 -86 -110 -134 -105 21 45 69 41 -84 -72 -60 -5 49 70 92 32 -27 -26 -25 -24 -23 -29 -35 -42 -48 -72 -97 -122 -146 -141 -136 -107 -78
10465g8J0RN8N8r0r1N4N5q8q7N8N8POj8j7M1M1l9m0qqM1M0PPJ9J9q3J12k1k2k9k9N1N2k9k9
$$ -78 -68 -59 -1 57 -33 -124 -70 -15 -103 -190 -132 -74 -67 -61 -79 -96 -55 -14 -53 -93 -101 -109 -68 -28 -21 -14 5 24 -59 53 32 10 -19 -48 3 55 26 -3
10447cm1m1J12q1q2J12MMqpK0K1k7k8J1J1J1J1k5k5jjM9M8o4o5J5J5M0L9j7j7j7j7PPm2m1
$$ -3 -44 -85 27 -54 -136 -24 -20 -16 -24 -31 -11 10 -17 -45 -34 -23 -12 -1 -26 -51 -52 -53 -4 44 -20 -85 -70 -55 -15 24 7 -10 -27 -44 -37 -30 -72 -113
10429a13L5L5n7n8J57l6K4K4j5j6j5j5l7l7M4M4J7J7ppj9j8L0L0j9j8M2j51K8K8m3m2J70R
$$ -113 -78 -43 -100 -158 -1 -37 -13 11 -4 -20 -35 -50 -87 -124 -80 -36 -19 -2 -9 -16 -35 -53 -23 7 -12 -30 12 -139 -111 -83 -126 -168 2 11
10412A1j3j3k6k7k0k0J0J08J4J5r5O6k5k5J6J7J6J6%jjjm0m0QQj3j3j3j3J3J3J4J3j5j5j5
$$ 11 -2 -15 -41 -68 -88 -108 -98 10 24 39 -56 10 -15 -40 -24 -7 9 25 25 24 23 22 -18 -58 -50 -42 -55 -68 -81 -94 -81 -68 -54 -41 -56 -71 -86
10395h6j5J6J7K2K3q3J5Qq9R0pk4P4R3o8L9L8j03N8M0n7Pr0n1J10j6j5R2p0p1K6J6J6j5Q0
$$ -86 -101 -85 -68 -46 -23 -106 -91 -83 -172 -82 -89 -113 -39 54 -14 25 63 -40 18 58 1 8 -82 -133 -23 -39 -54 38 -32 -103 -77 -61 -45 -60 20
10378B0k1k2m1m2QPj3j3M8n0m0N7R9Km5m4lkM8M8r7r7P5P6k4k3q2J45L0o7n1M5j5j5N4N5j63
$$ 20 -1 -23 -64 -106 -98 -91 -104 -117 -69 -119 -159 -102 -3 -1 -46 -90 -93 -95 -47 1 -96 -193 -118 -42 -66 -89 -171 -26 4 -63 -114 -69 -84 -99 -45 10 -153
10360a53O2J12m9M0n7r7O4qqJJo0L7Q9pkjO3l3Jr6j8P9K5p3J9J9OPP0k6o3o3J40k1j1j1LL
$$ -153 -91 21 -28 12 -45 -142 -78 -86 -94 -93 -92 -152 -115 -26 -33 -35 -36 27 -6 -5 -101 -119 -40 -15 -88 -69 -50 -44 -37 33 7 -56 -119 21 0 -11 -22 -19 -16
10342a6k2k1J3J4n6M1n3J09O6r5MMp9Q3k0j18N0m6O5O6k1k1K8K9n9n8O9k8k1P5q5J1J1J1J3
$$ -16 -38 -59 -46 -32 -88 -47 -100 9 75 -20 -16 -12 -91 -8 -28 -146 -96 -142 -77 -11 -32 -53 -25 4 -55 -113 -44 -72 -93 -18 -103 -92 -81 -70 -57
10325e7J3j2j1k6k5L9J35m2N4j8j8o0o0J5J5O4l2k6k6k7k7O0O0o5L1Pr0jjP4P4m9m9NOl5O1
$$ -57 -44 -56 -67 -93 -118 -79 56 14 68 50 32 -28 -88 -73 -58 6 -26 -52 -78 -105 -132 -72 -12 -77 -46 -39 -129 -130 -131 -57 17 -32 -81 -76 -70 -105 -44
10307d4m1m1N9N8N9l8O0l7l7l7lmk7k8M1M2ppm6m6J3J3o6R6NOonl0k9QQN1N0j6j12N4N5OP
$$ -44 -85 -126 -67 -9 50 12 72 35 -2 -39 -42 -46 -73 -101 -60 -18 -25 -32 -78 -124 -111 -98 -164 -68 -63 -57 -63 -68 -98 -127 -119 -111 -60 -10 -26 -138 -84 -29 -23 -16
10288a6m9M9j6j6N1m7m4N4l8l8Q0j6J8p9m2N6nnkkN9l8J3J10l1l1j0j0rj0J3J4K0J9n8L8k1
$$ -16 -65 -16 -32 -48 3 -44 -88 -34 -72 -110 -30 -46 -28 -107 -149 -93 -98 -103 -105 -107 -48 -86 -73 37 6 -25 -35 -45 -54 -64 -51 -37 -17 2 -56 -18 -39
10271c9k2L8n8mlL8L9M8M9j34K8J2J2O0l6o0L7j2j1N5m1n2M5j6j5K6K7k7k8K9o7J26l5m6m6
$$ -39 -61 -23 -81 -85 -88 -50 -11 37 86 -48 -20 -8 4 64 28 -32 5 -7 -18 37 -4 -56 -11 -27 -42 -16 11 -16 -44 -15 -82 44 9 -37 -83
10254h3K8o8j8P9%%k9O8k9k9l8N9J1q6L2L2k9O9n7n7J23K5n2M4j7j6o5o4l8N8k9k9N8N8M2
$$ -83 -55 -123 -141 -62 -62 -62 -91 -23 -52 -81 -119 -60 -49 -135 -103 -71 -100 -31 -88 -145 -22 3 -49 -5 -22 -38 -103 -167 -205 -147 -176 -205 -147 -89 -47
10237d7M3onk3k4JJK5K5J9J9K0p7K5K6k2k3k2k3O0N9m7m8o6L2K5K5j4j4k8k8J51p4j4j4p8
$$ -47 -4 -10 -15 -38 -62 -61 -60 -35 -10 9 28 48 -29 -4 22 0 -23 -45 -68 -8 51 4 -44 -110 -78 -53 -28 -42 -56 -84 -112 39 -35 -49 -63 -141
10220a41J48k7k8J7J7j3j3L7o0j6j5J29l3J6J6p3K3l1l2MLn7M0P8j9M8m9j02j02J25K7J8J8
$$ -141 7 -20 -48 -31 -14 -27 -40 -3 -63 -79 -94 35 2 18 34 -39 -16 -47 -79 -75 -72 -129 -89 -11 -30 18 -31 -133 -235 -110 -83 -65 -47
10204d7M2n5j7j8K5K5rrrrL6L7m5m4M0M1qqopooM1M1pqlkl0j26P3P2m7m7J1J1L4L5m2m2j8
$$ -47 -5 -60 -77 -95 -70 -45 -54 -63 -72 -81 -45 -8 -53 -97 -57 -16 -24 -32 -38 -45 -51 -57 -16 25 18 10 7 5 -25 -151 -78 -6 -53 -100 -89 -78 -44 -9 -51 -93 -111
10185a11j8JJL2L1n3M4o5o6J52N4q5J3k0P7N9l8j4j4j4j11L2L3K7K6K4K5n7n7ooooj7j7N7
$$ -111 -129 -128 -127 -95 -64 -117 -73 -138 -204 -52 2 -83 -70 -90 -13 46 8 -6 -20 -34 -145 -113 -80 -53 -27 -3 22 -35 -92 -98 -104 -110 -116 -133 -150 -93
10168i3N8J0q7oR1k4k4P9j8N6m1j1j0p4K3n1M5n7J05n4n5jR6m0l9N1N1l0l0J6J5j9j9K6j35
$$ -93 -35 -25 -112 -118 -27 -51 -75 4 -14 42 1 -10 -20 -94 -71 -122 -77 -134 -29 -83 -138 -139 -43 -83 -122 -71 -20 -50 -80 -64 -49 -68 -87 -61 -196
10151a96n9J67L7L6k9l0j2j2M9m9l3O4n1M6J7J8j9j9p4K4nR1L6L5l9m0L1L2n0n0L5L5o9K9
$$ -196 -255 -88 -51 -15 -44 -74 -86 -98 -49 -98 -131 -67 -118 -72 -55 -37 -56 -75 -149 -125 -130 -39 -3 32 -7 -47 -16 16 -34 -84 -49 -14 -83 -54
10135e4J5J5n2M5m1N6N0j12L8L8L8j24mnP7P6j18M3n4M3nnm8M9o0L6j2j3J9J9J3J3O0l7q5
$$ -54 -39 -24 -76 -31 -72 -16 34 -78 -40 -2 36 -88 -92 -97 -20 56 -62 -19 -73 -30 -35 -40 -88 -39 -99 -63 -75 -88 -69 -50 -37 -24 36 -1 -86
10118h6J2K6K5k2k3N0m7PQk3k2JKO0N9Jr5L3L4k0k1l3l2J5J6O9O9m3m4k7k7k8k7P4P3qpl5
$$ -86 -74 -48 -23 -45 -68 -18 -65 -58 -50 -73 -95 -94 -92 -32 27 28 -67 -34 0 -20 -41 -74 -106 -91 -75 -6 63 20 -24 -51 -78 -106 -133 -59 14 6 -1 -36
10100c6l5j6j7N3m4l7J23K7p1L0o6k7P0M0n7K0J9L7L8j5j5n9L7j40K2Q2Q2POm2m2l7l7M4M4
$$ -36 -71 -87 -104 -51 -95 -132 -9 18 -53 -23 -89 -116 -46 -6 -63 -43 -24 13 51 36 21 -38 -1 -141 -119 -37 45 52 58 16 -26 -63 -100 -56 -12
10083a2j9j9J08j17J7J8MLl4l4J4J4j7j8OPL5L5j3j3L1L1L2L1m7m7m7m7j1j0J4J3L2L2m9m9
$$ -12 -31 -50 58 -59 -42 -24 -20 -17 -51 -85 -71 -57 -74 -92 -86 -79 -44 -9 -22 -35 -4 27 59 90 43 -4 -51 -98 -109 -119 -105 -92 -60 -28 -77 -126
10066a26KKk2k2N3N3NMk9k9K0J9M9N0l1l1j9j8R4ko7R4n0n1K8K8k0k0J1J1l8l7%%r1P0J3J3
$$ -126 -124 -122 -144 -166 -113 -60 -55 -51 -80 -109 -89 -70 -21 29 -2 -33 -52 -70 24 22 -45 49 -1 -52 -24 4 -16 -36 -25 -14 -52 -89 -89 -89 -180 -110 -97 -84
10048h4P8P7j04pM1n5jjo8K9M1n5NMj6j6L2L2qrN6m1j07N4L7L8JJn4M3k4k3P3P4r4O8j14M7
$$ -84 -6 71 -33 -40 1 -54 -55 -56 -124 -95 -54 -109 -104 -100 -116 -132 -100 -68 -76 -85 -29 -70 -177 -123 -86 -48 -47 -46 -100 -57 -81 -104 -31 43 -51 17 -97 -50
10030e0P2P2r0q9k6P2J7J7LLm0l9n0M8jjp7K0J01Mn0n0N6N7j%o6L2J05n6m5m6N6m1J4J4j%
$$ -50 22 94 4 -85 -111 -39 -22 -5 -2 1 -39 -78 -128 -80 -81 -82 -159 -139 -38 -34 -84 -134 -78 -21 -22 -22 -88 -56 49 -7 -52 -98 -42 -83 -69 -55 -56 -56
10012e6M0n7J04j21j%RJ0J9K0j08N4j1Q6l1l0L0L1n6M2pqo1L5K9K9q4q4K9L0OOJ2J2qQ9k4
$$ -56 -16 -73 31 -90 -91 -91 -82 -72 -53 -33 -141 -87 -98 -12 -43 -73 -43 -12 -68 -26 -33 -41 -102 -67 -38 -9 -93 -177 -148 -118 -112 -106 -94 -82 -90 -1 -25
9994b5k4R7o4K7K7m5m5LMK8K8p5K2j7j6o5L2klMMqqP2P3kkn7n6M7m9jjQ3j5qqrrL9L9m8m8
$$ -25 -49 48 -16 11 38 -7 -52 -49 -45 -17 11 -64 -42 -59 -75 -140 -108 -110 -113 -109 -105 -113 -121 -49 24 22 20 -37 -93 -46 -95 -96 -97 -14 -29 -37 -45 -54 -63 -24 15 -33 -81
9974h1Q7rp5p4O5O5m3m3L7L8J1J2l7l7M5M5K0p8M1M2m6m5L0K9j8j9m5m5MMQ1Q1o9p0Q5j1M3
$$ -81 6 -3 -78 -152 -87 -22 -65 -108 -71 -33 -22 -10 -47 -84 -39 6 26 -52 -11 31 -15 -60 -30 -1 -19 -38 -83 -128 -124 -120 -39 42 -27 -97 -12 -23 20
9956B0n3Qq9P8P9p3K4J8J9m6m6J2J3r6O6l0O6j2j1nnkkMMl5O2JJN7m0K1K1n0M8q1q2n3M3P0
$$ 20 -33 -25 -114 -36 43 -30 -6 12 31 -15 -61 -49 -36 -132 -66 -96 -30 -42 -53 -58 -63 -65 -67 -63 -59 -94 -32 -31 -30 27 -13 8 29 -21 27 -54 -136 -189 -146 -76
9937g6P0ooj2j2N3m3j29L4j2j1P9Q0m4m4J1q6L4L3K8K7j4j4P7q4j5j5N5N6m1m0J4J4q9PK3
$$ -76 -6 -12 -18 -30 -42 11 -32 -161 -127 -139 -150 -71 9 -35 -79 -68 -154 -120 -87 -59 -32 -46 -60 17 -67 -82 -97 -42 14 -27 -67 -53 -39 -128 -121 -98
9920i8K3P6q6q6P6MMJ4J4k8k9K1K0M1M2ppj3j3j3j3K1K1o9R1MMQQK4p3k4P3n7n7o2L4M5n2
$$ -98 -75 1 -85 -171 -95 -91 -87 -73 -59 -87 -116 -95 -75 -34 8 1 -6 -19 -32 -45 -58 -37 -16 -85 6 10 14 22 30 54 -19 -43 30 -27 -84 -146 -112 -67 -119
9901a19RRL8L8j07N4P4k3K1p5J5J12q3J3m9m9NOJ0J1J11n0r8O4NNJ5q1K1K1NMNMk4k5K4K3
$$ -119 -110 -101 -63 -25 -132 -78 -4 -27 -6 -81 -66 46 -37 -24 -73 -122 -117 -111 -101 -90 21 -29 -127 -63 -58 -53 -38 -119 -98 -77 -72 -68 -63 -59 -83 -108 -84 -61
9883f1K7K6n5n4O6O7Qq9k3k3K5K5KR9l7l6POm8M9j1j0JJo4L3L8n8n2M4j6j6J1J1J7J6j5Q1
$$ -61 -34 -8 -63 -117 -51 16 24 -65 -88 -111 -86 -61 -59 40 3 -33 -26 -20 -68 -19 -30 -40 -39 -38 -102 -69 -31 -89 -141 -97 -113 -129 -118 -107 -90 -74 -89 -8
9865hJr6j6j6K6K6k1k2k1k1O8O8J3J4j0j06Q7p4P1P1L3j28L6o1j6j7M1M1P7q4M0n6j1j2K6
$$ -8 -7 -103 -119 -135 -109 -83 -104 -126 -147 -168 -100 -32 -19 -5 -15 -121 -34 -108 -37 34 67 -61 -25 -86 -102 -119 -78 -37 40 -44 -4 -60 -71 -83 -57
9848e7K6k3k3J1J1m4N3K4K4k4P2o5o4k1k0J23l7MNj5j4L9n7k9l0POK8o9O6O6L9M0J3q4k3k3
$$ -57 -31 -54 -77 -66 -55 -99 -46 -22 2 -22 50 -15 -79 -100 -120 3 -34 -30 -25 -40 -54 -15 -72 -101 -131 -124 -118 -90 -159 -93 -27 12 52 65 -19 -42 -65
9831f5J3J3K5p1L1L1l3l2P0k6JKmnppR5jp2p1k0P8J0J0J6J6k3k3J9K0L1o5nnm2N4N3j09l6
$$ -65 -52 -39 -14 -85 -54 -23 -56 -88 -18 -44 -43 -41 -45 -50 -57 -64 31 30 -42 -113 -133 -55 -45 -35 -19 -3 -26 -49 -30 -10 21 -44 -49 -54 -96 -42 11 -98 -134
9812a34J25k4k4K7K7J7J8M1j20j9j9l8J23k1k2N0m7J4J3m7N1nmk9k8q3J3%%J33r4K9K9J5J5
$$ -134 -9 -33 -57 -30 -3 14 32 73 -47 -66 -85 -123 0 -21 -43 7 -40 -26 -13 -60 -9 -14 -18 -47 -75 -158 -145 -145 -145 -12 -106 -77 -48 -33 -18
9795a8L4L4n3n3K4p2O0l6M2M3j2j2j3j2o7L0O2O3n1n0N8l9lklR3rrk0k0k6P0j5j6K1p6L2L1
$$ -18 16 50 -3 -56 -32 -104 -44 -80 -38 5 -7 -19 -32 -44 -111 -81 -19 44 -7 -57 1 -38 -41 -43 -46 47 38 29 9 -11 -37 33 18 2 23 -53 -21 10
9777A0L1o5rrK7K7L9n7N1N2q7J0J0J0n2M4L2j29O4O4n3n3m2N5L6o1%R6o8L0rrK8p0j2j3O2
$$ 10 41 -24 -33 -42 -15 12 51 -6 45 97 10 20 30 40 -12 32 64 -65 -1 63 10 -43 -85 -30 6 -55 -55 41 -27 3 -6 -15 13 -57 -69 -82 -20
9760b0O2j3j3j3j3J0J0J1J0J2J3m2m2N5m2O1O2J5J4o5o6M3M2noo8o8R9KN8N7R4o8o6o5O9O9
$$ -20 42 29 16 3 -10 0 10 21 31 43 56 14 -28 27 -15 46 108 123 137 72 6 49 91 86 80 12 -56 43 45 103 160 254 186 120 55 124 193
9742A93JKM9M9m5m5m6m5K3K4K3K4O5O6m8m8L1L0OOK3K3jjN5N6PPL3L3RRO4O4M0M0O2O1J10
$$ 193 194 196 245 294 249 204 158 113 136 160 183 207 272 338 290 242 273 303 309 315 338 361 360 359 414 470 477 484 517 550 559 568 632 696 736 776 838 899 1009
9723A009J09J04J03R7R7K21J24J25L18L43M40O16R39J392K360M015O661Q250M700k585p168
$$ 1009 1118 1222 1325 1422 1519 1740 1864 1989 2307 2650 3090 3706 4645 6037 8397 12412 19073 27323 32023 29438 22270
9713B2270p279n278l173j945j160p08m27l30j65K8J03r0j58l52k61j64j32j31j3j3J9J9o2
$$ 22270 14991 9713 6540 4595 3435 2727 2300 1970 1805 1833 1936 1846 1688 1336 1075 911 779 648 635 622 641 660 598
9702E98o1j4j3L5L5M1M1m0m0K4K4%jMLK8K7R8R8l6J58JKJ26J26O9O9J50J50J70J70L22L21
$$ 598 537 523 510 545 580 621 662 622 582 606 630 630 629 633 636 664 691 789 887 851 1009 1010 1012 1138 1264 1333 1402 1552 1702 1872 2042 2364 2685
9687B685N17O14Q74J455K284M027O875Q618M818k734p581p581n412l186j821j143p11m85l82
$$ 2685 3202 3816 4690 6145 8429 12456 19331 27949 32767 30033 22452 14871 9459 6273 4452 3309 2598 2113 1731
9678A731k86j91j90m0k01j11j5JKn3n3k9k9LLLr3Lr4J28L1j3Q4n8n7O8O7j3j3K6K5J28L2K5
$$ 1731 1445 1254 1064 1024 823 712 697 698 700 647 594 565 536 539 542 545 452 455 361 489 520 507 591 533 476 544 611 598 585 611 636 764 796 821
9661H21K5O2O1J40M2M9J45K2J19J51J51K95K95L76M73N70R24J429K429M029O901Q321M610
$$ 821 846 908 969 1109 1151 1200 1345 1367 1486 1637 1788 2083 2378 2754 3227 3797 4721 6150 8579 12608 19509 27830 32440
9650C2440k802p481p420n323l192j870j153p34m53m53l34j72j71p5r4r4q2q2NNj28l1mnn5
$$ 32440 29638 22157 14737 9414 6222 4352 3199 2465 2012 1559 1225 1053 882 807 713 619 537 455 460 465 337 306 302 297 242
9638B42n5K6K6m5m5MLK5K5k9l0L0o8l8O0n9L8J4J4k3k2l9N8J17m5MLn5n4o1L6j9j8k4P3P4
$$ 242 187 213 239 194 149 153 156 181 206 177 147 177 109 71 131 72 110 124 138 115 93 54 112 229 184 188 191 136 82 21 57 38 20 -4 69 143
9621A43k2o5L2j4j4l2l2LLk2k1L3L3QRj1j1l5l5k8k9Q5Q4%jm9m9l9l9M2M2J8J9J9J8m8m8L2
$$ 143 121 56 88 74 60 28 -4 -1 2 -20 -41 -8 25 33 42 31 20 -15 -50 -78 -107 -22 62 62 61 12 -37 -76 -115 -73 -31 -13 6 25 43 -5 -53 -21
9603b1L3%%k1P7j20M2J2q5N2N1l5l5k1k0N0N0Q4p7J4J4j3j2j2j3L3L3m8m7J0J0J0J0n6n7J00
$$ -21 12 12 12 -9 68 -52 -10 2 -83 -31 20 -15 -50 -71 -91 -41 9 93 16 30 44 31 19 7 -6 27 60 12 -35 -25 -15 -5 5 -51 -108 -8
9586hMO8r3q1Q1J02Nj05J20j5j6m9n0L8L8j0j1LKLKm3m3L8L8m9m8%%k5k4K4K4QPm1m2N8N8
$$ -8 -4 64 -29 -110 -29 73 78 -27 93 78 62 13 -37 1 39 29 18 21 23 26 28 -15 -58 -20 18 -31 -79 -79 -79 -104 -128 -104 -80 -72 -65 -106 -148 -90 -32
9567c2RRJ5J5l4l3j4j3O7O8MNm4m3J2J1J2J2n7n6kkn6M1L5L6l4l4O9k8%Jn5J08K7p0M4M3n6
$$ -32 -23 -14 1 16 -18 -51 -65 -78 -11 57 61 66 22 -21 -9 2 14 26 -31 -87 -89 -91 -147 -106 -71 -35 -69 -103 -34 -62 -62 -61 -116 -8 19 -51 -7 36 -20
9549b0n7mR3J0q6k5k6P5P5l8l8JJn4M3M7M7k8k8j5j6L9n8K6K6l5O2j5j5Q1q0j9k0N1N1n8n9
$$ -20 -77 -81 12 22 -64 -89 -115 -40 35 -3 -41 -40 -39 -93 -50 -3 44 16 -12 -27 -43 -4 -62 -36 -10 -45 17 2 -13 68 -12 -31 -51 0 51 -7 -66
9531f6o5L2N2N1j7j6k6P2ppm7m6K7K8J1q6OPR5o6%%J9J9l6O1J9J9j10j3J7J8ppM1n5kjM8M9
$$ -66 -131 -99 -47 4 -13 -29 -55 17 10 3 -44 -90 -63 -35 -24 -110 -104 -97 -2 -68 -68 -68 -49 -30 -66 -5 14 33 -77 -90 -73 -55 -62 -69 -28 -83 -85 -86 -38 11
9512A1j0j0N2j09L7L6n9L9j6j6j3j3j9j9O3l3l4O3j7j8L1L1R2ol1l1n7n6L5L4p5Q5K5p1J3
$$ 11 1 -9 43 -66 -29 7 -52 -13 -29 -45 -58 -71 -90 -109 -46 -79 -113 -50 -67 -85 -54 -23 69 63 32 1 -56 -112 -77 -43 -118 -33 -8 -79 -66
9495f6J3PPJ0J1J00Kj30L1p2K5nnp8J9K6K5k3P3qqJ19m2n9L8J5J6J7q0k5k6%jP8j9L7L7l9
$$ -66 -53 -46 -39 -29 -18 82 84 -46 -15 -87 -62 -67 -72 -150 -131 -105 -80 -103 -30 -38 -46 73 31 -28 10 25 41 58 -22 -47 -73 -73 -74 4 -15 22 59 20
9477B0m0j01O1k4k4n2M4J29l3j6j5kkL1L0j7j8j0j0QQO8k7KKn4n4K7K6mnJJl9N7llJ7q0k5
$$ 20 -20 -121 -60 -84 -108 -160 -116 13 -20 -36 -51 -53 -55 -24 6 -11 -29 -39 -49 -41 -33 35 8 10 12 -42 -96 -69 -43 -47 -52 -51 -50 -89 -32 -35 -38 -21 -101 -126
9458a26P1m5N2K7K8K1K2j24k7J19m3q5P7J4J4k3k4LKk7k7Q3j4l0k9l3J29O9k8j3j2l7l7l0
$$ -126 -55 -100 -48 -21 7 28 50 -74 -101 18 -25 -110 -33 -19 -5 -28 -52 -49 -47 -74 -101 -18 -32 -62 -91 -124 5 74 46 33 21 -16 -53 -83
9442h3O6k3k2P4q7M0n7l5O2mnP0k6K8K8j2j1j2j1M3M4l8l7m2m2OOO1O0J2J2K2K2j23k7O7r5
$$ -83 -17 -40 -62 12 -75 -35 -92 -127 -65 -69 -74 -4 -30 -2 26 14 3 -9 -20 23 67 29 -8 -50 -92 -86 -80 -19 41 53 65 87 109 -14 -41 26 -69
9424f9K2J19L3o4n7L9l9m0J02Nn8n8J6J7k3k3JJK1K1q2J5N8N8j6j7j1j1PQN4m2l7l6nmL7L8
$$ -69 -47 72 105 41 -16 23 -16 -56 46 51 -7 -65 -49 -32 -55 -78 -77 -76 -55 -34 -116 -101 -43 15 -1 -18 -29 -40 -33 -25 29 -13 -50 -86 -91 -95 -58 -20
9406b0L5o3j4j4N9l8j3Q3n0n0R5R5nj02Pr0J1J1NNjjN4m4j%o2L6K8K9j4j4J6J5P0k7o7o8k1
$$ -20 15 -48 -62 -76 -17 -55 -68 15 -35 -85 10 105 100 -2 5 -85 -74 -63 -58 -53 -54 -55 -1 -45 -46 -46 -108 -72 -44 -15 -29 -43 -27 -12 58 31 -36 -104 -125
9388a25P6L2o3K1K0%%J8J8J7p9KR8p8p8QRJ8J7L6L5j5j11J7J8N7l9L9L9MLp6K1k2k2k2P4J8
$$ -125 -49 -17 -80 -59 -39 -39 -39 -21 -3 14 -65 -63 35 -43 -121 -113 -104 -86 -69 -33 2 -13 -124 -107 -89 -32 -71 -32 7 11 14 -62 -41 -63 -85 -107 -33 -15
9370a5J8L0o7m1m1L4L4o7o7J4J4P9P8l4l4lkkR5j12j6P2k6L4L3mj02M6n2K2K1L1L1k7k8Qj53
$$ -15 3 33 -34 -75 -116 -82 -48 -115 -182 -168 -154 -75 3 -31 -65 -68 -70 -72 23 -89 -105 -33 -59 -25 8 4 -98 -52 -104 -82 -61 -30 1 -26 -54 -46 -199
9352a99N1N0K2K2o4o5J42M5Rq8N1N1q5J2l4O3M5n2j7j6k9k8J04Qj9j8k8k8P5k1J3J4J4q4j3
$$ -199 -148 -98 -76 -54 -118 -183 -41 4 13 -75 -24 27 -58 -46 -80 -17 28 -24 -41 -57 -86 -114 -10 -2 -21 -39 -67 -95 -20 -41 -28 -14 0 -84 -97
9335i7j4M1n6L4J31j4j11o1L6L0o7N7N7KLJKk2k2j5j5L4L4MMJ1q7RQk3k2O3O3p2K5N9N9k2
$$ -97 -111 -70 -126 -92 39 25 -86 -147 -111 -81 -148 -91 -34 -32 -29 -28 -26 -48 -70 -85 -100 -66 -32 -28 -24 -13 -100 -91 -83 -106 -128 -65 -2 -74 -49 10 69 47
9317D7k1M7m8m3m3PP%JL7n9NMp6Q5L7j25L2L1P0P0n0n1MMo5L1K5K5k6k6k6k6K1K2K1K2onJ
$$ 47 26 73 25 -18 -61 -54 -47 -47 -46 -9 -68 -63 -59 -135 -50 -13 -138 -106 -75 -5 65 15 -36 -32 -28 -93 -62 -37 -12 -38 -64 -90 -116 -95 -73 -52 -30 -36 -41 -40
9298d0Jn3M3j1j1rrj5j5R1nM2M3j8j15N2N3n6n7qqPON6m2J00Mo1o1j0rM4M5l0O7l6l6l7l8
$$ -40 -39 -92 -49 -60 -71 -80 -89 -104 -119 -28 -33 9 52 34 -81 -29 24 -32 -89 -97 -105 -98 -92 -36 -78 22 26 -35 -96 -106 -115 -71 -26 -56 11 -25 -61 -98 -136
9279a36J5J11N7l9j21k3P5k1Q1p9K7K7K3K3l4O2J5J4p9J9l6l7J0J0j%P0r1J0Rq6P5rj0j4Q2
$$ -136 -121 -10 47 8 -113 -136 -61 -82 -1 -80 -53 -26 -3 20 -14 48 63 77 -2 17 -19 -56 -46 -36 -37 -37 33 -58 -48 -39 -125 -50 -59 -69 -83 -1
9262ak0k1KJN6m1m3m4L7L7o6L1K5K5k9l0O8l0P8k0n2n2L6L6o7L0LLQRk0k0Q2j4o0n9J08J1
$$ -1 -21 -42 -40 -39 17 -24 -67 -111 -74 -37 -103 -72 -47 -22 -51 -81 -13 -43 35 15 -37 -89 -53 -17 -84 -54 -51 -48 -40 -31 -51 -71 11 -3 -63 -122 -14 -3
9244co7K9l7N9j1j2M9M9p1K6k9k9L8L8m3m3J9K0K5K6j6Q1q2J5L2o4N1m6RRlR3K9K9L6L5O2
$$ -3 -70 -41 -78 -19 -30 -42 7 56 -15 11 -18 -47 -9 29 -14 -57 -38 -18 7 33 17 98 16 31 63 -1 50 4 13 22 19 112 141 170 206 241 303
9226C03O3Q8J86L09L10N65Q56M30m42q41o80l49k52j77j6r3r3MMo3L5k1k0l3l4l3l4K0K0K0
$$ 303 366 454 640 949 1259 1824 2680 3110 2668 1827 1147 798 546 369 353 260 167 171 175 112 147 126 106 73 39 6 -28 -8 12 32
9212C2J9K9K9j38m2M3M4K2p3lkqqj2j3M3n5M6M6K3p3p6Q5j2j2K1K2K7K7o3L3K1K1K5p2L1L1
$$ 32 51 80 109 -29 -71 -28 16 38 -35 -38 -40 -48 -56 -68 -81 -38 -93 -47 -1 22 -51 -127 -42 -54 -66 -45 -23 4 31 -32 1 22 43 68 -4 27 58
9195E8o7o6m1N6j5j6rj0K0K0k9k8K9K9L6o1O5O6p0K8k7O9k1k1m8M8l7l7Q0j6j1j1L6L5j00
$$ 58 -9 -75 -116 -60 -75 -91 -100 -110 -90 -70 -99 -127 -98 -69 -33 -94 -29 37 -33 -5 -32 37 16 -5 -53 -5 -42 -79 1 -15 -26 -37 -1 34 -66
9178f6lM7M6l3l4Q1j6r6%M7M6n6M0L1o5N5m1p5K2J0J0j0j0M4n3L6L6m5m5l0O6P9q3LLo1L5
$$ -66 -69 -22 24 -9 -43 38 22 -74 -74 -27 19 -37 3 34 -31 24 -17 -92 -70 -60 -50 -60 -70 -26 -79 -43 -7 -52 -97 -127 -61 18 -65 -62 -59 -120 -85
9160h5J1J0K3K3q0J8O5l1mnJ4J4n6n5N8N7k9k8K0J9j7j8L1L1J3J4nnr9kK5K4j2j3L6L6l7l6
$$ -85 -74 -64 -41 -18 -98 -80 -15 -46 -50 -55 -41 -27 -83 -138 -80 -23 -52 -80 -60 -41 -58 -76 -45 -14 -1 13 8 3 -96 -98 -73 -49 -61 -74 -38 -2 -39 -75
9142g5J1J2K5K6n5n5N4N4n9n9J1J1L6L5n8n8K2K3J8J8J8J8k0k0K9K9l4l5J4J3l6l5J2J2N1
$$ -75 -64 -52 -27 -1 -56 -111 -57 -3 -62 -121 -110 -99 -63 -28 -86 -144 -122 -99 -81 -63 -45 -27 -47 -67 -38 -9 -43 -78 -64 -51 -87 -122 -110 -98 -47
9125d7N1l0l0L0K9j9j9J4J4j1j0J4J3l5l5J3J2L6L6j2j1l6l6k2k1J17m4j7j7k7k8POj7j8N7
$$ -47 4 -26 -56 -26 3 -16 -35 -21 -7 -18 -28 -14 -1 -36 -71 -58 -46 -10 26 14 3 -33 -69 -91 -112 5 -39 -56 -73 -100 -128 -121 -115 -132 -150 -93
9108i3N7J5J4p1K5O8r4oR0k2k3m3m4L7L7Q2Q2o4o3LLLL%jj%k1k1k1k1J3J4J3J4j7j6m0m1O4
$$ -93 -36 -21 -7 -78 -53 15 -79 -85 5 -17 -40 -83 -127 -90 -53 29 111 47 -16 -13 -10 -7 -4 -4 -5 -6 -6 -27 -48 -69 -90 -77 -63 -50 -36 -53 -69 -109 -150 -86
9089h6O4r4Mm4J18L9n8M5M5m1m2j1j2j1j1K3K2K3K3l9m0M1M1kjq3q2N2N2K7K8j8j8OOK4K5
$$ -86 -22 -116 -112 -156 -38 1 -57 -12 33 -8 -50 -61 -73 -84 -95 -72 -50 -27 -4 -43 -83 -42 -1 -3 -4 -87 -169 -117 -65 -38 -10 -28 -46 -40 -34 -10 15
9071A5n1n0m1N5PPl0O7J8p9K6K6jr7QJ06mlmnKKNJ02nj02o5L2p1R0O0O0m3m3K0K0k9k8rql
$$ 15 -36 -86 -127 -72 -65 -58 -88 -21 -3 -82 -56 -30 -31 -128 -120 -14 -18 -21 -25 -30 -28 -26 -21 81 76 -26 -91 -59 -130 -40 20 80 37 -6 14 34 5 -23 -32 -40 -43
9052d3km4N3jkNNMNj5j6j5j5klkkO9O9m5m4K1K2k1k2n1M5M0L9l7l7m4m3P0k7L4L4n4M3M3M3
$$ -43 -45 -89 -36 -37 -39 -34 -29 -25 -20 -35 -51 -66 -81 -83 -86 -88 -90 -21 48 3 -41 -20 2 -19 -41 -92 -47 -7 32 -5 -42 -86 -129 -59 -86 -52 -18 -72 -29 14 57
9032E7p7K0K0p7J8J7l8l7m9m9OOM0J36k4k5n3M4L7L8n2n1N2N1K9j32J2J3m1N7n3M4J3J4k3
$$ 57 -20 0 20 -57 -39 -22 -60 -97 -146 -195 -189 -183 -143 -7 -31 -56 -109 -65 -28 10 -42 -93 -41 10 39 -93 -81 -68 -109 -52 -105 -61 -48 -34 -57
9016e7k3m5N1MLo8L0N5N6j2j2R6%j01ml9N8m0l9O3r8l7O1M4M4k4k5J8J8L9n9mlppppKLN1m6
$$ -57 -80 -125 -74 -70 -67 -135 -105 -50 6 -6 -18 78 78 -23 -27 -66 -8 -48 -87 -24 -122 -159 -98 -54 -10 -34 -59 -41 -23 16 -43 -47 -50 -57 -64 -71 -78 -76 -73 -22 -68
8996f8O3l3J5J4K1K2l3O3n4n5%%KKQQq3J4R5lLLklo5o4P6k0k3P4l5l6l3l3M1M2J44M7p5p6
$$ -68 -5 -38 -23 -9 12 34 1 64 10 -45 -45 -45 -43 -41 -33 -25 -108 -94 1 -2 1 4 2 -1 -66 -130 -54 -74 -97 -23 -58 -94 -127 -160 -119 -77 67 114 39 -37
8977c7j0j0P0P1k5k5k6k5llllLMRq8N5N5r7JJ17m5MMj5j5M5n1oR1Mr2k7k7M7M8l4l5M7M6j
$$ -37 -47 -57 13 84 59 34 8 -17 -20 -23 -26 -29 -26 -22 -13 -101 -46 9 -88 -87 30 -15 -11 -7 -22 -37 8 -43 -49 42 46 -46 -73 -100 -53 -5 -39 -74 -27 19 18
8958A8jr2P0K3K4m7m7mmj00O1N2m6J57o9q4P7l4l4J51N5j37K5P2q9o6L0p6p6P2k5K9J25j5
$$ 18 17 -75 -5 18 42 -5 -52 -56 -60 -160 -99 -47 -93 64 -5 -89 -12 -46 -80 71 126 -11 14 86 -3 -69 -39 -115 -191 -119 -144 -115 10 -5
8941ej6k4k4L1L0p8J8LKK6j36L6L6K8K8kkJ7q0l2O5K0K1k2k2K2K3P1r0m3N4nnj9P7NNj02m
$$ -5 -21 -45 -69 -38 -8 -86 -68 -65 -63 -37 -173 -137 -101 -73 -45 -47 -49 -32 -112 -144 -79 -59 -38 -60 -82 -60 -37 34 -56 -99 -45 -50 -55 -74 3 8 13 -89 -93
8923i3P6k1kkqqj2j2M2n4L3L4P9q1n1J11p1p0N1N1k9l0K6K6qqQ1q0r2J33l8l9K4K4n7n8N6
$$ -93 -17 -38 -40 -42 -50 -58 -70 -82 -40 -94 -61 -27 52 -29 -80 31 -40 -110 -59 -8 -37 -67 -41 -15 -23 -31 50 -30 -122 11 -27 -66 -42 -18 -75 -133 -77
8905g7N6J8J8o0L6l9l9l8N8K5K6k3P4m3m3l7l7J8J8ook9l0N2N1p8p8KJ64P8j9l5l4k1k1O0
$$ -77 -21 -3 15 -45 -9 -48 -87 -125 -67 -42 -16 -39 35 -8 -51 -88 -125 -107 -89 -95 -101 -130 -160 -108 -57 -135 -213 -211 -47 31 12 -23 -57 -78 -99 -39
8888c9O0j1j2n9o0M9M9JJj5j4o3o3L8L7L8L8kklkQRj6j6L6L5j2j3JJJJJ5J4J4J4J9J8o2o3
$$ -39 21 10 -2 -61 -121 -72 -23 -22 -21 -36 -50 -113 -176 -138 -101 -63 -25 -27 -29 -32 -34 -26 -17 -33 -49 -13 22 10 -3 -2 -1 0 1 16 30 44 58 77 95 33 -30
8868c0M9M9l1l2j9k0j9k0LKLLj8j7m1m1N7N7k3k3j2j2L7L6L7L7m3m4K5K5K5K5k8k7k8k7K2
$$ -30 19 68 37 5 -14 -34 -53 -73 -70 -68 -65 -62 -80 -97 -138 -179 -122 -65 -88 -111 -123 -135 -98 -62 -25 12 -31 -75 -50 -25 0 25 -3 -30 -58 -85 -63
8851f3K2K2K2m8m9L3L3k4k3JJj4j4L4L5k3k3k2k3PPQ8Q7l1l2n6n6J2J3l6l6M4M3mnK6K7KK
$$ -63 -41 -19 3 -45 -94 -61 -28 -52 -75 -74 -73 -87 -101 -67 -32 -55 -78 -100 -123 -116 -109 -21 66 35 3 -53 -109 -97 -84 -120 -156 -112 -69 -73 -78 -52 -25 -23 -21
8832b1k7k7K2K2j0j0j0rj1j1L8L7l3l3J5J5N4N5n9n8K1K1K1K1k6k5k6k5K9L0j9j9k0k0k0j9
$$ -21 -48 -75 -53 -31 -41 -51 -61 -70 -81 -92 -54 -17 -50 -83 -68 -53 1 56 -3 -61 -40 -19 2 23 -3 -28 -54 -79 -50 -20 -39 -58 -78 -98 -118 -137
8815a37L0L1L0L1J0J0J1J0j5j5j5j5l2l2l2l3O2O1k0j9m3m3L2L2P4k2j07N4M7M7k3k3%JJJ
$$ -137 -107 -76 -46 -15 -5 5 16 26 11 -4 -19 -34 -66 -98 -130 -163 -101 -40 -60 -79 -122 -165 -133 -101 -27 -49 -156 -102 -55 -8 -31 -54 -54 -53 -52 -51
8798e1ONm2m3P1P1j0j0j5j4o2o3K9K9P7P7m4m3m3m3j4j4L4L4J0J0J0J0l1l1J7J8KKmmM4n4
$$ -51 -45 -40 -82 -125 -54 17 7 -3 -18 -32 -94 -157 -128 -99 -22 55 11 -32 -75 -118 -132 -146 -112 -78 -68 -58 -48 -38 -69 -100 -83 -65 -63 -61 -65 -69 -25 -79
8780g9r6O6O8k8o7L0K3K2K9K8qqqpk3k2K6K6m9n0L2L1J8J7l0l1M2M2Q5p7K0K1p0p0L4L5j3
$$ -79 -175 -109 -41 -69 -136 -106 -83 -61 -32 -4 -12 -20 -28 -35 -58 -80 -54 -28 -77 -127 -95 -64 -46 -29 -59 -90 -48 -6 79 2 22 43 -27 -97 -63 -28 -41
8762d1j4n8n8l6J25Q0Q1q8q7J1J1l8O0p5K2N4N4k9l0l5O1n5n6J12n0J00o1j15j9N1N0n6n6
$$ -41 -55 -113 -171 -207 -82 -2 79 -9 -96 -85 -74 -112 -52 -127 -105 -51 3 -26 -56 -91 -30 -85 -141 -29 -79 21 -40 -155 -174 -123 -73 -129 -185
8746a85J9J9J9J8J5J5J5J4j2j3L5L6m6m6L5L4m3m4kjP0k7K8K8m6m6KKK8K7L4L3o5L1k3k3j6
$$ -185 -166 -147 -128 -110 -95 -80 -65 -51 -63 -76 -41 -5 -51 -97 -62 -28 -71 -115 -117 -118 -48 -75 -47 -19 -65 -111 -109 -107 -79 -52 -18 15 -50 -19 -42 -65 -81
8729h1j5L2L3j8j9p2K4RQK0K0r4KJ16J8k6k6l1l2N1N2k3k3mR2j1j1j6j5j6j5mlmlK9K9n2n2
$$ -81 -96 -64 -31 -49 -68 -140 -116 -107 -99 -79 -59 -153 -151 -35 -17 -43 -69 -100 -132 -81 -29 -52 -75 -79 13 2 -9 -25 -40 -56 -71 -75 -78 -82 -85 -56 -27 -79 -131
8710a31Q6Q5k7k8jkpqM5n2LLm9m9k8O8O6l2rrm2J20j06rJ0RJ5J5NOO0l7PQq9P2qrN7m1ooj2
$$ -131 -45 40 13 -15 -16 -18 -25 -33 12 -40 -37 -34 -83 -132 -160 -92 -26 -58 -67 -76 -118 2 -104 -113 -103 -94 -79 -64 -59 -53 7 -30 -23 -15 -104 -32 -40 -49 8 -33 -39 -45 -57
8690e7j2j8j8j7j8Q6Q6mj02KKn8L8j3j4M2M1l6l7OON0m7N7N6rrn7n7K4K3l1l1N1m7N7N7k3
$$ -57 -69 -87 -105 -122 -140 -54 32 28 -74 -72 -70 -128 -90 -103 -117 -75 -34 -70 -107 -101 -95 -45 -92 -35 21 12 3 -54 -111 -87 -64 -95 -126 -75 -122 -65 -8 -31
8671c1k2j6j13N1N0N1m6j2j2K4K4P3k4j11j4N0m7O7k9l4l4J9J15RRJ6J5l1l1l1l1L6L6K2K2
$$ -31 -53 -69 -182 -131 -81 -30 -76 -88 -100 -76 -52 21 -3 -114 -128 -78 -125 -58 -87 -121 -155 -136 -21 -12 -3 13 28 -3 -34 -65 -96 -60 -24 -2 20
8655B0j28L3K8J24j6j14k6P0noN5m1PPJJk2k2N7m1k7k8J01No1o2j9j9ppJ6J7j3j4Q3j4O5l3
$$ 20 -108 -75 -47 77 61 -53 -79 -9 -14 -20 35 -6 1 8 9 10 -12 -34 23 -18 -45 -73 28 33 -28 -90 -109 -128 -135 -142 -126 -109 -122 -136 -53 -67 -2 -35
8637c5qqj0j0J4J4k8k9K0K0RQQQJ2J1NNM1n6j1j2P3q8J6J7j12J14M8n0o8K8J0J1N3m4O6l2
$$ -35 -43 -51 -61 -71 -57 -43 -71 -100 -80 -60 -51 -43 -35 -27 -15 -4 1 6 47 -9 -20 -32 41 -47 -31 -14 -126 -12 36 -14 -82 -54 -44 -33 20 -24 42 10
8619A0k4k4l1l0RRO9k7m8M9j1j1KKO3l5m5N2J6J6K3K4q5J1O6l1p3K4NNj3j4rj0M5n2k0j9M9
$$ 10 -14 -38 -69 -99 -90 -81 -12 -39 -87 -38 -49 -60 -58 -56 7 -28 -73 -21 -5 11 34 58 -27 -16 50 19 -54 -30 -25 -20 -33 -47 -56 -66 -21 -73 -93 -112 -63
8600f3M9L4o3M0M0o1o1p8K0J19m2OOONNOk2k2K6K7j8j8K0K0P8q4j8j7K6K6k2k2N4N5k7k7n7
$$ -63 -14 20 -43 -3 37 -24 -85 -163 -143 -24 -66 -60 -54 -48 -43 -38 -32 -54 -76 -50 -23 -41 -59 -39 -19 59 -25 -43 -60 -34 -8 -30 -52 2 57 30 3 -54
8582e4n7K3K3J9J8q5J2K4K4k5P2k0k0K9K8lj00R0qm0m1KKmlN0m5j1j1P0P1j01lN5m2j7J44
$$ -54 -111 -88 -65 -46 -28 -113 -101 -77 -53 -78 -6 -26 -46 -17 11 8 -92 -2 -10 -50 -91 -89 -87 -91 -94 -44 -89 -100 -111 -41 30 -71 -74 -19 -61 -78 66
8564F6qj69j4j4N7N6j6j6j6Q1q1J5O9k7lkrrk1k0k0k1L9L8j7Q1j5j5rrpqjr7P8P8m1m1L3L3
$$ 66 58 -111 -125 -139 -82 -26 -42 -58 -74 7 -74 -59 10 -17 -20 -22 -31 -40 -61 -81 -101 -122 -83 -45 -62 19 4 -11 -20 -29 -36 -44 -45 -142 -64 14 -27 -68 -35 -2
8545brrm5N2K8o9J0Rj4j5m6N1KKl7N9n0m9J10J3lln3J08o3o3rrJ36k5j34l7J02n9M2M2p1K6
$$ -2 -11 -20 -65 -13 15 -54 -44 -35 -49 -64 -110 -59 -57 -55 -92 -33 -83 -132 -22 -9 -12 -15 -68 40 -23 -86 -95 -104 32 7 -127 -164 -62 -121 -79 -37 -108 -82
8527h2m6m6P4P3RRRRj4j4k8k8J30r6PPrj0K9K8M0j22j9P8J15j11k6k7%jo7R4J5J6JJk7k7K1
$$ -82 -128 -174 -100 -27 -18 -9 0 9 -5 -19 -47 -75 55 -41 -34 -27 -36 -46 -17 11 51 -71 -90 -12 103 -8 -34 -61 -61 -62 -129 -35 -20 -4 -3 -2 -29 -56 -35
8508c5K1ooj6j6P9q4L2L2L8L9j03ok3j20J22K5j26J00j0rk9k8P5k3J1J0n0n0Q1j5o4L3N7N7
$$ -35 -14 -20 -26 -42 -58 21 -63 -31 1 39 78 -25 -31 -54 -174 -52 -27 -153 -53 -63 -72 -101 -129 -54 -77 -66 -56 -106 -156 -75 -90 -154 -121 -64 -7
8492gj8j8m8m9OOj8P8P9j8qrmmp5Q7mmppopk3k3L5L6n3J09%Jl8N9j61JkR5K5p3j3j4J09J2
$$ -7 -25 -43 -91 -140 -134 -128 -146 -68 11 -7 -15 -24 -28 -32 -107 -20 -24 -28 -35 -42 -48 -55 -78 -101 -66 -30 -83 26 26 27 -11 48 -113 -112 -114 -19 6 -67 -80 -94 15 27
8472B7Pr0PPm0m1j4Q3j3j2poL1L1j8j7m9m8L2L2L1L2j8j7MLJ4J3q0Q1N1m6m9M7M2n5j2j2k8
$$ 27 34 -56 -49 -42 -82 -123 -137 -54 -67 -79 -86 -92 -61 -30 -48 -65 -114 -162 -130 -98 -67 -35 -53 -70 -66 -63 -49 -36 -116 -35 16 -30 -79 -32 10 -45 -57 -69 -97
8453i7k8P2q9j1Q7J5q1P0r1L2L3k6k6J1J0K9K9Q2j6m1m2M1M0Qq9M7n0P7k0m8m9K5K6L2L3m7
$$ -97 -125 -53 -142 -153 -66 -51 -132 -62 -153 -121 -88 -114 -140 -129 -119 -90 -61 21 5 -36 -78 -37 3 11 -78 -31 -81 -4 -24 -72 -121 -96 -70 -38 -5 -52
8436e2N0J%m8m8Q7j0l0l0o6L1Q6p6O0l6q3P8OOqqK2K3k6k5j3j3O0l7Q3j5l7l7j4J47L0o7l0
$$ -52 -2 -1 -1 -49 -97 -10 -20 -50 -80 -146 -115 -29 -105 -45 -81 -164 -86 -80 -74 -82 -90 -68 -45 -71 -96 -109 -122 -62 -99 -16 -31 -68 -105 -119 28 58 -9 -39
8418c9l1L8L7M8m9p3K3j4j4K8o9K1J18Rq8q9P2p2K4j7Q1L2L2p4p4O1l6N8N8k8k9j1j2M7M8
$$ -39 -70 -32 5 53 4 -69 -46 -60 -74 -46 -115 -94 24 33 -55 -144 -72 -144 -120 -137 -56 -24 8 -66 -140 -79 -115 -57 1 -27 -56 -67 -79 -32 16
8401A6j31L1j5Q2P6j50o0J03K9L0m1m2P1P1j0rj7j6KJJ6q2K2K1l0l0l6O0k6k5J01o0q0J7J9
$$ 16 -115 -84 -99 -17 59 -91 -151 -48 -19 11 -30 -72 -1 70 60 51 34 18 20 21 37 -45 -23 -2 -32 -62 -98 -38 -64 -89 12 -48 -128 -111 -92
8384i2J9J00j27JJK0K0l4l4M6n1k1P5j9P8P8j9O1l6N3m4j53PL5L4m8J13j02oj03N9N5N5m7
$$ -92 -73 27 -100 -99 -98 -78 -58 -92 -126 -80 -131 -152 -77 -96 -18 60 41 102 66 119 75 -78 -71 -36 -2 -50 63 -39 -45 -148 -89 -34 21 -26
8368b6m7rrQ7p4o0J02J30l0nmq6J1J1J1n2M4j0j1J2J1opj04pO7k9N4m3ONK7K6n4n4P2P1rr
$$ -26 -73 -82 -91 -4 -78 -138 -36 94 64 59 55 -31 -20 -9 2 -50 -6 -16 -27 -15 -4 -10 -17 -121 -128 -61 -90 -36 -79 -73 -68 -41 -15 -69 -123 -51 20 11 2
8350Bj3j2r2ON7N8k4k3M6n0J0J0m6N2n8n8R4ll6l5P8j8j9P9m7m7L0K9P9q2q8P3N9l8k8O9k5
$$ 2 -11 -23 -115 -109 -52 6 -18 -41 5 -45 -35 -25 -71 -19 -77 -135 -41 -44 -80 -115 -37 -55 -74 5 -42 -89 -59 -30 49 -33 -121 -48 11 -27 -55 14 -11
8332a1k5k5P2k6k5J07j18J2J2lkkkQ9p3m4m4Q7rp8J9j7j7L6L6l6O0n5M1qpKJn2M4mmL3o4O2
$$ -11 -36 -61 11 -15 -40 67 -51 -39 -27 -30 -32 -34 -36 53 -20 -64 -108 -21 -30 -108 -89 -106 -123 -87 -51 -87 -27 -82 -41 -49 -56 -54 -53 -105 -61 -65 -69 -36 -100 -38
8313c8O3PQm0m1QPP8P9r5JO6l1n1n1l9l9M1M2l7l6j0Q7onn3M3ooM9M8l9l9l3l3j8P8K5K4k3
$$ -38 25 32 40 0 -41 -33 -26 52 131 36 37 103 72 21 -30 -69 -108 -67 -25 -62 -98 -108 -21 -27 -32 -85 -42 -48 -54 -5 43 4 -35 -68 -101 -119 -41 -16 8 -15
8294a5k3q9P2k1k2L0L1Mr3l2l3J1J08kjL2o6K0J9o7K9Q8rp8Q5M1n4JJJJr6JK7K7L3L3j6j6
$$ -15 -38 -127 -55 -76 -98 -68 -37 -33 -126 -158 -191 -180 -72 -74 -75 -43 -109 -89 -70 -137 -108 -20 -29 -107 -22 19 -35 -34 -33 -32 -31 -127 -126 -99 -72 -39 -6 -22 -38
8275c8kjN3m4j7j6k2k2j%j%%jJ8J8R1oj13j7m5N1L9n8l0O7lmP3q8N1N2K7K8j21M0L8j24N8
$$ -38 -40 -41 12 -32 -49 -65 -87 -109 -110 -110 -111 -111 -111 -112 -94 -76 15 9 -104 -121 -166 -115 -76 -134 -164 -97 -100 -104 -31 -119 -68 -16 11 39 -82 -42 -4 -128 -70
8257g0N7J2J1J7p9m4m3Q9p2RRN3N4l6O1J7j44j1j2L3L3LJ00l6l5j8j8POk7k7J08J1KLK1p6
$$ -70 -13 -1 10 27 -52 -96 -139 -50 -122 -113 -104 -51 3 -33 28 45 -99 -110 -122 -89 -56 -53 47 11 -24 -42 -60 -53 -47 -74 -101 7 18 20 23 44 -32
8239c2M3n4L0K9o3R8p7J9M0n7llM6n2n2M5L8L8l0l1m6N2j0rL4o2M6n0j5j4j4j4l7N9N3m3N9
$$ -32 11 -43 -13 16 -47 51 -26 -7 33 -24 -27 -30 16 -36 -88 -43 -5 33 3 -28 -74 -22 -32 -41 -7 -69 -23 -73 -88 -102 -116 -130 -167 -108 -55 -98 -39
8221c9l8NNM6n2lkM4n2KKO1O2n2n2J1J0j4j4j6j6O4O5j5j5J0Rk8k9j4j5J09n3j0j1j8j9O2
$$ -39 -77 -72 -67 -21 -73 -76 -78 -34 -86 -84 -82 -21 41 -11 -63 -52 -42 -56 -70 -86 -102 -38 27 12 -3 7 16 -12 -41 -55 -70 39 -14 -24 -35 -53 -72 -10
8203a0O2m4m4m4m4M5M4l6l5L5L5j3j3J8J8j6j6Q2p9q0Q2KJj2j2M5M6o7o7N5N6n8n7N1N1o4
$$ -10 52 8 -36 -80 -124 -79 -35 -71 -106 -71 -36 -49 -62 -44 -26 -42 -58 24 -55 -135 -53 -51 -50 -62 -74 -29 17 -50 -117 -62 -6 -64 -121 -70 -19 -83
8186h3R8j5j6nom3m3NOL2L1j6j7k8k9N2N2l0l1K4K4mR3M8j13K5K5r9r8N4N3L0K9l9l9RRK0
$$ -83 15 0 -16 -21 -27 -70 -113 -108 -102 -70 -39 -55 -72 -100 -129 -77 -25 -55 -86 -62 -38 -42 51 99 -14 11 36 -63 -161 -107 -54 -24 5 -34 -73 -64 -55 -35
8168c5K0K0K0k4k4K5K5k5k6k5k6L9M0rj0llllm2m2PJ03L7j25M7M7L6o0N4m2l9N8lkJ8J8j2
$$ -35 -15 5 25 1 -23 2 27 2 -24 -49 -75 -36 4 -5 -15 -18 -21 -24 -27 -69 -111 -104 -1 36 -89 -42 5 41 -19 35 -7 -46 12 9 7 25 43 31
8150C1j2L4o2qj05M9m8K5K5JJk4k3L8L9k0k0Q3p9R2R3l9l8p5Q6o1L6qqj2j2j2j2klK8K8n7
$$ 31 19 53 -9 -17 -122 -73 -121 -96 -71 -70 -69 -93 -116 -78 -39 -59 -79 4 -75 17 110 71 33 -42 44 -17 19 11 3 -9 -21 -33 -45 -47 -50 -22 6 -51
8132e1L9k1P6m9m8j9j8J3J2LKQ1q1m4N2J3J3J9J9k6k5j5j6q9P2j9j9K4K4m1N6J08n3K5K5j47
$$ -51 -12 -33 43 -6 -54 -73 -91 -78 -66 -63 -61 20 -61 -105 -53 -40 -27 -8 11 -15 -40 -55 -71 -160 -88 -107 -126 -102 -78 -119 -63 45 -8 17 42 -105
8114a05n0M7M7k9O9m0m1Q2j5L3L3nj01L3L4k5k5K3K4qpo2L5k0k0L4L4m1m1m7N0J8J9M8M9p
$$ -105 -155 -108 -61 -90 -21 -61 -102 -20 -35 -2 31 26 -75 -42 -8 -33 -58 -35 -11 -19 -26 -88 -53 -73 -93 -59 -25 -66 -107 -154 -104 -86 -67 -19 30 23
8097B3pjjo2L5K8K9p2p1M1M1m5m6Rq8J5J5O3l4RQm6m5L8L9N4m2o7R5K1K2J7J8j18k2L7L7N9
$$ 23 16 15 14 -48 -13 15 44 -28 -99 -58 -17 -62 -108 -99 -187 -172 -157 -94 -128 -119 -111 -157 -202 -164 -125 -71 -113 -180 -85 -64 -42 -25 -7 -125 -147 -110 -73 -14
8079a4l8p5Q7M4n3n1n2K3K3L7L8M3n3j3j4J5J5r8O2J5J4M4n4p2K5k9O7nnK3K3k5k6N4N4q2
$$ -14 -52 -127 -40 4 -49 -100 -152 -129 -106 -69 -31 12 -41 -54 -68 -53 -38 -136 -74 -59 -45 -1 -55 -127 -102 -131 -64 -69 -74 -51 -28 -53 -79 -25 29 -53
8062e3J5k2k2J3q2J2J2oR1K1p6q1P9QPQ4p7K3K4M9m7q6J2N8N8pj03N4m3j3j3ONJ3J3m2N5j
$$ -53 -38 -60 -82 -69 -151 -139 -127 -133 -42 -21 -97 -178 -99 -91 -84 0 -77 -54 -30 19 -28 -114 -102 -44 14 7 -96 -42 -85 -98 -111 -105 -100 -87 -74 -116 -61 -62
8044f2jn6M1O7k9P3q8J0J0n4n5R8Jk6k5J7J7P1k6k1k2Q1j5o2L6L5o2o0L7L1o6L9M0RRm8m9
$$ -62 -63 -119 -78 -11 -40 33 -55 -45 -35 -89 -144 -46 -45 -71 -96 -79 -62 9 -17 -38 -60 21 6 -56 -20 15 -47 -107 -70 -39 -105 -66 -26 -17 -8 -56 -105
8026a05OOl3O5J0J0mmN0m6L1L1n0m9n0M6R6j31J4J5M2M3L9n7n7M0l6l6o6L0J20K3k9k9l6l5
$$ -105 -99 -93 -126 -61 -51 -41 -45 -49 1 -45 -14 17 -33 -82 -132 -86 10 -121 -107 -92 -50 -7 32 -25 -82 -42 -78 -114 -180 -150 -30 -7 -36 -65 -101 -136
8009a36POL9n8K0K1mlj9J42J1q5l3O4P8j8m8j45L4L4J06J0n3n4l9N8L1o5K9K9j05N7J3J4L9
$$ -136 -129 -123 -84 -142 -122 -101 -105 -108 -127 15 26 -59 -92 -28 50 32 -16 -161 -127 -93 13 23 -30 -84 -123 -65 -34 -99 -70 -41 -146 -89 -76 -62 -23
7992b3L8j38K2P7k0mmj6j5j6j6L4L5j4Q3l8N9l8l8K2K1m0m1J26r9j4j4o6L1J%O1O1K8o8K2
$$ -23 15 -123 -101 -24 -44 -48 -52 -68 -83 -99 -115 -81 -46 -60 23 -15 44 6 -32 -10 11 -29 -70 56 -43 -57 -71 -137 -106 -105 -105 -44 17 45 -23 -1
7975ap4K3K3j%ONr8kJ80J8l5l5l9l9m0N6KKM9M8%r7j05N6KJR5lk8k9n7n6K3K4O6O7rqq4J4
$$ -1 -75 -52 -29 -30 -30 -24 -19 -117 -119 61 79 44 9 -30 -69 -109 -53 -51 -49 0 48 48 -49 -154 -98 -96 -95 0 -3 -31 -60 -117 -173 -150 -126 -60 7 -2 -10 -94 -80
7956h0R8o3j8j7N3N4J4J5n7L9j09j2K7K7n6M1j9j9M8m8m3m2N2N2L1o5m8M9j2j1J0J0J13J6
$$ -80 18 -45 -63 -80 -27 27 41 56 -1 38 -71 -83 -56 -29 -85 -44 -63 -82 -34 -82 -125 -167 -115 -63 -32 -97 -145 -96 -108 -119 -109 -99 14 30
7939C0j0j0j6j6m7m6J27L0r5JN4N4j7j7PPj7j6J16j09m2N5o2o2O6O6j11N0L5o1M1M2L6j26
$$ 30 20 10 -6 -22 -69 -115 12 42 -53 -52 2 56 39 22 29 36 19 3 119 10 -32 23 -39 -101 -35 31 -80 -30 5 -56 -15 27 63 -63
7923f3qQ8m2m3o1L6n3M4M3M4l2l2m5N3R1ok6k6J8J7J8p9M1n6l7N9J5J4q8QR2mQQj2j3j8j8
$$ -63 -71 17 -25 -68 -129 -93 -146 -102 -59 -15 -47 -79 -124 -71 20 14 -12 -38 -20 -3 15 -64 -23 -79 -116 -57 -42 -28 -116 -108 -16 -20 -12 -4 -16 -29 -47 -65
7905f5M8m9L6o1K5K6o2o1Q0P9N3m4n4n4P5k2m3m3L1L2KLn2M5j1j1P7P6m5m5LLnol5l6N9l9
$$ -65 -17 -66 -30 -91 -66 -40 -102 -163 -83 -4 49 5 -49 -103 -28 -50 -93 -136 -105 -73 -71 -68 -120 -75 -86 -97 -20 56 11 -34 -31 -28 -33 -39 -74 -110 -51 -90
7887i0J6J6J3J3j2j1J2J3O1O1l6l6j08j2oR0poK9L0Rq7m0N7K1K0L6L6K9j34j09J16Q2j5p2
$$ -90 -74 -58 -45 -32 -44 -55 -43 -30 31 92 56 20 -88 -100 -106 -16 -23 -29 0 30 39 -48 -88 -31 -10 10 46 82 111 -23 -132 -16 66 51 -21
7870b1p1M1M2j22k4J14J8N6m2m7m7Q6j2K0J9J3J4k9k9j07j0M2M3M9m6l5l5K9J26N8N8j40K2
$$ -21 -92 -51 -9 -131 -155 -41 -23 33 -9 -56 -103 -17 -29 -9 10 23 37 8 -21 -128 -138 -96 -53 -4 -50 -85 -120 -91 35 93 151 11 33
7855C3k0k1J2J2l1l0pR0n4M4N2j09j2j2rrrqj1j0j6Q0n3n4JJJ5J6O4O4j4j4Q3j3K4p2p8J9
$$ 33 13 -8 4 16 -15 -45 -52 38 -16 28 80 -29 -41 -53 -62 -71 -80 -88 -99 -109 -125 -45 -98 -152 -151 -150 -135 -119 -55 9 -5 -19 64 51 75 3 -75 -56
7836e6k5k5Q4j2M4M5m2m2l0l0l0l0PPO2l5J8J9K2K3j47J4J07J08j15j8j3Q3l7l7K9o7K1J17
$$ -56 -81 -106 -22 -34 10 55 13 -29 -59 -89 -119 -149 -142 -135 -73 -108 -90 -71 -49 -26 -173 -159 -52 56 -59 -77 -90 -7 -44 -81 -52 -119 -98 19
7820A9Nr3p0K7J5J4J5J5K9K8j03J22j5j4Q5p7K1K0k7O9o6o5K5K5j00mp7Q4N9l7p6K2J5q2R8
$$ 19 24 -69 -139 -112 -97 -83 -68 -53 -24 4 -99 23 8 -6 79 2 23 43 16 85 19 -46 -21 4 -96 -100 -177 -93 -34 -71 -147 -125 -110 -192 -94
7804i4R8Kr6K3K4J7J8j7j8L2L1m6m7L4L5L4L5j00mJ5J6J06n5L7o1n8n9m0N7O3l5o8K9M8M9
$$ -94 4 6 -90 -67 -43 -26 -8 -25 -43 -11 20 -26 -73 -39 -4 30 65 -35 -39 -24 -8 98 43 80 19 -39 -98 -138 -81 -18 -53 -121 -92 -44 5
7787Em1m1J3q3K4K4P3k5J7J7r4O7J03j23k9k8k9O8K0p7jjj2j3Q0j7L7L8o3o3J2J2Q4j3n6J06
$$ 5 -36 -77 -64 -147 -123 -99 -26 -51 -34 -17 -111 -44 59 -64 -93 -121 -150 -82 -62 -139 -140 -141 -153 -166 -86 -103 -66 -28 -91 -154 -142 -130 -46 -59 -115 -9
7770iJ6q0j6j6k1k2Q1j6KJM4j17j8Q0QRRq8M8M7J9J9J9J9m8m9%%K4K5j11j5QPLMJ38k3p1R0
$$ -9 7 -73 -89 -105 -126 -148 -67 -83 -81 -80 -36 -153 -171 -91 -83 -74 -65 -153 -105 -58 -39 -20 -1 18 -30 -79 -79 -79 -55 -30 -141 -156 -148 -141 -138 -134 4 -19 -90 0
7751@k1k0o5L2J1J1l2l1M5M6lkm2m1KJJ10J4m5m5N9N8n4n4QQJ4J4j08j1N3N4q0J7O5l1RRL
$$ 0 -21 -41 -106 -74 -63 -52 -84 -115 -70 -24 -27 -29 -71 -112 -110 -109 1 15 -30 -75 -16 42 -12 -66 -58 -50 -36 -22 -130 -141 -88 -34 -114 -97 -32 -63 -54 -45 -42
7732d2KJ4J4m1N6m3m4M3M3j6j6j5j6K6K7k8O9m4m4J0J1lln1n1P4P4O2r9j10N2O4O4n3n3K2
$$ -42 -40 -26 -12 -53 3 -40 -84 -41 2 -14 -30 -45 -61 -35 -8 -36 33 -11 -55 -45 -34 -37 -40 -91 -142 -68 6 68 -31 -141 -89 -25 39 -14 -67 -45
7715d5K2J3q3K0J9L5L5o8K9m3m4M9M9m6N1n3n2j6j6Q7j0M5M5m1m2J3J3J2J3j2j3lkq3Q0j8
$$ -45 -23 -10 -93 -73 -54 -19 16 -52 -23 -66 -110 -61 -12 -58 -7 -60 -112 -128 -144 -57 -67 -22 23 -18 -60 -47 -34 -22 -9 -21 -34 -37 -39 -122 -42 -60
7698f0j8J4q2N2N3p5p4M8M9n2J10l5O2m4m4M2M3J4J4r5JO8l0L7n9rj0rrK0J17n1n1J3J3j3
$$ -60 -78 -64 -146 -94 -41 -116 -190 -142 -93 -145 -35 -70 -8 -52 -96 -54 -11 3 17 -78 -77 -9 -39 -2 -61 -70 -80 -89 -98 -78 39 -12 -63 -50 -37 -50
7681e0j10J5J6K0K0r2P0O5O5p2K5k3k4k0P7k6k6K2K2l2l3N2m4RJ0n4n4Q1Q1M0j22K1J18Jr6
$$ -50 -160 -145 -129 -109 -89 -181 -111 -46 19 -53 -28 -51 -75 -95 -18 -44 -70 -48 -26 -58 -91 -39 -83 -74 -64 -118 -172 -91 -10 30 -92 -71 47 48 -48
7664d8k9l0k9O7OPM2n5j%j0j0L3L2J0q6J07n4J4J4J4J3j26L5j3j4R4kk9k9L3L4L4L3k1k2k1
$$ -48 -77 -107 -136 -69 -63 -56 -14 -69 -70 -70 -80 -90 -57 -25 -15 -101 6 -48 -34 -20 -6 7 -119 -84 -97 -111 -17 -19 -48 -77 -44 -10 24 57 36 14 -7
7646gk1poj2j2K7p0L4L3j5j5rrp0K7N4N3J4J3m6m5Q6p5l8N8QPo1o1j3Q3k6P0k9k9N8N8p2p2
$$ -7 -28 -35 -41 -53 -65 -38 -108 -74 -41 -56 -71 -80 -89 -159 -132 -78 -25 -11 2 -44 -89 -3 -78 -116 -58 -50 -43 -104 -165 -178 -95 -121 -51 -80 -109 -51 7 -65 -137
7628a37J9J8j09N2P4k2m2J20P7k0KJn3n3llM5M6qrM7n1k5k5J1J1P1k5m5m6m1N5n3M3j2j2M2
$$ -137 -118 -100 -209 -157 -83 -105 -147 -27 50 30 32 33 -20 -73 -76 -79 -34 12 4 -5 42 -9 -34 -59 -48 -37 34 9 -36 -82 -123 -68 -121 -78 -90 -102 -60
7610f0M2QPm7m7O1l6l6O1K8K9n9L8j32L0P0r2n1J10J0RJJJ%ppM7n0RRj4j5p4K3J6J7L7L6j2
$$ -60 -18 -10 -3 -50 -97 -36 -72 -108 -47 -19 10 -49 -11 -143 -113 -43 -135 -186 -76 -66 -57 -56 -55 -54 -54 -61 -68 -21 -71 -62 -53 -67 -82 -156 -133 -117 -100 -63 -27 -39
7591c9j2K6K6n4n5POj8j8P0P1m9m9O2l5l5O2k0j9M1n6J9J9J9p8j3j4N1N1O5r7j2Q5nmp8K0
$$ -39 -51 -25 1 -53 -108 -101 -95 -113 -131 -61 10 -39 -88 -26 -61 -96 -34 -54 -73 -32 -88 -69 -50 -31 -109 -122 -136 -85 -34 31 -66 -78 7 2 -2 -80 -60
7573f0%%R6o4NNj1j2J4q4J3J3P0k7k1k1N7N8k3k3kkNr3L2L2K5K6J3J3j3j10qqk0P6l3l3q0
$$ -60 -60 -60 36 -28 -23 -18 -29 -41 -27 -111 -98 -85 -15 -42 -63 -84 -27 31 8 -15 -17 -19 -14 -107 -75 -43 -18 8 21 34 21 -89 -97 -105 -125 -49 -82 -115 -195
7555a95Q1N7j05OOqJ54n0n0nmnmJ1J1NNQ0j7j2j1j9j9PJ03l1l1K4K3l6l6k3k2J13m8o1L6%
$$ -195 -114 -57 -162 -156 -150 -158 -4 -54 -104 -109 -113 -118 -122 -111 -100 -95 -90 -10 -27 -39 -50 -69 -88 -81 22 -9 -40 -16 7 -29 -65 -88 -110 3 -45 -106 -70 -70
7537g0%L1L0l5l5J3J3RRj13M9L2o6M2M1R0qo6o6j3j4O8O7pqJ07n5l2l2q4P7k3k3m3N3j1j1
$$ -70 -70 -39 -9 -44 -79 -66 -53 -44 -35 -148 -99 -67 -133 -91 -50 40 32 -34 -100 -113 -127 -59 8 1 -7 100 45 13 -19 -103 -26 -49 -72 -115 -62 -73 -84
7519h4onJ8J8p9Q2J3q5K9K9J0J1K0K0j52J0J22l9o6o5O9P0KKKKN9N8p7K0n2n2p0R2J83m3j45
$$ -84 -90 -95 -77 -59 -138 -56 -43 -128 -99 -70 -60 -49 -29 -9 -161 -151 -29 -68 -134 -199 -130 -60 -58 -56 -54 -52 7 65 -12 8 -44 -96 -166 -74 109 66 -79
7501g9Q1k1k1K3K4r7%k9O9M4M4o9o9O5l2kkj3j3M1M1rQ8m7m7J3J4r0QM3M4n7n7m8M9P4k4l1
$$ -79 2 -19 -40 -17 7 -90 -90 -119 -50 -6 38 -31 -100 -35 -67 -69 -71 -84 -97 -56 -15 -24 64 17 -30 -17 -3 -93 -85 -42 2 -55 -112 -160 -111 -37 -61 -92
7483i2l2J0J1L2L1N6m0j4j09j4j3Q0P9kjQQm0m0klN8l8l0O6L1L0q2q2L7L7n7M0j5Q2n0M7k
$$ -92 -124 -114 -103 -71 -40 16 -24 -38 -147 -161 -174 -94 -15 -17 -18 -10 -2 -42 -82 -84 -87 -29 -67 -97 -31 0 30 -52 -134 -97 -60 -117 -77 -92 -10 -60 -13 -15
7465a5kk2k2Q1j5n3n2P7k0j1j1k4k4N6m0J3J4LLllL8n8Q5j1j44J7J18m3J6q1k9J33N1j76K1
$$ -15 -17 -39 -61 20 5 -48 -100 -23 -43 -54 -65 -89 -113 -57 -97 -84 -70 -67 -64 -67 -70 -32 -90 -5 -16 -160 -143 -25 -68 -52 -133 -162 -29 22 -154 -133
7448a33J17op%%rqK2K3j07j0P8k0m9M7j9P8o1o2opJ9J9k4J38l7l8K1K1m5m6n2M6MNN4N3L3
$$ -133 -16 -22 -29 -29 -29 -38 -46 -24 -1 -108 -118 -40 -60 -109 -62 -81 -3 -64 -126 -132 -139 -120 -101 -125 13 -24 -62 -41 -20 -65 -111 -163 -117 -113 -108 -54 -1 32
7430C2o3Lr4j2Q5K4K4J5J4K0p6J6J5j4j4m1m0O2l5J2J2k4k5P6k1m7m7O4O4k2k3L9n9mmM0L9
$$ 32 -31 -28 -122 -134 -49 -25 -1 14 28 48 -28 -12 3 -11 -25 -66 -106 -44 -79 -67 -55 -79 -104 -28 -49 -96 -143 -79 -15 -37 -60 -21 -80 -84 -88 -48 -9
7412im1m1J5J5J1q6M0j22R8JJ7J7l8l7L3L4RJ0L5L6o7L0RJ0o3L3K5K4n0n0JJN6m1%%J9J9j8
$$ -9 -50 -91 -76 -61 -50 -136 -96 -218 -120 -119 -102 -85 -123 -160 -127 -93 -84 -74 -39 -3 -70 -40 -31 -21 -84 -51 -26 -2 -52 -102 -101 -100 -44 -85 -85 -85 -66 -47 -65
7394f5j7k3P4N0N1kr9ooj2j2j4j3M0n6O7O7p5K3L2L3rj0j2j1l8j35O5O5J0J1lkn7n6P9j8m2
$$ -65 -82 -105 -31 19 70 68 -31 -37 -43 -55 -67 -81 -94 -54 -110 -43 24 -51 -28 4 37 28 18 6 -5 -43 -178 -113 -48 -38 -27 -30 -32 -89 -145 -66 -84 -126
7375a26N5ppL3L3q7P4QQj2j3L6L6KLJ4q2p2K4M5M5j4j5L5j28KR9m7m6J2J3O0O1n9o0j1j1R
$$ -126 -71 -78 -85 -52 -19 -106 -32 -24 -16 -28 -41 -5 31 33 36 50 -32 -104 -80 -35 10 -4 -19 16 -112 -110 -11 -58 -104 -92 -79 -19 42 -17 -77 -88 -99 -90
7357i0QQRjjjjj0j1N4m3p8Q3L5L5QRq2P9j4j5mmj5j5j5j5L9L9qrn4n4O0N9pppqk0k0k1k0N2
$$ -90 -82 -74 -65 -66 -67 -68 -69 -79 -90 -36 -79 -157 -74 -39 -4 4 13 -69 10 -4 -19 -23 -27 -42 -57 -72 -87 -48 -9 -17 -26 -80 -134 -74 -15 -22 -29 -36 -44 -64 -84 -105 -125 -73
7336g3N2o1o0j6j5L3L3K4K5n7n7K4K4K4K4k1k0K8K8kkr2O8POJ6J6j7j7O4O3l2l2j33K8R6o6
$$ -73 -21 -82 -142 -158 -173 -140 -107 -83 -58 -115 -172 -148 -124 -100 -76 -97 -117 -89 -61 -63 -65 -157 -89 -82 -76 -60 -44 -61 -78 -14 49 17 -15 -148 -120 -24 -90
7319i0L5L6qqn7n6M9M9M9M9n0n0o0J02kkQQk3k3j3j3m6J16K4K5j8j7o7o6L4L4j5j5noR5o6
$$ -90 -55 -19 -27 -35 -92 -148 -99 -50 -1 48 -2 -52 -112 -10 -12 -14 -6 2 -21 -44 -57 -70 -116 0 24 49 31 14 -53 -119 -85 -51 -66 -81 -86 -92 3 -63
7301f3j03N8O4O4Kr5PQK0K0p6Q4J6q2L1L2j9j9K3K4J5q2l9N8Q7rl0k9lkMMj00kl1O7j0rj5
$$ -63 -166 -108 -44 20 22 -73 -66 -58 -38 -18 -94 -10 6 -76 -45 -13 -32 -51 -28 -4 11 -71 -110 -52 35 26 -4 -33 -36 -38 -34 -30 -130 -132 -163 -96 -106 -115 -130
7282a30Q1L3o3M6M5l9l9N1j09NON0m7K3K3J6J7K4K5n7n6J2J2OOL5o3M1M1n3n2k6P1LMJ0J0
$$ -130 -49 -16 -79 -33 12 -27 -66 -15 -124 -119 -113 -63 -110 -87 -64 -48 -31 -7 18 -39 -95 -83 -71 -65 -59 -24 -87 -46 -5 -58 -110 -136 -65 -62 -58 -48 -38
7264c8j8j7O3O3K1K1j47n0J%J7J7p3Q9MMq7RllO1l6J9J9j2j3j2j3K3K2K9K8j15j8P3P3m6m5
$$ -38 -56 -73 -10 53 74 95 -52 -102 -101 -101 -84 -67 -140 -51 -47 -43 -130 -121 -124 -127 -66 -102 -83 -64 -76 -89 -101 -114 -91 -69 -40 -12 -127 -145 -72 1 -45 -90
7246i0Q9pm4m3L7L7p3K4m7N0J04n7j4j5j5j13N0M9M8m8N4N4k9k9l6l5N9l8J6J6k2k2L2o4R
$$ -90 -1 -8 -52 -95 -58 -21 -94 -70 -117 -67 37 -20 -34 -49 -64 -177 -127 -78 -30 -78 -24 30 1 -28 -64 -99 -40 -78 -62 -46 -68 -90 -58 -122 -113
7229a13RN8l9j4j4N5N5L0o6o6L1K6K6j6j7J1J1J1J1k7k7k7k6K2K3Q3j4p6K1J00o1l8l7L3L3
$$ -113 -104 -46 -85 -99 -113 -58 -3 27 -39 -105 -74 -48 -22 -38 -55 -44 -33 -22 -11 -38 -65 -92 -118 -96 -73 10 -4 -80 -59 41 -20 -58 -95 -62 -29
7213b9J0Rn1M6j0j06P3P3j08j1k3k3N3m3K1K1o7R4N8l9QQLKk7k8P5k1k8k7n4M3J10j16p4Q7
$$ -29 -19 -10 -61 -15 -25 -131 -58 15 -93 -104 -127 -150 -97 -140 -119 -98 -165 -71 -13 -52 -44 -36 -33 -31 -58 -86 -11 -32 -60 -87 -141 -98 12 -104 -178 -91
7196i1llJ2J3OJ02oj68K0K0O4l2qqJ26l6k5k4l5l5J9J9P4k4llJ7J14p2p2K0K1n3M4j5j11J18
$$ -91 -94 -97 -85 -72 -66 36 30 -138 -118 -98 -34 -66 -74 -82 44 8 -17 -41 -76 -111 -92 -73 1 -23 -26 -29 -12 102 30 -42 -22 -1 -54 -10 -25 -136 -18
7178a8m3oR0m8M8j%l4l4K1K1r7jM8m9J4J3J3q3M6M5M0L9j1j2k2k1P4q8r3O8O7l1N5j07p1R1
$$ -18 -61 -67 23 -25 23 22 22 -12 -46 -25 -4 -101 -102 -54 -103 -89 -76 -63 -146 -100 -55 -15 24 13 1 -21 -42 32 -56 -149 -81 -14 -45 10 -97 -168 -77
7160g7mmj1Q7j7j6J6J5l8N8L4L5p2p3O2O2n1n1O2O2P8q4j11j5O6r6oR1n4n5M1M0m0m0M9M8
$$ -77 -81 -85 -96 -9 -26 -42 -26 -11 -49 9 43 78 6 -67 -5 57 6 -45 17 79 157 73 -38 -53 13 -83 -89 2 -52 -107 -66 -26 -66 -106 -57 -9
7143iq6J1J3J4J9K0l7l8n3J08O9k8j2j2l0l1l7O1J0J1J7J7o3o4R8KK4p2p8J8J1J0P2k6j9j8
$$ -9 -95 -84 -71 -57 -38 -18 -55 -93 -146 -38 31 3 -9 -21 -51 -82 -119 -58 -48 -37 -20 -3 -66 -130 -32 -30 -6 -78 -156 -138 -127 -117 -45 -71 -90 -108
7126a08L0o7jjj9P8M7m9J1J1J0J0l8l9JJJJK2K3J13m8l2l2O1l6qqM5M5j36K5J6J5j1j1k1k1
$$ -108 -78 -145 -146 -147 -166 -88 -41 -90 -79 -68 -58 -48 -86 -125 -124 -123 -122 -121 -99 -76 37 -11 -43 -75 -14 -50 -58 -66 -21 24 -112 -87 -71 -56 -67 -78 -99 -120
7108a20R4o6K4K4j4j4j5j4O0N9k7k7N9l8K3K3p1K6k8k9k0k0j3j4j3Q4j9j9L0K9L0K9l0l1l1
$$ -120 -26 -92 -68 -44 -58 -72 -87 -101 -41 18 -9 -36 23 -15 8 31 -40 -14 -42 -71 -91 -111 -124 -138 -151 -67 -86 -105 -75 -46 -16 13 -17 -48 -79
7091g9l1P6P6j4j5K5j36O7O7l0l0J9J8NMn0M6k4k5j09N2J9J8R0qq4J3n4M3j6j5j0rL7L7j8
$$ -79 -110 -34 42 28 13 38 -98 -31 36 6 -24 -5 13 18 22 -28 18 -6 -31 -140 -88 -69 -51 39 31 -53 -40 -94 -51 -67 -82 -92 -101 -64 -27 -45
7074d5j7M5n2j00mJ7J6K2K3N6N7q9q9K5K4J8J9J45M9j66mJ5J6K5K5k2k3j6j6m2N5n9L7M9m8
$$ -45 -62 -17 -69 -169 -173 -156 -140 -118 -95 -39 18 -71 -160 -135 -111 -93 -74 71 120 -46 -50 -35 -19 6 31 9 -14 -30 -46 -88 -33 -92 -55 -6 -54
7057e4m8M9N1m7QQM1n6NMn3M3L1j30M9M9rj0J0J0J0J1L1L1j7j7JJn3n3M1n7NMm2N6J04PJ6
$$ -54 -102 -53 -2 -49 -41 -33 8 -48 -43 -39 -92 -49 -18 -148 -99 -50 -59 -69 -59 -49 -39 -28 3 34 17 0 1 2 -51 -104 -63 -120 -115 -111 -153 -97 7 14 30
7039C0J6r9kRq8K1K1k1k1J18m4K8K8o3o3j1j0L8L8jjR6jL1o5j8j7J1J0J6J6n3M3mj02J8J8
$$ 30 46 -53 -55 -46 -134 -113 -92 -113 -134 -16 -60 -32 -4 -67 -130 -141 -151 -113 -75 -76 -77 19 18 49 -16 -34 -51 -40 -30 -14 2 -51 -8 -12 -114 -96 -78
7021g8J3J2RRJ6J5m3N4poJ8p8l4J28l4l4L1o7ONopM8m8NOj5j6L9L9m8M9no%J%JJ2J3l0l0n1
$$ -78 -65 -53 -44 -35 -19 -4 -47 7 0 -6 12 -66 -100 28 -6 -40 -9 -76 -70 -65 -71 -78 -30 -78 -73 -67 -82 -98 -59 -20 -68 -19 -24 -30 -30 -29 -29 -28 -16 -3 -33 -63 -114
7001a14M7qqL9L9l6l5l9N8N8l9OO%%k0k0k0k0L1L2M3M4j63L0LKMMMNN4N5k6k6K0K0K0K0m3
$$ -114 -67 -75 -83 -44 -5 -41 -76 -115 -57 1 -38 -32 -26 -26 -26 -46 -66 -86 -106 -75 -43 0 44 -119 -89 -86 -84 -80 -76 -72 -67 -13 42 16 -10 10 30 50 70 27
6982B7m2K6K6N9j35k6k6J9K0J9J9j6j6j7j6L3L3N1m6j05Q8k7k7J1J1J1J2M3M2p0p0j6j7m5
$$ 27 -15 11 37 96 -39 -65 -91 -72 -52 -33 -14 -30 -46 -63 -79 -46 -13 38 -8 -113 -25 -52 -79 -68 -57 -46 -34 9 51 -19 -89 -105 -122 -167
6965a67J49m3m2J8J8l4l5J5J4M4M4mnl0l1J8J8n0n1O3O2j0j0j0j0pqqqk7k6N5N4m0m1P3P2
$$ -167 -18 -61 -103 -85 -67 -101 -136 -121 -107 -63 -19 -23 -28 -58 -89 -71 -53 -103 -154 -91 -29 -39 -49 -59 -69 -76 -84 -92 -100 -127 -153 -98 -44 -84 -125 -52 20
6948B0j2j1o0n9K7K8K8K8j9k0j9j9LMLMJ2J3o8o9N7N7N7N7kln1n1M1M0J4q3K6K6K0K0mmmn
$$ 20 8 -3 -63 -122 -95 -67 -39 -11 -30 -50 -69 -88 -85 -81 -78 -74 -62 -49 -117 -186 -129 -72 -15 42 40 37 -14 -65 -24 16 30 -53 -27 -1 19 39 35 31 27 22
6929B2m6m7Q9rm4m4kkKJJ1J2n3J09L0o6o6L1J3J3M8m9Nr1R2nj1Q6lmn1M5%jOOMNJ0q6OOrj0
$$ 22 -24 -71 18 9 -35 -79 -81 -83 -81 -80 -69 -57 -110 -1 29 -37 -103 -72 -59 -46 2 -47 -42 -133 -41 -46 -57 29 26 22 -29 16 16 15 21 27 31 36 46 -40 -34 -28 -37 -47
6908d7L5j26M5M5j3j3qpm2N6M9M9k4k5k4k5klN2m5J6J5m5N2LKJ5J5n1M6o3L4m2m3OOP3k4L0
$$ -47 -12 -138 -93 -48 -61 -74 -82 -89 -131 -75 -26 23 -1 -26 -50 -75 -77 -80 -28 -73 -57 -42 -87 -35 -32 -30 -15 0 -51 -5 -68 -34 -76 -119 -113 -107 -34 -58 -28
6889b8L0l3l3m5N2N5m2p2R0k2k1M4n4l2l2M2M2J3J2kkJ32r5l8l8n1J11K6K6o8K9k5k6QPm7
$$ -28 2 -31 -64 -109 -57 -2 -44 -116 -26 -48 -69 -25 -79 -111 -143 -101 -59 -46 -34 -36 -38 94 -1 -39 -77 -128 -17 9 35 -33 -4 -29 -55 -47 -40 -87
6872h7N0J2J2l0l1POL1L1QQQQj4j3N0m6j09N2m5m5N2N2n5n4MJ01K2K3j0j0j1j0j9j8K3K4N8
$$ -87 -37 -25 -13 -43 -74 -67 -61 -30 1 9 17 25 33 19 6 56 10 -99 -47 -92 -137 -85 -33 -88 -142 -138 -37 -15 8 -2 -12 -23 -33 -52 -70 -47 -23 35
6854C5l9p5Q6L1L0m7m6M6n1j5j5q5J2J25K8o9o9M4M4n0M7N3m3o9K9J6J7n8n9M5n2K3K2J7J6
$$ 35 -4 -79 7 38 68 21 -25 21 -30 -45 -60 -145 -133 -8 20 -49 -118 -74 -30 -80 -33 20 -23 -92 -63 -47 -30 -88 -147 -102 -154 -131 -109 -92 -76
6837g6K6K6J9K0M6n2O4l3j18k1O4O4o4o4j6j6nonnJ5J6J6J6k8k8L3o5K2J19Q9ro3o3j7Q0M3
$$ -76 -50 -24 -5 15 61 9 73 40 -78 -99 -35 29 -35 -99 -115 -131 -136 -142 -147 -152 -137 -121 -105 -89 -117 -145 -112 -177 -155 -36 53 44 -19 -82 -99 -19 24
6819B4n4l5l6n3M3L7L8m6m5O2O2O8k9k2k3l2l2nR1n0n0p5K3M6M7MMJ0RJ0J0NNm3m3l8l8m7
$$ 24 -30 -65 -101 -154 -111 -74 -36 -82 -127 -65 -3 65 36 14 -9 -41 -73 -78 13 -37 -87 -162 -139 -93 -46 -42 -38 -28 -19 -9 1 6 11 -32 -75 -113 -151 -198
6801a98J13k5k5RRk4k4L1L1j8Q0l0k9O7k9O8r3OOl4O3J8J7k4k5k8k9N3N2l5l4L6L6J7j45M
$$ -198 -85 -110 -135 -126 -117 -141 -165 -134 -103 -121 -41 -71 -100 -33 -62 6 -87 -81 -75 -109 -46 -28 -11 -35 -60 -88 -117 -64 -12 -47 -81 -45 -9 8 -137 -133
6784a33J01rj0mmj0j0N0m6n1M6j5j5K7K7J41j9MNj09j1J7J7kjKLmmK6p0N9N8K1p7p6K0m2m2
$$ -133 -32 -41 -51 -55 -59 -69 -79 -29 -75 -126 -80 -95 -110 -83 -56 85 66 70 75 -34 -45 -28 -11 -13 -14 -12 -9 -13 -17 9 -61 -2 56 77 0 -76 -56 -98 -140
6766a40L9L8J1q5J10J3p4K3n0M7N3m4K2K3o7L1j0j0P2q8N0N1k9k9n3n3P1P1m1m2NMN9l8qr
$$ -140 -101 -63 -52 -137 -27 -14 -88 -65 -115 -68 -15 -59 -37 -14 -81 -50 -60 -70 2 -86 -36 15 -14 -43 -96 -149 -78 -7 -48 -90 -85 -81 -22 -60 -68 -77
6748g7L4L3k7k8K0K1L1L1m4m3m0N7K0K1J6q0K2K3qpOON7j05o3o3Q1Q0OOn1M7rqj7j7P4q8r
$$ -77 -43 -10 -37 -65 -45 -24 7 38 -6 -49 -89 -32 -12 9 25 -55 -33 -10 -18 -25 -19 -13 44 -61 -124 -187 -106 -26 -20 -14 -65 -18 -27 -35 -52 -69 5 -83 -92
6730i2rMNL7L7l8l8n8L8J1J07MNj05N6k7k8L7L7r2Mr2P0N7N8K0J9k9l0j1j2K4p4J4J10q0J8
$$ -92 -101 -97 -92 -55 -18 -56 -94 -152 -114 -103 4 8 13 -92 -36 -63 -91 -54 -17 -109 -105 -197 -127 -70 -12 8 27 -2 -32 -43 -55 -31 -105 -91 19 -61 -43
6712d3K3p3P3P2n2n2pj04K6K5O8k9n3M3K8K8O4l3l5l6O1l6j2j2j2j2n9L7NJ67o1o0Q4j2p0
$$ -43 -20 -93 -20 52 0 -52 -59 -163 -137 -112 -44 -73 -126 -83 -55 -27 37 4 -31 -67 -6 -42 -54 -66 -78 -90 -149 -112 -107 60 -1 -61 23 11 -59
6695e9o9noJ03n9k3P4J8J9n0n0n9L8L2L3L4L4l7l6r2O9K7K7LMm5m4K0K0m5N2P9q2J5J5RRR
$$ -59 -128 -133 -139 -36 -95 -118 -44 -26 -7 -57 -107 -166 -128 -96 -63 -29 5 -32 -68 -160 -91 -64 -37 -34 -30 -75 -119 -99 -79 -124 -72 7 -75 -60 -45 -36 -27 -18
6677a8QNML5L4m5N1m6m5n2M5rj0J2J2L6L6n6n6K4K5k3k3k9O8l5l6ooK3K3MNKR8o2o3n9L7O1
$$ -18 -10 -5 -1 34 68 23 74 28 -17 -69 -24 -33 -43 -31 -19 17 53 -3 -59 -35 -10 -33 -56 -85 -17 -52 -88 -94 -100 -77 -54 -50 -45 -43 55 -7 -70 -129 -92 -31
6658c1l6m4m4O9O9q5J3OOJ9J9k9k9J0J1NMM2n4Q0Q0n7n7llq5J1L7L8l1l0QPJ30l2Or1n9L8
$$ -31 -67 -111 -155 -86 -17 -102 -89 -83 -77 -58 -39 -68 -97 -87 -76 -71 -67 -25 -79 1 81 24 -33 -36 -39 -124 -113 -76 -38 -69 -99 -91 -84 46 14 20 -71 -130 -92
6640i2O1l4m4N3M1n5M9m8N5m1rqL4L4qpqpk6k6K3K3ooM9m8OOk5k4L7L7j29L3qQ9l6l6k1k1
$$ -92 -31 -65 -109 -56 -15 -70 -21 -69 -14 -55 -64 -72 -38 -4 -12 -19 -27 -34 -60 -86 -63 -40 -46 -52 -3 -51 -45 -39 -64 -88 -51 -14 -143 -110 -118 -29 -65 -101 -122 -143
6621a43K1K1K0p8k9O8M8M8J2J2o0L7J2q4K4K4q5J2M4M4JJK2K2l2l2K3p3P8j9M7m9j9k0o9K8
$$ -143 -122 -101 -81 -159 -188 -120 -72 -24 -12 0 -60 -23 -11 -95 -71 -47 -132 -120 -76 -32 -31 -30 -8 14 -18 -50 -27 -100 -22 -41 6 -43 -62 -82 -151 -123
6603a23J6J5Q9qo7o6Q2Q3k4k4k7P0j34K8J09n3K4K4K3K2k6k6k0k0n0n0L5o2M1M2j4j4M1M1
$$ -123 -107 -92 -3 -11 -78 -144 -62 21 -3 -27 -54 16 -118 -90 19 -34 -10 14 37 59 33 7 -13 -33 -83 -133 -98 -160 -119 -77 -91 -105 -64 -23
6587b3j15j8M0M1rrJ5J5L4L4m5N2n3n3K8K7L1o7o6L0R0Q9q1q2KKJ55oj84M2K4K4q4J3L3L3
$$ -23 -138 -156 -116 -75 -84 -93 -78 -63 -29 5 -40 12 -41 -94 -66 -39 -8 -75 -141 -111 -21 68 -13 -95 -93 -91 64 58 -126 -84 -60 -36 -120 -107 -74 -41
6570d1M3n3POo1L5k5k6Pq9O1l5J28L1l3l3K1K1J5J5L2o5o6L2kkNMj8j8R5R5j06j06QPJ4J3
$$ -41 2 -51 -44 -38 -99 -64 -89 -115 -108 -197 -136 -171 -43 -12 -45 -78 -57 -36 -21 -6 26 -39 -105 -73 -75 -77 -72 -68 -86 -104 -9 86 -20 -126 -118 -111 -97 -84
6552h4O3O2j07j07L3L2M8m8l5O3O0j00M4M5j6j6L2o4M1n5ppM0M1N4N4j75N0kkR8%q0J6k2k1
$$ -84 -21 41 -66 -173 -140 -108 -60 -108 -143 -80 -20 -120 -76 -31 -47 -63 -31 -95 -54 -109 -116 -123 -83 -42 12 66 -109 -59 -61 -63 35 35 -45 -29 -51 -72
6535g2j6j6MMMML1L1p1p2n3J08P2k5j8j7K4K5QPm0m1O1O0k0k1L9L9j0j0k2k2L2o4j3j2j8j9
$$ -72 -88 -104 -100 -96 -92 -88 -57 -26 -97 -169 -222 -114 -42 -67 -85 -102 -78 -53 -45 -38 -78 -119 -58 2 -18 -39 0 39 29 19 -3 -25 7 -57 -70 -82 -100 -119
6517a19K4K5K4K5ooK4p3K2K2N8j03K5K5l9l9R2nK6K6m6m7LKJKJKmlmmK5K4L1L1o7L0k5k4j9
$$ -119 -95 -70 -46 -21 -27 -33 -9 -82 -60 -38 20 -83 -58 -33 -72 -111 -19 -24 2 28 -18 -65 -62 -60 -59 -57 -56 -54 -58 -61 -65 -69 -44 -20 11 42 -25 5 -20 -44 -63
6497f3j8j8j9J9J9K5K5m7M9M3M3k7k7P0k7M3n3n9L7m0m0m0m0N9l8MJ01P7k0o8K9K3p5Q3p8
$$ -63 -81 -99 -118 -99 -80 -55 -30 -77 -28 15 58 31 4 74 47 90 37 -22 15 -25 -65 -105 -145 -86 -124 -120 -19 58 38 -30 -1 22 -53 30 -48
6480d8l5O1mlm0l9O3l4L0L0k5k5L3L3M4n2m5N2N2m6j13j7N7l9J5J5O3l3k7k6M2M2j6j12m2
$$ -48 -83 -22 -26 -29 -69 -108 -45 -79 -49 -19 -44 -69 -36 -3 41 -11 -56 -4 48 2 -111 -128 -71 -110 -95 -80 -17 -50 -77 -103 -61 -19 -35 -147 -189
6464a89N5J01o1L6L6k8k8K6K7r0QN5m1k3k2J06RM9M9J7q1j2j3L6o1K3K2l8N9k3k3L7o0rrP5
$$ -189 -134 -33 -94 -58 -22 -50 -78 -52 -25 -115 -107 -52 -93 -116 -138 -32 -23 26 75 92 11 -1 -14 22 -39 -16 6 -32 27 4 -19 18 -42 -51 -60 15
6447A5q6K0K0J0J0m6m5KLJ1J1J0J1j6j7L8L8k2P4q9PO2l4l5O2J5q3k2k1K7K8k1k1j5j4M0n7
$$ 15 -71 -51 -31 -21 -11 -57 -102 -100 -97 -86 -75 -65 -54 -70 -87 -49 -11 -33 41 -48 -41 21 -13 -48 14 29 -54 -76 -97 -70 -42 -63 -84 -99 -113 -73 -130
6429a30N8N8lkK3p4p3K3jjQ6p6P3q8P3P3k4k5o7R5K7K8m3m3l5l4N3N3o9K9k7k6k4k4L0o6N8
$$ -130 -72 -14 -17 -19 4 -70 -143 -120 -121 -122 -36 -112 -39 -127 -54 19 -5 -30 -97 -2 25 53 10 -33 -68 -102 -49 4 -65 -36 -63 -89 -113 -137 -107 -173 -115
6411a15N9n1M7K3K3rrn2J09l0k9l9l9P4P4k7k7K7p0j4j4J19m2K9K9o1o1k0k0K2K2M8m8NOO
$$ -115 -56 -107 -60 -37 -14 -23 -32 -84 25 -5 -34 -73 -112 -38 36 9 -18 9 -61 -75 -89 30 -12 17 46 -15 -76 -96 -116 -94 -72 -24 -72 -67 -61 -55
6394e5OONo0o0P9P9K1p6k2k2L6L7L6o1M6n1kkn3n2O0O1j3j2j8P8J%J2J3j06qK3K4p5K2P5P4
$$ -55 -49 -43 -38 -98 -158 -79 0 21 -55 -77 -99 -63 -26 10 -51 -5 -56 -58 -60 -113 -165 -105 -44 -57 -69 -87 -9 -8 -8 4 17 -89 -97 -74 -50 -125 -103 -28 46
6375D6Qq8l5l4RQRRQRn6M1P7q5OOO0l6l1l0nmj1Q6j1j1j1j0L2o4o5L3OOJ04n9MLjjm3N4jj
$$ 46 54 -34 -69 -103 -94 -86 -77 -68 -60 -51 -107 -66 11 -74 -68 -62 -2 -38 -69 -99 -104 -108 -119 -33 -44 -55 -66 -76 -44 -108 -173 -140 -134 -128 -24 -83 -79 -76 -77 -78 -121 -67 -68 -69
6354f9j1j0o6L2L2L3L8L9l7l8m9M7M2n6m9M7k5k5K9K9ONjjL9n8M5M6j7j6k2k3Q6j1j1Q6PP
$$ -69 -80 -90 -156 -124 -92 -59 -21 18 -19 -57 -106 -59 -17 -73 -122 -75 -100 -125 -96 -67 -61 -56 -57 -58 -19 -77 -32 14 -3 -19 -41 -64 22 11 0 86 93 100
6336A00L8j24j54P1j7Q0N1j11o8K8M2M2l2l3M6M6qrK3p5J07j19k8k8j6Q0k3k4j7j8J1J1J1
$$ 100 138 14 -140 -69 -86 -6 45 -66 -134 -106 -64 -22 -54 -87 -41 5 -3 -12 11 -64 43 -76 -104 -132 -148 -68 -91 -115 -132 -150 -139 -128 -117
6321a17J1j0j0L8L9k5k5k5k5K6K6K6K7L7L7p6p5J5J5J6J5J2J1J1J2J1J1l7l7NNONj7j7L1L1
$$ -117 -106 -116 -126 -88 -49 -74 -99 -124 -149 -123 -97 -71 -44 -7 30 -46 -121 -106 -91 -75 -60 -48 -37 -26 -14 -3 8 -29 -66 -61 -56 -50 -45 -62 -79 -48 -17
6303a7rrj30O4J42n1j0j1nnM4M4l5l5l4l5M7M7o6o6L9M0j50M4K0K1L2L3k1k0K7K8M6M6l5l4
$$ -17 -26 -35 -165 -101 41 -10 -20 -31 -36 -41 3 47 12 -23 -57 -92 -45 2 -64 -130 -91 -51 -201 -157 -137 -116 -84 -51 -72 -92 -65 -37 9 55 20 -14
6286a4JJj08Q6J2J1k5k5J9J9J9J9mmQQj30O3m6m5K2K2K1K2j8j9K9L0N0N0JJk7k7k6k7%%m8
$$ -14 -13 -12 -120 -34 -22 -11 -36 -61 -42 -23 -4 15 11 7 15 23 -107 -44 -90 -135 -113 -91 -70 -48 -66 -85 -56 -26 24 74 75 76 49 22 -4 -31 -31 -31 -79
6267g9m8O7O8J9K0k5k5K3K3OOp4p5ooM3M2k4k5K4K4ppl1l2j3j3j3j3L1L1L1L1nmJ9J9k8k9
$$ -79 -127 -60 8 27 47 22 -3 20 43 49 55 -19 -94 -100 -106 -63 -21 -45 -70 -46 -22 -29 -36 -67 -99 -112 -125 -138 -151 -120 -89 -58 -27 -32 -36 -17 2 -26 -55
6249e5K0K0L0L1q2q3K1K0k7k8N8N8J0Rl2l2KKp3Q8klKKKKk8k9N3N2%jm9m9j7j7PQJ3J4J4J4
$$ -55 -35 -15 15 46 -36 -119 -98 -78 -105 -133 -75 -17 -7 2 -30 -62 -60 -58 -131 -43 -45 -48 -46 -44 -42 -40 -68 -97 -44 8 8 7 -42 -91 -108 -125 -118 -110 -97 -83 -69 -55
6229e5l3l2J7J6j3j3L5L6M1M1pqp0p0J1J1L0L0j8j8l2l1M9N0QQJ8J8j27L5J6q0Q5j3j2j3L1
$$ -55 -88 -120 -103 -87 -100 -113 -78 -42 -1 40 33 25 -45 -115 -104 -93 -63 -33 -51 -69 -101 -132 -83 -33 -25 -17 1 19 -108 -73 -57 -137 -52 -65 -77 -90 -59
6211e9L0L1L0k6k7k6k7m7m8R8R8j8j8j7j8k4k5Q8Q9m9m8J0J0r4O8J4q3k7P0RRl0l1J8J8NM
$$ -59 -29 2 32 6 -21 -47 -74 -121 -169 -71 27 9 -9 -26 -44 -68 -93 -5 84 35 -13 -3 7 -87 -19 -5 -88 -115 -45 -36 -27 -57 -88 -70 -52 -47 -43
6193d3p6p6P9Q0o6o6P0P0K1K2L1L2p1p2n0J10q3J4M6M6o1o0K0K0r2r3P3P3qqM0L9m1m1j6j6
$$ -43 -119 -195 -116 -36 -102 -168 -98 -28 -7 15 46 78 7 -65 -115 -5 -88 -74 -28 18 -43 -103 -83 -63 -155 -248 -175 -102 -110 -118 -78 -39 -80 -121 -137 -153
6176a53QRK8K8R5o6J1J2JJklkklklknnonJ4J4p7Q5K7K6j2j2k9k9K0J9j1j1L8L8m2m2j7j7N6
$$ -153 -145 -136 -108 -80 15 -51 -40 -28 -27 -26 -28 -31 -33 -35 -38 -40 -43 -45 -50 -55 -61 -66 -52 -38 -115 -30 -3 23 11 -1 -30 -59 -39 -20 -31 -42 -4 34 -8 -50 -67 -84 -28
6156b8N6l1l0M9m7r4O8Q4p8k6k5M4M5p3K4J70n6o8o8K7K7k1k2j9j9K9K9j6j7L2L3J3J4PQK1
$$ -28 28 -3 -33 16 -31 -125 -57 27 -51 -77 -102 -58 -13 -86 -62 108 52 -16 -84 -57 -30 -51 -73 -92 -111 -82 -53 -69 -86 -54 -21 -8 6 13 21 42
6138D2p6l9l9m7N1L8L8M3n3J1J1j10N1Q1p9OJ03n8L8n9L8j0j0L0L0j10N3mnm8M8L4L3m1m2
$$ 42 -34 -73 -112 -159 -108 -70 -32 11 -42 -31 -20 -130 -79 2 -77 -71 32 -26 12 -47 -9 -19 -29 1 31 -79 -26 -30 -35 -83 -35 -1 32 -9 -51
6122e1K7K7k1k2m3m3M3M4l5O2L1L1j8j9j07j0R2o9rQ8M3n4m2m2M1M1N3m3q8RN1m6N2N2K9j31
$$ -51 -24 3 -18 -40 -83 -126 -83 -39 -74 -12 19 50 32 13 -94 -104 -12 -81 -90 -2 41 -13 -55 -97 -56 -15 38 -5 -93 -84 -33 -79 -27 25 54 -77
6105g7n8M0N0M9K1p7N9N8p4p5m2N4j7P9L1o6P0k7lll4l3p0R2j07j0M9M9J10n0N0j12k2k2M9
$$ -77 -135 -95 -45 4 25 -52 7 65 -9 -84 -126 -72 -89 -10 21 -45 25 -2 -5 -8 -42 -75 -145 -53 -160 -170 -121 -72 38 -12 38 -74 -96 -118 -69
6088f9M8j8j8m3N5k1P6k0k1l2l2J6J6J4J3J22K6p2K5l6l5k2k3L2L2o6L1K4K5q8q7N2N1L8n9
$$ -69 -21 -39 -57 -100 -45 -66 10 -10 -31 -63 -95 -79 -63 -49 -36 86 112 40 65 29 -6 -28 -51 -19 13 -53 -22 2 27 -61 -148 -96 -45 -7 -66
6071f6r5O6J7J7ppJ04n7k1k1M1n6p8Q3J14m7l4l3O3l5N1m7M7M7j08N3M5j16rrp8J9m8M9J09
$$ -66 -161 -95 -78 -61 -68 -75 29 -28 -49 -70 -29 -85 -163 -80 34 -13 -47 -80 -17 -52 -1 -48 -1 46 -62 -9 36 -80 -89 -98 -176 -157 -205 -156 -47
6055d7J1m7m6J30L3q3q4L0J26m1m2k2k2kR4N6m1k8k9K4K4%%k7k8K2K1j6j5l9N7p8J8Q3j3j00
$$ -47 -36 -83 -129 1 34 -49 -133 -103 23 -18 -60 -82 -104 -106 -12 44 3 -25 -54 -30 -6 -6 -6 -33 -61 -39 -18 -34 -49 -88 -31 -109 -91 -8 -21 -121
6037a21O3J00Mk4k3p4K2m4J18p0K6JJL2L1o1o1j07J19L2L2rQ9k1k2n2M6k0j17k4P3l5O2m7
$$ -121 -58 42 46 22 -1 -75 -53 -97 21 -49 -23 -22 -21 11 42 -19 -80 -187 -68 -36 -4 -13 76 55 33 -19 27 7 -110 -134 -61 -96 -34 -81
6021h1N0J9p8L7o0J0J0MMJ1J1p9Q1J1J1q1J5K3K2p4K3KKk2P5qqj3j2Q9p3k6P1l5J27ook6k5
$$ -81 -31 -12 -90 -53 -113 -103 -93 -89 -85 -74 -63 -142 -61 -50 -39 -120 -105 -82 -60 -134 -111 -109 -107 -129 -54 -62 -70 -83 -95 -6 -79 -105 -34 -69 58 52 46 20 -5
6003ek6P1p5K1J6J5L3o4M5n1QQm0m0m7N1J4J4P7k0%%L9j22j0Q6L0o6n0M6J29r7k2k2L3j29
$$ -5 -31 40 -35 -14 2 17 50 -14 31 -20 -12 -4 -44 -84 -131 -80 -66 -52 25 5 5 5 44 -78 -88 -2 28 -38 -88 -42 87 -10 -32 -54 -21 -150
5985a50J6J7QJ05O3l4j23k6%%j6Q0p6K0J3J3l5O1j3j3J02Nq7J0qqMr2P5P4J8J7k7P0j44J7
$$ -150 -134 -117 -109 -4 59 25 -98 -124 -124 -124 -140 -60 -136 -116 -103 -90 -125 -64 -77 -90 12 17 -70 -60 -68 -76 -72 -164 -89 -15 3 20 -7 63 -81 -64
5968f4j16M5R5jm6N1L6o1K3K4p3p4P2P2J5J6o5o5mnM4M4QQr5KLLLLQ2j4M6n1MNqqK8o9j5j5
$$ -64 -180 -135 -40 -41 -87 -36 0 -61 -38 -14 -87 -161 -89 -17 -2 14 -51 -116 -120 -125 -81 -37 -29 -21 -116 -114 -111 -108 -105 -102 -20 -34 12 -39 -35 -30 -38 -46 -18 -87 -102 -117
5948a17M0M0rrn5n4K6K6M3M3l5O1k0k0J6J6p1K5J9J9J2J2r7%L7o0K5K5ppo7L0J33L5k2k3K2
$$ -117 -77 -37 -46 -55 -110 -164 -138 -112 -69 -26 -61 0 -20 -40 -24 -8 -79 -54 -35 -16 -4 8 -89 -89 -52 -112 -87 -62 -69 -76 -143 -113 20 55 33 10 32
5931C2p5N8l9qpMNP4k3j6j6MMJ0q6l1l1j1Q6NMNNM3n3K5K6L0L1j18M3O1j00OPl8N9NNl7l8
$$ 32 -43 15 -24 -32 -39 -35 -30 44 21 5 -11 -7 -3 7 -79 -110 -141 -152 -66 -61 -57 -52 -47 -4 -57 -32 -6 24 55 -63 -20 41 -59 -53 -46 -84 -25 -20 -15 -52 -90
5911i0J2J1J9K0J9J9n9n9jR6j2j2n4n4O8O8j3j3l7l6JJJ21m1mmj9j15N2N2k5k6P1k6O3l3K0
$$ -90 -78 -67 -48 -28 -9 10 -49 -108 -109 -13 -25 -37 -91 -145 -77 -9 -22 -35 -72 -108 -107 -106 15 -26 -30 -34 -53 -168 -116 -64 -89 -115 -44 -70 -7 -40 -20
5893b0K1l9N8O4l3j53n7K3K2P8k0m9J11j15j8J47j4j19k3l2J29llm1m1J9K0m1N5O2l5n5n5
$$ -20 1 -38 20 84 51 -102 -159 -136 -114 -36 -56 -105 6 -109 -127 20 6 -113 -136 -168 -39 -42 -45 -86 -127 -108 -88 -129 -74 -12 -47 -102 -157
5878a57K3K3J7J8M6n0MMK4K5P9j7k1k1k6k7j3j3L0K9L2o5j7j7Q4j4l9l9K7K7k1k2K2K1J5J6
$$ -157 -134 -111 -94 -76 -30 -80 -76 -72 -48 -23 56 39 18 -3 -29 -56 -69 -82 -52 -23 9 -56 -73 -90 -6 -20 -59 -98 -71 -44 -65 -87 -65 -44 -29 -13
5860a3M6n0MMllmlk1k2K7o9M9m7n9L8O2l4K7K6OOjR7n2n2KLJ5J4K7p0l3O4MLo9o9M4M4M0M1
$$ -13 33 -17 -13 -9 -12 -15 -19 -22 -43 -65 -38 -107 -58 -105 -164 -126 -64 -98 -71 -45 -39 -33 -34 63 11 -41 -39 -36 -21 -7 20 -50 -83 -19 -15 -12 -81 -150 -106 -62 -22 19
5840A9p2p2M5M5n8L9m4m3M3M3L9L8rj0j6j7L2L2m3m3P3j22j6Q1m7N0J7p9O2O2ppppm7m8JJ
$$ 19 -53 -125 -80 -35 -93 -54 -98 -141 -98 -55 -16 22 13 3 -13 -30 2 34 -9 -52 21 -101 -117 -36 -83 -33 -16 -95 -33 29 22 15 8 1 -46 -94 -93 -92
5822i2k7k6N4N4N5N6n8n7L1L1j7j7n4n4K6K7rj0j0rrqqrmmL8L8P2k5j59L4M4M4k5k4L8L8m2
$$ -92 -119 -145 -91 -37 18 74 16 -41 -10 21 4 -13 -67 -121 -95 -68 -77 -87 -97 -106 -115 -123 -131 -140 -144 -148 -110 -72 0 -25 -184 -150 -106 -62 -87 -111 -73 -35 -77
5804g7m3N8N9RJ0m1m2L9L9k4k4K4K4K0K0r5R9K8o8j17P6O2l5j7j7J1J2NNj0j07n4J39M3n3
$$ -77 -120 -62 -3 6 16 -25 -67 -28 11 -13 -37 -13 11 31 51 -44 55 83 15 -102 -26 36 1 -16 -33 -22 -10 -5 0 -10 -117 -171 -32 11 -42
5787d2J3J3NOOOk6k5k6k5N2N3NMn5n5N8N8K1K1k8k7l2l3l8l9J14J7l2O5l3l3K1K2%JL1o6O
$$ -42 -29 -16 -11 -5 1 7 -19 -44 -70 -95 -43 10 15 19 -36 -91 -33 25 46 67 39 12 -20 -53 -91 -130 -16 1 -31 34 1 -32 -11 11 11 12 43 -23 -17
5768a7O%%K8K7Jr6J3J3PPl0l1K5K4p0K7K1K2L7L7l7l7k1P5K5j37P9j8LKk2k2L2L2n5M3j3j2
$$ -17 -11 -11 -11 17 44 45 -51 -38 -25 -18 -11 -41 -72 -47 -23 -93 -66 -45 -23 14 51 14 -23 -44 31 56 -81 -2 -20 -17 -15 -37 -59 -27 5 -50 -7 -20 -32
5750c2m2m2L7o0N7N6o2o2Q7Q8OPj9j9k5P2K2K1n7j54k2P6K7p0rQ8n7L9L1o6m8m9M3J39L6L6
$$ -32 -74 -116 -79 -139 -82 -26 -88 -150 -63 25 31 38 19 0 -25 47 69 90 33 -121 -143 -67 -40 -110 -119 -31 -88 -49 -18 -84 -132 -181 -138 1 37 73
5733G3m7m7l0O6L3j29m3N3M1n6jjO2l5l4l5M8n0J7p9LJ00K5K5n1J10j1j1nj01L3L4k7k6K2
$$ 73 26 -21 -51 15 48 -81 -124 -71 -30 -86 -87 -88 -26 -61 -95 -130 -82 -132 -115 -194 -191 -91 -66 -41 -92 18 7 -4 -9 -110 -77 -43 -70 -96 -74
5716g4K2k9k9nnM9M9JJj6j5KLOr1M4M4k0j9n6M1O4l3K7K8J4J4K4K3j19M3OOn4M3OPJ5q2N3
$$ -74 -52 -81 -110 -115 -120 -71 -22 -21 -20 -36 -51 -49 -46 -40 -131 -87 -43 -63 -82 -138 -97 -33 -66 -39 -11 3 17 41 64 -55 -12 -6 0 -54 -11 -5 2 17 -65 -12
5697a2N3l0l0J8J9k9k8k8k9J1J0M1M0k1P5q2J4klN2N2n1n0r1OJ20m1k3P3l3l4j7j7p0R2Jr6
$$ -12 41 11 -19 -1 18 -11 -39 -67 -96 -85 -75 -34 6 -15 60 -22 -8 -10 -13 39 91 40 -10 -101 -95 25 -16 -39 34 1 -33 -50 -67 -137 -45 -44 -140
5679a40R0qJ7J7J1J0O5l1q5q6Q3j5q4J2R7R7k1k1m6m5N4N4j13j7M4M4L1o7o0L6J9J8J0q8M5
$$ -140 -50 -58 -41 -24 -13 -3 62 31 -54 -140 -57 -72 -156 -144 -47 50 29 8 -38 -83 -29 25 -88 -105 -61 -17 14 -53 -113 -77 -58 -40 -30 -118 -73
5663g3n1J9K0J4J3MMRq7j5j6K7K7M7M7NMq3J4QPllN1m6j2j3O3O2K7K7l1j29M6M5lmr1NN3m3
$$ -73 -124 -105 -85 -71 -58 -54 -50 -41 -128 -143 -159 -132 -105 -58 -11 -6 -2 -85 -71 -63 -56 -59 -62 -11 -57 -69 -82 -19 43 70 97 66 -63 -17 28 25 21 -70 -65 -12 -55
5643e5K0K0l4l5J1J0J1J0KLKLo0n9N4N3J7J6K3p5O0O0o6o5O5l2k6k6K3K3K3K3J%n3M3M1M0
$$ -55 -35 -15 -49 -84 -73 -63 -52 -42 -40 -37 -35 -32 -92 -151 -97 -44 -27 -11 12 -63 -3 57 -9 -74 -9 -41 -67 -93 -70 -47 -24 -1 0 0 -53 -10 31 71
5625G1l9m0M6n1n1M6JKQQNMjjM8m9m3m3k6k7P6k1OO%%K9K8n3n2K9K9k5P1l6l6N0N0k7k8K0
$$ 71 32 -8 38 -13 -64 -18 -17 -15 -7 1 6 10 9 8 56 7 -36 -79 -105 -132 -56 -77 -71 -65 -65 -65 -36 -8 -61 -113 -84 -55 -80 -9 -45 -81 -31 19 -8 -36 -16
5605a6K0J1J0Pr1R5o6q5J3M3M4PQp1K6K7p1L5L5P2r0k9k8RJ0J8J9K9K8j20M1qpL9n8N1m6j4
$$ -16 4 15 25 32 -59 36 -30 -115 -102 -59 -15 -8 0 -71 -45 -18 -89 -54 -19 53 -37 -66 -94 -85 -75 -57 -38 -9 19 -101 -60 -68 -75 -36 -94 -43 -89 -103
5587a03j4K3K2O4l3P0k7M5n1lkk7k7K2K1j0j1L8L8m8m9K6K6K6p0L2L2p6p7L7L6M3M4l7l8K4
$$ -103 -117 -94 -72 -8 -41 29 2 47 -4 -7 -9 -36 -63 -41 -20 -30 -41 -3 35 -13 -62 -36 -10 16 -54 -22 10 -66 -143 -106 -70 -27 17 -20 -58 -34
5570c4K3r0q9P8P8l1O6M8m9m3N4j7j6j1j0k3k3K6K5m2m3NOJ4J5P9j8j20M2M8m9R1R1m2m1P8
$$ -34 -11 -101 -190 -112 -34 -65 1 49 0 -43 11 -6 -22 -33 -43 -66 -89 -63 -38 -80 -123 -118 -112 -98 -83 -4 -22 -142 -100 -52 -101 -10 81 39 -2 76
5553G6j47M2M2j59O8Q5p6m1N6N2m5k7P0J5q1K6K6J9K0l8l9J0J0J9J9J8J9j7j8p1K4m9n0J23
$$ 76 -71 -29 13 -146 -78 7 -69 -110 -54 -2 -47 -74 -4 11 -70 -44 -18 1 21 -17 -56 -46 -36 -17 2 20 39 22 4 -67 -43 -92 -142 -19
5537a9K7J%nnl1l1J7J8j0j0LKo8J26J7J7l7l8J1J1NOm4m3M7M8N5j38j15P9J15p8J6J7n6J37
$$ -19 8 9 9 4 -1 -32 -63 -46 -28 -38 -48 -45 -43 -111 15 32 49 12 -26 -15 -4 1 7 -37 -80 -33 15 70 -68 -183 -104 11 -67 -51 -34 -90 47
5519D7l8l8K3K2j6j7j7j7ONO5j28Q1Q1R7r7l6l5%JmlRQq5J09%j%%%jJJKJPPnnQ5j08%Jm8m8
$$ 47 9 -29 -6 16 0 -17 -34 -51 -45 -40 25 -103 -22 59 156 59 23 -12 -12 -11 -15 -18 -9 -1 -86 23 23 22 22 22 22 21 22 23 25 26 33 40 35 30 115 7 7 8 -40 -88
5497h8J%poM1M2l8l8J1J0%%%%L0L1j8j9jkJ19p4r8R6k5k5%jj%k1k1k1k1J8J7J7J8KLKKJ1J1
$$ -88 -87 -87 -94 -100 -59 -17 -55 -93 -82 -72 -72 -72 -72 -72 -42 -11 -29 -48 -49 -51 68 -6 -104 -8 -33 -58 -58 -59 -60 -60 -81 -102 -123 -144 -126 -109 -92 -74 -72 -69 -67 -65 -54 -43
5476d3l8l7K5K6K6K6mnj6j6J09q4L1L1l0O7j01mO3r8K4J21l6l5k4k4n0M7j8j7J22l9l5l5Q1
$$ -43 -81 -118 -93 -67 -41 -15 -19 -24 -40 -56 53 -31 0 31 1 68 -33 -37 26 -72 -48 73 37 2 -22 -46 -96 -49 -67 -84 38 -1 -36 -71 10
5459A0j4j5j5K7p0j5j5L3L4m8m7M2M2M2M2n3n4M9m7M8M8l8l9JJN5m2o0o1j2J49j2j3N3m5L6
$$ 10 -4 -19 -34 -7 -77 -92 -107 -74 -40 -88 -135 -93 -51 -9 33 -20 -74 -25 -72 -24 24 -14 -53 -52 -51 4 -38 -98 -159 -171 -22 -34 -47 6 -39 -3
5442cL6L6o1KKn9L8J4J3%r7p3K4J7p9Q8Q8K7j34mmM1n7K1K0NMR4o7P8j9n5n6J9J8k7k8N3N4
$$ -3 33 69 8 10 12 -47 -9 5 18 18 -79 -152 -128 -111 -190 -102 -14 13 -121 -125 -129 -88 -145 -124 -104 -99 -95 -1 -68 10 -9 -64 -120 -101 -83 -110 -138 -85 -31
5424c1kkNMr2NJ17J18M5j15k5k5m5m5n7L9N3m5J6J6M9N0onkr9N9l9J4J3J3J3m5N2n1n1J14
$$ -31 -33 -35 -30 -26 -118 -113 4 122 167 52 27 2 -43 -88 -145 -106 -53 -98 -82 -66 -17 33 27 22 20 -79 -20 -59 -45 -32 -19 -6 -51 1 -50 -101 13
5406A3J13o4o3j3j2K9L0K3p4k0j9J3J3k9k9l1O5J2J1n6n6Q6j2o9K8M9M8RJ0l3l3nR2Nr1K5
$$ 13 126 62 -1 -14 -26 3 33 56 -18 -38 -57 -44 -31 -60 -89 -120 -55 -43 -32 -88 -144 -58 -70 -139 -111 -62 -14 -5 5 -28 -61 -66 26 31 -60 -35
5389c5p1LJ00k9k9K6K5J4J4l4l5QQJ4J4n7M0k1k1K8o9M0n7M3M4j8Q0k7k7K1K1J9p7K5K6j2
$$ -35 -106 -103 -3 -32 -61 -35 -10 4 18 -16 -51 -43 -35 -21 -7 -64 -24 -45 -66 -38 -107 -67 -124 -81 -37 -55 25 -2 -29 -8 13 32 -45 -20 6 -6
5372fj2L6L7j8j9p2K4k2k2j06N4L0L0m0m0N0N0mR3n7n7kkJ3J3k9l0o6L0L0L0m3N4%%J7J7J1
$$ -6 -18 18 55 37 18 -54 -30 -52 -74 -180 -126 -96 -66 -106 -146 -96 -46 -50 43 -14 -71 -73 -75 -62 -49 -78 -108 -174 -144 -114 -84 -127 -73 -73 -73 -56 -39 -28
5354b8J1P3k4j8j8j7j7ppp6Q6j1j1kr9R0oJ2J2OOj6j5L3L3nnQ6p6m7m8K3K4K0K0K6p1O8O8
$$ -28 -17 56 32 14 -4 -21 -38 -45 -52 -128 -42 -53 -64 -66 -165 -75 -81 -69 -57 -51 -45 -61 -76 -43 -10 -15 -20 66 -10 -57 -105 -82 -58 -38 -18 8 -63 5 73
5335G3j16j9J08n3JJm9M9j3Q5k2k2j7j6k2k2k2k2M2M1pommN0m6j8j8J05QL3o3p5K1lj01P3
$$ 73 -43 -62 46 -7 -6 -5 -54 -5 -18 67 45 23 6 -10 -32 -54 -76 -98 -56 -15 -22 -28 -32 -36 14 -32 -50 -68 37 45 78 15 -60 -39 -42 -143 -70
5317g0P3k9k8K0K0%%%%%JJ%k7k8k2k1l3O5J6J5k9O7O8l0MLn0n1j8j7j8j7L5L6L5L6j5j5R4
$$ -70 3 -26 -54 -34 -14 -14 -14 -14 -14 -14 -13 -12 -12 -39 -67 -89 -110 -143 -78 -62 -47 -76 -9 59 29 33 36 -14 -65 -83 -100 -118 -135 -100 -64 -29 7 -8 -23 71
5298G1kq4J3PPp4K3JR8r9lN2m4n1n1N0N0J26K9j26k9P4q6J0J0m2m1L3L4M1n6kjRJ0P6q5J1
$$ 71 69 -15 -2 5 12 -62 -39 -38 60 -39 -42 10 -34 -85 -136 -86 -36 90 119 -7 -36 38 -48 -38 -28 -70 -111 -78 -44 -3 -59 -61 -62 -53 -43 33 -52 -41
5280d1J1j41m3J22K5r1NJ05n7M7M6q3J3M6M6o2L6j10N2J5J5k3k3k5k4L4L4j22L9L5L4o6L1
$$ -41 -30 -171 -214 -92 -67 -158 -153 -48 -105 -58 -12 -95 -82 -36 10 -52 -16 -126 -74 -59 -44 -67 -90 -115 -139 -105 -71 -193 -154 -119 -85 -151 -120
5264a20J16m6k3k3K2K1p3K3J7J7J6J5rqL9L9L9M0l9l8n0M6J3q3l6O2O1l6n7n6j8j7J21m0L3
$$ -120 -4 -50 -73 -96 -74 -53 -126 -103 -86 -69 -53 -38 -47 -55 -16 23 62 102 63 25 -25 21 34 -49 -85 -23 38 2 -55 -111 -129 -146 -25 -65 -32
5248c2L3j9k0o0L7O1l6j6j5K7K7J6J5K2p5M0M0p2p3%R7J33k8k6k5l6l6J0J1O5l2llj5j5J5
$$ -32 1 -18 -38 -98 -61 0 -36 -52 -67 -40 -13 3 18 40 -35 5 45 -27 -100 -100 -3 130 102 76 51 15 -21 -11 0 65 33 30 27 12 -3 12
5231A2q2J5J5N9l8q6J1P9P9o1o0QQm1m0k7k6N4N4L3L3j5j5l7l8M4M3J7J7l1l1l8l9M3M2J2
$$ 12 -70 -55 -40 19 -19 -105 -94 -15 64 3 -57 -49 -41 -82 -122 -149 -175 -121 -67 -34 -1 -16 -31 -68 -106 -62 -19 -2 15 -16 -47 -85 -124 -81 -39 -27
5213b7J1J2J1j0j0J3J4o1o2N1N2m0l9M2M2L5L5j22P2l0l0POL2L1m9m9R8R9J79j44j64K9M2
$$ -27 -16 -4 7 -3 -13 0 14 -47 -109 -58 -6 -46 -85 -43 -1 34 69 -53 19 -11 -41 -34 -28 4 35 -14 -63 35 134 313 169 5 34 76
5197G6n6o6L1M9m8L9L8j6j6RRj5j5m4m5MMK8K8j05Q8JJj1j2N1N1o2o2K2K2lkM9N0l1l1LML
$$ 76 20 -46 -15 34 -14 25 63 47 31 40 49 34 19 -25 -70 -66 -62 -34 -6 -111 -23 -22 -21 -32 -44 7 58 -4 -66 -44 -22 -25 -27 22 72 41 10 13 17 20
5178B0Mn7n6l3l2P0P0j20P5K2K3J0J1qpn6n6klK2K2k4k3N7N7rrJ5J5l7l7O7l1m3m4J19K1l3
$$ 20 24 -33 -89 -122 -154 -84 -14 -134 -59 -37 -14 -4 7 -1 -8 -64 -120 -122 -125 -103 -81 -105 -128 -71 -14 -23 -32 -17 -2 -39 -76 -9 -40 -83 -127 -8 13 -20
5160b0l2k9k9q5P7o9K7Q2Q1K8o8J0J1N9l8k0j9K3K2l0l1L4o3o9R3N0m6K7K7l4O4n3n2KKL9
$$ -20 -52 -81 -110 -195 -118 -187 -160 -78 3 31 -37 -27 -16 43 5 -15 -34 -11 11 -19 -50 -16 -79 -148 -55 -5 -51 -24 3 -31 33 -20 -72 -70 -68 -29
5143b9L8M9j13J9K0n5M1O8r3J3J4j62jK1K2J5J5l3l3J2J2J2J2K8K7L3o4j4j5o3R9M8M8m9m9
$$ -29 9 58 -55 -36 -16 -71 -30 38 -55 -42 -28 -190 -191 -170 -148 -133 -118 -151 -184 -172 -160 -148 -136 -108 -81 -48 -112 -126 -141 -204 -105 -57 -9 -58 -107
5126a07j4Q2n3n2M1M1L5L5K4p2N6N6l0j28KKO2l5J9J9l1l1l7O0j7j7M4n3J9J8N5j06N2N3%
$$ -107 -121 -39 -92 -144 -103 -62 -27 8 32 -40 16 72 42 -86 -84 -82 -20 -55 -36 -17 -48 -79 -116 -56 -73 -90 -46 -99 -80 -62 -7 -113 -61 -8 -8
5109h%o1L6j9j9L4L5k0j9O2l5k9k9N5N5n9n8L9L8M5M4q7Rj00lPPm7N0N2m5J6J5MMRJ0m8M9
$$ -8 -8 -69 -33 -52 -71 -37 -2 -22 -41 21 -14 -43 -72 -17 38 -21 -79 -40 -2 43 87 0 9 -91 -94 -87 -80 -127 -77 -25 -70 -54 -39 -35 -31 -22 -12 -60 -11
5091a1o0L7nmJJL0L0n0n1N8N8n4n5J1J1q0Q2J4J4P9j8KLN1m6o8o7m0N5o0L6P3q9N9l8OOK7
$$ -11 -71 -34 -39 -43 -42 -41 -11 19 -31 -82 -24 34 -20 -75 -64 -53 -133 -51 -37 -23 56 38 40 43 94 48 -20 -87 -127 -72 -132 -96 -23 -112 -53 -91 -85 -79 -52
5072e2K7k2k1L8L8j40K2Q1j6%%J6J5K1K2q4J4L0K9P1r0J6q0n3J08J27j64OPj8P9j8j7j2j2
$$ -52 -25 -47 -68 -30 8 -132 -110 -29 -45 -45 -45 -29 -14 7 29 -55 -41 -11 18 89 -1 15 -65 -118 -10 117 -47 -41 -34 -52 27 9 -8 -20 -32
5056c2RQRQOOl6l7o0L7L2L1j7j6L3L2m1m0mj65J03Pk9k9M3M4N5m1m9M9L6L6L2L2j6j6o3o3
$$ -32 -23 -15 -6 2 8 14 -22 -59 -119 -82 -50 -19 -36 -52 -19 13 -28 -68 -72 -237 -134 -127 -156 -185 -142 -98 -43 -84 -133 -84 -48 -12 20 52 36 20 -43 -106
5037a06J1J2Q8ql5l5JKJ3q3pR1J2J2l4O4m0l9RJ0M3M4R2j33opqqJ7J6m5m5N1m5Q4j2o1J00
$$ -106 -95 -83 5 -3 -38 -73 -72 -70 -57 -140 -147 -56 -44 -32 -66 -2 -42 -81 -72 -62 -19 25 117 -16 -22 -29 -37 -45 -28 -12 -57 -102 -51 -96 -12 -24 -85 15
5019A5M2n6q2Q0k9l0j9j9J2J2J09n2j8P9j2j09L9L8m8m9O9O9j36K7j2j1M7M8JJk3k3L5L4R
$$ 15 57 1 -81 -1 -30 -60 -79 -98 -86 -74 35 -17 -35 44 32 -77 -38 0 -48 -97 -28 41 -95 -68 -80 -91 -44 4 5 6 -17 -40 -5 29 38
5003C8q9k8k9m1N7L6L6l8l9J0J0M1M0p3K3M8m9k0j9jkM5M6l6l5l0k9mR4J3J3noPOJ2q4J7J7
$$ 38 -51 -79 -108 -149 -92 -56 -20 -58 -97 -87 -77 -36 4 -69 -46 2 -47 -67 -86 -87 -89 -44 2 -34 -69 -99 -128 -132 -38 -25 -12 -17 -23 -16 -10 2 -82 -65 -48
4984d8l7N9r2MO8O9L4L5j01mj9j9Q3j3M4n2nmppj4j3M6n0LML6L6m4m5j2j3O9O8n6n6l0O7k4
$$ -48 -85 -26 -118 -114 -46 23 57 92 -9 -13 -32 -51 32 19 63 11 6 2 -5 -12 -26 -39 7 -43 -40 -36 0 36 -8 -53 -65 -78 -9 59 3 -53 -83 -16 -40
4965d0k3OPnnnnM1M1kkp4K3J6q0R8JQPq9RM0M1q8RllJ14J7p3p4M9M8OOj4Q3q0J6%r6J9J9m6
$$ -40 -63 -57 -50 -55 -60 -65 -70 -29 12 10 8 -66 -43 -27 -107 -9 -8 0 7 -82 -73 -33 8 -80 -71 -74 -77 37 54 -19 -93 -44 4 10 16 2 85 5 21 21 -75 -56 -37 -83
4944h3N1L3o4k8O9j5j6J0RJ0Rm1m2J0J08J1q5l4J26n4n4MNllklK9K9Rq8n5M2j3j09P3P4j9
$$ -83 -32 1 -63 -91 -22 -37 -53 -43 -34 -24 -15 -56 -98 -88 20 31 -54 -88 38 -16 -70 -66 -61 -64 -67 -69 -72 -43 -14 -5 -93 -148 -106 -119 -228 -155 -81 -100
4926a00j9P5k1rrJ2J09q5q4LR9N5j06J2J2l8N8J15m7n3M4n0n1L7L6l6l6J3J2k4k4K4K4L1L0
$$ -100 -119 -44 -65 -74 -83 -71 38 -47 -131 -128 -29 26 -80 -68 -56 -94 -36 79 32 -21 23 -27 -78 -41 -5 -41 -77 -64 -52 -76 -100 -76 -52 -21 9
4910Ij8j8m1m1R9o3%JM5n2M5M5j0j0K2K1k1k1q1J6M7M8o3L5lkM0n8N2m5%%M3n5M0n7l9N8K0
$$ 9 -9 -27 -68 -109 -10 -73 -73 -72 -27 -79 -34 11 1 -9 13 34 13 -8 -89 -73 -26 22 -41 -6 -9 -11 29 -29 23 -22 -22 -22 21 -34 6 -51 -90 -32 -12
4891a2K0J0q7l5J25L6o2mmK7p1pR0o1R9l0l1K8K7m3m4NNJ1J1n9o0q1P9J24K7l0l0j27L4Q3
$$ -12 8 18 -69 -104 21 57 -5 -9 -13 14 -57 -64 26 -35 64 34 3 31 58 15 -29 -24 -19 -8 3 -56 -116 -197 -118 6 33 3 -27 -154 -120 -37
4874c7Q4m2N5l4l3L7o0p9Q2K3K4Q0q1m5N2n3n3L4L4j0j0mmq2J4j5j6Q0P9l9m0N8l9RJ06r1
$$ -37 47 5 60 26 -7 30 -30 -109 -27 -4 20 100 19 -26 26 -27 -80 -46 -12 -22 -32 -36 -40 -122 -108 -123 -139 -59 20 -19 -59 -1 -40 -31 75 -16
4857a6r0O1O0j0j1j0j1K1K1P5k1l4l3m0m0K3K3K9o8K5K6k3k3l7O0j8j9j1j2L7L6j0j0j6Q1
$$ -16 -106 -45 15 5 -6 -16 -27 -6 15 90 69 35 2 -38 -78 -55 -32 -3 -71 -46 -20 -43 -66 -103 -43 -61 -80 -91 -103 -66 -30 -40 -50 -66 15
4840A5k5k5k5P3LMl9l9k6k5K8K9o9K8Q2j4m9M8j3j3NOjjP0k7k1k2J9J8K4p3K9K9k6k6KJJ2
$$ 15 -10 -35 -60 13 16 20 -19 -58 -84 -109 -81 -52 -121 -93 -11 -25 -74 -26 -39 -52 -47 -41 -42 -43 27 0 -21 -43 -24 -6 18 -55 -26 3 -23 -49 -47 -46 -34
4821c4J2q9P3L1L1K4K3j17k1R4mp8J9J2J3P1r0n2J09l9m0pqL5L5L1o6j2j08J19K3j0rl2l1
$$ -34 -22 -111 -38 -7 24 48 71 -46 -67 27 23 -55 -36 -24 -11 60 -30 -82 27 -12 -52 -59 -67 -32 3 34 -32 -44 -152 -33 -10 -20 -29 -61 -92
4805i2M3M3j4j10K5K5L9L8n8L9l7O0oom0N7M7n0N0j12J1J2J04n7o3L4m3N5j%K1p5k7k7O6l1
$$ -92 -49 -6 -20 -130 -105 -80 -41 -3 -61 -22 -59 1 -5 -11 -51 6 53 3 53 -59 -48 -36 68 11 -52 -18 -61 -6 -7 -7 14 -61 -88 -115 -49 -80
4788h0K4K3j2j2M3n4j1j1o5L2m0N8LJ00PPJ9J9p9J8O5l1J4J3m1N6j05qP9j8j00j00M5M6l8
$$ -80 -56 -33 -45 -57 -14 -68 -79 -90 -155 -123 -163 -105 -102 -2 5 12 31 50 -29 -11 54 23 37 50 9 65 -40 -48 31 13 -87 -187 -142 -96 -134
4771a34O0m3m4M1M0L4L5O7k9j3j4q5P5j5j5K0K1k8k8%jj%j0j1%%r3O8K6K6J3J2K5p2L6J33
$$ -134 -74 -117 -161 -120 -80 -46 -11 56 27 14 0 -85 -10 -25 -40 -20 1 -27 -55 -55 -56 -57 -57 -67 -78 -78 -78 -171 -103 -77 -51 -38 -26 -1 -73 -37 96
4753I6Pq9L5o2j4j3K8K9j9k0m0m1m0m0K5K5L1L2l0O8J2J3l3l4J5J5j9k0K9K9k6k6k7k6N1N1
$$ 96 103 14 49 -13 -27 -40 -12 17 -2 -22 -62 -103 -143 -183 -158 -133 -102 -70 -100 -32 -20 -7 -40 -74 -59 -44 -63 -83 -54 -25 -51 -77 -104 -130 -79 -28
4736b8LLJ6J6l2l2llM6M6o1o1J9K0RRm0l9KJJ11q3N5N4p1p1QQQQP7P7mlq0p9L3L4M3M3l8l8
$$ -28 -25 -22 -6 10 -22 -54 -57 -60 -14 32 -29 -90 -71 -51 -42 -33 -73 -112 -110 -109 2 -81 -26 28 -43 -114 -106 -98 -90 -82 -5 72 68 65 -15 -94 -61 -27 16 59 21 -17
4716a7J5J5J4J5lmmlk4k4l6l6J01r2J6J7J6J7l2l2L0K9j8j9N1N1l0l0J2J2J2J2j6j7j6j6K5
$$ -17 -2 13 27 42 39 35 31 28 4 -20 -56 -92 9 -83 -67 -50 -34 -17 -49 -81 -51 -22 -40 -59 -8 43 13 -17 -5 7 19 31 15 -2 -18 -34 -9
4698iK5k3k3MMMMklkkj5j4L4L4l8l8J0J0l1l1N0N0j5j5j4j5L6L5l2l3j00R5j5j5j7j8J9J8
$$ -9 16 -7 -30 -26 -22 -18 -14 -16 -19 -21 -23 -38 -52 -18 16 -22 -60 -50 -40 -71 -102 -52 -2 -17 -32 -46 -61 -25 10 -22 -55 -155 -60 -75 -90 -107 -125 -106 -88
4680h8J09q5k5k4L3L3j5j6j2j1M2n4L4L4L3L4p6K0K1p6J0J1Q5Q5l6l5p8Q4l2l1rj07J1J07
$$ -88 21 -64 -89 -113 -80 -47 -62 -78 -90 -101 -59 -113 -79 -45 -12 22 -54 -34 -13 -89 -79 -68 17 102 66 31 -47 37 5 -26 -35 -142 -131 -24
4664b4N3m4oop6K1P6q4m3N5QQm0N6jjn0M7j2j2j3j2J11J5j1j2o9o9N4N4j03N8P0k6OOj%j5
$$ -24 29 -15 -21 -27 -103 -82 -6 -90 -133 -78 -70 -62 -102 -46 -47 -48 -98 -51 -63 -75 -88 -100 11 26 15 3 -66 -135 -81 -27 -130 -72 -2 -28 -22 -16 -17 -17 -32
4645c2j4j5j5j0j1J19K1K0p6l5O3OOl6O0p1K6j2j3k1J40o4o4kkqqM0n7n6M0M3M2q7J1j4j4
$$ -32 -46 -61 -76 -86 -97 22 43 63 -13 -48 15 21 27 -9 51 -20 6 -6 -19 -40 100 36 -28 -30 -32 -40 -48 -8 -65 -121 -81 -38 4 -83 -72 -86 -100
4627a00M6M7l6O1%%K6p1p1K5J0RJ6J5l9l8N1j09L6L6Q0j6k6k5l2l1k4k3N8N7RJ0RRLLm5m5
$$ -100 -54 -7 -43 18 18 18 44 -27 -98 -73 -63 -54 -38 -23 -62 -100 -49 -158 -122 -86 -6 -22 -48 -73 -105 -136 -160 -183 -125 -68 -59 -49 -40 -31 -28 -25 -70 -115
4609a15rqL9M0JJ%Jj6j6j7j6J1J1J1J1K1K1k8k7M0M0m0m1J4J4J4J4k1k1Q7j06L8L7k3k3l1
$$ -115 -124 -132 -93 -53 -52 -51 -51 -50 -66 -82 -99 -115 -104 -93 -82 -71 -50 -29 -57 -84 -44 -4 -44 -85 -71 -57 -43 -29 -50 -71 16 -90 -52 -15 -38 -61 -92
4592i2l2Q2Q2k4k5l6l6J29o5mnj7j7j8j7K0K0K0K0m6m5L5L5NMNNj5j6j5j5j3j4L6L5j2j2L6
$$ -92 -124 -42 40 16 -9 -45 -81 48 -17 -21 -26 -43 -60 -78 -95 -75 -55 -35 -15 -61 -106 -71 -36 -31 -27 -22 -17 -32 -48 -63 -78 -91 -105 -69 -34 -46 -58 -22
4573b2L7OOp5p4P9Q0jjmmnmn3n2O0O0k6k7l8l9J09q5K4K4m5m5MLL2L2L2L2k1k1K7K7k3k3k3
$$ -22 15 21 27 -48 -122 -43 37 36 35 31 27 22 18 -35 -87 -27 33 7 -20 -58 -97 12 -73 -49 -25 -70 -115 -111 -108 -76 -44 -12 20 -1 -22 5 32 9 -14 -37
4554c7k3K7K7p6K1LLJ5J5j9P7l6l6M4j17N4N5k5k4%%OOk8k7Q2p8L6L7n8n9J09J3lmrrP3P4
$$ -37 -60 -33 -6 -82 -61 -58 -55 -40 -25 -44 33 -3 -39 5 -112 -58 -3 -28 -52 -52 -52 -46 -40 -68 -95 -13 -91 -55 -18 -76 -135 -26 -13 -16 -20 -29 -38 35 109
4536A09r4Ll3l4k7k7K6K6L3L2n0M7ppj4j3llo1J01J1J0l0l1r7O4OPk6k7m9M8M1M2qqK2K3k9
$$ 109 15 18 -15 -49 -76 -103 -77 -51 -18 14 -36 11 4 -3 -17 -30 -33 -36 -97 4 15 25 -5 -36 -133 -69 -63 -56 -82 -109 -158 -110 -69 -27 -35 -43 -21 2 -27
4517b7O8P4k2q2J5m5m5ppj2Q4m0m1Q1q0M8M9L5o2P8q4n3M3l7l8K3K3m3N5J8J8P5k3J2q5r1
$$ -27 41 115 93 11 26 -19 -64 -71 -78 -90 -6 -46 -87 -6 -86 -38 11 46 -16 62 -22 -75 -32 -69 -107 -84 -61 -104 -49 -31 -13 62 39 51 -34 -125
4500a25OonRRRJ0L9M0rrQRp3p2N5N4O1l6P0P1n8n9K5j37LKK6K6k9O8M3M3L2j28o0L7N7l9k4
$$ -125 -119 -125 -130 -121 -112 -103 -93 -54 -14 -23 -32 -24 -15 -88 -160 -105 -51 10 -26 44 115 57 -2 23 -114 -111 -109 -83 -57 -86 -18 25 68 100 -28 -88 -51 6 -33 -57
4481e7P2o3o3rQ8QRK8K8j11N0J9J9j9j9o0o1N2N2K6K7q9P3m6m6N1N2q4J3O2l5j1j1j6j7qp
$$ -57 15 -48 -111 -120 -32 -24 -15 13 41 -70 -20 -1 18 -1 -20 -80 -141 -89 -37 -11 16 -73 0 -46 -92 -41 11 -73 -60 2 -33 -44 -55 -71 -88 -96 -103
4463a03M0M1oon4n4L6L7J3J3J1J0N9N9p7p7MMJ4J4j0rl2l1j4j3Q6j0J4J10j4j5o4L4J%L7L8
$$ -103 -63 -22 -28 -34 -88 -142 -106 -69 -56 -43 -32 -22 37 96 19 -58 -54 -50 -36 -22 -32 -41 -73 -104 -118 -131 -45 -55 -41 69 55 40 -24 10 11 11 48 86
4445H6j15j8M1M0j4j5k0k0mj00n2n1R7%N5N4LLp0K7o5L2L2L2QQm0m0J1J1NNM5n3KKK1K1K7
$$ 86 -29 -47 -6 34 20 5 -15 -35 -39 -139 -191 -242 -145 -145 -90 -36 -33 -30 -100 -73 -138 -106 -74 -42 -34 -26 -66 -106 -95 -84 -79 -74 -29 -82 -80 -78 -57 -36 -9
4427iK7k7P1p1p1N3m4J7J7j2Q5j08N3onMMpqo8K8J8q0J16K0PPqrR5o6j14M7K0K0j10N2l3l4
$$ -9 18 -9 62 -9 -80 -27 -71 -54 -37 -49 36 -72 -19 -25 -30 -26 -22 -29 -37 -105 -77 -59 -139 -23 -3 4 11 3 -6 89 23 -91 -44 -24 -4 -114 -62 -95 -129
4408a29K5K5J2J3l0k9m7N0J35k6n3n3J05Ql0l1M5M4K1K1k7k7j9j8j3j2l2O6r1P2Q5p5o6R6
$$ -129 -104 -79 -67 -54 -84 -113 -160 -110 25 -1 -54 -107 -2 6 -24 -55 -10 34 55 76 49 22 3 -15 -28 -40 -72 -6 -97 -25 60 -15 -81 15
4392A5m5m4M6M6j3j3j3j4N6N5l6j32M2M1L6L5k6k6k6k6j4j4j3j4j9j9P8j9R1nj7Q0oj03r1
$$ 15 -30 -74 -28 18 5 -8 -21 -35 21 76 40 -92 -50 -9 27 62 36 10 -16 -42 -56 -70 -83 -97 -116 -135 -57 -76 15 10 -7 73 67 -36 -127
4375a27P1J04Qklp2K5k9l0M5M4J8p9j3j3K3K3Q2j5o8o7k0P6K9K8m6N2n2n2k2k3K6K6k6k6K2
$$ -127 -56 48 56 54 51 -21 4 -25 -55 -10 34 52 -27 -40 -53 -30 -7 75 60 -8 -75 -95 -19 10 38 -8 44 -8 -60 -82 -105 -79 -53 -79 -105 -83
4358h3K3J5J5J5J6rqo3o3J01Lk2k3RRO9k8j08j2J00o2K4K4J11n0p1K6m4m4J28L2J0q8j02J24
$$ -83 -60 -45 -30 -15 1 -8 -16 -79 -142 -41 -38 -60 -83 -74 -65 4 -24 -132 -144 -44 -106 -82 -58 53 3 -68 -42 -86 -130 -2 30 40 -48 -150 -26
4341b6M4n1K5K5K0J9l4l4K6p0m9M8O7O8k1k1l1l1J31l1o9K8nR1j02j03M4M3l1l2l2O5%%O0
$$ -26 18 -33 -8 17 37 56 22 -12 14 -56 -105 -57 10 78 57 36 5 -26 105 74 5 33 28 119 17 -86 -42 1 -30 -62 -94 -29 -29 -29 31
4325C1j00J6J14m9m8L9L9j7j7p2K6JJJKJ13J6j5j77K5K6K2p6L1L0k4k4O5O5q1q0M9N0K9o7
$$ 31 -69 -53 61 12 -36 3 42 25 8 -64 -38 -37 -36 -35 -33 80 96 81 -96 -71 -45 -23 -99 -68 -38 -62 -86 -21 44 -37 -117 -68 -18 11 -56
4308e6m1N7j0Q7k2k2j6j6l9l8M3M2k1k1L3o3NNN3m3j4j3K8K9L1L2m9m9k9k9N2N3J0J1n0M7
$$ -56 -97 -40 -50 37 15 -7 -23 -39 -78 -116 -73 -31 -52 -73 -40 -103 -98 -93 -40 -83 -97 -110 -82 -53 -22 10 -39 -88 -117 -146 -94 -41 -31 -20 -70 -23
4291b3K7p0L9L8J3J2p8Q3J5J6k4k3n1n1J26l6n6L9P3r0m5N1L4L5m4m5q7P5J4J5k3k3J4J5K1
$$ -23 4 -66 -27 11 24 36 -42 41 56 72 48 25 -26 -77 49 13 -43 -4 69 -21 -66 -15 19 54 10 -35 -122 -47 -33 -18 -41 -64 -50 -35 -14
4274a4K0n2M5j5j6J0q6N5N5p6K2l9N8J8J8k5k4j1j1n4J08j6j6r6O5J0J1K0K1j8j7N7N7j2j08
$$ -14 6 -46 -1 -16 -32 -22 -108 -53 2 -74 -52 -91 -33 -15 3 -22 -46 -57 -68 -122 -14 -30 -46 -142 -77 -67 -56 -36 -15 -33 -50 7 64 52 -56
4257e6Jr6O1O2PPL3L2q0q1lmM4M5kkkjrrQ3p9MN%Jp2K5N1N1K2K3lj01K6K6K0K0l9l8l9l9R2
$$ -56 -55 -151 -90 -28 -21 -14 19 51 -29 -110 -113 -117 -73 -28 -30 -32 -34 -35 -44 -53 30 -49 -45 -40 -40 -39 -111 -86 -35 16 38 61 58 -43 -17 9 29 49 10 -28 -67 -106 -14
4237a4R2m7m7o0L8j7j7k6k6M8M9M2n4%%J8J8l6l7O0l7J2J2P4k2m9m8O4O4j0j1n5M2N6m1j22
$$ -14 78 31 -16 -76 -38 -55 -72 -98 -124 -76 -27 15 -39 -39 -39 -21 -3 -39 -76 -16 -53 -41 -29 45 23 -26 -74 -10 54 44 33 -22 20 76 35 -87
4220h7J03O1j00JJqrK8K7m7m7o4L2k8O9L0L0m4m4M5M5n1M5l9N8MMK5p1r6J31kkJ3J2k6k6q6
$$ -87 16 77 -23 -22 -21 -29 -38 -10 17 -30 -77 -141 -109 -137 -68 -38 -8 -52 -96 -51 -6 -57 -12 -51 7 11 15 40 -31 -127 4 2 0 13 25 -1 -27 -113
4202a13J0Q6j1L0o7n6M1j9j9L7L7j8j7M8m9m9M8K9K9j04N7O0O0j12N0M7j15j4j4L5L4J1J0
$$ -113 -103 -17 -28 2 -65 -121 -80 -99 -118 -81 -44 -62 -79 -31 -80 -129 -81 -52 -23 -127 -70 -10 50 -62 -12 35 -80 -94 -108 -73 -39 -28 -18
4186a8l4l4O8k8j3j2L6L7n6M0J1J0NNNNp6p5P0P0RRJ0Rq2q3R1nl3O5m4m5J2J1K1K1n0J10M
$$ -18 -52 -86 -18 -46 -59 -71 -35 2 -54 -14 -3 7 12 17 22 27 -49 -124 -54 16 25 34 44 53 -29 -112 -21 -26 -59 6 -38 -83 -71 -60 -39 -18 -68 42 46
4167D6r3l9J22Q7j1m4N3n0n0o5L2pR1Q3p8j49n2M8M8NOj1j1j0j1nnmnL2L1j7j7M6M7o7L1L1
$$ 46 -47 -86 36 123 112 68 121 71 21 -44 -12 -19 72 155 77 -72 -124 -76 -28 -23 -17 -28 -39 -49 -60 -65 -70 -74 -79 -47 -16 -33 -50 -4 43 -24 7 38
4149C8j30m0N8L9L9rrN5m2j26L5M9M9MNj5j11JR8POnon9L8PQppj2j3J8p9Q8Q8l2l2m4N3L5
$$ 38 -92 -132 -74 -35 4 -5 -14 41 -1 -127 -92 -43 6 10 15 0 -111 -110 -12 -5 1 -4 -10 -69 -31 -24 -16 -23 -30 -42 -55 -37 -116 -28 60 28 -4 -48 5 40
4130D0o1l5l6Q8p4NMJ70k4k8k8j01j01M4M4nmK0K0J5J6J5J5mnmmnmnmRJ0J0RK2K2k7k6J6J7
$$ 40 -21 -56 -92 -4 -78 -73 -69 101 77 49 21 -80 -181 -137 -93 -98 -102 -82 -62 -47 -31 -16 -1 -5 -10 -14 -18 -23 -27 -32 -36 -27 -17 -7 2 24 46 19 -7 9 26
4110B6l1l2k0j9k0j9NOOOJ7J6qpJ3J3P3j20klL4L5J3J3j0j1l0k9k9l0P1P0m2m2qqM1M1QQj7
$$ 26 -5 -37 -57 -76 -96 -115 -110 -104 -98 -92 -75 -59 -67 -74 -61 -48 25 -95 -97 -100 -66 -31 -18 -5 -15 -26 -56 -85 -114 -144 -73 -3 -45 -87 -95 -103 -62 -21 -13 -5 -22
4091b2j6PPL1L1k5k5k5k5PPm2m2P6P6o9o9N7N8J0Rp9p8O6O7qpqpJ7J7ppJ7J7l2l2N2N1k9l0
$$ -22 -38 -31 -24 7 38 13 -12 -37 -62 -55 -48 -90 -132 -56 20 -49 -118 -61 -3 7 16 -63 -141 -75 -8 -16 -23 -31 -38 -21 -4 -11 -18 -1 16 -16 -48 4 55 26 -4
4071dppo8o7J41n3QQM8M7p2p2M0n7lkRRJ0RL1L1j7j7nonnNOJ1q5J0J0kkK9o8J02o0M2M1j1
$$ -4 -11 -18 -86 -153 -12 -65 -57 -49 -1 46 -26 -98 -58 -115 -118 -120 -111 -102 -92 -83 -52 -21 -38 -55 -60 -66 -71 -76 -71 -65 -54 -139 -129 -119 -121 -123 -94 -162 -60 -120 -78 -37 -48
4051d8j1n4M2M2M2n1M6o2L4kjN9l8k6k6K9o8n5M2P3q9L2L3K3K3k9k9M6M5j0j06J15J8m7m8
$$ -48 -59 -113 -71 -29 13 -38 8 -54 -20 -22 -23 36 -2 -28 -54 -25 -93 -148 -106 -33 -122 -90 -57 -34 -11 -40 -69 -23 22 12 -94 21 39 -8 -56
4034e6K1K1L5o2m8M8Qj54Q5j3J5J11o3o2L2L1M4n3j6Q1mml9l8J6J5m8M8opK1K2j3j3O3r9j3
$$ -56 -35 -14 21 -41 -89 -41 -33 -187 -102 -115 -100 11 -52 -114 -82 -51 -7 -60 -76 5 1 -3 -42 -80 -64 -49 -97 -49 -55 -62 -41 -19 -32 -45 18 -81 -94
4017i4Q3k3k3LJ00lr9P0k7l9N8J5J6qj04O4O3p2p1L1o5M2M2M3M2r7%K7K6k6k5n6M1J8J8K8
$$ -94 -11 -34 -57 -54 46 43 -56 14 -13 -52 6 21 37 29 -75 -11 52 -20 -91 -60 -125 -83 -41 2 44 -53 -53 -26 0 -26 -51 -107 -66 -48 -30 -2
3999bj33Q4j4POJ8J7ppj3j4n6J06J1J1j0rO9k9k6j23m0N7P5k2j0j1KJQ1j5j01O1l4l4pJ54
$$ -2 -135 -51 -65 -58 -52 -34 -17 -24 -31 -44 -58 -114 -8 3 14 4 -5 64 35 9 -114 -154 -97 -22 -44 -54 -65 -63 -62 19 4 -97 -36 -70 -104 -111 43
3982D3M4n2j2j1mln8n7J24K8QPj12j5m3N3K0K1KKm8m7J20K3rrJ0Rm6m6mmO5l2kkO5O6q0q0
$$ 43 87 35 23 12 8 5 -53 -110 14 42 50 57 -55 -70 -113 -60 -40 -19 -17 -15 -63 -110 10 33 24 15 25 34 -12 -58 -62 -66 -1 -33 -35 -37 28 94 14 -66
3963f6N7N7k3k4l2l2M6n0j3j4l2O5M9m8L1L1Nr1m3N4jjNNM6M5l5l5J6J5l2l3K3K3m6N1p2Q8
$$ -66 -9 48 25 1 -31 -63 -17 -67 -80 -94 -126 -61 -12 -60 -29 2 7 -84 -127 -73 -74 -75 -70 -65 -19 26 -9 -44 -28 -13 -45 -78 -55 -32 -78 -27 -99 -11
3945a1O5l2j9P9l1l1noo0o0J17K1l9l8llllN0N0o3o2mlM5M5L5L6j00lj6j6M4M5m3N4%jm0m1
$$ -11 54 22 3 82 51 20 15 9 -51 -111 6 27 -12 -50 -53 -56 -59 -62 -12 38 -25 -87 -91 -94 -49 -4 31 67 -33 -36 -52 -68 -24 21 -22 32 32 31 -9 -50
3925e0n3M4N1m7J5J4m5m5R6%mR4m8m8L4L4m7m7J5J6J5J6l7l7J1J1k0k0M4n3m9J13N2j09P4
$$ -50 -103 -59 -8 -55 -40 -26 -71 -116 -20 -20 -24 70 22 -26 8 42 -5 -52 -37 -21 -6 10 -27 -64 -53 -42 -62 -82 -38 -91 -140 -27 25 -84 -10
3909a0k3l3O4l6l6J8J9LMqQ8K7p0rro1o1N2N2J9J9o6R6j06j0Pr0JR8L7L7k4k4k4k4J1J0l8
$$ -10 -33 -66 -2 -38 -74 -56 -37 -34 -30 -38 50 77 7 -2 -11 -72 -133 -81 -29 -10 9 -57 39 -67 -77 -70 -160 -159 -61 -24 13 -11 -35 -59 -83 -72 -62 -100
3891a00l8P8P7LLl4O2K5j38l9N8MLq1Q0mnr4LQ4j4mmM5n3KKKKm1N7mnN5m3J2J2k2k1k2k1P2
$$ -100 -138 -60 17 20 23 -11 51 76 -62 -101 -43 -39 -36 -117 -37 -41 -46 -140 -137 -53 -67 -71 -75 -30 -83 -81 -79 -77 -75 -116 -59 -63 -68 -13 -56 -44 -32 -54 -75 -97 -118 -46
3871d6P1l5l6n3M3L8L7j6j5j6j5j7j6k3P5J4J4j9j8p3Q9Mr3%JJ35L9q0J6n0M7K2K2j01mk9
$$ -46 25 -10 -46 -99 -56 -18 19 3 -12 -28 -43 -60 -76 -99 -24 -10 4 -15 -33 -106 -17 -13 -106 -106 -105 30 69 -11 5 -45 2 24 46 -55 -59 -88
3853h8O8J4J4L6o0onooo0L6J4J5m5N3R2o8L4o2l4l3RRM0M1M0M1PPj61o3K3K3p3K3qqJ55j35
$$ -88 -20 -6 8 44 -16 -22 -27 -33 -39 -99 -63 -49 -34 -79 -26 66 -2 32 -30 -64 -97 -88 -79 -39 2 42 83 90 97 -64 -127 -104 -81 -154 -131 -139 -147 8 -127
3835a27R4lQ8rKJj05N6N9j02kjj1j2L7L7n4n3O5O5o6L1k3k4K8K8L4o2K0K1l3l4l1l2N9N9j09
$$ -127 -33 -36 52 43 45 46 -59 -3 56 -46 -48 -49 -60 -72 -35 2 -52 -105 -40 25 -41 -10 -33 -57 -29 -1 33 -29 -9 12 -21 -55 -86 -118 -59 0 -109
3817a09N2O4l3L0K9l1l0J07J1j03nk6k6N5N5O1l6l0l0NN%jO5l1l1l2J4q3nnM5M4l7l6K6K5
$$ -109 -57 7 -26 4 33 2 -28 79 90 -13 -18 -44 -70 -15 40 101 65 35 5 10 15 15 14 79 48 17 -15 -1 -84 -89 -94 -49 -5 -42 -78 -52 -27
3800b7k9O8KKm1m1k8k7M7M7Q7j0l7l6l9l9l9m0O3O3J5J4m3m2jjM8m9M8M8O6l0n4M2M9M9k5
$$ -27 -56 12 14 16 -25 -66 -94 -121 -74 -27 60 50 13 -23 -62 -101 -140 -180 -117 -54 -39 -25 -68 -110 -111 -112 -64 -113 -65 -17 49 19 -35 7 56 105 80
3782H0k5QRj8j15M5M4m8m8Q5j2o1L7l3l3oR0J4q3k9k9P7j9Q9pj7j6k3k3L3L3J2q4K1J19jr7
$$ 80 55 63 72 54 -61 -16 28 -20 -68 17 5 -56 -19 -52 -85 -91 -1 13 -70 -99 -128 -51 -70 19 12 -5 -21 -44 -67 -34 -1 11 -73 -52 67 66 -31
3764c1j8j9K5K4j7j7j08N4M7M8k4k3M9N0j14P9M3n4m2N5j3j2M2M1m4m4NMK2K3k6k6JJM9M9
$$ -31 -49 -68 -43 -19 -36 -53 -161 -107 -60 -12 -36 -59 -10 40 -74 5 48 -6 -48 7 -6 -18 24 65 21 -23 -18 -14 8 31 5 -21 -20 -19 30 79
3747G9m9n0J08q6l5l4O6O6n7n6K3K4mmM4M4jjK3K4QRn3J42M0L9K8K7j07j08j82J40jr9J%k1
$$ 79 30 -20 88 2 -33 -67 -1 65 8 -48 -25 -1 -5 -9 35 79 78 77 100 124 132 141 88 230 270 309 337 364 257 149 -33 107 106 7 8 8 -13
3729a3k2K7K7m5m5J35L7j33O0N4m2p1K6l4l5L1L0L1L0k4k3k4k3J4J5j0j0MNN3N3l8l9l9l9
$$ -13 -35 -8 19 -26 -71 64 101 -32 28 82 40 -31 -5 -39 -74 -43 -13 18 48 24 1 -23 -46 -32 -17 -27 -37 -33 -28 25 78 40 1 -38 -77
3713g7P1P1p5p4M4M5nml8l9J0J0R6R6j14j15K9K9J0J07R0j04j3j3o6o5Q6Q6j19k3RJ0m7M9
$$ -77 -6 65 -10 -84 -40 5 0 -4 -42 -81 -71 -61 35 131 17 -98 -69 -40 -30 77 167 63 50 37 -29 -94 -8 78 -41 -64 -55 -45 -92 -43
3697d3mnJ4J4K0K1j2Q4q2q3M1M0l0l0j10N2RJ0KLO4l3k2P6K1p6J3J3PPl2l3J6J6KJN0N0l7
$$ -43 -47 -52 -38 -24 -4 17 5 89 7 -76 -35 5 -25 -55 -165 -113 -104 -94 -92 -89 -25 -58 -80 -4 17 -59 -46 -33 -26 -19 -51 -84 -68 -52 -50 -49 1 51 14
3678A4l7m3N4k1k1K4K4O7r4j0rP5k3p0K6m7m7J62Jm6m6L5L4n5J07k3k3r5O7l4l3R5o6K4K5
$$ 14 -23 -66 -12 -33 -54 -30 -6 61 -33 -43 -52 23 0 -70 -44 -91 -138 24 25 -21 -67 -32 2 -53 54 31 8 -87 -20 -54 -87 8 -58 -34 -9
3661iK0K1n4n5n4M3L7L6J5J6m6N2J0q7J41J42Oj55j6j6m5m5r9lQ6Q5j14j7P6k0L0L0P2r0J
$$ -9 11 32 -22 -77 -131 -88 -51 -15 0 16 -30 22 32 -55 86 228 234 79 63 47 2 -43 -142 -145 -59 26 -88 -105 -29 -49 -19 11 83 -7 -6
3645fKK3K3k5k5j9k0O1O1l5l5J4J3%%r7O4K5p2o8K9J10J3P4P3j26j26J3J3P8j9p4K3K7o9R4
$$ -6 -4 19 42 17 -8 -27 -47 14 75 40 5 19 32 32 32 -65 -1 24 -48 -116 -87 23 36 110 183 57 -69 -56 -43 35 16 -58 -35 -8 -77 17
$$ [...]
-1793b2
##END=		$$ NMR SPECTRUM
##END=		$$ LINK
