##TITLE=	13C
##JCAMP-DX=	6.0	$$ MestReNova 14.3.3-33362
##DATA TYPE=	LINK
##BLOCKS=	1    
##ORIGIN=	Mestrelab Research S.L.
##OWNER=	hrzepa
##$MNOVA/METADATA=	(DOCUMENT,BASE64)
eyJuYW1lIjoiRG9jdW1lbnQgMSIsInBhZ2VzIjpbeyJpdGVtcyI6WyIxIiAgICAgXX1dfQ==
##TITLE=	13C
##JCAMP-DX=	6.0	$$ MestReNova 14.3.3-33362
##DATA TYPE=	NMR SPECTRUM
##DATA CLASS=	XYDATA
##BLOCK_ID=	1
##ORIGIN=	Varian
##OWNER=	hrzepa
##NUMDIM=	1
##$MNOVA/METADATA=	(ITEM,BASE64)
eyJhbmdsZSI6MCwiYXhlcyI6eyJ4Ijp7Im1heCI6MjM0LjI2NDY1NzgxNzc5Nzc0LCJtaW4iOi0xNC4
yNjE1NDgyMzExMTU2NjF9LCJ5Ijp7Im1heCI6MjI0LjE1MzUxODY3Njc1NzgsIm1pbiI6LTIxLjU5MD
EyNTU2MDc2MDQ5OH19LCJwb2ludHMiOlt7IngiOjUzMjEsInkiOjU4MzV9LHsieCI6ODcyMiwieSI6N
TgzNX0seyJ4Ijo4NzIyLCJ5Ijo4MjA4fSx7IngiOjUzMjEsInkiOjgyMDh9LHsieCI6NTMyMSwieSI6
NTgzNX1dLCJ6IjowfQ==
##.OBSERVE FREQUENCY=	125.75317950000000167
##.OBSERVE NUCLEUS=	^13C
##.SOLVENT NAME=	cdcl3
##.PULSE SEQUENCE=	s2pul
##LONGDATE=	2019/04/30 19:03:32.000
##.ACQUISITIONMODE=	SIMULTANEOUS
##$ORIGINAL FORMAT=	Varian
##$MNOVA/SCALES_VERSION=	9
##$PARAMETER FILE=	(datafile, ASCII, /private/var/folders/bp/m_4195y96sx1d256lqvkcvym0000gq/T/DeJZRP9FSqi71juXDRDDcw/13C/fid, 0)
$$ 
##$PARAMETER FILE=	(header, BASE64, /private/var/folders/bp/m_4195y96sx1d256lqvkcvym0000gq/T/DeJZRP9FSqi71juXDRDDcw/13C/fid, 0)
AAAAAQAAAAEAAQAAAAAABAAEAAAABAAcAAAAyQAAAAE=
##$PARAMETER FILE=	(log, ASCII, /private/var/folders/bp/m_4195y96sx1d256lqvkcvym0000gq/T/DeJZRP9FSqi71juXDRDDcw/13C/log, 0)
$$ Tue Apr 30 19:03:34 2019: Experiment started
$$ Tue Apr 30 19:05:49 2019: BS 1 completed
$$ Tue Apr 30 19:08:00 2019: BS 2 completed
$$ Tue Apr 30 19:10:11 2019: BS 3 completed
$$ Tue Apr 30 19:12:22 2019: BS 4 completed
$$ Tue Apr 30 19:14:33 2019: BS 5 completed
$$ Tue Apr 30 19:16:44 2019: BS 6 completed
$$ Tue Apr 30 19:18:55 2019: BS 7 completed
$$ Tue Apr 30 19:21:06 2019: BS 8 completed
$$ Tue Apr 30 19:23:17 2019: BS 9 completed
$$ Tue Apr 30 19:25:28 2019: BS 10 completed
$$ Tue Apr 30 19:27:40 2019: BS 11 completed
$$ Tue Apr 30 19:29:51 2019: BS 12 completed
$$ Tue Apr 30 19:32:02 2019: BS 13 completed
$$ Tue Apr 30 19:34:13 2019: BS 14 completed
$$ Tue Apr 30 19:36:24 2019: BS 15 completed
$$ Tue Apr 30 19:38:35 2019: BS 16 completed
$$ Tue Apr 30 19:40:46 2019: BS 17 completed
$$ Tue Apr 30 19:42:57 2019: BS 18 completed
$$ Tue Apr 30 19:45:08 2019: BS 19 completed
$$ Tue Apr 30 19:47:20 2019: BS 20 completed
$$ Tue Apr 30 19:49:31 2019: BS 21 completed
$$ Tue Apr 30 19:51:42 2019: BS 22 completed
$$ Tue Apr 30 19:53:53 2019: BS 23 completed
$$ Tue Apr 30 19:56:04 2019: BS 24 completed
$$ Tue Apr 30 19:58:15 2019: BS 25 completed
$$ Tue Apr 30 20:00:26 2019: BS 26 completed
$$ Tue Apr 30 20:02:37 2019: BS 27 completed
$$ Tue Apr 30 20:04:48 2019: BS 28 completed
$$ Tue Apr 30 20:07:00 2019: BS 29 completed
$$ Tue Apr 30 20:09:11 2019: BS 30 completed
$$ Tue Apr 30 20:11:22 2019: BS 31 completed
$$ Tue Apr 30 20:13:33 2019: BS 32 completed
$$ Tue Apr 30 20:15:44 2019: BS 33 completed
$$ [...]
$$ 0 
$$ wqinit 2 2 8 0 0 4 1 0 1 64
$$ 1 ""
$$ 0 
$$ wshim 4 2 4 0 0 2 1 1 1 64
$$ 1 "n"
$$ 15 "e" "f" "g" "n" "s" "0" "1" "2" "3" "4" "5" "6" "7" "8" "9" 
$$ wtfile1 2 2 15 0 0 3 2 1 1 64
$$ 1 ""
$$ 0 
$$ wtfile 2 2 15 0 0 3 1 1 1 64
$$ 1 ""
$$ 0 
$$ wtune 4 2 4 0 0 2 1 0 1 64
$$ 1 "st12"
$$ 11 "s" "t" "e" "i" "n" "o" "v" "1" "2" "3" "4" 
$$ xy 7 1 19 19 19 2 1 8192 1 64
$$ 1 681 
$$ 0 
$$ x3 7 1 19 19 19 2 1 8192 1 64
$$ 1 7587 
$$ 0 
$$ x2y2 7 1 19 19 19 2 1 8192 1 64
$$ 1 -284 
$$ 0 
$$ x4 7 1 19 19 19 2 1 8192 1 64
$$ 1 0 
$$ 0 
$$ xz2 7 1 19 19 19 2 1 8192 1 64
$$ 1 -1561 
$$ 0 
$$ xz 7 1 19 19 19 2 1 8192 1 64
$$ 1 6948 
$$ 0 
$$ y1 7 1 19 19 19 2 1 8192 1 64
$$ 1 797 
$$ 0 
$$ z3x 7 1 19 19 19 2 1 8192 1 64
$$ 1 476 
$$ 0 
$$ z2 7 1 19 19 19 2 1 8192 1 64
$$ 1 -902 
$$ 0 
$$ yz2 7 1 19 19 19 2 1 8192 1 64
$$ 1 -2835 
$$ 0 
$$ yz 7 1 19 19 19 2 1 8192 1 64
$$ 1 -2906 
$$ 0 
$$ y4 7 1 19 19 19 2 1 8192 1 64
$$ 1 0 
$$ 0 
$$ z1 7 1 19 19 19 2 1 8192 1 64
$$ 1 -17818 
$$ 0 
$$ z0_ 1 1 19 19 19 2 1 73744 1 64
$$ 1 3390 
$$ 0 
$$ z1c 7 1 19 19 19 2 1 8192 1 64
$$ 1 -1044 
$$ 0 
$$ z2xy 7 1 19 19 19 2 1 8192 1 64
$$ 1 5183 
$$ 0 
$$ z2x2y2 7 1 19 19 19 2 1 8192 1 64
$$ 1 -2701 
$$ 0 
$$ z2c 7 1 19 19 19 2 1 8192 1 64
$$ 1 196 
$$ 0 
$$ z2x3 7 1 19 19 19 2 1 8192 1 64
$$ 1 0 
$$ 0 
$$ z3 7 1 19 19 19 2 1 8192 1 64
$$ 1 2601 
$$ 0 
$$ z2y3 7 1 19 19 19 2 1 8192 1 64
$$ 1 0 
$$ 0 
$$ z3c 7 1 19 19 19 2 1 8192 1 64
$$ 1 0 
$$ 0 
$$ z4y 7 1 19 19 19 2 1 8192 1 64
$$ 1 4212 
$$ 0 
$$ z4c 7 1 19 19 19 2 1 8192 1 64
$$ 1 0 
$$ 0 
$$ z3xy 7 1 19 19 19 2 1 8192 1 64
$$ 1 0 
$$ 0 
$$ z3x3 7 1 19 19 19 2 1 8192 1 64
$$ 1 0 
$$ 0 
$$ z3x2y2 7 1 19 19 19 2 1 8192 1 64
$$ 1 0 
$$ 0 
$$ z3y3 7 1 19 19 19 2 1 8192 1 64
$$ 1 0 
$$ 0 
$$ z3y 7 1 19 19 19 2 1 8192 1 64
$$ 1 1029 
$$ 0 
$$ z4 7 1 19 19 19 2 1 8192 1 64
$$ 1 4828 
$$ 0 
$$ z4x2y2 7 1 19 19 19 2 1 8192 1 64
$$ 1 0 
$$ 0 
$$ z4x 7 1 19 19 19 2 1 8192 1 64
$$ 1 -13017 
$$ 0 
$$ z4xy 7 1 19 19 19 2 1 8192 1 64
$$ 1 0 
$$ 0 
$$ z8 7 1 19 19 19 2 1 8192 1 64
$$ 1 0 
$$ 0 
$$ z6 7 1 19 19 19 2 1 8192 1 64
$$ 1 -5568 
$$ 0 
$$ z5x 7 1 19 19 19 2 1 8192 1 64
$$ 1 0 
$$ 0 
$$ z5 7 1 19 19 19 2 1 8192 1 64
$$ 1 -6610 
$$ 0 
$$ z5y 7 1 19 19 19 2 1 8192 1 64
$$ 1 0 
$$ 0 
$$ z7 7 1 19 19 19 2 1 8192 1 64
$$ 1 339 
$$ 0 
$$ zx2y2 7 1 19 19 19 2 1 8192 1 64
$$ 1 698 
$$ 0 
$$ zoom 7 1 32767 0 0 4 1 0 1 64
$$ 1 0 
$$ 0 
$$ zxy 7 1 19 19 19 2 1 8192 1 64
$$ 1 -1576 
$$ 0 
$$ zx3 7 1 19 19 19 2 1 8192 1 64
$$ 1 4844 
$$ 0 
$$ zy3 7 1 19 19 19 2 1 8192 1 64
$$ 1 -2037 
$$ 0 
$$ 
##$PARAMETER FILE=	(text, ASCII, /private/var/folders/bp/m_4195y96sx1d256lqvkcvym0000gq/T/DeJZRP9FSqi71juXDRDDcw/13C/text, 0)
$$ 
$$ 
##XUNITS=	HZ
##YUNITS=	ARBITRARY UNITS
##FIRSTX=	29456.285383729999012
##LASTX=	-1793.2377791117969537
##DELTAX=	-0.476837158203125
##XFACTOR=	1
##YFACTOR=	0.006529884386110644881
##FIRSTY=	-0.20326745510101318359
##MINY=	-1.2731589078903198242
##MAXY=	213.9647216796875
##NPOINTS=	65536
##XYDATA=	(X++(Y..Y))
$$ [...]
$$ plain form
15796 -61 -36 -34 -29 -86 -77 -32 21 36 55 43 -1 -40 -77 -24 -81 -55 -28 -3 36 38 41 -6 -70 -39 13 -3 -25 -52 33 7 -52 -61 -23 -38 -64 -30 -71 -22
15778 -22 -34 -78 -75 -17 -15 -16 -33 -2 45 29 -10 -64 -9 -4 18 10 29 43 33 0 -57 -73 -54 -51 -59 -103 -88 -74 -56 -50 -92 -57 -52 -49 -69 -9 3 -1 22 97
15759 97 13 28 30 5 -41 -29 35 -38 -22 49 26 30 34 -56 -19 -8 -24 -37 -5 20 12 53 -12 -73 -95 -40 -1 21 64 53 71 6 -2 65 1 -16 -7 -37
15741 -37 -34 -47 -59 21 39 34 -30 -92 -13 -15 3 14 3 34 -7 -55 -14 -3 35 -45 -29 -26 -7 -18 3 19 37 21 -46 -69 -30 3 8 -41 16 71 21
15723 21 -22 -39 28 35 -39 -38 -26 -88 -32 -29 -46 -1 45 20 5 -34 -43 -43 -47 -22 -12 -49 -65 -32 -65 -66 -32 34 -28 -58 18 10 -20 -48 36 0 1 15 19 -50
15704 -50 -63 -53 -83 -89 -40 2 10 -26 -84 -45 -26 -48 -3 -45 -49 -74 -53 50 54 16 -11 -40 -67 -82 0 -45 -122 -41 -47 -30 -44 -116 -31 24 -29 -47 -50
15687 -50 -23 -11 24 30 -20 -9 -1 0 0 -7 -14 -5 -1 45 27 -5 -9 20 73 70 21 5 -11 43 75 7 53 78 40 -36 -7 -31 17 32 67 5 7 38 43 49 -20
15667 -20 -33 51 25 27 -3 22 41 -17 -116 -59 -28 -61 -21 -19 5 26 -18 -15 -3 -37 -59 -49 -48 -37 16 28 13 80 52 33 49 113 181 459 1061 1777
$$ packed form
15796f1K5KNn7RM5N3J5J9j2m4l9l7N3n7K6K7K5L9KLm7o4L1N2j6k2k7Q5k6n9rL8j5k6L4m1M9
15778b2j2m4LN8Kjj7L1M7j6l9n4N5NK2qJ9J4j0l3n7j6J9Lqm4J5J4J8Om2L5NLk0O0J2mK3P5
15759I7q4J5Kk5m6J2O4p3J6P1k3MMr0L7J1j6j3L2K5qM1o5o1k2N5L9K2M3j1J8o5qO7o4j7Rl0
15741c7Lj3j2Q0J8no4o2P9kJ8J1j1L1m1m8M1J1L8q0J6LJ9j1K1J6J8j6o7k3L9L3Nm9N7N5n0
15723B1m3j7O7Pp4JJ2o2N6Lj7M5M6k5j5l9r%mK5J0l7j6L3l3jL4O6o2l0P6ql0k8Q4l6JJ4Mo9
15704e0j3J0l0oM9M2Ql6n8L9J9k2M5m2mk5K1J03Ml8k7k9k7j5Q2m5p7Q1oJ7j4p2Q5N5n3j8l
15687e0K7J2L5On0J1QJ%ppRMM6j8l2mK9N3lm9j6j6N4L2o8M6K5l8p6K9k4M8J5L5o2KL1NOo9
15667b0j3Q4k6Kl0K5J9n8r9N7L1l3M0KK4K1m4LJ2l4k2J0JJ1N3J2j5O7k8j9J6O4O8K78O02P16
$$ plain form
15650 1777 1523 675 281 178 27 -9 13 42 67 66 23 -39 7 0 -63 -66 -58 -53 -4 -28 -13 -38 -7 6 20 10 17 -39 -28 -46 -22 67 31 -2
15634 -2 -8 6 -72 -79 -46 -26 -14 -58 -24 22 18 -23 -41 -19 -49 16 36 11 13 -22 -12 -25 -15 -34 -66 0 60 66 -52 -47 -13 -35 -89 -63 -62 -5 -43 -13
15616 -13 24 24 27 12 -28 -12 -21 3 -25 -15 -7 -73 -138 -75 -57 -26 -70 -40 -11 12 -50 -61 -39 -21 -33 59 77 -17 -71 -75 -42 -44 13 41 -45 -20 -31 -2
15597 -2 41 -24 -67 -58 -104 -67 22 -18 -40 27 7 -1 -48 13 7 -20 -39 -18 -3 -24 -44 -51 10 -8 14 38 51 -28 -93 -57 -4 -8 -73 -134 -89 -163 -135 -67
15579 -67 2 10 -47 -10 -15 -43 -58 -109 -55 -11 -13 17 20 28 -27 -9 -13 -112 -106 -98 13 16 -2 -19 1 -63 -24 -14 -23 -33 -43 -63 -17 -78 -87 -60 -39 -59 33 27
15560 27 1 -20 -9 -33 -55 -56 -110 -35 25 -56 -56 -55 -4 47 51 -10 10 0 12 17 5 20 1 17 56 20 -15 20 55 1 -34 -3 -44 -50 -76 -96 -47 -24
15542 -24 -5 23 -33 -70 -44 -60 -45 -58 -73 -42 -20 -32 -43 -33 -14 -22 -71 26 -1 19 64 36 44 18 21 -6 -101 -42 -30 -27 23 39 34 -12 22 37 2
15525 2 2 27 -28 -51 -105 -85 -70 -21 -44 -57 -97 -58 -19 12 22 -12 37 -1 19 16 20 -3 7 -19 -5 -4 14 12 -14 -19 -26 -2 -46 2 9 -24 -45 -33 7
$$ packed form
15650A777k54q48l94j03j51l6K2K9K5jm3o2M6po3lQNM9k4J5k5L1J3J4j0Pn6J1j8K4Q9l6l3
15634boJ4p8pL3K0J2m4L4M6mm1j8K2l0O5K0k5Kl5J0j3J0j9l2O6O0Oj18NL4k2n4K6JN7l8L0
15616a3L7%Lj5m0J6rK4k8J0Qo6o5O3J8L1m4L0K9K3o2j1K2J8j2R2J8r4n4mL3kN7K8q6K5j1K9
15597bM3o5m3Rm6L7Q9m0k2O7k0qm7O1ok7j9K1J5k1k0pO1j8K2K4J3p9o5L6N3mo5o1M5p4K8O8
15579f7O9Qn7L7nk8j5n1N4M4kL0LQn5J8mr9OQJ11Lj8j7K0o4L9J0rj0j0k0M6o1rK7K1k0R2o
15560B7k6k1J1k4k2jn4P5O0q1%JN1N1Mo1K0j0J2Nj2J5j9J6L9l6l5L5L5n4l5L1m1ok6k0M9K3
15542b4J9K8n6l7K6j6J5j3j5L1K2j2j1J0J9qm9R7k7K0M5k8Qk6Lk7r5N9J2LN0J6nm6L4J5l5
15525B%K5n5k3n4K0J5M9k3j3m0L9L9L1J0l4M9l8K0lMk3J0k6J4JJ8kk6npK4m4M8Pl3k1J2M0
$$ plain form
15506 7 -6 -50 -47 -7 -42 -36 -37 -73 -47 5 -19 -53 -66 -28 23 87 59 80 101 58 -18 -27 -41 -15 -14 26 20 33 -32 -15 -25 -49 27 -13 3 4 -93 -21 -62
15487 -62 -29 -11 -46 -25 17 0 -70 -55 12 65 73 35 5 31 -24 -1 9 -16 -70 -20 -67 -26 8 -41 -32 -59 8 2 24 14 13 -2 -21 44 15 14 20 -38
15469 -38 -11 -1 -63 -72 -5 18 -36 30 50 49 103 137 257 540 1311 2065 1545 614 239 208 117 61 -62 -75 -49 -26 8 49 107 109 54 46 -8
15453 -8 8 -18 26 25 55 10 4 10 52 39 64 91 -8 -26 -25 -8 -48 -63 24 -22 -25 10 67 49 12 22 17 -17 -34 -70 -70 -66 -23 -15 4 -20 -16 4 -50 -76
15434 -76 -22 -44 -39 -12 9 -24 -9 51 -41 -78 -73 4 33 -26 -34 0 64 106 13 -81 -50 -51 -40 -10 7 23 31 31 65 62 -18 -25 32 -14 -23 34 17 -27 -78
15416 -78 -47 -45 -92 -71 -43 -7 -41 -130 -80 -31 -16 -82 -93 -56 -66 -83 -67 -64 -10 31 85 -14 -99 -122 -56 24 -70 -86 -35 -19 9 -35 -7 10 11 0
15399 0 67 -10 -38 -39 -13 9 -12 -32 34 64 49 92 89 56 58 9 33 12 41 36 15 49 -18 -55 -78 -70 -68 19 -15 -28 -8 -33 -23 -30 2 0 32 -8 -5 -25
15380 -25 14 41 -42 -95 -45 30 6 -19 -33 62 38 -4 -29 -2 -47 -33 35 -48 -73 -37 -1 20 -2 -48 -73 -34 -54 -57 -22 -11 -1 -80 -96 20 -20
$$ packed form
15506Gj3m4LM0l5Ojl6K6N2k4l4j3L8N1O4k8K1K1m3p6rj4K6JM0oJ3o5J7j0k4P6m0J6Jr7P2m1
15487f2L3J8l5K1M2j7p0J5O7N3Ql8l0K6n5K3J0k5n4N0m7M1L4m9Rk7O7oK2j0jj5j9O5k9jOn8
15469c8K7J0o2rO7K3n4O6K0jN4L4J20K83P71P54n20r31l75l1r1n6j23j3K6K3L4M1N8Kn5qn4
15453hJ6k6M4jL0m5oOM2j3K5K7r9j8JJ7m0j5Q7m6lL5N7j8l7J0nl4j7l6%MM3QJ9k4MK0n4k6
15434g6N4k2NK7K1l3J5O0r2l7NP7K9n9qL4O4M2r3r4L1jJ1L0J7J6Q%L4lq0pN7m6rN7j7m4n1
15416g8L1Km7K1K8L6l4q9N0M9J5o6j1L7j0j7J6LN4M1N4r9q5k3O6Q0r4j6N1J6K8m4K8J7Jj1
15399@O7p7k8jK6K2k1k0O6L0j5M3ll3Km9K4k1K9nk1L4o7l7k3QKQ7l4j3K0k5J0pL2kL2m0Lk0
15380b5L9K7q3n3N0P5k4k5j4R5k4m2k5K7m5J4O8q3k5L6L6K1k2m6k5L9k0lL5J1J0p9j6J16m0
$$ plain form
15363 -20 -71 3 56 -32 -43 -71 -36 -19 -54 -68 -17 0 19 1 0 -11 -2 -53 -49 -62 -30 -24 -14 15 -32 -3 -64 -73 -29 -30 -35 -56 -102 -1 -49 -66 -107 -103
15345 -103 -25 12 -9 3 -44 -7 -25 35 58 64 33 -41 -14 32 19 -50 -33 33 -53 -57 -77 -59 -52 -51 -82 10 -31 -16 34 -9 -28 19 23 32 -8 -31 10
15327 10 -28 -51 -34 17 -7 -64 -39 -12 54 12 -9 -32 -54 -75 -50 -21 -15 -23 -23 -28 -61 8 -2 -31 2 -48 -55 -25 -14 -7 -20 -25 -5 46 38 25 15 -11 -30
15309 -30 31 13 -4 -26 -23 -3 -47 -30 -39 -55 -32 9 0 -31 -29 -35 -69 -74 -34 -9 27 25 0 -40 -41 -5 56 71 29 3 -28 9 19 -18 12 -35 -38 -17 18
15290 18 -22 74 83 -15 38 19 30 24 -2 15 31 -1 -21 -23 -33 -32 1 -49 -36 -40 -27 -18 -61 -15 -44 -22 29 50 23 27 23 -19 16 -48 -60 -70 -49 29 -23
15271 -23 -52 -11 35 41 4 -40 -37 -67 -1 29 8 -23 36 75 22 28 -64 -37 -40 -14 -74 -1 66 15 2 -45 -59 -35 -35 -46 23 9 -49 -60 -69 -73 -73 -11 5
15253 5 -7 -74 -78 -79 -61 40 71 24 27 -4 26 13 55 21 -38 -31 49 22 19 -8 20 73 -18 -37 33 57 10 -41 -40 -39 -35 9 -10 -22 -37 -46 -32 -10 -15 -43
15234 -43 -19 -3 1 6 -60 -74 -70 -59 -24 -25 -48 -6 -43 -49 2 -19 -26 -45 15 -7 -39 5 -33 -95 -19 8 -65 -98 -47 -27 -59 -72 -10 12 -4 -67 20 51
$$ packed form
15363b0n1P4N3q8j1k8L5J7l5j4N1J7J9j8jj1Rn1Mj3L2OJ0K9m7K9o1rM4jnk1m6J01m8j7m1M
15345a03P8L7k1J2m7L7j8O0K3Ol1p4K7M6j3o9J7O6q6mk0J8PJl1R2m1J5N0m3j9M7MRm0k3M1
15327A0l8k3J7N1k4n7K5K7O6m2k1k3k2k1K5K9Oq%nl3O9j0k9L3n0pL0J1Pj3nK0N1qj3j0k6j9
15309c0O1j8j7k2LK0m4J7rj6K3M1rl1Kol4nM0K5L6kk5m0jL6O1J5m2k6l1L7J0l7L0m7lK1L5
15290A8m0R6Rr8N3j9J1ok6J7J6l2k0kj0JL3n0J3mJ3Rm3M6k9K2N1K1k7Mmm2L5o4j2j0K1P8n2
15271b3k9M1M6Ol7m4Ll0O6L0k1l1N9L9n3Or2K7lK6o0P3O7n1j3m7j4K4%j1O9j4n8j1rm%O2J6
15253Ej2o7mjJ8J01L1m7Ll1L0j3M2l4n9PQ0k7lk7K8N3r1j9P0K4m7n1JJMM4j9j2j5rJ4K2nk8
15234d3K4J6MNo6j4MJ1L5jk3M2l7oN1k1pj9O0k2l2M4l8o2P6K7p3l3N1K0l2j3O2K2j6o3Q7L1
$$ plain form
15216 51 56 36 -7 -54 -11 18 -53 -16 -21 8 -40 -22 -58 -53 1 -97 -52 -39 -19 5 56 14 31 37 -17 -5 -69 -61 -49 -81 -96 -48 -12 -59 -25 8 16 14
15197 14 41 41 19 -41 5 23 -42 -32 58 26 -37 -90 -49 -6 73 45 -7 -22 8 40 38 17 -30 -68 -69 -93 -78 -12 -19 -59 -24 -59 -73 -27 -57 -27 17
15180 17 -43 -23 -20 -30 -41 1 38 9 -38 -68 -40 -4 31 80 106 37 -10 -53 -8 54 19 -36 -52 -8 -33 -104 -80 -142 -73 -61 -45 28 38 15 -52
15163 -52 -62 -2 -13 -35 7 33 12 -69 -28 27 3 13 40 21 8 48 -5 -16 -60 -6 -29 -70 -33 -24 -30 -59 -55 -12 -38 -49 21 20 -41 -21 4 -41 -29
15145 -29 2 -57 12 15 -19 -46 -47 3 40 45 52 27 -1 0 -19 11 -8 -9 0 19 23 32 56 108 115 162 203 290 308 455 862 1616 3235 4405 3448 1845
15128 1845 945 559 394 309 219 147 124 80 91 22 -33 -31 12 44 46 44 70 206 198 96 49 8 -4 -18 -61 -91 -84 -69 -4 5 39 30 -27 -46 -52
15112 -52 -71 -102 -49 1 -27 -75 -104 -25 -21 -18 -73 -50 -29 -51 -60 -7 -3 -35 -45 -41 3 -36 -20 6 -53 30 72 3 -38 -30 -32 1 49 32 -34 -36 -51 -39 -49
15093 -49 -71 -17 39 -11 -54 -90 -68 -101 -100 -130 -73 -46 -17 4 -56 -38 -47 -42 3 -9 26 -25 -54 -20 -7 9 64 -37 -76 -45 5 55 88 90 52 5
$$ packed form
15216E1Nk0m3m7M3K9p1L7nK9m8J8l6NN4r8M5J3K0K4N1m2J7On4J2o4QJ2l2j5M8L6m7L4L3Qk
15197A4K7%k2o0M6J8o5J0R0l2o3n3M1M3P9k8n2j5L0L2kk1m7l8jk4J5O6pm0L5l5j4M6l0L0M4
15180A7o0K0Lj0j1M2L7k9m7l0K8L6L5M9K6o9m7m3M5O2l5n5j6M4k5p1K4o2O9J2J6P3J0k3o7
15163e2j0O0j1k2M2K6k1q1M1N5k4J0K7j9j3M0n3j1m4N4k3m1L7Rok9MM3k6j1P0jo1K0K5m5J2
15145b9L1n9O9Ll4k7jN0L7NPk5k8Jj9L0j9jRJ9MRK4N2PM7M1Q7J8J47M07P54J619J170r57j603
15128A845r00l86j65q5r0p2k3m4J1o9n5KM3L2KkK6J36qj02m7m1j2j4m3l0PJ5O5RL4rn7j9o
15112e2j9l1N3N0k8m8k9P9MLn5K3K1k2rN3Ml2j0MM4l9J6K6n9Q3M2o9m1QkL3M8j7o6kj5J2j0
15093d9k2N4N6n0m3l6K2l3Jl0N7K7K9K1o0J8rNM5j2L5n1k9L4J3J6N5j01l9L1N0N0L3Kl8m7
$$ plain form
15076 5 -50 -79 -85 -72 -52 -67 -78 -11 13 -49 -41 49 27 -17 -20 28 42 21 -25 -40 -52 -28 -26 -24 -47 8 -1 -44 -26 -29 -29 -53 -86 -55 -31 -52 -15 -31 -5
15057 -5 56 104 93 111 96 -5 10 11 -37 -7 -25 -5 -22 -42 26 -20 -20 -52 -31 -13 42 75 66 79 62 21 -4 -53 -25 -36 -42 -45 -41 -54 -37 -6 -22 19
15039 19 4 -4 -23 -29 12 80 118 13 17 -22 -42 -34 -48 -13 -10 18 -47 -59 -24 14 14 8 -4 1 2 -16 -73 -62 -4 10 -11 -38 -24 -4 -23 -53 -71 -38 -69
15021 -69 -89 -80 -18 -34 -44 -37 19 -57 -64 -15 -16 -22 -68 -46 -15 -28 -51 -12 -48 -49 -99 -107 -63 -58 -14 3 9 -32 -16 -33 -44 -57 -79 -54 -56 -57 -70 -54 -40 -60
15001 -60 -9 -7 24 6 7 37 -20 -18 -32 -34 2 43 -8 -40 -62 -57 -43 17 58 46 -30 -54 -44 6 1 0 -2 -2 45 7 -1 20 -17 -12 -63 -41 -6 -16 19 33
14982 33 8 -10 16 3 -31 -44 5 -10 -45 -99 -66 -49 -55 -18 -56 -87 -30 9 44 8 -45 -5 -12 -21 32 3 -37 -6 -46 -90 -93 -7 74 45 43 36 29 24 43
14964 43 4 -16 -21 -99 -18 3 -15 -19 14 -2 2 41 29 -15 -18 -48 -15 -16 -37 -2 8 -12 -39 -17 56 30 -12 3 53 47 24 -56 -149 -121 -71 -57 -27 -63
14946 -63 -39 -16 1 -59 -44 -32 -15 -36 -48 -70 -79 -103 -42 1 -63 -73 -34 -26 -44 -14 -36 -73 -2 -20 -47 -48 -19 -14 -36 -99 -44 -104 -91 -6 15 -55 -45
$$ packed form
15076En5k9oJ3K0j5j1O7K4o2QR0k2m4lM8J4k1m6j5j2K4KKk3N5rm3J8l%k4l3L1K4k1L7j6K6
15057eO1M8j1J8j5j01J5Jm8L0j8K0j7k0O8m6%l2K1J8N5L3rJ3j7m1k5m9K8j1olMj3J7L1j6M1
15039A9j5qj9oM1O8L8j05Ml9k0Qj4L5LK8o5j2L5L8%oj2NJj8n7J1N8J4k1k7J4K0j9l0j8L3l1
15021f9k0RO2j6j0PN6p6pM9jom6K2L1j3k3L9l6jn0qM4NM4J7Om1J6j7j1j3k2K5kjj3J6J4k0
15001f0N1KL1j8JL0n7Kj4kL6M1n1l2k2NJ4O0M1j2p6k4J0N0njk%M7l8qK1l7Nn1K2L5j0L5J4
14982C3k5j8K6j3l4j3M9j5l5n4L3J7oL7l8l1N7L9L5l6n3M0prN3k9m0L1m0m4lQ6Q1k9kppnJ9
14964D3l9k0np8Q1K1j8mL3j6ML9j2m4ll0L3jk1L5J0k0k7K2P3k6m2J5N0ok3q0r3K8N0J4L0l6
14946f3K4K3J7o0J5J2J7k1j2k2rk4O1M3o4j0L9Qj8L0k2l7P1j8k7jK9Nk2o3N5o0J3Q5K1p0J0
$$ plain form
14928 -45 7 13 -54 -78 0 43 37 50 48 19 18 18 113 50 20 -56 -58 -6 68 138 76 17 -57 -37 3 1 -13 -17 18 -14 -15 -34 -15 20 0 -21 -41 -35 -16 -14
14909 -14 -45 -77 -49 19 12 -11 13 -52 -39 -25 10 -30 -43 -46 -20 -47 -20 20 -9 -21 9 -45 -22 -58 3 28 -17 -85 -86 -76 -109 -40 -22 -47 -5 -14 0
14891 0 -39 -43 -20 -23 -77 -86 -17 28 -31 -40 -36 -80 -23 14 49 42 7 -12 -9 61 79 38 -5 5 26 -22 -13 -59 -10 -9 -22 -64 -94 -83 -39 -91 -107 -29 -70 -109
14872 -109 -86 -110 -67 -51 -16 -42 -23 12 -16 -50 -52 -37 -6 -51 -96 -41 -12 -62 -22 -84 -121 -180 -97 -63 -30 0 -48 -118 -28 -12 -8 -22 -72 -54 -33
14856 -33 -57 -80 -39 -50 -70 -10 30 38 -15 -39 6 33 -2 -44 -14 -21 -71 -53 -42 -87 -76 -9 58 22 38 25 20 -16 -18 -115 -109 -34 3 -15 20 -30 -61
14838 -61 -59 -45 -27 0 -1 22 15 -31 -2 63 39 17 -30 3 45 62 -23 -17 -29 -78 -90 -69 -11 -31 -31 -44 -15 90 5 -77 -72 -33 -66 -128 -88 -53 -85
14820 -85 -48 -24 0 46 -11 -77 -34 7 -48 -62 -78 -47 4 -32 -104 -128 -101 -126 -86 -31 -36 -79 -108 -56 -42 -106 -89 -80 -59 -72 -90 -72 -77 -56 35 1
14803 1 -53 -34 -52 -50 -26 27 47 -3 -32 27 42 25 -6 -6 -21 -24 -51 -76 -31 -29 -43 -48 -40 3 8 -40 -75 -49 8 52 -23 -42 -13 -22 -9 -50 -12 4 15
$$ packed form
14928d5N2Oo7k4P8M3oJ3kk9j%R5o3l0p6kN2P4P0o2n9p4K0M0kj4mL5l2jj9J9L5k0k1k0OJ9K
14909a4l1l2K8O8pk3K4o5J3J4L5m0j3lK6k7K7M0k9j2L0n4K3l6O1K5m5o8jJ0l3O9J8k5M2rJ4
14891@l9mK3ln4rO9M5n9rMm4N7L7L5pl5j9LP0J8m1m3J0K1m8Rm6M9Jj3m2l0J1M4n2j6P8m1l9
14872a09K3k4M3J6L5k6J9L5k8l4kJ5L1m5m5N5K9n0M0o2l7n9Q3L4L3L0m8p0R0J6Mj4n0J8K1
14856c3k4k3M1j1k0O0M0Qn3k4M5K7l5m2L0pn0J8J1m5J1O7O7l6J6j3nl6kr7OP5L7j8L5n0l1
14838f1KJ4J8K7jK3pm6K9O5k4k2m7L3M2J7q5Oj2m9j2K1N8k0%j3K9J05q5q2NL9l3o2M0L5l2
14820h5L7K4K4M6n7o6M3M1n5j4j6L1N1l6p2k4K7k5M0N5nm3k9N2J4o4J7RK1j3j8J8nK1R1l4
14803An4J9j8KK4N3K0n0k9N9J5j7l1%j5lk7k5M5Kj4nQM3Nm8l5K6N7M4p5j9K9rJ3m1L8J6J1
$$ plain form
14784 15 30 -53 -51 -73 -70 -17 -11 -21 -43 -4 55 77 65 -13 -35 -35 -21 27 15 34 -16 0 16 32 24 8 -86 -13 12 -38 -15 -39 -33 -53 -32 -38 -47 -40 -9
14766 -9 -99 -75 -17 25 -1 4 13 5 -30 -75 -97 -82 7 -15 -14 -41 -43 -56 -62 -10 -25 -27 -65 -90 -116 -35 29 92 -35 -88 -72 -101 -78 -47 -59 -80 -85 -101 -57
14747 -57 -22 -22 -15 3 1 11 38 31 -16 -30 9 -42 -18 79 17 -10 29 -15 -34 -46 -72 -64 -15 -28 -15 -30 -83 -62 -23 -31 -52 -4 -46 -68 -75 -83 -14 -91 -112
14729 -112 -21 -26 -44 -10 -4 29 77 19 -30 -46 -69 -85 -43 -59 -16 -51 -97 -78 -57 -10 -72 -45 -24 -28 2 7 -18 -33 -19 -38 -30 -24 -60 -8 -16 -28 -68 -35
14711 -35 18 28 23 -12 -35 -33 -42 -24 -12 -45 -29 -54 -84 -24 -35 -24 -30 -39 -46 -41 -32 -60 -65 -125 -49 -58 -114 -105 -144 -83 1 16 -3 -25 -28 37 12 -14 -43 -62 -59
14691 -59 -12 -10 -8 -19 -42 -15 -55 -86 -63 -41 -40 -38 -1 1 22 -2 -19 -64 -39 -46 -55 -40 -25 -8 -38 -71 -19 -3 -29 1 23 -30 -71 -91 -61 -117 -118 -86 -72
14672 -72 -43 -32 -49 -22 -47 -21 -82 -35 -74 -88 -61 -66 -40 8 32 -30 -44 -13 16 -40 -28 -42 -32 -62 -37 -26 32 -7 -75 -15 -7 61 81 57 -1 -17
14655 -17 25 49 13 -77 -51 -57 -13 -4 -28 -129 -76 -55 -30 2 -63 -60 -82 -56 -47 -36 -37 -9 16 -35 -33 -110 -121 -112 -55 -16 -22 -23 -32 -54 -37 -49 -31 -36 -37 29
$$ packed form
14784A5J5q3Kk2LN3Oj0k2L9N9K2j2p8k2%J4M8j2J9n0J6J6J6qj6r4P3K5n0K3k4Ok0K1orPL1
14766ir0K4N8M2k6NRql5m5k2J5Q9k2Jk7kj3oN2j5kl8k5k6Q1O4O3j27n3J6k9K3L1j2k1nj6M4
14747e7L5%PJ8kJ0K7pm7j4L9n1K4R7o2k7L9m4j9j2k6QM9j3J3j5n3K1L9qk1M8m2k2pqO9p7k1
14729a12R1nj8L4OL3M8n8m9j6k3j6M2j6M3l5m6J9K1M7o2K7K1mL0Nk5j5J4j9QOl6N2qj2m0L3
14711c5N3J0nl5k3KrJ8J2l3J6k5l0O0j1J1orpNRk8no0P6rn6Rl9O1Q4J5j9k2lO5k5k6k9j9L
14691e9M7KKj1k3K7m0l1K3K2JKL7KK1k4j7m5K5prJ5J5J7l0l3N2J6k6L0K2n3m1k0L0n6jL2J4
14672g2K9J1j7K7k5K6o1M7l9j4K7nK6M8K4o2j4L1K9n6J2j4J0l0K5J1N8l9o8O0QO8K0k4n8j6
14655a7M2K4l6r0K6oM4Rk4j01N3K1K5L2o5Lk2K6RJ1jK8K5n1Kp7j1RN7L9ojrk2J7j2J8njO6
$$ plain form
14636 29 -10 -67 -44 -80 9 53 62 -19 -56 39 17 -33 -21 -27 -55 -82 -29 5 9 -30 -7 5 -50 -35 -59 -8 -52 -7 9 -2 29 -42 -50 -41 -62 -49 -16
14619 -16 12 8 -28 -64 -42 -45 -93 -128 -103 -101 -81 -72 -62 -35 -37 -100 -63 -99 -122 -80 -100 -72 -64 -64 -46 -79 -22 -21 -38 -20 -18 -42 -92 -103 -74 -50 -58 -28 -43 -63
14599 -63 -3 48 31 21 21 -3 22 34 2 48 13 2 71 77 40 10 -30 -12 -51 -20 -6 -10 -40 24 -44 -121 -70 -21 -43 -72 -50 -19 -24 -62 -59 -78 -5
14582 -5 24 4 2 -36 -35 19 71 14 -37 -66 -61 -26 -73 -73 -35 -57 -57 -14 -44 -11 -25 -50 -92 13 14 6 0 -40 -40 -13 34 -10 6 64 9 7 -23 15 -21 -64
14563 -64 -51 -34 -37 -7 -25 -47 -70 -93 -78 -99 -35 -74 -8 26 -38 -43 -3 -12 3 1 -29 -46 -52 -17 -19 -58 -54 -16 -73 -121 -107 -52 -54 48 32 6 -16 0
14545 0 -62 5 46 -21 -16 33 0 11 -20 -75 -74 -48 -45 -36 -43 -67 -48 -72 -6 -66 -62 -35 -47 -60 -50 5 -19 10 1 -22 1 -27 -32 8 -11 -66 -123 -75 29
14526 29 -26 -75 -44 -57 -103 -63 -9 -38 -89 -71 -88 -121 -70 -59 -62 -39 -44 47 10 35 9 -86 -30 14 2 -49 -19 -33 -20 -18 37 72 70 19 31 39 34 46
14508 46 -32 -6 -47 -96 -25 -1 -7 -22 5 -7 46 108 -47 -87 -60 -68 -77 -16 -21 -82 -47 -49 -45 -9 -16 -40 -85 -9 73 7 -47 25 -2 65 17 -53 -57 -40
$$ packed form
14636B9l9n7K3l6Q9M4Rq1l7R5k2n0J2ok8k7N3L4Ml9K3J2n5J5k4N1m4M5J6j1L1p1qRk1J3L3
14619a6K8ml6l6K2lm8l5K5KK0RJ0K7ko3L7l6k3M2k0K8Q%J8l3N7Jj7J8Kk4n0j1K9K4qL0j5k0
14599f3O0N1j7j0%k4K5J2l2M6l5j1O9Ol7l0m0J8l9L1J4ml0O4o8p7N1M9k2k9K2L1nl8Lj9P3
14582eK9k0kl8JN4N2n7n1k9NL5m7%L8k2%M3l0L3j4k5m2J05Jqom0%K7M7m4J6N8n5kl0L8l6m3
14563f4J3J7lL0j8k2k3k3J5k1O4l9O6L4o4nM0rJ5kl0j7oL5kl9ML8n7m8J4N5kJ02j6k6k2J6
14545@o2O7M1o7NM9l3J1l1n5JK6LRpk4J9k4O6o0MK7j2j3J0N5k4K9rk3K3k8nM0j9n5n7M8J04
14526B9n5m9L1j3m6M0N4k9n1J8j7l3N1J1lK3nR1l7K5k6r5N6M4j2n1L0j4J3KN5L5kn1J2QnJ2
14508D6p8K6m1m9P1K4oj5K7j2N3O2j55m0K7qrO1no1L5kML6pk4m5P6Q2o6n4P2k7O7m8p0mJ7
$$ plain form
14490 -40 1 -37 -21 -21 -57 -53 -69 -55 -53 -14 25 3 20 31 56 23 17 20 21 26 -10 -8 -48 7 -1 -24 29 -3 -16 -46 -70 -87 -42 -30 -55 -61 -45 -46 -79 -67
14471 -67 -107 -147 -91 -48 13 -7 -7 -69 9 34 5 -3 61 15 -62 -69 -101 -84 -113 -90 -43 -80 -77 -8 21 20 4 4 17 26 -87 -37 -26 -68 -24 23 -8 0
14453 0 -3 16 22 -106 -97 -104 -64 -50 -24 -30 -46 -44 -33 -8 40 20 -3 -23 -55 -95 -51 -28 -19 -51 -18 -22 -12 -25 20 -3 -7 -33 -46 -55 -48 -107 -116 -111 -109 -50 -37 3
14433 3 5 -26 -51 -64 -72 -5 -13 -12 -7 -4 -15 -128 -119 -148 -126 -48 -39 -43 -85 -10 0 -41 -26 -17 -71 -100 -52 -32 -4 11 -28 -11 72 70 10 -20 -38 -23 2 2 14
14413 14 7 -46 -64 -99 -11 33 -17 -88 -94 -58 -45 2 -35 -41 5 -1 0 -48 -28 -68 -36 -20 -14 -6 -22 -12 -106 -142 -121 -51 15 -10 -12 -35 15 13 -7 -14 18 16
14394 16 -20 26 23 -14 -21 55 38 -1 -36 -77 -41 -13 -43 -6 6 -9 -7 -60 41 3 -46 -82 -75 -100 -37 -75 -43 13 -15 -8 -48 -84 -127 -91 -17 -41 -52
14376 -52 0 -40 -12 -61 -56 50 73 19 -8 -89 -98 -63 -79 -81 -32 -56 -26 -29 -16 5 -44 -39 -29 -42 -81 -42 -34 -13 -65 -12 -45 -57 -63 12 16 -9 -27 -55
14358 -55 -45 10 -35 -30 -14 -56 -83 -41 -18 -85 -81 -125 -44 -33 -22 -43 -50 -10 -23 -57 -24 14 18 -52 -65 -61 -47 7 -49 -43 44 54 -9 -32 -69 -53 -17 1
$$ packed form
14490d0M1l8J6%l6Mj6J4KL9L9k2J7J1K5l3oLJNl6Km0N5qk3N3l2j3l0k4j7M5J2k5oJ6jl3J2
14471f7m0m0N6M3O1k0%o2P8K5k9qO4m6p7pl2J7k9K3M7l7LO9K9jj6%J3Rj13N0J1m2M4M7l1Q
14453@lJ9Oj28RpM0J4K6oj6KJ1K5M8k0k3k0l2m0M4K3Rl2L3mJ0j3M5k3mk6j3rPn9rNKN9J3M0
14433CKl1k5j3qO7qJNLj1j13Rk9K2P8Rmm2P5J0m1J5Rn4k9M8K0K8J5l9J7Q3ko0l0j8J5K5%J2
14413A4pn3j8l5Q8M4n0p1oL6J3M7l7oM6oJm8K0m0L2J6OQj6J0r4l6K1P0O6k5kk3N0kk0pL2k
14394A6l6M6ll7pP6j7l9l5m1L6K8l0L7J2j5Kn3J01l8m9l6Pk5O3l8L2N6k8Pm0l6m3L6P4k4j1
14376e2N2m0K8m9NJ06K3n4k7q1rL5j6kM9k4L0lJ3K1m9NJ0j3l9L9QK1n2N3l3j2oP5Mk5j8k8
14358e5J0N5m5NJ6m2k7M2K3o7Mm4Q1J1J1k1pM0j3l4L3L8Mp0j3MJ4N4n6OQ7J0o3k3l7J6L6J8
$$ plain form
14340 1 -58 -71 -60 -50 -26 34 8 15 -56 -38 -91 -77 -64 -38 -51 -97 -135 -84 -12 -3 -38 -10 10 -12 11 -53 -56 -14 -59 23 34 15 -43 -21 -17 -29 -9
14322 -9 -32 -86 -56 -29 -22 -23 37 -48 -70 -80 -59 -69 -39 -26 -20 -41 -56 -45 -114 -93 -115 -76 -79 -75 -58 -82 -94 -55 9 -41 -40 -51 -49 -55 -78 -59 -27 26 9
14304 9 -28 -36 -6 0 -35 -69 -71 4 -16 0 -28 -18 -62 -46 -6 -61 -86 -72 -44 -46 -28 -24 -19 14 18 -8 13 13 8 39 51 -44 -48 -60 -59 -78 -63 -24 -20 -110 -89
14284 -89 -80 -70 -33 -37 -29 -65 -27 -68 -116 -76 -34 -71 -111 -43 -41 -54 -12 5 41 -24 -56 -69 -35 -21 24 -57 -109 -31 8 -32 -17 -16 -32 -56 -135 -75 -46
14267 -46 -52 -66 -52 -28 -29 22 -17 20 51 19 -17 -27 15 -1 -12 6 -4 16 -10 37 29 46 17 3 -39 -79 -64 -54 -71 -57 -17 -15 -14 -72 -40 -45 -14 -32
14249 -32 11 -25 -43 32 26 -7 -63 33 18 -112 -110 -73 -30 -32 -25 -19 -57 -34 -50 -68 -41 -55 -29 -46 -9 -51 -58 7 -9 -51 -41 -22 -24 47 55 22 -41 -63
14230 -63 -36 20 4 -4 -11 -48 -46 -19 -75 -108 -75 -7 -25 72 53 -2 -81 -18 -57 -59 -28 48 -9 -79 -75 -67 -25 3 -53 -41 -42 -7 -68 -113 -57 5 -30 -81
14212 -81 -70 -58 -20 12 -25 31 26 -63 -41 -54 -33 -44 -22 -17 -19 -17 10 -28 -7 16 14 -13 -27 -35 -42 -115 -69 -76 -23 -37 24 -11 -66 -63 -84 -111 -103 -111 -57 -60 -52
$$ packed form
14340An9j3J1J0K4O0k6Pp1J8n3J4J3K6j3m6l8N1P2Rl5K8K0k2K3o4lM2m5Q2J1j9n8K2Mj2K0
14322ik3n4L0K7PjO0q5k2j0K1j0L0J3Ok1j5J1o9K1k2L9lMJ7k4j2L9O4n0Jj1Kok3J9L2N3j7
14304Il7qL0Ol5l4kP5k0J6k8J0m4J6M0n5k5J4K8kJ8MNL3Mk6K1%nL1J2r5mj2Jj9J5L9Mr0K1
14284h9RJ0L7mQl6L8m1m8M0M2l7m0O8Kj3M2J7L6o5l2j3L4J4M5q1n2P8L9m0J5Jj6k4p9O0K9
14267d6oj4J4K4jN1l9L7L1l2l6j0M2j6j1J8j0K0k6M7qJ7k9j4m2m0J5J0j7J4M0KJn8L2nL1j8
14249c2M3l6j8P5ol3n6R6j5j30KL7M3kPOl8K3j6j8K7j4K6j7L7m2pO5j6m2J0J9kP1Ql3o3k2
14230f3K7N6j6qpl7KK7n6l3L3O8j8R7j9n5p9O3l9kL1P6n7p0MQM2K8n6J2jL5o1m5N6O2l5n1
14212h1J1J2L8L2l7N6nq9K2j3K1j1K2NkKK7l8K1K3kk7j4qpp3M6pN3j4O1l5n5Lk1k7QqN4lQ
$$ plain form
14193 -52 0 -34 -39 -31 -28 -8 14 33 -4 -58 -39 12 -29 -63 -65 -88 -49 -26 21 100 23 -31 -47 -76 -48 2 -45 -61 -93 -64 4 27 9 -51 -16 -69 -6
14175 -6 -2 -15 -10 -46 22 13 -67 -62 -16 71 38 55 16 18 -18 0 -49 -79 -41 -21 -42 -19 -35 -17 -28 -9 -22 -25 -8 -41 -53 -86 -84 -84 -23 5 -53 -67 -82
14156 -82 -67 -51 -85 -106 -42 -25 -14 -25 -27 -14 -36 -55 -110 -88 -8 -70 -78 -72 -54 -5 17 64 7 -27 -66 -43 44 30 -21 7 2 -35 12 -5 -32 47 21
14139 21 -4 -48 -55 16 27 15 11 -59 -94 -95 -85 -72 -32 37 33 -21 -76 -82 -63 -36 -54 -61 -31 -17 -18 -25 30 38 34 23 18 28 10 -5 -81 -46 -17 13 12 -37 -36
14119 -36 17 -34 -70 -59 -63 -1 -2 -23 -32 -6 6 -18 -41 -49 58 52 46 34 43 24 -42 -74 -71 -148 -113 -81 -27 -69 -88 -60 -38 -39 -82 -45 -28 -67 -56 -20 14
14101 14 38 9 10 -68 -70 -5 81 17 -34 15 46 42 40 33 6 -20 -61 -20 -7 -22 21 17 59 18 8 -17 -70 -52 -91 2 -10 -46 -84 -27 44 33 -7 4
14083 4 -30 -12 -4 -24 8 20 -20 -22 1 30 10 9 18 -50 -49 -49 -70 -79 4 1 -39 6 54 50 10 14 -42 -23 -101 -76 -52 -19 -10 -63 -34 7 48 -15 -25 31 -32
14063 -32 -71 -83 -71 -64 -43 8 31 -15 -7 -26 -21 -38 -4 -15 -30 -34 -80 -113 -136 -78 -59 -93 -58 -31 -58 -36 -40 -13 54 -32 -3 36 -13 -77 -16 -84 -38
$$ packed form
14193e2N2l4nQLK0K2J9l7n4J9N1m1l4kk3L9K3M7P9p7n4j6k9K8N0m7j6l2K9O8K3j8o0L5n3O3
14175fMj3Nl6O8rq0NM6Q7l3J7l9Kl6J8m9l0L8K0k1K3j6J8j1J9j3lJ7l3j2l3K%O1K8n8j4j5
14156h2J5J6l4k1O4J7J1j1kJ3k2j9n5K2Q0o2qOJ8M9K2M7n7l4l9K3Q7j4n1K8nl7M7j7k7P9k6
14139B1k5m4pP1J1j2mp0l5jJ0J3M0O9mn4n5oJ9K7j8pL0J4jpN5Qmj1nJ0j8j5p6L5K9L0jm9J
14119c6N3n1l6J1mO2jk1rK6J2k4k3qJ07ooj2Rj9o6l2Lp7L5L2N4m2j9K8K2jm3L7J7l9J1L6L4
14101A4K4k9Jp8kO5Q6o4n1M9L1mkpk7k6m1M1J3j5M3mM2m1j0k5n3J8l9R3j2l6l8N7P1j1m0J1
14083Dl4J8Qk0L2J2m0kK3K9k0jRo8J%k1rQ3lm0M5M8mm0Mn6J9p8K5K4L3Rn3K9M1M1o3j0N6o3
14063c2l9j2J2PK1N1K3m6Qj9Nj7L4j1j5mm6l3k3N8J9l4L5K7k7K2mK7O7q6K9L9m9o4O1o8M6
$$ plain form
14045 -38 -52 -14 -80 -40 -44 -43 -40 -17 -22 -30 10 -7 -4 48 24 4 8 -53 -124 -114 -33 -30 -76 -70 -3 22 19 54 92 56 28 61 30 33 0 -51 -87 -66 -54 -60 -36
14026 -36 -71 -128 -128 -93 -65 -60 -102 -59 -35 -38 -32 -63 -3 -1 41 8 5 -16 -24 -45 -30 39 -6 -79 -10 -33 -72 -44 -85 -94 -61 -47 -45 -53 -57 -32 17 -30 -12 70
14007 70 -14 -14 -90 -152 -114 -31 1 -9 -90 -35 -87 -108 -84 -105 -84 -58 -48 -88 -76 -71 -93 -95 -87 -27 -56 -75 -67 34 41 -2 9 -11 -26 1 -55 -74 -100
13989 -100 -97 -47 32 13 -47 -88 -81 -48 -29 -47 -34 -59 -64 -18 -55 -46 -44 -64 -13 7 -11 -35 -18 22 -45 0 -76 -117 -35 -75 -59 -93 -94 -9 20 -23 32
13971 32 1 -25 -15 -68 -94 -17 39 -6 -58 -94 -48 -6 29 18 -39 -9 -12 -19 -10 -39 -46 -27 -60 -20 2 5 50 12 -49 -14 -2 -38 -70 -74 -105 -79 -52 -58
13953 -58 9 42 2 1 -35 -42 -53 -17 24 3 5 -42 -29 -81 -84 -94 -86 -56 -58 -30 -41 -34 -14 -57 -44 -58 -26 -24 -33 -53 -23 6 -50 -72 -59 -6 -45 -76 -30
13935 -30 13 -66 -57 14 -78 -36 -43 -85 -100 -32 -39 8 39 -16 10 -31 -96 -74 25 20 -1 -1 -14 5 -7 -27 -63 -52 -43 -57 -38 -48 -94 -106 -63 -66 -33 -67
13917 -67 -135 -16 -55 -30 -11 -41 -35 -3 -29 -79 -30 9 -29 -60 -19 -51 -94 -52 8 -27 -29 -29 -65 -86 -44 -42 -36 -48 -49 -43 -67 -54 -24 -3 -39 -21 28 -2
$$ packed form
14045c8j4L8o6M0mJLK3nqM0j7LN2k4k0Mo1p1J0Q1Lm6OO7K5lL5L8l6k8L3l1Ll3n1l6K1J2oK4
14026c6l5n7%L5K8Nm2M3K4lOl1O0KM2l3lk1qk1J5O9m5p3O9k3l9K8m1rL3J4KqmK5M9m7J8Q2
14007G0q4%p6o2L8Q3L2j0q1N5n2k1K4k1K1K6J0m0J2Nk2kQO0k9j9QJ01Pm3J1k0j5K7n6j9k6
13989a00LN0P9j9o0m1PL3J9j8J3k5nM6l7RKk0N1K0j8k4J7M0o7M5p6m1Q2m0J6l4jQ5K9m3N5
13971C2l1k6J0n3k6P7N6m5n2l6M6M2L5j1n7L0lpRk9pJ9l3M0K2LM5l8o1L5J2l6l2ml1K6K7o
13953e8O7L3m0jl6pj1L6M1k1Km7J3n2lj0QL0kK8j1PK0m3J3j4L2Krk0L0K9n6k2J3N3l9l1M6
13935c0M3p9RP1r2M2pm2j5O8pM7L1n5K6m1o5K2R9nk1%j3J9j2k0l6J1Rj4J9j0m6j2M3lL3l4
13917f7o8J19l9K5J9l0OL2k6n0M9L9l8l1M1l2m3M2O0l5k%l6k1M2KOj2jOk4J3L0K1l6J8M9l0
$$ plain form
13899 -2 15 7 2 -10 40 25 -18 20 -22 -43 0 22 24 -33 -19 -14 -47 20 -68 -65 -95 -86 14 -30 -39 -41 -23 -24 -27 -68 -69 -15 -30 -49 -48 -99 -82 -63 -6 -36 -74
13879 -74 -76 -32 -10 -8 -3 -33 -43 -24 9 56 70 29 65 68 23 -33 -17 16 59 39 13 4 10 -7 -53 -24 -51 -27 -65 -10 -31 20 32 28 -6 -104 -80 -28
13861 -28 -54 -100 -39 -15 -9 -31 -84 -106 -135 -113 -73 -53 -44 -91 -93 -43 -39 -32 -30 -46 -18 -14 -9 -19 4 4 -28 3 -64 -67 -52 -34 -43 -41 25 -62 -78 -93 -106 -43 -50
13841 -50 8 -4 39 -12 13 55 67 -34 -48 -16 20 -13 -1 -43 -35 -38 -19 -167 -153 -147 -88 92 31 48 91 77 24 -47 -86 -39 -62 -46 -44 -36 -55 -35
13824 -35 -37 -52 -37 -36 -67 -45 3 -1 -11 78 22 -12 60 31 -58 -27 0 16 33 -6 -56 -32 -87 -60 -45 -29 -81 -42 -6 -51 -52 -45 -15 -46 -53 -31 10 14
13806 14 -36 -6 31 -4 -19 -18 10 2 -42 -72 -89 -59 -42 -43 -46 -32 -69 -23 -101 -84 -83 -89 -71 -158 -169 -90 -45 -63 -51 -38 -17 -9 -54 -21 -12 17 21 9 2 -3
13787 -3 41 7 34 -20 -20 60 -1 -41 -80 -29 4 -87 -83 -96 -89 -15 -13 -53 -76 -60 -89 -89 -67 -76 -10 6 -15 -23 69 49 -36 -43 -104 -104 -138 -72 -121 -108 -55 -27
13768 -27 45 26 17 8 -32 -74 -33 4 -34 -32 -36 -62 -42 -81 -92 -95 -65 -50 25 -27 -73 -108 -112 -28 12 -22 -23 -43 -57 -43 7 -22 -99 -42 -7 -101 -123 -91
$$ packed form
13899bJ7qnj2N0j5m3L8m2k1M3K2Kn7J4Nl3O7q8Ll0RJ00m4rkJ8jlm1jN4j5j9Jn1J7J9N7l0l8
13879g4kM4K2KNl0j0J9L3M7J4m1L6Lm5n6J6L3M3k0k6rOj7m6K9k7K4l8N5k1N1J2ml4r8K4N2
13861b8k6m6O1K4Ok2n3k2k9K2M0K0Rm7kN0MPKj6K8MNj0K3%l2L1o7lJ5J8rKO6q7j6j5j3O3p
13841e0N8j2M3n1K5M2J2j01j4L2L6l3J2m2QlJ9j48J4ON9J80o1J7M3j4n3p1l9M7k3J6KQj9K0
13824c5kj5J5Jl1K2M8mj0Q9n6l4P2k9q9L1K7J6J7l9n0K4n5K7J5J6n2L9L6m5jPL0l1pK2M1M
13806A4n0L0L7l5j5JK8qm4l0j7L0J7jlJ4l7M6p8J7JoJ8q7j1P9M5j8J2J3K1Qm5L3RK9Mj2pn
13787cM4l4K7n4%Q0o1m0l9N1L3r1Mj3PP4Km0k3J6k9%K2rO6J6k1qR2k0q5po1%l4O6m9J3N3K8
13768b7P2j9rrm0m2M1L7l8Kmk6K0l9j1lL0J5P5n2m6l5mQ4M0l4jk0j4J4N0k9p7N7L5r4k2L2
$$ plain form
13750 -91 -92 -61 -45 16 43 -39 -7 14 28 16 25 -1 -26 7 -12 1 63 29 3 -41 -38 -42 23 -10 4 -25 -100 -85 0 -18 3 30 -11 20 -48 -28 -64
13732 -64 -16 2 -2 -65 -37 -14 -4 -45 -62 -23 -80 -53 -54 -6 -21 -20 -32 -41 -74 -32 -26 -21 -34 -1 -47 -76 -65 -14 -28 -61 -83 -106 -39 -7 7 -27 -56 -9
13714 -9 -15 -60 -67 5 -50 -43 -42 -14 -2 -49 -37 -8 -36 -70 -13 -19 -55 -86 -78 -47 -68 -76 -53 -19 -34 -17 -92 -55 -29 -14 -16 2 -65 -42 -15 -54 -51 -88 -49 -13
13695 -13 -51 -64 -8 54 27 12 -54 -43 -35 -25 -38 -39 -9 -111 -114 -100 -66 -69 -40 -53 -35 -45 -63 -57 -15 -26 -47 19 61 -57 -54 -48 -16 -27 20 -42 7
13677 7 11 -32 -13 -29 36 -5 -36 -80 33 77 -2 -80 -71 -34 -79 -44 -85 -26 -29 -43 -41 -105 -91 -72 -81 -61 -34 -31 7 18 21 10 -24 -17 -60 -52 -15 -61 -109
13659 -109 -51 -39 -83 -131 -53 -61 -41 16 4 -23 -41 -40 -2 -11 -73 -27 -18 42 -27 -75 -84 -30 -59 -62 -86 -53 -41 -20 -42 -47 -81 -79 -25 16 -39 -31 -24 -40 -99
13640 -99 -26 -79 -64 -81 -77 -62 -14 -24 33 55 50 30 -13 -37 -41 -38 10 -7 12 26 -63 -26 -24 -58 -72 -33 -8 -46 -8 7 21 -30 -17 -3 9 28 27 -34
13622 -34 8 -18 -64 -33 16 23 -26 -34 -86 -20 -11 -46 -34 -101 -97 -86 -74 -86 -51 -67 -57 -12 -38 -36 -114 -95 -9 47 11 -37 2 4 48 43 -11 -69 -82 -74 -4
$$ packed form
13750i1jL1J6O1K7q2L2K1J4j2Rk6k5L3j9J3O2l4k6m4LmO5l3J4k9p5J5Q5j8K1K7m1L1o8K0l6
13732f4M8J8mo3K8K3J0m1j7L9n7K7jM8j5Jj2rl3M2ONj3L3m6k9J1N1j4l3k2k3O7L2J4l4k9M7
13714iom5pP2n5PJK8J2m7J2K9k8l4N7ol6l1QL1k1qK3L4j5J7p5L7K6J5kJ8o7K3K7l9Ll7L9L6
13695a3l8j3N6O2k7j5o6J1QJ0j3jL0j02lJ4L4lK9j3J8j0j8OM2j1k1O6M2j18LOL2j1M7o2M9
13677GMm3J9j6O5m1l1m4J13M4p9p8RL7m5L5m1N9lj4Ko4J4J9rK0K7LL8J1Lj1l4Pm3QL7m6m8
13659a09N8J2m4m8P8qK0N7j2k7j8JL8ro2M6RO0o9m8rN4k9lk4L3J2K1k2nl4KN4M1n5QPj6n9
13640i9P3n3J5j7MJ5M8j0N7K2nk0m3k4mLM8j7J9J4q9L7Kl4j4L9K5l8L8J5J4n1J3J4J2J9jo1
13622c4M2k6m6L1M9Pm9qn2O6Rl5J2o7MJ1J2j2L5j6J0M5k6Kp8J9Q6N6l6m8L9KM4nn4n8j3QP0
$$ plain form
13603 -4 -4 -20 -35 -61 -50 18 -22 -77 -16 -28 -51 -85 -76 -64 -98 -75 -83 -39 -10 12 54 41 -11 -69 -51 -21 -7 -47 -60 -101 -69 -45 -3 10 -30 6 -27
13586 -27 -39 -74 -50 6 -4 -39 -2 21 -23 -30 -16 -41 -61 -47 -81 -129 -55 -61 10 -50 -53 -36 -42 -9 -45 17 26 8 52 -35 -91 -86 -67 -64 -85 -123 -27 -30 -65
13567 -65 -85 -68 -66 -62 -54 -24 -25 51 -26 -10 29 -51 -66 0 5 5 12 -45 -6 -46 -47 -71 -91 -104 -96 -63 -81 -96 -53 -63 -3 -17 -23 -14 12 0 -40 -33 -35 -16 9
13548 9 -64 -12 6 71 66 66 58 24 1 36 2 -18 -56 -23 12 -32 -1 27 -22 -46 -35 -4 44 53 24 -46 -54 -51 -49 -47 -32 -33 -32 25 -43 -74 -48 -25 -23 4 -33
13528 -33 -90 -59 -51 -18 -42 -54 -58 -59 -82 -69 -55 -16 -52 -65 -30 -7 -84 -19 46 -24 -54 -87 -44 -87 -94 -96 -124 -103 -90 -82 -134 -143 -91 -75 -36 -26 -69 -77 -79
13509 -79 -84 -50 3 -31 -9 31 -12 -61 -84 -42 -70 -16 -20 -130 -93 -58 -29 -51 -81 -69 -38 -58 -137 -89 -8 -19 -89 -53 -14 -25 -24 6 7 48 64 17
13492 17 59 37 -4 -62 -94 -30 -53 -71 -18 -20 -39 -37 -57 -7 -45 -83 -30 -13 3 -1 -21 -10 -15 -89 -125 -91 -17 -12 7 -55 -69 -23 -9 -63 -79 -13 -20 8
13474 8 -9 -20 -14 1 -4 -38 -33 34 -36 -67 -43 -76 -41 -46 -64 -9 -72 1 -2 -36 22 31 -1 2 -47 -34 12 -7 -23 -18 37 55 1 -9 0 -29 -63 -13 2 -28
$$ packed form
13603d%j6j5k6J1O8m0n5O1j2k3l4RJ2l4K3qM4K9K2M2j3n2n8J8L0J4m0j3m1L2K4M2J3m0L6l3
13586b7j2l5K4N6j0l5L7K3m4pJ4k5k0J4l4m8P4oP1o0lJ7oL3l6O2Rj8M4q7n6NJ9Lk1l8R6ll5
13567f5k0J7KMQL0jP6p7J6L9q0j5O6N%Pn7L9m0jk4k0j3QL3j8j5M3j0O0j4oRK6j2m0PkJ9K5
13548Ip3N2J8O5n%ql4k3L5l4k0l8L3L5m4L1K8m9k4J1L1M8Rk9p0qLKKJ5jJN7o8l1K6K3KK7l7
13528c3n7L1QL3k4j2mjk3J3J4L9l6j3L5K3p7O5O5p0l0l3M3m3pkk8K1J3Qn2rN2J6L9J0m3qk
13509g9nL4N3l4K2M0m3m9k3M2k8N4mj10L7L5K9k2l0J2L1k0p9M8Q1j1p0L6L9j1JL0JM1J6m7
13492A7M2k2m1n8l2O4k3j8N3kj9Kk0N0l8l8N3J7J6mk0J1np4l6L4P4NJ9o2j4M6J4n4j6O6pK8
13474Hj7j1OJ5nl4NO7p0l1K4l3L5nj8N5o3P3ll4N8Rl2Lm9J3M6j9j6NN5J8n4j0Rk9l4N0J5l0
$$ plain form
13455 -28 -1 -1 -3 -35 -44 -53 -49 -34 -7 18 14 -24 -26 -12 -46 -68 -70 -59 -13 12 -19 -93 -44 45 -45 -42 -48 -16 7 -63 -96 -64 -35 -23 -46 -32 -20 1 -13 -74
13436 -74 -64 -46 -64 -72 -56 -41 36 26 -37 -4 -11 -45 -46 -15 -5 33 -5 -69 -54 -26 -3 -16 -51 -45 39 25 59 -39 -44 -48 21 9 -35 -4 -27 -30 25 9
13418 9 -75 -92 -43 -11 10 13 -53 -29 -40 17 11 30 -1 8 -20 1 -43 -53 -78 -84 -105 -159 -91 -19 19 43 29 26 8 12 -2 -47 -63 -37 37 11 -13 -16 -39
13399 -39 -6 -47 -54 -49 -49 -5 -3 -30 -14 -53 -77 -58 -31 -76 -94 -22 -14 -1 -57 -73 -69 -55 -44 8 -8 16 -15 8 -19 -99 -56 -89 -59 -15 31 -90 -14
13382 -14 31 47 -18 -9 -34 -108 -87 -27 -60 -2 5 14 -22 4 13 11 5 -16 14 64 -14 -80 -40 -42 -12 -42 -41 -9 -37 -64 -49 -13 -30 -87 -67 -32 -40 -4 -5 7
13363 7 -30 -46 -76 -32 -46 -72 -69 -62 -23 -26 -31 -4 -57 -57 -84 -48 -26 41 4 -50 -66 -76 -88 -74 -53 -38 24 14 -58 -7 17 -31 -4 -30 -3 -59 -88 -85
13344 -85 -29 28 32 -17 -53 -26 21 12 -36 -106 -56 -9 -51 53 -8 -88 -73 -48 -36 20 8 52 -4 -70 -29 -22 -29 -36 -66 -74 -6 -61 -49 -21 -17 -11 26 11
13326 11 -86 -69 -18 -32 -2 0 -9 32 51 -9 -33 -8 -2 10 22 -8 0 46 21 49 7 -77 -126 -65 -10 -39 -58 -82 -22 -18 -40 -10 10 -25 -52 -10 4
$$ packed form
13455b8K7%kl2rrMJ5K7K5ml8kJ4l4k2kJ1M6K5l1p4M9Q9r0LoL2K3p0l3L2K9J2k3J4J2K1j4o1
13436g4J0J8j8qJ6J5P7j0o3L3pl4jL1J0L8l8o4J5K8K3j3l5OQ4j4L4r8nmO9j2m4L1k3lN5j6
13418Iq4j7M9L2K1Lo6K4j1N7oJ9l1Rk8K1m4j0k5ok1n4O8P2L8K4j4lj8Mj4m5j6K6P4k6k4lk3
13399c9L3m1pN%M4Kk7J6l9k4J9K7m5j8P2QJ3n6j6MJ4J1N2j6K4l1K3k7q0M3l3L0M4M6j21P6
13382a4M5J6o5Rk5p4K1O0l3N8PRl6K6Rkok1L0N0p8o6M0kL0l0JL2k8k7J5L6j7n7K0L5qL6jJ2
13363Gl7j6l0M4j4k6LPL9lnK7n3%k7L6K2O7l7n4j6j0j2J4K1J5O2j0p2N1K4m8K7k6K7n6k9L
13344h5N6N7Mm9l6K7M7rm8p0N0M7m2J04o1q0J5K5J2N6j2M4n6o6M1Pppl0qO8n5J2K8MOL7j5
13326A1r7J7N1j4L0KrM1J9o0k4K5OJ2J2l0QM6k5K8m2q4m9O1N5k9j9k4O0Mk2L0K0l5k7M2J4
$$ plain form
13309 4 -62 -76 -51 -93 -131 -125 -146 -49 -12 -44 -57 -4 -5 -34 19 3 10 -47 5 14 -54 -58 -21 -41 -92 -90 -56 1 2 0 39 -37 -28 -64 -43 -55 -38 -23 -68 -69
13290 -69 -34 -38 39 8 -23 -51 -47 27 -15 -29 -28 -25 29 2 43 35 48 -14 -53 -15 8 -23 -25 -38 15 39 16 9 -36 15 5 -76 -96 -85 -90 -77 2 1 1 -43
13271 -43 -3 25 -14 -13 -64 -131 -74 -11 16 -70 -118 -87 -110 -44 -49 -62 -75 -35 13 25 56 10 25 10 -13 5 -41 -39 -46 -58 52 34 -38 -15 -13 45 43
13253 43 -16 -14 19 55 -3 -40 -52 -25 26 11 -32 -15 11 -20 -48 -33 -16 -15 8 4 47 -2 -64 -35 11 46 -6 -21 24 41 0 -14 -33 -18 -19 -33 -23
13235 -23 -63 -75 -35 -24 -5 -8 25 47 15 0 17 -60 -43 -52 -56 -33 -55 -88 -74 -49 -20 4 4 -17 -27 -39 -63 -47 39 -13 -20 -65 -21 -65 -85 -91 -30 -23
13217 -23 12 -13 24 9 17 -10 -53 -16 18 55 25 19 54 67 22 21 24 -40 -75 -72 -11 8 -14 37 -40 -74 -72 2 -1 -32 -62 -76 -9 -13 18 18 -92 -72 -6
13199 -6 -37 -20 -25 0 15 -23 -71 -6 50 -14 -15 -26 11 -44 -46 -11 -63 -79 -56 -33 -97 -76 -43 -46 -76 -27 -6 -20 34 1 -73 -62 15 19 -6 -28 -33 -2
13180 -2 21 11 -70 -74 -51 -45 -58 -57 -23 58 47 -2 -29 -18 -90 -33 -14 -41 -30 -17 25 6 12 32 70 22 11 -2 -4 0 -30 -43 2 -35 -68 -23 -12 -47
$$ packed form
13309Do6j4K5m2l8Ok1R7L7l2j3N3jk9N3j6Pn7N2Ro8mL7k0n1KL4N7JkL9p6Rl6K1j2J7J5m5j
13290f9L5mP7l1l1k8MP4m2j4JLN4k7M1qJ3o2l9L8K3l1kj3N3K4k3pm5N1j0q1k0J1nJ3P9j%m4
13271d3M0K8l9Jn1o7N7O3K7q6m8L1k3O6nj3j3M0M8J2L1m6J5j5k3J8m6Kpj2J10j8p2K3KN8k
13253D3n9KL3L6n8l7j2K7N1j5m3J7K6l1k8J5J7JK3mM3m9o2K9M6L5n2j5M5J7m1j4j9J5jj4J0
13235b3m0j2M0J1J9lL3K2l2j5J7p7J7rmK3k2l3J4K5K9K4%k1j0j2k4J6Q6n2pm5M4m4k0oO1P
13217b3L5k5L7j5Qk7m3L7L4L7l0oL5J3m5jLo4l5LO1J9k2N1p7l4KP4ll1l0j4O7mL1%j10K0O6
13199fl1J7nK5J5l8m8O5N6o4jj1L7n5kL5n2j6K3K3o4K1L3ll0M9K1j4N4l3p4J1P7Mk5k2nL1
13180bK3j0q1mK3Oj3JL4Q1j1m9k7J1p2N7J9k7J1J3M2j9OK0L8m8j1j3kMl0j3M5l7l3M5J1l5
$$ plain form
13162 -47 -5 11 27 -25 5 -63 -124 -67 -101 -135 -148 -62 -69 -61 -9 52 4 -40 -40 -9 54 23 -11 -78 -82 -62 -86 -43 -20 -7 -51 -64 -51 -51 -37 -29 -42 -27
13144 -27 -6 -18 -9 -43 -30 -34 -36 -31 -38 -35 -32 -80 -51 -61 -62 -60 -18 35 30 0 25 4 -13 -75 -75 14 32 22 20 19 -29 11 40 38 -58 -40 -26 -91 -117 -104 -112 -58
13124 -58 -46 -89 -109 -33 5 -51 -46 26 -28 -9 -47 -74 -88 -13 21 -32 -12 9 28 12 54 30 -35 -22 -25 -53 -78 -39 -33 -40 -13 -46 -16 -16 -28 -42 -67
13106 -67 -119 -87 -59 -31 -81 -114 -22 48 -15 -14 -18 -57 -111 -76 -82 -127 -84 -101 -65 -26 -49 -53 0 -49 10 -12 -18 41 54 40 -3 -32 41 21 -37 -69 -41
13089 -41 -45 -80 -42 -53 4 -29 -7 26 22 34 4 12 4 3 -22 -39 -21 -43 -51 -53 -94 -55 -51 -32 -61 -55 -60 -55 -96 3 -7 -34 -22 -44 -1 22 5 37 -28 -59
13070 -59 -14 -8 39 41 -27 -64 -3 1 18 15 -9 -34 -46 26 10 18 -14 25 -19 -107 -69 -89 -52 -7 35 29 59 32 -17 3 -1 -47 3 8 -24 -27 -45 -49 -43 -51 -28
13050 -28 -15 14 32 -37 -68 -44 -10 -77 -118 -73 -45 21 39 -62 -36 -63 -7 12 8 3 -56 -28 -49 -80 -33 -28 -45 -30 -20 -21 -33 -41 -22 21 -4 45 84
13033 84 29 -46 -72 -79 -48 7 41 27 3 -35 -19 -49 -38 -14 -9 -2 -17 -44 -40 25 37 -60 -103 -82 -46 11 53 33 4 -17 -2 -60 -20 -40 -23 -26 -47
$$ packed form
13162d7M2J6J6n2L0o8o1N7l4l4j3Q6pQN2O1m8m4%L1O3l1l4o7mK0k4M3K3J3m4j3J3%J4Qj3J5
13144b7K1j2Rl4J3mkNpLLm8K9j0jKM2N3nl0K5k1j7o2%Q9J8j0kjm8M0K9kr6J8J4o5k6J3qN4
13124e8J2m3k0P6L8n6NP2n4J9l8k7j4P5L4n3K0K1J9j6M2k4o5J3lk8k5L9OpK7l3L0%j2j4k5
13106f7n2L2K8K8n0l3R2P0o3Jml9n4L5om5M3j7L6L9k3mN3m9N9k2oN9J3j4m3k9P3k0n8l2K8
13089d1ml5L8j1N7l3K2L3mJ2l0Qqjk5j7J8k2qkm1L9MJ9k9OnNm1R9j0k7J2k2M3K3j7L2o5l1
13070e9M5OM7Ko8l7O1MJ7lk4k5j2P2j6Ql2L9m4q8L8k0L7M5M2oL0k7m9K0mm6N0Nl2lj8mOqK3
13050b8J3K9J8o9l1K4L4o7m1M5K8O6J8j01K6k7N6J9mnn9K8k1l1M7Nj7J5J0jj2qJ9M3k5M9L9
13033H4n5p5k6pL1N5L4j4k4l8J6l0J1K4NPj5k7MO5J2r7m3K1L6N7M2k0k9k1J5n8M0k0J7lk1
$$ plain form
13015 -47 -12 -9 -46 -43 -12 -18 -30 -58 -73 34 -40 -42 -28 -54 -31 -54 -43 -47 -42 -50 -44 -17 -44 -36 -27 -44 -92 -68 -10 -7 17 -129 -157 -144 -83 -3 30 -70 -40
12996 -40 -38 14 22 18 14 12 -7 26 -18 -52 -123 -124 -31 -55 -62 -29 -43 -16 -7 -36 -78 -102 -39 -31 7 2 -19 -34 -16 18 -11 -52 -14 -20 -24 -58 -103 -87 -98 -52 -37
12977 -37 -32 -54 23 -28 -38 -31 -11 -24 -42 -25 -29 9 -6 2 -5 -39 -66 -38 -55 -27 -18 19 34 7 2 -25 38 -13 -94 -78 -57 -51 -112 -40 -21 -66 -58 -98 -50
12958 -50 -72 -125 -95 -33 11 -10 -27 -28 -38 -83 -2 14 -48 -97 -140 -82 13 -8 -47 -60 -47 -12 -50 -37 -12 -11 7 11 -48 -86 -83 -66 -80 -67 1 53 43
12941 43 -9 -5 -58 28 22 -28 -64 -81 -22 -65 3 -33 -6 -53 -56 -27 -31 -20 -49 -39 -11 -10 -10 -52 -89 -18 12 -22 -31 -14 -31 -11 31 8 31 17 52 5
12922 5 -49 -33 -98 -88 -77 -83 -40 -49 -83 -120 -127 -104 -128 -105 -80 -78 -85 -81 -42 -120 -101 -84 -112 -48 -25 -4 -45 -37 -42 -105 -95 -52 -78 -57 -34 -21 -13 -49 -73 -70
12903 -70 -69 -47 -16 -25 3 -41 -62 -41 -1 4 -25 -41 -75 -7 28 -28 -38 -34 9 -4 -43 -57 -127 -105 6 -7 2 -55 19 -67 -113 -86 -40 -4 -60 -99 -101
12886 -101 -80 -28 -64 -40 0 17 -45 -82 -83 -69 9 -93 -66 -36 -21 -10 33 105 36 13 -4 -55 -8 -54 -83 -48 27 -1 -46 -30 -58 -1 -8 5 -12
$$ packed form
13015d7L5Ll7LL1oj2k8j5J07p4kJ4k6K3k3J1mNqOK7k7QRj7m8K4N8LK4j46k8J3O1Q0L3j00L0
12996d0KN2Qmmkj9L3m4l4p1jR3k4pL3j4K7Rk9m2k4O3QL8nk1j5J8L4k9m1L8oml4m5J6j1M6J5
12977c7Nk2P7n1j0PK0j3j8J7mL8j5Qpl4k7K8j7K8RL7J5k7nk7O3n1q1J6K1Oo1P2J9m5Qm0M8
12958e0k2n3L0O2M4k1j7jj0m5Q1J6o2m9m3N8R5k1l9j3J3L5l8J3K5JJ8Mn9l8LJ7j4J3O8N2j0
12941D3n2Mn3Q6on0l6j7N9m3O8l6K7m7lK9mJ1k9J0K8J%m2l7P1L0l4rJ7j7K0M2k3K3j4L5m7
12922En4J6o5J0J1oM3rl4l7pK3k4K3K5KpML9p8J9J7k8O4K3K1m1Qno3J0M3k6K1K3J3Ql6k4L
12903g0JK2L1rK8m4k1K1M0Nk9j6l4O8L5n6j0MM3j3l9j4p0K2J11j3Rn7P4q6m6K7M6L6n6l9k
12886a01K1N2l6K4M0J7o2l7jJ4P8j02K7L0J5J1M3P2o9k3j7n1M7m6k9L5P5k8m5J6k8N7pJ3j7
$$ plain form
12869 -12 -53 -7 -39 -59 46 18 -17 -25 -40 -40 -33 -62 -94 -62 -56 -83 -136 -122 -56 -46 20 10 -5 -4 6 4 29 -39 -40 -14 -37 -8 -22 78 45 5 -10
12851 -10 -50 -105 -15 44 2 -26 -42 -55 -61 29 66 -38 -66 1 -36 -43 -32 -49 -39 -24 47 62 31 17 -2 -27 -20 -62 -29 -26 -55 -68 -29 -10 -8 -5 -43
12834 -43 -52 5 -17 -22 32 15 106 5 -57 -15 -44 -84 -37 6 -2 -17 -20 40 7 -55 -26 46 -8 -29 -16 -58 -17 -35 -30 -40 12 -32 -34 -21 20 -59 -64 -74
12816 -74 -65 -88 -95 -141 -90 -95 -113 -57 -44 -1 14 -83 -112 -93 -85 -37 -82 -20 10 44 7 20 -44 -42 -59 -28 -18 6 2 13 36 -14 -42 -62 -38 -131 -81 -63
12798 -63 -97 -71 -70 -41 -20 -27 18 21 -20 -74 -55 -30 -22 -21 -36 -47 -54 -79 -72 -66 -4 43 -31 -25 -72 -35 0 -82 -118 -57 -70 -42 -12 -18 -57 -24 -51 -72 -52 -44
12778 -44 -71 -29 23 12 4 -18 -57 -8 -43 -49 5 20 11 -37 -42 -88 -70 -62 -30 -1 -15 21 38 -8 -67 -16 42 49 43 -31 -23 54 16 -52 -62 -79 -98 -79 -32
12760 -32 -47 -35 -34 -22 -47 11 -41 -71 -100 -50 -53 -58 -65 -12 4 16 -41 -61 -31 -76 -86 -77 -55 3 6 26 -32 -38 34 49 18 47 7 -11 40 -19 -51 -36
12742 -36 -37 -43 -9 -6 -33 -40 22 -5 -36 -9 -26 37 49 81 52 17 -45 -107 -79 -41 12 -59 -34 -11 -52 -57 -2 10 -22 -30 -37 -5 -3 -25 -70 -76 -54 -71 -81
$$ packed form
12869a2m1M6l2k0J05k8l5qj5%Pk9l2L2Ok7n3J4O6J0O6j0j5JJ0kK5o8jK6k3K9j4J00l3m0j5
12851a0m0n5R0N9m2k8j6j3oR0L7j04k8O7l7pJ1j7J0J5P1J5l1j4j9k5Pm2L3Lk9j3L9J9KLl8
12834d3rN7k2nN4j7R1j01o2M2k9m0M7M3qj5lO0l3o2K9P2n4k1J3m2M1j8Nj0N2m4kJ3M1p9nj0
12816g4Rk3pm6N1nj8N6J3M3J5r7k9J9QM8m5O2L0L4l7J3o4Kj7L1J0K4mJ1K3n0k8k0K4r3N0J8
12798f3l4K6JK9K1pM5Lm1n4J9K5QJj5j1pk5POO2M7p4Om7L7L5q2l6O1j3K8L0ol9L3k7k1K0Q
12778d4k7M2N2j1qk2l9M9l5oN4J5rm8nm6J8QL2K9j4L6J7m6n9N1N8Pop4QP7l8o8j0j7j9J9M7
12760c2j5J2JJ2k5N8n2l0k9N0lnpN3J6J2n7k0L0m5j0RK2N8LK0n8oP2J5l1K9m0j8N1n9l2J5
12742c6joL4Lk7pO2k7l1K7j7O3J2L2k9l5o2o2K8L8N3p1K5K3m1nN5J2l2qpL2Kk2m5oK2j7j0
$$ plain form
12723 -81 -106 -109 -58 8 51 32 -54 -11 -4 -17 -20 -45 -43 -47 6 -28 -48 -100 -62 -88 -89 -118 -61 -32 -49 -50 -43 -3 -31 -113 -48 -21 12 22 26 4 6 -11 -55 -55
12704 -55 -77 -60 -46 -28 -59 -3 0 -49 -31 -23 -86 -16 -33 -24 -53 -62 -76 -58 1 -33 -63 -12 -1 -84 -127 -134 -100 -121 -125 -102 -64 -59 1 -31 -6 -35 -17 -36
12686 -36 -24 -43 -74 -56 -23 -50 -112 -32 -69 -81 -88 -121 -65 -71 -63 -47 -23 -84 -73 5 -10 -49 -82 -60 -56 -63 -35 -73 -56 -31 -1 7 9 -39 -55 2 20 12 67
12667 67 46 1 -36 7 27 -61 -54 8 16 -44 -49 -28 -27 -39 11 39 -59 -80 -43 -77 -94 -5 -7 -9 -8 -45 -41 -34 -4 -33 -56 -37 19 59 -36 -39 -43 -18 -64 -16
12648 -16 -23 -84 -96 -83 -34 -29 -48 -62 -49 -83 -33 7 28 56 42 -65 -26 -62 -47 -94 -89 -59 -46 -51 -2 -9 -56 -111 -59 -24 -18 -71 -36 -41 -45 -16 -56 -75
12630 -75 -35 -102 -56 -29 -37 14 8 10 -18 -49 -33 -16 -71 -24 38 -27 -67 -67 -70 -68 -18 -28 -92 -11 20 3 -16 -32 -39 -105 -15 -8 -57 -61 -14 16 -30 35 79
12612 79 7 -42 -20 -55 -67 -96 -102 -172 -129 -60 -52 -3 34 -4 -25 -30 -13 -12 -7 -4 32 40 -10 -48 -47 -74 -53 -39 -52 -27 22 17 -32 -7 20 8 39 -52 -92
12593 -92 -11 -66 -65 -29 -47 -34 -79 -81 -43 -24 25 -18 -31 7 -11 -51 -48 -74 -129 -107 -40 25 24 -31 -65 -50 -59 -46 -53 -44 -48 -40 -70 -62 -15 10 18 -1 -25 -87
$$ packed form
12723h1k5lN1O6M3j9q6M3Pj3lk5KmN3l4k0n2L8k6jk9N7K9j7jPM0k8q2O5K7L3J0Mk2Kj7m4%
12704e5k2J7J4J8l1N6Lm9J8Qo3P0j7Rk9rj4J8N9l4l0N1J1q3m3pL4k1mK3L8NO0l2K5k9J8j9
12686c6J2j9l1J8L3k7o2Q0l7j2pl3N6oQJ6K4o1J1P8j5l9l3K2MpK8l8J7K5L0QKm8j6N7J8qN5
12667F7k1m5l7M3K0q8PO2Qo0nK1Jj2N0K8r8k1L7l4j7Q9kkJl7MPL0k9k3J9N6M0r5lmK5m6M8
12648a6po1j2J3M9Nj9j4J3l4N0M0K1K8j4j07L9l6J5m7NL0J3nM9pm7n5N2L5On3L5nmK9m0j9
12630g5M0o7M6K7qN1oKk8l1J6J7n5M7O2o5m0%lKN0j0o4Q1L1j7j9j6po6R0Pm9mM7L0m6O5M4
12612G9p2m9K2l5j2k9op0M3O9QM9L7l8k1nJ7JNLL6Qn0l8Jk7K1J4j3K5M9nm9K5K7j2L1r1m0
12593i2Q1n5JL6j8J3m5kL8J9M9m3j3L8j8m0Lk6n5K2O7O5jn5l4J5rJ3pRmQl0QM7K5Qj9k4o2
$$ plain form
12574 -87 -65 -90 -50 -38 -101 -72 -78 -44 -54 -59 -44 -29 -18 -39 -36 -6 -35 -24 -19 -31 1 -45 -61 -70 -100 -115 -77 -24 -69 -96 -29 21 10 -36 -63 -84 -43
12556 -43 -20 11 -20 26 65 50 -3 -35 -38 -48 -48 -64 -46 24 -21 -24 -8 -50 -30 -63 -27 2 -13 -18 -19 -50 -1 -25 -24 -25 -41 -79 -41 3 -18 -57 -95 -39
12538 -39 -48 -7 -14 -5 1 -21 -47 -14 11 -33 40 2 -26 -22 -17 -63 -49 -27 -25 -30 -36 -48 -58 -36 60 3 0 -9 18 -54 -87 -76 -33 5 1 0 -80 -45 -7 -11 6 -21
12518 -21 -56 -12 47 35 12 5 -5 -79 -40 -23 8 14 20 -51 -81 -30 -12 -17 12 -13 -46 -64 -92 -22 -53 -96 -24 17 7 -23 -60 -34 -30 -6 29 -5 27
12500 27 15 -23 35 31 -52 -24 10 -67 -77 -45 -46 -59 3 -7 -26 -93 -26 -36 0 -11 -42 -39 -5 2 48 28 -43 -24 8 -2 -2 -37 -73 -28 23 -19 -69
12483 -69 -26 -54 -31 14 20 8 -62 -64 -54 -87 -66 -52 -67 -34 -30 -36 -81 -111 -38 -63 -24 -24 -20 -60 -76 -81 -58 31 -72 -110 -18 -31 -39 -40 -59 -104 -81 -72 -49
12464 -49 -32 -90 -56 -2 -19 -18 26 9 -54 -80 -75 -99 -60 -12 -41 -41 -31 -108 -76 -97 -50 -53 -48 -39 -17 15 -51 -47 -53 -94 -61 -13 -81 -55 -28 -28 -57 -20 -58
12446 -58 -11 31 100 60 40 -5 -57 -102 -65 -5 11 95 15 -21 -19 -30 -8 20 27 20 -62 -66 29 -29 -64 -13 34 -36 -43 -54 -23 2 51 10 -23 -56 -30
$$ packed form
12574h7K2k5M0J2o3K9oL4j0nJ5J5J1k1LL0k9J1Nj2L2m6j6rl0j5L8N3m5k7O7N0j1m6k7k1M1
12556d3K3L1l1M6L9j5n3l2lj0%j6J8P0m5lJ6m2K0l3L6K9j5njl1M9k4Jjj6l8L8M4k1l9l8N6
12538c9rM1pROk2k6L3K5m4P3l8k8MNm6J4K2Knoj2j0K2R6n7lrK7p2l3J1M3L8mjq0L5L8mJ7k7
12518b1l5M4N9j2k3pj0p4L9J7L1OOp1l0N1J8nK9k5l3j8k8P0l1m3P2M1j0l0l7K6MK4L5l4L2
12500B7j2l8N8mq3K8L4p7j0L2jj3O2j0j9o7O7j0L6j1l1LL4PM6k0p1J9L2j0%l5l6M5N1m2n0
12483f9M3k8K3M5Oj2p0kJ0l3K1J4j5L3Mom5l0P3k5L9%Mm0j6nK3Q9j03l8R2j3qjj9m5K3RK3
12464d9J7n8L4N4j7JM4j7o3k6Nk4L9M8k9%J0p7L2k1M7lNRK2L2o6Mom1L3M8o8K6K7%k9L7l8
12446e8M7M2O9m0k0m5n2m5L7O0J6Q4q0l6Kj1K2K8Ppq2mR5n8l5N1M7p0pj1L1K5M9m1l3l3K6
$$ plain form
12428 -30 -55 -61 0 24 -25 -87 -98 -41 -3 -62 -48 -76 -59 -25 5 -8 63 0 -5 -24 -54 -35 -63 -52 -72 -76 -59 -99 -76 -17 -81 -67 -86 -41 -37 -60 -91
12410 -91 -98 -76 -46 14 26 -66 -41 -49 -24 -31 -40 11 5 23 0 -40 -13 18 3 -98 -47 5 -5 -9 -93 -84 -18 40 -46 20 32 -17 -63 -50 -31 -48 -24 -65
12392 -65 -19 -1 10 10 -16 -61 -45 -14 -13 20 8 8 -19 -25 -55 -71 -63 -47 -8 -46 -6 -13 -62 8 72 -33 -42 -40 8 5 -54 -81 -47 -31 -24 -7 -62 -69 -61 -123
12373 -123 -108 -112 -74 7 -16 -1 19 -10 -47 -73 -57 -18 55 -27 52 31 15 0 -69 -82 -34 -10 -42 -49 -32 -21 -42 -41 -84 -86 -33 -23 26 48 -17 -27
12356 -27 23 35 0 -6 -20 -70 -94 -92 -29 -47 -23 -42 -69 -45 -69 -46 -16 -29 -35 -97 -99 -97 -67 -32 0 -48 -33 -54 -89 -42 -57 -89 -73 -16 -75 -76 -63 -43
12338 -43 4 -34 -35 18 40 -10 6 67 0 -31 -40 14 -21 -8 -38 -52 -20 -43 -25 -27 -36 11 18 -5 -26 -8 -113 -132 -110 -70 -27 11 -13 -81 -96 -77 -46
12320 -46 -71 -56 -30 -13 -28 -60 0 2 -56 -67 -67 -88 -97 -31 -11 -42 -48 -62 -43 -51 -63 -45 -54 -31 -46 -75 -36 14 51 -53 -28 -123 -157 -53 -47 -45 -28 2
12302 2 -33 -68 -31 -9 13 41 14 -80 -105 -56 -27 -85 -74 -3 -8 -25 -37 -45 -77 -49 -66 -12 20 -53 -46 5 31 5 -13 -40 -73 -76 -29 -61 -69 -39 24 11
$$ packed form
12428c0k5oO1K4m9o2j1N7L8n9J4k8J7L4L0j3P1o3nj9l0J9k8J1k0mJ7m0K3N9o4J4j9M5Mk3l1
12410i1pK2L0O0J2r2K5qK5prN1oJ8k3m0K7L1j5j01N1N2j0mq4RO6N8q6O6J2m9m6J3J9j7K4m1
12392f5M6J8J1%k6m5J6L1JL3j2%k7ol0j6QJ6L9l8M0pm9P0O4j05rKM8ln9k7L4J6PJ7n5pQo2
12373a23J5mL8Q1k3J5K0k9l7k6J6L9P3q2P9k1j6j5o9j3M8K4l2pJ7J1k1Jm3kN3J0M9K2o5j0
12356b7N0J2l5oj4n0k4KO3j8K4j9k7K4k4K3L0j3oo2kKL0L5L2m8J5k1l5M7j5l2J6N7n9jJ3K0
12338d3M7l8jN3K2n0J6O1o7l1rN4l5J3l0j4L2k3J8krM7Pk3k1J8j05j9K2M0M3L8k4o8j5J9L1
12320d6k5J5K6J7j5l2O0Kn8j1%k1rO6K0l1oj4J9qj2J8rK3j5k9L9N0L7j04K5r5l4J04OKJ7L0
12302Bl5l5L7K2K2K8k7r4k5M9K9n8J1P1nj7j2ql2K8j7N4L2p3PN1K6k6j8k7l3lM7l2qL0O3j3
$$ plain form
12284 11 -108 -77 -92 -109 -55 -86 -48 -26 -34 -58 14 12 49 -2 -65 -77 -58 -67 -27 -17 -29 -40 -52 -54 -47 -20 -5 -24 -26 -26 -40 -46 -24 -10 -45 -58 -18 -17 -87
12265 -87 -73 -38 -28 -92 -93 -32 11 -55 -32 -39 -48 -49 -24 -9 -14 -7 -7 -6 27 -8 -29 -28 -24 -52 -72 -92 -62 -78 1 4 43 12 18 -29 -33 -10 18 12 -20 -25 -34 -53 -98
12245 -98 -91 -62 -61 -86 -80 -11 -25 -38 -10 -60 -56 -32 9 -20 -76 -4 -45 -28 -24 2 -80 -53 -67 -139 -93 -61 -106 -65 -77 -72 -49 -103 -142 -143 -65 -73 -89 -101 -82
12226 -82 -87 -66 -22 -54 -4 -16 -56 -58 -4 -73 -118 -99 -46 -62 -67 -82 -89 -55 -62 -34 -70 -42 -47 -40 -16 23 24 -35 -33 -25 -68 -42 -43 -116 -110 -50 -80 -77 -56 -76 -74 -36
12206 -36 -12 -52 -55 -9 -57 -121 -108 -69 -88 -75 5 -29 -13 31 -79 -85 -25 -44 -66 -80 -66 -32 12 -13 -71 -81 -98 -113 -108 -90 -18 14 -28 -21 -98 -77
12189 -77 -14 -19 -80 -124 -87 -49 19 29 48 88 26 37 29 7 42 24 -4 12 22 -7 -13 27 5 -73 -86 -118 -109 16 61 16 -82 -114 -52 -84 -94 -59
12172 -59 -22 -73 -89 -122 -40 -71 -103 -30 -3 39 -15 -14 -36 -2 64 18 30 -7 -40 -55 -86 -107 -85 -58 -42 -32 -94 -77 47 58 57 43 69 -20 -27 -61
12155 -61 -41 -17 -26 -27 -15 -17 -28 -43 -59 -69 -82 -95 -62 -9 -50 -90 -107 -69 -5 -45 -56 -32 -65 -42 -53 -54 31 14 34 31 -42 -43 -59 -54 -100 -81 -71 -101
$$ packed form
12284A1j19L1j5j7N4l1L8K2qk4P2kL7n1o3j2J9rM0J0j2j1j2kPK7J5j9k%j4oK2J4l5j3M0Jp0
12265h7J4L5J0o4jO1M3o6K3prjK5J5nP%JL3l5k1JMk8k0k0L0j6P9LL9l1Om7mK3K8ol2nrj9m5
12245i8PK9Jk5OO9j4j3K8n0MK4M1k9n6P2m1J7MK6q2K7j4p2M6L2m5M1j2NK3n4l9jP8qj6j2J9
12226h2nK1M4l2N0j2m0kN4o9m5J9N3j6nj5pL4pK8l6K8nPK4L9Jn9KQm3K6jp3OO0l0LK1k0KL8
12206c6K4m0lM6m8o4J3L9j9J3Q0l4J6M4j10oO0j9k2j4J4L4M4k5n8j0j7j5NJ8P2L2m2Pp7K1
12189g7O3no1m4L7L8O8J0J9M0o2J1qk2L5j8k8J6J0k9oM0k2p8j3l2RJ25M5m5r8l2O2l2j0L5
12172e9L7n1j6l3Q2l1l2P3K7M2n4Jk2L4O6m6J2l7l3j5l1k1K2K7J6J0o2J7J24J1jj4K6q9pl4
12155f1K0K4rjJ2kj1j5j6j0j3j3L3N3m1m0j7L8O4m0j1K4l3K3j1jQ5j7K0lp3jj6Nm6J9J0l0
$$ plain form
12137 -101 -85 -83 -52 -15 -33 -73 -27 -23 -31 1 22 -17 -29 -109 -98 -57 -82 -90 -84 -80 -36 -68 -33 -3 25 22 -10 -42 -55 -37 -67 -62 -21 -7 22 25 -5 -12 -13 -34
12118 -34 -42 41 -38 -6 -4 -62 -104 -8 38 -17 -33 -90 -90 -93 -65 -16 -75 -105 -48 5 -66 -73 -106 -71 -45 -19 9 -12 -41 -39 -82 3 28 -1 19 17 -54 -73
12099 -73 9 32 -19 -20 -54 -25 -9 -14 -32 19 20 -49 -29 23 -23 -60 -26 -12 -55 -20 -9 -27 15 -60 -61 -17 2 23 9 8 -17 -2 42 -17 -33 -34 11 59
12081 59 38 35 31 -16 -33 -68 -73 -89 -18 -31 -89 -101 -50 -34 -42 -57 -53 -78 -78 -94 -73 -83 -6 -17 -52 -52 -54 -121 -88 -84 -104 -17 36 -5 -26 -15 -24 -30 -44 -24
12062 -24 -5 -29 -61 -116 -125 -86 -97 -33 -79 -89 -106 -92 -52 -66 -43 -9 -44 -26 -56 -107 -61 -1 -9 -39 -52 -36 -23 -28 -105 -114 -95 -33 -16 -25 -6 -4 -3 -12 -34
12044 -34 -26 -13 -5 0 1 54 48 -2 -49 -34 -23 -57 -36 -66 -11 -15 -89 -86 -63 -85 -62 4 6 -11 -16 -77 -71 -111 -109 -85 -73 -47 -49 -44 -58 -55 -28 -28 -11 -30 -11 -63
12024 -63 -87 -63 -90 -50 -15 -41 -24 -47 -38 -23 -33 -32 -87 -69 -38 -49 -69 4 -24 -4 -35 -38 -36 -9 21 -30 21 51 -67 -57 -58 -74 -72 -29 -17 -61 -60 -2
12005 -2 4 2 -63 -31 -27 7 23 -5 8 -1 -3 54 5 -15 -24 -31 -62 -24 -2 6 9 -49 -10 -21 -18 -18 -59 -1 23 71 65 12 -29 -51 -41 -43 -53 -87 -53 -25 -46 -56
$$ packed form
12137a01J6KL1L7j8m0M6MqL2K1l9j2q0J1M1k5qOMM4l2L5L0K8ll2l2j3J8l0NM1J4K9Ll0pjk1
12118c4qQ3p9L2Kn8m2R6M6n5j6n7%lK8M9n9l0N7N3p1pl3L5K6K6K8k1k9Km3Q5K5k9K0kp1j9
12099g3Q2K3n1jl4K9J6nj8N1Jo9K0N2m6l7L4J4m3L5J1j8M2p5jM4J9K1j4jk5J5M4n9j6jM5M8
12081E9k1lmm7j7l5nj6P1j3n8j2N1J6qj5Mk5%j6K1j0P7j1l5%ko7L3Mk0Q7N3m1k1J1roj4K0
12062b4J9k4l2n5rL9j1O4m6j0j7J4M0j4K3L4l5J8l0n1M6O0ql0j3J6J3np7rJ9O2J7rJ9KJrk2
12044c4QJ3QNJN3on0m7J5J1l4K1l0N5mp4LK3k2K3O6Kj7no1Om0KK4J2K6kNj4LK7%J7j9J9n2
12024f3k4K4k7M0L5k6J7k3RJ5j0Jn5J8L1j1k0P3k8K0l1lKK7L0n1N1L0j18J0jj6KM3J2m4JN8
12005bOko5L2ML4J6k8J3rkN7m9k0rpl1L8K2QLn8L9j1L%m1N8K4M8on3m1k2J0kj0l4L4K8k1j0
$$ plain form
11985 -56 -6 8 -14 41 -39 -44 -25 -36 -73 -65 -86 -40 -6 -1 -21 -16 -41 -28 -81 -41 -28 -71 -87 -88 -39 -90 -146 -81 -69 -47 -45 -18 -44 -11 -14 -29 1 5 -13
11967 -13 -19 30 3 -33 -27 -25 -29 -58 -74 -8 -2 -46 -71 -54 -79 -50 -4 -27 -71 -95 -81 -11 30 -20 -67 -83 -89 -72 -140 -79 -53 -26 -71 -66 -5 -9 -60 -56 -80
11948 -80 23 10 -39 -102 -101 -94 -85 -88 -46 -28 33 5 -29 35 16 -51 -70 -51 -18 28 -7 23 -44 -102 -60 -56 -57 -12 16 27 -48 -85 -48 29 50 4 -92
11931 -92 -131 -103 -79 -87 -68 -36 -28 -82 -69 -16 -51 -41 62 51 10 12 25 -16 -49 -11 4 2 -20 -16 -18 -18 -8 4 -43 -19 -46 -49 -69 -66 -37 -46 -100 -77 -75 -57
11912 -57 -19 -4 -29 -41 5 -18 -41 -61 -47 -100 -113 -108 -44 -40 -30 -55 -44 -54 -81 -27 -21 22 -38 -2 16 -26 -42 -75 5 -10 -81 -104 -67 -57 -60 -62 -30
11894 -30 -49 -27 46 -36 -89 -81 -59 -29 -29 -35 -39 -82 -67 -50 -82 -55 -25 -43 -18 0 -18 -41 -25 -52 -32 -17 11 -58 -76 -30 -7 -32 -61 -44 30 -4 -14
11876 -14 -63 -36 -35 -29 -19 -55 8 41 0 -42 -67 -25 22 -11 -87 -69 -61 -72 -33 -46 -51 -67 -91 -123 -120 -73 -74 -44 -53 -108 -28 -32 -64 -96 -120 -26 -8 17 50
11858 50 30 39 0 -45 -37 -86 -67 -40 -80 -89 -7 -48 -116 -65 -19 -16 -93 -73 -50 -138 -108 -45 -52 -34 -34 -52 -87 -111 -69 -40 -12 -55 -11 -40 -39 9 -7 -24
$$ packed form
11985e6N0J4k2N5q0nJ9j1l7Qk1M6L4Nk0Nk5J3n3M0J3m3j6jM9n1n6O5J2K2KK7k6L3lj5L0Mj8
11967a3oM9k7l6OKmk9j6O6Om4k5J7k5K9M6k3m4k4J4P0M1n0m7j6oJ7o8O1K6K7m5NO1mn1Mk4
11948h0J03j3m9o3JPRlM2J8O1k8l4O4j9o7j9J9L3M6l5L0o7n8M2MjM5K8J1p5l7L7P7K1m6r6
11931i2l9K8K4qJ9L2Qn4J3N3l5J0J03j1m1KJ3m1l3L8J5kk2Mk%J0J2m7K4k7lk0LK9rn4K3KJ8
11912e7L8J5k5j2M6k3k3k0J4n3j3NO4MJ0k5J1j0k7N4OM3o0L6J8m2j6l3Q0j5p1k3L7J0lkL2
11894c0j9K2P3q2n3QK2L0%omm3J5J7l2K7L0j8K5J8j8k3J6k7K0J5K8o9j8M6K3k5k9J7P4l4j0
11876a4m9K7JOJ0l6O3L3m1m2k5M2M7l3p6J8Qj1L9j3nj6k4l2LM7jL0rn5Q0ml2l2k4R4J8K5L3
11858E0k0Rl9m5Qm9J9K7m0rQ2m1o8N1M6Lp7K0K3q8L0O3pJ8%j8l5k4M2K9K8m3M4k9JM8j6j7
$$ plain form
11840 -24 51 56 -43 -46 -82 -71 -14 -25 -51 -26 -35 -1 -26 -37 -51 -16 -18 -53 -12 18 -59 -28 -32 -63 -40 -112 -169 -137 -128 -98 -60 -83 -140 -101 -23 -35 -12 -24
11821 -24 -42 -66 -63 -44 -18 5 21 -8 -9 -37 -20 -15 9 -9 -66 -20 -49 -58 -52 -66 -25 -9 -52 -71 -42 -30 -30 -66 -91 -95 -109 -61 -41 -4 -4 -58 -75 -79 -17
11803 -17 -17 -40 -47 -85 -157 -109 -47 -61 -50 -55 -61 -28 -76 -84 -21 -12 -26 -85 -64 -73 9 -20 -1 10 -32 -48 -54 -18 -4 -78 -49 -93 -47 -84 -106 -159 -91 -90 -70
11784 -70 -6 -16 -18 -47 -41 -113 -53 -58 -52 -58 -34 -57 -75 -101 -80 -54 -82 -67 -72 -56 -84 -58 -19 -53 -37 -74 -67 -32 -86 -100 -92 -37 -42 -6 34 74 16 -11 -36
11766 -36 -67 -27 -50 -73 -8 0 -4 -39 -45 -77 -69 -52 -50 -2 33 66 15 -34 0 3 -43 -29 -1 7 4 -14 -3 -8 -57 -24 -56 -41 -65 -47 10 -57 -52 -38 -119 -65
11747 -65 6 -9 14 8 -64 -90 -54 -8 -1 11 -19 -53 13 36 30 -12 -24 -60 -17 15 10 -24 -106 -121 -86 -50 -18 -54 -52 -37 -56 -38 -35 -64 -63 -26 -24 -101 -149
11728 -149 -112 -43 47 47 8 -29 -9 -39 -76 -55 -40 -20 -71 -86 -63 -57 -75 -55 -58 -32 0 -19 -100 -95 0 19 -29 -27 -29 9 -12 -54 -47 15 -16 -41 -22 -1
11710 -1 5 -58 -59 -75 -87 -29 7 -58 -23 21 -28 -65 6 -25 -36 -6 -16 -20 -48 -13 10 -47 -66 -25 -42 10 22 -14 -65 -19 -39 -12 78 13 -31 -41 -45
$$ packed form
11840b4P5Nr9ll6J1N7j1k6K5rL4k5j1j4L5kl5M1L0p7L1ml1K3p2n7L2RL0L8k3n7L9P8j2K3j2
11821b4j8k4LJ9K6K3J6k9jk8J7NK4j8n7M6k9rOj4M1J6m3j9K9J2%l6k5mj4M8K0L7%n4j7mO2
11803a7%k3pl8p2M8O2j4J1noL3m8qO3Rj4n9K1rQ2k9J9J1m2j6oL6J4p4K9m4M6l7k2n3O8JK0
11784g0O4j0kk9Op2O0nOoK4k3j8k6K1K6k8J5nJ6k8K6L9l4J6l7PL5n4j4QN5nL6M0M0n8k7k5
11766c6l1M0k3k3O5Qml5ol2QJ7KM8L5L3n1m9L4Lm6J4K8Qlj8J1nm9L3l2J5k4J8N7o7NJ4q1N4
11747f5P1j5K3op2k6L6M6PJ2l0l4O6K3om2j2l6M3L2nl4q2j5L5L6L2l6KJ5j9J8Lk9JL7Kp7m8
11728a49L7O9R0%l9l7K0l0l7K1J5K0n1j5K3Oj8K0lK6L2j9q1NR5J9m8KkL8k1m2PO2l1k5J9K1
11710aOo3jj6j2N8L6o5L5M4m9l7P1l1j1L0j0mk8L5K3n7j9M1j7N2J2l6n1M6k0K7R0o5m4j0m
$$ plain form
11692 -45 14 -11 -62 -16 -41 -2 -13 -38 -116 -88 -43 -77 -105 -123 -114 -5 33 12 -19 -50 -64 -8 -41 -96 -68 -33 -3 -57 -18 -42 -110 -78 -64 -64 -18
11676 -18 -48 -32 -96 -46 -27 -34 -78 -101 -83 -17 3 0 -19 -27 54 1 4 -36 -14 17 11 -1 -1 -61 -101 -89 -71 -20 -32 -36 -33 -60 -70 -21 -5 34 32 -9 -7 -35
11656 -35 -40 -35 33 5 -70 -75 -105 -113 -91 -43 -14 -11 -44 -80 -29 -24 -60 -35 3 17 -26 54 3 -27 -10 44 28 -19 8 -38 -42 37 1 -17 -30 -77 -57 -32
11638 -32 -49 -64 -82 -69 -37 -47 -59 -14 -18 -52 40 61 13 -59 -36 -100 -113 -68 -81 -43 -51 -136 -142 -129 -1 18 -15 -56 -6 -54 -81 -80 -62 -36 -9 -34
11621 -34 -95 -36 -77 -59 -4 -21 -56 -38 -32 -41 -43 12 11 -32 17 52 53 67 58 10 -18 -32 -49 -2 -66 -12 -37 -72 -23 -24 -29 23 -37 -8 38 15 -23 -72 -57
11603 -57 -16 -62 -138 -84 -41 -26 -41 -62 -53 -17 -40 26 8 -61 -69 -75 -83 -113 -57 -73 4 16 -53 -81 -39 -10 -25 -50 -30 -94 -95 -69 -113 -110 -45 -31 -17 -54
11584 -54 -71 -65 -43 -50 -60 -68 -62 -19 -5 58 -29 -64 -43 12 22 -3 -3 -76 -90 -35 -70 -54 47 38 16 5 -47 -30 25 3 -16 1 5 -73 -69 -30 -39 -55 -16
11566 -16 -48 -81 -33 -8 -12 -2 -19 14 -47 -54 -45 -32 1 -57 -102 -125 -108 -104 -66 -92 -73 -72 -71 -111 -77 -36 -11 -35 -6 3 -14 -58 -49 -57 -48 -1 -69 -51 -32 -27
$$ packed form
11692d5N9k5n1M6k5L9j1k5p8K8M5l4k8j8RJ09L8k1l1l1j4N6l3n5K8L5L0n4L9k4o8L2J4%M6
11676a8l0J6o4N0J9pm4k3J8O6K0lj9qQ1n3Lm0K2L1oj2%o0m0J2J8N1j2mLk7j0M9J6L9km1Kk8
11656c5nNO8k8p5nl0qK2M8K9Ll3l6N1Nl6K5L8J4m3Q0n1l0J7N4j6m7K7m6mP9l6j8j3m7K0K5
11638c2j7j5j8J3L2j0j2M5ml4R2K1m8p2K3o4j3M5j3L8qq5oJ3J28J9l3m1N0m8k7JJ8K6K7k5
11621c4o1N9m1J8N5j7l5J8OrkN5jm3M9L5JJ4rm8k8j4j7M7o4N4k5l5M9jnN2o0K9M6k3l8m9J5
11603e7M1m6p6N4M3J5j5k1RL6k3O6j8o9qoql0N6j6P7J2o9k8M2K9j5k5K0o4jK6m4LO5J4J4l7
11584e4j7OK2pj0qOM3J4O3q7l5K1N5J0k5%p3j4N5l5J6J01rk2j1n2J7N5k2j9J7Mp8ML9rj6L9
11566a6l2l3M8K5mJ0j7L3o1pRJ3L3n8m5k3J7ML8k6J9JJm0L4M1K5k4K9Rj7m4RqRM7o8J8J9N
$$ plain form
11547 -27 -78 -37 -51 -68 -7 -9 -35 -54 -23 13 13 31 54 76 61 39 -37 -4 11 -33 -72 -73 -181 -117 -85 -82 -12 -8 5 2 -33 -40 -31 -20 51 33 -4 -18
11529 -18 -21 3 31 27 1 -35 -29 -27 -18 -22 -61 -7 -37 -29 -41 -73 -60 -32 -48 -78 -59 -13 -8 -7 -22 -5 -32 -4 10 26 -76 -74 -50 -78 -68 -66 -20 -78 -46 -46
11510 -46 -91 -77 -29 -33 -93 -44 -61 -41 -66 -65 -14 -67 -21 -49 -64 -23 -23 -27 -22 1 -17 -61 -64 -85 -76 -61 -20 -67 -58 -103 -117 -99 -54 -13 -64 -98 -77 -39 -12
11491 -12 3 8 -90 -84 -80 -28 -18 -21 -4 16 -17 -2 21 -42 -76 -103 -73 -50 -35 -51 -52 -33 -35 18 -8 -70 -43 4 -30 -55 -55 -61 -35 -8 -2 -57 -23 -35 -93
11472 -93 -93 -52 25 37 -39 -18 -52 -109 -147 -97 -49 -17 1 -33 -22 -53 -47 -59 -74 -60 2 -4 10 -10 -9 4 -47 -100 -68 -83 3 56 -13 -58 -101 -52 33
11455 33 -14 -48 -30 36 -10 -3 23 6 13 29 1 -1 -34 -57 -53 -16 -34 -11 18 -3 12 39 7 -22 1 -10 -1 -60 -46 -23 -66 -132 -80 -71 -34 -44 -48 -80
11437 -80 -6 9 -43 -24 -42 -54 -111 -89 -103 -68 -64 -8 4 -11 23 9 -53 -53 -11 -47 -75 -32 -59 -99 -90 -56 -91 -77 4 17 7 -41 -31 -76 -84 -40 3
11419 3 -9 -6 21 -19 -35 -60 -73 -77 -69 -45 -16 -28 -11 -24 -47 -46 -78 -123 -61 -36 -27 -52 -85 -76 -75 -31 -95 -98 -116 -68 -40 -24 -7 19 -38 -88 -78 -40 -42 -60
$$ packed form
11547b7n1M1j4j7O1kk6j9L1L6%J8K3K2j5k2p6L3J5m4l9jj08O4L2LP0MJ3ll5pRJ1P1j8l7j4
11529a8lK4K8mk6l6OKRml9N4l0Qj2l2J3K8j6l0J9M6NJj5J7k7K8J4J6j02KK4k8J0KM6n8L2%
11510d6m5J4M8mo0M9j7K0k5JN1n3M6k8j5M1%mNK3j8m4lk1RJ5M1m7Rm5j4J8M5M1n1l4K1L8K7
11491a2J5Nr8OMN2J0lJ7K0l3J5K3o3l4k7L0K3J5j6jJ9kN3k6o2K7M7l4k5%oK6K7On5L4j2n8
11472i3%M1P7J2p6K1l4n7l8N0M8L2J8l4J1l1Oj2j5J4O2oJ4k0JJ3n1n3L2j5Q6N3o9m5m3M9Q5
11455C3m7l4J8O6m6PK6j7PJ6k8kl3k3ML7j8K3K9k1J5K7l2k9K3j1Rn9J4K3m3o6N2RL7j0ml2
11437h0P4J5n2J9j8j2n7K2j4L5MN6J2j5L4j4o2%M2l6k8M3k7m0RL4l5J4Q1J3j0m8J0m5qM4M3
11419Cj2LK7m0j6k5j3mQK4K9j2J7j3k3Jl2m5O2K5Rk5l3RJM4o4lj8M8K8J6J7K6n7n0J0L8kj8
$$ plain form
11400 -60 -5 -18 -47 -40 5 16 8 13 -36 -54 -129 -82 -42 5 -46 -15 -21 -94 -15 -23 -19 -86 -90 -109 -105 -20 -44 -63 6 -15 -30 -30 19 -25 -39 -53 -39 -60 -82
11381 -82 -14 -28 -44 -67 -65 -18 3 -10 -3 -45 -19 -2 -65 -39 -37 -8 -52 -16 62 -8 23 -42 -10 -71 -109 -41 -94 -86 -58 -83 -60 -39 -42 -46 -42 -36 -21 -47 -66
11363 -66 -55 -10 -80 -63 -59 -90 -28 -26 -58 29 29 -37 -62 -37 -87 -100 -86 -88 -20 2 -38 -42 -24 6 -26 -58 -58 -26 -50 -55 -60 -87 -36 -3 5 -25 -4 -67 -103
11344 -103 -134 -100 -68 -121 -46 -94 -92 -120 -81 -70 -33 -11 -25 -29 -15 -69 -98 -113 -47 -9 34 44 23 22 14 -13 -52 -36 -58 -53 -99 -91 -41 -45 -2 -3 -66 -73 -112
11326 -112 -136 -108 5 40 -37 15 -21 -83 -109 -90 -68 -52 -46 -40 -46 -36 -33 -27 -2 18 25 -46 -35 -46 -17 -1 -88 -54 -47 -56 -6 -35 -53 -15 -112 -58 -49 -57 -51
11307 -51 -23 -37 -37 -80 -96 -6 -21 -29 -15 -63 -86 -72 -89 -82 -78 -31 -74 -77 -106 -124 -80 -58 -95 -92 -133 -118 -52 -100 -94 -66 -38 -41 -40 -43 -18 -82 -47 -90 -99 -54
11288 -54 8 -45 -76 -19 -17 -63 -60 -35 16 -62 -64 -17 -21 -15 -22 -36 -22 -42 -44 -67 -27 -58 -46 -69 -75 -45 -76 -28 -37 -54 -48 -15 -10 -7 -56 -61 -103 -52 11 -10 -110
11268 -110 -64 -30 -42 -28 -43 10 7 -25 -9 -35 -1 47 79 53 1 -11 -27 -21 -39 -22 -83 -119 1 56 31 -27 -28 -57 -49 -42 -98 -42 -4 48 -33 -40 14
$$ packed form
11400f0N5j3k9PM5J1qNm9j8p5M7M0M7n1L1op3P9qMo7mj9MQ5k4j9O9k1j5%M9m4j4j4J4k1k2
11381h2O8j4j6k3KM7K1j3Pm2K6J7o3K6KK9m4L6P8p0L1o5L2o1l8O8n3QK8k5K3K1lmMOJ5k6j9
11363f6J1M5p0J7Ml1O2Kl2Q7%o6k5K5n0j3J4kO8K2m0mJ8L0l2l2%L2k4nnk7N1L3Ql0K1o3l6
11344a03l1L4L2n3P5m8Kk8L9J1L7K2j4mJ4n4k9j5O6L8M3J0k1jqk7l9J6k2Nm6QN0mM3jo3pl9
11326a12k4K8J13L5p7N2l6o2k6J9K2J6OOoJ0LOK5K0Pp1J1j1K9J6q7L4PrN0k9j8L8r7N4RqO
11307e1K8j4%m3j6R0j5qJ4m8k3J4j7PMM7m3lk9j8M4K2l7Lm1J5O6m8OK8K8lJlK5o4L5m3rM5
11288e4O2n3l1N7Km6LK5N1p8kM7mOpj4J4k0kk3M0l1J2k3oL0l1M8rj7OL3NLm9nm2N1O3k1j00
11268a10M6L4j2J4j5N3ll2J6k6L4M8L2k6n2j2j6Oj8J7o1l6J20N5k5n8jk9QPn6N6L8N2q1pN4
$$ plain form
11251 14 22 -22 -63 -45 -79 -4 -17 -29 8 -27 -37 -38 -33 -15 -10 7 -34 -121 -65 -76 -39 -56 -69 -49 -73 -133 -50 -60 -31 -74 -80 -49 -74 -74 -70 -40 -56 -23
11233 -23 -79 -85 -119 -95 -48 -32 -52 -16 -47 -98 -82 -51 -20 -29 -15 50 -8 -31 -30 -54 -81 -91 -3 -19 -50 -35 -33 -39 -24 -3 -3 -23 -43 -70 -32 -51 -36 -35
11214 -35 -37 -70 0 13 -2 -21 -8 24 20 -33 8 4 -3 -30 20 41 65 12 -4 -58 -99 -60 1 -40 34 58 18 -64 -77 -26 -12 10 -77 -64 -41 -49 -67
11197 -67 -60 -33 -68 -19 28 2 30 3 -3 -39 -29 -43 -19 -63 -55 -82 -70 -64 -55 -72 -43 -28 38 -14 -22 24 -9 -3 -3 -98 -128 9 -27 -116 -28 -9 -29 -10
11179 -10 -12 -14 -37 0 16 -54 -70 -55 -98 -61 24 -56 -113 -97 -66 -41 -53 -46 19 19 -8 -66 -95 -61 -26 -114 -133 -49 -13 -12 -20 -2 54 31 -25 2 56 14
11161 14 -50 58 15 -66 -27 -41 10 -69 -126 -137 -52 -39 -123 -147 -101 -110 -48 -11 -31 -69 -8 -12 -43 -64 -65 -97 -92 -32 -80 -43 -49 -18 38 -10 -41 -35 -33 -57
11142 -57 -40 -45 -47 -42 14 33 -1 5 28 -13 -74 -42 -44 -108 -94 -32 -11 -6 13 -10 -1 -21 -54 -142 -66 -90 -88 -65 -69 -72 -45 -17 -44 -53 -73 -38 11 13 -18 28 17
11123 17 -17 -54 -22 -29 -48 -51 -105 -66 -18 -63 -78 -65 8 -68 -66 -4 -11 -48 -43 -8 -19 -44 -92 -61 -136 -78 -26 -73 -21 -12 -50 -54 -27 -39 -35 31 56 34 -66
$$ packed form
11251A4Qm4m1J8l4P5j3j2L7l5j0jNJ8NJ7m1q7N6j1L7j7j3K0k4o0Q3j0K9m3oL1k5%ML0j6L3
11233b3n6ol4K4M7J6k0L6l1n1J6L1L1rJ4O5n8k3Jk4k7j0Q8j6l1J5KoJ5K1%k0k0k7L8j9J5J
11214c5kl3P0J3j5j9J3L2mn3M1mpk7N0K1K4n3j6n4m1L9O1m1P4K4m0q2j3N1J4K2q7J3K3qj8
11197f7PK7l5M9M7k6K8k7ol6J0j4K4m4Qk7J2ORj7K9J5O6n2qM6l3O%r5l0J37l6q9Q8J9k0J9
11179a0kkk3L7J6p0j6J5m3L7Q5q0n7J6L1K5j2PO5%k7n8k9L4L5q8j9Q4L6JqJ8N6k3n6K7N4m2
11161A4o4J08m3q1L9j4N1p9n7j1Q5J3q4k4M6rO2L7k0l8O1ml1k1jl2NO0m8L7oL1N6m8l1OKk4
11142e7J7nkNN6J9l4OK3m1o1L2ko4J4O2K1NJ9k3Rk0l3q8P6k4KK3mlK7K8k7rk0L5M9Kl1M6j1
11123A7l4l7L2pj9ln4L9M8m5j5J3P3p6KO2pl7NL5j1k5m8L1p5N8N2m7N2Rl8mK7j2MO6K5k2j00
$$ plain form
11104 -66 -63 -36 28 24 -38 -16 -13 -66 -7 -12 -70 -48 1 13 3 33 -71 -74 -59 -85 -75 -72 -48 29 -10 -74 -1 -12 -37 -1 -18 -69 -46 -37 -29 -21 -46 2 35
11086 35 -42 -98 -96 -80 -22 -28 -27 -48 -38 -10 -70 11 -8 -121 -125 -77 -75 -76 4 2 -61 -35 -57 -62 -58 -78 -30 14 46 54 25 -16 -1 -50 -45 21 64 35 -26 1
11067 1 -23 -21 24 -58 -83 -47 -53 -28 -26 -83 -75 -36 -43 -39 -41 -11 10 5 4 -9 -72 4 -34 -45 -127 -55 28 -2 -13 -16 -18 -57 -55 -63 -55 -2 -29 -67 -49 -73 -58 -46
11047 -46 -76 -78 4 -15 -27 -62 -62 -21 -9 -38 -37 -46 -52 -69 -71 -37 -52 -61 -55 -1 24 -8 -19 -17 -83 -78 -93 -71 33 18 -36 1 -27 -37 23 88 -3 -35 -48
11028 -48 -38 -18 -20 -22 -69 -103 -41 -42 -116 -97 -74 -107 -66 49 48 0 -22 -57 -58 -61 -86 -80 -45 -26 12 38 7 -77 -68 -52 -10 -10 -33 -37 -32 -28 10 -51 -84 -66
11009 -66 -26 -74 -75 -30 -34 -36 -57 -40 -11 -27 -71 -55 -28 -60 -39 -92 -40 14 -30 -8 -43 -69 -43 -59 -65 -3 -40 -62 -104 -81 -39 -54 -32 -91 -92 -58 -77
10991 -77 -86 -20 -1 5 12 -72 -76 -42 -14 23 14 6 -36 -45 -68 -12 -24 -23 -61 -102 -115 -112 -32 -10 -19 5 -2 12 -59 -86 -72 -79 -91 -98 -68 -12 -56 -90 -59 -66 -80 -60
10971 -60 10 -62 -112 -96 -112 -52 21 61 46 -43 -55 -33 -21 -81 -102 -71 -46 10 -54 -92 -78 -90 -70 -94 -51 17 35 -22 -43 -25 -18 -12 -29 -23 -20 -12 -6 10
$$ packed form
11104f6LK7O4mo2K2Ln3N9nn8K2M9J2j0L0j04lJ5k6J0LK4P7l9o4P3j1k5L6j7n1K3RQQk5M8L3
11086C5p7n6KJ6N8oJk1J0K8o0Q1j9j13mM8KjQ0ko3K6k2nMk0M8M4L2Qk9m1J5m9NO6M3k9o1K7
11067Ak4KM5q2k5L6oK5Kn7QL9pMkL0K1njj3o3P6l8j1q2P2Q3l0j1lkl9KqQN3k7l8J8k4J5J2
11047d6l0kQ2j9j2l5%M1J2k9Jroj7kL4j5rON4K5l2j1Ko6Nj5K2J04j5n4L7k8j0O0O5r1l2j3
11028d8J0K0kkm7l4O2jp4J9K3l3M1J15jm8k2l5jlk5OL5J9L8K6l1q4RJ6M2%k3mNML8o1l3J8
11009f6M0m8jM5mkk1J7K9j6m4J6K7l2K1n3N2N4m4K2l5k6K6j6oO2l7k2m2K3M2j5K2n9jL4j9
10991g7rO6J9OPq4mL4K8L7rqm2rk3N6j2Jl8m1j3LQ0K2rK4pJ4p1k7J4pj2pL0N6m4l4L1pj4K0
10971f0P0p2n0J6j6O0P3M0j5q9j2K2J2o0k1L1K5N6o4l8J4j2K0k4M3O8J8n7k1J8POj7OLQOJ6
$$ plain form
10953 10 -22 -77 -74 -69 -61 5 -48 -44 -39 -52 16 -46 -16 -43 -85 -52 -66 -60 -46 -95 -103 -73 -30 -32 -59 -88 -87 -14 -40 -42 22 25 22 -42 -32 -23 -16 -68 -40 -16 -72 -79
10933 -79 -106 -70 -28 -36 -63 -103 -99 -49 -8 -22 -32 0 3 47 28 8 -46 -78 -53 -44 -46 -35 -1 -53 -31 -35 -42 16 14 -80 -77 -79 -62 -84 -43 -38 -71 -46 -41 -54 -15
10914 -15 -16 28 0 -32 -4 18 21 -53 -51 -39 -68 -30 9 -68 -64 -41 0 -30 -27 -32 -30 -65 -3 -36 -89 -80 -78 -47 -91 -124 -90 -155 -160 -185 -143 -5 -23 -13 -59
10895 -59 -68 -67 -8 26 1 12 -2 19 19 -6 -56 -61 -48 -6 -28 -64 -1 -26 -28 6 -24 -86 -120 -66 -25 -27 -1 -4 8 -11 -71 -111 -88 -70 -103 -146 -107 -78
10877 -78 -63 -37 -26 -71 -8 16 -46 -18 -25 -87 -38 -3 -9 -14 8 26 -25 -1 -29 -19 -61 -84 -89 -82 -90 -82 -61 37 -34 -47 -55 -37 -66 -54 31 50 45 5 0 -44
10858 -44 -56 -32 -69 -123 -102 -48 -35 -21 13 25 -42 -58 -69 -72 -51 21 -48 -77 -62 -37 -35 -38 -48 -72 -64 -80 -62 35 42 -17 -31 -30 -49 -123 -174 -123 -105 -48
10840 -48 -7 -48 -57 -19 -79 -70 15 -32 -78 -53 -37 -64 -65 -67 -55 -90 -115 -50 -1 12 -27 21 -7 29 27 3 -4 -7 -60 -80 -22 7 -24 -19 -67 -71 -26 -117 -103
10821 -103 -63 -12 43 12 -26 48 -6 -118 -87 -80 -74 -59 -77 -101 -83 -55 -1 -55 -66 -28 28 -34 -93 -26 -38 6 38 -21 -69 -19 15 -43 -48 -11 18
$$ packed form
10953A0l2n5LNQO6n3MNj3O8o2L0k7m2L3j4OJ4m9qL0M3kk7k9JP3k6kO4Llo4J0RPn2K8K4n6p
10933g9k7L6M2qk7m0MN0M1j4j0L2LM4j9k0n4l2K5RkJ1L4n2K2mpN8kr4LkJ7k2M1Nl3K5Nj3L9
10914a5jM4k8l2K8K2Lp4KJ2k9L8L9p7MK3M1l0LnKl5O2l3n3RKL1m4l3L4o5nk5M2J38j8J0m6
10895e9rJN9L4k5J1j4K1%k5n0nJ3M2k2l6O3k5kL4l0o2l4N4M1kK6lJ2j9o0m0K3J8l3m3L9K9
10877g8J5K6J1m5O3K4o2K8po2M9L5onK2J8n1K4k8J0m2k3nPqQK1R8p1j3qJ8k9J2Q5J9nm0nm4
10858d4j2K4l7n4K1N4J3J4L4J2o7j6j1lK1P2o9k9J5K5Klj0k4Qj6J8R7Pn9j4Jj9p4n1N1J8N7
10840d8M1m1rL8o0RQ5m7m6K5J6k7jkJ2l5k5O5M9J3l9M8k8L6kk4pln3k0N8K9l1Nm8mM5r1J4
10821a03M0N1N5l1l8P4n4j12L1POJ5j8k4J8K8N4n4j1L8N6o2n9O7j2M4L2n9m8N0L4n8nL7K9
$$ plain form
10804 18 -23 -26 -25 -36 -30 -19 -58 -62 -107 -50 -50 -72 -89 -119 -93 -76 -90 -130 -58 -74 -30 -57 -49 -28 -20 -30 -96 -12 10 -12 -23 -55 -115 -123 -72 -23 1 -17 -76
10786 -76 -15 -16 -59 -84 -60 -113 -120 -115 -29 -46 -49 -9 9 -7 -40 -42 -72 -100 -69 -78 -36 15 -34 -50 -86 -77 -59 -37 -95 -4 15 -18 -26 -34 -63 -13 41 36 16 -13
10767 -13 -44 -78 -105 -73 -35 -11 22 -31 -41 -67 -22 -50 -41 -15 9 8 15 -49 -103 -44 12 -24 -29 -15 22 -15 -21 -12 -22 26 10 -15 -43 -61 -63 -57 -63 -84 -72
10748 -72 -59 -4 25 -41 -18 37 11 1 -75 -97 -76 -44 -33 -31 -35 -77 -45 -62 -40 -30 -49 -19 12 16 17 25 15 -50 -69 -79 -58 -72 -79 -26 -7 -37 -10 -67
10730 -67 -58 -31 -9 -11 31 50 22 -10 -69 -34 -33 -36 -67 -45 -45 -27 5 -62 -54 -17 -16 -65 -143 -71 2 -44 -72 -109 -31 -48 -53 -78 -47 -91 -88 -77 -57 -62 -14 -31
10711 -31 -7 88 15 -50 -83 -108 -117 -104 -63 -1 3 -29 -6 -39 -27 -30 -11 14 -16 -39 -82 -116 -116 -64 8 -3 -15 -37 -45 -36 -29 -63 -30 -50 -94 -114 -84 -52
10693 -52 13 -6 -24 -51 -45 -8 8 -35 -82 -89 -67 -66 -93 -119 -131 -19 3 -38 -3 14 -36 -42 -34 -127 -96 -71 -77 -105 -93 -131 -142 -102 -28 -45 -33 -52 -40
10675 -40 -64 -100 -88 -57 -33 -42 -59 -74 -58 -109 -103 -64 -67 -51 -13 6 -7 -38 -19 -75 -84 -84 -22 5 -27 -38 -97 -92 -16 20 -34 -55 -17 -46 -58 -70 -52 -61
$$ packed form
10804A8m1lJj1OJ1l9mm5N7%k2j7l0K6J7j4m0P2j6M4k7QK1Qj0o6Q4K2k2j1l2o0qN1M9K4j8n9
10786g6O1jm3k5K4n3pNQ6j7lM0J8j6l3kl0k8L1rM2N1m9j6l6RJ8K2n8R1J9l3qqk9N0N4nk0k9
10767a3l1l4k7L2L8K4L3n3j0k6M5k8RK6K4jPo4n4N9N6l6nJ4L7l7oRj0M8j6k5k8j8kOok1J2
10748g2J3N5K9o6K3N5k6j0p6k2K1L2J1Kmm2L2j7K2J0j9L0L1MJQj0o5j9j0K1j4pN3J9l0K7n7
10730f7RK7K2kM2J9k8l2n9L5Jll1K2%J8L2o7QL7Jm9p8P2P3m6k8l7P8j7nk5L1m4LJ1K0nM8j7
10711c1K4R5p3o5l3k5rJ3M1O2Ml2K3l3J2lJ9K5l0k3m3l4%N2P2j1j2k2qRPl4L3k0m4k0L0L2
10693e2O5j9j8k7OL7J6m3m7pK2Jk7k6j2J12K2m1L5J7n0oQr3L1K5ok8J2l8j1M0P4j7J2j9J2
10675d0k4l6J2L1K4rj7j5J6n1OL9lJ6L8J9j3l1J9n6r%O2K7l2j1n9NP6L6n4k1L8k9j2j2J8r
$$ plain form
10657 -61 -52 -4 -55 -52 -7 -32 -20 -86 -63 -21 -13 -14 -1 -11 5 -17 -35 -66 -54 -57 -114 -85 -33 -12 -44 -42 -56 -11 -66 -104 -47 43 62 21 -28 -32 -9 -11 -43
10638 -43 -41 -39 -105 -66 5 -31 -56 -76 -78 -133 -80 -85 -50 -2 18 -30 -8 -40 -70 -52 -26 -17 -17 -82 -126 -74 -64 -89 -43 4 -58 62 -7 -100 -4 -22 -72
10621 -72 -85 -60 -32 -48 -58 -36 -20 -58 -60 -56 -41 -67 -1 -31 -78 -40 -53 -101 -49 10 -46 -70 -112 -68 -11 -35 -78 -54 -6 21 16 -43 -59 0 -19 -57
10604 -57 -64 -9 -21 -55 19 -30 -47 12 -16 6 -39 7 -8 -35 -17 -31 -36 -26 -3 -48 -77 -63 -27 5 -88 -77 24 1 -26 -115 -98 -31 -26 -55 -85 -9
10586 -9 -14 4 8 -34 -18 -8 -13 -17 -18 11 12 -8 -67 -74 -21 -6 -3 9 49 -2 -80 -55 -90 -88 -94 -120 -52 4 -31 -45 -13 30 -24 -9 6 -4 -71 -78 -83 -22 31
10567 31 -20 -35 -29 -3 -18 -46 -84 -61 -10 64 9 30 -27 -75 -38 -94 -62 -82 -99 -96 -100 -81 -56 -1 -14 -26 -33 -6 3 -20 -28 -48 -79 -38 -35 -42 -22 -42 -6
10548 -6 -58 -78 -42 -20 -23 -41 -50 34 2 33 -15 -29 18 -62 -93 -70 -23 8 -29 -50 3 -6 -69 -75 -77 -58 -62 -23 -36 -24 -32 2 -34 -23 -76 -83 -34 -69 -40
10530 -40 -30 -17 -2 28 -11 -64 -32 -70 -98 -77 -48 -68 -100 -158 -118 -16 -27 -34 -4 -71 -53 -44 -28 -23 8 -11 -41 -31 -39 -58 -115 -38 -41 -53 -40 -26 -79
$$ packed form
10657f1RM8n1LM5k5J2o6K3M2QjJ3j0J6k2j8l1J2ln7K9N2K1l2Kj4M5n5l8N7R0J9m1m9mK3kl2
10638d3KKo6L9P1l6k5k0kn5N3nL5M8K0m8K2l2l0J8K6R%o5m4N2J0k5M6M7o2J20o9r3R6j8n0
10621g2j3K5K8j6j0K2J6l8kMJ5k6O6l0m7L8j3m8N2N9n6k4m2M4N7k4m3K4M8K7nn9j6N9j9l8
10604e7pN5j2l4P4m9j7N9k8K2m5M6j5k7J8j4nJ0K3m5k9J4L6L2r3J1J01k3k7q9J7O7Nk9l0P6
10586inJ8Mm2J6J0nmjK9Jk0n9pN3J5LJ2M0n1p8K5l5Kok6O8N6l5j4L2M3n4J5J5j0o7pnO1N3
10567C1n1j5OK6j5k8l8K3N1P4n5K1n7m8L7n6L2k0j7LmJ9K5N5j3j2pK7Rk3qk0l1M1LpK0k0L6
10548fn2k0L6K2lj8rQ4l2L1m8j4M7q0l1K3M7L1l7k1N3ro3okJ9mL9j3J2qL4l6J1n3pM9l5K9
10530d0J0J3J5L0l9n3L2l8k8K1K9k0l2n8M0J02j1pL0o7J8RJ6NL1j9l0J0qj9n7P7lj2J3J4n3
$$ plain form
10512 -79 -19 -16 -24 -56 -110 -123 -95 -35 -34 -63 5 -19 -109 -112 -56 -106 -129 -22 -79 -65 -52 -49 -52 -46 -73 -66 -67 -88 -55 -54 -67 -22 1 -42 -47 -31 -46 -11 -37 -75
10493 -75 -82 -84 -98 -90 -58 -50 -49 -94 -103 -75 -76 -73 -144 -106 -61 -47 -40 -58 41 -18 -104 -62 -45 -31 -3 -44 -32 -64 13 -39 -90 -53 -7 -23 1 -34 -21 -33 -78
10474 -78 -96 -122 -70 -23 -48 -63 -71 -59 -113 -111 -27 -48 -91 -54 4 12 6 -73 -57 -48 -55 -26 -41 -12 -39 -11 52 -37 -72 -101 -127 -66 22 -27 -53 -22 -30 15
10456 15 -2 11 -62 -73 -61 -117 -55 -25 9 -57 -65 -38 -5 36 14 37 48 -26 -56 -2 44 22 -7 -42 4 61 29 -25 -12 -48 -110 -89 -134 -118 -111 -72
10439 -72 -37 -54 -51 30 67 -48 -106 -106 -90 -14 -46 -65 -59 -41 -44 -33 -87 -84 -102 -104 -55 -50 -76 -93 1 20 31 -32 -27 29 12 24 -19 -60 -24 -66 -50 -42 -52
10420 -52 -26 -80 -80 -4 9 -34 -59 -73 -50 -62 -51 -58 -19 -24 -28 -105 -109 -81 -118 -106 -80 -90 -77 -13 -21 -5 51 -4 25 38 6 -8 -7 23 -5 13 18 -52 -56
10402 -56 -43 -85 -48 -24 -57 -20 -10 36 3 43 62 3 -38 -53 -13 -58 -111 -119 -90 -71 -95 -39 -38 -72 -77 -83 -10 -16 -32 -4 5 1 -32 -62 -78 -85 -35 -24 -49
10383 -49 -27 -8 56 -19 -53 -59 -22 -51 -38 -24 -8 9 -6 13 -7 -3 -21 -19 -5 33 -27 -79 -57 0 -28 4 51 2 -54 -71 -99 -72 -72 -44 -31 7 35
$$ packed form
10512g9O0Lql2n4j3K8O0Jk9O8k4r0lN6n0k3J07n7J4J3LlOk7Pjk1L3Jj3M5K3m3nJ6j5L5k6l8
10493g5pkj4QL2QJm5rK8jLp1L8M5J4Pj8R9n9q6M2J7J4K8m1J2l2P7n2n1L7M6j6K4l5J3j2m5
10474g8j8k6N2M7k5j5qJ2n4KQ4k1m3L7N8Qop9J6RpK9j5K9k7K8O3q9l5k9k6O1Q8m9k6L1qM5
10456A5j7J3p3j1J2n6O2L0L4o6qK7L3M1k2K3J1p4l0N4M6k2k9l5M6N7l2n4J3l6o2K1m5J6PL9
10439g2L5j7LQ1L7j15n8%J6P6l2j9OJ8lJ1n4Lj8kM9Nk6j7R4J9J1o3NN6j7J2m3m1L6m2J6Qj0
10420e2K6n4%P6J3m3k5j4K3j2J1pL9nmp7mK8l7J2K6j0J3O4qJ6N6n5K9J3l2j4JL0k8J8Np0m
10402e6J3m2L7K4l3L7J0M6l3M0J9n9m1j5M0m5n3qK9J9k4N6Jl4noP3oj6K8Rml3l0j6pN0J1k5
10383d9K2J9O4p5l4oL7k9J3J4J6J7j5J9k0Mj8KJ4L8o0n2K2N7k8L2M7m9n6j7k8K7%K8J3L8K8
$$ plain form
10366 35 18 21 13 -44 -76 -85 -22 -1 8 -45 -62 -30 33 43 2 -28 -56 -33 -52 -88 1 48 -22 -51 -35 -15 -76 -83 -40 -63 -35 10 -23 -33 -19 -56 -20
10348 -20 -32 -49 -67 -104 -37 9 -4 15 18 -106 -71 -46 -47 -60 -80 -84 -42 -20 -41 -92 -91 -68 -95 -73 -14 -45 -27 -27 -39 -78 -68 22 18 -44 -19 42 35 36
10330 36 -36 -51 13 8 -29 -41 -23 -14 -70 -47 -23 11 -21 27 11 -51 -20 41 63 31 -32 2 11 54 -3 -30 -51 -19 -25 -30 29 48 -55 -58 -78 -61 -44
10312 -44 -22 10 -21 -92 -103 -99 -61 -36 -43 -72 -42 6 37 34 -55 -82 -63 -56 -24 33 -31 -93 -93 -64 -78 2 64 86 -2 28 6 -14 -49 -1 -15 -52 -75
10295 -75 -69 -30 -20 -48 -10 -3 -23 -47 -66 -56 -40 -95 -88 -99 -64 -58 -50 -90 -41 -42 1 -38 -67 -109 -102 -80 -38 -15 -61 -91 -76 -19 -7 -64 -102 -46 -57 -113
10276 -113 -79 -94 -124 -116 -63 -50 -74 -54 -91 -104 -89 -73 -81 -39 -94 -80 -3 -39 -58 -48 -107 -66 -45 -41 3 -32 -40 -19 -52 -8 -26 -56 -66 -31 14 -33
10259 -33 -57 -95 -52 -22 -22 29 -5 -13 44 -65 -88 -69 9 10 -41 -83 -183 -113 -90 -92 -37 -27 7 -16 -43 -13 -105 -139 -77 -27 -15 -39 -39 -58 -30 -25 -42
10242 -42 -19 -25 -39 -14 -35 -38 -61 -25 -5 -8 -37 -46 -28 2 -7 -60 -48 -48 -38 -23 -64 2 -36 -7 4 -30 -38 -101 -80 0 -2 -64 -23 -53 -14 -8 -115 -78 -10
$$ packed form
10366C5j7Lqn7l2rO3K1Rn3j7L2O3J0m1l0k8K3j9l6Q9M7p0k9J6K0o1pM3k3K8M5l3j0J4l7L6
10348b0j2j7j8l7O7M6j3J9Lj24L5K5jj3k0mM2K2k1n1JK3k7K2N9l1J8%j2l9J0R0mo2K5O1pJ
10330C6p2j5O4nl7j2J8Rn6K3K4L4l2M8j6o2L1O1K2l2o3L4RM3n7k7k1L2onN9J9j03lk0J7J7
10312d4K2L2l1p1j1ML8K5pk9L0M8L1lq9k7J9PL2N7o4o2%K9j4Q0O2K2q8L0k2k0l5M8j4l7k3
10295g5OL9J0k8L8Pk0k4j9J0J6n5Pj1L5OQm0M9jM3l9k9m2PK2M2K3m6l0J5N7J2n7l8N6j1n6
10276a13L4j5l0QN3J3k4K0l7j3J5J6qM2n5J4P7l6j9J0n9M1K1MM4l5qK1l3M4j8l0j0L5M5m7
10259c3k4l8M3L0%N1l4qN7j09k3J9P8Jn1m2j00P0K3kN5J0L4k3k7L0r2l4O2N0J2k4%j9K8Nj7
10242d2K3oj4K5k1lk3L6K0lk9rJ8L0rn3J2%J0J5m1O6l8K9J1l4qo3K1Q0ko2M1l0L9Oj07L7O8
$$ plain form
10223 -10 -24 -78 -79 -69 -76 -41 -48 -54 -39 -90 -34 -30 -13 -83 -30 -64 -74 -86 -48 -75 -120 -62 -42 -48 -4 -46 -74 -65 -80 -47 -29 3 -11 29 22 -20 -27 2 29
10204 29 -11 -29 -2 -17 -6 -32 -51 10 -22 -24 -53 -16 90 27 -80 -79 -113 -57 -17 -36 -60 -32 -27 -120 -106 -85 -54 -51 -106 -170 -100 -30 -24 -14 -8 -39 -2
10187 -2 -5 9 -37 4 -33 -43 -81 -109 -88 -65 -44 -21 -26 -82 -54 -67 -89 -57 -40 -51 -42 -60 -110 -145 -76 -10 0 -54 -26 98 18 -47 -58 -78 -41 7
10170 7 38 -35 -74 -97 -142 -114 -26 -43 -36 -4 -93 -111 -40 -10 -93 -62 -22 -48 -97 -36 -7 -16 -49 -110 -88 -52 -61 -54 -42 -108 -85 -45 -37 -56 -49 -54 -38 -16 -27
10151 -27 -50 -14 -49 -109 -132 -83 -42 -83 -92 -74 -94 -89 -44 -27 -34 -19 -32 -57 -29 -5 -23 -9 -35 -52 -24 -38 -46 -52 -41 10 -12 -69 -60 -13 -29 0 -63 -85
10133 -85 -127 -82 11 9 -4 -66 -71 -80 -68 -69 -96 -70 31 -2 -33 -39 -28 -62 -44 -35 -36 -61 -93 -48 -106 -22 -30 -54 -36 -27 -68 -4 -32 1 -39 -13 -16 -52 -67
10114 -67 -64 7 -39 -86 -55 -15 -8 -100 -163 -131 -86 -32 -41 -45 -11 -10 -57 -47 -54 -50 -9 -29 31 25 10 7 -6 40 25 -9 -49 -17 -84 -79 -19 -3 27 -8 -62 -15
10095 -15 -48 -85 -31 -26 -25 -75 -79 -114 -129 -90 -25 -63 -12 -4 0 -13 -20 -61 -37 -38 -91 -69 -36 -16 -59 -44 -67 -46 -115 -110 -51 -38 -62 -71 -26 -9 -39 -1 -46
$$ packed form
10223a0j4n4jJ0pL5poJ5n1N6MJ7p0N3l4j0j2L8k7m5N8K0oM4m2k8Rj5L3J8L2j4M0pm2pK9K7
10204B9m0j8K7j5J1k6j9O1l2kk9L7J06o3j07Jl4N6M0j9k4K8Nr3J4K1L1Ln5o4P0P0OJ0Ol1L7
10187blJ4m6M1l7j0l8k8K1K3K1K3nn6K8j3k2L2J7j1Rj8n0l5O9O6J0n4K8J24q0o5j1k0L7M8
10170GL1p3l9k3m5K8Q8j7PL2q9j8P1L0q3L1M0k6m9O1K9rl3o1K2L6rPJ2o6K3M0Qj9PnJ6K2j1
10151b7k3L6l5o0k3M9M1m1rJ8k0NM5J7pJ5j3k5K8K4j8J4k6j7K8j4qoJ1N1k2n7RM7j6K9o3k2
10133h5m2M5R3kj3o2nrJ2jk7K6J01l3l1oJ1l4J8Rjk5l2M5n8Q4qk4J8Rm1O4k8L3m0K6ll6j5
10114f7LP1m6m7L1M0Pr2o3L2M5N4rmL4Jm7J0pMM1k0O0oj5lj3M6j5l4m0L2o7NO0J6L0l5n4M7
10095a5l3l7N4NJn0ml5j5L9O5l8N1QMj3pm1K4jn3K2L3K0m3J5k3K1o9NN9J3k4rM5J7l0L8m5
$$ plain form
10077 -46 -44 6 -24 -56 -58 -13 -28 -22 10 -8 -32 -30 1 -2 -8 -31 -47 -35 -15 -68 -67 -33 -55 -74 -41 -26 -41 -13 16 -37 -51 -56 -100 -87 -40 -32 -53 -45 0 -67
10058 -67 -72 -59 -92 -90 -50 -61 -50 -13 -21 -94 -44 -44 -8 -82 -88 -59 -73 -47 -76 -53 -40 23 0 -18 -58 -86 -85 -100 -58 -19 3 -27 -3 42 52 60 -71 -76
10039 -76 -65 29 -31 -70 -60 -93 -82 -63 -62 -53 -30 -58 -88 -49 -47 -57 -17 24 -2 -62 -49 -67 -71 -34 -56 8 35 -21 6 -52 -96 -92 -125 -104 -121 -48 -50 -63
10021 -63 -42 -73 -73 -90 -88 -61 -103 -140 -113 -1 -13 8 17 18 33 -18 -54 -8 -42 -34 -75 -74 -35 -25 -9 -10 -58 -2 8 -39 -20 -38 -77 -43 -42 -28 -16 -39
10003 -39 -80 -37 -54 -47 -28 -61 -71 -79 -50 -41 -31 -42 32 -11 -17 -57 -75 -43 -19 -40 -26 -68 -13 17 -49 -52 -82 -41 37 34 -13 -21 -18 -23 -29 -2 3 4 -12 -30 -9
9984 -9 15 25 -16 -5 -43 34 16 -27 7 -21 -3 -44 -21 27 -43 -10 -76 -32 -37 -58 -12 -37 -74 -85 -79 -68 -54 -5 11 19 -59 -46 -1 -12 -38 -65 -82
9966 -82 -51 1 -4 28 9 -64 -48 -32 -62 -20 -20 -48 -44 -34 -25 0 -12 6 -26 -18 -9 -54 -65 -79 2 26 -18 23 42 2 12 34 48 36 65 36 -55 -71
9948 -71 -63 -25 23 -8 -68 -60 -85 -101 -82 -49 -43 -48 -26 11 30 18 9 -89 -112 -94 -88 -47 -64 -80 -88 -66 -28 -20 -40 -28 40 -6 -47 -44 -40 -11 -37 -34 -63 -41 -52
$$ packed form
10077d6KN0l0l2kM5j5OL2j8k4KL1lok3j6J2K0n3JL4k2j9L3J5j5K8K9n3j4nm4J3M7Qk1QM5o7
10058f7nJ3l3KM0j1J1L7qp3N0%L6p4oK9j4K6k9K3J3O3k3j8m0k8Jj5M2L9K2l0K4M5J0Qj31n
10039g6J1R4o0l9J0l3J1J9JRK3k8l0L9Kj0M0M1k6o0J3j8mL7k2O4K7n6K7n8m4Ml3K1j7P3kj3
10021f3K1l1%j7KK7m2l7K7J12j2K1RJJ5n1l6M6l4Qm1JL9J0J6jm8N6J0m7J9j8l9L4JJ4J2k3
10003c9m1M3j7PJ9l3j0qK9RJ0j1P4m3om0j8L2K4k1J4m2N5L0o6ll0M1P8lm7qLnoK7NJj6j8K1
9984iK4J0m1J1l8P7j8m3L4k8J8m1K3M8p0L3o6M4nk1M6k5l7j1OJ1J4M9J6Qp8J3M5j1k6k7j7
9966h2L1N2nL2j9p3J6J6l0M2%k8MJ0RK5j2J8l2QRm5j1j4Q1K4m4M1J9m0J0K2J4j2K9k9r1j6
9948g1QL8M8l1o0Qk5j6J9L3OnK2L7J9j2rr8k3J8OM1j7j6qK2L8Qk0J2O8m6m1LMK9k6Lk9K2j1
$$ plain form
9928 -52 -65 -75 -133 -100 -59 -51 -44 -13 -5 -18 -11 -4 -44 -73 -72 -52 -41 -17 -43 -16 2 -50 -85 -55 -52 -2 -33 -46 -27 -38 -8 38 32 9 3 -45 -67 -15 -20 -28 -54
9909 -54 -62 -57 5 -28 -79 -61 -23 -33 -72 -59 18 5 -3 10 -11 -7 -30 -37 -22 -71 -73 -91 -82 -92 -20 -35 -87 -60 -34 -44 -15 -23 -50 -77 16 7 -40 -64 -64 -70 -105
9889 -105 -57 -27 14 -20 -35 -123 -126 -112 -108 -10 -43 -92 -151 -116 -43 -19 -19 -66 0 24 -18 23 -30 -10 -7 68 44 -28 -2 -34 14 16 -3 -45 -42 -59 -56 -39
9871 -39 -72 -98 -88 -104 -103 -69 -18 -37 -73 -83 -104 -66 -111 -106 -77 -7 -12 -1 -40 10 28 -18 14 13 -68 -117 -91 -52 -6 14 21 -15 -27 -61 -42 -66 -76 -33
9853 -33 -8 -47 -30 -17 48 14 -23 12 19 -35 -7 -36 -104 -131 -48 10 -10 -44 1 21 47 -45 -51 -145 -85 -82 -62 -92 -64 -21 -22 -40 -17 -28 -20 -3 -30 -37
9835 -37 -56 -28 -25 -35 -41 -78 -72 -46 -6 -5 -31 -73 -26 -52 -92 -92 -92 -42 -45 -17 -26 -32 13 4 -5 -34 -8 -27 -122 -174 -100 -45 -36 -107 -91 -88 -94 -133 -67 -61 -47 8 -48
9814 -48 -18 -42 -12 14 19 -63 -26 -52 -64 -24 -46 -12 -88 -84 -56 -43 -31 14 27 65 23 -23 -18 -5 -28 -9 -49 -49 -26 -19 -43 48 46 17 21 -25 -86 -50 -9
9796 -9 -36 -53 -19 24 -7 -51 -52 -34 -19 -65 -86 -32 -34 -24 13 43 9 1 -26 -27 -24 -39 13 17 -23 -48 -66 -60 -16 -31 -18 -108 -128 -65 -121 -153 -111 -81 -89 -7
$$ packed form
9928e2j3j0n8L3M1QPL1Qj3PPm0k9JK0J1K4k6K7J8n2l5L0LN0l1j3J9j1L0M6ok3om8k2N2nqk6
9909e4qNO2l3n1J8L8j0l9J3P7j3qJ3k1Mk3pJ5m9kj8Rj0P2j5n2K7K6j0K9qk7k7R3rm7k4%ol5
9889a05M8L0M1l4j5q8lJ4MR8l3m9n9L5P3K4%m7O6K4m2M1n3K0LP5k4p2K6l2M8Kj9m2Lj7LJ7
9871c9l3k6J0j6JL4N1j9l6j0k1L8m5NK9P0nJ1l9N0J8m6L2jq1m9K6L9M6K0Pl6j2l4J9k4j0M3
9853c3K5l9J7J3O5l4l7L5Pn4K8k9o8k7Q3N8k0l4M5K0K6r2or4O0LK0l0K8M3jj8K3j1QJ7k7p
9835c7j9K8Lj0ol7OK6M0Jk6m2M7k6m0%%N0lK8roM5rrk9K6j9r5n2P4N5Rp1J6Lol9O6OJ4N5n6
9814d8L0k4L0K6Nq2L7k6j2M0k2L4p6MK8J3J2M5J3L8m2m6NJ3k3J9m0%K3Pk4R1kk9Mm6o1L6M1
9796ik7j7L4M3l1m4jJ8J5m6k1N4kJ0L7L0l4qk7jLj5N2Mm0k5j8OM4j5J3r0k0O3n6l2M2L0qQ2
$$ plain form
9777 -7 76 53 -16 43 1 0 -10 -15 -61 -55 -69 36 53 -16 29 37 27 9 10 4 7 28 -16 -61 -36 -72 -42 18 38 18 -26 -33 -13 -13 9 -47 -61 -19 77 40
9758 40 1 8 56 49 2 58 29 29 -2 30 85 53 7 54 62 32 4 -3 17 22 25 66 68 28 -32 -47 -24 39 36 28 57 41 -38 26 19 22 14 48 -1 -15 -3 61
9738 61 37 103 71 39 71 70 51 54 48 73 75 91 78 80 95 105 69 101 141 171 180 96 136 219 237 315 298 380 396 446 476 485 603 699 758 874 1024
9720 1024 1158 1450 1850 2208 2857 3873 5479 8206 13049 20676 28803 31871 27754 20040 13026 8264 5364 3694 2740
9711 2740 2123 1740 1484 1513 1548 1540 1527 1258 901 699 599 534 473 363 334 339 310 295 271 242 234 222 259 283 295 259 243 303 298 258 198 173
9696 173 195 251 215 334 333 279 362 420 440 450 430 517 578 764 848 1037 1203 1430 1762 2243 2853 3876 5523 8308 13189 21060
9683 21060 29583 32767 28313 20174 12941 8082 5215 3633 2655 1980 1511 1231 1001 859 711 618 584 484 453 411 368 370
9673 370 287 185 179 198 233 219 228 293 326 206 201 259 258 261 262 225 220 215 252 246 302 308 277 273 327 356 407 459 532 524 575 654 734 871 938 1186 1464 1823
$$ packed form
9777gQ3k3o9N9m2jj0nm6Oj4J05J7o9M5Qj0j8JoLK1m4m5K5l6L0O0K0k0m4pK0%K2n6j4M2R6l7
9758D0l9PM8pm7N6k9%l1L2N5l2m6M7Ql0k8pK0NLM1Km0o0j5K3O3lqK9j6p9O4pLqL4m9j4J2O4
9738F1k4O6l2l2L2jj9LoK5KJ6j3KJ5J0l6L2M0L0Rq4M0Q3J8P8j7Q2J6N0L0RJ18R6N9J16J50
9720A024J34K92M00L58O49J016J606K727M843P627Q127L068m117p714p014m762k900j670r54
9711B740o17l83k56K9L5qj3k69l57k02j00o5o1j10k9Nk9j5k4k9qj2L7K4J2l6j6O0nm0o0k5
9696A73K2N6l6J19jn4Q3N8K0J0k0Q7O1J86Q4J89J66K27L32M81O10J023J647K785M881P871
9683B1060Q523L184m454q139p233m859k867j582r78o75m69k80k30j42j48r3l4j00l1m2m3K
9673C70q3j02oJ9L5j4RO5L3j20nN8jLJl7nnL7oN6Ol1mN4K9N1N2P3qN1P9Q0J37O7K48K78L59
$$ plain form
9655 1823 2274 2917 3979 5626 8383 13284 21061 29299 32329 28002 20040 12865 8080 5295 3679 2667 2068 1577
9646 1577 1205 1016 870 713 598 554 476 389 345 268 224 253 234 180 211 218 170 123 139 134 96 113 96 131 76 88 80 94 103 83 66 150 66 22
9630 22 33 15 -26 0 42 12 -48 -44 -2 -1 -7 -34 -41 -21 -39 13 -12 22 21 -24 4 36 26 -8 -65 -86 4 -5 -65 -48 17 -1 8 -45 -97 -7 -47 8 -1
9611 -1 -35 -4 -14 -58 -42 -33 5 15 -32 -31 -21 -2 18 24 -27 -44 -35 -96 -82 -32 -14 -39 -42 -72 -104 -89 -70 -34 -59 -49 -53 -69 -53 -57 -32 -61 -91 -54 -46 -70
9592 -70 -49 -57 -42 -66 -53 -66 -68 -34 -69 -105 7 -31 -47 -13 -93 -38 -54 -112 -32 -20 1 12 -59 -120 -87 -26 37 38 -67 -68 -66 -83 -113 -16 -62 -124 -142
9575 -142 -89 -48 -71 -59 -87 -10 -25 -52 11 -20 -81 -62 -69 -125 -95 -37 -28 -5 -65 -128 -105 -82 -76 -75 -72 -58 -32 -91 -14 -42 12 -15 12 -32 -7 -62 -84
9557 -84 -49 17 -41 -57 -70 -59 -80 -42 -60 -29 12 -49 7 46 -40 -36 -40 -36 -39 -45 -67 -33 4 -85 -34 -5 -2 12 -2 23 -28 -45 -17 -55 -125 -155 -51 7
9539 7 -67 -85 -1 -64 -48 -32 -73 -92 -108 -73 -141 -137 -53 10 -64 -46 -26 -35 -17 -15 -33 -27 -44 -47 -44 -81 -23 -67 -43 -74 -60 -55 -75 -91 -59 -21 -50 -54 -128 -102
$$ packed form
9655A823M51O43J062J647K757M901P777Q238L030m327p962p175m785k785j616j012n99m91
9646A577l72j89j46j57j15m4p8q7m4p7m4K9j9n4L1Pm8m7J6nl8J7j7L5n5J2qJ4Rk0j7Q4q4m4
9630B2J1j8m1K6M2l0o0MM2Jok7pK0j8N2k5L4jm5K8L2j0l4n7k1R0ro0J7O5j8Rn3n2R0m0N5r
9611al4L1j0m4J6RL8J0m7JJ0J9K0On1j7Ro1J4N0J8k5ll0l2J5J9L6k5J0mj6J6mK5k9l0L7Qk4
9592g0K1qJ5k4J3j3kL4l5l6J12l8j6L4q0N5j6n8Q0J2K1J1p1o1L3O1O3Jj05jKj7l0R7m6o2j8
9575a42N3M1k3J2k8P7j5k7O3l1o1J9pn6L0N8RK3o0o3K3K3OJLJ4K6n9P7k8N4k7K7m4K5n5k2
9557h4L5O6n8j6j3J1k1L8j8L1M1o1N6L9q6MmMlok2L4L7q9N1K9LJ4j4K5n1j7K8l8p0l0J04N8
9539Gp4j8Q4o3J6J6m1j9j6L5o8MQ4O3p4J8K0rJ8Kj8Oj7lLl7N8m4K4l1J4Nk0j6L2L8k9mp4K6
$$ plain form
9520 -102 14 0 -12 -32 -33 -36 -45 -59 -91 -132 -64 -82 -137 -79 -69 -36 -9 -55 -17 -28 -62 -41 -2 41 40 -35 -52 -57 -53 -20 11 -15 -15 0 30 -27 -44 -51
9502 -51 -6 -74 -71 -96 -81 -68 -34 11 47 -20 -91 -27 18 5 -73 -55 -11 -25 -82 -53 2 2 -69 -14 -56 -78 -82 -85 -79 -22 -82 -135 -48 -4 -8 -19 -34 -1
9483 -1 39 26 1 -57 -59 15 -17 -41 -4 -37 -98 -24 7 -9 -14 -16 -76 -68 -26 -53 -46 -9 -18 -60 -66 -15 -5 -22 -76 -82 -51 -54 -48 -32 -47 -6 -33 -76 -91 -44 -58
9464 -58 -32 -36 -52 39 26 -69 -56 -63 -24 -33 -77 -56 -78 -86 -89 -4 28 6 41 18 -18 -12 -58 -81 -57 -36 -65 -103 -86 -90 -97 -97 -6 -35 -39 -45 8 38 32 43 77
9444 77 43 4 -51 -55 -1 -10 -48 -11 -17 5 -23 -91 -94 -48 -28 -106 -100 -72 -75 -63 -58 -66 -53 -21 -62 10 17 3 -30 -38 -72 13 53 -32 -41 -37 -17 -16 -41 -31 23 56
9424 56 29 -55 -37 -78 -21 -42 15 -17 -46 -12 -58 12 -25 -29 2 30 11 -37 -40 -19 -14 -29 -45 -123 -106 -119 -189 -100 -40 -33 -48 -43 -80 -69 -35 -63 -45 -50
9406 -50 -6 -51 -90 -81 -100 -33 -50 -45 -56 -2 24 -3 -7 55 -20 -36 -19 -9 -1 -50 -80 -43 -18 -46 -4 83 -60 -33 -33 -90 -62 -4 7 27 33 53 63 -25
9388 -25 -74 -53 -31 -43 -99 -42 -57 -5 -16 -8 13 -12 -112 -130 -117 -58 -92 -118 -94 -91 -55 32 19 -50 -67 -25 -44 -91 -58 -64 -90 -79 -9 64 11 -88
$$ packed form
9520a02J16j4j2k0jlrj4l2m1O8j8n5N8J0L3K7m6L8j1l4K1L9M3jp5j7nML3L1k6%J5L0n7j7p
9502e1M5o8Lk5J5J3L4M5L6o7p1O4M5j3p8J8M4j4n7K9N5%p1N5m2k2mlON7o0n3Q7M4mj1j5L3
9483aM0j3k5n8kP4l2k4L7l3o1P4L1j6nko0QM2k7PL7rm2oN1J0j7n4oL1lOJ6j5M1k7m3j5M7j4
9464e8K6mj6R1j3r5J3pL9rm4K1k2qlQ5L2k2L5k3l6Om6k3K4K1k9l8J7mp%R1k9moN3L0oJ1L4
9444G7l4l9n5mN4rl8L7oK2k8o8lM6K0p8OK8lJ2NqJ3L2m1P2Pj4l3ql4Q5M0q5rMK0Jk5J0N4L3
9424E6k7q4J8m1N7k1N7l2k9L4m6P0l7mL1K8j9m8lK1Nj5j6p8J7j3p0Q9O0Pj5Nl7J1L4k8J8n
9406e0M4m5l9Rj9O7j7Nj1N4K6k7mO2p5j6J7J0Qm9l0L7K5k8M2Q7j43K7%n7K8N8J1K0OK0J0q8
9388b5m9K1K2j2n6N7j5N2j1QK1k5j00j8J3N9l4k6K4LL6Q7j3o9j7M2j9m7L3ok6J1P0P3n3r9
$$ plain form
9371 -88 -19 12 -28 -25 -29 13 -7 23 -8 -92 -48 13 -9 1 -48 -56 -46 -81 -81 -44 -32 -36 26 30 14 3 35 18 43 76 29 42 41 44 10 0 -24 -29 11 -4
9352 -4 -61 -33 -52 -33 -56 -12 38 23 -12 -36 -10 -23 -68 -44 -26 -47 -46 13 -6 -59 -21 -11 36 -23 -70 -101 -40 11 -31 -43 -52 -49 -28 -31 -24 -30 -37 -52 -45 -38
9333 -38 -20 -13 -51 -85 -96 -70 -110 -50 3 -2 27 30 57 51 44 48 37 -10 9 4 -16 -5 -28 -33 -39 -103 -31 9 -33 -100 -139 -86 3 -40 -13 -29 -36 -52 -62 -24
9314 -24 -3 -11 -21 -42 -48 -39 -19 -24 -65 -23 -2 -43 -18 -2 -35 -22 -27 -50 -97 -74 -109 -32 -6 -35 -45 -95 -66 -54 -35 -81 15 34 -49 -2 59 39 -22 10
9296 10 3 -39 -31 -30 -21 -24 4 -1 -2 -51 -35 -88 -62 -63 4 15 -2 -27 -22 -30 26 -11 -26 -30 55 81 64 37 -9 61 87 125 113 74 84 117 117 164 310 514
9277 514 783 1352 2676 4071 3958 2505 1264 662 459 281 156 149 168 134 121 116 124 161 90 73 54 20 60 -17 -82 -52 -12 -18 -37
9263 -37 10 8 -28 4 -31 -48 7 15 6 -46 -34 -15 47 24 32 -1 -47 -28 -47 -19 -1 21 30 40 93 67 2 -58 -61 -41 -53 -33 16 -37 -51 -25 -100 -162
9245 -162 -159 -136 -58 -47 -14 12 -18 16 -15 -10 44 -34 -20 -20 3 24 -18 -72 -75 -46 -52 -21 -67 -103 -92 -59 -46 -29 -68 -57 15 -43 -53 -105 -109 -109 -92 -83 -61
$$ packed form
9371h8O9L1m0LmM2k0L0l1q4M4O1k2J0m9qJ0l5%L7J2mO2Mj6j1L2j7K5L3m7J3jLl4j0k4nM0j5
9352dn7K8j9J9k3M4N0j5l5k4K6j3m5K4J8k1JN9j9n3L8J0M7n9m7l1O1N1m2j2rLK1lPopj5PP
9333c8J8Pl8l4j1K6m0O0N3nK9LK7opMj1m7J9nk0J1k3noo4P2M0m2o7l9N3Q9m3K7j6pj6j0L8
9314b4K1qj0k1oRK0nm1M2K1m1K5J6l3J3nk3m7K3l5P7K6k9j0n0K9J2J9m6R6J9q3M7O1k0o1L2
9296A0pm2QJRlK8njm9J6n3K6jO7J1j7k5NqN6l7j5mQ5K6j7k7m6P0K6L8j2l9J0L3%M7J46K04
9277E14K69N69J324J395j13j453j241o02k03j78j25pJ9l4j3nQL7p1j7j9l4M0p7o5L0M0oj9
9263c7M7kl6L2l5j7N5Qrn2J2J9O2k3Ql3m6J9j9K8J8K2RJ0N3k6o5o0lK0j2K0M9n3j4K6p5o2
9245a62LK3P8J1L3K6l0L4l1NN4p8J4%K3K1m2n4lK9oL1m6l6J1L3J3J7l9J1P2n8j0n2m%J7RK2
$$ plain form
9226 -61 -67 -19 65 12 28 55 43 -24 -10 14 15 0 -3 -15 -73 -68 -39 -62 -23 -96 -93 -135 -100 -96 -86 -75 -115 -89 -55 -71 -76 -116 -150 -95 -42 -4 -33 -21 -34
9207 -34 -17 -1 -15 -80 -13 -44 -43 -61 -65 -52 -24 26 -38 -111 -63 -103 -57 -79 -122 -129 -29 -10 -86 -76 -73 -119 -108 -85 -106 -86 -76 -34 -28 -43 -74 -84 -66
9190 -66 -2 0 33 -13 9 -9 -76 -96 -112 -104 -32 -42 -61 -76 29 44 -11 -21 -39 -36 -10 -39 -70 -104 -152 -134 -35 -27 -15 -49 -30 -16 -4 4 -65 -77 -51
9172 -51 -69 -32 -22 11 1 29 -61 -68 -57 -7 -41 -59 -19 66 62 9 -9 -21 31 -35 -63 -46 16 71 -14 -38 -6 -75 -95 -44 -15 -10 18 -21 -22 -74 -23
9154 -23 -22 -28 -50 -35 -86 -97 -57 -24 49 18 -49 -75 -70 -43 -53 -93 -57 -32 -2 -12 -18 -17 -2 -10 -9 25 -25 -74 -16 53 0 -58 -11 10 -13 0 43 25 7
9136 7 8 -59 -65 23 12 -101 -24 -36 -44 -22 -49 -72 -39 -13 -84 -69 -91 -35 -48 -93 -63 -35 3 64 85 42 -27 11 54 39 -51 4 21 -34 -41 14 -12
9118 -12 1 -11 -46 -75 -25 -15 -59 -79 -4 34 35 -13 -91 -1 -28 -78 -53 -51 -58 -43 -66 -84 -38 -36 -52 -47 -11 -16 -34 -56 -70 -55 -8 -42 -8 -83 -59 -50 -68
9100 -68 -89 -45 -40 -45 -47 -79 -97 -22 -14 -45 -50 -57 -63 -71 -77 -125 -89 -46 -32 -58 -94 -58 -74 -56 -23 -66 -2 -42 -23 7 42 2 -41 -76 -109 -74 -94 -62 -64 -72 -83
$$ packed form
9226f1oM8Q4n3J6K7j2o7J4K4Jj5lj2n8NK9k3L9p3Lm2L5MJ0J1m0K6L4j6nm0l4N5N3L8k9J2j3
9207c4J7J6j4o5O7l1Jj8mJ3K8N0o4p3M8m0M6k2m3pJ00J9p6J0Lm6J1K3k1K0J0M2Oj5l1j0J8
9190f6O4KL3m6K2j8o7k0j6QP2j0j9j5J05J5n5j0j8LK6k9l1l4m8J8R9QJ2l4J9J4J2Qo9j2K6
9172e1j8L7J0L3j0K8r0pJ1N0l4j8M0Q5mn3j8j2N2o6k8J7O2N5q5k4L2o9k0N1K9NK8l9jn2N1
9154b3Jok2J5n1j1M0L3P3l1o7k6NK7j0m0L6K5L0j0oJJ5qJL4n0m9N8O9n3n8M7K1k3J3M3j8j8
9136GJo7oQ8j1j13P7j2qK2k7k3L3K6p1J5k2N6j3m5L0K8L8O1K1m3o9L8M3j5r0N5J7n5pN5k6
9118a2J3j2l5k9N0J0m4k0P5L8Jm8p8R0k7n0K5KpJ5k3j8M6Kj6NL6nj8k2j4J5M7l4L4p5K4Rj8
9100f8k1M4Nnkl2j8P5Ql1npoqom8L6M3J4k6l6L6j6J8L3m3O4m0J9L0L5m0m3l5l3L5k0L2kqj1
$$ plain form
9080 -83 -26 -45 -28 9 13 10 -36 -23 -36 -37 -35 -56 -69 1 -6 0 21 -22 -25 -1 -10 3 -8 19 -23 -45 -73 -42 -49 -80 -60 -86 -80 -29 -84 -57 -20 44 0 -26
9061 -26 -42 -119 -89 -75 -28 -13 -127 -106 -40 -40 -88 -60 3 -76 -52 -45 -60 -75 -102 -93 -114 -73 -80 -102 -66 -114 -93 -78 -42 -69 -91 -72 -66 -47 -23 1 2 -79
9043 -79 -131 -90 14 -37 -83 -78 -87 -33 -29 -59 -75 -109 -104 -66 -45 -119 -137 -62 -16 -57 -82 -50 -46 -41 -103 -127 -80 -39 0 -65 -44 -45 -53 -57 -55 16 -23 -74 -88 -78
9024 -78 -49 -24 33 64 19 -7 -16 -25 -34 -22 -61 -39 -18 -59 -71 -103 -105 -129 -123 -79 -6 -6 -19 26 24 -49 -28 -35 -60 -61 -66 -58 -53 4 -44 -75 -101 -75 -76 -70 -61 -79 -117
9003 -117 -51 -23 -87 -121 -81 -81 -88 -76 -42 -45 -10 -9 -17 11 -18 -2 14 -11 -54 -29 -27 -9 -1 -80 -41 -9 12 20 -36 -24 -19 23 2 -60 -55 23 3 3 -32 -46
8984 -46 -108 -55 -76 -85 -23 0 -8 -97 -50 -34 -56 -45 -24 -81 -116 -46 -51 -45 -28 -68 -57 -62 -97 -42 29 -38 -65 4 -23 -28 -113 -86 -6 -47 -56 -42 -45 -34 -43 -75
8965 -75 -38 -1 -26 -73 -145 -73 22 -49 -54 -97 -113 -53 -15 -47 -57 -82 -74 -36 -19 -80 -97 -43 -17 18 32 -47 -83 -53 -46 -38 -43 -22 23 3 1 -14 -16 -6 -27
8947 -27 -5 -32 -24 -63 -64 -47 -10 -8 -29 -29 -21 -33 -30 3 5 4 -19 -26 22 82 31 36 57 83 -14 -33 31 52 26 17 -56 -20 -69 -65 -1 -27 -44 -72 -42 -75 -9
$$ packed form
9080h3N7j9J7L7Mlm6J3j3jKk1j3P0pOK1m3lK4rJ3j1K7m2k2k8L1pl1K0k6ON1n5K7L7O4m4k6
9061b6j6p7L0J4M7J5j14K1O6%m8K8O3p9K4Pj5j5k7Rk1M1pk2L6m8K1J5L6k7k2J9OJ9K4K4Jq1
9043g9n2M1J04n1m6NrN4Ml0j6l4NL8K1p4j8P5M6m1k5L2MNo2k4M7M1L9o5K1jqmKP1l9n1j4J0
9024g8K9K5N7L1m5k6rrrJ2l9K2K1m1j2l2kk4OM4P3%j3M5kp3K1pk5jnQNN7m8l1k6K6jORj8l8
9003a17O6K8o4l4M0%pJ2L4lL5JqK8k9J6J6k5m3K5KJ8Qp9L9L2K1Qn6J2NM2k1o2NP8k0%l5j4
8984d6o2N3k1rO2K3qq9M7J6k2J1K1n7l5P0nOJ7m0J1nl5N5P1o7k7O9k7nq5K7Q0m1rJ4lJ1rl2
8965g5L7L7k5m7p2P2R5p1nm3j6O0L8l2j0k5QL8J7o1j7N4K6L5J4p9l6L0PQnK1M5k0kj5kJ0k1
8947b7K2k7Ql9jJ7L7Kk1%Qj2LL3Kjk3pM8O0n1NK1K6r7j9O4K1k6rp3L6m9MO4k6j7k8L0l3O6
$$ plain form
8927 -9 -5 -18 -42 -49 -22 -31 -18 -35 12 -21 -54 -74 -52 -62 -24 -30 -22 -60 -22 -55 -157 -80 -81 -105 -85 -36 -41 -32 -83 -83 -93 -67 -56 -20 -78 -70 -49 -60 -58 -10 -27
8907 -27 -93 -89 -113 -88 2 -22 -18 -68 -23 -21 -35 -21 2 -24 3 32 40 38 -43 -24 40 17 -36 -51 -51 -66 -104 -147 -78 -5 -52 -87 5 -28 -32 -68 -34 10 12
8889 12 -31 -9 -14 43 28 -49 -41 25 8 45 66 10 10 -95 -84 -65 -32 -57 -20 -8 -37 -86 -85 -53 -71 -75 -77 -94 -157 -175 -158 -94 -110 -25 -17 -27 6 -17
8871 -17 -25 -4 -100 -83 -35 -37 -13 -2 -13 -52 -65 -49 5 -27 -50 -59 -86 -68 -41 -83 -60 -40 -75 -44 -44 -36 -81 -84 -103 -62 -46 -49 -43 -27 -22 -37 -89 -60 -51 -79
8852 -79 -61 -56 -91 -77 -39 -54 -28 -14 -28 -44 -35 -70 -40 -7 -60 -52 -71 -44 -82 -59 -13 -87 -90 -53 -83 -78 -98 51 71 12 15 27 -29 -3 4 -45 -120 -73
8834 -73 -9 -16 -46 -41 -31 -33 0 -80 -86 -72 -50 -102 -79 -9 -40 -45 -28 0 21 0 -38 -75 -92 -87 -46 -9 -46 -78 -50 -29 -62 -38 -18 -12 -27 -93 -70 -5 -54
8815 -54 -52 -85 -91 -66 -5 -36 -38 -28 33 14 -29 -44 2 35 44 34 -17 30 70 47 4 -58 -71 -71 -81 -82 -52 -33 -4 -32 -25 -1 -63 6 24 -40 -62 -82 -49
8796 -49 -77 -88 -81 -70 -17 -54 -91 -66 -96 -66 -20 -8 10 37 -4 -37 -14 -64 13 -10 -30 -55 -65 -15 1 -39 22 8 14 46 42 5 -42 -55 -35 -18 -68
$$ packed form
8927iMj3k4pK7rJ3j7M7l3l3k0K2j0L8oQl8L8l3j02P7jk4K0M9nRn1%j0K6J1L6n8QK1j1KM8j7
8907b7o6Mk4K5R0k4Mn0M5Kj4J4K3k6K7K9Qkq1J9O4k3n3j5%j5l8m3O9P3m7l5R2l3ml6L4M4K
8889A2m3K2nN7j5p7QO6j7L7K1n6%j05J1J9L3k5L7J2k9m9JL2j8mkj7o3j8J7O4j6Q5Qj0L3k3
8871a7qK1r6J7M8kK4J1j1l9j3J6N4l2k3rk7J8K7m2K3K0l5L1%Qm5lj9M1J6lOJ6Nj5n2K9Rk8
8852g9J8Nl5J4L8j5K6J4j4j6Rl5L0L3n3Qj9K7l8K3M6p4lL7l0Nk0J49K0n9LJ2n6K6Pm9p5M7
8834g3O4pl0NJ0kL3q0oJ4K2n2K3P0l1nJ7K8K1k1l8l7j7NM1L7l7l2K8K1l3K4K0Oj5o6K3O5m9
8815e4Kl3oK5O1l1kJ0O1j9m3j5M6L3Rj0n1M7M0k3m3o2j3%j0jL0J9K9k8PK4o2O9J8o4k2k0L3
8796d9k8j1PJ1N3l7l7K5l0L0M6J2J8K7m1l3K3n0P7k3k0k5j0N0J6m0O1j4OL2ml7m7j3K0J7n0
$$ plain form
8779 -68 -43 -27 -46 -50 -9 14 61 36 -45 -33 -33 -25 -76 -80 -63 -44 -1 13 -59 -42 -21 33 -36 -131 -91 -25 -27 -25 44 10 -33 -98 -81 -34 -29 -32 -84 -58 -18
8760 -18 -16 -44 -106 -69 -11 12 60 17 64 34 -33 -13 -11 49 54 31 -69 -78 -38 -25 -41 -43 -34 -19 1 63 28 -17 -72 -135 -118 -102 -120 -143 -55 -79 -95 -78
8742 -78 -24 -43 -41 -84 -21 12 -25 -39 -50 -61 -63 -94 -110 -159 -136 -56 -31 -67 -29 -64 -33 -60 -27 -95 -112 -39 4 31 -26 -71 -17 -57 -121 -96 -53 -3
8725 -3 16 -24 -81 -127 -111 -96 -76 -70 -46 -14 -3 -42 -81 -46 -97 -54 -32 -43 11 34 -45 -74 -77 -86 -59 -25 -38 -63 -90 -44 -53 -53 -2 9 -41 -57 -41 -45 -32
8706 -32 -86 -118 -97 -84 -157 -94 -113 -68 -77 -86 -90 -84 -23 4 -9 -70 -61 -3 2 -13 -37 -59 -86 -58 -5 -15 34 39 10 -49 -63 -58 -56 1 -26 -31 -17 -49 -38 -43 -52
8687 -52 -85 -57 -42 -23 -83 -136 -152 -113 -23 -90 -72 -41 -7 20 -14 -87 -55 -34 3 -88 -91 -75 -89 -82 -88 -76 -64 -15 9 -2 -31 -54 -8 -14 -26 -34 -44 -44
8669 -44 -23 -69 -86 -19 12 -71 -44 -81 -44 -17 -35 -17 6 -28 -21 -43 -66 -139 -100 -28 -78 -86 -95 -28 -40 -71 -77 -79 -61 -114 -64 -68 -10 -49 -128 -73 -31 0
8650 0 17 10 -18 -36 -53 -56 39 21 -1 26 -20 -9 22 -22 -101 -99 -44 -38 -34 -39 -29 1 14 -10 -48 -1 -75 -73 -43 -77 -55 -138 -95 9 37 30 -12 -8 -176
$$ packed form
8779f8K5J6j9mM1K3M7k5q1J2%Qn1mJ7J9M3J4p2J7K1N4o9r5M0O6kKO9l4m3o5J7M7Nln2K6M0
8760a8Kk8o2L7N8K3M8m3M7l0o7K0KO0Nk3j00rM0J3j6kRJ5K0O2l5m5n5o3J7J6j8k3Q8k4j6J7
8742g8N4j9Km3O3L3l7j4j1j1kl1j6m9K3Q0K5l6L8l5L1k7L3o8j7P3M3K7n7m5N4m0o4K5M3N0
8725cJ9m0n7m6J6J5K0OK4L2J1l9l9L5n1M3K2j1N4K3p9k9lrK7L4j3k5k7M6r%N1J1n0j6J6mJ3
8706c2n4l2K1J3p3O3j9M5rrmOO1K7j3o1RN8Nj5k4k2k7K8N3j0M9Nk9n9j4NKN7k7nJ4l2J1nr
8687e2l3K8J5J9o0n3j6L9R0o7J8L1L4K7l4p3L2K1L7r1lJ6j4PoJ2J2M9K4j1k9k3M6oj2qj0%
8669d4K1m6j7O7L1q3K7l7L7K7j8J8K3l4Pk2k3p3L9P2n0qrO7j2l1okJ8n3N0mN8l9p9N5M2L1
8650@J7pk8j8j7lR5j8k2K7m6J1L1m4p9KN5OMnJ0L0J3k4l8M7p4KL0l4K2q3M3J04K8pm2Mj68
$$ plain form
8632 -176 -128 -59 -70 -120 -72 -52 -90 -90 -30 -14 -46 -60 -41 -8 -62 -48 -54 -17 -39 -111 10 -4 -12 -33 -119 -108 -132 -89 -54 -61 -79 -119 -74 -41 9 26
8615 26 16 -6 -59 -46 -26 -59 -22 -36 17 -17 28 8 -23 -15 -47 -71 -111 -116 -106 -19 15 -49 -55 -47 -76 -69 -64 -66 -41 -85 -83 -47 -41 10 12 -17 -42 -66 -67 -92 -27
8595 -27 22 2 22 13 24 -73 -118 -71 -59 -110 -102 -59 -70 -14 -20 11 29 38 35 28 59 -8 -65 -54 -7 11 -43 -109 -89 -59 -46 -19 -46 -80 -119 -96 1 -56
8577 -56 -134 -95 -5 -31 -60 -7 -19 -22 -1 -43 -89 -48 -39 -59 -57 -93 -75 -79 -90 -56 -38 -24 -28 -52 -25 6 20 -15 -44 -24 -36 -34 -37 -33 -48 -89 -82 -51 -18 5
8558 5 31 -18 -16 -68 -83 -29 -28 -53 -24 0 -26 -47 -79 8 -19 2 -91 -117 -97 -87 -41 -59 -95 -102 -87 -54 -15 -28 14 7 -8 -43 -23 -54 -105 -94 -57 -41
8540 -41 -42 -47 -49 -103 -95 -70 -52 -30 -1 -19 -5 5 13 -1 11 -85 -61 -40 -54 -60 -5 -14 -44 -53 -32 -57 -91 -78 -81 -28 -29 -70 -32 -35 -56 -43 -2 -1 -65 -72 -84 -35
8520 -35 -52 -15 49 -33 -12 40 28 -36 -69 -71 -93 -38 -10 -84 -44 -39 -55 -66 -26 -50 5 49 53 51 41 83 -6 -81 -18 -8 -25 -57 -111 -126 -79 -26 -15
8502 -15 -1 13 49 24 -52 -71 -37 -10 35 49 -40 -104 -30 -63 -12 -64 -115 -54 -50 -50 13 36 -18 -64 -68 -21 -13 -33 20 -27 -29 -9 -68 -30 -25 -63 -9 -38
$$ packed form
8632a76M8O9j1n0M8K0l8%O0J6l2j4J9L3n4J4oL7k2p2J21j4qk1q6J1k4M3L5pj8m0M5L3N0J7
8615B6j0k2n3J3K0l3L7j4N3l4M5k0l1Ql2k4m0nJ0Q7L4o4oQk9PNkK5m4KL6ON1Kk9k5k4jk5O5
8595b7M9k0K0rJ1r7m5M7J2n1QM3j1N6oL1J8RlpL1o7n7J1M7J8n4o6K0L0J3K7k7l4l9K3R7n7
8577e6p8L9R0k6k9N3j2lK1m2m6M1Rk0Kl6J8mj1L4J8J4mk4K7L1J4l5k9K0j2KlMj5m1PL1L3K3
8558EK6m9Kn2j5N4Jk5K9K4k6k1l2Q7k7K1r3k6K0J0M6j8l6pJ5L3L9j3M2pj5l5K0l1n1J1L7J6
8540d1jnkn4QK5J8K2K9j8J4J0Qj4J2r6K4K1j4oN5rl0rK1k5l4J3lN3jm1L8lk1J3M1Jo4pj2M9
8520c5j7L7O4q2K1N2j2o4l3kk2N5K8p4M0Nj6j1M0k4N5M4Mkj0M2q9p5O3J0j7l2n4j5M7N3J1
8502a5J4J4L6k5p6j9L4K7M5J4q9o4P4l3N1n2n1O1M%O3K3n4m6mM7Qk0N3m7kK0n9L8Nl8N4k9
$$ plain form
8484 -38 -61 -32 -40 -59 -65 -54 -45 -68 -135 -92 -10 -6 58 -7 13 -33 -9 -4 -74 -85 -34 -71 -69 -79 -70 -37 -12 -13 -14 -29 -50 -70 -66 -87 -129 -76 -33 -21 -26 19 -37
8464 -37 -31 -47 -67 -87 -97 -60 -72 -61 -29 -76 -43 -63 -41 9 11 41 32 -53 -66 -65 -59 -47 -34 -94 -100 -24 -48 -85 -73 -33 -47 -32 -66 -56 -61 -14 -18 -68 -64 -95
8445 -95 -43 36 -5 -24 -52 -15 -47 -56 -36 -44 -11 -48 -67 -95 -78 -66 -35 14 -33 -17 36 37 40 6 -4 29 36 12 -8 39 15 -54 -92 -67 -37 -70 -88 -32
8427 -32 -14 24 7 -47 -48 -40 -32 -71 -120 -81 -34 -105 -101 -171 -114 2 11 7 5 -14 -52 -64 -66 -66 -52 -61 -39 -86 2 37 18 -39 -5 47 -47 -56 -35 -32 -83 -63 -54
8408 -54 0 -57 -85 -74 -67 -51 -96 -82 -43 2 26 10 4 -57 -96 -41 -23 -75 -36 28 62 -50 -83 -54 -33 -33 -28 -82 -70 -70 -73 -90 -130 -43 4 11 -49 -68
8390 -68 -65 -15 -21 -14 -52 -39 -42 -34 -19 -67 -58 -79 -89 -56 -85 -45 -52 0 18 -32 -39 -22 12 2 39 1 -17 -49 -75 -7 11 -14 -79 -94 -48 -50 -71 -100 -69 -27
8371 -27 -17 -57 22 -13 -43 -55 -18 -47 -65 -51 -78 -59 -85 -17 -40 -17 -2 -31 -61 -75 -68 -57 -63 -85 -30 -15 47 64 45 -24 30 48 85 29 -34 -51
8353 -51 -77 16 11 -38 -109 -48 -1 -4 -61 -95 -56 6 6 7 -46 -32 -8 -48 -7 8 -2 -26 -28 -39 -68 -41 -24 -59 -22 27 -41 -73 -63 -38 -32 -35 2 -10 -4
$$ packed form
8484c8k3K9qj9oJ1Rk3o7M3Q2MO4o5K0m6K4Np0j1N1l7Kj0RL3K5jjj5k1k0Mk1m2N3M3J2nM5n6
8464c7Oj6k0k0j0L7j2J1L2m7L3k0K2N0KL0rq5j3JOJ2J3o0oP6k4l7J2M0j4J5l4J0nM7mn0Ml1
8445i5N2P9m1j9k8L7l2rK0qL3l7j9k8J7J2L1M9m7J6N3JLl4j0L3Pk4k0M7k4o9l8K5L0l3j8N6
8427c2J8L8j7n4jQQl9m9L9M7p1Mp0N7J16Rmkj9l8j2k%J4rK2m7Q8L5j9n7L4N2r4rK1Ln1K0R
8408e4N4n7k8J1PJ6m5J4L9M5K4j6oo1l9N5J8n2L9O4L4j12l3K9K1%Nn4J2%lj7m0Q7M7Po0j9
8390f8LN0oPl8J3lQJ5m8Rk1j0L3k9M0pN2J8n0pJ7L4j0L7l8j8l2k6O8J8k5o5j5M6kk1k9L1M2
8371b7J0m0P9l5l0j2L7k9j8J4k7J9k6O8k3K3J5k9l0j4PJ1ok2N5J5O2J7j9o9N4J8L7n6o3j7
8353e1k6R3nm9p1O1M7ln7l4L9O2%Jn3J4K4m0M1J5j0k4kj1k9K7J7l5L7M9o8l2J0K5OlL7j2O
$$ plain form
8335 -4 -25 -68 -22 48 21 -38 -30 9 8 -7 -37 -85 -94 -26 -32 -11 -36 2 -49 -77 -102 -69 -33 -38 2 9 -54 -69 -44 -39 -30 -19 -28 -50 -57 -31 -48 -9 6 -37 -70
8315 -70 -65 -52 -59 -105 -144 -143 -55 -5 -29 -4 10 -30 -87 -8 -45 -109 -111 -19 -63 -91 -75 -19 -69 -67 -75 21 1 -39 -62 -89 -29 -16 -92 -87 -99 -72 -93 -58 -11
8297 -11 -23 22 -37 -90 -44 -50 -75 -86 -72 -63 -68 -78 -25 -52 -37 -17 -3 -41 -50 -47 16 45 20 1 52 20 6 -3 35 -54 -36 -47 -34 -36 -79 -75 -68 -52 -42 -31
8278 -31 -57 -23 -11 -30 -11 -56 -116 -25 -48 -40 33 -39 -85 -97 7 17 -24 -20 -31 -43 -71 -149 -95 -26 -61 -12 -4 7 -26 -32 -57 -77 -43 -25 20 27 -11
8260 -11 -11 -20 -21 -37 -38 -77 -89 -128 -99 -71 -76 -99 -78 -59 -114 -71 -39 -70 -80 -2 -88 -72 -16 8 -17 25 29 -17 -13 14 -28 -24 -36 -47 -28 -76 -89 -62 -84
8241 -84 -58 -23 -85 -130 -82 -6 -66 -143 -102 -71 -44 -36 16 -29 -86 -53 -11 -74 -187 -119 -96 -95 -91 -46 -11 -17 9 -28 -59 -45 -40 -59 -78 -53 -56 -52 -19 -23 -73
8223 -73 -93 -57 41 -42 -47 -47 -81 -93 4 -33 -13 45 -2 -18 -60 -29 -22 -83 -110 -153 -195 -133 -74 -163 -156 -99 -56 -88 -29 -62 -104 -61 -48 -62 -10 -10 -33 -34
8205 -34 -51 -23 -32 8 -53 -41 -40 -117 -64 -82 -77 -82 -51 -71 -54 9 -32 -43 -66 -123 -46 -40 -23 -85 -59 -27 -2 -5 -18 -27 -81 -152 -105 -27 -77 -96 -67 -52 -76
$$ packed form
8335dk1m3M6P0k7n9QL9jj5l0m8rO8oK1k5L8n1k8k5L3L6nM0Po3j5K5NRJ1rk2pK6j7L9J5m3l3
8315g0NJ3pm6l9JQ8N0k4K5J4m0n7P9l7o4kR2m4k8J6N6n0KqR6k0m0k3k7O0J3p6Nj2K7k1L5M7
8297a1j2M5n9n3M6ok5j1J4Rnj0N3k7J5K0J4l8rLO3K9k5j9N1l2j4rL8q9J8j1J3km3MPJ6J0J1
8278c1k6L4J2j9J9m5o0R1k3QP3p2m6j2J04J0m1Mj1j2k8p8N4O9l5M9QJ1l3ok5k0L4J8M5Pl8
8260a1%rjj6jl9j2l9K9K8nk3K1J9n5M3L2l1j0P8q6J6N6K4k5M2Mm6MK7m2Mj2j1J9m8j3K7k2
8241h4K6L5o2m5M8P6o0p7M1L1K7QN2m5n7L3M2o3j13O8K3JMM5L5oK6l7l1J4Nj9j9K5lML3mn0
8223g3k0L6R8q3n%l4j2R7l7K0N8m7j6m2L1Po1k7m3m2O2N9q9PN7M3l2N9l3m2M3J3j4N2%k3j
8205c4j7K8rM0o1J2Jp7N3j8NnL1k0J7O3m1j1k3n7P7OJ7o2K6L2K5lj3rn4p1M7P8n0j9K9J5k4
$$ plain form
8186 -76 -80 -54 -63 -62 -110 -29 -29 -69 -88 -54 -17 -67 -54 -2 20 0 15 21 -56 -90 -59 -39 -76 -53 -36 -32 -48 -118 -79 -99 -61 -62 36 21 9 -1 -79 -15 -28
8167 -28 -50 -27 -42 -71 3 -22 -68 -54 -4 -10 -15 -28 -25 -13 9 7 -19 -23 -56 -32 17 -25 -70 -69 19 25 -9 16 -10 -17 -32 -89 -61 -49 -2 -45 -82 -68 -26
8149 -26 -79 -44 -89 -61 -40 -50 -60 -52 3 36 10 21 18 -4 -18 -47 -28 25 69 47 -29 -66 -36 -91 -91 -126 -72 -98 -91 -68 -116 3 -12 -54 -31 -63 -25
8131 -25 -47 -47 -40 -1 -55 -73 -65 -96 -78 -89 -59 -48 -73 -48 -22 -5 37 25 -1 -12 -4 -26 21 50 -17 -72 -80 -52 -69 -60 -105 -63 -29 -58 -23 7 31 -46
8113 -46 16 -35 -5 4 -44 -56 -70 -96 -119 -32 6 -45 -47 -78 -91 -78 -63 -74 -37 -16 -14 -32 -26 20 2 -17 -10 -22 -15 -34 -36 -36 -20 -3 -69 -6 5 -67 -23
8094 -23 15 1 72 18 -29 -10 39 12 -50 -112 42 54 -6 -25 -40 -19 32 -30 -47 -61 -50 -36 -36 -42 -72 -13 5 -21 -74 -17 -27 2 15 21 -50 -81
8077 -81 -45 -7 25 -34 -81 -71 -57 -70 -48 -51 -85 -67 -20 15 -5 -70 -142 -121 -90 -53 -22 -63 -111 -106 -85 -66 -28 27 11 13 -26 -29 -64 -50 9 -22 -76
8060 -76 -135 -97 -76 -85 -103 -122 -94 -21 -65 -91 -26 2 -31 -11 -39 -35 -52 -50 4 -3 -105 -70 -109 -97 -48 -11 -52 -11 1 -25 -71 -14 2 -14 -55 -110 -95
$$ packed form
8186g6mK6rJm8Q1%m0j9L4L7n0J3N2K2k0J5Op7l4L1K0l7K3J7Mj6p0L9k0L8jR8j5j2j0p8O4j3
8167b8k2K3j5k9P4k5m6J4N0onj3LJ2K2kk6ml3K4M9m2m5JQ8Ol4K5k6pj5n7K8J2M7m3l7J4M2
8149b6n3L5m5K8K1j0j0QN5L3k6J1lk2j4k9J9N3M4k2p6l7L0n5%l5N4k6PK3m8J19j5m2K3l2L8
8131b5k2%PL9n4j8Ql1J8j1L0J1k5K5K6J7M2j2k6j1Qk2M7K9o7n5qK8j7Rm5M2L4k9L5L0K4p7
8113d6O2n1L0Rm8j2j4k6k3Q7L8n1kl1j3J3J5j1L7K1Kj8OM6j8j9Pj2Pj9k%J6J7o6O3J1p2M4
8094b3L8j4P1n4m7J9M9k7o2o2J54J2o0j9j5K1N1o2j7j4J1J4%ol0N9J8k6n3N7j0K9J3Op1l1
8077h1L6L8L2n9m7J0J4j3K2ll4J8M7L5k0o5p2K1L1L7L1m1m8NK1J9L8N5j6Kl9ll5J4N9l1n4
8060g6n9L8K1rj8j9K8P3m4k6O5K8l3K0k8Mj7KN4pj02L5l9J2M9L7m1M1J2k6m6N7J6j6m1n5J5
$$ plain form
8042 -95 -9 -2 -5 -24 -61 -48 -79 -97 -56 -51 -80 -68 -31 -19 -77 -108 -63 -41 39 13 -55 -32 55 29 -10 14 8 -74 -53 -34 1 69 8 -12 3 -7 -5 -45
8024 -45 -25 -21 -13 -36 -50 -64 -67 -61 -90 -36 -29 -54 -20 5 -43 -34 5 -4 -43 -28 -24 -22 -25 -50 -33 -42 -33 -114 -59 -46 -77 -104 -98 -93 -57 -51 -15 15 -5 -79 -115 -75 -65
8003 -65 -17 -44 -21 11 82 26 -66 -104 -89 -59 -16 -25 -67 -38 -64 -96 -58 -29 -75 -117 -109 -32 -58 -97 -70 -39 -34 -68 -62 -59 -55 -38 -24 -71 -146 -105 -73 -19
7985 -19 -35 -62 -32 -40 -27 -56 -69 -70 -43 -7 -41 -44 -44 -24 -43 -86 -74 -13 -2 -13 -58 -50 -70 -76 -61 -81 -23 -7 -6 -46 17 -2 -26 7 17 20 -24 -61 -51
7967 -51 1 -65 -41 -53 -5 4 -2 -42 7 72 15 -42 -26 -26 -7 -8 11 -16 -10 4 -51 -75 -58 -52 -65 -110 -71 -39 -56 -59 -44 -47 -70 -73 -21 -5 -50 2 -4 -76
7948 -76 -51 -41 -45 22 47 38 -17 -10 -18 -17 -67 -15 -46 -54 -52 -41 -15 -34 -4 -87 -79 -80 -78 -67 -73 -77 -13 -46 -73 -64 -22 19 -11 -21 -40 -3 12 -39 -109 -116 -86 -29
7928 -29 -15 -40 -23 -38 -92 -79 -66 -28 -47 -70 -70 -43 -36 -44 -33 -61 -39 14 41 21 -9 -20 -48 -67 -135 -83 -48 -69 -29 -65 -60 -45 -15 -48 -51 -71 -122 -159
7909 -159 -72 -79 -101 -42 -54 -50 -40 5 40 11 15 20 -17 28 33 -11 -18 -3 -50 -32 -22 -67 -34 -5 -29 -62 -28 -12 6 2 67 7 -32 20 8 -63 -107 -143
$$ packed form
8042i5Q6Plj9l7J3l1j8M1Nk9J2L7J2n8l1M5K2Q0k6o8K3Q7k6l9K4oq2K1J9L5O8o1k0J5j0Km0
8024d5K0MQk3j4j4lOk9N4Pk5L4K5m8RL9rl9J5MKlk5J7rRq1N5J3l1k7ONL6OL6L0k0p4l6M0J0
8003f5M8k7K3L2P1n6r2l8J5L0M3rm2K9k6l2L8K9m6m2QP7k6l9K7L1Nl4OLMJ7J4m7p5M1L2N4
7985a9j6k7L0qJ3k9j3jK7L6l4l%K0j9m3J2O1J1j1m5Qk0oJ5k0N8J6Jm0O3j9k4L3J0Lm4l7J0
7967e1N2o6K4j2M8Rom0M9O5n7n7J6%J9jJ9k7OJ4n5k4J7Oj3m5L9L2j7lJ5lk3lN2J6m5N2op2
7948g6K5J0mO7K5rn5PqJn0N2l1qKJ1K6j9L0q3QjKJ1omO4l3k7RM2M1l0j0j9L7J5n1p0pL0N7
7928b9J4k5J7j5n4J3J3L8j9k3%K7PqJ1k8K2N3K7k0l0j1k8j9o8N2L5k1M0l6NJ5L0l3lk0n1l7
7909a59Q7pk2N9j2MJ0M5L5k9MNl7M5Nm4pJ5m7J8J0m5L3K9k4l3L4J6J8mO5o0l9N2j2p1m4l6
$$ plain form
7891 -143 -93 -64 -6 30 23 -8 -53 -24 -54 -63 -4 -40 -104 -89 -101 -97 -17 12 -49 -41 -14 -157 -81 -8 -17 -60 -63 -81 -42 35 45 42 -12 -36 4 -28 -26 -44
7873 -44 -14 23 -46 2 41 -24 -55 -86 -37 -78 -110 -71 -32 -59 -81 -65 -24 -80 -121 -43 -8 -77 -102 -97 -112 -118 -100 -59 -40 -27 -64 -34 3 -6 -10 17 -27
7856 -27 -57 -34 -14 9 -27 -65 -73 -79 -63 -84 -103 -122 -110 -90 -129 -85 -46 -51 -58 -99 -61 -95 -61 -75 -63 -62 -128 -65 -55 -90 -41 -85 -61 -8 -10 -12 -75 -51 -37
7837 -37 -45 -37 -63 -83 -58 -78 -10 -29 -57 -59 -50 -73 -106 -62 3 -28 -51 -5 -9 -25 -73 -52 -30 -22 8 31 35 -29 -95 -76 -80 -75 -85 -23 -61 -72 -21 5 11 -9
7818 -9 -14 -8 -43 -12 -60 -91 -69 -116 -111 -68 -72 -45 -24 -63 -65 -86 -38 -39 -91 -96 -39 -21 -35 -46 -29 -93 -71 -9 32 -50 -15 -51 -12 38 -28 -6 23 4 -38
7799 -38 -83 -74 -108 -88 -26 -27 -51 -80 -64 -88 -37 -39 -58 -59 -107 -87 -77 -85 -71 -79 -70 -63 -41 -61 -26 -65 -17 -34 -23 -25 -45 -16 -37 -12 -6 -28 -39 -40 -15 -36 -61
7780 -61 -35 -103 -110 -81 -82 -125 -62 -68 -103 -38 -38 -17 -16 -66 -68 -18 -51 -18 2 -43 -32 -11 -46 -36 -77 -102 -69 -70 -84 -69 -85 -38 -33 -37 -36 -26 -5 -18 -37 -84
7761 -84 -78 -38 18 35 0 -6 -69 -114 -23 31 -6 -19 -13 -66 -64 -28 4 -38 -27 -42 -55 -56 -77 16 7 -44 -39 3 -23 -13 -53 -25 -128 -134 -69 -43 -14 17 1
$$ packed form
7891a43N0K9N8L6pl1m5K9l0rN9l6o4J5j2MQ0K9o1QK7j43P6P3rm3lj8L9P7J0ln4k4M0l2Kj8
7873d4L0L7o9M8L9o5l1l1M9m1l2L9L9k7k2J6M1n6m1P8L5o9k5Nj5oJ8M1J9J3l7L0L7rmK7m4
7856b7l0K3K0K3l6l8qoJ6k1j9j9J2K0l9M4L9npm1L8l4L4j4J2Jo6O3J0l5M9m4K4N3kko3K4J4
7837c7qQk6k0K5k0O8j9k8kRk3l3M4O5l1k3M6mj6m8K1K2QL0K3Mo4o6J9mNj0O2l8j1N1K6Ok0
7818inOl5L1m8l1K2m7NM3mK7K1l9kk1M8jn2nN7J8j4j1J7o4K2O2M1q2L5l6L9N0o6K2K9j9m2
7799c8m5Rl4K0O2jk4k9J6k4N1kj9jm8K0J0qJ4qRPK2k0L5l9M8j7J1kk0K9k1K5Ok2j1jK5k1k5
7780f1K6o8pK9jm3O3ol5O5%K1Jn0kN0l3L3K0m5J1K1l5J0m1k5L3jj4J5j6M7NmJJ0K1j3j9m7
7761h4OM0N6J7l5oo3m5R1N4l7j3On3KL6L2m2J1j5j3jk1R3rn1NM2k6J0m0K8j03oO5K6K9L1j6
$$ plain form
7742 1 21 -11 43 -11 -60 -76 -20 26 -94 -130 -41 -21 13 6 12 35 -30 -80 -28 -10 -35 -23 22 6 -18 -41 -52 -118 -105 -54 -58 -61 -55 -73 -46 -47 -77 -15
7724 -15 32 60 -12 -18 -9 -18 -54 -59 16 35 13 -6 5 -22 -19 -24 -68 -77 -24 -42 -24 -43 -30 24 21 -56 -66 -49 -45 -44 -51 12 30 -40 -52 -53 -69 -66 -97 -100 -58 -65 -90
7703 -90 -111 -42 10 -73 -53 -40 -22 -14 -21 -6 2 55 -3 -38 -45 3 13 13 33 39 -4 -8 46 -21 -36 -76 -66 -64 -61 -86 -85 -40 -3 -34 -55 -80 -37 -9 -26 -43
7684 -43 -78 -92 -33 11 25 4 -82 -90 -62 -75 -74 -71 -38 -11 -59 -37 -3 14 -17 -57 -100 -117 -49 -60 -76 -56 -48 -5 -19 -24 -43 -112 -22 -41 -60 -90 -89 -81 -94
7666 -94 -26 -53 -69 -23 -5 5 -48 -14 6 22 -31 -15 -20 -19 20 -29 -61 -73 -131 -140 -53 -43 -92 -59 -48 -63 -80 -49 -75 -119 -86 -25 -10 -46 -31 -57 -38
7648 -38 -42 -29 5 -52 -13 0 -10 -39 -31 3 -65 -20 -52 -21 -55 -23 30 38 -20 -49 -76 -16 -14 -6 42 36 -33 8 6 -33 -58 -34 11 37 50 45 16 -54 -33
7630 -33 -55 -12 -1 -57 -109 -73 -68 -99 -32 -40 8 0 3 34 29 -53 -83 -43 -7 7 -31 -46 -82 -53 -29 -27 -82 -75 -77 -97 -40 -8 -19 -80 -79 -74 -59 -20 -10 -64
7610 -64 -40 -25 -62 -41 19 -25 -69 -76 -63 -81 -92 -50 -71 -123 -35 -46 -91 -60 -41 -25 -57 -65 -47 -19 -25 -51 -6 -63 -82 -35 -69 -9 -23 -32 -54 -83 -95
$$ packed form
7742AK0l2N4n4m9j6N6M6j20l6Q9K0L4pOK3o5n0N2J8k5J2M5j6k4k3j1o6J3N1mlOj8K7jl0O2
7724a5M7K8p2oRrl6nP5J9k2j9J1k7Lnm4rN3j8J8j9J3N4lp7j0J7MJpO3J8p0j2jj6Ll1lM2pk5
7703i0k1O9N2q3K0J3J8QpJ5QN3n8l5pM8J0%K0Om3mN4o7j5m0J0KLk5JM5L7l1k1k5M3K8j7j7
7684d3l5j4N9M4J4k1q6qK8j3JLL3K7m8K2L4J7l1m0m3j7O8j1j6K0QM3j4nj9o9R0j9j9l0JQj3
7666i4O8k7j6M6J8J0n3L4K0J6n3J6nJL9m9l2j2n8rQ7J0m9L3J1j5j7L1k6m4L3O1J5l6J5k6J9
7648c8mJ3L4n7L9J3j0k9QL4o8M5l2L1l4L2N3Qn8k9k7O0KQM8oo9M1kl9k5K4M5K6J3nk9p0K1
7630c3k2M3J1n6n2L6Nl1O7qM8qLL1nq2l0M0L6J4l8j5l6K9K4Kn5Pkk0N7L2j1o1JNJ5L9J0n4
7610f4K4J5l7K1O0m4m4pJ3j8j1M2k1n2Q8j1m5L1J9J6l2qJ8K8ok6M5n7j9M7l4O0j4rk2k9j2
$$ plain form
7593 -95 -59 -37 -78 -72 -75 -58 -53 -4 -24 -52 -77 -124 -113 -113 -90 -41 -31 -77 -60 -85 -9 -41 -31 -52 -2 31 -11 -63 -41 -29 -80 -87 -69 -83 -92 -68 -77 -49 -64
7574 -64 -81 -131 -102 -42 -94 -108 -91 -39 -42 -96 -58 -74 -102 -138 -129 -68 -21 -8 2 -27 -74 -41 -5 -29 -71 -58 -54 -105 -80 -104 -67 -32 -49 -79 -104 -62 -33
7557 -33 -61 -115 -70 -49 -77 -42 -39 -61 -70 -85 -53 34 -42 -52 -41 -28 -21 -56 -43 -67 -108 -116 -99 -91 -79 -108 -69 -16 -46 -29 4 -6 -35 -55 -63 -32 -49 -57 -54
7538 -54 -45 -105 -94 -61 -50 -28 -50 -28 -67 -97 -83 -35 -23 -59 -18 -28 43 10 -49 -18 -47 -22 -26 -35 -26 -38 -23 -65 -131 -122 -87 -56 4 -36 -66 -93 -102 -28
7520 -28 11 -46 -36 -44 -18 -7 -75 -39 -49 -63 -32 -36 -59 -43 1 -59 -40 -30 -7 -89 -71 -59 -35 -100 -88 -76 -99 -57 -85 -15 -88 -68 -3 -51 -66 -8
7503 -8 57 -6 -70 -57 -107 -80 -96 -66 -54 -23 -22 -19 38 28 53 28 31 -6 -39 -9 -13 -51 -41 -48 -37 -80 -114 -26 71 -12 -15 -46 -62 -2 38 1 -56 -93 -100
7484 -100 -101 -49 -29 -105 -94 -78 -50 -63 -46 -16 37 25 -8 -29 -111 -139 -105 -56 -64 -71 -63 -1 4 -2 -14 -19 -32 -31 -59 -20 -16 -36 12 4 -68 -78 -48 -47 -12 -9 -12
7465 -12 -27 8 -5 -77 -23 34 -33 -51 -40 -47 -41 -78 -56 14 -43 -69 -110 -76 -47 -38 -25 -11 -70 -101 -149 -107 -68 -111 -59 -36 -42 -86 -62 -42 -36 -18 2 -26
$$ packed form
7593i5L6K2m1OlJ7NM9k0k8k5m7J1%K3M9J0m6J7k5P6l2J0k1N0L3m2n2K2J2n1pJ8j4rK4rK8j5
7574f4j7n0K9O0n2j4J7N2ln4L8j6k8l6RO1M7J3J0k9m7L3L6k4m2J3Mn1K5k4L7L5j7l0k5M2K9
7557c3k8n4M5K1k8L5Lk2rj5L2Q7p6j0J1J3Pl5J3k4m1qJ7QJ2k9L9N3l0J7L3j0k9k0qL1j7qL
7538e4Ro0J1L3J1K2k2K2l9l0J4M8J2l6M1j0P1l3n9L1k9K5mrRj2J5m2o6RL5L1O0m0l0k7rP4
7520b8L9n7J0qK6J1o8L6j0j4L1mk3J6M4o0J9J0K3q2J8J2K4o5J2J2k3M2k8P0p3K0O5m8j5N8
7503hO5o3o4J3n0K7j6L0J2L1JLN7j0K5k5Ll7l3L0ml8J0pJ1m3l4Q8R7q3ll1j6O0M0l7n7l7p
7484a00jN2K0p6J1J6K8j3J7L0N3j2l3k1q2k8L4M9qpQO2Noj2nj3Jk8L9Mk0M8qp2j0L0JL5Ll
7465a2j5L5j3p2N4N7o7j8J1pOl7K2P0n7k6m1L4K9RJ3J4n9l1m8M2L9m3N2K3om4K4K0OJ8K0k8
$$ plain form
7446 -26 -76 -80 -42 9 4 -47 -75 -10 -2 -22 -70 -73 -28 22 16 -32 -9 -25 -27 -34 -73 -12 -80 -67 -3 -23 -68 -53 -34 -57 -59 2 -45 -32 -3 -6 -13 -1 -8 -13 -88
7427 -88 -75 -53 -40 -37 -25 25 4 -18 21 -14 47 6 -85 -96 -135 -89 -115 -43 -67 -67 -33 -84 -33 23 -39 -44 -63 -15 -50 -40 -59 -65 -32 -61 -54 -5 -4 -40
7409 -40 -59 -40 -25 -58 -81 -62 -56 -44 -38 -9 6 -14 -14 26 -28 -41 -16 -22 -40 -81 -70 -115 -108 -124 -114 -58 -85 -113 -88 -49 -18 10 -15 -53 -44 -53 -48 -87 -67
7390 -67 -60 -34 -27 -45 -62 -22 -37 -62 -148 -189 -117 -53 -63 -52 13 -87 -89 -98 -71 -87 -129 -64 -82 -31 -48 -25 -22 -50 -54 -82 -67 -71 -54 -15 -15 21 -48 -85 -51
7372 -51 -77 -26 10 7 -67 -34 18 1 -36 -18 -26 -76 -33 -29 -52 -67 -89 -99 -121 -68 -39 23 1 -50 -56 -70 -68 -56 -51 -11 -3 51 -21 -26 -30 -64 -27 12 22 48
7352 48 9 -12 5 8 25 45 36 -43 -72 11 -24 -24 -15 -70 -74 -62 -15 -29 -8 -52 -77 -44 -66 -45 -64 -94 -57 -33 -31 -90 -89 -46 -75 -132 -123 -148 -116 -53 -81
7334 -81 -83 -112 -56 -16 -71 -12 6 -72 -93 -50 -68 -31 14 -21 -26 -19 -25 -43 -55 -19 27 46 -47 -81 -104 -21 19 29 -15 -23 -27 -3 -35 -50 -38 -29 -36 -36 -45 -4
7315 -4 -56 -90 -74 -19 -32 -50 -5 4 -108 -50 -6 32 -37 -89 -50 -32 -2 9 -32 12 22 -28 -99 -133 -162 -149 -80 -116 -64 -124 -139 -92 -70 -43 -5 -55
$$ packed form
7446b6n0mL8N1nn1k8O5Qk0m8lM5N0om8K3j6kpl9O1o8J3O4k0m5J5J9k3kO1m7J3K9lpJ2pnp5
7427h8J3K2J3LJ2N0k1k2L9l5O1m1r1j1l9M6k6P2k4%L4n1N1N6o2nj9M8l5J0j9oL3k9PM9Jl6
7409d0j9J9J5l3k3J9OJ2OK9J5k0%M0n4j3K5oj8m1J1m5Pj6J0N6k7k8K5L9L1K8k5l8RrNl9K0
7390f7PK6Pj8j7M0j5k5q6m1P2O4j0J1O5j00krK7j6m2O5j8N1j7K3Lk8mk8J5mJ7L9%L6o9l7L4
7372e1k6N1L6lp4L3N2j7l7J8qn0M3Mk3j5k2j0k2N3K9O2k2n1oj4KJ2NM0QN4p2nml4L7L9J0K6
7352D8l9k1J7LJ7K0rp9k9Q3l5%Rn5mJ2M7j4K1m4k5L3k2K1j9l0L7K4Kn9JM3k9n7Rk5L2O3k8
7334h1kk9N6M0n5N9J8p8k1M3j8L7M5l5nPoj8j2L6M6J9r3l4k3Q3M0J0m4qmK4l2j5J2Rp%rM1
7315dn2l4J6N5j3j8M5Rj12N8M4L8o9n2L9J8L0J1m1M4J0n0p1l4k9J3O9l6N2o0j5M7K2K7L8n0
$$ plain form
7298 -55 -46 -80 -58 3 -26 -6 -13 -46 -89 -105 -81 -104 -91 -87 -6 -45 -99 -20 17 11 19 27 -1 -88 -64 -86 5 -17 -59 -19 9 -27 -63 -60 -58 -41 1 -3 -9 12
7279 12 -23 -8 -51 -41 -20 6 1 -2 -44 -39 -31 -97 -97 -98 -119 -86 -71 -76 -80 -39 -27 -55 -98 -118 -98 -11 -62 -73 -33 -68 -116 -112 -46 -26 -14 -56 -125 -90 -52 -82
7260 -82 -62 -82 -52 -57 -39 -33 29 -3 -48 -102 -113 -62 2 -49 29 -80 -83 -67 -31 -18 -56 -43 -74 -12 -62 -48 -27 -51 -26 -11 -43 -4 -15 -63 -65 -46 -10
7242 -10 -21 -48 -21 -5 -55 -81 -64 -30 -32 16 -87 -90 -70 -83 -62 -66 -20 -50 -41 -27 -55 -127 -102 -109 -36 -45 -89 -46 -65 -105 -99 -83 -107 -81 -32 -65 -86 -80 -62
7223 -62 6 -46 -55 -35 -12 -69 -47 -52 -51 -66 -30 -7 13 12 -19 -70 -49 -52 -41 -25 -50 -34 25 26 33 -18 -51 -27 -51 -53 14 14 -18 10 -13 -65 -60 -19 -29 -34 -67
7204 -67 -111 -21 -10 -47 -25 -27 -24 -53 -21 -40 -63 -26 -5 -36 -87 -58 -68 -52 -68 -64 -33 -45 -56 41 10 3 14 1 4 -36 8 52 18 -54 -45 -86 -9 -4 -58
7185 -58 -10 -50 -55 -50 -37 -28 -51 -116 -100 -60 -34 -25 -7 -16 -36 -49 -33 13 10 -14 12 24 -16 -5 -35 -76 -61 -4 -26 -63 -30 -37 -24 -16 17 -3 -5 5 -9 48
7166 48 24 -10 11 -95 -146 -95 -58 -62 -70 -50 -92 -105 -70 -69 -45 -53 -49 -63 -27 -51 -52 -49 -60 -50 -72 26 5 -20 5 -1 -2 -43 -75 -104 -151 -62 -37 -62 -13
$$ packed form
7298e5Rl4K2O1k9K0pl3m3j6K4k3J3MQ1l9n4P9L7oQQk8q7K4k2R1k2m2M0K8l6l6LKJ7M2moK1
7279A2l5J5m3J0K1K6nlm2NQo6%jk1L3J5nmM1J2k8m3k0K0Q7n1j1M0l5m8MO6K0J2m2o9L5L8l0
7260h2K0k0L0nJ8OO2l2m5n4j1N1O4n1P8j09lJ6L6J3l8J3l1O2n0J4K1k4K5J5l2L9j1m8kJ9L6
7242a0j1k7K7J6n0k6J7L4kM8j03lK0j3K1mM6l0RJ4k8p2K5pP3rm4M3j9m0OJ6k4K6M9l3k1OJ8
7223f2O8n2rK0K3n7K2nJj5L6K3K0jl1n1K1lJ1J6k5J6N9JPn1l3K4k4kO7%l2K8k3n2NM1j0nl3
7204f7m4R0J1l7K2kLk9L2j9k3L7K1l1n1K9j0J6j6ML1j2j1R7l1pJ1j3Lm0M4M4l4p2Rm1P7Nn4
7185e8M8m0nNJ3Rk3o5J6M0K6RJ8rk0j3J6M6lk4K6J2m0J1l0m1J5N7k2l7L3pJ3QL3k0kJ0j4N7
7166D8k4l4K1j06n1N1L7mqK0m2j3L5JK4qMj4L6k4jLj1J0k2R8k1k5K5ojm1l2k9m7Q9K5k5M9
$$ plain form
7147 -13 -33 -70 -47 -49 -35 -20 23 4 -57 -71 -6 25 2 -57 -47 -97 -85 -53 -45 -27 -21 26 46 15 -37 -49 -41 -75 -80 -75 -78 -78 -96 -54 -34 -67 -41 -47 -31 -56
7128 -56 -100 -69 -21 -8 -43 -61 -19 -20 -42 4 20 -42 -37 -70 -42 -44 -26 -73 -35 -20 -69 -21 -8 -5 46 58 25 -25 -46 -77 -55 -42 -87 -94 -11 -15 -62 -110
7110 -110 -103 -66 -48 -88 -49 -29 -32 -18 -3 -21 -30 -3 8 -40 2 -40 -81 -114 -15 -65 -109 -65 17 -27 -41 -56 -10 -15 -54 -34 -40 -17 20 -73 -56 -49 -7 -47
7092 -47 -39 -6 3 2 -3 -22 31 23 -95 -81 -38 -61 -114 -81 -78 -100 -76 -67 -69 -59 -45 -131 -111 -52 -6 -5 -54 -10 4 -50 -25 7 42 40 -41 -71 -56 -4 -4 -41
7073 -41 -33 -32 -5 19 1 -57 -63 -42 -63 -73 -88 -78 -53 -49 -35 -21 -33 -55 -58 -55 -47 -25 -47 -15 13 6 -86 -18 39 -26 -44 -43 -30 -5 -17 -26 -46 -33 -28 -19 -6
7054 -6 16 58 55 32 -10 -21 54 20 10 -45 -38 -1 -56 -96 -84 -38 -64 -83 -102 -85 -77 -62 -54 -93 -56 -74 -96 -35 -42 -26 6 17 -16 -26 8 -38 -24 -67
7035 -67 -3 8 15 -44 -50 -41 -29 -41 -39 -79 -119 -31 36 8 35 30 -26 -88 -104 -26 -62 -85 -22 -40 -16 -11 -40 -12 10 32 31 -12 -48 -82 -96 -76 -50 -43 -71
7017 -71 -118 -65 -28 11 2 8 -5 -16 -6 -41 2 -4 -40 -3 24 40 2 -33 -20 -38 -47 -72 -44 -70 -52 -49 -9 -45 -39 7 -15 18 30 56 15 -33 -51 -40
$$ packed form
7147a3k0l7K3kJ4J5M3j9o1j4O5L1k3n9J0n0J2L2QJ8OM7K0l1n2j2Ql4nNl%j8M2K0l3K6oJ6k5
7128e6m4L1M8J3l5j8M2jk2M6J6o2Nl3K8kJ8m7L8J5m9M8J3LN1J2l3n0k1l1K2J3m5pQ3mm7m8
7110a10PL7J8m0L9K0lJ4J5j8rK7J1m8M2m2m1l3R9n0m4M4Q2m4j4j5M6nl9K0oK3L7r3J7PM2m0
7092d7QL3Rjnj9N3qj18J4M3k3n3L3Lk2K4RkJ0J4q6K0N9M6Jm9M4J4n4K5L2L5kq1l0J5N2%l7
7073d1QJK7K4j8n8oK1k1j0j5J0K5MJ4J4j2k2lLQK2k2L2K8pr2O8N7o5j8JJ3K5j2rk0J3NRJ3
7054fK2M2lk3m2j1P5l4j0n5PL7n5m0J2M6k6j9j9J7QJ5Ql9L7j8k2O1pJ6L2J1l3j0L4m6J4m3
7035f7O4J1Pn9oRJ2j2Km0m0Q8O7k8K7nn6o2j6P8l6k3O3j8K4Nk9K8K2K2jm3l6l4j4K0K6Pk8
7017g1m7N3L7L9rOj3j1J0l5M3ol6L7K7J6l8l5J3j8rk5K8k6J8LM0l6OM6k2L3J2K6m1m8j8J1
$$ plain form
6999 -40 -90 -41 -26 -39 -19 72 79 22 -23 -38 -44 -33 -3 -33 -79 -49 -66 -52 -15 -43 -72 -64 -67 -35 -5 -18 -30 -128 -80 -9 3 -10 -12 -27 -61 -69 -102 -65
6981 -65 -55 -12 -19 -14 -38 -47 6 2 8 -35 -77 -60 -12 -30 -41 -45 -9 21 2 -41 -21 -99 -73 -41 -55 -53 -63 -28 -9 -11 -21 -31 4 23 -78 -107 -64 -71 -103
6962 -103 -50 5 24 -21 -55 -15 -40 -95 -110 -90 -88 -51 -40 -90 -70 -79 -124 -149 -21 -47 -81 -101 -89 -103 -81 -60 20 30 6 -24 -12 -27 -22 -76 -66 -73
6945 -73 -56 -23 11 7 -22 24 -4 -18 -15 -33 -8 20 -87 -55 -58 -36 26 34 37 -86 -115 0 12 -31 -9 -59 -130 -102 -58 -34 -30 16 -5 -34 -14 -65 -52
6927 -52 -38 -40 -46 -16 -64 -78 -79 -68 -38 16 10 -41 -30 -29 -66 -81 -59 -75 -73 -55 -131 -64 -41 -1 3 16 -8 -60 -128 -135 -100 -33 -17 -3 -58 -56 -36 4 -47 -37
6908 -37 -22 -80 -66 -70 -51 -47 -74 16 -18 -112 -50 -41 -60 -78 -31 -46 -13 2 -41 -115 -100 -74 -75 -27 6 -3 -57 -84 -98 -59 0 8 -20 -25 -22 11 35 -17 -7
6889 -7 -30 -46 -44 -31 -39 -82 -11 -17 -38 -9 0 -35 -22 20 32 -5 -28 -41 7 -34 -32 -41 -19 12 18 -55 -79 30 -9 44 -9 -38 -40 -47 15 44 18 -31 42 24
6870 24 -59 -86 -5 -13 -74 -51 -26 -73 -79 -80 -44 -74 -43 -49 -2 -45 -105 -85 -48 -39 74 26 2 31 -58 -89 -89 -63 -42 -11 17 -29 -35 -51 -1 -20 -40 -8
$$ packed form
6999d0n0M9J5j3K0R1Pn7m5j5oJ1L0l0m6L0j7J4L7k8k9QlL2L0j3j2r8M8P1J2j3kj5l4ql3L7
6981f5J0M3pNk4rN3mOm3m2J7M8j8j1mL6L0j9m3K0p8K6L2j4Kj0L5J9kj0j0L5J9j01k9M3pl2
6962a03N3N5J9m5l4M0k5n5j5K0KL7J1n0K0rm5k5J28k6l4k0J2j4K2K1Q0J0k4l0J2j5Nn4J0p
6945g3J7L3L4mk9M6k8j4Lj8K5K8j07L2lK2O2QLj23k9J15J2m3K2n0p1K8M4K4MM6k1k9K0n1J3
6927e2J4koL0m8j4jJ1L0N4on1J1Jl7j5K2j6KJ8p6O7K3M0MJ3k4n2o8pL5O7J6J4n5KK0M0n1J0
6908c7J5n8J4mJ9Mk7R0l4r4O2Rj9j8M7j5L3J5m3p4J5K6jM8L3rn4k7j4L9N9Qk8nLL3K4n2J0
6889gk3j6KJ3qm3P1ok1K9Rl5J3M2J2l7k3j3M8m1KrK2L1Op3k4J09l9N3n3k9kpO2K9k6m9P3j8
6870B4q3k7Q1qo1K3K5m7ojL6l0L1oM7m3o0K0L7RJ13m8k4K9q9l1%K6K1L1K8m6oj6N0j9k0L2
$$ plain form
6852 -8 -43 -57 -20 -68 -72 -31 13 -58 -59 -1 -50 -42 -15 -83 -90 -59 -112 -132 -52 -79 -187 -187 -124 -39 -50 -68 -109 -98 -92 -72 29 24 -31 -37 -64 -70 -79 -101 -55 -23
6833 -23 -19 -11 -38 -54 1 14 -30 -14 -32 -33 -2 11 41 -19 -39 -62 -114 -84 -49 -84 -52 -18 -7 -8 -26 -71 -66 -58 -24 -8 -30 -22 -47 -74 -50 -54 -30 -70 -44
6815 -44 -27 -48 -91 -30 -86 -44 -32 -26 14 -17 -66 -110 -68 -29 -60 -42 21 8 -16 -57 2 -32 -33 18 -25 -13 -87 -56 -46 -29 -43 -58 -55 -54 -61 -44 -19 -8
6797 -8 -52 -55 -39 -33 -12 -45 -24 -52 -112 -108 -78 -110 -84 -1 -6 11 31 -18 6 -18 3 -11 -57 -70 -41 -62 -47 -17 -12 -14 -28 -53 -46 -21 -19 -59 -70 -88 -60 -42
6777 -42 -57 -85 -43 -31 -1 -6 -45 -45 -48 -46 -23 -32 9 -42 -99 -103 -34 -22 -43 -55 -97 -78 -52 -51 -37 -68 -9 -9 -75 -118 -62 -58 -33 32 25 -19 -55 -80 -114 -81
6758 -81 -38 -78 -73 -127 -65 -62 -58 -47 -60 -50 -63 -105 -72 -131 -126 -106 -58 -54 -92 -124 -42 -49 -88 -65 -98 -75 -64 -44 -4 -26 -6 -18 -12 -35 -18 -81 -110 -38 -74
6740 -74 -31 -13 6 -27 -37 -13 -27 -42 -8 -9 2 22 -9 -31 -59 -77 -85 -67 -62 3 -53 -56 -46 -56 -14 -9 4 -70 -86 -61 -134 -115 -71 -74 -114 -82 -26 2
6722 2 36 64 10 -47 -23 -63 -44 -14 -85 -103 -45 -112 -59 -36 -85 -35 -12 -26 -2 -67 -2 -43 -93 -34 -3 -65 -68 -13 -40 -64 -32 -13 21 -40 -32 42 37
$$ packed form
6852hl5j4L7m8mM1M4p1jN8m9QK7o8pL1n3k0Q0k7j08%O3Q5j1j8m1J1OK0J01nn5ok7ork2M6L2
6833b3MQk7j6N5J3m4J6j8jL1J3L0o0k0k3n2L0L5l5L2L4J1jj8m5NQL4J6k2Qk5k7K4mK4m0K6
6815d4J7k1m3O1n6M2J2OM0l1m9m4M2L9l1J8O3j3k4m1N9l4jN1m3J2p4L1J0J7j4j5LJpJ7K5J1
6797hm4lJ6OK1l3K1k8o0ML0l2K6Q3nJ7K0m9K4k4K1j4m6j3K9k1J5L0Nkj4k5PK5Km0j1j8K8J8
6777d2j5k8M2J2L0nl9%lKK3rM1n1n7mO9J2k1j2m2J9K6JJ4l1N9%o6m3N6MK5O5pm4l6k5l4L3
6758h1M3m0Nn4O2LMJ1j3J0j3m2L3n9NK0M8Ml8l2Q2pl9K3l3K3J1K0M0k2K0j2Ok3J7o3k9P2l6
6740g4M3J8J9l3j0K4j4j5L4jJ1K0l1k2k8j8qJ8NO5n6lJ0j0M2NJ3p4j6K5p3J9M4lm0L2N6K8
6722BL4K8n4n7K4m0J9L0p1j8N8o7N3K3m9N0K3j4K4o5O5m1n0N9L1o2lN5k7k4L2J9L4o1QP4n
$$ plain form
6704 37 -44 -95 -33 -35 -2 -17 -84 -86 -49 -10 7 -25 -79 -44 23 30 -81 -96 -56 -68 -85 -82 -104 -76 -25 -37 -39 -42 -34 -54 -23 95 15 -10 -31 -6 13 11
6686 11 -18 -78 -37 6 33 -35 -30 -50 -75 -72 -66 -31 -121 -79 -23 -40 -75 -35 6 35 -68 -75 -45 -71 -96 -104 -68 -55 -74 -52 -37 -60 -55 -48 -45 -64 2 -28 -70
6667 -70 -29 24 40 30 -31 -80 -109 -70 10 -47 -43 -11 -45 -26 2 -13 17 12 -44 -43 -75 -44 -2 -1 -55 -95 -61 -31 -27 -38 -76 -31 -15 -21 -76 -53 -52 -42 -43
6649 -43 -51 -40 -70 -90 -94 -44 -76 -92 -63 -75 -67 -57 -36 -20 -43 -12 -6 -77 -45 -84 -79 -43 -53 -117 -22 -17 -5 -26 -44 40 -30 -49 -19 18 -23 -29 -23 -34 0
6630 0 -19 -37 -33 -48 -97 -83 -33 29 20 20 -22 -29 -21 -23 -37 24 -14 -18 -1 -40 -68 -70 -69 -73 -100 -89 -41 -60 -67 -68 -19 -52 -65 -92 -95 -81 -18 -47 -74 -27 18 19 26
6610 26 -21 -42 -60 -44 -67 -58 -19 -65 -56 -2 48 53 49 -39 -80 -59 -22 8 -8 46 54 25 18 -54 -108 -87 -10 5 -10 -24 -37 -60 -61 -19 -20 -80 -39 -21 27
6591 27 8 -32 -18 -9 -2 -25 -32 -40 -38 -12 5 10 36 27 -9 -44 -104 -75 -84 -3 39 -4 -28 -44 -43 -32 -25 28 -42 -67 -122 -88 -39 -39 -30 -12 -8 -72 -98 -116 -90 -122
6571 -122 -85 -98 -39 32 21 4 -37 -39 -32 -25 14 10 -11 -69 -71 -63 -58 -45 -75 -66 -170 -152 -110 -55 -17 -76 -108 -51 -41 -54 -61 -22 -31 -25 -81 -43 -18 -70 -50 -21
$$ packed form
6704C7q1n1O2kL3j5o7kL7L9J7l2n4L5O7Pj11j5M0j2j7Lk2K8N1j2klQk0L1J18q0k5k1K5J9k
6686A1k9o0M1M3K7o8Nk0k5LOL5r0M2N6j7l5M0M1K9j03pL0k6k5qL6J3j9K2J5k3NPLj9O6l0m2
6667g0M1N3J6j0o1m9k9L9Q0n7ML2l4J9K8j5L0nn6Jl2L1M2Jn4m0L4L0Mj1l8M5J6on5K3JJ0j
6649d3qJ1l0k0mN0l2j6K9j2QJ0K1J6k3L1Op1L2l9NL6j0o4R5NJ2k1j8Q4p0j9L0L7m1oOj1L4
6630@j9j8Mj5m9J4N0O2r%m2pQkj4O1l8mJ7l9k8kJmk7J1M8j9pjM9l3j3k7lJ4O3k9k7M7M5JP
6610B6m7k1j8J6k3RL9m6RN4N0Nmq8m1K1L7L0j6N4Qk9pp2n4K1P7J5j5j4j3k3jM2jo0M1J8M8
6591B7j9m0J4RPk3pqKK6J7NK6rl6l5o0K9rQ1M2m3k4j6JJ1PN3p0k5n5L4M9%RJ8Mo4k6j8K6l2
6571a22L7j3N9P1j1j7m1kPPL9mk1n8kQNJ3l0Rj04J8M2N5L8n9l2N7J0j3pL9rOn6L8K5n2K0K9
$$ plain form
6552 -21 -58 -54 -83 -35 50 -6 -20 -69 -82 -90 -58 20 -8 -48 -86 -118 -57 -39 -86 -60 -10 -38 -21 -27 -4 -89 -43 17 36 -10 -38 -48 -124 -136 -52 -12 -46
6534 -46 -80 -57 -66 -12 2 -26 -15 -26 -61 -90 -77 -59 -50 -99 -46 -50 -28 -12 -43 -39 -12 -34 -97 -32 -35 -14 44 6 20 -13 -80 -46 35 -17 -5 5 -52 -51
6516 -51 -9 1 21 -11 -9 4 -30 5 -31 -45 -62 -37 -7 -62 -141 -57 -7 -15 -75 -65 -87 -74 -22 -17 -36 -53 -59 -75 -77 -87 -129 -105 13 -34 -42 -56 -84 -65
6498 -65 -71 -14 -29 -21 -33 -66 -85 -42 8 22 35 17 -2 -5 55 50 30 -10 -38 -48 -33 -27 32 -47 -73 -61 -63 -52 -38 -32 -53 -95 -81 -67 1 -28 -44 -29 -41
6479 -41 -8 -34 -56 -14 -29 -64 -71 -77 -72 -27 -34 -80 -7 -95 -83 -48 -46 -42 -46 -54 -20 -5 -28 -12 -29 17 -3 -7 -45 -63 -82 8 33 -17 12 19 39 23 -22 -96
6460 -96 -58 -36 -34 -39 -83 -58 -3 19 -25 -52 -56 -127 -113 -118 -69 36 44 16 5 -67 -39 -10 -9 -30 -81 -74 -27 -3 -67 -53 19 34 -3 0 -10 9 30 -37 -77
6442 -77 44 53 8 -33 -70 -30 -63 -46 -41 -60 -63 -101 -34 -87 -40 -37 -50 -80 -98 -63 10 2 -1 23 54 43 17 26 34 -25 -42 -66 -68 -59 -76 -108 -85 -104 -91 -9
6423 -9 9 2 2 -45 -49 -50 0 -33 -56 -34 -44 10 -49 -53 -23 -84 -48 -55 -59 -101 -66 -62 -73 -28 -40 -63 -75 -54 -74 -74 -110 -93 -26 -48 -43 -11 19 0 -4 -9 -51 -47
$$ packed form
6552b1l7Mk9M8Q5n6j4m9j3qL2P8k8m0l8l2O1J8m7K6N0k8J7oK3q5M6O0J9m6k8j0p6j2Q4M0l4
6534d6l4K3rN4J4k8J1j1l5k9J3J8Rm9N3mK2J6l1MK7k2o3O5lK1N8l8J4l3o7L4Q1n2J2J0n7J
6516e1M2J0K0l2KJ3l4L5l6j4j7K5L0n5p9Q4N0qo0J0k2J3N2Nj9j7oj6kj0m2K4J18m7qj4k8J9
6498f5oN7j5Qj2l3j9M3N0J4J3j8j9lO0nk0m0k8j0J5ON9p9k6J2kJ1J4Ok1m2J4J4O8k9j6J5j2
6479d1L3k6k2M2j5l5poNM5pm6P3q8J2L5KMmqL4J5k3J6j7M6k0ml8j8j9R0K5n0K9PK0j6m5p4
6460i6L8K2Knm4K5N5K2m4k7mp1J4nM9J05Qk8j1p2K8K9Jk1n1PM7K4o4J4P2J5l7Lj0J9K1o7m0
6442g7J21Rm5m1l7M0l3J7Nj9ll8O7n3M7Lj3l0j8L5P3qlK4L1j1k6RQn9j7k4kRj7l2K3j9J3Q2
6423iJ8p%m7mjN0l3k3K2j0N4n9mL0o1L6pmm2L5Mj1M5j2k3j2K1k0%l6J7O7k2NL2L0j9mnm2M
$$ plain form
6403 -47 -5 -25 -20 -11 -33 -52 -82 -110 -43 1 -11 3 2 -3 -23 -43 -115 -97 -63 -90 -126 -64 -72 -70 -56 -86 -88 -58 -96 -121 -40 2 -54 -132 -106 -125 -70 -27 -35
6384 -35 -42 -31 -62 9 34 -27 -32 10 53 15 -104 -73 3 -8 -9 -25 -7 -9 -5 -37 1 10 -19 -41 -18 -30 -20 13 32 44 -51 -36 -34 -81 -66 -51 -101 -63
6366 -63 -37 -42 -19 -32 -76 -90 -124 -146 -111 -23 -26 10 32 22 36 -36 -40 -33 -62 -27 -23 -35 -63 -58 -55 -31 -78 -73 -102 -23 -47 -57 3 -60 -100 -81 -15 -7 -53 -64
6347 -64 -58 32 63 -15 -11 -3 21 -8 -63 -73 -83 -66 -62 -21 -28 -29 -17 -31 -75 -84 -52 -53 -78 -80 -31 -14 -17 -56 -36 -48 -80 -67 -11 -32 -56 -34 -84 -97 -129 -119
6328 -119 -68 57 0 -11 -36 -31 18 9 -6 -59 -29 30 29 -34 -57 4 -21 -23 -38 -49 5 18 40 61 47 46 10 -12 -47 -74 -6 -25 3 -7 58 -28 -45
6310 -45 -22 -16 59 35 -15 -2 -28 -30 -21 -29 21 41 19 -3 -37 -106 -72 -6 -1 2 7 -47 -42 -87 -116 -51 -21 -71 -68 -44 -50 -63 -75 -40 -77 -68 -16 -2 -30 -18 -36
6291 -36 -18 -35 -63 -12 -38 -34 18 -20 -78 -73 -60 -17 -11 -65 -67 -74 -91 -33 -43 -97 -30 -32 -30 52 -38 -38 -55 -60 -62 -35 -55 -82 -59 10 -22 -49 -86 -79 -40 -61 -15
6271 -15 -3 -40 -7 0 5 -65 -59 -50 -66 -25 -21 -84 -49 -16 -59 30 -1 1 -49 -9 -94 -63 14 12 31 5 -46 -15 -28 20 -45 -76 -69 -62 -10 -152 -95 -34 -20
$$ packed form
6403d7M2k0NRk2j9l0k8O7M4j2J4jnk0k0p2J8L4k7l6O2qKJ4l0kL0l8k5Q1M2n6p8K6j9N5M3q
6384c5pJ1l1P1K5o1nM2M3l8j19L1P6j1jj6J8kMl2L8Rk9k2K3j2J0L3J9J2r5J5Km7J5J5n0L8
6366f3K6nK3j3m4j4l4k2L5Q8lL6K2j0J4p2mPk9L5Mj2k8NLK4m7Nk9P9k4j0O0o3m0J9O6Qm6j1
6347f4OR0L1p8MQK4k9n5j0j0J7MM1pjJ2j4m4rL2jk5kM9J7ll9K0j2l2J3N6k1k4K2n0j3l2J0
6328a19N1J25n7j1k5NM9rj5n3L0N9jo3k3O1k5kj5j1N4J3K2K1j4jl6k2l5k7O8j9K8j0O5q6j7
6310d5K3OP5k4n0J3k6kRqN0K0k2k2l4o9L4O6NLNn4Nm5k9O5L0n0LK4oj3j2L5l7RN2J4k8J2j8
6291c6J8j7k8N1k6MN2l8n8NJ3M3On4kpj7N8j0n4O7kKQ2r0%j7nkK7k0k7K3O9l2k7l7PL9k1M6
6271a5J2l7L3PNp0ORj6M1Mo3L5L3m3Q9l1Kn0M0q5L1P7kJ9k6n1L1j3M8o5l1PPN2j42N7O1J4
$$ plain form
6252 -20 -34 -80 -59 -20 19 54 10 -70 -84 -21 -14 -21 -54 -85 -145 -108 -90 -73 -125 -113 -34 -72 -70 -31 -96 -43 -8 -64 -54 -45 -45 -53 -60 -44 -60 -72 -63 -37 3
6234 3 -25 -26 -28 -89 -59 -37 -26 12 -5 4 10 -4 -43 -63 -60 -45 -79 -106 -19 45 49 15 7 7 -6 -60 -68 -61 -66 -101 -72 -44 -36 -3 24 32 -1 4 -53 -72 17 -34 -26
6213 -26 0 -56 -11 -13 -3 21 -8 -19 -7 -15 -65 -37 -47 -113 -34 32 5 -23 -20 -49 31 31 8 13 26 -20 -89 -34 -15 -10 -16 -63 -42 -22 -33 -70 -49 -22 -42
6195 -42 -42 -19 12 4 -16 -31 -85 -85 -6 -26 -30 -37 -40 -69 -89 -14 -94 -84 -43 -33 -31 -1 -12 -25 -35 -74 -37 -32 7 6 -64 -47 -34 4 29 -73 -83 -42 -57
6176 -57 -44 22 -12 -89 -102 -70 -22 12 20 10 15 -21 -2 -5 -106 -31 -18 27 -22 -50 24 -55 -67 -15 18 -18 -86 -64 -97 -2 2 -73 -23 20 47 45 34
6158 34 33 -12 -22 -38 -83 -68 -76 -34 -26 26 -33 70 77 89 23 -68 -8 2 37 12 -23 -24 -80 -76 -20 20 11 -8 -123 -128 -94 -107 -116 -76 -11 -80 -81 -100 -158
6140 -158 -149 -111 -27 -71 -78 -47 -16 -57 -112 -83 -47 -30 -58 -54 32 12 -74 -114 -19 -1 -26 -76 -66 -31 -38 -57 13 37 -9 -46 -43 -26 -1 29 -4 -97 -36
6122 -36 -20 -19 -12 -25 -2 -28 -72 -45 -67 -24 -21 -88 -114 -54 17 44 -10 0 -22 -54 -54 -101 -115 -73 -73 -88 -110 -76 -78 -50 -63 -44 4 -36 -45 -11 11 15 -13
$$ packed form
6252b0j4m6K1L9L9L5m4q0j4O3Ppl3l1o0L7J8J7n2J2P9l8KL9o5N3L5n6J0R%qpJ6j6j2RK6M0
6234Ck8jko1L0K2J1L8j7ROj4l9k0LJ5l4k7Q7O4Ml4q%j3n4qPnl5K9K8QL3K7Ql3Nn7j9Q9n1Q
6213b6K6n6M5kJ0K4k9j1J2qn0K8j0o6P9O6k7k8Lk9Q0%k3NJ3m6o9N5J9Nom7K1K0j1l7K1K7k0
6195d2%K3L1qk0j5n4%P9k0mplk9k0P5q0J0M1J0KL0j1j3j0l9L7NL9jp0J7J3L8K5j02j0M1j5
6176e7J3O6l4p7j3L2M8L4Qj0Nl6J9lj01P5J3M5m9k8P4p9j2N2L3l6o8K2l3R5Mp5N0M3K7kj1
6158C4jm5j0j6m5J5qM2QN2n9J03PJ2o6r1O0J0L5k5l5jn6MN6M0rj9j15nL4j3rM0O5o9jj9n8
6140a58RL8Q4m4pL1L1m1n5K9L6J7k8MQ6k0q6m0R5J8k5n0J0L5pj9P0K4m6l7LJ7K5L0l3r3O1
6122c6J6JPj3K3k6m4K7k2M3Lo7k6O0P1K7n4J0k2l2%m7j4M2%j5k2L4kK8j3J9M8m0rL4K2Mk8
$$ plain form
6104 -13 -35 40 20 -79 -73 -48 -48 -100 -131 -76 -66 -53 -22 50 8 11 30 7 -28 -59 -65 -55 -19 -37 -40 -1 17 -14 -50 -41 -85 -126 -100 -83 -40 -40 -109 -66 -32
6085 -32 6 -65 -37 -10 -54 -48 -61 -68 -70 -37 2 -79 -93 -55 -60 -53 1 -36 -60 -75 -51 -29 -8 -22 32 14 -14 -37 -17 -23 -12 -34 -4 11 -65 -98 4 -55
6067 -55 -58 -80 -54 -45 -41 -46 -15 24 -22 -39 -41 -35 -21 -45 -8 -57 -76 -19 -44 -81 -62 -92 -66 -29 -64 -112 -103 -52 -38 -35 -43 -36 -47 -7 4 -10 -40 -44 -21 -13 40
6047 40 19 11 -34 -105 -67 -33 3 -49 -54 -35 -27 -26 0 -36 -54 -28 -48 -78 -27 -42 -69 -5 52 39 -36 -45 -20 -46 -75 -154 -130 -107 -121 -56 40 57 13 12
6029 12 -39 -37 -75 -102 -121 -154 -95 -16 -38 -32 -10 -80 -22 -53 -74 -75 -64 -40 -25 0 -32 -35 40 -5 -62 -93 -75 -59 -33 -66 -80 -78 -78 -47 -82 -30 -54 -42
6011 -42 -69 -73 14 15 -32 -32 -25 -62 -115 -113 -86 -53 -31 -39 -58 -43 -32 28 7 43 33 6 -25 -53 -3 -58 -41 -37 -22 -62 14 79 -5 -61 -76 -3 -3 -96 -57
5993 -57 -11 26 -12 -58 -6 -26 -42 -7 -19 -10 51 -17 -7 3 -42 -42 -10 34 5 15 34 -46 -1 -36 -20 6 25 1 -50 -40 -14 -14 -62 -132 -103 -24 -38
5975 -38 -90 -45 11 -45 -24 -13 1 -22 -21 -51 -60 -69 -73 -64 -96 -58 -99 -85 -37 -53 -4 -62 -41 16 -63 -92 -104 -78 -35 -45 -43 -71 -97 -96 -103 -44 -34 -10 -24
$$ packed form
6104a3k2P5k0r9OK5%n2l1N5J0J3L1P2m2LJ9k3l5l1oJ0L6j8lL9J8l1l6Rm4m1K6J7M3%o9M3L4
6085c2L8p1K8K7m4Oj3pkL3L9q1j4L8nPN4l7k4j5K4K2K1j4N4j8k8k3K0oJ1k2L0J5p6l3J02n9
6067e5lk2K6RMnL1L9m6j7kOJ4k4L7m9j9N7k5l7J9l0K6L7l5m8RN1J4LqPj1M0J1j4l0mK3QN3
6047D0k1qm5p1L8L4L6n2nJ9QJK6l6j8K6k0l0N1j5k7O4N7j3p5rK5k6k9p9K4K3j4O5R6J7m4j
6029A2n1Kl8k7j9l3N9P9k2OK2p0N8l1k1jJ1K4J5K5l2lP5m5n7l1J8J6K6l3j4K%L1l5N2k4J2
6011d2k7mQ7Jm7%Pl7n3KK7L3K2qj9J5J1O0k1L6j0k7l1k8N0n5J7MJ5m0P6O5q4n6j5P3%r3L9
5993e7M6L7l8m6N2k0j6L5j2RO1o8J0J0m5%L2M4k9J0J9q0M5l5J6K6J9k4n1J0K6%m8p0K9P9j4
5975c8n2M5N6n6K1J1J4k3Jl0rrmRl2L8m1J4M8j6M9n8K1N7p9k9j2K6M3j0Kk8k6JpN9J0K4j4
$$ plain form
5956 -24 20 -10 -44 -58 -17 -68 -48 -51 -35 -39 -3 -78 -77 -64 -79 -73 -59 -4 10 -25 -55 -13 -14 9 -23 -54 -59 -83 -79 -70 -45 -23 -23 -10 -36 -108 -116 -56 -41 -16
5937 -16 18 -62 -44 -12 -60 -71 -38 -38 -86 -86 -24 -50 -67 -55 -21 -27 -16 -75 -82 1 20 -3 -9 -57 -67 -44 12 2 -84 -64 -48 -56 -47 -71 -86 -105 -69 -83 -25
5919 -25 3 22 22 -73 -58 -39 -54 -18 -32 -21 -78 -102 -7 -53 -73 -57 -41 -19 21 -50 -4 -13 -17 -15 -55 -91 -41 20 73 20 -22 5 3 22 26 8 32 -72
5901 -72 -51 -17 -77 15 8 -12 -58 -52 -14 -12 -4 -29 -25 -53 -91 -48 -65 -63 -47 -69 -97 -53 -83 -58 -114 -131 -99 -102 -49 -34 -77 -80 -50 -72 -32 10 -33 -61 -35
5882 -35 -8 -19 -24 29 49 -12 37 12 -73 -95 -88 -61 -82 -83 -14 -93 -104 -53 -9 -43 -44 -39 -33 -30 -8 -2 -22 -65 -16 8 -28 -28 -19 5 -10 -31 -44 -54 -58 -62 -39
5862 -39 -81 -34 -44 -95 -62 -8 -29 3 3 37 48 63 26 0 -34 -62 -24 -48 -45 -59 -97 -79 -82 -163 -85 -19 -76 -117 -67 -44 -46 -28 -127 -83 -78 -79 -91 -121
5844 -121 -111 -105 -38 -41 -35 6 -12 2 -78 -15 39 21 -42 -48 -46 -52 8 4 25 45 55 -9 -39 -84 -84 -37 6 -21 -22 11 85 45 32 2 25 -15 -40 -78 -86 -16
5825 -16 -14 -22 -17 1 -61 -46 6 -26 -18 -60 -19 -30 -39 -9 -6 -48 -108 -103 -26 24 34 -31 -30 -13 15 -29 11 -67 -78 -39 -30 -7 -19 33 79 35 -41 -31 -74 -24
$$ packed form
5956b4M4l0l4j4M1n1K0lJ6mL6p5JJ3j5OJ4N5J4l5l0M2jK3l2l1nk4MRK5K2%J3k6p2qO0J5K5
5937a6L4q0J8L2m8j1L3%m8%O2k6j7J2L4oJ1n9pQ3J9k3om8j0K3N6j0q6K0J6qRk4j5j9L6j4N8
5919b5K8J9%r5J5J9j5L6j4J1n7k4R5m6k0J6J6K2M0p1M6rmKm0l6N0O1N3n3m2K7kJ9Mj8K4j04
5901g2K1L4o0R2pk0m6OL8KQk5Mk8l8M3j7KJ6k2k8M4l0K5n6j7L2lN3J5m3lL0k2M0M2m3k8K6
5882c5K7j1nN3K0o1M9k5q5k2PK7k1jO9p9j1N1M4l4jNOLK2Ok0m3M9K4l6%RK4j5k1j3j0mmK3
5862c9m2M7j0n1L3N4k1L2%L4J1J5l7k6l4k8L8k4Lj4l8J8lq1P8O6n7m1N0K3kJ8r9M4Njj2l0
5844a21J0OO7lOM1j8J4q0O3N4j8o3oKoO0mK1K0J0o4l0m5%M7M3k7jL3P4m0j3l0K3m0k5l8qP0
5825a6KqNJ8o2J5N2l2Qm2M1j1rL0Lm2o0NP7N0J0o5JJ7K8m4M0p8j1L9RK3j2N2M6m4p6J0m3N0
$$ plain form
5806 -24 -38 -35 -75 -51 -42 -29 -5 -51 -59 -80 -117 -90 -39 -31 -24 -37 -48 12 62 38 -30 -39 -47 -27 1 -63 -25 -6 18 29 10 42 61 95 68 -12 -18 -41 -22
5788 -22 -20 -67 -74 -49 -60 -75 -19 -11 -20 -23 -53 -23 -51 -74 -13 25 20 13 -64 -69 -48 -15 -19 44 38 15 28 56 36 14 -24 -36 -72 -93 -118 -110 -99 -102 -83 -89 -83 -43
5767 -43 -64 -89 -41 -10 -42 -56 -34 -23 -28 -79 -54 -15 -89 -80 -55 -79 -48 -111 -47 -24 -41 -33 -108 -70 -48 -92 -55 -92 -25 -25 -45 -85 -20 -42 -29 -2 4 -10
5749 -10 -12 -34 -28 18 -22 -57 -80 -47 -11 -22 -29 -66 -147 -146 -55 3 16 -20 -36 -40 -60 -29 -52 -39 -27 -7 -42 -26 13 -25 -4 -13 -53 12 7 -51 -88 -63 -3
5731 -3 -12 -54 -55 -91 -95 -69 -89 -60 -33 -54 -17 -50 -121 -36 -46 -134 -90 -32 -50 -67 -39 -93 -31 -12 -21 23 12 14 0 -22 13 -36 -122 -80 -62 -70 -42 -15 -6
5712 -6 -53 -59 -42 -37 -30 -22 -29 18 34 -39 -40 -42 -95 -60 -81 -41 -47 -73 -71 -79 -57 -20 -31 -69 -90 -46 -26 -61 -9 -42 -51 -71 -76 -62 -89 -83 23 6 -13 -24 -21 -57
5692 -57 -72 -68 -13 43 43 38 38 58 57 -3 -35 -28 13 -17 -31 -54 59 88 -2 60 38 -38 -36 0 -33 -35 -48 1 7 -54 -39 -31 3 -53 -73 -75 -32 35 3 -18
5673 -18 12 -22 -125 -76 -43 -21 4 -11 3 13 34 -42 -19 6 -27 -23 -29 -50 -50 4 14 -11 -35 -65 -48 57 72 -26 -105 -68 -35 -33 -84 -33 5 1 -29
$$ packed form
5806b4j4Lm0K4RJ3K4m6qk1l7K7N1QPj3j1O0N0k4o8rqK0K8o4L8J9K4J1j9L2J9L4k7q0ok3J9
5788b2Km7pK5j1j5N6Qrll0L0k8k3O1L8npp7nK1L3mO3ok3J3K8k0k2l8j2l6k1k5QJ1lJ9oOM0
5767d3k1k5M8L1l2j4K2J1nn1K5L9p4RK5k4L1o3O4K3j7Qp5L8K2m4L7l7O7%k0m0O5k2J3K7Oj4
5749a0kk2OM6m0l5k3L3L6j1pl7q1JR1N8J3l6j6mk0L1k3J3J2K0l5J6L9l8K1rm0O5nn8l7K5O0
5731crm2jl6mK6k0K9K7k1L7l3p1Q5j0q8M4N8j8j7K8n4O2J9rM4j1Kj4k2L5m9q6M2J8qK8K7R
5712fm7oJ7NPQpM7J6p3jkn3L5k1M0ok6KqK2L7j1l8k1M4K0l5N2l3rk0nJ4k7OJ06j7j9j1Ll6
5692e7j5MN5N6%n%K0jo0l2PM1l0j4k3J13K9r0O2k2p6KL6l3kj3M9Oo1J5QL4n6k0kM3O7l2k1
5673a8L0l4j03M9L3K2K5j5J4J0K1p6K3K5l3Mok1%N4J0k5k4l0J7J05J5r8p9L7L3Kn1N1L8ml0
$$ plain form
5655 -29 -61 -95 -78 -72 -73 -58 -52 -43 37 -5 -77 -75 -96 -91 -34 -39 5 15 -21 -53 -56 -71 -62 -64 -94 -59 -32 -36 -110 -69 -9 46 9 11 20 17 -39 -51 -91 -66 -36 -23
5635 -23 8 6 6 -47 -72 -15 -7 9 -9 -30 -52 -23 12 -43 -45 -15 -24 -4 25 22 -19 -36 -84 -41 7 41 29 49 17 2 9 -25 -80 -93 -84 -89 -91 -36 8 -6
5616 -6 -39 -57 -66 -77 -30 14 -9 -38 -72 -79 -67 -51 -33 -24 -32 -34 4 -37 -39 -61 -83 -80 -72 -65 -56 -83 -91 -38 -22 -53 -77 -61 -81 -76 -73 -104 -59 -58 -94 -53 -25 -50 -44
5596 -44 -72 -49 -12 -37 -2 -36 -81 -127 -48 -13 -24 11 41 50 -23 -72 -56 -21 -29 -34 -41 -54 -70 -80 -76 -34 -4 -9 16 17 -95 -78 -16 -38 -63 -73 -65 -63 2
5577 2 -21 -19 -48 -87 -91 -79 -63 -89 -70 -50 -53 -18 -20 -45 -40 -14 -50 -48 -76 -73 -72 -11 40 -54 -32 -36 -65 -4 -83 -85 -37 -28 -19 -7 -44 -37 -36 -46 -55 -32 -34 26 -16 -26
5556 -26 -16 -3 -13 -85 -92 -70 -2 -1 -40 -34 4 23 -7 -16 -56 -40 33 58 -10 -63 -68 -76 -63 -80 -26 -17 -42 -55 -25 -7 -55 -21 -47 -19 0 -62 -45 -43 19
5538 19 27 -5 -24 -82 -89 -74 10 -42 -68 -106 -46 -62 -146 -112 -29 -56 -48 -23 -67 -68 -45 -64 -78 -69 3 -29 -66 -11 -43 -67 -21 17 -9 -46 -85 21 46
5520 46 -29 -88 -84 -47 -42 -11 29 43 49 11 -15 -47 -48 -38 -30 -43 8 2 -93 -100 -27 -18 -8 -16 -38 -46 -84 -33 -59 -92 -56 -92 -82 -53 -81 -30 -1 10 17 56 37
$$ packed form
5655b9l2l4J7OjJ5ORQ0m2p2Kk1NN7nM4J0l6l2lj5Rkl0L5K7mp4M1O0N5l7KRln6j2m0K5L0J3
5635b3L1k%n3k5N7QJ6j8k1k2K9L5n5kL0rK0K9lm1j7m8M3M8L4j2K0l2j5Pl4n5j3RnkN5M4j4
5616fl3j8rj1M7M4k3k9l4pJ2J6J8RqkL8m1kk2k2LQPRk7qN3J6l1k4J6k0NLl1M5Jl6M1K8k5O
5596d4k8K3L7k5L5l4m5m6P9L5j1L5L0Rp3m9J6L5qnpj3j6j0MM2L0nK5Jj12J7O2k2k5j0QKO5
5577Bk3Kk9l9mJ2J6k6J9K0lL5kk5NK6l6Kk8LJO1N1r4K2mk9O1p9kM8RRJ2l7PJj0rK3kO0m2j0
5556b6J0J3j0p2pK2O8Jl9OL8J9l0rm0J6P3K5o8n3nqJ3j7N4Rk5j3L0J8m8L4k6K8J9o2J7KO2
5538A9Ql2j9n8pJ5Q4n2k6l8O0j6q4L4Q3k7QK5m4jK3j9j4RP2l2l7N5l2k4M6L8k6l7l9J06K5
5520D6p5n9ML7NL1M0J4Ol8k6l2jJ0Qj3N1or5pP3RJ0qk2ql8N1k6l3L6l6J0K9k8N1K9J1PL9j9
$$ plain form
5500 37 8 29 45 13 13 -8 -46 -75 -83 -86 -56 -77 -89 -23 -68 -100 -57 -81 -45 -56 -73 -101 -17 -44 -25 48 26 21 -61 -3 -14 4 -62 -68 -16 -3 5 -57
5482 -57 -122 -64 -45 -57 -112 -15 23 -43 -62 -65 -57 -33 -73 -83 -21 -30 -77 -89 -66 -6 -49 -42 -11 -2 -19 -66 -141 -77 -29 36 57 0 -11 -7 -7 -1 19 -17 -15 26
5463 26 -53 -92 -104 -133 -126 -91 -80 -115 -57 -78 -79 -111 -76 -29 -19 33 36 -16 -48 -64 -91 -81 -47 -35 1 -18 -24 -63 -20 -33 -37 -100 -27 51 37 1 3 19
5445 19 -18 -43 -64 -49 -36 -5 -69 -64 -35 -1 -18 -77 -58 -10 -45 -71 -28 -57 -59 -23 -47 -16 1 -1 -62 -70 -55 -7 -36 -42 -6 2 -15 -39 -4 5 -21 -43 -78
5427 -78 -90 -35 -30 -32 -72 0 21 29 17 -59 -62 -12 -70 -67 -85 -90 -38 -23 -49 -32 -12 1 -7 -35 -36 -9 24 -15 -57 -32 -36 -3 -25 -66 -81 9 5 -31 -30 6 9
5407 9 -27 -11 -46 -67 -64 -13 -82 -68 -58 33 -53 -54 -40 -41 -60 -6 10 14 -1 5 -15 -51 -7 20 -22 -39 -43 -41 -101 -29 13 50 30 30 -44 -24 -55 -66 -38 -47
5388 -47 -68 -16 -16 -59 -28 -12 -65 -31 -9 -35 -14 -16 18 59 11 -66 -57 -25 12 -43 -38 -21 -34 -51 -42 -32 -36 -53 -75 -44 -10 -5 -10 1 30 27 33 64 21 -39
5369 -39 -76 -46 -22 -42 -11 -70 -68 -36 -4 -37 -78 -76 -41 -24 -38 -27 -42 -27 -9 -26 21 58 1 12 -11 -14 -57 -60 -97 -76 -51 -37 -49 -75 -63 -35 -52
$$ packed form
5500C7k9K1J6l2%k1l8k9qlL0k1j2O6m5l2M3k4L6j1j7k8Q4k7J9P3k2nq2N8j1J8o6oN2J3Qo2
5482e7o5N8J9j2n5R7L8o6j9lQK4m0j0O2rm7j2K3O0m3PL1Rj7m7p5O4M8O5K1n7j1M%OK0l6KM1
5463B6p9l9j2k9PL5J1l5N8k1jl2L5M7J0N2Ln2l2j6k7J0L4J2L6j9ol9M3j3mo3P3P8j4l6KJ6
5445A9l7k5k1J5J3L1o4NK9L4j7n9J9M8l5k6M3k9kL6k4L1J7ko1qJ5M8k9oL6Qj7k4L5Rk6k2l5
5427g8j2N5Nkm0P2K1Qj2p6lN0n8Lj8nN2J5k6J7K0J3qk8jK7L3l9m2K5mL3k2m1j5R0ml6JL6L
5407Il6J6l5k1LN1o9J4J0R1q6jJ4jj9N4J6Mj5Ok0l6M4K7m2j7mKo0P2M2L7k0%p4K0l1j1K8r
5388d7k1N2%m3L1J6n3L4K2k6K1kL4M1m8p7RL2L7n5NJ7j3j7RJ0mj7k2L1L4NnJ1K9lOL1m3o0
5369c9l7L0K4k0L1n9KL2L2l3m1KL5J7j4J1j5J5J8j7M7L7n7J1k3lm3ll7K1K5J4j2k6J2K8j7
$$ plain form
5351 -52 -111 -44 32 64 -3 -11 -59 -48 -94 -61 -3 -5 -81 -28 8 -37 -77 -33 13 45 -64 -16 -38 -72 -53 -31 -30 -50 -27 4 3 8 -1 -29 -62 -42 -32 -68
5333 -68 -45 -25 -61 -47 -19 18 -7 -60 -67 4 13 -21 8 8 -13 -24 -66 -77 1 -30 -15 -23 -33 8 -5 -36 -36 -59 -48 -11 -30 -12 -23 -78 -97 -102 -59 -63 -74
5314 -74 -89 -47 11 -33 -87 -47 -40 -42 12 -69 -66 8 -25 -19 -2 64 -30 -65 31 -12 -28 -77 -54 -19 -51 -38 -40 -11 -40 -54 -37 -32 -32 1 27 6 1 -23 -68
5296 -68 -14 -37 -52 -37 -61 17 -1 -39 1 -5 -43 -60 -45 -42 -57 -22 -30 -31 -11 -20 -61 -17 -9 -24 -35 -40 -11 -47 -46 -47 -4 -33 -49 -63 -38 -66 -107 -85 -74 -62
5277 -62 -24 3 -57 -72 -8 -22 -67 -38 -11 -47 -7 -46 4 -32 -30 -57 -105 -32 -61 -7 -22 -76 -88 -66 -15 57 31 52 48 -16 -74 -96 -81 -55 -6 76
5260 76 74 -12 0 -8 -39 -49 -30 -55 -16 22 21 18 3 -31 25 -59 -89 -79 -56 -79 -74 -54 -78 -7 -18 -38 -37 -3 -62 -101 -104 -54 -35 -75 -27 9 21 -17 -44
5241 -44 -11 -34 -65 -17 -97 -79 -63 -19 -45 -35 -34 -55 27 30 8 33 -46 -52 -11 -26 -48 -45 -29 -40 -31 -48 -37 25 60 23 -7 -50 -46 -31 -13 44 8 -68
5223 -68 -23 27 -7 -46 -100 -33 -6 -99 -139 -119 -28 -5 -1 35 -19 46 -6 -14 -13 -4 19 -10 -7 8 -30 -10 22 17 -44 -68 33 17 -79 -108 -69 -60 -106 -127
$$ packed form
5351e2n9O7P6L2o7qm8J1m6L3N8kp6N3L6m5m0M4M6L2j09M8k2l4J9K2Jk0K3L1jNrk8l3K0J0l6
5333f8K3K0l6J4K8L7k5n3pP1Rl4K9%k1j1m2j1P8l1J5qj0M1j3l1%k3J1L7j9J8j1n5j9nM3mj1
5314g4j5M2N8m4n4M0PkN4q1LP4l3OJ7O6r4l5R6m3j6m9K3L5l2J3kK9k9j4J7N%L3K6k1nk4m5
5296f8N4k3j5J5k4P8j8l8M0ol8j7J5Lj5L5qjK0rm1M4Qj5j1nK9l6JjM3k9j6j4K5k8m1K2J1J2
5277f2L8K7o0j5O4j4m5K9K7l6M0l9N0l6Kk7m8P3k9N4j5n4j2K2N1P2k6K1mo4n8k2J5K6M9Q2
5260G6kq6J2ql1j0J9k5L9L8jlj5l4N6q4l0J0K3k3NK0k4P1j1k0JL4n9l9lN0J9m0M8L6J2l8k7
5241d4L3k3l1M8q0J8J6M4k6J0Jk1Q2Lk2K5p9oM1j5k2LJ6j1Rj7J1O2L5l7l0m3MJ5J8N7l6p6
5223f8M5N0l4l9n4O7K7r3m0K0R1K3ML6n4O5n2qJRK3k9LJ5l8K0L2no1k4J01j6r6k9L9Rm6k1
$$ plain form
5205 -127 -48 -17 -2 -46 -70 -85 -77 31 49 44 33 17 21 -14 0 21 38 22 39 -23 -30 8 24 9 -67 -58 -81 -54 -41 3 15 24 -5 -8 -6 -95 -81 -61
5187 -61 -58 -38 -51 -15 -11 -43 -58 -51 -27 -104 -65 -57 -1 6 -12 -13 -46 -75 -67 -25 -51 -4 31 -17 -73 -108 -57 -12 49 60 49 -19 -67 -65 -45 -81 -90 -26 -38 -20
5168 -20 -112 -125 -85 -24 -13 -34 -65 -59 -77 -63 -77 -79 -82 -23 -45 -24 -29 -24 -50 -49 -43 -41 -11 -75 -88 -39 -38 -20 -37 -56 18 26 -6 -57 -29 -67 -22 -63 -77 -41
5149 -41 7 -34 -52 -41 -59 -34 -22 4 -29 -48 -100 -114 -149 -125 6 6 -50 1 -44 -43 -56 -43 -19 3 -27 -20 -17 -30 -32 -37 -52 -82 -45 -16 -25 -47 -65 -14
5130 -14 -33 -37 7 -10 2 42 -43 -11 6 -12 -14 -37 -69 -65 -66 -43 -75 -39 -45 -110 -109 -65 -68 -76 -17 -37 -57 -43 -42 -97 -74 -62 -59 -61 -38 -72 -89 -81 -50 -82 -79 -33
5110 -33 -35 23 2 -27 -24 -65 -23 31 61 -30 -16 -56 -36 -8 -22 22 3 -5 7 4 -100 -41 47 34 -35 -20 1 22 -21 -86 -98 -96 -127 -27 -28 -32 -22 -66
5092 -66 -47 4 5 -21 -100 -97 -9 -64 -118 -112 -85 -32 -30 -77 -48 11 72 53 35 -40 -34 -36 -42 -94 -53 -45 -30 -28 10 24 -3 75 5 -17 -22 -73 -98 -12 -79 -105
5073 -105 -100 -1 -19 -15 -68 -85 -78 -80 -72 -48 -55 -88 -60 -11 1 19 -13 -21 -4 -62 -99 -78 -71 -1 -19 -71 3 -21 -37 -53 -57 -101 -105 -12 -20 -22 -41 -42 -25 -31 -40 37
$$ packed form
5205a27P9L1J5m4k4j5QJ08J8nj1j6Ml5J4K1J7j6J7o2pL8J6j5p6Rk3K7J3M4J2Rk9lKq9J4K0
5187f1LK0j3L6Ml2j5PK4p7L9QN6Pj8jl3k9QM2k6M7L5m8n6l5N1M5O1J1j1o8m8KK0l6rO4j2J8
5168b0r2j3M0O1J1k1l1Oj8J4j4klN9k2K1nNk6JOKL0o4j3M9JJ8j7j9P4Ql2n1K8l8M5m1j4L6
5149d1M8m1j8J1j8K5J2K6l3j9n2j4l5K4J31%n6N1m5Jj3J3K4K2l0PLj3knj5l0L7K9rk2j8N1
5130a4j9mM4j7J2M0q5L2J7j8kk3l2MjK3l2L6oo5JM4lqN9k0k0J4Jn5K3J2LkK3l4j7QL1l2LM6
5110c3kN8k1k9Lm1M2N4L0r1J4m0K0K8j4M4j9qJ2lj04N9Q8j3o9J5K1K1m3o5j2Kl1J00jmJ0m4
5092f6J9N1Jk6p9LQ8n5n4OK7N3Km7K9N9O1j9j8p5Okon2M1QJ5KL8J4k7P8p0k2nn1k5Q6o7k6
5073a05NR9j8Mn3j7PkQK4pl3K8M9J2J8l2qJ7n8l7K1PP0j8n2P4k4j6j6mm4mR3qkj9jJ7orP7
$$ plain form
5053 37 5 -31 -19 -44 -10 14 4 -29 25 64 25 -15 6 -16 -6 25 -3 -28 -43 -22 5 -29 -34 -43 -20 -2 -64 -130 -131 -123 -105 -98 -40 -96 -61 -34 -41 -56
5035 -56 -77 -35 -45 -64 -39 -66 -88 -52 6 62 2 0 -47 -49 -42 -51 5 -55 -87 -35 -27 -41 -19 -32 -35 -41 -47 -21 -37 -57 -43 -64 -45 -44 -44 -79 -45 -15 -29 -11
5016 -11 -18 9 3 -19 -50 -69 -82 -61 -43 7 3 -82 -48 -25 17 36 -11 4 9 -17 -79 -58 -36 -25 -89 -134 -99 -50 -27 -77 -88 -62 -58 20 -11 -15 -64 -99
4998 -99 -66 -47 -32 0 -13 13 43 42 8 -15 -39 -27 -22 10 35 42 47 30 -52 16 3 42 25 -7 -9 42 18 12 16 32 33 29 -30 -35 -39 -14 -23 3 -13 -36 36
4978 36 -11 -16 1 -48 -35 28 -19 -31 -54 -63 -50 -32 -47 -80 -34 -26 -17 44 0 -62 -39 -2 10 54 -4 26 109 42 -36 0 -43 -35 -79 -83 -65 -17 3 -37
4960 -37 -32 -83 -96 -37 -50 -7 -79 -50 -82 -55 -81 -26 18 11 72 39 44 21 -56 -48 28 66 22 -69 -105 -123 -91 -64 -31 -16 -46 -94 -112 -39 -43 6 33 22
4942 22 -15 -60 -20 2 -99 -108 -91 -27 -21 17 0 -41 -7 25 0 -16 44 40 0 -33 -12 -5 5 -24 48 -2 -10 14 -66 -62 35 -1 -61 -47 47 3 17 19
4924 19 -38 -58 -81 -16 8 -54 -86 -108 -123 -102 -91 -21 -6 -32 -35 -55 -2 43 49 49 16 4 -23 -22 -9 -44 -37 10 -4 -5 -30 -2 27 22 -20 -52 -12 -37 -25
$$ packed form
5053C7l2l6J2k5L4K4j0l3N4L9l9m0K1k2J0L1k8k5j5K1K7l4nrK3J8o2o6jQJ8PN8n6L5K7pj5
5035e6k1M2j0j9K5k7k2L6N8N6o0km7kPrN6o0l2N2Qj4K2j3looK6j6k0J4k1J9J%l5L4L0j4J8
5016a1pK7ok2l1j9j3K1J8N0mq5L4K3M2J9m7J5Nk6o2K1K2J1o4m5L5M9K3n0j1K6MP8l1mm9l5
4998i9L3J9J5L2j3K6L0jl4k3k4J2NL2K5PNj7q2O8j3L9j7l2kN1k4oMJ6Jmn9nmK5rK6j6k3P2
4978C6m7nJ7m9J3O3m7j2k3rJ3J8j5l3M6QRO1m4o2K3L7J2M4n8L0Q3o7p8L6m3Qm4mJ8M8K0m0
4960c7Nn1j3N9j3M3p2K9l2K7k6N5M4pO1l3Nk3p7QP6L8m4r1l6j8L2K7L3J5l0m8j8P3mM9K7j1
4942B2l7m5M0K2j01rJ7O4OL8j7m1L4L2k5j6O0mm0l3K1PJ0k9P2n0qK4q0MR7l6o0J4R4m4J4K
4924A9n7k0k3O5K4o2l2k2j5K1J1P0J5k6lk0N3M5O%l3j2k7JJ3l5PM7j4jk5K8K9nm2l2M0k5J2
$$ plain form
4905 -25 -36 2 -65 -74 -48 -23 -30 -45 -29 -46 2 -53 -51 -61 -59 1 -35 -34 -30 -24 -28 -37 -49 -60 -52 -52 -12 -4 -28 -44 -34 -43 -48 -65 31 101 37 20 -14 7 -71 -75 -41
4885 -41 -36 -23 -59 -33 2 15 -2 19 -5 -37 -55 -79 -152 -129 -61 -21 -13 -56 -68 -43 3 -40 -72 -74 -56 -12 -15 -15 -19 3 19 -27 -16 -5 16 -36 -15 -8 -27
4866 -27 -34 -82 -65 -1 -16 8 -22 -30 -28 16 70 58 -44 -82 -97 -67 -11 19 -17 -24 -25 3 -19 -32 -9 -35 13 18 70 3 -35 -105 -96 -142 -79 -57 -75 -25
4848 -25 -69 -114 -57 -41 -45 -25 -1 -20 -43 4 5 -23 -33 -30 -36 -21 -34 4 -30 -64 -52 -51 -56 -39 -114 -92 -60 -46 -54 -9 -8 20 0 -29 22 38 7 -9 11
4830 11 -13 -12 -11 -81 -33 -24 -38 -28 -37 -12 -36 -89 -34 6 24 11 -68 -41 -32 -38 -19 -59 -43 -60 -63 -86 -45 2 -36 -35 -77 -44 -50 -43 -24 -31 -19 22 8 28 62
4810 62 58 -58 -85 -45 -102 -45 6 -4 -7 59 67 29 10 55 21 -5 -36 -41 -20 -17 -53 -33 -52 -30 -1 67 41 -77 -76 2 -21 -44 -72 -75 -47 -65 -55 -13
4792 -13 0 7 -4 0 -8 -19 -39 -38 -93 -27 20 -10 4 -18 -5 4 41 60 33 -24 7 -28 -49 -45 36 42 36 10 -10 -76 -72 -85 -73 -65 -39 -89 -151 -64 -95 -87 -39
4772 -39 3 -39 -61 -60 -63 -21 -4 -33 20 27 28 34 -62 -28 -14 2 3 0 -22 4 -8 -53 -73 -64 -40 -60 -29 -64 -26 -36 -32 -55 -72 -59 -47 -101 -120 -149 -147 -54
$$ packed form
4905b5j1L8o7rK6K5pj5J6j7M8n5Kj0KO0l6JMOmrj2j1Q%M0Qk4j6J0rnj7R6P0o4j7l4K1p8mL4
4885d1NJ3l6K6L5J3j7K1k4l2j8k4p3K3O8M0Qm3j2K5M6m3l2kJ8M4l%mK2J6m6J1J1K1n2K1Pj9
4866b7pm8J7O4j5K4l0qKM4N4j2j02l8j5L0N6L0l6pjK8k2j3K3k6M8NN2o7l8p0Rm6O3K2j8N0
4848b5m4m5N7J6mK0K4j9k3M7Jk8j0LoJ5j3L8l4l4J2JnJ7p5K2L2J4qM5JK8k0k9N1J6l1j6K0
4830A1k4JJp0M8Rj4J0rK5k4n3N5M0J8j3p9K7RoJ9m0J6j7lk3M1M7l8Jm2L3oPJ9pJ2M1j4K0L4
4810F2mj16k7M0n7N7N1j0lO6Ql8j9M5l4k6l1nK1Ll6K0j9K2K9O8k6j18JP8k3k3k8lK8j8J0M2
4792a3J3Pj1Mqj1k0Jn5O6M7l0J4k2J3RL7J9k7n7L1l5k1MQ1Ook6k0o6Mj3J2QK6n0o2Q7l1QM8
4772c9M2m2k2JlM2J7k9N3PJOr6L4J4J6Jlk2K6j2m5k0RK4k0L1l5L8j0Mk3j7J3J2n4j9k9KR3
$$ plain form
4753 -54 -29 -42 -47 -59 -35 -92 -112 -150 -136 -74 -75 -111 -55 -49 -81 -97 -27 -16 -51 -2 -11 -58 -68 3 13 -41 -23 39 -22 -44 -70 -25 14 -28 -34 -46 -46 -19
4735 -19 -43 -40 -41 23 58 41 -7 7 16 -33 -16 -36 4 -35 -9 64 -42 -1 33 -39 34 62 7 31 -30 -61 -96 -75 -19 -62 -40 -4 -91 -111 -54 -41
4718 -41 11 -19 -7 20 24 56 79 25 13 -11 -33 -34 -80 -36 -59 -39 -43 -29 -22 -4 -3 -5 13 -12 -12 -66 -82 -62 -44 -73 -53 -82 -27 19 -2 15 -77 -63 -2
4699 -2 -1 32 10 -1 -9 -24 -7 -51 -51 -69 32 -32 -41 -42 -17 -51 -102 -124 -123 -58 11 62 22 56 20 28 7 -18 -41 -47 -20 10 94 81 28 -28 5 15 -19
4681 -19 13 19 -16 -47 7 -41 -22 -83 -82 -63 -43 -36 -64 -65 1 -52 0 -7 -93 -59 22 -5 -14 -30 -11 -10 -40 2 -7 -60 -84 -58 -31 -2 33 -31 -17 -15 -47 -6
4662 -6 -53 -105 -24 -31 20 44 -48 -124 -37 -92 -46 -49 -47 -47 -125 -41 14 -10 -29 -9 -35 -53 -48 -38 -33 -72 3 29 28 46 1 4 33 30 -19 12 -34 -39 -20 -6 -50
4642 -50 -108 -77 -27 -21 -9 -9 -32 4 51 67 -1 -8 -18 -48 30 36 -48 -135 -69 -48 -99 -80 -39 -33 4 -21 -56 -28 -79 -113 -28 -67 -82 -76 -62 -41 -64 -72 -40
4624 -40 38 21 8 -6 2 -46 -21 -32 -9 -5 47 35 -36 -20 8 47 -18 44 11 -37 13 -81 -24 -22 -49 -24 -38 -11 -27 -28 -27 -27 -7 -89 -53 -4 43 62
$$ packed form
4753e4K5j3nj2K4n7k0l8J4O2jl6N6Ol2j6P0J1l5M9rm7j0P1J0n4J8O2o1k2k6M5L9m2oj2%K7
4735a9k4LjO4L5j7m8J4Rm9J7k0M0l9K6P3j06M1L4p2P3K8n5K4o1l1l5K1N6m3K2L6q7k0N7J3
4718d1N2l0J2K7ML2K3n4j2k4k2jm6M4k3K0mJ4PJ8JkJ8k5%n4j6K0J8k9K0k9N5M6k1J7r2J4O1
4699bJL3k2j1qj5J7m4%j8J01o4rjK5l4n1k2JO5O9N1m0L4l6Qk1k5k3oK7L0Q4j3n3n6L3J0l4
4681a9L2Ol5l1N4m8J9o1JJ9K0Pk8jO6n3N2pq6L4Q1k7rj6J9Jl0M2rn3k4K6K7K9L5o4J4Kl2M1
4662fm7n2Q1pN1K4r2p6Q7n5M6lK%p8Q4N5k4j9K0k6j8NJ0Nl9P5K6jJ8m5LK9lm9L1m6nJ9J4m4
4642e0n8L1N0OJ2%k3L6M7J6o8pj0l0P8Oq4q7O6K1n1J9M1OL7k5l5K8n1l4Q5l9j5OJ4K1k3qL2
4624d0P8j7j3j4Qm8K5j1K3MN2j2p1J6K8L9o5O2l3m8N0r4N7Kk7K5j4K7j6jJ%K0q2L6M9M7J9
$$ plain form
4605 62 71 15 46 53 6 -16 -105 -67 7 13 -5 -21 -1 40 17 16 -2 -20 -21 -37 -40 -29 -43 -27 -37 -48 23 22 -15 17 78 65 12 33 -13 -49 -40 -7 -18
4587 -18 -45 -60 -80 -30 30 56 21 -5 -49 -50 -18 25 -33 -47 -36 -21 35 25 -21 -5 8 27 28 37 4 -55 -76 -55 -66 14 -15 -103 -46 -25 -57 -59 -40
4569 -40 -16 8 82 10 23 -11 9 25 3 -27 -70 -69 -54 -7 4 7 27 -7 -9 11 -66 -63 -49 6 -1 -46 -56 -43 -30 -81 -68 -29 -51 -76 -3 -19 -73 -59
4551 -59 -20 -31 -5 30 -4 -23 40 36 28 49 31 28 -51 -89 -56 -40 -50 -74 -56 -52 -54 -5 -31 -69 -51 -33 -17 -53 -77 -99 -93 -60 -71 -33 -34 -40 -52 -95 -51
4532 -51 -17 -11 33 4 -1 -19 38 20 -78 -69 -32 -40 -42 -39 -11 -15 -44 -42 30 -5 -77 -85 -25 -54 -44 -64 -80 -150 -90 -84 -59 11 -54 -61 -98 -37 -5 -51 -51 17 30
4513 30 28 36 109 67 64 89 51 45 32 30 2 1 55 18 -53 -54 -13 -4 -51 -2 -40 -112 -73 -113 -115 -100 -75 25 -35 -52 -34 -41 -26 31 69 14 -37 -109 -122 -113
4494 -113 -52 -50 -43 -15 -69 -49 -43 -118 -126 -80 -61 -92 -81 9 28 -11 -9 -49 -74 6 3 -8 23 51 51 26 -33 -6 6 20 -7 5 -2 -4 -4 -45 -67 -52 -27 -14
4475 -14 -22 -44 -5 8 -59 -52 -59 -53 -31 -99 -56 16 1 -82 -24 -12 -45 -15 20 -21 -53 -28 -27 -72 -17 -77 -14 -3 -38 -42 -64 -37 -28 19 -45 -70 -120 -106 -36
$$ packed form
4605F2Rn6L1Pm7k2q9L8P4Oj8j6K0M1k3jj8j8jj6lJ1j4J6j0j1P1jl7L2O1j3n3K1m6l6RL3j1
4587a8k7j5k0N0O0K6l5k6m4jL2M3n8j4J1J5N6j0m6J6J3J9JRl3n9k1K1j1Q0k9q8N7K1l2kJ9
4569d0K4K4P4p2J3l4K0J6k2l0m3JJ5M7J1LK0l4kK0p7LJ4N5pm5j0J3J3n1J3L9k2k5P3j6n4J4
4551e9L9j1K6L5l4j9O3mqK1j8lp9l8L3J6j0k4J8MkM9k6l8J8J8J6l6k4k2OL3j1L8joj2m3M4
4532e1L4OM4k9nj8N7j8r8RL7qkLK8mk9KP2l5p2qO0k9J0k0j6p0O0OK5P0o5pl7O1L2m6%O8J3
4513C0kQP3m2lK5l8oj3kk8jN4l7p1jM1Rm7M9l8p2L9m0kJ5K5J00o0j7J8pJ5N7L8n5n1p2j3R
4494a13O1KPK8n4K0Op5qM6J9l1J1R0J9l9Km0k5Q0lj1L1K8%k5n9K7J2J4k7J2pk%m1k2J5K5J3
4475a4qk2L9J3o7PpOK2o8M3P2j5q3N8J2l3L0L5m1l2K5Jm5N5o0O3J1l5mk2K7RM7o4k5n0J4P0
$$ plain form
4456 -36 1 -67 -31 -39 -46 -30 -4 -17 -2 0 39 11 -22 29 28 15 -3 66 34 -18 -21 -25 -43 22 38 -23 -1 -29 -81 -21 -14 9 40 -23 -83 -40 -47 -2 37
4438 37 -54 -83 -101 -27 -28 3 43 53 24 -54 -60 -44 12 32 -45 -83 -55 0 -42 -64 -42 -80 -94 -100 -86 -67 -26 -40 -36 -25 -72 -93 -53 -90 -86 -22 3 27
4419 27 42 -11 -26 7 -32 -37 -25 20 36 -36 -45 16 30 49 -4 -19 16 -27 -22 -40 -1 -18 -13 0 -2 -17 -48 -64 -27 12 -3 -48 -58 -49 -26 -1 -16 -14 11
4401 11 20 23 17 5 20 17 -20 -70 -117 -95 -54 -78 20 -10 -55 -60 -31 0 6 -28 8 45 51 -7 -15 5 -19 -17 -51 -10 -7 -43 -10 -27 -5 -37 6 23 1 -85
4382 -85 -120 -95 -131 -73 -23 -28 -30 -70 -50 -3 -4 -76 -98 -73 -112 -111 -62 -7 5 -54 -11 12 -62 -102 -47 -41 -88 -78 -92 -38 -34 -55 -56 -7 40 74 43 2 -5
4363 -5 30 -6 -50 -12 -2 19 49 28 12 39 22 -23 24 31 27 34 16 -47 -61 -18 -69 -62 -90 -69 -50 -92 -110 -91 -17 -6 -77 -56 0 -7 17 2 -39 -64
4345 -64 -60 -88 -79 -61 -59 -52 20 -4 -20 -64 -115 -118 -28 -39 -110 -54 -64 -30 4 -52 -78 -57 -39 -14 -59 -105 -68 -48 -69 -93 -84 -72 -74 -76 -40 -7 -4 -55 15 43
4326 43 35 14 4 10 -92 -87 -51 -80 -34 -42 -30 -32 -17 50 -8 -5 -4 -20 -46 -75 -49 9 30 47 -3 -70 -19 -33 2 -1 -43 -69 -69 13 39 41 26 -25 16 -25
$$ packed form
4456c6L7o8L6qpJ6K6j3J5KL9k8l3N1jj3j8O9l2n2lmj8O5J6o1K2k8n2O0PK3L1o3o0M3pM5L9
4438C7r1k9j8P4jL1M0J0k9p8oJ6N6K0p7l8K8N5m2k2K2l8j4oJ4J9M1j4MJ1m7k1M0l7MO4K5K4
4419B7J5n3j5L3l9nJ2M5J6p2rO1J4J9n3j5L5m3Nj8L9j7NJ3kj5l1j6L7L9j5m5j0RK3K5j5KK5
4401A1RLoj2J5ll7n0m7K2M1k4R8l0m5nK9L1Ol4L6L7On8qK0k4Kl4M1Ll6L3j7K2l2M3J7k2q6
4382h5l5K5l6N8N0nkm0K0M7jp2k2K5l9JM9N5J2n9M3K3p4m0N5Om7J0j4N4Mk1jM9M7L4l1m1p
4363eL5l6m4L8J0K1L0k1j6K7j7m5M7PmPj8o3j4M3n1Pk8K1J9m2j8J9P4J1p1K1N6pK4j5m1k5
4345f4Mk8RJ8KPP2k4j6m4n1lR0j1p1N6j0L4L4n6k6K1J8K5m5m6L7K0k1k4RJ2kkL6L3Ln1P0K8
4326D3qk1j0Oj02NL6k9M6qJ2kJ5O7n8LJj6k6k9K6N8K1J7n0o7N1j4L5lm2k6%Q2K6Kj5n1M1m1
$$ plain form
4307 -25 -56 -25 6 -59 -40 -31 -34 -17 -34 -47 1 8 86 47 -20 4 -73 -66 -45 -21 -56 -98 -97 -39 -25 -6 -26 -40 -53 6 3 -30 -38 -12 -2 -18 -20 41 2
4288 2 -20 -31 -100 -60 -44 -33 -20 -25 -46 -4 26 40 32 65 -16 -70 -66 11 -10 -24 23 28 -9 -1 -26 -7 20 14 -12 -24 -59 48 74 17 -15 0 -15 -25
4270 -25 29 -9 19 24 17 13 -29 -41 -81 6 90 61 46 -35 -108 -56 -67 -108 -92 -50 -55 -17 -15 -6 -8 -18 -29 -49 -63 -87 -59 -13 -7 16 -32 -86 -65 -76 -63
4252 -63 45 -29 -49 -27 -15 -54 -49 -43 -58 -87 -82 2 31 18 2 -52 -14 -50 -81 -37 -52 -71 -13 16 65 75 36 -17 -64 -10 -18 -42 25 4 -81 -61 -22
4234 -22 17 52 -22 -19 -48 1 -5 -71 -55 -37 -24 -36 5 -26 -3 -16 -49 -101 -104 -106 -140 -77 -72 -36 29 -8 -36 -27 -45 -75 -16 -12 -71 -38 29 -24 -14 36 11
4215 11 -46 -40 6 35 22 -34 -25 2 -71 -69 -47 19 -56 -61 -84 -103 -37 -33 7 -36 29 70 30 26 7 -25 50 87 33 49 19 -6 -33 -54 -87 -47 20 77
4197 77 23 -57 -11 -31 -102 -84 -67 -7 -2 2 -24 -23 29 -101 -55 14 -30 28 19 6 -103 -18 1 1 -47 -46 -42 -42 -55 -18 -74 -72 -23 -87 -98 -54 -33 -17 -61
4179 -61 -40 -66 -91 -58 -24 25 -19 -26 37 -29 -32 -45 15 -55 -92 -90 -46 -48 -88 -62 -74 -41 -31 -59 -34 -53 -14 -73 -142 -128 -78 -34 -8 -39 -25 -21 -43 -41
$$ packed form
4307b5l1L1L1o5J9RlJ7j7j3M8PP8l9o7K4p7PK1K4l5m2JN8J4J9k0j4j3N9ll3qK6J0j6kO1l9
4288Bk2j1o9M0J6J1J3nk1M2L0J4qL3q1n4MP7k1j4M7Nl7Qk5J9K7ok6j2l5J07K6n7l2J5j5j0
4270b5N4l8K8Npmm2j2m0Q7Q4k9j5q1p3N2j1m1J6M2nL8KRkj0j1k0j4k4K8M6OK3m8n4K1j1J3
4252f3J08p4k0K2J2l9NOj5k9NQ4K9j3j6n4L8l6l1M4j5j9N8K9M9J0l9n3m7N4qk4O7k1q5K0L9
4234b2L9L5p4Lk9M9oo6J6J8J3j2M1l1K3j3l3n2lkl4O3NL6O5l7k8Rj8l0N9Mn9L3O7n3J0N0k5
4215A1n7OM6K9j3n6RK7p3KK2O6p5nk3j9O6MM0m3O5M1m0mj9l2P5L7n4J6l0k5k7k1l3M0O7N7
4197G7n4q0M6k0p1J8J7O0NMk6JN2j30M6O9m4N8rj3j09Q5J9%m8JM%j3L7n6KM9o4j1M4K1J6m4
4179f1K1k6k5L3L4M9m4pO3o6lj3O0p0l7KM4km0K6j2L3J0k8K5j9L9n9o9J4N0M4K6l1J4Mk2K
$$ plain form
4161 -41 -52 -40 -55 12 10 0 -11 -48 -35 -49 -39 -28 -26 23 -17 -39 -20 -39 -44 -73 -60 9 -23 -25 32 58 3 49 41 -15 -36 -75 -80 -67 -68 -37 37 -5 0
4142 0 -4 -5 -19 29 -32 -68 27 -2 21 -5 -65 -77 -71 -67 -30 25 19 10 -8 11 36 -21 -16 78 46 63 -2 -46 -41 -53 -68 -68 -47 -22 -58 -92 -9 -5 -37 -14 -65
4122 -65 -8 -16 -24 24 36 46 41 -13 -22 9 23 43 15 29 26 101 85 32 54 -17 -9 44 46 -1 9 -37 8 -46 -37 -58 -25 9 -7 21 29 -26 -51 -72 -115 -59
4103 -59 -22 0 -41 -83 -30 24 49 30 -6 -18 7 19 5 -25 -74 -60 -39 3 -21 -27 -46 -23 -8 -31 -20 -79 49 24 -21 52 56 -2 8 -1 -36 -46
4086 -46 -49 -98 -106 -100 -42 -76 -94 -64 -8 -32 -94 -82 -131 -96 -73 -6 -21 -51 -30 15 -82 -71 -34 34 -52 -49 6 12 -42 -82 24 29 28 -4 -36 -73 -100 -48
4068 -48 -8 -26 -73 -67 -15 -66 -88 -50 -33 16 0 -17 -22 -63 12 -8 -39 -50 -35 -47 -55 -7 -10 -6 -20 -22 -40 -37 -17 -12 42 93 52 -58 -35 -4 -13 -3 0 -38
4049 -38 -58 -59 -32 -47 -31 8 10 34 23 -18 12 13 -56 -6 4 -10 9 -10 -25 40 21 9 -3 13 68 53 13 48 37 -5 -29 -63 -43 -15 14 29 45
4031 45 41 9 37 39 21 -1 -25 -69 -45 -28 -69 -77 -58 -41 -17 10 48 -1 -60 -31 40 90 54 -18 -58 -13 -20 -8 43 51 11 -8 -23 -59 16 79 68 -16
$$ packed form
4161d1j1J2j5O7kj0j1l7J3j4J0J1KM9m0k2J9j9nk9J3O9l2kN7K6n5M6qn6k1l9nJ3jL1P4m2N
4142@mjj4M8o1l6R5k9K3k6o0j2OML7N5orj8J9K5n7NR4l2J7o5m4Nj2j5%K1K5l6l4Q3Ml2K3n1
4122f5N7qqM8J2J0nn4rL1J4K0k8J4lP5j6n3K2p1QN3Km7J0m6M5n4Rk1L3L4j6K8Qn5k5k1m3N6
4103e9L7K2m1m2N3N4K5j9l6j2K5J2j4l0m9J4K1M2k4oj9K3J5k3J1n9J28k5m5P3Mn8J0rl5j0
4086d6lm9qON8l4j8L0N6k4o2J2m9L5K3O7j5l0K1M5r7J1L7O8q6LN5On4m0J06Njl2l2l7k7N2
4068d8M0j8m7ON2n1k2L8J7M9j6j7nm1P5k0l1j1J5j2qM8lMj4kj8LK0NN4N1m1j10K3L1rJ0Ll8
4049c8k0jK7j5J6L9KK4j1m1L0Jo9N0J0j4J9j9j5O5j9j2j2J6N5j5m0L5j1m2k4l4K0K8K9J5J6
4031D5ml2K8Kj8k2k4m4K4J7m1qJ9J7K4K7L8m9n9K9P1N0l6p2m0M5pJ2N1Qm0j9j5l6P5O3j1q4
$$ plain form
4013 -16 -14 -34 -65 -8 -46 -41 -18 -49 -20 -23 -23 -61 -20 -57 -69 -89 -64 -71 -87 -46 -13 7 3 -20 -30 -21 40 60 68 2 -50 -66 -31 -64 -71 -22 -8 3 -14 -46
3994 -46 -60 -87 -51 -46 -65 -38 -50 -59 7 12 25 6 22 41 17 17 41 17 13 -16 -12 0 -4 -1 -7 -68 -7 -10 -27 13 1 -2 37 2 -71 -43 -26 -44 -24 -52 -37
3975 -37 -43 -31 0 18 13 -60 -94 -101 -107 -110 -47 -73 -71 -56 0 41 -8 -47 0 23 24 -4 22 2 -87 -125 -109 -53 -32 -30 -13 7 -31 -65 -36 -67 -31 2 8 15
3956 15 -1 1 -19 -32 -18 -37 -19 -53 -74 -72 -106 -76 -9 -16 -26 10 22 -39 -35 -63 -39 -77 -83 -98 -72 -17 5 12 13 13 -14 -114 -73 -34 -38 -14 -32 -37 -50 -2
3936 -2 30 14 28 -3 -40 -52 -14 -21 -55 -43 34 9 -33 -3 9 44 65 36 -34 -4 37 35 -4 -48 -47 -61 -89 -66 3 -2 23 -19 1 -11 13 -33 -84 -84
3918 -84 -59 2 -27 -57 -1 -24 -49 45 13 -9 26 33 6 -28 -49 -67 -28 -9 -52 -35 -48 -40 -64 -38 -63 -62 23 -7 -34 -35 -18 -41 -25 20 -59 -15 -9 10
3900 10 2 -30 -7 15 -15 -20 -16 -9 69 34 -35 -32 -39 -38 -35 -93 -61 -51 -76 -39 -29 17 -3 26 52 -1 28 20 -46 -84 -14 -7 -23 -74 -87 -51 -43 33 1 -47 -31
3881 -31 -28 -92 -54 -106 -95 -49 19 -3 -17 -23 -35 -26 -14 -18 -46 -56 -67 -20 7 -24 -38 -15 -12 36 27 36 53 0 -69 -38 -27 -74 -25 -57 -41 -31 -2 -32 -16
$$ packed form
4013a6Kk0l1N7l8NK3l1K9l%l8M1l7j2k0K5pj6M1L3K0mk3j0RO1K0Qo6n2j6L5l3pM9J4J1j7l2
3994d6j4k7L6Nj9K7j2rO6NJ3j9J6J9k4%K4k4mk9MJ2mLoo1O1lj7M0j2lL9l5p3K8J7j8K0k8J5
3975c7oJ2L1J8np3l4polO3k6KJ5N6M1m9l9M7K3Jk8K6k0q9l8J6N6K1KJ7K0l8l4K9l1L6L3OP
3956A5j6Kk0j3J4j9J8l4k1Kl4L0O7pj0L6J2o1Mk8K4l8oj5K6N5K2PJ%k7j00M1L9mK4j8nj3M8
3936bL2j6J4l1l7j2L8pl4J2P7k5m2L0J2L5K1k9p0L0M1kl9m4Jj4k8K3O9nK5m2K0j2K4m6n1%
3918h4K5O1k9l0N6k3k5R4l2k2L5Pk7l4k1j8L9J9m3J7j3Qk4K6k5JQ5l0k7jJ7k3J6M5p9M4OJ9
3900A0ql2K3K2l0nMPP8l5o9LpJLn8L2J0k5L7J0M6k0K9K6n3K9qo6l8P0Pj6n1j3L6QP6l2m8J6
3881c1Lo4L8n2J1M6O8k2j4oj2RJ2mk8j0j1M7K7l1j4K3LM8rRJ7n3o9L1J1m7M9l2J6J0K9l0J6
$$ plain form
3862 -16 -34 10 2 -71 -31 -10 -53 -67 -34 2 -2 -15 -35 -8 -3 -35 -30 7 -12 -44 -64 4 5 -16 4 13 11 14 -44 -29 -24 -32 -60 -73 -45 -79 -92 -41 -6 12
3843 12 -8 -47 -43 4 -36 -27 -10 -70 -88 -131 -81 -28 6 33 -13 23 -40 -57 -71 -58 -38 -64 -80 -90 -31 -59 -35 -55 -15 -69 -7 56 36 29 22 18 -8 30
3825 30 20 54 21 27 -31 -17 19 30 7 85 29 -80 -85 -81 -18 0 20 -30 -50 -121 -93 -24 -14 -28 -22 -13 -31 10 2 -22 8 -7 -5 1 -47 -32 16 -58 -15
3806 -15 -59 -15 27 -67 -46 -19 -50 -10 34 5 -32 40 -24 -27 -28 -44 -35 -9 -5 0 -91 -121 -104 -4 -5 -52 -74 -37 -65 -54 -34 -17 -84 -136 -67 -20 -27 -13
3788 -13 -2 -24 -16 -5 9 2 -44 -27 -20 -69 -76 -59 -61 -22 21 -26 -6 -8 -62 2 -20 -26 57 92 62 42 -4 -35 -34 -33 -51 -8 -9 22 16 14 72 83 64 -8 -26
3769 -26 -77 -74 22 5 -31 -58 6 -38 0 -15 -5 -83 -62 -46 -67 -35 -10 -55 -107 -59 -63 -40 66 10 -15 -83 -40 3 18 5 -7 -2 -76 -84 -71 -54 0
3751 0 -30 -25 -34 -39 -98 -87 -103 -59 -61 -68 -47 -65 -30 15 19 -4 49 -16 -46 -46 -1 6 32 12 17 -8 -33 -35 16 -46 -38 -51 -74 -56 51 97 51 38 21 27 7
3731 7 6 -10 29 73 52 55 -2 -44 -87 -21 -38 -31 -26 -4 62 47 30 -29 -56 -32 -12 -46 -6 -55 23 61 75 69 30 7 28 1 -20 -41 -70 14 -21 -84
$$ packed form
3862a6j8M4qp3M0K1m3j4L3L6mj3k0K7Nl2NL7j9l2k0O8Jk1K0RkLn8J5Nqk8j3K8l4j3N1L5J8
3843A2k0l9MM7m0RJ7o0j8m3N0N3L4K7m6L6o3j7j4J3K0k6j6j0N9k8K4k0M0n4O2O3k0ppmk6L8
3825C0j0L4l3On8J4L6J1k3P8n6j09nMO3J8K0n0k0p1K8O9J0j4ORj8M1qk4L0j5KOm8J5M8p4M3
3806a5m4M4M2r4K1K7l1M0M4k9l7P2o4ljj6RK6MNr1l0J7J00jm7k2L7k8J1K0J7o7n2O9M7pJ4
3788a3J1k2QJ1J4pm6J7Pm9pJ7kL9M3m7K0kn4O4k2oQ3L5l0k0m6l1JJj8M3jL1okN8J1j9p2j8
3769b6n1LR6j7l6k7O4m4L8j5J0p8K1J6k1L2K5m5n2M8mK3J06n6k5o8M3M3J5j3j2Np4qJ3J7N4
3751@l0Nrnn9J1j6M4kpK1j8L5M5Mk3N3o5l0%M5PK6k0Nk5k5kN1o2Qj3k3J8J07M6m6j3j7Ok0
3731Gjj6L9M4k1Ln7m2m3O6j7PNK2O6j5j7n9k7K4K0l4M0m9P8L8J4ol9k3K1k7k1k1k9Q4l5o3
$$ plain form
3713 -84 -45 -14 49 33 20 -20 -55 -2 -26 56 -8 -3 -21 -26 34 20 35 -59 -76 -73 -83 0 -7 -18 15 6 1 -37 -39 29 64 11 19 -13 60 -5 21 49 44 55
3694 55 -26 -102 -84 -35 -42 24 30 57 63 26 2 -45 -38 -35 -7 26 -35 -42 29 61 -12 -7 16 -11 51 40 -20 -13 -55 -41 -35 -36 -32 11 32 36 34 37 86 17 -23 -20 47
3674 47 127 98 121 147 43 -5 15 23 32 -31 22 75 78 52 37 -2 -40 -40 -28 -12 -8 -25 -31 -46 -68 -50 5 -12 -86 -73 -2 -7 -10 -5 17 22 32 43 -69
3655 -69 -56 -8 -13 7 20 -2 -5 -52 -97 -41 -7 -62 -7 42 35 -48 -62 2 -17 -16 14 41 29 -1 -67 -43 26 -34 -5 -30 29 39 9 -59 -13 -37 -16
3637 -16 -20 -17 13 -32 -94 -107 -90 -42 -26 -74 6 16 4 -43 -85 -47 33 44 -17 -13 -20 -78 -75 -73 -7 -5 -30 -12 20 2 -16 -25 -32 -58 -60 -14 -92 -89 -38 -34 -54
3618 -54 -44 -37 -28 -34 -39 -29 -86 -112 -72 -79 -29 33 15 18 -10 -38 -31 28 32 35 -21 33 -47 -55 21 44 -2 -29 7 -57 -35 -15 -16 -52 -103 -5 32 9 -58 10 4
3598 4 24 -21 -28 -35 -36 -52 -31 2 -10 -26 -89 -34 4 36 38 37 41 -65 -64 -26 1 14 38 37 28 32 36 -15 -19 21 -22 -32 17 -21 -18 5 -6 -14 24 17 3 -30 20
3578 20 13 -26 -56 -57 -8 20 -15 13 -29 -32 -87 -38 -84 -35 -6 6 -34 -43 -65 -44 19 -43 -59 -50 -2 31 0 -10 -23 -27 -20 16 -11 -36 -73 -40 61 -7
$$ packed form
3713h4L9L1O3j6j3m0l5N3k4Q2o4Nj8nO0j4J5r4j7Lj0Q3pj1L3rnl8kO8L5n3Ql2P3o5K6K8nJ1
3694E5q1p6J8M9pO6OK7Ol7k4m7PLK8L3o1pP1L2p3NK3k7O2j1o0Pm2J4OjMM3K1MkLM9o9m0LO7
3674D7Q0k9K3K6j04m8K0QRo3N3N3Lk6j5l9l8%J2J6Mj7oj5k2J8N5j7p4J3P1nlNK2NJ0J1j12
3655f9J3M8nK0J3k2lm7m5N6L4n5N5M9pq3j4O4j9JL0K7j2l0o6K4O9o0K9k5N9J0l0o8M6k4K1
3637a6mLL0m5o2j3J7M8J6m8Q0J0j2m7m2L8Q0J1o1Mpn8LKO6Kk5J8L2j8j8rpk6kM6p8LN1Mk0
3618e4J0PRonJ0n7k6M0pN0O2j8Lk8k8PN9MLn6N4q0qP6K3m6k7L6o4K2K0jl6n1R8L7k3o7O8o
3598DK0m5ppjj6K1L3j2j6o3N5L8L2KjMj06JL8K7J3K4jrMMn1mM0m3j0M9l8LK3j1qL8pj4l3N0
3578B0pl9l0jM9K8l5K8m2ln5M9m6M9K9J2m0rk2K1O3o2j6RM8L3l1j0j3mPL6k7k5l7L3J01o8
$$ plain form
3560 -7 -41 -53 -32 -14 -3 -27 -40 16 -4 -22 13 26 11 39 26 17 -14 -45 -66 -64 -46 -38 -8 -45 -55 -15 -16 -25 -92 -99 -32 -42 13 -3 -5 20 -12 17 -29
3541 -29 -46 -11 -15 -18 -17 15 65 19 -2 -9 15 22 -54 4 -63 9 -11 -33 9 -35 -91 -184 -95 -89 -53 -34 -22 -6 -97 -117 -93 -41 0 50 26 -22 0 10
3523 10 -78 -63 -15 6 -42 -26 -28 41 62 18 7 26 54 2 -2 -29 -22 -36 9 40 47 39 -23 -71 -41 -24 6 -10 4 -39 -38 -27 -34 -50 -26 -9 -34 -35 -9
3504 -9 -20 1 19 -42 -33 -59 -18 56 71 -24 -100 -54 -21 -53 -57 -82 -110 -53 -62 -52 -54 -24 -19 -73 -98 -88 -83 -13 23 -34 -90 -75 0 24 -39 -23 4 0 -7 -16
3485 -16 -47 -52 0 68 -21 -25 -67 -132 -87 -67 -53 -29 -22 31 1 -49 -68 -14 2 -60 -28 -50 39 19 -21 -14 -55 -40 27 -25 -59 -70 -22 22 4 -15 -1
$$ packed form
3560gl4j2K1J8J1k4j3N6k0j8L5J3j5K8j3rl1l1k1KJ8QL0l7j0M0jro7pO7j0N5j6kK5l2K9m6
3541b9j7L5mlJL2N0m6k1pK4Pp6N8o7P2k0k2M2m4n6r3Q9OL6J9J2J6r1k0K4N2M1N0k4m8K2J0
3523A0q8J5M8K1m8J6kO9K1m4j1J9K8n2mk7Pj4M5L1Pqo2m8L0J7L0j6J4m3JJ1pj6K4J7k5jK6
3504ij1K1J8o1Rk6M1P4J5r5p6M6L3l2mk5k8N7rJ0kL0Nn4k5J0NP0L6n7n6J5P5K4o3J6K7mpr
3485a6l1nN2O8q9mm2o5M5K0J4K4PN3l0n0j9N4J6o2L2k2Q9k0m0Pm1J5O7n2l4j1M8M4j8j9J4
$$ [...]
-1793b8
##END=		$$ NMR SPECTRUM
##END=		$$ LINK
