##TITLE=	Oct03-2014-fpc.11.fid
##JCAMP-DX=	6.0	$$ MestReNova 14.3.3-33362
##DATA TYPE=	LINK
##BLOCKS=	1    
##ORIGIN=	Mestrelab Research S.L.
##OWNER=	hrzepa
##$MNOVA/METADATA=	(DOCUMENT,BASE64)
eyJuYW1lIjoiRG9jdW1lbnQgNSIsInBhZ2VzIjpbeyJpdGVtcyI6WyIxIiAgICAgXX1dfQ==
##TITLE=	Oct03-2014-fpc.11.fid
##JCAMP-DX=	6.0	$$ MestReNova 14.3.3-33362
##DATA TYPE=	NMR SPECTRUM
##DATA CLASS=	XYDATA
##BLOCK_ID=	1
##ORIGIN=	Bruker BioSpin GmbH
##OWNER=	nmr
##NUMDIM=	1
##$MNOVA/METADATA=	(ITEM,BASE64)
eyJhbmdsZSI6MCwiYXhlcyI6eyJ4Ijp7Im1heCI6MjE5LjcxNzMwMDAwNjE1MzEsIm1pbiI6LTE5Ljc
yODY2NDQ2ODc5MDExNH0sInkiOnsibWF4Ijo3MjQzLjYwOTA2OTgyNDIxOSwibWluIjotNzg3LjY1MD
kzOTk0MTQwNjJ9fSwicG9pbnRzIjpbeyJ4Ijo1MzIxLCJ5Ijo1ODM1fSx7IngiOjg3MjIsInkiOjU4M
zV9LHsieCI6ODcyMiwieSI6ODIwOH0seyJ4Ijo1MzIxLCJ5Ijo4MjA4fSx7IngiOjUzMjEsInkiOjU4
MzV9XSwieiI6MH0=
##.OBSERVE FREQUENCY=	62.901528049852601043
##.OBSERVE NUCLEUS=	^13C
##.SOLVENT NAME=	CDCl3
##.PULSE SEQUENCE=	zgpg30
##LONGDATE=	2014/10/03 20:18:00.000
##.ACQUISITIONMODE=	SIMULTANEOUS (DQD)
##$ORIGINAL FORMAT=	Bruker XWIN-NMR
##$MNOVA/SCALES_VERSION=	9
##$PARAMETER FILE=	(acqus, ASCII, /private/var/folders/bp/m_4195y96sx1d256lqvkcvym0000gq/T/h7oVVBfKSQqfriC9E7jhrw/13C/acqus, 0)
$$ ##TITLE= Parameter file, TOPSPIN		Version 1.3
$$ ##JCAMPDX= 5.0
$$ ##DATATYPE= Parameter Values
$$ ##ORIGIN= Bruker BioSpin GmbH
$$ ##OWNER= nmr
$$ $$ 2014-10-03 20:18:23.848 +0100  nmr@CHPC-NMR250
$$ $$ C:\Bruker\TOPSPIN/data/fpc/nmr/Oct03-2014-fpc/11/acqus
$$ ##$AMP= (0..31)
$$ 100 100 100 100 100 100 100 100 100 100 100 100 100 100 100 100 100 100 
$$ 100 100 100 100 100 100 100 100 100 100 100 100 100 100
$$ ##$ANAVPT= -1
$$ ##$AQSEQ= 0
$$ ##$AQ_mod= 3
$$ ##$AUNM= <au_zg>
$$ ##$AUTOPOS= <57 >
$$ ##$BF1= 62.895239
$$ ##$BF2= 250.13
$$ ##$BF3= 62.895239
$$ ##$BF4= 62.895239
$$ ##$BF5= 500.13
$$ ##$BF6= 500.13
$$ ##$BF7= 500.13
$$ ##$BF8= 500.13
$$ ##$BYTORDA= 1
$$ ##$CFDGTYP= 0
$$ ##$CFRGTYP= 5
$$ ##$CHEMSTR= <none>
$$ ##$CNST= (0..63)
$$ 1 1 145 1 1 1 1 1 1 1 1 1 1 1 1 1 1 1 1 1 1 1 1 1 1 1 1 1 1 1 1 1 1 1 
$$ 1 1 1 1 1 1 1 1 1 1 1 1 1 1 1 1 1 1 1 1 1 1 1 1 1 1 1 1 1 1
$$ ##$CPDPRG= <waltz16>
$$ ##$CPDPRG1= <>
$$ ##$CPDPRG2= <waltz16>
$$ ##$CPDPRG3= <>
$$ ##$CPDPRG4= <mlev>
$$ ##$CPDPRG5= <mlev>
$$ ##$CPDPRG6= <mlev>
$$ ##$CPDPRG7= <mlev>
$$ ##$CPDPRG8= <mlev>
$$ ##$CPDPRGB= <>
$$ ##$CPDPRGT= <>
$$ ##$D= (0..63)
$$ 0 2 0.00345 0 0 0 0 0 0 0.06 0 0.03 2e-05 3e-06 0 0 0 0 0 0 0 0 0 0 0 
$$ 0 0 0 0 0 0 0 0 0 0 0 0 0 0 0 0 0 0 0 0 0 0 0 0 0 0 0 0 0 0 0 0 0 0 0 
$$ 0 0 0 0
$$ ##$DATE= 1412363899
$$ ##$DBL= (0..7)
$$ 120 120 120 120 120 120 120 120
$$ ##$DBP= (0..7)
$$ 150 150 150 150 150 150 150 150
$$ ##$DBP07= 0
$$ ##$DBPNAM0= <>
$$ ##$DBPNAM1= <>
$$ ##$DBPNAM2= <>
$$ ##$DBPNAM3= <>
$$ ##$DBPNAM4= <>
$$ ##$DBPNAM5= <>
$$ ##$DBPNAM6= <>
$$ ##$DBPNAM7= <>
$$ ##$DBPOAL= (0..7)
$$ 0.5 0.5 0.5 0.5 0.5 0.5 0.5 0.5
$$ ##$DBPOFFS= (0..7)
$$ 0 0 0 0 0 0 0 0
$$ ##$DE= 6
$$ ##$DECBNUC= <off>
$$ ##$DECIM= 8
$$ ##$DECNUC= <off>
$$ ##$DECSTAT= 4
$$ ##$DIGMOD= 1
$$ [...]
$$ -1 -1 -1 -1 -1 -1 -1 -1 -1 -1 -1 -1 -1 -1 -1 -1 -1 -1 -1 -1 -1 -1 -1 -1 
$$ -1 -1 -1 -1 -1 -1 -1 -1 -1 -1 -1 -1 -1 -1 -1 -1 -1 -1 -1 -1 -1 -1 -1 -1 
$$ -1 -1 -1 -1 -1 -1 -1 -1 -1 -1 -1 -1 -1 -1 -1 -1 -1 -1 -1 -1 -1 -1 -1 -1 
$$ -1 -1 -1 -1 -1 -1 -1 -1 -1 -1 -1 -1 -1 -1 -1 -1 -1 -1 -1 -1 -1 -1 -1 -1 
$$ -1 -1 -1 -1 -1 -1 -1 -1 -1 -1 -1 -1 -1 -1 -1 -1 -1 -1 -1 -1 -1 -1 -1 -1 
$$ -1 -1 -1 -1 -1 -1 -1 -1 -1 -1 -1 -1 -1 -1 -1 -1 -1 -1 -1 -1 -1 -1 -1 -1 
$$ -1 -1 -1 -1 -1 -1 -1 -1 -1 -1 -1 -1 -1 -1 -1 -1 -1 -1 -1 -1 -1 -1 -1 -1 
$$ -1 -1 -1 -1 -1 -1 -1 -1 -1 -1 -1 -1 -1 -1 -1 -1 -1 -1 -1 -1 -1 -1 -1 -1 
$$ -1 -1 -1 -1 -1 -1 -1 -1 -1 -1 -1 -1 -1 -1 -1 -1 
$$ ##$RG_tab7= (0..255)
$$ -1 -1 -1 -1 -1 -1 -1 -1 -1 -1 -1 -1 -1 -1 -1 -1 -1 -1 -1 -1 -1 -1 -1 -1 
$$ -1 -1 -1 -1 -1 -1 -1 -1 -1 -1 -1 -1 -1 -1 -1 -1 -1 -1 -1 -1 -1 -1 -1 -1 
$$ -1 -1 -1 -1 -1 -1 -1 -1 -1 -1 -1 -1 -1 -1 -1 -1 -1 -1 -1 -1 -1 -1 -1 -1 
$$ -1 -1 -1 -1 -1 -1 -1 -1 -1 -1 -1 -1 -1 -1 -1 -1 -1 -1 -1 -1 -1 -1 -1 -1 
$$ -1 -1 -1 -1 -1 -1 -1 -1 -1 -1 -1 -1 -1 -1 -1 -1 -1 -1 -1 -1 -1 -1 -1 -1 
$$ -1 -1 -1 -1 -1 -1 -1 -1 -1 -1 -1 -1 -1 -1 -1 -1 -1 -1 -1 -1 -1 -1 -1 -1 
$$ -1 -1 -1 -1 -1 -1 -1 -1 -1 -1 -1 -1 -1 -1 -1 -1 -1 -1 -1 -1 -1 -1 -1 -1 
$$ -1 -1 -1 -1 -1 -1 -1 -1 -1 -1 -1 -1 -1 -1 -1 -1 -1 -1 -1 -1 -1 -1 -1 -1 
$$ -1 -1 -1 -1 -1 -1 -1 -1 -1 -1 -1 -1 -1 -1 -1 -1 -1 -1 -1 -1 -1 -1 -1 -1 
$$ -1 -1 -1 -1 -1 -1 -1 -1 -1 -1 -1 -1 -1 -1 -1 -1 -1 -1 -1 -1 -1 -1 -1 -1 
$$ -1 -1 -1 -1 -1 -1 -1 -1 -1 -1 -1 -1 -1 -1 -1 -1 
$$ ##$RG_tab8= (0..255)
$$ -1 -1 -1 -1 -1 -1 -1 -1 -1 -1 -1 -1 -1 -1 -1 -1 -1 -1 -1 -1 -1 -1 -1 -1 
$$ -1 -1 -1 -1 -1 -1 -1 -1 -1 -1 -1 -1 -1 -1 -1 -1 -1 -1 -1 -1 -1 -1 -1 -1 
$$ -1 -1 -1 -1 -1 -1 -1 -1 -1 -1 -1 -1 -1 -1 -1 -1 -1 -1 -1 -1 -1 -1 -1 -1 
$$ -1 -1 -1 -1 -1 -1 -1 -1 -1 -1 -1 -1 -1 -1 -1 -1 -1 -1 -1 -1 -1 -1 -1 -1 
$$ -1 -1 -1 -1 -1 -1 -1 -1 -1 -1 -1 -1 -1 -1 -1 -1 -1 -1 -1 -1 -1 -1 -1 -1 
$$ -1 -1 -1 -1 -1 -1 -1 -1 -1 -1 -1 -1 -1 -1 -1 -1 -1 -1 -1 -1 -1 -1 -1 -1 
$$ -1 -1 -1 -1 -1 -1 -1 -1 -1 -1 -1 -1 -1 -1 -1 -1 -1 -1 -1 -1 -1 -1 -1 -1 
$$ -1 -1 -1 -1 -1 -1 -1 -1 -1 -1 -1 -1 -1 -1 -1 -1 -1 -1 -1 -1 -1 -1 -1 -1 
$$ -1 -1 -1 -1 -1 -1 -1 -1 -1 -1 -1 -1 -1 -1 -1 -1 -1 -1 -1 -1 -1 -1 -1 -1 
$$ -1 -1 -1 -1 -1 -1 -1 -1 -1 -1 -1 -1 -1 -1 -1 -1 -1 -1 -1 -1 -1 -1 -1 -1 
$$ -1 -1 -1 -1 -1 -1 -1 -1 -1 -1 -1 -1 -1 -1 -1 -1 
$$ ##$ROUTER= 2
$$ ##$RX22TY= <tty10>
$$ ##$SCMTY= <no>
$$ ##$SPECTR= 7
$$ ##$SY2FLAG= 0
$$ ##$TFXNUM= 0
$$ ##$TRIPLO2= 0
$$ ##$VTUTY= <no>
$$ ##$WBREFAM= (0..15)
$$ 100 100 100 100 100 100 100 100 100 100 100 100 100 100 100 100 
$$ ##$WBREFPH= (0..15)
$$ 0 0 0 0 0 0 0 0 0 0 0 0 0 0 0 0 
$$ ##$XFAC= 2
$$ ##END=
$$ 
##$DECIM=	8
##$DSPFVS=	12
##XUNITS=	HZ
##YUNITS=	ARBITRARY UNITS
##FIRSTX=	13819.172095934689423
##LASTX=	-1240.8390668806121084
##DELTAX=	-0.22980104009789120711
##XFACTOR=	1
##YFACTOR=	0.20096740992748038379
##FIRSTY=	-27.63513946533203125
##MINY=	-129.1409912109375
##MAXY=	6585.09912109375
##NPOINTS=	65536
##XYDATA=	(X++(Y..Y))
$$ [...]
12174 -199 -240 -269 -286 -278 -270 -271 -264 -222 -141 -57 -6 8 -9 -44 -56 -29 2 1 -17 -13 13 46 60 32 -25 -89 -141 -153 -103 -19 21 -13 -92 -138 -113 -35 39
12166 39 44 15 28 90 116 92 52 25 7 -10 -35 -66 -59 0 25 4 -19 -51 -90 -130 -146 -130 -121 -132 -128 -96 -67 -88 -138 -166 -175 -155 -132 -154 -198 -237 -283
12157 -283 -319 -319 -252 -139 -38 14 28 7 -24 -47 -40 -41 -70 -106 -140 -150 -124 -83 -62 -51 -59 -139 -210 -234 -252 -270 -261 -209 -152 -110 -76 -38 2 15 -32 -114
12149 -114 -167 -160 -102 -21 24 37 30 8 -2 -4 -16 -48 -69 -64 -67 -71 -43 13 46 38 24 4 -29 -82 -149 -201 -198 -154 -115 -90 -81 -102 -141 -139 -94 -59 -33 -22 -29 -19
12140 -19 9 61 102 87 51 54 100 143 163 145 105 99 119 114 93 105 146 167 138 38 -83 -153 -161 -118 -51 -11 -16 -51 -91 -121 -150 -169 -170 -133 -73 -53 -75
12131 -75 -78 -72 -101 -137 -157 -187 -239 -301 -342 -349 -338 -320 -302 -283 -255 -219 -211 -202 -176 -171 -160 -134 -130 -137 -123 -73 -5 61 95 107 129 163 198 195 135 62 2 -44 -82
12122 -82 -109 -121 -116 -86 -62 -64 -75 -78 -60 -35 -51 -90 -127 -152 -171 -187 -172 -97 -6 50 91 136 146 138 129 101 79 74 83 78 45 10 0 -22 -82 -126 -145 -169 -152
12113 -152 -75 -17 -6 -18 -5 38 73 80 60 20 -36 -84 -108 -137 -170 -195 -222 -217 -169 -124 -113 -146 -203 -246 -244 -227 -221 -209 -183 -146 -86 -49 -85 -146 -180 -185 -163
12105 -163 -121 -87 -71 -74 -98 -132 -140 -100 -56 -57 -97 -160 -220 -263 -276 -269 -268 -286 -313 -299 -217 -121 -70 -78 -103 -101 -61 -24 -29 -73 -117 -114 -73 -51 -66 -89 -97 -91 -61 -8
12095 -8 35 35 -8 -39 -5 67 100 86 64 52 53 78 106 103 65 18 -14 -32 -58 -89 -87 -40 30 125 207 221 194 180 168 138 120 158 198 153 28 -93
12087 -93 -151 -169 -185 -215 -240 -249 -282 -306 -280 -174 -30 46 69 88 83 42 -13 -64 -106 -125 -135 -127 -107 -96 -87 -85 -85 -73 -69 -61 -48 -41 -27 -9 -7 -15 -8 27 59 51
12078 51 38 47 82 109 84 19 -50 -86 -67 -7 34 -11 -101 -143 -136 -115 -117 -152 -173 -155 -83 -1 22 26 54 66 27 -24 -60 -79 -88 -92 -85 -79 -70 -33 16 58 89
12069 89 71 19 -20 -56 -85 -77 -65 -104 -162 -185 -177 -155 -125 -94 -57 -16 15 18 -27 -66 -66 -60 -60 -80 -116 -143 -127 -81 -53 -15 20 9 -13 -19 -15 28 81 124 144
12060 144 152 157 145 129 114 124 143 152 157 130 55 -14 -21 -6 -10 -46 -64 -23 38 80 109 99 39 -25 -35 -3 35 49 29 9 12 7 -28 -70 -84 -87 -105 -123 -106
12051 -106 -47 17 64 82 60 15 -32 -58 -55 -61 -76 -61 -12 29 20 -7 -4 31 74 80 68 74 81 61 47 56 60 20 -74 -175 -240 -245 -210 -182 -182 -214 -251 -259 -227 -192
12042 -192 -183 -204 -221 -173 -64 45 85 68 41 -24 -118 -190 -203 -156 -121 -122 -141 -154 -164 -156 -124 -105 -121 -144 -145 -136 -100 -50 -15 21 65 122 183 211 213 199
12034 199 140 66 38 48 63 66 53 53 70 44 -20 -79 -119 -142 -176 -201 -177 -142 -131 -112 -68 0 58 55 40 31 7 -31 -76 -90 -75 -39 42 108 97 35
12025 35 -48 -94 -86 -47 4 65 127 163 172 186 206 224 245 246 240 245 245 230 161 56 -4 -5 3 -30 -106 -191 -244 -261 -250 -219 -159 -82 -22 39 94 94 30 -60 -105
12016 -105 -93 -73 -81 -131 -195 -229 -256 -304 -333 -315 -263 -198 -159 -147 -104 -47 -34 -70 -102 -143 -187 -213 -225 -213 -191 -190 -217 -232 -216 -178 -125 -98 -105 -100 -79 -64
12008 -64 -74 -104 -127 -115 -103 -105 -97 -88 -87 -103 -115 -91 -44 -1 29 41 53 78 94 84 84 116 150 169 139 67 -5 -46 -60 -61 -77 -115 -140 -154 -184 -187 -133 -77
11999 -77 -30 5 15 15 21 33 14 -43 -119 -185 -224 -246 -254 -238 -195 -140 -104 -126 -154 -162 -178 -195 -174 -146 -125 -80 -45 -17 7 -10 -64 -134 -165 -117 -63 -62 -82
11991 -82 -131 -177 -170 -140 -122 -113 -98 -82 -62 -43 -44 -85 -126 -138 -119 -68 -14 7 -6 -21 -49 -97 -133 -124 -87 -78 -92 -126 -181 -231 -233 -194 -156 -128 -104 -73 -37 -23
11982 -23 -19 -12 -1 20 42 65 71 45 12 -3 -14 -51 -99 -119 -116 -129 -147 -138 -100 -54 -11 12 -1 -56 -113 -119 -100 -92 -82 -65 -27 12 36 26 -11 -16 29 86 111
11973 111 110 116 126 119 68 -39 -129 -176 -198 -195 -184 -202 -266 -327 -347 -306 -252 -208 -166 -145 -148 -181 -227 -230 -162 -91 -53 -21 37 99 86 14 -61 -119 -164 -183 -164
11965 -164 -166 -214 -258 -273 -264 -262 -272 -267 -255 -224 -166 -134 -160 -199 -222 -241 -278 -327 -341 -313 -268 -218 -181 -125 -25 53 56 8 -34 -21 17 47 68 86 86 40 -5
11956 -5 -4 7 -31 -104 -181 -232 -238 -195 -114 -32 2 14 40 53 47 42 49 68 82 70 28 -10 5 80 173 227 218 203 224 240 218 181 150 106 55 31 44 97
11947 97 167 192 163 175 239 266 231 199 156 69 26 55 80 59 39 40 27 0 -29 -73 -102 -116 -163 -227 -262 -269 -235 -159 -71 -53 -104 -157 -188 -187 -177 -197
11939 -197 -223 -196 -135 -81 -30 12 36 23 4 -15 -47 -67 -66 -53 -37 -26 -25 -26 -36 -32 -9 1 6 14 -2 -9 18 40 44 48 55 52 15 -36 -37 -20 -26 -37 -47 -62 -61
11930 -61 -16 48 108 176 234 238 217 182 145 136 117 67 44 61 111 169 182 125 53 -17 -70 -91 -103 -100 -92 -113 -157 -186 -209 -237 -261 -295 -312 -273 -207 -160 -146
11921 -146 -134 -125 -139 -144 -102 -41 -8 -17 -46 -65 -36 25 64 63 11 -76 -143 -146 -98 -31 39 81 70 16 -46 -107 -165 -171 -132 -95 -88 -95 -81 -70 -102 -145 -175 -183 -146
11912 -146 -47 74 151 176 171 148 106 51 6 -3 37 93 118 95 47 -7 -76 -125 -131 -121 -110 -107 -115 -143 -194 -228 -231 -213 -189 -156 -129 -115 -95 -88 -101 -150 -190
11904 -190 -175 -115 -48 -30 -39 -21 19 55 78 121 200 250 221 150 64 -22 -64 -66 -92 -158 -219 -229 -211 -230 -265 -275 -275 -265 -229 -168 -106 -53 -20 -30 -84 -150
11896 -150 -177 -167 -165 -192 -247 -322 -368 -353 -298 -212 -125 -52 10 39 38 28 16 -5 -8 -6 -19 -19 1 47 96 109 72 34 24 2 -34 -75 -96 -71 -22 -5 -55
11887 -55 -162 -244 -257 -238 -230 -268 -340 -395 -409 -367 -302 -241 -180 -132 -110 -102 -77 -19 58 114 120 70 -13 -77 -99 -108 -110 -112 -138 -172 -185 -150 -85 -41 -1 54 121
11879 121 172 145 51 -2 23 73 112 145 162 150 146 180 221 194 122 70 37 17 14 29 63 82 55 -6 -63 -76 -45 -24 -31 -16 22 45 37 20 23 29 37 13
11870 13 -72 -177 -239 -264 -264 -273 -316 -350 -316 -227 -148 -95 -40 27 72 81 47 14 5 20 61 75 48 13 9 23 38 71 108 134 114 45 -19 -26 14 52 63
11861 63 70 77 79 60 18 -9 6 64 105 91 62 55 53 39 7 -12 -37 -84 -92 -43 43 116 149 159 157 166 181 173 155 140 106 35 -34 -77 -86 -71 -50 -26 -4 -6
11852 -6 -20 -52 -61 -4 85 170 200 168 120 103 123 136 109 56 -11 -63 -59 -26 -25 -61 -82 -66 -43 -39 -37 -29 -15 5 5 -7 2 5 -25 -58 -49 23 96 107 57 8
11843 8 -19 -53 -87 -101 -101 -78 -48 -45 -60 -71 -76 -70 -61 -40 0 44 89 115 99 76 87 108 100 76 31 -20 -35 -6 17 -12 -43 -43 -27 -26 -21 -10 -41 -96 -96 -68
11834 -68 -85 -141 -182 -178 -165 -167 -174 -185 -196 -208 -224 -262 -309 -306 -268 -232 -188 -131 -79 -20 45 104 130 110 92 83 34 -19 -65 -146 -212 -232 -211 -198 -229 -285 -331
11825 -331 -352 -347 -320 -305 -278 -230 -194 -172 -153 -133 -100 -95 -100 -66 2 51 40 5 -25 -57 -80 -101 -148 -204 -227 -248 -313 -370 -374 -332 -299 -285 -270 -257 -228 -203
11817 -203 -189 -175 -158 -151 -152 -136 -117 -108 -72 -21 -1 -24 -98 -166 -175 -144 -123 -155 -209 -206 -175 -197 -253 -291 -280 -211 -153 -138 -119 -119 -142 -150 -135 -104 -42 27 65 99
11808 99 133 150 122 40 -88 -208 -247 -181 -108 -114 -142 -142 -140 -138 -126 -124 -135 -146 -154 -151 -154 -196 -250 -244 -186 -145 -127 -119 -135 -156 -174 -190 -198 -181 -139 -120 -148 -200 -236
11799 -236 -247 -267 -260 -185 -103 -68 -59 -38 -24 -13 -1 1 4 20 51 62 26 -14 -35 -31 -8 -4 -36 -72 -105 -169 -219 -194 -160 -136 -93 -85 -115 -121 -99 -93 -99 -106 -122 -117
11790 -117 -66 -10 36 71 98 98 72 41 -2 -47 -79 -119 -179 -228 -222 -143 -50 11 33 1 -69 -129 -166 -182 -182 -186 -199 -216 -222 -199 -153 -97 -26 66 159 205 194
11782 194 126 30 -29 -38 -18 -19 -53 -80 -59 -16 31 58 41 1 20 95 136 123 84 31 -44 -111 -125 -92 -51 -33 -16 29 30 -30 -57 -32 -2 19 15 -17
11773 -17 -32 6 109 224 299 321 286 241 212 173 133 115 103 89 91 89 58 7 -59 -126 -190 -236 -279 -333 -353 -326 -281 -228 -158 -77 -4 47 59 28 -30
11765 -30 -84 -124 -149 -159 -140 -99 -98 -115 -110 -99 -84 -95 -146 -179 -154 -128 -139 -160 -193 -214 -202 -189 -206 -266 -331 -349 -330 -308 -291 -254 -209 -192 -185 -158 -150 -177 -209
11757 -209 -228 -216 -185 -180 -211 -231 -205 -155 -99 -42 -2 9 -2 -22 -34 -51 -54 -51 -46 -52 -87 -104 -59 2 16 -6 -7 4 -35 -71 -48 17 79 79 12 -74 -123 -111
11748 -111 -101 -132 -146 -116 -54 21 68 71 73 78 81 58 -10 -100 -169 -202 -201 -141 -46 29 56 43 24 -5 -20 -5 16 49 87 103 89 54 8 19 65 81 76
11739 76 60 24 -26 -80 -127 -164 -197 -211 -189 -129 -43 17 19 -20 -75 -93 -84 -58 -9 3 -25 -67 -117 -149 -137 -115 -126 -166 -194 -216 -236 -202 -132 -76 -20 26
11731 26 19 -18 -47 -72 -85 -102 -158 -235 -283 -269 -235 -227 -234 -202 -130 -86 -86 -124 -196 -281 -333 -304 -220 -146 -112 -107 -103 -73 -27 30 77 76 10 -79 -121 -97 -52 -21
11722 -21 -26 -62 -102 -139 -163 -159 -110 -56 -51 -70 -69 -64 -88 -134 -160 -135 -86 -60 -66 -71 -78 -105 -145 -194 -225 -237 -272 -277 -231 -193 -155 -87 -2 40 8 -50 -71 -82 -85 -54
11713 -54 6 90 187 244 236 167 99 45 -6 -28 -40 -89 -164 -210 -194 -126 -65 -46 -75 -119 -157 -209 -271 -325 -350 -317 -216 -124 -87 -81 -112 -168 -195 -166 -98
11705 -98 -21 36 52 25 -4 -4 -8 -33 -72 -61 19 90 105 84 34 -40 -119 -171 -193 -202 -185 -119 -36 -7 -61 -138 -192 -219 -213 -194 -160 -116 -105 -116 -111 -79 -38
11697 -38 -17 -4 30 18 -72 -182 -250 -268 -241 -167 -80 -39 -44 -45 -14 38 52 38 21 -18 -54 -51 -27 -1 45 103 150 170 129 74 48 32 4 -29 -54 -90
11688 -90 -156 -230 -281 -307 -307 -268 -206 -147 -78 -11 -3 -43 -72 -71 -68 -60 -28 9 15 -8 -46 -112 -162 -173 -135 -65 -10 26 24 -13 -49 -92 -137 -176 -210 -212 -192 -188 -197 -186
11679 -186 -158 -142 -163 -213 -263 -305 -316 -277 -194 -107 -52 -36 -30 -21 -5 16 41 51 10 -85 -181 -235 -250 -229 -180 -121 -82 -63 -45 -33 -43 -100 -182 -239 -257
11671 -257 -275 -303 -325 -332 -338 -336 -290 -216 -141 -88 -67 -96 -166 -236 -236 -167 -104 -54 -1 30 43 52 37 -13 -77 -127 -133 -119 -127 -158 -179 -174 -158 -148 -130 -106 -75 -51
11662 -51 -38 -47 -67 -67 -75 -84 -21 92 137 100 78 70 17 -64 -134 -193 -210 -204 -203 -166 -96 -36 3 50 75 87 87 67 47 44 49 37 -1 -36 -42 -26 -5 -22 -58 -61
11653 -61 -48 -54 -84 -109 -98 -45 -10 -11 -15 -20 -31 -54 -64 -57 -61 -74 -99 -141 -157 -142 -150 -194 -214 -160 -73 -25 -31 -71 -114 -126 -131 -145 -162 -192 -213 -177 -93 4 74
11644 74 73 8 -46 -65 -72 -59 -43 -60 -101 -110 -78 -17 46 104 133 105 39 -38 -85 -107 -132 -164 -219 -276 -295 -275 -225 -170 -113 -59 -34 -36 -45 -61 -47 -20 -13 -4
11636 -4 32 66 102 140 140 82 -4 -80 -147 -174 -159 -121 -82 -42 7 73 146 168 142 101 54 11 -30 -74 -107 -121 -157 -234 -302 -298 -236 -169 -129 -99 -53 4
11627 4 65 81 38 -11 -48 -76 -114 -148 -153 -128 -112 -96 -58 -37 -41 -42 -38 -21 9 -11 -118 -247 -323 -349 -340 -310 -274 -210 -113 -43 -44 -64 -74 -102 -133 -127 -127 -178
11619 -178 -246 -287 -309 -296 -248 -176 -98 -42 -1 17 3 -18 -31 -38 -41 -46 -65 -68 -62 -84 -121 -148 -158 -174 -202 -225 -241 -265 -282 -234 -123 -27 7 20 31 43
11610 43 48 43 31 11 -22 -35 -31 -31 -34 -19 28 110 203 266 265 196 116 60 38 40 60 78 82 98 117 125 124 137 166 160 112 49 -22 -68 -73 -67 -80 -124 -182 -213 -215 -186
11601 -186 -136 -75 -4 36 25 -12 -44 -41 -1 23 -14 -49 -31 21 89 156 189 182 158 123 95 90 106 142 167 154 109 32 -56 -122 -134 -119 -88 -40 11 35
11592 35 11 -21 -19 32 101 176 231 224 188 190 227 244 210 117 23 -18 -12 35 94 134 129 63 -10 -43 -7 73 141 179 179 140 76 21 -15 -10 14 -4 -70 -165
11584 -165 -248 -323 -380 -367 -290 -207 -137 -61 -5 8 27 70 96 100 98 97 106 98 81 75 56 23 -10 -20 7 33 -8 -93 -137 -134 -142 -169 -180 -205 -243 -265 -286 -327
11575 -327 -336 -291 -227 -178 -141 -126 -139 -135 -70 30 123 158 130 128 141 112 40 -23 -31 13 68 92 76 46 10 -38 -55 -43 -46 -50 -15 43 97 154 210 217 183
11566 183 161 163 177 177 134 74 24 -23 -70 -123 -165 -187 -219 -241 -236 -225 -219 -203 -156 -96 -55 -38 -59 -118 -172 -203 -213 -194 -170 -133 -80 -22 61 132 140 113 101
11558 101 89 63 1 -70 -118 -155 -189 -187 -145 -102 -60 -14 19 17 -20 -62 -89 -104 -97 -45 26 46 36 7 -49 -85 -65 8 68 59 12 -8 19 52 59 56 51 29
11549 29 14 24 41 75 128 157 125 59 -15 -83 -130 -161 -198 -210 -192 -200 -186 -103 -15 20 52 89 98 82 37 -9 -28 -37 -45 -52 -43 1 34 39 36 29 -12 -74 -96
11540 -96 -79 -65 -46 -42 -82 -138 -177 -194 -193 -188 -197 -229 -248 -237 -218 -195 -169 -166 -203 -235 -226 -180 -137 -101 -49 24 106 171 199 189 175 176 147 69 5 0 29 71 98
11531 98 105 86 44 1 -59 -138 -179 -144 -63 1 9 -3 -6 -9 -19 -28 -29 -18 17 61 77 47 27 37 50 44 5 -43 -48 -12 51 129 178 200 200 183 164 150 126
11522 126 66 -15 -65 -68 -60 -88 -148 -200 -207 -173 -138 -106 -58 -5 38 41 18 31 87 147 200 233 222 173 112 48 13 35 84 109 101 44 -32 -83 -85 -58 -53 -49
11514 -49 -47 -41 -18 0 4 11 26 18 -6 -19 -31 -57 -60 -3 72 123 131 88 25 -39 -75 -75 -97 -140 -194 -271 -350 -387 -365 -307 -276 -295 -319 -328 -320 -307 -298 -284 -271 -269 -274
11504 -274 -281 -292 -295 -254 -159 -74 -43 -65 -99 -111 -111 -90 -65 -51 -13 70 159 214 215 183 162 154 115 63 14 -12 -14 -21 -28 -24 -6 21 35 41 77 151 187 151 97
11495 97 44 2 -33 -71 -99 -79 -31 -12 -20 -46 -75 -101 -111 -98 -96 -130 -174 -200 -211 -196 -154 -120 -117 -129 -124 -117 -153 -210 -244 -255 -266 -255 -239 -231 -218 -188 -150 -84
11486 -84 -16 18 28 22 2 -24 -69 -123 -137 -132 -131 -141 -146 -152 -179 -214 -226 -211 -191 -189 -200 -195 -131 -41 -13 -63 -110 -131 -168 -238 -307 -350 -346 -304 -238 -139 6 131
11478 131 179 180 155 130 105 68 20 -29 -19 53 105 141 166 192 197 162 146 172 192 178 148 139 173 230 289 321 301 244 192 170 164 141 120 100 7 -123
11469 -123 -206 -232 -240 -250 -267 -283 -309 -300 -214 -115 -77 -80 -67 -49 -30 -23 -56 -142 -249 -308 -306 -261 -203 -159 -145 -134 -88 -21 9 -8 -65 -117 -131 -130 -110 -88 -99
11461 -99 -122 -149 -184 -199 -190 -183 -203 -209 -169 -112 -70 -49 -42 -67 -109 -133 -94 -10 20 -18 -56 -77 -95 -96 -104 -116 -105 -76 -21 28 47 67 70 43 7 -14 -20 -8 6
11452 6 13 15 -16 -63 -61 -27 -5 4 -2 -30 -65 -64 -17 40 85 108 106 101 90 45 -36 -121 -180 -199 -173 -133 -125 -146 -154 -148 -175 -230 -267 -268 -247 -202 -156 -113 -99 -125 -127 -111
11442 -111 -126 -149 -116 -66 -49 -67 -95 -113 -133 -167 -200 -232 -253 -244 -193 -132 -111 -130 -169 -205 -237 -255 -240 -210 -210 -277 -356 -383 -374 -332 -262 -194 -127 -68 -32 -7
11434 -7 -15 -58 -94 -114 -122 -133 -131 -120 -128 -142 -130 -120 -137 -124 -80 -35 3 9 -18 -26 -13 -4 3 -11 -38 -56 -78 -129 -160 -166 -144 -82 -45 -45 -35 -5 21 11 -38 -60
11425 -60 -55 -80 -125 -165 -204 -249 -267 -250 -209 -169 -135 -127 -118 -76 -12 51 86 64 32 12 20 55 57 36 11 -27 -49 -27 10 -9 -66 -110 -143 -166 -206 -264 -294
11416 -294 -273 -232 -224 -228 -231 -251 -263 -265 -269 -265 -217 -145 -89 -56 -64 -113 -176 -198 -179 -163 -167 -165 -135 -115 -142 -196 -222 -215 -195 -178 -167 -153 -147 -165 -200 -224 -223 -210 -191 -172
11407 -172 -130 -74 -70 -111 -146 -144 -113 -87 -78 -68 -49 -39 -34 -11 30 85 154 200 207 187 168 153 137 127 125 157 229 297 326 309 262 206 147 104 75 80 99 74
11398 74 19 -2 17 32 10 -24 -27 8 76 137 156 114 11 -101 -183 -222 -225 -233 -233 -200 -158 -127 -122 -128 -108 -74 -64 -63 -43 -2 31 -4 -109 -233 -302 -284
11390 -284 -227 -143 -23 81 150 181 176 170 148 112 102 96 69 35 0 -6 40 101 149 206 261 259 202 160 171 194 203 192 155 97 4 -115 -216 -288 -339
11382 -339 -383 -377 -300 -181 -75 -9 25 53 81 64 12 -19 -17 -2 2 -6 -38 -80 -87 -34 37 68 74 100 128 106 36 -71 -180 -244 -274 -298 -335 -368 -325
11374 -325 -226 -155 -139 -128 -84 -27 5 25 44 60 93 145 165 152 154 166 143 85 40 44 82 118 129 109 86 56 10 -40 -55 -25 29 61 42 17 18 20
11366 20 13 -6 -45 -89 -105 -79 -37 -13 2 30 56 74 85 77 65 91 136 134 77 -29 -114 -126 -103 -55 3 63 97 89 75 92 131 150 122 73 29 -24
11358 -24 -109 -197 -243 -234 -188 -157 -171 -199 -196 -162 -125 -129 -150 -116 -49 -24 -35 -54 -55 -44 -10 21 -6 -73 -96 -63 -32 -29 -31 -19 -16 -39 -78 -116 -111 -58 -9 8 20
11349 20 31 10 -23 -20 37 92 105 88 74 44 -1 -17 15 74 122 124 81 48 77 116 114 84 34 -2 -44 -120 -196 -226 -220 -200 -162 -107 -69 -83 -124 -129 -78
11340 -78 -35 -72 -138 -160 -139 -107 -80 -37 18 43 41 66 118 150 143 131 140 155 154 133 99 87 93 78 20 -51 -97 -87 -12 79 102 68 26 -23 -80 -147 -211
11332 -211 -222 -160 -78 9 78 84 56 49 54 18 -27 -40 -42 -27 -23 -56 -100 -119 -108 -90 -51 5 31 63 113 138 133 116 102 84 54 23 5 -22 -77 -109 -106 -85
11323 -85 -43 13 45 52 35 6 15 49 76 58 1 -32 -57 -98 -113 -107 -88 -70 -56 22 132 192 184 149 145 177 170 100 13 -31 -21 9 22 -8 -55 -103 -135
11314 -135 -146 -179 -185 -92 38 85 29 -62 -104 -71 -7 25 4 -28 -7 88 195 216 146 68 34 32 18 13 56 68 -17 -129 -223 -306 -370 -385 -327 -220
11307 -220 -133 -92 -73 -68 -96 -132 -122 -70 -46 -86 -160 -246 -331 -417 -474 -474 -397 -262 -147 -95 -88 -98 -145 -216 -259 -272 -283 -295 -294 -276 -241 -209 -200 -198 -184 -163
11298 -163 -150 -166 -186 -196 -185 -153 -113 -61 -17 -6 -10 11 18 -11 -31 0 45 84 123 149 169 200 219 211 185 179 190 168 119 73 26 1 -2 -22 -44 -30 0
11290 0 45 100 122 89 28 -30 -78 -90 -75 -81 -108 -104 -69 -46 -33 -17 -32 -70 -100 -119 -136 -141 -115 -73 -31 10 27 0 -27 -28 -2 25 38 44 48 43 25 5 7
11281 7 49 119 140 79 4 3 63 133 165 141 78 -1 -72 -118 -155 -189 -176 -136 -97 -78 -119 -173 -189 -152 -87 -43 -42 -73 -116 -163 -196 -215 -240 -258 -219 -168
11273 -168 -150 -139 -125 -109 -97 -104 -95 -48 5 26 37 70 110 145 160 120 54 19 -20 -104 -194 -249 -262 -248 -228 -221 -251 -277 -256 -201 -145 -97 -56 -35 -11 38
11264 38 126 233 308 321 288 221 139 72 34 -14 -86 -131 -115 -65 -49 -89 -130 -174 -227 -265 -300 -331 -348 -332 -289 -263 -271 -281 -277 -284 -283 -244 -198 -201 -216 -185 -122
11256 -122 -66 -20 29 58 64 64 61 68 68 49 -14 -115 -199 -237 -220 -158 -94 -53 -24 -20 -14 -3 -12 -28 -41 -69 -130 -179 -186 -163 -134 -122 -125 -159 -207 -229 -200 -128 -63
11247 -63 -35 -28 -45 -75 -94 -92 -60 -20 14 33 30 47 75 64 25 0 18 74 118 124 99 40 -52 -151 -188 -158 -105 -76 -90 -114 -119 -96 -68 -45 -23 -12 3
11238 3 26 20 -34 -86 -105 -80 -4 65 80 66 71 75 40 -6 -40 -69 -78 -83 -89 -53 1 23 46 79 129 166 145 91 59 41 26 18 19 24 62 110 90 21 -31 -30
11229 -30 14 37 16 -23 -83 -138 -169 -200 -236 -270 -306 -317 -260 -163 -96 -60 -29 7 34 39 24 8 -2 -31 -83 -123 -161 -212 -220 -208 -223 -260 -297 -319 -319 -319 -321
11221 -321 -302 -256 -185 -88 7 51 68 78 78 56 32 36 44 32 10 -13 -19 -15 -1 30 56 46 2 -66 -134 -154 -126 -87 -69 -70 -83 -94 -84 -62 -37 -2 32
11212 32 51 36 -21 -84 -117 -128 -119 -79 -33 4 33 35 32 19 -25 -65 -51 46 156 173 140 135 129 101 75 67 51 23 -9 -32 -18 27 81 122 160 217 272
11204 272 292 275 219 151 108 88 50 27 36 17 -24 -74 -96 -74 -51 -40 -31 -34 -52 -69 -93 -120 -116 -81 -47 -50 -77 -127 -194 -245 -274 -279 -269 -257 -217 -151 -107
11195 -107 -81 -63 -75 -86 -84 -82 -77 -65 -60 -57 -43 -49 -49 -35 -63 -147 -224 -241 -212 -160 -115 -82 -31 1 -13 -21 21 97 163 187 177 142 105 96 112 120 85 -16 -116
11186 -116 -168 -197 -190 -145 -102 -65 -31 0 6 -11 -44 -53 -17 0 -31 -61 -72 -70 -60 -37 -20 -42 -83 -91 -79 -69 -55 -40 -26 -16 -6 1 14 23 28 27 1 -48 -78
11177 -78 -74 -57 -33 -19 -33 -50 -63 -77 -82 -78 -72 -64 -50 -21 23 79 92 40 -15 -38 -44 -43 -6 52 76 69 73 110 140 147 132 111 117 122 98 37 -47 -136 -208 -258 -291
11168 -291 -298 -280 -239 -188 -126 -63 -8 44 114 165 183 192 197 174 98 30 -4 -52 -118 -197 -264 -303 -311 -287 -249 -225 -203 -148 -80 -28 33 110 147 125 98 86
11159 86 94 120 113 62 5 -49 -109 -190 -259 -276 -229 -145 -69 -7 34 41 24 22 46 56 17 -45 -93 -155 -208 -233 -251 -262 -266 -263 -255 -234 -208 -195 -201 -208 -221 -251 -267
11150 -267 -260 -264 -283 -275 -218 -159 -103 -29 13 -30 -124 -226 -287 -270 -194 -125 -110 -130 -165 -179 -153 -106 -77 -77 -88 -89 -77 -62 -56 -46 -41 -51 -57 -52 -61 -115 -163 -131 -60
11142 -60 -21 -14 -24 -34 -48 -93 -147 -184 -174 -110 -76 -102 -112 -115 -156 -184 -161 -118 -64 -12 50 85 61 15 -25 -50 -63 -61 -61 -58 -56 -78 -119 -184 -262 -329 -343 -294
11133 -294 -210 -123 -78 -97 -141 -140 -115 -110 -108 -88 -79 -82 -89 -79 -30 29 65 112 199 290 343 370 347 268 154 69 37 8 -31 -29 14 54 54 34 27 22 6 9 46
11124 46 85 87 45 -3 -28 -16 9 -8 -54 -91 -99 -69 -16 30 36 19 30 64 72 26 -43 -58 -27 15 50 68 73 69 35 -27 -96 -140 -148 -100 -18 19 12 23 56
11115 56 91 105 97 102 139 188 197 173 155 142 122 100 91 86 67 20 -49 -117 -183 -263 -355 -378 -336 -310 -294 -271 -241 -197 -155 -153 -204 -253 -246 -208 -194 -167 -101 -68
11106 -68 -88 -124 -135 -125 -119 -123 -111 -81 -89 -121 -176 -245 -277 -277 -246 -186 -140 -96 -22 53 103 111 87 46 0 -19 -18 10 72 100 66 16 13 53 51 -2 -48 -65 -40
11097 -40 -1 9 -25 -88 -160 -210 -212 -191 -184 -211 -240 -212 -141 -53 32 77 91 105 153 179 164 140 110 60 17 8 17 45 78 89 109 136 131 96 73 101 165
11089 165 221 243 204 108 -5 -88 -129 -131 -110 -86 -65 -31 2 -4 -18 -33 -63 -82 -106 -150 -187 -183 -112 -26 3 -10 -48 -87 -109 -131 -166 -187 -164 -123 -91
11081 -91 -67 -43 2 34 11 -53 -135 -204 -210 -147 -47 38 65 50 35 16 -47 -119 -174 -202 -209 -218 -228 -210 -155 -107 -113 -145 -130 -68 -18 4 9 9 -8 -33 -46
11072 -46 -47 -50 -63 -50 -18 0 13 44 89 126 120 55 -40 -120 -170 -179 -165 -159 -165 -155 -144 -131 -66 -3 40 86 103 77 51 44 40 46 73 88 44 -11 -37 -55 -43
11063 -43 -3 23 1 -42 -58 -29 24 47 13 -65 -167 -265 -327 -344 -340 -342 -364 -358 -246 -65 48 44 -17 -74 -84 -67 -55 -68 -81 -87 -98 -108 -122 -103 -24
11055 -24 59 98 110 98 61 20 -5 -7 -27 -79 -104 -82 -50 -36 -37 -8 58 144 218 236 220 216 226 214 144 47 5 4 0 -9 1 21 38 52 84 117 130 135
11046 135 123 88 37 -32 -103 -163 -192 -158 -108 -108 -143 -176 -175 -132 -68 -24 -44 -82 -115 -136 -110 -69 -44 -19 18 55 65 55 20 -43 -97 -125 -168 -286 -468
11038 -468 -614 -643 -590 -547 -508 -452 -430 -443 -439 -391 -330 -325 -363 -368 -359 -362 -337 -264 -224 -231 -212 -160 -76 30 116 158 155 103 29 -40 -95 -159 -215 -214 -165 -151 -170
11030 -170 -167 -129 -86 -70 -77 -86 -87 -75 -78 -117 -169 -208 -233 -263 -285 -270 -250 -237 -192 -146 -147 -166 -192 -231 -262 -254 -197 -133 -112 -155 -236 -308 -331 -311 -303 -332 -384 -399
11021 -399 -350 -279 -242 -241 -223 -168 -116 -95 -89 -71 -16 24 1 -28 -56 -111 -176 -249 -314 -358 -360 -338 -326 -304 -263 -222 -156 -61 -1 1 -34 -61 -52 -40 -60 -101 -119
11013 -119 -90 -43 -13 -9 -16 -38 -72 -83 -88 -114 -126 -110 -105 -113 -110 -102 -72 -13 36 73 114 117 81 43 15 -24 -70 -116 -149 -135 -104 -109 -123 -124 -151 -194 -212 -190 -131
11004 -131 -89 -105 -111 -39 38 50 35 16 -28 -71 -49 7 53 83 68 -5 -59 -54 -41 -54 -96 -138 -140 -122 -102 -74 -41 -10 13 8 -7 -4 26 65 65 29 -1
10995 -1 -9 -8 -22 -50 -86 -91 -65 -29 -17 -42 -61 -80 -136 -201 -206 -160 -95 -36 -16 8 76 150 177 159 125 113 103 43 -49 -121 -162 -182 -169 -144 -115 -74 -16
10987 -16 26 47 56 67 84 49 -47 -124 -141 -136 -147 -174 -195 -209 -230 -211 -132 -57 -23 -28 -21 14 28 18 18 41 102 162 187 155 93 54 38 33 11 -6 20 71
10978 71 123 177 211 191 139 80 12 -68 -145 -204 -233 -226 -231 -245 -237 -200 -148 -84 -33 -11 6 22 25 25 27 29 63 103 97 62 16 -19 -10 13 4 -28 -68 -97 -100 -93 -65
10968 -65 12 118 213 276 292 270 239 180 81 -7 -55 -70 -77 -78 -103 -157 -204 -219 -200 -162 -112 -65 -59 -73 -80 -80 -61 -43 -42 -52 -59 -55 -61 -81 -106 -119 -109 -109 -112 -96
10959 -96 -76 -53 -37 -37 -63 -116 -174 -211 -212 -175 -144 -131 -96 -24 69 155 189 153 84 19 -24 -70 -75 -12 57 58 21 21 47 50 35 32 52 71 67 76 107 130 157
10950 157 181 151 73 -5 -29 -13 1 24 57 82 106 120 103 70 40 10 -20 -17 24 94 188 267 314 336 306 219 129 90 64 -2 -79 -138 -151 -136 -142
10942 -142 -162 -180 -211 -260 -297 -268 -168 -67 -5 1 -55 -136 -171 -160 -154 -159 -168 -157 -126 -106 -105 -118 -115 -78 -37 -46 -134 -220 -255 -262 -233 -155 -45 52 108 131 141
10934 141 156 139 88 45 25 38 75 98 65 -28 -130 -177 -164 -129 -74 -38 -42 -54 -68 -52 -3 58 100 84 21 -25 -22 2 28 63 89 101 94 42 -59
10926 -59 -167 -232 -242 -218 -183 -131 -68 -14 34 83 101 91 89 100 95 82 82 94 69 -6 -79 -102 -67 -16 4 1 16 37 27 -31 -86 -129 -164 -163 -120 -76 -80
10917 -80 -118 -147 -157 -184 -251 -344 -424 -435 -369 -284 -203 -135 -99 -94 -79 -43 -29 -57 -87 -117 -184 -255 -252 -189 -122 -83 -75 -82 -114 -146 -153 -143 -134 -110 -81 -94 -149 -213
10909 -213 -271 -333 -352 -324 -292 -274 -281 -327 -400 -441 -421 -355 -264 -165 -129 -177 -241 -279 -311 -343 -364 -349 -324 -310 -311 -341 -364 -351 -289 -180 -72 -48 -135 -240
10901 -240 -276 -241 -186 -123 -67 -32 -14 -33 -101 -150 -143 -88 -10 71 134 152 137 126 108 71 41 31 36 54 61 19 4 58 92 72 47 17 5 25 8 -80
10892 -80 -188 -267 -307 -306 -290 -256 -218 -197 -177 -144 -100 -44 16 58 62 24 -11 -42 -99 -183 -265 -317 -307 -245 -180 -104 15 117 126 56 -28 -95 -130 -148 -137
10884 -137 -87 -21 37 58 38 -15 -57 -65 -69 -93 -138 -174 -162 -123 -91 -55 -21 -27 -75 -122 -120 -76 -41 -22 -7 16 47 93 125 119 110 120 158 188 191 174 133 78
10876 78 24 -3 -3 -20 -79 -125 -137 -138 -167 -204 -175 -105 -63 -57 -82 -130 -159 -161 -151 -136 -120 -97 -66 -84 -141 -191 -197 -150 -73 8 67 81 69 70 109 143 133 109
10867 109 95 62 20 -19 -22 18 68 93 76 54 80 109 107 80 7 -49 -37 16 64 105 169 214 184 109 30 -24 -29 -15 -3 17 28 34 50 76 83 81 87 102
10858 102 114 112 78 23 -4 14 32 22 34 89 147 193 257 314 318 283 241 191 125 52 -17 -55 -34 8 5 -20 -18 9 15 15 67 126 111 77 58 46 62
10850 62 89 80 69 88 136 195 244 238 176 115 72 46 21 -18 -44 -35 -4 13 5 -9 -26 -38 -33 -16 19 50 70 99 142 183 220 271 304 292 261 240 225
10841 225 171 77 10 8 39 79 131 185 214 226 209 167 155 166 182 184 147 101 73 29 -21 -61 -92 -71 -5 26 4 -15 -12 34 103 175 227 226 178 119
10833 119 77 39 -4 -31 -15 21 29 12 -2 1 -12 -25 -28 -3 33 25 -19 -46 -31 12 51 87 119 133 159 192 174 132 105 83 51 -9 -97 -159 -180 -186 -161
10824 -161 -114 -77 -72 -61 -47 -47 -60 -83 -121 -148 -91 6 68 104 102 70 36 0 -6 32 70 67 35 14 26 64 91 92 87 99 102 65 20 -33 -107 -177 -205 -216
10816 -216 -250 -260 -211 -154 -134 -128 -125 -122 -133 -149 -153 -151 -106 -8 106 189 195 126 30 -37 -73 -83 -76 -73 -89 -110 -113 -104 -104 -120 -143 -164 -179 -190 -218 -267 -324 -384 -425
10807 -425 -403 -336 -282 -258 -250 -242 -248 -263 -252 -262 -317 -343 -307 -224 -154 -117 -102 -117 -121 -98 -60 5 50 42 -14 -64 -78 -86 -97 -84 -54 -39 -37 -48 -84 -167 -254 -301
10798 -301 -286 -242 -205 -189 -189 -195 -219 -225 -202 -178 -170 -174 -180 -189 -166 -118 -77 -54 -62 -104 -173 -234 -275 -282 -249 -204 -172 -192 -257 -302 -295 -251 -208 -168 -147 -174 -203 -203 -211 -206 -161
10789 -161 -101 -68 -66 -61 -63 -96 -122 -92 -42 -2 8 16 29 33 20 -13 -33 -25 -17 -32 -86 -145 -188 -223 -244 -223 -192 -218 -279 -299 -275 -207 -99 25 138 223
10780 223 238 183 106 39 -5 1 69 145 201 218 179 132 106 89 83 54 13 -3 -20 -63 -98 -96 -71 -7 86 151 151 124 111 69 -21 -133 -216 -254 -249 -211
10772 -211 -202 -236 -292 -330 -304 -241 -203 -217 -255 -280 -303 -317 -290 -215 -114 -30 19 60 104 137 156 166 168 171 172 142 85 32 -23 -77 -114 -142 -159 -150 -141 -137 -114
10764 -114 -83 -60 -55 -69 -70 -38 -5 5 20 32 -3 -56 -81 -122 -210 -277 -281 -241 -217 -195 -147 -91 -71 -104 -139 -128 -91 -82 -109 -141 -154 -148 -135 -129 -132 -129 -104 -57
10755 -57 -7 46 88 83 41 20 14 8 5 5 10 15 0 -44 -92 -114 -114 -116 -104 -80 -50 -32 -70 -153 -219 -204 -115 -49 -77 -139 -164 -182 -201 -180 -111 -39 18 72 123
10746 123 172 177 116 25 -55 -95 -98 -93 -104 -126 -138 -144 -164 -167 -104 13 116 148 117 54 4 -33 -77 -120 -153 -168 -160 -127 -80 -37 1 38 91 141 166 168 169
10737 169 187 190 159 119 87 53 39 61 77 71 62 56 47 8 -72 -140 -193 -234 -239 -234 -218 -184 -153 -156 -175 -163 -124 -82 -41 -27 -52 -101 -160 -208 -211 -167 -114 -99 -156
10728 -156 -248 -306 -330 -318 -263 -210 -203 -237 -304 -389 -450 -432 -331 -196 -95 -37 -5 10 24 19 -26 -78 -79 -41 -5 16 17 3 -9 -35 -89 -105 -64 -29 -30
10720 -30 -56 -96 -148 -182 -176 -160 -174 -199 -180 -102 -1 72 76 29 -21 -68 -91 -66 -13 23 -1 -24 12 56 77 83 76 55 34 19 8 -5 -25 -42 -48 -27 7
10712 7 10 -8 -37 -23 45 135 201 231 259 279 304 354 381 369 336 265 186 143 136 147 155 134 90 57 65 96 122 131 144 168 195 222 241 234 171 87 32 2
10703 2 -36 -77 -90 -108 -114 -105 -99 -86 -76 -57 -4 40 50 60 66 43 -12 -56 -85 -110 -142 -170 -168 -156 -160 -169 -175 -154 -113 -98 -112 -126 -114 -92 -113 -148 -137 -99 -64
10694 -64 -27 20 71 87 43 -44 -115 -148 -160 -164 -177 -203 -239 -267 -254 -178 -71 5 23 11 3 1 -4 18 77 113 66 -29 -110 -140 -164 -181 -161 -129 -97 -62
10686 -62 -33 -16 -20 -51 -100 -165 -225 -228 -177 -112 -72 -49 -19 13 30 46 63 53 15 -3 -1 -20 -58 -81 -66 -18 36 63 53 34 27 3 -52 -135 -195 -188 -150
10677 -150 -133 -143 -156 -167 -189 -224 -242 -228 -207 -215 -264 -316 -370 -407 -398 -332 -236 -154 -103 -54 -23 -21 -35 -49 -40 -9 13 -23 -84 -98 -83 -82 -56 12 75 107 123
10669 123 150 172 150 104 82 81 84 92 100 82 68 79 75 38 11 38 76 95 105 92 52 -4 -62 -86 -73 -43 -24 -18 -4 23 44 42 3 -75 -110 -60 34 115
10660 115 120 61 -11 -73 -96 -65 -9 14 13 4 -9 -19 -51 -96 -98 -35 34 42 1 -51 -110 -165 -194 -205 -210 -211 -206 -206 -205 -186 -171 -178 -188 -167 -109 -55 2 67 104 103
10651 103 83 61 36 -8 -55 -76 -77 -71 -55 -53 -82 -135 -202 -235 -221 -181 -125 -90 -84 -62 -16 30 48 45 38 27 20 26 23 17 48 92 101 92 108 145 147 110 65 22 -7
10641 -7 -12 -4 17 40 18 -58 -103 -64 1 30 27 -7 -54 -101 -149 -155 -104 -70 -72 -90 -106 -106 -95 -70 -32 18 76 120 127 94 32 -26 -78 -132 -157 -145 -104 -59 -57
10633 -57 -74 -78 -63 -51 -48 -33 -19 -22 -41 -73 -124 -169 -180 -147 -101 -94 -102 -107 -109 -97 -41 52 139 174 163 117 46 -4 -14 4 28 40 44 28 -7 -54 -104 -137 -138
10624 -138 -111 -78 -61 -58 -40 4 78 169 206 163 124 129 142 150 135 83 28 -14 -72 -131 -164 -202 -233 -237 -202 -159 -133 -113 -78 -65 -100 -164 -234 -262 -243 -209
10615 -209 -166 -129 -106 -70 -31 -5 0 4 35 81 126 124 59 -9 -35 -43 -88 -167 -220 -236 -216 -161 -115 -112 -148 -168 -147 -119 -87 -48 -38 -38 -7 18 -22 -126 -250
10607 -250 -380 -445 -409 -337 -255 -167 -117 -96 -48 20 44 -1 -56 -78 -55 -24 -37 -120 -238 -327 -353 -325 -272 -234 -199 -164 -136 -152 -193 -219 -233 -231 -205 -163
10599 -163 -145 -129 -71 -37 -78 -142 -130 -35 59 103 114 100 77 63 94 146 145 59 -94 -225 -285 -285 -260 -249 -264 -251 -203 -166 -168 -187 -185 -202 -241 -241 -226 -221
10591 -221 -228 -225 -196 -166 -137 -143 -165 -153 -136 -134 -137 -157 -201 -235 -224 -170 -117 -91 -71 -55 -43 -31 -42 -77 -97 -109 -130 -136 -135 -156 -195 -228 -239 -193 -84 30 97
10582 97 120 145 188 199 195 197 185 142 101 89 83 70 46 13 9 42 101 129 84 -6 -92 -111 -68 -34 -54 -95 -110 -97 -69 -37 3 67 124 147 147 143 137 131 113
10573 113 90 81 69 66 62 21 -13 -25 -49 -73 -54 2 63 107 119 116 99 45 -39 -92 -79 -39 -24 -19 1 3 -31 -58 -56 -74 -107 -108 -64 12 67 81 82 65 22
10564 22 -53 -115 -120 -65 -16 -3 -11 -22 -19 2 42 104 135 88 13 -28 -19 8 2 -28 -34 -4 22 27 38 88 149 183 168 100 11 -71 -149 -207 -227 -242 -256 -258 -261
10555 -261 -251 -200 -114 -56 -72 -121 -110 -35 44 113 172 184 126 77 76 88 72 25 2 -2 -11 -32 -58 -69 -50 -9 34 50 54 64 66 33 -39 -104 -147 -177 -193
10547 -193 -202 -205 -180 -153 -132 -120 -133 -157 -186 -213 -224 -205 -163 -157 -187 -214 -206 -170 -126 -84 -58 -46 -41 -49 -79 -101 -83 -60 -76 -112 -133 -147 -180 -242 -295 -307 -272
10538 -272 -231 -213 -189 -154 -101 -43 15 43 13 -45 -95 -122 -146 -163 -145 -99 -53 -12 16 18 -15 -93 -207 -317 -375 -377 -331 -255 -197 -160 -138 -126 -107 -86
10530 -86 -87 -100 -97 -90 -112 -162 -205 -206 -176 -142 -131 -141 -131 -122 -132 -135 -115 -74 -46 -67 -107 -133 -138 -114 -81 -60 -83 -148 -226 -276 -254 -174 -82 -17 16 48 73 89
10522 89 103 118 107 55 8 2 26 66 98 87 44 1 -19 -40 -46 24 121 145 81 18 -6 -32 -79 -127 -158 -186 -195 -175 -159 -144 -154 -214 -270 -275 -245 -195 -143
10513 -143 -101 -55 13 61 62 42 27 16 10 22 26 -7 -43 -60 -51 -30 -7 30 86 152 192 177 140 118 106 98 91 75 74 107 152 210 276 307 283 221 145 66
10505 66 -14 -84 -140 -185 -205 -197 -141 -44 31 75 85 40 -13 -38 -51 -69 -100 -150 -207 -239 -256 -257 -230 -206 -202 -197 -153 -97 -69 -47 -14 16 51 66 35 -5 -18
10496 -18 -36 -74 -119 -122 -73 -36 -34 -37 -18 16 32 48 81 83 44 4 -25 -11 59 123 145 144 155 182 187 163 131 95 84 104 94 78 118 179 173 106 32 -89
10487 -89 -246 -322 -300 -255 -176 -105 -52 -2 34 62 103 156 186 172 131 60 -20 -107 -196 -232 -237 -258 -285 -305 -288 -216 -134 -87 -82 -94 -106 -117 -138 -147 -119 -84
10479 -84 -67 -48 -9 63 143 206 249 301 354 362 318 239 199 219 253 282 316 364 435 490 532 590 660 731 789 845 930 1057 1227 1393 1556 1788 2117
10471 2117 2585 3239 4143 5379 7093 9476 12333 13861 12091 8819 6262 4609 3549 2823 2309 1940 1669 1409 1151
10467 1151 941 798 672 515 345 229 200 239 263 266 261 235 194 137 58 -17 -53 -54 -56 -57 -60 -70 -107 -158 -218 -281 -316 -300 -265 -231 -163 -72 -13 -8
10459 -8 -38 -48 -32 -17 -12 -34 -94 -133 -129 -109 -88 -69 -83 -121 -131 -114 -110 -107 -66 -8 45 60 34 3 -21 -62 -122 -157 -184 -210 -214 -207 -190 -156 -133 -117 -100 -66
10451 -66 -66 -97 -93 -59 -25 -34 -94 -157 -191 -194 -220 -241 -206 -169 -183 -238 -289 -299 -272 -224 -161 -94 -42 -20 -28 -56 -74 -67 -72 -89 -93 -107 -141 -157 -158 -150 -158 -175 -177 -159 -123
10441 -123 -85 -66 -68 -84 -118 -127 -78 -31 -32 -46 -54 -73 -99 -96 -60 -44 -58 -77 -103 -145 -153 -137 -162 -223 -243 -237 -237 -216 -119 34 133 159 170 173 160 156 157 122 75
10432 75 79 122 149 113 40 2 -3 2 -5 -27 -50 -86 -129 -151 -156 -159 -142 -82 -23 -21 -103 -211 -306 -340 -291 -197 -99 -39 -30 -63 -110 -146 -141 -78 -6 30 54 84 94
10423 94 95 96 94 80 45 -11 -25 2 -27 -110 -159 -169 -178 -185 -189 -199 -234 -276 -313 -354 -367 -338 -281 -184 -71 -7 -27 -63 -57 -14 -2 -40 -86 -105 -75 -12 52 106
10414 106 152 186 200 208 233 246 238 203 119 27 14 49 45 -10 -87 -148 -160 -127 -89 -60 -31 -16 -5 10 8 -19 -46 -56 -43 -30 -19 -2 16 26 42 70
10406 70 85 57 -26 -108 -143 -126 -74 -34 -31 -56 -94 -91 -36 24 78 111 104 57 -10 -85 -137 -156 -180 -234 -278 -283 -262 -194 -104 -51 -46 -64 -71 -36 33 85 78 43
10397 43 -7 -56 -75 -66 -35 16 79 128 143 144 126 88 40 -5 -59 -89 -79 -73 -71 -34 -2 5 35 91 135 146 127 75 17 -18 -35 -45 -52 -38 18 68 103 150
10389 150 171 104 2 -47 -40 -24 -11 -7 -30 -65 -91 -89 -48 8 31 18 -2 -9 -16 -58 -116 -147 -180 -195 -176 -172 -197 -247 -287 -292 -289 -283 -268 -252 -228 -204 -157 -96
10380 -96 -75 -91 -86 -41 -26 -50 -73 -93 -113 -131 -145 -155 -139 -114 -111 -119 -111 -107 -141 -191 -197 -133 -33 32 7 -67 -114 -134 -169 -198 -217 -214 -182 -155 -158 -169 -172 -176 -169 -153
10371 -153 -122 -120 -147 -153 -148 -133 -112 -86 -55 -65 -124 -162 -143 -106 -72 -34 -15 -28 -44 -36 0 46 90 126 139 104 18 -87 -168 -172 -130 -80 7 133 211 206
10363 206 127 -21 -188 -266 -250 -224 -206 -184 -171 -153 -132 -147 -176 -189 -178 -153 -134 -120 -103 -93 -107 -115 -114 -133 -160 -154 -117 -69 -49 -72 -110 -136 -151 -142 -103
10354 -103 -63 -51 -40 -17 -7 -2 6 28 52 59 46 -14 -110 -197 -253 -275 -257 -203 -149 -123 -144 -185 -208 -200 -179 -156 -141 -131 -97 -34 34 92 129 129 106 76 60
10346 60 55 23 -39 -103 -121 -76 -3 43 73 103 120 122 89 24 -46 -133 -204 -201 -131 -90 -115 -150 -154 -146 -153 -172 -189 -164 -101 -43 -38 -70 -58 3 44 55 81 124
10337 124 133 116 110 131 149 136 99 56 38 39 39 26 6 -16 -44 -66 -61 -40 -36 -38 -7 47 63 42 39 54 84 92 47 -31 -108 -128 -116 -76 -8 51 66 73 101
10328 101 122 159 199 174 62 -82 -183 -231 -273 -335 -372 -365 -325 -278 -229 -196 -178 -140 -84 -18 39 53 39 45 88 119 100 59 7 -36 -23 40 111 143
10320 143 126 94 68 73 96 94 62 19 -5 -4 1 18 63 99 94 63 10 -25 -13 -3 -20 -29 -24 -40 -98 -134 -94 -16 43 70 69 73 100 93 47 13 42 99 115
10311 115 104 97 93 83 63 35 1 -38 -81 -92 -79 -82 -92 -78 -47 -35 -41 -58 -109 -168 -170 -135 -101 -65 -11 27 16 -21 -93 -177 -221 -229 -203 -144 -92 -66 -55
10303 -55 -12 57 110 133 116 71 43 -15 -114 -192 -213 -175 -144 -144 -155 -141 -110 -91 -71 -56 -58 -57 -62 -69 -89 -119 -163 -242 -303 -329 -364 -396 -379 -310 -253 -256 -273 -262
10294 -262 -215 -188 -217 -262 -295 -330 -360 -374 -382 -361 -297 -213 -141 -117 -145 -182 -194 -207 -224 -222 -191 -143 -64 24 86 152 228 240 167 73 20 31 85 149 179
10286 179 152 113 114 131 128 103 80 52 6 -26 -35 -26 6 22 37 90 115 97 88 73 5 -98 -164 -160 -123 -72 1 53 60 19 0 49 126 162 142 121 121 122
10277 122 95 36 -21 -67 -116 -135 -110 -93 -88 -102 -118 -106 -107 -149 -198 -202 -157 -89 -5 71 85 35 15 45 84 150 189 139 71 36 2 -16 28 105 151 165
10269 165 158 138 129 133 134 119 78 21 -36 -81 -115 -146 -186 -201 -172 -165 -234 -323 -374 -387 -370 -333 -271 -209 -172 -147 -124 -130 -175 -218 -228 -203 -180 -173 -186 -218 -226 -169
10260 -169 -71 -17 -43 -84 -129 -188 -204 -165 -86 -36 -51 -74 -85 -103 -150 -219 -268 -288 -281 -235 -169 -107 -62 -35 -20 -15 7 35 30 6 1 16 17 -35 -100 -131 -107
10252 -107 -49 11 48 59 66 80 80 98 143 160 139 133 117 38 -32 -18 12 2 13 45 62 46 12 -5 -1 13 13 -29 -98 -148 -167 -139 -92 -89 -119 -134 -130 -125
10243 -125 -133 -151 -153 -129 -101 -108 -127 -85 -23 -34 -111 -204 -260 -222 -127 -29 26 13 -37 -82 -91 -85 -81 -64 -47 -27 11 32 19 17 54 100 121 117 106 90 72 77 75
10234 75 57 54 79 114 125 135 172 199 177 114 81 88 113 136 143 130 89 32 -25 -54 -36 11 69 136 192 210 177 124 79 70 86 70 14 -49 -79 -85 -64
10226 -64 -14 19 29 50 52 9 -62 -138 -169 -124 -38 24 25 5 3 -29 -101 -146 -139 -113 -99 -101 -99 -93 -99 -94 -62 -43 -42 -56 -87 -126 -145 -132 -126 -143 -154 -130 -97 -56
10217 -56 2 17 -12 -37 -45 -63 -108 -160 -163 -70 60 122 96 72 73 67 23 -56 -75 -19 23 28 11 4 7 21 45 56 77 117 148 145 143 149 137 100 87 105 125
10208 125 104 29 -57 -129 -160 -146 -139 -136 -108 -63 -9 40 64 38 0 -18 -53 -95 -108 -99 -70 -18 20 21 -4 -36 -56 -54 -25 12 39 32 13 24 86 147 148 125
10199 125 91 19 -79 -152 -191 -213 -205 -177 -163 -158 -156 -172 -207 -236 -241 -202 -117 -11 68 93 107 121 106 82 47 -5 -61 -69 -9 59 94 95 45 -51 -127 -127 -78
10190 -78 -43 -47 -73 -98 -113 -72 14 74 90 51 -15 -41 -19 6 19 12 -34 -90 -134 -195 -264 -287 -254 -171 -71 35 111 82 18 -14 -58 -137 -215 -263 -279
10182 -279 -235 -183 -193 -229 -233 -228 -215 -156 -61 6 23 18 -21 -97 -185 -232 -213 -180 -166 -160 -149 -160 -193 -206 -186 -161 -132 -106 -133 -226 -293 -279 -230 -220 -243 -280
10174 -280 -289 -248 -187 -129 -74 -24 46 113 173 222 225 192 150 131 173 207 167 90 7 -87 -182 -254 -300 -319 -327 -341 -339 -330 -366 -426 -438 -386 -315 -264 -230 -169 -60
10166 -60 57 123 126 119 116 91 35 -29 -90 -122 -129 -132 -104 -45 -3 18 56 106 122 122 125 123 101 82 86 107 136 148 110 37 -27 -53 -62 -61 -52 -33 -24 -21 3 22 25 14
10156 14 -1 -18 -34 -81 -136 -136 -100 -65 -39 -26 -32 -37 -28 -38 -81 -127 -121 -101 -115 -131 -125 -80 -17 17 43 80 96 96 117 149 177 217 293 367 401 380 317 222
10147 222 134 84 42 -41 -125 -135 -94 -65 -45 7 92 185 255 278 255 202 154 138 118 56 -37 -81 -34 57 114 144 193 246 284 313 358 387 370 339
10139 339 288 205 119 51 10 13 25 22 38 78 120 173 229 262 277 277 251 194 132 53 -36 -94 -93 -74 -72 -83 -113 -144 -118 -48 4 47 93 139 170 149 106
10131 106 94 113 130 115 53 2 -14 -38 -70 -116 -163 -200 -214 -155 -62 -4 15 26 36 41 40 25 17 39 78 122 163 190 198 163 78 -16 -72 -85 -91 -89 -58
10122 -58 -3 30 8 -27 -51 -59 -12 100 223 305 340 315 244 154 65 -11 -80 -152 -226 -259 -246 -233 -219 -187 -140 -87 -27 30 43 0 -31 -16 9 36
10115 36 75 94 82 57 23 22 48 17 -79 -155 -134 -39 31 19 -40 -97 -134 -127 -65 8 39 19 -23 -50 -49 -53 -72 -101 -151 -218 -317 -419 -472 -473 -408 -301
10106 -301 -204 -142 -112 -108 -127 -127 -86 -56 -56 -67 -78 -78 -59 -21 -7 -43 -81 -99 -105 -98 -64 15 78 113 158 220 279 302 280 241 199 176 177 138 63 5 -16 12
10098 12 54 59 49 69 99 106 90 73 67 72 83 90 104 126 152 175 171 129 73 49 43 10 -60 -154 -210 -230 -236 -252 -292 -334 -361 -358 -326 -285 -249 -203 -136 -43 29
10089 29 18 -60 -157 -239 -288 -304 -284 -208 -143 -175 -248 -283 -260 -224 -224 -231 -200 -161 -146 -149 -149 -152 -161 -180 -180 -111 -14 52 75 71 45 10 -54 -135 -200 -223 -226 -229 -187 -114
10079 -114 -78 -97 -140 -178 -195 -199 -199 -193 -185 -173 -163 -163 -164 -133 -98 -85 -74 -65 -69 -62 -45 -63 -107 -164 -213 -230 -243 -272 -279 -229 -130 -12 102 179 202 158 106 91
10071 91 94 84 54 29 8 -18 -39 -25 2 9 -19 -68 -108 -138 -156 -140 -78 -27 -42 -101 -137 -108 -47 -8 -25 -75 -127 -152 -152 -137 -122 -126 -140 -143 -135 -109 -63 -1
10062 -1 49 35 -25 -65 -75 -72 -61 -53 -87 -134 -111 -56 -41 -56 -50 -18 8 26 39 44 24 -11 -13 12 51 89 81 24 -28 -54 -71 -94 -103 -101 -106 -103 -51 39 90 87 75
10053 75 92 85 36 -20 -60 -89 -96 -69 -13 53 121 166 179 185 150 80 11 -61 -109 -75 34 127 173 210 232 202 133 67 24 -33 -92 -92 -50 -22 -12 6
10044 6 24 26 9 -31 -70 -101 -150 -200 -206 -183 -185 -248 -317 -322 -280 -233 -186 -136 -86 -65 -95 -172 -280 -360 -368 -335 -302 -301 -323 -323 -276 -191 -110 -84 -93 -71 -34 -28 -33 -29
10035 -29 -34 -62 -104 -134 -146 -148 -132 -103 -71 -28 37 93 116 143 163 143 101 62 18 -19 -12 44 93 120 142 130 78 23 -34 -104 -172 -203 -215 -228 -249 -242 -162
10027 -162 -36 59 47 -43 -95 -60 8 34 21 26 48 25 -46 -130 -199 -217 -200 -204 -209 -219 -257 -285 -256 -186 -119 -63 -25 -6 -4 -6 -6 -11 -10 6 6 8 50 135 181
10018 181 148 126 141 162 190 228 241 229 250 297 284 220 185 182 150 74 -3 -36 -30 -7 37 86 83 56 66 83 66 59 93 129 157 171 145 90 30 2
10009 2 31 61 54 27 -11 -57 -91 -107 -97 -60 -28 -37 -84 -125 -167 -224 -290 -332 -309 -235 -147 -94 -83 -96 -101 -90 -64 -41 -34 -14 -21 -98 -187 -237 -252 -269 -287 -296
10001 -296 -312 -331 -298 -225 -180 -180 -206 -214 -202 -199 -194 -179 -131 -63 12 92 140 109 24 -47 -99 -143 -174 -166 -128 -106 -115 -145 -159 -142 -105 -42 9 -10 -116 -218
9992 -218 -226 -169 -101 -80 -97 -122 -129 -110 -107 -116 -102 -113 -171 -244 -278 -256 -226 -217 -232 -268 -287 -276 -238 -183 -151 -123 -84 -72 -96 -123 -107 -66 -63 -60 -14 49 114 144
9984 144 118 73 43 32 46 71 95 94 90 112 129 110 48 -26 -60 -39 -8 -2 -41 -90 -88 -42 16 52 49 22 18 42 47 4 -73 -120 -131 -136 -147 -168 -195 -197 -186
9975 -186 -185 -175 -149 -146 -176 -193 -181 -164 -176 -212 -218 -221 -253 -290 -301 -288 -247 -195 -162 -171 -175 -117 -38 10 47 51 2 -30 -17 -14 -26 -10 23 27 -9 -48 -63 -82 -121
9966 -121 -177 -215 -211 -190 -193 -210 -210 -187 -158 -146 -176 -227 -266 -295 -320 -318 -291 -265 -244 -209 -152 -105 -98 -92 -68 -34 17 45 22 6 23 71 142 182 169 122 69 21
9957 21 -1 13 55 92 89 78 93 114 100 61 34 31 29 30 55 90 108 114 125 148 150 114 78 86 169 264 329 355 354 342 300 241 170 62 -38 -59 -6 66
9948 66 115 101 26 -26 -31 1 69 156 246 314 332 312 281 231 177 113 42 -4 -17 6 62 159 252 293 308 314 307 304 309 318 332 324 303 276 226 172 160 200 228
9939 228 222 206 180 171 195 193 132 67 33 26 29 19 23 56 88 100 116 127 121 100 94 96 52 -21 -32 62 183 233 169 46 -36 -65 -87 -113 -126 -157 -201 -209 -158
9930 -158 -90 -57 -38 12 60 59 14 -4 30 85 133 173 191 203 210 215 235 265 283 305 317 348 402 458 503 552 570 585 652 743 855 1023 1191 1375
9922 1375 1609 1936 2372 2914 3578 4528 5989 8303 11640 15160 15865 12881 9223 6544 4823 3733 2972 2357 1893 1572
9918 1572 1332 1125 910 679 517 448 454 476 476 477 483 477 448 354 232 135 68 24 21 48 86 108 127 143 152 129 100 88 97 101 78 55 49 49 57 90 116
9909 116 115 99 63 8 -34 -45 -60 -93 -106 -60 7 58 87 92 85 80 51 -2 -67 -127 -172 -216 -196 -104 -56 -72 -100 -92 -46 9 13 -38 -77 -84 -66 -43 -24 -16 -5
9900 -5 5 15 8 -17 -15 13 38 54 85 151 221 246 253 287 336 347 303 231 145 38 -63 -134 -169 -203 -242 -243 -184 -137 -134 -146 -160 -169 -183 -193 -192 -208 -265 -343
9892 -343 -381 -357 -300 -243 -214 -208 -207 -193 -165 -157 -187 -191 -131 -37 35 63 59 40 10 -23 -51 -81 -96 -90 -86 -75 -46 -3 32 35 11 -6 -6 -7 3 -10 -38 -36 -41 -54 -50
9882 -50 -57 -71 -45 -10 -46 -141 -203 -205 -168 -135 -111 -88 -79 -95 -97 -27 74 133 141 143 129 88 65 78 98 76 37 4 25 128 222 252 215 144 96 82 79 68
9873 68 48 38 53 103 160 171 122 67 45 32 -15 -83 -138 -156 -113 -40 25 52 39 -6 -37 -37 3 57 73 39 -40 -132 -199 -247 -302 -381 -430 -392 -317 -269
9865 -269 -244 -215 -169 -153 -188 -194 -153 -87 -44 -18 32 59 32 -11 -22 -11 -15 -35 -66 -105 -124 -131 -142 -135 -101 -39 29 52 52 27 -28 -96 -139 -126 -75 -60 -74
9857 -74 -59 -58 -93 -121 -122 -116 -145 -182 -174 -132 -86 -52 -61 -119 -174 -182 -163 -156 -169 -182 -208 -246 -263 -263 -224 -155 -99 -93 -120 -128 -135 -111 -22 51 61 43 30 17 -7 -26 -40
9847 -40 -47 -74 -144 -210 -222 -206 -242 -350 -431 -421 -372 -328 -297 -282 -279 -277 -259 -204 -133 -92 -94 -92 -61 -6 55 55 1 -15 28 80 97 102 108 105 104 105 91 48 -8 -57
9838 -57 -77 -87 -88 -47 37 106 105 68 57 67 41 -43 -125 -147 -135 -122 -120 -139 -147 -137 -126 -101 -62 -52 -70 -72 -25 35 50 45 62 99 144 175 176 152 126 89 66
9829 66 85 135 180 188 171 164 157 117 53 -6 -21 15 51 75 100 122 138 127 99 80 62 41 31 29 45 79 112 121 77 1 -48 -83 -140 -193 -228 -243 -238 -229 -232
9820 -232 -199 -132 -75 -33 -10 19 55 83 91 105 109 62 -23 -123 -223 -294 -299 -244 -164 -100 -53 -6 13 -5 -54 -101 -126 -151 -169 -141 -79 -35 -25 -50 -98
9812 -98 -137 -132 -95 -41 18 43 33 -7 -57 -92 -120 -190 -264 -302 -301 -259 -210 -170 -121 -87 -89 -96 -104 -111 -88 -26 38 67 59 28 -13 -34 -20 23 75 86 38 -23 -50
9803 -50 -26 36 86 82 55 62 92 137 201 250 246 212 193 196 206 206 182 156 142 131 113 83 45 31 65 118 143 125 73 33 30 10 -7 -1 9 19 38 61 80
9794 80 95 101 104 111 97 34 -62 -156 -199 -163 -88 -36 -44 -77 -76 -47 -62 -151 -239 -280 -288 -266 -236 -214 -209 -232 -274 -304 -271 -176 -77 7 48 38 22 24 9 -10 -10 -24
9785 -24 -48 -65 -47 -8 14 23 -2 -49 -67 -32 35 89 117 112 73 29 17 31 40 29 -22 -101 -184 -237 -251 -237 -190 -150 -141 -124 -91 -74 -63 -11 90 194
9777 194 229 162 57 -8 -40 -83 -116 -111 -126 -173 -192 -161 -118 -110 -139 -181 -222 -237 -220 -208 -200 -163 -136 -162 -211 -211 -164 -120 -105 -123 -143 -138 -128 -106 -52 31 111
9768 111 157 146 78 -10 -67 -68 -51 -48 -66 -101 -99 -25 78 145 160 150 123 107 99 82 73 58 29 7 -23 -61 -111 -163 -152 -90 -48 -44 -65 -91 -113 -147 -201
9760 -201 -256 -264 -231 -213 -215 -218 -204 -157 -107 -93 -94 -84 -56 -31 -41 -64 -79 -127 -201 -230 -201 -137 -75 -61 -79 -112 -135 -113 -58 4 43 21 -49 -94 -90 -46 -9
9751 -9 -2 -40 -70 -36 8 31 62 99 116 92 31 -13 -10 6 15 23 32 37 16 -54 -149 -202 -212 -200 -188 -195 -199 -201 -187 -143 -106 -55 25 114 151 115 65 33 22 24 26
9742 26 20 30 86 145 179 193 172 103 5 -65 -82 -47 -23 -51 -58 -16 17 11 -25 -67 -70 -32 5 34 57 49 5 -53 -88 -78 -52 -52 -77 -123 -149 -135 -135 -168 -203
9733 -203 -201 -174 -173 -216 -267 -325 -386 -424 -425 -376 -302 -236 -183 -153 -145 -125 -64 7 18 -7 -2 21 8 -33 -62 -64 -98 -172 -187 -143 -97 -54 -43 -80 -109 -87 -29 33
9724 33 54 29 -22 -53 -60 -79 -93 -63 -46 -85 -101 -76 -67 -78 -90 -84 -73 -67 -54 -53 -64 -96 -130 -148 -146 -111 -62 -22 1 -10 -19 2 31 34 17 -12 -55 -83 -85 -80
9715 -80 -89 -95 -99 -101 -107 -110 -129 -162 -181 -190 -197 -212 -251 -305 -348 -345 -318 -323 -320 -254 -142 -74 -87 -126 -149 -171 -183 -162 -88 13 95 129 87 13 -24 -37 -96 -192 -253 -271
9706 -271 -265 -238 -239 -282 -338 -381 -385 -355 -311 -257 -183 -99 -59 -66 -64 -36 -21 -18 -2 35 70 101 158 209 227 231 219 167 117 78 25 -24 -48 -33 7 35 36 40 42 41
9697 41 79 128 163 183 165 107 34 -4 -19 -16 27 108 201 234 187 112 51 15 -19 -57 -77 -80 -49 30 109 178 237 256 240 192 104 4 -53 -48 -13 -2
9688 -2 -19 -45 -65 -81 -83 -59 -50 -53 -52 -31 -14 -49 -104 -124 -109 -120 -137 -115 -58 25 96 88 32 0 -28 -59 -61 -32 11 57 98 128 135 116 104 89 59 1 -78
9679 -78 -115 -91 -61 -55 -55 -72 -82 -87 -89 -79 -68 -36 -2 -12 -60 -106 -110 -82 -73 -95 -111 -82 -36 -16 10 56 85 103 110 90 63 37 24 30 46 49 40 22 19 35 57
9670 57 90 110 97 69 44 -4 -73 -118 -101 -44 34 111 148 137 86 32 -2 -10 -18 -22 -27 -71 -111 -106 -82 -78 -112 -173 -201 -139 -41 24 44 20 -36 -89 -94 -53 4
9661 4 14 -28 -51 -25 -17 -51 -92 -134 -164 -187 -214 -245 -252 -236 -225 -236 -255 -248 -226 -210 -187 -149 -117 -123 -187 -268 -296 -268 -174 -49 29 87 161 225 242 219 179
9652 179 130 94 72 59 67 96 109 79 12 -61 -104 -119 -108 -79 -66 -52 -24 -27 -53 -106 -144 -116 -51 4 -4 -66 -120 -142 -148 -164 -186 -191 -185 -201 -213 -218 -239 -261
9644 -261 -266 -242 -196 -163 -174 -216 -214 -144 -63 -16 -23 -39 -30 -36 -57 -79 -115 -145 -162 -189 -211 -204 -187 -151 -83 -10 34 66 139 227 272 281 283 267 238 202 186 194 222
9635 222 217 121 -40 -170 -220 -238 -272 -295 -292 -266 -219 -184 -175 -207 -246 -253 -241 -237 -246 -249 -215 -166 -122 -60 34 123 194 210 173 126 121 134 100 25 -55 -116 -151 -175
9626 -175 -204 -234 -246 -216 -142 -72 -25 -13 -32 -75 -122 -126 -76 -2 43 18 -39 -48 -15 37 93 109 91 82 94 113 121 110 81 41 0 -34 -49 -60 -74 -88 -66
9617 -66 2 38 8 -31 -74 -129 -146 -92 -15 4 -33 -86 -120 -130 -155 -183 -214 -240 -226 -195 -169 -134 -106 -103 -108 -130 -167 -210 -226 -198 -175 -153 -102 -49 -23 -14 -39
9609 -39 -103 -155 -167 -144 -140 -154 -152 -120 -92 -80 -81 -104 -107 -85 -106 -175 -196 -143 -84 -43 -5 27 48 63 60 60 74 94 117 137 162 202 231 246 257 265 250 210 141
9600 141 65 25 34 65 72 54 26 -21 -62 -79 -81 -68 -47 -38 -67 -131 -170 -179 -181 -147 -106 -122 -178 -178 -119 -85 -73 -61 -78 -118 -176 -242 -264 -211 -137 -84 -55 -65
9591 -65 -96 -125 -139 -131 -138 -167 -206 -267 -315 -308 -253 -204 -173 -135 -112 -130 -187 -229 -216 -181 -130 -71 -36 -29 -42 -70 -83 -70 -57 -58 -54 -38 -2 30 19 -26 -70 -115
9583 -115 -161 -193 -184 -124 -42 56 136 181 214 255 310 321 225 92 -7 -71 -85 -92 -124 -156 -176 -174 -148 -119 -80 -22 50 98 107 68 2 -31 -25 -21 -24 -39 -73 -84
9574 -84 -61 -25 23 67 92 107 113 80 28 -9 -53 -113 -155 -177 -200 -243 -271 -247 -201 -157 -100 -51 -27 -17 -11 6 26 23 16 48 119 162 124 43 -43 -109 -133
9565 -133 -101 -53 -37 -13 55 149 250 297 291 260 205 151 114 82 37 -17 -67 -132 -214 -263 -244 -187 -125 -58 5 66 138 195 214 188 124 20 -76 -107
9558 -107 -80 -33 -3 -1 -37 -75 -62 -18 19 33 16 -34 -86 -68 5 78 111 57 -39 -95 -102 -71 -26 3 -15 -43 -36 -30 -71 -100 -57 27 89 86 37 -45 -137
9549 -137 -194 -230 -287 -337 -358 -386 -386 -318 -235 -200 -205 -226 -222 -192 -169 -165 -168 -130 -54 12 59 104 126 139 149 143 122 103 102 104 109 107 80 65 52 16 -32 -45 -28 -17
9540 -17 -32 -43 -38 -43 -65 -79 -60 -37 -25 -26 -33 -28 -26 -52 -83 -77 -40 -1 31 35 10 -13 -34 -51 -20 20 -4 -38 -48 -58 -53 -21 2 -12 -45 -71 -64 -41 -47 -57 -53
9530 -53 -79 -139 -175 -178 -178 -206 -269 -358 -423 -414 -352 -274 -202 -140 -82 -52 -41 -25 1 23 37 35 43 63 71 51 12 19 51 47 26 11 -4 -34 -57 -46 -54 -76 -76 -49
9521 -49 -3 25 17 -23 -33 18 89 117 100 69 36 5 -23 -41 -59 -83 -84 -52 -30 -29 -52 -108 -165 -193 -185 -154 -110 -60 4 65 103 136 177 234 283 282 256 224
9512 224 183 152 125 70 14 -9 -30 -74 -123 -136 -110 -85 -98 -143 -142 -104 -82 -40 4 -3 -46 -133 -236 -271 -215 -155 -128 -102 -85 -92 -129 -187 -255 -295 -296 -292 -303
9504 -303 -309 -300 -275 -260 -268 -248 -180 -115 -90 -102 -103 -91 -109 -145 -147 -139 -156 -140 -73 -33 -53 -95 -98 -31 74 140 99 -18 -146 -228 -248 -227 -200 -181 -140 -78 -31
9495 -31 -6 -20 -72 -138 -194 -214 -223 -230 -219 -173 -112 -101 -131 -144 -151 -159 -152 -119 -65 -20 -14 -46 -89 -114 -115 -110 -64 -16 -22 -42 -54 -95 -167 -217 -210 -172 -139 -121 -100 -99 -129
9486 -129 -185 -229 -216 -163 -97 -52 -46 -45 -15 32 53 36 -5 -35 -52 -69 -56 -32 -37 -41 -43 -48 -8 83 145 146 103 54 10 -43 -76 -57 -18 27 53 30 23 49 76
9477 76 90 90 78 56 43 32 29 52 68 20 -47 -66 -51 -54 -75 -80 -79 -82 -43 32 62 47 37 55 55 17 -36 -76 -103 -141 -188 -207 -212 -186 -121 -61 -40 -55 -104
9468 -104 -158 -170 -132 -70 -15 27 20 -60 -143 -172 -182 -182 -148 -109 -112 -162 -225 -270 -276 -237 -170 -108 -78 -77 -85 -76 -56 -66 -110 -156 -154 -120 -93 -78 -68 -56 -68 -100 -154
9459 -154 -225 -265 -243 -193 -137 -67 7 54 60 49 39 52 59 29 -9 -30 -25 2 14 24 72 126 134 106 109 142 138 95 51 44 59 82 69 21 4 32 59 73
9450 73 62 15 -25 -16 6 -4 -32 -14 39 41 6 13 52 71 51 40 68 104 131 145 138 113 96 88 76 75 80 66 26 -31 -58 -59 -54 -38 -8 25 39 25 -16 -73
9441 -73 -119 -138 -169 -208 -198 -156 -119 -69 -27 -26 -53 -84 -111 -137 -175 -217 -239 -265 -311 -338 -298 -213 -140 -106 -87 -57 -34 -21 0 -4 -34 -55 -50 -46 -58 -92 -144
9433 -144 -155 -148 -164 -161 -110 -46 -23 -36 -36 -38 -58 -74 -71 -70 -69 -52 -51 -97 -169 -246 -296 -269 -182 -98 -41 -35 -101 -197 -289 -340 -309 -217 -138 -105 -77 -18 35 53 69
9424 69 69 27 -52 -130 -166 -188 -195 -162 -130 -124 -126 -151 -217 -286 -305 -264 -194 -118 -70 -47 -30 -15 -4 -10 -17 -8 -1 -13 -29 -16 15 38 43 20 -10 -25 1 48 47 -15
9415 -15 -82 -102 -78 -79 -126 -146 -142 -180 -237 -215 -130 -70 -63 -80 -103 -82 -57 -103 -153 -171 -171 -144 -126 -103 -65 -35 -4 27 33 48 76 78 69 76 91 116 161 223 253
9406 253 255 241 214 156 69 5 -23 -34 -33 -16 5 18 31 61 118 173 210 232 238 236 208 159 126 109 86 53 4 -57 -95 -61 38 129 167 182 190 168 135
9397 135 132 136 127 96 43 14 51 106 142 176 204 200 154 77 56 102 146 162 181 173 80 -64 -150 -156 -136 -113 -66 -41 -75 -117 -119 -120 -145 -148 -141 -117 -67 -2 79
9388 79 140 154 135 100 65 60 64 21 -54 -98 -89 -75 -64 -39 -16 0 28 56 88 125 157 184 166 116 98 106 91 77 101 128 106 44 -39 -96 -91 -55 7 71
9379 71 58 -4 -59 -81 -47 8 51 61 5 -81 -135 -93 -1 54 55 20 -22 -47 -57 -49 -56 -112 -187 -277 -371 -424 -401 -309 -204 -136 -120 -97 -45 11 84 166
9371 166 223 230 205 158 86 13 -23 -36 -75 -123 -162 -185 -197 -206 -206 -184 -135 -77 -47 -46 -33 -10 12 38 61 91 135 183 196 162 136 148 184 212 204 154 77
9363 77 6 -46 -85 -144 -222 -265 -240 -179 -145 -163 -190 -211 -211 -185 -132 -69 -34 -39 -55 -70 -95 -108 -96 -68 -54 -77 -84 -24 39 61 59 76 94 64 9 -57 -141
9354 -141 -195 -208 -212 -212 -135 16 143 188 183 158 118 71 21 -21 -44 -56 -77 -77 -34 14 9 -56 -127 -148 -145 -136 -121 -121 -134 -104 -28 35 41 3 -44 -86 -117 -136
9345 -136 -149 -166 -159 -97 -27 1 6 2 -16 -24 -43 -111 -186 -209 -162 -72 10 65 104 123 106 65 39 33 17 -24 -49 -28 1 -10 -44 -49 -16 25 60 73 74 52
9337 52 0 -67 -115 -111 -70 -25 5 18 36 63 72 57 41 48 99 167 193 171 115 47 -22 -107 -203 -277 -298 -278 -225 -150 -102 -98 -127 -196 -272 -333 -375 -380 -367 -369
9328 -369 -370 -339 -293 -241 -156 -46 25 23 -9 -33 -47 -34 -14 -4 -6 -32 -72 -82 -25 27 7 -45 -73 -50 23 114 169 189 205 198 155 107 79 29 -30 -82
9320 -82 -154 -230 -273 -261 -218 -201 -230 -254 -220 -164 -101 -32 -12 -64 -100 -68 -6 27 9 -48 -81 -85 -119 -172 -198 -173 -137 -109 -90 -84 -79 -65 -57 -52 -12 73 170 220
9311 220 198 163 126 61 13 32 75 110 127 109 49 -38 -108 -138 -145 -126 -75 -15 15 23 45 90 122 126 96 51 29 37 82 152 201 204 168 119 76 46 15
9302 15 -57 -165 -231 -230 -217 -198 -144 -62 -9 2 30 78 130 175 220 235 201 164 165 178 177 184 187 197 243 291 283 202 90 -7 -57 -54 -24 1 -25 -73 -129 -200
9294 -200 -263 -277 -215 -136 -111 -126 -130 -97 -66 -37 -4 3 18 76 134 153 152 160 176 162 85 -11 -84 -106 -82 -47 -42 -62 -44 38 120 147 145 135 111 80 44 50
9285 50 90 111 100 74 75 101 95 46 -4 -6 20 41 60 74 58 10 -16 -7 -16 -54 -113 -188 -222 -182 -132 -104 -47 48 107 119 114 68 -7 -69 -93 -69 -44 -41 -62
9276 -62 -76 -58 -42 -25 2 20 9 -30 -69 -119 -181 -226 -241 -180 -78 -25 1 29 10 -54 -87 -81 -72 -70 -65 -84 -150 -224 -254 -244 -191 -97 -11 47 84 104 111
9268 111 119 163 220 242 256 277 292 305 291 239 177 113 55 -9 -78 -120 -94 -35 -19 -52 -66 -27 39 82 106 115 73 11 -5 -1 12 68 106 103 125 156 163
9259 163 144 101 52 18 5 27 78 124 145 155 167 168 147 117 68 0 -69 -129 -164 -184 -211 -235 -250 -290 -330 -333 -301 -270 -251 -191 -102 -65 -103 -127 -100 -67
9251 -67 -56 -83 -122 -130 -102 -85 -82 -66 -43 5 88 173 216 211 189 167 124 68 50 62 94 138 169 194 205 190 164 131 68 2 -25 1 31 33 27 12 1 2
9242 2 4 3 1 23 51 40 37 78 87 39 -24 -47 -18 15 50 98 132 138 112 38 -39 -58 -47 -62 -64 -48 -72 -140 -188 -188 -153 -115 -103 -88 -67 -54 -50 -29 16 42
9233 42 30 20 47 64 39 27 37 17 -27 -72 -115 -167 -235 -306 -340 -298 -178 -30 31 -29 -145 -220 -220 -162 -87 -42 -24 -15 -16 -48 -112 -167 -195 -204 -197 -176
9225 -176 -158 -145 -144 -126 -99 -68 -29 -14 -3 36 75 94 72 15 -33 -75 -102 -94 -65 -33 3 38 39 12 -3 1 30 56 38 4 -13 -23 -12 21 61 96 99
9216 99 42 -8 -12 -14 -22 -12 -6 -11 -2 7 4 -16 -55 -94 -114 -118 -130 -164 -219 -287 -324 -308 -247 -151 -66 -24 -35 -72 -101 -142 -193 -213 -178 -108 -57 -40 -47 -73 -94 -85 -71
9207 -71 -81 -126 -170 -163 -114 -84 -73 -69 -71 -79 -100 -130 -163 -214 -281 -330 -340 -318 -297 -245 -158 -73 -15 -12 -60 -98 -84 -64 -92 -147 -192 -205 -180 -151 -128 -89 -41 -39
9198 -39 -81 -117 -131 -155 -159 -106 -42 -21 -25 -27 -36 -86 -186 -286 -349 -349 -291 -227 -158 -118 -134 -155 -146 -113 -62 17 80 73 26 3 1 9 19 -7 -41 -24 7 5 1 1
9189 1 -6 -21 -36 -51 -52 -17 25 47 49 45 18 -38 -113 -182 -226 -222 -187 -134 -58 18 68 72 45 3 -27 -19 7 53 95 92 72 38 6 -7 -8 -12 -43 -105 -177 -193 -181
9179 -181 -178 -149 -103 -82 -82 -79 -64 -24 36 91 88 17 -73 -122 -120 -114 -118 -118 -110 -105 -65 -9 29 47 67 95 93 65 8 -64 -96 -59 19 59 25 -26 -69 -101 -95 -57 -30
9170 -30 -5 8 -23 -65 -102 -118 -108 -71 0 52 71 88 138 199 235 244 221 140 47 -10 -31 -41 -37 -26 -31 -41 -52 -63 -88 -105 -87 -32 16 8 -11 -17 -55 -129
9161 -129 -183 -163 -101 -55 -40 -87 -161 -197 -170 -105 -35 13 15 3 4 -8 -32 -52 -59 -25 13 45 86 107 124 108 30 -73 -145 -157 -127 -90 -75 -88 -124 -135
9153 -135 -100 -58 -40 -59 -101 -109 -56 10 35 12 -8 -19 -59 -103 -105 -64 -19 10 25 3 -48 -79 -90 -71 -18 0 -49 -127 -189 -233 -266 -266 -219 -133 -63 -42
9145 -42 -46 -36 0 52 61 10 -36 -62 -64 -24 17 20 19 64 138 188 197 203 212 179 84 -25 -95 -98 -71 -86 -136 -163 -155 -151 -166 -199 -219 -172 -105 -75 -52 -4 17 -34
9135 -34 -101 -134 -149 -153 -127 -98 -72 -30 15 56 96 129 127 90 72 74 57 18 -32 -75 -107 -129 -133 -136 -145 -148 -164 -190 -211 -228 -228 -189 -131 -78 -53 -76 -138 -250 -362
9126 -362 -388 -328 -246 -199 -229 -298 -328 -309 -277 -276 -283 -233 -139 -64 -39 -81 -145 -165 -147 -105 -45 14 41 52 63 54 0 -81 -145 -178 -201 -197 -187 -224 -306 -379 -437
9118 -437 -456 -408 -332 -251 -172 -97 -44 -53 -120 -196 -229 -205 -150 -108 -97 -103 -114 -133 -146 -131 -85 -35 3 -5 -54 -108 -129 -118 -124 -140 -147 -155 -140 -105 -89 -76 -76 -109
9109 -109 -164 -205 -228 -252 -279 -308 -337 -323 -257 -182 -129 -111 -107 -107 -116 -124 -122 -100 -62 -66 -124 -217 -297 -312 -297 -274 -240 -206 -156 -78 -2 61 89 66 34 0 -37 -69
9100 -69 -103 -129 -143 -138 -127 -107 -99 -84 -26 44 59 19 7 19 -11 -60 -64 -49 -82 -160 -214 -209 -182 -162 -144 -116 -65 -48 -77 -76 -20 48 98 108 71 23 5 2
9092 2 -8 -25 -52 -75 -85 -87 -106 -128 -127 -125 -106 -45 4 2 -32 -70 -97 -107 -97 -96 -128 -130 -66 22 91 139 168 169 144 88 30 6 -7 -21 -19 -10 -4 1 14 39 53
9082 53 65 80 74 28 -3 22 68 96 96 89 90 72 35 3 -21 -14 3 -16 -66 -104 -96 -77 -90 -127 -145 -139 -158 -212 -254 -256 -227 -180 -132 -115 -119 -97 -52 -8 47 84
9073 84 77 48 22 -14 -82 -138 -174 -215 -249 -256 -236 -209 -187 -148 -104 -73 -72 -126 -203 -256 -298 -303 -225 -117 -51 -39 -60 -87 -122 -166 -207 -222 -204 -193 -202 -198 -174 -143
9064 -143 -99 -66 -43 -25 -30 -85 -174 -245 -260 -225 -188 -188 -179 -125 -73 -94 -155 -178 -177 -174 -167 -130 -57 8 28 16 29 46 41 7 -45 -55 -17 27 32 8 -25 -44 -46
9055 -46 -61 -79 -68 -50 -41 -32 -31 -41 -21 17 15 -33 -95 -148 -165 -151 -126 -106 -94 -73 -68 -113 -183 -224 -254 -294 -317 -271 -210 -171 -138 -128 -101 -32 34 67 93 116
9047 116 122 142 177 196 185 170 160 133 89 69 87 113 118 108 99 86 81 77 49 -5 -90 -182 -234 -261 -280 -286 -300 -301 -257 -190 -119 -86 -101 -148 -207 -255 -267 -213
9038 -213 -110 -38 -21 -41 -79 -98 -90 -67 -77 -109 -129 -133 -112 -60 -27 -18 -1 -23 -98 -172 -200 -189 -157 -125 -90 -63 -88 -135 -154 -166 -170 -116 -47 -31 -23 4 35
9029 35 60 75 95 111 97 89 122 146 107 22 -42 -69 -99 -134 -165 -186 -191 -201 -233 -257 -230 -187 -188 -220 -237 -243 -247 -249 -239 -199 -188 -222 -253 -263 -263 -269 -302 -363 -426
9020 -426 -478 -495 -449 -372 -290 -202 -154 -162 -180 -195 -193 -144 -57 33 93 133 162 185 213 219 192 168 149 113 64 19 -16 -43 -63 -50 -8 40 104 198 284 320
9012 320 314 283 227 167 108 47 10 -20 -62 -107 -151 -201 -252 -245 -200 -152 -99 -23 32 21 -21 -57 -74 -87 -109 -130 -127 -77 4 68 95 75 28 -35 -101 -148
9004 -148 -170 -148 -120 -125 -143 -146 -122 -76 -77 -138 -188 -207 -167 -75 -7 11 12 26 51 54 30 6 -13 -71 -138 -160 -170 -179 -168 -135 -128 -149 -179 -205 -216 -194 -140 -94
8995 -94 -68 -49 -21 -6 -26 -76 -118 -110 -72 -33 -14 -21 -16 27 75 67 22 -40 -115 -138 -70 40 125 157 154 116 58 7 -18 -34 -74 -124 -163 -156 -98 -59 -69 -97
8986 -97 -105 -79 -36 -21 -48 -105 -165 -220 -235 -204 -162 -156 -154 -143 -163 -179 -170 -142 -84 8 85 89 43 11 2 -14 -51 -103 -158 -215 -223 -163 -93 -50 -24 -39 -74 -84 -104
8977 -104 -138 -155 -191 -248 -285 -267 -197 -126 -85 -92 -169 -252 -295 -311 -300 -268 -272 -327 -384 -404 -361 -315 -305 -303 -250 -171 -127 -135 -190 -252 -249 -190 -134 -151 -195 -236 -293
8969 -293 -345 -360 -347 -314 -255 -212 -171 -95 8 78 80 77 107 132 117 69 21 15 44 98 157 167 154 164 172 163 148 149 152 157 158 122 104 124 127 107 69 8 -79
8960 -79 -162 -217 -246 -239 -212 -210 -226 -241 -237 -214 -231 -246 -202 -156 -135 -120 -83 -26 14 13 -11 -41 -91 -148 -191 -218 -197 -154 -133 -115 -96 -88 -72 -43 -9 28 56 56
8951 56 34 38 80 155 237 299 306 254 182 122 65 40 61 112 161 178 136 31 -75 -149 -179 -156 -137 -149 -163 -137 -69 -1 45 42 3 -50 -128 -195 -235 -304
8943 -304 -393 -447 -466 -455 -419 -350 -269 -211 -155 -91 -64 -90 -148 -190 -204 -187 -164 -163 -190 -210 -210 -186 -152 -132 -109 -81 -55 -16 25 48 51 37 11 -29 -80 -131
8935 -131 -153 -119 -57 -1 39 73 90 83 77 75 87 104 105 91 70 37 -13 -61 -73 -62 -53 -24 38 86 96 106 129 142 120 68 10 -60 -117 -151 -162 -139 -119
8926 -119 -145 -193 -229 -231 -209 -189 -167 -127 -77 -53 -31 10 24 -11 -52 -77 -73 -56 -39 -13 0 -29 -81 -120 -134 -112 -59 7 67 107 111 101 113 141 147 146 184
8918 184 235 263 263 245 227 224 218 169 86 52 61 58 22 -20 -12 45 98 139 146 128 99 56 14 -17 -11 20 60 98 106 84 31 -27 -45 -38 -42 -29 -11 -28 -65 -110
8909 -110 -144 -144 -107 -48 0 26 26 4 -32 -62 -75 -98 -118 -129 -135 -133 -128 -120 -106 -107 -145 -168 -155 -111 -45 32 76 38 -38 -97 -140 -152 -120 -78 -27 42 79 50
8900 50 -25 -109 -159 -158 -114 -73 -46 -20 -17 -55 -119 -185 -215 -223 -228 -197 -133 -89 -80 -89 -99 -98 -92 -80 -55 -31 -38 -55 -53 -49 -44 -28 -4 20 51 72 84 86 48 -36 -120 -155
8890 -155 -154 -155 -160 -162 -150 -125 -79 5 77 95 55 -58 -196 -291 -311 -250 -167 -118 -114 -130 -135 -123 -117 -149 -195 -214 -201 -169 -125 -78 -39 -38 -35 -17 -3 5 20 67 125
8881 125 151 126 83 74 93 128 173 214 207 140 72 23 -2 -15 -20 -19 -35 -86 -140 -201 -264 -307 -334 -328 -290 -253 -243 -265 -284 -274 -219 -147 -109 -108 -103 -78 -80 -114 -168
8872 -168 -220 -245 -250 -249 -238 -188 -142 -115 -87 -97 -123 -124 -124 -137 -152 -137 -71 11 105 221 318 380 391 350 293 235 197 203 201 135 34 -58 -146 -215 -246 -260 -252
8864 -252 -198 -100 -14 22 28 18 -8 -34 -56 -76 -92 -71 0 73 112 118 139 186 193 165 121 45 -35 -73 -94 -123 -127 -102 -66 -21 27 81 163 246 264 211 132
8855 132 50 -13 -19 12 60 125 182 199 174 108 44 14 9 -7 -26 -21 -6 -6 -4 24 86 175 246 275 264 238 189 115 48 12 27 51 19 -34 -58 -67 -42 1
8847 1 -4 0 -10 -67 -93 -56 2 43 55 45 24 30 61 74 57 27 8 -4 -23 -35 -13 33 48 25 -8 -33 -30 -27 -34 -29 -43 -66 -68 -63 -88 -128 -136 -106 -64 -24 16
8837 16 49 66 62 19 -55 -130 -174 -151 -109 -105 -121 -114 -45 50 90 57 11 -19 -13 11 32 18 -48 -88 -49 31 87 100 87 54 15 9 34 42 11 -16 -10 26 51
8828 51 62 87 108 113 95 87 123 166 152 112 100 90 62 7 -49 -71 -73 -44 17 81 133 142 92 43 5 -67 -177 -254 -234 -138 -34 20 17 -32 -102 -149 -167
8820 -167 -164 -152 -127 -78 -38 -33 -64 -79 -72 -84 -105 -114 -112 -118 -129 -124 -97 -91 -118 -133 -128 -129 -145 -168 -156 -136 -143 -168 -200 -225 -211 -167 -115 -49 -6 -22 -39 -8 25 30 14
8810 14 -20 -56 -60 -26 18 26 5 -8 -2 35 99 147 133 58 -32 -100 -140 -159 -150 -158 -198 -225 -214 -179 -145 -106 -41 37 79 69 33 -12 -30 7 62 78 23 -62
8801 -62 -110 -123 -138 -151 -127 -74 -22 11 37 52 33 1 -15 5 33 28 12 10 -28 -104 -125 -78 -9 25 -16 -92 -169 -236 -266 -262 -244 -207 -176 -152 -115 -86 -64
8793 -64 -45 -32 -35 -62 -95 -85 -17 34 33 43 92 116 122 147 161 118 40 -14 -24 -13 -34 -79 -71 -15 28 71 121 129 102 52 -15 -74 -111 -115 -93 -82 -93 -97 -76
8784 -76 -79 -100 -106 -106 -124 -137 -152 -168 -161 -143 -153 -179 -186 -172 -145 -105 -50 -21 -49 -73 -50 -20 -36 -87 -121 -141 -193 -242 -228 -181 -117 -16 83 111 96 80 46
8775 46 6 0 65 155 193 163 97 20 3 65 134 185 215 196 125 53 37 76 101 70 9 -41 -53 -32 21 72 65 56 62 28 -32 -74 -66 16 98 115 80 21
8767 21 -14 -20 -12 -31 -99 -166 -187 -164 -111 -66 -43 -55 -112 -184 -239 -224 -140 -69 -61 -110 -153 -129 -53 26 54 27 -18 -69 -112 -135 -134 -97 -61 -69 -99 -110 -110 -112 -104
8758 -104 -92 -57 -5 5 -3 13 40 67 92 115 116 86 59 50 16 -55 -86 -78 -79 -94 -129 -177 -243 -290 -271 -216 -162 -113 -96 -138 -205 -237 -214 -167 -137 -133 -143 -149
8749 -149 -158 -184 -236 -277 -248 -161 -86 -84 -123 -145 -140 -149 -193 -243 -272 -303 -348 -400 -409 -357 -304 -273 -237 -198 -173 -140 -102 -93 -97 -70 -26 -20 -63 -129 -188 -218 -193 -138 -88
8740 -88 -57 -47 -54 -90 -134 -142 -122 -103 -84 -51 -27 -38 -90 -138 -150 -139 -110 -87 -96 -105 -87 -52 -13 16 18 0 -33 -81 -98 -84 -100 -157 -210 -225 -180 -100 -42 -20
8731 -20 13 75 107 90 45 -20 -47 -17 28 50 22 -16 -24 -32 -49 -87 -142 -172 -134 -57 1 16 -25 -117 -170 -131 -52 -5 3 -35 -75 -90 -97 -123 -141 -115 -87
8723 -87 -97 -139 -152 -99 -14 50 68 59 15 -51 -74 -56 -26 -22 -86 -173 -200 -163 -79 4 54 66 84 112 108 102 131 191 272 352 422 496 579 651 707 763 827
8714 827 936 1084 1248 1444 1701 2074 2564 3158 3904 4963 6557 8948 12103 14472 13640 10589 7687 5604 4224 3321
8710 3321 2710 2210 1762 1354 1039 806 642 539 507 516 537 560 566 555 546 504 444 398 349 300 274 260 246 233 205 165 155 160 149 120 79 20
8702 20 -37 -36 46 132 146 102 36 -9 -5 20 26 -22 -110 -182 -180 -120 -83 -93 -90 -58 -53 -94 -140 -177 -184 -129 -43 13 31 -2 -51 -52 -40 -38 -7 61 143 206 246 304
8693 304 360 379 359 314 291 289 272 212 125 68 73 127 183 180 149 145 155 141 121 118 105 88 82 97 149 201 221 208 170 111 51 -7 -37 -21 -22 -86 -156 -159 -86
8684 -86 40 143 172 166 152 145 146 152 133 101 90 94 104 155 236 255 198 150 150 150 131 104 69 43 29 -1 -37 -55 -41 17 86 109 100 66 17 2 33 52
8676 52 40 -1 -70 -131 -149 -130 -86 -21 52 124 159 156 143 145 159 183 202 221 222 185 151 143 149 148 112 49 0 -34 -38 -40 -71 -98 -115 -122 -114 -66 29 124 185 232
8666 232 272 283 260 216 160 113 86 80 80 102 152 194 195 186 210 279 370 418 416 390 366 317 244 194 148 138 164 198 255 345 437 525 616 665 666 689 752 784
8658 784 812 867 957 1081 1212 1365 1573 1828 2096 2418 2843 3401 4145 5180 6757 9122 12073 13652 11981 8924 6479 4828
8653 4828 3740 3004 2511 2141 1830 1555 1315 1143 1052 999 948 873 822 826 832 792 730 707 737 795 857 893 928 955 950 928 932 928 911 937 1058 1236
8645 1236 1389 1498 1605 1769 2071 2563 3222 4029 5111 6712 9155 12394 14942 14309 11277 8267 5984 4377 3286 2575
8641 2575 2080 1749 1505 1282 1082 920 801 707 580 437 319 238 200 231 288 302 280 290 319 326 274 164 59 -29 -100 -128 -123 -118 -106 -86
8634 -86 -64 -48 -66 -97 -95 -69 -57 -96 -182 -247 -268 -260 -255 -236 -181 -128 -87 -35 12 44 60 25 -16 7 47 65 37 -34 -76 -27 52 56 -18 -116 -188 -202 -174
8625 -174 -131 -108 -127 -181 -221 -216 -201 -164 -81 -14 17 16 -9 -14 6 29 10 -45 -73 -40 20 71 101 103 83 60 72 101 88 36 -16 -63 -110 -146 -130 -96 -117
8617 -117 -154 -159 -151 -155 -144 -104 -51 10 73 110 83 -1 -97 -159 -131 -46 -19 -42 -41 -11 32 91 155 228 293 293 209 104 39 28 63 92 113 153 169 137 60
8608 60 -27 -78 -95 -108 -152 -213 -243 -212 -126 -52 -10 4 -8 -32 -47 -60 -64 -45 0 52 62 46 18 0 18 44 34 -36 -124 -184 -198 -157 -72 -3 30 43
8600 43 14 -23 -30 -22 -16 -4 39 116 223 302 319 328 315 265 229 234 209 109 3 -33 6 35 17 0 -21 -73 -91 -38 23 31 -18 -74 -103 -115 -131 -124 -82
8591 -82 -54 -79 -110 -125 -160 -174 -133 -85 -59 -48 -46 -56 -57 -37 -21 -16 -16 -3 -3 8 42 75 87 58 13 11 54 95 114 104 71 29 -21 -57 -56 -40 -29 -36 -46
8582 -46 -38 0 56 125 179 187 185 198 212 236 267 273 244 214 207 211 192 151 133 165 191 186 146 66 -11 -50 -78 -127 -186 -195 -141 -92 -38 45 134 181 172 154 166 196
8573 196 211 214 208 180 147 117 85 41 -6 -45 -69 -71 -80 -129 -192 -218 -207 -178 -166 -199 -256 -280 -259 -204 -115 -26 6 -16 -30 -14 29 48 25 -20 -72 -101 -94
8565 -94 -98 -133 -158 -187 -194 -151 -87 -46 -67 -153 -244 -269 -207 -105 -16 24 19 -28 -124 -204 -202 -137 -64 -9 22 24 11 2 -7 -13 -7 13 16 13 31 57 89 98 55 -24 -84
8555 -84 -76 -7 56 34 -51 -142 -206 -227 -201 -166 -138 -99 -51 -17 13 36 26 12 30 68 96 103 93 85 91 88 55 -1 -45 -50 -11 24 7 -21 -50 -92 -125 -134 -155
8546 -155 -162 -113 -44 14 51 66 85 132 174 166 126 110 123 143 134 98 59 24 27 60 89 72 44 76 115 83 0 -41 -30 -38 -90 -163 -191 -143 -102 -120 -141
8538 -141 -132 -121 -147 -185 -202 -175 -120 -84 -79 -83 -94 -100 -93 -71 -66 -98 -122 -84 -22 2 -28 -111 -196 -228 -200 -130 -53 13 61 59 21 -1 4 13 -26 -92 -125 -105 -51
8529 -51 26 85 110 134 163 175 145 65 -40 -127 -161 -147 -99 -39 -20 -47 -78 -95 -88 -80 -101 -145 -190 -233 -225 -184 -158 -121 -93 -103 -112 -93 -87 -101 -86 -54 -19
8520 -19 24 21 -21 -66 -86 -65 -12 61 137 198 234 230 191 164 154 134 87 30 23 50 67 75 72 47 16 29 57 38 -25 -85 -113 -118 -140 -188 -220 -226 -197 -163 -122
8511 -122 -54 -1 -9 -62 -109 -162 -226 -278 -291 -266 -265 -280 -286 -275 -216 -140 -96 -91 -114 -129 -117 -119 -137 -130 -90 -30 37 89 103 72 0 -72 -114 -144 -158 -149 -121 -115 -147
8502 -147 -161 -127 -70 -17 46 114 149 112 47 24 19 -6 -69 -124 -125 -92 -84 -120 -159 -143 -71 16 103 159 174 178 158 91 56 50 19 6 46 95 106 70 21
8494 21 -12 -55 -131 -180 -135 -38 43 90 93 47 -19 -88 -152 -186 -187 -181 -174 -151 -117 -85 -54 -32 5 44 57 42 9 -29 -47 -10 45 48 16 13 51 69 12 -78
8485 -78 -142 -182 -226 -279 -305 -305 -290 -252 -219 -198 -169 -123 -76 -56 -52 -78 -133 -166 -154 -134 -144 -186 -228 -267 -297 -303 -286 -242 -197 -176 -169 -188 -210 -205 -196 -221 -257 -264 -236
8476 -236 -181 -123 -83 -65 -97 -171 -230 -256 -250 -239 -240 -232 -165 -41 54 95 98 35 -53 -66 0 57 76 84 88 106 135 144 128 111 109 100 80 50 28 52 81 99 132
8467 132 168 189 201 200 164 112 50 -33 -94 -118 -147 -162 -148 -110 -57 15 72 50 -53 -168 -232 -251 -243 -216 -167 -95 -52 -43 -35 -43 -49 -23 25 49 44 58 109
8459 109 147 169 212 275 348 364 332 317 336 384 449 468 397 305 246 209 179 148 135 150 155 123 75 12 -74 -118 -106 -99 -128 -147 -109 -53 -31 -63 -135 -195
8451 -195 -241 -264 -273 -308 -351 -341 -263 -185 -161 -191 -212 -200 -175 -150 -127 -93 -51 -31 -32 -34 -36 -77 -163 -231 -224 -145 -74 -52 -50 -51 -50 -42 -28 -28 -38 -47 -42 -45 -44 -17 30 102
8441 102 196 285 316 297 257 206 119 17 -49 -74 -78 -69 -47 -11 9 12 32 65 117 183 212 173 93 -5 -79 -111 -124 -131 -134 -135 -154 -215 -299 -372 -409 -405 -338 -250
8432 -250 -170 -124 -100 -72 -26 33 81 107 123 135 109 46 0 1 7 -22 -37 -12 24 14 -22 -39 -47 -27 14 37 26 14 11 -19 -88 -175 -246 -262 -220 -180 -170
8424 -170 -152 -134 -126 -102 -74 -37 3 46 86 108 125 137 151 164 139 86 68 111 165 161 101 43 40 50 51 51 35 20 21 45 72 88 100 97 75 30 -32 -103
8415 -103 -166 -184 -157 -129 -122 -126 -118 -116 -128 -135 -137 -174 -277 -366 -370 -313 -222 -125 -57 -20 -12 -7 42 127 194 190 131 62 13 -21 -38 -1 24 -3 -35 -43 -58 -88 -119 -128
8406 -128 -102 -67 -58 -86 -117 -144 -172 -206 -221 -180 -94 -14 -27 -114 -195 -220 -180 -136 -140 -171 -182 -171 -133 -92 -67 -47 -40 -37 -8 41 61 21 -42 -85 -119 -141 -119
8397 -119 -55 29 58 24 -1 -7 -2 7 18 27 -15 -101 -159 -154 -121 -108 -120 -131 -150 -206 -253 -255 -229 -206 -185 -159 -120 -46 46 79 74 101 161 219 280 316 276 191
8389 191 117 80 86 129 174 188 174 161 155 120 35 -43 -94 -125 -129 -133 -139 -119 -68 10 62 35 -44 -107 -126 -124 -127 -148 -183 -214 -218 -217 -233 -248 -253 -250 -221 -154 -80 -41
8379 -41 -33 -36 -40 -46 -95 -144 -153 -146 -122 -91 -69 -42 6 59 120 174 190 156 84 29 24 30 23 2 -7 29 83 108 85 17 -52 -70 -50 -37 -22 24 71 98 131 167
8370 167 164 97 6 -63 -127 -186 -214 -184 -104 -27 20 41 31 4 9 24 -6 -69 -111 -124 -132 -135 -136 -136 -113 -93 -89 -79 -43 8 15 -30 -63 -78 -96 -121 -121 -104 -100 -91
8361 -91 -58 -14 37 58 36 18 24 56 92 67 -26 -89 -67 -22 6 33 60 56 28 31 77 85 53 49 68 89 104 98 96 124 143 137 119 110 121 143 142 126 131 118 75
8352 75 38 9 -19 -61 -102 -119 -96 -24 27 22 19 30 45 56 52 41 40 65 54 -35 -137 -197 -193 -153 -110 -77 -80 -109 -108 -72 -22 30 72 90 106 125 123 126 154
8343 154 188 219 236 263 307 340 375 393 386 344 269 189 133 97 90 91 77 53 46 61 54 36 29 50 77 81 62 28 7 10 27 62 107 136 138 126 105 72 43
8334 43 13 -38 -86 -93 -75 -67 -62 -41 -22 -30 -72 -111 -121 -134 -128 -123 -171 -207 -137 15 160 224 204 161 148 148 137 139 155 163 156 133 109 88 81 76 65 53 18 -26
8324 -26 -28 -14 -44 -114 -171 -193 -170 -131 -100 -82 -106 -214 -326 -349 -318 -290 -263 -204 -106 -26 3 16 58 101 91 46 26 31 8 -31 -55 -72 -103 -138 -168
8316 -168 -182 -179 -169 -188 -230 -232 -206 -161 -101 -79 -98 -115 -110 -90 -54 -39 -53 -65 -80 -99 -120 -167 -230 -236 -172 -103 -51 3 48 53 13 -55 -97 -81 -38 -21 -37
8308 -37 -35 -10 4 25 59 71 77 104 144 149 110 65 29 8 6 23 60 79 58 12 -27 -51 -46 -28 0 48 82 98 120 118 73 -5 -67 -97 -108 -118 -126 -103 -85
8299 -85 -116 -180 -225 -238 -233 -190 -100 -13 16 -24 -101 -161 -188 -223 -273 -294 -276 -251 -254 -296 -296 -212 -120 -57 -42 -63 -74 -54 -15 7 -23 -87 -127 -102 -54 -45 -73
8290 -73 -74 -41 14 82 116 114 126 172 215 229 210 146 34 -90 -175 -210 -214 -192 -138 -89 -79 -106 -145 -176 -203 -216 -210 -208 -217 -225 -202 -159 -104 -44 -16 -9 8 20
8282 20 23 18 16 32 68 116 153 168 178 193 215 250 299 342 335 283 225 187 148 86 33 18 25 45 46 8 -30 -40 -43 -28 -21 -65 -121 -138 -103 -32 39 81 93
8273 93 82 61 42 -6 -53 -72 -87 -75 -64 -115 -185 -263 -323 -316 -269 -228 -188 -148 -133 -101 -23 73 152 183 179 164 121 55 -10 -68 -99 -74 -10 51 66 63 72
8264 72 66 62 40 -33 -89 -87 -58 -24 12 35 46 73 94 106 136 159 168 169 169 206 252 266 254 236 218 184 170 171 165 172 185 186 138 54 31 60 97 133 166 201
8255 201 223 222 229 272 323 372 394 368 330 283 250 266 294 305 290 247 224 226 248 299 313 259 193 142 106 80 67 73 74 74 101 145 183 176 130 86 79 96 107
8246 107 105 80 77 95 83 61 54 77 120 133 137 183 193 108 -3 -74 -103 -105 -73 -14 48 113 175 210 220 210 175 158 188 251 284 311 383 440 435 400 360
8238 360 319 300 330 385 452 546 654 742 811 896 963 981 1009 1074 1184 1369 1589 1778 1959 2171 2378 2558 2761 3020 3319 3673 4114 4657
8231 4657 5306 6073 7007 8190 9687 11582 13870 16324 18424 19422 18935 17370 15535 14066 13203 12996 13451 14599 16416
8227 16416 18720 20900 21806 20686 18127 15296 12851 10948 9600 8769 8355 8238 8368 8795 9569 10736 12339 14400 16683
8222 16683 18444 18713 17239 14759 12177 9934 8129 6752 5697 4826 4116 3599 3209 2865 2559 2308 2100 1901 1711 1545
8218 1545 1396 1266 1158 1048 911 776 688 661 666 688 685 630 607 651 703 684 571 450 414 435 443 441 446 469 491 502 481 413 325 266 251 277 294
8210 294 271 237 214 210 248 313 369 387 361 298 218 159 144 169 193 199 220 254 250 206 213 269 280 248 221 186 141 117 97 86 99 112 132 177 232 259 239
8202 239 197 174 155 127 124 140 123 77 42 39 73 138 197 210 212 231 245 229 200 199 184 134 95 74 58 48 63 122 192 215 178 104 34 22 84 153 199
8193 199 246 291 302 278 262 237 147 8 -96 -121 -107 -95 -105 -135 -152 -114 -46 13 62 107 143 135 78 55 98 127 124 115 118 111 67 5 -51 -64 -32 -8
8185 -8 16 78 134 130 111 87 75 96 106 60 8 -13 -24 -22 -15 -2 4 -29 -70 -95 -121 -140 -120 -41 72 147 192 241 308 350 352 325 262 171 67 15 39
8176 39 89 125 137 148 141 121 138 153 126 67 12 -33 -71 -74 -24 46 81 79 49 19 -13 -54 -74 -65 -40 3 79 151 187 181 123 46 -11 -48 -92 -129 -136 -111
8168 -111 -70 -42 -41 -38 -51 -98 -143 -171 -190 -214 -248 -277 -294 -298 -312 -305 -260 -219 -197 -175 -130 -94 -48 63 210 320 384 402 354 286 227 168 109 27 -40
8160 -40 -62 -50 -30 -38 -50 -16 76 143 135 104 64 13 -13 6 36 22 -32 -69 -50 -10 -4 -25 -45 -28 13 43 58 51 25 -23 -61 -43 16 64 68 24 2 35
8151 35 65 81 111 108 70 61 83 109 112 95 90 86 70 49 28 8 27 77 112 122 125 129 113 87 85 135 204 262 314 311 251 200 211 247 247 227 221 199 154 136 139
8141 139 131 92 46 21 34 86 141 175 172 127 80 70 87 76 27 -20 -39 -36 -30 -35 -34 -27 -28 -46 -83 -68 16 110 167 142 59 -7 -49 -89 -105 -84 -42 19 73
8133 73 100 140 164 152 159 223 299 329 325 294 264 264 269 283 343 439 517 549 568 612 724 884 1041 1169 1239 1312 1466 1654 1825 1980 2119 2280
8125 2280 2540 2934 3453 4108 4938 5971 7221 8776 10800 13313 15947 17777 17763 15878 13157 10545 8373 6655 5348
8121 5348 4391 3689 3142 2680 2320 2033 1751 1503 1336 1247 1213 1186 1142 1103 1061 995 907 815 751 684 578 461 362 296 255 222 195 182 179
8114 179 160 141 155 207 251 249 222 202 191 159 97 39 51 123 189 212 216 224 233 255 257 238 188 115 18 -98 -155 -121 -47 1 5 5 14 21 26 26 10 -4 -2 17
8105 17 50 77 91 99 100 94 112 161 201 221 216 199 184 170 163 168 181 198 169 113 97 101 96 103 102 72 54 62 101 144 158 145 102 40 -3 -29 -36 -38 -83 -165 -227 -245
8095 -245 -228 -190 -157 -115 -48 -6 -16 -41 -60 -85 -91 -65 -46 -25 38 113 158 144 103 116 174 228 253 260 288 328 353 342 300 247 196 132 45 -12 -2 50
8087 50 104 136 142 111 70 82 142 177 153 108 107 129 107 83 100 101 75 43 -7 -40 -11 17 7 -3 -9 -8 -34 -87 -102 -63 -4 53 84 79 60 53 73 96 83
8078 83 57 38 26 56 121 196 249 264 292 340 339 289 255 284 356 379 328 242 149 85 108 183 239 248 232 209 185 147 72 -4 -69 -118 -136 -139 -153 -173 -187
8070 -187 -175 -150 -109 -48 3 40 79 136 192 236 243 189 130 120 164 251 348 383 372 363 358 384 420 435 454 454 419 374 350 347 361 377 375 344 312 331 370 391
8061 391 387 368 349 335 331 341 377 415 431 456 491 536 571 579 585 618 634 628 618 573 511 456 461 553 714 876 974 1035 1108 1219 1342 1465 1587 1700
8053 1700 1834 2021 2229 2413 2601 2809 3065 3423 3912 4533 5335 6347 7634 9314 11447 14016 16721 18738 19062 17504
8048 17504 14966 12482 10517 9074 8039 7362 6975 6817 6864 7154 7775 8783 10199 12082 14460 17013 18795 18727 16711
8044 16711 13787 10977 8710 7000 5691 4684 3940 3385 2954 2593 2253 1957 1754 1604 1435 1235 1033 857 728 646 609
8039 609 602 575 519 455 408 361 318 321 365 388 337 234 153 141 167 220 305 358 368 365 326 249 177 116 73 90 166 274 359 375 362 355 352 349 345 332 299
8031 299 240 176 151 157 142 106 80 67 50 26 -5 -3 57 117 141 174 230 300 376 411 395 364 323 292 275 254 254 237 185 164 179 184 163 135 134 172 232
8022 232 247 204 132 76 19 -73 -156 -187 -158 -96 -18 69 114 116 122 136 156 165 150 106 55 42 83 140 189 199 169 128 116 137 151 127 82 31 -18 -20 1
8014 1 0 -21 -30 -13 -1 -2 18 74 120 111 103 126 146 148 127 97 70 72 109 126 103 90 113 135 141 159 195 208 175 110 58 68 129 161 150 116 100 146 213 271
8005 271 322 332 275 192 121 64 37 45 57 56 75 130 187 211 206 189 154 116 109 121 132 107 88 100 111 116 103 102 144 200 244 279 301 280 221 163 117 109
7996 109 147 180 159 112 114 155 181 171 180 229 289 344 395 435 486 554 607 664 758 887 998 1043 1070 1153 1313 1497 1661 1828 2019 2244 2509
7989 2509 2805 3158 3630 4249 5055 6055 7282 8807 10692 12849 14912 16202 16070 14528 12284 10048 8155 6662 5499
7984 5499 4576 3852 3290 2823 2412 2078 1844 1671 1508 1360 1215 1078 959 841 738 656 556 460 405 405 456 519 560 544 475 380 278
7978 278 207 216 289 363 379 328 218 116 77 63 65 83 99 122 141 152 182 229 265 288 311 348 389 418 413 375 329 275 213 172 174 218 280 334 340 300
7970 300 231 161 149 187 256 350 398 376 335 302 281 238 181 162 158 121 48 -49 -151 -195 -187 -168 -125 -84 -67 -79 -108 -128 -148 -185 -211 -211 -188 -105 28
7962 28 158 224 186 105 62 78 124 165 181 160 97 36 13 14 21 7 -53 -112 -140 -160 -176 -178 -168 -140 -105 -100 -125 -151 -151 -118 -66 -21 -2 -12 -61 -134 -204
7953 -204 -241 -241 -211 -166 -121 -90 -85 -95 -127 -154 -150 -108 -41 0 20 69 115 107 63 35 39 20 -41 -87 -92 -67 -25 -6 -23 -32 -8 36 78 86 81 95 124 136 134 133
7944 133 132 149 178 201 228 234 192 121 56 -4 -59 -125 -201 -242 -209 -127 -53 1 44 100 149 143 94 46 0 -66 -104 -75 -1 72 122 175 253 337 379 353
7936 353 279 209 190 206 194 126 63 46 48 56 47 28 -13 -76 -138 -178 -167 -116 -60 -3 53 81 95 82 21 -19 5 45 26 -44 -74 -54 -49 -79 -114 -122 -110
7927 -110 -105 -87 -66 -40 -4 -9 -62 -110 -122 -105 -78 -56 -59 -86 -108 -93 -72 -56 -41 -46 -28 -2 -7 -13 -10 -8 -1 18 43 45 16 -16 -24 -24 -32 -44 -55 -28 24 32 3 -15
7918 -15 -33 -74 -101 -107 -111 -80 -30 -17 -43 -53 -67 -121 -176 -189 -129 -67 -62 -74 -82 -108 -138 -137 -101 -43 -14 -24 -33 -51 -123 -227 -310 -315 -234 -191 -228 -262 -245 -177
7909 -177 -124 -114 -116 -95 -79 -77 -71 -73 -91 -104 -101 -96 -102 -115 -115 -97 -66 -48 -37 -18 13 50 60 41 5 -16 1 43 88 88 3 -103 -186 -271 -339 -362 -326 -272 -237
7900 -237 -212 -176 -134 -112 -102 -85 -85 -131 -209 -277 -300 -267 -211 -156 -117 -129 -149 -123 -42 75 144 131 95 77 76 80 85 79 55 0 -96 -190 -218 -185 -139 -105 -66
7891 -66 -41 -78 -142 -195 -226 -229 -217 -176 -88 -2 38 32 -11 -38 -21 27 73 119 178 218 240 257 270 253 198 163 153 124 79 53 62 89 103 99 102 101 61 -11
7883 -11 -76 -87 -48 -16 -8 -21 -45 -63 -75 -87 -107 -128 -143 -129 -83 -15 42 35 -1 17 84 126 127 105 72 41 2 -57 -123 -174 -209 -208 -142 -49 14 34 53
7874 53 104 134 113 90 88 87 93 92 63 27 -14 -85 -163 -246 -349 -413 -401 -321 -213 -144 -145 -180 -171 -125 -106 -126 -126 -81 -14 37 83 130 153 157 162 177 181 171 162 126
7865 126 84 51 16 -10 -9 0 6 5 -12 -43 -78 -111 -133 -165 -163 -116 -103 -142 -193 -210 -221 -256 -293 -306 -308 -330 -342 -305 -234 -155 -95 -34 45 90 44 -49 -82 -49
7856 -49 10 82 141 159 125 85 73 43 -5 -44 -56 -25 51 129 179 193 189 162 133 139 174 213 260 325 400 473 541 602 676 756 827 889 958 1040 1166 1382
7848 1382 1687 2011 2352 2744 3295 4164 5581 7670 10030 10868 9286 6979 5108 3756 2785 2126 1699 1422 1241 1127 1023
7843 1023 884 738 609 502 405 311 253 233 228 222 227 230 214 177 123 44 -22 -41 -52 -83 -137 -175 -139 -86 -80 -104 -133 -146 -147 -148 -147 -135 -110 -72 -15 23
7835 23 6 -42 -85 -124 -109 -63 -43 -31 1 27 13 -11 -26 -45 -64 -75 -86 -94 -101 -123 -186 -287 -356 -344 -276 -205 -129 -61 -39 -51 -110 -210 -293 -339 -322
7827 -322 -242 -157 -123 -137 -163 -153 -72 41 111 122 102 60 16 5 12 19 14 -27 -60 -50 -41 -23 -1 19 42 75 114 156 189 199 189 187 199 214 208 183 143
7818 143 83 16 -20 -19 9 68 125 158 155 121 82 37 -31 -106 -140 -110 -60 -14 27 48 31 -53 -161 -208 -193 -166 -148 -135 -136 -173 -216 -200 -144 -107 -60 10
7810 10 64 69 46 32 36 55 69 43 -4 -27 -38 -62 -72 -38 20 38 -25 -135 -219 -227 -165 -91 -39 3 19 9 0 -9 -2 30 50 29 -4 -30 -44 -48 -56 -85 -120
7801 -120 -145 -145 -128 -105 -99 -103 -112 -131 -155 -183 -203 -213 -220 -215 -174 -113 -64 -12 68 129 138 120 100 81 59 33 12 -10 -9 8 -1 -13 -8 2 -12 -48 -76 -80 -86 -75 -20
7792 -20 40 51 39 21 -2 -21 -51 -91 -138 -179 -169 -90 17 90 87 10 -78 -118 -91 -18 27 15 -25 -57 -86 -122 -148 -136 -103 -78 -61 -76 -124 -169 -177 -148
7783 -148 -109 -72 -36 -11 -28 -57 -74 -92 -84 -61 -26 14 30 5 -6 29 65 70 58 61 76 88 99 100 107 109 75 43 55 89 111 123 120 121 146 198 221 200 167
7774 167 115 59 53 111 159 136 101 94 101 111 114 131 152 127 45 -35 -90 -108 -74 -53 -71 -72 -42 -26 -46 -57 -51 -24 32 68 70 50 9 -43 -58 -17 70 178
7766 178 270 340 391 405 391 363 325 263 204 159 133 143 170 219 277 320 352 348 298 223 140 61 9 -2 12 24 26 45 82 110 118 137 156 138 119 134
7757 134 159 177 205 229 234 241 253 270 289 296 282 256 231 206 166 124 124 182 252 289 305 310 271 183 100 81 91 105 129 152 167 186 222 237 212 177 160
7749 160 152 121 81 52 62 99 121 108 83 54 3 -47 -69 -84 -100 -94 -73 -39 -17 -36 -69 -99 -128 -130 -114 -111 -102 -60 11 67 129 185 205 235 282 325 346
7740 346 357 378 421 492 550 574 607 685 837 1029 1227 1448 1684 1949 2310 2815 3482 4373 5662 7676 10742 14635 17024 15496
7735 15496 11967 8855 6588 4974 3803 2981 2464 2121 1819 1547 1343 1200 1052 895 756 645 573 504 414 340 274 220 192
7730 192 201 217 204 186 169 117 58 45 72 106 106 82 47 -13 -67 -116 -158 -187 -221 -258 -289 -277 -205 -144 -120 -113 -133 -168 -152 -94 -36 7 32 52 86 118
7721 118 128 134 149 173 183 174 172 166 138 78 20 -5 51 137 161 145 137 160 165 149 179 244 276 249 224 221 213 226 261 288 284 227 140 46 -46 -150 -243 -265 -216
7712 -216 -188 -200 -199 -192 -196 -175 -131 -101 -85 -63 -48 -77 -119 -112 -43 59 173 253 240 171 126 81 17 -9 40 131 194 225 268 303 290 212 113 47 61 149
7704 149 274 369 389 366 362 373 358 345 367 378 351 313 286 261 213 165 141 113 81 52 33 27 25 32 30 -27 -84 -88 -68 -43 -21 2 55 118 179 228 255
7696 255 272 294 317 339 350 350 365 411 485 522 462 359 305 347 455 575 672 716 731 802 933 1078 1230 1426 1670 1952 2237 2613 3202
7689 3202 4158 5628 7894 11089 14147 14259 11364 8200 5880 4342 3350 2709 2222 1832 1519 1319 1159 996 831 686
7684 686 554 451 411 417 415 410 422 450 454 438 402 328 244 192 156 146 151 151 131 99 80 86 84 79 104 149 179 177 148 125 137 159 171 167 135 95 80 90 103
7675 103 118 122 123 99 42 -27 -50 -8 32 35 7 -20 1 28 37 54 81 83 64 53 40 18 -34 -117 -160 -127 -52 -3 -6 -23 -29 -45 -81 -136 -170 -156 -100 -29
7667 -29 29 42 47 90 150 207 241 233 227 219 170 103 64 69 84 85 81 71 37 12 45 76 53 10 -16 -36 -40 -23 -38 -90 -85 6 120 182 205 201 154 77 -4 -71
7658 -71 -104 -88 -42 10 52 64 77 84 64 25 -7 -25 -22 6 47 104 162 173 147 102 37 -26 -91 -158 -193 -190 -160 -101 -44 -20 -9 32 113 183 207 190 161
7649 161 126 103 121 162 198 215 194 159 134 114 105 111 97 20 -96 -188 -227 -218 -200 -198 -169 -95 -11 76 134 147 135 112 106 131 143 124 128 185 226 233 225 209
7640 209 175 104 14 -81 -166 -234 -257 -200 -112 -54 -26 -20 -41 -74 -91 -74 -16 41 53 19 -23 -35 -52 -95 -110 -77 -16 45 68 57 30 9 12 57 109 142
7632 142 136 64 -27 -74 -83 -62 -35 -33 -56 -77 -39 47 126 160 140 106 110 130 121 78 27 17 45 68 76 67 43 9 -23 -13 26 46 31 9 13 13 3 0 26 78
7623 78 128 130 59 -18 -57 -80 -70 -28 -5 -48 -145 -234 -262 -232 -197 -190 -178 -148 -117 -90 -32 68 130 118 78 31 7 9 -19 -63 -77 -85 -118 -173 -209 -188 -158
7614 -158 -152 -177 -205 -193 -154 -99 -25 43 56 33 12 -7 -7 12 62 140 202 205 165 105 44 -9 -57 -86 -68 -15 19 38 70 103 110 91 67 64 66 53 15 -37
7606 -37 -85 -120 -146 -175 -188 -187 -208 -229 -209 -167 -111 -38 29 76 99 115 118 106 102 122 130 105 42 -18 -25 10 62 125 190 243 259 232 169 91 62 64 28 -25
7597 -25 -52 -72 -69 -32 -17 -18 -21 -21 -41 -74 -92 -81 -44 -26 -61 -142 -212 -189 -95 -18 10 -10 -64 -101 -98 -84 -59 -29 -8 2 -5 -12 -35 -102 -173 -190 -154 -113 -106
7588 -106 -120 -120 -99 -93 -129 -186 -203 -162 -108 -66 -31 7 87 216 293 281 245 220 174 111 48 -19 -56 -55 -57 -67 -74 -72 -50 -21 2 32 98 160 140 54 -18
7579 -18 -17 22 57 82 98 80 63 79 91 98 101 102 113 113 113 145 156 98 28 -10 -35 -62 -66 -80 -110 -114 -90 -61 -42 -23 -25 -37 -6 43 75 103 121 115 74 17
7570 17 -28 -75 -141 -191 -207 -194 -154 -116 -93 -91 -117 -130 -125 -100 -92 -94 -71 -24 -4 -39 -88 -116 -117 -112 -106 -81 -85 -103 -95 -66 -63 -85 -91 -84 -80 -71 -80 -112 -104 -59 3 84 159
7560 159 215 257 262 240 238 238 224 219 200 171 154 119 52 -16 -67 -112 -173 -204 -155 -73 -16 5 6 -23 -97 -177 -236 -295 -335 -320 -262 -201 -149 -107 -81 -72 -51 2
7552 2 88 146 148 134 121 94 60 12 -28 -43 -63 -83 -87 -88 -105 -157 -205 -207 -188 -178 -175 -196 -225 -248 -258 -246 -238 -237 -237 -206 -138 -78 -51 -14 43 88 130 160 165 128
7542 128 54 -11 -62 -105 -119 -99 -75 -49 -17 22 37 19 0 -31 -89 -147 -214 -263 -270 -255 -225 -177 -127 -108 -133 -150 -136 -121 -112 -94 -57 -1 44 69 65 51
7534 51 87 149 176 130 46 -3 -5 15 85 205 309 345 294 205 156 137 98 54 51 89 149 201 209 180 135 134 179 186 131 63 28 24 20 -4 -26 -38 -72 -129
7525 -129 -169 -164 -149 -165 -200 -217 -217 -189 -125 -74 -31 18 63 91 105 120 143 157 123 59 11 -3 48 129 190 221 238 233 217 216 235 239 216 188 172 155 125
7517 125 82 38 -1 -25 -22 -23 -36 -45 -56 -27 21 27 -25 -80 -77 -26 9 4 5 61 171 297 378 367 293 229 207 227 261 281 296 326 366 415 475 537 586
7508 586 625 648 657 671 689 723 773 823 880 955 1058 1190 1351 1562 1827 2120 2415 2708 3020 3422 3954 4587 5363 6382 7759 9566
7502 9566 11753 14126 16239 17252 16504 14364 11794 9465 7594 6161 5092 4266 3562 2954 2479 2146 1910 1720 1550 1419
7498 1419 1331 1267 1198 1092 959 840 764 733 710 663 603 515 396 299 240 205 192 205 222 218 207 189 171 157 143 142 148 167 222 268 259 226 185 167
7490 167 166 121 44 -12 6 69 101 89 60 47 39 0 -27 -9 5 7 -3 -4 23 47 42 6 -37 -88 -133 -152 -120 -47 19 52 77 98 86 40 -2 7 63 116
7481 116 135 138 131 105 89 101 91 74 73 53 36 36 39 10 -49 -108 -169 -232 -289 -336 -377 -387 -380 -392 -414 -387 -291 -198 -146 -146 -181 -201 -176 -133 -86 -52 -36 -24
7473 -24 4 30 34 51 79 124 182 201 152 69 -25 -107 -150 -167 -184 -197 -179 -145 -113 -89 -74 -46 -4 32 82 120 134 149 140 110 99 95 73 48 27 8 17
7464 17 75 133 163 159 103 50 67 105 107 96 93 106 120 98 58 48 75 132 182 185 153 73 18 17 22 50 93 91 38 -22 -50 -45 -18 30 77 101 100 71 40 14
7455 14 -17 -33 -36 -51 -63 -38 2 40 71 93 109 113 110 99 77 51 44 55 72 89 103 112 128 154 155 113 48 14 21 35 67 121 194 276 300 235 152 94 52
7446 52 30 31 37 53 85 93 73 53 41 20 -13 -33 3 79 130 124 92 82 99 114 105 74 63 97 152 181 138 46 -54 -143 -222 -285 -321 -330 -303 -239 -180 -190
7437 -190 -209 -184 -170 -187 -206 -194 -128 -65 -46 -40 -18 -7 -58 -127 -158 -178 -230 -294 -321 -327 -342 -321 -240 -141 -37 45 79 71 45 20 -2 -4 -14 -57 -96 -124
7429 -124 -165 -210 -256 -279 -270 -243 -190 -105 -34 -13 -35 -62 -69 -42 -9 35 73 52 28 23 -1 -37 -47 -21 40 88 117 162 203 205 159 82 22 32 65 30 -53
7420 -53 -113 -134 -146 -175 -192 -196 -218 -222 -200 -197 -210 -232 -243 -251 -255 -239 -200 -163 -138 -119 -91 -58 -41 -6 28 11 -19 -23 -24 -25 -41 -90 -115 -110 -100 -79 -40 6 46 73
7411 73 61 8 -64 -129 -179 -216 -239 -258 -280 -300 -307 -291 -280 -297 -291 -257 -234 -219 -170 -110 -106 -127 -89 -20 25 37 60 80 67 53 57 94 156 190 202 207 203 185
7402 185 181 173 139 96 69 58 54 57 73 83 109 114 50 -32 -74 -75 -73 -68 -60 -61 -71 -88 -112 -105 -55 -28 -59 -103 -152 -188 -166 -123 -101 -86 -95 -110 -81 -25 13 22 38
7393 38 58 59 32 -15 -30 -26 -26 -3 34 43 -7 -94 -171 -190 -175 -184 -198 -187 -169 -177 -197 -198 -156 -108 -113 -146 -160 -142 -77 13 74 98 106 78 21 -35 -106 -152 -156 -154 -151
7384 -151 -144 -130 -109 -109 -153 -221 -274 -314 -305 -236 -133 -19 59 87 88 59 21 11 30 50 87 149 193 190 125 59 44 73 123 138 87 12 -27 -32 2 16 -26
7375 -26 -89 -134 -155 -147 -133 -126 -127 -136 -138 -103 -44 -40 -79 -114 -120 -95 -43 -10 -2 -14 -47 -98 -147 -130 -37 58 75 -2 -74 -109 -148 -189 -218 -250 -294 -286 -213 -121 -51 -10
7366 -10 -3 -6 19 56 119 178 170 118 98 122 136 101 61 36 19 6 -11 -32 -72 -123 -149 -127 -79 -36 -11 -19 -12 5 0 -22 -30 -12 -17 -64 -110 -97 -61 -66 -78 -52
7357 -52 -17 2 7 -11 -47 -85 -125 -171 -210 -214 -198 -218 -268 -281 -252 -240 -256 -257 -198 -117 -76 -76 -97 -143 -205 -247 -257 -246 -222 -172 -116 -101 -127 -143 -101 -45 -16
7348 -16 -8 -1 25 33 25 3 -32 -38 -42 -48 -29 11 11 -50 -108 -126 -120 -109 -110 -122 -138 -146 -141 -129 -125 -143 -183 -213 -192 -149 -67 46 121 142 127 77 31 6 -51 -129 -172
7339 -172 -178 -168 -138 -95 -70 -51 -16 10 8 -16 -44 -74 -104 -139 -154 -123 -80 -83 -107 -128 -129 -120 -126 -126 -117 -101 -74 -62 -38 21 56 31 -10 -39 -64 -71 -64 -53 -59 -113
7330 -113 -190 -239 -241 -207 -165 -124 -91 -56 -24 -49 -112 -150 -159 -160 -133 -94 -78 -84 -102 -117 -116 -103 -94 -62 -20 -21 -86 -190 -300 -388 -409 -369 -326 -292 -245 -181 -117
7321 -117 -63 -16 6 21 32 31 25 4 -41 -82 -135 -179 -169 -133 -112 -107 -108 -124 -161 -202 -242 -290 -312 -277 -208 -130 -69 -53 -72 -116 -152 -152 -160 -191 -186 -109 -13 34
7312 34 13 -31 -53 -100 -190 -269 -305 -287 -204 -88 21 79 73 47 15 -25 -71 -92 -79 -55 -52 -85 -124 -179 -227 -217 -172 -158 -171 -177 -175 -181 -182 -167 -136 -129 -167 -229
7304 -229 -283 -318 -300 -222 -129 -47 13 73 153 225 253 224 148 55 -34 -97 -133 -158 -151 -123 -117 -115 -85 -47 -24 -15 -27 -55 -58 -29 -11 -8 -15 -39 -39 25 105 128 73
7295 73 14 -13 -72 -147 -178 -162 -152 -188 -243 -276 -287 -236 -132 -41 20 70 96 102 103 97 79 19 -68 -154 -251 -310 -287 -241 -220 -203 -185 -172 -150 -139 -135 -145 -153
7286 -153 -177 -247 -322 -362 -352 -306 -251 -221 -202 -179 -179 -198 -222 -256 -278 -285 -288 -259 -199 -129 -45 44 133 197 224 219 194 152 81 30 8 -19 -36 -33 -16 -13 -33 -42
7277 -42 -41 -59 -70 -52 -24 19 83 142 163 131 80 65 91 115 155 223 263 234 165 109 95 98 76 63 64 39 -21 -98 -139 -108 -53 8 72 121 164 177 135
7269 135 93 69 61 79 118 156 188 225 241 232 204 195 229 280 313 300 272 231 166 90 1 -52 -31 17 39 34 15 -28 -80 -105 -82 -55 -64 -89 -117 -127 -117
7260 -117 -116 -158 -238 -297 -303 -286 -277 -266 -240 -186 -102 -6 63 89 42 -32 -75 -82 -74 -54 -11 30 54 56 17 -60 -123 -144 -136 -124 -114 -51 46 101 116 126 133 141 142 107
7251 107 58 61 128 192 212 215 238 235 178 118 79 53 47 65 65 53 64 75 87 119 155 154 111 50 -6 -66 -136 -154 -105 -55 -24 6 43 46 -3 -59 -124 -177
7242 -177 -176 -142 -132 -147 -156 -160 -162 -139 -111 -92 -92 -135 -176 -157 -106 -40 30 77 88 38 -61 -155 -211 -229 -206 -160 -108 -96 -95 -57 8 76 118 112 63 18 -10 -19 -19
7234 -19 -38 -56 -53 -36 -10 47 105 100 53 11 -31 -90 -147 -167 -150 -142 -167 -183 -161 -122 -86 -50 -1 32 18 -21 -21 56 157 205 182 108 30 -20 -24 19 80
7225 80 118 104 84 94 97 57 -23 -85 -134 -171 -175 -170 -169 -174 -149 -109 -96 -101 -108 -93 -64 -43 -32 -53 -95 -124 -107 -59 4 73 125 152 161 141 105 86 90 85 56 51 106
7216 106 176 206 193 174 178 203 217 192 143 114 131 175 208 204 158 117 107 92 58 30 37 39 -8 -78 -137 -141 -87 -29 -9 -28 -44 -36 -28 -44 -72 -100 -104 -59 7
7207 7 37 -7 -80 -131 -171 -173 -103 -10 54 91 107 105 82 23 -28 -60 -101 -160 -188 -198 -207 -187 -114 1 94 123 81 11 -33 -19 43 108 146 187 223 244 223
7198 223 145 54 14 10 -40 -114 -152 -167 -159 -114 -45 20 30 7 -31 -109 -186 -188 -139 -70 39 159 235 257 233 197 170 139 118 112 92 53 -24 -119 -168 -138
7190 -138 -43 61 133 142 118 95 64 30 4 11 26 17 -18 -42 -60 -102 -132 -111 -101 -132 -166 -190 -208 -227 -234 -232 -196 -150 -108 -58 -2 33 46 63 80 81 72 48
7181 48 6 -11 1 -4 -41 -85 -109 -135 -196 -264 -308 -343 -366 -344 -281 -208 -168 -161 -166 -168 -158 -130 -81 -36 -21 -27 -4 41 82 82 55 9 -60 -126 -172 -193 -188 -181 -185 -198
7172 -198 -217 -237 -244 -246 -260 -226 -139 -58 1 30 26 19 32 39 20 14 33 47 32 4 -29 -56 -115 -181 -200 -193 -161 -112 -85 -67 -18 52 118 159 152 112 66 40 49
7163 49 62 63 49 30 31 75 152 239 325 349 296 218 164 131 108 90 65 69 125 163 122 33 -32 -29 32 98 150 177 152 73 -8 -53 -55 -7 73 144 187 224
7154 224 247 277 318 329 284 188 93 16 -20 19 65 41 -32 -109 -162 -161 -120 -66 -11 43 91 122 88 17 -24 -59 -105 -142 -153 -144 -136 -136 -137 -130 -101 -46 4 34
7146 34 19 -14 -59 -112 -149 -150 -127 -100 -60 -36 -42 -41 -23 14 20 -17 -29 -10 19 28 -5 -90 -212 -330 -409 -429 -391 -331 -269 -217 -181 -145 -69 10 49 43 -7
7137 -7 -56 -101 -140 -147 -133 -97 -45 -10 -15 -46 -84 -140 -196 -221 -219 -215 -216 -230 -246 -225 -181 -144 -120 -73 2 47 48 16 -39 -98 -150 -164 -140 -105 -69 -30 14 47 56
7128 56 41 20 -11 -87 -182 -227 -224 -203 -195 -203 -224 -257 -265 -237 -201 -181 -197 -254 -328 -367 -359 -291 -176 -60 15 21 19 52 75 88 101 103 85 56 10 -41 -67 -60 -39
7119 -39 -10 29 48 19 -55 -157 -236 -264 -269 -239 -184 -150 -153 -181 -198 -206 -202 -180 -148 -86 -26 19 70 112 124 135 163 154 81 -16 -108 -168 -182 -173 -168 -121 -22 45
7110 45 48 21 -37 -133 -183 -181 -166 -125 -53 11 53 75 74 50 13 -17 -34 -42 -53 -62 -47 2 64 84 53 22 -18 -102 -198 -252 -239 -186 -146 -123 -103 -83 -74 -50
7102 -50 19 113 165 182 210 222 166 68 6 16 78 105 68 6 -51 -99 -135 -147 -124 -95 -93 -112 -139 -167 -190 -159 -89 -16 36 44 17 -25 -55 -51 -51 -90 -117
7093 -117 -123 -121 -80 -27 -3 -15 -44 -47 -12 -1 -21 -21 11 69 121 142 134 101 40 -20 -40 -38 -39 -30 -13 4 21 -4 -66 -104 -88 -53 -45 -58 -82 -113 -131 -119 -78
7084 -78 -30 25 63 60 40 20 20 8 -25 -64 -110 -167 -220 -213 -149 -104 -123 -171 -179 -130 -92 -109 -122 -71 -13 -12 -66 -129 -154 -165 -223 -321 -399 -408 -357 -297 -259 -248
7075 -248 -249 -230 -195 -175 -132 -55 -18 -37 -42 -11 37 73 73 53 34 35 55 53 20 -25 -58 -76 -51 3 61 110 134 158 201 247 286 291 221 124 48 8 6 -29
7067 -29 -101 -139 -136 -120 -97 -64 -38 -50 -112 -176 -201 -201 -193 -162 -98 -61 -64 -81 -85 -58 -2 43 51 38 12 -16 -24 -21 -16 25 69 82 74 61 70 74 50 -12 -72 -114 -125
7057 -125 -107 -100 -76 -12 58 101 126 127 109 83 49 34 54 85 114 124 127 142 151 158 149 87 -3 -76 -137 -191 -234 -238 -201 -152 -129 -126 -92 -50 -31 -24 5 61 103
7048 103 96 53 15 -31 -115 -214 -272 -273 -240 -197 -168 -151 -161 -182 -167 -140 -135 -135 -129 -113 -82 -43 1 48 80 77 33 -2 -4 10 16 -11 -53 -93 -122 -112 -85 -48 -22
7039 -22 -21 -19 -23 -20 -3 9 -3 -19 -1 39 65 59 37 12 2 19 52 91 98 84 81 93 107 123 128 86 21 -21 -35 -74 -122 -125 -95 -72 -83 -122 -159 -189 -192 -143
7030 -143 -95 -87 -103 -90 -54 -18 12 27 62 110 112 38 -82 -194 -281 -340 -357 -333 -282 -200 -95 -14 3 -19 -46 -70 -98 -142 -201 -238 -236 -204 -156 -98 -54
7022 -54 -24 -2 16 35 30 -9 -52 -49 8 48 21 -21 -13 31 46 15 -39 -85 -89 -44 3 40 48 5 -50 -40 21 68 108 143 140 110 80 81 130 175 175 152 151 172
7013 172 170 134 106 125 180 225 213 137 46 -22 -68 -83 -67 -50 -21 35 73 59 47 84 113 116 137 175 196 206 196 155 77 -5 -36 -7 27 21 -33 -119
7005 -119 -213 -297 -341 -331 -276 -208 -133 -75 -27 22 39 18 -40 -111 -183 -258 -300 -287 -228 -162 -131 -144 -168 -132 -63 -71 -140 -210 -272 -320 -338 -316 -270 -215 -133
6997 -133 -53 -12 4 17 54 117 173 177 95 -15 -65 -64 -56 -34 -11 -24 -74 -132 -145 -106 -43 5 21 3 -6 29 46 4 -49 -80 -82 -70 -72 -71 -61 -40 -41 -53
6988 -53 -34 -9 5 7 -24 -91 -150 -174 -158 -109 -75 -69 -81 -88 -78 -55 -32 -28 -29 -6 15 29 70 102 74 8 -56 -83 -65 -26 16 52 122 183 178 114 25 -72
6979 -72 -166 -189 -151 -159 -207 -281 -356 -376 -326 -230 -116 -14 66 98 46 -45 -117 -138 -125 -107 -124 -190 -262 -314 -319 -268 -217 -173 -119 -66 -13 0 -12 -14 7 19
6971 19 4 -16 -30 -34 -69 -117 -130 -112 -92 -79 -53 -20 -17 -38 -54 -54 -59 -78 -91 -91 -80 -36 13 30 9 -17 -15 -14 -58 -117 -129 -101 -84 -71 -33 3 37 80 115
6962 115 137 99 -4 -89 -119 -89 -30 -5 -20 -69 -136 -186 -211 -230 -261 -300 -308 -277 -240 -233 -253 -286 -308 -313 -290 -237 -177 -121 -113 -155 -194 -197 -148 -109 -119 -133 -116
6953 -116 -98 -85 -66 -46 -58 -93 -108 -97 -59 -32 -36 -30 -38 -81 -132 -164 -170 -156 -120 -80 -51 -43 -60 -88 -77 -27 15 25 9 -1 11 30 23 7 -1 -35 -109 -170
6945 -170 -156 -90 -10 79 114 103 104 134 155 141 125 127 154 183 184 174 163 126 91 71 22 -72 -173 -243 -270 -258 -212 -178 -164 -142 -102 -67 -61 -53 -24 13 50
6936 50 40 -52 -164 -235 -249 -192 -121 -116 -167 -210 -197 -122 -60 -75 -89 -59 -11 54 130 202 224 184 103 1 -71 -98 -83 -27 26 21 -21 -54 -42 19 89
6928 89 166 250 307 344 405 451 406 290 172 97 55 20 -7 -10 12 23 4 -35 -49 -31 -31 -42 -55 -84 -131 -188 -272 -334 -355 -363 -356 -326 -297 -284 -280 -241 -145
6920 -145 -39 38 85 130 157 158 117 41 -10 -8 18 22 -12 -55 -76 -72 -38 15 48 54 25 -8 -22 -13 16 51 46 16 -5 -8 3 20 34 25 -24 -84 -110 -98 -62
6911 -62 -6 50 92 82 27 -4 -22 -75 -144 -211 -258 -273 -248 -170 -62 51 168 271 318 304 235 150 109 98 102 127 131 100 69 64 72 73 47 -8 -69 -153
6902 -153 -242 -289 -284 -246 -196 -142 -85 -16 47 79 64 -5 -90 -162 -211 -238 -253 -254 -246 -241 -244 -248 -250 -266 -244 -180 -116 -49 0 23 63 105 130 123 86 39 8 13 38
6893 38 56 45 11 4 25 63 115 167 187 188 184 142 67 30 77 145 170 159 142 115 78 51 10 -52 -118 -131 -99 -95 -139 -198 -236 -261 -279 -290 -289 -239 -151 -83
6885 -83 -55 -37 -17 -19 -29 -23 -33 -25 21 79 117 114 87 81 75 20 -79 -150 -165 -166 -176 -192 -175 -111 -50 -16 6 27 20 -18 -81 -154 -205 -212 -178 -138 -103 -70 -36 -34
6876 -34 -80 -124 -146 -172 -223 -270 -293 -299 -282 -249 -221 -175 -109 -63 -42 -44 -46 -45 -32 -20 -23 -18 -6 7 24 20 6 -10 -22 -40 -68 -79 -66 -41 -5 64 123 116 37
6867 37 -72 -149 -154 -124 -126 -154 -174 -191 -236 -292 -316 -272 -175 -74 3 50 52 28 7 -10 -17 0 31 36 -5 -81 -158 -173 -108 -22 23 41 51 56 44 4 -43
6858 -43 -74 -97 -141 -174 -177 -186 -193 -178 -164 -148 -146 -156 -188 -244 -270 -234 -163 -66 33 127 172 116 -6 -101 -141 -137 -101 -73 -65 -56 -9 63 122 151 149 159 196 240 268
6849 268 248 198 144 93 52 -11 -74 -79 -70 -113 -165 -157 -87 -4 64 120 145 152 172 190 163 106 43 -32 -115 -159 -156 -154 -187 -230 -206 -127 -66 -45 -46 -68 -99 -109
6840 -109 -113 -143 -179 -187 -168 -112 -3 127 227 249 186 111 91 127 178 171 109 49 12 2 13 40 90 109 87 59 38 11 -15 -22 5 68 116 135 145
6832 145 121 53 -2 -24 -56 -101 -124 -116 -101 -95 -117 -178 -219 -204 -148 -100 -97 -126 -140 -94 -10 84 145 146 133 151 142 82 18 -39 -72 -78 -64 -32 9 23 -2 -11
6824 -11 3 -1 -34 -49 -39 -33 -29 -19 -42 -105 -160 -212 -249 -224 -167 -143 -98 -23 47 118 168 182 158 79 -30 -117 -161 -178 -192 -215 -241 -230 -193 -183 -193 -204
6815 -204 -189 -169 -190 -214 -207 -173 -119 -78 -86 -109 -93 -56 -18 11 36 72 92 89 84 95 118 108 43 -39 -79 -76 -62 -72 -113 -160 -221 -278 -292 -271 -254 -247 -214 -183
6807 -183 -191 -230 -255 -236 -203 -173 -152 -163 -175 -178 -187 -192 -205 -237 -259 -260 -247 -212 -183 -189 -224 -243 -172 -56 22 61 59 22 -24 -54 -62 -73 -80 -69 -54 -35 -13 0 20
6798 20 40 41 26 -3 -53 -105 -135 -107 -59 -84 -169 -247 -298 -334 -328 -276 -210 -152 -126 -126 -150 -176 -166 -155 -150 -93 3 59 72 89 97 60 -7 -24 -19 -44 -43 -4 24
6789 24 21 22 40 36 21 41 73 83 84 86 69 19 -69 -156 -188 -190 -233 -316 -376 -405 -402 -338 -237 -161 -120 -97 -58 8 64 81 37 -46 -104 -111 -88 -49 -11 31 81
6780 81 121 158 174 186 192 143 50 -22 -39 -32 -38 -40 -6 30 56 77 64 5 -90 -173 -181 -108 -11 46 66 59 45 66 95 94 93 92 69 64 103 144 156 152 131 104 122
6770 122 197 263 267 212 111 25 -11 -9 -29 -80 -101 -70 -51 -61 -66 -97 -143 -167 -176 -195 -211 -210 -208 -233 -293 -339 -338 -306 -249 -186 -112 -16 99 170 144 84 43
6762 43 -15 -78 -81 -22 32 33 26 44 77 130 193 221 214 226 262 265 224 172 143 150 181 185 145 77 24 -4 -45 -108 -152 -119 -46 2 47 86 81 17 -72 -118 -121 -124
6753 -124 -122 -106 -71 -37 -19 -38 -65 -55 -9 28 20 -30 -90 -118 -103 -71 -72 -111 -144 -147 -124 -74 1 92 163 181 160 134 122 124 129 107 60 16 -4 0 10 10 -25
6744 -25 -101 -166 -168 -123 -64 -18 2 -8 -11 30 59 36 23 66 101 74 2 -56 -36 20 53 72 91 111 118 88 40 25 81 185 248 200 96 1 -101
6736 -101 -185 -205 -186 -193 -193 -184 -187 -189 -187 -163 -123 -103 -104 -120 -142 -137 -104 -62 -15 8 -15 -47 -44 -15 4 -2 -18 -25 -41 -64 -78 -101 -177 -293 -372 -410 -374 -260 -181
6727 -181 -173 -175 -170 -173 -170 -129 -80 -49 -45 -82 -146 -201 -221 -204 -136 -34 54 102 101 50 -17 -37 -39 -79 -115 -116 -94 -71 -67 -85 -115 -145 -144 -88 -29 -18 -27 -40 -70 -101
6717 -101 -124 -162 -209 -234 -245 -239 -206 -190 -217 -229 -182 -112 -80 -71 -63 -73 -116 -153 -139 -98 -67 -57 -82 -148 -194 -163 -109 -76 -59 -62 -49 -4 34 51 30 -17 -54
6709 -54 -62 -25 13 -3 -69 -129 -168 -211 -264 -294 -266 -193 -120 -42 20 39 49 78 111 118 107 91 56 17 -9 -31 -55 -80 -115 -150 -165 -163 -133 -69 -4 33 43
6700 43 45 39 1 -52 -74 -74 -104 -142 -154 -182 -234 -296 -328 -313 -248 -161 -93 -66 -90 -159 -229 -242 -183 -112 -66 -53 -69 -100 -125 -121 -115 -101 -44 23 60 80 101 116
6692 116 101 74 81 88 72 69 99 157 215 224 191 163 152 139 98 47 31 15 -20 -52 -52 -12 38 53 11 -72 -149 -177 -145 -98 -69 -34 22 48 4 -60 -83
6683 -83 -83 -76 -70 -77 -104 -144 -153 -130 -75 -1 54 69 94 113 92 60 14 -70 -166 -211 -190 -154 -174 -219 -210 -158 -131 -150 -163 -171 -192 -220 -254 -264 -252 -238 -198 -145 -104
6674 -104 -81 -50 -13 4 13 55 110 128 139 131 111 92 69 65 63 18 -78 -194 -264 -284 -267 -231 -196 -156 -108 -69 -35 0 39 83 82 33 -12 -41 -46 -6 41
6666 41 38 -8 -52 -74 -56 -21 -12 -18 -19 -2 18 7 -52 -130 -195 -240 -259 -247 -188 -155 -200 -266 -323 -340 -284 -203 -143 -82 -17 15 18 -8 -26 -3 8 -29 -97 -155
6657 -155 -159 -141 -124 -113 -111 -116 -135 -133 -92 -58 -46 -31 -39 -81 -135 -180 -209 -234 -240 -214 -178 -161 -137 -95 -34 -14 -59 -105 -90 -15 49 90 124 123 80 25 -7 8
6648 8 65 116 129 102 48 -24 -92 -108 -60 9 43 19 17 60 72 28 -13 -22 -26 -28 -24 -19 -6 35 75 64 -3 -96 -131 -122 -129 -120 -82 -58 -53 -56 -108 -180 -184 -122 -62 -24
6639 -24 -4 -20 -73 -152 -230 -273 -274 -271 -299 -330 -354 -388 -415 -428 -439 -444 -420 -343 -261 -243 -255 -258 -282 -328 -342 -298 -247 -220 -210 -194 -189 -220 -253 -232 -179 -142 -159 -210
6630 -210 -225 -220 -230 -238 -208 -145 -88 -71 -90 -129 -165 -197 -225 -238 -233 -199 -161 -163 -206 -234 -215 -210 -218 -221 -230 -239 -264 -298 -294 -254 -183 -101 -18 58 93 60 -24 -95 -120 -91
6621 -91 -42 -10 10 42 57 52 39 21 -26 -81 -128 -166 -193 -195 -140 -47 27 57 48 25 28 41 61 91 60 -26 -57 -12 29 -7 -116 -226 -250 -191 -118 -72
6612 -72 -38 9 59 81 79 54 12 -45 -106 -120 -90 -58 -32 -24 -7 39 75 100 110 91 61 40 6 -46 -94 -120 -104 -56 -25 -36 -58 -82 -86 -36 16 40 37
6604 37 26 18 5 0 7 11 4 -6 -49 -109 -146 -156 -154 -152 -161 -143 -90 -50 -20 34 100 121 100 37 -53 -102 -62 43 133 172 199 202 157 109 92 51 -14 -72 -148
6595 -148 -163 -66 59 128 131 106 81 53 9 -49 -93 -136 -185 -207 -177 -121 -87 -92 -125 -160 -194 -197 -152 -105 -89 -77 -33 62 168 208 164 79 -13 -63 -53
6587 -53 -32 -38 -52 -40 -44 -94 -177 -263 -314 -334 -351 -370 -373 -334 -259 -175 -106 -73 -54 -31 -53 -110 -152 -172 -159 -113 -59 -12 19 17 2 17 57 97 99 76 49 -15
6578 -15 -105 -177 -232 -277 -283 -252 -200 -150 -103 -33 -2 -54 -135 -169 -132 -75 -60 -107 -163 -174 -162 -156 -158 -160 -142 -114 -74 -30 -26 -69 -120 -157 -174 -171 -161 -139 -100 -55
6569 -55 -17 -10 -63 -161 -219 -214 -178 -166 -174 -154 -96 -15 64 121 141 147 180 233 258 251 227 166 78 15 -18 -50 -61 -41 -11 36 82 92 111 131 92 28 -15 -25
6561 -25 -1 17 9 -14 -14 2 14 1 -35 -81 -136 -200 -230 -195 -121 -36 38 89 115 107 51 -42 -138 -209 -227 -184 -110 -53 -43 -58 -61 -49 -34 -27 -18 -37 -83 -102
6552 -102 -122 -138 -96 -49 -56 -78 -71 -36 -22 -25 -16 5 27 56 73 69 38 -4 -34 -61 -75 -46 8 22 -10 -48 -93 -147 -184 -181 -140 -89 -4 88 110 71 21 -8
6543 -8 -12 27 89 99 50 -20 -57 -55 -53 -54 -44 -39 -59 -90 -96 -67 -36 -30 -35 -43 -45 -31 -39 -86 -142 -182 -194 -188 -183 -170 -179 -222 -282 -332 -354 -367 -337 -242 -150 -85 -34 -12 -12
6533 -12 -6 -3 -7 -7 -25 -55 -61 -34 -21 -53 -90 -89 -56 -46 -95 -151 -177 -178 -146 -118 -139 -192 -240 -277 -309 -321 -253 -129 -38 3 21 46 68 31 -33 -70 -77 -96 -128
6524 -128 -125 -111 -148 -215 -250 -243 -242 -276 -283 -244 -194 -154 -128 -110 -76 -13 12 -58 -179 -274 -299 -280 -265 -284 -329 -331 -252 -136 -28 55 104 107 73 41 56 75
6516 75 58 -10 -131 -246 -295 -253 -151 -56 5 36 23 -17 -54 -83 -97 -106 -87 -36 -3 -2 -28 -62 -78 -45 11 45 49 8 -63 -98 -94 -76 -61 -35 21 82
6508 82 95 46 -37 -129 -227 -280 -248 -185 -131 -105 -118 -157 -196 -213 -216 -197 -153 -119 -86 -34 12 20 -33 -119 -170 -169 -168 -204 -257 -283 -252 -182 -140 -109 -36 39 44 -6
6499 -6 -55 -86 -97 -101 -100 -83 -66 -81 -140 -179 -147 -105 -88 -65 -60 -57 -44 -5 66 129 107 19 -54 -100 -128 -160 -195 -211 -210 -180 -107 -48 -34 -39 -45 -28 -11 -12 -52 -116
6490 -116 -142 -132 -114 -109 -134 -139 -82 15 78 46 -30 -73 -46 14 56 75 69 24 -83 -222 -328 -372 -370 -329 -265 -223 -215 -209 -175 -133 -94 -51 -12 -1 -23 -73
6482 -73 -130 -176 -216 -235 -222 -196 -161 -104 -21 50 59 9 -49 -85 -127 -185 -237 -275 -299 -339 -413 -461 -467 -438 -385 -347 -314 -264 -214 -209 -240 -256 -253 -242 -225 -215 -223 -228
6473 -228 -227 -229 -212 -160 -111 -79 -67 -60 -51 -64 -76 -40 45 104 125 143 164 189 217 248 232 165 103 43 23 81 138 113 24 -77 -156 -215 -294 -364 -381 -349
6465 -349 -315 -319 -313 -257 -160 -89 -75 -65 -20 37 73 103 130 148 159 133 61 -6 -43 -43 -1 33 26 -5 -16 -22 -58 -67 -22 29 53 40 2 -20 -9 2 -5 -17
6456 -17 -17 15 57 62 45 51 40 -36 -144 -224 -239 -172 -48 67 106 29 -84 -131 -104 -56 -54 -93 -117 -120 -111 -81 -46 -9 36 82 99 97 89 57 9 -30 -60
6447 -60 -50 -3 37 51 32 -17 -70 -125 -166 -180 -174 -156 -168 -201 -177 -100 -42 13 96 174 205 172 119 79 55 51 80 98 74 45 25 4 4 46 101 116 108
6439 108 106 85 34 -17 -59 -103 -134 -149 -165 -193 -210 -191 -143 -103 -98 -126 -147 -160 -166 -162 -158 -143 -120 -113 -126 -136 -128 -150 -178 -188 -179 -180 -207 -232 -222 -194 -158 -105 -73
6430 -73 -62 -30 22 77 79 3 -112 -225 -290 -269 -217 -182 -160 -129 -100 -120 -174 -228 -273 -310 -322 -323 -336 -331 -307 -299 -319 -338 -306 -220 -128 -57 7 77 135 176
6422 176 216 233 220 186 124 41 0 20 29 -8 -49 -79 -81 -52 -26 -26 -38 -59 -73 -71 -71 -73 -85 -101 -123 -133 -134 -158 -191 -205 -227 -244 -206 -134 -90 -73 -67 -68 -59 -47
6412 -47 -62 -98 -120 -123 -111 -70 -18 7 1 -32 -91 -133 -146 -170 -212 -251 -272 -263 -238 -209 -175 -125 -81 -95 -136 -147 -138 -123 -95 -81 -82 -86 -111 -143 -125 -84 -67 -61 -70
6403 -70 -87 -125 -177 -198 -204 -217 -216 -206 -205 -160 -62 -1 -33 -105 -155 -167 -171 -181 -171 -149 -118 -103 -131 -178 -201 -183 -162 -144 -96 -51 -41 -48 -51 -40 -44 -104 -161 -136 -64
6395 -64 -23 -33 -97 -183 -227 -213 -190 -180 -164 -148 -138 -143 -165 -193 -223 -253 -300 -358 -382 -348 -255 -148 -39 65 148 186 170 135 83 -40 -212 -332 -353
6387 -353 -264 -117 -27 -29 -69 -95 -85 -71 -63 -33 11 59 117 150 129 82 44 4 -32 -73 -124 -136 -89 -26 11 18 6 -33 -84 -121 -106 -30 66 158 209 211
6379 211 192 189 206 200 183 186 190 164 81 -27 -66 -55 -46 -43 -61 -97 -149 -210 -244 -253 -261 -233 -139 -23 73 117 113 136 176 179 145 77 -40 -162 -226 -221 -189 -180 -177
6370 -177 -146 -90 -69 -122 -192 -231 -216 -156 -87 -45 -31 -40 -45 -33 -27 -44 -66 -71 -108 -208 -315 -376 -383 -361 -322 -250 -137 -38 30 85 124 149 168 176 184 189 153
6361 153 71 15 14 17 -8 -64 -93 -79 -73 -77 -82 -132 -221 -287 -308 -303 -264 -199 -111 -28 42 100 145 156 117 69 28 -22 -60 -53 -43 -86 -165 -235 -249 -210 -158 -131
6352 -131 -113 -94 -72 -52 -63 -86 -97 -97 -84 -61 -70 -116 -172 -204 -176 -107 -59 -53 -62 -61 -14 56 114 130 67 -23 -73 -113 -175 -215 -210 -201 -207 -217 -233 -231 -202 -170 -172 -207
6343 -207 -229 -207 -174 -158 -151 -142 -124 -97 -61 -24 -19 -26 -22 -32 -59 -100 -129 -106 -32 67 146 159 113 55 -11 -59 -57 -58 -62 -22 45 82 104 168 278 361 341 238
6335 238 156 139 141 125 70 -44 -165 -231 -250 -264 -303 -317 -302 -302 -315 -330 -330 -303 -212 -63 64 137 189 214 208 200 206 212 180 127 84 68 59 34 31 46 46 45
6326 45 63 75 77 117 186 228 228 210 182 118 40 4 -12 -78 -177 -204 -146 -80 -36 -28 -68 -114 -140 -159 -188 -212 -227 -244 -228 -177 -112 -63 -61 -79 -99 -127 -151
6317 -151 -181 -207 -220 -224 -182 -117 -81 -50 -24 -36 -75 -122 -177 -203 -190 -157 -133 -110 -81 -45 8 55 85 91 60 21 0 -21 -47 -49 -27 -23 -14 1 -19 -77 -118
6309 -118 -123 -132 -161 -160 -132 -138 -160 -180 -208 -208 -195 -161 -73 62 176 198 142 70 30 19 21 28 28 4 -20 -28 -39 -63 -74 -59 -38 -48 -100 -171 -221 -218 -206 -191 -130
6300 -130 -82 -96 -135 -158 -161 -142 -106 -105 -150 -205 -213 -192 -165 -100 -18 43 79 106 130 139 115 45 -37 -80 -99 -143 -208 -234 -195 -144 -140 -186 -249 -299 -346 -344 -284 -215
6291 -215 -176 -168 -170 -174 -177 -144 -55 42 103 112 108 120 152 198 235 218 159 108 82 55 26 32 69 98 96 83 83 92 117 110 54 5 14 25 -10 -56 -78 -62 -15 12 -30
6282 -30 -81 -83 -41 2 5 -34 -90 -170 -245 -277 -271 -254 -259 -279 -275 -241 -214 -199 -205 -215 -187 -159 -152 -150 -141 -139 -134 -112 -85 -58 -39 -32 -39 -46 -64 -117 -177 -195 -183 -177 -176 -149 -69
6272 -69 19 59 25 -14 -18 -44 -91 -150 -199 -218 -225 -230 -239 -252 -267 -240 -167 -78 0 28 -6 -49 -48 -18 35 95 138 141 99 56 48 67 80 65 7 -60 -60 -2 53
6263 53 64 4 -93 -146 -147 -106 -38 20 57 55 25 5 -25 -63 -68 -78 -96 -62 14 86 145 177 168 167 176 178 186 184 173 150 121 106 86 55 9 -39 -62 -64 -94 -152
6254 -152 -205 -203 -113 -5 40 16 1 44 102 122 89 35 0 -8 -4 6 13 14 16 37 77 101 99 66 26 15 20 11 -11 -24 -40 -42 -13 6 -13 -66 -149 -243 -300
6245 -300 -329 -344 -331 -281 -233 -218 -218 -200 -156 -114 -83 -56 -47 -67 -128 -173 -166 -119 -60 -44 -69 -99 -114 -78 -6 42 77 107 106 70 15 -29 -30 -21 -39 -43 -31 -49
6236 -49 -85 -109 -93 -14 83 120 82 11 -39 -48 -40 -30 -16 -44 -113 -181 -207 -189 -173 -163 -162 -173 -160 -137 -113 -74 -48 -30 -5 4 -10 -21 -41 -55 7 132 207
6227 207 183 135 115 113 112 101 49 -29 -84 -121 -143 -152 -148 -117 -94 -108 -143 -169 -171 -163 -165 -207 -263 -308 -344 -361 -326 -250 -196 -183 -194 -224 -208 -138 -94 -107 -143 -145 -116
6219 -116 -89 -48 21 94 124 95 40 -17 -44 -43 -46 -41 -18 2 23 66 141 207 196 129 73 37 20 7 -28 -84 -146 -159 -114 -50 -14 -14 -8 10 15 -5 -44 -103
6210 -103 -161 -189 -213 -208 -166 -143 -149 -148 -138 -99 -34 4 -14 -45 -72 -97 -121 -138 -114 -78 -93 -117 -92 -45 -12 19 48 42 15 4 4 32 95 142 129 63 -19
6201 -19 -76 -91 -58 17 111 196 238 242 206 127 35 -29 -27 14 22 5 -9 -2 14 59 143 194 187 146 101 86 94 100 125 131 91 58 52 64 67 61 42 26 10 -30 -80
6192 -80 -87 -55 -40 -46 -74 -119 -181 -239 -264 -251 -214 -173 -140 -100 -54 -24 -19 -11 37 84 97 78 29 -25 -70 -98 -92 -82 -57 -37 -40 -37 -17 0 -12 -32 -70 -113 -118
6183 -118 -117 -142 -158 -165 -168 -169 -159 -145 -149 -161 -174 -203 -244 -268 -282 -309 -333 -310 -243 -203 -217 -214 -185 -189 -209 -223 -201 -144 -79 -11 35 29 -9 -69 -144 -208 -232 -227 -206
6174 -206 -163 -123 -96 -78 -65 -48 -39 -51 -110 -187 -219 -241 -267 -256 -199 -129 -87 -93 -124 -144 -137 -103 -65 -29 -4 14 55 113 162 210 271 320 307 242 197 199 206
6165 206 195 199 248 333 404 380 265 138 41 -30 -109 -187 -204 -158 -79 -18 -10 -41 -72 -101 -135 -173 -213 -230 -205 -163 -165 -191 -182 -132 -84 -53 -38 -38 -3 72
6157 72 146 189 194 163 106 60 48 57 54 23 -11 -22 -21 -40 -82 -121 -130 -93 -8 110 198 217 176 98 15 -49 -80 -70 -46 -33 -21 13 61 77 53 14 -30
6149 -30 -45 -63 -105 -135 -121 -68 -6 46 98 151 174 145 107 73 23 -9 5 33 42 31 14 -20 -57 -69 -88 -123 -163 -198 -186 -114 -12 49 29 -28 -39
6141 -39 17 54 17 -38 -45 -20 -24 -56 -76 -59 4 66 81 73 63 19 -14 -18 -11 10 37 38 -7 -55 -67 -77 -118 -174 -172 -75 36 64 14 -63 -119 -114 -83 -62 -46
6132 -46 8 81 142 170 160 146 136 130 110 84 75 79 86 93 88 44 -32 -102 -175 -241 -242 -181 -129 -111 -76 -5 83 174 252 286 280 234 171 106 44 -21 -75 -113 -170
6123 -170 -222 -223 -195 -174 -147 -126 -117 -133 -167 -187 -185 -158 -121 -100 -79 -50 -27 0 38 35 -6 -25 3 61 90 47 -11 -7 12 3 -4 4 -1 -24 -57 -100 -134 -131 -96 -47
6113 -47 -12 0 21 53 101 162 219 278 343 368 305 200 85 -29 -100 -121 -124 -122 -128 -115 -69 -46 -44 -18 5 7 21 66 115 149 171 185 197 209 238 284
6105 284 306 306 299 252 165 96 88 115 131 130 132 113 68 38 21 21 29 48 107 174 208 184 106 -12 -134 -209 -224 -185 -137 -148 -196 -217 -180 -97 -11 20 3
6097 3 5 19 15 11 -12 -61 -122 -192 -240 -253 -245 -199 -111 -39 -9 12 13 -29 -94 -138 -153 -146 -126 -108 -84 -63 -66 -107 -140 -141 -143 -140 -118 -67 -22 21 93 164 175 129 98
6087 98 86 41 -29 -79 -92 -67 -18 18 23 -3 -64 -134 -185 -184 -135 -80 -9 80 158 187 173 129 83 67 74 89 71 24 -8 -20 -14 -3 -12 -34 -39 -1 58 86
6079 86 73 43 36 64 70 38 7 20 89 171 215 193 132 83 29 -48 -97 -92 -69 -49 -33 -32 -62 -104 -145 -190 -193 -125 -54 -14 -1 -20 -80 -126 -116 -71 -2 67
6070 67 89 55 -12 -110 -185 -197 -147 -56 40 112 145 148 155 143 69 -17 -40 -10 26 61 81 75 44 3 -18 -37 -57 -44 -28 -11 2 1 17 48 36 -31 -90
6061 -90 -89 -58 -30 1 20 29 51 97 112 76 36 20 52 91 102 85 62 48 27 -16 -57 -80 -80 -58 -34 -8 -7 -42 -58 -51 -66 -116 -145 -133 -91 -39 4 89
6053 89 202 270 260 208 142 79 26 14 24 55 125 140 76 21 16 30 25 -21 -77 -105 -103 -74 -44 -31 -45 -90 -155 -213 -230 -212 -180 -132 -62 -19 -36 -90
6044 -90 -157 -202 -199 -160 -97 -44 -20 -28 -58 -66 -28 33 82 118 121 85 14 -36 -51 -51 -36 -7 20 30 64 128 176 175 157 163 186 214 203 135 69 52 47 31 24 16
6035 16 -4 -32 -62 -63 -32 -8 12 47 92 117 87 34 16 20 27 31 2 -62 -123 -171 -222 -246 -235 -201 -124 -10 82 116 97 23 -85 -173 -182 -141 -117 -117 -128
6027 -128 -141 -129 -68 4 44 84 149 169 110 42 20 19 32 52 72 97 115 106 59 2 -2 36 50 28 -4 -13 -15 -28 -22 -1 7 -14 -57 -117 -203 -285 -339 -373
6018 -373 -368 -307 -217 -150 -135 -142 -165 -213 -248 -234 -187 -127 -79 -72 -82 -65 -29 -17 -49 -72 -69 -69 -72 -71 -88 -103 -85 -34 23 56 59 39 -6 -58 -78 -83 -114 -146 -159
6009 -159 -155 -126 -102 -116 -167 -230 -273 -273 -239 -165 -56 45 129 184 178 128 75 39 -5 -60 -74 -61 -58 -64 -78 -78 -46 -11 6 20 33 57 97 97 30 -47 -108
6000 -108 -146 -182 -251 -313 -310 -263 -226 -202 -175 -136 -97 -98 -131 -145 -125 -93 -89 -135 -177 -159 -95 -25 32 67 57 39 40 49 64 83 94 78 29 -15 -22 -37 -91 -143
5992 -143 -201 -234 -171 -70 -23 -20 -51 -128 -219 -271 -259 -233 -203 -164 -124 -83 -59 -68 -99 -120 -132 -122 -87 -72 -83 -59 1 45 69 51 -7 -62 -112 -168 -196
5984 -196 -187 -154 -106 -60 -27 -1 11 -2 -12 -11 -29 -35 -2 43 65 91 142 184 212 204 160 96 43 13 15 55 120 188 228 215 179 129 83 66 68 59 55 75 93
5975 93 77 11 -53 -82 -122 -177 -208 -218 -206 -168 -123 -105 -103 -111 -111 -99 -67 -32 -26 -4 37 57 66 74 54 26 27 32 9 -37 -78 -115 -162 -188 -148 -69 -21 -42 -103
5966 -103 -141 -107 -30 25 24 -7 -39 -48 0 88 159 194 188 157 142 128 111 127 143 98 9 -39 -35 -42 -67 -77 -76 -98 -129 -133 -96 -78 -94 -96 -70 -28 29 84 107
5957 107 106 87 42 -32 -114 -174 -200 -202 -179 -113 -19 33 16 -46 -104 -161 -235 -264 -218 -126 -21 64 90 72 65 70 78 65 50 68 94 99 101 121 139 142 116 73
5948 73 49 33 -18 -98 -147 -176 -173 -137 -98 -97 -125 -148 -168 -158 -119 -68 -40 -67 -130 -162 -146 -128 -140 -171 -202 -212 -198 -153 -120 -111 -123 -148 -163 -167 -188 -230 -261
5940 -261 -291 -325 -324 -300 -271 -234 -210 -221 -240 -232 -207 -175 -146 -137 -150 -174 -198 -218 -225 -187 -124 -147 -238 -287 -254 -179 -93 -9 47 68 66 68 80 76 66 69 53 -16 -103
5931 -103 -166 -181 -167 -149 -104 -30 45 81 64 25 -24 -67 -77 -62 -53 -61 -54 -24 12 38 46 65 86 72 21 -33 -38 2 42 52 29 -30 -92 -98 -67 -40 -50 -114
5922 -114 -163 -162 -122 -63 -44 -94 -160 -176 -129 -39 75 176 214 193 142 94 53 -11 -81 -141 -192 -195 -165 -137 -89 -25 44 84 50 -31 -97 -131 -156 -179 -184
5914 -184 -147 -62 48 132 161 164 166 142 73 -14 -79 -119 -121 -77 1 59 66 46 44 56 70 80 95 114 104 75 53 24 1 28 127 238 302 300 260 218 192
5905 192 208 215 170 141 145 128 59 -37 -115 -170 -198 -203 -174 -118 -45 29 78 85 67 42 4 -39 -71 -68 -55 -31 14 30 8 -28 -62 -78 -64 -26 -1 5 0 -17
5897 -17 -45 -77 -92 -94 -101 -108 -109 -115 -129 -143 -151 -156 -159 -177 -188 -176 -138 -63 40 91 48 -34 -107 -119 -83 -55 -64 -91 -94 -41 43 73 54 27 10 15 21 -1 -39 -88 -159
5887 -159 -233 -271 -259 -215 -197 -222 -261 -259 -178 -83 -10 40 42 7 -38 -82 -139 -203 -240 -194 -79 6 19 10 -9 -48 -88 -136 -172 -178 -174 -172 -178 -188 -168 -137 -116 -100
5878 -100 -96 -127 -198 -278 -309 -271 -211 -132 -33 36 56 48 13 -51 -90 -70 -29 -20 -36 -33 -24 -32 -41 -61 -63 -53 -62 -61 3 82 119 114 85 60 49 58 62 83 86 42 -2 -25
5869 -25 8 74 122 153 154 144 154 160 140 123 124 125 131 147 147 145 150 153 153 166 177 178 181 184 163 70 -45 -93 -95 -99 -96 -77 -62 -43 -9 21 18 -19 -54 -86 -128 -157 -158 -158
5859 -158 -176 -185 -181 -159 -111 -61 -39 -62 -99 -105 -69 1 43 36 12 -8 -20 -1 35 57 59 20 -38 -74 -116 -147 -126 -89 -73 -94 -131 -138 -116 -66 -3 15 -38 -119
5850 -119 -147 -134 -122 -135 -178 -210 -195 -140 -87 -57 -35 -15 -7 -10 -19 -49 -82 -98 -93 -102 -140 -179 -228 -245 -177 -98 -99 -138 -148 -147 -149 -157 -191 -228 -226 -188 -168 -178 -176 -139
5841 -139 -87 -14 26 -8 -84 -151 -167 -129 -47 20 74 105 104 106 138 196 232 215 182 168 147 121 114 100 68 41 35 37 51 88 116 109 74 9 -81 -139 -126 -83
5832 -83 -54 -38 2 51 64 74 131 232 330 384 381 348 322 290 250 207 149 90 43 28 34 25 3 -4 14 57 99 138 180 199 188 180 189 197 215 221 171 94 65
5823 65 57 29 15 0 -26 -61 -128 -208 -259 -272 -255 -222 -175 -149 -167 -192 -234 -296 -332 -334 -316 -257 -151 -57 -30 -43 -69 -110 -160 -193 -193 -188 -179 -140 -91 -61 -39
5815 -39 -9 27 41 34 27 9 -2 2 10 44 77 88 114 142 119 66 29 15 9 15 27 35 56 70 62 63 76 80 93 116 104 86 95 93 72 44 17 -8 -24 -9 7
5805 7 -21 -68 -63 -8 64 111 109 87 65 18 -50 -71 -32 25 75 89 58 27 26 30 31 14 -34 -94 -122 -96 -66 -51 -28 -17 0 31 68 116 160 182 190 189 158
5796 158 87 15 -33 -49 -43 -41 -42 -16 29 61 72 116 162 156 143 147 142 124 115 122 148 200 266 297 276 218 111 14 -47 -108 -143 -134 -83 -22 23 61 85 105 142
5787 142 152 121 101 138 221 281 276 227 155 84 44 41 83 159 213 217 188 172 180 207 229 192 96 -9 -81 -107 -108 -95 -75 -32 40 113 184 238 258 248 237
5779 237 229 228 231 206 152 96 59 20 -28 -80 -104 -90 -61 -50 -68 -79 -66 -21 16 -21 -93 -138 -160 -213 -262 -267 -252 -233 -203 -148 -119 -135 -147 -127 -77 -71 -81
5770 -81 -57 -36 -49 -64 -74 -97 -112 -117 -127 -134 -148 -157 -134 -91 -32 22 47 54 45 17 -35 -100 -113 -50 48 151 212 208 192 203 215 181 126 88 71 74 92 107
5761 107 130 141 126 95 61 56 72 77 70 78 79 68 45 0 -39 -52 -72 -88 -67 -35 -26 -56 -126 -211 -278 -302 -265 -201 -152 -134 -111 -72 -52 -33 -12 -21 -19 33 86
5752 86 98 90 55 8 -32 -101 -174 -208 -198 -174 -180 -201 -187 -128 -82 -76 -72 -46 -29 -45 -63 -62 -62 -68 -80 -125 -182 -197 -180 -158 -143 -100 -32 27 67 59 12 9 56 90
5743 90 76 35 12 17 49 101 131 110 55 -9 -64 -83 -65 -65 -85 -95 -104 -139 -183 -229 -256 -241 -200 -147 -110 -86 -57 -29 -1 23 1 -44 -21 62 117 130 131
5735 131 87 -24 -152 -255 -306 -300 -278 -263 -229 -157 -78 -16 24 4 -69 -129 -172 -225 -269 -266 -206 -130 -88 -94 -112 -98 -78 -94 -147 -199 -230 -267 -308 -337 -325
5727 -325 -261 -198 -149 -103 -81 -67 -23 13 17 -6 -39 -46 -20 17 33 43 87 119 68 -40 -138 -158 -104 -19 93 221 294 272 196 98 12 -11 38 120
5719 120 178 187 165 117 17 -68 -103 -100 -100 -129 -154 -141 -71 30 104 145 166 146 107 70 29 19 45 74 126 201 240 245 249 245 229 218 189 140 53 -40 -67
5710 -67 -18 37 45 30 44 93 138 119 70 47 54 56 34 35 62 109 141 133 106 58 6 -17 -2 15 -16 -60 -64 -37 -7 15 16 5 -20 -68 -91 -60 2 71 123
5701 123 159 185 194 170 119 49 -16 -78 -127 -142 -121 -95 -81 -98 -128 -138 -138 -109 -84 -102 -101 -70 -47 -61 -88 -110 -122 -98 -59 -52 -80 -111 -121 -113 -92 -82 -124
5693 -124 -183 -202 -164 -113 -81 -58 -17 45 97 64 -33 -107 -125 -94 -51 -13 27 77 97 42 -49 -116 -123 -87 -54 -54 -77 -72 -27 26 45 17 -9 3 1 18 73
5684 73 101 91 30 -68 -151 -176 -128 -41 62 125 115 79 61 39 -11 -48 -44 -32 -25 -18 -16 -9 24 78 95 39 -58 -124 -125 -82 -59 -68 -80 -55 18 66 50 19
5676 19 20 33 60 109 107 23 -85 -181 -252 -277 -257 -196 -120 -78 -80 -86 -74 -62 -45 -40 -48 -41 -41 -63 -56 -15 8 19 33 14 -47 -101 -126 -131 -120 -84 -15 62 104 106
5667 106 92 74 49 12 -50 -112 -143 -155 -161 -142 -78 27 127 192 219 212 173 127 88 31 -9 42 137 190 187 159 104 19 -29 -26 -23 -28 -38 -52 -68 -82 -75
5658 -75 -51 -12 30 37 -12 -91 -90 25 138 176 169 137 52 -77 -194 -275 -304 -274 -193 -85 -11 2 -48 -105 -113 -98 -102 -123 -97 -41 -15 -38 -113 -193 -234
5650 -234 -213 -157 -125 -127 -127 -101 -47 6 19 3 -3 28 41 10 -18 -22 -22 -5 17 16 30 65 110 153 124 5 -129 -197 -215 -199 -138 -63 -6 32 41 14 -27
5641 -27 -46 -7 59 83 51 24 32 56 68 43 -12 -84 -140 -199 -242 -235 -212 -199 -193 -156 -80 -25 -8 -24 -46 -63 -93 -118 -144 -153 -157 -186 -208 -199 -175 -157 -158 -169 -156
5633 -156 -109 -59 -24 14 63 83 76 47 22 34 76 110 86 47 39 41 20 -17 -45 -73 -106 -105 -58 -15 -8 -55 -138 -190 -163 -129 -126 -117 -126 -139 -120 -102 -115 -155 -203
5624 -203 -218 -186 -127 -105 -141 -180 -186 -163 -117 -59 -26 -16 -13 -22 -42 -56 -58 -59 -65 -52 -17 18 40 43 40 80 108 59 -33 -93 -103 -120 -169 -218 -265 -305 -301 -245 -214
5615 -214 -224 -239 -248 -235 -211 -215 -233 -243 -232 -192 -141 -103 -85 -78 -87 -115 -151 -144 -95 -91 -141 -187 -188 -154 -129 -96 -67 -36 16 38 30 13 -18 -51 -69 -74 -53 -1 62
5606 62 98 103 79 22 -43 -96 -84 5 97 100 70 88 130 170 224 277 286 271 265 262 257 244 218 182 143 115 82 31 -17 -32 -30 -42 -84 -115 -86 -47 -53 -103 -168
5597 -168 -219 -235 -216 -170 -119 -67 -20 15 46 70 57 12 -33 -56 -64 -87 -128 -164 -207 -257 -294 -308 -304 -292 -287 -279 -245 -188 -146 -103 -47 -22 -43 -78 -98 -86 -49
5588 -49 -17 -21 -38 -50 -76 -93 -76 -33 -2 6 7 16 31 56 77 72 48 47 74 98 130 161 168 159 134 73 7 -40 -87 -141 -155 -118 -79 -83 -104 -83 -40 -47 -78 -52
5579 -52 23 60 45 8 -39 -84 -87 -76 -95 -100 -83 -47 -23 -7 28 49 58 44 1 -33 -32 0 52 89 89 76 68 50 48 64 47 -14 -90 -166 -215 -217 -183 -124 -72
5570 -72 -59 -77 -101 -120 -110 -91 -72 -53 -50 -50 -47 -57 -63 -60 -56 -48 -40 -39 -52 -66 -55 -14 54 129 189 185 116 32 -20 -31 -21 -15 -16 -7 -14 -67 -137 -186 -194 -171 -119 -23 49
5560 49 38 -26 -43 -22 -23 -50 -31 51 141 168 129 86 67 55 48 49 33 8 -8 -32 -48 -48 -52 -72 -130 -195 -233 -271 -296 -266 -224 -227 -256 -262 -219 -176 -166 -153 -137
5551 -137 -122 -106 -85 -53 -19 32 93 111 88 90 117 142 192 262 294 263 207 160 116 93 83 71 41 1 -27 -35 -25 -22 -46 -63 -49 -27 -15 -38 -91 -127
5543 -127 -117 -79 -58 -51 -62 -84 -117 -166 -208 -230 -207 -156 -101 -78 -93 -99 -82 -78 -91 -82 -42 4 7 -37 -58 -14 50 97 129 154 180 211 245 282 298 258 170
5534 170 85 28 0 8 28 46 30 -17 -77 -139 -189 -213 -199 -165 -113 -50 19 80 118 134 125 71 -4 -64 -81 -58 -35 -33 -38 -42 -67 -87 -75 -62 -71 -111 -146 -164
5526 -164 -198 -218 -203 -157 -59 59 145 178 166 154 123 66 24 -3 -47 -115 -146 -117 -39 32 62 81 121 159 141 66 -4 -25 -16 -43 -79 -75 -36 23 53
5518 53 61 78 123 147 106 69 89 131 178 199 168 104 23 -57 -88 -77 -71 -74 -55 -30 -8 40 86 98 83 85 129 177 208 246 294 346 349 277 208 180 173 170 169
5509 169 163 144 117 71 26 54 135 176 155 127 120 134 141 145 156 148 111 72 58 69 94 95 21 -84 -126 -76 4 68 133 184 195 173 132 80 56 68 90
5500 90 105 97 39 -32 -81 -124 -161 -185 -208 -216 -182 -136 -125 -124 -114 -104 -71 -44 -77 -147 -207 -242 -225 -173 -144 -152 -149 -119 -68 -24 -29 -86 -181 -228 -188 -127 -76 -46
5491 -46 -83 -174 -240 -261 -241 -206 -166 -138 -155 -194 -211 -219 -222 -188 -121 -61 -43 -30 3 33 27 -11 -24 12 47 60 118 204 246 231 178 131 97 65 59 80 93
5483 93 106 125 101 61 72 119 158 180 184 140 71 0 -51 -55 -40 -31 -36 -73 -115 -105 -19 66 97 77 36 -5 -53 -80 -74 -37 12 56 83 89 80 40 -26 -68 -85
5474 -85 -106 -116 -96 -59 -20 26 58 49 52 100 139 148 140 100 53 35 22 14 38 80 105 112 140 204 288 348 374 366 325 260 186 113 24 -71 -135 -178 -197 -185 -144
5465 -144 -107 -91 -85 -75 -90 -141 -199 -212 -188 -150 -113 -66 -17 -24 -63 -64 -72 -131 -189 -235 -258 -248 -227 -211 -190 -151 -141 -164 -176 -166 -164 -163 -146 -151 -163 -166 -154 -115 -63
5456 -63 -35 -22 -22 -66 -134 -187 -218 -193 -127 -47 -5 -20 -40 -31 -11 5 49 109 138 131 100 43 -12 -37 -36 -45 -78 -106 -115 -112 -117 -123 -113 -91 -56 -11 23 40 42 14
5447 14 -18 -29 -48 -93 -165 -239 -288 -307 -301 -296 -312 -342 -331 -293 -292 -329 -373 -393 -369 -322 -290 -253 -197 -174 -189 -199 -204 -189 -125 -40 28 50 15 -25 -10 6 -22
5438 -22 -58 -58 -32 -17 -45 -93 -148 -212 -266 -311 -357 -376 -355 -318 -286 -276 -274 -240 -160 -52 55 113 134 136 102 49 3 -20 -13 9 50 77 70 61 76 111 136
5430 136 116 77 73 81 58 -5 -71 -78 -42 -60 -151 -244 -286 -251 -183 -151 -177 -225 -237 -215 -209 -227 -230 -204 -164 -133 -118 -138 -154 -116 -55 -16 15 24 2 -10 7 30
5421 30 19 -32 -92 -109 -114 -126 -121 -102 -99 -135 -160 -127 -50 16 55 76 78 46 -12 -47 -52 -70 -98 -93 -51 -19 13 30 24 24 50 63 69 94 111 77 16 -16 0 22
5412 22 20 14 18 12 1 -5 -2 0 19 68 100 106 121 170 219 208 129 -15 -153 -214 -217 -180 -137 -95 -35 31 70 76 58 37 34 45 59 52 35 15 5 28 65 44
5403 44 -21 -61 -82 -101 -129 -177 -204 -178 -145 -147 -167 -145 -96 -95 -128 -173 -227 -245 -197 -105 -37 -17 -13 -1 -11 -75 -148 -198 -235 -238 -186 -108 -14 69 122 186 270
5394 270 305 268 202 109 -2 -111 -211 -274 -254 -168 -96 -89 -141 -180 -169 -134 -102 -72 -26 16 23 -11 -72 -108 -78 -20 23 64 84 52 -2 -44 -79 -102
5386 -102 -90 -54 -19 -1 -15 -54 -93 -145 -209 -248 -244 -223 -232 -259 -248 -194 -121 -39 28 81 120 134 137 130 126 128 128 130 129 77 21 34 105 177 180 97 -41 -161 -225
5377 -225 -263 -299 -308 -278 -221 -167 -149 -182 -242 -288 -318 -349 -353 -302 -237 -178 -131 -108 -91 -72 -65 -70 -82 -77 -24 79 134 126 103 83 78 102 146 210 266 301 316 315
5369 315 333 345 284 196 144 103 72 64 78 98 108 93 55 26 19 17 2 -4 5 15 12 9 -5 -37 -37 -25 -29 -62 -81 -67 -73 -100 -117 -120 -95 -41 27 88 109 94
5360 94 64 19 -35 -85 -122 -123 -84 -36 0 43 74 58 18 -48 -140 -230 -266 -257 -246 -233 -217 -204 -188 -176 -180 -208 -242 -242 -198 -128 -63 -32 -89 -217 -305 -281 -192
5351 -192 -127 -111 -122 -114 -28 73 95 60 28 9 13 54 92 108 84 25 -48 -113 -132 -123 -118 -110 -95 -75 -67 -72 -86 -85 -62 -3 48 5 -72 -100 -85 -69 -48 5
5342 5 71 129 175 205 193 133 53 -4 -38 -93 -175 -264 -320 -320 -280 -217 -150 -98 -80 -78 -61 -55 -75 -81 -59 -31 -19 -46 -75 -93 -125 -159 -165 -120 -53 24 91 88 40
5333 40 0 -1 24 3 -70 -124 -142 -164 -192 -208 -191 -148 -111 -102 -67 -5 17 16 60 141 251 345 373 330 229 105 9 -23 -7 36 70 61 37 23 34 51
5325 51 38 6 -11 -24 -61 -126 -201 -228 -207 -179 -148 -118 -98 -72 -39 0 41 75 69 -10 -139 -231 -228 -195 -134 -69 -53 -59 -59 -78 -112 -103 -75 -83 -106 -101 -71 -37
5316 -37 23 88 109 106 111 113 103 66 -29 -134 -190 -200 -190 -167 -143 -95 -31 -9 -13 -18 -19 -4 7 -7 -31 -37 -37 -60 -116 -184 -245 -267 -241 -202 -168 -104 13 114
5308 114 127 65 -19 -92 -145 -139 -90 -40 3 25 35 28 -15 -76 -125 -146 -153 -131 -74 -18 -15 -48 -89 -117 -144 -181 -199 -198 -207 -218 -187 -119 -73 -103 -163 -191 -158 -88
5299 -88 4 105 125 44 -72 -165 -228 -296 -356 -401 -444 -451 -404 -341 -269 -191 -122 -39 39 71 96 143 171 157 135 145 166 184 212 248 259 217 179 194 222
5291 222 207 139 65 27 36 60 67 50 -5 -44 -26 17 41 26 -10 -60 -110 -112 -69 -30 -13 -7 -29 -78 -119 -142 -161 -153 -145 -161 -177 -172 -161 -141 -123 -136 -170 -195
5282 -195 -199 -191 -187 -182 -157 -107 -48 -9 17 31 12 -11 -19 -33 -58 -66 -32 17 32 11 -38 -109 -144 -144 -150 -142 -123 -121 -141 -195 -266 -291 -253 -208 -175 -176 -198 -199 -202 -224 -216 -153
5272 -153 -106 -110 -118 -99 -80 -66 -40 -15 7 33 11 -42 -82 -116 -139 -130 -113 -87 -26 48 74 42 -24 -72 -88 -99 -100 -94 -93 -91 -71 -40 -21 -9 14 48 51 -4 -47
5263 -47 -19 42 87 100 73 11 -65 -121 -148 -153 -145 -131 -113 -91 -96 -120 -139 -142 -138 -157 -201 -210 -183 -171 -187 -219 -210 -153 -78 -36 -44 -78 -106 -118 -131 -151 -172 -159 -98
5254 -98 -62 -59 -42 -20 0 38 59 42 51 82 80 22 -94 -195 -199 -129 -46 15 40 74 97 60 -15 -100 -168 -196 -182 -165 -165 -170 -144 -78 -17 3 -12 -19 -11 -25
5246 -25 -72 -134 -196 -219 -192 -164 -165 -177 -157 -106 -60 -21 26 86 155 232 283 269 185 79 21 -14 -65 -96 -94 -72 -25 37 83 116 117 57 -69 -234 -367
5238 -367 -389 -323 -241 -199 -184 -154 -112 -51 13 32 19 -2 -30 -74 -114 -120 -77 -49 -57 -77 -106 -123 -122 -137 -144 -137 -149 -153 -149 -126 -75 -18 38 87 109 95 70 60
5229 60 87 135 164 168 168 163 136 99 66 39 10 -21 -40 -42 -24 20 35 29 35 21 -10 -25 -20 -7 27 78 88 41 -1 -6 7 28 51 81 140 221 279 296 266
5220 266 201 128 57 -2 -50 -85 -98 -102 -128 -155 -154 -136 -132 -126 -87 -68 -112 -160 -167 -157 -151 -125 -131 -207 -299 -365 -378 -312 -194 -89 -28 -23 -35 -16 42 100 92 59
5211 59 84 125 137 145 174 205 211 185 163 196 270 287 225 139 57 8 3 27 68 90 86 62 15 -22 -34 -58 -100 -133 -140 -145 -161 -162 -165 -194 -235 -259 -269 -226 -117
5202 -117 -13 39 85 136 120 37 -38 -84 -114 -145 -172 -208 -230 -223 -239 -276 -281 -247 -209 -190 -185 -179 -149 -80 -13 -3 -63 -146 -210 -266 -304 -313 -248 -109 -36 -54
5194 -54 -105 -96 -16 40 25 -36 -101 -135 -150 -183 -212 -199 -179 -206 -261 -267 -225 -194 -202 -188 -142 -101 -66 -52 -56 -60 -82 -127 -148 -153 -158 -166 -168 -144 -125 -107 -54 2 17 0
5185 0 -5 -12 -29 -31 -30 -26 -28 -30 17 80 142 206 252 273 263 234 196 141 93 61 35 21 9 -34 -83 -100 -91 -65 -40 -35 -40 -35 -3 14 -16 -81 -136 -166 -170 -166 -129 -47
5175 -47 11 -7 -79 -159 -230 -296 -337 -339 -325 -309 -287 -247 -212 -182 -158 -153 -159 -170 -172 -187 -220 -232 -207 -144 -75 -49 -58 -53 -51 -82 -129 -156 -148 -146 -129 -70 -15 8 8 23
5166 23 31 17 -5 -27 -4 70 115 105 68 16 -44 -71 -51 -15 29 73 80 64 50 19 -14 -29 -26 4 51 98 136 160 151 110 65 45 52 51 26 -7 -27 -7
5157 -7 27 22 12 41 94 141 155 149 142 118 84 64 75 133 219 261 220 139 88 57 36 60 82 62 31 6 -8 -36 -98 -151 -165 -142 -92 -59 -70 -116 -169
5149 -169 -206 -205 -196 -197 -221 -250 -247 -221 -187 -157 -159 -192 -190 -136 -66 -26 -39 -40 8 34 6 -44 -86 -115 -115 -79 -27 21 36 26 -12 -87 -170 -209 -181 -97 -13 -2 -23
5140 -23 -19 -15 -26 -44 -60 -78 -106 -154 -178 -170 -157 -128 -99 -116 -158 -166 -149 -134 -129 -140 -141 -129 -140 -180 -209 -231 -244 -221 -174 -116 -59 -34 -29 -63 -145 -205 -209 -187 -210
5131 -210 -240 -208 -137 -53 29 84 93 59 36 51 73 70 72 97 105 86 67 50 20 -26 -62 -65 -59 -107 -209 -299 -334 -328 -307 -295 -257 -164 -68 18 107 169 164 70
5122 70 -66 -163 -190 -176 -156 -142 -137 -119 -110 -129 -131 -101 -71 -54 -41 -26 -13 -35 -107 -203 -250 -185 -71 13 59 73 96 145 185 157 93 58 67 94 114 141
5114 141 159 150 122 71 39 49 65 40 -11 -34 -29 -80 -160 -216 -254 -242 -159 -92 -101 -111 -85 -69 -63 -64 -87 -138 -161 -108 -33 20 35 40 50 36 4 -11 8 42
5105 42 52 41 -10 -67 -61 -24 -24 -62 -112 -132 -131 -130 -104 -60 -27 -28 -74 -160 -248 -303 -335 -360 -372 -331 -249 -177 -130 -105 -98 -91 -68 -42 -26 -6 16 17 -4 -30 -58
5096 -58 -63 -37 13 55 54 21 -27 -75 -84 -47 -13 -11 -36 -59 -38 -7 7 24 37 45 33 -6 -35 -47 -52 -71 -88 -81 -33 52 135 198 206 171 161 167 139 78 18 -28
5087 -28 -62 -112 -185 -219 -179 -97 -18 37 72 97 127 145 129 77 14 3 16 -2 -65 -148 -191 -194 -195 -176 -108 -21 40 81 91 85 84 94 102 93 70 28 10 37
5078 37 90 139 174 181 165 158 165 140 74 -32 -118 -113 6 145 183 159 167 200 214 200 183 185 202 209 178 85 -38 -133 -214 -264 -266 -235 -189 -171 -158 -117 -78
5070 -78 -43 -30 -52 -109 -175 -187 -145 -64 54 126 116 87 73 43 10 -9 -46 -130 -216 -247 -227 -192 -152 -94 -42 -20 -24 -61 -104 -114 -114 -121 -153 -198 -237 -258
5061 -258 -254 -211 -105 20 114 145 146 134 96 69 71 48 -12 -67 -96 -92 -48 10 58 74 59 42 48 47 32 4 -54 -95 -56 40 134 189 204 184 145 104 68
5053 68 53 51 59 77 94 85 74 72 68 63 40 -26 -88 -106 -93 -86 -103 -142 -169 -154 -100 -45 -29 -13 27 44 -3 -77 -132 -155 -115 -66 -78 -93 -60 -3 3 -42 -90
5044 -90 -120 -131 -127 -124 -151 -200 -232 -245 -256 -238 -140 1 110 166 177 146 78 -9 -51 -25 11 39 62 77 95 94 69 26 -28 -63 -72 -63 -30 -5 -34 -113 -190
5035 -190 -198 -173 -190 -227 -253 -245 -217 -187 -124 -49 5 11 -15 -52 -83 -95 -85 -26 57 93 76 21 -50 -97 -113 -122 -121 -92 -46 -8 17 14 -10 -19 -4 14 42 107
5027 107 170 171 114 27 -54 -69 -10 43 55 64 82 99 114 127 128 117 100 78 81 99 71 24 9 16 1 -11 -6 -37 -110 -154 -144 -80 13 75 111 143 161 129
5018 129 62 19 11 -6 -46 -66 -61 -18 47 80 68 27 -7 1 27 43 46 44 44 52 79 118 161 186 178 137 91 71 80 63 -17 -124 -188 -167 -84 -11 17 22 21 30
5009 30 25 -15 -82 -133 -133 -98 -51 -16 -24 -55 -72 -53 -17 -13 -8 8 15 30 32 31 56 62 7 -68 -99 -95 -60 -18 -2 -14 -32 -38 -60 -92 -98 -93 -93 -88 -55 -7 13 7 -15
4999 -15 -55 -72 -51 -10 5 9 15 -9 -77 -140 -163 -146 -108 -66 -30 8 67 137 194 220 210 170 112 32 -38 -75 -68 -29 20 62 63 24 -4 -26 -46 -37 17 90
4990 90 152 186 205 213 195 189 222 268 252 171 99 71 57 39 26 4 -30 -38 -32 -81 -170 -217 -191 -116 -57 -40 -31 -1 31 39 32 39 60 91 115 148 198 246 246 187
4981 187 105 34 -8 -35 -91 -182 -265 -275 -210 -157 -149 -128 -56 17 50 56 20 -42 -108 -194 -270 -284 -248 -203 -156 -123 -113 -97 -89 -95 -93 -75 -46 -27 -37 -73 -114
4973 -114 -155 -179 -152 -95 -50 -40 -44 -34 -17 18 81 129 132 114 131 170 186 164 91 32 47 99 133 137 116 59 -15 -79 -113 -118 -95 -69 -58 -86 -155 -188 -192
4964 -192 -183 -147 -92 -29 7 16 39 46 -1 -81 -128 -109 -60 -24 4 35 64 65 39 39 82 128 116 58 3 -10 12 55 114 145 127 89 56 27 8 0 -1 -14
4955 -14 -75 -156 -194 -204 -199 -202 -202 -183 -163 -155 -160 -170 -156 -124 -112 -102 -78 -38 25 92 131 141 139 123 120 121 101 56 -3 -48 -59 -51 -32 30 116 157 156 128 87 67
4946 67 62 49 16 -41 -79 -71 -46 -26 13 32 -5 -28 -10 7 0 4 31 46 42 -3 -90 -123 -72 2 59 90 114 134 152 150 114 30 -61 -86 -56 -22 18 47
4937 47 58 83 112 135 160 185 170 100 22 -9 -38 -104 -144 -113 -46 -14 -29 -60 -78 -40 12 33 29 34 93 182 262 327 379 424 439 389 319 291 293 289 244
4929 244 179 136 114 107 122 190 247 211 126 70 75 130 170 151 84 15 -14 -12 -20 -30 -28 -11 13 -10 -56 -44 21 68 85 96 120 145 128 56 -13 -33 -10
4920 -10 30 99 172 218 264 300 287 263 253 243 239 246 233 203 182 168 161 166 200 254 296 306 272 234 206 174 149 157 189 220 241 225 188 160 126 72 13 -23
4912 -23 -23 -10 14 54 102 138 161 196 243 256 222 163 75 4 -4 22 71 132 190 212 181 131 109 124 137 140 118 78 54 41 45 72 98 110 125 162 214
4903 214 250 244 213 189 171 169 213 289 341 355 349 313 253 194 168 170 192 255 283 244 207 187 216 285 336 356 366 372 399 462 519 559 599 650 682 679 660 636
4894 636 596 557 567 615 678 727 751 755 733 700 683 676 646 610 562 516 506 491 464 482 554 645 739 857 966 1033 1073 1142 1260 1399 1526 1611 1646
4887 1646 1667 1703 1766 1870 1978 2044 2070 2098 2184 2345 2565 2828 3126 3445 3767 4100 4433 4781 5188 5686 6289 7012 7920 9074 10514
4881 10514 12246 14342 16878 19894 23336 26916 30012 31791 31685 29753 26622 23050 19578 16487 13886 11797 10145
4877 10145 8783 7641 6720 6004 5414 4891 4428 4011 3647 3343 3081 2878 2728 2592 2422 2194 1941 1711 1512 1341 1213 1140
4872 1140 1087 1059 1063 1069 1039 999 1015 1086 1155 1175 1139 1066 987 936 903 817 694 598 567 615 701 745 752 752 746 752 803 877 926 928 880 829 805 802 811 818 803 795 809
4863 809 842 864 850 840 870 960 1073 1156 1200 1224 1262 1327 1418 1508 1550 1515 1414 1295 1202 1130 1059 1003 968 908 829 801 827 869 948 1074 1190 1254
4856 1254 1311 1388 1476 1536 1568 1602 1652 1714 1782 1877 1993 2131 2312 2543 2804 3029 3232 3475 3744 4043 4438 4951 5492 6029 6622 7298
4850 7298 8112 9161 10503 12146 14161 16651 19677 23216 26996 30394 32565 32767 30908 27636 23818 20139 16943 14282
4846 14282 12081 10294 8860 7719 6816 6080 5463 4948 4524 4166 3869 3589 3286 2993 2749 2528 2324 2157 2019 1891 1768
4841 1768 1653 1545 1471 1465 1468 1408 1283 1138 1041 1008 1000 969 908 893 903 882 843 806 770 730 690 652 640 637 632 620 627 672 734 769 754 710 683 676 675 685
4833 685 683 661 649 675 704 715 695 646 592 560 542 512 462 430 476 603 721 768 769 779 813 827 825 830 836 845 877 901 881 831 775 750 801 903 985 1008
4824 1008 1003 1025 1104 1225 1346 1436 1487 1535 1617 1712 1768 1813 1909 2073 2264 2477 2696 2903 3128 3380 3677 4025 4400 4799 5223 5706 6324
4818 6324 7089 7978 9006 10248 11796 13684 16007 18850 22162 25703 29032 31362 31900 30476 27593 24019 20438 17251
4814 17251 14570 12352 10541 9084 7894 6917 6127 5452 4837 4278 3801 3444 3183 2974 2778 2585 2390 2172 1952 1760 1591
4809 1591 1443 1312 1198 1116 1075 1048 1000 958 951 959 968 973 946 897 866 828 739 650 641 658 645 622 623 623 564 463 390 364 381 418 437 439 428 406 366 303
4801 303 260 258 272 258 202 142 103 88 97 120 138 149 160 170 200 247 277 284 253 197 164 183 230 246 236 230 238 241 235 232 222 211 223 218 199 202 230 276 297 291
4792 291 294 316 324 288 216 129 62 48 59 88 124 137 120 113 137 180 199 163 93 9 -57 -55 -20 9 14 -9 -14 -3 -21 -62 -80 -50 31 116 181 219 231 219
4783 219 173 138 140 118 74 34 21 43 72 96 98 89 88 101 114 116 98 47 -35 -112 -162 -165 -95 23 128 194 235 246 208 128 31 -29 -62 -93 -103 -103 -112 -137
4774 -137 -150 -172 -195 -186 -141 -51 39 52 39 60 87 75 37 18 -12 -82 -180 -291 -366 -371 -332 -295 -253 -199 -192 -248 -288 -265 -166 -51 20 78 157 195 164
4766 164 111 73 74 85 75 64 31 -2 0 26 94 153 145 110 84 66 42 7 -36 -106 -201 -276 -290 -297 -328 -320 -270 -246 -279 -334 -366 -409 -419 -399 -374 -345 -321
4758 -321 -300 -308 -351 -388 -406 -414 -400 -333 -243 -221 -234 -193 -109 -28 31 58 75 119 141 116 79 28 -50 -118 -146 -164 -168 -174 -201 -237 -259 -236 -161 -99 -88 -87 -97
4749 -97 -149 -222 -271 -298 -299 -281 -266 -268 -258 -216 -181 -162 -124 -62 -22 -25 -34 -18 6 5 -16 -26 -18 -21 -40 -64 -89 -126 -178 -224 -247 -228 -188 -164 -184 -205 -186 -164 -172
4740 -172 -207 -231 -226 -202 -168 -145 -137 -96 -30 8 -10 -56 -90 -101 -95 -105 -129 -127 -120 -112 -99 -103 -116 -118 -112 -132 -161 -127 -65 -6 49 78 70 19 -15 0 24 33 23 7
4731 7 -9 -49 -106 -127 -88 -76 -105 -103 -54 4 21 -10 -66 -137 -208 -245 -235 -211 -193 -176 -140 -114 -143 -175 -172 -153 -107 -37 27 32 3 -3 5 25 66 91 89 79 68
4722 68 33 -8 -60 -141 -231 -303 -296 -205 -97 -22 -9 -62 -122 -142 -141 -148 -148 -138 -105 -65 -75 -114 -156 -202 -230 -238 -205 -139 -102 -115 -132 -140 -142 -123 -76 -41 -17 -5
4713 -5 -10 -24 -29 -38 -56 -72 -75 -58 -34 -3 43 61 38 8 -23 -43 -4 52 66 36 -12 -37 -42 -16 43 85 88 67 25 -21 -35 -27 -39 -47 -10 64 132 158 133 66
4704 66 -18 -77 -72 -13 18 -26 -89 -131 -139 -114 -94 -77 -68 -70 -52 -19 -20 -65 -99 -88 -48 18 104 169 200 209 173 79 -25 -75 -41 59 153 174 131 89 40
4696 40 -25 -80 -109 -111 -99 -62 -14 21 30 34 36 22 -11 -62 -104 -113 -120 -149 -167 -161 -144 -114 -76 -73 -99 -123 -105 -54 -27 -44 -72 -53 0 31 8 -52 -105 -122 -126 -152
4686 -152 -229 -325 -365 -355 -340 -296 -228 -160 -93 -22 43 72 78 51 -12 -57 -69 -71 -76 -70 -47 -23 11 78 145 198 229 231 235 255 286 283 206 115 70 68 84 101 129
4677 129 141 122 96 40 -56 -131 -158 -184 -202 -197 -189 -166 -118 -61 4 42 12 -42 -57 -49 -73 -121 -139 -118 -82 -58 -20 39 78 71 35 -8 -24 -30 -50 -68 -77 -104
4669 -104 -162 -189 -189 -215 -274 -305 -246 -120 -4 51 67 82 79 30 -74 -159 -193 -225 -268 -274 -223 -140 -63 -21 -35 -49 -24 -7 -34 -79 -124 -150 -158 -144 -117
4661 -117 -83 -64 -91 -108 -76 -11 73 148 198 228 240 245 262 255 206 163 149 118 40 -26 -58 -68 -60 -50 -13 27 38 30 8 -6 11 55 119 185 228 211 176
4652 176 166 169 185 193 171 150 151 182 240 272 259 219 157 93 13 -98 -177 -202 -213 -220 -217 -204 -144 -50 -3 -30 -77 -96 -105 -117 -103 -50 4 30 33 34 23 -4
4643 -4 -26 -41 -9 82 185 223 199 179 178 122 7 -90 -171 -228 -221 -166 -86 8 39 -6 -36 -30 -29 -30 7 93 151 145 73 -18 -47 -7 31 6 -44 -76 -68 -46
4635 -46 -46 -79 -140 -200 -223 -173 -76 -2 19 55 140 241 307 343 359 332 255 165 105 76 86 138 199 243 275 274 246 207 151 121 118 99 59 32 57 142
4626 142 239 297 312 292 271 276 314 379 461 518 545 582 640 741 879 1040 1219 1370 1473 1577 1714 1868 2065 2368 2776 3242 3759 4353
4620 4353 5071 5955 7069 8502 10328 12406 14297 15414 15308 14013 12051 10048 8316 6889 5728 4801 4085 3534 3075
4616 3075 2685 2342 2032 1756 1531 1346 1173 1014 909 876 845 805 764 723 689 639 567 483 396 313 247 189 122 69 49 42 9 -24 -21 26 86
4609 86 148 211 254 263 234 190 137 87 46 -2 -68 -141 -176 -161 -98 -47 -44 -56 -63 -63 -51 -40 -28 -11 7 34 74 131 158 123 86 83 90 70 49 46 34 -22 -75
4600 -75 -72 -43 -30 -24 15 59 88 105 76 35 28 70 125 157 168 198 255 289 277 262 264 249 221 214 216 200 195 196 163 149 197 258 308 348 368 378 365 325 271
4591 271 199 139 84 -4 -100 -161 -181 -183 -191 -186 -142 -44 76 163 211 238 215 142 77 38 -3 -3 52 103 144 165 137 56 -11 -23 -14 -25 -33 -9 15 8 -23 -36
4582 -36 -13 11 36 68 53 -11 -56 -58 -37 -14 22 73 113 147 169 177 188 219 264 281 291 310 320 311 269 238 241 239 195 144 131 105 33 -58 -134 -171 -156 -103
4573 -103 -38 25 81 106 91 42 12 26 40 36 19 -28 -103 -165 -186 -171 -116 -35 15 26 21 25 72 141 184 191 187 196 193 168 163 170 155 118 57 -36 -94 -77 -13
4564 -13 51 96 123 122 92 50 13 -25 -69 -111 -133 -102 -79 -82 -45 15 20 -52 -140 -186 -189 -171 -128 -86 -55 -14 58 124 140 103 49 18 47 138 214 205 102
4556 102 -30 -116 -120 -69 -3 52 98 130 101 42 11 -8 -20 -16 5 42 71 82 94 135 195 258 318 347 320 248 169 107 41 -26 -47 -29 -11 -4 1 -16
4547 -16 -58 -113 -137 -117 -97 -109 -124 -119 -102 -63 -6 38 62 57 28 26 67 113 121 69 -16 -89 -138 -186 -216 -220 -199 -129 -19 93 143 98 -13 -132 -218 -265
4539 -265 -299 -316 -333 -322 -251 -171 -151 -165 -169 -144 -109 -78 -35 15 44 53 53 61 95 141 121 35 -33 -40 -11 16 -1 -73 -135 -132 -98 -81 -70 -59 -65 -92 -95 -57 -28
4530 -28 -28 -22 13 52 86 100 85 74 85 114 131 128 127 119 99 116 169 188 152 84 5 -69 -117 -106 -66 -58 -64 -32 21 88 141 152 153 158 185 213 214 201 198 202 222
4521 222 237 203 152 135 147 175 208 202 142 72 23 -20 -66 -82 -53 -8 30 23 -9 -22 -37 -24 58 167 229 238 230 205 128 24 -47 -68 -49 -18 8 6
4512 6 -12 5 39 50 59 88 132 159 187 243 277 259 222 190 167 158 145 121 86 46 21 6 -16 -26 -15 15 10 -61 -124 -140 -121 -94 -74 -78 -104 -110 -76 6
4504 6 116 192 199 180 157 126 94 79 108 153 156 120 94 76 57 49 45 46 50 61 52 19 11 20 -4 -69 -165 -251 -283 -313 -360 -357 -323 -302 -286 -279 -286 -290 -263 -182 -90 -24
4494 -24 17 -3 -50 -83 -99 -113 -155 -202 -214 -206 -192 -171 -134 -94 -60 -22 -8 -4 24 55 50 27 57 124 133 53 -49 -95 -71 -28 -23 -32 -23 -22 -51 -81 -84 -38 19
4485 19 38 37 66 121 150 135 73 -3 -40 -13 28 54 38 -50 -171 -246 -254 -239 -240 -243 -219 -200 -179 -131 -89 -78 -71 -70 -63 -37 -4 19 5 -6 18 11 -29 -57 -63
4476 -63 -64 -69 -102 -150 -174 -175 -168 -142 -103 -59 -42 -88 -143 -156 -131 -100 -85 -91 -84 -61 -22 44 93 86 15 -79 -165 -236 -272 -281 -286 -283 -267 -251 -253 -247 -231 -225 -224 -216 -182 -105 10
4466 10 114 141 101 65 43 22 -2 -11 -22 -41 -58 -131 -226 -268 -246 -203 -159 -118 -102 -103 -120 -123 -83 -34 28 79 97 107 112 93 81 89 74 17 -48 -80 -72 -41
4458 -41 -35 -68 -108 -129 -124 -89 -49 -32 -49 -82 -113 -109 -58 -9 3 11 32 46 81 128 135 100 77 96 131 160 182 196 167 93 13 -39 -36 26 87 113 122 102 55
4449 55 27 2 -52 -99 -107 -70 -48 -46 -19 32 59 66 93 138 169 148 122 141 187 218 186 108 50 52 91 103 73 34 20 9 -26 -77 -135 -162 -140 -130 -156
4440 -156 -176 -178 -201 -215 -191 -161 -143 -114 -60 -3 18 25 24 1 17 49 55 39 45 113 181 204 210 232 253 250 225 198 177 167 160 145 110 42 -51 -122 -170 -210 -239
4431 -239 -246 -251 -225 -137 -47 -16 -9 13 57 114 102 6 -100 -163 -185 -178 -151 -124 -101 -79 -75 -95 -117 -87 -5 42 6 -55 -45 46 161 218 164 51 -12 8
4423 8 62 101 130 157 180 199 231 238 211 184 166 121 65 31 10 3 19 30 23 13 6 13 29 30 4 -18 -15 -17 -16 -18 -20 3 23 50 73 41 -16 -52 -30 11 37
4413 37 60 74 34 -33 -48 -20 16 65 128 162 164 145 153 194 225 205 131 59 43 74 126 185 219 213 187 147 101 64 44 48 60 78 87 62 37 18 -38 -107
4405 -107 -162 -190 -174 -125 -60 -18 -23 -51 -60 -65 -75 -68 -19 16 1 -19 -70 -176 -255 -261 -194 -135 -126 -118 -87 -32 12 17 -19 -54 -51 -21 18 44 61 87 130 189 254
4396 254 301 301 226 119 43 -12 -73 -124 -134 -125 -145 -180 -177 -150 -110 -60 -31 -18 -23 -75 -146 -203 -246 -274 -284 -253 -233 -259 -280 -293 -310 -307 -261 -195 -155 -110 -63
4387 -63 -29 5 45 91 103 67 16 -34 -67 -78 -71 -44 4 77 135 148 136 116 135 194 228 219 210 212 192 150 138 169 211 224 201 162 146 164 182 157 118
4379 118 75 19 -32 -56 -58 -79 -114 -138 -134 -101 -82 -97 -96 -61 -10 24 45 75 112 126 91 13 -54 -86 -85 -72 -72 -55 -32 -34 -39 -58 -102 -137 -159 -179 -189 -164
4370 -164 -115 -84 -79 -89 -111 -150 -227 -321 -370 -369 -333 -258 -171 -89 -10 70 140 187 213 216 183 135 123 166 240 286 285 254 186 116 77 50 25 -14 -91 -199
4362 -199 -293 -353 -383 -375 -312 -204 -114 -63 -10 43 100 134 115 72 38 16 -21 -56 -59 -62 -66 -27 64 163 239 267 247 202 161 129 99 95 125 170 187 152 90
4353 90 51 34 39 78 136 173 168 129 107 127 186 238 231 179 133 116 110 98 67 36 34 47 56 51 49 61 64 28 -37 -77 -78 -39 37 96 111 94 59 -8 -76 -78 -43
4344 -43 -19 -5 0 -15 -11 -17 -77 -147 -181 -176 -127 -60 -4 31 40 7 -77 -169 -233 -271 -266 -230 -212 -196 -127 -39 14 59 109 120 99 94 107 97 35 -30 -43 -20 -18
4335 -18 -39 -78 -93 -60 -11 2 -29 -47 -33 -15 1 23 26 15 26 46 32 6 -11 -31 -50 -70 -58 -20 37 115 179 188 133 65 4 -68 -109 -90 -61 -79
4327 -79 -114 -115 -73 -6 86 165 189 176 172 201 233 242 218 192 161 123 90 57 27 -28 -67 -38 25 51 53 88 129 127 76 2 -83 -148 -191 -201 -143 -44 32 59
4318 59 48 33 28 22 19 21 37 36 -36 -138 -186 -187 -186 -181 -185 -180 -136 -61 -1 1 -48 -123 -200 -246 -233 -177 -129 -106 -74 -56 -71 -112 -167 -180 -139 -90 -33 14 9 -15 -37
4308 -37 -53 -46 -28 -6 26 53 74 73 16 -42 -58 -53 -9 67 157 207 204 172 114 42 -23 -50 -25 18 33 21 16 21 27 32 22 19 45 37 -10 -33 -12 5 -16 -56
4299 -56 -97 -127 -126 -73 -3 36 46 80 157 212 202 194 209 204 178 142 107 76 36 5 -28 -92 -148 -184 -210 -202 -135 -10 89 95 22 -75 -142 -161 -138 -88 -47
4291 -47 -9 43 88 87 30 -45 -104 -94 -26 28 58 86 113 121 63 -3 -7 0 -16 -22 -34 -70 -100 -79 -23 38 82 97 102 119 152 150 108 57 38 48 53 60 64 48
4282 48 -10 -88 -115 -98 -91 -97 -107 -112 -120 -123 -97 -52 -9 10 -1 9 58 93 96 94 107 117 118 119 136 136 103 59 43 61 109 177 213 198 141 77 45 80 153 158 108
4272 108 56 11 0 22 56 94 108 97 78 53 24 -5 -19 -12 8 21 16 4 -9 0 22 39 49 30 -31 -109 -170 -202 -205 -158 -49 57 87 55 23 -4
4264 -4 8 54 87 109 100 53 3 -38 -76 -89 -80 -84 -95 -64 8 52 40 -1 -51 -74 -79 -100 -127 -108 -40 23 43 11 -42 -96 -174 -267 -317 -292 -211 -126 -62 -30
4255 -30 4 27 8 -41 -78 -86 -77 -58 -59 -63 -28 37 47 -38 -152 -232 -279 -320 -353 -350 -313 -265 -228 -209 -235 -273 -252 -182 -107 -38 -7 -27 -50 -45 -14 -13 -53 -104
4246 -104 -172 -240 -268 -241 -181 -125 -86 -64 -36 22 68 84 80 73 70 78 63 43 36 5 -62 -145 -224 -243 -177 -114 -120 -162 -163 -126 -92 -39 14 24 5 -37 -68 -57
4238 -57 -31 -10 36 86 123 143 130 69 5 5 60 128 165 168 157 137 107 50 5 -3 -27 -93 -165 -226 -268 -263 -230 -182 -128 -74 -33 -33 -53 -94 -151 -183 -184 -169
4229 -169 -143 -120 -96 -76 -84 -118 -155 -199 -238 -209 -99 13 69 125 190 198 147 94 54 13 -29 -77 -115 -125 -125 -140 -167 -188 -205 -220 -219 -176 -74 39 113
4221 113 168 243 328 407 475 499 487 459 395 301 171 36 -38 -44 -26 -9 8 18 -14 -57 -65 -44 -15 -29 -102 -197 -283 -294 -226 -143 -66 16 86 118 91
4213 91 40 21 46 91 81 28 -21 -69 -102 -92 -43 33 90 79 33 6 3 1 -21 -46 -49 -67 -115 -179 -224 -237 -249 -287 -331 -327 -285 -238 -192 -154 -146 -161 -178 -174
4204 -174 -142 -141 -178 -202 -198 -189 -217 -268 -281 -282 -239 -138 -27 71 140 160 128 69 37 58 100 137 122 74 46 32 17 12 17 34 44 -3 -117 -249 -317 -292
4196 -292 -220 -139 -69 -49 -59 -34 22 73 106 150 212 239 207 120 26 -55 -108 -143 -172 -178 -172 -169 -143 -107 -88 -64 -18 42 73 62 44 45 49 63 96 93 43 -6
4187 -6 -12 13 29 45 93 152 175 149 114 124 143 118 41 -40 -67 -13 76 130 118 68 8 -22 8 49 85 140 163 102 -10 -100 -132 -102 -75 -101 -147 -155
4179 -155 -109 -16 78 93 40 -34 -88 -84 -7 76 97 109 152 212 242 195 95 5 -61 -85 -62 -28 -6 -28 -71 -55 -18 -40 -109 -175 -199 -168 -119 -109 -135
4171 -135 -171 -177 -131 -83 -80 -92 -99 -113 -135 -152 -166 -184 -178 -123 -59 -16 44 115 130 103 106 115 50 -64 -159 -189 -153 -101 -35 20 50 80 115 156 194 234 278
4162 278 293 280 268 275 303 313 277 178 65 21 43 45 3 -7 25 61 85 92 74 84 133 174 174 135 66 -11 -51 -37 18 80 120 154 177 190 201 172
4154 172 132 110 102 89 17 -79 -126 -112 -68 -19 42 62 9 -65 -81 -54 -61 -82 -95 -89 -67 -20 58 105 76 13 -21 -3 30 50 39 8 -4 34 118 183
4146 183 187 133 67 50 71 70 18 -58 -108 -120 -125 -117 -78 -52 -87 -159 -200 -176 -100 -37 -18 20 94 158 185 151 64 -5 -14 15 56 91 114 131 145 122 35
4137 35 -44 -61 -25 -6 -45 -69 -56 -26 26 95 125 102 64 46 31 -5 -44 -54 -31 46 135 147 97 47 8 -39 -112 -203 -266 -289 -282 -254 -212 -157 -111 -86
4129 -86 -90 -108 -102 -79 -77 -75 -28 46 77 60 -1 -73 -114 -129 -111 -49 -3 7 0 11 22 10 17 52 64 34 -10 -35 -49 -57 -38 -4 -3 -4 22 42 26 -3 -24 -49
4120 -49 -65 -34 18 31 45 112 176 184 147 86 25 -11 -26 -34 -30 8 57 65 53 70 111 146 135 77 30 20 50 78 80 81 101 99 60 1 -40 -47 -37 -15 18
4111 18 26 -8 -75 -143 -192 -222 -260 -309 -305 -246 -222 -289 -380 -427 -411 -335 -234 -171 -152 -130 -76 6 81 88 52 27 13 -28 -89 -108 -111 -114 -93 -76 -60 -8 69
4102 69 117 142 162 169 168 188 271 372 391 333 275 200 77 -11 -19 19 66 95 124 172 202 204 198 199 192 156 92 1 -77 -113 -132 -133 -119 -97 -66 -40 -22 -10
4094 -10 11 61 138 169 137 112 138 168 166 136 72 -3 -42 -73 -118 -134 -122 -89 -62 -78 -107 -123 -117 -67 -21 -1 30 54 41 -14 -58 -45 -9 38 73 80 77
4085 77 91 109 122 110 74 33 10 -5 -17 -3 14 27 39 54 64 62 31 -7 -42 -89 -144 -180 -175 -137 -82 -21 23 20 -52 -128 -138 -111 -66 -4 52 86 105
4077 105 136 189 258 327 354 286 133 -21 -87 -58 -25 -9 8 22 15 -1 -6 -8 -1 -3 -25 -63 -55 -1 34 19 0 35 76 67 63 80 73 51 56 82 93 79 52
4068 52 -3 -80 -135 -147 -126 -83 -38 6 59 136 241 326 384 416 408 386 345 262 156 89 65 59 28 -27 -34 7 35 34 29 43 68 102 128 149 178 171 125
4059 125 81 60 81 98 93 102 124 132 112 93 68 14 -54 -85 -65 -1 70 123 140 110 45 -22 -61 -49 -19 -30 -58 -40 13 39 11 -27 -40 -27 1 35
4051 35 75 94 80 49 43 53 47 35 31 69 145 201 199 149 85 25 -7 -22 -10 54 139 211 234 197 116 14 -72 -89 -70 -64 -52 -4 54 74 67 71 68 46 9
4042 9 -24 -34 -20 22 61 68 77 94 87 55 28 13 -16 -52 -80 -105 -111 -80 -45 -48 -64 -25 36 56 58 96 161 185 147 71 -18 -103 -176 -223 -227 -231 -231 -208 -192 -182
4033 -182 -169 -162 -164 -162 -151 -123 -89 -73 -61 -37 -34 -53 -77 -73 -15 63 69 -9 -67 -53 -12 10 -3 -55 -105 -130 -137 -138 -150 -178 -203 -205 -178 -156 -134 -112 -105 -102 -105 -148 -222
4023 -222 -262 -289 -323 -380 -418 -383 -330 -278 -228 -193 -163 -163 -188 -202 -189 -185 -206 -231 -230 -214 -203 -151 -73 -11 35 74 92 76 25 -32 -67 -58 -33 -31 -16 26 56
4015 56 74 75 27 -52 -125 -114 -12 87 102 57 9 -23 -39 -18 44 112 147 147 131 107 65 14 -7 3 -3 -22 -60 -117 -184 -215 -191 -171 -162 -178 -227 -245 -190
4006 -190 -117 -83 -70 -71 -91 -104 -113 -124 -97 -29 33 68 58 9 -59 -144 -223 -260 -251 -206 -136 -79 -40 -13 -13 -25 -22 -5 8 30 67 72 39 -4 -57 -118 -165 -165
3997 -165 -130 -105 -69 -40 -46 -59 -42 3 43 50 47 44 24 -2 -27 -38 -39 -34 -12 9 -3 -19 -7 26 53 44 25 4 -30 -55 -43 9 76 103 55 -1 -6 -16 -66
3989 -66 -114 -142 -153 -162 -167 -135 -91 -51 -35 -66 -113 -146 -159 -173 -169 -148 -135 -156 -185 -183 -187 -205 -189 -139 -79 -29 -24 -53 -72 -40 4 24 35 58 84 83 80 87 84 79 84
3979 84 135 217 245 184 107 91 116 127 105 82 69 17 -72 -98 -70 -49 -51 -67 -70 -87 -106 -108 -127 -155 -161 -124 -81 -99 -160 -216 -235 -171 -64 11 -3 -70 -128
3971 -128 -169 -175 -154 -103 -52 -43 -64 -102 -125 -104 -42 16 30 55 93 101 111 128 92 11 -48 -75 -90 -72 -42 -9 7 -29 -110 -162 -146 -106 -72 -69 -95 -113 -108
3962 -108 -97 -103 -140 -201 -237 -212 -143 -82 -37 10 2 -61 -121 -156 -182 -195 -165 -95 -15 54 102 122 105 79 36 -23 -44 -47 -75 -115 -145 -161 -175 -191 -185 -158 -90
3954 -90 -16 -9 -42 -53 -7 64 103 77 2 -80 -103 -85 -108 -172 -232 -281 -314 -315 -284 -256 -238 -209 -140 -23 95 142 84 -21 -77 -78 -42 -12 -19 -33 -62 -77
3945 -77 -45 -22 -1 44 54 19 -28 -49 -34 -6 4 5 4 -4 -9 -12 -21 -24 -21 -26 -51 -73 -58 -19 29 64 58 -3 -83 -136 -151 -124 -71 -17 14 26 35 57 98 100 61
3936 61 41 34 18 -11 -38 -39 2 49 69 61 33 -12 -56 -106 -152 -136 -87 -54 -51 -73 -71 -35 -4 -7 -1 41 65 0 -103 -133 -106 -85 -103 -146 -155 -121 -91 -75 -64
$$ [...]
-1241A0
##END=		$$ NMR SPECTRUM
##END=		$$ LINK
