##TITLE=	Aug19-2022-lemw22.21.fid
##JCAMP-DX=	6.0	$$ MestReNova 14.3.3-33362
##DATA TYPE=	LINK
##BLOCKS=	1    
##ORIGIN=	Mestrelab Research S.L.
##OWNER=	hrzepa
##$MNOVA/METADATA=	(DOCUMENT,BASE64)
eyJuYW1lIjoiRG9jdW1lbnQgMSIsInBhZ2VzIjpbeyJpdGVtcyI6WyIxIiAgICAgXX1dfQ==
##TITLE=	Aug19-2022-lemw22.21.fid
##JCAMP-DX=	6.0	$$ MestReNova 14.3.3-33362
##DATA TYPE=	NMR SPECTRUM
##DATA CLASS=	XYDATA
##BLOCK_ID=	1
##ORIGIN=	Bruker BioSpin GmbH
##OWNER=	nmr
##NUMDIM=	1
##$MNOVA/METADATA=	(ITEM,BASE64)
eyJhbmdsZSI6MCwiYXhlcyI6eyJ4Ijp7Im1heCI6MjAuOTQ3MDg5OTk5OTQ0OTU3LCJtaW4iOi04Ljg
wMzQyODE2Njc1NzM3fSwieSI6eyJtYXgiOjIyNjgwMDI4Ljg3NSwibWluIjotMjA2MzEzOS45NDc3NT
M5MDYyfX0sInBvaW50cyI6W3sieCI6NTMyMSwieSI6NTgzNX0seyJ4Ijo4NzIyLCJ5Ijo1ODM1fSx7I
ngiOjg3MjIsInkiOjgyMDh9LHsieCI6NTMyMSwieSI6ODIwOH0seyJ4Ijo1MzIxLCJ5Ijo1ODM1fV0s
InoiOjB9
##.OBSERVE FREQUENCY=	400.15247108400001252
##.OBSERVE NUCLEUS=	^1H
##.SOLVENT NAME=	CDCl3
##.PULSE SEQUENCE=	zg30
##LONGDATE=	2022/08/19 22:06:56.000
##.ACQUISITIONMODE=	SIMULTANEOUS (DQD)
##$ORIGINAL FORMAT=	Bruker XWIN-NMR
##$MNOVA/SCALES_VERSION=	9
##$PARAMETER FILE=	(acqus, ASCII, /private/var/folders/bp/m_4195y96sx1d256lqvkcvym0000gq/T/3g6h6kCgQGyuqroCnSQmLg/S_S-1H/acqus, 0)
$$ ##TITLE= Parameter file, TopSpin 4.1.1
$$ ##JCAMPDX= 5.0
$$ ##DATATYPE= Parameter Values
$$ ##NPOINTS= 8	$$ modification sequence number
$$ ##ORIGIN= Bruker BioSpin GmbH
$$ ##OWNER= nmr
$$ $$ 2022-08-19 22:06:11.987 +0100  nmr@chpc-nmr400a
$$ $$ D:/data/lemw22/nmr/Aug19-2022-lemw22/21/acqus
$$ $$ process C:\Bruker\TopSpin4.1.1\prog\mod\xwish3.exe
$$ ##$ACQT0= -1.70581753891579
$$ ##$AMP= (0..31)
$$ 100 100 100 100 100 100 100 100 100 100 100 100 100 100 100 100 100 100
$$ 100 100 100 100 100 100 100 100 100 100 100 100 100 100
$$ ##$AMPCOIL= (0..32)
$$ -1 0 0 0 0 0 0 0 0 0 0 0 0 0 0 0 0 0 0 0 0 0 0 0 0 0 0 0 0 0 0 0 0
$$ ##$AQSEQ= 0
$$ ##$AQ_mod= 3
$$ ##$AUNM= <au_zg>
$$ ##$AUTOPOS= <42 >
$$ ##$BF1= 400.15
$$ ##$BF2= 400.15
$$ ##$BF3= 400.15
$$ ##$BF4= 400.15
$$ ##$BF5= 400.15
$$ ##$BF6= 400.15
$$ ##$BF7= 400.15
$$ ##$BF8= 400.15
$$ ##$BWFAC= (0..63)
$$ 0 0 0 0 0 0 0 0 0 0 0 0 0 0 0 0 0 0 0 0 0 0 0 0 0 0 0 0 0 0 0 0 0 0 0 0
$$ 0 0 0 0 0 0 0 0 0 0 0 0 0 0 0 0 0 0 0 0 0 0 0 0 0 0 0 0
$$ ##$BYTORDA= 0
$$ ##$CHANFCU= (0..24)
$$ 0 0 1 0 0 0 0 0 0 0 0 0 0 0 0 0 0 0 0 0 0 0 0 0 0
$$ ##$CHANREC= (0..24)
$$ 0 0 0 0 0 0 0 0 0 0 0 0 0 0 0 0 0 0 0 0 0 0 0 0 0
$$ ##$CHEMSTR= <none>
$$ ##$CNST= (0..63)
$$ 1 1 145 1 1 1 1 1 1 1 1 1 1 1 1 1 1 1 1 1 1 1 1 1 1 1 1 1 1 1 1 1 1 1 1
$$ 1 1 1 1 1 1 1 1 1 1 1 1 1 1 1 1 1 1 1 1 1 1 1 1 1 1 1 1 1
$$ ##$CPDPRG= (0..8)
$$ <> <> <> <> <mlev> <mlev> <mlev> <mlev> <mlev>
$$ ##$D= (0..63)
$$ 0 0.1 0 0 0 0 0 0 0 0.06 0 0 0 0 0 0 0.0002 0 0 0 0 0 0 0 0 0 0 0 0 0 0
$$ 0 0 0 0 0 0 0 0 0 0 0 0 0 0 0 0 0 0 0 0 0 0 0 0 0 0 0 0 0 0 0 0 0
$$ ##$DATE= 1660943216
$$ ##$DATE_START= 1660943122
$$ ##$DE= 8.794183
$$ ##$DECBNUC= <off>
$$ ##$DECIM= 1680
$$ ##$DECNUC= <off>
$$ ##$DECSTAT= 4
$$ ##$DIGMOD= 3
$$ ##$DIGTYP= 17
$$ ##$DR= 32
$$ ##$DS= 0
$$ [...]
$$ 1 1 1 1 0 0 0 0 0 0 0 0 0 0 0 0 0 0 0 0 0 0 0 0 0 0 0 0
$$ ##$ShimPowRng3= (0..63)
$$ 1 1 1 1 1 1 1 1 1 1 1 1 1 1 1 1 1 1 1 1 1 1 1 1 1 1 1 1 1 1 1 1 1 1 1 1
$$ 1 1 1 1 0 0 0 0 0 0 0 0 0 0 0 0 0 0 0 0 0 0 0 0 0 0 0 0
$$ ##$ShimPowType1= 8
$$ ##$ShimPowType2= 8
$$ ##$ShimPowType3= 0
$$ ##$ShimPowType4= 0
$$ ##$ShimPowType5= 0
$$ ##$ShimPowType6= 0
$$ ##$ShimPowType7= 0
$$ ##$ShimPowType8= 0
$$ ##$ShimSysActGrad= (0..63)
$$ 1 2 3 4 13 5 7 11 10 9 6 8 12 18 19 20 21 15 22 23 24 14 25 16 26 17 27
$$ 28 31 32 33 34 35 36 37 38 0 0 0 0 0 0 0 0 0 0 0 0 0 0 0 0 0 0 0 0 0 0
$$ 0 0 0 0 0 0
$$ ##$ShimSysAngle= <>
$$ ##$ShimSysFunc= (0..63)
$$ 1 2 3 4 5 6 7 8 9 10 0 37 38 35 16 15 14 13 12 11 28 27 26 25 24 23 36
$$ 22 30 29 20 21 34 33 32 31 17 18 19 0 0 0 0 0 0 0 0 0 0 0 0 0 0 0 0 0 0
$$ 0 0 0 0 0 0 0
$$ ##$ShimSysMatId= <292722aa.dat>
$$ ##$ShimSysMatrix= 1
$$ ##$ShimSysMinMaxUG= 130000
$$ ##$ShimSysOffset= <37mm>
$$ ##$ShimSysType= 4
$$ ##$ShimUnit= 3
$$ ##$SpectrOsVersion= <4.1.148.20201202>
$$ ##$TCubeEth= <192.168.180.22>
$$ ##$TCubeSeqDevice= <>
$$ ##$TOSITY= <no>
$$ ##$TRIPLO2= 0
$$ ##$TopSpinVersion= <TopSpin 4.1.1>
$$ ##$TrxFreqFormula= (0..23)
$$ <TrxFreqFormula(2.0,400150000.000000,'TRX',Trx(1.0,'TRX 1200.1',2,5.000000,1290.000000))>
$$ <TrxFreqFormula(2.0,400150000.000000,'TRX',Trx(1.0,'TRX 1200.2',2,5.000000,1290.000000))>
$$ <> <> <> <> <> <> <> <> <> <> <> <> <> <> <> <> <> <> <> <> <> <>
$$ ##$TrxPN= (0..23)
$$ <Z148391> <Z148391> <> <> <> <> <> <> <> <> <> <> <> <> <> <> <> <> <>
$$ <> <> <> <> <>
$$ ##$TrxSN= (0..23)
$$ <02953> <02954> <> <> <> <> <> <> <> <> <> <> <> <> <> <> <> <> <> <> <>
$$ <> <> <>
$$ ##$VCubeEth= (0..23)
$$ <no> <no> <no> <no> <no> <no> <no> <no> <no> <no> <no> <no> <no> <no> <no>
$$ <no> <no> <no> <no> <no> <no> <no> <no> <no>
$$ ##$VTU= 2
$$ ##$VTUETH= <192.168.99.11>
$$ ##$VTUTY= <no>
$$ ##$ValueLine= no
$$ ##$VpuPN= (0..23)
$$ <no> <no> <no> <no> <no> <no> <no> <no> <no> <no> <no> <no> <no> <no> <no>
$$ <no> <no> <no> <no> <no> <no> <no> <no> <no>
$$ ##$VpuSN= (0..23)
$$ <no> <no> <no> <no> <no> <no> <no> <no> <no> <no> <no> <no> <no> <no> <no>
$$ <no> <no> <no> <no> <no> <no> <no> <no> <no>
$$ ##$WBREFAM= (0..31)
$$ 131 107.2 100 100 100 100 100 100 100 100 100 100 100 100 100 100 100 100
$$ 100 100 100 100 100 100 100 100 100 100 100 100 100 100
$$ ##$WBREFLM= (0..31)
$$ 0 0 0 0 0 0 0 0 0 0 0 0 0 0 0 0 0 0 0 0 0 0 0 0 0 0 0 0 0 0 0 0
$$ ##$WBREFPH= (0..31)
$$ 78.04 -68.39 0 0 0 0 0 0 0 0 0 0 0 0 0 0 0 0 0 0 0 0 0 0 0 0 0 0 0 0 0
$$ 0
$$ ##$WBSGU= (0..31)
$$ 2 0 1 0 0 0 0 0 0 0 0 0 0 0 0 0 0 0 0 0 0 0 0 0 0 0 0 0 0 0 0 0
$$ ##END=
$$ 
##$DECIM=	1680
##$DSPFVS=	21
##XUNITS=	HZ
##YUNITS=	ARBITRARY UNITS
##FIRSTX=	8381.9789324893681624
##LASTX=	-3522.6921461471579278
##DELTAX=	-0.090826125372023752691
##XFACTOR=	1
##YFACTOR=	629.23697622608108304
##FIRSTY=	942.94927978515625
##MINY=	-1319.07275390625
##MAXY=	20618208
##NPOINTS=	131072
##XYDATA=	(X++(Y..Y))
$$ [...]
3330EJ%%%j%jJjJ%%jjJJJjJ%j%kKj%jJ%%J%jKjjjJJj%J%jJ%%K%jjjjK%JjJ%JJJ%jJJ%%%j%
3323I%%%Jj%J%%JjJ%%Jj%Kj%%jk%J%%j%%%%jKJJKKMKLMLKJJJ%%%jmjlljj%KLLKKJKj%jjjj
3317C3lnmmlkj%jkJj%%%J%kj%%KkjJ%%J%jj%%J%%%jJ%J%j%%%%%Jj%%%%%jjJJ%jJ%j%JJjJJ
3310H%jjJj%%JjJ%%%%jJ%%jj%j%KJ%%%j%kJJj%K%%K%%%%Jjj%j%j%jJj%JJjKJj%K%%%%Jj%%
3304A0%%K%%JJ%JJj%Jlk%%kj%J%j%%%JKKJ%JKjJ%k%klj%%%j%%j%L%KKj%%j%%kj%j%%Jj%%%
3297HJJjJ%JK%%Jjjjjjjj%JJ%jjJ%%%%%%kJJjj%%JJ%%%jjJ%%%%%%j%J%J%jjJjJ%J%%j%%%j
3291FJ%%J%J%jljJK%KJjK%%L%JJKJ%jkjjJlj%%%%JjJJ%JKJ%JKJJkkjkjk%%%j%%Jj%JjJJ%J
3285A4j%j%k%JJjKjj%%J%J%J%%J%%jj%%jJkj%%JJ%K%J%JjJJj%k%jj%j%k%%jJjJ%J%%%JJ%%
$$ plain form
3330 5 6 6 6 6 5 5 4 5 4 5 5 5 4 3 4 5 6 5 6 6 5 5 3 5 4 4 3 4 4 4 5 5 4 6 5 4 3 4 5 4 4 5 5 4 5 5 5 7 7 6 5 4 3 5 5 6 5 6 6 7 8 9 9 8 9 10 10 10 10 9 9
3323 9 9 9 9 10 9 9 10 10 10 11 10 11 11 11 12 11 11 13 12 12 12 11 9 9 10 10 10 9 9 9 9 9 8 10 11 12 14 16 20 22 25 29 32 34 35 36 37 37 37 37 36 32 31 28 25 24 23 23 25 28 31 33 35 36 38 37 37 36 35 34 33
3317 33 30 25 21 17 14 12 11 11 10 8 9 8 8 8 8 9 9 7 6 6 6 8 6 5 6 6 6 7 7 6 5 5 5 6 6 6 6 5 6 6 7 7 6 6 6 6 6 6 7 6 6 6 6 6 6 5 4 5 6 6 5 6 6 5 5 6 7 6 7 8
3310 8 8 7 6 7 6 6 6 7 6 7 7 7 7 7 6 7 7 7 6 5 5 4 4 6 7 7 7 7 6 6 4 5 6 5 5 7 7 7 9 9 9 9 9 10 9 8 8 7 7 6 6 5 6 5 5 6 7 6 8 9 8 8 10 10 10 10 10 11 10 10 10
3304 10 10 10 12 12 12 13 14 14 15 16 15 15 16 13 11 11 11 9 8 8 9 9 8 8 8 8 9 11 13 14 14 15 17 16 17 17 15 15 13 10 9 9 9 9 8 8 8 7 7 10 10 12 14 13 13 13 12 12 12 10 9 9 8 8 8 9 8 8 8 8
3297 8 9 10 9 10 10 11 13 13 13 14 13 12 11 10 9 8 7 7 8 9 9 8 7 8 8 8 8 8 8 8 6 7 8 7 6 6 6 7 8 8 8 8 7 6 7 7 7 7 7 7 7 6 6 7 7 8 8 7 6 7 6 7 7 8 8 8 7 7 7 7 6
3291 6 7 7 7 8 8 9 9 8 5 4 5 7 7 9 10 9 11 11 11 14 14 15 16 18 19 19 18 16 15 14 15 12 11 11 11 11 11 12 11 12 13 13 14 16 17 17 18 20 21 22 20 18 17 15 14 12 12 12 12 11 11 11 12 11 11 12 11 12 13 13 14
3285 14 13 13 12 12 10 10 11 12 11 13 12 11 11 11 12 12 13 13 14 14 14 15 15 15 14 13 13 13 12 13 11 10 10 10 11 12 12 14 14 15 15 16 15 16 17 16 16 14 14 13 12 12 11 11 9 9 9 8 9 8 9 9 10 10 10 10 11 12 12 12
3278A2%JJ%jjjjJKJ%J%LKNNMONKLJjknomomjkjJJJJKKMNMNNOLKkllmomnk%%jjJJJJJJJLLK
3272D5NMMONOMMKKL%JMNPOQPMKKJLLOQJ1J2J4J2J1J2J1RJ3J7K3L1L6N0O5Q4J12J51K13K98
3268A342M13N46O63P32P28O50M94K47p6l85n88p00p59p37o10m32k77j65q7k8K6P7J47K34L50
3265A805M88O34P39P65O95N47L29K6l16n87p18p70p76p13n66m04k73j86j28r4o9n1l9k9k1
3263B88j5j3j2j0j0j1j4j5j3j0qoljLMMPRJ0J3J2J2QMlrj4j7k0k0j7j6j0j0pnl%JMPJ0J4J7
3259A35J4J4J0Mkrj4j7j7j7j5j2romkkk%jjJ%kJJ%%LLMNQJ1J5K1K8L4L5L4K9K1Qok2k8l4l6
3255A81l5k8j7j3pljJNPJ3J8K6L2L6L7L2K2J5mk1l0l6l4l7l3k4j6j3j0nmnmllj%j%j%%JJ%
3250C8j%%jk%Jjkkkljjk%%JJ%%%%jjj%lk%j%k%%jJ%jJjJ%%JjJ%j%jJ%jj%jJ%jJjK%J%%jKj
$$ plain form
3278 12 12 13 14 14 13 12 11 10 11 13 14 14 15 15 18 20 25 30 34 40 45 47 50 51 50 48 43 37 33 27 23 22 20 19 20 21 22 23 25 27 31 36 40 45 50 56 59 61 59 56 53 49 43 39 34 32 32 32 31 30 31 32 33 34 35 36 37 40 43 45
3272 45 50 54 58 64 69 75 79 83 85 87 90 90 91 95 100 107 113 121 128 132 134 136 137 140 143 149 157 168 180 194 206 217 229 240 249 262 279 302 333 369 419 484 568 680 831 1044 1342
3268 1342 1755 2301 2964 3696 4424 5074 5568 5815 5739 5354 4766 4066 3307 2570 1960 1528 1251 1086 999 971 997 1074 1221 1455 1805
3265 1805 2293 2927 3666 4431 5126 5673 6002 6028 5712 5125 4407 3637 2861 2148 1582 1178 905 719 591 497 428 377 338 309 288
3263 288 273 260 248 238 228 217 203 188 175 165 157 151 148 147 150 154 158 165 174 184 197 209 221 229 233 230 221 207 190 170 150 133 117 107 97 90 85 82 82 83 87 94 104 118 135
3259 135 149 163 173 177 175 166 152 135 118 101 86 74 65 59 55 53 51 49 49 48 47 48 48 46 47 48 48 48 51 54 58 63 71 82 97 118 146 180 215 249 278 299 307 301 279 251 217 181
3255 181 146 118 101 88 81 78 77 78 83 90 103 121 147 179 215 252 284 306 321 317 296 266 230 196 159 126 102 86 73 63 58 54 49 45 42 39 38 38 37 37 36 36 36 37 38 38
3250 38 37 37 37 36 34 34 35 34 32 30 28 25 24 23 21 21 21 22 23 23 23 23 23 22 21 20 20 17 15 15 14 14 12 12 12 11 12 12 11 12 11 12 12 12 13 12 13 13 12 12 11 12 12 11 10 10 9 10 10 9 10 9 11 11 12 12 12 11 13 12
3244A2J%%%%j%%j%J%jJ%j%Jj%jJ%JJ%jjKjJ%jJ%j%%%JJ%jkJKjJJ%KKMMLKKLkkllljjk%%%%
3238B0%%JJMKKOOOJ1J4J5J7J9J8J2Olj0j8k2k2j9j4qonjJJJKLNRJ3J5J8J8J5J1Mnj5k0k2k1
3233F5j5j0pnl%kk%J%%k%%%Jjkjj%jj%J%KJJKKJNLLJjjmkkljlj%l%J%%jLKKLJKJKKjlkmlm
3227A6k%kjj%Jj%jjJ%JjJ%%%%J%kJj%JJ%%J%%JJKj%%k%k%%kJ%%J%%%%JKJ%J%%%jjJjjjjJj
3221A1j%Kjj%J%jjJJ%%%jjKj%%j%j%%j%JjJJJ%k%j%K%%%Jjj%Jj%J%%%J%%%j%%%%jJkJJJ%%
3214A0J%kJj%%%J%j%%%J%JJJk%Jj%jj%%%JJ%j%KKj%%Jj%Jk%%Jj%jjJK%%jJJJJ%jjJKjJJJJ
3208B0%J%kjJ%kj%jJjJjJJK%%JKL%JJK%jkjmkjj%jj%J%%%Kj%JKj%LJjk%%%%kk%JJKJJ%JLL
3202B9KKKLLJ%%jlnkjj%%%JKLNKMOMMK%jlmllmlkjkjJ%KKJKJJjkkkkkjljkjjjj%jj%%j%Jj
$$ plain form
3244 12 13 13 13 13 13 12 12 12 11 11 12 12 11 12 12 11 11 12 11 11 10 11 11 12 13 13 12 11 13 12 13 13 12 13 13 12 12 12 12 13 14 14 13 11 12 14 13 14 15 15 17 19 23 27 30 32 34 37 35 33 30 27 24 23 22 20 20 20 20 20
3238 20 20 20 21 22 26 28 30 36 42 48 59 73 88 105 124 142 154 160 157 147 129 107 85 66 52 44 38 33 32 33 34 35 37 40 45 54 67 82 100 118 133 144 148 143 128 108 86 65
3233 65 50 40 33 28 25 25 23 21 21 22 22 22 20 20 20 20 21 20 18 17 16 16 15 14 14 15 15 17 18 19 21 23 24 29 32 35 36 35 34 30 28 26 23 22 19 18 18 15 15 16 16 16 15 18 20 22 25 26 28 29 31 33 32 29 27 23 20 16
3227 16 14 14 12 11 10 10 11 10 10 9 8 9 9 10 9 10 10 10 10 10 11 11 9 10 9 9 10 11 11 11 12 12 12 13 14 16 15 15 15 13 13 11 11 11 9 10 10 10 11 11 11 11 11 12 14 15 15 16 16 16 16 15 14 15 14 13 12 11 12 11
3221 11 10 10 12 11 10 10 11 11 10 9 10 11 11 11 11 10 9 11 10 10 10 9 9 8 8 8 7 7 8 7 8 9 10 10 8 8 7 7 9 9 9 9 10 9 8 8 9 8 8 9 9 9 9 10 10 10 10 9 9 9 9 9 8 9 7 8 9 10 10 10
3214 10 11 11 9 10 9 9 9 9 10 10 9 9 9 9 10 10 11 12 13 11 11 12 11 11 10 9 9 9 9 10 11 11 10 10 12 14 13 13 13 14 13 13 14 12 12 12 13 12 12 11 10 11 13 13 13 12 13 14 15 16 16 15 14 15 17 16 17 18 19 20
3208 20 20 21 21 19 18 19 19 17 16 16 15 16 15 16 15 16 17 19 19 19 20 22 25 25 26 27 29 29 28 26 25 21 19 18 17 17 16 15 15 16 16 16 16 18 17 17 18 20 19 19 22 23 22 20 20 20 20 20 18 16 16 17 18 20 21 22 22 23 26 29
3202 29 31 33 35 38 41 42 42 42 41 38 33 31 30 29 29 29 29 30 32 35 40 42 46 52 56 60 62 62 61 58 54 51 48 44 41 39 38 36 35 36 36 38 40 41 43 44 45 44 42 40 38 36 34 33 30 29 27 26 25 24 23 23 22 21 21 21 20 20 21 20
3195B0jJ%LJKLJLLLLNMNQQQOKkmqpqml%JKKKJjJjjLMNPQNKKjmnmmkkkkkllkkj%JK%KL%Kkl
3189F0kmmmmmj%KJMMLJKkjkmljjJKLKMNJ0J1J5J9K2K4K0J4Nmj2j6j6j2m%JLjlonnlKMRJ2J7
3184A58K0J6J5QJpj4j4j1pjKJjmnpqpk%JLNPPJ0RJ1J1J4J7J6K1K3K8L5M7O2Q7J17J61K20K98
3180A343L78M40M38L60K07K4j62l33m57m79m04k93j97j29q4m8k2kK4M8P4J13J64K28L03L76
3177A910M11L87K87J28n0k24l76m66m56l72k73j91j34r7o9n1l7k8k0j5rqn%KQJ3J4J4QJqj8
3174B76k4k9k7k0j2j0mmjJJJKLLMMOOQQRJ0RJ1J5J8K2L0L7M9O5Q4J12J51K10K82L66M40M68
3171B580M14K74Q9j05k95m46n11m59l47k39j60j03o4l5j2J4L9O5J01J48K10K88L69M33M34
3169B682L46J86kj90l68m92n12m27l11k12j44j03p4n6m2l1k4k2j6j2j1rqoppooooommnkj%
$$ plain form
3195 20 19 20 20 23 24 26 29 30 33 36 39 42 47 51 56 64 72 80 86 88 86 82 74 67 59 55 52 52 53 55 57 59 60 59 60 59 58 61 65 70 77 85 90 92 94 93 89 84 80 76 74 72 70 68 66 63 60 58 56 55 55 56 58 58 60 63 63 65 63 60
3189 60 58 54 50 46 42 38 37 37 39 40 44 48 51 52 54 52 51 49 45 42 41 40 41 43 46 48 52 57 67 78 93 112 134 158 178 192 197 193 181 165 149 137 133 133 134 137 136 133 127 122 117 114 116 120 129 141 158
3184 158 178 194 209 217 218 211 197 183 172 165 164 166 167 166 162 157 150 142 135 133 133 134 137 142 149 156 166 175 186 197 211 228 244 265 288 316 351 398 460 547 664 825 1045 1343
3180 1343 1721 2161 2599 2959 3166 3190 3028 2695 2238 1759 1355 1062 865 736 652 604 582 580 604 652 726 839 1003 1231 1534 1910
3177 1910 2321 2708 2995 3123 3073 2849 2473 2007 1551 1179 906 715 581 484 415 364 327 299 279 264 255 247 242 242 244 252 265 279 293 301 302 294 276
3174 276 252 223 196 176 164 154 150 146 145 146 147 148 150 153 156 160 164 170 176 184 192 201 211 220 231 246 264 286 316 353 402 467 551 663 814 1024 1306 1672 2112 2580
3171 2580 2994 3268 3357 3252 2957 2511 2000 1541 1194 955 795 692 628 593 581 595 634 699 800 948 1158 1446 1815 2248 2682
3169 2682 3028 3214 3212 3022 2654 2162 1650 1223 912 700 556 453 379 323 281 250 226 204 188 176 165 156 148 142 135 128 122 116 110 104 98 94 90 85 83 82 82
3165H2KLLL%lmoommll%J%jj%kl%%KLKMjjnopnmkkl%j%jj%j%%%kJ%Jj%%Jjkjj%jJj%j%%jJJ
3159A9%JJ%%KJJJj%j%%%j%%kjJ%KLNONNMK%joomnlkkj%j%%%JKKNNNMK%lnnomlmjjkJ%%%%j
3152A4%%kJJ%JkJ%kj%Kj%%%%%%kjK%J%%JJ%%j%%%%%jjJ%jjJJj%J%%jJ%%j%%J%kjK%jJj%Kj
3146A1j%%%jK%J%%%%%k%JJjJ%%jJj%J%%%%%%%j%j%%j%%%Kjj%J%J%jjjKJjjj%J%%%%%j%K%%
3140A0j%jJ%JJjkJ%%%%%jJ%%j%K%kJ%JjjJ%KJ%kjJ%%%jjKjJ%jj%JjJJj%j%%%%JJ%%j%J%jj
3133HJ%%%%%%K%%%%%%j%%jjJ%j%%JKj%%%%J%J%jj%jkJJ%%%%%j%%%%%J%%%J%JjkJKk%%%%%j
3127HJ%%%%%jJjj%K%jJJj%%%j%K%jJj%J%J%jJ%jJ%kjK%Jjj%%%j%%JjJ%J%%j%%%JJjkjKJ%k
3121Hj%J%%%%%%%%J%%%%Jjj%J%%%%jK%j%jJjJj%J%%j%j%J%Jjj%Jj%L%kjKjj%%L%kj%JJk%%
$$ plain form
3165 82 84 87 90 93 93 90 86 80 74 70 66 63 60 60 61 61 60 59 59 57 54 54 54 56 59 61 65 64 63 58 52 45 40 36 34 32 29 29 28 28 27 26 26 25 25 25 25 23 24 24 25 24 24 24 25 24 22 21 20 20 19 20 19 19 18 18 18 17 18 19
3159 19 19 20 21 21 21 23 24 25 26 25 25 24 24 24 24 23 23 23 21 20 21 21 23 26 31 37 42 47 51 53 53 52 46 40 36 31 28 26 24 23 23 22 22 22 22 23 25 27 32 37 42 46 48 48 45 40 35 29 25 22 18 17 16 14 15 15 15 15 15 14
3152 14 14 14 12 13 14 14 15 13 14 14 12 11 11 13 12 12 12 12 12 12 12 10 9 11 11 12 12 12 13 14 14 14 13 13 13 13 13 13 12 11 12 12 11 10 11 12 11 11 12 12 12 11 12 12 12 11 11 11 12 12 10 9 11 11 10 11 10 10 12 11
3146 11 10 10 10 10 9 11 11 12 12 12 12 12 12 10 10 11 12 11 12 12 12 11 12 11 11 12 12 12 12 12 12 12 12 11 11 10 10 10 9 9 9 9 11 10 9 9 10 10 11 11 10 9 8 10 11 10 9 8 8 9 9 9 9 9 9 8 8 10 10 10
3140 10 9 9 8 9 9 10 11 10 8 9 9 9 9 9 9 8 9 9 9 8 8 10 10 8 9 9 10 9 8 9 9 11 12 12 10 9 10 10 10 10 9 8 10 9 10 10 9 8 8 9 8 9 10 9 9 8 8 8 8 8 9 10 10 10 9 9 10 10 9 8
3133 8 9 9 9 9 9 9 9 11 11 11 11 11 11 11 10 10 10 9 8 9 9 8 8 8 9 11 10 10 10 10 10 11 11 12 12 11 10 10 9 7 8 9 9 9 9 9 9 8 8 8 8 8 8 9 9 9 9 10 10 11 10 8 9 11 9 9 9 9 9 9 8
3127 8 9 9 9 9 9 9 8 9 8 7 7 9 9 8 9 10 9 9 9 9 8 8 10 10 9 10 9 9 10 10 11 11 10 11 11 10 11 11 9 8 10 10 11 10 9 9 9 9 8 8 8 9 8 9 9 10 10 10 9 9 9 9 10 11 10 8 7 9 10 10 8
3121 8 7 7 8 8 8 8 8 8 8 8 8 9 9 9 9 9 10 9 8 8 9 9 9 9 9 8 10 10 9 9 8 9 8 9 8 8 9 9 9 8 8 7 7 8 8 9 8 7 7 8 7 7 10 10 8 7 9 8 7 7 7 10 10 8 7 7 8 9 7 7 7
3114GKJj%%j%%%%JjjJKjJJjJj%JjJ%J%j%J%kJ%%%%%%Jj%%k%%%%j%J%%%%jJj%%%%%jJ%%Jj%
3108HJ%j%%jJ%J%%j%J%%jjJJJj%%J%Jj%%%%JjJ%%%%Jj%KjJk%JjjJJk%Jk%J%J%j%jjKj%%%j
3101HKj%%jJJjjJjJ%jJj%%%J%%%%%jKj%j%JjJJ%jJJjKJ%J%%%KJ%J%%%%kjJkjjJj%KJ%JJJJ
3095A9%%JJ%j%jj%jjjkjJ%%%jJ%%%%jJ%%Jjj%jjJj%j%%kJ%JJ%j%%Jj%JjJ%%%%K%%%jJ%J%J
3088A4%JKJ%%J%jjj%%kjkJJ%JjJKjJJ%%K%%jJjjjj%jj%%jj%jJlJ%j%K%j%%%%%j%%%Jjj%%%
3082G%J%J%%jj%JJ%jj%J%KjkJJJj%%%jjJJJj%Jj%%Jk%K%kj%%%J%%%j%jJJJ%%%%jjKjkJK%%
3076IJ%%%%J%%Jk%jJj%%j%J%%jJjJJ%jKJ%%j%%jjj%%%%KkJ%%j%%%Jj%JJjk%J%Jj%J%JjkLj
3069I%%j%J%jK%j%%J%%JJk%%jJ%JJ%%JjJ%j%%k%K%%J%j%%%J%j%J%Jj%jj%jJjJj%j%%Jjj%J
$$ plain form
3114 7 9 10 9 9 9 8 8 8 8 8 9 8 7 8 10 9 10 11 10 11 10 10 11 10 11 11 12 12 11 11 12 12 10 11 11 11 11 11 11 11 12 11 11 11 9 9 9 9 9 8 8 9 9 9 9 9 8 9 8 8 8 8 8 8 7 8 8 8 9 8 8
3108 8 9 9 8 8 8 7 8 8 9 9 9 8 8 9 9 9 8 7 8 9 10 9 9 9 10 10 11 10 10 10 10 10 11 10 11 11 11 11 11 12 11 11 13 12 13 11 11 12 11 10 11 12 10 10 11 9 9 10 10 11 11 10 10 9 8 10 9 9 9 9 8
3101 8 10 9 9 9 8 9 10 9 8 9 8 9 9 8 9 8 8 8 8 9 9 9 9 9 9 8 10 9 9 8 8 9 8 9 10 10 9 10 11 10 12 13 13 14 14 14 14 16 17 17 18 18 18 18 18 16 15 16 14 13 12 13 12 12 14 15 15 16 17 18 19
3095 19 19 19 20 21 21 20 20 19 18 18 17 16 15 13 12 13 13 13 13 12 13 13 13 13 13 12 13 13 13 14 13 12 12 11 10 11 10 10 9 9 9 7 8 8 9 10 10 9 9 9 10 9 9 10 9 10 10 10 10 10 12 12 12 12 11 12 12 13 13 14
3088 14 14 15 17 18 18 18 19 19 18 17 16 16 16 14 13 11 12 13 13 14 13 14 16 15 16 17 17 17 19 19 19 18 19 18 17 16 15 15 14 13 13 13 12 11 11 10 11 8 9 9 8 8 10 10 9 9 9 9 9 9 8 8 8 8 9 8 7 7 7 7
3082 7 7 8 8 9 9 9 8 7 7 8 9 9 8 7 7 8 8 10 9 7 8 9 10 9 9 9 9 8 7 8 9 10 9 9 10 9 9 9 10 8 8 10 10 8 7 7 7 7 8 8 8 8 7 7 6 7 8 9 9 9 9 9 8 7 9 8 6 7 9 9 9
3076 9 10 10 10 10 10 11 11 11 12 10 10 9 10 9 9 9 8 8 9 9 9 8 9 8 9 10 10 9 11 12 12 12 11 11 11 10 9 8 8 8 8 8 10 8 9 9 9 8 8 8 8 9 8 8 9 10 9 7 7 8 8 9 8 8 9 9 10 9 7 10 9
3069 9 9 9 8 8 9 9 8 10 10 9 9 9 10 10 10 11 12 10 10 10 9 10 10 11 12 12 12 13 12 13 13 12 12 12 10 10 12 12 12 13 13 12 12 12 12 13 13 12 12 13 13 14 13 13 12 11 11 10 11 10 11 10 10 9 9 9 10 9 8 8 9
3063ILj%%%J%%j%J%j%%kJJJ%jj%%J%%JjkJK%j%%j%%%K%jk%JJk%J%J%%J%%%%J%jkJJ%J%%%J
3056A4%jkjJ%%J%%kJ%j%JjJ%%%J%j%J%jJjjJ%J%kJJjj%J%J%%%jJJkJJk%%%%J%j%%J%Jj%%%
3050A2%j%%JJ%%%%%%j%K%%j%%%JJ%lj%jJ%J%Lj%%jjJjJjJ%%%%%JkJ%jj%%%%%%j%%JJ%jjK%
3043A2jJ%%jJ%jJ%%%%%%%%%Jj%jJK%KJj%%%jjJjj%%%%%%JjJJJ%JjjJJk%JJ%j%%JjJjj%%J%
3037A6%j%j%%JJJ%%jJK%%%%%j%k%j%Jj%J%j%J%JkjjJ%%JkjKJ%%%%jjJ%J%jJK%%%%%JK%%JJ
3031B2j%%J%%j%jj%jJ%%%j%%JJkJ%kkJ%j%j%jKKJj%%%%%%%j%JkJj%%%j%%J%%%K%jJjkjKkj
3024A2J%JJj%kJJ%%%%%%j%JjJkjJ%%jjJJJ%%k%Kj%Kj%jJJJjkJJJ%JJ%%%j%J%%j%J%%%%jJ%
3018A7%j%jKJ%%JjjJjjJ%j%%%jj%J%%%J%%jJ%%%jjJJ%kjJJJkJJ%JJKjj%%jJjjJ%%%J%J%%j
$$ plain form
3063 9 12 11 11 11 11 12 12 12 11 11 12 12 11 11 11 9 10 11 12 12 11 10 10 10 11 11 11 12 11 9 10 12 12 11 11 11 10 10 10 10 12 12 11 9 9 10 11 9 9 10 10 11 11 11 12 12 12 12 12 13 13 12 10 11 12 12 13 13 13 13 14
3056 14 14 13 11 10 11 11 11 12 12 12 10 11 11 10 10 11 10 11 11 11 11 12 12 11 11 12 12 11 12 11 10 11 11 12 12 10 11 12 11 10 10 11 11 12 12 12 12 11 12 13 11 12 13 11 11 11 11 11 12 12 11 11 11 12 12 13 12 12 12 12
3050 12 12 11 11 11 12 13 13 13 13 13 13 13 12 12 14 14 14 13 13 13 13 14 15 15 12 11 11 10 11 11 12 12 15 14 14 14 13 12 13 12 13 12 13 13 13 13 13 13 14 12 13 13 12 11 11 11 11 11 11 11 10 10 10 11 12 12 11 10 12 12
3043 12 11 12 12 12 11 12 12 11 12 12 12 12 12 12 12 12 12 12 13 12 12 11 12 14 14 16 17 16 16 16 16 15 14 15 14 13 13 13 13 13 13 13 14 13 14 15 16 16 17 16 15 16 17 15 15 16 17 17 16 16 16 17 16 17 16 15 15 15 16 16
3037 16 16 15 15 14 14 14 15 16 17 17 17 16 17 19 19 19 19 19 19 18 18 16 16 15 15 16 15 15 16 16 15 15 16 16 17 15 14 13 14 14 14 15 13 12 14 15 15 15 15 15 14 13 14 14 15 15 14 15 17 17 17 17 17 17 18 20 20 20 21 22
3031 22 21 21 21 22 22 22 21 21 20 19 19 18 19 19 19 19 18 18 18 19 20 18 19 19 17 15 16 16 15 15 14 14 13 15 17 18 17 17 17 17 17 17 17 17 16 16 17 15 16 15 15 15 15 14 14 14 15 15 15 15 17 17 16 17 16 14 13 15 13 12
3024 12 13 13 14 15 14 14 12 13 14 14 14 14 14 14 14 13 13 14 13 14 12 11 12 12 12 11 10 11 12 13 13 13 11 11 13 12 12 14 13 13 12 13 14 15 14 12 13 14 15 15 16 17 17 17 17 16 16 17 17 17 16 16 17 17 17 17 17 16 17 17
3018 17 17 16 16 15 17 18 18 18 19 18 17 18 17 16 17 17 16 16 16 16 15 14 14 15 15 15 15 16 16 16 15 16 16 16 16 15 14 15 16 16 14 13 14 15 16 14 15 16 16 17 18 20 19 18 18 18 17 18 17 16 17 17 17 17 18 18 19 19 19 18
3012A8j%J%J%j%%jjK%%jjJKJ%%%%J%%%kJ%%J%J%JJJJJJ%%Jjjjk%J%%JJLJ%MLJJJKjlkKJJK
3005D3KLLJLJ%Jk%J%%%jkJklj%klmkklkJjjj%Jjk%kj%jJ%%jJ%%JJJ%%JJJKJLK%%%kJJJ%JJ
2999D0%%JJKJj%klkkkjJ%jJJK%JKjKJLKJ%Jj%jJjKK%jlkkkj%jkkkkj%jj%j%jkjJjjjJKj%j
2993B1%KJjJ%KJkkJ%%Jjj%%Jk%jKJJjj%%%jjK%%%%%j%JjJ%K%%%jJ%%%%%J%%j%%k%jJJ%%jJ
2986B4JJ%%%j%%jJJjJ%jL%JJKJJLNLLLKLJjj%%%klnlklkjjj%%j%J%kj%%%j%%JjJjjJ%%J%%
2980B9%%%%KJ%J%%L%kJjjj%%KJK%J%KjJMMMKJKlmllklj%jJ%%KKLMKLK%K%%%kkjklmnljkjJ
2974C3%jkJ%Jj%%JjJJJ%J%%JJ%jJ%%%JKJ%KJKJKKjj%%%jKJ%%%jjjkjlkJJ%j%J%%J%jK%j%L
2967D6%%%LjjJJ%J%Jjj%kkl%jjJ%jK%%J%JKJjJJJJJJj%J%J%KKKLMOOPOMNJjkljk%JLKKK%k
$$ plain form
3012 18 17 17 18 18 19 19 18 18 18 17 16 18 18 18 17 16 17 19 20 20 20 20 20 21 21 21 21 19 20 20 20 21 21 22 22 23 24 25 26 27 28 28 28 29 28 27 26 24 24 25 25 25 26 27 30 31 31 35 38 39 40 41 43 42 39 37 39 40 41 43
3005 43 45 48 51 52 55 56 56 57 55 55 56 56 56 56 55 53 54 52 49 48 48 46 43 39 37 35 32 30 31 30 29 28 28 29 28 26 26 24 23 23 22 23 23 23 22 23 23 23 24 25 26 26 26 27 28 29 31 32 35 37 37 37 37 35 36 37 38 38 39 40
2999 40 40 40 41 42 44 45 44 44 42 39 37 35 33 32 33 33 32 33 34 36 36 37 39 38 40 41 44 46 47 47 48 47 47 46 47 46 48 50 50 49 46 44 42 40 39 39 38 36 34 32 30 29 29 28 27 27 26 26 25 23 22 23 22 21 20 21 23 22 22 21
2993 21 21 23 24 23 24 24 26 27 25 23 24 24 24 25 24 23 23 23 24 22 22 21 23 24 25 24 23 23 23 23 22 21 23 23 23 23 23 23 22 22 23 22 23 23 25 25 25 25 24 25 25 25 25 25 25 26 26 26 25 25 25 23 23 22 23 24 24 24 23 24
2986 24 25 26 26 26 26 25 25 25 24 25 26 25 26 26 25 28 28 29 30 32 33 34 37 42 45 48 51 53 56 57 56 55 55 55 55 53 50 45 42 40 37 35 34 33 32 32 32 31 31 32 32 30 29 29 29 29 28 28 28 29 28 29 28 27 28 28 28 29 29 29
2980 29 29 29 29 29 31 32 32 33 33 33 36 36 34 35 34 33 32 32 32 34 35 37 37 38 38 40 39 40 44 48 52 54 55 57 54 50 47 44 42 39 38 38 37 38 38 38 40 42 45 49 51 54 56 56 58 58 58 58 56 54 53 51 48 44 39 36 35 33 32 33
2974 33 33 32 30 31 31 32 31 31 31 32 31 32 33 34 34 35 35 35 36 37 37 36 37 37 37 37 38 40 41 41 43 44 46 47 49 51 50 49 49 49 49 48 50 51 51 51 51 50 49 48 46 45 42 40 41 42 42 41 41 42 42 42 43 43 42 44 44 43 43 46
2967 46 46 46 46 49 48 47 48 49 49 50 50 51 50 49 49 47 45 42 42 41 40 41 41 40 42 42 42 43 43 44 46 47 46 47 48 49 50 51 52 51 51 52 52 53 53 55 57 59 62 66 72 78 85 91 95 100 101 100 98 95 94 92 92 93 96 98 100 102 102 100
2961A00mmnoonmmkljkkjKJJJKLKK%jjkkjkjJ%%JK%%JJJJ%%j%lj%%kjj%%JK%JKL%KJJKJjKK
2955G3%%%JK%Jj%ljkjjkjl%J%%%JJJ%KL%J%Jkjlmkkkk%%k%%J%J%%JJJ%%%Jjj%jjkj%j%j%%
2948E0%Kjj%J%%J%jKKJjJKKJJJ%Jj%Jjkj%%%k%jJjj%K%JKKKJLJJ%jmjlkjkjjjJJLK%JKLM%
2942G1KKK%%%jklkljjkJj%KJjJJjjj%KKKJLKJJ%KLK%JLKJL%Jjlknlkm%j%LLLKL%j%kj%JKM
2935I1ONMML%j%lj%KLLOOKLK%JKJJKJ%lkkmlJJK%KMLLKMLOOJ1J3J6K1K6L0L1L2L1K3J6QOM
2930D34RJ7K2K7K2J5Plj1j3qmLQPONMPJ1J6K0K4K6L4M6O5R6J41K02K75L49M11M27L85K83J39
2927C504k6j90l15l78l68l05k22j37m7M5J44K50L53M37M72M45L51K07K9j49k93l84m12l83
2925B628l30k69k09j45p4KP0J20J38J23Q1K2l6p9r7q2m3JK0J3j9o1j03j29j34j11p3k6K0N9
$$ plain form
2961 100 96 92 87 81 75 70 66 62 60 57 56 54 52 51 53 54 55 56 58 61 63 65 65 64 63 61 59 58 56 55 56 56 56 57 59 59 59 60 61 62 63 63 63 62 62 59 58 58 58 56 55 54 54 54 55 57 57 58 60 63 63 65 66 67 69 70 69 71 73
2955 73 73 73 73 74 76 76 77 76 76 73 72 70 69 68 66 65 62 62 63 63 63 63 64 65 66 66 68 71 71 72 72 73 71 70 67 63 61 59 57 55 55 55 53 53 53 54 54 55 55 55 56 57 58 58 58 58 59 58 57 57 56 55 53 52 52 51 51 50 50 50
2948 50 50 52 51 50 50 51 51 51 52 52 51 53 55 56 55 56 58 60 61 62 63 63 64 63 63 64 63 61 60 60 60 60 58 58 57 58 57 56 56 58 58 59 61 63 65 66 69 70 71 71 70 66 65 62 60 59 57 56 55 54 55 56 59 61 61 62 64 67 71 71
2942 71 73 75 77 77 77 77 76 74 71 69 66 65 64 62 63 62 62 64 65 64 65 66 65 64 63 63 65 67 69 70 73 75 76 77 77 79 82 84 84 85 88 90 91 94 94 95 94 91 89 84 81 79 75 75 74 74 77 80 83 85 88 88 87 87 85 84 84 85 87 91
2935 91 97 102 106 110 113 113 112 112 109 108 108 110 113 116 122 128 130 133 135 135 136 138 139 140 142 143 143 140 138 136 132 129 130 131 133 133 135 139 142 145 147 151 154 160 166 177 190 206 227 253 283 314 346 377 400 416 424 430 434
2930 434 443 460 482 509 531 546 553 550 539 526 518 514 517 525 532 538 543 547 554 565 581 601 625 651 685 731 796 892 1033 1235 1510 1859 2270 2697 3082 3365 3504
2927 3504 3478 3288 2973 2595 2227 1922 1700 1563 1516 1561 1705 1955 2308 2745 3217 3662 4013 4220 4249 4100 3807 3423 3011 2628
2925 2628 2298 2029 1820 1675 1601 1603 1673 1793 1931 2054 2135 2157 2121 2042 1945 1863 1820 1821 1841 1854 1835 1774 1671 1542 1408 1297 1224 1198 1218 1277
2922A277R1J12J13R7O6K5j6n2p3p5o0l2%M1Q8J47K16K89L47L76L69L25K60J87J15M8on3r9
2919D123j61k27k76k88k67k23j69j18q2n8l6jN8J43K53L64M58N09N16M67L59J85k1k25l96
2917D887n22n95n94n27m18l02k15j53j20j05j01j07j17j24j23j14r3o7m6l2k2j6j2qppqpq
2914C17ppoppoqpqqrqoqolkJMPRJ4K0K5K6K5K0J3Jj0j8k6k4k4j8j2pkJMOQQOPNNMMPOMJjn
2909B98j1j3j3j1j0oppj1j0j1j1j0qoml%j%JJJKK%JJjKJ%NMLKKL%jkjkk%jjlllmkJjJjlml
2904A40lkj%JJK%Jjlklj%%JNOJ0J0J2J4J6J8K1K1J9J5J1Nnj3j3j4j3j0mLJ0K1L3M3M7L9K7
2900D64Qj2l1m7n2m6l3j9j1lMQJ6K4L5M5N2N1M1K6Lk3m1n6n9n2m3l0k0j6qn%JMNQOROOLJ%
2896B19jkKMRJ1J3J5J3J3J5J5J5J9K1K0K2K2J8J5J5J6K4L4N2P8J09J41J61J61J32Q1K2l0p6
$$ plain form
2922 1277 1368 1480 1593 1690 1756 1781 1765 1713 1640 1565 1505 1473 1473 1514 1602 1749 1965 2254 2601 2977 3346 3671 3931 4118 4233 4281 4275 4222 4123
2919 4123 3962 3735 3459 3171 2904 2681 2512 2394 2312 2254 2218 2217 2275 2418 2671 3035 3493 4002 4518 4985 5344 5529 5508 5283 4887
2917 4887 4365 3770 3176 2649 2231 1929 1714 1561 1441 1336 1235 1128 1011 887 764 650 557 490 444 412 390 374 362 354 347 340 332 325 317
2914 317 310 303 297 290 283 277 269 262 254 246 237 229 223 215 209 206 204 205 209 216 225 239 259 284 310 335 355 368 369 359 341 315 291 267 249 237 230 228 229 233 239 247 255 261 268 273 278 282 286 293 299 303 304 303 298
2909 298 287 274 261 250 240 234 227 220 209 199 188 177 167 159 153 149 146 146 145 145 146 147 148 150 152 152 153 154 153 155 156 156 161 165 168 170 172 175 175 174 172 171 169 167 167 166 165 162 159 156 152 150 151 150 151 150 147 143 140
2904 140 137 135 134 134 135 136 138 138 139 138 135 133 130 129 129 129 130 135 141 151 161 173 187 203 221 242 263 282 297 308 313 308 295 282 268 255 245 241 244 254 275 308 351 398 437 464
2900 464 472 460 429 382 330 284 251 232 221 218 222 230 246 270 305 350 402 453 494 520 523 500 459 403 344 292 249 219 199 183 175 170 170 171 175 180 188 194 203 209 215 218 219 219
2896 219 218 216 218 222 231 242 255 270 283 296 311 326 341 360 381 401 423 445 463 478 493 509 533 567 619 697 806 947 1108 1269 1401 1482 1504 1474 1398
2893A398r4p2j0O3J28J75J90J71J19M5m2j26j88k17k20j95j55j15q0n2l6k1j0KJ3K6L9N4O5
2890H55P4Q2R0R8J07J17J26J35J33J18J03R2R3J03J22J51J96K34K34J78Q4j6j11k00k68k78
2888B652k22j36n6K3R6J79K80M12N77P65R53J095J139J054Q38N24J50k40n99q52r51r26q36
2886E919o95n13l26j99j48j58j90k29k42k01q7N7J87K76L09K73J77L3j37k99m13m69m63m06
2883B056l17k22j44q6l9jM0Q1J15J36J28R1L8k4q5j35j54j42j09p4m5j6J1M2P5J05J44J76
2881A645K04K12J98J54R1J5m8q7q9n0L4J35K25K68K60K10J54J05P1N3O6R8J17J10Q0J2p6j71
2878C996k48l24l99m57m61l93k90j99j28q4n2k6oJ4L0L9M1L5L0K1J6J3J6K6L1L0K4K4K8M4
2876A391P9J30J99K77L66M50N18N56N57N13M17K65R1p4k12l21l72l33k02j0J95L37L41J96
$$ plain form
2893 1398 1304 1232 1222 1285 1413 1588 1778 1949 2068 2113 2071 1945 1757 1540 1320 1125 970 855 775 723 687 666 656 658 671 697 736 790 855
2890 855 929 1011 1101 1199 1306 1423 1549 1684 1817 1935 2038 2130 2223 2326 2448 2599 2795 3029 3263 3441 3525 3509 3398 3198 2930 2652
2888 2652 2430 2294 2238 2261 2357 2536 2816 3228 3805 4570 5523 6618 7757 8811 9649 10173 10323 10083 9484 8632 7681 6755 5919
2886 5919 5224 4711 4385 4186 4038 3880 3690 3461 3219 3018 2931 2988 3175 3451 3760 4033 4210 4243 4106 3807 3394 2925 2462 2056
2883 2056 1739 1517 1373 1287 1248 1247 1287 1368 1483 1619 1747 1838 1876 1852 1767 1632 1478 1336 1227 1153 1108 1092 1103 1145 1220 1325 1469 1645
2881 1645 1849 2061 2259 2413 2504 2519 2471 2384 2295 2245 2279 2414 2639 2907 3167 3377 3531 3636 3707 3760 3826 3924 4041 4151 4231 4243 4167 3996
2878 3996 3748 3424 3025 2568 2107 1714 1424 1225 1097 1013 961 935 929 943 973 1012 1053 1088 1118 1139 1155 1168 1184 1210 1241 1271 1295 1319 1347 1391
2876 1391 1470 1600 1799 2076 2442 2892 3410 3966 4523 5036 5453 5718 5809 5735 5523 5202 4830 4497 4295 4285 4480 4817 5158 5354
2873E354Mk04m59p15p90o31m64l58k79k14j67j28r5n9k8LK3L2K4Oj7m0o1p3p0n4l5j8mQJ7
2871E08L0M7O5Q1R0Q5O8L5pm9p8r7j04r3o6l5j2LJ6K5K8K9K6J9J2Krj8k0k2k4j9j5qLJ2K3
2867E31L6M8O5Q2J03J34J72K18K71L30L83M23M45M41M03L17J95N7q1k22l56m51m86m77m53
2865B128m10l45k68k01j49j13q6o8n4m4l9l1k7k2j8j5j3j1rppnnklnmkmlmllmlmmlnnlmkj
2861A10jk%JKNOPRJ3J4J8K1K2K0J9J5QJmj2j8k3k5k5k3k1j8j4j1ppllljlljjljjjjkJ%%J%
2856E5%%JjjJ%J%j%jjJj%%j%%%JJJJJJJ%jkj%j%%KJJKKJJjlmlkl%jkKK%JJJjkjjl%jj%%jj
2850D0j%%j%%%J%jJKJ%j%Kj%K%K%JMK%JJJkjljjk%jJJKJLKMONPPNQPMKJJklmoponommljJJ
2844F3LLKKJKJkkkklmljjjJ%%JJJj%%jkjjjk%%%jjjjJj%%%KNMMMMJKJkllljJLKMNNNKJkno
$$ plain form
2873 5354 5358 5154 4695 3980 3190 2559 2095 1737 1458 1244 1077 949 854 795 767 770 793 825 849 855 838 798 737 664 594 540 505 487 483 491 508
2871 508 538 585 650 731 821 906 974 1009 1002 953 875 778 674 581 515 480 468 471 487 512 540 569 595 614 626 628 619 601 581 559 535 516 501 493 496 508 531
2867 531 567 615 680 762 865 999 1171 1389 1660 1990 2373 2796 3241 3682 4085 4402 4597 4654 4573 4351 3995 3544 3058 2581 2128
2865 2128 1718 1373 1105 904 755 642 556 488 434 390 351 320 293 271 253 238 225 214 205 198 191 186 181 179 176 171 167 165 161 158 154 151 148 144 141 137 133 130 125 120 117 113 111 110
2861 110 109 107 107 108 110 115 121 128 137 150 164 182 203 225 245 264 279 287 288 284 272 254 231 206 181 158 137 119 105 94 87 80 77 74 71 70 67 64 63 62 59 58 57 56 55 53 54 54 54 55 55
2856 55 55 55 56 55 54 55 55 56 56 55 55 54 53 54 53 53 53 52 52 52 52 53 54 55 56 57 58 59 59 58 56 55 55 54 54 54 56 57 58 60 62 63 64 63 60 56 53 51 48 48 47 45 47 49 49 50 51 52 51 49 48 47 44 44 43 42 42 42 41 40
2850 40 39 39 39 38 38 38 38 39 39 38 39 41 42 42 41 41 43 42 42 44 44 46 46 47 51 53 53 54 55 56 54 53 50 49 48 46 46 45 46 47 49 50 53 55 59 65 70 77 84 89 97 104 108 110 111 112 110 107 103 97 90 84 79 73 69 65 62 61 62 63
2844 63 66 69 71 73 74 76 77 75 73 71 69 66 62 59 58 57 56 57 57 57 58 59 60 59 59 59 58 56 55 54 53 51 51 51 51 50 49 48 47 48 47 47 47 47 49 54 58 62 66 70 71 73 74 72 69 66 63 62 63 66 68 72 77 82 87 89 90 88 83 77
2837G7pomm%JjJLLJ%jjllklkj%ljjjj%jj%%%%%Jj%JK%JJ%jl%kkm%%j%kjj%%Kj%%JkJJjjkJ
2831B6J%%jJ%jJ%%%jj%J%J%%%%%J%JKJJJ%%%jk%kjkk%Jj%Jj%j%Jj%J%%%%%j%j%K%%%%%Jj%
2825B4JJj%Jj%%J%%JKJ%%J%jjk%%%JjJ%J%JKJKLK%JjJJJMMPQPRRNNNLKNMKJlpqj0j1j0rol
2818E6%JKKJJjkmmnlkjjj%%%%jj%%%%jjk%jj%JJJJjJJ%J%J%JJ%JKLMNNOOQNKJ%kkl%MMQRJ2
2812A18J3RQMKlpj0j2j2j0j2qqqmk%%Kj%%%jjllkjk%%KJjlk%j%j%JjJJ%jJjj%%%J%J%%KJK
2806D8KLK%K%klmjjj%KMOQPOLJkmmnjKNRJ0QPOKlpj0rrppqolmlkjJJjJ%%jJJ%%%jjK%j%K%
2800D0jJ%JjJJ%J%J%kj%jkkljj%%K%JK%j%kjjl%%jjJ%%j%J%%K%JJJKKNOOOQONK%looqrmlk
2794C9j%%%JJ%Kj%%%JjjJjjl%k%llj%J%%JJJKKJJJ%ljjlmlj%jjjJJ%%jkJ%JKj%j%JJj%JkJ
$$ plain form
2837 77 70 64 60 56 56 57 56 57 60 63 64 64 63 62 59 56 54 51 49 48 48 45 44 43 42 41 41 40 39 39 39 39 39 39 40 39 39 40 42 42 43 44 44 43 40 40 38 36 32 32 32 31 31 29 28 27 27 27 29 28 28 28 29 27 28 29 28 27 25 26
2831 26 27 27 27 26 27 27 26 27 27 27 27 26 25 25 26 26 27 27 27 27 27 27 28 28 29 31 32 33 34 34 34 34 33 31 31 29 28 26 24 24 25 24 24 25 24 24 23 23 24 23 23 24 24 24 24 24 24 23 23 22 22 24 24 24 24 24 24 25 24 24
2825 24 25 26 25 25 26 25 25 25 26 26 26 27 29 30 30 30 31 31 30 29 27 27 27 27 28 27 28 28 29 29 30 32 33 35 38 40 40 41 40 41 42 43 47 51 58 66 73 82 91 96 101 106 109 111 116 120 122 123 120 113 105 95 84 74 65 59 56
2818 56 56 57 59 61 62 63 62 60 56 52 47 44 42 41 40 39 39 39 39 39 38 37 37 37 37 37 36 35 33 33 32 31 31 32 33 34 35 34 35 36 36 37 37 38 38 39 40 40 41 43 46 50 55 60 66 72 80 85 87 88 88 86 84 81 81 85 89 97 106 118
2812 118 131 140 148 152 154 151 144 134 122 110 100 88 80 72 64 60 58 58 58 60 59 59 59 59 58 57 54 51 49 48 46 46 46 48 49 48 45 43 43 42 42 41 41 42 41 42 43 43 42 43 42 41 41 41 41 42 42 43 43 43 45 46 48
2806 48 50 53 55 55 57 57 55 52 48 47 46 45 45 47 51 57 65 72 78 81 82 80 76 72 67 66 68 73 82 92 100 107 113 115 112 105 95 86 77 70 63 55 49 46 42 39 37 36 37 38 37 38 38 38 37 38 39 39 39 39 38 37 39 39 38 38 40 40
2800 40 39 40 40 41 40 41 42 42 43 43 44 44 42 41 41 40 38 36 33 32 31 31 31 33 33 34 36 36 35 35 33 32 31 28 28 28 27 26 27 27 27 26 26 27 27 27 29 29 30 31 32 34 36 41 47 53 59 67 73 78 80 80 77 71 65 57 48 44 41 39
2794 39 38 38 38 38 39 40 40 42 41 41 41 41 42 41 40 41 40 39 36 36 34 34 31 28 27 27 28 28 28 29 30 31 33 35 36 37 38 38 35 34 33 30 26 23 22 22 21 20 19 20 21 21 21 20 18 19 19 20 22 21 21 20 20 21 22 21 21 22 20 21
2787B1J%jjJ%jJ%%%JjjjJ%jJ%J%J%jJ%%K%JLKjJ%KJJ%jjjkjjj%jkjjJk%JJK%Jj%j%jkjJjk
2781A7%J%j%%jJ%JJJjj%J%JjjKj%jJ%j%Jjj%%Jjjj%J%j%j%jKJ%%%jJj%%%%%jJjJJjJ%jk%K
2775A5%jjjK%Jj%%%jjK%%%j%%%J%Jj%%j%JJjJ%%jj%%J%%j%Kj%J%j%%K%kJj%%jJJj%J%%jJK
2768A7%JLKMLLJjkmnljkjJj%JkjJ%jj%Jj%J%%J%%J%%%kJ%%KkJj%jJKj%j%jJ%jjJ%%Jj%jJ%
2762A3JK%j%%%Jj%j%jJjkJj%JJj%%%j%%%%JJJj%jJ%%%jj%%%J%Jj%JjJjj%Kj%Jj%j%%J%%k%
2756A0J%jJ%Jk%j%J%jJ%%J%j%jJJ%%jJ%%J%j%jJj%J%%j%Jj%Jjj%JJ%%jjjJ%j%JJ%%%%%jJ%
2749A0J%%%%jj%%%%KJj%j%%Jjj%J%jJJ%%jk%%%JJjJ%Jj%Jk%%j%J%%%%J%jJJ%kj%J%%J%%jJ
2743A0jJJJj%JkJ%%jjJjjJ%%KjjJj%J%Jj%%%J%k%J%jJ%%%j%JJk%J%%j%jJj%%%%%jJ%%%KJj
$$ plain form
2787 21 22 22 21 20 21 21 20 21 21 21 21 22 21 20 19 20 20 19 20 20 21 21 22 22 21 22 22 22 24 24 25 28 30 29 30 30 32 33 34 34 33 32 31 29 28 27 26 26 25 23 22 21 22 20 20 21 22 24 24 25 24 24 23 23 22 20 19 20 19 17
2781 17 17 18 18 17 17 17 16 17 17 18 19 20 19 18 18 19 19 20 19 18 20 19 19 18 19 19 18 18 19 18 17 17 17 18 17 16 15 15 16 16 15 15 14 14 13 15 16 16 16 16 15 16 15 15 15 15 15 15 14 15 14 15 16 15 16 16 15 13 13 15
2775 15 15 14 13 12 14 14 15 14 14 14 14 13 12 14 14 14 14 13 13 13 13 14 14 15 14 14 14 13 13 14 15 14 15 15 15 14 13 13 13 14 14 14 13 13 15 14 14 15 15 14 14 14 16 16 14 15 14 14 14 13 14 15 14 14 15 15 15 14 15 17
2768 17 17 18 21 23 27 30 33 34 33 31 27 22 19 18 16 15 16 15 15 16 14 13 14 14 13 12 12 13 12 12 13 13 13 14 14 14 15 15 15 15 13 14 14 14 16 14 15 14 14 13 14 16 15 15 14 14 13 14 14 13 12 13 13 13 14 13 13 12 13 13
2762 13 14 16 16 15 15 15 15 16 15 15 14 14 13 14 13 11 12 11 11 12 13 12 12 12 12 11 11 11 11 11 12 13 14 13 13 12 13 13 13 13 12 11 11 11 11 12 12 13 12 12 13 12 13 12 11 11 13 12 12 13 12 12 11 11 11 12 12 12 10 10
2756 10 11 11 10 11 11 12 10 10 9 9 10 10 9 10 10 10 11 11 10 10 9 10 11 11 11 10 11 11 11 12 12 11 11 10 11 10 10 11 11 11 10 10 11 10 10 11 10 9 9 10 11 11 11 10 9 8 9 9 8 8 9 10 10 10 10 10 10 9 10 10
2749 10 11 11 11 11 11 10 9 9 9 9 9 11 12 11 11 10 10 10 11 10 9 9 10 10 9 10 11 11 11 10 8 8 8 8 9 10 9 10 10 11 10 10 11 9 9 9 8 8 9 9 9 9 9 10 10 9 10 11 11 9 8 8 9 9 9 10 10 10 9 10
2743 10 9 10 11 12 11 11 12 10 11 11 11 10 9 10 9 8 9 9 9 11 10 9 10 9 9 10 10 11 10 10 10 10 11 11 9 9 10 10 9 10 10 10 10 9 9 10 11 9 9 10 10 10 9 9 8 9 8 8 8 8 8 8 7 8 8 8 8 10 11 10
2737A0%%jjJJjjJJjj%%%%%JJ%jjJJ%kKJlJ%%%%%%%%JjJjKk%j%J%%%jJJjJjjJ%j%J%%%%Jj%
2730I%jjJJjjJ%%j%%%%%%KjKjj%jJ%%%%%jJ%%%J%j%j%%JJ%%jjjJKjJ%k%%JjJ%J%j%jJJJkj
2724GJJ%jJ%j%%%%%K%j%%%j%J%%%Jk%%%JjJJj%Jj%%%%%JkJjJ%jJ%%jJj%J%%%Jjj%%Jj%%j%
2717GjJJJkjJ%J%%%j%j%%%%%J%J%kJ%%K%%jJj%%J%Jj%j%j%%%jJJjK%J%jJjJ%%jjJ%jKjk%j
2711FKKjjj%KJjj%kKj%%J%j%%Jk%J%%%j%jJK%j%jJjJ%%jjJJjK%jjJJjj%%JjKjj%Kjj%JjjJ
2704FJ%%%%%JKkjKj%%%J%k%J%J%j%%jj%J%%kJ%J%jJj%%J%k%JjJ%Jj%Jj%%jJKl%Jj%JJjj%J
2698FJjjJ%%jJ%%J%J%jj%J%kJ%%%%J%j%JjJj%J%%%%%%%%%jJ%j%k%%%%J%%%%Kj%%Kjj%Jj%%
2692F%J%%%jj%JJ%jk%%%JJ%J%j%Jj%%%jJk%J%Jj%Ljj%%J%j%kKj%Kjj%jJ%%%%j%J%%J%jJkK
$$ plain form
2737 10 10 10 9 8 9 10 9 8 9 10 9 8 8 8 8 8 8 9 10 10 9 8 9 10 10 8 10 11 8 9 9 9 9 9 9 9 9 9 10 9 10 9 11 9 9 8 8 9 9 9 9 8 9 10 9 10 9 8 9 9 8 8 9 9 9 9 9 10 9 9
2730 9 9 8 7 8 9 8 7 8 8 8 7 7 7 7 7 7 7 9 8 10 9 8 8 7 8 8 8 8 8 8 7 8 8 8 8 9 9 8 8 7 7 7 8 9 9 9 8 7 6 7 9 8 9 9 7 7 7 8 7 8 8 9 9 8 8 7 8 9 10 8 7
2724 7 8 9 9 8 9 9 8 8 8 8 8 8 10 10 9 9 9 9 8 8 9 9 9 9 10 8 8 8 8 9 8 9 10 9 9 10 9 9 9 9 9 9 10 8 9 8 9 9 8 9 9 9 8 9 8 8 9 9 9 9 10 9 8 8 8 9 8 8 8 7 7
2717 7 6 7 8 9 7 6 7 7 8 8 8 8 7 7 6 6 6 6 6 6 7 7 8 8 6 7 7 7 9 9 9 8 9 8 8 8 9 9 10 9 9 8 8 7 7 7 7 6 7 8 7 9 9 10 10 9 10 9 10 10 10 9 8 9 9 8 10 9 7 7 6
2711 6 8 10 9 8 7 7 9 10 9 8 8 6 8 7 7 7 8 8 7 7 7 8 6 6 7 7 7 7 6 6 5 6 8 8 7 7 6 7 6 7 7 7 6 5 6 7 6 8 8 7 6 7 8 7 6 6 6 7 6 8 7 6 6 8 7 6 6 7 6 5 6
2704 6 7 7 7 7 7 7 8 10 8 7 9 8 8 8 8 9 9 7 7 8 8 9 9 8 8 8 7 6 6 7 7 7 5 6 6 7 7 6 7 6 6 6 7 7 5 5 6 5 6 6 7 6 6 7 6 6 6 5 6 8 5 5 6 5 5 6 7 6 5 5 6
2698 6 7 6 5 6 6 6 5 6 6 6 7 7 8 8 7 6 6 7 7 5 6 6 6 6 6 7 7 6 6 7 6 7 6 6 7 7 7 7 7 7 7 7 7 7 6 7 7 6 6 4 4 4 4 4 5 5 5 5 5 7 6 6 6 8 7 6 6 7 6 6 6
2692 6 6 7 7 7 7 6 5 5 6 7 7 6 4 4 4 4 5 6 6 7 7 6 6 7 6 6 6 6 5 6 4 4 5 5 6 5 5 8 7 6 6 6 7 7 6 6 4 6 5 5 7 6 5 5 4 5 5 5 5 5 4 4 5 5 5 6 6 5 6 4 6
2685Fj%J%jJ%j%%JjJ%kJ%%jK%%%kJJJ%%j%%J%%j%J%Jjj%jJjJ%%J%jJ%Jjj%%%jJj%KjjJ%Jj
2679F%%J%%jk%J%J%j%j%JKj%jjKJjj%%J%%%j%JjJJJ%j%jJj%%J%k%jJJ%j%Jj%%J%k%%KjJj%
2672EJj%%%%%%%%%%Jj%%%J%j%%%%%Kjj%JjJ%j%%%%jKJj%%%jJj%J%jJjJ%j%%%%%%%%%%J%j%
2666EJjjJjJJJjjjJ%jJ%%J%k%%J%%Jjj%%Kj%%%%%%J%kjJJJ%j%%%J%Jj%J%jj%%Jj%j%Kj%j%
2659D%JJjjj%%K%jJJj%j%%KJj%%%%%jj%Jjj%J%%JJjj%jjK%J%jJj%%J%j%J%jJ%%JkjJJ%jJ%
2653EjLjj%%Jjj%JjJK%jj%J%%%%kjJjJ%Jj%%jJ%jJ%%%%JJk%J%JkJj%jJ%J%%%JJjk%JkJJ%%
2646EjjK%%%%j%J%jJjkJ%J%jJJ%%%%Jjj%Jj%jJ%%%%J%%jJj%Jj%%j%JkJKj%%jJj%%J%%%%jJ
2640D%JjJJj%%%%K%%k%Jjjj%KjJJjj%J%j%%%j%JjJ%JjkJ%j%JJjJJ%%%%Jjj%%J%%jjJ%%%JJ
$$ plain form
2685 6 5 5 6 6 5 6 6 5 5 5 6 5 6 6 4 5 5 5 4 6 6 6 6 4 5 6 7 7 7 6 6 6 7 7 7 6 6 7 7 8 7 6 6 5 6 5 6 6 6 7 7 6 7 7 8 7 6 6 6 6 5 6 5 5 7 6 5 6 6 7 6
2679 6 6 6 7 7 7 6 4 4 5 5 6 6 5 5 4 4 5 7 6 6 5 4 6 7 6 5 5 5 6 6 6 6 5 5 6 5 6 7 8 8 7 7 6 7 6 6 6 7 7 5 5 4 5 6 6 5 5 6 5 5 5 6 6 4 4 4 6 5 6 5 5
2672 5 6 5 5 5 5 5 5 5 5 5 5 5 6 5 5 5 5 6 6 5 5 5 5 5 5 7 6 5 5 6 5 6 6 5 5 5 5 5 4 6 7 6 6 6 6 5 6 5 5 6 6 5 6 5 6 6 5 5 5 5 5 5 5 5 5 5 5 6 6 5 5
2666 5 6 5 4 5 4 5 6 7 6 5 4 5 5 4 5 5 5 6 6 4 4 4 5 5 5 6 5 4 4 4 6 5 5 5 5 5 5 5 6 6 4 3 4 5 6 6 5 5 5 5 6 6 7 6 6 7 7 6 5 5 5 6 5 5 4 4 6 5 5 4 4
2659 4 4 5 6 5 4 3 3 3 5 5 4 5 6 5 5 4 4 4 6 7 6 6 6 6 6 6 5 4 4 5 4 3 3 4 4 4 5 6 5 4 4 3 2 4 4 5 5 4 5 4 4 4 5 5 4 4 5 5 4 5 5 5 6 4 3 4 5 5 4 5 5
2653 5 4 7 6 5 5 5 6 5 4 4 5 4 5 7 7 6 5 5 6 6 6 6 6 4 3 4 3 4 4 5 4 4 4 3 4 4 3 4 4 4 4 4 5 6 4 4 5 5 6 4 5 4 4 3 4 4 5 5 5 5 6 7 6 4 4 5 3 4 5 5 5
2646 5 4 3 5 5 5 5 5 4 4 5 5 4 5 4 2 3 3 4 4 3 4 5 5 5 5 5 6 5 4 4 5 4 4 3 4 4 4 4 4 5 5 5 4 5 4 4 5 4 4 4 3 3 4 2 3 5 4 4 4 3 4 3 3 3 4 4 4 4 4 3 4
2640 4 4 5 4 5 6 5 5 5 5 5 7 7 7 5 5 6 5 4 3 3 5 4 5 6 5 4 4 5 5 4 4 4 4 3 3 4 3 4 4 5 4 2 3 3 2 2 3 4 3 4 5 5 5 5 5 6 5 4 4 4 5 5 5 4 3 4 4 4 4 5 6
2634Fj%%j%%%JJj%JjJ%jjJ%jJ%%jJj%%j%JJ%%%%%%%%k%JJ%%%jj%%Jj%JJJjjJ%%%j%%jJ%%j
2627CJJJj%%%%%jJJj%j%%%J%%j%jJ%J%jK%k%jJ%%%j%JKJjj%jj%%JJ%%%JJjjjJ%j%%KjJ%jj
2621D%%%%%J%j%JJj%jj%%J%%%K%Jjj%%jJ%%%%j%JJk%JJjJ%%jj%j%KkJ%%%J%j%J%Jk%J%j%J
2614E%jjjJK%Jjj%J%%%J%j%jJj%%jjJJKjk%JKj%j%JJkJj%JjjJ%JJj%j%j%%JJ%jJ%kK%jj%%
2608CJJ%%j%%Jj%%%J%%%j%%%J%jKjj%JJ%k%J%%%jJ%j%%%J%J%%%JJ%JJKJ%%JJ%jkkjjj%jj%
2601Ej%%JJj%%%k%%J%%%%Jj%%JJj%J%%j%%j%%J%j%Jj%%J%%j%%kK%%j%J%%jKj%jJ%%J%j%K%
2595Fjj%%jJJ%%%j%%jJ%Jjjj%J%%J%jJJjJ%J%j%jK%j%Jj%Jj%kJ%%J%Jjj%%%j%%%%JJjJ%jJ
2588E%%%%j%%jJj%JJjjK%%%%jj%K%j%jJJj%%%J%j%%%J%%j%%j%JJ%%j%J%jJ%k%jjKJ%jJ%%j
$$ plain form
2634 6 5 5 5 4 4 4 4 5 6 5 5 6 5 6 6 5 4 5 5 4 5 5 5 4 5 4 4 4 3 3 4 5 5 5 5 5 5 5 5 5 3 3 4 5 5 5 5 4 3 3 3 4 3 3 4 5 6 5 4 5 5 5 5 4 4 4 3 4 4 4 3
2627 3 4 5 6 5 5 5 5 5 5 4 5 6 5 5 4 4 4 4 5 5 5 4 4 3 4 4 5 5 4 6 6 4 4 3 4 4 4 4 3 3 4 6 7 6 5 5 4 3 3 3 4 5 5 5 5 6 7 6 5 4 5 5 4 4 4 6 5 6 6 5 4
2621 4 4 4 4 4 4 5 5 4 4 5 6 5 5 4 3 3 3 4 4 4 4 6 6 7 6 5 5 5 4 5 5 5 5 5 4 4 5 6 4 4 5 6 5 6 6 6 5 4 4 3 3 5 3 4 4 4 4 5 5 4 4 5 5 6 4 4 5 5 4 4 5
2614 5 5 4 3 2 3 5 5 6 5 4 4 5 5 5 5 6 6 5 5 4 5 4 4 4 3 2 3 4 6 5 3 3 4 6 5 5 4 4 5 6 4 5 4 4 5 4 3 4 4 5 6 5 5 4 4 3 3 3 4 5 5 4 5 5 3 5 5 4 3 3 3
2608 3 4 5 5 5 4 4 4 5 4 4 4 4 5 5 5 5 4 4 4 4 5 5 4 6 5 4 4 5 6 6 4 4 5 5 5 5 4 5 5 4 4 4 4 5 5 6 6 6 6 7 8 8 9 10 12 13 13 13 14 15 15 14 12 10 9 8 7 7 6 5 5
2601 5 4 4 4 5 6 5 5 5 5 3 3 3 4 4 4 4 4 5 4 4 4 5 6 5 5 6 6 6 5 5 5 4 4 4 5 5 4 4 5 4 4 4 5 5 5 4 4 4 2 4 4 4 3 3 4 4 4 3 5 4 4 3 4 4 4 5 5 4 4 6 6
2595 6 5 4 4 4 3 4 5 5 5 5 4 4 4 3 4 4 5 4 3 2 2 3 3 3 4 4 3 4 5 4 5 5 6 6 5 5 4 6 6 5 5 6 5 5 6 5 5 3 4 4 4 5 5 6 5 4 4 4 4 3 3 3 3 3 4 5 4 5 5 4 5
2588 5 5 5 5 5 4 4 4 3 4 3 3 4 5 4 3 5 5 5 5 5 4 3 3 5 5 4 4 3 4 5 4 4 4 4 5 5 4 4 4 4 5 5 5 4 4 4 3 3 4 5 5 5 4 4 5 5 4 5 5 3 3 2 1 3 4 4 3 4 4 4 3
2582CK%j%J%%%j%J%j%%JJjjJj%Kj%jjJ%JjjKj%%%jJJJk%%%Jj%%j%%%%%%J%JjJ%%%j%%%%Jj
2575DjJ%%J%%kJJ%%%%Jj%%%j%%%J%%%%%%%j%j%%%JJ%%%jKjjjJ%%KjJ%jkjJ%J%%j%J%%j%%J
2569D%%%%%%j%%%J%%jK%%jj%J%%%j%J%J%jJ%%jj%jKJ%%%%%k%%J%%%%%Jj%J%j%j%J%Jjj%%J
2563Dj%JjJ%%J%jj%Kj%%%Jj%j%JJ%%J%kJj%%Jj%%jKJ%j%%jj%J%kJ%JJjJj%JjjJ%jJ%%%JjJ
2556EjjJJ%j%%J%%Jjk%JjJ%%%Jj%jJJj%J%kJ%%Jk%%%%%%%%Jj%J%%J%%%%%k%%%%KjkJJ%jJJ
2550E%%jJ%jjJjJ%%jjJ%%%J%jJ%%%J%j%%JJjj%J%k%K%kJj%%%%JJ%j%k%J%%%%JKk%%%%%%%J
2543EJj%j%J%%j%%Jj%%jJJ%j%%%%%%%jKJjj%jJ%kJ%Jj%%J%%%%%JkJjJJ%jj%%%%%%%K%jJjj
2537Cj%JJ%%%%%j%JjJJkjJJ%j%%JJj%%J%j%%J%jjLjk%J%%%JJj%j%J%Jjjj%%JJj%%%jJ%j%%
$$ plain form
2582 3 5 5 4 4 5 5 5 5 4 4 5 5 4 4 4 5 6 5 4 5 4 4 6 5 5 4 3 4 4 5 4 3 5 4 4 4 4 3 4 5 6 4 4 4 4 5 4 4 4 3 3 3 3 3 3 3 4 4 5 4 5 5 5 5 4 4 4 4 4 5 4
2575 4 3 4 4 4 5 5 5 3 4 5 5 5 5 5 6 5 5 5 5 4 4 4 4 5 5 5 5 5 5 5 5 4 4 3 3 3 3 4 5 5 5 5 4 6 5 4 3 4 4 4 6 5 6 6 5 3 2 3 3 4 4 4 3 3 4 4 4 3 3 3 4
2569 4 4 4 4 4 4 4 3 3 3 3 4 4 4 3 5 5 5 4 3 3 4 4 4 4 3 3 4 4 5 5 4 5 5 5 4 3 3 2 4 5 5 5 5 5 5 3 3 3 4 4 4 4 4 4 5 4 4 5 5 4 4 3 3 4 4 5 4 3 3 3 4
2563 4 3 3 4 3 4 4 4 5 5 4 3 3 5 4 4 4 4 5 4 4 3 3 4 5 5 5 6 6 4 5 4 4 4 5 4 4 4 3 5 6 6 5 5 5 4 3 3 4 4 2 3 3 4 5 4 5 4 4 5 4 3 4 4 3 4 4 4 4 5 4 5
2556 5 4 3 4 5 5 4 4 4 5 5 5 6 5 3 3 4 3 4 4 4 4 5 4 4 3 4 5 4 4 5 5 3 4 4 4 5 3 3 3 3 3 3 3 3 3 4 3 3 4 4 4 5 5 5 5 5 5 3 3 3 3 3 5 4 2 3 4 4 3 4 5
2550 5 5 5 4 5 5 4 3 4 3 4 4 4 3 2 3 3 3 3 4 4 3 4 4 4 4 5 5 4 4 4 5 6 5 4 4 5 5 3 3 5 5 3 4 3 3 3 3 3 4 5 5 4 4 2 2 3 3 3 3 3 4 6 4 4 4 4 4 4 4 4 5
2543 5 6 5 5 4 4 5 5 5 4 4 4 5 4 4 4 3 4 5 5 4 4 4 4 4 4 4 4 3 5 6 5 4 4 3 4 4 2 3 3 4 3 3 3 4 4 4 4 4 4 5 3 4 3 4 5 5 4 3 3 3 3 3 3 3 3 5 5 4 5 4 3
2537 3 2 2 3 4 4 4 4 4 4 3 3 4 3 4 5 3 2 3 4 4 3 3 3 4 5 4 4 4 5 5 4 4 4 5 5 4 3 6 5 3 3 4 4 4 4 5 6 5 5 4 4 5 5 6 5 4 3 3 3 4 5 4 4 4 4 3 4 4 3 3 3
2530CJJ%jk%J%J%%jJJj%Jk%JJ%jj%JJ%%%j%J%k%%K%%jJJjJjj%%%%j%%J%j%JJ%%%j%%%j%J%
2524DjJ%j%J%%J%j%jJjj%%J%%%%%%%%JJj%%jJJ%j%Jjj%%J%j%%%jJ%Kj%jJ%%%%Jj%JJjjj%%
2517CJjJ%%jJjJj%%JjjJ%J%%JJjjJJjJj%jj%%J%J%kJ%j%J%j%Kjj%%JjJjJ%%%%%JjJjjJ%%j
2511CJJj%%%%%%%%%j%J%%%%Jj%j%K%%j%%JjJJkjJJj%%%J%j%j%%%K%j%%j%Kj%%JjjjK%%%j%
2505C%JJj%Jjj%JJj%kK%%%%%jK%jJ%j%j%JjJ%JJkJ%%jJj%J%j%%%%%JkjLj%%%%%%jJJ%jjJj
2498CJ%%jJJj%Jj%JJj%%j%JJj%%%Jk%Jj%%J%j%jJ%J%j%J%%j%J%k%JJkjK%jJjjjKKk%JJj%%
2492DJjj%%%%%Jj%Jj%%%jK%%%%%%j%JJj%j%%j%KJjJ%%j%JkJjk%JJJ%j%%%%jJ%%%Kj%%J%%%
2485E%%%%kJ%jj%JJJ%%k%%%JJ%Jj%j%%%%%%%Jj%%kJjJJj%KkJjJJjJj%%j%JJ%%JkJ%j%%%%j
$$ plain form
2530 3 4 5 5 4 2 2 3 3 4 4 4 3 4 5 4 4 5 3 3 4 5 5 4 3 3 4 5 5 5 5 4 4 5 5 3 3 3 5 5 5 4 5 6 5 6 5 4 4 4 4 4 3 3 3 4 4 3 3 4 5 5 5 5 4 4 4 4 3 3 4 4
2524 4 3 4 4 3 3 4 4 4 5 5 4 4 3 4 3 2 2 2 3 3 3 3 3 3 3 3 3 4 5 4 4 4 3 4 5 5 4 4 5 4 3 3 3 4 4 3 3 3 3 2 3 3 5 4 4 3 4 4 4 4 4 5 4 4 5 6 5 4 3 3 3
2517 3 4 3 4 4 4 3 4 3 4 3 3 3 4 3 2 3 3 4 4 4 5 6 5 4 5 6 5 6 5 5 4 3 3 3 4 4 5 5 3 4 4 3 3 4 4 3 3 5 4 3 3 3 4 3 4 3 4 4 4 4 4 4 5 4 5 4 3 4 4 4 3
2511 3 4 5 4 4 4 4 4 4 4 4 4 4 3 3 4 4 4 4 4 5 4 4 3 3 5 5 5 4 4 4 5 4 5 6 4 3 4 5 4 4 4 4 5 5 4 4 3 3 3 3 5 5 4 4 4 3 3 5 4 4 4 5 4 3 2 4 4 4 4 3 3
2505 3 3 4 5 4 4 5 4 3 3 4 5 4 4 2 4 4 4 4 4 4 3 5 5 4 5 5 4 4 3 3 4 3 4 4 5 6 4 5 5 5 4 5 4 4 5 5 4 4 4 4 4 4 5 3 2 5 4 4 4 4 4 4 4 3 4 5 5 4 3 4 3
2498 3 4 4 4 3 4 5 4 4 5 4 4 5 6 5 5 5 4 4 5 6 5 5 5 5 6 4 4 5 4 4 4 5 5 4 4 3 4 4 5 5 4 4 5 5 5 4 4 5 5 3 3 4 5 3 2 4 4 3 4 3 2 1 3 5 3 3 4 5 4 4 4
2492 4 5 4 3 3 3 3 3 3 4 3 3 4 3 3 3 3 2 4 4 4 4 4 4 4 3 3 4 5 4 4 3 3 3 2 2 4 5 4 5 5 5 4 4 5 3 4 3 1 1 2 3 4 4 3 3 3 3 3 2 3 3 3 3 5 4 4 4 5 5 5 5
2485 5 5 5 5 5 3 4 4 3 2 2 3 4 5 5 5 3 3 3 3 4 5 5 6 5 5 4 4 4 4 4 4 4 4 5 4 4 4 2 3 2 3 4 3 3 5 3 4 3 4 5 4 5 4 4 4 3 3 4 5 5 5 6 4 5 5 4 4 4 4 4 3
2479C%JKjkJJkJ%%j%JjK%j%%jjK%j%%%%Jj%JjJj%%%J%J%%jj%j%L%j%Jj%JJk%%j%J%%%j%%%
2472CjK%%J%%%%%%j%%%%kJJ%Jj%%%%%%J%%jjjKJ%%%k%JjJjJJ%JjJ%j%kJJkKj%J%%jj%%JJj
2466D%%%J%%%j%%%j%JJkJJJj%%j%%J%%jJJj%%J%jjK%kJj%J%J%j%%%kJj%%J%%%%%%%Jj%%%%
2459D%j%JjJ%JkKjkJ%%%%J%jJJk%%Lj%%j%%j%Jj%J%j%%J%%%%%jJ%%J%%%%%%jJ%jJjK%jjJ%
2453EJj%j%j%JKkj%JJj%JjJJ%jjJkJ%J%j%J%%j%jJJ%jJ%j%%%jK%k%%JJ%%%%JkJjJ%JJj%%%
2446FjJk%jJ%J%Jj%jJJj%%%Jjjj%%%J%%%%%%Jj%J%%jjjK%%J%Jj%J%j%j%jL%j%%%J%jjJ%%%
2440Ej%JjJ%%jJ%j%%%%JJ%k%%jJ%%%%%%J%jJ%j%%J%j%J%%jj%%K%jjJKjj%J%Jj%%jKjjjJ%%
2434D%%%%%Jj%jK%jjJ%%%kJJjJ%J%kKjJ%%%%lJK%%jJ%j%%JjjJJ%j%%JJjjJjJ%%%jJ%%jJJ%
$$ plain form
2479 3 3 4 6 5 3 4 5 3 4 4 4 3 3 4 3 5 5 4 4 4 3 2 4 4 3 3 3 3 3 4 3 3 4 3 4 3 3 3 3 4 4 5 5 5 4 3 3 2 2 5 5 4 4 5 4 4 5 6 4 4 4 3 3 4 4 4 4 3 3 3 3
2472 3 2 4 4 4 5 5 5 5 5 5 5 4 4 4 4 4 2 3 4 4 5 4 4 4 4 4 4 4 5 5 5 4 3 2 4 5 5 5 5 3 3 4 3 4 3 4 5 5 6 5 6 6 5 5 3 4 5 3 5 4 4 5 5 5 4 3 3 3 4 5 4
2466 4 4 4 4 5 5 5 5 4 4 4 4 3 3 4 5 3 4 5 6 5 5 5 4 4 4 5 5 5 4 5 6 5 5 5 6 6 5 4 6 6 4 5 4 4 5 5 6 6 5 5 5 5 3 4 3 3 3 4 4 4 4 4 4 4 4 5 4 4 4 4 4
2459 4 4 3 3 4 3 4 4 5 3 5 4 2 3 3 3 3 3 4 4 3 4 5 3 3 3 6 5 5 5 4 4 4 3 3 4 3 3 4 4 3 3 3 4 4 4 4 4 4 3 4 4 4 5 5 5 5 5 5 5 4 5 5 4 5 4 6 6 5 4 5 5
2453 5 6 5 5 4 4 3 3 4 6 4 3 3 4 5 4 4 5 4 5 6 6 5 4 5 3 4 4 5 5 4 4 5 5 5 4 4 3 4 5 5 4 5 5 4 4 4 4 3 5 5 3 3 3 4 5 5 5 5 5 6 4 5 4 5 5 6 7 6 6 6 6
2446 6 5 6 4 4 3 4 4 5 5 6 5 5 4 5 6 5 5 5 5 6 5 4 3 3 3 3 4 4 4 4 4 4 4 5 4 4 5 5 5 4 3 2 4 4 4 5 5 6 5 5 6 6 5 5 4 4 3 6 6 5 5 5 5 6 6 5 4 5 5 5 5
2440 5 4 4 5 4 5 5 5 4 5 5 4 4 4 4 4 5 6 6 4 4 4 3 4 4 4 4 4 4 4 5 5 4 5 5 4 4 4 5 5 4 4 5 5 5 4 3 3 3 5 5 4 3 4 6 5 4 4 5 5 6 5 5 5 4 6 5 4 3 4 4 4
2434 4 4 4 4 4 4 5 4 4 3 5 5 4 3 4 4 4 4 2 3 4 3 4 4 5 5 3 5 4 5 5 5 5 5 2 3 5 5 5 4 5 5 4 4 4 5 4 3 4 5 5 4 4 4 5 6 5 4 5 4 5 5 5 5 4 5 5 5 4 5 6 6
2427FJk%jJjJJ%jJjJjj%K%jj%K%k%%J%jJ%%%k%%%JjJ%%%j%J%j%KJj%%%%jJj%j%%%J%%J%j%
2421DKjj%%%%J%%%%%%%Jjj%jJ%%jJJ%jjJJK%%j%jj%%%J%%Jjj%%JJ%%%%%%jJjjJjjJjJjJJj
2414D%J%%%j%%%%j%%%J%J%j%%jKjJ%%jkKJ%JkjJjjJJ%%%jJ%%%j%JJjJ%J%jj%%JkjKj%JjjJ
2408C%JJk%%JjJ%j%J%J%%j%jJJ%j%%JJjj%Jkj%JJ%jj%KJ%j%%j%%J%JjJJj%jjJ%%%%j%jK%%
2401DJj%jJJj%jJ%J%%jj%%JJ%JjJ%%%k%%%j%%Jj%J%%%%J%jJJk%j%j%K%j%K%%%j%%jJJjjJj
2395C%J%j%JKk%%JjJ%%%jjKj%%%j%JJ%jJ%%j%Jj%Kj%kJj%%JKj%%%Jj%j%J%jJJ%k%J%%%J%j
2388E%j%%%%%j%J%j%%K%jjJ%%JJjjk%J%J%jjK%j%%jjKJ%j%J%Jjj%J%j%jK%jJj%Kj%%%%%j%
2382CJJ%jjjJJ%j%JJ%j%j%%%jKJjjJJ%jJJj%j%J%j%jjJ%%%K%j%%Kjk%J%Jj%%%%%%%%%%%J%
$$ plain form
2427 6 7 5 5 4 5 4 5 6 6 5 6 5 6 5 4 4 6 6 5 4 4 6 6 4 4 4 5 5 4 5 5 5 5 3 3 3 3 4 3 4 4 4 4 3 3 4 4 3 3 5 6 5 5 5 5 5 4 5 4 4 3 3 3 3 4 4 4 5 5 4 4
2421 4 6 5 4 4 4 4 4 5 5 5 5 5 5 5 5 6 5 4 4 3 4 4 4 3 4 5 5 4 3 4 5 7 7 7 6 6 5 4 4 4 4 5 5 5 6 5 4 4 4 5 6 6 6 6 6 6 6 5 6 5 4 5 4 3 4 3 4 3 4 5 4
2414 4 4 5 5 5 5 4 4 4 4 4 3 3 3 3 4 4 5 5 4 4 4 3 5 4 5 5 5 4 2 4 5 5 6 4 3 4 3 2 3 4 4 4 4 3 4 4 4 4 3 3 4 5 4 5 5 6 6 5 4 4 4 5 3 2 4 3 3 4 3 2 3
2408 3 3 4 5 3 3 3 4 3 4 4 3 3 4 4 5 5 5 4 4 3 4 5 5 4 4 4 5 6 5 4 4 5 3 2 2 3 4 4 3 2 2 4 5 5 4 4 4 3 3 3 4 4 5 4 5 6 5 5 4 3 4 4 4 4 4 3 3 2 4 4 4
2401 4 5 4 4 3 4 5 4 4 3 4 4 5 5 5 4 3 3 3 4 5 5 6 5 6 6 6 6 4 4 4 4 3 3 3 4 3 3 4 4 4 4 4 5 5 4 5 6 4 4 3 3 2 2 4 4 3 3 5 5 5 5 4 4 4 3 4 5 4 3 4 3
2395 3 3 4 4 3 3 4 6 4 4 4 5 4 5 5 5 5 4 3 5 4 4 4 4 3 3 4 5 5 4 5 5 5 4 4 5 4 4 6 5 5 3 4 3 3 3 4 6 5 5 5 5 6 5 5 4 4 5 5 4 5 6 6 4 4 5 5 5 5 6 6 5
2388 5 5 4 4 4 4 4 4 3 3 4 4 3 3 3 5 5 4 3 4 4 4 5 6 5 4 2 2 3 3 4 4 3 2 4 4 3 3 3 2 1 3 4 4 3 3 4 4 5 4 3 3 4 4 3 3 2 4 4 3 4 3 3 5 4 4 4 4 4 4 3 3
2382 3 4 5 5 4 3 2 3 4 4 3 3 4 5 5 4 4 3 3 3 3 2 4 5 4 3 4 5 5 4 5 6 5 5 4 4 5 5 4 4 3 2 3 3 3 3 5 5 4 4 4 6 5 3 3 4 4 5 4 4 4 4 4 4 4 4 4 4 4 4 5 5
2376EjJ%jJ%%%%Jj%%%%Jj%j%JjJ%j%J%j%j%%%J%%j%JJ%%j%J%%%j%J%KkkJ%%JjJj%Kk%%Jj%
2369DJJjjJjj%%%JJ%jJ%kJJ%J%k%JKj%lJJ%jjj%%JKJjj%%jJJj%Jj%%J%%%%J%j%%j%J%jjJ%
2363D%J%kJ%JJkj%%%KJj%Jj%%Jj%%%%%%%%jJ%JJj%%j%J%%%j%%%J%jjjJJJkJ%j%%%%%%%Jk%
2356CJJKjjjJ%%%JjjJ%%%%%%%J%%k%J%%%JjJj%JJj%%jJ%j%%jjKJj%K%%%j%J%%jjj%JJ%jjJ
2350E%%JJ%kJ%k%JJkjJKj%%kKJ%kjJ%%J%J%jJj%%%%J%%J%j%%Jj%%%%Jj%JKJJ%%%%j%j%J%j
2343Ijj%%jJ%jJ%K%jjJJ%JJJKjKJK%KKJjj%j%kj%kjj%jjk%Jj%%%%JJjjKk%KJJj%JJ%jjJjj
2337A1k%%%%JjK%%K%j%KJ%KJKNLMNNPPOMMK%jmoqqnnommkkj%k%%jjj%Jjjj%J%%%%jJJ%%j%
2331A0jK%j%%%JJJj%%J%%%JJJLLLMMNMOPPONKjmnpppoonlmlkjkj%%%j%%%kjjJJ%JjjjJ%%j
$$ plain form
2376 5 4 5 5 4 5 5 5 5 5 6 5 5 5 5 5 6 5 5 4 4 5 4 5 5 4 4 5 5 4 4 3 3 3 3 4 4 4 3 3 4 5 5 5 4 4 5 5 5 5 4 4 5 5 7 5 3 4 4 4 5 4 5 4 4 6 4 4 4 5 4 4
2369 4 5 6 5 4 5 4 3 3 3 3 4 5 5 4 5 5 3 4 5 5 6 6 4 4 5 7 6 6 3 4 5 5 4 3 2 2 2 3 5 6 5 4 4 4 3 4 5 4 4 5 4 4 4 5 5 5 5 5 6 6 5 5 5 4 4 5 5 4 3 4 4
2363 4 4 5 5 3 4 4 5 6 4 3 3 3 3 5 6 5 5 6 5 5 5 6 5 5 5 5 5 5 5 5 5 4 5 5 6 7 6 6 6 5 5 6 6 6 6 5 5 5 5 6 6 5 4 3 4 5 6 4 5 5 4 4 4 4 4 4 4 4 5 3 3
2356 3 4 5 7 6 5 4 5 5 5 5 6 5 4 5 5 5 5 5 5 5 5 6 6 6 4 4 5 5 5 5 6 5 6 5 5 6 7 6 6 6 5 6 6 5 5 5 4 3 5 6 5 5 7 7 7 7 6 6 7 7 7 6 5 4 4 5 6 6 5 4 5
2350 5 5 5 6 7 7 5 6 6 4 4 5 6 4 3 4 6 5 5 5 3 5 6 6 4 3 4 4 4 5 5 6 6 5 6 5 5 5 5 5 6 6 6 7 7 6 6 6 7 6 6 6 6 6 7 6 6 7 9 10 11 11 11 11 11 10 10 9 9 10 10 9
2343 9 8 7 7 7 6 7 7 6 7 7 9 9 8 7 8 9 9 10 11 12 14 13 15 16 18 18 20 22 23 22 21 21 20 20 18 17 17 15 14 13 13 12 11 9 9 10 9 9 9 9 9 10 11 10 9 11 9 9 11 12 13 12 12 13 14 14 13 12 13 12 11
2337 11 9 9 9 9 9 10 9 11 11 11 13 13 12 12 14 15 15 17 18 20 25 28 32 37 42 49 56 62 66 70 72 72 71 67 61 53 45 40 35 29 25 21 19 17 16 16 14 14 14 13 12 11 11 12 11 10 9 9 10 10 10 10 10 9 10 11 11 11 10 10
2331 10 9 11 11 10 10 10 10 11 12 13 12 12 12 13 13 13 13 14 15 16 19 22 25 29 33 38 42 48 55 62 68 73 75 74 70 65 58 51 44 38 32 27 24 20 17 15 14 12 11 11 11 11 10 10 10 10 8 7 6 7 8 8 9 8 7 6 7 7 7 6
2324F%J%%%KjjJk%JJJjjJJ%JjJJK%%KJJJJJJ%J%Jjkkjkjk%k%%jjj%JJ%jj%j%j%%Kj%%jjJJ
2318F%j%%%%JJ%jj%%J%%j%%%%J%%%kJ%j%JjJ%%%%j%J%Jk%%%jJJ%%jjJJKjj%%%J%kJ%j%jJ%
2311DJ%jjJ%Jj%J%%%J%%%%jJjJJk%%%%%%JJjkj%JJjjJ%%JjK%j%%J%jJjjJjJ%j%jJKk%JjJj
2305DJjJjJ%JjkjJ%JJJ%jjJJ%kK%%%j%jJ%J%%%Jj%J%JjJJjl%%%%JJj%k%%%%%J%kJJj%%JJJ
2298G%jj%kKJjj%%%K%j%%jKj%%jJ%%%JJ%jjJ%jJ%%%%%%%J%jjjJjj%KJ%j%%%j%%%%JJk%Jj%
2292DjJjJJ%%%%jJj%J%jJ%jjJ%%%jJ%%J%%%%Jj%jJ%J%jjJ%%J%%%J%j%Jk%%%%%%%jjK%%j%J
2285Ek%JJ%%%jJJj%jJ%j%%%JjJKj%%J%%j%j%J%%%j%%%jJ%j%%J%jJKjjjjK%jjJ%J%K%k%%%j
2279Dj%JJ%%%J%j%%JkjJJj%%JJ%%J%jj%j%%JJJ%%%jJ%jJ%j%%%%%jJ%k%%J%%J%j%%J%%j%%j
$$ plain form
2324 6 6 7 7 7 7 9 8 7 8 6 6 7 8 9 8 7 8 9 9 10 9 10 11 13 13 13 15 16 17 18 19 20 21 21 22 22 23 22 20 18 17 15 14 12 12 10 10 10 9 8 7 7 8 9 9 8 7 7 6 6 5 5 5 7 6 6 6 5 4 5 6
2318 6 6 5 5 5 5 5 6 7 7 6 5 5 5 6 6 6 5 5 5 5 5 6 6 6 6 4 5 5 4 4 5 4 5 5 5 5 5 4 4 5 5 6 4 4 4 4 3 4 5 5 5 4 3 4 5 7 6 5 5 5 5 6 6 4 5 5 4 4 3 4 4
2311 4 5 5 4 3 4 4 5 4 4 5 5 5 5 6 6 6 6 6 5 6 5 6 7 5 5 5 5 5 5 5 6 7 6 4 3 3 4 5 4 3 4 4 4 5 4 6 6 5 5 5 6 6 5 6 5 4 5 4 5 5 4 4 3 4 6 4 4 5 4 5 4
2305 4 5 4 5 4 5 5 6 5 3 2 3 3 4 5 6 6 5 4 5 6 6 4 6 6 6 6 5 5 4 5 5 6 6 6 6 7 6 6 7 7 8 7 8 9 8 5 5 5 5 5 6 7 6 6 4 4 4 4 4 4 5 5 3 4 5 4 4 4 5 6 7
2298 7 7 6 5 5 3 5 6 5 4 4 4 4 6 6 5 5 5 4 6 5 5 5 4 5 5 5 5 6 7 7 6 5 6 6 5 6 6 6 6 6 6 6 6 7 7 6 5 4 5 4 3 3 5 6 6 5 5 5 5 4 4 4 4 4 5 6 4 4 5 4 4
2292 4 3 4 3 4 5 5 5 5 5 4 5 4 4 5 5 4 5 5 4 3 4 4 4 4 3 4 4 4 5 5 5 5 5 6 5 5 4 5 5 6 6 5 4 5 5 5 6 6 6 6 7 7 6 6 7 5 5 5 5 5 5 5 5 4 3 5 5 5 4 4 5
2285 5 3 3 4 5 5 5 5 4 5 6 5 5 4 5 5 4 4 4 4 5 4 5 7 6 6 6 7 7 7 6 6 5 5 6 6 6 6 5 5 5 5 4 5 5 4 4 4 5 5 4 5 7 6 5 4 3 5 5 4 3 4 4 5 5 7 7 5 5 5 5 4
2279 4 3 3 4 5 5 5 5 6 6 5 5 5 6 4 3 4 5 4 4 4 5 6 6 6 7 7 6 5 5 4 4 4 5 6 7 7 7 7 6 7 7 6 7 7 6 6 6 6 6 6 5 6 6 4 4 4 5 5 5 6 6 5 5 5 6 6 6 5 5 5 4
2273DJ%%%%%J%J%%JkJj%%jJ%%j%j%%J%J%%jK%%j%J%%Kj%%kJ%%jjJ%Jjj%%%jJJ%%j%%%%j%J
2266EjJJk%J%%J%%J%%%%J%%%%Jkkj%K%%Jkk%KJjJj%%%JJjjKJ%%%%jJ%%j%jjJj%%%%j%%%%%
2260DJKjj%%Jjj%%j%Kj%J%%%J%%j%J%jjJ%JjjJ%kJJ%%%%%%j%J%J%%jkKJ%%Jj%%%j%%jJjJJ
2253F%%j%JjJkJJj%j%J%j%%JjJ%Jj%%jjJ%jJJJjJ%j%J%j%J%%%jJjjJ%%Jj%%k%JJ%jJ%%%%%
2247EjJJjjJjJjj%KJj%jKjj%JjJk%JK%j%%%%%j%JJk%%%%JjJ%jJjj%JJ%j%J%k%JJ%j%J%jJ%
2240E%%%j%J%jJ%jj%JjJ%jJJ%jjJJ%J%%jjj%%K%%%%%%jJ%%%Jk%%%%jJKj%%%Jj%%%%%%j%%%
2234DJ%jj%K%J%%jj%%Jj%%j%JJjjK%jjJ%JjJ%jJjJJ%%%%jj%%%JjJ%K%k%%%jJ%%%JjJ%j%%%
2227E%%%jJ%%%%%%jJj%Jj%jKj%%J%jJ%J%j%j%J%jJ%%J%jj%JJj%jJj%%%j%%KJj%J%kJJ%Jjj
$$ plain form
2273 4 5 5 5 5 5 5 6 6 7 7 7 8 6 7 6 6 6 5 6 6 6 5 5 4 4 4 5 5 6 6 6 5 7 7 7 6 6 7 7 7 9 8 8 8 6 7 7 7 6 5 6 6 7 6 5 5 5 5 4 5 6 6 6 5 5 5 5 5 4 4 5
2266 5 4 5 6 4 4 5 5 5 6 6 6 7 7 7 7 7 8 8 8 8 8 9 7 5 4 4 6 6 6 7 5 3 3 5 6 5 6 5 5 5 5 6 7 6 5 7 8 8 8 8 8 7 8 8 8 7 7 6 5 6 5 5 5 5 5 4 4 4 4 4 4
2260 4 5 7 6 5 5 5 6 5 4 4 4 3 3 5 4 4 5 5 5 5 6 6 6 5 5 6 6 5 4 5 5 6 5 4 5 5 3 4 5 5 5 5 5 5 5 4 4 5 5 6 6 6 5 3 5 6 6 6 7 6 6 6 6 5 5 5 4 5 4 5 6
2253 6 6 6 5 5 6 5 6 4 5 6 5 5 4 4 5 5 4 4 4 5 4 5 5 6 5 5 5 4 3 4 4 3 4 5 6 5 6 6 5 5 6 6 5 5 6 6 6 6 5 6 5 4 5 5 5 6 5 5 5 3 3 4 5 5 4 5 5 5 5 5 5
2247 5 4 5 6 5 4 5 4 5 4 3 3 5 6 5 5 4 6 5 4 4 5 4 5 3 3 4 6 6 5 5 5 5 5 5 4 4 5 6 4 4 4 4 4 5 4 5 5 4 5 4 3 3 4 5 5 4 4 5 5 3 3 4 5 5 4 4 5 5 4 5 5
2240 5 5 5 5 4 4 5 5 4 5 5 4 3 3 4 3 4 4 3 4 5 5 4 3 4 5 5 6 6 6 5 4 3 3 3 5 5 5 5 5 5 5 4 5 5 5 5 6 4 4 4 4 4 3 4 6 5 5 5 5 6 5 5 5 5 5 5 5 4 4 4 4
2234 4 5 5 4 3 3 5 5 6 6 6 5 4 4 4 5 4 4 4 3 3 4 5 4 3 5 5 4 3 4 4 5 4 5 5 4 5 4 5 6 6 6 6 6 5 4 4 4 4 5 4 5 5 7 7 5 5 5 5 4 5 5 5 5 6 5 6 6 5 5 5 5
2227 5 5 5 5 4 5 5 5 5 5 5 5 4 5 4 4 5 4 4 3 5 4 4 4 5 5 4 5 5 6 6 5 5 4 4 5 5 4 5 5 5 6 6 5 4 4 5 6 5 5 4 5 4 4 4 4 3 3 3 5 6 5 5 6 6 4 5 6 6 7 6 5
2221E%JjjJ%%%Jk%%%%%J%J%j%J%jj%J%%Jk%JjjJK%j%j%%%%%J%J%j%j%%J%%J%%%%j%%%k%JJ
2215EJj%Jj%%Jk%%jKjJ%j%K%%j%j%%%jJJJ%j%JjJk%%J%%j%J%j%%J%jJ%jJj%%%%%JJ%%j%Jj
2208E%K%j%k%Jj%J%J%%jj%%%Jjj%J%J%j%J%%%%j%Jj%JJk%JJk%%JJ%j%%%Kj%JjkK%%j%%%%j
2202DJ%jJJ%%jJ%j%jJ%%%jj%JJ%%%JjjJ%j%%%J%%j%%J%jJJj%j%J%%%j%JjJ%j%Jj%%%%%J%%
2195E%%j%%J%%%%jJJjj%JjjJJJ%j%JkjJ%Kj%j%JKj%jJJjJjJjj%jJ%kJ%JJjjjJ%%%JJ%%j%%
2189E%%JJ%jj%JjjJ%%j%%J%jJ%%J%Jj%j%jjJ%J%%%%%%%%J%%jj%Jj%%%JJ%Jj%%kJJ%j%%J%%
2182FJ%%%%j%j%J%%%k%J%%jJjK%J%jJj%%j%%J%%%%%j%%%%jJ%%%JJj%j%%KjJjkK%J%JkjjJ%
2176E%J%Jj%j%%%JJjjJJkjjJK%jJjJJjjJ%jJj%JjJJj%j%jJJJ%Kj%%j%J%%Jjj%%J%%%%jJ%j
$$ plain form
2221 5 5 6 5 4 5 5 5 5 6 4 4 4 4 4 4 5 5 6 6 5 5 6 6 5 4 4 5 5 5 6 4 4 5 4 3 4 6 6 5 5 4 4 4 4 4 4 5 5 6 6 5 5 4 4 4 5 5 5 6 6 6 6 6 5 5 5 5 3 3 4 5
2215 5 6 5 5 6 5 5 5 6 4 4 4 3 5 4 5 5 4 4 6 6 6 5 5 4 4 4 4 3 4 5 6 6 5 5 6 5 6 4 4 4 5 5 5 4 4 5 5 4 4 4 5 5 4 5 5 4 5 4 4 4 4 4 4 5 6 6 6 5 5 6 5
2208 5 5 7 7 6 6 4 4 5 4 4 5 5 6 6 6 5 4 4 4 4 5 4 3 3 4 4 5 5 4 4 5 5 5 5 5 4 4 5 4 4 5 6 4 4 5 6 4 4 4 5 6 6 5 5 5 5 7 6 6 7 6 4 6 6 6 5 5 5 5 5 4
2202 4 5 5 4 5 6 6 6 5 6 6 5 5 4 5 5 5 5 4 3 3 4 5 5 5 5 6 5 4 5 5 4 4 4 4 5 5 5 4 4 4 5 5 4 5 6 5 5 4 4 5 5 5 5 4 4 5 4 5 5 4 4 5 4 4 4 4 4 4 5 5 5
2195 5 5 5 4 4 4 5 5 5 5 5 4 5 6 5 4 4 5 4 3 4 5 6 6 5 5 6 4 3 4 4 6 5 5 4 4 5 7 6 6 5 6 7 6 7 6 7 6 5 5 4 5 5 3 4 4 5 6 5 4 3 4 4 4 4 5 6 6 6 5 5 5
2189 5 5 5 6 7 7 6 5 5 6 5 4 5 5 5 4 4 4 5 5 4 5 5 5 6 6 7 6 6 5 5 4 3 4 4 5 5 5 5 5 5 5 5 5 6 6 6 5 4 4 5 4 4 4 4 5 6 6 7 6 6 6 4 5 6 6 5 5 5 6 6 6
2182 6 7 7 7 7 7 6 6 5 5 6 6 6 6 4 4 5 5 5 4 5 4 6 6 7 7 6 7 6 6 6 5 5 5 6 6 6 6 6 6 5 5 5 5 5 4 5 5 5 5 6 7 6 6 5 5 5 7 6 7 6 4 6 6 7 7 8 6 5 4 5 5
2176 5 5 6 6 7 6 6 5 5 5 5 6 7 6 5 6 7 5 4 3 4 6 6 5 6 5 6 7 6 5 6 6 5 6 5 5 6 5 6 7 6 6 5 5 4 5 6 7 7 9 8 8 8 7 7 8 8 8 9 8 7 7 7 8 8 8 8 8 7 8 8 7
2169G%j%%%J%%kj%KJ%k%%%JJ%jj%JJj%%%j%J%%j%%%%%JJjJ%jJ%%%jJ%jJ%%j%J%%%%j%%J%j
2163FjJ%%%%%jjJ%%%J%jjKJ%%k%jJJ%%%%%%J%%j%%kJK%Jjj%jJjJj%J%JjJj%%%jJ%Jj%J%%%
2156G%%J%j%J%%J%kJJj%K%jJjj%JjJ%jjKkjj%K%%j%%%%%jJK%kJJkJJ%%j%J%J%%kK%jj%%Jj
2150GJ%%J%JJ%JJ%K%%K%j%JkK%j%jjj%%k%jjjJ%%%%%jj%j%J%%jJjJ%%%%%%Jj%j%JJ%J%j%%
2144HJ%jJ%J%JJjJ%Kj%KKJ%J%%Jjkjkk%%j%jj%%Jjj%jJ%%J%jj%J%j%jJ%JjjK%jK%jjj%jJJ
2137G%JjJJ%j%JjJ%%J%jJJ%%%jJ%kjJ%%%Kk%jjJ%%%j%Jj%j%JJJjj%jJjjJJ%%J%j%%%%%%%%
2131G%J%%j%jjKJjjJ%%J%%J%jj%J%%j%Jj%%%%j%JJkJ%jjJ%JjKj%Jj%%KjJJj%j%%JJJ%k%jJ
2124I%jjJJJj%%J%k%%Jj%Jjj%JjJJkj%J%%J%Kkj%%J%%%JJj%%%J%jjJJ%jjJJ%%JjKJjJj%%K
$$ plain form
2169 7 7 6 6 6 6 7 7 7 5 4 4 6 7 7 5 5 5 5 6 7 7 6 5 5 6 7 6 6 6 6 5 5 6 6 6 5 5 5 5 5 5 6 7 6 7 7 6 7 7 7 7 6 7 7 6 7 7 7 6 6 7 7 7 7 7 6 6 6 7 7 6
2163 6 5 6 6 6 6 6 6 5 4 5 5 5 5 6 6 5 4 6 7 7 7 5 5 4 5 6 6 6 6 6 6 6 7 7 7 6 6 6 4 5 7 7 8 7 6 6 5 6 5 6 5 5 6 6 7 6 7 6 6 6 6 5 6 6 7 6 6 7 7 7 7
2156 7 7 7 8 8 7 7 8 8 8 9 9 7 8 9 8 8 10 10 9 10 9 8 8 9 8 9 9 8 7 9 7 6 5 5 7 7 7 6 6 6 6 6 6 5 6 8 8 6 7 8 6 7 8 8 8 7 7 8 8 9 9 9 7 9 9 8 7 7 7 8 7
2150 7 8 8 8 9 9 10 11 11 12 13 13 15 15 15 17 17 16 16 17 15 17 17 16 16 15 14 13 13 13 11 11 10 9 8 9 9 9 9 9 9 8 7 7 6 6 7 7 7 6 7 6 7 7 7 7 7 7 7 8 7 7 6 6 7 8 8 9 9 8 8 8
2144 8 9 9 8 9 9 10 10 11 12 11 12 12 14 13 13 15 17 18 18 19 19 19 20 19 17 16 14 12 12 12 11 11 10 9 9 9 10 9 8 8 7 8 8 8 9 9 8 7 7 8 8 7 7 6 7 7 8 7 6 8 8 7 9 9 8 7 6 6 5 6 7
2137 7 7 8 7 8 9 9 8 8 9 8 9 9 9 10 10 9 10 11 11 11 11 10 11 11 9 8 9 9 9 9 11 9 9 8 7 8 8 8 8 7 7 8 7 7 6 6 7 8 9 8 7 7 6 7 6 5 6 7 7 7 8 8 7 7 7 7 7 7 7 7 7
2131 7 7 8 8 8 7 7 6 5 7 8 7 6 7 7 7 8 8 8 9 9 8 7 7 8 8 8 7 7 8 7 7 7 7 7 6 6 7 8 6 7 7 6 5 6 6 7 6 8 7 7 8 7 7 7 9 8 9 10 9 9 8 8 8 9 10 11 11 9 9 8 9
2124 9 9 8 7 8 9 10 9 9 9 10 10 8 8 8 9 8 8 9 8 7 7 8 7 8 9 7 6 6 7 7 7 8 8 10 8 7 7 7 8 8 8 8 9 10 9 9 9 9 10 10 9 8 9 10 10 9 8 9 10 10 10 11 10 12 13 12 13 12 12 12 14
2118A4Jj%J%jjjJj%%%%%jj%%Jj%j%%J%%%%%%Jj%Kj%jK%%J%%%JJjj%J%jJJ%%%%%%JJJK%KJ%
2111B3KK%KK%%%%j%lkmjjkj%k%%%%%%%kKj%Jj%jj%Kj%J%%J%jJk%J%%J%%j%J%%%Jj%JJJJJJ
2105B0KJK%%KKK%%jjkjkkjkj%k%%JjKjkJ%jJj%%J%%J%%Jj%%j%%jj%%jJjj%%%%KJ%jkKK%j%
2099A5J%%KjJj%JKjJ%k%%jjj%J%%k%%j%%%J%jJ%%JJJjjJJjJ%%jj%%J%%j%%%Jjj%%KJ%jjJ%
2092A6%J%%Jjj%JJJJ%%JjJ%%%j%J%J%J%JJ%KJKLJKNOPJ1J3J5K3K9L2L4L0J9Qqk0l0l4l3k9
2087A14k2j6j1pnmjk%%Jj%%jj%JKJJMKKJKKKJ%LJJ%JMKKLMLMMMONNMPQPRJ1J4J8K1K4K7L3
2082C00L9M4M8N5N9N9N8N2M4L4K1Kj2k6l7m5n3n4n5n1m7m0l7l2k6k1k0j6j1rpmkj%KJL%JK
2078B18jjlk%%KJMQRRJ0J1J1J1J0J0J2J2J3J6J8K2K8L5M4N4O8Q4J03J27J53J84K16K41K59
$$ plain form
2118 14 15 14 14 15 15 14 13 12 13 12 12 12 12 12 12 11 10 10 10 11 10 10 9 9 9 10 10 10 10 10 10 10 11 10 10 12 11 11 10 12 12 12 13 13 13 13 14 15 14 13 13 14 14 13 14 15 15 15 15 15 15 15 16 17 18 20 20 22 23 23
2111 23 25 27 27 29 31 31 31 31 31 30 30 27 25 21 20 19 17 16 16 14 14 14 14 14 14 14 14 12 14 13 13 14 13 13 12 11 11 13 12 12 13 13 13 14 14 13 14 12 12 13 13 13 14 14 14 13 13 14 14 14 14 15 14 14 15 16 17 18 19 20
2105 20 22 23 25 25 25 27 29 31 31 31 30 29 27 26 24 22 21 19 18 18 16 16 16 17 16 18 17 15 16 16 15 16 15 15 15 16 16 16 17 17 17 18 17 17 17 16 16 16 15 14 14 14 13 14 13 12 12 12 12 12 14 15 15 14 12 14 16 16 15 15
2099 15 16 16 16 18 17 18 17 17 18 20 19 20 20 18 18 18 17 16 15 15 16 16 16 14 14 14 13 13 13 13 14 14 13 14 14 14 15 16 17 16 15 16 17 16 17 17 17 16 15 15 15 16 16 16 15 15 15 15 16 15 14 14 14 16 17 17 16 15 16 16
2092 16 16 17 17 17 18 17 16 16 17 18 19 20 20 20 21 20 21 21 21 21 20 20 21 21 22 22 23 23 24 25 25 27 28 30 33 34 36 41 47 54 65 78 93 116 145 177 211 241 260 268 260 240 210 176 143 114
2087 114 92 76 65 58 53 49 48 46 46 46 47 46 46 46 45 44 44 45 47 48 49 53 55 57 58 60 62 64 65 65 68 69 70 70 71 75 77 79 82 86 89 93 97 101 107 112 117 121 128 136 143 152 163 177 195 216 240 267 300
2082 300 339 383 431 486 545 604 662 714 758 792 813 815 803 777 740 695 642 588 533 482 435 395 358 326 300 279 259 243 232 223 216 212 210 209 209 211 212 215 215 216 218
2078 218 217 216 213 211 211 211 213 214 218 226 235 244 254 265 276 287 297 307 319 331 344 360 378 400 428 463 507 561 629 713 816 943 1096 1280 1496 1737 1996
2075A996K65K51K15J58Q6Lq1j53k14k50k68k68k50k23j91j56j27j02q1o6n2m2l4k6k1j6j2
2072C41j1ppllmmnnonnnnmJJMOQQRJ0J0J0J2J0J1J3J5J9K1K7L5M1N3O7Q0J00J21J47J77K05
2068A483K31K49K55K47K19J68J05K8n6j32k00k48k78k83k68k42k05j70j34j07q5o7n4m3l4
2066C79l1k3j9j7j5j3j1rj0opj0oppnplmlk%jJ%KLKMLLMOOQQJ2J4J7J7K2K5K9L6L9M3M7N2
2062E66N2N0M7M0L0J7Nj2k6m0m8n7o1o1n8n3m8m2l7l1k5k2j7j5j4j0j0qqnmnmlmjkjkJj%%
2058G3jJJj%%jkljlnkmmlklkjkkj%kj%%jjj%k%%%%%j%jKJj%%jJ%J%jJ%JJ%K%JJKKLMMOOPR
2052G4J1J2J4J2J3ROMkmqj1j2j3j3j2j1rqomnlkkjkjk%jkjJ%j%jjKJjj%%%jJ%%J%J%%J%jK
2046B3K%KKKKLKNNQQQRJ1J3J2J1J1QNJmpj0j2j4j3j3j2rrnonmkkkk%jj%%kjj%%%%%j%%jjj
$$ plain form
2075 1996 2261 2512 2727 2885 2971 2974 2893 2740 2526 2276 2008 1740 1490 1267 1076 920 793 691 610 544 492 450 416 390 369 353 341
2072 341 330 323 316 313 310 306 302 297 292 286 281 276 271 266 262 263 264 268 274 282 290 299 309 319 329 341 351 362 375 390 409 430 457 492 533 586 653 733 833 954 1101 1278 1483
2068 1483 1714 1963 2218 2465 2684 2852 2957 2985 2929 2797 2597 2349 2071 1788 1520 1278 1073 903 769 662 577 510 456 413 379
2066 379 348 325 306 289 274 261 250 241 231 225 218 208 202 195 188 183 176 173 169 166 164 164 163 164 164 166 169 171 175 178 181 185 191 197 205 213 225 239 256 273 295 320 349 385 424 467 514 566
2062 566 618 668 715 755 785 802 807 795 769 729 681 624 563 502 444 391 343 301 264 233 208 186 169 154 140 130 120 112 104 99 95 90 86 83 79 78 76 75 73 74 73 73 73
2058 73 72 73 74 73 73 73 72 70 67 66 63 58 56 52 48 45 43 40 38 37 35 33 32 32 30 29 29 29 28 27 26 26 24 24 24 24 24 24 23 23 22 24 25 24 24 24 23 24 24 25 25 24 25 25 26 27 27 29 29 30 31 33 35 38 42 46 52 58 65 74
2052 74 85 97 111 123 136 145 151 155 153 149 141 130 118 105 92 80 69 60 52 46 42 37 34 32 30 29 27 26 24 24 23 21 20 21 21 20 20 19 18 20 21 20 19 19 19 19 18 19 19 19 20 20 21 21 21 22 22 21 23
2046 23 25 25 27 29 31 33 36 38 43 48 56 64 72 81 92 105 117 128 139 147 152 153 149 142 132 120 106 93 80 68 59 50 45 39 34 30 28 26 24 22 22 21 20 20 20 18 17 16 16 16 16 16 16 15 15 15 14 13 12
2041A2%%%%%%K%%j%%K%%JJ%KJJ%KKKKKLLJKKK%%%kkkkmmkjljjkkjjJjkj%j%%j%JjJ%jj%J%
2035Ij%%j%%%J%j%%j%%JJ%j%%kJJjj%JJ%jJ%j%j%jJJ%Jjj%%jJjJ%%Jk%KJjJj%jj%%%K%%%%
2028F%%j%Jj%jjJ%JJjJ%Jj%%jJ%%j%%JjjJ%jJj%J%K%j%J%k%%jJ%%J%j%%%%K%k%%jJ%%j%%K
2022F%%jjJJJjj%j%jJ%%%JJjJ%JjkJJ%Jj%%jJJj%Jjj%J%%%jJj%J%jJ%Jjj%jJJ%jJJjJkkKJ
2015Fj%%%JJ%k%%j%J%Kjj%%%%%J%j%%JjJ%j%J%%j%%%%%JJk%%%jJ%%%J%J%jj%J%%j%%%%J%j
2009E%%%%Jj%Jj%J%J%%jjJ%j%J%J%%%%JJJj%%%%j%%j%JJJ%jjKk%%%Jj%%J%j%%%%%%jJ%jJ%
2002HjjjJ%%Jj%JKkkKJ%%%%%Jj%JJ%%j%J%%JJJ%J%KJJ%j%%jjJjj%%j%kkJ%kJ%%Jj%%%%j%j
1996G%Kj%%jjjLjkJJ%%%Jjj%jJJ%Jj%JJK%jJJJ%K%J%K%JJ%jk%j%j%kk%%j%%%%%j%jj%JJ%k
$$ plain form
2041 12 12 12 12 12 12 12 14 14 14 13 13 13 15 15 15 16 17 17 19 20 21 21 23 25 27 29 31 34 37 38 40 42 44 44 44 44 42 40 38 36 32 28 26 25 22 21 20 18 16 15 14 15 14 12 11 11 10 10 10 9 9 10 9 10 10 9 8 8 9 9
2035 9 8 8 8 7 7 7 7 8 8 7 7 7 6 6 6 7 8 8 7 7 7 5 6 7 6 5 5 6 7 7 6 7 7 6 6 5 5 4 5 6 6 7 6 5 5 5 4 5 4 5 5 5 6 4 4 6 7 6 7 6 6 5 4 4 4 4 6 6 6 6 6
2028 6 6 6 5 5 6 5 5 4 3 4 4 5 6 5 6 6 7 6 6 6 5 6 6 6 5 5 5 6 5 4 5 5 4 5 4 4 5 5 7 7 6 6 7 7 5 5 5 4 5 5 5 6 6 5 5 5 5 5 7 7 5 5 5 4 5 5 5 4 4 4 6
2022 6 6 6 5 4 5 6 7 6 5 5 4 4 3 4 4 4 4 5 6 5 6 6 7 6 4 5 6 6 7 6 6 6 5 6 7 6 6 7 6 5 5 6 6 6 6 5 6 5 5 6 6 5 6 6 7 6 5 5 4 5 6 6 5 6 7 6 7 5 3 5 6
2015 6 5 5 5 5 6 7 7 5 5 5 4 4 5 5 7 6 5 5 5 5 5 5 6 6 5 5 5 6 5 6 6 5 5 6 6 6 5 5 5 5 5 5 6 7 5 5 5 5 4 5 5 5 5 6 6 7 7 6 5 5 6 6 6 5 5 5 5 5 6 6 5
2009 5 5 5 5 5 6 5 5 6 5 5 6 6 7 7 7 6 5 6 6 5 5 6 6 7 7 7 7 7 8 9 10 9 9 9 9 9 8 8 8 7 7 8 9 10 10 9 8 10 8 8 8 8 9 8 8 8 9 9 8 8 8 8 8 8 8 7 8 8 7 8 8
2002 8 7 6 5 6 6 6 7 6 6 7 9 7 5 7 8 8 8 8 8 8 9 8 8 9 10 10 10 9 9 10 10 10 11 12 13 13 14 14 16 17 18 18 17 17 17 16 15 16 15 14 14 14 13 13 11 9 10 10 8 9 9 9 10 9 9 9 9 9 8 8 7
1996 7 7 9 8 8 8 7 6 5 8 7 5 6 7 7 7 7 8 7 6 6 5 6 7 7 8 7 7 8 9 11 11 10 11 12 13 13 15 15 16 16 18 18 19 20 20 19 17 17 16 16 15 15 13 11 11 11 10 10 10 10 10 10 9 9 8 7 7 8 9 9 7
1989GJ%%%j%%jJJjj%JJk%%J%Jjj%%%%J%%%%%%jJJj%%J%J%Kk%%%%%kJj%Kjj%j%J%j%K%j%jj
1983E%JKk%jJ%Jj%%%%j%%JjJ%j%%J%kJJKkkJ%JjJ%j%K%jj%%%Jjj%JJ%%j%%%%%JJjjJ%J%jj
1976E%%%%%j%K%%J%j%j%%jJJ%J%%j%%%jJ%%jJJ%%j%%Jkj%JJ%%k%%%J%Jj%J%j%jJJ%j%j%J%
1970EJJjk%%%J%%%%J%%jJj%%%%%%%J%J%kJ%%jjJjK%k%JJjj%%%K%jJjj%%JJ%%JJjkJj%Jj%%
1964EK%kjJJ%%j%%%JKjjjj%J%J%%%jjJJ%%jJJ%j%%%%j%%%j%KJ%j%%jJJ%%jj%%j%%%JJj%%J
1957F%%%jjK%j%jK%kJK%j%%Jjj%J%%%%j%J%jj%JJJk%Jk%JjJ%J%j%jJj%%%JJj%%%%%%%%%%%
1951E%%%jJJ%%%%j%jJ%%%%J%j%%Jj%%%jK%%%j%jJ%jjJ%JJ%%J%%k%Jj%J%%%kJ%%%%%%J%J%k
1944EjJ%j%J%%%Kj%%j%%J%j%KJkjjKJkJk%K%j%%J%%jJ%%JJkK%jjJ%Jj%J%jjjJ%%Jj%%%J%k
$$ plain form
1989 7 8 8 8 8 7 7 7 6 7 8 7 6 6 7 8 6 6 6 7 7 8 7 6 6 6 6 6 7 7 7 7 7 7 7 6 7 8 7 7 7 8 8 9 9 11 9 9 9 9 9 9 7 8 7 7 9 8 7 7 6 6 7 7 6 6 8 8 7 7 6 5
1983 5 5 6 8 6 6 5 6 6 7 6 6 6 6 6 5 5 5 6 5 6 6 5 5 5 6 6 4 5 6 8 6 4 5 5 6 5 6 6 5 5 7 7 6 5 5 5 5 6 5 4 4 5 6 6 6 5 5 5 5 5 5 6 7 6 5 6 6 7 7 6 5
1976 5 5 5 5 5 5 4 4 6 6 6 7 7 6 6 5 5 5 4 5 6 6 7 7 7 6 6 6 6 5 6 6 6 5 6 7 7 7 6 6 6 7 5 4 4 5 6 6 6 4 4 4 4 5 5 6 5 5 6 6 5 5 4 5 6 6 5 5 4 4 5 5
1970 5 6 7 6 4 4 4 4 5 5 5 5 5 6 6 6 5 6 5 5 5 5 5 5 5 5 6 6 7 7 5 6 6 6 5 4 5 4 6 6 4 4 5 6 5 4 4 4 4 6 6 5 6 5 4 4 4 5 6 6 6 7 8 7 5 6 5 5 6 5 5 5
1964 5 7 7 5 4 5 6 6 6 5 5 5 5 6 8 7 6 5 4 4 5 5 6 6 6 6 5 4 5 6 6 6 5 6 7 7 6 6 6 6 6 5 5 5 5 4 4 6 7 7 6 6 6 5 6 7 7 7 6 5 5 5 4 4 4 4 5 6 5 5 5 6
1957 6 6 6 6 5 4 6 6 5 5 4 6 6 4 5 7 7 6 6 6 7 6 5 5 6 6 6 6 6 5 5 6 6 5 4 4 5 6 7 5 5 6 4 4 5 4 5 5 6 6 5 5 4 5 4 4 4 4 5 6 5 5 5 5 5 5 5 5 5 5 5 5
1951 5 5 5 5 4 5 6 6 6 6 6 5 5 4 5 5 5 5 5 6 6 5 5 5 6 5 5 5 5 4 6 6 6 6 5 5 4 5 5 4 3 4 4 5 6 6 6 7 7 7 5 5 6 5 5 6 6 6 6 4 5 5 5 5 5 5 5 6 6 7 7 5
1944 5 4 5 5 4 4 5 5 5 5 7 6 6 6 5 5 5 6 6 5 5 7 8 6 5 4 6 7 5 6 4 4 6 6 5 5 5 6 6 6 5 6 6 6 7 8 6 8 8 7 6 7 7 8 7 7 8 8 7 6 5 6 6 6 7 6 6 6 6 7 7 5
1938E%J%K%kjJJ%%%%jJj%Kj%Jj%JjkKJj%%%j%%KJk%J%JJJJj%JJKJJJK%JK%%%jj%jjlJkkjJ
1931A3%kj%%jK%jj%%%%%%%j%JJJjKKk%Jjj%J%%jjJ%jK%%K%jJJJJKJJJLKNMLNONLMJK%lmmm
1925E0mnnnlkklkkk%jj%%%%%kJ%%Jj%j%jJJJjjKJ%%j%Jj%%j%J%%%J%%K%Jj%LKKLMNMMMMNM
1919F0KK%kkjnoonnlljmlkj%Jjkj%%j%%jJ%jj%Jjj%KkJJ%%Jjj%%Jj%%J%J%%jJ%%J%Jj%KJ%
1912A5JjKK%J%JJ%jjjjj%Jlj%k%%%%kj%j%Jjj%JjKj%%j%%%%j%%jJ%%%Kj%jJjjJ%%%%%j%%J
1906F%%%jjKjkJ%%%%%K%%jjJ%J%%%j%%%%J%%j%Jjj%%%%J%J%j%%%J%jJ%jJ%%j%j%%J%%j%%J
1899E%%%%J%j%jJ%%%J%j%%%Jj%K%%j%%J%jj%Jj%%JJ%%kJjjJ%J%%j%JjJJ%%j%%%j%%%J%%%j
1893EJj%j%J%%%Jj%%%JJjJjj%j%JJj%J%%%jJj%Kj%%jjK%jJ%%jJ%%%%j%%J%jJ%jjJ%%%j%%%
$$ plain form
1938 5 5 6 6 8 8 6 5 6 7 7 7 7 7 6 7 6 6 8 7 7 8 7 7 8 7 5 7 8 7 7 7 7 6 6 6 8 9 7 7 8 8 9 10 11 12 11 11 12 13 15 16 17 18 20 20 21 23 23 23 23 22 21 21 20 19 16 17 15 13 12 13
1931 13 13 11 10 10 10 9 11 11 10 9 9 9 9 9 9 9 9 8 8 9 10 11 10 12 14 12 12 13 12 11 11 12 12 12 11 10 11 11 10 12 12 12 14 14 13 14 15 16 17 19 20 21 22 25 27 32 36 39 44 50 55 58 62 63 65 65 62 58 54 50
1925 50 46 41 36 31 28 26 24 21 19 17 15 15 14 13 13 13 13 13 13 11 12 12 12 13 12 12 11 11 10 11 12 13 12 11 13 14 14 14 13 13 14 13 13 13 12 12 13 13 13 13 14 14 14 16 16 17 16 16 19 21 23 26 30 35 39 43 47 51 56 60
1919 60 62 64 64 62 60 59 54 48 42 37 32 29 26 25 21 18 16 15 15 16 15 13 12 12 12 11 11 11 10 11 11 10 9 9 10 9 8 8 10 8 9 10 10 10 11 10 9 9 9 10 9 9 9 10 10 11 11 11 10 11 11 11 12 12 13 12 12 14 15 15
1912 15 16 15 17 19 19 20 20 21 22 22 21 20 19 18 17 17 18 15 14 14 12 12 12 12 12 10 9 9 8 8 9 8 7 7 8 7 9 8 8 8 7 7 7 7 7 6 6 6 5 6 6 6 6 8 7 7 6 7 6 5 6 6 6 6 6 6 5 5 5 6
1906 6 6 6 6 5 4 6 5 3 4 4 4 4 4 4 6 6 6 5 4 5 5 6 6 6 6 5 5 5 5 5 6 6 6 5 5 6 5 4 4 4 4 4 5 5 6 6 5 5 5 5 6 6 5 6 6 5 6 6 6 5 5 4 4 4 5 5 5 4 4 4 5
1899 5 5 5 5 5 6 6 5 5 4 5 5 5 5 6 6 5 5 5 5 6 5 5 7 7 7 6 6 6 7 7 6 5 5 6 5 5 5 6 7 7 7 5 6 5 4 5 5 6 6 6 5 5 6 5 6 7 7 7 6 6 6 6 5 5 5 5 6 6 6 6 5
1893 5 6 5 5 4 4 5 5 5 5 6 5 5 5 5 6 7 6 7 6 5 5 4 4 5 6 5 5 6 6 6 6 5 6 5 5 7 6 6 6 5 4 6 6 5 6 6 6 5 6 6 6 6 6 5 5 5 6 6 5 6 6 5 4 5 5 5 5 4 4 4 4
1887D%JK%jjJ%%%J%jj%JJ%j%%%J%%%kKKK%jJJK%%jk%Jlj%%%%jk%J%%JJjj%J%j%%%%j%%J%%
1880Fjj%%%K%%J%jjK%%jJJJ%%jJJJJ%JjKJLJMMKL%%jmlmkljkkj%%%kj%J%%Jk%Jj%J%%%jj%
1874EJjJ%JJkJ%Jk%J%jJ%Kj%J%%%J%KJ%JJK%LKLLJJKjlklklkmkjjj%%jJjJjjJJ%%%%%%Jj%
1867Gj%JjJk%J%%jJ%JjJ%%jJJjjK%J%jk%MjjK%J%kKJKjjJ%kkkj%%%JkJ%jjJJ%jJ%%%j%%JJ
1861G%%jk%J%%JJjjJ%Jj%j%JjJ%%%JJjjJjj%J%%%%%J%%jjjJj%JJJjjJjJj%JJjJj%%%%%jj%
1854D%%JJj%%jK%j%J%Jk%%jJJjJJj%Jj%%%j%J%K%j%JjjJ%%%%jj%%%JjJ%%jJ%KjJJjj%%JJj
1848HjkJ%%kJ%jJ%jJkKJjJ%%%%J%j%%%%%%%%%j%%JJ%J%j%j%%%%kJ%JJjjJ%%%%Jj%Jj%KJjJ
1841Ij%JjjJ%jJjj%%%%J%%%j%%Jj%jjKJjjJ%%jJ%Jj%jJ%JJk%Jjjj%J%%%%%%%J%JJjjjJ%%J
$$ plain form
1887 4 4 5 7 7 6 5 6 6 6 6 7 7 6 5 5 6 7 7 6 6 6 6 7 7 7 7 5 7 9 11 11 10 11 12 14 14 14 13 11 11 12 9 8 8 8 8 8 7 5 5 6 6 6 7 8 7 6 6 7 7 6 6 6 6 6 5 5 5 6 6 6
1880 6 5 4 4 4 4 6 6 6 7 7 6 5 7 7 7 6 7 8 9 9 9 8 9 10 11 12 12 13 12 14 15 18 19 23 27 29 32 32 32 31 27 24 20 18 15 14 12 10 9 9 9 9 7 6 6 7 7 7 8 6 6 7 6 6 7 7 7 7 6 5 5
1874 5 6 5 6 6 7 8 6 7 7 8 6 6 7 7 6 7 7 9 8 8 9 9 9 9 10 10 12 13 13 14 15 17 17 20 22 25 28 29 30 32 31 28 26 23 21 18 16 12 10 9 8 7 7 7 6 7 6 7 6 5 6 7 7 7 7 7 7 7 8 7 7
1867 7 6 6 7 6 7 5 5 6 6 6 5 6 6 7 6 7 7 7 6 7 8 7 6 8 8 9 9 8 6 6 10 9 8 10 10 11 11 9 11 12 14 13 12 13 13 11 9 7 6 6 6 6 7 5 6 6 5 4 5 6 6 5 6 6 6 6 5 5 5 6 7
1861 7 7 7 6 4 4 5 5 5 6 7 6 5 6 6 7 6 6 5 5 6 5 6 6 6 6 7 8 7 6 7 6 5 5 6 6 6 6 6 6 7 7 7 6 5 4 5 4 4 5 6 7 6 5 6 5 6 5 5 6 7 6 7 6 6 6 6 6 6 5 4 4
1854 4 4 4 5 6 5 5 5 4 6 6 5 5 6 6 7 5 5 5 4 5 6 5 6 7 6 6 7 6 6 6 6 5 5 6 6 8 8 7 7 8 7 6 7 7 7 7 7 6 5 5 5 5 6 5 6 6 6 5 6 6 8 7 8 9 8 7 7 7 8 9 8
1848 8 7 5 6 6 6 4 5 5 4 5 5 4 5 3 5 6 5 6 6 6 6 6 7 7 6 6 6 6 6 6 6 6 6 6 5 5 5 6 7 7 8 8 7 7 6 6 6 6 6 4 5 5 6 7 6 5 6 6 6 6 6 7 6 6 7 6 6 8 9 8 9
1841 9 8 8 9 8 7 8 8 7 8 7 6 6 6 6 6 7 7 7 7 6 6 6 7 6 6 5 4 6 7 6 5 6 6 6 5 6 6 7 6 6 5 6 6 7 8 6 6 7 6 5 4 4 5 5 5 5 5 5 5 5 6 6 7 8 7 6 5 6 6 6 7
1835G%%%k%%K%jJkJJ%%j%%%J%%jj%J%j%J%Jjjj%JJ%j%%%Jj%%j%JJ%j%JK%%%j%%%j%%%jJ%%
1829F%JjJj%jjKjJ%Jk%%%JJ%jj%J%jjK%jJ%jJkJJ%J%%j%jJJk%J%%jJ%jJ%JjJjjJ%%%j%%%%
1822E%Jj%%%Jjj%J%J%jj%%KJj%j%%jJ%jKjjK%k%K%J%jjJJk%jJj%JJj%%%%JjjK%%k%%K%j%K
1816Gj%jj%J%%%JJk%%%%%%J%jj%J%jJJ%%j%%jJ%%J%%jjJJjJ%j%Jjj%j%JjJ%J%%J%jJ%k%J%
1809EJ%jjKj%%jJJJj%jK%jjKjlJJ%jJJJjjJ%%%j%JjJ%j%%Jj%%%jJ%%JjjJJjJj%%J%%%J%kJ
1803F%jjJjJ%jKjjJjJJ%jJj%JJ%k%%%jKJ%j%jJj%Jj%jJ%%%jJJ%J%%j%Jj%%j%KKjk%%Jj%%%
1796FKjj%jJ%jJ%%J%%%%%j%%%j%%%j%%jJJjJjJ%%%jJJJj%j%J%%%%%j%JjjJJjjJj%J%jK%j%
1790EJj%JKj%k%J%%%Jjjj%JJjk%%K%%J%JjKk%%Jkj%%%J%%K%jJ%jJ%kjJJJjjJj%Jj%J%%%Jj
$$ plain form
1835 7 7 7 7 5 5 5 7 7 6 7 5 6 7 7 7 6 6 6 6 7 7 7 6 5 5 6 6 5 5 6 6 7 6 5 4 4 5 6 6 5 5 5 5 6 5 5 5 4 4 5 6 6 5 5 6 8 8 8 8 7 7 7 7 6 6 6 6 5 6 6 6
1829 6 6 7 6 7 6 6 5 4 6 5 6 6 7 5 5 5 5 6 7 7 6 5 5 6 6 5 4 6 6 5 6 6 5 6 4 5 6 6 7 7 7 6 6 5 6 7 5 5 6 6 6 5 6 6 5 6 6 7 6 7 6 5 6 6 6 6 5 5 5 5 5
1822 5 5 6 5 5 5 5 6 5 4 4 5 5 6 6 5 4 4 4 6 7 6 6 5 5 5 4 5 5 4 6 5 4 6 6 4 4 6 6 7 7 6 5 6 7 5 5 4 5 4 4 5 6 5 5 5 5 5 6 5 4 6 6 6 4 4 4 6 6 5 5 7
1816 7 6 6 5 4 4 5 5 5 5 6 7 5 5 5 5 5 5 5 6 6 5 4 4 5 5 4 5 6 6 6 5 5 5 4 5 5 5 6 6 6 5 4 5 6 5 6 6 5 5 6 5 4 4 3 3 4 3 4 4 5 5 5 6 6 5 6 6 4 4 5 5
1809 5 6 6 5 4 6 5 5 5 4 5 6 7 6 6 5 7 7 6 5 7 6 3 4 5 5 4 5 6 7 6 5 6 6 6 6 5 5 6 5 6 6 5 5 5 6 5 5 5 5 4 5 5 5 6 5 4 5 6 5 6 5 5 5 6 6 6 6 7 7 5 6
1803 6 6 5 4 5 4 5 5 4 6 5 4 5 4 5 6 6 5 6 5 5 6 7 7 5 5 5 5 4 6 7 7 6 6 5 6 5 5 6 5 5 4 5 5 5 5 4 5 6 6 7 7 7 6 6 7 6 6 6 5 5 7 9 8 6 6 6 7 6 6 6 6
1796 6 8 7 6 6 5 6 6 5 6 6 6 7 7 7 7 7 7 6 6 6 6 5 5 5 5 4 4 4 3 4 5 4 5 4 5 5 5 5 4 5 6 7 6 6 5 5 6 6 6 6 6 6 5 5 6 5 4 5 6 5 4 5 4 4 5 5 4 6 6 5 5
1790 5 6 5 5 6 8 7 7 5 5 6 6 6 6 7 6 5 4 4 5 6 5 3 3 3 5 5 5 6 6 7 6 8 6 6 6 7 5 4 4 4 4 5 5 5 7 7 6 7 7 6 7 7 5 4 5 6 7 6 5 6 5 5 6 5 5 6 6 6 6 7 6
1783Fjj%JJJ%%jj%j%Jj%JK%j%jJJj%j%%%Kj%JjJj%%kJJ%%%%Jj%jJj%J%jJjJKkj%%%jJJ%jJ
1777FjJ%j%%%Jj%%jJ%%%Jj%%Jj%%%JjJ%%%jJ%jJ%k%J%%%%J%%JjJjjkJK%%%%%%%%j%jJ%J%%
1770F%%%%JjJk%%jJ%JJjj%KjJk%%%Jj%J%%%jJ%j%J%%Jj%%%kJJj%jJJ%%%%%Jjj%%%%%JJjJ%
1764Gj%%%%%Jj%J%jj%JJjjJ%%J%%%kJ%%jJ%jj%J%jKjJjj%JJ%jJj%JKk%%j%%%%JjJj%J%J%j
1758FJj%%%%kKjJKljLj%J%JjjJ%%k%JJ%jJj%j%JJk%%J%%j%KjJ%j%jJ%jJJ%%%%j%%%jJ%%Jj
1751Fj%%J%J%jJjj%J%%Jj%%kJKj%%Jj%j%%jK%%JkjJJjjJj%%JJ%%J%j%j%%%JJjj%%jJJJj%J
1745Gjj%JjJJjj%%%JJjj%JkJJkJ%%JJk%%%J%jjJ%J%j%%j%K%jJ%%%%Kjk%jKJkJ%%j%J%jJ%%
1738FJ%%jKj%%j%Jj%Jjj%%%K%JkjJJ%kjJ%%%%Jk%J%%jJJjJ%jJ%J%%%%jjJKj%j%Jj%%jJ%kJ
$$ plain form
1783 6 5 4 4 5 6 7 7 7 6 5 5 4 4 5 4 4 5 7 7 6 6 5 6 7 6 6 5 5 5 5 7 6 6 7 6 7 6 6 6 4 5 6 6 6 6 6 7 6 6 5 6 5 5 6 6 5 6 5 6 8 6 5 5 5 5 4 5 6 6 5 6
1777 6 5 6 6 5 5 5 5 6 5 5 5 4 5 5 5 5 6 5 5 5 6 5 5 5 5 6 5 6 6 6 6 5 6 6 5 6 6 4 4 5 5 5 5 5 6 6 6 7 6 7 6 5 3 4 6 6 6 6 6 6 6 6 6 5 5 4 5 5 6 6 6
1770 6 6 6 6 6 7 6 7 5 5 5 4 5 5 6 7 6 5 5 7 6 7 5 5 5 5 6 5 5 6 6 6 6 5 6 6 5 5 6 6 6 7 6 6 6 6 4 5 6 5 5 4 5 6 6 6 6 6 6 7 6 5 5 5 5 5 5 6 7 6 7 7
1764 7 6 6 6 6 6 6 7 6 6 7 7 6 5 5 6 7 6 5 6 6 6 7 7 7 7 5 6 6 6 5 6 6 5 4 4 5 5 4 6 5 6 5 4 4 5 6 6 5 6 5 5 6 8 6 6 6 5 5 5 5 5 6 5 6 5 5 6 6 7 7 6
1758 6 7 6 6 6 6 6 4 6 5 6 8 5 4 7 6 6 7 7 8 7 6 7 7 7 5 5 6 7 7 6 7 6 6 5 5 6 7 5 5 5 6 6 6 5 5 7 6 7 7 6 6 5 6 6 5 6 7 7 7 7 7 6 6 6 6 5 6 6 6 7 6
1751 6 5 5 5 6 6 7 7 6 7 6 5 5 6 6 6 7 6 6 6 4 5 7 6 6 6 7 6 6 5 5 5 4 6 6 6 7 5 4 5 6 5 4 5 4 4 4 5 6 6 6 7 7 6 6 5 5 5 5 6 7 6 5 5 5 4 5 6 7 6 6 7
1745 7 6 5 5 6 5 6 7 6 5 5 5 5 6 7 6 5 5 6 4 5 6 4 5 5 5 6 7 5 5 5 5 6 6 5 4 5 5 6 6 5 5 5 4 4 6 6 5 6 6 6 6 6 8 7 5 5 4 6 7 5 6 6 6 5 5 6 6 5 6 6 6
1738 6 7 7 7 6 8 7 7 7 6 6 7 6 6 7 6 5 5 5 5 7 7 8 6 5 6 7 7 5 4 5 5 5 5 5 6 4 4 5 5 5 4 5 6 5 6 6 5 6 6 7 7 7 7 7 6 5 6 8 7 7 6 6 7 6 6 6 5 6 6 4 5
1732EJj%%J%j%jJ%K%j%%jJJjJJjj%%j%J%J%%%%%%%J%jj%j%J%j%%%%%%J%%JjjJJ%%%kJJjJj
1725F%JJjjkK%%j%J%%%%%jJJ%j%jJJ%j%jJ%jKj%J%%%%jjJ%Jj%%J%jjJJkjJK%jJ%Jjj%JjJj
1719FJJjJ%%%j%j%Kj%Jkj%J%%Jj%%jKjj%%KJk%J%k%J%j%jKJ%j%J%JJjj%jJ%J%j%J%KK%%%J
1712A3%kj%j%J%j%%%%jjJJ%%%k%J%jjJJjj%%%%J%KjkJJ%%j%J%J%j%KJ%J%K%JJ%jjjJjjJkj
1706A0%%%jjJ%%jjJJK%%KJJ%kj%jj%jjj%%%J%%%j%%%K%%%Jjj%LJ%%%K%%%k%jkj%%JJ%JjJ%
1700A1JJ%K%%J%j%jjjJjj%%Jj%k%%j%Jjj%%J%jJj%%JjjJj%JjJ%jK%%%%%jjJ%JjJj%%JJKJ%
1693A2K%%j%%jj%k%JkjJJjjJj%J%Jj%%j%j%%%%JjJj%Jj%%JJ%%%j%J%%JkjJJjJj%%%%%%JJ%
1687Ikj%jJJ%Jj%jJ%%JjkK%jJj%jJ%J%j%%%%%JJk%J%%jJ%j%Jj%J%%K%j%%J%jj%Kj%%%j%%j
$$ plain form
1732 5 6 5 5 5 6 6 5 5 4 5 5 7 7 6 6 6 5 6 7 6 7 8 7 6 6 6 5 5 6 6 7 7 7 7 7 7 7 7 8 8 7 6 6 5 5 6 6 5 5 5 5 5 5 5 6 6 6 7 6 5 6 7 7 7 7 5 6 7 6 7 6
1725 6 6 7 8 7 6 4 6 6 6 5 5 6 6 6 6 6 6 5 6 7 7 6 6 5 6 7 7 6 6 5 6 6 5 7 6 6 7 7 7 7 7 6 5 6 6 7 6 6 6 7 7 6 5 6 7 5 4 5 7 7 6 7 7 8 7 6 6 7 6 7 6
1719 6 7 8 7 8 8 8 8 7 7 6 6 8 7 7 8 6 5 5 6 6 6 7 6 6 6 5 7 6 5 5 5 7 8 6 6 7 7 5 5 6 6 5 5 4 6 7 7 6 6 7 7 8 9 8 7 7 6 7 7 8 8 7 7 8 8 10 12 12 12 12 13
1712 13 13 11 10 10 9 9 10 10 9 9 9 9 9 8 7 8 9 9 9 9 7 7 8 8 7 6 7 8 7 6 6 6 6 6 7 7 9 8 6 7 8 8 8 7 7 8 8 9 9 8 8 10 11 11 12 12 14 14 15 16 16 15 14 13 14 13 12 13 11 10
1706 10 10 10 10 9 8 9 9 9 8 7 8 9 11 11 11 13 14 15 15 13 12 12 11 10 10 9 8 7 7 7 7 8 8 8 8 7 7 7 7 9 9 9 9 10 9 8 8 11 12 12 12 12 14 14 14 14 12 12 11 9 8 8 8 9 10 10 11 10 11 11
1700 11 12 13 13 15 15 15 16 16 15 15 14 13 12 13 12 11 11 11 12 11 11 9 9 9 8 8 9 8 7 7 7 8 8 7 8 7 7 7 8 7 6 7 6 6 7 6 7 7 6 8 8 8 8 8 8 7 6 7 7 8 7 8 7 7 7 8 9 11 12 12
1693 12 14 14 14 13 13 13 12 11 11 9 9 10 8 7 8 9 8 7 8 7 7 8 8 9 8 8 8 7 7 6 6 6 6 6 7 6 7 6 6 7 6 6 6 7 8 8 8 8 7 7 8 8 8 9 7 6 7 8 7 8 7 7 7 7 7 7 7 8 9 9
1687 9 7 6 6 5 6 7 7 8 7 7 6 7 7 7 8 7 5 7 7 6 7 6 6 5 6 6 7 7 6 6 6 6 6 6 7 8 6 6 7 7 7 6 7 7 6 6 7 6 6 7 7 7 9 9 8 8 8 9 9 8 7 7 9 8 8 8 8 7 7 7 6
1681F%%JJjJ%%%Jj%%kKjkJJ%JjJ%%j%%%%j%jKJj%jjJ%Jj%JK%jj%%%j%%%j%KJ%%%%%%j%j%%
1674FJ%%%J%j%%j%J%JkJ%j%%%%JjJ%%JkjJ%%JjJ%Jjk%K%%%%JjJJ%%jjjjKjJj%%%J%j%%%%J
1668GJj%J%%%j%%%J%Jj%Jj%j%%JjJJj%JjjK%%j%J%J%jJJj%JjJJJ%jJ%jJj%j%%jJ%jjjJj%%
1661H%%J%Kj%jj%jJ%jJ%JJkjjKJjJJ%j%J%%%%JJjjJ%%%j%%J%jK%JLJJLKJKJJJjjkjllkkjj
1655A2l%k%K%%j%J%%%%jJjJ%%%jJJ%%%kJ%%j%%%J%%%%JJjj%J%jJjJK%%JkJJJKJKLJKKKJk%
1648B8k%lklkjjk%j%%j%Jjj%%jJJjj%%JJjJj%Jj%%%%%%%j%JJJj%JjkJj%%J%%%jJ%%J%%%J%
1642A1%J%%JJjjj%%%%%%j%kjJ%%jJ%%KjjJj%J%%J%jjJ%%Jk%%jJ%JjJj%%%jJ%%%%%%JJjj%%
1636H%%%%Jj%%jj%KJ%k%%JJ%jJ%J%jjJjJ%%%%%kJJk%%%%j%J%%%J%%j%J%j%JKk%%%%%JjJ%%
$$ plain form
1681 6 6 6 7 8 7 8 8 8 8 9 8 8 8 6 8 7 5 6 7 7 8 7 8 8 8 7 7 7 7 7 6 6 5 7 8 7 7 6 5 6 6 7 6 6 7 9 9 8 7 7 7 7 6 6 6 6 5 5 7 8 8 8 8 8 8 8 7 7 6 6 6
1674 6 7 7 7 7 8 8 7 7 7 6 6 7 7 8 6 7 7 6 6 6 6 6 7 6 7 7 7 8 6 5 6 6 6 7 6 7 7 8 7 5 5 7 7 7 7 7 8 7 8 9 9 9 8 7 6 5 7 6 7 6 6 6 6 7 7 6 6 6 6 6 7
1668 7 8 7 7 8 8 8 8 7 7 7 7 8 8 9 8 8 9 8 8 7 7 7 8 7 8 9 8 8 9 8 7 9 9 9 8 8 9 9 10 10 9 10 11 10 10 11 10 11 12 13 13 12 13 13 12 13 12 12 11 11 11 10 11 11 10 9 8 9 8 8 8
1661 8 8 8 9 9 11 10 10 9 8 8 7 8 8 7 8 8 9 10 8 7 6 8 9 8 9 10 10 9 9 10 10 10 10 10 11 12 11 10 11 11 11 11 10 10 10 11 11 10 12 12 13 16 17 18 21 23 24 26 27 28 29 28 27 25 24 21 18 16 14 13 12
1655 12 9 9 7 7 9 9 9 8 8 9 9 9 9 9 8 9 8 9 9 9 9 8 9 10 10 10 10 8 9 9 9 8 8 8 8 9 9 9 9 9 10 11 10 9 9 10 10 9 10 9 10 12 12 12 13 11 12 13 14 16 17 19 22 23 25 27 29 30 28 28
1648 28 26 26 23 21 18 16 15 14 12 12 11 11 11 10 10 11 10 9 9 9 8 9 10 9 8 8 8 9 10 9 10 9 9 10 9 9 9 9 9 9 9 9 8 8 9 10 11 10 10 11 10 8 9 8 8 8 9 9 9 9 8 9 9 9 10 10 10 10 11 11
1642 11 11 12 12 12 13 14 13 12 11 11 11 11 11 11 11 10 10 8 7 8 8 8 7 8 8 8 10 9 8 9 8 8 9 9 9 10 10 9 8 9 9 9 10 8 8 8 7 8 8 9 8 9 8 8 8 8 7 8 8 8 8 8 8 8 9 10 9 8 8 8
1636 8 8 8 8 8 9 8 8 8 7 6 6 8 9 9 7 7 7 8 9 9 8 9 9 10 10 9 8 9 8 9 9 9 9 9 9 7 8 9 7 7 7 7 7 6 6 7 7 7 7 8 8 8 7 7 8 8 7 7 8 10 8 8 8 8 8 8 9 8 9 9 9
1629IjJ%%j%jJ%%K%k%%J%j%%%%J%J%%j%Jj%%jJj%kJJJJj%JJ%k%%Jj%JkJ%Jj%%%%j%Jj%jJJ
1623I%%%%%%%%J%J%%j%jj%JJ%%j%%%j%JjJ%%j%JJ%%j%%jJ%%%%%%jK%%j%%%%%j%JJj%Jj%%J
1616A0j%jJ%%j%%jJJ%%Jj%kJ%JJ%j%JjJ%j%jJJj%jJJ%%Jjj%%%%JjjJJJJjj%KJkj%%%jKjJ%
1610A1%%%K%J%%JL%JLJJJkjlkk%j%jj%J%jJJ%J%%JJjjjJ%jj%J%%%J%%%%%JJJjKKJjKJJKLK
1604C2JLMNNQRJ2J3J8K0J7J6J0Jmj1j9k1j9j8j4j0qoomlklklj%Jlj%JJ%%%J%%%J%%%jl%j%
1599A6j%kKJj%jJ%jkJj%J%j%%%JjjJ%%k%JJjJjjJJj%%jJ%%j%JJ%%%j%JJkj%J%Jj%J%j%%%%
1592A1jJ%%%J%%%%J%jj%JKj%jjKj%%jJJj%Kkk%KJJ%j%j%%%J%KjjjjJ%%Jj%%%Jjj%%JjJJjK
1586A4jJ%j%%%%%j%%%JkJJJjjJ%j%%J%jJJ%%jj%K%j%%K%%%%jJjj%J%%Jj%jJj%%J%jjjJK%j
$$ plain form
1629 9 8 9 9 9 8 8 7 8 8 8 10 10 8 8 8 9 9 8 8 8 8 8 9 9 10 10 10 9 9 10 9 9 9 8 9 8 8 6 7 8 9 10 9 9 10 11 11 9 9 9 10 9 9 10 8 9 9 10 9 9 9 9 9 8 8 9 8 8 7 8 9
1623 9 9 9 9 9 9 9 9 9 10 10 11 11 11 10 10 9 8 8 9 10 10 10 9 9 9 9 8 8 9 8 9 9 9 8 8 9 10 10 10 9 9 9 8 9 9 9 9 9 9 9 8 10 10 10 9 9 9 9 9 9 8 8 9 10 9 9 10 9 9 9 10
1616 10 9 9 8 9 9 9 8 8 8 7 8 9 9 9 10 9 9 7 8 8 9 10 10 9 9 10 9 10 10 9 9 8 9 10 9 9 8 9 10 10 10 11 10 9 9 9 9 9 10 9 8 9 10 11 12 11 10 10 12 13 11 10 10 10 10 9 11 10 11 11
1610 11 11 11 11 13 13 14 14 14 15 18 18 19 22 23 24 25 23 22 19 17 15 15 14 14 13 12 12 13 13 12 13 14 14 15 15 15 16 17 16 15 14 15 15 14 13 13 14 14 14 14 15 15 15 15 15 15 16 17 18 17 19 21 22 21 23 24 25 27 30 32
1604 32 33 36 40 45 50 58 67 79 92 110 130 147 163 173 174 170 159 140 119 100 82 68 58 50 44 38 34 31 29 26 24 21 20 20 21 18 17 17 18 19 19 19 19 20 20 20 20 21 21 21 21 20 17 17 16 16
1599 16 15 15 13 15 16 15 15 14 15 15 14 12 13 12 12 13 13 12 12 12 12 13 12 11 12 12 12 10 10 11 12 11 12 11 10 11 12 11 11 11 10 11 11 11 10 10 11 12 12 12 12 11 11 12 13 11 10 10 11 11 12 11 11 12 12 11 11 11 11 11
1592 11 10 11 11 11 11 12 12 12 12 12 13 13 12 11 11 12 14 13 13 12 11 13 12 12 12 11 12 13 12 12 14 12 10 10 12 13 14 14 13 13 12 12 12 12 13 13 15 14 13 12 11 12 12 12 13 12 12 12 12 13 12 11 11 11 12 11 12 13 12 14
1586 14 13 14 14 13 13 13 13 13 13 12 12 12 12 13 11 12 13 14 13 12 13 13 12 12 12 13 13 12 13 14 14 14 13 12 12 14 14 13 13 13 15 15 15 15 15 14 15 14 13 13 14 14 14 15 14 14 13 14 13 13 13 14 14 13 12 11 12 14 14 13
1579A3%%%%%J%j%K%%%j%%%%J%jjjKjJ%%%%%jJ%jJ%JjkKj%jjJJKj%%jj%KJjjJ%%Jk%%Jj%%%
1573A3%%KJjj%K%j%%j%%%%%j%J%KjJ%%%J%%%%%%J%%%JJj%jJ%%%%jJk%J%%%%%%%%JjJj%%J%
1567A9%j%K%%j%%%%%%%j%J%%%J%%k%JJJ%KJ%%%JJJKJ%jlJ%%j%j%KKJJjJJ%J%JJ%%%Jj%JJ%
1560C7%%K%KMJJK%kjmjjjjJ%%jJ%%jJK%Kj%KJJJJJKKKJLMMOQJ0J1J4J6K2K4K8K6K1J3jj0k0
1555B35l0l1k7k2j7j1onkl%JJ%KNLNPPJ2J7K0K5K8L1K9J9Nrj8l1l4l3k6j6j0ponmononl%k
1551G2KKLNNOQJ4J7K0K6L0K9K5J7Mpk0k9l4l1k3j8j3qqnlmmnlk%j%jj%kj%jj%%%j%Jj%J%%
1546F0%J%%kjkjjj%JJJJKJJJJK%JJJjJ%Jjk%%%J%JJ%K%LJKJKLLLLMOMPQJ1J0PNOL%%JLNON
1540A83OOMMMMJlmnpmlkJNORQJ2J2J6J4J4J4J5J6J7K4L0L5M8O0P1Q3Q8P9N4K1j5n0p7r2q5
$$ plain form
1579 13 13 13 13 13 13 14 14 13 13 15 15 15 15 14 14 14 14 14 15 15 14 13 12 14 13 14 14 14 14 14 14 13 14 14 13 14 14 15 14 12 14 13 13 12 11 12 13 15 14 14 14 13 12 12 14 15 14 13 14 14 14 15 13 13 13 14 13 13 13 13
1573 13 13 13 15 16 15 14 14 16 16 15 15 15 14 14 14 14 14 14 13 13 14 14 16 15 16 16 16 16 17 17 17 17 17 17 17 18 18 18 18 19 20 19 19 18 19 19 19 19 19 18 19 17 17 18 18 18 18 18 18 18 18 18 19 18 19 18 18 18 19 19
1567 19 19 18 18 20 20 20 19 19 19 19 19 19 19 19 18 18 19 19 19 19 20 20 20 18 18 19 20 21 21 23 24 24 24 24 25 26 27 29 30 30 29 26 27 27 27 26 26 25 25 27 29 30 31 30 31 32 32 33 33 34 35 35 35 35 36 35 35 36 37 37
1560 37 37 37 39 39 41 45 46 47 49 49 47 46 42 41 40 39 38 39 39 39 38 39 39 39 38 39 41 41 43 42 42 44 45 46 47 48 49 51 53 55 56 59 63 67 73 81 91 102 116 132 154 178 206 232 253 266 265 255 235
1555 235 205 174 147 125 108 97 91 86 84 81 81 82 83 83 85 90 93 98 105 112 124 141 161 186 214 245 274 293 298 289 271 240 206 173 147 131 121 114 108 103 99 93 88 82 77 74 74 72
1551 72 74 76 79 84 89 95 103 117 134 154 180 210 239 264 281 285 278 258 229 195 164 141 123 110 102 94 89 86 82 78 73 70 68 68 67 67 66 65 65 63 62 62 61 60 60 60 60 59 59 60 59 59 60 60 60
1546 60 60 61 61 61 59 58 56 55 54 53 53 54 55 56 57 59 60 61 62 63 65 65 66 67 68 67 68 68 69 68 66 66 66 66 67 67 68 69 69 71 71 74 75 77 78 80 83 86 89 92 96 102 106 113 121 132 142 149 154 160 163 163 163 164 167 172 178 183
1540 183 189 195 199 203 207 211 212 209 205 200 193 189 186 184 185 190 196 205 213 225 237 253 267 281 295 310 326 343 367 397 432 480 540 611 694 782 861 915 936 921 871 794 702 617
1536F17o4m3k7j5pPJ4K5L6N0O4Q1R4J02R2O9L2mm0p1q6q0n9l6j4lQJ7K3K7L3L9M1N0N9P0P8
1532A179R3J05J21J30J45J57J73J98K33K74L42M23N26O57Q31J055J357J759K282K895L525
1530A8460L993M051L451K221N91j010k541l867m679m490l608k732k004j484j105q47o52n12
1529C236m02l25k53k03j59j26j00q6p3o5n5m3k2QN1R4J38J67J71J33N9k7j10j94k45k56k14
1526A099j61j16q1n0k7kJ9L3L5K0kk7n3p6q8q1o0m3l1k5k0j4j2j0rqpopkmnlmnpqpomonml
1522A17kjkkkkmklkkl%jJJj%KJkj%jjjJj%ljlmljjjjkjJJjj%%kjlk%Jkljjj%kkjk%kjj%Jj
1516D0JJK%JKJKKKjjlmmmmlkk%jkj%kjjjj%J%%%jjj%%KJK%jjJ%%K%jJ%j%j%%jJj%J%jj%jJ
1510A6jJJ%%j%jjJ%jj%%%jJ%jJjKK%j%jJKjj%JJjkJJ%Kj%%jjJLJj%jkJK%%%J%JJJj%l%kj%
$$ plain form
1536 617 553 510 483 468 461 468 482 507 543 593 657 738 832 934 1026 1095 1127 1123 1083 1012 926 846 787 751 737 734 742 759 782 809 842 881 922 972 1031 1101 1179
1532 1179 1272 1377 1498 1628 1773 1930 2103 2301 2534 2808 3150 3573 4099 4756 5587 6642 7999 9758 12040 14935 18460
1530 18460 22453 26504 29955 32176 32767 31757 29216 25349 20670 16180 12572 9840 7836 6352 5247 4400 3748 3236
1529 3236 2834 2509 2256 2053 1894 1768 1668 1582 1509 1444 1389 1346 1324 1332 1383 1477 1615 1782 1953 2086 2145 2118 2008 1814 1569 1313 1099
1526 1099 938 822 741 691 664 662 681 714 749 769 767 740 687 611 523 442 382 339 308 283 263 249 237 227 218 210 203 197 190 188 184 179 176 172 167 160 152 145 139 135 129 124 120 117
1522 117 115 114 112 110 108 106 102 100 97 95 93 90 90 89 90 91 90 90 92 93 91 90 90 89 88 87 88 87 87 84 83 80 76 73 72 71 70 69 67 66 67 68 67 66 66 66 64 63 60 58 58 59 57 54 53 52 51 51 49 47 46 44 44 42 41 40 40 41 40
1516 40 41 42 44 44 45 47 48 50 52 54 53 52 49 45 41 37 33 30 28 26 26 25 23 22 22 20 19 18 17 16 16 17 17 17 17 16 15 14 14 14 16 17 19 19 18 17 18 18 18 20 20 19 20 20 19 19 18 18 18 17 18 17 17 18 18 17 16 16 15 16
1510 16 15 16 17 17 17 16 16 15 14 15 15 14 13 13 13 13 12 13 13 12 13 12 14 16 16 15 15 14 15 17 16 15 15 16 17 16 14 15 16 16 18 17 17 17 16 15 16 19 20 19 19 18 16 17 19 19 19 19 20 20 21 22 23 22 22 19 19 17 16 16
1503A6%j%Jjk%%%Jjj%JJjJK%%%%K%%K%%KLKLNMPONNMk%nonmkkmnnmjkk%kjJj%j%j%j%%jJJ
1497A2jj%jJjJJk%%%%K%jJJ%%%jJj%jk%%JJ%j%%JJJJJJKj%j%jj%j%%kJ%%jjK%%JJkJjjk%j
1490G%%%%%%%%%J%%%j%J%jJJKJ%J%Jj%%kj%j%kjKJ%jjjKjj%J%JJjjj%%%%JJ%jk%JJJ%jJJJ
1484A0%JjjJ%%j%%j%%jjJ%%%jL%%%j%%JJ%jk%%%J%%jjKjj%J%J%j%%%jJjJ%j%JkJJ%%Jjk%J
1478F%jJ%%J%j%jjJK%j%jJJj%jLjj%%%jKJj%J%Kj%j%Jj%%%%%%%jJKJ%JkJ%jj%JJJ%jjj%%%
1471I%%%JJ%J%%JjKKJLJLMMKjjjlklklmkj%j%%%j%%%JKJ%Kj%Jjjj%%%JLjk%jjjjjJj%jjKj
1465GjJKKlj%%%%%%%jKj%J%%Jj%Kj%KJJ%KJ%JK%%K%jJjj%%J%jJ%jj%k%%%ljJj%%%j%%%%j%
1458A0%J%J%%J%KJJ%%JKJKKKMMMOQRJ2J5J5J8J8J7J1Llj2j7k0k0j6j4rqrplmml%l%jjjJ%%
$$ plain form
1503 16 16 15 15 16 15 13 13 13 13 14 13 12 12 13 14 13 14 16 16 16 16 16 18 18 18 20 20 20 22 25 27 30 35 39 46 52 57 62 66 64 64 59 53 48 44 42 40 36 31 26 22 21 19 17 17 15 14 15 14 14 13 13 12 12 11 11 11 10 11 12
1497 12 11 10 10 9 10 9 10 11 9 9 9 9 9 11 11 10 11 12 12 12 12 11 12 11 11 10 8 8 8 9 10 10 9 9 9 10 11 12 13 14 15 17 16 16 15 15 14 13 13 12 12 12 10 11 11 11 10 9 11 11 11 12 13 11 12 11 10 8 8 7
1490 7 7 7 7 7 7 7 7 7 7 8 8 8 8 7 7 8 8 7 8 9 11 12 12 13 13 14 13 13 13 11 10 10 9 9 7 6 8 9 9 8 7 6 8 7 6 6 7 7 8 9 8 7 6 6 6 6 6 7 8 8 7 5 5 6 7 8 8 7 8 9 10
1484 10 10 11 10 9 10 10 10 9 9 9 8 8 8 7 6 7 7 7 7 6 9 9 9 9 8 8 8 9 10 10 9 7 7 7 7 8 8 8 7 6 8 7 6 6 7 7 8 8 7 7 7 7 6 7 6 7 7 6 6 7 5 6 7 7 7 8 7 5 5 6
1478 6 6 5 6 6 6 7 7 6 6 5 4 5 7 7 6 6 5 6 7 6 6 5 8 7 6 6 6 6 5 7 8 7 7 8 8 10 9 9 8 8 9 8 8 8 8 8 8 8 8 7 8 10 11 11 12 10 11 11 10 9 9 10 11 12 12 11 10 9 9 9 9
1471 9 9 9 9 10 11 11 12 12 12 13 12 14 16 17 20 21 24 28 32 34 33 32 31 28 26 23 21 18 14 12 11 11 10 10 10 10 9 9 9 9 10 12 13 13 15 14 14 15 14 13 12 12 12 12 13 16 15 13 13 12 11 10 9 8 9 8 8 7 6 8 7
1465 7 6 7 9 11 8 7 7 7 7 7 7 7 7 6 8 7 7 8 8 8 9 8 8 10 9 9 11 12 13 13 15 16 16 17 19 19 19 21 21 20 21 20 19 19 19 20 20 19 20 20 19 18 18 16 16 16 16 13 12 13 12 12 12 12 11 11 11 11 11 10 10
1458 10 10 11 11 12 12 12 13 13 15 16 17 17 17 18 20 21 23 25 27 31 35 39 45 53 62 74 89 104 122 140 157 168 171 168 156 139 119 99 83 69 60 52 43 36 33 29 25 22 22 19 19 18 17 16 17 17 17
1453A7jkJj%JJ%J%%Jkj%j%%%%%j%%j%JkkJjj%%%%%J%jjJ%kJ%jJj%%%KJ%kjjJJ%j%%%J%%%J
1447HjKj%%JJ%j%j%J%%%Kj%J%JjJKLLJKMLKjkkmlklk%j%%l%%%%j%jkKJ%JjJj%%%j%%%%%%J
1440Hjj%JJJ%kjJj%JJj%%%J%j%%%%%jJ%%%%%J%%J%%%J%%JJJJK%%K%kjJJjkjjjjj%j%%j%Kk
1434Gj%%J%J%kJ%%%%%Kjj%%j%JJ%Jj%j%%J%jj%%J%JJkJkJJj%%jJ%%kJJ%Jj%%%j%%%%%%%J%
1427GJjJ%JjjJjJ%%%JjKjJ%j%j%%j%%JjJj%jJ%jJ%k%%J%%%%j%%%%JjJ%Kk%Jj%%%jjJ%jJ%%
1421EK%%jJjjjJ%jK%%%J%kJJ%JjjJJk%%jJjkK%j%L%%Jjjj%j%%kJJJ%%j%%%J%%%%%j%%%%%J
1415E%%%kJjJKjj%J%Kjj%%%%jJJkjJJj%%J%%%%j%jJ%JK%jk%J%%%%%%%%%%%j%KJjjj%jJ%J%
1408EJ%%%%%%Kjj%jjJ%%%%J%%jJ%j%jK%%j%%J%j%%%Jjj%J%%%j%JKjJjjj%J%JjkJJkJ%%JjJ
$$ plain form
1453 17 16 14 15 14 14 15 16 16 17 17 17 18 16 15 15 14 14 14 14 14 14 13 13 13 12 12 13 11 9 10 9 8 8 8 8 8 8 9 9 8 7 8 8 6 7 7 6 7 6 6 6 6 8 9 9 7 6 5 6 7 7 6 6 6 6 7 7 7 7 8
1447 8 7 9 8 8 8 9 10 10 9 9 8 8 9 9 9 9 11 10 10 11 11 12 11 12 14 17 20 21 23 27 30 32 31 29 27 23 20 18 15 13 13 12 12 12 9 9 9 9 9 8 8 7 5 7 8 8 9 8 9 8 8 8 8 7 7 7 7 7 7 7 8
1440 8 7 6 6 7 8 9 9 7 6 7 6 6 7 8 7 7 7 7 8 8 7 7 7 7 7 7 6 7 7 7 7 7 7 8 8 8 9 9 9 9 10 10 10 11 12 13 14 16 16 16 18 18 16 15 16 17 16 14 13 12 11 10 9 9 8 8 8 7 7 9 7
1434 7 6 6 6 7 7 8 8 6 7 7 7 7 7 7 9 8 7 7 7 6 6 7 8 8 9 8 8 7 7 7 8 8 7 6 6 6 7 7 8 9 7 8 6 7 8 7 7 7 6 7 7 7 5 6 7 7 8 7 7 7 7 6 6 6 6 6 6 6 6 7 7
1427 7 8 7 8 8 9 8 7 8 7 8 8 8 8 9 8 10 9 10 10 9 9 8 8 8 7 7 7 8 7 8 7 7 6 7 7 6 7 7 5 5 5 6 6 6 6 6 5 5 5 5 5 6 5 6 6 8 6 6 7 6 6 6 6 5 4 5 5 4 5 5 5
1421 5 7 7 7 6 7 6 5 4 5 5 4 6 6 6 6 7 7 5 6 7 7 8 7 6 7 8 6 6 6 5 6 5 3 5 5 4 4 7 7 7 8 7 6 5 5 4 4 4 2 3 4 5 5 5 4 4 4 4 5 5 5 5 5 5 4 4 4 4 4 4 5
1415 5 5 5 5 3 4 3 4 6 5 4 4 5 5 7 6 5 5 5 5 5 4 5 6 4 3 4 5 4 4 4 5 5 5 5 5 4 4 3 4 4 5 7 7 6 4 4 5 5 5 5 5 5 5 5 5 5 5 5 4 4 6 7 6 5 4 4 3 4 4 5 5
1408 5 6 6 6 6 6 6 6 8 7 6 6 5 4 5 5 5 5 5 6 6 6 5 6 6 5 5 4 6 6 6 5 5 5 6 6 5 5 5 5 6 5 4 4 5 5 5 5 4 4 5 7 6 7 6 5 4 4 5 5 6 5 3 4 5 3 4 4 4 5 4 5
1402EJjj%%J%%J%j%Jjj%%JJkJ%%%j%%%JjjJ%KJk%%JJ%%%%jjjJ%jJj%%J%%%%jJ%jJjJj%%J%
1395Ej%Jj%J%%%%j%J%jJjJj%%%%jJjJJj%J%JjjJ%jJ%%jJ%J%jJ%%j%%jJ%%JK%JJJ%%jj%kkJ
1389F%%j%j%JJ%j%%%JJjjjKL%KjJJJJkj%jkk%jjJ%%j%%j%LjjK%j%J%%%j%%J%J%%jJ%%jJ%%
1382GJJJ%jJjj%j%k%%%J%%j%%JjjJjj%Ljj%J%jKjjJKj%%%jJj%j%%jJ%%JJ%J%%j%JJ%JJ%kj
1376GJ%J%jJJjJ%%%%JKjJJk%K%K%KLKMLNQPJ3K1L0M2N7P1P1N6K6ll5o3q5q1n5l4k2j5rnol
1371B1ll%jjjk%%Jj%%Jjj%jJjjjJkJjJJ%k%J%%%%%jJ%%%j%jJ%j%J%%j%KjjK%kJJk%jJ%%%%
1365DjJJ%jj%J%%%%%%JK%Jj%%jjjJ%%Jj%J%J%%%J%%jjjJ%%%%j%%kJ%JjjJJjJ%%J%%kjJJ%%
1358E%Jk%J%k%J%kJ%K%%j%%JjJjJ%j%%Jj%%%J%JJkJ%JjjJ%%j%j%J%j%%%j%J%J%%%jjKj%%J
$$ plain form
1402 5 6 5 4 4 4 5 5 5 6 6 5 5 6 5 4 4 4 5 6 4 5 5 5 5 4 4 4 4 5 4 3 4 4 6 7 5 5 5 6 7 7 7 7 7 6 5 4 5 5 4 5 4 4 4 5 5 5 5 5 4 5 5 4 5 4 5 4 4 4 5 5
1395 5 4 4 5 4 4 5 5 5 5 5 4 4 5 5 4 5 4 5 4 4 4 4 4 3 4 3 4 5 4 4 5 5 6 5 4 5 5 4 5 5 5 4 5 5 6 6 5 6 6 6 5 5 5 4 5 5 5 6 8 8 9 10 11 11 11 10 9 9 7 5 6
1389 6 6 6 5 5 4 4 5 6 6 5 5 5 5 6 7 6 5 4 6 9 9 11 10 11 12 13 14 12 11 11 10 8 6 6 5 4 5 5 5 4 4 4 3 3 6 5 4 6 6 5 5 6 6 6 6 5 5 5 6 6 7 7 7 6 7 7 7 6 7 7 7
1382 7 8 9 10 10 9 10 9 8 8 7 7 5 5 5 5 6 6 6 5 5 5 6 5 4 5 4 3 3 6 5 4 4 5 5 4 6 5 4 5 7 6 6 6 6 5 6 5 5 4 4 4 3 4 4 4 5 6 6 7 7 7 6 6 7 8 8 9 10 10 8 7
1376 7 8 8 9 9 8 9 10 9 10 10 10 10 10 11 13 12 13 14 12 12 14 14 16 16 18 21 23 27 30 35 43 50 63 84 114 156 213 284 355 411 437 434 399 336 251 170 115 81 59 44 35 30 24 21
1371 21 18 15 15 14 13 12 10 10 10 11 10 10 10 11 10 9 9 8 9 8 7 6 7 5 6 5 6 7 7 5 5 6 6 6 6 6 6 5 6 6 6 6 5 5 4 5 5 4 4 5 5 5 4 4 6 5 4 6 6 4 5 6 4 4 3 4 4 4 4 4
1365 4 3 4 5 5 4 3 3 4 4 4 4 4 4 4 5 7 7 8 7 7 7 6 5 4 5 5 5 6 5 5 6 6 7 7 7 7 8 8 8 7 6 5 6 6 6 6 6 5 5 5 3 4 4 5 4 3 4 5 4 5 5 5 6 6 6 4 3 4 5 5 5
1358 5 5 6 4 4 5 5 3 3 4 4 2 3 3 5 5 5 4 4 4 5 4 5 4 5 5 4 4 4 5 4 4 4 4 5 5 6 7 5 6 6 7 6 5 6 6 6 5 5 4 4 5 5 4 4 4 4 3 3 4 4 5 5 5 5 4 3 5 4 4 4 5
1352EJj%%j%Jk%%JJ%%%jJjjJJ%j%jJ%%%%JjJ%%j%%%JJ%jKJjkJJk%JjjJjjJj%K%jjKjjJ%%%
1345Dj%K%j%J%%j%K%jjJ%j%%JjJ%%%%j%%J%%%kK%jjJ%%%j%JJjJjj%JjJJj%j%%%JjjKJ%%jj
1339CJJk%%jJ%%jJ%%%JJjJJjj%jJ%%%%Jj%%%j%Kj%%j%J%%j%JJ%jJ%%jj%J%jJ%jJ%J%J%jJ%
1332Fkj%%L%j%kJJ%%j%%%jJj%J%Jj%JJ%%%%%kJ%jJJjj%%%%k%K%%j%%K%j%%%JjJ%j%j%%J%%
1326D%%%%jJj%J%J%%%jKk%J%k%J%%%jJ%%jJjJK%kjKjj%J%%%%%%JjJjjJ%%%jJj%J%jJJjj%j
1319BjK%jjJJjJ%j%K%jKj%%%%%%j%%J%Jj%Kj%JjkJjJ%Jk%kJJJ%JJkJJjjj%JJjjJJ%kJ%%kJ
1313CJ%jJ%J%%kJJj%JJjjJj%kJ%J%%jJ%%%%J%jj%jJJ%%%%%j%%JjJJ%%%j%%%%j%Kj%j%Kjj%
1307CK%j%jjJJ%jjJJ%%J%jjJJ%jj%jJ%%J%%J%jj%%j%JJjjJ%J%%%J%jj%J%jKJjkJjJJ%%%%%
$$ plain form
1352 5 6 5 5 5 4 4 5 3 3 3 4 5 5 5 5 4 5 4 3 4 5 5 4 4 3 4 4 4 4 4 5 4 5 5 5 4 4 4 4 5 6 6 5 7 8 7 5 6 7 5 5 6 5 4 5 4 3 4 3 3 5 5 4 3 5 4 3 4 4 4 4
1345 4 3 3 5 5 4 4 5 5 5 4 4 6 6 5 4 5 5 4 4 4 5 4 5 5 5 5 5 4 4 4 5 5 5 5 3 5 5 4 3 4 4 4 4 3 3 4 5 4 5 4 3 3 4 3 4 5 4 4 3 3 3 3 4 3 2 4 5 5 5 4 3
1339 3 4 5 3 3 3 2 3 3 3 2 3 3 3 3 4 5 4 5 6 5 4 4 3 4 4 4 4 4 5 4 4 4 4 3 3 5 4 4 4 3 3 4 4 4 3 3 4 5 5 4 5 5 5 4 3 3 4 4 3 4 4 3 4 4 5 5 6 6 5 6 6
1332 6 4 3 3 3 6 6 5 5 3 4 5 5 5 4 4 4 4 3 4 3 3 4 4 5 4 4 5 6 6 6 6 6 6 4 5 5 4 5 6 5 4 4 4 4 4 2 2 4 4 4 3 3 3 5 5 4 4 4 4 5 4 5 5 4 4 3 3 3 4 4 4
1326 4 4 4 4 4 3 4 3 3 4 4 5 5 5 5 4 6 4 4 5 5 3 3 4 4 4 4 3 4 4 4 3 4 3 4 6 6 4 3 5 4 3 3 4 4 4 4 4 4 4 5 4 5 4 3 4 4 4 4 3 4 3 3 4 4 3 4 5 4 3 3 2
1319 2 1 3 3 2 1 2 3 2 3 3 2 2 4 4 3 5 4 4 4 4 4 4 4 3 3 3 4 4 5 4 4 6 5 5 6 5 3 4 3 4 4 5 3 3 1 2 3 4 4 5 6 4 5 6 5 4 3 3 4 5 4 3 4 5 5 3 4 4 4 2 3
1313 3 4 4 3 4 4 5 5 5 3 4 5 4 4 5 6 5 4 5 4 4 2 3 3 4 4 4 3 4 4 4 4 4 5 5 4 3 3 2 3 4 4 4 4 4 4 3 3 3 4 3 4 5 5 5 5 4 4 4 4 4 3 3 5 4 4 3 3 5 4 3 3
1307 3 5 5 4 4 3 2 3 4 4 3 2 3 4 4 4 5 5 4 3 4 5 5 4 3 3 2 3 3 3 4 4 4 5 5 4 3 3 3 2 2 3 4 3 2 3 3 4 4 4 4 5 5 4 3 3 4 4 3 5 6 5 3 4 3 4 5 5 5 5 5 5
1300E%%J%J%j%%j%%%jkJJ%%jJ%j%J%j%%J%jJ%J%jJkJJj%J%jj%jK%%%%%JjkJ%J%jJ%jjK%%J
1294Ej%jJ%j%K%kJ%jjKJ%j%%%%jj%K%jJJj%J%jjJ%Jjj%J%jJ%%%%%jJKjj%%Jjj%JjJ%%%%%%
1287D%jJJJjj%%%%j%%%J%jJj%%jJ%J%%jjJ%%J%j%%%%J%%%%%%Jj%%Jj%%kKJ%%k%%%JK%k%%%
1281D%J%jJj%%%%%kJ%%J%%%jJ%%%%%%JjjJ%%kJJj%%JjjJJJ%j%%j%Jj%K%jJ%k%Jjj%%JjJJJ
1274Ej%Jjj%Kj%K%j%%J%kJ%%kJJj%jJJ%%%j%%jJKjJjjJ%JKjj%%jj%%jJ%%%jJJ%%%%%jJ%Jj
1268E%%%%%%JjJ%J%j%J%jJjJjjjJK%%jJ%jJJK%LJLLJKLJ%%lmlkmkj%%jjJjjjJ%jJ%%%j%%%
1261D%%JjjJjJ%Jj%Jj%JjJ%%j%Jj%%JJ%%jJ%%%jkJ%%J%%%jjJjjK%%%%%%%%%%%jK%%%j%%jJ
1255D%jJ%%%JjJjj%%%jKJjjj%JK%jJjj%J%jJ%%jJ%%%%jKj%Jj%j%JjJ%Jj%%%Kj%jj%%%J%j%
$$ plain form
1300 5 5 5 6 6 7 7 6 6 6 5 5 5 5 4 2 3 4 4 4 3 4 4 3 3 4 4 3 3 3 4 4 3 4 4 5 5 4 5 3 4 5 4 4 5 5 4 3 3 2 4 4 4 4 4 4 5 4 2 3 3 4 4 3 4 4 3 2 4 4 4 5
1294 5 4 4 3 4 4 3 3 5 5 3 4 4 3 2 4 5 5 4 4 4 4 4 3 2 2 4 4 3 4 5 4 4 5 5 4 3 4 4 5 4 3 3 4 4 3 4 4 4 4 4 4 3 4 6 5 4 4 4 5 4 3 3 4 3 4 4 4 4 4 4 4
1287 4 4 3 4 5 6 5 4 4 4 4 4 3 3 3 3 4 4 3 4 3 3 3 2 3 3 4 4 4 3 2 3 3 3 4 4 3 3 3 3 3 4 4 4 4 4 4 4 5 4 4 4 5 4 4 4 2 4 5 5 5 3 3 3 3 4 6 6 4 4 4 4
1281 4 4 5 5 4 5 4 4 4 4 4 4 2 3 3 3 4 4 4 4 3 4 4 4 4 4 4 4 5 4 3 4 4 4 2 3 4 3 3 3 4 3 2 3 4 5 5 4 4 4 3 3 4 3 3 5 5 4 5 5 3 3 4 3 2 2 2 3 2 3 4 5
1274 5 4 4 5 4 3 3 5 4 4 6 6 5 5 5 6 6 4 5 5 5 3 4 5 4 4 3 4 5 5 5 5 4 4 4 3 4 6 5 6 5 4 5 5 6 8 7 6 6 6 5 4 4 4 3 4 4 4 4 3 4 5 5 5 5 5 5 4 5 5 6 5
1268 5 5 5 5 5 5 5 6 5 6 6 7 7 6 6 7 7 6 7 6 7 6 5 4 5 7 7 7 6 7 7 6 7 8 10 10 13 14 17 20 21 23 26 27 27 27 24 20 17 15 11 9 8 8 8 7 6 7 6 5 4 5 5 4 5 5 5 5 4 4 4 4
1261 4 4 4 5 4 3 4 3 4 4 5 4 4 5 4 4 5 4 5 5 5 4 4 5 4 4 4 5 6 6 6 5 6 6 6 6 5 3 4 4 4 5 5 5 5 4 3 4 3 2 4 4 4 4 4 4 4 4 4 4 4 4 3 5 5 5 5 4 4 4 3 4
1255 4 4 3 4 4 4 4 5 4 5 4 3 3 3 3 2 4 5 4 3 2 2 3 5 5 4 5 4 3 3 4 4 3 4 4 4 3 4 4 4 4 4 3 5 4 4 5 4 4 3 3 4 3 4 4 5 4 4 4 4 6 5 5 4 3 3 3 3 4 4 3 3
1248C%%J%JJk%jJJ%%%%jJjJ%jJj%%J%kJ%%%%%j%K%jjK%j%%j%K%j%%%Jk%JJkJjjJK%%%%%%j
1242D%J%%jJ%%j%%%%%j%J%%jKjJjJjJjJ%%j%Jj%%JjJj%%%%JJjJ%Jj%jJ%j%jK%%JJ%%J%%%k
1236G%%%j%%j%%jJ%Jj%J%%%%j%jjjK%%%J%%%%%%jJj%%jJ%JJ%%j%j%jK%j%jKjj%%J%JjJ%j%
1229DJk%Kjj%Jj%jK%JJjj%j%%J%jJ%%J%j%jKjjjJJ%%Jj%%J%j%%J%%%%j%%Kjk%JJ%JjkJ%jK
1223E%%kJJ%k%Jj%jJ%%%%%%J%%jJJj%%%%%jKjJjJ%j%%K%kJ%J%%kJj%%J%j%J%%%%jKk%J%j%
1216D%jj%K%jJ%%jJJjJ%j%%%%%%JJjjjJJ%%%Jj%jJ%j%%K%jj%jKj%JJk%J%j%%JjJj%%Jjj%J
1210DJJj%%jkL%%Kjj%Jk%J%jJ%jjKjjJ%%%%%jK%%%jJ%j%%j%J%JJjjJ%%jKj%%Jj%jjJ%%%%%
1203D%%J%k%KJjj%Jjj%Jj%%%%%%%jJJ%%Jj%J%%%%jJ%jj%%J%JJkKkJ%jJJjj%kJ%%%%Jj%%J%
$$ plain form
1248 3 3 3 4 4 5 6 4 4 3 4 5 5 5 5 5 4 5 4 5 5 4 5 4 4 4 5 5 3 4 4 4 4 4 4 3 3 5 5 4 3 5 5 4 4 4 3 3 5 5 4 4 4 4 5 3 3 4 5 3 4 3 2 3 5 5 5 5 5 5 5 4
1242 4 4 5 5 5 4 5 5 5 4 4 4 4 4 4 3 3 4 4 4 3 5 4 5 4 5 4 5 4 5 5 5 4 4 5 4 4 4 5 4 5 4 4 4 4 4 5 6 5 6 6 7 6 6 5 6 6 5 5 4 6 6 6 7 8 8 8 9 9 9 9 7
1236 7 7 7 7 6 6 6 5 5 5 4 5 5 6 5 5 6 6 6 6 6 5 5 4 3 2 4 4 4 4 5 5 5 5 5 5 5 4 5 4 4 4 3 4 4 5 6 6 6 5 5 4 4 3 5 5 4 4 3 5 4 3 3 3 4 4 5 4 5 5 4 4
1229 4 5 3 3 5 4 3 3 4 3 3 2 4 4 5 6 5 4 4 3 3 3 4 4 3 4 4 4 5 5 4 4 3 5 4 3 2 3 4 4 4 5 4 4 4 5 5 4 4 4 5 5 5 5 5 4 4 4 6 5 3 3 4 5 5 6 5 3 4 4 3 5
1223 5 5 5 3 4 5 5 3 3 4 3 3 2 3 3 3 3 3 3 3 4 4 4 3 4 5 4 4 4 4 4 4 3 5 4 5 4 5 5 4 4 4 6 6 4 5 5 6 6 6 4 5 4 4 4 5 5 4 4 5 5 5 5 5 4 6 4 4 5 5 4 4
1216 4 4 3 2 2 4 4 3 4 4 4 3 4 5 4 5 5 4 4 4 4 4 4 4 5 6 5 4 3 4 5 5 5 5 6 5 5 4 5 5 4 4 4 6 6 5 4 4 3 5 4 4 5 6 4 4 5 5 4 4 4 5 4 5 4 4 4 5 4 3 3 4
1210 4 5 6 5 5 5 4 2 5 5 5 7 6 5 5 6 4 4 5 5 4 5 5 4 3 5 4 3 4 4 4 4 4 4 3 5 5 5 5 4 5 5 4 4 4 3 3 4 4 5 6 5 4 5 5 5 4 6 5 5 5 6 5 5 4 3 4 4 4 4 4 4
1203 4 4 4 5 5 3 3 5 6 5 4 4 5 4 3 3 4 3 3 3 3 3 3 3 3 2 3 4 4 4 5 4 4 5 5 5 5 5 4 5 5 4 3 3 3 4 4 5 6 4 6 4 5 5 4 5 6 5 4 4 2 3 3 3 3 3 4 3 3 3 4 4
1197DjJ%J%jJj%jJKk%J%J%kJJj%jJ%%%%jJj%%%J%%%%%%%%%%JkjKjJJkjJ%JJj%%%%j%J%J%%
1190FKjjkJJj%jkJKJ%j%%J%lj%K%%Jj%jJ%%%J%%j%%%J%jj%%J%j%%KjjJJj%J%%%jjJ%%%%jJ
1184D%%JjJ%jJjjJ%%%J%%jJj%%%%%%%JjJ%jJjJ%%%j%%%%%%J%%j%jJK%j%JjJj%%%%j%jJ%j%
1178CJJ%J%j%Jk%%K%%Jk%%%%j%J%j%J%%%j%%%%jJ%%jJjJJJ%k%JJjj%J%J%j%%%J%%jJ%k%jJ
1171D%%%%%%J%%%%j%jJJj%Jj%%%%%%%Jk%J%jK%%jjJ%JjjJJjjJJJ%kjK%%%%JkkJ%%J%%j%Jj
1165C%JJj%%J%%%%j%%%%JJJJj%jjJ%Jj%%j%j%JjJ%jJJj%jjJJJ%jJ%%%%%%J%j%%JjJ%%jj%%
1158E%%%%J%jjJ%%%J%j%%jJ%jj%J%%%%Jjj%%JJJj%j%JjJ%j%J%%%JjJ%%jkK%%%J%%%K%%J%j
1152HJJJj%%jjJjj%%j%kJJ%%j%k%KjjJL%%k%%J%%jjJJ%jjJKJ%%JJ%jj%jjj%j%%K%j%j%Lj%
$$ plain form
1197 4 3 4 4 5 5 4 5 4 4 3 4 6 4 4 5 5 6 6 4 5 6 5 5 4 5 5 5 5 5 4 5 4 4 4 4 5 5 5 5 5 5 5 5 5 5 5 6 4 3 5 4 5 6 4 3 4 4 5 6 5 5 5 5 5 4 4 5 5 6 6 6
1190 6 8 7 6 4 5 6 5 5 4 2 3 5 6 6 5 5 5 6 6 3 2 2 4 4 4 5 4 4 3 4 4 4 4 5 5 5 4 4 4 4 5 5 4 3 3 3 4 4 3 3 3 5 4 3 4 5 4 4 5 5 5 5 4 3 4 4 4 4 4 3 4
1184 4 4 4 5 4 5 5 4 5 4 3 4 4 4 4 5 5 5 4 5 4 4 4 4 4 4 4 4 5 4 5 5 4 5 4 5 5 5 5 4 4 4 4 4 4 4 5 5 5 4 4 3 4 6 6 5 5 6 5 6 5 5 5 5 5 4 4 3 4 4 3 3
1178 3 4 5 5 6 6 5 5 6 4 4 4 6 6 6 7 5 5 5 5 5 4 4 5 5 4 4 5 5 5 5 4 4 4 4 4 3 4 4 4 3 4 3 4 5 6 6 4 4 5 6 5 4 4 5 5 6 6 5 5 5 5 6 6 6 5 6 6 4 4 3 4
1171 4 4 4 4 4 4 4 5 5 5 5 5 4 4 3 4 5 4 4 5 4 4 4 4 4 4 4 4 5 3 3 4 4 3 5 5 5 4 3 4 4 5 4 3 4 5 4 3 4 5 6 6 4 3 5 5 5 5 5 6 4 2 3 3 3 4 4 4 3 3 4 3
1165 3 3 4 5 4 4 4 5 5 5 5 5 4 4 4 4 4 5 6 7 8 7 7 6 5 6 6 7 6 6 6 5 5 4 4 5 4 5 5 4 5 6 5 5 4 3 4 5 6 6 5 6 6 6 6 6 6 6 7 7 6 6 6 7 6 7 7 7 6 5 5 5
1158 5 5 5 5 5 6 6 5 4 5 5 5 5 6 6 5 5 5 4 5 5 4 3 3 4 4 4 4 4 5 4 3 3 3 4 5 6 5 5 4 4 5 4 5 5 4 4 5 5 5 5 6 5 6 6 6 5 3 5 5 5 5 6 6 6 6 8 8 8 9 9 8
1152 8 9 10 11 10 10 10 9 8 9 8 7 7 7 6 6 4 5 6 6 6 5 5 3 3 5 4 3 4 7 7 7 5 5 5 6 6 6 5 4 5 6 6 5 4 5 7 8 8 8 9 10 10 9 8 8 7 6 5 5 4 4 4 6 6 5 5 4 4 7 6 6
1145F%J%%k%JJ%%%JjJJ%j%%%jJ%jj%j%%J%jj%JJjj%%%JkK%%k%%JK%jJj%j%%%%%JJ%%jj%J%
1139Ej%%%%%jJjKJj%jJ%%%j%J%J%%%JJ%jjjj%%jJJ%%%jJ%%%%%j%J%j%%%%%%J%%j%%j%JJjj
1132CK%%Jjj%%jKj%j%J%J%%%JJk%j%JJ%jJkj%%%JJJj%J%j%%jJ%%%%jKjjJj%jJJ%Jj%%j%%%
1126DjJJkJJjKjjj%J%J%%kJ%%%jJj%JKj%J%%%%jjJ%%jJJ%j%%%%%kJJ%J%J%%J%%%%jJ%jKj%
1120H%jj%%%jj%J%jjKJjJ%%j%%jJ%j%j%Jj%J%%%JjJ%Jj%%%%jJJ%%j%%%%J%j%j%%Jj%%k%JJ
1113DJ%J%k%jJ%Jj%%JJjjJjjJ%%%J%%%%j%%%%%J%%j%%%J%%%%Jk%J%jJ%J%%k%%%JjKjj%KkJ
1107E%JJjjjJ%%%%%Jj%%J%j%jjJ%%j%JJ%j%JkJ%jJJj%%J%jj%%JJ%Kjj%%%%jJJ%j%j%%J%%%
1100Ej%Jk%JJ%j%Kj%%%J%j%jj%JJ%%jK%jjJ%Jj%Jj%J%%%k%JjJ%%%%%%%jjK%j%J%jJjJ%jjJ
$$ plain form
1145 6 6 7 7 7 5 5 6 7 7 7 7 8 7 8 9 9 8 8 8 8 7 8 8 7 6 6 5 5 5 6 6 5 4 4 5 6 5 4 4 4 4 5 3 5 5 5 3 3 3 4 6 6 5 6 5 5 4 4 4 4 4 4 5 6 6 6 5 4 4 5 5
1139 5 4 4 4 4 4 4 3 4 3 5 6 5 5 4 5 5 5 5 4 4 5 5 6 6 6 6 7 8 8 7 6 5 4 4 4 3 4 5 5 5 5 4 5 5 5 5 5 5 4 4 5 5 4 4 4 4 4 4 4 5 5 5 4 4 4 3 3 4 5 4 3
1132 3 5 5 5 6 5 4 4 4 3 5 4 4 3 3 4 4 5 5 5 5 6 7 5 5 4 4 5 6 6 5 6 4 3 3 3 3 4 5 6 5 5 6 6 5 5 5 4 5 5 5 5 5 4 6 5 4 5 4 4 3 4 5 5 6 5 5 5 4 4 4 4
1126 4 3 4 5 3 4 5 4 6 5 4 3 3 4 4 5 5 5 3 4 4 4 4 3 4 3 3 4 6 5 5 6 6 6 6 6 5 4 5 5 5 4 5 6 6 5 5 5 5 5 5 3 4 5 5 6 6 7 7 7 8 8 8 8 8 7 8 8 7 9 8 8
1120 8 8 7 6 6 6 6 5 4 4 5 5 4 3 5 6 5 6 6 6 5 5 5 4 5 5 4 4 3 3 4 3 3 4 4 4 4 5 4 5 5 6 5 5 5 5 5 4 5 6 6 6 5 5 5 5 5 6 6 5 5 4 4 4 5 4 4 4 2 2 3 4
1113 4 5 5 6 6 4 4 3 4 4 5 4 4 4 5 6 5 4 5 4 3 4 4 4 4 5 5 5 5 5 4 4 4 4 4 4 5 5 5 4 4 4 4 5 5 5 5 5 6 4 4 5 5 4 5 5 6 6 6 4 4 4 4 5 4 6 5 4 4 6 4 5
1107 5 5 6 7 6 5 4 5 5 5 5 5 5 6 5 5 5 6 6 5 5 4 3 4 4 4 3 3 4 5 5 4 4 5 3 4 4 3 4 5 4 4 4 5 5 4 3 3 3 4 5 5 7 6 5 5 5 5 5 4 5 6 6 5 5 4 4 4 5 5 5 5
1100 5 4 4 5 3 3 4 5 5 4 4 6 5 5 5 5 6 6 5 5 4 3 3 4 5 5 5 4 6 6 5 4 5 5 6 5 5 6 5 5 6 6 6 6 4 4 5 4 5 5 5 5 5 5 5 5 4 3 5 5 4 4 5 5 4 5 4 5 5 4 3 4
1094D%%%JJ%j%%%jjJJJ%jj%%jKj%%J%jK%Jj%j%%%JjKj%j%%%jJJj%jJ%%jJJJj%j%J%jkKJjj
1087DJ%J%%%%%jj%J%%%%%Jk%jK%%J%%jj%JjJ%%%%jJJ%kjJ%JJ%jJ%jJ%jJ%%k%JJk%J%%%%j%
1081D%J%%j%JjJJj%kJJJ%j%%jJ%Jj%jJJ%jj%KjJj%%%j%%Jj%%%%J%%%jJJj%%j%J%jJ%%%Jjj
1074DKj%Jj%%%Jj%jJJj%%JJjjkJK%jJ%jKjkJJ%JkjJJ%%Jj%jJj%JjjJ%%J%j%%jJK%jJ%j%%j
1068E%Jj%Jk%J%jJ%jK%%%%%%%Kkj%%%j%%%%JJ%jK%j%%%jJJj%jJj%%J%J%%j%%%j%J%J%%jj%
1061EJ%%%%%%jjJK%%kJJj%Jj%jJ%%%%jJ%jjJJj%%%%%j%JJJJkj%%%JJkJ%JjkJJK%kj%K%j%j
1055EJJ%jj%Jj%JJJjjJl%%JjJJ%%%%jJjJ%Jj%Jk%%J%j%%jJJJ%%%j%%%Kkk%J%J%JJj%%%K%j
1049Hjj%%%jJ%%J%%jJ%jjJ%%%%%%%J%j%JkJ%J%j%%%%%%j%%J%Jj%J%jjjJ%%%K%%%%%j%j%JJ
$$ plain form
1094 4 4 4 4 5 6 6 5 5 5 5 4 3 4 5 6 6 5 4 4 4 3 5 4 4 4 5 5 4 6 6 7 6 6 5 5 5 5 6 5 7 6 6 5 5 5 5 4 5 6 5 5 4 5 5 5 4 5 6 7 6 6 5 5 6 6 5 3 5 6 5 4
1087 4 5 5 6 6 6 6 6 6 5 4 4 5 5 5 5 5 5 6 4 4 3 5 5 5 6 6 6 5 4 4 5 4 5 5 5 5 5 4 5 6 6 4 3 4 4 5 6 6 5 6 6 5 6 6 5 6 6 6 4 4 5 6 4 4 5 5 5 5 5 4 4
1081 4 4 5 5 5 4 4 5 4 5 6 5 5 3 4 5 6 6 5 5 5 4 5 5 6 5 5 4 5 6 6 5 4 4 6 5 6 5 5 5 5 4 4 4 5 4 4 4 4 4 5 5 5 5 4 5 6 5 5 5 4 4 5 5 4 5 5 5 5 6 5 4
1074 4 6 5 5 6 5 5 5 5 6 5 5 4 5 6 5 5 5 6 7 6 5 3 4 6 6 5 6 6 5 7 6 4 5 6 6 7 5 4 5 6 6 6 7 6 6 5 6 5 5 6 5 4 5 5 5 6 6 5 5 5 4 5 7 7 6 7 7 6 6 6 5
1068 5 5 6 5 5 6 4 4 5 5 4 5 5 4 6 6 6 6 6 6 6 6 8 6 5 5 5 5 4 4 4 4 4 5 6 6 5 7 7 6 6 6 6 5 6 7 6 6 5 6 5 5 5 6 6 7 7 7 6 6 6 6 5 5 6 6 7 7 7 6 5 5
1061 5 6 6 6 6 6 6 6 5 4 5 7 7 7 5 6 7 6 6 7 6 6 5 6 6 6 6 6 5 6 6 5 4 5 6 5 5 5 5 5 5 4 4 5 6 7 8 6 5 5 5 5 6 7 5 6 6 7 6 4 5 6 8 8 6 5 5 7 7 6 6 5
1055 5 6 7 7 6 5 5 6 5 5 6 7 8 7 6 7 4 4 4 5 4 5 6 6 6 6 6 5 6 5 6 6 7 6 6 7 5 5 5 6 6 5 5 5 4 5 6 7 7 7 7 6 6 6 6 8 6 4 4 5 5 6 6 7 8 7 7 7 7 9 9 8
1049 8 7 6 6 6 6 5 6 6 6 7 7 7 6 7 7 6 5 6 6 6 6 6 6 6 6 7 7 6 6 7 5 6 6 7 7 6 6 6 6 6 6 6 5 5 5 6 6 7 6 6 7 7 6 5 4 5 5 5 5 7 7 7 7 7 7 6 6 5 5 6 7
1042G%%jJ%j%%j%%Jj%JJ%j%Jj%%%JJ%jJj%J%k%%J%jjJj%%%JJj%J%%jJJ%%%%j%%j%j%%%JJj
1036F%jJ%jjJJ%%Jjj%Jj%JJj%j%J%jjJ%K%kjJ%j%%JJj%J%%j%JjJJ%jJ%%%j%%jJJjj%%%%jJ
1029EJJ%kJJ%%%j%J%%%jjJ%%j%JJjJj%J%j%j%Jj%%%J%J%%%Jj%%jjJ%%%%Jj%jJJ%Kjl%KJ%j
1023GJjjJ%jJ%j%J%j%jJJ%jJ%j%%%J%%jjK%%j%JjjJ%%%%Jj%%k%JJJ%%kJ%%J%jJjJJ%kkJ%K
1016G%%j%%JjJkJJ%%jJj%%jJ%%%J%j%%j%J%JjjJ%%JJ%%jj%%K%jj%%%JJj%%%%%%%j%%J%%%J
1010H%jkJJ%%jJ%jJJjjJ%%J%k%J%%j%%%j%JJJ%Jj%%j%J%J%%%%%%Jj%%%j%%JjjJ%jJk%JJJJ
1003A0jjj%%kJ%%JjJ%jJ%%j%JJ%j%%J%%jJjJ%%%J%jJjJ%%j%%%J%%jjL%jJ%%%%j%jJJ%%%jJ
997A0j%%%jJ%j%Jj%jJ%%%%j%%jJ%j%Jj%%J%jKjJJk%%%J%j%%K%Jk%%%%jkJ%J%JjJ%%Kj%jj%
$$ plain form
1042 7 7 7 6 7 7 6 6 6 5 5 5 6 5 5 6 7 7 6 6 7 6 6 6 6 7 8 8 7 8 7 7 8 8 6 6 6 7 7 6 5 6 5 5 5 5 6 7 6 6 7 7 7 6 7 8 8 8 8 8 7 7 7 6 6 5 5 5 5 6 7 6
1036 6 6 5 6 6 5 4 5 6 6 6 7 6 5 5 6 5 5 6 7 6 6 5 5 6 6 5 4 5 5 7 7 5 4 5 5 4 4 4 5 6 5 5 6 6 6 5 5 6 5 6 7 7 6 7 7 7 7 6 6 6 5 6 7 6 5 5 5 5 5 4 5
1029 5 6 7 7 5 6 7 7 7 7 6 6 7 7 7 7 6 5 6 6 6 5 5 6 7 6 7 6 6 7 7 6 6 5 5 6 5 5 5 5 6 6 7 7 7 7 8 7 7 7 6 5 6 6 6 6 6 7 6 6 5 6 7 7 9 8 5 5 7 8 8 7
1023 7 8 7 6 7 7 6 7 7 6 6 7 7 6 6 5 6 7 7 6 7 7 6 6 6 6 7 7 7 6 5 7 7 7 6 6 7 6 5 6 6 6 6 6 7 6 6 6 4 4 5 6 7 7 7 5 6 6 6 7 7 6 7 6 7 8 8 6 4 5 5 7
1016 7 7 7 6 6 6 7 6 7 5 6 7 7 7 6 7 6 6 6 5 6 6 6 6 7 7 6 6 6 5 5 6 6 7 6 5 6 6 6 7 8 8 8 7 6 6 6 8 8 7 6 6 6 6 7 8 7 7 7 7 7 7 7 7 6 6 6 7 7 7 7 8
1010 8 8 7 5 6 7 7 7 6 7 7 6 7 8 7 6 7 7 7 8 8 6 6 7 7 7 6 6 6 6 5 5 6 7 8 8 9 8 8 8 7 7 8 8 9 9 9 9 9 9 9 10 9 9 9 9 8 8 8 9 8 7 8 8 7 8 6 6 7 8 9 10
1003 10 9 8 7 7 7 5 6 6 6 7 6 7 7 6 7 7 7 6 6 7 8 8 7 7 7 8 8 8 7 8 7 8 8 8 8 9 9 8 9 8 9 9 9 8 8 8 8 9 9 9 8 7 10 10 9 10 10 10 10 10 9 9 8 9 10 10 10 10 9 10
997 10 9 9 9 9 8 9 9 8 8 9 8 8 7 8 8 8 8 8 7 7 7 6 7 7 6 6 7 6 6 6 7 7 6 8 7 8 9 7 7 7 7 8 8 7 7 7 9 9 10 8 8 8 8 8 7 5 6 6 7 7 8 7 8 8 8 10 9 9 8 7 7
991G%%JJj%J%jj%jJ%%KJkj%%J%J%Jjk%J%jj%J%%JjjJJJ%k%%J%%Jjj%Jj%J%j%%%%%%Jj%%jJ
984GJj%J%%jJj%jJ%%%jJ%%JjJ%j%J%jK%jj%%%J%%J%%%%%JjJ%jJ%%%%J%jj%j%Kj%jjK%%j%%
978H%jj%JJ%j%%Jj%JjjJJ%j%%%%%%%Jj%JjJ%j%jJ%%%%JjJ%J%j%%%%%%%KJkj%%JjJj%%%jjK
971Hj%J%%JJjJJk%%%%%%%JkjJJj%jJ%%%k%%%%J%%%JJj%j%JJ%j%%%j%%%%%Jj%%%%J%%jJj%%
964G%jJ%j%%JJJkJJ%j%J%jj%JJ%kJ%JJjjJJjjJjjJj%%J%%%J%%jJkJJ%%jKk%%%%JKkjjLjj%
958H%%%JjjJ%jKj%%%%%J%%%jK%k%%%%%%JKkJjjJJ%jJJJJj%jJ%%%k%%%j%J%JK%J%JLMNNMK%
951C8lloomljj%%%jj%j%JKkjJ%%%Jj%%%Jj%JJk%JJ%%j%j%%%J%j%%%%%J%%%%j%J%j%jJjK%j
945IJjj%%Jj%JJ%%J%%%%%%%%Jj%j%%%%j%%J%j%JJ%JjJ%%jj%J%j%%%%%Jj%%J%j%%jK%%k%JJ
$$ plain form
991 7 7 7 8 9 8 8 9 9 8 7 7 6 7 7 7 9 10 8 7 7 7 8 8 9 9 10 9 7 7 8 8 7 6 6 7 7 7 8 7 6 7 8 9 9 7 7 7 8 8 8 9 8 7 7 8 7 7 8 8 7 7 7 7 7 7 7 8 7 7 7 6 7
984 7 8 7 7 8 8 8 7 8 7 7 6 7 7 7 7 6 7 7 7 8 7 8 8 7 7 8 8 7 9 9 8 7 7 7 7 8 8 8 9 9 9 9 9 9 10 9 10 10 9 10 10 10 10 10 11 11 10 9 9 8 8 10 9 9 8 7 9 9 9 8 8 8
978 8 8 7 6 6 7 8 8 7 7 7 8 7 7 8 7 6 7 8 8 7 7 7 7 7 7 7 7 8 7 7 8 7 8 8 7 7 6 7 7 7 7 7 8 7 8 8 9 9 8 8 8 8 8 8 8 8 10 11 9 8 8 8 9 8 9 8 8 8 8 7 6 8
971 8 7 7 8 8 8 9 10 9 10 11 9 9 9 9 9 9 9 9 10 8 7 8 9 8 8 7 8 8 8 8 6 6 6 6 6 7 7 7 7 8 9 8 8 7 7 8 9 9 8 8 8 8 7 7 7 7 7 7 8 7 7 7 7 7 8 8 8 7 8 7 7 7
964 7 7 6 7 7 6 6 6 7 8 9 7 8 9 9 8 8 9 9 8 7 7 8 9 9 7 8 8 9 10 9 8 9 10 9 8 9 8 7 8 7 7 7 8 8 8 8 9 9 9 8 9 7 8 9 9 9 8 10 8 8 8 8 8 9 11 9 8 7 10 9 8 8
958 8 8 8 8 9 8 7 8 8 7 9 8 8 8 8 8 8 9 9 9 9 8 10 10 8 8 8 8 8 8 8 9 11 9 10 9 8 9 10 10 9 10 11 12 13 12 12 11 12 12 12 12 10 10 10 10 9 9 10 10 11 13 13 14 14 15 18 22 27 32 36 38 38
951 38 35 32 26 20 16 13 12 11 11 11 11 10 9 9 8 8 9 11 9 8 9 9 9 9 10 9 9 9 9 10 9 9 10 11 9 9 10 11 11 11 10 10 9 9 9 9 10 10 9 9 9 9 9 9 10 10 10 10 10 9 9 10 10 9 9 8 9 8 10 10 9
945 9 10 9 8 8 8 9 8 8 9 10 10 10 11 11 11 11 11 11 11 11 11 12 11 11 10 10 10 10 10 9 9 9 10 10 9 9 10 11 11 12 11 12 12 12 11 10 10 11 11 10 10 10 10 10 10 11 10 10 10 11 11 10 10 10 9 11 11 11 9 9 10 11
938A1%%jJj%%%J%j%JJ%kJ%%%%%Jj%J%%K%jJj%%%%JJ%%jJ%%JJj%j%%%Jjj%%%%k%%%J%j%%kK
932A2j%JJj%Jj%jJ%j%%%%%%J%%%Jj%%JJj%%%jJ%%Jj%jJJj%%J%jkJ%%Jj%J%jJ%J%%%%%%%%j
926A3K%%%%jkJJ%%%%J%J%Kjk%J%%%%Jj%jJ%jjjJ%%%JJjJ%J%j%k%KJjJJ%%j%jj%J%%%%j%%j
919A4%%J%k%%%JJj%%%Jj%JJ%%J%K%%JK%%KJ%j%k%%%jjlj%%%%%j%K%j%j%%%K%%Jj%J%%jJ%J
913A9jJjj%J%LJ%JJKKKKKMMKLKLKJ%%Jjjkjkkkkk%%j%jj%kjljkk%jl%jkjkj%%j%J%kjJjJ%
906A4%%j%%jJ%J%%%%j%%%%Kj%jK%%kKjJ%J%%JjjJ%k%%KjJJjJJ%%JJJJJKjkJjkjk%kk%%jJ%
900A3jj%%kK%J%%j%J%JjjJJ%%%%%j%%%%J%jjj%%%%J%jK%jj%J%%%%%j%Jj%Kj%J%%j%j%j%J%
893A0jJj%%JJjj%K%%jkK%jKJj%j%J%j%%jKj%Kj%%j%J%JjJj%JkjK%jJjJj%jJjJJ%%jJjJj%J
$$ plain form
938 11 11 11 10 11 10 10 10 10 11 11 10 10 11 12 12 10 11 11 11 11 11 11 12 11 11 12 12 12 14 14 13 14 13 13 13 13 13 14 15 15 15 14 15 15 15 16 17 16 16 15 15 15 15 16 15 14 14 14 14 14 12 12 12 12 13 13 12 12 12 10 12
932 12 11 11 12 13 12 12 13 12 12 11 12 12 11 11 11 11 11 11 11 12 12 12 12 13 12 12 12 13 14 13 13 13 13 12 13 13 13 14 13 13 12 13 14 13 13 13 14 14 13 11 12 12 12 13 12 12 13 13 12 13 13 14 14 14 14 14 14 14 14 14 13
926 13 15 15 15 15 15 14 12 13 14 14 14 14 14 15 15 16 16 18 17 15 15 16 16 16 16 16 17 16 16 15 16 16 15 14 13 14 14 14 14 15 16 15 16 16 17 17 16 16 14 14 16 17 16 17 18 18 18 17 17 16 15 15 16 16 16 16 16 15 15 15 14
919 14 14 14 15 15 13 13 13 13 14 15 14 14 14 14 15 14 14 15 16 16 16 17 17 19 19 19 20 22 22 22 24 25 25 24 24 22 22 22 22 21 20 17 16 16 16 16 16 16 15 15 17 17 16 16 15 15 15 15 17 17 17 18 17 17 18 18 18 17 18 18 19
913 19 18 19 18 17 17 18 18 21 22 22 23 24 26 28 30 32 34 38 42 44 47 49 52 54 55 55 55 56 55 54 52 51 49 47 45 43 41 41 41 40 40 39 38 38 36 35 32 31 29 27 27 26 23 23 22 20 19 17 16 16 16 15 15 16 16 14 13 14 13 14 14
906 14 14 14 13 13 13 12 13 13 14 14 14 14 14 13 13 13 13 13 15 14 14 13 15 15 15 13 15 14 15 15 16 16 16 17 16 15 16 16 14 14 14 16 15 16 17 16 17 18 18 18 19 20 21 22 23 25 24 22 23 22 20 19 17 17 15 13 13 13 12 13 13
900 13 12 11 11 11 9 11 11 12 12 12 11 11 12 12 13 12 11 12 13 13 13 13 13 13 12 12 12 12 12 13 13 12 11 10 10 10 10 10 11 11 10 12 12 11 10 10 11 11 11 11 11 11 10 10 11 10 10 12 11 11 12 12 12 11 11 10 10 9 9 10 10
893 10 9 10 9 9 9 10 11 10 9 9 11 11 11 10 8 10 10 9 11 12 11 11 10 10 11 11 10 10 10 9 11 10 10 12 11 11 11 10 10 11 11 12 11 12 11 11 12 10 9 11 11 10 11 10 11 10 10 9 10 9 10 11 11 11 10 11 10 11 10 10 11
887A1j%%%JJkjJj%%J%%j%JJ%jJj%%%%%JJj%j%Jj%%%Kj%%jJJj%%j%%%%JjJjKJkj%Jj%%%J%j
880A0%%j%%J%j%J%%%Jjj%%JJj%%jJ%%jj%%%%%%JJjJ%j%Jj%%%K%Jk%J%%%%%j%%jK%%%%%k%J
874A0jJ%Jj%jJj%J%%%Jj%j%%J%J%JjjjJ%%jJJj%%j%Jj%%%jJ%jJJJk%JJjj%Kj%jJJj%kJJ%j
867IJJ%%%j%jj%JJJ%kJ%%%%jJjJ%j%%JJjj%J%%kK%%j%JJjjJ%%%%%%%%j%J%Jj%jJ%%JJj%J%
861A2jjj%%j%J%%%JJj%j%Jj%JJ%%%JjkJ%%%j%%%K%Jj%%j%%JkJ%%%k%JK%J%jjJjkK%%J%%%%
854A1%jJ%j%J%Jjj%jJJ%j%J%%jJjj%JJJj%%JK%%jKJMNNKKj%knoljkkjj%J%%%%jJ%%JJJJJK
848A8NMKKL%jmnnmjj%Jjjj%J%j%JJkJ%jJjjJ%%%jJj%JJJJ%kJjJ%jjjLj%J%%%jjJ%%%jJ%%j
842A1jj%K%jJ%%%JjjJ%%JJjJ%%j%%%%%j%Kjj%J%J%Jj%%%%%j%K%%%JJLJJJJLLNQJ1J8K6L4L6
$$ plain form
887 11 10 10 10 10 11 12 10 9 10 9 9 9 10 10 10 9 9 10 11 11 10 11 10 10 10 10 10 10 11 12 11 11 10 10 11 10 10 10 10 12 11 11 11 10 11 12 11 11 11 10 10 10 10 10 11 10 11 10 12 13 11 10 10 11 10 10 10 10 11 11 10
880 10 10 10 9 9 9 10 10 9 9 10 10 10 10 11 10 9 9 9 10 11 10 10 10 9 10 10 10 9 8 8 8 8 8 8 8 9 10 9 10 10 9 9 10 9 9 9 9 11 11 12 10 10 11 11 11 11 11 11 10 10 10 9 11 11 11 11 11 11 9 9 10
874 10 9 10 10 11 10 10 9 10 9 9 10 10 10 10 11 10 10 9 9 9 10 10 11 11 12 11 10 9 10 10 10 9 10 11 10 10 10 9 9 10 9 9 9 9 8 9 9 8 9 10 11 9 9 10 11 10 9 9 11 10 10 9 10 11 10 10 8 9 10 10 9
867 9 10 11 11 11 11 10 10 9 8 8 9 10 11 11 9 10 10 10 10 10 9 10 9 10 10 9 9 9 10 11 10 9 9 10 10 10 8 10 10 10 9 9 10 11 10 9 10 10 10 10 10 10 10 10 10 9 9 10 10 11 10 10 9 10 10 10 11 12 11 11 12 12
861 12 11 10 9 9 9 8 8 9 9 9 9 10 11 10 10 9 9 10 9 9 10 11 11 11 11 12 11 9 10 10 10 10 9 9 9 9 11 11 12 11 11 11 10 10 10 11 9 10 10 10 10 8 8 9 11 11 12 12 11 10 11 10 8 10 10 10 11 11 11 11 11
854 11 11 10 11 11 10 10 11 11 12 11 10 10 9 10 11 11 10 10 11 11 11 10 11 10 9 9 10 11 12 11 11 11 12 14 14 14 13 15 16 20 25 30 32 34 33 33 31 26 20 17 16 14 12 11 10 10 11 11 11 11 11 10 11 11 11 12 13 14 15 16 18
848 18 23 27 29 31 34 34 33 29 24 19 15 14 13 13 14 13 12 11 11 12 12 11 11 12 13 11 12 12 11 12 11 10 11 11 11 11 10 11 10 10 11 12 13 14 14 12 13 12 13 13 12 11 10 13 12 12 13 13 13 13 12 11 12 12 12 12 11 12 12 12 11
842 11 10 9 9 11 11 10 11 11 11 11 12 11 10 11 11 11 12 13 12 13 13 13 12 12 12 12 12 12 11 11 13 12 11 11 12 12 13 13 14 13 13 13 13 13 13 12 12 14 14 14 14 15 16 19 20 21 22 23 26 29 34 42 53 71 97 131 167
836A67K8J2jj4k8m2m2k5j5rlmkjjj%kjjj%j%Jj%k%%%JK%%j%%jj%%JJjj%J%%%j%%J%j%J%%J
830A3%kJJ%Jk%%j%%J%%%JJ%J%jjj%KkJ%j%j%KJ%KkjJ%Jj%Jj%%%%%Jk%%J%J%j%%JjJJ%JKjj
823A7jJ%jKjjJJ%j%%K%%JKJ%%Jj%JJj%kjJ%kkJkj%%jj%%j%%%%%Jj%J%%%jjKjjJj%J%%%%j%
817A2J%%J%%%j%Kk%J%jjjJJ%jJKjk%%J%j%%JJJj%jJk%J%Jj%Jj%JJj%k%J%J%kJjJjJ%%%kJJ
811A3Jj%%%J%k%%J%%J%jJ%j%jJJ%%j%J%%%%%J%%%JJ%K%%jJJL%KL%jJkmkk%jjj%jjJJj%%%%
804A4J%%j%j%J%Jk%%J%%JjJjJj%JjJj%KJkk%KJk%Kj%%%%J%j%J%Jj%%%%j%JjLjkJkJjK%j%%
798A5%J%jj%JJ%%jJJjkJJjJj%%%K%j%J%jJ%jK%jjJ%jJ%%jJ%%%J%%J%jJJjJ%%%k%J%J%%%k%
791A8J%KJjJ%%J%JJ%KJjKKJ%MKKLNMLMMMLKj%ljlnmnlllkkl%Jlj%Kk%%j%JJjjJjJ%%JKJ%J
$$ plain form
836 167 195 207 206 192 164 122 80 55 40 31 28 24 22 21 20 19 19 17 16 15 14 14 13 13 14 13 13 11 11 11 11 12 14 14 14 13 13 13 12 11 11 11 12 13 12 11 11 12 12 12 12 11 11 11 12 12 11 11 12 12 12 13
830 13 13 11 12 13 13 14 12 12 12 11 11 11 12 12 12 12 13 14 14 15 15 14 13 12 12 14 12 13 13 12 12 11 11 13 14 14 16 14 13 14 14 15 14 14 15 14 14 14 14 14 14 15 13 13 13 14 14 15 15 14 14 14 15 14 15 16 16 17 19 18 17
823 17 16 17 17 16 18 17 16 17 18 18 17 17 17 19 19 19 20 22 23 23 23 24 23 23 24 25 24 24 22 21 22 22 20 18 19 17 16 16 16 15 14 14 14 13 13 13 13 13 13 14 13 13 14 14 14 14 13 12 14 13 12 13 12 12 13 13 13 13 13 12 12
817 12 13 13 13 14 14 14 14 13 13 15 13 13 14 14 13 12 11 12 13 13 12 13 15 14 12 12 12 13 13 12 12 12 13 14 15 14 14 13 14 12 12 13 13 14 13 13 14 13 13 14 15 14 14 12 12 13 13 14 14 12 13 12 13 12 13 13 13 13 11 12 13
811 13 14 13 13 13 13 14 14 12 12 12 13 13 13 14 14 13 14 14 13 13 12 13 14 14 14 13 13 14 14 14 14 14 14 15 15 15 15 16 17 17 19 19 19 18 19 20 23 23 25 28 28 27 28 26 22 20 18 18 17 16 15 15 14 13 14 15 14 14 14 14 14
804 14 15 15 15 14 14 13 13 14 14 15 13 13 13 14 14 14 15 14 15 14 15 14 14 15 14 15 14 14 16 17 15 13 13 15 16 14 14 16 15 15 15 15 15 16 16 15 15 16 16 17 16 16 16 16 16 15 15 16 15 18 17 15 16 14 15 14 16 16 15 15 15
798 15 15 16 16 15 14 14 15 16 16 16 15 16 17 16 14 15 16 15 16 15 15 15 15 17 17 16 16 17 17 16 17 17 16 18 18 17 16 17 17 16 17 17 17 16 17 17 17 17 18 18 18 19 19 18 19 20 19 20 20 20 20 18 18 19 19 20 20 20 20 18 18
791 18 19 19 21 22 21 22 22 22 23 23 24 25 25 27 28 27 29 31 32 32 36 38 40 43 48 52 55 59 63 67 70 72 71 71 68 67 64 59 55 50 47 44 41 39 37 34 34 35 32 31 31 33 31 31 31 30 30 31 32 31 30 31 30 31 31 31 32 34 35 35 36
785C6K%%jjjkjjj%%j%JJK%%JKL%LKLLMMNMLK%%kkmnjnlllllk%kkJj%l%J%%J%Jjjjjj%j%kj
778B3%J%jjKjJjJJj%jjjJ%%Jj%%%jK%%jJj%J%%%%%%jJ%j%K%%JK%%j%%j%%%J%J%j%j%%KjJ%
772B7jj%%%%Jk%%%%%jJj%j%Jj%jJ%%%%%J%%JjJ%%jjK%%J%j%%%%JJjjJjJJjjJJjjJjJ%J%JJ
765B8%j%%%jKJjJJ%k%JjJJjjJ%JKKk%J%%K%%%%KJKLJKLKMJNLLKLMNNONOONKkkopqqpqpmmm
759D9jkkk%JkjJjj%%%%%%k%JJ%J%kJJJ%J%%%%K%JKK%JLKKMLMLKMMLNMPNONLJkmnprqpopol
752E6llklj%jj%%%jJ%k%J%%J%kKJ%J%kjj%lJJ%kJ%%%j%%jJ%%J%j%JJ%%J%J%%Jj%%j%%J%%%
746D1%J%%%JJj%J%%jJ%%KJ%JJKkKJ%LKKJKJj%jkl%kjJ%k%J%%JKJk%JjJ%KJj%KJ%kjK%jJ%J
740F1j%%Kjk%%%%K%JJJ%LJJ%J%K%JJJ%J%KKJ%%JJ%j%JJKKKJJJLJKJjJLLMLLLMMMNMLMKOOP
$$ plain form
785 36 38 38 38 37 36 35 33 32 31 30 30 30 29 29 30 31 33 33 33 34 36 39 39 42 44 47 50 54 58 63 67 70 72 72 72 70 68 64 59 58 53 50 47 44 41 38 36 36 34 32 33 32 32 29 29 30 30 30 31 31 32 31 30 29 28 27 27 26 26 24 23
778 23 23 24 24 23 22 24 23 24 23 24 25 24 24 23 22 21 22 22 22 23 22 22 22 22 21 23 23 23 22 23 22 22 23 23 23 23 23 23 23 22 23 23 22 22 24 24 24 25 27 27 27 26 26 26 25 25 25 25 26 26 27 27 26 26 25 25 25 27 26 27 27
772 27 26 25 25 25 25 25 26 24 24 24 24 24 24 23 24 23 23 22 22 23 22 22 21 22 22 22 22 22 22 23 23 23 24 23 24 24 24 23 22 24 24 24 25 25 24 24 24 24 24 25 26 25 24 25 24 25 26 25 24 25 26 25 24 25 24 25 25 26 26 27 28
765 28 28 27 27 27 27 26 28 29 28 29 30 30 28 28 29 28 29 30 29 28 29 29 30 32 34 32 32 33 33 33 35 35 35 35 35 37 38 40 43 44 46 49 51 55 56 61 64 67 69 72 76 81 86 92 97 103 109 114 116 114 112 106 99 91 83 76 68 61 57 53 49
759 49 48 46 44 42 42 43 41 40 41 40 39 39 39 39 39 39 39 37 37 38 39 39 40 40 38 39 40 41 41 42 42 42 42 42 44 44 45 47 49 49 50 53 55 57 61 64 68 71 73 77 81 84 89 93 100 105 111 116 119 120 118 114 109 102 93 85 78 72 65 59 56
752 56 53 50 48 45 44 44 43 42 42 42 42 41 42 42 40 40 41 41 41 42 42 40 42 43 43 44 44 42 41 40 40 37 38 39 39 37 38 38 38 38 37 37 37 36 37 37 37 38 38 37 37 38 39 39 39 40 40 41 41 41 42 41 41 41 40 40 40 41 41 41 41
746 41 41 42 42 42 42 43 44 43 43 44 44 44 43 44 44 44 46 47 47 48 49 51 49 51 52 52 55 57 59 60 62 63 62 62 61 59 56 56 54 53 54 54 52 52 53 53 53 54 56 57 55 55 56 55 56 56 58 59 58 58 60 61 61 59 58 60 60 59 60 60 61
740 61 60 60 60 62 61 59 59 59 59 59 61 61 62 63 64 64 67 68 69 69 70 70 72 72 73 74 75 75 76 76 78 80 81 81 81 82 83 83 82 82 83 84 86 88 90 91 92 93 96 97 99 100 99 100 103 106 110 113 116 119 123 127 131 136 140 143 147 149 155 161 168
733A68PQJ1J4J5J7K1K2K4K4J9J3Okqj7k1k2j9j9j6j3j0rolkjkjJKK%LKKLNNLONONQPPRJ0Q
729B97QJ1RJ3J3J6J6J6K1K1K3K6K9L0L4L6L7L9M4M4M8N2N6O3O7P6Q6R6J08J22J34J49J65J85
725B190K11K45K89L46M21N14O23P47Q74R91J068J077R84P74M59P6l22o85r68j129j159j084
723F542r52q05o65n42m37l54k86k31j85j51j24j02q5p2o3n3m4l6k8j9j3qoj1j5k1k7k9l1k7
721A120k1j4pJQJ5K0K2L1L3M0M8N6O6P6Q9J04J22J46J70K05K45K95L55M28N14O17P36Q58R71
718G349J049J060R75P74M69R2l05o72r59j127j163j093r63q13o67n41m35l48k74k13j65j24
716A906r3o5m3k7j8j5j5k3l6m8o0p2p8q2q4q3q1q3p7p2o7o0n3m4l8l1k9k5k2j7j7j6j3j1j0
713B98j0rj0qqqronnnnmkkk%KJ%%JkjkkJJLNRRJ3J4J8K2K8L4L8M5M9M7M6L9K3Oj4l2m6n7n8
$$ plain form
733 168 175 183 194 208 223 240 261 283 307 331 350 363 369 367 359 342 321 299 280 261 245 232 222 213 207 204 202 201 199 198 199 201 203 203 206 208 210 213 218 223 226 232 237 243 248 256 263 270 279 289 297
729 297 305 316 325 338 351 367 383 399 420 441 464 490 519 549 583 619 656 695 739 783 831 883 939 1002 1069 1145 1231 1327 1435 1557 1691 1840 2005 2190
725 2190 2401 2646 2935 3281 3702 4216 4839 5586 6460 7451 8519 9596 10580 11354 11813 11889 11567 10882 9914 8785 7626 6542
723 6542 5590 4785 4120 3578 3141 2787 2501 2270 2085 1934 1810 1708 1623 1551 1488 1435 1391 1355 1327 1308 1295 1287 1281 1270 1255 1234 1207 1178 1147 1120
721 1120 1099 1085 1078 1079 1087 1102 1122 1144 1175 1208 1248 1296 1352 1418 1494 1583 1687 1809 1955 2125 2330 2575 2870 3225 3653 4167 4784 5520 6378 7349
718 7349 8398 9458 10433 11207 11676 11768 11463 10791 9832 8705 7542 6449 5486 4673 4006 3465 3030 2682 2408 2195 2030 1906
716 1906 1813 1748 1705 1678 1660 1645 1630 1607 1571 1523 1463 1391 1313 1231 1147 1064 983 900 823 751 684 624 571 527 489 458 429 404 382 365 348 332 319 308 298
713 298 288 279 269 261 253 245 236 230 225 220 215 210 206 204 202 200 200 202 203 203 203 204 202 201 199 197 198 199 202 207 216 225 238 252 270 292 320 354 392 437 486 533 579 618 641 647 633 601 555 498 440
708D40n6n0m2l5k8k5k0j4j3j1j0rponnlnlkkkmjkljJjkljj%kjjj%%Kj%KJjjmlmk%l%jk%jj
703D5%%%j%jjj%lJ%%Jlk%%j%jjJJJjk%jJ%jJjJJJ%jjjJjJ%JkjjJJ%%j%jJJJ%%%%j%%%k%j%
696B8%%%%%%J%%%%%JJJ%jJk%%%%%%kJJ%%kjJ%%%JjJ%%jj%Jj%JJjj%%%%%%%k%%JJJ%%%JJ%%
690C0jJ%j%jJ%J%jKj%%J%j%%%JJ%%JJJ%%JK%%JJj%%%%jkjkjJj%%j%jJ%j%%%j%%JJJ%kjJ%J
683C1%JJ%%J%J%%%J%%J%kJ%JJJ%K%kJJJJJJLJJJKL%JKKMMMLNNONOMMMKlmqpoopnmnlkkkkj
677E0jjkj%j%%j%j%%JJ%j%JJ%KjjJ%%KJ%%%%%%JKJJLKKJLMLMLNONPQNMJklonoppqmmlkmj%
671E8kjjj%%%kJ%%%KJ%%%KJ%LJJ%j%%Jjkkj%j%%%%J%J%jJJJjj%jJJ%JKKJJLKNNMPPONOOMK
664A28%lnponpnmmlll%%%%%JLKjK%j%%%jl%%%%jj%%JJ%KJJKKKKLNLMMMNMMNMMKLLJkjkkjk
$$ plain form
708 440 384 334 292 257 229 204 184 170 157 146 136 127 120 114 109 104 101 96 93 91 89 87 83 82 80 77 76 77 76 74 71 70 69 69 67 66 65 64 64 64 66 65 65 67 68 67 66 62 59 55 53 53 50 50 49 47 47 46 45
703 45 45 45 45 44 44 43 42 41 41 38 39 39 39 40 37 35 35 35 34 34 33 32 33 34 35 34 32 32 31 32 32 31 32 31 32 33 34 34 33 32 31 32 31 32 32 33 31 30 29 30 31 31 31 30 30 29 30 31 32 32 32 32 32 31 31 31 31 29 29 28 28
696 28 28 28 28 28 28 28 29 29 29 29 29 29 30 31 32 32 31 32 30 30 30 30 30 30 30 28 29 30 30 30 28 27 28 28 28 28 29 28 29 29 29 28 27 27 28 27 27 28 29 28 27 27 27 27 27 27 27 27 25 25 25 26 27 28 28 28 28 29 30 30 30
690 30 29 30 30 29 29 28 29 29 30 30 29 31 30 30 30 31 31 30 30 30 30 31 32 32 32 33 34 35 35 35 36 38 38 38 39 40 39 39 39 39 39 38 36 35 33 32 33 32 32 32 31 31 30 31 31 30 30 30 30 29 29 29 30 31 32 32 30 29 30 30 31
683 31 31 32 33 33 33 34 34 35 35 35 35 36 36 36 37 37 35 36 36 37 38 39 39 41 41 39 40 41 42 43 44 45 48 49 50 51 53 56 56 57 59 61 65 69 73 76 81 86 92 97 103 107 111 115 117 114 110 102 95 89 83 76 71 67 62 59 57 55 53 51 50
677 50 49 48 46 45 45 44 44 44 43 43 42 42 42 43 44 44 43 43 44 45 45 47 46 45 46 46 46 48 49 49 49 49 49 49 49 50 52 53 54 57 59 61 62 65 69 72 76 79 84 90 95 102 110 115 119 120 118 115 109 104 98 91 84 76 72 68 65 63 59 58 58
671 58 56 55 54 53 53 53 53 51 52 52 52 52 54 55 55 55 55 57 58 58 61 62 63 63 62 62 62 63 62 60 58 57 57 56 56 56 56 56 57 57 58 58 57 58 59 60 59 58 58 57 58 59 59 60 62 64 65 66 69 71 76 81 85 92 99 105 110 116 122 126 128
664 128 128 125 120 113 107 102 95 90 86 82 79 76 73 73 73 73 73 73 74 77 79 78 80 80 79 79 79 79 78 75 75 75 75 75 74 73 73 73 74 75 75 77 78 79 81 83 85 87 90 95 98 102 106 110 115 119 123 128 132 136 138 141 144 145 143 142 140 138 137 135
658A35j%LMMNLK%klopqrpnmnmkljjkk%%%kJ%%J%j%%%%%KJ%JJJJJKMMKMLMNPMONOL%kjkmmo
651A31olnmmll%llk%%%j%%jJj%%%%jjJ%k%%%JjjJ%%J%K%k%J%jJK%JjJK%%KKJ%%%KkJJjj%j
645A01%%%J%j%J%%JjJJJJ%JJJKJ%%jK%%J%j%JK%k%JKJ%%Jk%LJ%j%LJJ%J%JKKJ%%J%%jJJjj
639A32jK%jjjKKJkJj%K%JJjK%%%J%%%%KJJ%jJKKJ%%%JJ%%%jJ%%jJKJ%%%%KjJJJj%J%%J%%%
632A58%KJ%j%%JJjJ%jJJ%JjKjJJj%jJJ%jJ%j%KJ%JkJJjj%J%%jK%%%J%j%JjjJ%k%JjJJ%J%%
626A70%%JKj%%j%j%kjKj%j%jJj%j%jjjJ%kj%Jj%%j%Jjj%%%jj%%%%jjJj%%%j%j%%%kj%%jJJ
620A50jjJ%JJ%j%%jjkJ%Kk%j%JkJjjjjJjj%Jkjjjj%kk%jjkjjj%%%%kjjJj%%jjkJ%j%%kjjJ
613A14%kJ%%%jkJ%j%j%%J%%kK%%%%JJjJJ%jj%%jjJj%kkjl%%%jkj%%j%jjk%%%jkJ%jj%%%j%
$$ plain form
658 135 134 134 137 141 145 150 153 155 155 153 150 144 137 129 120 113 108 104 99 95 93 90 89 88 86 84 84 84 84 82 83 83 83 84 84 83 83 83 83 83 83 85 86 86 87 88 89 90 91 93 97 101 103 107 110 114 119 126 130 136 141 147 150 150 148 147 145 141 137 131
651 131 125 122 117 113 109 106 103 103 100 97 95 95 95 95 94 94 94 93 94 93 93 93 93 93 92 91 92 92 90 90 90 90 91 90 89 90 90 90 91 91 93 93 91 91 92 92 91 92 94 94 95 94 95 97 97 97 99 101 102 102 102 102 104 102 103 104 103 102 102 101
645 101 101 101 101 102 102 101 101 102 102 102 103 102 103 104 105 106 106 107 108 109 111 112 112 112 111 113 113 113 114 114 113 113 114 116 116 114 114 115 117 118 118 118 119 117 117 120 121 121 120 120 123 124 125 125 126 126 127 129 131 132 132 132 133 133 133 132 133 134 133 132
639 132 131 133 133 132 131 130 132 134 135 133 134 133 133 135 135 136 137 136 138 138 138 138 139 139 139 139 139 141 142 143 143 142 143 145 147 148 148 148 148 149 150 150 150 150 149 150 150 150 149 150 152 153 153 153 153 153 155 154 155 156 157 156 156 157 157 157 158 158 158 158
632 158 158 160 161 161 160 160 160 161 162 161 162 162 161 162 163 163 164 163 165 164 165 166 165 165 164 165 166 166 165 166 166 165 165 167 168 168 169 167 168 169 168 167 167 168 168 168 167 169 169 169 169 170 170 169 169 170 169 168 169 169 167 167 168 167 168 169 169 170 170 170
626 170 170 170 171 173 172 172 172 171 171 170 170 168 167 169 168 168 167 167 166 167 166 166 165 165 164 163 162 163 163 161 160 160 161 160 160 160 159 159 160 159 158 158 158 158 157 156 156 156 156 156 155 154 155 154 154 154 154 153 153 152 152 152 152 150 149 149 149 148 149 150
620 150 149 148 149 149 150 151 151 150 150 150 149 148 146 147 147 149 147 147 146 146 147 145 146 145 144 143 142 143 142 141 141 142 140 139 138 137 136 136 134 132 132 131 130 128 127 126 125 125 125 125 125 123 122 121 122 121 121 121 120 119 117 118 118 117 117 117 115 114 113 114
613 114 114 112 113 113 113 113 112 110 111 111 110 110 109 109 109 110 110 110 108 110 110 110 110 110 111 112 111 112 113 113 112 111 111 111 110 109 110 109 109 107 105 104 101 101 101 101 100 98 97 97 97 96 96 95 94 92 92 92 92 91 89 90 90 89 88 88 88 88 87 87
607H7Jj%jjjJ%%JkjKj%%%JjJ%%jj%%jj%%JjjJ%%jjj%Kj%%%kjjJ%j%%j%jj%jjJ%%j%%jj%J%
600F9jj%%%%%j%Kj%%JjJJJJ%j%J%%%%%%%jJj%j%%j%%K%%j%KjKJK%KKKKLQQJ2J6K1K4K0J5M
595B14pj8k4k8k4j6j0pplk%jlk%jk%Jj%%%jK%%J%%%j%%J%j%J%%%J%JJJ%JJ%KJ%LJKKJJKLM
589H9OJ0J5K0K5K3J7J0jrj9k6k6k0j3omjjkKLLKOMPQJ0J0J4J7J6J7J8J6J5J0Mmqj4j7j9j9
585A88j8j6j3j1j0qronmlljll%%jkJjjjjk%j%kj%jj%%%%%J%%JJJ%%JKKJJLJMLLLMPPRJ0J3
579A39J3J5J8J7J8J6J2QJlj1j4j8k0j8j7j5j4j1j0qonnmklljkl%ljlkkjjkjk%j%%jjjj%%J
574D2j%%jJj%%%%kj%j%%kJJjj%jJ%%Jj%%%%%%JJjJKj%j%J%%%kJ%jjjJjJ%jjjJ%jjJJk%%J%
568C1%jJJjj%JjJJJj%%%j%%%k%%%%j%JjJ%%%%j%%J%J%J%jJ%Jkk%%%%kJj%J%jJ%%JJjj%jJj
$$ plain form
607 87 88 87 87 86 85 84 85 85 85 86 84 83 85 84 84 84 84 85 84 85 85 85 84 83 83 83 82 81 81 81 82 81 80 81 81 81 80 79 78 78 80 79 79 79 79 77 76 75 76 76 75 75 75 74 74 73 72 72 71 70 71 71 71 70 70 70 69 68 68 69 69
600 69 68 67 67 67 67 67 67 66 66 68 67 67 67 68 67 68 69 70 71 71 70 70 71 71 71 71 71 71 71 71 70 71 70 70 69 69 69 68 68 68 70 70 70 69 69 71 70 72 73 75 75 77 79 81 83 86 94 102 114 130 151 175 195 210 214
595 214 207 189 165 137 113 97 87 80 73 70 68 68 67 64 62 62 61 59 59 60 59 59 59 59 58 60 60 60 61 61 61 61 60 60 60 61 61 60 60 61 61 61 61 62 62 63 64 65 65 66 67 67 69 70 70 73 74 76 78 79 80 82 85 89
589 89 95 105 120 140 165 188 205 215 214 205 186 160 134 114 101 95 91 90 89 87 89 92 95 97 103 107 114 122 132 142 156 173 189 206 224 240 255 265 269 265 257 243 226 207 188
585 188 170 154 141 130 120 112 103 97 92 88 85 82 81 78 75 75 75 74 72 73 72 71 70 69 67 67 66 66 64 63 63 62 61 61 61 61 61 61 62 62 62 63 64 65 65 65 66 68 70 71 72 75 76 80 83 86 89 93 100 107 116 126 139
579 139 152 167 185 202 220 236 248 256 257 254 243 229 211 191 173 156 141 127 116 106 98 92 87 82 78 76 73 70 69 67 64 64 61 60 57 55 53 52 51 49 48 46 46 45 45 45 44 43 42 41 41 41 42
574 42 41 41 41 40 41 40 40 40 40 40 38 37 37 36 36 36 34 35 36 35 34 34 33 34 34 34 35 34 34 34 34 34 34 34 35 36 35 36 38 37 37 36 36 37 37 37 37 35 36 36 35 34 33 34 33 34 34 33 32 31 32 32 31 30 31 32 30 30 30 31 31
568 31 31 30 31 32 31 30 30 31 30 31 32 33 32 32 32 32 31 31 31 31 29 29 29 29 29 28 28 29 28 29 29 29 29 29 28 28 28 29 29 30 30 31 31 30 31 31 32 30 28 28 28 28 28 26 27 26 26 27 27 26 27 27 27 28 29 28 27 27 26 27 26
561B6%J%%j%%%JJj%JJJk%Jk%%%%j%%JJjj%jJjJJ%%J%J%%%ljJ%%jjJJ%%jJ%j%%j%%JjJjJJ%
555B6j%%J%jjJJ%j%%j%K%KjjJJjj%j%Jjj%%%%jKJjJ%jj%JKJjKj%%%%%%%%jjJj%%Jj%%j%Jj
548B5jJJkjJjjJ%%JjJKj%JJjk%%J%Jj%%%%jJ%jJ%J%%%JJj%J%%%J%%jkjJ%KJ%Jjj%JJ%%j%J
542C0j%jJJ%kj%j%j%JkJ%J%jJ%%jJJj%%%jj%%J%%%K%%jj%%%%J%J%jJ%JJj%J%%%jJJj%jj%j
535B6J%j%JjJJKKJKKKKjkjkkkjkjKk%jJkjJ%%jJJ%j%%j%JJ%jjjJJ%%J%%k%J%%J%%J%k%Jj%
529B5Jj%Jj%J%%%%JjjjKJ%%J%JJKK%J%kjj%kj%jjJ%%Jjjj%JJ%%jj%jJj%JJk%%%JjJJ%%jJj
523B5JjjJj%%%%J%%jJJk%%jJK%%J%kJ%JjJJJ%Jj%%j%Jjj%%%%%%j%J%%jJ%j%JJjJ%%%j%%Jj
516B7%%%%%%%JJ%jj%%J%%jjJJ%KjJjj%J%j%%%j%J%%J%Jj%jJ%J%JJjj%%jKj%J%KJj%%k%J%%
$$ plain form
561 26 26 27 27 27 26 26 26 26 27 28 27 27 28 29 30 28 28 29 27 27 27 27 27 26 26 26 27 28 27 26 26 25 26 25 26 27 27 27 28 28 29 29 29 29 26 25 26 26 26 25 24 25 26 26 26 25 26 26 25 25 25 24 24 24 25 24 25 24 25 26 26
555 26 25 25 25 26 26 25 24 25 26 26 25 25 25 24 24 26 26 28 27 26 27 28 27 26 26 25 25 26 25 24 24 24 24 24 23 25 26 25 26 26 25 24 24 25 27 28 27 29 28 28 28 28 28 28 28 28 28 27 26 27 26 26 26 27 26 26 26 25 25 26 25
548 25 24 25 26 24 23 24 23 22 23 23 23 24 23 24 26 25 25 26 27 26 24 24 24 25 25 26 25 25 25 25 25 24 25 25 24 25 25 26 26 26 26 27 28 27 27 28 28 28 28 29 29 29 28 26 25 26 26 28 29 29 30 29 28 28 29 30 30 30 29 29 30
542 30 29 29 28 29 30 30 28 27 27 26 26 25 25 26 24 25 25 26 26 25 26 26 26 25 26 27 26 26 26 26 25 24 24 24 25 25 25 25 27 27 27 26 25 25 25 25 25 26 26 27 27 26 27 27 28 29 28 28 29 29 29 29 28 29 30 29 29 28 27 27 26
535 26 27 27 26 26 27 26 27 28 30 32 33 35 37 39 41 40 38 37 35 33 31 30 28 27 29 27 27 26 27 25 24 25 25 25 24 25 26 26 25 25 25 24 24 25 26 26 25 24 23 24 25 25 25 26 26 26 24 24 25 25 25 26 26 26 27 27 25 25 26 25 25
529 25 26 25 25 26 25 25 26 26 26 26 26 27 26 25 24 26 27 27 27 28 28 29 30 32 34 34 35 35 33 32 31 31 29 28 28 27 26 27 27 27 28 27 26 25 25 26 27 27 27 26 25 25 24 25 24 24 25 26 24 24 24 24 25 24 25 26 26 26 25 26 25
523 25 26 25 24 25 24 24 24 24 24 25 25 25 24 25 26 24 24 24 23 24 26 26 26 27 27 25 26 26 27 26 27 28 29 29 30 29 29 29 28 28 29 28 27 27 27 27 27 27 27 26 26 27 27 27 26 27 27 26 26 27 28 27 28 28 28 28 27 27 27 28 27
516 27 27 27 27 27 27 27 27 28 29 29 28 27 27 27 28 28 28 27 26 27 28 28 30 29 30 29 28 28 29 29 28 28 28 28 27 27 28 28 28 29 29 30 29 29 28 29 29 30 30 31 32 31 30 30 30 29 31 30 30 31 31 33 34 33 33 33 31 31 32 32 32
510C2%J%%JJjJ%jJj%%%jKJjJK%%%KJj%K%%%%%Jj%%j%k%%K%J%%JJ%%JKJJJ%jj%jjj%jj%Jjj
503D2J%%JJj%j%%K%%%j%%%%Jj%J%%J%%JJJJJJJ%jJJ%%kJ%jj%J%jJ%Jj%J%%%JJj%%j%%JjJ%
497E4%j%Jj%%J%JJ%%J%%j%Jj%%%%%JJ%%J%%JKJjK%JJj%JJjJJJJ%%Kj%JJJ%%j%jjJJ%%%%%j
490G2JJ%%%J%%J%%%%jJ%Jj%%%J%jJ%J%%%Jj%J%J%%jK%J%%JKKjJJkJ%J%KJJJK%JJKK%KJJKJ
484A08%%%jk%kjj%JJjJ%%JK%J%J%%J%KKJK%%J%JJ%JjLJ%K%%KKJJJJKKJLJLKKKLLMNNLKKJJ
477A80KKJKMLMLNMLMNONOOOOQPORRRJ0RJ2J2J2J3J3J6J6J6J7J8J9J9K1K2K2K3K4K5K5K6K7
473G22K9L1L1L4L5L6L8L8M0M0L8L4K7J5%j6l2m7n9o8p1o8o6n7n2m8m1l8l4l1k9k5k3k2k0j9
470C22j7j6j3j3j3j1j1rrqpqomoonmkmlllkkk%kjkkkkjkkkl%kjk%kj%jkj%%j%%%%jkkjjjj
$$ plain form
510 32 32 33 33 33 34 35 34 35 35 34 35 34 34 34 34 33 35 36 35 36 38 38 38 38 40 41 40 40 42 42 42 42 42 42 43 42 42 42 41 41 39 39 39 41 41 42 42 42 43 44 44 44 45 47 48 49 50 50 49 48 48 47 46 45 45 44 43 43 44 43 42
503 42 43 43 43 44 45 44 44 43 43 43 45 45 45 45 44 44 44 44 44 45 44 44 45 45 45 46 46 46 47 48 49 50 51 52 53 53 52 53 54 54 54 52 53 53 52 51 51 52 52 51 52 52 53 52 52 53 53 53 53 54 55 54 54 54 53 53 53 54 53 54 54
497 54 54 53 53 54 53 53 53 54 54 55 56 56 56 57 57 57 56 56 57 56 56 56 56 56 56 57 58 58 58 59 59 59 60 62 63 62 64 64 65 66 65 65 66 67 66 67 68 69 70 70 70 72 71 71 72 73 74 74 74 73 73 72 71 72 73 73 73 73 73 73 72
490 72 73 74 74 74 74 75 75 75 76 76 76 76 76 75 76 76 77 76 76 76 76 77 77 76 77 77 78 78 78 78 79 78 78 79 79 80 80 80 79 81 81 82 82 82 83 85 87 86 87 88 86 87 87 88 88 90 91 92 93 95 95 96 97 99 101 101 103 104 105 107 108
484 108 108 108 108 107 105 105 103 102 101 101 102 103 102 103 103 103 104 106 106 107 107 108 108 108 109 109 111 113 114 116 116 116 117 117 118 119 119 120 119 122 123 123 125 125 125 127 129 130 131 132 133 135 137 138 141 142 145 147 149 151 154 157 161 166 171 174 176 178 179 180
477 180 182 184 185 187 191 194 198 201 206 210 213 217 222 228 233 239 245 251 257 265 272 278 287 296 305 315 324 336 348 360 373 386 402 418 434 451 469 488 507 528 550 572 595 619 644 669 695 722
473 722 751 782 813 847 882 918 956 994 1034 1074 1112 1146 1173 1188 1188 1172 1140 1093 1034 966 895 827 761 704 652 604 563 525 491 460 431 406 383 361 341 322
470 322 305 289 276 263 250 239 228 219 210 202 195 187 181 177 171 165 160 156 154 150 147 144 141 139 137 135 135 133 132 130 128 126 124 123 121 119 117 114 114 112 111 109 109 107 106 106 105 103 102 102 102 101 101 101 101 101 100 98 96 95 94 93 92
464I2%jJjj%%%%J%Jj%%jJJjjjj%j%%%kjk%%kJ%%%%%k%Kjjj%%jjJJJj%%%%JjjJ%jJ%KJ%jkj
458G7jJJJjJj%k%j%%jjkj%jj%jJ%k%lJ%JjjJkj%Jk%%jjJ%k%kjJjJ%J%jjj%%kJ%kJ%j%%%k%
451D8Jkk%%%%jj%%%%%k%%%jJ%jj%%%%jj%JJjjj%%k%Jj%%J%jj%%j%%J%jj%%jJ%%%%%Jjj%%k
445B8%j%%J%%%%%%JjjJJj%%j%%%j%JJljJ%%JjJ%jJj%%jJ%j%KjJjj%J%%%%jKjk%%J%j%JjjK
438B4jjJj%jJ%%jJ%%jj%JjJjjJ%%%%j%JJjj%J%%j%JJj%%J%JjJk%%jJ%KjJjJ%j%Jjjj%%%%J
432B0jj%jK%kJJ%jJ%%%%Jj%kJ%Jj%j%JJj%j%J%J%jjJ%%%%%%jJ%%Jj%jJ%%JJj%J%j%%j%%%%
425A8J%%jJJk%%J%j%%JJ%jkJJJj%jJ%%%jKj%j%%%%Jj%%%%%%%kKJ%%Jjk%%J%J%jKJjj%JJ%j
419B0%jJ%%Kj%j%Kj%%j%j%J%JJ%%jj%%%%JjJ%%JJ%jkjJJj%J%%j%%K%%jjJJ%JjJk%%J%jJ%J
$$ plain form
464 92 92 91 92 91 90 90 90 90 90 91 91 92 91 91 91 90 91 92 91 90 89 88 88 87 87 87 87 85 84 82 82 82 80 81 81 81 81 81 81 79 79 81 80 79 78 78 78 77 76 77 78 79 78 78 78 78 78 79 78 77 78 78 77 78 78 80 81 81 80 78 77
458 77 76 77 78 79 78 79 78 78 76 76 75 75 75 74 73 71 70 70 69 68 68 67 68 68 66 66 63 64 64 65 64 63 64 62 61 61 62 60 60 60 59 58 59 59 57 57 55 54 55 54 55 55 56 56 55 54 53 53 53 51 52 52 50 51 51 50 50 50 50 48 48
451 48 49 47 45 45 45 45 45 44 43 43 43 43 43 43 41 41 41 41 40 41 41 40 39 39 39 39 39 38 37 37 38 39 38 37 36 36 36 34 34 35 34 34 34 35 35 34 33 33 33 32 32 32 33 33 32 31 31 31 30 31 31 31 31 31 31 32 31 30 30 30 28
445 28 28 27 27 27 28 28 28 28 28 28 28 29 28 27 28 29 28 28 28 27 27 27 27 26 26 27 28 25 24 25 25 25 26 25 26 26 25 26 25 25 25 24 25 25 24 24 26 25 26 25 24 24 25 25 25 25 25 24 26 25 23 23 23 24 24 23 23 24 23 22 24
438 24 23 22 23 22 22 21 22 22 22 21 22 22 22 21 20 20 21 20 21 20 19 20 20 20 20 20 19 19 20 21 20 19 19 20 20 20 19 19 20 21 20 20 20 21 21 22 21 22 20 20 20 19 20 20 22 21 22 21 22 22 21 21 22 21 20 19 19 19 19 19 20
432 20 19 18 18 17 19 19 17 18 19 19 18 19 19 19 19 19 20 19 19 17 18 18 19 18 18 17 17 18 19 18 18 17 17 18 18 19 19 18 17 18 18 18 18 18 18 18 17 18 18 18 19 18 18 17 18 18 18 19 20 19 19 20 20 19 19 19 18 18 18 18 18
425 18 19 19 19 18 19 20 18 18 18 19 19 18 18 18 19 20 20 19 17 18 19 20 19 19 18 19 19 19 19 18 20 19 19 18 18 18 18 18 19 18 18 18 18 18 18 18 18 16 18 19 19 19 20 19 17 17 17 18 18 19 19 18 20 21 20 19 19 20 21 21 20
419 20 20 19 20 20 20 22 21 21 20 20 22 21 21 21 20 20 19 19 20 20 21 22 22 22 21 20 20 20 20 20 21 20 21 21 21 22 23 23 22 20 19 20 21 20 20 21 21 21 20 20 20 22 22 22 21 20 21 22 22 23 22 23 21 21 21 22 22 21 22 22 23
413B3jJ%JkJ%%%%jj%%%%JJj%%%%j%%j%j%JJ%%%%%%jJjJ%%j%%j%%J%%%%%%%%%%j%%%jJ%%J%
406B0K%JJjJ%jjjj%JjjJkj%%%j%%JlK%jJJ%kJ%kK%JjJ%j%j%%JJ%J%jJJj%j%J%j%%J%%jJjJ
400A8%%%KKj%jK%%%%jkjjj%%J%jj%J%%jJ%%kj%J%J%jJJ%JjjjJ%j%%J%%jJjjJ%%Jjj%%j%J%
393A3%j%j%%J%%J%Jj%%%%j%%%jK%jK%kJ%%%J%k%J%jjJ%%JJjJJlJJ%%j%JjJ%jJj%%kJj%%JJ
387A3kJ%%Jjj%JJ%%%jJj%J%jj%%jkKJkKJ%jjK%j%JJj%%jJJjjj%%%KjJkJJjjKJjj%j%%JJ%j
380A1%%jJ%%%jJJ%k%%Kj%JJj%j%%j%%Jj%%%%j%%%%%J%%j%Kj%JkJj%J%%%%%j%%JJjjJ%%%K%
374A2jJj%%%%jKjjJJJ%jJjj%%JJ%j%j%%Jjj%%Jj%JjJ%%kKJj%%JJJJK%KMLMNKL%mnlnllklj
367A1K%j%%%%%%%j%JjjJJ%%KJk%%j%JjJ%jKkjJj%%jJ%%%jjJ%JJjJ%JKJK%LKMLLMJJklnnmj
$$ plain form
413 23 22 23 23 24 22 23 23 23 23 23 22 21 21 21 21 21 22 23 22 22 22 22 22 21 21 21 20 20 19 19 20 21 21 21 21 21 21 21 20 21 20 21 21 21 20 20 20 19 19 19 20 20 20 20 20 20 20 20 20 20 20 19 19 19 19 18 19 19 19 20 20
406 20 22 22 23 24 23 24 24 23 22 21 20 20 21 20 19 20 18 17 17 17 17 16 16 16 17 14 16 16 15 16 17 17 15 16 16 14 16 16 17 16 17 17 16 16 15 15 15 16 17 17 18 18 17 18 19 18 18 17 17 18 18 17 17 17 18 18 18 17 18 17 18
400 18 18 18 18 20 22 21 21 20 22 22 22 22 22 21 19 18 17 16 16 16 17 17 16 15 15 16 16 16 15 16 16 16 14 13 13 14 14 15 15 14 15 16 16 17 16 15 14 15 15 14 14 14 15 15 15 14 15 14 13 14 14 14 15 14 13 13 13 12 12 13 13
393 13 13 12 12 11 11 11 12 12 12 13 13 14 13 13 13 13 13 12 12 12 12 11 13 13 12 14 14 12 13 13 13 13 14 14 12 12 13 13 12 11 12 12 12 13 14 13 14 15 12 13 14 14 14 13 13 14 13 14 14 13 14 13 13 13 11 12 11 11 11 12 13
387 13 11 12 12 12 13 12 11 11 12 13 13 13 13 12 13 12 12 13 13 12 11 11 11 10 8 10 11 9 11 12 12 11 10 12 12 11 11 12 13 12 12 12 11 12 13 12 11 10 10 10 10 12 11 12 10 11 12 11 10 12 13 12 11 11 10 10 10 11 12 12 11
380 11 11 11 10 11 11 11 11 10 11 12 12 10 10 10 12 11 11 12 13 12 12 11 11 11 10 10 10 11 10 10 10 10 10 9 9 9 9 9 9 10 10 10 9 9 11 10 10 11 9 10 9 9 10 10 10 10 10 10 9 9 9 10 11 10 9 10 10 10 10 12 12
374 12 11 12 11 11 11 11 11 10 12 11 10 11 12 13 13 12 13 12 11 11 11 12 13 13 12 12 11 11 11 12 11 10 10 10 11 10 10 11 10 11 11 11 9 11 12 11 11 11 12 13 14 15 17 17 19 23 26 30 35 37 40 40 36 31 28 23 20 17 15 12 11
367 11 13 13 12 12 12 12 12 12 12 12 11 11 12 11 10 11 12 12 12 14 15 13 13 13 12 12 13 12 13 13 12 14 12 11 12 11 11 11 10 11 11 11 11 10 9 10 10 11 12 11 12 12 13 15 16 18 18 21 23 27 30 33 37 38 39 37 34 29 24 20 19
361A9jjkjj%kJjJJjJj%JJj%%jj%%%Kj%J%jjjJJ%JkJ%j%%J%%JJjl%JJ%j%%%%%Jjj%JkJK%%%
354A2%Kj%J%JkJjjK%jjJ%jJ%%J%%Jjj%J%%jj%JjJJjjKjjJj%JjJjJjjJjKjj%j%JJ%%%%JJ%%
348A4%j%JjjJJ%JjJJjK%k%%%jJJjJ%%%%Jj%%J%%%%%Jj%%j%Jj%Jjj%%j%J%%K%j%%k%%%%%%%
342A4%%%%%Kj%Jj%%J%%Kjj%JJJj%J%%j%J%%J%jJjJJ%%j%JJjj%Jj%K%jK%%%J%Jj%%j%J%jJ%
335B4%JJkjj%K%J%%%JJJjJ%%%LjK%%%J%J%JJkJ%j%jJJ%JjJJKJJj%%K%j%%%jJ%JJJJJLJJKK
329E5KJJj%jJjj%j%j%%Jkj%JjjK%%%K%JKJ%%j%jjjJJjjK%%Jj%%j%JJjj%%jjJ%%%%KKJKKNM
322G3LNMLKKjlmoonmmljljjj%jjjjkJ%j%jJJJ%j%K%%%%JjJ%%jJJjjjjkjjj%J%%JjJkKj%%K
316D2%JKKjJK%JK%%jjJ%jmk%kjjj%%jj%kjj%JjJJj%%j%KJjjJJjJ%Jj%j%%jk%%%jJ%%JjJ%j
$$ plain form
361 19 18 17 15 14 13 13 11 12 11 12 13 12 13 12 12 13 14 13 13 13 12 11 11 11 11 13 12 12 13 13 12 11 10 11 12 12 13 11 12 12 11 11 11 12 12 12 13 14 13 10 10 11 12 12 11 11 11 11 11 11 12 11 10 10 11 9 10 12 12 12 12
354 12 12 14 13 13 14 14 15 13 14 13 12 14 14 13 12 13 13 12 13 13 13 14 14 14 15 14 13 13 14 14 14 13 12 12 13 12 13 14 13 12 14 13 12 13 12 12 13 12 13 12 13 12 11 12 11 13 12 11 11 10 10 11 12 12 12 12 12 13 14 14 14
348 14 14 13 13 14 13 12 13 14 14 15 14 15 16 15 17 17 15 15 15 15 14 15 16 15 16 16 16 16 16 17 16 16 16 17 17 17 17 17 17 18 17 17 17 16 16 17 16 16 17 16 15 15 15 14 14 15 15 15 17 17 16 16 16 14 14 14 14 14 14 14 14
342 14 14 14 14 14 14 16 15 15 16 15 15 15 16 16 16 18 17 16 16 17 18 19 18 18 19 19 19 18 18 19 19 19 20 20 19 20 19 20 21 21 21 20 20 21 22 21 20 20 21 20 20 22 22 21 23 23 23 23 24 24 25 24 24 24 23 23 24 24 23 24 24
335 24 24 25 26 24 23 22 22 24 24 25 25 25 25 26 27 28 27 28 28 28 28 31 30 32 32 32 32 33 33 34 34 35 36 34 35 35 34 34 33 34 35 35 36 35 36 37 39 40 41 40 40 40 42 42 41 41 41 41 40 41 41 42 43 44 45 46 49 50 51 53 55
329 55 57 58 59 58 58 57 58 57 56 56 55 55 54 54 54 55 53 52 52 53 52 51 53 53 53 53 55 55 56 58 59 59 59 58 58 57 56 55 56 57 56 55 57 57 57 58 57 57 57 56 56 57 58 57 56 56 56 55 54 55 55 55 55 55 57 59 60 62 64 69 73
322 73 76 81 85 88 90 92 91 88 84 78 72 67 63 59 56 55 52 51 50 49 49 48 47 46 45 43 44 44 43 43 42 43 44 45 45 44 44 46 46 46 46 46 47 46 47 47 47 46 47 48 47 46 45 44 42 41 40 39 39 40 40 40 41 40 41 39 41 40 40 40 42
316 42 42 43 45 47 46 47 49 49 50 52 52 52 51 50 51 51 50 46 44 44 42 41 40 39 39 39 38 37 37 35 34 33 33 34 33 34 35 34 34 34 33 33 35 36 35 34 35 36 35 36 36 37 36 36 35 35 35 34 32 32 32 32 31 32 32 32 33 32 33 33 32
309C2%J%%%%%j%%K%j%%%kJJjJjjjkJJ%jjkJ%jJ%%j%JJJj%%J%%J%j%%JjJjjjK%JJ%jKj%%j%
303C0%%%J%j%%%JJk%J%%j%KkJ%k%%j%%%jjJkk%j%%%k%jJjJjJ%%j%j%JjjJJjj%%%%jJJ%jJJ
296A9%kJ%%%j%%%JjJ%%%%jJjjJJ%j%JJjjJjjj%J%JjjJjjj%%%%%%jkJJjJ%%jJ%%kj%J%%Kjj
290A0%%j%KjJj%%J%j%%%%Jjk%%jJJjjJj%JJjj%jJ%%Jj%%%JjjjK%J%%%%%%j%K%%j%jj%%%J%
284GjJ%%%jJjJ%jJ%%%%%%%%%%jJ%Jj%jJj%Jj%J%%jjJJJj%j%%J%%%%J%j%%%%%%J%%%j%%%%J
277H%%j%Jj%%j%%%J%JJjjjJ%%jJ%jJj%J%%Jj%J%jjjK%%%jjJ%%%jJ%jJJjJJ%jjJJJ%jJJ%%j
270IjjJ%jJ%%%k%Kj%%jJ%%%%J%%Jkj%%J%%J%j%j%%%%jKJ%%%%%j%K%j%jJjjJJJj%J%j%%J%j
264HjJJK%%%%J%j%j%J%%jjjJk%%%%jJ%j%%jK%%jJJjj%%JJ%k%j%%K%%Jj%j%%%%Kj%jJJ%jjJ
$$ plain form
309 32 32 33 33 33 33 33 33 32 32 32 34 34 33 33 33 33 31 32 33 32 33 32 31 30 28 29 30 30 29 28 26 27 27 26 27 27 27 26 26 27 28 29 28 28 28 29 29 29 30 30 29 29 29 30 29 30 29 28 27 29 29 30 31 31 30 32 31 31 31 30 30
303 30 30 30 30 31 31 30 30 30 30 31 32 30 30 31 31 31 30 30 32 30 31 31 29 29 29 28 28 28 28 27 26 27 25 23 23 22 22 22 22 20 20 19 20 19 20 19 20 20 20 19 19 18 18 19 18 17 18 19 18 17 17 17 17 17 16 17 18 18 17 18 19
296 19 19 17 18 18 18 18 17 17 17 17 18 17 18 18 18 18 18 17 18 17 16 17 18 18 17 17 18 19 18 17 18 17 16 15 15 16 16 17 16 15 16 15 14 13 13 13 13 13 13 13 12 10 11 12 11 12 12 12 11 12 12 12 10 9 9 10 10 10 12 11 10
290 10 10 10 9 9 11 10 11 10 10 10 11 11 10 10 10 10 10 11 10 8 8 8 7 8 9 8 7 8 7 7 8 9 8 7 7 6 7 7 7 8 7 7 7 7 8 7 6 5 7 7 8 8 8 8 8 8 8 7 7 9 9 9 8 8 7 6 6 6 6 7 7
284 7 6 7 7 7 7 6 7 6 7 7 6 7 7 7 7 7 7 7 7 7 7 7 6 7 7 8 7 7 6 7 6 6 7 6 6 7 7 7 6 5 6 7 8 7 7 6 6 6 7 7 7 7 7 8 8 7 7 7 7 7 7 7 8 8 8 8 7 7 7 7 7 8
277 8 8 8 7 7 8 7 7 7 6 6 6 6 7 7 8 9 8 7 6 7 7 7 6 7 7 6 7 6 6 7 7 7 8 7 7 8 8 7 6 5 7 7 7 7 6 5 6 6 6 6 5 6 6 5 6 7 6 7 8 8 7 6 7 8 9 9 8 9 10 10 10 9
270 9 8 7 8 8 7 8 8 8 8 6 6 8 7 7 7 6 7 7 7 7 7 8 8 8 9 7 6 6 6 7 7 7 8 8 7 7 6 6 6 6 6 5 7 8 8 8 8 8 8 7 7 9 9 8 8 7 8 7 6 7 8 9 8 8 9 9 8 8 8 9 9 8
264 8 7 8 9 11 11 11 11 11 12 12 11 11 10 10 11 11 11 10 9 8 9 7 7 7 7 7 6 7 7 6 6 6 5 7 7 7 6 7 8 7 6 6 6 7 8 8 6 6 5 5 5 7 7 7 8 7 7 6 6 6 6 6 8 7 7 6 7 8 8 7 6 7
257G%JJJlJJJ%jkJJ%J%JK%jJ%kkJkjjJ%%j%%J%%jjjJ%k%K%Jj%J%%k%J%%%J%jjJj%JjjJJ%%
251Ej%J%jJ%j%%JjjL%%%%%j%J%jjJJJjkJ%%JJkj%JJjj%%%%%%jJ%JjjJJkJ%%%%J%jj%jJJJj
244DJjj%%JjJ%%j%%J%k%JJj%%%%jjJJJjJ%%jJjj%%%Jj%J%K%jkK%%k%%JjJ%%jJjJj%J%jJLj
238Ej%jJjjKjjjJ%Jj%JJ%j%jjJ%J%j%JJj%Jj%%J%jj%%%%jJJ%%%%J%jj%%%%%%%%%%%J%jJ%j
231B%%%%Kj%Jj%jJ%%jJJ%%j%%%jjKjJ%%%%jjJJjJJjjJJ%%j%jJj%JkJK%Jjj%%jjJK%%j%J%j
225C%JJj%%%jj%J%j%%J%jJ%%J%%%k%%%kKJ%j%%%%K%%%k%%%J%%j%JjJ%%J%jj%K%jj%%%J%%%
218CJ%%KjjJj%J%%%jjJ%%jjJ%%%%kJ%jK%jjK%%jJJk%%%J%%%%jJ%j%%j%J%JJj%%%%Jjj%J%J
212D%k%%%%%K%jjJ%J%jJj%%%Jj%jJJj%%%Jj%JjJJkJj%j%JjJjJ%%jK%j%%Jjj%j%JJ%jJj%%%
$$ plain form
257 7 7 8 9 10 7 8 9 10 10 9 7 8 9 9 10 10 11 13 13 12 13 13 11 9 10 8 7 6 7 7 7 6 6 6 7 7 7 6 5 4 5 5 3 3 5 5 6 5 5 6 6 6 4 4 5 5 5 5 6 6 5 4 5 4 4 5 4 3 4 5 5 5
251 5 4 4 5 5 4 5 5 4 4 4 5 4 3 6 6 6 6 6 6 5 5 6 6 5 4 5 6 7 6 4 5 5 5 6 7 5 4 4 5 6 5 4 4 4 4 4 4 4 3 4 4 5 4 3 4 5 3 4 4 4 4 4 5 5 4 3 3 2 3 4 5 4
244 4 5 4 3 3 3 4 3 4 4 4 3 3 3 4 4 2 2 3 4 3 3 3 3 3 2 1 2 3 4 3 4 4 4 3 4 3 2 2 2 2 3 2 2 3 3 5 5 4 2 4 4 4 2 2 2 3 2 3 3 3 2 3 2 3 2 2 3 3 2 3 6 5
238 5 4 4 3 4 3 2 4 3 2 1 2 2 3 2 2 3 4 4 3 3 2 1 2 2 3 3 2 2 3 4 3 3 4 3 3 3 4 4 3 2 2 2 2 2 1 2 3 3 3 3 3 4 4 3 2 2 2 2 2 2 2 2 2 2 2 2 3 3 2 3 3 2
231 2 2 2 2 2 4 3 3 4 3 3 2 3 3 3 2 3 4 4 4 3 3 3 3 2 1 3 2 3 3 3 3 3 2 1 2 3 2 3 4 3 2 3 4 4 4 3 3 2 3 2 2 3 1 2 4 4 5 4 3 3 3 2 1 2 4 4 4 3 3 4 4 3
225 3 3 4 5 4 4 4 4 3 2 2 3 3 2 2 2 3 3 2 3 3 3 4 4 4 4 2 2 2 2 0 2 3 3 2 2 2 2 2 4 4 4 4 2 2 2 2 3 3 3 2 2 3 2 3 3 3 4 4 3 2 2 4 4 3 2 2 2 2 3 3 3 3
218 3 4 4 4 6 5 4 5 4 4 5 5 5 5 4 3 4 4 4 3 2 3 3 3 3 3 1 2 2 1 3 3 2 1 3 3 3 2 3 4 2 2 2 2 3 3 3 3 3 2 3 3 2 2 2 1 1 2 2 3 4 3 3 3 3 3 4 3 2 2 3 3 4
212 4 4 2 2 2 2 2 2 4 4 3 2 3 3 4 4 3 4 3 3 3 3 4 3 3 2 3 4 3 3 3 3 4 3 3 4 3 4 5 3 4 3 3 2 2 3 2 3 2 3 3 3 2 4 4 3 3 3 4 3 2 2 1 1 2 3 3 2 3 2 2 2 2
205BJ%%j%%%J%KjjjkJJJJkKj%%j%J%%%%jjKjJ%jJ%Jj%jjK%jKjjJ%jJjj%JJJ%k%%KkJJ%k%J
199C%%j%%%%%%jJJJ%k%%%JjkJJJjJ%%%%jJ%%%%J%%%%jJk%%%j%K%j%Jj%%Jj%%jjJJ%jJJ%%%
192C%%%J%kJ%%j%JJ%k%jJ%%jLjjJ%%%Jk%JJkk%K%Jj%%%%%%%%J%%%jj%%JJJ%j%j%%%%JJjKj
185Dj%%jJJ%%j%j%%%J%%%j%J%jj%%J%J%jJj%j%%%JJ%%%%%%J%jj%%j%J%jJ%j%J%j%KJjjj%J
179B%%J%%jJ%jjJJk%JJ%j%jJJJ%jk%JjjLj%j%jjL%j%%jJ%J%%%%%%%j%%%JJ%JkJjJ%J%j%jj
172AJ%%jJJ%jjK%k%%J%%jJ%Jj%%%J%j%JjjJJ%j%jJ%JjJjj%JJjjJJj%%%%j%%%J%%%%jj%KJ%
166Cj%%%J%k%J%%J%%%J%j%%Jk%J%%%%%jk%KJ%jJjJjJj%jJ%j%J%%%jJKjj%J%%j%JjJ%%%jKj
159Cj%%%%%%JJjJjjjJKjj%Jj%%%jJJj%%%J%jKk%%%j%J%Jj%%%j%J%%J%%jj%J%%%%Jj%%Jj%k
$$ plain form
205 2 3 3 3 2 2 2 2 3 3 5 4 3 2 0 1 2 3 4 2 4 3 3 3 2 2 3 3 3 3 3 2 1 3 2 3 3 2 3 3 4 3 3 2 1 3 3 2 4 3 2 3 3 2 3 2 1 1 2 3 4 4 2 2 2 4 2 3 4 4 2 2 3
199 3 3 3 2 2 2 2 2 2 2 1 2 3 4 4 2 2 2 2 3 2 0 1 2 3 2 3 3 3 3 3 2 3 3 3 3 3 4 4 4 4 4 3 4 2 2 2 2 1 1 3 3 2 2 3 2 2 2 3 2 2 2 1 0 1 2 2 1 2 3 3 3 3
192 3 3 3 3 4 4 2 3 3 3 2 2 3 4 4 2 2 1 2 2 2 1 4 3 2 3 3 3 3 4 2 2 3 4 2 0 0 2 2 3 2 2 2 2 2 2 2 2 2 3 3 3 3 2 1 1 1 2 3 4 4 3 3 2 2 2 2 2 3 4 3 5 4
185 4 3 3 3 2 3 4 4 4 3 3 2 2 2 2 3 3 3 3 2 2 3 3 2 1 1 1 2 2 3 3 2 3 2 2 1 1 1 1 2 3 3 3 3 3 3 3 4 4 3 2 2 2 1 1 2 2 1 2 2 1 1 2 2 1 1 3 4 3 2 1 1 2
179 2 2 2 3 3 3 2 3 3 2 1 2 3 1 1 2 3 3 2 2 1 2 3 4 4 3 1 1 2 1 0 3 2 2 1 1 0 -1 2 2 1 1 1 0 1 1 2 2 2 2 2 2 2 2 1 1 1 1 2 3 3 4 2 3 2 3 3 4 4 3 3 2 1
172 1 2 2 2 1 2 3 3 2 1 3 3 1 1 1 2 2 2 1 2 2 3 2 2 2 2 3 3 2 2 3 2 1 2 3 3 2 2 1 2 2 3 2 3 2 1 1 2 3 2 1 2 3 2 2 2 2 2 1 1 1 1 2 2 2 2 2 1 0 0 2 3 3
166 3 2 2 2 2 3 3 1 1 2 2 2 3 3 3 3 4 4 3 3 3 4 2 2 3 3 3 3 3 3 2 0 0 2 3 3 2 3 2 3 2 3 2 2 1 2 2 1 1 2 2 2 2 1 2 4 3 2 2 3 3 3 2 2 3 2 3 3 3 3 2 4 3
159 3 2 2 2 2 2 2 2 3 4 3 4 3 2 1 2 4 3 2 2 3 2 2 2 2 1 2 3 2 2 2 2 3 3 2 4 2 2 2 2 1 1 2 2 3 2 2 2 2 1 1 2 2 2 3 3 3 2 1 1 2 2 2 2 2 3 2 2 2 3 2 2 0
153@%LjjKjjJ%Jj%JjkJ%%%JJjJ%Jk%%JJ%jjJ%%jj%L%jjjJJ%jjjKKjj%j%jJJj%%j%JJ%j%%J
146B%%%%%%%%J%jJk%%jJJj%%%JJj%jJjjJ%%JJj%jJ%J%jJ%j%%Jj%%J%kJ%jj%J%Kj%%%%%%Jj
140Bj%K%%%%%jJ%jJj%JkJjJJJjjjJj%Kj%J%jjJ%j%JJj%jJ%%j%JjjK%JjjjJKj%%J%%j%%j%K
133C%%j%%jJJjKjk%J%%J%j%Jk%Jj%%%JjJ%%jJJjjJJ%JkJ%JjjjJJj%%jJJ%%j%%%%%%%J%jJk
127AJJ%jj%%JJjJ%k%%J%%%J%kJ%jJJ%j%j%JjJ%jJ%J%j%J%%%%j%JkjJJJj%%jJJj%%%j%J%%%
120Bj%%%J%%%%Jj%%Jj%JjjJ%k%JJ%%%%%j%J%J%kjJ%%%%Kj%%%%%J%%j%%%%%%j%j%K%j%J%%%
114B%%j%Jj%JjJjJ%%jJj%J%%%%JJk%jJJ%%kj%%%Kj%%J%jK%%%%%jj%%K%jj%j%%K%JkK%k%jK
107B%Jj%Jj%J%%j%%j%J%%J%jJ%jjJ%%%JkjJKJjjjJJj%J%%%%jj%%J%%%%j%%Kj%j%JJj%Jk%%
$$ plain form
153 0 0 3 2 1 3 2 1 2 2 3 2 2 3 2 0 1 1 1 1 2 3 2 3 3 4 2 2 2 3 4 4 3 2 3 3 3 2 1 1 4 4 3 2 1 2 3 3 2 1 0 2 4 3 2 2 1 1 0 1 2 1 1 1 0 0 1 2 2 1 1 1 2
146 2 2 2 2 2 2 2 2 2 3 3 2 3 1 1 1 0 1 2 1 1 1 1 2 3 2 2 1 2 1 0 1 1 1 2 3 2 2 1 2 2 3 3 2 3 3 2 2 2 3 2 2 2 3 3 1 2 2 1 0 0 1 1 3 2 2 2 2 2 2 2 3 2
140 2 1 1 3 3 3 3 3 3 2 3 3 2 3 2 2 3 1 2 1 2 3 4 3 2 1 2 1 1 3 2 2 3 3 2 1 2 2 1 1 2 3 2 2 1 2 2 2 1 1 2 1 0 2 2 3 2 1 0 1 3 2 2 2 3 3 3 2 2 2 1 1 3
133 3 3 3 2 2 2 1 2 3 2 4 3 1 1 2 2 2 3 3 2 2 3 1 1 2 1 1 1 1 2 1 2 2 2 1 2 3 2 1 2 3 3 4 2 3 3 4 3 2 1 2 3 2 2 2 1 2 3 3 3 2 2 2 2 2 2 2 2 3 3 2 3 1
127 1 2 3 3 2 1 1 1 2 3 2 3 3 1 1 1 2 2 2 2 3 3 1 2 2 1 2 3 3 2 2 1 1 2 1 2 2 1 2 2 3 3 2 2 3 3 3 3 3 2 2 3 1 0 1 2 3 2 2 2 1 2 3 2 2 2 2 1 1 2 2 2 2
120 2 1 1 1 1 2 2 2 2 2 3 2 2 2 3 2 2 3 2 1 2 2 0 0 1 2 2 2 2 2 2 1 1 2 2 3 3 1 0 1 1 1 1 1 3 2 2 2 2 2 2 3 3 3 2 2 2 2 2 2 2 1 1 0 0 2 2 1 1 2 2 2 2
114 2 2 2 1 1 2 1 1 2 1 2 1 2 2 2 1 2 1 1 2 2 2 2 2 3 4 2 2 1 2 3 3 3 1 0 0 0 0 2 1 1 1 2 2 1 3 3 3 3 3 3 2 1 1 1 3 3 2 1 1 0 0 0 2 2 3 1 3 3 1 1 0 2
107 2 2 3 2 2 3 2 2 3 3 3 2 2 2 1 1 2 2 2 3 3 2 3 3 2 1 2 2 2 2 3 1 0 1 3 4 3 2 1 2 3 2 2 3 3 3 3 3 2 1 1 1 2 2 2 2 2 1 1 1 3 2 2 1 1 2 3 2 2 3 1 1 1
100A%J%J%Jj%%%j%%%J%%j%JjJjkKJk%Jj%J%Jjj%J%%J%%jJ%j%%%%Jj%JkJ%j%JjJJJ%%k%J%k
94A%%J%jJJkJ%%%j%JjjJJ%%%%%j%j%JK%%%%%j%J%%jJjj%%%%%JJjj%%%J%K%kkjJJK%%%kJ%%
87BjJ%j%JJ%jJ%%jj%JJjJJkj%K%jj%JjJJ%j%%jJ%%Jj%%Jjj%JJ%j%j%%J%%jjJJ%j%JJkj%KJ
81CjJ%%%k%Jj%J%jj%K%J%j%%%J%jjJ%%%%%j%J%%%jj%L%jjKjjJJ%j%Jj%%%J%%jJ%%jj%%KjJ
74C%%jjJj%%%%J%%jj%J%%%JJjjJ%jJjJj%J%jj%K%%%%j%%%Kj%jJ%%%%J%j%%j%%jJJjj%J%%%
67AJ%jJ%%%jJ%%%Kj%%%%jJj%Jj%%%j%JjjJ%%%JJjjJ%%%j%%JkJJ%k%KJj%%%j%%JkKjj%%JJ%
61B%%%%%J%j%%%J%%jJ%%jJ%%J%j%J%%j%%%%Jjj%%j%jJ%J%j%JJ%jjKjJjJj%%Jj%jJj%jJ%%J
54BJ%j%%%%%JjJ%%%j%%%%J%JjkJ%%%J%%kjJ%J%Jj%%kJj%J%J%%JJkJj%Jk%kJ%JJ%jJj%%%%%
$$ plain form
100 1 1 2 2 3 3 4 3 3 3 3 2 2 2 2 3 3 3 2 2 3 2 3 2 0 2 3 1 1 2 1 1 2 2 3 2 1 1 2 2 2 3 3 3 2 3 3 2 2 2 2 2 3 2 2 3 1 2 2 1 1 2 1 2 3 4 4 4 2 2 3 3 1
94 1 1 1 2 2 1 2 3 1 2 2 2 2 1 1 2 1 0 1 2 2 2 2 2 2 1 1 0 0 1 3 3 3 3 3 3 2 2 3 3 3 2 3 2 1 1 1 1 1 1 2 3 2 1 1 1 1 2 2 4 4 2 0 -1 0 1 3 3 3 3 1 2 2 2
87 2 1 2 2 1 1 2 3 3 2 3 3 3 2 1 1 2 3 2 3 4 2 1 1 3 3 2 1 1 2 1 2 3 3 2 2 2 1 2 2 2 3 2 2 2 3 2 1 1 2 3 3 2 2 1 1 1 2 2 2 1 0 1 2 2 1 1 2 3 1 0 0 2 3
81 3 2 3 3 3 3 1 1 2 1 1 2 2 1 0 0 2 2 3 3 2 2 2 2 3 3 2 1 2 2 2 2 2 2 1 1 2 2 2 2 1 0 0 3 3 2 1 3 2 1 2 3 3 2 2 3 2 2 2 2 3 3 3 2 3 3 3 2 1 1 1 3 2 3
74 3 3 3 2 1 2 1 1 1 1 1 2 2 2 1 0 0 1 1 1 1 2 3 2 1 2 2 1 2 1 2 1 1 2 2 1 0 0 2 2 2 2 2 1 1 1 1 3 2 2 1 2 2 2 2 2 3 3 2 2 2 1 1 1 0 1 2 1 0 0 1 1 1 1
67 1 2 2 1 2 2 2 2 1 2 2 2 2 4 3 3 3 3 3 2 3 2 2 3 2 2 2 2 1 1 2 1 0 1 1 1 1 2 3 2 1 2 2 2 2 1 1 1 2 0 1 2 2 0 0 2 3 2 2 2 2 1 1 1 2 0 2 1 0 0 0 1 2 2
61 2 2 2 2 2 2 3 3 2 2 2 2 3 3 3 2 3 3 3 2 3 3 3 4 4 3 3 4 4 4 3 3 3 3 3 4 3 2 2 2 1 1 0 1 1 2 2 1 1 2 3 3 2 1 3 2 3 2 3 2 2 2 3 2 2 1 2 1 1 0 1 1 1 2
54 2 3 3 2 2 2 2 2 2 3 2 3 3 3 3 2 2 2 2 2 3 3 4 3 1 2 2 2 2 3 3 3 1 0 1 1 2 2 3 2 2 2 0 1 0 0 1 1 2 2 2 3 4 2 3 2 2 3 1 1 -1 0 0 1 2 2 1 2 1 1 1 1 1 1
48A%%J%j%J%%J%jJ%j%j%J%J%jJ%J%jjJ%jj%JjJJ%jjK%j%jK%%%jJJjj%%%%k%J%%%%%%%jJK%
41Cj%j%%J%jJ%jj%JJj%%%J%jJ%%%J%%%%%Jjjj%%J%%Jj%%jJJ%%jj%KkjJ%%%%JJj%%Jj%%%jj
34@%Lj%%%jj%J%%JjjJ%J%%jJ%jJ%%%%J%jJ%j%jJ%jJJj%%%%j%%%%%J%jJ%Jjj%J%%%%J%jJ%j
28BJj%%%%%%jJJj%jJ%%jjJ%%%jJ%%JJ%JkjLjJj%j%%%%%%J%%%j%%%J%jj%%jJ%J%j%%%jK%J%
21Cj%J%%j%%%%%JJ%kj%JJjjJjJ%jJJ%j%kJ%%%Jj%J%%JJjJj%%jJJ%jjj%%J%Jj%%%Jj%jJj%J
14BJ%Jj%j%%J%jJ%jJ%%kjJJJJ%j%Jj%%j%%%J%j%JjjJjK%j%%%Kjj%J%%JjJjJjJj%JjJ%JjJj
8D%j%%%%%J%JJ%j%%JJ%%jj%jJ%jJ%%jjJJ%%JJKJ%KK%%%%%jj%%k%jjJKjj%JK%KK%JMKLLNMQ
1D6RJ2J5J9K7L4M4M7M3K9J0j0k7m8n8n3l9k8j9j1j0mnnmjj%kjj%%j%%jJjjjJJkJ%LJJKjjJ
$$ plain form
48 1 1 1 2 2 1 1 2 2 2 3 3 2 3 3 2 2 1 1 2 2 3 3 2 3 3 4 4 3 2 3 3 2 1 1 2 1 2 3 3 2 1 3 3 2 2 1 3 3 3 3 2 3 4 3 2 2 2 2 2 0 0 1 1 1 1 1 1 1 1 0 1 3 3
41 3 2 2 1 1 1 2 2 1 2 2 1 0 0 1 2 1 1 1 1 2 2 1 2 2 2 2 3 3 3 3 3 3 4 3 2 1 1 1 2 2 2 3 2 2 2 1 2 3 3 3 2 1 1 3 1 0 1 1 1 1 1 2 3 2 2 2 3 2 2 2 2 1 0
34 0 0 3 2 2 2 2 1 0 0 1 1 1 2 1 0 1 1 2 2 2 1 2 2 1 2 2 2 2 2 3 3 2 3 3 2 2 1 2 2 1 2 3 2 2 2 2 2 1 1 1 1 1 1 2 2 1 2 2 3 2 1 1 2 2 2 2 2 3 3 2 3 3 2
28 2 3 2 2 2 2 2 2 2 1 2 3 2 2 1 2 2 2 1 0 1 1 1 1 0 1 1 1 2 3 3 4 2 1 4 3 4 3 3 2 2 2 2 2 2 2 3 3 3 3 2 2 2 2 3 3 2 1 1 1 0 1 1 2 2 1 1 1 1 0 2 2 3 3
21 3 2 2 3 3 3 2 2 2 2 2 2 3 4 4 2 1 1 2 3 2 1 2 1 2 2 1 2 3 3 2 2 0 1 1 1 1 2 1 1 2 2 2 3 4 3 4 3 3 3 2 3 4 4 3 2 1 1 1 2 2 3 2 2 2 2 3 2 2 1 2 1 1 2
14 2 3 3 4 3 3 2 2 2 3 3 2 3 3 2 3 3 3 1 0 1 2 3 4 4 3 3 4 3 3 3 2 2 2 2 3 3 2 2 3 2 1 2 1 3 3 2 2 2 2 4 3 2 2 3 3 3 4 3 4 3 4 3 4 3 3 4 3 4 4 5 4 5 4
8 4 4 3 3 3 3 3 3 4 4 5 6 6 5 5 5 6 7 7 7 6 5 5 4 5 5 4 5 5 5 4 3 4 5 5 5 6 7 9 10 10 12 14 14 14 14 14 14 13 12 12 12 10 10 9 8 9 11 10 9 9 10 12 12 14 16 16 17 21 23 26 29 34 38 46
1 46 55 67 82 101 128 162 206 253 296 325 335 325 298 250 192 139 100 72 53 42 32 28 23 18 14 13 12 12 10 9 8 8 8 7 7 7 6 7 6 5 4 5 6 4 5 5 8 9 10 12 11 10 11
-4A1%kkkjJj%%jj%%%%%%%%j%JJJj%%JJJ%%%%jjk%J%%%j%kJJ%%j%Jj%%Jj%J%%%Jj%j%%KJ%%
-10D%%j%%j%J%jjJJ%%%kjJjJ%j%j%KJ%jj%Lj%%Jj%%%%jJj%%%J%J%Jjj%%j%%JjJ%jJ%%%jJ%
-17Bj%%%K%jjJJ%kjJJJk%JJj%j%%%%%JJ%k%%%J%%Jj%%jJ%%%%jK%Jjjj%J%%%%%Jj%Jj%Kj%j
-23Bj%JJj%k%KjJjjJjJJ%%jj%J%%%J%%%%j%%%Jj%j%J%%J%kK%j%JJj%Jj%%%j%J%%%jJ%%jJ%
-30BJ%j%%j%%J%j%%%j%J%J%%%%%%%j%JJjj%JjJ%j%%j%%%JJ%%j%jK%j%%J%%jJ%%%%jJ%j%J%
-37B%Jj%j%JjjJ%J%j%Kj%J%jk%Jj%J%Jj%%%J%JjjjK%jJ%j%%%%Jj%Kjj%%%%%j%JJ%%jJJjkJ
-43A%JJJk%%%%j%%JjJ%jJ%jJ%%jjJ%%K%%k%%%Jj%%%J%%%J%%jj%K%jjJ%%j%%j%%%J%%JJj%%
-50B%j%J%j%jKJ%j%%%%%jJ%j%%JJj%%%%JjjJjJj%%%J%%%%%%j%%jJ%%J%jJj%%%%%jJKjjjJ%
$$ plain form
-4 11 11 9 7 5 4 5 4 4 4 3 2 2 2 2 2 2 2 2 2 1 1 2 3 4 3 3 3 4 5 6 6 6 6 6 5 4 2 2 3 3 3 3 2 2 0 1 2 2 2 1 1 2 1 1 1 2 1 1 2 2 2 2 3 2 2 1 1 1 3 4 4 4
-10 4 4 4 3 3 3 2 2 3 3 2 1 2 3 3 3 3 1 0 1 0 1 1 0 0 -1 -1 1 2 2 1 0 0 3 2 2 2 3 2 2 2 2 2 1 2 1 1 1 1 2 2 3 3 4 3 2 2 2 1 1 1 2 1 2 2 1 2 2 2 2 1 2 2
-17 2 1 1 1 1 3 3 2 1 2 3 3 1 0 1 2 3 1 1 2 3 2 2 1 1 1 1 1 1 2 3 3 1 1 1 1 2 2 2 3 2 2 2 1 2 2 2 2 2 1 3 3 4 3 2 1 1 2 2 2 2 2 2 3 2 2 3 2 2 4 3 3 2
-23 2 1 1 2 3 2 2 0 0 2 1 2 1 0 1 0 1 2 2 2 1 0 0 1 1 1 1 2 2 2 2 2 1 1 1 1 2 1 1 0 0 1 1 1 2 2 0 2 2 1 1 2 3 2 2 3 2 2 2 2 1 1 2 2 2 2 1 2 2 2 1 2 2
-30 2 3 3 2 2 2 1 1 1 2 2 1 1 1 1 0 0 1 1 2 2 2 2 2 2 2 2 1 1 2 3 2 1 1 2 1 2 2 1 1 1 0 0 0 0 1 2 2 2 1 1 0 2 2 1 1 1 2 2 2 1 2 2 2 2 2 1 2 2 1 1 2 2
-37 2 2 3 2 2 1 1 2 1 0 1 1 2 2 1 1 3 2 2 3 3 2 0 0 1 0 0 1 1 2 1 1 1 1 2 2 3 2 1 0 2 2 1 2 2 1 1 1 1 1 2 1 1 3 2 1 1 1 1 1 1 0 0 1 2 2 2 1 2 3 2 0 1
-43 1 1 2 3 4 2 2 2 2 2 1 1 1 2 1 2 2 1 2 2 1 2 2 2 1 0 1 1 1 3 3 3 1 1 1 1 2 1 1 1 1 2 2 2 2 3 3 3 2 1 1 3 3 2 1 2 2 2 1 1 1 0 0 0 0 1 1 1 2 3 2 2 2
-50 2 2 1 1 2 2 1 1 0 2 3 3 2 2 2 2 2 2 1 2 2 1 1 1 2 3 2 2 2 2 2 3 2 1 2 1 2 1 1 1 1 2 2 2 2 2 2 2 1 1 1 0 1 1 1 2 2 1 2 1 1 1 1 1 1 0 1 3 2 1 0 1 1
-56A%%Jj%J%jJ%J%%%%J%jkJJjJj%JjJ%jJjjJJJ%%kJ%%%%kJJj%J%j%JjJ%j%jJJjjJJjkJ%%J
-63Bj%jJ%%%%%%%%%%%J%j%jJKj%%%j%Jj%jJJj%%%%jLjj%J%%JjJ%jj%JJ%kj%JJJj%K%kj%%J
-69BjJ%%Kkj%JkJJJj%j%Jj%J%%%jJj%%JjJ%%%J%j%Jjj%jJJJk%%JJj%%%jkJ%JJjj%JK%Jjj%
-76B%%%%j%%%%%%%j%%%K%j%%%%jK%%%kjJKKk%%%%JjjJ%%%j%%J%%%%j%jKj%JkJJ%J%%j%%jJ
-82B%%J%j%JkJ%j%jK%j%JJj%J%jkJkK%JjJ%kJ%jJjK%j%J%j%JJj%%%jJ%jJ%%%%jj%%KJj%Kj
-89CjKjj%%%%jjJ%%K%%%jJjkJJ%JJ%k%%j%%jJ%%J%j%%J%%J%Jkj%%%%Jj%J%j%j%J%Jj%Jj%J
-95B%%%%kj%JJjJ%JJ%k%J%%jJ%%j%%%%J%jJjJ%%%JJk%j%jJJ%JjJ%kjJJ%j%JjJjj%%jJKjJ%
-102B%%j%%%%%%%%jJ%Jj%%J%J%%%jj%%%JJ%%%%%jjkJJJjj%JJJj%j%%%j%J%kKJjJ%%jJ%%%%
$$ plain form
-56 1 1 1 2 1 1 2 2 1 2 2 3 3 3 3 3 4 4 3 1 2 3 2 3 2 2 3 2 3 3 2 3 2 1 2 3 4 4 4 2 3 3 3 3 3 1 2 3 2 2 3 3 2 2 3 2 3 3 2 2 1 2 3 2 1 2 3 2 0 1 1 1 2
-63 2 1 1 0 1 1 1 1 1 1 1 1 1 1 1 1 2 2 1 1 0 1 3 2 2 2 2 1 1 2 1 1 0 1 2 1 1 1 1 1 0 3 2 1 1 2 2 2 3 2 3 3 2 1 1 2 3 3 1 0 0 1 2 3 2 2 4 4 2 1 1 1 2
-69 2 1 2 2 2 4 2 1 1 2 0 1 2 3 2 2 1 1 2 1 1 2 2 2 2 1 2 1 1 1 2 1 2 2 2 2 3 3 2 2 3 2 1 1 0 1 2 3 1 1 1 2 3 2 2 2 2 1 -1 0 0 1 2 1 0 0 1 3 3 4 3 2 2
-76 2 2 2 2 2 1 1 1 1 1 1 1 1 0 0 0 0 2 2 1 1 1 1 1 0 2 2 2 2 0 -1 0 2 4 2 2 2 2 2 3 2 1 2 2 2 2 1 1 1 2 2 2 2 2 1 1 0 2 1 1 2 0 1 2 2 3 3 3 2 2 2 1 2
-82 2 2 2 3 3 2 2 3 1 2 2 1 1 0 2 2 1 1 2 3 2 2 3 3 2 0 1 -1 1 1 2 1 2 2 0 1 1 0 1 0 2 2 1 1 2 2 1 1 2 3 2 2 2 2 1 2 2 1 2 2 2 2 2 1 0 0 0 2 3 2 2 4 3
-89 3 2 4 3 2 2 2 2 2 1 0 1 1 1 3 3 3 3 2 3 2 0 1 2 2 3 4 4 2 2 2 1 1 1 0 1 1 1 2 2 1 1 1 2 2 2 3 3 4 2 1 1 1 1 1 2 1 1 2 2 1 1 0 0 1 1 2 1 1 2 1 1 2
-95 2 2 2 2 2 0 -1 -1 0 1 0 1 1 2 3 3 1 1 2 2 2 1 2 2 2 1 1 1 1 1 2 2 1 2 1 2 2 2 2 3 4 2 2 1 1 0 1 2 2 3 2 3 3 1 0 1 2 2 1 1 2 1 2 1 0 0 0 -1 0 2 1 2 2
-102 2 2 2 1 1 1 1 1 1 1 1 1 0 1 1 2 1 1 1 2 2 3 3 3 3 2 1 1 1 1 2 3 3 3 3 3 3 2 1 -1 0 1 2 1 0 0 1 2 3 2 2 1 1 1 1 0 0 1 1 -1 1 2 1 2 2 2 1 2 2 2 2 2
-108BjJJ%%j%%J%j%kJ%%J%%j%%J%j%%JJ%jjJ%%%jjJJJjJj%%%J%jjJJj%%%%Kjk%K%%%jJ%%%
-115C%%%kJJjj%%Jj%Jk%K%jj%K%J%kJ%jjJ%%%%Jj%JJjJ%%%%jj%%%%J%%%J%%j%%j%%%J%JJj
-121CjjJ%%%%%%jJ%%j%%%J%%j%%J%jJ%jjJJJj%%JJ%j%jj%jJ%%%%J%j%%JJj%jJJ%jjj%JJjJ
-128B%j%J%%%%%j%J%J%j%%%%%%k%J%%JJ%%j%jj%J%jJJjj%%J%%%J%j%%j%J%jJJ%Jjj%jjJJJ
-134BJJk%J%%%k%J%%%%jjJ%J%KjjjjK%j%%jJ%%Jj%J%%%j%J%j%J%%j%%jJ%%%J%%J%jJkJ%Jj
-141BjJJjjjJ%J%%%Jj%%j%%%J%%%jjK%%J%%%jjjKJj%%%%J%j%%J%%jj%Jj%KjJ%%jj%JJ%Jjj
-147B%jjJJ%%JJjjjjK%jjJJJk%%%j%KJ%jj%%%J%jJj%J%%%%jJ%%jjJJJJk%%j%%Jj%%jKJ%k%
-153AJ%j%JjJ%jJJj%%%%%Jk%jJKJjj%%j%%%%%%%%j%J%%%J%J%jJJjkJJjjJ%%%j%%%J%%j%Jj
$$ plain form
-108 2 1 2 3 3 3 2 2 2 3 3 2 2 0 1 1 1 2 2 2 1 1 1 2 2 1 1 1 2 3 3 2 1 2 2 2 2 1 0 1 2 3 2 3 2 2 2 2 3 3 2 1 2 3 2 2 2 2 2 4 3 1 1 3 3 3 3 2 3 3 3 3
-115 3 3 3 3 1 2 3 2 1 1 1 2 1 1 2 0 0 2 2 1 0 0 2 2 3 3 1 2 2 1 0 1 1 1 1 1 2 1 1 2 3 2 3 3 3 3 3 2 1 1 1 1 1 2 2 2 2 3 3 3 2 2 2 1 1 1 1 2 2 3 4 3
-121 3 2 1 2 2 2 2 2 2 2 1 2 2 2 1 1 1 1 2 2 2 1 1 1 2 2 1 2 2 1 0 1 2 3 2 2 2 3 4 4 3 3 2 1 1 0 1 1 1 1 1 2 2 1 1 1 2 3 2 2 1 2 3 3 2 1 0 0 1 2 1 2
-128 2 2 1 1 2 2 2 2 2 2 1 1 2 2 3 3 2 2 2 2 2 2 2 0 0 1 1 1 2 3 3 3 2 2 1 0 0 1 1 0 1 2 1 0 0 0 1 1 1 1 2 2 1 1 1 0 0 1 1 0 1 2 2 3 2 1 1 0 -1 0 1 2
-134 2 3 4 2 2 3 3 3 3 1 1 2 2 2 2 2 1 0 1 1 2 2 4 3 2 1 0 2 2 1 1 1 0 1 1 1 2 1 1 2 2 2 2 1 1 2 2 1 1 2 2 2 1 1 1 0 1 1 1 1 2 2 2 3 3 2 3 1 2 2 3 2
-141 2 1 2 3 2 1 0 1 1 2 2 2 2 3 2 2 2 1 1 1 1 2 2 2 2 1 0 2 2 2 3 3 3 3 2 1 0 2 3 2 2 2 2 2 3 3 2 2 2 3 3 3 2 1 1 2 1 1 3 2 3 3 3 2 1 1 2 3 3 4 3 2
-147 2 2 1 0 1 2 2 2 3 4 3 2 1 0 2 2 1 0 1 2 3 1 1 1 1 0 0 2 3 3 2 1 1 1 1 2 2 1 2 1 1 2 2 2 2 2 1 2 2 2 1 0 1 2 3 4 2 2 2 1 1 1 2 1 1 1 0 2 3 3 1 1
-153 1 2 2 1 1 2 1 2 2 1 2 3 2 2 2 2 2 2 3 1 1 0 1 3 4 3 2 2 2 1 1 1 1 1 1 1 1 1 0 0 1 1 1 1 2 2 3 3 2 3 4 3 1 2 3 2 1 2 2 2 2 1 1 1 1 2 2 2 1 1 2 1
-160A%J%%%%%jjJJj%%%%%jJJ%%%%jjJjJ%%%JjjJjJKj%%jJ%%%%j%J%%%jJjjJJ%kJJjjJ%%%%
-166AJJjjJJj%jJjjJJjJj%%%%JJ%%k%%%%%Jk%J%%%J%jJj%%%jJ%%%%jJ%%%%J%%jJj%%%%J%J
-173CjjJ%%jJJjj%JJj%J%k%%JJ%Jjj%Jk%KjJJ%jjjJjJJ%jJ%j%J%%%jJj%Jj%%%%jjJjJ%jKj
-179AkJ%%jK%J%%kj%KJ%%jJjjJ%JJj%j%%jK%%%%jJj%J%j%%J%%jJj%JJJ%jj%%kL%%%jj%%%J
-186BJjj%K%%%l%JJj%%%%JjJ%%jjJjJJj%jJ%j%J%J%%J%%%jj%J%%%j%Jj%Jj%%Jjj%K%J%jjJ
-192BjJ%Jjj%JJj%jJj%Jj%%J%j%%j%JKj%J%%jjJJjJj%%%jJj%J%jJ%%JJk%%%%%Jj%jkJJ%%%
-199A%JJjjJ%%j%JJ%j%%%%%%%j%JJ%jjJjJ%%%jKj%K%jkJjjKj%%%KjjJ%j%j%%JJj%J%%jJjJ
-205B%%%%%jJ%Jj%j%%%%%J%j%JjjK%%%%j%K%%jjjJ%%%JKjjJj%jj%%J%j%JJ%j%j%%JJ%%%%%
$$ plain form
-160 1 1 2 2 2 2 2 2 1 0 1 2 1 1 1 1 1 1 0 1 2 2 2 2 2 1 0 1 0 1 1 1 1 2 1 0 1 0 1 3 2 2 2 1 2 2 2 2 2 1 1 2 2 2 2 1 2 1 0 1 2 2 0 1 2 1 0 1 1 1 1 1
-166 1 2 3 2 1 2 3 2 2 1 2 1 0 1 2 1 2 1 1 1 1 1 2 3 3 3 1 1 1 1 1 1 2 0 0 1 1 1 1 2 2 1 2 1 1 1 1 0 1 1 1 1 1 0 1 1 1 1 1 2 2 2 1 2 1 1 1 1 1 2 2 3
-173 3 2 1 2 2 2 1 2 3 2 1 1 2 3 2 2 3 3 1 1 1 2 3 3 4 3 2 2 3 1 1 3 2 3 4 4 3 2 1 2 1 2 3 3 2 3 3 2 2 3 3 3 3 2 3 2 2 3 2 2 2 2 2 1 0 1 0 1 1 0 2 1
-179 1 -1 0 0 0 -1 1 1 2 2 2 0 -1 -1 1 2 2 2 1 2 1 0 1 1 2 3 2 2 1 1 1 0 2 2 2 2 2 1 2 1 1 2 2 1 1 1 2 2 2 1 2 1 1 2 3 4 4 3 2 2 2 0 3 3 3 3 2 1 1 1 1 2
-186 2 3 2 1 1 3 3 3 3 0 0 1 2 1 1 1 1 1 2 1 2 2 2 1 0 1 0 1 2 1 1 0 1 1 0 0 1 1 2 2 2 3 3 3 3 2 1 1 2 2 2 2 1 1 2 1 1 2 1 1 1 2 1 0 0 2 2 3 3 2 1 2
-192 2 1 2 2 3 2 1 1 2 3 2 2 1 2 1 1 2 1 1 1 2 2 1 1 1 0 0 1 3 2 2 3 3 3 2 1 2 3 2 3 2 2 2 2 1 2 1 1 2 2 1 2 2 2 3 4 2 2 2 2 2 2 3 2 2 1 -1 0 1 1 1 1
-199 1 1 2 3 2 1 2 2 2 1 1 2 3 3 2 2 2 2 2 2 2 2 1 1 2 3 3 2 1 2 1 2 2 2 2 1 3 2 2 4 4 3 1 2 1 0 2 1 1 1 1 3 2 1 2 2 1 1 0 0 0 1 2 1 1 2 2 2 1 2 1 2
-205 2 2 2 2 2 2 1 2 2 3 2 2 1 1 1 1 1 1 2 2 1 1 2 1 0 2 2 2 2 2 1 1 3 3 3 2 1 0 1 1 1 1 2 4 3 2 3 2 2 1 0 0 0 1 1 0 0 1 2 2 1 1 0 0 0 1 2 2 2 2 2 2
-212BJj%k%JjJ%%J%jj%%K%j%K%k%%%JjJJj%j%JjjJJ%%jjJJ%%%%jJJj%k%J%%J%%%jjJ%%Jj%
-218AjJKj%%kK%jjJJ%%%%%j%%%%%JjJJj%J%jjJkJKJk%%J%k%%%%J%jJ%jjJJ%jJ%%jJJ%JjjJ
-224C%jj%jJ%%%J%%%%Jj%%Jk%Kj%%%%%%%JJ%kj%J%jJ%%J%j%%%Jj%Jjj%%%jK%%%jJ%%%jJ%%
-231B%j%%Jj%Jj%JjjJ%%%%J%j%%J%%kjJK%%jJJkJ%%%JkJ%%jjK%%%%JjJJjlJJj%J%%%j%J%%
-237B%%jjK%j%Jj%JjJJ%j%jkJJKj%Jjk%JJjjJ%%%%%%%K%jjJJ%jjj%JjJJ%%%j%%%%JjJJ%jj
-244AJJ%jJ%j%jJj%Jj%jJ%%Kk%JJk%Jj%%%%J%%%%j%Jj%JjJ%%%jJJj%jJ%j%%%J%%jJ%k%JKj
-250BjJ%%%j%%J%%%JjJkjK%jJ%%Jk%J%%%%%%j%%J%%%%%j%%j%K%Kjj%%j%j%Jj%J%J%kJ%J%j
-257AjJJ%%%%%%%%%jj%JJ%%%j%%J%%%%jjJ%KJjk%%j%JJj%j%J%%jJJjJj%Kj%J%k%%K%jkjK%
$$ plain form
-212 2 3 2 2 0 0 1 0 1 1 1 2 2 1 0 0 0 2 2 1 1 3 3 1 1 1 1 2 1 2 3 2 2 1 1 2 1 0 1 2 2 2 1 0 1 2 2 2 2 2 1 2 3 2 2 0 0 1 1 1 2 2 2 2 1 0 1 1 1 2 1 1
-218 1 0 1 3 2 2 2 0 2 2 1 0 1 2 2 2 2 2 2 1 1 1 1 1 1 2 1 2 3 2 2 3 3 2 1 2 0 1 3 4 2 2 2 3 3 1 1 1 1 1 2 2 1 2 2 1 0 1 2 2 1 2 2 2 1 2 3 3 4 3 2 3
-224 3 3 2 1 1 0 1 1 1 1 2 2 2 2 2 3 2 2 2 3 1 1 3 2 2 2 2 2 2 2 2 3 4 4 2 1 1 2 2 1 2 2 2 3 3 2 2 2 2 3 2 2 3 2 1 1 1 1 0 2 2 2 2 1 2 2 2 2 1 2 2 2
-231 2 2 1 1 1 2 1 1 2 1 1 2 1 0 1 1 1 1 1 2 2 1 1 1 2 2 2 0 -1 0 2 2 2 1 2 3 1 2 2 2 2 3 1 2 2 2 1 0 2 2 2 2 2 3 2 3 4 3 0 1 2 1 1 2 2 2 2 1 1 2 2 2
-237 2 2 2 1 0 2 2 1 1 2 1 1 2 1 2 3 3 2 2 1 -1 0 1 3 2 2 3 2 0 0 1 2 1 0 1 1 1 1 1 1 1 1 3 3 2 1 2 3 3 2 1 0 0 1 0 1 2 2 2 2 1 1 1 1 1 2 1 2 3 3 2 1
-244 1 2 3 3 2 3 3 2 2 1 2 1 1 2 1 1 0 1 1 1 3 1 1 2 3 1 1 2 1 1 1 1 1 2 2 2 2 2 1 1 2 1 1 2 1 2 2 2 2 1 2 3 2 2 1 2 2 1 1 1 1 2 2 2 1 2 2 0 0 1 3 2
-250 2 1 2 2 2 2 1 1 1 2 2 2 2 3 2 3 1 0 2 2 1 2 2 2 3 1 1 2 2 2 2 2 2 2 1 1 1 2 2 2 2 2 2 1 1 1 0 0 2 2 4 3 2 2 2 1 1 0 0 1 0 0 1 1 2 2 0 1 1 2 2 1
-257 1 0 1 2 2 2 2 2 2 2 2 2 2 1 0 0 1 2 2 2 2 1 1 1 2 2 2 2 2 1 0 1 1 3 4 3 1 1 1 0 0 1 2 1 1 0 0 1 1 1 0 1 2 1 2 1 1 3 2 2 3 3 1 1 1 3 3 2 0 -1 1 1
-263A%%%%jK%%j%%%%%%%%%JkK%j%J%%j%%j%J%%%Jj%Kjj%%%J%jJj%KkjJK%j%k%K%j%J%j%J%
-270BjJ%j%%%%J%Jjj%%J%kJJ%%J%%Jjj%%%%%%%%%Jj%%jJJkjJ%jJJ%%j%%J%j%%KjJJkjJJ%%
-276Cj%jj%Jj%KJ%Jjjj%%%JJ%%jjJ%%%jJ%%jJj%%%J%%%%%KkJjjJ%%J%j%kK%jJJ%jjJj%%J%
-282BjJjJJjJ%kjJjJ%%JJjj%%%jK%j%%%%%J%%jj%JJJ%jjjJ%J%j%%jjJK%jKj%%%Jj%J%j%j%
-289AJJjjJ%%j%JJjj%K%%%Jk%Jk%Jj%%%J%%%%%%%JjjJJjj%%Kj%%%%jJ%%%%jJJ%jj%J%%%%%
-295BJjj%%JjjJ%%J%%%%j%K%j%%jKj%j%%jK%%jJ%jJ%j%%j%KjJ%%j%%J%j%Jj%JkKKk%%%%%j
-302A%J%%%J%k%%jJ%%JjK%%J%jj%%%%%Jj%j%K%j%j%%JjjJ%J%jJj%J%%%Jj%%JJ%%k%%J%Jj%
-308Cj%jJ%%%K%jj%%jJ%%j%%%J%JjjJ%Jj%%kJ%%j%jK%%jKjjJJ%%jJ%%JjJ%jj%J%j%J%jJ%%
$$ plain form
-263 1 1 1 1 1 0 2 2 2 1 1 1 1 1 1 1 1 1 1 2 0 2 2 1 1 2 2 2 1 1 1 0 0 1 1 1 1 2 1 1 3 2 1 1 1 1 2 2 1 2 1 1 3 1 0 1 3 3 2 2 0 0 2 2 1 1 2 2 1 1 2 2
-270 2 1 2 2 1 1 1 1 1 2 2 3 2 1 1 1 2 2 0 1 2 2 2 3 3 3 4 3 2 2 2 2 2 2 2 2 2 2 3 2 2 2 1 2 3 1 0 1 1 0 1 2 2 2 1 1 1 2 2 1 1 1 3 2 3 4 2 1 2 3 3 3
-276 3 2 2 1 0 0 1 0 0 2 3 3 4 3 2 1 1 1 1 2 3 3 3 2 1 2 2 2 2 1 2 2 2 1 2 1 1 1 1 2 2 2 2 2 2 4 2 3 2 1 2 2 2 3 3 2 2 0 2 2 1 2 3 3 2 1 2 1 1 1 2 2
-282 2 1 2 1 2 3 2 3 3 1 0 1 0 1 1 1 2 3 2 1 1 1 1 0 2 2 1 1 1 1 1 1 2 2 2 1 0 0 1 2 3 3 2 1 0 1 1 2 2 1 1 1 0 -1 0 2 2 1 3 2 2 2 2 3 2 2 3 3 2 2 1 1
-289 1 2 3 2 1 2 2 2 1 1 2 3 2 1 1 3 3 3 3 4 2 2 3 1 1 2 1 1 1 1 2 2 2 2 2 2 2 2 3 2 1 2 3 2 1 1 1 3 2 2 2 2 2 1 2 2 2 2 2 1 2 3 3 2 1 1 2 2 2 2 2 2
-295 2 3 2 1 1 1 2 1 0 1 1 1 2 2 2 2 2 1 1 3 3 2 2 2 1 3 2 2 1 1 1 0 2 2 2 1 2 2 1 2 2 1 1 1 0 0 2 1 2 2 2 1 1 1 2 2 1 1 2 1 1 2 0 2 4 2 2 2 2 2 2 1
-302 1 1 2 2 2 2 3 3 1 1 1 0 1 1 1 2 1 3 3 3 4 4 3 2 2 2 2 2 2 3 2 2 1 1 3 3 2 2 1 1 1 2 1 0 1 1 2 2 1 2 1 1 2 2 2 2 3 2 2 2 3 4 4 4 2 2 2 3 3 4 3 3
-308 3 2 2 1 2 2 2 2 4 4 3 2 2 2 1 2 2 2 1 1 1 1 2 2 3 2 1 2 2 3 2 2 2 0 1 1 1 0 0 -1 1 1 1 0 2 1 0 1 2 2 2 1 2 2 2 3 2 3 3 2 1 1 2 2 1 1 2 2 1 2 2 2
-315B%j%Jj%jJKJkjj%%jK%K%%jJ%k%Jj%J%jJ%J%k%%%%%Jj%JjJ%%%J%kJ%%j%%%%JJ%jj%j%%
-321@JJ%j%%%jJJ%jjKJjJj%%kKJj%j%JJ%%j%%j%J%%%%Jj%%%jJJj%j%%%J%%j%%J%%%%%%%%j
-328A%j%J%%J%%%%jj%Kj%%%%J%%%%%jJjKj%j%J%%%%Jk%jJj%K%%%%%%%jJ%%%kjKJjJ%JjjJ%
-334B%%%%jjJJ%j%%Jj%%J%j%J%JjkJJj%J%jJjJ%jJ%j%Kj%k%%%JJ%%%jJJkjJJ%%jJjjKJj%%
-341BJjJj%%%j%%%%j%%J%%%J%%%jKjjJ%%%%%%%J%%lJJjJjJ%J%J%jjJjjJJ%j%%jJJj%%%%J%
-347C%%Jk%%%kJJk%K%j%Jj%j%K%jJ%j%JjJJ%jjJ%%%jJ%jK%j%%%jJJj%%%%j%%%%%j%%JJ%j%
-353A%jJ%%Jj%J%JjkJJj%JjJ%jJ%Jjj%%%%%%J%%%jKjj%%%JjjJ%%J%J%%jJj%j%JJJ%j%jjJ%
-360B%%%%KkkJ%%J%%%%%kJJ%Jj%%jJJjJj%%j%JJ%j%%%jJ%%%%Jk%JJ%kjKJjjJjKjjjJ%%%%%
$$ plain form
-315 2 2 1 1 2 1 1 0 1 3 4 2 1 0 0 0 -1 1 1 3 3 3 2 3 3 1 1 2 1 1 2 2 1 2 2 3 3 1 1 1 1 1 1 2 1 1 2 1 2 2 2 2 3 3 1 2 2 2 1 1 1 1 1 2 3 3 2 1 1 0 0 0
-321 0 1 2 2 1 1 1 1 0 1 2 2 1 0 2 3 2 3 2 2 2 0 2 3 2 2 1 1 2 3 3 3 2 2 2 1 1 2 2 2 2 2 3 2 2 2 2 1 2 3 2 2 1 1 1 1 2 2 2 1 1 1 2 2 2 2 2 2 2 2 2 1
-328 1 1 0 0 1 1 1 2 2 2 2 2 1 0 0 2 1 1 1 1 1 2 2 2 2 2 2 1 2 1 3 2 2 1 1 2 2 2 2 2 3 1 1 0 1 0 0 2 2 2 2 2 2 2 2 1 2 2 2 2 0 -1 1 2 1 2 2 3 2 1 2 2
-334 2 2 2 2 2 1 0 1 2 2 1 1 1 2 1 1 1 2 2 1 1 2 2 3 2 0 1 2 1 1 2 2 1 2 1 2 2 1 2 2 1 1 3 2 2 0 0 0 0 1 2 2 2 2 1 2 3 1 0 1 2 2 2 1 2 1 0 2 3 2 2 2
-341 2 3 2 3 2 2 2 2 1 1 1 1 1 0 0 0 1 1 1 1 2 2 2 2 1 3 2 1 2 2 2 2 2 2 2 2 3 3 3 0 1 2 1 2 1 2 2 3 3 4 4 3 2 3 2 1 2 3 3 2 2 2 1 2 3 2 2 2 2 2 3 3
-347 3 3 3 4 2 2 2 2 0 1 2 0 0 2 2 1 1 2 1 1 0 0 2 2 1 2 2 1 1 2 1 2 3 3 2 1 2 2 2 2 1 2 2 1 3 3 2 2 2 2 1 2 3 2 2 2 2 2 1 1 1 1 1 1 0 0 0 1 2 2 1 1
-353 1 1 0 1 1 1 2 1 1 2 2 3 2 0 1 2 1 1 2 1 2 2 1 2 2 3 2 1 1 1 1 1 1 1 2 2 2 2 1 3 2 1 1 1 1 2 1 0 1 1 1 2 2 3 3 3 2 3 2 2 1 1 2 3 4 4 3 3 2 1 2 2
-360 2 2 2 2 2 4 2 0 1 1 1 2 2 2 2 2 2 0 1 2 2 3 2 2 2 1 2 3 2 3 2 2 2 1 1 2 3 3 2 2 2 2 1 2 2 2 2 2 3 1 1 2 3 3 1 0 2 3 2 1 2 1 3 2 1 0 1 1 1 1 1 1
-366A%%jJ%%%%J%%%%%jJJjjJ%j%%%%%J%%j%%J%%%jjJ%%Jj%Kjj%Jj%J%%%%j%Jj%J%%Jj%%%%
-373B%jJ%%JjjJJ%j%%jJ%J%%Jkj%J%jJjJ%j%%%jJ%%%JjJ%j%j%J%%%%%JJkJ%%%%%%%j%Jj%J
-379B%%%jJ%%%%%j%%J%jJ%jJ%Kkj%%%Jj%KjjJj%J%%J%k%J%j%J%%J%j%j%%Jj%%J%j%jLJ%j%
-386Cj%JJ%ljJ%J%jJjjJJj%Kkj%J%J%%%Jjjj%%%%%%J%J%JjJj%Kj%jJ%j%%j%JjjJ%j%KJ%kJ
-392B%%%%J%j%%kJJ%%j%jJ%%J%jJjJj%jJJ%j%%%%JJj%%%%j%J%j%JJJ%j%kJ%%J%jkJ%%%%%J
$$ plain form
-366 1 1 1 0 1 1 1 1 1 2 2 2 2 2 2 1 2 3 2 1 2 2 1 1 1 1 1 1 2 2 2 1 1 1 2 2 2 2 1 0 1 1 1 2 1 1 3 2 1 1 2 1 1 2 2 2 2 2 1 1 2 1 1 2 2 2 3 2 2 2 2 2
-373 2 2 1 2 2 2 3 2 1 2 3 3 2 2 2 1 2 2 3 3 3 4 2 1 1 2 2 1 2 1 2 2 1 1 1 1 0 1 1 1 1 2 1 2 2 1 1 0 0 1 1 1 1 1 1 2 3 1 2 2 2 2 2 2 2 2 1 1 2 1 1 2
-379 2 2 2 2 1 2 2 2 2 2 2 1 1 1 2 2 1 2 2 1 2 2 4 2 1 1 1 1 2 1 1 3 2 1 2 1 1 2 2 2 3 3 1 1 2 2 1 1 2 2 2 3 3 2 2 1 1 1 2 1 1 1 2 2 1 1 0 3 4 4 3 3
-386 3 2 2 3 4 4 1 0 1 1 2 2 1 2 1 0 1 2 1 1 3 1 0 0 1 1 2 2 2 2 3 2 1 0 0 0 0 0 0 0 1 1 2 2 3 2 3 2 2 4 3 3 2 3 3 2 2 2 1 1 2 1 0 1 1 0 0 2 3 3 1 2
-392 2 2 2 2 2 3 3 2 2 2 0 1 2 2 2 1 1 0 1 1 1 2 2 1 2 1 2 1 1 0 1 2 2 1 1 1 1 1 2 3 2 2 2 2 2 1 1 2 2 1 1 2 3 4 4 3 3 1 2 2 2 3 3 2 0 1 1 1 1 1 1 2
$$ [...]
-3523A
##END=		$$ NMR SPECTRUM
##END=		$$ LINK
