##TITLE=	Aug01-2022-lemw22.30.fid
LW234

##JCAMP-DX=	6.0	$$ MestReNova 14.1.0-24037
##DATA TYPE=	LINK
##BLOCK_ID=	1
##BLOCKS=	1    
##ORIGIN=	Mestrelab Research S.L.
##OWNER=	hrzepa
##$MNOVA/LINK_BLOCK_TYPE=	ITEM	$$ NMR Spectrum
##$MNOVA/ITEM/POLYGON=	(XY..XY)
5321,5835
8722,5835
8722,8208
5321,8208
5321,5835
##$MNOVA/ITEM/Z=	0
##$MNOVA/ITEM/ANGLE=	0
##TITLE=	Aug01-2022-lemw22.30.fid
##JCAMP-DX=	6.0	$$ MestReNova 14.1.0-24037
##BLOCK_ID=	2
##DATA TYPE=	NMR SPECTRUM
##DATA CLASS=	XYDATA
##NUMDIM=	1
##ORIGIN=	Bruker BioSpin GmbH
##OWNER=	nmr
##.OBSERVE FREQUENCY=	100.6288641350000006
##.OBSERVE NUCLEUS=	^13C
##.SOLVENT NAME=	Acetone
##.PULSE SEQUENCE=	zgpg30
##LONGDATE=	2022/08/01 12:09:40.000
##.ACQUISITIONMODE=	SIMULTANEOUS (DQD)
##$ORIGINAL FORMAT=	Bruker XWIN-NMR
##$MNOVA/SCALES_VERSION=	8
##$PARAMETER FILE=	(acqus, ASCII, /var/folders/f6/rjf_tdyn2v98c5c0wvkgn4s80000gq/T/A6LJBgEsSumnRmbxLmWT2w/13C/acqus, 0)
$$ ##TITLE= Parameter file, TopSpin 4.1.1
$$ ##JCAMPDX= 5.0
$$ ##DATATYPE= Parameter Values
$$ ##NPOINTS= 8	$$ modification sequence number
$$ ##ORIGIN= Bruker BioSpin GmbH
$$ ##OWNER= nmr
$$ $$ 2022-08-01 12:09:04.593 +0100  nmr@chpc-nmr400a
$$ $$ D:/data/lemw22/nmr/Aug01-2022-lemw22/30/acqus
$$ $$ process C:\Bruker\TopSpin4.1.1\prog\mod\xwish3.exe
$$ ##$ACQT0= -1.70581753891579
$$ ##$AMP= (0..31)
$$ 100 100 100 100 100 100 100 100 100 100 100 100 100 100 100 100 100 100
$$ 100 100 100 100 100 100 100 100 100 100 100 100 100 100
$$ ##$AMPCOIL= (0..32)
$$ -1 0 0 0 0 0 0 0 0 0 0 0 0 0 0 0 0 0 0 0 0 0 0 0 0 0 0 0 0 0 0 0 0
$$ ##$AQSEQ= 0
$$ ##$AQ_mod= 3
$$ ##$AUNM= <au_zg>
$$ ##$AUTOPOS= <6 >
$$ ##$BF1= 100.61779753
$$ ##$BF2= 400.15
$$ ##$BF3= 100.61779753
$$ ##$BF4= 100.61779753
$$ ##$BF5= 100.61779753
$$ ##$BF6= 100.61779753
$$ ##$BF7= 100.61779753
$$ ##$BF8= 100.61779753
$$ ##$BWFAC= (0..63)
$$ 0 0 0 0 0 0 0 0 0 0 0 0 0 0 0 0 0 0 0 0 0 0 0 0 0 0 0 0 0 0 0 0 0 0 0 0
$$ 0 0 0 0 0 0 0 0 0 0 0 0 0 0 0 0 0 0 0 0 0 0 0 0 0 0 0 0
$$ ##$BYTORDA= 0
$$ ##$CHANFCU= (0..24)
$$ 0 1 2 0 0 0 0 0 0 0 0 0 0 0 0 0 0 0 0 0 0 0 0 0 0
$$ ##$CHANREC= (0..24)
$$ 0 0 0 0 0 0 0 0 0 0 0 0 0 0 0 0 0 0 0 0 0 0 0 0 0
$$ ##$CHEMSTR= <none>
$$ ##$CNST= (0..63)
$$ 1 1 145 1 1 1 1 1 1 1 1 1 1 1 1 1 1 1 1 1 1 1 1 1 1 1 1 1 1 1 1 1 1 1 1
$$ 1 1 1 1 1 1 1 1 1 1 1 1 1 1 1 1 1 1 1 1 1 1 1 1 1 1 1 1 1
$$ ##$CPDPRG= (0..8)
$$ <waltz16> <> <waltz65> <> <mlev> <mlev> <mlev> <mlev> <mlev>
$$ ##$D= (0..63)
$$ 0 1 0.00345 0 0 0 0 0 0 0 0 0.03 2e-05 3e-06 0 0 0.0002 0 0 0 0 0 0 0 0
$$ 0 0 0 0 0 0 0 0 0 0 0 0 0 0 0 0 0 0 0 0 0 0 0 0 0 0 0 0 0 0 0 0 0 0 0 0
$$ 0 0 0
$$ ##$DATE= 1659352180
$$ ##$DATE_START= 1659351721
$$ ##$DE= 8.294183
$$ ##$DECBNUC= <off>
$$ ##$DECIM= 800
$$ ##$DECNUC= <off>
$$ ##$DECSTAT= 4
$$ ##$DIGMOD= 3
$$ ##$DIGTYP= 17
$$ ##$DR= 32
$$ ##$DS= 4
$$ ##$DSPFIRM= 4
$$ ##$DSPFVS= 21
$$ ##$DTYPA= 2
$$ ##$EXP= <Carbon.icon>
$$ ##$ExpStatus= 4
$$ ##$FCUCHAN= (0..9)
$$ 0 1 2 0 0 0 0 0 0 0
$$ ##$FILCOR= 0
$$ ##$FL1= 83
$$ ##$FL2= 83
$$ ##$FL3= 83
$$ ##$FL4= 83
$$ [...]
$$ 1 1 1 1 0 0 0 0 0 0 0 0 0 0 0 0 0 0 0 0 0 0 0 0 0 0 0 0
$$ ##$ShimPowRng3= (0..63)
$$ 1 1 1 1 1 1 1 1 1 1 1 1 1 1 1 1 1 1 1 1 1 1 1 1 1 1 1 1 1 1 1 1 1 1 1 1
$$ 1 1 1 1 0 0 0 0 0 0 0 0 0 0 0 0 0 0 0 0 0 0 0 0 0 0 0 0
$$ ##$ShimPowType1= 8
$$ ##$ShimPowType2= 8
$$ ##$ShimPowType3= 0
$$ ##$ShimPowType4= 0
$$ ##$ShimPowType5= 0
$$ ##$ShimPowType6= 0
$$ ##$ShimPowType7= 0
$$ ##$ShimPowType8= 0
$$ ##$ShimSysActGrad= (0..63)
$$ 1 2 3 4 13 5 7 11 10 9 6 8 12 18 19 20 21 15 22 23 24 14 25 16 26 17 27
$$ 28 31 32 33 34 35 36 37 38 0 0 0 0 0 0 0 0 0 0 0 0 0 0 0 0 0 0 0 0 0 0
$$ 0 0 0 0 0 0
$$ ##$ShimSysAngle= <>
$$ ##$ShimSysFunc= (0..63)
$$ 1 2 3 4 5 6 7 8 9 10 0 37 38 35 16 15 14 13 12 11 28 27 26 25 24 23 36
$$ 22 30 29 20 21 34 33 32 31 17 18 19 0 0 0 0 0 0 0 0 0 0 0 0 0 0 0 0 0 0
$$ 0 0 0 0 0 0 0
$$ ##$ShimSysMatId= <292722aa.dat>
$$ ##$ShimSysMatrix= 1
$$ ##$ShimSysMinMaxUG= 130000
$$ ##$ShimSysOffset= <37mm>
$$ ##$ShimSysType= 4
$$ ##$ShimUnit= 3
$$ ##$SpectrOsVersion= <4.1.148.20201202>
$$ ##$TCubeEth= <192.168.180.22>
$$ ##$TCubeSeqDevice= <>
$$ ##$TOSITY= <no>
$$ ##$TRIPLO2= 0
$$ ##$TopSpinVersion= <TopSpin 4.1.1>
$$ ##$TrxFreqFormula= (0..23)
$$ <TrxFreqFormula(2.0,400150000.000000,'TRX',Trx(1.0,'TRX 1200.1',2,5.000000,1290.000000))>
$$ <TrxFreqFormula(2.0,400150000.000000,'TRX',Trx(1.0,'TRX 1200.2',2,5.000000,1290.000000))>
$$ <> <> <> <> <> <> <> <> <> <> <> <> <> <> <> <> <> <> <> <> <> <>
$$ ##$TrxPN= (0..23)
$$ <Z148391> <Z148391> <> <> <> <> <> <> <> <> <> <> <> <> <> <> <> <> <>
$$ <> <> <> <> <>
$$ ##$TrxSN= (0..23)
$$ <02953> <02954> <> <> <> <> <> <> <> <> <> <> <> <> <> <> <> <> <> <> <>
$$ <> <> <>
$$ ##$VCubeEth= (0..23)
$$ <no> <no> <no> <no> <no> <no> <no> <no> <no> <no> <no> <no> <no> <no> <no>
$$ <no> <no> <no> <no> <no> <no> <no> <no> <no>
$$ ##$VTU= 2
$$ ##$VTUETH= <192.168.99.11>
$$ ##$VTUTY= <no>
$$ ##$ValueLine= no
$$ ##$VpuPN= (0..23)
$$ <no> <no> <no> <no> <no> <no> <no> <no> <no> <no> <no> <no> <no> <no> <no>
$$ <no> <no> <no> <no> <no> <no> <no> <no> <no>
$$ ##$VpuSN= (0..23)
$$ <no> <no> <no> <no> <no> <no> <no> <no> <no> <no> <no> <no> <no> <no> <no>
$$ <no> <no> <no> <no> <no> <no> <no> <no> <no>
$$ ##$WBREFAM= (0..31)
$$ 142.7 107.1 100 100 100 100 100 100 100 100 100 100 100 100 100 100 100
$$ 100 100 100 100 100 100 100 100 100 100 100 100 100 100 100
$$ ##$WBREFLM= (0..31)
$$ 0 0 0 0 0 0 0 0 0 0 0 0 0 0 0 0 0 0 0 0 0 0 0 0 0 0 0 0 0 0 0 0
$$ ##$WBREFPH= (0..31)
$$ 72.61 -67.16 0 0 0 0 0 0 0 0 0 0 0 0 0 0 0 0 0 0 0 0 0 0 0 0 0 0 0 0 0
$$ 0
$$ ##$WBSGU= (0..31)
$$ 2 0 1 0 0 0 0 0 0 0 0 0 0 0 0 0 0 0 0 0 0 0 0 0 0 0 0 0 0 0 0 0
$$ ##END=
$$ 
##$DECIM=	800
##$DSPFVS=	21
##XUNITS=	HZ
##YUNITS=	ARBITRARY UNITS
##FIRSTX=	23566.604999996328843
##LASTX=	-1433.3950000036700203
##DELTAX=	-0.1907363184838751502
##XFACTOR=	1
##YFACTOR=	7.860094837478762031
##FIRSTY=	-234.062255859375
##MINY=	-3518.001953125
##MAXY=	696519.4375
##NPOINTS=	131072
##XYDATA=	(X++(Y..Y))
23567 -29 -54 -46 0 45 66 87 108 129 110 91 72 53 61 70 78 86 59 32 4 -22 -64 -105 -145 -184 -193 -170 -132 -94 -65 -37 -6 -8 -30 -52 -76 -100 -125 -150
23559 -150 -175 -200 -197 -194 -191 -188 -148 -108 -68 -27 -20 -13 -4 -28 -69 -111 -140 -137 -135 -133 -162 -190 -216 -241 -234 -227 -209 -190 -155 -121 -75 -29 -15 -2 -10 -17 -25 -33 -30 -27 -41 -54 -84
23551 -84 -115 -109 -71 -44 -18 -22 -26 -50 -73 -42 -10 12 36 60 83 127 170 181 191 162 133 121 108 102 95 89 83 96 109 90 70 57 45 32 19 2 -13 -16 13
23544 13 39 65 60 56 44 33 22 10 7 5 2 0 -7 -14 11 37 63 89 83 77 75 73 70 68 43 18 -6 -32 -21 -10 0 10 32 55 60 38 -16 -70 -108 -120 -105 -90
23536 -90 -74 -57 -66 -74 -83 -92 -108 -123 -139 -155 -133 -111 -88 -66 -48 -29 -11 6 7 8 -23 -55 -58 -60 -30 0 21 42 46 51 58 65 94 139 164 162 143 125 115 105 128
23528 128 151 154 156 159 161 142 123 104 85 49 14 -21 -56 -43 -30 -17 -4 0 3 -8 -20 10 42 41 40 -2 -45 -89 -132 -125 -118 -112 -105 -93 -81 -54 -27 -9 -18 -44 -70
23520 -70 -73 -75 -47 -18 25 53 50 21 -28 -78 -112 -118 -85 -36 -5 -13 -56 -100 -113 -88 -50 -11 -2 5 -23 -53 -81 -108 -114 -93 -78 -79 -69 -59 -50 -41 -42 -43 -44 -45 -63 -80
23512 -80 -98 -115 -108 -101 -94 -87 -81 -74 -67 -60 -43 -26 -9 7 -13 -34 -55 -76 -86 -96 -107 -117 -111 -105 -99 -93 -90 -86 -82 -79 -91 -104 -115 -126 -119 -84 -56 -43 -20 2 24 46 54 62
23504 62 69 77 69 60 52 43 42 41 25 36 57 78 116 127 98 69 38 7 14 22 29 36 54 71 88 105 83 45 2 -14 0 12 27 43 58 73 88 104 85 66 47
23496 47 28 10 -8 -27 -46 -37 -29 -21 -12 1 14 -23 -61 -74 -49 -12 23 40 57 74 91 83 76 68 61 53 46 38 31 26 21 16 11 6 1 -3 -9 -31 -53 -76 -98 -82 -67 -51 -35
23487 -35 -12 10 31 53 42 3 -28 -44 -44 -44 -43 -42 -68 -94 -120 -146 -132 -119 -105 -91 -50 -9 29 68 72 49 43 37 42 73 87 102 96 63 46 28 9 -10 -29
23480 -29 -49 -28 -7 28 37 23 9 -6 -21 -26 -32 -37 -42 -78 -113 -117 -82 -41 -17 -13 -9 14 38 62 87 90 92 95 98 74 50 27 4 -5 10 26 16 -15 -47 -80 -114
23472 -114 -126 -137 -149 -160 -172 -184 -195 -207 -207 -207 -223 -211 -176 -142 -105 -69 -68 -66 -65 -63 -31 0 -1 -36 -61 -54 -35 -15 -16 -16 -16 -17 -10 -4 2 8 -11 -32 -53 -73 -83 -93
23464 -93 -103 -113 -115 -117 -119 -121 -124 -126 -129 -132 -134 -137 -140 -142 -108 -74 -40 -6 -21 -36 -51 -66 -73 -80 -87 -94 -109 -124 -139 -154 -142 -130 -118 -106 -93 -81 -69 -57 -48 -38 -29 -20 -38 -56
23456 -56 -74 -92 -96 -100 -103 -107 -94 -82 -69 -57 -27 1 28 55 63 37 33 28 25 55 65 74 77 47 35 24 10 -4 -18 -32 -49 -65 -81 -98 -84 -69 -69 -102 -143 -184
23448 -184 -191 -165 -153 -142 -128 -114 -123 -131 -157 -151 -128 -106 -81 -56 -69 -83 -96 -109 -126 -143 -160 -178 -135 -92 -50 -7 18 44 89 100 74 48 19 -8 -51 -94
23441 -94 -101 -76 -51 -25 1 29 25 22 19 15 12 8 5 1 9 17 25 32 40 48 56 64 53 42 12 16 28 40 54 69 62 56 49 43 53 63 70 78 23 -65 -151 -205 -216 -194 -188 -183 -143 -102
23432 -102 -62 -22 -8 4 17 30 4 -22 -46 -71 -76 -48 -39 -29 -30 -32 -33 -34 11 56 118 147 121 61 18 -24 -31 -38 -45 -52 -39 -27 -15 -2 -6 -10 -14 -18 8 35 62
23424 62 89 107 126 145 164 167 171 175 179 182 186 190 194 200 206 212 218 204 190 176 163 171 178 148 91 41 8 3 25 39 53 69 85 105 124 143 163 153 144 134 125 132 138 145 152
23416 152 128 105 81 58 34 11 -12 -36 -33 -30 -28 -25 -31 -36 -42 -47 -53 -59 -80 -73 -34 5 47 88 71 53 37 22 17 39 54 53 41 12 -7 -27 -11 5 22 39 51
23408 51 64 76 88 85 81 77 73 49 26 2 -20 -41 -61 -79 -98 -122 -120 -78 -37 -6 24 55 86 86 86 117 149 187 209 201 166 111 56 39 49 75 101 112 95
23400 95 60 25 -11 -47 -77 -107 -144 -165 -149 -106 -67 -46 -29 -13 1 17 19 20 22 24 -1 -26 -51 -77 -84 -91 -116 -109 -82 -54 -59 -97 -131 -149 -145 -142 -161 -180 -167 -153
23393 -153 -132 -111 -90 -69 -62 -55 -49 -42 -35 -27 -20 -12 -21 -30 -39 -48 -46 -44 -42 -41 -39 -37 -35 -33 -17 -1 12 26 32 5 -46 -114 -181 -216 -224 -216 -222 -228 -233 -239 -254 -270 -283 -297 -279 -228 -205 -166
23383 -166 -120 -74 -28 18 5 -8 -21 -34 -49 -65 -80 -95 -83 -71 -59 -48 -51 -54 -58 -61 -64 -68 -71 -74 -36 1 37 73 80 54 37 36 28 20 13 5 14 24 33 42 9 -22 -55
23375 -55 -88 -104 -120 -137 -153 -120 -88 -55 -22 -16 -11 -5 0 -12 -24 -36 -48 -33 -18 -3 11 -10 -31 -52 -74 -65 -56 -48 -39 -40 -41 -42 -43 -43 -44 -45 -46 -47 -48 -49 -51 -52 -53 -54 -56 -21 13
23366 13 48 83 77 71 65 60 67 74 81 88 95 102 109 116 89 61 33 6 -31 -68 -69 -38 -6 24 57 91 114 137 160 183 150 117 83 50 37 25 -5 -3 15 33 53 73
23358 73 94 114 134 155 151 148 145 141 92 42 -4 -52 -89 -94 -106 -135 -160 -152 -110 -68 -44 -20 2 26 45 64 83 102 85 67 52 37 16 28 31 18 21 40 48
23351 48 57 53 49 45 41 47 53 59 65 80 94 108 122 112 102 91 81 63 44 27 9 11 29 53 51 39 28 16 3 36 70 103 136 124 111 98 85 74 63 51
23343 51 40 48 56 63 71 78 85 91 98 113 128 143 158 165 171 177 183 192 184 147 83 39 11 -27 -66 -67 -68 -68 -69 -48 -26 -5 16 9 3 -3 -9 -24 -38 -21 -4 38 66 47 -8 -93
23334 -93 -178 -231 -246 -238 -215 -188 -178 -157 -135 -115 -94 -82 -69 -40 -38 -54 -53 -40 -10 42 95 111 100 85 87 110 133 148 162 160 131 85 55 58 77 89 74 42
23327 42 11 0 -9 -19 -30 -50 -71 -91 -112 -82 -53 -41 -2 23 12 24 37 53 95 121 146 142 112 98 84 93 130 159 172 159 130 109 88 83 79 74 70 79 88
23320 88 97 106 104 101 99 96 71 46 21 -3 -20 -37 -38 -13 14 14 -20 -55 -87 -91 -72 -26 18 63 76 90 77 63 28 -23 -56 -63 -41 -4 45 79 77 59 43 27
23312 27 9 -7 14 36 58 79 94 93 116 112 77 41 4 -33 -56 -80 -104 -127 -110 -93 -76 -59 -40 -21 -17 13 71 130 190 251 270 290 310 329 310 291
23305 291 271 252 219 186 153 121 132 144 155 166 168 170 187 176 167 158 148 137 101 65 40 0 -36 -34 -55 -76 -48 -20 6 34 73 111 147 183 178 134 112
23298 112 91 60 30 0 -30 13 56 99 142 160 178 196 214 200 186 155 97 24 -48 -89 -93 -82 -72 -59 -46 -31 -16 -1 13 41 70 99 127 119 111 103
23291 103 94 88 81 60 65 103 141 181 221 215 208 202 196 180 165 150 134 129 123 101 106 114 95 84 90 98 106 115 124 141 159 175 191 181 154 121 116 117 118 105 64 6 -36 -50
23283 -50 -37 -1 34 70 107 95 67 64 88 109 102 69 20 -14 -21 -12 -4 -15 -25 -36 -47 -56 -65 -74 -83 -113 -142 -170 -197 -189 -142 -117 -93 -75 -58 -41 -24 -17 -10 -3 3 -5
23275 -5 -13 -54 -94 -134 -159 -154 -121 -49 23 95 167 255 310 325 309 271 234 208 216 238 260 252 244 203 163 124 85 86 120 135 150 165 180 213 213 172 131 88 45
23268 45 47 49 51 53 39 24 12 0 6 45 66 87 110 133 155 178 167 155 143 132 112 92 73 53 49 46 43 40 53 66 77 88 85 50 35 20 12 36 42 49 79
23260 79 109 139 170 175 180 183 186 154 88 44 53 102 151 158 110 58 6 -32 -38 -16 39 76 113 119 93 32 -27 -77 -95 -98 -101 -121 -141 -129 -116 -76 -36 -11 -18 -30
23252 -30 -43 -58 -73 -73 -74 -74 -75 -72 -68 -65 -62 -51 -39 -28 -17 -1 14 30 46 69 93 117 141 124 107 90 73 52 31 27 51 88 126 126 99 53 7 -8 -23 -2
23244 -2 19 41 62 78 93 109 124 99 74 49 24 -7 -40 -79 -102 -77 -13 38 73 101 128 154 179 196 197 169 114 63 29 23 44 79 113 116 120 126 132 159
23237 159 203 243 256 253 249 215 182 148 114 86 57 28 0 -15 -30 -78 -126 -196 -266 -304 -303 -264 -225 -183 -142 -127 -111 -96 -81 -80 -79 -78 -78 -66 -55 -12 30 76
23230 76 106 106 79 51 22 -7 -38 -44 -51 -57 -64 -34 -5 23 53 67 81 127 172 214 229 206 144 85 41 10 -4 -2 0 32 65 85 72 69 82 115 148 183 217
23223 217 202 188 173 158 155 153 148 143 137 98 47 -3 -13 8 12 17 37 58 97 103 70 37 35 33 50 68 85 102 122 143 163 183 219 256 277 265 219 156 93
23215 93 47 29 45 43 41 51 61 71 80 63 29 -13 -23 -29 -34 -38 -41 -36 -32 -27 -22 -15 -9 -2 4 9 14 19 24 50 75 69 62 73 85 97 108 87 67 46 25 5 -15 -34 -52
23206 -52 -45 -5 26 42 58 90 129 136 122 92 60 44 54 64 75 86 102 119 134 95 43 7 -16 -24 -25 -9 30 71 76 81 54 27 0 -26 -72 -84 -30 22
23199 22 62 69 42 -16 -59 -102 -100 -98 -96 -94 -85 -77 -68 -59 -78 -96 -115 -133 -102 -70 -38 -7 32 72 97 90 45 0 -47 -95 -104 -114 -123 -133 -120 -107 -64 -20 28 45 26
23191 26 -25 -59 -39 2 44 37 31 38 79 118 157 196 235 244 221 183 146 101 56 44 32 16 0 -15 -31 -41 -51 -60 -70 -65 -61 -56 -51 -34 -17 -33 -48 -59 -70
23184 -70 -62 -87 -127 -167 -151 -102 -66 -29 6 43 52 29 24 20 49 78 107 137 159 181 171 161 142 124 119 148 181 213 216 218 223 229 198 135 66 -2 -37 -39 -54 -69
23176 -69 -99 -98 -107 -116 -112 -124 -115 -79 -60 -40 -26 -12 0 14 27 40 60 64 34 -22 -65 -108 -114 -121 -128 -134 -123 -111 -100 -89 -75 -62 -48 -35 -17 0 48 96 128 123
23169 123 85 46 28 10 -8 -26 -10 6 22 38 50 62 74 85 113 141 169 197 210 224 237 250 236 221 207 193 168 143 117 92 66 41 16 -9
23162 -9 -15 -21 -28 -34 -13 7 27 48 47 45 32 36 60 57 16 -24 -55 -86 -117 -148 -166 -184 -169 -154 -128 -101 -118 -151 -142 -106 -77 -65 -70 -74 -79 -83 -130 -160 -167 -135 -67 0
23154 0 16 -5 -14 -24 -15 10 25 12 15 19 -15 -49 -81 -113 -112 -77 -61 -45 -13 18 68 85 58 15 -38 -59 -51 -43 -33 -22 -2 18 38 57 67 61 44 60 102
23147 102 128 107 54 -6 -66 -112 -126 -101 -44 -17 -23 -67 -110 -153 -196 -237 -245 -228 -195 -163 -164 -210 -273 -326 -347 -352 -323 -271 -218 -196 -173 -152 -131 -141 -150 -154 -125
23140 -125 -75 -40 -44 -80 -109 -120 -108 -96 -83 -69 -19 30 37 -9 -48 -55 -41 -44 -74 -104 -136 -167 -145 -124 -102 -80 -94 -108 -108 -76 -39 -19 -22 -58 -91 -108 -90
23133 -90 -56 -37 -18 31 82 118 122 89 57 35 13 23 34 44 54 32 10 -22 -54 -32 -11 9 30 51 72 80 88 96 104 78 52 27 1 -46 -95 -150 -190
23126 -190 -208 -193 -153 -97 -52 -40 -64 -121 -155 -155 -112 -52 -11 -3 2 -9 -21 -16 -4 -24 -27 -30 -35 -40 -14 11 35 59 86 81 82 100 97 62 46 30 19 8 13 50
23118 50 117 200 252 249 231 212 211 227 262 264 231 198 168 139 109 80 35 -9 -52 -96 -141 -170 -172 -142 -106 -70 -65 -60 -60 -60 -62 -64 -68 -105 -142 -146 -132 -119 -103 -88 -76
23110 -76 -64 -52 -40 -5 29 81 101 82 46 -3 -69 -130 -159 -153 -146 -125 -103 -82 -60 -84 -108 -130 -152 -167 -150 -151 -151 -134 -117 -99 -82 -70 -57 -45 -33 -4 24
23103 24 52 81 83 86 88 91 127 163 207 234 235 203 144 69 -9 -71 -112 -152 -198 -245 -259 -273 -261 -250 -206 -162 -108 -54 -2 49 82 81 45 9 5 1 -2 -5 -13 -20 -27
23095 -27 -34 -62 -89 -134 -147 -137 -112 -63 -14 4 -9 -48 -103 -130 -124 -94 -47 3 38 49 61 74 71 43 -16 -74 -99 -90 -81 -76 -72 -68 -64 -21 21 71 105 96 54 29
23088 29 5 -21 -48 -74 -101 -100 -99 -95 -91 -56 33 108 149 174 144 92 40 10 34 80 126 133 109 49 -10 -64 -101 -111 -89 -47 -5 5 16 -12 -41 -48 -1 44
23080 44 58 28 -16 -57 -64 -59 -53 -69 -84 -100 -115 -120 -125 -130 -135 -110 -85 -60 -35 -6 22 51 80 68 56 44 32 -21 -76 -130 -185 -212 -238 -263 -233 -160 -86 -45
23073 -45 -36 -34 -32 -31 -31 -27 -24 -20 -16 -13 -9 -5 -2 -6 -11 -16 -20 -19 -18 -16 -15 -37 -58 -102 -161 -185 -176 -133 -89 -54 -20 14 49 55 61 67 73 79 85 79 40 -8 -25 -26 5 43 82 120 159 141
23064 141 91 51 29 27 58 91 90 64 38 9 -18 13 44 76 107 103 100 96 92 83 73 64 54 58 63 65 67 67 35 2 2 4 -10 -11 -12 -5 33 54 75 98 121 145 168
23055 168 137 105 74 43 1 -41 -102 -131 -118 -106 -92 -78 -40 -2 0 -29 -80 -115 -123 -98 -56 18 95 138 136 118 98 94 97 100 103 107 81 54 82 110 166 222
23048 222 262 270 276 250 185 121 82 43 15 -28 -31 -1 9 19 18 16 15 14 17 20 23 27 30 33 36 39 64 89 114 139 151 162 174 185 161 137 113 89 64 39 27 47
23040 47 80 81 47 14 -19 -54 -56 -58 -49 -41 -32 -23 -45 -68 -109 -117 -116 -116 -112 -107 -93 -47 0 13 10 8 4 0 25 51 75 98 101 71 59 48 26 4 -14 -34 -29 9 28 48
23032 48 70 92 114 136 116 97 78 59 81 102 124 146 169 192 213 235 208 149 90 64 73 81 92 103 143 184 221 258 244 176 138 101 79 57 37 17
23025 17 13 42 50 59 65 39 13 19 36 53 72 90 107 124 157 158 122 54 -15 -53 -54 -55 -54 -53 -51 -49 -47 -45 -15 14 61 74 53 -1 -69 -84 -68 -52 -31 -10 13 69
23017 69 107 145 149 154 158 163 119 76 35 -6 -19 0 0 1 5 10 14 19 37 55 73 92 90 89 87 86 85 83 82 80 55 30 23 -16 -73 -130 -186 -243 -226 -176 -145 -114 -80 -47
23009 -47 -14 19 3 -11 -27 -42 -68 -94 -120 -146 -156 -167 -143 -87 -17 19 19 -13 -53 -92 -99 -74 -45 -49 -87 -125 -172 -218 -272 -310 -290 -237 -193 -165 -127 -89
23002 -89 -35 -13 -9 -20 -44 -35 -40 -61 -69 -77 -65 -20 13 30 22 -18 -49 -64 -51 -6 21 50 75 101 124 147 133 86 49 29 27 42 57 56 30 5 -21 -48 -62
22994 -62 -76 -90 -103 -128 -154 -177 -200 -204 -175 -133 -92 -41 -22 -39 -56 -64 -72 -47 -23 -1 20 -11 -44 -68 -91 -101 -78 -36 5 17 28 10 -7 -26 -44 -51 -57
22987 -57 -63 -69 -60 -35 -2 -2 -53 -135 -218 -268 -269 -238 -204 -202 -216 -214 -166 -86 4 79 162 246 291 303 278 219 144 85 73 93 132 172 197 190 137 52 -14 -80 -132
22980 -132 -152 -131 -79 -26 25 56 32 -24 -82 -105 -96 -66 -20 26 58 54 51 46 41 22 4 -14 -33 -66 -100 -164 -228 -286 -312 -298 -251 -178 -104 -65 -59 -67 -91 -116
22972 -116 -125 -137 -133 -92 -34 -2 30 71 95 80 32 -28 -89 -116 -111 -79 -31 7 46 52 24 16 25 55 85 113 142 116 90 51 12 16 75 130 152 142 131 146
22965 146 160 138 84 19 -44 -75 -73 -60 -47 -32 -17 -25 -34 -43 -51 -50 -49 -48 -47 -55 -63 -60 -73 -80 -54 -48 -41 -19 3 14 42 66 58 26 -21 -42 -31 -31 -46 -43 -39 -37 -35 -49 -63
22957 -63 -76 -90 -75 -60 -45 -30 -31 -32 -33 -34 -38 -41 -45 -48 -79 -110 -140 -171 -175 -179 -183 -188 -155 -122 -82 -58 -72 -119 -148 -178 -193 -208 -221 -234 -229 -191 -172 -153 -123 -94 -64
22949 -64 -35 -45 -56 -67 -78 -88 -99 -110 -120 -100 -79 -59 -39 -24 -25 -37 -16 24 48 82 115 129 109 65 4 -33 -39 -10 18 31 44 57 69 36 -12 -70
22942 -70 -96 -121 -147 -168 -189 -214 -206 -162 -118 -84 -50 -49 -48 -39 -31 -23 -14 -8 -2 4 10 21 33 25 49 81 96 123 150 156 163 169 176 210 243 277 311 308 305 302 299 268 238 208 177
22933 177 123 69 14 -39 -45 -50 -55 -61 -61 -62 -62 -62 -37 -12 27 40 5 -29 -49 -97 -117 -110 -119 -129 -109 -89 -69 -49 -22 3 -23 -51 -92 -134 -137 -112 -88 -64 -38 -12
22926 -12 -27 -42 -57 -72 -80 -88 -85 -99 -109 -93 -92 -92 -90 -88 -86 -84 -63 -43 -22 -1 19 40 60 81 100 119 138 157 160 163 166 168 156 144 132 119 80 40 3 -33 -30 10
22918 10 52 56 48 55 52 48 28 8 -11 -32 -42 -68 -100 -105 -87 -69 -66 -35 17 54 63 44 7 -29 -69 -108 -123 -138 -154 -169 -197 -224 -250 -276 -279 -255 -246 -238 -234 -231 -226 -221
22910 -221 -195 -142 -105 -69 -29 -6 8 -3 -39 -75 -75 -48 -46 -76 -104 -99 -74 -48 -21 6 10 15 20 25 13 2 -9 -21 -50 -79 -106 -133 -141 -116 -109 -102 -79 -55 -32
22902 -32 -9 14 37 61 84 86 88 90 92 95 97 99 101 90 78 67 56 29 1 -25 -53 -75 -96 -136 -144 -134 -123 -93 -95 -96 -97 -100 -103 -81 -59 -16 -6 18 75 110 145 140
22894 140 103 86 70 70 104 118 133 154 174 140 106 99 93 87 80 108 137 163 189 159 97 55 13 19 58 96 103 100 98 91 85 80 43 -29 -102 -185 -268 -314 -361 -370 -325
22886 -325 -232 -107 2 81 143 173 174 175 175 174 168 161 155 149 134 120 105 91 113 136 156 177 167 124 99 75 58 40 23 5 26 47 67 88 53 18 -16
22879 -16 -52 -59 -67 -75 -83 -68 -54 -57 -28 20 69 119 170 161 151 160 136 104 71 36 2 -5 -13 -39 -33 -7 18 47 75 89 103 134 132 87 9 -66 -109 -67 29 113
22872 113 165 156 114 91 67 9 -15 -26 -37 -57 -77 -42 -8 34 77 120 163 200 237 238 206 158 110 59 9 15 20 26 32 38 44 50 55 53 51 46 42 26 -22 -70 -86
22864 -86 -63 -39 -14 11 10 10 10 10 10 10 9 9 -15 -41 -67 -92 -116 -139 -181 -191 -172 -153 -132 -111 -107 -102 -128 -154 -173 -158 -110 -62 -23 -17 -46 -76 -75 -74 -73 -72 -90 -109
22856 -109 -128 -147 -141 -135 -130 -124 -111 -97 -83 -69 -36 -2 31 64 49 34 18 3 -32 -68 -123 -145 -125 -105 -84 -62 -81 -100 -119 -137 -118 -99 -80 -60 -48 -36
22849 -36 -24 -11 -22 -32 -96 -193 -251 -254 -191 -95 -17 28 18 8 -34 -77 -117 -158 -160 -130 -117 -105 -82 -59 -6 46 119 159 121 84 64 77 102 126 146 133
22842 133 86 39 -11 -29 12 86 123 127 76 -7 -79 -98 -73 -48 -20 8 36 64 65 66 67 67 85 102 119 136 159 182 224 233 221 210 162 82 5 -38 -48
22835 -48 -59 -52 -46 -39 -33 -22 -12 -2 8 30 53 65 93 121 116 65 -1 -39 -44 -46 -31 4 41 45 49 25 -15 -64 -81 -102 -123 -141 -158 -178 -165 -162 -175 -182 -190 -198 -207 -168
22827 -168 -130 -93 -55 -39 -39 -43 -81 -138 -196 -219 -210 -200 -189 -176 -164 -148 -132 -116 -100 -87 -74 -60 -47 -36 -25 -13 0 36 90 121 120 98 92 128 164 167 138
22820 138 88 54 72 123 156 189 205 221 237 253 241 230 216 203 170 104 56 8 -24 -58 -91 -125 -107 -90 -73 -55 -76 -97 -117 -138 -147 -157 -185 -180 -144
22813 -144 -109 -71 -34 -59 -85 -108 -132 -138 -111 -102 -94 -76 -58 -73 -88 -92 -95 -46 2 58 81 77 58 41 24 6 -11 10 32 54 75 70 65 59 54 39 23 7 -7
22806 -7 -6 -6 -5 -4 37 80 121 161 183 172 170 185 185 186 187 188 172 157 128 66 6 -37 -36 -1 16 18 21 40 73 90 83 77 91 88 61 1 -46 -62 -55 -31 -22 -30 -28 -26 -39
22797 -39 -52 -63 -74 -67 -28 9 13 -17 -81 -135 -172 -162 -97 -33 -23 -42 -77 -122 -135 -117 -67 -14 5 10 15 18 21 15 10 5 0 -28 -55 -83 -111 -111 -112 -113 -113 -104 -95 -86 -76
22789 -76 -50 -23 9 27 15 -28 -55 -28 4 5 -26 -58 -90 -123 -155 -187 -167 -146 -125 -105 -46 13 36 27 28 30 30 29 56 83 109 136 125 113 102 91 83 75 67
22782 67 59 52 44 38 32 25 51 76 69 66 63 58 53 70 87 103 118 92 33 -3 -40 -20 53 115 145 126 106 85 63 38 13 -11 -36 -62 -87 -110 -133 -124 -82 -59 -36
22774 -36 -38 -41 10 95 128 107 64 21 8 -4 0 -26 -50 -73 -98 -124 -109 -94 -79 -65 -61 -56 -22 12 41 38 -1 -40 -64 -88 -80 -71 -82 -93 -123 -120 -112 -104 -94 -84
22766 -84 -74 -64 -53 -43 -70 -97 -124 -151 -140 -129 -118 -107 -101 -95 -88 -80 -65 -18 28 43 27 12 -4 -22 -12 -2 7 16 0 -18 -36 -53 -99 -146 -156 -133 -104 -74
22759 -74 -23 -6 -12 -18 -26 -34 -57 -80 -68 -22 1 24 50 76 89 103 117 130 106 81 57 32 47 62 77 92 107 122 137 152 141 130 120 109 125 142 156
22752 156 170 166 130 111 93 89 85 81 77 100 123 144 165 155 112 88 64 22 -19 -61 -103 -118 -133 -148 -163 -154 -145 -136 -127 -119 -110 -101 -92 -101 -109 -136 -131 -84 -37 11 60 105
22744 105 149 225 245 193 142 86 31 17 3 -10 -24 -14 -5 -27 -48 -72 -64 -18 60 151 210 213 216 195 173 101 29 -9 5 42 80 99 85 58 30 21 12
22737 12 -45 -103 -160 -141 -58 24 27 -1 -12 -22 -26 -30 -33 -37 -24 -12 0 13 37 62 85 108 148 155 118 80 47 45 44 10 -41 -93 -100 -75 -65 -55 -43 -30 -14
22729 -14 1 17 33 33 33 32 32 31 31 30 30 26 22 -2 6 14 -10 -14 -18 -32 -46 -61 -75 -62 -49 -36 -23 -6 10 10 41 55 68 83 99 99 99 99 99 72 45 18 -8 -24
22721 -24 -40 -56 -72 -86 -100 -96 -124 -180 -236 -247 -226 -200 -173 -145 -117 -128 -139 -150 -161 -156 -150 -145 -140 -114 -88 -62 -37 -38 -40 -41 -43 -38 -34 -27 -21 -31 -8 14 4 -27 -60
22713 -60 -47 -2 54 111 166 221 280 283 253 222 176 129 83 36 -24 -86 -165 -211 -185 -142 -117 -75 1 62 85 76 39 -14 -68 -106 -84 -29 7 44 67 90
22706 90 113 136 116 96 77 58 18 -4 7 52 71 58 11 -52 -105 -125 -109 -76 -67 -58 -45 -33 -2 61 113 149 179 176 136 80 23 -16 -19 10 41 88 145
22699 145 169 144 87 28 1 -15 -31 -48 -64 -98 -165 -228 -259 -240 -168 -106 -77 -73 -86 -82 -94 -130 -150 -135 -87 7 86 117 132 153 140 91 26 -3 0 1
22692 1 -29 -48 -67 -106 -112 -82 -51 -18 14 84 154 166 162 129 64 16 -31 -65 -100 -151 -169 -155 -109 -60 -45 -46 -48 -52 -55 -10 34 79 125 112 100 88 76 37
22685 37 -2 -39 -76 -71 -28 -8 11 23 7 -7 4 18 32 48 63 79 95 110 126 141 156 178 184 146 81 31 -17 -43 -42 -33 -8 25 59 50 3 -51 -107
22678 -107 -163 -218 -280 -304 -249 -178 -113 -48 -14 19 9 0 -9 -19 -97 -175 -227 -264 -297 -302 -272 -215 -159 -103 -48 7 58 81 64 31 -7 -47 -87 -127 -134 -140 -146
22671 -146 -153 -124 -96 -69 -42 -20 -25 -69 -130 -166 -185 -166 -121 -97 -101 -97 -76 -58 -41 -22 -3 -11 -20 -28 -37 -25 -12 0 11 23 36 48 60 65 69 74 79 67 56 44
22663 44 33 27 20 14 8 29 50 71 92 106 119 135 150 148 178 189 201 196 192 186 180 134 56 -22 -67 -83 -99 -112 -126 -149 -173 -149 -93 -34 24 70 84 57 30
22656 30 2 -26 -52 -77 -102 -127 -125 -123 -121 -119 -99 -80 -60 -40 -48 -55 -62 -70 -40 -11 16 43 40 5 -11 -29 -79 -130 -180 -230 -243 -255 -267 -280 -268 -257 -245 -234 -222
22649 -222 -211 -200 -188 -181 -173 -184 -162 -130 -97 -63 -28 -23 -18 16 51 96 108 74 39 46 53 60 66 92 117 97 45 -8 -30 -9 11 14 -15 -44 -42 0 42 86 130
22641 130 136 143 149 155 134 113 92 71 88 105 122 139 154 169 184 199 154 109 66 23 0 8 -1 -11 -19 -27 -35 -43 -42 -41 -40 -39 -38 -37 -36 -35 -32 -29 -26 -24 -21 -18 -16 -13 -3 5 34 31
22632 31 36 58 69 80 65 51 36 22 24 25 27 29 17 5 -6 -18 -14 -9 -5 -1 14 30 43 57 39 -9 -41 -72 -110 -149 -205 -228 -208 -172 -145 -118 -97 -108 -98
22625 -98 -89 -73 -24 5 35 64 92 118 143 154 110 24 -60 -127 -139 -115 -75 2 79 134 134 103 72 71 103 129 123 126 145 137 96 57 51 82 129 175 206 216
22617 216 193 135 76 11 -38 -41 -11 24 28 8 4 5 -26 -48 -54 -48 -43 -37 -31 -13 -12 -36 -92 -138 -167 -175 -182 -194 -207 -217 -227 -197 -134 -72 -43 -54 -81 -109 -121 -96
22610 -96 -55 -13 12 9 7 4 1 6 12 17 22 27 32 38 43 76 109 149 173 154 102 69 37 12 21 10 0 -5 -11 -17 -24 -26 -29 -3 23 48 19 -53 -126 -189 -220 -216 -212 -234 -273
22601 -273 -288 -270 -237 -204 -203 -201 -225 -264 -311 -326 -324 -290 -218 -145 -84 -23 11 31 17 -29 -58 -88 -119 -150 -170 -206 -238 -237 -211 -170 -140 -127 -103 -80 -90 -100
22594 -100 -109 -119 -113 -106 -100 -93 -78 -63 -48 -33 -18 -4 10 25 47 68 107 114 112 110 106 102 68 34 0 -32 -28 -24 -19 -15 9 34 59 84 82 80 75 71 64 24 -15 -22 -12 -2
22586 -2 10 22 5 -11 -27 -44 -12 19 51 83 61 40 18 -2 -24 -46 -67 -89 -89 -90 -90 -91 -53 -16 21 58 57 56 52 49 28 -25 -79 -100 -95 -90 -83 -76 -97 -117 -138
22578 -138 -158 -176 -193 -211 -229 -247 -264 -282 -300 -296 -292 -289 -285 -281 -278 -273 -268 -260 -236 -202 -201 -197 -193 -191 -189 -142 -95 -48 -1 7 16 25 33 27 20 13 6 -16 -39 -62 -85 -91 -96 -102 -108 -77 -45
22569 -45 -7 14 0 -46 -83 -105 -129 -137 -130 -106 -56 -5 9 -7 -19 -31 -14 2 -22 -79 -126 -158 -159 -159 -177 -162 -124 -85 -45 -4 -2 0 2 4 5 6 7 7 -13 -34 -22
22561 -22 -11 28 69 73 44 -2 -50 -63 -44 18 81 111 108 111 130 168 206 240 241 207 172 119 65 14 -36 -38 -7 -4 14 26 39 52 65 63 61 59 57 54 51 59 51 35
22553 35 52 50 48 20 -6 -33 -61 -84 -107 -128 -149 -150 -118 -107 -96 -96 -129 -143 -157 -173 -189 -205 -221 -201 -180 -160 -139 -102 -65 -29 7 4 0 -1 -4 12 46 88 98
22546 98 64 29 29 61 104 147 190 233 232 198 182 166 123 79 4 -70 -122 -157 -156 -102 -38 8 33 58 83 75 23 -28 -67 -73 -33 7 29 52 41 31 9
22539 9 -11 -31 -51 -64 -45 0 79 157 203 204 206 240 274 294 281 254 227 199 172 160 180 215 249 301 352 369 332 266 201 134 67 10 -14 8 30 57
22532 57 84 78 72 33 -5 -42 -79 -114 -115 -70 -25 -14 -4 6 16 10 4 -2 -8 1 11 21 32 16 1 -13 -28 -59 -90 -122 -153 -121 -89 -57 -25 -12 1 14 28
22524 28 3 -21 -76 -132 -189 -214 -181 -94 -17 25 44 30 9 -11 -34 -57 -77 -97 -70 -10 44 100 110 88 84 79 74 70 51 64 125 185 208 230 205 148 106
22517 106 64 53 42 -2 -47 -60 -72 -30 11 50 90 96 64 55 45 57 95 117 138 150 134 118 129 123 117 113 109 118 127 137 147 146 161 189 179 146 128 100 71
22510 71 81 91 101 112 125 138 151 164 149 135 121 107 107 107 92 104 148 192 251 283 253 195 150 106 87 68 49 30 15 0 -14 -29 -32 -8 9 10 13
22503 13 16 17 19 -8 -35 -46 -84 -132 -164 -206 -248 -230 -211 -193 -174 -167 -160 -151 -142 -110 -51 -9 32 49 39 55 55 35 32 29 9 25 58 71 99 125 134 153 171 169 150
22495 150 93 8 -55 -81 -87 -55 -9 19 28 36 30 24 27 69 128 154 166 144 121 97 72 46 22 -2 -58 -114 -176 -222 -232 -188 -126 -64 -36 -40 -63 -101 -99 -64
22488 -64 -32 -32 -64 -96 -81 -34 2 22 24 -5 -71 -136 -172 -192 -206 -188 -171 -155 -137 -118 -84 -49 -17 15 46 44 29 15 23 64 138 211 242 219 150 81 53
22481 53 25 -2 -30 -24 -17 -42 -67 -111 -140 -141 -109 -62 -15 31 78 84 57 6 -61 -100 -105 -112 -151 -189 -227 -272 -301 -280 -203 -138 -106 -79 -52 -27 -3 -5 -7 -10 -13 -1
22473 -1 -5 -34 -95 -156 -184 -156 -128 -117 -106 -96 -85 -72 -60 -47 -34 -22 -9 2 15 13 12 10 8 9 9 -9 3 19 8 5 19 22 24 28 32 33 34 36 37 39 40 41 43 43 44 45 45
22464 45 65 85 95 67 19 -11 -9 8 24 39 87 136 176 199 195 163 145 154 162 142 116 90 62 35 45 56 66 76 62 48 33 19 6 -5 -33 -34 -29 -24
22457 -24 -17 -10 -31 -51 -72 -92 -83 -74 -66 -57 -43 -28 16 61 82 75 40 -11 -61 -94 -98 -76 -40 -3 33 71 85 99 111 123 94 28 -15 -59 -97 -118 -131 -117 -86
22449 -86 -54 -75 -95 -124 -137 -120 -76 -9 57 88 92 107 139 169 182 189 196 202 208 187 166 145 123 107 90 73 56 56 55 55 54 37 21 4 -12 -45 -78 -111 -144
22442 -144 -143 -143 -142 -141 -140 -139 -138 -137 -110 -83 -55 -26 17 77 146 182 158 117 84 51 33 15 -2 -20 -15 -9 -4 0 6 11 16 22 25 29 33 37 18 0 -18 -36 -91 -130 -130 -98 -29
22433 -29 56 119 150 108 50 22 10 -5 -37 -69 -84 -81 -78 -74 -70 -39 -8 23 54 72 90 107 125 143 161 179 197 157 117 77 37 19 2 -44 -91 -101 -56
22426 -56 20 97 134 138 96 53 43 32 22 11 13 14 16 18 29 40 49 58 58 26 12 -1 -6 -12 -17 -22 -28 -33 -39 -44 -57 -70 -83 -97 -94 -90 -87 -84 -72 -59 -47 -34 -22 -9 2
22418 2 15 9 3 -2 -8 1 12 22 33 45 57 70 82 78 74 69 64 30 -20 -78 -103 -97 -58 -17 -8 0 25 37 49 40 0 -41 -50 -21 8 -13 -52 -55 -26 25 60 74 88
22410 88 101 114 127 140 172 170 133 96 39 15 44 90 135 164 160 123 105 87 75 96 108 103 98 94 88 82 83 83 51 18 -22 -63 -71 -25 46 86 58 -1 -53 -89
22402 -89 -113 -120 -119 -119 -84 -50 -30 -11 7 27 48 70 89 109 113 84 74 64 68 72 76 80 88 95 102 110 117 124 132 139 140 142 124 139 144 134 134 135 131 127 123 119 88 57 26 -5 -7 -8
22393 -8 -10 -12 23 59 95 131 123 114 106 99 118 153 198 210 199 188 173 158 135 79 33 3 -8 -20 -31 -42 -25 -9 6 23 24 26 27 28 13 0 -15 -30 -48 -67
22385 -67 -85 -103 -121 -140 -158 -176 -217 -257 -295 -334 -341 -316 -310 -303 -275 -247 -219 -192 -166 -140 -114 -88 -70 -51 -65 -79 -107 -134 -119 -87 -58 -62 -88 -98 -101 -104 -106 -108 -92
22378 -92 -77 -95 -146 -166 -154 -162 -170 -142 -114 -106 -65 -6 35 89 143 151 159 167 175 134 93 53 12 4 -2 -9 -17 -16 -15 -13 -11 -25 -22 -9 -29 -38 -30 -42 -39 -35 -31 -25 -20 -32 -43 -54
22369 -54 -65 -49 -33 -35 -9 37 46 3 -40 -31 -23 -14 -5 -10 -14 -18 -22 -1 20 41 63 76 90 103 117 99 82 65 48 3 -40 -84 -129 -127 -124 -122 -120 -126 -132 -138 -144 -125 -107 -88
22361 -88 -69 -34 0 35 70 93 117 153 162 118 35 -46 -90 -97 -77 -69 -62 -47 -33 35 104 148 191 202 213 235 257 263 241 233 242 239 237 217 197 177 157 133 110
22353 110 87 65 54 70 79 73 73 74 73 73 71 69 83 71 41 39 19 0 -1 -2 -4 -5 1 9 17 25 31 38 52 50 4 -68 -135 -185 -220 -228 -205 -165 -123 -80 -35 9 57 132 208
22345 208 256 268 280 291 301 276 250 242 260 296 332 331 302 262 221 179 137 131 126 120 115 109 104 99 93 97 101 106 111 154 214 278 314 290 239 192 162 169 177 186 194 185 176 167 157
22336 157 140 123 105 88 75 62 49 36 23 10 -2 -16 -18 -20 -11 -18 -15 13 27 41 47 54 61 69 81 109 150 153 120 86 51 15 7 -1 -9 -18 -2 13 29 44 52 59
22328 59 65 71 53 7 -12 -48 -95 -125 -165 -205 -181 -158 -134 -111 -79 -47 -15 15 49 82 116 149 197 246 256 238 223 223 243 264 282 273 226 178 144 110 75
22321 75 41 42 43 43 44 3 -38 -79 -120 -172 -224 -252 -226 -147 -68 29 94 64 -18 -74 -129 -152 -175 -198 -221 -195 -169 -143 -117 -96 -74 -52 -30 -36 -41 -47 -52 -35 -18
22313 -18 -1 15 -27 -69 -112 -155 -151 -148 -144 -141 -137 -133 -130 -126 -117 -108 -99 -90 -97 -105 -112 -119 -104 -89 -74 -59 -103 -147 -167 -133 -81 -29 -50 -71 -104 -137 -138 -138 -136 -133 -163 -193 -199 -206 -212 -218 -239
22305 -239 -261 -228 -194 -201 -207 -246 -285 -252 -218 -185 -152 -192 -231 -271 -310 -273 -237 -200 -163 -118 -73 -29 15 24 33 42 50 83 115 148 180 198 216 179 143 118 94
22297 94 104 115 112 141 170 165 145 108 68 45 42 22 4 2 17 32 48 64 66 68 89 77 56 36 13 -9 -5 0 3 7 12 16 21 25 -8 -42 -93 -111 -86 -45 -14 17
22289 17 19 -11 -32 -37 -24 -12 -18 7 29 18 28 37 18 -1 -21 -40 -67 -94 -120 -147 -210 -258 -278 -266 -237 -207 -176 -144 -127 -109 -111 -81 -21 21 40 27 7
22282 7 3 32 77 100 106 121 135 111 53 15 -23 -50 -76 -120 -132 -82 -16 58 100 112 90 53 15 -37 -90 -108 -92 -76 -60 -96 -133 -162 -192 -221 -250 -231
22276 -231 -212 -193 -174 -155 -136 -117 -98 -59 -21 12 47 55 8 -26 -28 -11 5 31 40 28 -15 -75 -135 -189 -244 -263 -249 -226 -203 -178 -154 -129 -103 -78 -53 -66
22269 -66 -79 -92 -105 -100 -95 -90 -85 -80 -75 -70 -65 -56 -48 -39 -30 -22 -13 -5 3 -6 -16 -26 -36 -70 -104 -146 -171 -169 -134 -85 -36 -10 0 -16 -64 -122 -163 -158 -121 -82 -59 -58 -56 -25 5
22260 5 37 68 94 119 162 172 141 94 31 -46 -123 -184 -197 -177 -128 -79 -42 -37 -66 -96 -101 -91 -68 -13 73 129 115 86 63 41 33 24 16 8 2 -4 -28 -20 -9 1
22252 1 14 27 53 79 103 127 140 121 66 11 -11 -35 -57 -79 -111 -127 -116 -72 -33 6 33 27 -6 -41 -84 -112 -97 -55 -12 3 0 -5 -26 -20 5 32 77
22245 77 95 88 98 97 95 79 62 46 30 21 13 16 3 -14 6 56 106 136 139 155 171 155 113 55 -2 -33 -26 13 53 46 40 33 26 26 27 27 27 -10 -48 -86 -124 -130 -135 -141
22237 -141 -147 -114 -82 -50 -17 10 39 67 96 97 98 99 101 83 65 46 28 10 -7 -25 -43 -44 -46 -47 -49 -47 -45 -43 -41 -22 -4 57 135 179 195 205 198 179 160 140 121
22229 121 115 110 104 99 85 71 57 43 56 69 82 96 90 84 78 73 20 -31 -50 -32 5 43 50 58 60 62 64 66 75 84 93 102 95 88 81 73 56 39 21 3 -41 -102 -171 -206 -203 -166
22220 -166 -138 -126 -131 -152 -174 -180 -179 -177 -174 -172 -113 -53 3 60 100 107 79 50 30 10 22 35 65 95 93 91 71 51 32 13 11 26 48 37 6 -56 -121 -152 -143 -117
22213 -117 -99 -81 -61 -42 -22 -3 -1 0 2 4 -10 -24 -39 -53 -47 -41 -35 -29 0 29 57 84 86 55 -10 -75 -110 -113 -102 -90 -80 -70 -60 -51 -88 -125 -162 -199 -220 -241
22205 -241 -280 -287 -274 -261 -246 -231 -232 -232 -233 -234 -234 -235 -235 -236 -230 -225 -217 -210 -173 -105 -38 -4 -12 -52 -95 -105 -108 -111 -113 -114 -100 -86 -75 -63 -48 -66 -74 -65 -32 16 57 98 102 106 109 113
22196 113 63 13 -37 -87 -110 -133 -156 -179 -149 -119 -89 -58 -88 -118 -147 -177 -156 -135 -115 -94 -35 23 81 140 147 153 160 166 126 85 47 8 -21 -18 -2 14 46
22189 46 78 66 39 18 29 54 79 89 98 86 58 29 32 69 105 133 129 112 96 90 118 147 192 224 201 156 111 74 36 32 27 4 -18 -41 -64 -79 -94 -73
22182 -73 -20 42 104 115 125 141 158 175 191 197 203 194 153 87 22 -9 -8 -9 -10 -9 -9 -17 -26 -34 -43 -52 -60 -69 -78 -58 -39 -19 0 17 34 70 74 66 58 48 39 -8 -56 -102 -148
22173 -148 -157 -134 -129 -124 -134 -143 -153 -162 -161 -161 -161 -160 -160 -159 -159 -158 -141 -125 -108 -91 -91 -90 -90 -89 -93 -96 -99 -103 -118 -133 -146 -159 -173 -154 -81 -8 27 8 -31 -72 -105 -106 -93 -79 -69
22165 -69 -59 -49 -39 -10 18 47 76 103 130 175 188 154 121 86 50 2 -45 -91 -137 -196 -223 -232 -208 -152 -95 -20 21 1 -51 -87 -124 -133 -142 -151 -161 -161 -162 -163
22158 -163 -109 -53 -30 -40 -49 -70 -91 -82 -72 -45 -51 -70 -88 -88 -55 -7 39 80 121 127 99 71 42 12 -17 -44 -70 -61 -18 10 40 37 34 3 -60 -124 -156 -154 -153
22150 -153 -149 -145 -158 -171 -181 -192 -199 -174 -166 -159 -150 -141 -130 -119 -81 -11 47 90 125 127 135 158 148 82 30 11 7 4 1 -1 -11 -54 -79 -103 -130 -156 -181 -206 -195 -151 -117
22142 -117 -99 -70 -41 -15 10 9 -23 -47 -54 -44 -19 7 18 28 39 48 58 19 -20 -58 -97 -110 -107 -131 -122 -82 -25 41 76 70 63 54 46 37 28 19 11 24 38 52 66
22135 66 42 19 -10 -24 -25 6 39 39 23 8 -27 -30 -17 -4 10 25 43 60 77 94 78 63 68 90 125 126 92 42 -12 -50 -75 -84 -75 -67 -70 -105 -142 -146 -117 -71
22127 -71 -31 -23 -61 -98 -113 -128 -112 -96 -72 -80 -124 -184 -225 -233 -215 -163 -112 -61 -22 -16 -52 -87 -110 -100 -51 -2 15 34 18 2 -13 -29 -2 24 50 76 123
22120 123 155 147 107 51 -20 -102 -151 -141 -98 -72 -46 14 76 144 196 214 199 147 79 14 -17 -48 -112 -201 -257 -244 -199 -162 -141 -109 -77 -47 -17 12 41
22113 41 55 69 80 92 80 36 -8 -21 -19 -34 -58 -50 -9 0 -36 -72 -91 -111 -98 -85 -56 -28 0 28 59 90 120 151 134 116 99 82 32 -17 -20 8 5
22106 5 2 15 60 119 162 161 143 128 128 151 174 203 232 261 290 292 293 295 297 326 354 381 408 409 377 363 349 306 263 220 177 167 156 146 136 132 128 142 124 70
22099 70 17 -38 -93 -121 -150 -178 -206 -172 -137 -102 -68 -67 -66 -65 -65 -127 -190 -207 -192 -187 -214 -221 -228 -223 -219 -215 -210 -198 -186 -173 -161 -153 -146 -138 -131 -107 -83 -59 -36 -12 11 34
22090 34 58 54 51 47 44 19 -5 -30 -55 -77 -100 -68 -21 -14 -41 -48 -54 -41 -28 -32 -5 32 69 109 148 117 86 54 23 3 -17 -55 -61 -38 -14 21 42 43 76 107
22083 107 105 72 6 -50 -90 -86 -49 -19 -6 17 57 86 116 118 120 122 124 89 53 17 -18 2 22 43 64 84 105 127 148 149 165 191 184 130 76 20 -35 -85
22076 -85 -135 -139 -111 -93 -92 -89 -69 -16 36 43 18 -8 -35 -53 -87 -120 -121 -86 -36 20 44 0 -77 -110 -110 -132 -155 -175 -228 -269 -295 -317 -307 -257 -192 -132 -73 -14
22068 -14 44 72 68 82 96 70 44 18 -6 -31 -56 -81 -106 -134 -161 -124 -86 -59 -31 -69 -107 -127 -147 -168 -188 -225 -262 -252 -209 -172 -136 -97 -59 -68 -77 -85 -93
22061 -93 -75 -40 1 11 -13 -71 -130 -156 -169 -166 -125 -51 33 84 108 99 63 -5 -65 -108 -119 -98 -94 -90 -67 -45 -24 -4 -3 -35 -57 -62 -52 -26 10 14 10 6 0 -5
22054 -5 26 58 88 118 128 106 102 98 108 118 129 139 130 121 111 102 66 29 -6 -43 -45 -47 -50 -52 -63 -73 -84 -94 -78 -62 -46 -30 -14 1 17 33 40 47 56 64 49 65
22046 65 96 126 182 222 224 194 163 133 133 133 137 141 146 150 173 195 218 241 237 233 229 224 196 152 99 79 69 58 96 166 207 231 234 237 229 222 181 141 101 60 22 -15
22038 -15 -16 16 30 44 51 59 67 75 68 60 53 46 55 64 73 82 90 98 106 114 95 75 56 37 51 65 79 93 115 137 159 181 183 184 185 187 186 186 185 184 169 153 116 62 8 -12 12
22029 12 37 25 13 3 -5 -20 -2 49 117 158 144 107 53 16 -5 -13 -4 17 39 18 -36 -103 -138 -137 -120 -113 -106 -98 -89 -109 -129 -116 -49 29 76 54 0 -57 -113
22021 -113 -125 -104 -74 -43 -12 18 23 -4 -22 -24 -35 -45 -44 -59 -56 -21 -4 11 20 29 38 47 40 33 26 19 13 6 0 -5 -13 -21 -29 -38 -22 -5 -21 -36 -71 -90 -70 -17 53 141
22013 141 205 236 213 156 107 75 50 26 -27 -81 -122 -130 -102 -57 -32 -23 -3 15 40 65 25 -14 -56 -97 -93 -56 -31 -22 -4 12 14 -17 -50 -51 -54 -90 -103 -116
22006 -116 -125 -101 -87 -89 -95 -102 -110 -118 -80 -43 -7 27 62 64 85 105 99 93 87 80 74 68 61 55 86 116 145 173 174 142 128 115 72 30 -11 -54 -39 -24 -9 4 -18 -41
21998 -41 -64 -87 -96 -105 -115 -124 -110 -96 -82 -68 -62 -56 -51 -45 -32 -20 -7 4 -1 -8 -14 -21 -14 -8 -2 3 -15 -33 -51 -70 -103 -137 -170 -204 -207 -211 -215 -218 -180 -141 -103 -64 -61 -58 -53 -48
21989 -48 -33 13 60 75 69 63 55 47 33 19 7 -4 4 45 86 94 80 67 51 35 8 -19 -65 -78 -58 -39 0 7 -3 -14 -9 -36 -91 -147 -137 -72 -13 46 76
21981 76 107 125 144 162 181 199 217 200 150 87 25 -3 0 14 28 45 61 27 -5 -36 -68 -55 -9 15 40 58 44 47 51 40 28 16 5 14 23 32 41 41 42
21974 42 43 44 81 117 154 190 186 182 178 174 179 184 190 195 208 220 238 240 196 98 23 -36 -47 -26 -22 -19 -19 -19 -17 -14 7 62 117 140 124 108 91 73 69 65 61 57 48 39 30 20 11
21965 11 2 -6 -15 -41 -67 -93 -119 -104 -90 -75 -61 -22 16 54 93 107 121 135 149 175 200 244 256 252 249 241 233 223 180 113 29 -53 -103 -113 -92 -34 40 92
21958 92 113 124 135 144 153 162 171 180 189 172 155 138 121 69 17 19 37 52 36 -26 -89 -130 -171 -180 -188 -151 -114 -78 -42 -29 -33 -10 -20 -53 -102 -160 -186 -153 -88 -22
21950 -22 9 3 -35 -67 -82 -93 -104 -114 -125 -133 -141 -149 -157 -149 -141 -101 -62 -14 17 11 -26 -75 -124 -161 -165 -131 -97 -74 -84 -97 -93 -101 -109 -118 -127 -136 -145 -155 -166 -176 -186 -189 -191 -193
21942 -193 -195 -155 -115 -75 -35 -27 -18 -11 -4 -21 -55 -91 -160 -263 -334 -347 -306 -266 -227 -217 -207 -218 -229 -186 -126 -95 -97 -112 -127 -122 -117 -112 -106 -111 -115 -121 -126 -139 -169 -207 -212
21934 -212 -168 -107 -37 0 5 -5 -20 -20 -41 -96 -129 -162 -153 -111 -88 -64 -55 -46 -37 -28 -15 -2 10 23 51 79 61 10 -34 -78 -92 -105 -105 -104 -103 -103 -77 -52 -45 -6
21926 -6 58 123 145 134 108 99 119 122 110 65 20 8 31 71 101 131 136 108 99 90 42 -5 -51 -97 -157 -185 -174 -147 -114 -81 -59 -69 -100 -97 -61 -9 52 81
21919 81 65 49 56 80 112 111 70 14 -34 -82 -148 -197 -209 -188 -137 -86 -32 20 47 74 100 126 171 201 192 151 109 67 23 -20 -31 -41 -70 -67 -55 -43 -29
21912 -29 -15 -10 -4 1 6 -13 -33 -54 -74 -81 -88 -95 -102 -79 -56 -33 -11 -7 -3 0 3 2 0 -1 -2 30 64 96 127 99 38 -4 -46 -79 -111 -144 -176 -209 -242 -209 -177 -117 -58
21904 -58 0 56 103 117 85 52 30 7 -14 -36 -24 -12 -2 7 31 23 -29 -82 -109 -104 -117 -129 -140 -151 -161 -172 -186 -199 -148 -96 -60 -25 9 45 58 71
21897 71 21 -28 -83 -105 -81 -56 -45 -34 -23 -12 -39 -67 -76 -118 -161 -204 -248 -291 -268 -213 -176 -139 -127 -116 -104 -93 -90 -86 -83 -80 -72 -64 -75 -53 3 60 73 52
21890 52 18 -16 -50 -85 -85 -52 -37 -23 6 36 82 95 92 56 -6 -102 -169 -182 -121 -59 -28 -29 -12 4 -6 -17 -28 -39 -50 -61 -72 -83 -62 -41 -20 0
21883 0 -15 -32 -30 -61 -87 -113 -142 -170 -199 -227 -254 -280 -268 -224 -200 -176 -194 -245 -275 -305 -291 -245 -206 -184 -148 -94 -44 -11 -19 -60 -82 -104 -89 -41 -12 17
21876 17 41 65 90 114 147 179 213 247 247 263 301 284 202 119 110 155 201 214 193 156 106 55 5 -44 -81 -102 -86 -39 -35 -63 -72 -80 -61 -42 -24 -5 35
21869 35 76 135 161 143 109 82 56 58 60 62 64 68 72 75 79 59 38 17 -2 37 77 117 158 179 200 220 240 239 222 195 201 201 201 203 206 169 132 95 58 25 -7 -38
21861 -38 -69 -119 -137 -117 -82 -74 -82 -70 -74 -80 -69 -68 -68 -47 -26 -5 14 22 29 36 44 27 9 -37 -85 -89 -61 0 63 108 121 98 74 78 82 85 89 53 18 -16 -51 -86
21853 -86 -105 -77 -16 43 86 106 93 76 76 85 111 137 130 89 47 55 63 72 80 76 73 70 67 71 75 79 83 74 64 53 41 13 -47 -108 -136 -142 -147 -169 -159 -136 -113 -88 -63 -57
21844 -57 -52 -46 -40 -37 -35 -32 -30 -36 -43 -17 41 99 101 61 20 12 4 -3 -11 -22 -33 -65 -113 -153 -161 -123 -69 -41 -44 -29 -14 -9 -4 0 4 -3 -10 -17 -24 3 31 59 87 78 69 61 52 35 18
21835 18 1 -14 -39 -64 -107 -117 -110 -104 -95 -87 -87 -87 -87 -87 -96 -104 -113 -121 -112 -102 -93 -83 -117 -150 -138 -71 19 111 167 190 184 124 42 -7 -15 -22 -28 -34 -23 -11 0 10 18 25 32 40
21826 40 34 27 21 15 -3 -22 -41 -60 -60 -60 -61 -61 -57 -53 -50 -46 -51 -55 -60 -65 -61 -58 -55 -52 -29 -7 14 36 -5 -48 -90 -133 -129 -126 -68 -10 55 121 154 187 191 194 197 200 177 153 129 106
21817 106 101 96 92 87 79 72 64 56 73 90 52 14 -18 -51 -52 -53 -45 -38 -31 -23 -33 -43 -53 -63 -59 -55 -52 -48 -20 8 36 65 25 -14 -53 -93 -132 -172 -212 -252 -218 -184 -151
21809 -151 -117 -91 -64 -38 -11 -1 8 18 28 44 61 77 94 108 123 153 156 126 97 65 34 30 26 23 20 46 87 134 154 141 111 79 64 59 55 68 53 0
21802 0 -37 -43 -31 -41 -78 -109 -124 -157 -218 -270 -305 -307 -282 -271 -260 -210 -159 -109 -58 -42 -25 -8 7 51 95 138 182 164 145 126 107 89 70 51 32 39 45
21795 45 51 57 63 69 75 81 51 21 -8 -38 -41 -44 -47 -50 -22 5 33 60 59 58 41 -2 -47 -65 -48 -31 -25 -46 -83 -120 -113 -80 -30 19 48 62 67 45 -9 -65 -122 -179
21787 -179 -189 -199 -210 -221 -214 -222 -237 -224 -201 -177 -152 -127 -98 -70 -41 -13 12 39 83 96 95 94 91 88 69 50 31 12 -5 -22 -40 -58 -39 -21 17 23 9 27
21779 27 37 30 52 108 153 182 189 196 202 209 166 123 80 37 26 15 -14 -11 11 34 59 83 64 44 26 9 -1 20 41 31 24 16 7 -1 18 38 39 72 124 159
21772 159 205 252 237 223 209 194 160 125 91 56 71 85 100 114 90 66 42 18 21 25 28 31 47 64 80 97 127 158 155 119 68 49 52 39 15 -8 -18
21765 -18 3 29 56 85 114 142 171 188 222 248 243 202 161 133 104 76 47 30 13 -3 -19 -53 -86 -119 -152 -156 -160 -164 -168 -165 -161 -146 -97 -57 -50 -75 -100 -86 -40
21757 -40 -2 19 26 49 80 78 58 38 16 -5 -10 -14 -18 -22 -27 -31 -35 -39 -42 -44 -47 -49 -51 -54 -56 -59 -51 -43 -37 -30 -50 -86 -100 -82 -59 -52 -68 -117 -163 -177 -166 -138 -99 -44 11 51
21749 51 53 55 75 62 5 -51 -107 -164 -168 -140 -130 -120 -113 -106 -99 -91 -106 -121 -104 -87 -46 -21 -24 -58 -101 -144 -166 -134 -65 -13 6 10 -2 -14 -27 -40 -53 -65 -66 -34
21741 -34 10 22 0 -22 -47 -73 -99 -125 -154 -184 -211 -238 -224 -178 -149 -121 -64 -7 50 107 119 131 143 155 150 146 141 137 130 123 116 109 75 41 7 -26 -65 -105 -143
21733 -143 -181 -179 -145 -109 -107 -87 -52 -18 -1 -1 -1 -1 -2 -5 -8 -13 -18 -51 -117 -180 -210 -175 -86 -17 35 95 156 231 274 298 290 244 197 178 159 148 119 65 -21 -99
21726 -99 -161 -192 -206 -229 -252 -252 -251 -219 -187 -147 -123 -124 -158 -209 -227 -189 -151 -130 -109 -89 -68 -54 -39 -25 -10 1 13 46 46 35 56 67 60 66 71 75 79 77 75 73 71
21718 71 69 67 65 63 65 66 68 69 54 39 24 9 4 0 -3 -6 18 76 132 156 153 118 98 79 58 37 16 -4 -35 -66 -97 -127 -109 -91 -73 -54 -54 -54 -54 -53 -26 1 28
21710 28 55 64 72 99 93 49 5 -28 -79 -124 -137 -112 -55 -6 26 35 11 -17 -30 1 66 96 93 77 62 53 43 34 24 49 74 115 123 83 11 -61 -100 -110 -88
21702 -88 -64 -73 -90 -123 -159 -178 -179 -181 -147 -81 -25 -2 -4 -22 -45 -69 -82 -111 -143 -142 -118 -77 -44 -44 -67 -73 -54 -36 -17 0 -31 -79 -84 -57 -32 -39 -60 -80 -108
21695 -108 -152 -204 -224 -210 -180 -156 -133 -106 -78 -84 -123 -155 -155 -142 -129 -108 -88 -67 -45 -19 22 75 95 88 98 87 92 112 131 170 176 153 131 106 82 76 70 95
21688 95 119 126 100 39 -20 -27 -2 13 12 -17 -48 -80 -111 -142 -173 -221 -236 -221 -190 -148 -138 -151 -165 -180 -195 -185 -174 -182 -158 -91 -25 7 7 -3 -14 -27 -40
21681 -40 -69 -98 -127 -156 -158 -159 -161 -163 -129 -95 -61 -27 -11 5 29 36 19 -31 -73 -98 -97 -96 -94 -92 -56 -21 14 50 93 137 181 225 237 249 262 274 226 179 134
21673 134 88 45 34 24 -18 -32 -30 -48 -50 -37 -25 6 6 0 8 6 4 19 33 48 62 77 91 106 121 90 59 28 -2 -60 -117 -175 -233 -231 -228 -226 -223 -204 -186 -167
21666 -167 -148 -107 -67 -26 14 37 60 91 105 65 -7 -60 -114 -136 -127 -136 -146 -144 -159 -163 -113 -14 83 160 183 165 131 104 78 76 107 127 131 128 93 57 53 56 59
21658 59 64 69 79 89 99 109 119 129 139 149 156 163 178 176 144 80 16 -14 -5 36 70 88 88 72 63 55 50 45 21 30 46 62 97 100 74 32 -20 -41 -22 -2 19
21650 19 40 21 1 -18 -37 -41 -44 -47 -51 -28 -5 17 40 56 73 75 45 -10 -66 -66 -34 11 58 122 154 133 78 9 -58 -110 -129 -109 -56 -14 27 69 112 118
21643 118 92 75 74 62 50 39 28 22 16 42 68 88 91 69 15 -48 -80 -90 -117 -174 -230 -230 -197 -131 -65 1 68 68 51 61 39 18 -2 -23 -44 -27 22
21636 22 71 87 73 44 12 -2 13 28 44 61 77 93 110 126 137 148 159 170 165 159 154 148 131 113 95 77 32 -12 -57 -102 -117 -132 -145 -158 -171 -151 -95
21629 -95 -39 -29 -18 -8 1 31 61 91 121 88 54 23 -8 -20 0 3 5 4 4 3 2 19 36 71 74 40 7 5 36 72 75 32 -26 -83 -139 -180 -189 -166 -111 -64
21621 -64 -34 -18 -35 -43 -35 -3 29 48 35 -11 -57 -70 -51 -23 -11 -6 30 76 121 176 214 187 128 88 48 41 65 72 78 79 79 79 80 41 3 -32 -69 -74 -47 -39 -30
21613 -30 -36 -41 -47 -52 -50 -48 -36 -40 -20 26 66 90 97 105 111 118 100 83 66 49 48 47 46 45 59 73 94 100 81 36 -2 -25 -26 -10 -2 5 41 77 113 149 155 160 166 172 150 129
21605 129 108 86 84 83 81 79 103 127 166 178 139 99 60 21 3 12 17 5 13 38 53 67 83 98 113 127 111 78 70 35 -10 -56 -125 -156 -131 -106 -96 -59
21597 -59 -22 -13 20 38 15 -24 -63 -87 -70 -36 -13 10 3 -29 -45 -62 -47 -5 28 47 48 32 25 18 10 2 -5 -14 -2 9 21 33 31 30 43 30 -23 -78 -80 -45 -8
21590 -8 12 11 11 18 24 29 34 59 52 20 -28 -50 -41 -9 4 -7 -36 -66 -80 -81 -82 -81 -81 -59 -36 -15 4 45 53 5 -41 -61 -48 -2 44 49 22 -27 -60 -63 -49 -22 20
21581 20 62 70 57 59 86 113 148 167 136 71 7 -23 -14 11 30 49 30 12 -6 -25 -5 13 34 54 77 117 165 181 169 158 126 126 141 155 172 188 167
21574 167 145 124 102 77 51 25 0 8 17 26 35 78 121 129 105 94 100 104 92 76 75 95 115 99 49 -22 -111 -184 -202 -198 -193 -205 -217 -172 -95 1 82 116 118 85
21567 85 51 49 46 49 52 55 59 37 15 -6 -28 -40 -51 -74 -80 -66 -85 -114 -89 -35 18 94 137 161 185 204 224 218 180 159 139 90 41 -7 -56 -104 -152 -207 -246
21559 -246 -220 -161 -119 -78 -32 13 58 103 131 143 129 83 23 -4 3 43 101 126 104 67 14 -37 -66 -42 3 49 83 85 51 1 -51 -88 -106 -139 -202
21553 -202 -249 -275 -268 -233 -181 -132 -82 -32 18 55 92 147 170 162 154 145 135 106 77 48 18 -38 -110 -190 -238 -226 -181 -153 -125 -105 -84 -46 -40 -57 -73 -92 -110
21546 -110 -113 -115 -87 -58 -38 -51 -100 -148 -171 -193 -172 -135 -107 -111 -128 -145 -142 -140 -137 -135 -123 -112 -102 -91 -86 -97 -117 -105 -93 -82 -68 -55 -25 4 34 64 67 70 73 76
21538 76 32 -11 0 9 1 -5 -13 -21 23 69 60 52 0 -53 -52 -50 -44 -39 -33 -28 -28 -29 -30 -31 -32 -32 -33 -34 -24 -14 -4 5 -11 -28 -45 -62 -87 -112 -137 -162 -170 -179 -133 -87 -40 7 21
21529 21 36 17 0 -19 -37 -52 -68 -41 40 135 176 154 99 89 133 161 157 114 39 -19 -78 -88 -99 -109 -120 -56 7 39 70 110 149 165 126 77 28
21522 28 8 -11 -3 3 -21 -46 -84 -122 -160 -198 -225 -253 -204 -156 -51 53 113 118 70 22 -28 -79 -65 -50 -35 -20 -21 -21 -21 -22 -6 10 26 42 49 56 45 66
21515 66 70 73 78 83 83 82 82 81 80 80 79 79 82 84 87 90 27 -35 -96 -157 -208 -226 -205 -151 -100 -49 -29 -8 -6 -3 -1 0 17 34 50 67 95 122 150 178 214 250 283 317 310
21506 310 270 248 227 219 212 203 193 183 140 116 91 53 15 -20 -56 -111 -134 -120 -73 -32 -24 -28 -31 -47 -63 -79 -95 -129 -163 -197 -231 -222 -212 -200 -188 -104 11
21499 11 124 205 217 174 160 146 145 143 142 141 105 68 32 -3 -51 -99 -132 -133 -104 -74 -76 -111 -124 -103 -71 -39 -13 11 36 61 132 203 250 242 222 201 178 154
21492 154 135 116 97 78 59 39 20 0 2 5 -24 -53 -85 -101 -92 -49 -13 6 5 4 -15 -35 -55 -75 -59 -43 -27 -11 -11 -11 -10 -10 -27 -43 -57 -71 -50 3 45
21485 45 72 68 31 -40 -111 -161 -179 -182 -185 -159 -133 -107 -81 -86 -92 -98 -104 -102 -99 -97 -95 -46 2 51 99 88 77 67 57 59 78 106 101 47 -5 -4 29 44 43 52 62 68 73 79
21476 79 84 102 120 136 153 143 116 79 74 68 30 3 -7 6 20 35 51 69 87 73 58 28 -1 23 47 84 122 124 94 50 23 17 11 39 66 101 119 110
21469 110 68 -7 -84 -147 -177 -166 -122 -69 16 103 156 175 166 160 171 159 120 89 73 66 59 43 42 41 12 -9 -14 -15 -16 -16 -17 28 73 86 99 95 90 86 82 42 1 -6
21461 -6 -14 11 38 65 91 91 90 90 89 103 117 98 79 79 78 78 77 60 42 24 6 5 4 2 1 -9 -20 -31 -42 -14 12 39 66 78 90 101 112 136 143 123 75 27
21453 27 7 2 -2 -9 -17 8 33 35 38 18 -17 -30 -16 -17 -18 -15 14 44 46 25 -11 -41 -70 -79 -88 -97 -106 -100 -95 -90 -84 -81 -77 -104 -132 -136 -113 -73 -33 1 37 72 108 110 112 153
21444 153 178 152 88 36 0 -46 -93 -121 -121 -116 -110 -103 -96 -59 -23 12 49 60 71 80 89 68 15 -49 -114 -151 -155 -120 -52 20 93 132 139 114 88 60 33 16 0
21437 0 -28 -90 -162 -201 -194 -132 -46 40 73 106 105 72 23 -24 -28 -33 -5 22 41 60 78 97 100 103 73 44 15 -13 -11 -10 -10 -43 -76 -77 -29 18 53 56 27 -1 -51
21429 -51 -68 -54 -41 -26 -10 6 24 41 59 63 68 103 138 142 114 72 29 1 -26 -54 -82 -73 -63 -22 19 50 81 79 77 80 82 84 87 65 44 25 6 21 68 130
21421 130 192 216 241 282 291 249 174 116 58 18 -20 -6 8 9 9 10 10 8 5 2 0 19 39 58 78 119 160 157 99 28 -25 -68 -96 -98 -99 -100 -101 -73 -45 -16 11
21414 11 25 40 73 73 53 34 12 -9 -24 -39 -54 -69 -61 -52 -43 -35 17 70 87 72 41 26 11 -19 -45 -38 5 81 130 147 130 113 97 80 63 47 11 -23
21406 -23 -66 -92 -70 -15 19 54 83 79 93 107 77 47 17 -12 -21 -31 -61 -108 -139 -137 -109 -65 -36 -7 39 53 23 -38 -101 -131 -120 -77 -32 -19 -16 -12 -11 -10
21399 -10 14 40 72 88 64 6 -62 -131 -168 -150 -102 -70 -70 -103 -169 -236 -242 -195 -125 -56 -4 14 -2 -19 -12 -6 2 11 20 62 84 106 110 81 38 -4 -59 -114 -131
21392 -131 -115 -81 -14 33 27 -8 -45 -52 -59 -89 -119 -134 -117 -91 -65 -69 -74 -58 -42 -26 -10 -13 -16 -18 -19 -22 7 18 29 30 31 32 33 18 2 -12 -27 -41 -54 -68 -81
21384 -81 -78 -76 -73 -70 -69 -68 -67 -66 -90 -114 -138 -162 -141 -121 -70 -18 13 14 -21 -57 -61 -65 -69 -73 -87 -101 -132 -132 -123 -114 -102 -91 -97 -102 -107 -112 -101 -90 -79 -68 -57 -46 -35 -24 -25
21375 -25 -26 -28 -29 -57 -85 -111 -137 -138 -107 -75 -76 -92 -107 -122 -138 -147 -123 -65 -8 31 39 10 -18 -57 -96 -133 -170 -171 -140 -129 -118 -105 -125 -148 -187 -221 -223 -198 -157
21368 -157 -110 -46 24 63 62 28 12 -3 -4 27 49 55 56 57 56 56 63 69 75 81 61 40 19 -1 0 2 4 7 -6 -21 -35 -49 -54 -60 -66 -71 -61 -50 -39 -29 -12 3 20 37
21359 37 37 37 37 38 9 -19 -47 -76 -76 -75 -20 34 68 103 126 165 221 244 219 179 166 153 140 127 136 162 197 200 177 170 169 137 83 30 -24 -78 -77 -59 -63 -99 -133
21352 -133 -134 -100 -67 -39 -11 2 -16 -52 -87 -110 -100 -62 -24 -5 -2 4 43 116 188 228 235 205 176 140 88 29 3 2 33 66 65 48 14 -30 -43 -60 -77
21345 -77 -92 -108 -151 -194 -192 -135 -52 30 58 54 46 37 26 15 -1 -18 -35 -52 -31 -10 10 31 76 120 165 209 216 222 229 235 226 216 207 197 174 150 108 99 119 140
21337 140 163 186 182 177 173 169 181 194 206 219 215 211 207 204 167 131 95 59 42 24 8 -7 0 40 91 142 139 82 3 -75 -143 -178 -174 -138 -104 -70 -67 -64 -87 -109 -77
21329 -77 -46 -8 29 31 0 -20 -42 -33 -24 -33 -42 -83 -125 -179 -233 -255 -277 -310 -343 -342 -340 -301 -228 -177 -125 -109 -125 -123 -120 -120 -119 -104 -57 -15 25 14 3 23 44 64
21321 64 84 97 110 121 132 143 127 60 -5 -32 -60 -87 -114 -151 -188 -160 -131 -112 -93 -75 -56 -44 -33 -22 -11 0 10 22 33 75 117 174 205 201 198 193
21315 193 188 159 130 101 72 5 -61 -126 -191 -195 -172 -164 -155 -146 -136 -126 -116 -84 -52 -31 5 32 32 49 65 76 87 81 102 159 188 148 71 -4 -63 -84 -77 -58
21307 -58 -39 -18 2 -17 -37 -57 -77 -98 -118 -138 -158 -148 -138 -128 -117 -107 -97 -87 -77 -89 -100 -111 -121 -116 -94 -66 -65 -83 -102 -123 -143 -159 -176 -190 -205 -203
21300 -203 -173 -111 -21 51 97 112 99 79 75 60 46 55 65 74 84 110 137 163 190 168 145 123 100 75 50 42 6 -58 -107 -111 -99 -72 -46 -18 9 13 18 23
21293 23 27 16 4 -5 -15 -6 29 48 67 98 101 65 13 -38 -75 -70 -38 6 67 120 172 215 240 226 183 157 131 103 75 44 12 -19 -51 -60 -69 -77 -86 -57 -27
21286 -27 1 31 18 5 -7 -20 15 50 92 119 120 94 72 66 43 3 -26 -56 -91 -127 -177 -199 -176 -136 -103 -69 -44 -3 43 63 51 38 24 10 36 63
21279 63 89 115 125 135 145 155 142 129 118 106 66 43 58 100 107 76 68 60 37 15 -7 -30 -36 -42 -48 -55 -45 -34 -24 -14 -8 -1 5 11 18 25 30 36 12 -27 -72 -90
21271 -90 -84 -61 -24 28 88 120 124 111 90 70 81 92 101 109 85 61 45 28 12 -4 -50 -97 -111 -88 -61 -51 -62 -73 -65 -56 -46 -35 -28 5 45 47 56 64 70 76 82
21263 82 88 94 100 114 128 142 156 143 130 117 104 78 52 26 0 -26 -52 -78 -105 -128 -151 -175 -198 -193 -188 -191 -177 -121 -38 38 98 126 126 150 157 127 98 84 97
21256 97 144 190 204 180 146 96 43 7 -3 -15 -24 -33 -17 26 63 83 75 67 73 52 13 -25 -81 -110 -102 -95 -76 -72 -90 -80 -35 8 12 -32 -82 -132 -145 -158 -138
21248 -138 -118 -99 -79 -92 -104 -105 -106 -95 -51 2 23 11 -1 26 54 90 109 93 45 5 -18 -27 -37 -46 -54 -16 22 78 102 89 75 61 47 29 43 58 40
21241 40 3 -32 -71 -111 -139 -183 -236 -256 -229 -187 -132 -110 -105 -83 -75 -67 -67 -100 -112 -124 -121 -85 -50 -48 -67 -104 -142 -163 -166 -169 -156 -111 -57 -3 17 6 -13 -16 -20 -41
21234 -41 -28 1 10 36 59 67 91 100 62 -8 -91 -175 -231 -255 -243 -230 -201 -172 -132 -107 -89 -38 -7 24 43 62 99 103 99 94 88 82 84 86 88 91 89 86 106 141 160 146
21226 146 108 53 10 -15 -19 -23 -69 -114 -160 -206 -211 -217 -222 -228 -222 -215 -209 -203 -180 -158 -135 -112 -136 -159 -182 -205 -191 -176 -161 -146 -151 -156 -161 -165 -154 -142 -132 -121 -114 -124 -139 -127
21217 -127 -100 -73 -76 -117 -171 -208 -212 -200 -191 -183 -174 -164 -159 -153 -147 -141 -149 -157 -166 -174 -174 -175 -143 -112 -77 -59 -70 -109 -137 -165 -195 -225 -220 -215 -211 -206 -197 -187 -178 -169 -176 -183 -190 -197 -185 -174 -178 -156
21208 -156 -118 -96 -94 -92 -93 -67 -14 55 117 141 133 125 126 127 75 24 6 26 65 88 90 76 47 2 -57 -117 -167 -179 -156 -134 -109 -84 -45 -7 28 64 99 97 57
21201 57 -9 -73 -98 -94 -91 -120 -187 -252 -279 -256 -194 -120 -45 19 68 90 80 59 39 16 -5 6 17 29 40 52 64 75 87 54 22 -9 -42 -36 -30 -25 -19 -10
21194 -10 -1 7 16 9 2 -4 -12 -30 -48 -66 -84 -107 -131 -185 -239 -256 -241 -190 -138 -103 -67 -64 -61 -53 -46 -72 -131 -207 -250 -276 -269 -238 -192 -152 -112 -86 -60 -16 -4 -21 -38
21186 -38 -57 -76 -79 -81 -84 -86 -94 -103 -109 -115 -102 -57 -21 -1 16 34 51 68 82 95 107 118 121 92 28 -34 -61 -54 -66 -78 -56 -35 -13 7 27 46 83 87 56 9
21178 9 -49 -75 -70 -65 -37 -43 -77 -78 -45 -12 -8 -4 0 4 -7 -19 -30 -42 -27 -11 3 19 24 29 34 39 44 49 53 58 40 21 2 -16 -48 -80 -119 -142 -139 -104 -53 -2 44 91
21170 91 103 82 67 68 68 50 24 -2 -29 -57 -78 -98 -117 -136 -145 -121 -72 -8 43 61 67 72 73 75 76 77 50 24 40 73 86 67 34 2 -42 -86 -147 -175 -159
21162 -159 -110 -60 -42 -71 -100 -95 -57 7 72 124 144 137 130 120 111 100 89 78 68 38 24 19 -17 -62 -107 -152 -197 -209 -188 -185 -181 -187 -177 -156 -168 -184 -185 -196 -208
21155 -208 -216 -225 -251 -244 -190 -120 -49 4 5 -26 -40 -55 -65 -76 -86 -97 -91 -85 -79 -74 -69 -65 -60 -56 -52 -47 -43 -38 -7 24 53 82 79 43 -26 -95 -123 -118 -119 -138 -128 -86 -64 -41
21147 -41 7 56 103 150 167 150 155 159 139 152 164 145 85 26 -34 -96 -114 -131 -149 -167 -125 -83 -43 -3 7 -13 -24 -20 -24 -29 -51 -40 6 53 98 144 171
21139 171 144 94 43 7 -29 -32 -36 -14 8 -2 -12 -38 -64 -57 -50 -63 -77 -90 -104 -90 -76 -62 -48 -12 23 26 29 21 14 59 105 122 123 100 43 -5 -22 -3 48
21132 48 104 143 148 137 130 122 114 106 95 83 72 60 41 22 3 -15 -34 -53 -72 -91 -100 -109 -118 -126 -135 -144 -153 -162 -168 -175 -181 -187 -191 -194 -177 -193 -245 -264 -246 -195 -144 -92 -39 14
21124 14 22 29 38 47 61 91 131 137 104 70 35 0 -42 -85 -134 -168 -154 -108 -79 -50 -46 -43 -40 -37 -37 -53 -79 -71 -45 -20 7 35 30 24 19 13 -8 -30 -52 -74 -72 -69 -67 -65
21115 -65 -97 -130 -162 -194 -208 -222 -193 -148 -116 -117 -155 -225 -282 -308 -295 -250 -209 -169 -126 -83 -61 -39 -17 4 9 15 20 26 26 27 28 29 30 30 31 32 53 74 95 115 97
21107 97 63 53 75 121 167 191 161 112 64 12 -39 -42 -45 -48 -51 -62 -73 -84 -95 -96 -98 -99 -101 -42 15 72 128 161 162 181 200 158 115 72 30 -15 -60 -121 -154
21100 -154 -133 -111 -87 -64 -50 -37 -8 -7 -39 -71 -105 -139 -136 -134 -131 -129 -110 -91 -73 -54 -35 -17 0 18 45 71 98 124 108 92 74 56 28 -26 -79 -105 -73
21093 -73 -3 55 98 112 110 116 122 101 81 61 40 20 0 -18 -37 -29 6 26 47 69 91 113 135 143 150 172 167 126 69 4 -33 -31 -29 -58 -87 -150 -214 -244 -235 -215
21085 -215 -179 -119 -58 -5 20 28 37 27 18 8 0 -3 -6 -10 -13 -37 -61 -85 -110 -96 -82 -69 -57 -54 -78 -94 -94 -84 -46 -8 3 13 23 32 41 22 3 -13 -30 -44
21078 -44 -31 -33 -35 -28 -20 -13 -5 -17 -30 -42 -54 -58 -63 -65 -67 -69 -38 -25 -13 -14 -16 33 84 96 76 41 6 -22 -51 -79 -106 -130 -121 -97 -74 -31 12 20 -4 -45 -85 -128
21070 -128 -171 -176 -182 -206 -198 -165 -131 -96 -60 -52 -44 -38 -31 -51 -104 -139 -173 -180 -187 -213 -206 -208 -210 -208 -206 -206 -174 -159 -145 -109 -73 -37 -1 47 96 143 190 189 155 86 16 -6
21062 -6 -29 -70 -78 -57 -35 -11 11 8 4 1 -2 8 19 28 37 16 -37 -71 -105 -137 -137 -154 -170 -164 -126 -106 -87 -61 -36 -10 14 -4 -24 -44 -64 -62 -60 -8 43 75 30
21054 30 -65 -161 -226 -236 -201 -166 -149 -132 -115 -98 -82 -65 -49 -33 -51 -69 -87 -104 -128 -136 -118 -67 -11 28 56 68 75 83 89 96 135 174 211 248 268 255 218
21047 218 164 136 141 169 214 236 225 201 177 163 148 132 115 81 14 -65 -144 -207 -238 -220 -185 -173 -161 -148 -135 -155 -175 -195 -215 -211 -206 -201 -196 -153 -93 -25 10
21040 10 36 62 86 110 134 158 181 204 218 215 201 220 230 207 207 207 188 203 217 198 164 130 76 54 62 70 99 95 60 25 -10 -47 -49 -51 -53 -55 -65 -75 -85 -95
21032 -95 -131 -167 -200 -233 -247 -207 -178 -182 -184 -169 -144 -103 -55 -39 -48 -74 -95 -101 -84 -67 -32 1 35 70 79 89 98 108 90 72 55 37 24 12 0 -13 1 16
21025 16 30 45 55 65 73 82 50 -12 -75 -105 -105 -89 -80 -71 -60 -50 -40 -30 -31 -33 -35 -37 -66 -95 -124 -152 -116 -80 -44 -7 26 60 113 133 138 144 147 151 154 158 161 165 146
21017 146 127 89 83 68 37 17 -2 -33 -64 -114 -131 -128 -125 -120 -114 -108 -85 -54 -55 -76 -98 -122 -146 -140 -134 -149 -181 -207 -201 -161 -122 -120 -150 -162 -174 -183 -192 -218 -211 -155 -83
21009 -83 0 48 77 89 85 64 17 -29 -43 -23 -12 -18 -45 -104 -149 -139 -88 -37 -38 -71 -84 -96 -96 -63 -49 -34 -23 -12 -32 -51 -59 -35 13 77 102 72 42
21002 42 11 3 -3 -11 -18 -12 -5 1 8 -34 -77 -119 -162 -203 -245 -294 -326 -302 -245 -205 -165 -140 -115 -89 -64 -40 -15 28 39 32 41 38 34 31 -4 -39 -41 -44 -31 16 82 112
20994 112 110 86 78 74 70 34 -1 -46 -92 -105 -117 -121 -125 -117 -76 -31 -20 -32 -60 -75 -73 -61 -32 -3 -7 -1 20 33 47 61 75 72 70 67 65 62 59 57 54 33 11 -10 -31
20986 -31 -37 -42 -47 -53 -63 -74 -84 -95 -105 -116 -126 -137 -123 -110 -96 -83 -71 -60 -32 -37 -84 -164 -234 -289 -280 -239 -217 -194 -181 -184 -197 -177 -140 -104 -47 -22 -30 -37 -58
20978 -58 -62 -85 -140 -174 -207 -224 -209 -201 -210 -201 -175 -159 -144 -145 -146 -147 -148 -149 -151 -152 -153 -133 -113 -94 -76 -76 -108 -139 -137 -110 -66 -20 9 33 56 77 97 90 50 31 11 20 62
20970 62 83 104 137 138 147 173 186 198 230 230 194 158 120 82 60 38 17 -4 -32 -60 -88 -116 -158 -200 -207 -180 -141 -103 -95 -87 -66 -46 -60 -106 -138 -137 -137 -170 -192
20962 -192 -197 -212 -226 -244 -228 -187 -130 -87 -60 -48 -52 -51 -67 -119 -188 -236 -283 -328 -319 -260 -184 -114 -44 -9 25 60 95 100 106 112 117 85 52 20 -12 -53 -94 -153
20955 -153 -180 -178 -176 -174 -172 -184 -223 -278 -333 -367 -375 -353 -315 -290 -283 -265 -247 -226 -206 -185 -165 -153 -141 -130 -118 -122 -125 -140 -138 -137 -163 -187 -185 -151 -102 -60 -18 34 87 100
20948 100 85 58 15 -29 -57 -90 -123 -145 -129 -97 -82 -98 -130 -144 -120 -104 -114 -110 -106 -104 -102 -115 -128 -142 -155 -131 -108 -73 -55 -30 21 77 96 64 17 -21
20941 -21 -60 -86 -85 -99 -113 -98 -83 -69 -54 -28 -2 38 51 22 -7 -46 -68 -46 3 46 73 71 53 43 33 40 47 53 60 50 41 31 21 9 -3 -15 -27 -69
20933 -69 -110 -112 -87 -46 -4 36 77 84 53 34 31 38 44 53 62 59 73 94 87 47 7 -33 -74 -67 -59 -52 -44 -39 -35 -30 -26 -59 -93 -126 -160 -175 -190 -223 -223 -193 -163 -131 -99 -104
20925 -104 -109 -114 -119 -147 -176 -202 -229 -254 -247 -203 -160 -137 -114 -91 -68 -57 -47 -36 -26 -43 -59 -76 -93 -108 -124 -139 -155 -164 -173 -183 -192 -177 -161 -178 -194 -207 -204 -176
20918 -176 -116 -55 -26 -34 -75 -108 -124 -119 -114 -113 -112 -112 -111 -132 -152 -172 -192 -181 -153 -101 -16 63 110 120 97 68 39 8 -22 -31 -40 -49 -58 -60 -63 -65 -68 -37 -6 21 50 64
20910 64 45 -19 -101 -164 -195 -200 -189 -182 -175 -168 -161 -167 -189 -220 -218 -201 -183 -164 -144 -152 -160 -167 -175 -156 -138 -119 -100 -81 -63 -44 -25 -17 -8 6 5 -26 -90 -145 -183 -178 -140 -110
20902 -110 -96 -64 -31 0 32 53 74 95 116 121 126 131 136 87 38 -10 -59 -69 -80 -89 -98 -80 -30 17 32 28 -7 -45 -51 -19 13 47 81 78 74 70 67 29 -7 -42
20894 -42 -78 -102 -94 -69 -11 46 87 117 130 115 99 103 75 18 -4 3 11 -5 -55 -94 -117 -116 -83 -58 -50 -30 -10 8 27 -2 -31 -58 -86 -104 -90 -95 -99 -74 -48
20887 -48 -23 2 39 76 120 149 158 135 79 22 -17 -3 34 72 54 36 18 0 24 47 71 94 110 125 139 152 147 109 81 68 57 45 34 24 37 49
20880 49 19 -27 -50 -41 -19 3 13 24 35 46 35 24 13 3 9 32 62 60 29 -16 -54 -91 -111 -98 -94 -107 -118 -129 -141 -153 -138 -123 -108 -93 -69 -46 -22
20873 -22 1 18 36 41 14 -32 -47 -26 27 94 129 139 133 97 60 23 -14 -67 -120 -137 -122 -113 -105 -76 -79 -72 -48 -35 -23 -11 1 -17 -35 -50 -32 11 71 132
20866 132 177 187 143 77 12 -22 -57 -92 -110 -101 -60 -21 17 43 36 8 -35 -72 -110 -134 -157 -127 -97 -72 -48 -56 -65 -59 -54 -49 -43 -49 -55 -61 -67 -65 -63 -60 -58 -57 -55 -53 -52 -58 -64
20857 -64 -73 -81 -95 -142 -168 -194 -171 -116 -69 -39 -17 3 42 49 32 15 -2 -21 9 40 36 0 -37 -58 -54 -19 32 68 68 52 40 11 -17 -31 -2 25 54 83
20850 83 113 142 171 200 181 161 142 124 80 53 52 83 122 145 143 109 49 -9 -56 -71 -71 -71 -68 -66 -35 -4 27 58 42 25 11 -2 -9 17 33 32 24 0 -25
20842 -25 -34 -35 -36 -54 -40 0 38 86 117 86 0 -63 -111 -143 -158 -181 -204 -210 -216 -221 -227 -220 -213 -224 -203 -142 -82 -2 45 41 21 9 -3 -11 -19 2 24 29 1 -50 -119
20834 -119 -161 -170 -141 -80 -34 -4 10 9 -21 -85 -147 -178 -169 -134 -111 -89 -38 12 63 115 127 139 152 164 176 187 209 215 208 228 239 234 198 134 64 33 40 63
20827 63 80 96 111 125 137 150 170 163 131 73 15 -42 -85 -101 -97 -109 -125 -115 -74 -33 16 50 79 81 43 5 -4 -13 -22 -32 -33 -35 -36 -38 -39 -41 -42 -44 -49 -54 -57 -60 -58 -19
20819 -19 52 124 192 244 273 263 218 174 143 140 135 113 80 30 -7 -45 -84 -123 -141 -160 -177 -193 -218 -216 -192 -140 -100 -87 -89 -92 -95 -99 -92 -48 14 50 50 11 -38
20811 -38 -71 -84 -97 -80 -63 -46 -29 -37 -45 -53 -61 -73 -84 -95 -106 -101 -96 -90 -84 -52 -4 52 77 72 67 60 53 58 64 69 75 24 -26 -76 -126 -158 -175 -165 -122 -73 -23 -4 13
20803 13 15 17 -12 -43 -41 -40 -72 -137 -198 -226 -229 -216 -206 -196 -184 -173 -156 -139 -121 -104 -87 -70 -52 -35 -10 14 38 63 60 56 60 48 -4 -89 -172 -224 -222 -188 -164
20796 -164 -155 -179 -235 -290 -312 -293 -240 -161 -65 9 51 77 70 54 37 19 0 -14 -30 -45 -60 -76 -91 -107 -122 -108 -94 -80 -67 -80 -93 -107 -120 -129 -139 -148
20789 -148 -158 -127 -97 -66 -35 -40 -45 -28 4 22 7 -22 -84 -144 -172 -185 -165 -118 -71 -47 -40 -53 -98 -136 -157 -154 -150 -146 -141 -117 -94 -70 -46 14 75 101 73 12
20782 12 -47 -46 -46 -47 -49 -51 -53 -62 -71 -81 -90 -96 -101 -106 -112 -148 -185 -177 -136 -75 -46 -60 -74 -90 -74 -21 46 103 128 126 92 51 27 -7 -42 -71 -84 -94 -71 -26 -13 -45
20774 -45 -77 -72 -67 -63 -58 -40 -22 -4 13 32 51 59 83 93 70 67 64 32 0 -32 -64 -87 -111 -134 -158 -143 -129 -115 -102 -107 -129 -159 -157 -124 -75 -25 8 11 -2 -9
20766 -9 -16 -41 -98 -168 -183 -182 -182 -178 -174 -166 -158 -150 -142 -153 -163 -119 -58 -36 -45 -75 -89 -67 -13 23 4 -48 -85 -69 -53 -55 -57 -58 -60 -83 -106 -129 -152 -191 -230 -236 -242 -255 -267
20758 -267 -233 -166 -122 -78 -48 -51 -72 -126 -182 -205 -212 -219 -192 -164 -114 -64 -77 -90 -99 -75 -24 59 138 184 173 108 24 -59 -100 -108 -107 -106 -103 -100 -90 -80 -70 -60 -68
20750 -68 -77 -67 -89 -120 -151 -184 -217 -212 -207 -202 -196 -213 -230 -245 -260 -255 -218 -199 -180 -167 -155 -142 -129 -96 -63 -95 -127 -125 -123 -122 -120 -118 -116 -114 -112 -138 -163 -142 -87 -65 -43 -21
20742 -21 1 26 20 -33 -86 -105 -124 -143 -162 -183 -204 -225 -245 -239 -233 -225 -216 -213 -178 -161 -144 -152 -160 -168 -176 -159 -142 -126 -109 -109 -109 -110 -112 -131 -183 -214 -246 -248 -219 -207 -196 -174
20734 -174 -152 -131 -109 -143 -177 -212 -246 -313 -380 -412 -390 -303 -216 -158 -100 -76 -53 -29 -5 -32 -60 -87 -114 -150 -186 -221 -257 -234 -212 -201 -223 -234 -213 -168
20728 -168 -91 -32 -28 -98 -168 -234 -267 -253 -239 -229 -219 -208 -198 -203 -209 -215 -220 -212 -203 -176 -182 -194 -206 -239 -239 -200 -160 -119 -78 -68 -58 -63 -100 -146 -191 -192 -160 -124 -88 -84
20720 -84 -81 -69 -89 -155 -220 -258 -264 -256 -247 -211 -175 -106 -37 43 124 140 155 159 163 135 106 57 7 -9 -25 -14 -2 7 16 13 -22 -59 -62 -50 -38 -6 -6 -12 -18 -5 -26
20712 -26 -62 -66 -90 -115 -118 -121 -124 -127 -118 -109 -114 -151 -201 -250 -236 -223 -225 -228 -263 -298 -331 -363 -351 -307 -246 -219 -202 -185 -156 -110 -86 -96 -106 -100 -82 -49 -21 -9 -20 -31
20705 -31 -25 -18 -66 -131 -146 -130 -122 -131 -135 -122 -109 -111 -119 -94 -71 -81 -109 -153 -198 -227 -233 -223 -221 -219 -216 -213 -210 -207 -207 -206 -206 -206 -208 -210 -148 -85 -12 60 86 79 89 99 108 116 156 197
20696 197 190 151 100 48 -12 -56 -76 -62 -35 -8 32 56 43 -2 -43 -84 -112 -108 -97 -86 -105 -125 -152 -179 -193 -175 -136 -113 -90 -51 -46 -73 -81 -89 -93 -98 -124 -167
20689 -167 -199 -198 -152 -105 -58 -12 41 79 87 63 47 47 53 58 65 71 124 177 229 282 335 388 441 493 521 549 575 601 632 631 627 656 708 726 679 600 590 656 706
20681 706 702 638 541 461 381 304 260 262 265 263 262 261 260 225 190 157 124 101 111 103 95 61 28 -5 -38 -50 -61 -91 -89 -68 -48 -7 0 5 10 13 16 35 54 74 93 96
20673 96 99 83 100 126 152 180 208 251 294 338 381 473 565 657 749 832 915 998 1081 1176 1272 1418 1596 1817 2092 2441 2888 3453 4115 4918 5906
20667 5906 7083 8444 9971 11748 13988 16696 19512 22229 25355 29448 34116 38295 41869 46171 51918 57784 61859
20664 61859 64814 69042 74847 79520 81072 81647 84082 87582 88614 86238 83699 83235 83065 80096 74834 70347 67611 64594
20661 64594 59543 53680 48981 45444 41679 37144 32794 29393 26676 23948 21145 18705 16820 15260 13754 12329 11131
20657 11131 10191 9391 8629 7964 7439 6990 6511 6031 5637 5340 5074 4775 4446 4148 3940 3731 3520 3309 3100 2891 2724 2589
20653 2589 2482 2408 2330 2252 2176 2100 1999 1898 1797 1696 1637 1579 1522 1465 1394 1356 1365 1373 1390 1407 1377 1314 1258 1202 1144 1085 1105 1124 1141 1159 1177 1163
20647 1163 1149 1167 1212 1257 1320 1351 1340 1297 1251 1239 1287 1335 1384 1432 1462 1459 1476 1493 1557 1653 1731 1809 1859 1909 1937 1888 1803 1718 1673 1660 1614 1536 1475 1415
20641 1415 1328 1208 1089 1002 958 913 871 828 798 768 738 707 709 711 648 584 531 478 472 498 536 574 631 656 641 610 587 563 526 488 451 414 384 354
20634 354 335 300 284 300 307 297 275 253 231 210 172 167 188 225 260 280 307 335 341 314 306 298 290 282 255 262 310 359 407 455 496 483 446 408 347 270 226 236
20627 236 274 311 351 392 392 392 392 392 393 393 393 393 390 387 384 381 375 368 362 356 358 360 328 263 205 179 188 230 268 274 282 322 369 416 432 414 402 422 453 484 482 448 402 356 323
20618 323 322 303 284 281 278 275 272 267 262 258 253 275 297 318 338 330 289 257 242 236 230 204 161 127 125 147 186 224 246 233 203 202 200 197 195 205 215 171 127 98 69 72 75 73
20610 73 71 69 67 37 7 -22 -52 -32 -13 5 24 37 51 64 78 64 50 37 23 -24 -72 -117 -163 -188 -181 -134 -55 18 91 152 179 188 180 171 177 191 205 219 232
20603 232 215 166 128 107 111 147 185 190 177 164 149 135 121 108 94 81 67 54 40 27 30 33 24 32 49 34 38 41 50 58 67 76 61 62 73 52 0 -37 -40 -27 -13
20595 -13 0 33 33 -1 -37 -38 -7 34 76 120 164 151 138 125 112 96 80 77 107 158 193 184 176 154 131 110 89 44 16 15 46 79 111 145 180 210 241 272
20587 272 302 273 244 215 186 175 165 154 144 121 99 76 53 7 -38 -38 -6 7 5 12 20 20 3 -21 -14 17 50 82 115 151 155 112 69 44 19 -5 -29 6
20580 6 43 80 117 115 114 113 111 89 67 44 22 27 31 36 41 35 30 24 18 5 -8 -22 -36 -57 -79 -100 -121 -170 -202 -196 -158 -105 -52 19 59 49 22 5 -11 2 48 65
20572 65 99 178 225 214 148 79 27 9 25 62 115 169 207 223 223 229 235 209 151 111 71 26 -19 -83 -114 -93 -72 -49 -26 -40 -53 -67 -80 -45 -10 25
20565 25 60 59 59 58 57 48 39 29 19 19 2 -23 -16 8 34 61 88 80 71 62 53 44 36 27 18 -3 -25 -46 -66 -56 -13 11 35 49 62 74 87 116 128 104 48 17 3
20557 3 -30 -47 -37 -10 7 26 36 47 76 72 42 12 -18 -48 -98 -115 -85 -55 -60 -65 -70 -75 -49 -23 2 28 63 97 131 166 172 179 186 193 183 174 164 155 134 113 103
20549 103 77 50 55 86 150 238 309 314 264 193 121 94 98 70 42 16 -9 -15 -20 -26 -32 -15 1 18 35 25 15 5 -4 -7 -10 -19 -13 23 92 162 198 197 179 168 157
20542 157 121 85 61 20 -50 -87 -97 -75 -35 4 47 89 109 130 148 166 178 157 134 143 127 79 34 23 43 95 130 164 164 132 117 103 70 38 5
20535 5 -26 -26 -26 -7 -21 -63 -106 -114 -90 -44 2 17 33 43 54 64 74 86 98 111 125 127 161 177 193 197 201 172 143 114 85 108 131 170 176 127 78 48 50
20527 50 89 127 162 198 199 167 135 136 149 161 178 195 212 229 199 169 139 109 105 102 98 94 91 87 82 76 62 15 -31 -46 -64 -83 -99 -116 -130 -143 -155 -166 -137 -74
20520 -74 -32 9 21 0 -20 -8 31 72 111 150 139 74 23 4 16 61 89 118 145 173 198 223 200 144 106 68 22 -23 -14 -6 0 4 9 14 -13 -40 -66 -91
20513 -91 -97 -70 -61 -53 -34 -15 3 23 42 61 80 99 100 101 102 104 103 102 101 100 75 49 -6 -63 -114 -149 -157 -132 -58 15 75 102 118 101 92 99 114 129 143 157 153 116
20505 116 89 78 91 121 143 165 171 177 181 186 179 139 118 97 58 18 -20 -60 -56 -53 -49 -45 -15 15 46 77 83 90 96 102 136 170 203 237 231 226 220 215 193 171 149 128 125
20496 125 123 120 118 99 80 61 43 26 10 -5 -22 -54 -87 -120 -153 -152 -152 -152 -152 -147 -141 -103 -65 -13 38 54 37 -5 -48 -57 -33 3 40 76 112 110 53 -24 -101 -94
20489 -94 -33 16 32 20 8 -23 -22 15 53 93 134 136 138 140 143 130 118 106 93 65 36 5 -25 -44 -95 -147 -166 -157 -148 -136 -125 -109 -93 -77 -61 -61 -61 -61 -62 -57 -51
20481 -51 -46 -41 -50 -58 -34 -10 15 40 11 -18 -41 -65 -89 -113 -127 -141 -156 -170 -175 -179 -201 -191 -165 -138 -109 -80 -35 9 52 96 106 83 79 75 69 63 57 51 59 67 75 83 91
20473 91 100 108 116 132 148 164 181 192 203 213 222 230 206 144 50 -23 -65 -88 -79 -27 58 127 196 229 263 326 336 297 258 216 174 128 82 7 -68 -128 -134 -106
20465 -106 -62 -31 -33 -46 -59 -49 -5 36 46 25 -11 -59 -74 -60 -46 -30 -14 9 34 58 82 77 71 66 60 69 78 87 95 97 99 70 41 17 26 61 111 160 192 179
20458 179 167 186 204 223 242 230 219 177 135 90 78 93 125 151 177 202 227 216 171 135 115 76 20 -30 -65 -49 20 69 101 106 95 92 88 68 47 27
20451 27 6 -7 -20 -34 -48 -34 -20 -7 6 14 22 30 37 18 -17 -62 -74 -54 -33 7 16 -18 -52 -76 -118 -142 -135 -146 -158 -151 -144 -138 -131 -120 -109 -95 -82 -71 -27 -4
20443 -4 19 26 2 -4 -10 -17 -23 -48 -40 -5 30 86 110 92 74 54 34 51 68 85 102 103 103 104 105 92 79 66 53 40 27 12 -2 -27 -84 -142 -167 -131 -95 -57
20436 -57 -19 -13 -7 0 5 28 50 73 96 99 103 106 110 116 121 129 137 146 188 242 296 305 281 221 161 89 17 -19 -22 -7 6 23 40 53 65 78 91 76 62 47 33 23
20428 23 13 3 -5 -15 -25 -35 -45 -88 -131 -173 -214 -225 -203 -167 -131 -65 0 30 27 -16 -60 -106 -152 -139 -126 -131 -104 -59 -14 50 83 72 60 47 33 47
20421 47 60 74 88 71 55 38 22 5 -11 -25 -40 -49 -25 -20 -15 -8 -1 6 13 -8 -30 -52 -74 -93 -113 -149 -153 -106 -26 67 107 98 88 76 63 42 22 1 -19
20413 -19 -3 12 8 36 84 99 80 61 58 55 52 49 24 0 9 51 106 127 113 65 26 3 -6 -1 11 23 37 50 57 64 78 76 42 -23 -80 -120 -146 -155 -162 -184 -180 -143
20405 -143 -119 -110 -108 -138 -181 -224 -245 -233 -189 -145 -123 -156 -231 -305 -341 -323 -279 -202 -129 -72 -40 -40 -55 -70 -54 -37 -3 46 105 131 106 65 31 -3 -32 -62
20398 -62 -92 -122 -112 -102 -91 -81 -90 -100 -94 -57 10 78 111 112 87 62 35 8 16 23 31 39 23 8 -7 -22 -11 0 12 24 24 24 25 25 26 26 23 20 4 -65 -121 -144
20390 -144 -148 -119 -106 -94 -84 -75 -65 -56 -1 53 106 159 180 168 121 73 54 35 16 -2 -2 -3 -3 -3 23 50 77 104 101 98 94 91 88 85 81 78 58 37 16 -3 13 31
20382 31 48 65 82 99 116 132 122 111 101 91 110 130 148 166 132 65 18 -28 -34 -7 0 8 34 60 87 113 104 95 86 77 30 -16 -63 -110 -112 -114 -136 -126 -118 -143
20375 -143 -147 -151 -132 -112 -121 -131 -138 -90 0 91 134 144 138 132 140 115 55 -37 -92 -92 -49 -6 59 125 158 192 211 230 250 269 266 264 261 259 252 244 183 121 71 22 5
20367 5 -11 -19 -27 -36 -44 -34 -24 -14 -4 20 46 72 97 121 144 185 193 163 117 77 38 38 37 19 33 64 95 146 164 127 74 37 -16 -56 -96 -153 -178 -147 -83
20360 -83 -38 6 26 13 19 24 4 -15 -35 -54 -86 -103 -93 -51 0 35 37 23 18 29 63 97 110 124 137 150 115 80 47 14 21 60 98 103 79 38 6 -24
20352 -24 -28 0 9 20 54 88 119 97 24 -47 -87 -93 -87 -65 -49 -34 -14 4 24 43 61 78 95 112 128 143 177 177 178 179 178 176 178 181 169 126 75 41 50 59 54 50
20344 50 15 -19 -45 -39 -33 -59 -82 -104 -146 -155 -122 -72 -21 13 42 71 99 127 145 163 181 199 178 158 138 118 100 83 65 48 28 9 -10 -29 -21 -13 -19 -57
20337 -57 -129 -201 -217 -201 -176 -152 -158 -164 -138 -112 -53 4 46 87 136 168 148 95 62 29 28 60 73 86 101 116 131 147 161 176 191 206 251 297 316 320 297
20330 297 242 150 59 -10 -63 -79 -42 27 97 113 96 87 93 98 86 79 72 63 55 74 93 112 131 141 152 163 174 169 164 149 149 148 114 99 84 39 -20 -89 -125 -126
20322 -126 -110 -101 -93 -80 -67 -54 -41 -22 -3 57 133 194 200 171 126 106 87 67 46 37 28 19 10 17 24 31 37 44 51 58 64 74 83 92 101 73 44 15 -13 -49 -85 -119 -154
20314 -154 -191 -195 -161 -94 -21 35 67 67 32 -2 -25 -15 3 23 51 63 45 -5 -68 -130 -159 -133 -84 -35 3 42 66 57 18 -21 -30 -39 -19 0 18 36 47
20307 47 42 28 46 72 98 126 154 149 143 137 131 76 21 -32 -87 -92 -98 -103 -108 -113 -118 -124 -129 -104 -79 -56 -32 -17 -18 -29 -8 28 48 34 3 -33 -70 -108 -146 -188 -230 -237
20299 -237 -211 -194 -177 -140 -136 -162 -188 -181 -141 -73 -22 -17 -45 -72 -99 -129 -158 -176 -194 -209 -225 -190 -122 -73 -23 25 75 142 177 157 137 115 93 43 -5 -55
20292 -55 -104 -135 -165 -195 -226 -253 -280 -305 -329 -357 -352 -311 -270 -225 -180 -189 -199 -203 -207 -179 -150 -146 -141 -136 -132 -130 -127 -156 -184 -227 -237 -208 -180 -150 -86 -23 6 2 -2 26 88
20284 88 132 176 184 159 87 -17 -101 -132 -113 -61 -6 15 19 22 23 25 47 69 55 8 -23 -55 -57 -59 -75 -92 -106 -120 -115 -77 -39 -34 -39 -45 -52 -60 -68 -75 -83 -90 -114 -138 -162
20276 -162 -186 -150 -114 -78 -42 -41 -41 -41 -40 -56 -72 -86 -100 -87 -41 -14 12 42 71 101 130 150 169 187 204 193 150 106 95 101 106 114 122 129 137 145 152 144 136 127 118 104
20268 104 74 34 27 26 24 42 28 16 4 -10 -24 -10 3 17 31 18 5 -7 -20 -16 -12 -7 -3 34 72 117 146 143 107 45 -32 -97 -145 -158 -116 -60 -3 40
20261 40 52 42 17 -21 -76 -114 -98 -60 -21 6 33 28 23 48 73 104 120 123 93 26 -40 -88 -136 -158 -165 -151 -106 -57 -41 -26 20 66 79 74 69 60 51 44 4
20254 4 -15 -34 -25 15 39 62 69 76 83 90 60 29 0 -28 -34 -6 1 10 21 32 43 54 36 19 2 -14 -11 -9 -20 -63 -116 -152 -164 -143 -95 -46 -32 -50 -68 -86
20246 -86 -124 -130 -119 -108 -95 -82 -82 -81 -81 -80 -76 -71 -64 -58 -68 -45 22 89 117 113 63 14 22 63 86 108 133 157 182 206 223 239 210 148 105 78 40 2 -38 -79
20238 -79 -139 -166 -140 -115 -88 -60 -42 -23 -5 13 16 20 12 20 36 19 2 16 41 33 0 -66 -147 -212 -223 -234 -224 -215 -205 -196 -193 -189 -186 -182 -171 -159 -148 -136 -143 -150 -156 -163
20230 -163 -170 -177 -140 -70 3 43 39 35 21 6 -7 -21 -51 -80 -130 -147 -146 -177 -206 -202 -187 -156 -131 -107 -84 -45 1 16 3 -25 -57 -73 -89 -121 -152 -167 -169 -171
20223 -171 -169 -168 -184 -167 -103 -39 -15 7 47 58 30 1 -28 -58 -73 -88 -103 -118 -57 3 52 118 201 246 220 168 150 147 134 121 139 158 133 71 -15 -85
20216 -85 -116 -120 -117 -98 -79 -76 -86 -113 -141 -153 -135 -116 -97 -78 -76 -73 -70 -67 -46 -24 -3 17 51 85 118 152 169 187 139 91 80 68 56 43 22 -25 -79 -95
20209 -95 -96 -97 -95 -94 -77 -61 -43 -26 -11 19 56 66 74 81 86 92 98 103 109 114 109 105 100 95 90 85 81 76 83 89 80 99 154 208 214 193 167 141 129 90 31 -10 -21 5 60 98 92
20200 92 71 72 90 98 106 110 114 134 126 95 65 33 0 2 4 -11 4 43 83 91 100 138 177 150 123 92 62 32 1 6 12 17 22 14 7 -29 -66 -111 -102 -33 68 164 260
20192 260 312 331 327 323 335 315 269 223 207 246 329 378 360 308 251 194 170 146 130 146 175 204 218 199 136 72 15 -9 -7 26 67 76 72 69 45 22 0
20185 0 -23 -46 -69 -90 -111 -105 -66 -16 33 74 61 13 -34 -37 -40 -42 -45 -52 -59 -66 -73 -58 -43 -28 -13 1 16 31 45 46 46 47 47 48 48 49 49 30 11 -7 -26 -29 -32 -35 -38 -53
20176 -53 -68 -83 -98 -114 -129 -142 -155 -135 -83 -49 -16 -18 -20 -21 -21 10 70 128 159 146 116 94 72 46 21 -4 -30 -47 -65 -80 -96 -83 -42 -18 5 -3 -39
20169 -39 -74 -83 -60 -37 -29 -47 -76 -77 -30 16 47 79 109 138 123 70 31 9 -4 9 8 8 -6 -21 -36 -52 -48 -45 -42 -38 -27 -16 -4 6 3 0 -3 -6 -24 -42 -74
20161 -74 -78 -41 22 88 126 131 136 154 145 132 120 103 87 72 29 -13 -28 -26 -24 -20 -16 3 23 43 63 68 73 78 82 71 59 48 36 15 -5 -26 -48 -42 -36 -30 -24 5 36
20153 36 73 95 97 72 6 -75 -137 -184 -224 -237 -232 -243 -276 -309 -309 -309 -308 -307 -275 -216 -163 -126 -96 -65 -36 -6 60 128 193 259 245 199 189 147 113 80 44 8
20146 8 0 -6 4 -17 -74 -131 -155 -125 -69 -14 -2 -23 -34 -44 -57 -69 -63 -58 -52 -46 -56 -67 -77 -87 -113 -139 -164 -190 -176 -161 -103 -13 78 115 76 37 22 7
20138 7 -9 -26 -45 -96 -129 -162 -159 -156 -153 -150 -145 -139 -134 -129 -107 -85 -64 -42 -38 -35 -31 -27 -9 8 44 48 18 -11 -62 -80 -99 -119 -135 -151 -147 -111 -93 -75 -43 -11 20 53
20130 53 80 107 91 42 9 29 80 131 135 105 96 87 41 28 60 92 93 62 30 32 33 34 39 45 43 75 88 101 78 55 32 9 -19 -48 -78 -107 -87 -68 -48 -29
20123 -29 -25 -21 2 -5 -13 10 14 18 44 71 100 128 199 303 353 349 308 266 221 177 144 112 79 47 27 8 -10 -29 -32 -35 -38 -41 -42 -43 -45 -48 -49 -82 -95 -108 -96 -52
20115 -52 -26 0 20 40 60 80 103 127 168 178 145 113 78 44 -15 -75 -133 -192 -197 -171 -162 -154 -138 -122 -88 -87 -118 -150 -136 -90 -60 -30 19 37 10 -15 -42
20108 -42 -68 -125 -149 -125 -102 -87 -71 -56 -40 -37 -33 -30 -27 3 33 63 94 112 129 147 165 232 299 332 310 295 279 261 242 211 180 148 117 102 87 72 56
20101 56 41 26 10 -4 5 16 44 40 27 14 0 -14 -16 -17 -19 -20 -16 -11 11 1 -37 -77 -137 -164 -139 -114 -87 -60 -25 8 42 77 62 47 33 18 -9 -37 -65
20093 -65 -93 -73 -52 -31 -10 -20 -29 -39 -48 -39 -31 -40 -17 -8 0 10 21 5 -11 -29 -48 -47 -79 -110 -109 -93 -76 -40 -35 -44 -52 -82 -78 -68 -57 -26 -28 -78 -127 -176 -226 -212
20085 -212 -166 -135 -105 -58 20 96 140 154 114 50 -13 -59 -73 -51 -29 -10 9 42 109 167 226 250 242 236 230 251 217 124 -1 -98 -119 -76 -1 58 118
20078 118 117 83 67 51 42 32 23 13 43 72 101 131 133 135 137 140 94 48 1 -44 -60 -77 -112 -115 -99 -83 -65 -46 -47 -47 -29 -43 -70 -97 -126 -155 -146 -137 -130 -123 -115 -139
20070 -139 -166 -160 -119 -111 -158 -206 -255 -305 -320 -335 -323 -277 -198 -119 -57 -28 -16 -37 -85 -134 -148 -130 -112 -94 -74 -54 -15 24 63 103 121 140 158 177 167
20064 167 157 179 234 260 231 215 231 221 177 154 131 126 122 117 112 116 119 123 127 117 107 98 88 78 69 59 49 42 35 28 21 15 8 1 -5 4 15 26 36 52 67 83 98 135
20055 135 172 173 142 99 57 14 -27 -49 -39 -47 -55 -67 -80 -40 -1 29 27 7 -44 -95 -146 -197 -248 -247 -212 -196 -180 -146 -111 -77 -42 -27 -11 4 19 51 83
20048 83 115 147 143 138 134 130 118 106 94 81 60 40 21 2 -7 14 19 23 49 76 103 129 154 178 221 231 204 176 145 114 60 -9 -88 -135 -160 -184 -162 -107
20041 -107 -60 -46 -77 -107 -154 -200 -244 -288 -305 -289 -302 -298 -277 -272 -256 -239 -227 -199 -161 -156 -151 -146 -143 -139 -136 -133 -130 -127 -132 -138 -144 -149 -126 -102 -97 -59 -29 0 49 65 52 22
20033 22 -19 -27 -22 -17 -10 -4 -71 -154 -193 -178 -158 -139 -116 -94 -51 -8 32 73 88 70 62 70 94 134 185 202 195 187 178 168 158 148 139 129 132 134 137 139 125 112 98 84
20025 84 70 55 41 26 50 73 95 117 93 38 0 -36 -84 -132 -122 -96 -65 -1 54 94 110 127 143 158 127 96 65 34 -4 -43 -82 -121 -108 -95 -89
20018 -89 -66 -2 93 188 251 261 239 233 227 229 230 230 229 256 251 175 67 -34 -103 -128 -152 -169 -185 -201 -216 -190 -147 -95 -76 -80 -85 -92 -99 -67 -36 -5 26 39 52
20011 52 65 79 118 158 151 111 81 50 18 -13 9 33 56 79 85 92 98 104 118 133 147 161 140 120 99 78 48 17 -32 -48 -10 26 18 -22 -56 -107 -168 -198
20004 -198 -196 -195 -191 -187 -211 -235 -258 -282 -255 -229 -203 -176 -152 -128 -84 -73 -63 -37 -23 -8 0 6 14 21 40 59 78 97 78 59 40 21 17 13 9 5 -23 -53 -98 -111
19996 -111 -62 19 90 144 166 134 77 4 -57 -87 -70 -54 -39 -23 -8 6 0 -5 7 -13 -21 -29 -58 -54 -9 34 69 121 196 238 211 152 76 32 34 35 18 1
19989 1 49 98 107 116 125 134 159 184 143 103 84 66 78 91 74 24 -24 -41 -39 -36 -31 -26 14 56 50 12 -21 -56 -67 -61 -74 -54 11 77 114 119 118 101 67 18 -32
19981 -32 -66 -103 -139 -127 -83 -34 14 65 116 134 153 171 189 158 127 96 66 63 61 58 56 37 18 1 -15 5 59 92 125 151 145 157 169 171 172 172 171 161 119
19974 119 72 10 -65 -125 -146 -135 -116 -66 -1 63 111 127 96 65 43 21 0 -21 -40 -59 -78 -97 -115 -133 -158 -166 -136 -72 -19 17 14 -20 -47 -57 -54 -34
19967 -34 -14 -10 3 18 31 44 28 12 -3 -19 -35 -52 -68 -84 -74 -65 -56 -46 -53 -60 -67 -74 -77 -79 -81 -83 -67 -51 -53 -23 28 79 140 184 182 148 123 114 142 186 189 138
19959 138 89 56 44 31 30 29 28 26 72 118 117 83 24 -33 -80 -93 -88 -83 -76 -68 -94 -119 -145 -170 -159 -148 -155 -130 -69 -8 18 13 18 23 57 91 129 135 104 74 25
19951 25 -23 -70 -116 -144 -139 -152 -166 -139 -112 -85 -59 -26 6 36 67 88 77 85 92 55 17 -19 -56 -54 -51 -48 -45 -47 -49 -20 8 40 40 4 -32 -64 -97 -128 -158 -185
19943 -185 -178 -138 -98 -52 -38 -59 -79 -104 -97 -75 -53 -18 16 51 86 97 108 67 26 6 18 64 109 142 141 157 173 174 142 128 114 98 82 66 50 29
19936 29 8 -12 -33 -27 -21 -17 -13 -29 -78 -106 -134 -123 -79 -54 -28 -4 20 43 65 68 39 27 16 0 -18 -35 -53 -67 -81 -93 -105 -99 -60 12 84 98 78 78
19929 78 77 85 93 102 111 109 123 145 134 109 67 23 -4 -26 -47 -68 -88 -66 -43 -20 1 38 75 76 45 3 -37 -66 -62 -31 0 30 60 96 98 65 31 26 21 16 11
19921 11 12 12 13 13 30 47 63 80 91 102 113 123 100 76 53 30 -1 -16 -4 39 89 140 178 184 160 137 111 85 74 62 51 39 12 -15 -42 -70 -90
19914 -90 -110 -75 -41 8 58 105 152 140 74 38 3 -7 -18 -29 -39 -34 -28 -23 -17 -3 10 24 37 24 11 -2 -15 -20 -25 -29 -34 -33 -31 13 74 96 87 63 40 0
19907 0 -40 -88 -119 -95 -39 15 38 52 34 -21 -77 -132 -187 -177 -167 -148 -130 -111 -92 -47 -3 39 83 132 165 160 122 94 66 36 6 -11 -29 -47 -65 -29
19900 -29 7 44 80 86 91 98 104 127 165 149 100 59 34 7 -35 -88 -141 -195 -249 -254 -259 -265 -270 -260 -250 -241 -231 -194 -157 -121 -84 -98 -113 -126 -140 -126 -96 -57 -49 -56
19892 -56 -46 -47 -48 -32 -16 0 16 11 6 1 -3 28 60 26 -6 -38 -69 -100 -131 -135 -139 -143 -147 -161 -175 -123 -71 -9 69 168 212 195 146 93 73 58 27 0 -11 -3
19884 -3 21 45 53 18 -48 -98 -148 -184 -220 -273 -294 -272 -233 -201 -169 -167 -165 -162 -160 -130 -101 -71 -41 8 59 110 160 123 85 47 10 -28 -68 -42 -16 -43 -70 -97
19877 -97 -124 -125 -126 -124 -122 -148 -121 -59 2 23 43 64 84 49 13 -21 -56 -33 -10 12 35 30 26 22 18 38 59 79 100 131 161 158 99 -16 -133 -188 -243 -257
19870 -257 -271 -285 -299 -286 -273 -260 -247 -272 -298 -323 -348 -353 -359 -364 -370 -359 -348 -337 -326 -311 -296 -282 -267 -225 -183 -141 -99 -86 -73 -60 -47 18 84 85 86 68 50
19863 50 32 14 20 25 30 35 -10 -57 -103 -149 -147 -145 -142 -140 -114 -89 -64 -39 8 57 102 147 177 154 96 38 -3 -44 -22 0 76 120 104 34 -19 -73 -129 -185 -197
19855 -197 -176 -139 -70 -23 -8 -37 -83 -132 -148 -138 -112 -80 -47 -14 18 15 11 8 4 -23 -52 -99 -113 -86 -60 -31 -2 9 22 34 47 42 36 31 26 35 44 71 66 49
19848 49 33 14 -3 -22 -40 -58 -75 -94 -97 -90 -115 -132 -133 -147 -161 -167 -206 -257 -308 -342 -345 -311 -277 -260 -242 -225 -208 -188 -167 -146 -126 -106 -86 -48 -42 -67 -92 -119
19841 -119 -146 -117 -87 -76 -33 26 69 133 181 180 179 177 176 147 117 88 59 47 34 21 8 -31 -71 -107 -144 -135 -72 -33 -10 6 -8 -16 -7 -18 -29 -40 -50 -60
19833 -60 -70 -81 -91 -71 -51 -30 -10 9 29 47 65 81 64 65 66 73 81 88 95 113 130 148 165 155 145 136 126 131 137 140 144 128 79 49 18 -1 -22 -24 -59 -123 -186
19826 -186 -266 -314 -288 -207 -137 -99 -56 -13 27 69 97 126 154 183 195 208 218 228 193 126 48 24 42 93 159 226 273 287 265 244 218 192 199 206 190
19819 190 174 158 143 94 46 -2 -50 -91 -131 -136 -108 -36 35 52 36 2 -32 -32 0 63 127 157 154 150 146 88 30 -10 -19 -45 -72 -97 -123 -148 -173 -198 -224
19812 -224 -249 -274 -282 -289 -294 -300 -264 -195 -147 -98 -81 -96 -93 -90 -62 -34 -6 21 63 105 145 185 153 89 42 -3 -51 -99 -130 -129 -124 -86 -21 59 139 187 218 217 206
19804 206 195 181 168 163 158 153 148 133 118 121 91 43 -4 -55 -105 -118 -130 -142 -155 -124 -93 -62 -32 0 31 51 88 125 130 152 174 151 96 36 -40 -121 -202
19797 -202 -246 -257 -227 -164 -131 -131 -147 -147 -134 -106 -67 -29 9 48 72 95 118 142 127 113 98 83 79 74 69 64 76 87 99 111 116 122 127 133 109 85 61 38 22
19790 22 6 -41 -88 -142 -180 -190 -169 -119 -69 -52 -67 -54 -24 3 15 0 -14 12 56 82 76 46 0 -34 -37 -27 -16 1 18 36 54 70 87 121 123 105
19783 105 88 68 48 29 10 -7 -26 -18 -10 -3 2 4 -26 -38 -51 -49 -47 -45 -43 -23 -3 16 36 39 43 46 50 46 43 39 35 8 -19 -10 30 83 137 156 143 122 101 79 56
19775 56 41 26 11 -3 -9 -16 -24 -32 -49 -82 -123 -132 -88 -28 25 78 98 118 138 158 140 122 104 86 72 59 45 32 10 -11 -32 -54 -52 -50 -46 -43 -48 -20 7 2
19767 2 -47 -97 -126 -101 -72 -58 -65 -72 -49 -25 -2 20 14 8 2 -3 0 3 7 10 30 50 69 89 86 83 80 78 39 0 -55 -79 -67 -38 -7 8 32 73 104 134 135 135 136 136
19759 136 99 61 24 -13 -22 -32 -59 -53 -39 -8 34 44 46 64 71 77 77 77 78 79 97 132 174 185 163 126 98 70 45 53 52 34 44 54 61 68 46 -9 -54 -83 -83
19751 -83 -67 -57 -47 -32 16 55 77 80 83 85 86 68 49 -31 -113 -151 -157 -138 -85 -73 -115 -134 -136 -117 -97 -122 -180 -257 -318 -343 -336 -309 -283 -254 -225 -164 -103 -88
19744 -88 -106 -115 -107 -120 -117 -74 -31 10 51 62 39 44 33 -5 -44 -84 -125 -144 -164 -184 -204 -245 -286 -280 -242 -199 -156 -111 -65 -22 21 64 108 135 163 190 217
19737 217 198 179 161 142 95 49 57 81 79 45 10 8 25 9 5 17 18 20 41 29 -34 -98 -162 -225 -267 -276 -293 -326 -369 -396 -386 -343 -277 -211 -208 -205 -190 -174 -189
19729 -189 -149 -79 -10 28 12 -74 -160 -203 -214 -197 -180 -172 -147 -111 -108 -150 -192 -202 -212 -221 -231 -218 -204 -191 -178 -138 -98 -61 -23 5 1 16 30 7 -15 -38
19722 -38 -61 -51 -40 -30 -20 0 3 -28 -93 -144 -163 -156 -117 -37 25 52 47 29 12 -7 -27 -62 -98 -131 -164 -209 -220 -162 -71 12 64 71 78 78 77 77 76 86 95 104
19715 104 113 95 77 59 41 23 5 -12 -29 8 46 81 117 181 213 204 180 149 85 20 -11 -8 -5 0 5 -5 -16 -28 -39 -41 -44 -30 -44 -82 -104 -99 -67 -35 -20
19707 -20 -26 -32 -26 -19 -24 -67 -130 -193 -218 -217 -201 -170 -145 -121 -99 -77 -55 -33 -35 -38 -41 -44 -75 -107 -105 -103 -93 -83 -19 44 102 145 177 182 158 107 62 32 25 35 38 40 54
19699 54 96 137 151 146 140 133 126 134 142 164 158 116 57 -8 -47 -54 -61 -67 -74 -77 -107 -138 -141 -112 -83 -52 -22 -17 -12 -6 -1 -4 -7 -10 -13 14 43 72 101 122 143 163 184 182 181 179 177
19690 177 159 141 123 105 106 108 110 111 106 100 84 84 80 48 24 16 -2 -20 -36 -52 -45 -11 6 23 43 36 46 57 56 88 131 173 197 165 90 16 -39 -63 -39 1
19682 1 23 28 42 56 56 24 0 -8 -17 -43 -68 -76 -70 -64 -57 -50 -15 18 52 86 109 132 152 173 152 99 63 28 15 1 -30 -30 -20 -11 0 11 16 22 28 33 22 12 1
19674 1 -9 -30 -52 -63 -89 -110 -98 -32 33 61 56 17 10 19 -4 -60 -116 -134 -119 -90 -62 -69 -76 -81 -86 -77 -36 -12 10 10 10 10 10 24 37 83 129 160 191 168 145
19666 145 113 80 59 22 -19 -29 -4 20 6 -6 -20 -34 -39 -44 4 53 84 114 111 109 78 48 28 -6 -17 3 6 8 -1 -11 -19 -27 -50 -41 -18 5 4 4 -39 -115
19659 -115 -194 -218 -186 -121 -89 -90 -89 -55 -53 -50 -46 -41 -23 -4 32 36 35 34 31 28 25 22 17 12 3 -38 -62 -85 -73 -60 -48 -35 -19 -2 16 35 36 69 84 99 120 142 164
19651 164 185 184 183 181 180 145 110 139 167 160 120 65 11 7 4 31 58 86 81 31 -18 -73 -95 -91 -55 -4 13 -12 -39 -53 -66 -80 -94 -112 -130 -148 -165 -149 -133
19643 -133 -116 -100 -45 8 61 113 94 43 10 -22 -57 -93 -128 -163 -163 -164 -164 -165 -138 -111 -87 -62 -54 -78 -84 -90 -91 -93 -125 -158 -172 -153 -90 -26 55 104 105 106 110 98
19636 98 76 87 100 112 146 146 102 59 15 -28 -58 -55 -25 36 106 159 177 162 145 129 111 93 91 104 127 117 65 12 5 30 69 107 137 183 193 171 168
19628 168 164 160 156 151 147 142 138 133 129 96 63 32 1 -36 -40 1 43 41 39 37 34 36 38 39 40 17 -21 -68 -83 -80 -60 -28 -30 -21 -13 -6 0 7 13 20 27 12 -1 -15 -30 -17 -4 8
19619 8 21 15 8 2 -3 -11 -19 -28 -36 -46 -56 -99 -141 -202 -263 -259 -254 -250 -245 -241 -236 -201 -166 -99 -32 20 56 55 21 -21 -64 -94 -92 -89 -86 -81 -75 -68 -61 -53 -46 -41 -36 -16 -23 -52 -80 -118 -140
19610 -140 -127 -87 -53 -36 -26 -32 -29 -27 -61 -95 -126 -156 -167 -129 -66 -4 21 9 -33 -77 -104 -104 -119 -134 -126 -118 -108 -98 -67 -9 47 77 65 38 18 0 -9 -2
19603 -2 -12 -61 -125 -152 -126 -101 -90 -80 -70 -59 -61 -64 -66 -68 -68 -68 -69 -69 -63 -58 -35 14 73 133 154 148 138 112 72 15 -54 -108 -132 -129 -115 -85 -32 20 45 43 35 10
19595 10 -17 -7 13 33 39 45 19 -6 -59 -112 -132 -152 -151 -149 -116 -82 -70 -58 -46 -34 -20 -7 6 20 -2 -25 -49 -72 -57 -42 -28 -13 0 15 51 48 21
19588 21 -5 -57 -70 -26 16 61 107 104 101 97 94 99 104 108 111 75 6 -62 -98 -90 -82 -71 -61 -64 -68 -36 28 85 142 168 194 172 149 129 109 100 124 148 140 105 70 69
19580 69 101 129 156 172 155 99 43 20 30 72 113 142 139 130 121 142 164 167 170 173 176 153 131 111 91 89 120 130 141 123 72 40 7 -34 -77 -120 -163 -156 -150 -107
19572 -107 -32 53 139 203 212 215 219 219 219 238 258 293 296 247 165 51 -30 -63 -64 -8 47 100 98 50 -28 -103 -123 -100 -76 -53 -30 -21 -44 -48 -51 -24 3 26 49
19565 49 70 91 67 9 -29 -68 -93 -117 -140 -163 -130 -64 0 32 44 39 50 44 2 -56 -123 -157 -156 -122 -105 -88 -75 -63 -30 18 61 49 15 -19 -24 -28 -66
19558 -66 -103 -119 -135 -118 -101 -75 -48 -56 -64 -72 -112 -175 -221 -245 -252 -235 -218 -182 -146 -111 -75 -57 -39 -20 -2 -11 -20 -29 -38 -62 -86 -109 -133 -120 -106 -86 -82 -94 -139
19550 -139 -183 -195 -179 -147 -104 -93 -92 -90 -91 -92 -110 -127 -144 -161 -155 -149 -162 -142 -131 -137 -132 -126 -135 -145 -154 -163 -156 -149 -142 -135 -103 -71 -39 -7 -2 2 7 12 24 37 49 62 58 55 51 47
19541 47 65 83 100 118 119 120 122 123 133 142 152 162 123 84 45 5 -32 -71 -110 -148 -149 -150 -150 -151 -92 -34 31 80 75 38 20 2 -3 23 41 42 38 34 30 25 9 -6 -22
19533 -22 -38 -54 -70 -84 -98 -85 -39 5 18 18 18 50 114 158 169 144 86 36 3 -39 -82 -116 -118 -93 -51 -2 46 64 82 78 75 72 68 32 -3 -17 22 78
19526 78 101 102 86 75 80 76 71 81 92 102 113 107 101 95 90 51 13 -25 -64 -64 -65 -64 -64 -75 -69 -55 -73 -119 -164 -176 -155 -93 -31 0 32 35 38 8 -20 -30 -40 -18
19518 -18 4 24 45 65 86 83 80 108 136 171 174 130 69 26 14 27 56 78 66 32 -18 -60 -63 -34 -6 17 41 65 89 64 38 12 -13 -41 -69 -64 -59 -71
19511 -71 -83 -95 -106 -81 -56 -64 -72 -80 -88 -96 -104 -87 -69 -52 -35 -51 -68 -82 -96 -97 -70 -59 -48 -46 -45 -22 16 43 43 57 71 54 9 -27 -48 -59 -53 -23 6 4 3
19503 3 1 0 25 51 77 102 113 124 102 81 42 4 -40 -69 -68 -29 30 73 80 71 71 70 42 14 -13 -41 -40 -39 -38 -37 -66 -95 -92 -89 -82 -76 -100 -125 -130 -108 -58 7 51
19495 51 58 23 -28 -60 -53 4 62 91 92 107 122 105 61 17 1 23 46 70 95 147 199 219 200 155 110 95 81 81 81 82 82 84 86 89 91 56 21 -13 -48 -47 -46
19487 -46 -1 59 111 132 113 63 9 -43 -85 -93 -61 -29 4 38 93 147 188 195 172 149 146 158 162 133 90 48 39 30 22 13 4 -3 -12 -21 -39 -57 -61 -32 -4 24 54
19479 54 84 122 160 183 174 155 135 114 92 51 11 2 -5 16 39 61 83 103 122 141 160 182 203 192 180 136 93 49 5 8 11 14 18 10 2 -5 -13 -14 -16 -40 -80
19471 -80 -117 -121 -89 -25 40 73 60 32 -4 -25 -33 -25 -4 0 -17 -35 -34 -33 -32 -31 16 63 111 159 192 225 257 290 321 352 351 350 330 311 240 169 94 52 49 79
19463 79 108 136 167 198 185 171 158 145 146 148 149 151 136 121 106 91 31 -28 -103 -145 -125 -49 12 43 61 46 48 50 88 126 161 197 201 171 161 150 110 70
19456 70 30 -9 -45 -80 -134 -155 -113 -71 -27 16 57 98 158 185 180 175 199 222 251 248 188 129 79 61 58 55 42 29 50 104 159 182 172 161 133 106 78
19449 78 50 38 25 -5 -3 35 74 115 156 182 207 198 157 107 89 109 161 209 256 251 247 226 206 185 165 141 117 93 70 86 103 120 136 115 93 72 51
19442 51 73 96 119 142 147 153 123 60 -3 -67 -98 -96 -57 -18 19 57 81 51 -2 -55 -98 -141 -184 -227 -223 -219 -216 -213 -186 -175 -175 -142 -90 -55 -52 -65 -72 -46 10 68
19434 68 69 16 -24 -33 -21 -10 2 16 28 40 52 64 38 12 -13 -39 -57 -74 -81 -104 -136 -135 -154 -173 -140 -107 -76 -45 -11 -10 -1 24 24 8 11 -1 -33 -66 -97
19427 -97 -128 -127 -93 -77 -61 -43 -26 -8 9 32 55 86 100 84 36 -34 -88 -127 -133 -81 -28 -18 -8 0 10 14 18 21 25 13 0 -11 -24 -49 -73 -98 -123 -144
19420 -144 -166 -185 -204 -230 -223 -191 -142 -95 -80 -79 -77 -86 -94 -103 -111 -124 -136 -167 -165 -125 -86 -88 -124 -123 -89 -76 -63 -34 -6 40 54 30 7 -17 -43 -65 -86 -63 -7
19412 -7 11 -2 4 11 0 -11 -22 -34 -70 -107 -161 -182 -164 -130 -94 -75 -85 -110 -138 -150 -171 -209 -243 -262 -245 -195 -165 -134 -64 -27 -48 -124 -203 -266 -294 -289 -259
19405 -259 -229 -196 -164 -187 -209 -239 -252 -225 -166 -114 -79 -61 -42 -24 -6 31 69 107 145 145 145 145 145 138 131 143 121 63 4 -55 -116 -178 -241 -256 -239 -206 -173
19398 -173 -139 -104 -118 -132 -146 -160 -147 -134 -121 -108 -114 -121 -127 -134 -140 -147 -154 -160 -173 -186 -217 -215 -205 -194 -182 -170 -140 -111 -93 -59 -41 -56 -71 -54 -53 -84 -93 -102 -93 -52 -29
19390 -29 -6 -3 0 2 5 9 12 15 18 7 -3 -14 -26 0 27 54 81 46 11 -23 -58 -66 -74 -81 -89 -89 -89 -86 -84 -42 31 104 143 143 111 94 78 76 74 72 70 93 117 140 164
19382 164 149 135 120 106 100 95 90 85 53 21 -10 -43 -53 -63 -72 -82 -92 -102 -112 -122 -117 -113 -108 -103 -124 -144 -183 -189 -140 -90 -39 12 63 115 164 213 228 209 209 209
19374 209 183 158 135 112 89 100 137 207 251 263 230 197 190 182 175 167 183 199 214 230 213 197 180 164 103 41 -17 -76 -126 -143 -113 -83 -71 -59 -48 -36
19367 -36 -31 -25 -20 -15 5 27 49 70 43 15 -11 -39 -62 -85 -125 -132 -88 -12 76 165 185 151 92 34 10 -13 -38 -62 -52 -41 -31 -21 -19 -18 -17 -15 -30 -45 -58
19360 -58 -71 -80 -57 -52 -47 -37 -28 -39 -18 0 -13 -6 0 -14 -30 -30 1 64 127 156 152 140 128 113 99 99 99 98 98 98 98 97 97 103 108 114 119 98 76 57 37 12 20 28 3 0
19351 0 -5 -11 -17 7 32 76 86 67 47 25 4 6 8 11 13 15 18 20 22 25 27 30 32 51 69 88 106 93 80 69 58 55 85 95 105 114 91 68 77 80 84 57 31 12 -6
19343 -6 -67 -143 -188 -178 -133 -72 -8 40 62 53 37 21 37 53 82 127 162 141 86 31 5 -20 -39 -58 -44 -30 -26 -23 -53 -116 -182 -214 -212 -177 -138 -132 -149 -183
19335 -183 -206 -213 -206 -184 -143 -103 -95 -87 -114 -157 -177 -164 -143 -121 -98 -75 -63 -67 -82 -64 -12 23 13 -28 -59 -75 -67 -27 -3 -13 -43 -58 -33 -7 4 -16 -81
19328 -81 -146 -168 -136 -95 -54 -41 -29 -4 36 86 103 97 91 83 75 67 59 51 43 49 55 62 68 74 81 87 93 110 126 143 160 138 116 95 73 51 29 6 -15 -34 -54 -73 -92
19320 -92 -111 -130 -94 -59 -38 -17 3 24 41 58 73 88 83 45 5 -51 -124 -164 -177 -156 -93 -29 -9 -22 -40 -40 -7 59 114 153 202 250 243 203 175 163
19313 163 146 162 179 164 141 117 92 66 59 52 45 38 31 25 48 72 86 67 23 -53 -125 -142 -125 -108 -97 -53 5 63 107 151 163 174 167 161 155 148 144 139 134 129 152
19305 152 174 197 219 213 208 202 196 202 207 220 216 179 109 -6 -122 -220 -286 -280 -242 -194 -145 -95 -44 -36 -28 -21 -15 -7 -32 -56 -48 -11 24 63 102 129 157 202 216 185
19298 185 155 125 94 105 149 172 140 65 -8 -40 -38 -8 22 54 87 119 152 182 213 239 232 198 131 54 -4 -30 -22 -11 -17 -44 -71 -49 -27 -6 15 47
19291 47 78 108 137 174 178 146 99 74 82 104 125 126 127 128 129 111 94 76 59 68 78 87 97 102 107 112 118 123 128 133 138 148 159 169 179 173 167 161 154 157 159 161 163 137 112 87 62
19282 62 39 15 -7 -30 -65 -100 -89 -46 19 68 82 64 36 25 35 45 26 8 -38 -86 -103 -65 6 78 120 162 140 118 86 71 91 144 207 237 198
19275 198 127 56 0 -18 -5 5 17 28 39 26 -18 -64 -77 -74 -71 -64 -56 -40 8 38 68 74 80 84 88 76 32 -12 -23 -32 -41 -14 11 47 84 82 54 39 41 31
19268 31 22 11 0 -12 -23 -35 -46 -58 -69 -64 -60 -55 -50 -42 -33 -25 -17 4 27 49 72 78 84 80 38 -40 -103 -130 -142 -123 -78 -38 -15 -18 -36 -47 -57 -49 -40 -32 -23 -29 -34 -38 -42
19259 -42 -38 -6 42 90 125 144 133 95 40 -14 -33 -24 -18 -27 -57 -87 -124 -133 -103 -74 -42 -11 -12 -13 -16 -20 -55 -91 -129 -167 -172 -177 -184 -192 -199 -206 -173 -140 -107 -75 -43 -11
19251 -11 20 52 56 61 66 70 49 27 6 -15 -39 -63 -69 -48 -14 19 23 26 20 13 -24 -61 -74 -59 -50 -58 -74 -89 -88 -60 -52 -43 -33 -22 -7 8 11 -18 -62 -88 -90 -59 -21
19243 -21 17 57 98 110 122 102 82 78 74 70 66 89 113 103 94 102 109 114 119 122 92 50 9 -7 8 58 107 131 122 99 76 70 64 47 46 60 41 -9 -61 -84 -75 -29
19235 -29 15 27 39 52 64 31 0 -40 -63 -50 -5 19 45 63 48 10 -44 -73 -47 -12 5 -3 -28 -42 -57 -57 -25 8 9 -9 -12 18 65 97 128 128 128 121
19228 121 114 106 99 125 152 164 144 81 18 7 -3 6 16 26 36 63 91 83 43 1 -24 -37 -35 2 40 66 59 53 64 72 65 49 33 15 -1 -2 -3 -4 -5 29 64
19220 64 99 133 140 147 140 100 52 4 27 50 33 -37 -127 -184 -187 -158 -145 -132 -85 -37 9 56 76 97 117 137 107 78 48 19 -8 -35 -81 -94 -80 -66 -48
19213 -48 -30 3 70 149 174 166 157 145 133 148 163 177 190 157 92 48 3 -12 4 2 0 -13 -26 -40 -53 -67 -81 -92 -104 -73 -9 34 77 70 31 10 -11
19206 -11 -49 -87 -125 -163 -183 -203 -239 -242 -208 -141 -91 -40 -48 -55 -62 -69 -89 -108 -127 -146 -139 -131 -123 -115 -118 -120 -123 -126 -99 -73 -66 -28 18 33 65 98 141 151 124 64 8 -14
19198 -14 -25 -37 -11 13 25 3 -32 -69 -54 -38 0 39 46 53 53 54 55 55 52 48 45 41 24 6 -32 -87 -141 -168 -158 -148 -179 -226 -237 -200 -140 -80 -57 -60 -73 -86
19190 -86 -99 -112 -107 -75 -43 -39 -39 -39 -41 -42 -42 -42 -40 -38 -26 13 69 126 158 191 191 153 110 84 70 73 95 134 173 195 195 179 171 162 93 24 -44 -113 -134 -155 -176 -197
19182 -197 -169 -141 -114 -86 -108 -130 -150 -171 -194 -201 -179 -131 -85 -67 -64 -61 -38 -15 7 30 14 -1 -16 -32 -70 -108 -143 -179 -201 -184 -124 -48 -6 8 40 71
19175 71 57 42 30 17 26 61 97 105 129 152 163 190 195 173 176 164 161 158 155 151 146 140 135 131 132 150 146 110 63 48 67 86 70 54 38 21 25 28 32 35 19 2 -12 -27
19167 -27 -45 -47 -25 30 86 110 101 92 76 77 87 64 21 -21 -85 -116 -116 -117 -115 -113 -126 -139 -154 -168 -209 -266 -331 -362 -345 -295 -261 -227 -224 -220 -182 -111 -48 -17 0 -16
19159 -16 -46 -59 -69 -46 1 49 99 149 183 216 196 175 138 101 66 31 44 91 119 147 160 172 185 198 173 147 123 99 92 102 119 103 59 -17 -87
19152 -87 -140 -192 -244 -259 -242 -224 -206 -187 -167 -133 -100 -66 -32 -15 1 17 32 30 -3 -27 -35 -44 -37 -19 -35 -94 -154 -170 -132 -71 -10 38 56 78 101 108 83
19145 83 51 36 43 83 130 144 134 108 99 107 105 103 81 59 52 77 124 170 182 162 106 51 25 0 -19 -38 -58 -78 -98 -118 -138 -158 -162 -166 -169 -173 -152 -130 -108 -86
19138 -86 -58 -14 38 58 62 67 69 72 74 76 79 81 30 -20 -78 -120 -110 -67 -25 -16 -32 -80 -129 -146 -122 -83 -41 -16 -4 7 18 29 40 51 61 72 59 46 33
19130 33 19 41 62 82 103 116 114 86 26 -34 -62 -56 -51 -57 -62 -68 -74 -76 -78 -80 -83 -107 -131 -156 -180 -188 -196 -203 -209 -212 -182 -171 -159 -146 -133 -120 -106 -87 -68 -48 -29 -26 -23 -20
19122 -20 -17 -7 1 11 21 31 41 50 60 81 103 140 151 128 122 114 89 73 57 40 23 44 65 85 106 139 171 201 232 217 175 125 60 -16 -77 -109 -114 -117
19115 -117 -120 -121 -122 -92 -62 -33 -3 22 48 75 101 116 132 110 62 34 45 87 129 134 138 143 148 156 165 173 181 179 177 174 172 170 168 164 160 153 118 101 84 64 71 84 59 17 -24
19106 -24 -69 -113 -98 -82 -65 -48 -21 32 79 109 114 93 69 73 88 88 46 5 -10 11 45 78 89 99 77 54 25 -3 -32 -61 -53 -45 -36 -28 -47 -66 -116 -165
19099 -165 -181 -164 -121 -62 -4 36 43 33 19 5 -10 -25 -19 -13 11 3 -24 -52 -82 -112 -126 -140 -154 -167 -158 -149 -139 -130 -121 -112 -102 -93 -84 -75 -66 -57 -64 -71 -76 -81 -84 -54 -33 -27
19090 -27 -34 -25 28 81 85 88 92 96 109 138 176 182 189 197 202 207 209 211 213 215 251 288 289 257 225 193 161 129 114 131 130 129 130 131 132 133 133 133 133 133 105 78 51 24 26 29 30 32 49 50
19081 50 25 -30 -95 -127 -120 -81 -37 23 86 133 162 191 184 143 85 26 -1 -29 -14 1 16 32 53 74 41 8 -22 -53 -83 -114 -99 -84 -71 -57 -40 -50
19074 -50 -55 -44 -32 -37 -47 -30 0 31 64 96 69 42 14 -12 -44 -76 -108 -141 -123 -105 -66 -11 37 48 18 4 19 34 -7 -77 -129 -143 -120 -70 -26 1
19067 1 7 13 23 32 42 51 44 37 14 18 24 14 15 15 31 48 64 80 102 125 147 170 174 179 166 126 71 16 -7 6 26 46 68 90 90 91 91 91 75 59 43 27 29 31
19059 31 49 41 12 0 -32 -48 -36 -24 -11 1 30 59 89 118 96 75 53 32 26 21 16 11 29 47 65 83 85 87 89 91 63 36 1 -16 0 42 78 99 97 78
19051 78 59 55 69 83 98 113 76 39 4 -30 -53 -49 -60 -71 -62 -53 -60 -40 -27 -31 -13 -12 -23 -19 -24 -30 -7 14 36 58 68 62 49 63 70 61 62 64 50 37 24 10
19043 10 13 16 19 22 24 26 28 30 -15 -62 -109 -155 -139 -123 -107 -91 -62 -33 -4 24 22 19 -26 -88 -128 -141 -137 -134 -129 -124 -119 -114 -85 -56 -60 -64 -100 -136 -142 -109 -68 -54 -76 -99
19035 -99 -96 -94 -91 -88 -90 -91 -82 -89 -71 -26 1 28 57 59 65 87 86 57 44 32 56 80 102 124 126 100 90 80 68 56 44 33 52 70 88 106 135 147 153 185 211
19027 211 221 242 263 265 267 284 274 232 189 144 100 93 87 83 78 71 97 104 111 116 121 124 127 122 83 0 -82 -137 -159 -134 -109 -84 -60 -35 -10 -19 -28 -37 -46 -75 -104 -132 -161
19019 -161 -151 -142 -133 -123 -110 -97 -84 -70 -84 -98 -112 -126 -98 -70 -42 -15 29 73 117 162 175 188 202 215 183 152 123 93 57 54 96 138 166 162 111 59
19012 59 -4 -69 -88 -75 -54 -66 -75 -52 -33 -14 -24 -33 -27 12 94 177 221 210 123 37 6 7 54 100 113 93 90 86 65 12 -21 -54 -60 -33 -7 -13 0 15 27
19004 27 39 76 113 148 182 176 136 116 95 79 64 48 33 34 34 35 36 9 -16 -43 -70 -80 -91 -101 -111 -69 -26 14 55 96 104 44 -48 -112 -121 -106 -75 -9
18997 -9 72 112 97 80 63 43 23 -1 -25 -49 -74 -88 -102 -116 -130 -144 -157 -171 -185 -152 -118 -84 -51 -17 15 49 83 95 108 121 133 164 195 182 135
18990 135 102 102 81 61 54 48 42 35 54 73 92 111 70 29 -10 -51 -78 -104 -130 -156 -155 -155 -154 -153 -120 -88 -58 -28 -6 -17 -10 -3 0 4 7 11 15 19 22 26 40 53 65 76
18982 76 96 83 25 -32 -59 -54 -33 -13 13 57 109 129 87 46 4 -37 -38 -7 14 20 34 47 60 72 83 94 85 109 174 223 236 216 172 112 74 67 77
18975 77 86 97 108 122 135 148 162 166 171 175 180 164 148 147 178 235 293 305 285 252 218 183 147 144 141 138 135 132 129 125 121 120 102 75 80 83 85 90 94 108 122 136 150 126 102
18966 102 77 53 21 -11 -62 -80 -46 -12 23 59 74 90 106 122 120 119 124 114 79 12 -55 -91 -119 -148 -173 -197 -193 -156 -137 -118 -113 -109 -104 -100 -71 -43 -15 11
18959 11 -10 -48 -64 -47 -5 20 12 -27 -65 -69 -49 4 36 51 78 105 96 87 85 67 25 -49 -115 -165 -185 -204 -220 -236 -259 -249 -203 -140 -92 -60 -18 22 85
18952 85 132 110 33 -57 -148 -193 -206 -184 -129 -90 -52 -8 35 68 116 165 181 192 188 153 119 149 179 196 212 196 180 148 116 84 53 79 105 131 158
18945 158 168 178 188 198 160 122 84 46 24 3 -18 -40 -36 -33 -30 -27 1 29 74 86 49 -20 -80 -124 -140 -123 -105 -120 -134 -149 -184 -186 -147 -108 -68 -29 -13
18938 -13 -30 -29 -27 -16 -5 -39 -105 -163 -187 -186 -153 -101 -66 -85 -104 -90 -77 -30 15 39 63 85 107 128 116 113 127 129 132 135 138 112 85 58 31 53 76 98 120
18931 120 111 101 110 87 56 26 -23 -40 -2 51 95 140 183 194 177 129 63 30 42 54 29 4 -17 -40 -61 -48 -22 4 52 101 103 73 1 -71 -98 -92
18924 -92 -54 -15 24 65 61 57 72 54 18 -17 -54 -92 -106 -120 -122 -91 -41 -25 -53 -81 -112 -144 -176 -207 -226 -246 -263 -280 -279 -246 -231 -216 -174 -132 -90 -48 -34
18917 -34 -21 -40 -60 -112 -164 -169 -141 -122 -102 -82 -63 -68 -105 -142 -147 -126 -104 -80 -57 -33 -9 14 37 57 76 95 115 120 125 130 135 147 158 200 242 307 339 301
18910 301 231 173 147 134 121 122 124 126 127 97 66 35 5 -25 -56 -86 -117 -93 -68 -44 -19 4 28 53 77 97 117 137 157 202 247 289 331 320 255 181
18903 181 123 75 59 80 117 118 85 40 -5 -34 -64 -60 -57 -48 -39 -44 -81 -107 -118 -116 -98 -68 -37 -39 -40 -59 -78 -97 -116 -113 -111 -108 -106 -76 -46 -16 12 35 58 102 112
18895 112 123 166 189 212 222 232 242 252 246 239 233 226 177 129 80 31 -1 -33 -66 -98 -100 -103 -105 -107 -109 -111 -113 -115 -95 -76 -56 -36 -44 -51 -57 -62 -70 -44 -19 -27 -80 -133 -142 -118
18887 -118 -76 -50 -67 -101 -127 -120 -79 -22 35 59 57 21 -19 -61 -90 -87 -88 -89 -56 -22 -12 -1 -21 -41 -50 -25 11 47 75 70 51 32 34 35 37 39 50 61 70 79 109
18879 109 107 57 -7 -21 -3 29 61 83 121 168 181 156 114 71 45 36 44 43 43 5 -31 -68 -106 -151 -195 -240 -284 -280 -276 -273 -269 -281 -308 -344 -347 -307 -251 -213 -158
18871 -158 -92 -57 -4 49 72 96 126 140 118 63 19 -8 2 47 82 101 93 69 63 40 -6 -54 -118 -150 -146 -109 -37 33 81 75 23 -28 -57 -86 -83 -79 -60
18864 -60 -42 -23 -4 13 31 48 66 84 102 120 138 119 99 80 60 68 76 83 91 102 112 123 133 160 187 213 240 226 212 198 184 170 156 142 128 134 140 146
18857 146 153 133 128 133 105 82 59 34 8 21 34 47 60 42 24 6 -11 -28 -46 -64 -82 -69 -55 -42 -28 -48 -68 -87 -106 -147 -171 -160 -94 -2 89 161
18850 161 179 176 191 201 196 170 144 117 90 54 17 -18 -54 -74 -94 -114 -134 -73 -12 45 104 133 129 136 159 179 216 263 278 241 204 167 130 143 189 215
18843 215 241 270 284 273 229 174 152 143 133 103 74 45 15 -9 -34 -58 -83 -92 -101 -109 -118 -98 -77 -57 -37 -16 3 23 44 50 56 61 66 44 6 -41 -57 -72 -103
18836 -103 -121 -139 -149 -127 -71 -14 -5 -29 -67 -104 -124 -145 -132 -120 -107 -93 -80 -67 -46 -26 -26 -43 -64 -53 3 76 119 129 105 80 70 60 47 35 12
18829 12 -42 -97 -119 -102 -84 -65 -45 -10 24 66 91 85 46 24 2 -21 -45 -70 -95 -90 -102 -124 -113 -95 -93 -91 -72 -77 -99 -109 -119 -132 -113 -104 -110 -114 -117 -139 -129
18822 -129 -100 -70 -38 -6 31 69 105 142 178 181 149 117 74 31 -9 -50 -75 -67 -75 -83 -39 37 102 152 172 159 155 167 170 173 196 186 159 148 126 103 77 52
18815 52 26 0 -23 -47 -71 -95 -81 -68 -22 22 51 65 53 8 -43 -79 -81 -66 -35 -3 35 58 42 -6 -54 -69 -54 -5 35 59 70 80 90 99 92 85 79
18808 79 72 77 82 88 94 127 176 234 260 231 203 172 142 139 135 132 129 157 185 213 242 243 244 245 246 234 221 207 193 151 77 -8 -40 -18 3 28 54 21 -10 -28 -14
18800 -14 7 28 -2 -34 -67 -100 -101 -101 -70 -39 -8 22 -4 -31 -57 -84 -89 -94 -98 -103 -89 -76 -62 -49 -30 -11 38 88 124 127 73 18 -9 -37 -31 6 40 41 8
18792 8 -24 -28 -33 -39 -45 -75 -137 -179 -221 -261 -269 -293 -317 -298 -246 -210 -174 -138 -68 -20 28 59 57 -2 -62 -89 -117 -145 -173 -189 -205 -221 -237 -216 -194 -190 -154 -108 -61
18785 -61 -49 -69 -104 -138 -175 -211 -180 -150 -121 -92 -59 -59 -59 -26 -1 24 49 74 67 27 -37 -118 -176 -200 -186 -139 -70 -1 31 32 6 -51 -92 -133 -186 -223 -213
18778 -213 -171 -111 -85 -81 -93 -110 -94 -65 -37 -27 -18 -9 0 6 13 20 28 35 42 49 56 46 35 25 14 3 -6 -17 -27 -26 -26 -26 -26 -30 -51 -92 -80 -52 -25 5 36 9 -18
18770 -18 -53 -72 -62 -20 13 31 61 91 109 143 170 164 178 191 187 182 177 173 153 133 113 93 108 124 128 149 160 139 93 31 -16 -48 -66 -68 -81 -94 -70 -14
18762 -14 49 114 147 181 204 226 217 207 187 166 146 125 101 76 63 33 -3 -6 -18 -47 -73 -67 -26 14 44 75 73 71 61 50 40 29 18 8 -21 -19 -3 -3
18755 -3 7 18 27 37 47 57 44 32 20 8 12 16 21 25 71 117 164 210 237 264 248 215 173 164 168 117 46 8 -16 -41 -67 -59 -16 26 61 97 99 102 79 56
18747 56 35 14 11 40 51 62 54 47 40 32 41 50 59 68 108 149 187 226 244 230 235 239 240 240 241 241 240 239 237 236 238 240 209 179 136 93 105 117 100 84 67 50 75 100 125
18739 125 150 180 209 246 267 255 211 184 157 110 63 18 -26 -41 -23 -23 -23 -14 -4 4 13 -2 -19 -16 -46 -82 -103 -90 -60 -23 12 35 26 0 -27 -23 -20 -20 -20 -21
18731 -21 -21 -56 -91 -127 -162 -135 -108 -81 -55 -58 -62 -33 -4 24 53 49 45 43 41 38 36 59 82 104 127 148 168 189 209 201 192 183 175 175 175 143 110 66 21 0 34 84
18723 84 134 134 133 147 161 142 123 105 88 71 54 83 113 139 166 170 120 82 76 71 66 30 -5 -18 -31 9 50 102 153 159 110 39 -31 -51 -72 -89 -107 -125
18716 -125 -142 -101 -59 -18 23 34 45 23 1 44 87 130 173 194 215 203 192 170 149 127 106 59 12 -35 -82 -106 -131 -101 -71 -54 -37 -74 -112 -158
18710 -158 -204 -195 -187 -116 -45 23 38 -4 -46 -92 -138 -145 -152 -126 -100 -79 -57 -36 -15 40 96 137 146 141 135 127 119 110 100 90 80 69 57 45 33 -3 -40 -75 -109
18702 -109 -114 -85 -42 0 28 57 53 48 52 55 58 61 45 30 15 0 -5 -11 -17 -23 8 40 70 100 98 64 48 32 -2 -36 -101 -166 -206 -214 -185 -156 -140 -123 -140 -156 -176
18694 -176 -196 -217 -237 -239 -242 -212 -182 -173 -165 -154 -144 -110 -44 34 112 139 133 113 93 73 53 66 78 69 59 49 39 15 -9 -33 -57 -58 -59 -59 -60 -79 -98 -85 -71
18687 -71 -75 -79 -83 -87 -62 -37 -12 13 26 40 54 67 75 83 121 159 156 120 40 -40 -74 -77 -97 -118 -95 -72 -50 -29 -9 -21 -77 -132 -162 -137 -80 -24 -22 -73 -111
18679 -111 -116 -116 -83 -36 -43 -76 -108 -160 -180 -143 -74 -5 30 23 -15 -36 -56 -67 -45 -21 -29 -36 -10 -4 1 -20 -42 -63 -83 -72 -29 -6 16 16 -15 -29 -43 -43 -43 -42
18672 -42 -42 -71 -101 -131 -160 -163 -165 -168 -170 -164 -159 -151 -143 -111 -47 -3 39 94 116 68 -12 -33 -22 -31 -41 -50 -59 -68 -78 -101 -125 -167 -176 -151 -125 -98 -71 -73 -75 -59 -75 -97 -120
18664 -120 -144 -168 -191 -213 -254 -262 -211 -161 -110 -60 -47 -66 -67 -68 -126 -183 -194 -172 -128 -83 -39 5 28 19 -37 -93 -130 -168 -206 -244 -233 -222 -212 -201 -190 -179
18657 -179 -168 -158 -135 -113 -91 -69 -46 -24 -2 20 18 17 16 15 -8 -33 -57 -81 -115 -149 -136 -91 -50 -8 53 82 64 45 89 132 164 163 136 77 39 33 5
18650 5 -22 -61 -133 -184 -235 -228 -189 -168 -148 -86 -24 -10 -27 -61 -94 -64 -34 -29 -23 -18 -12 -12 -12 -12 -12 -28 -44 -61 -77 -87 -97 -107 -117 -139 -161 -183 -206 -257 -309 -314
18642 -314 -286 -254 -221 -187 -152 -131 -109 -70 -63 -75 -88 -102 -117 -97 -77 -58 -38 -45 -53 -60 -68 -44 -20 0 20 40 5 -81 -134 -100 -34 15 66 102 137 110 83
18635 83 84 118 149 147 92 -17 -128 -185 -174 -163 -148 -134 -103 -72 -41 -10 -16 -21 -27 -33 -22 -11 -3 5 22 6 8 11 11 12 12 13 18 23 30 37 43 80 100 119 126 133 141 148 153 158
18626 158 181 172 139 107 72 37 2 -32 -67 -101 -97 -93 -89 -84 -53 -22 7 36 24 -20 -47 -73 -57 -41 -27 -12 11 2 -52 -108 -102 -95 -89 -82 -79 -75 -69 -63 -38 19 59
18618 59 99 123 148 173 198 191 185 176 168 190 180 123 66 9 -47 -58 -35 -29 -22 -14 -5 4 14 45 44 30 50 46 43 25 -26 -77 -96 -71 -47 -20 6 3 1 17 0 -46
18610 -46 -93 -149 -188 -196 -171 -163 -155 -127 -99 -71 -42 -16 9 54 67 51 51 48 30 7 -14 -56 -66 -75 -84 -91 -98 -105 -112 -119 -126 -127 -128 -117 -123 -141 -127 -88 -15 59 102 75 16
18602 16 -19 -55 -110 -132 -117 -85 -52 -35 -77 -134 -182 -229 -274 -286 -269 -219 -163 -90 -6 44 62 80 103 109 64 -13 -90 -135 -139 -110 -97 -84 -86 -88 -89 -91 -70 -49
18595 -49 -28 -7 47 103 113 90 106 140 160 179 195 177 123 52 -27 -92 -110 -113 -137 -161 -182 -203 -188 -141 -114 -87 -99 -143 -176 -192 -179 -134 -106 -77 -31
18588 -31 15 61 108 133 158 183 208 174 139 105 70 45 20 -4 -29 -27 -25 -23 -20 -26 -32 -37 -43 -21 0 21 42 29 16 3 -10 -7 -3 0 2 28 55 81 108 107 107 106
18580 106 105 96 87 78 69 73 77 81 85 109 133 119 77 36 11 8 5 5 6 -24 -55 -104 -136 -138 -114 -80 -47 -12 22 11 1 -9 -19 -2 14 32 49 46 44 57 98 152
18572 152 190 193 181 170 160 132 78 9 -32 -31 -3 11 10 -11 -34 -39 -45 -18 7 41 58 67 49 15 -19 -22 -26 -34 -41 -49 -57 -44 -32 -20 -7 -22 -37 -52 -66 -70 -73
18564 -73 -77 -80 -85 -91 -80 -97 -101 -105 -127 -121 -95 -85 -65 -45 -35 -41 -56 -43 -1 14 -7 -28 -31 -18 0 -8 -34 -60 -51 -14 7 1 -18 -38 -42 -31 -38 -83 -141 -172 -167 -124
18556 -124 -77 -46 -20 33 88 127 143 159 155 124 64 -12 -84 -155 -226 -297 -341 -368 -371 -336 -254 -172 -104 -64 -57 -51 -46 -41 -47 -53 -74 -68 -30 7 62 89 84 79 72 65 85
18549 85 105 124 143 129 97 59 48 46 28 21 13 26 38 52 65 68 87 111 108 74 23 -20 -63 -70 -76 -83 -89 -118 -146 -174 -202 -229 -240 -222 -176 -121 -67 -3 44
18541 44 72 72 33 -6 -38 -70 -47 -25 -23 -20 -17 -15 -19 -24 -45 -94 -159 -207 -206 -178 -179 -179 -178 -177 -170 -162 -152 -142 -122 -69 -3 61 110 126 103 48 7 -17 -43 -85 -131 -160
18533 -160 -200 -240 -246 -252 -277 -269 -221 -174 -106 -71 -88 -106 -125 -145 -137 -130 -122 -114 -81 -47 -13 20 26 33 39 46 27 8 -10 -29 -32 -34 -37 -40 -15 8 33 57 55 52 49 47 33 19
18525 19 6 -7 -21 -35 -48 -62 -51 -39 -30 -20 -61 -135 -207 -247 -259 -254 -254 -254 -225 -163 -103 -75 -94 -146 -197 -216 -174 -99 -11 22 0 -39 -71 -104 -129 -139 -121
18518 -121 -71 -19 33 50 34 -6 -64 -113 -107 -54 0 40 49 27 -11 -59 -75 -29 48 116 167 192 163 91 19 -29 -24 4 33 30 27 24 21 21 22 22 22 6 -9 -26
18510 -26 -42 -10 20 70 87 64 42 30 50 84 84 53 22 -12 -15 -36 -57 -66 -75 -83 -92 -99 -106 -131 -123 -102 -82 -40 -32 -34 -36 -41 -45 -27 -8 -23 -37 -68 -99 -78 -57 -6
18502 -6 11 -9 -63 -122 -181 -185 -155 -115 -74 -31 10 20 29 38 48 54 60 46 65 111 125 104 49 23 29 67 105 101 64 46 28 -1 -30 -59 -88 -118 -147 -174 -201
18495 -201 -221 -209 -215 -221 -209 -197 -184 -172 -141 -109 -78 -47 -23 0 10 -12 -43 -73 -70 -34 -5 22 21 19 7 -4 -30 -89 -140 -191 -245 -298 -301 -303 -305 -307 -291 -260 -203
18487 -203 -114 -12 55 87 85 76 66 55 43 43 42 41 40 31 22 13 4 27 51 74 97 104 110 117 124 96 68 41 13 -14 -42 -69 -96 -88 -64 -29 -27 -51 -42 -54 -67 -76 -102
18479 -102 -138 -141 -127 -130 -121 -113 -86 -60 -34 -7 2 12 22 32 24 15 7 -1 -1 -2 -2 -2 2 7 12 17 6 -4 -14 -24 -10 20 59 65 42 3 -45 -62 -32 15 63 94 87 63
18471 63 39 31 54 93 133 156 168 164 125 70 35 33 31 -3 -45 -72 -52 0 36 57 67 59 17 -25 -32 -7 8 24 49 58 40 -11 -85 -142 -170 -166 -143 -87 -14
18463 -14 58 97 103 100 81 52 54 81 108 135 162 155 116 63 10 -28 -51 -47 -11 35 82 96 79 60 74 100 127 135 143 151 159 153 146 140 134 152 169 187 204 222 239
18455 239 257 275 257 239 221 203 173 142 113 85 59 67 108 149 162 142 99 73 69 82 105 95 45 -4 -56 -108 -132 -156 -166 -143 -88 -33 -31 -28 -50 -72
18448 -72 -93 -114 -130 -130 -106 -48 15 47 45 43 34 26 18 10 18 27 36 45 52 59 84 76 51 26 0 -27 -16 -5 5 16 21 25 29 34 46 58 71 83 82 81 79 78 77 75 74 73 88 104
18439 104 117 130 106 48 9 -29 -85 -142 -162 -150 -108 -65 -23 19 61 69 64 59 23 -12 -26 13 63 81 65 50 0 -50 -98 -147 -152 -125 -62 0 67 134
18432 134 187 207 177 146 114 81 74 67 112 157 200 212 208 205 184 162 141 119 104 89 74 59 61 62 63 64 67 69 71 74 92 111 129 148 158 168 181 193 214 267
18425 267 333 345 273 202 163 157 130 102 76 50 56 62 66 70 46 -11 -68 -92 -101 -109 -115 -122 -120 -118 -116 -114 -110 -107 -103 -99 -95 -92 -88 -84 -97 -109 -122 -135 -183 -232 -297 -329 -327 -293 -275
18416 -275 -257 -221 -185 -148 -112 -121 -131 -129 -144 -182 -188 -147 -90 -59 -44 -19 5 4 3 3 2 20 38 44 17 -37 -60 -51 -42 -48 -87 -116 -129 -113 -81 -57 -33 11 56 64
18409 64 40 -5 -50 -98 -146 -171 -196 -221 -246 -201 -155 -110 -64 -9 44 99 154 149 143 138 133 113 92 72 51 47 43 38 33 19 -10 -49 -55 -22 11 47 83 89 95 112
18401 112 113 111 141 152 163 166 169 139 109 81 53 60 100 175 250 281 258 207 156 114 54 13 5 -20 -45 -17 44 86 129 141 153 165 177 140 103 66 30
18394 30 22 14 6 -1 28 58 88 118 136 155 173 191 202 212 222 232 230 227 224 222 181 141 100 59 52 45 38 31 40 49 58 67 88 109 130 151 145 139 132 126 70 15 -38 -91 -166
18385 -166 -208 -209 -178 -142 -90 -26 3 42 81 117 154 161 169 176 183 143 102 55 23 31 72 95 119 144 170 195 220 220 219 219 219 191 163 136 108 71 34 -8 -35
18378 -35 -11 66 132 166 174 166 165 164 146 128 110 92 73 54 34 15 11 7 36 64 107 150 150 95 27 -7 -7 25 61 81 79 78 55 32 23 47 71 94 118 141
18370 141 148 123 106 106 105 105 124 110 69 28 -14 -57 -84 -111 -84 -57 -61 -64 -67 -69 -48 -10 36 51 25 0 -26 -52 -59 -34 -7 -13 -16 -3 -1 0 14 28 42 56 37
18362 37 17 32 79 114 115 81 15 -37 -57 -43 -29 -42 -56 -69 -82 -91 -101 -110 -120 -102 -85 -67 -49 -23 2 28 55 41 44 56 36 10 0 -20 -41 -42 -44 -45
18355 -45 -46 -61 -77 -111 -112 -53 4 45 118 194 239 236 217 205 192 179 165 139 113 86 60 20 -19 -60 -100 -91 -82 -74 -65 -99 -133 -165 -197 -227 -225 -239 -253 -253 -219
18348 -219 -152 -84 -41 -30 -75 -119 -148 -144 -114 -67 -23 19 53 103 128 122 134 147 157 168 178 189 195 201 208 214 194 173 150 127 85 10 -62 -102 -90 -45 -8
18341 -8 11 5 -17 -31 -46 -45 -44 -43 -43 -28 -14 0 14 -8 -32 -55 -79 -92 -105 -136 -135 -114 -93 -70 -47 -67 -86 -105 -124 -126 -129 -132 -135 -110 -86 -54 -39 -54 -102 -150
18333 -150 -166 -149 -131 -112 -92 -96 -99 -103 -106 -107 -107 -54 15 55 63 34 -9 -41 -56 -82 -107 -135 -164 -192 -221 -207 -193 -180 -166 -169 -171 -174 -177 -152 -126 -101 -76 -72 -67 -62 -58 -29
18325 -29 0 -15 -63 -122 -148 -106 -31 34 68 57 46 35 24 57 124 216 275 266 224 194 181 157 133 72 12 -43 -100 -119 -83 -59 -67 -62 -41 -31 -21 -25 -30
18318 -30 -65 -100 -137 -140 -97 -54 -21 11 11 12 1 -8 0 -24 -60 -95 -133 -170 -158 -145 -132 -120 -123 -127 -131 -134 -148 -161 -175 -188 -185 -183 -180 -177 -159 -142 -124 -106 -104 -101 -88 -91 -107
18310 -107 -92 -65 -38 2 11 -16 -60 -120 -164 -162 -144 -136 -129 -120 -112 -100 -88 -76 -65 -91 -117 -143 -169 -168 -166 -164 -162 -144 -126 -108 -90 -100 -109 -119 -128 -121 -114 -107 -101 -107 -114 -120 -126 -149
18301 -149 -172 -193 -214 -200 -153 -116 -95 -92 -89 -87 -84 -60 -36 -26 -49 -118 -187 -212 -204 -168 -132 -94 -55 -29 -3 22 48 44 40 35 30 -11 -70 -138 -173 -153 -134 -112 -90
18294 -90 -85 -79 -74 -69 -55 -41 -27 -14 -24 -34 -43 -52 -68 -67 -43 12 55 43 10 -23 -21 -18 -16 -14 0 15 30 46 84 122 157 193 224 223 207 191 175 158 98 22 -38
18286 -38 -67 -84 -101 -129 -190 -262 -334 -366 -345 -312 -295 -272 -248 -226 -204 -184 -165 -115 -64 -13 21 30 7 -31 -54 -55 -56 -65 -73 -82 -91 -59 -28 3 34 51 67 91
18279 91 98 76 20 -33 -55 -29 28 77 110 124 105 104 102 67 32 -2 -37 -71 -105 -146 -170 -149 -95 -60 -25 3 0 3 24 28 16 14 12 14 17 40 80 118 124 94
18271 94 31 -19 -37 -21 -6 10 28 45 62 47 32 -34 -101 -162 -189 -168 -131 -98 -65 -18 60 152 212 234 224 200 177 152 126 105 85 10 -65 -123 -182
18265 -182 -215 -231 -240 -217 -157 -96 -44 7 46 53 54 71 110 148 151 154 157 160 154 147 141 135 125 116 106 96 113 130 93 55 32 9 -13 -36 -34 -32 -42 -35 -34 -65 -87 -92 -68
18256 -68 -44 -20 4 29 54 79 103 135 166 204 226 236 213 153 93 72 52 32 12 18 24 11 31 65 99 133 167 171 141 131 120 100 80 60 41 59
18249 59 77 96 114 109 104 99 93 72 50 29 8 -12 -32 -52 -72 -65 -58 -51 -44 -19 5 30 56 62 69 94 86 31 -24 -89 -137 -140 -115 -107 -98 -107 -144 -173 -186 -204 -205 -205 -221
18241 -221 -226 -216 -215 -215 -211 -208 -220 -205 -156 -107 -57 -6 -4 -2 0 0 3 5 8 11 3 12 26 14 0 -14 -30 -47 -47 -47 -46 -46 0 45 89 134 133 106 94 82 64 47 29 11
18233 11 31 52 72 92 95 97 116 108 67 42 55 95 153 195 191 171 162 153 143 133 138 143 146 150 138 109 69 66 82 99 117 136 116 97 77 58 36 14 -6 -28
18225 -28 -23 -17 -11 -6 -10 -15 -17 -20 0 47 78 109 130 135 131 155 193 194 152 110 104 97 91 85 70 56 42 27 47 68 41 -17 -38 -59 -79 -100 -85 -38 8 22 40 59
18217 59 75 92 84 75 67 59 90 120 104 55 -2 -60 -73 -53 -39 -26 -73 -121 -137 -121 -123 -126 -103 -80 -57 -34 -35 -35 -36 -37 -38 -39 -40 -40 -5 30 66 102 100 98 96 94 92 90 88
18209 88 86 76 67 14 -71 -152 -179 -149 -85 -36 13 63 113 127 110 45 -19 -65 -112 -155 -198 -204 -155 -119 -115 -128 -141 -155 -170 -162 -153 -147 -141 -132 -157 -163 -168 -149 -129 -110
18201 -110 -90 -73 -55 -19 -16 -25 -35 -46 -58 -55 -52 -28 -38 -30 9 28 48 70 91 113 135 116 97 59 55 65 76 89 102 126 150 127 71 17 -35 -26 -16 -9
18194 -9 -2 5 12 5 -1 -27 -19 38 97 123 95 64 32 -2 -37 -63 -88 -114 -140 -139 -137 -136 -134 -118 -102 -89 -75 -69 -97 -106 -115 -121 -127 -133 -138 -107 -77 -109 -141 -129 -85 -41 -29 -39
18185 -39 -49 -59 -69 -40 21 81 109 115 89 79 69 66 64 80 64 -12 -88 -88 -34 39 113 155 143 124 105 82 60 29 -1 -32 -64 -95 -126 -155 -184 -151 -85
18178 -85 -38 8 26 44 60 76 97 87 31 -24 -83 -110 -91 -71 -70 -69 -68 -68 -63 -58 -53 -48 -42 -36 -30 -24 19 63 107 151 159 166 173 181 139 98 56 14 -42 -99 -163 -211 -229
18170 -229 -214 -170 -94 -58 -39 1 25 35 62 86 94 64 17 -19 -55 -64 -39 -24 -25 -25 -24 -23 -22 8 72 125 162 177 176 183 190 212 235 257 279 243 206 169 133
18163 133 109 84 60 36 60 84 76 14 -52 -86 -77 -67 -45 -22 -21 11 67 69 29 6 32 57 39 -11 -61 -79 -30 51 82 58 58 74 98 123 167 178 152
18156 152 126 101 75 68 95 103 111 112 113 113 112 102 60 36 12 12 11 10 9 13 16 21 27 27 60 147 217 233 216 206 212 182 135 98 62 58 54 50 45 76 90 69 16 -40 -65
18147 -65 -54 -26 12 51 55 26 1 -22 -49 -76 -73 -70 -67 -64 -61 -59 -56 -53 -50 -48 -45 -43 -34 -25 -2 52 111 170 185 145 72 -1 -43 -51 -43 -34 -23 -13 0 14 29 43 15 -11
18139 -11 -20 -62 -114 -166 -183 -169 -155 -142 -126 -110 -91 -72 -53 -34 -15 3 22 41 60 79 98 117 147 177 205 233 220 174 94 14 -23 -28 -19 -10 -17 -25 -30 -35 -60
18131 -60 -53 -9 34 49 64 79 94 118 143 167 192 189 186 184 181 175 170 143 150 156 130 124 119 117 116 115 113 112 110 107 104 79 22 -13 -50 -47 -11 5 22 27 32 37 42 -1 -45 -89 -133
18122 -133 -150 -167 -201 -203 -163 -106 -48 -5 13 33 52 71 63 54 46 38 44 50 56 62 67 73 79 85 44 3 -35 -74 -123 -141 -141 -109 -64 -35 -28 -20 -12 -4 4 12 37 61 32 2
18114 2 3 4 5 6 -19 -45 -60 -91 -122 -121 -94 -51 3 58 112 166 237 275 274 240 168 96 44 46 63 47 35 56 81 122 164 189 183 144 93 41 19 30 66
18106 66 118 162 174 159 129 109 90 69 49 41 34 26 18 34 49 64 79 95 110 125 140 106 72 38 4 0 -4 -9 -14 -24 -33 -21 6 55 72 54 36 18 0
18099 0 -17 -34 -47 -27 26 80 134 155 141 127 132 137 161 152 115 79 11 -55 -100 -90 -35 20 76 132 153 140 106 71 49 59 81 104 127 149 163 145 90
18092 90 35 -3 -42 -80 -117 -138 -126 -133 -139 -108 -77 -46 -14 8 31 54 77 91 106 118 131 126 88 50 45 72 99 146 161 113 64 16 -31 -46 -28 -29 -29 -21
18085 -21 -14 12 5 -33 -71 -112 -153 -147 -140 -134 -128 -96 -65 -47 -62 -74 -86 -66 -13 43 67 35 4 -21 -46 -71 -97 -111 -126 -159 -159 -143 -127 -108 -90 -56 -22 -22 -55
18077 -55 -71 -54 -24 4 40 76 76 43 -6 -56 -54 -52 -53 -54 -55 -57 -31 -5 20 47 66 85 60 20 -28 -50 -33 -17 -13 -8 -35 -62 -73 -58 -25 8 9 11 12 14 17 21
18069 21 25 28 13 -2 -17 -33 -21 -9 2 13 16 19 22 25 12 0 -14 -27 -24 -21 -18 -15 -3 7 18 30 27 25 24 23 38 69 107 117 98 78 57 36 31 26 21 16 18 19 22
18061 22 25 19 40 60 53 19 -30 -89 -120 -118 -117 -114 -110 -112 -113 -114 -115 -125 -134 -144 -153 -122 -90 -59 -27 -12 2 18 33 53 74 95 115 136 157 177 198 172 146 119 93
18053 93 83 73 63 53 17 -19 -69 -92 -54 10 68 111 113 87 76 64 59 55 50 45 43 41 40 39 43 63 91 86 50 -17 -85 -120 -114 -75 -43 -28 -14 0 12 25 11
18045 11 -2 -17 -31 -42 -53 -64 -74 -56 -38 -39 -8 16 24 53 65 47 30 11 -7 -21 -35 -48 -62 -91 -120 -116 -113 -122 -132 -106 -47 13 74 136 199 186 173
18038 173 160 148 115 98 84 103 120 105 59 13 18 77 155 200 191 166 149 131 130 130 129 129 131 133 135 136 155 173 189 205 191 144 115 85 55 8 -46 -68 -56
18030 -56 -27 -19 -43 -72 -84 -53 -22 -13 -4 -28 -52 -69 -85 -49 -13 -10 -40 -68 -64 -49 -17 -5 -26 -65 -72 -43 17 67 85 89 60 21 15 43 71 85 100 81 63
18023 63 50 37 23 10 -42 -95 -149 -202 -211 -221 -230 -239 -221 -203 -187 -171 -159 -179 -190 -184 -163 -142 -119 -97 -69 -42 -25 7 30 21 -22 -66 -68 -71 -66 -78 -113 -180 -246
18016 -246 -279 -234 -156 -87 -34 -22 -43 -47 -51 -64 -77 -89 -102 -97 -91 -104 -84 -38 7 63 102 106 78 23 -46 -79 -80 -89 -115 -150 -169 -140 -80 -5 53 66 47 16
18008 16 1 7 12 14 0 -25 -16 0 15 52 56 46 36 24 11 27 42 57 72 71 71 69 67 66 34 -10 -56 -85 -82 -43 -4 52 108 172 219 238 225 238 234 200 166
18001 166 131 95 43 -9 -80 -119 -116 -113 -108 -103 -124 -145 -167 -188 -229 -271 -330 -356 -360 -347 -285 -190 -79 14 82 118 130 126 128 129 119 76 34 25 31 52 86 88 72
17993 72 72 62 51 36 21 7 -5 9 57 104 118 115 96 76 72 84 113 151 157 131 89 35 14 44 73 70 34 -4 -26 -25 8 16 7 11 15 19 40 70 67 65 63 47
17985 47 -1 -48 -63 -44 -25 -2 20 11 2 9 16 21 27 16 -27 -69 -78 -65 -19 62 144 219 262 259 239 225 245 254 247 246 245 244 242 229 216 204 191 183 176 116 57 26 29
17977 29 45 61 42 22 3 -16 -26 -37 -47 -58 -82 -107 -132 -156 -184 -212 -225 -206 -151 -96 -95 -126 -173 -187 -168 -116 -71 -80 -130 -181 -169 -125 -99 -73 -77 -81 -83
17970 -83 -85 -81 -44 -8 -4 4 12 18 24 36 48 60 72 84 96 108 120 117 114 111 108 106 103 100 97 86 75 63 52 57 62 67 72 93 113 150 154 102 18 -47 -112 -151 -157 -181 -205
17961 -205 -200 -195 -158 -120 -92 -64 -91 -117 -138 -158 -166 -142 -104 -98 -104 -110 -115 -119 -123 -127 -137 -146 -157 -168 -144 -153 -199 -244 -247 -250 -221 -192 -157 -122 -87 -53 -35 -18 -2 12 19 -6
17953 -6 -14 -22 7 36 66 95 113 131 147 164 193 195 160 125 101 105 126 147 134 121 109 96 114 132 138 162 162 135 134 117 82 46 -5 -29 -22 -14 -5 3 -14 -32 -51
17945 -51 -69 -110 -151 -193 -234 -266 -297 -295 -254 -196 -122 -47 10 22 -2 -15 -12 16 62 99 136 148 159 170 181 176 171 166 161 148 135 122 109 124 139 154 169 184
17938 184 199 214 229 269 309 347 385 390 367 360 353 311 269 228 186 171 157 142 128 145 162 179 196 164 132 100 68 55 42 29 16 31 45 59 73 74
17931 74 74 73 71 79 59 11 -52 -104 -128 -136 -144 -123 -102 -82 -61 -60 -59 -58 -57 -18 20 57 94 93 65 43 37 32 27 23 19 -11 -43 -20 2 22 42 59 77 55 6 -27 -60
17923 -60 -94 -128 -177 -199 -188 -176 -163 -150 -137 -124 -111 -98 -84 -70 -56 -42 -12 17 46 74 87 72 73 73 68 62 79 111 142 146 122 82 38 10 -27 -65 -96
17916 -96 -127 -103 -80 -68 -57 -78 -100 -94 -88 -82 -76 -89 -101 -145 -188 -229 -242 -226 -193 -152 -110 -68 -25 -8 9 26 43 34 24 14 4 5 6 6 7 24 41 58 75
17909 75 89 103 117 131 127 123 134 119 89 60 28 -2 -6 -10 -14 -18 6 30 55 79 77 74 72 69 57 46 34 22 3 -16 -36 -56 -46 -36 -8 -12 -47 -82 -116 -151
17901 -151 -153 -121 -109 -96 -54 -12 29 72 88 105 120 136 143 133 114 127 180 232 254 221 182 176 213 251 251 252 219 187 141 95 50 4 -34 -73 -99 -93 -50
17894 -50 -40 -73 -105 -112 -87 -39 -7 12 17 0 -18 -29 -8 -5 -2 0 3 6 9 11 13 15 17 19 21 23 25 44 64 84 103 123 142 160 178 148 87 36 2 -2 24 43 47 39
17886 39 31 21 11 25 22 8 27 58 56 10 -36 -64 -92 -106 -88 -72 -56 -38 -20 -16 -12 -9 -5 16 38 68 81 42 -28 -79 -77 -47 -18 -38 -74 -85 -42 31 105
17878 105 154 149 111 74 52 63 95 111 94 44 3 -20 -18 0 8 17 49 64 44 -9 -65 -88 -86 -52 -20 -4 -23 -74 -110 -130 -138 -129 -95 -62 -27 7 27 47
17871 47 68 88 70 52 34 16 23 30 58 102 150 165 110 23 -49 -105 -148 -175 -191 -191 -180 -203 -240 -278 -270 -230 -167 -103 -70 -36 -6 24 7 -41 -73 -105 -139
17864 -139 -173 -162 -152 -141 -130 -91 -53 -14 24 46 68 91 113 147 181 234 254 232 211 187 164 122 81 39 -1 -5 -8 -11 -15 -12 -9 -6 -3 -27 -51 -75 -99 -86
17857 -86 -72 -59 -46 -49 -51 -54 -57 -49 -41 -32 -24 21 68 112 156 141 92 64 36 17 31 26 21 28 36 64 110 148 153 134 99 74 65 48 31 40 81 123 132 98 64 28 -7
17848 -7 -14 -21 -47 -41 -35 -46 -45 -44 -28 -12 3 19 46 73 99 126 125 125 124 124 99 74 60 30 6 15 13 -3 -17 -31 -45 -60 -89 -118 -123 -74 -5 63 99 103 88 72
17840 72 33 -21 -54 -54 -20 13 59 89 92 64 32 18 47 109 170 198 214 229 261 293 309 293 224 140 78 48 24 15 21 43 79 83 73 64 27 -8 -30 -20
17833 -20 20 60 48 36 44 51 59 66 87 107 128 148 172 196 238 248 220 191 161 130 93 57 74 92 101 109 85 62 16 -29 -41 -21 2 -7 -48 -89 -121 -120 -72
17826 -72 -7 46 84 108 117 96 75 53 31 55 79 110 124 84 11 -42 -96 -110 -92 -92 -92 -95 -98 -102 -105 -92 -80 -36 6 40 40 5 -30 -53 -76 -67 -57 -44 -31
17818 -31 -18 -4 10 25 40 55 43 31 20 8 13 34 64 62 39 17 -9 -35 -65 -127 -178 -213 -238 -231 -184 -104 -29 45 85 92 83 58 10 -37 -82 -95 -90 -52
17811 -52 -8 35 49 62 67 72 44 16 -9 -35 -78 -87 -67 -15 38 59 47 19 -20 -27 -15 -4 9 23 24 25 26 28 31 34 37 40 14 -12 -25 -6 29 49 23 -35 -84
17803 -84 -117 -125 -99 -37 41 120 182 213 212 184 141 89 70 97 141 162 167 159 134 105 75 45 15 -28 -71 -100 -97 -53 -8 1 -20 -26 -32 -40 -47 -43 -40 -54 -36 13 62
17795 62 78 61 22 -15 -56 -97 -111 -125 -140 -154 -152 -150 -148 -146 -137 -128 -118 -109 -91 -74 -57 -39 -18 2 23 44 69 93 81 37 7 -21 -20 -20 -13 -7 -1 5 19 33 47
17787 47 61 48 35 21 7 -6 -37 -88 -86 -66 -46 -23 0 19 38 55 73 80 54 28 35 71 106 110 81 51 53 80 124 172 220 255 257 239 222 202 182 143
17780 143 103 65 27 18 41 64 55 14 -26 -69 -112 -106 -100 -94 -88 -92 -96 -98 -100 -93 -53 -34 -14 -11 -41 -70 -67 -57 -47 -35 -22 -9 4 17 31 7 -15 -50 -68 -102 -169
17772 -169 -225 -264 -285 -289 -310 -314 -272 -214 -146 -110 -114 -119 -125 -132 -137 -142 -147 -152 -144 -136 -136 -119 -90 -28 67 163 221 225 192 143 102 62 20 -20 -51 -82 -79 -43 -8 -5 -46 -104
17764 -104 -142 -146 -116 -86 -67 -49 -30 -12 -6 -1 4 9 12 15 18 20 -14 -49 -83 -116 -103 -57 -12 0 -7 -30 -47 -63 -57 -51 -43 -35 -8 52 93 135 171 206 242 277 283 290
17756 290 312 302 244 153 62 4 10 48 77 91 97 87 86 85 101 132 153 119 56 -7 -37 -35 -17 0 6 -19 -57 -95 -103 -110 -89 -68 -47 -26 -23 -19 -16 -12 0 11
17749 11 22 34 35 35 36 37 29 22 15 7 7 6 6 6 14 21 29 37 56 76 111 114 66 -14 -85 -141 -170 -166 -128 -89 -76 -94 -129 -197 -279 -345 -355 -311 -264 -217 -148 -112 -107 -101 -98
17740 -98 -95 -75 -56 -36 -17 -44 -72 -100 -128 -148 -167 -187 -207 -200 -193 -187 -180 -146 -112 -78 -45 -10 23 75 94 60 10 -42 -78 -111 -144 -177 -209 -193 -176 -160 -143
17733 -143 -117 -92 -66 -40 -25 -11 2 16 68 120 136 119 84 48 44 39 9 -19 -67 -83 -80 -77 -74 -71 -73 -107 -174 -241 -287 -278 -222 -133 -51 -1 12 -5 -21 -4
17726 -4 47 130 199 214 207 199 164 129 94 59 27 -4 -37 -69 -85 -101 -117 -133 -135 -137 -137 -136 -117 -64 -1 61 72 29 -56 -109 -151 -193 -233 -273 -262 -251 -240 -229
17719 -229 -171 -114 -40 1 -17 -69 -102 -135 -151 -134 -135 -137 -79 -21 34 90 83 43 22 0 -1 -3 -24 -11 -1 8 22 36 64 124 165 205 238 239 258 277 258 240
17711 240 222 204 133 61 -8 -77 -144 -178 -151 -91 -48 -5 6 18 13 8 -27 -62 -91 -88 -70 -52 -18 15 47 78 80 55 31 34 52 86 122 142 145 147 149 151 136
17704 136 122 106 89 52 -11 -73 -108 -93 -41 6 27 28 28 28 28 61 110 164 191 173 139 110 81 44 -19 -81 -116 -102 -60 -32 -3 37 94 162 192 167
17697 167 115 76 36 24 12 0 -13 -42 -88 -137 -160 -127 -56 1 43 59 38 20 30 29 12 6 0 -31 -63 -109 -128 -97 -39 13 50 67 67 92 88 48 8
17690 8 -49 -79 -54 -29 -4 20 24 1 -14 -15 -10 -5 0 6 -3 -13 -23 -33 -43 -53 -63 -73 -58 -42 -27 -12 1 14 28 41 63 85 75 65 27 -9 -7 21 21 22
17682 22 24 26 10 -5 10 26 57 88 64 40 33 26 18 11 -2 -16 -30 -44 -20 3 27 52 36 20 6 -8 -19 -13 13 -12 -49 -70 -113 -140 -116 -93 -83 -106
17675 -106 -155 -204 -219 -201 -185 -170 -152 -134 -144 -153 -163 -172 -165 -158 -152 -145 -104 -64 -25 12 44 43 42 74 112 150 190 229 248 251 229 173 123 90 77 65 32 0 -33
17668 -33 -66 -90 -115 -139 -164 -139 -115 -90 -66 -86 -105 -124 -143 -197 -235 -224 -181 -110 -38 2 43 69 95 121 147 157 167 178 188 171 154 137 121 104 88
17661 88 71 54 36 17 16 -17 -89 -177 -274 -338 -324 -277 -247 -217 -170 -124 -56 28 91 121 106 92 79 83 96 76 56 35 12 -9 -15 -21 -45 -36 -19 -2 17
17654 17 36 37 38 39 40 41 42 44 46 92 154 224 260 242 192 158 123 85 46 -9 -33 -22 -10 -49 -105 -126 -94 -42 -22 -31 -39 -50 -60 -48 -36 -23 -11 16 43 78
17646 78 96 89 49 27 4 -3 -11 -18 -26 -10 20 61 69 47 26 2 -20 -29 -37 -46 -54 -36 -17 0 17 20 6 -17 -7 -17 -27 -35 -43 -13 16 44 72 92 80 76 89 118
17638 118 148 177 206 263 303 306 276 237 197 157 116 64 29 5 -51 -114 -144 -146 -116 -61 9 59 76 69 63 53 43 10 -49 -110 -143 -138 -132 -125 -118 -90 -62 -88
17631 -88 -130 -167 -178 -172 -166 -164 -162 -161 -159 -138 -117 -95 -74 -53 -31 -10 10 18 26 33 41 32 23 15 6 -40 -87 -133 -180 -204 -228 -186 -144 -94 -44 12 53 75 70 68 83 84 68
17623 68 63 58 69 81 76 98 137 159 192 225 219 213 207 201 159 118 76 34 30 27 23 19 -1 -21 -43 -65 -49 -48 -60 -34 -1 30 65 100 81 63 45 27 59 92 76
17615 76 33 9 12 30 48 26 4 -18 -40 -33 -27 -20 -13 7 28 32 63 92 94 113 132 128 123 103 56 11 3 65 153 206 228 267 306 288 238 188 171 170 170 169 168 115
17607 115 29 -35 -100 -120 -108 -114 -120 -85 -50 -26 13 55 64 84 120 158 197 256 281 258 236 211 187 149 112 75 38 -11 -44 -51 -26 0 25 19 -18 -49 -48
17600 -48 -12 22 53 84 114 145 151 157 163 170 167 165 163 161 122 82 43 3 1 0 -1 -2 -5 -8 -10 -13 -21 -29 -5 19 30 41 9 -38 -77 -83 -97 -128 -146 -132 -85 -38 -10 -13 -21
17591 -21 -45 -66 -70 -52 -34 -35 -36 -39 -41 -64 -103 -151 -166 -130 -77 -14 16 20 24 27 29 47 65 84 102 103 105 106 108 114 121 127 133 124 115 74 0 -61 -68 -53 -38 -22 -5 -3 -34
17583 -34 -49 -64 -49 -33 -40 -47 -40 0 79 159 206 254 306 326 309 293 247 200 187 173 149 125 101 77 71 65 59 53 72 90 106 123 119 83 66 48 31 14 -1
17575 -1 -18 -38 -58 -64 -37 -20 -2 -37 -72 -98 -125 -97 -69 -36 -2 0 3 16 61 106 119 103 86 68 50 4 -40 -84 -127 -130 -100 -89 -78 -48 -18 7 33
17568 33 31 -25 -70 -82 -99 -117 -132 -148 -170 -192 -212 -232 -189 -114 -60 -6 16 -15 -34 -21 -14 -6 3 13 9 6 2 0 -4 -7 -11 -14 -34 -54 -73 -93 -97 -100 -104 -107 -46 15 74
17560 74 133 166 166 119 73 45 18 -27 -40 -27 -13 1 17 64 111 158 205 203 201 197 193 138 51 -17 -86 -175 -264 -304 -312 -275 -206 -152 -99 -89 -78 -68 -57 -57
17553 -57 -57 -56 -56 -55 -54 -21 -41 -101 -128 -110 -91 -77 -30 61 153 228 270 254 184 113 75 61 80 122 163 172 126 81 36 -9 -55 -54 -21 -5 9 10 11 12 13 -10
17545 -10 -33 -56 -80 -117 -154 -127 -101 -64 -60 -102 -144 -148 -152 -155 -159 -144 -129 -113 -98 -119 -139 -179 -185 -159 -134 -106 -78 -59 -39 -20 0 12 25 38 51 37 23 9
17538 9 -4 6 16 25 33 3 -60 -122 -151 -137 -96 -60 -40 -25 -10 3 17 32 46 61 75 73 72 70 68 80 92 88 110 127 127 138 148 123 82 34 14 7 0 -21
17530 -21 -15 1 19 38 58 65 72 77 82 117 123 82 41 10 6 52 98 117 137 157 176 162 148 133 119 105 92 63 61 93 125 157 189 194 172 156 156 129 101 85
17523 85 53 29 32 18 5 21 38 43 65 82 72 77 83 104 124 145 165 161 157 153 149 143 137 113 116 141 128 75 22 -20 -36 -10 30 47 64 82 100 95 90 84 79 75 70
17515 70 65 60 48 35 22 9 -7 -25 -42 -60 -74 -88 -100 -112 -144 -143 -107 -70 -17 36 57 78 99 120 160 167 123 79 35 -8 -56 -72 -53 -35 -25 -47 -70
17507 -70 -60 -13 33 80 126 152 144 100 57 54 51 47 44 0 -44 -86 -129 -126 -91 -74 -57 -13 30 93 122 112 102 108 82 57 33 8 -15 -11 24 60 64 50 36
17500 36 18 0 0 -33 -66 -67 -39 -11 16 44 58 39 39 38 21 5 -27 -27 11 82 135 189 203 184 129 74 38 1 -2 -6 -14 -22 -29 -37 -54 -72 -59 -46 -27 -41
17492 -41 -90 -138 -109 -47 24 97 118 85 29 -27 -38 -49 -59 -70 -89 -108 -91 -41 12 65 97 75 36 -3 -45 -88 -87 -85 -84 -82 -81 -79 -78 -77 -86 -96 -88 -112 -146 -180
17485 -180 -180 -148 -138 -128 -135 -109 -46 15 79 143 160 176 222 268 266 210 132 55 15 7 14 21 6 -8 9 26 8 -9 -26 -44 -33 -22 -11 0 14 28 60
17478 60 60 33 6 -23 -52 -72 -92 -60 -28 -2 -10 -53 -96 -129 -162 -163 -163 -159 -154 -149 -144 -121 -99 -46 -47 -77 -108 -142 -175 -161 -148 -134 -120 -102 -85 -68 -51 -59 -67 -41
17470 -41 16 75 100 92 84 99 114 148 148 104 60 14 -31 -66 -102 -156 -177 -146 -115 -82 -49 -40 -31 -23 -14 -5 2 11 20 26 33 40 46 53 60 66 73 79 84 90 96 102 107 113 119 111 104 96 89 108
17461 108 128 148 167 173 179 200 194 144 93 41 -10 -28 -46 -63 -81 -61 -41 -21 0 -14 -27 -41 -54 -51 -48 -45 -42 -39 -36 -34 -32 -41 -67 -66 -39 2 27 18 -6 -26 -47
17453 -47 -83 -92 -59 -10 29 69 100 103 84 39 -20 -42 -21 15 33 24 8 -23 -69 -114 -144 -146 -124 -102 -79 -55 -53 -51 -49 -47 -45 -43 -41 -39 -36 -33 -30 -28 -25 -22 -19 -17 13 44 75
17444 75 106 88 69 51 33 7 -18 -66 -76 -49 -38 -24 4 29 54 78 102 106 81 57 60 63 65 69 74 94 114 135 155 155 154 154 153 153 152 154 155 180 237 293 315 286
17436 286 224 161 130 106 83 61 39 34 29 25 21 17 29 51 40 -7 -54 -68 -48 -33 -19 -3 12 39 50 51 85 143 201 224 215 185 154 121 88 62 35 9
17429 9 -17 -6 5 16 28 49 70 79 106 135 132 116 100 46 -6 -25 -11 16 28 19 9 8 7 7 6 -23 -53 -83 -114 -94 -75 -56 -37 8 55 77 45 -3 -53
17421 -53 -104 -156 -170 -151 -142 -149 -139 -129 -120 -111 -102 -93 -84 -75 -19 36 88 141 153 111 45 -19 -59 -98 -105 -112 -103 -93 -51 -9 22 55 34 12 14 17 -13 -43 -67 -91 -115
17414 -115 -139 -138 -137 -134 -131 -121 -79 -55 -31 -43 -56 -68 -80 -89 -97 -106 -115 -99 -83 -15 52 118 152 130 108 110 144 179 180 153 125 95 65 7 -51 -73 -63 -27 8
17406 8 46 83 97 111 125 140 141 143 145 147 121 96 70 45 35 25 15 5 11 17 23 29 53 76 99 123 130 137 144 151 165 179 191 203 185 134 101 68 21 -24 -69
17398 -69 -114 -128 -110 -109 -109 -121 -133 -145 -156 -119 -82 -45 -8 -19 -30 -41 -52 -46 -41 -33 -26 -24 10 57 50 18 -14 -68 -89 -73 -56 -19 -15 -6 1 -10 10 75 140 224
17391 224 275 281 254 244 234 193 153 112 72 17 -36 -57 -45 -22 -32 -54 -75 -61 -47 -32 -18 -9 0 9 18 11 4 -2 -9 -7 -4 -2 0 -27 -54 -81 -108 -118 -128 -148 -201
17383 -201 -230 -205 -157 -110 -103 -95 -88 -81 -90 -99 -94 -56 -1 54 75 64 37 10 13 16 -10 -37 -64 -91 -89 -87 -85 -83 -68 -53 -38 -23 -8 5 20 35 33 32 30 28 26 24 23 21 -13
17374 -13 -47 -80 -112 -103 -62 -40 -19 30 47 83 119 136 154 171 189 176 163 151 138 123 109 94 79 77 75 40 6 -38 -83 -92 -68 -12 43 102 160 149 138
17367 138 146 121 56 -9 -74 -139 -192 -211 -195 -179 -170 -160 -121 -81 -42 -35 -63 -90 -125 -126 -92 -58 -55 -53 -50 -48 -23 2 46 57 16 -23 -32 -8 42 60 44 28 58
17360 58 88 134 148 134 87 56 25 12 0 -13 -26 -17 -8 34 110 161 180 161 109 77 45 47 82 115 148 169 157 146 134 88 41 -6 -54 -70 -86 -53
17353 -53 -20 12 45 96 146 151 102 6 -88 -149 -177 -186 -163 -102 -40 28 98 131 132 123 114 121 96 48 0 -47 -96 -103 -77 -69 -62 -56 -49 -43 -37 -31 -25 -18 -12 -13 -13 -14 -15 0 16
17344 16 31 47 39 30 21 13 61 109 133 102 55 8 -27 -30 -4 20 16 11 -8 -27 -14 -1 29 60 90 121 103 85 68 50 48 47 45 44 28 11 -4 -20 -9 1
17337 1 12 23 40 57 89 95 55 16 -24 -65 -70 -74 -95 -89 -72 -72 -60 -48 -32 0 38 49 50 50 47 45 44 15 -12 -13 -4 4 15 26 21 16 11 6 28 50 72 94 99 104 108
17328 108 111 92 45 -16 -78 -123 -140 -128 -100 -83 -81 -92 -118 -136 -126 -79 -32 2 37 39 42 26 11 -4 -19 -35 -50 -63 -76 -73 -32 18 69 90 85 51 2
17321 2 -50 -75 -83 -92 -121 -150 -146 -142 -161 -180 -166 -152 -106 -59 -13 33 44 55 65 76 49 22 -4 -31 -26 -21 -17 -13 -22 -48 -82 -84 -54 -23 9 42 50 58 66 75 54 33
17313 33 13 -7 -3 0 4 7 -1 -11 -21 -31 -21 -12 -3 5 18 30 43 55 32 9 -11 -32 -32 0 31 31 32 32 31 30 15 1 7 -19 -38 -24 -30 -36 -10 16 42 68 102
17305 102 119 109 66 16 -48 -116 -167 -194 -220 -253 -269 -246 -190 -130 -53 36 93 123 98 47 -19 -87 -139 -155 -137 -83 -29 -9 11 31 51 50 49 49 48 34
17298 34 20 26 0 -48 -79 -122 -164 -179 -193 -205 -218 -213 -176 -157 -138 -113 -88 -63 -37 -33 -29 -6 -15 -32 -33 -55 -60 -44 -27 -10 7 14 22 29 37 23 10 10 42 98 138
17290 138 144 95 14 -66 -94 -91 -82 -105 -161 -217 -196 -143 -98 -70 -52 -34 -17 0 17 34 51 68 58 49 39 29 31 34 68 102 151 185 172 126 65 37 21
17283 21 5 12 20 28 36 19 3 4 -25 -66 -106 -167 -195 -179 -163 -145 -127 -106 -85 -64 -42 -46 -49 -52 -55 -74 -92 -111 -130 -140 -150 -161 -171 -135 -98 -64 -29 -10 -23
17276 -23 -36 -17 20 58 98 139 165 192 218 245 208 172 135 99 41 -16 -71 -127 -150 -141 -96 -51 -58 -66 -74 -82 -112 -142 -172 -203 -160 -116 -73 -30 -6 17 41
17269 41 65 43 21 0 -22 -71 -119 -165 -212 -208 -173 -155 -137 -93 -48 14 44 9 -25 -61 -96 -114 -99 -102 -106 -73 -40 22 85 121 124 69 15 -19 -53 -87 -122
17262 -122 -132 -142 -140 -105 -68 -64 -114 -163 -200 -204 -194 -184 -175 -167 -159 -151 -121 -91 -62 -32 -43 -54 -65 -76 -100 -125 -149 -173 -184 -195 -205 -216 -198 -180 -162 -144 -108 -71
17254 -71 -34 2 9 16 22 29 22 15 8 1 -25 -52 -98 -110 -67 -23 -14 -37 -41 -45 -51 -56 -66 -75 -84 -94 -83 -73 -62 -52 -28 -4 -10 -17 -34 -19 28 76 98 65 11 -43 -35 5
17246 5 44 50 13 -56 -106 -156 -151 -92 -63 -34 -17 0 34 36 40 43 44 45 66 86 106 126 131 136 143 150 167 216 265 281 261 241 217 193 186 146 70 -5 -57 -109 -125
17238 -125 -109 -104 -99 -92 -85 -66 -47 -29 -10 8 27 46 64 54 43 32 21 -11 -44 -77 -110 -102 -94 -53 -13 37 88 101 81 36 -41 -121 -169 -172 -175 -174 -174 -154 -101
17231 -101 -69 -37 3 11 36 60 71 49 -8 -66 -96 -125 -155 -185 -196 -207 -219 -230 -201 -171 -142 -113 -92 -72 -73 -40 -16 -25 -13 -1 -9 -17 -26 -34 -67 -99 -132 -165
17223 -165 -188 -212 -235 -258 -258 -257 -256 -255 -212 -170 -127 -85 -26 33 110 155 147 139 129 118 108 98 88 77 59 41 4 0 31 62 50 5 -42 -57 -51 -61 -86 -111
17216 -111 -104 -97 -66 -18 5 -3 -21 -39 -59 -79 -63 -48 -33 -17 -8 0 -10 11 22 1 -9 -2 0 3 7 11 10 9 8 7 -20 -48 -77 -105 -112 -120 -128 -136 -144 -151 -159 -167 -155 -143 -132
17208 -132 -121 -106 -109 -120 -99 -82 -64 -27 -22 -48 -73 -101 -129 -101 -73 -45 -17 6 29 51 73 93 81 24 -32 -74 -84 -58 -16 29 43 22 -14 -46 -45 -32
17201 -32 -18 -6 5 48 91 148 189 207 170 106 75 88 100 90 81 70 59 46 17 -21 -28 -21 -31 -30 -29 -12 3 -27 -90 -169 -248 -282 -283 -242 -201 -128 -54 -18
17194 -18 -15 4 24 37 34 -4 -76 -133 -158 -114 -38 16 39 79 120 149 146 103 45 -9 -80 -159 -205 -206 -173 -115 -74 -83 -92 -56 12 74 120 144 114 61 40 53
17186 53 82 137 175 157 140 133 127 120 113 129 145 161 177 167 157 165 140 98 56 -6 -36 -29 -22 -14 -5 3 12 21 30 47 64 82 99 112 126 158 158 154 167 155 110 39
17178 39 -15 -34 -21 16 53 48 10 -33 -45 -45 -45 -36 -27 -40 -69 -71 -41 -22 -19 -26 -49 -80 -78 -57 -4 62 75 48 21 1 -33 -40 -14 11 4 -1 9 38 68 108 116
17170 116 76 37 47 58 68 78 68 58 48 37 69 101 133 165 187 210 240 253 222 159 105 68 45 53 90 159 199 206 188 137 59 -1 -27 -20 6 32
17164 32 28 23 12 1 -9 -20 -38 -56 -105 -154 -190 -194 -151 -108 -71 -34 21 44 30 16 0 -16 -33 -51 -68 -86 -120 -154 -188 -222 -211 -200 -189 -178 -167 -156
17157 -156 -145 -134 -128 -123 -117 -112 -79 -46 -13 18 19 20 22 25 34 76 117 126 103 65 22 -4 -48 -126 -191 -239 -241 -211 -198 -184 -153 -121 -90 -58 -23 11 46 82 90 98 106
17149 106 114 87 60 34 7 14 22 27 32 47 30 -31 -93 -131 -136 -96 -56 -32 -41 -95 -148 -193 -205 -173 -140 -109 -110 -124 -138 -134 -97 -48 0 38 43 1 -40 -43 -46 -30
17141 -30 -48 -91 -135 -134 -100 -73 -45 -15 13 52 90 147 171 175 180 182 184 148 111 76 42 38 66 74 83 89 62 54 46 19 -6 -33 -59 -12 33 78 122 167 178 118
17134 118 26 -49 -124 -154 -152 -123 -95 -66 -37 -14 -23 -75 -128 -138 -94 -19 55 116 123 71 -11 -93 -142 -147 -151 -211 -272 -297 -269 -184 -99 -26 12 9 -26 -45 -65
17127 -65 -72 -79 -87 -94 -75 -57 -20 -16 -51 -87 -142 -165 -165 -164 -161 -158 -151 -144 -139 -134 -99 -97 -140 -182 -207 -199 -144 -90 -63 -37 -11 14 18 21 24 27 43 59 74 89 77 48 10 4 -1
17118 -1 -23 -34 -45 -49 -53 -57 -61 -46 -31 -15 0 31 64 85 123 157 158 179 199 191 182 174 165 159 154 148 142 158 174 158 141 95 49 37 58 74 57 17 -5 -31 -74 -107
17110 -107 -139 -126 -112 -99 -86 -85 -85 -85 -85 -85 -85 -85 -85 -74 -64 -56 -47 -68 -120 -172 -192 -157 -106 -62 -19 7 33 60 86 89 92 82 40 -13 -35 -25 -14 -22 -62 -103 -111
17102 -111 -120 -144 -157 -170 -160 -149 -138 -127 -133 -139 -144 -150 -152 -154 -156 -159 -145 -131 -116 -102 -42 17 74 132 160 154 115 76 48 53 72 92 67 43 19 -4 -53 -102 -115 -96
17095 -96 -76 -57 -35 -13 16 46 77 107 110 114 117 120 102 83 65 46 28 9 -8 -27 -27 -27 -26 -26 -12 2 14 26 54 49 29 9 -7 -25 -6 44 84 123 150
17087 150 145 123 101 110 119 144 168 193 218 245 272 299 325 298 270 242 214 208 201 163 124 88 53 52 83 128 140 98 57 42 59 110 162 180 165 115 64
17080 64 65 66 67 67 51 34 0 -3 2 7 15 23 22 22 21 21 28 35 42 49 56 63 70 77 69 61 35 41 56 71 88 105 113 121 129 137 146 154 162 170 165 160 155 150 147 144 160 143 99 56 44 87 148 193
17070 193 204 184 140 113 122 163 204 245 305 333 310 271 239 206 173 140 107 74 78 83 85 87 72 24 -23 -38 -7 23 56 89 105 122 138 155 153 150 148 146 127
17062 127 109 90 71 85 99 111 124 110 79 39 32 40 48 58 68 62 55 49 43 10 -21 -53 -85 -68 -52 -35 -18 -19 -20 -21 -22 -24 -25 -26 -27 -5 15 37 58 64 69 74 79 67
17054 67 56 44 32 -8 -49 -56 -8 85 178 229 246 239 232 242 218 173 128 81 34 13 -6 -26 -46 -28 -9 8 26 48 70 93 115 115 116 51 -12 -53 -93
17047 -93 -133 -173 -182 -191 -155 -87 -46 -37 -73 -109 -121 -132 -143 -155 -162 -169 -176 -184 -174 -164 -154 -144 -118 -91 -65 -39 -57 -75 -93 -112 -70 -28 10 50 82 81 98 116 75
17039 75 34 28 76 150 224 211 165 143 122 98 74 76 79 81 83 69 55 41 27 24 21 0 10 52 94 137 181 206 232 239 278 299 321 344 367 337 306 274 241
17032 241 215 156 115 75 25 -24 -26 2 15 28 43 58 58 59 60 60 53 45 38 30 13 -3 -21 -38 -82 -127 -171 -215 -209 -202 -195 -188 -152 -116 -62 -40 -47 -54 0 53 72 59
17024 59 64 69 48 27 8 -10 -40 -38 -1 35 54 41 28 48 96 143 157 138 122 106 89 71 84 97 55 14 -63 -140 -182 -191 -173 -155 -156 -174 -165 -124 -62 -16
17017 -16 11 22 18 -1 -39 -77 -83 -89 -77 -66 -56 -47 -43 -72 -100 -95 -71 -31 1 35 33 32 30 29 27 26 25 23 23 23 23 23 23 23 23 23 22 21 21 20 22 23 4 18 15 -19 -34 -49 -72
17007 -72 -95 -136 -145 -122 -99 -74 -50 -41 -33 -24 -16 31 78 125 173 202 231 277 291 248 189 120 83 98 129 169 178 153 112 69 42 21 1 -18 -38 -31 -24 -17 -10 -31
17000 -31 -51 -103 -155 -204 -237 -241 -214 -164 -99 -32 17 47 61 83 105 76 48 20 -7 -20 -34 -47 -61 -66 -71 -77 -82 -86 -89 -112 -101 -62 -23 35 62 64 67 65 63 33
16992 33 -29 -90 -118 -100 -50 -6 20 31 42 52 62 42 22 2 -16 -20 -24 -27 -31 -18 -5 7 20 16 12 19 9 -4 12 29 13 2 -9 -23 -37 -31 -25 -20 -14 7
16984 7 29 51 72 54 35 16 -2 -4 -7 -10 -12 4 22 39 57 36 16 -4 -24 -29 -33 -56 -46 -29 -12 24 29 -7 -45 -84 -123 -103 -82 -64 -45 -54 -95 -125 -138
16977 -138 -133 -94 -43 8 35 30 9 -45 -93 -126 -169 -213 -235 -257 -214 -171 -126 -81 -47 3 17 -1 -2 -4 -45 -118 -170 -221 -253 -231 -182 -118 -55 8 39 17
16970 17 9 35 38 41 59 77 92 108 104 68 31 27 78 129 116 103 73 43 5 -15 -10 27 66 73 68 78 78 77 94 110 127 144 142 139 137 135 132 130 128 125 140 154 168 182
16962 182 180 178 174 170 159 114 70 59 103 148 149 118 80 60 73 118 149 147 121 62 -10 -51 -22 39 66 93 139 153 119 69 17 -18 -34 -51 -85 -87 -77 -66
16955 -66 -54 -41 -74 -106 -138 -169 -212 -239 -228 -185 -135 -86 -37 12 20 -4 -10 -17 -21 -25 -29 -34 -5 22 1 -46 -79 -95 -122 -149 -132 -116 -99 -82 -27 26 81 136
16947 136 144 153 162 171 152 134 116 97 80 63 46 30 51 72 93 114 117 119 121 124 118 112 107 101 104 107 111 114 83 52 23 -5 -34 -36 12 60 71 82 109 109 90 72 51
16939 51 31 49 67 83 99 102 78 60 58 61 65 69 74 97 121 145 168 192 215 239 262 246 230 214 198 155 111 68 25 0 -23 -48 -72 -80 -89 -97 -105 -74 -42 -11
16931 -11 19 42 65 89 112 107 102 97 92 49 6 -36 -79 -89 -100 -111 -121 -113 -105 -32 40 109 162 174 159 128 97 67 37 1 -2 -24 -45 -65 -85 -105 -124 -104
16924 -104 -84 -64 -44 -46 -47 -17 13 58 102 108 82 56 -2 -62 -90 -55 -21 15 51 28 4 -18 -42 -36 -30 -6 -14 -4 5 13 21 65 110 136 195 260 325 334 311
16917 311 253 195 117 71 63 54 47 40 55 71 86 101 78 56 33 10 0 -12 -23 -35 -30 -25 -20 -15 -20 -25 -10 -27 -37 -13 -10 -7 22 52 80 108 108 75 42 41 38 35
16909 35 34 33 51 68 86 103 108 114 150 186 236 254 236 218 209 201 192 184 167 149 100 50 2 -45 -56 -35 23 82 140 197 200 148 53 -7 -29 -52 -70 -88 -97 -73
16901 -73 -34 37 113 156 188 219 227 236 212 188 172 156 140 124 107 89 72 55 56 57 58 59 49 38 61 83 112 142 135 95 37 -21 -24 5 18 32 48 64 69
16894 69 73 77 82 70 57 15 -27 -62 -65 -31 1 4 6 9 12 11 11 11 10 10 10 9 9 0 -11 -21 -32 -28 -24 -21 -17 -1 14 -2 -19 -50 -81 -58 -34 -17 0 -15 -30 -32 -33 -35 -37
16885 -37 -34 -32 -29 -27 -20 -13 43 101 137 120 78 37 9 -17 -44 -72 -80 -89 -95 -102 -69 -4 59 89 69 16 -18 -52 -49 -14 20 23 -1 -27 -54 -82 -93 -104 -115 -125 -107
16877 -107 -73 -30 -20 -51 -97 -154 -178 -161 -128 -102 -76 -65 -54 -43 -33 -29 -25 -22 -18 -30 -42 -61 -63 -34 26 79 116 124 132 157 150 121 92 61 30 0 -31 -62
16870 -62 -93 -91 -89 -87 -85 -83 -81 -79 -78 -87 -96 -94 -109 -117 -93 -78 -79 -76 -58 -38 -35 -14 39 82 108 98 72 56 39 6 6 -3 -29 -61 -94 -103 -58 12 83 156 228 262 263 218
16861 218 156 108 93 113 133 158 184 174 132 102 72 22 4 37 70 71 40 19 30 53 77 83 88 62 35 10 -14 -6 1 13 25 37 49 42 35 50 80 84
16854 84 55 -6 -68 -87 -73 -45 -17 6 30 54 78 77 76 75 74 80 85 109 100 72 44 15 -12 -30 -15 -18 -22 -43 -64 -85 -106 -74 -43 -46 -81 -118 -123 -94 -65 -19
16846 -19 26 57 56 46 36 24 12 0 -10 -20 -30 -22 17 59 68 57 62 76 56 26 12 32 68 87 106 126 147 132 117 102 86 62 21 -31 -50 -67 -116
16839 -116 -161 -173 -167 -128 -85 -24 24 42 22 -29 -75 -89 -68 -14 27 36 42 32 24 16 5 -5 -35 -99 -160 -189 -185 -149 -120 -108 -111 -114 -119 -123 -150 -176 -202 -229 -268
16832 -268 -308 -345 -382 -428 -442 -428 -399 -358 -317 -275 -233 -209 -185 -142 -131 -138 -129 -131 -134 -87 -40 6 53 72 92 111 131 140 149 158 167 162 157 152 147 122 97 94 107 116 93
16824 93 37 -18 -42 -34 -11 11 7 4 -29 -64 -93 -90 -73 -55 -49 -42 -22 31 104 177 216 223 209 196 181 166 157 149 140 132 124 115 107 99 74 50 27 3 -3 5 24 10 -12
16816 -12 -20 -39 -58 -76 -94 -111 -129 -146 -164 -199 -202 -196 -190 -182 -174 -184 -194 -203 -213 -206 -200 -193 -186 -202 -217 -232 -246 -260 -258 -229 -168 -110 -52 4 60 101 88 31 -25 -62 -67
16808 -67 -89 -112 -110 -108 -107 -105 -104 -103 -101 -100 -96 -91 -99 -139 -151 -130 -86 -26 27 50 59 68 69 71 41 10 -20 -50 -67 -51 -36 -22 -6 8 0 -26 -60 -63 -21 19 63 106 122
16800 122 139 155 171 166 161 174 155 107 59 22 18 45 56 42 -4 -59 -113 -168 -222 -260 -265 -255 -245 -234 -207 -133 -26 68 130 168 189 202 215 227 238 233
16793 233 227 207 155 84 12 -23 -27 -4 34 66 98 108 117 127 136 106 76 45 15 23 30 38 46 77 107 138 169 140 110 81 52 46 39 32 26 46 67 87 108 121
16785 121 134 147 160 174 187 200 213 201 189 188 171 171 204 224 228 203 145 104 63 24 -14 -54 -93 -164 -235 -282 -274 -226 -161 -102 -43 25 94 128 128 97 65
16778 65 31 -2 -30 -59 -85 -111 -106 -69 -51 -32 4 42 79 116 106 97 67 69 72 42 32 23 11 0 -11 -23 -33 -43 -52 -62 -45 -28 19 67 117 133 134 103
16771 103 55 40 58 77 79 80 80 80 63 14 -16 -47 -32 -18 -4 10 40 71 101 132 106 80 55 29 -10 -51 -89 -127 -140 -121 -90 -59 -30 -33 -71 -108 -141
16764 -141 -142 -107 -71 -49 -28 -38 -49 -45 -40 -35 -30 -65 -101 -136 -171 -152 -133 -113 -94 -38 16 68 120 126 78 30 -18 -31 -12 42 97 142 187 218 216 205 195 182
16757 182 169 138 107 76 45 17 -9 -37 -65 -100 -135 -134 -100 -59 -18 8 4 -23 -66 -79 -76 -86 -96 -62 -11 26 32 25 17 -8 -33 -57 -81 -79 -44 -28 -11 -9
16749 -9 -7 -5 -3 -18 -33 -48 -63 -78 -93 -109 -125 -116 -124 -140 -124 -71 -19 34 88 147 189 205 188 159 130 99 67 29 -8 -62 -84 -53 11 76 109 117 108 88 100
16742 100 118 119 132 145 164 183 202 221 222 223 169 115 71 27 -16 -60 -102 -143 -150 -125 -77 -61 -80 -98 -101 -103 -137 -170 -206 -210 -178 -146 -113 -81 -103 -125 -112 -99
16735 -99 -86 -73 -46 -20 5 31 58 86 132 145 117 88 59 30 1 -10 -48 -53 -25 34 97 127 108 90 69 49 44 40 36 32 34 36 19 35 49 64 80 96
16728 96 74 52 30 8 -11 -31 -69 -75 -52 -29 -4 20 7 -5 -19 -32 -21 -11 0 9 6 2 -46 -127 -168 -176 -204 -233 -232 -232 -229 -226 -256 -253 -203 -153 -121 -90 -58 -26
16720 -26 -23 -20 -16 -13 -26 -39 -52 -65 -51 -38 -26 -15 12 8 -40 -89 -110 -98 -104 -110 -119 -127 -135 -144 -151 -158 -164 -169 -152 -103 -54 -38 -82 -126 -107 -88 -79 -70 -60 -51 -58 -65 -73 -80 -87 -94 -101
16711 -101 -109 -123 -138 -153 -167 -144 -121 -97 -74 -45 -15 31 47 31 16 -1 -18 -34 -50 -64 -78 -52 5 61 85 85 52 35 19 14 10 24 5 -37 -81 -126
16704 -126 -172 -157 -143 -129 -114 -85 -55 -25 3 16 30 43 56 53 51 48 45 59 73 86 100 134 168 202 236 200 163 127 90 86 82 78 75 107 140 108 75 55
16697 55 35 15 -5 -2 0 3 6 -3 -13 -23 -33 -16 1 16 31 14 -34 -65 -95 -79 -63 -47 -31 -28 -25 -20 -15 5 59 90 122 144 112 47 -16 -66 -84 -119 -155
16689 -155 -152 -148 -145 -142 -75 -8 56 121 212 270 256 209 146 82 63 77 91 106 122 138 159 179 199 220 204 188 173 157 142 126 110 95 111 126 142 158
16683 158 147 136 125 113 88 63 38 13 4 -3 -12 -21 -34 -48 -61 -75 -88 -102 -115 -129 -99 -70 -40 -10 -8 -5 -3 0 -16 -31 -44 -57 -40 9 41 73 88 104
16675 104 120 136 150 164 134 71 26 14 14 14 21 28 35 42 50 57 65 73 79 84 108 100 99 98 95 92 72 53 35 18 18 50 82 82 85 89 91 92 64 36 7 -20 -17 -14 -11 -8 0 9 63
16666 63 149 232 282 318 300 228 157 82 8 8 9 10 10 31 52 59 33 -8 -50 -47 -12 24 62 69 76 46 16 -12 -40 -58 -44 -48 -53 -27 -2 22 47 62 77 92
16658 92 108 85 62 39 16 -20 -57 -94 -131 -97 -64 0 66 99 132 132 78 37 28 42 88 163 204 201 198 187 175 164 153 184 216 280 344 395 447 563
16651 563 679 808 936 1085 1331 1721 2274 3079 4222 5643 6814 6797 5617 4213 3102 2366 1902 1573 1320 1091 895
16647 895 765 690 651 612 560 509 458 407 360 312 265 218 224 230 235 241 220 198 177 155 117 80 42 4 -10 -24 -39 -54 -3 46 61 22 -23 -69 -54 -38
16641 -38 0 38 77 116 132 148 164 180 177 174 171 168 182 195 209 222 175 127 80 32 26 21 15 10 0 -11 43 97 134 170 173 177 189 202 214 227 210 193 176 159
16633 159 162 165 168 170 146 122 97 73 56 38 21 4 14 24 34 43 93 142 198 238 213 156 115 75 56 38 19 0 8 17 58 99 149 199 214 196 152 125
16626 125 143 193 256 302 358 413 449 452 461 487 494 447 376 272 175 110 83 89 128 167 208 249 254 260 254 264 278 258 213 152 85 17 -17 -53 -69 -85 -68
16619 -68 -51 -32 -14 -27 -41 -52 -63 -73 -84 -58 -33 -10 13 21 -3 -9 -15 -24 -32 -40 -48 -32 -16 -20 9 45 65 97 128 137 146 155 164 134 105 76 47 71 96 120 144
16611 144 167 189 230 238 227 216 202 189 180 170 160 151 123 95 102 142 171 185 165 129 97 82 75 35 -16 -69 -87 -73 -49 -26 6 22 -10 -76 -133 -173 -187
16604 -187 -185 -191 -198 -203 -208 -213 -218 -185 -152 -119 -86 -69 -52 -35 -18 -12 -5 2 11 16 54 104 154 175 163 106 33 -10 0 31 64 62 60 58 56 65 73 27 -18 -80 -142 -168 -161 -138
16595 -138 -115 -90 -65 -44 -23 -34 -45 -70 -79 -64 -15 34 51 34 17 32 48 63 78 75 72 70 68 82 112 150 156 137 102 55 41 46 51 58 65 18 -28 -82 -120
16588 -120 -125 -98 -88 -79 -67 -55 -44 -32 -58 -85 -111 -138 -111 -85 -61 -37 -32 -60 -68 -76 -63 -17 10 38 51 64 77 91 98 106 114 122 113 104 96 87 87 86 86 85 93 101 109 116 104
16579 104 92 91 73 59 77 74 71 97 91 38 -13 -50 -71 -81 -123 -162 -169 -194 -219 -191 -130 -78 -43 -6 29 65 100 98 95 92 90 72 54 36 18 28 37 46 56 29
16572 29 2 -21 -46 -86 -94 -65 -20 7 19 40 60 51 9 -32 -42 0 41 37 1 -8 -18 -50 -50 -5 7 -14 -53 -84 -115 -166 -184 -185 -186 -185 -184 -167 -149 -132 -115
16564 -115 -115 -115 -133 -119 -78 -37 4 47 75 103 67 30 0 -15 5 59 94 96 63 13 -56 -126 -151 -142 -124 -106 -39 60 143 227 265 271 261 250 236 223 190
16557 190 157 123 90 114 138 162 187 182 177 190 171 117 63 -11 -53 -42 -32 -19 -7 12 32 52 71 99 127 155 183 172 160 169 146 120 127 132 104 79 54
16550 54 27 0 -18 -37 -55 -74 -75 -76 -95 -81 -24 32 44 24 17 11 2 -6 40 87 132 177 210 211 228 245 229 181 151 121 127 133 119 138 191 211 205 166 141 116
16543 116 90 63 59 55 52 48 46 43 41 39 41 43 45 46 31 16 44 105 167 174 127 48 -13 -21 1 24 9 -38 -67 -97 -110 -124 -137 -151 -164 -177 -191 -204 -210 -215 -221 -226 -231 -237
16534 -237 -242 -248 -221 -195 -169 -143 -119 -95 -52 -42 -47 -51 -57 -63 -70 -76 -82 -88 -79 -70 -60 -51 -22 6 21 3 -13 -30 4 40 61 82 105 128 145 195 256 318 366 361 288
16526 288 215 172 128 84 40 14 -11 -37 -64 -47 -30 -46 -96 -143 -157 -134 -78 -28 21 18 16 30 45 58 70 66 29 -19 -69 -112 -124 -99 -74 -61 -48 -35
16519 -35 -22 -9 3 14 25 36 14 -40 -96 -111 -93 -61 -29 -7 14 35 57 43 28 14 0 -29 -58 -88 -117 -118 -118 -137 -123 -88 -53 -18 15 0 -47 -95
16513 -95 -111 -89 -67 -61 -23 -3 16 38 60 61 62 64 67 59 79 136 193 237 254 262 253 232 194 141 73 12 -31 -61 -75 -74 -57 -17 22 37 25 11 24 41 31
16505 31 -15 -63 -74 -86 -97 -109 -92 -74 -111 -148 -173 -199 -192 -184 -160 -119 -73 -54 -51 -49 -48 -48 -63 -79 -95 -110 -99 -88 -77 -66 -38 -11 16 43 44 44 60 49 18
16498 18 -12 -43 -75 -126 -162 -175 -149 -98 -63 -61 -75 -77 -63 -59 -55 -53 -52 -50 -49 -51 -53 -55 -57 -59 -61 -63 -65 -47 -28 -9 10 42 91 144 169 159 110 38 -50 -127 -178 -198 -202
16490 -202 -196 -174 -127 -80 -67 -55 -10 34 48 62 43 23 52 81 107 133 144 121 117 113 107 101 96 91 91 108 133 126 89 53 15 -22 -65 -92 -146 -167 -145 -107 -66
16482 -66 -42 -24 -7 9 26 26 26 27 27 13 -1 -15 -30 4 38 72 105 117 113 100 119 133 147 181 182 163 128 80 65 49 1 -34 -55 -55 -54 -72 -56 -32 -7
16475 -7 18 44 68 92 116 140 104 68 32 -2 -35 -67 -99 -131 -147 -163 -126 -90 -81 -104 -142 -180 -181 -183 -185 -186 -149 -111 -73 -36 42 120 140 127 95 47 -2 -36
16467 -36 -65 -94 -99 -50 2 38 72 73 40 -7 -49 -91 -100 -110 -120 -130 -136 -143 -149 -156 -148 -140 -78 -16 46 109 137 166 184 169 120 72 35 32 84 136 182 195 195 194 167
16460 167 141 94 80 54 -2 -40 -78 -79 -81 -82 -84 -65 -46 -28 -9 -40 -70 -100 -131 -104 -78 -51 -24 -16 -8 18 12 -6 -25 -45 -66 -27 12 51 90 71 53 35
16452 35 16 -17 -52 -87 -122 -110 -98 -86 -74 -79 -83 -86 -88 -73 -26 0 27 34 9 2 -4 3 12 6 -32 -49 -67 -64 -8 70 117 127 105 57 8 -9 -27 -9 8 25
16445 25 43 97 152 206 260 298 336 351 311 243 176 141 139 132 126 121 116 115 113 112 110 99 87 73 59 14 -62 -121 -180 -232 -284 -334 -384 -360 -303 -264 -225 -169 -96
16437 -96 -16 31 37 27 25 24 24 57 90 91 55 20 -16 -53 -103 -136 -145 -121 -108 -127 -166 -189 -176 -146 -106 -98 -111 -125 -138 -151 -127 -70 -22 9 24 40 54 69
16430 69 77 86 75 96 109 105 113 120 93 66 41 16 8 33 58 51 52 54 53 52 52 51 51 50 30 11 -9 -29 -38 -64 -97 -97 -59 9 61 112 127 108 89 102 127 135 155 175
16422 175 164 154 161 135 81 10 -70 -118 -124 -114 -111 -107 -69 -30 6 43 79 82 42 19 49 111 143 141 104 67 28 -9 -21 -33 -44 -56 -51 -46 -41 -37 -31 -26 -20 -15 -9 -4
16414 -4 0 6 33 60 87 114 125 136 144 153 135 85 53 21 24 28 32 36 41 45 67 58 8 -40 -108 -143 -132 -89 -62 -35 -33 -31 -29 -27 -62 -97 -151 -171 -151 -130 -107 -84 -63
16405 -63 -41 -19 2 21 41 79 85 52 19 -15 -50 -85 -120 -155 -190 -160 -129 -98 -67 -38 -9 37 52 20 -10 -60 -77 -38 32 118 203 241 245 214 183 164
16399 164 145 156 168 150 99 67 35 2 -29 -59 -89 -75 -29 0 27 73 120 167 213 195 177 159 141 123 105 86 68 49 29 9 -10 -44 -78 -112
16392 -112 -146 -150 -154 -125 -96 -57 -18 -15 -45 -48 -51 -56 -62 -43 -24 -8 8 5 -29 -65 -67 -42 -16 11 39 30 22 -4 1 26 52 46 41 26 11 50 90 121 153 203 221
16384 221 218 216 211 207 202 197 193 188 160 132 104 76 46 16 -13 -43 -42 -40 -72 -103 -145 -186 -192 -165 -146 -128 -107 -86 -79 -71 -63 -55 -70 -85 -99 -114 -123 -131 -106 -48 8 32 22
16376 22 12 -3 -19 -35 -52 -58 -65 -53 -74 -107 -140 -139 -106 -59 -13 2 18 39 60 27 -5 -32 -59 -54 -48 -67 -85 -91 -64 -16 0 2 6 11 17 23 28 46 64 82 100
16368 100 91 82 75 68 81 127 173 186 160 134 106 78 61 45 10 8 45 83 100 63 0 -35 -35 -36 -23 -10 2 15 38 61 30 0 -1 -1 -4 -6 -36 -94 -144 -177
16361 -177 -165 -126 -110 -78 -15 48 126 177 178 151 139 127 131 162 177 191 163 107 66 26 -7 -41 -74 -107 -130 -126 -78 -4 73 113 109 89 69 50 8 -49
16354 -49 -91 -107 -129 -168 -194 -220 -260 -272 -237 -164 -79 5 77 132 157 154 109 65 40 31 9 -39 -93 -109 -98 -87 -73 -60 -32 -4 22 50 47 44 8 -27 -59
16347 -59 -90 -68 -45 -62 -79 -96 -113 -126 -140 -153 -166 -203 -239 -289 -313 -290 -251 -219 -187 -140 -92 -55 -2 39 55 87 119 96 74 68 36 2 -3 -18 -48 -62
16340 -62 -76 -109 -110 -91 -72 -51 -30 -20 -10 0 10 1 -6 -14 -22 -43 -63 -95 -160 -208 -223 -193 -163 -135 -108 -94 -114 -144 -174 -171 -115 -21 71 135 199 222 246 255
16333 255 231 177 123 82 73 81 89 99 109 175 241 260 246 216 187 187 188 182 176 107 37 -2 -10 25 62 78 61 -2 -66 -128 -190 -186 -183 -166 -150 -134 -117 -134 -150
16325 -150 -154 -126 -67 -42 -59 -77 -62 -14 33 48 52 56 58 60 35 10 -14 -40 -32 -25 -18 -11 -20 -29 -38 -47 -37 -28 -18 -8 -15 -22 -28 -35 -10 13 36 59 51 11 -11 -33 -54 -76
16317 -76 -115 -123 -80 -36 26 57 37 17 14 -20 -105 -174 -166 -125 -82 -72 -52 -15 -10 -22 -15 -23 -46 -69 -79 -56 -5 45 64 28 -26 -65 -70 -43 -2 37 79 121
16309 121 119 117 133 115 71 10 -51 -96 -144 -176 -160 -128 -95 -62 -42 -55 -70 -84 -70 -55 -13 12 2 -40 -99 -141 -147 -120 -86 -51 -14 22 76 130 139 114
16303 114 90 82 98 114 126 171 214 224 183 109 53 -1 -40 -47 -70 -92 -74 -22 28 47 52 58 43 60 85 109 154 166 148 130 109 89 117 146 174 203
16296 203 201 199 197 196 178 159 141 123 91 58 25 -6 9 25 41 57 81 104 127 151 136 121 109 96 86 109 113 118 97 76 55 35 25 15 6 -3 -12 -22 -31
$$ [...]
-1433b0
##END=	
##END=	
