##TITLE=	Aug01-2022-lemw22.10.fid
LW234

##JCAMP-DX=	6.0	$$ MestReNova 14.1.0-24037
##DATA TYPE=	LINK
##BLOCK_ID=	1
##BLOCKS=	1    
##ORIGIN=	Mestrelab Research S.L.
##OWNER=	hrzepa
##$MNOVA/LINK_BLOCK_TYPE=	ITEM	$$ NMR Spectrum
##$MNOVA/ITEM/POLYGON=	(XY..XY)
5321,5835
8722,5835
8722,8208
5321,8208
5321,5835
##$MNOVA/ITEM/Z=	0
##$MNOVA/ITEM/ANGLE=	0
##TITLE=	Aug01-2022-lemw22.10.fid
##JCAMP-DX=	6.0	$$ MestReNova 14.1.0-24037
##BLOCK_ID=	2
##DATA TYPE=	NMR SPECTRUM
##DATA CLASS=	XYDATA
##NUMDIM=	1
##ORIGIN=	Bruker BioSpin GmbH
##OWNER=	nmr
##.OBSERVE FREQUENCY=	400.15247108400001252
##.OBSERVE NUCLEUS=	^1H
##.SOLVENT NAME=	Acetone
##.PULSE SEQUENCE=	zg30
##LONGDATE=	2022/08/01 10:37:05.000
##.ACQUISITIONMODE=	SIMULTANEOUS (DQD)
##$ORIGINAL FORMAT=	Bruker XWIN-NMR
##$MNOVA/SCALES_VERSION=	8
##$PARAMETER FILE=	(acqus, ASCII, /var/folders/f6/rjf_tdyn2v98c5c0wvkgn4s80000gq/T/TDqC5+dXTmyEzc3vnN2Sgg/1H/acqus, 0)
$$ ##TITLE= Parameter file, TopSpin 4.1.1
$$ ##JCAMPDX= 5.0
$$ ##DATATYPE= Parameter Values
$$ ##NPOINTS= 8	$$ modification sequence number
$$ ##ORIGIN= Bruker BioSpin GmbH
$$ ##OWNER= nmr
$$ $$ 2022-08-01 10:36:30.360 +0100  nmr@chpc-nmr400a
$$ $$ D:/data/lemw22/nmr/Aug01-2022-lemw22/10/acqus
$$ $$ process C:\Bruker\TopSpin4.1.1\prog\mod\xwish3.exe
$$ ##$ACQT0= -1.70581753891579
$$ ##$AMP= (0..31)
$$ 100 100 100 100 100 100 100 100 100 100 100 100 100 100 100 100 100 100
$$ 100 100 100 100 100 100 100 100 100 100 100 100 100 100
$$ ##$AMPCOIL= (0..32)
$$ -1 0 0 0 0 0 0 0 0 0 0 0 0 0 0 0 0 0 0 0 0 0 0 0 0 0 0 0 0 0 0 0 0
$$ ##$AQSEQ= 0
$$ ##$AQ_mod= 3
$$ ##$AUNM= <au_zg>
$$ ##$AUTOPOS= <15 >
$$ ##$BF1= 400.15
$$ ##$BF2= 400.15
$$ ##$BF3= 400.15
$$ ##$BF4= 400.15
$$ ##$BF5= 400.15
$$ ##$BF6= 400.15
$$ ##$BF7= 400.15
$$ ##$BF8= 400.15
$$ ##$BWFAC= (0..63)
$$ 0 0 0 0 0 0 0 0 0 0 0 0 0 0 0 0 0 0 0 0 0 0 0 0 0 0 0 0 0 0 0 0 0 0 0 0
$$ 0 0 0 0 0 0 0 0 0 0 0 0 0 0 0 0 0 0 0 0 0 0 0 0 0 0 0 0
$$ ##$BYTORDA= 0
$$ ##$CHANFCU= (0..24)
$$ 0 0 1 0 0 0 0 0 0 0 0 0 0 0 0 0 0 0 0 0 0 0 0 0 0
$$ ##$CHANREC= (0..24)
$$ 0 0 0 0 0 0 0 0 0 0 0 0 0 0 0 0 0 0 0 0 0 0 0 0 0
$$ ##$CHEMSTR= <none>
$$ ##$CNST= (0..63)
$$ 1 1 145 1 1 1 1 1 1 1 1 1 1 1 1 1 1 1 1 1 1 1 1 1 1 1 1 1 1 1 1 1 1 1 1
$$ 1 1 1 1 1 1 1 1 1 1 1 1 1 1 1 1 1 1 1 1 1 1 1 1 1 1 1 1 1
$$ ##$CPDPRG= (0..8)
$$ <> <> <> <> <mlev> <mlev> <mlev> <mlev> <mlev>
$$ ##$D= (0..63)
$$ 0 0.1 0 0 0 0 0 0 0 0.06 0 0 0 0 0 0 0.0002 0 0 0 0 0 0 0 0 0 0 0 0 0 0
$$ 0 0 0 0 0 0 0 0 0 0 0 0 0 0 0 0 0 0 0 0 0 0 0 0 0 0 0 0 0 0 0 0 0
$$ ##$DATE= 1659346625
$$ ##$DATE_START= 1659346531
$$ ##$DE= 8.794183
$$ ##$DECBNUC= <off>
$$ ##$DECIM= 1680
$$ ##$DECNUC= <off>
$$ ##$DECSTAT= 4
$$ ##$DIGMOD= 3
$$ ##$DIGTYP= 17
$$ ##$DR= 32
$$ ##$DS= 0
$$ ##$DSPFIRM= 4
$$ ##$DSPFVS= 21
$$ ##$DTYPA= 2
$$ ##$EXP= <Proton.icon>
$$ ##$ExpStatus= 4
$$ ##$FCUCHAN= (0..9)
$$ 0 2 0 0 0 0 0 0 0 0
$$ ##$FILCOR= 0
$$ ##$FL1= 90
$$ ##$FL2= 90
$$ ##$FL3= 90
$$ ##$FL4= 90
$$ ##$FN_INDIRECT= (0..7)
$$ 0 0 0 0 0 0 0 0
$$ ##$FOV= 20
$$ ##$FQ1LIST= <freqlist>
$$ [...]
$$ 1 1 1 1 0 0 0 0 0 0 0 0 0 0 0 0 0 0 0 0 0 0 0 0 0 0 0 0
$$ ##$ShimPowRng3= (0..63)
$$ 1 1 1 1 1 1 1 1 1 1 1 1 1 1 1 1 1 1 1 1 1 1 1 1 1 1 1 1 1 1 1 1 1 1 1 1
$$ 1 1 1 1 0 0 0 0 0 0 0 0 0 0 0 0 0 0 0 0 0 0 0 0 0 0 0 0
$$ ##$ShimPowType1= 8
$$ ##$ShimPowType2= 8
$$ ##$ShimPowType3= 0
$$ ##$ShimPowType4= 0
$$ ##$ShimPowType5= 0
$$ ##$ShimPowType6= 0
$$ ##$ShimPowType7= 0
$$ ##$ShimPowType8= 0
$$ ##$ShimSysActGrad= (0..63)
$$ 1 2 3 4 13 5 7 11 10 9 6 8 12 18 19 20 21 15 22 23 24 14 25 16 26 17 27
$$ 28 31 32 33 34 35 36 37 38 0 0 0 0 0 0 0 0 0 0 0 0 0 0 0 0 0 0 0 0 0 0
$$ 0 0 0 0 0 0
$$ ##$ShimSysAngle= <>
$$ ##$ShimSysFunc= (0..63)
$$ 1 2 3 4 5 6 7 8 9 10 0 37 38 35 16 15 14 13 12 11 28 27 26 25 24 23 36
$$ 22 30 29 20 21 34 33 32 31 17 18 19 0 0 0 0 0 0 0 0 0 0 0 0 0 0 0 0 0 0
$$ 0 0 0 0 0 0 0
$$ ##$ShimSysMatId= <292722aa.dat>
$$ ##$ShimSysMatrix= 1
$$ ##$ShimSysMinMaxUG= 130000
$$ ##$ShimSysOffset= <37mm>
$$ ##$ShimSysType= 4
$$ ##$ShimUnit= 3
$$ ##$SpectrOsVersion= <4.1.148.20201202>
$$ ##$TCubeEth= <192.168.180.22>
$$ ##$TCubeSeqDevice= <>
$$ ##$TOSITY= <no>
$$ ##$TRIPLO2= 0
$$ ##$TopSpinVersion= <TopSpin 4.1.1>
$$ ##$TrxFreqFormula= (0..23)
$$ <TrxFreqFormula(2.0,400150000.000000,'TRX',Trx(1.0,'TRX 1200.1',2,5.000000,1290.000000))>
$$ <TrxFreqFormula(2.0,400150000.000000,'TRX',Trx(1.0,'TRX 1200.2',2,5.000000,1290.000000))>
$$ <> <> <> <> <> <> <> <> <> <> <> <> <> <> <> <> <> <> <> <> <> <>
$$ ##$TrxPN= (0..23)
$$ <Z148391> <Z148391> <> <> <> <> <> <> <> <> <> <> <> <> <> <> <> <> <>
$$ <> <> <> <> <>
$$ ##$TrxSN= (0..23)
$$ <02953> <02954> <> <> <> <> <> <> <> <> <> <> <> <> <> <> <> <> <> <> <>
$$ <> <> <>
$$ ##$VCubeEth= (0..23)
$$ <no> <no> <no> <no> <no> <no> <no> <no> <no> <no> <no> <no> <no> <no> <no>
$$ <no> <no> <no> <no> <no> <no> <no> <no> <no>
$$ ##$VTU= 2
$$ ##$VTUETH= <192.168.99.11>
$$ ##$VTUTY= <no>
$$ ##$ValueLine= no
$$ ##$VpuPN= (0..23)
$$ <no> <no> <no> <no> <no> <no> <no> <no> <no> <no> <no> <no> <no> <no> <no>
$$ <no> <no> <no> <no> <no> <no> <no> <no> <no>
$$ ##$VpuSN= (0..23)
$$ <no> <no> <no> <no> <no> <no> <no> <no> <no> <no> <no> <no> <no> <no> <no>
$$ <no> <no> <no> <no> <no> <no> <no> <no> <no>
$$ ##$WBREFAM= (0..31)
$$ 142.7 107.1 100 100 100 100 100 100 100 100 100 100 100 100 100 100 100
$$ 100 100 100 100 100 100 100 100 100 100 100 100 100 100 100
$$ ##$WBREFLM= (0..31)
$$ 0 0 0 0 0 0 0 0 0 0 0 0 0 0 0 0 0 0 0 0 0 0 0 0 0 0 0 0 0 0 0 0
$$ ##$WBREFPH= (0..31)
$$ 72.61 -67.16 0 0 0 0 0 0 0 0 0 0 0 0 0 0 0 0 0 0 0 0 0 0 0 0 0 0 0 0 0
$$ 0
$$ ##$WBSGU= (0..31)
$$ 2 0 1 0 0 0 0 0 0 0 0 0 0 0 0 0 0 0 0 0 0 0 0 0 0 0 0 0 0 0 0 0
$$ ##END=
$$ 
##$DECIM=	1680
##$DSPFVS=	21
##XUNITS=	HZ
##YUNITS=	ARBITRARY UNITS
##FIRSTX=	8379.3978253949990176
##LASTX=	-3525.3640793669001141
##DELTAX=	-0.090826818325654784525
##XFACTOR=	1
##YFACTOR=	6.9195492937636888797
##FIRSTY=	1736.3486328125
##MINY=	-14408.4140625
##MAXY=	30834636
##NPOINTS=	131072
##XYDATA=	(X++(Y..Y))
$$ [...]
2481B65j0j1pJ98j85J9n3n3Q0P9J0J0J12r1L3j70O3O3j03J00L7L7r6r6J13J12Q8j16j16Q8
$$ 265 255 244 237 435 250 269 216 163 243 322 332 342 454 363 396 226 289 352 249 349 386 423 327 231 344 456 544 428 312 400
2478D00OOo6o6j7j6N6N6L3j72O2O2J0J0j04R9M9N0J1J1j%q6q5J14J15O3j40j40K01mlo8o9
$$ 400 406 412 346 280 263 247 303 359 392 220 282 344 354 364 260 359 408 458 469 480 479 479 393 308 422 537 600 460 320 521 517 514 446 377
2475C77j7j7n6n5R7R8ppppL2L1J16q7j65J76j5j5j38O6N4N4p0p0L2L2n3n3J64m0q1q2P6P6
$$ 377 360 343 287 232 329 427 420 413 406 399 431 462 578 491 326 502 487 472 334 400 454 508 438 368 400 432 379 326 490 450 369 287 363 439
2472D39j4j4k6k6J55m9O5O6q0q0k9k9J15J15n5n5p1p0j6J88klr2r3L4L3j8j7kkN0M9j%jk05
$$ 439 425 411 385 359 514 465 530 596 516 436 407 378 493 608 553 498 427 357 341 529 527 524 432 339 373 406 388 371 369 367 417 466 465 465 464 259
2468B59J72l2J8J9q9q9J3J3l7l7P7j27K8K7J17J17J9J9j47N7N4N4P9j24q2q2PQQRN9O0m6m6
$$ 259 431 399 417 436 347 258 271 284 247 210 287 160 188 215 332 449 468 487 340 397 451 505 584 460 378 296 303 311 319 328 387 447 401 355
2465C55O9j35KKj1j0J07J07NNk0k1l3l3J22q2o9o9N4N4o1J43P3P3q5q5l2l3J9J9p8p8R2R2
$$ 355 424 289 291 293 282 272 379 486 491 496 476 455 422 389 511 429 360 291 345 399 338 481 554 627 542 457 425 392 411 430 352 274 366 458
2462D58k4k3k4k4O5O5J0j95K9K9m8J57lkO2O1m7m7m6m7n6n7J14J14m9n0JKm6m5J20q3QRn5
$$ 458 434 411 387 363 428 493 503 308 337 366 318 475 472 470 532 593 546 499 453 406 350 293 407 521 472 422 423 425 379 334 454 371 379 388 333
2459C33n5N6N6O8O9k30k5q4J19M2M2rrQ1j23j22Q1J6J6J6J6Q9j16jjJ2J2J2J2l1l0P1P2j12
$$ 333 278 334 390 458 527 297 272 188 307 349 391 382 373 454 331 209 290 306 322 338 354 443 327 326 325 337 349 361 373 342 312 383 455 343
2456C43j12J27J26n8n9M4M4k1k0k0k0P9Q0L7j67j63M2Q3Q4KLj12R2m3m3l0l0J7J6J32p3ll
$$ 343 231 358 484 426 367 411 455 434 414 394 374 453 533 570 403 240 282 365 449 451 454 342 434 391 348 318 288 305 321 453 380 377 374
2453C74j5j6Q4Q5j8j8m0m0m1m0M2M1R3R2o1o0j51J91k4k4kk06J66l9O4O4j32j31K29j10K7
$$ 374 359 343 427 512 494 476 436 396 355 315 357 398 491 583 522 462 311 502 478 454 452 246 412 373 437 501 369 238 467 357 384
2450C84K6J21q4r9r8J86j8j99MM7M6L4L4o8o8J26J26m3m4J7J8m6m6N3j51J4J5R2R3L7j67L7
$$ 384 410 531 447 348 250 436 418 219 223 270 316 350 384 316 248 374 500 457 413 430 448 402 356 409 258 272 287 379 472 509 342 379
2447C79L7j3j4q8J15KJP1P1L3L3j76K7LKJ09r5q2q2L5L5L4L5m8m8J82k3j79K6n2n1KKJ04J04
$$ 379 416 403 389 301 416 418 419 490 561 594 627 451 478 481 483 592 497 415 333 368 403 437 472 424 376 558 535 356 382 330 279 281 283 387 491
2444D91p8p8K5K4p8p8K4K5J0J1o6J37J19q6N5j49N1N2n1n1r4J10R7R8p1p1L1L2m5m5l2l2p
$$ 491 413 335 360 384 306 228 252 277 287 298 232 369 488 402 457 308 359 411 360 309 215 325 422 520 449 378 409 441 396 351 319 287 280
2441B80J98l2l2O5j40R0j14jjK03jN5N5p3p3P4j30j5j5J5J4q7q8P0P0l2l2MNMNM2M3q5J19
$$ 280 478 446 414 479 339 429 315 314 313 516 515 570 625 552 479 553 423 408 393 408 422 335 247 317 387 355 323 327 332 336 341 383 426 341 460
2438D60L5j70P2P3q2J22M6M6O7j37k2k2K7K8POJ03k37l3l3n8J46M3M4r4J11j8j7O8j37qrp4
$$ 460 495 325 397 470 388 510 556 602 669 532 510 488 515 543 550 556 659 422 389 356 298 444 487 531 437 548 530 513 581 444 436 427 353
2435C53J31J5J6l7l8k5k4m1J64o6o6J48n6m4m4K9K9k2k2L9L8o3o4K2K1q1q0M7M7M7M6K8K7
$$ 353 484 499 515 478 440 415 391 350 514 448 382 530 474 430 386 415 444 422 400 439 477 414 350 372 393 312 232 279 326 373 419 447 474
2432D74K8K7n0n0JJL6L5n4n4j03J00j17j16J39J39l2l1l1l1q2J21j34P1J9J9J9J9J9J9nnn
$$ 474 502 529 479 429 430 431 467 502 448 394 291 391 274 158 297 436 404 373 342 311 229 350 216 287 306 325 344 363 382 401 396 391 386
2429C86nN3N2n0n0K0J9L2L3j38O6O6j38l5l5N4N4M2M1o0o1K3K3K4K3q3q3L1L2m7J58M2M3j5
$$ 386 381 434 486 436 386 406 425 457 490 352 418 484 346 311 276 330 384 426 467 407 346 369 392 416 439 356 273 304 336 289 447 489 532 517
2426E17j5kkj09R5j9k0O7O6j50N4o3o3J16q8M9M9o6o6NNJ19q4M6M6R8j07j13j14l6l7K13R
$$ 517 502 500 498 389 484 465 445 512 578 428 482 419 356 472 384 433 482 416 350 355 360 479 395 441 487 585 478 365 251 215 178 391 400
2423D00m6m6O3O2r4r4j25P9O6O6nnN8j45R4R4l4J70j9j9J09r6l3l4l4l4l3J72j14j13L2L2
$$ 400 354 308 371 433 339 245 120 199 265 331 326 321 379 234 328 422 388 558 539 520 629 533 500 466 432 398 365 537 423 310 342 374
2420C74R6R6j82K3J1J0J4J5K7K7j67L6J01j04j41O4K20J7j47j46J26p9L8L7J2K16n1n1J3J3
$$ 374 470 566 384 407 418 428 442 457 484 511 344 380 481 377 236 300 520 537 390 244 370 291 329 366 378 594 543 492 505 518
2417E18j9j9M5j59K9K8J6J6p7p7K5K6N3N2j64M0L4L3nmj5j4J64m0o4J41q9q9N9N9m3m3K7K7
$$ 518 499 480 525 366 395 423 439 455 378 301 326 352 405 457 293 333 367 400 395 391 376 362 526 486 422 563 474 385 444 503 460 417 444 471
2414D71q8J16J6J6n2n3n0K90J88j52j5j4P8P9%K05k6k5L5j69n4n4N8N9r9r9q7J17j00j00n8
$$ 471 383 499 515 531 479 426 376 666 854 702 687 673 751 830 830 1035 1009 984 1019 850 796 742 800 859 760 661 574 691 591 491 433
2411D33n8M3M4LMQ0j24q1J22M6M6j14j15N6N5l3l4L0L0j33P1N8N8J8J7q4q4J1J1O2O3p9p9
$$ 433 375 418 462 465 469 549 425 344 466 512 558 444 329 385 440 407 373 403 433 300 371 429 487 505 522 438 354 365 376 438 501 422 343
2408C43K3K3M4M5m5m4j34P0N7N8O4O4l8l8m8m7M1M2R3j12m7m8nnN9N9l8J67j18j18j8j8j84
$$ 343 366 389 433 478 433 389 255 325 382 440 504 568 530 492 444 397 438 480 573 461 414 366 361 356 415 474 436 603 485 367 349 331 147
2405A47K0J80J80L5L5j79K4r0r0K2K3P3P4O1O2j55M9ONj51j52O1O1m1m1j0rJ95rJ14r0J2J2
$$ 147 167 347 527 562 597 418 442 352 262 284 307 380 454 515 577 422 471 477 482 331 179 240 301 260 219 209 200 395 386 500 410 422 434
2402D34K9K9L0K9j3j3j4j3m5m5m5m5L6L7j4j4L9M0N2j51J29J29j22j22K8K7P9P9q2q2K1K0
$$ 434 463 492 522 551 538 525 511 498 453 408 363 318 354 391 377 363 402 442 494 343 472 601 479 357 385 412 491 570 488 406 427 447
2399D47j4j4j4j4j7j8l0k9J37o7j6J88POL2j72q7q8J5J4L2K36J33p0p9p9J0J1P5P5J2J1j5
$$ 447 433 419 405 391 374 356 326 297 434 367 351 539 546 552 584 412 325 237 252 266 298 534 667 597 518 439 449 460 535 610 622 633 618
2396F18k19lkQ2Q1k0k1r0r1j16Q8J47n6l1J73j69L6o6o6M2M2p3J32m2m2P2P3nmn6n6O6O6P9
$$ 618 399 396 394 476 557 537 516 426 335 219 307 454 398 367 540 371 407 341 275 317 359 286 418 376 334 406 479 474 470 414 358 424 490 569
2393E69j25mmL4L4L2L2N7j47j85J9O2O1k7k7p8p8Q5Q5j8j7O2O1j08j08M7M7o8J36N4N3l6l5
$$ 569 444 440 436 470 504 536 568 625 478 293 312 374 435 408 381 303 225 310 395 377 360 422 483 375 267 314 361 293 429 483 536 500 465
2390D65n5n5n5n5kjkkj0j0R2R1k9l0P3P2m4m3nnJ75k9q4q4L1L0r7J08R8j05m2J62J5J4p5p4
$$ 465 410 355 300 245 243 242 240 238 228 218 310 401 372 342 415 487 443 400 395 390 565 536 452 368 399 429 332 440 538 433 391 553 568 582 507 433
2387D33K1K2L4j70M3M2j74L0j4J90K0j85J40o4j3j4j5j5P4P5R8j05j06R9PQK0K0p5p6J08J07
$$ 433 454 476 510 340 383 425 251 281 267 457 477 292 432 368 355 341 326 311 385 460 558 453 347 446 453 461 481 501 426 350 458 565
2384E65j51N2o2o2J0J0J0J0J52J51j9j9j76j76KK07O9j34pqlmmmL2L2m9m9L12j65J4J4j94
$$ 565 414 466 404 342 352 362 372 382 534 685 666 647 471 295 297 504 573 439 432 424 421 417 413 409 441 473 424 375 687 522 536 550 356
2381C56J1j5j5J21q4k1k0N4N3N3N3k6k6k7k6k7k7k7k7Q1Q2q9q9L5L5L4L5JJ%JK8K7j42j42
$$ 356 367 352 337 458 374 353 333 387 440 493 546 520 494 467 441 414 387 360 333 414 496 407 318 353 388 422 457 458 459 459 460 488 515 373 231
2378B31J22J23o1o0J68l6M0M1k35l1K5K5P2P2r8r8L1L0R5j10L7L8p8p8Q7Q7j5j5P2P1l1l0
$$ 231 353 476 415 355 523 487 527 568 333 302 327 352 424 496 398 300 331 361 456 346 383 421 343 265 352 439 424 409 481 552 521 491
2375D91M1M2j29j28J16J16j22j22N7N6J21q4L3L2m3m4J64l9j4j5k36l2J38o6K5K5j02J02K4
$$ 491 532 574 445 317 433 549 427 305 362 418 539 455 488 520 477 433 597 558 544 529 293 261 399 333 358 383 281 383 407
2372D07K4O2j42k4J80j13R1J5J5p4p4P8P8r2r2R4R4p5p6O0O0m2m2P1P1l1l1o6o6K4K3Q5j18
$$ 407 431 493 351 327 507 394 485 500 515 441 367 445 523 431 339 433 527 452 376 436 496 454 412 483 554 523 492 426 360 384 407 492 374
2369C74N9j44P1P0PPo7o7L5L5O1O0m1m2j9j9L2L2mln4n4L1L0R5j09kjk6k7J90j3jkN6N5m7
$$ 374 433 289 360 430 437 444 377 310 345 380 441 501 460 418 399 380 412 444 440 437 383 329 360 390 485 376 374 373 347 320 510 497 496 494 550 605 558
2366E58m7k5k5q9q9K05Jj69L6j2j1R0R1Q9j15l8l8l1J72N8N7n0m9n0n0p9p9R1R1m1m0m1m1
$$ 558 511 486 461 372 283 488 489 320 356 344 333 423 514 603 488 450 412 381 553 611 668 618 569 519 469 390 311 402 493 452 412 371 330
2363C30J04J04o6o6O7O8Q1j24L4L4q1q0L8L8P2j31k07J33R9R9j03j03O7O8K7K7J4J5P7j27
$$ 330 434 538 472 406 473 541 622 498 532 566 485 405 443 481 553 422 215 348 447 546 443 340 407 475 502 529 543 558 635 508
2360E08o4o3Q9Q9j50j49LKK20J5j08j08J04J04J49n6m2m3l1l2j47N7M7M7m2m3m1m1J29J30
$$ 508 444 381 470 559 409 260 263 265 485 500 392 284 388 492 641 585 543 500 469 437 290 347 394 441 399 356 315 274 403 533
2358E33p3p3K9K9K4K4r1J13l8l8k5k5M4M4p1J33p3p3N5j50k1k0K04K05k7k7N0j55o3J41k5
$$ 533 460 387 416 445 469 493 402 515 477 439 414 389 433 477 406 539 466 393 448 298 277 257 461 666 639 612 662 507 444 585 560
2355E60k5q3J20r6r6m0l9J26p8lkQ6Q7p8p8R2R1r5r5O2O2J5j90R6R6r2r1m9J55J48n6j46N9
$$ 560 535 452 572 476 380 340 301 427 349 346 344 430 517 439 361 453 544 449 354 416 478 493 303 399 495 403 312 263 418 566 510 364 423
2352D23K0K1j84K0R0R0j2j2J12r3q0q0P8P9R1j12L8L8K5K6j12j12J85j8j59M5K0K0j9j8l2
$$ 423 443 464 280 300 390 480 468 456 568 475 395 315 393 472 563 451 489 527 552 578 466 354 539 521 362 407 427 447 428 410 378
2349C78l1J66l8k5k5K1K1q2q1N3N3N3N3K5K5j7k22j4J90J1J2q0q0K2K2n2n1MK08r0r0J06J05
$$ 378 347 513 475 450 425 446 467 385 304 357 410 463 516 541 566 549 327 313 503 514 526 446 366 388 410 358 307 311 519 429 339 445 550
2346E50j18Q5o7o8l1J73Q0k61K3K3j1j1R8j06QRj5j5J00j04P9P8L2j72j30K11J46j93NML5
$$ 550 432 517 450 382 351 524 604 343 366 389 378 367 465 359 367 376 361 346 446 342 421 499 531 359 229 440 586 393 398 402 437
2343D37L5N5N6j01j02q6J18LLJ2J2J1J2o2o2J55m9p2p3J7J6J38J37j48N7j6j6RJ0o4J40J3
$$ 437 472 527 583 482 380 294 412 415 418 430 442 453 465 403 341 496 447 375 302 319 335 473 610 462 519 503 487 496 506 442 582 595
2340E95J2N6j47m6J58r2r2k8k8J02J02o9o8KKj64M0RRK2K2lkR9R9j4j5j4j5%%J66l9j14j14
$$ 595 607 663 516 470 628 536 444 416 388 490 592 523 455 457 459 295 335 344 353 375 397 394 392 491 590 576 561 547 532 532 532 698 659 545 431
2337D31M4M3L5L5o7o7m2m2O1O0j36j35K17J3j8j7N8N9P1j32o9o9N9O0m3m2J02J03o7o8J7J6
$$ 431 475 518 553 588 521 454 412 370 431 491 355 220 437 450 432 415 473 532 603 471 402 333 392 452 409 367 469 572 505 437 454 470
2334D70J7J6M4M3Q6j18j43O0J8J8OPj08R5O7O8p4p3L9L9m6m6m3m3M2M2nonok4k5K7j78r5K44
$$ 470 487 503 547 590 676 558 415 475 493 511 517 524 416 511 578 646 572 499 538 577 531 485 442 399 441 483 478 472 467 461 437 412 439 261 166 410
2331D10M1M1QRm2m2oopoj2j3J03j02m7m7R4R3J1J1J0J1j2j3L9L9l2l3l2l3QQQRl5l4N0N1j5
$$ 410 451 492 500 509 467 425 419 413 406 400 388 375 478 376 329 282 376 469 480 491 501 512 500 487 526 565 533 500 468 435 443 451 459 468 433 399 449 500 485
2327D85j5P0P1n4n3j93J47j5j4N7N8j3j4j3j4j2j3o3o4P1P0P1P0%%q5q6J7J7r8J06j15j15
$$ 485 470 540 611 557 504 311 458 443 429 486 544 531 517 504 490 478 465 402 338 409 479 550 620 620 620 535 449 466 483 385 491 376 261
2324B61J52J53qqj27j27R3R3k6k6klL6L6M0j64M8M9j15Q9K6K5j08j07Q0P9L0K9J36k04%%r
$$ 261 413 566 558 550 423 296 389 482 456 430 428 425 461 497 537 373 421 470 355 444 470 495 387 280 360 439 469 498 634 430 430 430 421
2321D21qq9J16O5O4k42l9%jL5L4L5L5J1J1N4j50r8J06J44o0JKM0L9j1j1q4q3L0K35J4j91j7
$$ 421 413 324 440 505 569 327 288 288 287 322 356 391 426 437 448 502 352 254 360 504 444 445 447 487 526 515 504 420 337 367 602 616 425 408
2318D08j7N5N5MMrrJ16q8K7K8q8q7J13r1K4K4j41j41J51J51j50N3K3K3l7l7p9J25J0J0M5M5
$$ 408 391 446 501 505 509 500 491 607 519 546 574 486 399 512 421 445 469 328 187 338 489 339 392 415 438 401 364 285 410 420 430 475 520
2315E20n3n3J21q3KK06r2r2OPo3o2N7N7k4k4n4J51o0n9MMJ6J6J6J5m6m6J06J07j05j04M8M8
$$ 520 467 414 535 452 454 660 568 476 482 489 426 364 421 478 454 430 376 527 467 408 412 416 432 448 464 479 433 387 493 600 495 391 439 487
2312D87m4m4J9K0j6J89q0p9QRK1K1j50N4J73l1n7n7o6J39mmL8j65l0k9J11J11k4k3J03j00
$$ 487 443 399 418 438 422 611 531 452 460 469 490 511 361 415 588 557 500 443 377 516 512 508 546 381 351 322 433 544 520 497 600 500
2309E00j46N9LK07r7r8Q1j24k1k1K9L0r8J06k2k1J44o0N5N4m2m2j78K6K12j29K4K4l2l2J08
$$ 500 354 413 416 623 526 428 509 385 364 343 372 402 304 410 388 367 511 451 506 560 518 476 298 324 536 407 431 455 423 391 499
2306D99k32L3L4R7R7j3j2%%K4K28j42j42m3m3l8J65o9p0R7R6l2l2j47N8M8M8J0J0n2n2L3L4
$$ 499 267 300 334 431 528 515 503 503 503 527 755 613 471 428 385 347 512 443 373 470 566 534 502 355 413 461 509 519 529 477 425 458 492
2303D92PPj07R6q7q8M5M4l5l5N0N0l9l9J82k3N7j47M0M0J3J2%jJ22q2K0K0O9j35O5O5L2L3
$$ 492 499 506 399 495 408 320 365 409 374 339 389 439 400 361 543 520 577 430 470 510 523 535 535 534 656 574 594 614 683 548 613 678 710 743
2300G43n3n2j5j6k8k8J73l2L3L2P0P1o5J38K92m7r9r9p4p3j58j59oonon3n3O7O6j2j2J03j01
$$ 743 690 638 623 607 579 551 724 692 725 757 827 898 833 971 1263 1216 1117 1018 944 871 713 554 548 542 537 531 478 425 492 558 546 534 637 536
2297E36N5N5rrp3p3j80J61J6J7j4j4M6M5M1j63M6M6J3J2R2k48K8K8L4L3J53j88j31P2L5L4
$$ 536 591 646 637 628 555 482 302 463 479 496 482 468 514 559 600 437 483 529 542 554 646 398 426 454 488 521 674 486 355 427 462 496
2294D96j08R6R6j08j9j9l2l1L7L7L8L7p9p9P3P4l8l8l8l8M1M0N4N3j08R6n7k61R5R5p1p1Q2
$$ 496 388 484 580 472 453 434 402 371 408 445 483 520 441 362 435 509 471 433 395 357 398 438 492 545 437 533 476 215 310 405 334 263 345
2291C45Q2Q3Q2KLKLj12j13M1M1M4M5j22Q3k4k5o3o3O0N9M7M6J12r3r2J11m2m2k9k9N2N2%J
$$ 345 427 510 592 594 597 599 602 490 377 418 459 503 548 426 509 485 460 397 334 394 453 500 546 658 565 473 584 542 500 471 442 494 546 546 547
2288E47N0M9q2q2Q3j20M5M5l9l9%jK03jj70L3rrq5q6p5J29O6O5J4J5k5k4n6J48M6j58P4P3
$$ 547 597 646 564 482 565 445 490 535 496 457 457 456 659 658 488 521 512 503 418 332 257 386 452 517 531 546 521 497 441 589 635 477 551 624
2285F24J50j90opr1J13m6m6k1k0j29P5j03J00O0N9Q5j20QPonQ4Q4j8j7M8M8n4n4O5O5n0m9
$$ 624 774 584 578 571 480 593 547 501 480 460 331 406 303 403 463 522 607 487 495 502 496 491 575 659 641 624 672 720 666 612 677 742 692 643
2282F43J22q1L3L3J9J9OK10K7K7N3N3L5K39l4l3J25L29J13J12J73J72J09J09J89j4kkj45j44
$$ 643 765 684 717 750 769 788 794 1004 1031 1058 1111 1164 1199 1438 1404 1371 1496 1825 1938 2050 2223 2395 2504 2613 2802 2788 2786 2784 2639 2495
2279B495q1k85j60j60j23j22j41j41p7p7j84J9J90j4m1m1j04j05j08j07ooP9P9r2r1P8P7r2
$$ 2495 2414 2129 1969 1809 1686 1564 1423 1282 1205 1128 944 963 1153 1139 1098 1057 953 848 740 633 627 621 700 779 687 596 674 751 659
2277F59r2N8N9PQl6l6P8j25o3o4R4R4j25j25J81J81r3r4QRk4k3l7l6O3j41l9J65J7J7Q1Q1
$$ 659 567 625 684 691 699 663 627 705 580 517 453 547 641 516 391 572 753 660 566 574 583 559 536 499 463 526 385 346 511 528 545 626 707
2274G07q2q1J35o9j2j1j2j1oJ98L2L2j43j44m1m1J23J23j03j02o0J44p2p3J57J57q0q1J1J2
$$ 707 625 544 679 610 598 587 575 564 558 756 788 820 677 533 492 451 574 697 594 492 432 576 504 431 588 745 665 584 595 607
2271F07n2J51k4k5j01K39m6m5k5k5r1r1l9m0N9N8m3m3M5M5j71L2L9L9L8L9J19q5p2p2M5M5
$$ 607 555 706 682 657 556 795 749 704 679 654 563 472 433 393 452 510 467 424 469 514 343 375 414 453 491 530 649 564 492 420 465 510
2268E10n7n7J33J34l7l6K2K2k9k9jj%jlmRRr7J08J07r6J6J6LMr2r1R2R1j64M1K8K7J6J6LL
$$ 510 453 396 529 663 626 590 612 634 605 576 575 574 574 573 570 566 575 584 487 595 702 606 622 638 641 645 553 462 554 645 481 522 550 577 593 609 612 615
2265F15O4j39k5k4J8J8J8J9O7O7k01MP6P7Q5j18n8n7p8J25Q8j16j29K11j7j6q0q0O0O0m6m7
$$ 615 679 540 515 491 509 527 545 564 631 698 497 501 577 654 739 621 563 506 428 553 641 525 396 607 590 574 494 414 474 534 488 441
2262D41j09R4J7J8J32p1p6p6M0M0q8J17Q7j17m0J64j23Q1q5J19j2j2JJk4k5l7l8Q7j18P4j30
$$ 441 332 426 443 461 593 522 446 370 410 450 362 479 566 449 409 573 450 531 446 565 553 541 542 543 519 494 457 419 506 388 462 332
2259C32j9J85m0m0M3j61K6K6J68l7k8k8j05J00j6j5R0Q9Q6j19%jL7L8n3n3kkllklK1K0K1K1
$$ 332 313 498 458 418 461 300 326 352 520 483 455 427 322 422 406 391 481 570 656 537 537 536 573 611 558 505 503 501 498 495 493 490 511 531 552 573
2255E73m4m4Q9Q8j32P3QRN5N6r7r8MLP6P6J08r6r6J08nnQRk6k5J28J28K3K3j77K7k6k6o4o5
$$ 573 529 485 574 662 530 603 611 620 675 731 634 536 540 543 619 695 803 707 611 719 714 709 717 726 700 675 803 931 954 977 800 827 801 775 711 646
2252F46o0n9k2k2J44o1LLl7l8k4k5r5J10onPPQPKKKKN5N5r8r8P1P0m8m9Q9Q8j58M6N7j48k1
$$ 646 586 527 505 483 627 566 569 572 535 497 473 448 353 463 457 452 459 466 474 481 483 485 487 489 544 599 501 403 474 544 496 447 536 624 466 512 569 421 400
2249D00k0M7M8j6j6J41o3N2N2PPp7p8l8l7l7l8J57J57r8r8M5M5ooL2L3L2L2l1l2l2l1N8N7
$$ 400 380 427 475 459 443 584 521 573 625 632 639 562 484 446 409 372 334 491 648 550 452 497 542 536 530 562 595 627 659 628 596 564 533 591 648
2245F48r5r5J1J1O2O3qqM3M3k6k6p7p7J5J4KJJ42o2M0M0J6j88Q1Q0l3l2r6J08L3L3mnklQ3
$$ 648 553 458 469 480 542 605 597 589 632 675 649 623 546 469 484 498 500 501 643 581 621 661 677 489 570 650 617 585 489 597 630 663 659 654 652 649 732
2242G32Q3j37j37J18J18j01j01J67l10K3K2M3M4J7J8J7J8p1p1j9k0Q1Q1J8J7R0j14n1n0k7
$$ 732 815 678 541 659 777 676 575 742 432 455 477 520 564 581 599 616 634 563 492 473 453 534 615 633 650 740 626 575 525 498
2239D98k7Q0Q0M1j63L8L7l9l8Q1Q0k8k9k9k9L1L2n4n4K1K2r8r7LLN4N4J0J1M0j64O6O7o1J43
$$ 498 471 551 631 672 509 547 584 545 507 588 668 640 611 582 553 584 616 562 508 529 551 453 356 359 362 416 470 480 491 531 367 433 500 439 582
2236E82k2k2l9J66K7K8j13j13ononj8j7r4J10J34p0j34K05p4p5L2L1pqM3M4p0p0J30J30k05
$$ 582 560 538 499 665 692 720 607 494 488 483 477 472 454 437 343 453 587 517 383 588 514 439 471 502 495 487 530 574 504 434 564 694 489
2233D89jP1P2l7l6n8n8K26j15j01J02J32p3MMm3m4Q8Q8Q9k50o0n9K3K2J0J0J15r0K6K5p0p0
$$ 489 488 559 631 594 558 500 442 668 553 452 554 686 613 617 621 578 534 622 710 799 549 489 430 453 475 485 495 610 520 546 571 501 431
2230D31R6R5q7J16o2J42m8m9k01KmmJ24q1n8n8K18K18k0k1N6j49j49N5M8n3p2J33J1J2k3k3
$$ 431 527 622 535 651 589 731 683 634 433 435 431 427 551 470 412 354 572 790 770 749 805 656 507 562 610 557 485 618 629 641 618 595
2227E95j43O0R6oPPN1n2j94J0Q4Q5J60m3K2K1RRnno9J35rj0j17Q6J42M0m8j49jJ00J13r1k16
$$ 595 452 512 608 602 609 616 667 615 421 431 515 600 760 717 739 760 769 778 773 768 699 834 825 815 698 784 926 966 918 769 768 868 981 890 674
2224F74j2j23K17J22q2K6p6M8M8m3m3m8m9J16J3R7j07n6M6qqm0m0j9J85m3m3q3J8K11j30k2
$$ 674 662 539 756 878 796 822 746 794 842 799 756 708 659 775 788 885 778 722 768 760 752 712 672 653 838 795 752 669 687 898 768 746
2221G46Q0N3N3K5K5J91j3j26j27k0k1j9k0L2L2j3j3j3j3L6L6L6L6o2o2JKl5J70N5N5MNl9m0
$$ 746 826 879 932 957 982 1173 1160 1034 907 887 866 847 827 859 891 878 865 852 839 875 911 947 983 921 859 860 862 827 997 1052 1107 1111 1116 1077 1037
2218A037o6L7q4J19M5M4j72L2K09NJ8J8P8j25j1j1P1P2r8r8Q2Q2j9k0J19J20r8J07K5K5k6
$$ 1037 971 1008 924 1043 1088 1132 960 992 1201 1206 1224 1242 1320 1195 1184 1173 1244 1316 1218 1120 1202 1284 1265 1245 1364 1484 1386 1493 1518 1543 1517
2215A517k6J54n0M3M3J91j50J56m7P1P2M5M6K18J5J28J29llQ6Q7J23q1K72K72K44K43J92J93
$$ 1517 1491 1645 1595 1638 1681 1872 1722 1878 1831 1902 1974 2019 2065 2283 2298 2426 2555 2552 2549 2635 2722 2845 2764 3036 3308 3552 3795 3987 4180
2213D180K45K46L47L48L84L85N55N55P36P35P96J136J297J501J977K182K661L273L809M829
$$ 4180 4425 4671 5018 5366 5750 6135 6690 7245 7981 8716 9512 10648 11945 13446 15423 17605 20266 23539 27348 32177
2211C2177O126P963J0693J3481J6723J8832J6978Q067o853j8350k2210j9693j5426j1413q437
$$ 32177 38303 46266 56959 70440 87163 105995 122973 131040 124187 105837 83627 63934 48508 37095 28658
2209B8658n784m214l058k404j927j440j235p98p97o94m89m34m34l09l09l08l09k05k06m0k44
$$ 28658 22874 18660 15602 13198 11271 9831 8596 7798 7001 6307 5818 5384 4950 4641 4332 4024 3715 3510 3304 3264 3020
2208C020m4m4k14k14k51m7o0o0l3l4j35j35OOm5m5k0k0Q2Q2r9j00q7q7j89J5KLN1N1n1n1o3
$$ 3020 2976 2932 2718 2504 2253 2206 2146 2086 2053 2019 1884 1749 1755 1761 1716 1671 1651 1631 1713 1795 1696 1596 1509 1422 1233 1248 1250 1253 1304 1355 1304 1253 1190
2205A190o3J21J20k44l9Q4Q4m7m8j62M2K5K4p7p7J28p6L8L9K5K5L7j66K2K2M7M8R2j12o1J43
$$ 1190 1127 1248 1368 1124 1085 1169 1253 1206 1158 996 1038 1063 1087 1010 933 1061 985 1023 1062 1087 1112 1149 983 1005 1027 1074 1122 1214 1102 1041 1184
2202A184por6r6P8P7j39O4l7l8j2j2j24Q1J82k2j8j9K0J9k8k8j30j31P0O9l2l3M4M4N7N7J3
$$ 1184 1177 1171 1075 979 1057 1134 995 1059 1022 984 972 960 836 917 1099 1077 1059 1040 1060 1079 1051 1023 893 762 832 901 869 836 880 924 981 1038 1051
2199A051K18J02J03J77J76O3K66K6K6j32j31k21k20j19j18q4q3r6r6Q6j19n4n5N6N7j26j27
$$ 1051 1269 1371 1474 1651 1827 1890 2156 2182 2208 2076 1945 1724 1504 1385 1267 1183 1100 1004 908 994 875 821 766 822 879 753 626
2196F26J74l1p3p4qJ95r8J06O2j42L7L7J2J2l9l9M8M8o7J37K2K1K2K1N0j54j54N1N5N6j7j7
$$ 626 800 769 696 622 614 809 711 817 879 737 774 811 823 835 796 757 805 853 786 923 945 966 988 1009 1059 905 751 802 857 913 896 879
2193H79JJK14J0r4J09m8J57KKP9j25O9O9P0O9j43O2K24K23J06r8J82J82O6K69J04L08J57L60
$$ 879 880 881 1095 1105 1011 1120 1072 1229 1231 1233 1312 1187 1256 1325 1395 1464 1321 1383 1607 1830 1936 1838 2020 2202 2268 2537 2641 2949 3106 3466
2191C466N61N61O65Q69Q60Q61J075Q72N95K55k11n51p84j125r53r52q21o17m51k46j62j62
$$ 3466 4027 4588 5253 6122 6982 7843 8918 9790 10385 10640 10429 9878 9094 7969 7016 6064 5243 4626 4175 3929 3767 3605
2189C605j09j10k41k41j29l34k19k19o2o2j47j47p9p9p9p9J8J9o7o6rrj24Q0RJ0k9k9K6K5
$$ 3605 3496 3386 3145 2904 2775 2441 2222 2003 1941 1879 1732 1585 1506 1427 1348 1269 1287 1306 1239 1173 1164 1155 1031 1111 1120 1130 1101 1072 1098 1123
2186A123P7P6j0rr5r5L0K9L0K9j9j9j86J9l3l3R9R8QPJ26J26O2O3n7n7klj76j77j44O0O1j44
$$ 1123 1200 1276 1266 1257 1162 1067 1097 1126 1156 1185 1166 1147 961 980 947 914 1013 1111 1119 1126 1252 1378 1440 1503 1446 1389 1387 1384 1208 1031 887 947 1008 864
2183H64k5k4J4J3m0m0m1m0J4J4j77J63n4n4l3l3jkjkM3M4R4j10j43J97n9n8k4k4R5R5jjl9
$$ 864 839 815 829 842 802 762 721 681 695 709 532 695 641 587 554 521 520 518 517 515 558 602 696 586 443 640 581 523 499 475 570 665 664 663 624
2180F24m0j37O7L7L7o0o1rj0N6N7p6p5J45o0j10R3J3J3K6K5rj0KLj27P7M8M7n9o0N9O0j6j5
$$ 624 584 447 514 551 588 528 467 458 448 504 561 485 410 555 495 385 478 491 504 530 555 546 536 538 541 414 491 539 586 527 467 526 586 570 555
2176E55J00j04J4J3KJk0k1L1L1J3J2N5j50j20Q3m4m4J5J4J80k4OOpok3k4K8K8mlj7j7N7j47
$$ 555 655 551 565 578 580 581 561 540 571 602 615 627 682 532 412 495 451 407 422 436 616 592 598 604 597 591 568 544 572 600 596 593 576 559 616 469
2173D69J21J20p3p4k3k3M1M0o5o6m0J64l6l6M7M7J11r4l2l1l2l2j02J01J15r0j64L9J68J67
$$ 469 590 710 637 563 540 517 558 598 533 467 427 591 555 519 566 613 724 630 598 567 535 503 401 502 617 527 363 402 570 737
2170G37jkn3n2J0J0J12r2M0j65K2K2k1k1R8R8q3q2L6L7n5n4mmK6K7j40O5M1M1J6J6j73L1j2
$$ 737 736 734 681 629 639 649 761 669 709 544 566 588 567 546 644 742 659 577 613 650 595 541 537 533 559 586 446 511 552 593 609 625 452 483 471
2167D71j1J52n2k2k2L3L2oon4J49L4L5k8k7j43O2L7L7N0N0j7j8o8o8J5J6n7n7j38O6P1P0p6
$$ 471 460 612 560 538 516 549 581 575 569 515 664 698 733 705 678 535 597 634 671 721 771 754 736 668 600 615 631 574 517 379 445 516 586 510
2164E10p5P8P8J2J2J3J2K5K5K5K5r9j00m9m9N8N7J73l2l5l4J18q6%Jj3j2j5j6J00j05o0o0
$$ 510 435 513 591 603 615 628 640 665 690 715 740 641 541 492 443 501 558 731 699 664 630 748 662 662 663 650 638 623 607 707 602 542 482
2161D82Q0Q1n1n1j14Q9L5L4l8l8LLJ00J01p7J27j07j07K3K2L5L5p9J24j09j10NMMNM4M5m0
$$ 482 562 643 592 541 427 516 551 585 547 509 512 515 615 716 639 766 659 552 575 597 632 667 588 712 603 493 498 502 506 511 555 600 560
2158E60m1MMJ82j58J39o4K9K9L8L7j3j4n2n3kjl6l5J6J5J1J0J0J1L2L2n2n3K1K1QQR3j10M
$$ 560 519 523 527 709 551 690 626 655 684 722 759 746 732 680 627 625 624 588 553 569 584 595 605 615 626 658 690 638 585 606 627 635 643 736 626 630
2155F30MK3K4o2o2L0L0qrj54N1J69l5KKJ04j00j9j9r6J08L9L8N2N1j5j5m4m4L04j71o9p0J44
$$ 630 634 657 681 619 557 587 617 609 600 446 497 666 631 633 635 739 639 620 601 505 613 652 690 742 793 778 763 719 675 979 808 739 669 813
2152H13o1LLqpj99J41L9L9j14j14n5J49K1K2J01j03m0l9P1P1j5j4%j%jL5L6O5j39J1J0kjL7
$$ 813 752 755 758 750 743 544 685 724 763 649 535 480 629 650 672 773 670 630 591 662 733 718 704 704 703 703 702 737 773 838 699 710 720 718 717 754
2149G54L8j66J74N0j55r5J10J34o9m4m4J01J02o8o9R3R3o4o5j37O8N4N5J44J43k6k6j44j43
$$ 754 792 626 800 850 695 600 710 844 775 731 687 788 890 822 753 846 939 875 810 673 741 795 850 994 1137 1111 1085 941 798
2146G98J42o3L1L1ONK01lj05R9J5J5K8K8l9m0O3O3qrn9n9J16J16J4J3m8m8N4N4N7N6M3M3L5
$$ 798 940 877 908 939 945 950 1151 1148 1043 1142 1157 1172 1200 1228 1189 1149 1212 1275 1267 1258 1199 1140 1256 1372 1386 1399 1351 1303 1357 1411 1468 1524 1567 1610 1645
2143A645j69M8M7M4M3M4M3J49J49j36O8K35K36P7P8J12J12J75k8K27K28J26J25O9K74K60K60
$$ 1645 1476 1524 1571 1615 1658 1702 1745 1894 2043 1907 1975 2210 2446 2523 2601 2713 2825 3000 2972 3199 3427 3553 3678 3747 4021 4281 4541
2140D541J49J49K12K13K48M53L93N98M41M41Q75O70J021J020J365J569J858K335K785L397
$$ 4541 4690 4839 5051 5264 5512 5965 6358 6956 7397 7838 8713 9383 10404 11424 12789 14358 16216 18551 21336 24733
2139B4733L906M927N386N863N734M714K793J39k403m105m921m444l641k757k033j830k291
$$ 24733 28639 33566 38952 44815 50549 55263 58056 58195 55792 51687 46766 42322 38681 35924 33891 32061 29770
2137B9770k631k904l243k946k197j951j747j131p92n96n95l76l76l12l12j94J0k62k62j97
$$ 29770 27139 24235 20992 18046 15849 13898 12151 11020 10228 9632 9037 8661 8285 7973 7661 7467 7477 7215 6953 6756
2135F756Po5J38M19K14M44M44N78N78P82J123R45J286J278R37M46l0k98p74q21q20n19j79
$$ 6756 6763 6698 6836 7255 7469 7913 8357 8935 9513 10295 11418 12363 13649 14927 15864 16310 16280 15982 15208 14387 13567 13048 12869
2133A2869K22M26R28J404J674J878J904J699J171K87p50j771k256k596k545k204j763j558
$$ 12869 13091 13517 14445 15849 17523 19401 21305 23004 24175 24462 23712 21941 19685 17089 14544 12340 10577 9019
2131I019j274p97q32q33n30l27n65l62k38k38j7k21j70j70L2j72n7n7q7q7k53m9L1L1j26j26
$$ 9019 7745 6948 6116 5283 4753 4426 3861 3499 3261 3023 3006 2785 2615 2445 2477 2305 2248 2191 2104 2017 1764 1715 1746 1777 1651 1525
2129A525P7P8j52N2K2j82o7J37j2j2q8q9j37O7N4N4o7o7o7o7K2K1j7j7m5J60n8n7L7L7p3k78
$$ 1525 1602 1680 1528 1580 1602 1420 1353 1490 1478 1466 1378 1289 1152 1219 1273 1327 1260 1193 1126 1059 1081 1102 1085 1068 1023 1183 1125 1068 1105 1142 1069 791
2126G91k7J77N0M9j2j2j2j3N5N5N5N4j5j6j5j5JJQ2Q1rl50l5J69j01j01J28p6J0RRRj13R1
$$ 791 764 941 991 1040 1028 1016 1004 991 1046 1101 1156 1210 1195 1179 1164 1149 1150 1151 1233 1314 1305 955 920 1089 988 887 1015 939 949 958 967 976 863 954
2123I54k4k5L2L1L1L1MMLMJ1J2O2O2M4M4n9n8Q5Q5k9l0Q4j19nnR9R9p0p1J64J65p3p4J31J30
$$ 954 930 905 937 968 999 1030 1034 1038 1041 1045 1056 1068 1130 1192 1236 1280 1221 1163 1248 1333 1304 1274 1358 1239 1234 1229 1328 1427 1357 1286 1450 1615 1542 1468 1599 1729
2120A729K9K8L9L9J96J97L88J85K48K49J78J79K93K93M29O32P22R26J251J455J893J893J830
$$ 1729 1758 1786 1825 1864 2060 2257 2645 2830 3078 3327 3505 3684 3977 4270 4699 5331 6053 6979 8230 9685 11578 13471 15301
2118A5301J217K26o58j643k119k047k047j702j226r63p58m50m49j98j99j87j88j88j88m2m3
$$ 15301 16518 16744 16086 14443 12324 10277 8230 6528 5302 4339 3581 3131 2682 2484 2285 2098 1910 1722 1534 1492 1449
2116A449j45j45K3K3J1J0P2j32j45O0L7j68J2J1j1j2j13j14L3L2Q3Q3o4o3J02j02l4l4o0J45
$$ 1449 1304 1159 1182 1205 1216 1226 1298 1166 1021 1081 1118 950 962 973 962 950 837 723 756 788 871 954 890 827 929 827 793 759 699 844
2113H44j44j44J54n0M0M0j1j1k27k4J60m5j97QJ65m0N9N8M6M5m4m3R2j12j88J52J65l9M5M5
$$ 844 700 556 710 660 700 740 729 718 491 467 627 582 385 393 558 518 577 635 681 726 682 639 731 619 431 583 748 709 754 799
2110G99j38j38k0j9L1L2M9N0O2j41J8J8NNM2M1o1o0p3p2J10J11r4J11j41O4J80j60q3J20O8
$$ 799 661 523 503 484 515 547 596 646 708 567 585 603 608 613 655 696 635 575 502 430 540 651 557 668 527 591 771 611 528 648 716
2108G16j37J18q5j42O3J52n2k8k7m1m0P0P0L2L2j82K3RJ0l4l4O9O8K1K2o8o8j5J88r6r7j3
$$ 716 579 697 612 470 533 685 633 605 578 537 497 567 637 669 701 519 542 551 561 527 493 562 630 651 673 605 537 522 710 614 517 504
2105E04j4J57J56o3o3N2j52O2O3n3n2p9p9r2J12M4M4m5m5N7N7m5m5M8M7n4n5M9M9kkJ7J7O8
$$ 504 490 647 803 740 677 729 577 639 702 649 597 518 439 347 459 503 547 502 457 514 571 526 481 529 576 522 467 516 565 563 561 578 595 663
2102F63O8J0J1J0J0l3l3j48N6J2J3r0J15OOl2l2j6j6p9J25LMJ6J6jj%jj5j4p9p8J21q3J59
$$ 663 731 741 752 762 772 739 706 558 614 626 639 549 664 670 676 644 612 596 580 501 626 629 633 649 665 664 663 663 662 647 633 554 476 597 514 673
2098F73m5m6J59n5n4O5O5l2l3j68J73R6j08r3r3J4J3J3J4j02J03K4K5k39J01M7M7o4o4J81
$$ 673 628 582 741 686 632 697 762 730 697 529 702 798 690 597 504 518 531 544 558 456 559 583 608 369 470 517 564 500 436 617
2096F17k4j51J89n4n3l2l3QPPQM8M7p1p1J15J16j06j05O5O6K7K7j23Q0l5l4PQQQl2l2Q7Q6
$$ 617 593 442 631 577 524 492 459 467 474 481 489 537 584 513 442 557 673 567 462 527 593 620 647 524 604 569 535 542 550 558 566 534 502 589 675
2092F75k1k2j36O8P6P7J7j87L4L3K0K1l6l5j50N4k5k5P3P3l5l5Q4Q4q2q2L7L7m9m9L6L5j7
$$ 675 654 632 496 564 640 717 734 547 581 614 634 655 619 584 434 488 463 438 511 584 549 514 598 682 600 518 555 592 543 494 530 565 548
2089E48j7j8j7RJ0j05R8ooJ21q3M2M3R4j10llj01j01P7P6P3j32M3M3k1k1L8L8m6m7M8M8M8
$$ 548 531 513 496 505 515 410 508 502 496 617 534 576 619 713 603 600 597 496 395 472 548 621 489 532 575 554 533 571 609 563 516 564 612 660
2086F60M8K8K9j25j24%JJ4J4o9J35l1l1j1j2k4k5J62m3q0q1O9O9J9J8l0l0N6N5n6n7K9K9M
$$ 660 708 736 765 640 516 516 517 531 545 476 611 580 549 538 526 502 477 639 596 516 435 504 573 592 610 580 550 606 661 605 548 577 606 610
2083F10Mj11R4J2J3j3j3o3J42K7K7nnj46j45o5J39K4K4m4m4QPn8n7n8n8O7O7J31p4Q3Q2j5
$$ 610 614 503 597 609 622 609 596 533 675 702 729 724 719 573 428 363 502 526 550 506 462 470 477 419 362 304 246 313 380 511 437 520 602 587
2080E87j5m4m3m4m4K3K3P4P4OOOOn1n1j27P6O7j39j0j1N0M9p0p0k1k1k1k1J71J71lk07%%P2
$$ 587 572 528 485 441 397 420 443 517 591 597 603 609 615 564 513 386 462 529 390 380 369 419 468 398 328 307 286 265 244 415 586 583 376 376 376 448
2077D48P3k4k3K7K8rrM3M2k7k7K4K5KLM1M1J1j93M0M0mmO8O8M3j61NNN2N1q8q9r5J09n7n7
$$ 448 521 497 474 501 529 520 511 554 596 569 542 566 591 593 596 637 678 689 496 536 576 572 568 636 704 747 586 591 596 648 699 611 522 427 536 479 422
2073D22k3k3O2O2O3O3r1r0JJN2N2n6n6mnj8j9O7O6k5k6R0j15M8M8Q6Q6j21j21O5O6q4q4J4
$$ 422 399 376 438 500 563 626 535 445 446 447 499 551 495 439 435 430 412 393 460 526 501 475 565 450 498 546 632 718 597 476 541 607 523 439 453
2070D53J3l9J66J43o0J11k29q0J23j15j15o4J40P6P6o4o5o0o0J18q5l6J68J69l6n6J48j32
$$ 453 466 427 593 736 676 787 558 478 601 486 371 307 447 523 599 535 470 410 350 468 383 347 515 684 648 592 740 608
2068F08j33M3M3q9q9j42J98N7N8PQnnJ48n5o0o0N6N6o3o3N8N8m9m8J83j57K1K2Q4j19nnO9
$$ 608 475 518 561 472 383 241 439 496 554 561 569 564 559 707 652 592 532 588 644 581 518 576 634 585 537 720 563 584 606 690 571 566 561 630
2065F30O8q4q5onooK8K8K20j21m8m9J6J5r0r0J10J10j40O5J49n5j6j7K2K1j68j68J08J08R1
$$ 630 698 614 529 523 518 512 506 534 562 782 661 613 564 580 595 505 415 525 635 495 560 709 654 638 621 643 664 496 328 436 544 635
2062F35j13j05K36k3k3q6q7L0K9K9L0OPN8N8j16j15l1l1P0O9J9J8M3M3p6p7QQJ22q1K8K8J1
$$ 635 522 417 653 630 607 521 434 464 493 522 552 558 565 623 681 565 450 419 388 458 527 546 564 607 650 574 497 505 513 635 554 582 610 621
2059F21j93J2J2j0J95M0j65K7K7j23Q2Q5Q6p5p5M4M4n5n5m2m2j30P3J47J46llj68L5J6J5K8
$$ 621 428 440 452 442 637 677 512 539 566 443 525 610 696 621 546 590 634 579 524 482 440 310 383 530 676 673 670 502 537 553 568 596
2056E96K9L9L9m5m6l4l4l4l4pqpJ97j03J01J14r0%Jk5k5J02j01J3J3M5M5M5M6%JJ15q9L9L9
$$ 596 625 664 703 658 612 578 544 510 476 469 461 454 651 548 649 763 673 673 674 649 624 726 625 638 651 696 741 786 832 832 833 948 859 898 937
2053I37L9j65j9j8P1P1j17j16j4j5j1j1o2o2K8K8K8K8J8J7j48N6N8N9l1l1j5j6L5L5j54j54
$$ 937 976 811 792 774 845 916 799 683 669 654 643 632 570 508 536 564 592 620 638 655 507 563 621 680 649 618 603 587 622 657 503 349
2050C49Q4Q4J3J3%%N9j45j7j7%K04j3j3j12j12N8N9qqJ07J08j08R7j8j8j8j8l1J73m5m5k0
$$ 349 433 517 530 543 543 543 602 457 440 423 423 627 614 601 489 377 435 494 486 478 585 693 585 682 664 646 628 610 579 752 707 662 642
2047F42k0j28P6l8l9K4K5K5K5jjjjL7L6L7L6j27j28J03j02q6J17rj0P7P7k4k5q3q3R9J00o0
$$ 642 622 494 570 532 493 517 542 567 592 591 590 589 588 625 661 698 734 607 479 582 480 394 511 502 492 569 646 622 597 514 431 530 630 570
2044E70J44q5q5J17q6K8K8j18j18N1N2O3O3l9m0N5N4N4N5o9o9q1q2J33p2qqO2O3m0l9M0M0
$$ 570 714 629 544 661 575 603 631 513 395 446 498 561 624 585 545 600 654 708 763 694 625 544 462 595 523 515 507 569 632 592 553 593 633
2041F33KKj07R7o9o8j2j1j2j1M0M0o2o2J2J1J01J01J07r6k24J16M2M1J2J2j12j13j0j0K1K2
$$ 633 635 637 530 627 558 490 478 467 455 444 484 524 462 400 412 423 524 625 732 636 412 528 570 611 623 635 523 410 400 390 411 433
2038D33O0N9J49n6l0k9r5J09j20Q3j43j43J21J20o3J40j2j3j85J9P4P5J6J7l4l4J6J5J6J6
$$ 433 493 552 701 645 615 586 491 600 480 563 420 277 398 518 455 595 583 570 385 404 478 553 569 586 552 518 534 549 565 581
2035E81J4J5J17q8l2k36J03J04j%J2J2j34O9J47j94m1m1M0L9rrR3R2m1m1O1O1k7k7j4j4j76
$$ 581 595 610 727 639 607 371 474 578 577 577 589 601 467 536 683 489 448 407 447 486 477 468 561 653 612 571 632 693 666 639 625 611 435
2032D35K9Q3Q4k2k1j37O8M8M9l7l6J11r3o3o3R2R2m8m8m9J55j1j1n2n2L2L3K1K0j70J69L0
$$ 435 464 547 631 609 588 451 519 567 616 579 543 654 561 498 435 527 619 571 523 474 629 618 607 555 503 535 568 589 609 439 608 638
2029F38L0o7o8k6k6N9N9j04j03K28j12O3j40O8j36M4M3n4n4R2R2PPL7L6q2q2J7J8k1k0r4J10
$$ 638 668 601 533 507 481 540 599 495 392 620 508 571 431 499 363 407 450 396 342 434 526 533 540 577 613 531 449 466 484 463 443 349 459
2026D59nnL9L9m7m6J36J35j54j53N7N7j21Q3J15r0%%rJ95j54N1L3L3p3p3n8n8M8K53j3j2j14
$$ 459 454 449 488 527 480 434 570 705 551 398 455 512 391 474 589 499 499 499 490 685 531 582 615 648 575 502 444 386 434 687 674 662 548
2023E48Q9K6K6m6m6JKj1j2M5j59j72L2K00mQ5j19K2K2P4j31M7M8j7j6%jN1N0KJo2o2J27p7
$$ 548 637 663 689 643 597 598 600 589 577 622 463 291 323 523 519 604 485 507 529 603 472 519 567 550 534 534 533 584 634 636 637 575 513 640 563
2020E63jjj20Q5N4N5o8o8J7J7j3j2r8r8Q6Q7o7o7M9M9l6l6M0M0J55n0l0l1m3m3J47J47j88
$$ 563 562 561 441 526 580 635 567 499 516 533 520 508 410 312 398 485 418 351 400 449 413 377 417 457 612 562 532 501 458 415 562 709 521
2017E21J5J08J08o7o6k4k4J5J4J0j95L9L9K8K9K9K9j5j5L6j68J72l3m9n0O6O5k0j9m4m4PP
$$ 521 536 644 752 685 619 595 571 586 600 610 415 454 493 521 550 579 608 593 578 614 446 618 585 536 486 552 617 597 578 534 490 497 504
2014E04P8P8K7K7p2p2p2p2N4N4l1l0J15J15p2p2M1M0M1M1l0l1l0l0o6o7J21J21r1r0O3O3n3
$$ 504 582 660 687 714 642 570 498 426 480 534 503 473 588 703 631 559 600 640 681 722 692 661 631 601 535 468 589 710 619 529 592 655 602
2011F02n4J13r1k2k2l4l5N4N4j0j0J41o4%Jm4m3m3m3j3j4J53n2k2k3J51J52p7p7RQJJ%Jj17
$$ 602 548 661 570 548 526 492 457 511 565 555 545 686 622 622 623 579 536 493 450 437 423 576 524 502 479 630 782 705 628 637 645 646 647 647 648 531
2008E31j18J38J38n6n6n6n5o1o2R2R2j3j3N9N8M8j56J12r3J08r5OOj4j5J04J04j20j20jjJ18
$$ 531 413 551 689 633 577 521 466 405 343 435 527 514 501 560 618 666 510 622 529 637 542 548 554 540 525 629 733 613 493 492 491 609
2005F09J18k18j4rqJ7J7j1J94j08j09Q0Q0j8j8J10r5l0l1m2m2M3M3k0j9j9j9k1k2k1k1L6L7
$$ 609 727 509 495 486 478 495 512 501 695 587 478 558 638 620 602 712 617 587 556 514 472 515 558 538 519 500 481 460 438 417 396 432 469
2002D69J21J21l8l8q0J23P3j32mmK3K2Q7Q6k00NN5j48J3J3%%JJJ4J3j01J03p5p6J59m4r6J08
$$ 469 590 711 673 635 555 678 751 619 615 611 634 656 743 829 629 634 689 541 554 567 567 567 568 569 583 596 495 598 523 447 606 562 466 574
1999E74%%j07j06M8M8j6J88L0L0r7r8m9J55p4J30j7j7j70L4LLK8K9r6J08M4M4k1k0p2p1Q3
$$ 574 574 574 467 361 409 457 441 629 659 689 592 494 445 600 526 656 639 622 452 486 489 492 520 549 453 561 605 649 628 608 536 465 548
1996E48Q4l6l5L2L3j8j8j06j05J83j56k2J83R7R8p1p0M8M9p6p7j27P6j02J02O4O4j36O8Q5
$$ 548 632 596 561 593 626 608 590 484 379 562 406 384 567 664 762 691 621 669 718 642 565 438 514 412 514 578 642 506 574 659
1993F59Q6j74L0r8r7J16q8K6K7J32J32n5n5l9l8j53N0l1l0J34J35l6l7j13R1O2j43L6L6J6
$$ 659 745 571 601 503 406 522 434 460 487 619 751 696 641 602 564 411 461 430 400 534 669 633 596 483 574 636 493 529 565 581
1990E81J6j03j03R5R5RJ0m2m2QRM5M5p5p4l0l0K1K1qqJ07r7N5N5m3m3O2O2R2j12L8L7j28P6
$$ 581 597 494 391 486 581 590 600 558 516 524 533 578 623 548 474 444 414 435 456 448 440 547 450 505 560 517 474 536 598 690 578 616 653 525 601
1987F01r5J09j4j5R5k45R9R9j%J01j03J59m6j43O1k2k2K9K9J10r3K1K2m8m7o1o0J65l9j16
$$ 601 506 615 601 586 681 436 535 634 633 633 734 631 790 744 601 662 640 618 647 676 786 693 714 736 688 641 580 520 685 646 530
1984E30K25j7j7O8j36l0l0N8N9l2l3p0p1r5J10onO2O1m0m1N0N0N0M9k6k7k7k6N7N8j12j12
$$ 530 755 738 721 789 653 623 593 651 710 678 645 575 504 409 519 513 508 570 631 591 550 600 650 700 749 723 696 669 643 700 758 646 534
1981E34P7P7r4r3o6o6J04J04K7K6L9j65J6J6O7j37mlN6N6j36K03J2J2MLN5j50J62m2m2m3r
$$ 534 611 688 594 501 435 369 473 577 604 630 669 504 520 536 603 466 462 459 515 571 435 638 650 662 666 669 724 574 736 694 652 609 600
1978F00rJ06J05j59M5q2J22lkr2r2RRk9k9n7J47l1l1J39o5j66L7J25J26j47N8mmr3r4P3P3
$$ 600 591 697 802 643 688 606 728 725 723 631 539 548 557 528 499 442 589 558 527 666 601 435 472 597 723 576 634 630 626 533 439 512 585
1975E85Q5j19j14j14R8R9J92j3o7o7k1k0L5K40n9n8m6m5RRJ0Rk6k6K6K5o3o3L9L9qrrrP7P6
$$ 585 670 551 437 323 421 520 712 699 632 565 544 524 559 799 740 682 636 591 600 609 619 628 602 576 602 627 564 501 540 579 571 562 553 544 621 697
1972F97k5k6P1P1r9r9M1M0R2R2j3j3o3o4J5J6J5J5j3j4j3j4lklkm1m1O1O1n9o0M3M2n9o0M2
$$ 697 672 646 717 788 689 590 631 671 763 855 842 829 766 702 717 733 748 763 750 736 723 709 706 704 701 699 658 617 678 739 680 620 663 705 646 586 628
1969F28M3l6l5O7O6l3l3l4l3q8q8Q2Q3L5L5L6L5p4p4K8K8q6q6Q4Q5J3J4l8l8J7J7J6J7M5M6
$$ 628 671 635 600 667 733 700 667 633 600 512 424 506 589 624 659 695 730 656 582 610 638 552 466 550 635 648 662 624 586 603 620 636 653 698 744
1965G44j25j25R9R8p1p2q2q2K0K0R3R2rj0j5j5Q7Q7j2j3j3j3q3q4J9J9M1M1R2R2j31j31J08
$$ 744 619 494 593 691 620 548 466 384 404 424 517 609 600 590 575 560 647 734 722 709 696 683 600 516 535 554 595 636 728 820 689 558 666
1962F66J07n2n2jjJ5J6KLK9j75rj0N4N3j0j1J37o7M8M8O1O0j27j27M4M4j55M8k3k4P4P4k9
$$ 666 773 721 669 668 667 682 698 700 703 732 557 548 538 592 645 635 624 761 694 742 790 851 911 784 657 701 745 590 638 615 591 665 739 710
1959G10k9j7j6j68L7O1O2j1k16J21J20J5J5P9j25J1J2%jL4L4q5q5N4N3M1M0l6k40O1O2m7m7
$$ 710 681 664 648 480 517 578 640 629 413 534 654 669 684 763 638 649 661 661 660 694 728 643 558 612 665 706 746 710 470 531 593 546 499
1956D99P3P2m6m6m6m6J06J05j15j15J06J06K1K1m2m2m1m2P4P5K4K3q4q3q0J25M9M8j38O6N1
$$ 499 572 644 598 552 506 460 566 671 556 441 547 653 674 695 653 611 570 528 602 677 701 724 640 557 477 602 651 699 561 627 678
1953F78N1J3J2o5o5j4j3j1j1j1j0M0M1L7j68OOl7J67j10j10J23J24j2j2J17q9j01J03j90J4
$$ 678 729 742 754 689 624 610 597 586 575 564 554 594 635 672 504 510 516 479 646 536 426 549 673 661 649 766 677 576 679 489 503
1951E03M1M1N5N4p9p8N3N3j17Q6q0p9j3j2J06J07lllln3n4kkM0M1M0M0J3J2p2p3O0O0n8n9
$$ 503 544 585 640 694 615 537 590 643 526 612 532 453 440 428 534 641 638 635 632 629 576 522 520 518 558 599 639 679 692 704 632 559 619 679 621 562
1947E62o7o6J8J9N2N2o2J42l6l5k3k3o4o4N5N5K2K2K2K2M2M2p7p7j1j1P4P4r1r1J5J6J21q2
$$ 562 495 429 447 466 518 570 508 650 614 579 556 533 469 405 460 515 537 559 581 603 645 687 610 533 522 511 585 659 568 477 492 508 629 547
1944E47q2J22j9j8j9j9J51n3m5m5n6J47O3j42J01J01r8r9K1K0N9N8Nj99%JQ2Q2L1L2j8j7j8
$$ 547 465 587 568 550 531 512 663 610 565 520 464 611 674 532 633 734 636 537 558 578 637 695 700 501 501 502 584 666 697 729 711 694 676
1941F76j7RRk9k9J2K17r8r8J95qk30k6k6k7J6J6J39k00q6J18J58m5M4j60n0n0N7N7R3R3j28
$$ 676 659 668 677 648 619 631 848 750 652 847 839 609 583 557 530 546 562 701 501 415 533 691 646 690 530 480 430 487 544 637 730 602
1938F02j28n8n8Q3Q2jk06R7R7P1P1kjp0J33m2j45j5j5N7N7k1j24j30P5J47J48o1o1lkllm3
$$ 602 474 416 358 441 523 522 316 413 510 581 652 650 649 579 712 670 525 510 495 552 609 588 464 334 409 556 704 643 582 579 577 574 571 528
1935E28m3J10J10k0k0j9k0l2l1q2q3J03J02j6j7k9k9l0k9L9L8L9L9N3N4k5k5m8N3qk12P6P6
$$ 528 485 595 705 685 665 646 626 594 563 481 398 501 603 587 570 541 512 482 453 492 530 569 608 661 715 690 665 617 670 662 450 526 602
1932F02N1N0J09r5o6o6K5K5o1o0L9L9j61M3J16J15n9n9P5P4K3K3m5m6o7o7K82n7j9j9p9p9
$$ 602 653 703 812 717 651 585 610 635 574 514 553 592 431 474 590 705 646 587 662 736 759 782 737 691 624 557 839 782 763 744 665 586
1929E86POM7M7N9O0j68L6p9p8J12J13ooo1o0Q0P9Jk04j62J79J7J7j2j3J06J06K0K1q7q8lk
$$ 586 593 599 646 693 752 812 644 680 601 523 635 748 742 736 675 615 695 774 775 571 409 588 605 622 610 597 703 809 829 850 763 675 672 670
1926F70m9m8K28j12L6L6j52N3n8n8m6m5P5P4m4m4QQn6n6J52n3J1J2LLJ6J5r4J09k7k6K25j15
$$ 670 621 573 801 689 725 761 609 662 604 546 500 455 530 604 560 516 524 532 476 420 572 519 530 542 545 548 564 579 485 594 567 541 766 651
1923F51rql0l0o0J45k9k9j5j6L4L4j78K5N1j53J27J28j0j0MLj48N7R5R4j3j4%jj0J94M1j64
$$ 651 642 634 604 574 514 659 630 601 586 570 604 638 460 485 536 383 510 638 628 618 622 625 477 534 629 723 710 696 696 695 685 879 920 756
1920G56K5K5p2p3k4k3J5J5J75k9l3l2rrJ2J3j30K10J34p1p2p3O8O7PPPPo6o7o6o6J06J07N6
$$ 756 781 806 734 661 637 614 629 644 819 790 757 725 716 707 719 732 602 812 946 875 803 730 798 865 872 879 886 893 827 760 694 628 734 841 897
1917H97N6llJ0J0r5J09p0J34QQl1J74p6J29J5J4J86j8O5l7j8J86N9m3L60J57K77J76L37M39
$$ 897 953 950 947 957 967 872 981 911 1045 1053 1061 1030 1204 1128 1257 1272 1286 1472 1454 1519 1482 1464 1650 1709 1666 2026 2183 2460 2636 2973 3412
1914C412L82J78K27J26J1J13M10M11O12R53J017J222J434J230Q47R9p26j474j764j560j314
$$ 3412 3794 3972 4199 4325 4336 4449 4859 5270 5882 6835 7852 9074 10508 11738 12585 12684 11958 10484 8720 7160 5846
1912E846j110p54n49m11n14l23j19l16j12Mj99q5J7pj09l2l3r9J05J5j89j1J93P1j33n8j60
$$ 5846 4736 3982 3433 3022 2508 2185 2066 1750 1638 1642 1443 1358 1375 1368 1259 1227 1194 1095 1200 1215 1026 1015 1208 1279 1146 1088 928
1910I28J69l4P1P2j17j17Nr7j04J01J1J2m6N6M6j57l7l6N3N3j17j17Q0Q1L0L0j5j5Mr8j00
$$ 928 1097 1063 1134 1206 1089 972 977 880 776 877 888 900 854 910 956 799 762 726 779 832 715 598 678 759 789 819 804 789 793 695 595
1907E95J04M7n6l4O7r8r9O0O0RQR4R3p0p1r1J0K59q1k7J76o8L3POO3O4qqM7K51j14j13JKQ
$$ 595 699 746 690 656 723 625 526 586 646 655 663 757 850 780 709 618 628 887 806 779 955 887 920 927 933 996 1060 1052 1044 1091 1342 1228 1115 1116 1118 1126
1904A126Qj07j07J08r6J20J21N5N5N4N5J21J20J21J21j86j86j86j85K0K1j37j37j40O4n1n1
$$ 1126 1134 1027 920 1028 932 1052 1173 1228 1283 1337 1392 1513 1633 1754 1875 1689 1503 1317 1132 1152 1173 1036 899 759 823 772 721
1901G21j2j3j2j3N1N1n1n1j25j26M5M4R2R1j00j00J87j53j3j3J5J5m9J56J6J6j76K9o7J37
$$ 721 709 696 684 671 722 773 722 671 546 420 465 509 601 692 592 492 679 526 513 500 515 530 481 637 653 669 493 522 455 592
1899E92j6j7opPOp0J33K0J9J9J9J9J9J3J3J3J3M3M3j15j14m6J58n9n9M8M9lkK6K6p6p5O7O8
$$ 592 576 559 553 546 553 559 489 622 642 661 680 699 718 737 750 763 776 789 832 875 760 646 600 758 699 640 688 737 734 732 758 784 708 633 700 768
1895G68j49N4QPq2q2O3O2P6j29J9J9J21J21j74K9J7J7l5l5l5l5P1P2l1l1J0J0J0Rj5j4j5j5
$$ 768 619 673 681 688 606 524 587 649 725 596 615 634 755 876 702 731 748 765 730 695 660 625 696 768 737 706 716 726 736 745 730 716 701 686
1892F86n2n2j24K15O0O0l9l8Q0P9P6j29K2K1L8j66K9K9K9K9j41O3n2n2J00J00j35P0Q8Q8R7
$$ 686 634 582 458 673 733 793 754 716 796 875 951 822 844 865 903 737 766 795 824 853 712 775 723 671 771 871 736 806 894 982 1079
1889A079j08j40j41L4L4Q8Q8N0j55j9k0j48N7llM9M8Q0j25j24Q0O4O4K5K6j09j10n8n9N5N4
$$ 1079 971 831 690 724 758 846 934 984 829 810 790 642 699 696 693 742 790 870 745 621 701 765 829 854 880 771 661 603 544 599 653
1887F53LMQ0Q1r3r4q1J24J27J28j90j91J80k5J3J3j15Q9o5o5kjN2N3JKK4K4o1o1j3j2L9L9
$$ 653 656 660 740 821 728 634 553 677 804 932 742 551 731 706 719 732 617 706 641 576 574 573 625 678 679 681 705 729 668 607 594 582 621 660
1883F60N0N0j03j03poK70p0k0j9m1m0J8J7R5j10j7J87k6k6J4J3J4J4L3L2n2n2n5n5mnl6l7
$$ 660 710 760 657 554 547 541 811 741 721 702 661 621 639 656 751 641 624 811 785 759 773 786 800 814 847 879 827 775 720 665 661 656 620 583
1880E83J29p6K1K0J74l1q2q3J05j00J2J2J91j50OPL6L6J2J3p2p3K2K3J37o7k4k3J4J5o0o0
$$ 583 712 636 657 677 851 820 738 655 760 660 672 684 875 725 731 738 774 810 822 835 763 690 712 735 872 805 781 758 772 787 727 667
1877F67J2J2O6j39n4J50L6L6n8n7p0J35K0K0m3m3p3J31j11j11k6J78j5j6llk2k2k2k2Q8Q8
$$ 667 679 691 757 618 564 714 750 786 728 671 601 736 756 776 733 690 617 748 637 526 500 678 663 647 644 641 619 597 575 553 641 729
1875G29LKJ17J16J1j94%Jo3o3L4L5j6j7j12j12J90j4M6M6M7M6k32k8J47n8J25q0o3o3llJ50
$$ 729 732 734 851 967 978 784 784 785 722 659 693 728 712 695 583 471 661 647 693 739 786 832 600 572 719 661 786 706 643 580 577 574 724
1872G24J50l5l5m7m8Q2j22j23Q2J9J9Q3Q3p7p7L8j66J0J1J8J9m6K93n9k64p6J28j15R0J45
$$ 724 874 839 804 757 709 791 669 546 628 647 666 749 832 755 678 716 550 560 571 589 608 562 855 796 532 456 584 469 559 704
1869G04J45NNq0q0L4j69rj0J57m8j48N7qpj8J87P1P2j09j09M4M4p7p8r0q9K23K0M9M9p4p5
$$ 704 849 854 859 779 699 733 564 555 545 702 654 506 563 555 548 530 717 788 860 751 642 686 730 653 575 485 396 619 639 688 737 663 588
1866E88J46J47n5n4mlm5m5m5m5L7L7J01j04klL6L5L7L7L6L7p8p7M1M2j0rj37O6J45o0J19J19
$$ 588 734 881 826 772 768 765 720 675 630 585 622 659 760 656 654 651 687 722 759 796 832 869 791 714 755 797 787 778 641 707 852 792 911 1030
1863A030j67j67o0J43M7M8Q9j14N4N3j0j0p8p8PPJ14J13j8j9P7j28p7p7J40o4N1N0p8p7o6
$$ 1030 863 696 636 779 826 874 963 849 903 956 946 936 858 780 787 794 908 1021 1003 984 1061 933 856 779 919 855 906 956 878 801 735
1860G35o5j22Q1J8J8N4N5o5o4M2M1MLj94J0J4J4P7P6j35O8J21q3J59m5m5m5n8n7nmn6n6J55
$$ 735 670 548 629 647 665 719 774 709 645 687 728 732 735 541 551 565 579 656 732 597 665 786 703 862 817 772 727 669 612 607 603 547 491 646
1857F46J55j55J84n4n5m6m6J50n5RJ0J8J8J8J8m0l9J1J2OOOOk9k9N6N6Q4Q3L3L3o8o7J67l8
$$ 646 801 646 830 776 721 675 629 779 724 733 743 761 779 797 815 775 736 747 759 765 771 777 783 754 725 781 837 921 1004 1037 1070 1002 935 1102 1064
1854A064p9p9j9k0K0j84J5J6K4K4p8J25j43O1r2r2JJJ66l7M3M3q8q9J35J35j12R2k22J19o0
$$ 1064 985 906 887 867 887 703 718 734 758 782 704 829 686 747 655 563 564 565 731 694 737 780 692 603 738 873 761 853 631 750 690
1851F90o0P4P5N8j47j18K22Kk03Q3j21J00J00j6j6L5L6J1J1J1J2q9q8J11r3J7J8J07r7O9j34
$$ 690 630 704 779 837 690 572 794 796 593 676 555 655 755 739 723 758 794 805 816 827 839 750 662 773 680 697 715 822 725 794 660
1848F60p1p1k9J75J0RLLJ69l6j04j04K3K3J11r4J06J06kkpk10L8L8P6P7OOm4m5O7O6n2n2o3
$$ 660 589 518 489 664 674 683 686 689 858 822 718 614 637 660 771 677 783 889 887 885 878 668 706 744 820 897 903 909 865 820 887 953 901 849 786
1845G86o4k55Q5p3p3N4K59r1r1N4N4q5J18m7m7N2N2M0L9P5j30j4j5NNJ20q4j5j5Q7j17O7O7
$$ 786 722 467 552 479 406 460 719 628 537 591 645 560 678 631 584 636 688 728 767 842 712 698 683 688 693 813 729 714 699 786 669 736 803
1842H03o4o5j7j7O8O9R2R2j29j29M2M2qrj4j4J01j03N3N3j26P9LMQ0Q0j28P5K5K5j85K0N8
$$ 803 739 674 657 640 708 777 869 961 832 703 745 787 779 770 756 742 843 740 793 846 720 799 802 806 886 966 838 913 938 963 778 798 856
1839H56N8PPl1l2j49N5J19q5j07R6l1l1M0M0j2j1k1k1J8J7J11r2P3P3p1p1O0O1j58M6R7j08
$$ 856 914 921 928 897 865 716 771 890 805 698 794 763 732 772 812 800 789 768 747 765 782 893 801 874 947 876 805 865 926 768 814 911 803
1836H03k3k3m9m8O2j43K4K3j7j8j8j8K2K3L5L6q5J19J06r7L8j67N5N4J8J7J8J7M6M5j46J94
$$ 803 780 757 708 660 722 579 603 626 609 591 573 555 577 600 635 671 586 705 811 714 752 585 640 694 712 729 747 764 810 855 709 903
1833I03l8l9q1J23m0m0k7k8j39j39M9M8J5J6J81k3M9M8p1p0o8J37K2K1m1m1J0J0mnM6M6J0
$$ 903 865 826 745 868 828 788 761 733 594 455 504 552 567 583 764 741 790 838 767 697 629 766 788 809 768 727 737 747 743 738 784 830 840
1830H40J0k8k8j29P6j03J02j6j6KK05j50j51M9N0L1L1j56j56Q7Q6Q7Q7j8j7j32P1n1n2M7M6
$$ 840 850 822 794 665 741 638 740 724 708 710 915 765 614 663 713 744 775 619 463 550 636 723 810 792 775 643 714 663 611 658 704
1827G04ppP9P8m5m4m4m5O4O3k2k2J00J00LKK1j84nnq3J20ppP3j31M7M7j38O7KLJ1J1O2O2R6
$$ 704 697 690 769 847 802 758 714 669 733 796 774 752 852 952 955 957 978 794 789 784 701 821 814 807 880 749 796 843 705 772 774 777 788 799 861 923 1019
1824A019R5J00L03mnm2m3j09j09n7n8j5j5J12r1k06kM1M1K5K6L7j66jkn3n2n8J46L2L1r6r6
$$ 1019 1114 1214 1517 1513 1508 1466 1423 1314 1205 1148 1090 1075 1060 1172 1081 875 873 914 955 980 1006 1043 877 876 874 821 769 711 857 889 920 824 728
1821G28O1O1J06r7n9J45N2j53k5k5R3R3rrN0N1n2n1k2k1J95rn2n2L7L8j06j07P7P7j69L5p
$$ 728 789 850 956 859 800 945 997 844 819 794 887 980 971 962 1012 1063 1011 960 938 917 1112 1103 1051 999 1036 1074 968 861 938 1015 846 881 874
1818H74pq1K60l4l4j03j04J14r1K0K0PPppopOOK36L1k36l1n7n8Q9Q8L8L7M2M2o0o0n7n6L2
$$ 874 867 786 1046 1012 978 875 771 885 794 814 834 841 848 841 834 828 821 827 833 1069 1100 864 833 776 718 807 895 933 970 1012 1054 994 934 877 821 853
1815H53L3M6j57N9N9jjn3n2j1j1JJj26P8l6l7k7k7K4K4J06J06o4o5Q6Q5q5q4k5k6J45J45J1
$$ 853 886 932 775 834 893 892 891 838 786 775 764 765 766 640 718 682 645 618 591 615 639 745 851 787 722 808 893 808 724 699 673 818 963 974
1811I74J2r1r1L5L4o7o8RRRRP5P5r5r5J02J02J45j96r1K49M9j55o1o1o2o1m4J60J60m5j27
$$ 974 986 895 804 839 873 806 738 747 756 765 774 849 924 829 734 836 938 1083 887 796 1045 1094 939 878 817 755 694 650 810 970 925 798
1809G98j27l8l8J90J90m9m8l9l8O4O4n2n3jjp1p1K14Rp3p4l5l5J8J7MNJ48n6N8N9l8l8l8l8
$$ 798 671 633 595 785 975 926 878 839 801 865 929 877 824 823 822 751 680 894 903 830 756 721 686 704 721 725 730 878 822 880 939 901 863 825 787
1805G87O1O1j56M8o1o2J17q6o8o8J45J45Q4j19n5n6onj20Q3L1L1P7j26k16J25K2K2ONJ20q4
$$ 787 848 909 753 801 740 678 795 709 641 573 718 863 947 828 773 717 711 706 586 669 700 731 808 682 466 591 613 635 641 646 766 682
1802F82noj8j8J8J7J8J7L7L6p8J26m7m7O8O8P5P4j64j64k9l0Q6Q5m9J55j42j42R2j12j0j0
$$ 682 677 671 653 635 653 670 688 705 742 778 700 826 779 732 800 868 943 1017 853 689 660 630 716 801 752 907 765 623 715 603 593 583
1800E83J85j9o2o2j62M2M6M6l1l2M1M1J12r2j10j09K45M2N8N9N2j52M8M8K7K8K8K7n6n6on
$$ 583 768 749 687 625 463 505 551 597 566 534 575 616 728 636 526 417 662 704 762 821 873 721 769 817 844 872 900 927 871 815 809 804
1797H04n3n3J13r2L9L9j2j3l6J67m1J63k41R9Q7j18j0j1q7J18r5r4Q4j20MLO3O3N9j44N5N5
$$ 804 751 698 811 719 758 797 785 772 736 903 862 1025 784 883 970 852 842 831 744 862 767 673 757 637 641 644 707 770 829 685 740 795
1794G95K9L0k2k1o8o8J54J53p8p9M1M1l6l5o4J39M8M8r3r2l6l6J5J5P7P7qqM0M1o6o5m2J62
$$ 795 824 854 832 811 743 675 829 982 904 825 866 907 871 836 772 911 959 1007 914 822 786 750 765 780 857 934 926 918 958 999 933 868 826 988
1791I88M7M7k7k6m0l9N0j54j8j8j55J84opj6j6R9j06N4N5m4m3q2q2N9N8J49n5O0O0LKLKp2
$$ 988 1035 1082 1055 1029 989 950 1000 846 828 810 655 839 833 826 810 794 893 787 841 896 852 809 727 645 704 762 911 856 916 976 979 981 984 986 914
1787I14p2J3J3l4l4J32p2K7K8J4J5o1o1R2R2j11j12nnJ26p9k18j5l2J71m4J59r7r7%JQ9Q8
$$ 914 842 855 868 834 800 932 860 887 915 929 944 883 822 914 1006 895 783 778 773 899 820 602 587 555 726 682 841 744 647 647 648 737 825
1784H25L8L7j7j8o9o8Q5Q6l4l4l6l7P8j26J55J54P0j34m2m1n5n4K3K2r1J12llJ0J1OOOOK8
$$ 825 863 900 883 865 796 728 813 899 865 831 795 758 836 710 865 1019 1089 955 913 872 817 763 786 808 717 829 826 823 833 844 850 856 862 868 896
1781H96K8K9K8m7m6J06J06RJ0m2m1l1l1QPJ22q1p4p3j68L6M0M1MMO8O8j72L1k3J80J3j92K1
$$ 896 924 953 981 934 888 994 1100 1109 1119 1077 1036 1005 974 982 989 1111 1030 956 883 715 751 791 832 836 840 908 976 804 835 812 992 1005 813 834
1778H34K1j42j42J60m3%Jp6J29n0m9J5J5RJ0RJ0M1M2P1j33J0J0llO7O7n1n2k6k6k6k7J41J40
$$ 834 855 713 571 731 688 688 689 613 742 692 643 658 673 682 692 701 711 752 794 865 732 742 752 749 746 813 880 829 777 751 725 699 672 813 953
1775I53j14j15l1l0l1l1N0M9M9N0L2L3j34j33K19J6j0j0n7J47M1j63j21Q4k7J78N0k91N4N4
$$ 953 839 724 693 663 632 601 651 700 749 799 831 864 730 597 816 832 822 812 755 902 943 780 659 743 716 894 944 653 707 761
1772G61K4j79K0K0P9Q0onr0q9P7j28Q7Q8m5m4O8O8q4q5Q5Q6L4L4n1n1K05j36j24Q1J88j53
$$ 761 785 606 626 646 725 805 799 794 704 615 692 564 651 739 694 650 718 786 702 617 702 788 822 856 805 754 959 823 699 780 968 815
1769H15k5k5K7K6N7j46j47N7J25J26j30P5N3N3n3n3j3j4j4j4R4R4k6k5n2n2L3L3O0O1j39O4
$$ 815 790 765 792 818 875 729 582 639 764 890 760 835 888 941 888 835 822 808 794 780 874 968 942 917 865 813 846 879 939 1000 861 925
1766I25j7j7J57j83j47J93poj19Q5Q6j19p1p1J04J03k6k7l9l9J35o9k7k6p0J35J9K0N8N8K0
$$ 925 908 891 1048 865 718 911 904 898 779 864 950 831 760 689 793 896 870 843 804 765 900 831 804 778 708 843 862 882 940 998 1018
1764A018j84O8O8N5N6p4p3M6M6o2o1N7N7m0m0J59m4j1j1p4p4L6L6L6L6K0J9K0J9J03J04K18
$$ 1018 834 902 970 1025 1081 1007 934 980 1026 964 903 960 1017 977 937 1096 1052 1041 1030 956 882 918 954 990 1026 1046 1065 1085 1104 1207 1311 1529
1761A529J4J0J0k24k24l7l7j52N2M7M6r4r4R5R5j18Q7N2j53k5k5p5p5R1R1o5J38N4j51P9P9
$$ 1529 1543 1553 1563 1339 1115 1078 1041 889 941 988 1034 940 846 941 1036 918 1005 1057 904 879 854 779 704 795 886 821 959 1013 862 941 1020
1758A020n2n3m5m5OPo0o0J07J06p4J30m8m8J2j92J11J10m2m1m1m2K5K5k7k6kkkkL7L8L7L8
$$ 1020 968 915 870 825 831 838 778 718 825 931 857 987 939 891 903 711 822 932 890 849 808 766 791 816 789 763 761 759 757 755 792 830 867 905
1755I05noj7j8J24p9n0n0l8l8o8J37P7P8k8k9%jJ2J2j64M0R1j14N0M9L7L7n4n3n4n4k6k6k6
$$ 905 900 894 877 859 983 904 854 804 766 728 660 797 874 952 924 895 895 894 906 918 754 794 885 771 821 870 907 944 890 837 783 729 703 677 651
1752F51k7L4L3L3L3N1N1j53J87R5j10q8J16J2J3Q9j15MLR2R3nnR7R7q1q2Q9Q9PQR6k43J4J3
$$ 651 624 658 691 724 757 808 859 706 893 988 878 790 906 918 931 1020 905 909 912 1004 1097 1092 1087 1184 1281 1200 1118 1207 1296 1303 1311 1407 1164 1178 1191
1748A191j35O9J33p2j94j95J86j9noj31j31J54n0lkn4n3r2J12K14J0kkn3n2j06R9J49n4J18
$$ 1191 1056 1125 1258 1186 992 797 983 964 959 953 822 691 845 795 792 790 736 683 591 703 917 927 925 923 870 818 712 811 960 906 1024
1746A024J18o5o6q6q6r9J05J62J63j65L9j10R4qqqqpqP8P9j04j05J83k1p7p6r7r6qpK14J0
$$ 1024 1142 1077 1011 925 839 740 845 1007 1170 1005 1044 934 1028 1020 1012 1004 996 989 981 1059 1138 1034 929 1112 1091 1014 938 841 745 737 730 944 954
1743I54j05R9J14r0o4o4M4M4L1L1J3j92rJ95j51N4r9j00l0l1P2P1n6n6J01J01Q3j21K4K3K41
$$ 954 849 948 1062 972 908 844 888 932 963 994 1007 815 806 1001 850 904 805 705 675 644 716 787 731 675 776 877 960 839 863 886 1127
1740A127j00p8p9n8n7ppP1P1l1l1L1L2L1L2n1n2n1n1j1j0j0j0J0J0n4J50q6q5j8J86n2n3O2
$$ 1127 1027 949 870 812 755 748 741 812 883 852 821 852 884 915 947 896 844 793 742 731 721 711 701 711 721 667 817 731 646 628 814 762 709 771
1737G71O2J0J1J0J1M2M3o0o0Q2Q2j35O9r0q9k6k6M9M9n4n3J1J1r0r1J31J32l9l8J11J11O1
$$ 771 833 843 854 864 875 917 960 900 840 922 1004 869 938 848 759 733 707 756 805 751 698 709 720 630 539 670 802 763 725 836 947 1008
1734A008O0m7m7N5N5q8q9J4J3J6J5K8K8j47N8n7n7N7N6j73L1J57m8rrj62M3R8R8p3p3k2k2
$$ 1008 1068 1021 974 1029 1084 996 907 921 934 950 965 993 1021 874 932 875 818 875 931 758 789 946 898 889 880 718 761 859 957 884 811 789 767
1731G67J10J11m7m7k1J82Q1j23J4J4l7l7q4J19N6N6j8j8o9p0n6n6Q4Q4J39o4r1r0m9J55M1
$$ 767 877 988 941 894 873 1055 1136 1013 1027 1041 1004 967 883 1002 1058 1114 1096 1078 1009 939 883 827 911 995 1134 1070 979 889 840 995 1036
1728A036M0L1L1pqj48N5j23Q1j3j3L9L8J57m6q5q5m0l9J1J2m6m6J20q5K2K1J35k04O6j39N3
$$ 1036 1076 1107 1138 1131 1123 975 1030 907 988 975 962 1001 1039 1196 1150 1065 980 940 901 912 924 878 832 952 867 889 910 1045 841 907 768 821
1725H21N3j12R2O2O2JKn0m9M4M4J71l2j51N4J38o5k01Mm0l9R1R0o2o3R8R7M7M6r3r2qqj1j1
$$ 821 874 762 854 916 978 979 981 931 882 926 970 1141 1109 958 1012 1150 1085 884 888 848 809 900 990 928 865 963 1060 1107 1153 1060 968 960 952 941 930
1722I30j1j1lklkl9m0J27p7l2l2J09J08M5M6m0J64J32k09k6k6J60j81n3J51n2n2J2J2O8O8
$$ 930 919 908 905 903 900 898 859 819 946 869 837 805 914 1022 1067 1113 1073 1237 1369 1160 1134 1108 1268 1087 1034 1185 1133 1081 1093 1105 1173 1241
1719A241p2p2l4J70m2m2J52n2K5j79kkP1P1llklj09j09J59m5o0o1j89J6L6L6J0J1r1J12M9
$$ 1241 1169 1097 1063 1233 1191 1149 1301 1249 1274 1095 1093 1091 1162 1233 1230 1227 1225 1222 1113 1004 1163 1118 1058 997 808 824 860 896 906 917 826 938 987
1716I87M9Q1Q1j40j41M8M7R9R8j70j69o3J41RJ0k9k9MNMMR0Q9o3o3J25J24j43O1m0m0K4K3
$$ 987 1036 1117 1198 1058 917 965 1012 1111 1209 1039 870 807 948 957 967 938 909 913 918 922 926 1016 1105 1042 979 1104 1228 1085 1146 1106 1066 1090 1113
1713A113Q1Q1j06j06J19J20l4l4l3l3l2l3j2j2J54n0m3m4o5J39O5j39j2j2opJ00J00J76k9
$$ 1113 1194 1275 1169 1063 1182 1302 1268 1234 1201 1168 1136 1103 1091 1079 1233 1183 1140 1096 1031 1170 1235 1096 1084 1072 1066 1059 1159 1259 1435 1406
1710A406j56j56j17Q7Q7j17m1m1mlo1o2N8N7l9l9j12j11K0K24k6J78R5k44k7k8m5J58J84j56
$$ 1406 1250 1094 977 1064 1151 1034 993 952 948 945 884 822 880 937 898 859 747 636 656 880 854 1032 1127 883 856 828 783 941 1125 969
1708I69N3N3L1L2J1J2k7k7j27P8q9q8J33J34J5J4q7q7J5J4M3M2k00J41n7n6Q0j25J28J27J3
$$ 969 1022 1075 1106 1138 1149 1161 1134 1107 980 1058 969 881 1014 1148 1163 1177 1090 1003 1018 1032 1075 1117 917 1058 1001 945 1025 900 1028 1155 1168
1705A168J3p5p5K7K7L0L1j40j40N6N6J33p2p1J34m5m6M2M2LLj28P5K55q6o1o0Q9Q9J01J01
$$ 1168 1181 1106 1031 1058 1085 1115 1146 1006 866 922 978 1111 1039 968 1102 1057 1011 1053 1095 1098 1101 973 1048 1303 1217 1156 1096 1185 1274 1375 1476
1702A476j83K0o7o8M7M7n3n3O2j42l1l1n7J48o1o1J22J22j4j3j29P6j05j05llJ75k9R9j05
$$ 1476 1293 1313 1246 1178 1225 1272 1219 1166 1228 1086 1055 1024 967 1115 1054 993 1115 1237 1223 1210 1081 1157 1052 947 944 941 1116 1087 1186 1081
1699A081k9k9J76k9l6l5N4N4o1o1M1M1Q3Q3ooj5J90r6r5J22J23m7m8j6j5j6j5j16j15j4j3
$$ 1081 1052 1023 1199 1170 1134 1099 1153 1207 1146 1085 1126 1167 1250 1333 1327 1321 1306 1496 1400 1305 1427 1550 1503 1455 1439 1424 1408 1393 1277 1162 1148 1135
1696A135J5J5q7q7mmM7M7j4j4j4j3J2J3J3J3M5M4M5M5m3m2L8L8R6k45M9M9p3p2L0K9o3o4L8
$$ 1135 1150 1165 1078 991 987 983 1030 1077 1063 1049 1035 1022 1034 1047 1060 1073 1118 1162 1207 1252 1209 1167 1205 1243 1339 1094 1143 1192 1119 1047 1077 1106 1043 979 1017
1693A017L8J75J74NNn5n5n5n5MNqqJ49n5O0O0l4l4j49N6JJl7l7j5j6J00R9j53N2J53n0k0j9
$$ 1017 1055 1230 1404 1409 1414 1359 1304 1249 1194 1198 1203 1195 1187 1336 1281 1341 1401 1367 1333 1184 1240 1241 1242 1205 1168 1153 1137 1237 1336 1183 1235 1388 1338 1318 1299
1690A299O9P0%jj15j15Mj99q5q5ppppL7L7K03jk6k6n1J53N5N4k2k2q1J23r5r4J0J1R9k40Q6
$$ 1299 1368 1438 1438 1437 1322 1207 1211 1012 927 842 835 828 821 814 851 888 1091 1090 1064 1038 987 1140 1195 1249 1227 1205 1124 1247 1152 1058 1068 1079 1178 938 1024
1687A024Q7j04j05J13J13n8n7L1L1k0k0k7k7k7k6nnmn%jJ35o9p5K65P4j31mll0k9P3j31j7
$$ 1024 1111 1007 902 1015 1128 1070 1013 1044 1075 1055 1035 1008 981 954 928 923 918 914 909 909 908 1043 974 899 1164 1238 1107 1103 1100 1070 1041 1114 983 966
1684I66j6Q5Q5j7j7O8O8J06J07j4k18J06J05M1j63m9m9M0M0j27P8l7l7k4k4J12J11P3P4j64
$$ 966 950 1035 1120 1103 1086 1154 1222 1328 1435 1421 1203 1309 1414 1455 1292 1243 1194 1234 1274 1147 1225 1188 1151 1127 1103 1215 1326 1399 1473 1309
1681A309M1J0J1K6K7j27j26l1l1K0K1LLPK11j69j69l7J67j33P2K0K1J33J33j34j35J40o5j
$$ 1309 1350 1360 1371 1397 1424 1297 1171 1140 1109 1129 1150 1153 1156 1163 1374 1205 1036 999 1166 1033 1105 1125 1146 1279 1412 1278 1143 1283 1218 1217
1678A217jl0k9K1K2M5M5M6M5qqqpq4q3l2l2n4n5O5O5L7L7j29P5jjq7q6O8j36K00K00L1L1q9
$$ 1217 1216 1186 1157 1178 1200 1245 1290 1336 1381 1373 1365 1357 1350 1266 1183 1151 1119 1065 1010 1075 1140 1177 1214 1085 1160 1159 1158 1071 985 1053 917 1117 1317 1348 1379 1290
1675A290q8j0j1j0j1L5L5R9R9j70L5NMK3K3K2K3q1q0p7J28j8j8m3m4MK08J22q1q9q9L9L8J13
$$ 1290 1202 1192 1181 1171 1160 1195 1230 1329 1428 1258 1293 1298 1302 1325 1348 1370 1393 1312 1232 1155 1283 1265 1247 1204 1160 1164 1372 1494 1413 1324 1235 1274 1312 1425
1672A425r2K3K3L2L3j67L6P5P6J17q6l5l4m7m8m5m6M0L9l9l9l9m0L8L8m7m7M3M2j24Q1j3j3
$$ 1425 1333 1356 1379 1411 1444 1277 1313 1388 1464 1581 1495 1460 1426 1379 1331 1286 1240 1280 1319 1280 1241 1202 1162 1200 1238 1191 1144 1187 1229 1105 1186 1173 1160
1669A160j3j3N0j53M7M6K5K5K5K5J7J6l4l5M7M7J62m3l0l1PQL8L8j71j70J95j45l8l9J30J29
$$ 1160 1147 1134 1184 1031 1078 1124 1149 1174 1199 1224 1241 1257 1223 1188 1235 1282 1444 1401 1371 1340 1347 1355 1393 1431 1260 1090 1285 1140 1102 1063 1193 1322
1666A322J26p9J3J2n1n1j8j8o9o9M6M6o0o1j42O1J13J12j45O0nmr3r3P3P3j89J5M1M1P4j30
$$ 1322 1448 1369 1382 1394 1343 1292 1274 1256 1187 1118 1164 1210 1150 1089 947 1008 1121 1233 1088 1148 1143 1139 1046 953 1026 1099 910 925 966 1007 1081 951
1663I51n4n3N1K56K2K1L3L3q2J23j60j59M0M1n6n6J45o0o2o2K3K3j68L5J89j6J8J9J8J9r4
$$ 951 897 844 895 1151 1173 1194 1227 1260 1178 1301 1141 982 1022 1063 1007 951 1096 1036 974 912 935 958 790 825 1014 998 1016 1035 1053 1072 978
1660I78J11mnL8L7j4j4LKj0j1N3j50J5J5p2p1K22j19J1J0r2r2l9L01QQn7n7M4M5K4K4k7k7
$$ 978 1089 1085 1080 1118 1155 1141 1127 1130 1132 1122 1111 1164 1014 1029 1044 972 901 1123 1004 1015 1025 933 841 802 1103 1111 1119 1062 1005 1049 1094 1118 1142 1115 1088
1657A088M2M2o0o0N6N5k29k5L6L5o6o7J1j93k8k7N2N3n0n0N1N1l8l9MK09rqo1o1M2M1R2R3
$$ 1088 1130 1172 1112 1052 1108 1163 934 909 945 980 914 847 858 665 637 610 662 715 665 615 666 717 679 640 644 853 844 836 775 714 756 797 889 982
1654I82Q4j20K24j16k7k6kK03J01j03o0o1K9K9o4o5j80K5L7L6J64l9J22J23N9N9l2l2P1P0
$$ 982 1066 946 1170 1054 1027 1001 999 1202 1303 1200 1140 1079 1108 1137 1073 1008 828 853 890 926 1090 1051 1173 1296 1355 1414 1382 1350 1421 1491
1651A491j6j5k9k8J15q9K7K6j49j50r4J11P2P1L4L4n5n5n4n5RRJ45o0j82J57K39L4j39j38
$$ 1491 1475 1460 1431 1403 1518 1429 1456 1482 1333 1183 1089 1200 1272 1343 1377 1411 1356 1301 1247 1192 1201 1210 1355 1295 1113 1270 1509 1543 1404 1266
1649A266L9K44L8L8N0N1r3r3J92j3p9p9O5O6J46n9ppJ60m5j33P0k54n1P3P3k2k27j0j0m5m5
$$ 1266 1305 1549 1587 1625 1675 1726 1633 1540 1732 1719 1640 1561 1626 1692 1838 1779 1772 1765 1925 1880 1747 1817 1563 1512 1585 1658 1636 1409 1399 1389 1344 1299
1646A299P0j35n2n3J05J05N9N9QRl5l4J7J6q2q2K0K0r2r2J0J1l3l3Q2j22P6P6j54N0p3p3M1
$$ 1299 1369 1234 1182 1129 1234 1339 1398 1457 1465 1474 1439 1405 1422 1438 1356 1274 1294 1314 1222 1130 1140 1151 1118 1085 1167 1045 1121 1197 1043 1093 1020 947 988
1643I88M2L7L8L7L7O9O9O8O9RRj06j05J51n3m1m0r5r4P5P6j9j9M5M5q5J18J05J06L7L7N0N0
$$ 988 1030 1067 1105 1142 1179 1248 1317 1385 1454 1463 1472 1366 1261 1412 1359 1318 1278 1183 1089 1164 1240 1221 1202 1247 1292 1207 1325 1430 1536 1573 1610 1660 1710
1640A710j43O1K4j81j28P7MK08q4q4k0k0JJn0n0L5L5L5L5N9N8l0l1j82K2r2r3m7m7m8m7O3
$$ 1710 1567 1628 1652 1471 1343 1420 1424 1632 1548 1464 1444 1424 1425 1426 1376 1326 1361 1396 1431 1466 1525 1583 1553 1522 1340 1362 1270 1177 1130 1083 1035 988 1051
1637A051O4O3O3L5L5q0J24j6j6L5L5N6j47J8J9J2J2l9J65o8J36j53j53Q5Q5k51m6p9p9K0J9
$$ 1051 1115 1178 1241 1276 1311 1231 1355 1339 1323 1358 1393 1449 1302 1320 1339 1351 1363 1324 1489 1421 1557 1404 1251 1336 1421 1170 1124 1045 966 986 1005
1634A005k3k4R6R6j02j02N1N1RRQ1Q1k09J32J40o5K1K1m3m2o8o7N2N2n7n7noJ23J24l0k9R7
$$ 1005 982 958 1054 1150 1048 946 997 1048 1057 1066 1147 1228 1019 1151 1291 1226 1247 1268 1225 1183 1115 1048 1100 1152 1095 1038 1033 1027 1150 1274 1244 1215 1312
1631A312R7j37O7N0N1O3O4q7q7l5l6R8R7M6M7J4J4n7n8K79o0j12j11k39l5J39J39p8p9POl9
$$ 1312 1409 1272 1339 1389 1440 1503 1567 1480 1393 1358 1322 1420 1517 1563 1610 1624 1638 1581 1523 1802 1742 1630 1519 1280 1245 1384 1523 1445 1366 1373 1379 1340
1628A340m0j41O3k42l8O8O8P8j26M0L9r2r2O1O1o1o0Q0Q0r1K50K24K0K7K6l7l8k8k8l7J67
$$ 1340 1300 1159 1222 980 942 1010 1078 1156 1030 1070 1109 1017 925 986 1047 986 926 1006 1086 995 1245 1469 1489 1516 1542 1505 1467 1439 1411 1374 1541
1625A541J05j00J6J5O1j42k4J80noN8N8j36j36J66l8m8m9R2R1J61J60o0o1m2m3m2m2j14j13
$$ 1541 1646 1546 1562 1577 1638 1496 1472 1652 1647 1641 1699 1757 1621 1485 1651 1613 1565 1516 1608 1699 1860 2020 1960 1899 1857 1814 1772 1730 1616 1503
1622A503j86j86j30P4r3r2P6P6Q9Q9L4K39K6K6O4j41q9J15r0r0P6P5o9o8j84K0J1J1o2o1p
$$ 1503 1317 1131 1001 1075 982 890 966 1042 1131 1220 1254 1493 1519 1545 1609 1468 1379 1494 1404 1314 1390 1465 1396 1328 1144 1164 1175 1186 1124 1063 1056
1620A056oP8P8J3J2p2J31J58j82m1J62mnR3R4l1l1l1l0M7M6M3j62r9r9k6k7q0q0L9L9p2p2
$$ 1056 1050 1128 1206 1219 1231 1159 1290 1448 1266 1225 1387 1383 1378 1471 1565 1534 1503 1472 1442 1489 1535 1578 1416 1317 1218 1192 1165 1085 1005 1044 1083 1011 939
1617I39Q1Q1J70J70p2K68J59J60J5J5M7j58j57M7M0M0J67l7ooj9j8j09j08K3K3J70j70m3m3
$$ 939 1020 1101 1271 1441 1369 1637 1796 1956 1971 1986 2033 1875 1718 1765 1805 1845 2012 1975 1969 1963 1944 1926 1817 1709 1732 1755 1925 1755 1712 1669
1614A669J11r3L5L4p6J28J53j86p4p4r5r5j6j5j6j5l1l2P1P1m2m2O0O0O1O1j08j09j7j8n5
$$ 1669 1780 1687 1722 1756 1680 1808 1961 1775 1701 1627 1532 1437 1421 1406 1390 1375 1344 1312 1383 1454 1412 1370 1430 1490 1551 1612 1504 1395 1378 1360 1305
1611A305n6j98PN7j47NONNm9J55j0j1J20J20J8J8QPJ10J10L0L0L0L0L2L2j9j9k12k13j10j10
$$ 1305 1249 1051 1058 1115 968 973 979 984 989 940 1095 1085 1074 1194 1314 1332 1350 1358 1365 1475 1585 1615 1645 1675 1705 1737 1769 1750 1731 1519 1306 1196 1086
1608A086J5J5R1j13J0K14Q6Q6Q2Q2j35O9J38J37R5j09L8L8K6K6N5N6%k04M7M6L4L3j15j15
$$ 1086 1101 1116 1207 1094 1104 1318 1404 1490 1572 1654 1519 1588 1726 1863 1958 1849 1887 1925 1951 1977 2032 2088 2088 1884 1931 1977 2011 2044 1929 1814
1605A814M2M3J00j04J0J1N7N6R1j14j79J61K1K1l46j42J65m0K8K8J31J30j25P9J35J34M0L9
$$ 1814 1856 1899 1999 1895 1905 1916 1973 2029 2120 2006 1827 1988 2009 2030 1684 1542 1707 1667 1695 1723 1854 1984 1859 1938 2073 2207 2247 2286
1603B286o3o2L2L2j94j93j24Q0J7J7L1L1L8L8j35l3P6j29n0n1L8L8l3l4l4l4j10j11j23j23
$$ 2286 2223 2161 2193 2225 2031 1838 1714 1794 1811 1828 1859 1890 1928 1966 1831 1798 1874 1745 1695 1644 1682 1720 1687 1653 1619 1585 1475 1364 1241 1118
1600A118m4k49qR4p6J28L72J69J24J25J12r2K50M6j7Q4J23K2j49m7O2m1j48N5K0q2n6n7o7
$$ 1118 1074 825 817 911 835 963 1335 1504 1628 1753 1865 1773 2023 2069 2052 2136 2259 2281 2132 2085 2147 2106 1958 2013 2033 1951 1895 1838 1771
1597A771L6R8j05j83q1K9J31rrM8M9K5K5Q8j15n1n2L8L7J6J6K2K2l8O3J79k6j55n4K3p8J74
$$ 1771 1807 1905 1800 1617 1536 1565 1696 1687 1678 1726 1775 1800 1825 1913 1798 1747 1695 1733 1770 1786 1802 1824 1846 1808 1871 2050 2024 1869 1815 1838 1760 1934
1595A934l0q8J17K7K7o3o2K7K7p5p5l3l3J2J1K18J16M4j60J24K3K33K9J48J48r4J10J45n9
$$ 1934 1904 1816 1933 1960 1987 1924 1862 1889 1916 1841 1766 1733 1700 1712 1723 1941 2057 2101 1941 2065 2088 2321 2350 2498 2646 2552 2662 2807 2748
1592B748m0O2N3N3Q6k53k63j61o7j70k42l7%j01n4n3o0o0K0K1J36o9M3M3o0n9N5K59J58m7
$$ 2748 2708 2770 2823 2876 2962 2709 2446 2285 2218 2048 1806 1769 1769 1668 1614 1561 1501 1441 1461 1482 1618 1549 1592 1635 1575 1516 1571 1830 1988 1941
1589A941J23J24R8R7L5j70o8J36j0j0J5J6j32P3J28J29q5q4L9K43J4J4l6J67K7K7K6K7N4j49
$$ 1941 2064 2188 2286 2383 2418 2248 2180 2316 2306 2296 2311 2327 2195 2268 2396 2525 2440 2356 2395 2638 2652 2666 2630 2797 2824 2851 2877 2904 2958 2809
1586B809l5l5j22j22n9n8O1K64K40j01n8n7j30j30j3j3o3o4l7l8O5O5j19j18l0l0O4j40J44
$$ 2809 2774 2739 2617 2495 2436 2378 2439 2703 2943 2842 2784 2727 2597 2467 2454 2441 2378 2314 2277 2239 2304 2369 2250 2132 2102 2072 2136 1996 2140
1584B140J44O2O1Q3Q3p8K62N8K62L8L8L8L8J75k8J37J37p2p2J7J7J81k3J04J04R0K93M17M17
$$ 2140 2284 2346 2407 2490 2573 2495 2757 2815 3077 3115 3153 3191 3229 3404 3376 3513 3650 3578 3506 3523 3540 3721 3698 3802 3906 3996 4289 4706 5123
1581E123M93M92N48P52R99R98J284J624J934K274K614K955K495J202o85k385l123l462k765
$$ 5123 5616 6108 6656 7408 8407 9405 10689 12313 14247 16521 19135 22090 24585 25787 25102 22717 19594 16132 13367
1579A3367k290j659j184j013q10o27m24l56l55j43j43M0M0j1J93l6l6k6k29k30k6l23l23j87
$$ 13367 11077 9418 8234 7221 6411 5784 5360 5004 4649 4506 4363 4403 4443 4432 4625 4589 4553 4527 4298 4068 4042 3719 3396 3209
1577C209J7j15j15j02j02k6k5O3O4K91Q7l6l6N8N9m4m3k1k0j22j23p0p1j98Omk08j18j19q0
$$ 3209 3226 3111 2996 2894 2792 2766 2741 2804 2868 3159 3246 3210 3174 3232 3291 3247 3204 3183 3163 3041 2918 2848 2777 2579 2585 2581 2373 2255 2136 2056
1575B056J24r3r2Q9Q9K1j83J99np3p4j21j22J16J16J01J01Q8Q8P4j31j6j6M6M6M6M6J03J03
$$ 2056 2180 2087 1995 2084 2173 2194 2011 2210 2205 2132 2058 1937 1815 1931 2047 2148 2249 2337 2425 2499 2368 2352 2336 2382 2428 2474 2520 2623 2726
1572B726j1J92J85J86m1m0P1P0J34p0l7l8J%j8j8R6j08J6J6J17q6m9n0j1j1L0L0p3p2J4J3
$$ 2726 2715 2907 3092 3278 3237 3197 3268 3338 3472 3402 3365 3327 3328 3328 3310 3292 3388 3280 3296 3312 3429 3343 3294 3244 3233 3222 3252 3282 3209 3137 3151 3164
1569C164J4J4J24J24J24J24R3R2R3R2J50J51M8M9j37j36j24l27k45k45q8q7m6m7J0K13LKm8
$$ 3164 3178 3192 3316 3440 3564 3688 3781 3873 3966 4058 4208 4359 4407 4456 4319 4183 4059 3732 3487 3242 3154 3067 3021 2974 2984 3197 3200 3202 3154
1566C154m8J52n1j07j07j0j0j12j12R9R8j7J88K43K42Q5Q5K43K42o4o3r8r8r8r7K1K1K2K1
$$ 3154 3106 3258 3207 3100 2993 2983 2973 2861 2749 2848 2946 2929 3117 3360 3602 3687 3772 4015 4257 4193 4130 4032 3934 3836 3739 3760 3781 3803 3824
1564C824J10J09QQp4p3q6J18j29j29j03j04l01r7j69L5Q8j16r0r0o3o2O1K64J92J92K05K05
$$ 3824 3934 4043 4051 4059 3985 3912 3826 3944 3815 3686 3583 3479 3178 3081 2912 2947 3035 2919 2829 2739 2676 2614 2675 2939 3131 3323 3528 3733
1561C733J6J5K33K8R4R4qql39j36q0q1k1k2j03j02l61k1m2m2L9L8R0Q9nnj07j07j98j97k8
$$ 3733 3749 3764 3997 4025 4119 4213 4205 4197 3858 3722 3642 3561 3540 3518 3415 3313 2952 2931 2889 2847 2886 2924 3014 3103 3098 3093 2986 2879 2681 2484 2456
1558B456k8j96j97k6k7n3n3J1J1j64M1k4k3K06K05J93J93m1k45j30j31j45j46j96j97M4M4
$$ 2456 2428 2232 2035 2009 1982 1929 1876 1887 1898 1734 1775 1751 1728 1934 2139 2332 2525 2484 2239 2109 1978 1833 1687 1491 1294 1338 1382
1556A382j60M3J5K19N4N3K01lJ0J0L6L6N8N8k39J01K16K16J41J40R0Q9O1O1j09j09KJj68j68
$$ 1382 1222 1265 1280 1499 1553 1606 1807 1804 1814 1824 1860 1896 1954 2012 1773 1874 2090 2306 2447 2587 2677 2766 2827 2888 2779 2670 2672 2673 2505 2337
1553B337r6r6k11oM7M8M7M8K04%J65J66J68J69p0J35R7k43O4O3M5M5K16K15R4R4K86n5J39
$$ 2337 2241 2145 1934 1928 1975 2023 2070 2118 2322 2322 2487 2653 2821 2990 2920 3055 3152 2909 2973 3036 3081 3126 3342 3557 3651 3745 4031 3976 4115
1551D115J39K28M33L48J45L10L10K63N9o4o4j61j61n9n9l64l64k40l7l46l45k19k18j72L2
$$ 4115 4254 4482 4915 5263 5408 5718 6028 6291 6350 6286 6222 6061 5900 5841 5782 5418 5054 4814 4777 4431 4086 3867 3649 3477 3509
1548C509l2l2j6j6k9J75M8M7m2m2p6p6j66j65j38O7m9J56J55L60K58N3L12J08M0L9k8k9j30
$$ 3509 3477 3445 3429 3413 3384 3559 3607 3654 3612 3570 3494 3418 3252 3087 2949 3016 2967 3123 3278 3638 3896 3949 4261 4369 4409 4448 4420 4391 4261
1546D261j30n6n6j58j57j92j92M6M7J10J10K12K12J59J59K87Q2K88M93J95J95J93J94m4m4
$$ 4261 4131 4075 4019 3861 3704 3512 3320 3366 3413 3523 3633 3845 4057 4216 4375 4662 4744 5032 5525 5720 5915 6108 6302 6258 6214
1543F214j38j37J04k35k02k02k24j9J8K23K23K23R5R6o2o2r9J06Lk01N0N1J39J39J44J44k6
$$ 6214 6076 5939 6043 5808 5606 5404 5180 5161 5179 5402 5625 5848 5943 6039 5977 5915 5816 5922 5925 5724 5774 5825 5964 6103 6247 6391 6365
1541F365k7MLo0J43J18J17K02K03k10J30K8K8J89j6p0p1q8q8J0m66k50k50j78j78L0K9k1J82
$$ 6365 6338 6342 6345 6285 6428 6546 6663 6865 7068 6858 6988 7016 7044 7233 7217 7147 7076 6988 6900 6910 6444 6194 5944 5766 5588 5618 5647 5626 5808
1538E808J50L53J50J49L2L1l6k41j2k17j2j2J55J56J42J43L28J23J%k80k80k68k67k44l9Q5
$$ 5808 5958 6311 6461 6610 6642 6673 6637 6396 6384 6167 6155 6143 6298 6454 6596 6739 7067 7190 7191 7191 6911 6631 6363 6096 5852 5813 5898
1536E898Q4J12J12p9q0k7l68k65k65k28k3L05L04K31K31J28J29P6P5K46K46M07M08L69L69
$$ 5898 5982 6094 6206 6127 6047 6020 5652 5387 5122 4894 4871 5176 5480 5711 5942 6070 6199 6275 6350 6596 6842 7249 7657 8026 8395
1534H395K99l13l43l43l36l36m2m3j11l15k00j99j40j40j39j40j11j11j11j11J20J20N6K60
$$ 8395 8694 8381 8038 7695 7359 7023 6981 6938 6827 6512 6312 6113 5973 5833 5694 5554 5443 5332 5221 5110 5230 5350 5406 5666
1531E666L60L60L86J81LLN4N4j21Q2P0P0K28K29K28M32N62P66P79N75P26P25O45M41M13K10
$$ 5666 6026 6386 6772 6953 6956 6959 7013 7067 6946 7028 7098 7168 7396 7625 7853 8285 8847 9613 10392 10967 11693 12418 13063 13504 13917 14127
1529A4127N02N03O59J000J264J603J876J876J395O47q71k027k236k235j845j232r35l22J23
$$ 14127 14629 15132 15791 16791 18055 19658 21534 23410 24805 25452 24581 22554 20318 18083 16238 15006 14071 13749 13872
1527A3872J24N36N37R52R53J336J948K059K263K196J583J21j445k464k669k563k087j559j220
$$ 13872 13996 14532 15069 16021 16974 18310 20258 22317 24580 26776 28359 28480 27035 24571 21902 19339 17252 15693 14473
1526A4473j032q29p52p52n58n59m56m56k82k83r9r9l08j05Q7Q7J15J15M08M08L88J83K99K98
$$ 14473 13441 12612 11860 11108 10550 9991 9535 9079 8797 8514 8415 8316 8008 7903 7990 8077 8192 8307 8715 9123 9511 9694 9993 10291
1523A0291M53M53L38L38M92K88L51L52J55J55L25L25K75K76K75K75N0N0M9N0r8r9l29j24N0
$$ 10291 10744 11197 11535 11873 12365 12653 13004 13356 13511 13666 13991 14316 14591 14867 15142 15417 15467 15517 15566 15616 15518 15419 15090 14966 15016
1521A5016j54k6k7L9L8K6K30Q3Q3J98J97P0P0K87Q3J71J72J60J59L07L08L07L08L71L71K69
$$ 15016 14862 14836 14809 14848 14886 14912 15142 15225 15308 15506 15703 15773 15843 16130 16213 16384 16556 16716 16875 17182 17490 17797 18105 18476 18847 19116
1519A9116K69L74L74N90L86M19M18M06M05L68L68M82M83N18P23R82R83J239J240J452J656
$$ 19116 19385 19759 20133 20723 21109 21528 21946 22352 22757 23125 23493 23975 24458 24976 25699 26681 27664 28903 30143 31595 33251
1517C3251J724K064K218K557K966L170L722M471N228N432N100L263O29j072j226k04J364K793
$$ 33251 34975 37039 39257 41814 44780 47950 51672 56143 61371 66803 71903 75166 75795 74723 73497 73293 74657 77450
1515G7450M038M923N556N557N356N697P125Q826J0259J0259Q491M477k266r545j2946j2947
$$ 77450 81488 86411 91967 97524 102880 108577 115702 124528 134787 145046 153537 158014 155748 146203 133257 120310
1514A20310j0629p432m282j357J134K699K308M71k556m937n646m897l596k439j326p13K56
$$ 120310 109681 102249 97967 96610 97744 100443 102751 103222 100666 95729 90083 85186 81590 79151 77825 77112 77368
1512G7368M60J035J512J741K081K443K918L310L514L888M499M844M845N154N631O051O664
$$ 77368 77828 78863 80375 82116 84197 86640 89558 92868 96382 100270 104769 109613 114458 119612 125243 131294 137958
1511A37958P459Q207Q913J0206J1225J2519J3734J5300J6929J8902K1248K4311K7601L1070
$$ 137958 145417 153624 162537 172743 183968 196487 210221 225521 242450 261352 282600 306911 334512 365582
1509C65582L4557L8162M1681M6510N3484O1851P0244P7658Q3238R0652J05399J28733J59541
$$ 365582 400139 438301 479982 526492 579976 641827 712071 789729 872967 963619 1069018 1197751 1357292
1508A357292J97160K42310K98433L63858M30458M81472M86303M01650J97226j12517m05786
$$ 1357292 1554452 1796762 2095195 2459053 2889511 3370983 3857286 4258936 4456162 4343645 3937859
1507C937859n55864n72802n11009m21552l34834k60071k00661j56375j22429r4878p2485n3097
$$ 3937859 3381995 2809193 2298184 1876632 1541798 1281727 1081066 924691 802262 707384 634899 581802
1506E81802l6660k2851j1651m780m721j3632k8991m1168m5393m4102l9347l3294k7613k2647
$$ 581802 545142 522291 510640 505860 501139 487507 458516 417348 371955 327853 288506 255212 227599 204952
1505B04952j8641j5443j2969j1132r419q398p387o774o114n909n561n357m673m196m035l694
$$ 204952 186311 170868 157899 146767 137348 128950 121563 114789 108675 102766 97205 91848 87175 82979 78944 75250
1503G5250l448k972k870k666k655k314k188k187j679j678j679j679j340j341j238j239r51
$$ 75250 71802 68830 65960 63294 60639 58325 56137 53950 52271 50593 48914 47235 45895 44554 43316 42077 41126
1502D1126r50r38j142j091j090j261j261j192r87q43o39m84m83m71m71n03n03m34k31j77K6
$$ 41126 40176 39238 38096 37005 35915 34654 33393 32201 31214 30371 29732 29248 28765 28294 27823 27320 26817 26383 26152 25975 26001
1500B6001K05M09P05J044J308J784K392L412M237N122N395M238J084l067n804o416n618m324
$$ 26001 26206 26615 27320 28364 29672 31456 33848 37260 41497 46619 52014 56252 57336 54269 48465 42049 36431 32107
1498C2107l135k385j800j050q26m85l92j88o09r48r75j314j323r83r57r58o34o35m44k39l41
$$ 32107 28972 26587 24787 23737 22911 22426 22034 21846 21237 20289 19314 18000 16677 15694 14737 13779 13145 12510 12066 11827 11486
1496A1486l40l28j23l81j77k27k28k21k22j19j19k18k17j53l57j65j65k80k80j76j75ook33
$$ 11486 11146 10818 10695 10314 10137 9910 9682 9461 9239 9120 9001 8783 8566 8413 8056 7891 7726 7446 7166 6990 6815 6809 6803 6570
1494F570k33m1l82k63k62m41m41m54k51k63k63j62j61l02L9M4M4K35K35J43J42J43J43J73
$$ 6570 6337 6296 5914 5651 5389 4948 4507 4053 3802 3539 3276 3114 2953 2651 2690 2734 2778 3013 3248 3391 3533 3676 3819 3992
1492C992J74K24K25K78K78L67L67M55K50L14L14L13L12M61M62K43r7m15m16m15m14n72n73
$$ 3992 4166 4390 4615 4893 5171 5538 5905 6360 6610 6924 7238 7551 7863 8324 8786 9029 8932 8517 8101 7686 7272 6700 6127
1490F127n56l52l52l52l65j60l14l13j54N0K4K4M3j62r7J06l4J70J70J70L4L4Q5Q4K36K36
$$ 6127 5571 5219 4867 4515 4150 3990 3676 3363 3209 3259 3283 3307 3350 3188 3091 3197 3163 3333 3503 3673 3707 3741 3826 3910 4146 4382
1488D382J85J84Q2Q2Q1Q2j22j23p1p2j61j61l19l18l30j27l30l30j72L2K0J9k2k2q6J19K12
$$ 4382 4567 4751 4833 4915 4996 5078 4956 4833 4762 4690 4529 4368 4049 3731 3401 3274 2944 2614 2442 2474 2494 2513 2491 2469 2383 2502 2714
1485B714K12K12K12L18J13L7j67q4q3j21Q2o1k65j50N4K32K33K96K97J72J72J17q8r3r3l23
$$ 2714 2926 3138 3350 3668 3781 3818 3651 3567 3484 3363 3445 3384 3119 2969 3023 3255 3488 3784 4081 4253 4425 4542 4454 4361 4268 3945
1483C945j18j19j19k08k07l03l03j32j33P6P6k6k6r1r0J1J2M8M7O1O0o8J35k2k26j39O6L03
$$ 3945 3827 3708 3589 3381 3174 2871 2568 2436 2303 2379 2455 2429 2403 2312 2222 2233 2245 2293 2340 2401 2461 2393 2528 2506 2280 2141 2207 2510
1480B510R9M3K48k00j99j86l91m71k67k99M1M5M5oJ98n2k57k61m66l07j03Q3Q3PL45l1l2J48
$$ 2510 2609 2652 2900 2700 2501 2315 1924 1453 1186 887 928 973 1018 1012 1210 1158 901 640 174 -133 -236 -153 -70 -63 282 251 219 367
1478C67J47P8j26j26P8j33j32j82K0J78J79R0R0J94J94j11j12j54j55j54l58j58l62r0r1l
$$ 367 514 592 466 340 418 285 153 -29 -9 169 348 438 528 722 916 805 693 539 384 230 -128 -286 -648 -738 -829 -832
1475h32lllJ3J3J02J02J66l8P6P7R2R3j0j0n1n1%%J75J75NOn3n2j09l12m5m4K3K4K81o0J32
$$ -832 -835 -838 -841 -828 -815 -713 -611 -445 -483 -407 -330 -238 -145 -155 -165 -216 -267 -267 -267 -92 83 88 94 41 -11 -120 -432 -477 -521 -498 -474 -193 -253 -121
1472a21J31mlk88q5j97j97q3q2K6K7J5K18K93K92L05L05K44K44J29J29J94j0LL%Jn1n0l01
$$ -121 10 6 3 -285 -370 -567 -764 -847 -929 -903 -876 -861 -643 -350 -58 247 552 796 1040 1169 1298 1492 1482 1485 1488 1488 1489 1438 1388 1087
1470A087l00m9n0k13rk2k2J05J06LLL48L48J65J65R6j08n7J47q5q5j28l32j33j33J40o5ml
$$ 1087 787 738 688 475 466 444 422 527 633 636 639 987 1335 1500 1665 1761 1653 1596 1743 1658 1573 1445 1113 980 847 987 922 918 915
1467I15j6j6j03j03P5k65j58l62k57k56l21j18k32k32j52j52q0q1j68J72Q3Q2J88J88M73K68
$$ 915 899 883 780 677 752 487 329 -33 -290 -546 -867 -985 -1217 -1449 -1601 -1753 -1833 -1914 -2082 -1910 -1827 -1745 -1557 -1369 -896 -628
1465f28L30L30J47J47Q7Q7k8J76J34J33M5M4J0J1J37o6j25P8J21J21R7R7J11J10j65L9K6K6
$$ -628 -298 32 179 326 413 500 472 648 782 915 960 1004 1014 1025 1162 1096 971 1049 1170 1291 1388 1485 1596 1706 1541 1580 1606 1632
1462A632m3m4r5r4j10j09j48j48k10nLK07J65J65J26J27L9L9K56N2K4K3klJ29p5o3o3mnM7
$$ 1632 1589 1545 1450 1356 1246 1137 989 841 631 626 629 836 1001 1166 1292 1419 1458 1497 1753 1805 1829 1852 1850 1847 1976 1901 1838 1775 1771 1766 1813
1459A813M7K3K2J51n4k16j3k42k42k10k10k22j9K02K03K15K15L4L3L3L4j18j17j18j17j01
$$ 1813 1860 1883 1905 2056 2002 1786 1773 1531 1289 1079 869 647 628 830 1033 1248 1463 1497 1530 1563 1597 1479 1362 1244 1127 1026
1457A026j00j82j81k67P3o8o8r0r0k04%M2M3N6N4n3n4l47pp1p1n0m9p7p7j66j66j51N2J09
$$ 1026 926 744 563 296 369 301 233 143 53 -151 -151 -109 -66 -10 44 -9 -63 -410 -417 -488 -559 -609 -658 -735 -812 -978 -1144 -1295 -1243 -1134
1454a134J08K06K07L6L7K06K06J18J16j61M3K8L0q6q7q8q7m0m0j4k19j96Qj7j8p5p5j1k16
$$ -1134 -1026 -820 -613 -577 -540 -334 -128 -10 106 -55 -12 16 46 -40 -127 -215 -302 -342 -382 -396 -615 -811 -803 -820 -838 -913 -988 -999 -1215
1451a215J03J02J%o7J36K2K2r9r8q6q5j64M1J00L05J08J07L63K3J79J79qqJ31p2j43j44r5
$$ -1215 -1112 -1010 -1009 -1009 -1076 -940 -918 -896 -995 -1093 -1179 -1264 -1428 -1387 -1287 -982 -874 -767 -404 -381 -202 -23 -31 -39 92 20 -123 -267 -362
1449c62r5N8N8qqJ33J32j3k17K9K9k56n3j67j67j81j81m1m1J51n2J81J81J84J83M3j61J09
$$ -362 -457 -399 -341 -349 -357 -224 -92 -105 -322 -293 -264 -520 -573 -740 -907 -1088 -1269 -1310 -1351 -1200 -1252 -1071 -890 -706 -523 -480 -641 -532
1446e32J09n6n7P6P6J05r8r6r7L2L1J14r0k65P6K24K1o5o4p2p1J50J50QRQQo3o3R0R0J11J10
$$ -532 -423 -479 -536 -460 -384 -279 -377 -473 -570 -538 -507 -393 -483 -748 -672 -448 -427 -492 -556 -628 -699 -549 -399 -391 -382 -374 -366 -429 -492 -402 -312 -201 -91
1443i1m3m3J36J34N1N0O0O1R8R8J16q8K7K6L0L0J96rR7R7jjllq8q8mmL4K38qrl4l3m2J62j19
$$ -91 -134 -177 -41 93 144 194 254 315 413 511 627 539 566 592 622 652 848 839 936 1033 1032 1031 1028 1025 937 849 845 841 875 1113 1105 1096 1062 1029 987 1149 1030
1440A030j18N7j47j98Oj22j21j09j09r1q9k7k7J7K21K25K26J24J23L9L9n6n6j53j53l3k36
$$ 1030 912 969 822 624 630 508 387 278 169 78 -11 -38 -65 -48 173 398 624 748 871 910 949 893 837 684 531 498 262
1438B62p1p0M1M1J27J26K08K09K71O8J04J03R1R1k1k1J45n9Q0Q0K21K20J46J46R5R5K29K28
$$ 262 191 121 162 203 330 456 664 873 1144 1212 1316 1419 1510 1601 1580 1559 1704 1645 1725 1805 2026 2246 2392 2538 2633 2728 2957 3185
1435C185K25K0K44K43O5K69L62L62K34N75O97O98Q59J063J327J326J692K305K653K653K606
$$ 3185 3410 3430 3674 3917 3982 4251 4613 4975 5209 5784 6481 7179 8038 9101 10428 11754 13446 15751 18404 21057 23663
1433B3663J313l05k142l311l312k994k383j919j579j256p81m66m66l70l70j96QqqN5N6k53
$$ 23663 24976 24671 22529 19218 15906 12912 10529 8610 7031 5775 4994 4528 4062 3692 3322 3126 3134 3126 3118 3173 3229 2976
1431B976k53n3k57l19l18k94q9j71j71J23q2k39l5j62j62l8l9q9q9L6L6j5j6R9R9M7M8o4o3
$$ 2976 2723 2670 2413 2094 1776 1482 1393 1222 1051 1174 1092 853 818 656 494 456 417 328 239 275 311 296 280 379 478 525 573 509 446
1428D46o3o3n8n9p2p1Q9j14J32J32m8J56K9K9J34p1Kk03o4J40j71j70K29K5r8r9J00R9J00
$$ 446 383 320 262 203 131 60 149 35 167 299 251 407 436 465 599 528 530 327 263 403 232 62 291 316 218 119 219 318 418
1426D18R9J28J28j02J03K36L2j25P9K6K7o3o3RJ0r3r3j09j10k11k12j45j46j45j46j04j04
$$ 418 517 645 773 671 774 1010 1042 917 996 1022 1049 986 923 932 942 849 756 647 537 326 114 -31 -177 -322 -468 -572 -676
1423f76J34J34m5m4n7J46M8M8J88j5LK06Q0Q0N4N4N4N4PPr5r4m4m4N8N8j3j2j2j2Q8Q8j3j4
$$ -676 -542 -408 -453 -497 -554 -408 -360 -312 -124 -139 -136 70 150 230 284 338 392 446 453 460 365 271 227 183 241 299 286 274 262 250 338 426 413 399
1420C99j25j26M5M5M6M5j8J87q0q0j30P3O8O9l4l4J09r4K0K1O7O8m7m7o0k64J35o8qpk1k0
$$ 399 274 148 193 238 284 329 311 498 418 338 208 281 349 418 384 350 459 365 385 406 473 541 494 447 387 123 258 190 182 175 154 134
1417A34O0O1J8j86j23P9m6m7J8J7J7J8K6K6Q9R0l8J66J54J53J10J10N9N9MMj11j11O9j34j73
$$ 134 194 255 273 87 -36 43 -3 -50 -32 -15 2 20 46 72 161 251 213 379 533 686 796 906 965 1024 1028 1032 921 810 879 745 572
1415E72L1k63n9P7P7j2j2j1j2j2j2j2j2j02j01Q2Q1j19Q5q1J23j83K0q1q0o8o7J03J01K8K9
$$ 572 603 340 281 358 435 423 411 400 388 376 364 352 340 238 137 219 300 181 266 185 308 125 145 64 -16 -84 -151 -48 53 81 110
1412A10J56m9L3K36J22q2o5o5r1r0J46n8POn2n3L7L7Rj96K1K1J6J7J31p3N7N7j26j26p8p7
$$ 110 266 217 250 486 608 526 461 396 305 215 361 303 310 316 264 211 248 285 294 98 119 140 156 173 304 231 288 345 219 93 15 -62
1409f2K4K4M8N0O2O2J6K20J18J18j63M2K8K9L5L5J37J37J0J0RJ0q9r0q9q9n0n0m9n0J01J01
$$ -62 -38 -14 34 84 146 208 224 444 562 680 517 559 587 616 651 686 823 960 970 980 989 999 910 820 731 642 592 542 493 443 544 645
1406F45O3O3l2J72m4m5O8O7l5l4O2O2P5P4j25P8J30p5l2l2j47j46KKm8m9o9o9J6J6o1o1K3
$$ 645 708 771 739 911 867 822 890 957 922 888 950 1012 1087 1161 1036 1114 1244 1169 1137 1105 958 812 814 816 768 719 650 581 597 613 552 491 514
1403E14K4J59J60m0m0O6j37p3p4l5l5q6q6n7n6J43o0r7r7P8P7k4k4o7J38J30p5j33j34K0K0
$$ 514 538 697 857 817 777 843 706 633 559 524 489 403 317 260 204 347 287 190 93 171 248 224 200 133 271 401 326 193 59 79 99
1400I9K0K0O5O6q7q8Q6Q6K3K2R5j10n8J45J65J64J26J26P5P5m5m4l4l5j20j20k8k8j95J0n9
$$ 99 119 139 204 270 183 95 181 267 290 312 407 297 239 384 549 713 839 965 1040 1115 1070 1026 992 957 837 717 689 661 466 476 417
1397D17n9R4R4P1j32O7O7J2J2J2J1rj0J44J43K9K8J43o1j0j0M9N0k9k33j19j18N7N7pJ97n0
$$ 417 358 452 546 617 485 552 619 631 643 655 666 657 647 791 934 963 991 1134 1073 1063 1053 1102 1152 1123 890 771 653 710 767 760 957 907
1394I07n0j15R0J04j00K7K7j61j62M7M6K20J6J82k3J8j86JJj02j03j02j02j04j03m0m0p2J33
$$ 907 857 742 832 936 836 863 890 729 567 614 660 880 896 1078 1055 1073 887 888 889 787 684 582 480 376 273 233 193 121 254
1392B54J49J49n4J49K2K1N5j49N0N1J17J17p0p0l5l6l6l6LMLMJ37J38N2N2nnJ48J48J51J50
$$ 254 403 552 498 647 669 690 745 596 646 697 814 931 861 791 756 720 684 648 651 655 658 662 799 937 989 1041 1036 1031 1179 1327 1478 1628
1389A628J50J50K85K86K72K73L08J05l6l6l93l94k74k75l06l06O3O4k64o0q9r0r6r6j0j1j19
$$ 1628 1778 1928 2213 2499 2771 3044 3352 3457 3421 3385 2992 2598 2324 2049 1743 1437 1500 1564 1300 1240 1151 1061 965 869 859 848 729
1386G29j19J83k1j7j7N6N5O8O7nop7J27R7R7L8L9m7m7J9J8R1R0P5j30j29P4J42J41j1j2J65
$$ 729 610 793 772 755 738 794 849 917 984 979 973 896 1023 1120 1217 1255 1294 1247 1200 1219 1237 1328 1418 1493 1363 1234 1308 1450 1591 1580 1568 1733
1383A733m0n7n6J88j5j13R1L2j73m5m5K04K03J7J7J25J25J26J25L7L8N0N0p3J32J7J7K09K10
$$ 1733 1693 1636 1580 1768 1753 1640 1731 1763 1590 1545 1500 1704 1907 1924 1941 2066 2191 2317 2442 2479 2517 2567 2617 2544 2676 2693 2710 2919 3129
1381C129O9O9l0J74J23K1J04K07J69l6J67L70L43M45M78K74L38L37R18Q15Q73J212J299J639
$$ 3129 3198 3267 3237 3411 3534 3555 3659 3866 4035 3999 4166 4536 4879 5324 5802 6076 6414 6751 7669 8484 9357 10569 11868 13507
1379A3507J886K362K946L559M120M732M562K862N5l006m303l962k840j684n23P70J484K368
$$ 13507 15393 17755 20701 24260 28380 33112 37674 40536 40591 37585 33282 29320 26480 24796 24273 25043 26527 28895
1377B8895L634M653N708P409R416J1252J2647J1491O208l520j2499j5833j4906j2117r209
$$ 28895 32529 37182 42890 50299 59715 70967 83614 95105 101313 97793 85294 69461 54555 42438 33229
1376C3229o691n058l765k788k175j620j280j036r34p04n00n83k43k09n50k34k35j75j75k77
$$ 33229 26538 21480 17715 14927 12752 11132 9852 8816 7882 7178 6678 6095 5852 5643 5093 4859 4624 4449 4274 3997
1374C997O4j2k15p9q0k47k47p7p7n6n7oo%%j%P9Q0l0k9J36L3j27P8J02J03L19J15J56m7q6
$$ 3997 4061 4049 3834 3755 3675 3428 3181 3104 3027 2971 2914 2908 2902 2902 2902 2901 2901 2980 3060 3030 3001 3137 3170 3043 3121 3223 3326 3645 3760 3916 3869 3783
1371C783K54K07K08J78J77M85M85N86N87R26R25J275J614J782K257K760L099L040K292L35
$$ 3783 4037 4244 4452 4630 4807 5292 5777 6363 6950 7876 8801 10076 11690 13472 15729 18489 21588 24628 26920 27255
1369B7255j773l018l222k576j691q37k25K52N91J085J697K216K964L968N124N634N294L019
$$ 27255 25482 22464 19242 16666 14975 14138 13913 14165 14756 15841 17538 19754 22718 26686 31810 37444 42738 45757
1367D5757j267n229o931o590n433m320l163k420j808j209j004o06o05n21n21m28q9j09j10
$$ 45757 44490 39261 32330 25740 20307 15987 12824 10404 8596 7387 6383 5777 5172 4651 4130 3702 3613 3504 3394
1366C394k38k38j3j3q7k91j77j76o8o8j83K1n0n1l7l8r4r3j84j83l4J70MLJ4J3q8q9J12J11
$$ 3394 3156 2918 2905 2892 2805 2514 2337 2161 2093 2025 1842 1863 1813 1762 1725 1687 1593 1500 1316 1133 1099 1269 1273 1276 1290 1303 1215 1126 1238 1349
1363A349RRK4K5p8p8J1J1J2J1k1k2j36O7p2p2rrJ37J38L5L5l0l0j19K21M1M2J13J14J%J4j91
$$ 1349 1358 1367 1391 1416 1338 1260 1271 1282 1294 1305 1284 1262 1126 1193 1121 1049 1040 1031 1168 1306 1341 1376 1346 1316 1197 1418 1459 1501 1614 1728 1729 1729 1743 1552
1360A552N0M9j4j4J01J01jjr8r7MNL6L7M9M9j04J01k8J77J04J04J17J17M0M0J43J42J66J65
$$ 1552 1602 1651 1637 1623 1724 1825 1824 1823 1725 1628 1632 1637 1673 1710 1759 1808 1704 1805 1777 1954 2058 2162 2279 2396 2436 2476 2619 2761 2927 3092
1357C092J66J65L00K99L08N12N60R00R13R13J448J789K405L018L445L922L599J626j635m016
$$ 3092 3258 3423 3723 4022 4330 4842 5402 6302 7215 8128 9576 11365 13770 16788 20233 24155 27754 29380 27745 23729
1355B3729m671m194l447k426j745j406r54o15n25l22l40l41k73o8j28j28j4j3r7r7j10R4p2
$$ 23729 19058 14864 11417 8991 7246 5840 4886 4271 3746 3424 3084 2743 2470 2402 2274 2146 2132 2119 2022 1925 1815 1909 1837
1353A837p2j10j10p5p4j26j26m5m4J25J25r2r1J1J0mmj19Q5K4K4o5o5k8k9P3P3j93j92O6K71
$$ 1837 1765 1655 1545 1470 1396 1270 1144 1099 1055 1180 1305 1213 1122 1133 1143 1139 1135 1016 1101 1125 1149 1084 1019 991 962 1035 1108 915 723 789 1060
1350A060M3M3j82j82j0j1j0j0Q1Q1k1k0j43j43P4j30Q9Q9k6k6PPPPm4m4N9N8K0K0r5J10M0
$$ 1060 1103 1146 964 782 772 761 751 741 822 903 882 862 719 576 650 520 609 698 672 646 653 660 667 674 630 586 645 703 723 743 648 758 798
1347G98M0k40J00l3l3M0L9j7j8q2J23O8O9J07r7o2J42J5J4l0l1l0l0n6n6m4m3r8J05rrJ9J8
$$ 798 838 598 698 665 632 672 711 694 676 594 717 785 854 961 864 802 944 959 973 943 912 882 852 796 740 696 653 555 660 651 642 661 679
1344F79q4q3o3o3o3o2J05J05j0J94p2p2N5j49j4j4K4K5L7L8J27J26J07r7j10R4N6j48k0k1
$$ 679 595 512 449 386 323 261 366 471 461 655 583 511 566 417 403 389 413 438 475 513 640 766 873 776 666 760 816 668 648 627
1342F27l3l3l3l3O6O6O6O6%%%JJ08J08OOo8o7L5L4k9k8L4L5n7J46K24j18q0q1%jj72j72O5
$$ 627 594 561 528 495 561 627 693 759 759 759 759 760 868 976 982 988 920 853 888 922 893 865 899 934 877 1023 1247 1129 1049 968 968 967 795 623 688
1339F88O6J5J4q7q8J61J61p6p7l0l0Q5j19j4j4P5P5l8l8%%K01ln8n8M5M5M5M5j32j31L9L8
$$ 688 754 769 783 696 608 769 930 854 777 747 717 802 683 669 655 730 805 767 729 729 729 930 927 869 811 856 901 946 991 859 728 767 805
1336H05M6M6rk14K7K6R1j14r7J06L0L0k1k1k2k1q3q4Q6Q6K6K5k5k5j0j0R2R2j17j18N3N3n4
$$ 805 851 897 888 674 701 727 818 704 607 713 743 773 752 731 709 688 605 521 607 693 719 744 719 694 684 674 766 858 741 623 676 729 675
1333F75n4O0O1j26P7l7l7M2M1q6J19J37o7O1O0N7N7m5m5l0l0l1l0K4K4K3K4P6P6K4K5n4n4
$$ 675 621 681 742 616 693 656 619 661 702 616 735 872 805 866 926 983 1040 995 950 920 890 859 829 853 877 900 924 1000 1076 1100 1125 1071 1017
1330A017KK05j22j21NOj22Q3J33p1j3j3K5K5L6L7o6o6KJj14R1j09j10J9J8r6J09M5M5n4n4
$$ 1017 1019 1224 1102 981 986 992 870 953 1086 1015 1002 989 1014 1039 1075 1112 1046 980 982 983 869 960 851 741 760 778 682 791 836 881 827 773
1327G73J17J16J7J8O8O9m9m9J5j90p2p2Q5Q5q7q7J5J5P0P1j00j00j0j0R3R2k5k5k5k4jjj02
$$ 773 890 1006 1023 1041 1109 1178 1129 1080 1095 905 833 761 846 931 844 757 772 787 857 928 828 728 718 708 801 893 868 843 818 794 793 792 690
1324F90j03R0R0q1q0L1L2k0k0K8K8p4p4rrK29K29k7k6l9J65L5L5j23j23P3P3Q5j18k7k8O2
$$ 690 587 677 767 686 606 637 669 649 629 657 685 611 537 528 519 748 977 950 924 885 1050 1085 1120 997 874 947 1020 1105 987 960 932 994
1321I94O2q1q2P6P6R7j06N9N9j%N0N1rrrj0r5r5K0J9m0J64n3n3n3n3o6J39L0L1n9n9J8J8J7
$$ 994 1056 975 893 969 1045 1142 1036 1095 1154 1153 1153 1203 1254 1245 1236 1227 1217 1122 1027 1047 1066 1026 1190 1137 1084 1031 978 912 1051 1081 1112 1053 994 1012 1030 1047
1318A047J8L4L4L4L4o8o8K29K6j07R7P2P2J7J6J19J19j11j10J74k9J59J60m5K96J28J29L67
$$ 1047 1065 1099 1133 1167 1201 1133 1065 1294 1320 1213 1310 1382 1454 1471 1487 1606 1725 1614 1504 1678 1649 1808 1968 1923 2219 2347 2476 2843
1315B843L66M79J39J40o5m18m17l28l28n2n2O4j41L4L4K1K1RRJ36o8R8L03J75J74K52K51M22
$$ 2843 3209 3688 3827 3967 3902 3484 3067 2739 2411 2359 2307 2371 2230 2264 2298 2319 2340 2349 2358 2494 2426 2524 2827 3002 3176 3428 3679 4101
1312D101M21O06O05Q73Q74J200J677K124K463K858K653J566k72k639l387l157k545j926j451
$$ 4101 4522 5128 5733 6606 7480 8680 10357 12481 14944 17802 20455 22021 21749 19110 15723 12566 10021 8095 6644
1311F644j216p40m99m99m39r9nmk39k38J24J24J24J24J05J04J77j63l11l10k47k48j92j93
$$ 6644 5428 4688 4189 3690 3251 3152 3147 3143 2904 2666 2790 2914 3038 3162 3267 3371 3548 3385 3074 2764 2517 2269 2077 1884
1309A884q7q6L3j70m3m3k00MQQM8M7M8M7j2j2l3l3J46j93KK05POJ9J9k0k1L1L1m6m6m2J63
$$ 1884 1797 1711 1744 1574 1531 1488 1288 1292 1300 1308 1356 1403 1451 1498 1486 1474 1441 1408 1554 1361 1363 1568 1575 1581 1600 1619 1599 1578 1609 1640 1594 1548 1506 1669
1305A669j26j25OOm1m0m1m1O8O9n0n1J45J45J3J3J22q3n3n2k0j9p0p0n6n6j71L3N5N6q5q5
$$ 1669 1543 1418 1424 1430 1389 1349 1308 1267 1335 1404 1354 1303 1448 1593 1606 1619 1741 1658 1605 1553 1533 1514 1444 1374 1318 1262 1091 1124 1179 1235 1150 1065
1303A065L6L5m9n0n7n7K45M1m6m6qqP3P4K3K3l9l9l9l8L2L3L2L3p5p4L1L2j35K04JJJ29p4
$$ 1065 1101 1136 1087 1037 980 923 1168 1209 1163 1117 1109 1101 1174 1248 1271 1294 1255 1216 1177 1139 1171 1204 1236 1269 1194 1120 1151 1183 1048 1252 1253 1254 1383 1309
1299A309p5J29m0m0j5j5q0J24K10Nm5m4n8n7N0N0jjk5k5p6p6L2L3j9j8N7N8k8k7L5L6L5L5
$$ 1309 1234 1363 1323 1283 1268 1253 1173 1297 1507 1512 1467 1423 1365 1308 1358 1408 1407 1406 1381 1356 1280 1204 1236 1269 1250 1232 1289 1347 1319 1292 1327 1363 1398 1433
1296A433j1j2P3P3p4p5J59m5k1k1K43r8llk5k4l8l8J3J2N4N3J13L17J69l4R3R3j21j20j08
$$ 1433 1422 1410 1483 1556 1482 1407 1566 1521 1500 1479 1722 1624 1621 1618 1593 1569 1531 1493 1506 1518 1572 1625 1738 2055 2224 2190 2283 2376 2255 2135 2027
1294B027j08j16Q7P4j29%k04Q6Q5R4R4k4k5rrrrN1N1j%J27J28J78J78J67J66J88J88K62O02
$$ 2027 1919 1803 1890 1964 1835 1835 1631 1717 1802 1896 1990 1966 1941 1932 1923 1914 1905 1956 2007 2006 2006 2133 2261 2439 2617 2784 2950 3138 3326 3588 4190
1291D190L82N85P11P11N97Q00K88Q3m23q99q41q41o15o15k78k77k05k05j75J65L8j67O9O8
$$ 4190 4572 5157 5868 6579 7176 7976 8264 8347 7924 7025 6184 5343 4728 4113 3835 3558 3353 3148 2973 3138 3176 3009 3078 3146
1289C146N6N5j70j71k09m13o8o7q1q0j8j8j9j8l1l0J98nl19j15mnj7j7j19K21J32p2l8l8q
$$ 3146 3202 3257 3087 2916 2707 2294 2226 2159 2078 1998 1980 1962 1943 1925 1894 1864 2062 2057 1738 1623 1619 1614 1597 1580 1461 1682 1814 1742 1704 1666 1658
1286A658rNk00n8n8R9R9m5m4j21Q3J40o4O3O4K1K2L5j69P3P4M8M8J16q9J4J4K01mj27j28J7
$$ 1658 1649 1654 1454 1396 1338 1437 1536 1491 1447 1326 1409 1549 1485 1548 1612 1633 1655 1690 1521 1594 1668 1716 1764 1880 1791 1805 1819 2020 2016 1889 1761 1778
1283A778J6m7m8J31p4q2q2J48j93J2J2q3J21Q4j21j40O4L8L9P9Q0K8K9KLJ05J05l8l8q9q9
$$ 1778 1794 1747 1699 1830 1756 1674 1592 1740 1547 1559 1571 1488 1609 1693 1572 1432 1496 1534 1573 1652 1732 1760 1789 1791 1794 1899 2004 1966 1928 1839 1750
1280A750J29J29n4n4k9k33N2N2k0j9L2L1k1k1R4j10N0N1L7L8M2M2M3M2l4l5k1k1j05J00j4
$$ 1750 1879 2008 1954 1900 1871 1638 1690 1742 1722 1703 1735 1766 1745 1724 1818 1708 1758 1809 1846 1884 1926 1968 2011 2053 2019 1984 1963 1942 1837 1937 1923
1277A923j5rqj36O8K16J3j54j53L5K40m5m5J08J08p5p5J7j88j87J7J20J20j65L9J92j2J4J4
$$ 1923 1908 1899 1891 1755 1823 2039 2052 1898 1745 1780 2020 1975 1930 2038 2146 2071 1996 2013 1825 1638 1655 1775 1895 1730 1769 1961 1949 1963 1977
1275A977K7K7K7K8j0j0M1M1j70j70j2j2O5j39l7J68%JJ15J15j03j04kjJ8J7J8J8NNNNK9L0
$$ 1977 2004 2031 2058 2086 2076 2066 2107 2148 1978 1808 1796 1784 1849 1710 1673 1841 1841 1842 1957 2072 1969 1865 1863 1862 1880 1897 1915 1933 1938 1943 1948 1953 1982 2012
1271B012p3p3J7J6J7J6k0k0O9P0O2j42r2J13O7O7k2k2K26K26n8J46K19K19K70K70J58m6k24
$$ 2012 1939 1866 1883 1899 1916 1932 1912 1892 1961 2031 2093 1951 1859 1972 2039 2106 2084 2062 2288 2514 2456 2602 2821 3040 3310 3580 3738 3692 3468
1269C468k24l31j26j26j26q0J25r2r3q1q2r4J10J7J7p2p2p2p2%%k66P3K56q4j25P9N7j46m0
$$ 3468 3244 2913 2787 2661 2535 2455 2580 2488 2395 2314 2232 2138 2248 2265 2282 2210 2138 2066 1994 1994 1994 1728 1801 2057 1973 1848 1927 1984 1838 1798
1266A798m1M9M9M6M6M6M6j0j0j1j0P0P1J34p0o5o4R3R2J3J3J2J3L0K9j23j24Q9R0L8L8n2n3
$$ 1798 1757 1806 1855 1901 1947 1993 2039 2029 2019 2008 1998 2068 2139 2273 2203 2138 2074 2167 2259 2272 2285 2297 2310 2340 2369 2246 2122 2211 2301 2339 2377 2325 2272
1263B272n2n2J25J26j30j30popok1k2O4O3K9K9l6J69l3l4J45n9m2m2n0J53q2q2o6J39l8l7
$$ 2272 2220 2168 2293 2419 2289 2159 2152 2146 2139 2133 2112 2090 2154 2217 2246 2275 2239 2408 2375 2341 2486 2427 2385 2343 2293 2446 2364 2282 2216 2355 2317 2280
1260B280J40o3M8M8j7j6P4P3K2K2r7r7j60M3n4n4mK01M1M1l1l1N4N3m4m4J41o3J37J37j42
$$ 2280 2420 2357 2405 2453 2436 2420 2494 2567 2589 2611 2514 2417 2257 2300 2246 2192 2188 2389 2430 2471 2440 2409 2463 2516 2472 2428 2569 2506 2643 2780 2638
1257B638j42r1r0K3K4o2o1R4R5R5R5L5L6m9n0m9m9M8M9j24Q1l4l4K6K7K6K7j4j4j4j4K4K4
$$ 2638 2496 2405 2315 2338 2362 2300 2239 2333 2428 2523 2618 2653 2689 2640 2590 2541 2492 2540 2589 2465 2546 2512 2478 2504 2531 2557 2584 2570 2556 2542 2528 2552 2576
1254B576j41O2k0k0N6j48Q8Q8l1l1j51N2j26P8R5R5L6L5j42O1j17j17K21J6J62m3j14j14J07
$$ 2576 2435 2497 2477 2457 2513 2365 2453 2541 2510 2479 2328 2380 2254 2332 2427 2522 2558 2593 2451 2512 2395 2278 2499 2515 2677 2634 2520 2406 2513
1252B513r7R3R2k7k7n8J45Q2Q1m4m3P5P5onJ00J01K1j83o8o8Q0P9k6k6j32P3K1K2j9J85K0
$$ 2513 2416 2509 2601 2574 2547 2489 2634 2716 2797 2753 2710 2785 2860 2854 2849 2949 3050 3071 2888 2820 2752 2832 2911 2885 2859 2727 2800 2821 2843 2824 3009 3029
1249C029J9j10j10mmJ27p6k6J79p4p5n7J47q7q6R2R2n9J45n5n5J5J4p1p1L4L4L5L4j8j8L3
$$ 3029 3048 2938 2828 2824 2820 2947 2871 2845 3024 2950 2875 2818 2965 2878 2792 2884 2976 2917 3062 3007 2952 2967 2981 2910 2839 2873 2907 2942 2976 2958 2940 2973
1246B973L4K6K7n8n8M1M0K8K8J32p2M3M3M5M6m0m0J8J8J33p2M4M4Q2j22J78k6m3m3M0L9p5
$$ 2973 3007 3033 3060 3002 2944 2985 3025 3053 3081 3213 3141 3184 3227 3272 3318 3278 3238 3256 3274 3407 3335 3379 3423 3505 3383 3561 3535 3492 3449 3489 3528 3453
1243C453J29J31J31N9N9K05K05P8K81M11K08J81j58j43m84l00l00k54n0m5m5q4q4ONk5k29
$$ 3453 3582 3713 3844 3903 3962 4167 4372 4450 4731 5142 5350 5531 5373 5230 4746 4446 4146 3892 3842 3797 3752 3668 3584 3590 3595 3570 3341
1241C341N5N6J7J8J7J7L1L1L1L1p6p6R0j14P5P5m0m0o8o8j7j7R1R2j13R2p2J33k0k0j4j4j
$$ 3341 3396 3452 3469 3487 3504 3521 3552 3583 3614 3645 3569 3493 3583 3469 3544 3619 3579 3539 3471 3403 3386 3369 3460 3552 3439 3531 3459 3592 3572 3552 3538 3524 3523
1238C523jm0J65jjp1p0J9J9R4j11q6K55n8n7J4J5l4l3q4q4j1j1M0M0P0P0j9k0o0J43N4j50
$$ 3523 3522 3482 3647 3646 3645 3574 3504 3523 3542 3636 3525 3439 3694 3636 3579 3593 3608 3574 3541 3457 3373 3362 3351 3391 3431 3501 3571 3552 3532 3472 3615 3669 3519
1235C519j0J95l6l5l8l9J79k6j8j9K0J9m9n0O6O5j91J3O8O8K7K8K8K7N0M9P5j30n7J47PPj1
$$ 3519 3509 3704 3668 3633 3595 3556 3735 3709 3691 3672 3692 3711 3662 3612 3678 3743 3552 3565 3633 3701 3728 3756 3784 3811 3861 3910 3985 3855 3798 3945 3952 3959 3948
1232C948k16J38J37m7m7N4N5N7N6j60M5l6l6K9K8nnQQqJ96q9q8j9j9l1l1Q5j19R9R8N9N9m3
$$ 3948 3732 3870 4007 3960 3913 3967 4022 4079 4135 3975 4020 3984 3948 3977 4005 4000 3995 4003 4011 4003 4199 4110 4022 4003 3984 3953 3922 4007 3888 3987 4085 4144 4203 4160
1229D160m3K0K1K1K0l5l5l5l5l1l1J40J39o1o0K8K9R7j08nnR3j10J7J7o4J39K5K4o3o3j2j2
$$ 4160 4117 4137 4158 4179 4199 4164 4129 4094 4059 4028 3997 4137 4276 4215 4155 4183 4212 4309 4201 4196 4191 4284 4174 4191 4208 4144 4283 4308 4332 4269 4206 4194 4182
1226D182k6k6J44J44m6m7m7m7J1J1J25p8j8j8l1l1nnR6R7N1N0j07j07L2K36m8m9K3K4k8k8
$$ 4182 4156 4130 4274 4418 4372 4325 4278 4231 4242 4253 4378 4300 4282 4264 4233 4202 4197 4192 4288 4385 4436 4486 4379 4272 4304 4540 4492 4443 4466 4490 4462 4434
1223D434P3P3k9k9J3J2J28p7Q3Q3m5m5J48n6m3m4N5N5N4N5m3m3m3m3J17J16j21j22M8M7o7
$$ 4434 4507 4580 4551 4522 4535 4547 4675 4598 4681 4764 4719 4674 4822 4766 4723 4679 4734 4789 4843 4898 4855 4812 4769 4726 4843 4959 4838 4716 4764 4811 4744
1220D744J37L2L3M5M6p3p3p3p3Q9Q9j4j3Q4Q4l1l1J02j02J3J2o5o5Q8Q8m3m3K9L0R1j13N3
$$ 4744 4881 4913 4946 4991 5037 4964 4891 4818 4745 4834 4923 4909 4896 4980 5064 5033 5002 5104 5002 5015 5027 4962 4897 4985 5073 5030 4987 5016 5046 5137 5024 5077
1217E077N2J4J3JJJ65l9K5K5l8l8J3J4L1L2p5p5j79K5R8R7k5k5K6K6rrrrN3N3l1l2jjJ19J18
$$ 5077 5129 5143 5156 5157 5158 5323 5284 5309 5334 5296 5258 5271 5285 5316 5348 5273 5198 5019 5044 5142 5239 5214 5189 5215 5241 5232 5223 5214 5205 5258 5311 5280 5248 5247 5246 5365 5483
1214E483M5M4j08j08J4J4l7l7O8O7J83k2j0rj17K24j55N0poJ49n5r3r3m9m8K61p8j00r9L2
$$ 5483 5528 5572 5464 5356 5370 5384 5347 5310 5378 5445 5628 5606 5596 5587 5470 5694 5539 5589 5582 5576 5725 5670 5577 5484 5435 5387 5648 5570 5470 5371 5403
1211E403L2J22J21LLKLj76K8J78k6j8j7NMNNN6N5NNj2j3R0j14K01lppj23Q1N1N1m3m4M2M1
$$ 5403 5435 5557 5678 5681 5684 5686 5689 5513 5541 5719 5693 5675 5658 5663 5667 5672 5677 5733 5788 5793 5798 5786 5773 5863 5749 5950 5947 5940 5933 5810 5891 5942 5993 5950 5906 5948 5989
1207E989o1o2J39o6M3M2L1L0n9n8n8n8M8M8J69l6q4J8M4n9J29p6M0J41J13k28l0l0j6j6O9
$$ 5989 5928 5866 6005 5939 5982 6024 6055 6085 6026 5968 5910 5852 5900 5948 6117 6081 5997 6015 6059 6000 6129 6053 6093 6234 6347 6119 6089 6059 6043 6027 6096
1205F096O9O3O3m4m4r6J08J15r0o8L4J4J5L2L3q3J22P4P4k6k6k6P6Q8j15n6M6JK06M8j57N7
$$ 6096 6165 6228 6291 6247 6203 6107 6215 6330 6240 6172 6206 6220 6235 6267 6300 6217 6339 6413 6487 6461 6435 6409 6485 6573 6458 6402 6448 6449 6655 6703 6546 6603
1202F603N6j43j44R1R0K20j20p2L1N6N6k2k3o4o4K1K1k3k4K8K7R8R8J2J3q7q7J94j1j32P2
$$ 6603 6659 6516 6372 6463 6553 6773 6653 6581 6612 6668 6724 6702 6679 6615 6551 6572 6593 6570 6546 6574 6601 6699 6797 6809 6822 6735 6648 6842 6831 6699 6771
1199F771J34L2j49N5OK10k20k19K0K1R1J94Rj95m8J57K9K9M1M0j12j12j4j3P1P2k1k1k1k1
$$ 6771 6905 6937 6788 6843 6849 7059 6839 6620 6640 6661 6752 6946 6955 6760 6712 6869 6898 6927 6968 7008 6896 6784 6770 6757 6828 6900 6879 6858 6837 6816
1196F816l7l7Q2Q2J0J1p4p5J53J53p1L1J71l3l2l1L9M0n0n0p2J33l3l3o7o8J58J58N8j45l0
$$ 6816 6779 6742 6824 6906 6916 6927 6853 6778 6931 7084 7013 7044 7215 7182 7150 7119 7158 7198 7148 7098 7026 7159 7126 7093 7026 6958 7116 7274 7332 7187 7157
1193G157l0K0K0K1K0m4m5POo4o5J40o5K55N1j10R4j79J62J53J52J8J8q4q4l3l3J45n8p2J33
$$ 7157 7127 7147 7167 7188 7208 7164 7119 7126 7132 7068 7003 7143 7078 7333 7384 7274 7368 7189 7351 7504 7656 7674 7692 7608 7524 7491 7458 7603 7545 7473 7606
1190G606m6m5L0L1M4j60N9O0n5n5N0N0n2n2L5L6K2K2J19q6p4p3O7O7j37O7o1J43J55m9nnL3
$$ 7606 7560 7515 7545 7576 7620 7460 7519 7579 7524 7469 7519 7569 7517 7465 7500 7536 7558 7580 7699 7613 7539 7466 7533 7600 7463 7530 7469 7612 7767 7718 7713 7708 7741
1187G741L3k0j9j22j21P5P5L7L7m9J55j1j0K5K6o4o4j01J04j2j1Q1Q1j36O8l4l4L0L0K6K7
$$ 7741 7774 7754 7735 7613 7492 7567 7642 7679 7716 7667 7822 7811 7801 7826 7852 7788 7724 7623 7727 7715 7704 7785 7866 7730 7798 7764 7730 7760 7790 7816 7843
1185G843N6N7l34J43k3k3MMM2M2J73l0k01MN3N2J5J4m4m4o9J34M9j56k8k8ONqpR1j13KLO3
$$ 7843 7899 7956 7622 7765 7742 7719 7723 7727 7769 7811 7984 7954 7753 7757 7810 7862 7877 7891 7847 7803 7734 7868 7917 7761 7733 7705 7711 7716 7708 7701 7792 7679 7681 7684 7747
1181G747O4J2J3M5M5n6n7m9m9N4N3k7k6J43J44n4n4j6j6R4j10j10R4j5j5kjK3K4p8p9N9O0
$$ 7747 7811 7823 7836 7881 7926 7870 7813 7764 7715 7769 7822 7795 7769 7912 8056 8002 7948 7932 7916 8010 7900 7790 7884 7869 7854 7852 7851 7874 7898 7820 7741 7800 7860
1178G860m3m3J1J2K4K4j18Q7K2K3M0M1j76K7l6l7P8P8K3K2M8j55k1J84J4j91j33P1o9J35K3
$$ 7860 7817 7774 7785 7797 7821 7845 7727 7814 7836 7859 7899 7940 7764 7791 7755 7718 7796 7874 7897 7919 7967 7812 7791 7975 7989 7798 7665 7736 7667 7802 7825
1176G825K3L6L5n1n2n1n2J9J9J33p1KKj1j1LLLMNNj09R5K1K2j35j36J12J13n8n8P0P1j08R6
$$ 7825 7848 7884 7919 7868 7816 7765 7713 7732 7751 7884 7813 7815 7817 7806 7795 7798 7801 7804 7808 7813 7818 7709 7804 7825 7847 7712 7576 7688 7801 7743 7685 7755 7826 7718 7814
1172G814M8j56k8k8O6O6j50N3K2K1K2K2Q8j15J14r0j38j38P1P0j7j7nmJ4K19j85j85QPQQm2
$$ 7814 7862 7706 7678 7650 7716 7782 7632 7685 7707 7728 7750 7772 7860 7745 7859 7769 7631 7493 7564 7634 7617 7600 7595 7591 7605 7824 7639 7454 7462 7469 7477 7485 7443
1169G443m2p2J32jkO3O2QPP1P1j17Q8p9p8l4l3l4l4J5J4J4J4l0l1K1K0n2n1k6J77O6j39j39
$$ 7443 7401 7329 7461 7460 7458 7521 7583 7591 7598 7669 7740 7623 7711 7632 7554 7520 7487 7453 7419 7434 7448 7462 7476 7446 7415 7436 7456 7404 7353 7327 7504 7570 7431 7292
1166G292O5J08r6L2L1j19j20J36o9Q9j16L7L8J3J3J2J3j5j5q7q7K6K31L0L1j20j19l5l5m0
$$ 7292 7357 7465 7369 7401 7432 7313 7193 7329 7260 7349 7233 7270 7308 7321 7334 7346 7359 7344 7329 7242 7155 7181 7412 7442 7473 7353 7234 7199 7164 7124
1164G124m0K4K4q5J19MMM1M2j63J77N3j52j30P4j8j9onJ6J7j03j02P6P6p7p7%j%%K8K9j0j0
$$ 7124 7084 7108 7132 7047 7166 7170 7174 7215 7257 7094 7271 7324 7172 7042 7116 7098 7079 7073 7068 7084 7101 6998 6896 6972 7048 6971 6894 6894 6893 6893 6893 6921 6950 6940 6930
1160F930j69L6P3P4l5l5K9j75N1N1m7m7K7K6J4J4R4j09n9J46j13j13kkK4K28p3p4J7J6J7J7
$$ 6930 6761 6797 6870 6944 6909 6874 6903 6728 6779 6830 6783 6736 6763 6789 6803 6817 6911 6802 6743 6889 6776 6663 6661 6659 6683 6911 6838 6764 6781 6797 6814 6831
1158F831NNj36j35J36k05R3R4R5j08m4J59j46N8m5m4k7k6k6k7qql0l0J94j47p5p4K1K1K1K1
$$ 6831 6836 6841 6705 6570 6706 6501 6594 6688 6783 6675 6631 6790 6644 6702 6657 6613 6586 6560 6534 6507 6499 6491 6461 6431 6625 6478 6403 6329 6350 6371 6392 6413
1155F413j19j20%%L8L8k6k5R1j12j12R2MLJ7J6rrqrj7j6j6j6j5j5K62p8j50j50R7j07O0O0
$$ 6413 6294 6174 6174 6174 6212 6250 6224 6199 6290 6178 6066 6158 6162 6165 6182 6198 6189 6180 6172 6163 6146 6130 6114 6098 6083 6068 6330 6252 6102 5952 6049 5942 6002 6062
1152F062l8l8lmM7M7p8p9POP1P0q3q2L0L0k1k1l4l4J7J7k5k5L8j65O4O4J15q9q0q0J42o3o7
$$ 6062 6024 5986 5983 5979 6026 6073 5995 5916 5923 5929 6000 6070 5987 5905 5935 5965 5944 5923 5889 5855 5872 5889 5864 5839 5877 5712 5776 5840 5955 5866 5786 5706 5848 5785 5718
1148E718o7J08J07onn6n7n1n1M6M7j21Q3Q2j21J2J1j03J01r8J06qrJ2j92noJ25q0L5L4q3q3
$$ 5718 5651 5759 5866 5860 5855 5799 5742 5691 5640 5686 5733 5612 5695 5777 5656 5668 5679 5576 5677 5579 5685 5677 5668 5680 5488 5483 5477 5602 5522 5557 5591 5508 5425
1145E425KKj6j7o8o7QQJ22q1L0L0j95QJ91j4J23q2j27P7J3J4j37O8Q0j24j82K2J16J16j28
$$ 5425 5427 5429 5413 5396 5328 5261 5269 5277 5399 5318 5348 5378 5183 5191 5382 5368 5491 5409 5282 5359 5372 5386 5249 5317 5397 5273 5091 5113 5229 5345 5217
1143E217j28qrm2m1J32J33l5k40J6J6J06r7O0j44p7J28n0n1K9L0m3m2k3J82j9j8n8n7n8n7
$$ 5217 5089 5081 5072 5030 4989 5121 5254 5219 4979 4995 5011 5117 5020 5080 4936 4859 4987 4937 4886 4915 4945 4902 4860 4837 5019 5000 4982 4924 4867 4809 4752
1140D752N4N4LLQQL8j66L8L8n9o0K5K4k6k7M5M4P5j30m1m1n4n4N0M9kkn2n2jjk5k6n5J49l0
$$ 4752 4806 4860 4863 4866 4874 4882 4920 4754 4792 4830 4771 4711 4736 4760 4734 4707 4752 4796 4871 4741 4700 4659 4605 4551 4601 4650 4648 4646 4594 4542 4541 4540 4515 4489 4434 4583 4553
1136D553l0nmj81K3K7K8J2J2J2J2poPPj17Q8k7k7m4m4J98J98l1k36j84J9k5k5m1J62p0p0J09
$$ 4553 4523 4518 4514 4333 4356 4383 4411 4423 4435 4447 4459 4452 4446 4453 4460 4343 4431 4404 4377 4333 4289 4487 4685 4654 4418 4234 4253 4228 4203 4162 4324 4254 4184 4293
1133D293r6l4l5m8m7N0N0l5l5l6l6KK06q6q7J13J14n9n9L9L9r0J15l9l8r4J10j7j7O9j36J07
$$ 4293 4197 4163 4128 4080 4033 4083 4133 4098 4063 4027 3991 3993 4199 4113 4026 4139 4253 4194 4135 4174 4213 4123 4238 4199 4161 4067 4177 4160 4143 4212 4076 4183
1130D183r7r4J10j7j8o6o6j5j6PPl1l1o1J43k3k3M3M3q9q8N9j45K0K1P6P6p7p7J04J04j6j5
$$ 4183 4086 3992 4102 4085 4067 4001 3935 3920 3904 3911 3918 3887 3856 3795 3938 3915 3892 3935 3978 3889 3801 3860 3715 3735 3756 3832 3908 3831 3754 3858 3962 3946 3931
1127C931j02j03J32p3k1k1j19j19O1O1l7l7J03j00J4J4QQK0K1k09mJ82k1L8L8K5K6j17j17
$$ 3931 3829 3726 3858 3785 3764 3743 3624 3505 3566 3627 3590 3553 3656 3556 3570 3584 3592 3600 3620 3641 3432 3428 3610 3589 3627 3665 3690 3716 3599 3482
1125C482N7N8Q0j23M3M2n3n3n3n4j5j6L5L5QRN9O0j2j2j1j2J4J4k5k4q3J21j9k23j19Q6Rj95
$$ 3482 3539 3597 3677 3554 3597 3639 3586 3533 3480 3426 3411 3395 3430 3465 3473 3482 3541 3601 3589 3577 3566 3554 3568 3582 3557 3533 3450 3571 3552 3329 3210 3296 3305 3110
1122C110J94j0PPK0K0P1P1o6o5PPP0j35n0J54j06j06k1k1R6j07K1K0j06R8N9j44j01J04O1
$$ 3110 3304 3294 3301 3308 3328 3348 3419 3490 3424 3359 3366 3373 3443 3308 3258 3412 3306 3200 3179 3158 3254 3147 3168 3188 3082 3180 3239 3095 2994 3098 3159
1119C159O0o3o3n1n1J1K15n3n2M6M6j88J6L7L7j16Q8M8M9J0J0k4k5j39O5J25J25m9m8j0ro0
$$ 3159 3219 3156 3093 3042 2991 3002 3217 3164 3112 3158 3204 3016 3032 3069 3106 2990 3078 3126 3175 3185 3195 3171 3146 3007 3072 3197 3322 3273 3225 3215 3206 3146
1116C146o0NNL4j69L2L2L2L3k33k8K60N7p4p4j16Q8O1O1j04R9P5j30J13r1l9l9o1J44ok09
$$ 3146 3086 3091 3096 3130 2961 2993 3025 3057 3090 2857 2829 3089 3146 3072 2998 2882 2970 3031 3092 2988 3087 3162 3032 3145 3054 3015 2976 2915 3059 3053 2844
1113B844L7L8l1l1K0K0O9O9q5q4p6p6RRO9O9n1n0N2N2q0q0J65l8j24j24J98oj24P9KKJ5J6
$$ 2844 2881 2919 2888 2857 2877 2897 2966 3035 2950 2866 2790 2714 2723 2732 2801 2870 2819 2769 2821 2873 2793 2713 2878 2840 2716 2592 2790 2784 2660 2739 2741 2743 2758 2774
1110B774l7l7J4J4NOj61M4K3K2M4j60m0J65m8m8mnj19Q5o2o3KJM0M1j0j1L2L2J08r5k15j1
$$ 2774 2737 2700 2714 2728 2733 2739 2578 2622 2645 2667 2711 2551 2511 2676 2628 2580 2576 2571 2452 2537 2475 2412 2414 2415 2455 2496 2486 2475 2507 2539 2647 2552 2337 2326
1107B326Q3Q3j7j7O8O8jjj16Q8L5L4l7l8p4p5J46J47p2p1j23j22K5K5K5K6M7M8n1n0O4j39
$$ 2326 2409 2492 2475 2458 2526 2594 2593 2592 2476 2564 2599 2633 2596 2558 2484 2409 2555 2702 2630 2559 2436 2314 2339 2364 2389 2415 2462 2510 2459 2409 2473 2334
1104B334p6p6M5M4M4M5l1l0l0l0j7j8o0J44J36o7r3r3O3O3J27p7O9P0p5p5O8j35j27K13j02
$$ 2334 2258 2182 2227 2271 2315 2360 2329 2299 2269 2239 2222 2204 2144 2288 2424 2357 2264 2171 2234 2297 2424 2347 2416 2486 2411 2336 2404 2269 2142 2355 2253
1101B253j01L8L9J41J41o8o7j70L4NNk3k2O3O2K9K9k3k2o9o9J5J6J9J9j9j9p3J30J6J6pqk0
$$ 2253 2152 2190 2229 2370 2511 2443 2376 2206 2240 2245 2250 2227 2205 2268 2330 2359 2388 2365 2343 2274 2205 2220 2236 2255 2274 2255 2236 2163 2293 2309 2325 2318 2310 2290
1098B290k0J55m9j68L7J7J7r0q9k1k1k1k1J4J4J4J4l2l3m5m5J58m6J7J8J2J3%%J08r5m5J59
$$ 2290 2270 2425 2376 2208 2245 2262 2279 2189 2100 2079 2058 2037 2016 2030 2044 2058 2072 2040 2007 1962 1917 2075 2029 2046 2064 2076 2089 2089 2089 2197 2102 2057 2216
1095B216l1l2l1l1M4j60L9M0Q2Q2l7l7L3L4j8j8rrR7k43J4J4j47J93N8N7j42j42K8K8K8K8
$$ 2216 2185 2153 2122 2091 2135 1975 2014 2054 2136 2218 2181 2144 2177 2211 2193 2175 2166 2157 2254 2011 2025 2039 1892 2085 2143 2200 2058 1916 1944 1972 2000 2028
1092B028l1l0l1l1l2l3N2N3m1m0J1J0P3P2j3j3j00j00Q8Q7m1m0P9P8r7r8K2K1O8O8p2p2p0
$$ 2028 1997 1967 1936 1905 1873 1840 1892 1945 1904 1864 1875 1885 1958 2030 2017 2004 1904 1804 1892 1979 1938 1898 1977 2055 1958 1860 1882 1903 1971 2039 1967 1895 1825
1089A825J35o6o6KLk8J77KLj04j04K3K4m0J64J9K0m0m0j45N9QPj50N3N4j51K0K1J27J26k9
$$ 1825 1960 1894 1828 1830 1833 1805 1982 1984 1987 1883 1779 1802 1826 1786 1950 1969 1989 1949 1909 1764 1823 1831 1838 1688 1741 1795 1644 1664 1685 1812 1938 1909
1086A909k9q0q1O6O5m1m1r4J10nnK4K4j5j4j25P9Pj98k4J80N3N2m3m3J57m8jkJ77j63J9J9
$$ 1909 1880 1800 1719 1785 1850 1809 1768 1674 1784 1779 1774 1798 1822 1807 1793 1668 1747 1754 1556 1532 1712 1765 1817 1774 1731 1888 1840 1839 1837 2014 1851 1870 1889
1083A889j17Q7l8l9o4o3j16Q8L7L8j04R9K28j13K5K4LLK3K3k10pMLl4l5O0O0r3r3J6J6J18
$$ 1889 1772 1859 1821 1782 1718 1655 1539 1627 1664 1702 1598 1697 1925 1812 1837 1861 1864 1867 1890 1913 1703 1696 1700 1703 1669 1634 1694 1754 1661 1568 1584 1600 1718
1080A718q7Q3j22L2L2MMJ70l4r8r8QRm4m4O3O2L5j69L1L0k3k2j9J85o4o5L4L3ONJ21q4k4k4
$$ 1718 1631 1714 1592 1624 1656 1660 1664 1834 1800 1702 1604 1612 1621 1577 1533 1596 1658 1693 1524 1555 1585 1562 1540 1521 1706 1642 1577 1611 1644 1650 1655 1776 1692 1668 1644
1077A644P8j26j06j05Q1Q2p6J28J4J3n0n1JJJ4J5J4J4j8j8j8j8J%%%J7J7q9r0m9J54J03j01
$$ 1644 1722 1596 1490 1385 1466 1548 1472 1600 1614 1627 1577 1526 1527 1528 1542 1557 1571 1585 1567 1549 1531 1513 1514 1514 1514 1514 1531 1548 1459 1369 1320 1474 1577 1476
1074A476J8J7o7o7j02J01k6k5P8j25J43J42j9j8j9j9MMm7m7j1j1j39O6J28p5Q1j22rrL0K9
$$ 1476 1494 1511 1444 1377 1275 1376 1350 1325 1403 1278 1421 1563 1544 1526 1507 1488 1492 1496 1449 1402 1391 1380 1241 1307 1435 1360 1441 1319 1310 1301 1331 1360
1071A360P7P7P2j31k9k8m1m2M4M3m2m1l0l0J23J23K4K3j29j29j2j3J88j7J09J09r1r1n9n9
$$ 1360 1437 1514 1586 1455 1426 1398 1357 1315 1359 1402 1360 1319 1289 1259 1382 1505 1529 1552 1423 1294 1282 1269 1457 1440 1549 1658 1567 1476 1417 1358
1068A358K09Nl1l0j28j28N6N7J76j64j53N2o8J37j27P7l8l8J31p4M2M1Q2Q2L1j73j79J62Q
$$ 1358 1567 1572 1541 1511 1383 1255 1311 1368 1544 1380 1227 1279 1211 1348 1221 1298 1260 1222 1353 1279 1321 1362 1444 1526 1557 1384 1205 1367 1375
1066A375RK9L0K6j79l9l9J36J35n1n0L4L4llllPOj93J1J10J09r8r9M8M9l7l7K8K8r0r1J11
$$ 1375 1384 1413 1443 1469 1290 1251 1212 1348 1483 1432 1382 1416 1450 1447 1444 1441 1438 1445 1451 1258 1269 1379 1488 1390 1291 1339 1388 1351 1314 1342 1370 1280 1189 1300
1063A300J11q9q8K23J9J5J4r9j00N3N3n8n7p4J30q4J21q9q8o4J40L8L8j16Q9L8j66K0K1K0
$$ 1300 1411 1322 1234 1457 1476 1491 1505 1406 1306 1359 1412 1354 1297 1223 1353 1269 1390 1301 1213 1149 1289 1327 1365 1249 1338 1376 1210 1230 1251 1271
1060A271K1j00J05o2o1J1J0p5p4J30J31J1J2l5l5O8j37Q8j15j4j3K7K6P8P8q1q1NML8L8m7
$$ 1271 1292 1192 1297 1235 1174 1185 1195 1120 1046 1176 1307 1318 1330 1295 1260 1328 1191 1279 1164 1150 1137 1164 1190 1268 1346 1265 1184 1189 1193 1231 1269 1222
1057A222m7N5N4r8r8MLQ9Q8J3J2o1o0k7J76n7n7MNrqO8j35k1k0J3J3q8q9J34J33l6l6J0J1
$$ 1222 1175 1230 1284 1186 1088 1092 1095 1184 1272 1285 1297 1236 1176 1149 1325 1268 1211 1215 1220 1211 1203 1271 1136 1115 1095 1108 1121 1033 944 1078 1211 1175 1139 1149 1160
1054A160J0J1j7j7j7j7K5K5j03J01M4j61J9J8n8n9N7N6o0J44k3k2k1k1M3j62M1M1k3k3k7k8
$$ 1160 1170 1181 1164 1147 1130 1113 1138 1163 1060 1161 1205 1044 1063 1081 1023 964 1021 1077 1017 1161 1138 1116 1095 1074 1117 955 996 1037 1014 991 964 936
1051I36K8K32j07j07P5P6RJ0j18Q6J23q1n5n5l9m0O3O3j7j6q0J24n1n2l8J65r4J10r4r4O0
$$ 936 964 1196 1089 982 1057 1133 1142 1152 1034 1120 1243 1162 1107 1052 1013 973 1036 1099 1082 1066 986 1110 1059 1007 969 1134 1040 1150 1056 962 1022
1048A022O0mK00r2r3q0q0J33J32l7l7l9l9K5K5j22Q1R4j10j07R6P1P1p9p9k7k8L1L2L1L1J6
$$ 1022 1082 1078 1278 1186 1093 1013 933 1066 1198 1161 1124 1085 1046 1071 1096 974 1055 1149 1039 932 1028 1099 1170 1091 1012 985 957 988 1020 1051 1082 1098
1045A098J5J6J5p1p2L1L0NNm6m6ONO9P0j16Q9Q8j16qqqqq2J23M6M6R8j06j06j06K19J5j20
$$ 1098 1113 1129 1144 1073 1001 1032 1062 1067 1072 1026 980 986 991 1060 1130 1014 1103 1191 1075 1067 1059 1051 1043 961 1084 1130 1176 1274 1168 1062 956 1175 1190 1070
1042A070j21R8j06O0O0llM8M8J5J5l7l6mnmnm4m4m4m3K5K5Q9j15N5N6o0n9l7l7O5O5K5K5J40
$$ 1070 949 1047 941 1001 1061 1058 1055 1103 1151 1166 1181 1144 1108 1104 1099 1095 1090 1046 1002 958 915 940 965 1054 939 994 1050 990 931 894 857 922 987 1012 1037 1177
1039A177o5M5M5M6j59m9m8J17q7j54M9P1P0J70j71N8N9Q1j23qqk07k07J67J67j10j11P3P2
$$ 1177 1112 1157 1202 1248 1089 1040 992 1109 1022 868 917 988 1058 1228 1057 1115 1174 1255 1132 1124 1116 909 702 869 1036 926 815 888 960
1036I60j19Q5L4L4o0J43K9K9m3m3m3m3mmn5n4J35J35j04j03N0N0jjL4L5o8o7q1q0R0Q9k8k9
$$ 960 841 926 960 994 934 1077 1106 1135 1092 1049 1006 963 959 955 900 846 981 1116 1012 909 959 1009 1008 1007 1041 1076 1008 941 860 780 870 959 931 902
1033I02K3K2P4P5r6r5K7K7K7K7M6M5p0o9J06r7l4l4L0L0p2p2N5N6j10R4n6n6J61m3J08r7N
$$ 902 925 947 1021 1096 1000 905 932 959 986 1013 1059 1104 1034 965 1071 974 940 906 936 966 894 822 877 933 823 917 861 805 966 923 1031 934 939
1030I39Ok7k6k7k6j3j2R0j15J38o7L5L6j3j2o3o3P8P8j39O6J0J0K3K3L9M0l08L1m7J56N1N0
$$ 939 945 918 892 865 839 826 814 904 789 927 860 895 931 918 906 843 780 858 936 797 863 873 883 906 929 968 1008 700 731 684 840 891 941
1027I41M8j57O0O0nnn5n6M6M6P2j32n5J49k9l0Q6Q5j6j7RRm2m2J6J6MLJ05r9q6q6N2N2Q6j18
$$ 941 989 832 892 952 947 942 887 831 877 923 995 863 808 957 928 898 984 1069 1053 1036 1045 1054 1012 970 986 1002 1006 1009 1114 1015 929 843 895 947 1033 915
1024I15k30J10RQL2L2L1L2k9k9P3P2o1o1M1M1m4m4P0P1k33k9K6K6k1k0k0k0L3L3M5M6j50N3
$$ 915 685 795 804 812 844 876 907 939 910 881 954 1026 965 904 945 986 942 898 968 1039 806 777 803 829 808 788 768 748 781 814 859 905 755 808
1021H08m9m8p6J29O5O6q4q4Q6Q7OPOPmmJ11r4j4j5k8k7m3m3N9N9M9M9J1J2j61M3J59m6k98
$$ 808 759 711 635 764 829 895 811 727 813 900 906 913 919 926 922 918 1029 935 921 906 878 851 808 765 824 883 932 981 992 1004 843 886 1045 999 701
1018G01r3J99mk9l0O0O0OONOk8k9q0p9N1N1j32j31J58m5J84J84k50m5P7P8o9o9M5M6l6J69
$$ 701 608 807 803 774 744 804 864 870 876 881 887 859 830 750 671 722 773 641 510 668 623 807 991 741 696 773 851 782 713 758 804 768 937
1015I37m8m8n8n8M4M4j4j3j4j3r3r2RJ0J30J31q6J18j39j39K26K3n8n7j9j9K7K8K8K8L0L1
$$ 937 889 841 783 725 769 813 799 786 772 759 666 574 583 593 723 854 768 886 747 608 834 857 799 742 723 704 731 759 787 815 845 876
1012H76L1L1mlj06R8j38O7l6l6N2N2O5j39n8n7R5j08O8O8m6m7KJJ16q8J8J7J84j57J09r4j17
$$ 876 907 938 934 931 825 923 785 852 816 780 832 884 949 810 752 695 790 682 750 818 772 725 727 728 844 756 774 791 975 818 927 833 716
1009G16Q8q2q3K0J9J18q7J43o2r6r6J76k9Q4Q3j00r9K8K8P9j25J25p8M5M5j82J57r7J06Q0
$$ 716 804 722 639 659 678 796 709 852 790 694 598 774 745 829 912 812 713 741 769 848 723 848 770 815 860 678 835 738 844 924
1006I24Q0p7p7j0j0rj0p8p8L7L7p8J26J1J1k4k5O6O5L2j73J09r6n4n5L5L5O8O7l4l5j7j6m
$$ 924 1004 927 850 840 830 821 811 733 655 692 729 651 777 788 799 775 750 816 881 913 740 849 753 699 644 679 714 782 849 815 780 763 747 743
1003G43mn8J45m1m2K34j06q5q5l4l4O8O8K0J9j9j9j45N9mnJ08J08o2o3R6R6opo4o5j4j4J4
$$ 743 739 681 826 785 743 977 871 786 701 667 633 701 769 789 808 789 770 625 684 680 675 783 891 829 766 862 958 952 945 881 816 802 788 802
1000H02J4K7K7r7J06qqj9j9j9j9PPj09R6K4K4p8J26q3q3k0j9Q8Q8j4j4KKm9m9%JN1N1qqj23
$$ 802 816 843 870 773 879 871 863 844 825 806 787 794 801 692 788 812 836 758 884 801 718 698 679 767 855 841 827 829 831 782 733 733 734 785 836 828 820 697
996F97Q1J22J22j04j03J1J1J1J1L1L0p2p2J8J7L0L1j52N3N3N3j7J86r8r8J2J3j03j02J76k8
$$ 697 778 900 1022 918 815 826 837 848 859 890 920 848 776 794 811 841 872 720 773 826 879 862 1048 950 852 864 877 774 672 848 820
994H20j6j5NNJ19q4l4l3N6N6RJ0J0RM3M2j23Q1p2p1J11J11N5N4N5N5k0j9k0k0m2m2m2m2o4
$$ 820 804 789 794 799 918 834 800 767 823 879 888 898 908 917 960 1002 879 960 888 817 928 1039 1094 1148 1203 1258 1238 1219 1199 1179 1137 1095 1053 1011 947
990I47o5j4j4O1O0m1m2L5L4R8R8j00J05m4J59J98j43j94J47q2k87j63M2J26J26l1l1MLm8m8
$$ 947 882 868 854 915 975 934 892 927 961 1059 1157 1057 1162 1118 1277 1475 1332 1138 1285 1203 916 753 795 921 1047 1016 985 989 992 944 896
988H96N7N7j08R5M8M8O0j44J24q1l0l0L2L1j34P0j21j21O1O2RJ0r3r3J04J04j81K3rrMMN8
$$ 896 953 1010 902 997 1045 1093 1153 1009 1133 1052 1022 992 1024 1055 921 991 870 749 810 872 881 891 798 705 809 913 732 755 746 737 741 745 803
985H03N8m3m4K3K3k8k8j5j4Q7Q8KLj76K7J23q3o9o9J90j4j4j4Q3j20L2L2R3j11J19q6o4o4
$$ 803 861 818 774 797 820 792 764 749 735 822 910 912 915 739 766 889 806 737 668 858 844 830 816 899 779 811 843 936 825 944 858 794 730
982G30K6K5JJJ16q8k6k5J3J2m1m1M7M8L4j70M6M7K1K1l0l0P3P3K1K2n7n7n7n7Q0P9L7j67p
$$ 730 756 781 782 783 899 811 785 760 773 785 744 703 750 798 832 662 708 755 776 797 767 737 810 883 904 926 869 812 755 698 778 857 894 727 720
978G20J98OOk1k24O1O0p6p7K6K5o1o2M0M1N6N6j09R5QQK1K1o6o5K4K4J02j02J3J3LMLLJ1J0
$$ 720 918 924 930 909 685 746 806 730 653 679 704 643 581 621 662 718 774 665 760 768 776 797 818 752 687 711 735 837 735 748 761 764 768 771 774 785 795
975G95m0m1q8q9Q2Q2K9L0p3p2KKj1j1R9j05kK01n5n5RRJKJKMNNMppppJ2J2J27p7n9n8p1J32
$$ 795 755 714 626 537 619 701 730 760 687 615 617 619 608 597 696 591 589 790 735 680 689 698 699 701 702 704 708 713 718 722 715 708 701 694 706 718 845 768 709 651 580 712
971G12r4J09PQl1l0m3m3J60m5J22J22j01j00JKp1p0M4M4m4J60j98J43l2l3k4k4N2j52J33J33
$$ 712 618 727 734 742 711 681 638 595 755 710 832 954 853 753 754 756 685 615 659 703 659 819 621 764 732 699 675 651 703 551 684 817
968H17NOj10R5K6K6O5j39j78K6O9O9j3j3k6k5J39o5jkp5p5j9J84mmRRk1k1k1k1L0L0p2p2k7
$$ 817 822 828 718 813 839 865 930 791 613 639 708 777 764 751 725 700 839 774 773 771 696 621 602 786 782 778 787 796 775 754 733 712 742 772 700 628 601
965F01k8P5P5N0N0j19j20L8L9P6P7M3j62j10R3J6J6K8K8K3K4o7o6j9J84l2l2o5o5o5o6M7M6
$$ 601 573 648 723 773 823 704 584 622 661 737 814 857 695 585 678 694 710 738 766 789 813 746 680 661 845 813 781 716 651 586 520 567 613
962F13nnP8P8P8P8j23j23O4O4j20j21P9P9j55M9J25k14L9M0q4J20p0J34L2L2p1p1p1p1Q7Q7
$$ 613 608 603 681 759 837 915 792 669 733 797 677 556 635 714 559 608 733 519 558 598 514 634 564 698 730 762 691 620 549 478 565 652
959F52JKj0j0j0rL0L1L0L1m2m2P3j31L0K9J7J7p9p8Q7j17LLP5P6k4k3K8K7J7J6J7J6j5j5j6
$$ 652 653 655 645 635 625 616 646 677 707 738 696 654 727 596 626 655 672 689 610 532 619 502 505 508 583 659 635 612 640 667 684 700 717 733 718 703 687
956F87j5M1M1j12j12K4K4J38o5kkL6L6o2o3r2J11l7l7R4R4k2k3q6J18k0k0M4M5L4L4lmr0J15
$$ 687 672 713 754 642 530 554 578 716 651 649 647 683 719 657 594 502 613 576 539 633 727 705 682 596 714 694 674 718 763 797 831 828 824 734 849
952H49j%k2k1p3p2J8J8NNR7j07PQm1m0J59m4O9O9r7r7m5m6J21q4N7N8M5M4j04j04k0j9N4N4
$$ 849 848 848 826 805 732 660 678 696 701 706 803 696 703 711 670 630 789 745 814 883 786 689 644 598 719 635 692 750 795 839 735 631 611 592 646 700
949G00l1l1N5N4LLm7m8K4K5K04Jk08mj34P1K6K5O1J64J2j92j23Q2Q1j23O3K67p7K5k7j28j16
$$ 700 669 638 693 747 750 753 706 658 682 707 911 912 704 700 566 637 663 688 749 913 925 733 610 692 773 650 713 980 903 928 901 773 657
946F57j15M4M4M4M5PPO4O5j46m4J26p8r2j94n1K88jjO5l7M8j55P2P3k5k5N9O0J1J0J0J0m7
$$ 657 542 586 630 674 719 726 733 797 862 716 672 798 720 628 434 383 671 670 669 734 697 745 590 662 735 710 685 744 804 815 825 835 845 798
943G98m6MNkkq7q6N9O0N9O0q2q2l0l1m1m0Q1k2p9J26MMQRQQl3l3Q6Q6m0m1l3l4N6J58nk09
$$ 798 752 756 761 759 757 670 584 643 703 762 822 740 658 628 597 556 516 597 575 496 622 626 630 638 647 655 663 630 597 683 769 729 688 655 621 677 835 830 621
940F21j7j6L5L4r7J07M9n2l0l0n0J55NNl3l3M5M4n7n7k2k2k2k2k3k2R2R3j00J04o2o1jjj03
$$ 621 604 588 623 657 560 667 716 664 634 604 554 709 714 719 686 653 698 742 685 628 606 584 562 540 517 495 587 680 580 684 622 561 560 559 456
936D56j04P5P4k7k8J34J33l6l6L1L2j38j39Q6Q5mmj74L0R9R8m4J61n6n6J1J1k7k7n7J48L2
$$ 456 352 427 501 474 446 580 713 677 641 672 704 566 427 513 598 594 590 416 446 545 643 599 760 704 648 659 670 643 616 559 707 739
934G39L3o8o8o9o8N7N6j47J93Q4j20j75J65k3k3j4J89j18j19J23q0j99Oo7J37O9O9k0k0nn
$$ 739 772 704 636 567 499 556 612 465 658 742 622 447 612 589 566 552 741 623 504 627 547 348 354 287 424 493 562 542 522 517 512
931E12J09J10j52N2L9M0l3l3j48N6L6L7J00R9o5o6L6L6p9p8l7J68P1j34n8n7n2n2J43o0J60
$$ 512 621 731 579 631 670 710 677 644 496 552 588 625 725 824 759 693 729 765 686 608 571 739 810 676 618 561 509 457 600 540 700
928G00j81j4J90R5R5o2o2llm1m1q9J15J%R6R7p4p4n4n5J15J16r5r4PQpqpqk1k2Q1Q1J6J7J7
$$ 700 519 505 695 790 885 823 761 758 755 714 673 584 699 700 700 796 893 819 745 691 636 751 867 772 678 685 693 686 678 671 663 642 620 701 782 798 815 832
924H32J7J0RK3j82P4P3m1m2M7M6M7M6m8m9r9r9J18J18J6J7j6j6p9J24o1o0N4N4n1n1L0K9J39
$$ 832 849 859 868 891 709 783 856 815 773 820 866 913 959 911 862 763 664 782 900 916 933 917 901 822 946 885 825 879 933 882 831 861 890 1029
921A029k01j00r9j4J90k7k7j8j7Q5Q5K9L0p3p2M4M3n8n9r3r3J91j3oop0p1P0O9m6m6J09r6
$$ 1029 828 728 629 615 805 778 751 733 716 801 886 915 945 872 800 844 887 829 770 677 584 775 762 756 750 680 609 679 748 702 656 765 669
918F69J33p0%%P6P6k9k33j18Q6j04J01jkQ8Q7j29P5N3N3j03j04J3J3J3J3L5L6q0J25OOo6o7
$$ 669 802 732 732 732 808 884 855 622 504 590 486 587 586 584 672 759 630 705 758 811 708 604 617 630 643 656 691 727 647 772 778 784 718 651
915F51QPPPnmJ10r4l3l4NNK0K0L3L2p1J32J33p2M7M6k42R7j00j00k8k8M2M3p2J33KKJ6J5k1
$$ 651 659 666 673 680 675 671 781 687 654 620 625 630 650 670 703 735 664 796 929 857 904 950 708 805 705 605 577 549 591 634 562 695 697 699 715 730 709
912G09k0R8R8r8r8J36o9p7p8O3O3L9M0j2j2j33j34K79o1KLooj32P3m2m2N2N1J%m4m5J08J09
$$ 709 689 787 885 787 689 825 756 679 601 664 727 766 806 794 782 649 515 794 733 735 738 732 726 594 667 625 583 635 686 687 687 643 598 706 815
909H15m3m2QRp9p8P4P4m8m7o1o1K27K2q5q4M0M0M1M0k5k5l8l8J03j02K6K6r2J13lkK3K3k8
$$ 815 772 730 738 747 668 590 664 738 690 643 582 521 748 770 685 601 641 681 722 762 737 712 674 636 739 637 663 689 597 710 707 705 728 751 723
906G23k8l2l2J22J21j09j08J68J68P1j33o9o9j7j7j7j7R5R5k4k4k2k1R3j11n4n3N3N3QRj20
$$ 723 695 663 631 753 874 765 657 825 993 1064 931 862 793 776 759 742 725 820 915 891 867 845 824 917 806 752 699 752 805 813 822 702
903G02Q5R9j06k9k9l5l4J6J7l1l0P6P5R6j08PPM9M8l6l6J22J23k82p8M3M2R8j06j72L2J72
$$ 702 787 886 780 751 722 687 653 669 686 655 625 701 776 872 764 771 778 827 875 839 803 925 1048 766 688 731 773 871 765 593 625 797
900G97J72k12ql7l7M4M4j21Q3L3L3M6M6ooN7j46M4M5o7o6Kk02O5O6R8R8J3J3j21j21kkk0k0
$$ 797 969 757 749 712 675 719 763 642 725 758 791 837 883 877 871 928 782 826 871 804 738 740 538 603 669 767 865 878 891 770 649 647 645 625 605
897F05L2L1K7K7P8P8o3o4j3j2m4m3P1j32P0P1j5j5o4J39J31J31l2k35j5j4J60m4J9K0O4O4
$$ 605 637 668 695 722 800 878 815 751 738 726 682 639 710 578 648 719 704 689 625 764 895 1026 994 759 744 730 890 846 865 885 949 1013
894A013n5n5j04j04j13R2K01mlk08j52N1P8P7j9j8L3L2PQN8N8J5J6P9j24n2n1k6J78m8m9j51
$$ 1013 958 903 799 695 582 674 875 871 868 660 508 559 637 714 695 677 710 742 749 757 815 873 888 904 983 859 807 756 730 908 860 811 660
891F60N4N8N9j4j3%JN2N2j9j8K0K0O3j40O0N9l0k9L4L4j53N1Q9Q9mmn6n5Q2Q2p1p1J01J00
$$ 660 714 772 831 817 804 804 805 857 909 890 872 892 912 975 835 895 954 924 895 929 963 810 861 950 1039 1035 1031 975 920 1002 1084 1013 942 1043 1143
887A143M9M9J03J03J03J02J13J12J13J12J57J57J58J57K04K04Q5Q4N6N5p7p7J41o4j36j37
$$ 1143 1192 1241 1344 1447 1550 1652 1765 1877 1990 2102 2259 2416 2574 2731 2935 3139 3224 3308 3364 3419 3342 3265 3406 3342 3206 3069
885C069j42j41j93j93j38j38l16j12l0k34j57j57L1L0n4n4k8k7k8k8k9k8J24J24j20j20J01
$$ 3069 2927 2786 2593 2400 2262 2124 1808 1696 1666 1432 1275 1118 1149 1179 1125 1071 1043 1016 988 960 931 903 1027 1151 1031 911 1012
883A012J01O0O1j27j26K3K4N3j51J7J7r3r4J38o5l7l6J23J22j8j8q6J17rj0Q2j21pok8k7j5
$$ 1012 1113 1173 1234 1107 981 1004 1028 1081 930 947 964 871 777 915 850 813 777 900 1022 1004 986 900 1017 1008 998 1080 959 952 946 918 891 876
880H76j5p0J34Q3Q3o3J41m5m6j32P3M2M3n9n8n9n8n5n5MK08Q1j22m7m6PPj08R6qrqqJ49n5
$$ 876 861 791 925 1008 1091 1028 1169 1124 1078 946 1019 1061 1104 1045 987 928 870 815 760 764 972 1053 931 884 838 845 852 744 840 832 823 815 807 956 901
877I01N9O0n0n0m9n0K5K4k6k6MNM3M3J24q1k9k9J51n3k3k3O0O0mmK3j82P3P4P1j33m7J56k7
$$ 901 960 1020 970 920 871 821 846 870 844 818 822 827 870 913 1037 956 927 898 1049 996 973 950 1010 1070 1066 1062 1085 903 976 1050 1121 988 941 1097 1070
873A070k7J6j89J58J58j10j09O4O5o7o7J69l5p4p3K2K2k8k9O7O7l9k44l2l3P3P4J4J4l7l7
$$ 1070 1043 1059 870 1028 1186 1076 967 1031 1096 1029 962 1131 1096 1022 949 971 993 965 936 1003 1070 1031 787 755 722 795 869 883 897 860 823
871H23Q7Q6l2l2j1j0p4J30j9k0ONr9J05j1j0o1o1J55m9o7o8Q9R0J07J07NNj2j2L9L9o1o1r
$$ 823 910 996 964 932 921 911 837 967 948 928 934 939 840 945 934 924 863 802 957 908 841 773 862 952 1059 1166 1171 1176 1164 1152 1191 1230 1169 1108 1099
867A099j0l4l3O9O8m9m9n0m9L7L7o6o5R0R0J54n0L7L6k6k7r8r9K6K29j26j26j1j1L8L9j3j3
$$ 1099 1089 1055 1022 1091 1159 1110 1061 1011 962 999 1036 970 905 995 1085 1239 1189 1226 1262 1236 1209 1111 1012 1038 1267 1141 1015 1004 993 1031 1070 1057 1044
864A044l4l3r7J08m1m1K4K3L6L6p9J25lkJ0J0K2K2q0q0L6L6j43O1J05r9p4p4J9J9OK10qqJ8
$$ 1044 1010 977 880 988 947 906 930 953 989 1025 946 1071 1068 1066 1076 1086 1108 1130 1050 970 1006 1042 899 960 1065 966 892 818 837 856 862 1072 1064 1056 1074
861A074J8p4J30Q0P9j06R7K68O3q5q4m3J62r3r3L4j69L1L1J8J9q8q8J4J4j36j36o8J36l8J66
$$ 1074 1092 1018 1148 1228 1307 1201 1298 1566 1629 1544 1460 1417 1579 1486 1393 1427 1258 1289 1320 1338 1357 1269 1181 1195 1209 1073 937 869 1005 967 1133
858A133P6j27n2n3L8L7o5o5L7L8j8j8j07j07l0J73N9N9L3L3L4L3o6o5J51n3M3M2k1k1qrMN
$$ 1133 1209 1082 1030 977 1015 1052 987 922 959 997 979 961 854 747 717 890 949 1008 1041 1074 1108 1141 1075 1010 1161 1108 1151 1193 1172 1151 1143 1134 1138 1143
855A143j07R7L3L3p2p2J45n9L5L5p9q0R0R1j2j2m2m1O0O0K9K8p3p4ONONjkK40j00J22J22j84
$$ 1143 1036 1133 1166 1199 1127 1055 1200 1141 1176 1211 1132 1052 1142 1233 1221 1209 1167 1126 1186 1246 1275 1303 1230 1156 1162 1167 1173 1178 1177 1175 1415 1315 1437 1559 1375
852A375K0k4k5K6K6J82k3R2R1n5n6J14J14N3N3N3N3J84J84J46J45K11M15J09r5r1r1m0k44
$$ 1375 1395 1371 1346 1372 1398 1580 1557 1649 1740 1685 1629 1743 1857 1910 1963 2016 2069 2253 2437 2583 2728 2939 3354 3463 3368 3277 3186 3146 2902
849B902j01j00j1j2O9O8k0k1j21Q4P0P1J81J81K37M40L17L17J26p8j21l24m48m49l27j23j15
$$ 2902 2801 2701 2690 2678 2747 2815 2795 2774 2653 2737 2807 2878 3059 3240 3477 3917 4234 4551 4677 4599 4478 4154 3706 3257 2930 2807 2692
847B692Q9%%J3J2J42J41J41J41K02K02L72L72N57N57J87J87k33m37n77n78n38n38l29j26l9
$$ 2692 2781 2781 2781 2794 2806 2948 3089 3230 3371 3573 3775 4147 4519 5076 5633 5820 6007 5774 5337 4760 4182 3644 3106 2777 2651 2612
845B612m0m4J61p0J34L2L2K42K43L57J53L04L05K74P0j62l67l49l50l46l46l08j04k1k1r4
$$ 2612 2572 2528 2689 2619 2753 2785 2817 3059 3302 3659 3812 4116 4421 4695 4765 4603 4236 3887 3537 3191 2845 2537 2433 2412 2391 2297
842B297r3O5O5j34O9J25J24N3N2J28J28J58J58J8l22j32j31j51j51j52j51M0M0j13j13J9K0
$$ 2297 2204 2269 2334 2200 2269 2394 2518 2571 2623 2751 2879 3037 3195 3213 2891 2759 2628 2477 2326 2174 2023 2063 2103 1990 1877 1896 1916
840A916o6o5kjkkK3K4K3K3o6o5j4j4l3l4m6m6R4j10j10R4l4l3M3j62N0M9L6L7RJ0J29J28q2
$$ 1916 1850 1785 1783 1782 1780 1778 1801 1825 1848 1871 1805 1740 1726 1712 1679 1645 1599 1553 1647 1537 1427 1521 1487 1454 1497 1335 1385 1434 1470 1507 1516 1526 1655 1783 1701
837A701q2j45N8p5p6o2o3j7j7L4L4J7J6M7j58M4M3L1L0R9R9qpj25P8j21j21J0J0Nj98o5o5
$$ 1701 1619 1474 1532 1457 1381 1319 1256 1239 1222 1256 1290 1307 1323 1370 1212 1256 1299 1330 1360 1459 1558 1550 1543 1418 1496 1375 1254 1264 1274 1279 1081 1016 951
834I51nnJ20q4q8q8P9P8POp4J30KLQ6j18J12r2M2M1M2M2k52m7J05r8N8N9QPm8J55M1M1Q3Q4
$$ 951 946 941 1061 977 889 801 880 958 965 971 897 1027 1029 1032 1118 1000 1112 1020 1062 1103 1145 1187 935 888 993 895 953 1012 1020 1027 979 1134 1175 1216 1299 1383
830A383j16Q8k9k9k9k9J34p0N4j51q1J24j19Q6l7l7K7K7P5P5l1l1qJ96L0L0J6J7J6J7L2L3
$$ 1383 1267 1355 1326 1297 1268 1239 1373 1303 1357 1206 1125 1249 1130 1216 1179 1142 1169 1196 1271 1346 1315 1284 1276 1472 1502 1532 1548 1565 1581 1598 1630 1663
828A663n2n3j9k0J81k4l0l0RQq3q3J64m1K01j39lK00K56N2j43j44Q5Q5J58j83j17j17J5J5
$$ 1663 1611 1558 1539 1519 1700 1676 1646 1616 1625 1633 1550 1467 1631 1590 1791 1652 1649 1849 2105 2157 2014 1870 1955 2040 2198 2015 1898 1781 1796 1811
825A811l8l8l3J70k5k4K6K6J03j00Q6Q7O6j37j38O7o2o2KLKKKKJ17J18k06kl0J74P1P2J7J6
$$ 1811 1773 1735 1702 1872 1847 1823 1849 1875 1978 1878 1964 2051 2117 1980 1842 1909 1847 1785 1787 1790 1792 1794 1796 1798 1915 2033 1827 1825 1795 1969 2040 2112 2129 2145
822B145K08j33K3K3o2o3pk11j1J92r5J09ooJ29p4R1R1J2J1R7R6m9n0J16J17j21Q3j46N8j45
$$ 2145 2353 2220 2243 2266 2204 2141 2134 1923 1912 2104 2009 2118 2112 2106 2235 2161 2252 2343 2355 2366 2463 2559 2510 2460 2576 2693 2572 2655 2509 2567 2422
819B422j44l4l4k6J79Q5Q5j33K08Q9k51P9P9J09J09l2l2J8J9l7l6j65M0N1j53k17J23M9M9
$$ 2422 2278 2244 2210 2184 2363 2448 2533 2400 2608 2697 2446 2525 2604 2713 2822 2790 2758 2776 2795 2758 2722 2557 2597 2648 2495 2278 2401 2450 2499
816B499J21J21P2P2J36o8q8q9J20J20p4p3p4p4K6K7K6K6q6q5J82k1j9j8l1l2K3K4J37o6j5
$$ 2499 2620 2741 2813 2885 3021 2953 2865 2776 2896 3016 2942 2869 2795 2721 2747 2774 2800 2826 2740 2655 2837 2816 2797 2779 2748 2716 2739 2763 2900 2834 2819
813B819j5L6j69M4M3k1k0L6L5L6L6J6J6K1l20m8m7N0N0K9K9J6J6K09Mj02j02m0m0M5M5k8k7
$$ 2819 2804 2840 2671 2715 2758 2737 2717 2753 2788 2824 2860 2876 2892 2913 2593 2545 2498 2548 2598 2627 2656 2672 2688 2897 2901 2799 2697 2657 2617 2662 2707 2679 2652
810B652K3K4M4M3p5p5m0m0k8k7M0K45k3k3M8M8M3j60J9K0o6o6J7K20M1M2J4j90p5p5p2p2J28
$$ 2652 2675 2699 2743 2786 2711 2636 2596 2556 2528 2501 2541 2786 2763 2740 2788 2836 2879 2719 2738 2758 2692 2626 2643 2863 2904 2946 2960 2770 2695 2620 2548 2476 2604
807B604J28K7K31J93j1j36O9J32k08j2j1L9M0J89j5j12R1O9j36j75L0jjK5K5l8J67J92j48
$$ 2604 2732 2759 2990 3183 3172 3036 3105 3237 3029 3017 3006 3045 3085 3274 3259 3147 3238 3307 3171 2996 3026 3025 3024 3049 3074 3036 3203 3395 3247
805C247N2N2M4M3p5J28r3r2j7J87N9N9R1j14j35P0L03l7n4n4K5K6l8J66P0P0L2L2m4m4N4N4
$$ 3247 3299 3351 3395 3438 3363 3491 3398 3306 3289 3476 3535 3594 3685 3571 3436 3506 3809 3772 3718 3664 3689 3715 3677 3843 3913 3983 4015 4047 4003 3959 4013 4067
802D067K50r0j3J91KKN4N3Q4j20Q0P9J02J01j8j8J7J6K93m8P1P1J35J35R5R6L37kJ10J11K59
$$ 4067 4317 4227 4214 4405 4407 4409 4463 4516 4600 4480 4560 4639 4741 4842 4824 4806 4823 4839 5132 5084 5155 5226 5361 5496 5591 5687 6024 6022 6132 6243 6502
799F502K59J75J75M13M13L61L61O12O12Q37J042J241J445J348J145M21K18J87N28O30O30K77
$$ 6502 6761 6936 7111 7524 7937 8298 8659 9271 9883 10720 11762 13003 14448 15796 16941 17362 17580 17767 18295 18925 19555 19832
797A9832K77M00O04J153J153P49Jp96j681k140k343k080j604r24p19o85l44k1k26j65L8L4
$$ 19832 20109 20509 21113 22266 23419 24168 24169 23373 21692 19552 17209 15129 13525 12601 11882 11197 10853 10832 10606 10441 10479 10513
795A0513K38J43J44K57K58L09L09M92M92L17N22N90N89P94R98R97R98J171J374J523J999K340
$$ 10513 10751 10894 11038 11295 11553 11862 12171 12663 13155 13472 13994 14584 15173 15967 16965 17962 18960 20131 21505 23028 25027 27367
793B7367K680K926K722K519K315K605L352M152M628L922K222m18l342n171n646m767l610k335
$$ 27367 30047 32973 35695 38214 40529 43134 46486 50638 55266 59188 61410 60992 57650 52479 46833 42066 38456 36121
791C6121j178m89L96R23J536K084K696K764K764K681K681L013L762M662N275M841L141M38
$$ 36121 34943 34454 34850 35773 37309 39393 42089 44853 47617 50298 52979 55992 59754 64416 69691 74532 77673 78111
790G8111k351m157m158l235j670J7J582K916M209N501O793Q222R787J1479J3179J5002J7382
$$ 78111 75760 71603 67445 64210 62540 62557 64139 67055 71264 76765 83558 91780 101567 113046 126225 141227 158609
788A58609K1073K5903L1286L5435L4670K6711J0502r837k7806l7534l8108l2597k4426j6738
$$ 158609 179682 205585 236871 272306 306976 333687 344189 334352 306546 269012 230904 198307 173881 157143
787A57143r734m631o52L225O959J0428J4119J7996K1932K7307L3949M2179N1427N9114O1147
$$ 157143 147409 142778 142126 145351 152310 162738 176857 194853 216785 244092 278041 320220 371647 430761 491908
786D91908N2099K8991n228l9649o2439o8931o1925m8914l4968k2841j3114n656N35O109J1483
$$ 491908 544007 572998 567770 528121 465682 396751 334826 285912 250944 228103 214989 209333 209868 215977 227460
784B27460J7189K3107K9534L7221M6320N7272O9317Q0134Q5449P7761N0141L814m8092q7887
$$ 227460 244649 267756 297290 334511 380831 438103 507420 587554 673003 750764 800905 804719 756627 668740
783F68740j04533r9704q2781o3529m5956l1874k1135j3175o793j419L896R134J4173J9683
$$ 668740 564207 464503 381722 318193 272237 240363 219228 206053 199260 197841 201737 210871 225044 244727
782B44727K5465L2337M0265M9042N5266N4109L9780J1140k5050n5460p1130p0791o0621m7355
$$ 244727 270192 302529 342794 391836 447102 501211 540991 552131 527081 471621 400491 329700 269079 221724
780B21724l4987k4715j7071j1696p682m350j390J400M122P048R956J3153J7137K1831K5981
$$ 221724 186737 162022 144951 133255 125573 121223 119833 121233 125355 132403 142359 155512 172649 194480 220461
779B20461K6592K1218Q632q842k5238l5071l6772l2963k6636k0365j5128j1309q657o777n621
$$ 220461 247053 268271 276903 268061 242823 207752 170980 138017 111381 91016 75888 64579 55922 49145 43524
778D3524m838m090l223k883k407k203j739j400j365j161j025o85p61p62n78n79m77m76m22
$$ 43524 38686 34596 31373 28490 26083 23880 22141 20741 19376 18215 17190 16505 15744 14982 14404 13825 13348 12872 12450
776A2450m22l79j75k52m55n67n66m79m79l77l77l39l39k37k37k70k69m1k44j88J5r8l03j67
$$ 12450 12028 11649 11474 11222 10767 10200 9634 9155 8676 8299 7922 7583 7244 7007 6770 6500 6231 6190 5946 5758 5773 5675 5372 5205
774E205j67j29j28j11j10j11j11k20k21o4o3j3k17q0q1k80N9j6j7r8J07rqj71j71j16Q8o5
$$ 5205 5038 4909 4781 4670 4560 4449 4338 4118 3897 3833 3770 3757 3540 3460 3379 3099 3158 3142 3125 3027 3134 3125 3117 2946 2775 2659 2747 2682
771B682o5o5o5J70l4m16p7o0n9k6k5j75L0J6J7k1k2p2p3k6k6r0J14O1O1m1m1J34p1n7n7RJ0
$$ 2682 2617 2552 2487 2657 2623 2207 2130 2070 2011 1985 1960 1785 1815 1831 1848 1827 1805 1733 1660 1634 1608 1518 1632 1693 1754 1713 1672 1806 1735 1678 1621 1630 1640
768A640m1m2j6j7j6j6ppJ08r6n9n8p1p2P9P9J5J5J45n8O9j35n9n8L1L1l4l4r7J06m3m4j58
$$ 1640 1599 1557 1541 1524 1508 1492 1485 1478 1586 1490 1431 1373 1302 1230 1309 1388 1403 1418 1563 1505 1574 1439 1380 1322 1353 1384 1350 1316 1219 1325 1282 1238 1080
765A080M6R0j15J3J3j9j8j9j9r4r3RQL3L4j8j8k0k0J37J37P7j28j2j3K6K6j66J75p0o9l6l6
$$ 1080 1126 1216 1101 1114 1127 1108 1090 1071 1052 958 865 874 882 915 949 931 913 893 873 1010 1147 1224 1096 1084 1071 1097 1123 957 1132 1062 993 957 921
762I21k07lj5j6n9n9J07r8J4J4j13R0J61J60Q5Q4j20Q4r5r4J49n5m3m2q6q5l03r8Q8Q9j4j3
$$ 921 714 711 696 680 621 562 669 571 585 599 486 576 737 897 982 1066 946 1030 935 841 990 935 892 850 764 679 376 278 366 455 441 428
759D28M0j64J68J68J57j83RQM7M7n6n5l3l3J9J8q3q2j84j85j3j3j%K3K27kK02J0J1L6j68r6
$$ 428 468 304 472 640 797 614 623 631 678 725 669 614 581 548 567 585 502 420 236 51 38 25 24 24 47 274 272 474 484 495 531 363 267
756B67r6n3J50k3k4j1j1o6o7o6o6m1m1m1m1M7M7M7M8m3m2P3j31m0l9j67L8J14J14K4K5r5r4
$$ 267 171 118 268 245 221 210 199 133 66 0 -66 -107 -148 -189 -230 -183 -136 -89 -41 -84 -126 -53 -184 -224 -263 -430 -392 -278 -164 -140 -115 -210 -304
753c04PQj04j04n3n3K5K5K42L8L9M0p6p6n2n3j54j54P9P9r0r1J02J01J15r0r1r1o5o6K22J7
$$ -304 -297 -289 -393 -497 -550 -603 -578 -553 -311 -273 -234 -194 -270 -346 -398 -451 -605 -759 -680 -601 -691 -782 -680 -579 -464 -554 -645 -736 -801 -867 -645 -628
750f28L1L0Q2Q3k0k0j14j15R0j14N9j44O0O0J18J19j54N0n8J46N7N6L9K42K6K4Q7Q8J00j05
$$ -628 -597 -567 -485 -402 -422 -442 -556 -671 -581 -695 -636 -780 -720 -660 -542 -423 -577 -527 -585 -439 -382 -326 -287 -45 -19 5 92 180 280 175
748A75k46k48j58j58k7k6j16j16R2K96P9Q0LMm7m7J11J11RRJ7J6o4o4k68P2R8j06r1r2m8J55
$$ 175 -71 -319 -477 -635 -662 -688 -804 -920 -828 -532 -453 -373 -370 -366 -413 -460 -349 -238 -229 -220 -203 -187 -251 -315 -583 -511 -413 -519 -610 -702 -750 -595
745e95N1N1N1N1J24q1L4L4R1R0p9p9l3l3l2l3k3k3j12j13J6K19KLO7O7M6M5J72j69K2K2j7
$$ -595 -544 -493 -442 -391 -267 -348 -314 -280 -189 -99 -178 -257 -290 -323 -355 -388 -411 -434 -546 -659 -643 -424 -422 -419 -352 -285 -239 -194 -22 -191 -169 -147 -164
742a64j7k9l0j4k17m0l9j32P2O0N9k5k6L0K34P4P4L6L6ONNNn7n8N7N7j31P3j44j44J1J0M8
$$ -164 -181 -210 -240 -254 -471 -511 -550 -682 -610 -550 -491 -516 -542 -512 -278 -204 -130 -94 -58 -52 -47 -42 -37 -94 -152 -95 -38 -169 -96 -240 -384 -373 -363 -315
739c15M9J49n6J10J09MMJ18J19m9J56N4j51j02j03k29k6Q7Q5o9p1J6J6q6q6Q4Q4j8j8J11J11
$$ -315 -266 -117 -173 -63 46 50 54 172 291 242 398 452 301 199 96 -133 -159 -72 13 -56 -127 -111 -95 -181 -267 -183 -99 -117 -135 -24 87
736H7N7j47R1R2J42o1o4o4K5K6p1p0j9k0RJ0r2r3J0J0J12J11p0o9J46n7J7J7M2M3J10r5l1
$$ 87 144 -3 88 180 322 261 197 133 158 184 113 43 24 4 13 23 -69 -162 -152 -142 -30 81 11 -58 88 31 48 65 107 150 260 165 134
733A34l1m9n0N2j51K9j75n1n2k76O3k6k6Q4Q4nnk7J78J90j4j45N9j83K1K1K0j36j37n2n2O3
$$ 134 103 54 4 56 -95 -66 -241 -292 -344 -620 -557 -583 -609 -525 -441 -446 -451 -478 -300 -110 -124 -269 -210 -393 -372 -351 -331 -467 -604 -656 -708 -645
730f45O3n9J46J33k07j16Q8m7m8J94J93k7k8k1k2qrj30P5m1m0J6J7M6j57QQn6n5N3N4N3N3
$$ -645 -582 -641 -495 -362 -569 -685 -597 -644 -692 -498 -305 -332 -360 -381 -403 -411 -420 -550 -475 -516 -556 -540 -523 -477 -634 -626 -618 -674 -729 -676 -622 -569 -516
727e16M1M0M1M1l9l8J2J3L5L5j7j6pon8n8P3P3K1K2j3j3J14r0K5K29J01J01J74J74K93K93
$$ -516 -475 -435 -394 -353 -392 -430 -418 -405 -370 -335 -352 -368 -375 -381 -439 -497 -424 -351 -330 -308 -321 -334 -220 -310 -285 -56 45 146 320 494 787 1080
724A080P0P1k7k7q5k88k80k80j56M8k33k8L0L1R3R4J55J55O2K65R8M38M13K09L13J10Q0Q0
$$ 1080 1150 1221 1194 1167 1082 794 514 234 78 126 -107 -135 -105 -74 19 113 268 423 485 750 848 1286 1699 1908 2221 2331 2411 2491
722B491k39m43m13m13j25j26j03j04o2K79L6L7Q8Q8K08K07L23L22M75M76L87L87J79k6n02
$$ 2491 2252 1809 1396 983 858 732 629 525 463 742 778 815 903 991 1199 1406 1729 2051 2526 3002 3389 3776 3955 3929 3427
719C427n02n03n02m71k68j14j14k70o5OPJ35J34ooK56M60P8K81J70J70L23j7l13l13l21l21
$$ 3427 2925 2422 1920 1449 1181 1067 953 683 618 624 631 766 900 894 888 1144 1604 1682 1963 2133 2303 2626 2609 2296 1983 1662 1341
717A341l20j16j80j80n5n4R8j06M4j60opJ79J79j2L28J31J32l5l4j03j04k69o5j38j38j55
$$ 1341 1021 905 725 545 490 436 534 428 472 312 306 299 478 657 645 973 1104 1236 1201 1167 1064 960 691 626 488 350 195
714A95M9OOj08R5j4k18nnM7M7q4q3r6k99L7L7P8P8J29J28m1m1M4M3m0m1J10r1R9j03j29P4
$$ 195 244 250 256 148 243 229 11 6 1 48 95 11 -72 -168 -467 -430 -393 -315 -237 -108 20 -21 -62 -18 25 -15 -56 54 -37 62 -41 -170 -96
711i6J87j6r5r7j22Q1Q2j22Q8Q7M9j54o0J44l4l5qpP7P6L7L6m8m8P7P7Nj98J6J6LKm9n0j64
$$ -96 91 75 -20 -117 -239 -158 -76 -198 -110 -23 26 -128 -188 -44 -78 -113 -121 -128 -51 25 62 98 50 2 79 156 161 -37 -21 -5 -2 0 -49 -99 -263
708b63L9P5P5L6j68J10r4j07R7N7N8J84j9n6n5j83K0RRq1J24q4J20m6m6J59m5m9m9o8o8N1
$$ -263 -224 -149 -74 -38 -206 -96 -190 -297 -200 -143 -85 99 80 24 -31 -214 -194 -185 -176 -257 -133 -217 -97 -143 -189 -30 -75 -124 -173 -241 -309 -258
705b58N1j2j2P3P4k0j9J09r6j21Q3m5m5K2K2N1j53p9q0J29J29o9o9K11Qk08lJ59J58o1o1P1
$$ -258 -207 -219 -231 -158 -84 -104 -123 -14 -110 -231 -148 -193 -238 -216 -194 -143 -296 -375 -455 -326 -197 -266 -335 -124 -116 -324 -327 -168 -10 -71 -132 -61
702f1P0j53M9L3L3k59n5J32p2q1q2L4K37Q9j15J2J3L6L7j4j4o7o7J32p1J3J2%%N2N1l3l3k6
$$ -61 9 -144 -95 -62 -29 -288 -343 -211 -283 -364 -446 -412 -175 -86 -201 -189 -176 -140 -103 -117 -131 -198 -265 -133 -204 -191 -179 -179 -179 -127 -76 -109 -142 -168
699a68k6r0r0K03jl9m0RQQRMMp2J31J19q5o0J45j58M6nnq8q8L1L1J8J7mmJ38k03M0L9Q6Q5
$$ -168 -194 -284 -374 -171 -172 -211 -251 -242 -234 -226 -217 -213 -209 -281 -150 -31 -116 -176 -31 -189 -143 -148 -153 -241 -329 -298 -267 -249 -232 -236 -240 -102 -305 -265 -226 -140 -55
696e5L4L4r3r3R4R3q2q4KKL8L9K6K6J21q3j33P0J4J4J32k06NOL5L4o2o3R0Q9jjn1n3N2N1j34
$$ -55 -21 13 -80 -173 -79 14 -68 -152 -150 -148 -110 -71 -45 -19 102 19 -114 -44 -30 -16 116 -90 -85 -79 -44 -10 -72 -135 -45 44 43 42 -9 -62 -10 41 -93
693i3j35k6k5K5K6N5N5J06J05l9l9M5M6l0k9m3m1J72l1jjn1n0%%j9k0M2M4p7J24J1J1rrj3
$$ -93 -228 -254 -279 -254 -228 -173 -118 -12 93 54 15 60 106 76 47 4 -37 135 104 103 102 51 1 1 1 -18 -38 4 48 -29 95 106 117 108 99 86
689H6k16O9O8o2o3M1M2m4m3N4N4j45N8K2K2mmp5J28p2p2Q1P9K9K9j02j02N0N1p4p4M6M5j5
$$ 86 -130 -61 7 -55 -118 -77 -35 -79 -122 -68 -14 -159 -101 -79 -57 -61 -65 -140 -12 -84 -156 -75 4 33 62 -40 -142 -92 -41 -115 -189 -143 -98 -113
686a13j5j30P4N1N1K6K6k05jR3R3O6j37J90j4j42O2p9p8J25q0m9m9J1J1J1J1llj6j6K01lp6
$$ -113 -128 -258 -184 -133 -82 -56 -30 -235 -236 -143 -50 16 -121 69 55 -87 -25 -104 -182 -57 -137 -186 -235 -224 -213 -202 -191 -194 -197 -213 -229 -28 -31 -107
683a07p5N8N8J21q2m9n0o2o2O7O7j46N8J03j01l7J66J4J5K6K6p1p2k0k1OPN8N7m8m9J18J16
$$ -107 -182 -124 -66 55 -27 -76 -126 -188 -250 -183 -116 -262 -204 -101 -202 -239 -73 -59 -44 -18 8 -63 -135 -155 -176 -170 -163 -105 -48 -96 -145 -27 89
680H9o3J41r3r2j19j18J58J57J7j86J3J3J9J8J9J8Q9Q9k11qQ1Q2p9p9o8J35o3o4j0rj25Q0
$$ 89 26 167 74 -18 -137 -255 -97 60 77 -109 -96 -83 -64 -46 -27 -9 80 169 -42 -50 31 113 34 -45 -113 22 -41 -105 -115 -124 -249 -169
677a69M6M6o0o0N0N0l6l5M6M6P6j28M6M5r5J09K5j78j2j3J72l1j1k14n5J50K2K2L4L4M7M5
$$ -169 -123 -77 -137 -197 -147 -97 -133 -168 -122 -76 0 -128 -82 -37 -132 -23 2 -176 -188 -201 -29 -60 -71 -285 -340 -190 -168 -146 -112 -78 -31 14
674A4j21Q1l4l3J9K0m4J59ppm5m4j6j6L5L4M3M3M3M3o5o5Q8Q8k7k7j4j4r1J13j4j4Q7j17M8
$$ 14 -107 -26 -60 -93 -74 -54 -98 61 54 47 2 -42 -58 -74 -39 -5 38 81 124 167 102 37 125 213 186 159 145 131 40 153 139 125 212 95 143
671A43M9k3k3M2j63j%o3o4M1M1p4J30J07J07l4l3K3K3k52Q6M7M8j7j6j7j7j8j7r7r7J56J58
$$ 143 192 169 146 188 25 24 24 -39 -103 -62 -21 -95 35 142 249 215 182 205 228 -24 62 109 157 140 124 107 90 72 55 -42 -139 17 175
668A75l1l0K0K1r9r7J68l5J7J8rqR8j06p6p5J04J06N4N5j08j07J2J1r5r7r3J12l1l1J9K0J47
$$ 175 144 114 134 155 56 -41 127 92 109 127 118 110 208 102 26 -49 55 161 215 270 162 55 67 78 -17 -114 -207 -95 -126 -157 -138 -118 29
665B9n6J08J09o1o2j25P8J2J1K5K4k4k4M0j63J0J0M8M8J2J2J2J3l1l0n0n2J77j62k2k2L5L6
$$ 29 -27 81 190 129 67 -58 20 32 43 68 92 68 44 84 -79 -69 -59 -11 37 49 61 73 86 55 25 -25 -77 100 -62 -84 -106 -71 -35
662c5J49n4n0m8j1j1Q5Q6j47N5k7k8L5L5o1o2N7N6q4q5%%R4R3j9j9K4J26L1j74PPO5j39O2
$$ -35 114 60 10 -38 -49 -60 25 111 -36 19 -8 -36 -1 34 -27 -89 -32 24 -60 -145 -145 -145 -51 42 23 4 28 154 185 11 18 25 90 -49 13
659A3J64n8n9N5N4LLj13j12PON4N6MMJ4J5q1K1o0J42L5L5o6o5K0J9J5J4J5J4LLKLj1j1n0m9
$$ 13 177 119 60 115 169 172 175 62 -50 -43 -37 17 73 77 81 95 110 29 50 -10 132 167 202 136 71 91 110 125 139 154 168 171 174 176 179 168 157 107 58
655E8k9J75LJ05qrM9M8q1q1MMJ01J01J6J6j6j6N4m8j00J04o8o8o6o7N3N3qqqqo3o2m6J59J28
$$ 58 29 204 207 312 304 295 344 392 311 230 234 238 339 440 456 472 456 440 494 446 346 450 382 314 248 181 234 287 279 271 263 255 192 130 84 243 371
652C71k13r3r2J05J06m1m0r2J0J47n8j00k02K9L0O7O7O7O8n9n9n2n3o0M2J05r7j1R2J93j1
$$ 371 158 65 -27 78 184 143 103 11 21 168 110 10 -192 -163 -133 -66 1 68 136 77 18 -34 -87 -147 -105 0 -97 -108 -16 177 166
649A66n3M8q0p9N3m9o6J35%k03M3M3O0O2k4k4l6l6J4J5j2j2L8L9k4k3nj06j37O8O8j36K2J24
$$ 166 113 161 81 2 55 6 -60 75 75 -128 -85 -42 18 80 56 32 -4 -40 -26 -11 -23 -35 3 42 18 -5 -10 -116 -253 -185 -117 -253 -231 -107
646a07M8J49q5q3k8k7PPJ65l8Mr8QJ08j8j8R5j08k0j23JK04j83q2R4j10J80k5J9J21n2n0N1
$$ -107 -59 90 5 -78 -106 -133 -126 -119 46 8 12 -86 -78 30 12 -6 89 -19 -39 -162 -161 43 -140 -222 -128 -238 -58 -83 -64 57 5 -45 6
643FN3n9J45R4j10n9n9j9k1K3K2j06nn2J51l5l5m8N5J18q4PJ08n7j58L1L1k6k7M4M4qpN9N9
$$ 6 59 0 145 239 129 70 11 -8 -29 -6 16 -90 -95 -147 4 -31 -66 -114 -59 59 -25 -18 90 33 -125 -94 -63 -89 -116 -72 -28 -36 -43 16 75
640G5RRK7K8n7n7l8l8M6M7K5K4L8L7j42O2L2L3j6j6L6L5m0m0J1J1L7L7m9m8onk4P8M2j61j03
$$ 75 84 93 120 148 91 34 -4 -42 4 51 76 100 138 175 33 95 127 160 144 128 164 199 159 119 130 141 178 215 166 118 112 107 83 161 203 42 -61
637f1R9l2l2j9k0P9P9l5J69O8O9j01j02Q6j18mlQ8Q9q2q2QQPQj4j3Q8Q9q7q7Q3Q3p2p2k0k1
$$ -61 38 6 -26 -45 -65 14 93 58 227 295 364 263 161 247 129 125 122 210 299 217 135 143 151 158 166 152 139 227 316 229 142 225 308 236 164 144 123
633A23mmJ62m2NMj36O9J48n6l1l1j6j7Q5Q5l8l8l8l8m0m1m0m0R0R0j2j1J1J1m0m0J0J1m0m0
$$ 123 119 115 277 235 240 244 108 177 325 269 238 207 191 174 259 344 306 268 230 192 152 111 71 31 121 211 199 188 199 210 170 130 140 151 111 71
630G1LLLLm7m6RK11N1N1P6j27j66j65N9N9l2l1J97pj02J02l8l9O3j41O2O3M6j57QRQ3Q2j9
$$ 71 74 77 80 83 36 -10 -1 210 261 312 388 261 95 -70 -11 48 16 -15 182 175 73 175 137 98 161 20 82 145 191 34 42 51 134 216 197
627A97j9J6J6q6q7M6M6j70L3K5K7K6K7J95qk00j99O0N9P3j30N1N0j3j3L6L6j5j5p5p6Q1Q1
$$ 197 178 194 210 124 37 83 129 -41 -8 17 44 70 97 292 284 84 -115 -55 4 77 -53 -2 48 35 22 58 94 79 64 -11 -87 -6 75
624G5L3j69M6M5L5L4o8o6j6j6Q6Q6p4p4j1j1l7J66n0n0O0O1j55M8N3N5Q0j24LMrroon6n7J13
$$ 75 108 -61 -15 30 65 99 31 -35 -51 -67 19 105 31 -43 -54 -65 -102 64 14 -36 24 85 -70 -22 31 86 166 42 45 49 40 31 25 19 -37 -94 19
621A9J14j03J01J3J3m7m6J32k07L3L4L9L8o3o4M1M2p4J31lmJ0RJ3J2j02J02K5K5p7p7O1j43
$$ 19 133 30 131 144 157 110 64 196 -11 22 56 95 133 70 6 47 89 15 146 143 139 149 158 171 183 81 183 208 233 156 79 140 -3
618cP2P3J0J0M9M8O2j42j5j4j60M3J46n8l0l0O0O0K3K4K3K4j55j53Q2Q4K2K2q0q0O5O6J0j93
$$ -3 69 142 152 162 211 259 321 179 164 150 -10 33 179 121 91 61 121 181 204 228 251 275 120 -33 49 133 155 177 97 17 82 148 158 -35
614c5M6M8Q6Q5m7m8O7O7j21Q3l2l1m1m0O2O2N6N6o0n9J30p5m9m9q3J21OOL7L6L7L6j21j21
$$ -35 11 59 145 230 183 135 202 269 148 231 199 168 127 87 149 211 267 323 263 204 334 259 210 161 78 199 205 211 248 284 321 357 236 115
611A15LK06o5o6M9N0r3r2J25p9L2L3l2l1L6L5L6L6k7k7l9J64n5n6mnJ46n9m6m6p0p0j80J58
$$ 115 118 324 259 193 242 292 199 107 232 153 185 218 186 155 191 226 262 298 271 244 205 369 314 258 254 249 395 336 290 244 174 104 -76 82
608H2J73j68J48J47L8L8k6k6J05j00q6q7l1l1K0K0lkklj0j0j0j0Q2Q1K6j79L3L2OPJ52n1n2
$$ 82 255 87 235 382 420 458 432 406 511 411 325 238 207 176 196 216 213 211 209 206 196 186 176 166 248 329 355 176 209 241 247 254 406 355 303
605C03J52j7j8j8j8P1j33j9j9L3L2J47n7m8m9j76K8N4N4J1j93p1o9J54J55l8l9n1n1J62m1
$$ 303 455 438 420 402 384 455 322 303 284 317 349 496 439 391 342 166 194 248 302 313 120 49 -20 134 289 251 212 161 110 272 231
602B31j6j6j18Q6m1m1J51n2n2n2J04j01m9J55m6m6j47N5M8M8M9M8J25p9o7o7O6O5O5O5j20
$$ 231 215 199 81 167 126 85 236 184 132 80 184 83 34 189 143 97 -50 5 53 101 150 198 323 244 177 110 176 241 306 371 251
599B51j21N0N0OOm5m4o9o8Q9Q9J02j01J3J4o8o8J02J02o7o6r3J12Q8j16m0m0O4O3j07j05n1
$$ 251 130 180 230 236 242 197 153 84 16 105 194 296 195 208 222 154 86 188 290 223 157 64 176 264 148 108 68 132 195 88 -17 -68
597f8n1J19J18J9K0OPL2j71n5J46o5J39L8L7j5j5j05j04n2J50L6L6j20j19J17J18j18j17L9
$$ -68 -119 0 118 137 157 163 170 202 31 -24 122 57 196 234 271 256 241 136 32 -20 130 166 202 82 -37 80 198 80 -37 2
594BL9J50n4k8k8j54M9J51n3j8j9J35p0r5r4J29J31k5k4K6K7r6r5J29J29P6j29k7k6J03j01
$$ 2 41 191 137 109 81 -73 -24 127 74 56 37 172 102 7 -87 42 173 148 124 150 177 81 -14 115 244 320 191 164 138 241 140
591A40J16J16j1j1j25j26Q4j20M6M6jjjjl0l0k9l0J13J12J1J1j87j86J18J19p7p6R2R3llj05
$$ 140 256 372 361 350 225 99 183 63 109 155 154 153 152 151 121 91 62 32 145 257 268 279 92 -94 24 143 66 -10 82 175 172 169 64
588F4j03O0O2M9M9J65l8r4r3l6l6O5O6n3n3M9M9l7l6P8P8j13R1Jk02j53N1K5K5lkJ11r1P3
$$ 64 -39 21 83 132 181 346 308 214 121 85 49 114 180 127 74 123 172 135 99 177 255 142 233 234 32 -121 -70 -45 -20 -23 -25 86 -5 68
585F8P4m1m1O4O5j53N2m8m6J5J7N4N5Q0j24q9J15N2N1j60M4ppq7J16m9m9K1K2M6j56r6J08
$$ 68 142 101 60 124 189 36 88 40 -6 9 26 80 135 215 91 2 117 169 220 60 104 97 90 3 119 70 21 42 64 110 -46 -142 -34
582c4Q2Q3r0q8Q0Q0MMJ18q5k0j9l3l2lkllJ7J6J7J6K3K3o6o7q4J17j10R2l7l9k6k6N6N4J8
$$ -34 48 131 41 -47 33 113 117 121 239 154 134 115 82 50 47 45 42 39 56 72 89 105 128 151 85 18 -66 51 -59 33 -4 -43 -69 -95 -39 15 33
579C3J8n4J49o6o7k5k5k6k5P4P4P4P5J5J5J5J5p2p2p2p1P2P3l0k9O8O7Q0j24%jj15j15M6M4
$$ 33 51 -3 146 80 13 -12 -37 -63 -88 -14 60 134 209 224 239 254 269 197 125 53 -18 54 127 97 68 136 203 283 159 159 158 43 -72 -26 18
575A8m2m4n3J50Q7Q7o7o8N7N6k65P4J54m9J72l3j01j00N4N4o0J44j14j12JJj4j5J51n3k5k4
$$ 18 -24 -68 -121 29 116 203 136 68 125 181 -84 -10 144 95 267 234 133 33 87 141 81 225 111 -1 0 1 -13 -28 123 70 45 21
572B1l6J66q5J19J7J8j06j06j5j6J10r2K1K2O3O3l9l9p8p6J05J05j26P9j50N2qrJ05J06o7
$$ 21 -15 151 66 185 202 220 114 8 -7 -23 87 -5 16 38 101 164 125 86 8 -68 37 142 16 95 -55 -3 -11 -20 85 191 124
570A24o7j2J92l7l7k5k4J1J1J0J1j2j3j3j2J01J02N8j45j26P8N2N3q3q3L2L2n6J47nnj78K7
$$ 124 57 45 237 200 163 138 114 125 136 146 157 145 132 119 107 208 310 368 223 97 175 227 280 197 114 146 178 122 269 264 259 81 108
567A08J3J4K7K8R1R1q9J14O4j41l4l4m7m7N1N0J74J74l30J0p9p9J27J27o4k69LLM1M1m6m5
$$ 108 121 135 162 190 281 372 283 397 461 320 286 252 205 158 209 259 433 607 277 287 208 129 256 383 319 50 53 56 97 138 92 47
564D7n7J45M5M5k3k3j97J41J20J21o5o4n2n2j15R0P6P6q5q5MMJ04j01J4J5J4J4J4J5l4l4O9
$$ 47 -10 135 180 225 202 179 -18 123 243 364 299 235 183 131 16 106 182 258 173 88 92 96 200 99 113 128 142 156 170 185 151 117 186
561A86O8j04j03m8J55P2P2j32P2j08j09OPK9L0L0L0M8M8n4n4O9O9J9J8J8J8q4q3N5N5K6K6
$$ 186 254 150 47 -1 154 226 298 166 238 130 21 27 34 63 93 123 153 201 249 195 141 210 279 298 316 334 352 268 185 240 295 321 347
558C47j65J76k4k29K21j19n6n5J97pj77K8K6K7L9L9LLMLK0K0J48n7j59M4J9J9J6J6l5l5k9
$$ 347 182 358 334 105 326 207 151 96 293 286 109 137 163 190 229 268 271 274 278 281 301 321 469 412 253 297 316 335 351 367 332 297 268
555B68k9K3K2k8k7k8k8P2P3l0l0K4K5k7k7k9l0K1K1k0k0M3M4q4J20j10R5m1m0k8k8R4R3p6
$$ 268 239 262 284 256 229 201 173 245 318 288 258 282 307 280 253 224 194 215 236 216 196 239 283 199 319 209 304 263 223 195 167 261 354 278
$$ [...]
-3525A51
##END=	
##END=	
