##TITLE=	Aug01-2014-fpc.11.fid
FPC197B pure

##JCAMP-DX=	6.0	$$ MestReNova 14.1.0-24037
##DATA TYPE=	LINK
##BLOCK_ID=	1
##BLOCKS=	1    
##ORIGIN=	Mestrelab Research S.L.
##OWNER=	hrzepa
##$MNOVA/LINK_BLOCK_TYPE=	ITEM	$$ NMR Spectrum
##$MNOVA/ITEM/POLYGON=	(XY..XY)
5321,5835
8722,5835
8722,8208
5321,8208
5321,5835
##$MNOVA/ITEM/Z=	0
##$MNOVA/ITEM/ANGLE=	0
##TITLE=	Aug01-2014-fpc.11.fid
##JCAMP-DX=	6.0	$$ MestReNova 14.1.0-24037
##BLOCK_ID=	2
##DATA TYPE=	NMR SPECTRUM
##DATA CLASS=	XYDATA
##NUMDIM=	1
##ORIGIN=	Bruker BioSpin GmbH
##OWNER=	nmr
##.OBSERVE FREQUENCY=	75.499030390135004609
##.OBSERVE NUCLEUS=	^13C
##.SOLVENT NAME=	CDCl3
##.PULSE SEQUENCE=	zgpg30
##LONGDATE=	2014/08/02 05:43:00.000
##.ACQUISITIONMODE=	SIMULTANEOUS (DQD)
##$ORIGINAL FORMAT=	Bruker XWIN-NMR
##$MNOVA/SCALES_VERSION=	8
##$PARAMETER FILE=	(acqus, ASCII, /var/folders/f6/rjf_tdyn2v98c5c0wvkgn4s80000gq/T/V1Nii4DFTJ+SSzaCjm09Jw/13C/acqus, 0)
$$ ##TITLE= Parameter file, TOPSPIN		Version 2.1
$$ ##JCAMPDX= 5.0
$$ ##DATATYPE= Parameter Values
$$ ##NPOINTS= 12	$$ modification sequence number
$$ ##ORIGIN= Bruker BioSpin GmbH
$$ ##OWNER= nmr
$$ $$ 2014-08-02 05:43:53.467 +0100  nmr@CHPC-NMR300
$$ $$ C:\u/data/fpc/nmr/Aug01-2014-fpc/11/acqus
$$ $$ process C:\Bruker\TOPSPIN2.1\prog\mod\shimcntl.exe
$$ ##$ACQT0= -1.57563025210084
$$ ##$AMP= (0..31)
$$ 100 100 100 100 100 100 100 100 100 100 100 100 100 100 100 100 100 100
$$ 100 100 100 100 100 100 100 100 100 100 100 100 100 100
$$ ##$ANAVPT= -1
$$ ##$AQSEQ= 0
$$ ##$AQ_mod= 1
$$ ##$AUNM= <au_zgt>
$$ ##$AUTOPOS= <26 >
$$ ##$BF1= 75.490349
$$ ##$BF2= 300.22
$$ ##$BF3= 75.490349
$$ ##$BF4= 500.13
$$ ##$BF5= 500.13
$$ ##$BF6= 500.13
$$ ##$BF7= 500.13
$$ ##$BF8= 500.13
$$ ##$BYTORDA= 1
$$ ##$CFDGTYP= 0
$$ ##$CFRGTYP= 5
$$ ##$CHEMSTR= <none>
$$ ##$CNST= (0..63)
$$ 1 1 145 1 1 1 1 1 1 1 1 1 1 1 1 1 1 1 1 1 1 1 1 1 1 1 1 1 1 1 1 1 1 1 1
$$ 1 1 1 1 1 1 1 1 1 1 1 1 1 1 1 1 1 1 1 1 1 1 1 1 1 1 1 1 1
$$ ##$CPDPRG= <waltz16>
$$ ##$CPDPRG1= <>
$$ ##$CPDPRG2= <waltz16>
$$ ##$CPDPRG3= <>
$$ ##$CPDPRG4= <mlev>
$$ ##$CPDPRG5= <mlev>
$$ ##$CPDPRG6= <mlev>
$$ ##$CPDPRG7= <mlev>
$$ ##$CPDPRG8= <mlev>
$$ ##$CPDPRGB= <>
$$ ##$CPDPRGT= <>
$$ ##$D= (0..63)
$$ 0 2 0.00345 0 0 0 0 0 0 0.06 0 0.03 2e-005 3e-006 0 0 0.0002 0 0 0 0 0
$$ 0 0 0 0 0 0 0 0 0 0 0 0 0 0 0 0 0 0 0 0 0 0 0 0 0 0 0 0 0 0 0 0 0 0 0 0
$$ 0 0 0 0 0 0
$$ ##$DATE= 1406954623
$$ ##$DBL= (0..7)
$$ 120 120 120 120 120 120 120 120
$$ ##$DBP= (0..7)
$$ 150 150 150 150 150 150 150 150
$$ ##$DBP07= 0
$$ ##$DBPNAM0= <>
$$ ##$DBPNAM1= <>
$$ ##$DBPNAM2= <>
$$ ##$DBPNAM3= <>
$$ ##$DBPNAM4= <>
$$ ##$DBPNAM5= <>
$$ ##$DBPNAM6= <>
$$ ##$DBPNAM7= <>
$$ ##$DBPOAL= (0..7)
$$ 0.5 0.5 0.5 0.5 0.5 0.5 0.5 0.5
$$ ##$DBPOFFS= (0..7)
$$ 0 0 0 0 0 0 0 0
$$ ##$DE= 6
$$ ##$DECBNUC= <off>
$$ ##$DECIM= 6
$$ ##$DECNUC= <off>
$$ ##$DECSTAT= 4
$$ ##$DIGMOD= 1
$$ ##$DIGTYP= 7
$$ ##$DL= (0..7)
$$ 0 120 120 120 120 120 120 120
$$ ##$DP= (0..7)
$$ 150 150 150 150 150 150 150 150
$$ ##$DP07= 0
$$ ##$DPNAME0= <>
$$ ##$DPNAME1= <>
$$ [...]
$$ -1 -1 -1 -1 -1 -1 -1 -1 -1 -1 -1 -1 -1 -1 -1 -1 -1 -1 -1 -1 -1 -1 -1 -1
$$ -1 -1 -1 -1 -1 -1 -1 -1 -1 -1 -1 -1 -1 -1 -1 -1
$$ ##$RG_tab8= (0..255)
$$ -1 -1 -1 -1 -1 -1 -1 -1 -1 -1 -1 -1 -1 -1 -1 -1 -1 -1 -1 -1 -1 -1 -1 -1
$$ -1 -1 -1 -1 -1 -1 -1 -1 -1 -1 -1 -1 -1 -1 -1 -1 -1 -1 -1 -1 -1 -1 -1 -1
$$ -1 -1 -1 -1 -1 -1 -1 -1 -1 -1 -1 -1 -1 -1 -1 -1 -1 -1 -1 -1 -1 -1 -1 -1
$$ -1 -1 -1 -1 -1 -1 -1 -1 -1 -1 -1 -1 -1 -1 -1 -1 -1 -1 -1 -1 -1 -1 -1 -1
$$ -1 -1 -1 -1 -1 -1 -1 -1 -1 -1 -1 -1 -1 -1 -1 -1 -1 -1 -1 -1 -1 -1 -1 -1
$$ -1 -1 -1 -1 -1 -1 -1 -1 -1 -1 -1 -1 -1 -1 -1 -1 -1 -1 -1 -1 -1 -1 -1 -1
$$ -1 -1 -1 -1 -1 -1 -1 -1 -1 -1 -1 -1 -1 -1 -1 -1 -1 -1 -1 -1 -1 -1 -1 -1
$$ -1 -1 -1 -1 -1 -1 -1 -1 -1 -1 -1 -1 -1 -1 -1 -1 -1 -1 -1 -1 -1 -1 -1 -1
$$ -1 -1 -1 -1 -1 -1 -1 -1 -1 -1 -1 -1 -1 -1 -1 -1 -1 -1 -1 -1 -1 -1 -1 -1
$$ -1 -1 -1 -1 -1 -1 -1 -1 -1 -1 -1 -1 -1 -1 -1 -1 -1 -1 -1 -1 -1 -1 -1 -1
$$ -1 -1 -1 -1 -1 -1 -1 -1 -1 -1 -1 -1 -1 -1 -1 -1
$$ ##$RG_tabA= (0..255)
$$ 1 1.1 1.3 1.4 1.6 1.8 2 2.2 2.5 2.8 3.2 3.6 4 4.5 5 5.7 6.3 7.1 8 9 10.1
$$ 11.3 12.7 14.3 16 18 20.2 22.6 25.4 28.5 32 35.9 40.3 45.3 50.8 57 64 71.8
$$ 80.6 90.5 101.6 114 128 143.7 161.3 181 203.2 228.1 256 287.4 322.5 362
$$ 406.4 456.1 512 574.7 645.1 724.1 812.7 912.3 1024 1149.4 1290.2 1448.2
$$ 1625.5 1824.6 2048 2298.8 2580.3 2896.3 3251 3649.1 4096 4597.6 5160.6
$$ 5792.6 6502 7298.2 8192 9195.2 10321.3 11585.2 13004 14596.5 16384 18390.4
$$ 20642.5 23170.5 26008 29193 32768 36780.8 41285.1 46341 -1 -1 -1 -1 -1
$$ -1 -1 -1 -1 -1 -1 -1 -1 -1 -1 -1 -1 -1 -1 -1 -1 -1 -1 -1 -1 -1 -1 -1 -1
$$ -1 -1 -1 -1 -1 -1 -1 -1 -1 -1 -1 -1 -1 -1 -1 -1 -1 -1 -1 -1 -1 -1 -1 -1
$$ -1 -1 -1 -1 -1 -1 -1 -1 -1 -1 -1 -1 -1 -1 -1 -1 -1 -1 -1 -1 -1 -1 -1 -1
$$ -1 -1 -1 -1 -1 -1 -1 -1 -1 -1 -1 -1 -1 -1 -1 -1 -1 -1 -1 -1 -1 -1 -1 -1
$$ -1 -1 -1 -1 -1 -1 -1 -1 -1 -1 -1 -1 -1 -1 -1 -1 -1 -1 -1 -1 -1 -1 -1 -1
$$ -1 -1 -1 -1 -1 -1 -1 -1 -1 -1 -1 -1 -1 -1 -1 -1 -1 -1 -1 -1 -1 -1 -1 -1
$$ -1 -1 -1 -1 -1 -1 -1 -1 -1 -1 -1 -1 -1
$$ ##$ROUT14= (0..7)
$$ 0 0 0 0 0 0 0 0
$$ ##$ROUTER= 3
$$ ##$RX22TY= <tty10>
$$ ##$RXFMAX= (0..7)
$$ -1 -1 -1 -1 -1 -1 -1 -1
$$ ##$RXFMIN= (0..7)
$$ -1 -1 -1 -1 -1 -1 -1 -1
$$ ##$RXINTLV= (0..7)
$$ 0 0 0 0 0 0 0 0
$$ ##$RXMSTY= <no>
$$ ##$SCMTY= <no>
$$ ##$SGUC1= (0..15)
$$ 0 0 0 0 0 0 0 0 0 0 0 0 0 0 0 0
$$ ##$SGUC2= (0..15)
$$ 0 0 0 0 0 0 0 0 0 0 0 0 0 0 0 0
$$ ##$SPECTR= 5
$$ ##$SY2FLAG= 0
$$ ##$TFXNUM= 0
$$ ##$TRIPLO2= 0
$$ ##$VTUTY= <tty05>
$$ ##$WBREFAM= (0..15)
$$ 100 100 100 100 100 100 100 100 100 100 100 100 100 100 100 100
$$ ##$WBREFPH= (0..15)
$$ 0 0 0 0 0 0 0 0 0 0 0 0 0 0 0 0
$$ ##$XFAC= 2
$$ ##END=
$$ 
##$DECIM=	6
##$DSPFVS=	10
##XUNITS=	HZ
##YUNITS=	ARBITRARY UNITS
##FIRSTX=	18815.305417826530174
##LASTX=	-1509.8978342059699571
##DELTAX=	-0.310142721477569272
##XFACTOR=	1
##YFACTOR=	0.90143128011100770447
##FIRSTY=	-23.5987548828125
##MINY=	-445.547515869140625
##MAXY=	55831.35546875
##NPOINTS=	65536
##XYDATA=	(X++(Y..Y))
$$ [...]
$$ plain form
9509 -6 -106 -114 -70 -26 37 101 88 76 118 160 202 244 146 48 26 5 -32 -70 -59 -47 -27 38 130 131 74 18 -22 28 70 67 66 112 114 71 56 41 5 -29
9497 -29 -40 39 53 67 81 95 111 36 -13 -17 -1 14 30 46 58 24 -40 -13 98 119 60 1 8 15 -23 -62 -3 55 37 20 2 -14 -78 -141 -164 -188
9486 -188 -105 -21 37 97 156 216 186 157 82 8 -14 -36 -13 9 -54 -119 -138 -157 -144 -131 -119 -106 -64 -23 -27 -31 -81 -132 -137 -142 -183 -224 -220 -215 -153 -92 -76 -60
9474 -60 -38 -16 -40 -64 -72 -80 -42 -4 10 26 41 56 37 19 45 72 53 34 15 -2 10 24 37 51 21 -7 8 24 -19 -62 -106 -150 -64 21 107 193
9463 193 176 158 96 33 31 28 -19 -67 -103 -140 -131 -122 -220 -318 -370 -422 -329 -235 -142 -49 13 76 93 110 83 56 -16 -89 -50 -12 25 64 39 15 -9 -33 -83
9451 -83 -134 -108 -81 -72 -62 -52 -42 -66 -91 -115 -140 -163 -186 -164 -142 -202 -262 -323 -383 -342 -301 -260 -220 -150 -81 -88 -95 -123 -152 -181 -210 -195 -180 -165 -150 -150 -149 -106
9439 -106 -62 -31 -45 -81 -41 -33 -100 -146 -146 -172 -199 -223 -247 -146 -45 -51 -57 -71 -85 -100 -114 -64 -13 -69 -126 -134 -143 -151 -159 -186 -212 -193 -174 -95 -16 -14 -11 -28 -44
9427 -44 -61 -77 -63 -49 -35 -21 1 24 -29 -82 -59 -36 -13 9 -69 -149 -183 -217 -175 -132 -89 -46 2 51 55 59 59 59 14 -31 -2 26 9 -52 -70 -12 43
$$ packed form
9509fj00qM4M4O3O4j3j2M2M2M2M2r8r8k2k1l7l8J1J2K0O5R2Jn7n6m0N0M2ljM6Km3j5j5l6l4
9497b9j1P9J4J4J4J4J6p5m9mJ6J5J6J6J2l4o4K7J11K1n9n9PPl8l9N9N8j8j7j8j6o4o3k3k4
9486a88Q3Q4N8O0N9O0l0k9p5p4k2k2K3K2o3o5j9j9J3J3J2J3M2M1mmn0n1nnm1m1MNO2O1J6J6
9474f0K2K2k4k4qqL8L8J4J6J5J5j9j8K6K7j9j9j9j7J2J4J3J4l0k8J5J6m3m3m4m4Q6Q5Q6Q6
9463A93j7j8o2o3klm7m8l6l7RRr8r8n2n2R3R4R3R3O2O3J7J7k7k7p2p3L9L8L7L9k5k4k4k4n0
9451h3n1K6K7RJ0J0J0k4k5k4k5k3k3K2K2o0o0o1o0M1M1M1M0P0O9ppk8k9k9k9J5J5J5J5%JM3
9439a06M4L1j4l6M0Qo7m6%k6k7k4k4J01J01ooj4j4j5j4N0N1n6n7qrqqk7k6J9J9P9P9KLj7j6
9427d4j7j6J4J4J4J4K2K3n3n3K3K3K3K2p8q0l4l4M2M3M3M3M8M9MM%%m5m5K9K8j7o1j8N8N5
$$ plain form
9416 43 23 26 29 -17 -65 -83 -101 -43 14 40 67 47 28 21 14 6 0 -19 -37 -56 -75 -98 -122 -192 -261 -316 -372 -381 -391 -363 -335 -261 -188 -150 -113 -121 -129 -50 28 26
9403 26 23 6 -101 -138 -129 -154 -179 -124 -70 -61 -53 -90 -127 -81 -34 -33 -77 -48 71 189 215 200 185 165 144 130 116 56 -3 -49 -94 -140 -185 -211 -236 -240 -152
9392 -152 -75 -44 -3 -54 -99 -98 -59 -19 6 -58 -144 -184 -142 -99 -100 -101 -87 -72 -58 -43 9 62 116 169 139 110 77 44 25 -38 -85 -40 37 70 58 91
9381 91 65 -52 -95 -92 -74 -56 -41 -27 62 60 -22 -104 -132 -70 -7 -35 -35 -34 -38 -43 -64 -85 -106 -127 -126 -124 -76 -29 33 96 113 -22 -128 -142 -141 -140 -154 -168 -181
9369 -181 -195 -210 -225 -195 -165 -141 -118 -94 -70 -53 -35 -63 -90 -64 -37 -10 16 129 242 217 192 181 170 158 147 153 160 167 173 122 71 19 -31 5 42 79
9358 79 116 127 138 42 -53 -117 -181 -107 -33 -62 -90 -119 -148 -149 -150 -151 -151 -151 -150 -149 -148 -147 -146 -146 -145 -153 -161 -169 -177 -188 -200 -136 -71 -50 -28 -52 -76 -125 -174 -177 -180 -147 -114 -127
9344 -127 -140 -93 -47 -46 -46 -34 -22 65 153 232 311 344 376 325 274 299 323 497 671 960 1250 1619 2141 2725 2853 3033 3671 5124 7645
9335 7645 12486 21382 34010 37399 27364 16871 10411 6909 4830 3635 2825 2289 1870 1664 1523 1382 1154 926 804
$$ packed form
9416D3k0LLm6m8j8j8N8N7K6K7k0j9ppqoj9j8j9j9k3k4p0o9n5n6rj0K8K8P4P3L8L7qqP9P8k
9403B6lj7j07l7Rk5k5N5N4RQl7l7M6M7Jm4K9J19J18K6j5j5k0k1j4j4o0n9m6m5m6m5k6k5mQ8
9392a52P7L1M1n1m5JL9M0K5o4q6m0M2M3jjJ4J5J4J5N2N3N4N3l0k9l3l3j9o3m7M5P7L3j2L3
9381I1k6j17m3LJ8J8J5J4Q9kq2q2k8O2O3k8%Jmnk1k1k1k1JKM8M7O2O3J7j35j06j4JJj4j4j3
9369a81j4j5j5L0L0K4K3K4K4J7J8k8k7K6K7K7K6J13J13k5k5j1j1j2j1OPPOn1n1n2n0L6L7L7
9358G9L7J1J1r6r5o4o4P4P4k9k8k9k9jjj%%JJJJJ%Jqqqqj1j2O4O5K1K2k4k4m9m9llL3L3j3
9344a27j3M7M6J%J2J2Q7Q8P9P9L3L2n1n1K5K4J74J74K89K90L69N22N84J28J80O38J453K521
9335G645M841Q896J2628L389j0035j0493o460l502k079j195q10n36m19k06j41j41k28k28j22
$$ plain form
9329 804 682 616 550 534 518 449 455 495 535 478 422 266 109 12 21 21 67 116 166 218 271 262 253 244 236 233 230 226 223 197 170 144 117 54 -9 -70 -54 -28 -2
9317 -2 -47 -93 -130 -166 -198 -230 -240 -174 -79 15 9 -72 -154 -161 -158 -156 -150 -143 -136 -129 -122 -115 -66 -16 33 83 109 135 116 96 64 32 5 -22 -21 54 88 121 170 218 160
9304 160 102 118 134 147 160 194 182 192 278 257 130 45 5 19 78 114 75 20 12 80 148 147 146 146 145 162 180 197 214 193 171 150 128 86 44 -44 -132
9293 -132 -148 -164 -135 -105 -33 38 4 -29 -43 -56 -38 -67 -88 -32 48 83 61 39 60 81 63 46 51 56 108 159 165 171 118 65 24 -108 -189 -178 -149 -119
9282 -119 -70 -21 4 30 81 132 138 143 104 65 -19 -104 -154 -205 -118 -32 -49 -66 -83 -101 -135 -169 -158 -147 -102 -57 -89 -120 -163 -206 -173 -139 -73 -6 -47 -87
9270 -87 -110 -134 -134 -134 -84 -34 -7 20 -21 -62 -103 -144 -152 -159 -152 -100 -6 -4 -54 -104 -49 5 -16 -37 -93 -149 -184 -126 -75 -69 -49 -75 -120 -120 -102 -85 -69 -53 -59 -66
9258 -66 -90 -113 -137 -160 -142 -123 -50 -68 -79 -43 -40 -36 -32 -27 22 72 68 63 13 -36 -26 -15 -28 -41 7 56 105 154 106 59 -10 -80 -83 -86 -43 0 -4 -8 -12 -92 -188
9245 -188 -238 -209 -135 -83 -76 -116 -157 -163 -168 -151 -133 -197 -261 -248 -236 -164 -92 -43 4 -8 -21 -57 -93 -144 -196 -202 -208 -182 -157 -132 -107 -43 21 -21 -63 -128 -192
$$ packed form
9329H04j22o6o6j6j6o9OM0M0n7n6j56j57r7R%M6M9N0N2N3rrrqllmlk6k7k6k7o3o3o1J6K6K6
9317bm5m6l7l6l2l2j0O6R5R4oq1q2pLKOPPPPPM9N0M9N0K6K6j9k0l2l2k7k7JP5L4L3M9M8n8
9304A60n8J6J6J3J3L4j2J0Q6k1j27q5m0J4N9L6l9n5qO8O8jj%jJ7J8J7J7k1k2k1k2m2m2q8q8
9293a32j6j6K9L0P2P1l4l3j4j3J8k9k1N6Q0L5k2k2K1K1j8j7NNN2N1OOn3n3m1j32q1J1K9L0
9282a19M9M9K5K6N1N1ONl9l9q4q5n0n1Q7Q6j7j7j7j8l4l4J1J1M5M5l2l1m3m3L3L4O6O7m1m0
9270h7k3k4%%N0N0K7K7m1m1m1m1qpPN2R4Kn0n0N5N4k1k1n6n6l5N8N1OK0k6m5%J8J7J6J6op
9258f6k4k3k4k3J8J9P3j8j1L6LMMNM9N0mnn0m9J0J1j3j3M8M9M9M9m8m7o9p0llM3M3mmmq0r6
9245a88n0K9P4N2Pm0m1onJ7J8o4o4J3J2P2P2M9M7j2j3l6l6n1n2ooK6K5K5K5O4O4m2m2o5o4
$$ plain form
9234 -192 -150 -108 -58 -9 -6 -2 18 38 36 34 1 -32 -88 -144 -108 -73 -114 -154 -173 -191 -163 -136 -120 -104 -134 -163 -192 -220 -203 -140 -103 -142 -164 -140 -137 -180 -238
9222 -238 -219 -204 -189 -169 -149 -109 -69 -29 10 41 73 59 44 40 35 31 27 0 -25 24 74 39 4 -76 -157 -146 -135 -101 -68 -99 -131 -140 -148 -103 -58 -36 -14 -75
9210 -75 -136 -151 -167 -130 -93 -33 26 76 126 130 134 115 97 78 60 52 44 37 29 50 71 46 21 24 27 46 110 197 208 128 47 -1 -49 -38 48 128 132 107 82 102
9198 102 122 142 162 92 23 -43 -110 -70 15 47 2 -49 -25 54 134 92 4 -17 67 123 72 -48 -169 -190 -210 -231 -252 -202 -152 -102 -52 23 100 39
9188 39 -21 23 68 67 66 -5 -76 -102 -128 -176 -224 -195 -167 -131 -95 -59 -23 2 28 -21 -71 -69 -67 -65 -64 -60 -56 -53 -49 -11 26 -11 -50 11 73 28 -16 -33 -50 -113
9175 -113 -175 -149 -124 -98 -72 -64 -56 -89 -121 -140 -82 33 104 113 121 81 40 -10 -62 -114 -165 -164 -164 -163 -162 -161 -160 -159 -159 -173 -187 -201 -215 -144 -72 -46 -20 -25 -29 5 40
9162 40 0 -133 -224 -222 -190 -204 -212 -174 -127 -81 -108 -135 -149 -163 -131 -100 -64 -29 -39 -49 -76 -102 -174 -247 -225 -204 -137 -70 -11 47 0 -46 -128 -210 -215 -220 -219
9151 -219 -219 -172 -126 -134 -143 -198 -252 -194 -136 -124 -112 -61 -10 40 91 101 112 76 40 -18 -77 -91 -105 -95 -85 -29 25 -1 -28 -56 -83 -59 -36 -58 -80 -75 -71
$$ packed form
9234a92M2M2N0M9LMK0K0kkl3l3n6n6L6L5m1m0j9j8K8K7J6J6l0k9k9k8J7O3L7l9k2K4Lm3n8
9222b38J9J5J5K0K0M0M0M0L9L1L2j4j5mnmmk7k5M9N0l5l5q0q1J1J1L4L3l1l2rqM5M5K2K2o1
9210g5o1j5j6L7L7O0N9N0N0MMj9j8j9j8qqpqK1K1k5k5LLJ9O4Q7J1q0q1m8m8J1Q6Q0Mk5k5K0
9198A02K0K0K0p0o9o6o7M0Q5L2m5n1K4P9Q0m2q8k1Q4N6n1j20j21k1k0k1k1N0N0N0N0P5P7o1
9188C9o0M4M5jjp1p1k6k6m8m8K9K8L6L6L6L6K5K6m9n0KKKJMMLML8L7l7l9O1O2m5m4j7j7o3
9175a13o2K6K5K6K6QQl3l2j9N8J15P1RQm0m1n0n2n2n1J%JJJJJ%j4j4j4j4P1P2K6K6nmL4L5
9162D0m0j33r1KL2j4qL8M7M6k7k7j4j4L2L1L6L5j0j0k7k6p2p3K2K1O7O7N9N8m7m6q2q2nnJ
9151b19%M7M6qrn5n4N8N8J2J2N1N1N0N1J0J1l6l6n8n9j4j4J0J0N6N4k6k7k8k7K4K3k2k2NM
$$ plain form
9139 -71 -20 29 -24 -78 -132 -187 -221 -255 -213 -171 -102 -32 14 -29 -95 -116 -97 -78 -41 -96 -168 -193 -164 -89 13 25 -7 -41 -80 -119 -201 -282 -226 -170 -63
9129 -63 42 94 53 27 0 -16 57 122 35 -88 -120 -65 -10 49 110 134 158 137 115 98 80 62 45 -2 -51 -28 -6 53 21 -4 -30 -20 -10 -46
9118 -46 -82 -139 -195 -174 -154 -118 -82 -47 -11 31 73 91 17 -67 -153 -137 -122 -53 15 8 0 7 13 -56 -125 -131 -137 -143 -149 -174 -200 -118 -37 -19 -1 52 106 160 63
9106 63 -76 -124 -82 -39 -37 -34 -10 13 37 61 97 133 99 65 -31 -36 14 64 35 6 -22 -51 -119 -187 -149 -110 -100 -90 -80 -70 -59 -47 -82 -116 -83 -49
9095 -49 -16 16 -34 -85 -135 -186 -188 -189 -190 -192 -157 -122 -86 -51 9 69 84 100 35 -28 -93 -157 -154 -151 -102 -53 50 153 150 147 93 40 32 24 -13 -51 -89 -127 -102
9083 -102 -76 -51 -26 10 47 7 -31 -111 -192 -217 -150 -123 -96 -110 -123 -82 -41 0 40 88 137 160 92 38 -14 -74 -133 -134 -135 -130 -125 -160 -104 -53 -2 24 51
9071 51 1 -47 -84 -121 -51 18 -6 -30 -55 -79 -52 -25 1 28 -78 -185 -298 -319 -246 -173 -139 -106 -83 -59 -81 -103 -83 -63 -44 -24 -10 3 16 30
9061 30 -28 -87 -146 -204 -183 -162 -141 -120 -125 -131 -136 -142 -122 -102 -81 -61 -119 -177 -128 -80 2 84 117 58 -31 -29 -39 -50 -61 -72 -84 -95 -157 -219 -175 -130 -118 -107
$$ packed form
9139g1N1M9n3n4n4n5l4l4M2M2O9P0M6m3o6k1J9J9L7n5p2k5K9P5J02J2l2l4l9l9q2q1N6N6J07
9129f3J05N2m1k6k7j6P3O5q7j23l2N5N5N9O1K4K4k1k2j7j8j8j7m7m9K3K2N9l2k5k6J0J0l6
9118d6l6n7n6K1K0L6L6L5L6M2M2J8p4q4q6J6J5O9O8pqPOo9o9ooook5k6Q2Q1J8J8N3N4N4r7
9106F3j39m8M2M3KLK4K3K4K4L6L6l4l4r6nN0N0k9k9k8k9o8o8L8L9J0J0J0J0J1J2l5l4L3L4
9095d9L3L2n0n1n0n1kjjkL5L5L6L5O0O0J5J6o5o3o5o4LLM9M9J03J03lln4n3qql7l8l8l8K5
9083a02K6K5K5L6L7m0l8q0q1k5O7K7K7j4j3M1M1M1M0M8M9K3o8n4n2o0n9jjNNl5N6N1N1K6K7
9071E1n0m8l7l7P0O9k4k4k5k4K7K7K6K7j06j07j13k1P3P3L4L3K3K4k2k2K0K0J9K0J4J3J3J4
9061C0n8n9n9n8K1K1K1K1nonoK0K0K1K0n8n8M9M8Q2Q2L3n9q9Kj0j1j1j1j2j1o2o2M4M5J2J1
$$ plain form
9049 -107 -166 -224 -185 -54 30 23 35 46 51 57 40 24 -62 -149 -120 0 47 3 -12 16 37 12 -24 -107 -170 -142 -80 26 120 121 61 1 18 126 138
9038 138 103 75 91 97 102 111 119 74 29 29 30 -29 -90 -44 2 -55 -113 -170 -228 -256 -284 -267 -250 -187 -124 -167 -211 -205 -200 -194 -188 -181 -173 -166 -158 -138 -118 -52 13 42 71 54
9025 54 37 0 -35 3 43 118 194 193 193 87 -18 -99 -89 -47 -5 42 89 43 -1 28 59 55 51 47 44 68 92 70 48 3 -41 -41 -41 -59 -77 -49 -22 8
9013 8 38 23 8 -3 -15 -27 -39 -76 -113 -149 -186 -205 -225 -168 -111 -94 -77 -60 -43 -10 22 9 -3 -32 -61 -90 -119 -123 -128 -132 -137 -164 -191 -173 -155 -189 -223 -211
9001 -211 -200 -200 -200 -200 -200 -201 -203 -235 -222 -140 -134 -189 -244 -242 -240 -192 -144 -160 -176 -121 -65 -33 -77 -101 -79 -21 81 139 152 140 83 5 4 1 -1 3 7 2 43 58 -3 -53
8988 -53 -57 -91 -126 -122 -117 -113 -108 -66 -23 -83 -142 -199 -180 -102 -70 -112 -154 -153 -152 -166 -180 -117 -55 -56 -58 -59 -60 -90 -120 -151 -104 -35 -12 -65 -118 -107 -96 -85 -74 -130 -186
8976 -186 -196 -206 -186 -165 -144 -124 -92 -60 -27 4 8 11 -29 -71 -119 -166 -137 -109 -102 -96 -90 -84 -56 -28 -45 -63 -114 -165 -170 -175 -139 -102 -111 -120 -103 -86 -145 -204 -188 -173
8963 -173 -112 -51 -23 4 -44 -92 -69 -46 -68 -91 -107 -124 -186 -172 -125 -123 -117 -65 -21 22 -38 -98 -119 -140 -116 -91 -135 -179 -147 -115 -73 -31 9 51 44 37 27
$$ packed form
9049a07n9n8L9J31Q4pJ2J1NOj7j6q6q7K9J20M7m4j5K8K1k5l6q3o3K8O2J06R4Jo0o0J7J08J2
9038A38l5k8J6ONRQm5m5%Jn9o1M6M6n7n8n7n8k8k8J7J7O3O3m3m4ONOOPQPQK0K0O6O5K9K9j7
9025E4j7l7l5L8M0P5P6j%j06j05q1J0M2M2M7M7m6m4K9L1mmmlK4K4k2k2m5m4%%j8j8K8K7L0
9013HL0j5j5j1j2j2j2l7l7l6l7j9k0N7N7J7J7J7J7L3L2j3j2k9k9k9k9mnmnk7k7J8J8l4l4J2
9001b11J1%%%%jkl2J3Q2On5n5KKM8M8j6j6N5N6L2m4k4K2N8J02N8J3j2n7p8jlkMMnM1J5o1n0
8988e3ml4l5MNMNM2M3o0n9n7J9P8L2m2m2JJj4j4O3O2jkjjl0l0l1M7O9K3n3n3J1J1J1J1n6n6
8976a86j0j0K0K1K1K0L2L2L3L1MLm0m2m8m7K9K8POOOK8K8j7j8n1n1nnL6L7rrJ7J7n9n9J6J5
8963a73O1O1K8K7m8m8K3K3k2k3j6j7o2J4M7KON2M4M3o0o0k1k1K4K5m4m4L2L2M2M2M0M2ppj0
$$ plain form
8952 27 17 22 -19 -80 -65 -7 5 -27 -60 -44 -28 -12 2 -3 -10 -62 -115 -97 -79 -60 -42 -41 -40 -115 -191 -207 -223 -239 -255 -279 -303 -252 -200 -188 -176 -164 -152 -140
8940 -140 -127 -158 -188 -214 -194 -112 45 171 190 106 22 34 46 59 71 57 43 29 15 -33 -81 -130 -178 -180 -182 -183 -185 -225 -265 -228 -192 -231 -270 -290 -218 -120
8929 -120 -113 -125 -137 -229 -321 -366 -412 -396 -380 -318 -256 -204 -151 -98 -46 -37 -28 -19 -11 17 45 -2 -50 -33 -16 0 17 36 55 4 -47 -70 -1 91 185 172 158
8917 158 145 132 129 126 101 -14 -75 -90 -92 -93 -95 -97 -99 -101 -118 -135 -152 -169 -144 -119 -140 -161 -172 -183 -240 -296 -266 -235 -204 -173 -167 -162 -159 -156 -128 -145 -190 -145 -74 -49
8905 -49 -50 39 129 127 45 -35 -83 -131 -102 -74 18 110 126 142 112 81 51 20 -50 -122 -242 -270 -257 -197 -106 -107 -119 -132 -75 -17 22 62 26 -10 -86 -162
8894 -162 -233 -303 -304 -214 -152 -136 -97 -103 -87 -71 -53 -34 -16 1 -14 -30 -46 -62 -92 -123 -154 -185 -163 -141 -120 -98 -86 -74 -133 -193 -116 36 123 165 200
8883 200 189 125 60 27 -6 -40 -74 -130 -186 -166 -146 -198 -249 -255 -261 -282 -304 -325 -270 -193 -161 -205 -250 -248 -246 -199 -152 -131 -110 -87 -63 -73 -38 17 -3 -91 -134
8872 -134 -161 -188 -186 -183 -165 -102 -25 -24 -54 -84 -121 -159 -152 -144 -109 -75 -40 -6 1 8 15 22 18 14 9 5 -11 -27 -44 -61 -120 -180 -102 -24 -24 -25 -57 -44 -4 -71 -166 -186
$$ packed form
8952B7j0Nm1o1J5N8J2l2l3J6J6J6J4npn2n3J8J8J9J8JJp5p6j6j6j6j6k4k4N1N2J2J2J2J2J2
8940a40J3l1l0k6K0Q2J57J26J9q4q4J2J2J3J2j4j4j4j4m8m8m9m8kkjkm0m0L7L6l9l9k0P2R8
8929a20Pj2j2r2r2m5m6J6J6O2O2N2N3N3N2RRRQK8K8m7m8J7J7J6J7J9J9n1n1k3O9R2R4j3j4
8917A58j3j3llk5j15o1j5kjkkkkj7j7j7j7K5K5k1k1j1j1n7n6L0L1L1L1ONLLK8j7m5M5P1K5
8905d9jQ9R0kq2q0m8m8K9K8R2R2J6J6l0l1l0l1p0p2j20k8J3O0R1jj2j3N7N8L9M0l6l6p6p6
8894a62p1p0jR0O2J6L9oJ6J6J8J9J8J7j5j6j6j6l0l1l1l1K2K2K1K2J2J2n9o0P7J52Q7M2L5
8883B00j1o4o5l3l3l4l4n6n6K0K0n2n1ook1k2k1N5P7L2m4m5KKM7M7K1K1K3K4j0L5N5k0q8m3
8872a34k7k7KLJ8O3P7Jl0l0l7l8PQL5L4L5L4PPPPmmnmj6j6j7j7n9o0P8P8%jl2J3M0o7r5k0
$$ plain form
8858 -186 -151 -163 -220 -278 -233 -188 -144 -99 -72 -45 -18 8 -52 -113 -128 -143 -123 -103 -37 28 0 -29 -59 -88 -89 -91 -92 -93 -50 -6 -9 -11 -28 -46 -63 -81 -79 -78 -76
8846 -76 -75 -43 -12 -56 -101 -47 7 57 106 171 160 54 -50 -39 -27 -16 -4 22 49 122 195 190 186 136 86 17 -51 -74 -96 -81 -66 -5 55 37 19 -43
8835 -43 -107 -121 -135 -103 -71 -45 -18 -38 -57 -36 -15 -40 -65 -25 14 9 3 -39 -83 -81 -79 -39 0 -49 -175 -277 -303 -257 -134 -16 25 -21 -69 -69 -70 -117
8824 -117 -163 -157 -150 -98 -46 -51 -56 -107 -158 -212 -267 -154 -40 -21 -3 15 34 138 241 208 174 115 56 39 23 -11 -92 -144 -120 -52 15 11 7 -58 -125 -158
8813 -158 -115 -59 -4 56 116 88 59 31 3 -38 -81 -78 -74 -81 -88 -94 -101 -91 -80 -116 -151 -145 -139 -133 -127 -176 -225 -229 -232 -206 -181 -155 -130 -186 -242 -222 -202 -185 -168 -151 -134
8800 -134 -136 -139 -64 9 21 32 44 56 76 97 71 46 26 6 -58 -124 -140 -156 -171 -187 -170 -153 -167 -134 -103 -148 -147 -146 -94 -43 -98 -153 -139 -125 -112 -98 -114
8789 -114 -130 -100 -70 -28 13 -20 -54 -123 -192 -155 -117 -121 -124 -127 -131 -95 -59 -24 -64 -125 -139 -139 -139 -145 -151 -113 -29 8 -59 -90 -75 -88 -102 -113 -124 -118 -113 -108 -102 -100 -97 -140
8776 -140 -183 -189 -195 -125 -54 -74 -93 -158 -223 -197 -172 -192 -212 -200 -188 -176 -164 -139 -115 -45 25 0 -24 57 139 155 170 79 -11 -6 -1 49 100 66 32 -1 -34
$$ packed form
8858a86L5j2n7n8M5M5M4M5K7K7K7K6o0o1j5j5K0K0O6O5k8k9l0k9jkjjM3M4lkj7j8j7j8KJK
8846g6JL2L1m4m5N4N4N0M9O5j1j06j04J1J2J1J2K6K7P3P3nmn0n0o9o8k3k2J5J5O1O0j8j8o2
8835d3o4j4j4L2L2K6K7k0j9K1K1k5k5M0L9nom2m4KKM0L9m9j26j02k6M6J23J18M1m6m8%jm7
8824a17m6OPN2N2nnn1n1n4n5J13J14J9J8J8J9J04J03l3l4n9n9j7j6l4q1n2K4O8O7mmo5o7l3
8813a58M3N6N5O0O0k8k9k8k8m1m3LMppopJ0J1l6l5OOOOm9m9mlK6K5K6K5n6n6K0K0J7J7J7J7
8800a34klP5P3J2J1J2J2K0K1k6k5k0k0o4o6j6j6j5j6J7J7j4L3L1m5JJN2N1n5n5J4J4J3J4j6
8789a14j6L0L0M2M1l3l4o9o9L7L8mllmL6L6L5m0o1j4%%ooL8Q4L7o7l1J5j3j4j1j1ONNOKLm3
8776a40m3ooP0P1k0j9o5o5K6K5k0k0J2J2J2J2K5K4P0P0k5k4Q1Q2J6J5r1r0NNN0N1l4l4l3l3
$$ plain form
8764 -34 -89 -143 -126 -110 -71 -123 -149 -130 -132 -133 -132 -131 -104 -77 -96 -115 -150 -185 -220 -255 -176 -98 -89 -81 -31 110 146 90 41 -6 15 37 48 58 -7 -73 -59 -46
8752 -46 12 71 41 11 -18 -48 -75 -102 -129 -156 -185 -215 -245 -274 -275 -277 -232 -187 -132 -76 -67 -57 -25 5 -38 -83 -120 -158 -195 -233 -261 -289 -328 -276 -205 -227 -219
8741 -219 -166 -142 -165 -158 -152 -153 -154 -155 -156 -169 -182 -194 -207 -175 -144 -116 -87 -11 19 -7 -125 -180 -188 -228 -268 -251 -234 -262 -291 -271 -252 -186 -121 -81 -42 -2 37 63
8729 63 89 69 49 52 55 58 61 54 47 -6 -59 -26 5 38 71 91 112 56 1 -76 -153 -154 -156 -117 -78 -85 -92 -94 -96 -52 -8 1 12 22 33 23 12 2 -8 -15 -23 13 51
8716 51 6 -38 -83 -128 -130 -133 -135 -138 -114 -91 -113 -136 -136 -137 -138 -139 -151 -163 -99 -35 -38 -41 -45 -48 -78 -108 -138 -168 -171 -174 -131 -88 -115 -143 -171 -198 -222 -246 -193 -141 -109 -78
8703 -78 -46 -15 -30 -44 -13 16 65 114 57 0 -41 -82 -77 -73 -69 -65 -16 33 19 6 -7 -20 -12 -3 4 12 3 -5 -14 -24 -21 -19 -17 -15 -51 -88 -119 -150 -175 -109 -83 -148 -187
8689 -187 -133 -66 -44 -26 -8 -37 -112 -144 -85 -8 22 56 90 96 11 -42 -95 -48 -1 55 112 92 73 107 141 129 118 80 43 -39 -123 -132 -142 -151 -160 -160 -160 -160
8678 -160 -160 -170 -181 -85 11 70 129 81 34 -31 -98 -87 -77 -148 -219 -214 -208 -192 -177 -161 -146 -144 -143 -173 -157 -101 -136 -189 -196 -217 -239 -213 -186 -125 -63 -47 -31 27
$$ packed form
8764c4n5n4J7J6L9n2k6J9kjJJK7K7j9j9l5l5l5l5P9P8RQN0J41L6n6m9m7K1K2J1J0o5o6J4J3
8752d6N8N9l0l0k9l0k7k7k7k7k9l0l0k9jkM5M5N5N6RJ0L2L0m3m5l7l8l7l8k8k8l9N2P1k2Q
8741b19N3K4k3POjjjjj3j3j2j3L2L1K8K9P6L0k6j18n5qm0m0J7J7k8k9K0J9O6O5M0L9M0L9K6
8729F3K6k0k0LLLLppn3n3L3L1L3L3K0K1n6n5p7p7jkL9L9ppkkM4M4RJ1J0J1j0j1j0j0pqL6L8
8716E1m5m4m5m5klklK4K3k2k3%jjjj2j2O4O4llmll0l0l0l0llM3M3k7k8k8k7k4k4N3N2L2L1
8703g8L2L1j5j4L1K9M9M9n7n7m1m1NMMMM9M9j4j3j3j3QRPQrqrj0LKKKl6l7l1l1k5O6K6o5l9
8689a87N4O7K2J8J8k9p5l2N9P7L0L4L4Oq5n3n3M7M7N6N7k0j9L4L4j2j1l8l7q2q4rj0rr%%%
8678a60%j0j1R6R6N9N9m8m7o5o7J1J0p1p1NOJ6J5J6J5KJl0J6N6l5n3pk1k2K6K7O1O2J6J6N8
$$ plain form
8666 27 85 98 111 80 49 18 -12 -20 -28 -82 -136 -154 -173 -188 -204 -173 -98 3 13 -31 -77 -129 -180 -151 -121 -92 -62 -145 -228 -173 -118 -88 -58 -74 -90 -90
8655 -90 -90 -90 -90 -114 -137 -115 -93 -37 18 144 271 301 240 185 129 88 46 62 -13 -85 -67 0 69 138 208 172 135 143 151 153 155 141 35 -116 -176 -114 -53
8643 -53 8 70 108 54 6 -40 -67 -94 -75 -57 -55 -52 -50 -48 -14 18 6 -5 -17 -29 3 37 18 -1 -27 39 95 151 136 122 163 204 199 194 202 210 264 318 274
8631 274 230 180 131 131 40 46 52 74 95 162 229 268 306 344 383 433 482 532 582 679 777 960 1234 1504 1774 2228 2896 3746 4747 5955 7559
8622 7559 9960 13794 20143 30243 43193 51173 46640 34759 23895 16538 12036 9272 7446 6078 4957 4050 3337
8616 3337 2838 2415 2083 1824 1657 1551 1444 1290 1136 942 901 888 876 878 790 704 618 526 434 415 396 422 449 498 547 490 433 389 346 303
8607 303 259 198 136 121 105 158 212 189 166 183 201 294 387 522 657 947 1236 1556 1663 1447 1079 774 561 403 336 298 260 303 347
8598 347 343 339 290 240 195 150 151 152 138 125 111 97 131 165 199 233 247 262 200 138 107 76 100 215 255 295 340 386 452 518 585 651 656 661 717 773 882
$$ packed form
8666B7N8J3J3l1l1l1l0qqn4n4j8j9j5j6L1P5J01J0m4m6n2n1K9L0K9L0q3q3N5N5L0L0j6j6%
8655i0%%%k4k3K2K2N6N5J26J27L0o1n5n6m1m2J6p5p2J8O7O9O9P0l6l7QQKKj4j06j51o0O2O1
8643e3O1O2L8n4m8m6k7k7J9J8KLKKL4L2j2j1j2j2L2L4j9j9k6O6N6N6j5j4M1M1nnQQN4N4m4
8631B74m4n0m9%r1OOK2K1O7O7L9L8L8L9N0M9N0N0R7R8J83K74K70K70M54O68Q50J001J208J604
8622G559K401L834O349J0100J2950P980m533j1881j0864p357m502k764j826j368j121r07p13
8616C337m99m23l32k59j67j06j07j54j54j94m1j3j2Kq8q6q6r2r2j9j9K6K7M9M9n7n7m4m3m3
8607C03m4o1o2j5j6N3N4k3k3J7J8R3R3J35J35K90K89L20J07k16l68l05k13j58o7l8l8M3M4
8598C47mmm9n0m5m5JJj4j3j4j4L4L4L4L4J4J5o2o2l1l1K4J15M0M0M5M6O6O6O7O6NNN6N6J09
$$ plain form
8586 882 1082 1325 1661 2000 2492 3105 4176 6078 9718 16365 24872 25795 18211 11046 6778 4521 3208 2504 2074 1743
8580 1743 1411 1183 1046 864 682 582 483 441 400 359 317 286 256 265 274 329 293 262 232 221 210 200 189 223 257 297 245 206 167 122 77 90
8570 90 102 110 117 136 64 18 18 62 106 152 199 151 102 57 11 17 69 150 139 112 131 141 105 101 50 -2 -9 46 102 161 221 207 193 134 74 -5 -85 -60
8559 -60 10 91 80 17 -46 -103 -161 -173 -184 -185 -186 -141 -96 -86 -75 -64 -54 -46 -38 -31 -23 15 54 93 132 114 95 31 -32 -50 -67 -39 -11 0 11 -23 -57 9
8547 9 75 142 209 115 21 -63 -147 -205 -110 -29 4 14 23 29 35 33 31 29 27 42 57 72 86 4 -77 -83 -89 -83 -77 -25 26 34 41 34 -18 -133 -157 -67 21 47 73 93
8534 93 113 136 68 -49 -167 -268 -277 -256 -235 -232 -138 -44 -41 -34 -27 -25 -23 -4 15 35 54 35 15 -3 -22 -30 -38 -1 36 47 58 24 -10 -6 -1 2 6 7 7 -37 -83
8521 -83 -52 -22 8 38 -13 -66 -42 -18 -65 -112 -83 -54 -100 -147 -117 -43 37 26 -36 -100 -106 -112 -75 -39 -31 -69 -89 -19 54 82 36 37 93 104 97 91 3 -85
8509 -85 -167 -250 -282 -223 -140 -104 -132 -114 -79 -45 -24 -3 17 38 68 99 83 68 53 39 24 9 -49 -109 -122 -136 -143 -149 -110 -71 -88 -105 -15 73 81 88 95 102
$$ packed form
8586H82K00K43L36L39M92O13J071J902L640O647Q507R23p584p165m268k257j313p04m30l31
8580A743l32k28j37j82j82j00r9m2m1m1m2l1l0RRN5l6l1l0j1j1j0j1L4L4M0n2l9l9m5m5J3
8570I0J2QPJ9p2m6%M4M4M6M7m8m9m5m6ON2Q1j1k7J9J0l6mn1n2pN5N6N9O0j4j4n9o0p9q0K5
8559f0P0Q1j1o3o3n7n8j2j1jjM5M5J0J1J1J0QQPQL8L9L9L9j8j9o4o3j8j7K8K8J1J1l4l4O6
8547IO6O7O7r4r4q4q4n8R5Q1L3J0ROOkkkkJ5J5J5J4q2q1ooOON2N1QPpn2j15k4R0Q8K6K6K0
8534I3K0K3o8j17j18j01rK1K1LR4R4LPPKKJ9J9K0J9j9k0j8j9qqL7L7J1J1l4l4MNLMJ%m4m6
8521h3L1L0L0L0n1n3K4K4m7m7K9K9m6m7L0P4Q0j1o2o4ooL7L6Ql8k0P0P3K8m6JN6J1poq8q8
8509h5q2q3l2N9Q3L6k8J8L5L4K1K1K0K1L0L1j6j5j5j4j5j5n8o0j3j4poL9L9j7j7R0Q8QPPP
$$ plain form
8497 102 77 52 27 2 7 11 62 113 108 103 99 94 26 -41 -33 -25 -67 -110 -76 -42 -3 35 25 -76 -131 -93 -68 -42 -37 -31 -72 -112 -93 -73 -54 -34 15 64 68 72
8485 72 73 74 35 -3 -27 40 102 164 174 184 212 239 275 219 139 59 23 -12 -48 -84 -66 -48 -31 -13 -38 -64 -13 37 39 41 43 45 59 74 43 12 -25 -62
8473 -62 -77 -91 -64 -38 -11 15 59 102 146 189 204 219 163 108 15 14 104 195 428 752 738 449 257 65 -31 24 70 116 64 13 3 -7 -40
8463 -40 -73 -143 -213 -207 -200 -159 -119 -83 -48 -14 -71 -123 -174 -151 -128 -151 -173 -110 -46 -59 -71 -80 -88 -73 -58 -8 42 48 53 31 9 10 11 -22 -55 -46 -36 -84 -178 -275
8451 -275 -281 -202 -123 -44 34 63 1 -61 -32 25 82 91 7 -92 -192 -273 -263 -172 -82 -38 -85 -173 -214 -150 -86 -53 -20 -9 0 -33 -66 -54 -42 -68 -93 -95
8439 -95 -97 -61 -25 -35 -45 -32 -19 -6 6 7 7 28 48 5 -82 -123 -73 -22 -18 -58 -98 -74 -50 -26 -2 7 18 28 39 8 -21 48 119 129 48 -7 -16 4
8428 4 25 3 -19 -73 -128 -138 -147 -115 -84 -98 -113 -108 -103 -76 -48 -15 16 95 173 104 35 42 49 31 12 -6 -24 -3 18 -5 -74 -117 -69 20 64 80 6 -91
8416 -91 -143 -116 -90 -38 14 14 14 -31 -77 -151 -225 -253 -282 -190 -98 -52 -6 30 68 75 6 -114 -189 -219 -248 -233 -218 -157 -95 -66 -37 -23 -55 -55 21 98 175
$$ packed form
8497A02k5k5k5k5NMN1N1nnmno8o7QQm2m3L4L4L9L8j0j01n5L8K5K6NOm1m0J9K0J9K0M9M9MM
8485G2JJl9l8k4O7O2O2J0J0K8K7L6n6q0q0l6l5l6l6J8J8J7J8k5k6N1N0KKKKJ4J5l1l1l7l7
8473f2j5j4K7K6K7K6M4M3M4M3J5J5n6n5r3jR0R1K33L24j4k89j92j92r6N5M6M6n2n1j0j0l3
8463d0l3p0p0OPM1M0L6L5L4n7n2n1K3K3k3k2O3O4j3j2rqJ5J5N0N0ONk2k2JJl3l3RJ0m8r4r7
8451b75oP9P9P9P8K9o2o2K9N7N7Rq4r9j00q1J0R1R0M4m7q8m1O4O4L3L3J1Rl3l3J2J2k6k5k
8439i5kL6L6j0j0J3J3J3J2J%K1K0m3q7m1N0N1Mm0m0K4K4K4K4RJ1J0J1l1k9O9P1J0q1n5rK0
8428DK1k2k2n4n5j0rL2L1j4j5NNK7K8L3L1P9P8o9o9PPj8j9j8j8K1K1k3o9m3M8Q9M4J6p4r7
8416i1n2K7K6N2N2%%m5m6p4p4k8k9R2R2M6M6L6L8Po9j20p5l0k9J5J5O1O2K9K9J4l2%P6P7P7
$$ plain form
8404 175 140 105 24 -55 -66 -76 -86 -96 -133 -169 -205 -242 -183 -124 -111 -98 -120 -142 -88 -34 -34 -35 -35 -35 -69 -103 -92 -80 -22 35 94 152 117 82 47 13 -30
8393 -30 -73 -59 30 78 20 -39 -54 -8 113 175 191 194 196 196 196 78 -40 -86 -25 42 33 2 17 80 143 102 61 34 7 25 44 54 65 0 -66 -50
8382 -50 -35 -19 -3 -3 -3 -49 -95 -47 0 3 5 -30 -67 -104 -140 -158 -176 -149 -121 -107 -94 -35 23 -2 -29 -10 8 -26 -62 -97 -132 -166 -200 -188 -176 -114 -52
8370 -52 -96 -140 -157 -174 -114 -55 32 120 153 94 90 86 30 -25 -86 -146 -130 -115 -82 -50 -17 15 48 82 70 58 101 144 141 139 76 13 -51 -117 -149 -228 -258
8359 -258 -198 -80 -8 -72 -136 -103 -70 -36 -3 2 9 15 21 -25 -72 -73 -75 -90 -106 -122 -138 -170 -202 -234 -266 -208 -150 -137 -124 -121 -118 -117 -117 -96 -122 -176 -138 -32 28
8347 28 -16 -61 -97 -132 -92 -51 -50 -50 -95 -140 -107 -74 -117 -160 -83 -5 -35 -64 -64 -63 -63 -63 -113 -164 -77 8 52 96 93 91 46 0 -1 -4 -15 -72 -155 -146 -103 -60 -12
8334 -12 35 65 94 78 61 77 93 63 33 -22 -78 -27 23 -6 -35 -65 -95 -161 -227 -217 -207 -201 -194 -188 -181 -183 -185 -111 -37 -51 -65 -34 -3 15 34 -22 -79 -64
8322 -64 -48 -38 -28 -49 -161 -227 -202 -197 -191 -232 -180 -141 -101 -56 -10 -40 -70 -55 -39 19 79 62 45 41 37 34 30 21 12 4 -4 -11 -18 -25 -32 -50 -69 -87 -106 -95 -83 -72
$$ packed form
8404A75l5l5q1p9j1j0j0j0l7l6l6l7N9N9J3J3k2k2N4N4%j%%l4l4J1J2N8N7N9N8l5l5l5l4m3
8393c0m3J4Q9M8n8n9j5M6J21O2J6LK%%j18j18m6O1O7rl1J5O3O3m1m1k7k7J8J9J0J1o5o6J6
8382e0J5J6J6%%m6m6M8M7LKl5l7l7l6j8j8K7K8J4J3N9N8k5k7J9J8l4l6l5l5l4l4J2J2O2O2
8370e2m4m4j7j7O0N9Q7Q8L3n9mmn6n5o1o0J6J5L3L2L3L2L3L4j2j2M3M3lko3o3o4o6l2p9l0
8359b58O0J18P2o4o4L3L3L4L3NPOOm6m7jkj5j6j6j6l2l2l2l2N8N8J3J3LLJ%K1k6n4L8J06O0
8347B8m4m5l6l5M0M1J%m5m5L3L3m3m3P7P8l0k9%J%%n0n1Q7Q5M4M4lkm5m6jlj1n7q3RM3M3M8
8334a2M7L0K9j6j7J6J6l0l0n5n6N1N0k9k9l0l0o6o6J0J0OPOPkkP4P4j4j4L1L1J8J9n6n7J5
8322f4J6J0J0k1j12o6K5NOm1N2L9M0M5M6l0l0J5J6N8O0j7j7mmlmrrqqppppj8j9j8j9J1J2J1
$$ plain form
8309 -72 -61 -95 -128 -116 -104 -78 -51 -25 1 6 11 17 22 -12 -48 -38 -28 54 138 84 30 -15 -60 -60 -60 -35 -9 16 41 10 -20 -5 9 -76 -163 -203 -244 -194
8297 -194 -145 -95 -46 15 77 87 98 121 53 -39 -131 -155 -180 -204 -228 -187 -146 -105 -63 -74 -84 -134 -185 -194 -111 -34 42 47 52 56 61 36 12 -12 -36 -69 -102
8286 -102 -135 -168 -192 -217 -195 -174 -159 -145 -130 -115 -98 -81 -64 -47 -47 -47 -93 -139 -224 -310 -289 -268 -222 -176 -131 -85 -76 -67 -59 -50 -32 -14 -41 -69 -119 -169 -167 -166 -192
8274 -192 -128 -18 0 -63 -127 -151 -176 -112 -48 14 78 112 145 179 213 175 136 98 59 72 84 96 109 85 61 -7 -77 -122 -167 -167 -166 -164 -163 -164 -166 -174 -229 -263
8262 -263 -206 -145 -85 -65 -45 -17 10 38 66 16 -32 -37 -41 -84 -127 -169 -212 -157 -102 -46 8 -28 -65 -102 -139 -154 -169 -184 -200 -182 -164 -100 -36 41 119 121
8251 121 122 89 55 -24 -104 -98 -91 -40 11 63 115 91 67 29 -9 -47 -86 -127 -169 -134 -100 -13 73 84 95 23 -47 -72 -98 -51 -4 -3 -1 4 11 -27 -66 -63 -60
8239 -60 -57 -54 -50 -46 -41 -37 -41 -45 -50 -54 -79 -105 -85 -65 -10 43 52 61 70 78 87 96 88 79 -5 -89 -100 -110 -121 -132 -62 6 0 -7 -39 -71 -103 -135 -92 -49 -82 -115 -141 -167 -148
8225 -148 -128 -82 -36 4 45 59 -18 -44 -70 -36 -3 -16 -28 -6 15 -7 -31 -3 24 7 -10 -24 -38 -6 25 86 147 101 55 55 56 11 -33 2 38 -1
$$ packed form
8309g2J1l4l3J2J2K6K7K6K6NNONl4l6J0J0Q2Q4n4n4m5m5%%K5K6K5K5l1l0J5J4q5q7m0m1N0
8297a94M9N0M9O1O2J0J1K3o8r2r2k4k5k4k4M1M1M1M2j1j0n0n1rQ3P7P6NNMNk5k4k4k4l3l3
8286a02l3l3k4k5K2K1J5J4J5J5J7J7J7J7%%m6m6q5q6K1K1M6M6M5M6RRQRJ8J8k7k8n0n0KJk6
8274a92O4J10J8o3o4k4k5O4O4O2O4L4L3L4L4l8l9l8l9J3J2J2J3k4k4o8p0m5m5%JKJjkqn5l4
8262b63N7O1O0K0K0K8K7K8K8n0m8nmm3m3m2m3N5N5N6N4l6l7l7l7j5j5j5j6J8J8O4O4P7P8K
8251A21Jl3l4p9q0OPN1N1N2N2k4k4l8l8l8l9m1m2L5L4Q7Q6J1J1p2p0k5k6M7M7JKNPl8l9LL
8239f0LLMMNMmmnmk5k6K0K0N5N3RRRQRRqrq4q4j1j0j1j1P0O8opl2l2l2l2M3M3l3l3k6k6J9
8225a48K0M6M6M0M1J4p7k6k6L4L3j3j2K2K1k2k4K8K7j7j7j4j4L2L1O1O1m6m6%Jm5m4L5L6l9
$$ plain form
8214 -1 -87 -191 -220 -192 -209 -217 -224 -230 -235 -232 -153 -71 10 45 79 85 15 -47 -34 -23 -88 -154 -176 -181 -187 -199 -211 -121 -32 1 -40 -116 -192 -186 -180 -128 -76 -40 -4 31
8201 31 67 87 108 53 -2 -58 -115 -122 -130 -240 -304 -302 -224 -168 -156 -160 -164 -121 -78 -35 7 38 70 97 124 85 -28 -77 -81 -114 -102 -39 -21 -9 48 103 113
8190 113 74 36 95 154 144 28 -52 -88 -85 -82 -30 20 25 30 80 131 58 -13 -85 -158 -171 -185 -152 -120 -97 -74 -51 -29 -110 -192 -243 -218 -182 -192 -198 -157 -78
8178 -78 1 8 14 19 24 28 33 -38 -109 -156 -111 -28 54 36 18 -34 -88 -141 -194 -164 -134 -127 -120 -143 -166 -112 -59 -43 -27 -12 3 45 86 51 17 -11 -40 -45 -51 -43 -35
8166 -35 18 72 45 17 35 53 66 79 16 -46 -33 -21 -53 -86 -111 -136 -142 -56 3 -26 -46 -65 -23 17 -16 -51 -13 24 91 66 20 -25 28 83 49 15
8154 15 27 39 5 -28 -85 -142 -120 -98 -122 -146 -157 -167 -132 -97 -67 -38 -54 -70 -59 -48 -25 -94 -184 -183 -194 -204 -189 -174 -159 -144 -110 -77 -66 -55 -104 -154
8143 -154 -158 -161 -115 -68 1 71 102 134 90 46 28 11 40 68 98 128 113 97 25 -46 -124 -110 -76 -42 -3 36 21 6 13 21 37 54 24 -4 3 10 18 26 -1
8131 -1 -29 -80 -131 -95 -59 -69 -79 -43 -8 1 12 -48 -155 -211 -176 -190 -204 -167 -129 -136 -142 -195 -247 -213 -179 -252 -325 -334 -344 -278 -211 -84 43 91 48 -59
$$ packed form
8214aq6j04k9K8j7qponLP9Q2Q1L5L4Op0o2J3J1o5o6k2noj2j2R0Q9L3m1p6p6OON2N2L6L6L5
8201C1L6K0K1n5n5n6n7pqj10o4KP8N6J2mmM3M3M3M2L1L2K7K7l9j13m9ml3J2O3J8J2N7N5J0
8190A13l9l8N9N9j0j16q0l6LLN2N0NNN0N1p3p1p2p3j3j4L3L2K3K3K3K2q1q2n1K5L6j0oM1P9
8178g8P9PONNMNp1p1m7M5Q3Q2j8j8n2n4n3n3L0L0PPk3k3N4N3J6J6J5J5M2M1l5l4k8k9noQQ
8166c5N3N4k7k8J8J8J3J3o3o2J3J2l2l3k5k5oQ6N9k9k0j9M2M0l3l5L8L7O7k5m6m5N3N5l4l4
8154A5J2J2l4l3n7n7K2K2k4k4j1j0L5L5L0K9j6j6J1J1K3o9r0Jj1j0J5J5J5J5L4L3J1J1m9n0
8143a54mlM6M7O9P0L1L2m4m4j8j7K9K8L0L0j5j6p2p1p8J4L4L4L9L9j5j5PQJ6J7l0k8PPQQk7
8131ak8n1n1L6L6j0j0L6L5RJ1o0j07n6L5j4j4L7L8pon3n2L4L4p3p3rj0O6O7J27J27M8m3j07
$$ plain form
8120 -59 -75 -76 -124 -238 -353 -334 -315 -251 -188 -170 -153 -171 -189 -130 -72 -54 -35 -17 0 -12 -26 -40 -54 -36 -18 44 108 68 28 46 -27 -83 -48 6 61
8109 61 94 127 53 -20 -50 -80 -64 -48 10 70 22 -24 2 29 33 37 76 116 132 149 85 20 -43 -107 -146 -184 -177 -170 -102 -33 57 149 134 120 60 0 -41
8098 -41 -82 -119 -156 -153 -74 32 94 105 117 23 -70 -77 -9 57 123 125 50 19 -12 -24 -36 -48 -60 -92 -124 -157 -189 -220 -251 -206 -115 -107 -175 -244 -236 -212 -233
8086 -233 -296 -313 -228 -143 -116 -165 -205 -200 -226 -251 -231 -211 -160 -155 -200 -169 -110 -96 -133 -124 -157 -236 -225 -107 -73 -84 -31 21 -7 -37 -9 -27 -67 -31 21 -2
8075 -2 -80 -112 -28 54 95 136 111 85 59 34 28 21 15 9 14 19 24 30 -17 -64 -111 -158 -161 -163 -89 -16 -14 -12 -8 -3 17 83 121 83 0 -83 -95 -107 -34 37 34 30 0 -30
8061 -30 -61 -92 -84 -76 -22 31 42 53 66 2 -92 -111 -70 -30 -17 -4 3 10 48 -6 -80 -109 -126 -142 -150 -158 -161 -73 14 11 -54 -121 -193 -265 -224 -182 -187 -191 -156 -122
8049 -122 -87 -53 -41 -29 27 84 92 99 107 114 120 127 88 48 60 71 36 2 -30 -62 -50 7 66 33 4 65 115 164 143 122 93 65 82 99 82 66 49 33
8037 33 13 -6 -71 -137 -140 -144 -102 -60 -72 -84 -19 44 -6 -57 -102 -148 -233 -228 -197 -167 -135 -104 -118 -133 -71 -9 -51 -94 -88 -37 42 30 -39 -63 -73 -83 -141
$$ packed form
8120e9j6jm8j14j15J9J9O4O3J8J7j8j8N9N8J8J9J8J7j2j4j4j4J8J8O2O4m0m0J8p3n6L5N4N5
8109F1L3L3p4p3l0l0J6J6N8O0m8m6K6K7MML9M0J6J7o4o5o3o4l9l8PPO8O9R0R2j5j4o0o0m1
8098d1m1l7l7LP9J06O2J1J2r4r3pO8O6O6Kp5l1l1j2j2j2j2l2l2l3l2l1l1M5R1Qo8o9QK4k1
8086b33o3j7Q5Q5K7m9m0Nk6k5K0K0N1Nm5L1N9J4l7Rl3p9J1J18L4j1N3N2k8l0K8j8m0L6N2k3
8075bp8l2Q4Q2M1M1k5k6k6k5opooNNNOm7m7m7m7lkP4P3KKMNK0O6L8l8q3q3j2j2P3P1lml0l0
8061c0l1l1QQN4N3J1J1J3o4r4j9M1M0J3J3PPL8n4p4k9j7j6qqlQ8Q7lo5o7p2p2M1M2nmL5L4
8049a22L5L4J2J2N6N7QPQPOPl9m0J2J1l5l4l2l2J2N7N9l3k9O1N0M9k1k1k9k8J7J7j7j6j7j6
8037C3k0j9o5o6lmM2M2j2j2O5O3n0n1m5m6q5NL1L0L2L1j4j5O2O2m2m3ON1P9j2o9k4j0j0n8
$$ plain form
8026 -141 -200 -213 -225 -217 -208 -167 -173 -187 -109 -32 -45 -32 26 -24 -121 -85 -3 0 -43 -40 -36 9 56 30 4 -24 -53 -63 -119 -189 -183 -152 -74 4 38 49 15 -41
8014 -41 -98 -130 -161 -192 -224 -252 -279 -258 -237 -135 11 70 51 51 50 0 -51 -37 -22 37 97 75 53 30 8 -22 -52 -83 -114 -116 -118 -119 -121 -71 -22 -48 -75
8002 -75 -70 -65 -106 -147 -145 -143 -141 -139 -72 -4 -13 -22 -30 -38 -45 -53 -61 -69 -76 -84 -98 -112 -127 -141 -96 -50 -112 -173 -175 -176 -178 -179 -167 -155 -173 -146 -70 -70 -101 -131 -118 -105 -92 -79 -118 -158
7988 -158 -151 -145 -118 -91 -110 -130 -123 -116 -110 -103 -65 -28 -36 -44 -40 -37 -34 -30 -30 -29 -74 -119 -132 -144 -157 -170 -206 -242 -171 -101 -46 9 18 28 24 21 18 14 -47 -110 -84 16 93 63
7975 63 27 36 73 110 104 98 80 62 44 26 57 89 120 152 68 -15 -54 -92 -88 -84 -81 -77 -108 -140 -125 -111 -118 -126 -87 -49 -17 14 0 -59 -116 -96 -51 -51 -63 -75
7962 -75 -43 -12 -28 -43 -15 59 90 15 -65 -100 -139 -133 -103 -73 -66 -59 -52 -44 10 65 13 -84 -144 -129 -83 -37 -83 -129 -99 -70 -96 -123 -166 -253 -314 -298 -192
7951 -192 -41 54 44 20 -3 -75 -148 -144 -140 -79 -18 -3 11 0 -11 -22 -34 -39 -44 -49 -54 -54 -54 -100 -70 -28 -31 -4 22 19 17 14 12 38 65 135 128 89 50 7 -36
7938 -36 -27 -18 -55 -92 -94 -96 -103 -33 21 -30 -116 -157 -159 -116 -72 -29 1 32 41 49 22 -4 -31 -58 -68 -78 -89 -99 -49 0 49 99 144 190 222 147 12 -76 -116
$$ packed form
8026a41n9j3j2QRM1oj4P8P7j3J3N8n0r7L6Q2Lm3LMM5M7k6k6k8k9j0n6p0OL1P8P8L4J1l4n6
8014d1n7l2l1l1l2k8k7K1K1J02J46N9j9%jn0n1J4J5N9O0k2k2k3k2l0l0l1l1kkjkN0M9k6k7
8002g5NNm1m1KKKKO7O8rrqqpqqqpqj4j4j5j4M5M6o2o1kjkjJ2J2j8K7P6%l1l0J3J3J3J3l9m0
7988a58POK7K7j9k0PPOPL8L7qqMLLM%Jm5m5j3j2j3j3l6l6P1P0N5N5RJ0mllmo1o3K6J00P7l0
7975F3l6RL7L7ooj8j8j8j8L1L2L1L2q4q3l9l8MMLMl1l2J5J4pqL9L8L2L1j4n9n7K0M5%j2j2
7962g5L2L1j6j5K8P4L1p5q0l5l9OL0L0PPPQN4N5n2r7o0J5M6M6m6m6L0K9k6k7m3q7o1J6J06
7951a92J51R5j0k4k3p2p3MMO1O1J5J4j1j1j1j2nnnn%%m6L0M2lK7K6lklkK6K7P0pl9l9m3m3
7938c6RRl7l7kkpP0N4n1q6m1kM3M4M3L0L1RQk7k6k7k7j0j0j1j0N0M9M9N0M5M6L2p5j35q8m0
$$ plain form
7926 -116 -111 -112 -113 -111 -109 -121 -133 -192 -250 -239 -229 -173 -117 -100 -83 -94 -181 -235 -212 -185 -205 -202 -154 -109 -110 -131 -153 -132 -111 -91 -72 -93 -115 -104 -17 46 34 -12
7914 -12 -60 -70 -80 -33 -32 -97 -86 -47 -54 -106 -159 -139 -118 -52 13 26 39 7 -25 -77 -130 -159 -189 -147 -104 -62 -19 -66 -112 -154 -195 -196 -121 -63 -50 -27 -4
7903 -4 35 0 -95 -191 -215 -239 -227 -215 -203 -192 -190 -187 -185 -183 -237 -292 -270 -248 -237 -226 -238 -250 -201 -153 -111 -69 -78 -178 -253 -282 -251 -220 -209 -199 -231 -263 -219 -174
7891 -174 -161 -148 -158 -167 -133 -98 -63 -29 -54 -79 -104 -129 -132 -135 -92 -49 -87 -125 -187 -248 -160 -73 -31 10 5 0 -50 -101 -120 -139 -112 -85 -67 -50 -139 -228 -292
7879 -292 -355 -373 -391 -308 -225 -147 -70 -36 -93 -144 -195 -171 -146 -76 -6 12 30 3 -23 5 35 -42 -120 -150 -181 -198 -169 -114 -152 -236 -320 -311 -211 -71
7869 -71 -23 4 -58 -101 -99 -140 -182 -193 -203 -220 -146 -77 -161 -253 -252 -206 -160 -108 -57 -51 -45 -28 -12 4 20 -22 -65 -119 -218 -338 -306 -201 -95 -62 -120 -173
7858 -173 -225 -220 -215 -196 -132 -48 -56 -10 35 16 -1 -6 35 118 110 79 49 55 61 21 -18 28 75 76 77 57 36 61 86 45 5 -35 -75 -66 -57 -48 -39 19 78 91 104
7845 104 70 37 3 -29 -19 -9 0 10 23 36 49 62 53 43 79 116 77 38 0 -39 -36 -33 -30 -28 -25 -22 -19 -16 -42 -67 -93 -118 -139 -160 -135 -66 0 -26 -73 -121
$$ packed form
7926a16NjjKKj2j2n9n8J1J0N6N6J7J7j1q7n4K3K7k0LM8M5jk1k2K1K1K0J9k1k2J1Q7O3j2m6
7914a2m8j0j0M7Jo5J1L9pn2n3K0K1O6O5J3J3l2l2n2n3k9l0M2M3M2M3m7m6m2m1jP5N8J3K3K3
7903dL9l5r5r6k4k4J2J2J2J1KLKKn4n5K2K2J1J1j2j2M9M8M2M2rj00p5k9L1L1J1J0l2l2M4M5
7891a74J3J3j0rL4L5L5L4k5k5k5k5llM3M3l8l8o2o1Q8Q7M2M1nnn0n1j9j9K7K7J8J7q9q9o4
7879b92o3j8j8Q3Q3P8P7L4n7n1n1K4K5P0P0J8J8k7k6K8L0p7p8l0l1j7K9N5l8q4q4RJ00J40
7869g1M8K7o2m3Km1m2j1j0j7P4O9q4r2JM6M6N2N1OOJ7J6J6J6m2m3n4r9j20L2J05J06L3n8n3
7858a73n2NNJ9O4Q4qM6M5j9j7nM1Q3ql1l0OOm0l9M6M7JJk0k1K5K5m1m0m0m0RRRRN8N9J3J3
7845A04l4l3l4l2J0J0RJ0J3J3J3J3rj0L6L7l9l9l8l9LLLKLLLLk6k5k6k5k1k1K5O9O6k6m7m8
$$ plain form
7833 -121 -130 -138 -102 -20 52 33 -6 -47 -14 18 51 84 111 138 119 100 93 86 79 71 74 77 34 -8 -34 -60 -86 -112 -90 -68 -1 66 93 119 70 20 -46 -114 -75
7820 -75 -36 -6 24 54 85 -22 -129 -129 -130 -88 -45 -3 38 48 57 66 76 -6 -89 -96 -103 -98 -94 -89 -85 -98 -110 -123 -136 -78 -21 -9 1 -15 -32 -49 -66 -128 -189
7808 -189 -205 -221 -184 -147 -110 -72 -97 -121 -44 32 44 -34 -114 -102 -66 -31 -66 -101 -194 -288 -326 -272 -196 -120 -115 -109 -78 -47 -62 -76 -80 -84 -89 -93 -130 -168 -104 -40
7797 -40 4 -42 -113 -184 -156 -128 -145 -163 -194 -224 -209 -194 -208 -221 -235 -248 -170 -93 -15 62 88 114 34 -46 -102 -159 -109 -59 -31 -2 -20 -38 -18 0 19
7786 19 38 32 27 -54 -136 -170 -203 -237 -270 -233 -196 -159 -122 -92 -62 -108 -154 -104 -55 -51 -48 -28 -9 9 28 59 89 74 59 37 16 -4 -26 -15 -5 -11 -61 -62
7774 -62 12 88 87 83 126 163 155 120 85 48 11 -12 -35 -58 -81 -51 -22 -69 -115 -108 -100 -92 -85 -145 -205 -265 -325 -297 -270 -196 -123 -109 -94 -39 15 14 -62 -142 -222
7762 -222 -271 -321 -233 -145 -134 -123 -113 -102 -143 -184 -180 -175 -202 -229 -180 -130 -68 -6 -19 -33 -21 -9 1 13 8 3 -46 -97 -105 -113 -166 -220 -200 -180 -114 -48 -15 17
7750 17 45 72 19 -111 -154 -91 -48 -52 -68 -85 -97 -108 -74 -40 -38 -36 11 58 72 86 24 -37 -22 -7 -69 -130 -120 -110 -99 -89 -83 -77 -24 27 -10 -49 -87
$$ packed form
7833a21rqL6Q2P2j9l9m1L3L2L3L3K7K7j9j9pppqLLm3m2k6k6k6k6K2K2O7O7K7K6m9n0o6o8L9
7820g5L9L0L0L0L1j07j07%jM2M3M2M1J0RRJ0q2q3ppNMNMj3j2j3j3N8N7J2J0j6j7j7j7o2o1
7808a89j6j6L7L7L7L8k5k4P7P6J2p8q0J2L6L5l5l5r3r4l8N4P6P6NOL1L1j5j4mmnml7l8O4O4
7797d0M4m6p1p1K8K8j7j8l1l0J5J5j4j3j4j3P8P7P8P7K6K6q0q0n6n7N0N0K8K9j8j8K0J8J9
7786A9J9onq1q2l4l3l4l3L7L7L7L7L0L0m6m6N0M9MLK0J9J8J9L1L0j5j5k2k1k0k2J1J0on0j
7774f2P4P6jmM3L7ql5l5l7l7k3k3k3k3L0K9m7m6PQQPo0o0o0o0K8K7P4P3J4J5N5N4jp6q0q0
7762b22m9n0Q8Q8J1J1J0J1m1m1MNk7k7M9N0O2O2j3j4J2J2J0J2nnm9n1qqn3n4K0K0O6O6L3L2
7750A7K8K7n3j30m3O3M3mj6j7j2j1L4L4KKM7M7J4J4o2o1J5J5o2o1J0J0J1J0OON3N1l7l9l8
$$ plain form
7739 -87 -125 -126 -127 -128 -129 -106 -82 -59 -36 -39 -43 -46 -50 -5 39 84 129 97 64 32 0 -18 -36 -130 -224 -188 -152 -115 -79 -75 -70 -66 -62 -66 -70 -120 -170 -187 -204 -220 -237 -222
7726 -222 -207 -188 -168 -148 -52 60 66 -31 -129 -128 -126 -55 15 -20 -56 -86 -115 -68 -67 -86 -29 27 84 50 17 -16 -50 -49 -48 -48 -47 -38 -29 -20 -10 -60 -110 -112 -113 -122 -86
7713 -86 -32 -54 -130 -206 -177 -148 -195 -197 -102 -84 -107 -85 -93 -101 -99 -97 -94 -92 -136 -180 -179 -177 -205 -234 -216 -198 -211 -223 -190 -157 -127 -96 -112 -127 -117 -106 -96 -85 -100 -114
7700 -114 -129 -143 -91 -39 23 -4 -80 -65 -5 9 2 -3 -35 -67 -96 -126 -79 -32 38 110 75 40 -25 -91 -50 -9 11 33 32 30 30 29 28 28 45 62 80 97 137
7688 137 177 142 61 7 44 53 16 26 35 42 49 16 -16 -35 -8 31 -19 -92 -166 -121 -77 -79 -81 -75 -70 -87 -105 -133 -161 -184 -206 -205 -111 -61 -102 -107 -66 -57 -47 -40 -33
7676 -33 -72 -111 -93 -75 -80 -85 -84 -84 -60 -36 -49 -62 -114 -167 -158 -58 36 85 80 29 -20 -71 -154 -237 -213 -189 -244 -299 -278 -256 -176 -96 -64 -32 -91 -195 -252
7664 -252 -218 -98 -23 -55 -177 -263 -196 -145 -93 -29 33 74 114 43 -27 -52 -77 -59 -41 -68 -96 -67 -37 -85 -132 -145 -159 -173 -110 -25 15 9 4 -1 -7 -85
7653 -85 -162 -202 -166 -150 -134 -110 -87 -86 -86 -125 -165 -182 -199 -233 -266 -223 -181 -164 -148 -154 -160 -103 -45 -33 -21 -16 -12 15 43 68 94 43 -7 -22 -38 -99 -161 -161 -162
$$ packed form
7739h7l8jjjjK3K4K3K3lmlmM5M4M5M5l2l3l2l2j8j8r4r4L6L6L7L6MNMMmmn0n0j7j7j6j7J5
7726b22J5J9K0K0R6J12Or7r8JKP1P0l5l6l0k9M7Jj9N7N6N7l4l3l3l4JJ%JRRRJ0n0n0kjrL6
7713h6N4k2p6p6K9K9m7kR5J8k3K2qqKKLKm4m4JKk8k9J8J8j3j2L3L3L0L1j6j5J0J1J0J1j5j4
7700a14j5j4N2N2O2k7p6J5O0J4pnl2l2k9l0M7M7P0P2l5l5o5o6M1M1K0K2jk%jj%J7J7J8J7M0
7688A37M0l5q1n4L7Rl7J0RPPl3l2j9K7L9n0p3p4M5M4kkONj7j8k8k8k3k2JR4N0m1nM1RJ0PP
7676c3l9l9J8J8nnJ%K4K4j3j3n2n3RJ00R4M9nn1m9n1q3q3K4K4n5n5K1K2Q0Q0L2L2n9j04n7
7664b52L4J20P5l2j22q6O7N1N2O4O2M1M0p1p0k5k5J8J8k7k8K9L0m8m7j3j4j4O3Q5M0onnop8
7653h5p7m0L6J6J6K4K3J%l9m0j7j7l4l3M3M2J7J6ooN7N8J2J2NMK7K8K5K6n1n0j5j6o1o2%j
$$ plain form
7641 -162 -140 -118 -132 -146 -114 -82 -57 -32 -53 -74 -97 -120 -98 -75 -26 23 118 213 168 122 99 76 97 119 94 69 54 39 46 54 37 21 -38 -97 -126 -110
7630 -110 -73 -113 -179 -199 -205 -210 -138 -67 -102 -138 -122 -107 -115 -122 -91 -60 -10 38 50 -14 -107 -155 -110 -66 -18 29 0 -28 -56 -85 -168 -251 -227 -204 -155 -105 -96
7618 -96 -87 -124 -69 5 33 49 64 31 -1 -13 -25 -37 -49 -24 0 47 94 77 60 -27 -115 -165 -124 -57 8 24 41 57 73 109 145 105 19 -101 -131
7607 -131 -108 -85 -27 30 43 56 31 6 -41 -89 -108 -127 -100 -73 -71 -69 -112 -201 -263 -233 -212 -191 -156 -121 -58 -86 -170 -254 -267 -281 -206 -131 -57 17 17 17 -5
7596 -5 -28 -95 -162 -183 -205 -208 -212 -139 -67 -59 -51 -44 -36 2 42 5 -31 -30 -29 12 53 46 -52 -104 -66 -23 20 69 118 44 -29 -57 -85 -32 20 -2 -25 -9 6 0 -5
7583 -5 -36 -66 -96 -127 -131 -135 -190 -154 -97 -40 -54 -67 -52 -36 -44 -51 -35 -20 -4 10 13 16 18 21 -10 -42 -69 -96 -75 23 121 142 104 65 44 24 -20 -65 -65 -64 -81
7570 -81 -97 -69 -40 5 52 21 -8 -36 -64 -46 -29 -15 -1 11 25 -18 -63 -107 -152 -142 -132 -122 -112 -115 -119 -168 -217 -190 -163 -159 -155 -183 -211 -193 -176 -139 -103
7559 -103 -143 -182 -207 -231 -210 -188 -153 -117 -127 -137 -145 -153 -161 -170 -100 -31 -39 -46 -81 -116 -106 -95 -45 5 10 14 -6 -27 27 36 -11 16 42 -8 -47 -86 -84 -37 31 24
$$ packed form
7641a62K2K2j4j4L2L2K5K5k1k1k3k3K2K3M9M9R5R5m5m6k3k3K1K2k5k5j5j5PQj7j6n9n9k9J6
7630a10L7m0o6k0onP2P1l5l6J6J5qpL1L1N0M8J2o4r3m8M5M4M8M7k9k8k8k9q3q3K4K3M9N0R
7618i6Rl7N5P4K8J6J5l3l2j2j2j2j2K5K4M7M7j7j7q7q8n0M1O7O5J6J7J6J6L6L6m0q6j20l0
7607a31K3K3N8N7J3J3k5k5m7m8j9j9K7K7KKm3q9o2L0K1K1L5L5O3k8q4q4j3j4P5P5P4P4%%k2
7596ek3o7o7k1k2lmP3P2QQPQL8M0l7l6JJM1M1pr8n2L8M3M3M9M9p4p3k8k8N3N2k2k3J6J5on
7583el1l0l0l1mmn5L6N7N7j4j3J5J6qpJ6J5J6J4LLKLl1l2k7k7K1R8R8K1l8l9k1k0m4m5%Jj7
7570h1j6K8K9M5M7l1k9k8k8J8J7J4J4J2J4m3m5m4m5J0J0J0J0lmm9m9K7K7MMk8k8J8J7L7L6
7559a03m0l9k5k4K1K2L5L6j0j0qqqrP0O9qpl5l5J0J1N0N0NMk0k1N4Rm7K7K6n0l9l9KM7O8p
$$ plain form
7547 24 -41 -62 -65 -115 -156 -120 -65 -10 3 17 21 26 30 34 23 12 1 -9 -40 -71 0 70 105 63 34 51 70 13 -86 -109 -53 1 16 30 -23 -77 -85 -94 -71
7534 -71 -48 -25 -2 -23 -45 -20 3 12 21 30 39 -32 -104 -100 -96 -36 24 8 -53 -86 -42 -19 -42 -42 -43 0 41 29 16 -41 -99 -115 -130 -142 -155 -127 -54 -37 -96
7522 -96 -177 -212 -278 -344 -361 -378 -349 -320 -296 -272 -203 -133 -135 -136 -16 27 0 16 46 0 -84 -169 -182 -195 -174 -153 -131 -110 -92 -73 -101 -128 -151 -175 -198 -222
7511 -222 -154 -86 -64 -42 18 79 74 -7 -67 -173 -301 -353 -371 -388 -398 -332 -290 -249 -248 -247 -190 -132 -151 -169 -126 -83 -86 -89 -84 -79 -120 -161 -208 -255 -256 -258 -195 -133
7499 -133 -131 -206 -153 -54 -37 -65 -116 -166 -144 -121 -106 -90 -120 -151 -167 -184 -155 -126 -53 19 94 93 19 20 76 132 136 64 8 -1 30 61 19 -22 -95 -167 -194
7488 -194 -221 -209 -197 -185 -173 -123 -73 -68 -64 -65 -67 -22 21 10 -1 -13 -24 -39 -53 -67 -82 -76 -70 -67 -63 -77 -137 -168 -123 -99 -75 -92 -109 -134 -160 -139 -119 -166 -214
7476 -214 -261 -308 -271 -233 -272 -311 -308 -306 -275 -168 -120 -148 -126 -104 -127 -104 -57 -87 -113 -33 27 88 139 191 135 80 38 -3 -45 -87 -71 -55 -9 -8 13 112
7465 112 191 224 176 128 77 26 28 29 31 32 5 -22 -4 13 -28 -70 -67 -63 -83 -102 -76 -50 -67 -84 -55 -27 -12 3 18 33 17 0 -15 -31 -56 -80 -105 -130
$$ packed form
7547B4o5k1ln0m1L6N5N5J3J4MNMMj1j1j1j0l1l1P1P0L5m2k9J7J9n7r9k3N6N4J5J4n3n4qrK3
7534g1K3K3K3k1k2K5K3RRRRp1p2MMO0O0j6o1l3M4K3k3%jM3M1j2j3n7n8j6j5j2j3K8P3J7n9
7522i6q1l5o6o6j7j7K9K9K4K4O9P0kjJ20M3k7J6L0m6q4q5j3j3K1K1K2K1J8J9k8k7k3k4k3k4
7511b22O8O8K2K2O0O1nq1o0j06j28n2j8j7j0O6M2M1JJN7N8j9j8M3M3llNNm1m1m7m7jkO3O2
7499a33Kp5N3R9J7k8n1n0K2K3J5J6l0l1j6j7K9K9P3P2P5jp4JN6N6Mp2n6rL1L1m2m1p3p2k7
7488a94k7J2J2J2J2N0N0NMjkM5M3j1j1j2j1j5j4j4j5OOLMj4o0l1M5K4K4j7j7k5k6K1K0m7m8
7476b14m7m7L7L8l9l9LKL1J07M8k8K2K2k3K3M7l0k6Q0O0O1N1N2n6n5m2m1m2m2J6J6M6JK1R9
7465A12P9L3m8m8n1n1KJKJk7k7J8J7m1m2LMk0j9K6K6j7j7K9K8J5J5J5J5j6j7j5j6k5k4k5k5
$$ plain form
7453 -130 -128 -127 -172 -216 -203 -189 -176 -162 -111 -61 -87 -68 -59 -141 -192 -198 -148 -52 -27 -47 -105 -118 -113 -108 -123 -139 -81 -23 9 -3 -39 -168 -275 -291 -257 -223 -201
7441 -201 -179 -157 -135 -143 -151 -157 -162 -138 -69 -16 -55 -114 -127 -121 -70 -73 -76 -77 -77 0 77 99 30 29 28 21 14 0 -15 -77 -138 -177 -217 -156 -94 -76 -149 -222 -204 -186 -168
7429 -168 -190 -212 -224 -237 -249 -262 -237 -212 -263 -315 -266 -217 -214 -211 -174 -137 -91 -136 -203 -224 -200 -176 -122 -68 -14 39 48 57 21 -15 -58 -101 -67 -34 -27 -19 -57 -96
7417 -96 -74 -53 -31 -10 -63 -116 -37 40 54 -23 -101 -87 -103 -119 -130 -140 -114 -87 -61 -34 -27 -20 -12 -5 10 26 42 58 55 52 48 45 62 78 95 111 77 43 9
7405 9 -24 -94 -164 -127 -90 -82 -74 -111 -149 -151 -153 -156 -158 -215 -272 -252 -232 -240 -248 -211 -173 -175 -177 -180 -182 -168 -154 -140 -126 -111 -96 -35 25 -19 -63 -108 -152 -129 -106 -129 -151 -114
7392 -114 -76 -85 -93 -128 -163 -152 -141 -167 -193 -173 -153 -166 -179 -193 -206 -138 -70 -26 -74 -103 -131 -176 -130 -46 -54 -80 -107 -151 -195 -239 -283 -249 -216 -183 -149 -80
7381 -80 -10 28 113 215 242 176 111 120 129 93 56 38 20 48 76 23 -29 -36 -44 -65 -86 -107 -128 -162 -195 -122 -49 -7 33 0 -35 18 72 65 -17 -99 -135
7369 -135 -151 -167 -168 -92 16 124 114 104 47 -8 -34 -61 -11 37 45 52 59 67 105 143 135 127 109 91 73 55 28 2 -70 -142 -151 -161 -124 -88 -48 -9 25 59
$$ packed form
7453a30KJm5m4J3J4J3J4N1N0k6J9Rq2n1oN0R6K5k0n8j3NNj5j6N8N8L2j2l6j29j07j6L4L4K2
7441b01K2K2K2qqonK4O9N3l9n9j3ON1llj%P7P7K2o9jjppj4j5o2o1l9m0O1O2J8p3p3J8J8J8
7429a68k2k2j2j3j2j3K5K5n1n2M9M9LLL7L7M6m5o7k1K4K4N4N4N4N3RRl6l6m3m3L4L3PQl8l9
7417i6K2K1K2K1n3n3P9P7J4p7p8J4j6j6j1j0K6K7K6K7PPQPJ5J6J6J6llmlJ7J6J7J6l4l4l4
7405Il3p0p0L7L7QQl7l8kklkn7n7K0K0qqL7L8kklkJ4J4J4J4J5J5O1O0m4m4m5m4K3K3k3k2L7
7392a14L8rql5l5J1J1k6k6K0K0j3j3j4j3O8O8M4m8k9k8m5M6Q4qk6k7m4m4m4m4L4L3L3L4O9
7381h0P0L8Q5J02K7o6o5RRl6l7j8j8K8K8n3n2pqk1k1k1k1l4l3P3P3M2M0l3l5N3N4pq2q2l6
7369a35j6j6jP6J08J08j0j0n7n5k6k7N0M8QPPQL8L8qqj8j8j8j8k7k6p2p2rj0L7L6M0L9L4L4
$$ plain form
7357 59 121 107 90 73 63 52 42 32 2 -26 -96 -167 -208 -172 -154 -181 -149 -117 -87 -58 -40 -22 -4 13 -20 -54 -88 -123 -182 -242 -254 -265 -231 -152 -59
7347 -59 -42 -50 -105 -164 -177 -129 -80 -29 21 39 57 75 93 90 88 9 -114 -144 -98 -26 0 -47 -93 -143 -192 -248 -303 -282 -261 -262 -262 -258 -254 -222 -114 -51 -65 -92
7335 -92 -119 -105 -91 -152 -212 -196 -180 -124 -68 -58 -48 -40 -32 -100 -168 -186 -204 -178 -107 -53 -105 -184 -186 -167 -148 -124 -101 -94 -88 -36 16 -1 -19 -37 -55 -104 -153 -203
7323 -203 -252 -237 -223 -208 -193 -236 -278 -245 -211 -168 -126 -129 -132 -163 -194 -166 -61 -7 -28 -76 -78 20 73 78 38 -59 -81 -27 -49 -96 -98 -54 -10 -46 -83 -73 -64
7311 -64 -16 32 -25 -84 -99 -114 -129 -144 -181 -217 -207 -197 -203 -208 -166 -200 -258 -240 -193 -146 -113 -80 -93 -106 -147 -188 -153 -118 -156 -195 -302 -410 -412 -308 -237
7301 -237 -213 -117 -22 -6 9 0 -8 -13 -19 -59 -53 -72 -168 -237 -260 -238 -216 -159 -102 -91 -80 -111 -142 -173 -204 -136 -68 0 67 89 110 101 16 -80 -131 -167 -203 -186
7289 -186 -169 -153 -136 -101 -66 -34 -2 -49 -141 -248 -279 -174 -23 45 38 -19 -32 -30 -104 -185 -220 -225 -154 -94 -80 -142 -204 -164 -125 -44 36 36 -38 -71 -104
7278 -104 -84 -64 -90 -116 -102 -88 -74 -60 -46 -32 26 86 111 136 116 95 68 41 14 -12 -41 -71 -96 -121 -106 -15 58 87 53 18 27 35 73 112 107 102 72
$$ packed form
7357E9O2j4j7j7j0j1j0j0l0k8p0p1m1L6J8k7L2L2L0K9J8J8J8J7l3l4l4l5n9o0j2j1L4P9R3
7347e9J7qn5n9j3M8M9N1N0J8J8J8J8lkp9j23l0M6P2K6m7m6n0m9n6n5K1K1j%MML2J08O3j4k7
7335i2k7J4J4o1o0J6J6N6N6J0J0QQo8o8j8j8K6P1N4n2p9kJ9J9K4K3PON2N2j7j8j8j8m9m9n0
7323b03m9J5J4J5J5m3m2L3L4M3M2lll1l1K8J05N4k1m8kR8N3Nm0r7k2N4k2m7kM4M4l6l7J0R
7311f4M8M8n7n9j5j5j5j5l7l6J0J0onM2l4n8J8M7M7L3L3j3j3m1m1L5L5l8l9j07j08kJ04P1
7301b37K4R6R5J6J5rqnom0Oj9r6o9k3K2K2N7N7J1J1l1l1l1l1O8O8O8O7K2K1rq5r6n1l6l6J7
7289a86J7J6J7L5L5L2L2m7r2j07l1J05J51O8pn7j3Kp4q1l5nP1O0J4o2o2M0L9Q1Q0%p4l3l3
7278a04K0K0k6k6J4J4J4J4J4J4N8O0K5K5k0k1k7k7k7k6k9l0k5k5J5R1P3K9l4l5RQL8L9nnl0
$$ plain form
7267 72 87 124 85 6 3 -5 -13 -30 -93 -174 -178 -134 -89 -40 8 -70 -150 -137 -49 63 131 122 113 63 12 -37 -88 -86 -84 -37 9 5 1 43 85 37 -10 -58 -106 -171
7254 -171 -235 -223 -211 -192 -174 -201 -228 -178 -128 -78 -28 -58 -89 -47 -4 -9 -59 -129 -122 -115 -153 -187 -175 -132 -89 -120 -151 -179 -207 -159 -111 -118 -124 -85 -45 -21 2
7243 2 26 50 28 5 -62 -130 -151 -171 -115 -59 -12 33 4 -25 -88 -152 -139 -127 -142 -156 -171 -110 -21 21 -13 -94 -142 -144 -176 -207 -164 -122 -82 -118 -126 -134 -101
7231 -101 -68 -47 -26 -50 -74 -73 -72 -70 -69 -83 -96 -156 -215 -251 -286 -276 -266 -195 -123 -98 -72 -80 -87 -141 -194 -219 -244 -269 -294 -272 -251 -229 -207 -188 -170 -151 -132 -169
7219 -169 -206 -197 -187 -144 -100 -102 -104 -58 -11 40 1 -30 -63 -101 -139 -122 -104 -87 -70 -11 47 0 -48 -47 -46 30 107 112 117 76 35 11 -12 -37 -61 -111 -160 -134
7208 -134 -107 -128 -149 -170 -191 -254 -317 -274 -230 -197 -164 -132 -99 -104 -110 -116 -122 -122 -123 -134 -55 27 19 -69 -157 -204 -251 -252 -252 -207 -162 -218 -274 -308 -250 -173 -141 -176 -211
7195 -211 -173 -134 -120 -106 -97 -88 13 23 -54 -177 -219 -216 -195 -175 -195 -216 -187 -67 -43 -111 -193 -229 -195 -162 -169 -175 -146 -70 -15 -51 -45 -40 -40 -40 -25 -11 -37 -62
7184 -62 -108 -61 -21 19 2 -14 -30 -47 -48 -48 -43 -38 -118 -106 -39 27 10 -6 -23 -40 -74 -107 -94 -82 -38 5 94 184 149 115 126 138 106 73 118 162 174
$$ packed form
7267G2J5L7l9p9lqqj7o3q1mM4M5M9M8p8q0J3Q8J12O8rrn0n1m9n1KKM7M6mmM2M2m8m7m8m8o5
7254a71o4J2J2J9J8k7k7N0N0N0N0l0l1M2M3nn0p0PPl8l4J2M3M3l1l1k8k8M8M8poL9M0K4K3
7243BK4K4k2k3o7o8k1k0N6N6M7M5k9k9o3o4J3J2j5j4j5O1Q9M2l4q1m8kl2l1M3M2M0l6qqL3
7231a01L3K1K1k4k4JJKJj4j3o0n9l6l5J0J0P1P2K5K6qpn4n3k5k5k5k5K2K1K2K2J9J8J9J9l7
7219a69l7RJ0M3M4kkM6M7N1l9l1l3l8l8J7J8J7J7N9N8m7m8JJP6P7NNm1m1k4k3k5k4n0m9K6
7208a34K7k1k1k1k1o3o3M3M4L3L3L2L3nooo%jj1P9Q2qq8q8m7m7j%M5M5n6n6l4N8P7L2l5l5
7195b11L8L9J4J4RRJ01J0p7j23m2LK1K0k0k1K9J20K4o8q2l6L4L3poK9P6N5l6ON%%J5J4k6k5
7184f2m6M7M0M0j7j6j6j7j%NNq0J2O7O6j7j6j7j7l4l3J3J2M4M3Q9R0l5l4J1J2l2l3M5M4J2
$$ plain form
7172 174 187 124 60 64 68 73 77 -4 -85 -111 -46 -35 -23 -6 10 40 69 99 129 136 143 150 157 141 125 155 184 199 213 187 162 183 295 408 429 463 498 572
7160 572 647 781 914 971 1029 1184 1340 1501 1662 1748 1926 2238 2704 3314 4138 5252 6823 9064 12312 17146 24510 34789
7154 34789 44976 47684 40606 30015 21284 15339 11376 8612 6732 5412 4428 3632 2989 2495 2092 1811 1621 1431 1242
7148 1242 1128 1013 1030 1048 1049 960 922 884 919 954 1100 1337 1604 1780 1696 1399 1106 905 777 648 570 491 412 333 263 193 123 53 71
7139 71 90 108 126 133 140 147 154 162 170 178 186 159 132 105 78 24 -29 22 75 27 -20 -63 -105 -151 -106 45 150 166 91 36 26 35 -1 -81 -115 -121 -126 -129 -131 -189 -246
7126 -246 -227 -209 -165 -121 -124 -126 -94 -62 -30 0 -12 -25 1 28 106 93 55 17 41 64 88 112 86 59 79 98 95 91 88 84 113 143 126 110 65 20 -30 10
7114 10 59 109 165 220 161 101 47 -6 -61 -24 18 -30 -83 -44 9 16 2 -10 4 -26 -79 -41 73 188 218 156 100 44 30 17 -41 -100 -72 -44 -62
7103 -62 -4 104 168 154 94 13 -20 -38 -56 -71 -87 -102 -118 -35 47 -6 -61 -61 -62 -61 -136 -216 -220 -195 -169 -188 -207 -226 -244 -151 -58 -11 35 36 36 37 38 56 74
$$ packed form
7172A74J3o3o4MMNMq1q1k6O5J1J2J7J6L0K9L0L0PPPPj6j6L0K9J5J4k6k5K1J12J13K1L4L5P4
7160E72P5J34J33N7N8J55J56J61J61Q6J78L12M66O10Q24J114J571K241L248M834P364J0279
7154C4789J0187K708p078j0591q731n945l963k764j880j320r84p96o43m94m03k81j90j90j89
7148A242j14j15J7J8Jq9l8l8L5L5J46K37K67J76q4k97k93k01j28j29p8p9p9p9p0p0p0p0J8
7139G1J9J8J8PPPPQQQQk7k7k7k7n4n3N1N3m8m7m3m2m6M5J51J05J6p5n5j0Rl6q0l4onlkn8n7
7126b46J9J8M4M4lkL2L2L2L0j2j3K6K7P8j3l8l8K4K3K4K4k6k7K0J9lmlmK9L0j7j6m5m5n0M0
7114A0M9N0N6N5n9o0n4n3n5L7M2m8n3L9N3Pj4j2J4l0n3L8J14J15L0o2n6n6j4j3n8n9K8K8j8
7103f2N8J08O4j4o0q1l3j8j8j5j6j5j6Q3Q2n3n5%jJp5q0mK5K6j9j9j9j8R3R3M7M6J%JJJ8J8
$$ plain form
7091 74 92 110 119 129 93 56 26 -4 -34 -65 -96 -126 -157 -188 -155 -123 -137 -150 -162 -174 -109 -45 -46 -47 -48 -49 6 62 118 174 154 135 44 -45 -83 -44 -22 -46
7080 -46 -95 -144 -89 -34 0 33 67 101 128 155 134 113 77 -3 -119 -128 -129 -131 -127 -122 -45 32 104 177 179 105 48 37 17 -2 -19 -35 -69 -102 -89 -77 -90 -103
7068 -103 -116 -129 -85 -40 4 48 1 -46 -94 -141 -96 -51 -82 -113 -107 -102 -111 -166 -221 -185 -101 -63 -56 -48 -44 -39 -6 27 -15 -58 -55 -52 -49 -46 -51 -56 -15 25 -9 -43 -77
7055 -77 -112 -142 -172 -197 -221 -245 -177 -59 13 -24 -63 -58 -54 -8 36 90 53 -5 -19 -60 -102 -91 -34 -27 -112 -132 -152 -178 -203 -148 -93 -175 -257 -271 -284 -161
7044 -161 -38 42 122 126 131 102 73 45 16 -58 -134 -209 -284 -267 -249 -232 -215 -206 -197 -234 -271 -247 -222 -198 -173 -199 -225 -205 -94 27 -2 -71 -49 -36 -69
7033 -69 -71 -73 -64 -55 -91 -172 -260 -255 -168 -81 -34 12 14 16 -27 -71 -115 -159 -137 -114 -91 -69 -96 -122 -149 -176 -128 -79 -31 16 0 -15 -32 -48 -53 -57 -62 -66 -22 21 65
7020 65 109 18 -72 -57 -41 -2 36 0 -37 -94 -151 -101 -52 -5 41 28 -60 -170 -204 -179 -154 -169 -184 -199 -214 -235 -256 -231 -206 -157 -109 -106 -103 -76 -48 -66
7009 -66 -84 -129 -174 -173 -173 -148 -123 -128 -210 -228 -200 -157 -114 -107 -99 -92 -84 -74 -63 -53 -42 -33 -23 -14 -4 -40 -75 -64 -54 -54 -55 -55 -56 -53 -51 -48 -46 -69 -93 -116 -140 -119 -97 -122
$$ packed form
7091G4J8J8RJ0l6l7l0l0l0l1l1l0l1l1L3L2j4j3j2j2O5O4jjjjN5N6N6N6k0j9r1q9l8L9K2k4
7080d6m9m9N5N5L4L3L4L4K7K7k1k1l6q0j16rjkMNP7P7P2P3Kp4n7j1k0j9j7j6l4l3J3J2j3j3
7068a03j3j3M4M5M4M4m7m7m8m7M5M5l1l1ONrn5n5L6Q4L8PQMNL3L3m2m3LLLLnnM1M0l4l4l4
7055g7l5l0l0k5k4k4O8J18P2l7l9NMM6M4N4l7n8j4m1m2J1N7Pq5k0k0k6k5N5N5q2q2j4j3J23
7044a61J23Q0Q0MNk9k9k8k9p4p6p5p5J7J8J7J7RRl7l7K4K5K4K5k6k6K0J11J21k9o9K2J3l3
7033f9kkRRl6q1q8NQ7Q7M7M6KKm3m4m4m4K2K3K3K2k7k6k7k7M8M9M8M7j6j5j7j6nmnmM4M3M4
7020F5M4r1r0J5J6L9L8l6l7n7n7N0M9M7M6j3q8j10l4K5K5j5j5j5j5k1k1K5K5M9M8LLK7K8j8
7009f6j8m5m5J%K5K5nq2j8K8M3M3PQPQJ0J1J0J1RJ0RJ0l6l5J1J0%j%jLKLKk3k4k3k4K1K2k5
$$ plain form
6995 -122 -146 -109 -72 -34 2 23 44 20 -4 -42 -81 -74 -66 1 69 61 53 55 57 13 -29 -39 -48 -12 23 27 31 -10 -52 -46 -41 -35 -29 -9 9 29 49 15 -17 -5 6
6983 6 86 166 161 64 -14 -93 -132 -171 -133 -95 -57 -19 -24 -28 -32 -36 -98 -161 -270 -378 -379 -380 -335 -290 -271 -253 -164 -76 -63 -142 -94 -45 -45 -46 -92 -138 -144 -150 -116 -82
6970 -82 -9 -27 -101 -174 -149 -123 -97 -72 -74 -76 -78 -80 -48 -15 16 48 55 62 69 77 42 7 -27 -62 -54 -47 -39 -31 -38 -45 -52 -58 10 79 103 127 114 102 89 77 62 48 73
6957 73 99 82 -24 -81 -137 -67 3 22 42 15 -102 -174 -155 -115 -76 -30 14 74 134 148 162 197 232 221 210 170 130 90 49 1 -46 -18 8 8 7
6946 7 -44 -5 -4 -4 -44 -84 -85 -85 -40 4 -36 -76 -41 -5 -35 -65 -49 -34 -49 -64 -80 -95 -124 -152 -181 -210 -258 -306 -308 -311 -256 -201 -192 -182 -176 -170 -164 -158 -70 16 -3
6933 -3 -22 -103 -183 -187 -192 -228 -265 -225 -186 -120 -55 -65 -76 -130 -183 -191 -199 -203 -207 -211 -215 -172 -130 -41 46 74 102 85 67 94 121 72 23 13 2 -7 -17 -20 -24 -27 -30 -5
6920 -5 20 45 71 -2 -77 -75 -73 -90 -107 -124 -141 -119 -97 -75 -53 -69 -85 -102 -118 -129 -141 -152 -164 -226 -289 -275 -261 -233 -205 -177 -149 -153 -158 -162 -167 -145 -124 -149 -173
6908 -173 -115 -57 0 58 25 -7 -86 -165 -203 -241 -211 -180 -191 -202 -213 -224 -206 -187 -168 -149 -97 -45 -62 -78 -120 -161 -104 -46 -57 -68 -78 -89 -121 -152 -131
$$ packed form
6995a22k4L7L7L8L6K1K1k4k4l8l9PQO7O8qqKKm4m2j0rL6L5MMm1m2ONOOK0J8K0K0l4l2J2J1
6983FQ0Q0nr7p8p9l9l9L8L8L8L8nmmmo2o3j09j08jjM5M5J9J8Q9Q8J3p9M8M9%jm6m6ooL4L4
6970h2P3j8p4p3K5K6K6K5kkkkL2L3L1L2PPPQl5l5l4l5QPQQpppoO8O9K4K4j3j2j3j2j5j4K5
6957G3K6j7j06n7n6P0P0J9K0k7j17p2J9M0L9M6M4O0O0J4J4L5L5j1j1m0m0m0m1m8m7K8K6%j
6946Gn1L9J%m0m0j%M5M4m0m0L5L6l0l0J6J5j5j5j6j5k9k8k9k9m8m8klN5N5RJ0OOOOQ8Q6j9
6933cj9q1q0mnl6l7M0L9O6O5j0j1n4n3qqmmmmM3M2Q9Q7K8K8j7j8K7K7m9m9j0j1rj0lmllK5
6920eK5K5K6p3p5KKj7j7j7j7K2K2K2K2j6j6j7j6j1j2j1j2o2o3J4J4K8K8K8K8mnmnK2K1k5k4
6908a73N8N8N7N8l3l2p9p9l8l8L0L1j1j1j1j1J8J9J9J9N2N2j7j6m2m1N7N8j1j1j0j1l2l1K1
$$ plain form
6897 -131 -109 -123 -137 -113 -89 -9 70 93 116 68 -24 -167 -218 -169 -120 -122 -216 -279 -251 -196 -141 -109 -77 -114 -151 -174 -197 -243 -289 -293 -297 -201 -105 -85 -65 -67
6886 -67 -70 -80 -91 -48 -5 -27 -49 -17 13 -10 -34 -112 -189 -232 -275 -280 -285 -263 -241 -219 -106 -75 -89 -78 -67 -37 -98 -126 -153 -239 -234 -166 -98 -74 -51 -27 -3
6875 -3 18 40 6 -27 -51 -120 -162 -113 -102 -90 -73 -56 -90 -124 -158 -192 -226 -259 -238 -218 -208 -198 -120 -41 26 94 124 154 114 74 88 101 108 116 101 9 -81
6863 -81 -127 -134 -142 -108 -74 -79 -84 -107 -130 -115 -99 -57 -14 -25 -35 -54 -72 -56 -39 -49 -104 -127 -73 -19 -10 -9 -8 -13 -18 -45 -73 -57 -41 -2 36 39 43 24 -40 -98 -78
6851 -78 -53 -74 -96 -71 -47 -68 -125 -135 -137 -138 -128 -118 -108 -98 -111 -124 -84 -43 -78 -113 -124 -136 -147 -158 -130 -103 -182 -262 -272 -283 -252 -220 -166 -112 -111 -110 -71
6839 -71 -32 -16 0 -52 -105 -126 -147 -99 -51 -53 -55 -19 17 24 30 -30 -92 -87 -82 -99 -116 -48 20 89 157 137 117 89 16 -80 -100 -37 25 52 79 38 -3 -21
6827 -21 -39 25 91 62 32 79 126 135 143 106 68 39 10 -18 -47 -24 -2 20 42 -4 -52 -23 5 -11 -28 -45 -62 -36 -10 -30 -50 -81 -113 -144 -175 -201
6816 -201 -226 -175 -124 -116 -108 -100 -92 -99 -106 -113 -120 -49 20 -15 -96 -147 -107 -75 -43 -37 -30 -24 -18 -48 -78 -63 -47 -55 -63 -26 11 63 115 118 29 -105 -148 -111 -74 -31 11 -21
$$ packed form
6897a31K2j4j4K4K4Q0P9K3K3m8r2j43n1M9M9kr4o3K8N5N5L2L2l7l7k3k3m6m6mmR6R6K0K0k
6886f7lj0j1M3M3k2k2L2L0k3k4p8p7m3m3nnK2K2K2J13L1j4J1J1L0o1k8k7q6NO8O8K4K3K4K4
6875cK1K2l4l3k4o9m2M9J1J2J7J7l4l4l4l4l4l3K1K0J0J0P8P9O7O8L0L0m0m0J4J3PQj5r2r0
6863h1m6pqL4L4nnk3k3J5J6M2M3j1j0j9j8J6J7j0n5k3N4N4RJJnnk7k8J6J6L9L8LMj9o4n8K0
6851g8K5k1k2K5K4k1n7j0kjJ0J0J0J0j3j3M0M1l5l5j1j2j1j1K8K7p9q0j0j1L1L2N4N4JJL9
6839g1L9J6J6n2n3k1k1M8M8kkL6L6POo0o2NNj7j7O8O8O9O8k0k0k8p3r6k0O3O2K7K7m1m1j8
6827b1j8O4O6k9l0M7M7RQl7l8k9k9k8k9K3K2K2K2m6m8K9K8j6j7j7j7K6K6k0k0l1l2l1l1k6
6816b01k5N1N1QQQQppppP1O9l5q1n1M0L2L2OPOOl0l0J5J6qqL7L7N2N2Lq9j34m3L7L7M3M2l2
$$ plain form
6803 -21 -54 -88 -122 -110 -99 -108 -118 -128 -138 -93 -47 -48 -48 -61 -75 -88 -101 -86 -70 -131 -192 -144 -97 -49 -2 -21 -40 -105 -170 -155 -139 -124 -109 -174 -239 -166 -94
6792 -94 -71 -48 -24 -1 7 16 39 108 145 90 38 77 102 126 156 186 165 144 78 11 -25 -62 -107 -61 -38 -61 -92 -123 -132 -49 79 116 59 2 -60 -123
6781 -123 -88 -53 -18 16 -49 -115 -181 -247 -247 -247 -241 -236 -206 -85 -71 -148 -160 -173 -191 -209 -158 -106 -101 -95 -121 -147 -173 -199 -177 -155 -130 -106 -107 -64 8 -10 -78 -100
6769 -100 -78 -55 -26 3 32 61 49 36 -21 -79 -55 -30 -6 18 -45 -109 -173 -238 -202 -166 -206 -246 -228 -210 -191 -173 -148 -123 -84 0 32 -26 -56 -41 -12
6758 -12 16 48 79 70 60 50 41 49 58 22 -59 -121 -91 -42 6 79 106 76 -45 -118 -146 -159 -173 -130 -88 -45 -2 3 9 16 22 -18 -60 -25 9 42 76 34 -8
6746 -8 8 24 86 149 127 105 7 -90 -114 -138 5 149 208 266 279 292 269 245 298 351 511 670 915 1161 1629 2250 3250 4890 7917
6737 7917 13170 20397 21862 15501 9476 5963 4127 3034 2338 1788 1391 1167 942 803 665 573 481 388 296 256 215 220 226 242
6729 242 259 275 292 211 131 50 -29 -114 -198 -236 -274 -269 -263 -212 -161 -178 -195 -213 -230 -173 -116 -59 -2 -50 -98 -39 18 -11 -42 -73 -104 -76 -49 -67 -86 -44
$$ packed form
6803b1l3l4l4J2J1rj0j0j0M5M6j%j3j4j3j3J5J6o1o1M8M7M8M7j9j9o5o5J5J6J5J5o5o5P3P2
6792i4K3K3K4K3QRK3O9L7n5n2L9K5K4L0L0k1k1o6o7l6l7m5M6K3k3l1l1rQ3J28L7n7n7o2o3
6781a23L5L5L5L4o5o6o6o6%%ONL0J21J4p7j2j3j8j8N1N2NOk6k6k6k6K2K2K5K4jM3P2j8o8k2
6769a00K2K3K9K9K9K9j2j3n7n8K4K5K4K4o3o4o4o5L6L6m0m0J8J8J9J8K5K5L9Q4L2n8l0J5K9
6758a2K8L2L1rj0j0rQRl6q1o2L0M9M8P3K7l0j21p3k8j3j4M3M2M3M3NOPOm0m2L5L4L3L4m2m2
6746hJ6J6O2O3k2k2r8r7k4k4J43J44N9N8J3J3k3k4N3N3J60J59K45K46M68O21J000J640L027
6737G917N253P227J465o361o025l513j836j093o96n50l97k24k25j39j38r2r2r3r2m0m1NOJ6
6729B42J7J6J7q1q0q1p9q5q4l8l8NON1N1j7j7j8j7N7N7N7N7m8m8N9N7k9l1l1l1K8K7j8j9M2
$$ plain form
6718 -44 -2 38 80 90 100 109 119 74 28 28 29 35 40 1 -38 -15 7 30 53 35 17 -1 -19 -81 -143 -99 -54 -14 25 20 14 0 -15 -30 -45 -33 -22 -10 0
6706 0 -37 -75 -65 -54 -6 88 131 84 36 -10 -64 -117 -139 -161 -138 -114 -115 -115 -39 36 25 13 47 81 65 48 32 15 12 8 -37 -83 -32 63 109 64 44 23
6694 23 42 62 16 -28 -73 -119 -109 -99 -89 -79 -33 12 -48 -109 -115 -122 -82 -43 -20 2 25 49 16 -15 -93 -171 -163 -155 -179 -157 -104 -143 -185 -135 -75 -106 -156
6683 -156 -207 -191 -175 -159 -144 -81 -19 -32 -46 -51 -57 -107 -158 -108 -58 -54 -50 -12 24 66 18 -66 -151 -166 -180 -212 -243 -199 -154 -87 -21 0 20 7 -6 34 -16
6671 -16 -105 -149 -148 -148 -161 -175 -189 -203 -263 -324 -308 -292 -245 -199 -166 -179 -208 -146 -62 21 62 103 67 32 10 -11 -55 -100 -116 -132 -103 -73 -59 -45 -34 -23
6660 -23 -46 -115 -209 -212 -151 -90 -23 43 30 17 36 8 -27 27 53 33 3 -26 -59 -92 -75 -58 -63 -69 -125 -181 -194 -207 -179 -198 -199 -108 -10 41 79 117 116 116
6648 116 92 69 0 -70 -93 -117 -83 -49 7 65 18 -28 -29 -30 5 41 53 66 62 58 32 5 -97 -200 -196 -192 -220 -247 -173 -99 -80 -153 -200 -201 -202 -203 -179 -154
6637 -154 -186 -218 -204 -190 -196 -202 -185 -169 -207 -245 -237 -229 -197 -165 -133 -101 -100 -100 -99 -99 -87 -76 -65 -54 -32 -9 12 35 -12 -60 -109 -157 -226 -295 -288 -281 -220 -159 -171 -183
$$ packed form
6718d4M2M0M2J0J0RJ0m5m6%JONl9l9K3K2K3K3j8j8j8j8o2o2M4M5M0L9noj4j5j5j5J2J1J2J0
6706@l7l8J0J1M8R4M3m7m8m6n4n3k2k2K3K4j%P6P5j1j2L4L4j6j7j6j7lmm5m6N1R5M6m5k0k1
6694B3J9K0m6m4m5m6J0J0J0J0M6M5o0o1opM0L9K3K2K3K4l3l1p8p8QQk4K2N3l9m2N0O0l1n0
6683a56n1J6J6J6J5O3O2j3j4non0n1N0N0MML8L6M2m8q4q5j5j4l2l1M4M5O7O6K1K0j3j3M0n0
6671a6q9m4J%j3j4j4j4o0o1J6J6M7M6L3j3k9O2Q4Q3M1M1l6l5k2k1m4m5j6j6K9L0J4J4J1J1
6660b3k3o9r4lO1O1O7O6j3j3J9k8l5N4K6k0l0k9l3l3J7J7non6n6j3j3K8j9jR1R8N1L8L8j%
6648A16k4k3o9p0k3k4L4L4N6N8m7m6jjL5L6J2J3mmk6k7j02j03MMk8k7P4P4J9p3m7jjjK4K5
6637a54l2l2J4J4ooJ7J6l8l8QQL2L2L2L2J%J%J2J1J1J1K2K3K1K3m7m8m9m8o9o9PPO1O1j2j2
$$ plain form
6624 -183 -150 -71 10 0 16 33 -1 -35 -80 -125 -124 -123 -87 -50 -59 -68 -78 -88 -106 -78 -41 -96 -125 -108 -91 -120 -152 -138 -134 -221 -257 -247 -171 -96 -125 -153 -131
6613 -131 -109 -87 -65 -43 -21 -45 -69 -90 -112 -134 -156 -182 -209 -190 -171 -235 -299 -287 -275 -218 -161 -118 -122 -151 -90 18 82 95 109 43 -21 -68 -114 -137 -160
6602 -160 -164 -168 -127 -41 18 -13 -36 -60 -70 -80 -90 -100 -74 -47 -53 -12 18 -41 -118 -150 -161 -173 -158 -144 -116 -87 -59 -31 9 50 14 -20 -68 -116 -58 0
6591 0 14 29 21 12 -17 -48 -33 -18 -10 -2 20 89 156 146 90 109 106 26 -30 -42 -7 27 65 103 99 96 92 89 2 -83 -170 -256 -267 -277 -211 -146 -80 -14 -25 -35
6578 -35 -33 -31 -29 -26 -63 -100 -132 -164 -184 -127 -70 -90 -132 -174 -176 -177 -139 -100 -107 -115 -80 -45 -56 -113 -135 -82 -48 -60 -73 -86 -178 -270 -287 -305 -272 -239 -233 -150 -22
6566 -22 29 35 41 -3 -48 -55 -63 -71 -78 -92 -106 -136 -211 -232 -176 -90 -4 30 65 -5 -76 -120 -164 -132 -99 -80 -61 -42 -24 -34 -45 -56 -66 -86 -106 -126 -146 -94
6554 -94 -42 -5 -13 -69 -48 -27 -82 -135 -142 -174 -207 -250 -216 -180 -144 -69 5 34 64 51 37 24 11 -3 -18 6 32 46 -15 -61 -60 -88 -117 -66 -15 -5 4
6543 4 14 23 29 35 41 47 103 159 169 179 172 166 160 153 114 75 36 -2 37 77 10 -56 -126 -196 -266 -336 -287 -238 -189 -140 -100 -60 -20 19 40 61 83 104 75 46
$$ packed form
6624a83L3P9Q1j0J6J7l4l4m5m5JJL6L7rrj0j0j8K8L7n5k9J7J7k9l2J4Mq7l6J0P6P5k9k8K2
6613a31K2K2K2K2K2k4k4k1k2k2k2k6k7J9J9o4o4J2J2N7N7M3mk9O1J08O4J3J4o6o4m7m6k3k3
6602a60mmM1Q6N9l1k3k4j0j0j0j0K6K7oM1L0n9p7l2j1j2J5J4K8K9K8K8M0M1l6l4m8m8N8N8
6591@J4J5qrk9l1J5J5QQK2O9O7j0n6J9lq0n6j2L5L4L8L8mlmlq7q5q7q6j1j0O6O5O6O6j1j0
6578c5KKKLl7l7l2l2k0N7N7k0m2m2kjL8L9pqL5L5j1n7k2N3L4j2j3j3r2r2j7j8L3L3OQ3J28
6566b2N1OOm4m5pqqpj4j4l0p5k1N6Q6Q6L4L5p0p1m4m4L2L3J9J9J9J8j0j1j1j0k0k0k0k0N2
6554i4N2L7qn6K1K1n5n3pl2l3m3L4L6L6P5P4K9L0j3j4j3j3j4j5K4K6J4o1m6Jk8k9N1N1J0R
6543DJ0ROOOON6N6J0J0poopl9l9l9l8L9M0o7o6p0p0p0p0M9M9M9M9M0M0M0L9K1K1K2K1k9k9
$$ plain form
6531 46 17 -11 -57 -103 -103 -104 -63 -22 -27 -32 -54 -75 -96 -117 -165 -212 -183 -154 -139 -123 -108 -92 -30 31 17 4 24 44 19 -5 -28 -51 -74 -97 -70 -44 -63
6519 -63 -82 -64 -46 -28 -10 12 36 -15 -68 -58 -49 -39 -30 3 36 24 11 -32 -76 -74 -73 -81 -89 -97 -105 -65 -26 13 52 24 -4 -65 -203 -270 -338 -334 -330 -259 -188 -136
6507 -136 -176 -251 -234 -198 -162 -154 -145 -137 -129 -127 -125 -199 -273 -275 -277 -203 -129 -102 -76 -50 -23 -56 -89 -122 -154 -102 -50 -54 -148 -186 -224 -160 -97 -62 -27 6 41 48 55 62 70
6494 70 50 31 12 -6 -124 -242 -254 -265 -186 -106 -103 -99 -75 -51 19 -63 -113 -71 -65 31 96 162 178 102 72 41 4 -31 9 51 93 134 109 83 12 -59
6483 -59 -96 -133 -124 -116 -92 -68 6 -9 14 38 56 74 97 120 96 73 62 50 84 118 124 130 136 142 75 9 -57 -123 -119 -115 -157 -199 -209 -219 -184 -148 -119 -89 -54
6471 -54 -110 -195 -280 -233 -187 -147 -107 -143 -179 -169 -158 -148 -137 -112 -86 -136 -187 -184 -181 -173 -165 -201 -161 -87 -14 1 16 31 47 5 -36 23 83 117 75 30 -14
6459 -14 -57 -100 -143 -186 -213 -240 -221 -202 -100 1 27 53 48 42 37 31 26 20 61 101 113 126 62 0 -54 -107 -84 -61 -66 -72 -77 -83 -123 -163 -202 -242 -187 -131 -76
6447 -76 -20 -23 -25 -28 -30 -95 -161 -119 -78 -106 -135 -209 -283 -260 -237 -214 -191 -201 -211 -216 -222 -162 -26 32 15 -25 -66 -81 -21 76 128 104 80 71 61 51 41 21
$$ packed form
6531D6k9k8m6m6%jM1M1nnk2k1k1k1m8m7K9K9J5J6J5J6O2O1j4j3K0K0k5k4k3k3k3k3K7K6j9
6519f3j9J8J8J8J8K2K4n1n3J0RJ0RL3L3j2j3m3m4KJqqqqM0L9L9L9k8k8o1j38o7o8MMP1P1N2
6507a36m0p5J7L6L6QRQQKKp4p4kkP4P4K7K6K6K7l3l3l3l2N2N2mr4l8l8O4O3L5L5L3L5PPPQ
6494G0k0j9j9j8j18j18j2j1P9Q0LMK4K4P0q2n0M2OR6O5O6J6p6l0l1l7l5M0M2M2M1k5k6p1p1
6483e9l7l7RQK4K4P4j5K3K4J8J8K3K3k4k3j1j2L4L4OOOOo7o6o6o6MMm2m2j0j0L5L6K9L0L5
6471e4n6q5q5M7M6M0M0l6l6J0J1J0J1K5K6n0n1LLQQl6M0P4P3J5J5J5J6m2m1N9O0L4m2m5m4
6459a4m3m3m3m3k7k7J9J9J02J01K6K6nononoM1M0J2J3o4o2n4n3K3K3nonom0m0l9m0N5N6N5
6447g6N6lklko5o6M2M1k8k9p4p4K3K3K3K3j0j0noO0J36N8j7m0m1j5O0R7N2k4k4rj0j0j0k0
$$ plain form
6435 21 1 -60 -121 -116 -35 -14 -39 -85 -85 -11 61 85 33 -2 8 -3 -14 -68 -123 -102 -82 -16 49 19 -10 -40 -70 -70 -70 -116 -162 -199 -236 -228 -219 -197 -174 -197
6424 -197 -219 -164 -109 -99 -90 -66 -42 -65 -87 -122 -158 -117 -76 -158 -240 -214 -189 -152 -115 -120 -125 -150 -129 -86 -120 -152 -108 -10 41 31 21 -38 -97 -124 -152 -134
6412 -134 -115 -101 -86 -71 -56 -15 26 39 -24 -109 -118 -124 -85 -57 -29 1 32 18 4 -9 -23 -48 -73 -94 -114 -103 -15 72 84 15 -53 -82 -110 -136 -163 -189
6401 -189 -216 -250 -285 -318 -350 -309 -222 -118 -91 -59 -28 -1 25 10 -3 -13 -22 -19 59 92 49 18 -12 -48 -84 3 91 42 -6 -17 -27 -37 -47 -34 -22
6390 -22 -9 3 12 21 41 -29 -130 -139 -131 -168 -155 -95 -64 -33 -1 31 -11 -55 -61 -67 -33 0 8 -75 -132 -144 -144 -144 -142 -139 -139 -140 -140 -140 -90 -41 -37 -33 -45 -58 -70 -82 -47
6377 -47 -11 23 59 11 -35 -36 -38 -20 -1 16 35 7 -20 -46 -71 -74 -32 35 12 -21 -55 -95 -134 -109 -83 -58 -32 -18 -4 9 23 28 33 38 42 -20 -84 -72 31
6365 31 131 77 18 51 88 125 91 58 61 64 67 70 26 -16 -60 -104 -136 -168 -200 -232 -187 -142 -97 -51 -30 -8 -32 -56 -78 -100 -122 -144 -146 -149 -106 -63 -37 -11
6353 -11 -61 -111 -67 -22 21 66 97 128 114 99 42 -14 -71 -128 -110 -93 -75 -58 -93 -128 -139 -58 -22 12 -22 -57 -46 -34 -23 -11 -60 -109 -111 -114 -72 -30
$$ packed form
6435B1k0o1o1NQ1K1k5m6%P4P2K4n2l5J0j1j1n4n5K1K0O6O5l0k9l0l0%%m6m6l7l7QRK2K3k3
6424a97k2N5N5J0RK4K4k3k2l5l6M1M1q2q2K6K5L7L7nnk5K1M3l4l2M4R8N1j0j0n9n9k7k8J8
6412a34J9J4J5J5J5M1M1J3o3q5roL9K8K8L0L1j4j4j3j4k5k5k1k0J1Q8Q7J2o9o8k9k8k6k7k6
6401a89k7l4l5l3l2M1Q7J04K7L2L1K7K6j5j3j0rLP8L3m3l1l0l6l6Q7Q8m9m8j1j0j0j0J3J2
6390b2J3J2RRK0p0j01rQl7J3O0L1L1L2L2m2m4ooL4L3Qq3n7j2%%KL%j%%N0M9MMj2j3j2j2L5
6377d7L6L4L6m8m6jkJ8J9J7J9k8k7k6k5lM2O7k3l3l4m0l9K5K6K5K6J4J4J3J4NNNMo2o4J2J03
6365C1J00n4n9L3L7L7l4l3LLLLm4m2m4m4l2l2l2l2M5M5M5M6K1K2k4k4k2k2k2k2klM3M3K6K6
6353a1n0n0M4M5M3M5L1L1j4j5n7n6n7n7J8J7J8J7l5l5j1Q1L6L4l4l5J1J2J1J2m9m9klM2M2
$$ plain form
6342 -30 -34 -38 -35 -32 -29 -26 -26 -26 -72 -119 -110 -102 -164 -227 -301 -285 -243 -201 -171 -141 -157 -172 -210 -247 -266 -193 -49 2 -86 -175 -175 -176 -99 -23 38 100 86 72 53 33 -9
6329 -9 -52 -63 -75 -10 54 -18 -91 -141 -191 -154 -117 -80 -43 -69 -95 -115 -136 -170 -113 -55 -90 -95 -101 -89 -78 -9 58 132 114 51 -11 -79 -148 -140 -131 -83 -34 11
6317 11 -33 -103 -172 -189 -205 -176 -146 -123 -99 -122 -144 -132 -121 -155 -189 -178 -167 -179 -191 -133 -74 -62 -50 -36 -23 -7 8 25 88 168 172 101 30 -45 -121 -150
6306 -150 -179 -162 -146 -159 -173 -187 -201 -179 -157 -140 -122 -86 -126 -194 -186 -116 -122 -157 -191 -203 -215 -156 -96 -77 -135 -176 -170 -193 -215 -188 -162 -140 -118 -119 -120 -76 -33
6295 -33 -35 -38 -76 -113 -128 -143 -76 -8 -17 -25 -42 -58 -51 -45 -3 38 49 -15 -81 -101 -151 -201 -211 -221 -185 -149 -176 -203 -227 -175 -137 -100 -133 -167 -144 -121 -143 -166
6283 -166 -179 -193 -131 -68 -50 -31 -59 -86 -21 44 33 21 -49 -120 -115 -110 -118 -127 -131 -135 -176 -141 -106 -148 -132 -115 -104 -93 -65 -38 -10 16 51 86 75 64 -20 -106
6271 -106 -115 -124 -173 -223 -273 -322 -252 -181 -116 -52 38 38 14 37 -27 -137 -196 -164 -102 -85 -113 -140 -138 -135 -87 -38 -58 -77 -96 -115 -95 -74 -99 -124 -143 -161 -180
6260 -180 -199 -205 -210 -170 -130 -144 -159 -174 -189 -192 -195 -199 -202 -161 -120 -125 -130 -80 -31 26 -6 -77 -103 -28 46 124 110 41 -28 2 33 -11 -57 -66 -75 -85 -94 -90 -86 -82 -78 -143
$$ packed form
6342c0mmLLLL%%m6m7RQo2o3p4J6M2M2L0L0j6j5l8l7j9P3J44N1q8q9%jP7P6O1O2j4j4j9k0m2
6329im3j1j2O5O4p2p3n0n0L7L7L7L7k6k6k0k1l4N7N8l5noJ2J1O9O7P4j8o3o2o8o9QRM8M9M5
6317A1m4p0o9j7j6K9L0K3K4k3k2J2J1l4l4J1J1j2j2N8N9J2J2J4J3J6J5J7O3Q0Mp1p1p5p6k9
6306a50k9J7J6j3j4j4j4K2K2J7J8L6m0o8QP0ol5l4j2j2N9O0J9n8m1Ok3k2K7K6K2K2jjM4M3
6295c3kll8l7j5j5O7O8rqj7j6POM2M1J1o4o6k0n0n0j0j0L6L6k7k7k4N2L8L7l3l4K3K3k2k3
6283a66j3j4O2O3J8J9k8k7O5O5j1j2p0p1NNqrmmm1L5L5m2J6J7J1J1K8K7K8K6L5L5j1j1q4q6
6271a06rrm9n0n0m9P0P1O5O4R0%k4K3o4j10n9L2O2J7k8k7KLM8M9k0j9j9j9K0K1k5k5j9j8j9
6260a80j9onM0M0j4j5j5j5llmlM1M1nnN0M9N7l2p1k6P5P4P8j4o9o9L0L1m4m6rrj0rMMMMo5
$$ plain form
6247 -143 -208 -166 -124 -145 -165 -140 -115 -101 -87 -148 -210 -163 -116 -69 -23 -33 -43 -53 -64 -51 -38 -70 -103 -101 -100 -53 -5 13 31 50 69 8 -53 -68 -84 -61
6236 -61 -39 -16 5 -29 -63 -52 -41 -50 -58 -66 -75 -51 -28 -51 -73 -76 -78 -37 3 -26 -102 -136 -63 9 82 129 99 21 -55 -61 -67 -58 -49 -40 -31 25 82 108 58 12 12 83
6223 83 109 58 7 -45 -99 -92 -85 -77 -70 -47 -23 45 114 127 140 152 165 142 118 49 -19 -23 -26 -30 -33 5 45 8 -28 -27 -26 20 67 104 142 103 64 48 33 -22
6210 -22 -78 -131 -108 -9 13 -21 -56 -91 -126 -132 -61 -34 -6 3 14 -21 -102 -179 -180 -198 -262 -256 -203 -134 -141 -231 -276 -214 -153 -136 -120 -103 -87 -68 -50 -33 58 124
6198 124 114 103 47 -13 -28 4 36 26 15 -40 -96 -94 -93 -46 0 9 19 -43 -106 -140 -128 -97 -141 -86 13 52 15 -94 -158 -164 -93 -29 -42 -109 -176 -178 -103
6187 -103 -46 -35 8 52 47 43 27 11 -4 -20 7 35 17 0 -51 -103 -49 5 35 65 94 124 120 117 6 -103 -130 -158 -139 -121 -90 -59 -28 2 -21 -44
6176 -44 -144 -243 -254 -264 -228 -192 -199 -206 -213 -220 -139 -58 22 103 70 37 -41 -120 -116 -112 -108 -104 -115 -126 -137 -147 -134 -121 -108 -95 -135 -175 -139 -102 -51 -1 49 100 101
6164 101 102 104 105 95 85 75 65 48 31 15 -1 -22 -44 -65 -87 -92 -98 -175 -252 -281 -234 -154 -74 -54 -34 31 97 88 79 25 -28 -120 -211 -166 -120 -71 -23 -20 -17
$$ packed form
6247a43o5M2M2k1k0K5K5J4J4o1o2M7M7M7M6j0j0j0j1J3J3l2l3KJM7M8J8J8J9J9o1o1j5j6K3
6236f1K2K3K1l4l4J1J1rqqrK4K3k3k2lkM1M0k9p6l4P3P2P3M7l0p8p6ooRRRRN6N7K6n0m6%P1
6223H3K6n1n1n2n4PPQPK3K4O8O9J3J3J2J3k3k4o9o8mlmlL8M0l7l6JJM6M7L7L8l9l9j6j5n5
6210b2n6n3K3R9K2l4l5l5l5oP1K7K8RJ1l5q1p7jj8o4ON3O9pr0m5O2O1J7J6J7J6J9J8J7R1O6
6198A24j0j1n6o0j5L2L2j0j1n5n6KJM7M6RJ0o2o3l4J2L1m4N5R9L9l7j09o4oP1O4j3o7o7kP5
6187a03N7J1M3M4nmj6j6j5j6K7K8j8j7n1n2N4N4L0L0K9L0mlj11j09k7k8J9J8L1L1L1L0k3k3
6176d4j00r9j1j0L6L6ppppQ1Q1Q0Q1l3l3p8p9MMMMj1j1j1j0J3J3J3J3m0m0L6L7N1N0N0N1J
6164A01JKJj0j0j0j0j7j7j6j6k1k2k1k2nop7p7k9M7Q0Q0K0K0O5O6rrn4n3r2r1M5M6M9M8LL
$$ plain form
6152 -17 -59 -101 -143 -185 -165 -145 -125 -105 -84 -62 -41 -19 -47 -75 -103 -131 -113 -96 -78 -61 -18 25 22 20 19 19 19 18 39 60 80 101 97 93 44 -5 -72 -140 -101
6139 -101 -62 -35 -8 -27 -46 -20 6 -42 -92 -152 -213 -197 -181 -163 -145 -128 -110 -127 -145 -163 -181 -175 -170 -206 -242 -237 -157 -122 -163 -188 -213 -166 -120 -107 -95 -82
6128 -82 -70 -53 -35 -64 -92 -68 -43 -125 -207 -217 -226 -190 -154 -174 -194 -153 -36 37 66 74 37 0 -39 -77 -40 -49 -58 -62 -66 -68 -70 -71 -73 -117 -162 -130 -98 -67 -36 -4
6116 -4 26 8 -9 -27 -46 -36 -27 27 82 79 76 -3 -82 -37 7 7 6 45 85 124 164 164 165 165 165 116 67 18 -30 -33 -37 -40 -43 -57 -72 -86 -101 -80 -59 -39 -18 -24 -30
6103 -30 -36 -42 -40 -39 -37 -35 -62 -88 -115 -141 -127 -114 -123 -132 -186 -240 -247 -255 -169 -84 -74 -64 -125 -186 -201 -216 -207 -197 -233 -269 -235 -200 -212 -223 -179 -135 -137 -139 -144 -148 -153 -158 -61 35
6089 35 76 26 -72 -172 -201 -230 -199 -168 -138 -107 -48 10 -6 -23 -5 13 82 61 21 -18 -64 -110 -120 -131 -142 -152 -124 -96 -40 -75 -141 -208 -204 -200 -134 -69
6078 -69 23 25 2 -20 -4 12 11 9 -36 -83 -115 -147 -133 -119 -131 -143 -109 -76 -86 -96 -83 -70 -62 -53 -67 -82 -49 -17 -7 1 -29 -60 -92 -123 -90 -56 -69 -81
6066 -81 -78 -74 -85 -142 -178 -122 -103 -85 -33 -73 -108 -142 -137 -133 -128 -124 -82 -40 -47 -54 -39 -69 -85 -9 22 -36 -37 -39 -77 -114 -152 -189 -192 -196 -199 -202 -136 -69 -3 62 76 90
$$ packed form
6152a7m2m2m2m2K0K0K0K0K1K2K1K2k8k8k8k8J8J7J8J7M3M3lkj%%jK1K1K0K1mmm9m9o7o8L9
6139a01L9K7K7j9j9K6K6m8n0o0o1J6J6J8J8J7J8j7j8j8j8ONl6l6NQ0L5m1k5k5M7M6J3J2J3
6128h2J2J7J8k9k8K4K5q2q2j0rL6L6k0k0M1J17P3K9Ql7l7l9l8L7rrmmkkjkm4m5L2L2L1L1L2
6116dL0j8j7j8j9J0RN4N5llp9p9M5M4%jL9M0L9M0%J%%m9m9m9m8lmllj4j5j4j5K1K1K0K1oo
6103c0ooKJKKk7k6k7k6J4J3rrn4n4pqQ6Q5J0J0o1o1j5j5RJ0l6l6L4L5j2j1M4M4kknmnnR7R6
6089C5M1n0r8j00k9k9L1L1L0L1N9N8j6j7J8J8O9k1m0l9m6m6j0j1j1j0K8K8N6l5o6o7MMO6O5
6078f9R2Kk3k2J6J6jkm5m7l2l2J4J4j2j2L4L3j0j0J3J3QRj4j5L3L2J0Ql0l1l2l1L3L4j3j2
6066h1LMj1n7l6N6J9J8N2m0l5l4NMNMM2M2ppJ5l0j6P6L1n8jkl8l7l8l7lmllO6O7O6O5J4J4
$$ plain form
6053 90 104 118 56 -5 8 22 47 72 51 31 -14 -59 -82 -104 -81 -59 -59 -59 -57 -55 -76 -98 -140 -182 -148 -113 -121 -128 -91 -8 10 -61 -127 -102 -93 -37 49 44 0
6041 0 -43 -92 -142 -161 -180 -179 -178 -142 -151 -145 -49 25 7 -59 -126 -146 -165 -162 -159 -201 -242 -238 -234 -148 -62 -22 17 27 38 48 59 40 21 2 -16 -21 -25 -29 -33 8 50 87
6028 87 124 118 22 -63 -148 -215 -190 -109 -29 -66 -103 -141 -178 -151 -123 -96 -68 -19 29 -27 -85 -93 -102 -111 -120 -105 -90 -75 -60 -34 -7 18 44 -9 -64 -118 -172 -162
6016 -162 -152 -141 -131 -119 -106 -94 -82 -63 -44 -71 -98 -114 -131 -147 -164 -144 -124 -105 -85 -80 -75 -116 -157 -138 -118 -99 -80 -43 -6 30 66 69 71 28 -14 17 49
6005 49 35 21 33 44 56 68 15 -37 -44 -51 -40 -28 -62 -96 -61 -27 58 53 23 -5 4 15 68 122 99 76 80 84 88 92 109 126 144 161 144 127 110 92 97 102
5992 102 107 112 81 49 -27 -104 -127 -150 -128 -105 -100 -95 -89 -84 -66 -48 -30 -13 -14 -15 -16 -18 11 41 71 100 13 -74 -97 -45 7 60 41 23 12 1 -10 -21 -45 -69
5980 -69 -137 -128 -83 -39 -36 -33 21 76 54 32 -4 -40 -32 -23 53 129 160 191 129 68 36 81 125 122 57 67 106 68 -28 -125 -139 -152 -90 -27 6 40 -1 -43
5968 -43 -12 18 3 -11 -52 -93 -104 -161 -216 -194 -142 -90 -56 -21 -18 -90 -170 -205 -158 -65 -15 33 25 -59 -128 -150 -127 -59 -18 -53 -84 -114 -180 -170 -101 -77
$$ packed form
6053I0J4J4o2o1J3J4K5K5k1k0m5m5k3k2K3K2%%KKk1k2m2m2L4L5qpL7Q3J8p1o6K5RN6Q6nm4
6041@m3m9n0j9j9JJL6rOR6P4j8o6o7k0j9LLm2m1MMQ6Q6M0L9J0J1J0J1j9j9j9j8nmmmM1M2L7
6028H7L7or6q5q5o7K5Q1Q0l7l7l8l7K7K8K7K8M9M8n6n8qrrrJ5J5J5J5K6K7K5K6n3n5n4n4J0
6016a62J0J1J0J2J3J2J2J9J9k7k7j6j7j6j7K0K0J9K0NNm1m1J9K0J9J9L7L7L6L6LKm3m2L1L2
6005D9j4j4J2J1J2J2n3n2ppJ1J2l4l4L5L4Q5nl0k8RJ1N3N4k3k3MMMMJ7J7J8J7j7j7j7j8NN
5992A02NNl1l2p6p7k3k3K2K3NNONJ8J8J8J7jjjkK9L0L0K9q7q7k3N2N2N3j9j8j1j1j1j1k4k4
5980f9o8RM5M4LLN4N5k2k2l6l6QRP6P6L1L1o2o1l2M5M4lo5J0L9l8r6r7j4j3O2O3L3L4m1m2
5968d3L1L0j5j4m1m1j1n7n5K2N2N2L4L5Lp2q0l5M7R3N0M8qq4o9k2K3O8M1l5l1l0o6J0O9K4
$$ plain form
5957 -77 -60 -43 -29 -15 -29 -42 -9 22 32 41 51 61 114 167 114 15 -46 -32 12 57 138 220 237 179 75 -27 -28 -30 -11 6 65 124 188 176 161 146
5946 146 80 14 25 36 76 116 156 196 202 207 136 66 6 -52 -35 -18 34 87 140 193 193 193 86 -20 41 104 167 230 203 176 149 122 89 56 99 142
5934 142 143 143 143 143 145 146 148 149 198 247 220 193 141 89 65 118 166 137 80 23 -24 -72 -88 -150 -157 -58 21 24 -21 -67 -72 -77 -12 52 87 46 -50 -100 -73 0 59
5922 59 73 45 62 45 29 61 93 140 186 159 85 3 28 66 105 92 78 65 52 11 -29 97 224 204 185 165 145 100 56 87 119 128 138 20
5911 20 -6 74 155 162 77 -7 0 85 172 150 128 183 237 235 234 283 241 214 186 199 211 203 195 186 178 159 141 199 257 255 253 327 401 442 483 562 733 800 594
5899 594 419 336 286 235 236 237 221 205 229 253 289 235 191 148 89 122 201 188 173 157 182 207 189 172 200 229 232 234 161 87 124 161 198 235 237 238 239 240
5887 240 185 129 149 169 155 140 202 264 292 319 301 283 294 306 329 260 174 180 266 352 314 276 284 292 350 408 421 433 419 405 390 376 314 252 236 220
5876 220 272 323 375 426 423 421 418 415 427 439 451 462 494 526 558 590 520 449 513 578 699 774 856 1030 1185 1127 945 854 876 898 818 739 666 594 566
$$ packed form
5957g7J7J7J4J4j4j3L3L1J0RJ0J0N3N3n3r9o1J4M4M5Q1Q2J7n8j04j02jkJ9J7N9N9O4j2j5j5
5946A46o6o6J1J1M0M0M0M0ONp1p0o0n8J7J7N2N3N3N3%%j07j06O1O3O3O3k7k7k7k7l3l3M3M3
5934A42J%%%KJKJM9M9k7k7n2n2k4N3M8k9n7n7m7m8j6o2pR9P9Lm5m6nnO5O4L5m1r6n0K7P3N9
5922E9J4k8J7j7j6L2L2M7M6k7p4q2K5L8L9j3j4j3j3m1m0J26J27k0j9k0k0m5m4L1L2RJ0j18
5911B0k6Q0Q1Pq5q4PQ5Q7k2k2N5N4kjM9m2k7k8J3J2qqrqj9j8N8N8kkP4P4M1M1P9J71O7k06
5899E94j75q3n0n1JJj6j6K4K4L6n4m4m3n9L3P9j3j5j6K5K5j8j7K8K9LKp3p4L7L7L7L7KJJJ
5887B40n5n6K0K0j4j5O2O2K8K7j8j8J1J2K3o9q6OQ6Q6l8l8QQN8N8J3J2j4j4j5j4o2o2j6j6
5876B20N2N1N2N1lkllJ2J2J2J1L2L2L2L2p0p1O4O5J21P5Q2J74J55n8j82r1K2K2q0p9p3p2k8
$$ plain form
5865 566 539 537 535 609 683 660 637 690 744 814 885 818 751 727 703 754 806 914 1021 1174 1327 1437 1548 1765 1983 2191 2399 2586 2820 3174
5856 3174 3619 4115 4763 5715 6941 8484 10545 13369 17260 22515 29387 37314 44113 46609 43464 36431 28514 21714
5850 21714 16530 12800 10137 8214 6748 5641 4808 4124 3531 3081 2723 2464 2250 2096 1988 1832 1721 1625 1528 1434 1341 1293
5844 1293 1245 1198 1150 1076 1003 975 947 909 871 833 795 759 724 689 653 643 632 622 611 645 678 797 1008 1246 1484 1694 1859 1952 1831 1600
5834 1600 1368 1213 1058 979 900 877 853 873 892 874 810 792 864 974 992 930 868 900 932 1010 1087 1188 1288 1343 1397 1547 1696 1805 1915
5825 1915 2022 2221 2521 2912 3388 3955 4645 5487 6605 8120 10164 12910 16695 21852 28660 36779 44295 47757 45211
5819 45211 38123 29789 22524 16984 12939 10087 8058 6593 5463 4590 3870 3325 2933 2588 2334 2121 1908 1651 1487 1443
5813 1443 1445 1446 1447 1375 1303 1180 1057 980 903 851 798 700 602 581 559 583 608 586 564 588 613 640 668 649 631 569 507 445 383 416 450 484 517 486 455
$$ packed form
5865E66k7kkP4P4k3k3N3N4P0P1o7o7k4k4N1N2J08J07J53J53J10J11K17K18K08K08J87K34L54
5856C174M45M96O48R52J226J543K061K824L891N255O872P927O799K496l145p033p917o800
5850B1714n184l730k663j923j466j107q33o84n93m50l58k59k14j54j08j56j11r6r7r4r3m8
5844A293m8m7m8p4p3k8k8l8l8l8l8l6l5l5l6j0j1j0j1L4L3J19K11K38K38K10J65R3j21k31
5834A600k32j55j55p9p9k3k4K0J9j8o4j8P2J10J8o2o2L2L2P8P7J01J00N5N4J50J49J09J10
5825A915J07J99L00L91M76N67O90Q42J118J515K044K746L785N157O808Q119P516L462k546
5819D5211p088q334p265n540m045k852k029j465j130q73p20n45l92l45k54k13k13k57j64m4
5813A443KJJp2p2j23j23p7p7n2n3r8r8k1k2K4K5k2k2K4K5K7K8j9j8o2o2o2o2L3L4L4L3l1l1
$$ plain form
5802 455 475 495 474 545 635 680 703 727 751 774 799 870 923 885 862 884 946 962 987 1011 1064 1071 1122 1265 1379 1447 1522 1596 1693 1881 2190 2499 2872
5792 2872 3246 3715 4397 5218 6313 7780 9766 12430 16039 20880 27277 35023 42494 46518 44901 38630 30622 23324
5787 23324 17643 13559 10603 8445 6806 5608 4686 3954 3375 2935 2586 2295 2003 1803 1695 1537 1379 1272 1166 1049 932
5780 932 891 850 795 740 686 631 554 478 401 324 282 240 204 168 158 239 268 298 212 126 65 95 165 234 172 110 54 -2 41 86 155 133 85 38 31
5769 31 23 92 160 142 124 106 88 142 196 173 151 129 108 41 -26 -7 10 -17 -44 -27 -10 7 24 55 86 157 228 242 165 139 113 89 64 -5 -74 -132
5758 -132 -189 -171 -152 -139 -126 -67 -9 66 142 168 101 32 39 69 53 56 59 14 -77 -103 -52 -48 -43 -68 -93 -118 -143 -86 -28 -16 -4 -1 1 5 8 18 27 42 56 19
5746 19 58 83 62 42 67 58 50 95 64 -25 -116 -110 -28 8 -31 -126 -220 -273 -326 -298 -270 -238 -207 -190 -128 -91 -130 -185 -194 -155 -70 -22 -20 10 41 60 79 52
5734 52 25 -31 -88 -68 -49 -20 7 -40 -134 -151 -92 -53 -60 -82 -104 -82 -15 0 -60 -147 -187 -119 -51 -57 -62 -67 -71 -121 -171 -201 -230 -260 -289 -285 -281 -232 -182 -138 -94
$$ packed form
5802D55K0K0k1P1R0M5K3K4K4K3K5P1N3l8k3K2O2J6K5K4N3PN1J43J14O8P5P4R7J88L09L09L73
5792B872L74M69O82Q21J095J467J986K664L609M841O397P746P471M024j617o271q008p298
5787B3324n681m084k956k158j639j198r22p32n79m40l49k91k92k00j08j58j58j07j06j17j17
5780I32m1m1n5n5n4n5p7p6p7p7m2m2l6l6j0Q1K9L0q6q6o1L0P0O9o2o2n6n6M3M5O9k2m8m7p
5769C1qO9O8j8j8j8j8N4N4k3k2k2k1o7o7J9J7k7k7J7J7J7J7L1L1P1P1J4p7k6k6k4k5o9o9n8
5758a32n7J8J9J3J3N9N8P5P6K6o7o9PL0j6LLm5r1k6N1MNk5k5k5k5N7N8J2J2LKMLJ0RJ5J4l7
5746A9L9K5k1k0K5rqM5l1q9r1OQ2L6l9r5r4n3n3K8K8L2L1J7O2L7l9n5rL9Q5M8KL0L1J9J9k7
5734E2k7n6n7K0J9K9K7m7r4j7N9L9pk2k2K2O7J5o0q7m0O8O8onnmn0n0l0k9l0k9MMM9N0M4M4
$$ plain form
5722 -94 -90 -87 -105 -46 31 3 -28 -14 -33 -51 -59 -67 0 68 138 207 170 133 45 -42 -54 -65 -40 -15 10 35 39 42 46 49 91 133 175 217 237 257 201 145 111
5710 111 78 44 11 -51 -113 -99 -85 -73 -62 -50 -38 -41 -44 -47 -50 -45 -40 -39 -37 -72 -153 -159 -74 -17 -52 -132 -122 -25 -20 -33 -47 -48 -49 -96 -142 -144 -146 -148 -150 -143 -137 -171 -205 -228
5696 -228 -160 -97 -35 -10 14 -6 -27 -6 15 -8 -32 -36 -39 -43 -47 49 146 191 144 59 20 -49 -120 -114 -108 -103 -97 -95 -94 -93 -91 -80 -69 -190 -310 -371 -341 -286 -231 -185
5684 -185 -139 -138 -138 -98 -59 -20 18 119 220 242 264 179 47 -64 -84 -106 -128 -144 -161 -194 -227 -267 -214 -119 -24 0 24 27 30 -11 -54 -130 -206 -206 -205 -218
5672 -218 -230 -239 -248 -230 -166 -76 -78 -170 -262 -277 -293 -267 -151 -59 -14 25 64 58 52 39 72 85 7 -19 -46 -78 -111 -127 -143 -159 -176 -142 -109 -76 -43 -33 -24
5661 -24 -11 0 -21 1 -19 -132 -200 -177 -134 -92 -82 -71 -61 -51 -25 0 27 53 32 10 -10 -31 -56 -82 -61 -40 -57 -74 -165 -255 -256 -211 -138 -156 -206
5650 -206 -210 -174 -184 -206 -227 -251 -276 -249 -222 -151 -34 18 -20 -81 -142 -114 -86 -104 -122 -157 -192 -181 -170 -214 -257 -194 -131 -116 -102 -87 -72 -67 -62 -103 -144 -99
5639 -99 -54 -55 -55 -95 -135 -174 -214 -276 -339 -407 -383 -329 -275 -219 -164 -83 -78 -136 -195 -191 -186 -181 -177 -155 -133 -65 1 3 4 5 7 35 63 62 -14 -68 -46 3 54 16 -20
$$ packed form
5722i4MLj8N9P7k8l1J4j9j8qqO7O8P0O9l7l7q8q7j2j1K5K5K5K5MLMLM2M2M2M2K0K0n6n6l4
5710A11l3l4l3o2o2J4J4J2J1J2J2llllNNJKl5q1oQ5N7l5q0J0R7Nj3j4jjm7m6kkkkPOl4l4k3
5696b28O8O3O2K5K4k0k1K1K1k3k4mlmmR6R7M5m7q5l9o9p1OONOKJJKJ1J1j21j20o1L0N5N5M6
5684a85M6J%M0L9L9L8J01J01K2K2q5j32j11k0k2k2j6j7l3l3m0N3R5R5K4K4LLm1m3p6p6%Jj3
5672b18j2rrJ8O4R0kr2r2j5j6K6J16R2M5L9L9ooj3L3J3p8k6k7l2l3j6j6j6j7L4L3L3L3J0R
5661b4J3J1k1K2k0j13o8K3M3M2J0J1J0J0K6K5K7K6k1k2k0k1k5k6K1K1j7j7r1r0jM5P3j8n0
5650b06mL6j0k2k1k4k5K7K7P1J17N2l8o1o1K8K8j8j8l5l5J1J1m4m3O3O3J5J4J5J5NNm1m1M5
5639i9M5j%m0m0l9m0o2o3o8K4N4N4N6N5Q1Nn8n9MNNMK2K2O8O6KJJKK8K8jp6n4K2M9N1l8l6
$$ plain form
5626 -20 -11 -3 6 16 25 35 59 83 31 -20 -17 -15 28 71 63 -21 -59 -96 -144 -115 -103 -138 -156 -174 -194 -215 -171 -128 -125 -122 -179 -160 -82 -50 -87 -125 -119 -114 -124 -134 -144
5613 -144 -154 -145 -137 -128 -120 -151 -181 -212 -242 -224 -206 -143 -79 -99 -120 -81 33 105 99 96 93 63 33 -42 -118 -114 -111 -108 -105 -127 -148 -170 -192 -197 -202 -130 -59 29 119 117 38
5601 38 16 40 59 32 -11 -55 -56 -57 -68 -78 -88 -98 -99 -100 -146 -192 -171 -149 -128 -106 -74 -42 -86 -130 -92 -53 -60 -67 -104 -140 -101 -15 5 -50 -158 -221 -211 -155
5589 -155 -96 -83 -156 -230 -260 -291 -242 -192 -143 -93 -129 -164 -153 -143 -113 -83 -100 -116 -109 -102 -96 -89 -61 -33 -6 21 29 36 -1 -39 -96 -153 -210 -267 -269 -271 -319 -366 -308
5577 -308 -250 -237 -225 -231 -236 -169 -101 -96 -137 -152 -91 -54 -62 -86 -110 -137 -165 -194 -147 -83 -94 -129 -119 -62 -4 -51 -98 -82 -66 -49 -33 -69 -104 -139 -175 -198 -222
5565 -222 -169 -116 -140 -165 -143 -122 -126 -130 -88 -46 -33 -20 -52 -85 -80 -75 -25 25 0 -26 -97 -169 -208 -248 -181 -114 -65 -17 -40 -64 -145 -150 -91 -32 -41 -51 15 82
5554 82 48 15 -21 -57 -111 -210 -280 -275 -240 -204 -164 -124 -141 -158 -129 -101 -80 -59 -38 -17 -50 -83 -113 -144 -135 -81 -9 -14 -7 -1 -40 -79 -139 -122 -50 -23 -34 -90
5542 -90 -77 -65 -124 -183 -165 -148 -98 -49 -75 -102 -80 -58 9 77 85 93 96 99 116 58 -28 -70 -53 -36 -62 -89 -58 -28 -74 -119 -135 -150 -119 -89 -125 -161 -121
$$ packed form
5626b0RQRJ0RJ0K4K4n2n1LKM3M3qq4l8l7m8K9J2l5j8j8k0k1M4M3LLn7J9P8L2l7l8ONj0j0j0
5613a44j0RQRQl1l0l1l0J8J8O3O4k0k1L9J14P2olll0l0p5p6MLLLk2k1k2k2nnP2P1Q8R0kp9
5601C8k2K4J9k7m3m4jjj1j0j0j0jjm6m6K1K2K1K2L2L2m4m4L8L9ppl7l6L9Q6K0n5j08o3J0N6
5589a55N9J3p3p4l0l1M9N0M9N0l6l5J1J0L0L0j7j6PPOPK8K8K7K7QPl7l8n7n7n7n7kkm8m7N8
5577c08N8J3J2onO7O8Nm1j5O1L7qk4k4k7k8k9M7O4j1l5J0N7N8m7m7J6J6J7J6l6l5l5l6k3k4
5565b22N3N3k4k5K2K1mmM2M2J3J3l2l3NNN0N0k5k6p1p2l9m0O7O7M9M8k3k4q1nN9N9rj0O6O7
5554H2l4l3l6l6n4r9p0NL5L6M0M0j7j7K9K8K1K1K1K1l3l3l0l1RN4P2nPOl9l9o0J7P2K7j1n6
5542i0J3J2n9n9J8J7N0M9k6k7K2K2O7O8QQLLJ7n8q6m2J7J7k6k7L1L0m6m5j6j5L1L0l6l6M0
$$ plain form
5530 -121 -81 -31 18 8 -76 -131 -109 -106 -149 -164 -133 -101 -116 -182 -203 -174 -99 -54 -55 -27 0 5 9 -92 -194 -205 -215 -180 -145 -125 -106 -86 -67 -71 -75 22 119
5519 119 202 209 122 34 -58 -152 -169 -186 -111 -37 32 101 96 14 -50 -69 -77 -85 -90 -95 -34 27 43 58 10 -38 19 77 49 20 -8 -36 -92 -147 -156 -166 -126 -86
5507 -86 29 145 122 98 75 51 1 -48 -98 -149 -178 -208 -192 -176 -159 -142 -125 -108 -103 -98 -93 -87 -119 -151 -138 -124 -135 -146 -157 -168 -142 -116 -89 -63 -46 -29
5496 -29 -12 4 43 82 121 160 209 259 231 204 178 152 126 99 64 29 -5 -41 -127 -214 -225 -235 -211 -188 -118 -48 -54 -60 -66 -71 -95 -118 -96 -74 -30 12 55
5484 55 99 88 78 23 -32 -36 -39 -42 -46 -104 -163 -217 -271 -322 -298 -241 -183 -148 -113 -78 -44 -64 -85 -105 -125 -116 -106 -141 -177 -168 -159 -150 -141 -127 -113 -99 -85 -71 -57 -43
5472 -43 -29 -32 -35 -38 -42 -18 5 -47 -100 -115 -129 -98 -68 -93 -118 -37 44 58 72 86 100 107 113 120 126 134 142 104 66 2 -62 -126 -191 -232 -273 -237 -202 -191 -179 -168
5460 -168 -157 -138 -119 -100 -81 -116 -151 -110 -70 -79 -88 -97 -107 -115 -124 -60 2 82 86 61 83 77 72 69 66 26 -13 -53 -93 -102 -110 -119 -127 -86 -45 -49 -53 -43 -33 -23 -13 -55 -97
5446 -97 -139 -180 -165 -150 -91 -33 -8 -28 -23 58 80 55 11 -78 -73 -69 -68 -67 -46 -26 39 105 80 54 29 4 -28 -61 -94 -127 -106 -85 -141 -196 -260 -324 -312 -300
$$ packed form
5530a21M0N0M9j0q4n5K2Lm3j5L1L2j5o6k1K9P5M5jK8K7NMj01j02j1j0L5L5K0J9K0J9mmR7R7
5519A19Q3Pq7q8r2r4j7j7P5P4O9O9nq2o4j9qqnnO1O1J6J5m8m8N7N8k8k9k8k8n6n5rj0M0M0
5507h6J15J16k3k4k3k4n0m9n0n1k9l0J6J6J7J7J7J7NNNOl2l2J3J4j1j1j1j1K6K6K7K6J7J7
5496b9J7J6L9L9L9L9M9N0k8k7k6k6k6k7l5l5l4l6q6q7j1j0K4K3P0P0ooonk4k3K2K2M4M2M3
5484E5M4j1j0n5n5mllmn8n9n4n4n1K4N7N8L5L5L5L4k0k1k0k0RJ0l5l6RRRRJ4J4J4J4J4J4J4
5472d3J4lllmK4K3n2n3j5j4L1L0k5k5Q1Q1J4J4J4J4POPOQQl8l8o4o4o4o5m1m1L6L5J1J2J1
5460a68J1J9J9J9J9l5l5M1M0rrrj0qrO4O2Q0Mk5K2onllm0l9m0m0rqrqM1M1mmJ0J0J0J0m2m2
5446i7m2m1J5J5N9N8K5k0NQ1K2k5m4q9NMJJK1K0O5O6k5k6k5k5l2l3l3l3K1K1n6n5o4o4J2J2
$$ plain form
5435 -300 -308 -316 -279 -242 -176 -110 -120 -130 -117 -103 -165 -228 -192 -156 -166 -176 -200 -224 -248 -272 -284 -296 -228 -159 -118 -2 94 146 131 71 33 -3 -48 -92 -78
5424 -78 12 92 96 10 -120 -141 -86 -51 -61 -48 -35 -70 -106 -115 -124 -179 -234 -299 -365 -354 -297 -216 -211 -231 -206 -165 -123 -79 -35 3 42 5 -31 -37 -43 -48 -54 -78 -101
5412 -101 -124 -148 -84 -19 44 108 39 -28 -118 -162 -144 -49 30 64 59 55 93 55 11 12 59 106 88 69 51 33 3 -26 -11 3 28 52 122 192 102 12
5400 12 -27 -66 -138 -133 -64 3 36 68 25 -18 -44 -70 -66 -108 -158 -131 -75 -18 20 59 -7 -121 -207 -218 -196 -128 -85 -87 -61 -35 0 33 22 -33 -131 -153
5389 -153 -113 -74 -53 -33 -35 -38 -82 -127 -146 -166 -196 -180 -124 -145 -200 -255 -239 -223 -239 -255 -194 -134 -15 103 145 188 113 38 8 -20 -70 -120 -147 -174 -156
5378 -156 -139 -122 -104 -100 -95 -136 -178 -101 -24 19 -13 -54 -95 -65 -34 -37 -41 -44 -47 -48 -50 -6 37 -1 -40 -33 -26 -69 -112 -109 -106 -70 -34 -20 -7 -70 -134 -175 -215 -225 -235
5366 -235 -199 -163 -126 -90 -76 -62 -8 45 53 61 16 -28 -95 -163 -115 -67 -19 28 70 112 78 44 51 58 19 -19 24 67 31 -96 -155 -123 -72 -20 -14 -8 -79
5354 -79 -149 -148 -146 -99 -52 -78 -105 -131 -157 -130 -104 -78 -51 -90 -129 -161 -194 -199 -112 -54 3 -55 -114 -97 -80 -76 -72 -144 -216 -108 0 22 -46 -73 -99 -86 -72
$$ packed form
5435c00qqL7L7O6O6j0j0J3J4o2o3L6L6j0j0k4k4k4k4j2j2O8O9M1J16R6N2j5o0l8l6m5m4J4
5424g8R0Q0Mq6j30k1N5L5j0J3J3l5l6rrn5n5o5o6J1N7Q1Nk0K5M1M2M4M4L8L9l7l6oonok4k3
5412a01k3k4O4O5O3O4o9o7r0m4J8R5P9L4nmL8l8m4JM7M7j8j9j8j8l0k9J5J4K5K4P0P0r0r0
5400A2l9l9p2NO9O7L3L2m3m3k6k6Mm2n0K7N6N7L8L9o6j14q6j1K2O8M3kK6K6L5L3j1n5r8k2
5389a53M0L9K1K0klm4m5j9k0l0J6N6k1n5n5J6J6j6j6O1O0J19J18M2M3p5p5l0k8n0n0k7k7J8
5378a56J7J7J8MNm1m2P7P7M3l2m1m1L0L1lmlljkM4M3l8l9PPm3m3LLL6L6J4J3o3o4m1m0j0j0
5366b35L6L6L7L6J4J4N4N3QQm5m4o7o8M8M8M8M7M2M2l4l4PPl9l8M3M3l6j27n9L2N1N2OOp1
5354g9p0JKM7M7k6k7k6k6K7K6K6K7l9l9l2l3nQ7N8N7n8n9J7J7MMp2p2J08J08K2o8k7k6J3J4
$$ plain form
5343 -72 -80 -87 -71 -56 -79 -102 -54 -7 -24 -134 -197 -169 -145 -121 -137 -152 -184 -216 -146 -77 -40 -95 -195 -204 -160 -117 -63 -100 -144 -189 -220 -160 -95 -122 -138 -154
5332 -154 -111 -67 -24 18 18 18 18 18 -8 -35 -39 -44 29 104 132 160 77 -6 -43 -81 -54 -28 4 -54 -100 -145 -90 -35 24 84 89 3 -13 -29 -5 18 63 109
5320 109 109 109 121 133 99 66 42 18 -5 -29 -71 -112 -153 -194 -214 -234 -290 -345 -363 -229 -27 81 82 -7 -104 -109 -137 -166 -189 -212 -212 -211 -211 -210 -183 -155 -128
5308 -128 -101 -83 -64 -46 -28 -87 -146 -68 10 9 8 7 6 32 59 9 -39 -104 -169 -187 -206 -186 -166 -145 -125 -53 17 43 69 82 95 62 29 13 -2 32 -23
5297 -23 -60 -96 -139 -182 -199 -215 -162 -108 -46 -75 -129 -183 -204 -225 -139 -53 -43 -33 -23 -14 -15 -16 -17 -18 -38 -59 -79 -99 -119 -138 -152 -166 -179 -100 -73 -46 -82 -118
5285 -118 -109 -99 -104 -109 -114 -119 -77 -34 1 37 33 -62 -113 -72 -68 -65 -56 -47 -33 -18 -3 10 -72 -156 -194 -232 -215 -199 -183 -166 -116 -65 -15 35 13 -8 -30 -52 -59 -67 -42
5272 -42 -64 -69 17 74 86 74 63 62 107 147 95 52 9 -16 -42 -22 -3 -14 -26 -23 24 75 34 -109 -162 -143 -123 -175 -226 -223 -220 -140 -61 -71 -81 -162 -243
5261 -243 -293 -251 -186 -168 -232 -250 -160 -70 -94 -119 -143 -168 -182 -196 -164 -132 -52 28 59 -1 -1 89 123 157 145 133 75 18 -48 -114 -180 -247 -237 -228 -218 -209
$$ packed form
5343g2qpJ6J5k3k3M8M7j7j10o3K8K4K4j6j5l2l2P0O9L7n5j00rM4M3N4l7m4m5l1O0O5k7j6j6
5332a54M3M4M3M2%%%%k6k7mnP3P5K8K8q3q3l7l8K7K6L2n8m6m5N5N5N9O0Nq6j6j6K4K3M5M6
5320A09%%J2J2l4l3k4k4k3k4m2m1m1m1k0k0n6n5j8J34K02J08Jq9r7nk8k9k3k3%J%JK7K8K7
5308a28K7J8J9J8J8n9n9P8P8jjjjK6K7n0m8o5o5j8j9K0K0K1K0P2P0K6K6J3J3l3l3j6j5L4n5
5297b3l7l6m3m3j7j6N3N4O2k9n4n4k1k1Q6Q6J0J0J0Rjjjjk0k1k0k0k0j9j4j4j3P9K7K7l6l6
5285a18RJ0nnnnM2M3L5L6mr5n1M1MLRRJ4J5J5J3q2q4l8l8J7J6J6J7N0N1N0N0k2k1k2k2pqK5
5272d2k2nQ6N7J2j2j1jM5M0n2m3m3k5k6K0J9j1j2LM7N1m1j43n3J9K0n2n1LLQ0P9j0j0q1q1
5261b43n0M2O5J8o4j8R0R0k4k5k4k5j4j4L2L2Q0Q0L1o0%R0L4L4j2j2n8n7o6o6o6o7J0RJ0R
$$ plain form
5250 -209 -273 -338 -296 -254 -223 -191 -205 -218 -243 -267 -215 -163 -147 -131 -115 -99 -83 -67 -50 -34 24 83 67 50 57 64 71 78 106 135 161 187 115 -1 -104 -115
5238 -115 -75 -126 -171 -125 -88 -51 -55 -58 -40 -23 -5 12 -30 -72 -114 -157 -137 -117 -97 -77 -62 -46 -75 -105 -146 -188 -153 -118 -129 -140 -151 -162 -164 -165 -167 -168 -189 -210
5227 -210 -230 -251 -220 -188 -157 -125 -131 -136 -142 -148 -93 -39 -31 -22 -10 1 13 26 28 30 -12 -56 -40 -24 -116 -207 -215 -223 -231 -239 -163 -87 -17 52 92 42 -33 -108 -104 -99 -171 -242
5214 -242 -211 -180 -149 -117 -21 74 170 266 255 245 188 132 104 77 49 21 17 13 55 97 28 -39 -32 -24 -3 18 40 61 46 30 15 0 23 47 71 96 70
5202 70 45 19 -5 -15 -26 -36 -46 -60 -74 -94 -22 43 109 134 160 111 63 14 -33 -40 -47 -54 -61 -28 4 -7 -20 -48 -76 -58 -40 -23 -5 -33 -61 -87 -114
5191 -114 -95 -76 -100 -124 -102 -80 -77 -74 -71 -68 -18 32 37 42 37 33 29 24 79 134 124 39 -65 -170 -219 -192 -158 -170 -197 -224 -161 -98 -35 27 20 13 5 -1 0 1 79 157
5178 157 157 158 161 165 111 103 112 45 18 -8 -81 -153 -201 -172 -140 -109 -135 -161 -188 -214 -189 -164 -139 -113 -88 -63 -38 -12 -17 -22 -27 -32 -34 -36 -40 31 66 24 -13 -50 -11
5165 -11 73 132 114 76 83 60 37 -13 -65 -71 -77 -90 -103 -163 -222 -195 -168 -96 -24 0 23 -29 -81 -93 -106 -118 -131 -132 -132 -133 -134 -154 -174 -194 -214 -191 -168 -146 -123
$$ packed form
5250b09o4o5M2M2L1L2j4j3k5k4N2N2J6J6J6J6J6J6J7J6N8N9j6j7PPPPK8K9K6K6p2j16j03j1
5238a15M0n1m5M6L7L7mlJ8J7J8J7m2m2m2m3K0K0K0K0J5J6k9l0m1m2L5L5j1j1j1j1kjkjk1k1
5227b10k0k1L1L2L1L2onooN5N4QRJ2J1J2J3KKm2m4J6J6r2r1qqqqP6P6P0O9M0n0p5p5MNp2p1
5214b42L1L1L1L2R6R5R6R6j1j0n7n6k8k7k8k8mmM2M2o9o7PQK1K1K2K1j5j6j5j5K3K4K4K5k6
5202G0k5k6k4j0j1j0j0j4j4k0P2O5O6K5K6m9m8m9m7ppppL3L2j1j3k8k8J8J8J7J8k8k8k6k7
5191a14J9J9k4k4K2K2LLLLN0N0NNnmmnN5N5j0q5j04j05m9K7L4j2k7k7O3O3O3O2ppqoJJP8P8
5178A57%JLMn4qRo7k7k6p3p2m8K9L2L1k6k6k7k6K5K5K5K6K5K5K5K6nnnnkkmP1L5m2l7l7L9
5165a1Q4N9j8l8Pk3k3n0n2ooj3j3o0n9K7K7P2P2K4K3n2n2j2j3j2j3j%jjk0k0k0k0K3K3K2K3
$$ plain form
5153 -123 -144 -165 -232 -299 -267 -234 -162 -90 -57 -115 -162 -209 -226 -152 -78 -95 -84 -72 -48 67 93 27 18 10 18 27 35 43 -32 -109 -79 -49 -19 10 -5 -21 -70
5141 -70 -120 -169 -219 -206 -192 -104 30 158 195 240 285 239 193 147 101 79 58 36 15 27 39 51 63 35 7 54 147 217 196 152 109 74 39 49
5131 49 60 24 -12 -48 -84 -111 -139 -121 -103 -72 -42 -57 -72 2 77 98 26 -82 -192 -222 -160 -130 -100 -111 -121 -74 -26 21 68 48 27 -6 -87 -174
5120 -174 -170 -61 46 92 -12 -118 -71 -29 12 18 23 45 66 42 18 17 17 -53 -124 -151 -87 -75 -62 -40 -18 -41 -109 -185 -169 -133 -143 -135 -82 -58 -33 -46
5109 -46 -59 -72 -85 -61 -37 -58 -80 -107 -135 -162 -189 -223 -257 -215 -173 -137 -101 -111 -122 -131 -140 -149 -158 -212 -266 -244 -222 -216 -210 -203 -197 -173 -149 -125 -100 -95 -90 -85 -79 -82 -86 -89 -92
5096 -92 -101 -110 -119 -128 -163 -198 -234 -269 -277 -286 -295 -303 -243 -182 -122 -62 -60 -59 -103 -148 -175 -203 -185 -166 -169 -172 -129 -86 12 111 72 34 -34 -103 -166 -230 -236 -151 -91 -78 -116 -155
5083 -155 -120 -86 -39 6 -53 -113 -145 -178 -210 -243 -157 -71 -30 9 -49 -109 -93 -76 -56 -35 60 157 120 84 47 10 -25 -60 -96 -131 -99 -67 -35 -3 -14
5072 -14 -25 8 43 41 39 38 36 127 218 227 235 185 43 -46 -136 -152 -167 -137 -107 -96 -85 -120 -154 -147 -140 -134 -127 -44 39 15 -8 6 21 36 51 48 45 42 39 51 62 73
$$ packed form
5153a23k1k1o7o7L2L3P2P2L3n8m7m7j7P4P4j7J1J2K4J15K6o6rqQRQQp5p7L0L0L0K9j5j6m9
5141g0n0m9n0J3J4Q8J34J28L7M5M5m6m6m6m6k2k1k2k1J2J2J2J2k8k8M7R3P0k1m4m3l5l5J0
5131D9J1l6l6l6l6k7k8J8J8L1L0j5j5P4P5K1p2j08j10l0O2L0L0j1j0M7M8M7M7k0k1l3q1q7
5120a74MJ09J07M6j04j06M7M2M1ONK2K1k4k4j%p0p1k7O4J2J3K2K2k3o8p6J6L6j0QN3K4K5j3
5109d6j3j3j3K4K4k1k2k7k8k7k7l4l4M2M2L6L6j0j1rrrrn4n4K2K2OOPOK4K4K4K5NNNOlmll
5096i2rrrrl5l5l6l5qrrqO0O1O0O0KJm4m5k7k8J8J9llM3M3R8R9l9l8o8o9o3o4oQ5O0J3l8l9
5083a55L5L4M7M5n9o0l2l3l2l3Q6Q6M1L9n8o0J6J7K0K1R5R7l7l6l7l7l5l5l6l5L2L2L2L2j1
5072a4j1L3L5kkjkR1R1RQn0j42q9r0j6j5L0L0J1J1l5l4PPOPQ3Q3k4k3J4J5J5J5llllJ2J1J1
$$ plain form
5059 73 85 10 -65 -33 -2 -17 -33 -49 -64 -51 -39 -26 -13 -18 -24 15 55 -5 -66 -81 -96 -72 -47 -23 1 -51 -104 -163 -130 -91 -53 -55 -57 -52 -47 -42 -37 -72 -107
5047 -107 -117 -36 -19 -2 -85 -169 -178 -186 -240 -295 -295 -296 -297 -298 -319 -339 -360 -381 -352 -323 -295 -266 -234 -201 -169 -137 -142 -147 -76 -5 -5 -5 -6 -6 17 42 66 91 144 197 143
5034 143 89 0 -88 -101 -113 -96 -79 -107 -136 -179 -223 -166 -109 -47 -77 -131 -186 -149 -112 -181 -251 -315 -379 -336 -294 -266 -239 -166 -92 -38 14 23 31 36 41 47 52 13
5022 13 -25 -18 -11 17 46 0 -48 -110 -173 -211 -158 -118 -78 -108 -138 -190 -242 -156 -70 -58 -46 -110 -174 -128 -83 -37 7 -11 -31 -39 -138 -198 -166 -192 -217 -205 -194
5011 -194 -182 -171 -186 -202 -218 -234 -178 -121 -65 -8 20 50 79 108 73 38 -43 -124 -164 -204 -167 -131 -93 -55 -62 -70 -26 17 -14 -46 -59 -72 -39 -7 -61 -115
5000 -115 -93 -71 -40 -9 -85 -161 -175 -188 -201 -215 -189 -163 -239 -314 -319 -233 -244 -255 -247 -240 -161 -83 -75 -159 -197 -144 -71 1 80 159 217 275 308 250 213 177 134
4988 134 92 80 69 57 45 22 -1 -24 -47 -59 -72 -84 -96 -145 -193 -196 -199 -177 -156 -210 -265 -207 -149 -137 -125 -160 -195 -123 -52 -24 3 -14 -32 -109 -186 -187
4977 -187 -187 -184 -181 -102 -23 14 51 43 35 34 32 31 29 11 -6 20 48 99 151 208 173 97 21 -14 -50 -62 -75 -11 52 12 -27 -67 -108 -72 -37 -48 -59 -67 -76 -91
$$ packed form
5059G3J2p5p5L2L1j5j6j6j5J3J2J3J3noL9M0o0o1j5j5K4K5K4K4n2n3n9L3L9L8kkNNNNl5l5
5047a07j0Q1J7J7q3q4rqn4n5%jjjk1k0k1k1K9K9K8K9L2L3L2L2nnP1P1%%j%K3K5K4K5N3N3n4
5034A43n4q9q8j3j2J7J7k8k9m3m4N7N7O2l0n4n5L7L7o9p0o4o4M3M2K8K7P3P4N4N2RQNNONl9
5022A3l8PPK8K9m6m8o2o3l8N3M0M0l0l0n2n2Q6Q6J2J2o4o4M6M5M6M4j8k0qr9o0L2k6k5J2J1
5011a94J2J1j5j6j6j6N6N7N6N7K8L0K9K9l5l5q1q1m0m0L7L6L8L8pqM4M3l1l2j3j3L3L2n4n4
5000a15K2K2L1L1p6p6j4j3j3j4K6K6p6p5nQ6j1j1QPP9P8Qq4l8N3P3P2P9P9N8N8L3n8l7l6m3
4988A34m2j2j1j2j2k3k3k3k3j2j3j2j2m9m8llK2K1n4n5N8N8J2J2l5l5P2P1K8K7j7j8p7p7j
4977a87%LLP9P9L7L7qqjkjkj8j7K6K8N1N2N7l5p6p6l5l6j2j3O4O3m0l9m0m1L6L5j1j1qrj5
$$ plain form
4965 -91 -14 25 65 34 3 -40 -84 -127 -171 -168 -164 -84 -4 1 6 11 16 -37 -92 -147 -202 -165 -127 -90 -53 -28 -3 -85 -167 -164 -161 -158 -155 -164 -172 -180 -189 -260 -331 -341 -275 -189
4952 -189 -148 -154 -159 -121 -82 -89 -97 -83 -69 -56 -42 -70 -98 -126 -154 -160 -166 -172 -178 -120 -63 -81 -100 -102 -104 -107 -109 -113 -117 -120 -124 -144 -164 -108 -51 -41 -31 -21 -10 -45 -79 -114 -148
4938 -148 -150 -152 -154 -156 -172 -188 -159 -129 -138 -147 -156 -165 -145 -126 -152 -178 -217 -255 -294 -333 -337 -342 -346 -351 -324 -297 -229 -162 -86 -87 -121 -156 -202 -248 -218 -188 -203 -218 -233 -248 -207
4926 -207 -165 -109 -6 47 26 -51 -83 -130 -178 -177 -176 -130 -84 -84 -83 -34 14 63 112 73 35 -3 -41 -28 -14 42 99 175 206 169 55 -27 -109 -164 -141 -113
4914 -113 -86 -99 -157 -175 -116 -31 7 -2 -11 -23 -35 -79 -122 -142 -163 -148 -134 -73 -13 -45 -77 -56 -81 -148 -139 -145 -197 -281 -289 -236 -183 -165 -148 -148 -148 -169 -113 -37
4903 -37 -38 -70 -148 -162 -70 42 79 115 152 129 30 -44 -44 -11 20 12 3 7 10 -31 -73 -130 -187 -110 -33 -62 -137 -128 -42 -4 -43 -79 -116 -86 -57 -73 -89 -82 -75
4891 -75 -75 -30 17 -11 -70 -129 -122 -115 -109 -102 -134 -167 -199 -231 -160 -89 -17 53 14 -24 -64 -103 -99 -95 -90 -86 -55 -24 5 36 0 -38 -76 -113 -101 -89 -77 -65 -60 -54 -48
4878 -48 -42 -40 -39 -37 -36 -87 -138 -218 -206 -135 -64 -32 -1 63 129 115 101 66 -15 -76 -46 -18 9 -2 -14 -37 -61 -38 -16 12 41 21 1 -54 -157 -215 -181
$$ packed form
4965i1P7L9M0l1l1m3m4m3m4LMQ0Q0NNNNn3n5n5n5L7L8L7L7K5K5q2q2LLLLrqqrp1p1j0O6Q6
4952a89M1onL8L9pqJ4J4J3J4k8k8k8k8ooooN8N7j8j9kklkmmlmk0k0N6N7J0J0J0J1l5l4l5l4
4938a48kkkkj6j6K9L0rrrrK0J9k6k6l9l8l9l9mnmnK7K7O8O7P6jl4l5m6m6L0L0j5j5j5j5M1
4926b07M2N6J03N3k1p7l2m7m8JJM6M6%JM9M8M9M9l9l8l8l8J3J4N6N7P6L1l7j14q2q2n5K3K8
4914a13K7j3n8j8N9Q5L8rrj2j2m4m3k0k1J5J4O1O0l2l2K1k5o7Ron2q4qN3N3J8J7%%k1N6P6
4903c7jl2p8j4R2J12L7L6L7k3r9p4%L3L1qrMLm1m2n7n7P7P7k9p5RQ6L8l9l6l7L0K9j6j6PP
4891g5%M5M7k8n9n9PPOPl2l3l2l2P1P1P2P0l9l8m0l9MMNML1L1K9L1l6l8l8l7J2J2J2J2NOO
4878d8OKJKJn1n1q0J2P1P1L2L1O4O6j4j4l5q1o1L0K8K7j1j2k3k4K3K2K8K9k0k0n5j03n8L4
$$ plain form
4866 -181 -108 -127 -164 -202 -189 -176 -118 -59 -65 -71 -78 -84 -81 -79 -117 -154 -186 -127 -43 85 212 248 196 98 29 -39 -60 -80 -91 -10 67 100 93 87 7 -71 -110 -57
4855 -57 -10 36 4 -28 -37 -47 -123 -200 -221 -151 -72 7 46 85 4 -76 -111 -146 -189 -233 -201 -123 -72 -113 -196 -188 -159 -131 -96 -62 -53 -44 -80 -117 -119 -122 -101 -80
4843 -80 -98 -115 -136 -156 -175 -239 -255 -195 -115 -80 -73 -112 -144 -177 -212 -248 -211 -175 -161 -147 -78 -8 -3 -105 -203 -225 -198 -124 -3 41 47 100 73 -29 -43
4832 -43 -57 -74 -14 83 105 39 -26 -130 -234 -269 -227 -132 -113 -95 -78 -87 -97 -114 -130 -184 -239 -224 -210 -127 -43 -45 -47 -48 -50 25 101 94 86 108 131 29 -73
4820 -73 -123 -96 -3 43 -11 -67 -42 -16 -48 -79 -110 -141 -150 -158 -220 -282 -295 -308 -211 -114 -51 -64 -103 -141 -129 -116 -80 -121 -190 -214 -230 -246 -163 -81 0 82
4809 82 67 52 36 21 -51 -123 -173 -223 -185 -146 -146 -146 -84 -22 18 -16 -101 -110 -54 -43 -62 -36 0 35 76 118 106 93 79 64 -2 -70 -44 -17 8 35 41
4798 41 48 -38 -125 -102 13 99 140 130 74 -11 -97 -115 -133 -128 -123 -185 -247 -225 -203 -185 -168 -203 -239 -277 -314 -274 -233 -171 -200 -200 -200 -185 -170 -178 -186 -222 -257 -270
4786 -270 -283 -205 -127 -63 -91 -107 -78 -49 -65 -112 -68 -26 -76 -124 -172 -187 -203 -185 -168 -97 -26 3 34 68 11 -86 -93 -72 -52 -51 -51 -50 -49 -85 -121 -89 -56
$$ packed form
4866a81P3j9l7l8J3J3N8N9oopoLKl8l7l2N9Q4J28J27L6n2r8o9o8k1k0j1Q1P7L3poq0p8l9N3
4855e7M7M6l2l2rj0p6p7k1P0P9P9L9L9q1q0l5l5m3m4L2P8N1m1q3QK9K8L5L4RRl6l7klK1K1
4843h0j8j7k1k0j9o4j6O0Q0L5Pl9l2l3l5l6L7L6J4J4O9P0Nj02r8k2K7P4J21M4ON3k7j02j4
4832d3j4j7O0R7K2o6o5j04j04l5M2R5J9J8J7rj0j7j6n4n5J5J4Q3Q4kkjkP5P6pqK2K3j02j02
4820g3n0K7R3M6n4n6K5K6l2l1l1l1rqo2o2j3j3R7R7O3j3l9l8J2J3L6m1o9k4j6j6Q3Q2Q1Q2
4809H2j5j5j6j5p2p2n0n0L8L9%%O2O2M0l4q5rN6J1j9K6L6L5M1M2j2j3j4j5o6o8K6K7K5K7O
4798D1Pq6q7K3J15Q6M1j0n6q5q6j8j8NNo2o2K2K2J8J7l5l6l8l7M0M1O2k9%%J5J5qql6l5j3
4786b70j3P8P8O4k8j6K9K9j6m7M4M2n0m8m8j5j6J8J7P1P1K9L1L4n7r7pK1K0J%JJl6l6L2L3
$$ plain form
4775 -56 -12 32 23 13 -14 -42 -35 -28 -59 -135 -199 -172 -151 -129 -64 0 -52 -104 -134 -164 -146 -127 -131 -136 -103 -71 -92 -113 -96 -78 -37 3 6 9 -40 -90 -113 -136 -95
4762 -95 -54 -14 -50 -69 -42 20 84 74 64 92 120 41 -37 -77 -117 -81 -44 -11 21 51 81 141 155 46 -138 -264 -284 -248 -136 -89 -119 -102 -84
4752 -84 -68 -52 -36 -21 -21 -22 -68 -114 -98 -81 -65 -49 -62 -75 -89 -102 -141 -179 -215 -251 -234 -172 -89 -83 -127 -125 -108 -90 -70 -50 -75 -101 -75 -49 -22 3 0 -3
4740 -3 -6 -10 -8 -7 -6 -4 -26 -47 -23 0 -49 -100 -104 -109 -113 -117 -120 -124 -95 -65 -81 -98 -155 -212 -193 -174 -174 -175 -130 -85 -93 -101 -63 -26 21 68 57 -30 -55 -4 28 14 -6 18
4727 18 60 102 149 196 151 30 -53 -91 -84 -76 -109 -142 -174 -207 -188 -170 -198 -225 -228 -231 -163 -95 -68 -133 -146 -159 -177 -196 -215 -233 -203 -172 -218 -263 -279 -294 -309
4715 -309 -324 -346 -369 -285 -201 -168 -135 -178 -222 -216 -211 -205 -200 -107 -15 21 -32 -88 -145 -161 -177 -125 -74 -22 29 49 70 45 20 -21 -63 -29 4 1 -1 -4 -7 -15 -24 -130
4703 -130 -144 -115 -86 -52 -18 -69 -120 -126 -132 -119 -107 -94 -82 -88 -95 -102 -108 -152 -196 -164 -132 -48 36 75 114 80 45 -33 -113 -161 -208 -179 -151 -190 -229 -223 -217 -230 -244
4691 -244 -212 -180 -205 -231 -257 -282 -265 -248 -276 -304 -339 -374 -415 -364 -301 -237 -168 -99 -109 -119 -174 -229 -205 -180 -155 -130 -52 26 59 92 74 56 -7 -71 -67
$$ packed form
4775e6M4M4rj0k7k8PPl1p6o4K7K1K2O5O4n2n2l0l0J8J9mnL3L2k1k1J7J8M1M0LLm9n0k3k3M1
4762i5M1M0l6j9K7O2O4j0j0K8K8p9p8m0m0L6L7L3L2L0L0O0J4j09j84j26k0L6J12M7l0J7J8
4752h4J6J6J6J5%jm6m6J6J7J6J6j3j3j4j3l9l8l6l6J7O2Q3Om4KJ7J8K0K0k5k6K6K6K7K5ll
4740clmKJJKk2k1K4K3m9n1mnmmlmK9L0j6j7n7n7J9J9%jM5M5qqL8L7M7M7j1q7k5N1L2j4k0K4
4727A8M2M2M7M7m5j21q3l8PQl3l3l2l3J9J8k8k7llO8O8K7o5j3j3j8j9j9j8L0L1m6m5j6j5j5
4715c09j5k2k3Q4Q4L3L3m3m4ONONR3R2L6n3n6n7j6j6N2N1N2N1K0K1k5k5m1m2L4L3lkllqrj06
4703a30j4K9K9L4L4n1n1ooJ3J2J3J2oppom4m4L2L2Q4Q4L9L9l4l5p8q0m8m7K9K8l9l9OOj3j4
4691b44L2L2k5k6k6k5J7J7k8k8l5l5m1N1O3O4O9O9j0j0n5n5K4K5K5K5P8P8L3L3j8j8o3o4M
$$ plain form
4680 -67 -62 -57 -53 -62 -70 -79 -88 -50 -12 -8 -80 -113 -145 -183 -221 -233 -245 -211 -177 -176 -175 -128 -81 -71 -61 -49 -36 -24 32 64 19 -89 -153 -170 -140 -132 -169 -178 -186 -194 -203 -140
4667 -140 -76 -28 -57 -118 -180 -250 -320 -284 -248 -214 -180 -147 -113 -149 -184 -143 -103 -108 -113 -120 -128 -142 -201 -253 -199 -127 -132 -133 -134 -99 -64 -104 -145 -216 -286 -280 -274 -261 -248
4655 -248 -235 -222 -193 -164 -135 -106 -85 -64 -44 -23 -84 -145 -130 -115 -125 -134 -98 -61 -88 -114 -141 -167 -153 -138 -123 -109 -113 -118 -76 -35 -3 29 -14 -58 -97 -135
4644 -135 -127 -120 -133 -146 -205 -264 -311 -357 -328 -298 -241 -183 -126 -69 -71 -74 -77 -80 -110 -140 -171 -201 -171 -142 -112 -83 -98 -113 -83 -53 -48 -43 -39 -34 -6 21 50 78 13 -51
4631 -51 -71 -90 -90 -90 -14 61 108 156 170 108 43 -22 -92 -163 -112 -61 -11 39 -36 -112 -188 -264 -294 -323 -353 -382 -406 -430 -378 -325 -279 -232 -188 -145 -188 -276
4620 -276 -373 -333 -198 -108 -91 -73 -65 -57 -94 -132 -143 -155 -162 -169 -205 -164 -60 43 55 67 2 -61 -117 -173 -228 -284 -306 -327 -303 -279 -267 -255 -243 -232 -214
4609 -214 -197 -179 -162 -146 -130 -160 -189 -217 -245 -197 -148 -129 -109 -90 -70 -111 -151 -143 -135 -74 31 87 52 6 -38 -84 -130 -159 -97 -57 -64 -83 -57 -34 -56 -84
4598 -84 -112 -97 -82 -62 -41 -21 0 -37 -75 -36 1 13 24 80 137 71 5 46 87 77 67 11 -43 -80 -116 -147 -178 -188 -108 -53 -43 15 73 84 94
$$ packed form
4680f7NNMrqrrL8L8Mp2l3l2l8l8j2j2L4L4JJM7M7J0J0J2J3J2N6L2m5j08o4j7L0Ql7rqqrO3
4667a40O4M8k9o1o2p0p0L6L6L4L4L3L4l6l5M1M0nnpqj4n9n2N4P2njjL5L5m0m1p1p0OOJ3J3
4655b48J3J3K9K9K9K9K1K1K0K1o1o1J5J5j0rL6L7k7k6k7k6J4J5J5J4mnM2M1L2L2m3m4l9l8
4644a35QPj3j3n9n9m7m6K9L0N7N8N7N7kllll0l0l1l0L0K9L0K9j5j5L0L0NNMNK8K7K9K8o5o4
4631e1k0j9%%P6P5M7M8J4o2o5o5p0p1N1N1N0N0p5p6p6p6l0k9l0k9k4k4N2N3M6M7M4M3m3q8
4620b76r7M0J35R0J7J8QQl7l8j1j2ppl6M1J04J03J2J2o5o3n6n6n5n6k2k1K4K4J2J2J2J1J8
4609b14J7J8J7J6J6l0k9k8k8M8M9J9K0J9K0m1m0QQO1J05N6l5m6m4m6m6k9O2M0pj9K6K3k2k8
4598h4k8J5J5K0K1K0K1l7l8L9L7J2J1N6N7o6o6M1M1j0j0n6n4l7l6l1l1j0Q0N5J0N8N8J1J0
$$ plain form
4587 94 62 31 45 59 42 26 10 -6 0 4 4 4 19 -56 -132 -117 -112 -107 -96 -86 -92 -98 -59 24 107 98 6 -85 -106 -127 -108 -89 -62 -125 -192 -168 -121 -119 -132 -145
4575 -145 -144 -143 -187 -231 -255 -278 -301 -324 -295 -267 -238 -210 -244 -278 -235 -193 -156 -119 -101 -175 -223 -179 -192 -205 -143 -81 -96 -110 -140 -170 -124 -78 -68 -58 -48 -39
4564 -39 29 97 172 247 404 667 890 884 631 333 161 34 -74 -138 -143 -103 -32 38 79 44 -54 -153 -224 -218 -177 -135 -88 -42 -2 37 77 117 126
4553 126 134 142 151 82 13 21 28 10 -7 -24 -42 -27 -11 -72 -132 -138 -143 -73 -2 -36 -70 -104 -139 -138 -137 -137 -136 -166 -196 -149 -57 -28 -75 -102 -83 -97 -111 -122 -133 -192
4541 -192 -252 -265 -279 -261 -244 -226 -208 -172 -137 -101 -65 -53 -41 16 -2 -68 -89 -138 -186 -223 -215 -189 -239 -274 -308 -271 -234 -147 -60 -79 -144 -167 -115 -48 -88
4530 -88 -132 -177 -182 -188 -222 -257 -249 -135 -45 -31 -100 -169 -211 -178 -187 -196 -165 -133 -101 -70 -64 -58 -129 -200 -183 -166 -149 -132 -130 -127 -200 -274 -217 -160 -103 -46 -30 -14 2
4518 2 18 -7 -32 -128 -225 -247 -178 -91 -51 -39 -73 -129 -186 -242 -298 -302 -214 -161 -153 -190 -227 -202 -177 -151 -126 -84 -43 -78 -112 -95 -77 -105 -133 -136 -139 -96 -54 -47
4506 -47 -40 -109 -179 -221 -262 -195 -127 -94 -16 87 100 35 -28 -23 26 2 -112 -118 -33 9 52 54 57 2 -51 -105 -160 -152 -144 -177 -209 -265 -229 -175 -120 -93 -157 -193
$$ packed form
4587I4l2l1J4J4j7j6j6j6OM%%J5p5p6J5NNJ1J0ooL9Q3Q3rr2r1k1k1J9J9K7o3o7K4M7Kj3j3
4575a45JJm4m4k4k3k3k3K9K8K9K8l4l4M3M2L7L7J8p4m8M4j3j3O2O2j5j4l0l0M6M6J0J0J0R
4564c9O8O8P5P5J57K63K23ok53k98j72j27j08o4nM0P1P0M1l5r8r9p1OM1M2M7M6M0L9M0M0R
4553A26QQRo9o9QPj8j7j7j8J5J6o1o0onP0P1l4l4l4l5JJ%Jl0l0M7R2K9m7k7J9j4j4j1j1n9
4541a92o0j3j4J8J7J8J8L6L5L6L6J2J2N7j8o6k1m9m8l7QK6n0l5l4L7L7Q7Q7j9o5k3N2O7m0
4530h8m4m5nol4l5QJ14R0J4o9o9m2L3rrL1L2L2L1OOp1p1J7J7J7J7KLp3p4N7N7N7N7J6J6J6
4518BJ6k5k5r6r7k2O9Q7M0J2l4n6n7n6n6mQ8N3Ql7l7K5K5K6K5M2M1l5l4J7J8k8k8llM3M2P
4506d7Po9p0m2m1O7O8L3P8J03J3o5o3NM9k4j14oQ5M2M3KLn5n3n4n5QQl3l2n6L6N4N5K7o4l6
$$ plain form
4494 -193 -183 -174 -120 -62 -50 -103 -155 -134 -112 -78 -43 -9 25 4 -16 -36 -57 -49 -41 -79 -117 -155 -194 -183 -81 24 39 4 -30 -51 -71 -92 -112 -113 -114 -69
4483 -69 -24 27 80 25 -28 -46 -64 -82 -100 -97 -94 -91 -88 -38 12 -44 -100 -75 -49 -23 1 -13 -29 1 31 34 37 85 133 96 59 -23 -106 -152 -198 -198 -198 -167 -136
4471 -136 -104 -73 -68 -63 -59 -54 -93 -132 -217 -302 -330 -358 -426 -494 -475 -364 -279 -240 -215 -190 -219 -157 -67 22 11 0 -53 -106 -84 -62 -32 -2 -14 -27 -28 17 48
4460 48 -12 -70 -36 69 129 117 59 -1 -16 -62 -109 -106 -103 -74 -45 -62 -78 -83 -88 -93 -98 -44 9 -12 -34 -20 -5 8 23 -14 -52 -44 -37 -50 -63 -122 -181 -162 -143
4448 -143 -124 -105 -95 -84 -74 -63 -47 -31 -15 0 -1 -4 -6 -9 -18 -27 9 45 58 71 84 97 92 87 62 -52 -178 -211 -195 -180 -184 -188 -192 -196 -225 -254 -207 -160 -87 -14
4435 -14 34 -9 -62 -116 -100 -83 -57 -31 -81 -131 -153 -174 -150 -125 -132 -138 -144 -150 -127 -105 -82 -59 -36 -12 10 34 -46 -127 -101 -75 0 73 41 9 -55 -120 -78
4424 -78 -36 -11 13 32 51 20 -103 -197 -246 -288 -283 -253 -223 -147 -25 48 30 -43 -72 -56 -40 -108 -175 -167 -114 -89 -155 -218 -191 -145 -99 -123 -148 -164 -180
4413 -180 -150 -121 -54 11 32 53 23 -6 -35 -65 -127 -190 -115 -40 3 47 14 -18 -46 -75 -58 -41 -46 -50 -55 -60 -55 -51 -92 -133 -127 -120 -190 -306 -379 -377 -313 -250 -177
$$ packed form
4494a93J0RN4N8J2n3n2K1K2L4L5L4L4k1k0k0k1QQl8l8l8l9J1J02J05J5l5l4k1k0k1k0jjM5
4483f9M5N1N3n5n3j8j8j8j8LLLLN0N0n6n6K5K6K6K4j4j6L0L0LLM8M8l7l7q2q3m6m6%%L1L1
4471a36L2L1NNMNl9l9q5q5k8k8o8o8J9J11Q5L9K5K5k9O2R0Q9j1j1n3n3K2K2L0L0j2j3jM5L1
4460D8o0n8L4J05O0j2n8o0j5m6m7LLK9K9j7j6nnnnN4N3k1k2J4J5J3J5l7l8QPj3j3n9n9J9J9
4448a43J9J9J0J1J0J1J6J6J6J5jlklrrL6L6J3J3J3J3nnk5j14j26l3J6J5mmmmk9k9M7M7P3P3
4435a4M8m3n3n4J6J7K6K6n0n0k2k1K4K5poooK3K2K3K3K3K4K2K4q0q1K6K6P5P3l2l2o4o5M2
4424g8M2K5K4J9J9l1j23r4m9m2NL0L0P6J22P3j8p3k9J6J6o8o7QN3K5o6o3K7M6M6k4k5j6j6
4413a80L0K9O7O5K1K1l0k9k9l0o2o3P5P5M3M4l3l2k8k9J7J7nmnnNMm1m1OPp0j16p3KO4O3P3
$$ plain form
4401 -177 -105 7 120 199 202 116 75 52 29 55 81 52 22 -6 -36 -33 -30 -27 -24 -43 -62 -36 -9 -23 -37 -20 -49 -53 19 88 81 -6 -94 -141 -188 -153 -119
4389 -119 -88 -57 -60 -108 -174 -164 -172 -180 -108 -35 -16 1 -25 -52 -106 -160 -138 -115 -44 26 -9 -45 -36 -27 -19 -10 -25 -40 -9 20 41 62 36 11 40 69 53 36
4378 36 -19 -76 -132 -189 -158 -126 -141 -155 -161 -166 -172 -178 -116 -54 -37 -21 3 28 -22 -73 -76 -79 -51 -69 -123 -101 -96 -137 -144 -106 -112 -163 -181 -122 -65 -85 -136 -187 -196 -206
4365 -206 -159 -112 -65 -18 7 33 13 -5 -8 -10 -43 -31 19 -21 -79 -91 -85 -78 -89 -100 -54 36 127 127 112 52 -13 -33 -37 -40 -41 -42 -105 -167 -154 -140 -138 -135 -155 -176
4353 -176 -165 -154 -143 -133 -102 -70 -39 -8 -83 -158 -187 -216 -197 -177 -228 -279 -235 -99 -35 -17 -11 -5 -47 -90 -93 -97 -31 35 81 35 41 46 68 89 110 132 96
4341 96 60 -15 -90 -208 -235 -115 5 48 91 57 24 1 -22 -46 -69 -74 -78 -52 -70 -106 -51 1 -37 -99 -161 -152 -143 -121 -100 -124 -148 -120 -92 -87 -82 -42 -2
4330 -2 -7 -13 -9 -6 -25 -44 -48 -52 -79 -106 -78 -50 -99 -148 -169 -191 -212 -234 -209 -184 -113 -42 2 47 47 46 32 17 -20 -57 -26 3 54 105 64 -21 -81 -65 8 36
4317 36 72 108 61 15 14 13 54 94 58 23 16 10 4 -1 -59 -116 -127 -139 -163 -187 -165 -143 -119 -95 -74 -130 -205 -280 -269 -181 -136 -137 -112 -88 -69 -126 -211 -252 -224
$$ packed form
4401a77P2J12J13P9Lq6m1k3k3K6K6k9l0k8l0LLLLj9j9K6K7j4j4J7k9mP2O9pq7q8m7m7L5L4
4389a19L1L1lm8o6J0qqP2P3J9J7k6k7n4n4K2K3P1P0l5l6RRQRj5j5L1K9K1K1k6k5K9K9j6j7
4378C6n5n7n6n7L1L2j5j4onooO2O2J7J6K4K5n0n1llK8j8n4K2Nm1pL8on1j8N9N7k0n1n1rj0
4365b06M7M7M7M7K5K6k0j8lkl3J2N0m0n8j2OPj1j1M6R0R1%j5o0o5k0mljjo3o2J3J4KLk0k1
4353a76J1J1J1J0L1L2L1L1p5p5k9k9J9K0n1n1M4J36O4J8OOm2m3lmO6O6M6m6ONK2K1K1K2l6
4341I6l6p5p5j18k7J20J20M3M3l4l3k3k3k4k3nmK6j8l6N5N2l8o2o2RRK2K1k4k4K8K8NNM0M0
4330bnoMLj9j9mmk7k7K8K8m9m9k1k2k1k2K5K5P1P1M4M5%jj4j5l7l7L1K9N1N1m1q5o0J6P3K8
4317C6L6L6m7m6jjM1M0l6l5poonn8n7j1j2k4k4K2K2K4K4K1n6p5p5J1Q8M5jK5K4J9n7q5m1K8
$$ plain form
4305 -224 -196 -89 17 -38 -93 -190 -286 -266 -169 -113 -102 -60 -17 -23 -29 -29 -30 -30 -31 -68 -106 -138 -171 -160 -72 -1 23 91 159 218 201 188 129 45 -38 -96 -153
4294 -153 -149 -69 43 110 65 -24 -64 -104 -102 -99 -98 -97 -73 -49 -27 -4 12 30 18 -69 -160 -251 -243 -234 -150 -66 -66 -66 -21 23 -11 -47 -37 -26 -9 7 25 42 73
4282 73 105 137 168 176 183 191 198 159 120 81 42 38 34 76 118 206 295 340 386 529 717 1047 1591 2334 2558 2045 1532 1319 1257 1276 1249 1317 1431
4271 1431 1568 1705 1935 2257 2855 3544 4541 5994 8485 12469 19677 32404 52125 61936 46965 28000 16715 10766
4266 10766 7519 5461 4066 3068 2369 1945 1575 1296 1122 1040 911 783 635 487 394 393 396 398 331 263 266 268 200 133 102 164 182 109
4257 109 57 50 32 60 62 64 24 -16 0 16 -13 -42 -85 -129 -127 -124 -174 -225 -138 -7 49 15 -66 -102 -131 -159 -139 -120 -103 -86 -70 -53 -17 17 53 89 91
4246 91 94 50 7 24 41 89 91 54 108 153 199 193 187 135 83 53 23 -7 -37 28 93 112 131 102 72 43 13 99 184 196 209 213 262 299 183 0 -138
4234 -138 -195 -160 -157 -153 -144 -135 -114 -93 -117 -187 -235 -190 -126 -108 -93 -33 21 30 48 21 -28 -78 -76 -74 -72 -70 -128 -186 -193 -200 -202 -112 -20 -19 -32 0 25 6 -5 -18 -19 25
$$ packed form
4305b24K8J07J06n5n5r7r6K0R7N6J1M2M3oo%j%jl7l8l2l3J1Q8P1K4O8O8N9j7j3n9q4q3n8n7
4294a53MQ0J12O7m5q9m0m0KLJJK4K4K2K3J6J8j2q7r1r1QRQ4Q4%%M5M4l4l6J0J1J7J6J8J7L1
4282G3L2L2L1QPQPl9l9l9l9mmM2M2Q8Q9M5M6J43J88L30N44P43K24n13n13k13o2J9k7O8J14
4271A431J37J37K30L22N98O89R97J453K491L984P208J2727J9721R811j4971j8965j1285n949
4266A0766l247k058j395r98o99m24l70k79j74q2j29j28j48j48r3jLKo7o8LKo8o7l1O2J8p3
4257A09n2pj8K8KKm0m0J6J6k9k9m3m4KLn0n1Q7J31N6l4q1l6k9k8K0J9J7J7J6J7L6L4L6L6K
4246I1Lm4m3J7J7M8Kl7N4M5M6oon2n2l0l0l0l0O5O5J9J9k9l0k9l0Q6Q5J2J3MM9L7j16j83j38
4234a38n7L5LMRRK1K1k4p0m8M5O4J8J5O0N4RJ8k7m9n0KKKKn8n8ppkR0R2Jj3L2K5j9j1j3jM4
$$ plain form
4221 25 97 78 3 -163 -245 -236 -212 -234 -275 -316 -313 -311 -316 -322 -251 -180 -64 51 60 70 51 33 15 -3 -17 -30 -4 21 89 66 18 -29 -39 -48 -58 -67 -30 6
4209 6 -32 -70 -133 -196 -152 -63 -57 -143 -169 -195 -209 -146 -83 -96 -149 -203 -261 -319 -250 -181 -113 -44 -76 -109 -111 -158 -211 -188 -106 -70 -86 -57 -30 -49 -72 -95 -120
4198 -120 -146 -114 -81 -49 -16 43 103 56 10 44 78 67 56 11 -34 22 79 125 95 37 24 59 94 131 169 108 46 -14 -75 -133 -190 -145 -100 -42 -61
4187 -61 -125 -112 -77 -42 -2 37 35 33 -14 -61 -91 -121 -151 -181 -157 -133 -109 -84 -75 -66 -56 -47 -64 -80 -51 -22 -12 -3 5 14 25 35 -61 -157 -187 -216 -200 -184 -200
4175 -200 -217 -233 -249 -256 -263 -270 -277 -230 -182 -135 -88 -94 -99 -151 -203 -207 -211 -215 -219 -121 -24 -5 12 -36 -131 -167 -127 -121 -116 -151 -187 -157 -128 -99 -69 -79 -90 -100 -110 -94 -77
4162 -77 -61 -44 -36 -27 -19 -10 -54 -98 -142 -186 -180 -174 -213 -253 -210 -167 -169 -171 -184 -197 -133 -70 -58 -47 -25 -94 -121 -56 -24 -37 -88 -139 -86 -33 41 116 85 53 80
4150 80 106 130 154 132 65 12 51 110 77 -4 -87 -123 -159 -196 -232 -212 -193 -127 -61 -26 8 -63 -135 -138 -141 -98 -55 11 78 93 109 135 69 30 36 16 -4
4139 -4 -21 -38 -32 -25 -19 -12 13 40 21 2 -20 -42 -65 -88 -72 -56 -85 -115 -119 -123 -127 -131 -84 -38 2 43 23 -88 -168 -203 -233 -172 -62 -44 -55 -65 -81 -97 -138
$$ packed form
4221B5P2j9p5j66q2RK4k2m1m1LKnoP1P1J16J15RJ0j9j8j8j8j4j3K6K5O8k3m8m7j0rj0rL7L6
4209Fl8l8o3o3M4Q9Oq6k6k6j4O3O3j3n3n4n8n8O9O9O8O9l2l3km7n3K3Q2L6j6K9K7j9k3k3k5
4198a20k6L2L3L2L3N9O0m7m6L4L4j1j1m5m5N6N7M6l0n8j3L5L5L7L8o1o2o0o1n8n7M5M5N8j9
4187f1o4J3L5L5M0L9kkm7m7l0l0l0l0K4K4K4K5RRJ0Rj7j6K9K9J0RQRJ1J0r6r6l0k9J6J6j6
4175b00j7j6j6ppppM7M8M7M7onn2n2mmmmR8R7J9J7m8r5l6M0ONl5l6L0K9K9L0j0j1j0j0J6J7
4162g7J6J7QRQRm4m4m4m4OOl9m0M3M3kkj3j3O4O3J2J1K2o9k7O5L2j3n1n1N3N3P4P5l1l2K7
4150H0K6K4K4k2o7n3L9N9l3q1q3l6l6l7l6K0J9O6O6L5L4p1p2llM3M3O6O7J5J6K6o6l9Ok0k0
4139dj7j7OPOPK5K7j9j9k2k2k3k3J6J6k9l0mmmmM7M6M0M1k0j11q0l5l0O1J10J8j1j0j6j6m1
$$ plain form
4127 -138 -179 -143 -108 -152 -197 -241 -286 -314 -343 -295 -247 -201 -154 -107 -60 -47 -34 -21 -8 -60 -112 -57 -2 18 40 -14 -69 -119 -169 -174 -178 -161 -143 -126 -108 -77
4115 -77 -46 -122 -198 -206 -214 -221 -229 -251 -273 -219 -165 -115 -64 -115 -166 -186 -115 -49 15 73 130 135 49 -32 -68 -55 4 10 16 26 35 52 69 9 -49 -72 -96 -119 -142
4103 -142 -148 -154 -214 -183 -125 -113 -115 -117 -119 -122 -125 -128 -153 -177 -156 -135 -70 -4 15 35 6 -23 -10 3 2 -44 -76 -17 37 2 -22 -46 -94 -142 -185 -227 -227 -135 -25
4091 -25 37 47 11 -26 -19 -52 -85 -115 -145 -178 -211 -244 -277 -227 -177 -173 -169 -150 -132 -113 -95 -52 -9 33 76 77 78 79 81 43 6 -30 -67 -70 -73 -75 -78 -84 -90 -95 -101 -95 -90 -130
4078 -130 -170 -170 -171 -95 -19 -10 -1 -38 -75 -110 -146 -135 -125 -192 -258 -219 -179 -140 -102 -64 -26 0 26 53 4 -57 -74 -74 -75 -113 -152 -144 -136 -129 -122 -68 -15 -61 -108 -77
4065 -77 -47 -8 30 -36 -104 -49 4 26 -29 -61 -94 -127 -160 -164 -91 -35 -25 -40 -56 -74 -92 -89 -86 -42 0 62 47 -16 -3 39 36 -11 -60 -49 -38 -28 -17
4054 -17 -71 -125 -120 -39 28 19 -43 -60 -58 -56 -51 -46 -36 -25 -15 -4 -29 -53 -78 -103 -155 -206 -151 -97 -76 -56 9 75 70 66 85 104 84 65 -30 -125 -103 -81 -36
4042 -36 8 6 3 -44 -137 -203 -192 -182 -171 -144 -117 -106 -140 -145 -73 0 -2 -8 62 85 108 31 -44 -79 -7 45 22 -16 20 12 5 -20 -45 -18 9 59 109 74 38
$$ packed form
4127a38m1L6L5m4m5m4m5k8k9M8M8M6M7M7M7J3J3J3J3n2n2N5N5K0K2n4n5n0n0nmJ7J8J7J8L1
4115g7L1p6p6qqpqk2k2N4N4N0N1n1n1k0P1O6O4N8N7Nq6q1l6J3N9OOJ0RJ7J7o0n8k3k4k3k3
4103a42ooo0L1N8J2kkklllk5k4K1K1O5O6J9K0k9k9J3J3jm6l2N9N4l5k4k4m8m8m3m2%R2J10
4091b5O2J0l6l7Pl3l3l0l0l3l3l3l3N0N0MMJ9J8J9J8M3M3M2M3JJJKl8l7l6l7llkloonoONm0
4078a30m0%jP6P6RRl7l7l5l6J1J0o7o6L9M0L9L8L8L8K6K6K7m9o1j7%jl8l9QQPPN4N3m6m7L1
4065g7L0L9L8o6o8N5N3K2n5l2l3l3l3mP3N6J0j5j6j8j8LLM4M2O2j5o3J3M2lm7m9J1J1J0J1
4054a7n4n4NQ1O7ro2j7KKNNJ0J1J0J1k5k4k5k5n2n1N5N4K1K0O5O6nmJ9J9k0j9r5r5K2K2M5
4042c6M4klm7r3o6J1J0J1K7K7J1l4nP2P3koP0K3K3p7p5l5P2N2k3l8L6qpk5k5K7K7N0N0l5l6
$$ plain form
4030 38 -42 -123 -135 -147 -88 -29 17 -12 -68 -78 -71 -19 9 38 19 0 -18 -37 -19 -1 -6 -11 -19 -26 -74 -122 -150 -101 -70 -84 -95 -107 -121 -135 -132 -129 -122 -116 -96 -31
4017 -31 31 18 -81 -135 -82 -29 0 30 60 90 98 106 38 -29 -113 -197 -205 -166 -34 21 12 -42 -98 -154 -162 -170 -137 -29 33 20 -11 -44 -58 -73 -56 -39 -44 -50
4005 -50 -37 -24 -13 -3 34 25 -13 38 84 39 -16 -27 -30 11 -16 -90 -95 -55 -37 -65 -97 -83 -51 -20 -57 -94 -131 -168 -140 -112 -61 -10 52 114 101 87 65
3994 65 44 0 -43 -55 -66 -78 -89 -83 -77 -71 -65 -41 -17 3 24 4 -61 -152 -152 -111 -69 -22 24 59 93 51 9 -38 -86 -111 -136 -91 -45 -23 0 -23 -45 -53
3982 -53 -15 4 -66 -131 -150 -164 -178 -265 -352 -360 -368 -330 -292 -212 -132 -74 -17 59 136 191 155 23 -61 -70 -33 61 110 82 53 75 98 75 52 -10 -73 -89
3971 -89 -106 -74 -42 -19 50 88 34 32 75 116 157 155 153 130 106 106 105 116 127 115 103 104 105 106 107 104 102 77 51 14 -21 -12 -3 -41 -78 -92 -106 -85 -64 -65 -67 -33 0
3958 0 11 23 17 11 6 0 35 69 81 92 182 271 253 236 191 147 179 211 189 166 144 121 123 125 50 -24 -18 -13 -7 -2 76 154 156 159 188 217 270 322 351 379 362 345
3945 345 358 370 429 487 595 704 835 966 1122 1278 1544 2084 2893 3792 4197 4144 4390 5093 6506 8680 12293 18436 28963
$$ packed form
4030C8q0q1j2j2N9N9M6k9n6j0PN2K8K9j9j9j8j9J8J8nnqpm8m8k8M9L1j4j1j2j4j4LLPOK0O5
4017c1O2j3r9n4N3N3K9L0L0L0QQo8o7q4q4qL9J32N5rn4n6n6qqL3J08O2j3l1l3j4j5J7J7no
4005e0J3J3J1J0L7rl8N1M6m5n5j1lM1k7p4nM0J8k8l2J4L2L1l7l7l7l7K8K8N1N1O2O2j3j4k2
3994F5k1m4m3j2j1j2j1OOOOK4K4K0K1k0o5r1%M1M2M7M6L5L4m2m2m7m8k5k5M5M6K2K3k3k2q
3982e3L8J9p0o5j9j4j4q7q7qqL8L8Q0Q0N8N7P6P7N5l6j32q4rL7R4M9k8k9K2K3k3k3o2o3j6
3971h9j7L2L2K3O9L8n4kM3M1M1kkk3k4%jJ1J1j2j2JJJJlkk5k6l7l5RRl8l7j4j4K1K1jkL4L3
3958@J1J2oonoL5L4J2J1R0Q9j8j7m5m4L2L2k2k3k2k3KKp5p4ONONP8P8KLK9K9N3N2K9K8j7j7
3945C45J3J2N9N8J08J09J31J31J56J56K66N40Q09Q99M05n3K46P03J413K174L613O143J0527
$$ plain form
3937 28963 45679 60009 52660 33907 20795 13337 9264 6661 4943 3680 2875 2222 1844 1576 1400 1213 1071 920
3932 920 816 708 647 574 502 392 282 200 210 218 273 292 311 256 202 151 100 125 150 142 133 102 70 69 68 44 20 -28 -77 -121 -165 -151 -46 7 61
3921 61 77 93 109 125 75 24 -66 -156 -274 -301 -212 -122 -119 -116 -158 -201 -174 -147 -143 -139 -124 -110 -96 -82 -98 -115 -132 -148 -189 -230 -225 -220 -176 -132 -65 0 15 30
3909 30 45 60 72 84 91 97 107 26 -74 -174 -239 -214 -163 -112 -109 -106 -27 51 58 65 -4 -74 -23 26 1 -24 -74 -123 -127 -131 -113 -94 -30 33 53 74 71 68 66 64
3897 64 91 26 -70 -167 -194 -221 -161 -101 -64 -27 -32 -36 -40 -45 -83 -121 -114 -106 -34 38 4 -29 -43 -57 4 67 75 83 91 99 92 86 80 74 35 -2 -41 -79 -50 -21 7 37
3884 37 124 211 309 453 486 366 234 103 -14 -40 12 -25 -93 -116 -64 -59 -103 -102 -129 -156 -144 -132 -120 -108 -90 -73 -98 -123 -135 -101 -81 -153 -251 -257
3873 -257 -242 -226 -182 -92 23 47 3 -40 -13 13 -16 -46 0 47 -12 -71 -85 -99 -72 -45 -17 9 71 134 150 167 69 -29 -82 -135 -180 -226 -225 -225 -216 -207
3862 -207 -153 -98 -110 -122 -134 -146 -158 -170 -181 -193 -151 -109 -113 -116 -68 -19 -46 -74 -107 -141 -128 -116 -150 -185 -143 -101 -96 -90 -85 -80 -53 -27 -1 24 25 26 -17 -62 -121
$$ packed form
3937B8963J6716J4330p349j8753j3112p458m073k603j718j263q05o53l78k68j76j87j42j51
3932I20j04j08o1p3p2j10j10q2J0QN5J9J9n5n4n1n1K5K5qrl1l2jjk4k4m8m9m4m4J4J05N3N4
3921F1J6J6J6J6n0n1r0r0j18k7Q9R0LLm2m3K7K7MMJ5J4J4J4j6j7j7j6m1m1NNM4M4O7O5J5J5
3909C0J5J5J2J2POJ0q1j00j00o5K5N1N1LLP9P8PPo9p0N1M9k5k5n0m9mmJ8J9O4O3K0K1llkk
3897F4K7o5r6r7k7k7O0O0L7L7nmmnl8l8PQP2P2l4l3j4j4O1O3QQQQpoool9l7l9l8K9K9K8L0
3884C7Q7Q7R8J44L3j20j32j31j17k6N2l7o8k3N2Nm4Jk7k7J2J2J2J2J8J7k5k5j2L4K0p2r8o
3873b57J5J6M4R0J15K4m4m3K7K6k9l0M6M7n9n9j4j4K7K7K8K6O2O3J6J7r8r8n3n3m5m6J%RR
3862b07N4N5j2j2j2j2j2j2j1j2M2M2mlM8M9k7k8l3l4J3J2l4l5M2M2NONNK7K6K6K5JJm3m5n9
$$ plain form
3850 -121 -180 -191 -201 -185 -124 -91 -134 -145 -156 -172 -188 -206 -225 -243 -262 -173 -84 -71 -58 -37 -15 6 27 -7 -43 -74 -105 -168 -155 -109 -62 -27 6 41 76
3839 76 77 77 78 78 63 47 31 15 -51 -119 -141 -163 -229 -296 -286 -277 -250 -224 -243 -262 -259 -256 -254 -251 -214 -177 -99 -21 30 5 -5 30 5 -64 -86 -62 0 62 98 59
3827 59 -11 -6 28 62 46 31 15 0 -73 -147 -144 -142 -107 -72 -83 -94 -77 -60 -43 -26 -38 -49 -15 18 28 39 49 59 53 48 -3 -55 -43 -32 -66 -100 -32 36
3815 36 59 82 91 101 65 29 30 30 33 -39 -96 -78 12 26 -33 -92 -110 -129 -125 -121 -117 -113 -108 -104 -125 -100 -25 49 51 53 17 -17 -81 -100 -40 -25 -57 -42 -44 -92 -108 -125
3802 -125 -106 -41 -53 -110 -96 -82 -71 -60 -37 -14 8 30 25 19 42 19 -87 -149 -132 -70 -21 -50 -108 -167 -147 -128 -137 -100 -20 14 -28 -72 -69 -67 -64 -62 -57 -53 -5
3790 -5 41 51 15 4 -5 -6 -6 -53 -99 -106 -113 -74 -35 -21 -8 4 18 18 19 36 100 95 45 24 2 -28 -59 -90 -121 -135 -149 -204 -259 -270 -205 -137 -69 -29 11 34
3777 34 12 -25 -17 -12 -52 -104 -156 -137 -163 -183 -157 -114 -70 6 83 113 97 98 145 113 35 -41 -118 -117 -71 5 82 70 -17 -94 -126 -142 -159 -137 -115 -92 -70
3766 -70 -69 -68 -113 -157 -151 -145 -139 -133 -130 -127 -124 -121 -81 -41 -1 38 36 34 -44 -122 -150 -177 -159 -141 -154 -166 -179 -191 -176 -160 -144 -128 -136 -144 -152 -160 -149 -138 -85 -31 -12 -38 -130
$$ packed form
3850a21n9j1j0J6O1L3m3j1j1j6j6j8j9j8j9Q9Q9J3J3K1K2K1K1l4l6l1l1o3J3M6M7L5L3L5L5
3839G6J%J%j5j6j6j6o6o8k2k2o6o7J0RK7K6j9j9LLKLL7L7P8P8N1k5j0L5k5o9k2K4O2O2L6l9
3827E9p0NL4L4j6j5j6j5p3p4LKL5L5j1j1J7J7J7J7j2j1L4L3J0J1J0J0onn1n2J2J1l4l4O8O8
3815C6K3K3RJ0l6l6J%Lp2n7J8R0J4n9n9j8j9MMMMNMk1K5P5P4KKl6l4o4j9O0J5l2J5km8j6j7
3802a25J9O5j2n7J4J4J1J1K3K3K2K2noK3k3j06o2J7O2M9k9n8n9K0J9rL7Q0L4m2m4LKLKNMM8
3790eM6J0l6j1rj%m7m6ppL9L9J4J3J2J4%JJ7O4nn0k1k2l0l1l1l1j4j4n5n5j1O5O8O8M0M0K3
3777C4k2l7QNm0n2n2J9k6k0K6M3M4P6P7L0j6JM7l2p8p6p7JM6P6P7j2q7p7l2j6j7K2K2K3K2
3766g0JJm5m4OOOOLLLLM0M0M0L9kkp8p8k8k7J8J8j3j2j3j2J5J6J6J6qqqqJ1J1N3N4J9k6r2
$$ plain form
3753 -130 -146 -120 -139 -174 -133 -12 61 85 64 7 -48 -62 -76 -88 -99 -111 -123 -103 -82 -93 -57 -8 -35 -119 -157 -161 -165 -167 -168 -149 -129 -155 -182 -181 -181 -181 -181 -146
3741 -146 -112 -77 -43 -15 12 -35 -83 -87 -91 -50 -9 -34 -60 -86 -111 -72 -33 -70 -108 -76 -44 -12 19 -18 -56 -94 -131 -117 -103 -89 -75 -82 -90 -98 -106 -42 21 39
3729 39 57 51 45 39 33 6 -20 -48 -75 -86 -97 -108 -120 -59 0 15 29 -9 -49 -89 -128 -130 -131 -132 -134 -135 -136 -138 -139 -110 -80 -51 -22 31 85 90 3 -77 -66 -36 -6 -94
3716 -94 -182 -163 -145 -128 -112 -135 -159 -176 -101 18 47 -14 -77 -145 -212 -220 -228 -236 -244 -207 -170 -133 -96 -44 7 -16 -40 -114 -188 -156 -123 -141 -159 -176 -194 -133 -72
3705 -72 -35 -90 -85 -80 -81 -81 -72 -62 -52 -42 -28 -15 68 152 191 139 92 45 24 3 28 52 64 77 89 101 22 -56 -29 -1 -30 -59 -88 -117 -100 -83 -67 -50
3693 -50 -73 -96 -43 9 53 98 61 -66 -168 -194 -219 -197 -136 -74 -86 -98 -98 -98 -144 -189 -224 -258 -294 -254 -226 -273 -299 -279 -257 -235 -195 -109 -30 -27 -54 -81
3682 -81 -71 -60 -49 -39 1 42 37 32 -44 -121 -153 -184 -153 -121 -90 -58 -43 -27 -12 2 17 31 45 59 65 70 76 81 14 -52 -74 -95 -57 -18 -26 -33 -25 -17 31 81
3669 81 97 38 21 4 4 4 50 96 41 -14 -69 -124 -163 -201 -211 -145 -71 -73 -100 -80 -96 -112 -79 -46 -91 -136 -148 -84 -76 -69 -57 -44 -59 -73 -87 -102 -93 -85 -31
$$ packed form
3753a30j6K6j9l5M1J21P3K4k1n7n5j4j4j2j1j2j2K0K1j1L6M9k7q4l8mmkjJ9K0k6k7J%%%L5
3741a46L4L5L4K8K7m7m8mmM1M1k5k6k6k5L9L9l7l8L2L2L2L1l7l8l8l7J4J4J4J4pqqqO4O3J8
3729C9J8ooook7k6k8k7j1j1j1j2O1N9J5J4l8m0m0l9kjjkjjkjK9L0K9K9N3N4Nq7q0J1L0L0q8
3716i4q8J9J8J7J6k3k4j7P5J19K9o1o3o8o7qqqqL7L7L7L7N2N1k3k4p4p4L2L3j8j8j7j8O1O1
3705g2L7n5NNj%RJ0J0J0J4J3Q3Q4L9n2m7m7k1k1K5K4J2J3J2J2p9p8K7K8k9k9k9k9J7J7J6J7
3693e0k3k3N3N2M4M5l7j27j02k6k5K2O1O2j2j2%%m6m5l5l4l6M0K8m7k6K0K2K2M0Q6P9Lk7k7
3682h1J0J1J1J0M0M1nnp6p7l2l1L1L2L1L2J5J6J5J4J5J4J4J4ONONo7o6k2k1L8L9qpQQM8N0
3669H1J6n9j7j7%%M6M6n5n5n5n5l9l8j0O6P4kk7K0j6j6L3L3m5m5j2O4QPJ2J3j5j4j4j5RQN4
$$ plain form
3657 -31 22 -2 -28 -54 -80 -112 -144 -130 -116 -116 -116 -117 -117 -122 -126 -131 -135 -110 -85 -66 -47 49 54 5 3 1 -46 -43 51 86 75 -11 -53 -32 -103 -145 -142 -115 -88 -59 -29 -46
3644 -46 -63 -81 -98 -102 -107 -66 -25 -52 -78 -105 -131 -99 -67 -35 -2 -65 -129 -192 -255 -227 -200 -173 -146 -118 -91 -64 -37 -16 4 24 45 71 97 78 58 -44
3633 -44 -147 -143 -139 -141 -142 -143 -144 -164 -184 -67 50 63 76 44 11 -7 -27 -92 -157 -112 -67 -21 23 -3 -29 -56 -82 -74 -65 -56 -48 -19 8 -70 -149 -133 -117 -101 -86
3621 -86 -99 -112 -125 -139 -158 -177 -196 -215 -171 -128 -85 -42 -53 -65 -79 -93 -118 -189 -241 -200 -186 -171 -136 -56 2 -31 9 141 185 138 147 157 156 155 155 154 121
3609 121 89 57 25 -53 -131 -206 -205 -187 -168 -100 -31 70 171 164 156 151 100 29 35 60 39 33 -17 -51 -9 -13 -16 -37 -57 -78 -98 -102 -107 -96 -39 1 -33 -94 -110
3597 -110 -95 -81 -64 -47 -54 -61 2 66 97 53 -21 -96 -79 -17 16 -25 -65 -105 -74 -43 30 103 131 159 109 60 10 -38 -63 -88 -67 -46 -40 -33 18 71 33
3586 33 -4 3 11 -3 -18 -33 -48 -69 -91 -113 -135 -118 -102 -55 -54 -110 -90 -16 57 113 61 -3 -23 -14 -50 -99 -147 -146 -67 -32 2 32 62 -14 -91 -135 -178 -176
3574 -176 -174 -220 -266 -281 -221 -189 -202 -257 -266 -207 -149 -87 -26 15 58 100 142 89 36 29 21 -12 -46 -4 37 0 -37 -75 -113 -69 -25 -57 -89 -62 -35 -8 18
$$ packed form
3657c1N3k4k6k6k6l2l2J4J4%%j%nmnmK5K5J9J9R6Nm9kkm7LR4L5j1q6m2K1p1m2LK7K7K9L0j7
3644d6j7j8j7mnM1M1k7k6k7k6L2L2L2L3o3o4o3o3K8K7K7K7K8K7K7K7K1K0K0K1K6K6j9k0j02
3633d4j03MMkjjjk0k0J17J17J3J3l2l3j8k0o5o5M5M5M6M4k6k6k7k6QRRQK9K7p8p9J6J6J6J5
3621h6j3j3j3j4j9j9j9j9M4M3M3M3j1j2j4j4k5p1n2M1J4J5L5Q0N8l3M0J32M4m7RJ0jj%jl3
3609A21l2l2l2p8p8p5JJ8J9O8O9J01J01pqnn1p1OK5k1on0l4M2mlk1k0k1k0mnJ1N7M0l4o1j6
3597a10J5J4J7J7ppO3O4L1m4p4p5J7O2L3m1m0m0L1L1P3P3K8K8n0m9n0m8k5k5K1K1OPN1N3l8
3586C3l7PQj4j5j5j5k1k2k2k2J7J6M7Jn6K0P4P3N6n2o4k0Rl6m9m8JP9L5L4L0L0p6p7m4m3K
3574a76Km6m6j5O0L2j3n5rN9N8O2O1M1M3M2M2n3n3pql3l4M2M1l7l7l8l8M4M4l2l2K7K7K7K6
$$ plain form
3562 18 13 9 -40 -90 -152 -214 -199 -185 -145 -104 -171 -237 -225 -212 -169 -172 -194 -141 -87 -34 -58 -82 -60 -38 -40 -42 -90 -138 -134 -130 -126 -122 -66 -11 -29 -47 -70 -47 -4 -37
3550 -37 -121 -159 -121 -83 -40 3 46 90 90 91 91 92 88 83 79 74 101 128 79 30 -6 -44 -50 -103 -153 -128 -76 -70 -85 -99 -70 -42 -33 -24 -16 -7 6 19 -12 -44 -76 -109
3537 -109 -142 -175 -172 -169 -166 -163 -133 -103 -149 -196 -226 -257 -242 -227 -216 -204 -190 -176 -197 -172 -121 -162 -157 -152 -192 -233 -248 -171 -95 -110 -99 -88 -37 13 -7 -28 -3 21
3525 21 -7 -36 -39 47 92 137 111 85 68 51 31 10 -6 -70 -116 -71 -28 -30 -30 15 -2 -67 -102 -138 -117 -96 -74 -53 -75 -97 -104 -66 -37 -99 -118 -46 -3
3514 -3 -52 -43 -35 -35 -35 -36 -36 -43 -50 -58 -65 -112 -159 -162 -119 -86 -145 -201 -166 -125 -85 -115 -146 -138 -131 -77 -24 -32 -39 -1 36 88 140 116 92 61 30 45 60 73 86 100 113
3500 113 114 116 118 120 104 88 27 -34 -37 -40 -89 -138 -188 -238 -181 -125 -80 -36 8 52 119 186 201 124 19 -39 -124 -210 -228 -171 -58 9 15 -24 4 33 38 42
3489 42 45 47 41 -9 -81 -152 -197 -243 -271 -254 -228 -248 -264 -236 -176 -117 -58 1 36 26 42 57 41 24 34 -2 -24 -46 -71 -96 -95 -95 -94 -93 -84 -75 -65 -56 -20 14
3476 14 1 -10 -74 -183 -246 -264 -215 -167 -222 -277 -225 -172 -123 -73 -46 -65 -135 -204 -214 -224 -235 -245 -226 -206 -158 -156 -146 -89 -92 -171 -217 -218 -198 -133 -67 -1
$$ packed form
3562A8nmm9n0o2o2J5J4M0M1o7o6J2J3M3lk2N3N4N3k4k4K2K2kkm8m8MMMMN6N5j8j8k3K3M3l3
3550c7q4l8L8L8M3M3M3M4%J%JmnmnK7K7m9m9l6l8on3n0K5N2Oj5j4K9K8RRQRJ3J3l1l2l2l3
3537a09l3l3LLLLL0L0m6m7l0l1J5J5J1J2J4J4k1K5N1m1NNm0m1j5P7P6j5J1J1N1N0k0k1K5K4
3525B1k8k9lQ6M5M5k6k6j7j7k0k1j6o4m6M5M3k%M5j7o5l5l6K1K1K2K1k2k2pL8K9o2j9P2M3
3514cm9RQ%%j%ppqpm7m7lM3L3n9n6L5M1M0l0l1QPN4N3qpL8L7N2N2k4k4l1l1J5J5J3J3J4J3
3500A13JKKKj6j6o1o1llm9m9n0n0N7N6M5M4M4M4O7O7J5p7j05n8q5q6j8N7J13O7Ol9K8K9NM
3489D2LKon0p2p1m5m6k8J7K6k0j6K8O0N9N9N9L5j0J6J5j6j7J0l6k2k2k5k5J%JJRRJ0RL6L4
3476A4j3j1o4j09o3j8M9M8n5n5N2N3M9N0K7j9p0o9j0j0j1j0J9K0M8KJ0N7lp9m6jK0O5O6O6
$$ plain form
3465 -1 -36 -71 -83 -49 -41 -32 22 77 51 -20 -72 -125 -132 -94 -53 -57 -79 -101 -98 -95 -92 -89 -77 -66 -57 -49 -14 -25 -14 -2 -67 -177 -181 -139 -130 -122 -107 -93 -129 -119 -59 0
3452 0 9 17 26 34 -6 -47 -12 23 60 97 134 171 199 226 178 129 87 44 1 -40 -78 -116 -77 -39 -9 20 -25 -72 -123 -174 -179 -185 -175 -165 -156 -146 -168 -189 -135
3440 -135 -80 -47 -14 23 -28 -67 -105 -104 -102 -103 -104 -106 -107 -120 -132 -145 -158 -161 -165 -214 -264 -203 -143 -159 -175 -160 -144 -79 77 159 150 122 94 48 1 -90 -182 -186 -190 -149
3428 -149 -108 -82 -56 -76 -97 -34 28 15 1 -44 -89 -135 -181 -210 -238 -191 -143 -186 -228 -270 -312 -238 -163 -113 -154 -179 -204 -189 -174 -125 -76 -72 -69 -148 -228 -231
3416 -231 -234 -183 -131 -34 62 48 34 20 6 -3 -12 -67 -122 -122 -123 -78 -32 -93 -153 -138 -122 -129 -136 -140 -145 -133 -75 0 -2 -3 -5 -11 -17 -4 8 63 43 -61 -167 -243 -244
3404 -244 -211 -178 -140 -103 -16 69 46 23 27 -13 -92 -64 -31 -45 -4 -8 -57 -151 -220 -213 -233 -254 -270 -286 -201 -117 -106 -95 -68 4 49 18 -27 -73 -121 -92
3393 -92 -46 0 5 10 -39 -90 -141 -192 -165 -138 -65 6 68 129 144 160 159 159 158 158 119 79 85 92 7 -78 -71 10 6 -43 -17 54 71 11 -74 -159 -212 -188 -132 -123 -178
3380 -178 -188 -150 -113 -67 -22 18 59 45 -45 -92 -63 -22 -26 0 25 -4 -34 -19 -3 45 94 97 100 42 -15 32 81 127 172 124 0 -118 -236 -298 -284
$$ packed form
3465al5l5j2L4QRN4N5k6p1n2n3pL8M1mk2k2LLLLJ2J1RQL5j1J1J2o5j10mM2RQJ5J4l6J0O0N9
3452@RQRQm0m1L5L5L7L7L7L7K8K7m8m9m2m3m3m1l8l8L9L8L0K9m5m7n1n1noJ0J0RJ0k2k1N4
3440a35N5L3L3L7n1l9l8JKjjkjj3j2j3j3lmm9n0O1O0j6j6J5J6O5J56Q2rk8k8m6m7r1r2mmM1
3428a49M1K6K6k0k1O3O2j3j4m5m5m6m6k9k8M7M8m3m2m2m2P4P5N0m1k5k5J5J5M9M9MLp9q0l
3416b31lN1N2R7R6j4j4j4j4rrn5n5%jM5M6o1o0J5J6ppmnJ2N8P5kjkooJ3J2N5k0j04j06p6j
3404b44L3L3L8L7Q7Q5k3k3Mm0p9K8L3j4M1mm9r4o9Pk0k1j6j6Q5Q4J1J1K7P2M5l1m5m6m8K9
3393i2M6M6NNm9n1n1n1K7K7P3P1O2O1J5J6j%j%l9m0OPq5q5PQ1mm9K6P1J7o0q5q5n3K4N6Rn5
3380a78j0L8L7M6M5M0M1j4r0m7K9M1mK6K5k9l0J5J6M8M9LLn8n7M7M9M6M5m8j24j18j18o2J4
$$ plain form
3369 -284 -226 -213 -218 -147 -24 21 -21 -64 -69 -74 -79 -85 -100 -116 -99 -128 -181 -128 -19 13 -1 -15 -34 -53 -105 -156 -162 -168 -204 -241 -280 -319 -327 -380 -319 -181 -86
3357 -86 -68 -78 -88 -89 -90 -91 -92 -41 8 12 17 -13 -44 -29 -14 -58 -101 -69 9 33 -18 -116 -138 -118 -144 -186 -227 -233 -238 -243 -172 -103 -79 -101 -124 -139 -155 -97 -39 -77
3345 -77 -159 -158 -80 -14 -25 -33 -42 -2 36 -30 -97 -77 -58 -38 -19 12 44 0 -43 -87 -130 -128 -125 -100 -74 -121 -167 -216 -188 -85 -57 -79 -101 -127 -154 -152 -150 -148 -146
3333 -146 -85 -25 -10 4 -61 -128 -139 -58 -30 -2 -14 -26 -39 -51 -64 -77 -2 73 99 33 -46 -34 -4 26 55 85 38 -7 -54 -100 -101 -102 -80 -58 -25 -83
3322 -83 -134 -94 -54 -105 -155 -112 -81 -50 -40 -30 -66 -101 -89 -77 -65 -53 -33 -12 8 28 17 5 -5 -17 -17 -17 -63 -109 -108 -107 -152 -197 -219 -241 -263 -286 -271
3310 -271 -257 -243 -228 -159 -89 -65 -41 -25 -8 -68 -128 -79 -30 -27 -24 -76 -128 -49 29 113 104 41 -22 -128 -234 -233 -233 -199 -166 -88 -9 46 102 27 -48 -89
3299 -89 -39 5 49 -20 -90 -83 -77 -10 55 45 35 -44 -125 -199 -274 -276 -187 -150 -112 -75 -38 -77 -116 -123 -129 -136 -143 -77 -10 -20 -30 -40 -50 -60 -70 -102 -135 -65 3
3287 3 32 -15 -91 -122 -89 -56 -66 -76 -105 -134 -206 -202 -130 -58 -57 -56 -55 -53 -97 -141 -91 -40 -35 -30 -47 -64 -35 -6 -22 -38 -54 -70 -118 -165 -212 -260 -209 -158 -108
$$ packed form
3369b84N8J3nP1J23M5m2m3nnnoj5j6J7k9n3N3J09L2j4j4j9j9n2n1ool6l7l9l9qn3O1J38R5
3357h6J8j0j0jjjjN1M9MNl0l1J5J5m4m3L2P8K4n1r8k2K0k6m2m1onnP1O9K4k2k3j5j6N8N8l8
3345g7q2JP8O6j1qrM0L8o6o7K0J9K0J9L1L2m4m3m4m3KLK5K6m7m6m9K8J03K8k2k2k6k7KKKK
3333a46O1O0J5J4o5o7j1Q1K8K8j2j2j3j2j3j3P5P5K6o6p9J2L0L0K9L0m7m5m7m6jjK2K2L3n8
3322h3n1M0M0n1n0M3L1L1J0J0l6l5J2J2J2J2K0K1K0K0j1j2j0j2%%m6m6JJm5m5k2k2k2k3J5
3310b71J4J4J5O9P0K4K4J6J7o0o0M9M9LLn2n2P9P8Q4ro3o3j06j06J%L4L3P8P9N5N6p5p5m1
3299h9N0M4M4o9p0POO7O5j0j0p9q1p4p5kQ9L7L8L7L7l9l9poppO6O7j0j0j0j0j0j0l2l3P0O8
3287CK9m7p6l1L3L3j0j0k9k9p2MP2P2JJJKm4m4N0N1NNj7j7K9K9j6j6j6j6m8m7m7m8N1N1N0
$$ plain form
3275 -108 -57 -74 -91 -108 -125 -108 -91 -119 -148 -170 -192 -214 -236 -219 -202 -185 -167 -136 -105 -122 -139 -120 -146 -193 -163 -148 -178 -132 -86 -56 -27 2 32 0 -32
3264 -32 -64 -96 -103 -109 -116 -123 -121 -119 -117 -115 -53 7 22 37 21 5 -13 -32 -30 -74 -138 -126 -52 -23 -71 -119 -134 -150 -120 -90 -74 -57 -41 -24 -42 -60 -78 -95 -86 -78 -69
3251 -69 -60 -74 -89 -104 -118 -68 -18 -14 -9 -4 1 -37 -77 -115 -153 -145 -137 -152 -168 -107 -46 15 77 35 -6 0 51 131 120 89 104 87 70 23 -23 -70 -117 -77 -36
3239 -36 3 44 35 25 16 7 -6 -20 -34 -48 -17 14 26 -53 -152 -160 -151 -188 -198 -163 -157 -150 -124 -97 -71 -44 -63 -83 -57 -30 -30 -29 -29 -28 -16 -4 8 20 51 83 108
3227 108 134 152 78 2 17 27 -9 -34 -104 -156 -207 -216 -224 -262 -300 -262 -224 -190 -156 -123 -89 -151 -212 -274 -335 -329 -322 -270 -218 -172 -126 -81 -35 -51 -67 -51 -81
3215 -81 -154 -136 -96 -101 -107 -37 -13 10 -4 -19 -36 -54 -70 -132 -169 -129 -80 -77 -120 -163 -157 -150 -144 -137 -96 -54 -58 -62 -55 -48 4 57 65 73 81 89 47 6 10 15 20 25 30 36 19 3
3201 3 -13 -30 -50 -70 -15 40 70 100 84 68 -1 -71 -142 -212 -273 -335 -381 -382 -361 -416 -442 -362 -305 -294 -247 -201 -168 -89 -47 -112 -167 -146 -133 -121 -109 -174
3190 -174 -267 -314 -275 -235 -269 -302 -216 -130 -44 42 20 -1 -18 -35 -100 -88 -46 -48 -93 -93 -18 9 -32 -74 -165 -256 -289 -322 -309 -296 -239 -181 -127 -72 14 56
$$ packed form
3275a08N1j7j7j7j7J7J7k8k9k2k2k2k2J7J7J7J8L1L1j7j7J9k6m7L0J5l0M6M6L0K9K9L0l2l2
3264c2l2l2poppKKKKO2O0J5J5j6j6j8j9Km4o4J2P4K9m8m8j5j6L0L0J6J7J6J7j8j8j8j7RQR
3251f9Rj4j5j5j4N0N0MNNNl8m0l8l8QQj5j6O1O1O1O2m2m1ON1Q0j1l1J5j7j7m7m6m7m7M0M1
3239c6L9M1rj0rrj3j4j4j4L1L1J2p9r9qRl7j0L5OPK6K7K6K7j9k0K6K7%J%JJ2J2J2J2L1L2K5
3227A08K6J8p4p6J5J0l6k5p0n2n1rql8l8L8L8L4L4L3L4o2o1o2o1OPN2N2M6M6M5M6j6j6J6l0
3215h1p3J8M0noP0K4K3j4j5j7j8j6o2l7M0M9Lm3m3OPOPM1M2mmPPN2N3QQQQm2m1MNNNNOj7j6
3201Cj6j7k0k0N5N5L0L0j6j6o9p0p1p0o1o2m6jK1n5k6Q0N7J1M7M6L3P9M2o5n5K1J3J2J2o5
3190a74r3m7L9M0l4l3Q6Q6Q6Q6k2k1j7j7o5J2M2km5%P5K7m1m2r1r1l3l3J3J3N7N8N4N5Q6M2
$$ plain form
3179 56 60 -12 -146 -280 -295 -233 -193 -153 -108 -64 -68 -73 -78 -83 -93 -102 -36 30 37 45 6 -31 -63 -95 -127 -159 -170 -182 -147 -112 -90 -67 -44 -22 27 76 49 22
3167 22 3 -16 -36 -55 -135 -215 -246 -277 -220 -117 -34 -42 -62 -82 -63 1 84 76 17 3 -20 -91 -104 -163 -234 -260 -208 -155 -167 -178 -144 -110 -119 -128 -137 -146 -115 -84
3155 -84 -53 -22 -54 -85 -72 -58 -57 -56 -56 -55 -2 50 50 -39 -94 -103 -98 -92 -140 -187 -189 -191 -166 -141 -130 -166 -156 -55 42 49 30 11 -13 -38 -22 -7 8 24 -8 -42
3143 -42 1 44 7 -30 -67 -104 -51 2 9 17 -16 -49 -37 -25 -48 -71 -94 -117 -131 -144 -82 -19 0 18 -8 -35 -58 -80 -103 -125 -116 -107 -98 -89 -55 -21 12 47
3131 47 -9 -65 -76 -86 -72 -58 -45 -31 -132 -234 -289 -345 -331 -316 -256 -196 -221 -246 -194 -143 -148 -154 -159 -165 -154 -143 -132 -121 -150 -178 -175 -217 -305 -301 -214 -127 -91
3119 -91 -55 -95 -180 -215 -158 -80 -1 42 86 23 -39 -48 -57 -67 -76 -98 -120 -142 -164 -145 -127 -185 -243 -207 -171 -178 -185 -180 -130 -48 -58 -105 -60 -26 6 -9 -25 -41
3108 -41 -57 -63 -69 -121 -173 -116 -60 -3 52 22 -8 7 22 12 1 -8 -19 -8 1 8 16 0 -60 -147 -142 -130 -118 -86 -8 55 27 -48 -77 -5 67 97 127 105 83
3095 83 107 131 157 183 133 83 44 5 12 18 3 -12 12 36 83 39 1 -37 -77 -116 -111 -105 -116 -127 -139 -150 -122 -94 -66 -39 -104 -170 -190 -210 -127 -44 -8
$$ packed form
3179E6Mp2j34j34j5O2M0M0M5M4mnnnj0rO6O6PQl9l7l2l2l2l2j1j2L5L5K2K3K3K2M9M9k7k7
3167B2j9j9k0j9q0q0l1l1N7J03Q3qk0k0J9O4Q3qn9j4k3p1j3n9p1k6N2N3j2j1L4L4rrrrL1L1
3155h4L1L1l2l1J3J4JJ%JN3N2%q9n5rNOm8m7kkK5K5J1l6J0J01R7Pj9j9k4k5J6J5J5J6l2l4
3143d2M3M3l7l7l7l7N3N3PQl3l3J2J2k3k3k3k3j4j3O2O3J9J8k6k7k3k2k3k2RRRRL4L4L3L5
3131D7n6n6j1j0J4J4J3J4j01j02n5n6J4J5O0O0k5k5N2N1nonoJ1J1J1J1k9k8Lm2q8MQ7Q7L6
3119i1L6m0q5l5N7P8P9M3M4o3o2rrj0rk2k2k2k2J9J8n8n8L6L6ppNN0Q2j0m7M5L4L2j5j6j6
3108d1j6oon2n2N7N6N7N5l0l0J5J5j0j1rj1J1RPQj6o0q7NJ2J2L2P8O3k8p5k9P2P2L0L0k2k2
3095H3K4K4K6K6n0n0l9l9POj5j5K4K4M7m4l8l8m0l9NOj1j1j2j1K8K8K8K7o5o6k0k0Q3Q3L6
$$ plain form
3084 -8 28 39 49 13 -21 -59 -97 -34 28 33 -53 -68 -37 18 74 111 56 -7 -26 -75 -125 -176 -226 -169 -113 -40 33 109 94 68 -3 -106 -118 -130 -142 -103
3073 -103 -63 -72 -82 -45 -8 -64 -120 -99 -79 -84 -89 -93 -98 -140 -182 -178 -174 -122 -70 -91 -112 -76 4 35 -24 -18 -12 -12 -12 -43 -73 -29 61 107 61 -3 -23 23 24 -52 -129
3060 -129 -175 -221 -161 -100 -130 -160 -190 -221 -219 -217 -175 -133 -84 -126 -188 -204 -195 -187 -246 -305 -333 -270 -276 -327 -328 -282 -266 -249 -227 -206 -81 44 37 -14 -98 -90 -57 -115
3048 -115 -142 -123 -108 -93 -81 -70 -56 -133 -185 -191 -192 -193 -121 -48 -1 -46 -50 35 103 80 67 55 24 -6 -38 -69 -73 -77 -81 -85 -83 -80 -123 -166 -134 -102 -70 -38 -89 -139
3036 -139 -190 -241 -241 -241 -242 -242 -205 -168 -131 -94 -76 -58 -117 -175 -197 -219 -196 -172 -167 -161 -156 -151 -162 -173 -184 -195 -142 -89 -36 16 -71 -159 -164 -78 -16 0 -27 -55 -68
3024 -68 -82 -96 -109 -113 -117 -121 -125 -69 -13 -2 7 2 -2 -7 -13 -24 -35 -45 -56 -28 0 -18 -35 -27 -19 -11 -3 -13 -22 -32 -42 -32 -23 -14 -4 -18 -31 -45 -58 -50 -42 -35 47 93 64
3010 64 -24 -113 -169 -226 -236 -247 -221 -195 -169 -143 -121 -99 -32 35 37 38 39 41 -33 -108 -76 -44 -52 -59 -66 -73 -61 -48 -81 -160 -148 -61 -20 21 3 -15 -33 -52 -40
2998 -40 -29 -63 -98 -42 14 -6 -26 -51 -77 -56 -36 -46 -56 -66 -77 -88 -98 -109 -120 -109 -98 -87 -76 -53 -30 -83 -137 -178 -218 -153 -87 -25 36 22 8
$$ packed form
3084hL6J1J0l6l4l8l8O3O2Nq6j5L1N5N6L7n5o3j9m9n0n1n0N7N6P3P3P6j5k6p1j03j2j2j2L9
3073a03M0rj0L7L7n6n6K1K0nnmnm2m2MMN2N2k1k1L6Q0L1n9OO%%l1l0M4R0M6m6o4k0M6Jp6p7
3060a29m6m6O0O1l0l0l0l1KKM2M2M9m2o2j6RQn9n9k8O3on1jM6J6J7K2K1J25J25pn1q4QL3n8
3048a15k7J9J5J5J2J1J4p7n2ojjP2P3M7m5mQ5O8k3j3j2l1l0l2l1mmmmKLm3m3L2L2L2L2n1n0
3036a39n1n1%%j%L7L7L7L7J8J8n9n8k2k2K3K4NONNj1j1j1j1N3N3N3N2q7q8nQ6O2J6k7k8j3
3024f8j4j4j3mmmmN6N6J1Rnmnoj1j1j0j1K8K8j8j7QQQQj0rj0j0J0RRJ0j4j3j4j3QQPQ2M6k9
3010F4q8q9n6n7j0j1K6K6K6K6K2K2O7O7KJJKp4p5L2L2qpppJ2J3l3p9J2Q7M1M1j8j8j8j9J2
2998d0J1l4l5N6N6k0k0k5k6K1K0j0j0j0j1j1j0j1j1J1J1J1J1K3K3n3n4m1m0O5O6O2O1j4j4
$$ plain form
2987 8 -89 -187 -209 -231 -245 -259 -200 -142 -125 -153 -202 -175 -155 -181 -176 -171 -169 -166 -117 -69 -33 3 39 76 8 -60 -174 -288 -239 -191 -142 -93 -8 77 117 157 186
2975 186 214 167 119 109 98 88 77 74 71 22 -25 -66 -106 -9 87 72 57 88 119 71 22 -25 -73 -51 -28 34 98 166 158 86 14 -6 -27 -48 -69 -94
2964 -94 -119 -144 -169 -206 -243 -277 -235 -118 -2 11 26 12 -1 -15 46 37 -17 -41 -66 -34 -3 -17 -31 -29 -27 20 68 65 63 14 -33 -99 -164 -153 -142 -92 -42
2953 -42 -37 -33 -41 -50 -11 -49 -101 -78 -56 -35 -13 7 -16 -40 9 60 64 24 -19 12 45 77 41 4 -31 -68 -81 -93 -110 -50 -16 -89 -97 -105 -147 -188 -230 -272 -264
2941 -264 -256 -172 -88 -50 -13 -21 -29 -57 -85 -37 10 25 39 7 -24 -36 -49 -107 -165 -151 -137 -123 -109 -84 -59 -35 -10 -18 -25 -79 -132 -199 -265 -225 -184 -193 -201 -249
2929 -249 -297 -301 -213 -148 -128 -123 -72 3 -10 -57 -57 -89 -121 -85 -49 -13 21 40 58 76 94 84 73 17 -38 -41 -43 -122 -200 -229 -259 -211 -164 -108 -51 -71 -90
2917 -90 -28 33 20 6 -45 -96 -153 -119 -75 -32 -89 -146 -175 -204 -157 -110 -106 -101 -97 -93 -41 9 16 -22 -63 -13 8 -14 -11 -8 -53 -143 -149 -64 20 13 -31 -30 -61 -92
2905 -92 -146 -200 -208 -216 -213 -210 -206 -203 -197 -191 -184 -178 -169 -160 -150 -141 -107 -73 6 86 112 138 57 -23 -84 -144 -129 -113 -101 -89 -29 -45 -115 -109 -48 -33 -108 -182 -153 -124 -76 -28
$$ packed form
2987Hr7r8k2k2j4j4N9N8J7k8m9K7K0k6NNKLM9M8L6L6L6L7o8o8j14j14M9M8M9M9Q5Q5M0M0K9
2975A86K8m7m8j0j1j0j1llm9m7m1m0R7R6j5j5L1L1m8m9m7m8K2K3O2O4O8qp2p2k0k1k1k1k5
2964i4k5k5k5l7l7l4M2J17J16J3J5j4j3j4O1rn4k4k5L2L1j4j4KKM7M8lkm9m7o6o5J1J1N0N0
2953d2NMqrL9l8n2K3K2K1K2K0k3k4M9N1Mm0m3L1L3L2l6l7l5l7j3j2j7O0L4p3qqm2m1m2m2Q
2941b64QQ4Q4L8L7qqk8k8M8M7J5J4l2l1j2j3n8n8J4J4J4J4K5K5K4K5qpn4n3o7o6M0M1rqm8
2929b49m8mQ8O5K0NN1P5j3m7%l2l2L6L6L6L4J9J8J8J8j0j1n6n5lkp9p8k9l0M8M7N6N7k0j9
2917i0O2O1j3j4n1n1n7L4M4M3n7n7k9k9M7M7MNMMN2N0Pl8m1N0K1k2LLm5r0oQ5Q4pm4Jl1l1
2905i2n4n4qqLLMLOOPORRJ0RL4L4P9Q0K6K6q1q0o1o0J5J6J2J2O0j6p0OO1J5p5p4K9K9M8M8
$$ plain form
2892 -28 -83 -139 -134 -83 -87 -166 -233 -223 -182 -96 -28 -5 0 5 27 49 25 1 -100 -201 -297 -317 -280 -197 -91 -63 -63 -63 -69 1 69 92 69 45 19 -5 -29
2880 -29 -130 -182 -159 -183 -206 -215 -224 -228 -232 -211 -114 -17 3 -8 -20 -37 -53 -67 -81 -95 -108 -160 -211 -216 -222 -176 -130 -84 -38 -26 -15 41 143 133 46 4 -36
2869 -36 -68 -99 -131 -163 -186 -209 -186 -164 -135 -105 -76 -47 -23 0 23 46 4 -37 -33 -29 -17 -5 7 19 1 -16 -34 -52 -65 -79 -92 -105 -160 -214 -195 -176
2858 -176 -146 -162 -148 -59 -46 -33 -15 2 16 30 85 140 109 3 -100 -127 -69 34 94 109 110 66 19 17 -29 -76 -74 -73 -90 -108 -126 -143 -128 -113 -99
2847 -99 -84 -118 -152 -142 -133 -105 -123 -204 -208 -187 -165 -139 -113 -134 -156 -177 -199 -155 -111 -113 -116 -149 -183 -216 -250 -229 -208 -187 -166 -126 -86 -46 -6 -5 -4 -4 -3 -2 -2 -1 0
2834 0 -6 -12 -17 -23 -38 -54 -23 6 -14 -36 -99 -161 -226 -214 -138 -63 -75 -88 -100 -113 -102 -92 -82 -71 -5 60 76 92 53 -61 -155 -204 -210 -169 -152 -135 -119 -103
2822 -103 -88 -72 -30 11 -23 -57 -19 18 57 95 27 -39 -61 -82 -56 -30 -9 11 44 0 -104 -209 -268 -281 -272 -262 -253 -198 -140 -129 -156 -137 -101 -66 -66
2812 -66 -66 -64 -61 -90 -73 -82 -90 -125 -160 -148 -137 -124 -111 -98 -85 -39 6 -26 -104 -213 -277 -232 -188 -194 -201 -223 -291 -302 -237 -192 -193 -223 -252 -310 -322 -237 -152 -141 -129
$$ packed form
2892b8n5n6NN1mp9o7J0M1Q6O8K3NNK2K2k4k4j01j01r6k0L7Q3J06K8%%oP0O8K3k3k4k6k4k4
2880b9j01n2K3k4k3rrmmK1R7R7K0j1j2j7j6j4j4j4j3n2n1noM6M6M6M6J2J1N6J02j0q7m2m0
2869c6l2l1l2l2k3k3K3K2K9L0K9K9K4K3K3K3m2m1MMJ2J2J2J2j8j7j8j8j3j4j3j3n5n4J9J9
2858a76L0j6J4Q9J3J3J8J7J4J4N5N5l1j06j03k7N8J03O0J5Jm4m7km6m7KJj7j8j8j7J5J5J4
2847i9J5l4l4J0RK8j8q1mK1K2K6K6k1k2k1k2M4M4kll3l4l3l4K1K1K1K1M0M0M0M0JJ%JJ%JJ
2834@oonoj5j6L1K9k0k2o3o2o5J2P6P5j2j3j2j3J1J0J0J1O6O5J6J6l9j14r4m9oM1J7J7J6J6
2822a03J5J6M2M1l4l4L8L7L9L8o8o6k2k1K6K6K1K0L3m4j04j05n9j3RJ0RN5N8J1k7J9L6L5%
2812f6%KLk9J7rql5l5J2J1J3J3J3J3M6M5l2p8j09o4M5M4opk2o8j1O5M5jl0k9n8j2Q5Q5J1J2
$$ plain form
2800 -129 -177 -225 -273 -321 -303 -285 -296 -261 -183 -150 -190 -185 -164 -143 -161 -180 -217 -208 -154 -145 -142 -139 -113 -133 -119 -105 -137 -169 -171 -128 -110 -92 -132 -171 -164 -158 -176 -194 -192
2787 -192 -145 -104 -63 -66 -68 -112 -156 -154 -153 -132 -112 -134 -156 -141 -80 -20 -5 -36 -67 -56 -44 -88 -131 -146 -207 -208 -163 -147 -130 -141 -151 -161 -171 -135 -99 -109 -118 -136
2776 -136 -153 -63 25 41 56 72 87 59 32 5 -22 -24 -27 -29 -31 -31 -30 -30 -29 -70 -111 -106 -101 -34 32 23 13 -13 -40 -21 -2 21 46 -5 -57 -94 -131 -92 -52 -24
2763 -24 4 27 50 -23 -188 -308 -336 -350 -364 -327 -289 -159 -30 -16 -94 -111 -127 -104 -81 -130 -180 -187 -193 -157 -167 -247 -237 -158 -80 -41 -2 -21 -40 -58
2753 -58 -77 -54 -32 -9 13 2 -8 25 105 129 63 -25 -113 -160 -208 -179 -151 -135 -120 -104 -89 -115 -141 -162 -183 -253 -231 -215 -199 -187 -175 -117 -59 -51 -43 -40 -38
2741 -38 -13 -80 -166 -252 -300 -257 -188 -120 -119 -118 -71 -25 -59 -93 -128 -162 -152 -141 -131 -120 -111 -101 -91 -81 -95 -109 -124 -138 -132 -127 -81 -36 -29 -114 -173 -187 -120 -53
2729 -53 -29 -5 -32 -60 -16 26 41 -35 -85 -90 -83 -76 -20 35 1 -33 -64 -96 -99 -56 14 -5 -65 -79 -124 -170 -130 -89 -95 -100 -56 -12 31 75 64 53 42 30
2718 30 45 60 28 -2 -17 -32 -1 28 35 42 3 -34 -95 -156 -217 -277 -289 -301 -206 -111 -52 7 -39 -87 -135 -183 -124 -65 -118 -171 -224 -277 -248 -219 -235 -252
$$ packed form
2800a29m8m8m8m8J8J8j1L5P8L3m0NK1K1j8j9l7RN4RLLK6k0J4J4l2l2kM3J8J8m0l9POj8j8K
2787a92M7M1M1lkm4m4KJK1K0k2k2J5O1O0J5l1l1J1J2m4m3j5o1jM5J6J7j1j0j0j0L6L6j0rj8
2776a36j7R0Q8J6J5J6J5k8k7k7k7klkk%J%Jm1m1NNO7O6rj0k6k7J9J9K3K5n1n2l7l7L9M0K8
2763b4K8K3K3p3j65j20k8j4j4L7L8J30J29J4p8j7j6K3K3m9n0poL6j0q0J0P9P8L9L9j9j9j8
2753e8j9K3K2K3K2j1j0L3Q0K4o6q8q8m7m8K9K8J6J5J6J5k6k6k1k1p0K2J6J6J2J2N8N8QQLK
2741c8K5o7q6q6m8M3O9O8JJM7M6l4l4l5l4J0J1J0J1RJ0J0J0j4j4j5j4ONM6M5Pq5n9j4O7O7
2729e3K4K4k7k8M4M2J5p6n0nPPN6N5l4l4l1l2lM3P0j9o0j4m5m6M0M1onM4M4M3M4j1j1j1j2
2718C0J5J5l2l0j5j5L1K9PPl9l7o1o1o1o0j2j2R5R5N9N9m6m8m8m8N9N9n3n3n3n3K9K9j6j7
$$ plain form
2706 -252 -262 -272 -282 -292 -287 -283 -278 -274 -248 -222 -195 -169 -70 28 108 97 58 110 160 118 61 49 34 -25 -41 -11 -10 -8 -35 -62 -89 -116 -157 -199 -194 -190 -140 -90 -45
2694 -45 -1 -4 -99 -196 -202 -149 -142 -180 -218 -191 -165 -139 -113 -74 -36 -43 -50 -97 -143 -170 -106 12 40 -12 -64 -29 5 40 76 43 10 -22 -54 -2 49 25 0
2683 0 -5 -11 -18 -24 -5 14 -12 -38 -56 -74 -48 24 99 83 45 7 -101 -210 -212 -214 -229 -244 -255 -267 -222 -131 -85 -131 -201 -180 -170 -161 -129 -97 -111 -126 -161 -196
2671 -196 -231 -266 -239 -211 -184 -157 -171 -186 -246 -307 -284 -261 -162 -63 -62 -60 -104 -148 -184 -219 -209 -199 -168 -137 -152 -166 -193 -219 -169 -120 -56 7 -34 -77 -75 -74 -73
2660 -73 -71 -123 -175 -227 -279 -261 -244 -180 -117 -62 -7 1 10 -1 -13 19 53 13 -26 -20 -14 -17 -20 -22 -25 -98 -170 -166 -162 -141 -121 -140 -160 -149 -48 53 63 -29 -121 -113
2647 -113 -105 -140 -175 -165 -155 -145 -136 -127 -117 -124 -131 -214 -297 -311 -325 -292 -260 -186 -112 -114 -117 -98 -80 -16 47 31 15 0 -16 -36 -57 -77 -98 -124 -150 -75 0 14
2635 14 -61 -132 -203 -187 -171 -155 -140 -167 -194 -175 -157 -129 -102 -75 -48 -77 -105 -134 -163 -176 -188 -149 -110 -158 -115 -122 -130 -158 -186 -168 -150 -53 44 95 147 149 151
2624 151 77 2 20 38 11 -16 -62 -108 -205 -211 -131 -52 38 38 -6 -52 3 59 -23 -106 -143 -180 -175 -169 -163 -157 -170 -184 -121 -58 -14 29 73 117 88 60 -13 -87
$$ packed form
2706b52j0j0j0j0NMNMK6K6K7K6R9R8Q0j1l9N2N0m2n7j2j5n9j6L0JKk7k7k7k7m1m2NMN0N0M5
2694d5M4lr5r7oN3Pl8l8K7K6K6K6L9L8ppm7m6k7O4J18K8n2n2L5L4L5L6l3l3l2l2N2N1k4k5
2683@nopoJ9J9k6k6j8j8K6P2P5j6l8l8j08j09kkj5j5j1j2M5R1M6m6p0K1J0RL2L2j4j5l5l5
2671a96l5l5K7K8K7K7j4j5o0o1K3K3R9R9JKm4m4l6l5J0J0L1L1j5j4k7k6N0M9O4O3m1m3KJJ
2660g3Kn2n2n2n2J8J7O4O3N5N5QRj1j2L2L4m0l9OOllklp3p2MMK1K0j9k0J1J01J01J0r2r2Q
2647a13Ql5l5J0J0J0RRJ0ppq3q3j4j4L3L2P4P4klJ9J8O4O3j6j6j5j6k0k1k0k1k6k6P5P5J4
2635A4p5p1p1J6J6J6J5k7k7J9J8K8K7K7K7k9k8k9k9j3j2L9L9m8M3pqk8k8J8J8R7R7N1N2KK
2624A51p4p5J8J8k7k7m6m6r7oQ0P9R0%m4m6N5N6q2q3l7l7NOOOj3j4O3O3M4M3M4M4k9k8p3p4
$$ plain form
2612 -87 -121 -155 -189 -223 -249 -276 -257 -238 -270 -302 -289 -275 -252 -228 -205 -181 -88 4 -8 -22 -33 -44 -131 -218 -219 -219 -119 -18 7 -56 -121 -95 -3 87 108
2601 108 129 99 68 38 7 37 66 50 34 -29 -93 -131 -79 -66 -54 -112 -170 -171 -171 -126 -82 -83 -85 -87 -89 -96 -103 -65 -26 0 27 8 -9 -26 -43 -60 -77 -143 -208
2589 -208 -198 -187 -162 -136 -156 -176 -135 -93 -51 -9 6 22 -1 -25 -62 -7 93 103 46 -10 -27 -44 -36 -28 -96 -164 -192 -221 -172 -124 -102 -79 -62 -46 7
2578 7 -31 -93 -156 -175 -195 -137 -80 -52 -23 4 33 17 1 -15 -31 -36 -42 -47 -52 -58 -63 -23 16 -46 -110 -67 -24 -12 0 12 25 22 19 16 13 36 59 36 13 8 2 -2
2565 -2 -8 -49 -91 -32 27 32 -54 -140 -135 -118 -102 -156 -210 -203 -196 -189 -182 -174 -165 -156 -148 -159 -171 -76 19 14 9 -41 -91 -175 -258 -289 -228 -123 -63 -48 -33 6 46 11 -24 -72
2552 -72 -119 -120 -122 -94 -67 5 79 97 115 26 -62 -70 -77 -40 -2 -3 -4 -5 -6 -23 -39 20 80 129 179 122 20 -2 65 105 99 55 10 38 66 33 0 -32 -65
2540 -65 -25 13 7 0 -14 -29 -44 -60 -54 -48 -42 -37 -98 -159 -143 -128 -76 -23 -17 -10 8 28 1 -24 -66 -109 -152 -194 -180 -167 -139 -65 53 81 88 50 6 54 48 42
2528 42 54 66 1 -62 -40 -18 -41 -110 -187 -172 -80 -33 -73 -113 -155 -198 -146 -94 -42 9 24 39 55 70 85 101 116 131 77 23 -30 -84 -104 -124 -98
$$ packed form
2612h7l4l4l4l4k6k7J9J9l2l2J3J4K3K4K3K4R3R2j2j4j1j1q7q7j%J00J01K5o3o5K6R2R0K1
2601A08K1l0l1l0l1L0K9j6j6o3o4l8N2J3J2n8n8j%M5M4jkkkppL8L9K6K7j9j7j7j7j7j7o6o5
2589b08J0J1K5K6k0k0M1M2M2M2J5J6k3k4l7N5J00J0n7n6j7j7QQo8o8k8k9M9M8K2K3J7J6N3
2578Gl8o2o3j9k0N8N7K8K9K7K9j6j6j6j6nonnonM0L9o2o4M3M3J2J2J2J3llllK3K3k3k3nom
2565bom1m2N9N9Nq6q6NJ7J6n4n4PPPPQRRQj1j2R5R5nnn0n0q4q3l1O1J05O0J5J5L9M0l5l5m8
2552g2m7jkK8K7P2P4J8J8q9q8qpL7L8jjjjj7j6N9O0M9N0n7j02k2O7M0om4m5K8K8l3l3l2l3
2540f5M0L8opj4j5j5j6OOONo1o1J6J5N2N3OPJ8K0k7k5m2m3m3m2J4J3K8P4J18K8Pl8m4M8oo
2528D2J2J2o5o3K2K2k3o9p7J5R2M7m0m0m2m3N2N2N2N1J5J5J6J5J5J6J5J5n4n4n3n4k0k0K6
$$ plain form
2517 -98 -73 -60 -48 9 67 37 7 -21 -51 -80 -109 -138 -167 -111 -56 5 -24 -49 -74 -105 -136 -143 -151 -81 -12 -36 -60 -130 -199 -239 -278 -210 -143 -109 -76 -119
2506 -119 -162 -226 -290 -308 -326 -317 -307 -222 -136 -134 -132 -176 -220 -228 -236 -198 -161 -126 -91 -163 -235 -231 -227 -223 -219 -240 -262 -284 -305 -322 -339 -356 -372 -296 -219 -188 -158 -101 -45
2494 -45 -60 -74 -94 -23 51 34 -13 -14 -47 -80 -83 -87 -90 -93 -70 -47 -23 0 -22 -43 -62 -80 -48 28 86 52 18 -15 -8 -2 -31 -59 -41 -24 -21 -18 -14 -11 13 39 19
2481 19 0 -40 -79 -214 -304 -282 -168 -94 -112 -146 -135 -80 -24 -35 -46 -51 -56 -110 -73 -36 -91 -149 -207 -225 -243 -250 -256 -263 -269 -281 -292 -258 -223 -189 -154 -166 -177
2470 -177 -157 -137 -117 -97 -153 -208 -217 -227 -181 -136 -167 -198 -174 -150 -127 -103 -47 8 18 28 -10 -49 -88 -127 -201 -274 -266 -258 -277 -205 -158 -157 -129 -101 -122 -143 -151
2458 -151 -159 -91 -23 -47 -71 -50 -28 -69 -110 -151 -192 -122 -52 18 88 91 94 97 100 88 76 18 -39 -96 -154 -166 -178 -166 -153 -141 -128 -113 -98 -82 -67 -51 -36
2447 -36 -20 -4 -18 -32 -45 -59 -69 -79 -135 -191 -214 -236 -183 -129 -80 -31 -89 -147 -244 -341 -300 -260 -235 -210 -185 -160 -161 -161 -162 -163 -112 -61 -10 39 43 46 90 134
2435 134 150 91 33 -24 -64 -28 -7 -31 -92 -107 -48 -35 -82 -128 -131 -135 -129 -123 -118 -112 -130 -148 -166 -185 -173 -161 -149 -137 -82 -28 -62 -173 -271 -293 -286 -279 -252 -224
$$ packed form
2517i8K5J3J2N7N8l0l0k8l0k9k9k9k9N6N5O1k9k5k5l1l1pqP0O9k4k4p0o9m0l9O8O7L4L3m3
2506a19m3o4o4j8j8RJ0Q5Q6KKm4m4qqL8L7L5L5p2p2MMMMk1k2k2k1j7j7j7j6P6P7L1L0N7N6
2494d5j5j4k0P1P4j7m7jl3l3lmllK3K3K4K3k2k1j9j8L2P6N8l4l4l3POk9k8J8J7LLMLK4K6k0
2481A9j9m0l9j35r0K2J14P4j8l4J1N5N6j1j1nnn4L7L7n5n8n8j8j8popoj2j1L4L5L4L5j2j1
2470a77K0K0K0K0n6n5rj0M6M5l1l1K4K4K3K4N6N5J0J0l8l9l9l9p4p3QQj9P2M7JK8K8k1k1q
2458a51qO8O8k4k4K1K2m1m1m1m1P0P0P0P0LLLLj2j2n8n7n7n8j2j2J2J3J2J3J5J5J6J5J6J5
2447c6J6J6j4j4j3j4j0j0n6n6k3k2N3N4M9M9n8n8r7r7M1M0K5K5K5K5j%jjN1N1N1M9MLM4M4
2435A34J6n9n8n7m0L6K1k4o1j5N9J3m7m6lmOONOj8j8j8j9J2J2J2J2N5N4l4j11r8k2PPK7K8
$$ plain form
2423 -224 -196 -168 -189 -211 -186 -162 -89 -16 11 38 2 -33 37 108 85 61 38 15 -49 -114 -133 -153 -186 -219 -264 -218 -116 -107 -114 -76 -23 -16 -29 -42 -55 -113
2412 -113 -197 -190 -164 -139 -153 -168 -167 -167 -167 -167 -166 -165 -139 -21 59 140 144 56 3 -3 -42 -81 -172 -262 -246 -230 -232 -234 -160 -86 -53 -20 -32 -45 -99 -154 -156 -67 35 93
2399 93 106 74 20 58 66 30 -28 -86 -147 -209 -182 -156 -129 -103 -89 -75 -62 -48 -74 -101 -81 -62 -53 -44 -82 -119 -153 -187 -175 -164 -151 -139 -127 -114 -86 -57 -99
2388 -99 -141 -130 -29 26 -8 -66 -123 -110 -97 -62 -27 7 43 97 151 159 167 108 49 -9 -69 -51 -33 -15 2 -18 -39 -60 -81 -109 -137 -164 -192 -235 -277 -243
2377 -243 -210 -177 -144 -157 -170 -189 -208 -150 -93 -41 10 -44 -99 -168 -236 -198 -159 -148 -138 -127 -116 -197 -277 -282 -286 -271 -256 -241 -227 -276 -326 -299 -272 -257 -242 -181
2366 -181 -120 -133 -147 -160 -173 -183 -192 -156 -120 -85 -50 -14 20 9 -2 -10 -19 -49 -34 1 -39 -62 -39 0 37 25 12 -45 -104 -122 -140 -154 -168 -138 -33 52
2354 52 92 59 -18 -40 13 71 128 188 171 89 8 -1 -11 -31 -51 -70 -90 -52 -15 -23 -31 -46 -60 -74 -89 -59 -29 -29 -104 -163 -147 -132 -117 -125 -133 -141 -150 -168 -186
2342 -186 -158 -131 -75 -19 -39 -59 -58 -58 -57 -56 -11 34 33 33 65 96 82 68 35 2 15 27 12 -2 27 58 -2 -62 -73 -85 -61 7 93 103 71 39 48 57 66
$$ packed form
2423b24K8K8k1k2K5K4P3P3K7K7l6l5P0P1k3k4k3k3o4o5j9k0l3l3m5M6J02RpL8N3Pj3j3j3n8
2412a13q4PK6K5j4j5J%%%JJK6J18Q0Q1Mq8n3ol9l9r1r0J6J6kkP4P4L3L3j2j3n4n5kQ9J02N8
2399I3J3l2n4L8Ql6n8n8o1o2K7K6K7K6J4J4J3J4k6k7K0J9RRl8l7l4l4J2J1J3J2J2J3K8K9m2
2388i9m2J1J01N5l4n8n7J3J3L5L5L4L6N4N4QQn9n9n8o0J8J8J8J7k0k1k1k1k8k8k7k8m3m2L4
2377b43L3L3L3j3j3j9j9N8N7N2N1n4n5o9o8L8L9J1J0J1J1q1q0nmJ5J5J5J4m9n0K7K7J5J5O1
2366a81O1j3j4j3j3j0rL6L6L5L5L6L4j1j1qrl0J5L5m0k3K3L9L7j2j3n7n9j8j8j4j4L0J05Q5
2354E2M0l3p7k2N3N8N7O0j7q2q1rj0k0k0j9k0L8L7qqj5j4j4j5L0L0%p5n9J6J5J5qqqrj8j8
2342a86K8K7N6N6k0k0J%JJM5M5j%L2L1j4j4l3l3J3J2j5j4K9L1o0o0j1j2K4O8Q6J0l2l2RRR
$$ plain form
2330 66 75 84 93 81 69 12 -45 -86 -128 -169 -211 -204 -197 -149 -100 -38 -52 -111 -94 -36 20 37 54 49 44 39 34 20 5 -8 -23 -60 -96 -57 -17 -38 -58 -33 -8 -38
2318 -38 -67 -51 -35 -34 -32 -30 -29 -54 -79 -150 -221 -231 -242 -253 -264 -244 -225 -174 -170 -194 -142 -156 -215 -218 -220 -222 -224 -186 -103 -31 -65 -46 -26 -13 0 1 2 4 5 -47 -100 -108
2305 -108 -116 -79 -43 -83 -123 -147 -172 -196 -221 -167 -113 -59 -6 29 65 24 -15 -44 -73 -56 -39 -81 -123 -165 -206 -183 -160 -92 -23 -10 1 14 26 0 -26
2294 -26 -53 -80 -84 -88 -92 -96 -103 -110 -117 -124 -133 -143 -107 -70 -78 -86 -108 -177 -279 -306 -241 -175 -131 -87 -43 0 32 63 49 34 77 120 87 53 -7 -69 -131 -192 -230 -268
2282 -268 -255 -242 -209 -100 -51 -47 -48 -2 13 30 57 85 66 48 13 -21 -55 -90 -73 -57 -40 -23 -36 -49 -62 -75 -33 9 5 2 2 3 3 4 47 90 88 85 74
2270 74 63 52 41 8 -23 -56 -88 -105 -121 -137 -154 -206 -257 -233 -208 -130 -53 -8 -40 -150 -260 -281 -226 -139 -52 -12 28 57 -4 -60 -116 -166 -217 -191
2259 -191 -165 -194 -223 -175 -128 -94 -60 -72 -83 -98 -113 -52 8 -17 -44 -70 -97 -107 -117 -127 -137 -136 -134 -133 -131 -134 -137 -139 -142 -193 -244 -219 -194 -150 -106 -11 -7 -7 -7 -13 -19
2246 -19 -45 -72 -138 -205 -212 -128 -95 -62 -64 -67 -114 -162 -145 -128 -111 -94 -57 -20 21 -27 -74 -120 -127 -134 -94 -54 -14 26 -41 -108 -99 -90 -48 -5 -8 -10 0 11 23 34
$$ packed form
2330F6RRRj2j2n7n7m1m2m1m2PPM8M9O2j4n9J7N8N6J7J7nnnnj4j5j3j5l7l6L9M0k1k0K5K5l0
2318c8k9J6J6JKKJk5k5p1p1j0j1j1j1K0J9N1Mk4N2j4n9lkkkL8Q3P2l4J9K0J3J3JJKJn2n3q
2305a08qL7L6m0m0k4k5k4k5N4N4N4N3L5L6m1l9k9k9J7J7m2m2m2m1K3K3O8O9J3J1J3J2k6k6
2294b6k7k7mmmmpppprj0L6L7qqk2o9j02k7O5O6M4M4M4M3L2L1j4j5M3M3l3l4o0o2o2o1l8l8
2282b68J3J3L3J09M9MjM6J5J7K7K8j9j8l5l4l4l5J7J6J7J7j3j3j3j3M2M2ml%J%JM3M3klj1
2270G4j1j1j1l3l1l3l2j7j6j6j7n2n1K4K5P8P7M5l2j10j10k1N5Q7Q7M0M0K9o1n6n6n0n1K6
2259a91K6k9k9M8M7L4L4j2j1j5j5O1O0k5k7k6k7j0j0j0j0JKJKllkln1n1K5K5M4M4R5M%%oo
2246a9k6k7o6o7pQ4L3L3klm7m8J7J7J7J7L7L7M1m8m7m6ppM0M0M0M0o7o7RRM2M3lkJ0J1J2J1
$$ plain form
2234 34 71 108 68 29 -40 -110 -125 -49 -15 18 51 85 96 16 -51 -120 -189 -167 -120 -73 -73 -73 -27 18 32 46 60 74 67 60 53 46 25 5 30 55 154 253
2222 253 236 128 73 19 -35 -90 -119 -71 32 90 47 -41 -149 -182 -137 -92 -88 -84 -97 -109 -167 -226 -196 -167 -183 -199 -161 -122 -129 -136 -101 -65 -75 -85 -94 -102
2211 -102 -111 -120 -195 -269 -298 -327 -285 -244 -248 -252 -242 -232 -181 -130 -110 -167 -207 -201 -185 -169 -151 -132 -61 10 6 1 26 50 -1 -53 -22 8 39 71 50 30 -35 -101
2199 -101 -132 -163 -195 -226 -206 -185 -165 -145 -98 -52 -51 -50 -70 -90 -110 -130 -92 -53 -90 -127 -95 -63 -102 -141 -170 -122 -46 -15 -12 -8 -7 -6 -12 -18 -25 -31 -71 -112 -148 -183
2187 -183 -192 -124 -70 -62 -82 -56 -33 -55 -121 -187 -179 -172 -152 -132 -36 59 32 5 24 43 4 -35 -74 -113 -88 -63 -84 -105 -94 -83 -73 -62 -59 -55 -52 -48 -8 30 -9
2175 -9 -141 -260 -288 -266 -244 -206 -168 -131 -93 -116 -139 -112 5 54 12 -17 -48 -42 -35 -29 -23 -84 -146 -152 -67 -22 22 -3 -28 -57 -85 -114 -142 -209 -276 -267 -258 -236
2163 -236 -213 -197 -180 -69 -49 -115 -181 -157 -132 -108 -84 -102 -119 -137 -155 -165 -174 -184 -193 -146 -99 -98 -97 -112 -127 -141 -156 -194 -231 -269 -306 -276 -245 -215 -185 -127
2152 -127 -69 28 126 220 222 200 178 168 158 149 139 70 1 -78 -67 -40 -104 -163 -130 -129 -129 -122 -116 -90 -64 -115 -165 -114 -62 -87 -111 -127 -142 -81 -20 -33 -47 -60
$$ packed form
2234C4L7L7m0l9o9p0j5P6L4L3L3L4J1q0o7o9o9K2M7M7%%M6M5J4J4J4J4ppppk1k0K5K5R9R9
2222B53j7j08n5n4n4n5k9M8J03N8m3q8j08l3M5M5MMj3j2n8n9L0K9j6j6L8L9ppL5L6j0j0rq
2211a02rrp5p4k9k9M2M1mmJ0J0N1N1K0n7m0OJ6J6J8J9P1P1mnK5K4n1n2L1L0L1L2k1k0o5o6
2199a01l1l1l2l1K0K1K0K0M7M6JJk0k0k0k0L8L9l7l7L2L2l9l9k9M8P6L1LMJJoopom0m1l6l5
2187a83rO8N4Qk0K6K3k2o6o6QPK0K0R6R5k7k7J9J9l9l9l9l9K5K5k1k1J1J1J0J1LMLMM0L8l9
2175ij32j19k8K2K2L8L8L7L8k3k3K7J17M9m2k9l1OPOOo1o2oQ5M5M4k5k5k9k8k9k8o7o7RRK2
2163b36K3J6J7J11K0o6o6K4K5K4K4j8j7j8j8j0rj0rM7M7JJj5j5j4j5l8l7l8l7L0L1L0L0N8
2152a27N8R7R8R4Kk2k2j0j0rj0o9o9p9J1K7o4n9L3J%POK6K6n1n0N1N2k5k4j6j5O1O1j3j4j3
$$ plain form
2140 -60 -73 -64 -54 -45 -35 -60 -85 -104 -123 -159 -104 -74 -90 -44 1 25 -42 -130 -126 -75 -70 -95 -75 -82 -90 -101 -111 -121 -132 -103 -74 -46 -17 -25 -33 -86 -140 -149 -158 -167 -176
2127 -176 -145 -114 -80 -46 -32 27 66 15 -57 -129 -131 -133 -125 -117 -150 -182 -214 -155 -101 -48 -102 -156 -208 -259 -235 -166 -144 -214 -257 -254 -237 -221 -200 -180 -159 -139 -84
2116 -84 -29 -26 -23 -3 -74 -146 -126 -67 -8 10 29 45 61 2 -101 -169 -145 -129 -114 -114 -115 -161 -207 -165 -124 -158 -193 -244 -295 -269 -244 -203 -162 -168 -173 -231 -290 -354
2104 -354 -326 -235 -144 -93 -42 -72 -101 -131 -161 -158 -155 -46 63 42 21 6 -8 -126 -153 -93 -34 -54 -73 -93 -112 -123 -134 -145 -156 -150 -143 -136 -130 -123 -116 -110 -103 -72
2092 -72 -42 -17 7 76 53 5 -41 -98 -155 -105 -55 -41 -28 31 90 112 134 110 86 62 37 12 -12 5 23 -4 -32 -49 -66 -82 -99 -72 -45 -64 -83
2081 -83 -115 -146 -248 -349 -397 -353 -253 -154 -76 2 4 6 -35 -78 -13 50 52 55 57 59 74 88 57 26 55 83 15 38 71 103 96 89 47 5 -75 -157 -219 -190
$$ packed form
2140f0j3RJ0RJ0k5k5j9j9l6N5L0j6M6M5K4o7q8MN1Nk5K0pqj1j0j0j1K9K9K8K9qqn3n4rrrr
2127a76L1L1L4L4J4N9L9n1p2p2kkQQl3l2l2N9N4N3n4n4n2n1K4O9K2p0m3LJ7J6K1K0K1K0N5
2116h4N5LLK0p1p2K0N9N9J8J9J6J6n9j03o8K4J6J5%jm6m6M2M1l4l5n1n1K6K5M1M1onn8n9o4
2104c54K8R1R1N1N1l0k9l0l0LLJ09J09k1k1j5j4j18k7O0N9k0j9k0j9j1j1j1j1OPPOPPOPL1
2092g2L0K5K4O9k3m8m6n7n7N0N0J4J3N9N9K2K2k4k4k4k5k5k4J7J8k7k8j7j7j6j7K7K7j9j9
2081h3l2l1j02j01m8M4J00R9P8P8KKm1m3O5O3KLKKJ5J4l1l1K9K8o8K3L3L2ppm2m2q0q2o2K9
$$ [...]
-1510g8
##END=	
##END=	
