##TITLE=	May25-2021-lemw22.10.fid
LW179_recryst1

##JCAMP-DX=	6.0	$$ MestReNova 14.1.0-24037
##DATA TYPE=	LINK
##BLOCK_ID=	1
##BLOCKS=	1    
##ORIGIN=	Mestrelab Research S.L.
##OWNER=	hrzepa
##$MNOVA/LINK_BLOCK_TYPE=	ITEM	$$ NMR Spectrum
##$MNOVA/ITEM/POLYGON=	(XY..XY)
5321,5835
8722,5835
8722,8208
5321,8208
5321,5835
##$MNOVA/ITEM/Z=	0
##$MNOVA/ITEM/ANGLE=	0
##TITLE=	May25-2021-lemw22.10.fid
##JCAMP-DX=	6.0	$$ MestReNova 14.1.0-24037
##BLOCK_ID=	2
##DATA TYPE=	NMR SPECTRUM
##DATA CLASS=	XYDATA
##NUMDIM=	1
##ORIGIN=	Bruker BioSpin GmbH
##OWNER=	nmr
##.OBSERVE FREQUENCY=	400.15247108400001252
##.OBSERVE NUCLEUS=	^1H
##.SOLVENT NAME=	CDCl3
##.PULSE SEQUENCE=	zg30
##LONGDATE=	2021/05/25 11:30:55.000
##.ACQUISITIONMODE=	SIMULTANEOUS (DQD)
##$ORIGINAL FORMAT=	Bruker XWIN-NMR
##$MNOVA/SCALES_VERSION=	8
##$PARAMETER FILE=	(acqus, ASCII, /var/folders/f6/rjf_tdyn2v98c5c0wvkgn4s80000gq/T/h+wfZQPIToSW3WzKvY87WA/1H/acqus, 0)
$$ ##TITLE= Parameter file, TopSpin 4.1.1
$$ ##JCAMPDX= 5.0
$$ ##DATATYPE= Parameter Values
$$ ##NPOINTS= 8	$$ modification sequence number
$$ ##ORIGIN= Bruker BioSpin GmbH
$$ ##OWNER= nmr
$$ $$ 2021-05-25 11:30:49.866 +0100  nmr@chpc-nmr400a
$$ $$ D:/data/lemw22/nmr/May25-2021-lemw22/10/acqus
$$ $$ process C:\Bruker\TopSpin4.1.1\prog\mod\xwish3.exe
$$ ##$ACQT0= -1.70581753891579
$$ ##$AMP= (0..31)
$$ 100 100 100 100 100 100 100 100 100 100 100 100 100 100 100 100 100 100
$$ 100 100 100 100 100 100 100 100 100 100 100 100 100 100
$$ ##$AMPCOIL= (0..32)
$$ -1 0 0 0 0 0 0 0 0 0 0 0 0 0 0 0 0 0 0 0 0 0 0 0 0 0 0 0 0 0 0 0 0
$$ ##$AQSEQ= 0
$$ ##$AQ_mod= 3
$$ ##$AUNM= <au_zg>
$$ ##$AUTOPOS= <30 >
$$ ##$BF1= 400.15
$$ ##$BF2= 400.15
$$ ##$BF3= 400.15
$$ ##$BF4= 400.15
$$ ##$BF5= 400.15
$$ ##$BF6= 400.15
$$ ##$BF7= 400.15
$$ ##$BF8= 400.15
$$ ##$BWFAC= (0..63)
$$ 0 0 0 0 0 0 0 0 0 0 0 0 0 0 0 0 0 0 0 0 0 0 0 0 0 0 0 0 0 0 0 0 0 0 0 0
$$ 0 0 0 0 0 0 0 0 0 0 0 0 0 0 0 0 0 0 0 0 0 0 0 0 0 0 0 0
$$ ##$BYTORDA= 0
$$ ##$CHANFCU= (0..24)
$$ 0 0 1 0 0 0 0 0 0 0 0 0 0 0 0 0 0 0 0 0 0 0 0 0 0
$$ ##$CHANREC= (0..24)
$$ 0 0 0 0 0 0 0 0 0 0 0 0 0 0 0 0 0 0 0 0 0 0 0 0 0
$$ ##$CHEMSTR= <none>
$$ ##$CNST= (0..63)
$$ 1 1 145 1 1 1 1 1 1 1 1 1 1 1 1 1 1 1 1 1 1 1 1 1 1 1 1 1 1 1 1 1 1 1 1
$$ 1 1 1 1 1 1 1 1 1 1 1 1 1 1 1 1 1 1 1 1 1 1 1 1 1 1 1 1 1
$$ ##$CPDPRG= (0..8)
$$ <> <> <> <> <mlev> <mlev> <mlev> <mlev> <mlev>
$$ ##$D= (0..63)
$$ 0 0.1 0 0 0 0 0 0 0 0.06 0 0 0 0 0 0 0.0002 0 0 0 0 0 0 0 0 0 0 0 0 0 0
$$ 0 0 0 0 0 0 0 0 0 0 0 0 0 0 0 0 0 0 0 0 0 0 0 0 0 0 0 0 0 0 0 0 0
$$ ##$DATE= 1621938655
$$ ##$DATE_START= 1621938560
$$ ##$DE= 8.794183
$$ ##$DECBNUC= <off>
$$ ##$DECIM= 1680
$$ ##$DECNUC= <off>
$$ ##$DECSTAT= 4
$$ ##$DIGMOD= 3
$$ ##$DIGTYP= 17
$$ ##$DR= 32
$$ ##$DS= 0
$$ ##$DSPFIRM= 4
$$ ##$DSPFVS= 21
$$ ##$DTYPA= 2
$$ ##$EXP= <Proton.icon>
$$ ##$ExpStatus= 4
$$ ##$FCUCHAN= (0..9)
$$ 0 2 0 0 0 0 0 0 0 0
$$ ##$FILCOR= 0
$$ ##$FL1= 90
$$ ##$FL2= 90
$$ ##$FL3= 90
$$ ##$FL4= 90
$$ ##$FN_INDIRECT= (0..7)
$$ 0 0 0 0 0 0 0 0
$$ ##$FOV= 20
$$ [...]
$$ 1 1 1 1 0 0 0 0 0 0 0 0 0 0 0 0 0 0 0 0 0 0 0 0 0 0 0 0
$$ ##$ShimPowRng3= (0..63)
$$ 1 1 1 1 1 1 1 1 1 1 1 1 1 1 1 1 1 1 1 1 1 1 1 1 1 1 1 1 1 1 1 1 1 1 1 1
$$ 1 1 1 1 0 0 0 0 0 0 0 0 0 0 0 0 0 0 0 0 0 0 0 0 0 0 0 0
$$ ##$ShimPowType1= 8
$$ ##$ShimPowType2= 8
$$ ##$ShimPowType3= 0
$$ ##$ShimPowType4= 0
$$ ##$ShimPowType5= 0
$$ ##$ShimPowType6= 0
$$ ##$ShimPowType7= 0
$$ ##$ShimPowType8= 0
$$ ##$ShimSysActGrad= (0..63)
$$ 1 2 3 4 13 5 7 11 10 9 6 8 12 18 19 20 21 15 22 23 24 14 25 16 26 17 27
$$ 28 31 32 33 34 35 36 37 38 0 0 0 0 0 0 0 0 0 0 0 0 0 0 0 0 0 0 0 0 0 0
$$ 0 0 0 0 0 0
$$ ##$ShimSysAngle= <>
$$ ##$ShimSysFunc= (0..63)
$$ 1 2 3 4 5 6 7 8 9 10 0 37 38 35 16 15 14 13 12 11 28 27 26 25 24 23 36
$$ 22 30 29 20 21 34 33 32 31 17 18 19 0 0 0 0 0 0 0 0 0 0 0 0 0 0 0 0 0 0
$$ 0 0 0 0 0 0 0
$$ ##$ShimSysMatId= <292722aa.dat>
$$ ##$ShimSysMatrix= 1
$$ ##$ShimSysMinMaxUG= 130000
$$ ##$ShimSysOffset= <37mm>
$$ ##$ShimSysType= 4
$$ ##$ShimUnit= 3
$$ ##$SpectrOsVersion= <4.1.148.20201202>
$$ ##$TCubeEth= <192.168.180.22>
$$ ##$TCubeSeqDevice= <>
$$ ##$TOSITY= <no>
$$ ##$TRIPLO2= 0
$$ ##$TopSpinVersion= <TopSpin 4.1.1>
$$ ##$TrxFreqFormula= (0..23)
$$ <TrxFreqFormula(2.0,400150000.000000,'TRX',Trx(1.0,'TRX 1200.1',2,5.000000,1290.000000))>
$$ <TrxFreqFormula(2.0,400150000.000000,'TRX',Trx(1.0,'TRX 1200.2',2,5.000000,1290.000000))>
$$ <> <> <> <> <> <> <> <> <> <> <> <> <> <> <> <> <> <> <> <> <> <>
$$ ##$TrxPN= (0..23)
$$ <Z148391> <Z148391> <> <> <> <> <> <> <> <> <> <> <> <> <> <> <> <> <>
$$ <> <> <> <> <>
$$ ##$TrxSN= (0..23)
$$ <02953> <02954> <> <> <> <> <> <> <> <> <> <> <> <> <> <> <> <> <> <> <>
$$ <> <> <>
$$ ##$VCubeEth= (0..23)
$$ <no> <no> <no> <no> <no> <no> <no> <no> <no> <no> <no> <no> <no> <no> <no>
$$ <no> <no> <no> <no> <no> <no> <no> <no> <no>
$$ ##$VTU= 2
$$ ##$VTUETH= <192.168.99.11>
$$ ##$VTUTY= <no>
$$ ##$ValueLine= no
$$ ##$VpuPN= (0..23)
$$ <no> <no> <no> <no> <no> <no> <no> <no> <no> <no> <no> <no> <no> <no> <no>
$$ <no> <no> <no> <no> <no> <no> <no> <no> <no>
$$ ##$VpuSN= (0..23)
$$ <no> <no> <no> <no> <no> <no> <no> <no> <no> <no> <no> <no> <no> <no> <no>
$$ <no> <no> <no> <no> <no> <no> <no> <no> <no>
$$ ##$WBREFAM= (0..31)
$$ 142.7 107.1 100 100 100 100 100 100 100 100 100 100 100 100 100 100 100
$$ 100 100 100 100 100 100 100 100 100 100 100 100 100 100 100
$$ ##$WBREFLM= (0..31)
$$ 0 0 0 0 0 0 0 0 0 0 0 0 0 0 0 0 0 0 0 0 0 0 0 0 0 0 0 0 0 0 0 0
$$ ##$WBREFPH= (0..31)
$$ 72.61 -67.16 0 0 0 0 0 0 0 0 0 0 0 0 0 0 0 0 0 0 0 0 0 0 0 0 0 0 0 0 0
$$ 0
$$ ##$WBSGU= (0..31)
$$ 2 0 1 0 0 0 0 0 0 0 0 0 0 0 0 0 0 0 0 0 0 0 0 0 0 0 0 0 0 0 0 0
$$ ##END=
$$ 
##$DECIM=	1680
##$DSPFVS=	21
##XUNITS=	HZ
##YUNITS=	ARBITRARY UNITS
##FIRSTX=	8385.7641693909790774
##LASTX=	-3518.9977353709200543
##DELTAX=	-0.090826818325654784525
##XFACTOR=	1
##YFACTOR=	6.6741306343512523114
##FIRSTY=	1347.2781982421875
##MINY=	-1144.77197265625
##MAXY=	10472039
##NPOINTS=	131072
##XYDATA=	(X++(Y..Y))
$$ [...]
2383D13N3o5P9p3p4J02J01J02J01r7r8j06j07J29j6J56J1m9R5q3k26k3k4k4k4lJ41N2N1N7
$$ 413 466 401 480 407 333 435 536 638 739 642 544 438 331 460 444 600 611 562 657 574 348 325 301 277 253 250 391 443 494 551
2380E51q6J05J05m3j87K0J64Kj42J1J1O7p7k0j63k9K10P6P6j74l1m0j83K00N6K3K3j43R7q
$$ 551 465 570 675 632 445 465 629 631 489 500 511 578 501 481 318 289 499 575 651 477 446 406 223 423 479 502 525 382 479 471
2377D71j52m1K94J17k18m2m3M7M7O9p6NNN7N6M1M1j9k58m5R8O3p9JJ45KLj32J07M7r7j9J24
$$ 471 319 278 572 689 471 429 386 433 480 549 473 478 483 540 596 637 678 659 401 356 454 517 438 439 584 586 589 457 564 611 514 495 619
2374F19Q2o3p7p8n4J86o9o9K4K4j77l3o6o7O2O2P3P2O7p7J19j20q5N9J39nLk35l7l8L04l1
$$ 619 701 638 561 483 429 615 546 477 501 525 348 315 249 182 244 306 379 451 518 441 560 440 355 414 553 548 551 316 279 241 545 514
2371E14j7j6L5L4p1p0qqJ15k8M3M3K2j22j21K2%%q2O3J84M0J44r4mlNj38j63P6J60p9k23J12
$$ 514 497 481 516 550 479 409 401 393 508 480 523 566 588 466 345 367 367 367 285 348 532 572 716 622 618 615 620 482 319 395 555 476 253 365
2368C65j07J33L7L7n9n9j14K9O9O8j1j0r2N2J7J6J0J0Q3j57Q8Q9R7m6j66k2J7J8J1J2P5j63
$$ 365 258 391 428 465 406 347 233 262 331 399 388 378 286 338 355 371 381 391 474 317 405 494 591 545 379 357 374 392 403 415 490 327
2365C27N2N1j06L7J58J3j8j8K4K4J39j96q8N5o0n9k1J22k5j69QJ52J2J2J17k7j72O7MMKJ46
$$ 327 379 430 324 361 519 532 514 496 520 544 683 487 399 454 394 335 314 436 411 242 250 402 414 426 543 516 344 411 415 419 421 567
2362E67P5o9JKj60j6o5o4K21j16j08J31M8M7K3K4j30J5M9M9j3j57r2J48J24J25j05j04OPJ08
$$ 567 642 573 574 576 416 400 335 271 492 376 268 399 447 494 517 541 411 426 475 524 511 354 262 410 534 659 554 450 456 463 571
2359E71l5p5p4M8M9l8l8J06j32R2n2k6J18n3n3Q0o4l9m0k0K20l5l4j3j2j02M2K9j15J90J91
$$ 571 536 461 387 435 484 446 408 514 382 474 422 396 514 461 408 488 424 385 345 325 545 510 476 463 451 349 391 420 305 495 686
2357F86OPk7k66l4l4J66p3j00M3l7l8p6J63J9J9J01m2j59J77Q1o3N7q6j14L1k1J23k9k8nm
$$ 686 692 699 672 406 372 338 504 431 331 374 337 299 223 386 405 424 525 483 324 501 582 519 576 490 376 407 386 509 480 452 447 443
2354D43r0J49OOJ00m4k3J21j80J55j5j59J1J2J2J1k14p1R7m6k6k6J9J8K68k0p4p4J44J45p1
$$ 443 353 502 508 514 614 570 547 668 488 643 628 469 480 492 504 515 301 230 327 281 255 229 248 266 534 514 440 366 510 655 584
2351E84p1n8n8J5J4j5j5j5j5ooooQ8Q7K5k63J67K3J4J5r4r3K6K6M0M0O7p7o9K18M8M8j37j38
$$ 584 513 455 397 412 426 411 396 381 366 360 354 348 342 430 517 542 279 446 469 483 498 404 311 337 363 403 443 510 433 364 582 630 678 541 403
2348D03J53j35o0Q4j5j5j0rrro0n9O0O0k5k5ppj33J54Q3o1k8J15K6j18J34j0n7n7l9m0Q1Q0
$$ 403 556 421 361 445 430 415 405 396 387 378 318 259 319 379 354 329 322 315 182 336 419 358 330 445 471 353 487 477 420 363 324 284 365 445
2345D45N3N3O4k22j17J71P2p1O0O0l9l8J57j30m0m0RQo3o3J2J2J31J32o7o6NNnnj67J20K9
$$ 445 498 551 615 393 276 447 519 448 508 568 529 491 648 518 478 438 447 455 392 329 341 353 484 616 549 483 488 493 488 483 316 436 465
2342D65L0l4l4N2r3j19J69K14p2j0j53o7K21j17j17L8L9l3l4M4M4Q9n5mnmnj1J33J77o2l9
$$ 465 495 461 427 479 386 267 436 650 578 568 415 348 569 452 335 373 412 379 345 389 433 522 467 463 458 454 449 438 571 748 686 647
2339F47j82p8O6LLJ02m2k8J16j27J8%%r9J41J33j0j77j78M8M7M8M7%%RQj29J3o6o7P9Q0J30
$$ 647 465 387 453 456 459 561 519 491 607 480 498 498 498 399 540 673 663 486 308 356 403 451 498 498 498 507 515 386 399 333 266 345 425 555
2336E55J30k75l7O2q1Q9j50NJ50J55J1L5k04j59Q0J22k2J03m0N5q9j00J40L2j12J14l0q4O1
$$ 555 685 410 373 435 354 443 293 298 448 603 614 649 445 286 366 488 466 569 529 584 495 395 535 567 455 569 539 455 516
2333E16K2j20M0M1p1p0K8K8K03j31j92m8P7P6P0P1J26j13r8r8l0l1n4Q9L6k04J08J08N9N8
$$ 516 538 418 458 499 428 358 386 414 617 486 294 246 323 399 469 540 666 553 455 357 327 296 242 331 367 163 271 379 438 496
2330D96q5J54Mj40M3M3k25J5L8L9J8j25J33J32n3R0j01j01j01M3M3M3m4J01pqj6J28k5k5m2
$$ 496 411 565 569 429 472 515 290 305 343 382 400 275 408 540 487 577 476 375 274 317 360 403 359 460 453 445 429 557 532 507 465
2328D65m2k7k7k9K10k3k3K08k23l5J10qj50o1Q2j44%Q6Q7J20k3J26k09k3k4j4J29J0j34n3
$$ 465 423 396 369 340 550 527 504 712 489 454 564 556 406 345 427 283 283 369 456 576 553 679 470 447 423 409 538 548 414 361
2325C61R1l2l2M9M9m5m4L7L6j84l9jjJ07J06Q6Q6J43j93j3j2P6o6r1r1l2K07Q1o2jjq2q1M2
$$ 361 452 420 388 437 486 441 397 434 470 286 247 246 245 352 458 544 630 773 580 567 555 631 565 474 383 351 558 639 577 576 575 493 412 454
2322D54M3m8R7J08l6N4q9j3j57KKj65P4J41mj41j41P2K15J08l5j52Q7J9J9m8m7o5k09M0L9
$$ 454 497 449 546 654 618 672 583 570 413 415 417 252 326 467 463 322 181 253 468 576 541 389 476 495 514 466 419 354 145 185 224
2319B24P6P5j1j1J40r8R9j40R0R0l6l5j06L9P7P7O9O8k31J05j51pmnR8m6K6K6R9m4r8J41K8
$$ 224 300 375 364 353 493 395 494 354 444 534 498 463 357 396 473 550 619 687 456 561 410 403 399 394 492 446 472 498 597 553 455 596 624
2316F24K8j73O7P1p3%j44m0K00j44jP9P8L4j11Q2j58k4k3n0R3klJ01j39j23J15j49R1l9J06
$$ 624 652 479 546 617 544 544 400 360 560 416 415 494 572 606 495 577 419 395 372 322 415 413 410 511 372 249 364 215 306 267 373
2313C73m6m6J64K0MNp7p6L2L1K2K3P6o7J48r1L0L0K3j19K5K6L2L1j13J26N4j86j8j9m2J01
$$ 373 327 281 445 465 469 474 397 321 353 384 406 429 505 438 586 495 525 555 578 459 484 510 542 573 460 586 640 454 436 417 375 476
2310D76J6J6k6k6j44J92q7N7O7p6J75L1j50qJ4J4K7j16n3R0N8q6Q5n9L3L2n7n7%j44K4J68
$$ 476 492 508 482 456 312 504 417 474 541 465 640 671 521 513 527 541 568 452 399 489 547 461 546 487 520 552 495 438 438 294 318 486
2307D86n6n5J06J06R3j48r3N0K9K9n8Q7J34j05j13L0k1k1O9p5r6r5J11J11KJp0p0k1k2R0Q9
$$ 486 430 375 481 587 680 532 439 489 518 547 489 576 710 605 492 522 501 480 549 474 378 283 394 505 507 508 438 368 347 325 415 504
2304E04R8m5O5j74j8K21o6l05J71K9J3J57lkk26q3r2J47n9Q5N0N1j3j2J0J0J0J0j2j2j2j2
$$ 504 602 557 622 448 430 651 585 280 451 480 493 650 647 645 419 336 244 391 332 417 467 518 505 493 503 513 523 533 521 509 497 485
2301D85l8l7l8l7R2R3k7k6j1j0O1O2o0o0O0O0j08j07M5M5J95m4p7p6J2J3J3J3k1k2k1k2J36
$$ 485 447 410 372 335 427 520 493 467 456 446 507 569 509 449 509 569 461 354 399 444 639 595 518 442 454 467 480 493 472 450 429 407 543
2298E43J35p9q0KLLKk7k7m2J97l4l4j9j9J1J1J1J1o1o2J0J1llp5p5L5L5J16J16n6Q7k54Q2
$$ 543 678 599 519 521 524 527 529 502 475 433 630 596 562 543 524 535 546 557 568 507 445 455 466 463 460 385 310 345 380 496 612 556 643 389 471
2295D71J1J1L2L2m0l9k29J07O2O1J0J1l6l6j05K30k3k3P0k17K21o6m2m3j3j3j3j3j3j3J66
$$ 471 482 493 525 557 517 478 249 356 418 479 489 500 464 428 323 553 530 507 577 360 581 515 473 430 417 404 391 378 365 352 518
2292E18j21j05J82o9p0J03J03JJj54J33j48j48R5R4k5k6O0O0j73J13L6L6k27O0L9L9j4j5m0
$$ 518 397 292 474 405 335 438 541 542 543 389 522 374 226 321 415 390 364 424 484 311 424 460 496 269 329 368 407 393 378 338
2290C38m0L2L1K0K0K0K0k0k1N2N1M7M7k4k5m8m9K3K4R1R2p6p6q8q8j6j6R7R8M3M3j87J01J0
$$ 338 298 330 361 381 401 421 441 421 400 452 503 550 597 573 548 500 451 474 498 589 681 605 529 441 353 337 321 418 516 559 602 415 516 526
2287E26J1L8L9q1q1K7K7m5m5O5O4ppq8q8L2L1K8K8r1r2J30J30q6q6L3L2m0m0J8J7J7J7J7J6
$$ 526 537 575 614 533 452 479 506 461 416 481 545 538 531 443 355 387 418 446 474 383 291 421 551 465 379 412 444 404 364 382 399 416 433 450 466
2283D66j64J24J83j06j76J10J56j31L0L1P5k12l5l6M1K80j19j18n3n4J05J04Q1o4K6j17J0
$$ 466 302 426 609 503 327 437 593 462 492 523 598 386 351 315 356 636 517 399 346 292 397 501 582 518 544 427 437
2281D37J0K1K2j90J45J63p7l9l9o9o9J47r3r3J46L4L5N8N8j24J9q6J54J2j32M5M5j54j0Q6
$$ 437 447 468 490 300 445 608 531 492 453 384 315 462 369 276 422 456 491 549 607 483 502 416 570 582 450 495 540 386 376 462
2278D62Q6j10L3m7m8N1N0N9q5p7p7J30J29o7o7k8J16OOJ6J5j3j3p6p5j0J34N2N3r4r4O8p6
$$ 462 548 438 471 424 376 427 477 536 451 374 297 427 556 489 422 394 510 516 522 538 553 540 527 451 376 366 500 552 605 511 417 485 409
2275D09n4R0J29J29j29J6p5O9j21j21k5J19m3m3j14K9M1M1M1M1Q3o1J02J01j63j8J1J1M3j01
$$ 409 355 445 574 703 574 590 515 584 463 342 317 436 393 350 236 265 306 347 388 429 512 451 553 654 491 473 484 495 538 437
2273D37ooj05J33jj44O0q4O9O9r5M8m7m8J41r9L5L6n1n1o0Q4N3N4q8q7n6K31P0O9J8J8k63
$$ 437 431 425 320 453 452 308 368 284 353 422 327 375 328 280 421 322 357 393 342 291 231 315 368 422 334 247 191 422 492 561 579 597 334
2270C34K4M7M6n5n5K5K5m6m7K4K4K4K4n6n5O4O4R1R2p7p6OPOPrqrqJ7J8n4n4O4O4qqJ5J5n6
$$ 334 358 405 451 396 341 366 391 345 298 322 346 370 394 338 283 347 411 502 594 517 441 447 454 460 467 458 450 441 433 450 468 414 360 424 488 480 472 487 502 446
2266D46n7k7k7R3R3o0o0O0O0j30j30J33J34J8J8J8J8j23j22llP0P1r2J97l6l6j8j8J9J8J9
$$ 446 389 362 335 428 521 461 401 461 521 391 261 394 528 546 564 582 600 477 355 352 349 419 490 398 595 559 523 505 487 506 524 543
2263E43J9k5k5j86J01n5n5L5L5K5K5K4K5J5J4J5J5p5p5lljjJ01J01l42J37L5L5p7p7R0R0J3
$$ 543 562 537 512 326 427 372 317 352 387 412 437 461 486 501 515 530 545 470 395 392 389 388 387 488 589 247 384 419 454 377 300 390 480 493
2260D93J2j07j08P7P7J19j69m1m2K8K7j22J18j7j6M4M5L5L6Q5n8n9Q6k9k8N2N2j51j51J13
$$ 493 505 398 290 367 444 563 394 353 311 339 366 244 362 345 329 373 418 453 489 574 516 457 543 514 486 538 590 439 288 401
2257D01J12o4o4N5N5l1l2J75o5o1o2J0J0j09J30J15J15j9j8rrj44jP2p2J13J14o3o4m8m8m9
$$ 401 513 449 385 440 495 464 432 607 542 481 419 429 439 330 460 575 690 671 653 644 635 491 490 562 490 603 717 654 590 542 494 445
2254D45m8o8o8N2N2M6M5J6j28j0J34J79o1k8k9j21J18P8j62j2j2J3J4Q4n8R4n0j25j24n2K84
$$ 445 397 329 261 313 365 411 456 472 344 334 468 647 586 558 529 408 526 604 442 430 418 431 445 529 471 565 515 390 266 214 498
2252D98K4k16j7J27L1L1L1L1j22K1k9k9J89M6q0O4k6k5l4l3K4K3k5k64J34J34j3j2N9N9j07
$$ 498 522 306 289 416 447 478 509 540 418 439 410 381 570 616 536 600 574 549 515 482 506 529 504 240 374 508 495 483 542 601 494
2249D94j08J95m4l0l0n3n4J12l1M9M9k2k1j02M1OOp4p5J95r3o6P8j09J78K6K5j8j8j07J79
$$ 494 386 581 537 507 477 424 370 482 451 500 549 527 506 404 445 451 457 383 308 503 410 344 422 313 491 517 542 524 506 399 578
2246E78qrq1q0K15p1J8J8K0J9n2n2J7J6j03j03m6m7P3P4K2K2P3k14m0J02P6P6k6k6R4R4j10
$$ 578 570 561 480 400 615 544 562 580 600 619 567 515 532 548 445 342 296 249 322 396 418 440 513 299 259 361 437 513 487 461 555 649 539
2243E39j09l7l8l0l0J41j47k7J16K42m6m8j92Q9n4r9J88J8J8K5K5K5K5l8l9l8l9NNJ85j03
$$ 539 430 393 355 325 295 436 289 262 378 620 574 526 334 423 369 270 458 476 494 519 544 569 594 556 517 479 440 445 450 635 532
2240E32j87J00J94r5J6j29R6m8m0J04n8n8mmmmL5L6J7J8J40j47Q6n7M9r4k3k2l0l0M1M2K0
$$ 532 345 445 639 544 560 431 527 479 439 543 485 427 423 419 415 411 446 482 499 517 657 510 596 539 588 494 471 449 419 389 430 472 492
2237D92K0K1K0jjjjk4k5M7M7l1l1l0l1P4P5m5m5k0j9Mj39p9J60K09l1M1j98j33J07j30J3O8
$$ 492 512 533 553 552 551 550 549 525 500 547 594 563 532 502 471 545 620 575 530 510 491 495 356 277 437 646 615 656 458 325 432 302 315 383
2234C83O8J2J2o0n9K3K3K11j24LKN3N2j4j5J%j37J02m2m1J24j9n8n8j1j2r2r3J93N0j18K5
$$ 383 451 463 475 415 356 379 402 613 489 492 494 547 599 585 570 571 571 434 536 494 453 577 558 500 442 431 419 327 234 427 477 359 384
2231C84l4l5R4R5l3l2lJ41%j43j16J23J02J02j79l6j8j7P2p2J5J5J40r8J2J1j2J32o4o5q5
$$ 384 350 315 409 504 471 439 436 577 577 434 318 441 543 645 466 430 412 395 467 395 410 425 565 467 479 490 478 610 546 481 396
2228C96J54Q4j56o0J80r7M8j9j9o8o8N2N1l6l5K7K7J24j9p3p3J21j19J07l8n7Q7J40r9r9M5
$$ 396 550 634 478 418 598 501 549 530 511 443 375 427 478 442 407 434 461 585 566 493 420 541 422 529 491 434 521 661 562 463 508
2225E08K1j22J05l9M2j02k7k7R3R3n7Q6NNm5m6j0rJ2J3n9n9RQJ25j8q8q8J19J19K2K3m9m9
$$ 508 529 407 512 473 515 413 386 359 452 545 488 574 579 584 539 493 483 474 486 499 440 381 390 398 523 505 417 329 448 567 589 612 563 514
2222E14M8M9M8M8j75j75M0M1O6O6j35RN2N1j24J8j04J35J25j7k6k5R4R5j79l5M6r8p9O4k6
$$ 514 562 611 659 707 532 357 397 438 504 570 435 444 496 547 423 441 337 472 597 580 554 529 623 718 539 504 550 452 373 437 411
2219D11k5N3N4O3q1k2k1p8J61j80N9J1J2k5k6J91J90j26j26n5n4m3m3P4p0Q9Q8m1m0P4P5L
$$ 411 386 439 493 556 475 453 432 354 515 335 394 405 417 392 366 557 747 621 495 440 386 343 300 374 304 393 481 440 400 474 549 552
2217E52Lq1q1m2J01N1N0j68P1J73j63o7J72l1j76q8N5LKK26j08J15k9O7O7%%k00n6M8M9o0
$$ 552 555 474 393 351 452 503 553 385 456 629 466 399 571 540 364 276 331 334 336 562 454 569 540 607 674 674 674 474 418 466 515 455
2214D55Q5O4O4j03j04J09l5j7j7j2J32o8o9N7N6K1K0j1j2j02J86J1J1k05Q3N3N2p9p9j79J07
$$ 455 540 604 668 565 461 570 535 518 501 489 621 553 484 541 597 618 638 627 615 513 699 710 721 516 599 652 704 625 546 367 474
2211D74J14J14m1m0P9P9q4q4P7k10JKN5N4p1p1J9J9j33J55poj5j5N7N6j14j14NNR1R0l5K52
$$ 474 588 702 661 621 700 779 695 611 688 478 479 481 536 590 519 448 467 486 353 508 501 495 480 465 522 578 464 350 355 360 451 541 506 758
2208G58lln7n7J3J4j07j07K2K2K3K2k2k2k2k1k7k6k6k7P8P7ONJ0J0k6k5rro2o3K19o9K2K1
$$ 758 755 752 695 638 651 665 558 451 473 495 518 540 518 496 474 453 426 400 374 347 425 502 508 513 523 533 507 482 473 464 402 339 558 489 511 532
2204E32M8M9k3k3p2p2%%K8K8qpOPOPO0O0j08j07k4k4O6O6j14J72J1J2PPk9k8K3K3m9m9l6l6
$$ 532 580 629 606 583 511 439 439 439 467 495 487 480 486 493 499 506 566 626 518 411 387 363 429 495 381 553 564 576 583 590 561 533 556 579 530 481 445 409
2201D09Q4Q3l1l1M9r4M0M1L1L2n7n7%%R8j42K08K08j30j29n2R2J02m3k5k4n9n9N1N2J54Rj01
$$ 409 493 576 545 514 563 469 509 550 581 613 556 499 499 499 597 455 663 871 741 612 560 652 754 711 686 662 603 544 595 647 801 810 709
2198G09M3N3J97Nj39r2J47Q4n9QQP1P1J07J07M4K83J66J67J81J81L30L29J62J62L13L14K33
$$ 709 752 805 1002 1007 868 776 923 1007 948 956 964 1035 1106 1213 1320 1364 1647 1813 1980 2161 2342 2672 3001 3163 3325 3638 3952 4185
2195D185K33J50Pj27J6q1l20j86j85k71m14k38r4l06j63j24j24r0k33o6o6j96M4kj45j63k0
$$ 4185 4418 4568 4575 4448 4464 4383 4063 3877 3692 3421 3007 2769 2675 2369 2206 2082 1958 1868 1635 1569 1503 1307 1351 1349 1204 1041 1021
2193A021mnP2j68j14K9m0m1k3k3q0O4qql0J13j20K4j3j2P7o6n3n3l8J06J67p3q1O2l5l5k30
$$ 1021 1017 1012 1084 916 802 831 791 750 727 704 624 688 680 672 642 755 635 659 646 634 711 645 592 539 501 607 774 701 620 682 647 612 382
2190C82J06J78o2K2K2p8p8ooQ8Q9l1l1K2K3o7o7R4j94Q8Q8J19J19r6r6jkjjK6K5m6m6N4N4
$$ 382 488 666 604 626 648 570 492 486 480 568 657 626 595 617 640 573 506 600 406 494 582 701 820 724 628 627 625 624 623 649 674 628 582 636 690
2187F90N4N3j15j15m4m3N9N9N3k34J9J8JJP5P5m4m5k0k1k1k0J01J01r6r6k0K67j09j10n2n2
$$ 690 744 797 682 567 523 480 539 598 651 417 436 454 455 456 531 606 562 517 497 476 455 435 536 637 541 445 425 692 583 473 421 369
2184C69J63J64m2m2m1m2k3k4R7R6q2q1L8L7r0r0K39m9K7K6QRk3k3j85J02l0l1J49j38Q3Q3
$$ 369 532 696 654 612 571 529 506 482 579 675 593 512 550 587 497 407 646 597 624 650 658 667 644 621 436 538 508 477 626 488 571 654
2181F54n5n5N4N4o5o5P9Q0k3k2j18J69o4o4J14J13j31j32p9K08M7M6j28j28n6n6J07J06j74
$$ 654 599 544 598 652 587 522 601 681 658 636 518 687 623 559 673 786 655 523 444 652 699 745 617 489 433 377 484 590 416
2178D16J13k1k0O9P0qrk3k3P5j64k9l0P0O9P0O9mnj3j4O7p6o7J72k3j66m0J03P4p0j5j6M1
$$ 416 529 508 488 557 627 619 610 587 564 639 475 446 416 486 555 625 694 690 685 672 658 725 649 582 754 731 565 525 628 702 632 617 601 642
2175F42M1p8p9J30J31k3k2j14J27L0J75K7K8j31j32J3J3Q4Q4r5r6o0o0m7m7K5K5J01J01o6
$$ 642 683 605 526 656 787 764 742 628 755 785 960 987 1015 884 752 765 778 862 946 851 755 695 635 588 541 566 591 692 793 727
2173G27o7K3K2M3M4k3k62M0M0JJL7L7O3O3rqj7j7q8q9k2k3M9M9R2R2k8k8N3N2k0k0KJk0j9
$$ 727 660 683 705 748 792 769 507 547 587 588 589 626 663 726 789 780 772 755 738 650 561 539 516 565 614 706 798 770 742 795 847 827 807 809 810 790 771
2169G71j10J30J12l1n2n2J1J1Q2Q2Q2Q2L6L7l6l5N7N8N7N7P7P8K44K45J06J05K74K73L81L82
$$ 771 661 791 903 872 820 768 779 790 872 954 1036 1118 1154 1191 1155 1120 1177 1235 1292 1349 1426 1504 1748 1993 2099 2204 2478 2751 3132 3514
2166C514N02N01O07O07Q22Q23P10P09P37P37N74M31K66k2j06j07l22o10p01p02p91p91o14
$$ 3514 4016 4517 5124 5731 6553 7376 8086 8795 9532 10269 10843 11274 11540 11518 11412 11305 10983 10373 9672 8970 8179 7388 6774
2164F774o15p40m52n37n38l99m00k25k25k97k97r9j00j71j71M4M3j81J07j09L5j00j00m4m4
$$ 6774 6159 5419 4967 4430 3892 3493 3093 2868 2643 2346 2049 1950 1850 1679 1508 1552 1595 1414 1521 1412 1447 1347 1247 1203 1159
2162A159K8K8j1j1q3q3L9L9j86J02j76l3K2j22O8O9O0N9ooooJ02J02r5J92J60J60M41M41N17
$$ 1159 1187 1215 1204 1193 1110 1027 1066 1105 919 1021 845 812 834 712 780 849 909 968 962 956 950 944 1046 1148 1053 1245 1405 1565 2006 2447 2964
2159B964N16N17N17O05O05L24L24K81oj31k75n24o67n09l65m37m38k58m02l71q5j83j83j07
$$ 2964 3480 3997 4514 5119 5724 6048 6372 6653 6647 6516 6241 5717 5050 4541 4176 3739 3301 3043 2641 2270 2185 2002 1819 1712
2157A712j07J3J2R1R0k9k9k0k0j09j09O9k18k0k0q2q2PQk19O8K4j21k5k5J00m3k05Q3J12l1
$$ 1712 1605 1618 1630 1721 1811 1782 1753 1733 1713 1604 1495 1564 1346 1326 1306 1224 1142 1149 1157 938 1006 1030 909 884 859 959 916 711 794 906 875
2154H75n5n4J7K57p1p1m7m7j31J2J38j02J6J5q1O3k4k4O6O5j54j1P6P6K3K3m8m9RJ0RJ0p4
$$ 875 820 766 783 1040 969 898 851 804 673 685 823 721 737 752 671 734 710 686 752 817 663 652 728 804 827 850 802 753 762 772 781 791 717
2151G17p5J96m5j83N6J21J22j35j35Q9Q9j56j3K7K6j5j4j35j34K23K23p3p3j24J16O2q2K0
$$ 717 642 838 793 610 666 787 909 774 639 728 817 661 648 675 701 686 672 537 403 626 849 776 703 579 695 757 675 695
2149F95K0K0K0K8J72J20k14n9Q4k6k6m1j84m1m1J83M0M0J84j09j10O2q2q2O1l7l7O6p8O0O0
$$ 695 715 735 755 783 955 1075 861 802 886 860 834 793 609 568 527 710 750 790 974 865 755 817 735 653 714 677 640 706 628 688 748
2146G48Q6j54k8k9N7q7ooJ16J17j3j2N7q7k4J19J03m1j60j7K9j16N5q8j%p2J68P0P0q3q2M0
$$ 748 834 680 652 623 680 593 587 581 697 814 801 789 846 759 735 854 957 916 756 739 768 652 707 619 618 618 546 714 784 854 771 689 729
2143G29M0q9q8J59J6j05M0o7o7K3K3pJ38M7M8J5j29R5j44k8J16K9j15O0O0l5l6J08j31oJ38
$$ 729 769 680 592 751 767 662 702 635 568 591 614 607 745 792 840 855 726 821 677 649 765 794 679 739 799 764 728 836 705 699 837
2140H37j10j10J47LQ1Q0j5j5J18j21L4L4k23J11J86n3j33J1J25j9rJ35l3j77OJ50n1n1p0P3
$$ 837 727 617 764 767 848 928 913 898 1016 895 929 963 740 851 1037 984 851 862 987 968 959 1094 1061 884 890 1040 989 938 868 941
2137I41N5N6Q5n9k91J39m7m7M3M2J15k9N2N2k5k4k5k4K5K5J5J6mj49J48J48j21j22J01j40
$$ 941 996 1052 1137 1078 787 926 879 832 875 917 1032 1003 1055 1107 1082 1058 1033 1009 1034 1059 1074 1090 1086 937 1085 1233 1112 990 1091 951
2135I51o4J76K6K6O2O2j48mN9q5p6O8k1k0q4O1n6Q8JJJ21j19j27J6r2N2J47J48l8l8R1R0j26
$$ 951 887 1063 1089 1115 1177 1239 1091 1087 1146 1061 985 1053 1032 1012 928 989 933 1021 1022 1023 1144 1025 898 914 822 874 1021 1169 1131 1093 1184 1274 1148
2132A148J8J92m8n0n0N6N5k4k3j04L9R4R3l2l3J01j38lmM3M3k9J14n8Q6J4J4m0m0J60J7q0
$$ 1148 1166 1358 1310 1260 1210 1266 1321 1297 1274 1170 1209 1303 1396 1364 1331 1432 1294 1291 1287 1330 1373 1344 1458 1400 1486 1500 1514 1474 1434 1594 1611 1531
2129A531q1L24j2j12L2Q9Q9L4j08j9j9l1J12M1j02K1K1K8K7j42R8K33pk00M0J69J69j50R0
$$ 1531 1450 1774 1762 1650 1682 1771 1860 1894 1786 1767 1748 1717 1829 1870 1768 1789 1810 1838 1865 1723 1821 2054 2047 1847 1887 2056 2225 2075 2165
2126B165pJ38L9M0N7N7j15K9R2j48l5J08J92j43J16k8m9m8P3p0j93J43J01j37o3Q1M1M1N0
$$ 2165 2158 2296 2335 2375 2432 2489 2374 2403 2495 2347 2312 2420 2612 2469 2585 2557 2508 2460 2533 2463 2270 2413 2514 2377 2314 2395 2436 2477 2527
2124B527M9k2k2k2J22NJ49K0K0N6K96Q3o1K8J72J9J9r8M6K52J09J05l8l8l8J44J43J67p3P0
$$ 2527 2576 2554 2532 2510 2632 2637 2786 2806 2826 2882 3178 3261 3200 3228 3400 3419 3438 3340 3386 3638 3747 3852 3814 3776 3738 3882 4025 4192 4119 4189
2121D189K14L7J81J41J42m9R3J66J66K55J12J24J24k0K20N6N6J91J91K44K45K63K62K4L10
$$ 4189 4403 4440 4621 4762 4904 4855 4948 5114 5280 5535 5647 5771 5895 5875 6095 6151 6207 6398 6589 6833 7078 7341 7603 7627 7937
2119G937L46L47L24L7M13M14M34M34N06N06N72N71O92O91R08R09Q18J106J172J172J244J531
$$ 7937 8283 8630 8954 8991 9404 9818 10252 10686 11192 11698 12270 12841 13533 14224 15132 16041 16859 17965 19137 20309 21553 23084
2117B3084J444J445J726J726J633J633J705J705J842J843K202K201K340K339K831L117L399
$$ 23084 24528 25973 27699 29425 31058 32691 34396 36101 37943 39786 41988 44189 46529 48868 51699 54816 58215
2115E8215M261M871N733O979Q606J0235J2630J5363J8908K3505K9347L5854M3230N1263N8637
$$ 58215 62476 67347 73080 80059 88665 98900 111530 126893 145801 169306 198653 234507 277737 329000 387637
2114C87637O4781O8516O9977O8539O4871N8261M8684L4987J8310j76j8434l4811m7204n5153
$$ 387637 452418 520934 590911 659450 724321 782582 831266 866253 884563 884387 865953 831142 783938 728785
2112G28785o0038o2049o1305n9102n5798n1870m7220m2526l8061l3559k8964k4655k0655j7112
$$ 728785 668747 606698 545393 486291 430493 378623 331403 288877 250816 217257 188293 163638 142983 125871
2111A25871j3993j1407r312p684o397n536m565m087l510l221k821k534k545k546k246k246
$$ 125871 111878 100471 91159 83475 77078 71542 66977 62890 59380 56159 53338 50804 48259 45713 43467 41221
2110D1221k297k010j955j956k061k061j684j971j506j505j524j524j239j239j155q68p94j082
$$ 41221 38924 36914 34959 33003 30942 28881 27197 25226 23720 22215 20691 19167 17928 16689 15534 14666 13872 12790
2108A2790n22n22o21k87k77n16k76m19k33k34j62j61j46j47j81N9n8k02m1J02J33J33K67K67
$$ 12790 12268 11746 11125 10838 10561 10045 9769 9350 9117 8883 8721 8560 8414 8267 8086 8145 8087 7885 7844 7946 8079 8212 8479 8746
2106H746M05P41P62J002J122J361J416J559J684J541J550J406J202P72K51J1o95q39j125j269
$$ 8746 9151 9892 10654 11656 12778 14139 15555 17114 18798 20339 21889 23295 24497 25269 25520 25531 24836 23997 22872 21603
2104B1603j556j557j568j568j542j206j135j136r85p47q06q06o09m65l38l39k09k10j28j27
$$ 21603 20047 18490 16922 15354 13812 12606 11471 10335 9350 8603 7797 6991 6382 5917 5579 5240 5031 4821 4693 4566
2102D566l67k23j71k6r9r8j90j89l7j81m6m6k02k01k35J01pj51j36j36j36j35N4J98r9r8l9
$$ 4566 4199 3976 3805 3779 3680 3582 3392 3203 3166 2985 2939 2893 2691 2490 2255 2356 2349 2198 2062 1926 1790 1655 1709 1907 1808 1710 1671
2100A671m0N7q7j20J19j05L8O2O2j6j6Q6j53j9j9N0N0p0p0l7l7n1J87o3o4m8m8j4j5J87M3
$$ 1671 1631 1688 1601 1481 1600 1495 1533 1595 1657 1641 1625 1711 1558 1539 1520 1570 1620 1550 1480 1443 1406 1355 1542 1479 1415 1367 1319 1305 1290 1477 1520
2097A520l3l2J74J74j14j15l7J07O4q1n0R4k06J29J38j96J70J70j68P1K33oJ52J52M6J90K34
$$ 1520 1487 1455 1629 1803 1689 1574 1537 1644 1708 1627 1577 1671 1465 1594 1732 1536 1706 1876 1708 1779 2012 2006 2158 2310 2356 2546 2780
2094B780L78L71K27L74L73O07L68M31M30K39K39M55K15J36K81J13J13M36M36M36M36L86L85
$$ 2780 3158 3529 3756 4130 4503 5110 5478 5909 6339 6578 6817 7272 7487 7623 7904 8017 8130 8566 9002 9438 9874 10260 10645
2092A0645L64L64K90m6m71o14r36r36q25q25q31q31o63m24m12n54m75k34j95j94q3k28k48
$$ 10645 11009 11373 11663 11617 11146 10532 9596 8660 7835 7010 6179 5348 4685 4261 3849 3295 2820 2586 2391 2197 2114 1886 1638
2090A638ql3l2j05j04O3q0j51Q8j36Pl1l2N9q6O4O3l3j76R8R7j74l1J42r7j61Q0J6J7q9q8
$$ 1638 1630 1597 1565 1460 1356 1419 1339 1188 1276 1140 1147 1116 1084 1143 1057 1121 1184 1151 975 1073 1170 996 965 1107 1010 849 929 945 962 873 785
2087G85Q7Q6q1q1J0J0J9K0j44jrrM0M0K29j07l3l2L6j08j20K4R3R3K8j15K8K8O9p5p6O9J02
$$ 785 872 958 877 796 806 816 835 855 711 710 701 692 732 772 1001 894 861 829 865 757 637 661 754 847 875 760 788 816 885 810 734 803 905
2084I05J03o6o5j1j55L6L7J24j9l5J10P9j60J73j63n8n8J27j11K4K4J%Kj42q2q2K61p5L7j08
$$ 905 1008 942 877 866 711 747 784 908 889 854 964 1043 883 1056 893 835 777 904 793 817 841 842 842 844 702 620 538 799 724 761 653
2082F53l7J06o4P9L4L4n5n6j41J94j38J02O5p8QRJ61J8J7k22m4m3J41jo5o4N5N6j51qJ27j6
$$ 653 616 722 658 737 771 805 750 694 553 747 609 711 776 698 706 715 876 894 911 689 645 602 743 742 677 613 668 724 573 565 692 676
2079F76j02J38j16j16jJ42O2O2q5q4J23j18K3K2P0P0L1j12m6J93RRn7n7M5r8llr4J45o1o2
$$ 676 574 712 596 480 479 621 683 745 660 576 699 581 604 626 696 766 797 685 639 832 841 850 793 736 781 683 680 677 583 728 667 605
2076F05J53J53o3o2J6J7K3k17P4p0mmk5k5N6q7J6J7j0J33Kj42j00J39j34J05J74j61J7J7N
$$ 605 758 911 848 786 802 819 842 625 699 629 625 621 596 571 627 540 556 573 563 696 698 556 456 595 461 566 740 579 596 613 618
2073F18Nq3O1O1q3q8q7J13l1j1J31m7R5O0q3p5O9l3l3M8M8o9o9l9J05O3q1RRn2n3J15k8j63
$$ 618 623 540 601 662 579 491 404 517 486 475 606 559 654 714 631 556 625 592 559 607 655 586 517 478 583 646 565 574 583 531 478 593 565 402
2070D02P7L8L8J35j04j79l6P8o6j10J29P0P0M7r7j6j5N6N6L7J81k03L7k7k7q4N9l4J09J09
$$ 402 479 517 555 690 586 407 371 449 383 273 402 472 542 589 492 476 461 517 573 610 791 588 625 598 571 487 546 512 621 730
2067G30J09n8n8MNn2j96n8n8K23j6PQo7P6Nj39M2M2n3n4O5j75J27J28j4j3j3j3JKJ54J1o6
$$ 730 839 781 723 727 732 680 484 426 368 591 575 582 590 523 599 604 465 507 549 496 442 507 332 459 587 573 560 547 534 535 537 691 702 636
2064F36o7p5p5K0K1NOK39Jl3l3q8q8J4J58q5J54j06j06P8j61N4r0R0Q9%jK7j18L6L5J9J9J9
$$ 636 569 494 419 439 460 465 471 710 711 678 645 557 469 483 641 556 710 604 498 576 415 469 379 469 558 558 557 584 466 502 537 556 575 594
2061E94J9K6K7l1l1r4J44j4j58j03J35qqj3j3P7o7m1J02MLJ03m2j13L0qqj5j4K29rj87j86
$$ 594 613 639 666 635 604 510 654 640 482 379 514 506 498 485 472 549 482 441 543 547 550 653 611 498 528 520 512 497 483 712 703 516 330
2058C30P7P7mJ40k1k0j22j22N3J97m3m3p7O7k3J21l2l2k3k3M0L9n1R3J20k3l0J14N2j88m4
$$ 330 407 484 480 620 599 579 457 335 388 585 542 499 422 489 466 587 555 523 500 477 517 556 505 598 718 695 665 779 831 643 599
2055E99m4ppq7N6N8N9j00j00M6M5j61P8LMj44JP5o9n9Q4M0L9J30j4k8k8N3r0j4J31J0j33j11
$$ 599 555 548 541 454 510 568 627 527 427 473 518 357 435 438 442 298 299 374 305 246 330 370 409 539 525 497 469 522 432 418 549 559 426 315
2052C15L3OON9q4O8O8q0q0J44J44j21K2m4m4m5J94KLk17K3J48j87P1P1n2R1J88j48r3J46O0
$$ 315 348 354 360 419 335 403 471 391 311 455 599 478 500 456 412 367 561 563 566 349 372 520 333 404 475 423 514 702 554 461 607 667
2049F67q3J3J2j00j01K0J9p5p5J41J40O3O2n8n8n3n3n4n3J49J49j9j9m3m2m3m3J9J8J36k00
$$ 667 584 597 609 509 408 428 447 372 297 438 578 641 703 645 587 534 481 427 374 523 672 653 634 591 549 506 463 482 500 636 436
2046D36j2j1J20J20J04j36j27J12j07L6l0l0ook1k1J60p9l5J09J08l6j8j8p7p6R1R1o5o4O
$$ 436 424 413 533 653 757 621 494 606 499 535 505 475 469 463 442 421 581 502 467 576 684 648 630 612 535 459 550 641 576 512 518
2044E18PL6L5l6l7qrqrr0r1J73J72ppj26j27J5J6K13j23MJ47j22j22K7K7K8K7J6J5j04j05
$$ 518 525 561 596 560 523 515 506 498 489 399 308 481 653 646 639 513 386 401 417 630 507 511 658 536 414 441 468 496 523 539 554 450 345
2041C45J19J19r7r7O1O0o0n9K0K0K0K0m1m1J38nK15j20o0o1N9N8o1o1k9k9J00R9j08L6J23
$$ 345 464 583 486 389 450 510 450 391 411 431 451 471 430 389 527 522 737 617 557 496 555 613 552 491 462 433 533 632 524 560 683
2038F83k13j6K24J1J1j70O9n0n1j31J09l6l5lj46J5K54M5M4J58q1o5o5J12l2l0j74J9J8m0
$$ 683 470 454 678 689 700 530 599 549 498 367 476 440 405 402 256 271 525 570 614 772 691 626 561 673 641 611 437 456 474 434
2035D34l9K15k5m8m9J8J7OJ49mlk8k7k8k7mmj2j3J40lr0r1k7k6J2J56j1j0k2k2j26J14OOP0
$$ 434 395 610 585 537 488 506 523 529 678 674 671 643 616 588 561 557 553 541 528 668 665 575 484 457 431 443 599 588 578 556 534 408 522 528 534 604
2032F04p3J39nq7J53J41lr4J46l3l4M6M6k6J18n7Q6j02M2J6J7K33K32J40lK06K06J55K99K17
$$ 604 531 670 665 578 731 872 869 775 921 888 854 900 946 920 1038 981 1067 965 1007 1023 1040 1273 1505 1645 1642 1848 2054 2209 2508 2725
2029B725K18L57L57M6K85K24Q1J05J04l5l6l48l47j36j35l37j92j66j66l24l25j11j11j02
$$ 2725 2943 3300 3657 3703 3988 4212 4293 4398 4502 4467 4431 4083 3736 3600 3465 3128 2936 2770 2604 2280 1955 1844 1733 1631
2027A631k46k4k5j05j05j82j82Q2Q1o5o5N4N5j0j0q2q2k7k7k6k7k1k1R9R8p1p1j61J26L6L5
$$ 1631 1385 1361 1336 1231 1126 944 762 844 925 860 795 849 904 894 884 802 720 693 666 640 613 592 571 670 768 697 626 465 591 627 662
2024F62J8J7m1m1k38M9N5N5m7m7L4L3n7n6K32n5j4j3P8P9m1m2J1J1k4k5k0k0j9k0N9N8m3m3
$$ 662 680 697 656 615 377 426 481 536 489 442 476 509 452 396 628 573 559 546 624 703 662 620 631 642 618 593 573 553 534 514 573 631 588 545
2021E45o9K19j41j40j69J19J54J54J42j46j51j52L4L3J60j28n9n8R1R1P7P7o1o1J58j30j18
$$ 545 476 695 554 414 245 364 518 672 814 668 517 365 399 432 592 464 405 347 438 529 606 683 622 561 719 589 471
2019D71j18n6K31J5k72Q9Q9jjL0L1L1L0m6m5q8K00J08J08k33k34Q5Q4J2J2L6L5j32j32K9L0
$$ 471 353 297 528 543 271 360 449 448 447 477 508 539 569 523 478 390 590 698 806 573 339 424 508 520 532 568 603 471 339 368 398
2016C98J37j50j60J27O8O8n4n4O7O6NNK3K3k28N9K86j92LLJ35j52j12j12Q6Q5N0N0o9p0K9
$$ 398 535 385 225 352 420 488 434 380 447 513 518 523 546 569 341 400 686 494 497 500 635 483 371 259 345 430 480 530 461 391 420
2013D20K9K9K9K4K4K4K4r0r0q4K04K5K5p6p7ooopN0N0p0o9K7K8RJ0J50j36j37J50L9L8o3o4
$$ 420 449 478 507 531 555 579 603 513 423 339 543 568 593 517 440 434 428 422 415 465 515 445 376 403 431 440 450 600 464 327 477 516 554 491 427
2010D27J6J5J78j11l6l7O5O4p6p7k3k3J75j12n3n3N1L37q7q7o8o7K13p3k3k3m1m1R8R8k2k1
$$ 427 443 458 636 525 489 452 517 581 505 428 405 382 557 445 392 339 390 727 640 553 485 418 631 558 535 512 471 430 528 626 604 583
2007E83r7r7P0P1k4k4k3k4n1n1O9O9J0RRRn2n1O7O8L4L3n6n6J63j25o4o4j32J55ooL7L6j7
$$ 583 486 389 459 530 506 482 459 435 384 333 402 471 481 490 499 508 456 405 472 540 574 607 551 495 658 533 469 405 273 428 422 416 453 489 472
2004D72j7j99Q9M7M7PQL1J74P8j62j68P1J75o4J3J4RRooJ22j17j33J07J21j19j13J27Q7n7
$$ 472 455 256 345 392 439 446 454 485 659 737 575 407 478 653 589 602 616 625 634 628 622 744 627 494 601 722 603 490 617 704 647
2001F47j14L0M1M0k2k3L1L1j27j28kJ42j55Q5Q8n5l1l1k4k3J43Jp6J63J9K0q2q2q2q3O8O7
$$ 647 533 563 604 644 622 599 630 661 534 406 404 546 391 476 564 509 478 447 423 400 543 544 468 631 650 670 588 506 424 341 409 476
1998D76n3n2J4J5J5J5onN5q9J45j91J41kK8K9n3n3P8P7m2m2k9k9k9k9kkkkQ6Q6l3l4o2o2J54
$$ 476 423 371 385 400 415 430 424 419 474 385 530 339 480 478 506 535 482 429 507 584 542 500 471 442 413 384 382 380 378 376 462 548 515 481 419 357 511
1995E11J54p3p4p3J67k42lJ26j8l2l3m1m2O3O3qrOPOPm9m9L2L2r1N2j66K65R5j45o5Q0lkO
$$ 511 665 592 518 445 612 370 367 493 475 443 410 369 327 390 453 445 436 442 449 455 462 413 364 396 428 337 389 223 488 583 438 373 453 450 448 454
1991D54Pmmj9j9J79o1r3r4L5L5L5L5M3M3k9k9PPPQQRj59j6J00j39O7O7Oj38q0J59R0n4p8p7
$$ 454 461 457 453 434 415 594 533 440 346 381 416 451 486 529 572 543 514 521 528 535 543 551 560 401 385 485 346 413 480 486 348 268 427 517 463 385 308
1988C08J15J15j77O1n4R0L4j11L3L2K4K3j45j46J84M0J65p4o8o8J9J8R1R0o2o2j35J06J56
$$ 308 423 538 361 422 368 458 492 381 414 446 470 493 348 202 386 426 591 517 449 381 400 418 509 599 537 475 340 446 602
1985F02J2n9o0l4l4L7L8j4j3j3j4N0M9M9M9q3q4L5L6n0n1n0n1K7K7K8K7l4l4L8L8P3P2JJn1
$$ 602 614 555 495 461 427 464 502 488 475 462 448 498 547 596 645 562 478 513 549 499 448 398 347 374 401 429 456 422 388 426 464 537 609 610 611 560
1982E60n0K2K1o0o1o1o0J24J25j83J52m5m4M9M8o2o3N7N7o8o9MLm6m6P4P4q3q3Q4Q4l5l5J27
$$ 560 510 532 553 493 432 371 311 435 560 377 529 484 440 489 537 475 412 469 526 458 389 393 396 350 304 378 452 369 286 370 454 419 384 511
1979E11j61M2M1K3K4L9L9L9L9OOo5o6NMO8O8O4p9q8J99p1p1RK97j52qq9q9J05j82k0k0O0O1
$$ 511 350 392 433 456 480 519 558 597 636 642 648 583 517 522 526 594 662 726 647 559 758 687 616 625 922 770 762 673 584 689 507 487 467 527 588
1976E88j2j1p6p7k2k3J92r6P4P5j45kj42J45K41m7o7P6k0j9j82J06P2p3m5m5K7K7m4m5r5r5
$$ 588 576 565 489 412 390 367 559 463 537 612 467 465 323 468 709 662 595 671 651 632 450 556 628 555 510 465 492 519 475 430 335 240
1973B40J20J20M9M8n3n3j87J00J29j4K0j24k68K11J61j27j7J28kjPQn2n3j42J46o0o0L0L0
$$ 240 360 480 529 577 524 471 284 384 513 499 519 395 127 338 499 372 355 483 481 480 487 495 443 390 248 394 334 274 304 334
1970C34Q9Q8Q8Q9k3k2j43j42J60J60j36k80K39m8n8K30k6k6j6j7L0j13l2l2l3l2j13L1M4M4
$$ 334 423 511 599 688 665 643 500 358 518 678 542 262 501 453 395 625 599 573 557 540 570 457 425 393 360 328 215 246 290 334
1967C34q2J58RJ0n6Q7L8L8N5q8r5r6J44Jl9l9j6K25OOn1n1P1P1j0rM6r8r8M5Q8Q8Rj33p1p1
$$ 334 252 410 419 429 373 460 498 536 591 503 408 312 456 457 418 379 363 588 594 600 549 498 569 640 630 621 667 569 471 516 604 692 701 568 497 426
1964D26j61j7J73J74J02j38noj2j2j00M3j3J30N0j90L4L5l7J08J7J8M8r4q6q6o2o2%JP6o9
$$ 426 265 248 421 595 697 559 554 548 536 524 424 467 454 584 634 444 478 513 476 584 601 619 667 573 487 401 339 277 277 278 354 285
1961B85kK37p6p7M4M3J41r9m5m5Q3o2J54q5n8n9J37qq7N6M7r6J0J0q0O4J9J9K9K8j20j20J53
$$ 285 283 520 444 367 411 454 595 496 451 406 489 427 581 496 438 379 516 508 421 477 524 428 438 448 368 432 451 470 499 527 407 287 440
1958D40J52q6N7k3k3LMj40R9J68K5k31J0J2J2N7N7k59K20P0P1l2l1j4j4j26J60p2p3K2K1M
$$ 440 592 506 563 540 517 520 524 384 483 651 676 445 455 467 479 536 593 334 554 624 695 663 632 618 604 478 638 566 493 515 536 540
1955E40LJ32j56POJ3J4J3J4p6p6M4M3r5r5K4K4N8N7J46j40KJq8q8LLMLL4L5L5L4QQQQMMLM
$$ 540 543 675 519 526 532 545 559 572 586 510 434 478 521 426 331 355 379 437 494 640 500 502 503 415 327 330 333 337 340 374 409 444 478 486 494 502 510 514 518 521 525
1952E25KLo9o9Q8Q8p9q0J33J33q2q3m9n0J30j57j32J55k4k4N3N4L6L5J50j38K4K3o6o6OOm3
$$ 525 527 530 461 392 480 568 489 409 542 675 593 510 461 411 541 384 252 407 383 359 412 466 502 537 687 549 573 596 530 464 470 476 433
1949D33m2K9K9N1N0q8q7K43m3n0n0o2o2J06J06nmk38M9K2K3K2K2J29j59LLL4L5L4L4j38j39
$$ 433 391 420 449 500 550 462 375 618 575 525 475 413 351 457 563 558 554 316 365 387 410 432 454 583 424 427 430 464 499 533 567 429 290
1946B90P7P7l1l0j21J67j6j5p8O5O2O3R2k43J3J3JJm5R8j2j56J02K45P6j65q3q4R3n0K5j18
$$ 290 367 444 413 383 262 429 413 398 320 385 447 510 602 359 372 385 386 387 342 440 428 272 374 619 695 530 447 363 456 406 431 313
1943C13qJ36K9K8PJ51Ol29Q3Q4N8N8q9q8j10K25L7L7M8M9l8j82PQkkL3L2m8R6m9m8m9m9J40
$$ 313 305 441 470 498 505 656 662 333 416 500 558 616 527 439 329 554 591 628 676 725 687 505 512 520 518 516 549 581 533 629 580 532 483 434 574
1940E74lr1r0R3R3n0R3p9O5P3p0o6o7j2j3M8r5J0J54R6j42P3j67j03M0N5N5K06O2j41j41K29
$$ 574 571 480 390 483 576 526 619 540 605 678 608 542 475 463 450 498 403 413 567 663 521 594 427 324 364 419 474 680 742 601 460 689
1937F89j07n3J87M4M3k14k14J63K0K8K8qrj52Q7R2n2j48mj24K0L4L5j99M1M1J84L8L7Qj36
$$ 689 582 529 716 760 803 589 375 538 558 586 614 606 597 445 532 624 572 424 420 296 316 350 385 186 227 268 452 490 527 535 399
1934C99K6K6L4j09N2J96k00n6J06l8M3M3R2n2o7P7J76o4j20j21m5J95J2j32J30j4o1o1LLp8
$$ 399 425 451 485 376 428 624 424 368 474 436 479 522 614 562 495 572 748 684 564 443 398 593 605 473 603 589 528 467 470 473 395
1931C95O5R8R7r4M9j12j11p9O5J93m7J5J6O5p9ppJ05l9j58j5J06J05nj49q4J55J1J1m7m7J7
$$ 395 460 558 655 561 610 498 387 308 373 566 519 534 550 615 536 529 522 627 588 430 415 521 626 621 472 388 543 554 565 518 471 488
1928D88J6k9j73J24J24nnk0k0J22j17Q0j59k3k3J78o2n7Q6j%j8J26l6l6K5j18j9K20l6k76
$$ 488 504 475 302 426 550 545 540 520 500 622 505 585 426 403 380 558 496 439 525 524 524 506 632 596 560 585 467 448 668 632 356
1925C56L3L2J05m0m5m5K29j0j25K0LLJ2J2q0q0K4K4K21j9j24K0OJ50j0j52O1O1N3N2m9m9n8
$$ 356 389 421 526 486 441 396 625 615 490 510 513 516 528 540 460 380 404 428 649 630 506 526 532 682 672 520 581 642 695 747 698 649 591
1922E91Q5L8L8k6J19j07L8J81n9j42KJ13J13J86M2Q7Q7K9L0J10J10J76L20L40J97K80O14N46
$$ 591 676 714 752 726 845 738 776 957 898 756 758 871 984 1170 1212 1299 1386 1415 1445 1555 1665 1841 2161 2501 2698 2978 3592 4138
1920D138P85R34R34J012J012J101R58P43P42P57K30l75n19p25p25r02r01r61r61q20q20p48
$$ 4138 4923 5857 6791 7803 8815 9916 10874 11617 12359 13116 13346 12971 12452 11727 11002 10100 9199 8238 7277 6457 5637 4889
1918D889m13l81o19n52l12k89j45j30k73j12j12j74j74RRj92M7rJ34p2k15RRn3J86j65k1N6
$$ 4889 4476 4095 3476 2924 2612 2323 2178 2048 1775 1663 1551 1377 1203 1212 1221 1029 1076 1067 1201 1129 914 923 932 879 1065 900 879 935
1915I35j84P0P1Rj34j92m7j14J25P2p2P0p4j0j1N4r0O3q1K00N7l1l0O3K06J50r1OJ50k49r
$$ 935 751 821 892 901 767 575 528 414 539 611 539 609 535 525 514 568 478 541 460 660 717 686 656 719 925 1075 984 990 1140 891 882
1912H82PQj17j18J73j62q1O3K2J67l2j75j16K8O4q0l3J11J92m8k8k7o1o1j46J42J41j46NN
$$ 882 889 897 780 662 835 673 592 655 677 844 812 637 521 549 613 533 500 611 803 755 727 700 639 578 432 574 715 569 574 579
1910E79m0m0J8J61j2k99qJ36q8J98l8l8N1N2j7j7j6j7m7m8j7j7k22K57K4K4mlJ17J16j85j85
$$ 579 539 499 517 678 666 367 359 495 407 605 567 529 580 632 615 598 582 565 518 470 453 436 214 471 495 519 515 512 629 745 560 375
1907C75J27J26j45j44J18J19q7q8j6j6ooO6O6j4j5j05j04K15p1l0l0J41J41p8O6J20j68j50
$$ 375 502 628 483 339 457 576 489 401 385 369 363 357 423 489 475 460 355 251 466 395 365 335 476 617 539 605 725 557 407
1904D07oO1O1n0m9K6K7K7K6J9K0kj46j10J77J26J26j14j15p8p8J34J35q1q1NMP6P6k0k1J5
$$ 407 401 462 523 473 424 450 477 504 530 549 569 567 421 311 488 614 740 626 511 433 355 489 624 543 462 467 471 547 623 603 582 597
1901E97J5l1l1MNq8q7K3K3J19k4j59J29j60J28N6N7j12j11N6N6N1N2k0k0N1N2j16j16k0k0
$$ 597 612 581 550 554 559 471 384 407 430 549 525 366 495 335 463 519 576 464 353 409 465 516 568 548 528 579 631 515 399 379 359
1898C59J48Mj66P2n5n6q8J51J7J7m4m5m5m4J65J65lkM5M5p4p5o6o6P7j62Q3K28q5q4lmj38
$$ 359 507 511 345 417 362 306 218 369 386 403 359 314 269 225 390 555 552 550 595 640 566 491 425 359 436 274 357 585 500 416 413 409 271
1895B71J01j0rJ01m3j18J21M9M9nmnnN3N3j14j15J05J06j10j11k0k1N1N1J8J9Q1Q1l1j75J60
$$ 271 372 362 353 454 411 293 414 463 512 507 503 498 493 546 599 485 370 475 581 471 360 340 319 370 421 439 458 539 620 589 414 574
1892E74p8l1l2K6K6l5l6Q4Q5r3r2K7K7p6p6M3M3P8P8OOOPPOn4n5Qk31O3O3k4k4m4m3J72J72
$$ 574 496 465 433 459 485 450 414 498 583 490 398 425 452 376 300 343 386 464 542 548 554 560 567 574 580 526 471 479 248 311 374 350 326 282 239 411 583
1889E83q0q1q1q1J51J52Q5n8k69O7J45r5j23K12QRl6l6L5L6l4l5J6J7Q5k49J06J07o1o1p0
$$ 583 503 422 341 260 411 563 648 590 321 388 533 438 315 527 535 544 508 472 507 543 509 474 490 507 592 343 449 556 495 434 364
1886C64P4N5N5K5j19L4L4K5K6l3l2k4k3R0K34j01j01n0R3K10k9n1j94k6J17k32PM9M9M3M3
$$ 364 438 493 548 573 454 488 522 547 573 540 508 484 461 551 785 684 583 533 626 836 807 756 562 536 653 421 428 477 526 569 612
1883F12p7p7O2O3j0rQRJ7j26L9L9m2m2j5j5O6p8PPQPp3P0j1j0j%p3P1j8J25J16j24o6o6q1
$$ 612 535 458 520 583 573 564 572 581 598 472 511 550 508 466 451 436 502 424 431 438 446 453 380 450 439 429 428 428 355 426 408 533 649 525 459 393 312
1880C12O3K0J65j9j8m1J02j31J2jjJ04m0j86N3J25j14j3J31L5L5n2n2p5J63o8k13K40r5L3
$$ 312 375 395 560 541 523 482 584 453 465 464 463 567 527 341 394 519 405 392 523 558 593 541 489 414 577 509 296 536 441 474
1877D74L4Q5Q4j22j22M6M6L7L7j69P1qpo5o4ppJ21J22j40LM2M3PQpqJ40j00K5K6O6p7nJ38
$$ 474 508 593 677 555 433 479 525 562 599 430 501 493 486 421 357 350 343 464 586 446 449 491 534 541 549 542 534 674 574 599 625 691 614 609 747
1874G47l4l4Q6Q6K1j22j1J32Nj39L2j12m2m3J64p6j60j7J44Jj16K7J%K6j17L5j09J19k5P7
$$ 747 713 679 765 851 872 750 739 871 876 737 769 657 615 572 736 660 500 483 627 628 512 539 540 540 566 449 484 375 494 469 546
1871E46j63n5J85j18K6J5J4K4K3r9r9J01m2J8J7J98j38j2j2L9L9p7p6J3j30j6J29J73o6J0
$$ 546 383 328 513 395 421 436 450 474 497 398 299 400 358 376 393 591 453 441 429 468 507 430 354 367 237 221 350 523 457 467
1869D67RnnM9N0l0J12p9q0P3p0O8p5lmJ%q1O3M5M5j8j8m6m6J15k8l7J07o4o4J30j4mnq2q3
$$ 467 476 471 466 515 565 535 647 568 488 561 491 559 484 481 477 478 478 397 460 505 550 532 514 468 422 537 509 472 579 515 451 581 567 563 558 476 393
1865C93n8J81Q6n7jj44K2K3J3J3Q3Q4j32j33N5N5N5N5l6l7n4n5J36j52J00m4n6Q7j55j1O8
$$ 393 335 516 602 545 544 400 422 445 458 471 554 638 506 373 428 483 538 593 557 520 466 411 547 395 495 451 395 482 327 316 384
1862C84O9NNklP0O9j13j14N5N4p1p2R6R7L8L7q1q2J6J6j63J24K19o9k28O0J1j32Q6Q7j9j8
$$ 384 453 458 463 461 458 528 597 484 370 425 479 408 336 432 529 567 604 523 441 457 473 310 434 653 584 356 416 427 295 381 468 449 431
1859D31J43j44%%rqj41LJ56j31Q0Q1r6r6P5K18R3j95j20K3J25j9M3M2j46J42L9k47LMPOPP
$$ 431 574 430 430 430 421 413 272 275 431 300 380 461 365 269 344 562 655 460 340 363 488 469 512 554 408 550 589 342 345 349 356 362 369 376
1856C76P0P1jjllklj8j7j8j7L1L2r7r7J24j9r2J96r5N0Q5n9k21O6J5J5K0K0J9K0j1j1j0j1
$$ 376 446 517 516 515 512 509 507 504 486 469 451 434 465 497 400 303 427 408 316 512 417 467 552 493 272 338 353 368 388 408 427 447 436 425 415 404
1853D04llJ5J4j69J19P6P7k5k6k5k5p5p4J41J41q7q6j5j4K5K6K6K6N5N6m6m6j72J16m6m6J36
$$ 404 401 398 413 427 258 377 453 530 505 479 454 429 354 280 421 562 475 389 374 360 385 411 437 463 518 574 528 482 310 426 380 334 470
1850D70J35q1q0L7L8j97R1J8J8j44J43K18o9n7n7L7L7L7L7o0o0o0o1K9K8K8K8q3q3p7K11m
$$ 470 605 524 444 481 519 322 413 431 449 305 448 666 597 540 483 520 557 594 631 571 511 451 390 419 447 475 503 420 337 260 471 467
1847D67lJ4J5llklNMNNo3o3K18o9N2N2l7l8P4P5j42j41J01J02K9K9o5o6N5N4p8p7j19J68O9
$$ 467 464 478 493 490 487 485 482 487 491 496 501 438 375 593 524 576 628 591 553 627 702 560 419 520 622 651 680 615 549 604 658 580 503 384 552 621
1844F21P0q0q0L9M0M0L9k5k4J37j51j1j2M3M2QPQPj4j3j4j3ooO7O6q4q3L6L6k2k2j83J04M4
$$ 621 691 611 531 570 610 650 689 664 640 777 626 615 603 646 688 696 703 711 718 704 691 677 664 658 652 719 785 701 618 654 690 668 646 463 567 611
1841F11M4j0j0NMNMN1N1k1k1j23j23K06q1m4m4m3m4m4K43l8l8l8l8l8l8R7R7k3k3j9j8N3N3
$$ 611 655 645 635 640 644 649 653 704 755 734 713 590 467 673 592 548 504 461 417 373 616 578 540 502 464 426 388 485 582 559 536 517 499 552 605
1838F05j01j01J8J9r9r8O9P0JKJ51J51O3k24K7K7j58J30l2l2q5q4L5L5O6O5p2p2J94r3O9O8
$$ 605 504 403 421 440 341 243 312 382 383 385 536 687 750 526 553 580 422 552 520 488 403 319 354 389 455 520 448 376 570 477 546 614
1835F14rrrj0K4K4r6r6L1L1J21j67l7l8J12J12j28j29M0L9p4p4R3R3m6m5J22J22mlmmJ2J1
$$ 614 605 596 587 577 601 625 529 433 464 495 616 449 412 374 486 598 470 341 381 420 346 272 365 458 412 367 489 611 607 604 600 596 608 619
1832F19J1J1j03j02J13J13o9o9N0N1n7n7n7n7J4J4j65J21J67j21j3j3J%P2P3L3L3q6q6l7l6
$$ 619 630 641 538 436 549 662 593 524 574 625 568 511 454 397 411 425 260 381 548 427 414 401 402 402 474 547 580 613 527 441 404 368
1829C68r9J40K2K3k2J21Q9j51j26j27M5M4K1J65J34j04p2p2p5O9J08J07NMO8O7k2j66l8J06
$$ 368 269 409 431 454 432 553 642 491 365 238 283 327 348 513 647 543 471 399 324 393 501 608 613 617 685 752 730 564 526 632
1826F32j08L6J01m2k2k61L3L2m5m6K00l9M3j01L7L7ppJ36j03PJ49j04j04l3J10r0r0O4O3m7
$$ 632 524 560 661 619 597 336 369 401 356 310 510 471 514 413 450 487 480 473 609 506 513 662 558 454 421 531 441 351 415 478 431
1823D31m7l2J11J47Mj5j6l3J11r5r4Q2Q2j00j01J9K0Q6Q7l3l3J5J6j91M8J0J0O1O1q8q7jJ43
$$ 431 384 352 463 610 614 599 583 550 661 566 472 554 636 536 435 454 474 560 647 614 581 596 612 421 469 479 489 550 611 523 436 435 578
1820E78K5K5J9J9j59J76m8m8N9O0j3j2K8K8k9k9j46R3Mj40m1m0P0P0J5J4m8m8o0Q4J20k15
$$ 578 603 628 647 666 507 683 635 587 646 706 693 681 709 737 708 679 533 626 630 490 449 409 479 549 564 578 530 482 422 506 626 411
1817D11J8J8L4L3Q5Q4q2q3J6J5J6J5J9J9O0k27M8M8j32J55q1q1P4P5j66J21m0m1N4N4M8k39
$$ 411 429 447 481 514 599 683 601 518 534 549 565 580 599 618 678 451 499 547 415 570 489 408 482 557 391 512 472 431 485 539 587 348
1814C48Q1Q1n6n7L9L8LLmmJ4J5j41J47J04J05j59j58J04J05N9O0o0o0j2j2j32j32M5M4k7k7
$$ 348 429 510 454 397 436 474 477 480 476 472 486 501 360 507 611 716 557 399 503 608 667 727 667 607 595 583 451 319 364 408 381 354
1811C54Q4Q3j8j8k07Q0rrQ3Q4j32j32J07J08o0o0J56J56j08j07J9J8n3n4J36J36j27j28K3
$$ 354 438 521 503 485 278 358 349 340 423 507 375 243 350 458 398 338 494 650 542 435 454 472 419 365 501 637 510 382 405
1809D05K3m9m9J1J2M7M7nmO7O8j42j41P4P4K1K1j5j5o0o0O0O0QQM4M5OOj19J68o0o1J56j32
$$ 405 428 379 330 341 353 400 447 442 438 505 573 431 290 364 438 459 480 465 450 390 330 390 450 458 466 510 555 561 567 448 616 556 495 651 519
1806E19o1o1m9R5M2j02P4P5o9J70Nj38j55j1J9J9NOj0rJ73o7O9O8p7p7P6o8j16j16J54J54
$$ 519 458 397 348 443 485 383 457 532 463 633 638 500 345 334 353 372 377 383 373 364 537 470 539 607 530 453 529 461 345 229 383 537
1803E37j57Q2j33J1J38J38o9o9K6K5Q9j51R0R0j08k51J10J11J10J10j80l7l9J04L5j09k0j9
$$ 537 380 462 329 340 478 616 547 478 504 529 618 467 557 647 539 288 398 509 619 729 549 512 473 577 612 503 483 464
1800D64m9m9n0R5k9J15J78o2k1k1l6l7rj0P1p2L7L6J9J9l2j76P3P2K4K3r6r7J45J46p1p0o
$$ 464 415 366 316 411 382 497 675 613 592 571 535 498 489 479 550 478 515 551 570 589 557 381 454 526 550 573 477 380 525 671 600 530 524
1797E24ok09J26J81n9r1r1K42r3p2p2J04J03J7j27o1o1N0M9m0m0m9R4P1P1M0j03K3K3P6j62
$$ 524 518 309 435 616 557 466 375 617 524 452 380 484 587 604 477 416 355 405 454 414 374 325 419 490 561 601 498 521 544 620 458
1794D58m5m5n9o0J69J69m7m7J16J16r9r9j5j5N7N6llp5p5P2P2r6r6j1j0J51j36O5O6j5j5m6
$$ 458 413 368 309 249 418 587 540 493 609 725 626 527 512 497 554 610 607 604 529 454 526 598 502 406 395 385 536 400 465 531 516 501 455
1791D55R7J15j72q4O0L3L2l0l0R0R0r0r0j9j8O7O7K37n0j68k5n1n2P1P1r7r6K0K0K0K0q9q9
$$ 455 552 667 495 411 471 504 536 506 476 566 656 566 476 457 439 506 573 810 760 592 567 516 464 535 606 509 413 433 453 473 493 404 315
1788C15R4n0J29j58L0L18O6k21L0L1q9q8j7j7PPQPK2K3K3K2J8J8J8J8mnp6p6K9K8K9K8m0m0
$$ 315 409 359 488 330 360 678 744 523 553 584 495 407 390 373 380 387 395 402 424 447 470 492 510 528 546 564 560 555 479 403 432 460 489 517 477 437
1785D37L2L2j3j3j3j3O4O3qrj9j9N3N3JJj67j67K4K3R5R5j1j1j2j1o6o5Q4Q5J45j43j51J36
$$ 437 469 501 488 475 462 449 513 576 568 559 540 521 574 627 628 629 462 295 319 342 437 532 521 510 498 487 421 356 440 525 670 527 376 512
1782E12P0p3K5K5q0q0JJl5J09O1k27Q2o1q0O4ooK84lo4o4j90R7J86j02kJ40o9p0J1J1k2k2
$$ 512 582 509 534 559 479 399 400 401 366 475 536 309 391 330 250 314 308 302 586 583 519 455 265 362 548 446 444 584 515 445 456 467 445 423
1779D23k2k2J29J30k9k9j57j2j84J05Q2Q2R5j93%%J02J02j4j3J48j39o3o2rrn8n8O1O2L5L4
$$ 423 401 379 508 638 609 580 423 411 227 332 414 496 591 398 398 398 500 602 588 575 723 584 521 459 450 441 383 325 386 448 483 517
1776E17l7l7M2M2l0l0q9q8P9P9KKKKn0n1K2K1P3P3j8j7J61j26J7J7N8k30N2N1L4L3r5r5J11
$$ 517 480 443 485 527 497 467 378 290 369 448 450 452 454 456 406 355 377 398 471 544 526 509 670 544 561 578 636 406 458 509 543 576 481 386 497
1773D97l3j14J73k4k4o0n9j57J31O8p6m6K42P0P1j12j12J04J03l6l5l6l6mlmmmmmlM2M3M3
$$ 497 464 350 523 499 475 415 356 199 330 398 322 276 518 588 659 547 435 539 642 606 571 535 499 495 492 488 484 480 476 472 469 511 554 597
1770E97M3p7p6M3M3q7q7L2L3J9K0j16J24J9J8k9l0j38Nk8J16K6J70k04L5J6J6l2l2l8J05J13
$$ 597 640 563 487 530 573 486 399 431 464 483 503 387 511 530 548 519 489 351 356 328 444 470 640 436 471 487 503 471 439 401 506 619
1767F19k9l6J08j35J0m9m8N0r3l1J13j20J19R7m7j43Jm7R7J68p0j48np6J64P6o7K8K9j16j17
$$ 619 590 554 662 527 537 488 440 490 397 366 479 359 478 575 528 385 386 339 436 604 534 386 381 305 469 545 478 506 535 419 302
1764C02N7K01N7q7o8o9M2M2j46J88q5q5J51J52q4q3k1k1J15k8q2J57p7p8N7N7m2m2m2m2j0
$$ 302 359 560 617 530 462 393 435 477 331 519 434 349 500 652 568 485 464 443 558 530 448 605 528 450 507 564 522 480 438 396 386
1761C86j0K50q5NNM7M6L5j09k17J18O6O5k24J5J56J3m4R9J0J0j01j01m3m4J25J24q9r0P8P8
$$ 386 376 626 541 546 551 598 644 679 570 353 471 537 602 378 393 549 562 518 617 627 637 536 435 392 348 473 597 508 418 496 574
1758E74l4l4j33J0K37n1k00Q7q7N7K28o0q6q7J5J5j4j5m1J02J89r9%%MNl2l1j1j1j1j2m0m0
$$ 574 540 506 373 383 620 569 369 456 369 426 654 594 508 421 436 451 437 422 381 483 672 573 573 573 577 582 550 519 508 497 486 474 434 394
1755C94L1L2N8N9o1o2OOJ68j19kjN2N3k7k7O3O3j89R9j34j35J22J22J06j80Q7n8lJ41l4l5
$$ 394 425 457 515 574 513 451 457 463 631 512 510 509 561 614 587 560 623 686 497 596 462 327 449 571 677 497 584 526 523 664 630 595
1752E95q8N6J16j71j%K2K2n0n0P2P1m8m8M4M4k8k7n4n3J18j70j5J28j14K9l8J06l8l7n1n1
$$ 595 507 563 679 508 507 507 529 551 501 451 523 594 546 498 542 586 558 531 477 424 542 372 357 485 371 400 362 468 430 393 342 291
1749B91K2K1n3n3O7O7J7J8N3N3llllO1O2n8n8N0M9j83J03nnK1K2p3P2P1p3m4m3m4m4M9J93
$$ 291 313 334 281 228 295 362 379 397 450 503 500 497 494 491 552 614 556 498 548 597 414 517 512 507 528 550 477 549 620 547 503 460 416 372 421 614
1746F14j46kJ82L7q8q8mnl1l1l7J07P1p3J5J4l0l0K6K5M4j00j16K8o2Q2j7J27P3p1j02M1n8
$$ 614 468 466 648 685 597 509 505 500 469 438 401 508 579 506 521 535 505 475 501 526 570 470 354 382 320 402 385 512 585 514 412 453 395
1743C95n8O0q4J05j35L6J79R8j41O6O6j49no0o0O8O9JJl4l5L5L6rrL9j04M8M8M8M8l4l3J29
$$ 395 337 397 313 418 283 319 498 596 455 521 587 438 433 373 313 381 450 451 452 418 383 418 454 445 436 475 371 419 467 515 563 529 496 625
1740F25j4o3o2J15k9j48nK9L0pJ37p2p3M7M8J9j25qpo9o8K28Q4q8q8K3K3J1J2o9o9R2n2j5
$$ 625 611 548 486 601 572 424 419 448 478 471 608 536 463 510 558 577 452 444 437 368 300 528 612 524 436 459 482 493 505 436 367 459 407 392
1737C92J28J3J4q3q2l6K03Q4j56oon6n6PPR5R4j14J25J42%n7n7J5j29n2n3l7J06J59q0OPj74
$$ 392 520 533 547 464 382 346 549 633 477 471 465 409 353 360 367 462 556 442 567 709 709 652 595 610 481 429 376 339 445 604 524 530 537 363
1734C63O7J8J62p3p4J90m9J6J7p0p1p4p4J41J41m5m5L5j08%jK6K7L9L9o6o5j42R8Q3Q3j02
$$ 363 430 448 610 537 463 653 604 620 637 567 496 422 348 489 630 585 540 575 467 467 466 492 519 558 597 531 466 324 422 505 588 486
1731D86j03J14J13PPn6n6r2N1J6J5K0J64j27J7J8j26J25j8l6J07j58j59N3r0J50J49J11l3
$$ 486 383 497 610 617 624 568 512 420 471 487 502 522 686 559 576 594 468 593 575 539 646 488 329 382 292 442 591 702 669
1728F69o3o2j5J28j10j11j7J26J18j22p6O9l7l7L6j08J2J56r0r0m1J01J4J3J4J3R7m7j37J02
$$ 669 606 544 529 657 547 436 419 545 663 541 465 534 497 460 496 388 400 556 466 376 335 436 450 463 477 490 587 540 403 505
1726E05M9N0j85m0J3J3J03m0K8K8O4p9L9L8j23K1J2J1j6j5J5J5l9l9j21J65K37n0n0n1l3l3
$$ 505 554 604 419 379 392 405 508 468 496 524 588 509 548 586 463 484 496 507 491 476 491 506 467 428 307 472 709 659 609 558 525 492
1723D92k8k9k3K64p5p5k2k1LLLLnmL1L2j07j06O2O1n1n2O8O8jkP0P0m0m0p6p6j27j27J36J36
$$ 492 464 435 412 676 601 526 504 483 486 489 492 495 490 486 517 549 442 336 398 459 408 356 424 492 491 489 559 629 589 549 473 397 270 143 279 415
1719D15O9P0j46j46Q6Q5l4l4l4l4J99q8J4J5O8O9QRm6m5J79j07j44J43o0o0m2m2N0M9M9N0
$$ 415 484 554 408 262 348 433 399 365 331 297 496 408 422 437 505 574 582 591 545 500 679 572 428 571 511 451 409 367 417 466 515 565
1717E65m4m3P6P6n4n4K7K7j25J8J45j43m9R5j03M1Pk80J06J06K0J9n3n2Q8Q8J6J7l2l1M1M1
$$ 565 521 478 554 630 576 522 549 576 451 469 614 471 422 517 414 455 462 182 288 394 414 433 380 328 416 504 520 537 505 474 515 556
1714E56poJ55j32J8J9l5l6o7o7Q5Q5J04j35jjm1m1L1L1m9n0K3K2K3K2n8n8J17k7llj08J32
$$ 556 549 543 698 566 584 603 568 532 465 398 483 568 672 537 536 535 494 453 484 515 466 416 439 461 484 506 448 390 507 480 477 474 366 498
1711D98o6o6jJ43P7j62M0L9J6J6N6q6o9o9J8J62N6q6j07J34P0p3Q6Q7M8r6n2R1J1j34r5r6
$$ 498 432 366 365 508 585 423 463 502 518 534 590 504 435 366 384 546 602 516 409 543 613 540 626 713 761 665 613 704 715 581 486 390
1708C90j8J26n7n6m8m7M8M8J29j4P2P3n6n6opp8p9J05J05J29j5k22J6Q3o1l3J11J56q4RRj4
$$ 390 372 498 441 385 337 290 338 386 515 501 573 646 590 534 528 521 443 364 469 574 703 688 466 482 565 504 471 582 738 654 663 672 658
1705F58j5K0j24P7P7j57j56J96N3j07L7n3n3M0M0j58J77k9j73J72J71R7k39n0n0O2O2r1N3
$$ 658 643 663 539 616 693 536 380 576 629 522 559 506 453 493 533 375 552 523 350 522 693 790 551 501 451 513 575 484 537
1702E37j36j36J37J36n2n3j33J1j5j5J13J14q7q8j5j6J30J30p1P3j5j4onK6K6j18K6j28J5
$$ 537 401 265 402 538 486 433 300 311 296 281 394 508 421 333 318 302 432 562 491 564 549 535 529 524 550 576 458 484 356 371
1699C71O3O3J%J5J5j35J04O0q4pJ37o3o3l3J11m2m2n8n8O8K11M9r4p7O7r0N4k7k7N7q7O6p7
$$ 371 434 497 498 498 513 528 393 497 557 473 466 603 540 477 444 555 513 471 413 355 423 634 683 589 512 579 489 543 516 489 546 459 525 448
1696D48J19k3j68P2J90M6j60P9j2j2Q3o0M2M1n5j98J07J07j98n5K0K0J10l3K0K0p0P5K7K7
$$ 448 567 544 376 448 638 684 524 603 591 579 662 602 644 685 630 432 539 646 448 393 413 433 543 510 530 550 480 555 582 609
1693F09l5l6M6M5k6k7l3l2M8r6R7R8m1m0J70K7p5k19k7k7KJ47J16J16k19p6l0l1N0N1p0o9
$$ 609 574 538 584 629 603 576 543 511 559 463 560 658 617 577 747 774 699 480 453 426 428 575 691 807 588 512 482 451 501 552 482 413
1691D13R9R8j26j26M2j02m6J93M1J85l6l5lj46j01J39J30j10M3M2r2r1K8K8n3R1q8q9J27j12
$$ 413 512 610 484 358 400 298 252 445 486 671 635 600 597 451 350 489 619 509 552 594 502 411 439 467 414 505 417 328 455 343
1688C43R1R2Q6Q5j45jj63j9N8N8Q2j57J20J21r5M9m4m5J00j41j6j6J70K5n3n3J53J54j36j35
$$ 343 434 526 612 697 552 551 388 369 427 485 567 410 530 651 556 605 561 516 616 475 459 443 613 638 585 532 685 839 703 568
1685E68j%j07J33P9o4L6L6J43j91lmj5j58%jK1J65J13l1o1o1m5m4n4R0lmNONNK3j20o3Q0j0
$$ 568 567 567 460 593 672 608 644 680 823 632 629 625 610 452 452 451 472 637 750 719 658 597 552 508 454 544 541 537 542 548 553 558 581 461 398 478 468
1682D68rL0L1L1L1opr6M8L4j09j16K9K09l0l9J05n4n4m5m5j5j5N6N7J4J5j5j59j5J28J11l3
$$ 468 459 489 520 551 582 576 569 473 521 555 446 330 359 568 538 499 604 550 496 451 406 391 376 432 489 503 518 503 344 329 457 568 535
1679E35j7j62j8j8M4M3N9N8j43R6L3L3m8m8K4K4K9K9K8K9k2k3L2L2J26j62q1O4k5k4j5j5N4
$$ 535 518 356 338 320 364 407 466 524 381 477 510 543 495 447 471 495 524 553 581 610 588 565 597 629 755 593 512 576 551 527 512 497 551
1676E51N3j8j8Q1Q0l9l9JKJJj49j49O7O6jjQ9j98M3M2J14j73J33J32nom8m9L3L2r9M4K06q1
$$ 551 604 586 568 649 729 690 651 652 654 655 656 507 358 425 491 490 489 578 380 423 465 579 406 539 671 666 660 612 563 596 628 529 573 779 698
1673F98k75j31J63J9n3n3K19o8Q8Q7k09o5k5K62n7n8L9M0L9M0o6o5o5o5O0O1k06o2K05q3Q7
$$ 698 423 292 455 474 421 368 587 519 607 694 485 420 395 657 600 542 581 621 660 700 634 569 504 439 499 560 354 292 497 414 501
1670E01Q8j04j04J6J6K2K1K2K2O5O5j03j03J3J3j5J29J62j25n7n7j58J29O9O9M4k44J16J16
$$ 501 589 485 381 397 413 435 456 478 500 565 630 527 424 437 450 435 564 726 601 544 487 329 458 527 596 640 396 512 628
1667F28P8k09r0J98l5l5J%j57J29M0L9l9l9J04j83J89r8k6J18j00M3k8k8rrJ53j34N3N4q4
$$ 628 706 497 407 605 570 535 536 536 379 508 548 587 548 509 613 430 619 521 495 613 513 556 528 500 491 482 635 501 554 608 524
1664E24q4k1k1k1k1J07J07L5L6mmONj51pJ46j42P8P8o0n9l0l0M2M1m9n0m9m9P9Q0m0m1mmJ16
$$ 524 440 419 398 377 356 463 570 605 641 637 633 639 644 493 486 632 490 568 646 586 527 497 467 509 550 501 451 402 353 432 512 472 431 427 423 539
1661E39J15n1n0n1n0N5N6o4o4P0O9kkm6m5K6K6j0j0j1j0P2P2m8m8p4p3R4R4l0l1K04q4l1l1
$$ 539 654 603 553 502 452 507 563 499 435 505 574 572 570 524 479 505 531 521 511 500 490 562 634 586 538 464 391 485 579 549 518 722 638 607 576
1658E76m9m9j6j6j6j6R6R7k4k3m0m0m0l9L2L3L3L3L7L7l4l5j1j1J60j28o8P6k3k3J29J30j34
$$ 576 527 478 462 446 430 414 510 607 583 560 520 480 440 401 433 466 499 532 569 606 572 537 526 515 675 547 479 555 532 509 638 768 634
1655F34j33N3N3q4q4Q4k02J60J6j17j17Q9R0QQQQopJ55j33j9j9Q3Q3p5p4lkR2R3j23j22O3
$$ 634 501 554 607 523 439 523 321 481 497 380 263 352 442 450 458 466 474 468 461 616 483 464 445 528 611 536 462 459 457 549 642 519 397 460
1652D60O2O3O3p5p5n7n7j68J20r3J94Q7n6oj49K19P6n4R1l8l8M4M3o8o7N2N2m3m3K9K9K3K3
$$ 460 522 585 648 573 498 441 384 216 336 243 437 524 468 462 313 532 608 554 645 607 569 613 656 588 521 573 625 582 539 568 597 620 643
1649F43Q6n8J21j67j5j4k9k9R0R0r8r9P0O9k2k3j92R4l7j81K14P0j9k0J42j45KJ45r8M7j06
$$ 643 729 671 792 625 610 596 567 538 628 718 620 521 591 660 638 615 423 517 480 299 513 583 564 544 686 541 543 688 590 637 531
1646E31L7NJ48n6n5n6n5J27j7j78J09L8j06J1J1j06J81j30j30r1J96L4L4J8J8n5n4O9O9lm
$$ 531 568 573 721 665 610 554 499 626 609 431 540 578 472 483 494 388 569 439 309 218 414 448 482 500 518 463 409 478 547 544 540
1643E40m3m4J9K0J12l2l2J12ONk07L3J10j29J41J40j77j77m8m8L2J77J02j38N9q6J01J00j1
$$ 540 497 453 472 492 604 572 540 652 658 663 456 489 599 470 611 751 574 397 349 301 333 510 612 474 533 447 548 648 637
1641F37j0l1l2K31j05j17K7m7m8k0J23K1l13J8J62N3N3P1p3p6p6O8O8J67p1m2m2r9J41J95
$$ 637 627 596 564 795 690 573 600 553 505 485 608 629 316 334 496 549 602 673 600 524 448 516 584 751 680 638 596 497 638 833
1638H33j41k2k2m4m3m2m2j2J32P7o7K3K3L4L3j64P5m6R7J00k35P4P5p5p5N2r1P0p4J44J43
$$ 833 692 670 648 604 561 519 477 465 597 674 607 630 653 687 720 556 631 585 682 782 547 621 696 621 546 598 507 577 503 647 790
1635G90j29j29R8R7j09j09m2J02P5j64J08l6M0L9p7O6j04L9M2j03k1J22J4J4J19k4j36J04
$$ 790 661 532 630 727 618 509 467 569 644 480 588 552 592 631 554 620 516 555 597 494 473 595 609 623 742 718 582 686
1632F86R9k38j50J85N6q7j8j8L6L6P7o8J4J3J6J6J41r8L6j07L1L0j9k0r2r2J18J18r8r8l6
$$ 686 785 547 397 582 638 551 533 515 551 587 664 596 610 623 639 655 796 698 734 627 658 688 669 649 557 465 583 701 603 505 469
1630D69l7P5P4J13l0r3N0j24K0j3J30jjP0j68j1j1M6M7l0l1l0l0OPJ58J6j4j3j72O8J23j16
$$ 469 432 507 581 694 664 571 621 497 517 504 634 633 632 702 534 523 512 558 605 575 544 514 484 490 497 655 671 657 644 472 540 663 547
1627E47K4K5J41kOPj35j34L4L3q4q5J22j18K4K4RRP0P0R5j45n5Q9O5O5p8p9KL%J44OOj75O5
$$ 547 571 596 737 735 741 748 613 479 513 546 462 377 499 381 405 429 438 447 517 587 682 537 482 571 636 701 623 544 546 549 549 693 699 705 530 595
1623E95J6J7j10J30p7O7j16K8PPJ37j97qrJ00J01j00M4O1O0q8q9m0J05R5m8R8m5r3r3J6J6
$$ 595 611 628 518 648 571 638 522 550 557 564 701 504 496 487 587 688 588 632 693 753 665 576 536 641 736 688 786 741 648 555 571 587
1620E87J12l1j55Q5n0m9qJ36j7j7k8k8m3J96jjl7l7k10J26J0RJ4J3J4J4P0P0j70P0q9J51k18
$$ 587 699 668 513 598 548 499 491 627 610 593 565 537 494 690 689 688 651 614 404 530 540 549 563 576 590 604 674 744 574 644 555 706 488
1617D88p3M0M0N7N8n3R1p1P3p3p3J45Kn7Q7O0O0J31j3j08j09O3q2j%L5L6m5R8K9K8j40j39
$$ 488 415 455 495 552 610 557 648 577 650 577 504 649 651 594 681 741 801 932 919 811 702 765 683 682 682 717 753 708 806 835 863 723 584
1614E84J21k2q4J54L7j08P9o6j7J26L6L7p9p9k2k2J44r6r6J44L2L1l4l4J59J6k3k3J20J21
$$ 584 705 683 599 753 790 682 761 695 678 804 840 877 798 719 697 675 819 723 627 771 803 834 800 766 925 941 918 895 1015 1136
1612A136J%K9K8J9J63M3M3K29K28P6K19L54M97N74L35P02P03M88O32N43N42M78L35R5j45l95
$$ 1136 1137 1137 1166 1194 1213 1376 1419 1462 1691 1919 1995 2214 2568 3065 3639 3974 4676 5379 5867 6499 7042 7584 8062 8397 8492 8347 7952
1609G952l95m91p31n28n28n44n43m54m53m21j81k23k23k08k08k26k26j06j06N1N1M5k42O5
$$ 7952 7557 7066 6335 5807 5279 4735 4192 3738 3285 2864 2683 2460 2237 2029 1821 1595 1369 1263 1157 1208 1259 1304 1062 1127
1607A127O5p3p3j12j11K6K6l7K50p8p9N6N6o4o4l7l7Q2Q3j06j06J75j12l8l8O5O4m0l9l9l9
$$ 1127 1192 1119 1046 934 823 849 875 838 1088 1010 931 987 1043 979 915 878 841 923 1006 900 794 969 857 819 781 846 910 870 831 792 753
1604G53P4P4m5m6M0M0j28j28j9j8Q3Q3L7k51K40m7QPj1j1n7n7r9J88J6J6P6k11K5K5PPk8k7
$$ 753 827 901 856 810 850 890 762 634 615 597 680 763 800 549 789 742 750 757 746 735 678 621 522 710 726 742 818 607 632 657 664 671 643 616
1601F16k8k7L2L3L2L3J0J1J0J0k5k6pqr9J89K6K7j03j03l2l1NNNNN6N6N6N6j05j05M4M5P2
$$ 616 588 561 593 626 658 691 701 712 722 732 707 681 674 666 567 756 782 809 706 603 571 540 545 550 555 560 616 672 728 784 679 574 618 663 735
1598G35k16J8J8N2N2L4L4J16j71rj0N3N3N3N2q5q5NNj79J08J14J14qrq0q1N8N8o1o2K6K7K6
$$ 735 519 537 555 607 659 693 727 843 672 663 653 706 759 812 864 779 694 699 704 525 633 747 861 853 844 764 683 741 799 738 676 702 729 755
1595G55K7O8O9r9j00nnnnK9K9K9K8KKp0p0L3L4q6q6J07J07o1o0mmJ57j30N3N3q5q5K8K7K8
$$ 755 782 850 919 820 720 715 710 705 700 729 758 787 815 817 819 749 679 712 746 660 574 681 788 727 667 663 659 816 686 739 792 707 622 650 677 705
1592G05K8KLKKj2j2j2j3OOK3K4j54J33k9k9M8M7k4k4j1j1J51j36K8K8j09j10mmlmK4K5K5K4
$$ 705 733 735 738 740 742 730 718 706 693 699 705 728 752 598 731 702 673 721 768 744 720 709 698 849 713 741 769 660 550 546 542 539 535 559 584 609 633
1588F33K8K7K8K7R7R6p1p1r7r7N3N3J87j00j00J87r0r0p2p3R3R2k7k8O2O1j06j06J12J12j03
$$ 633 661 688 716 743 840 936 865 794 697 600 653 706 893 793 693 880 790 700 628 555 648 740 713 685 747 808 702 596 708 820 717
1585G17j04k0j9J47J48j2j3k1k2J4j29Q5Q6j94M6O9O9K1j22P7P8K1K1o5k10KLL2J75l2l2k3
$$ 717 613 593 574 721 869 857 844 823 801 815 686 771 857 663 709 778 847 868 746 823 901 922 943 878 668 670 673 705 880 848 816 793
1583G93k4J00J01k6j69n3R2j4j3R9j39o8o7m4J00J0J0K16P2Q2Q1l9l8l9l8r6r5j04L9J89J89
$$ 793 769 869 970 944 775 722 814 800 787 886 747 679 612 568 668 678 688 904 976 1058 1139 1100 1062 1023 985 889 794 690 729 918 1107
1580A107j1k51j03J36mmr7M7L8L8k1k1onp2J68N4N4k26J09qqk4k4J11j29N1N1N2N1j61P8J11
$$ 1107 1096 845 742 878 874 870 773 820 858 896 875 854 848 843 771 939 993 1047 821 930 922 914 890 866 977 848 899 950 1002 1053 892 970 1081
1577A081l3k09L0Q7n7%%%j44J06J06j57Q2l5l5j63P6Q8n6n1R4K6j17M4M4L6L5L6L5j22j22
$$ 1081 1048 839 869 956 899 899 899 899 755 861 967 810 892 857 822 659 735 823 767 716 810 836 719 763 807 843 878 914 949 827 705
1574G05L1L1J74o6n1n0M3M4M4M3p8p8J28J28L2j11l0l1m0m1J50q8J88n2j23J16k11K8P6P5
$$ 705 736 767 941 875 824 774 817 861 905 948 870 792 920 1048 1080 969 939 908 868 827 977 889 1077 1025 902 1018 807 835 911 986
1571I86qqqqqrqrP0O9qj52pJ37J7j27j02M1J82J81j10J30J2j31N8K01k3j67k0j9R2R1n3n4
$$ 986 978 970 962 954 946 937 929 920 990 1059 1051 899 892 1029 1046 919 817 858 1040 1221 1111 1241 1253 1122 1180 1381 1358 1191 1171 1152 1244 1335 1282 1228
1568A228j49oK35np7p7M3M3j10L4mnR5n0k6J16q3q4J5J59o6P8L7J82J99N5j1J33J96N2J74
$$ 1228 1079 1073 1308 1303 1226 1149 1192 1235 1125 1159 1155 1150 1245 1195 1169 1285 1202 1118 1133 1292 1226 1304 1341 1523 1722 1777 1766 1899 2095 2147 2321
1565B321J73J58L98M10N53Q95O55N24O67O91O91N87N86K12K13r5l34n01n02p21n78p31n87
$$ 2321 2494 2652 3050 3460 4013 4908 5563 6087 6754 7445 8136 8723 9309 9521 9734 9639 9305 8804 8302 7581 7003 6272 5685
1563E685n61m18m17m18j90j89k70n10j78j77p3p3j09j10p0P3j35j35j5j5K5j19j27J6J80L7
$$ 5685 5124 4706 4289 3871 3681 3492 3222 2712 2534 2357 2284 2211 2102 1992 1922 1995 1860 1725 1710 1695 1720 1601 1474 1490 1670 1707
1561A707j78l5Q8n6m6R7L4L5Mj39OOQ6n7LJ47o3o3QPQ0o4M2j01R6K39J0j33J3J3J88n1J1J2
$$ 1707 1529 1494 1582 1526 1480 1577 1611 1646 1650 1511 1517 1523 1609 1552 1555 1702 1639 1576 1584 1591 1671 1607 1649 1548 1644 1883 1893 1760 1773 1786 1974 1923 1934 1946
1558A946N3N3r1J49J71K8LMj6j6Lj42q8N6Q6j53Q2j58l8l8J8J7RQN5r0P8K22l9l8j65P5R6
$$ 1946 1999 2052 1961 2110 2281 2309 2312 2316 2300 2284 2287 2145 2057 2113 2199 2046 2128 1970 1932 1894 1912 1929 1938 1946 2001 1911 1989 2211 2172 2134 1969 2044 2140
1555B140R6qrL2L2J51J51N2N2j1K28J0J0n6Q7p9q0p1p0j5j6%%q4J56L0j14l4l4Q5Q5l7J06
$$ 2140 2236 2228 2219 2251 2283 2434 2585 2637 2689 2678 2906 2916 2926 2870 2957 2878 2798 2727 2657 2642 2626 2626 2626 2542 2698 2728 2614 2580 2546 2631 2716 2679 2785
1552B785M9j91o3Q1P4o9j26J8J83J82J54J1j16J24J20J20J5J4RRR9m5o4P9q2O1n0R2J02m2
$$ 2785 2834 2643 2580 2661 2735 2666 2540 2558 2741 2923 3077 3088 2972 3096 3216 3336 3351 3365 3374 3383 3482 3437 3373 3452 3370 3431 3381 3473 3575 3533
1549C533J02J02Oj37Q5Q5K0K0j82N8J78o2p8p8P5P4k0k1j1j2Q6K30P6P7J18J18J27j6J04J05
$$ 3533 3635 3737 3743 3606 3691 3776 3796 3816 3634 3692 3870 3808 3730 3652 3727 3801 3781 3760 3749 3737 3823 4053 4129 4206 4324 4442 4569 4553 4657 4762
1546D762OJ49J68K5r3J48K3K3J72J73m5J94L62J23J34J35K69L0J69M08K50K50L48K05L57L58
$$ 4762 4768 4917 5085 5110 5017 5165 5188 5211 5383 5556 5511 5705 6067 6190 6324 6459 6728 6758 6927 7335 7585 7835 8183 8388 8745 9103
1544I103K99L00M19M20P21P22Q08R52Q69Q68J006J006Q26R70Q09N69P6P7j21k65k22k23k08
$$ 9103 9402 9702 10121 10541 11262 11984 12792 13744 14613 15481 16487 17493 18319 19289 20098 20667 20743 20820 20699 20434 20212 19989 19781
1542A9781o4O6j73K43K42L60N03M49P85P68P68Q22J061J304J304J313J552J663J807J944K184
$$ 19781 19717 19783 19610 19853 20095 20455 20958 21407 22192 22960 23728 24550 25611 26915 28219 29532 31084 32747 34554 36498 38682
1540C8682K411K843L297L441L985M320M775N397N847O660P828Q834J0150J2019J3939J7053
$$ 38682 41093 43936 47233 50674 54659 58979 63754 69151 74998 81658 89486 98320 108470 120489 134428 151481
1539A51481K0974K6193L3506M3227N4795O9066Q5603J03130J18421J26562J25748J20288J13771
$$ 151481 172455 198648 232154 275381 330176 399242 484845 587975 706396 832958 958706 1078994 1192765
1537A192765J07353R5657P2574L8487o051m7750p3132r8596j12675j10485j08473j08923j03846
$$ 1192765 1300118 1395775 1468349 1506836 1500785 1453035 1379903 1281307 1168632 1058147 949674 840751 736905
1536G36905r3837q4929p6949o9190n9948n1423m3967l7742l0594k3603j8214j4478j1844j0217
$$ 736905 643068 558139 481190 412000 352052 300629 256662 218920 188326 164723 146509 132031 120187 109970
1535A09970q740p687o897o035n333n046m710m040l800l322k891k603k096j617j115o36K33
$$ 109970 101230 93543 86646 80611 75278 70232 65522 61482 57682 54360 51469 48866 46770 45153 44038 43402 43635
1533D3635R02J241J529J624J768J609J322J190N20m03j647k294k965l599l599l398l399l240
$$ 43635 44537 45778 47307 48931 50699 52308 53630 54820 55340 54937 53290 50996 48031 44432 40833 37435 34036 30796
1532C0796k953k675k532k224j937j869j390j345j202r22o34p88p87n10n11l43l42k89k89j70
$$ 30796 27843 25168 22636 20412 18475 16606 15216 13871 12669 11747 11113 10325 9538 9028 8517 8174 7832 7543 7254 7084
1530G084j69j55j56j56j56J6J5k00k00q7q8k08k07k49k50j20j21k58j15k85Kj54j55k34N2
$$ 7084 6915 6760 6604 6448 6292 6308 6323 6123 5923 5836 5748 5540 5333 5084 4834 4714 4593 4335 4220 3935 3937 3783 3628 3394 3446
1528C446j11k54J40lm7m8n6n7p1p2p1p1N1N1j16j16l9l8j58j58r8r7M7j93j38OJ5J5j11l52
$$ 3446 3335 3081 3221 3218 3171 3123 3067 3010 2939 2867 2796 2725 2776 2827 2711 2595 2556 2518 2360 2202 2104 2007 2054 1861 1723 1729 1744 1759 1648 1296
1525A296m3J01J6j29l8l9o6o7Q5Q6J77o2j91M8N6q8j0J34J07l7j15j15M6M6k5k6o8o7J18k6
$$ 1296 1253 1354 1370 1241 1203 1164 1098 1031 1116 1202 1379 1317 1126 1174 1230 1142 1132 1266 1373 1336 1221 1106 1152 1198 1173 1147 1079 1012 1130 1104
1522A104l5k74o2o2p4J66J03m1Q0o3QRK9L0J01J01r8r7O9P0K1K0n2n1J4J4J4J4n3n3J8J9j9
$$ 1104 1069 795 733 671 597 763 866 825 905 842 850 859 888 918 1019 1120 1022 925 994 1064 1085 1105 1053 1002 1016 1030 1044 1058 1005 952 970 989 970
1519I70j8M4j95L7L7K2K2O7O7n3n3L4L4j73O7lmJ2J1J7J8J7J8O7O7n3n2j07j06J09J09pop
$$ 970 952 996 801 838 875 897 919 986 1053 1000 947 981 1015 842 909 906 902 914 925 942 960 977 995 1062 1129 1076 1024 917 811 920 1029 1022 1016 1009
1516A009pq9q9J27j13n9Q4q3q4NNK0k19Q4Q3O9O9p6p6k2k3P7k11J19J19p5p4K25o2r4J93J4
$$ 1009 1002 913 824 951 838 779 863 780 696 701 706 726 507 591 674 743 812 736 660 638 615 692 481 600 719 644 570 795 733 639 832 846
1513H46J3QQQQj25j25J09j79M0M0j57J29J14j74k28O0nmQ5Q5R3R4j70j70rqR3R4J67j19o0
$$ 846 859 867 875 883 891 766 641 750 571 611 651 494 623 737 563 335 395 390 386 471 556 649 743 573 403 394 386 479 573 740 621 561
1510E61o0j64J23l9l9N5N4N4N4M9N0M9N0J0J0o2o2k1k1R8R8m4m5P5P5j04j05l2l3MMP5P6n6
$$ 561 501 337 460 421 382 437 491 545 599 648 698 747 797 807 817 755 693 672 651 749 847 803 758 833 908 804 699 667 634 638 642 717 793 737
1507G37n6Q2Q2k18P0K8K8K0K1j30j29j55J32l0l0J05J05j4j5%%%%P7P8m2m2k1k1k1k2PQPP
$$ 737 681 763 845 627 697 725 753 773 794 664 535 380 512 482 452 557 662 648 633 633 633 633 633 710 788 746 704 683 662 641 619 626 634 641 648
1504F48k7k7k8k7K2K3J3J3J49NQj35o4Q0rj0n8n8K3K3r6M8j01K34nnL3j10j07L7J15J14m4
$$ 648 621 594 566 539 561 584 597 610 759 764 772 637 573 653 644 634 576 518 541 564 468 516 415 649 644 639 672 562 455 492 607 721 677
1501F77m5j5J29j1j54QPK7K6J7J7Mj40L7j07j13J28P3p0oJ37N7q7J%rrRJ0o3o3l0k9O0q4r4
$$ 677 632 617 746 735 581 589 596 623 649 666 683 687 547 584 477 364 492 565 495 489 626 683 596 597 597 588 579 588 598 535 472 442 413 473 389 295
1498B95N0Q8Q9m9R5n7n7J2J3P6P6j6j59O5j74JJ45M0M0M7r5j5j5PQq3O2M0j03K02l8r1N3L7
$$ 295 345 433 522 473 568 511 454 466 479 555 631 615 456 521 347 348 493 533 573 620 525 510 495 502 510 427 489 529 426 628 590 499 552 589
1495E89L7l3J10L0K9j1j1k0k0J08l6M5M5j12j12N5N5j8j9r9M4L0L1qj52j8j61n1R3J61J60
$$ 589 626 593 703 733 762 751 740 720 700 808 772 817 862 750 638 693 748 730 711 612 656 686 717 709 557 539 378 327 420 581 741
1492G41ppL7j07j06L7K5K5J15k9J1J0o2o1l1J14j44j44J22k2P6o7q9N5l6l5J78J79l7l7q5
$$ 741 734 727 764 657 551 588 613 638 753 724 735 745 683 622 591 705 561 417 539 517 593 526 437 492 456 421 599 778 741 704 619
1489F19q5j74l1J49OR6m8N4r0J35rk8k8j09L5PJ52PQk8k8l6l7%j43J0J0J11J12pqJ3J3j22
$$ 619 534 360 329 478 484 580 532 586 496 631 622 594 566 457 492 499 651 658 666 638 610 574 537 537 394 404 414 525 637 630 622 635 648 526
1486E26J18k4k5r1N3J1J1J64p5n7Q7rrp6p7L5L4P8o6o6P7l1l2j73O8J32j07k9J14m0J04j68
$$ 526 644 620 595 504 557 568 579 743 668 611 698 689 680 604 527 562 596 674 608 542 619 588 556 383 451 583 476 447 561 521 625 457
1483D57k5MMJ3J3Q1Q2j19K5J8J8j08J31rrP8P7p0p1O5j75N1N0J71o9j9k0j9k0j73O6P5o9M7
$$ 457 432 436 440 453 466 547 629 510 535 553 571 463 594 585 576 654 731 661 590 655 480 531 581 752 683 664 644 625 605 432 498 573 504 551
1480E51r6k5k4Q1Q2J0J0l6l6n4R0M9r4j3j4J07l6j9j8oJ39JJr9J42j13j13J4J4j24K0q4J56
$$ 551 455 430 406 487 569 579 589 553 517 463 553 602 508 495 481 588 552 533 515 509 648 649 650 551 693 580 467 481 495 371 391 307 463
1477D63J19k4j46jK8K8J04J04J8j27opJ46Kj67k3m1m1L8L8k5k4l2J11K2K1J06l8k9l0K0K0
$$ 463 582 558 412 411 439 467 571 675 693 566 560 553 699 701 534 511 470 429 467 505 480 456 424 535 557 578 684 646 617 587 607 627
1474F27K0K0p8p7L3L3N8q5O7O7o2o2J0J0n3n3J48Ll5l5K8K7n5n5J51J51M0j03l1J12o3o3m3
$$ 627 647 667 589 512 545 578 636 551 618 685 623 561 571 581 528 475 623 626 591 556 584 611 556 501 652 803 843 740 709 821 758 695 652
1471F52J98J11k23k0j9N1N1o8o9N8N7k51Q4L8L8l7J07O4j74QJ51m6m6l7l7P2P3Q1o3M1M1q8
$$ 652 850 961 738 718 699 750 801 733 664 722 779 528 612 650 688 651 758 822 648 656 807 761 715 678 641 713 786 867 804 845 886 798
1468G98q7L9L9L1L0jj44Q9Q9J11j30L2L3j22L09M9j90k5K15n4n4Q6Q6p6O8J59J6q3K52J59
$$ 798 711 750 789 820 850 849 705 794 883 994 864 896 929 807 1116 1165 975 950 1165 1111 1057 1143 1229 1153 1221 1380 1396 1313 1565 1724
1465A724J60L10L09L75N19N13Q48O83O82O14P58P98O54N05L61j1j56l31l32m77k37k38r4R0
$$ 1724 1884 2194 2503 2878 3397 3910 4758 5441 6123 6737 7495 8293 8947 9452 9813 9802 9646 9315 8983 8506 8269 8031 7937 8027
1463H027R0J07J08J97L41L86J46P8o5k73n11m72m71n52p91p02m62m06o44m18m17m50l07k11
$$ 8027 8117 8224 8332 8529 8870 9256 9402 9480 9415 9142 8631 8159 7688 7136 6345 5643 5181 4775 4131 3713 3296 2846 2539 2328
1461B328l55j84N5j53j53j86N4j77O1Q6j53j70k7J27j8J7J6j36Pj45jJ90n0j72l0J24k0LM
$$ 2328 1973 1789 1844 1691 1538 1352 1406 1229 1290 1376 1223 1053 1026 1153 1135 1152 1168 1032 1039 894 893 1083 1033 861 831 955 935 938 942
1458I42O7O6q5q6J78o1r3N0m5m5L2L1j36PN7j82L3L3q1q0k7k7J49j39K2K3J08J08j38j37j05
$$ 942 1009 1075 990 904 1082 1021 928 978 933 888 920 951 815 822 879 697 730 763 682 602 575 548 697 558 580 603 711 819 681 544 439
1456D39J83K1K1n9n8J3J3R8R9o9o9m5m4J53J53K9k59R5m9Q3o1p1P4p0p0o2o1O2O3J34J34L1
$$ 439 622 643 664 605 547 560 573 671 770 701 632 587 543 696 849 878 619 714 665 748 687 616 690 620 550 488 427 489 552 686 820 851
1453H51L1m1m1j70j69J59j27K8K8Q2Q2p9p8M2M1K5K5K5K5N3N2k29N9ooJ2J2J8J8J8J8J9K0
$$ 851 882 841 800 630 461 620 493 521 549 631 713 634 556 598 639 664 689 714 739 792 844 615 674 668 662 674 686 704 722 740 758 777 797
1450G97j00j01%j%jj8j9N4N3JJr8M6J36j52j51J35M2j01J40kP1p1j8j8J22j65O8O8j5j4j85
$$ 797 697 596 596 595 595 594 576 557 611 664 665 666 568 614 750 598 447 582 624 523 663 661 732 661 643 625 747 582 650 718 703 689 504
1447E04J03N9q4J5J5N6N5L4j09j17J70Q0o4m2m3L5L6j28J11j04M0M4M4M4M4M8r6j5j5q1q1
$$ 504 607 666 582 597 612 668 723 757 648 531 701 781 717 675 632 667 703 575 686 582 622 666 710 754 798 846 750 735 720 639 558
1444E58m8J92q4q4J7J8o8J71J27j7j36PJ9J63j62P7J04l9q6q7J0RP5j64l8J05M5M6j8j7pp
$$ 558 510 702 618 534 551 569 501 672 799 782 646 653 672 835 673 750 854 815 729 642 652 661 736 572 534 639 684 730 712 695 688 681
1441F81KKn2R2J37j98j16K8M6M6m2m1J36J35k11o8N2r2l9l8K21P9j99J36P4j66p4p4lJ41J14
$$ 681 683 685 633 725 862 664 548 576 622 668 626 585 721 856 645 577 629 537 498 460 681 760 561 697 771 605 531 457 454 595 709
1438G09J14m4m5LLpoQ4o1j14J26R9R9j01j01M1M0J1j32k5J20j00r9J45Jj19K5P7P8J46KJ3
$$ 709 823 779 734 737 740 733 727 811 750 636 762 861 960 859 758 799 839 850 718 693 813 713 614 759 760 641 666 743 821 967 969 982
1435I82l22n6Q8L4L4O1q2q5O0K24j5j6j5l0l1J06J06m4m3j55J33K4K5J45j43p1P3J01m4J28
$$ 982 660 604 692 726 760 821 739 654 714 938 923 907 892 862 831 937 1043 999 956 801 934 958 983 1128 985 914 987 1088 1044 1172
1433A172j7Q0P9j45j45Q2Q2l8l8K9K9r0r1m5m6m5m6NOJ4J4j14L0J82j05k4k5m2m2J52J52j60
$$ 1172 1155 1235 1314 1169 1024 1106 1188 1150 1112 1141 1170 1080 989 944 898 853 807 812 818 832 846 732 762 944 839 815 790 748 706 858 1010 850
1430H50j59j7j8N5N5J12J13k16P1%JJ8J9j6j5j36j35J13J14J13J13j15j14NNP3P3%Jjkr1J96
$$ 850 691 674 656 711 766 878 991 775 846 846 847 865 884 868 853 717 582 695 809 922 1035 920 806 811 816 889 962 962 963 962 960 869 1065
1427A065nmm1m0k55L3j71J16J07J07r0r0J92J92n4n4k33N4O0O1K9L0m3m2o5o4o5o5Q2Q2l8
$$ 1065 1060 1056 1015 975 720 753 582 698 805 912 822 732 924 1116 1062 1008 775 829 889 950 979 1009 966 924 859 795 730 665 747 829 791
1424G91l7N2N2k0k0OPklJ03m2j31J56J18k6m7m7J1J2poJ34j53o4Q0n2R0K8K8o6P8j02J85L6
$$ 791 754 806 858 838 818 824 831 829 826 929 887 756 912 1030 1004 957 910 921 933 926 920 1054 901 837 917 865 955 983 1011 945 1023 921 1106 1142
1421A142j08RQr6J90jj44j3J31M1M1k6k6M7M6N5N5o4o5rrrrO6O6LMr1N3J34j53o8o8L4L4l2
$$ 1142 1034 1043 1051 955 1145 1144 1000 987 1118 1159 1200 1174 1148 1195 1241 1296 1351 1287 1222 1213 1204 1195 1186 1252 1318 1321 1325 1234 1287 1421 1268 1200 1132 1166 1200 1168
1417A168l1M0M0ooJ14J13p6p6p6p6R8R7R2j96N5N6N5N6p7K11m0m1J21j66nnlmJ59j30J5J5
$$ 1168 1137 1177 1217 1211 1205 1319 1432 1356 1280 1204 1128 1226 1323 1415 1219 1274 1330 1385 1441 1364 1575 1535 1494 1615 1449 1444 1439 1436 1432 1591 1461 1476 1491
1414A491j74J14R5m8k27q4nK83o7o7j08J80J8J9L5L6l6l7k8k9J39J39l6l6Q4Q4k2k3r4r4P3
$$ 1491 1317 1431 1526 1478 1251 1167 1162 1445 1378 1311 1203 1383 1401 1420 1455 1491 1455 1418 1390 1361 1500 1639 1603 1567 1651 1735 1713 1690 1596 1502 1575
1412A575P2P3P3q8q7L2L2J09J09n9n8l7l7L5L5rqJ26j7o7K21J10j77m3K45J2J1K17p0o1Q3
$$ 1575 1647 1720 1793 1705 1618 1650 1682 1791 1900 1841 1783 1746 1709 1744 1779 1770 1762 1888 1871 1804 2025 2135 1958 1915 2160 2172 2183 2400 2330 2269 2352
1409B352O4O5P3P4o9o9LLJ52J52o3o4J13J13l6l7mK83j7j6J78j09K14P1j09L6O5O5l8l8l8
$$ 2352 2416 2481 2554 2628 2559 2490 2493 2496 2648 2800 2737 2673 2786 2899 2863 2826 2822 3105 3088 3072 3250 3141 3355 3426 3317 3353 3418 3483 3445 3407 3369
1406C369l8J24J25r1r1Q4Q4j02j01R0j97j08j07M8M8p2p1J08J09j2j1j00j01K0J9Q8Q7J23
$$ 3369 3331 3455 3580 3489 3398 3482 3566 3464 3363 3453 3256 3148 3041 3089 3137 3065 2994 3102 3211 3199 3188 3088 2987 3007 3026 3114 3201 3324
1403C324J24L9L8J11J11J4J5Q7Q6P1P0J51J51m8R5j47J41Q3Q4J56J55K64k4J38J38K38K38
$$ 3324 3448 3487 3525 3636 3747 3761 3776 3863 3949 4020 4090 4241 4392 4344 4439 4292 4433 4516 4600 4756 4911 5175 5151 5289 5427 5665 5903
1401E903J66J66J91J90N3N2k80K00o5K24K71K71K5K6K17K17L37L36M3M3L06L06L51L51M05
$$ 5903 6069 6235 6426 6616 6669 6721 6441 6641 6576 6800 7071 7342 7367 7393 7610 7827 8164 8500 8543 8586 8892 9198 9549 9900 10305
1399A0305M05K55N42K72N60M12O99P56O12P76P76P68P67R69R69R10J196J190R02J282J426
$$ 10305 10710 10965 11507 11779 12339 12751 13450 14206 14818 15594 16370 17138 17905 18874 19843 20753 21949 23139 24041 25323 26749
1397B6749J668J956J913K201K426K569L081L368L099L770L865M153M670M957N472O717P606
$$ 26749 28417 30373 32286 34487 36913 39482 42563 45931 49030 52800 56665 60818 65488 70445 75917 82634 90240
1395I0240R043J1114J3509J6730K1424K8332L7431M9379O4417Q2459J03435J23445J35992
$$ 90240 99283 110397 123906 140636 162060 190392 227823 277202 341619 424078 527513 650958 786950
1394G86950J36963J30928J24274J20348J13379R2596N7235O376m6842p5096j02890j24248
$$ 786950 923913 1054841 1179115 1299463 1412842 1505438 1562673 1569049 1522207 1447111 1344221 1219973
1393A219973j19089j12672j14524j10982r8505q8066p9733p2167o3019n4304m6824m0598l3666
$$ 1219973 1100884 988212 873688 762706 664201 576135 496402 424235 361216 306912 260088 219490 185824
1392A85824k5717j9251j5133j2236j0033q491p055o133n462n115m637m328m184l831l544l403
$$ 185824 160107 140856 125723 113487 103454 94963 87908 81775 76313 71198 66561 62233 58049 54218 50674 47271
1390D7271l116k927k927k655k368k340k196j739j738j730j442j178j179p79m92j87J01P77
$$ 47271 44155 41228 38301 35646 33278 30938 28742 27003 25265 23535 22093 20915 19736 18957 18465 18278 18379 19156
1389A9156J257K010K681L014L301L293L292K969K826K379J518J66j079k186k857l504l503
$$ 19156 20413 22423 25104 28118 31419 34712 38004 40973 43799 46178 47696 47862 46783 44597 41740 38236 34733
1387C4733l312l312l197k911k664k378k197j911j647j360j205r18o22m79n53k65k75j31l08
$$ 34733 31421 28109 24912 22001 19337 16959 14762 12851 11204 9844 8639 7721 7099 6620 6067 5802 5527 5396 5088
1385E088j65l39l38J90k89p3p4k49L8o1k04P0k18k18p4j28j29m7m7l9l8n9k03j19J68r2r3
$$ 5088 4923 4584 4246 4436 4147 4074 4000 3751 3789 3728 3524 3594 3376 3158 3084 2956 2827 2780 2733 2694 2656 2597 2394 2275 2443 2351 2258
1383B258J61j27m5m6l6j79O3k25k9l0m8m8K8K8j87j88J10J10k19O9p2p1J8J9J50J50K22K22
$$ 2258 2419 2292 2247 2201 2165 1986 2049 1824 1795 1765 1717 1669 1697 1725 1538 1350 1460 1570 1351 1420 1348 1277 1295 1314 1464 1614 1836 2058
1380B058M09M09P20P21Q20Q21Q20Q21Q71Q72M67L24k7n05l95o82p59p60r39o53o56o57n84
$$ 2058 2467 2876 3596 4317 5137 5958 6778 7599 8470 9342 9809 10133 10106 9601 9206 8524 7765 7005 6066 5413 4757 4100 3516
1378C516k98k86k87j97j96j10j10J53J53L1L1J98J98K29K28J56J57J82J83L02L02O15O16O15
$$ 3516 3218 2932 2645 2448 2252 2142 2032 2185 2338 2369 2400 2598 2796 3025 3253 3409 3566 3748 3931 4233 4535 5150 5766 6381
1376F381O15P11P10P05M18K48K49p2l59o08p51r22o34o78o78n88n88m08m09m08m09k75k75
$$ 6381 6996 7707 8417 9122 9540 9788 10037 9965 9606 8998 8247 7325 6691 6013 5335 4747 4159 3751 3342 2934 2525 2250 1975
1374A975j08j08lmp5p6m4m4j15j16j1j0j73J15J8J8j32j32RRj11j11kkjkK7K7r2r3o4o4N5
$$ 1975 1867 1759 1756 1752 1677 1601 1557 1513 1398 1282 1271 1261 1088 1203 1221 1239 1107 975 984 993 882 771 769 767 766 764 791 818 726 633 569 505 560
1371E60N6K1K1r9r9P8P7r0q9J4J5n7K31L14j65j29J59J27j61j33J0P1P2QRK9K9K8K9k5k5k5
$$ 560 616 637 658 559 460 538 615 525 436 450 465 408 639 953 788 659 818 945 784 651 661 732 804 812 821 850 879 907 936 911 886 861
1368H61k5J19J18r7r7noj25j26J00R9j16j16k9k9j01j01Q2Q1l8l8J64J64n2n2j0j1Q8n6j01
$$ 861 836 955 1073 976 879 874 868 743 617 717 816 700 584 555 526 425 324 406 487 449 411 575 739 687 635 625 614 702 646 545
1365E45J87P6k12r3J94J5J5j4j4q6q5MNK38n0j11j10L3k55J15J15J60p9K1K1j38OK9J72J4
$$ 545 732 808 596 503 697 712 727 713 699 613 528 532 537 775 725 614 504 537 282 397 512 672 593 614 635 497 503 532 704 718
1363G18j30j3j4N0N0q5q4m6R8m1m1M9r5J09J08L7L7j33J2m6R8J21j18m7m7M8M7N7q8L7L7J09
$$ 718 588 575 561 611 661 576 492 446 544 503 462 511 416 525 633 670 707 574 586 540 638 759 641 594 547 595 642 699 611 648 685 794
1360G94l4r7r6k4K15j70j70o9P5j3j3mmM9M9qqk13K7J2J1J52J51o4o4m2m1L0L0mmQ5n8j51
$$ 794 760 663 567 543 758 588 418 349 424 411 398 394 390 439 488 480 472 259 286 298 309 461 612 548 484 442 401 431 461 457 453 538 480 329
1357C29pL2L1l5J07L6L6p0P4qpl5l5l4l5n1n1J37j98O0N9L0J73J5J4K4K3j04j04M9r5j9j8
$$ 329 322 354 385 350 457 493 529 459 533 525 518 483 448 414 379 328 277 414 216 276 335 365 538 553 567 591 614 510 406 455 360 341 323
1354C23J72L0j36j35J05m0o6o6R2R2K0K0n1n2J3J2o8P6n7n6K4K5OPPON6N5l4K53j27j27l7
$$ 323 495 525 389 254 359 319 253 187 279 371 391 411 360 308 321 333 265 341 284 228 252 277 283 290 297 303 359 414 380 633 506 379 342
1351C42l7K8K8K8K7j20j20%jJ19J18jjJ2J2J3J2j06j06j6j6j13J74Q4Q4J03J03J93r5j02j02
$$ 342 305 333 361 389 416 296 176 176 175 294 412 411 410 422 434 447 459 353 247 231 215 102 276 360 444 547 650 843 748 646 544
1348E44m8m8l0l0m8m8J89r9O3O3j0rk90mO6O5J26j62L8L8KKJ61j27L5L5rrO3O3q6q5Q2Q3l7
$$ 544 496 448 418 388 340 292 481 382 445 508 498 489 199 195 261 326 452 290 328 366 368 370 531 404 439 474 465 456 519 582 496 411 493 576 539
1345E39l6L5L6M1M2j3j2n1K36j5j5R9j89R3R2%jk35N4J05J05J24J23k7k8M4M4J01J01J73J73
$$ 539 503 538 574 615 657 644 632 581 817 802 787 886 697 790 882 882 881 646 700 805 910 1034 1157 1130 1102 1146 1190 1291 1392 1565 1738
1342A738K23K24K06K05L12K5K40N28N54N55P10J189J690J690J661J947J745J457J594J595
$$ 1738 1961 2185 2391 2596 2908 2933 3173 3701 4255 4810 5520 6709 8399 10089 11750 13697 15442 16899 18493 20088
1340B0088J132M62l11r80j350j637j733j733j518j517j464j176j105j106q24q24n97n96k20
$$ 20088 21220 21682 21371 20391 19041 17404 15671 13938 12420 10903 9439 8263 7158 6052 5228 4404 3807 3211 2991
1338B991n07k31k32j6l03p9p9r6r7pqj68J18KKj30j30j38J50j14j15j50J38r6r7KKj18j18
$$ 2991 2484 2253 2021 2005 1702 1623 1544 1448 1351 1344 1336 1168 1286 1288 1290 1160 1030 892 1042 928 813 663 801 705 608 610 612 494 376
1336C76Q3Q3Q3Q2q5q6q6q6K3K2n0n0J33J33l4l5n3n2JJJ03j85J63J63j85J03n9n9k0j9k0j9
$$ 376 459 542 625 707 622 536 450 364 387 409 359 309 442 575 541 506 453 401 402 403 506 321 484 647 462 565 506 447 427 408 388 369
1333C69J02J02j14j14RRRRL6L6l6l6K8K8K9K8q1q1L9L8k2k2M9N0oonoK6K5m6m6mmO8O8K1K1
$$ 369 471 573 459 345 354 363 372 381 417 453 417 381 409 437 466 494 413 332 371 409 387 365 414 464 458 452 447 441 467 492 446 400 396 392 460 528 549 570
1329E70K2K1N6N5N6N6J4J4J04m0J48K92K0j23j47j46m4m5P6o9p7O6J1j32j39NQ1j58j46lj12
$$ 570 592 613 669 724 780 836 850 864 968 928 1076 1368 1388 1265 1118 972 928 883 959 890 813 879 890 758 619 624 705 547 401 398 286
1327B86K23M4M3p8p7Q1Q0l2j76P3P2poq8N6j4j4J48MK6K7L5j08q3O1J23k0N8N8q0q0K13P0
$$ 286 509 553 596 518 441 522 602 570 394 467 539 532 526 438 494 480 466 614 618 644 671 706 598 515 576 699 679 737 795 715 635 848 918
1324I18j13j13M7M7q7J52N2N2MML1J75MJ48K44J01M12J72L54N93O74Q17P55P55O83O83N93
$$ 918 805 692 739 786 699 851 903 955 959 963 994 1169 1173 1321 1565 1666 2078 2250 2604 3197 3871 4688 5443 6198 6881 7564 8157
1321H157M49J00j40k00m40n02o46n73n72p08m67n93m48m43m43k09k09k09k10k22k22j02j02
$$ 8157 8606 8706 8566 8366 7926 7424 6778 6205 5633 4925 4458 3865 3417 2974 2531 2322 2113 1904 1694 1472 1250 1148 1046
1319A046j53j53O2O3l3l3l2l3K1K1j8j61J6J5POklj1J32m2m2k4k4j11L3Q7j53n0n0PPR4R4
$$ 1046 893 740 802 865 832 799 767 734 755 776 758 597 613 628 635 641 639 636 625 757 715 673 649 625 514 547 634 481 431 381 388 395 489 583
1316E83j1j1q5J54j23J15O9p4K1K1l4l4l5l4P6P6r1r1r5r5J69J69lmllp7p6mnjkjkr5r5M0
$$ 583 572 561 476 630 507 622 691 617 638 659 625 591 556 522 598 674 583 492 397 302 471 640 637 633 630 627 550 474 470 465 464 462 461 459 364 269 309
1313C09L9k16K3M2j03J14J14M8M8j22J19kjj10J30J47Mj77j77P8P7J3J3n9n9L0K9L0K9O4O3
$$ 309 348 132 155 197 94 208 322 370 418 296 415 413 412 302 432 579 583 406 229 307 384 397 410 351 292 322 351 381 410 474 537
1310E37qqr6r5K5K4lmmmJ4J4m8J90n0n1l6l6M1M0m0m0J08l5j53Q8j24K0Q9j51J04J05l1l0
$$ 537 529 521 425 330 355 379 376 372 368 364 378 392 344 534 484 433 397 361 402 442 402 362 470 435 282 370 246 266 355 204 308 413 382 352
1307C52k2k1N1N0L1L0K2K1k1j66J40j00p6K10j01k45J6J6J27J26L3L4l9l8j34j34J29J29O2
$$ 352 330 309 360 410 441 471 493 514 493 327 467 367 291 501 400 155 171 187 314 440 473 507 468 430 296 162 291 420 482
1304D82O3j36j35j42J44Q5Q5Q5k03M0j03K6K7L5L5j49J38M9r6J50Pr0q9Q8Q9q0p9NMNMm2m1
$$ 482 545 409 274 132 276 361 446 531 328 368 265 291 318 353 388 239 377 426 330 480 487 397 308 396 485 405 326 331 335 340 344 302 261
1301B61m2m2J9K0J18k5o2K25q9k33K03N9j17K6O8O8MNj21j20PQm1J02J11j76OPj2j2N0M9m9
$$ 261 219 177 196 216 334 309 247 472 383 150 353 412 295 321 389 457 461 466 345 225 232 240 199 301 412 236 242 249 237 225 275 324 275
1298B75R4J51j36l7l8N4N5j8j8l5l6L7L6m3m4K9K8l1l1J36J36j01j02O6O6j57j57N8N9O1O2
$$ 275 369 520 384 347 309 363 418 400 382 347 311 348 384 341 297 326 354 323 292 428 564 463 361 427 493 336 179 237 296 357 419
1295D19O1O1j06j06J09J10o9o9p0o9R6R5rrj55Q5J48j87k2J23J01m2j1j1k0k0o6o6K03l6j66
$$ 419 480 541 435 329 438 548 479 410 340 271 367 462 453 444 289 374 522 335 313 436 537 495 484 473 453 433 367 301 504 468 302
1292C02P4N8j80J11J11l9l8O6j73n4J86m6m6Q9Q9l8l7l7l7OOlJ41q9r0J29j5o9P5K01l9j44
$$ 302 376 434 254 365 476 437 399 465 292 238 424 378 332 421 510 472 435 398 361 367 373 370 511 422 332 461 446 377 452 653 614 470
1290D70jj05L8J9J9J9J8P1p3kJ43M3M4l04L1K3K3l6J06J1J1R2n2l1j75l2l2M4M3M3M3j86j85
$$ 470 469 364 402 421 440 459 477 548 475 473 616 659 703 399 430 453 476 440 546 557 568 660 608 577 402 370 338 382 425 468 511 325 140
1287A40K12k7L3L3p2P2L3j10N2N1P4P4m6m5j25j25J50j85m1J98J3j31KJ46j5j6j05j05K03
$$ 140 352 325 358 391 319 391 424 314 366 417 491 565 519 474 349 224 374 189 148 346 359 228 230 376 361 345 240 135 338
1284C38j32R7R7j87N2J24k0j24J9O8O7L8j06M6M7l4l4p0o9N0N0o3o4L8L26q8q8KKQ6Q6q2q2
$$ 338 206 303 400 213 265 389 369 245 264 332 399 437 331 377 424 390 356 286 217 267 317 254 190 228 554 466 378 380 382 468 554 472 390
1281C90NMo7o7K3K2K3K3K1K2K1K2j9j9j9j9j3j2q5q5J9J8R0R1K2K3J30j56j90R7R8j90r8J89
$$ 390 395 399 332 265 288 310 333 356 377 399 420 442 423 404 385 366 353 341 256 171 190 208 298 389 411 434 564 408 218 315 413 223 125 314
1278C14qqJ13j75N9N9j6j6j6j6p9p9M1M1O7O7j12J75J27j60K0J9m5m5K6K7M7M8j14J73r4r4
$$ 314 306 298 411 236 295 354 338 322 306 290 211 132 173 214 281 348 236 411 538 378 398 417 372 327 353 380 427 475 361 534 440 346
1275C46K6K6L9k48Q1Q1P1P1J6J7j52J35M5M5O4O4O4O4k5k4M7M8l8l7Q2Q2j75j76pqq3q3L6
$$ 346 372 398 437 189 270 351 422 493 509 526 374 509 554 599 663 727 791 855 830 806 853 901 863 826 908 990 815 639 632 624 541 458 494
1272D94L7o8o9K2K1q8K00q2q2m1m0L2L1Q3Q2l7l8OPOOM5M5j13j13m3J00j29J09J23j17o9P5
$$ 494 531 463 394 416 437 349 549 467 385 344 304 336 367 450 532 495 457 463 470 476 482 527 572 459 346 303 403 274 383 506 389 320 395
1269C95J41j94R2n0k2J22L2L2o5o5J45Jq9N4j69O9K5K5M0M0n6n5O5O4j04j05l3l3n8n9K17
$$ 395 536 342 434 384 362 484 516 548 483 418 563 564 475 529 360 429 454 479 519 559 503 448 513 577 473 368 335 302 244 185 402
1266D02j19j27J12nJ39O1O0q9r0j08L5j36QJ98N4o5P8L3j10j40R9p1J68j4j4m5R8J52q7NN
$$ 402 283 156 268 263 402 463 523 434 344 236 271 135 143 341 395 330 408 441 331 191 290 219 387 373 359 314 412 564 477 482 487
1263D87j45R5m9m9k4j69J15J14P3j67N4N3L8L9q4q3r3N2rqj35J05P8P7k8k7poKLOJ50llJ4
$$ 487 342 437 388 339 315 146 261 375 448 281 335 388 426 465 381 298 205 257 248 240 105 210 288 365 337 310 303 297 299 302 308 458 455 452 466
1260D66J3p6O8J3j31m1m1K5K5o5o5J53j33R9J00l7l6l7l7jkP0P0p4p3k0K68p2p3l6l6q9J99
$$ 466 479 403 471 484 353 312 271 296 321 256 191 344 211 310 410 373 337 300 263 262 260 330 400 326 253 233 501 429 356 320 284 195 394
1257C94l4l5o3o4J52J53J1J2j09j08K0K1n2n1j0rj0j0J2J1J1J1O1O0n9n9L4L4J96r2m3m4m4
$$ 394 360 325 262 198 350 503 514 526 417 309 329 350 298 247 237 228 218 208 220 231 242 253 314 374 315 256 290 324 520 428 385 341 297
1254B97m4m5K42RRm7m7m7m6N7N7N7N7o5o6j2j1J79j08j9j8k8k7j89R8k3k3onQ4Q4l5l5lkO9
$$ 297 253 208 450 459 468 421 374 327 281 338 395 452 509 444 378 366 355 534 426 407 389 361 334 145 243 220 197 191 186 270 354 319 284 281 279 348
1251C48P0j6j6j6j6K3K3R5R4j34j34l3K55j12j13K5K5j3j2j2j3j9j8P1P1r0J97j33j32MMM
$$ 348 418 402 386 370 354 377 400 495 589 455 321 288 543 431 318 343 368 355 343 331 318 299 281 352 423 333 530 397 265 269 273 277
1248B77Mn4n5J14J13o0n9J2J2NNNMN4N4q0q1L6k04R9R9jjkjq4q3P5P5K09O5l14K0P0p4K0J9
$$ 277 281 227 172 286 399 339 280 292 304 309 314 319 323 377 431 351 270 306 102 201 300 299 298 296 295 211 128 203 278 487 552 238 258 328 254 274 293
1245B93J60J6k05L5Q1Q1K4K4o7o7J49J49j28j27j28j28Q9Q9j42j42K33pp3P1K8K7L7L6j7j7
$$ 293 453 469 264 299 380 461 485 509 442 375 524 673 545 418 290 162 251 340 198 56 289 282 209 280 308 335 372 408 391 374
1242C74j8j7k8k8P7P7J9k21L4L3k9k9R0R1mmmmJ4J4Pj36J35j04J47r3P9o5p1P3j04M0M8M9
$$ 374 356 339 311 283 360 437 456 235 269 302 273 244 334 425 421 417 413 409 423 437 444 308 443 339 486 393 472 407 336 409 305 345 393 442
1239D42j04L8J80o0k22J8m5R9L8L8p2p3R2R2K0K0l5l6L6L6j0j1q2q2M8M8M8M8r7r7K2K3l6
$$ 442 338 376 556 496 274 292 247 346 384 422 350 277 369 461 481 501 466 430 466 502 492 481 399 317 365 413 461 509 412 315 337 360 324
1236C24l6J17k6LLooJ5J5J5J6L0L0r0r0O4O3j04j04J11J11qrK0J9j33J1NMJ4J3jkq2O1r4r4
$$ 324 288 405 379 382 385 379 373 388 403 418 434 464 494 404 314 378 441 337 233 344 455 447 438 458 477 344 355 360 364 378 391 390 388 306 367 273 179
1232A79J69p1l8l9N7N8J23k1j07j08P3P2l8l8n1R2J1J1J15J14j40J00N9N9j50j50M6r6J03
$$ 179 348 277 239 200 257 315 438 417 310 202 275 347 309 271 220 312 323 334 449 563 423 523 582 641 491 341 387 291 394
1230C94J04o9o8LMJ6J6o5P9m2m2J01j38K7K7J01m2j44%M4M5j56Q3K1k19L6J79J58k73P2P2
$$ 394 498 429 361 364 368 384 400 335 414 372 330 431 293 320 347 448 406 262 262 306 351 195 278 299 80 116 295 453 180 252 324
1227C24p4p5J56J55r2r3r5J44Q2j58p4P0R4R3n6n6Q7n6k2j65M1J85o0o0K2j23J14k9M2M2L4
$$ 324 250 175 331 486 394 301 206 350 432 274 200 270 364 457 401 345 432 376 354 189 230 415 355 295 317 194 308 279 321 363 397
1224C97L4M3j00l9m0P2P2l3l3o3J77P0j69k8k8J04l9j10L3K5K5L5L4L0L0p2P2J68j68j32J2
$$ 397 431 474 374 335 295 367 439 406 373 310 487 557 388 360 332 436 397 287 320 345 370 405 439 469 499 427 499 667 499 367 379
1221C79L2j12j48J88R1n2N9N9j30J4o7o7N2N3j63P7J42lp4p3%JP3P3nnO6O7J0J0o2o2k3k3
$$ 379 411 299 151 339 430 378 437 496 366 380 313 246 298 351 188 265 407 404 330 257 257 258 331 404 399 394 460 527 537 547 485 423 400 377
1218C77m6R7J03j36kJ42j02j02P5P5J0Rk01n6J96N2j06L8l3l3R6R6p8p9p8p9N9O0l1J13J82
$$ 377 331 428 531 395 393 535 433 331 406 481 491 500 299 243 439 491 385 423 390 357 453 549 471 392 314 235 294 354 323 436 618
1215F18L8k17p2j5j4k7k6J26k10r2N1J02K45r0q9Q3Q3p0P4j03j02P4P4m2m1n1R3QQJ6J7q0
$$ 618 656 439 367 352 338 311 285 411 201 109 160 262 507 417 328 411 494 424 498 395 293 367 441 399 358 307 400 408 416 432 449 369
1213C69q1K01q6o4o4L8L8K3K3m8m9j0rJ10J10k9k9j19J69j01j01j1j1O1O0j2j2k5k5k5k5P0
$$ 369 288 489 403 339 275 313 351 374 397 349 300 290 281 391 501 472 443 324 493 392 291 280 269 330 390 378 366 341 316 291 266 336
1210C36P1jkn9o0J2J2P8P7ONr9j00k7k7J4J4O8O8Q6k02J94r4m5m6QQJ9J9J8J9L6L7q3q3m4
$$ 336 407 406 404 345 285 297 309 387 464 470 475 376 276 249 222 236 250 318 386 472 270 464 370 325 279 287 295 314 333 351 370 406 443 360 277 233
1206B33m4J23J24k5k5k5k4k5k5M8M7J2J1J2J2o1o2J0J1j4j4N9N8MNo8o7k9k9R1R1q3q3Q5Q5
$$ 233 189 312 436 411 386 361 337 312 287 335 382 394 405 417 429 368 306 316 327 313 299 358 416 420 425 357 290 261 232 323 414 331 248 333 418
1203D18q2q2Q6Q5l2l3l3l2O9O8j64J22l9l9j11J77L4L4N2N3n3n2j25j24K6K7K6K6%jQ0o3k
$$ 418 336 254 340 425 393 360 327 295 364 432 268 390 351 312 201 378 412 446 498 551 498 446 321 197 223 250 276 302 302 301 381 318 316
1200C16jk8J15J5j28O6O6L8k01J34rlmj2j3POp4O9J83J83p2p2q7q7j5j5m9m8j8J25kj47J6
$$ 316 315 287 402 417 289 355 421 459 258 392 383 380 376 364 351 358 364 290 359 542 725 653 581 494 407 392 377 328 280 262 387 385 238 254
1197B54J5K6K6J22k2j73O8J24k0j9k0j09L4m4m4L7L6R8R8J1J2K7k12l8J06KKn2J88k4k5P2
$$ 254 269 295 321 443 421 248 316 440 420 401 381 272 306 262 218 255 291 389 487 498 510 537 325 287 393 395 397 345 533 509 484 556
1194E56p2n5n4M8M7K6j18N3r1j21K3R2R1L5j10J60j76J5J5poM1M1M9N0j00M4m6R8n5n5J7J7
$$ 556 484 429 375 423 470 496 378 431 340 219 242 334 425 460 350 510 334 349 364 357 351 392 433 482 532 432 476 430 528 473 418 435 452
1191D52O6p7LMm2m3L0L0l3l3l3l3M0M0M1j04J06l7q3J57r2J94R0j97k1k1k1k0j08J80J08j80
$$ 452 518 441 444 448 406 363 393 423 390 357 324 291 331 371 412 308 414 377 294 451 359 553 643 446 425 404 383 363 255 435 543 363
1188C63N6N5l4l4l8l7L4L4l2l3j23J64K2K2j21J65k4k4p9p8Q1Q0l9l9m0l9L3L2O8O8mmr4r4
$$ 363 419 474 440 406 368 331 365 399 367 334 211 375 397 419 298 463 439 415 336 258 339 419 380 341 301 262 295 327 395 463 459 455 361 267
1185B67J22J21q1q2j72J16K1K1M0L9j03j03l1l1J17J18llN2N2j82J06L5L5j8j9m6m7m6m6P9
$$ 267 389 510 429 347 175 291 312 333 373 412 309 206 175 144 261 379 376 373 425 477 295 401 436 471 453 434 388 341 295 249 328
1182C28Q0K5K6j45J42j9j9l2l3L9L9ppp9p9L6L7L6L6L1L0r0q9L6L7L6L6J1J1r1r0j14J74K64
$$ 328 408 433 459 314 456 437 418 386 353 392 431 424 417 338 259 295 332 368 404 435 465 375 286 322 359 395 431 442 453 362 272 158 332 596
1179E96k3k55L3J17J16r4r4K5K6J5J5j47J41m4m3j1j0j01J39J39j00o3o3O8O9J42j93mmk3
$$ 596 573 318 351 468 584 490 396 421 447 462 477 330 471 427 384 373 363 262 401 540 440 377 314 382 451 593 400 396 392 369
1177C69k2k2k3R9J00J23j17j09L5N9N8j10j10J0J0L9M0q0q0J8J8Q1Q1m3j87p4J67K4K4L9L9
$$ 369 347 325 302 401 501 624 507 398 433 492 550 440 330 340 350 389 429 349 269 287 305 386 467 424 237 163 330 354 378 417 456
1174D56KJk05L5l4l5J49J48m5m5m4m5O9O9llj2j1q4q4L3L4K4K4J60J7k67k9K13k6m5m5k5k5
$$ 456 458 459 254 289 255 220 369 517 472 427 383 338 407 476 473 470 458 447 363 279 312 346 370 394 554 571 304 275 488 462 417 372 347 322
1171C22k5k5P3P3KJo0o0J2J2m1m2K2K2P7o7j12K24Q1o3o3Q1R0k45K4K4j9j8j8j9M3M3O7p7
$$ 322 297 272 345 418 420 421 361 301 313 325 284 242 264 286 363 296 184 408 489 426 363 444 534 289 313 337 318 300 282 263 306 349 416 339
1168C39p3J66m9m9J0J1J0J1K2K3K2K3k0j9k0j9K4K5K4K5r2r2P5P6p6p5M4M4l2l2J30j58j0
$$ 339 266 432 383 334 344 355 365 376 398 421 443 466 446 427 407 388 412 437 461 486 394 302 377 453 377 302 346 390 358 326 456 298 288
1165B88j1R2R1l8l9L3L3M9M9k3k4k4k5k4k5M3M4k9k8k6k5k6k5K2K2R5R4r6r6j5j5j9J25Q5
$$ 288 277 369 460 422 383 416 449 498 547 524 500 476 451 427 402 445 489 460 432 406 381 355 330 352 374 469 563 467 371 356 341 322 447 532
1161E32k02L2L2n8n8J9K0R2R1n2n2J1J1Q0o3k07Q0k1J22O8p5o3o4j14J73k3k3nnk1k1R9R8
$$ 532 330 362 394 336 278 297 317 409 500 448 396 407 418 498 435 228 308 287 409 477 402 339 275 161 334 311 288 283 278 257 236 335 433
1158D33q7q7j5j5N3N3N3N3LMLMj7j7q0O4j42J46Q3o0j24J9j6j6J81j06r8M7rj0J71j18n2R1
$$ 433 346 259 244 229 282 335 388 441 444 448 451 455 438 421 341 405 263 409 492 432 308 327 311 295 476 370 272 319 310 300 471 353 301 392
1155C92j79J09R1n3J27j6mlj2j3n8n8O1O2j2j2p5p5M1J84j03J36l6l5l6l6N4j85O9O9rqJ44
$$ 392 213 322 413 360 487 471 467 464 452 439 381 323 384 446 434 422 347 272 313 497 394 530 494 459 423 387 441 256 325 394 385 377 521
1152E21%k7k6j17K7K6K6k8k9j04L9J11l3k6k7j07J32L3j09J47Mj27J6P0p4Q8n4PJ52K6K6p0
$$ 521 521 494 468 351 378 404 430 402 373 269 308 419 386 360 333 226 358 391 282 429 433 306 322 392 318 406 352 359 511 537 563 493
1150D93p0J7K56r4r3o0n9j94M5P3P3j82N8J44r5P0P0q7J52j6k55J45J44j18K5p5p4J02J02
$$ 493 423 440 696 602 509 449 390 196 241 314 387 205 263 407 312 382 452 365 517 501 246 391 535 417 442 367 293 395 497
1147D97j12j12J7J7k1J22K0K1J99j37q3q2J89n0J03m2j39LJ63J8q1q2r9M4L1L0r5J45n3n2
$$ 497 385 273 290 307 286 408 428 449 648 511 428 346 535 485 588 546 407 410 573 591 510 428 329 373 404 434 339 484 431 379
1144C79L4L4o6o6J02J01n1n1o0Q4m5m5n1n1J19j21NNJ57J2j46kl2J12M1M0J6J7j19j18J50
$$ 379 413 447 381 315 417 518 467 416 356 440 395 350 299 248 367 246 251 256 413 425 279 277 245 357 398 438 454 471 352 234 384
1141C84q9N5N5j63j8J22K66m0j84pJ37J2J2n0n0m7m6m6m6R5R5k6k5l3l3j13K9Q6Q5J78o1k28
$$ 384 295 350 405 242 224 346 612 572 388 381 518 530 542 492 442 395 349 303 257 352 447 421 396 363 330 217 246 332 417 595 534 306
1138C06J08k3k4k5k5Q5Q6j9j62Qj35J6J60Q5j55L5L4J67J66J28k08k26J4n1n1K1K1J27j12
$$ 306 414 391 367 342 317 402 488 469 307 315 180 196 356 441 286 321 355 522 688 816 608 382 396 345 294 315 336 463 351
1136C51o8P7J67K3j26J8n4Q9J8J7o0o1p8O5Q7n6J78o2r1N3m3m3j4j5k3k4J51QJ1j33j47lO6
$$ 351 283 360 527 550 424 442 388 477 495 512 452 391 313 378 465 409 587 525 434 487 444 401 387 372 349 325 476 484 495 362 215 212 278
1133B78O6P8o7K4j21L6L5J16k7p3P0j00M4j2j1P8o6m0m1o4J75J19J20m8j92n6n5N4N5L7L7
$$ 278 344 422 355 379 258 294 329 445 418 345 415 315 359 347 336 414 348 308 267 203 378 497 617 569 377 321 266 320 375 412 449
1130D49kj45k0k0R0R1m7m7P3P3llO9O9r7r7p3J66j6j60K5j18l8J04PON6q7ppo3o4N7N6P3P3
$$ 449 447 302 282 262 352 443 396 349 422 495 492 489 558 627 530 433 360 526 510 350 375 257 219 323 330 336 392 305 298 291 228 164 221 277 350 423
1127D23j66k3M0J84L4j09j09L4N0M9J26j13K1K1o4o4J4J57k2j66L5L5L2j11O5p9o9J69J2J1
$$ 423 257 234 274 458 492 383 274 308 358 407 533 420 441 462 398 334 348 505 483 317 352 387 419 308 373 294 225 394 406 417
1124D17N0j89o7K69j40MO3O4qpp1p0K7J71RRL3j10k0k1q6N7O7p8l2J11L1j13onj5j4j4j4J06
$$ 417 467 278 211 480 340 344 407 471 463 456 385 315 342 513 522 531 564 454 434 413 327 384 451 373 341 452 483 370 364 359 344 330 316 302 408
1121D08J06j32j32Q3Q4m1m0o4P9K23j6q9q8J1J1o0o1%JJ20J21k3k3k3k3m4m4m3m4R1R2j40
$$ 408 514 382 250 333 417 376 336 272 351 574 558 469 381 392 403 343 282 282 283 403 524 501 478 455 432 388 344 301 257 348 440 300
1118C00Nj42J45M7M6J45j42j43J45l5l4l5l5K12p7K3K3j94n1J98r0P4P4j5j6k8k8O2k25J1
$$ 300 305 163 308 355 401 546 404 261 406 371 337 302 267 479 402 425 448 254 203 401 311 385 459 444 428 400 372 434 209 220
1115B20J1O5O5M1M1o0o1j90R7N5N5l1l2j3j4j17J70Q9n4J02J03K2K2m8m7m8m7M3M2k9l0PP
$$ 220 231 296 361 402 443 383 322 132 229 284 339 308 276 263 249 132 302 391 337 439 542 564 586 538 491 443 396 439 481 452 422 429 436
1112D36PPo5o5N4N5nmnnL9L9J46j41k72J5J40ln9Q3m4j89J27J27J69j18j93m9J39nQ1o3q1
$$ 436 443 450 385 320 374 429 424 420 415 410 449 488 634 493 221 236 376 373 314 397 353 164 291 418 587 469 276 227 366 361 442 379 298
1109B98K06r9j00Q7Q6n3n4J89r8j50nl3l2J02J03j8j7j1j2j1j1k3k2k3k2l6l6Q3Q4N0N1L5
$$ 298 504 405 305 392 478 425 371 560 462 312 307 274 242 344 447 429 412 401 389 378 367 344 322 299 277 241 205 288 372 422 473 508
1106E08L6j1k51N2N2N7N7j4j5j8j7j8j8jjjjN2N3o7o7o2o2J0J0J6J6Q8Q8onj25j25J02J03
$$ 508 544 533 282 334 386 443 500 486 471 453 436 418 400 399 398 397 396 448 501 434 367 305 243 253 263 279 295 383 471 465 460 335 210 312 415
1103D15o5o6k4k4R6R6k3k2k3k2L5L6j32j32J87J86K0J9o2o1n6Q8j17J22llj02j02J7J8%j%
$$ 415 350 284 260 236 332 428 405 383 360 338 373 409 277 145 332 518 538 557 495 434 378 466 349 471 468 465 363 261 278 296 296 295 295
1100B95%lmJ83L8Q4j56j5j6k08L0O4O4lkkkL2L3l9l8O8O9l6l6r1J48J4J3n1n1O9O9K7K7m5
$$ 295 295 292 288 471 509 593 437 422 406 198 228 292 356 353 351 349 347 379 412 373 335 403 472 436 400 309 457 471 484 433 382 451 520 547 574 529
1097E29m5j3j4k2k3J90M6k98j0PPm7m6O5O6O6O5j00j01K0J9L3L4J23j64q7q6O4O3K7K6R9R8
$$ 529 484 471 457 435 412 602 648 350 340 347 354 307 261 326 392 458 523 423 322 342 361 394 428 551 387 300 214 278 341 368 394 493 591
1094E91l4l5l5l4k7k7J59J59k04Q4p7p8qpq0q0N7N7j14K9J16j73j00J87M3j00jkK6K6K5K6
$$ 591 557 522 487 453 426 399 558 717 513 597 520 442 434 427 347 267 324 381 267 296 412 239 139 326 369 269 268 266 292 318 343 369
1091C69p3p3J43J42q2q2j1j0NMN9N8Q8k00L4L4j13j13K64k3k9k8K5K6j6j5q7q6M9M9M9N0l3
$$ 369 296 223 366 508 426 344 333 323 328 332 391 449 537 337 371 405 292 179 443 420 391 363 388 414 398 383 296 210 259 308 357 407 374
1088C74l3Q6Q7M7M7j20j21j4j5j4j4j5j5N8N7l7l7K05q2j44%k7k7J31J32J2J2p7p7nnn5n6
$$ 374 341 427 514 561 608 488 367 353 338 324 310 295 280 338 395 358 321 526 444 300 300 273 246 377 509 521 533 456 379 374 369 314 258
1085B58M6M6K36n1j5j59j38Ol0K58L7L8j96R2J03j84mmRRRRn1n1O8O9n8n9O1O2o6o6J49J50
$$ 258 304 350 586 535 520 361 223 229 199 457 494 532 336 428 531 347 343 339 348 357 366 375 324 273 341 410 352 293 354 416 350 284 433 583
1082E83n0m9n0n0K7K7r3r3Q0Q1RRm7m8K4K4nnO7O8m7m7m6m7L9M0L9L9m1m2j13j13J76J75n5
$$ 583 533 484 434 384 411 438 345 252 332 413 422 431 384 336 360 384 379 374 441 509 462 415 369 322 361 401 440 479 438 396 283 170 346 521 466
1079D66Q9J83k95j08L7J55J2Rk79pJ36m4J00o5o5n6n6R6R7k3k3K6K7k8k7j38J49j2j2OPPO
$$ 466 555 738 443 335 372 527 539 548 269 262 398 354 454 389 324 268 212 308 405 382 359 385 412 384 357 219 368 356 344 350 357 364 370
1076C70M8M7k5k5m5m5m5m6k0j9J00R9KKJ21J22j99j99J60J61r6r6K3K4k1k1J40j47K3K3J01
$$ 370 418 465 440 415 370 325 280 234 214 195 295 394 396 398 519 641 442 243 403 564 468 372 395 419 398 377 517 370 393 416 517
1073E17m3j13J26P3p2MJ48o2o2j6j5N6N6k5k5j45j45K7K7J23k1j82N8J83n6j57Q1q3q3K27
$$ 517 474 361 487 560 488 492 640 578 516 500 485 541 597 572 547 402 257 284 311 434 413 231 289 472 416 259 340 257 174 401
1070D01j2J7J7j14J25q2q1O7O8O7O8n1n1n1n0J5J6J6J5Q0Q1q8q8KJKJNMP7P6o0o1o0o1J3J3
$$ 401 389 406 423 309 434 352 271 338 406 473 541 490 439 388 338 353 369 385 400 480 561 473 385 387 388 390 391 396 400 477 553 493 432 372 311 324 337
1067C37Q4Q5q9q8M0M0j53rK81n4j41R8n8n7n2n1M4r9O6L05q7N6L5L4k11K8O6O6l8l9k1k0k1
$$ 337 421 506 417 329 369 409 256 247 528 474 333 431 373 316 264 213 257 158 224 529 442 498 533 567 356 384 450 516 478 439 418 398 377
1064C77k1L5L5L4L5j09j09J07J06qqp9q0L7L7R9j39L1L2n5n5LMLLO3O3k19O9J03J04m7m6o7
$$ 377 356 391 426 460 495 386 277 384 490 482 474 395 315 352 389 488 349 380 412 357 302 305 309 312 315 378 441 222 291 394 498 451 405 338
1061C38o8J66j21J7J8P1P1k3k4J3J3p1p1%JJ6J5j09J77j4j5l2l2M3M3j1j1k07Q1J53j34J2
$$ 338 270 436 315 332 350 421 492 469 445 458 471 400 329 329 330 346 361 252 429 415 400 368 336 379 422 411 400 193 274 427 293 305
1058C05J3O6O7L6L6q3q3k1k1N2N1o5o4N6N5RRj53J35m7m7M4M3K9L0m3m2M7M7j86J01o1o2j34
$$ 305 318 384 451 487 523 440 357 336 315 367 418 353 289 345 400 409 418 265 400 353 306 350 393 422 452 409 367 414 461 275 376 315 253 119
1055A19J53Q5Q5L1L1PQo4o4m9m9P0P1p1p2%Jk6k5K09q0J7J7J7J7j63J24l7l7O8O8nmn3n2r5
$$ 119 272 357 442 473 504 511 519 455 391 342 293 363 434 363 291 291 292 266 241 450 370 387 404 421 438 275 399 362 325 393 461 456 452 399 347 252
1051B52J93j4j4L9M0l3l4LKr6r6J19J19n4n4j9j8m2m1kJ42%JL7L7J10l2r6M8k06o2L4L3k5
$$ 252 445 431 417 456 496 463 429 432 434 338 242 361 480 426 372 353 335 293 252 250 392 392 393 430 467 577 545 449 497 291 229 263 296 271
1048B71k6J42J42k09k08J51Pj36J04M2M1j8J26%%K6j18M9J94p2p1O3q1l3J10L5k04k7k7J64
$$ 271 245 387 529 320 112 263 270 134 238 280 321 303 429 429 429 455 337 386 580 508 437 500 419 386 496 531 327 300 273 437
1046D37J65N6q7p8p8m2m3J65p6j6j6J22k2J8J7j08L6RJ0l2l3j43J92J42j94j99J36R7j43K4
$$ 437 602 658 571 493 415 373 330 495 419 403 387 509 487 505 522 414 450 459 469 437 404 261 453 595 401 202 338 435 292 316
1043C16K3QQM3M4o7o7K3J67J5J4j7j7j33J0K7K7m5R9mmo7o7k2k3M9M9LLJ19k4o6o6p6O9n7
$$ 316 339 347 355 398 442 375 308 331 498 513 527 510 493 360 370 397 424 379 478 474 470 403 336 314 291 340 389 392 395 514 490 424 358 282 351 294
1040B94Q7N1N1o5o4J6j27L3L3O0O0L1L0M0j04N8N7j19j19K5K5R6R7r1r2j9j9LLLLj4j5N8N8
$$ 294 381 432 483 418 354 370 243 276 309 369 429 460 490 530 426 484 541 422 303 328 353 449 546 455 363 344 325 328 331 334 337 323 308 366 424
1036D24k8k7R2R2n9n9J2J3J9J9j01j01M6M6J48l31J99J99j43j42J25J25j87j86N0N0J21J22
$$ 424 396 369 461 553 494 435 447 460 479 498 397 296 342 388 536 205 404 603 460 318 443 568 381 195 245 295 416 538
1034E38j28j29qrN8N8K2K2J2J2n9o0o2o2Q8Q8J42j45k53K27J2J3PPQ6Q6q1q1M3M4k9k8j03
$$ 538 410 281 273 264 322 380 402 424 436 448 389 329 267 205 293 381 523 378 125 352 364 377 384 391 477 563 482 401 444 488 459 431 328
1031C28j03O5O5J8J7j80J08K6K7J34j53n7n7J5J4r8J89O3O4q9q9j6j7k3k3k3k3jjP1P2N0N0
$$ 328 225 290 355 373 390 210 318 344 371 505 352 295 238 253 267 169 358 421 485 396 307 291 274 251 228 205 182 181 180 251 323 373 423
1028D23o9p0J01J01o6o7l5l5L7L7jjrj0l5j79J17J17L6L5Q1o3n6n5J45Jo1Q3j6j6pj51N8N9
$$ 423 354 284 385 486 420 353 318 283 320 357 356 355 346 336 301 122 239 356 392 427 508 445 389 334 479 480 419 502 486 470 463 312 370 429
1025D29p9O5j5j6J0J0M6M6m1m0J75L2k95n5M9r4L0L1m1m2k7J16Q1o3O3O3J17j22O9O9r9M6
$$ 429 350 415 400 384 394 404 450 496 455 415 590 622 327 272 321 227 257 288 247 205 178 294 375 312 375 438 555 433 502 571 472 518
1022E18j9j8n4Q9JJk0j63j12L2kjK13k6r2N1J1J1o1Q3l2l3M0L9P8o5j76l3n1R2J01m2L4L3
$$ 518 499 481 427 516 517 518 498 335 223 255 253 252 465 439 347 398 409 420 359 442 410 377 417 456 534 469 293 260 209 301 402 360 394 427
1019D27l8l8m7R6Q7j53rJ35l3l3j6j7N5N5n2n3O7O7n4n4R0n4L7j05N6q8q7N7LLl7l7J24j9
$$ 427 389 351 304 400 487 334 325 460 427 394 378 361 416 471 419 366 433 500 446 392 482 428 465 360 416 328 241 298 301 304 267 230 354 335
1016C35p8O6J02m2k1J22pj50rj0J49J49kkq2O0r3r3M4M5j28J6J03J02M7M7n8n8j57Q3n2n2
$$ 335 257 323 425 383 362 484 477 327 318 308 457 606 604 602 520 580 487 394 438 483 355 371 474 576 623 670 612 554 397 480 428 376
1013C76m4m4n3n3J62J9M3M2j65P3R2n2m6m6Q9n5rj53rrR3R3P5j65j72O8J34J34n6n7n6n6J39
$$ 376 332 288 235 182 344 363 406 448 283 356 448 396 350 304 393 338 329 176 167 158 251 344 419 254 82 150 284 418 362 305 249 193 332
1010C32J39K8K8r1N2L4L4J0j33o2o2M1j02R8R8m8m7M5M5q7K49j17j16M6r7J90J90J7j28l7
$$ 332 471 499 527 436 488 522 556 566 433 371 309 350 248 346 444 396 349 394 439 352 601 484 368 414 317 507 697 714 586 549
1007E49l7r0N4j17K7J11l3o3o3N7N7J4k24J29j5l0J13m4m4M5r8N8N7m1J03L8j05opj11L2J59
$$ 549 512 422 476 359 386 497 464 401 338 395 452 466 242 371 356 326 439 395 351 396 298 356 413 372 475 513 408 402 395 284 316 475
1004D75q2j06j05J18k5J14l0l8J05L2L2Kj42N1N2o3o2j71O8N4N4P4P5KLj06j07O1O1o7o8M
$$ 475 393 287 182 300 275 389 359 321 426 458 490 492 350 401 453 390 328 157 225 279 333 407 482 484 487 381 274 335 396 329 261 265
1001B65MR4R4N4q9n9n9K29Q4p5p5n5R0J11l2j09j10j1j2j1j2n1n2K17P4j84J51Kk39J56q4
$$ 265 269 363 457 511 422 363 304 533 617 542 467 412 502 613 581 472 362 351 339 328 316 265 213 430 504 320 471 473 234 390 306
998C06j08J32N5q9J28J27j8j9rj52J11J12j66k3J46j89p2P2j1j0j0J34m6m6N3r1j04L9n9Q5
$$ 306 198 330 385 296 424 551 533 514 505 353 464 576 410 387 533 344 272 344 333 323 313 447 401 355 408 317 213 252 193 278
996B78jjJ19J19n2j96N3J97L7k01j9J24j2j1r0r0J63p6N9N8R1R1k9k8m7m7m6m7J5J5r6r5q7
$$ 278 277 276 395 514 462 266 319 516 553 352 333 457 445 434 344 254 417 341 400 458 549 640 611 583 536 489 443 396 411 426 330 235 148
993A48N7R6R6rqOPp5J65J80n9k29J1j9j9NMo7o7N4N3q2J58m0m0J5J57l8l9l0l0J1J1k0J25
$$ 148 205 301 397 388 380 386 393 318 483 663 604 375 386 367 348 353 357 290 223 277 330 248 406 366 326 341 498 460 421 391 361 372 383 363 488
990D88J32k02o8J71o3o4k7k8r3K43J13k21J09l4j27J6j2j2J17J17j08j08R3n1k8k9KJ45k3
$$ 488 620 418 350 521 458 394 367 339 246 489 602 381 490 456 329 345 333 321 438 555 447 339 432 381 353 324 326 471 448
987D48k4Lj40m1J02J03m1j25J9p1p1O0N9j2j3K1K0K9L0K4J68l3l2M3M4p6p6J9J9j66k2l0K09
$$ 448 424 427 287 246 348 451 410 285 304 233 162 222 281 269 256 277 297 326 356 380 548 515 483 526 570 494 418 437 456 290 268 238 447
984D47LLN5q9j8j7P0p4j28J11KKj09K26J9j26k3k4K7K8r9J41j07L6r2J47M7M7K3j21K4K5j74
$$ 447 450 453 508 419 401 384 454 380 252 363 365 367 258 484 503 377 354 330 357 385 286 427 320 356 264 411 458 505 528 407 431 456 282
981B82J63o9o9j8J26N4r0r5M8J34j05J01J02J9j24m4m4K7K6p0P4Q1j60p8p9L5J79K5K6q2q2
$$ 282 445 376 307 289 415 469 379 284 332 466 361 462 564 583 459 415 371 398 424 354 428 509 349 271 192 227 406 431 457 375 293
978B93J52QN1j88l9K01J16k8Q5n8q8N6j15K9O0O0O0O0Q1o3m7R6j93M7r4r4K03l6r9J40j41
$$ 293 445 453 504 316 277 478 594 566 651 593 505 561 446 475 535 595 655 715 796 733 686 782 589 636 542 448 651 615 516 656 515
975E15Lo3o3N9N9p0p0P4p0K0j24ONmlpoO5p9L3j10J20J20L7j06k5k6L2L1K2K2J03m0l2l2m
$$ 515 518 455 392 451 510 440 370 444 374 394 270 276 281 277 274 267 261 326 247 280 170 290 410 447 341 316 290 322 353 375 397 500 460 428 396 392
972C92np7p6N5N5P3p0o7P7l1J13Qj36K6K6o5o6M6M5N9q4O7O8K7K7K7K7l7l7M3M4j98n5j6j5
$$ 392 387 310 234 289 344 417 347 280 357 326 439 447 311 337 363 298 232 278 323 382 298 365 433 460 487 514 541 504 467 510 554 356 301 285 270
969B70M3M2M3M3l9m0L3L2l3l3J28j59M8M9r0q9N4N4j7j8K7K8K7K8L0L1r0q9llJ59j29M4M3
$$ 270 313 355 398 441 402 362 395 427 394 361 489 330 378 427 337 248 302 356 339 321 348 376 403 431 461 492 402 313 310 307 466 337 381 424
966D24K6K5m2m1m2m2L0L0m2m1L3L3l8l8O4O5n5n4J0J0J0J0L3L3l9m0P4P3O8k20J3J4mnn2n2
$$ 424 450 475 433 392 350 308 338 368 326 285 318 351 313 275 339 404 349 295 305 315 325 335 368 401 362 322 396 469 537 317 330 344 340 335 283 231
962B31n2n2J04J04L1L2n5n6O5O4L5L4q5q6m6m7J21J21K3K4m9m8qqrqk7k8M4M4KJm1K47q1q1
$$ 231 179 127 231 335 366 398 343 287 352 416 451 485 400 314 268 221 342 463 486 510 461 413 405 397 388 380 353 325 369 413 415 416 375 622 541 460
959D60N7N7m3m2m2m3j8j9J02J01kkJ6J6k40M7N4N3M1M1p9p8k4k3qrl7K03mnr8r8O9O9p4p3
$$ 460 517 574 531 489 447 404 386 367 469 570 568 566 582 598 358 405 459 512 553 594 515 437 413 390 382 373 336 539 535 530 432 334 403 472 398 325
956C25jkN2N3N2N2k1k1k09J25m1m2J13j26jkJ19j22RRO6O6k5k5k6k5O1O0j47R3Q3Q4p0p0r2
$$ 325 324 322 374 427 479 531 510 489 280 405 364 322 435 309 308 306 425 303 312 321 387 453 428 403 377 352 413 473 326 419 502 586 516 446 354
953C54r2P6P5K8K8j07J33LKQ7k49l2l3O7O7N4N5j13j13J5J4Q7Q7J5J5j05j05L1L2m1m0M4M5
$$ 354 262 338 413 441 469 362 495 498 500 587 338 306 273 340 407 461 516 403 290 305 319 406 493 508 523 418 313 344 376 335 295 339 384
950C84M5M5P0P1m9m9k5k6l4l4J44%j64P5r2N1j76l3J25j9P1P1lkklK3K3j20J19Q5n7r7k40
$$ 384 429 474 544 615 566 517 492 466 432 398 542 542 378 453 361 412 236 203 328 309 380 451 448 446 444 441 464 487 367 486 571 514 417 177
947A77J31J31KLJ5J6J6J6L0L1m1m2q2q1Q5Q6m9m9k5j69j18J21j00J39J82n8K0K0n0n1K2K2
$$ 177 308 439 441 444 459 475 491 507 537 568 527 485 403 322 407 493 444 395 370 201 83 204 104 243 425 367 387 407 357 306 328 350
944C50O3O4P3P2k41r8P5j63L9L9K4K4L9L9L9L9j02j02J8J8J25J24m3m4MLo9o9Q9Q8l1l2j1
$$ 350 413 477 550 622 381 283 358 195 234 273 297 321 360 399 438 477 375 273 291 309 434 558 515 471 475 478 409 340 429 517 486 454 443
941D43j1j1j1J1J1m5m6m1J99k3j67M8M9l2l2O4O5j03j03M2M2M2M2OPo5o5nnO7O6j9k0k0k0
$$ 443 432 421 410 421 432 387 341 300 499 476 309 357 406 374 342 406 471 368 265 307 349 391 433 439 446 381 316 311 306 373 439 420 400 380 360
938C60O9O8lln4n4O5O6M0M0M0M0j29j30L8L8q7q8L2L2j0rNNj40R9K19k0L2L1o1J78Q9j51k47
$$ 360 429 497 494 491 437 383 448 514 554 594 634 674 545 415 453 491 404 316 348 380 370 361 366 371 231 330 549 529 561 592 531 709 798 647 400
934D00pn5R0r7r6L2L3L2L2K8K7K8K7k9l0m4J95L3L3j05L8k7k7Oj38o4J77m0l9O8O9j32J1j13
$$ 400 393 338 428 331 235 267 300 332 364 392 419 447 474 445 415 371 566 599 632 527 565 538 511 517 379 315 492 452 413 481 550 418 429 316
931C16j14K40R6j4j5k4k3JJrqR1n3n3n3K73J29j49j49L5L5l1J13k00L9POj38J96q1O2L1j12
$$ 316 202 442 538 524 509 485 462 463 464 455 447 538 485 432 379 652 781 632 483 518 553 522 635 435 474 481 487 349 545 464 526 557 445
928D45k2k2n4n3K00l8N5N5M1M0j5j5m5R9O7k68p0P3q1O3J01J02L6j09j08L6K2K2n9Q5O4q0
$$ 445 423 401 347 294 494 456 511 566 607 647 632 617 572 671 738 470 400 473 392 455 556 658 694 585 477 513 535 557 498 583 647 567
925E67J0J0l5l5k6k5m2J01L0L0q6N7N6q6J5J5R6m8r7M6m3m4l1l1K18P4p5p4m4R9n2n2Q6Q6
$$ 567 577 587 552 517 491 466 424 525 555 585 499 556 612 526 541 556 652 604 507 553 510 466 435 404 622 696 621 547 503 602 550 498 584 670
922F70j49oJ12k24J13K57o9p0j7j60Q8Q8N4N5k5k6J08l4N5q9m4m4O6O7%jp3p2M4M4M5M4nn
$$ 670 521 515 627 403 516 773 704 634 617 457 545 633 687 742 717 691 799 765 820 731 687 643 709 776 776 775 702 630 674 718 763 807 802 797
919G97P5o8K8K7o2Q2L9L9J93M8J7j27j17J22J51J52M7M7k3k4J36J35K06O2L5J79P9K24J88
$$ 797 872 804 832 859 797 879 918 957 1150 1198 1215 1088 971 1093 1244 1396 1443 1490 1467 1443 1579 1714 1920 1982 2017 2196 2275 2499 2687
917B687J88K17K18K98J55M09M08O72O72Q41R85J257J400J632K062K272K415K526K861L089
$$ 2687 2875 3092 3310 3608 3763 4172 4580 5252 5924 6765 7750 9007 10407 12039 14101 16373 18788 21314 24175 27264
915B7264L089L017L018L017K682K457K122J560J128P52J29l14o50j272j607j924k260k557
$$ 27264 30353 33370 36388 39405 42087 44544 46666 48226 49354 50106 50235 49921 49271 47999 46392 44468 42208 39651
913C9651k988k926k925l018k874k575k575k501k165j910j767j498j162j103q63r10o70o23
$$ 39651 36663 33737 30812 27794 24920 22345 19770 17269 15104 13194 11427 9929 8767 7664 6801 5891 5221 4598
912D598l83j81l24m08p2k60j17o0k03j85j85k04n9j24j24j51j51j29j30rj0q5q6j3j4j5j5
$$ 4598 4215 4034 3710 3302 3230 2970 2853 2793 2590 2405 2220 2016 1957 1833 1709 1558 1407 1278 1148 1139 1129 1044 958 945 931 916 901
909I01j35j35K5K5K5K5j8j9j8j8r8r7r8r8J48J48o8o8K0J9j18j19K74j3o8o7N8N8MMj62J25
$$ 901 766 631 656 681 706 731 713 694 676 658 560 463 365 267 415 563 495 427 447 466 348 229 503 490 422 355 413 471 475 479 317 442
906D42l7l6j5j6N7N6j41j41K36n1RRrrJ3J4n8n9l2l2M0M0l8l9Q1Q1O8O7L2L2k5k4j50J37p1
$$ 442 405 369 354 338 395 451 310 169 405 354 363 372 363 354 367 381 323 264 232 200 240 280 242 203 284 365 433 500 532 564 539 515 365 502 431
903D31p1j7j7M3M3j0j1j39J48K3K2J3J3n9n9M6M7p3p3K4K5O1O1ppr6r7K03q4OOL7L8l5l4J
$$ 431 360 343 326 369 412 402 391 252 400 423 445 458 471 412 353 399 446 373 300 324 349 410 471 464 457 361 264 467 383 389 395 432 470 435 401 402
900D02KL7L7k3k3J2J3nnj5j4M9r4r5N0K3K4R3n1J10k25P4P5k1k1J05l8j36QJ39j00q8J52J18
$$ 402 404 441 478 455 432 444 457 452 447 432 418 467 373 278 328 351 375 468 417 527 302 376 451 430 409 514 476 340 348 487 387 299 451 569
897E69k5o0o0j42R9O2q1J5J4K3K3N8N9j59j59K24Q1Qj35o3Q1j06L9j5j59J6J59P6j64J16k9
$$ 569 544 484 424 282 381 443 362 377 391 414 437 495 554 395 236 460 541 549 414 351 432 326 365 350 191 207 366 442 278 394 365
894C65p9O5N6N7J7j26O6p8LMr4N0j3j57j4J29J20k3nonnm2J01K09j26q7q6M5M6K3k17m3J01
$$ 365 286 351 407 464 481 355 421 343 346 350 256 306 293 136 122 251 371 348 343 337 332 327 285 386 595 469 382 296 341 387 410 193 150 251
891B51O4O4RJ0o8P6r2r2K41%PPNj38K3j20NNJ49Nn6n6O4O4j1J33j09L4pj50k5k5K9L0j21J20
$$ 251 315 379 388 398 330 406 314 222 463 463 470 477 482 344 367 247 252 257 406 411 355 299 363 427 416 549 440 474 467 317 292 267 296 326 205 325
887C25J45r4j12j12P3P3JJN9N9K3K3j27j26ppL8L7l4l4P7P7NNk4k5K9L0J64j24n1K35j2j3
$$ 325 470 376 264 152 225 298 299 300 359 418 441 464 337 211 204 197 235 272 238 204 281 358 363 368 344 319 348 378 542 418 367 602 590 577
884E77o7o6N7N7o2o2j6j5q7q7Q2Q2M6M6q2q2L8L8j%j68j68J91J91k4k5j28j28L9L9N4N4j7
$$ 577 510 444 501 558 496 434 418 403 316 229 311 393 439 485 403 321 359 397 396 396 228 60 251 442 418 393 265 137 176 215 269 323 306
881C06j8l0l1j38J49J94r4J5J4r9j00J82j05O9O9k1k1JJL7L6l6l5j26J62L9L8R9j88O0O0j92
$$ 306 288 258 227 89 238 432 338 353 367 268 168 350 245 314 383 362 341 342 343 380 416 380 345 219 381 420 458 557 369 429 489 297
878B97R6Q5Q5j12j13nom1m1K1K1K1K1N5N5l5l5J34j53k07Q0o3K24j0j0J78j09l8l7J46j41
$$ 297 393 478 563 451 338 333 327 286 245 266 287 308 329 384 439 404 369 503 350 143 223 160 384 374 364 542 433 395 358 504 363
876C63k12P4L4L4N2N2j40j39P6P5K8K7K7K7m6m6K6K6L8L9l3l3J5J5n7n7ppO4O5q5q5Q2Q3K9
$$ 363 151 225 259 293 345 397 257 118 194 269 297 324 351 378 332 286 312 338 376 415 382 349 364 379 322 265 258 251 315 380 295 210 292 375 404
872D04K9j39j38J08J08L7L6k9k9k9k9l6l7L6L5P4P5KKj23j23R2R2M8M8n4n4j83J04llJ68j19
$$ 404 433 294 156 264 372 409 445 416 387 358 329 293 256 292 327 401 476 478 480 357 234 326 418 466 514 460 406 223 327 324 321 489 370
869C70p8p8J23J23m4m5q8q9Q0P9qpqpmllmm8m8P2P1N6N5o4o4n7n7O3O3j9j8j9j8L0L1L1L1
$$ 370 292 214 337 460 416 371 283 194 274 353 345 338 330 323 319 316 313 309 261 213 285 356 412 467 403 339 282 225 288 351 332 314 295 277 307 338 369 400
866D00k9k9j1j0p2K15j80J07l4l4j6j6R7R8R1j95L7L8j42J46p2p1J05J05k6j69L1L2k1k1J29
$$ 400 371 342 331 321 249 464 284 391 357 323 307 291 388 486 577 382 419 457 315 461 389 318 423 528 502 333 364 396 375 354 483
863D83j11j42R7j0K29j46jK8j15r4J45O5j75qpJ93M9j29J11j05L9n2R3o0Q3r5r6n4J86N9N8
$$ 483 372 230 327 317 546 400 399 427 312 218 363 428 253 245 238 431 480 351 462 357 396 344 437 377 460 365 269 215 401 460 518
860E18q5q5j06L8J49Nmj47mmJ11J11qqn3n4p1P3J31j2m3m2q8q7J28J29OOL6j07k02J33J7J7
$$ 518 433 348 242 280 429 434 430 283 279 275 386 497 489 481 428 374 303 376 507 495 452 410 322 235 363 492 498 504 540 433 231 364 381 398
857C98r3N1j6j5k2K17nnJ33j07m4m4p6p7r5M9J22k1r4N1J31j3m2m2L5L5k8k7m9R5j53rJ84
$$ 398 305 356 340 325 303 520 515 510 643 536 492 448 372 295 200 249 371 350 256 307 438 425 383 341 376 411 383 356 307 402 249 240 424
854D24n4j38J01K67o8j67P3J7J7M2M1j28J6PPm2m2K1K1K7j17J56J2j2j56L5L6l6l5J32J32
$$ 424 370 232 333 600 532 365 438 455 472 514 555 427 443 450 457 415 373 394 415 442 325 481 493 481 325 360 396 360 325 457 589
851E89m5m6J26j14J5J5Q2o3P3P3j43R7J13J13j78l4N9q5l0l1n8n9O2O1JKj24J15o8P5O4q0
$$ 589 544 498 624 510 525 540 622 559 632 705 562 659 772 885 707 673 732 647 617 586 528 469 531 592 593 595 471 586 518 593 657 577
849E77k05o1l1J12M0j99J90n0J87M3l28q9J7J61K11j23j6j5J5J5q8J52L5j09m9R4K3j22k8
$$ 577 372 311 280 392 432 233 423 373 560 603 275 186 203 364 575 452 436 421 436 451 363 515 550 441 392 486 509 387 359
846C59J16Q8j51m2m2L1L0j12J28L0K9o1o1j39J01P9j61p1P3J89n0p7J62p2p3J82L8P2p2j53
$$ 359 475 563 412 370 328 359 389 277 405 435 464 403 342 203 304 383 222 151 224 413 363 286 448 376 303 485 523 595 523 370
843C70rmllJ40j03j03J63K0r0N4J17k7j5j5O5p8p7O7q6J54K9K8q4q5K06O4k01n6P4P4Q3Q3
$$ 370 361 357 354 351 491 388 285 448 468 378 432 549 522 507 492 557 479 402 469 383 537 566 594 510 425 631 695 494 438 512 586 669 752
840G52j2j1j2j1k4k4k4k4M4M5j70j71J16J17n1n1j2j2j2j3l4l5J27j60J5J5lmQ3Q3J1J1o5
$$ 752 740 729 717 706 682 658 634 610 654 699 529 358 474 591 540 489 477 465 453 440 406 371 498 338 353 368 365 361 444 527 538 549 484
837D84o5j1j1P7k10j2j3Q7Q6n1n0J52j35K7K6m1m2L1L0K8K8qqK1K1J82j04o6o5J50j37N9N9
$$ 484 419 408 397 474 264 252 239 326 412 361 311 463 328 355 381 340 298 329 359 387 415 407 399 420 441 623 519 453 388 538 401 460 519
834E19l1l0lkj22j22J02J02L1L0j87j87J24J25J19J18m8m9m4m4pqN1N1q6q7K10p8l6l6n9n9
$$ 519 488 458 455 453 331 209 311 413 444 474 287 100 224 349 468 586 538 489 445 401 394 386 437 488 402 315 525 447 411 375 316 257
831B57O1O1onj32J57k9k9P9P9j82J05n6n6M3M3P9P9m3m3j15j15O1O2O1O1j8j7q9r0J09J08
$$ 257 318 379 373 368 236 393 364 335 414 493 311 416 360 304 347 390 469 548 505 462 347 232 293 355 416 477 459 442 353 263 372 480
828D80j2j1rj0%%m1J03Q5j54n5n5JKl7l8Q3Q2ooo3o3j29J10M8M8K7K7m5m5L3L3l9l9R2R2k8
$$ 480 468 457 448 438 438 438 397 500 585 431 376 321 322 324 287 249 332 414 408 402 339 276 147 257 305 353 380 407 362 317 350 383 344 305 397 489 461
825D61k8L2L2q8q8MNK8j16m5J94j11L3P1p3o4Q0mmNNN3N3j33J2n7J84Q1j58j36OP9P8J5J4
$$ 461 433 465 497 409 321 325 330 358 242 197 391 280 313 384 311 247 327 323 319 324 329 382 435 302 314 257 441 522 364 228 234 313 391 406 420
822D20J4J4n6n7J11J12j12j12QQRRj01j02j9J25K32j03m3m4N5N4k2k3M9M8j5j6j6j6JJp2p1
$$ 420 434 448 392 335 446 558 446 334 342 350 359 368 267 165 146 271 503 400 357 313 368 422 400 377 426 474 459 443 427 411 412 413 341 270
819B70R2R1p6p6Q1Q1l8l9L0L0l6J08j35J04m2j85o8K20M8M9l7l8l8l8N7N7o2o3qrrqm1m0L2
$$ 270 362 453 377 301 382 463 425 386 416 446 410 518 383 487 445 260 192 412 460 509 472 434 396 358 415 472 410 347 339 330 321 313 272 232 264
816B64L1M5M5n6n7j34J54O4O4pqqpnonnN2N2k0k0j23j24J41J40kkj73J15Q9n5j47lpJ37J28
$$ 264 295 340 385 329 272 138 292 356 420 413 405 397 390 385 379 374 369 421 473 453 433 310 186 327 467 465 463 290 405 494 439 292 289 282 419 547
812E47j5J48j40j39MNMJ3J3n4n5J8J7l7l6Q3Q3l1l1l2l1N4N4j8j8J24J23j39j40K2K1L1L1
$$ 547 532 680 540 401 405 410 414 427 440 386 331 349 366 329 293 376 459 428 397 365 334 388 442 424 406 530 653 514 374 396 417 448 479
809D79j16K8J08j78N7N8l2l2m6m5P4P4qqqqq8q9L1L1QPPPp5p6J41J40p6p5R2R2j2j2j1j2N5
$$ 479 363 391 499 321 378 436 404 372 326 281 355 429 421 413 405 397 309 220 251 282 290 297 304 311 236 160 301 441 365 290 382 474 462 450 439 427 482
806D82N6p3p4J20k4r6r6r8J40llL9j04k4k3O3O3L9j04n0J89N5q9L3L4o2o3J64p6k2k2J15k8
$$ 482 538 465 391 511 487 391 295 197 337 334 331 370 266 242 219 282 345 384 280 230 419 474 385 418 452 390 327 491 415 393 371 486 458
803D58j48mJ00J00n8n8J7J8RRJ08l6j14j14l6J08K7K6n2n2Q2Q2o3J77j11L3q6q7L4L3L0j13
$$ 458 310 306 406 506 448 390 407 425 434 443 551 515 401 287 251 359 386 412 360 308 390 472 409 586 475 508 422 335 369 402 432 319
800C19J29j5j03M1Q0P9j37OOj37k2k2L1L2R3n0r9r8J95N3O1O1q6q5j01J39k1k1J23J22j59
$$ 319 448 433 330 371 451 530 393 399 405 268 246 224 255 287 380 330 231 133 328 381 442 503 417 332 231 370 349 328 451 573 414
797D14j5L9k01Q2Q3j4J30n2n3n2R1m7m7j11j10J33J32k0J23j25j24k9J15R9J00p4p3J02j36
$$ 414 399 438 237 319 402 388 518 466 413 361 452 405 358 247 137 270 402 382 505 380 256 227 342 441 541 467 394 496 360
795C60P0P0p4p4n9n9m9J90j6J27q9N4j8j8m2m1K21j7j17K7J38j02L1L1J5J6klj45R3R2n1J5
$$ 360 430 500 426 352 293 234 185 375 359 486 397 451 433 415 373 332 553 536 419 446 584 482 513 544 559 575 573 570 425 518 610 559 574
792E74j29j26J7J49r0r4J45N5q9J84j51j25J9K4K3M1M2j39Oj3j2J49NOJ49j59j59P5P4j02
$$ 574 445 319 336 485 395 301 446 501 412 596 445 320 339 363 386 427 469 330 336 323 311 460 465 471 620 461 302 377 451 349
789C49M3k4k4j40R9J08j31K7J70L6j07K0K1n3Q9j69P0J6J6j0rrj0J3J3j22J17L7L6J15J14
$$ 349 392 368 344 204 303 411 280 307 477 513 406 426 447 394 483 314 384 400 416 406 397 388 378 391 404 282 399 436 472 587 701
786G01O3q1j20j21L3L2M2M1j12L2n0m9m2m2rK30k8k9O8p7p2p2%%j13K9K49q7J20k4k7k7mJ40
$$ 701 764 683 563 442 475 507 549 590 478 510 460 411 369 327 318 548 520 491 559 482 410 338 338 338 225 254 503 416 536 512 485 458 454 594
783E94o0o0kkq3O1p0p0J40ml1l1L2L1K3K3j03J37r0N4kj46l9l9J43%J13l2j03J36o3k07%j
$$ 594 534 474 472 470 387 448 378 308 448 444 413 382 414 445 468 491 388 525 435 489 487 341 302 263 406 406 519 487 384 520 457 250 250 249
780B49M3j00K85J42j02M1l9j84Q1Q0j05j05J49OK4K4o6P7j2j2N1r2J37j01j46R3J5J5n3n2
$$ 249 292 192 477 619 517 558 519 335 416 496 391 286 435 441 465 489 423 500 488 476 527 435 572 471 325 418 433 448 395 343
777C43j15J24K0K1J08j32m8R7%%k5k5k5k5K2K1L1L1NJ49j0j53o4Q0rj0k8k7J45j89J33j06
$$ 343 228 352 372 393 501 369 321 418 418 418 393 368 343 318 340 361 392 423 428 577 567 414 350 430 421 411 383 356 501 312 445 339
774C39n5J84r2r1M4M3mmONj31J2M3M3L7j06J19k5K3j21Q8n5J71o8k4k3qj50o1o1l9J05K79
$$ 339 284 468 376 285 329 372 368 364 370 375 244 256 299 342 379 273 392 367 390 269 357 302 473 405 381 358 350 200 139 78 39 144 423
771D23L9J5J6r0N4qj53RJ0O1O2j1j0K7K6M4r9K7J70j83j83ppL2J76N6N7n5n5L0L0L9j04P2
$$ 423 462 477 493 403 457 449 296 305 315 376 438 427 417 444 470 514 415 442 612 429 246 239 232 264 440 496 553 498 443 473 503 542 438 510
768E10P1j46lK6j17M4M4opO5O6q2q1j9j8J08l5M6M6n1n2K1K0L7L7k26J3O3q0P8P8K9j15m3
$$ 510 581 435 432 458 341 385 429 423 416 481 547 465 384 365 347 455 420 466 512 461 409 430 450 487 524 298 311 374 294 372 450 479 364 321
765C21m3J40mM8r7q0O4m4J00k2j66K8K9J83n7lJ41q8q8qpl0l0l0k9K6K7J07l6J2J2O5O6Mj40
$$ 321 278 418 414 462 365 285 349 305 405 383 217 245 274 457 400 397 538 450 362 354 347 317 287 257 228 254 281 388 352 364 376 441 507 511 371
762C71P0P0p4P0q2q3J48J48n2n2j10J31o8o7j38OLJ46J2j32O3O2M1j99p3P0jjK05j30m8R5
$$ 371 441 511 437 507 425 342 490 638 586 534 424 555 487 420 282 288 291 437 449 317 380 442 483 284 211 281 280 279 484 354 306 401
759D01q7N7j5j6j5j5J38oP5P5n3n2j42KM2j01P6P5k80m1J74o5N9N9l7J07l9m0J04j35P7P7
$$ 401 314 371 356 340 325 310 448 442 517 592 539 487 345 347 389 288 364 439 159 118 292 227 286 345 308 415 376 336 440 305 382 459
756D59jjp9O6P4p0r3N2P2P2M4j00j09L5Q3o1n2R2n2n2M4M4j38J01M8M7r0N3k7k8l5l6l5l6
$$ 459 458 457 378 444 518 448 355 407 479 551 595 495 386 421 504 443 391 483 431 379 423 467 329 430 478 525 435 488 461 433 398 362 327 291
753B91J26J27j71k6P7P6jjJ44r5p1p2n1R3J2J3L7L8j30j30M0M1m7j90J08J08J8J62%jr6r7
$$ 291 417 544 373 347 424 500 499 498 642 547 476 404 353 446 458 471 508 546 416 286 326 367 320 130 238 346 364 526 526 525 429 332
750C32o3J76l1l0M4M5M5M4j23j23n7K78J6j28k6k6qqqqP5P6o0n9J01j39j3J31o4o3O5O5q3
$$ 332 269 445 414 384 428 473 518 562 439 316 259 537 553 425 399 373 365 357 349 341 416 492 432 373 474 335 322 453 389 326 391 456 373
747C73q3L7L7mmJ5J4j40J48J05J06j12j13J69j18M3M4K5K5l1l2l1l2l4l5J33J33j21j22jk
$$ 373 290 327 364 360 356 371 385 245 393 498 604 492 379 548 430 473 517 542 567 536 504 473 441 407 372 505 638 517 395 394 392
744C92k3k2k3k3M2M2M2M1P3P3m6m7p3p3p4p3j7j6J03J03L8L7K0J9N8k29j57J30J4J4L1L2m
$$ 392 369 347 324 301 343 385 427 468 541 614 568 521 448 375 301 228 211 195 298 401 439 476 496 515 573 344 187 317 331 345 376 408 404
741D04nJ4J4j09J80n5n4l7l6L5L6kkjkk8k9R2R1o2o1o2o1N4N4L5L6J29j58LLn5n5J7J6L2L2
$$ 404 399 413 427 318 498 443 389 352 316 351 387 385 383 382 380 352 323 415 506 444 383 321 260 314 368 403 439 568 410 413 416 361 306 323 339 371 403
738D03J3J4J15j72j0j0K1K0J11j77K5K5K5K6j30J58mmk2k2m0m0J22j64mlM3M3M4M3k9k8K5
$$ 403 416 430 545 373 363 353 374 394 505 328 353 378 403 429 299 457 453 449 427 405 365 325 447 283 279 276 319 362 406 449 420 392 417
735D17K5J40j46j47lO9p3Q8Q8k6k6k6k6j9j9Q0o4q5K02P4k14p2p3j03J85K28n9L4j10k3k3
$$ 417 442 582 436 289 286 355 282 370 458 432 406 380 354 335 316 396 332 247 449 523 309 237 164 61 246 474 415 449 339 316 293
732B93k4k3j2J30j20J67Q0o4j27J61n0n1M0L9M1M0K2K2P3k14n2n3R2R2k8k8P8P8k69J9K51
$$ 293 269 246 234 364 244 411 491 427 300 461 411 360 400 439 480 520 542 564 637 423 371 318 410 502 474 446 524 602 333 352 603
729F03l6j43%j41LR9R9p5p4llK7K7K7K7NNO8p6J13j75O5K08J2J2j14L0k08P9Q9j99k1k1Q0
$$ 603 567 424 424 283 286 385 484 409 335 332 329 356 383 410 437 442 447 515 439 552 377 442 650 662 674 560 590 382 461 550 351 330 309 389
726C89Q1k2k3k2k3N4N3L6L5K4k64Q3Q4j77J10Q3o0J12j76j03M0L2L2p8p8Q3Q3Q4Q3q9q9P9
$$ 389 470 448 425 403 380 434 487 523 558 582 318 401 485 308 418 501 441 553 377 274 314 346 378 300 222 305 388 472 555 466 377 456
723D56P9j28j28M0M0J4J3J3J4P3P3m7m6l8l7l8l7M9M9j00j01r5J92L1L1j6j6M1J85k33N4k6
$$ 456 535 407 279 319 359 373 386 399 413 486 559 512 466 428 391 353 316 365 414 314 213 118 310 341 372 356 340 381 566 333 387 361
720C61k6L9M0l2l2lkP0P0m0l9l9m0Q0P9QPj1j2j2j2k6k6k6k6J0J0o1o2Q4Q4J3J3l6l5l5l6
$$ 361 335 374 414 382 350 347 345 415 485 445 406 367 327 407 486 494 501 490 478 466 454 428 402 376 350 360 370 309 247 331 415 428 441 405 370 335 299
717B99K6K6K6K6p8p7J38J38j5j5j5j4L0L0r0r0k7k6k7k6J74J73q9q9MNNNk4k3R6R6k4k4r5
$$ 299 325 351 377 403 325 248 386 524 509 494 479 465 495 525 435 345 318 292 265 239 413 586 497 408 412 417 422 427 403 380 476 572 548 524 429
714D29r6J2J3J2J2K8K9K8K8%%%%k6k6j04K31N3r0L5j08j64P5J95m4j2J32J3j32j46R3O9O9
$$ 429 333 345 358 370 382 410 439 467 495 495 495 495 495 469 443 339 570 623 533 568 460 296 371 566 522 510 642 655 523 377 470 539 608
711F08q8q9j06L8Q0o3J07l7o2o2M0M0Q8n5J1K50m1m2j79l6NNQ6n8O6p7r6M8P3p2J9J8N4N5
$$ 608 520 431 325 363 443 380 487 450 388 326 366 406 494 439 450 700 659 617 438 402 407 412 498 440 506 429 333 381 454 382 401 419 473 528
708E28j47kJ24J24j63j9l7l8K9K8J57q4k36Ml2K07OPQ8n5n5n5Q4o0J3J2J27j7j04j03O3O2
$$ 528 381 379 503 627 464 445 408 370 399 427 584 500 264 268 236 443 449 456 544 489 434 379 463 403 416 428 555 538 434 331 394 456
705D56j95n1J08l5j7j8R3R4J2J3P8o5n6n6N6N6K45r0l0l0j14J26j0j1j84J51K8K8M8M9n6n6
$$ 456 261 210 318 283 266 248 341 435 447 460 538 473 417 361 417 473 718 628 598 568 454 580 570 559 375 526 554 582 630 679 623 567
702E67j22K1j09J30R5n0j54j0j4J30J10J09j45j45%%%JrqO4O4o7o6o7o6M6M6M7M6n1n1k4k4
$$ 567 445 466 357 487 582 532 378 368 354 484 594 703 558 413 413 413 413 414 405 397 461 525 458 392 325 259 305 351 398 444 393 342 318 294
699B94k03K29N8N7L6L5l6l7k1k2N1N0j05j05O2O3J20J20j43j43K6K7K6K6R2R2j24K0J12j28
$$ 294 91 320 378 435 471 506 470 433 412 390 441 491 386 281 343 406 526 646 503 360 386 413 439 465 557 649 525 545 657 529
696E29J5J6o5o4o5o4Q8Q8J7J6j15j16N2N3j0rK06O3j13J26j7j8j65j66m6J94K4j18M8M9%j
$$ 529 544 560 495 431 366 302 390 478 495 511 396 280 332 385 375 366 572 635 522 648 631 613 448 282 236 430 454 336 384 433 433 432
693D32O2j77O1O0M6M6J1J2J1J2o3o2o3o2M2M2r2J47OOK1K1J2J2o0o0P4P4m5m6n7n8O2O2J0
$$ 432 494 317 378 438 484 530 541 553 564 576 513 451 388 326 368 410 318 465 471 477 498 519 531 543 483 423 497 571 526 480 423 365 427 489 499
690D99J0r5r5o2J77J24k1j8j9k8k8QQn4n5jJ44NOo4J76l9k79Q2Q2j19K5o3J76N9q4j5j5k5
$$ 499 509 414 319 257 434 558 537 519 500 472 444 452 460 406 351 350 494 499 505 441 617 578 299 381 463 344 369 306 482 541 457 442 427 402
687D02k4j9k0O2q3K1K0J46r3L7L7J12l2j15L0J54q4j36QM7j92J10J11K3K4K8K8j39j40N2N2
$$ 402 378 359 339 401 318 339 359 505 412 449 486 598 566 451 481 635 551 415 423 470 278 388 499 522 546 574 602 463 323 375 427
684D27k9k8R2n1K9L0Q2Q1k9k9j10L3l2l2j85N3J59J5j2j56M5M5p2P1r9M4k0j63M6K85l4j78
$$ 427 398 370 462 411 440 470 552 633 604 575 465 498 466 434 249 302 461 476 464 308 353 398 326 397 298 342 322 159 205 490 456 278
681B78Q5Q5kjj1j0N1r3kljJ42j00M4L1j13k4k3N0N0k1k2n7n6OPJ44%J00m5j13L1MLN7q8po
$$ 278 363 448 446 445 434 424 475 382 380 377 376 518 418 462 493 380 356 333 383 433 412 390 333 277 283 290 434 434 534 489 376 407 411 414 471 383 376 370
678C70p8p7M2M2L7L6L6L6o2o2N8N7l5l5O6O7J30j57MMM3M3M3M3m0m0j11j12N4N4j7j8n3n4
$$ 370 292 215 257 299 336 372 408 444 382 320 378 435 400 365 431 498 628 471 475 479 522 565 608 651 611 571 460 348 402 456 439 421 368 314
675C14O6O6o9o8J29J29M7k40poR0R1R1R1j44j44k34N3J36J36L4L4k1k2r3r3O2O3k7K60j54
$$ 314 380 446 377 309 438 567 614 374 367 361 451 542 633 724 580 436 202 255 391 527 561 595 574 552 459 366 428 491 464 724 570
672E70j54j7j6L3L3L3L3r6r7P2P1NOJ67j21l0l1j38J49Q8Q7o2o2m1m1L0L1j6j6j6j6jkP1P1
$$ 570 416 399 383 416 449 482 515 419 322 394 465 470 476 643 522 492 461 323 472 560 647 585 523 482 441 471 502 486 470 454 438 437 435 506 577
669E77r4r4P3P4n2n2n2n2P9Q0m0m0RJ0RJ0POPONMq6K02j21j21J6J6L0K9K9L0mmO9O8k7k7k6
$$ 577 483 389 462 536 484 432 380 328 407 487 447 407 416 426 435 445 452 458 465 471 476 480 394 596 475 354 370 386 416 445 474 504 500 496 565 633 606 579 553
665E53k7m5m5J17j70M2M2m8m8J15J16n3n2m7m8J20J21o1o1J1J1l6l6j8j8r9J88RRJ75j13p1
$$ 553 526 481 436 553 383 425 467 419 371 486 602 549 497 450 402 522 643 582 521 532 543 507 471 453 435 336 524 533 542 717 604 533
662E33p1L7L7l5l4J3J3J4J3j18j18j7j6J77j10N1N2o1o0Q9Q8P8k11J01J01J25j62jjooooQ
$$ 533 462 499 536 501 467 480 493 507 520 402 284 267 251 428 318 369 421 360 300 389 477 555 344 445 546 671 509 508 507 501 495 489 483 491
659D91PQPJ0J0k23O4j1j1j1j1K71j7p1p1M3M3M3M3r3r3q8K01l4l3j6j5l8l7N2N2j50J38L0
$$ 491 498 506 513 523 533 310 374 363 352 341 330 601 584 513 442 485 528 571 614 521 428 340 541 507 474 458 443 405 368 420 472 322 460 490
656D90K9P2k15J8J8M0M1l2l1NNNNQPQQm1m2P8P9p9p9M1M1P8P9POj4j4P6P5k17P0K9K8q4q4
$$ 490 519 591 376 394 412 452 493 461 430 435 440 445 450 458 465 473 481 440 398 476 555 476 397 438 479 557 636 643 649 635 621 697 772 555 625 654 682 598 514
653E14L6L6l9l9m0l9NMMNK5K4K5K5l2l2Q8Q7j13j14N4N4l0k9P2P2L3k55oJ38J9J9K9K8o7o8
$$ 514 550 586 547 508 468 429 434 438 442 447 472 496 521 546 514 482 570 657 544 430 484 538 508 479 551 623 656 401 395 533 552 571 600 628 561 493
649D93J16k9J48j39o7P6M1M1q8q8K49l8k06Q1J0Ro3o3K06q2j45J42m5R8L6L6llp5p5J0J1q8
$$ 493 609 580 728 589 522 598 639 680 592 504 753 715 509 590 600 609 546 483 689 607 462 604 559 657 693 729 726 723 648 573 583 594 506
646E06N5J37j51l5l4j15J72J1J0r2r3K7K7J28J27q7q8j3j3N9N8m2m2L8L8j80l6J16j71J43
$$ 506 561 698 547 512 478 363 535 546 556 464 371 398 425 553 680 593 505 492 479 538 596 554 512 550 588 408 372 488 317 460
644D60J43NOJ5J5%%J11j30O0q5J0J54Q4k50K1K2j70O9Q8Q9o5o5L7L7j30j31L2L3L2L3N0N0
$$ 460 603 608 614 629 644 644 644 755 625 685 600 610 764 848 598 619 641 471 540 628 717 652 587 624 661 531 400 432 465 497 530 580 630
641F30k2k2qqO3O4MMo8o8RQRQK2K2l5l5J0K50j01j01L6L5K1K0J10j30j57j3N5q8m4J00O4O3
$$ 630 608 586 578 570 633 697 701 705 637 569 578 586 595 603 625 647 612 577 587 837 736 635 671 706 727 747 857 727 570 557 612 524 480 580 644 707
637G07j82N8L7L6nnr3J46N6q8J3J3n5Q8J16j23j14J25opQQk5k6k5k6J%L6L6MNn9n9p6O8j9
$$ 707 525 583 620 656 651 646 553 699 755 667 680 693 638 726 842 719 605 730 724 717 725 733 708 682 657 631 632 632 668 704 708 713 654 595 519 587 568
634E68K21p5O8M8r6o0o0N1N0l0l0O6p8o7J72J28j12m6m5N9O0j7j7j7j7J5J6k1k1l1l1M1M1
$$ 568 789 714 782 830 734 674 614 665 715 685 655 721 643 576 748 876 764 718 673 732 792 775 758 741 724 739 755 734 713 682 651 692 733
631G33n6n5k0k0M5M4Q1Q1K2K3KKj37J03M9r5k2k3o1J78R6j44q0q1M8j92J11J11L1L1m1m0Q1
$$ 733 677 622 602 582 627 671 752 833 855 878 880 882 745 848 897 802 780 757 696 874 970 826 746 665 713 521 632 743 774 805 764 724 805
628H05Q2J0J1K7K7m4m5N9N8q1q2J62j73%JJ83n6qrR9j40r6M9O7p6Q6Q5M1M1l1l1p6p5J39J40
$$ 805 887 897 908 935 962 918 873 932 990 909 827 989 816 816 817 1000 944 936 927 1026 886 790 839 906 830 916 1001 1042 1083 1052 1021 945 870 1009 1149
625A149r9r8J01J02M2j97j5J29j69k5J13l1j33J1Q9Q8n3n3O7O6PPJ14k20J56J3KJp6p6m0m0
$$ 1149 1050 952 1053 1155 1197 1000 985 1114 945 920 1033 1002 869 880 969 1057 1004 951 1018 1084 1091 1098 1212 992 1148 1161 1163 1164 1088 1012 972 932
622I32M6M7M6M7M7M7J82n8j25j26P5P5k4k5M8M7k9k9PPM3M4N3N2n5Q9k02n8J50Ok3k4j4j5
$$ 932 978 1025 1071 1118 1165 1212 1394 1336 1211 1085 1160 1235 1211 1186 1234 1281 1252 1223 1230 1237 1280 1324 1377 1429 1374 1463 1261 1203 1353 1359 1336 1312 1298 1283
619A283N8N8k2k2N0r4J78L4J00m4J58q2j71O9O5p8J38J37K2K1J12j28J23k0r7M5r4N0J06J07
$$ 1283 1341 1399 1377 1355 1405 1311 1489 1523 1623 1579 1737 1655 1484 1553 1618 1540 1678 1815 1837 1858 1970 1842 1965 1945 1848 1893 1799 1849 1955 2062
616B062p1P3j7j7K9j14L9L8J53J53j58Q1J01m2k8J17J4J5P4P5m3J96R7k37n8J81L5L5p8O7
$$ 2062 1991 2064 2047 2030 2059 1945 1984 2022 2175 2328 2170 2251 2352 2310 2282 2399 2413 2428 2502 2577 2534 2730 2827 2590 2532 2713 2748 2783 2705 2772
613B772J86M2%Jj8J26Q2Q2N5N5J42J42O5q0J8J61P1P1P7P7J64J64o5J75K47QR8R8J10J11J48
$$ 2772 2958 3000 3000 3001 2983 3109 3191 3273 3328 3383 3525 3667 3732 3652 3670 3831 3902 3973 4050 4127 4291 4455 4390 4565 4812 4820 4918 5016 5126 5237 5385
611E385NK14K14O1K05K76J33K84K83J23J22J60M00L45K02L33L32K87N27M21Q7N95M51L67N11
$$ 5385 5390 5604 5818 5879 6084 6360 6493 6777 7060 7183 7305 7465 7865 8210 8412 8745 9077 9364 9891 10312 10399 10994 11445 11812 12323
608A2323N56P00O93O93Q39Q40P31J018J072P85J157J444J319J605J766J765J983K128K573
$$ 12323 12879 13579 14272 14965 15804 16644 17375 18393 19465 20250 21407 22851 24170 25775 27541 29306 31289 33417 35990
607C5990K860K936L223L612M090M534N013N352N831O266O744P259P402P505P648P293O814
$$ 35990 38850 41786 45009 48621 52711 57245 62258 67610 73441 79707 86451 93710 101112 108617 116265 123558 130372
605A30372O231N368M276L031J702P4j257k693l903m956n854o524p100p099p203p204o955o811
$$ 130372 136603 141971 146247 149278 150980 151054 149797 147104 143201 138245 132391 125867 118767 111668 104465 97261 90306 83495
603H3495o249n961n659n180m670m190l868l580l350k871k605k460k107k106j672j673j534
$$ 83495 77246 71285 65626 60446 55776 51586 47718 44138 40788 37917 35312 32852 30745 28639 26967 25294 23760
602B3760j248j361j217j126r83q86q87q18q18o98o98o77o77n72m29o02l14m77l33m03m04k57
$$ 23760 22512 21151 19934 18808 17825 16939 16052 15234 14416 13718 13020 12343 11666 11094 10665 10063 9749 9272 8939 8536 8132 7875
600G875k58m58j71j00l86j88j89k42k42j81j82k35k35k24O3k33r0k42M6j08j07j08j08j07
$$ 7875 7617 7159 6988 6888 6502 6314 6125 5883 5641 5460 5278 5043 4808 4584 4647 4414 4324 4082 4128 4020 3913 3805 3697 3590
598C590j08p2p2j44j43k6k7r8r8o8o9LLj8j7n3n3q6q5j48R1r8r8O9p4l9l9j2j2n8n8R5R4j4
$$ 3590 3482 3410 3338 3194 3051 3025 2998 2900 2802 2734 2665 2668 2671 2653 2636 2583 2530 2444 2359 2211 2302 2204 2106 2175 2101 2062 2023 2011 1999 1941 1883 1978 2072 2058
595B058k54M8M9q2q2j36QK7j17Q9n4nnn0n0m2m3R2j47QRKKj15K7N5q9k52J78M6M7%%j19j20
$$ 2058 1804 1852 1901 1819 1737 1601 1609 1636 1519 1608 1554 1549 1544 1494 1444 1402 1359 1451 1304 1312 1321 1323 1325 1210 1237 1292 1203 951 1129 1175 1222 1222 1222 1103 983
591I83l8l8J21J20K9j15p1p0Q9Q8j21K2N9q4mmJj43O7O6m7R7J5J6q9r0M6M5j74O5KKJ31J32
$$ 983 945 907 1028 1148 1177 1062 991 921 1010 1098 977 999 1058 974 970 966 967 824 891 957 910 1007 1022 1038 949 859 905 950 776 841 843 845 976 1108
588A108j65k1j6j6m3m3k5k5j0j0r2J48MMJ18k6k06J29j4j4POllK6j17k18J18PJ51L5L4j57
$$ 1108 943 922 906 890 847 804 779 754 744 734 642 790 794 798 916 890 684 813 799 785 792 798 795 792 818 701 483 601 608 759 794 828 671
585F71j3K4K3q4N9P2P2k4k4j71O8Q6n7o9o9n9Q4R8k36J50J50k36R9j7j7J08J09j07j07M4M4
$$ 671 658 682 705 621 680 752 824 800 776 605 673 759 702 633 564 505 589 687 451 601 751 515 614 597 580 688 797 690 583 627 671
582F71l8l7O1q2K5K5l5j78O1O1J83L9P3p2rj53N4j86qqR7R7QQj45jO8O8P0p3K3k16J66K3m9
$$ 671 633 596 657 575 600 625 590 412 473 534 717 756 829 757 748 595 649 463 455 447 544 641 649 657 512 511 579 647 717 644 667 451 617 640 591
579E91R4p2J66%k40L0L0n5n5QRJ07l6ooK27j2j02j02Q2o2j51Q8k2k3P4P4j37OL7L7R0n3m4
$$ 591 685 613 779 779 539 569 599 544 489 497 506 613 577 571 565 792 780 678 576 658 596 445 533 511 488 562 636 499 505 542 579 669 616 572
576E72m4o4o4Q8n5K2K1n1n0j7J27l5J09K3K3K02l7n4n3q4J56q3q2N2N2J2J2k27J2j52Q7J29
$$ 572 528 464 400 488 433 455 476 425 375 358 485 450 559 582 605 807 770 716 663 579 735 652 570 622 674 686 698 471 483 331 418 547
573E47j5p3P0r2r1O9O8j2j2Q8n6J6J6Q3o0J1J2L6j08k7k7J2J2n1n0o7P6J16J16k8k8m6R7K4
$$ 547 532 459 529 437 346 415 483 471 459 547 491 507 523 606 546 557 569 605 497 470 443 455 467 416 366 299 375 491 607 579 551 505 602 626
570F26j20J14l0oj50o0K75l4j79L5L4O1q2q3O2lkPPj1j1j1j1M1M1M0M1j0j0j44R5m2m2k8k7
$$ 626 506 620 590 584 434 374 649 615 436 471 505 566 484 401 463 460 458 465 472 461 450 439 428 469 510 550 591 581 571 427 522 480 438 410 383
567C83K0J9j1J33J57j78J00m3j7j6k6k6r7r7J19j21K4J68r6M8P4j67M1M0N7q7P4o9k5k6M6
$$ 383 403 422 411 544 701 523 623 580 563 547 521 495 398 301 420 299 323 491 395 443 517 350 391 431 488 401 475 406 381 355 401
564D01M6j12L1K14P0j30J10k5k5j66k2j6J28m3m2m3m2J54J2R2R2q8q8j6j6o0n9J41lK1K1o0
$$ 401 447 335 366 580 650 520 630 605 580 414 392 376 504 461 419 376 334 488 500 592 684 596 508 492 476 416 357 498 495 516 537 477
561D77n9j8j8N4N3k0k0L4L3J31j56j56J31N0N0lmm8m8m9m8J23J23j5j4Q2k05K9K9p4p3R4R5
$$ 477 418 400 382 436 489 469 449 483 516 647 491 335 466 516 566 563 559 511 463 414 366 489 612 597 583 665 460 489 518 444 371 465 560
558E60n0m9n0m9K1K0K1K1QPj54J33m8m8J38J37J1J0j57j57n1n1J16J17PQPQM2M3l0k9j1j2
$$ 560 510 461 411 362 383 403 424 445 453 460 306 439 391 343 481 618 629 639 482 325 274 223 339 456 463 471 478 486 528 571 541 512 501 489
555D89J69j20j18J68q3q2R5R5p2p2n5n4O6O5o0o0J1J2N7N8o3o2l6l5L6L6L1L0k04Q4O5O4Q3
$$ 489 658 538 420 588 505 423 518 613 541 469 414 360 426 491 431 371 382 394 451 509 446 384 348 313 349 385 416 446 242 326 391 455 538
552E38Q2j15j14NNN2N3N3N3j52j51O3O4j7j7j7j7N2N1j63j64Q9Q9K7K6j75l0J93N0n8Q6j33
$$ 538 620 505 391 396 401 453 506 559 612 460 309 372 436 419 402 385 368 420 471 308 144 233 322 349 375 200 170 363 413 355 441 308
549C08j32K48J05j50pp3P0r1N2P4o8L0j14RJ0n3R1L3j10M3M2J22k1J4J4P6o8n9n9O7O7j34
$$ 308 176 424 529 379 372 299 369 278 330 404 336 366 252 261 271 218 309 342 232 275 317 439 418 432 446 522 454 395 336 403 470 336
546C36J0llJ32j2n0R3J8k22K5K4k6J17j80l7J01m3k3J20J38j01j22K3kkj8j8K28j3Rj34q7
$$ 336 346 343 340 472 460 410 503 521 299 324 348 322 439 259 222 323 280 257 377 515 414 292 315 313 311 293 275 503 490 499 365 278
544B78N6J79L4l4l4p3P1M6M7K5k15P9P9O8p6l2l1N2N3p7p6N8q5p7p6k8k7J43r6J15J16mmq9
$$ 278 334 513 547 513 479 406 477 523 570 595 380 459 538 606 530 498 467 519 572 495 419 477 392 315 239 211 184 327 231 346 462 458 454 365
540C65J51k2j67M5M5m5R9m4m4J18k6o3o4J82n7k9k9K8K8O8O9j38J01k3k3qqj3j2j3j2L7L7
$$ 365 516 494 327 372 417 372 471 427 383 501 475 412 348 530 473 444 415 443 471 539 608 470 571 548 525 517 509 496 484 471 459 496 533
537E33M6M7j80l6J8k22KKJ06J07O6O6P3j68Kj42nml6l6L6L6OPPOk2k3J3J4R8R8j17j17R6R6
$$ 533 579 626 446 410 428 206 208 210 316 423 489 555 628 460 462 320 315 311 275 239 275 311 317 324 331 337 315 292 305 319 417 515 398 281 377 473
534D73j19J20Rj34L3L3NNj39J00J09l6K2j22J0RJ%P7P6m4m3K4K3l3l3l4K06r7r6L8L8l4l4
$$ 473 354 474 483 349 382 415 420 425 286 386 495 459 481 359 369 378 379 379 456 532 488 445 469 492 459 426 392 598 501 405 443 481 447 413
531D13J27J27m1m1k6k5o1o1L2L2m0m0r2r3J07J08J52q8l3J10j28j28M9M8l8l9L4L3M6M6J0
$$ 413 540 667 626 585 559 534 473 412 444 476 436 396 304 211 318 426 578 490 457 567 439 311 360 408 370 331 365 398 444 490 500
528E00J0k3k3M8M9l5l4N2N2j73O7o9o8q0q0J35J35m7m7M3j01M2J87n6n6j32J09R3j46K11k8
$$ 500 510 487 464 512 561 526 492 544 596 423 490 421 353 273 193 328 463 416 369 412 311 353 540 484 428 296 405 498 352 563 535
525E35j09L5o8o8O0O1p3p2R5R5l0k9l8l8J56J3Oj37OOllqqKj43J09J08k0k1KKKKM7M8j06L8
$$ 535 426 461 393 325 385 446 373 301 396 491 461 432 394 356 512 525 531 394 400 406 403 400 392 384 386 243 352 460 440 419 421 423 425 427 474 522 416 454
522D54N6N7r4r4p6O7JJr2J48J3J3p0o9M9N0QQppO9j70LJ46J5J6L3j11QQQ8n5q6N7m1J02p3
$$ 454 510 567 473 379 303 370 371 372 280 428 441 454 384 315 364 414 422 430 423 416 485 315 318 464 479 495 528 417 425 433 521 466 380 437 396 498 425
519D25p3o4P9p4O9O0O1L1j12l2l2N8N9J9j24O7O7l2J12J7j28m6m7J59J5K5K4n2n2m3m3j13
$$ 425 352 288 367 293 362 422 483 514 402 370 338 396 455 474 350 417 484 452 564 581 453 407 360 519 534 559 583 531 479 436 393 280
516B80L1n1n0R1R0j4j4j45R5m9R5j5j4onJ36J36p0p0j87m3R1R1J0J0J0J0j06j07P0P0m5J00
$$ 280 311 260 210 301 391 377 363 218 313 264 359 344 330 324 319 455 591 521 451 264 221 312 403 413 423 433 443 337 230 300 370 325 425
513D25J9J8L1L0L1L0r6r7P9Q0k7J17j79l6J62p8j88N0K1K1L6L6j4j4j5j4n6n6o5P9J17J18
$$ 425 444 462 493 523 554 584 488 391 470 550 523 640 461 425 587 509 321 371 392 413 449 485 471 457 442 428 372 316 251 330 447 565
510E65j49nK12k20L3L2N0N1j59j6J00m3j61P9O7O7M3j01p3p4P0p4N4N4o5o6l8J05l9l9j4J30
$$ 565 416 411 623 403 436 468 518 569 410 394 494 451 290 369 436 503 546 445 372 298 368 294 348 402 337 271 233 338 299 260 246 376
507C76k4k3M0L9M0L9m4m5K13k18q6J53O3O4k5k4m3J01M6r8j7j7m8j91J53J53m7m7j5K25m7
$$ 376 352 329 369 408 448 487 443 398 611 393 307 460 523 587 562 538 495 596 642 544 527 510 462 271 424 577 530 483 468 693 646
504F46m7j67P3j1j1J2J3j24J9J0J1JJKJl7l7K6K6M4j00N3N3j8j8j0rn0R4K2K2l9J05K4K4p5
$$ 646 599 432 505 494 483 495 508 384 403 413 424 425 426 428 429 392 355 381 407 451 351 404 457 439 421 411 402 352 446 468 490 451 556 580 604 529
501E29p5O6O6j79J56j04j04J30J29k21J9K4K4J08k28Q2Q3q9J51J57q3K8j16J13J13L8j05k86
$$ 529 454 520 586 407 563 459 355 485 614 393 412 436 460 568 340 422 505 416 567 724 641 669 553 666 779 817 712 426
498D26N0J9K0M4M3j9j9j52pJ03m0J69K5k2k3m3m2P7P7j91j91J62J9l7J06J07l7j15K9J96N3
$$ 426 476 495 515 559 602 583 564 412 405 508 468 637 662 640 617 574 532 609 686 495 304 466 485 448 554 661 624 509 538 734 787
495G87j19K5p3p4o2k05J29J30P2p1j34J05J26j7R6m7p3P1M7r7M0k01p4p4O2O1j9J25llPOr1
$$ 787 668 693 620 546 484 279 408 538 610 539 405 510 636 619 715 668 595 666 713 616 656 455 381 307 369 430 411 536 533 530 537 543 452
492D52r1K05O2j9j9k8k8R7R7K5K5kkp3p4M1M1M1M1ppj6j6J38nk06Q1r9j00Q6Q6j17j17J46
$$ 452 361 566 628 609 590 562 534 631 728 753 778 776 774 701 627 668 709 750 791 784 777 761 745 883 878 672 753 654 554 640 726 609 492 638
489F38J46j19j18J8J9j40J47N7q7J59J5j14L0K4K4o6P7Q7k01N1r3PQP1P0%%P2P2j34j35L3
$$ 638 784 665 547 565 584 444 591 648 561 720 735 621 651 675 699 633 710 797 596 647 554 561 569 640 710 710 710 782 854 720 585 618
486F18L3J1J0J1J1n3n3O7O6j17j17R8R8m3m3K8K9J1J0n2R2j54J34J43j45L5L5J7J7PPPPm4
$$ 618 651 662 672 683 694 641 588 655 721 604 487 585 683 640 597 625 654 665 675 623 715 561 695 838 693 728 763 780 797 804 811 818 825 781
483G81m4K8K8k6k5R5R5O6O6j10j11P3p1j61J26j4j58J3J3J3J2J3J3n6n7Pj37K51l6l6J07p2
$$ 781 737 765 793 767 742 837 932 998 1064 954 843 916 845 684 810 796 638 651 664 677 689 702 715 659 602 609 472 723 687 651 758 686
480F86p2K18o9J1J2j95J41L4L4k5k6P2p1P3P2J04m0m0J04K7K8j70O9Q0Q0K2K3j07j06O9P0
$$ 686 614 832 763 774 786 591 732 766 800 775 749 821 750 823 895 999 959 919 1023 1050 1078 908 977 1057 1137 1159 1182 1075 969 1038 1108
478A108q8N7j6j6l9J05R5R6m1m1n0R4J56J55M4M5nnmnppP4P4n4R0J30K73J07j32Q4Q3NMM6
$$ 1108 1020 1077 1061 1045 1006 1111 1206 1302 1261 1220 1170 1264 1420 1575 1619 1664 1659 1654 1650 1645 1638 1631 1705 1779 1725 1815 1945 2218 2325 2193 2277 2360 2365 2369 2415
474B415K86jJ44Q6Q7L1J75J3J3J84M0J30j4N2N2p6p7j36j36j54j0J4j30j93m9l3l3j34j35
$$ 2415 2701 2700 2844 2930 3017 3048 3223 3236 3249 3433 3473 3603 3589 3641 3693 3617 3540 3404 3268 3114 3104 3118 2988 2795 2746 2713 2680 2546 2411
472B411j61j8j62j61j27J7p2P0j19j19j4j58k7K12r0r0j63k0n0m9J23k11M8M9r2r2J15J14
$$ 2411 2250 2232 2070 1909 1782 1799 1727 1797 1678 1559 1545 1387 1360 1572 1482 1392 1229 1209 1159 1110 1233 1022 1070 1119 1027 935 1050 1164
469A164N5r0J0j34r0N5l6l5J0J0J0J0o7o8M3M3M3j01R9J00j28j28Q2o2r9M6j26j25K21P7j0
$$ 1164 1219 1129 1139 1005 915 970 934 899 909 919 929 939 872 804 847 890 933 832 931 1031 903 775 857 795 696 742 616 491 712 789 779
466G79j0lkP8o5o3o2P2p1O2q1J79j56LKj8j9P6P5j25J9mmR5m9r2N0l8l9O8O9llL6L5p5p5j34
$$ 779 769 766 764 842 777 714 652 724 653 715 634 813 657 660 662 644 625 701 776 651 670 666 662 757 708 616 666 628 589 657 726 723 720 756 791 716 641 507
463E07J1J98m1j10J30k9l0J64K0k4j69nJ38l2l2N5r0qqmmj4j3J17k6k7J17j40j40J17k7O8
$$ 507 518 716 675 565 695 666 636 800 820 796 627 622 760 728 696 751 661 653 645 641 637 623 610 727 701 674 791 651 511 628 601 669
460F69O7j23j24J87n3j87J48Q5n8N2N2q1O3j8j8m5m5J13J14l2j75pqj16J23J76j58P4P4k8
$$ 669 736 613 489 676 623 436 584 669 611 663 715 634 697 679 661 616 571 684 798 766 591 584 576 460 583 759 601 675 749 721
457G21k7K0j24o0o1K54l3QQj4j4P6k11M9N0m0m1N0M9p0p0kkO9P0l8l9L4L4m1m1J27J27p4p3
$$ 721 694 714 590 530 469 723 690 698 706 692 678 754 543 592 642 602 561 611 660 590 520 518 516 585 655 617 578 612 646 605 564 691 818 744 671
454F71j46j46J17J17r9r8J05J04o2o3OPj13j14R9R8k1k1K7K8rqJ3J2M8M9O1O1j54j54M2M3
$$ 671 525 379 496 613 514 416 521 625 563 500 506 513 400 286 385 483 462 441 468 496 487 479 492 504 552 601 662 723 569 415 457 500
451E00M2M2J0J0o2o2O8O8mmj00j00Q2o1K57l0o3o2J58j29j30J59J7J8q5q4M8M8M9M8r5r5K5
$$ 500 542 584 594 604 542 480 548 616 612 608 508 408 490 429 686 656 593 531 689 560 430 589 606 624 539 455 503 551 600 648 553 458 483
448D83K5M0L9LMJ7J7j9j9L2L2l9m0j7j7J9J8m7m8K4K4j2j2m8m7L8L7L8L8j4j5n0n1J4J3n8
$$ 483 508 548 587 590 594 611 628 609 590 622 654 615 575 558 541 560 578 531 483 507 531 519 507 459 412 450 487 525 563 549 534 484 433 447 460 402
445D02n8PQj9k0N4J98L9j05o6P7N0N0j4j58N1N1j08L5j09J30k9l0J20j20J12J11o2o2r5M9
$$ 402 344 351 359 340 320 374 572 611 506 440 517 567 617 603 445 496 547 439 474 365 495 466 436 556 436 548 659 597 535 440 489
442D89n3n4o7J72N3j87nmQ6Q6J30j09j03j02J40mo7P8j48lJ25J25J4k25KLj00K36q7q8J83
$$ 489 436 382 315 487 540 353 348 344 430 516 646 537 434 332 472 468 401 479 331 328 453 578 592 367 369 372 272 508 421 333 516
439E16n7lkJ0j33N9N9O4q0p1P3p8O6k4J20O3q1r0J49M0L9j85m1l6J07L6L5J7J6o5o4R9m5j26
$$ 516 459 456 454 464 331 390 449 513 433 362 435 357 423 399 519 582 501 411 560 600 639 454 413 377 484 520 555 572 588 523 459 558 513 387
436C87J8R7m6L5L4pj52l7K02mlq8J52j04j04L1L0ooO6p8J26j9k7k8lj47j2J31j38J01l3l4
$$ 387 405 502 456 491 525 518 366 329 531 527 524 436 588 484 380 411 441 435 429 495 417 543 524 497 469 466 319 307 438 300 401 368 334
433C34Q7n8m8R6j07L8P0P0P8j62j08L6PQK04j30q1q1J22J22n9Q4j76J59p7O6n1n0j00J40P7
$$ 334 421 363 315 411 304 342 412 482 560 398 290 326 333 341 545 415 334 253 375 497 438 522 346 505 428 494 443 393 293 433 510
431E10o7n7k02J73o7M0M0L3L4n5Q9J7J7j29J4J4j29J70J70j11j12rj52M8M8k7k7M5M5k2k2
$$ 510 443 386 184 357 290 330 370 403 437 382 471 488 505 376 390 404 275 445 615 504 392 383 231 279 327 300 273 318 363 341 319
428C19N1N0M1M1j12L2m7m8Q0Q1j6j7j6j7n2n2J09l4o1Q2Q2o1j11L2R5m8M3M2L4L4o6o6o6o6
$$ 319 370 420 461 502 390 422 375 327 407 488 472 455 439 422 370 318 427 393 332 414 496 435 324 356 451 403 446 488 522 556 490 424 358 292
425B92K7K7J17k7p6O8qpj25J14k1k0JKj4K26k2k3pqq5q5M4M4p0P3q8N6J8J8m4m5P4P4JKj33
$$ 292 319 346 463 436 360 428 420 413 288 402 381 361 362 364 350 576 554 531 524 516 431 346 390 434 364 437 349 405 423 441 397 352 426 500 501 503 370
421C70j32j4j3Q3Q3q5q5N3N4l3l3J89n1j71O9J09J08j1j2M6j94J3J3N8N9o0o1O6O7oj49j13
$$ 370 238 224 211 294 377 292 207 260 314 281 248 437 386 215 284 393 501 490 478 524 330 343 356 414 473 413 352 418 485 479 330 217
418B17J27j8j7J61J60n4n5r5r5P3P3j3j2j3j2L6L6q3q4lkllO9O9lkk6k5j60Q0L8L8N4N3m1
$$ 217 344 326 309 470 630 576 521 426 331 404 477 464 452 439 427 463 499 416 332 329 327 324 321 390 459 456 454 428 403 243 323 361 399 453 506 465
415D65m1m1m1mlJ01J01J03j37kkJ8J8J0R%j43J43r5J0Rp7p7O7O7p1P3j80N9N4N3j8j8J25j14
$$ 465 424 383 342 338 335 436 537 640 503 501 499 517 535 545 554 554 411 554 459 469 478 401 324 391 458 387 460 280 339 393 446 428 410 535 421
412D21q7N7N0r3jJ42N2N2q8q9j6j6J15J15n2n2n1n1n1n0P6P7m4m3k0j9M3M3P8o6p6O9R1n3
$$ 421 334 391 441 348 347 489 541 593 505 416 400 384 499 614 562 510 459 408 357 307 383 460 416 373 353 334 377 420 498 432 356 425 516 463
409D63q3q3kkPOrJ35O8j70J26J27j03j04m1m2kJ40k5k5J67J66j39J01j15K8m4m5l6l5mmnm
$$ 463 380 297 295 293 300 306 297 432 500 330 456 583 480 376 335 293 291 431 406 381 548 714 575 676 561 589 545 500 464 429 425 421 416 412
406D12p6p6R2R2o5o5L4L4j54K76j3j58M5r8R3R3l0k9N1r3K2K2R4n0K1K0J2J1q8q8K3K3J20
$$ 412 336 260 352 444 379 314 348 382 228 504 491 333 378 280 373 466 436 407 458 365 387 409 503 453 474 494 506 517 429 341 364 387 507
403E07k4j49R0L1L2l4k74N1N2L6L6qqJ11J12o0o1N0N1j9j62r0N3j18j17NK45J49r1k2k2J59
$$ 507 483 334 424 455 487 453 179 230 282 318 354 346 338 449 561 501 440 490 541 522 360 270 323 205 88 93 338 487 396 374 352 511
400E11J5j13L0N3r1J33j06j04j03J1K50l4l5j9j9o1o1J72j15O2O2M4M4L6L7l5l6K5K4j44j43
$$ 511 526 413 443 496 405 538 432 328 225 236 486 452 417 398 379 318 257 429 314 376 438 482 526 562 599 564 528 553 577 433 290
397B90J32J32j32j31P4P4LKO7O7O7O7j39j39K9K9l6l5l6l5JKKJk8k9R2R1q0p9M0M0K5K5m7
$$ 290 422 554 422 291 365 439 442 444 511 578 645 712 573 434 463 492 456 421 385 350 351 353 355 356 328 299 391 482 402 323 363 403 428 453 406
394D06m6mmO8O9K3K3j44j45P3P2JJl9l8q0K07r4r5R2R1l0l0l0l0K1K1n1n1qrQ1Q1j03J84K3
$$ 406 360 356 352 420 489 512 535 391 246 319 391 392 393 354 316 236 443 349 254 346 437 407 377 347 317 338 359 308 257 249 240 321 402 299 483 506
391E06K2k9l0p2K16q8q9KJj6j7N6N5j47j46O8O9%%j61J25J1J1K9K8o2o3J53J53q3q4q4q4P0
$$ 506 528 499 469 397 613 525 436 438 439 423 406 462 517 370 224 292 361 361 361 200 325 336 347 376 404 342 279 432 585 502 418 334 250 320
387C20P1q0p9j34J53O4O3Q8Q7k41M5l5l5N4N5klp4p4R6R6q9r0J45j44J9J8qqrql5l5Q4Q5K
$$ 320 391 311 232 98 251 315 378 466 553 312 357 322 287 341 396 394 391 317 243 339 435 346 256 401 257 276 294 286 278 269 261 226 191 275 360 362
384C62KP4P4q7q6L3L4J8J8J9J8k9l0k9l0n6n7L3L3o0K28J26j62j76J10o8o9L4L5J72J72k52
$$ 362 364 438 512 425 339 372 406 424 442 461 479 450 420 391 361 305 248 281 314 254 482 608 446 270 380 312 243 277 312 484 656 404
381D04L5n5n5J4J4mmJ35j53RRJ21J22J9k67NNl0l1K58k9q3q3qpM6M6K11p7j30j31P9P8OPn5
$$ 404 439 384 329 343 357 353 349 484 331 340 349 470 592 611 344 349 354 324 293 551 522 439 356 348 341 387 433 644 567 437 306 385 463 469 476 421
378D21n5n4n5Q0P9K6K7k06Q1rqR9R9o9o9j1j0j0j1L5L5l6l7j%jjLKo9p0Q2Q2J0J0k0k1J47
$$ 421 366 312 257 337 416 442 469 263 344 335 327 426 525 456 387 376 366 356 345 380 415 379 342 341 341 340 339 342 344 275 205 287 369 379 389 369 348 495
375D95J47j9k0j9j9k9l0j49j49R1R2p6p5M9M9k3k3m3m4K8K8J17J16n1n1l3l3L9L9J8J7n4n4
$$ 495 642 623 603 584 565 536 506 357 208 299 391 315 240 289 338 315 292 249 205 233 261 378 494 443 392 359 326 365 404 422 439 385 331
372C31K4K4m8m8J18J18kkl9l9m0l9p6p6M3M3j4j5Q0o2q5J54J1J0j5j4j5j5L4L3l8l9J9J8J9
$$ 331 355 379 331 283 401 519 517 515 476 437 397 358 282 206 249 292 278 263 343 281 196 350 361 371 356 342 327 312 346 379 341 302 321 339 358
368C58J8j18j19J45J45n7n7J5J4J22J21k20K0q0O5q2O1MLJ3J2M4M4p6p6O7O7O6O7j2j3q4q5
$$ 358 376 258 139 284 429 372 315 330 344 466 587 367 387 307 372 290 351 355 358 371 383 427 471 395 319 386 453 519 586 574 561 477 392
365C92L5L4l7l7onooJ2J2j56j2J78o2K9K8j11J77J23j65j71J16J37pK1K2k4k4j2j2K4K4n5
$$ 392 427 461 424 387 381 376 370 364 376 388 232 220 398 336 365 393 282 459 582 417 246 362 499 492 513 535 511 487 475 463 487 511 456
362D56n5J16k8k16P1O9O8l9m0Q0Q0j04j04J6J5ONONlkL3L3r1r1k0j9J43J43j23K0J84j03j00
$$ 456 401 517 489 273 344 413 481 442 402 482 562 458 354 370 385 391 396 402 407 404 402 435 468 377 286 266 247 390 533 410 430 614 511 411
359D11j00O1O1k8k9J45j44n3n4%jL6L6J8J8n4n3P6P6j22j22K9L15j09j09NNP7P7k7k7J07l6
$$ 411 311 372 433 405 376 521 377 324 270 270 269 305 341 359 377 323 270 346 422 300 178 207 522 413 304 309 314 391 468 441 414 521 485
$$ [...]
-3519I7%
-3519I7
##END=	
##END=	
