##TITLE=	Jul31-2014-fpc.21.fid
FPC195

##JCAMP-DX=	6.0	$$ MestReNova 14.1.0-24037
##DATA TYPE=	LINK
##BLOCK_ID=	1
##BLOCKS=	1    
##ORIGIN=	Mestrelab Research S.L.
##OWNER=	hrzepa
##$MNOVA/LINK_BLOCK_TYPE=	ITEM	$$ NMR Spectrum
##$MNOVA/ITEM/POLYGON=	(XY..XY)
5321,5835
8722,5835
8722,8208
5321,8208
5321,5835
##$MNOVA/ITEM/Z=	0
##$MNOVA/ITEM/ANGLE=	0
##TITLE=	Jul31-2014-fpc.21.fid
##JCAMP-DX=	6.0	$$ MestReNova 14.1.0-24037
##BLOCK_ID=	2
##DATA TYPE=	NMR SPECTRUM
##DATA CLASS=	XYDATA
##NUMDIM=	1
##ORIGIN=	Bruker BioSpin GmbH
##OWNER=	nmr
##.OBSERVE FREQUENCY=	75.499030390135004609
##.OBSERVE NUCLEUS=	^13C
##.SOLVENT NAME=	CDCl3
##.PULSE SEQUENCE=	zgpg30
##LONGDATE=	2014/07/31 23:23:00.000
##.ACQUISITIONMODE=	SIMULTANEOUS (DQD)
##$ORIGINAL FORMAT=	Bruker XWIN-NMR
##$MNOVA/SCALES_VERSION=	8
##$PARAMETER FILE=	(acqus, ASCII, /var/folders/f6/rjf_tdyn2v98c5c0wvkgn4s80000gq/T/D2yDAtWtSfq7Zw5brUHWCg/13C/acqus, 0)
$$ ##TITLE= Parameter file, TOPSPIN		Version 2.1
$$ ##JCAMPDX= 5.0
$$ ##DATATYPE= Parameter Values
$$ ##NPOINTS= 12	$$ modification sequence number
$$ ##ORIGIN= Bruker BioSpin GmbH
$$ ##OWNER= nmr
$$ $$ 2014-07-31 23:23:09.189 +0100  nmr@CHPC-NMR300
$$ $$ C:\u/data/fpc/nmr/Jul31-2014-fpc/21/acqus
$$ $$ process C:\Bruker\TOPSPIN2.1\prog\mod\shimcntl.exe
$$ ##$ACQT0= -1.57563025210084
$$ ##$AMP= (0..31)
$$ 100 100 100 100 100 100 100 100 100 100 100 100 100 100 100 100 100 100
$$ 100 100 100 100 100 100 100 100 100 100 100 100 100 100
$$ ##$ANAVPT= -1
$$ ##$AQSEQ= 0
$$ ##$AQ_mod= 1
$$ ##$AUNM= <au_zgt>
$$ ##$AUTOPOS= <27 >
$$ ##$BF1= 75.490349
$$ ##$BF2= 300.22
$$ ##$BF3= 75.490349
$$ ##$BF4= 500.13
$$ ##$BF5= 500.13
$$ ##$BF6= 500.13
$$ ##$BF7= 500.13
$$ ##$BF8= 500.13
$$ ##$BYTORDA= 1
$$ ##$CFDGTYP= 0
$$ ##$CFRGTYP= 5
$$ ##$CHEMSTR= <none>
$$ ##$CNST= (0..63)
$$ 1 1 145 1 1 1 1 1 1 1 1 1 1 1 1 1 1 1 1 1 1 1 1 1 1 1 1 1 1 1 1 1 1 1 1
$$ 1 1 1 1 1 1 1 1 1 1 1 1 1 1 1 1 1 1 1 1 1 1 1 1 1 1 1 1 1
$$ ##$CPDPRG= <waltz16>
$$ ##$CPDPRG1= <>
$$ ##$CPDPRG2= <waltz16>
$$ ##$CPDPRG3= <>
$$ ##$CPDPRG4= <mlev>
$$ ##$CPDPRG5= <mlev>
$$ ##$CPDPRG6= <mlev>
$$ ##$CPDPRG7= <mlev>
$$ ##$CPDPRG8= <mlev>
$$ ##$CPDPRGB= <>
$$ ##$CPDPRGT= <>
$$ ##$D= (0..63)
$$ 0 2 0.00345 0 0 0 0 0 0 0.06 0 0.03 2e-005 3e-006 0 0 0.0002 0 0 0 0 0
$$ 0 0 0 0 0 0 0 0 0 0 0 0 0 0 0 0 0 0 0 0 0 0 0 0 0 0 0 0 0 0 0 0 0 0 0 0
$$ 0 0 0 0 0 0
$$ ##$DATE= 1406845380
$$ ##$DBL= (0..7)
$$ 120 120 120 120 120 120 120 120
$$ ##$DBP= (0..7)
$$ 150 150 150 150 150 150 150 150
$$ ##$DBP07= 0
$$ ##$DBPNAM0= <>
$$ ##$DBPNAM1= <>
$$ ##$DBPNAM2= <>
$$ ##$DBPNAM3= <>
$$ ##$DBPNAM4= <>
$$ ##$DBPNAM5= <>
$$ ##$DBPNAM6= <>
$$ ##$DBPNAM7= <>
$$ ##$DBPOAL= (0..7)
$$ 0.5 0.5 0.5 0.5 0.5 0.5 0.5 0.5
$$ ##$DBPOFFS= (0..7)
$$ 0 0 0 0 0 0 0 0
$$ ##$DE= 6
$$ ##$DECBNUC= <off>
$$ ##$DECIM= 6
$$ ##$DECNUC= <off>
$$ ##$DECSTAT= 4
$$ ##$DIGMOD= 1
$$ ##$DIGTYP= 7
$$ ##$DL= (0..7)
$$ 0 120 120 120 120 120 120 120
$$ ##$DP= (0..7)
$$ 150 150 150 150 150 150 150 150
$$ ##$DP07= 0
$$ ##$DPNAME0= <>
$$ ##$DPNAME1= <>
$$ [...]
$$ -1 -1 -1 -1 -1 -1 -1 -1 -1 -1 -1 -1 -1 -1 -1 -1 -1 -1 -1 -1 -1 -1 -1 -1
$$ -1 -1 -1 -1 -1 -1 -1 -1 -1 -1 -1 -1 -1 -1 -1 -1
$$ ##$RG_tab8= (0..255)
$$ -1 -1 -1 -1 -1 -1 -1 -1 -1 -1 -1 -1 -1 -1 -1 -1 -1 -1 -1 -1 -1 -1 -1 -1
$$ -1 -1 -1 -1 -1 -1 -1 -1 -1 -1 -1 -1 -1 -1 -1 -1 -1 -1 -1 -1 -1 -1 -1 -1
$$ -1 -1 -1 -1 -1 -1 -1 -1 -1 -1 -1 -1 -1 -1 -1 -1 -1 -1 -1 -1 -1 -1 -1 -1
$$ -1 -1 -1 -1 -1 -1 -1 -1 -1 -1 -1 -1 -1 -1 -1 -1 -1 -1 -1 -1 -1 -1 -1 -1
$$ -1 -1 -1 -1 -1 -1 -1 -1 -1 -1 -1 -1 -1 -1 -1 -1 -1 -1 -1 -1 -1 -1 -1 -1
$$ -1 -1 -1 -1 -1 -1 -1 -1 -1 -1 -1 -1 -1 -1 -1 -1 -1 -1 -1 -1 -1 -1 -1 -1
$$ -1 -1 -1 -1 -1 -1 -1 -1 -1 -1 -1 -1 -1 -1 -1 -1 -1 -1 -1 -1 -1 -1 -1 -1
$$ -1 -1 -1 -1 -1 -1 -1 -1 -1 -1 -1 -1 -1 -1 -1 -1 -1 -1 -1 -1 -1 -1 -1 -1
$$ -1 -1 -1 -1 -1 -1 -1 -1 -1 -1 -1 -1 -1 -1 -1 -1 -1 -1 -1 -1 -1 -1 -1 -1
$$ -1 -1 -1 -1 -1 -1 -1 -1 -1 -1 -1 -1 -1 -1 -1 -1 -1 -1 -1 -1 -1 -1 -1 -1
$$ -1 -1 -1 -1 -1 -1 -1 -1 -1 -1 -1 -1 -1 -1 -1 -1
$$ ##$RG_tabA= (0..255)
$$ 1 1.1 1.3 1.4 1.6 1.8 2 2.2 2.5 2.8 3.2 3.6 4 4.5 5 5.7 6.3 7.1 8 9 10.1
$$ 11.3 12.7 14.3 16 18 20.2 22.6 25.4 28.5 32 35.9 40.3 45.3 50.8 57 64 71.8
$$ 80.6 90.5 101.6 114 128 143.7 161.3 181 203.2 228.1 256 287.4 322.5 362
$$ 406.4 456.1 512 574.7 645.1 724.1 812.7 912.3 1024 1149.4 1290.2 1448.2
$$ 1625.5 1824.6 2048 2298.8 2580.3 2896.3 3251 3649.1 4096 4597.6 5160.6
$$ 5792.6 6502 7298.2 8192 9195.2 10321.3 11585.2 13004 14596.5 16384 18390.4
$$ 20642.5 23170.5 26008 29193 32768 36780.8 41285.1 46341 -1 -1 -1 -1 -1
$$ -1 -1 -1 -1 -1 -1 -1 -1 -1 -1 -1 -1 -1 -1 -1 -1 -1 -1 -1 -1 -1 -1 -1 -1
$$ -1 -1 -1 -1 -1 -1 -1 -1 -1 -1 -1 -1 -1 -1 -1 -1 -1 -1 -1 -1 -1 -1 -1 -1
$$ -1 -1 -1 -1 -1 -1 -1 -1 -1 -1 -1 -1 -1 -1 -1 -1 -1 -1 -1 -1 -1 -1 -1 -1
$$ -1 -1 -1 -1 -1 -1 -1 -1 -1 -1 -1 -1 -1 -1 -1 -1 -1 -1 -1 -1 -1 -1 -1 -1
$$ -1 -1 -1 -1 -1 -1 -1 -1 -1 -1 -1 -1 -1 -1 -1 -1 -1 -1 -1 -1 -1 -1 -1 -1
$$ -1 -1 -1 -1 -1 -1 -1 -1 -1 -1 -1 -1 -1 -1 -1 -1 -1 -1 -1 -1 -1 -1 -1 -1
$$ -1 -1 -1 -1 -1 -1 -1 -1 -1 -1 -1 -1 -1
$$ ##$ROUT14= (0..7)
$$ 0 0 0 0 0 0 0 0
$$ ##$ROUTER= 3
$$ ##$RX22TY= <tty10>
$$ ##$RXFMAX= (0..7)
$$ -1 -1 -1 -1 -1 -1 -1 -1
$$ ##$RXFMIN= (0..7)
$$ -1 -1 -1 -1 -1 -1 -1 -1
$$ ##$RXINTLV= (0..7)
$$ 0 0 0 0 0 0 0 0
$$ ##$RXMSTY= <no>
$$ ##$SCMTY= <no>
$$ ##$SGUC1= (0..15)
$$ 0 0 0 0 0 0 0 0 0 0 0 0 0 0 0 0
$$ ##$SGUC2= (0..15)
$$ 0 0 0 0 0 0 0 0 0 0 0 0 0 0 0 0
$$ ##$SPECTR= 5
$$ ##$SY2FLAG= 0
$$ ##$TFXNUM= 0
$$ ##$TRIPLO2= 0
$$ ##$VTUTY= <tty05>
$$ ##$WBREFAM= (0..15)
$$ 100 100 100 100 100 100 100 100 100 100 100 100 100 100 100 100
$$ ##$WBREFPH= (0..15)
$$ 0 0 0 0 0 0 0 0 0 0 0 0 0 0 0 0
$$ ##$XFAC= 2
$$ ##END=
$$ 
##$DECIM=	6
##$DSPFVS=	10
##XUNITS=	HZ
##YUNITS=	ARBITRARY UNITS
##FIRSTX=	18815.305417826530174
##LASTX=	-1509.8978342059699571
##DELTAX=	-0.310142721477569272
##XFACTOR=	1
##YFACTOR=	0.89624383708064203624
##FIRSTY=	-64.516510009765625
##MINY=	-429.331634521484375
##MAXY=	38557.33984375
##NPOINTS=	65536
##XYDATA=	(X++(Y..Y))
$$ [...]
7992e3MN6N7j0rj0rk6k4n7n8L1L0L1L0K2K4qroon9n9k8k8M6M6J9J9J9J9l7l6L8L9j9j8n0n0
7980a39j1j2K1K0K7K6K7K7L6L7j5j6j6j4j6j6n5n6J9J9OOO0N8Q2Q1l5l5r5r3o3o3M8M7o8o9
7969b40OPJ02J03O5O6qqp2p2j9j9k2k2k2k2KKKKJ6J7M8M8N8N8n8n8K9K7k3k5m9m8K6K6m2m2
7957a61J2J1K6K6ooMMk8k9N1N1J9J9QQRQl6l7N7N8n3n3k1k2n1n2j9k0Q9Q9Q8Q8K9K8lmo2o2
7945E7l1k9l4l4kkQRQQk1k1J1J1POPPm2m1L3L3qqqqj1j1j2j1n0m9n0m9L8L8L8L8K2K1K2K1
7932h9oonoK3K3l0l0MMn0m9k8k8K5K5R7R8r7r6j8J09J09j9p9p9RRO7O8L5L5l4l4l4l4l6l6
7920a83L8L8J7J6j5j6k4k5PQJ3J3j9j8NOOOJ7J7J7J7K2K2K1K2j14j15KLM6M7k7k8j2j2O2O2
7908e8M6M5M6M5k6k7k6k7m4m4m5m4j0j0j0j0j0j0j0j0M6M6M6M6j3j3j4j3mll6l6j7j8N7N7
$$ plain form
7992 -53 -49 7 64 54 45 35 26 0 -24 -81 -139 -108 -78 -47 -17 5 29 21 12 6 0 -59 -118 -146 -174 -128 -82 -63 -44 -25 -6 -43 -79 -41 -2 -21 -39 -89 -139
7980 -139 -150 -162 -141 -121 -94 -68 -41 -14 22 59 44 28 12 -2 -18 -34 -89 -145 -126 -107 -101 -95 -35 23 105 186 151 116 21 -72 -135 -198 -150 -103 -171 -240
7969 -240 -234 -227 -125 -22 43 109 101 93 21 -51 -70 -89 -111 -133 -155 -177 -175 -173 -171 -169 -153 -136 -88 -40 18 76 18 -40 -11 16 -7 -32 -81 -129 -103 -77 -119 -161
7957 -161 -149 -138 -112 -86 -92 -98 -94 -90 -118 -147 -96 -45 -26 -7 1 9 18 26 -10 -47 10 68 15 -38 -59 -81 -132 -184 -203 -223 -134 -45 43 131 160 188 185 181 119 57
7945 57 26 -3 -37 -71 -73 -75 -67 -58 -50 -42 -63 -84 -73 -62 -55 -49 -42 -35 -77 -118 -85 -52 -60 -68 -76 -84 -95 -106 -118 -129 -179 -228 -278 -327 -289 -251 -213 -175 -153 -132 -110 -89
7932 -89 -95 -101 -106 -112 -89 -66 -96 -126 -122 -118 -168 -217 -245 -273 -248 -223 -126 -28 -125 -221 -239 -130 -21 -40 -119 -198 -189 -180 -113 -45 -10 25 -9 -43 -77 -111 -147 -183
7920 -183 -145 -107 -90 -74 -89 -105 -129 -154 -147 -139 -126 -113 -132 -150 -145 -139 -133 -127 -110 -93 -76 -59 -37 -15 6 28 -86 -201 -199 -196 -150 -103 -130 -158 -170 -182 -120 -58
7908 -58 -12 33 79 124 98 71 45 18 -26 -70 -115 -159 -169 -179 -189 -199 -209 -219 -229 -239 -193 -147 -101 -55 -68 -81 -95 -108 -112 -115 -151 -187 -204 -222 -165 -108
7897a08P6P4q2q4MMn0m9m5m5P1P2L6L5o0o0k4k5PPK5K4K4K5J8J8J9J8pqpql5l6Q2Q1O3O3n3
7885F0n3j2j3j3j3rj0n4n5p9M8L0L0M4M4P5P6k3k2p5p6NONOpoq1q1j7j7j6j7K4K3K4K4P6P7
7873g2P6P6J7J6J6J7RJ0o4o5k3k1k3k3M1L9M0M0j6j5j6j6j1j1j1j0j6j6j6j6L5L4Q7Q8j26
7862E4j24n9O8N1M9j5j6LLMLJ9K0j3j3m4m5N0N0L1L0m3m3l5l6l5l6j1j1j1j1P0P0L6L8l3l2
7851a7q7q6n0n0n0n0J33J32N9N8KKKKLMLMQRk4k2n9n9n9n9K1K0Q8Q8M1o3l5l6kkl3l4J8J8
7838a62J8J8j8j7J5J5J%l1l1J7J6M8M8J2J1J2J2k0k0k0k1o5o6L0L0P4P4j%m8m9m8m8m6m6N0
7827b56N0OOOPK1K1n3n3j2j2K0K0P4P5K1K1j8j9J4J4O6O7J0J1l4r6r7l4P5P5M6M7Q8Q9Qn6
7815B18r2r2k2k0K9L1kj07j06m3J5J4K5Q8L6k9j4j3J4J4LKL5L4%%%%K5K4K0K1k4q7q8k4m1
$$ plain form
7897 -108 -32 42 -40 -124 -120 -116 -166 -215 -260 -305 -234 -162 -126 -91 -151 -211 -235 -260 -253 -246 -221 -197 -173 -148 -130 -112 -93 -75 -82 -90 -97 -105 -140 -176 -94 -13 50 113 60
7885 60 7 -5 -18 -31 -44 -53 -63 -117 -172 -251 -203 -173 -143 -99 -55 20 96 73 51 -24 -100 -95 -89 -84 -78 -85 -91 -172 -253 -270 -287 -303 -320 -296 -273 -249 -225 -149 -72
7873 -72 4 80 97 113 129 146 155 165 101 36 13 -8 -31 -54 -13 26 66 106 90 75 59 43 32 21 10 0 -16 -32 -48 -64 -29 5 92 180 54
7862 54 -70 -129 -61 -10 39 24 8 11 14 18 21 40 60 47 34 -10 -55 -5 45 76 106 63 20 -15 -51 -86 -122 -133 -144 -155 -166 -96 -26 10 48 15 -17
7851 -17 -104 -190 -240 -290 -340 -390 -257 -125 -66 -8 -6 -4 -2 0 3 7 10 14 22 31 7 -15 -74 -133 -192 -251 -230 -210 -122 -34 7 -56 -91 -127 -129 -131 -164 -198 -180 -162
7838 -162 -144 -126 -144 -161 -146 -131 -130 -130 -161 -192 -175 -159 -111 -63 -51 -40 -28 -16 -36 -56 -76 -97 -162 -228 -198 -168 -94 -20 -21 -21 -69 -118 -166 -214 -260 -306 -256
7827 -256 -206 -200 -194 -188 -181 -160 -139 -192 -245 -257 -269 -249 -229 -155 -80 -59 -38 -56 -75 -61 -47 19 86 96 107 73 -23 -120 -154 -79 -4 42 89 177 266 274 218
7815 218 126 34 12 -8 21 52 50 -57 -163 -206 -191 -177 -152 -64 -28 -57 -71 -84 -70 -56 -53 -51 -16 18 18 18 18 18 43 67 87 108 84 -3 -91 -115 -156
7804a56m1J6J6L2L1%jN4N2K2K2p8p8L8L9J6J6N1j1o1o1l4l3k5k5k9L4K8K8m2m2m7m8J0J0J1
7793b86P4P4J0K5K4j5j5ko5l3L0K2K3onJ9J9J9J9k8k7M3M3O5Kl6l6K0K1J9K1PQQQJ0RJ0Rl5
7780G2l6l5l5M0M1M0M1L8L7l7l7l9m0l9l9j3j3M1L9k4k3k4k4KKn2n1k9l0O6O6LLMLJKL3L4
7768a2J5J5J6J5l2l1l3l2j0j1j0j1L4L3KKMMNMNOk7k7LLL4L5K2K3K3K3k7k8k7k6j3j3M0M0
7756C6R1R2k6j31j28o5RP3P1l2l8K6j8j7j3j3m0l9L5L6PQq8q8onooM5M5M5M4k7k6K6K6N6N5
7744A4n9o1J5J4l9l8K8K9K9K8l3l3J4J3P3l3m7m8N7N8N6N7k5k5k5k4n2n1M0M0K3l9j8Q8K0
7733D6q5n6QRRJ3J3k2k1L1L2P8P8MNj4j4j3j4j3j2m4m4j6j5r1r0J0RO3O3K3K3P5P6M7M7k7
7721A71k8q2q1q9J7M2M3M8M9l8l7l6l7J09J10poj3j2j3j2l4l3l3l3j1j1m3m3klP2P2JJl1l1
$$ plain form
7804 -156 -197 -181 -165 -133 -102 -102 -103 -49 3 25 47 -31 -109 -71 -32 -16 0 51 40 -21 -82 -116 -149 -174 -199 -228 -194 -166 -138 -180 -222 -269 -317 -307 -297 -286
7793 -286 -212 -138 -128 -103 -79 -94 -109 -111 -176 -209 -179 -157 -134 -140 -145 -126 -107 -88 -69 -97 -124 -81 -38 27 29 -7 -43 -23 -2 17 38 45 53 61 69 79 88 98 107 72
7780 72 36 1 -34 6 47 87 128 166 203 166 129 90 50 11 -28 -41 -54 -13 26 2 -21 -45 -69 -67 -65 -117 -168 -197 -227 -161 -95 -92 -89 -85 -82 -81 -79 -46 -12
7768 -12 3 18 34 49 17 -14 -47 -79 -89 -100 -110 -121 -87 -54 -52 -50 -46 -42 -37 -33 -28 -22 -49 -76 -73 -70 -36 -1 21 44 67 90 63 35 8 -18 -31 -44 -4 36
7756 36 127 219 193 62 -66 -131 -122 -49 22 -10 -48 -22 -40 -57 -70 -83 -123 -162 -127 -91 -84 -76 -164 -252 -258 -263 -269 -275 -230 -185 -140 -96 -123 -149 -123 -97 -41 14
7744 14 -45 -106 -91 -77 -116 -154 -126 -97 -68 -40 -73 -106 -92 -79 -6 -39 -86 -134 -77 -19 37 94 69 44 19 -5 -57 -108 -68 -28 -5 -44 -62 26 46
7733 46 -39 -95 -87 -78 -69 -56 -43 -65 -86 -55 -23 55 133 137 142 128 114 101 87 74 62 18 -26 -42 -57 -148 -238 -228 -219 -156 -93 -70 -47 28 104 151 198 171
7721 171 143 61 -20 -109 -92 -50 -7 41 90 52 15 -21 -58 51 161 154 148 135 123 110 98 64 31 -2 -35 -46 -57 -100 -143 -145 -148 -76 -4 -3 -2 -33 -64
7710f4qppqK1K0K1K0NNo9p0jkkjJ1J2M3M4MMp0p0N0M9J8J8o8o7j4j5N5N5J00J01M2o5r9j00
7697a09MLLMN1N0m4m4L2L3L2L2q2q4N5N4kkj3N0k7j34r8QP3P3P9P9ooooN5N5N5N5l7l7o8o8
7685F2o8o8OON3N2q5q5o6o7J2J3K2Q7J10Mpqj4j5k6k6K7K6L6L4o0o0j9k0N5N5N6N8MMqpq0
7673gq2k8k9k8k8QRRRlkK9K9l0l0M4M3K0J9K0J9rrq3q3K9L0k4k4J9J8k8k9M2J47J19N6K5l8
7661A49o0n9PPQPl3l2J9K0KJn0n1m9m8K5K6J9J8j3j3J8J7j4j5J7J7j5j5m1m1L4L3k6k7k7k7
7649b12j8j8J4J3P0P1L8L9j1j0ook9L3J10Nn2n0J6J5M0M1rql1L3O4m2r0J7O0lJ1J1POj9k0
7637H0j9k0k2k1RJ0m1m2j0j0m4m3N2N2RJ0m4m4K4K4N7N5j2j0j1j2K3K4qqm5m5j4j3N2N3K0
7626A6K1J9K0l4l4L6L5j8j8n6n7mmqqrqj6j6j6j6K8K8Q0Q0L1L0k3k2%Jn3n1o2o1o2o1M9M9
$$ plain form
7710 -64 -72 -79 -86 -94 -73 -53 -32 -12 -7 -2 -71 -141 -142 -144 -146 -147 -136 -124 -81 -37 -33 -29 -99 -169 -119 -70 -52 -34 -102 -169 -183 -198 -143 -88 12 113 155 90 -9 -109
7697 -109 -105 -102 -99 -95 -44 6 -38 -82 -50 -17 15 47 -35 -119 -64 -10 -12 -14 -27 23 -4 -138 -236 -228 -155 -82 -3 76 70 64 58 52 107 162 217 272 235 198 130 62
7685 62 -6 -74 -68 -62 -9 43 -42 -127 -193 -260 -248 -235 -213 -126 -16 -12 -19 -27 -41 -56 -82 -108 -81 -55 -19 15 -45 -105 -124 -144 -89 -34 22 80 84 88 80 73 -7
7673 -7 -89 -117 -146 -174 -202 -194 -185 -176 -167 -170 -172 -143 -114 -144 -174 -130 -87 -67 -48 -28 -9 -18 -27 -110 -193 -164 -134 -158 -182 -163 -145 -173 -202 -160 -13 106 162 187 149
7661 149 89 30 37 44 52 59 26 -6 13 33 35 36 -14 -65 -114 -162 -137 -111 -92 -74 -87 -100 -82 -65 -79 -94 -77 -60 -75 -90 -131 -172 -138 -105 -131 -158 -185 -212
7649 -212 -230 -248 -234 -221 -151 -80 -42 -3 -14 -24 -30 -36 -65 -32 78 83 31 -19 -3 12 52 93 84 76 45 78 142 100 10 27 87 84 95 106 113 119 100 80
7637 80 61 41 19 -2 7 17 -24 -66 -76 -86 -130 -173 -121 -69 -60 -50 -94 -138 -114 -90 -33 22 10 0 -11 -23 0 24 16 8 -37 -82 -96 -109 -57 -4 16
7626 16 37 56 76 42 8 44 79 61 43 -13 -70 -74 -78 -86 -94 -103 -111 -127 -143 -159 -175 -147 -119 -39 41 72 102 79 57 57 58 5 -46 -108 -169 -231 -292 -243 -194
7614a94N0M9J5J6J5J6%%n3n3j2j3j2j3jkP2P3OOOOn8n7k6k6K3K3K3K2RRO2O1M0M0L0p7r4l2
7601e1k1k1K5K5ppk6k6OPL9L9j4j4l4l4o6o6o1o1N5N6L9L8L9L8J2J2J2J2RRM0M1K6K6k7k7
7589D2m2m3j2j1l3l2M1M2l7l6l6l6P3P2K0J9k0k0k0k1LKL5L4r6r6k2k2P6P5JKM9M9J6J7N6
7578H9N6LLl9l9J0J0J5n0m9J4j7j7m5m5j3j2m8J6M3M4k7k7k0k0k0k0J1J2k4L9R2R1M3o2r1
7567i4k7l7l8j4j4O0O0O2O1R8L4n9n9l2P5N8ol8l8j2j3j3j3o4o5L1L0QQk4k4J0RJ0J0%%L1
7555b9L1K6K5n1j14q0j6M0M0p6p5M2M1L8L7L7L7qqK4K4J2J1J2J2opopn6n8L1l3J8J9k4q8m2
7543b27m3P0P1L8L7j5j5m0m0l9m0L8L8l7l6N6N6l9m0l1l2K2K2N8N8ONM8M7nnN4N6K4K4j0j0
7532A24j0j0L4L3k0j9K1K0n3n3q9r0l6l7N8N8K5K6K4K4N7N6J6J5n9n9n5n3kkL2L0k0k2J8J8
$$ plain form
7614 -194 -144 -95 -80 -64 -49 -33 -33 -33 -86 -139 -151 -164 -176 -189 -190 -192 -120 -47 -41 -35 -29 -23 -81 -138 -164 -190 -167 -144 -121 -99 -90 -81 -19 42 82 122 152 75 -19 -51
7601 -51 -72 -93 -68 -43 -50 -57 -83 -109 -103 -96 -57 -18 -32 -46 -80 -114 -180 -246 -307 -368 -313 -257 -218 -180 -141 -103 -91 -79 -67 -55 -46 -37 3 44 70 96 69 42
7589 42 0 -43 -55 -66 -99 -131 -90 -48 -85 -121 -157 -193 -120 -48 -28 -9 -29 -49 -69 -90 -87 -85 -50 -16 -112 -208 -230 -252 -176 -101 -100 -98 -49 0 16 33 89
7578 89 145 148 151 112 73 83 93 108 58 9 23 6 -11 -56 -101 -114 -126 -174 -158 -115 -71 -98 -125 -145 -165 -185 -205 -194 -182 -206 -167 -75 16 59 -3 -94
7567 -94 -121 -158 -196 -210 -224 -164 -104 -42 19 117 151 92 33 1 76 134 128 90 52 40 27 14 1 -63 -128 -97 -67 -59 -51 -75 -99 -89 -80 -70 -60 -60 -60 -29
7555 -29 2 28 53 2 -112 -192 -208 -168 -128 -204 -279 -237 -196 -158 -121 -84 -47 -55 -63 -39 -15 -3 8 20 32 26 19 13 6 -50 -108 -77 -110 -92 -73 -97 -185 -227
7543 -227 -270 -200 -129 -91 -54 -69 -84 -124 -164 -203 -243 -205 -167 -204 -240 -184 -128 -167 -207 -238 -270 -248 -226 -168 -110 -104 -99 -51 -4 -9 -14 40 96 120 144 134 124
7532 124 114 104 138 171 151 132 153 173 120 67 -22 -112 -148 -185 -127 -69 -44 -18 6 30 87 143 159 174 115 56 1 -52 -54 -56 -24 6 -14 -36 -18 0
7521@j4j4l0l0JJKKKKM2M1J0n3n4N1K8l6k9L4L0l3p0p0O4O4nonoJ6J6J6J6j1j2j1j1M4M4q
7508A8qJ8J8n5n6J%JJK0K0K0J9J2J2J2J1K1K1l2l2K5K4pqm7m6j6j5J6J6O8O9k2k2k1k2M1M2
7496A17p6p4o7o7K9K9LLn1n0N3N2N3N1L9L9l5l5m8m8K6K6J7J5J7J7O4O4l1l2n5n4k3k3JJK
7484e1JP0P1m6m5p8p8L9L8l2l3%jJ3J3J2J3K9L0K9K8m1m3m2m2J8J9J9J8J3J3k0j9L3L3L2L3
7473D6j4j4j5j3k8k8k7k8K2K3K2K3J7J6J7J6m3m5N1M9M9M9M8M9k1k1p4p4n0m9LLLLKLK7K7
7461B4n2j17j5j4J3J3mmm0K4N9N9j2j1O4O4L2L3qpo0o0M3M3m8m7q6k1N9O0N9O0j5j4n4n3r0
7450a23k6K4K5j2N3N7oj9j9l8l8L6L6kkn5n6K5K4n0n0M7M7P9P7P5P5J4m8q8q6l8l8p5p5K7
7438b23R1K7K8MMj4M9M8j4l5l4l9l8j7j8%O4P3P2K4K4j1j0j1j0r3r3j3N1M1M1Pn8o2o3K5K5
$$ plain form
7521 0 -14 -28 -58 -88 -87 -86 -84 -82 -80 -78 -36 5 15 -38 -92 -41 -13 -49 -78 -44 -14 -47 -117 -187 -123 -59 -64 -70 -75 -81 -65 -49 -33 -17 -28 -40 -51 -62 -18 26 18
7508 18 10 28 46 -9 -65 -64 -64 -63 -62 -42 -22 -2 17 29 41 53 64 85 106 74 42 67 91 84 76 29 -17 -33 -48 -32 -16 52 121 99 77 56 34 75 117
7496 117 41 -33 -100 -167 -138 -109 -106 -103 -154 -204 -151 -99 -46 5 44 83 48 13 -35 -83 -57 -31 -14 1 18 35 99 163 132 100 45 -9 -32 -55 -54 -53 -51
7484 -51 -50 20 91 45 0 -78 -156 -117 -79 -111 -144 -144 -145 -132 -119 -107 -94 -65 -35 -6 22 -19 -62 -104 -146 -128 -109 -90 -72 -59 -46 -66 -85 -52 -19 13 46
7473 46 32 18 3 -10 -38 -66 -93 -121 -99 -76 -54 -31 -14 2 19 35 -8 -53 -2 47 96 145 193 242 221 200 126 52 2 -47 -44 -41 -38 -35 -33 -30 -3 24
7461 24 -28 -145 -160 -174 -161 -148 -152 -156 -196 -172 -113 -54 -66 -77 -13 51 83 116 108 101 41 -19 24 67 19 -28 -114 -135 -76 -16 43 103 88 74 20 -33 -123
7450 -123 -149 -125 -100 -112 -59 -2 -8 -27 -46 -84 -122 -86 -50 -52 -54 -109 -165 -140 -116 -166 -216 -169 -122 -43 34 109 184 198 150 62 -24 -62 -100 -175 -250 -223
7438 -223 -132 -105 -77 -73 -69 -83 -34 14 0 -35 -69 -108 -146 -163 -181 -181 -117 -44 28 52 76 65 55 44 34 -59 -152 -165 -114 -73 -32 -25 -83 -145 -208 -183 -158
7427a58L4k9k6k6L8L7L7L8mmRP2N7plO1k7k6p5p6LMk9k9l0l1%JO3O3j2j2k2k2k2k2k2k2k2
7415b41k2O1O0PPk6k5k6k6j1j2M2M2Q0Q0j6j5l8l8N8N8kkkkK6K8K7K7o0n9k8k9MMn0m9K7K8
7403a13K7K8L0K9L0L0k0k0k0k0jjkjk3k2N1N1K5K5k8k8j9j9p2p3J0J0J1J0k7k7k7k7J06J06
7392a1L2L2j05j06J1J1KLLLJ4J4o1o0J7J8M9M9NOL7L7jjn4n5j7j8j8j8m2m3L2L2Q3Q3l2r6
7380a65j09K0O0O1N9N9N8N9l6l7l6l6n5n4K0K0J8J7J8J8m7m7m7m7OPL9L9O9O9J00J01n8n7
7369H6n8n7%%%%J1J1RJ1K9K8lll2l2l1l2M2M1l2l2j9j9N6N4JJJJk9k8k9k9J4J4J4J4k0j9L3
7356c3L3l0l1l1l1O2O1O2O1j8j9j8j9o2o4l1l2M4M3M4M2k3k2k2k3k2k1J0J0K1K1n4n4l2l3
7346b11J06J05K9K9o6o7j4j5o8o8n3n2K1K2N0N1N0N0K4K4N5N6n9o0k9k8RRM1M1M2M4M3M4o1
$$ plain form
7427 -158 -124 -153 -179 -205 -167 -130 -93 -55 -59 -63 -54 18 75 68 65 126 99 73 -2 -78 -75 -71 -100 -129 -159 -190 -190 -189 -126 -63 -75 -87 -109 -131 -153 -175 -197 -219 -241
7415 -241 -263 -202 -142 -135 -128 -154 -179 -205 -231 -242 -254 -212 -170 -90 -10 -26 -41 -79 -117 -59 -1 -3 -5 -7 -9 17 45 72 99 39 -20 -48 -77 -73 -69 -119 -168 -141 -113
7403 -113 -86 -58 -28 1 31 61 41 21 1 -19 -20 -21 -23 -24 -47 -69 -18 33 58 83 55 27 8 -11 -83 -156 -146 -136 -125 -115 -142 -169 -196 -223 -117 -11
7392 -11 21 53 -52 -158 -147 -136 -134 -131 -128 -125 -111 -97 -158 -218 -201 -183 -134 -85 -80 -74 -37 0 -1 -2 -56 -111 -128 -146 -164 -182 -224 -267 -235 -203 -120 -37 -69 -165
7380 -165 -274 -254 -194 -133 -74 -15 43 102 66 29 -7 -43 -98 -152 -132 -112 -94 -77 -59 -41 -88 -135 -182 -229 -223 -216 -177 -138 -69 0 100 201 143 86
7369 86 28 -29 -29 -29 -29 -29 -18 -7 2 13 42 70 67 64 32 0 -31 -63 -21 20 -12 -44 -63 -82 -26 28 29 30 31 32 3 -25 -54 -83 -69 -55 -41 -27 -47 -66 -33
7356 -33 0 -30 -61 -92 -123 -61 0 62 123 105 86 68 49 -13 -77 -108 -140 -96 -53 -9 33 10 -12 -34 -57 -79 -100 -90 -80 -59 -38 -92 -146 -178 -211
7346 -211 -105 0 29 58 -8 -75 -89 -104 -172 -240 -293 -345 -324 -302 -252 -201 -151 -101 -77 -53 2 58 -1 -61 -90 -118 -109 -100 -59 -18 24 68 111 155 94
7335I4o0n9o1M0M0L9M0mmn7n6NNo9p0l5l6J8J8O5O6O5O5l3l1l3l2poppj1j2K0K1l1l1JJJ9
7322a30J9r7r7MNJ17J18J9m5m2O6M9j5m6m7k5k5M9M9N7N5M2o4o3o3p1p0llK8K9j0j1K2K2o1
7311b38o0o0o0J5J5J10J10J9J8J9J9J9J9l4l4m7m7m7m7n7n8O0O0J02J02R8R7N0j4p3p3l3l3
7301h3M1M2M7M8J2J3lo6j14n1J0P4K5l9m1m2N1N0m2m2J1J1J0J0j9j8k7L6P0O9K1m4q1q2M2
7290a01M2j0p5n3N2K0K1j7j6j7j6j7j7R5R6O9Pj0j1MMMMj2j2j2j2JJKJj8j9n5RK0K0K4K3K9
7278D8K9J2n3%%k2q4p6p6p6p7K6Q9J03J02Q7K4qN5qqmmJ2J1M7j6l9l8m3m1L3L5M2k1j07m4
7266i0J2J2k3k3j9j9o6jP2Rk7k7l1l1J9J9l1l0n6PQ9Q8NMMMl5l5L9L9L3L4KKN1N2M8M8j3p6
7254E9p9j6j5p9p4j1O0N9M6j7o1o0J2P6N8pL4L3onomM5M6N0j3k1k1j5M9K7p9m8m7l6l7nml9
$$ plain form
7335 94 34 -25 -86 -46 -6 33 73 69 65 8 -48 -43 -38 -107 -177 -212 -248 -230 -212 -147 -81 -16 49 16 -15 -48 -80 -87 -93 -100 -107 -118 -130 -110 -89 -120 -151 -150 -149 -130
7322 -130 -111 -208 -305 -301 -296 -179 -61 -42 -87 -129 -63 -14 -29 -75 -122 -147 -172 -123 -74 -17 38 80 16 -47 -110 -181 -251 -254 -257 -229 -200 -210 -221 -199 -177 -238
7311 -238 -298 -358 -418 -403 -388 -278 -168 -149 -131 -112 -93 -74 -55 -89 -123 -170 -217 -264 -311 -368 -426 -366 -306 -204 -102 -4 93 143 129 56 -17 -50 -83
7301 -83 -42 0 47 95 107 120 117 51 -63 -114 -104 -30 -5 -44 -85 -127 -76 -26 -68 -110 -99 -88 -78 -68 -87 -105 -132 -96 -26 43 64 20 -61 -143 -101
7290 -101 -59 -69 -144 -197 -145 -125 -104 -121 -137 -154 -170 -187 -204 -109 -13 56 63 53 42 46 50 54 58 46 34 22 10 11 12 14 15 -3 -22 -77 -68 -48 -28 -4 19 48
7278 48 77 89 36 36 36 14 -70 -146 -222 -298 -375 -349 -260 -157 -55 32 56 48 103 95 87 83 79 91 102 149 133 94 56 13 -28 5 40 82 61 -46 -90
7266 -90 -78 -66 -89 -112 -131 -150 -216 -217 -145 -136 -163 -190 -221 -252 -233 -214 -245 -275 -331 -324 -235 -147 -142 -138 -134 -130 -165 -200 -161 -122 -89 -55 -53 -51 0 52 100 148 135 59
7254 59 -20 -36 -51 -130 -204 -215 -155 -96 -50 -67 -128 -188 -176 -100 -42 -49 -15 18 12 7 1 -3 42 88 138 125 104 83 68 117 144 65 17 -30 -66 -103 -108 -112 -151
7242a51l9N7N7L6L5L5L5rrrrm5m5m6m5NNNNK9K9K5K5K4m0j09m7J5P9Q2J9j3j2j7j6J2J3J3
7230b1J2K0K1J7J6J2n1n1J2jkKKl7l6m1K2P5P4J8m5K6K6K2K2l7l7mnj%jjK3K2rj0rj0q2q4
7217a31m7m6K7K8m4m3L0L1L7L6O9O7ppqpm9m9m9m9rj0K3K2m5m5K9K9jj%jM5M6M6M6RJ0M1M2
7205F5n9n7n9n8qpqpj7j8J5J4l4l4l4l5llllL7L7L7L7J0RJ0J0N2N3jjJ1J1J1J0j0rj0j0JJ
7192e7n2n3j9k0J1P4Q7m0p5j1k0k1j6j6K4K4K5K4lkklj6j6j6j7O0O0jo4J3J2NML7k7k7L6K3
7180g5K3K6K6k1k2J4J4m5J8L5L4j6j6j7j7J7J7O9P1L1L1o4o4k0k1o8p0k4L9P2Pnnm9J5J02
7169D2M0j6j6j9j9J4J3J0J0OOM6j9r8r9o6o6l0l0k1M3O0O0o9o9J2P5O1O1J00L7L1L1K7K7Q
7157A83Rk0j9m6J8L5L6j1j0K5l8r1q9n6QJ1J2k0M4N8O0j5j5R2K9p0p0l4L0K6K6K9K8O1O0M4
$$ plain form
7242 -151 -190 -133 -76 -40 -5 30 65 56 47 38 29 -16 -61 -107 -152 -147 -142 -137 -132 -103 -74 -49 -24 0 -40 -149 -196 -181 -102 -20 -1 -14 -26 -43 -59 -47 -34 -21
7230 -21 -9 11 32 49 65 77 26 -25 -13 -14 -16 -14 -12 -49 -85 -126 -104 -29 45 63 18 44 70 92 114 77 40 36 31 30 30 29 28 51 73 64 54 45 35 -47 -131
7217 -131 -178 -224 -197 -169 -213 -256 -226 -195 -158 -122 -53 14 7 0 -8 -15 -64 -113 -162 -211 -220 -230 -207 -185 -230 -275 -246 -217 -218 -219 -219 -220 -175 -129 -83 -37 -28 -18 23 65
7205 65 6 -51 -110 -168 -176 -183 -191 -198 -215 -233 -218 -204 -238 -272 -306 -341 -344 -347 -350 -353 -316 -279 -242 -205 -195 -186 -176 -166 -114 -61 -62 -63 -52 -41 -30 -20 -30 -39 -49 -59 -58 -57
7192 -57 -109 -162 -181 -201 -190 -116 -29 -69 -144 -155 -175 -196 -212 -228 -204 -180 -155 -131 -134 -136 -138 -141 -157 -173 -189 -206 -146 -86 -87 -151 -138 -126 -121 -117 -80 -107 -134 -98 -75
7180 -75 -52 -26 0 -21 -43 -29 -15 -60 -42 -7 27 11 -5 -22 -39 -22 -5 64 135 166 197 133 69 49 28 -40 -110 -134 -95 -23 -16 -21 -26 -75 -60 42
7169 42 82 66 50 31 12 26 39 49 59 65 71 117 98 0 -99 -165 -231 -261 -291 -312 -269 -209 -149 -218 -287 -275 -200 -139 -78 22 59 90 121 148 175 183
7157 183 192 172 153 107 125 160 196 185 175 200 162 71 -18 -74 -66 -55 -43 -63 -19 39 99 84 69 161 190 120 50 16 46 72 98 127 155 216 276 320
7146C20M4l2r7K2Q5J33J33K31M42N83P96J208K015L009K455p66l018k694j632r80o83m04j92
7139I78j70j70j25j24r7r7m4m4p6p4kjN1N1K0K0j1j2o4o3J7J8j4j4l1l1%JM4M3M3M4n0m9j8
7128e1j7%%N3N2n2n2K2K2OOk6k6o5o5RRn3n3k1k1O6O5O6O5l1l0K2K2J8J7j4j4J5J5l9l8K4
7116i4K4N6N4M8M8k7k6j8j7P8P9M1M2j1j2l3l3l3l4l3l4kkJ4J4l8l9m4m5j4j3kkN2N1j3j2
7105c0M0M0l7l6nnrj0m2m1OOOOj4j4j5j4O0O0O0O0jjJ2r2q7J9J25O3k0k0k4k4L1L1m4m3M6
7093D3M8k8k7k5k5K7K7jjn3n4j3j3j3j3PQL9L9J6J5l6l7n6n6M0M0j1j1M2M2j2j1j1j1RJ0J0
7081e6RK1K1K0K1rql9m1o3o4P5P4K6K4k6k8j3j3j3j3JJJ%J%%%O9O8onl6l6J6J7k8k7NMj2j2
7068g4j2j2qqm0m0O8O8ooJ5J5j7j7l0l0K3K3N5N3J6m6l9l8p0p1oN7P5P5jjPn7k0M3P2P4j6
$$ plain form
7146 320 364 332 235 257 342 475 608 839 1281 1864 2660 3868 5883 8892 11347 10581 7563 4869 3237 2257 1574 1170 978
7139 978 808 638 513 389 292 195 151 107 31 -43 -45 -46 5 56 76 96 85 73 9 -54 -37 -19 -33 -47 -78 -109 -109 -108 -64 -21 22 66 16 -33 -51
7128 -51 -68 -68 -68 -15 37 -15 -67 -45 -23 -17 -11 -37 -63 -128 -193 -184 -175 -228 -281 -302 -323 -257 -192 -126 -61 -92 -122 -100 -78 -60 -43 -57 -71 -56 -41 -80 -118 -94
7116 -94 -70 -14 40 88 136 109 83 65 48 126 205 246 288 277 265 232 199 166 132 99 65 63 61 75 89 51 12 -32 -77 -91 -104 -106 -108 -56 -5 -18 -30
7105 -30 10 50 13 -23 -28 -33 -42 -52 -94 -135 -129 -123 -117 -111 -125 -139 -154 -168 -108 -48 12 72 71 70 82 -10 -97 -78 47 110 90 70 46 22 53 84 40 -3 43
7093 43 91 63 36 11 -14 13 40 39 38 -15 -69 -82 -95 -108 -121 -114 -106 -67 -28 -12 3 -33 -70 -126 -182 -142 -102 -113 -124 -82 -40 -52 -63 -74 -85 -76 -66 -56
7081 -56 -47 -26 -5 15 36 27 19 -20 -61 -124 -188 -113 -39 -13 11 -15 -43 -56 -69 -82 -95 -94 -93 -92 -92 -91 -91 -91 -91 -22 46 40 35 -1 -37 -21 -4 -32 -59 -54 -50 -62 -74
7068 -74 -86 -98 -106 -114 -154 -194 -126 -58 -64 -70 -55 -40 -57 -74 -104 -134 -111 -88 -33 20 36 -10 -49 -87 -157 -228 -234 -177 -102 -27 -28 -29 -22 -79 -99 -56 16 90 74
7056G4q0r3r4nN8rrj4j3K3K2j1N2O9O8k1k0k1k0l2l2k8k8LO6L1L1J2J2J2J2l6l7mnP6P7%o3
7044B3q5k3L0K9k1q4j17n2P6P6M5M4K6l7n4n5l5l6K4Q7P7P6K6l9l2L0P9J6q9q8p6j2N9N9K5
7033b8l8l2l3o4o4L1R5N9N9k8k8j4M9N7oLKj7j5p0p0K4K5K4K5k9k8k5k5L8J01O5O6k8k8k4
7022B9k4l8K4j1j2j3j4J9J8l9l9L5L5M6M7J5r0r2k7RQn6RM6M7L4L4l5l5n1J3L0L1J2J3M7j6
7010Ip3p4o1KO7O7L6L4L4k8k4k5M6M8k7k7j9k0k4k4j3p7j08j08m0O7Q2Q1O4O4M6j7p8p8j18
6999c16n4O4O4K9R2O0lj6j6NNL7L7jjjjj9j9Q7Q8rj56j34k7kjNNK2K2K3K2RJ0P3l3o6lj7j8
6986a54J1n3p1p0N9N9N5N6P3Rqqn1n1M5M4N3N2L6k7NOKJo2o2o3o2JKNNK3Q6N4qn3n3J7J8j0
6974h9rKO5L4p1l9m0j3j3m1m1L0R3Q6k1l1l2ooMLP8P6k7k8K4K4j6j7m9m8LMk8k8M3M4M4M3
$$ plain form
7056 74 -6 -99 -193 -198 -140 -149 -158 -172 -185 -162 -140 -151 -99 -30 38 17 -3 -24 -44 -76 -108 -136 -164 -161 -95 -64 -33 -21 -9 3 15 -21 -58 -62 -67 9 86 86 23
7044 23 -62 -85 -55 -26 -47 -131 -248 -300 -224 -148 -103 -59 -33 -70 -124 -179 -214 -250 -226 -139 -62 14 40 1 -31 -1 78 94 5 -83 -159 -171 -112 -53 -28
7033 -28 -66 -98 -131 -195 -259 -228 -133 -74 -15 -43 -71 -85 -36 21 15 18 20 3 -12 -82 -152 -128 -103 -79 -54 -83 -111 -136 -161 -123 -22 43 109 81 53 29
7022 29 5 -33 -9 -20 -32 -45 -59 -40 -22 -61 -100 -65 -30 16 63 78 -12 -104 -131 -122 -114 -170 -161 -115 -68 -34 0 -35 -70 -121 -108 -78 -47 -35 -22 25 9
7010 9 -64 -138 -199 -197 -130 -63 -27 7 41 13 -11 -36 10 58 31 4 -15 -35 -59 -83 -96 -173 -281 -389 -429 -362 -280 -199 -135 -71 -25 -42 -120 -198 -316
6999 -316 -370 -306 -242 -213 -121 -61 -64 -80 -96 -91 -86 -49 -12 -13 -14 -15 -16 -35 -54 33 121 112 -44 -178 -205 -207 -208 -203 -198 -176 -154 -131 -109 -100 -90 -17 -50 -116 -119 -136 -154
6986 -154 -143 -196 -267 -337 -278 -219 -164 -108 -35 -26 -34 -42 -93 -144 -99 -55 -2 50 86 59 64 70 72 73 11 -51 -114 -176 -175 -173 -168 -163 -140 -54 0 -8 -61 -114 -97 -79 -89
6974 -89 -98 -96 -31 3 -68 -107 -147 -160 -173 -214 -255 -225 -132 -46 -67 -98 -130 -136 -142 -138 -135 -57 19 -8 -36 -12 12 -4 -21 -70 -118 -115 -111 -139 -167 -124 -80 -36 7
6962GJ1J0PPO1lKKJ1J2m2m2J4J4k5q7j0rm5m5J3J3J3J3L3L3j6j7J3P4P6J2ML%jk9k9k9k9q9
6949h9r0l7l7Q5Q4J30J31J9q6q0q0LLl0k9j6j6J6J6J5J5j7j7l9l9ppmmmmo1o1qqL3L2L3L2
6937b23R1R1J7J6J3J4J4J3mmmmk4k3k3k4j6j5J6J6N9N9OPm3m2L1L1j1j2q4q6l7l7J02J01R
6925a0Qk3k3P5P5j9k0OOOOq4q2rj0K5K4ppj2j1o4o5L4L3o2o2l5l6L9L9LMP7P8J%N4N3j9k0
6913c4L3L2m5m5QPM1L9j2j3K7K8nnJ7J6l6l7l0l0JJj9j9k0j9L3L4O4O6nonnJ8J8n6n6o0o0
6900a39L5L5N1M9o5o7l6l7l7l7nnonJ4J3M5M5O9O9on%j%jPPq9q8n0n0M5M5M2M1l2l3K6K6o
6888a36ol0k9M4M5Q1Q0K9K8l3l2l2l2l2l2O3O2N6N5KKk9l0l0l0NOo9o9j3j4J8Q2Q3k2q8k6
6876g3O7O6k4k5m4m6PPJ2J2k0k0mmM9M8J2J3k0j8k7k6OOkkl4l4kjkjN3N3j%l6l7mmJJPQrR6
$$ plain form
6962 7 18 28 35 42 103 100 102 104 115 127 85 43 57 71 46 -41 -51 -60 -105 -150 -137 -124 -111 -98 -65 -32 -48 -65 -52 22 98 110 114 117 117 116 87 58 29 0 -89
6949 -89 -179 -216 -253 -168 -84 46 177 196 110 30 -50 -47 -44 -74 -103 -119 -135 -119 -103 -88 -73 -90 -107 -146 -185 -192 -199 -203 -207 -211 -215 -276 -337 -345 -353 -320 -288 -255 -223
6937 -223 -132 -41 -24 -8 5 19 33 46 42 38 34 30 6 -17 -40 -64 -80 -95 -79 -63 -4 55 61 68 25 -17 14 45 34 22 -62 -148 -185 -222 -120 -19 -10
6925 -10 -2 -25 -48 27 102 83 63 69 75 81 87 3 -79 -88 -98 -73 -49 -56 -63 -75 -86 -150 -215 -181 -148 -210 -272 -307 -343 -304 -265 -262 -258 -181 -103 -102 -102 -48 5 -14 -34
6913 -34 -1 31 -14 -59 -51 -44 -3 36 24 11 38 66 61 56 73 89 53 16 -14 -44 -43 -42 -61 -80 -100 -119 -86 -52 12 78 73 67 62 57 75 93 37 -19 -79 -139
6900 -139 -104 -69 -18 31 -34 -101 -137 -174 -211 -248 -253 -258 -264 -269 -255 -242 -197 -152 -83 -14 -20 -25 -25 -26 -26 -27 -20 -13 -102 -190 -240 -290 -245 -200 -158 -117 -149 -182 -156 -130 -136
6888 -136 -142 -172 -201 -157 -112 -31 49 78 106 73 41 9 -23 -55 -87 -24 38 94 149 151 153 124 94 64 34 39 45 -24 -93 -106 -120 -102 -20 63 41 -47 -73
6876 -73 -6 60 36 11 -33 -79 -72 -65 -53 -41 -61 -81 -85 -89 -40 8 20 33 13 -5 -32 -58 -52 -46 -48 -50 -84 -118 -120 -121 -123 -124 -71 -18 -19 -19 -55 -92 -96 -100 -99 -98 -91 -83 -92 4
6862DJ01L8o0j23j8j8J8J8Pr8r5l1PP1Q8Q8N8O0k1k2k1k2q9r0ONk6k7K6K6J8J9N0N0K5K6k7
6850B1k6mml5l6mlmlk3k4RQPOPPJ2J3M4M4L5L5l9m0MMMMn3n3O4O2N8N7NMr9r9m6m6J6J6OO9
6836b0O9l7nnoqlmmO0Q4k3m5m5m1j05l0P6M8j6m8m9K2K2L0K9m5m5O9O8O8O8j5j6m8m7k5k5
6825d7K3K4P6J3lmj6j7j2j2l6K6Q0Q0N9m7j21j20m0K4JO4J8m5m1K2JKNNj1j0j1j1KKKKK2K2
6812b9l1l2J4J5J02J03O9l7p3p3l8l9l9l9M8M8j1p6n3n3M2M2l2L2P0P0n2n3K2K1j1j1K0K0
6802d4%%o7o8l7O9P9P9K3l9l7l6k6k6N3N2j6M7jo4k1M2R1K8j%K3K3j0p3o9o9r3r3j2N2R6R6
6790d9MMm1m1J2J2N8N7ONl3l4M0M0N6N6o1o0o0o1qqJ21J22K6K7p5p6m3m3kkkjq3q3L4L4N1
6778a01N0k3k4k6k6K8K7j1j0M2M3P1P3P3P2m4m4m5m4l4l4kkJ4J4l7l9N4N4KJo3o2j1j0L9L8
$$ plain form
6862 4 105 143 83 -40 -58 -76 -58 -40 -33 -131 -226 -257 -250 -179 -91 -3 55 115 94 72 51 29 -60 -150 -144 -139 -165 -192 -166 -140 -122 -103 -53 -3 22 48 21
6850 21 -5 -9 -13 -48 -84 -88 -91 -95 -98 -121 -145 -136 -128 -121 -115 -108 -101 -89 -76 -32 12 47 82 43 3 7 11 15 19 -34 -87 -23 39 97 154 159 163 64 -35 -81 -127 -111 -95 -89 -20
6836 -20 49 12 7 2 -4 -12 -15 -19 -23 37 121 98 53 8 -33 -138 -168 -92 -44 -60 -108 -157 -135 -113 -83 -54 -99 -144 -75 -7 61 129 114 98 50 3 -22 -47
6825 -47 -24 0 76 89 86 82 66 49 37 25 -11 15 95 175 234 187 66 -54 -94 -70 -69 -5 13 -32 -73 -51 -50 -48 -43 -38 -49 -59 -70 -81 -79 -77 -75 -73 -51 -29
6812 -29 -60 -92 -78 -63 39 142 211 174 101 28 -10 -49 -88 -127 -79 -31 -42 -118 -171 -224 -182 -140 -172 -140 -70 0 -52 -105 -83 -62 -73 -84 -64 -44
6802 -44 -44 -44 -111 -179 -216 -147 -68 11 34 -5 -42 -78 -104 -130 -77 -25 -41 6 5 -59 -80 -38 53 81 80 80 103 126 116 43 -26 -95 -188 -281 -293 -241 -145 -49
6790 -49 -45 -41 -82 -123 -111 -99 -41 16 22 27 -6 -40 0 40 96 152 91 31 -29 -90 -98 -106 15 137 163 190 115 39 -4 -47 -49 -51 -53 -54 -137 -220 -186 -152 -101
6778 -101 -51 -74 -98 -124 -150 -122 -95 -106 -116 -74 -31 40 113 186 258 214 170 125 81 47 13 11 9 23 37 0 -39 15 69 71 72 9 -53 -64 -74 -35 3
6766Cj3j4o3o3J2J1L7L8j6j6o9o9K6K7R3R3k3k3n3n2%%j0j1m2m2m1m1J2J2K8K8O0O0L7L7L8
6755iL6k6k5k6k7J8J8n7n6PPL9L9m1m1N5N5L8L8j4j5L0L1m4m3o0o0J5J4J%J%j1j1M2M2k7k8
6743i5k7k8K3K2K3K3j8j7j7j7L8L7L8L7k2k3k3k3L7L7L7L8j8j7j8j7o1o3L3L4K2K3l0l1m4
6732a07m4m4m5M6M5M5M6m0l9m0l9N5N5N6N4mlK7K8M1M0n5n5o4o5m2Q6NNj9j8l1l1K2K2K2K2
6720f3j0j0l2l2O3O4j8j7m9n0N2N1jkK2K3K1K2j2j3j1j3qrqrkkklO2O3l2l3k4k6n7n7j3j2
6708a87j3j3P4P3m3m3m6m7M9M9O1O0K7K9l7l8L7L5k1k1p5p4l9l9L5L6Q5Q6l1l1M3M2j0j0K
6697EKk9k9k3k3k3k3J6J6J7J6ooK6K5l8l9J4J5L8L8n7n8m7m8M8M8OOOOM4M4n1n2m2m1N4N4
6685i1NNL7L7M3M4J2J2M6M6p0p1n8n9k7k8pqqpK3K4K3K3j2j2j2j3JJJJkklkj0j1j0j0mmlm
$$ plain form
6766 3 -10 -24 -87 -150 -138 -127 -90 -52 -68 -84 -153 -222 -196 -169 -76 17 -6 -29 -82 -134 -134 -134 -144 -155 -197 -239 -280 -321 -309 -297 -269 -241 -181 -121 -84 -47 -9
6755 -9 27 1 -24 -50 -77 -59 -41 -98 -154 -147 -140 -101 -62 -103 -144 -89 -34 4 42 28 13 43 74 30 -13 -73 -133 -118 -104 -103 -103 -102 -102 -113 -124 -82 -40 -67 -95
6743 -95 -122 -150 -127 -105 -82 -59 -77 -94 -111 -128 -90 -53 -15 22 0 -23 -46 -69 -32 5 42 80 62 45 27 10 -51 -114 -81 -47 -25 -2 -32 -63 -107
6732 -107 -151 -195 -240 -194 -149 -104 -58 -98 -137 -177 -216 -161 -106 -50 4 0 -3 24 52 93 133 78 23 -41 -106 -148 -62 -57 -52 -71 -89 -120 -151 -129 -107 -85 -63
6720 -63 -73 -83 -115 -147 -84 -20 -38 -55 -104 -154 -102 -51 -52 -54 -32 -9 12 34 22 9 -2 -15 -23 -32 -40 -49 -51 -53 -55 -58 4 67 35 2 -22 -48 -105 -162 -175 -187
6708 -187 -200 -213 -139 -66 -109 -152 -198 -245 -196 -147 -86 -26 1 30 -7 -45 -8 27 6 -15 -90 -164 -203 -242 -207 -171 -86 0 -31 -62 -19 23 13 3 5
6697 5 7 -22 -51 -74 -97 -120 -143 -127 -111 -94 -78 -84 -90 -64 -39 -77 -116 -102 -87 -49 -11 -68 -126 -173 -221 -173 -125 -119 -113 -107 -101 -57 -13 -64 -116 -158 -199 -145 -91
6685 -91 -86 -81 -44 -7 36 80 92 104 150 196 126 55 -3 -62 -89 -117 -124 -132 -140 -147 -124 -100 -77 -54 -66 -78 -90 -103 -102 -101 -100 -99 -101 -103 -106 -108 -118 -129 -139 -149 -153 -157 -160 -164
6671a64J5J5J4J5KKKKkkkkl0k9L5L4K4K4K3K4N1N2r7r6j1j1N3N3j9j8M4M5L7L7p0o8n5n6Q
6659a21Qn5n6QQO1O1mlm6m5m6m6J00J00R8J00k3k3q6q7N1N0J9J9K8K8p8p7k1k1J1J0kkl3l4
6648a49J6J5M8M8ononj9j9q3q3kkL0L0J2J1M4M3N2N0n4n5l7l7K6K7J0J1n3n4K4K3Q8Q6OOP
6636D4Oj6j7M8M7k9k9LLJ0Rn4n3llllJ3J2J2J2MMRQj3N0J5J5m3m2m2m2KKKKm4m5K2Q6Q5K3
6622F7q4q6QQl1L2M7j7m0m1N2N2J3r4p2L4Qn6n2J2L5L6K0J9K0J9K4K3N9np0p1m8J7K7K7L1
6611g7L1NMl0L2KJn8n8J4J4j7j8l8l9p4j0Q4Q4K0K1M0k3n2n1l7l7l4l3M5J09M5j9pqN2N2P1
6599FP2Jo2M1M0l1l1oo8l4l4J6J5J6J5n6n7QPl6l7K4K3J8m5J4P7P9J5m7m7k4M0J02M0l6l5
6588a7L4L4j4j4m5m6J09J09r1r1n2n3M4M3%jl2l3k2k3L1L1k8k9k8k8q8q9l5P0J33O9kO1P0
$$ plain form
6671 -164 -149 -134 -120 -105 -103 -101 -99 -97 -99 -101 -103 -105 -135 -164 -129 -95 -71 -47 -24 0 51 103 6 -90 -101 -112 -59 -6 -25 -43 1 46 83 120 50 -18 -73 -129 -121
6659 -121 -113 -168 -224 -216 -208 -147 -86 -90 -93 -139 -184 -230 -276 -176 -76 22 122 99 76 -10 -97 -46 4 23 42 70 98 20 -57 -78 -99 -88 -78 -80 -82 -115 -149
6648 -149 -133 -118 -70 -22 -28 -33 -39 -44 -63 -82 -165 -248 -250 -252 -222 -192 -180 -169 -125 -82 -30 20 -34 -89 -126 -163 -137 -110 -100 -89 -142 -196 -172 -149 -61 25 31 37 44
6636 44 50 34 17 65 112 83 54 57 60 70 79 25 -28 -31 -34 -37 -40 -27 -15 -3 9 13 17 26 34 21 71 86 101 58 16 -26 -68 -66 -64 -62 -60 -104 -149 -127 -41 44 67
6622 67 -17 -103 -95 -87 -118 -86 -39 -56 -96 -137 -85 -33 -20 -114 -186 -152 -144 -200 -252 -240 -205 -169 -149 -130 -110 -91 -67 -44 15 10 -60 -131 -179 -162 -135 -108 -77
6611 -77 -46 -41 -37 -67 -35 -33 -32 -90 -148 -134 -120 -137 -155 -193 -232 -306 -316 -232 -148 -128 -107 -67 -90 -142 -193 -230 -267 -301 -334 -289 -180 -135 -154 -161 -169 -117 -65 6
6599 6 78 79 17 58 98 67 36 30 -38 -72 -106 -90 -75 -59 -44 -100 -157 -149 -142 -178 -215 -191 -168 -150 -195 -181 -104 -25 -10 -57 -104 -128 -88 14 54 18 -17
6588 -17 17 51 37 23 -22 -68 41 150 59 -32 -84 -137 -93 -50 -50 -51 -83 -116 -138 -161 -130 -99 -127 -156 -184 -212 -300 -389 -424 -354 -221 -152 -154 -93 -23
6577b3Pk8k7%JL3L2qqK3K4j0j0rj0m8m8j7j6O2O1l4l4nnnn%jj%jjj%L6L7L7L6m0m1J2J3KK
6563a8KKj1j0j1j1j8j9j8j9J9J9J8J9NMNNk2k1k2k2M4M3M2M4o7o8l7l6O1O1RQlkK8L0p7p9
6550a23m6m6L5L4j4j4qN6j2j2M1M2M9j5m7J7N1N1m9n0j1N3P9Q1Mo0n6n4ppLKm6m7n2J2N0N0
6539f6J%K8K8l1r4nnN6N6KLn1n1n1n1lkN0N0L7L6L6L6J7J7J7J7k3k3k4k2j0rn9n8o2JN8N7
6526i7M5j9j1j0p2rN2N2O4O3j7p9q1q0qN7J10M6j4p9j9j9L0L1L0L0L0L0J8J9p3p3pN7N9ll3
6515B0L1M0M0j0p2p1L4N7m9j4j3M4M6qpn2n1q3q4J2J2J2J2j5j5j4j5K5K4N7N6O7O7k7k8j7
6504A1j6J5J5k4k2p6p7J9J9P1P1oppqj4j4J8J7L7L8j6j5M5M5M4M5m2m3m3m2o6o7K9K9J2J3
6492a2m0m0j0j0rj0qqqrj4j4O1O0O8O7m8m8m8m8m8m8K4K4K4K4K1K0K1K0L6L5l8l9n9n9n9n9
$$ plain form
6577 -23 -16 -44 -71 -71 -70 -37 -5 -13 -21 2 26 16 6 -3 -13 -61 -109 -126 -142 -80 -19 -53 -87 -92 -97 -102 -107 -107 -108 -109 -109 -110 -111 -112 -112 -76 -39 -2 34 -6 -47 -35 -22 -20 -18
6563 -18 -16 -14 -25 -35 -46 -57 -75 -94 -112 -131 -112 -93 -75 -56 -51 -47 -42 -37 -59 -80 -102 -124 -80 -37 5 49 -18 -86 -123 -159 -98 -37 -28 -20 -23 -25 3 33 -44 -123
6550 -123 -169 -215 -180 -146 -160 -174 -182 -126 -138 -150 -109 -67 -18 -33 -80 -63 -12 39 -10 -60 -71 -18 61 142 146 86 30 -24 -31 -38 -35 -33 -79 -126 -178 -166 -116 -66
6539 -66 -65 -65 -37 -9 -40 -134 -139 -144 -88 -32 -30 -27 -78 -129 -180 -231 -234 -236 -186 -136 -99 -63 -27 9 26 43 60 77 54 31 7 -15 -25 -34 -93 -151 -213 -212 -154 -97
6526 -97 -52 -71 -82 -92 -164 -173 -121 -69 -5 58 41 -38 -119 -199 -207 -150 -40 6 -8 -87 -106 -125 -95 -64 -34 -4 26 56 74 93 20 -53 -60 -3 56 53 20
6515 20 51 91 131 121 49 -22 12 69 20 6 -7 37 83 75 68 16 -35 -118 -202 -190 -178 -166 -154 -169 -184 -198 -213 -188 -164 -107 -51 16 83 56 28 11
6504 11 -5 10 25 1 -21 -97 -174 -155 -136 -65 6 0 -7 -14 -22 -36 -50 -32 -15 22 60 44 29 74 119 163 208 166 123 80 38 -28 -95 -66 -37 -25 -12
6492 -12 -52 -92 -102 -112 -121 -131 -139 -147 -155 -164 -178 -192 -131 -71 -3 64 16 -32 -80 -128 -176 -224 -200 -176 -152 -128 -107 -87 -66 -46 -10 25 -13 -52 -111 -170 -229 -288
6480b88L1L1L1L1K2K1N4J16J17J2o3o3q4q4P4P3MNk8k7%JL1L2ppppm4m4OJ11O1m4n3n2m1m1
6469a20m2m1QRM4j9m0m0m4m4M6M6M6M7L0L1L1L1L3L4O5O6mlr9r9r5r5J%RRL7L7O4JnN8N7m9
6456Ak3L9M6j7l0k9mmL5k7m3K1L3L3k4k4PPJ%JJj4j3j3j4N2N1Q8K3m2m3m6m6MMnN9N0j4q3
6443bk0J3J2l4l6K4K4J9J9L3l1ONkjj5p7n6QO1lJ8Q0M2M2K4K4l2r6j00l6lkJ2J2J3J2j6j6
6431g5n2J2M7M8L3k8nnm0m1j8j8L5L6L0L1j%LMMLK5K5k8k7o1o1J4J4L3L2Q5Q6M7M7nok3k2
6419A78RJ0p3p3j03j05k8k9K5K5OOOOqqqqM8M7J00J01K8K8q9q9l8l9J5J4k0k0n2n2J5J5J5
6407a45J5LMp0p1O4O4O4O4N2N3N3N4o5o4o5o3o0o1N7N6N3N1m3m2k8k9k8k8K9K9K9K9L4L2j9
6396Hj8mmn7n7l2l2O3O4JKL3L3l9l9m0l9M1M1j3j2L2L3%Jm0m0L5L4RRJ0Rl7l6l7l6J9K0J9
$$ plain form
6480 -288 -257 -226 -195 -164 -142 -121 -67 49 166 178 115 52 -32 -116 -42 31 35 40 12 -15 -15 -14 17 49 42 35 28 21 -23 -67 -61 50 111 67 14 -38 -79 -120
6469 -120 -162 -203 -195 -186 -142 -161 -201 -241 -285 -329 -283 -237 -191 -144 -114 -83 -52 -21 12 46 111 177 173 170 71 -28 -123 -218 -217 -217 -208 -199 -162 -125 -61 -60 -65 -7 50 1
6456 1 -22 17 63 46 16 -13 -17 -21 14 -13 -56 -35 -2 31 7 -17 -10 -3 -2 -2 -1 0 -14 -27 -40 -54 -2 49 137 160 118 75 29 -17 -13 -9 -14 45 95 81 -2
6443 -2 -22 -9 3 -31 -67 -43 -19 0 19 52 21 27 32 30 29 14 -63 -119 -111 -50 -53 -35 45 87 129 153 177 145 49 -51 -87 -90 -92 -80 -68 -55 -43 -59 -75
6431 -75 -127 -115 -68 -20 13 -15 -20 -25 -65 -106 -124 -142 -107 -71 -41 -10 -11 -11 -8 -4 0 3 28 53 25 -2 -63 -124 -110 -96 -63 -31 54 140 187 234 229 223 200 178
6419 178 187 197 124 51 -52 -157 -185 -214 -189 -164 -158 -152 -146 -140 -148 -156 -164 -172 -124 -77 23 124 152 180 91 2 -36 -75 -60 -46 -66 -86 -138 -190 -175 -160 -145
6407 -145 -130 -127 -123 -193 -264 -200 -136 -72 -8 44 97 150 204 139 75 10 -53 -113 -174 -117 -61 -8 43 0 -42 -70 -99 -127 -155 -126 -97 -68 -39 -5 27 8
6396 8 -10 -14 -18 -75 -132 -164 -196 -133 -69 -68 -66 -33 0 -39 -78 -118 -157 -116 -75 -88 -100 -68 -35 -35 -34 -74 -114 -79 -45 -36 -27 -17 -8 -45 -81 -118 -154 -135 -115 -96
6384i6K0m6m6m6m7P3P3jjJ1J1m2m1j3j3J8J9O0O0K8K7k8k8M5M5rj0m0m1J3J3J4J3ppqpl3l3
6372a00l3l4PPOPL5L6L5L4k3k4k4k4N8N6P6n1l7l6K9K9mmmmo2o3J1J1%Jn3n3K1K0j1j2ppK5
6359a66K4NNNNk1k2k1k1K9K9L0K9M5M5M3M5LKp2p1KKN4N5m2m1j1j1l0l0l0l0m3m3O4O3J8J8
6347h5J8J9L1L0L2L1q9r1J6J6J1J2J2J2lkkkklkkL0K8L0K9j47j48m3m2M5M5j9j8N4N4N4N5
6335c6noo9o8k6k5k5k5N9O0N9N9M9N0j4j4nmnnn2n2J1J1m8m8m8m7nmmmL6L6L5L6l4l3L1L0
6323a49k0j9Q6Q7J1J0J1J1n8n9NNk7k7k6k7j6j5M8M8%jjjopooP1P0P0P1K1K2K1K2n0n0n0n1
6310A8j5j5j5j6PPn7n7L8L8L9L7j6j6j6j7l4l5l4l5P3P3RJ0k2k1k1k1l8l7K7K6J6J5J5J6M4
6299c0M4M5M4k4k5q7q9o3o3%JN4N5rqj5j4j4j4N1N1N0N1k9k8L9L7%O3K9p6n0N4K4l9m7m7J2
$$ plain form
6384 -96 -76 -122 -168 -214 -261 -188 -115 -116 -117 -106 -95 -137 -178 -191 -204 -186 -167 -107 -47 -19 8 -20 -48 -3 42 33 23 -17 -58 -45 -32 -18 -5 -12 -19 -27 -34 -67 -100
6372 -100 -133 -167 -160 -153 -147 -140 -105 -69 -34 0 -23 -47 -71 -95 -37 19 95 44 7 -29 0 29 25 21 17 13 -49 -112 -101 -90 -90 -89 -142 -195 -174 -154 -165 -177 -184 -191 -166
6359 -166 -142 -137 -132 -127 -122 -143 -165 -186 -207 -178 -149 -119 -90 -45 0 43 88 91 93 21 -50 -48 -46 8 63 21 -20 -31 -42 -72 -102 -132 -162 -205 -248 -184 -121 -103 -85
6347 -85 -67 -48 -17 13 45 76 -13 -104 -88 -72 -61 -49 -37 -25 -28 -30 -32 -34 -36 -39 -41 -43 -13 15 45 74 -73 -221 -264 -306 -261 -216 -235 -253 -199 -145 -91 -36
6335 -36 -41 -47 -116 -184 -210 -235 -260 -285 -226 -166 -107 -48 1 51 37 23 18 14 9 4 -48 -100 -89 -78 -126 -174 -222 -269 -274 -278 -282 -286 -250 -214 -179 -143 -177 -210 -179 -149
6323 -149 -169 -188 -102 -15 -4 6 17 28 -30 -89 -84 -79 -106 -133 -159 -186 -202 -217 -169 -121 -121 -122 -123 -124 -130 -137 -143 -149 -78 -8 62 133 154 176 197 219 169 119 69 18
6310 18 3 -12 -27 -43 -36 -29 -86 -143 -105 -67 -28 9 -7 -23 -39 -56 -90 -125 -159 -194 -121 -48 -39 -29 -51 -72 -93 -114 -152 -189 -162 -136 -120 -105 -90 -74 -30
6299 -30 14 59 103 79 54 -33 -122 -185 -248 -248 -247 -193 -138 -147 -155 -170 -184 -198 -212 -161 -110 -60 -9 -38 -66 -27 10 10 73 102 26 -24 30 54 15 -32 -79 -67
6287f7J2j2j2j1j2J6J6P8Q0k2k1M2M3j7j8j7j7NMj7q0q9J7J01J03k4k4k4k4l3l5l4l4j6j5
6276a58j6j6k0k0k0k0R3R2K9K9J0J0RJ0OOOONNNNp8p8p5L2R4R3m7m8p9q0K6R1K4q1q2K5R5
6264a12L1J0J0lmmmk1k1k1k1j6j6j5j6j2j2N2N3n0m9n0m9llO1O1N0N0j4j4M4M4J3J2LLLLO2
6252C5O3m3m3k4k4PQJ8J8J9J8j18j20j4j3K1K2m2m2M6M7J4J4j1j1N2N2L4L2k9l0m4m3K0K0
6241i1M8M7j4j6opopJ2J1P5P5L5L4LLLLo1o1j6j5j6j6k9k9o2o1j0j0N4N4J4J3j8j8k4k4L9
6229i4M0K2K2K1K2rqj3j1k1q4j08jK2K2K9K8K2K1K1K1p2p1rqL8L7J01J00O2O2q7q7k2k1J0
6218cQJ8J9m5m5L3L3L4L3l8l9o9p1RJ0n5n4K2K3noP6J38J9q7n5Ql4l4ONONJ4J3J4J3k3k4k3
6205a51k4L4L3R8R6n7n6n7n7JJJJK9L0klN2N0j2j1MNNOk0k1k0k1L2L3O4O4P7P6p2p2r5r4o3
$$ plain form
6287 -67 -55 -67 -79 -90 -102 -86 -70 8 88 66 45 87 130 113 95 78 61 66 70 53 -27 -116 -99 2 105 81 57 33 9 -24 -59 -93 -127 -143 -158
6276 -158 -174 -190 -210 -230 -250 -270 -177 -85 -56 -27 -17 -7 2 12 18 24 30 36 41 46 51 56 -22 -100 -175 -143 -49 44 -3 -51 -130 -210 -184 -93 -69 -150 -232 -207 -112
6264 -112 -81 -71 -61 -64 -68 -72 -76 -97 -118 -139 -160 -176 -192 -207 -223 -235 -247 -195 -142 -192 -241 -291 -340 -343 -346 -285 -224 -174 -124 -138 -152 -108 -64 -51 -39 -36 -33 -30 -27 35
6252 35 98 55 12 -12 -36 -29 -21 -3 15 34 52 -66 -186 -200 -213 -192 -170 -212 -254 -208 -161 -147 -133 -144 -155 -103 -51 -17 15 -14 -44 -88 -131 -111 -91
6241 -91 -43 4 -10 -26 -32 -39 -45 -52 -40 -29 46 121 156 190 193 196 199 202 141 80 64 49 33 17 -12 -41 -103 -164 -174 -184 -130 -76 -62 -49 -67 -85 -109 -133 -94
6229 -94 -54 -32 -10 11 33 24 16 3 -8 -29 -113 -221 -222 -200 -178 -149 -121 -99 -78 -57 -36 -108 -179 -188 -196 -158 -121 -20 80 142 204 117 30 8 -13 -3
6218 -3 5 23 42 -3 -48 -15 18 52 85 47 8 -61 -132 -123 -113 -168 -222 -200 -177 -182 -188 -112 26 45 -42 -97 -89 -123 -157 -151 -146 -140 -135 -121 -108 -94 -81 -104 -128 -151
6205 -151 -175 -141 -108 -10 86 29 -27 -84 -141 -140 -139 -138 -137 -108 -78 -80 -83 -31 19 7 -4 0 5 10 16 -4 -25 -45 -66 -34 -1 63 127 204 280 208 136 41 -53 -116
6193a16o3j3j3j3j3J1J1J1J2LLLMqqqqJ0J1J0J1N3N4N3N3j5j5j5j4M6M6J5J4K4K4n0n0ooo
6180D2nlklkJ1J1J2J1M0M1M0M0Q0P9Q0P9l7l7P1J35N8J64L65O42R70J629K824L609Q66l148
6171H662l313k017j121o33m33k84j47j48q5k1k0j27j51j52n8M7P5J3K2K3J8J8M8M8j12j12
6163D0jkN2N2J8J9J8J9m5m5m6m5m7m8K6K7QPJ00J00lo7kJ04J06%p1p2p7p8p6p8oooonnM8M8
6150d5J2J1m2m1j5j4L8L9qpqqK0K1K0K1KLJLJ5J5n9n9lmlmK1K1m7m7n7M9Q5Q4P3P4m4j07j14
6138a08rN9np7p7L6L6P3P2%k%%r5r6NOL7L7n7n7nmK8K8mnjjL1L0K1K1j1j1J9J9J9J9LLLMq3
6124i9q2qrMLP7P8P4P4K2K2m6m6p7p8k6k6M9M8j8j7j7j8L7L7O8O8J0J0q6q5l1l0K2K3j0j0
6112i3j0j0L6L6l8l8k9l0K4K3opO8O8K0K1M0q7o8o9kkp0o9mJ24Q2Q1K7K9O9n7j14J2K8l6%
$$ plain form
6193 -116 -179 -192 -205 -218 -231 -220 -209 -198 -186 -183 -180 -177 -173 -181 -189 -197 -205 -195 -184 -174 -163 -110 -56 -3 50 35 20 5 -9 37 83 98 112 136 160 110 60 54 48 42
6180 42 37 34 32 29 27 38 49 61 72 112 153 193 233 313 392 472 551 514 477 548 683 741 905 1270 1912 2882 4511 7335 10944 11810 8662
6171 8662 5349 3332 2211 1578 1145 861 714 566 481 460 440 313 162 10 -48 -1 74 87 109 132 150 168 216 264 152 40
6163 40 39 37 89 141 159 178 196 215 170 125 79 34 -13 -61 -35 -8 0 7 107 207 204 137 135 239 345 345 274 202 125 47 -29 -107 -113 -119 -125 -131 -136 -141 -93 -45
6150 -45 -33 -22 -64 -105 -120 -134 -96 -57 -65 -72 -80 -88 -68 -47 -27 -6 -4 -1 0 3 18 33 -26 -85 -88 -92 -95 -99 -78 -57 -104 -151 -208 -159 -74 10 83 157 113 6 -108
6138 -108 -117 -58 -63 -140 -217 -181 -145 -72 0 0 -2 -2 -2 -97 -193 -188 -182 -145 -108 -165 -222 -227 -231 -203 -175 -179 -184 -185 -186 -155 -125 -104 -83 -94 -105 -86 -67 -48 -29 -26 -23 -20 -16 -99
6124 -99 -181 -189 -198 -194 -191 -114 -36 38 112 134 156 110 64 -13 -91 -117 -143 -94 -46 -64 -81 -98 -116 -79 -42 26 94 104 114 28 -57 -88 -118 -96 -73 -83 -93
6112 -93 -103 -113 -77 -41 -79 -117 -146 -176 -152 -129 -135 -142 -74 -6 14 35 75 -12 -80 -149 -151 -153 -223 -292 -296 -172 -90 -9 18 47 116 59 -55 -43 -15 -51 -51
6101e1O2M6j8n2n2J4J5J5J5j7j6p0o9j9k0N5N5L1L2L2L0J9J8r7r8q9q8PQR6R5O5O3K3K3l1
6090C2l0m8m8MML5L4l9m0O2O1L0L0k1k2k1k1l1l2%JK9K9K8L0m2m1j0j1l4l5J9J8J4J4q2q2
6078b16lmP1P1K8K9k5k4k5k5k4k5L3L3L3L4l4l3l3l3M5M6M6M4lml4l5j7j7N7N6k0k1J1J1k3
6067c0k4RRl7l7l6l7J0RJ0RJ7J8j5j4k8k8K5K5J1J2k1k1ppppj2j2M1M1k7k8n9n9M1M1J4J4
6055a97N7J20P0l6p7p9j0j1j7j7N7N7L2L2m3m2LLP7P6OOk6k7l6l7r1r0ppK5K5mmK8K8mmK8
6043a36K8kkL0L0j4j5j4j4O6O5qqo2o4J0J1J6J7J6J7L7L9j5j5j7j8P6P7l0k9n5n4p6L1P4J0
6031Bk8L4mmJ4J5J5J5k3k3RRk8k6L6L6l0l0l0l1N2N1j1j2nmnnK1K2K2K2j7j8j8j7L9L9L2L3
6019A49o6j70j07kK9K9O8O7O5O5L0K9m4j09r9OM2M0n7n8k4k3M0L9l7l7K7K7K1K1q6q5L7L7
$$ plain form
6101 -51 11 57 39 -13 -65 -51 -36 -21 -6 -23 -39 -109 -178 -197 -217 -162 -107 -76 -44 -12 18 37 55 -42 -140 -229 -317 -310 -302 -206 -111 -46 17 40 63 32
6090 32 2 -46 -94 -90 -86 -51 -17 -56 -96 -34 27 57 87 66 44 23 2 -29 -61 -61 -60 -31 -2 26 56 14 -27 -37 -48 -82 -117 -98 -80 -66 -52 -134 -216
6078 -216 -219 -223 -152 -81 -53 -24 -49 -73 -98 -123 -147 -172 -139 -106 -73 -39 -73 -106 -139 -172 -127 -81 -35 9 6 2 -32 -67 -84 -101 -44 12 -8 -29 -18 -7 -30
6067 -30 -54 -45 -36 -73 -110 -146 -183 -173 -164 -154 -145 -128 -110 -125 -139 -167 -195 -170 -145 -134 -122 -143 -164 -171 -178 -185 -192 -204 -216 -175 -134 -161 -189 -248 -307 -266 -225 -211 -197
6055 -197 -140 -20 50 14 -63 -142 -152 -163 -180 -197 -140 -83 -51 -19 -62 -104 -101 -98 -21 55 61 67 41 14 -22 -59 -150 -240 -247 -254 -229 -204 -208 -212 -184 -156 -160 -164 -136
6043 -136 -108 -110 -112 -82 -52 -66 -81 -95 -109 -43 22 14 6 -56 -120 -110 -99 -83 -66 -50 -33 4 43 28 13 -4 -22 54 131 101 72 17 -37 -113 -82 -8 2
6031 2 -26 8 4 0 14 29 44 59 36 13 22 31 3 -23 13 49 19 -11 -41 -72 -20 31 20 8 3 -1 -6 -11 10 32 54 76 59 41 23 6 45 84 116 149
6019 149 83 -87 -194 -196 -167 -138 -70 -3 62 127 157 186 142 33 -66 -60 -18 22 -35 -93 -117 -140 -100 -61 -98 -135 -108 -81 -60 -39 -125 -210 -173 -136
6008a36k0k0n4N2J16J0l4l4m0m1P9Q0J5J6j9j9m1j04m7N9J02J00N8N7oop8p7K8K8K5K6K5K6
5998A26j6j5j5j6j9k0j9j9K9K9l4l3o2o1l0k9K3K4K4K3N2N1Q3Q3m9m8J5J5K0K1K1K1ooooK1
5986A72K1m4m3m5m5J4J5j1p3r8r8o9oJ08J08Q9Q8O1lm8m9QPL6k8r0r2n0N6K8K8N0M9J4J4K4
5975I8l9l6l4J3J5M6M6qrrrk1k0J1J1L8L9J0n3m2m1J9J8K1K1pom2K3K2m1K6K6N5N4J01J02
5964C98J49K13L68O86J210J060o19j320q56m95l07k02q7k4O8No2o2j8j7q1p9QRM1L9N6N6K9
5955A66l6p4p3n0J4K9K9O5O5P5P6l1l1n7n7jjM2q5q4M1J3J3j0j1k8k9L4L6J9K0K0K0j6j6j6
5943G1j5L7L7L8L7j8j8j8j9l3l4l3l3K5K5opk3k2q7q6J0J1P4P5J9K1m2m3LLLMk2k2Q4Q3N2
5932A31N3j2j1n0m9n0m9JKO4O5kll4l5o6o6o7o7Q2Q2J8J9J4J5J4J3jkkkrj0rj0j0j1j0j0j3
$$ plain form
6008 -136 -156 -176 -230 -178 -62 -52 -86 -120 -160 -201 -122 -42 -27 -11 -30 -49 -90 -194 -241 -182 -80 20 78 135 129 123 45 -32 -4 24 49 75 100 126
5998 126 110 95 80 64 45 25 6 -13 16 45 11 -22 -84 -145 -175 -204 -181 -157 -133 -110 -58 -7 76 159 110 62 77 92 112 133 154 175 169 163 157 151 172
5986 172 193 149 106 61 16 30 45 34 -39 -137 -235 -304 -310 -202 -94 -5 83 144 141 93 44 52 59 95 67 -23 -115 -165 -109 -81 -53 -3 46 60 74 98
5975 98 59 23 -11 2 17 63 109 101 92 83 74 53 33 44 55 93 132 142 89 47 6 25 43 64 85 78 72 30 53 75 34 60 86 141 195 296 398
5964 398 547 760 1128 1814 3024 4084 3465 2145 1289 794 487 285 198 174 242 247 185 123 105 88 7 -72 -64 -55 -14 25 81 137 166
5955 166 130 56 -17 -67 -53 -24 5 70 135 210 286 255 224 167 110 109 108 150 65 -19 22 35 48 38 27 -1 -30 4 40 59 79 99 119 103 87 71
5943 71 56 93 130 168 205 187 169 151 132 99 65 32 -1 24 49 43 36 13 -9 -96 -182 -172 -161 -87 -12 7 28 -14 -57 -54 -51 -48 -44 -66 -88 -4 79 131
5932 131 184 172 161 111 62 12 -37 -36 -34 30 95 93 90 56 21 -45 -111 -178 -245 -163 -81 -63 -44 -30 -15 -1 12 11 9 7 5 -4 -14 -23 -33 -43 -54 -64 -74 -87
5919h7j4N0N1PQk3k4LKKKO0O0llk8k8k9k7N4N6N5N6l0l0l1l0l8l9opm0m0j2N1P6P8M9N0j0
5907A91j1m2m2K3K3Q3Q3P4J0j8q1j23j8O4O3j9q2q3j8J3J4op0k1M3L5L5j5j5k4M1N8oj09j07
5896e7nJ00P8J3k8k8%jj9k0M5M4j9j8j9j9K7K7K7K7R6R7K5l8m2m3m6m6k7k7L8L7K3K4l7l6
5885A53j6M7J9m4j0N3M6M5j0j1j0j0qpmln8Nl0l0K1K1K0K1LLMLL4L5l0k9J9K0K0J9k4k4k4
5873B29k4l2l2l2l2L6L6L6L6L9L9L9L9o6o6q5M2J39J38M2q5p4j1M2M2K9K9K9K9m4m3RJ0pp
5862D69ppK7K8K8K7N7N7N7N7QRQRJ0J1J0J1Q3Q4J15J15R9R9K36K37K05K05K09K73L77N03O70
5852D379Q82J166J548K052K690L767N339O793P260N223Q49l808o483o771n710m393l246k369
5846I168j732j254r57p58o30n32m05k96k95k85j58j19j20j12j11j40j41k3k4l4l4l4l4l9m0
$$ plain form
5919 -87 -101 -51 0 7 15 -8 -32 -29 -27 -25 -23 37 97 94 91 63 35 6 -21 33 89 144 200 170 140 109 79 41 2 -4 -11 -51 -91 -103 -52 24 102 151 201 191
5907 191 180 138 96 119 142 225 308 382 392 374 293 170 152 216 279 260 178 95 77 90 104 98 28 7 50 85 120 105 90 66 107 165 159 50 -57
5896 -57 -62 38 116 129 101 73 73 72 53 33 78 122 103 85 66 47 74 101 128 155 251 348 373 335 293 250 204 158 131 104 142 179 202 226 189 153
5885 153 137 184 203 159 149 202 248 293 283 272 262 252 244 237 233 230 172 177 147 117 138 159 179 200 203 206 210 213 247 282 252 223 242 262 282 301 277 253 229
5873 229 205 173 141 109 77 113 149 185 221 260 299 338 377 311 245 160 202 341 479 521 436 362 351 393 435 464 493 522 551 507 464 473 483 476 469
5862 469 462 455 482 510 538 565 622 679 736 793 801 810 818 827 837 848 858 869 952 1036 1151 1266 1365 1464 1700 1937 2142 2347 2556 2829 3206 3709 4379
5852 4379 5261 6427 7975 10027 12717 16484 21823 28616 35876 41099 41948 38140 31657 24886 19176 14783 11537 9168
5846 9168 7436 6182 5225 4467 3837 3305 2900 2604 2309 2024 1866 1747 1627 1515 1404 1264 1123 1100 1076 1042 1008 974 940 901 861
5838H61L5L4qqq3q3m7m7j5j5L2L2L2L2L8L7J76J76J44J44J72J09j01k29j93j29r7l3l4l3L6
5829I35L6n9n9PQQQL8L9R1R2O3O2O3O2m9m9J7J44J76J76J52J52K47K46L15L78N31O58Q77J090
5819F455J413J965K724L871N315O887P635N724J032l938o671o969n829m514l393k501j843
5814G363j290r25p12o17m91l97k70k39k39k32j05q1j45j68j05j16j17l8l8n8n8n8n8o3o3o3
5806F17o3l7l6J7J6N9N8j6j6p4p4m3m2j2j2K1K0klP2P2J09J09n0n0o5o5o5o4O7O8O8O7M5M4
5795G40M5M4P7P7KLK3K2J19J19J34J35O1O1J00J01K17K17K84K85L80N07P08Q35J042J424J899
5787I661K706L858N175O662P300N510J221l554o400o830n852m521l373k482j759j307r25p48
5781D342o21m94m31l70k43j75j74j66j66j17j17o4o3n1n0n0n0q5q5l2l1n1n1n0n1m1m1m1m2
$$ plain form
5838 861 896 930 922 914 831 748 701 654 639 624 656 688 720 752 790 827 1003 1179 1323 1467 1639 1748 1647 1418 1225 1096 999 966 932 899 935
5829 935 971 912 853 860 868 876 884 922 961 1052 1144 1207 1269 1332 1394 1345 1296 1313 1457 1633 1809 1961 2113 2360 2606 2921 3299 3830 4488 5365 6455
5819 6455 7868 9833 12557 16428 21743 28630 36265 41989 43021 39083 32412 25443 19614 15100 11707 9206 7363
5814 7363 6073 5148 4436 3819 3328 2931 2661 2422 2183 1951 1846 1765 1620 1452 1347 1231 1114 1076 1038 980 922 864 806 743 680 617
5806 617 554 517 481 498 514 573 631 615 599 525 451 408 366 354 342 363 383 381 378 450 522 631 740 690 640 575 510 445 381 448 516 584 651 696 740
5795 740 785 829 906 983 985 988 1011 1033 1152 1271 1405 1540 1601 1662 1762 1863 2080 2297 2581 2866 3246 3753 4461 5296 6338 7762 9661
5787 9661 12367 16225 21400 28062 35362 40872 42093 38539 32139 25309 19457 14936 11563 9081 7322 6015 5090 4342
5781 4342 3721 3227 2796 2426 2183 2008 1834 1668 1502 1385 1268 1204 1141 1090 1040 990 940 855 770 738 707 656 605 555 504 463 422 381 339
5772C39k7k7n9n8M4M4rj0M9M9m8J6K4j04j13m9m0K4K4K4R0R0J6J5p7p7p8M8N9ol6l6rrK3K3
5761A29M5M5J3J3n0n1n1n0LLP7P8J0J1m2m3j6j6j6j6POOPj0rj0rj7j7j7j6m2m2N3N2nmK6K7
5748F2m3m2m4m3J2J2J2J2J2J2J2J2LKLLk7k7k7k6N9N8NOj02j04J3J4Q5Q4J1J1RRRRK7K6k6
5736I3k7n0n0M4M6JJJJN5N5M9M8k6j31p2p2JJJJkjkkj9j9L5L4MLm7m9K3K2N4N5J9K0j3j2m7
5723B6m7k0j9N1j3m1O5J07M4l1l0q4q4n2n3j1j1M2M2K4K4n0n0PPPPM5M4j8j9k1k0k0k0J1J1
5712a50J1J1nnnnmmmmO0O1O0O1ppp0p0p3p3rrM9N0J7J8K4K3K4K3j5j4j5j5M7M5n8n9n4n5k2
5699b27k2j6j6R0Q9L5L5L3L5k4k3k4k4ooN7N6MMLMJ1J1k0k1m2m2K1K1NPP0P0PPn7n7j9k0J3
5687B2J2K9K8l5l6p3p5m3m3j3j3N2N1O0O1K7K9M7M6M7M6k4k3q8q8J4J3J4J3r8r8QPK9K8ml
$$ plain form
5772 339 312 285 226 168 212 256 247 237 286 335 287 303 327 223 110 61 21 45 69 93 183 273 289 304 227 150 72 120 179 173 137 101 92 83 106 129
5761 129 174 219 232 245 195 144 93 43 46 49 126 204 214 225 183 140 124 108 92 76 83 89 95 102 92 83 73 64 47 30 13 -3 -45 -87 -34 18 13 9 35 62
5748 62 19 -23 -67 -110 -98 -86 -74 -62 -50 -38 -26 -14 -11 -9 -6 -3 -30 -57 -84 -110 -51 7 12 18 -84 -188 -175 -161 -76 8 19 30 39 48 57 66 93 119 93
5736 93 66 16 -34 10 56 57 58 59 60 115 170 219 267 241 110 38 -34 -33 -32 -31 -30 -32 -33 -35 -37 -56 -75 -40 -6 -2 1 -46 -95 -72 -50 4 59 78 98 85 73 26
5723 26 -21 -41 -60 -9 -22 -63 2 109 153 122 92 8 -76 -128 -181 -192 -203 -161 -119 -95 -71 -121 -171 -164 -157 -150 -143 -98 -54 -72 -91 -112 -132 -152 -172 -161 -150
5712 -150 -139 -128 -133 -138 -143 -148 -152 -156 -160 -164 -104 -43 17 78 71 64 -6 -76 -149 -222 -231 -240 -191 -141 -124 -106 -82 -59 -35 -12 -27 -41 -56 -71 -24 21 -37 -96 -150 -205 -227
5699 -227 -249 -265 -281 -191 -102 -67 -32 1 36 12 -11 -35 -59 -65 -71 -14 42 46 50 53 57 68 79 59 38 -4 -46 -25 -4 1 8 78 148 155 162 105 48 29 9 22
5687 22 34 63 91 56 20 -53 -128 -171 -214 -227 -240 -188 -137 -77 -16 11 40 87 133 180 226 202 179 91 3 17 30 44 57 -41 -139 -131 -124 -95 -67 -71 -74
5675g4P6P8k5k5j6M7j3p6l2L2K3K3P1P1l4l5j9j9n1n0l1l0kO1R7R9mlK6K7jo4n8n7LKMMl5
5663a0K7Pn5j7j7P1P2M3k0m5m6n7Ol6r9l2L2P3P4J4J4K2K3q2q3N8N9N3N4M3k0m8m8l7l8K5
5652b0K5K3K3j7M6M4k0q0j6O3O4L9k4n5n5l5K8j5p8l9m0noJ8Q2O4Lk1k2j0rj0j0jkL8k6n3
5640a09J1J1n3m7J7j9k0l1L3K8K9j2j1N2N3M2M1j4p6n8OO1O1RJ0m2m3p7p6p7j3M6J10J15M9
5629Fppn2J2Q1J8l8l7k5k4PPj3j3j3j3K2K3l1l1m4m5RRk3k3J6P9O3O4k9k8L0L0K9L0K2K2J8
5617A01J8k8r1n2n2j3N1J5J5K1J9L1l2k1Q4J13J12L7k6o8j32n6PN9N8On9k3k3k5k6M3k2m2
5607am3K6K6P3P2M1o6q4k1L3L2L3L3MNn6PPn6j2j2j6j6k8l0l3l3%o4o3jK7K6O5J28J10M7l4
5595A26r7o7nm4m5k9k9M6M5j8j7L1L2O0ml8l8l6K8O0njjnnL2L2L7k7n4n5kjk2M2Q0Q0klj6
$$ plain form
5675 -74 2 80 55 30 14 61 48 -28 -60 -28 -5 18 89 160 126 91 72 53 2 -48 -79 -109 -111 -50 47 146 142 139 165 192 191 127 69 12 15 17 21 25 -10
5663 -10 17 24 -31 -48 -65 6 78 121 101 56 10 -47 -41 -77 -176 -208 -176 -103 -29 -15 -1 21 44 -38 -121 -63 -4 49 103 146 126 78 30 -7 -45 -20
5652 -20 5 28 51 34 80 124 104 24 8 71 135 174 150 95 40 5 33 18 -60 -99 -139 -144 -150 -132 -50 14 17 -4 -26 -36 -45 -55 -65 -66 -68 -30 -56 -109
5640 -109 -98 -87 -140 -187 -170 -189 -209 -240 -207 -179 -150 -162 -173 -121 -68 -26 15 1 -75 -133 -127 -66 -5 4 14 -28 -71 -148 -224 -301 -314 -268 -158 -43 6
5629 6 -1 -8 -60 -48 33 51 13 -24 -49 -73 -66 -59 -72 -85 -98 -111 -89 -66 -97 -128 -172 -217 -208 -199 -222 -245 -229 -150 -87 -23 -52 -80 -50 -20 9 39 61 83 101
5617 101 119 91 0 -52 -104 -117 -66 -51 -36 -15 4 35 3 -18 66 179 291 328 302 234 102 46 53 112 170 176 117 94 71 46 20 63 41 -1
5607 -1 -44 -18 8 81 153 194 128 44 23 56 88 121 154 158 163 107 114 121 65 53 41 25 9 -19 -49 -82 -115 -115 -179 -242 -243 -216 -190 -125 3 113 160 126
5595 126 29 -38 -43 -87 -132 -161 -190 -144 -99 -117 -134 -103 -71 -11 -15 -53 -91 -127 -99 -39 -44 -45 -46 -51 -56 -24 8 45 18 -36 -91 -93 -94 -116 -74 6 86 84 81 65
5582F5p9m5J9J5m8lkO8O7k0k1J1J1pqppl0l0M3M3kjl3l3ppo0j24n2N5O5O5M6M6L8L9O8l8r4
5570Fr4qqj2N2Q1Q2j2p5o3%L5L3J7J6j5j5k6k7l2l1ko5o6kLMPPJ6J6k1M4M0M0M4M3LLk8k9
5557c9l2l2l9O7N4N3l3l5n1n2j5j6k5M0O6l9m4J9J6m7k9L5Q4K0mnLO6O7l7j07j08l8K6M2M3
5546a26LLLLM2M3j1j1k6k6O4O2L0p5j27o3M0L9Mn9k2k3k3k2J0P4M6j8N1J15J7m3p8j3O1lJ3
5535d6P5K0m4n8n8J2J2L9L9n2n3MO8O7Mm7m8KJl1l0k7k6M4J09N4rm4m6M6M6k3k5k4k4k0k0
5523a13k0j9KKL0L0M7j6j6M8J9J9K4K3J7J6jo5m0m1L0K8moooO5O5k9l0J2J2J3J2k0k0J3J2
5511H7j2j2j2j2RJ0m3m2m3m3J1J0m6m7POO7O7L5L4n2n3J%o0o0pqK6K5K5K6P1P0m4m6q0q1m3
5499b59Q3J00k7jjj3j2j2j2m2m1m6Q1J03k5j9j9k6k6K7K7J1J0k1k2nonnK8K8Q2Q0O0N9l6l6
$$ plain form
5582 65 -14 -59 -40 -25 -73 -76 -78 -10 57 37 16 27 38 31 23 16 9 -21 -51 -8 35 33 32 -1 -34 -41 -48 -108 -232 -284 -229 -164 -99 -53 -7 31 70 138 100 6
5570 6 -88 -96 -104 -116 -64 17 99 87 12 -51 -51 -16 17 34 50 35 20 -6 -33 -65 -96 -98 -163 -229 -231 -228 -224 -217 -210 -194 -178 -199 -155 -115 -75 -31 12 15 18 -10 -39
5557 -39 -71 -103 -142 -75 -21 32 -1 -36 -87 -139 -154 -170 -195 -155 -89 -128 -172 -153 -137 -184 -213 -178 -94 -74 -78 -83 -80 -14 53 16 -91 -199 -237 -211 -169 -126
5546 -126 -123 -120 -117 -114 -72 -29 -40 -51 -77 -103 -39 23 53 -22 -149 -212 -172 -133 -129 -188 -210 -233 -256 -278 -268 -194 -148 -166 -115 0 17 -26 -104 -117 -56 -59 -46
5535 -46 29 49 5 -53 -111 -99 -87 -48 -9 -61 -114 -110 -42 25 29 -18 -66 -64 -63 -94 -124 -151 -177 -133 -24 30 21 -23 -69 -23 23 0 -25 -49 -73 -93 -113
5523 -113 -133 -152 -150 -148 -118 -88 -41 -57 -73 -25 -6 13 37 60 77 93 92 27 -13 -54 -24 4 0 -6 -12 -18 47 112 83 53 65 77 90 102 82 62 75 87
5511 87 75 63 51 39 48 58 15 -27 -70 -113 -102 -92 -138 -185 -178 -172 -105 -38 -3 31 -21 -74 -73 -73 -133 -193 -200 -208 -182 -157 -132 -106 -35 35 -9 -55 -135 -216 -259
5499 -259 -176 -76 -103 -104 -105 -118 -130 -142 -154 -196 -237 -283 -202 -99 -124 -143 -162 -188 -214 -187 -160 -149 -139 -160 -182 -187 -193 -198 -203 -175 -147 -65 15 75 134 98 62
5488F2j0j0o3o3LLLLK2K3K3K2j8j8N4N6m9m8n0m9k1k1L1L2J9J8l4l5J9J8J9J8nonon8n9on
5475a91KKLKm4m4J0RK3K2O5Jm6O0O4%j5j5L4L4OOk6k6rrK3K3l4l4O1O0K1K2N3N3q7q7QPN0
5463E7M9J7J8l4l4o6o4L5L4l8l9m9m9MMllllnnM7M8P4P3k2k2o1o2k4k3oJ00J29O6l4l4l8l7
5451ck1k1k1k0p8p7J8J8j8j7j7j7K7K6K6K7j2j1j1j2k2k2J0RK3K3K3K3k5k5PPM8M7m8m8m2
5439b26m2L2L2L6L6l9l8R3R3L9M0K0K0j2j2k0j9n1n1J8J7j4j4NOo9o9l7l8N8N8llklj9j9j8
5427b15j9onK6K6O8O8L6L6%JL3L2n6n4k4k4M8M7M8M8n9n8noL2L3KJj5j4q2q2l1P6J04M2p2
5416b0p3lkOPL8L8k3k4n5n5J0J1J0J1j0j0j0j0K4K5K4K5NOOOK2K1K2K3j1j2o3o4m0m0J3J4
5403a58M5M5qqN3N2k1k0m8m9K6K6m0m0m1m0PPQ1Q1QRL9M0M2M2o5o4l7l9l8l8NONOKKKKN7N8
$$ plain form
5488 62 52 42 -21 -84 -81 -78 -75 -72 -50 -27 -4 18 0 -18 36 92 43 -5 -55 -104 -125 -146 -115 -83 -64 -46 -80 -115 -96 -78 -59 -41 -46 -52 -57 -63 -121 -180 -186 -191
5475 -191 -189 -187 -184 -182 -226 -270 -260 -251 -228 -206 -141 -140 -186 -126 -62 -62 -77 -92 -58 -24 -18 -12 -38 -64 -73 -82 -59 -36 -70 -104 -43 17 38 60 113 166 79 -8 0 7 57
5463 57 106 123 141 107 73 7 -57 -22 12 -26 -65 -114 -163 -159 -155 -158 -161 -164 -167 -172 -177 -130 -82 -8 65 43 21 -40 -102 -126 -149 -155 -55 74 140 106 72 34 -3
5451 -3 -24 -45 -66 -86 -164 -241 -223 -205 -223 -240 -257 -274 -247 -221 -195 -168 -180 -191 -202 -214 -236 -258 -248 -239 -216 -193 -170 -147 -172 -197 -190 -183 -135 -88 -136 -184 -226
5439 -226 -268 -236 -204 -168 -132 -171 -209 -116 -23 16 56 76 96 84 72 52 33 -18 -69 -51 -34 -48 -62 -57 -51 -120 -189 -226 -264 -206 -148 -151 -154 -156 -159 -178 -197 -215
5427 -215 -234 -240 -245 -219 -193 -125 -57 -21 15 15 16 49 81 25 -29 -53 -77 -29 18 66 114 55 -3 -8 -14 18 51 53 54 39 25 -57 -139 -170 -94 10 52 -20
5416 -20 -93 -96 -98 -92 -85 -47 -9 -32 -56 -111 -166 -156 -145 -135 -124 -134 -144 -154 -164 -140 -115 -91 -66 -61 -55 -49 -43 -21 0 22 45 34 22 -41 -105 -145 -185 -172 -158
5403 -158 -113 -68 -76 -84 -31 21 0 -20 -68 -117 -91 -65 -105 -145 -186 -226 -219 -212 -131 -50 -42 -33 6 46 88 130 65 1 -36 -75 -113 -151 -146 -140 -135 -129 -127 -125 -123 -121 -64 -6
5390fooJ6J5m7m8k9k9L4L5LLO6O7O9O8q0q0K7K7K7K7MMNMq5q5q5q6j0rR6R5%%j%m6m7K3J48
5377G8J09j8m5m4k0j9M4M4M3M3M3M3o2o1o2o2m2m1m2m1j9j9J4J3L5L5k9k9k2k1k2k2l9l9K5
5367b51K4K8K7nmppK5K5O6O6N7N8oj33o3o2L9L9PQl4l3L0L1P9Q0o9o7n1n0J3J3L9L8L9L7O3
5355H9O2m3m4m5m4m5m5M4M4M3M3P4P3l4l3o2o3JJl2l4l3l4J1J1J1J0j5j5j5j5K9K8llK9K8
5343b6l5l5J0J0M2M0j7j9j9j8O2O1kkPPPOk5k5OOpqN6N6k3k4k3k4O8O9l9l8n1n1J2J3J6J6
5331E9m8m7n8n8k7k6rqqrmnmnj3j4j4j4m8m8J5J6R3R4R4R4l5l5l4l5M4M4P6P6o5o3jjl4l4
5319i9kkk4k4k3k4j2j1j2j2QRMO8L7L7l3l2J1J2J6J5J3P7M4j9n6n7n7n7qN6Q7K4l2l3l7l7
5307a85o2o3J2J2L6L6l4l4j8M5N9N9J20N6J4J4K8l5mmjo5n7n7%O3K8K8M1M2j1j1k9k8J9K0
$$ plain form
5390 -6 -12 -18 -2 13 -34 -82 -111 -140 -106 -71 -68 -65 1 68 137 205 125 45 72 99 126 153 157 161 166 170 85 0 -85 -171 -181 -190 -94 1 1 1 0 0 -46 -93 -70 78
5377 78 187 169 124 80 60 41 85 129 172 215 258 301 239 178 116 54 12 -29 -71 -112 -131 -150 -136 -123 -88 -53 -82 -111 -133 -154 -176 -198 -237 -276 -251
5367 -251 -227 -199 -172 -177 -181 -188 -195 -170 -145 -79 -13 44 102 96 -37 -100 -162 -123 -84 -77 -69 -103 -136 -106 -75 4 84 15 -52 -103 -153 -140 -127 -88 -50 -11 26 89
5355 89 151 108 64 19 -25 -70 -115 -71 -27 16 59 133 206 172 139 77 14 15 16 -16 -50 -83 -117 -106 -95 -84 -74 -89 -104 -119 -134 -105 -77 -80 -83 -54 -26
5343 -26 -61 -96 -86 -76 -34 6 -11 -30 -49 -67 -5 56 54 52 59 66 73 79 54 29 35 41 34 26 82 138 115 91 68 44 112 181 142 104 53 2 14 27 43 59
5331 59 11 -36 -94 -152 -179 -205 -214 -222 -230 -239 -243 -248 -252 -257 -270 -284 -298 -312 -360 -408 -393 -377 -284 -190 -96 -2 -37 -72 -106 -141 -97 -53 23 99 34 -29 -30 -31 -65 -99
5319 -99 -101 -103 -127 -151 -174 -198 -210 -221 -233 -245 -237 -228 -224 -156 -119 -82 -115 -147 -136 -124 -108 -93 -80 -3 41 22 -34 -91 -148 -205 -213 -157 -70 -46 -78 -111 -148 -185
5307 -185 -247 -310 -298 -286 -250 -214 -248 -282 -300 -255 -196 -137 -17 39 53 67 95 60 56 52 51 -14 -71 -128 -128 -65 -37 -9 32 74 63 52 23 -5 14 34
5296C4M2k1n9o0l1l1KJL8L7OOM9N1Q6K3q1q1j1j0PPnp0p8j4K1K1K8K8K8K8k9k9K4K5J8J7j3
5283Dj3N9N9K8K8k9l0K4K4K0K0l4l3m0m0m0l9MLMLl8l9ooK2K2K2K2k3k2P2P3O6O6m7j55r0
5272g9J4M4M2M3M2l1l2j6j7m7m8qppp%%L2L2k6k7K6K7L4L3j03j03j5j5L8L8N8N8K6K6K2K3
5260G0n1n1m7m8K7K7J3J3j9j9O1N9j3j4l6l7nnL6L6j7j7j08j08j2R4J02L9j5j4n9n8n9n8P9
5249b14Q0P9P9K0J9r6r6l3l3K1Q4P7l0q3q2k0k0N5N5L6L6L5L5OOL8L8o1n9k9k9NOONk8k9k9
5238a50k8L0L0L0L1J6J7j6j5p8p8K8K9L2L2J%POOPnnmnRJ0k3k3nno8o9J4J5J4J4LLO6O7M2
5225a8M2J1J0rj0K2K2n7n5PQO1O3kjm0m1qqk1k2k2k2POn8n7N7N7K5K5j8j7J5J4M6M6j7j7j1
5212A3j1p4p4m0m0K4K5M0M0M0M0MMNMm1m1m1m0LLMLL1L1l2l3J0J0RJ0k3k3n5n4k8k8L6L6N5
$$ plain form
5296 34 76 55 -4 -64 -95 -126 -124 -123 -85 -48 -42 -36 13 64 150 173 92 11 0 -10 -3 4 -1 -71 -149 -163 -142 -121 -93 -65 -37 -9 -38 -67 -43 -18 0 17 4
5283 4 -9 50 109 137 165 136 106 130 154 174 194 160 127 87 47 7 -32 -28 -25 -21 -18 -56 -95 -101 -107 -85 -63 -41 -19 -42 -64 8 81 147 213 166 11 -79
5272 -79 -65 -21 21 64 106 75 43 27 10 -37 -85 -93 -100 -107 -114 -114 -114 -82 -50 -76 -103 -77 -50 -16 17 -86 -189 -204 -219 -181 -143 -85 -27 -1 25 47 70
5260 70 19 -32 -79 -127 -100 -73 -60 -47 -66 -85 -24 35 22 8 -28 -65 -70 -75 -39 -3 -20 -37 -145 -253 -265 -171 -69 -30 -45 -59 -118 -176 -235 -293 -214
5249 -214 -134 -55 24 44 63 -33 -129 -162 -195 -174 -90 -13 -43 -126 -208 -228 -248 -193 -138 -102 -66 -31 4 10 16 54 92 31 -28 -57 -86 -81 -75 -69 -64 -92 -121 -150
5238 -150 -178 -148 -118 -88 -57 -41 -24 -40 -55 -133 -211 -183 -154 -122 -90 -89 -89 -82 -76 -70 -63 -68 -73 -77 -82 -73 -63 -86 -109 -114 -119 -187 -256 -242 -227 -213 -199 -196 -193 -127 -60 -18
5225 -18 24 35 45 36 26 48 70 13 -42 -35 -27 34 97 95 94 54 13 5 -3 -24 -46 -68 -90 -83 -77 -135 -192 -135 -78 -53 -28 -46 -63 -48 -34 12 58 41 24 13
5212 13 2 -72 -146 -186 -226 -202 -177 -137 -97 -57 -17 -13 -9 -4 0 -41 -82 -123 -163 -160 -157 -153 -150 -119 -88 -120 -153 -143 -133 -124 -114 -137 -160 -215 -269 -297 -325 -289 -253 -198
5200a98N6K4K4opopR0Q9j7j6m5m5n4P4J2J3m4m4L5L4LLkkkkl9l9l9l8J1J2J1J2ONOOL8L7k6
5187g7k6PPQPM8M7M1M0J5j12m0m1j4j4j5j4j1j1j1j1OOONM3M3J0J1j0j1p4p4K6K6N7N8L7L6
5175B4k6k6j7j6j6j6J4J5J4J5J5J5J4J5qpqop6p5L0L1M8M7M8M8j9j8j9j9j4j4j4j5J6J7J5
5163A2J6lklkj7j6j7j7Q7Q7R6l1l2l2m0m0o0o0M6M4J4J3j8j8j2j2j2j3J7J6J5J7LLmlM5o0
5151Gl6K8j6j5j2j1JJKJk3k3k2k3K0K0K1K0j0j1j0j0lkO1O1M5M4j9j8l1l0KJj8k0n1n2n3n2
5139b36N3N3O2O2kkllllj5j5j5j5j1j1j1j1j1j1j1j0k0j9j9j9k0k0M3M3JJ%JM8M9j6j5J%J
5126a29%l0l1KJJ5J5J0J16J11l7r5r6ppN7N6%%l1l2J6J5J6J5N1N1j2j2k8k9LLQQn6n6n0n0
5114b19R9R8PQPOKKo0o1kkl3l4J5J5j7j7L5L4KLk3k2M2M2QPQQm6m7J7J8L9L9PPK6K7K7K7l8
$$ plain form
5200 -198 -142 -118 -94 -100 -107 -113 -120 -30 59 42 26 -19 -64 -118 -44 -32 -19 -63 -107 -72 -38 -35 -32 -34 -36 -38 -40 -79 -118 -157 -195 -184 -172 -161 -149 -143 -138 -132 -126 -88 -51 -77
5187 -77 -103 -96 -89 -81 -74 -26 21 62 102 117 5 -35 -76 -90 -104 -119 -133 -144 -155 -166 -177 -171 -165 -159 -154 -111 -68 -58 -47 -57 -68 -142 -216 -190 -164 -107 -49 -12 24
5175 24 -2 -28 -45 -61 -77 -93 -79 -64 -50 -35 -20 -5 9 24 16 9 1 -5 -81 -156 -126 -95 -47 0 48 96 77 59 40 21 7 -7 -21 -36 -20 -3 12
5163 12 28 25 23 20 18 1 -15 -32 -49 38 125 221 190 158 126 86 46 -14 -74 -28 16 30 43 25 7 -5 -17 -29 -42 -25 -9 6 23 26 29 25 22 67 7
5151 7 -29 -1 -17 -32 -44 -55 -54 -53 -51 -50 -73 -96 -118 -141 -121 -101 -80 -60 -70 -81 -91 -101 -104 -106 -45 16 61 105 86 68 37 7 9 10 -8 -28 -79 -131 -184 -236
5139 -236 -183 -130 -68 -6 -8 -10 -13 -16 -19 -22 -37 -52 -67 -82 -93 -104 -115 -126 -137 -148 -159 -169 -189 -208 -227 -246 -266 -286 -243 -200 -199 -198 -198 -197 -149 -100 -116 -131 -130 -130 -129
5126 -129 -129 -159 -190 -188 -187 -172 -157 -147 -31 80 43 -52 -148 -155 -162 -105 -49 -49 -49 -80 -112 -96 -81 -65 -50 1 52 40 28 0 -29 -26 -23 -15 -7 -63 -119 -169 -219
5114 -219 -120 -22 -15 -7 0 6 8 10 -50 -111 -113 -115 -148 -182 -167 -152 -169 -186 -151 -117 -115 -112 -135 -157 -115 -73 -65 -58 -50 -42 -88 -135 -118 -100 -61 -22 -15 -8 18 45 72 99 61
5100F1l8l7l8J8J8j4j4o0n9LML5L5k8k9J1J1J1J1kkkkK2K2K1K2k0j9k0k0L1L0L1L0m5m6m5
5089a13m6qrN5N6J7J7m6m7k2k3RJ0qqK4K4J4J5j7j8k1k2J0J0K0J9N2N1O8P0J6J7m1m0p3p1
5077e9OOL8L7L5L6MMj1j2j5j6l8j02j02l9J6J7K4K4kO1O1kj8j8k3k2J2J3J2J2l3l3o9nL7L7
5065a27qqj8M5O2O2l3l3l3l3J4J3k2M1L5L5POm5m6l3L1J7m6j0j0K3m0m0K3llNNJ6Q0M3M3O6
5053H1O7J3J3j5j6o4o5l5K7mo7k1k1k5k5k8k8PQn9NK2K2OOL8L8NNL6L7L7L7l6l6n4n4k0M4
5041a19J03L8K5K6O3O4n3n3mml6l6L9L8PPJ9J9j3j3l6l6q8q9l1l0K2K2J2J2P8P7R4l3p8p8
5030f5k6k6M9M8K0K1n3n4m9m9MML9L8j4j5m1m2L3L2n3n2M2M3N0M9N0M9NNNNl8l8l8l8L0L0
5018d0K9K9j7j7o3o3q2M5K6K7qqK4K4QQM0L9l7l7J5J5k1k2n4n4O0N9POJ3J3N1p3q7q8M3M3
$$ plain form
5100 61 23 -14 -52 -34 -16 -30 -44 -104 -163 -160 -156 -121 -86 -114 -143 -132 -121 -110 -99 -101 -103 -105 -107 -85 -63 -42 -20 -40 -59 -79 -99 -68 -38 -7 23 -22 -68 -113
5089 -113 -159 -167 -176 -121 -65 -48 -31 -77 -124 -146 -169 -160 -150 -158 -166 -142 -118 -104 -89 -106 -124 -145 -167 -157 -147 -127 -108 -56 -5 63 133 149 166 125 85 12 -59
5077 -59 -53 -47 -9 28 63 99 103 107 96 84 69 53 15 -87 -189 -228 -212 -195 -171 -147 -149 -88 -27 -29 -47 -65 -88 -110 -98 -85 -73 -61 -94 -127 -196 -201 -164 -127
5065 -127 -135 -143 -161 -116 -54 8 -25 -58 -91 -124 -110 -97 -119 -78 -43 -8 -1 5 -40 -86 -119 -88 -71 -117 -127 -137 -114 -154 -194 -171 -174 -177 -172 -167 -151 -71 -28 15 81
5053 81 148 161 174 159 143 79 14 -21 6 2 -65 -86 -107 -132 -157 -185 -213 -206 -198 -257 -252 -230 -208 -202 -196 -158 -120 -115 -110 -74 -37 0 37 1 -35 -89 -143 -163 -119
5041 -119 -16 22 47 73 136 200 147 94 90 86 50 14 53 91 98 105 124 143 130 117 81 45 -43 -132 -163 -193 -171 -149 -137 -125 -47 30 124 91 13 -65
5030 -65 -91 -117 -68 -20 0 21 -32 -86 -135 -184 -180 -176 -137 -99 -113 -128 -169 -211 -178 -146 -199 -251 -209 -166 -116 -67 -17 32 37 42 47 52 14 -24 -62 -100 -70 -40
5018 -40 -11 18 1 -16 -79 -142 -224 -179 -153 -126 -134 -142 -118 -94 -86 -78 -38 1 -36 -73 -58 -43 -64 -86 -140 -194 -134 -75 -68 -62 -49 -36 15 -58 -145 -233 -190 -147
5007a47L7L8n8n8l4l4kkM0M1M0M0K9L0K9K8kkn1n1j0N3J8J7K4K4j6M8M5j9p4p4L3L3q2q3J3
4995a39J4m0l9N6N7N3N1J4m9o3o4n9Mk3q7MO8O4%m6m5LMQPM0L9M4M3M4M2jjjk%jk9l0o4%N2
4982g2N2Qr9o7L9N8N8j2p6m8J5K9K9RRk3k3K2K3o8o9K5R0N3N2J3J2J2J2L0L1m5m4K3K3n2n0
4971b1J4J4l4l5pN7P3P4l0k9l8K6Mo0j11j12q2j9O9J33O5O4m6m8lll5l5L0L0K9L0j1j0M2M2
4959B7MMNMllp6p7k9k9k9l0J6J7j6j6O7O7J3J4J4J5J4J5M5M5ppj7j6o9o9k7k7NNl3l3M2M1
4947a34N2N1m4m4RRJ0RM4M4qqj9j9L5L3q8q9l6l6P9P8MMk5k4PPJ6J7J6J6L7L7L8L7J7J8n7
4935I3n7J3J3j9j9K5K5N6N7l5l5o7o5k1k1L3L1L5L5L5L5n3n3n2n3QQPQK2K0K1K1l4l3l5l4
4923h5j1j1j0j1KJn2n1QRJ04J04K9L1L0L0K4K4k9k9m9n0j6j8QRm0m1j2N2M8M7L0K9L0L0NN
$$ plain form
5007 -147 -110 -72 -130 -188 -222 -256 -258 -260 -220 -179 -139 -99 -70 -40 -11 17 15 13 -38 -89 -99 -46 -28 -11 13 37 21 69 114 95 21 -53 -20 13 -69 -152 -139
4995 -139 -125 -165 -204 -148 -91 -38 13 27 -22 -85 -149 -208 -204 -227 -314 -310 -242 -178 -178 -224 -269 -266 -262 -254 -247 -207 -168 -124 -81 -37 5 4 3 2 0 0 -1 -30 -60 -124 -124 -72
4982 -72 -20 -12 -111 -178 -139 -81 -23 -35 -111 -159 -144 -115 -86 -77 -68 -91 -114 -92 -69 -137 -206 -181 -91 -38 14 27 39 51 63 93 124 79 35 58 81 29 -21
4971 -21 -7 7 -27 -62 -69 -12 61 135 105 76 38 64 68 8 -103 -215 -297 -316 -247 -114 -49 15 -31 -79 -82 -85 -120 -155 -125 -95 -66 -36 -47 -57 -15 27
4959 27 31 35 40 44 41 38 -38 -115 -144 -173 -202 -232 -216 -199 -215 -231 -164 -97 -84 -70 -56 -41 -27 -12 33 78 71 64 47 31 -38 -107 -134 -161 -156 -151 -184 -217 -175 -134
4947 -134 -82 -31 -75 -119 -110 -101 -91 -82 -38 6 -2 -10 -29 -48 -13 20 -68 -157 -193 -229 -150 -72 -68 -64 -89 -113 -106 -99 -83 -66 -50 -34 3 40 78 115 132 150 93
4935 93 36 49 62 43 24 49 74 130 187 152 117 50 -15 -36 -57 -24 7 42 77 112 147 94 41 -11 -64 -56 -48 -41 -33 -11 9 30 51 17 -16 -51 -85
4923 -85 -96 -107 -117 -128 -126 -125 -177 -228 -220 -211 -107 -3 26 57 87 117 141 165 136 107 58 8 -8 -26 -18 -9 -49 -90 -102 -50 -2 45 75 104 134 164 169 174
4912A74MNj9j8RJ0k4q6r9j01L2R6M2k2n2n3J8J7Q7Q7L2l2p8j5kjooK5K5j6j6n6QJ1n3m4m5
4900a62j8j7j8j7J4J5J5J4j5j6n2J2O7O7P1P1J8J8j7p9n3J0KKo0o1k8k8jjN3N2L9L8L9L7J4
4888B5J4k5q8l1l2l1l2o0LK0K1N5N6J7m7LLP3P2RRo4o5K7K8k6k6jj%jKKKKJ18J19M5M4o4o4
4876A11j1j0p0o8K6K6O3O4j0j1k6k5k6k6J3J3O5O6k1k1J1J0J2J3o3o2PPL9L8kll5l4k3k3J0
4864B4Rm3m3N2N1m2m1m1m2l0l0K3K3K6K6N8N7N3N2k2k2qrm0m1l6l8noj2j3j2j2OPOOK8K7m0
4852i4m0n8M7P7J3N1N1k7k5j5j4J7J7j0j1%o3l0P6J18N5rp2rrn1n3k0k1oppoM7M7k4k3pN7
4840c8K5l8J0J0m7m6n2n1p9q0J9Q3M6M7J6J7J6J6k9k8l3L1L5L4k9k9J8J24P1l5o6o6l5K9Q1
4829e3Q1n1n3mmlmo6o6j3N1P3l4jkM5M6J14J16L2l2p0p0m1m2m6J8J0J0j5j4n0J2O6Lk5k5k9
$$ plain form
4912 174 178 183 164 146 155 165 141 55 -44 -145 -113 -17 25 3 -49 -102 -84 -67 20 107 139 107 29 14 12 11 5 -1 24 49 33 17 -39 -31 -20 -73 -117 -162
4900 -162 -180 -197 -215 -232 -218 -203 -188 -174 -189 -205 -257 -245 -178 -111 -40 31 49 67 50 -29 -82 -72 -70 -68 -128 -189 -217 -245 -246 -247 -194 -142 -103 -65 -26 11 25
4888 25 39 14 -74 -105 -137 -168 -200 -260 -257 -237 -216 -161 -105 -88 -135 -132 -129 -56 16 25 34 -30 -95 -68 -40 -66 -92 -93 -94 -94 -95 -93 -91 -89 -87 31 150 195 239 175 111
4876 111 100 90 20 -48 -22 4 67 131 121 110 84 59 33 7 20 33 98 164 143 122 133 143 155 168 105 43 50 57 96 134 132 129 94 60 37 14 24
4864 24 33 -10 -53 -1 50 8 -33 -74 -116 -146 -176 -153 -130 -104 -78 -20 37 90 142 120 98 90 81 41 0 -36 -74 -79 -85 -97 -110 -122 -134 -128 -121 -115 -109 -81 -54 -94
4852 -94 -134 -192 -145 -68 -55 -4 47 20 -5 -20 -34 -17 0 -10 -21 -21 -84 -114 -38 80 135 126 54 45 36 -15 -68 -88 -109 -115 -122 -129 -135 -88 -41 -65 -88 -95 -38
4840 -38 -13 -51 -41 -31 -78 -124 -176 -227 -306 -386 -367 -284 -238 -191 -175 -158 -142 -126 -155 -183 -216 -185 -150 -116 -145 -174 -156 -32 39 4 -62 -128 -163 -134 -53
4829 -53 28 -23 -76 -80 -84 -87 -91 -157 -223 -236 -185 -112 -146 -147 -149 -104 -58 56 172 204 172 102 32 -9 -51 -97 -79 -69 -59 -74 -88 -138 -126 -60 -57 -82 -107 -136
4817a36k9j%P0P0L9k2p7j3J9J8rj0J6J5M8M6L5L5o0o0m3m3N2N1K9K8J0n2r9j00k6k6J9Q3Q2
4806d1J9J6J4p9q0n5QQ5Q5L3k9r0r0J7J7P0P1M4M5qrj5j5j09j11QRQQp5p5M2M3L5L5O8O7k6
4794f0k6k7k6rj0K2K3K1K1j1j1RRRRJ5J4J5J3l2l4l4l4L5L6O6O7m1m0P5P6PPq8q7nonnJ3J3
4781a6j8j9JKJJj9j9J2J3m0m0J3J3P0O8nnj5j6j6j5j3j3j3j3N2N1R2l5p1p2nok6k7K7K6op
4769a08K6K5K8K8m6m6J0J0P5P7K1j05l4l5J4J4l9l9K2K3o9o9k5L8L5L5N7N6j7j8J3J4J3J3
4758cj0j0j0j0k1k1k1k1k1k1k1k1N0M9M9M9p0p0j1N4L6L6P1P2qqo2o0k2k1k2k1m0l9L5L5K2
4747a07K2j0j0K4K3On8n6n6pqm8m8PP1P8J4%JQRno8n6PK4Q8R3K9qp2m0K4N5N5K2l9m0K3k7
4735h0k8m6m6p7P1R8L4QQk8k8QQL6L6N6pk3k3oom6J8N4ro1o1K1Q4P6l0o9p1J9J9O1O0N7N8
$$ plain form
4817 -136 -165 -166 -166 -96 -26 13 -9 -86 -99 -80 -62 -71 -81 -65 -50 -2 44 79 114 54 -6 -49 -92 -40 11 40 68 78 26 -73 -173 -199 -225 -206 -123 -41
4806 -41 -22 -6 8 -71 -151 -206 -198 -113 -28 5 -24 -114 -204 -187 -170 -100 -29 15 60 52 43 28 13 -96 -207 -199 -190 -182 -174 -249 -324 -282 -239 -204 -169 -101 -34 -60
4794 -60 -86 -113 -139 -148 -158 -136 -113 -92 -71 -82 -93 -84 -75 -66 -57 -42 -28 -13 0 -32 -66 -100 -134 -99 -63 3 70 29 -11 64 140 147 154 66 -21 -26 -32 -37 -42 -29 -16
4781 -16 -34 -53 -52 -50 -49 -48 -67 -86 -74 -61 -101 -141 -128 -115 -45 23 18 13 -2 -18 -34 -49 -62 -75 -88 -101 -49 2 94 59 -12 -84 -89 -95 -121 -148 -121 -95 -101 -108
4769 -108 -82 -57 -29 -1 -47 -93 -83 -73 2 79 100 -5 -39 -74 -60 -46 -85 -124 -102 -79 -148 -217 -242 -204 -169 -134 -77 -21 -38 -56 -43 -29 -16 -3
4758 -3 -13 -23 -33 -43 -64 -85 -106 -127 -148 -169 -190 -211 -161 -112 -63 -14 -84 -154 -165 -111 -75 -39 32 104 96 88 26 -34 -56 -77 -99 -120 -160 -199 -164 -129 -107
4747 -107 -85 -95 -105 -81 -58 -52 -110 -166 -222 -229 -237 -285 -333 -326 -255 -177 -163 -163 -162 -154 -145 -150 -218 -274 -267 -243 -155 -62 -33 -41 -113 -153 -129 -74 -19 3 -36 -76 -53 -80
4735 -80 -108 -154 -200 -277 -206 -108 -74 -66 -58 -86 -114 -106 -98 -62 -26 30 23 0 -23 -29 -35 -81 -63 -9 -18 -79 -140 -119 -35 41 11 -58 -129 -110 -91 -30 30 87 145
4722A45n1j13j37l2K9L0L6L6l1l0l1l1Q0P9ONk4k3p6p7P0O9m7m8l4l4M0M0K3K3K4K3j7j6L6
4712e8L7QRo6o6POOPk0j9J2J2Q1Q0K8K8J8J8J8J8j3j2m4m5mnn6n8qqqpk5k4K8K9pql9l9Q4
4699a05Q3Q3Q4p3p2k0j9P1P3m5j07j17j0M2M3K2K3j0rj8j8J4J3J5J5j6j7opM7M6MMo9p0j3
4687a39j3m4m5K3K3rrL9L8O6O6m4j09p9K7N0N1N6N6LLLLl6l8K6K6K7K9K9K8q5q4k2k1onK6
4676i0K6J4J4j7j8k2k3J0RP0O9l6l5q5q5JJ06R6L3J2J2m0l9m0m0J8J7J7J8J9J8J9K0n6n6k5
4664h9k5M3M2k1k1ppN7N6O8O7l8l9n7n7POL6L8k7k6K0K1j2j1l1l2L1L1Q7Q8j9j9m1m2K3K2
4653A22j00r9j00j00KKO6O6j3j4N0N0P3P5J1J1l2l2%jllmlJ4J4J4J4m3m2l9l9n4J0L7L8J2
4641d0J3k0j9j%L2L1LJk4k6j9M5J03kj01l9K4K5M7M9M4o2j30j32M9M9k4q7n5QK8K7L2L1l7
$$ plain form
4722 145 94 -19 -156 -188 -159 -129 -93 -57 -88 -118 -149 -180 -100 -21 -15 -10 -34 -57 -133 -210 -140 -71 -118 -166 -200 -234 -194 -154 -131 -108 -84 -61 -78 -94 -58
4712 -58 -21 -13 -4 -70 -136 -129 -123 -117 -110 -130 -149 -137 -125 -44 36 64 92 110 128 146 164 151 139 95 50 46 41 -15 -73 -81 -89 -97 -104 -129 -153 -125 -96 -103 -111 -150 -189 -105
4699 -105 -22 61 145 72 0 -20 -39 32 105 60 -47 -164 -174 -132 -89 -67 -44 -54 -63 -81 -99 -85 -72 -57 -42 -58 -75 -81 -88 -41 5 9 13 -56 -126 -139
4687 -139 -152 -196 -241 -218 -195 -204 -213 -174 -136 -70 -4 -48 -157 -236 -209 -159 -108 -52 4 7 10 13 16 -20 -58 -32 -6 21 50 79 107 22 -62 -84 -105 -111 -116 -90
4676 -90 -64 -50 -36 -53 -71 -93 -116 -106 -97 -27 42 6 -29 -114 -199 -198 -92 4 37 49 61 21 -18 -58 -98 -80 -63 -46 -28 -9 9 28 48 -8 -64 -89
4664 -89 -114 -71 -29 -50 -71 -78 -85 -28 28 96 163 125 86 29 -28 -21 -15 21 59 32 6 26 47 35 24 -7 -39 -8 23 110 198 179 160 119 77 100 122
4653 122 22 -77 -177 -277 -275 -273 -207 -141 -154 -168 -118 -68 5 80 91 102 70 38 38 37 34 31 27 24 38 52 66 80 37 -5 -44 -83 -137 -127 -90 -52 -40
4641 -40 -27 -47 -66 -67 -67 -35 -4 -1 0 -24 -50 -69 -24 79 77 -24 -63 -39 -14 33 82 126 64 -66 -198 -149 -100 -124 -211 -266 -258 -230 -203 -171 -140 -177
4630a77l7K6K6M9M8j8q2J7Q1P2P3j5j5p8p9l4l4On7n4J0L4L4kkR8L4ooj0j0J8J7j0p4m2m1
4619b40K1Q4Q0J5K0K0J3m7n3J1J02M0o9o9J2J2J3J2k5k5OPJ8J8m6m5M6M6k4q8l4l3L3R7K6
4608d6K6L0L0N5N4rj0l7l8l7l7j2j2j3j2K3K4K2K4p2p4K2K3K4K4N5N6o9o9NNj8j8j8j8J0J1
4597i6J0J1L5L6L5L5nmnnM2M3n4n3o6o7j4j4J5J6l8l8k0k1P6P5Q4Q6l1l1J1J1k0k1K0J9j2
4585D5j2k2k1RRKLLKj0j0j1j0m1m1J2J3L4L5LLk0k0k0k0m7m8O9O9jjjjJKL4L2k0k0k0k1J2
4572d6J1J1J2L5L6l8l7r4r5k0k0m0m0L4L4M4M3l1l1O8O8J5J5llN1M9K3K3K3K4j09j08QQn1
4561a31n1j9k0J4J3M5M5N1N2N0N1MMk8k8o0o1J4J3j7j7j7j8k7k6k7k7k2k1L1L2L6L7l7l8j6
4550b16j6j7j6K9K9K8K9Q0P8K6K6J8J7l5l6k2k2N1N2O8O7k8k9o6o6o5o7LKL4L4LLKLqrrqJ2
$$ plain form
4630 -177 -214 -188 -162 -113 -65 -83 -165 -148 -67 5 78 63 48 -30 -109 -143 -177 -171 -228 -282 -272 -238 -204 -206 -208 -110 -76 -82 -88 -98 -108 -90 -73 -83 -157 -199 -240
4619 -240 -219 -135 -55 -40 -20 0 13 -34 -87 -76 26 66 -3 -72 -60 -48 -35 -23 -48 -73 -67 -60 -42 -24 -70 -115 -69 -23 -47 -135 -169 -202 -169 -72 -46
4608 -46 -20 10 40 95 149 140 130 93 55 18 -19 -31 -43 -56 -68 -45 -21 1 25 -47 -121 -99 -76 -52 -28 27 83 14 -55 -50 -45 -63 -81 -99 -117 -107 -96
4597 -96 -86 -75 -40 -4 31 66 61 57 52 47 89 132 78 25 -41 -108 -122 -136 -121 -105 -143 -181 -201 -222 -146 -71 13 99 68 37 48 59 39 18 38 57 45
4585 45 33 11 -10 -1 8 10 13 16 18 8 -2 -13 -23 -64 -105 -93 -80 -46 -11 -8 -5 -25 -45 -65 -85 -132 -180 -111 -42 -43 -44 -45 -46 -45 -43 -9 23 3 -17 -37 -58 -46
4572 -46 -35 -24 -12 23 59 21 -16 -110 -205 -225 -245 -285 -325 -291 -257 -213 -170 -201 -232 -164 -96 -81 -66 -69 -72 -21 28 51 74 97 121 12 -96 -88 -80 -131
4561 -131 -182 -201 -221 -207 -194 -149 -104 -53 -1 49 100 104 108 80 52 -8 -69 -55 -42 -59 -76 -93 -111 -138 -164 -191 -218 -240 -261 -230 -198 -162 -125 -162 -200 -216
4550 -216 -232 -249 -265 -236 -207 -179 -150 -70 8 34 60 78 95 60 24 2 -20 31 83 151 218 190 161 95 29 -36 -103 -100 -98 -64 -30 -27 -24 -22 -19 -27 -36 -45 -53 -41
4537d1J3o2o2M9N0J7J7l8l9L6L6L3L4j8j9l0l0K2K2l8l8ooRQM1M0m5m4j3j2N3N4N3N4l4l4
4526C2l2l4o6o6RQN2N2j2j2k9k9LLK2K2K1K2J6J6J5J5J8J8J8J8l1l1L2L3l4l4l4l3k7k6k6
4514a11k6qqN6N6j6j6M8M7n1n2n2n2N3N3J16J16L5L4k9l0n3n3J0J1M5M5j9j9o7o6lmj%l3l3
4503g7J7J7j5j4L7L6O8O9k6k6n8n7j8j9k5k5N2n5l1L2ONn4n4KKL4L4L7L7p0o9M4M5M4M4O5
4491C4O7q3q1l7l6K7K7K6K7nok8k9k8k9L7L6L6L7mlmlk1k0k0k0kjkkJ7J6N2j1m4m3q4j9L0
4479a96L0L3L4o3o3M6J09N2j1l6l6J1J1n3n2onJ6P9P3l4l8K6PPJ1J2j6j6j6j6ppN3N3J5m6
4467c9m3m3K3K4l6l6RP3M1k3o1o1Q4Q3k5k4k1k1N7J20N3j1n9j22r1k7K3Q6R0K7m6m4m3m3o
4457a32R9P5J2M1M1L7L7NNJ%l5r8n9n8l0L4L3k9n1n2k4k3L7L6k6k7klkkK2K3J8J9j4p7p7j3
$$ plain form
4537 -41 -28 -90 -152 -103 -53 -36 -19 -57 -96 -60 -24 9 43 25 6 -24 -54 -32 -10 -48 -86 -92 -98 -89 -81 -40 0 -45 -89 -102 -114 -61 -7 46 100 66 32
4526 32 0 -34 -100 -166 -157 -149 -97 -45 -57 -69 -98 -127 -124 -121 -99 -77 -56 -34 -18 -2 13 28 46 64 82 100 69 38 70 103 69 35 1 -32 -59 -85 -111
4514 -111 -137 -145 -153 -97 -41 -57 -73 -25 22 -29 -81 -133 -185 -132 -79 37 153 188 222 193 163 110 57 67 78 123 168 149 130 63 -3 -6 -10 -11 -11 -44 -77
4503 -77 -60 -43 -58 -72 -35 1 69 138 112 86 28 -29 -47 -66 -91 -116 -64 -119 -150 -118 -112 -107 -161 -215 -213 -211 -177 -143 -106 -69 -139 -208 -164 -119 -75 -31 34
4491 34 101 18 -63 -100 -136 -109 -82 -56 -29 -34 -40 -68 -97 -125 -154 -117 -81 -45 -8 -12 -15 -19 -22 -43 -63 -83 -103 -105 -106 -108 -110 -93 -77 -25 -36 -80 -123 -207 -226 -196
4479 -196 -166 -133 -99 -162 -225 -179 -70 -18 -29 -65 -101 -90 -79 -132 -184 -190 -195 -179 -100 -27 -61 -99 -73 -66 -59 -48 -36 -52 -68 -84 -100 -107 -114 -61 -8 7 -39
4467 -39 -82 -125 -102 -78 -114 -150 -141 -68 -27 -50 -111 -172 -88 -5 -30 -54 -75 -96 -39 81 134 123 64 -58 -149 -176 -153 -67 23 50 4 -40 -83 -126 -132
4457 -132 -33 42 54 95 136 173 210 215 220 221 221 186 88 29 -29 -59 -25 8 -21 -72 -124 -148 -171 -134 -98 -124 -151 -153 -156 -158 -160 -138 -115 -97 -78 -92 -169 -246 -259
4445b59PPJ1J1K9K9llK1K0N7qk4k4K5K6N9N9k1q4m3m3j6j5qpqqO3O2O3O1K0K0l4l3k8k9K5
4432b3K3k0k2J1P3N4n3k0k1l4l5l5l5J3J3n7n7M5J09L9k6%O3K8l5q2q2j1j2J8J7N0M9J6J5
4422b4O1O2K5q1q0K5P0P1Kj03j36p3JJQ4Q3P0Pm0K3j6j6K4K4pqj6j5j2j0p4j0M3k0OOKKN1
4409BN2K0K0N8N8p6p6q2j9kkM4M3K8l7k6k5M3M4k2k3k2k3k6k6OOk0k1L3L3l3l3o4o5M2M2M2
4398a07M2L4L4KLomonJ1J1k0k0lkM9N1K1K1n3n3l7l8J5J5J4J3J3J2PPq7q9OOk6k7j4j4Q1Q1
4385f2MLk8k9Q2Q0j4j3K3K4rqk1k2n2n4L2L1O2O3m2m2m8j14p5P4P5J1j1j1j6j5N9N9N9N9m0
4374G4m0l8m0m9n0K5K5M1M1RQL7L8L7L7qrm0m1p7p9nmJ1J1m1m2j0j0Q5Q6l1l0l1l1ONL8L7
4361e5K4K3l0k9m0m0J3J4O1O1j2j2K5K6K5K6L8L8j5j6j8j8j8j9m4m3j2j3l3l3K0K0rj0o2o2
$$ plain form
4445 -259 -252 -245 -234 -223 -194 -165 -168 -171 -150 -130 -73 -81 -105 -129 -104 -78 -19 40 19 -65 -108 -151 -167 -182 -190 -197 -205 -213 -150 -88 -25 36 56 76 42 9 -19 -48 -23
4432 -23 0 -20 -42 -31 42 96 43 23 2 -32 -67 -102 -137 -124 -111 -168 -225 -180 -71 -32 -58 -58 5 33 -2 -84 -166 -177 -189 -171 -154 -104 -55 -39 -24
4422 -24 37 99 124 43 -37 -12 58 129 131 28 -108 -181 -180 -179 -95 -12 58 65 25 48 32 16 40 64 57 49 33 18 6 -4 -78 -88 -45 -65 -59 -53 -51 -49 2
4409 2 54 74 94 152 210 134 58 -24 -43 -45 -47 -3 40 68 31 5 -20 23 67 45 22 0 -23 -49 -75 -69 -63 -83 -104 -71 -38 -71 -104 -168 -233 -191 -149 -107
4398 -107 -65 -31 3 5 8 2 -2 -8 -13 -2 9 -11 -31 -34 -36 13 64 85 106 53 0 -37 -75 -60 -45 -31 -18 -5 7 14 21 -66 -155 -149 -143 -169 -196 -210 -224 -143 -62
4385 -62 -58 -55 -83 -112 -30 50 36 23 46 70 61 53 32 10 -42 -96 -64 -33 29 92 50 8 -40 -154 -229 -155 -80 -69 -80 -91 -107 -122 -63 -4 55 114 74
4374 74 34 -4 -44 -93 -143 -118 -93 -52 -11 -2 6 43 81 118 155 147 138 98 57 -20 -99 -104 -108 -97 -86 -127 -169 -179 -189 -104 -18 -49 -79 -110 -141 -135 -130 -92 -55
4361 -55 -31 -8 -38 -67 -107 -147 -134 -120 -59 2 -10 -22 3 29 54 80 118 156 141 125 107 89 71 52 8 -35 -47 -60 -93 -126 -106 -86 -95 -105 -167 -229
4350b29M0M0RQM9M8k6k6JKL3L3N2N3o4o3q7q7QQJ3J4J3J4M9M9M8N0O9O9k6k7n7n7L9L9L1L0
4338A62k2k2K3K4qqM0L9l4l5o9o8NOM4M5M5M5o1o0r2r2llklL4L4L4L3k3k2QQL2L2m2m2k5k6
4326f9k6k6o6o6J4P9Q6Q5N8nj9Q8K0K0K2m2r5l1m1m2jkk7L8L7k6k8k8%%m8m8NONOOOL1L1N9
4313c4N8J6m7j1j2mmlmkkL0K9M2M2j1j1o1o0r7l3j1j2K5K5M5M5K8l6n1n0j6j6n7M8O1lm6J7
4301a83L0L0L4L4jo5j0N4N1j4q1q1k9L4K2m1nN8jjMLR7R5J9J8m4j06l4L1PPJ1J1N0N2P8P9
4289B13On7n4n4j4j5j4j3QJ0RJ0k9k8LLqpppj8j7j8j8J7J7M4M4oo9p8N0Q2J7K7R0L2L3j6j7
4277A51n1n1n0n1M3M2j1j0n6n8L8L8M7M8j8j9PJ35J15J16Q7Q8O1J88L13N26Q60J497K726L872
4268A0623Q84l492l311j826r33o36m79k66j59r5rrp9p9j%l3l2m7m6K6K8R3R3J9J9o2o1o2o1
$$ plain form
4350 -229 -189 -149 -140 -132 -83 -35 -61 -87 -86 -84 -51 -18 34 87 23 -40 -127 -214 -206 -198 -185 -171 -158 -144 -95 -46 2 52 121 190 164 137 80 23 62 101 132 162
4338 162 140 118 141 165 157 149 189 228 194 159 90 22 27 33 77 122 167 212 151 91 -1 -93 -96 -99 -101 -104 -70 -36 -2 31 8 -14 -6 2 34 66 24 -18 -43 -69
4326 -69 -95 -121 -187 -253 -239 -160 -74 11 69 64 45 133 153 173 195 153 58 27 -14 -56 -57 -59 -86 -48 -11 -37 -65 -93 -93 -93 -141 -189 -184 -178 -173 -167 -161 -155 -124 -93 -34
4313 -34 24 40 -7 -18 -30 -34 -38 -41 -45 -47 -49 -19 10 52 94 83 72 11 -49 -146 -179 -190 -202 -177 -152 -107 -62 -34 -70 -121 -171 -187 -203 -260 -212 -151 -154 -200 -183
4301 -183 -153 -123 -89 -55 -56 -121 -131 -77 -26 -40 -121 -202 -231 -197 -175 -216 -221 -163 -164 -165 -161 -158 -61 34 53 71 27 -79 -113 -82 -75 -68 -57 -46 4 56 134 213
4289 213 219 162 108 54 40 25 11 -2 6 16 25 35 6 -22 -19 -16 -24 -31 -38 -45 -63 -80 -98 -116 -99 -82 -38 6 0 -69 -147 -97 -15 2 29 119 151 184 168 151
4277 151 100 49 -1 -52 -9 33 22 12 -44 -102 -64 -26 21 69 51 32 39 174 289 405 492 580 641 829 1142 1668 2528 4025 6751 10623
4268 10623 11507 8015 4704 2878 1945 1309 830 564 405 310 301 292 213 134 133 133 100 68 21 -25 1 29 122 215 234 253 191 130 68 7
4258Gk9l0K3K3K3K5K4K5K5K6N8N7n3n4n3n3m3m2m3m3j5j6m7m7J3J3M5M5JJKJL5L5L5L5J8J9
4247D6j3j3k6k6k6k7QRO1O0k6k6k5k6J6J7J6J6N2N3m3m4J1J1M2M3K0K0p6p5q4q6L2L1J5J5
4235d8J5J5J6J4j9k0m4j09n7M8O4O5J7J8nop9q0kjkjO9O9O8O8m0l8m0m0l5l5l5l5K4K4K4K4
4224a29R8R8j9j9LMk9k8m4m5L0L0J5J4o0n9J8J7J8J8ooq0q0K4K4K5K4o9o9j6j6L0K9O2O2p5
4212b06p6k2k2O9O9onJ48J48J0J1l5l4llLKr2r3j5j5J7J7mmmmJ1J1O4O3n1n3K3K2N3N2k1k1
4200DL0L0jkn0m9n0n0L4L5KLJ1J2M3M3QRQQn9n8noj4j3O1O0K4K3qrkll4l4QQPQm7m9O7O9l9
4186C3l7p0p0NNN9N9RQO2O2J9J8Q3k4p5j2L9k5q8k4J0J0m4m4L0K9j7j7L4L5o2o0L3L3J9J9
4175D4n4n5KKL4L3J4J4j8j7J7J9j0rmN9L1p6p0p0m6m5O7O6J4J4M0L9M1M0J5J6J5J5m1m1rq
$$ plain form
4258 7 -22 -52 -29 -6 17 42 66 91 116 142 200 257 204 150 97 44 1 -41 -84 -127 -142 -158 -205 -252 -239 -226 -181 -136 -135 -134 -132 -131 -96 -61 -26 9 27 46
4247 46 33 20 -6 -32 -58 -85 -77 -68 -7 53 27 1 -24 -50 -34 -17 -1 15 67 120 77 33 44 55 97 140 160 180 104 29 -55 -141 -109 -78 -63 -48
4235 -48 -33 -18 -2 12 -7 -27 -71 -180 -237 -189 -125 -60 -43 -25 -30 -36 -115 -195 -197 -198 -200 -201 -132 -63 5 73 33 -5 -45 -85 -120 -155 -190 -225 -201 -177 -153 -129
4224 -129 -31 67 48 29 32 36 7 -21 -65 -110 -80 -50 -35 -21 -81 -140 -122 -105 -87 -69 -75 -81 -161 -241 -217 -193 -168 -144 -213 -282 -298 -314 -284 -255 -193 -131 -206
4212 -206 -282 -304 -326 -257 -188 -194 -199 -51 97 107 118 83 49 46 43 46 48 -44 -137 -152 -167 -150 -133 -137 -141 -145 -149 -138 -127 -63 0 -51 -104 -81 -59 -6 46 25 4
4200 4 34 64 63 61 11 -38 -88 -138 -104 -69 -67 -64 -53 -41 2 45 53 62 70 78 19 -39 -44 -50 -64 -77 -16 44 68 91 83 74 72 69 35 1 9 17 24 32 -15 -64 3 72 33
4186 33 -4 -74 -144 -139 -134 -75 -16 -7 1 63 125 144 162 245 221 146 134 173 148 60 36 46 56 12 -32 -2 27 10 -7 27 62 0 -60 -27 6 25 44
4175 44 -10 -65 -63 -61 -27 6 20 34 16 -1 16 35 25 16 12 71 102 26 -44 -114 -160 -205 -138 -72 -58 -44 -4 35 76 116 131 147 162 177 136 95 86 78
4163G8k7k7k6k7rrj0rj0rO5O4o1o1k9l0j4j4j4j5N2N2m3m4J01R9NNMNm8m8jjR4R5K5K6m9m8
4151H7j9j9j9j8N8N7j6j6q0p8m8m8M1M1l3l4j1j2M2M1j3j3j4j3N1N2J9J8m4m5QQJ6J6J6J7
4139eJKJJNNNNm0m1J3J2J9J8j2j3K5K6K6K5k6k7k3k1nN9Q3k3n9n8RRj1j2M1M2K6K7onJ6J6
4126A30J6J6r3r1r3r3LLL5L5M2M3j1j1M8M7k6k5n7n8N9N8K6K7m6m8KKJKKJKJK0K0J9K0%%%
4114B8%l9m0l9m0k5k5k5k5K6K6K5K6l1l1l1l2L0L0L0L0L7L7L8L6lll3l5o7o7P1P1K4K3n1n1
4102a05J5J5O8O8l8l7J4J5n0n1LKj1j1j1j1J7J8J8J8l9l8l8l8J2J2J1J2M8M9M8M7J6J5l7l6
4091a0l0k9l0k9m2m2P5P4Q3Q4L1L1m4m5m4m4m0l9m0m0RJ0RJ0K3K3K3K2MMMMK7K7k5k4NOL7
4079B8L8mll5l5r5r6K1K1K5K5N7N6J7J7l7l5l3l3M2M1LLLL%jn3n3k6k5POM2M1j2j2l9l9pp
$$ plain form
4163 78 51 24 -2 -29 -38 -47 -57 -66 -76 -85 -20 44 -17 -78 -107 -137 -151 -165 -179 -194 -142 -90 -133 -177 -76 23 28 33 37 42 -6 -54 -55 -56 38 133 158 184 135 87
4151 87 68 49 30 12 70 127 111 95 15 -63 -111 -159 -118 -77 -110 -144 -155 -167 -125 -84 -97 -110 -124 -137 -86 -34 -15 3 -41 -86 -78 -70 -54 -38 -22 -5
4139 -5 -4 -2 -1 0 5 10 15 20 -20 -61 -48 -36 -17 1 -11 -24 1 27 53 78 52 25 2 -19 -24 35 118 95 36 -22 -13 -4 -15 -27 14 56 82 109 103 98 114 130
4126 130 146 162 69 -22 -115 -208 -205 -202 -167 -132 -90 -47 -58 -69 -21 26 0 -25 -82 -140 -81 -23 3 30 -16 -64 -62 -60 -59 -57 -55 -54 -52 -51 -31 -11 8 28 28 28 28
4114 28 28 -11 -51 -90 -130 -155 -180 -205 -230 -204 -178 -153 -127 -158 -189 -220 -252 -222 -192 -162 -132 -95 -58 -20 16 13 10 -23 -58 -125 -192 -121 -50 -26 -3 -54 -105
4102 -105 -90 -75 -7 61 23 -14 0 15 -35 -86 -83 -81 -92 -103 -114 -125 -108 -90 -72 -54 -93 -131 -169 -207 -195 -183 -172 -160 -112 -63 -15 32 48 63 26 -10
4091 -10 -40 -69 -99 -128 -170 -212 -137 -63 20 104 135 166 122 77 33 -11 -51 -90 -130 -170 -161 -151 -142 -132 -109 -86 -63 -41 -37 -33 -29 -25 2 29 4 -20 -15 -9 28
4079 28 66 62 59 24 -11 -106 -202 -181 -160 -135 -110 -53 3 20 37 0 -35 -68 -101 -59 -18 -15 -12 -9 -6 -6 -7 -60 -113 -139 -164 -157 -151 -109 -68 -80 -92 -131 -170 -177 -184
4066a84L3L2O5O3M0L9j5j4k2k2k1k2J8J7J8J7k9k8k9l0m0m0J3J3K2K2K3K2l0k9M4M5j2j1K0
4055a2J9l9m0J3J3L7L6n7n9K7K6onqqM4M4k5k3OPk5k6M5M4J1n1j7j7llK4K5K6l6j01l7PQJ5
4043a21J6q0j6N4N5L4L4k9k9L7L7P1J0r1r1k3q7m6J8M2M2N5N5rrN5N5j1p4q3j9NNMNJ06J05
4031H2K2m1o9o9J3J3j8j9L2L1l3l2K0K0j6M8N4N5L0l3q1q0j5M9N6N6L3l1o0n9%%k2k2n7OO8
4020f9O8M3j9j08j09lO0O7Lj6j6MO9R1j4q0q1k0k0L6J00O7Nl5l4l5l5RP2P2Qnnjo5q2j9M3
4008e4M4O7NL7L7m0j03j04m0M9N0M7M5j6j21n6n7k5Q0R3K9p8j5J0RO0N9lmm0m1m1m1L2L1L2
3997f3L1l4l3L0L0k1k0j7j7k3M0M1k3j2j1j6j5l5l5l2l1k5M0O2O3J8m6j0j0N9O0nno9o9nn
3986b13j6j5J6J6L4L4l0k9RQn4n5MML6L6N9N8R5K9K7K8jo4j02l9O9O9J5J6PP1M3k1j3j3J3
$$ plain form
4066 -184 -151 -119 -54 9 49 88 73 59 37 15 -6 -28 -10 7 25 42 13 -15 -44 -74 -114 -154 -141 -128 -106 -84 -61 -39 -69 -98 -54 -9 -21 -32 -12
4055 -12 7 -32 -72 -59 -46 -9 27 -30 -89 -62 -36 -42 -47 -55 -63 -19 25 0 -23 -17 -10 -35 -61 -16 28 39 -12 -29 -46 -49 -52 -28 -3 23 -13 -114 -151 -144 -136 -121
4043 -121 -105 -185 -201 -147 -92 -58 -24 -53 -82 -45 -8 63 73 -18 -109 -132 -219 -265 -247 -205 -163 -108 -53 -62 -71 -16 39 28 -46 -129 -148 -143 -138 -134 -129 -23 82
4031 82 104 63 -6 -75 -62 -49 -67 -86 -54 -23 -56 -88 -68 -48 -64 -16 38 93 123 90 9 -71 -86 -37 19 75 108 77 17 -42 -42 -42 -64 -86 -143 -137 -69
4020 -69 -1 42 23 -85 -194 -197 -137 -70 -67 -83 -99 -95 -26 65 51 -29 -110 -130 -150 -114 -14 53 58 23 -11 -46 -81 -72 0 72 80 75 70 69 4 -78 -97 -54
4008 -54 -10 57 62 99 136 96 -7 -111 -151 -102 -52 -5 40 24 -97 -153 -210 -235 -155 -62 -33 -111 -126 -116 -107 -47 12 9 5 -35 -76 -117 -158 -126 -95 -63
3997 -63 -32 -66 -99 -69 -39 -60 -80 -97 -114 -137 -97 -56 -79 -91 -102 -118 -133 -168 -203 -235 -266 -291 -251 -189 -126 -108 -154 -164 -174 -115 -55 -60 -65 -134 -203 -208 -213
3986 -213 -229 -244 -228 -212 -178 -144 -174 -203 -194 -186 -240 -295 -291 -287 -251 -215 -156 -98 -3 26 53 81 80 16 -86 -125 -56 13 28 44 51 122 165 144 131 118 131
3974A31J4M9j4L5L5Qn6r7l2rqk6k6k5k6k7k7L7L6JJo3o3m7m7J7J7K5K5Q9Q9l6l6nmM7M7j01
3962g2j01J0RM2M1qqm0m1J5J5j7j7l8l8K6K5L9L8L8L8%%%jL8L7L7L8J0J0k2k2o5o4kjM5M4
3950C8o1o1p3p4rj0O5O4O5O4K6K6l8l6j4j4M8N0K0K0j2j2qqqqOOJ12J12Q8Q7R4K20M31O42
3939A838J009J816L167L465n49l650k699j552r16o18m21k93j49q5K5K5p7p8j05j06M3M2OO
3932A44n8n8l1l2K3K3N9o9o4jK6K6K9L0k3k2k2k2poj0j1M3k1k1M3J7J7N7pk4k5k7k8n2n2k5
3920a81k4L9k4m9m9K8R2L1l2l9K5J6J7j4j4N0M9PPOPn4n4J0J0PPL1R5O5Kk8r1n1n0M8M8j5
3908g2p9j11m7j3j3N5N5M9M9J7J7j%o0o0k8L7L3L3M9M9N2j0k7k7MMn8PKKm6m7J8J7l0l0JK
3896b07P4P4M6j8l0l1L0K9m1m0m1m0L7L7O9O7llN6N6K4m0mml1l0l1k9m4m4j2j2O7O6J2J3l6
$$ plain form
3974 131 145 194 180 215 250 258 202 105 73 64 56 30 4 -21 -47 -74 -101 -64 -28 -27 -26 -89 -152 -199 -246 -229 -212 -187 -162 -73 16 -20 -56 -61 -65 -18 29 -72
3962 -72 -173 -163 -154 -112 -71 -79 -87 -127 -168 -153 -138 -155 -172 -210 -248 -222 -197 -158 -120 -82 -44 -44 -44 -44 -45 -7 30 67 105 115 125 103 81 16 -48 -50 -51 -6 38
3950 38 -23 -84 -157 -231 -240 -250 -185 -121 -56 8 34 60 22 -14 -28 -42 6 56 76 96 84 72 64 56 48 40 46 52 164 276 364 451 545 765 1196 1838
3939 1838 2847 4663 7830 11295 10746 7096 4397 2845 1929 1311 890 597 448 363 388 413 336 258 153 47 90 132 138 144
3932 144 86 28 -3 -35 -12 11 70 1 -63 -64 -38 -12 17 47 24 2 -20 -42 -49 -55 -65 -76 -33 -54 -75 -32 -15 2 59 52 28 3 -24 -52 -104 -156 -181
3920 -181 -205 -166 -190 -239 -288 -260 -168 -137 -169 -208 -183 -167 -150 -164 -178 -128 -79 -72 -65 -59 -52 -106 -160 -150 -140 -133 -126 -95 0 65 67 39 -52 -103 -153 -105 -57 -72
3908 -72 -151 -262 -309 -322 -335 -280 -225 -176 -127 -110 -93 -94 -94 -154 -214 -242 -205 -172 -139 -90 -41 11 1 -26 -53 -49 -45 -103 -96 -94 -92 -138 -185 -167 -150 -180 -210 -209 -207
3896 -207 -133 -59 -13 -31 -61 -92 -62 -33 -74 -114 -155 -195 -158 -121 -52 15 12 9 65 121 145 105 101 97 66 36 5 -24 -68 -112 -124 -136 -69 -3 9 22 -14
3885a4l7J6J6j3j4Q2Q2L7L7KJk9r3o8L9M3j9n2n1K1K0l2l2n0m9j17j18o0M5Q2Q1K2K1K2K2
3874a57Q5Q5Q6Q6n0n0n0m9K8L0k4k2nnnnLKn0n0j3j3M0M0K1K1K0K0m0m1r4r4Q4Q4O9l7l9m0
3862a29m6m6L3L3L4L3L0L0K8L0J0Rm3m3o0n9poL7L7L6L7k4k5K8K9k2k1J0J0j8j8j8j9k8k9
3851a67LLm3m3J1J0J7J7M9M8M8M7J5J5K8K8m6m6J0J2k0k0K7K9K9K9L6L6j7j7o4o3L2L2l4l2
3840al3l3j0j0j1j0ONOOM4M4M4M5l5l5l4l5J4J3J3J3n3n5M2M1kkK8L0k2k1k7R9J17j1k6k6
3828A18k1k2L2L1k6k7k7k6j6j5j5j5K3K1K3K3%%l2l0M2M3j0j0%%L1L2k1k1k1k1n5n7n6n6k4
3816b05k4k4k4N5N6N5N6k2k3k2k2oopok9l0k9l0noN2N1O5J29N3rJ3J4k2k2j7j5k1k1J9m5r
3805h3rmnl6l7L3L2O5O3%%j%%%j%m2m4N2N2j4j3m9J4N3N4N8N8NNm8m8o2o0N0N1J2n2q9r0m1
$$ plain form
3885 -14 -51 -35 -19 -32 -46 36 118 155 192 194 195 166 73 5 44 87 68 16 -35 -14 6 -26 -58 -108 -157 -274 -392 -452 -407 -325 -244 -222 -201 -179 -157
3874 -157 -72 13 99 185 135 85 35 -14 14 44 20 -2 -7 -12 -17 -22 -19 -17 -67 -117 -130 -143 -103 -63 -42 -21 -1 19 -21 -62 -156 -250 -166 -82 -13 -50 -89 -129
3862 -129 -175 -221 -188 -155 -121 -88 -58 -28 0 30 40 49 6 -37 -97 -156 -163 -169 -132 -95 -59 -22 -46 -71 -43 -14 -36 -57 -47 -37 -55 -73 -91 -110 -138 -167
3851 -167 -164 -161 -204 -247 -236 -226 -209 -192 -143 -95 -47 0 15 30 58 86 40 -6 4 16 -4 -24 3 32 61 90 126 162 145 128 64 1 33 65 31 -1
3840 -1 -34 -67 -77 -87 -98 -108 -102 -97 -91 -85 -41 3 47 92 57 22 -12 -47 -33 -20 -7 6 -47 -102 -60 -19 -21 -23 5 35 13 -8 -35 64 181 170 144 118
3828 118 97 75 107 138 112 85 58 32 16 1 -14 -29 -6 15 38 61 61 61 29 -1 41 84 74 64 64 64 95 127 106 85 64 43 -12 -69 -125 -181 -205
3816 -205 -229 -253 -277 -222 -166 -111 -55 -77 -100 -122 -144 -150 -156 -163 -169 -198 -228 -257 -287 -292 -298 -246 -195 -130 -1 52 43 56 70 48 26 9 -6 -27 -48 -29 -74 -83
3805 -83 -92 -96 -101 -137 -174 -141 -109 -44 19 19 19 18 18 18 18 17 17 -25 -69 -17 35 21 8 -41 -27 26 80 138 196 201 206 158 110 48 -12 38 89 101 49 -40 -130 -171
3792a71m1p7j3M0M0P2P2M9j4j8M5K7l4l2L3J9J9J0n2o4JN6N5m1m1p0o9LO7L1L0j6j6oJ01J54
3781A49R2J1n2n4n3r0q8k9k9k9k8l5l4M0M0N7N7N7N5k1k1k2k2n2n3O5O4j0j0m2m2j2j2j2j2
3770a77LKm6m7K4Q8N1N2M2M1qpRP2M0k3l3l3l7l6l7l8j05m2P9Q0RRK9L0klK5K6j4N0J8m6j4
3758C1N0K9l6NNL8L9n7n7o3o4j32o8KLN9N9nnK7K7p6p7q1j6Q3Q3qrJ5J5J1J1K0m4K7R1P5J3
3745B0K1K1PQk4k5j9j9j9k0o0o0k2M2P3P2J6m6n2n3n3n2j9M5J3n1nmM4M4N0N0k1k1m2K2L8
3734a01L9ppp5j1J5J6J5J5J3n2q3j9J8J8N8nj3j3L6L6O2O1NMj5p7J0J0k7k6p3p3L3J39O2j
3723a3k9k9k2q6r0J6K7K7P4P4K1K1j0j1K1K0j8j9p2p2K7K6K6K7ooooK8K9K8K8k4k3k4k4M2
3711b8M2M6j7kjk3q6q2q3J3J3k5L9L5L5OOL7L8j3j4O2O0nmK7K8MMJ%k8r0k1k0L7R8M7j7p5
$$ plain form
3792 -171 -212 -289 -302 -262 -222 -150 -78 -29 -43 -61 -16 11 -23 -55 -22 -3 16 26 -26 -90 -89 -33 22 -19 -60 -130 -199 -196 -129 -98 -68 -84 -100 -106 -5 149
3781 149 241 252 200 146 93 3 -85 -114 -143 -172 -200 -235 -269 -229 -189 -132 -75 -18 37 16 -5 -27 -49 -101 -154 -89 -25 -35 -45 -87 -129 -141 -153 -165 -177
3770 -177 -174 -172 -218 -265 -241 -153 -102 -50 -8 33 25 18 27 99 139 116 83 50 13 -23 -60 -98 -203 -245 -166 -86 -77 -68 -39 -9 -11 -14 11 37 23 73 91 45 31
3758 31 81 110 74 79 84 122 161 104 47 -16 -80 -212 -280 -278 -275 -216 -157 -162 -167 -140 -113 -189 -266 -347 -363 -280 -197 -205 -214 -199 -184 -173 -162 -142 -186 -159 -68 7 20
3745 20 41 62 69 77 53 28 9 -10 -29 -49 -109 -169 -191 -149 -76 -4 12 -34 -86 -139 -192 -244 -263 -218 -205 -256 -261 -265 -221 -177 -127 -77 -98 -119 -161 -139 -101
3734 -101 -62 -69 -76 -151 -162 -147 -131 -116 -101 -88 -140 -223 -242 -224 -206 -148 -153 -166 -179 -143 -107 -45 16 21 25 10 -67 -57 -47 -74 -100 -173 -246 -213 -74 -12 -13
3723 -13 -42 -71 -93 -179 -269 -253 -226 -199 -125 -51 -30 -9 -19 -30 -9 11 -7 -26 -98 -170 -143 -117 -91 -64 -70 -76 -82 -88 -60 -31 -3 25 1 -22 -46 -70 -28
3711 -28 14 60 43 41 40 17 -69 -151 -234 -221 -208 -233 -194 -159 -124 -118 -112 -75 -37 -50 -64 -2 58 53 49 76 104 108 112 113 113 85 -5 -26 -46 -9 89 136 119 44
3699D4p3p5p5o3%N9O0N0M9m1m2k2M3Q0Q0K4K3l3l3J2n2o8o9J0Rj8j9j2N1O5O4%o2J0P4LLP
3687F3Pk0k1p2p3m1m0kO2N9N9j3p8l5K9M1M2k3k3K9L0K8K8L7k7m6J8OOL5k9q2j8klKJMMMM
3674e0k0k0j6j5OO9O9ORJ0NNk5k5K4K3J4m9q8q8p7p8K5Q9M8M9MLmN8K8l7ppq5q5J7J7J7J6
3662a65M0L9L3L3Kj03j28k3M4J49P9J5%Jj6q1l2L2K4K4L2L1L2L2n2n2q9k4M4M5jjm9J3L2L1
3651il4l5p0oM5M4M5M4L5k7n1n2J2P6M4j9q0q1n8PM3M3M7M6K5K5lo6o7o7L6L5M5M3j8k0M5
3639B2M6J8m6p0p1m6J6M2M1M9j4n9n9n9M7K8K8L1L0N2j1l4l5m3K0M4M3k2q8n5QqqK8K8J2J1
3628h4J1J2PQPQm7m7n0J3j6j6j1R5J16N5j4j4m7j11m8J5K6K5L0L0J5J5J5J4NNNNnnl6l7L0
3616b1K9l3l4J9J9m4m5KJL4L3NNNNM6M6j6q0q0K5O2lp5p5j5j6K1K1J7J7Qn5m8N9J02J01m1
$$ plain form
3699 44 -29 -104 -179 -242 -242 -183 -123 -73 -24 -65 -107 -129 -86 -6 74 98 121 88 55 67 15 -53 -122 -112 -103 -121 -140 -152 -101 -36 28 28 -34 -24 50 53 56 63
3687 63 70 50 29 -43 -116 -157 -197 -199 -137 -78 -19 -32 -110 -145 -116 -75 -33 -56 -79 -50 -20 8 36 73 46 0 18 24 30 65 36 -46 -64 -66 -69 -67 -66 -62 -58 -54 -50
3674 -50 -70 -90 -106 -121 -115 -46 23 29 38 48 53 58 33 8 32 55 69 20 -68 -156 -233 -311 -286 -197 -149 -100 -96 -93 -97 -39 -11 -48 -55 -62 -147 -232 -215 -198 -181 -165
3662 -165 -125 -86 -53 -20 -18 -121 -249 -272 -228 -79 0 15 15 16 0 -81 -113 -81 -57 -33 -1 30 62 94 42 -10 -99 -123 -79 -34 -35 -36 -85 -72 -40 -9
3651 -9 -43 -78 -148 -154 -109 -65 -20 24 59 32 -19 -71 -59 17 61 42 -38 -119 -177 -170 -127 -84 -37 9 34 59 56 -10 -77 -144 -108 -73 -28 15 -3 -23 22
3639 22 68 86 40 -30 -101 -147 -131 -89 -48 1 -13 -72 -131 -190 -143 -115 -87 -56 -26 26 15 -19 -54 -97 -77 -33 10 -12 -100 -155 -147 -155 -163 -135 -107 -95 -84
3628 -84 -73 -61 -54 -46 -39 -31 -78 -125 -175 -162 -178 -194 -205 -110 6 61 47 33 -14 -125 -173 -158 -132 -107 -77 -47 -32 -17 -2 12 17 22 27 32 27 22 -14 -51 -21
3616 -21 8 -25 -59 -40 -21 -65 -110 -108 -107 -73 -40 -35 -30 -25 -20 26 72 56 -24 -104 -79 -17 -20 -95 -170 -185 -201 -180 -159 -142 -125 -117 -172 -220 -161 -59 42 1
3604Al9j12j12noQPQPJ3J2J2J2L8L8L7L8Q8R0K6K6m2m1j04j04j1j2K1K1N3N3K1K1o1o1k9l0
3592a18N4N4M6M7l2j37j15n1ONk2k2j1j0N3N4J6J6j6j5J04J04M1M0K7K7j22j20q1q1j7j6O2
3582b30O3O3O2J7J7J6J7j0j0N4N4K5K6l8l9p8p7K8K8j7j6M6M6L0L0klp3p3m1m2K7K8N5N4J9
3571E6m4p5j2N5N4O3%j05j06k9L4Q2Q1J1J2l3l3l2l3k8k8r6l3l1l1L3R7M1M1J01om7j12j71
3560c24o5L3R7J04L9J9J9J5J4j2j3K8l6r6l3K4K3M3M4L9L8L0l4l0l0POPPP9P9j6j6o4o2o4
3549a01o4%%qN6K3m1k8k9l3K9K6K6mmK8K8M7M6M2M3no9l2l3L4L2j8k0M4M5J3r3q9k6K8K8R
3537g0J0RJ0llNn8m6J7N2N3M4M6qpo3o3o7mM0M1l1l0n8n8nnN6N5K4K3M6M5pqKKKJNML6L6J2
3524H2J3J2J2n9o0J4J4n4n5k4k3n2n2n9M8Q8Q8J53M8j04j03j6j5L6L6L5L6POq8q9nnNn8RJ15
$$ plain form
3604 1 -38 -150 -262 -267 -273 -265 -258 -250 -243 -230 -218 -206 -194 -156 -118 -81 -43 45 135 161 187 145 104 0 -104 -115 -127 -106 -85 -32 21 42 63 2 -59 -88 -118
3592 -118 -64 -10 36 83 51 -86 -201 -252 -246 -241 -263 -285 -296 -306 -253 -199 -183 -167 -183 -198 -94 10 51 91 118 145 23 -97 -178 -259 -276 -292 -230
3582 -230 -167 -104 -42 -25 -8 8 25 15 5 59 113 138 164 126 87 9 -68 -40 -12 -29 -45 1 47 77 107 105 102 29 -44 -85 -127 -100 -72 -17 37 56
3571 56 12 -63 -75 -20 34 97 97 -8 -114 -143 -109 -27 54 65 77 44 11 -21 -54 -82 -110 -206 -239 -270 -301 -268 -171 -130 -89 12 6 -41 -153 -324
3560 -324 -389 -356 -259 -155 -116 -97 -78 -63 -49 -61 -74 -46 -82 -178 -211 -187 -164 -121 -77 -38 0 30 -4 -34 -64 -57 -51 -44 -37 42 121 105 89 25 -37 -101
3549 -101 -165 -165 -165 -173 -117 -94 -135 -163 -192 -225 -196 -170 -144 -148 -152 -124 -96 -49 -3 39 82 77 8 -24 -57 -23 9 -9 -29 15 60 73 -20 -109 -135 -107 -79 -70
3537 -70 -60 -51 -41 -44 -47 -42 -100 -146 -129 -77 -24 20 66 58 51 -12 -75 -142 -146 -106 -65 -96 -126 -184 -242 -247 -252 -196 -141 -117 -94 -48 -3 -10 -18 -16 -14 -12 -11 -6 -2 34 70 82
3524 82 95 107 119 60 0 14 28 -26 -81 -105 -128 -180 -232 -291 -243 -155 -67 86 134 30 -73 -89 -104 -68 -32 3 39 46 52 -36 -125 -130 -135 -130 -188 -179 -64
3512f4J11Nn9n9j3j3QQk4k5m1m1J2J2k2k3N2N2O1O2l5l4nnK6K7k4k3QQJ1J2J1J2O5O7qqk1
3500H3k2k2k1J8J9J8J9p2p1r9OP2P2M7M7n1n1j9j9K5K5ooL5L6l8l7o0n9J4J5J4J3J4J3qpq
3488g1qo1o1J4J3L3L3O5O3J4J5n9o0k2k1L2L2qpK4K5L0L0L1L1m8m8j6j6%%l2l1J0J0k2k2N
3477a03MMMl9l9J4J5M7M8N7m8p8j5L5k8o7lK9l5j8M6N9N9K1K0l2l3L6L5LLj7j7L4L6k3k3k3
3465c2k4r1r2n9o0K8K9K8K8K8K8O0O0M8M7M8M8mmK8K8k2k2p6p4l9m0L5L4M8M8mno4o5o5o6
3453b07R1R1J6J5n6n7mmj4j5j5j4K8K8K8K9J6J6M7M8J7J6j5j5j8j8m5m6o4%L8L8M1M0M5j9
3442F2l1l1L5L5L2l2MMk5k6p8p9K2K1k1M2M6o1l3L1L7L7M0M1ONk6k6%jL2L1n7n7k2k2k4L9
3430e0k4k5mN9N0N1J2n2m2m4J5P7P9J5PQl3l2K6l7p2rJ4m9l7l8l4L0K6K6k3k2N3N2K5K3Qn6
$$ plain form
3512 -64 47 52 -7 -66 -79 -92 -84 -76 -100 -125 -166 -207 -195 -183 -205 -228 -176 -124 -63 -1 -36 -70 -75 -80 -54 -27 -51 -74 -66 -58 -47 -35 -24 -12 53 120 112 104 83
3500 83 61 39 18 36 55 73 92 20 -51 -150 -144 -72 0 47 94 43 -8 -27 -46 -21 4 -2 -8 27 63 25 -12 -72 -131 -117 -102 -88 -75 -61 -48 -56 -63 -71
3488 -71 -79 -140 -201 -187 -174 -141 -108 -43 20 34 49 -10 -70 -92 -113 -81 -49 -57 -64 -40 -15 15 45 76 107 59 11 -5 -21 -21 -21 -53 -84 -74 -64 -86 -108 -103
3477 -103 -99 -95 -91 -130 -169 -155 -140 -93 -45 12 -36 -114 -129 -94 -122 -189 -192 -163 -198 -216 -170 -111 -52 -31 -11 -43 -76 -40 -5 -2 1 -16 -33 1 37 14 -9 -32
3465 -32 -56 -147 -239 -298 -358 -330 -301 -273 -245 -217 -189 -129 -69 -21 26 74 122 118 114 142 170 148 126 50 -24 -63 -103 -68 -34 14 62 58 53 -11 -76 -141 -207
3453 -207 -116 -25 -9 6 -50 -107 -111 -115 -129 -144 -159 -173 -145 -117 -89 -60 -44 -28 19 67 84 100 85 70 52 34 -11 -57 -121 -121 -83 -45 -4 36 81 62
3442 62 31 0 35 70 102 70 74 78 53 27 -51 -130 -108 -87 -108 -66 -20 -81 -114 -83 -46 -9 31 72 78 83 57 31 31 30 62 93 36 -21 -43 -65 -89 -50
3430 -50 -74 -99 -103 -44 6 57 69 17 -25 -69 -54 23 102 117 124 132 99 67 93 56 -16 -25 -11 -60 -97 -135 -169 -139 -113 -87 -110 -132 -79 -27 -2 21 29 -27
3419b7LLjjrrn7n8j6M8M4M4qqO2O3K7l6n4n2popoj0j0j0j0n4n5n4n5jkL1L0K6K6R9J00K8K9
3406D0N4N4K5q2k3k2lln5n6l9m0qqQRO1O1M1M1l2l2p3p2k0j9l1l0O5O5N4N4o2o3n1n2JJK9
3393b13L0llJ1J2M3M3P6P4K2K2l8l8o9p0K3K3l0l0k6k6K7K7O2O1l3l4n6n5M0M0K2K2l2l1k0
3382a27k0L4L3NNMNk5k4M9N0LLLLO6O6pqn8n8N9O0J9K0j3j2l4l5l4l3J3J3k2k1n0j14j49k2
3370c53N1N2K8K7K9K8mlPPQ1Q1K2K1l1l2n6n7J7J7N4N3K3K2K3K3rql7l7J7J6L7L6n9o0l9m1
3358e4j3j2m2j05q8M0P1P2M7M8Q6Q7l0l0l0k9o1o2L4L3m1m1p4p4%JL4L4LKP7P7j9j9k3k3P3
3347e1P1k6k6LO7M2q3m1m0ppppm9n0M6M6j8j9J4J3R3R2klo9p0MMO4O3j0j0m9n0K4K4N6N6j8
3335G0j8kjkko8o9nok7k8k8k8K7K6K7K6k8k7MNj1j1N3N2M6M4j02j03l3l3L2L1n4n4n4n4N0
$$ plain form
3419 -27 -24 -21 -22 -23 -32 -41 -98 -156 -172 -124 -80 -36 -44 -52 10 73 100 64 10 -42 -49 -55 -62 -68 -78 -88 -98 -108 -162 -217 -271 -326 -327 -329 -298 -268 -242 -216 -117 -17 11 40
3406 40 94 148 173 91 68 46 43 40 -15 -71 -110 -150 -158 -166 -158 -149 -88 -27 14 55 23 -9 -82 -154 -174 -193 -224 -254 -189 -124 -70 -16 -78 -141 -192 -244 -243 -242 -213
3393 -213 -183 -186 -189 -178 -166 -123 -80 -4 70 92 114 76 38 -31 -101 -78 -55 -85 -115 -141 -167 -140 -113 -51 10 -23 -57 -113 -168 -128 -88 -66 -44 -76 -107 -127
3382 -127 -147 -113 -80 -75 -70 -66 -61 -86 -110 -61 -11 -8 -5 -2 1 67 133 126 118 60 2 61 121 140 160 147 135 101 66 32 -1 12 25 3 -18 -68 -182 -331 -353
3370 -353 -302 -250 -222 -195 -166 -138 -142 -145 -138 -131 -50 31 53 74 43 11 -45 -102 -85 -68 -14 39 62 84 107 130 121 113 76 39 56 72 109 145 86 26 -13 -54
3358 -54 -67 -79 -121 -226 -314 -274 -203 -131 -84 -36 50 137 107 77 47 18 -43 -105 -71 -38 -79 -120 -194 -268 -268 -267 -233 -199 -196 -194 -117 -40 -59 -78 -101 -124 -51
3347 -51 20 -6 -32 -29 38 80 -3 -44 -84 -91 -98 -105 -112 -161 -211 -165 -119 -137 -156 -142 -129 -36 56 54 51 -18 -88 -84 -80 -16 47 37 27 -22 -72 -48 -24 32 88 70
3335 70 52 50 49 47 45 -23 -92 -97 -103 -130 -158 -186 -214 -187 -161 -134 -108 -136 -163 -159 -154 -165 -176 -123 -71 -25 19 -83 -186 -219 -252 -220 -189 -243 -297 -351 -405 -355
3323c55N0M9N0K6K5K6K6l4l4l4l4N1N2N1N2RRk3k3n0n0J4J4k2k1M3M2KKL4L3OOn7n8kkl3l4
3311a94J0RJ0J0M1M0M0M0k4k6n7n7l7l7K6K7L2L2%%l8l8ooK6K6onPPP2P1KKKKJ9K0q6q6k7
3298a57k6L7L7L3L2l1l1m6m7j5j4qpqpM9M9M8M9O6O7l6l4lO0K9l4m9m7J1J1k2k2J8m5m0K4
3286a09J6J6%Jo4o3J1J0q9k5Q3Q3N9nlkj1N3N3N4no9o2M4M3o1l0L4K8l6m4m3J6J6l2l2j%k6
3274a92k7M0J04R9L6Rn4r9l7rj0n7PL4L5N3N3N1n2l8K6M1M3L8k5r5r6j1j1K1K1L4L5l0k9K
3263i0KL4L4k3k2k3k2kkklL0K9O0O1QQO8O8pp0o2o2j4M7P3P2j2p7o8o7l7K7N4N5l9l7K6R2
3251A07M1k3m7m6m3m4k0M3M6j6p7j3L2L1Rn6l5l4l9l8L7L8OOQRn5n5L4L5L4L5k4k5k0k0k2
3240b01M3J0J0J5P8P7J5k3k3k9l1Rn5n6RO4O4NNj5j5J3P6K9K9l1r4n4N1J29O6p1p0j1j1rj0
$$ plain form
3323 -355 -305 -256 -206 -180 -155 -129 -103 -137 -171 -205 -239 -188 -136 -85 -33 -24 -15 -38 -61 -111 -161 -147 -133 -155 -176 -133 -91 -89 -87 -53 -20 -14 -8 -65 -123 -125 -127 -160 -194
3311 -194 -184 -175 -165 -155 -114 -74 -34 6 -18 -44 -101 -158 -195 -232 -206 -179 -147 -115 -115 -115 -153 -191 -197 -203 -177 -151 -157 -162 -155 -148 -76 -5 -3 -1 1 3 22 42 -44 -130 -157
3298 -157 -183 -146 -109 -76 -44 -75 -106 -152 -199 -214 -228 -236 -243 -251 -258 -209 -160 -112 -63 3 70 34 0 -3 57 86 52 3 -44 -33 -22 -44 -66 -48 -93 -133 -109
3286 -109 -93 -77 -77 -76 -140 -203 -192 -182 -271 -296 -213 -130 -71 -76 -79 -81 -92 -39 14 68 63 -6 -68 -24 19 -42 -72 -38 -10 -46 -90 -133 -117 -101 -133 -165 -166 -166 -192
3274 -192 -219 -179 -75 24 60 69 15 -84 -121 -130 -140 -197 -190 -156 -121 -68 -15 36 -16 -54 -28 13 56 94 69 -26 -122 -133 -144 -123 -102 -68 -33 -63 -92 -90
3263 -90 -88 -54 -20 -43 -65 -88 -110 -112 -114 -116 -119 -89 -60 0 61 69 77 145 213 206 136 74 12 -2 45 118 190 178 101 33 -34 -71 -44 10 65 26 -11 15 107
3251 107 148 125 78 32 -11 -55 -75 -32 14 -2 -79 -92 -60 -29 -20 -76 -111 -145 -184 -222 -185 -147 -141 -135 -127 -118 -173 -228 -194 -159 -125 -90 -114 -139 -159 -179 -201
3240 -201 -158 -148 -138 -123 -45 32 47 24 1 -28 -59 -50 -105 -161 -152 -88 -24 -19 -14 -29 -44 -31 45 74 103 72 -22 -76 -25 104 170 99 29 18 7 -2 -12
3228a2rj0n3n2J4P8Q7K4l9K4L0l3k6k4k9k8k9k9J9J8J9J8klj05j05m4K0Q6Q6R0K6m4m4l1l0
3217a42L2L3kkkkONOOL4L4k8l0J1J0J1J1n0n0k3M2JJNNJ2J1M3M2p4p5n1J2O5JRRj4j4J8J9
3204f5MMn5n6q0j6N4N4Q3Q3J2m9k4k4NMj5j5M9M8j3j4m6m6j3j3m1m0o4%K7K8O3O4L2L1RQQ
3192a9RJ7J8J9J8jkkjk1k1j6Q9Q1Q1O0ln0n0n4n3m3m4j01LN7N6O0O0m7j09n1J3M7j7qrM5M7
3180E8j01j02l3l3L1L1j6j6j6j6J0Rj8j8K1Q6K1m2l9l9P4P4J0J0m4m3l3l2M1M2M1M0RQl0l0
3169h5KKN1N0J9J9J3J2o1o1n8n8k7k6M4M5M4M5p9p8k5k5j1j1M2M2K4K5R8R8oonop9q0q0q0
3157b72N5N6K3K4M4M4J2J2K4K4pqk8k8LLk8k8M6M5j8j9p3p2l2l2O3O3jkL0L0%%L2L1poq0q1
3144a58O6O6J3J3m0m1rrJ7J7J7J6J9J8l4l4n9o0J5J5O2O3K9L1J2J2j9k0o8p0NNJ5J5J5J5j2
$$ plain form
3228 -12 -21 -31 -84 -136 -122 -44 43 67 28 52 82 49 23 -1 -30 -58 -87 -116 -97 -79 -60 -42 -44 -47 -152 -257 -301 -281 -195 -109 -19 7 -37 -81 -112 -142
3217 -142 -110 -77 -79 -81 -83 -85 -79 -74 -68 -62 -28 6 -22 -52 -41 -31 -20 -9 -59 -109 -132 -90 -89 -88 -83 -78 -66 -55 -12 30 -44 -119 -170 -158 -93 -92 -83 -74 -88 -102 -84 -65
3204 -65 -61 -57 -112 -168 -248 -264 -210 -156 -73 10 22 -27 -51 -75 -70 -66 -81 -96 -47 1 -12 -26 -72 -118 -131 -144 -185 -225 -289 -289 -262 -234 -171 -107 -75 -44 -35 -27 -19
3192 -19 -10 7 25 44 62 61 59 57 56 35 14 -2 87 168 249 309 306 256 206 152 99 56 12 -89 -86 -29 27 87 147 100 -9 -60 -47 0 -17 -25 -34 11 58
3180 58 -43 -145 -178 -211 -180 -149 -165 -181 -197 -213 -203 -194 -212 -230 -209 -123 -102 -144 -183 -222 -148 -74 -64 -54 -98 -141 -174 -206 -165 -123 -82 -42 -33 -25 -55 -85
3169 -85 -83 -81 -30 20 39 58 71 83 22 -39 -97 -155 -182 -208 -164 -119 -75 -30 -109 -187 -212 -237 -248 -259 -217 -175 -151 -126 -28 70 64 58 53 47 -32 -112 -192 -272
3157 -272 -217 -161 -138 -114 -70 -26 -14 -2 22 46 39 31 3 -25 -22 -19 -47 -75 -29 16 -2 -21 -94 -166 -198 -230 -167 -104 -105 -107 -77 -47 -47 -47 -15 16 9 3 -77 -158
3144 -158 -92 -26 -13 0 -40 -81 -90 -99 -82 -65 -48 -32 -13 5 -29 -63 -122 -182 -167 -152 -90 -27 2 33 45 57 38 18 -50 -120 -115 -110 -95 -80 -65 -50 -62
3133f2j2K0K0N1N2m4m3k1k2N3N2O1O1j3j4n1n1n1n1ONk6k7J6J5J6J5l4l3l4l3N9N9OOL2L0
3121A3O3O4n1n1KKM3M2P0l6j06j05l8l8RRJ0RN5N4KKn5n6o3M3R4R2Q6k1p0p0ljK7K7lmnml6
3109Bl5j7j7j7j7M3M2l2l2j0rj0j0l2l3M1M2M6M6k8k9J7J7l7l6k9k9LLN8N8N7N8L9L9PPn5
3097A11n5M0M0l3l3kjklklkklkj0j0oo8n7n7l3L1J25J25J6m7p9p9j3N0N4N4O2jo6o5p0p0J3
3085a53J3J2J3J7J6J3J2P6J4n0J4K8K9p2p3m9m9q5k2M4M4M7M8O9O7l2l4m1K3J5J4j2p7p6j3
3074b10M7M6N1N0KLN5N7K4j25j33k6j2j2l4l3K9R3N7N7k3k3k3k4j5j5M8M9O2O4K4q3r3J3k2
3063g5k2P6P6J1n4q7k5j%j8j8j8j8O3O4%%l9l9ppm3m3j1j1M8M8j5j5M7M6j6j7j3j3J8J9M6
3051f3M6j8j8n5n6n5n6RQQQM5M6j9j8K8K7mnJ1J1J1J1m0m0K3K4O3O3O2O3q7q6K0J9l5l6K9
$$ plain form
3133 -62 -74 -54 -34 17 69 25 -18 -39 -61 -8 44 105 166 153 139 88 37 -14 -65 -59 -54 -80 -107 -91 -76 -60 -45 -79 -112 -146 -179 -120 -61 -55 -49 -17 13
3121 13 76 140 89 38 40 42 85 127 197 161 55 -50 -88 -126 -117 -108 -98 -89 -34 20 22 24 -31 -87 -150 -107 -13 79 165 144 74 4 1 0 27 54 51 47 42 38 2
3109 2 -33 -50 -67 -84 -101 -58 -16 -48 -80 -90 -99 -109 -119 -151 -184 -143 -101 -55 -9 -37 -66 -49 -32 -69 -105 -134 -163 -160 -157 -99 -41 16 74 113 152 159 166 111
3097 111 56 96 136 103 70 68 67 65 62 60 57 55 53 50 48 38 28 22 -46 -103 -160 -193 -162 -37 88 104 57 -22 -101 -114 -64 -10 44 106 105 39 -26 -96 -166 -153
3085 -153 -140 -128 -115 -98 -82 -69 -57 19 33 -17 -3 25 54 -18 -91 -140 -189 -274 -296 -252 -208 -161 -113 -44 23 -9 -43 -84 -61 -46 -32 -44 -121 -197 -210
3074 -210 -163 -117 -66 -16 -14 -11 44 101 125 0 -133 -159 -171 -183 -217 -250 -221 -128 -71 -14 -37 -60 -83 -107 -122 -137 -89 -40 22 86 110 27 -66 -53 -75
3063 -75 -97 -21 55 66 12 -75 -100 -101 -101 -119 -137 -155 -173 -110 -46 -46 -46 -85 -124 -131 -138 -181 -224 -235 -246 -198 -150 -165 -180 -133 -87 -103 -120 -133 -146 -128 -109 -63
3051 -63 -17 -35 -53 -108 -164 -219 -275 -266 -258 -250 -242 -197 -151 -170 -188 -160 -133 -137 -142 -131 -120 -109 -98 -138 -178 -155 -131 -68 -5 57 120 33 -53 -33 -14 -49 -85 -56
3039e6K8PPQOm2m3m2m3rqK3K3N4N4rj0j1j1m3m2j1j1N3N3M0M0k1k3L9L7PQkkj06j08%%j%K9
3026a38L0l5l5MNMMJ3J3J4J3k9l0l0k9JKKJM6M5P7P6L4L4k9l0l6l8Nn8q9J8N4j0JKl4l4J0
3014a76RM2M2k1k1k0k1l9l8ppP7P6M5M4j3j3j3j4p8p8lmN4N4JJO8O8L6L7%%p4p3j3j3j3j2
3002a10m0l9J4J3J2J1J1J1P6P4M4M4l7l6J6J7J%O7O7J6j11j63l7J2J3l3l3k6k6K7K6L4L3j9
2991g1k0j4j5J8J7N1M9J9J9J2J1m1m0j4j4m6m6M5M6M4M5POq8r0j0j1j9q3n2P6Q5K2q2j45r0
2980d19L8O4O4J9K0j8j8L5L5N2N3N2N1nnono8o9j6j6L1L1m4m3RJ0RJ0K7K7K7K8L5L4O7O7j7
2968A46j7p0o9k5k5K8K8J2J3j8j8q2q3qqJ1J1M2M3QQn9o0l5P0J00L6L9L9j7j8l7l7l8l8J6
2957a12J6l7l7j4j5L9L9R1R0nnj7j7J5J5k1k2p3p4O7O8L4L6J2J3m0m0n6n7J8J7LLk9k9j7j6
$$ plain form
3039 -56 -28 -21 -14 -6 0 -42 -85 -127 -170 -179 -187 -164 -141 -87 -33 -42 -52 -63 -74 -117 -159 -170 -181 -128 -75 -35 5 -16 -39 0 37 44 52 50 48 -58 -166 -166 -166 -167 -167 -138
3026 -138 -108 -143 -178 -174 -169 -165 -161 -148 -135 -121 -108 -137 -167 -197 -226 -225 -223 -221 -220 -174 -129 -52 24 58 92 63 33 -3 -41 -36 -94 -183 -165 -111 -121 -120 -118 -152 -186 -176
3014 -176 -167 -125 -83 -104 -125 -145 -166 -205 -243 -250 -257 -180 -104 -59 -15 -28 -41 -54 -68 -146 -224 -227 -231 -177 -123 -122 -121 -53 15 51 88 88 88 14 -59 -72 -85 -98 -110
3002 -110 -150 -189 -175 -162 -150 -139 -128 -117 -41 33 77 121 84 48 64 81 82 82 149 216 232 121 -42 -79 -67 -54 -87 -120 -146 -172 -145 -119 -85 -52 -71
2991 -71 -91 -105 -120 -102 -85 -34 15 34 53 65 76 35 -5 -19 -33 -79 -125 -80 -34 10 55 62 68 -20 -110 -120 -131 -150 -233 -285 -209 -124 -102 -184 -329 -419
2980 -419 -381 -317 -253 -234 -214 -232 -250 -215 -180 -128 -75 -23 28 23 18 12 7 -61 -130 -146 -162 -131 -100 -144 -187 -178 -168 -159 -149 -122 -95 -68 -40 -5 29 96 163 146
2968 146 129 59 -10 -35 -60 -32 -4 8 21 3 -15 -97 -180 -188 -196 -185 -174 -132 -89 -81 -73 -132 -192 -227 -157 -57 -21 18 57 40 22 -15 -52 -90 -128 -112
2957 -112 -96 -133 -170 -184 -199 -160 -121 -30 60 55 50 33 16 31 46 25 3 -70 -144 -77 -9 25 61 73 86 46 6 -50 -107 -89 -72 -69 -66 -95 -124 -141 -157
2945a57N7N8KLM8M9Kj02p9j6n0n1PP%%%%L5L6L6L6m3m3J0J0N4N3%%QQk4k4j4j4M0M0k3k2R
2933e4RO3O4j1j0l0l0K4K3j1j1q5q5NON9N9J7J8j3j3J7J8J8J7n2n1K3K1QPk3k4k3k2k3k2L
2921a14Mk9k8J0J0O3O3qqqqm5m5m5m5l3l4M2M1P6P7K3K3j8j9J4J3J1J1m3m2k0k0J2J1j2j2
2909a32K0K0j2j2K0K0K6K5oprrq3q4k6k5P0O9ppppj4j5j4j5M8M8M8M8m0l9m0m0K0J9J9J9J2
2897i9J1J8J8n1N4N8m6j7M7NLqrrrrrrrK4K5K4K4J2J2J3J2K1K1n3n3o1o2rqJ9J9j3j2J7J8
2885h0P1P0L4L3o1o2l2l3q5q6N1N1J9K0j8j8L5L5j9j9J2J3j0j0m2m2qqM5M5N8N8l6l6k4k3
2873a02j7j7j0R7P2Rnorj0n8o0o0o0K0J9J2J3N2n4k9L3N2N2N6N4j0j1j0j1K5K5K6K5l9l8p
2862A9oN7N7l9l9j16j17k1k1RRM1M0M3M2LML1p4j26o1PQM3M3N0M9mmpoppJ3J2J2J3J0Rm3m3
$$ plain form
2945 -157 -100 -42 -40 -37 11 60 62 -40 -119 -135 -185 -236 -229 -222 -222 -222 -222 -222 -187 -151 -115 -79 -122 -165 -155 -145 -91 -38 -38 -38 -30 -22 -46 -70 -84 -98 -58 -18 -41 -63 -54
2933 -54 -45 18 82 71 61 31 1 25 48 37 26 -59 -144 -139 -133 -74 -15 2 20 7 -6 11 29 47 64 12 -39 -16 5 13 20 -3 -27 -50 -72 -95 -117 -114
2921 -114 -110 -139 -167 -157 -147 -84 -21 -29 -37 -45 -53 -98 -143 -188 -233 -266 -300 -258 -217 -141 -64 -41 -18 -36 -55 -41 -28 -17 -6 -49 -91 -111 -131 -119 -108 -120 -132
2909 -132 -112 -92 -104 -116 -96 -76 -50 -25 -31 -38 -47 -56 -139 -223 -249 -274 -204 -135 -142 -149 -156 -163 -177 -192 -206 -221 -173 -125 -77 -29 -69 -108 -148 -188 -168 -149 -130 -111 -99
2897 -99 -88 -70 -52 -103 -49 9 -37 -54 -7 -2 1 -7 -16 -25 -34 -43 -52 -61 -70 -46 -21 3 27 39 51 64 76 97 118 65 12 -49 -111 -120 -128 -109 -90 -103 -115 -98 -80
2885 -80 -9 61 95 128 67 5 -27 -60 -145 -231 -180 -129 -110 -90 -108 -126 -91 -56 -75 -94 -82 -69 -79 -89 -131 -173 -181 -189 -144 -99 -41 17 -19 -55 -79 -102
2873 -102 -119 -136 -146 -49 23 32 27 21 12 2 -56 -116 -176 -236 -216 -197 -185 -172 -120 -174 -203 -170 -118 -66 -10 44 34 23 13 2 27 52 78 103 64 26 19
2862 19 13 70 127 88 49 -67 -184 -205 -226 -217 -208 -167 -127 -84 -42 -39 -35 -4 -78 -204 -265 -258 -250 -207 -164 -114 -65 -69 -73 -80 -86 -93 -100 -87 -75 -63 -50 -40 -31 -74 -117
2849a17m8m8O9O9K4K3n1n1j2j2j2j2J08J07J5r0r6J0O1O1n1n2KKL0L0L1K9k0k1n3n3l9l9L5
2838a71L5M6M6p1p1rrJ02J01O8l6r0k8R4L1o7o7k2k1P1P0L0l2k9P7Q2J9n5n6m5m7PPM6M7q9
2827c6r1N9O0N9N9m6m5r2r2o4M3P6J2J9Q2J07M3ko6p4j0M1k2k1M0k3q5qN5OPRJ0rqM3M3m1
2815C8m1l8l8k4L9MMk2k2j7j8J1P5P4J1nnK6l7m8m8J%nonnqqm8J6no9j2N1N1N1KKn1n0KLR
2802a65RRRJ2J3J2J2j8j7j8j8J6J6p3rK7K7L2L1l2l2%Jj5j4L8L9J0J1J1J0k8k9o5jmll6K8
2790b04O0O0R8L6%Jm6J7Jj04m5J8mmP5P4N0N0J5J5l7j00k9L3L3l1k7L6l4l4l1l1K7K7nno1
2778a06o0M2J06P3P3l9m0m6m5j4j4M0L9QQK1K0K1K1n8n6L7L9K1K2p4p3p8p8L8L9ooK6K6%J
2767g2%%L9L8L9L9L6L6j7j7p9p7nmJ4J4o1o1k8k9M6M5j6j6L7L8N3N3k1k0l7l8l8l8j1j2j1
$$ plain form
2849 -117 -165 -213 -144 -75 -51 -28 -79 -130 -142 -154 -166 -178 -70 37 52 -38 -134 -124 -63 -2 -53 -105 -103 -101 -71 -41 -10 19 -1 -22 -75 -128 -167 -206 -171
2838 -171 -136 -90 -44 -115 -186 -195 -204 -102 -1 67 31 -59 -87 7 38 -29 -96 -118 -139 -68 2 32 0 -29 48 130 149 94 38 -7 -54 -47 -40 6 53 -36
2827 -36 -127 -68 -8 51 110 64 19 -73 -165 -229 -186 -110 -98 -79 3 110 153 151 85 11 1 42 20 -1 39 16 -69 -77 -22 -16 -9 0 10 1 -7 36 79 38
2815 38 -3 -41 -79 -103 -64 -60 -56 -78 -100 -117 -135 -124 -49 25 36 31 26 52 15 -33 -81 -80 -80 -85 -91 -96 -101 -109 -117 -165 -149 -154 -223 -235 -184 -133 -82 -80 -78 -129 -179 -177 -174 -165
2802 -165 -156 -147 -138 -126 -113 -101 -89 -107 -124 -142 -160 -144 -128 -201 -210 -183 -156 -124 -93 -125 -157 -157 -156 -171 -185 -147 -108 -98 -87 -76 -66 -94 -123 -188 -189 -193 -196 -232 -204
2790 -204 -144 -84 14 50 50 51 5 22 23 -81 -126 -108 -112 -116 -41 33 83 133 148 163 126 26 -3 30 63 32 5 41 7 -27 -58 -89 -62 -35 -40 -45 -106
2778 -106 -166 -124 -18 55 128 89 49 3 -42 -56 -70 -30 9 17 25 46 66 87 108 50 -6 31 70 91 113 39 -34 -112 -190 -152 -113 -119 -125 -99 -73 -73 -72
2767 -72 -72 -72 -33 5 44 83 119 155 138 121 42 -35 -40 -44 -30 -16 -77 -138 -166 -195 -149 -104 -120 -136 -99 -61 -8 45 24 4 -33 -71 -109 -147 -158 -170 -181
2755a81j2l6l7nnR3R2O1O0N2N2m4m3p1p2j9j9L0L1L0L1K1K1l0l1m3m3J0J0J1J0J1J1L2L1o2
2744e3o4m8m8O9O9R6R7k0k0o4o3j1j1L2L2L1L2m7m6m7m7j7j8j7j7l1l0NNK2Q5L5k8n9MN3j1
2733a50k2k1L0R4J01L9K1K1K2m1oollppLo0l1L1On7k6L7O0mj7j6k5k5OOk4k4k5k4J5J5J6J5
2720h6M3M3J0J1m5m6J%K1q5o2KJ5J5K7l7j9M4Rn5k8k8M2M3K0K0K0K0n3n4%%PQl9l8k3Q5O0
2708a32mJ1J2L9L9L3L2JJK4K4p1p1j9j9J3J2k3k3k0j9KO5R6L3p3p4o8L9O6Jl0l0J9J9P2P1
2697D8K2K2l0l1K2K3K3K2LLj15j13OOOOK3K3K2K2n0n0n0n1J1J1J0J1J1J1J1J1M6M6M5M6j07
2685b5j08j3j3J08J06P6P6j9j8j13j13n5n6K0J9j8j9n0n0j9j9N5N4j0j0O5O4J7J8J7J7k9k9
2675g4K4K3K1J9l1l3n6n7J4J4Jo3o5Q5N7m9j2j1NMNNQ4Q3qro5jN9m7r5l1j8M5Q8K4K8K8l2
$$ plain form
2755 -181 -193 -229 -266 -271 -276 -183 -91 -30 30 82 134 90 47 -24 -96 -115 -134 -104 -73 -43 -12 9 30 0 -31 -74 -117 -107 -97 -86 -76 -65 -54 -22 9 -53
2744 -53 -117 -165 -213 -144 -75 21 118 98 78 14 -49 -60 -71 -39 -7 24 56 9 -37 -84 -131 -148 -166 -183 -200 -231 -261 -256 -251 -229 -144 -109 -137 -196 -192 -139 -150
2733 -150 -172 -193 -163 -69 32 71 92 113 135 94 88 82 79 76 69 62 65 5 -26 5 11 -46 -72 -35 25 21 4 -12 -37 -62 -56 -50 -74 -98 -123 -147 -132 -117 -101 -86
2720 -86 -43 0 10 21 -24 -70 -69 -69 -48 -133 -195 -193 -178 -163 -136 -173 -192 -148 -139 -194 -222 -250 -208 -165 -145 -125 -105 -85 -138 -192 -192 -192 -185 -177 -216 -254 -277 -192 -132
2708 -132 -136 -125 -113 -74 -35 -2 30 31 32 56 80 9 -62 -81 -100 -87 -75 -98 -121 -141 -160 -158 -93 3 36 -37 -111 -179 -140 -74 -73 -103 -133 -114 -95 -23 48
2697 48 70 92 62 31 53 76 99 121 124 127 12 -101 -95 -89 -83 -77 -54 -31 -9 13 -37 -87 -137 -188 -177 -166 -156 -145 -134 -123 -112 -101 -55 -9 36 82 -25
2685 -25 -133 -146 -159 -51 55 131 207 188 170 57 -56 -111 -167 -147 -128 -146 -165 -215 -265 -284 -303 -248 -194 -204 -214 -149 -85 -68 -50 -33 -16 -45 -74
2675 -74 -50 -27 -6 13 -18 -51 -107 -164 -150 -136 -135 -198 -263 -178 -121 -170 -182 -193 -188 -184 -179 -174 -90 -7 -15 -24 -89 -90 -31 -78 -173 -204 -222 -177 -89 -65 -37 -9 -41
2663d1r4j19j3O7O7P4P3l8l8L6L4o2o4l2l2M5M4M0M1j8q1j1N3N2j2l9K4l6l6j8M5O8NrrPP
2651b0m7m6k6k7NNJKo7lO2O1K7l6o5o4j2j1K2Q5J8J7J1J0M6j7p0o9K2K2K3K3n2n1Q2Q2j4j4
2640h5l4l4J5J5Jo3o3JM4M3M8M7l3l4l7K6M3M2rp2k8L7n3n3j8M6L7L8P6J2m3m4lO0K4K5j5
2628d1j5n1J3N1N0no8l0l1l5l5M0L9M0L9K1K0oqrN4P2P2j7j6r0r0j15j15K3K4J9K0K0K0J2
2617a28J2k3L9MLk5k5k7k7lO1M7j7M7J10N9mo4o3o2M4N2j1l2l2l6l6L5L4J0n3n6RL2L2K6K6
2605d2onl3l3L0L1J4J5k2M3J0J2m3m4j3N1J5J5n1n0N5N4KJL3L3k9k9k8k8j8j7j8j7K0K1K0
2594e1K0k3k4n2n1q3j9R3R4Q1Q0k6k5p0p2%O2o1o2k6k6K1K0lo7m7J7J3J4J6Q0M5M4K5K5l9
2583g7l9N9N7K3K3k8r1l2L1K4l9%%MMNMl7l6nmK9K9l4l4nnJ02J01QQm8m9l4P2P1l5r1r2l5
$$ plain form
2663 -41 -135 -254 -267 -200 -133 -59 14 -24 -62 -26 8 -54 -118 -150 -182 -137 -93 -53 -12 -30 -111 -122 -69 -17 -29 -68 -44 -80 -116 -134 -89 -21 -16 -25 -34 -27 -20
2651 -20 -67 -113 -139 -166 -161 -156 -155 -153 -220 -223 -161 -100 -73 -109 -174 -238 -250 -261 -239 -154 -136 -119 -108 -98 -52 -69 -139 -208 -186 -164 -141 -118 -170 -221 -139 -57 -71 -85
2640 -85 -119 -153 -138 -123 -122 -185 -248 -247 -203 -160 -112 -65 -98 -132 -169 -143 -100 -58 -67 -139 -167 -130 -183 -236 -254 -208 -171 -133 -57 -45 -88 -132 -135 -75 -51 -26 -41
2628 -41 -56 -107 -94 -43 7 2 -66 -96 -127 -162 -197 -157 -118 -78 -39 -18 2 -4 -12 -21 33 105 177 160 144 54 -36 -151 -266 -243 -219 -200 -180 -160 -140 -128
2617 -128 -116 -139 -100 -96 -93 -118 -143 -170 -197 -200 -139 -92 -109 -62 48 107 103 39 -24 -86 -42 10 -1 -33 -65 -101 -137 -102 -68 -58 -111 -167 -158 -126 -94 -68 -42
2605 -42 -48 -53 -86 -119 -89 -58 -44 -29 -51 -8 2 14 -29 -73 -86 -35 -20 -5 -56 -106 -51 3 5 6 39 72 43 14 -14 -42 -60 -77 -95 -112 -92 -71 -51
2594 -51 -31 -54 -78 -130 -181 -264 -283 -190 -96 -15 65 39 14 -56 -128 -128 -66 -127 -189 -215 -241 -220 -200 -203 -270 -317 -300 -287 -273 -257 -177 -132 -88 -63 -38 -77
2583 -77 -116 -57 0 23 46 18 -73 -105 -74 -50 -89 -89 -89 -85 -81 -76 -72 -109 -145 -150 -154 -125 -96 -130 -164 -169 -174 -72 29 37 45 -3 -52 -86 -14 57 22 -69 -161 -196
2570a96l5P0P0OOp1p2L5L4J08J07JKPQQQk8k8k8k6rqrqNNk6k6rrp3p3N2N2K4K5P4J36J3r3
2558B9n3n4KLN4N3j4j4o1j26q5K0Q4Q4j6j6n7n8POllK9K9J5J5J6J5MNNMl1l1L3L2K5K5K4K4
2545B0J6J7J7J6M4M4k0k0j16j16n3n3J4J5J20J20O8O8l4l4p2rK7K6J6m7l9l9r8l4MMN3N3N6
2534C4ok0j9j9q4nnMO8O6Mj0rl4l3jkk6k6l1l0M3k1p4p4K2J29J33K6o6mK8K8m5m5q1j7OOL8
2522a52L7N2j2n0n1k0k1k0k1K8K8M2J05R4L1k8k8L1l2p0p1NNL7L7K5K4qp3q3j9oomllmK2K2
2510a60N0N0Mo0o0MK9K9k1k1L1L1jjl1l2K2K1K5K5ppJ5J6n9n9n3n3j4M9O6O7J05M3l0k9l4
2498e0l4j5j5j5j6L2L1L1L1poppl3l4l7K6M5M5k1k1L0R3M1k3RRp0o8k8k9MMj2j3M1M1O0O1
2486G3PQj1j1N7pm7m7K4K3m9m8m9m9m9n0n7OR5L1o2o3J0P4P3J1K9K9k7k8m5m5k8L6L3L2L7
$$ plain form
2570 -196 -231 -161 -91 -85 -79 -150 -222 -187 -153 -45 62 63 65 72 80 88 96 68 40 12 -14 -23 -31 -40 -48 -43 -38 -64 -90 -99 -108 -181 -254 -202 -150 -126 -101 -27 109 122 29
2558 29 -24 -78 -76 -73 -19 34 20 6 -55 -181 -266 -246 -162 -78 -94 -110 -167 -225 -218 -212 -215 -218 -189 -160 -145 -130 -114 -99 -95 -90 -85 -81 -112 -143 -110 -78 -53 -28 -4 20
2545 20 36 53 70 86 130 174 154 134 18 -98 -151 -204 -190 -175 -55 65 133 201 167 133 61 52 79 105 121 74 35 -4 -102 -136 -132 -128 -75 -22 34
2534 34 28 8 -11 -30 -114 -119 -124 -120 -52 14 18 8 -1 -35 -68 -69 -71 -97 -123 -154 -184 -141 -162 -236 -310 -288 -159 -26 0 -66 -70 -42 -14 -59 -104 -185 -202 -196 -190 -152
2522 -152 -115 -63 -75 -125 -176 -196 -217 -237 -258 -230 -202 -160 -55 39 70 42 14 45 13 -57 -128 -123 -118 -81 -44 -19 5 -3 -76 -159 -178 -184 -190 -194 -197 -200 -204 -182 -160
2510 -160 -110 -60 -56 -116 -176 -172 -143 -114 -135 -156 -125 -94 -95 -96 -127 -159 -137 -116 -91 -66 -73 -80 -65 -49 -108 -167 -220 -273 -287 -238 -172 -105 0 43 13 -16 -50
2498 -50 -84 -99 -114 -129 -145 -113 -82 -51 -20 -27 -33 -40 -47 -80 -114 -151 -125 -80 -35 -56 -77 -47 46 87 64 73 82 12 -56 -84 -113 -109 -105 -117 -130 -89 -48 12 73
2486 73 80 88 77 66 123 116 69 22 46 69 20 -28 -77 -126 -175 -225 -282 -276 -181 -150 -212 -275 -265 -191 -118 -107 -78 -49 -76 -104 -149 -194 -222 -186 -153 -121 -84
2475h4L7N1N1m3m3k8k8k8k7M0M0j3j3N4N4J6m6j4j3j3j3l4L0L0l3jjnnnom1K2L2L1l9l9j3
2463a40j4j4j3M3M4L0l3pN6J6J7j6j7p3p3r1J6O2O2J1J2J2J2j3j3N0N0k0k1k0Q5M1k2J7J6
2452E2P6J3n9n8kklkk3k3o0MJ4J3J8J7KKNOp2qJ9K0k7k8MNOOl3L0P3J0n7n7J6J7j1j1J2P6
2439b0M0M0O2O2m4m4l4l4l4l4l7l7L0R2P0Po0n8k1k2n3n3MMk8k8M9M9J7J8J2J1k0j9J7J8j4
2428i2j4p4p5j1j0j3j3J9J9K2K2j0j0k8k8MNPQO7O8no8o0o0o9oO5O5K9L0p0oR2R3R3j3l6l6
2416i9j4M9J6J7K0K0l0l0n9n8m3K1J2P7P1O9Mn8%%mmlmJo3m0m0K6R0N5N5K7K8l2l1l2l0n3
2403f9n4q9k5L2L2L6L7K6K6O1jm0m0K3m1l6l6O2O3J0n4p7p8KO5Q9Q8L2l3k8k8JJKJM3M5o1
2392a3o2NOL3L2K2m1o9p0jjjjQQRQk3k3k3k3onl7l7M7M8j2j2m0K4N5qm1m1J8J9J0J0k2k1O1
$$ plain form
2475 -84 -47 4 55 12 -31 -59 -87 -115 -142 -102 -62 -75 -88 -34 20 36 -10 -24 -37 -50 -63 -97 -67 -37 -70 -71 -72 -77 -82 -87 -93 -134 -112 -80 -49 -88 -127 -140
2463 -140 -154 -168 -181 -138 -94 -64 -97 -104 -48 -32 -15 -31 -48 -121 -194 -285 -269 -207 -145 -134 -122 -110 -98 -111 -124 -74 -24 -44 -65 -85 0 41 19 36 52
2452 52 128 141 82 24 22 20 17 15 -8 -31 -91 -87 -73 -60 -42 -25 -23 -21 -16 -10 -82 -90 -71 -51 -78 -106 -102 -97 -91 -85 -118 -88 -15 -5 -62 -119 -103 -86 -97 -108 -96 -20
2439 -20 20 60 122 184 140 96 62 28 -6 -40 -77 -114 -84 8 78 85 25 -33 -54 -76 -129 -182 -178 -174 -202 -230 -181 -132 -115 -97 -85 -74 -94 -113 -96 -78 -92
2428 -92 -106 -180 -255 -266 -276 -289 -302 -283 -264 -242 -220 -230 -240 -268 -296 -292 -287 -280 -272 -205 -137 -142 -210 -270 -330 -399 -405 -340 -275 -246 -216 -286 -292 -200 -107 -14 -27 -63 -99
2416 -99 -113 -64 -48 -31 -11 9 -21 -51 -110 -168 -211 -190 -178 -101 -30 39 43 -15 -15 -15 -19 -23 -26 -30 -29 -92 -132 -172 -146 -56 -1 54 81 109 77 46 14 -16 -69
2403 -69 -123 -212 -237 -205 -173 -137 -100 -74 -48 13 12 -28 -68 -45 -86 -122 -158 -96 -33 -23 -77 -154 -232 -230 -165 -76 12 44 11 -17 -45 -44 -43 -41 -40 3 48 -13
2392 -13 -75 -70 -64 -31 1 23 -18 -87 -157 -158 -159 -160 -161 -153 -145 -136 -128 -151 -174 -197 -220 -226 -231 -268 -305 -258 -210 -222 -234 -274 -250 -195 -203 -244 -285 -267 -248 -238 -228 -250 -271 -210
2379b10O1kkM6M6j8j8J5J5M3M1lo5l1l1PPPOj5j5j5j5K9K8%o3K6K6oopN7M8M8m3j08m4K0O2
2366g9O3KLj%l2l3M8M6M3o1l5l5j0rK6K6ooL0K9L0L0M3M3k8r2r5r6M5M4M3k1n3J1M3M4j6j6
2354c2pooomlmlMNo0M7R4L0l2l2j7j7j7j7oononojkl3L1L5k8k1M3O3O2Pn5o0MK7l7o5jN1N1
2340d6m8m8o9oJ01L6o8o8kO2J01J01P4J0j4p8k1M1Nn9j8j9o2o1k0Q7j2p5j0N5L2l2j9k0j8
2329a88M6P8J5LML2L1m3m4j6M8K8K8Nn9kko9p0q1q1K6K5K9K8K8K8J5J6J5J5l9l9l9l9M7M8
2318a73K4m0o8mN8N8N5ql7l6J1J2L9L9N1j3qrJ3J3k7L7Rn5k3M0Q9K6%o5o2%L3l2j3N1L8L9
2306F2P2Qj9k0k3k4k3k4l9m1m4J9O3O1L9k5n5n5MML4L2k9l0n0n1J3J4P7P6L0p4l3l2l9l9K4
2294a37K3m0m0m9m9N5J18R7n3j30k4L8L9P7P6m2m2j1j0l9l9l9m0O0N9N9N9m3m3p5p5m7m7O0
$$ plain form
2379 -210 -149 -151 -153 -107 -61 -79 -97 -82 -67 -24 17 14 -51 -82 -113 -106 -99 -92 -86 -101 -116 -131 -146 -117 -89 -89 -152 -126 -100 -106 -112 -119 -62 -14 34 -9 -117 -161 -141 -79
2366 -79 -16 -14 -11 -12 -12 -44 -77 -29 17 60 -1 -36 -71 -81 -90 -64 -38 -44 -50 -20 9 39 69 112 155 127 35 -60 -156 -111 -67 -24 -45 -98 -87 -44 0 -16 -32
2354 -32 -39 -45 -51 -57 -61 -64 -68 -71 -67 -62 -122 -75 19 49 17 -15 -32 -49 -66 -83 -89 -95 -100 -106 -111 -117 -118 -120 -153 -122 -87 -115 -136 -93 -30 32 39 -16 -76 -72 -45 -82 -147 -148 -97 -46
2340 -46 -94 -142 -211 -217 -116 -80 -148 -216 -218 -156 -55 46 120 130 116 38 17 58 63 4 -14 -33 -95 -156 -176 -89 -101 -176 -186 -131 -99 -131 -150 -170 -188
2329 -188 -142 -64 -49 -46 -42 -10 21 -22 -66 -82 -34 -6 22 27 -32 -34 -36 -105 -175 -256 -337 -311 -286 -257 -229 -201 -173 -158 -142 -127 -112 -151 -190 -229 -268 -221 -173
2318 -173 -149 -189 -257 -261 -203 -145 -90 -98 -135 -171 -160 -148 -109 -70 -19 -32 -40 -49 -36 -23 -50 -13 -4 -59 -82 -42 47 73 73 8 -54 -54 -21 -53 -66 -15 23 62
2306 62 134 142 123 103 80 56 33 9 -30 -71 -115 -96 -33 28 67 42 -13 -68 -64 -60 -26 6 -23 -53 -103 -154 -141 -127 -50 26 56 -18 -51 -83 -122 -161 -137
2294 -137 -114 -154 -194 -243 -292 -237 -119 -22 -75 -205 -229 -191 -152 -75 1 -41 -83 -94 -104 -143 -182 -221 -261 -201 -142 -83 -24 -67 -110 -185 -260 -307 -354 -294
2284b94N9N1N1J9J9j5j5M9M9P0P1PPl2l2o4o2r2r2J5J4K0K0j2j2j7j7M7M6NML6L6qrrqjj%
2271i7jJKl1l0l2l1P5P5O0N9lmr6r7l4l3O2O3L0L1M2M4k1k0qpqpk0k0k0j9j8j8j7j8jjk8k9
2259b25o6jO8O9L3L4Rn4l9K5Q5K0m6m7N1N2N2j0l7l9jkkjJ3J3K0m2q7k3L9M0M1k3j9j8J5J5
2247h8J5J5L5L4L4L5J7J7N4j1l2l1l6l6L3L2l1l1j7j6m9m9n2n2k5M0L3L4o3KM0M0o2o2j3j3
2236b59J2P4R9L4l2l2L9L9M6j7m5J7J0RL5L6L9o7p3L3O5Ko6o8m8J6L1l2k5k4RJ0J0J0J5J6
2225h2J6J6o5o5l7K6L6L6k4k3J9J9j6M7N2N2m9n0m7m7J7J7qpJ7Q0Rn4n1J3J7J8K1K1j2j1j2
2213a11j1N5N5rro6o6%O4R9L7N3j1n2J2LMK1K1j0j1p1p2m4J9ooO1O0J02J02J3r3p1p0p3p3
2202a54l9K5poN2J16N1j1ppl8l9oN7K1q4o3JO5O4MLL5L5KKl0l0m5m6m5m6kkO2O2J3J3J3J2
$$ plain form
2284 -294 -235 -184 -133 -114 -95 -110 -125 -76 -27 43 114 121 128 96 64 0 -62 -154 -246 -231 -217 -197 -177 -189 -201 -218 -235 -188 -142 -137 -133 -97 -61 -69 -78 -87 -95 -96 -97 -97
2271 -97 -98 -97 -95 -126 -156 -188 -219 -144 -69 -9 50 47 43 -53 -150 -184 -217 -155 -92 -62 -31 11 55 34 14 6 -1 -9 -16 -36 -56 -76 -95 -113 -131 -148 -166 -167 -168 -196 -225
2259 -225 -291 -292 -224 -155 -122 -88 -79 -133 -172 -147 -62 -42 -88 -135 -84 -32 20 10 -27 -66 -67 -69 -71 -72 -59 -46 -26 -68 -155 -178 -139 -99 -58 -81 -100 -118 -103 -88
2247 -88 -73 -58 -23 11 45 80 97 114 168 157 125 94 58 22 55 87 56 25 8 -8 -57 -106 -158 -210 -235 -195 -162 -128 -191 -189 -149 -109 -171 -233 -246 -259
2236 -259 -247 -173 -74 -40 -72 -104 -65 -26 20 3 -42 -25 -15 -6 29 65 104 37 -36 -3 62 64 -2 -70 -118 -102 -71 -103 -128 -152 -143 -133 -123 -113 -98 -82
2225 -82 -66 -50 -115 -180 -217 -191 -155 -119 -143 -166 -147 -128 -144 -97 -45 7 -42 -92 -139 -186 -169 -152 -160 -167 -150 -70 -61 -115 -166 -153 -136 -118 -97 -76 -88 -99 -111
2213 -111 -122 -67 -12 -21 -30 -96 -162 -162 -98 1 38 91 80 28 40 43 47 68 89 79 68 -3 -75 -119 -100 -106 -112 -51 9 111 213 226 133 62 -8 -81 -154
2202 -154 -193 -168 -175 -181 -129 -13 38 27 20 13 -25 -64 -70 -13 8 -76 -139 -138 -73 -9 -5 -2 33 68 70 72 42 12 -33 -79 -124 -170 -172 -174 -112 -50 -37 -24 -11 1
2189AKLL8k5l6l7p7j4J06J04L9k4l3l2nnQPjO3M3k0J9J9o2o3KJk4k5n6n7N8N8N7N8k6k6k6
2177A2k6QOPPk1k3M0M1K4K3qqk1k1k1k0k2k2k2k1PPQPM3M2M3M2n0n1j8j9opp1p0jjO3O3M6
2164a1M5j8j7KLLLj8j9k0j9J0RJ0J0j2j1j2j1K6K7K5K6J9J8j4j3opo9o9o4o4%%N0N0J8J8M8
2152e4M8M6M8l1l1l0l1j8j8j8j8PPk6k5N1N1n5n5o1o2M5M5j6j6M7M7L0K9l4l5k3k4N1N1K5
2140e3K5j4p7q2q2k6L8R0R1kjl7l6l3l2lO1k8k8PPL9L8O3O2j5j6K4m0PP0Mj02p4j1L0L0n8
2129a64n7mO1O0lj0j1P7P6O3jo1o0j9k0j9j9M7M6M6M6ppppj7j6j6j7l3l3K1K0m1m1K9K9J4
2117e5m9j7M7P1P0n9n8j6M7J2J1jjk%j6j6N6N8J3J3RRL6k8m5m5k6k5M5j8l4K8K1K1k1k1r4
2105h0r6k0k0k1k0l3l3l3l3K1K0K0K1R8R9K4K5j5j5J7J7j3j4j3j4PPPPN3N3%Jq0q1k8k8k9
$$ plain form
2189 1 3 6 44 19 -17 -54 -131 -145 -39 65 104 80 47 15 10 5 13 20 19 82 125 105 124 143 81 18 20 21 -3 -28 -84 -141 -83 -25 32 90 64 38 12
2177 12 -14 -6 0 7 14 -7 -30 10 51 75 98 90 82 61 40 19 -1 -23 -45 -67 -88 -81 -74 -66 -59 -16 26 69 111 61 10 -8 -27 -33 -40 -111 -181 -182 -183 -120 -57 -11
2164 -11 34 16 -1 1 4 7 10 -8 -27 -47 -66 -56 -47 -37 -27 -39 -50 -62 -73 -47 -20 5 31 50 68 54 41 35 28 -41 -110 -174 -238 -238 -238 -188 -138 -120 -102 -54
2152 -54 -6 40 88 57 26 -4 -35 -53 -71 -89 -107 -100 -93 -119 -144 -93 -42 -97 -152 -213 -275 -230 -185 -201 -217 -170 -123 -93 -64 -98 -133 -156 -180 -129 -78 -53
2140 -53 -28 -42 -119 -201 -283 -309 -271 -181 -90 -92 -93 -130 -166 -199 -231 -234 -173 -201 -229 -222 -215 -176 -138 -75 -13 -28 -44 -20 -60 -53 17 21 -81 -155 -166 -136 -106 -164
2129 -164 -221 -225 -164 -104 -107 -117 -128 -51 25 88 87 26 -34 -53 -73 -92 -111 -64 -18 28 74 67 60 53 46 29 13 -3 -20 -53 -86 -65 -45 -86 -127 -98 -69 -55
2117 -55 -104 -121 -74 -3 67 8 -50 -66 -19 -7 4 3 2 0 0 -16 -32 24 82 95 108 117 126 162 134 89 44 18 -7 38 20 -14 14 35 56 35 14 -80
2105 -80 -176 -196 -216 -237 -257 -290 -323 -356 -389 -368 -348 -328 -307 -209 -110 -86 -61 -76 -91 -74 -57 -70 -84 -97 -111 -104 -97 -90 -83 -30 23 23 24 -56 -137 -165 -193 -222
2093b22k8LMj0j0j0j0N4N4N4N4K2K1n2n3M8M8M8M8j9k0L4L4j1j2j1j1JKN4N5J4J5J5J5n7n7
2082A04mmk8k9k9k8p1p0LMn5n4kjQ8Q9Q8Q9j5j5j5j5l5l7mnr3r4j9j9O1O0O1O1K2K1K2K2N0
2070A04N1llk2k2J0J0m1m2p2p3j%N2N2k5k6k6k6L3L4n9n8n2J2MMQ1J7j1j0M2M3k1k1k5k5L9
2058g6L9%%J%l9m0j1N2K4K5l1l1l2L1N9N9J9J9m5m4m4m5m5m4K3K3K3K4K8K8O8Mq4k2Q6Q8p2
2046A8p0m0m0j7j7j7j7j5j5j5j5K7K8K7K7RRM9j6k1M3J01L8l0l1l3l5k6k6L8L7LKJ1n3rN5
2035c6J1J1j9q3J6J7QRkO2N5m9n1n0m4m5k0M3N4j0l4l3P2P2m1j04l6l5L1R4M1M0j9j9j8j7
2024a29J4J5N3N2r4r6n2n2J1J1N1N0n5n6O8O7L6L6k4k5PPk6k7NNl8l9K5K5L3L3JJJ5J6J6J5
2012d5mnnnJ3J3J3J3m1m0rrn4n5J0RN3N2n3n4j2j2N2N2j6j7M7M7J7J7M8M9K7K8l6l6jjL1L1
$$ plain form
2093 -222 -250 -247 -243 -253 -263 -273 -283 -229 -175 -121 -67 -45 -24 -76 -129 -81 -33 15 63 44 24 58 92 81 69 58 47 48 50 104 159 173 188 203 218 161 104
2082 104 100 96 68 39 10 -18 -89 -159 -156 -152 -207 -261 -263 -264 -176 -87 1 90 75 60 45 30 -5 -42 -46 -51 -144 -238 -257 -276 -215 -155 -94 -33 -11 10 32 54 104
2070 104 155 152 149 127 105 115 125 84 42 -30 -103 -104 -104 -52 0 -25 -51 -77 -103 -70 -36 -95 -153 -205 -193 -189 -185 -104 -87 -98 -108 -66 -23 -44 -65 -90 -115 -76
2058 -76 -37 -37 -37 -36 -36 -75 -115 -126 -74 -50 -25 -56 -87 -119 -88 -29 30 49 68 23 -21 -65 -110 -155 -199 -176 -153 -130 -106 -78 -50 18 22 -62 -84 2 90 18
2046 18 -52 -92 -132 -149 -166 -183 -200 -215 -230 -245 -260 -233 -205 -178 -151 -142 -133 -84 -100 -121 -78 23 61 31 0 -33 -68 -94 -120 -82 -45 -42 -40 -29 -82 -91 -36
2035 -36 -25 -14 -33 -116 -100 -83 -75 -66 -68 -6 49 0 -51 -101 -145 -190 -210 -167 -113 -123 -157 -190 -118 -46 -87 -191 -227 -262 -231 -137 -96 -56 -75 -94 -112 -129
2024 -129 -115 -100 -47 5 -89 -185 -237 -289 -278 -267 -216 -166 -221 -277 -209 -142 -106 -70 -94 -119 -112 -105 -131 -158 -153 -148 -186 -225 -200 -175 -142 -109 -108 -107 -92 -76 -60 -45
2012 -45 -49 -54 -59 -64 -51 -38 -25 -12 -53 -93 -102 -111 -165 -220 -210 -201 -148 -96 -149 -203 -215 -227 -175 -123 -139 -156 -109 -62 -45 -28 20 69 96 124 88 52 51 50 81 112
1999A12rrK3K4k9k8k8k9m7m9m9m9P4P5J0J0RRk3k3nonoK2K2K0K2j4j5j3j5m4m3O2O2L5L5k9
1987E9k8m9n0J4J4J6J5m8m8K1K2m2m2k0j9J3J2j3j3j6R0J31K6n5n7k3k4M1M0L3L4l0k9p4p4
1976a73P1P1Rn4j9j9j2j2p2p2lO0O4%J4P8L7L7j9k1k0k0k3k2k2k2K0K0j2j2K6K6K9p8j28k2
1965b95O1O0M8M8J6J6k5k6o5kmo7k8k8K9K8K9K8k0k0k0k0j3j2J5J6R7L3l7l7j7j6M3M3K3m2
1954a61rN5J9K0K4K4NOn8n8l8l8l8l8N7N6pqL1L1k8k9l5K8N7n0n7OK8K8M0M0M9j6qN5J5r0
1942i2q9k5L8L9L6L6L6L5L0K9K9L0l8l9l8l7lklkr0q9j9M4L1L1O2O2M3k1m7m8o9o9lO1J03
1931d8L9k4k3l0L4L7k6k8L5L2l3M1M1k6k6J6J7j5j4k1k1J0J1j1j1m2m3l2l1L2L2L3L2J%K7
1920c5K7l6l7OPk6k6QRQQkkJ00J00M3k1m9m9k3k2RQJ1J1J1J0K8K7K8K7n5n6NMJo2r1k7PP0
$$ plain form
1999 112 103 94 117 141 112 84 56 27 -20 -69 -118 -167 -93 -18 -8 2 11 20 -3 -26 -31 -37 -42 -48 -26 -4 16 38 24 9 -4 -19 -63 -106 -44 18 53 88 59
1987 59 31 -18 -68 -54 -40 -24 -9 -57 -105 -84 -62 -104 -146 -166 -185 -172 -160 -173 -186 -202 -112 19 45 -10 -67 -90 -114 -73 -33 0 34 4 -25 -99 -173
1976 -173 -102 -31 -22 -76 -95 -114 -126 -138 -210 -282 -285 -225 -161 -161 -147 -69 -32 5 -14 -35 -55 -75 -98 -120 -142 -164 -144 -124 -136 -148 -122 -96 -67 -145 -273 -295
1965 -295 -234 -174 -126 -78 -62 -46 -71 -97 -162 -164 -168 -235 -263 -291 -262 -234 -205 -177 -197 -217 -237 -257 -270 -282 -267 -251 -154 -121 -158 -195 -212 -228 -185 -142 -119 -161
1954 -161 -170 -115 -96 -76 -52 -28 -23 -17 -75 -133 -171 -209 -247 -285 -228 -172 -179 -187 -156 -125 -153 -182 -217 -189 -132 -182 -239 -233 -205 -177 -137 -97 -48 -64 -72 -17 -2 -92
1942 -92 -181 -206 -168 -129 -93 -57 -21 14 44 73 102 132 94 55 17 -20 -23 -25 -28 -30 -120 -209 -228 -184 -153 -122 -60 2 45 24 -23 -71 -140 -209 -212 -151 -48
1931 -48 -9 -33 -56 -86 -52 -15 -41 -69 -34 -2 -35 6 47 21 -5 11 28 13 -1 -22 -43 -33 -22 -33 -44 -86 -129 -161 -192 -160 -128 -95 -63 -62 -62 -35
1920 -35 -8 -44 -81 -75 -68 -94 -120 -112 -103 -95 -87 -89 -91 9 109 152 131 82 33 10 -12 -3 5 16 27 38 48 76 103 131 158 103 47 52 56 57 -5 -96 -123 -116 -46
1907d6P3J1q3q5K1Q4N9mk7k7OOOOm3m3K1K1j1j1N3N1k2k2k7k7K2m2j05m2L4L5OPL5L4k9k9
1895a34k0j9J25J25Q9K6m4m5j5j6j5j6o9p0m2K1L1L0KKk4k4Q3Q1K6K6l8l7n9o0n9M6K6l8k7
1884a32k7N6N6qqJ1J2J1J1N2N3n3n3J2J1m7m8qN5Q3Q3k9k9l0k9j6j7j7j7J4J3J0RM8j4p8j4
1873g4m9m9K1Q5L1l3n2n2n7QL5L5qqqqL7L7O9OJ7m6n4Rj2p7m0K3N1N1onL7R9J00L7r2r2l2
1861f6l3nmm1K3O1O1m1m1l1l1oN7O9Oj8j8j7j6j7j7mmj%%O4K8K8j8j8k2M1O4O5K6p9o2Jm2
1848e8m1PQM3k0QQMMQRL5L7j4p7j8M5J5m7l9m0k4k3n1n1P6J40L3l0k7k7qN7Q9K6m0l9j8j8
1836e8m9n0QPM0M0opl8l8J4J5j8j8L7L7k7k7j3j3m9J4J4J3J7J7J3J3M9j5k3k4k4k4rN4J9J8
1824i1J0J0J0J0M8M7M1M1N4n2j09j09nnO6O4N9no0n9o1LK1K1k7k7K7K7m0l9l5l5l4L0R0Q9
$$ plain form
1907 -46 27 38 -45 -130 -109 -25 34 30 3 -24 -18 -12 -6 0 -43 -86 -65 -44 -55 -66 -13 38 16 -6 -33 -60 -38 -80 -185 -227 -193 -158 -152 -145 -110 -76 -105 -134
1895 -134 -154 -173 -48 77 166 192 148 103 88 72 57 41 -28 -98 -140 -119 -88 -58 -56 -54 -78 -102 -19 62 88 114 76 39 -20 -80 -139 -93 -67 -105 -132
1884 -132 -159 -103 -47 -55 -63 -52 -40 -29 -18 34 87 34 -19 -7 4 -43 -91 -99 -44 39 122 93 64 34 5 -11 -28 -45 -62 -48 -35 -25 -16 32 18 -60 -74
1873 -74 -123 -172 -151 -66 -35 -68 -120 -172 -229 -221 -186 -151 -159 -167 -175 -183 -146 -109 -40 -34 -17 -63 -117 -108 -120 -197 -237 -214 -163 -112 -118 -123 -86 13 113 150 58 -34 -66
1861 -66 -99 -104 -108 -149 -126 -65 -4 -45 -86 -117 -148 -154 -97 -28 -22 -40 -58 -75 -91 -108 -125 -129 -133 -134 -134 -134 -70 -42 -14 -32 -50 -72 -31 33 98 124 45 -17 -16 -58
1848 -58 -99 -92 -84 -41 -61 -53 -45 -41 -37 -29 -20 15 52 38 -39 -57 -12 3 -44 -83 -123 -147 -170 -221 -272 -196 -56 -23 -53 -80 -107 -115 -58 31 57 17 -22 -40 -58
1836 -58 -107 -157 -149 -142 -102 -62 -68 -75 -113 -151 -137 -122 -140 -158 -121 -84 -111 -138 -151 -164 -213 -199 -185 -172 -155 -138 -125 -112 -63 -78 -101 -125 -149 -173 -182 -128 -109 -91
1824 -91 -81 -71 -61 -51 -3 44 85 126 180 128 19 -90 -95 -100 -34 30 89 84 24 -35 -96 -93 -72 -51 -78 -105 -78 -51 -91 -130 -165 -200 -234 -204 -114 -25
1813b5nnj9q2j10m5J0J0O7O8J14J13Lj03j03KM9M8o2o2L3L3JJj3j3j3j3k9l0NO8P9J5l7l7
1802h7K1Q4N4j0j8j8k1k1j1j1K1K0m8m8K5K6M4M5J3J4n2n1n2n2L0K9L0K9J1J0k0k1p1p1n5
1791b32J0M5M6M9N0j7j7j7j7L9L8l6l6mnm4K0M4j9l2l2j2j1K4l9J2J3l2L2J14M9m4m5kO1N6
1780IN7Q0Q1K8p9j44p9k8k7j2j2j2j2ooooL9L9L9L8oopok3k3n9NkkL4L4qro1o1k5k5K8K8K0
1767a93J9J9K0P9P9k0j9L7k5j00l6K3K2K7K7j1j0K1K2L2L4k0k0j1j2K6l5n7QK1K1kkjkk2k2
1756h3j9j8qN6N5qKJK4K5P1Pl2l1J4J5J4J4o9o8K7K5M1M0j9q2p6p5m5J9L9k5l8l8P5P4M2M3
1744a1j0rm1m1o0o0poK4K5P7P8M6M7M8M7O1O2p6p6m9m9m8m8j8j7J4J4J0J0M2M1L4L4L4L4l6
1732A20l6l6l6l4l6lmM0L9L9M0j4j4m6m5l8l8J2J1L6k7n2N4N7N6j1j1l4l4l5l5O9O9nnj1j0
$$ plain form
1813 -25 -30 -35 -54 -136 -246 -291 -281 -271 -204 -136 -22 91 94 -9 -112 -110 -61 -13 -75 -137 -104 -71 -70 -69 -82 -95 -108 -121 -150 -180 -175 -107 -28 -13 -50 -87
1802 -87 -66 18 72 62 44 26 5 -16 -27 -38 -17 3 -45 -93 -68 -42 2 47 60 74 22 -29 -81 -133 -103 -74 -44 -15 -4 6 -14 -35 -106 -177 -232
1791 -232 -222 -177 -131 -82 -32 -49 -66 -83 -100 -61 -23 -59 -95 -99 -104 -148 -128 -84 -103 -135 -167 -179 -190 -166 -205 -193 -180 -212 -180 -66 -17 -61 -106 -108 -47 9
1780 9 66 146 227 255 176 32 -47 -75 -102 -114 -126 -138 -150 -156 -162 -168 -174 -135 -96 -57 -19 -25 -31 -38 -44 -67 -90 -149 -144 -146 -148 -114 -80 -88 -97 -158 -219 -244 -269 -241 -213 -193
1767 -193 -174 -155 -135 -56 23 3 -16 21 -4 -104 -140 -117 -95 -68 -41 -52 -62 -41 -19 13 47 27 7 -4 -16 10 -25 -82 -74 -53 -32 -34 -36 -37 -39 -61 -83
1756 -83 -102 -120 -128 -72 -17 -25 -23 -22 2 27 98 105 73 42 56 71 85 99 30 -38 -11 14 55 95 76 -6 -82 -157 -202 -183 -144 -169 -207 -245 -170 -96 -54 -11
1744 -11 -21 -30 -71 -112 -172 -232 -239 -245 -221 -196 -119 -41 5 52 100 147 208 270 194 118 69 20 -28 -76 -94 -111 -97 -83 -73 -63 -21 20 54 88 122 156 120
1732 120 84 48 12 -22 -58 -61 -65 -25 14 53 93 79 65 19 -26 -64 -102 -90 -79 -43 -70 -122 -68 -11 45 34 23 -11 -45 -80 -115 -46 23 18 13 2 -8
1721hk1q6j4R3N9m5k2M1N0N2l4l5l4l4k3k4L0L0j4j4m5m6q1q2L5L6R9R9K4K4J8J8J8J8k3k3
1710C6k3k2M0M2M1M1NOk7k7n3n3K2K2QRk3k3RQm3m4m1m1J2J3M4M4l1l0k9k9M5M5noK7K6PR
1697A1o5o6M2M2j1j1j7j8j7j7ppopq9q8PPj9j8P7P8llklm0m0J4J3K1K1K2K1M3M3j0j0l2l2
1685a76j%ONOOK8K8mmk3k3L0L0R3R3k3k4o6o7PPO5O4rrk6k5k6k6p3p3k0k1m7m8P0O9O4O3J0
1672g0J0m2m2j0j0J6J6J6J7j%%jk1k1k1k2J2J1L9L9Nn8k3k2J8J8J9J8QQk0j9m0K4K4m0j6j6
1660a97J1J2M7M8M7M7R0R0L7o9j14m9LLl3l3kkj1j1K1K1J1J2m2m1nnjjJ6Q0rrk7k7o3JM6M7
1648f1M6M6m1j04q0K6O1lQQj7j7j7j7j8j7m6m6qN6K4m0q6q7j0N4O4O5L6L7J4J5j7j7k5k6k5
1636b65k5K3K3K4K3n7n6J7J8L8L7K0m3l4l4k0M3QPJ1J1N2N3Q4Q3k9k9On7l9l8J1J1L9L8PP
$$ plain form
1721 -8 -29 -115 -129 -36 23 -22 -44 -3 47 99 65 30 -4 -38 -61 -85 -55 -25 -39 -53 -98 -144 -225 -307 -272 -236 -137 -38 -14 10 28 46 64 82 59 36
1710 36 13 -9 31 73 114 155 160 166 139 112 59 6 28 50 58 67 44 21 30 38 -5 -49 -90 -131 -119 -106 -62 -18 -49 -79 -108 -137 -92 -47 -52 -58 -31 -5 2 11
1697 11 -54 -120 -78 -36 -47 -58 -75 -93 -110 -127 -134 -141 -147 -154 -243 -331 -324 -317 -336 -354 -277 -199 -202 -205 -207 -210 -250 -290 -276 -263 -242 -221 -199 -178 -135 -92 -102 -112 -144 -176
1685 -176 -177 -177 -171 -166 -160 -154 -126 -98 -102 -106 -129 -152 -122 -92 1 94 71 47 -19 -86 -79 -72 -7 57 48 39 13 -12 -38 -64 -137 -210 -230 -251 -298 -346 -276 -207 -143 -80 -70
1672 -70 -60 -102 -144 -154 -164 -148 -132 -116 -99 -100 -100 -100 -101 -122 -143 -164 -186 -174 -163 -124 -85 -80 -138 -161 -183 -165 -147 -128 -110 -102 -94 -114 -133 -173 -149 -125 -165 -181 -197
1660 -197 -186 -174 -127 -79 -32 15 105 195 232 163 49 0 3 6 -27 -60 -62 -64 -75 -86 -65 -44 -33 -21 -63 -104 -109 -114 -115 -116 -100 -20 -29 -38 -65 -92 -155 -154 -108 -61
1648 -61 -15 31 -10 -114 -194 -168 -107 -110 -102 -94 -111 -128 -145 -162 -180 -197 -243 -289 -297 -241 -217 -257 -343 -430 -440 -386 -322 -257 -221 -184 -170 -155 -172 -189 -214 -240 -265
1636 -265 -290 -267 -244 -220 -197 -254 -310 -293 -275 -237 -200 -180 -223 -257 -291 -311 -268 -260 -253 -242 -231 -179 -126 -42 41 12 -17 -11 -68 -107 -145 -134 -123 -84 -46 -39 -32
1625c2m1m1R7R7l8l8j11j13L2L2L2L2O4O3j0rr2r3M5M5K2K1j0j0K0K0n4n4m2m2j0j0k2k2P3
1614a99P4N3N4K1K2j5j4o8o8rrK2K3L3L2L3L2j4j2J4J4l8j03r3L3J28%NNJ1J1O2O4NMl5l5
1602D3L1r6r2k9j6j6K0K0j0j0j0j0K0K0nmk2J06J00L8J7J6m1m0k6k5M7M8j6j6q9r1n6n6M0
1592b10M0llK9K8K9K9k4k4M1M1l4l3QRQRonM8M6JJn2n2n0n0QPQ1J43N5n1j08m6QQM4M2rrj
1579g%L0L2l8l6nnK4K3K4K4rqo1o2qrn5n5k2Q4J21J19O7O8ppn7n8n7n6ppppLLMLK1K0l1l2
1565d3rqm0m0K7K8K7K7J3J2J1J2lklkk4k4k4k5k6k7ONl2l3K1K1J3J4m0m0L3L2L3L3M1M0n3
1553d9n4l0l1K3K3l0l0l0l0Q3Q3RRj7j7J4J5k0j9j9k0m3m4P3P3Q4Q6J1J1opo0n9r6r7M1M1
1542a29poJ10J09QRk4k4J6J5j6j6M7M7p0o9m6m6m7m6L4L4L4L4k6k6k7k6K4K4K4K4K3K2K2K2
$$ plain form
1625 -32 -73 -114 -17 80 42 4 -107 -220 -188 -156 -124 -92 -28 35 25 16 -76 -169 -124 -79 -57 -36 -46 -56 -36 -16 -70 -124 -166 -208 -218 -228 -250 -272 -199
1614 -199 -125 -72 -18 3 25 10 -4 -72 -140 -149 -158 -136 -113 -80 -48 -15 17 3 -9 5 19 -19 -122 -215 -182 -54 -54 -49 -44 -33 -22 40 104 109 113 78 43
1602 43 74 -22 -114 -143 -159 -175 -155 -135 -145 -155 -165 -175 -155 -135 -140 -144 -166 -60 40 78 95 111 70 30 4 -21 26 74 58 42 -47 -138 -194 -250 -210
1592 -210 -170 -173 -176 -147 -119 -90 -61 -85 -109 -68 -27 -61 -94 -86 -77 -69 -60 -66 -71 -23 23 24 25 -27 -79 -129 -179 -171 -164 -83 60 115 64 -44 -90 -82 -74 -30 12 3 -6 -7
1579 -7 -7 23 55 17 -19 -24 -29 -5 18 42 66 57 49 -12 -74 -82 -91 -146 -201 -223 -139 -18 101 168 236 229 222 165 107 50 -6 -13 -20 -27 -34 -31 -28 -24 -21 0 20 -11 -43
1565 -43 -52 -60 -100 -140 -113 -85 -58 -31 -18 -6 5 17 14 12 9 7 -17 -41 -65 -90 -116 -143 -137 -132 -164 -197 -176 -155 -142 -128 -168 -208 -175 -143 -110 -77 -36 4 -49
1553 -49 -103 -133 -164 -141 -118 -148 -178 -208 -238 -155 -72 -63 -54 -71 -88 -74 -59 -79 -98 -117 -137 -180 -224 -151 -78 6 92 103 114 108 101 41 -18 -114 -211 -170 -129
1542 -129 -136 -142 -32 77 85 94 70 46 62 77 61 45 92 139 69 0 -46 -92 -139 -185 -151 -117 -83 -49 -75 -101 -128 -154 -130 -106 -82 -58 -35 -13 9 31
1530C1l2l3l4l3llllNMMNN0M9m4m5QRQRPPPPK4K5m9m9nonnq5q6L1L2O0N9K8K8J2J1m1m2J2
1516g4J3J2J2K7K6m6m7QQRQP0P1k5k5K4K3K4K4O3O3p6p5m6m6j5j3k6k6k5k6N5N4KKn9n9n9
1505a70n9N7N7MMJ5J5J5J5L6L6L6L6j1j0j1j1P9Q0l8l7K5K5m9n0mmmmlllkj5j5m5m7K8K9m6
1492d9m6K1K0N3N2L0L1k2k3j1j1j2j1m0m1J2J2PPN9O0o8o8ONJ3J2o2o2J6J7J7J7l3l3K0K0
1481h5OONOo8o9l6l6M0M0j3j3K9L0Q3Q1m2m4j2j1P7P6K3K4l4l5j08j09LLN6N6J0J1k2k2qq
1469a10rqL3L3L2L2NMj05j06jJ04J12M9OPp2p1j21j21o4M2R4R4K7K6MMMMJ3J3J2J3k7k7k7
1458a02k7j3j4j3j4L0L0K9L0k8k8K6K5MLLMPQPQk0j9k0k0K0K0l3l4qrK3K3J9J9p7p7%jN3N3
1445a13J0J0J0J1J3J4J4J3j9k0j9k0J0RRRj5j4N3N2N4n2q0j7j5j6j1j1j7j8L6L6opl8l8L1
$$ plain form
1530 31 -1 -34 -68 -101 -104 -107 -110 -113 -108 -104 -100 -95 -45 4 -40 -85 -77 -68 -60 -51 -44 -37 -30 -23 1 26 -23 -72 -77 -83 -88 -93 -178 -264 -233 -201 -141 -82 -54 -26 -14 -3 -44 -86 -74
1516 -74 -61 -49 -37 -10 16 -30 -77 -69 -61 -52 -44 26 97 72 47 71 94 118 142 205 268 192 117 71 25 10 -3 -29 -55 -80 -106 -51 3 5 7 -52 -111 -170
1505 -170 -229 -172 -115 -111 -107 -92 -77 -62 -47 -11 25 61 97 86 76 65 54 133 213 175 138 163 188 139 89 85 81 77 73 70 67 64 62 47 32 -13 -60 -32 -3 -49
1492 -49 -95 -74 -54 -1 51 81 112 90 67 56 45 33 22 -18 -59 -47 -35 -28 -21 38 98 30 -38 -32 -27 -14 -2 -64 -126 -110 -93 -76 -59 -92 -125 -105 -85
1481 -85 -79 -73 -68 -62 -130 -199 -235 -271 -231 -191 -204 -217 -188 -158 -75 6 -36 -80 -92 -103 -26 50 73 97 63 28 -80 -189 -186 -183 -127 -71 -61 -50 -72 -94 -102 -110
1469 -110 -119 -127 -94 -61 -29 3 8 12 -93 -199 -200 -96 16 65 71 78 6 -65 -186 -307 -371 -329 -235 -141 -114 -88 -84 -80 -76 -72 -59 -46 -34 -21 -48 -75 -102
1458 -102 -129 -142 -156 -169 -183 -153 -123 -94 -64 -92 -120 -94 -69 -65 -62 -59 -55 -48 -40 -33 -25 -45 -64 -84 -104 -84 -64 -97 -131 -139 -148 -125 -102 -83 -64 -141 -218 -218 -219 -166 -113
1445 -113 -103 -93 -83 -72 -59 -45 -31 -18 -37 -57 -76 -96 -86 -77 -68 -59 -74 -88 -35 17 71 19 -61 -78 -93 -109 -120 -131 -148 -166 -130 -94 -100 -107 -145 -183 -152
1433a52L1O2O2lnj00j00POOOj9j9k0j9O6O7J3J3KLKKk3k3j9j9n6OLLO1O1j4j4M2M2l2l2J1
1421i2J0m2m2ppopO0O0O5%o8o9K4K3l9l8m3K1K0J9K3K3mmmmQRQQNNONJ8J9Q9Q9K6l7l4l3l3
1407C0l2KKqN4P2P1nmj3N1Pn7j27o2KKL3L3qp2qrl1r4q7J9M8M7k3q6k7L6Q9Q8L3l1NNRRRR
1394a9MNMNPRo5o5L2L1L2L1J1J0J1J0J2J2k0k0l7l6nnJ%L2L1qql9l9J6J5j6j5l3l2M2M2J5
1381d2J5J5J3jll5l4o2o2J9Q3O4O4J5q9j21n7J7J8K0K0J6J6M0k4k8L6L1l3o7o8KKNOK9R3M0
1369d7k4l0l0J9J9m8m8K6K6R5R4K1K0n0m9j2N1l6l7K0K0o8o7PPN3N2K0K1L1L0L1L0q1q0J4
1358@J4m4m6m2m2n3J2M5M6N3j1K5K6o4o3n0J4M8j7m4J9P5P4P8P8l0l1p9q0p2qL1L0L0L0O5
1347A7Km0m0m0m1j00l6KKK2K2P1P1L9k6J1J0O6O7P1Po1o0qpn2J2O3O4M7o0r1r0jO3O1%l2l1
$$ plain form
1433 -152 -121 -59 3 0 -5 -105 -205 -198 -192 -186 -180 -199 -218 -238 -257 -191 -124 -111 -98 -96 -93 -91 -89 -112 -135 -154 -173 -229 -223 -220 -217 -156 -95 -109 -123 -81 -39 -71 -103 -92
1421 -92 -82 -124 -166 -173 -180 -186 -193 -133 -73 -8 -8 -76 -145 -121 -98 -137 -175 -218 -197 -177 -158 -135 -112 -116 -120 -124 -128 -120 -111 -103 -95 -90 -85 -79 -74 -56 -37 52 141 167 130 96 63 30
1407 30 -2 0 2 -6 48 120 191 186 182 169 220 227 170 43 -19 -17 -15 18 51 43 -29 -37 -46 -77 -171 -258 -239 -191 -144 -167 -253 -280 -244 -155 -67 -34 -65 -60 -55 -46 -37 -28 -19
1394 -19 -15 -10 -6 -1 6 15 -50 -115 -83 -52 -20 11 22 32 43 53 65 77 57 37 0 -36 -41 -46 -45 -45 -13 18 10 2 -37 -76 -60 -45 -61 -76 -109 -141 -99 -57 -42
1381 -42 -27 -12 1 0 -3 -38 -72 -134 -196 -177 -94 -30 34 49 -40 -161 -218 -201 -183 -163 -143 -127 -111 -71 -95 -123 -87 -56 -89 -156 -224 -222 -220 -215 -209 -180 -87 -47
1369 -47 -71 -101 -131 -112 -93 -141 -189 -163 -137 -42 52 73 93 43 -6 -18 33 -3 -40 -20 0 -68 -135 -128 -121 -68 -16 4 25 56 86 117 147 66 -14 0
1358 0 14 -30 -76 -118 -160 -213 -201 -156 -110 -57 -68 -43 -17 -81 -144 -194 -180 -132 -149 -193 -174 -99 -25 53 131 101 70 -9 -89 -161 -169 -138 -108 -78 -48 17
1347 17 19 -21 -61 -101 -142 -242 -278 -276 -274 -252 -230 -159 -88 -49 -75 -64 -54 12 79 150 157 96 36 28 21 -31 -19 44 108 155 95 4 -86 -87 -24 37 37 5 -26
1335b6p2qO1O0L0K9M7j6p2p1o7mR2K7l3l3l8l8l3l3J6J6O8Nn1n1NO9P3Ro4%J3J3K5K6K9l4
1323c1m6m6M2M1Ko2o3Kj2j1m4K0N4N3K3m1j20n7K0K0N3N2N2N2QQQQk3k4k3k3k2k1L1L2j3j3
1311a14M0M1J3J4M5M6l5l5l4l6L7L5L7L6l7l8l6l7n1n2KKM6M6J3J4QQk8L6K1K1m8m9l1l0k7
1300a57k6rN4P2P0L9L8L8L8k0k0j9k0MLMLm6m6m7m7LLL8k5k1k1M9M9POm7m7MLL2L1O3jn5n6
1287g9p6j2K6K6noQ6Q5j0p4p8j5K6l8l4K9L6L5L9L9qqqqK1K0K1K2LLLLqqK5K4n5n4kkL0L1
1274D5jjk7k6n9n9L4L4K9L0J1n1n6QK9l4ONJ6J5M7M6JJ%Jk9k7O5O7m6m6PPk6k4k6k5L1L0L2
1262C4L1N5N5K4K3M9N0m6m6k3k3k4k3m6m7m5m6l7l8ooL9M0L9L8L2L3k1k1L4L4o2o1nmnnK3
1250gK1rrK9L0k3k3j4j4j4j5rrO5O4l6l6q3q2p6L1K5K4K6K5p0p0MLN6N6rrM3M4j6j7j6j6k3
$$ plain form
1335 -26 -98 -106 -45 15 45 74 121 105 33 -38 -105 -109 -17 10 -23 -56 -94 -132 -165 -198 -182 -166 -98 -93 -144 -195 -190 -121 -48 -39 -103 -103 -90 -77 -52 -26 3 -31
1323 -31 -77 -123 -81 -40 -38 -100 -163 -161 -173 -184 -228 -208 -154 -101 -78 -119 -239 -296 -276 -256 -203 -151 -99 -47 -39 -31 -23 -15 -38 -62 -85 -108 -130 -151 -120 -88 -101 -114
1311 -114 -74 -33 -20 -6 39 85 50 15 -19 -55 -18 17 54 90 53 15 -21 -58 -109 -161 -159 -157 -111 -65 -52 -38 -30 -22 -50 -14 7 28 -20 -69 -100 -130 -157
1300 -157 -183 -192 -138 -66 4 43 81 119 157 137 117 98 78 82 85 89 92 46 0 -47 -94 -91 -88 -50 -75 -96 -117 -68 -19 -12 -6 -53 -100 -96 -93 -61 -30 33 32 -23 -79
1287 -79 -155 -167 -141 -115 -120 -126 -40 45 35 -39 -117 -132 -106 -144 -178 -149 -113 -78 -39 0 -8 -16 -24 -32 -11 9 30 52 55 58 61 64 56 48 73 97 42 -12 -14 -16 14 45
1274 45 44 43 16 -10 -69 -128 -94 -60 -31 -1 10 -41 -97 -89 -60 -94 -88 -83 -67 -52 -5 41 42 43 43 44 15 -12 53 120 74 28 35 42 16 -8 -34 -59 -28 2 34
1262 34 65 120 175 199 222 271 321 275 229 206 183 159 136 90 43 -2 -48 -85 -123 -129 -135 -96 -56 -17 21 53 86 65 44 78 112 50 -11 -16 -20 -25 -30 -7
1250 -7 14 5 -4 25 55 32 9 -5 -19 -33 -48 -57 -66 -1 63 27 -9 -92 -174 -250 -219 -194 -170 -144 -119 -189 -259 -255 -252 -196 -140 -149 -158 -115 -71 -87 -104 -120 -136 -159
1237a59k3k3k3L0L1jjO2O2j2j3o4o4j1j2llN0N0M3M3l1l2NML7L6p4p5j%nnO9P0K9K9L0L0P8
1225A53P9o0o0NNo9o8l3l4Q3Q3K2K3K9p8o6o4k0j9J%JJj8j8L4L5J9J9p6p6ooM7M7NOk6k6l4
1213a60l3M1M1M0M0L9M1ppn9o0m9m8M7M7J5J6J6J5K1J9l1l3n3n4O4O3Q2Q3L0K9m9m9j4j3j
1201F9O2Q6j9p0o9k3k4j3j4J7J7Q4Q4l2l3pqK5K5j03j02j35j34PQJ9J24P6J2JJK4K3k9k9O
1190g4Nk6k6k3k2M0M1qrqqJ6J7M8M8%%k3q8o1LK6K7q6q5j5M8K2K2pol3l4l3l4K0J9P9P9Q5
1178f4K1m5m5n5RRRJO5L3l1l2l3l6l7NNk4k3m3K1Q6Q7J24O1n2n0NNRJ0j0N4N4j0n0n0j3R3
1166F3M0k5J8J9m2m2m0m2J1J0J1J1l2l2L9k4p6j2N4N5j%L2L1J9K0K4m0j02j02OP1Q5Q7K1m4
1155G1k7k6l0l1J0J0OOJo2l0L4J1J2m8m8k2k2j7j8K7R2rqOOO6O6lo5l0l0k0k1QPM5j9m3m3
$$ plain form
1237 -159 -182 -205 -228 -198 -167 -168 -169 -107 -45 -57 -70 -134 -198 -209 -221 -224 -227 -177 -127 -84 -41 -72 -104 -99 -95 -58 -22 -96 -171 -172 -172 -177 -182 -113 -43 -14 15 45 75 153
1225 153 232 172 112 117 122 53 -15 -48 -82 1 84 106 129 158 80 14 -50 -70 -89 -88 -88 -87 -86 -104 -122 -88 -53 -34 -15 -91 -167 -173 -179 -132 -85 -80 -74 -100 -126 -160
1213 -160 -193 -152 -111 -71 -31 8 49 42 35 -24 -84 -133 -181 -134 -87 -72 -56 -40 -25 -4 15 -16 -49 -102 -156 -92 -29 53 136 166 195 146 97 83 70 69
1201 69 131 217 198 128 59 36 12 -1 -15 2 19 103 187 155 122 115 107 132 157 54 -48 -183 -317 -310 -302 -283 -159 -83 -71 -70 -69 -45 -22 -51 -80 -74
1190 -74 -69 -95 -121 -144 -166 -126 -85 -93 -102 -110 -118 -102 -85 -37 11 11 11 -12 -100 -161 -158 -132 -105 -191 -276 -291 -243 -221 -199 -206 -212 -245 -279 -312 -346 -326 -307 -228 -149 -64
1178 -64 -43 -88 -133 -188 -179 -170 -161 -160 -95 -62 -93 -125 -158 -194 -231 -226 -221 -245 -268 -311 -290 -204 -117 7 68 16 -34 -29 -24 -15 -5 -15 39 93 83 33 -17 -30 63
1166 63 103 78 96 115 73 31 -9 -51 -40 -30 -19 -8 -40 -72 -33 -57 -133 -145 -91 -36 -37 -37 -5 26 45 65 89 49 -53 -155 -149 -78 7 94 115 71
1155 71 44 18 -12 -43 -33 -23 -17 -11 -10 -72 -102 -68 -57 -45 -93 -141 -163 -185 -202 -220 -193 -101 -110 -118 -112 -106 -40 26 23 -42 -72 -102 -122 -143 -135 -128 -83 -102 -145 -188
1142a88l4L0O1kK3K3J8J9p3p3pN8N3j1L3L4JO3O5Jk8k7l2l1j4j4m6m6r9r8J0P4O4jk4k4k3
1131b65k3M0M1N8N8ool1l1L3L2J8J8J8J8j3j2j3j3J6J6J5J6K3K3K4K4k1k2k1k0k4k3J3n1m8
1119a39m9n6QM2M1K2m2j6M8QQl3l3L4R7P4J2j2j2l0l0r9l4J6J6qqm6J8J4J4KLOPp4j0O0O0
1107a21M1M1L7L5n6j21q1K4R5R5P2J0pqj1j2J2J1J1J2n5n4n5n5O4O5O3O4l6l6m0K4M3M2k1
1097I2k1J7m7n0J2Rn3n0J4j3j3nnK1Q4M8M8J9J8m5m5n0n2j9k0o4o3KO6R2K8Jo2l8K6J27O5
1085G4qrK0J9J5J5J5J5K6K6q0q0PPn6n6j0j0j0j0m7m7jJ05R8R8M4j05j05m3J8J8K6K6N7N8
1074A10q9q8o1KJ9J8K2K3N4N5N6N5l1l2l2l1o7o7o8o7k8k8L5L6N2N1M5M5M0o3o9o9k5k6PP
1063b09J8J7j4j4J2J1J2J2N0N1J8J8L2L2J1n2r4J2M7j6%%l6l5m0m0K4K4N4N4Q5Q6l7l7o8o9
$$ plain form
1142 -188 -222 -192 -131 -133 -110 -87 -69 -50 -123 -196 -203 -145 -92 -103 -70 -36 -35 28 93 94 66 39 7 -24 -38 -52 -98 -144 -243 -341 -331 -257 -193 -194 -218 -242 -265
1131 -265 -288 -248 -207 -149 -91 -97 -103 -134 -165 -132 -100 -82 -64 -46 -28 -41 -53 -66 -79 -63 -47 -32 -16 7 30 54 78 57 35 14 -6 -30 -53 -40 -91 -139
1119 -139 -188 -244 -236 -194 -153 -131 -173 -189 -141 -133 -125 -158 -191 -157 -60 14 26 14 2 -28 -58 -157 -191 -175 -159 -167 -175 -221 -203 -189 -175 -173 -170 -164 -157 -231 -241 -181 -121
1107 -121 -80 -39 -2 33 -23 -144 -225 -201 -106 -11 61 71 64 56 45 33 45 56 67 79 24 -30 -85 -140 -76 -11 52 116 80 44 4 28 71 113 92
1097 92 71 88 41 -9 3 12 -41 -91 -77 -90 -103 -108 -113 -92 -8 40 88 107 125 80 35 -15 -67 -86 -106 -170 -233 -231 -165 -73 -45 -44 -106 -144 -118 9 74
1085 74 66 57 77 96 111 126 141 156 182 208 128 48 55 62 6 -50 -60 -70 -80 -90 -137 -184 -185 -80 18 116 160 55 -50 -93 -75 -57 -31 -5 52 110
1074 110 21 -67 -128 -126 -107 -89 -67 -44 10 65 121 176 145 113 81 50 -17 -84 -152 -219 -247 -275 -240 -204 -152 -101 -56 -11 29 -34 -103 -172 -197 -223 -216 -209
1063 -209 -191 -174 -188 -202 -190 -179 -167 -155 -105 -54 -36 -18 14 46 57 5 -89 -77 -30 -46 -46 -46 -82 -117 -157 -197 -173 -149 -95 -41 44 130 93 56 -12 -81
1052h1j3j4j3j3M6M6j8j8p8p9m7m7N3N3K1K1J8J9J8J8L5L4k9k9rj0N5N4J06J07m2m2J1J2J1
1041A56J1n3n2n3n2k9l0LKo0n9M6M7L2L3l1l2k8k7k8k8rrN5N5JJl0l1K6K7l7l6J9J9K0J9p0
1029b12o9l8l8J7J7M8M9P8P9j7j7J0J0J1J0lmK9K8rqK3K3PPo5o7o8o8K8K7L6L7j7j7LKLKK
1017a31KN4N5J6J4n8n8RJ0RJ0kkn5n5NNNNl9l9J4J4J8J9J8J8L8L9j5j4O6O6m8n0l2l2j%k5
1004a47k6k5k6K7K6K6K7jjp5p6J4J4J3J4N1N1k4k3j3j2j3j2%JN4N4j7j6j7j6J8J8J7J8k7k7
993a51M7M8Q8Q9ppp7p6o0MK7K8o0o0o2JM0M1MM%%M1k4l0L3P7k9r6r7m5O2O9P0N4n2j26k1P6
981a77P5P8P7j3p5m1m1J6J6K0K0r2l0J0RPQjO3R1K8ppk1j9k1k1L3L1j9k0l0l0KKJ0RRRj3j3
968f8J8J9J5J6k4q7p6p7k8k7M3M3M4M3QRP8P8K3m0l1l3qN6Q6K3n7n6o2o1J3J3J3J3L8L9OP
$$ plain form
1052 -81 -94 -108 -121 -134 -88 -42 -60 -78 -156 -235 -282 -329 -276 -223 -202 -181 -163 -144 -126 -108 -73 -39 -68 -97 -106 -116 -61 -7 99 206 164 122 133 145 156
1041 156 167 114 62 9 -43 -72 -102 -99 -97 -157 -216 -170 -123 -91 -58 -89 -121 -149 -176 -204 -232 -241 -250 -195 -140 -139 -138 -168 -199 -173 -146 -183 -219 -200 -181 -161 -142 -212
1029 -212 -281 -319 -357 -340 -323 -275 -226 -148 -69 -86 -103 -93 -83 -72 -62 -65 -69 -40 -12 -21 -29 -6 17 24 31 -34 -101 -169 -237 -209 -182 -146 -109 -126 -143 -140 -138 -135 -133 -131
1017 -131 -129 -75 -20 -4 10 -48 -106 -97 -87 -78 -68 -70 -72 -127 -182 -177 -172 -167 -162 -201 -240 -226 -212 -194 -175 -157 -139 -101 -62 -77 -91 -25 41 -7 -57 -89 -121 -122 -122 -147
1004 -147 -173 -198 -224 -197 -171 -145 -118 -119 -120 -195 -271 -257 -243 -230 -216 -165 -114 -138 -161 -174 -186 -199 -211 -211 -210 -156 -102 -119 -135 -152 -168 -150 -132 -115 -97 -124 -151
993 -151 -104 -56 32 121 114 107 30 -46 -106 -102 -75 -47 -107 -167 -229 -228 -188 -147 -143 -139 -139 -139 -98 -122 -152 -119 -42 -71 -167 -264 -309 -247 -178 -108 -54 -106 -232 -253 -177
981 -177 -102 -24 53 40 -35 -76 -117 -101 -85 -65 -45 -137 -167 -157 -148 -141 -133 -134 -71 20 48 41 34 13 -6 -27 -48 -15 16 -3 -23 -53 -83 -81 -79 -69 -60 -51 -42 -55 -68
968 -68 -50 -31 -16 0 -24 -111 -187 -264 -292 -319 -276 -233 -189 -146 -138 -129 -51 27 50 10 -21 -54 -62 -6 80 103 46 -10 -72 -133 -120 -107 -94 -81 -43 -4 2 9
956IklkkL2L3J5m8n1n1poO5Jn1J2l0l0n7n8M2M3M2M3K0K0n4n5L1L0L1L1P7P8MMm8m7M9M8R
943A67J0k2k3l0l0K3K2j8j9n1m9k1k2N3N2opK6K5j3j3q6q8mmK8K7L6L7L5L6KKr2r3M7M7J6
932@J4opopl7l7nnN2N0K0K0l7l5nnm0m0m0m0K6K6K6K6J7J6n8n8O9O8J6J6J4J5l6l8K6K5K6
919B6K6nnonl3l4l4l4J2J3k0j9nnnmMMm9m9n2n2M3M3N1N1m5m5k0k1P4P5P9P9n8n9K5K5ppk8
906g6k7o0o0k6k6K7K8j1j1j1j1L0L1jjj2j2O3O2K0K1K1K0m9m8j7j7n9n9J6J5RQM0M1NNNNj
894a23kP3P2m6m6m7m7j1j1K0K0J6J5J5J5K7K7k6k6n4n3K0K1J4J4J5J4J3J3o1o2O0O0O1N9k4
883B5k5p6p7j2j2K1K0j3j2j3j2k6k5M8M9R2R1k5k4m0m0J3J3MNNMj5j5J6J7L2L2L3L2KKm7m7
870@J3P6M8n8q7q7m1m2k3k4K9K9P7P7m1m0K5K5n0J5K5q0m9m8J9K0K0K0k4k3L0K9%%%%K3K3
$$ plain form
956 9 7 4 2 0 32 65 80 32 -19 -70 -77 -83 -18 -17 -68 -56 -86 -116 -173 -231 -189 -146 -104 -61 -41 -21 -75 -130 -99 -69 -38 -7 70 148 152 156 108 61 110 158 167
943 167 177 155 132 102 72 95 117 99 80 29 -20 -41 -63 -10 42 36 29 55 80 67 54 -32 -120 -124 -128 -100 -73 -37 0 35 71 73 75 -17 -110 -63 -16 0
932 0 14 8 1 -5 -12 -49 -86 -91 -96 -44 6 26 46 9 -26 -31 -36 -76 -116 -156 -196 -170 -144 -118 -92 -75 -59 -117 -175 -106 -38 -22 -6 8 23 -13 -51 -25 0 26
919 26 52 47 42 36 31 -2 -36 -70 -104 -92 -79 -99 -118 -123 -128 -133 -137 -133 -129 -178 -227 -279 -331 -288 -245 -194 -143 -188 -233 -253 -274 -200 -125 -46 33 -25 -84 -59 -34 -41 -48 -76
906 -76 -103 -163 -223 -249 -275 -248 -220 -231 -242 -253 -264 -234 -203 -204 -205 -217 -229 -166 -104 -84 -63 -42 -22 -71 -119 -136 -153 -212 -271 -255 -240 -231 -223 -183 -142 -137 -132 -127 -122 -123
894 -123 -125 -52 20 -26 -72 -119 -166 -177 -188 -168 -148 -132 -117 -102 -87 -60 -33 -59 -85 -139 -192 -172 -151 -137 -123 -108 -94 -81 -68 -129 -191 -131 -71 -10 49 25
883 25 0 -76 -153 -165 -177 -156 -136 -149 -161 -174 -186 -212 -237 -189 -140 -48 43 18 -6 -46 -86 -73 -60 -56 -51 -46 -42 -57 -72 -56 -39 -7 25 58 90 92 94 47 0
870 0 13 89 137 79 -8 -95 -136 -178 -201 -225 -196 -167 -90 -13 -54 -94 -69 -44 -94 -79 -54 -134 -183 -231 -212 -192 -172 -152 -176 -199 -169 -140 -140 -140 -140 -140 -117 -94
859i4K3K3j4j3J8J8RQRQn0n1O7O5KLn0n0j3j3o5o6J8J8J9J8n6n5J9J9R5R5K0K0j0j1m3m3j1
847a14j1K1K0LLLLklK9L0K1K2l0l1o6o5n4N1P3Rk2k3M8M8J7J6r0r1ONJ1J0J1J1n6n6O0O1k7
834a49k8O9O8Q5Q5j0j0l9l8ppONL7L7ool7l8m0m0rqN6N4K4m0n6M7M9n7p7j2lkNMNMMNk8k7
821a25m4m3L0L1l1l1k5k4m6O1L4L3Q2Q3K9K9j3j3m5m5KKKKN8N7n8n9nnnnj4j3J8J8r9r9L8
809b38L9Q7Q6rrK4K2prk0k1J2J1k2k2J0J0O3O3j0p4o2M3L9o6m5m5KKL2L2q5q5L0K9K9L0l0
797a64l0k9l0noO9P0j2j1j1j1K2K2n2n3M9M8M8M9j9j9n0n1O7O7J3J4j%j%j7j6L6L5k7k7o0
785i3o0MNk7k8kkN1N1j7j7N8N7L7L7r9j01L1L2k2k2M0L9n5n6RRJ0RN9O0N9N9j1j1q5q4j0r
773i5rrK4K4K4K4k1k2k1k1M5M5M3M5KJO6m1j00l5k6k5O8O7O8O8kkkkl8l9l8l9l8m0J4J4N4
$$ plain form
859 -94 -71 -48 -62 -75 -57 -39 -30 -22 -13 -5 -55 -106 -39 26 28 31 -19 -69 -82 -95 -160 -226 -208 -190 -171 -153 -209 -264 -245 -226 -131 -36 -16 4 -6 -17 -60 -103 -114
847 -114 -125 -104 -84 -81 -78 -75 -72 -74 -77 -48 -18 3 25 -5 -36 -102 -167 -221 -170 -97 -88 -110 -133 -85 -37 -20 -4 -94 -185 -179 -174 -163 -153 -142 -131 -187 -243 -183 -122 -149
834 -149 -177 -108 -40 45 130 120 110 71 33 26 19 25 30 67 104 98 92 55 17 -23 -63 -72 -80 -24 30 54 14 -42 5 54 -3 -80 -92 -95 -97 -92 -88 -83 -79 -75 -70 -98 -125
821 -125 -169 -212 -182 -151 -182 -213 -238 -262 -308 -247 -213 -180 -98 -15 14 43 30 17 -28 -73 -71 -69 -67 -65 -7 50 -8 -67 -72 -77 -82 -87 -101 -114 -96 -78 -177 -276 -238
809 -238 -199 -112 -26 -35 -44 -20 2 -5 -14 -34 -55 -43 -32 -54 -76 -66 -56 7 70 60 -14 -76 -33 6 -60 -105 -150 -148 -146 -114 -82 -167 -252 -222 -193 -164 -134 -164
797 -164 -194 -223 -253 -258 -264 -195 -125 -137 -148 -159 -170 -148 -126 -178 -231 -182 -134 -86 -37 -56 -75 -125 -176 -109 -42 -29 -15 -16 -16 -17 -17 -34 -50 -14 21 -6 -33 -93
785 -93 -153 -149 -144 -171 -199 -201 -203 -152 -101 -118 -135 -77 -20 17 54 -45 -146 -115 -83 -105 -127 -87 -48 -103 -159 -150 -141 -131 -122 -63 -3 56 115 104 93 8 -76 -86 -95
773 -95 -104 -113 -89 -65 -41 -17 -38 -60 -81 -102 -57 -12 31 76 78 79 145 104 4 -31 -57 -82 -14 53 121 189 187 185 183 181 143 104 66 27 -11 -51 -37 -23 31
761C1N6KKp8p8m7m7K4K5K4K5nmnmJ3J4J4J4j9j9j5j6L3R5M6o1r7r9j12oQ9Q8M2M3nmn8n7l7
749a93l6mnrrK3Q6P4l3o5o5j2j3O2O2k9l0M5M4L1L1jjL5L4LLM1M1l4l4LMk9k7r7r7m4m4k2
736c11k1N2N3L9M0PPJ05J03N1N1q0q0ool0l2M2M2K1K0J7J7m5j08j05KN3j1k1k2mmM9M9R4R5
725A23Lj04r5J1k4k3K1K1K1K2n8n7mmkklkK0J9K0J9nonoqqK4K3M8M7nnRQNNO8Ml8l9mo7o4
711i7o5%jN3N3J2J2M7j5kkM6M7K5K5ppo4o3ppn6PK5K5K0K2r0r1n4J0Q7Q7O8Np4p6m1m2l7l7
698b59LO7L1L1J8J7l1l2K0Q3P8k6q4k1J2J1L0L0kkK9L0J3n0n9n9l1l1RJ0RJ0p2p2j6M8O4j
686a95L6L6K1m2l9l8L5L5O7J30J18J3o9j31o0o1l0L4M8j5qqK7K7nmonl7l7j9j9J4J3M1M2p
675i8qk5L9PQj7M8N0j1l7K8K2l9k3k4k3k3j0N5J09J10l8j00o5o6j8j8j8j9M5M4M4M4k5k5k9
$$ plain form
761 31 87 89 91 13 -65 -112 -159 -135 -110 -86 -61 -66 -70 -75 -79 -66 -52 -38 -24 -43 -62 -77 -93 -60 35 81 20 -77 -176 -288 -294 -205 -117 -75 -32 -37 -41 -99 -156 -193
749 -193 -229 -233 -238 -247 -256 -233 -147 -73 -106 -171 -236 -248 -261 -199 -137 -166 -196 -151 -107 -76 -45 -46 -47 -12 22 25 28 69 110 76 42 45 49 20 -7 -104 -201 -245 -289 -311
736 -311 -332 -280 -227 -188 -148 -141 -134 -29 74 125 176 96 16 10 4 -26 -58 -16 26 47 67 84 101 56 -52 -157 -155 -102 -113 -134 -156 -160 -164 -115 -66 28 123
725 123 126 22 -73 -62 -86 -109 -88 -67 -46 -24 -82 -139 -143 -147 -149 -151 -154 -156 -136 -117 -97 -78 -83 -89 -94 -100 -108 -116 -92 -69 -21 26 21 16 25 33 38 43 111 115 77 38 34 -33 -97
711 -97 -162 -162 -163 -110 -57 -45 -33 14 -1 -3 -5 41 88 113 138 131 124 60 -3 -10 -17 -73 -66 -41 -16 4 26 -64 -155 -209 -199 -112 -25 43 48 -26 -102 -143 -185 -222 -259
698 -259 -256 -189 -158 -127 -109 -92 -123 -155 -135 -52 26 0 -84 -105 -93 -82 -52 -22 -24 -26 3 33 46 -4 -63 -122 -153 -184 -175 -165 -156 -146 -218 -290 -306 -258 -194 -195
686 -195 -159 -123 -102 -144 -183 -221 -186 -151 -84 46 164 177 108 -23 -83 -144 -174 -140 -92 -107 -115 -123 -96 -69 -74 -78 -84 -89 -126 -163 -182 -201 -187 -174 -133 -91 -98
675 -98 -106 -131 -92 -85 -77 -94 -46 4 -7 -44 -16 6 -33 -56 -80 -103 -126 -136 -81 28 138 100 0 -65 -131 -149 -167 -185 -204 -159 -115 -71 -27 -52 -77 -106
664a06L5J3J3j8q1n6PO0N9L3l0o5o5k3M0N3N4L7k6m3m3K1K2K1K1l6l7J9Q3M2k0r2k8K8K8k2
652a02k1J2J2J1J2L9L7J02mq3j7l0k9j%Q7K4m9n0n4n3nnjjj8M6J0J0%%%jj8j9j8j9M6M5M6
640e9M6OONNNNNNJ3J2j9j9p3p4k6k5rp3k3Q4K7K8k0j9J6J5J5J6j%j%J2J2J2J3M6M5m8m9q7
627a71q7L0K9J1J1O4O4k8k7K5K5j5j6r0r0klN0N0J3J3J4J3N4N4m2m2k0j9J2J2%Jp4p4ooO9
615a98O8J9J8j4j4N6N5KLk6k6POK3K3k9l0J1J0J0J0k2k3k2k3N2N1N0N1NOm8m8J3J3M4M5j11
603A7j11n8n8K8K8K8K8L6L5L5L6q2q2qrM7M6k8k8l2l2K2K1L8L9PPJ5J5J4J4J8J7J7J7j6j7
592F4j6j7o1o3L3L3K3K2n0n1K9L0O0O1l6l6o8o8MLLMj2j1j1j1N0N1k4k4m7m7j5j5LLN7N6j7
580a11j6J5J5LML5L5J9J9J9J9l5l3l5l5n3n3n3n3J01J02J01J02j2j2j1j2mmp7p8M6M6M5M6
$$ plain form
664 -106 -71 -58 -45 -63 -144 -200 -193 -133 -74 -41 -71 -136 -201 -224 -184 -131 -77 -40 -66 -109 -152 -131 -109 -88 -67 -103 -140 -121 -38 4 -16 -108 -136 -108 -80 -102
652 -102 -123 -111 -99 -88 -76 -37 0 102 98 15 -2 -32 -61 -62 -62 25 49 0 -50 -104 -157 -162 -167 -168 -169 -187 -141 -131 -121 -121 -121 -121 -122 -140 -159 -177 -196 -150 -105 -59
640 -59 -13 -7 -1 4 9 14 19 24 29 42 54 35 16 -57 -131 -157 -182 -191 -264 -287 -203 -176 -148 -168 -187 -171 -156 -141 -125 -126 -126 -127 -127 -115 -103 -91 -78 -32 13 -35 -84 -171
627 -171 -258 -228 -199 -188 -177 -113 -49 -77 -104 -79 -54 -69 -85 -175 -265 -267 -270 -220 -170 -157 -144 -130 -117 -63 -9 -51 -93 -113 -132 -120 -108 -108 -107 -181 -255 -261 -267 -198
615 -198 -130 -111 -93 -107 -121 -65 -10 -8 -5 -31 -57 -50 -44 -21 2 -27 -57 -46 -36 -26 -16 -38 -61 -83 -106 -54 -3 47 98 103 109 61 13 26 39 83 128 17
603 17 -94 -152 -210 -182 -154 -126 -98 -62 -27 8 44 -38 -120 -128 -137 -90 -44 -72 -100 -132 -164 -142 -121 -83 -44 -37 -30 -15 0 14 28 46 63 80 97 81 64
592 64 48 31 -30 -93 -60 -27 -4 18 -32 -83 -54 -24 36 97 61 25 -43 -111 -107 -104 -101 -97 -109 -120 -131 -142 -92 -41 -65 -89 -136 -183 -198 -213 -210 -207 -150 -94 -111
580 -111 -127 -112 -97 -94 -90 -55 -20 -1 18 37 56 21 -12 -47 -82 -135 -188 -241 -294 -193 -91 10 112 100 88 77 65 61 57 -20 -98 -52 -6 39 85
569H5m0m1m0m0J5J5J5J5k9k8k9k8J6J7J7J6L5L4L5L5o3o2j0j0l3l2K1K1O8O8k7k6J8J9l3l4
558d0k4k4RQj2j2O3O1l0l1n9n9k5L8LKk2k3R2K7k3M1%JJ7J7l6l6j8j9k2M1P6P4ONj5j5N9N9
545A54mmmll1l0KJj0j0P8J5m8m9m9m8l5K9K9l5k0k0o1MN4N3MNLMl2L1M6M8L4k9o0n9o0o0K0
533a47Q4M8M7J9J9J9J9J9J8J9J9m6m6m5m6l2l2l3l2j4j4j5j4K1K0K1K0MLMMnmmmL7L7L6L7
521D1k9k9On8r8r8JO4R3R2L9L9J5m9m4m5L0K9K9L0opl8l7n5n5M1M0M5M4k9k8m6m5j3j4N6N5
509c4m0m1j1j2m3m4M4M4M4M4LKl0k9RJ0O2O2L9L9j5j4m8m6j6j6JKl1l0JJL3L2J3J3J2J3o5
497d2o5o6o5L2L3L2L3J5J5J6J5j1j2q5q6J%N4N4QPk3k4K2K2K3K2L9L8j3j4j6j7o9o9l9l8J4
$$ plain form
569 85 45 4 -36 -76 -61 -46 -31 -16 -45 -73 -102 -130 -114 -97 -80 -64 -29 5 40 75 12 -50 -60 -70 -103 -135 -114 -93 -25 43 16 -10 8 27 -6 -40
558 -40 -64 -88 -79 -71 -83 -95 -32 29 -1 -32 -91 -150 -175 -137 -134 -132 -154 -177 -85 -58 -81 -40 -40 -39 -22 -5 -41 -77 -95 -114 -136 -95 -19 55 61 66 51 36 95 154
545 154 150 146 142 139 108 78 80 81 71 61 139 154 106 57 8 -40 -75 -46 -17 -52 -72 -92 -153 -149 -95 -42 -38 -33 -30 -26 -58 -27 19 67 101 72 12 -47 -107 -167 -147
533 -147 -63 -15 32 51 70 89 108 127 145 164 183 137 91 46 0 -32 -64 -97 -129 -143 -157 -172 -186 -165 -145 -124 -104 -100 -97 -93 -89 -94 -98 -102 -106 -69 -32 4 41
521 41 12 -17 -11 -69 -167 -265 -264 -200 -107 -15 24 63 78 29 -15 -60 -30 -1 28 58 52 45 7 -30 -85 -140 -99 -59 -14 30 1 -27 -73 -118 -131 -145 -89 -34
509 -34 -74 -115 -126 -138 -181 -225 -181 -137 -93 -49 -46 -44 -74 -103 -94 -84 -22 40 79 118 103 89 41 -5 -21 -37 -36 -34 -65 -95 -94 -93 -60 -28 -15 -2 10 23 -42
497 -42 -107 -173 -238 -206 -173 -141 -108 -93 -78 -62 -47 -58 -70 -155 -241 -240 -240 -186 -132 -124 -117 -140 -164 -142 -120 -97 -75 -36 2 -11 -25 -41 -58 -127 -196 -235 -273 -259
$$ [...]
-1510c6
##END=	
##END=	
