##TITLE=	Apr30-2021-lemw22.10.fid
LW175

##JCAMP-DX=	6.0	$$ MestReNova 14.1.0-24037
##DATA TYPE=	LINK
##BLOCK_ID=	1
##BLOCKS=	1    
##ORIGIN=	Mestrelab Research S.L.
##OWNER=	hrzepa
##$MNOVA/LINK_BLOCK_TYPE=	ITEM	$$ NMR Spectrum
##$MNOVA/ITEM/POLYGON=	(XY..XY)
5321,5835
8722,5835
8722,8208
5321,8208
5321,5835
##$MNOVA/ITEM/Z=	0
##$MNOVA/ITEM/ANGLE=	0
##TITLE=	Apr30-2021-lemw22.10.fid
##JCAMP-DX=	6.0	$$ MestReNova 14.1.0-24037
##BLOCK_ID=	2
##DATA TYPE=	NMR SPECTRUM
##DATA CLASS=	XYDATA
##NUMDIM=	1
##ORIGIN=	Bruker BioSpin GmbH
##OWNER=	nmr
##.OBSERVE FREQUENCY=	400.15247108400001252
##.OBSERVE NUCLEUS=	^1H
##.SOLVENT NAME=	CDCl3
##.PULSE SEQUENCE=	zg30
##LONGDATE=	2021/04/30 14:10:46.000
##.ACQUISITIONMODE=	SIMULTANEOUS (DQD)
##$ORIGINAL FORMAT=	Bruker XWIN-NMR
##$MNOVA/SCALES_VERSION=	8
##$PARAMETER FILE=	(acqus, ASCII, /var/folders/f6/rjf_tdyn2v98c5c0wvkgn4s80000gq/T/4oXGqZ+hQ3qqyQd4AltvEw/1H/acqus, 0)
$$ ##TITLE= Parameter file, TopSpin 4.1.1
$$ ##JCAMPDX= 5.0
$$ ##DATATYPE= Parameter Values
$$ ##NPOINTS= 8	$$ modification sequence number
$$ ##ORIGIN= Bruker BioSpin GmbH
$$ ##OWNER= nmr
$$ $$ 2021-04-30 14:10:40.363 +0100  nmr@chpc-nmr400a
$$ $$ D:/data/lemw22/nmr/Apr30-2021-lemw22/10/acqus
$$ $$ process C:\Bruker\TopSpin4.1.1\prog\mod\xwish3.exe
$$ ##$ACQT0= -1.70581753891579
$$ ##$AMP= (0..31)
$$ 100 100 100 100 100 100 100 100 100 100 100 100 100 100 100 100 100 100
$$ 100 100 100 100 100 100 100 100 100 100 100 100 100 100
$$ ##$AMPCOIL= (0..32)
$$ -1 0 0 0 0 0 0 0 0 0 0 0 0 0 0 0 0 0 0 0 0 0 0 0 0 0 0 0 0 0 0 0 0
$$ ##$AQSEQ= 0
$$ ##$AQ_mod= 3
$$ ##$AUNM= <au_zg>
$$ ##$AUTOPOS= <60 >
$$ ##$BF1= 400.15
$$ ##$BF2= 400.15
$$ ##$BF3= 400.15
$$ ##$BF4= 400.15
$$ ##$BF5= 400.15
$$ ##$BF6= 400.15
$$ ##$BF7= 400.15
$$ ##$BF8= 400.15
$$ ##$BWFAC= (0..63)
$$ 0 0 0 0 0 0 0 0 0 0 0 0 0 0 0 0 0 0 0 0 0 0 0 0 0 0 0 0 0 0 0 0 0 0 0 0
$$ 0 0 0 0 0 0 0 0 0 0 0 0 0 0 0 0 0 0 0 0 0 0 0 0 0 0 0 0
$$ ##$BYTORDA= 0
$$ ##$CHANFCU= (0..24)
$$ 0 0 1 0 0 0 0 0 0 0 0 0 0 0 0 0 0 0 0 0 0 0 0 0 0
$$ ##$CHANREC= (0..24)
$$ 0 0 0 0 0 0 0 0 0 0 0 0 0 0 0 0 0 0 0 0 0 0 0 0 0
$$ ##$CHEMSTR= <none>
$$ ##$CNST= (0..63)
$$ 1 1 145 1 1 1 1 1 1 1 1 1 1 1 1 1 1 1 1 1 1 1 1 1 1 1 1 1 1 1 1 1 1 1 1
$$ 1 1 1 1 1 1 1 1 1 1 1 1 1 1 1 1 1 1 1 1 1 1 1 1 1 1 1 1 1
$$ ##$CPDPRG= (0..8)
$$ <> <> <> <> <mlev> <mlev> <mlev> <mlev> <mlev>
$$ ##$D= (0..63)
$$ 0 0.1 0 0 0 0 0 0 0 0.06 0 0 0 0 0 0 0.0002 0 0 0 0 0 0 0 0 0 0 0 0 0 0
$$ 0 0 0 0 0 0 0 0 0 0 0 0 0 0 0 0 0 0 0 0 0 0 0 0 0 0 0 0 0 0 0 0 0
$$ ##$DATE= 1619788246
$$ ##$DATE_START= 1619788152
$$ ##$DE= 8.794183
$$ ##$DECBNUC= <off>
$$ ##$DECIM= 1680
$$ ##$DECNUC= <off>
$$ ##$DECSTAT= 4
$$ ##$DIGMOD= 3
$$ ##$DIGTYP= 17
$$ ##$DR= 32
$$ ##$DS= 0
$$ ##$DSPFIRM= 4
$$ ##$DSPFVS= 21
$$ ##$DTYPA= 2
$$ ##$EXP= <Proton.icon>
$$ ##$ExpStatus= 4
$$ ##$FCUCHAN= (0..9)
$$ 0 2 0 0 0 0 0 0 0 0
$$ ##$FILCOR= 0
$$ ##$FL1= 90
$$ ##$FL2= 90
$$ ##$FL3= 90
$$ ##$FL4= 90
$$ ##$FN_INDIRECT= (0..7)
$$ 0 0 0 0 0 0 0 0
$$ ##$FOV= 20
$$ ##$FQ1LIST= <freqlist>
$$ [...]
$$ 1 1 1 1 0 0 0 0 0 0 0 0 0 0 0 0 0 0 0 0 0 0 0 0 0 0 0 0
$$ ##$ShimPowRng3= (0..63)
$$ 1 1 1 1 1 1 1 1 1 1 1 1 1 1 1 1 1 1 1 1 1 1 1 1 1 1 1 1 1 1 1 1 1 1 1 1
$$ 1 1 1 1 0 0 0 0 0 0 0 0 0 0 0 0 0 0 0 0 0 0 0 0 0 0 0 0
$$ ##$ShimPowType1= 8
$$ ##$ShimPowType2= 8
$$ ##$ShimPowType3= 0
$$ ##$ShimPowType4= 0
$$ ##$ShimPowType5= 0
$$ ##$ShimPowType6= 0
$$ ##$ShimPowType7= 0
$$ ##$ShimPowType8= 0
$$ ##$ShimSysActGrad= (0..63)
$$ 1 2 3 4 13 5 7 11 10 9 6 8 12 18 19 20 21 15 22 23 24 14 25 16 26 17 27
$$ 28 31 32 33 34 35 36 37 38 0 0 0 0 0 0 0 0 0 0 0 0 0 0 0 0 0 0 0 0 0 0
$$ 0 0 0 0 0 0
$$ ##$ShimSysAngle= <>
$$ ##$ShimSysFunc= (0..63)
$$ 1 2 3 4 5 6 7 8 9 10 0 37 38 35 16 15 14 13 12 11 28 27 26 25 24 23 36
$$ 22 30 29 20 21 34 33 32 31 17 18 19 0 0 0 0 0 0 0 0 0 0 0 0 0 0 0 0 0 0
$$ 0 0 0 0 0 0 0
$$ ##$ShimSysMatId= <292722aa.dat>
$$ ##$ShimSysMatrix= 1
$$ ##$ShimSysMinMaxUG= 130000
$$ ##$ShimSysOffset= <37mm>
$$ ##$ShimSysType= 4
$$ ##$ShimUnit= 3
$$ ##$SpectrOsVersion= <4.1.148.20201202>
$$ ##$TCubeEth= <192.168.180.22>
$$ ##$TCubeSeqDevice= <>
$$ ##$TOSITY= <no>
$$ ##$TRIPLO2= 0
$$ ##$TopSpinVersion= <TopSpin 4.1.1>
$$ ##$TrxFreqFormula= (0..23)
$$ <TrxFreqFormula(2.0,400150000.000000,'TRX',Trx(1.0,'TRX 1200.1',2,5.000000,1290.000000))>
$$ <TrxFreqFormula(2.0,400150000.000000,'TRX',Trx(1.0,'TRX 1200.2',2,5.000000,1290.000000))>
$$ <> <> <> <> <> <> <> <> <> <> <> <> <> <> <> <> <> <> <> <> <> <>
$$ ##$TrxPN= (0..23)
$$ <Z148391> <Z148391> <> <> <> <> <> <> <> <> <> <> <> <> <> <> <> <> <>
$$ <> <> <> <> <>
$$ ##$TrxSN= (0..23)
$$ <02953> <02954> <> <> <> <> <> <> <> <> <> <> <> <> <> <> <> <> <> <> <>
$$ <> <> <>
$$ ##$VCubeEth= (0..23)
$$ <no> <no> <no> <no> <no> <no> <no> <no> <no> <no> <no> <no> <no> <no> <no>
$$ <no> <no> <no> <no> <no> <no> <no> <no> <no>
$$ ##$VTU= 2
$$ ##$VTUETH= <192.168.99.11>
$$ ##$VTUTY= <no>
$$ ##$ValueLine= no
$$ ##$VpuPN= (0..23)
$$ <no> <no> <no> <no> <no> <no> <no> <no> <no> <no> <no> <no> <no> <no> <no>
$$ <no> <no> <no> <no> <no> <no> <no> <no> <no>
$$ ##$VpuSN= (0..23)
$$ <no> <no> <no> <no> <no> <no> <no> <no> <no> <no> <no> <no> <no> <no> <no>
$$ <no> <no> <no> <no> <no> <no> <no> <no> <no>
$$ ##$WBREFAM= (0..31)
$$ 142.7 107.1 100 100 100 100 100 100 100 100 100 100 100 100 100 100 100
$$ 100 100 100 100 100 100 100 100 100 100 100 100 100 100 100
$$ ##$WBREFLM= (0..31)
$$ 0 0 0 0 0 0 0 0 0 0 0 0 0 0 0 0 0 0 0 0 0 0 0 0 0 0 0 0 0 0 0 0
$$ ##$WBREFPH= (0..31)
$$ 72.61 -67.16 0 0 0 0 0 0 0 0 0 0 0 0 0 0 0 0 0 0 0 0 0 0 0 0 0 0 0 0 0
$$ 0
$$ ##$WBSGU= (0..31)
$$ 2 0 1 0 0 0 0 0 0 0 0 0 0 0 0 0 0 0 0 0 0 0 0 0 0 0 0 0 0 0 0 0
$$ ##END=
$$ 
##$DECIM=	1680
##$DSPFVS=	21
##XUNITS=	HZ
##YUNITS=	ARBITRARY UNITS
##FIRSTX=	8386.3048683681190596
##LASTX=	-3518.4570363937800721
##DELTAX=	-0.090826818325654784525
##XFACTOR=	1
##YFACTOR=	6.4540592049276943598
##FIRSTY=	1440.640869140625
##MINY=	-1832.0455322265625
##MAXY=	10238129
##NPOINTS=	131072
##XYDATA=	(X++(Y..Y))
$$ [...]
2901 521 512 441 512 474 524 443 464 545 512 350 382 466 542 610 613 457 338 424 391 525 486 484 532 409 378 383 377 538 457 370 417 441 568 487
2897 487 500 635 824 634 520 578 637 558 534 549 462 495 454 478 409 287 338 369 590 575 521 488 487 584 674 577 517 486 446 399 570 610
2895 610 441 593 651 729 620 447 572 608 433 304 500 584 669 515 520 535 557 579 579 424 414 420 481 387 331 430 341 432 676 641 544
2892 544 644 551 379 443 636 678 546 578 708 610 670 681 530 343 560 660 628 408 371 475 504 585 725 750 716 476 362 314
2889 314 233 244 351 342 444 401 484 574 559 619 628 659 715 625 555 561 487 614 457 536 689 782 715 695 702 541 538 498 574 675 592 567 702
2886 702 619 520 550 499 472 613 658 645 557 310 412 604 679 681 557 504 542 547 629 544 518 404 464 503 505 670 830 674 593 670 764 843
2883 843 894 1020 956 959 1018 1120 1149 1054 1128 1129 1157 1222 1216 1433 1538 1675 1780 1768 1827 1949 2112 2187 2306 2285 2360 2478 2662 2706 3021 3203
2881 3203 3335 3690 4171 4450 4857 5346 6198 7423 8800 10513 12335 15047 18985 24161 30663 39086 49248 61136 75510
2879 75510 92133 110723 130281 150482 171606 191970 209224 219113 220114 210018 191636 172788 155976 140622
2878 140622 124038 106111 90016 76512 64595 53309 43013 34286 27494 22691 19401 17074 15453 14152 13003
2876 13003 12014 11215 10319 9728 9124 8540 7910 7436 7027 6572 6321 5971 5565 5166 4823 4482 4211 3996 3826 3585 3387 3236 3023
2874 3023 2739 2611 2319 2239 2190 1932 1723 1736 1640 1653 1636 1712 1700 1641 1438 1468 1543 1590 1669 1709 1529 1510 1486 1446 1513 1602 1469 1403 1521 1347
2871 1347 1175 1215 1300 1246 1190 1244 1258 1250 1162 902 828 936 1025 1128 1161 1081 845 871 976 954 943 776 640 636 654 724 754 772 879 716
2869 716 623 558 708 840 857 826 737 762 941 902 824 614 756 822 806 804 846 861 703 651 719 794 883 860 686 793 731 712 745 833 663
2866 663 592 713 716 694 829 748 785 849 742 729 769 828 908 845 792 793 645 731 842 726 771 840 785 853 874 852 885 829 762 914 914 730
2863 730 791 789 782 770 778 818 811 721 727 550 770 1004 843 721 840 860 753 706 788 738 805 787 682 793 751 723 670 618 631 823 890 855
2860 855 1000 838 680 928 978 1004 1129 1125 932 948 925 1037 1092 1241 1311 1181 1102 1280 1454 1364 1135 1397 1361 1282 1243 1253 1272 1331 1179
2857 1179 1098 1093 1194 1363 1458 1460 1477 1511 1533 1331 1434 1605 1558 1498 1345 1364 1426 1403 1411 1244 1289 1372 1448 1263 1056 1004 953 1001 928 1094 1159
2855 1159 1131 1103 1110 1141 1106 1148 1117 1030 1123 1026 1111 960 1069 1154 1225 1214 1159 1124 1265 1389 1462 1633 1613 1732 1752 1733 1599 1595 1690 1789 1909
2852 1909 2158 2247 2277 2481 2611 2755 2892 3155 3400 3648 4013 4319 4749 5152 5548 5941 6308 6594 7095 7590 8143 8695 9457 9933
2850 9933 10455 10783 11129 11603 12093 12467 12649 12671 12928 13508 13827 14443 15526 17036 18678 21085 24388 28709 34260 41053 49241
2848 49241 59305 71410 85368 101140 118397 137190 156727 176402 194909 211169 223747 232067 235786 234842 229297
2846 229297 219655 206273 190030 172548 154764 137291 120416 104571 89950 77040 65700 55838 47530 40766
2845 40766 35009 30447 27076 24291 21977 19978 18428 17231 16176 15262 14433 13688 12912 12412 12137 11737 11346 11036 10631 10206
2843 10206 9744 9358 9154 8832 8502 8210 7879 7771 7622 7399 7293 7222 7271 7330 7146 7262 7383 7650 7891 7986 8084 8400 8807 9422
2841 9422 9789 10315 10786 11326 11694 11928 12374 12582 12819 13119 13319 13473 13724 14115 14670 15609 17032 18868 21106 24446 28535
2839 28535 33737 40262 48238 57968 69366 82424 97194 113713 131412 149870 168227 185523 200745 212580 220321
2838 220321 223337 222006 216566 207137 194292 178770 162109 145126 128494 112596 97728 84086 71854 61169
2837 61169 51916 44166 37777 32650 28299 24869 22201 20201 18473 17020 15717 14610 13693 12933 12162 11594 11138 10611 10203
2835 10203 9767 9159 8831 8540 8068 7854 7479 7234 7011 6754 6354 5886 5570 5296 4935 4699 4359 4011 3807 3652 3457 3266 3143
2833 3143 3067 2913 2870 2877 2828 2612 2438 2346 2464 2332 2158 2167 2176 2115 1967 2002 2062 1894 2040 1940 1723 1789 1782 1739 1567 1641 1687 1669 1600 1646
2830 1646 1394 1602 1623 1614 1568 1336 1380 1283 1297 1300 1322 1305 1308 1313 1269 1265 1279 1321 1386 1494 1400 1365 1345 1521 1484 1405 1492 1305 1322 1306 1326 1333 1319 1215
2827 1215 1137 1160 1110 1136 1212 1156 1104 1111 1080 1056 1123 1097 1143 1114 1043 1150 1127 1178 1083 1089 1097 1133 1149 1186 1123 1088 1028 994 1027 1115 1199 1125 1086 1008 1019
2824 1019 1075 1026 964 859 911 959 932 893 989 1002 813 914 876 956 817 926 967 784 638 681 767 958 927 946 960 850 892 884 836 860
2821 860 1016 1100 964 811 800 800 869 829 823 1006 914 929 887 847 1004 952 1004 1077 983 966 953 760 681 806 730 821 845 854 920 915 903 843 866
2818 866 879 1045 876 806 980 835 858 819 771 877 884 820 904 806 841 899 770 627 727 704 745 847 843 850 899 822 775 869 1008 1035 857
2815 857 890 862 860 916 855 715 978 1000 895 839 816 735 791 783 718 538 751 831 764 718 667 658 733 835 807 728 715 728 762 693 775 807 723
2812 723 618 591 764 861 990 866 874 807 742 674 658 690 737 637 546 595 718 938 823 794 742 797 709 710 732 787 897 835 619 678 683
2809 683 591 471 478 608 673 781 655 639 605 439 482 425 502 547 473 501 468 578 652 429 625 745 827 820 841 662 698 691 703 826 900
2807 900 767 851 664 452 473 483 595 689 592 708 693 660 796 602 513 535 644 662 633 663 729 840 781 769 605 575 649 738 787 755
2804 755 689 644 672 694 638 626 651 681 724 706 760 675 737 690 640 733 685 611 791 742 694 800 724 771 806 775 803 858 837 666 612 532 547
2801 547 592 662 654 600 747 726 693 800 814 686 862 924 774 790 867 912 845 1023 1156 1031 978 1002 855 752 866 979 899 818 829
2798 829 778 941 992 911 885 844 806 863 839 830 794 770 815 918 952 889 733 772 884 704 620 709 869 754 794 834 799 818 716 549 574
2795 574 689 891 911 840 852 850 619 637 674 649 452 602 825 910 836 652 771 756 713 832 790 745 690 760 764 760 615 654 680 623 596
2793 596 588 481 600 866 804 925 1063 807 639 754 736 675 680 665 840 975 837 706 838 831 829 750 804 926 920 810 704 825 945
2790 945 985 1040 887 862 799 762 848 946 850 748 891 921 862 840 731 612 669 800 701 630 645 573 585 682 774 871 693 711 683 656 618
2787 618 652 727 775 722 709 789 800 726 691 767 860 760 602 650 763 767 712 573 564 664 914 780 709 654 593 613 623 702 704 640 569 727
2784 727 790 810 835 773 685 657 598 613 637 580 612 686 801 863 702 481 579 564 521 538 630 706 723 551 522 551 616 701 641 693 732 616
2781 616 532 521 580 636 640 692 591 801 706 679 707 493 584 670 606 607 748 700 614 686 766 651 451 589 326 397 613 668 701 766 661
2778 661 616 670 720 736 513 573 571 525 611 677 765 766 671 645 614 607 652 707 800 619 672 678 711 754 603 673 795 746 575 615 617 679 683 661 734
2775 734 744 737 893 774 715 597 776 648 559 679 839 851 768 706 716 811 548 540 719 881 1026 1036 1054 1045 1231 1283 1205 1244 1553 1862
2773 1862 1942 1764 1780 1784 1588 1460 1401 1238 1122 1077 1116 1025 886 909 690 729 957 774 585 620 658 654 694 632 536 679 812 756 643
2770 643 725 691 720 567 677 785 663 621 517 619 662 639 751 842 766 678 641 608 630 682 725 673 765 585 543 716 688 759 708 681
2767 681 653 722 648 698 691 650 648 586 738 680 606 764 793 773 708 781 756 603 712 679 778 901 946 991 1094 1109 1307 1401 1466 1394 1703 1788
2764 1788 1873 1765 1680 1844 1746 1653 1670 1389 1140 1196 1231 1126 1079 1119 1040 845 807 836 668 706 744 631 569 516 567 646 726 726 775 798 842
2761 842 695 705 711 731 674 608 609 632 512 671 733 759 637 662 644 528 564 693 638 638 641 613 596 654 761 743 605 549 635 525 585 853
2759 853 855 788 733 849 787 558 591 584 627 718 639 589 703 742 671 676 565 704 861 971 886 895 947 867 980 1169 1188 1211 1229 1268 1512 1695
2756 1695 1701 1700 1772 1984 2041 1915 1687 1470 1474 1406 1400 1098 1159 1132 939 899 950 970 889 796 856 877 808 853 740 722 653 610 605 663 683 619 559
2753 559 669 582 594 553 650 752 691 638 586 544 499 575 647 740 830 712 615 651 573 519 528 528 523 559 668 707 659 713 719 595 563 672 560
2750 560 600 639 667 548 587 580 562 503 521 680 800 572 374 473 668 588 627 620 607 623 563 559 652 710 744 822 668 678 685 602 479 430 575
2747 575 600 531 576 596 499 541 641 807 716 556 419 437 501 586 589 512 413 510 481 546 575 656 545 548 482 589 764 699 659 667 762 744 594
2744 594 566 544 430 499 639 637 455 578 597 408 243 346 465 623 581 549 552 530 515 532 497 559 477 483 669 611 526 453 782 680
2741 680 578 688 702 610 735 697 622 593 685 618 475 488 460 446 464 406 415 588 483 490 489 416 587 477 484 516 508 453 499 541 470 617 668
2738 668 483 613 704 550 494 636 556 401 460 615 494 446 534 652 570 482 631 747 801 648 503 555 402 469 374 376 500 520
2735 520 423 433 603 619 709 578 481 391 376 485 757 640 609 583 643 667 465 464 605 594 598 639 619 574 469 544 487 520 514 466 618 673
2733 673 551 424 389 517 594 620 686 704 530 516 515 539 588 662 640 576 639 649 779 655 507 413 505 561 596 599 531 605 824 674 581
2730 581 491 512 508 586 670 644 752 776 668 553 464 468 557 630 702 625 642 684 731 683 668 539 509 519 641 650 568 613 539 502 582 513 613
2727 613 813 540 586 565 607 666 562 645 810 753 590 516 569 375 348 438 447 594 584 750 705 619 538 596 711 594 587 498 521 565 538
2724 538 377 435 696 577 544 604 677 751 668 686 671 511 552 441 463 499 560 656 636 704 611 639 618 626 597 670 593 599 500 537 521 498 667
2721 667 735 643 464 481 578 548 508 401 567 730 502 422 428 428 380 510 594 552 679 601 423 574 666 643 708 609 438 569 658 595
2718 595 512 370 465 407 555 591 650 630 512 504 502 572 594 539 325 426 479 423 523 485 496 636 713 659 693 628 558 548 594 682 718 729
2715 729 736 721 721 577 616 644 538 575 598 619 599 494 676 597 649 663 625 589 628 629 606 673 520 543 599 560 588 612 552 560 590 499 548 578
2712 578 662 711 748 845 877 748 749 716 618 796 878 808 746 791 630 534 532 620 639 594 512 486 545 670 674 619 651 658 652 566 678 843 766 859
2709 859 939 812 798 839 848 715 786 910 968 875 865 867 683 542 643 542 625 553 525 549 656 638 508 412 487 611 633 579 463 431
2706 431 602 502 574 672 625 617 542 649 496 528 472 582 667 642 511 388 534 570 420 582 705 662 562 445 551 597 574 637
2704 637 529 681 670 514 506 549 594 501 416 466 451 396 481 632 623 666 555 645 758 659 513 488 402 592 577 656 525 497 527 552 543 598
2701 598 658 635 518 464 463 552 613 384 447 521 590 570 567 576 570 615 588 620 558 533 731 706 604 540 593 617 638 782 766 560 391 541 828
2698 828 527 619 638 656 576 647 592 375 444 398 527 646 682 743 683 514 682 652 656 565 639 690 743 671 600 501 595 529 544 601 609 585 775
2695 775 669 686 686 660 551 382 511 616 607 608 604 612 694 562 404 561 581 501 522 422 652 620 463 397 416 474 792 808 628 452
2692 452 536 454 560 528 503 640 534 447 531 522 493 407 353 435 558 582 624 686 782 725 638 530 506 466 467 516 467 396 460 428 428 451 527 626
2689 626 640 541 392 588 658 702 597 547 519 574 569 513 546 537 565 471 520 681 653 729 615 615 606 591 620 751 713 622 680 599 617 737 748
2686 748 665 767 729 662 636 502 417 528 670 585 490 426 588 534 303 469 633 658 669 604 524 496 580 589 526 502 442 492 598 490
2683 490 488 595 587 492 542 639 628 572 707 610 510 504 480 635 587 485 619 608 423 436 460 512 518 560 446 406 563 601 575 493 426 508
2680 508 456 430 663 643 463 601 539 513 550 593 537 570 589 435 374 452 464 551 680 696 662 611 521 511 575 623 582 667 621 540 609 630
2678 630 604 658 721 695 648 462 457 623 593 649 597 461 447 381 418 535 604 521 568 586 699 577 565 572 524 519 414 587 672 466 497 553
2675 553 499 414 499 560 636 555 563 475 432 559 617 628 584 596 760 657 727 561 606 552 617 664 657 762 599 750 805 655 589 544 521 549
2672 549 706 589 579 585 653 528 620 744 693 700 723 690 652 757 698 632 651 699 727 581 532 564 553 643 525 601 643 727 633 558 666 602
2669 602 494 459 523 386 403 307 491 674 654 565 524 526 460 592 637 535 577 630 641 524 466 367 352 553 719 843 676 588 614 708
2666 708 688 486 513 432 416 415 358 403 432 512 490 547 429 438 557 674 561 565 562 673 647 598 680 702 573 527 582 579 539 580 612 485 522
2663 522 486 427 569 364 301 349 406 462 459 482 383 351 599 696 647 569 600 529 407 405 342 424 593 564 416 521 774 703 491 431 553
2660 553 615 733 705 566 439 481 592 540 548 620 554 523 666 802 756 666 577 553 656 562 508 587 503 513 606 527 517 594 697 682 560
2657 560 395 448 621 588 412 532 567 569 459 493 477 489 580 452 420 581 584 463 597 608 626 633 733 677 644 765 744 621 536 545 691
2655 691 518 504 549 499 552 575 494 517 538 585 562 574 518 418 589 565 542 544 489 567 496 416 542 555 647 523 651 575 627 695 494 451
2652 451 494 475 490 479 369 543 612 517 498 464 492 490 513 500 589 552 596 574 521 704 630 515 428 492 583 575 543 522 358 454 439 584 598
2649 598 464 516 469 443 473 398 463 540 444 483 580 555 595 529 641 621 587 561 595 629 635 593 703 712 599 597 547 538 555 627 582 629 576 643 644
2646 644 719 720 640 631 534 586 610 607 535 489 338 430 608 564 457 538 729 791 708 648 634 544 685 687 650 622 507 447 400 613 641 691 656
2643 656 564 633 574 456 630 685 622 630 739 790 1012 1077 1083 1209 1076 1192 1274 1290 1299 1467 1525 1622 1521 1444 1359 1214 1090 1080 1144 1056 983
2640 983 946 882 840 748 696 619 577 510 594 509 515 524 492 451 438 563 631 695 630 615 518 612 571 558 466 611 568 532 558 483 472 411 414 462 291
2637 291 416 521 629 589 613 517 645 706 566 496 462 407 476 541 605 626 653 736 765 757 657 628 732 732 671 591 479 461 494 662 628
2634 628 547 602 556 542 502 362 383 571 560 578 485 548 630 477 451 403 383 377 478 607 497 451 500 420 361 479 556 597 454 497 594
2631 594 562 656 505 482 500 507 518 522 355 396 461 496 356 344 440 413 489 589 564 421 418 386 558 681 705 622 630 548 378 537 653 622
2628 622 758 677 555 423 393 458 623 601 543 530 524 498 429 526 572 619 579 506 724 629 546 441 571 649 528 513 599 543 494 489 690
2625 690 682 546 532 532 502 581 490 514 680 456 558 569 600 635 492 467 719 669 438 277 499 585 637 514 529 356 386 370 374 523
2623 523 509 490 447 492 465 403 460 530 509 485 661 626 596 445 467 510 471 492 439 443 517 545 392 405 492 457 632 747 597 333 399 409
2620 409 547 499 463 476 495 413 401 500 500 506 360 466 462 450 417 455 432 406 568 566 385 551 491 485 476 496 615 538 317 294 478 667 476
2617 476 547 587 561 543 355 358 335 394 423 538 510 503 447 545 361 483 451 488 394 449 465 476 604 553 587 575 610 622 543 612 511 384
2614 384 353 364 443 522 636 621 516 433 425 497 730 608 662 577 592 629 641 610 715 547 502 511 616 644 467 554 630 582 558 644 616 618
2611 618 541 485 525 656 566 538 629 775 797 646 422 487 496 559 622 402 347 454 487 396 541 552 559 664 666 575 496 529 631 637 479 359
2608 359 399 476 458 376 509 337 563 626 612 612 596 615 610 648 732 660 756 719 504 538 601 449 506 601 646 611 568 703 549 434 581
2605 581 558 446 716 724 765 665 500 486 544 569 548 481 578 583 579 546 580 767 571 567 514 648 730 548 526 522 580 601 627 639 513 445 585
2602 585 422 425 732 777 673 577 467 609 674 604 510 656 650 545 479 526 544 523 679 648 653 701 573 497 400 398 454 563 577 540 447 416
2599 416 395 478 479 346 380 485 511 452 459 574 569 517 508 536 612 590 508 488 437 599 647 636 491 461 567 528 590 502 307 512 613 651
2596 651 575 634 751 823 641 631 651 684 612 555 552 648 693 792 741 822 807 784 751 831 980 915 813 707 679 675 650 696 765 762 709 571 573 536
2593 536 500 571 572 584 461 540 722 638 625 594 559 372 496 632 603 444 374 521 658 593 547 571 500 574 505 542 564 524 557 380 309
2590 309 504 501 473 652 495 354 574 485 401 483 599 489 460 493 406 481 442 379 437 358 351 476 524 443 419 459 551 592 560 371 307
2588 307 402 462 600 629 626 623 459 331 381 426 448 579 561 534 580 524 500 516 455 420 450 403 437 539 630 593 539 641 427 501 543 376
2585 376 484 409 513 563 623 569 612 684 621 581 634 655 424 399 383 398 494 621 430 455 368 462 665 468 611 621 563 585 690 663
2582 663 648 844 674 628 607 573 510 524 683 735 613 519 438 555 581 586 468 438 581 531 487 467 388 333 538 649 543 449 438 516
2579 516 607 420 582 506 367 388 320 455 490 648 627 622 634 599 535 521 761 601 563 587 546 639 561 575 557 611 626 487 648 629 661
2576 661 504 346 447 355 351 318 367 484 482 439 421 452 415 521 459 518 590 466 492 549 547 605 479 435 532 541 550 525 568 496 471 686 582
2573 582 427 655 704 705 637 501 484 519 467 573 638 504 516 612 639 579 535 427 590 542 541 696 640 596 677 575 397 397 444 453 504 452
2570 452 506 539 487 543 609 404 426 421 451 526 544 565 692 546 373 519 641 495 540 490 327 355 475 505 445 398 393 552 531 472 480
2568 480 371 458 556 671 708 750 464 239 385 445 590 525 509 485 523 442 416 503 461 554 668 654 606 488 518 686 540 444 507 530
2565 530 350 442 525 366 324 535 628 622 477 499 557 480 497 543 552 535 512 477 644 478 314 532 581 550 543 455 483 502 507 501 505 578 636 620
2562 620 634 627 584 466 476 508 540 547 449 393 487 578 627 590 623 515 426 466 659 607 507 445 352 411 490 560 626 677 730 606 575 489 520
2559 520 481 566 376 446 517 422 594 569 451 487 506 451 473 413 241 405 586 542 482 492 520 523 507 395 452 595 684 580 622 574 519
2556 519 491 382 369 374 470 428 491 514 424 434 475 452 427 336 493 567 554 570 648 506 522 507 671 708 521 503 500 441 288 352 404 283
2553 283 365 535 472 516 451 412 525 488 448 415 405 348 350 406 314 274 323 351 302 261 396 680 587 535 486 566 527 529 622 537 549 425 329
2550 329 405 647 709 715 484 522 502 314 536 723 681 615 599 403 393 448 534 583 610 554 499 434 356 332 514 510 419 571 564 349 463
2547 463 676 664 709 840 648 543 551 481 453 458 384 451 455 424 383 361 492 608 521 517 540 623 566 538 385 435 554 523 508 507 464 666 613
2544 613 541 569 657 620 482 502 492 511 508 501 550 548 650 494 462 500 468 493 600 512 416 460 557 505 465 546 531 644 627 621 487 544 621 544
2541 544 547 603 481 462 455 601 567 451 500 562 470 370 440 521 624 477 527 469 457 333 348 447 526 392 505 512 505 534 524 459 504 471
2538 471 345 415 349 363 398 570 811 599 565 559 591 565 458 447 432 436 467 397 343 473 587 757 653 592 434 529 536 530 558 498 494 483
2535 483 510 520 539 459 479 355 545 592 783 625 623 553 429 501 429 330 528 432 483 512 436 465 439 466 681 585 603 674 505 494 572
2533 572 642 567 446 443 441 298 224 411 537 607 496 393 437 354 402 374 533 696 565 510 658 527 413 428 423 443 439 347 452 575
2530 575 372 327 286 305 392 469 615 647 506 426 494 381 444 490 513 371 448 504 544 591 430 472 509 529 475 498 544 340 432 565 481
2527 481 593 607 444 476 521 426 489 478 364 433 449 476 470 451 547 584 659 645 646 578 437 393 399 395 383 535 540 536 440 543 623 563 462 331
2524 331 354 442 409 498 506 600 507 553 506 476 398 420 519 564 472 449 512 465 588 384 351 324 377 404 443 502 570 612 657 567 521 696 633 586
2521 586 569 563 655 604 490 587 517 682 520 450 490 581 559 537 483 562 690 668 609 496 425 358 337 414 380 283 422 287 296 428 348 312
2518 312 391 391 468 592 516 494 627 632 620 732 759 477 492 478 409 351 349 431 485 495 573 602 615 613 449 455 537 600 622 411 370 399 453 395
2515 395 441 496 603 580 479 356 384 443 562 514 573 517 544 560 527 328 308 545 531 551 445 513 504 330 564 562 503 556 549 525 641
2512 641 740 572 520 475 456 455 438 369 362 377 467 365 513 539 531 488 648 804 716 745 591 523 537 587 751 706 658 506 482 615 592 470
2509 470 405 328 448 538 471 526 556 626 605 577 568 464 629 528 473 553 543 405 481 751 711 567 610 609 597 715 689 641 542 407 340
2506 340 327 466 422 448 438 621 612 526 520 609 606 526 605 464 473 461 402 468 511 329 360 506 465 449 348 450 444 608 481 390 428 496 664
2503 664 607 480 375 540 506 431 296 327 432 362 316 374 416 413 411 361 358 391 534 441 516 645 680 677 589 437 433 353 387 402 454 470 536
2500 536 609 526 560 566 513 528 493 345 383 553 613 560 449 507 440 431 314 380 516 591 562 590 530 427 420 457 438 405 350 420 437 463 404
2497 404 322 317 444 540 569 424 379 410 387 484 568 451 397 444 364 436 456 373 497 489 422 503 427 574 697 674 589 435 397 319 567 567
2494 567 441 403 473 565 507 521 601 706 730 639 655 637 644 661 534 535 574 545 551 419 426 397 451 396 314 449 644 509 391 555 622 604
2492 604 504 345 467 427 431 441 607 641 625 610 511 526 502 674 624 617 682 689 471 614 548 482 516 465 400 388 367 400 447 454 465 394 456
2489 456 440 468 463 500 412 506 567 605 506 575 531 414 509 530 521 569 612 597 524 423 402 290 349 395 544 552 590 569 562 440 421 457 438 407
2485 407 391 363 464 499 554 550 508 425 373 297 403 460 434 446 354 338 402 446 561 535 562 496 487 497 441 398 471 503 502 566 618 509 490 614
2482 614 440 510 554 643 546 610 472 501 539 439 458 301 372 486 668 603 456 542 461 502 492 508 553 482 384 436 405 485 455 540 581
2480 581 347 441 413 422 449 461 577 558 663 588 477 609 462 375 434 637 467 511 532 493 631 535 470 385 480 549 518 424 550 536
2477 536 568 528 451 590 582 581 581 674 484 478 537 469 567 474 352 561 605 412 422 409 392 451 528 411 316 404 558 593 553 503 511 569 440
2474 440 364 415 439 375 496 469 383 329 376 364 326 316 325 204 270 371 360 432 426 407 387 468 587 517 540 400 310 260 317 274 304 295 401
2471 401 415 288 341 458 472 558 581 657 513 415 498 453 464 435 553 488 444 455 398 329 536 548 443 415 438 468 487 494 700 578 461
2468 461 509 526 511 399 365 306 402 566 470 366 425 441 426 443 488 471 542 583 594 660 471 324 489 448 433 220 471 650 550 610
2465 610 537 470 353 334 368 448 430 346 524 306 398 438 407 326 342 321 377 392 306 259 315 290 459 475 453 490 553 569 529 528 446 368 391
2462 391 359 400 343 420 437 490 533 538 655 578 489 501 570 490 500 433 498 523 397 506 571 410 475 486 489 437 420 349 436 476 514 629 553
2459 553 507 477 561 559 267 404 374 321 522 454 344 271 297 405 449 492 434 496 486 457 445 369 431 546 584 503 397 526 683 681 487
2456 487 549 549 557 600 652 652 659 452 523 539 543 594 540 492 523 534 619 580 668 705 326 251 443 506 587 617 691 534 445 557 564 582 561 628 662
2453 662 647 390 252 290 282 373 512 613 656 519 550 452 350 314 414 339 396 403 502 438 421 421 415 404 579 657 528 501 416 351 499 562
2450 562 584 517 475 565 625 622 560 550 639 424 476 537 478 516 452 480 474 533 656 516 309 477 561 377 420 357 422 578 519 683 605 382
2448 382 376 400 213 272 353 515 656 546 321 262 399 452 285 426 398 377 344 615 491 416 596 506 476 584 627 583 483 411 395
2445 395 513 540 498 297 449 567 496 422 385 587 626 584 419 289 308 364 449 494 476 579 456 390 343 273 294 473 523 432 426 306
2442 306 413 481 463 488 453 504 431 383 442 482 497 475 634 593 627 593 483 329 408 327 450 460 320 419 584 486 501 432 438 551 527
2439 527 419 412 379 479 464 463 598 488 476 514 564 491 408 481 498 457 472 383 380 517 341 453 533 389 473 370 589 730 660 569 674
2437 674 584 406 360 358 442 482 479 449 448 422 366 349 248 339 407 467 507 613 543 428 499 506 335 350 409 493 481 538 456 492 416 301 233 407
2433 407 462 420 518 402 351 425 292 526 464 474 588 587 466 512 538 450 312 388 307 370 389 414 487 395 393 431 460 535 580 464 549 371
2431 371 425 470 340 375 347 357 414 443 422 478 514 544 428 377 462 541 495 531 477 400 482 532 584 527 538 388 394 259 372 462 588 581 485
2428 485 463 429 350 388 320 288 203 333 491 431 429 395 566 553 463 645 572 522 490 429 397 439 390 438 319 363 308 434 449 413 500 434
2425 434 262 439 554 515 588 500 323 459 525 458 523 427 431 442 588 475 499 526 524 675 576 395 323 286 433 625 620 576 537 398
2422 398 373 392 493 586 567 433 324 192 336 453 547 498 596 660 398 513 413 311 537 435 424 566 626 444 382 255 282
2419 282 404 344 319 389 452 493 488 275 324 405 367 491 459 386 556 420 360 484 469 472 441 602 672 557 616 526 431 413 423 495 456 404
2417 404 513 564 504 488 422 498 593 448 322 427 467 507 617 698 612 420 205 245 264 360 397 465 415 467 418 450 464 517 452 463 395
2414 395 358 501 429 484 589 628 572 522 465 363 371 565 627 382 338 379 376 551 498 442 402 443 600 511 378 534 541 472 508 437 565
2411 565 542 514 598 535 450 392 436 452 353 455 490 373 359 330 366 514 506 455 531 510 427 416 513 538 402 396 431 443 473 473 379 364 400 448
2408 448 490 477 546 544 425 238 334 367 374 375 259 325 505 519 489 485 451 446 582 617 633 584 462 531 521 463 452 613 632 607 567 499 489 427
2405 427 632 614 655 535 373 393 404 362 286 339 430 496 407 302 357 521 422 355 407 445 584 513 355 359 359 469 386 479 412 395 418 533
2402 533 625 587 697 781 746 643 479 480 593 528 494 462 418 476 455 542 429 408 552 604 606 539 521 497 591 481 411 470 580 449 436
2399 436 398 386 445 427 315 173 345 635 636 564 452 311 359 410 529 638 597 627 469 310 385 524 392 404 484 434 348 480 437
2396 437 377 376 315 437 521 412 411 314 317 478 403 383 439 558 481 420 500 509 448 486 316 338 442 462 421 466 438 497 517 420 644 554 530
2393 530 601 573 481 573 633 527 458 383 507 608 636 588 431 408 359 435 539 429 501 573 742 674 615 669 623 485 494 614 565 586 499
2391 499 643 688 572 558 498 478 509 490 486 380 385 285 289 385 358 410 403 462 344 413 412 341 393 512 569 494 461 506 518 503 485 466 470 543 539
2387 539 430 341 333 400 410 377 384 393 516 391 291 479 523 619 531 586 502 489 465 345 292 320 436 507 411 343 397 564 405 332 428 296
2384 296 298 395 426 441 384 409 490 507 571 517 369 459 343 357 352 391 534 495 427 398 361 376 479 407 476 556 471 434 383 458 481 428 425 335
2381 335 398 396 511 560 592 452 420 478 418 431 472 444 549 536 485 539 565 422 150 323 361 342 395 422 410 294 435 487 434 585 461
2379 461 412 521 478 414 423 447 557 584 433 554 577 417 348 433 436 464 410 296 374 483 551 422 367 505 426 460 553 525 474 314 268
2376 268 327 443 512 555 343 322 370 449 434 410 446 382 384 484 503 552 542 574 596 688 474 311 316 462 550 556 395 355 395 357 298 404
2373 404 347 293 366 350 495 649 550 407 434 489 466 479 398 318 309 537 428 358 502 416 366 521 405 433 558 518 424 470 411 570
2370 570 401 284 313 340 279 296 381 426 431 410 328 475 618 584 508 607 671 561 463 357 496 494 625 547 491 319 294 372 438 436 441 388
2367 388 447 483 436 520 484 457 453 330 401 472 413 371 577 569 550 470 449 499 392 416 375 278 401 571 594 540 433 439 279 194 396 456
2364 456 426 418 484 512 502 389 480 435 527 527 470 364 448 451 423 312 257 297 324 404 407 470 582 583 541 480 389 298 350 553 686 630 582 446
2361 446 466 482 465 419 391 343 232 298 264 362 480 493 465 284 310 232 276 432 440 586 601 358 371 448 444 502 485 470 499 541 438 320
2358 320 514 665 491 395 403 412 333 377 385 439 411 363 511 580 627 518 500 436 497 512 418 477 572 437 633 486 406 384 426 445 560 446
2355 446 368 369 281 445 455 372 300 268 282 288 357 352 437 613 595 486 240 279 431 407 420 436 225 279 309 266 354 421 402 348 325 413 480
2352 480 542 500 380 279 219 341 269 381 340 543 563 566 421 392 510 533 526 393 465 446 541 443 476 625 495 432 415 441 552 560 586
2350 586 512 600 563 541 547 399 406 440 550 719 534 580 552 453 516 517 424 221 319 402 464 466 439 325 288 322 338 409 436 537 512 553 332
2347 332 282 317 638 762 625 612 582 544 572 485 505 503 561 653 505 520 547 482 412 423 462 556 557 529 550 448 402 338 453 473 334 334 315
2344 315 446 486 397 453 356 358 515 566 664 624 594 480 427 421 517 489 366 381 413 540 357 384 470 415 525 449 501 492 375 351 408 336
2341 336 361 333 421 590 470 350 479 445 292 384 455 479 629 599 564 570 671 513 360 320 471 359 291 437 479 508 357 340 476
2338 476 552 553 455 559 630 744 605 444 513 596 533 623 576 542 418 322 500 484 434 269 279 372 577 686 619 565 462 415 495 582
2335 582 628 514 519 607 487 463 469 458 513 505 436 362 426 512 339 364 495 429 369 320 510 607 424 412 593 502 265 443 446 393 437 315
2332 315 257 268 337 404 445 352 485 483 410 523 516 457 514 481 575 681 623 449 426 349 346 347 424 460 287 394 557 561 499 502 444 429 533 528
2329 528 491 343 444 492 448 408 416 610 655 577 499 325 440 472 389 458 434 540 443 402 530 520 422 443 597 587 511 570 582 609 573
2327 573 476 602 533 492 548 523 501 426 424 528 526 420 477 448 461 548 424 478 419 485 534 576 581 497 534 534 503 368 564 494 464 486 379
2324 379 306 408 421 511 590 635 523 492 643 606 466 466 609 597 598 619 525 607 622 432 362 464 478 443 449 487 442 466 525 659 572 462
2321 462 446 515 613 519 371 403 549 490 461 589 516 502 445 264 472 479 437 339 446 391 401 395 234 407 377 298 469 645 565 484 392
2318 392 466 515 617 735 587 500 444 439 351 426 475 468 505 608 524 527 425 448 388 374 343 504 540 452 413 448 450 342 436 482 444 495 618
2315 618 469 323 327 275 382 449 470 622 570 416 372 365 345 385 585 564 441 400 484 492 493 508 471 554 488 333 355 427 379 529 586 573
2312 573 490 320 449 618 500 540 513 473 465 467 529 461 452 435 278 352 482 468 396 373 437 510 398 431 389 394 451 524 485 451 435 470 467 515
2309 515 341 427 481 491 556 472 499 559 541 444 358 349 602 532 433 411 472 381 503 427 364 447 341 525 537 486 490 572 411 586 459 401
2306 401 558 562 476 442 489 535 576 500 556 513 574 455 421 499 479 470 503 520 528 460 412 410 381 473 553 504 541 524 434 400 521 524 387 438 536
2303 536 367 343 399 454 548 390 450 664 555 546 552 403 419 485 535 422 476 605 518 517 417 565 494 508 491 357 243 462 550 417
2300 417 468 617 536 496 563 603 526 455 369 371 361 366 461 407 534 591 425 414 472 644 618 409 274 471 481 393 393 467 288 276 337 348
2297 348 396 461 543 558 396 610 555 454 481 541 514 529 497 423 536 819 744 577 514 550 488 441 520 611 515 529 516 543 401 402 396 418
2294 418 363 389 463 423 329 305 365 334 398 498 644 642 459 478 396 451 472 459 393 474 547 466 349 342 507 638 510 543 502 456 413 448
2291 448 644 646 501 577 564 656 638 520 572 480 377 209 257 314 297 301 384 397 324 422 598 586 506 416 475 487 342 452 311 299 400
2288 400 385 413 398 246 353 421 440 523 424 357 324 527 388 409 533 562 475 390 527 581 497 466 528 553 487 479 601 522 438 413 458 382
2286 382 439 493 348 573 531 467 390 478 347 378 307 390 396 310 348 479 526 510 497 595 522 474 496 462 465 268 240 314 337 403 578 626 459
2283 459 451 579 637 563 460 368 295 436 347 344 260 313 426 321 370 418 546 325 450 417 323 347 364 252 367 273 366 468 415 426
2280 426 542 410 378 535 516 551 585 578 580 476 406 561 535 641 535 503 499 348 493 391 333 368 433 414 409 427 272 367 399 416 393
2277 393 423 527 319 500 453 424 350 361 328 298 419 536 394 337 383 335 272 322 165 258 223 282 421 389 529 512 492 491 373 406
2274 406 414 451 592 593 504 465 407 493 595 544 425 395 476 399 494 513 329 383 448 435 407 575 635 421 357 394 446 402 377 359 442 513 332
2271 332 230 264 356 584 432 512 495 360 550 571 491 416 409 510 414 287 476 524 571 498 427 514 649 717 500 351 408 303 299 282
2269 282 306 376 320 379 493 391 405 376 465 451 292 309 569 578 289 220 389 416 511 376 283 547 483 456 435 355 380 409 268 425
2266 425 438 344 386 409 293 293 413 505 448 411 454 492 396 388 329 297 339 359 340 387 493 345 265 314 384 324 368 408 289 345 406 455 475
2263 475 565 445 373 341 246 218 428 402 464 560 539 478 484 429 242 315 389 451 430 363 419 687 513 604 602 463 481 567 604 399 409 624
2260 624 609 420 392 318 383 427 513 554 376 383 410 323 376 155 227 376 396 483 532 413 243 340 425 446 426 491 503 437 287 203 364
2257 364 377 384 420 454 313 306 293 299 527 379 525 536 537 518 592 555 439 416 458 445 354 448 359 406 582 525 381 326 401 445 442 537 588 427
2254 427 507 415 459 445 485 378 317 340 315 426 417 486 564 533 391 482 492 528 477 344 322 486 442 448 407 424 394 426 369 535 469 335
2251 335 395 310 233 320 478 574 587 542 548 556 693 634 527 550 561 493 470 495 665 706 502 503 434 319 359 371 460 492 400 336 398 439 543
2248 543 482 387 429 340 470 657 651 469 343 312 456 608 515 524 411 374 331 429 490 535 530 399 540 562 311 338 444 431 420 415 480
2245 480 417 447 498 480 412 345 387 314 389 303 300 440 543 418 372 333 366 436 470 417 333 278 342 518 502 502 471 368 348 374 385 317 280
2242 280 338 536 618 603 488 431 339 389 414 477 503 302 309 412 498 591 498 393 394 397 317 386 436 437 508 417 338 409 500 469 427 425 462 557 563
2239 563 593 447 488 575 470 588 646 428 504 520 458 276 446 548 463 399 372 525 479 565 348 410 657 602 500 340 352 424 437
2237 437 585 779 733 570 451 448 618 628 659 726 733 653 539 441 491 590 612 535 303 344 415 362 322 313 330 355 321 456 475 395 527 610
2234 610 567 419 350 396 318 386 438 409 382 373 439 558 496 545 644 496 541 505 483 405 392 543 530 433 483 517 510 522 416 413 486 369 548
2231 548 348 339 517 512 455 478 404 454 487 356 311 405 334 299 561 690 494 507 663 503 410 428 404 415 373 362 281 194 310 436 433
2228 433 300 416 505 491 494 445 329 283 283 391 477 419 417 603 563 524 604 344 337 361 271 314 265 213 259 320 425 424 444 425 396 484 407 237
2225 237 420 334 531 533 421 475 429 348 558 400 313 357 408 439 453 453 283 308 300 316 377 273 430 371 386 417 465 511 528 510 391 423
2222 423 475 404 470 511 548 662 622 493 449 546 548 500 404 546 555 426 278 311 299 345 453 518 417 296 276 447 527 586 624 504 493
2219 493 491 518 356 397 567 519 553 393 494 473 455 345 233 470 502 318 477 516 396 470 381 383 502 490 377 385 499 449 454 355
2216 355 202 341 387 353 389 472 435 410 500 499 400 199 203 152 33 144 234 307 244 251 287 410 322 408 506 473 488 395 357 390 415 405 305
2213 305 308 376 460 432 544 510 366 325 274 200 285 350 329 377 516 564 351 369 435 318 328 391 345 335 314 395 462 444 541 460 347 378
2210 378 522 516 383 354 382 394 442 447 515 515 279 352 451 497 488 464 431 465 398 438 488 499 406 327 324 322 366 371 346 573 465 277 310 506 441
2207 441 347 301 442 498 478 550 534 589 436 410 288 329 306 490 437 338 395 333 520 454 483 390 289 318 330 392 413 425 477 498 363
2204 363 347 344 310 441 545 568 439 429 576 480 423 479 469 435 420 508 511 598 596 493 390 436 453 526 587 739 676 700 602 408 440 439 515
2201 515 496 483 521 445 412 475 511 565 561 442 453 502 467 545 422 306 407 366 342 254 298 390 503 455 388 587 513 483 370 363 453 394
2198 394 497 456 378 426 436 333 338 453 638 578 532 696 564 319 293 544 516 420 376 504 548 544 490 446 535 633 453 337 551 654
2196 654 581 498 639 608 448 457 520 542 323 427 459 500 494 400 446 299 314 321 395 405 501 587 557 522 654 501 365 460 417 455 512 701
2193 701 596 534 538 402 256 286 363 529 527 462 661 534 508 513 399 432 581 432 347 368 364 532 499 522 542 409 460 358 326 464
2190 464 393 463 451 389 449 538 540 452 536 616 500 526 603 588 418 300 421 486 580 571 455 538 408 478 421 583 583 495 556 493 516 465 520
2187 520 634 425 428 519 535 570 695 726 645 690 927 811 580 604 716 694 672 659 721 840 883 869 1013 1173 1262 1473 1677 2072 2146
2184 2146 2508 2649 3017 3405 3769 4216 4484 4722 5092 5151 5036 4887 4543 4369 4095 3846 3470 3071 2780 2352 2021 1913 1736
2182 1736 1497 1330 1229 1127 1107 998 939 940 884 834 749 779 748 782 755 801 723 731 643 679 745 567 500 683 859 860 706 752 729 644 757
2180 757 533 603 788 705 713 772 674 423 462 610 516 390 385 503 469 411 457 631 506 537 445 404 465 387 448 477 560 569 581 596 496 511
2177 511 631 542 429 460 540 488 471 435 456 462 493 456 381 449 442 599 518 347 298 346 498 583 540 395 468 541 540 323 364 473 555 508
2174 508 451 507 396 339 440 334 368 370 393 405 510 625 604 452 426 449 365 410 326 323 440 652 527 351 301 261 295 434 335 327 414
2171 414 318 299 261 414 457 543 453 352 401 537 503 407 439 326 422 404 581 477 435 625 714 589 512 509 340 457 553 530 482 532
2168 532 582 409 356 355 354 377 581 545 365 351 316 382 546 333 255 383 482 674 582 535 391 524 526 389 528 680 525 396 454
2166 454 428 442 452 486 513 542 636 589 539 587 653 668 733 595 428 463 441 481 557 471 564 619 585 694 697 789 647 624 495 574 664 603 495
2163 495 488 649 602 620 588 633 584 582 696 648 649 619 647 677 682 737 732 724 617 450 457 500 475 439 397 395 432 586 525 540 521 542 591 652 783 726
2159 726 596 517 707 925 1116 984 1002 991 957 790 813 803 866 678 593 718 875 857 728 678 739 765 700 734 847 819 880 814 788
2157 788 657 586 714 718 703 777 721 947 1010 931 957 1018 972 1152 1206 1235 1271 1234 1293 1388 1562 1595 1522 1638 1902 2064 2248 2566 3095 3576
2154 3576 4079 4769 5515 6553 7970 9434 10873 12602 14356 16382 18059 19686 20895 21724 22036 21736 20908 19703 18306
2152 18306 16793 15307 13705 12202 10777 9432 8121 7080 6016 5129 4388 3920 3511 3167 2812 2736 2452 2242 2144 2071 1900
2150 1900 1919 1874 1630 1546 1601 1469 1431 1504 1430 1365 1291 1245 1315 1077 1089 1002 942 795 711 684 603 609 710 673 605 834 945 774 742 728 846
2148 846 832 803 843 577 653 783 750 663 582 705 656 628 528 580 622 559 619 607 714 618 577 537 585 580 630 484 463 423 478 616 640 619
2145 619 549 542 572 668 662 676 644 605 517 457 589 517 580 563 423 444 484 482 608 612 652 650 703 570 676 567 486 505 614 658 660 568 670 905
2142 905 772 647 575 450 599 615 653 615 519 639 681 669 763 635 567 579 389 363 444 328 381 570 632 699 620 621 636 519 551 555 409
2139 409 409 441 464 543 374 429 508 533 571 459 631 522 321 496 623 654 525 456 471 364 425 680 576 525 598 628 664 676 704 598
2136 598 572 757 619 564 590 645 688 553 583 614 583 554 582 648 836 841 705 641 599 422 435 532 513 454 495 485 459 487 493 466 512 552 494
2133 494 519 704 701 600 473 516 577 551 382 581 571 552 634 710 786 743 724 870 736 756 711 605 754 749 644 639 734 710 686 882 715
2130 715 590 625 574 485 422 421 456 637 535 449 629 617 552 529 594 659 664 635 545 737 691 518 550 550 679 657 696 691 679 550 488 520 630
2127 630 583 623 496 500 595 472 491 497 603 765 656 753 856 815 886 782 816 832 772 733 925 855 689 736 540 647 652 592 602 754
2124 754 630 401 485 507 560 659 721 774 691 755 751 729 829 695 638 715 748 740 711 922 782 676 695 751 950 982 890 768 683 829 885
2122 885 878 884 836 746 662 770 845 770 792 858 1049 815 746 769 948 1003 967 1030 1046 1005 923 1081 1125 1248 1076 1007 1009 992 984 989 1028 977 1055 754
2119 754 890 837 890 1033 1042 1031 1018 1096 1055 953 912 1018 1049 984 1122 1115 1136 1123 985 1205 1129 1171 1218 1247 1281 1288 1144 1172 1217 1244 1212 1057
2116 1057 1122 1139 1165 1164 1052 960 1084 1205 1349 1233 1169 1219 1219 1261 1348 1287 1448 1508 1254 1181 1253 1311 1429 1334 1351 1479 1538 1435 1315 1512
2113 1512 1601 1452 1477 1534 1549 1594 1562 1576 1525 1438 1410 1452 1451 1641 1568 1437 1663 1719 1892 1914 2120 2171 2163 2286 2319 2422 2484 2460 2472 2608 2637
2110 2637 2607 2517 2601 2788 2710 2524 2644 2637 2567 2681 2609 2662 2674 2604 2618 2667 2793 2937 2931 2969 3113 3043 3146 3234 3464 3601 3735 3894 4067
2107 4067 4380 4419 4557 4802 5188 5507 5689 5984 6100 6368 6798 7124 7370 7657 7892 8204 8563 8886 9416 9872 10179 10694 11431
2105 11431 11998 12931 13916 14738 15702 16824 17998 19184 20409 21620 22805 24020 25170 26012 27042 28149 29230 30149 31338
2104 31338 32592 34040 35656 37740 40399 43808 48230 53810 60955 69903 81230 95705 114098 137447 166597 202310
2102 202310 245316 296206 355247 422261 496330 575534 658166 740558 818373 885251 934255 959108 955787 926406
2101 926406 877015 814161 745009 673358 601581 531067 462812 399057 341175 289063 242948 203442 170682 144718
2100 144718 124675 109347 97313 88012 80577 74494 69276 64886 60935 57620 54711 52238 50095 47994 46018 43951
2098 43951 41897 40062 37980 36070 34179 32189 30099 28183 26113 24012 22015 20313 18666 17234 15880 14669 13659
2097 13659 12726 11925 11170 10685 10310 9806 9403 9095 8839 8715 8494 8388 8136 7817 7505 7362 7368 7208 7117 6989 6777 6692 6513 6572
2094 6572 6577 6429 6254 6248 6325 6623 6786 6998 7511 7961 8649 9644 10844 12335 14014 15836 17874 19885 22116 24204 25812 26751
2092 26751 26640 25342 23290 21129 19212 17518 15680 13705 12001 10749 9531 8314 7260 6495 5733 5387 5246 5005 4953
2091 4953 4936 4717 4616 4580 4451 4238 4036 3901 3774 3571 3445 3191 2925 2840 2871 2763 2669 2759 2621 2453 2412 2539 2583 2701 2819 3011
2088 3011 3192 3257 3437 3573 3712 3907 3782 3670 3622 3519 3345 3139 2967 2872 2594 2510 2400 2287 2268 2028 1935 1831 1820 1813 1730 1680 1749
2086 1749 1655 1521 1636 1574 1487 1492 1536 1508 1564 1387 1460 1435 1387 1307 1296 1204 1134 1335 1415 1447 1257 1082 1148 1237 1241 1301 1257 1250 1204 1347 1256 1143
2083 1143 1022 1040 1123 1218 1185 1219 1150 1273 1202 1138 1250 1246 1218 1210 1282 1268 1292 1219 1156 1234 1281 1168 1147 1154 1169 1073 1085 1157 1078 1189 1232 1173 1110
2080 1110 1047 1005 953 1025 1094 1228 1104 1014 899 1017 1181 1279 1080 908 991 1163 1138 1258 1292 1164 1212 1164 1103 1141 1183 1248 1208 1208 1119 957
2077 957 907 1098 988 921 894 998 1044 993 1104 1074 922 966 1040 955 865 961 955 854 949 967 913 878 957 1102 1078 969 1048 1059 1118 919 1001
2074 1001 1072 973 1022 1027 930 1075 949 834 759 860 984 916 960 882 910 1009 941 914 943 932 1012 1076 973 855 910 940 881 920 848 828 837 996
2072 996 927 945 815 807 816 752 813 883 786 818 710 698 910 1023 991 846 783 775 984 908 1077 1104 969 855 810 900 855 906 953 979 881 848
2069 848 932 779 935 1130 942 1002 927 966 888 863 968 931 1034 1009 1126 972 827 950 919 859 817 819 1099 969 982 961 921 947 968
2066 968 860 753 725 815 895 980 976 867 935 1021 822 832 935 767 846 924 870 865 850 1121 1147 1092 1164 1222 1357 1414 1422 1428 1508 1644 1729 1643
2063 1643 1416 1478 1594 1442 1346 1283 1136 1042 1111 993 1079 1115 956 829 771 836 883 888 802 721 634 617 800 911 914 733 724 631 722 711 771
2060 771 828 750 785 727 684 745 696 789 838 767 728 831 800 585 664 706 778 813 798 864 775 706 714 681 727 710 631 731 676 700 826 805 784
2057 784 755 644 593 762 922 751 650 597 590 617 720 989 943 856 825 849 795 621 647 639 699 752 669 668 687 668 698 777 715 653 609 704
2054 704 712 741 692 604 743 839 650 621 607 625 640 630 654 651 637 576 560 564 620 729 747 726 745 665 639 770 731 729 857 769 723 655 652 783
2051 783 836 659 716 766 641 702 655 630 690 775 857 770 598 671 777 783 639 599 706 743 643 718 645 627 674 708 724 718 634 700 877 704
2048 704 511 521 641 767 663 728 887 621 449 588 696 726 881 844 780 705 703 765 646 695 680 489 606 762 801 713 719 783 683
2046 683 746 725 621 646 891 851 846 877 774 720 827 831 691 786 779 810 729 659 818 664 845 848 712 860 778 763 663 639 788 745 634
2043 634 661 752 697 723 686 701 659 697 761 757 819 956 858 812 770 628 715 789 753 649 626 618 589 685 842 738 695 696 696 655 691 743 584 557
2040 557 496 557 549 516 676 714 665 674 685 666 857 836 772 918 773 667 680 748 886 957 973 814 838 742 725 701 672 577 644 590 805 871
2037 871 744 704 789 664 565 711 743 727 721 709 769 807 829 695 789 796 660 550 551 677 722 678 798 765 715 872 792 615 676 677 607 610
2034 610 596 629 545 599 672 813 771 708 715 834 796 743 836 641 737 676 665 782 768 877 774 516 596 660 732 833 589 722 779 821
2031 821 929 900 825 583 670 881 785 771 565 527 475 369 554 681 607 653 684 669 671 761 695 618 647 690 725 571 644 558 500 641 607
2029 607 664 754 823 800 739 764 636 572 623 627 678 682 626 528 469 671 630 569 662 823 792 754 724 793 734 626 834 713 607 562 609 567
2026 567 611 620 670 800 760 557 540 687 726 760 651 658 663 607 668 739 710 690 807 834 789 720 685 744 675 656 817 647 554 537 578 725
2023 725 741 775 722 688 755 752 649 711 788 674 666 662 634 584 774 725 773 695 566 654 599 737 732 948 1017 837 741 635 770 810 821 806
2020 806 841 703 805 932 975 1046 1096 987 1013 864 841 912 881 993 1005 1084 1045 1183 1311 1385 1512 1360 1580 1846 1982 1948 2115 2675
2017 2675 3070 3398 3611 4197 4540 4775 5007 5388 5516 5312 5053 4844 4529 4231 3772 3473 3224 2841 2710 2177 2068 1944 1763
2015 1763 1503 1226 1308 1135 1134 1122 964 919 963 987 964 918 949 970 986 970 914 876 799 920 790 754 853 809 808 830 879 776 693 775 694 790
2012 790 805 797 670 713 706 739 627 748 828 745 663 713 676 667 766 808 831 805 722 479 464 565 563 696 741 680 616 623 559 671 659 657 688 617
2009 617 621 669 773 855 587 694 792 797 659 601 646 822 841 895 860 804 722 627 575 599 590 575 670 682 802 768 741 728 732 713 785 851 798 673
2006 673 654 740 745 605 673 809 765 620 615 562 694 766 815 698 646 703 640 474 596 605 556 573 600 632 685 691 641 662 604 529 582 586 630 812
2003 812 803 744 614 671 944 795 624 768 639 618 607 622 845 788 655 662 568 472 502 562 618 610 558 564 602 809 669 807 833 688 499
2000 499 585 692 661 570 504 636 655 657 728 824 715 634 682 772 711 626 573 673 634 773 649 668 700 783 708 679 827 809 608 747 747
1997 747 765 703 479 491 575 568 669 768 616 559 527 570 584 649 614 589 648 598 601 723 785 703 650 552 543 578 549 491 521 621 622 586 646 684
1994 684 697 658 666 595 684 716 694 641 748 860 824 682 767 812 657 628 627 620 635 650 661 631 795 693 727 626 597 662 611 495 618 747
1991 747 572 635 764 643 580 644 517 480 562 738 815 615 667 598 531 511 515 548 546 699 834 968 864 748 851 849 800 758 728 714
1989 714 593 525 505 572 644 669 590 487 562 632 661 718 746 680 722 814 668 596 620 766 716 622 529 661 766 760 627 578 680 853 746
1986 746 564 607 609 584 603 582 655 645 688 620 675 689 751 583 623 595 654 671 634 635 560 473 621 708 594 643 723 765 645 734 669 613 622 686
1983 686 714 739 630 555 643 656 700 803 665 671 570 507 670 816 802 662 799 706 580 664 615 515 655 730 625 751 800 602
1980 602 531 469 467 657 686 658 614 565 646 574 617 683 756 657 613 725 640 569 610 513 469 510 674 652 700 714 621 537 552 713 881 843 767
1977 767 703 765 735 804 874 750 743 721 621 557 562 529 675 708 782 789 751 747 627 420 463 556 659 667 731 537 452 495 717 635 531 545 691
1974 691 814 791 825 670 706 716 665 586 433 411 486 597 624 688 800 829 775 841 770 710 570 529 591 685 521 556 475 598 604 696 543
1971 543 582 715 824 765 819 756 650 606 512 618 762 611 421 597 636 690 707 643 652 481 479 744 767 650 721 790 748 794 839 685
1969 685 570 575 535 612 548 561 636 601 572 554 598 501 504 651 606 648 720 765 683 465 587 668 711 729 815 802 647 667 694 605 632 702 666
1966 666 623 532 640 782 750 692 720 740 645 587 617 751 767 769 687 589 620 559 550 666 649 488 645 884 831 738 553 558 675 791 786 649
1963 649 585 608 734 883 752 550 526 727 663 736 742 742 647 668 794 686 718 818 758 718 629 531 561 695 727 732 655 635 721 749 730 908
1960 908 885 748 654 506 661 799 879 646 568 533 564 716 825 740 676 670 736 534 358 515 617 605 610 550 603 624 748 749 723 672
1957 672 701 728 718 615 644 641 650 567 670 544 537 662 598 551 651 629 460 517 547 585 581 522 527 670 702 738 537 587 589 440 637 640 579
1954 579 549 667 787 610 476 554 579 608 614 583 629 640 503 524 559 565 673 679 590 462 579 737 711 523 632 697 660 439 377 482
1951 482 552 697 728 619 752 685 594 588 670 706 604 697 803 905 818 792 866 784 478 433 646 532 552 578 638 482 543 660 717 623
1949 623 735 648 581 573 670 801 851 844 856 812 783 805 798 722 631 601 604 614 600 745 824 908 828 863 834 765 634 623 703 685 727 697 660 587 397
1946 397 419 595 693 571 584 652 837 817 757 676 711 544 589 741 616 634 722 572 553 588 619 577 414 525 712 821 738 506 555
1943 555 542 574 718 738 520 581 657 646 602 552 608 686 676 615 586 627 551 541 537 509 494 506 616 494 548 512 654 635 650 692 636 610 521
1940 521 651 595 545 603 605 599 694 645 672 669 610 719 613 705 648 593 700 727 798 623 685 727 644 586 665 735 899 902 810 732 788 720 629 742
1937 742 758 728 706 720 728 873 716 828 885 783 751 730 743 669 699 638 696 727 638 590 551 471 445 606 623 736 691 575 393 519 548
1934 548 546 610 663 706 611 745 794 805 741 581 469 502 657 691 680 660 727 707 521 506 539 741 748 702 653 507 673 548 601 556 693
1931 693 899 793 578 559 663 559 695 903 767 689 583 740 784 757 711 686 719 635 618 623 472 522 614 479 594 593 533 554 599
1929 599 816 745 708 805 695 701 653 694 795 691 651 547 412 666 620 634 670 602 575 697 442 327 410 386 543 603 548 485 503 492
1926 492 546 495 615 692 684 704 585 518 650 540 597 653 587 574 441 480 669 680 605 690 583 622 624 547 683 771 774 738 632 710 811
1923 811 743 773 780 886 909 955 874 670 657 733 704 639 615 612 682 742 653 643 823 815 660 667 711 773 613 511 682 659 705 754 768 725 722 708
1920 708 596 670 729 771 697 577 465 603 770 585 614 608 579 519 465 418 337 397 463 549 696 652 684 669 607 678 682 648 710 630 726 754
1917 754 719 733 675 578 664 693 782 736 643 549 559 704 630 597 686 731 598 363 499 689 593 646 667 630 698 719 811 869 803 736 524 715
1914 715 816 834 869 814 711 755 693 767 744 590 673 717 771 717 637 690 832 718 633 549 530 506 619 727 710 667 620 806 896 656
1911 656 731 716 690 739 816 784 831 839 747 803 904 997 938 738 843 882 957 842 833 1003 974 963 1141 1109 994 1082 1119 1238 1186 1205 1247 1199
1908 1199 1168 1181 1205 1362 1379 1331 1505 1648 1739 1679 2019 2302 2587 2801 3162 3691 4379 5241 6310 7554 8913 10515 12382 14456
1906 14456 16455 18460 20314 22193 23784 24442 24358 23415 21824 20048 18323 16528 14728 12752 11084 9577 8383 7185
1905 7185 5998 5108 4411 3698 3416 3080 2870 2651 2358 2308 2155 1978 1797 1871 1904 1784 1621 1560 1653 1622 1630 1501 1319 1301 1359 1266
1902 1266 1192 1249 1093 1074 1058 817 908 893 974 805 826 756 673 746 746 565 553 758 762 822 834 818 724 725 775 827 860 816 800 841 856 808 782
1899 782 763 704 659 672 843 849 778 856 756 791 815 792 772 778 689 717 623 539 661 710 783 701 690 781 788 789 650 546 514 683 663 636 670 743
1896 743 777 832 725 656 689 572 675 677 789 643 642 610 550 653 693 578 527 564 598 530 699 752 660 694 660 644 622 658 670 842 552
1893 552 580 751 644 668 608 732 758 698 693 615 735 687 589 731 761 623 696 673 594 602 664 795 796 637 622 712 578 552 483 556 674
1891 674 634 471 516 690 773 696 661 455 503 581 671 594 475 542 658 609 641 598 549 483 579 648 577 538 543 570 612 695 861 823 878 874 702
1888 702 670 651 544 449 505 505 507 561 595 541 637 572 429 699 692 740 758 640 616 707 620 475 439 487 528 695 680 714 695 549 468 447 477
1885 477 492 553 501 670 785 734 630 476 557 500 541 484 542 495 580 525 322 432 507 438 389 502 764 606 594 606 686 669 595 631
1882 631 705 611 595 665 715 638 607 634 551 664 711 611 679 567 547 716 540 644 550 553 486 503 683 537 472 563 475 472 622 569 374
1879 374 431 587 719 778 646 597 473 401 465 552 563 524 598 661 750 726 704 578 715 709 663 671 578 618 689 639 636 450 569 628 591 537
1876 537 469 601 493 441 493 427 526 514 603 640 599 575 520 593 511 461 594 688 693 549 531 431 454 535 575 451 530 477 614 537 536 415
1873 415 418 510 518 561 480 628 601 589 532 540 523 458 483 546 583 555 620 659 556 444 430 553 491 577 631 714 633 732 621 541 583 596 548 547
1870 547 621 578 480 557 728 693 702 630 533 467 613 629 491 426 519 659 567 534 464 490 531 638 694 637 511 728 848 707 646 475
1867 475 549 584 570 636 668 703 628 595 499 378 415 529 704 697 642 726 864 860 573 566 556 683 725 672 532 498 526 600 536 534 608 635 587
1864 587 571 523 396 495 511 604 445 372 471 706 544 480 495 621 696 602 483 549 613 472 542 545 568 673 729 642 733 710 500 645
1862 645 663 516 592 575 616 672 633 597 589 528 537 519 548 385 377 482 502 618 635 660 498 499 565 607 639 677 600 671 660 570 694 518 421
1859 421 492 602 600 477 463 603 669 593 430 551 605 636 537 616 695 688 637 561 723 608 581 453 483 536 516 471 551 563 449 557 601
1856 601 503 609 624 472 462 456 584 816 652 624 583 462 569 649 639 474 441 473 497 583 480 480 645 691 660 616 680 577 413 403
1853 403 566 514 587 540 483 501 653 621 623 566 636 603 511 530 468 619 565 637 573 393 511 637 597 699 545 431 457 568 704 677
1850 677 552 592 555 633 539 511 559 664 674 556 413 610 465 420 394 271 325 414 469 638 556 387 492 660 623 642 683 509 507
1848 507 493 499 618 574 559 547 389 363 456 440 608 496 452 514 494 641 632 599 599 635 539 622 524 669 716 622 568 619 649 538 507 484 479
1845 479 512 462 413 458 591 652 718 670 674 687 568 383 377 488 588 575 466 432 500 478 618 531 506 446 451 609 625 580 498 477 496 538
1842 538 516 536 543 573 620 686 643 517 528 547 504 479 451 372 506 550 459 526 688 633 592 757 724 594 671 628 626 686 574 652 591 485
1839 485 469 441 345 381 576 586 545 505 633 623 583 643 622 568 675 879 715 777 802 736 671 471 447 527 545 478 613 623 632 762 682
1836 682 559 616 540 658 644 588 524 583 540 531 609 559 475 447 482 511 362 452 484 425 537 466 486 616 575 608 509 450 486 549 605 616 570
1833 570 527 626 619 411 357 513 526 635 567 593 678 585 515 467 477 618 397 302 503 468 397 519 696 700 618 538 465 477 433 450 431 396
1830 396 399 453 466 567 663 595 503 520 470 651 542 391 585 619 664 440 394 409 397 498 588 525 409 330 403 541 575 506 559 622 569
1827 569 519 589 550 558 529 454 546 675 553 510 488 462 449 537 697 656 526 477 519 645 567 746 686 583 545 422 439 520 537 584 588 287
1825 287 391 485 497 614 591 503 441 370 518 614 665 622 594 592 661 616 698 657 654 752 776 662 603 685 847 757 705 736 679 636 489 453 406
1822 406 528 646 479 496 532 642 652 629 637 561 493 504 610 667 531 642 655 735 631 657 681 624 608 496 416 482 523 462 392 509
1819 509 641 547 593 515 625 438 437 429 598 623 494 542 618 618 577 616 559 538 522 542 520 483 547 517 553 480 432 446 341 428 404 424 575
1816 575 693 456 380 340 427 370 367 328 388 492 342 464 633 641 490 323 430 537 613 646 440 474 517 523 485 489 426 454 614 618 623 629
1813 629 683 618 528 491 422 629 733 656 713 579 608 720 588 558 484 387 445 576 570 627 587 493 520 517 464 672 614 560 642 625 514 506
1810 506 519 417 495 593 660 568 485 530 618 557 562 473 415 394 517 503 562 640 729 612 499 477 457 508 611 717 817 670 611 475 459
1807 459 497 437 644 500 514 602 616 487 464 568 534 676 678 602 685 498 414 401 514 593 589 577 717 603 476 391 474 446 491 718
1804 718 738 545 563 729 668 648 794 619 404 424 511 741 798 623 518 512 438 400 422 493 671 634 548 548 583 501 557 571 511 509 373
1802 373 387 332 247 425 408 533 438 530 614 430 347 324 500 555 386 507 524 635 588 569 522 436 436 431 434 436 486 449 402 441 322 343 425
1799 425 386 488 524 403 457 541 549 543 465 489 447 513 372 323 262 294 357 434 493 530 648 557 566 651 566 406 384 410 479 515 568 464 268
1796 268 363 452 564 639 577 548 585 530 604 634 606 517 435 557 411 382 332 454 614 413 508 611 706 584 516 443 466 364 323 436
1793 436 474 570 543 372 477 468 483 431 330 368 550 637 432 460 463 414 329 566 609 544 467 307 236 305 426 573 583 496 544 634 678
1790 678 572 535 612 431 313 281 269 385 413 491 464 559 665 566 598 636 622 563 615 602 617 666 529 425 563 501 626 684 558 486
1787 486 553 612 477 510 647 642 507 369 211 198 276 336 399 422 407 409 538 451 483 560 546 611 603 465 583 580 467 431 504 521 427 500
1784 500 498 524 442 433 628 664 645 615 579 583 471 415 478 408 390 529 468 398 472 515 572 585 608 485 413 521 424 370 389 519 554 568 513
1781 513 384 507 580 548 539 531 485 498 483 339 400 498 487 568 582 605 552 603 478 427 406 310 332 364 315 485 458 412 467 449 336 467
1779 467 506 406 387 290 309 524 557 427 475 435 449 585 533 615 423 382 589 556 434 458 575 501 438 467 490 369 403 471 393 350
1776 350 488 537 537 545 715 599 488 534 430 379 436 406 426 443 564 551 419 623 647 497 600 554 506 460 298 325 407 517 744
1773 744 829 714 641 548 498 421 381 472 654 624 530 498 563 611 477 418 486 548 489 481 471 441 492 562 533 494 398 495 547 406 382 476 636
1770 636 346 215 404 487 467 510 377 492 375 405 625 574 522 352 405 484 504 395 191 327 345 425 440 449 541 502 587 632 619 574
1767 574 484 409 406 467 424 283 477 423 347 527 442 534 577 526 530 665 658 517 518 541 676 641 515 476 381 304 371 235 261 361 501 516
1765 516 440 426 500 504 453 466 440 381 514 477 367 464 407 368 332 438 475 532 595 605 666 627 465 417 377 342 405 445 421 365 647 666 506
1762 506 531 523 513 557 497 607 528 437 524 712 492 383 413 479 444 629 438 378 368 433 376 396 280 355 498 508 585 492 412 549 584
1759 584 405 382 379 390 353 357 408 425 491 457 405 435 440 469 528 580 433 421 434 360 385 455 470 402 376 495 317 324 261 264 324 551 606 546 563
1756 563 503 534 684 661 577 439 508 479 573 470 604 688 563 561 473 535 510 513 475 562 582 620 518 427 326 345 285 442 592 635 619
1753 619 615 438 514 489 590 610 508 547 623 558 434 470 422 477 478 502 520 517 463 472 533 613 651 591 584 660 652 520 569 578 533 292 315 275 461
1750 461 574 560 580 525 436 389 350 412 417 349 375 553 572 535 502 543 446 441 533 502 458 398 272 224 410 580 711 643 447 424 388 542
1747 542 427 365 370 354 383 243 379 483 437 446 409 541 544 522 417 420 379 564 532 486 548 621 647 523 567 574 521 487 575 564 440 535 429
1744 429 511 654 530 474 519 418 396 481 540 489 509 436 465 237 246 400 395 364 424 439 345 386 403 400 493 406 342 290 407 506 542 569 488
1741 488 479 558 618 668 691 697 586 538 366 276 395 387 457 603 591 671 637 482 600 679 544 591 686 650 525 489 552 480 440 404 528 552
1738 552 614 750 577 564 443 515 353 391 476 552 547 421 579 549 466 353 484 412 287 525 528 487 489 473 485 412 414 474 587 510 434
1735 434 425 564 565 514 515 430 314 301 327 449 437 465 569 505 553 579 570 525 499 480 344 359 388 385 339 464 452 407 282 335 350 318 300 313
1732 313 263 436 632 573 459 435 482 540 572 675 593 508 572 530 523 452 393 390 469 522 523 530 428 417 427 376 508 528 598 544 450 414 404 466
1729 466 524 464 366 294 348 471 501 589 583 483 509 559 568 549 398 567 418 372 341 328 359 312 341 422 485 563 641 603 558 565 399 480 419
1726 419 361 478 425 261 414 507 514 414 352 578 652 469 521 622 508 512 371 420 457 448 641 479 311 530 459 407 315 511 582
1723 582 385 488 547 702 530 429 462 426 382 513 455 400 443 386 532 498 635 592 407 283 411 537 526 477 453 557 643 657
1721 657 452 410 408 416 364 546 607 490 337 362 384 507 423 459 477 413 358 532 592 461 471 467 559 407 532 621 774 577 520 443 339
1718 339 393 479 504 548 562 491 360 404 546 500 648 609 409 356 424 438 544 453 527 518 527 516 318 431 537 643 530 516 435 494 504
1715 504 508 421 399 373 368 431 580 715 658 660 558 540 597 463 470 396 470 597 402 446 579 725 687 569 446 492 520 506 524 539 534 565
1712 565 505 455 359 410 530 428 450 417 533 636 792 773 647 668 745 625 651 690 636 555 507 620 657 661 618 683 635 654 696 572 489
1709 489 376 366 441 422 449 493 485 434 429 389 440 571 364 382 355 338 429 343 200 254 420 330 322 340 540 549 521 371 313 334 465 431 244
1706 244 397 527 564 575 502 520 448 606 556 531 443 381 342 432 510 502 532 479 460 436 402 438 455 518 547 604 634 637 504 437 491 405 378 297
1703 297 239 384 447 349 214 218 311 569 562 429 291 375 609 564 520 620 682 702 528 542 450 451 434 481 536 638 526 412 421 450 533
1700 533 526 528 438 373 385 280 300 402 430 289 338 307 300 500 535 388 415 449 314 412 435 354 373 606 557 579 649 616 498 398 506
1698 506 475 450 540 540 545 547 494 707 562 411 386 469 426 436 494 403 339 426 518 474 422 371 282 319 535 548 488 458 531 491 475 497 486 540
1694 540 485 548 521 442 444 502 509 583 417 414 380 505 457 473 600 383 342 486 387 420 327 396 578 468 348 305 300 324 423 415 492 400 343
1691 343 500 475 408 457 460 478 577 605 568 513 492 549 457 495 426 269 344 450 509 451 350 342 397 505 694 649 558 451 536 629 557 505
1689 505 496 497 411 536 408 520 307 357 405 449 499 324 451 546 530 399 353 257 294 316 446 509 451 469 376 441 330 410 350 267 591
1686 591 659 418 364 412 431 508 412 543 564 466 476 393 436 425 336 372 542 557 491 495 461 467 529 672 379 376 432 508 397 304 309 461 416
1683 416 470 419 428 411 422 457 474 533 564 633 536 393 322 487 463 368 360 405 581 650 570 462 309 235 292 218 346 453 387 410 437 404
1680 404 416 411 460 370 303 428 399 379 413 332 390 473 372 360 432 483 456 420 523 537 448 362 330 488 469 532 448 443 447 405 484 444 472 511
1677 511 370 338 429 439 498 369 296 434 356 319 442 504 429 347 359 265 280 378 336 339 321 426 313 386 473 634 654 624 534 500 430 407
1674 407 633 514 365 475 483 487 425 439 313 439 488 518 457 370 436 477 426 562 598 504 448 372 468 371 350 237 346 398 475 589 610
1671 610 510 285 376 301 268 343 504 471 366 329 463 553 496 449 430 326 336 338 371 395 465 531 474 444 513 531 450 395 317 322 388 491
1668 491 649 542 439 426 586 613 362 226 398 333 240 316 374 401 345 403 441 499 468 212 262 348 309 466 293 277 379 559 443
1665 443 360 379 407 452 395 378 432 472 546 457 516 409 471 558 392 420 442 492 360 487 495 411 531 556 366 360 414 422 347 469 551 497 418
1662 418 480 514 459 487 488 414 407 340 379 316 440 535 656 650 552 364 260 470 586 612 457 462 473 515 599 586 402 367 341 383 538 433
1660 433 419 424 415 326 298 288 477 503 327 278 425 450 483 520 481 458 455 410 427 485 472 520 606 653 531 396 533 571 516 488 510 540 545 501
1656 501 513 537 616 583 539 669 610 494 530 539 481 450 473 477 495 427 411 422 347 396 447 244 386 390 406 300 199 194 358 362 368 439 478 483 408
1653 408 432 439 393 428 563 596 536 464 567 740 568 595 592 502 435 466 489 387 544 339 358 383 572 589 529 547 458 527 611 407 530
1650 530 521 625 673 638 419 360 285 244 216 357 422 400 394 448 454 514 505 637 601 534 525 455 429 352 338 459 427 460 494 533 495 458 547 572 546
1647 546 438 468 487 403 319 328 433 431 526 454 457 417 400 267 329 361 430 447 434 473 407 516 492 418 508 547 531 439 482 585 531 465 491 461
1644 461 351 376 538 433 461 410 433 419 465 383 413 397 424 465 514 530 597 644 600 557 421 416 499 325 319 538 378 393 419 415 245 267
1641 267 302 253 359 422 478 328 298 457 435 469 392 490 446 566 388 296 509 451 449 547 472 514 694 768 732 508 393 388 311 338 400
1639 400 541 491 538 571 334 291 435 512 514 460 270 384 395 396 437 281 444 482 348 356 396 356 449 577 444 495 412 388 447 549 506
1636 506 502 546 539 504 419 523 550 416 194 389 564 475 461 467 361 434 364 277 281 404 378 434 425 526 575 488 508 457 372 270 253 327 525
1633 525 491 441 427 422 391 271 308 403 485 466 508 493 597 517 269 309 474 582 586 680 595 583 542 345 435 537 447 568 700 525 428
1630 428 458 430 433 402 424 445 571 633 661 698 568 633 407 477 538 608 522 453 608 623 631 697 625 647 543 418 514 556 581 575 640 597 517
1627 517 456 467 500 576 683 591 588 433 440 399 449 469 598 494 560 529 529 555 434 560 654 648 528 532 470 367 477 648 508 417 490 559
1624 559 641 676 638 633 549 443 468 490 516 642 640 532 578 670 414 351 268 209 390 362 386 432 497 336 548 601 480 482 471 527 503 324
1621 324 393 415 413 339 277 327 373 467 435 437 426 557 517 570 705 604 577 641 430 484 618 601 614 603 533 502 446 456 470 614 574 490 506
1618 506 496 507 572 597 647 642 598 749 649 473 337 393 613 653 601 523 451 569 569 552 595 666 624 649 476 433 477 437 425 471 474 370
1615 370 413 439 499 561 590 557 536 581 545 660 673 538 603 634 612 459 582 469 489 587 539 421 398 338 325 531 527 538 594 662 625 596
1612 596 623 488 607 557 420 449 594 597 432 574 506 502 443 443 525 588 518 556 678 497 475 486 448 501 593 576 523 579 577 620 685 665 702
1609 702 800 639 705 586 584 534 514 527 390 436 464 529 397 413 573 656 530 453 506 580 620 576 488 465 499 574 755 591 468 491 432
1606 432 549 516 554 778 622 529 480 504 507 690 752 733 738 650 652 813 988 748 878 1108 1116 1204 1266 1217 1459 1788 2078 2532 3037 3515
1604 3515 4104 4629 5289 6025 6756 7334 8050 8517 8798 8743 8464 7904 7246 6674 5985 5471 4816 4180 3662 3239 2677 2385 1989
1602 1989 1716 1696 1502 1419 1351 1314 1089 1002 916 1001 959 861 807 775 759 666 551 574 626 860 959 876 637 537 523 705 725 806 748 630
1599 630 648 734 786 778 665 610 545 581 436 411 496 701 742 842 756 651 544 572 694 590 553 539 553 699 604 679 703 577 492 488 466
1596 466 579 662 694 695 790 619 448 474 683 748 726 584 470 572 507 551 467 464 455 563 450 445 439 440 443 516 527 600 500 478 389 410 411 465
1593 465 610 644 549 466 476 548 626 581 499 515 505 690 610 550 438 472 545 516 556 424 461 516 575 378 377 434 453 472 585 708 558
1590 558 635 663 521 435 419 537 557 691 644 709 720 587 593 595 685 683 632 504 571 460 467 534 524 679 637 493 571 510 645 651 603 583 529
1587 529 579 543 333 406 377 452 552 565 608 542 592 495 403 402 387 581 646 592 580 486 721 800 558 613 705 781 620 537 595 396 424 639
1584 639 632 659 568 606 519 511 383 443 613 524 512 582 505 510 524 449 505 489 561 664 677 725 713 474 459 652 687 710 642 684 673 783 717
1581 717 643 682 580 629 651 533 604 587 670 704 737 783 622 565 697 647 585 527 399 542 555 488 463 504 554 612 799 768 612 592 529
1578 529 531 591 541 772 836 588 583 654 597 792 634 463 491 626 606 611 614 804 820 716 794 827 767 817 797 685 665 670 694 666 682 738 827
1575 827 619 570 602 552 541 601 719 706 643 638 695 579 473 493 610 601 710 738 774 769 863 743 728 664 749 864 801 705 775 739 699 598
1573 598 572 579 502 599 793 685 655 657 602 756 691 672 541 584 547 645 634 622 745 791 835 670 659 788 804 779 815 679 728 943 933
1570 933 800 711 793 795 717 644 841 784 763 834 847 1010 989 983 746 680 750 847 689 529 671 771 717 678 663 664 686 740 841 820 915 870
1567 870 855 787 737 708 837 752 751 854 850 849 760 725 793 837 947 1000 980 887 688 747 705 674 666 761 903 1112 1169 959 994 848 808 864 735
1564 735 810 790 699 641 656 741 882 992 904 845 786 885 835 832 723 752 876 780 826 965 939 849 802 801 877 1000 946 1052 1017 907 1012
1561 1012 1005 1009 1288 1187 1267 1338 1218 1097 1147 1016 1100 1102 1079 922 1085 1220 1085 1041 945 857 829 783 881 964 912 837 950 914 974 1154
1558 1154 1180 925 900 1091 1002 996 941 903 1005 1029 914 941 885 974 775 931 1033 1024 862 706 633 666 763 836 823 818 827 987 986 986 990 1064 1061
1555 1061 1068 1084 1096 1036 1071 1074 1184 1065 1069 1136 1163 1102 1137 1214 1075 1016 1050 1061 907 803 1023 1036 938 1045 1043 979 813 1011 994 1036 1117 1146
1552 1146 1112 1110 1126 1261 1326 1395 1547 1546 1384 1389 1497 1295 1261 1394 1593 1677 1479 1433 1359 1343 1389 1340 1289 1284 1225 1221 1133 1176 1256 1199 1198 1345 1502
1549 1502 1401 1578 1495 1343 1459 1535 1545 1517 1594 1572 1566 1608 1594 1687 1516 1568 1759 1827 1758 1836 1812 1720 1709 1694 1563 1549 1780 1763 1675 1698 1803
1547 1803 1750 1955 1830 1856 1818 1808 1857 1842 1899 1855 1778 1808 1779 1675 1788 1771 1671 1764 1852 1851 1816 1750 1749 1865 1897 1935 1872 1889 2060 2150 2149 2080
1544 2080 1927 2126 2356 2382 2273 2291 2306 2438 2495 2487 2457 2584 2509 2364 2420 2476 2508 2666 2646 2365 2391 2481 2502 2540 2624 2606 2451 2331 2463
1541 2463 2635 2771 2811 2732 2988 3093 3401 3456 3466 3482 3733 3906 3924 4071 4150 4143 4132 4154 4140 4087 4023 4018 3984 3874 3774 3887 4064 4044 4106
1538 4106 4189 4114 4098 4177 4074 3919 3986 4053 4027 4088 4019 4035 4031 4028 4182 4239 4438 4768 4900 4997 5100 5297 5539 5768 5851 5999 6366 6733 6869
1536 6869 7172 7608 8247 8672 9092 9441 9946 10644 11406 12084 12651 13384 14160 14847 15739 16703 17701 18608 19699 21016 22254 23618
1534 23618 24961 26317 27396 28635 30091 31941 33991 36359 38981 41808 45107 48926 53094 57912 63623 70204 78243
1532 78243 87855 99351 113463 130756 152485 180818 217610 264178 321996 391830 473955 569307 679563 802882
1531 802882 933471 1066984 1201331 1330478 1444231 1525066 1557466 1537466 1460960 1349729 1234729 1124107
1530 1124107 1015408 898469 779396 671578 575951 489766 410187 339123 279761 233053 198571 173441 154664
1529 154664 140490 129046 119400 110948 103351 96394 89822 83691 77945 72609 67569 62753 58229 54201 50392 46696
1527 46696 43229 40046 37102 34605 32185 29729 27604 25608 23824 22369 20696 19289 17990 16953 15981 15096 14351 13769
1526 13769 13244 12800 12566 12405 12260 11871 11644 11314 10900 10562 10133 9847 9544 9277 9001 8824 8581 8230 8142 7894 7789 7737 7394
1524 7394 7301 7147 6971 6753 6331 6198 6127 5967 5825 5615 5447 5114 4846 4753 4570 4337 4282 4189 4078 3761 3617 3609 3471 3435 3180 3075
1521 3075 2915 2753 2819 2743 2860 2899 2846 2766 2769 2859 3019 3055 2936 2992 3089 3141 2992 2957 2889 2777 2856 2804 2753 2724 2704 2641 2415 2403 2545 2501
1518 2501 2241 2215 2270 2284 2191 2221 2197 2211 2244 2077 2108 2286 2236 2132 2180 2291 2252 2158 2136 2189 2091 2106 2147 2200 2117 1988 2092 2223 2143 1842
1516 1842 1839 1820 1931 1981 1842 2085 2098 1930 1868 1770 1892 1981 1963 1788 1781 1726 1733 1756 1853 1872 1790 1673 1655 1502 1516 1512 1629 1762 1869 1643
1513 1643 1575 1649 1571 1568 1463 1497 1558 1552 1538 1407 1330 1438 1711 1822 1714 1597 1568 1637 1694 1656 1714 1750 1751 1955 1792 1841 1816 1953 1941 1864 1694
1510 1694 1680 1552 1435 1368 1331 1362 1412 1493 1335 1459 1569 1550 1619 1566 1502 1527 1631 1605 1622 1793 1693 1620 1682 1755 1662 1700 1738 1541 1666
1508 1666 1746 1747 1845 1734 1665 1668 1733 1696 1536 1677 1496 1358 1512 1481 1435 1317 1283 1267 1256 1294 1340 1353 1280 1278 1295 1410 1496 1516 1533 1643 1755
1505 1755 1595 1456 1479 1679 1777 1698 1638 1547 1512 1384 1360 1479 1494 1385 1362 1382 1335 1426 1464 1584 1391 1413 1506 1403 1444 1441 1470 1479 1542 1426
1502 1426 1430 1314 1315 1450 1340 1222 1392 1378 1329 1300 1129 1264 1417 1442 1313 1248 1060 1100 1099 1197 1238 1213 1181 1075 1038 1212 1169 1096 1102 1230
1499 1230 1260 1531 1566 1432 1423 1248 1260 1290 1390 1415 1310 1348 1435 1409 1389 1326 1428 1423 1429 1422 1197 1353 1470 1434 1432 1287 1330 1310 1260 1370 1455
1496 1455 1381 1256 1207 1184 1162 1321 1431 1351 1159 1133 1114 1082 1056 1315 1258 1280 1279 1338 1313 1311 1349 1258 1243 1144 1189 1246 1272 1238 1132 1160 1366 1384
1494 1384 1279 1318 1291 1236 1194 1112 1210 1374 1386 1258 1175 1359 1384 1257 1234 1121 1091 1169 1099 1118 1255 1289 1221 1145 1145 1149 1139 1051 1268 1229 1281
1491 1281 1363 1346 1220 1238 1221 1218 1227 1186 1130 1185 1287 1321 1218 1242 1300 1322 1272 1130 1129 1258 1378 1265 1191 1029 1064 1250 1262 1259 1278 1336 1327 1345
1488 1345 1329 1338 1425 1407 1289 1148 1241 1134 1053 1086 1223 1275 1331 1174 1139 1294 1271 1303 1278 1161 1205 1264 1210 1215 1202 1143 1319 1223 1189 1143 1285
1485 1285 1252 1173 1065 1081 867 967 1204 1034 1086 1046 1121 1029 1061 1157 1129 1279 1173 1197 1077 935 942 1049 1057 1078 1043 973 1117 1127 1192 1196
1482 1196 1225 1301 1307 1316 1233 1329 1385 1413 1427 1337 1259 1391 1348 1519 1610 1536 1657 1779 1728 1715 1581 1577 1546 1541 1548 1490 1498 1433 1421 1416 1244 1277 1196 1264 1163
1479 1163 1109 1198 1165 1118 1046 1143 1147 1160 1284 1304 1254 1266 1239 1163 1235 1218 1098 1273 1274 1073 1170 1259 1077 1064 1036 1255 1338 1220 1259 1112 923
1476 923 1140 1160 1288 1344 1279 1292 1311 1324 1144 1167 1313 1202 1080 998 1100 1119 958 1146 1237 1065 1133 1090 1001 1111 1160 1120 1158 1203 1248
1474 1248 1143 1064 1049 1000 1130 1156 1148 1006 1093 1140 1173 1233 1205 1199 1187 941 997 1193 1191 1126 1089 1045 1015 1070 1157 1177 1270 1128 1014 1138 1147 1115
1471 1115 1333 1315 1182 1152 1132 1150 1152 1260 1261 1241 1182 1131 1020 1110 1118 1276 1202 1244 1125 1110 1098 970 1104 1037 1084 1053 973 1016 1039 956 944 1202
1468 1202 1327 1191 1156 1181 1123 1058 1177 1187 1092 1048 1185 1128 1151 1111 1127 1139 1128 1129 1174 1115 956 1053 973 1089 1197 1215 1135 1010 1095 1159 1088
1465 1088 1067 1070 1057 1035 1095 928 907 889 1027 1047 1028 1134 1071 1213 1240 1152 1125 1228 1302 1289 1336 1342 1265 1253 1063 1023 1009 1140 1245 1208 1198
1462 1198 1231 1187 1021 1075 1125 1155 1208 1190 1177 1218 1291 1345 1312 1300 1164 1099 977 954 942 1000 953 1026 1153 1168 1070 1072 1044 1206 1308 1220 1255 1155
1459 1155 1246 1055 995 989 1105 1378 1425 1424 1341 1303 1300 1401 1502 1414 1348 1576 1452 1595 1592 1642 1781 1939 2041 2234 2387 2658 2990 3330
1457 3330 3805 4309 4784 5532 6273 6987 7633 8239 8966 9347 9489 9268 8697 8035 7465 7086 6605 5928 5298 4790 4263 3899 3512
1455 3512 3161 2854 2500 2385 2237 2093 2084 2115 2131 2123 2133 1987 1985 2152 2447 2516 2802 3104 3377 3786 4244 4662 5493 6241 6963 7894
1452 7894 8596 9088 9542 9658 9397 8731 8189 7477 6831 6301 5757 5080 4645 4004 3438 3071 2832 2705 2401 2002 1767 1777 1574
1450 1574 1639 1640 1610 1598 1709 1592 1591 1582 1482 1380 1269 1259 1320 1262 1448 1483 1398 1543 1511 1405 1402 1396 1367 1385 1240 1250 1272 1166 987 1177 1166
1447 1166 1235 1188 1182 1115 1104 1152 1044 1159 1205 1179 1174 1165 1209 1233 1191 1171 1215 1007 1149 1290 1307 1287 1312 1174 1349 1348 1124 1085 1070 1128 1241 1238
1445 1238 1110 1155 1177 1160 1101 1154 1273 1159 1091 979 1173 1142 914 950 1100 1048 1058 1050 1103 1042 1139 1060 981 965 986 1049 1121 1138 1203 1173 1183
1442 1183 1155 1072 928 950 1096 1194 1242 1178 1157 1118 1075 987 1014 1055 995 1142 1065 1092 1084 1114 1045 1031 1176 1180 1062 1131 1191 1050 1037 1061 1055 1142 1043
1439 1043 1122 1195 1063 990 1086 1195 1044 1095 1203 1263 1197 1190 1148 1105 1216 1268 1242 1085 855 841 1007 1091 1230 1301 1155 1086 1030 1031 1043 1201
1436 1201 1149 1077 1017 937 1033 1150 1131 1299 1398 1338 1262 1253 1223 1198 1014 995 1089 1352 1252 1267 1223 1151 1069 1256 1313 1219 1309 1329 1168 1125 1198
1433 1198 1182 1179 1054 1120 1246 1104 1019 1008 1140 1148 1183 1087 1146 1121 963 901 860 951 1037 928 912 948 1009 1075 953 1012 1127 1199 1077 870
1430 870 1056 1141 1174 1173 1216 1189 1073 1019 1082 886 890 952 1088 1132 1232 1180 1184 1233 1244 1229 1365 1290 1176 1207 1228 1243 1215 1209 1141 1203 1162 1181 1251
1427 1251 1276 1219 1170 1237 1179 1103 1299 1225 1186 1196 1276 1217 1106 1157 1215 1140 1013 1175 1246 1208 1171 1286 1258 1142 1057 987 1132 1185 1195 1141 989
1425 989 1071 1182 1275 1101 1124 1154 1026 1280 1333 1223 1069 1175 1251 1128 1197 1175 1116 1105 1300 1396 1258 1186 1162 1147 1199 1309 1347 1231 1198
1422 1198 1340 1287 1289 1352 1427 1462 1584 1709 1781 1883 2020 2121 2381 2668 2801 3059 3143 3273 3539 3459 3489 3564 3438 3403 3271 3036 2908
1420 2908 2808 2590 2428 2093 1958 1991 1794 1696 1611 1561 1393 1397 1472 1234 1346 1461 1296 1373 1244 1283 1284 1180 1146 1180 1208 1138 1239 1219
1417 1219 1173 1135 1065 1059 1137 1126 1228 1203 1177 1252 1244 1230 1268 1255 1094 1081 1149 1218 1301 1176 1169 1225 1253 1369 1335 1252 1254 1381 1374 1278 1235 1378 1268
1414 1268 1106 1109 970 1044 1248 1201 1111 1093 1064 1062 1060 952 966 1160 1248 1135 1068 1152 1179 1233 1312 1271 1225 1459 1400 1233 1341 1389 1420 1344 1300
1411 1300 1233 1353 1305 1321 1333 1227 1201 1177 1266 1217 1224 1216 1254 1172 1229 1162 1102 1139 1124 1085 1184 1082 970 1146 1192 1119 1157 1364 1276 1215 1202 1150
1408 1150 927 1095 1147 1102 1046 1065 1232 1142 1197 1279 1141 1095 1073 1240 1276 1242 1299 1291 1355 1400 1445 1542 1396 1401 1484 1482 1437 1493 1424 1394 1446 1401 1322
1405 1322 1491 1458 1400 1409 1362 1342 1279 1276 1276 1323 1186 1243 1427 1391 1330 1466 1421 1381 1369 1343 1194 1289 1490 1503 1514 1605 1631 1569 1600 1603 1731 1916
1402 1916 1777 1678 1594 1513 1608 1645 1547 1363 1430 1296 1186 1215 1402 1398 1280 1313 1406 1424 1419 1383 1463 1481 1455 1458 1530 1703 1683 1646 1577 1606 1707 1654
1399 1654 1655 1599 1663 1661 1703 1760 1816 1916 1925 1879 1829 1790 1735 1709 1696 1847 1864 1843 1801 1824 1870 1865 1876 1924 1990 1846 1762 1794 1691 1668 1774 1814 1876 1797
1396 1797 1910 1959 1679 1681 1851 1951 1973 1931 1872 1954 1974 1960 1874 1713 1799 1866 1918 1952 1939 2038 2005 2098 2190 2387 2419 2414 2418 2534 2540 2526 2387 2327
1393 2327 2228 2394 2393 2437 2429 2362 2259 2208 2328 2347 2290 2221 2329 2380 2350 2287 2314 2273 2535 2645 2771 2880 2822 2991 3058 3212 3536 3693 3712
1391 3712 3856 3956 4007 4002 4002 4052 4088 3967 3875 3862 3874 3730 3791 3790 3827 3775 3772 3665 3832 3720 3827 3863 4013 4101 4218 4321 4586 4762 5121
1388 5121 5397 5559 5736 5701 5761 5669 5607 5564 5714 5796 5705 5826 5875 6023 6115 6375 6704 6966 7429 7940 8312 8596 8988 9557 10144 10701
1386 10701 11129 11812 12446 12939 13552 14190 14984 15859 16546 17390 18494 19657 20814 22375 24112 25899 27935 30346 32728 35485
1384 35485 38414 41488 44629 48003 51727 55559 60013 65538 72447 81639 92875 106592 123930 146617 177083 217088
1383 217088 268177 331361 406593 494686 598886 719827 851743 988550 1128387 1269915 1403429 1514390
1381 1514390 1578127 1586308 1530699 1417769 1292516 1175480 1066288 951550 825127 706781 604470 513642
1380 513642 429886 352621 286238 233192 193933 166147 146384 131450 119664 109953 101746 94686 88505 83135 78411
1379 78411 73975 69920 65719 61670 57496 53644 49920 46414 43027 39797 36907 34089 31375 28987 26700 24508 22466
1377 22466 20804 19280 17823 16680 15412 14425 13542 12733 12069 11406 10968 10714 10495 10384 10256 9981 9725 9559 9436 9015 8564
1376 8564 8421 8163 7940 7847 7841 7620 7360 7202 7060 7065 6940 6812 6557 6541 6448 6411 6166 5877 5892 5913 5792 5711 5483 5339 5263 4972 4789
1373 4789 4865 4784 4648 4547 4695 4760 4600 4744 4758 5014 5069 5188 5439 5675 5756 5524 5452 5231 5093 4805 4539 4323 4024 4040 3890 3710
1371 3710 3518 3356 3265 3212 3227 2943 2863 2776 2806 2670 2598 2520 2374 2220 2176 2330 2304 2083 1994 2103 2287 2213 2135 2099 1877 2060 2161 2167
1368 2167 2166 2314 2346 2274 2116 2038 2126 2240 2271 2235 2189 2334 2431 2237 2122 2262 2344 2414 2543 2556 2660 2843 2985 3098 3184 3003 2946 2694
1366 2694 2509 2430 2501 2334 2160 2087 1904 1791 1653 1787 1592 1664 1761 1542 1568 1573 1573 1521 1437 1415 1550 1569 1555 1384 1419 1495 1506 1586 1433
1363 1433 1410 1444 1432 1453 1505 1670 1750 1728 1724 1635 1572 1481 1535 1582 1665 1713 1700 1730 1611 1538 1620 1660 1686 1489 1351 1496 1558 1581 1627 1621 1478 1383
1360 1383 1413 1417 1388 1326 1364 1398 1412 1402 1283 1486 1623 1580 1573 1623 1799 1650 1603 1570 1622 1583 1586 1584 1525 1424 1281 1343 1202 1174 1180 1244 1273 1220 1320
1357 1320 1358 1296 1181 1151 1116 1037 1046 1071 1156 1199 1150 1239 1188 1258 1328 1416 1391 1437 1318 1424 1646 1656 1585 1515 1436 1394 1562 1588 1612 1654 1563 1565 1594
1354 1594 1471 1385 1345 1344 1337 1336 1363 1328 1248 1310 1417 1483 1367 1329 1226 1264 1200 1219 1316 1358 1376 1370 1301 1095 1133 1187 1194 1035 1074 878 871 1111 959
1351 959 939 1114 1193 1012 919 977 1210 1238 1193 1336 1352 1258 1225 1181 1279 1340 1353 1242 1169 1283 1334 1167 1348 1477 1360 1109 1147 1107 1089
1348 1089 1036 1082 1132 1140 1059 929 1014 1196 1276 1151 1170 1231 1193 1178 1228 1142 1124 1028 1151 1247 1263 1378 1193 1135 1253 1224 1072 1304 1259 1230
1346 1230 1169 1162 1269 1324 1208 1114 1210 1209 1236 1097 1206 1286 1237 1251 1284 1274 1220 1318 1387 1100 1040 1133 1287 1367 1307 1305 1165 1197 1259 1226 1228 1325 1436
1343 1436 1340 1366 1356 1364 1355 1368 1328 1448 1492 1311 1386 1383 1432 1507 1435 1415 1260 1164 1194 1228 1085 1029 1097 1197 1214 1262 1179 1252 1246 1177 1190 1181 1186 1174 1202
1340 1202 1119 1256 1292 1380 1401 1276 1252 1343 1432 1462 1517 1309 1381 1273 1147 1212 1232 1460 1461 1259 1288 1513 1522 1581 1632 1621 1548 1466 1440 1726 1649
1337 1649 1516 1471 1638 1772 1836 1915 1903 2035 2042 2015 2188 2245 2224 2206 2467 2736 3091 3486 3823 4177 5025 5933 7099 8330 9842
1335 9842 11749 14114 16843 19953 23417 26826 30339 33731 36830 38765 39354 38607 36030 32871 29711 27015 24358 21427
1333 21427 18306 15688 13624 11624 9699 8001 6644 5669 4859 4232 4007 3849 3652 3460 3490 3153 3005 2927 2872 2765 2546
1331 2546 2412 2348 2299 2163 1961 2001 1995 1926 1929 1866 1884 1772 1783 1803 1804 1634 1620 1624 1631 1632 1586 1631 1635 1652 1541 1544 1560 1532 1509 1577 1422 1143 1273 1529
1328 1529 1365 1391 1505 1464 1370 1362 1484 1547 1487 1309 1433 1296 1277 1280 1144 1159 1243 1212 1225 1224 1361 1312 1308 1403 1435 1530 1525 1442 1274 1161 1229 1317
1325 1317 1251 1225 1271 1365 1466 1386 1260 1352 1431 1139 951 1157 1060 1138 1299 1453 1521 1405 1254 1220 1274 1278 1225 1048 1213 1265 1146 1107 1103
1322 1103 1126 1185 1097 1060 1204 1225 1309 1338 1373 1221 1112 1220 1253 1306 1265 1348 1490 1658 1978 2096 2217 2564 2720 2950 3248 3302 3557
1320 3557 3798 3849 3938 4010 3663 3253 3350 3178 2849 2653 2645 2515 2155 1961 1850 1752 1756 1575 1413 1296 1331 1352 1307 1331 1435 1285 1202 1299
1317 1299 1158 1196 1267 1328 1425 1440 1171 1160 1230 1178 1326 1348 1308 1327 1240 1172 1259 1215 1175 1082 1173 1388 1304 1286 1243 1286 1301 1330 1378 1323 1498 1327
1314 1327 1306 1550 1509 1393 1219 1068 1084 1185 1337 1306 1395 1411 1432 1361 1305 1402 1506 1343 1374 1471 1429 1366 1508 1605 1543 1384 1322 1377 1528
1312 1528 1619 1567 1475 1476 1639 1568 1554 1625 1477 1601 1775 1861 1689 1657 1913 1987 1858 2088 2451 2781 2883 3265 3706 4112 4715 5423 6009
1309 6009 6784 7662 8428 9060 9399 9504 9523 9239 8556 7848 7303 6697 5984 5431 4716 4191 3839 3382 3117 2870 2583 2434 2315
1307 2315 2325 2092 1996 2023 2279 2205 2063 1952 1862 1666 1632 1850 1725 1669 1747 1736 1664 1470 1588 1773 1716 1719 1662 1671 1679 1674 1689 1832 1916 1931 1832
1304 1832 1830 1829 1987 1935 1967 2070 2003 1945 1887 1886 1952 2068 1932 2093 1900 1726 1885 1883 1757 1833 1689 1629 1706 1689 1765 1742 1681 1730 1659 1627 1741
1302 1741 1901 1951 1996 1945 2077 2027 2254 2294 2278 2314 2381 2457 2481 2441 2708 2777 2953 3273 3444 3537 3733 4043 4243 4510 4657 4920 5021
1299 5021 5214 5413 5521 5455 5628 5711 5785 5753 5941 6082 6226 6543 6588 6865 7395 7800 8311 8832 9438 10252 11094 12052 13250 14478
1297 14478 16107 18024 20339 23147 26562 31224 36860 44131 53807 65961 81034 99867 122642 149595 180614 215797
1296 215797 254941 296844 339721 381589 419318 449917 469794 478291 475021 459095 432860 400402 364324 326089
1294 326089 287649 250646 216431 184802 155854 130233 108014 89353 74199 62044 52545 45547 40261 36296
1293 36296 33061 30647 28614 26608 24867 23350 21803 20403 19262 17992 16747 15583 14442 13425 12536 11704 10897 10218
1291 10218 9639 9160 8664 8202 8134 7998 8154 8396 8667 8943 9524 10176 10980 11948 12614 13337 13970 14441 14664 14392 13717 13050 12252
1289 12252 11263 10397 9371 8391 7754 6981 6064 5465 5016 4495 4174 3688 3394 3337 3055 3015 2902 2845 2795 2884 2761 2666 2670 2501 2121
1287 2121 1928 1844 1872 1949 1911 1866 1692 1694 1677 1659 1595 1608 1448 1459 1458 1425 1398 1435 1353 1247 1263 1257 1173 1177 1213 1260 1452 1361 1317 1354 1396 1620 1431
1284 1431 1385 1322 1410 1360 1146 1170 1179 1130 961 854 980 1022 959 980 1012 1037 1124 1227 1295 1191 1186 1149 1048 1016 999 1117 1150 1072 1027 1019 1171
1281 1171 1104 1071 1022 1137 1186 1053 1028 1079 1070 1155 1035 1027 982 975 1038 1062 964 995 1123 1206 1111 995 1019 1011 995 1077 879 775 1129 1219 1148 1010
1278 1010 1042 1108 986 889 846 1000 1053 853 767 833 1049 989 897 889 856 766 815 906 819 893 804 898 854 940 1054 984 992 936 795 836 892 863
1275 863 1014 996 975 919 979 1006 957 1023 1044 1035 1092 1122 1080 1012 882 822 825 798 873 873 997 1006 836 845 897 848 916 1011 989 879 801 811 821 812 869
1272 869 1006 1137 991 871 865 1037 1208 1219 1136 1179 972 912 994 941 1056 1216 1273 1371 1533 1672 1928 2058 2346 2573 2633 2886 2951
1270 2951 3165 3356 3360 3332 3331 3352 3049 2898 2708 2520 2154 2089 1903 1825 1606 1353 1302 1365 1379 1181 1144 1136 1113 1092 1110 1039 977 1032 1007 992
1267 992 941 968 923 920 1003 1042 993 1082 1180 1190 1155 1046 1030 995 975 873 878 855 852 713 710 806 906 899 924 936 849 798 717 594 596 784 804 875 896
1264 896 766 802 796 975 807 816 843 762 725 856 822 859 873 674 869 934 848 763 954 976 1070 1017 861 921 1071 915 997 1099 1046 1055 1033
1261 1033 840 905 1033 913 820 803 866 860 824 873 815 891 774 677 814 828 899 719 571 745 859 934 897 869 772 789 901 883 701
1258 701 636 744 669 729 893 849 692 833 925 866 867 831 807 707 792 921 890 745 599 701 627 673 804 782 698 795 822 814 890 885 914
1256 914 848 912 987 921 929 878 731 683 880 919 711 744 805 667 794 738 587 841 698 649 811 755 716 639 736 608 695 859 754
1253 754 790 886 891 841 772 637 658 841 843 762 779 906 997 811 787 844 904 692 676 856 781 813 718 712 725 740 764 866 836 833 892 898 847 758
1250 758 736 805 663 667 787 771 737 663 845 747 639 678 742 753 691 737 723 643 694 695 702 716 585 685 784 625 583 768 665 695 797
1247 797 847 865 850 907 866 817 771 745 734 622 840 878 774 650 713 657 643 592 491 464 474 603 758 719 739 613 572 657 700 624 595
1244 595 537 537 650 625 672 625 710 734 776 761 621 588 706 850 797 718 627 658 669 615 566 654 742 698 727 708 560 550 758 847 739 738
1241 738 772 737 717 709 737 857 728 591 709 796 760 711 631 557 587 703 724 675 581 434 473 720 687 755 701 728 700 692 702 608 614 698 835
1238 835 795 598 708 733 675 809 773 722 755 674 683 720 718 567 525 601 611 617 703 911 837 626 603 601 592 708 776 633 717 656 739 726 695
1235 695 622 583 798 637 678 696 693 688 774 887 715 577 671 719 624 573 504 678 643 526 537 660 660 855 860 785 636 527 525 651 550
1233 550 482 519 441 626 661 662 608 691 750 752 675 594 507 451 675 723 796 920 809 751 862 810 670 593 622 663 606 614 669 460 497 600
1230 600 670 660 665 634 510 594 626 760 832 856 703 724 690 806 869 782 779 559 481 586 504 546 665 578 511 571 715 809 724 702 755 645
1227 645 484 451 507 578 595 567 660 604 650 723 649 613 653 721 713 657 594 567 538 669 833 874 707 647 752 783 721 583 675 653 524 568
1224 568 578 658 637 648 794 808 659 535 592 769 805 773 579 592 652 678 740 690 636 678 716 562 658 665 670 844 824 746 571 533 655
1221 655 570 619 601 587 631 545 573 579 630 636 653 668 805 684 572 610 633 438 583 734 743 736 548 685 640 767 793 735 598 645 585 600
1218 600 660 722 671 750 686 585 778 732 697 753 695 661 647 548 601 773 748 447 532 680 659 757 785 596 575 565 635 515 427 545 659
1215 659 692 703 510 540 701 713 577 537 559 708 826 726 638 627 551 594 641 717 768 599 464 591 540 642 555 550 547 575 575 519 438
1212 438 631 785 711 613 544 611 705 817 589 694 682 655 769 640 691 633 585 496 439 526 634 718 665 581 721 668 658 625 680 684 539
1210 539 468 673 498 401 631 670 714 756 621 567 697 681 579 537 458 579 676 580 542 665 586 637 736 816 713 499 534 548 650
1207 650 700 559 607 520 560 512 623 636 666 745 557 576 603 591 608 558 657 633 588 577 564 642 484 548 625 676 560 466 500 490 565 544
1204 544 685 712 654 747 758 664 637 519 505 533 336 416 628 610 637 683 680 643 569 722 672 382 258 476 730 626 481 604 443
1201 443 485 526 614 421 246 410 471 510 584 517 543 495 567 615 690 653 558 507 465 526 545 791 716 627 723 665 571 390 562 578 690
1199 690 599 460 400 435 545 498 442 547 595 525 562 484 544 638 637 538 643 586 553 676 737 623 632 632 603 596 604 583 618 558 470 461 533 598 587
1195 587 369 516 579 642 706 580 650 666 725 693 663 658 657 586 455 453 411 477 609 653 596 647 534 558 574 660 619 606 740 647 624 628 558
1192 558 627 665 647 642 619 661 698 552 554 590 586 730 807 596 462 605 767 610 473 627 654 580 651 560 571 567 599 801 708 613 568 529
1190 529 589 595 526 613 578 680 582 617 596 575 632 675 675 604 538 582 637 481 415 444 495 489 488 435 622 641 534 475 487 517 552 492 505 547 584
1186 584 603 603 458 530 585 592 531 595 529 453 537 638 675 669 691 631 616 510 532 598 534 414 433 475 543 655 718 591 564 500 401 578 737
1183 737 701 601 527 578 553 480 488 517 519 472 593 564 627 566 546 538 634 571 670 603 668 672 761 672 669 719 615 708 492 407 524 547 510 581 462
1180 462 540 607 549 600 475 340 375 468 565 530 532 525 446 353 297 537 508 538 644 654 575 543 604 633 787 761 608 637 592 547 734 734 646
1177 646 621 605 567 667 511 507 519 473 533 522 551 527 573 570 670 715 623 465 503 510 513 765 708 738 616 560 387 565 595 668 655 433
1174 433 460 524 510 464 532 582 726 822 672 497 557 535 350 266 462 480 514 503 569 620 567 480 530 581 648 605 518 470 419 576 560 473
1171 473 572 560 520 367 450 496 537 643 611 535 529 551 640 632 643 717 754 680 653 750 774 758 799 896 945 991 1158 1433 1602 1732 2021 2200
1168 2200 2311 2618 2727 3048 3207 3238 3054 2925 2891 2771 2600 2540 2330 2152 1878 1668 1642 1450 1230 1282 1216 1093 890 918 874 866
1166 866 873 684 656 580 663 586 565 619 536 715 710 621 555 446 565 694 607 704 625 573 752 638 453 422 399 456 637 537 536 521 497
1163 497 541 628 541 485 602 461 473 452 493 580 597 590 660 643 727 737 700 816 760 778 666 598 604 572 658 708 596 517 549 566 674 571
1160 571 535 622 551 406 563 513 401 451 401 372 302 273 440 405 421 523 467 519 535 573 678 783 660 602 537 410 434 320 505
1158 505 617 614 602 652 591 615 624 598 380 344 514 606 443 429 542 599 495 505 529 640 622 620 577 438 625 593 523 623 631 650 582 401
1155 401 373 506 679 612 596 486 496 445 290 433 494 475 394 346 542 521 504 576 574 619 566 591 507 399 483 474 440 580 557 599 529 509
1152 509 590 503 626 734 611 511 494 470 595 608 526 694 617 454 444 682 789 567 456 515 566 459 432 513 559 664 645 545
1149 545 501 687 569 374 353 395 409 322 287 412 438 450 315 249 355 471 482 439 493 622 542 532 515 532 429 520 535 476 514 371
1147 371 269 315 488 564 452 336 452 526 412 338 333 504 543 517 499 569 703 810 611 584 654 597 588 523 488 491 372 437 607 589
1144 589 516 583 569 698 661 701 629 778 790 665 683 803 652 501 448 384 529 665 755 670 666 440 648 566 498 678 727 572 632
1141 632 660 506 342 327 459 580 641 649 677 584 451 489 402 484 497 555 612 512 660 628 428 534 665 494 429 442 464 468 483 597
1139 597 597 556 509 498 403 520 614 418 368 422 371 556 517 575 665 616 541 455 391 355 294 405 565 554 614 539 558 556 526 653 595 480
1136 480 467 406 450 354 464 480 485 518 533 531 481 393 572 564 434 409 418 482 409 495 576 488 482 477 392 499 491 620 648 405 430 515 492 521 533
1133 533 523 470 479 729 678 526 504 427 443 420 407 408 523 565 415 489 586 505 638 685 656 563 426 436 574 582 660 547 746 656 487
1130 487 506 692 778 735 688 508 501 517 544 535 469 356 352 311 423 332 197 305 488 609 541 572 603 477 446 358 459 453 475 638 633 590
1127 590 455 482 557 534 566 608 483 464 395 343 453 554 502 440 391 507 505 429 421 413 408 464 730 608 423 429 409 592 516 400 399 417 540
1124 540 607 690 543 528 579 559 533 472 681 568 545 560 520 539 483 362 384 387 442 504 432 337 457 655 541 638 684 627 676 656 534
1121 534 491 566 558 522 580 460 401 412 387 493 644 551 515 405 466 564 556 393 448 418 517 499 432 519 441 471 424 372 416 487 405 433 519
1118 519 573 621 496 567 681 625 689 725 594 661 525 544 552 513 591 530 500 583 510 492 521 523 519 587 671 660 689 605 579 599 555 349 482
1115 482 521 500 469 359 485 582 564 493 448 450 378 225 385 417 463 426 416 449 463 342 371 455 382 450 405 521 608 486 463 446 504 518
1112 518 525 476 506 585 470 349 570 662 467 526 491 367 462 566 438 447 511 525 548 341 377 473 504 413 433 354 305 425 449 553 530
1109 530 424 293 261 459 572 543 511 470 635 687 588 549 500 537 563 366 458 465 413 289 301 340 342 289 337 483 636 582 305 397 364
1106 364 493 474 503 531 566 503 516 571 546 602 459 465 374 419 434 376 485 386 439 579 541 548 405 412 402 490 466 362 451 472 460 470 468 514
1103 514 535 552 519 542 530 673 618 639 641 618 702 663 669 677 647 591 653 681 616 566 499 554 599 588 621 598 594 495 504 398 433 467 348 320 366 410
1100 410 524 529 557 552 467 513 456 460 532 517 487 465 564 679 613 580 580 624 523 476 533 548 430 341 352 426 390 539 611 471 495 478 566 492
1097 492 431 606 635 589 574 545 465 475 490 409 398 440 414 457 541 585 551 531 449 536 436 455 342 379 516 625 549 383 502 465 462 523
1094 523 498 496 448 505 468 514 548 590 388 376 623 607 569 423 457 428 322 418 463 383 452 464 419 444 540 538 495 512 529 521 575 696 480
1091 480 401 392 536 364 398 351 491 365 417 489 229 427 459 455 287 372 568 484 546 559 470 534 642 621 500 611 628 492 348
1088 348 471 422 359 456 416 455 637 529 601 553 565 524 466 337 393 412 370 559 492 379 538 455 365 340 346 504 511 380 461 580 635
1086 635 583 368 400 351 468 449 339 455 490 597 486 500 497 426 414 481 554 467 303 337 312 432 679 627 582 593 473 517 479 494
1083 494 639 488 456 412 461 502 401 490 554 499 568 531 535 524 504 385 357 535 501 509 422 357 269 449 467 466 446 524 544 549 608 534 607 489
1080 489 415 403 446 604 639 622 552 696 713 509 370 396 420 450 485 441 546 459 341 357 467 444 402 372 490 444 430 398 329 377 337
1077 337 480 509 300 385 431 491 314 411 624 447 313 264 384 426 410 371 463 460 545 543 503 504 628 572 574 531 446 444 371 534 493 506 437
1074 437 420 470 424 510 524 491 552 504 599 616 576 576 554 356 495 543 608 638 676 655 569 423 443 476 530 674 626 536 563 540 578 461 558
1071 558 646 668 590 531 445 489 451 514 480 542 520 482 456 426 456 531 529 333 315 510 441 455 464 404 381 424 478 475 574 437 279 270 270 474 531
1068 531 478 468 560 631 588 499 477 527 586 410 467 530 416 386 581 568 373 313 443 347 303 299 403 508 494 408 199 220 256 478 491
1065 491 389 494 543 322 322 336 372 500 575 452 426 495 475 558 432 398 461 504 431 576 523 517 583 547 565 476 366 455 525 425 356
1062 356 457 413 433 624 563 495 611 569 589 478 376 419 504 479 580 472 574 555 519 426 382 471 562 484 513 487 380 449 549 630
1059 630 528 387 406 474 569 584 497 433 460 429 405 542 527 579 569 384 378 527 672 698 592 506 515 647 731 626 432 552 592 526
1057 526 564 477 422 364 425 483 436 426 525 510 361 417 488 554 543 551 462 472 462 511 540 752 688 509 675 616 526 374 423 438 378 297 313
1054 313 342 390 328 379 362 390 439 430 473 404 366 300 439 464 508 580 611 428 428 335 400 506 534 584 413 465 446 347 507 391 474 393 437
1051 437 554 519 435 336 486 463 566 651 595 562 391 391 487 452 483 634 637 599 559 515 541 604 539 566 455 575 548 511 473 384 380 429 508
1048 508 449 438 463 434 467 513 523 451 440 667 606 459 406 357 334 334 427 417 390 518 487 439 280 311 382 518 565 420 502 614 549 421
1045 421 598 515 305 251 310 520 377 525 545 634 533 574 587 581 625 566 596 620 606 385 384 429 565 501 419 422 440 457 465 453 549 617 466
1042 466 398 491 516 561 405 600 454 310 466 481 469 607 630 621 575 421 559 578 525 362 174 290 277 347 531 447 320 399 403
1039 403 430 514 263 296 348 446 521 448 429 522 503 349 475 505 567 574 594 512 469 445 385 355 212 322 462 438 524 465 680 598 500 425
1036 425 456 573 423 460 483 459 522 465 505 520 523 511 471 491 413 235 260 466 533 512 621 550 664 583 450 422 438 444 536 424 321
1034 321 304 498 476 403 555 511 425 342 355 455 545 589 625 483 426 413 440 596 588 445 333 379 507 431 423 315 412 401 505 600 442
1031 442 448 468 500 324 374 359 425 475 621 542 624 546 546 557 516 531 582 588 618 639 629 592 506 527 479 424 538 472 354 331 451 614 608 377
1028 377 343 515 528 479 579 589 609 438 392 388 528 589 591 442 363 316 179 56 328 315 328 492 556 404 440 351 376 399 318 425
1025 425 431 469 305 279 512 527 404 404 405 454 368 540 549 536 521 471 528 551 478 353 394 489 559 432 459 444 363 410 478 525 479 468 436 458
1022 458 457 571 473 356 450 483 449 461 474 426 512 586 550 626 466 236 217 425 476 459 637 730 537 415 500 571 621 562 515 584 683
1019 683 492 551 460 276 374 387 464 662 560 456 539 303 343 546 635 681 764 632 480 469 471 446 501 533 513 390 502 618 555
1016 555 509 407 334 579 636 616 721 557 388 373 440 420 450 476 407 414 431 472 652 695 518 506 399 404 465 591 457 378 398 463 335
1014 335 332 459 268 256 314 359 367 317 389 512 600 612 605 525 505 336 442 398 461 608 583 629 626 622 579 608 391 406 518 540 645 713 651
1011 651 617 453 509 517 516 567 541 578 486 579 631 487 589 583 535 550 507 489 416 520 497 469 584 533 572 601 542 329 364 366 313 455 503
1008 503 509 418 474 620 388 180 345 516 429 354 349 514 543 532 539 596 609 510 522 476 540 582 461 334 437 513 504 431 434 554 597 607
1005 607 623 640 580 553 643 805 794 688 602 533 399 469 455 641 691 768 743 747 878 803 583 415 433 429 478 593 584 557 555 510 538 564 562
1002 562 430 418 387 466 405 456 310 509 536 469 420 476 507 378 370 404 562 473 408 366 323 393 420 545 603 475 605 645 424 403 408
999 408 462 501 397 611 677 543 571 508 537 496 437 518 581 565 587 571 452 365 530 462 464 496 497 411 572 577 543 554 470 377 453 481 478 697
996 697 407 291 429 408 333 345 396 376 372 375 476 505 468 405 417 528 588 560 443 417 532 535 376 435 475 474 555 488 507 631 406 522
993 522 411 336 462 452 381 411 455 334 471 502 524 510 500 419 545 554 604 638 530 437 433 457 637 734 500 575 640 723 705 654 655 630 694
990 694 544 617 632 441 623 498 459 513 467 555 608 532 441 557 603 767 705 556 553 467 494 536 494 539 552 546 542 430 552 506 471 535
987 535 435 433 534 440 427 439 352 518 522 523 476 523 406 561 424 422 441 506 476 560 657 591 507 473 481 468 442 571 571 385 548 583 697
984 697 644 509 499 589 575 499 390 489 670 752 540 473 522 513 402 373 571 470 541 754 727 505 564 591 502 392 479 542 559 587 674
981 674 526 376 441 429 489 499 599 630 520 490 434 474 410 533 512 452 484 544 631 643 377 405 479 530 531 425 587 516 415 408 519
978 519 459 523 575 499 475 403 296 481 458 469 488 544 663 567 376 336 533 594 455 440 262 368 374 287 402 513 635 490 494 487 453
975 453 480 663 605 599 575 496 516 446 440 484 479 350 293 366 516 437 602 682 574 568 458 563 495 414 419 370 433 440 452 536 520 511 412 319 349
972 349 291 244 297 406 325 437 435 439 367 426 476 447 284 385 279 426 454 381 483 472 410 474 420 405 405 545 439 396 280 339 432 474
969 474 453 274 362 258 214 331 441 423 435 524 495 462 452 571 627 699 563 500 502 415 526 629 521 572 612 533 499 403 399 359 218
967 218 411 396 442 509 553 582 431 415 481 429 469 444 417 446 436 446 479 304 260 413 516 523 459 455 444 463 406 475 604 602 598 574 514 446
963 446 518 529 468 571 497 496 462 419 548 490 526 521 546 522 420 390 497 555 528 537 559 497 466 457 475 474 414 452 443 443 565 584 445 530 454 491
960 491 458 288 290 391 476 495 369 499 587 586 652 741 769 689 554 581 662 650 522 445 553 457 466 455 398 498 446 623 524 491 503 445
957 445 579 697 573 488 504 581 417 433 492 526 501 481 530 556 592 602 443 408 319 484 550 585 451 400 501 506 417 495 602 579 568
954 568 610 686 640 716 619 476 471 615 579 363 301 440 475 487 467 574 490 493 526 501 411 418 433 463 275 396 486 566 509 517 400 497 548
951 548 398 473 565 571 504 391 450 412 375 392 373 417 540 574 395 313 319 518 606 652 646 549 442 467 559 592 635 647 679 600 568 543 484 489
948 489 429 403 489 509 469 484 440 389 434 354 462 560 426 433 494 489 404 328 420 473 450 359 488 383 441 524 414 414 549 596 595 533 420 447
945 447 388 284 567 651 706 658 565 629 463 461 458 510 524 573 435 492 547 551 569 567 512 456 599 562 653 714 723 615 604 698 621 599 555 512 422
942 422 467 477 557 750 755 522 443 423 601 444 419 425 397 405 596 577 473 476 625 794 541 310 541 541 422 566 767 725 562 515
939 515 615 498 350 512 535 429 486 527 480 460 380 437 642 603 542 617 668 563 515 554 648 630 666 542 756 694 583 612 757 719
937 719 708 651 580 488 690 713 594 565 598 528 498 528 496 464 317 389 496 594 525 459 515 509 427 408 485 531 634 575 432 399 429 393 606
934 606 635 442 415 462 527 548 620 491 572 521 447 628 627 581 552 530 654 707 608 428 437 445 386 504 540 612 564 568 606 702 541 468 511 677
931 677 723 593 655 580 514 548 548 518 464 406 369 522 523 535 517 483 581 523 468 475 617 705 603 400 444 556 603 625 590 539 536 518 595 560
928 560 542 637 703 710 463 476 440 502 447 445 634 482 350 370 362 455 616 556 426 475 578 495 608 635 661 744 621 578 508 484 282 459
925 459 614 449 448 529 615 476 396 467 518 570 583 634 644 516 352 524 611 599 502 437 437 391 471 476 550 650 510 519 556 542 541 507 358
922 358 200 317 444 572 613 532 537 595 563 380 393 485 421 561 551 584 577 607 572 586 524 638 469 497 649 653 592 565 440 479 486 384
919 384 398 463 381 515 564 456 454 476 478 539 427 413 573 611 646 481 529 637 607 618 547 620 717 571 575 561 657 635 609 587 506 493 608
916 608 658 506 607 493 446 431 400 462 548 474 366 426 415 546 592 517 685 685 603 533 616 618 506 480 518 573 523 429 578 563 544 558
913 558 590 738 671 714 657 558 479 345 514 618 592 589 687 585 522 603 571 615 550 592 670 763 563 547 464 445 491 585 590 503 468 499 568
910 568 566 701 643 608 577 607 585 550 620 571 466 580 531 528 611 709 538 592 730 772 624 532 573 573 564 823 732 611 488 615 567 519
907 519 621 590 441 481 664 577 739 664 592 530 419 409 482 538 550 582 638 497 464 658 536 591 551 438 471 520 564 530 552 372
904 372 335 378 493 639 584 604 603 583 543 594 662 706 789 715 599 612 443 591 640 651 659 579 496 444 552 573 550 528 594 617 570 581 823
901 823 541 444 437 477 443 564 677 727 641 603 601 547 565 681 497 505 510 483 698 827 872 798 717 619 442 543 566 593 694 670 699 540
898 540 562 649 545 681 534 485 527 618 648 590 595 591 528 590 667 634 582 702 679 587 575 703 485 574 553 563 678 622 472 388 577 684
895 684 746 711 693 513 539 558 486 564 561 549 621 688 652 727 705 726 778 712 763 772 614 578 510 656 619 710 619 608 684 771 845 720 732 784
892 784 758 626 555 620 609 440 510 597 670 615 609 724 673 617 468 537 358 316 550 656 618 576 759 716 544 613 623 518 571 484 282
889 282 301 483 628 615 621 571 613 619 557 620 518 715 714 530 545 551 619 585 478 438 420 469 445 373 619 680 459 315 425 394 446 643
887 643 631 432 377 422 474 533 565 590 451 456 558 496 626 704 721 713 631 494 557 729 552 541 607 593 607 564 729 749 667 681 653 663
884 663 577 584 637 701 625 569 490 422 528 522 609 559 578 610 557 552 351 531 658 590 610 521 599 503 491 592 577 569 685 572 476 490 538 634
881 634 686 521 581 596 625 536 591 562 618 735 626 546 470 463 596 616 509 501 422 494 618 555 577 476 499 505 537 450 424 614 561 613 671
878 671 729 685 628 557 665 716 632 619 513 523 507 553 451 444 441 478 476 279 341 406 504 712 876 667 650 408 475 554 574 657 666 663 610 603
874 603 798 650 750 646 446 535 658 711 626 639 505 491 548 614 567 582 587 419 521 579 622 613 556 414 404 472 562 586 630 617 515
872 515 404 451 503 537 518 437 522 643 614 580 507 548 620 719 825 748 702 859 796 741 751 619 506 432 547 625 591 484 416 514 544
869 544 515 559 663 658 528 460 515 494 515 393 591 633 540 534 549 501 572 658 590 614 738 697 587 560 666 700 669 719 708 727 773 695 619
866 619 541 500 589 616 583 643 632 663 581 512 552 597 652 574 543 495 569 608 711 758 736 691 669 671 546 601 592 617 721 750 743 600 582 710
863 710 796 582 531 683 591 583 708 817 875 867 759 639 620 885 677 638 809 677 476 494 620 745 813 696 510 421 479 653
860 653 633 468 428 610 671 667 755 659 695 623 650 667 675 649 495 506 450 696 717 596 485 559 541 528 637 609 463 461 585 574 659 574
857 574 629 687 613 707 778 793 730 888 746 740 878 895 725 701 791 664 607 594 635 608 641 660 536 664 730 703 793 860 841 689 580
854 580 579 661 599 641 684 769 666 707 748 698 660 699 739 678 828 685 559 628 616 670 516 515 551 812 751 691 613 615 633 597 674 646 533
851 533 565 560 702 776 640 494 517 850 696 738 783 716 698 704 757 696 709 823 725 685 818 840 793 652 728 752 813 883 843 751 531 550
849 550 751 755 584 599 805 759 755 873 822 949 867 760 861 902 815 766 749 693 615 708 647 580 737 775 764 736 819 775 683 570 494 571
846 571 555 663 690 678 564 665 542 509 595 694 664 757 744 649 792 840 732 670 881 802 688 818 904 892 754 744 731 692 750 787
843 787 900 827 937 685 766 984 993 820 880 904 813 772 714 875 1069 947 773 1006 1135 1225 1225 1512 1566 1695 1988 2225 2412 2404 2248
840 2248 2175 2034 1954 1950 1842 1533 1486 1291 1163 960 969 881 739 971 810 788 865 852 935 901 866 935 866 900 933 799 949 824 737 711
838 711 693 612 736 683 828 821 758 923 840 681 659 769 794 750 713 846 817 764 713 678 832 757 702 606 671 759 765 675 623 677 755 835 803
835 803 685 599 689 739 725 787 726 791 839 837 899 897 868 763 841 813 878 864 893 833 672 848 703 797 965 1047 830 728 628 837 891
832 891 713 592 688 714 777 786 726 663 700 743 865 855 740 813 677 767 911 861 915 930 835 759 724 700 723 752 867 896 817 910 936 921
829 921 926 941 915 833 776 762 755 687 697 702 655 730 836 817 937 866 739 745 713 803 847 755 618 765 862 771 782 974 963 730 813 816 744 772
826 772 692 586 727 826 827 772 648 752 647 644 886 994 939 917 752 834 727 832 870 719 697 743 815 821 928 882 833 781 637 729
823 729 764 581 648 803 842 795 824 749 777 634 573 581 586 742 669 579 715 854 823 810 896 930 743 706 759 841 820 810 602 626 704 863
820 863 908 903 841 700 706 783 803 770 898 790 689 746 793 792 707 693 801 847 972 947 779 757 896 846 687 657 781 781 766 786 738 653
817 653 734 730 880 889 1006 812 786 860 964 1008 1016 897 661 865 885 872 811 787 729 675 612 728 846 850 748 829 900 1026 841 882 968
814 968 830 812 916 967 857 881 940 938 791 739 813 885 848 866 785 734 627 683 728 789 753 705 832 885 909 889 802 714 685 711 840 1010
812 1010 977 946 946 944 1012 831 854 772 761 827 847 784 784 876 900 885 823 921 876 892 964 867 1014 847 807 761 695 661 831 879 947 869 865 654
808 654 706 963 944 980 868 852 892 768 762 864 927 932 858 929 1085 987 1052 955 930 919 853 867 852 903 829 906 967 970 980 922 974 942 957 933
805 933 911 901 816 833 761 888 895 814 901 821 829 884 850 752 822 791 831 955 796 880 946 1048 1071 977 986 945 972 958 884 816 879 899 926 934 858
802 858 973 980 1013 939 840 878 936 965 1018 1077 1130 1004 1001 1069 1078 1015 876 888 772 904 847 867 868 988 1073 1121 1003 945 905 966 832 862 974
799 974 946 855 871 943 914 939 1051 1060 1049 1000 1061 1065 1198 1082 979 1008 1069 953 942 1039 1077 1053 881 927 1003 1003 1039 1147 1114 898 940 1142
796 1142 1159 1146 1128 1035 1067 977 1015 864 983 923 864 909 998 978 1015 1093 1130 1083 1183 1144 1020 1256 1237 1202 1115 1181 1103 1058 1152 1128 1114 1129
793 1129 1091 1072 1085 1199 1245 1216 1333 1314 1050 988 1079 1135 1127 1094 1192 1265 1280 1295 1215 1168 1112 1004 1116 1356 1353 1332 1279 1354 1529 1513 1414 1429
790 1429 1418 1380 1668 1707 1650 1677 1579 1478 1570 1532 1531 1591 1430 1379 1437 1482 1321 1209 1282 1378 1312 1260 1334 1226 1320 1348 1322 1252 1319 1277 1257 1113
788 1113 1077 1095 1091 1219 1250 1338 1274 1356 1212 1245 1209 1251 1304 1285 1259 1456 1465 1405 1409 1415 1391 1401 1332 1274 1265 1242 1331 1303 1257 1229 1192 1383 1328 1299 1248
784 1248 1209 1194 1234 1278 1379 1182 1156 1155 1113 1156 1244 1337 1305 1419 1392 1404 1402 1362 1374 1377 1455 1524 1505 1294 1216 1186 1120 1376 1241 1236 1308 1444 1455
781 1455 1376 1263 1226 1299 1275 1492 1407 1363 1341 1431 1263 1263 1219 1277 1237 1302 1286 1304 1333 1210 1112 1114 1163 1225 1298 1256 1358 1288 1306 1340 1350 1351 1410 1323
778 1323 1334 1439 1363 1350 1509 1530 1611 1471 1261 1358 1468 1335 1355 1292 1342 1451 1391 1289 1500 1466 1421 1217 1230 1320 1450 1416 1254 1231 1354
776 1354 1334 1413 1459 1351 1433 1415 1356 1379 1374 1460 1503 1478 1518 1540 1679 1609 1455 1468 1404 1330 1332 1530 1507 1502 1615 1469 1434 1491 1374 1384 1444 1485 1483
773 1483 1539 1592 1458 1416 1499 1686 1757 1631 1504 1543 1497 1559 1701 1667 1600 1547 1185 1367 1446 1359 1621 1773 1734 1778 1777 1775 1757 1715 1701 1478 1471
770 1471 1489 1479 1476 1599 1659 1657 1662 1581 1660 1652 1590 1638 1615 1745 1587 1471 1622 1637 1605 1539 1575 1532 1710 1732 1525 1633 1618 1819 1710 1704 1746 1641
767 1641 1647 1683 1766 1749 1763 1875 1831 1695 1797 1865 1841 1676 1905 1975 1824 1797 1793 1726 1569 1640 1611 1640 1758 1805 1816 1812 1784 1906 1781 1664 1612
764 1612 1719 1867 1797 1728 1858 1796 1837 1894 1899 1928 1899 1818 1880 2044 1919 1668 1893 1946 1826 1856 1875 1905 1825 1911 1918 1833 1696 1805 1858 1891 1756
761 1756 1834 1774 1754 1801 1813 1966 1938 1898 1873 1946 1772 1878 1944 1935 2148 2035 2095 2182 2167 2004 1804 1764 1822 2020 1840 1757 1960 1975 1943 2108
759 2108 2125 1993 1900 1988 2066 2036 2034 1976 1971 2006 2037 1870 1921 2109 2295 2261 1990 2026 2139 2035 2000 1956 2004 2051 2055 1869 1937 2087 2113 2014 1935 1947
756 1947 2043 2204 2244 2225 2024 2213 2332 2169 2219 2449 2357 2242 2396 2330 2253 2243 2135 2086 2083 2294 2241 2330 2420 2314 2213 2137 2081 2183 2404
753 2404 2313 2263 2200 2276 2250 2192 2252 2329 2301 2240 2223 2152 2298 2462 2357 2494 2481 2417 2463 2548 2481 2316 2485 2472 2446 2322 2381 2492 2439 2509 2369
750 2369 2395 2290 2348 2474 2421 2195 2211 2524 2449 2450 2489 2622 2550 2720 2605 2709 2757 2755 2657 2513 2424 2493 2663 2627 2733 2669 2672 2721 2684 2595 2663
747 2663 2640 2709 2640 2699 2626 2644 2585 2605 2633 2573 2643 2735 2859 2946 2861 2881 2760 2644 2587 2663 2758 2731 2759 2707 2769 2701 2723 2789 2631 2687 2631 2707 2794
744 2794 2826 2942 2937 2822 2910 2938 2929 2775 2780 2878 3043 2981 2837 2839 2865 2992 2995 2952 3041 3029 3071 3158 3096 3219 3143 3122 3140 3003 3052 3115 2992 3077 3060
741 3060 2883 2914 3142 3222 3336 3308 3182 3201 3197 3228 3204 3121 3147 3074 3101 3088 3136 3122 3032 3137 3336 3220 3149 3086 3250 3320 3314 3205 3367 3308 3315
739 3315 3338 3304 3320 3273 3350 3236 3419 3446 3359 3347 3448 3372 3363 3399 3349 3306 3263 3291 3234 3192 3394 3452 3464 3381 3304 3473 3513 3584 3749 3631 3467
736 3467 3591 3740 3747 3634 3648 3646 3669 3737 3755 3729 3736 3579 3644 3762 3690 3739 3669 3589 3750 3834 3780 3822 3742 3699 3901 3844 3764 3759 3711 3724 3806 3836 3961
733 3961 3896 3813 3832 3896 3785 3732 3715 3819 3834 3958 3889 3828 3917 4031 3982 4055 4124 4228 4056 3907 3980 3936 3876 3937 4054 4091 4096 4170 4099 4083 3979
730 3979 3944 4205 4336 4271 4251 4402 4401 4492 4285 4316 4422 4375 4429 4375 4387 4464 4235 4275 4333 4283 4364 4602 4594 4431 4438 4483 4509 4470 4415 4409 4384 4397 4267
727 4267 4251 4405 4380 4460 4510 4392 4470 4466 4431 4463 4443 4510 4631 4514 4461 4546 4472 4458 4556 4551 4336 4512 4679 4700 4722 4705 4751 4694 4567 4728 4715
724 4715 4615 4659 4553 4630 4730 4687 4638 4691 4608 4562 4717 4721 4784 4737 4628 4624 4509 4570 4623 4687 4754 4801 4846 4772 4687 4670 4708 4665 4737 4843 4709 4779
721 4779 4797 4731 4755 4826 4605 4746 4875 4871 4888 4825 4866 4910 5021 4818 4779 4977 4919 4848 4786 4870 4864 4778 4783 4822 4876 4895 4857 5046 5050 4902 4851 4769 4729
718 4729 4861 4942 4915 4875 4832 4750 4913 5004 5019 5027 4899 4870 4974 5013 5120 5056 4978 5229 5279 5060 5104 5055 5010 5051 4995 4857 4844 4929 5086 5148 5109
715 5109 5048 4998 4840 4864 4939 4992 5110 4970 4987 5149 5119 5085 4922 4905 5035 4882 4928 4948 4900 4833 4934 4993 4989 5017 5077 5167 5088 4925 4982 5071 4928
713 4928 5115 4967 4901 5028 4924 4899 4880 4809 4838 4971 5021 4938 4846 4939 5038 5032 5033 4980 4817 4731 4897 4908 4879 4960 5039 4938 4878 4925 4940 4805 5014
710 5014 4909 4705 4634 4737 4758 4725 4637 4613 4748 4845 4760 4819 4801 4715 4839 4657 4685 4776 4589 4605 4732 4643 4682 4838 4734 4652 4753 4738 4666
707 4666 4776 4686 4776 4669 4566 4551 4644 4547 4477 4561 4666 4572 4479 4567 4528 4498 4476 4470 4526 4498 4423 4573 4543 4336 4443 4592 4713 4552 4540 4705
704 4705 4575 4434 4520 4424 4474 4452 4408 4666 4595 4594 4530 4491 4405 4393 4333 4323 4310 4247 4278 4360 4350 4244 4169 4285 4317 4306 4300 4328 4420 4266 4148 4355
702 4355 4273 4091 4191 4218 4300 4231 4180 4119 4227 4347 4331 4282 4163 4214 4274 4201 4214 4111 4022 4079 4132 4096 4140 4075 4002 3937 3927 3948 3955 3983 3873 3781
699 3781 3777 3831 3869 3823 3951 3942 3829 3899 3850 3709 3802 3785 3711 3747 3748 3780 3761 3742 3742 3776 3825 3779 3843 3779 3738 3772 3894 3793 3794 3685 3667 3683 3681 3775 3750
695 3750 3869 3823 3667 3601 3654 3682 3702 3752 3744 3670 3471 3483 3747 3662 3600 3584 3673 3755 3674 3564 3481 3434 3570 3497 3366 3409 3436 3385 3430 3496 3407 3462
693 3462 3407 3388 3375 3460 3427 3314 3430 3452 3321 3335 3317 3344 3415 3382 3329 3403 3378 3329 3257 3450 3410 3222 3133 3109 3203 3161 3234 3194 3210 3184 3018 3088
690 3088 3213 3255 3174 3148 3313 3212 3202 3147 3039 2988 2913 2984 3137 3175 3095 2913 2916 2942 3003 3019 3064 2992 2824 2791 2895 2880 2856 2796 2726 2782 2894
687 2894 3034 2956 2989 2993 2860 2905 2933 2955 2877 2855 2896 2908 2837 2839 2845 2877 2797 2801 2808 2647 2706 2699 2708 2510 2613 2769 2663 2654 2675 2788 2725 2576 2645 2536
684 2536 2490 2479 2554 2627 2679 2670 2627 2575 2524 2431 2547 2600 2559 2738 2623 2521 2521 2569 2566 2619 2641 2560 2523 2724 2592 2569 2648 2460 2360 2403 2555 2631
681 2631 2518 2389 2423 2315 2288 2346 2364 2431 2399 2274 2356 2350 2387 2377 2407 2245 2236 2411 2452 2397 2468 2491 2455 2345 2352 2370 2307 2262 2207 2050 2201 2200
678 2200 2201 2248 2191 2182 2354 2366 2236 2101 2157 2257 2333 2306 2248 2170 2234 2250 2227 2163 2246 2300 2178 2028 2035 2142 2025 2134 2185 2116 2138 2246 2119
675 2119 1988 2141 2088 2109 2185 2114 2071 2160 2176 2237 2181 2053 2087 2175 2162 2020 2084 2107 2083 2000 1957 1997 2012 1991 2093 1983 2106 2112 2076 2238 2051
672 2051 2078 2085 2122 2167 2080 2064 2010 1917 1906 1753 1848 1933 1943 1947 1899 1984 1902 1989 1920 1808 1933 1853 1887 1935 1949 1950 1976 1823 1989 1924 1759 1876 1862
669 1862 1851 1888 1822 1894 1966 2094 1999 1882 1797 1805 1837 1859 1816 1761 1729 1662 1700 1965 1965 1841 2059 1926 1845 1888 1911 1797 1747 1693 1644 1741 1806 1778
666 1778 1789 1645 1703 1796 1804 1811 1732 1791 1853 1710 1729 1632 1644 1767 1795 1619 1560 1514 1610 1718 1704 1785 1722 1754 1659 1599 1847 1854 1684 1617 1624 1597 1673
663 1673 1762 1703 1574 1667 1652 1548 1608 1661 1729 1642 1635 1619 1603 1551 1631 1645 1756 1738 1644 1521 1521 1414 1439 1555 1582 1414 1382 1444 1539 1543 1568 1638 1615
660 1615 1722 1547 1536 1669 1715 1628 1606 1545 1605 1404 1610 1461 1407 1447 1483 1463 1426 1394 1360 1316 1507 1498 1395 1363 1526 1519 1584 1614 1595 1507 1468
658 1468 1486 1457 1338 1378 1455 1464 1394 1406 1380 1501 1354 1311 1357 1526 1470 1411 1459 1467 1388 1473 1458 1376 1296 1374 1394 1357 1311 1404 1487 1276 1155 1218 1277
655 1277 1372 1388 1373 1254 1309 1315 1252 1221 1239 1336 1466 1524 1499 1352 1286 1354 1234 1245 1325 1327 1443 1323 1414 1468 1465 1527 1302 1174 1285 1275 1376
652 1376 1283 1316 1423 1265 1127 1271 1408 1264 1258 1323 1308 1387 1488 1349 1409 1459 1336 1280 1304 1253 1308 1367 1384 1228 1162 1153 1137 1186 1120 1007
649 1007 1000 1214 1279 1272 1276 1367 1231 1194 1366 1305 1169 1206 1255 1036 1085 1290 1348 1235 1296 1234 1190 1072 1048 1359 1366 1227 1302 1376 1286 1239 1261 1310
646 1310 1229 1326 1111 1203 1283 1202 1188 1220 1153 1098 1142 1141 1059 967 931 1254 1391 1221 1219 1245 1266 1289 1122 1208 1255 1276 1164 1045 966 1009 1056 1057 1073
643 1073 1087 1114 1142 1079 1081 1104 1079 1247 1153 1180 1156 1271 1291 1147 1151 1166 1114 1160 1251 1311 1281 1272 1147 1187 1148 1102 1105 1177 1110 1136 1160 1210 978 832
640 832 1074 1127 1085 998 1241 1149 1098 1037 1002 941 1088 1098 1036 952 1042 1039 929 900 953 1014 1027 1254 1227 1070 1200 1137 1120 980 1005 1028 957 1157
637 1157 1033 1054 991 1049 1191 1085 1092 1013 1107 1166 936 1027 1006 975 1037 1150 1096 1138 1179 1031 1008 1106 973 880 964 1004 1020 949 882 1007 1034
634 1034 1028 1020 1053 1070 991 999 1069 1118 1120 1007 1121 1213 1151 911 835 1093 1132 1014 933 1072 1069 1167 1054 871 870 1025 980 1106 1130 1003 968 964 1002
631 1002 1051 1147 1144 1084 1187 1128 1118 1264 1161 1038 1027 962 921 812 834 853 926 786 869 952 900 970 966 976 960 1077 987 1120 1124 1040 1012 935
628 935 1032 1035 912 946 962 994 959 1023 1069 1039 1153 914 812 1018 1024 1009 1104 1110 1027 974 833 771 901 960 1007 873 905 908 1060 935 692 723
626 723 996 953 1026 972 1076 935 949 912 818 906 998 1073 1181 1051 951 856 969 942 768 746 860 904 992 964 859 873 987 1004 949 882
623 882 840 987 958 952 952 1116 1053 941 901 1002 950 945 933 941 919 900 892 936 854 895 876 884 771 876 994 847 879 1033 1041 903 801 938 956
620 956 958 893 1004 1032 957 883 933 987 874 884 911 1065 987 977 947 980 1071 892 924 968 938 811 783 861 756 771 947 928 909 916 961 975 792
617 792 692 829 866 897 838 818 837 937 924 832 935 806 802 812 817 920 1054 907 802 907 881 901 843 957 986 901 977 1028 998 956 721
614 721 724 790 828 894 863 950 1003 978 963 976 873 785 745 837 948 902 892 946 952 918 937 976 873 965 974 857 917 841 724 727 912 927 993 958
611 958 923 828 989 903 907 823 930 905 724 758 795 915 818 797 871 967 974 1043 819 814 889 816 818 783 747 852 967 958 930 966 1025 895 979 822
608 822 913 855 760 866 1035 985 965 879 769 796 699 750 825 749 714 784 889 976 928 799 867 787 790 938 967 855 800 798 1022 874 780 799
605 799 772 714 914 889 913 683 742 766 808 781 676 776 751 636 719 762 887 916 967 1058 1047 1085 928 885 907 902 1063 1307 1178 1075
602 1075 1032 953 1007 924 984 1159 948 1000 908 798 977 998 869 901 875 778 830 757 851 864 823 881 921 871 839 976 850 726 756 791 774
599 774 707 649 662 814 829 1033 966 772 869 968 879 762 639 542 777 952 1006 709 881 786 603 657 813 885 893 934 818 784 917
597 917 764 647 720 758 714 800 787 893 860 907 959 987 910 858 766 748 928 950 996 1093 1029 1038 937 946 1041 872 946 1202 1125 929 907 945
594 945 942 899 838 867 905 1027 1089 992 844 718 889 880 869 940 885 890 987 998 887 876 823 703 859 916 913 932 721 786 737 736 712 641 768
591 768 764 771 627 780 870 718 680 665 718 770 711 799 790 778 712 875 865 912 724 606 611 621 781 825 767 826 838 963 1002 858 939 1044
588 1044 980 999 971 899 881 785 942 945 1035 910 872 845 703 639 720 786 775 716 592 559 703 776 765 717 680 771 797 770 840 796 758 777 747
585 747 753 1013 881 875 850 790 804 781 860 973 873 685 693 837 800 725 666 656 805 914 752 747 779 691 629 674 729 574 603 615 727 758
582 758 815 734 792 804 1045 1042 789 956 944 796 883 892 793 828 840 795 814 839 882 949 752 771 754 740 880 914 710 566 640 756 689 693
579 693 720 729 721 802 771 670 619 707 954 835 753 819 829 776 857 752 848 816 795 753 691 703 694 809 896 987 826 840 800 800 837 882 888 934 830
576 830 775 888 975 1072 1077 1052 935 824 749 865 878 878 661 641 878 807 783 758 757 808 770 776 747 656 803 877 871 902 886 849 916 984 889 963
573 963 870 980 976 954 874 847 925 925 792 878 785 719 669 791 750 706 741 704 659 710 647 554 634 752 719 814 704 680 760 664 640 706 676 804
570 804 785 563 469 500 602 798 784 731 710 736 617 574 746 725 565 578 644 599 524 583 604 642 625 606 567 789 734 581 609 570 717
567 717 774 919 673 520 548 598 726 597 459 743 719 698 612 653 557 598 537 548 586 605 601 709 664 613 758 658 622 708 680 708 531
564 531 580 613 764 770 688 659 477 586 680 629 569 586 643 667 553 475 613 655 671 738 696 813 777 923 832 737 627 572 683 619 593
561 593 670 620 522 637 568 650 648 595 614 765 809 574 418 526 690 672 693 551 650 626 670 630 738 694 599 643 768 655 719 723 551
558 551 570 657 575 640 664 749 542 541 571 529 626 707 725 725 651 532 550 537 521 600 543 335 575 653 609 656 674 695 696 631 518 456 499 463
555 463 515 598 542 529 587 449 520 569 487 439 419 427 467 571 556 453 400 412 453 615 627 542 545 691 640 722 794 702 518 604 626 516 519
552 519 560 801 708 645 663 736 677 618 642 731 786 710 674 665 587 737 675 567 509 491 543 674 683 457 514 467 564 604 654 677 677 699 587 618
549 618 624 624 637 501 585 778 703 715 723 569 513 674 697 580 481 661 679 460 507 640 658 642 669 472 525 672 637 594 545 608 619 528
546 528 717 757 776 601 479 631 564 665 589 412 572 706 836 669 717 965 951 895 741 611 701 726 659 730 739 719 745 652 637
544 637 583 566 563 725 748 783 702 663 740 670 566 543 601 841 887 854 715 541 473 603 611 490 629 666 580 693 715 596 579 752 651
541 651 560 639 605 686 675 817 658 528 362 544 669 654 765 591 769 730 698 562 705 637 636 525 558 626 808 688 759 801 632
538 632 646 785 818 840 939 585 637 597 604 678 711 668 638 696 731 739 741 697 605 571 619 658 683 650 612 512 624 642 711 688 770 758 821 824 795
535 795 765 779 666 676 718 719 736 692 608 680 708 663 704 662 624 686 665 725 722 667 692 821 807 796 903 726 764 908 827 897 947 907 868 911
532 911 959 874 802 803 783 752 706 706 786 873 752 691 749 676 634 746 647 660 788 731 730 742 756 711 706 629 696 750 705 721 630 563 577 722 601
529 601 486 420 552 546 631 781 733 763 769 763 681 540 598 620 660 735 654 756 852 841 659 551 438 420 277 475 579 648 558 672 849
526 849 752 720 628 644 840 717 852 740 675 784 790 879 810 1014 988 984 1063 963 883 827 816 757 808 774 634 590 673 686 746 743 604 734
523 734 793 683 669 654 680 686 603 606 661 678 645 717 736 742 654 697 737 595 705 832 851 860 810 706 695 711 696 665 538 709 740 719 732 717
520 717 712 845 780 623 719 645 694 819 834 887 840 839 786 743 853 953 786 843 788 777 718 704 752 833 795 787 747 912 932 1001 1068 1072 886
517 886 814 762 684 625 726 816 805 748 772 723 816 798 716 784 753 717 718 846 664 664 842 743 612 684 772 706 630 630 629 682 679 791 817 702
514 702 728 673 655 645 766 685 590 605 584 649 481 447 693 682 721 634 572 606 625 619 617 663 698 745 839 662 718 856 806 665 602 589 706
511 706 707 658 591 836 872 693 595 566 597 747 647 633 659 711 613 643 653 579 581 610 595 630 711 771 682 683 605 659 670 782 802 795 868 812 946
508 946 824 681 742 645 582 631 678 827 795 729 696 716 715 939 1058 1189 908 1018 1213 1154 1155 1216 1176 1201 1258 1193 1212 1133 1069 1173 1173 1174
505 1174 1214 1009 964 1010 996 949 842 800 964 941 900 875 887 886 817 687 806 720 687 686 577 759 701 832 777 724 725 776 772 777 828 757 665
502 665 694 681 763 823 800 841 917 1026 945 929 808 663 794 883 714 665 798 896 871 807 606 498 543 703 704 602 699 771 840 733
499 733 658 684 883 833 642 659 837 767 649 835 1003 935 783 753 658 749 893 796 753 769 775 796 868 824 869 790 813 672 779 780 716
496 716 765 770 723 744 878 770 794 740 920 922 911 984 1065 1042 928 927 841 977 859 790 707 865 912 761 735 845 759 779 1018 1067 1019 952
493 952 899 906 984 1196 1066 1001 1106 947 1046 1031 1251 1101 1015 1038 1050 1081 1092 979 1030 1079 1065 988 944 981 967 941 872 850 1067 1093 1001 910
491 910 915 961 1013 983 901 905 963 953 1026 1141 998 1105 1211 1092 1177 1166 1048 1036 1088 1136 1207 1115 1187 1214 1312 1415 1300 1212 1351 1114 1112 1173
488 1173 1257 1282 1325 1408 1295 1210 1165 1192 1366 1584 1664 1675 1510 1538 1647 1597 1680 1863 1801 1784 1752 1792 1512 1649 1699 1571 1491 1659 1632 1441
485 1441 1444 1474 1395 1368 1307 1459 1454 1337 1470 1432 1335 1147 1233 1337 1354 1335 1307 1382 1371 1370 1531 1433 1527 1473 1576 1632 1524 1420 1334 1331 1351 1369
482 1369 1271 1305 1305 1480 1425 1398 1546 1548 1662 1535 1540 1552 1495 1529 1690 1611 1585 1771 1682 1561 1613 1667 1730 1790 1762 1687 1610 1604 1817 1846 1786 1808 1725
479 1725 1639 1623 1745 1865 2023 2023 2029 2021 1994 1964 2114 2091 2174 2225 2264 2084 2194 2513 2614 2637 2687 2777 2759 2811 2812 2891 3037 3256 3295 3250 3457
476 3457 3436 3581 3610 3751 3985 4069 4147 4322 4496 4604 4767 4719 4856 5050 5050 5127 5359 5516 5658 5834 5888 6018 5996 6084 6057 6043 6278 6351
474 6351 6460 6280 6038 5896 5845 5804 5726 5447 5394 5189 4841 4709 4454 4355 4140 3961 3891 3673 3567 3417 3237 3171 2950 2873 2939 2734
471 2734 2593 2556 2466 2372 2172 2249 2200 1898 1742 1779 1674 1720 1739 1830 1655 1666 1664 1473 1490 1445 1388 1286 1261 1299 1373 1194 1316 1165 1129 1169
469 1169 1344 1253 1117 1174 1298 1294 1294 1271 1181 1138 1159 1233 1170 1239 1391 1183 1284 1239 1132 969 873 1021 1110 981 984 1183 1135 1179 1084 1020 1102
466 1102 1009 1009 1104 1093 1149 1173 1226 1204 1153 994 967 1004 1044 916 845 878 976 1040 1123 1043 989 1003 1099 1054 1192 1180 1262 1182 1075 1154 1223 1306 1376
463 1376 1412 1513 1434 1496 1472 1320 1408 1298 1349 1535 1418 1262 1265 1297 1271 1217 1092 1027 1102 1197 1190 1050 1091 1183 1080 1170 1225 1139 1115 1125 1153
460 1153 1177 1123 1267 1309 1173 1109 1220 1217 1406 1586 1512 1499 1732 2140 2262 2472 2703 2889 2860 2828 2788 2731 2656 2418 2467 2299 2106 1875
457 1875 1823 1520 1439 1485 1382 1260 1080 1088 1081 1136 1066 1111 1035 1100 1000 1160 1181 1086 1097 1051 1053 961 934 1031 1047 944 1026 970 884 839 885 958 760
454 760 652 739 672 758 962 852 838 905 924 843 950 1050 891 867 906 944 1001 784 775 675 600 722 797 824 755 778 734 649 572 595 662
452 662 679 802 687 565 619 599 569 669 637 502 484 610 665 592 671 608 566 713 657 549 758 721 598 712 729 675 596 564 623 563
449 563 579 614 684 739 603 530 562 592 650 652 696 556 563 674 584 594 595 533 529 649 557 575 640 494 536 551 581 619 627 558 599 644 682 779 689
446 689 549 572 604 583 635 731 714 511 297 479 645 547 604 685 582 529 576 662 700 710 740 731 698 552 545 573 460 536 445 415 563 577
443 577 540 514 554 662 585 666 588 653 618 453 562 577 687 641 733 899 877 808 662 801 702 652 712 727 860 770 666 784 856 715
440 715 706 713 595 542 713 689 713 833 821 828 909 876 982 1096 1151 1382 1551 1494 1682 1772 1791 1741 1726 1684 1604 1396 1498 1391 1149 1175 1159
437 1159 1005 795 798 958 964 895 924 882 881 693 1001 1073 776 770 746 664 738 664 703 697 758 711 526 571 574 631 800 823 932 781 870 729
434 729 716 713 652 799 572 723 638 695 751 781 772 803 792 756 734 787 762 517 465 490 608 629 623 773 667 624 631 572 496 586 560 614 647 440
431 440 458 512 586 566 585 604 789 758 696 763 774 638 598 701 706 609 606 539 467 667 829 835 841 746 788 821 883 1008 1073 1095 1061 1157 1063 1009
428 1009 950 888 964 984 872 748 724 824 797 844 766 703 592 614 578 720 805 766 650 752 955 753 794 797 795 628 583 589 581 640 822
425 822 840 740 600 683 755 750 892 807 772 766 759 629 645 774 752 806 689 634 672 637 756 727 667 673 776 710 661 604 560 638 588 638 610
422 610 560 631 698 634 720 683 563 614 620 617 804 678 560 573 690 589 604 650 756 744 826 790 682 665 660 649 623 702 727 647 537 550
419 550 632 538 582 726 591 490 556 625 652 585 752 734 620 609 594 496 637 659 619 479 500 576 641 719 804 794 673 590 522 579 712
417 712 836 846 830 667 630 641 594 515 619 463 454 470 574 563 477 566 632 661 734 572 609 616 553 581 652 783 692 622 770 767 671 622 573
414 573 578 602 703 635 732 699 644 643 462 539 524 616 482 539 588 613 478 444 548 557 538 524 630 499 443 488 458 370 391 395 459 486 515 483
411 483 428 556 475 505 462 496 538 461 460 424 457 460 368 366 446 457 414 479 607 567 506 517 482 428 276 292 447 707 525 485 529 693 556
408 556 594 609 358 425 534 542 708 502 552 604 533 579 427 358 438 527 441 611 662 595 669 586 625 532 534 530 498 467 467 458 378 609 548 357
404 357 430 338 504 571 360 401 256 371 659 529 437 560 542 491 419 388 486 325 283 544 630 691 707 714 802 557 465 481 417 314
402 314 292 502 428 170 319 387 491 557 491 533 566 535 400 461 540 640 637 594 632 597 410 421 469 485 490 653 452 381 435 424 574
399 574 498 467 437 477 413 390 414 186 399 451 542 577 582 474 460 555 576 520 532 431 540 481 463 548 420 514 601 691 519 593 526 407
396 407 424 752 671 495 654 472 434 465 421 491 438 605 692 464 495 520 432 455 450 335 390 394 292 444 525 417 329 281 426 527
393 527 450 372 513 564 688 494 500 633 634 505 348 363 458 445 572 617 446 367 387 324 375 370 273 268 432 491 578 573 429 432 380 368 412
390 412 440 313 363 386 339 372 428 396 529 598 479 348 408 496 494 433 449 534 464 378 418 536 560 432 372 488 662 657 418 363 362 384
387 384 518 496 421 336 453 465 428 428 377 556 563 467 449 292 301 323 386 374 520 565 478 360 458 469 550 462 361 321 359 414 433 493 330
384 330 355 405 485 419 401 460 575 546 417 559 530 445 534 680 602 329 425 387 392 387 512 398 407 326 313 476 465 250 275 319 313 517
381 517 524 431 340 603 501 498 528 537 598 440 294 387 421 588 630 514 529 448 419 432 411 314 477 481 403 324 359 250 233 325 400 312 260
378 260 227 326 457 388 292 381 523 431 429 408 481 445 391 536 448 553 501 441 265 342 351 383 546 500 586 498 516 448 509 519 656 731 594
375 594 578 505 480 503 485 526 531 417 461 569 598 455 440 363 473 452 598 556 611 700 524 606 530 451 554 547 473 464 457 444 351 367 441 469
372 469 425 491 576 455 550 590 478 537 473 378 483 441 631 482 437 509 531 499 457 391 301 241 328 351 403 518 582 671 606 647 679 530
369 530 437 431 487 535 621 628 594 521 499 420 361 416 458 495 490 436 630 503 453 471 415 463 436 456 498 374 303 362 655 541 413 343 470
366 470 412 509 580 545 491 464 411 384 461 323 387 515 537 446 263 284 415 365 542 551 507 539 542 515 635 615 574 616 612 524 413 573 494
363 494 456 475 442 564 455 606 613 513 429 407 470 588 644 439 502 407 482 564 408 411 308 412 381 418 472 401 343 408 491 424 320
361 320 528 529 434 526 571 442 432 376 315 391 354 406 472 619 624 541 499 594 569 446 573 693 501 379 519 585 494 363 395 474 384
358 384 389 403 525 694 461 522 511 435 413 533 525 349 348 374 461 371 285 542 575 522 486 567 541 614 675 489 547 667 571 543 558 565 501
355 501 490 531 538 558 442 474 552 534 687 640 677 754 730 581 405 473 557 472 523 619 705 525 418 497 595 481 387 592 450 428 578
352 578 640 608 574 519 404 547 675 667 722 741 571 578 714 691 742 814 814 816 768 751 736 701 769 746 744 587 543 627 522 449 456 507 559 761
349 761 674 501 527 521 616 648 495 517 485 417 502 499 568 580 515 557 637 569 440 420 531 496 553 700 560 535 353 430 586 441 479 434
346 434 438 473 489 548 501 526 715 615 683 683 648 665 536 619 505 578 581 582 661 610 627 656 791 783 688 711 659 785 936 805 1019 1154 1155
343 1155 1036 931 953 1037 987 832 836 751 760 800 887 832 791 842 643 545 494 465 496 734 665 526 516 582 558 595 518 482 481 510 653 656 567
340 567 583 505 355 450 544 584 427 441 419 563 680 744 582 659 661 605 602 695 813 860 735 739 892 919 1028 1146 1171 1144 1352 1477 1374
337 1374 1160 1028 1020 893 1025 946 1039 1086 981 813 940 826 685 779 898 950 852 782 796 761 802 868 896 884 921 812 687 829 872
335 872 867 743 724 691 574 655 681 805 687 688 639 632 612 662 662 808 734 654 759 815 830 911 915 868 1007 896 912 857 944 956 949 966 1036 1287
332 1287 1205 1180 1090 1131 1162 1172 1211 1354 1494 1479 1520 1554 1682 1761 1859 1815 1532 1518 1585 1495 1489 1485 1313 1268 1294 1225 1261 1226 1189 1113 823 743 786
329 786 803 771 876 779 783 742 802 763 753 740 753 861 873 791 735 796 825 865 879 886 879 835 654 770 864 781 929 1019 856 867 839 864 991
326 991 962 1003 1194 1185 1283 1491 1504 1405 1302 1384 1391 1605 1598 1487 1576 1653 1682 1583 1624 1556 1496 1523 1429 1297 1305 1341 1140 1226 1362 1525 1512 1392
323 1392 1381 1517 1648 1788 1912 1857 1957 1919 1871 1884 1791 1734 1813 1670 1698 1556 1634 1722 1636 1659 1766 1936 2041 2088 2044 2259 2296 2164 2143
320 2143 2071 1810 1790 1636 1582 1582 1396 1146 1079 1108 1072 998 863 845 809 956 787 820 908 927 1092 1055 1005 1088 1027 1188 1180 1144 1158 1177 1237
317 1237 1201 1337 1284 1144 1161 1118 1048 1136 1058 829 802 941 991 995 1215 1138 1143 969 936 1343 1344 1477 1554 1645 1638 1789 1979 1984 2085 2238 2107
314 2107 2322 2530 2672 2847 2857 2884 2907 2985 3055 3037 2968 2863 2701 2559 2268 1914 1818 1754 1693 1581 1477 1488 1494 1431 1306 1404 1371 1322 1169
312 1169 993 1108 1135 1083 969 988 955 927 768 819 885 835 737 670 777 873 963 965 939 1055 1168 1194 1252 1454 1443 1383 1330 1332 1343 1271 1191 1101
309 1101 1142 990 781 930 890 814 793 709 817 913 896 986 1231 1165 897 865 893 1061 1087 1054 1082 1043 992 1092 1035 1067 1130 1056 1129 885
306 885 942 1043 1113 1172 1229 1258 1173 1177 1132 1018 1005 1130 1111 1064 1093 947 795 891 893 819 736 832 974 1004 946 831 988 984 1082 1091 1148 1172 1168 1270
303 1270 1335 1393 1204 1084 908 930 977 864 788 817 751 516 419 585 527 485 556 441 371 526 589 490 497 561 577 523 398 487 552 588 673
300 673 626 612 530 548 577 638 653 585 581 532 651 720 606 663 501 483 649 545 631 543 589 529 614 588 472 463 528 422 549 631 514 479
297 479 436 386 369 410 471 442 387 373 344 513 469 451 580 612 488 566 648 604 669 662 653 638 538 610 473 482 542 446 401 458 523 663 586 553
294 553 422 382 444 389 406 390 398 400 487 637 605 485 454 562 557 637 549 335 241 334 556 582 578 650 785 784 701 580 695 615 478 505 615
291 615 650 668 583 498 531 480 509 578 539 434 417 451 374 375 385 215 229 438 422 363 314 428 590 583 520 622 541 393 410 404 396 386 473 525
288 525 340 310 256 298 436 335 423 509 628 558 525 465 546 431 358 430 533 437 424 543 537 620 674 461 458 514 455 440 314 318 246 286
285 286 434 528 457 295 432 483 341 388 397 338 389 388 464 675 567 519 505 563 454 403 468 386 378 357 387 528 525 450 317 539 613 582
282 582 457 330 356 374 422 269 445 419 497 529 395 451 449 415 508 551 567 519 459 425 637 502 431 399 350 491 522 518 470 401 456 441
279 441 500 607 695 597 499 514 519 385 385 338 545 400 303 256 357 457 489 559 421 319 430 501 365 390 361 360 511 484 636 596 430
277 430 329 520 564 472 584 484 458 443 422 557 362 210 285 229 363 470 451 392 421 439 437 616 317 294 428 554 503 345 354
274 354 527 417 346 445 458 441 525 467 539 522 467 444 321 344 343 317 150 238 247 221 384 437 487 476 447 393 470 327 397 426 430 471 536 431
271 431 434 608 462 506 468 443 426 394 400 441 379 364 379 349 396 444 442 402 456 444 381 484 482 431 387 328 281 273 225 410 496 462 357 454 388
268 388 334 478 424 396 333 252 251 349 235 361 447 633 650 481 453 552 509 555 487 478 513 473 593 456 321 410 334 508 495 474 574
265 574 587 509 316 410 420 352 413 501 473 540 454 389 431 347 430 387 550 531 508 541 565 469 448 493 621 592 481 411 358 410 459 395 435
262 435 547 489 378 465 437 462 440 529 544 595 573 704 524 426 499 522 445 349 444 396 402 522 631 625 554 569 548 468 536 606 505 458 545
259 545 453 407 520 452 398 307 250 354 356 304 357 517 371 395 455 507 480 482 562 607 531 453 459 305 324 377 248 246 353 367 485 632 504
256 504 424 364 405 505 527 571 524 415 214 310 465 371 405 267 328 463 347 277 326 315 304 322 298 322 451 509 407 396 483 490 356
253 356 369 513 450 441 407 320 278 355 391 464 494 434 451 376 266 457 501 577 574 578 661 553 477 492 455 362 398 373 376 462 596 458 504 457
250 457 405 374 403 354 287 416 300 496 555 488 512 436 302 336 311 341 315 460 360 493 597 502 368 276 275 385 416 435 381 268
247 268 357 421 492 577 458 380 348 345 432 448 530 524 454 351 281 331 376 342 318 469 493 408 334 349 340 230 271 241 350 353 323 416 402 587
244 587 478 370 303 382 449 367 502 480 265 305 441 406 408 298 252 334 476 523 567 558 550 407 315 502 445 206 108 326 443 406 474
241 474 524 486 418 309 240 376 332 487 360 392 427 485 452 412 508 510 393 359 339 397 519 591 511 379 303 343 297 276 250 364 442 477
238 477 588 545 497 632 628 435 582 507 459 364 273 293 407 434 400 392 310 362 439 395 334 296 354 278 319 295 291 260 156 321 371 245 347
235 347 379 465 447 471 440 433 357 255 343 322 391 388 548 560 421 355 376 349 333 319 294 425 493 561 555 446 523 406 421 425 451 495 497 394
232 394 338 313 226 187 317 290 418 339 325 313 286 258 302 309 268 326 379 494 657 509 556 574 420 383 408 463 490 291 275 218 238 399
229 399 501 635 377 330 247 314 402 320 413 468 321 191 347 369 310 332 313 495 564 535 455 460 404 335 481 414 408 378 159 232 118
227 118 210 292 378 466 351 338 333 327 440 420 430 457 317 276 527 483 389 428 394 438 323 291 295 457 494 328 280 280 299 399 466 452 340
224 340 541 521 353 327 205 225 272 364 438 536 596 420 410 411 326 406 433 415 408 411 564 512 449 451 362 415 333 406 398 398 394 405 432 423 410 388 490
220 490 483 432 387 338 505 416 218 208 318 323 381 425 444 329 322 412 387 358 505 449 513 516 518 611 541 534 437 303 366 427 414 336 530 415
217 415 360 402 425 448 337 320 212 260 216 293 283 153 323 351 250 228 316 309 189 321 275 215 97 237 270 387 421 320 316 436
214 436 429 342 270 170 259 413 412 284 301 196 402 361 377 557 377 243 442 534 465 428 450 346 270 344 425 426 385 429 410 470 467 443
212 443 456 432 324 238 293 371 382 368 389 382 388 297 367 305 368 343 148 252 220 282 415 467 474 513 336 384 277 411 410 438 509 381 336
209 336 311 369 409 484 333 360 352 360 213 267 305 409 454 397 322 330 404 477 359 373 354 267 373 304 394 516 535 615 534 519 425 563 552
206 552 450 323 339 275 350 437 485 413 373 323 438 572 656 479 346 350 312 278 334 268 377 340 458 493 437 301 403 442 345 323 331
203 331 168 252 329 348 470 490 406 413 317 323 336 296 304 354 375 288 411 584 540 457 489 434 439 419 439 392 373 329 364 341 424 403 437 478 344
200 344 401 490 498 422 328 340 346 269 370 472 248 273 219 330 490 289 241 379 498 493 471 496 473 459 352 300 483 382 352 185 381
197 381 514 355 305 409 321 383 435 471 494 403 230 338 410 417 364 309 320 495 456 430 458 493 389 465 528 466 390 221 273 377 315
194 315 369 449 533 380 293 266 245 422 624 552 449 396 255 323 392 297 332 495 484 347 440 444 351 242 370 328 336 388 304 225 250 347
191 347 448 267 196 218 264 286 382 398 407 258 232 400 287 219 343 402 465 468 411 385 417 581 554 463 442 464 596 548 428 289 323
188 323 522 460 471 467 331 440 256 135 202 340 365 320 336 215 438 525 376 269 288 352 388 270 525 562 448 513 366 477
186 477 600 479 443 408 348 317 393 526 477 394 376 256 389 347 278 248 185 196 243 328 536 459 407 387 469 489 321 327 278 178 254 258
183 258 334 282 299 275 210 340 524 444 457 457 436 462 506 505 541 532 420 366 220 161 209 141 83 338 547 566 409 514 323 335 279 356
180 356 373 406 366 404 470 372 346 420 435 407 460 337 302 408 458 411 382 528 497 319 287 217 247 290 364 277 368 411 409 371 363 340 417 558
177 558 524 430 425 299 350 233 163 47 160 186 370 421 501 305 310 306 312 263 264 323 337 444 408 442 295 454 560 476 439 452 612 461
174 461 326 266 186 173 188 192 320 334 352 304 343 350 337 373 459 429 411 390 363 379 255 386 508 394 424 246 46 325 386 326 246 309
171 309 307 353 566 532 582 540 368 299 241 465 490 353 384 384 257 318 224 183 263 368 542 413 365 441 423 426 461 352 492 503 401
168 401 221 379 371 283 264 183 343 440 381 373 337 331 379 338 266 335 341 290 345 397 305 429 415 306 188 276 222 265 337 269 220 292 288 508
165 508 581 560 489 427 565 536 504 499 516 527 604 588 525 532 567 530 324 368 482 382 346 313 380 396 402 408 254 315 493 493 561 504 292 296 322
162 322 358 397 396 418 565 524 463 328 376 390 219 293 510 467 528 510 440 356 335 363 289 472 459 384 469 345 308 349 597 613 567 452
159 452 532 565 437 508 373 310 332 410 542 616 367 308 313 288 320 331 209 213 385 234 175 303 487 429 347 316 339 425 647 577 410
156 410 406 439 341 303 548 494 370 268 160 224 319 349 288 333 330 338 345 264 344 378 283 156 286 478 486 362 261 236 384 429 384 495
153 495 541 560 318 202 269 399 518 370 309 347 344 298 509 447 410 408 500 459 364 619 611 377 351 384 434 323 335 364 381 396 628 588
150 588 538 531 464 504 534 490 507 433 394 510 413 273 326 293 248 394 550 475 383 440 382 388 445 447 448 448 484 311 297 405 569 465 466 366
147 366 440 567 426 597 496 447 528 408 352 367 309 278 373 440 202 326 408 324 188 325 297 313 451 446 411 424 502 457 565 425
144 425 333 370 408 559 431 415 382 327 375 442 427 353 339 413 452 530 444 469 456 485 609 496 542 464 535 457 258 325 399 361 377 377 267
142 267 339 364 473 440 472 450 296 350 387 263 254 237 257 341 362 408 290 269 419 343 412 579 431 322 319 245 264 416 276 278 264 504
139 504 525 500 432 333 332 386 332 278 433 480 420 162 242 226 202 280 303 268 272 303 297 422 357 334 210 251 318 423 539 380 485 361
136 361 309 314 348 366 476 545 487 456 397 238 283 354 390 484 406 375 335 309 384 481 549 499 305 354 264 299 319 437 494 432 456 396 456 511
133 511 428 482 578 400 336 505 418 358 192 145 242 385 390 343 225 290 432 342 366 331 279 361 366 348 530 485 445 474 559 439 492 516
130 516 453 395 463 605 638 485 387 429 347 378 446 530 460 419 460 408 294 464 568 519 531 532 531 444 425 460 405 453 572 605 737 598
127 598 613 830 929 999 1179 1296 1338 1334 1322 1410 1407 1432 1396 1334 1313 1295 1116 954 846 818 899 609 519 590 536 603 515 500 539 564 695 615
124 615 446 599 645 492 377 400 371 464 471 446 352 376 435 594 586 514 486 473 443 394 427 369 430 485 498 532 354 316 432 287 274 285
121 285 412 318 264 280 195 238 399 336 264 256 307 280 334 397 339 288 367 256 298 368 282 283 303 447 277 242 284 440 521 650 531 421
118 421 464 528 528 515 543 521 590 666 533 517 581 616 537 492 765 780 659 585 602 487 399 526 496 404 314 407 399 551 530 471 451 403 377
115 377 533 584 511 413 467 305 263 467 433 371 378 455 380 363 264 390 230 230 168 166 110 139 290 278 205 297 398 390 445 341 256 321 392
112 392 481 446 390 470 532 498 333 480 460 447 514 499 437 372 289 220 262 395 203 218 379 302 285 304 343 328 450 339 403 316 395 317
109 317 318 108 284 494 504 375 464 523 512 410 437 359 384 416 242 337 316 311 356 338 343 365 455 533 388 375 413 326 323 413 468 354 301
106 301 227 328 439 363 369 302 348 327 297 194 296 476 406 370 285 270 300 313 257 438 478 488 503 519 394 374 278 337 225 342 420
103 420 454 399 388 439 494 535 383 316 344 278 384 451 337 308 317 409 346 232 246 319 365 364 339 352 400 440 353 321 379 378 351 407 364 192
100 192 200 261 298 201 287 236 353 424 297 234 267 425 404 298 148 302 357 222 279 301 238 218 377 296 340 390 297 457 557 460 387
97 387 225 366 406 314 361 484 542 482 418 403 320 317 377 339 251 269 391 486 474 284 381 496 546 367 420 221 339 227 121 301
95 301 279 195 233 282 148 141 265 381 374 288 114 188 262 336 390 256 278 326 304 206 -5 187 317 300 385 458 358 355 542 492 362 255
92 255 275 254 282 336 329 284 259 109 273 308 273 243 342 396 460 505 380 348 359 397 306 310 469 361 404 438 323 280 369 428 484 491 520 470
89 470 366 263 350 451 377 373 246 322 289 395 390 316 381 272 318 380 363 376 313 446 559 413 295 418 406 509 453 328 262 413
86 413 494 512 475 549 737 425 271 332 276 384 404 403 373 449 400 386 381 362 445 464 454 389 494 486 547 408 250 201 315 280 175 218 395
83 395 552 478 304 300 327 247 294 466 366 553 555 569 395 432 464 381 188 185 214 351 283 313 306 227 337 154 225 294 202 156 300 387
80 387 384 496 331 180 398 577 539 506 535 498 409 516 440 422 426 278 377 416 399 468 504 418 338 461 534 428 498 454 601 577 414
77 414 350 461 489 471 436 495 452 465 494 459 359 629 624 462 306 343 381 339 267 304 424 450 372 439 389 258 297 312 344 408 303 224
74 224 275 311 395 255 294 500 511 451 245 310 481 350 287 377 406 367 505 307 415 381 182 260 251 223 330 230 203 395 496 379
72 379 257 228 528 517 455 392 448 511 262 320 302 470 513 514 348 179 498 458 248 130 286 331 387 480 476 355 550 327 126 126
69 126 417 457 325 279 411 415 332 290 495 606 385 291 325 460 232 264 266 319 227 328 445 485 500 464 498 354 359 393 268 206 221
66 221 278 289 376 343 491 421 257 480 488 383 265 283 360 411 389 371 464 439 376 374 380 301 382 264 252 348 424 468 425 505 326 136 142 136
63 136 324 312 217 387 485 525 423 300 276 456 534 571 593 522 304 468 470 460 413 278 371 415 235 205 279 192 258 368 513 601 527
60 527 437 343 383 406 354 211 185 234 183 259 348 294 348 395 448 430 393 270 281 411 348 484 480 473 367 359 368 519 327 345 397 405 310 319 388
57 388 322 306 354 385 312 299 203 272 410 293 390 521 400 324 389 645 608 448 307 337 325 401 408 470 384 353 309 226 315 281 242 480
54 480 573 491 338 331 366 374 221 287 346 494 412 389 482 339 282 328 518 531 448 321 227 281 303 310 341 386 196 223 270 321 304 314 174
51 174 180 194 255 288 228 290 249 296 539 274 305 450 508 288 298 184 297 440 346 300 313 253 325 410 292 183 273 339 326 253 175 353
48 353 351 287 380 522 436 311 257 305 394 378 351 512 519 472 394 269 289 407 420 281 143 288 396 454 474 368 420 448 314 260 317
45 317 321 411 341 570 641 684 481 368 484 454 372 380 276 211 301 537 508 538 523 529 598 582 434 385 358 421 478 319 235 405 400 460 445
42 445 454 416 458 426 446 365 241 209 159 149 249 243 156 316 404 313 316 364 309 517 507 384 457 403 390 357 522 504 478 474 413 563 442 602
39 602 514 350 369 319 293 446 403 434 439 345 350 336 444 355 231 241 405 449 502 455 460 437 258 463 414 444 649 541 409 394 317 354
36 354 351 284 274 275 221 269 385 377 372 460 491 379 395 360 472 457 412 629 875 781 750 608 437 679 747 679 717 678 697 589 490 499 469 606
33 606 640 559 491 483 599 542 593 707 650 655 569 645 754 562 521 685 565 481 488 622 497 417 474 398 343 314 361 346 386 389 403 446 191
30 191 280 366 369 488 465 426 451 428 463 409 440 396 567 529 346 247 422 551 401 351 391 560 540 435 506 535 538 379 332 427 402 358
27 358 340 236 228 204 223 260 380 537 407 267 292 407 475 470 362 344 289 219 382 396 458 401 218 429 473 401 433 559 513 543 307
25 307 185 254 350 545 397 311 448 509 370 566 541 426 497 434 481 649 552 510 548 682 503 596 461 429 416 370 266 293 324 317
22 317 468 653 586 416 347 381 368 434 305 424 563 510 577 553 400 425 516 485 412 556 418 376 405 292 389 479 361 267 393 423
19 423 469 545 398 355 479 490 448 334 353 327 405 489 491 460 492 437 298 292 395 337 293 326 347 431 458 642 621 614 521 584 643 422 428 569
16 569 533 595 657 694 679 621 377 425 592 508 385 415 509 630 647 571 490 418 542 851 957 894 898 1096 1179 1221 1273 1388 1227 1250 1135
13 1135 1028 997 933 862 759 694 644 610 631 625 615 694 499 367 325 249 382 308 223 305 300 351 349 350 388 504 379 534 511 498 591 545 526
10 526 384 232 262 310 393 419 270 298 315 274 221 390 562 615 464 353 406 557 669 646 308 293 419 348 405 392 418 319 329 261
8 261 404 362 117 60 167 320 318 332 403 386 361 440 504 456 344 398 414 474 549 429 292 264 284 362 433 377 347 423 599 454 464 515
5 515 497 524 674 651 551 566 396 361 475 348 330 507 424 393 379 454 477 460 533 489 446 470 432 459 493 497 541 546 425 494 416 307 505
2 505 637 633 673 747 852 971 1102 1141 1260 1482 1591 1914 2123 2264 2498 2624 2881 2868 2896 2688 2571 2403 2177 2056 1941 1666 1439
-1 1439 1390 1277 1248 976 815 769 650 685 651 525 560 554 422 552 654 669 563 535 526 459 461 465 481 461 423 466 469 387 467 425 442 465 572
-4 572 498 333 704 625 496 445 383 603 468 387 404 524 569 573 616 505 466 375 320 359 540 456 305 374 476 352 339 477 364 310
-7 310 374 379 324 296 225 286 285 323 388 202 297 230 182 237 321 366 399 332 258 334 438 259 254 146 240 430 291 301 374 390 375 370 329 393 281
-10 281 258 286 337 470 417 475 437 371 500 358 327 322 224 258 372 471 433 398 463 377 358 364 369 315 151 185 276 300 227 306 326 314 342 417
-13 417 339 178 184 258 297 332 387 437 332 339 359 593 525 427 396 453 386 325 301 346 400 299 198 270 371 315 229 382 441 482 447 478 415
-16 415 185 214 296 321 390 377 496 503 148 164 306 298 278 270 384 380 300 327 309 384 388 391 405 454 412 392 371 365 346 340 333 264 322 234 183 301 313
-19 313 350 329 329 272 343 251 221 174 204 289 420 393 381 367 287 102 206 309 521 344 193 168 111 96 250 369 364 379 209 388 456
-22 456 459 478 451 354 185 260 259 191 247 310 286 411 510 518 383 367 418 375 484 444 475 341 328 524 386 272 264 308 248 267 263 246 308 235
-25 235 268 415 464 398 510 458 282 370 440 367 421 431 381 313 528 541 436 272 157 213 319 317 284 371 317 261 375 400 150 201 21
-28 21 297 469 298 316 210 291 514 422 396 574 426 254 507 515 402 393 461 447 376 288 356 441 434 481 457 584 485 353 307 444 522
-31 522 409 260 400 371 390 475 292 243 270 273 216 267 267 212 240 351 392 256 238 333 216 391 515 599 493 512 614 509 387 285
-33 285 297 457 531 553 340 229 237 231 254 341 423 339 391 406 457 570 407 247 187 385 502 509 434 282 312 270 310 345 389 287 203 295
-36 295 303 365 408 474 475 446 341 415 354 345 506 411 384 163 346 402 214 261 353 405 347 351 229 270 156 380 583 419 485 241 242 344
-39 344 367 412 441 484 378 389 517 534 591 523 528 506 387 228 217 306 258 387 357 210 272 413 405 513 417 426 380 301 327 241 320 387 408
-42 408 412 388 320 337 381 443 398 375 426 379 349 276 266 324 154 272 430 499 504 433 396 258 239 316 359 293 400 451 369 246 106 220
-45 220 271 233 307 304 275 407 312 268 232 307 285 252 198 287 287 256 301 382 534 532 476 326 453 517 491 529 475 376 329 493 474 390 352 421
-48 421 367 233 272 335 341 327 350 348 279 474 481 325 380 350 381 257 405 232 365 375 373 415 407 352 329 326 232 314 160 224 206 291 235 234 279
-51 279 345 380 424 476 435 386 359 295 153 230 548 605 431 144 84 289 402 375 342 337 444 459 267 225 277 431 326 62 60 183
-54 183 248 375 448 407 167 281 405 397 239 297 329 489 460 468 449 318 381 327 341 428 443 533 505 359 335 362 349 303 315 286 366 476
-57 476 302 409 372 388 412 462 412 340 416 412 449 486 392 366 354 312 284 344 291 236 391 354 337 418 357 340 292 243 392 461 505 418 413 485
-60 485 477 328 488 434 399 502 515 442 323 303 306 368 370 311 292 232 404 461 329 368 372 303 377 310 310 427 391 460 428 501 381 207 161
-63 161 191 203 150 257 323 366 427 442 368 455 413 221 286 279 248 276 359 344 509 507 452 327 230 216 339 290 436 348 281 227 223 287 235 400
-66 400 410 343 245 239 148 217 384 269 117 210 341 376 341 221 325 300 369 327 112 135 188 321 210 192 131 182 215 241 315 347 490
-69 490 376 390 499 472 367 234 273 394 314 250 200 320 316 381 307 345 295 227 295 390 208 243 261 328 443 347 203 291 462 430 433
-72 433 475 510 464 243 101 177 301 455 409 472 441 458 236 270 283 421 504 520 411 438 390 370 340 320 230 342 301 372 350 390 342
-75 342 169 351 513 392 450 341 409 408 340 410 420 496 417 405 507 570 406 265 314 308 288 383 313 317 326 264 195 294 279 250 231 201 215
-78 215 385 334 309 396 473 428 434 283 185 338 511 479 507 446 282 363 224 240 276 362 328 362 408 430 496 354 276 476 594 607 578
-80 578 586 520 401 516 457 429 521 438 442 509 470 480 483 429 328 241 408 453 325 410 467 356 376 302 332 395 422 323 397 388 437 512 344 415
-84 415 411 457 463 394 387 520 451 322 229 337 293 381 418 465 435 276 204 171 273 345 230 341 209 284 407 197 211 279 179 199 167
-86 167 200 262 254 283 308 298 264 246 226 301 243 233 278 326 316 248 45 299 470 461 337 370 438 361 266 277 246 397 407 331 475 399 167
-89 167 290 362 498 501 444 341 266 337 246 188 199 242 277 237 249 212 137 168 239 311 319 392 245 227 190 247 270 346 224 283 381 258 213
-92 213 245 169 88 195 271 223 198 219 223 230 287 385 451 409 360 475 447 535 461 352 345 337 493 436 342 212 265 421 431 349 378 410 371 394
-95 394 403 285 268 352 403 338 329 438 445 497 325 414 418 355 236 279 322 278 299 273 199 188 251 309 341 313 348 330 338 266 371 297 307 319 289
-99 289 313 290 236 343 230 351 410 320 309 341 275 211 293 205 268 220 238 434 424 243 269 415 433 473 423 435 500 458 236 234 360 302
-102 302 233 340 471 368 384 503 514 432 363 409 316 263 401 468 472 518 359 283 226 256 184 231 249 332 428 362 356 288 343 364 285 248 154
-105 154 262 372 368 271 411 524 394 415 421 361 456 375 273 351 255 307 264 376 294 233 365 440 478 545 424 426 316 311 423 372 220
-107 220 330 504 359 316 370 273 283 464 381 372 268 272 263 323 335 303 194 335 346 232 320 286 309 324 283 23 222 257 319 403 472
-110 472 428 473 452 103 276 406 351 360 414 521 527 395 391 425 366 285 447 454 348 370 399 287 287 287 302 237 254 250 373 420 471 434 329
-113 329 397 493 313 324 257 237 314 411 309 192 232 264 490 295 106 261 330 241 259 354 242 124 146 299 291 196 294 347 294 152
-116 152 256 267 289 259 225 304 352 452 400 338 472 485 338 341 368 318 358 305 244 226 351 325 290 456 321 269 202 217 253 351 567
-119 567 461 420 363 422 381 424 350 378 541 481 389 530 530 471 535 334 309 357 433 489 450 550 586 572 401 622 555 236 218 301 238
-122 238 277 352 268 350 345 191 321 354 261 324 359 354 327 317 285 292 316 376 510 572 579 363 325 343 420 391 491 423 349 400 412 410 338 185
-125 185 190 146 225 334 276 287 142 175 244 263 292 251 195 390 466 461 386 377 382 398 345 401 440 510 539 452 462 287 279 409 508 350 333 297
-128 297 280 370 387 271 332 460 344 277 339 291 324 336 341 243 178 235 239 220 294 355 381 352 403 343 355 378 358 295 304 324 504 515 443 365
-131 365 295 292 395 439 484 390 315 362 532 524 379 219 287 91 71 337 455 345 309 432 340 357 275 248 312 341 351 355 427 524 408
-134 408 318 234 278 325 318 244 339 429 307 291 438 361 323 339 504 436 298 458 123 127 92 3 188 227 336 403 407 338 401 407 456 389 486
-137 486 458 241 273 368 387 326 306 342 383 290 153 125 306 395 490 476 448 427 199 245 184 164 138 203 156 124 252 297 331 382 360 385
-140 385 424 451 200 140 156 141 113 157 288 365 376 356 284 245 372 439 400 432 447 400 351 307 291 310 270 171 408 430 398 386 331 284 234
-143 234 246 347 403 369 328 242 274 378 386 288 189 207 164 116 93 219 325 341 227 306 403 419 396 456 467 362 443 347 345 225 287 498
-145 498 291 233 456 395 359 358 399 319 302 373 267 314 295 373 366 319 314 375 437 424 356 292 298 184 258 447 428 420 402 366 305 271 309 288 315
-149 315 255 208 220 283 352 315 327 191 177 328 360 532 451 359 421 345 331 375 352 321 301 395 262 272 303 420 297 241 356 297 366
-151 366 406 239 280 443 547 667 398 293 367 374 451 410 293 189 222 390 357 253 316 288 220 204 190 403 392 354 318 349 334 317
-154 317 202 219 247 409 429 446 415 441 408 421 254 254 414 423 410 487 424 339 355 312 328 307 286 375 354 311 360 389 343 398 488 374 344
-157 344 267 76 137 251 383 308 375 325 271 326 376 375 537 437 317 287 255 231 219 386 522 444 464 547 473 431 301 283 288 566 347
-160 347 276 178 202 308 390 473 430 425 418 301 382 312 311 309 384 475 350 289 398 349 326 340 369 372 493 430 268 385 474 366 236 337
-163 337 412 413 344 399 484 281 259 315 280 295 474 388 308 409 547 300 250 396 394 493 243 144 247 357 315 428 453 296 284 374
-166 374 391 412 330 275 131 249 341 424 376 361 380 367 416 381 459 335 377 353 267 164 355 416 254 431 504 470 488 432 367 390 350
-168 350 260 241 271 155 111 119 99 247 381 297 191 282 362 408 409 452 345 223 159 142 251 264 217 271 358 237 216 375 380 267 374
-171 374 396 350 501 501 430 440 491 445 361 381 333 283 326 307 197 401 299 162 71 291 282 232 221 72 123 203 236 264 291 328 305 233
-174 233 264 257 292 339 319 430 442 313 290 307 302 385 487 407 409 326 250 196 144 120 261 263 230 350 337 353 463 274 282 442 351 249 215
-177 215 381 276 167 165 222 186 159 197 297 360 295 316 522 443 300 376 388 349 314 347 425 455 441 478 519 513 316 362 331 411 543 500
-180 500 363 280 273 267 320 396 429 468 430 389 237 422 417 340 348 325 341 151 170 316 362 306 286 223 403 410 456 368 244 349 367 459 306
-183 306 400 472 513 433 427 346 331 287 405 304 132 224 292 276 277 286 287 305 313 151 348 455 433 459 371 375 407 323 327 450 338 487 469 272
-186 272 221 361 286 216 113 245 363 363 390 460 432 386 326 372 377 352 387 357 382 384 428 501 419 364 174 262 162 187 328 267 343 338 250
-189 250 219 353 343 328 280 208 244 273 320 274 205 102 297 514 458 435 372 341 317 223 317 270 152 133 240 278 296 388 245 404 395
-192 395 403 277 268 437 313 165 221 374 384 221 284 337 411 353 449 435 455 295 373 351 238 270 211 216 267 227 256 167 322 364 245
$$ [...]
-3518B57
##END=	
##END=	
