##TITLE=	Jul31-2014-fpc.10.fid
##JCAMP-DX=	6.0	$$ MestReNova 14.3.3-33362
##DATA TYPE=	LINK
##BLOCKS=	1    
##ORIGIN=	Mestrelab Research S.L.
##OWNER=	hrzepa
##$MNOVA/METADATA=	(DOCUMENT,BASE64)
eyJuYW1lIjoiRG9jdW1lbnQgMSIsInBhZ2VzIjpbeyJpdGVtcyI6WyIxIiAgICAgXX1dfQ==
##TITLE=	Jul31-2014-fpc.10.fid
##JCAMP-DX=	6.0	$$ MestReNova 14.3.3-33362
##DATA TYPE=	NMR SPECTRUM
##DATA CLASS=	XYDATA
##BLOCK_ID=	1
##ORIGIN=	Bruker BioSpin GmbH
##OWNER=	nmr
##NUMDIM=	1
##$MNOVA/METADATA=	(ITEM,BASE64)
eyJhbmdsZSI6MCwiYXhlcyI6eyJ4Ijp7Im1heCI6MjQ5LjI0MTA5OTk5Nzg3NDQ0LCJtaW4iOi0xOS4
5OTcwOTYxMzc3NzY5ODJ9LCJ5Ijp7Im1heCI6NDI4ODEuNzU1NjE1MjM0Mzc1LCJtaW4iOi00MjkwLj
U5MzQ0NDgyNDIxOX19LCJwb2ludHMiOlt7IngiOjUzMjEsInkiOjU4MzV9LHsieCI6ODcyMiwieSI6N
TgzNX0seyJ4Ijo4NzIyLCJ5Ijo4MjA4fSx7IngiOjUzMjEsInkiOjgyMDh9LHsieCI6NTMyMSwieSI6
NTgzNX1dLCJ6IjowfQ==
##.OBSERVE FREQUENCY=	75.499030390135004609
##.OBSERVE NUCLEUS=	^13C
##.SOLVENT NAME=	CDCl3
##.PULSE SEQUENCE=	zgpg30
##LONGDATE=	2014/07/31 21:10:00.000
##.ACQUISITIONMODE=	SIMULTANEOUS (DQD)
##$ORIGINAL FORMAT=	Bruker XWIN-NMR
##$MNOVA/SCALES_VERSION=	9
##$PARAMETER FILE=	(acqus, ASCII, /Users/hrzepa/Library/Mobile%20Documents/com~apple~CloudDocs/Bath/FAIR%20NMR%20Submission/Compound%201/13C/acqus, 0)
$$ ##TITLE= Parameter file, TOPSPIN		Version 2.1
$$ ##JCAMPDX= 5.0
$$ ##DATATYPE= Parameter Values
$$ ##NPOINTS= 12	$$ modification sequence number
$$ ##ORIGIN= Bruker BioSpin GmbH
$$ ##OWNER= nmr
$$ $$ 2014-07-31 21:11:04.681 +0100  nmr@CHPC-NMR300
$$ $$ C:\u/data/fpc/nmr/Jul31-2014-fpc/10/acqus
$$ $$ process C:\Bruker\TOPSPIN2.1\prog\mod\shimcntl.exe
$$ ##$ACQT0= -1.57563025210084
$$ ##$AMP= (0..31)
$$ 100 100 100 100 100 100 100 100 100 100 100 100 100 100 100 100 100 100
$$ 100 100 100 100 100 100 100 100 100 100 100 100 100 100
$$ ##$ANAVPT= -1
$$ ##$AQSEQ= 0
$$ ##$AQ_mod= 1
$$ ##$AUNM= <au_zgt>
$$ ##$AUTOPOS= <44 >
$$ ##$BF1= 75.490349
$$ ##$BF2= 300.22
$$ ##$BF3= 75.490349
$$ ##$BF4= 500.13
$$ ##$BF5= 500.13
$$ ##$BF6= 500.13
$$ ##$BF7= 500.13
$$ ##$BF8= 500.13
$$ ##$BYTORDA= 1
$$ ##$CFDGTYP= 0
$$ ##$CFRGTYP= 5
$$ ##$CHEMSTR= <none>
$$ ##$CNST= (0..63)
$$ 1 1 145 1 1 1 1 1 1 1 1 1 1 1 1 1 1 1 1 1 1 1 1 1 1 1 1 1 1 1 1 1 1 1 1
$$ 1 1 1 1 1 1 1 1 1 1 1 1 1 1 1 1 1 1 1 1 1 1 1 1 1 1 1 1 1
$$ ##$CPDPRG= <waltz16>
$$ ##$CPDPRG1= <>
$$ ##$CPDPRG2= <waltz16>
$$ ##$CPDPRG3= <>
$$ ##$CPDPRG4= <mlev>
$$ ##$CPDPRG5= <mlev>
$$ ##$CPDPRG6= <mlev>
$$ ##$CPDPRG7= <mlev>
$$ ##$CPDPRG8= <mlev>
$$ ##$CPDPRGB= <>
$$ ##$CPDPRGT= <>
$$ ##$D= (0..63)
$$ 0 2 0.00345 0 0 0 0 0 0 0.06 0 0.03 2e-005 3e-006 0 0 0.0002 0 0 0 0 0
$$ 0 0 0 0 0 0 0 0 0 0 0 0 0 0 0 0 0 0 0 0 0 0 0 0 0 0 0 0 0 0 0 0 0 0 0 0
$$ 0 0 0 0 0 0
$$ ##$DATE= 1406837455
$$ ##$DBL= (0..7)
$$ 120 120 120 120 120 120 120 120
$$ ##$DBP= (0..7)
$$ 150 150 150 150 150 150 150 150
$$ ##$DBP07= 0
$$ ##$DBPNAM0= <>
$$ ##$DBPNAM1= <>
$$ ##$DBPNAM2= <>
$$ ##$DBPNAM3= <>
$$ ##$DBPNAM4= <>
$$ ##$DBPNAM5= <>
$$ ##$DBPNAM6= <>
$$ ##$DBPNAM7= <>
$$ ##$DBPOAL= (0..7)
$$ [...]
$$ -1 -1 -1 -1 -1 -1 -1 -1 -1 -1 -1 -1 -1 -1 -1 -1 -1 -1 -1 -1 -1 -1 -1 -1
$$ -1 -1 -1 -1 -1 -1 -1 -1 -1 -1 -1 -1 -1 -1 -1 -1
$$ ##$RG_tab8= (0..255)
$$ -1 -1 -1 -1 -1 -1 -1 -1 -1 -1 -1 -1 -1 -1 -1 -1 -1 -1 -1 -1 -1 -1 -1 -1
$$ -1 -1 -1 -1 -1 -1 -1 -1 -1 -1 -1 -1 -1 -1 -1 -1 -1 -1 -1 -1 -1 -1 -1 -1
$$ -1 -1 -1 -1 -1 -1 -1 -1 -1 -1 -1 -1 -1 -1 -1 -1 -1 -1 -1 -1 -1 -1 -1 -1
$$ -1 -1 -1 -1 -1 -1 -1 -1 -1 -1 -1 -1 -1 -1 -1 -1 -1 -1 -1 -1 -1 -1 -1 -1
$$ -1 -1 -1 -1 -1 -1 -1 -1 -1 -1 -1 -1 -1 -1 -1 -1 -1 -1 -1 -1 -1 -1 -1 -1
$$ -1 -1 -1 -1 -1 -1 -1 -1 -1 -1 -1 -1 -1 -1 -1 -1 -1 -1 -1 -1 -1 -1 -1 -1
$$ -1 -1 -1 -1 -1 -1 -1 -1 -1 -1 -1 -1 -1 -1 -1 -1 -1 -1 -1 -1 -1 -1 -1 -1
$$ -1 -1 -1 -1 -1 -1 -1 -1 -1 -1 -1 -1 -1 -1 -1 -1 -1 -1 -1 -1 -1 -1 -1 -1
$$ -1 -1 -1 -1 -1 -1 -1 -1 -1 -1 -1 -1 -1 -1 -1 -1 -1 -1 -1 -1 -1 -1 -1 -1
$$ -1 -1 -1 -1 -1 -1 -1 -1 -1 -1 -1 -1 -1 -1 -1 -1 -1 -1 -1 -1 -1 -1 -1 -1
$$ -1 -1 -1 -1 -1 -1 -1 -1 -1 -1 -1 -1 -1 -1 -1 -1
$$ ##$RG_tabA= (0..255)
$$ 1 1.1 1.3 1.4 1.6 1.8 2 2.2 2.5 2.8 3.2 3.6 4 4.5 5 5.7 6.3 7.1 8 9 10.1
$$ 11.3 12.7 14.3 16 18 20.2 22.6 25.4 28.5 32 35.9 40.3 45.3 50.8 57 64 71.8
$$ 80.6 90.5 101.6 114 128 143.7 161.3 181 203.2 228.1 256 287.4 322.5 362
$$ 406.4 456.1 512 574.7 645.1 724.1 812.7 912.3 1024 1149.4 1290.2 1448.2
$$ 1625.5 1824.6 2048 2298.8 2580.3 2896.3 3251 3649.1 4096 4597.6 5160.6
$$ 5792.6 6502 7298.2 8192 9195.2 10321.3 11585.2 13004 14596.5 16384 18390.4
$$ 20642.5 23170.5 26008 29193 32768 36780.8 41285.1 46341 -1 -1 -1 -1 -1
$$ -1 -1 -1 -1 -1 -1 -1 -1 -1 -1 -1 -1 -1 -1 -1 -1 -1 -1 -1 -1 -1 -1 -1 -1
$$ -1 -1 -1 -1 -1 -1 -1 -1 -1 -1 -1 -1 -1 -1 -1 -1 -1 -1 -1 -1 -1 -1 -1 -1
$$ -1 -1 -1 -1 -1 -1 -1 -1 -1 -1 -1 -1 -1 -1 -1 -1 -1 -1 -1 -1 -1 -1 -1 -1
$$ -1 -1 -1 -1 -1 -1 -1 -1 -1 -1 -1 -1 -1 -1 -1 -1 -1 -1 -1 -1 -1 -1 -1 -1
$$ -1 -1 -1 -1 -1 -1 -1 -1 -1 -1 -1 -1 -1 -1 -1 -1 -1 -1 -1 -1 -1 -1 -1 -1
$$ -1 -1 -1 -1 -1 -1 -1 -1 -1 -1 -1 -1 -1 -1 -1 -1 -1 -1 -1 -1 -1 -1 -1 -1
$$ -1 -1 -1 -1 -1 -1 -1 -1 -1 -1 -1 -1 -1
$$ ##$ROUT14= (0..7)
$$ 0 0 0 0 0 0 0 0
$$ ##$ROUTER= 3
$$ ##$RX22TY= <tty10>
$$ ##$RXFMAX= (0..7)
$$ -1 -1 -1 -1 -1 -1 -1 -1
$$ ##$RXFMIN= (0..7)
$$ -1 -1 -1 -1 -1 -1 -1 -1
$$ ##$RXINTLV= (0..7)
$$ 0 0 0 0 0 0 0 0
$$ ##$RXMSTY= <no>
$$ ##$SCMTY= <no>
$$ ##$SGUC1= (0..15)
$$ 0 0 0 0 0 0 0 0 0 0 0 0 0 0 0 0
$$ ##$SGUC2= (0..15)
$$ 0 0 0 0 0 0 0 0 0 0 0 0 0 0 0 0
$$ ##$SPECTR= 5
$$ ##$SY2FLAG= 0
$$ ##$TFXNUM= 0
$$ ##$TRIPLO2= 0
$$ ##$VTUTY= <tty05>
$$ ##$WBREFAM= (0..15)
$$ 100 100 100 100 100 100 100 100 100 100 100 100 100 100 100 100
$$ ##$WBREFPH= (0..15)
$$ 0 0 0 0 0 0 0 0 0 0 0 0 0 0 0 0
$$ ##$XFAC= 2
$$ ##END=
$$ 
##$DECIM=	6
##$DSPFVS=	10
##XUNITS=	HZ
##YUNITS=	ARBITRARY UNITS
##FIRSTX=	18815.304773959651357
##LASTX=	-1509.5883400837747104
##DELTAX=	-0.31013798907520295778
##XFACTOR=	1
##YFACTOR=	1.1897156914731283894
##FIRSTY=	49.90087890625
##MINY=	-392.25189208984375
##MAXY=	38983.4140625
##NPOINTS=	65536
##XYDATA=	(X++(Y..Y))
$$ [...]
9801ELm5p3k4J6M6N5J5MQJ0m0p2k0J2J3K5L0J1K4Pl3m0k7l3LM0M9Rl7m0J0K0%K0M1O0M5L5
9789A32ok7m6p7m4k2j0j2k4l5lK3K1L6O2M5L3QJJ8mJ0L1N0J1k3qk9m3m3JJK2K7K9K6%j8LJ0
9776A26j8l1l6k8l3m3n1n0m5jK5M8O8O3K2k4k3j1N1Q9P8L0j2j9l5n0m7j4J9j2n0l6Qmj6K2
9765d0N3K3j0j2kl1m3J1Jk8rK4L3L9J7rJ9L5Rk2j4NJ4J4J1J9k3m4j3L6J7j1l9j5k7k7rk2K6
9753d4M1l4o0l7%L4Mj5J3L8K2RK1M5L4nm2n3l8jM0L0L6mj9J1Km3l4J8K2%k1n6l6K8L7L1K9
9741CK1J8k0mJ9j%Nk3qK4L5M5J0l5j2lpk9n2l8m7l6L6O2O8O1j2q8n6k3ppj7k2n9nO8R6N3L1
9728D4K9j5m6j8lJ4J4J8LPK3J1j2n4o8k7okJ8L6J1lm1m5K3K6K8K4j3k8k7RL2oj4j0l7k1M0
9716h6Q5N0j2k3K6L5J0orrk3LrJ0J7J3K8J8l5n1j2J9K0j1m4J3J7m4m5jL2J8K9K8Oj4prJj3
$$ y = [5, 8, -37, -110, -134, -118, -72, -17, -2, 2, 10, 20, -20, -92, -112, -100, -87, -62, -32, -21, 3, 10, -23, -63, -90, -123, -120, -80, -31, -22, -59, -99, -89, -69, -69, -49, -8, 52, 97, 132, 126, 99, 53, -24, -68, -90, -100, -112, -136, -171, -174, -151, -130, -94, -32, 13, 46, 54, 55, 73, 69, 79, 110, 160, 171, 148, 140, 111, 68, 25, 26, 27, 49, 76, 105, 131, 131, 113, 116, 126, 108, 77, 41, 13, -20, -63, -114, -164, -209, -210, -185, -137, -69, -6, 16, -8, -31, -42, 9, 98, 176, 206, 194, 175, 140, 90, 43, 29, 48, 36, -14, -50, -42, -46, -62, -40, 13, 36, 26, 14, 12, -19, -62, -51, -50, -78, -87, -63, -30, 9, 26, 17, 36, 71, 80, 58, 44, 49, 63, 77, 88, 107, 84, 40, 27, 63, 80, 69, 30, 15, -12, -39, -48, -70, -44, -3, -37, -97, -134, -134, -100, -96, -111, -98, -60, -38, -29, -8, 37, 71, 66, 24, -29, -67, -68, -28, 2, 38, 34, 15, 26, 28, -15, -49, -31, -9, -9, -30, -86, -122, -94, -57, -26, 3, 24, 42, 22, 18, 37, 36, 36, 41, 18, 10, 34, 69, 114, 124, 89, 77, 74, 67, 38, -14, -52, -99, -135, -99, -37, 31, 92, 80, -8, -64, -87, -94, -101, -118, -140, -199, -204, -136, -40, 13, 44, 73, 58, 12, -6, -9, 5, 19, 37, 40, 47, 70, 81, 69, 15, -53, -80, -86, -88, -70, -34, -23, -26, -67, -112, -89, -63, -35, -11, -24, -52, -79, -70, -38, -44, -58, -68, -105, -126, -86, -1, 49, 37, 14, 40, 75, 85, 79, 70, 61, 38, 41, 32, 42, 59, 72, 100, 118, 83, 32, 20, 39, 59, 48, 4, 17, 34, -10, -55, -56, -24, -6, 23, 51, 57, 43, 36, 27, 28, 15]
9704A5K3M7J6j8l2l7m0qK6%qK4M6L1j5l3l9l6oM2O1Pl5ql2m5j1J0N9N0K0%k6n1j7L8K2j6k4
9692@nJ2J7Kj1RJ6%l2m3J9M1M5L6Nl0p6p5l5K5N9N1Qk3l7o0k4K8K0lj1l7pK3L2N7L6N%pk7
9679Cj4J5jl0pL0L8K4JJ9K1l0m3jK9K9K3m6m7j8m9m6K6J19R6Kj8PJ0k2j5J1j5o2m9jj7%J8
9667a0M6J8k8n2l2MK8J4n%l7k9KJ0J8K6J7MM3M0k6k6J9K9Rj8qJ2Kj4KJOK0ok4m7l7j7j7l3
9654i6l3j3PJ9M8N6J2j3J8L4L5L7J9J5pl0j3Jk9m8j6rl2l3OMLK0L5L0J9jj2jL7N5J8j5n7p3
9642cq3n6J6O1N2M5K8RJ4J5n2m0L4K4Qk7k4jJ2K4j2QL3K0K8J0k7j8qj3%qMj1j7j9m2n1m5o
9629a18jokoJ6M2K4L4J3j8J6N2J2j8k8k8J1J9nj4j1N0P3L0MKQJ2J3Kk4NK3k6n3j4J3k1j1q
9617F2j6M9N0k8mJq3o5lK8M2M0Jj9Jpj8j8on9p2k3K4M0M9N4Rj1l8n7m0J6L3K6J3J3Mj3LJ5
$$ y = [15, 38, 85, 101, 83, 51, 14, -26, -34, -8, -8, -16, 8, 54, 85, 70, 37, -2, -38, -44, -2, 59, 66, 31, 23, -9, -54, -65, -55, 4, 54, 74, 74, 48, -3, -20, 18, 40, 24, 0, -5, 7, 24, 26, 15, 24, 40, 40, 8, -35, -16, 25, 70, 106, 111, 81, 5, -70, -105, -80, -21, 30, 38, 15, -22, -82, -106, -78, -58, -61, -72, -109, -116, -93, -61, -4, 32, 37, 37, 30, 3, -11, 4, 3, -27, -34, -4, 34, 58, 59, 78, 99, 69, 26, 25, 54, 83, 106, 60, 13, -5, -54, -100, -74, 45, 141, 143, 125, 132, 142, 120, 105, 116, 101, 39, -10, -11, -28, -28, -10, 36, 54, 26, -26, -58, -54, -26, -12, -17, -17, -54, -83, -81, -71, -53, -27, -10, -6, 37, 77, 51, 25, 44, 73, 82, 64, 56, 68, 70, 56, 58, 59, 65, 85, 79, 55, 8, -29, -46, -63, -96, -129, -142, -135, -116, -68, -12, 0, -13, 5, 39, 74, 111, 130, 145, 138, 108, 95, 96, 67, 19, 3, -6, -38, -71, -65, -61, -58, -38, -3, 27, 46, 45, 33, 32, 69, 124, 142, 127, 70, -3, -86, -142, -126, -65, -13, 32, 60, 69, 83, 98, 46, 6, 40, 64, 72, 45, 21, 20, 32, 56, 44, 52, 85, 105, 133, 143, 116, 98, 90, 77, 77, 69, 73, 62, 45, 26, -16, -67, -112, -118, -119, -125, -127, -133, -117, -75, -51, -17, -4, -22, -6, 46, 58, 40, 12, -16, -5, 14, 9, -5, -16, 34, 107, 137, 141, 143, 151, 163, 176, 178, 154, 159, 182, 156, 103, 89, 102, 81, 70, 62, 46, 95, 145, 117, 113, 114, 31, -34, -37, -9, 33, 73, 74, 55, 56, 49, 31, 13, 7, -52, -124, -147, -123, -83, -34, 20, 29, 18, -20, -77, -117, -101, -68, -42, -29, -16, -12, -25, -22, -7]
9605gL1M3J1rjMk9m8jN6L9l6l3K7K5poroJ4mn1j5O4M9M9K2m5p5n2k4m0l6k0K1M4L5K4j0l0
9592c6m9n9k2K0L9J1oMnJ6J8k9m5oL1K5QLMK2M6Jl8l0m5m2N9J01P0j7o3m4j0K2M0L6L3J7l6
9580D4l1L6N7Mn8m7j1k1l0k6mJ3rrk1m1k2j7%J0K5J0%mqJ8K2LK4N1O0J3pj9lJ2J4K5Kl8j5
9567Bmoj1l1n1l3J6K3J2J2K4J9K3L1L4J7j5Oqk2j8JJ4rpjMOJ6N1M3l6q0j9N9K8j6rj5KK0J8
9554I0K2Pl4l7j0K0J6K6J5l4j6K5M5Ln4r3m9K6K8lJK8K1jKJ%kk5J5J7l4k5k1oRQk3L3R7O0
9542A48Rk2l7j5L8M0k1m9oj9n7k2J1L0M0K3k0k2j1l0n1l5j1J9N4N0M0J0l1j8kNrj9LK2kpJ7
9529D3rm2j4OJ0N0P4M0J6j0l4l7NJ9Jj1j4j8j4om4l8l8n3j0L0L5qJ2K5K3L8K1k2k4j7Oj6k1
9517d6nJ0Lo%L0J2j6m2l0M0O4%k9j3k1k3j2J2J7K0J0j8k9K4Q3O4Mo0m5J2J3k4m6NL6P3K4j1
$$ y = [-7, 24, 67, 78, 69, 68, 72, 43, -5, -6, 50, 89, 53, 20, 47, 72, 65, 59, 50, 44, 58, 54, 3, -12, 52, 101, 150, 172, 127, 52, 0, -24, -64, -100, -120, -99, -55, -20, 4, -6, -36, -85, -144, -166, -146, -107, -96, -102, -98, -103, -87, -69, -98, -143, -149, -118, -93, -85, -82, -78, -56, -10, -9, -47, -77, -122, -164, -105, -4, 66, 49, -14, -58, -68, -46, -6, 30, 63, 80, 44, 13, 49, 106, 110, 52, 5, -6, -27, -57, -83, -87, -74, -83, -92, -113, -154, -176, -193, -193, -183, -158, -148, -148, -152, -160, -142, -120, -117, -93, -42, 18, 31, 24, 5, 2, 14, 28, 53, 55, 17, 2, -2, -8, -19, -50, -101, -134, -118, -95, -83, -71, -47, -28, -5, 26, 60, 77, 62, 68, 60, 38, 20, 21, 35, 26, 19, 18, 22, 28, 44, 95, 138, 102, 22, 3, 62, 90, 74, 65, 50, 52, 72, 90, 112, 119, 85, 48, 38, 58, 74, 100, 115, 81, 65, 90, 135, 138, 84, -9, -58, -32, -4, -7, -6, 22, 43, 42, 44, 45, 45, 43, 18, 33, 50, 16, -9, -30, -36, -27, -19, -42, -9, 88, 148, 157, 135, 98, 83, 121, 161, 140, 91, 85, 66, 9, -13, -2, 28, 68, 91, 71, 49, 38, 8, -43, -78, -89, -70, -16, 34, 74, 84, 53, 35, 33, 38, 29, 10, 13, 35, 33, 26, 43, 34, -8, -22, -16, -6, 44, 118, 158, 174, 164, 130, 93, 98, 117, 118, 107, 93, 75, 61, 55, 11, -27, -65, -118, -128, -98, -63, -71, -59, -34, -11, 27, 48, 26, 2, -15, -9, -25, -46, -51, -41, -38, -44, -44, -14, -2, -18, -60, -90, -50, 14, 14, -15, -28, -49, -72, -84, -72, -55, -35, -25, -43, -72, -48, 35, 99, 103, 43, -2, 10, 23, -1, -47, -42, -6, 67, 91, 80]
9505H0M2M9lrK2%k6lql5l8l6l6rlnL1M4Oo0m7RK2J2Ooj3N4O5K3k2m2k6m1o1l0QJ0K8M4Ml6
9492c6l3kMk1j7L4O8K4l0k8k9m1n2l6k7pL9O0O1O1K2k2lrkpONj1Q%j9L9L7OJ8K1m4q4m2j5
9480a04J3L9K2j0J5L9j0l1PK1N0N9M7K2j4m7l6j9nK3K7J0%l7n1k8pOL3J6NQm3o2NM7Oj0j2
9467fk9l0k0%L1L4J9K6L9Pk2m2k1qJ3M6L1MJ3Rk4l4mK8P2M7m1m6l1m0m9j8kPL7M0L5O4J39
9455B74K41M03K41k97m24k35r6n9l7l2o3j0J0RK3J4J4J3nRO2O1K3k7q1n1QK4J2Ll5k3Pj0n
9444c9nrk6k2OL0M7L8Qm4l9mpJ3L4K8Kj4L1M9%m0pJ7Mj8o9m5K6M2M6O3L6jjl1o0j8M8M2Ok9
9431H8m3j8oqj8l0k2K1M6Jm6m0PL1J2jMk9l9j1J0M0L3J6k9l6j9JKML5J3m1nL1pNL7j8n8k2
9419a09L2M2Ml2nQmK8K3J3J1nl1l6k0j8KJ8lk6k1J0J6L9O0N4J5Jkj8l2l8m4k1j7k9l0j9j6
$$ y = [80, 122, 171, 168, 159, 181, 181, 155, 152, 144, 109, 71, 35, -1, -10, -13, -18, 13, 57, 63, 3, -44, -35, -13, -1, 5, -1, -14, 40, 105, 128, 106, 64, 38, -3, -64, -94, -86, -76, -48, -4, 0, -36, -69, -71, -67, -88, -105, -71, -3, 21, -9, -37, -66, -107, -159, -195, -222, -229, -190, -130, -69, -8, 14, -8, -11, -20, -22, -29, -23, -18, -29, -21, -21, -40, -1, 36, 42, 60, 81, 37, -47, -89, -104, -91, -52, -30, -40, -25, 14, 4, -27, -20, 1, 51, 110, 157, 179, 165, 118, 82, 63, 58, 81, 108, 118, 118, 81, 30, 2, -5, 1, 34, 50, 55, 63, 20, -42, -37, 10, 16, 6, -6, -35, -65, -85, -85, -54, -20, -1, 25, 64, 71, 49, 7, -14, -22, -9, 37, 68, 72, 85, 94, 70, 36, 32, 60, 132, 179, 138, 92, 61, 21, -28, -46, -48, -41, -4, 36, 71, 135, 274, 515, 918, 1159, 862, 438, 203, 107, 48, 11, -21, -84, -94, -84, -75, -52, -38, -24, -11, -16, -7, 55, 116, 139, 112, 31, -20, -12, 12, 24, 27, -8, -31, -24, -34, -39, -44, -53, -79, -101, -95, -65, -18, 20, 28, -16, -55, -59, -66, -53, -19, 9, 11, -3, 28, 77, 77, 37, 30, 47, 51, 33, -36, -81, -55, -13, 33, 96, 132, 131, 130, 99, 39, 21, 69, 111, 117, 88, 45, 27, 21, 13, -5, -35, -57, -36, 10, 11, -35, -75, -68, -37, -25, -26, -22, -51, -90, -101, -91, -51, -18, -2, -31, -67, -86, -85, -83, -79, -44, -31, -72, -77, -46, -53, -48, -11, -29, -87, -109, -77, -35, -31, -63, -68, -60, -64, -36, -13, 0, 11, 6, -25, -61, -81, -99, -97, -79, -82, -108, -129, -119, -103, -64, -4, 50, 65, 66, 64, 46, 14, -24, -68, -89, -106, -135, -165, -184, -200]
9407b00l3qj2LO1N4M3k8q6n1rN1Q4M7MOK7N4J3j3Ol6o8qM2J8k0k5k8J8N8Mk3L0M0Jl0rJ6%
9394gj6j2j2l9p4j7O8O7J4k6k4k6k0J7L1J8J4jl5k6%J5jjJ3K7J7L4N0j3n5l7pJ2K9K8L0K3
9382E8K6j9m6nPk4k2J5K2Lm0l1MJ7K1K5M1M4J0K2Mk9KL2L1J9J8pj7l6l6m3o5m3k4%K5ROnm9
9370h0m0jL0J2J7N8M3qk4j1K5Oo6o5J3Q0Q8Om1m2k3j%j2k0k4k0j6L5J0m1k1N1N4J7L3K7Jm8
9358Bl2j1k7l3m2n3l6L5M8M4J7jj3QM1J9k2j2J0K0%L6Mo6q3n3%O3P7M1M7J2m5o3j4K4pkm9
9346a16p4K3M6RK3N7M4N2L2NL2K0k4n5q2j00n3L8Q4K2m6l7k4j8K1N3L7RmQJl3m2j5J9K9L0
9334b9K1K7M7J9k6m1p3p3j5O0P0K8M4QK3J8k8j7j9k4l1n0k7J4Nl1PJ7K5L5L3L9km5j9J1K2
9323B3j0j5MKJ0J0J6L0J6l5k7pn0PK5j8j4%Ook8oK9K8o%K0Rm9r2m3M1O7L3rJ8J4k1j0j1o2
$$ y = [-200, -233, -241, -253, -250, -189, -135, -92, -120, -206, -257, -266, -215, -131, -84, -80, -74, -47, 7, 20, 7, 13, -23, -91, -99, -57, -39, -59, -84, -112, -94, -36, -32, -55, -25, 15, 16, -14, -23, -7, -7, -23, -35, -47, -86, -160, -177, -109, -42, -28, -54, -78, -104, -124, -107, -76, -58, -44, -45, -80, -106, -106, -91, -92, -93, -80, -53, -36, -2, 48, 35, -20, -57, -64, -52, -23, 5, 35, 58, 84, 65, 19, 14, 21, -3, -25, -10, 12, 15, -25, -56, -52, -35, -14, 11, 52, 96, 106, 128, 132, 103, 105, 137, 168, 187, 205, 198, 181, 145, 109, 66, 1, -42, -66, -66, -41, -32, -26, -31, -80, -120, -121, -91, -79, -62, -4, 39, 31, 7, -4, 21, 27, -39, -104, -91, -11, 77, 83, 42, 0, -23, -24, -24, -36, -56, -80, -100, -116, -81, -71, -112, -133, -82, -28, -11, 22, 49, 50, 2, -30, -41, -68, -101, -143, -196, -232, -197, -149, -105, -88, -89, -102, -94, -53, -34, -56, -68, -58, -38, -38, -2, 2, -64, -147, -200, -200, -137, -60, -19, 28, 40, -5, -68, -82, -58, -65, -67, -116, -190, -167, -121, -112, -89, -32, 12, 64, 96, 101, 133, 153, 129, 74, -8, -108, -161, -123, -39, -17, -63, -100, -124, -142, -121, -68, -31, -22, -26, -18, -17, -50, -92, -107, -88, -59, -29, -8, 19, 66, 85, 59, 18, -55, -128, -143, -83, -13, 15, 59, 67, 90, 108, 80, 63, 44, 20, -11, -61, -88, -74, -69, -100, -93, -76, -51, -16, 17, 56, 54, 9, -10, 1, 23, 13, -2, 2, 4, 14, 24, 40, 70, 86, 51, 24, 17, -33, -26, -1, -19, -33, -33, -27, -33, -61, -67, -38, -10, -16, -16, 4, 13, -36, -128, -171, -130, -63, -30, -39, -21, -7, -28, -38, -49, -111]
9310a11m9K6M6K9J5QJ8L6M1Pm8o1j5QpK3M3P5P6J4l9n8o6k4K5M0M5N0J3j1k1k7j8j4J9K4k4
9298H8m4m5j8J8N7N0k9o3k5nkkJ3Kk2j7lPl0o1m6j8LM4K0L1M3po9m3N2O5J9J1J5k7n6oR4J10
9286A04L8m9o8n8l8NN8N1Nm6m9jJ1JL6M4M2L0oo0n4j4l3k4J4L6Kk6nRk4m5j8kO1Q5L9k1l5
9274eJ8j0l0j3J9K5J0Oj0m1k9k2j4KK0Qj7NK4L0K9J5j1rj1l1n3j1L0M4J0J6K1k1j7m7o5l9
9262a74nL0O1O0L6J4j9mMl8j9jKJ2J6K0J0k6l2j7JK0k0m9l1rJ4kLM0M4J9pl5n5OL8LQL6N2
9249FL5J0j4k4m1j5K0K5L9N0J5k5l3oJ5M4K4j9k9LQoJ0Oj3k7l6OM2j2n1k6j5k2n6m3QK4L4
9237h9M3rJ0K1o%ol7oK5L1k4nN0J2mKJ4oj6J3L5OMk9j9k4j5oPL5J7m6o9k0OL6Mm5OJ8KK6l
9224f1nL2J2J8M2K8mK6J8m9j7J3jL4K5j7mJ5J6Qj4l1l5j3j8rkPK4K8K4J2ql0l3rn0n6J0M4
$$ y = [-111, -160, -134, -88, -59, -44, -36, -18, 18, 59, 66, 18, -43, -58, -50, -57, -34, 9, 84, 160, 174, 135, 77, 11, -13, 12, 52, 97, 147, 160, 149, 128, 101, 83, 69, 88, 112, 88, 44, -1, -19, -1, 56, 106, 77, 14, -11, -16, -18, -20, -7, -5, -27, -44, -47, -40, -70, -131, -177, -195, -192, -148, -128, -97, -54, -61, -130, -173, -121, -56, -37, -26, -11, -38, -94, -100, -6, 104, 142, 93, 25, -33, -71, -66, -8, 43, 48, 2, -47, -48, -37, -36, 0, 44, 86, 116, 110, 50, -4, -18, -51, -75, -61, -25, -23, -49, -54, -45, -69, -114, -132, -134, -73, 12, 51, 30, -5, 13, 3, -27, -40, -21, 4, 14, 20, 10, -31, -60, -82, -96, -94, -74, -66, -83, -78, -54, -24, 5, 20, 9, 0, -11, -42, -95, -106, -76, -32, -22, -6, 15, -6, -23, -70, -135, -174, -179, -149, -88, -28, 8, 22, 3, -1, 3, -35, -54, -55, -53, -41, -25, -5, 5, -21, -53, -70, -69, -49, -69, -118, -149, -158, -144, -146, -143, -103, -59, -40, -47, -82, -137, -131, -93, -90, -82, -46, 6, 41, 51, 37, 13, -28, -43, -23, 2, 41, 91, 106, 81, 48, 42, 57, 101, 125, 106, 77, 80, 88, 82, 92, 98, 85, 58, 22, 28, 70, 58, 7, -19, -34, -56, -112, -155, -147, -123, -89, -46, -55, -45, -24, -30, -30, -36, -73, -79, -54, -23, -47, -52, -2, 10, 6, 8, 22, 16, 0, 13, 48, 54, 58, 29, 10, -14, -29, -35, -28, 7, 24, -22, -91, -111, -105, -69, -65, -110, -104, -86, -84, -58, -61, -66, -34, -22, -4, 38, 66, 62, 88, 106, 57, 40, 53, 52, 86, 111, 94, 90, 105, 121, 129, 115, 84, 49, 36, 18, 9, 7, 14, 38, 66, 90, 102, 94, 64, 31, 22, -28, -84, -74, -30]
9211c0L5K2j6l7L8R8L2l9k5j7ork7J2K7j9p1p0JR5Q3lj2J2j3k4L0K1kK5L8nk%j9l7k9Nk4j9
9199A9j6j6k4MK2Jl5n2KM0QqJ2K5L8J1j0l5n0j1M3O7J1K0J2o0p1j1K2M9P2N8J0k2k7j0j7k3
9187D8rK3L9K7nl7m7m8k8k3jK3M0L4Rj4m5l9oj8k9j6K3L9N3M5Rl9k5j3n1rM6K3K9M0K9Qj9
9175F6l1m1pJ2qk3j1kj7l6l6K1K7J0N0M9L%m0n9l2J1Rl2k1J6K4M4O6M8Ml3m6qK1j1rJ2L0N7
9163G7N9L8QPK2J0l0m8o3l6KJ9L0L5l6p7o7m3oL4Ok1J4M8L9j9n1j9Jk1p9m6M2J19J13M9J6
9151A26k3m2m6qJ0pm4m5J9M2k2j6K1J9K4k9n4m4kL0j7j2L7K0KJKkl6pK7pLM9N4L0J6K2JnJ1
9138I8k4j5kk7KK6K2K4l0n5pK5joOj8n7o5J8M2J2K1j5m2l8NRML3N6P3M2Oj5rOl5m8j1K6L4
9126G0Jl1o4l0K0J7Q%j8OLj5k3o0n1J9O0M7K5L4N5M4j0p0n6J0Ok5l3j9K9L5L0K4J8Qnj5lK0
$$ y = [-30, 5, 27, 11, -26, 12, 110, 142, 103, 78, 61, 55, 46, 19, 31, 58, 39, -32, -102, -101, -6, 77, 74, 62, 74, 61, 37, 67, 88, 86, 111, 149, 144, 142, 142, 123, 86, 57, 62, 38, 19, 3, -13, -37, -33, -11, -10, -45, -97, -95, -55, -47, -55, -43, -18, 20, 31, 21, -14, -64, -75, -32, 35, 46, 66, 78, 18, -53, -64, -42, 7, 79, 137, 147, 125, 98, 88, 71, 48, 39, 62, 101, 128, 123, 86, 39, -9, -37, -60, -61, -38, 2, 36, 45, 31, -14, -53, -59, -77, -106, -122, -99, -60, -7, 38, 47, 8, -17, -30, -81, -90, -44, -21, 8, 48, 77, 85, 66, 35, -6, -13, -1, -9, -32, -43, -45, -62, -98, -134, -113, -86, -76, -26, 23, 26, 26, -14, -73, -105, -94, -85, -117, -138, -122, -98, -54, 12, 60, 64, 31, -15, -23, -2, -13, -22, -10, 20, 77, 136, 174, 182, 189, 211, 221, 191, 143, 80, 44, 46, 65, 95, 130, 94, 17, -50, -93, -99, -65, -59, -80, -66, -18, 21, 2, -49, -68, -67, -88, -167, -213, -171, -52, 61, 110, 126, 103, 61, 15, 7, 17, 10, -34, -79, -60, -18, -40, -56, -35, -16, 8, -21, -75, -119, -121, -91, -108, -120, -83, -63, -61, -60, -58, -60, -96, -103, -76, -83, -80, -31, 23, 53, 69, 91, 92, 87, 98, 74, 59, 57, 30, 32, 58, 80, 104, 74, 19, 12, 37, 36, 30, 36, 18, -39, -104, -86, -44, -32, -11, -26, -68, -106, -101, -92, -88, -55, 1, 74, 116, 122, 107, 98, 104, 69, 21, 10, 36, 70, 71, 40, -24, -54, -34, -17, -9, -9, -27, -21, -18, -33, -56, -116, -167, -148, -88, -41, -16, 18, 73, 117, 107, 37, -19, -9, -3, -28, -61, -80, -51, -16, 14, 38, 56, 64, 59, 44, 41, 61]
9113F1L1L9Rk0m8o4m7j3nK7M1J6j2NO4N5k4m1j8j3rK0j0l2MK4%p5r5j2jJK1M2M4LnRj6m8k5
9101a17J6j4l9j5K2L5N5N6Rl3LL5Rj9K0K3OJrj3%j2RJ1J7J9RJ6L6J5j0j5k8m3m0j3Qj0j6k3
9088c9k3j0K8L4Kk4j9RRJ0J0j4L5P1j3q2n1J2J5j2POk8j8Mj1lJ5j6m2l7K2L5j1MJ1l1k1K3
9076a43K8J6K7LrML6L4L3N6Q3M6J5k9q2r1l8K1M5L3QQJ9Qnj6o0m8RJ0J2J4Mj5k0m7l7%J9K6
9064b3K6oj9nj5k2l0k2j1PMKM8L7Nj7m3l8k2J3M1j1j1L6K9J7K0L0L8J8Lk0K0L0nj4k7o6p9
9052h2k0O7M1j3j9l8k3k0k1K3J2kN3M5Jj4J4O3O2J8l4o2m3j9j8oM6M2J1J0J5NJ8Qk5o0n0l
9040a8J3K6L7nl5mJ0L1J8nrnLj5k5LN2O2kk4RjjL0J8nqk3n5j7K5J3l3m0J3Q1N9J5J4ml7n7
9027A04m7Mnk2J7K3Jk4l0k3J7N2O9k1j05r7p4%O3L9J7KJ4Nk5nNL4M6K5K6L7M0J3n3k1L9k1
$$ y = [61, 92, 131, 140, 120, 72, 8, -39, -52, -57, -30, 11, 27, 15, 20, 84, 139, 115, 74, 56, 43, 34, 54, 44, 12, 16, 40, 40, -35, -130, -142, -143, -142, -121, -79, -35, -32, -37, -28, -44, -92, -117, -101, -115, -154, -169, -147, -112, -57, -1, 8, -25, -22, 13, 22, 3, 23, 46, 52, 53, 44, 31, 31, 19, 28, 39, 56, 75, 84, 100, 136, 151, 141, 126, 98, 55, 15, 2, 10, 0, -16, -39, -62, -72, -44, -10, -8, -32, -51, -42, -33, -23, -13, -27, 8, 79, 66, -16, -67, -55, -40, -52, -45, -39, -67, -85, -81, -92, -95, -80, -96, -138, -175, -153, -118, -129, -125, -114, -145, -166, -143, -115, -99, -72, -69, -78, -74, -38, -4, 29, 85, 168, 214, 229, 200, 118, 27, -11, 10, 55, 88, 96, 104, 123, 131, 126, 110, 50, 2, 11, 21, 33, 47, 51, 36, 16, -31, -68, -68, -49, -23, 3, -3, -22, -27, -42, -64, -94, -116, -127, -120, -116, -114, -66, -29, -24, -41, -84, -122, -144, -131, -90, -101, -112, -76, -47, -30, -10, 20, 58, 76, 79, 59, 79, 109, 104, 90, 63, -3, -82, -102, -35, 6, -7, -26, -64, -87, -107, -128, -105, -93, -95, -42, 3, 4, -10, 4, 67, 129, 147, 113, 51, 8, -11, -29, -35, 11, 53, 64, 74, 89, 94, 112, 120, 95, 35, -15, -18, -5, 21, 58, 53, 18, 14, 24, 55, 73, 68, 59, 54, 57, 42, 17, 20, 72, 134, 132, 108, 117, 116, 115, 145, 163, 158, 150, 127, 72, 55, 80, 93, 60, 20, 33, 114, 173, 188, 202, 198, 161, 104, 57, 61, 56, 34, 51, 74, 75, 51, 21, -2, 15, 67, 136, 115, 10, -87, -161, -161, -98, -59, -42, -40, -26, -21, -46, -51, -46, -12, 34, 59, 85, 122, 162, 175, 122, 101, 140, 119]
9015A19n2l0mOj3m6l7J3L1rk9NJ3nj8l0PO0O4M0J7Lk5k3kok9LL7L8N7K6k0jkm8p5m2%k3l3
9002f3lJ7k1jM3J1j7MNNL7N5L0lm0k2K4L4J5k1k6%j1l7k7m4j6J7M1L6K6L4K5j3m1l5j5pL9
8990C5K6k3n2j8M9N2K9K6J3k7l2J8N3K1m6m8l0k0PJ3Kj8oO%rj2j6OK7lk1lJ3j3k8j6J1Ok4
8978e2J4P6M6k2k1j3n7m3pk0m4m7PL5L1PJ1N7M5lLL2N5L5K0ln9o0kPQj5l8j7M2M7Ol3m5mM3
8965B2Pk1k1j0j6l2l0j6J3O1P1Nn4o2j0K8K0K1J9p%k7n8n8k4M2N5L9L8M5J5m1n4j3J5k0l6
8954i4l1mK5M7K9L1N2M3po0o2l9j0qk4j4j1J7M9K8JK6J6j7j0L8M5K1J7K7J7oJ8J5k3rj0n9
8942F4n3kJ8K0QJ9K6nj3J5J4K1Km5m8J0O0K7k8k7j3J1L0J6j0n4r4p6nM7O0J7qM2K4n%Kkj8
8929D7kk0j4J9Ol1l7Mk3p8k3K5J6J8M0Oj4m1k7rjK3O0K5j5j9j9k9k5j1K8M6k1n0k9j3N1L5
$$ y = [119, 67, 37, 33, 39, 26, -20, -57, -44, -13, -22, -51, -46, -33, -38, -56, -86, -79, -19, 45, 85, 102, 105, 80, 57, 55, 49, 20, 23, 60, 98, 155, 181, 161, 160, 158, 110, 35, -7, -7, -30, -63, -66, -49, -70, -71, -28, -17, -34, -30, -25, -20, 17, 72, 102, 99, 59, 37, 61, 95, 110, 89, 63, 63, 52, 15, -12, -56, -72, -55, -14, 22, 48, 82, 107, 94, 53, 18, 3, -4, 35, 61, 38, -14, -32, 17, 69, 98, 124, 137, 110, 78, 96, 149, 170, 124, 76, 46, 26, 33, 46, 48, 30, 24, 30, 30, 21, 9, -7, -1, 26, 23, 2, -1, 12, -1, -29, -45, -34, -28, -52, -38, 38, 84, 62, 41, 28, -29, -72, -79, -99, -143, -190, -183, -148, -117, -110, -99, -42, 3, 0, 3, 35, 90, 125, 145, 142, 83, 23, 21, 28, 36, 21, -17, -34, 8, 55, 61, 28, -17, -21, 22, 29, 8, -13, -23, -39, -71, -101, -117, -104, -43, 28, 33, -21, -83, -93, -65, -45, -24, -5, -12, -12, -39, -97, -155, -179, -137, -82, -43, -5, 40, 55, 14, -40, -53, -38, -58, -94, -125, -129, -104, -57, -28, 3, 55, 98, 91, 31, -31, -70, -80, -88, -112, -126, -137, -120, -71, -43, -42, -16, 0, -17, -27, 11, 56, 77, 94, 121, 138, 132, 150, 165, 142, 133, 123, 64, 11, 9, 27, 47, 55, 74, 100, 95, 82, 97, 111, 132, 134, 89, 41, 51, 111, 138, 110, 83, 70, 81, 111, 127, 117, 63, -31, -107, -112, -65, -5, 12, 4, 46, 70, 65, 65, 67, 65, 47, 45, 25, 11, 30, 36, 5, -32, -28, -51, -129, -152, -127, -111, -93, -53, -47, -61, -102, -129, -138, -139, -116, -56, -31, -46, -65, -84, -113, -138, -149, -121, -75, -96, -146, -175, -188, -137, -102]
8918a02rk8m4J4N4M3M5J3j6Lom5k7OQPM0M8kJ5K5NK5J6K6OrJ7J1ok9k7m8n8PJ6rl2qpNO0L7
8904D0j4k2QL5M2J1k8m8j6j2k3j8M1Q5K5l5j0J0mmm6n2%J6jl0n3l9J9O2O3J8K0mj5J1j9l3
8892b0qj3j5k3qNL3K2k2nK3K3mj2J4L1K4L1Rl2n8k2J1K7rl3k1mK5Ok6l1j9j5rL4L0M1M0Ok6
8880@o7l0L4O3L9no1n0j4J5N8O6N0J3j4kJ9L6Po6m3j6oMK2K6lk5nj2j3OJ3PkOl6k5K0L5K2
8867F6j4LNKJ4Kj4j1K1K6J3nk5m9o1m2n3m3K3N6P1N9j2l1k5m1o0j7K4J1QJON9R3M0NqjL1M1
8854A68J1j3m7p7r8p2l6%L7L0K5O1P3K9j4j4K2M3J1j5j1j7mJ0K2Mm4m4j5j8j5Nj9l2o7k6L2
8843a15K4K2K7J5J1RRQjJ4J4J8J9L9Pl0m3k9J7MLJ5j0k3Ml2o0m7j9MK9M8K0j4rk0m4kM9M6
8830b3M0J6k0l6j5JN3O6ll4j6K0Om6k4J1J4N2Q1L8j1j3LJ2Lk7l3k0J9M2%m2q7m3L3Okj4j2
$$ y = [-102, -111, -139, -183, -169, -115, -72, -27, -14, -30, -27, -33, -78, -105, -99, -91, -84, -44, 4, 2, 17, 42, 47, 72, 88, 114, 120, 111, 128, 139, 133, 104, 77, 29, -29, -22, -6, -15, -47, -55, -62, -57, 3, 40, 26, 4, 12, 47, 89, 100, 72, 24, 8, -4, -27, -45, -4, 81, 106, 71, 61, 71, 67, 63, 17, -35, -35, -19, -20, -50, -103, -142, -123, -61, 2, 20, 40, 36, 21, 32, 13, -20, -28, -41, -56, -79, -87, -82, -49, -27, -49, -54, -31, -8, -12, -24, -10, 21, 45, 76, 85, 53, -5, -27, -16, 11, 2, -31, -52, -56, -31, -25, -51, -82, -101, -116, -125, -91, -61, -20, 20, 26, 0, -67, -97, -63, 0, 39, 34, -27, -77, -91, -76, -18, 48, 98, 111, 97, 95, 114, 150, 157, 91, 48, 32, 26, 30, 52, 78, 75, 50, 45, 33, 20, 26, 39, 46, 44, 50, 14, -11, 9, 44, 66, 52, 55, 60, 62, 76, 78, 64, 53, 74, 100, 113, 108, 83, 34, -27, -69, -122, -165, -142, -86, -15, 44, 32, 1, -24, -65, -125, -142, -118, -107, -99, -98, -92, -33, 60, 100, 105, 97, 96, 127, 168, 179, 166, 119, 42, -56, -128, -164, -164, -127, -97, -72, -11, 62, 91, 77, 63, 85, 128, 139, 124, 113, 96, 92, 102, 124, 128, 84, 40, 25, 7, -8, -3, -22, -54, -121, -147, -115, -91, -69, -42, -27, -16, -7, 2, 10, 9, 23, 37, 55, 74, 113, 120, 90, 47, 18, 35, 39, 42, 57, 47, 24, 28, -4, -64, -111, -130, -126, -97, -49, -29, -43, -52, -72, -116, -118, -69, -23, 17, 33, 13, -23, -38, -37, 16, 82, 79, 45, 29, 49, 55, 9, -15, -4, 10, 62, 143, 181, 170, 157, 160, 172, 175, 148, 115, 95, 114, 156, 156, 114, 27, -16, 17, 23, 21, 7, -5]
8818eJ4M8M3om1n9l7K0L4J1KJ5K4j5n5pJ3k7rj1j7j5k2m4o8n1K0M6P9P0Jn3p9k6L7O7M3M8
8807a2N9M0K0l1n9j6j7k1JoJ9J8OJ9K7M1K1n7j0M8J5rn0o8k7Nj3kK6M5J5kJ5K9pk8J8L5pm9
8794C1m4%K7K7j2l7j5J5L4J7j0mK6%mJ6j7KJ4j9pj3l5j5J7N8N9jp7r7p7JP2M2L1N8K7k5J7
8782H2K9j0lqj4j7k4j8rK5K2OJ8J7m8q6m4K6O6K7QN2M7l9o7l8NJ6l6n3k7MO8N1J9K8jl8J4
8770E0N0J2j3k6l4m7k0K7N0K3oK5L6qj9qj8J3J5om6r5n7ql4n1k4L1K4J3O3O3Km3k9j5lK2L0
8758f1J2mNj3m2m1nJ0j5l0k3L0O0jm2l2lK6K2M0L5J9J8ll3k6nOK0J6JJ1JNJ3mK1L3L3K0pj5
8745E2k6l5m3o3m6PN7O3J1k2j3L3M0Kl1l3j4k0m7j4M4O4M7%l0KK4K3kk1K0Jo1p9o5%O3L1l7
8733a18m2j0JNL6M6L0L5M0N9O6pm9n7m4j7K9N1L4Qj6l7m3l3j9ML8N3K6m6l8pk1qJ9J1J6Mk7
$$ y = [-5, 9, 57, 100, 94, 53, -6, -43, -23, 11, 22, 24, 39, 63, 48, -7, -14, -1, -28, -37, -48, -65, -80, -102, -146, -214, -265, -245, -199, -120, -50, -49, -102, -181, -207, -170, -103, -60, -12, 47, 87, 107, 76, 17, 1, -16, -37, -36, -42, -23, -5, 1, 20, 47, 88, 109, 52, 42, 90, 105, 96, 46, -22, -49, -44, -57, -59, -33, 12, 27, 25, 40, 69, 62, 34, 52, 87, 80, 31, -13, -13, 14, 41, 29, -8, -23, -8, 26, 43, 33, 29, 55, 55, 51, 67, 50, 52, 66, 47, 40, 27, -8, -23, -6, 52, 111, 110, 33, -64, -141, -140, -68, -26, 5, 63, 90, 65, 82, 111, 101, 98, 90, 76, 59, 35, 17, 8, 33, 55, 61, 79, 96, 48, -38, -82, -56, 10, 37, 45, 97, 144, 105, 38, 0, 5, 21, -15, -68, -95, -91, -23, 28, 47, 75, 74, 36, 50, 100, 112, 99, 73, 39, -8, -28, -1, 49, 72, 66, 91, 127, 119, 100, 92, 74, 87, 102, 96, 50, -45, -102, -110, -144, -195, -219, -188, -164, -151, -88, -25, -23, -66, -95, -110, -113, -91, -61, -49, -53, -48, -61, -103, -144, -149, -139, -154, -184, -207, -177, -117, -118, -160, -192, -195, -169, -147, -107, -72, -53, -35, -38, -71, -97, -102, -96, -76, -60, -59, -48, -47, -42, -29, -33, -12, 21, 54, 74, 67, 52, 26, -9, -52, -115, -161, -154, -97, -34, -23, -45, -58, -25, 15, 17, -14, -47, -61, -81, -128, -142, -98, -34, 13, 13, -17, -15, 9, 32, 30, 9, 29, 30, -31, -110, -175, -175, -112, -81, -118, -160, -170, -169, -164, -128, -82, -52, -17, 23, 82, 148, 141, 92, 35, -9, -26, 3, 54, 88, 96, 80, 43, 0, -33, -52, -48, -10, 43, 69, 23, -15, -22, -43, -51, -32, -21, -5, -1, -28]
8721b8K5Q0N6M7j2q1q9l7K0J9K7L6J4l8l0J4mqj6J1M1J1LKm0o6k8J0K5Lojk2k5K7K7K0N1M0
8709G8qj0oJ7l1p0k9PL1L0OJ0jl8%J3j1j7K3L0L3K9J6J8k0m5l5p0q8k8M6N3M4J7j4nj4jLK2
8696a5N7%k7L4M0Nk1n2k8K1K4M6L0qrKLNk2p8p4k6K3K0lK8O3O4L5j6m3n4k2J9K7L1Nl3n6m1
8684d6M5M4Kj2j4qj0j7JJ6k9k4J6J9pJ3j5j8l0k7JRK9M6M3N7L0k9m2k4Kj2j1nMK7k3l7k0n
8671f1NK2K4J1J5jJ1M3L6l1o2j7mJK4L6J4K0L5Lrmljj6k2mJ5L4J5j0k0nok0rj6l6rJ8J9rk4
8658Bj5m2o6k8j3j9L8Q5M7M6N1K0J5K8j7m5m9j5L5j6l8j4KJ4K0J2K0J0QJ2j3k9nmk1j8k0J6
8646fM7J2k9m3k0J0PmL3L7J7kk2lJ1j8j0Nk5m4LM7K8j7n2n6l4lpk0PN5N7j6n4k7k3j4j5J9
8634a69Q3R1O8L6nj6k4jrn6k3J6N9P1K1j8j7m4m2QRJ1kk2l3j9l0m0j7K2NJ6K6J4OJ9L3Ln0
$$ y = [-28, -3, 77, 133, 180, 168, 87, -2, -39, -19, 0, 27, 63, 77, 39, 9, 23, 19, 11, -5, 6, 47, 58, 61, 63, 23, -43, -71, -61, -36, -33, -39, -40, -62, -87, -60, -33, -13, 38, 78, 70, 60, 54, 71, 40, -30, -59, -52, -21, 9, 15, 25, 24, -14, -14, -1, -12, -29, -6, 24, 57, 86, 102, 120, 100, 55, 20, -50, -138, -166, -120, -67, -23, -6, -20, -25, -39, -40, -37, -15, 42, 42, 15, 49, 89, 94, 73, 21, -7, 14, 38, 84, 114, 106, 97, 99, 102, 107, 85, 7, -67, -93, -70, -50, -53, -25, 38, 102, 137, 121, 78, 24, 2, 21, 48, 79, 84, 51, -5, -46, -1, 43, 45, 33, 19, 11, 1, -16, -15, 1, -28, -52, -36, -17, -24, -11, -26, -44, -74, -101, -100, -91, -62, -16, 27, 84, 114, 85, 43, 19, 21, 9, -2, -7, -3, 24, 1, -36, -56, -61, -56, -34, -10, 1, 16, 15, 26, 69, 105, 74, 12, -5, -9, -8, 16, 52, 66, 86, 121, 124, 115, 111, 108, 107, 91, 69, 65, 80, 114, 129, 119, 99, 94, 88, 68, 59, 43, 7, -2, 16, 35, 26, 2, -13, -55, -121, -149, -162, -181, -143, -58, -11, 35, 86, 106, 121, 149, 132, 87, 38, 23, 58, 42, 4, -10, -8, 6, 26, 38, 58, 68, 76, 88, 75, 46, 41, 37, 16, -2, -22, -6, 41, 53, 24, -19, -39, -29, -22, -26, 7, 44, 61, 59, 37, 34, 45, 27, 17, 22, -3, -47, -44, 3, 31, 14, -38, -94, -128, -131, -138, -158, -151, -96, -39, -55, -109, -136, -159, -173, -188, -169, -86, 5, 73, 109, 104, 88, 64, 63, 54, -2, -25, -9, 50, 121, 142, 124, 107, 63, 21, 29, 38, 49, 47, 25, -8, -27, -57, -97, -114, -92, -87, -71, -45, -31, -25, -6, 27, 30, -20]
8622b0q1k8O8J01N0RQj1k7k7l7l7kL7qJ8M2J6om0n2k1j4m2k1J4M4L8j0p5p0J2L3jK6K1L5M8
8610a0N2L3rj5l2l9j4Okj0j5PM1L4k1k5mQM4O2L7Rql5n6n8m0mM1K9J2pJ5O0O9J0l9l8o6o0
8597c8mJ6J5RK9M5K6j3pJ5l8p3j1L8K3lj2J0K4Lkjk4j2M3N2j3l0LL7K2QL3M6K8j3m8o5m2O
8585H2J0j0J7L8%o1n9KJ9RONj6k8k8QO3O4L1%j8k1lJ4Pj6pj2rj3k9mK3kJ3P3M5j6m1j5j2l1
8572G8m7n2k6L0M3KRL7J8j0j3k3k5RM5M6O0O1O4O3M7K9N8P1J43L02N30Q35R16P3r20q83n24
8562A046l25k07j37p5j6m6p9o5k7k2l9l2k9j9K2M3L3oJ0L6j8o9m8K1N0K0k3k9%QJ4L5M1J2
8551H0k8m6l0K2M8M8K8k9n9l7k5l3oJ4N3Q5M5j0k1lJ5Kk3mM4M1K0K9J9k1q7r8l2%m0l7oL0
8540e2L6J0%j4l3m3JK2J1Pj5K7N8L4L2j1QM5KK4K7k1l7m0k7pK9K%M3ll3JJ1j0NJ4K0j2k6p
$$ y = [-20, -101, -129, -61, 40, 90, 99, 107, 96, 69, 42, 5, -32, -34, 3, -5, 13, 55, 71, 65, 25, -27, -48, -62, -104, -125, -111, -67, -29, -39, -114, -184, -172, -139, -140, -114, -93, -58, -10, 42, 75, 66, 51, 19, -20, -34, -28, -30, -40, -55, -48, -7, 27, 6, -19, -23, -15, 29, 91, 128, 137, 129, 94, 38, -20, -60, -64, -23, 6, 18, 11, 26, 86, 155, 165, 126, 88, 22, -38, -42, -26, -11, -2, 27, 72, 98, 85, 78, 93, 55, -18, -29, 9, 32, 29, 17, 27, 51, 54, 52, 51, 27, 15, 58, 110, 97, 67, 70, 107, 129, 137, 170, 216, 244, 231, 183, 118, 76, 82, 92, 82, 99, 137, 137, 76, 17, 19, 38, 47, 53, 58, 42, 14, -14, -6, 57, 121, 152, 152, 134, 113, 110, 124, 131, 115, 108, 96, 87, 74, 45, 41, 64, 62, 75, 148, 193, 177, 136, 121, 109, 78, 31, -21, -47, -17, 26, 28, 37, 74, 92, 82, 69, 46, 21, 30, 75, 121, 181, 242, 306, 369, 416, 445, 503, 574, 717, 1019, 1549, 2384, 3300, 3373, 2453, 1570, 1046, 721, 514, 377, 302, 286, 240, 161, 96, 69, 47, 8, -24, -53, -72, -50, -7, 26, 20, 30, 66, 48, -21, -69, -48, 2, 22, -1, -30, -30, -22, -8, 27, 68, 80, 52, 6, -24, -2, 46, 94, 122, 93, 34, -3, -28, -61, -67, -53, 0, 85, 130, 120, 99, 96, 111, 113, 90, 86, 130, 171, 191, 220, 239, 218, 131, 33, 1, 1, -39, -76, -82, -52, -16, -6, -6, -20, -53, -96, -95, -73, -62, -55, -70, -43, 15, 49, 81, 70, 78, 123, 125, 149, 176, 155, 118, 78, 51, 44, 73, 75, 75, 118, 115, 82, 83, 94, 84, 89, 103, 123, 111, 85, 78]
8527G8OJ9J3nj6n0o0k3J0j1k4MK7L4J2J7Kj7k0l6l2Rj5j3L7Q2O0k2p2n3k9J1O4M9K4nl8l0
8515a3k4k0K3K8L2K0L5L0j7j3j5m2m5k4RL0J0K3rn2pkJ0K4j3m0k6j1QL7M7M4LlJ1l0kN0M1
8503A07L2Rkql4n3m8pK7J8rjL3Ml2ork8pL8Ql6l4l3j4K8L9J6J3j5l0k7k1M7Q5K4j6l3o3o1
8491i9k2M2M3kJ6J0j5RRJ4MjK3L0K2j1mK1k4j4qjlL0O7K7k2l2J3J2l1l2j9k1j6kjqpj5n0l6
8477a04J1K0j5L3P1J3l5o6nP9P2L3lj4kj9m8k8QJjkk7k9rQL0O0L3p6n8L0J7J0L9J4j3m5m3
8465f0nMJ2j2k3%ql7pJ0J3O0O7K2j9j3j7k2k5l0OMj8L8Q1O5M5J5k2o5p3k2pm1mN6O7K7MOl6
8453C6m2m0lM2M8M5L0kp2q4JM2L5L1ml4j1n6r6l4M1O4L2K1L9K3l9q6p8o2k1QM0J6l1K0O4O3
8441e4N9K1j3J1k4m6l1j0MlL1L8J5j6k1LL3L2K8ll3j4L1M2L0L6J8Rln2q7l9J1L0%l9l7o0l3
$$ y = [78, 84, 103, 116, 111, 95, 45, -15, -38, -28, -39, -63, -59, -32, 2, 14, 31, 33, 16, -4, -40, -72, -63, -78, -91, -54, 28, 88, 66, -6, -59, -88, -77, -13, 36, 60, 55, 17, -13, -37, -57, -34, -6, 26, 46, 81, 111, 94, 81, 66, 24, -21, -45, -36, -6, 4, 27, 18, -34, -41, -43, -33, -9, -22, -62, -88, -99, -91, -54, -7, 37, 40, 37, 48, 18, 16, 66, 107, 139, 148, 146, 138, 104, 51, 3, -4, 23, 41, 32, 31, 64, 68, 36, 30, 21, -7, -14, 24, 32, -4, -38, -71, -85, -57, -18, -2, 11, -4, -34, -61, -82, -35, 50, 74, 58, 25, -38, -99, -121, -79, -36, -38, -22, -12, -27, -18, -9, 5, 9, 8, 31, 61, 83, 72, 68, 89, 65, 51, 43, 42, 39, 69, 136, 163, 141, 109, 122, 134, 103, 71, 52, 31, 15, 13, 12, 4, -3, -18, -68, -104, -93, -73, -88, -55, 16, 29, -6, -72, -77, 2, 74, 107, 104, 90, 88, 69, 21, -7, 1, 2, 1, -1, -28, -57, -66, -58, -28, 32, 65, -11, -69, -39, -22, -12, 27, 41, 28, -17, -60, -65, -61, -49, -61, -84, -84, -92, -129, -136, -126, -113, -53, 14, 36, 17, 4, -13, -35, -60, -90, -84, -80, -98, -60, 21, 86, 131, 146, 124, 59, -14, -36, -43, -84, -88, -32, 35, 62, 66, 72, 36, -6, -46, -49, -7, 41, 86, 116, 114, 42, -42, -41, 1, 36, 67, 63, 29, 18, -38, -134, -168, -127, -63, -31, -10, 29, 52, 13, -73, -151, -213, -234, -226, -186, -170, -201, -181, -117, -54, 5, 26, 13, 24, 0, -46, -77, -87, -83, -86, -55, -17, -2, -18, -39, -36, -3, 29, 57, 54, 21, 7, 38, 80, 110, 146, 164, 173, 170, 118, 31, -8, 3, 33, 33, -6, -43, -103, -136]
8429a36K4K6K5K4%jj5k9k2j3J0MkM0Pl6k7k0JK2rl4RN9O7J8lL2K3j3k2rK2K6K9Pj8k1j8%J6
8416D3J0J0K6nl6l7k7%L9N6M0j8%J0j9j2j7n1k4K0M1L8Jk9LJ9j0J5Rj4k3rLl0o1n4rOj9k2
8404a37K8N0J8Rrl4l7j8l8j2K1nRnl0nL0Kqpj7%Lpj3MM4O8M1j6n2j2L6Pk2l1l2l1pK5M3M4
8391a03QOM%j5j1L4P0M9M1K7lj0j2k4j3J7L2j6m6l3k4j0J9N8N1rm0pJ3ll3o0qO5L3l4m9l7
8379g3j1PJ9K6Rk4m1k9K7P2L9Nl5l7K6L7L3L6lJ1K2Rj7m2l7k1j3j1j4l8k8j0qQK4L1M1N3J0
8366E3pj3l3J1J6NLk4n8k1Jj4mJ9QJ9M2L9J9j8k6lkn6o0j9L1M7K8Lj6L3M1J5m5r4m5K1N0L1
8354b3J0jj8J5M0Mn1j7N2J9k8mJ1j1pJ5j0l9l3m0l8J0M9L4j0pL5L7RJ0K9k3j03l2L5J1pj9
8342i6j6mKnJ0N1N5K6j3k8k1J6pm7qK3M5P4O6J4j7k8k1j5m0k8m5p0k0Rj0jN3J01P1k0p7l4
$$ y = [-136, -112, -86, -61, -37, -37, -38, -53, -82, -104, -117, -107, -103, -105, -65, -58, -94, -121, -141, -140, -118, -127, -161, -152, -93, -26, -8, -11, 21, 44, 31, 9, 0, 22, 48, 77, 84, 66, 45, 27, 27, 43, 53, 63, 89, 84, 48, 11, -16, -16, 23, 79, 119, 101, 101, 111, 92, 80, 63, 12, -12, 8, 49, 87, 88, 59, 62, 81, 71, 86, 95, 81, 58, 49, 52, 22, -39, -93, -102, -96, -115, -137, -109, -59, -41, -32, -41, -75, -112, -130, -168, -180, -159, -164, -155, -160, -190, -195, -165, -163, -171, -178, -195, -195, -192, -199, -212, -208, -164, -96, -55, -71, -123, -135, -99, -92, -114, -145, -177, -208, -215, -190, -147, -103, -95, -89, -85, -85, -100, -111, -77, -7, 42, 83, 110, 107, 97, 85, 61, 48, 65, 97, 81, 35, 2, -22, -32, -13, 45, 96, 87, 47, 40, 53, 50, 17, -43, -51, 14, 47, 13, -36, -73, -84, -77, -58, -32, -23, -47, -88, -117, -90, -18, 21, 26, -9, -46, -20, 17, 50, 86, 83, 94, 116, 125, 108, 66, 29, 8, -5, -16, -30, -68, -96, -106, -114, -106, -82, -51, -10, 43, 53, 46, 33, 0, 11, 27, 32, 35, 11, -47, -68, -67, -81, -85, -66, -58, -39, 3, 42, 61, 43, 17, 14, 12, -44, -104, -123, -92, -45, -17, -14, -30, 3, 44, 59, 14, -80, -125, -104, -54, -23, -13, -14, -32, -17, 23, 27, -24, -41, 11, 30, 2, -2, 9, -2, -9, 6, -4, -43, -76, -116, -154, -144, -95, -61, -71, -78, -43, -6, 3, 13, 42, 19, -84, -116, -81, -70, -77, -96, -112, -116, -114, -119, -109, -58, -3, 23, 10, -18, -39, -23, -30, -77, -85, -62, -17, 57, 123, 137, 120, 92, 71, 56, 16, -12, -57, -127, -147, -138, -148, -149, -96, 5, 76, 56, -21, -55]
8330e5PJ7J4Nk6l8k8jJ8L2K8J7J9j8n0o3j7J8K1kj2J2L2M0M4M2L2ln5m6j0j1J3MNM4M7J3%
8318H9qk4l2J2K2Kj4oJ8kl4k9m1n3OM3L9L5N4L9jM1M0k7n2n1n3l8k9J2J6l%j6kj3l4m6k7N
8306a62K3K3JKJ2J6J5J1K3K5nm9k7J7J4j5nk3ON7P6N1jl1m8m8l5j1K6N5J2mKL3M3qn0l9J0
8294hK9J4K9L7J7MQL7M0J3k0m7o9n5l9k9j3JJ5K7K3JOm0l3J6Mk6j7L7O6J8J2L7JpRj1k3m6
8281A8n7l9KOnnL9M2lRN0J0k6J3L7J3J1k2m1l0j7OK8L3K8J6j7l0n8n4o7l2K4M6K9k5l4j1j0
8269a23j1J2M1N8K2j0rm8n4rL5J6J1L2M0j0l6k4m1l0J7L2ojN2Qj2j8j8K1K0QmQJ7K6K4M1N3
8257A30N6L4n1p6m2n0k9RM5lk3J3J1J3K2Qqk8l2k1oJ6K6K2j6n3l6joj4%J9K6j0j3J7J8JL6
8245DO3J9mk2l8l6m1j7L0J1j2j1k1n9j6M1O0on1j5J0NKJ1jK3N0J3pj1j8rj0rJ3J6N1L9l3l4
$$ y = [-55, -48, -31, -17, -12, -38, -76, -104, -105, -87, -55, -27, -10, 9, -9, -59, -122, -139, -121, -100, -102, -114, -102, -70, -30, 14, 56, 88, 85, 30, -16, -26, -37, -24, -20, -15, 29, 76, 89, 89, 81, 57, 25, 37, 59, 61, 47, 41, 59, 57, 23, -6, -47, -100, -94, -51, -12, 23, 77, 116, 115, 156, 196, 169, 117, 66, 13, -25, -54, -42, -26, -29, -29, -45, -47, -60, -94, -140, -167, -162, -139, -116, -115, -113, -101, -85, -70, -59, -36, -11, -16, -65, -92, -75, -61, -76, -81, -104, -98, -41, 35, 86, 85, 54, 6, -42, -77, -88, -62, -7, 5, 1, 3, 36, 79, 71, 21, -18, -8, 21, 35, 64, 101, 118, 122, 130, 167, 207, 220, 200, 153, 84, 29, -10, -39, -52, -51, -36, -9, 14, 15, 21, -19, -52, -36, -32, -58, -75, -38, 28, 46, 58, 95, 96, 89, 98, 87, 64, 18, -39, -78, -76, -70, -75, -80, -41, 1, -2, 7, 57, 67, 41, 54, 91, 104, 115, 93, 52, 22, 5, 11, 39, 72, 100, 116, 99, 69, 11, -43, -110, -142, -118, -72, -43, -68, -102, -113, -123, -134, -122, -81, -23, -1, -11, -20, -68, -122, -131, -96, -80, -69, -37, 3, -7, -43, -67, -108, -138, -121, -89, -95, -96, -44, -36, -48, -66, -84, -63, -43, -35, -39, -31, -14, 12, 36, 77, 130, 186, 220, 169, 93, 51, 1, -28, -19, 26, 23, 0, 13, 24, 37, 59, 67, 59, 31, -1, -22, -28, -12, 14, 36, 20, -33, -69, -70, -76, -90, -90, -71, -45, -55, -68, -51, -33, -32, 4, 67, 86, 82, 60, 22, -14, -55, -72, -42, -31, -43, -54, -75, -134, -150, -109, -49, -55, -106, -121, -111, -106, -104, -93, -94, -71, -21, -8, -15, -26, -44, -53, -63, -72, -59, -43, 8, 47, 14, -20]
8233b0J5J6L5M0Oj6j5KQMm8k5J0L3Jm5mK5L5J8k6m1l5m3l0k4pRL8N9N4K9k9p9p3lM9J2k0l
8220h8k1j8KJ8J5lL7L2nqL9N1k2l6K2J8Nj9rJpRlK3K8ql1j1Olk7j9k9k0oRK1Nj0RMj8OJ7K2
8206b2N4O9M7J8j3m8o0n8k7K2L3PMJ5l3o8m1jL3N1K4k4m0l7NK5K0L8O2K6rQok4k0j0oJ6J9
8194D9l1m2j5K2J1kmn7n3PO9J13R5L0kj0j2kjm0p9n9l7K4P3N8J0l9k4jOJ2J3j8k1o%j3rJj0
8182Fn2n9nL1M6M3Qkk4m1j8K2K1QL2J4J2K1JKPj7m5o5m2j7j6J8J5j8k5jK1J5J2J7Pqj6RP3
8169a0P5L1JJ0j4k3jj6k3Lqk7%M2L7k2l9OM1R2O6l6n6o3o7k0K3K4K5M0J0m2j5KJ3L5M6L1k2
8157A49m9n7m4j8NLkJ4MJ6%n2n4MM0KJ4M0M4K0j1j0k3m4j6KL1L8jlJ8%n5r7o3M2O7J8l4m8
8144a10k2J0M9O4N0Oj1K0Mj7J4K3Mk9l6l3m7n2k4j8J2N9L9k5k2OJRL8K3J8rj0JLK6K7K1RL2
$$ y = [-20, -5, 11, 46, 86, 92, 76, 61, 63, 71, 75, 27, 2, 12, 45, 46, 1, -3, 22, 57, 75, 49, 8, -27, -70, -100, -124, -131, -122, -84, -25, 29, 58, 29, -50, -123, -126, -77, -65, -85, -88, -109, -127, -125, -107, -92, -95, -58, -26, -31, -39, 0, 51, 29, -7, 15, 33, 38, 19, 10, 11, 4, 13, 10, 33, 61, 53, 22, 11, 17, 14, -13, -32, -61, -81, -87, -78, -57, -52, -62, -53, -49, -67, -61, -44, -22, 32, 101, 148, 166, 153, 105, 45, -13, -40, -18, 15, 22, 26, 41, 8, -60, -101, -102, -69, -18, 6, -18, -58, -95, -90, -65, -45, -7, 55, 81, 72, 80, 74, 50, 30, 20, 14, 30, 49, 18, -24, -39, -17, -6, -8, -12, -69, -122, -115, -46, 67, 162, 192, 190, 180, 168, 166, 165, 125, 46, -13, -50, -26, 47, 105, 115, 76, 52, 51, 57, 69, 82, 64, 43, 37, 37, 24, 15, 16, 6, -46, -105, -110, -79, -33, 10, 18, 16, -8, -49, -67, -45, -24, -16, 16, 30, 42, 63, 64, 66, 73, 56, 11, -54, -96, -113, -129, -111, -96, -114, -139, -140, -119, -104, -92, -75, -68, -76, -92, -83, -10, 65, 96, 97, 107, 93, 70, 69, 53, 30, 33, 25, -2, -2, 40, 77, 55, 16, 22, 63, 155, 221, 185, 129, 66, -1, -21, 2, 26, 51, 91, 101, 59, 44, 46, 59, 94, 140, 171, 149, 100, 43, -1, -19, -14, -11, -13, 1, 5, 21, 21, -31, -85, -81, -41, -39, -25, 15, 59, 79, 68, 58, 35, -9, -25, -23, 8, 46, 45, 42, 60, 60, 5, -92, -155, -113, -46, -28, -62, -110, -132, -122, -73, -9, 41, 47, 36, 56, 60, 43, 57, 80, 84, 55, 19, -14, -61, -113, -137, -155, -143, -84, -45, -70, -92, -86, -85, -76, -38, -15, 3, -6, -16, -15, -12, 14, 41, 62, 71, 103]
8132A03L1K8J0n1n1l4j1j7l5kK3mmlj4j2K4J5k0l2m6pL2J8l6n6m2j4J1lj3M1L8J0j6J1N2M6
8120c0K8J0l3l4pk2j4J5O4N2j2l9j2lK4K6Pj8m5k4J9J1m5l0K5L6L8L2KL9O7K5k2o9j17j00
8109a56LP2N0K8Lk4k6pL3M2J2j7k3k3j4l9m4J5J0OK9pj2k3l0RJ9N9O2L5lJL1Qk5k8j0JK0M0
8097G7J0krm8n1k4j1JK2L6K1Kj0lm8p7n4k6JJK6P1N8K3K8P5N9J3l5m3k3Jk9n7j0J5K4J1l0
8085a5qoJ8M6K9jk7j8k6m1l4JL2M2K6rj3mM8L3l7p1n1j3K6Q1P1L5L0K2l5m7j6LKK0Kk5j5k2
8072C3k7pnpPJ2qj6j9Kj6nL7K3j5nK3N8J3n5p4j5M9K5K1J9k1J9L4nn4l7RJ9j3k4Qj2l2qk1
8059i0k4L9Q3O4Pn6m7j9rJ3l0m4j1J4M4O1N9K4J9L1L3mk8j3j4j1k4%N9N6J2j8l6j1j7l2j7
8048F3m5o5o8n1QM0L4L5M2J8kk8m5k2k7k0J2L4M3M8Mk5j1nlPm1l1K6M0L0Pk3m8kN2ml4j5J
$$ y = [103, 134, 162, 172, 121, 70, 36, 25, 8, -27, -29, -6, -10, -14, -17, -31, -43, -19, -4, -24, -56, -102, -109, -77, -59, -95, -151, -193, -207, -196, -199, -212, -171, -133, -123, -139, -128, -76, -30, -2, 8, -25, -59, -66, -88, -102, -87, -23, 29, 17, -22, -34, -37, -13, 13, 20, 2, -43, -67, -48, -37, -82, -112, -87, -51, -13, 19, 21, 60, 127, 152, 130, 61, -56, -156, -153, -81, -31, -3, 0, -24, -50, -57, -24, 18, 30, 13, -10, -33, -47, -86, -130, -115, -105, -99, -70, -77, -89, -112, -142, -133, -114, -55, 7, 42, 39, 40, 71, 79, 54, 26, 16, 17, 37, 77, 87, 85, 76, 28, -23, -47, -58, -57, -35, 1, 22, 24, 14, 11, -37, -114, -168, -194, -193, -192, -166, -95, -37, -14, 14, 89, 148, 161, 126, 83, 60, 61, 32, -25, -35, -20, 4, 15, -15, -23, -29, -11, 35, 64, 63, 36, 18, -8, -49, -83, -82, -50, -8, 18, 9, -4, -8, 40, 73, 36, -35, -86, -99, -73, 8, 79, 114, 144, 166, 131, 84, 68, 71, 73, 93, 95, 70, 55, 33, 6, -1, -6, -13, -6, 6, -2, -18, -37, -35, -51, -56, -19, 4, -11, -16, 7, 65, 78, 23, -51, -66, -17, 8, 29, 48, 27, 46, 80, 75, 21, -16, -7, 12, -1, -25, -17, -29, -61, -69, -90, -114, -75, 8, 72, 79, 23, -24, -43, -52, -39, -69, -113, -124, -110, -66, -5, 54, 78, 97, 128, 161, 157, 129, 116, 102, 91, 67, 67, 126, 182, 194, 176, 140, 129, 112, 80, 63, 18, -47, -115, -166, -158, -118, -84, -49, -7, 11, 9, -19, -64, -86, -113, -133, -121, -87, -44, 4, 8, -17, -28, -33, -36, -29, -70, -101, -75, -35, -5, 2, -21, -69, -71, -19, -23, -57, -72, -71]
8036g1K7L3pJ5L8Ork6n5l4m1l1J3K8K5Nl9m0kQ1J05M8j5k2K5N3M3l1j08j03m6M5O7M4M3M6
8024A10Qm3p4o9l4l1lL7O1O2oo1j1L0L1Rj7k8j9j6k7JK5K6Jk1J4K6J5K2nm7l8k3K4N8N0K3
8013F0L3Rn2n6k4K5O4L9J7j9k3o1j09m2N7M7j2k8j8PM3M3jJ7K7n0o0k0K8O0M3J0RJ9rn5m9
8001c1jRJ2K0J8J9Lpkjm1p0m0K1J7kJ6O2Q6O1J1l3l5n2m8Rqk1J6j6n5j6L4M0J0k7k1K0K5L1
7989A3k1m3J6M0kl4m7K2M8pj8M0N0j9l8p5r5k9K4M7L4K1L7M0K8J1j3m6m0N5R1K3j0Jj2j2K
7977H2RJ9j9p8o4nL3J0pm4k6N5R1M5J4nm0l1mJ8J8k2j8k6j0k4m9o4oO5P3N2J8JJ8K8K2J2J1
7965A52j4m5m4m6o4k4O0P0M1K5j8m4k8n9m2J7Mk8k8m3m1j1M5O9P3P5M9K3J2J6Mj6j3PJkl0
7954A03j6K4K2K2K5l0o9r9m7K4K0J1L2N0Om3l3J0K5M4L5k7p1j5Plk0j2j6jL6N7mm4j3RL5K6
$$ y = [-71, -44, -11, -18, -3, 35, 41, 32, 6, -49, -83, -124, -155, -142, -114, -89, -84, -123, -163, -165, -84, 21, 69, 54, 32, 57, 110, 153, 122, 14, -89, -135, -90, -23, 21, 64, 110, 118, 75, 1, -68, -102, -133, -136, -99, -38, 24, 18, -43, -54, -24, 7, 16, -1, -29, -48, -64, -91, -90, -65, -39, -38, -59, -45, -19, -4, 18, 13, -34, -72, -95, -71, -13, 37, 60, 93, 102, 50, -6, -30, -5, 59, 98, 115, 96, 73, 12, -97, -139, -82, -35, -47, -75, -93, -86, -43, 0, -1, 16, 43, -7, -67, -87, -59, 1, 44, 54, 63, 82, 73, 18, -31, -32, -23, -11, 9, 27, 46, 49, 42, 40, 39, -2, -72, -112, -91, -74, -76, -60, 2, 88, 149, 160, 127, 92, 40, -8, 1, -7, -28, -12, -28, -83, -99, -65, -25, -15, -42, -63, -43, -18, 13, -8, -51, -35, 5, 3, -31, -78, -56, -8, -15, -33, 7, 57, 38, 0, -75, -170, -199, -175, -128, -94, -73, -36, 4, 32, 43, 30, -16, -56, -1, 90, 113, 103, 104, 92, 80, 82, 91, 110, 91, 13, -51, -56, -23, -13, -20, -64, -90, -35, 56, 101, 115, 110, 70, 39, 35, 53, 71, 49, 31, 5, -5, -29, -78, -142, -148, -83, -10, 42, 60, 61, 79, 107, 129, 141, 152, 138, 93, 49, 3, -61, -85, -25, 45, 86, 111, 93, 49, 21, -38, -80, -63, -59, -87, -115, -158, -199, -210, -165, -96, -23, 52, 101, 124, 136, 152, 156, 140, 127, 134, 135, 133, 103, 87, 111, 133, 155, 180, 150, 81, -18, -65, -41, -21, -10, 22, 72, 78, 35, 2, 12, 37, 81, 116, 89, 18, 3, 10, 7, -13, -25, -41, -42, -6, 51, 47, 3, -10, -1, 34, 60]
7942F0k3pK5K3QJ2J2l3m9o5n9j9K3K1M2N7NpJ8J5k3n6m1j2%K3J9j6j5K7K4M0j5n8l3j1J1L
7930g4l6j8k2k1qK0LQL6L8M1J6k6j4J1k6l6RL4k0m8l4j6j4k2j0K4K7M3L3J0Lj4m0J0K7J6J4
7918g6J8J4pk3ok5l0K9O0M0JJ1omjk4jqokk0j6j2J4L7M3j3k8Oj0qJ2L7L0RJ2L7jn8n7k0K9
7905b3K2J8Jk5j5Olj6J2K2%j2kj8m9k8J9O7N4Mkj8m8l5k7jL9O6M4M1L6k3n8m0k3j9j2J0Nk
7893c3Lkj1J4J7J9J2j5rQKlL6M9J4Ll7k1lk4n1l0qLj1j3QL7L7J8j1J1K1j6rM8N9J6l1q2p4
7880e9n8n4m%j9rK6M0L2J8%mj8K5O2Ml4k4L1Q0L7J1ll5OJ0m3n0j8M4N9k4l4J4K1k4q2n9qP
7868a36NRJ6K5M3M2J5j5l2k4pml2j4M5L6K0J7l5n5k7j2K8N4J4K0M5L9K8J1k4o4o8j5J0J0k
7856c4klJLj4j8J0J8rj1LM1Nm3k5j2K0Pj7K9N6N5K0l3p4m4Pj6J1M3K5J1j0k6j4K0K4k6n0l2
$$ y = [60, 37, 30, 55, 78, 86, 98, 110, 77, 28, -37, -96, -115, -92, -71, -29, 28, 33, 26, 44, 59, 36, -20, -61, -73, -73, -50, -31, -47, -62, -35, -11, 29, 14, -44, -77, -88, -77, -74, -110, -128, -150, -171, -179, -159, -156, -148, -112, -74, -33, -17, -43, -57, -46, -72, -108, -99, -65, -85, -133, -167, -183, -197, -219, -229, -205, -178, -135, -102, -92, -89, -103, -143, -133, -106, -90, -76, -58, -44, -51, -74, -80, -105, -135, -106, -46, -6, -5, 6, 0, -4, -5, -29, -30, -38, -44, -46, -66, -82, -94, -80, -43, 0, -13, -41, -35, -45, -53, -41, -4, 26, 35, 47, 84, 83, 25, -32, -52, -23, -1, 17, 18, -7, -22, -16, -19, -35, -23, -1, -1, -13, -15, -33, -82, -110, -91, -24, 30, 34, 32, 14, -34, -69, -96, -97, -58, 8, 52, 93, 129, 106, 48, 8, -15, -34, -46, -36, -31, -33, -30, -32, -43, -29, -12, 7, 19, 4, -5, 3, 5, 2, 38, 87, 101, 104, 67, 46, 43, 19, -32, -62, -70, -67, -78, -91, -83, -46, -9, 9, -2, 9, 30, 14, 5, 53, 112, 128, 97, 15, -59, -117, -171, -175, -175, -194, -203, -177, -137, -105, -87, -87, -91, -109, -84, -22, -18, -52, -76, -45, 35, 72, 83, 80, 45, 51, 61, 18, -32, -50, -6, 53, 29, -5, 9, 30, 6, -76, -135, -143, -136, -131, -122, -106, -81, -38, 4, 19, 4, -28, -52, -59, -63, -95, -109, -64, -28, -8, 9, -26, -81, -108, -120, -92, -38, -24, -4, 41, 80, 108, 119, 95, 31, -37, -52, -42, -32, -34, -36, -39, -38, -35, -49, -67, -57, -39, -48, -59, -56, -15, -10, -53, -78, -90, -70, -63, -80, -51, 5, 60, 80, 47, -27, -71, -64, -80, -69, -26, -1, 10, 0, -26, -40, -20, 4, -22, -72, -104]
7844a04MK5K7K9O2L2k4j6Qk6l9k9JM0L9NJRL9K2l3k8l3k8J0K6m0k5L4N7L1j3J4L7K3k8l3K0
7832I6oJ7K5j6j2rk1l8l1PK5K3j0m5k9%lNql5k4K8L6K%k6j2kj0j1j4K0M5N4K1j5m0k5J6J0
7820a2J3JJ9L3PJ8Qrl7o4m1LO0P4L9Ml7m6NJ3k8n7m7nM5J7k1m3k8L5N8N5K1jJ4K5K0qJ3M1
7807A57J4l8o3l1J8L1pl9j6OqJ1NMK2jk9j1K7k0n1j8l4l4k3J6L7JJ6K1k3k3j2J1N0M1jl2j8
7795d4joKRjl2p6k6lKO5P6K7J9j8p6m5rjM0L3mlK3L7J2RK8L1j4m4jJ0j6k4j7qok3l5k0mrm
7782a47OL2ol0K7M1MM1P7L8l5j02o5lK5RK0N7K3oj8j0%K5M1J7k5k8qj8pJ7M7K3ml6k1L6K7
7769F4k4l3k4PK7j7k9K3K2jRpm4m6m2m3JM3M6M1LJj3j2NJ1K7Lj7k2jJ6Pj4qNJ0J8oqJ3KOR
7756Hj1ojjj2m0k0L3N0J8L9Nk5K5ml7m8m0prK3M4j2m1RM7K6m2p7m1OK0M4L2kNmj1j5j3RM8
$$ y = [-104, -100, -75, -48, -19, 43, 75, 51, 35, 43, 17, -22, -51, -50, -10, 29, 34, 35, 44, 83, 105, 72, 44, 11, -17, -7, 19, -21, -46, -12, 45, 76, 63, 77, 114, 137, 109, 76, 96, 90, 107, 132, 116, 104, 95, 74, 36, 5, 12, 37, 60, 50, 5, -24, -24, -27, -22, -30, -65, -89, -61, -25, -23, -23, -49, -61, -63, -73, -84, -98, -78, -33, 21, 42, 27, -13, -38, -22, -12, 1, 2, 21, 54, 61, 79, 87, 78, 41, -23, -64, -61, -1, 73, 112, 116, 79, 33, 38, 51, 23, -34, -81, -86, -41, -24, -45, -88, -116, -81, -23, 32, 53, 52, 66, 91, 111, 103, 116, 157, 171, 133, 70, 39, 57, 88, 81, 42, 26, 32, 24, 35, 40, 44, 66, 65, 36, 25, 52, 32, -19, -37, -71, -105, -128, -112, -75, -74, -58, -37, -60, -83, -95, -84, -34, 7, 6, -26, -44, -45, -51, -49, -40, -41, -73, -149, -175, -178, -176, -111, -35, -8, 11, -7, -83, -128, -137, -138, -98, -65, -69, -72, -49, -12, 0, 9, 37, 68, 54, 10, 9, 19, 3, -21, -38, -46, -52, -75, -110, -130, -134, -143, -147, -141, -109, -115, -145, -118, -77, -73, -32, 45, 83, 48, -54, -119, -122, -97, -88, -68, -11, 12, 6, -12, -22, -22, 3, 44, 61, 36, 8, 0, -18, -25, -8, 39, 62, 58, 22, 1, 37, 64, 40, 7, -17, -10, 17, 0, -29, -6, 16, 15, 24, 17, -27, -73, -115, -158, -157, -114, -68, -27, -24, -23, -36, -48, -43, -32, -5, -2, -19, -41, -42, -26, -19, -33, -41, -36, -26, -8, -14, -22, -9, -7, -1, 8, -3, -9, -10, -11, -23, -63, -83, -50, 0, 18, 57, 62, 37, 62, 58, 21, -27, -67, -74, -83, -60, -16, -28, -69, -60, -13, 13, -29, -106, -147, -141, -121, -77, -45, -47, -42, -46, -57, -72, -85, -76, -28]
7743b8P3L8K2Kl1j2Nm4n5k8rj8qK8K2J3K6P2N0n4r0l2J9J0k3l1QN5M7L2L4OJk5l0k3m0l4%
7731e2K2Rj2m1l0ML4J7J3K7PJ3J9qj4K6J6J5j0l9l2j9pJ7L7J6j1k7j2JJJ4Nl5l5jM5M3J1l4
7718gl5lL8L7J3J2%K1J9l4m6l5j5J4Mn2o1l4m5RP2N3LNr%J4J1J5J2L0K7K2Jm0k4l3l8oJ9M0
7706b6L5J3k1l1j9k5jL0J5L0N8M4L6rm1p5j5J8qj9k0j3rPOK0L1J4k3qPok7k4k1nJ6K3K4j1
7693c0n0j2K2J7J6J6J6rl5KK7K2QK1j6n9k8J6K9M0N6K5k1k4MKrkK1K4J5J5Kl4m5k8k0L4M0
7681F8J0Nl2l4j7NL1J5jK4Qj8j8m3n1n3rK3J2QK2L9K2k9QN0K4j3j8l3k3N0N9L3k5o6o1NK8
7669EJ2K2jokjMJ3J0l4n7k2qj3J8N9L8l9q9r4l2L4M4K5KNJ3L5P4N9K4K1mj7Lj1m5k3K6L7L1
7656A16J2j1j6l8n0NN0J9j7kPk1j3k7m1QL1L2Nn5p9j5K2J7N1N0J8l3l3l7n4k8nJ0L3L6J3k4
$$ y = [-28, 45, 83, 105, 107, 76, 64, 69, 25, -30, -58, -67, -85, -93, -65, -43, -30, -4, 68, 118, 64, -26, -58, -39, -29, -52, -83, -75, -20, 27, 59, 93, 99, 100, 75, 45, 22, -18, -52, -52, -30, -21, -33, -74, -104, -100, -66, -49, -36, -9, -2, 11, 30, 22, 8, 34, 50, 65, 55, 16, -16, -35, -42, -25, 12, 28, 17, -10, -22, -21, -20, -6, -1, -36, -71, -72, -27, 16, 27, -7, -42, -45, -7, 30, 43, 55, 55, 76, 95, 61, 15, -20, -35, -21, -17, -69, -130, -164, -209, -200, -128, -75, -72, -67, -76, -76, -62, -51, -36, -24, 6, 33, 55, 56, 16, -8, -41, -79, -85, -66, -26, 9, 22, 1, -30, -49, -74, -75, -45, -30, 0, 58, 102, 138, 129, 88, 13, -2, 16, 8, -11, -31, -44, -53, -46, -40, -20, 11, 25, 2, -6, 1, -5, -32, -56, -77, -82, -66, -43, -19, -30, -80, -92, -70, -53, -37, -21, -5, -14, -49, -47, -20, 2, 10, 31, 15, -44, -72, -56, -27, 13, 69, 94, 73, 49, 53, 55, 46, 44, 65, 89, 104, 119, 121, 87, 42, 14, -6, 28, 68, 78, 83, 51, 17, 0, 5, 36, 51, 50, 74, 82, 64, 46, 3, -48, -101, -110, -87, -75, -67, -45, -6, 16, -13, -5, 45, 69, 56, 38, 5, -18, 32, 91, 124, 99, 33, -28, -23, 5, 17, 39, 38, 32, 30, 29, 33, 46, 56, 22, -35, -57, -65, -78, -60, -1, 37, -2, -91, -185, -217, -183, -139, -114, -112, -107, -94, -59, 15, 74, 98, 119, 115, 98, 101, 90, 45, 22, 48, 85, 116, 128, 117, 101, 63, 13, 18, 68, 87, 70, 68, 75, 54, 41, 14, -27, -19, 12, 44, 49, -6, -85, -100, -78, -61, -10, 40, 58, 25, -8, -45, -99, -127, -132, -122, -89, -53, -40, -64]
7644f4l2K4N4N1L0k4k9k1o0m2MK3j0k3k3j8K1L5L3N3K3kJ7K2k4j4L6L8On5q4o1pLOM2O8mm6
7632e4l4j5L3M8J4pJ3J8l2l9rrk2l5K6N4L3K5L0L5J2kJ0KNk4k1k3l5j3k3n2KM7L3J4K5O0N3
7620A43J8m2n4k9Qj8n0j7kJ0J4JJl0l0J9L3J9J5j0o0q8l6K7O4N5k9l5L0M5NL7L9Kj1k3ML5
7608F0Ol1m1l8J1N2K6pOJ2oJ5J4K8oo3o8p5o6m5rM8P9K2l2oM0K0j6JM1K9J8LJ5lj3rjpK6O
7595C6k8j0J7km7o8o1j8M0Q9M9pj9m3o6k1O1P8Nl9j2L9N6K0J5jk5qNJ8ql1j1jk6l1k7k0j5
7583a17J1N8P2K6l5j1K9M1K9j9m1k8n9n7m0k9l7l5M1Q1L5JL3L1J7lnL9K8PLm9o1K6O5K8Qp
7572G6k8qL3Qj3o2p9k1j9k4%K1J8K8P5M3M6L9kmLj6l7m9mJ4j3k6k7j8l1j7l4l0j8J7L2K0L1
7559g6J3j9l6l2j1L6N6L9P7O7J5l1o8l6K0M8K2l2l9%Qk7k6K7J02N2l6m9n8m3j1RM9Mj2K7J3
$$ y = [-64, -96, -72, -18, 33, 63, 39, 10, -11, -71, -113, -109, -86, -96, -119, -142, -160, -139, -104, -71, -18, 5, 3, 20, 42, 18, 4, 40, 78, 84, 29, -55, -116, -123, -120, -114, -72, -4, -8, -54, -88, -103, -70, -22, -8, -15, -2, 16, -16, -55, -64, -73, -95, -130, -104, -50, -17, 8, 38, 73, 85, 83, 93, 95, 100, 76, 55, 32, -3, -16, -39, -91, -89, -42, -9, 5, 30, 90, 143, 161, 119, 65, 36, 44, 26, -24, -41, -43, -33, -19, -18, -17, -47, -77, -58, -25, -6, 9, -1, -61, -149, -185, -158, -94, -39, -68, -103, -73, -28, -23, 14, 53, 55, 44, 21, 25, 60, 66, 35, -6, -44, -33, 19, 45, 38, 44, 56, 50, 65, 79, 107, 101, 38, -30, -105, -171, -216, -225, -177, -98, -76, -108, -114, -74, -54, -70, -69, -28, 1, 19, 22, 37, 34, 21, 12, 11, 4, 30, 36, 8, -2, 15, 13, -34, -102, -163, -181, -141, -52, -3, -10, -29, -72, -138, -159, -98, -20, -15, -54, -66, -27, 29, 49, 64, 63, 38, 30, 35, 53, 45, 14, 3, 2, -24, -55, -82, -102, -117, -106, -48, 24, 50, 15, 4, 33, 74, 103, 84, 43, 15, -44, -101, -141, -170, -207, -242, -201, -120, -85, -84, -51, -20, -3, -6, -11, 28, 56, 63, 66, 17, -44, -18, 47, 75, 83, 76, 48, 40, 73, 81, 68, 6, -73, -94, -113, -137, -137, -116, -98, -70, 5, 48, 94, 133, 131, 127, 130, 114, 77, 28, 24, 38, 25, -1, -28, -46, -77, -94, -128, -158, -176, -159, -127, -107, -76, -63, -82, -118, -150, -161, -125, -69, -30, 47, 114, 129, 98, 30, -6, 14, 62, 84, 52, 13, 13, 21, -6, -32, -5, 97, 149, 113, 64, 6, -37, -48, -39, 10, 14, 2, 29, 42]
7548D2rk0lJ2kl2m4jP2N7K5Ml9l3l2k8OM5N0K8j0j5J5J6Km2l1m4p4o0j3J3L0O1L4QJ6L5J6
7536E5NJ2j2j0K9K4k1q1n2L6Q6L9ll1m9m7o2l3j6MJ4L7N8M4K4ok2j7k2PJ4k7m0l1j1pj8l9
7524a69j6M0L5M8O1N1K5Orm7m3qJ2mj4M7M7k9m5kJ1j8lJ1j2l0rJ8J0RJ7j7j8k2l3J4K9Nj7
7512f9nL5O5M8KmJ1K0J0Rj3k4j6RQj4o2p7l9J3J7J2J4qk1rK0M6N8K7pj8k7m7k8QK0Ln%lJ7
7499b4J1j8PM8M5l5o6m7lJ0j8j4M1L7K2%ojPJ5l6k9j6l7j2J0J8K7q%L0L1N2L5l4o7l6k4L1
7487e4N1k2o4n5l2OK7M0K5jL6M1LjJ4k2o2n6k0j0PJ3QJ2K0L1Jm8k1Nj2lL1L5J1J1ok2j1j9
7474a13j1J7Ol2k9K1O5K4jK9K8K3jjPk5j3M6K0k7l1j3J4K4lK6L2kj5J9K7J1nj7rj2j1L8L3
7462A39j0k1l4Nk0l4j5%Pj8n7m6j4M6O3L3mk8J4L3M0L0j9m7j5M0N8K4l3j8LPk4l6m4n1nM6
$$ y = [42, 33, 13, 10, 22, 20, -12, -56, -57, 15, 72, 97, 101, 62, 29, -3, -31, -25, 20, 70, 98, 88, 73, 88, 104, 106, 64, 33, -11, -85, -145, -158, -145, -115, -54, -20, -12, 4, 39, 55, 60, 72, 60, 50, 79, 103, 82, 1, -51, -15, 71, 110, 107, 76, 27, -20, -82, -115, -131, -127, -113, -76, -18, 26, 50, 44, 22, 5, -17, -10, 4, -23, -63, -94, -105, -112, -130, -169, -185, -145, -110, -62, -1, 50, 75, 81, 72, 25, -18, -26, -14, -18, -32, 15, 62, 33, -12, -14, -3, -21, -24, -13, -25, -55, -64, -46, -36, -27, -10, -27, -45, -67, -100, -86, -57, -52, -69, -74, -39, 26, 74, 76, 72, 83, 103, 113, 122, 109, 85, 69, 78, 86, 72, 10, -67, -106, -93, -76, -64, -50, -58, -79, -88, -68, -22, 36, 63, 56, 38, 11, -36, -64, -56, -36, -33, -38, -38, -41, -24, -13, -31, -24, 24, 69, 34, -32, -79, -82, -72, -90, -104, -63, -26, -4, -4, -10, -11, -4, 11, -25, -54, -70, -107, -119, -109, -91, -64, -72, -72, -42, -11, 41, 76, 42, -25, -61, -85, -54, -3, -25, -89, -144, -176, -170, -143, -103, -78, -79, -43, -2, 1, 0, 14, -8, -70, -126, -146, -156, -149, -136, -128, -116, -96, -65, -64, -112, -133, -128, -140, -143, -112, -77, -66, -55, -61, -83, -94, -113, -124, -107, -101, -133, -162, -141, -76, -52, -53, -24, 4, 27, 26, 25, 32, 7, -6, 40, 60, 33, 2, -11, 3, 27, 24, 50, 82, 80, 65, 84, 111, 122, 117, 100, 91, 79, 68, 106, 139, 129, 108, 74, 79, 59, 25, 10, 10, 17, -1, -58, -104, -118, -72, -9, 24, 20, -8, 6, 39, 79, 109, 90, 43, 28, 68, 126, 150, 117, 99, 102, 109, 85, 49, 5, -46, -51, -5]
7451eL5OJ4N0J3p8n2j2j6j7j7k7j1K8K5%RK1M7M3kk8l2k0k0j4J6J7KO5M3l6n6m9k3KRJ1jl2
7438i2k2M3O5L8J0K6nl4m5l9J1K6L2J7J8K0J2j6l0j2m5o8NM0L3N1M3jk6k6%nk4mL8M8K1k5
7426G8n2o1k7k0j3J5L3J5Nj4l8j2L5K5pJJ9K6J3j1l8l6j5J4PJ8J4Lj0m2k5K9O1O4N3Mn0p1
7415a0m1j9NM2km4k3nNRJ2L9L4l6o4l4M9O1K0L3L4K5J1k0m6l9rlKJ0L3K3Jj2l9k3j7QN2K3
7402D5p0r0lP4N4J5K8J7k4k0j6k2K5N4L5j5m5m6l2KKj4OO2O6NMl6l7K1J3mm1o7n7k5j6K4L2
7390i6J5K0L6L5J7K4J1j7QJ4j8j0Jj4m1j8J1N7Q9K8o3r9m4%l2l4k3O%J2K5QK9N4M2nkN5O3
7378A44kl2k4k0JJ2j1j8k0Nj0k2rj3k0n0m9kL7K6J9L6N2ok7rqK1Mk0j2nqkK6Ok7k0j1j2J2
7365f8K0J5j5k2J2J5pLJ6nkMjK6K8j2l4k5k8k9k9qj6J0L6O2O9M0J5j3m6q2p8k9rK0N2J9j4
$$ y = [-5, 30, 36, 50, 100, 113, 35, -17, -29, -45, -62, -79, -106, -117, -89, -64, -64, -55, -34, 13, 56, 54, 26, -6, -26, -46, -60, -44, -27, -25, 40, 83, 47, -9, -58, -81, -79, -70, -59, -60, -92, -114, -71, -6, 32, 42, 68, 63, 29, -16, -55, -44, -18, 14, 31, 49, 69, 81, 65, 35, 23, -22, -90, -85, -45, -12, 39, 82, 81, 55, 29, 29, 24, 0, -4, 34, 82, 103, 78, 26, -35, -62, -82, -95, -80, -47, -32, -27, -41, -79, -91, -56, -31, -38, -37, -18, 8, 21, 10, -28, -64, -79, -65, -58, -40, -26, -23, -33, -75, -100, -71, -10, 54, 107, 111, 61, -10, -51, -70, -65, -23, -25, -69, -92, -97, -92, -83, -71, -32, 2, -34, -98, -132, -83, -22, -2, 31, 65, 90, 101, 81, 35, -4, -13, -16, -14, -4, 29, 52, 53, 41, 2, -21, -38, -30, 22, 45, -25, -115, -118, -44, 10, 25, 53, 70, 46, 26, 10, -12, 13, 67, 102, 87, 42, -4, -36, -34, -32, -46, -40, 22, 88, 93, 97, 61, 24, 45, 58, 54, 13, -54, -111, -136, -152, -128, -96, -81, -61, -25, 10, 27, 51, 62, 45, 53, 67, 49, 39, 40, 26, -15, -33, -22, 35, 124, 152, 89, -10, -54, -54, -86, -120, -143, -137, -137, -125, -100, -92, -63, -9, 33, 28, 26, 81, 144, 142, 110, 86, 66, 67, 79, 68, 50, 30, 35, 25, 3, -6, -19, -39, -89, -138, -140, -103, -77, -58, -22, 30, 24, -3, -12, -20, 1, 5, -15, -27, -32, -40, -42, -16, -10, -37, -57, -68, -80, -68, -48, -33, -48, -70, -58, -43, -50, -47, -31, -36, -38, -34, -35, -9, 19, 7, -27, -52, -80, -109, -138, -146, -162, -152, -116, -54, 15, 55, 70, 57, 11, -71, -149, -178, -187, -167, -115, -96, -110]
7353a10J0J0j1j3K0L1j7jK1L0Rk4jM9L6l6p0n9qL9M0L3j7n4m3j0K2J3k6n5k6J5oJ2O5P4P0
7342A2nk3K5Lj6j8JN8M3K0Qk4m3KN1O2L8Kn0m7kL4L7j0n8m6l3m7m5k4jK1M7O6M5J9l0m9m8
7330b5k5K3M8N7O0L0m7q9n0K1N9L4J8J6k1l0k5k9n5%K9N6M9j2m0j4j6k4k9k7n1n1kJ2NL6M5
7318f4L0Nn7l7%J2K5M5O4L3m2o5oK8%k4mNK7N7M2k1l5j7OJ7K2J4PNQKj1j9j1k5k1K5K3J8L2
7305I3L6NPjl3p4q2m0k2JM4L0m1n0j2K9K3rJ7N7P8P9Jo4n8o2p4k0knN5O4J9k8JJ1RK0L4L6
7293G2J4k4n7j4j5OK9L7L4OrRK1j5j1j9l7J6K4l7l7J1K9L2M0L8J5m3n7k8k7k6j7K5L6LK5J3
7281F2l5J1Q3K1k4nMKl4o0n0m8l1J1J6J6QL2M0Km0n2jO3O2K2rk9J6K7rl0n3m1j0J5OlKk0l2
7269i5lK5K4qj0OK0J4J0J0K9K1j7k6j5m4k7LQRmm6j1N2K1PJ2K7K5K6j3q4m5K3M2L0ppL6M4
$$ y = [-110, -100, -90, -101, -114, -94, -63, -80, -81, -60, -30, -21, -45, -46, 3, 39, 3, -67, -126, -134, -95, -55, -22, -39, -93, -136, -146, -124, -111, -137, -192, -218, -203, -209, -197, -132, -58, 12, 7, -16, 9, 12, -4, -22, -21, 37, 80, 100, 108, 84, 41, 43, 94, 156, 194, 196, 146, 99, 97, 131, 168, 158, 100, 54, 21, -26, -71, -95, -96, -75, -28, 38, 83, 102, 72, 23, -25, -50, -27, 21, 78, 138, 168, 121, 32, -18, 3, 62, 96, 114, 130, 109, 79, 54, 25, -30, -30, -1, 55, 104, 92, 52, 38, 22, -2, -31, -58, -109, -160, -162, -150, -145, -109, -64, -34, -29, -86, -123, -123, -111, -86, -41, 23, 56, 14, -51, -57, -29, -29, -53, -57, -52, -25, 32, 74, 53, 18, 1, 7, 24, 46, 60, 67, 72, 80, 82, 71, 52, 41, 16, -5, 20, 43, 61, 93, 129, 134, 141, 140, 107, 33, -49, -89, -111, -110, -66, -36, -77, -127, -139, -110, -87, -96, -79, -22, 56, 135, 136, 72, 14, -48, -122, -142, -144, -149, -94, -30, -11, -39, -38, -27, -18, 2, 36, 72, 86, 62, 5, -9, -24, -18, 11, 48, 82, 88, 79, 88, 109, 94, 83, 64, 27, 43, 67, 30, -7, 4, 33, 65, 105, 143, 158, 115, 58, 30, 3, -23, -40, -15, 21, 24, 49, 62, 27, 38, 121, 142, 118, 113, 117, 119, 85, 25, -25, -73, -104, -93, -77, -61, -53, -21, 19, 21, -19, -71, -72, -9, 53, 75, 66, 37, 53, 80, 71, 41, -12, -53, -63, -48, -42, -45, -43, -63, -95, -98, -73, -49, -57, -67, -61, -41, -27, -17, -7, 22, 43, 26, 0, -15, -59, -86, -83, -75, -66, -70, -116, -127, -75, -54, -47, -35, -8, 17, 43, 30, -54, -99, -76, -34, -4, -11, -18, 18, 62]
7256F2Nk5m8n3k5OLj3RJ4Onj8j2j5l4RO1M9N6N8L9j1k6j6J3K4Mm6m2oLJ5L2Lk0j7l1JM0M7
7243I6J0o3j26r0J7O9O9N8J5JM1Lj7m7l9Mnk5j0L9K6KM4O3mp4p1m2%L8Lk8J8K1j4ok0m4k6
7231a14k8m2j2RJ0M3P5L7L8K4n7l5kJ4K8J4k5j1M3L3j3k0j7k2k5m9l3K2O1P0M4rn2n0j3L7
7220b7M2k9n1l6m4l1L4M2L4j3j7J8K5J8K5QNLJ4K5J6M1K8M6L7l6n5l4k6lnm8q5r0m0O8J15
7209b6M9pl0o1j5M7M3K8J8j8j8J9L2j2m0k0j6jPkl0j5k7o1k6L3M4J1L2M7Rj6j2J0j6m8k1k4
7197a33%LkQM8P1M1L6K1m4o9j0J8qlJ9K5oJ1M5M4j1n6k3L0J6QJ7Lk8j6J2Jmj3ML6K2m0n5j5
7184CN7N7K8L6Mk4k3j5j4l4k9mL2K2k0n3p7n6jL5M2j3nJ1K9N3Rj5NK2J2k0n7n9JJ7Jmk9k8
7172a04J9K9j4k9oj4k6j0J4J0mlj5J8L4PL7N6J2l5k2QL4N6J3p0r2m3j8lK3K7O0M4J8K5M6K0
$$ y = [62, 67, 42, -6, -59, -84, -78, -75, -88, -79, -65, -59, -64, -82, -94, -109, -143, -134, -73, -24, 32, 90, 129, 118, 92, 76, 89, 113, 117, 71, 29, 23, 26, 41, 73, 76, 56, 39, 8, 9, 49, 96, 106, 43, -83, -173, -156, -87, -18, 40, 55, 56, 97, 100, 83, 36, -3, 1, -4, -29, -39, 0, 26, 28, 72, 135, 131, 57, -14, -56, -56, -18, -15, -43, -25, -4, -18, -24, -44, -88, -114, -142, -184, -196, -187, -177, -134, -59, -22, 16, 40, -17, -52, -54, -40, -12, 2, -23, -34, 9, 42, 29, 9, -8, -30, -55, -104, -137, -115, -54, 16, 60, 51, -1, -51, -64, -27, 15, -14, -65, -101, -145, -176, -142, -100, -66, -79, -96, -78, -53, -35, -10, -2, 3, 6, 20, 45, 61, 102, 130, 176, 213, 177, 122, 88, 62, 59, 54, 6, -79, -169, -209, -141, -26, 23, 16, -14, -75, -90, -43, 0, 28, 46, 28, 10, 29, 61, 49, 9, -11, -27, -28, -21, -23, -53, -68, -95, -156, -182, -149, -105, -94, -62, -15, -6, -22, -34, -24, -40, -88, -109, -133, -133, -130, -132, -124, -76, -5, 36, 72, 93, 49, -20, -30, -12, -20, -23, -4, 21, 15, 26, 71, 115, 104, 48, 25, 55, 71, 79, 96, 99, 71, 55, 67, 68, 64, 51, 55, 91, 113, 73, 18, 3, 60, 117, 145, 181, 185, 161, 138, 123, 109, 75, 46, 42, 74, 96, 76, 23, -54, -110, -111, -76, -34, -47, -52, -41, -12, 41, 50, 35, 40, 62, 74, 54, -3, -62, -61, -44, -43, -47, -76, -104, -85, -56, -70, -99, -105, -119, -145, -155, -141, -131, -135, -138, -153, -135, -101, -94, -57, -1, 11, -24, -46, -38, -4, 52, 65, -5, -97, -140, -158, -161, -138, -111, -51, -7, 11, 36, 82, 102]
7160A02j4j4k4m0qK0MNN0M2J9J3m0p7m2mKlJ2Q0J16N2L5O5J01J41J67K65M98Q16Q41K9q09
7150B400q24n47l21j88q9o8o6n4q8o0qNJ0lj9m0k5J2mk4J5O6L3m3o5l4L3L4l4l2j0pMJK5K2
7139GNjj5j4k6%K8M7K6m7m7o0q5n0pK4K3K5L8LjoKj5k2%mJ9L8O7P9K1m0l4l9n0mM5O0J4j1
7126gMpk3j8rQJ4M5P1L4onqn2m6qj8j1j2m3m3JN1L2J4L3jKOL0N9J7n1n1Oop4k9K0L2L3%j5
7113c1oj9k2M6M1J2M5P4L2j4k1OK7m2n2l2k5l6n8m6LJ2k1KN2Q6P4N1mj2j8n1k3pJ0J6k5n7
7101c3pJ3j8JL0K6Rj2jN0N7J7PK0L5K5l7p9o9j6RK0M4J7m6k8Rj2k8m1l6k4k9K6O8K6J0K5j5
7089A3k4jj1j2j5K0J9m6j6L0J3j3J3M2J1k3JLl6j8J6L9N4M1J5k9n6k7j9m8l8L2N1oj4K4L2
7077A7J1l0n9k3J7J9k4JN2L8j7k9j7lK8L5Ok2j8kJ0L2K4n4o4k5J1J2KmL7N1%m4n3o5j9N5N9
$$ y = [102, 88, 74, 50, 10, 2, 22, 26, 31, 81, 123, 142, 155, 115, 38, -4, -8, -6, -9, 3, 83, 199, 251, 286, 351, 452, 593, 760, 1025, 1523, 2339, 3180, 3209, 2400, 1576, 1029, 708, 520, 431, 363, 297, 243, 155, 95, 87, 92, 102, 99, 80, 40, 15, 27, 23, -1, 14, 80, 113, 70, 5, -29, 4, 38, 4, -28, -38, -45, -41, -40, -15, 7, 12, 11, -4, -18, -44, -44, -16, 31, 57, 10, -37, -97, -182, -232, -239, -215, -192, -167, -129, -126, -127, -133, -131, -146, -168, -168, -172, -153, -115, -48, 31, 52, 12, -22, -61, -111, -115, -70, -10, 4, -7, -3, -10, -33, -51, -60, -52, -38, 7, 78, 112, 106, 101, 93, 41, -5, -13, -31, -42, -54, -97, -140, -139, -88, -56, -42, -9, -10, -8, -2, 28, 87, 104, 53, 2, 8, 2, -72, -101, -81, -49, -16, -16, -31, -37, -56, -78, -32, 9, 21, 66, 140, 172, 158, 137, 143, 170, 128, 76, 44, 19, -17, -75, -121, -118, -106, -127, -125, -73, 13, 87, 138, 134, 122, 104, 53, 30, 23, 33, 49, 24, -33, -40, -27, -45, -44, -14, 12, 21, 9, 8, 58, 115, 132, 139, 159, 194, 219, 182, 103, 34, 18, 27, 47, 91, 108, 62, 34, 43, 31, 3, -38, -74, -98, -127, -101, -33, -7, 3, 28, 13, -11, -12, -23, -35, -50, -30, -11, -57, -73, -43, -30, -43, -30, 12, 23, 0, 1, 4, -32, -50, -34, 5, 59, 100, 115, 86, 30, 3, -16, -64, -102, -70, -19, -25, -39, -15, 17, 28, -2, -61, -84, -67, -48, -72, -71, -19, 19, 2, -27, -44, -47, -19, 16, 22, 0, -18, -20, -10, 22, 46, -8, -72, -97, -86, -74, -72, -76, -39, 12, 12, -32, -85, -150, -169, -114, -55]
7065e5L8M3Rj0K8M1qq2r0j5O2P5L3mrJ1OOk2m3j1J2J3mJ1M4N6jj8j2n4o8n5mJ8K4J3K3L6j6
7053B1l4%K8J7L3K3m9o3j0jk0rL8N4K4L7M4L4J4%m5n8k7m1j6J4j9k6mk8m8k4K6M0J4J1j6k0
7041h6pMk2o1RR5N7kJ7K3J2oj1L5L1jnOJKJ3rk0LQ%L0K5j3ol0n5k2K0nl9K0N8M2j5m2l8jL6
7027E1L6K7Ol6n7l1kL5ol8m9k3J2K6QJ1NJ2M2Jm4l4k1k4n4m4l1o0j4O8O3K8PJ0L1K5OKLNK1
7015b7J6j2l0%N9N7MJ4J9k9l6k5k0Rj0m8m0l8l1rLK2P7R3P2L1J1J8j2j8kQJ7Mm0o9m9l6o0
7002a07n4J0M9R5R2K2m0n7l4n1j7M1J8mK8K4j7n4q8o6J0K9Kk4j1K0K5nj3j8mM4K7nkJ1J5J5
6991i4L1J0l2k0om0j7j2K7Q3N6J5kpj0J2J8rm3l3NL8J6n1n5J4K1K6M5K1Jk6k3Nj2l4j3OJ8
6979g1%j2pk1j3m0KM5M5L9K9M5J2l2j6m0l0J3J0mkL5M2L4Lk0j6jK4RL4K4m1o6k7Nj1j5K4P1
$$ y = [-55, -17, 26, 35, 25, 53, 94, 86, 4, -86, -101, -39, 36, 69, 65, 56, 67, 73, 79, 57, 14, 3, 15, 28, 24, 35, 79, 135, 134, 116, 104, 50, -18, -73, -77, -59, -35, -22, 1, 37, 21, -13, -13, 15, 32, 65, 88, 39, -24, -34, -35, -55, -64, -26, 28, 52, 89, 133, 167, 181, 181, 136, 78, 51, 10, -6, 8, -11, -37, -41, -69, -117, -141, -115, -75, -61, -50, -66, -86, -93, -89, -111, -172, -163, -68, -11, -13, 4, 27, 39, 33, 22, 57, 88, 87, 82, 88, 89, 91, 104, 95, 75, 78, 86, 86, 116, 141, 128, 122, 92, 37, 15, 35, 30, -9, 11, 69, 111, 96, 54, 16, 15, 51, 87, 114, 120, 84, 27, -4, -6, 29, 23, -15, -64, -87, -75, -49, -41, -30, -25, -13, 29, 30, -14, -48, -69, -93, -147, -191, -222, -282, -296, -228, -165, -137, -130, -120, -89, -64, -58, -56, -53, -48, -27, -11, -23, -53, -53, 6, 63, 67, 81, 100, 71, 35, 10, -10, -1, -11, -59, -99, -137, -168, -177, -174, -152, -75, 18, 90, 121, 132, 150, 138, 120, 118, 126, 143, 147, 107, 38, -11, -47, -107, -161, -151, -102, -7, 85, 107, 67, 10, -24, -75, -92, -51, -33, -37, -9, 15, -2, -56, -144, -210, -200, -171, -169, -193, -204, -184, -159, -164, -177, -195, -199, -155, -128, -133, -135, -124, -109, -94, -63, -53, -85, -105, -111, -151, -168, -180, -153, -70, -14, 1, -1, -8, -18, -6, 12, 3, -40, -73, -68, -30, -14, -65, -120, -106, -85, -59, -14, 7, 8, -18, -41, -36, -48, -82, -95, -89, -71, -71, -83, -90, -111, -124, -164, -162, -117, -72, -33, -4, 41, 53, 21, 5, -35, -65, -52, -42, -46, -48, -13, 29, 63, 66, 46, 30, 29, 53, 62, 96, 120, 79, 13, -14, -9, -20, -35, -11, 60]
6966F0O8Nn5l0l2m4k4M5O3K3lk6m8m9lJ0OlkNJ6K6pJ1Pk9j2jj1oLJ8J8J0lkjk0nJ7O5M5k9
6953G6n0l3mPJ9RJ0Pl8k6j7RQk0j1j2OJ3K5K9Pj9n2j5K2j0k4j3Lnj3k2jK1OllJ7L2L7j1m7
6940h6j3lKM8P1N1ko2o0k1JJ9N0L8nk4lJ2K0l2q6o9J9O5L2KoJ9K0K9O1O0K0k3l6o4n7l6k9
6928g8l3j3J8M1Q0N1RK7J4j4j9l2l5m8n0k1kL1mRM8M2j1n2OM2K7J6Mj0j8j3pJ2OLK7nKjk5
6915B4qJ3Nj0k7m5m4k9J2L6L6J1k2j8Kj0pmmkK2L2Jm4k6J9J4ON1N1M0j2o3o3m1rk4k3k6m7
6903b33OM6K3L8P3P1K6rMNpk2j5K1L8Rl2o1n7j5Pj2mOOoj7j9mk6o2k0mK1M7L9M0K6k7m1J6
6890a25O0N6J9j2mjj2m6o3m4JPljK5L9O1N3J9k5l7j3mk8RL3J4k1q0n0J8L8N2K3j6lK8M5j1
6878AlJ2J3K4K6Ol2K2O9L5kk6j5j2l2k9K1L8k0m4k8l4j5Mn1j5K3K1K6J5K0J7Rlmj1JK4N4K5
$$ y = [60, 128, 133, 78, 48, 16, -28, -52, -7, 56, 79, 76, 50, 2, -47, -50, -40, -34, -37, -39, -34, -18, 8, 1, 12, 19, -10, -22, -23, -34, -40, -37, -19, -1, 9, 6, 4, 3, -17, -22, -5, 60, 105, 76, 26, -7, -11, -4, 15, 24, 34, 41, 3, -23, -40, -31, -23, -43, -54, -66, -60, -47, -22, 7, 14, -5, -57, -72, -50, -60, -84, -97, -94, -99, -112, -134, -135, -114, -108, -111, -114, -97, -65, -28, -39, -86, -99, -102, -100, -52, 19, 70, 68, 6, -54, -75, -74, -55, -5, 33, 28, 4, 1, 13, 33, 1, -85, -154, -135, -70, -38, -36, -42, -23, -3, 26, 87, 147, 167, 144, 108, 44, -13, -49, -78, -111, -124, -106, -65, 15, 66, 75, 102, 116, 102, 83, 51, 16, -32, -82, -103, -105, -74, -78, -69, -21, 21, 10, -42, -36, 6, 33, 49, 53, 43, 25, 12, 5, 17, 23, 26, 53, 48, 50, 49, 24, 16, 29, 34, 24, -3, -48, -92, -121, -109, -73, -37, -26, -48, -66, -64, -74, -81, -85, -89, -91, -69, -37, -36, -80, -106, -87, -73, -67, -16, 35, 75, 63, 0, -63, -104, -113, -137, -160, -186, -233, -227, -181, -158, -120, -47, 24, 50, 41, 45, 50, 43, 21, 6, 27, 65, 74, 42, -19, -76, -91, -84, -96, -100, -94, -88, -94, -111, -130, -134, -160, -222, -242, -246, -225, -178, -139, -99, -73, -100, -141, -125, -65, -9, 10, -2, -6, -7, -19, -65, -128, -172, -171, -164, -167, -168, -143, -104, -43, 10, 29, 4, -33, -46, -50, -78, -69, -36, -22, -43, -123, -173, -155, -117, -65, -42, -58, -61, -33, 12, 1, -2, 10, 23, 47, 73, 79, 47, 69, 138, 173, 171, 145, 130, 118, 86, 57, 78, 116, 96, 52, 24, -10, -25, -21, -72, -87, -64, -43, -17, -2, 18, 35, 44, 41, 37, 26, 27, 51, 105, 130]
6865A30m1n2k7j1k3J2N9K6L0L2J0J7J2l6o8l7k4l9n5l1L1M4K6nm5p8o3k4ON0O7M7J9J8K9L
6854Ik1pJ2J3K0J2NOk0m4pK2L4J7J3Ml8m4l6k5K4P5M6K2jk8k0Nj1l7nk8n3j1qn4n4RL8M9L6
6841h1K0qk7k7j1K1PnJ9K9N2O8M4j0l2p9p0j4lLJ1k4j1M8M9J5PK0Lj7rj5k7J0K5J5Ll6k1J2
6829d6j3l9j1L2M1J0JKk7j1K0K0P0N7J1j9m9l3j2J3J2j1l3n0l7lL2M7M3J4J0Qnk4PM5ll2j5
6817B2j9j9jK7K1LMj4k5lM6O7M7rl3k9o1n4k1L9L2K7K4k6j5Qj1j3K3J7Jk5m4n2qM4M5J4k1
6805Hm3n9kO9Q2L6j1j3j6j6l8m5pJ0LL4N3J2pl3k9kL5K6j2k2mJ0K6K4rK2N4J0l2n8l9J7qo2
6792c6l5qL1R8O8j0n2m5m6j2K3M3K9J5M8N9K8k5n0l4jjo3p4l6QM7N4K9Pj0l6j8lj7l1l3K4
6781f5Q7O2Pnk5m8n8l8OL3J5j2k7K2J3nqk3j3nj0jL6M3Lk4k6MM4M2Ol1k5L3L7Nknml4j2QJ6
$$ y = [130, 89, 37, 10, -1, -24, -12, 47, 73, 103, 135, 145, 162, 174, 138, 70, 33, 9, -30, -85, -116, -85, -41, -15, -20, -65, -143, -206, -230, -224, -174, -107, -60, -41, -23, 6, 9, -12, -19, -7, 6, 26, 38, 43, 49, 29, -15, -22, 0, 34, 51, 64, 68, 30, -14, -50, -75, -51, 24, 70, 92, 91, 63, 43, 48, 37, 0, -5, -33, -86, -97, -105, -159, -213, -204, -166, -117, -81, -61, -69, -96, -123, -134, -113, -106, -111, -92, -63, -11, 57, 101, 91, 59, -20, -90, -104, -107, -104, -93, -117, -128, -80, -31, -16, -9, 11, 14, -3, -12, -27, -54, -44, -19, -4, -1, -37, -58, -46, -59, -98, -109, -77, -36, -26, -25, -23, -50, -61, -41, -21, 49, 106, 117, 98, 49, 16, 4, 17, 29, 18, -15, -65, -102, -105, -73, -26, 17, 31, 41, 49, 44, 20, 27, 72, 69, 37, 22, 3, -16, -17, 10, 31, 34, 38, 24, -1, -4, 42, 109, 156, 147, 114, 85, 24, -30, -51, -12, 20, 47, 71, 45, 30, 38, 27, 14, 37, 54, 55, 30, -14, -66, -74, -30, 15, 29, 8, -35, -94, -96, -27, 55, 91, 80, 67, 51, 35, -3, -48, -55, -45, -42, -8, 45, 57, 50, 17, -12, -14, 21, 47, 35, 13, 9, 19, 45, 69, 60, 82, 136, 146, 114, 56, 17, 34, 26, -36, -71, -79, -48, 50, 118, 108, 56, 11, -35, -47, -24, 19, 48, 63, 111, 170, 198, 173, 123, 89, 88, 87, 24, -50, -86, -78, -31, 23, 52, 59, 49, 13, -5, -8, -25, -56, -89, -65, 22, 84, 91, 86, 61, 13, -45, -83, -77, -44, -29, -41, -68, -46, -33, -38, -46, -69, -82, -87, -97, -98, -62, -19, -16, -40, -66, -62, -18, 24, 30, -1, -26, 7, 44, 49, 47, 42, 38, 4, -8, 0, 16]
6767A6j7k5qJ7K7J5j4k5%j2m6k2RK5M1M1L1K4kj0jOK0N0L8k2l7m8k6NJ3k1m4o9p1n1%NmK1
6755a71K3%J0M0J3j6PL1J7j2nK0K2K0K9Qj3jjJ0K1nn5p1j2J8j4j8K7N0K5J1K0Ql7o0n4PL9
6743f9L7J6J1K9J8m1m2k0j6j4J6N4K5j8k1k7l5mmj5J4M5M4N4jp3q3m1J9L1M7M6l5q9l3L8M7
6731i0L0J8lj5LJ8J5oJ5Lj9nJ0Pj1j8NJ4oOK0k2mN5K7l7o5l8lk4pJ7K5NK6M6On5n6qJ3N9O6
6718A7Pp3p2QN3N5K3o2o1kK5QpnK3j7j2L3K4j0k7j6L3K8JnnOj5j6k4KJ9K5J4M2P6J9K5K6j8
6705A45j1nj6j0Nrj5j4l4k2J0mk0J5Mn3k7%j8j6J3K7qj2J6l2r1%R3O2OMK1K2NK6Rm9n9j8K
6693e8Qk0j7J0j2l6MN2M8K7Oj6j3MJk1l4l8NM2L9K9J8ok2rNQj%J8J5JKk4PK3j3J7J4nJ5jk4
6679D8l0j8rj5l1%L3K3M5K7m0%L7J9j0j8l3n5m2K2N6Pn3n9j1k3n7j3L0Ok4j9K4N6N5J3j8q
$$ y = [16, -1, -26, -34, -17, 10, 25, 11, -14, -14, -26, -72, -94, -85, -60, -19, 22, 53, 77, 75, 65, 64, 70, 90, 140, 178, 156, 119, 71, 45, 50, 63, 42, -2, -71, -142, -193, -193, -188, -192, -171, -148, -148, -138, -98, -85, -101, -94, -63, -46, -58, -63, -43, -21, -1, 28, 36, 23, 22, 21, 31, 52, 47, -8, -79, -91, -73, -87, -105, -78, -28, -3, 8, 28, 36, -1, -61, -115, -108, -69, -32, -16, -5, 24, 42, 1, -41, -61, -77, -91, -75, -21, 4, -14, -35, -62, -97, -101, -105, -120, -106, -61, -17, 37, 36, -37, -120, -161, -142, -111, -64, -18, -53, -142, -175, -137, -90, -60, -42, -45, -60, -57, -39, -24, -30, -15, -12, -31, -36, -26, -19, -30, -48, -43, -29, -35, -29, -9, -31, -35, 20, 47, 10, -55, -93, -96, -120, -127, -110, -85, -80, -54, -8, -2, -57, -113, -121, -108, -49, 17, 24, -49, -121, -113, -60, -5, 18, -44, -105, -107, -82, -74, -81, -86, -63, -80, -92, -59, -35, -45, -72, -88, -55, -27, -26, -31, -36, -30, -45, -61, -85, -83, -64, -39, -25, 17, 93, 112, 137, 163, 145, 134, 129, 113, 103, 108, 99, 84, 70, 36, 14, 24, 20, 0, 15, 19, -34, -61, -61, -79, -95, -82, -55, -63, -75, -59, -91, -182, -182, -89, -27, -21, -17, 4, 26, 31, 57, 66, 17, -42, -60, -58, -50, -70, -87, -77, -89, -125, -121, -69, -21, 6, 12, -4, -17, -13, -12, -33, -67, -105, -100, -58, -19, 10, 28, 22, 0, -9, -4, 4, 3, 3, 21, 36, 37, 39, 15, 22, 45, 32, 49, 63, 58, 73, 72, 48, 18, 0, -9, -24, -55, -55, -22, 1, 46, 73, 33, 33, 70, 89, 79, 61, 28, -27, -69, -47, 9, 16, -37, -96, -107, -130, -187, -200, -170, -164, -188, -207, -183, -127, -72, -59, -77, -85]
6667h5j7l8j8QJ9J5J0pk1j1j9oL7O7M8pm3m2n0o5MP6O2M8N3K3K0J6k3k6lK0J1l8k6j2rL3J5
6655A9k0k2k9k2K7L7L7K8J3J1j0l7k0j5j2K6On5p0nK8Mj2j9j7JJ6K0L1M3J6j1j2j3j7j2L0
6644c7J8j5ORj6OJ7j1k2j1j3L5N7jj6rJ8L0K4j7m7j0lnJ9Kl6lK7K6oo7o3MM9M3k8rJ5Ok1n3
6631a08p4o7j9LK0M9N8J5k1PK9L5K8J2J1l5n9n2l4rK5Kj7k9rJ8L7K5k8%N0K4pPJ9L3J1rk9
6619h8K6O3K4j1j1m7l7J0M9M5J4j8l7l8l5J6K6K2K6J0k4k1pK4M6J1kn6p0k0J4J5l8l8J7K4
6607a16j5rmrQJ8M4M0pl3PK5Lk3j7J9L2J0M6O6K6J1km8n8rj1j8k8m6l0lK3N9NMJ8mJ6K8J0
6595B8m5o6k7K7N5N3L9k6l5L7K5m4l9K3L8Oo1q7m0K2K8j9j0P4P7K0k8m1J9N1J6j0L7M0Km3
6583I6m7j2K8K7K0Ok3l1nOj7m5J6L1l7r2n9K1Q6J04M2kk4KM5K5PJ4ml5m7l6kk0j8lk5mJ3j
$$ y = [-85, -102, -140, -158, -150, -131, -116, -106, -113, -134, -145, -164, -170, -133, -66, -18, -25, -68, -110, -160, -225, -221, -145, -83, -35, 18, 41, 61, 77, 54, 28, 25, 45, 56, 18, -8, -20, -29, 4, 19, -1, -23, -52, -74, -47, -10, 27, 55, 68, 79, 69, 32, 12, -3, -15, 11, 17, -38, -108, -113, -85, -81, -93, -112, -129, -128, -112, -92, -61, -18, -2, -13, -25, -38, -55, -67, -37, -19, -34, -28, -19, -35, -29, -12, -23, -45, -56, -69, -34, 23, 22, 6, -3, 15, 45, 69, 52, 5, -5, -8, -13, 6, 8, -28, -31, -4, 22, 16, -51, -114, -110, -61, -18, -46, -55, -40, -34, -55, -108, -182, -249, -268, -265, -245, -196, -138, -123, -144, -137, -108, -73, -45, -33, -22, -57, -116, -168, -202, -211, -186, -184, -201, -230, -239, -221, -184, -159, -187, -187, -137, -113, -120, -113, -94, -61, -50, -59, -88, -62, 1, 25, 14, 3, -44, -81, -71, -22, 23, 37, 19, -18, -56, -91, -75, -49, -27, -1, 9, -15, -36, -43, -19, 27, 38, 36, -20, -90, -110, -96, -81, -119, -157, -140, -116, -131, -140, -144, -153, -145, -127, -83, -43, -50, -83, -76, -51, -48, -71, -88, -69, -37, -27, 19, 85, 111, 122, 120, 72, 14, 5, -6, -24, -52, -98, -128, -131, -108, -49, -44, -40, -22, -26, -10, 18, 28, -17, -83, -110, -83, -28, 25, 64, 38, 3, 40, 65, 21, -18, 5, 43, 49, -12, -99, -139, -117, -89, -108, -118, -44, 33, 53, 25, -16, 3, 54, 70, 60, 97, 137, 139, 96, 49, 37, 65, 92, 112, 118, 95, 64, 59, 65, 48, 3, 19, 50, 13, -79, -138, -117, -31, 73, 115, 113, 89, 91, 136, 161, 168, 182, 178, 143, 96, 60, 58, 38, 20, 17, -8, -12, 1, 0]
6571@Mk8o0%J7j1k3qJ3k4j9L7Q5P3J6Qjl0k7k4l5m4o0k9J2K3M7L5j7j5K4kk6k4ok8j0K5OJ9
6559a07K4Lj4k7j1M0M2L6J7j2l2j9l2o1J6Q3P5K4m6l5J4Lk0k4l7J8O7L5j2k4k2pL3M2L2k6
6547C6o7k3L4N2Mo5o3QL0qkL6mm7m6m3%M7M1KPJ9QLJ8qRM9M8J7ol5l6k1k7k0nK1L1rn2m7J
6534a13QrL0K3Mj7qklj2k5l8l5jqj8K2O1O2J6J8J7onOM2L0j7k8k3j7k4OK8J4j6n2k7jj1J3
6521a16J4L7J8j6J9L6J1L6L5k9rol0k2k7k5pLJ1L4L7RMMK1M3K6k1m0j8M1P7J30K99M41L6l79
6510F77l39j95q3k4J6nkpk7l9j8POLK0lrj5k3J5L3%l3j3NJ6J9KJ2lm2n7k3K1J3j9MK9J1qk9
6497a07m5%L3K7k3o1k2K5L0J4Moj9m7k1K0K0K5omM2M0lNK2l0j8N1L5J0L6L7kk1m9l9kK9jl4
6485e5j8j3j4k2NL3K2J0j5n4l1JM8Q0K7OoP%k5j0j1l0j5K0L6QL9M1O0M8%nPk6n5l2l0k1k9
$$ y = [0, 4, -24, -84, -84, -67, -78, -101, -109, -96, -120, -139, -102, -17, 56, 72, 80, 79, 49, 22, -2, -37, -81, -141, -170, -158, -135, -88, -53, -70, -85, -61, -63, -89, -113, -119, -147, -157, -132, -126, -107, -83, -80, -94, -121, -132, -92, -50, -14, 3, -9, -41, -60, -92, -153, -137, -54, 21, 45, -1, -36, -22, -19, -39, -63, -100, -82, -15, 20, 8, -16, -38, -45, -12, 30, 62, 36, -31, -54, -20, 32, 36, -29, -92, -84, -54, -62, -64, -28, -32, -79, -125, -168, -168, -121, -80, -78, -71, -52, -44, -41, -23, -31, -22, 27, 75, 92, 86, 51, 15, -6, -33, -53, -58, -37, -6, -15, -67, -114, -113, -105, -114, -84, -61, -57, -74, -82, -84, -87, -99, -124, -162, -197, -198, -206, -224, -202, -141, -79, -63, -45, -28, -34, -39, -33, 9, 39, 22, -6, -29, -46, -70, -64, -36, -22, -38, -90, -117, -118, -129, -116, -102, -65, -47, -63, -44, -8, 3, 39, 74, 45, 36, 30, 0, -22, -49, -74, -81, -78, -67, -33, 4, 13, 17, 21, 42, 85, 111, 90, 50, 32, 73, 150, 280, 579, 1020, 1056, 677, 338, 143, 60, 36, 52, 47, 45, 38, 11, -28, -46, -39, -33, -30, -10, -13, -22, -37, -60, -45, -12, -12, -45, -58, -53, -37, -18, -16, -4, -7, -49, -106, -129, -108, -95, -114, -110, -81, -70, -78, -107, -152, -152, -119, -92, -115, -176, -198, -173, -143, -129, -125, -131, -150, -197, -218, -198, -178, -153, -159, -163, -121, -81, -84, -79, -57, -87, -105, -54, -19, -9, 27, 64, 62, 41, -8, -47, -49, -20, -21, -55, -73, -86, -100, -122, -117, -84, -62, -52, -67, -121, -152, -151, -103, -23, 4, 10, 4, 11, 11, -14, -24, -35, -65, -80, -60, -24, -16, 23, 64, 124, 172, 172, 167, 174, 148, 93, 61, 31, 10, -19]
6472a9kL8L5k3k4j4m1m8k4J5K9J6Pl5k0L1N4k6n2k4k6k2j7k1J5L9OJN4N2j6n8l2j6J0K0pK0
6461a25N3N3N3on6j5LPM1J6m1k4K2RKJ6L1J3k0j4j9Rj3j1lo2m8N2M6NJ1j3k9j6j0J2k6m0k3
6449a60oL2J5rPJ3j1JM0K9K8Kj3J8Rk3j4l4l0OJ2L3M7J5K7N0Qm7m9m5k5kk1j6orJ1J0k4l5
6436a66J2L8K0L7J0l2k7KloN0O5O2L5%k5m1q4l9L2Lm9k7K3L4N4O8O0M0j9n6j7l2j9L9L4Kk8
6424E0n7l9rMJ0Oj2k0j5j2K1N7M8pk6OJ6ol4l0m3k4kk3OM7N5M4J0j5l0j7L1K7J6J0Jj0k1k0
6412gJ6L2ol5k0OL6J3PPk1l2m9k4QL2J5qj0k1j5jJ7J7L1Rm8k1k2l0L1P6P2L6k2k9l8j9Mpj4
6399c4qk8l0J9L6K9QJ2nk8k6k0k4Oml7k9pK5O9O0j4k4j9n7oO2M2MkK6N1K6J0LJ7Lm3p6n3Q
6387e8M4M3on1o0l0j2pLJ9L0M5Rk8l1k0pL0O3K0l0n5l4J8M6L4kk9l4OJ7Mk8KO2L9j9l4o0n8
$$ y = [-19, -21, 17, 52, 29, 5, -9, -50, -98, -122, -107, -78, -62, -55, -90, -110, -79, -25, -51, -103, -127, -153, -175, -192, -213, -198, -159, -153, -152, -98, -46, -62, -120, -152, -168, -158, -138, -145, -125, -72, -19, 34, 28, -28, -43, -40, -33, 8, 24, -17, -41, -19, -10, -8, 8, 39, 52, 32, 18, -1, 8, -5, -16, -19, -81, -129, -77, -31, -26, -15, -28, -57, -73, -83, -71, -97, -137, -160, -166, -134, -119, -128, -121, -108, -119, -118, -78, -49, -21, -19, -32, -14, -5, -28, -42, -76, -106, -100, -88, -55, -8, 7, 34, 84, 92, 45, -4, -49, -74, -76, -97, -113, -119, -128, -117, -107, -131, -166, -154, -116, -96, -59, -49, -81, -108, -106, -109, -115, -65, 0, 62, 97, 97, 72, 31, -53, -92, -60, -57, -106, -133, -110, -76, -22, 46, 106, 146, 127, 71, 54, 22, 3, 42, 76, 78, 50, -7, -46, -55, -51, -41, -35, -47, -67, -82, -94, -73, -16, 32, 25, -1, 5, 21, 15, -19, -49, -92, -116, -118, -141, -135, -88, -33, 11, 21, 6, -24, -41, -10, 17, 33, 43, 44, 34, 13, -7, 9, 41, 35, 0, -20, -14, 22, 35, 42, 49, 28, -4, -53, -77, -69, -37, -22, -30, -40, -61, -76, -77, -60, -43, -12, -3, -51, -72, -94, -124, -93, -17, 55, 91, 69, 40, 2, -17, -13, -20, -34, -42, -70, -100, -81, -45, -16, -8, 4, -1, -29, -55, -75, -99, -93, -97, -134, -163, -170, -145, -76, -16, -30, -54, -73, -130, -136, -74, -32, -28, -30, -4, 47, 73, 83, 86, 103, 106, 63, -13, -66, -58, -14, 29, 23, -28, -88, -118, -130, -137, -134, -115, -85, -40, -31, -59, -90, -110, -117, -87, -24, -4, -34, -89, -123, -105, -59, -25, -27, -56, -90, -84, -67, -63, -91, -89, -27, 12, -7, -41, -101, -159]
6374a59PP9J05M5l6n0n2n3k0J6L9M6Oj3Qk0n9m1j9M6Q4L9k6n3LM5Nk6%J7l4j4M8L5Ol3j2K6
6362a5J8J2J4K0J3j1m8m6l4k1j1J7L7L5O7P1Oo0o4k4k7k2k2ok5k8l5j8QJ6Mj5J6O3N3L8QR
6351gL8Ok2k7n3o2NN5L7k4m0PK5K3J5ROK1L4J0n5m6RL2Opnm2j7J4oKK2oj4j6j2K2J2K7Qk3
6338c9l3k5oK2N3L8jm8n4m2l4j1nK8N7M2pLM6O2M1j5l1k7J4K3j1okj5n2m5k1j1J2K8L0J5J7
6325a0J4j2ppPPl7n9j1K7J1%K8J5k7l5k6mMK5P5L9j2k9j6Nnm1j1M4N6J9k3j7L0M0k7n3qK3
6313hj0m7j8L8M0J1K1K1qj4j8m8m7l4m0k0j0K7N2M8M9M2J0k6l3k7JL0K0K6L7M3J0j8qQrm4
6301D7l6J1L0N6N8po6n2k8n3n3rL0J4k7j1K2L4kl8j7K5M2K9j7m4m4l1j1k1k5J9Ml2l2J1M5
6290a79M2J5l6nL7L9Qj3K0L5j7j8OJ3m0o2l4J8K6jM5Q6M4M0N2J5m6l0J5J2l4q3k1K3nk3j6
$$ y = [-159, -152, -73, 32, 77, 41, -9, -61, -114, -134, -118, -79, -33, -27, -40, -32, -52, -111, -152, -171, -125, -41, -2, -28, -81, -78, -33, -28, -54, -54, -37, -71, -85, -37, -2, 4, -29, -41, -15, 3, 15, 29, 49, 62, 51, 3, -43, -77, -98, -109, -92, -55, -20, 47, 118, 124, 64, 0, -24, -51, -73, -95, -101, -126, -154, -189, -207, -199, -183, -179, -194, -178, -115, -62, -24, -16, -7, 31, 37, 15, -12, -65, -127, -122, -67, -30, -54, -94, -87, -62, -39, -24, -15, -9, 12, 46, 56, 1, -45, -36, -4, 2, -5, -10, -52, -69, -55, -61, -59, -37, -43, -57, -73, -85, -63, -51, -24, -16, -39, -72, -97, -103, -81, -28, 10, 9, -39, -93, -135, -169, -180, -185, -157, -100, -58, -65, -62, -16, 46, 87, 72, 41, 14, 28, 51, 40, 34, 32, 17, -35, -80, -101, -112, -100, -72, -42, -27, -10, 4, -8, -15, -22, -15, -8, -45, -104, -115, -88, -77, -77, -49, -34, -61, -96, -122, -126, -122, -97, -22, 17, 5, -24, -40, -35, -40, -81, -92, -48, 8, 27, 4, -13, 17, 57, 30, -23, -31, -8, -18, -65, -83, -45, -5, 6, 27, 48, 40, 26, 8, -40, -87, -121, -161, -181, -191, -164, -112, -64, -15, 27, 37, 11, -22, -49, -48, -18, 2, 28, 65, 108, 118, 100, 92, 100, 91, 47, 11, 22, 52, 108, 166, 159, 93, 41, 13, -40, -93, -102, -72, -58, -85, -96, -74, -40, -42, -80, -97, -72, -30, -1, -18, -62, -106, -137, -148, -169, -194, -175, -171, -203, -235, -224, -179, -137, -122, -158, -163, -126, -87, -79, -92, -72, -37, -54, -72, -66, -53, -93, -155, -189, -171, -145, -146, -101, -15, 29, 69, 121, 136, 90, 60, 75, 87, 53, -30, -51, -28, -33, -56, -72]
6278g2jlJ1j7p3m1MJ6J2L3L2k1l2k6PM7K7J2lQJ5L4M6N1J9n7o6l1j3nLjm5l7J1M4K2J8K1L6
6266a5L4K4K0K5Rkj6m5n6l7lQRj1k2m4m0jM5M0J1KK1L8M3Ql3QKn2m8L1M3Qk5k1K5J2l1k0j2
6253f8K6J9nkLK7J5j9PJ1RL5L3J8J2l4l6JQqj2j6OKqK2M6N6j4q8j13l5L5K5J3K8K6j1m3n7
6241h6j0K9K8jj2LKJ8lj5%qM7R1O9Mm3n7l1j9m1m3nL6J2LM6O0K6pm2n6n1k5NL4N0L0mmNJn8
6227b2q5nLmNnK5K6k7k1L2M0J4J9NKM8N6kr5r8o2l6j2J7M0J1N4Q8K1PL2J9l0m0j5j8j7k9k2
6215h1pkRJk4m3j5M1M8J5j2Lj9OJ8K6O2M5K1k4m8j3qm2k6K7J8rKK9nk3m0o8n6rMnKRM8N8J4
6202g3J2N3Oj3rnLj0LL9Pm7n1j6j0oj5m0j1M3L6J0lk5k9%L6L9L2RkKK6K2k2mJ1L1L2j0k9l4
6189a2l2LJ2L1M8M4J8k2o6q4q1l8J8L5L2k3j5J1jj6k7OM3K8pkK7O9P7J1n3m3l6k2j8j6l1l8
$$ y = [-72, -73, -76, -65, -82, -155, -196, -192, -176, -164, -131, -99, -120, -152, -178, -171, -124, -97, -85, -88, -80, -65, -31, 15, 66, 85, 28, -38, -69, -82, -87, -84, -85, -130, -167, -156, -112, -90, -72, -51, -15, 19, 43, 63, 88, 97, 95, 79, 34, -22, -59, -62, -54, -45, -56, -78, -122, -162, -163, -118, -78, -67, -65, -44, -6, 37, 45, 12, 20, 22, -30, -78, -47, -4, 4, -21, -42, -17, -5, -36, -56, -68, -42, -23, -28, -30, -27, 0, 15, -4, 3, 14, 23, 58, 91, 109, 121, 87, 51, 52, 60, 52, 40, 24, 30, 32, 24, 46, 92, 148, 134, 46, -67, -102, -67, -42, -29, -1, 25, 14, -29, -86, -96, -67, -39, -40, -52, -49, -47, -29, -32, -47, -47, -55, -8, 83, 152, 156, 113, 56, 25, 6, -35, -78, -83, -47, -35, -32, 14, 74, 100, 93, 51, -5, -56, -81, -76, -42, 8, 38, 34, 30, 35, 36, -22, -107, -112, -109, -113, -108, -113, -88, -62, -89, -110, -78, -38, -24, -5, 0, 2, 50, 106, 104, 9, -89, -151, -187, -199, -182, -142, -131, -77, 11, 32, 39, 71, 90, 60, 20, 5, -13, -30, -59, -81, -88, -90, -81, -80, -104, -147, -162, -121, -73, -58, -70, -67, -86, -80, -62, -36, 26, 71, 92, 68, 20, 7, -1, -43, -69, -42, -24, -33, -31, -2, -7, -30, -70, -138, -194, -203, -199, -204, -202, -193, -145, -87, -73, -61, -8, -2, -15, -24, -29, -26, -36, -33, 6, 13, -34, -85, -101, -111, -117, -132, -172, -183, -140, -104, -94, -97, -122, -151, -151, -115, -76, -44, -35, -37, -35, -9, 13, -9, -13, -2, 29, 61, 51, 22, -12, -44, -41, -29, 2, 50, 94, 112, 90, 24, -60, -141, -179, -161, -126, -94, -117, -132, -121, -122, -138, -165, -159, -116, -88, -95, -97, -70, -1, 76, 87, 34, -9, -45, -67, -85, -101, -132, -170]
6177a70j4L3M1j3l5K8L8QJ0jQN2N2J7k1o7o1JL8j4k7nK6L0k0j9qk0J1J8J3pk6k5j0pJ4jk4
6165a57KL6P3P9L3k7p1n2K8K4p0n7kQ9J08M8Q%j1rJ8j1o4q2k6K8J7K2Lj7j7pRk2oO4L9k5l
6153hPl1j9K0Km5m9m6J0Q0P0L3k3mM8L0kl9l0J3j1l2%RRJ4Kj2k0jK5J0l2k1nlK4M3L6Kj7M
6140D1j4l1jL7Jn0k6RJ0PoJ6L5L9K5j8o9k5JkK6J2pJJ7Nl5p3o2l3MO4P3J8j5k6j4K9N5L1M
6127E3Rqk9l9k3nk4k7OM3L0K0lk2k0MJ0MJ5k2k0L7L0k4m5oO9N7njj5jnl4l6j2LML4qm6l0l7
6114a19n7k4NK1M0P5O3J1k6k3qk4m1M2P6ll1k6rJ6L7M1J2m2n2rKl5l0K3N5M2k4m0pRKK0K2
6102a6QJ1K7J0k0mjj9l3l1k1j9J6Q0O1K0k1j7Rpo2m0K0N2M3j2o7q1n1J6K7oPL3K6L7M7L2K3
6089G7J4J2NJk4l6k2%Pl2l8l1PL7j1k8NJ1JJ8L1K9K6l1n8l1n0m7j5K9L7J2J5K1L2P5M5Ok9
$$ y = [-170, -184, -151, -110, -123, -158, -130, -92, -84, -74, -75, -67, -15, 37, 54, 33, -34, -95, -94, -56, -70, -97, -102, -76, -46, -66, -85, -93, -113, -102, -84, -71, -78, -104, -129, -139, -146, -132, -133, -157, -155, -119, -46, 33, 66, 39, -32, -84, -56, -32, -102, -159, -161, -72, 36, 84, 92, 92, 81, 72, 90, 79, 15, -67, -93, -65, -48, -26, -23, -40, -57, -64, -55, -77, -83, -19, 20, -5, -8, -1, -32, -51, -31, -29, -74, -123, -169, -159, -79, -9, 24, 1, -3, 45, 75, 73, 34, 4, 17, 6, -26, -26, -17, -8, 6, 8, -4, -24, -25, 0, 10, -22, -43, -48, -51, -27, 16, 52, 54, 37, 41, 27, -4, -5, 32, 33, -17, -43, -34, -24, -17, -23, -7, 28, 67, 92, 74, 5, -20, -19, -21, 5, 17, 10, 11, 28, 33, -2, -75, -137, -170, -166, -102, -29, -11, -26, -52, -66, -37, 18, 49, 53, 62, 54, 25, -14, -37, -42, -66, -93, -87, -44, -14, 6, 3, -19, -39, -35, -25, -21, -6, -28, -48, -11, 19, -5, -50, -56, 13, 70, 65, 64, 49, 48, 43, 9, -27, -39, -36, -32, 2, -6, -52, -82, -119, -176, -200, -195, -174, -134, -59, 4, 15, -11, -34, -42, -66, -107, -65, 11, 8, -23, -49, -58, -42, -5, 36, 48, 6, -46, -55, -53, -88, -118, -95, -40, 2, -22, -62, -69, -60, -58, -38, -16, -8, 3, 30, 40, 20, 16, 15, -4, -37, -68, -89, -108, -92, -12, 49, 69, 48, 31, 40, 33, -29, -69, -49, 3, 46, 34, -33, -114, -165, -149, -122, -128, -121, -88, -62, -25, 22, 54, 77, 91, 103, 108, 109, 85, 49, 27, 27, 34, 2, -36, -67, -60, -23, -34, -62, -57, -46, -45, -27, 4, 33, 59, 28, -30, -61, -111, -158, -173, -144, -107, -95, -80, -59, -27, 48, 93, 99, 70]
6077G0o9n9l9RM3K4j1l8j9PRL5Q5N2j6l3k5k4k6l5j6L1O5Lm0%L5M3M8K4l5m9l0j2nK4K6JJ
6065E4k9n2j1K3K1rj8J0L5J0RNNl2m4Ql2o6o4k0M0P3O5N9M5k1n7k6J8L1Rj2QK8Pl0%ql4%J4
6053A2onJ3j8k7%L2K7nm3n6KK6M6K6l2q%j9m4qM4O4M3l8o0jJ2L3L1K6J6j6k3k6j8k6n0k3K9
6040g0M0Lk1nm1l9j6k0PKJ7N3N8M5N8N1Pk4l0n4m3j8nLjK6N0L1j0m1n7JR1N8j1l9l6nrpJ9
6027A8M4L3m9n8l1oK4Rj0L5L2j6pj8lJ0K9M6J1k4m8k8J2L1j3j7QJ5pl9k7k3lJj4pJ9M5K4k1
6015b3RJ1j2j1QJ4K8M6M3k7q3l7J3K7K6J3J9Rj5rL5N2op8j04l5K0K3J5J7Jm7j3O8N5J4NNk3
6003E3j9j1j2k3m1k5M%J1M1K1K1K0pm7l4rpJ6Om7n8QK5l1o8m5K2M7L2N3M3JK5M6Jm8p5k7M8
5990i0N9K1L0K2J1L0J7k5l6l7l8kM2P1L9PJ4k2l6l0m4k9j2k4k9K2L5J4J8K3j0l0kJ0K9O3M1
$$ y = [70, 1, -58, -97, -88, -45, -21, -32, -70, -89, -82, -73, -38, 47, 99, 83, 50, 25, 1, -25, -60, -76, -45, 20, 23, -17, -17, 18, 61, 109, 133, 98, 49, 19, 7, 2, 26, 52, 53, 54, 25, -27, -38, -15, 6, -3, -21, -11, 24, 34, 43, 48, 53, 21, -23, -15, -47, -113, -177, -197, -157, -84, -19, 40, 85, 64, 7, -19, -1, 30, 39, 27, 35, 63, 70, 40, 40, 32, -2, -2, 12, 6, 1, 14, -4, -31, -31, 1, 28, 23, -20, -76, -74, -48, -2, 24, -8, -16, -16, -35, -79, -87, -43, 21, 64, 26, -34, -35, -23, 10, 41, 67, 83, 67, 44, 18, 0, -26, -76, -99, -70, -30, -27, -48, -53, -94, -133, -149, -169, -162, -160, -143, -90, -32, 13, 71, 122, 129, 105, 75, 21, -22, -40, -45, -42, -43, -17, 33, 64, 54, 13, -44, -43, 48, 106, 95, 56, 20, 15, 6, -1, 18, 62, 95, 46, -12, -43, -49, -25, -16, -26, 9, 41, 25, 18, 0, -3, 7, 36, 82, 93, 69, 21, -7, 5, 36, 23, 6, 14, 29, 22, -17, -44, -67, -70, -69, -83, -90, -71, -26, -2, -23, -14, -3, -15, -26, -18, -4, 24, 70, 113, 86, 3, -34, -21, 6, 32, 45, 64, 73, 58, 49, 84, 136, 130, 52, -52, -87, -67, -44, -29, -12, -11, -58, -71, -3, 52, 66, 71, 76, 53, 34, 23, 11, -12, -53, -78, -74, -74, -63, -22, -1, 20, 40, 33, -14, -48, -57, -64, -48, -42, -89, -147, -139, -114, -145, -213, -258, -236, -189, -157, -104, -61, -60, -35, 11, 12, -36, -111, -138, -90, -31, -10, 20, 42, 53, 83, 100, 75, 39, 2, -36, -38, 4, 75, 114, 121, 135, 113, 77, 47, 3, -26, -38, -62, -91, -69, -34, -20, -2, 21, 11, -19, -21, -11, 18, 81, 122]
5979A22j2j8j7j9k9k7j1j8k6m0l0ML3L6J9K8L1Jk9m2m5k7M1P2L9Nk1j3J5j9n5l1K7K8L7O3
5968G2J9n7p2n2LP4P8K6K2j0j0J8J7J5lk7q2q1MK5M6K8j1J1k5l5QM8L0j6l2J8L9J0m4l2qj8
5956dpj9J0K0L0L1l4m2l2m8L2M3rk8NL6J5l2l9rK8L3KLMpNkl1l2L2P1K1k7l3k4LjlLj0J7M4
5943A5N5M4M0J0n8o2k8l0o0l9%K0K3J4Nn5m0PL0M9K2KJ9L2K1M0L2j5kK3J1k6m0l1n2n6j0O7
5931b3R7R1M5j0k9%K1j3j1j4m1m6l0mj7qM3L7K0j9m9l8NK9K6ql3j5J6QJ1J6nRL9M7M0Qj7L
5919A81K7j8o5l6L5M6J1jK3K6mj0L5M8Qm8q4n4l0mJ7pl9k1L2M6jl1k4l2l4oN4O0J6Rj9k5m
5906G7K3K6J5K5%k4nJ5K1L2J2j7j6k5rK9K8QL7J8j8k2JKk1l5p0n4j1nk0PK0Rj4n2k8P8O5J0
5894A12rj2L0N0O6N1l2o6m6J2J8k3l9n2k9L%K5K5kL9O7K5ok6l5k2mJ5K1J9j4k3j8k2nJ3K6
$$ y = [122, 110, 92, 75, 56, 27, 0, -11, -29, -55, -95, -125, -121, -88, -52, -33, -5, 26, 27, -2, -44, -89, -116, -75, -3, 36, 41, 20, 7, 22, 3, -52, -83, -56, -28, 9, 72, 91, 34, -38, -90, -87, -13, 65, 91, 113, 103, 93, 111, 128, 143, 140, 113, 31, -50, -46, -21, 25, 53, 42, 53, 28, -7, 1, 49, 79, 63, 31, 49, 88, 98, 54, 22, 14, -4, -11, -30, -20, 0, 30, 61, 27, -15, -47, -95, -63, -20, -29, -57, -52, -16, -1, -33, -72, -81, -53, -20, -18, -15, -11, -18, -13, -15, -46, -78, -46, 25, 46, 19, -14, -38, -35, -36, -39, -36, -46, -29, 15, 70, 114, 154, 164, 106, 44, 16, -14, -74, -113, -113, -93, -70, -56, -51, -106, -146, -139, -109, -60, -38, -36, -17, 15, 36, 76, 108, 93, 91, 114, 125, 99, 59, 28, -24, -80, -90, -23, 74, 165, 210, 200, 171, 171, 192, 179, 168, 154, 113, 67, 37, 33, 16, 8, 51, 88, 108, 89, 40, 2, 7, 36, 62, 54, 21, 6, 22, 30, 41, 57, 52, 61, 100, 147, 187, 195, 178, 181, 208, 190, 125, 89, 124, 170, 181, 180, 203, 229, 225, 215, 250, 298, 306, 258, 174, 120, 90, 86, 103, 96, 57, 36, 68, 114, 113, 82, 58, 26, -8, -14, 40, 100, 116, 125, 106, 81, 77, 100, 126, 141, 166, 166, 142, 137, 152, 173, 205, 217, 200, 184, 159, 150, 179, 207, 215, 252, 270, 252, 230, 231, 233, 212, 177, 107, 53, 42, 37, 17, 24, 44, 53, 39, -13, -41, 37, 102, 112, 103, 91, 121, 171, 237, 288, 256, 190, 144, 156, 174, 151, 112, 60, 31, 34, 34, 59, 84, 82, 121, 188, 213, 207, 181, 146, 124, 120, 135, 156, 175, 161, 138, 120, 98, 93, 106, 132]
5882A32J7l2k2l4j1N4M1M8Nl5k0K7M3Nl3m3LN9O6No0l9K3K0J7rJ7M2jj8k1j6k6j7J5QL4O4
5870C08M1j4m3Lnlmn8m1mK4N9O5K4J0ol1o4l7K4L7J2K3L8K6J3M2L5K1mnJ1K2K2K3K5L2Rj0
5858F20J5L9L9L4J02J46O3J1QP3J04R4R6R4J40J59J51J92K78L53M24N58P67J019J314J707
5850H600K320L255M357N261N142L106m09l592n054m950m106l126k328j689j235r70p39n36
5845C307l77l16k89k06j57j77k08j70j01m0j6l6o7p2o7p4l0j1m3o7l9j4PK3%m7o3l4K7M4N2
5835G39Nj8onL6P8J21J46J28R4N1l5j02j17j15r5q6q4n7l9k0L0Q7O6j7n4k2K0OK2M8N9Q3O8
5825A015L0L6J06J24O0M1N1L9Q8J85K27K50L52M28M62N32O86R06J232J691K364L293M429N426
5817B4053N384L330l26l657n232n141m234l208k342j714j287r88p44n46m24l73l03k23j59
$$ y = [132, 149, 117, 95, 61, 50, 104, 145, 193, 198, 163, 143, 170, 213, 218, 185, 142, 145, 204, 270, 275, 215, 176, 199, 219, 236, 227, 244, 286, 285, 267, 246, 230, 204, 187, 202, 210, 244, 308, 349, 335, 292, 295, 290, 287, 283, 225, 184, 180, 204, 263, 328, 352, 362, 356, 325, 261, 224, 248, 285, 297, 320, 358, 384, 397, 439, 474, 495, 491, 486, 497, 519, 541, 564, 589, 621, 630, 620, 635, 674, 713, 747, 849, 995, 1058, 1069, 1077, 1150, 1254, 1348, 1444, 1538, 1678, 1837, 1988, 2180, 2458, 2811, 3235, 3793, 4560, 5579, 6893, 8600, 10920, 14175, 18532, 23793, 28935, 32041, 31632, 28040, 22986, 18036, 13930, 10804, 8476, 6787, 5552, 4582, 3843, 3307, 2930, 2614, 2325, 2119, 1962, 1785, 1577, 1407, 1306, 1266, 1250, 1214, 1147, 1075, 1008, 934, 904, 893, 850, 783, 744, 730, 737, 760, 760, 713, 650, 616, 643, 687, 739, 744, 726, 720, 715, 751, 829, 950, 1096, 1224, 1318, 1369, 1334, 1232, 1115, 1000, 905, 819, 735, 678, 639, 619, 649, 736, 802, 785, 731, 709, 729, 735, 757, 805, 864, 947, 1015, 1045, 1081, 1187, 1311, 1371, 1412, 1463, 1502, 1590, 1775, 2002, 2252, 2604, 3032, 3494, 4026, 4712, 5618, 6850, 8541, 10905, 14198, 18627, 24053, 29437, 32767, 32441, 28784, 23552, 18411, 14177, 10969, 8627, 6913, 5626, 4638, 3894, 3348, 2924, 2551, 2248, 2025, 1866]
5811A866j29j20j28j16r2q1p2p5n8n4o2o8q6n6l1jJ8K3k1n4j2QK9L2k5o1k4k0pj5k9m2m2j9
5801C76K2O5O9N8K2l7k0J6J1L7rm9m7lM5Mj2lK2P4Q3J7MJ9M7O6M0J9M8P7R3J27J28J28J09
5790A646Q2J50K54L15L39M06N52P53R78J290J722K378L239M295N214N186L301j80l491n091
5784B3338n067m243l213k301j665j271r70p44n83m68l97l39k72k09j56j26j07r0o4n4o6o2
5777H71q8j03j06m4Kkj7m0l0j7n3l8L7L0jK5J1n5o5p1k6l8o6k4K5J6OJ0MRj6j5OJ7jk3j8k6
5765H6lM0M7jj5MRL5j7n9l6J6lrM6O1mn4m5k3jlKjJL2L6J1j0j5k9j2j6m2l6J7N4K8K4K4J3
5752A52K4Jm0p2m5nk3k0L8O4L0pmOk9k1L3M3L8Ql4m5l7k0k3j7J4J1K4L1LKQlJ1L6K3j2oLO
5740A46kLj5j8%k3nkl3k4rMK4J6m6l8J5L5J9km7n7j9%l0k9K1N9N0rl2RO7Q6K4k4MkqMK0J3
$$ y = [1866, 1737, 1617, 1489, 1373, 1281, 1200, 1128, 1053, 995, 941, 879, 811, 725, 669, 638, 637, 655, 678, 657, 603, 591, 599, 628, 660, 635, 574, 550, 530, 523, 508, 479, 437, 395, 376, 398, 463, 532, 590, 612, 575, 555, 571, 582, 619, 610, 561, 514, 511, 556, 560, 548, 545, 567, 641, 724, 741, 745, 764, 811, 877, 917, 936, 984, 1061, 1154, 1281, 1409, 1537, 1646, 1728, 1878, 2132, 2447, 2786, 3192, 3744, 4497, 5475, 6765, 8487, 10865, 14104, 18399, 23613, 28799, 32100, 31920, 28429, 23338, 18271, 14028, 10815, 8514, 6849, 5578, 4608, 3864, 3281, 2813, 2416, 2077, 1805, 1596, 1440, 1314, 1207, 1117, 1053, 999, 933, 871, 783, 680, 574, 530, 532, 530, 513, 473, 443, 426, 373, 335, 372, 402, 401, 426, 437, 382, 317, 246, 220, 182, 116, 92, 117, 133, 139, 149, 153, 162, 146, 131, 137, 154, 153, 130, 112, 86, 83, 123, 170, 169, 154, 158, 167, 202, 185, 126, 90, 106, 103, 94, 140, 201, 197, 143, 98, 75, 74, 71, 73, 72, 73, 105, 141, 152, 142, 127, 98, 86, 70, 28, -8, 9, 63, 91, 115, 139, 152, 176, 177, 137, 65, 20, 15, -8, -28, 10, 74, 104, 97, 93, 99, 70, 49, 82, 125, 163, 171, 137, 92, 55, 35, 12, -5, 9, 20, 44, 75, 78, 80, 88, 85, 96, 132, 155, 143, 137, 140, 146, 144, 147, 132, 114, 114, 91, 86, 84, 51, 27, 18, 22, 46, 62, 16, -22, -7, 28, 47, 45, -2, -59, -78, -78, -108, -137, -116, -57, -7, -16, -48, -39, 28, 114, 138, 114, 118, 116, 108, 112, 132, 145]
5727A45Olm2o7k8Rj2m6k5nlj6k5l4%M6O8M7j4k2L8N5J7j5k4n0n5kM9N2Mm8k4kl2QK4j6k1K8
5714c5K7j7j4kJ5O5M7J4Mmj7n0j0O7Q2M4l8o9k2j7o3l7J0L9N0Ml2m1j2LKK6J2j0l1k8L5K2
5702A9k6n6n1rMK1M9M7L4ln7l8%J0K1J8KOlj9j4pL2K1j8j8rJ9J5k4m9j7K1LQM3Pj2%K3O6M6
5689A05Kk3o8r2p1nJ3K0M0M3O5N3Opk4l4l2l2mK4M4M5j0j6J3k3m5k0l8KM3K6qK9O8L7l8m0
5678D8%k4k4k8l2j8n0k5L9O1K4n7n7oM5L1J2k2k1j1j5PJ4jJ7K0J3%PO2M4k4k0J9L4K8J5%j9
5665H6m7m7nL5K3l5m1k0Jj8l2oK9L5K7J9J7K1K1M8K3m6q8o5qj7kL2M1N1j2n0l3n2m0j4J0M6
5654a13J9rJ7M5K2j2j9K8J5J8jl5l0NJ4J0j0oMqm1k9K3M5K7J6L5N7N0K0MJ8J2k7p0q0m8pL7
5642dN1L8k0n9l6j4k4l6pOj1j0pJ1K6LM4L5j8l2l8m2qM4J2mJ1L0L0Mk9rJ4K2j2l7JK7ml4l0
$$ y = [145, 151, 148, 106, 39, 11, 20, 8, -38, -63, -68, -71, -87, -112, -146, -146, -100, -32, 15, 1, -21, 17, 72, 89, 74, 50, 0, -55, -57, -8, 44, 48, 0, -24, -26, -58, -50, -26, -42, -63, -35, -8, -25, -39, -41, -26, 39, 86, 100, 104, 100, 83, 33, 23, 90, 172, 216, 178, 109, 87, 70, 7, -30, -20, 19, 69, 73, 41, 0, -12, -9, -7, 19, 31, 21, -10, -38, -3, 19, -7, -63, -114, -123, -119, -98, -49, -2, 32, 29, -28, -66, -66, -56, -35, -17, -15, -9, -12, -31, -45, -52, -20, 1, -17, -35, -44, -25, -10, -34, -83, -100, -79, -76, -68, -25, -18, -30, -30, -7, 59, 105, 107, 84, 16, -76, -147, -152, -139, -119, -79, -36, 29, 82, 88, 81, 57, 23, -9, -41, -45, -21, 23, 68, 58, 42, 55, 32, -13, -33, -71, -69, -26, 0, -8, 21, 89, 126, 88, 48, 48, 24, 0, -28, -60, -78, -128, -153, -114, -53, -29, -86, -143, -149, -104, -73, -61, -83, -104, -115, -130, -123, -109, -110, -93, -73, -60, -60, -53, 9, 53, 29, 9, 28, 62, 90, 105, 105, 86, 39, -8, -13, 22, 45, 10, -31, -51, -50, -68, -100, -106, -77, -42, -15, 4, 21, 42, 63, 111, 134, 88, 0, -65, -73, -90, -92, -60, -19, 32, 20, -30, -63, -115, -155, -169, -159, -113, -94, -103, -86, -41, -19, -31, -50, -22, -7, 11, 10, -25, -55, -50, -36, -26, -36, -42, -38, -46, -87, -116, -93, -48, -21, -5, 30, 87, 137, 157, 161, 179, 191, 164, 94, 14, -34, -41, -4, 47, 85, 65, 6, -30, -44, -68, -104, -111, -105, -116, -126, -133, -122, -96, -93, -49, -14, -32, -64, -102, -144, -152, -108, -96, -100, -89, -59, -29, -25, -54, -63, -49, -27, -39, -76, -75, -48, -52, -86, -116]
5629a16l3OO3O7L6Kl0j1J0Mn3n9J0M1J9nK1K2L8L2j9p4k6M3L0J4K7L2J0Lj2j9rj1l8n4m6m0
5617a25j3L6P4L9j3k0k2j0rl1jL4K6J7Lj2l0k6l0jL2K0K0K7PQJ1j0m9j5k6l0j0mJ1L1lkL8
5605e8N5N9L5Ml1k2j9o4p0k0M3Q1P0M3K1l3m4JJ6n3q0l7lK0J4l1m3rJ2M1N9J5k4k7MJ9Jk2
5593g7J7J0J1N8M1j0k4MK3rl6n6o0n2l7J3L8J4J4L6L3N0O8L4j0o1n9l5k8J1K1M1M9J4l6j6
5582fM3K4j2j4Mj3pMk7K2O3K6k1n1j0L8Ml5j5Pqj5k4k9k9lOrPN1K1l0m6mL1Pl4m5mM4K2lJ1
5569e9L3J8j3l8M0R0M0l8o5k7j3PM1L6RlM0K0k3n6l8nK3P5Q1L3j9m7m6k7k0j2k1k7l3m7k3
5557a14M1O0M3k0n0m9l1k9l7K4K2k6m5j5J1K5L3ooK1K5J8K1K3J1k4l8m1j3K8L2K4J1RK5J1
5546b6J8L5j8p3n0j8rJ9K9L6PMJ0J4Nj6k1nJ8K8K3Nj1k2nK6k1p6o4L0J11O7rl9l0k9olJ6J7
$$ y = [-116, -149, -143, -80, -13, 23, 25, -5, -16, -6, -2, -55, -114, -104, -63, -44, -49, -28, -6, 32, 64, 45, -29, -55, -12, 18, 32, 59, 91, 101, 104, 92, 73, 64, 53, 15, -39, -85, -125, -138, -102, -28, 11, -2, -22, -44, -54, -63, -94, -95, -61, -35, -18, -15, -27, -57, -83, -113, -114, -82, -62, -42, -15, -8, 0, 11, 1, -48, -63, -89, -119, -129, -133, -122, -91, -94, -96, -58, -3, 56, 91, 95, 64, 42, 23, -41, -111, -131, -88, -7, 63, 106, 127, 94, 50, 51, 67, 14, -66, -103, -106, -86, -72, -103, -146, -155, -143, -102, -43, -28, -52, -79, -75, -56, -55, -77, -60, -50, -39, 19, 60, 50, 26, 30, 53, 44, 8, -48, -108, -160, -197, -184, -146, -132, -118, -82, -49, 1, 69, 103, 93, 32, -27, -62, -90, -79, -58, -17, 32, 46, 10, -6, 37, 61, 49, 35, 39, 26, 19, 23, -4, 18, 81, 107, 86, 35, 25, 63, 67, 32, 17, 24, 16, 1, -23, -52, -81, -84, -78, -87, -80, -29, -8, -38, -84, -88, -57, -50, -84, -129, -133, -89, -67, -70, -59, -26, -8, -21, -59, -19, 71, 111, 73, 8, -19, -32, -25, 16, 52, 61, 58, 98, 118, 95, 39, 1, -4, 19, 94, 175, 208, 189, 142, 96, 69, 49, 37, 16, -11, -44, -91, -114, -73, -13, 30, 10, -40, -89, -120, -149, -186, -162, -140, -166, -211, -226, -215, -190, -157, -163, -169, -148, -123, -105, -84, -61, -50, -74, -112, -153, -166, -138, -106, -82, -71, -62, -37, -26, -8, 27, 9, -64, -114, -132, -141, -122, -93, -57, -50, -46, -36, -22, -17, -33, -54, -59, -41, -13, 10, 15, 4, -18, -23, 3, -18, -94, -158, -128, -17, 50, 41, 2, -28, -57, -63, -66, -50, -33]
5534c3K1J8J0Nk8j6kK9L4J5k4m8pK8L5L6K7k4k4m1o2m8j0RM1L6J%lmJ6O1M6J0n1r3k8J4K0
5522c4M5L7J5ol5j6l4m5o5n8mK2J4K9K7L9M6K6J8Lj0k0ONm4k9J7j8k6jM9O3L5K8L6J9l6r3
5510Ep0k0NJ4qRJ5j6j8J2J4j%k3l6j7qJ6L8lrJ8K5K3k9l6k5Nj3l0L8N7L5l0l3L8N5J8mJ9J6
5497D6pLJ3Nnk3nj6n5o7l3L9P0M7PPj5k0k2JJ1MK4K8K0lrJ6J8j1l3j2J5J8L0pn3l5OJ4J3L8
5484F2M9%o8n1K8M0pm7m0K3L6l1o9o8l2J1L4Rj6KM1K3J1J9rj9K5L2%j2qmj9n5k8M7O6L8MJ
5472A8Jj6j4J1J7jj6rj0K5M8L1%o4p5j5L4L7K0J8K2K1qnK8K5l2q4r0l8M4N6K4J9ql4l8k0J9
5460e9N0P4M1m8p2l4Nj3k2k3k5J0K8K4J4N0O3J9k9m8n8j8J6J7j5kK8nj5J8M7N1L7K2k8qj2
5448H0n1m4J4P4N4Qk4j6j2m8m1kK5M8L5k8o2qMk6l4oK3RjJ6rk5OL1L7L5J6K6nm9o3n5LL8O6
$$ y = [-33, -12, 6, 16, 21, -7, -23, -25, 4, 38, 53, 29, -19, -26, 2, 37, 73, 100, 76, 52, 11, -51, -99, -109, -100, -59, -23, -22, -22, -25, -29, -13, 48, 94, 104, 53, -40, -68, -54, -34, 11, 48, 63, 57, 22, 6, -28, -73, -138, -196, -200, -178, -164, -135, -108, -69, -23, 3, 21, 24, 14, -6, 0, 5, -39, -68, -51, -69, -95, -96, -47, 16, 51, 79, 115, 134, 98, 5, -65, -85, -80, -66, -74, -65, -50, -66, -84, -72, -58, -59, -59, -82, -118, -135, -143, -127, -89, -92, -101, -83, -58, -35, -64, -100, -125, -120, -133, -163, -125, -68, -33, -63, -96, -58, -3, 15, 11, 30, 46, 39, 42, 55, 60, 55, 32, 27, 11, -44, -111, -144, -105, -35, 12, 19, 26, 11, -9, -31, -30, -19, -15, 9, 37, 57, 54, 45, 61, 79, 68, 35, 23, 38, 56, 86, 79, 26, -9, -3, 11, 24, 62, 111, 111, 43, -8, 20, 60, 53, 6, -34, -11, 25, -6, -75, -143, -175, -164, -130, -121, -137, -135, -94, -71, -60, -41, -50, -69, -44, -12, -12, -24, -32, -36, -55, -110, -138, -91, -25, 13, 17, 18, 19, 3, -11, 0, 17, 16, 0, -9, -19, 6, 54, 85, 85, 21, -54, -69, -35, 2, 22, 40, 62, 83, 75, 70, 98, 123, 91, 7, -83, -121, -77, -21, 3, 22, 14, -20, -58, -78, -59, -9, 65, 106, 58, -14, -48, -43, -56, -78, -101, -126, -116, -88, -64, -50, 0, 63, 82, 53, 5, -53, -71, -55, -38, -53, -55, -27, -32, -47, -29, 18, 69, 106, 128, 100, 92, 80, 29, -15, -1, 73, 127, 135, 111, 95, 83, 35, -6, -8, 17, 65, 100, 72, 10, 2, 6, -20, -54, -60, -37, -28, -29, -13, -22, -47, -41, -10, 27, 62, 78, 104, 99, 50, -13, -68, -65, -27, 39]
5435C9M7pj9k6m6j4J6k5j6j0NN0Q1L3L0Lm5m9j9j8l0lJ8mJJ6M3M8QlKOj1k5kJ8k5n1j2J1r
5423Fk5k0m7m4J1Oj0nK5L8K8j0l0m3j8K4K2L8M6M6K7Jj4m9l8J3K8j3k7mK1N7N3M5j0o6p5l3
5411d6ROk7j8oLJ8PJ3M3N3L1JlJql1j2%KJ8J0J9n3m4K6K6k8k2Lj8NMPM0N8J1j1kkj2m6k5J9
5397A9Qk0l9k3J9Q0P3k1r0p4m4mJ1j1j7JpJ2M3L9L1pm6j9J3K2M7N6l1q6n0%J1PJ7L0J4jl0
5385f7j0j8j8lQK9J3K3nj2K2L6K9Qpl1l6k4Jj5l4n5m2K5R3R7N5Ol1n2o0l1MK4J1k2K2L2l0
5373f5l9j0JK4L0J2K8N0L3m6l9o0l8J7N4O2Pqj0j9K1K0j7l2NJ6jK7K7ql1m0QM6Qj2j5j5k3
5361c2MM9L6L8M3M6j9n0n3n2q4n5K9O2L1j%k3l5j0K1J4nJ1on4m6rK0Lk2Kjj9%mJK8M2J4J0
5348g6L0Kj1l2k2RO6Q1K4m4l3j8k5j5K9J7k9l6l2jQNLOJ2j7l3J2RN4N9Rj2j4P%oOk5k7j4k
$$ y = [39, 86, 79, 60, 34, -12, -26, -10, -35, -51, -61, -56, -6, 75, 108, 138, 141, 96, 47, 28, 10, -20, -23, -5, -9, -8, 8, 51, 99, 107, 104, 106, 112, 101, 76, 74, 92, 67, 16, 4, 15, 6, -19, -39, -86, -130, -119, -113, -123, -128, -103, -65, -37, -47, -77, -120, -138, -114, -92, -54, -8, 38, 65, 66, 52, 3, -35, -22, 6, -7, -34, -38, -17, 40, 93, 138, 128, 62, -13, -46, -37, -31, -58, -76, -82, -79, -61, -54, -41, 2, 55, 86, 87, 84, 85, 77, 46, 34, 34, 36, 54, 64, 83, 30, -14, 12, 38, 10, -12, -9, -27, -22, -18, -11, 29, 87, 98, 87, 85, 83, 71, 25, 0, 19, 27, 7, -32, -55, -36, 44, 117, 96, 6, -68, -112, -116, -105, -116, -133, -132, -139, -127, -84, -45, -14, -21, -67, -86, -73, -51, -4, 52, 21, -65, -115, -115, -104, -97, -80, -50, -36, -37, -67, -77, -95, -113, -116, -108, -79, -66, -43, -48, -60, -38, -2, 27, 35, 28, -3, -39, -63, -62, -77, -111, -166, -208, -183, -90, 7, 62, 68, 37, -15, -75, -106, -102, -78, -67, -89, -67, -35, -65, -104, -114, -113, -89, -59, -47, -19, 31, 64, 18, -21, -81, -119, -102, -48, 14, 21, 13, 3, -16, 5, 25, 8, -24, -19, -3, -4, 23, 50, 42, 11, -29, -21, 25, 33, 21, 6, -9, -32, -28, 21, 57, 95, 138, 184, 165, 115, 62, 10, -74, -129, -100, -38, -7, -8, -8, -31, -66, -76, -55, -41, -46, -35, -41, -95, -141, -150, -130, -127, -149, -147, -148, -167, -167, -171, -170, -142, -100, -86, -76, -46, -44, -55, -87, -109, -100, -34, 47, 71, 27, -6, -24, -49, -64, -35, -18, -47, -83, -115, -116, -108, -103, -100, -94, -82, -99, -132, -120, -111, -57, 2, 11, -1, -15, -8, -8, -14, -8, -33, -60, -74, -76]
5335g6JK4O8Q0K6Lm9r1r3k2J0l0j4J2RNK5M2J4kQORK6jrK8K8loK4J4k7n1l6k2%j7l7j3K7L3
5322g7Om1l5J9O4M5K0QJ7L1k1l9j8j4m5m0JK1J8Oj0l3j5J7M2M6j4m1r%j4K7N1nn5l0RJ8K4
5310f6Ok7pK1M0N2K9qj3ormj9k5L3N1Lk8l6jmm6l7J7K8k3l5j6k9j5RK7Mk6j7L2L8Nn9k9K8
5297a62N8N1K5K6pm5m6o3k0L5M0K8M0O0N0Qj2j1j3j2j2l4rM8L9L1J2lKj0j6kQk4l5k9J3K6
5286C5N0L8n2p7pM6M2kl8n5n4k1O2R0K0k7n6m0ok7j4mJ7O9M2l2m2K6L2l9l3K0P8O4m6q1m3
5274f5oK4J2j1J9K4J6pj8J2Jk5J1L7Pl5m5j7qQK3ol2%L4K2rNN9P3J0o9n9l8rrkL0L8K0j0j4
5261iKM6M9k7n3j9K4R1P2J4%ml3m6j6kj2k0o0o2k1QM4K5J1L4L7k5o9m5mLlK1J2l2n3k0K6M7
5249f9N7N7J1n6k5L0Om2m3J1M3L7J7K5ro2l1L6j1n2k9MJ4ML4L8kJ2K4J2k1oO%nK8N3J3j6o9
$$ y = [-76, -75, -51, 17, 97, 123, 126, 77, -14, -107, -129, -119, -149, -163, -151, -142, -137, -112, -70, -56, -58, -50, -44, -35, -9, -10, -19, 9, 37, 34, 28, 52, 66, 39, -12, -48, -70, -70, -87, -124, -137, -110, -77, -71, -112, -147, -128, -64, -19, 1, 9, 26, 57, 36, -3, -21, -35, -80, -120, -119, -98, -80, -74, -84, -117, -132, -115, -73, -27, -41, -82, -91, -91, -105, -78, -27, -32, -87, -117, -108, -90, -66, -60, -87, -94, -73, -33, 19, 48, 40, 27, 21, 12, 8, -11, -36, -3, 48, 51, 23, -13, -14, -18, -64, -101, -84, -56, -79, -114, -130, -159, -174, -165, -138, -134, -160, -177, -145, -107, -102, -161, -190, -162, -104, -53, -28, -2, -9, -54, -100, -163, -183, -148, -108, -80, -40, 20, 70, 78, 66, 55, 42, 30, 18, -16, -25, 23, 62, 93, 105, 102, 104, 94, 78, 76, 84, 60, 25, -4, 9, 35, 85, 123, 71, -6, -13, 33, 75, 73, 35, -20, -74, -95, -33, 57, 77, 50, -6, -46, -52, -79, -93, -97, -80, -11, 31, -1, -43, -17, 15, -24, -57, -37, 41, 105, 59, -22, -65, -71, -47, -35, -46, -27, -3, 13, 6, -12, 0, 1, -24, -13, 24, 31, -4, -49, -66, -74, -66, -43, -49, -81, -81, -47, -25, -34, -29, 30, 103, 113, 44, -15, -53, -62, -71, -73, -43, -5, 15, 5, -9, -7, 39, 88, 61, 8, -11, 13, 104, 176, 190, 190, 186, 153, 107, 91, 89, 77, 57, -3, -65, -86, -78, -34, -9, 2, 36, 73, 48, -21, -66, -70, -67, -70, -49, -37, -69, -122, -142, -116, -69, -12, 45, 56, 0, -25, 5, 11, -31, -74, -63, -20, 17, 34, 59, 50, -12, -43, -7, -18, -70, -99, -95, -81, -77, -43, -5, -7, 5, 29, 41, 20, 14, 20, 20, 15, 43, 96, 109, 93, 24]
5236B4r8o0J0N9K0PL8L8j0n5n0k1J1J2J6j9LM6M0J8%NJ6N2Qm7k7NjJ7kj7L3M4lm5k1kQK%m3
5223A1k7oj6j4j0j8jmlK5j0k9m3n1oL4O5M0J9J9J6J6j4j2J4K4K9rn2l7nk5m8m2k7QL8L0jJ4
5211a08K4J8mj3j7JK1J5J8L5kn0k4LoMJ2K7L6Lj1k8m0RK8oj7l8k8K9L7mj0%qj5K6M9L2om8
5198e6m7k2mkJ9N2M5K9RKj1o5r9o1J8O4N8Ll4k3j5J1M4J3LK3pj3j2oojK7k2m6pRJ9J8K1Qn
5185f9PK2lj9L5K7JL3L3l2l4J0ok6l4%N3P9M5k1l2k4k7l4k2Lj3j2l8l3K9K5m9j3N4O1K0l0
5173c4J2L7kj9j3jKK9K3J2Jj1PJ4L6K7j7o4n4j1k3m4p0KP2L2J2JK4K6lk0l7l1qOK9L5N1No6
5161c3l7M5O4jk4k1ql3o9l6K9O1M6l2l3mL0K4k9m9K0M4k3n1nM6O1J0l6j1K0K5Jk7j0K9O7Q
5149E8l8l9pK2K3rn1q9k7L2N4L3m3n1l6o4n3rNjJ2L4N4N5K3J4K5Rj8j0J6om7j6J0kK6K4K0
$$ y = [24, -74, -134, -124, -65, -45, -38, 0, 38, 28, -27, -77, -98, -87, -75, -59, -78, -75, -29, 11, 29, 29, 34, 50, 102, 110, 63, 36, 41, 40, 57, 55, 38, 71, 115, 112, 67, 46, 44, 52, 54, 54, 11, -16, -22, -38, -52, -62, -80, -81, -85, -88, -63, -73, -102, -145, -196, -202, -168, -103, -63, -44, -25, -9, 7, -7, -19, -5, 19, 48, 39, -13, -50, -55, -80, -128, -170, -197, -189, -151, -121, -122, -108, -84, -66, -70, -83, -100, -99, -78, -63, -45, -10, -12, -62, -86, -83, -89, -85, -73, -46, -10, -7, -18, -46, -86, -77, -49, -55, -72, -110, -138, -109, -72, -76, -86, -86, -94, -109, -83, -34, -2, -8, -56, -103, -125, -129, -131, -112, -60, -15, 14, 23, 25, 14, -51, -150, -211, -193, -129, -71, -68, -102, -125, -140, -129, -85, -72, -69, -46, -53, -66, -78, -84, -90, -91, -64, -86, -132, -139, -130, -111, -93, -72, -64, -69, -62, -40, -43, -62, -27, 0, 1, 34, 67, 35, 1, 11, 5, -21, -55, -55, -2, 77, 122, 101, 69, 45, 18, -16, -38, -35, -48, -60, -98, -131, -102, -77, -126, -139, -85, -24, -4, -34, -22, 15, 13, -6, -19, -20, -18, 11, 34, 46, 47, 36, 43, 57, 93, 120, 103, 39, -15, -26, -49, -93, -163, -161, -89, -57, -45, -44, -20, 6, 3, -17, -54, -85, -93, -87, -58, -23, 28, 33, -33, -70, -25, 39, 38, 14, -7, -15, -48, -117, -153, -124, -63, -17, -49, -82, -86, -56, -32, -61, -110, -90, -46, -69, -120, -125, -79, -18, -8, -44, -55, -35, -10, -9, -36, -46, -17, 50, 58, 20, -19, -26, -4, 19, 10, -41, -130, -157, -125, -71, -38, -81, -132, -168, -232, -285, -294, -289, -290, -278, -244, -190, -135, -112, -98, -73, -64, -82, -92, -76, -82, -129, -145, -135, -137, -111, -87, -67]
5137f7N6O0Rjl5p6m0jqk5j0L0M9ol9nK4M4K0l8m0nM1K3k4l9l0J0M7L0K6M6K5pM0M4j7o5n8
5125a2mpj8nJ6oj9j1J4j0l5M2M2k8n5k6K8L4J9nk9m6k9NM4O1O0J1k4k1j6l0k1K8L3K1K4rn8
5112d2o3m0oO8Q7Lp6n3pM6O0K4j9j9JKROJ2J9k9n5l1oLj4j8m8k5%nJ6K3mj4rmK3K8M5M0J0
5099f2N7P0j3n7o0k0J3n5m0O1J02M7k5m5j7J1K2K5Kk9k4j0rnrl8l3k6ML6M7K0jJ2K3RK3K4
5088C0l2k5J2Lk0mqQJ8OJ0k1jk9j0N0M1ppJ4k1m9pL4M1jl7j6J3kj1MJ7k2o8n3kKj5Kl1o3m2
5074b99qM2M6L5J8NJN4Q7L2m3k8J9K2k6m4l6k0MNOK8J4rrn6p1j9j2K3Q5O2L3k0p0rQ0O6Nl6
5062d3n7n2m4j7K0J2PL7L6K7mm5n1k2mK4N6po2l6K9Q8P7kl2rPK5J5jk5j2L1M4L0J0%k8l8j
5050a7j5l6J2K3jl2m9l1pJ2KK5L9J3KL4M5j2JJ2j9l6j3oLJQJ7M8L7K6M6J9lk6m1l1J7L1J3
$$ y = [-67, -11, 49, 58, 57, 22, -54, -94, -95, -103, -128, -138, -108, -59, -65, -104, -109, -85, -41, -21, -59, -99, -104, -63, -40, -64, -103, -133, -123, -76, -46, -20, 26, 51, 44, 84, 128, 111, 46, -12, -16, -23, -41, -46, -30, -36, -55, -66, -52, -62, -97, -55, -13, -41, -96, -122, -94, -60, -41, -46, -75, -121, -150, -145, -101, -40, 20, 31, 7, -14, -30, -60, -81, -53, -20, 1, 25, 16, -42, -105, -145, -151, -83, 4, 7, -69, -122, -129, -83, -23, 1, -18, -37, -36, -34, -25, -19, -7, 12, -17, -72, -103, -109, -106, -120, -138, -186, -211, -211, -216, -200, -177, -181, -195, -204, -208, -185, -157, -112, -72, -62, -5, 65, 52, -5, -65, -85, -72, -127, -167, -106, -4, 43, 18, -27, -44, -33, -11, 14, 16, -13, -37, -47, -56, -61, -70, -108, -141, -167, -163, -127, -80, -60, -61, -49, -26, -17, 6, 30, -2, -27, -15, -12, -32, -36, -44, -36, -18, -12, -2, -23, -24, -53, -63, -13, 28, 21, 14, 28, 7, -42, -49, -15, 26, 25, -12, -28, -15, -17, -28, -24, -7, -29, -97, -150, -152, -150, -165, -163, -194, -257, -299, -307, -265, -219, -184, -166, -161, -160, -106, -19, 13, -30, -58, -39, -17, -43, -87, -123, -143, -139, -134, -128, -100, -86, -95, -104, -160, -231, -250, -262, -239, -154, -92, -59, -79, -149, -158, -78, -12, -7, -43, -100, -152, -196, -213, -193, -181, -174, -137, -101, -74, -78, -123, -174, -196, -200, -176, -120, -127, -189, -225, -196, -108, -31, -33, -65, -74, -67, -42, -27, -28, -53, -65, -34, 10, 40, 50, 50, 22, -16, -17, -32, -68, -56, -33, -34, -66, -115, -146, -153, -141, -139, -114, -75, -62, -60, -26, 19, 7, 8, 20, 1, -35, -48, -54, -51, -50, -42, -25, 23, 60, 86, 132, 151, 148, 122, 81, 50, 67, 98, 111]
5037A11k2qj4j9Nl1k1K2k9n5qJ0JL4N8M6Qj5k1l9m2l1j7qnpK3M8J2%K1rj7J0k3o2j7L8M3J2
5025a8J4Rk0l7Jjl3%RRJ4l7oL2K8J2m3m0orj6K6K2j2RO9Q1J7l7j7Rk1k3K0Om3j4O4O2L6nk6
5012H5n1m7j2K0M0M4Nm4m1k1j1MMm1l5N7J01Q7On2l6k0j7k1l6j4L1J8J8k3l6k8j7l1m4qM5
5000a21P6M0QJ6oOJ3k9l9k6l1j6J6K6Lj5l5m8l3J7M5N5Q3N2nk0k1l0j2J1Lk1k9qK2M8on8j5
4988h4K7J3J0O2M3lm3l9J1j4n3n3JL8J2l6m5j3J6K9%k5j8L4N9J8knmK5P2N2om5n4k3QLJk0
4976e1o4m8RJ5lJ8L5L8N4Rk4k1RL8J5ql1l8n2j7L6P6R0L1n0m1Oj0nMjJ5N5M2j1qLk2m3m9k0
4963a9ML2L5J6l2j4rk3Rlp1m2Njj6PL8J8J7K8j3l8l8l5lkJ3O6R0L6l6r2p0pO3N5NLj0k8oK5
4950d3M7L4ok3k5j5k6J7K0oJ0L3Ml4k2J1K1k8k5K2L6K7Nj9l8k3lL6P3M4%jK4ml8n6l5pj2j9
$$ y = [111, 89, 81, 67, 48, 53, 22, 1, 23, -6, -61, -69, -59, -58, -24, 34, 80, 88, 73, 52, 13, -29, -60, -77, -85, -90, -97, -74, -26, -14, -14, 7, -2, -19, -9, -32, -94, -111, -73, -30, -18, -4, 5, -15, -52, -51, -52, -85, -85, -76, -67, -53, -90, -96, -64, -36, -24, -67, -107, -113, -122, -138, -112, -90, -102, -93, -24, 57, 74, 37, 20, 29, 8, -15, 5, 11, -32, -46, 18, 80, 116, 111, 85, 34, -13, -25, -5, 35, 79, 84, 40, -1, -22, -33, -29, -25, -66, -101, -44, 57, 144, 150, 98, 62, 42, 25, 4, -32, -46, -15, 3, 21, -2, -38, -66, -83, -114, -158, -166, -121, -45, -5, 3, 19, 13, 19, 32, 3, -36, -62, -93, -109, -93, -67, -64, -79, -114, -162, -195, -178, -133, -78, 5, 57, 52, 32, 11, -19, -31, -20, -17, -38, -67, -75, -53, -5, -11, -69, -84, -57, -44, -34, 28, 71, 68, 25, -14, -3, -17, -70, -123, -122, -84, -72, -108, -153, -166, -150, -121, -121, -146, -164, -130, -71, -53, -55, -60, -64, -39, 33, 85, 79, 34, -20, -43, -35, -32, -31, -51, -115, -163, -154, -139, -142, -124, -89, -51, 3, 12, -12, -33, -24, 14, 29, 21, -10, -48, -100, -117, -81, -5, 85, 116, 66, 25, 31, 21, 16, 20, 19, 34, 89, 131, 120, 112, 115, 93, 50, 1, -19, -15, 17, 52, 68, 36, 22, 13, -10, -1, -4, -75, -117, -112, -113, -129, -122, -84, -66, -49, -21, -34, -72, -110, -145, -148, -150, -137, -71, 19, 55, 19, -73, -143, -150, -87, -32, -27, -24, -34, -62, -68, -43, 4, 38, 32, 9, -16, -31, -57, -40, -20, -26, -16, 17, 21, -13, -35, -24, -3, -31, -56, -34, 2, 29, 34, 15, -23, -46, -49, -13, 60, 104, 104, 103, 127, 123, 85, 29, -6, -13, -25, -44]
4938d4nJ9K3N1N6Qj4J9N4K0l8m7n7l6Rk5o2m4J8N7K6j4LKJ0M4M2Rj9l6j2l1m2j5NK6N6J3n5
4925b6k9J1J8k7j6K0N5M3MJ6J7m8p6n4k1Ppo0j7K2J0M3N8K3J0M1K8K1k3n3l0rj1j7%K7J7p
4914d0k2OJ7LJ6L7J9oj5j0K7J8qrk7k4j0nrl7k1K0oj2J5lnJ0KRmk1K0M4M2K7K1OK1J0l4m9
4901A3nj9n5j8J3R0J00L0j0k7m1j9Pj0rJ8j5n2m5KM0L9J1k0j2kl8l5k2Jk5j4K4L0J7j9k8J1
4889i4N2J4l7k6OL1L8Pl3l2j7l8NM1L7K9Mk1j9k0l7NLKK9L4L3kj9Rpk1J3N2K3jl8o4l6k3j5
4876a33PmPnKQJ0P1P4K6jm6m2J5M8Nn1n9m3Nqj3K3M5K5Qj2k0k0J1O1O1opK0rn0m5j1J5L3L6
4863C1J7j7l4k7lL8L6Ooj8l4k6M3O1oj3k8l8MK8K8Ko3p8n8m7l4%N3N4N3P8P1j6n4j7l1k7J3
4851e9L5nl5%L7O0M8Ql7q4o4k6JJ9j2j1j9k6JN1N9M4Om9m7j9J2K6KJ3K0NPMJ1K0J8kNL3J8
$$ y = [-44, -49, -30, -7, 44, 100, 108, 94, 113, 167, 187, 149, 102, 45, 9, 18, -7, -69, -113, -95, -38, -12, -26, -23, -21, -11, 33, 75, 84, 65, 29, 17, -14, -56, -71, -66, -40, 16, 29, -26, -55, -44, -26, -53, -69, -49, 6, 49, 53, 69, 86, 38, -38, -92, -113, -106, -113, -173, -190, -168, -158, -115, -57, -34, -24, 17, 45, 66, 43, -10, -40, -49, -60, -77, -77, -50, -33, -40, -62, -56, -39, -36, -20, 17, 36, 30, 15, 5, 32, 50, 42, 33, 6, -18, -28, -33, -42, -79, -100, -80, -86, -98, -83, -86, -91, -81, -79, -70, -74, -95, -75, -31, 11, 38, 59, 65, 86, 96, 62, 13, 8, -11, -66, -84, -71, 19, 119, 149, 139, 112, 71, 52, 59, 49, 40, 58, 43, -9, -54, -52, -12, 27, 38, 18, 6, 4, -34, -69, -91, -90, -115, -129, -105, -75, -58, -77, -105, -94, -42, -28, -65, -91, -85, -54, -16, -9, -42, -74, -91, -129, -124, -83, -46, -17, -13, -34, -53, -73, -110, -105, -102, -100, -71, -37, -4, -6, -25, -16, -23, -44, -31, 21, 44, 43, 5, -59, -95, -118, -133, -126, -130, -123, -128, -126, -118, -108, -37, 37, 63, 62, 16, -26, -11, 37, 42, -9, -68, -111, -106, -114, -127, -104, -59, -34, -26, -38, -58, -78, -67, -6, 55, 49, 42, 62, 53, 3, -42, -53, -38, -5, 31, 48, 31, -3, -30, -33, 5, 41, 47, 41, 23, -11, -37, 6, 67, 61, 48, 20, -18, -14, 14, 42, 44, -19, -97, -155, -202, -236, -236, -183, -129, -76, 2, 73, 57, 3, -14, -45, -72, -59, -24, -29, -64, -64, -27, 33, 81, 89, 52, -32, -96, -122, -121, -102, -114, -125, -144, -170, -169, -118, -59, -15, -9, -58, -105, -124, -112, -86, -84, -71, -51, -46, -39, -35, -24, -4, 14, 12, 17, 50, 68]
4838F8k7p2m2N1O0J1k4m0m6j7Lj9k1QM6L2kJ2K5j4n2qJ3l0k7%J9J5k1l6oK9M3J9PN0L2K1N3
4826A13j9m8l4n3l5j3RPK5N7K2qj8l7p0n9J2M9L8qk3kL4Qqj2k4n7o2j0P7P4K4K9L8Pl3j5K4
4814aNompn3p0k2M2M1j4k5j9l8k9J5P3O8L4K6J8J2n1l4K2joL7M9j3p4o1j4lLk6q7m3M1J9K8
4802a68P4O9M8M2Mm3n0j3K5J1j9m3k9mK6j3l0LK6N1M2JKPrJ8jk4n3n4j9Mp%M5L9K7J8Kj7m1
4789e3m6kK8O0N2Ok3j7j8rJ8J3K0J0%m4m0k6K1M3J7L8k0m4qQol1kj5p7n3k1L2N1N7M7jj8J7
4777c6K2Qj4l7o0m3nJ8M6P1K5rrqJ0K7K7J5J7Qj3o3j6J8l0k0L2L1j7l5l2jkRj0l8%mPL2K8
4764e1K7M4L9j0k4m0k8Kkl7n1n0n4%L9K7K6L9K1M5K5Qj3oRMk2n7n0j5J8N7L1rk0l1J8P7R8
4752H4N0k7p6o3j7L7N2Rj8k1m6qmKO8M8j2k7m4pN1O3M7Jl6j5J9pn0r2l8K2N2J9j5om9o7l0
$$ y = [68, 41, -31, -73, -22, 38, 49, 25, -15, -61, -78, -75, -94, -115, -107, -61, -29, -31, -19, 6, -8, -60, -68, -55, -85, -112, -112, -93, -78, -99, -135, -141, -112, -69, -50, -43, 7, 39, 60, 113, 94, 46, 12, -41, -76, -89, -80, -73, -48, 9, 31, 23, 5, -32, -102, -161, -149, -100, -62, -70, -93, -95, -61, -53, -61, -73, -97, -154, -216, -226, -149, -75, -51, -22, 16, 23, -10, -25, -1, 4, -2, -6, -13, -66, -136, -158, -116, -75, -89, -114, -133, -171, -200, -185, -112, -44, -10, 16, 34, 46, -5, -39, -17, -18, -24, 13, 62, 49, -25, -86, -100, -103, -100, -126, -213, -256, -215, -196, -168, -94, -25, 23, 65, 69, 26, -24, -37, -12, -1, -20, -63, -92, -96, -70, -83, -113, -110, -84, -33, 9, 10, 12, 19, 10, 28, 27, 3, -50, -104, -123, -119, -126, -126, -81, -42, -15, 3, 5, -12, -53, -99, -101, -73, -13, 39, 45, 22, 5, -13, -22, -4, 9, 29, 39, 39, -5, -45, -71, -50, -7, 10, 48, 28, -16, -24, -16, -22, -53, -55, -70, -147, -200, -221, -189, -138, -81, -34, -35, -53, -36, -14, -6, -20, -57, -117, -160, -165, -147, -101, -30, -5, -14, -23, -31, -21, 6, 33, 48, 65, 73, 60, -3, -19, -1, -31, -51, -19, 12, -5, -40, -72, -73, -75, -66, -76, -114, -114, -118, -111, -79, -51, -24, 20, 59, 49, 25, -15, -43, -41, -43, -80, -131, -181, -235, -235, -196, -169, -143, -104, -83, -38, -13, -5, -18, -24, -15, -11, -33, -90, -140, -155, -137, -80, -49, -58, -78, -109, -91, -14, 84, 134, 107, 31, -32, -49, -12, 40, 49, 31, 10, -36, -44, -48, -46, 22, 70, 58, 31, -13, -20, 31, 94, 141, 142, 106, 91, 110, 103, 53, -39, -77, -55, -3, 16, 1, -5, -54, -121, -151]
4740a51L2Q8P5L2jl3m0k7opl6m4l5l3j8J8M4L1K6N3J4j9OK0K4L8J2k0m0mN1M1QmK4po2n1j5
4728a6k3k5rnpk0J1L5K0POL7K3K3K4Pl1o4m8k5j7jM7O1L9K2K0L5L3K2lo6j04m4J2L7J0jPJ9
4715D8Qj4k1mM1N1Nm1l7Nk0n3k4K0jKL8K6mk5j3Ln0n7K6N6M4K0J9K4j2j1j6l5k2K4K3k3j0
4703a0pk0lK8k8o2j5%j4J8K8M0N6Qj6nJl5o8l6l2m9j4M8N1J8Nj2m0p7l8M4Q2O1N0Ok7j0J1
4691f3K2mm3m4k2J1O5K7oJ6k7p0m1K8R5J27M8o9j08k5M0K8J5K7K0J3pj1qj9p0n3%kK1M5O6
4680B2J8ok4j9Jk6J2N5K8Mj9m8m1l1k0K1O1M3j7k5L7K7Jj7p5o4l2j4RK%K1k1l7oK5K7J7kP
4667a06K1K2J1l5j8J7K0J9j0l5j6jj7n4l7j9j1M8Q5O5J9k6k8k4m1J1O1N1K4ql6o0o4l0M1M5
4656a16ok3l2j8J1L0L0M5P7P6ml4n8j6K8K7m%L5L9L6K0j3m7o3o6l5J4N0L1KJ6L8M9M3k2n6
$$ y = [-151, -119, -31, 44, 76, 75, 42, 2, -25, -31, -38, -74, -118, -153, -186, -204, -186, -142, -111, -85, -32, -18, -37, -31, -11, 13, 51, 63, 43, 3, -1, 50, 91, 99, 95, 119, 112, 50, -1, -16, -39, -64, -73, -78, -85, -105, -94, -59, -39, -32, -26, 11, 34, 57, 81, 88, 57, -7, -55, -80, -97, -98, -51, 10, 49, 71, 91, 126, 159, 181, 178, 112, 8, -36, -24, 13, 23, 22, 29, 48, 56, 42, 21, 17, 58, 109, 114, 73, 36, 41, 21, -32, -56, -36, -37, -35, 3, 29, 25, 0, -13, -10, -60, -117, -91, -35, 9, 29, 48, 72, 60, 49, 33, -2, -24, 0, 23, 0, -10, -17, -37, -40, -12, -40, -102, -117, -117, -131, -113, -85, -45, 11, 19, 3, -2, -1, -36, -104, -140, -172, -221, -235, -187, -136, -118, -113, -125, -165, -242, -280, -236, -154, -93, -43, -37, -64, -74, -63, -41, -45, -88, -132, -154, -143, -78, -51, -57, -41, -68, -138, -179, -151, -56, 71, 119, 50, -58, -83, -43, -15, 0, 27, 47, 60, 53, 42, 34, 15, -55, -108, -108, -110, -89, -44, 22, 40, 34, 10, -9, -8, -34, -22, 33, 61, 65, 46, -2, -43, -74, -94, -73, -12, 31, 14, -11, 26, 53, 54, 37, -38, -102, -134, -148, -139, -137, -137, -116, -137, -174, -180, -155, -128, -111, -113, -106, -85, -63, -52, -87, -105, -88, -68, -49, -59, -94, -110, -111, -128, -182, -219, -238, -249, -201, -116, -51, -32, -58, -86, -110, -151, -140, -79, -28, -4, -12, -48, -108, -172, -202, -161, -116, -122, -145, -177, -195, -184, -154, -124, -79, -2, 74, 70, 36, -22, -38, -10, 17, 13, 13, 48, 87, 123, 143, 130, 83, 20, -46, -81, -67, -17, 14, 16, 32, 70, 119, 162, 140, 84]
4644H4l0rj1j3l3NP6O1j5m2l0l0j4k7l5k2j8J1pk0mNj1J3M4M8J6k1l5oJ6jj9qM4L5Lql7m7
4632i2k4k7k5J5M3Jl5pJJ5M4N0RJ2L8K2l3k3K1Mk3l4k7NKnL2M8L9L4J0j5NJ0qk2j2l2n0l4
4620f8j1L4R3P2K8pk4j5Km1p7k7%k0j3mj1pJlk6mK1K8Nj3J1J7Nl1nK6K9mj2j7k7kM3M4K2j3
4607am0k4l4o7m1L7M4K3M3J8J0L0J9oj8nJj8n5m1K1O9M3K4j6n7l6RNj9j4JK4Ol2k8j4l2l1
4595b02j1MM3Q2N8Ok3j0pj0j1NN1N6K3qk9qkpk5rk0m9l6J1K3K2ll4j4L7L6LMJ0lqL7O9L5m
4582H2l5p7p6j5J0J0Qj3OL0K4Ll3l3rk3J1N2P9O4J2J0jm9r3p5l4QNmLJ3L3L2J2kJK8L2Mnj6
4568b1j4k5rK2j7j6OnpK7M2J9K0J9K8pj6J4K2j4o3p2k1J6j3j6O1Q5jk5j6k1j5LMj9l5j5J6
4556g9J1QM7O9M4K1mJ0Mm9q9l9OJ2J0j9l6K2O3QjJ4Ln7p4n7l9jMJ5M8P1P5O0Mo0m9l5n3l8
$$ y = [84, 54, 45, 34, 21, -12, -7, 69, 130, 115, 73, 43, 13, -1, -28, -63, -85, -103, -92, -99, -119, -123, -118, -129, -116, -72, -24, -8, -29, -64, -70, -54, -55, -74, -82, -38, -3, 0, -8, -45, -92, -116, -143, -168, -153, -110, -109, -144, -151, -150, -135, -91, -41, -32, -20, 18, 40, 7, -16, 5, 9, -14, -48, -75, -70, -68, -73, -41, 7, 46, 80, 90, 75, 80, 90, 82, 60, 48, 16, -34, -68, -79, -45, 48, 120, 148, 141, 117, 102, 104, 63, -14, -41, -41, -61, -74, -78, -89, -96, -95, -98, -124, -128, -107, -79, -74, -87, -76, -59, -54, -85, -90, -64, -35, -39, -51, -68, -95, -97, -54, -10, 12, -1, -41, -65, -99, -166, -207, -170, -126, -103, -60, -42, -32, -2, 17, 11, -7, -12, -11, -29, -84, -125, -104, -35, 8, 32, 16, -41, -77, -68, -63, -82, -96, -95, -71, -65, -97, -125, -139, -171, -202, -213, -209, -166, -84, -26, -20, -43, -53, -60, -70, -81, -76, -25, 31, 54, 46, 17, 9, 7, 0, -25, -34, -54, -103, -139, -128, -105, -83, -86, -120, -134, -97, -61, -58, -54, -44, -47, -55, -18, 51, 86, 82, 47, -30, -106, -121, -111, -101, -93, -106, -100, -70, -46, -43, -76, -109, -118, -141, -130, -78, 1, 65, 77, 87, 86, 37, -56, -131, -165, -157, -152, -156, -153, -140, -107, -75, -63, -65, -64, -36, -4, 0, -5, -21, -35, -60, -69, -47, -64, -80, -74, -79, -86, -59, -17, 2, 22, 41, 69, 62, 46, 60, 82, 68, 5, -67, -88, -72, -85, -101, -40, 45, 44, 19, 3, -18, -33, -30, -26, -45, -80, -95, -79, -68, -60, -13, 56, 100, 121, 117, 127, 131, 82, -7, -46, -40, -28, -18, -37, -73, -51, 12, 20, 19, 33, 36, -21, -95, -152, -191, -192, -188, -173, -125, -54, 21, 81, 85, 25, -24, -59, -112, -150]
4544a50J6L7L8K2K4M8L2Mk0n5l0J5K0N1P8K2l3k9j3mk6o4n1m2J4L0kK4M8L4k8n8j9J5oJ2K4
4533b2Lk2j3M5L9M0L6Km5m1l5l6k2RL5L6M5K4j4jrk3KK4j2l2k8o0m5nK8L3K9M9O5M2j4m1k3
4520D3l1p6p5JL6J9ok7k2J0O2O2M3J8k7k5j8j4j7lllJ0Pnj0J5M6O6J8k6Ll5q0n7l0j3rQJ6
4508a29OK1P2O6Km7k2JOlj2lJ9K9J8j9k8pPj6m8k7L4ln8NL2%l2m4OJ5J1L4J5lK8N7O3J5MJ0
4495G5RMn2q9n7K3O3K4l1m8l1J8N0M4J3l9p2k6K4L2L9K3j0k4k9l2J3O5L6J2J0j9n1l9lJ4J3
4484d8L2jm7m9K2M5pk4j7m1m9j3j2kK2L8N2J5L2M3K4J2L2K9j9l0j7o0k6O0P2K5j5j8k5j8L
4472B0K%qJ0kJ3L1Rpl8o3l3k9m5k1oJ2O8N4J7l9n6kK1J9J4J8J1oL0L2j6k2l2k2KM8L9l7l8
4460e2j6J5J4J3J7NlK1RnJ4Rk4l2j0npN8P3Nm8p7o9k7kMM8K5l2p6n6pNK4J1pk9oL2N6Q4M5
$$ y = [-150, -134, -97, -59, -37, -13, 35, 67, 71, 51, -4, -34, -19, 1, 52, 130, 152, 119, 90, 77, 73, 47, -17, -68, -110, -96, -66, -68, -44, 4, 38, 10, -48, -67, -52, -58, -46, -22, -19, -41, -54, -9, 30, 70, 106, 108, 63, 22, -13, -49, -71, -62, -27, 9, 54, 78, 64, 63, 54, 31, 33, 57, 45, 13, -15, -75, -120, -125, -97, -64, -35, 14, 79, 121, 107, 66, 43, 12, -64, -139, -138, -102, -83, -89, -116, -138, -128, -66, -4, 39, 57, 30, 5, -13, -27, -44, -47, -50, -53, -43, -36, -41, -51, -36, 10, 76, 94, 68, 71, 36, -44, -101, -131, -144, -153, -145, -129, -123, -102, -30, 36, 38, -9, -31, -30, -24, -27, -39, -42, -23, 6, 24, 5, -23, -30, -23, -39, -87, -114, -80, -83, -141, -136, -104, -104, -136, -180, -174, -159, -148, -114, -99, -102, -74, -17, 46, 61, 65, 75, 84, 88, 36, -53, -110, -87, -24, 0, -31, -79, -110, -92, -42, 2, 15, -24, -96, -122, -98, -66, -27, -4, -14, -38, -67, -99, -86, -21, 15, 27, 37, 18, -33, -72, -75, -61, -48, -16, -17, -64, -113, -91, -46, -53, -77, -94, -135, -184, -197, -209, -211, -189, -151, -99, -84, -52, -9, 15, 27, 59, 88, 69, 39, 22, -38, -64, -4, 68, 93, 78, 60, 35, 17, 20, 22, 22, 14, 24, 22, 35, 66, 75, 68, 30, -33, -66, -95, -140, -161, -167, -155, -87, -33, -16, -55, -111, -113, -92, -73, -59, -41, -30, -36, -6, 26, 10, -12, -44, -66, -64, -16, 23, -14, -52, -68, -53, -39, -26, -9, -4, -7, 14, 23, 18, 32, 41, 17, -15, -25, -30, -37, 21, 94, 99, 51, -26, -95, -122, -124, -120, -72, -47, -79, -155, -211, -218, -213, -189, -178, -185, -214, -220, -188, -132, -48, -3]
4447ckj2k7l3oKJK4%k5oRL7N1M9L7Kj8j5k8k2qM6M1n2o6p7q1pM0L6Ok3k6nK6M5Q0P2K9mk1
4434F6m8m6j9KLL8R4N4k3l5j2j5l1k7j9oQmmJ9M1L5M0M3J1j0k2j7nl4m6k6rlK2Rj3LJ3k9q0
4421h2q1m9j1N0O9K3J8N6M3j6n0k6oOM7O3J8j1n8r0n4j1K1K6J4L6M6j1k1nmkJ1K5Ll7l3k7
4409a10RL0j6M0O4J4k1mqNJ3l3nN1L5m0n4k4K9N2J0j1j3k7NK0Nk7l6PJ8J0K5N3M9K1k0l9m3
4397C4p4q5k9K1K4K2MQL7L3Pnl0l3l6J7L7l0p7l9L6O5M5J4k5l8qJ8%j8kK5L9M1Pj3j6j3oj6
4385e9mN7L9rj1j2K8Kk8jj2j4RK6J6J4M4K2l0l8j1M3N8J1l9n1l3k6j0Mmk7m2rOJ8O8P3M7K1
4372A36j1k0l2l9n6l4J1M3P2O0K0l1n5mJ5rl1k7ONj1KMKkKj7p0l9Pj9L9Q0L7ROK5Jj7j4l4
4359A0n3JL4Pk0j8k7j9rPK4pk7K0K3j8k5JK1OM1P0Ko0l8k3qlJ2J9j5j3J5L4L8J0j2Kj1JM1
$$ y = [-3, -5, -17, -44, -77, -83, -81, -80, -56, -56, -81, -87, -78, -41, 10, 59, 96, 98, 80, 65, 37, 15, 7, 53, 94, 42, -24, -101, -182, -189, -149, -113, -107, -130, -156, -161, -135, -90, -10, 62, 91, 87, 66, 18, -28, -47, -45, -42, -4, 90, 144, 121, 86, 74, 59, 28, 1, -18, -24, -16, -20, -24, -5, 36, 71, 111, 154, 165, 155, 133, 116, 111, 77, 31, 5, -4, -7, 15, 24, 11, 14, 27, -2, -82, -163, -212, -223, -173, -104, -81, -63, -7, 36, 20, -30, -56, -62, -56, -9, 54, 72, 61, 3, -87, -141, -152, -131, -105, -91, -55, -9, -20, -41, -46, -50, -52, -41, -16, -13, -50, -83, -110, -101, -71, -87, -47, 17, 31, 10, 6, -2, 3, 16, -17, -22, 29, 64, 24, -30, -54, -25, 27, 37, 26, 13, -14, -9, 11, 16, -11, -47, -40, -22, -12, 13, 66, 115, 136, 116, 77, 34, -40, -125, -154, -133, -109, -87, -83, -75, -38, -5, 2, -3, -33, -66, -102, -85, -48, -78, -155, -194, -158, -93, -48, -34, -59, -97, -105, -87, -87, -105, -107, -82, -43, -2, 5, -8, -24, -37, -43, -59, -63, -6, 33, 24, 13, 1, 29, 31, 3, 2, -10, -24, -15, 11, 27, 41, 85, 107, 77, 39, 28, 71, 129, 140, 101, 50, 17, -9, -19, -15, -19, -46, -88, -97, -91, -73, -5, 68, 115, 136, 125, 105, 73, 34, -22, -56, -45, -2, 70, 130, 150, 119, 64, 60, 75, 66, 35, 8, 14, 19, 8, 10, 14, 16, 14, 16, -1, -71, -110, -103, -122, -83, -3, 34, 43, 49, 74, 75, 58, 44, 10, -43, -42, -8, -1, -21, -39, -66, -85, -94, -87, -63, -70, -97, -77, -54, -72, -97, -96, -75, -69, -28, 42, 44, -16, -54, -77, -85, -88, -76, -57, -72, -85, -70, -36, 2, 12, 0, 2, -9, -8, 33]
4347C3M2L0L7j1l1l3n6m0l2l0j5qNL0N0K3mK3K9k2k6K3K4l5m5j4RRJ1Pj2K6K4Mj8n4l2jJK8
4334e1K9kRJ9lrL3P2M5l7o4k8K3N8N2M6N9k3q0r2r4o0qj1%J8qj5nL3J8mLj4qk2m3j1JRN3K4
4321h8M4M7j8m5k4k6l8l4l8k9J1O6P9K8K9J7n2o9j7J5qPJ5ql7m1l3l2PM0N7M5N8N8J5j3k1
4310c3k9l9j1L2K6J9L8K4jl0n3m2LJ5J0j7j9nmNJ1Q%jj4j7NL6kl5m5j4J5M5L4N%mj5m1l7o
4297a83JLL3L2K8K0rn6n2lL2M9K6j0m8l4l2J9J4j5l2j5K1Olj6j6NL9O7M4J8pj2j6%NK7P9P3
4284H2j9l9n0l2m0m2K8O1L4Pj8pPM6Q1Q2Q6J37J91L79P27J125N67p86j002o12l60k27j42p8
4275A86kOp0o6%J7j5m6n4l2J7L3Qj0l3rK6K1J5j1m5l9k1M1M2Ln1l7J7K2K5J7j4n3l0L5L0J8
4263e9j6m5K2O6O0K7n0n7j5k9m2m8l5rK1M3M5K5J5Pj6KL2%j8J0N1J2m9k4o%J5L1L8J9L1Nn9
$$ y = [33, 75, 105, 142, 131, 100, 67, 11, -29, -61, -91, -106, -114, -109, -79, -29, -6, -10, 13, 42, 20, -6, 17, 41, 6, -39, -53, -44, -35, -24, -17, -29, -3, 21, 25, 7, -47, -79, -80, -79, -51, -22, -24, -15, 4, 1, -8, 25, 97, 142, 105, 41, 13, 36, 94, 146, 192, 251, 228, 148, 56, -38, -98, -106, -117, -117, -99, -107, -122, -127, -94, -76, -80, -77, -91, -99, -121, -164, -175, -174, -165, -112, -88, -44, 3, -15, -60, -84, -110, -148, -182, -220, -249, -238, -172, -93, -65, -36, -19, -71, -140, -157, -142, -150, -143, -128, -136, -173, -214, -247, -279, -272, -232, -175, -130, -72, -14, 1, -12, -33, -62, -101, -112, -80, -54, -35, 3, 27, 26, -4, -57, -99, -96, -81, -71, -88, -107, -112, -116, -111, -100, -92, -92, -93, -107, -124, -119, -83, -85, -120, -165, -179, -164, -119, -85, -80, -80, -84, -99, -140, -177, -183, -182, -179, -146, -114, -86, -66, -75, -131, -183, -186, -154, -105, -79, -89, -137, -171, -203, -184, -170, -185, -217, -232, -211, -205, -208, -224, -240, -235, -196, -129, -85, -67, -74, -86, -102, -102, -97, -70, 9, 82, 63, 24, -26, -58, -98, -140, -112, -51, -17, -10, -28, -35, -28, 18, 99, 181, 267, 404, 595, 974, 1701, 2826, 3393, 2607, 1605, 993, 633, 406, 264, 186, 184, 190, 120, 54, 54, 71, 56, 10, -44, -76, -59, -26, -18, -28, -61, -70, -44, -23, -8, -19, -64, -103, -124, -83, -41, -38, -89, -126, -109, -87, -62, -45, -59, -112, -142, -107, -77, -59, -75, -120, -98, -32, 28, 55, 5, -52, -67, -96, -138, -186, -221, -230, -209, -166, -121, -96, -81, -74, -90, -88, -56, -56, -74, -64, -13, -1, -50, -74, -80, -80, -65, -34, 4, 23, 54, 59, 0]
4251@qL9L2kql2rK3j0k1j9LlnK1K6j2pnkk0l8m7l7j7N0J01N2j4m6j6K7L6K4JL9M7Poj6k5l2
4238G1nK7k2l3l2k2K6j6p3n6m8l5J7L5qJ5M0J4Mj3mL8J9j7RJ8ll9l4j4J3K9N0N0L3M4Jn4m4
4226a9j5l3k8J1Oj2RK1L9M5L1Rl5l4nKj6j3%k4RN7L5Ol5o6j9M9J9OK8j2l7m8l1N5N5J9K9J2
4214G0j7k3J2Rn%ml5k3Nk0j2L0J1l7m9j7PK9K2J1kk2l4JN1L3j8k7jJ5l5m0QM3M1K0k4n0l9
4201a16k9MJ4j0qLl6rP6M1j2J5L2j0j7qJ5k5n0qK7M1N4R0N9nj9k5j4J1k1l3k5j5K3L0nMjk1
4189A7K6N6J7pj3m0m7l0k4j6k4l0k4kM7P5O4L1j1m1%Orn7k7L0K5L3L3j1l6k9j2kJ1J0KK2O9
4177H2L4n8p0m5l0l8m0J3O1M2QM2K1m3n1k2L2M0J9Mj2l2l3l0LJ8j7l2K5O7M7k4k6Nj6j5J1
4165f0Kk0%J4L5M0mk2pM7L8mJ1lj2JJ%l2m8j8K2K8pn6q4l7KJ4M6K3pj0l3j6J5K7M9M4J0k2
$$ y = [0, -8, 31, 63, 61, 53, 21, 12, 35, 25, 4, -15, -12, -15, -20, 1, 27, 15, 8, 3, 1, -19, -57, -104, -141, -158, -108, -7, 45, 31, -15, -31, -4, 32, 56, 57, 96, 143, 150, 144, 128, 103, 71, 66, 93, 71, 38, 6, -16, 10, -6, -79, -135, -183, -218, -201, -166, -174, -159, -119, -105, -101, -114, -118, -80, -61, -78, -69, -51, -54, -93, -127, -141, -128, -99, -49, 1, 34, 78, 79, 25, -19, -34, -67, -95, -84, -78, -90, -81, -60, -21, 24, 55, 64, 29, -5, -10, -8, -24, -37, -37, -61, -52, 5, 40, 46, 11, -55, -74, -25, -6, 0, 28, 16, -21, -69, -100, -45, 10, 29, 58, 70, 53, 30, 42, 51, 46, 46, 42, 7, -16, -11, -31, -43, -13, -2, -39, -88, -105, -98, -69, -47, -36, -38, -60, -94, -93, -42, -9, -27, -54, -55, -40, -75, -115, -107, -64, -23, -3, -27, -77, -116, -145, -141, -127, -137, -145, -142, -178, -187, -111, -70, -82, -67, -35, -45, -62, -70, -55, -80, -130, -138, -111, -70, -16, 74, 133, 128, 109, 84, 70, 81, 60, 27, 2, -13, 10, 40, 35, 39, 38, 17, 43, 99, 116, 109, 96, 56, 9, -21, -45, -61, -85, -115, -139, -141, -94, -19, 45, 76, 65, 24, 24, 30, 21, -36, -63, -33, -8, 25, 58, 47, 11, -18, -30, -32, -21, -11, -9, 13, 82, 116, 58, -12, -57, -87, -125, -165, -152, -91, -49, -41, 1, 22, -21, -72, -94, -62, -22, -3, 1, -11, -43, -76, -106, -103, -85, -102, -134, -109, -42, 5, -19, -45, -40, -56, -71, -60, -58, -78, -78, -64, -29, 11, 7, -15, -22, 25, 63, 59, 70, 67, 55, 56, 57, 57, 25, -23, -41, -19, 9, 2, -54, -138, -175, -173, -159, -113, -90, -97, -107, -140, -156, -141, -114, -65, -21, -11, -33]
4153c3LL6K7JoKJ6MLj0j9j3l2m9l2J5M7K7k1k5pJ2J5j7n3l9J0L3QMJ1nmJ9ml1k7QM5M7J7j0
4140b7NJ7K3K8qoRn0o0k4LK6N7K8m1n0j0L2M0L5K7M1RmL1Nj1k7k0k4kN9O7J1l2n2l5qoJjL4
4127I0K5k2oJ8o0j15p0NK1j3l3l6nJ4J9K0K2km2k0M0P2P9N0jnJ3J0Rqj3l2lNl8m6k2KJ1J0
4114e7kPkk3l4k9L6Q5L3j9l3kK6%rJ2L0M3K7R%J9K0l4m8j3J4J2J6j3k9QJ4NoJ1K1J8j2q4o8
4101e1kJ8K9L3L2J7QLk9k5L3pm3o1n2K5O0L0Jj3oJRmk7RL9M9K4l7%Ok2j6j6RMM4O3jl1j5L
4088I1j6J2M0pn1n4j9K1j6m1m4n9rL7L7Rk4n2k7K6M3L0k9n9J1M9L1K4M6N6J6ol2l1l7m9pM8
4076d2R4J13O0mn2m4k9k7j3m7p9m3PJ5jj1pm2j7N2L6Kj9m6k1K9K5L2J8J5M5PLK6J2J6J6j7
4065F2j6K0K1n9n0K1Jm7l6j6NpKK6K7J5K5N2L8Rk2n9n6m8k3QK5jk8k6L1K2K8J0j1k2j1M4N0
$$ y = [-33, -30, 6, 33, 34, 28, 30, 46, 50, 53, 43, 24, 11, -21, -70, -102, -87, -40, -13, -34, -59, -66, -54, -39, -56, -109, -148, -138, -105, -97, -93, -82, -87, -91, -72, -76, -107, -134, -126, -81, -34, -17, -27, -22, -5, 18, 46, 38, 32, 41, -9, -69, -93, -90, -64, -7, 21, -20, -70, -80, -48, -8, 27, 54, 95, 104, 100, 131, 136, 125, 98, 78, 54, 52, 111, 178, 189, 157, 105, 70, 62, 56, 57, 56, 90, 115, 93, 87, 105, 45, -70, -140, -135, -114, -127, -160, -196, -201, -187, -168, -148, -126, -128, -170, -190, -150, -78, 1, 51, 50, 45, 58, 68, 77, 69, 56, 24, 21, 26, -12, -58, -80, -78, -67, -57, -59, -52, -54, -77, -111, -140, -104, -19, 14, -5, -38, -40, -14, -14, -23, -11, 19, 62, 89, 98, 98, 117, 137, 103, 55, 42, 56, 68, 84, 71, 42, 50, 64, 69, 63, 74, 95, 113, 101, 17, -51, -53, -35, -6, 27, 59, 76, 84, 87, 58, 33, 66, 59, 16, -45, -97, -72, -12, 18, 19, 6, 0, 1, 10, 6, -21, -12, 27, 76, 100, 63, 63, 69, 47, 31, 15, 24, 28, 72, 135, 134, 103, 88, 91, 75, 87, 127, 120, 69, 15, -4, 17, 1, -40, -84, -143, -152, -115, -78, -69, -93, -145, -172, -146, -103, -73, -102, -161, -150, -101, -70, -46, 0, 56, 72, 66, 34, 3, -34, -83, -90, -42, 52, 165, 225, 221, 169, 125, 96, 69, 56, 9, -70, -113, -106, -91, -92, -103, -110, -152, -169, -117, -81, -79, -98, -144, -165, -136, -111, -79, -61, -46, -1, 6, 9, 35, 47, 63, 79, 62, 46, 66, 87, 28, -22, -1, 0, -47, -83, -99, -94, -101, -99, -73, -46, -31, -6, 46, 84, 93, 71, 12, -44, -92, -115, -107, -82, -83, -111, -137, -106, -84, -56, -46, -57, -79, -90, -46, 4]
4052DLl5PL6L0K5J0Lj2pL0L7J3l2o5j5L7on1l1LLj8j6j3n2m9pJ5L6J0k2lJ8L0K3j2JM3N2K3
4040D6rl5o1k3Kk5l9j7L5P0N5j0oK5Km7o6k6%K0N4N8J0n0n8j6nj2J6K4j0j8j4RK0oOJ9J1K1
4027e0L6Lk0J6L5J7jLJ9K0k4l9k0k3m5o0k9J0K0J4Nk1l2K9P5L8J5L0M9K5n8q8n5K7P5J9j0
4016EJj1J1M1J7k9%l6p6n9m8qM4N2N1L8L4J6n1p4m9l5l1l5MM9M6M4L1MjK4J5l0j9oj5NL6K7
4003a8j7m4k3opk6n3OL0K7L8L7J2O%kJ3qk3j4J4L6J0j8j1OLJ6J3pj1M6O2j8m1%oj6PJ5Nj4
3990A9%J9K0Qk2l0rk4l5nL1M0Rk3l2l0m1n7l8K0N2M4j1m2qP6O0nMKj3J8K5j2lPJ3J6onlK3
3977E2K7j9p5m6k3mJ1LM5M2K0J2J4Rpl7k6L6O3K2l1m1m4o9n6J3O1M9J5l6k6k0l0j1mj3k6r
3966a59K8K0l6j4M9M6K6nj1K2jKPKJ5NJ1J1KLl4n4j1J2J6rl3j5J9P0N3j3p3n9KL3K6Llpj3
$$ y = [4, 7, -28, -21, 15, 45, 70, 80, 83, 71, 64, 94, 131, 144, 112, 47, 32, 69, 63, 12, -19, -16, -13, -31, -47, -60, -112, -161, -168, -153, -117, -107, -129, -132, -114, -84, -61, -73, -72, -29, 23, 46, 37, 2, -59, -82, -80, -105, -144, -161, -126, -56, -1, -11, -17, 8, 10, -37, -103, -129, -129, -109, -55, 3, 13, -37, -95, -111, -116, -128, -112, -88, -98, -116, -130, -121, -101, -107, -101, -82, -71, -50, -14, -11, -31, -15, 20, 37, 36, 39, 58, 78, 54, 15, -5, -28, -73, -133, -162, -152, -132, -118, -113, -134, -166, -137, -62, -24, -9, 21, 70, 95, 37, -51, -106, -79, -4, 15, 5, 6, -5, 6, 47, 64, 35, 35, -1, -77, -136, -184, -192, -148, -96, -45, -7, 27, 43, -8, -82, -131, -166, -197, -232, -228, -179, -133, -89, -58, -54, -55, -31, -16, -46, -65, -71, -86, -81, -45, -18, -35, -79, -102, -108, -115, -141, -194, -188, -158, -131, -93, -56, -44, -38, -38, -40, -27, -35, -58, -72, -58, -22, -12, -30, -41, -35, -32, -16, -3, -10, -21, 25, 87, 69, 28, 28, 22, 6, 13, 28, 33, 19, 19, 38, 58, 66, 44, 14, 5, -19, -54, -59, -28, 12, 21, -2, -34, -64, -105, -162, -200, -180, -128, -84, -95, -137, -145, -69, -9, -14, -10, -8, -21, -3, 22, 10, 7, 14, 27, 43, 37, 32, 29, 52, 79, 60, -15, -61, -84, -88, -77, -74, -29, 13, 33, 45, 59, 68, 61, 24, -2, 34, 97, 119, 88, 47, 3, -66, -122, -109, -48, 1, 16, -20, -46, -66, -96, -107, -111, -124, -150, -159, -131, -111, -147, -161, -112, -66, -40, -45, -56, -34, -35, -33, -26, -24, -9, -4, 7, 18, 20, 23, -11, -65, -76, -64, -48, -57, -90, -105, -86, -16, 37, 24, -49, -108, -106, -73, -47, -44, -47, -54, -67]
3953f7nj8j3kLlRRrnJkNRK5J6j3K1P5O0lJ4Q2O1M0j9k2L4J40L27O37J001R15k97j047p71m37
3941G51k51j77r4m1J2Oqn1l6m9n4k7j2pn4j8K8K1K5qn5o3j0O4P7L2k0l9NK2K5qK2K5j4n0l6
3930f7m1j5pj2OK7L1J1LK3Ol4m2k3J2O8P4K9qJ3L5J8k7k4j4l4l1jj4l7k5mJ4K2LK3J7j0J1
3918b4Mk3lqkMJ0Qj1m%mj5l7l3J1K1MNpK2O2L1J3jj2j1K5L3Ol2n3j8L1M7pl1KJk2m6m7Ool9
3904a50l1nj5mL0O3P9N2J2rJ2J2m8p4m0K1N2M5K0J3L2K8j4k4Jk0n3m7o7n6j4Prk4RN4J8mP
3892a41j4k9j2MJ4M4L0j2j3RJ2kJ2%k2l8ML4K1K9J7l9k7M0M3Nk4j8N6M7l0k8%Oj4k2j8J1K9
3880c6Okj5m3j7K5M8L4RQJn0l3R%k4m7l7k5j9K2O4O3M4Kk8j1MJ3J4j0l0n3LO1N6K8j6n3jL1
3867eJ1J1j7m5nK6Ql6k6Nnj1J8N8P0L5k2n8n3k9k5LJ4j0j8k7nL0N0N5kj4j2jlJ2Pm6m1J2N2
$$ y = [-67, -72, -90, -103, -105, -102, -105, -96, -87, -96, -101, -100, -102, -97, -88, -63, -47, -60, -39, 36, 96, 93, 107, 189, 250, 290, 271, 249, 283, 423, 750, 1387, 2388, 3303, 3006, 1959, 1188, 751, 500, 323, 229, 188, 200, 206, 198, 147, 111, 62, 8, -19, -31, -38, -92, -110, -82, -61, -36, -44, -99, -162, -172, -108, -31, 1, -19, -58, -53, -31, -6, -14, 8, 33, 19, -31, -67, -108, -123, -130, -142, -136, -109, -78, -67, -64, -41, -35, -69, -111, -134, -122, -54, 20, 49, 41, 54, 89, 107, 80, 56, 42, 8, -23, -24, -38, -75, -100, -104, -90, -68, -65, -42, -25, -35, -24, -20, -43, -46, -54, -56, -52, -42, -34, -45, -49, -49, -53, -68, -105, -138, -127, -106, -102, -97, -104, -82, -20, 11, 24, 23, 11, 0, 25, 58, 64, 32, -21, -39, -8, 39, 32, 1, 3, 4, -18, -64, -111, -105, -111, -150, -181, -186, -201, -205, -175, -112, -33, 19, 31, 22, 34, 46, -2, -76, -116, -95, -43, 2, 22, 35, 67, 95, 81, 57, 58, 38, -15, -62, -129, -185, -199, -192, -201, -225, -216, -162, -144, -148, -141, -155, -184, -196, -192, -178, -134, -104, -116, -129, -120, -108, -110, -98, -98, -120, -158, -154, -120, -99, -70, -53, -92, -119, -79, -36, -31, -55, -73, -17, 30, 0, -28, -28, -22, -36, -58, -76, -65, -36, -30, -32, -47, -90, -107, -82, -34, 0, 9, 17, 18, -32, -65, -56, -56, -80, -127, -164, -189, -208, -186, -122, -59, -15, -13, -41, -52, -48, -35, -21, -31, -61, -114, -111, -50, 6, 34, 18, -35, -36, -5, 6, 17, 0, -45, -50, -24, -16, -52, -78, -73, -78, -89, -71, -13, 57, 92, 70, 12, -41, -70, -95, -92, -78, -88, -106, -133, -138, -108, -58, -3, -5, -19, -31, -32, -35, -23, -16, -62, -103, -91, -39]
3854c9L1k1k8m4kK3L6O2Nk0J1J4k9m9k0k7OL1L9O4N2J4plj7k2k6RK9rj9j2n3o4j9k2p9o0J3
3842b52P9P7K2j5JM3L0m8l4RJ3J0j9k7M6P6K9l2l8J9L0%J6M5K4K7L9J9j8m0k7l1k7oj2j2o
3831A0KMLok5n3m4%L3K7j4k5n6n5j8K3L3OOM6M6J2J3J2K9K8Qj9k6lqj8j3k0k%%mJLj1K7M9
3817AK0JQnm0k9m0j9QM5J7j7Lj1k5J0O1Q0N2%k5k6pK6ok4n8o1qJ6NK3J4k5m4n1PJ9K8Q4M4
3805E1o8p9l6K2O8M8kk6j8mKk1l8j9OPj0j8n1n9J8R4O8K0J9K8K7M0on9l3j2l5k6J0L3L4K1
3793dK8K3N0O5rj01j12o3jM4K3j3l6k5MK1L8K4lK5L7k3o1l3PK2J5jk2l2l3J5N0M1Kl7l5o6
3781a76n4oN0N8N9L4%K2J8l1o2k6L6N1J0k1k1Nrk8MPk9J5M8Nm4k9l9l7J7L1J1j3pPPjJ2K5
3769a01jk5K2P1L4l4m2m1n3J4O3N3Pn4p5m6rJ2O1O6O9L6K0K2J8L3Jn4n9l5k7m7o7l4K7P5J8
$$ y = [-39, -8, -29, -57, -101, -103, -80, -44, 18, 23, 3, 14, 28, -1, -50, -70, -97, -91, -60, -21, 43, 95, 109, 102, 99, 82, 60, 34, 43, 72, 63, 44, 32, -21, -85, -104, -126, -205, -265, -252, -173, -96, -74, -89, -88, -45, -15, -63, -97, -88, -75, -65, -84, -111, -65, 11, 40, 8, -30, -11, 19, 19, 35, 80, 104, 131, 170, 189, 171, 131, 104, 73, 46, 40, 28, 16, 10, 12, 16, 19, 13, -12, -65, -109, -109, -76, -49, -63, -88, -144, -199, -217, -194, -161, -155, -149, -103, -57, -45, -32, -20, 9, 37, 45, 26, 0, -3, -11, -29, -42, -62, -64, -64, -64, -68, -67, -64, -75, -48, 1, 21, 22, 30, 25, -15, -44, -84, -103, -95, -50, -33, -50, -47, -58, -83, -73, -12, 68, 120, 120, 95, 69, 62, 88, 82, 58, 0, -61, -69, -53, -48, -25, -11, -36, -80, -131, -124, -105, -77, 7, 51, -17, -96, -132, -110, -42, 6, 4, -22, -40, -44, -42, -63, -101, -120, -114, -107, -117, -135, -186, -245, -227, -133, -65, -45, -26, 2, 29, 69, 63, 4, -29, -41, -76, -102, -92, -59, -25, -4, 24, 47, 97, 162, 153, 52, -60, -123, -124, -80, -57, -70, -106, -131, -127, -106, -68, -44, -47, -22, 15, -8, -69, -102, -95, -73, -58, -59, -81, -113, -146, -131, -81, -40, -38, -75, -110, -176, -230, -236, -186, -128, -69, -35, -35, -13, 5, -26, -88, -114, -78, -27, -17, -38, -59, -54, -63, -91, -87, -80, -109, -94, -46, -41, -85, -114, -153, -190, -173, -142, -131, -144, -151, -144, -137, -138, -126, -101, -102, -127, -105, -34, 0, -34, -76, -117, -170, -156, -93, -40, -33, -87, -162, -208, -217, -205, -144, -78, -9, 27, 47, 69, 87, 120, 121, 67, 8, -27, -54, -101, -168, -202, -175, -100, -82]
3757h2l9lJ3J1rk9o0k8J9M4O3P2K4oj9JK3kk5k2k0mJ4m1q7k8K7L3L6M0J9kprqjjJ8L2L0Pm1
3744d7m6l5j1J9J8qJ5L9om5m8j8M6P3P6M1lqm3o3j9L7K2j9l2l1jJ1NK0J1j4l6n1l1J5K5M4
3732i8N4K5RK8M3K3ppqj2k2l9l5l4k8L2N3K6L4nk3j0n1m8J6M5N3L2ml6k4K2M2P5M9n2q3q3
3721d8p4o0p5k0N7Q7P9L8l5o2k7L1O1K9j3j6k3KM0N3P8L2l2m2o7l3Lmk2o6o1m5PM6L6N6O7
3709b3L6j9m3nmn9l0J4K7N9K3Pkm3l6j7NLK0K9j6l1l4k7L9P6L9K5Jo5l1L1J1j4j8k8mJ3M3
3697d8L8k7l9k3jJ0J0K6J0m5l6QO1N1J5M1M3k2n1k4J5J4Jmm1m9J3N6K9Lnj6j4kpj9j3rl2N
3685g8K7JlNK0L2N0jm4JK3J5k5k8K2M1L2M1J4j1j0m4m4m4k5j7j7j2j2j1Nj6m0oJ1L2N8M3L0
3673A5J5l1k5K5RLJ3K2J2J9K8J8Pj1l8o0o1p5o7k0MKL3L9J2K4O4M7kk2j4J2K0J5l9o4l1Ok0
$$ y = [-82, -121, -124, -111, -100, -109, -138, -198, -226, -207, -163, -100, -28, -4, -10, -29, -28, -5, -7, -32, -54, -74, -78, -64, -105, -192, -220, -193, -160, -124, -84, -65, -67, -74, -83, -91, -92, -93, -75, -43, -13, -6, -47, -93, -128, -139, -120, -102, -110, -95, -56, -62, -107, -155, -173, -127, -54, 22, 63, 60, 52, 9, -54, -73, -36, -14, -33, -65, -96, -97, -86, -81, -61, -50, -64, -100, -151, -182, -167, -142, -98, -44, -19, -10, 18, 61, 84, 77, 70, 62, 50, 28, -11, -46, -80, -108, -76, -23, 3, 37, 32, 9, -1, -52, -100, -84, -39, 14, 46, 42, 6, -18, 4, 46, 121, 170, 118, 35, -48, -122, -182, -257, -277, -220, -133, -54, -16, -51, -113, -140, -109, -48, -19, -32, -48, -71, -69, -29, 24, 102, 134, 102, 60, -7, -40, -37, -41, -63, -129, -190, -235, -228, -182, -146, -90, -23, 13, -6, -49, -54, -58, -117, -147, -133, -106, -47, -24, -17, -19, -62, -98, -115, -110, -107, -87, -58, -74, -105, -139, -166, -127, -51, -12, 13, 14, -51, -82, -51, -40, -54, -72, -100, -104, -91, -48, -10, -37, -76, -99, -100, -90, -80, -54, -44, -89, -125, -117, -56, -5, 10, 51, 94, 72, 21, -3, 12, 26, 27, 23, -18, -67, -54, 2, 31, 34, 29, 13, -1, -3, -10, -29, -42, -51, -83, -78, -51, -50, -53, -48, -28, 4, 54, 53, 9, 10, 33, 48, 23, -5, 17, 58, 90, 131, 145, 134, 124, 80, 36, -8, -33, -50, -67, -79, -91, -102, -97, -113, -153, -159, -148, -116, -58, -15, 15, 30, -1, -26, -1, 8, 11, 24, 46, 58, 77, 105, 123, 130, 119, 81, 21, -40, -115, -182, -202, -198, -196, -163, -124, -112, -88, -24, 23, 21, -1, -15, -3, 17, 32, -7, -71, -102, -96, -116]
3660a16n2jN8P4O4L4l5l7J5K2K9%n3k8J0m1o5j5L0M8jn3j7N7M1NK5Rn5n8k2J8K1J4qJ5O1L5
3649B8L5Kk6Lkj4k4l9qL1Kl9l5j5%OJ4j9j8L0L8j5n5m5j8JJ0J7O4O8Qm8k0K4Lj9k4J2N5M1
3636In2q4J2O5K8K1M1K1k9m6k1lrj4J1M8K7Kj3k0m6m4Jrl2J2L5N1K0l8p2l6K2N0jl3m2pJ3
3624a62L9N8K8K9K5j1l3l5m1qL1J2k3l2m3k5j2m4pO2O3M2J1J8M0J5J6J1LK1J5kj7l4m9rM6
3613bM8RjpJ5Nj4k7nQk0l2K6J7j6rk1k7J0J5j0k2l3m9l4j2j6j1N8R6N1M3K6j7m4l2m4jNOL0
3600c8J6j7j2J7rl0MJ0lj7JOl5m0j6J6K3J4L4J01P2l0n8n2l6Nj0j1N0N5J3k9lL8L7K2jk1m0
3588B6l2KK1Jk7KM8K0j6rj1m0o1m8l5mNJ8N4P7O0QJ3Kpl4m7k1Jk2l1mOK0L6J0rmJ7Ml0k0K6
3575c5M0K5l9p5l8J2K5K8L0Qkj2j9j2k5MN3P5J0k0lJ9J5j3rQj4n7m3l1m3j5nj2k6j1L3O7M7
$$ y = [-116, -168, -169, -111, -37, 27, 61, 26, -11, 4, 26, 55, 55, 2, -26, -16, -57, -122, -137, -107, -59, -60, -113, -130, -73, -32, -27, -2, 7, -48, -106, -128, -110, -89, -75, -83, -68, -7, 28, 63, 65, 39, 42, 40, 26, 2, -37, -45, -14, -12, -51, -86, -101, -101, -95, -81, -100, -118, -88, -50, -65, -120, -165, -183, -182, -172, -155, -91, -23, -15, -63, -83, -59, -56, -75, -99, -87, -32, 9, -43, -127, -115, -50, -22, -1, 40, 61, 32, -14, -35, -38, -47, -61, -50, -2, 25, 27, 14, -6, -52, -96, -95, -104, -136, -124, -89, -38, -18, -56, -128, -164, -142, -92, -93, -126, -168, -175, -162, -123, -65, -37, -8, 17, 6, -27, -62, -103, -111, -80, -68, -91, -123, -166, -191, -203, -247, -254, -192, -129, -87, -76, -58, -18, -3, 13, 24, 27, 48, 63, 61, 44, 10, -39, -48, -2, 46, 55, 54, 47, 62, 67, 53, 26, 21, 29, 9, -23, 3, 20, 4, -5, -26, -53, -43, -28, -38, -60, -93, -142, -176, -188, -204, -215, -157, -61, -10, 33, 59, 42, -2, -34, -78, -79, -74, -68, -38, -22, -39, -51, -34, -43, -73, -69, -59, -62, -79, -78, -72, -107, -147, -163, -147, -124, -110, -76, 25, 97, 67, 9, -43, -79, -74, -84, -95, -45, 10, 23, -6, -9, 29, 66, 88, 87, 66, 26, -6, -4, 17, 18, -9, -7, 41, 61, 45, 36, 25, -15, -76, -124, -159, -163, -158, -140, -86, -9, 51, 59, 72, 74, 67, 33, -14, -35, -34, -56, -87, -91, -85, -65, -29, -19, -28, -32, -15, -11, -41, -61, -35, 5, 30, -9, -84, -122, -110, -85, -57, -27, -19, -21, -33, -52, -64, -89, -85, -32, 43, 53, 33, 30, 49, 64, 51, 42, 50, 36, -21, -64, -95, -138, -153, -158, -170, -196, -207, -174, -107, -60]
3562f0J7Qlj3l8l6L4P1J3j1J2qj9k3PJ6k1MK3J2m5p2l2k3j2LJ4K5pj2K7L1lk9j3M3Rk1K5L9
3550f8nm2l3K6M7J3j1M1J15R5L1l1n4o1o1k8j8L0L5QK7Qk2l3n7l7j1o%JM2N3J3j7JK1l0m2
3538f0J4K4%l5m6qM4L7N0L0kKpj0LK5L3Mlj3k6j7k5n2o8l0L6J8k3j1l0l7k3LL5L7L0L9K1J0
3526c1%j2j6QL1K4M4K9Qj1pJ4rj3nk6j3JPJ7NlK6J7j2NM4L9j5l1k8nj8k4oK2L1k8l8k1l8l3
3513g1oj0rL5N4Mk2j5k1pK8N1M7k2k9K7L1ok8k5j9j8k2J4J4MnJ3J0k0jM5N2kn2n1k4LL4O1
3500D2M0K0L5J2l3o3j02p9k5MMJ8L8N5ok2j6m0j2L4N1%l7oL0k0k6K1RqLk4l4K3M7L0J4j2k9
3488f4J1JJJ7K3L0Kk7lM0M7OJK9L2pl0j0J0k3o3o7l2qj6l5l4k4j2K5N5J8l4pK5Lk4k2j9pK8
3476a64K9J0J2K9J5j0kj5K7Q1L9K0Ko3l3J9J4k2j7l4m5k9KL3M3O0M0L2K0j4RJ5ROj0m5p7l8
$$ y = [-60, -43, -35, -38, -51, -89, -125, -91, -20, -7, -18, -6, -14, -33, -56, -49, -33, -54, -50, -27, -15, -60, -132, -164, -187, -199, -196, -182, -157, -164, -176, -149, -118, -121, -150, -163, -120, -111, -132, -107, -68, -73, -115, -148, -122, -75, -62, -73, -32, 83, 178, 209, 178, 124, 63, 2, -26, -44, -14, 21, 29, 56, 64, 42, 9, -48, -85, -96, -102, -102, -101, -59, -6, 7, -10, -9, 12, -18, -60, -46, -22, -22, -57, -103, -111, -67, -30, 20, 50, 48, 50, 43, 33, 36, 61, 94, 98, 95, 82, 56, 39, 14, -38, -106, -136, -100, -82, -105, -116, -146, -183, -206, -203, -168, -131, -101, -62, -41, -31, -31, -43, -59, -51, -20, 4, 48, 77, 85, 74, 67, 81, 72, 59, 54, 28, 15, 16, 23, 40, 45, 42, 68, 85, 73, 78, 122, 161, 146, 115, 87, 82, 64, 40, 34, 56, 87, 59, 21, 0, -38, -71, -77, -87, -96, -61, -7, -3, -25, -40, -61, -68, -40, 11, 58, 36, 7, 34, 65, 59, 31, 6, -13, -31, -53, -39, -25, -21, -26, -13, -3, -23, -24, 21, 73, 71, 19, -32, -56, -53, -19, 42, 82, 102, 137, 149, 116, 53, -49, -128, -153, -149, -145, -127, -89, -34, -40, -62, -78, -118, -130, -96, -45, -45, -82, -88, -58, -78, -104, -83, -74, -82, -79, -103, -137, -114, -67, -37, -23, -35, -64, -53, -52, -51, -34, -11, 19, 21, -6, -9, 31, 78, 84, 85, 114, 146, 139, 109, 99, 109, 86, 23, -44, -76, -84, -100, -135, -169, -193, -205, -180, -125, -107, -141, -148, -123, -120, -144, -166, -185, -192, -164, -135, -125, -113, -84, -69, -79, -81, -96, -69, 12, 51, 71, 73, 10, -23, -4, 10, -12, -29, -63, -108, -137, -135, -102, -59, 1, 41, 73, 93, 79, 88, 103, 112, 118, 108, 63, -14, -52]
3464e2rl7m3jJ5QOQj6j4j3m0l2L0M7J6L8K6k5l5k5%L2L1qkJ2L4M0kmJ6K8JJ8J2k9m1m1o0l1
3451a42K2noK2Mj2RL0L0Kl0j4L0M6Plj6l0k0mK7L7J5n7o1J9M4K2J2M2M3J8J0m4n4l4k7lrj0
3439i0O5R4K8l2p2q2m0k5L3N4K9K7K1J6j3j7K0K5k9o6o2k2PJ7M6M4K5J4k0k3Rmk5kM7L9j0
3427B6k6POj5RK7Mj9k5k1mj4m7k0K8K9J9j8%KlOJ1%k4oj3n1l3N6R5N7MoJ9L3M0om8m8l7l2
3414c8k4L0L2nk8j2j9k1K5K2j7JL0K1j0L9M8mn2p7n1%M1L7L4K2J6nk3k0kJ3Jl9m9j3K9K7O
3402c5pJM1L9Pk5k8j8p1o5k5pJQN7O7K9k4l7j1J%K1Lk9k5M1O7J6k2RJ5j7k8lJ7J5JK1J2j4
3389bl6j7kk6n0m7J7P6K5m7j7K5J9Lj6j7k1k6lL1M1L0K0N2N7J6j6m0oQj7m2k3lkj5k4kL3K3
3377d1%oj8kJ8Knqk6l6mK3ql4qJ4M2M3J4k3k4k1K6M0K9L0k1o8l9jkl5m1J1K2M0M8qj9L3N0
$$ y = [-52, -61, -98, -141, -142, -127, -119, -113, -105, -121, -135, -148, -188, -220, -190, -143, -127, -89, -63, -88, -123, -148, -148, -116, -85, -93, -95, -83, -49, -9, -11, -15, 1, 29, 30, 48, 60, 31, -10, -51, -111, -142, -120, -125, -131, -109, -105, -117, -108, -78, -48, -46, -76, -90, -60, -14, -7, -10, -26, -56, -76, -80, -53, -16, -1, -58, -119, -100, -56, -34, -22, 20, 63, 81, 91, 47, -7, -41, -68, -71, -80, -90, -25, 69, 97, 65, -7, -89, -129, -154, -121, -67, -38, -11, 10, 26, 13, -4, 16, 41, 12, -54, -116, -138, -131, -114, -68, -24, 1, 15, -5, -28, -19, -23, -48, -50, -3, 36, 26, 0, 7, 13, -2, 7, 34, 38, 19, -6, -27, -31, -45, -92, -112, -84, -55, -36, -54, -54, -52, -55, -49, -38, -38, -62, -68, -81, -132, -165, -109, -14, 43, 47, 41, 60, 93, 133, 127, 79, 31, -6, -38, -62, -32, 0, -5, -33, -45, -64, -85, -60, -38, -55, -54, -24, -3, -13, 26, 74, 70, 18, -59, -110, -110, -69, -32, 2, 24, 40, 35, 12, -8, -10, 3, 4, -35, -84, -97, -68, -41, -35, -42, -41, 0, 39, 46, 21, -7, -25, -96, -161, -186, -193, -192, -184, -127, -60, -31, -55, -92, -103, -102, -102, -81, -78, -107, -132, -91, -24, -8, -30, -21, -6, -23, -51, -54, -37, -22, -21, 0, 12, -2, -38, -55, -57, -83, -133, -180, -163, -87, -62, -109, -126, -101, -82, -79, -95, -112, -133, -159, -162, -131, -90, -60, -40, 12, 69, 85, 69, 29, 23, 31, 14, -28, -51, -54, -56, -71, -95, -97, -64, -41, -41, -47, -65, -67, -49, -47, -52, -60, -86, -122, -126, -103, -111, -145, -153, -139, -97, -54, -40, -63, -87, -108, -82, -42, -13, 17, -4, -72, -111, -112, -114, -149, -190, -179, -157, -117, -69, -77, -96, -63, -13]
3364a3L0K2k1o0l3PKj3%K0K9K9N1O2L2l1m7k6l4n1m0M%m0m6k6LK9M9N5N5L9m7j03o9j4K2L3
3352a41L2L0N1J9m0l3J5K6j3m3n0j9J4N4P6L8K3on7m3KL2M4L3J5J1K3kk5m1m0j3qLK5L9K1
3341E2k4k7k2%J7J3K9J3j8k5qj0k2l3l9j8K1J6LJ4j3j9PO4P7K4%k8l6jJ7nj2m0o6l4mJ6J5
3329a06ojj2K2O8P6L0l0n2n3k5j7ppk9nN8Q8P0J3n4o4l2J2K1K0K4j9o1J1O0M5j0n3p0k7L1
3317i1L6L2L9J3j3J9K0j1n1p1m4mLj8m7k0J6N5M6jlj9j6QK5L4J0k9oM3N6N6J7l4n8j7k9o4
3306a18k3K4L1L0K7J0l7p5n0j2KKL9L0k1J4M3L4J1mm4l6K0L1Pk7k0kK8L9O8Q7N1Jo0m1KJ0
3294G1J0Mj8j5JJ1J6j7l7l2m2o1l6J1j1k1jjk5m9J0R0J18N1j4j8k0KJ5J0j1mK1jl9l8lJ8O
3282d9k5m0l6j3J7J3k7mN3N9K7J1pm1j08j13l0PL6P6R6K9pOpLRJ2K8K3jj0j1J0qk8j2J5K8
$$ y = [-13, 17, 39, 18, -42, -75, -68, -66, -79, -79, -59, -30, -1, 50, 112, 144, 113, 66, 40, 6, -45, -85, -81, -81, -121, -167, -193, -190, -161, -112, -57, -2, 37, -10, -113, -182, -196, -174, -141, -109, -79, -28, -9, -49, -82, -67, -41, -54, -97, -147, -166, -152, -98, -22, 16, 39, 33, -24, -67, -65, -33, 11, 44, 59, 70, 93, 91, 66, 25, -15, -28, -36, -33, -8, 31, 52, 28, 1, -21, -21, -4, 9, 38, 51, 33, 8, 0, -10, -32, -65, -104, -122, -101, -85, -82, -68, -81, -100, -93, -29, 48, 72, 72, 44, 8, 7, 24, 19, 7, -33, -99, -133, -137, -121, -106, -112, -113, -125, -103, -35, 41, 71, 41, -11, -64, -89, -106, -113, -120, -149, -154, -96, -8, 62, 75, 21, -43, -75, -63, -42, -22, 2, -17, -78, -67, -7, 38, 28, -25, -95, -122, -91, -55, -23, 16, 29, 16, 35, 55, 44, -7, -78, -122, -126, -123, -141, -188, -208, -192, -137, -91, -92, -95, -114, -130, -122, -97, -63, -53, -82, -88, -45, 11, 67, 84, 50, -8, -25, -54, -118, -141, -117, -86, -56, -29, -19, -56, -131, -181, -193, -191, -189, -150, -120, -141, -127, -84, -50, -39, -43, -87, -123, -103, -72, -65, -92, -112, -114, -86, -47, 21, 108, 159, 160, 100, 59, 61, 71, 81, 85, 67, 52, 53, 64, 80, 63, 26, -6, -48, -109, -145, -134, -145, -166, -167, -168, -193, -242, -232, -142, -24, 27, 13, -5, -25, -23, -8, 2, -9, -13, 8, 7, -32, -70, -73, -55, -49, -74, -114, -150, -163, -146, -133, -160, -164, -111, -52, -25, -14, -21, -62, -170, -283, -313, -306, -270, -194, -98, -69, -76, -70, -77, -74, -65, -53, -25, -2, -3, -13, -24, -14, -22, -50, -62, -47, -19]
3270a9K0j1k0l7m9k4J4M9L9LRQl9k9lK6L1lkj0%L4L6pK3N4M6J7kJ1L2Qo5o2L6N8k0o3n9r1
3257f1m7K2J2k6pL2Mk8k4lL5M8M2N5N2Nj5l0k9k0KJ6m2q1J1N0J1jKJ5Nj7k0O%Mj4l3l9m8k8
3245a84QJ1L2N2J2J0N0K7j8PN8M0OQl5j01q8L0O4M5J5j9l4o5q0n8rJ6K0M0O3O4K5qkJ7M0J
3233F0k1l0n8o2qL2J8k0rlJ5M5K9J5L1J2OOj0j7m6n1m7j0K8J6J7M9P3P1J2o3q5n9l0qQL8L8
3221a8K6K9L7Jl8k6J7jl1J9J7k6j6K8J1J1N0K2RLokl3p4n8NL3k4p8n6kK4L6P0N2lk4j5l4n6
3208a21n2j5OM2Nl7l5j5j8MN6M8j3m0j6j4KJ6L6L4L1K7ml3l8mL7M9Pk0J9Rj4m2m5M2P2N5L7
3196E8J2J4j4m4o9n8QK1M5M9j8n8m8l3m8m8K4P7O2N2L6j8o4o8l2kK6K1%K1L6J2K0L1L1NJ7
3185E6Pm5o9k2Omj2j8NJ5K5N2L8ol8l9j7k3k3pK7O3N6J1k4k6L3J4l7p0o6l6KO0N8J1m9n5J8
$$ y = [-19, 1, -10, -30, -67, -116, -140, -126, -77, -38, -35, -26, -18, -57, -86, -89, -63, -32, -35, -37, -47, -47, -13, 23, 16, 39, 93, 139, 156, 154, 165, 197, 205, 140, 78, 114, 172, 152, 89, 30, -61, -108, -86, -74, -100, -107, -75, -71, -99, -123, -126, -91, -43, -1, 54, 106, 111, 96, 66, 37, 17, 19, 35, -7, -88, -77, -27, -16, -17, -15, 0, 5, -12, -32, -26, -26, -22, -36, -69, -108, -156, -184, -176, -165, -133, -81, -69, -59, -9, 18, 0, 7, 65, 105, 111, 119, 84, -17, -105, -75, -11, 34, 49, 30, -4, -69, -149, -207, -216, -200, -180, -140, -77, -13, 12, 4, 2, 19, 59, 60, 39, 9, -49, -111, -119, -87, -69, -89, -98, -101, -86, -41, -12, 3, 34, 46, 52, 58, 48, 31, -15, -66, -113, -123, -95, -79, -62, -13, 60, 131, 143, 80, -5, -64, -94, -102, -94, -56, -18, 8, 37, 74, 75, 37, 11, 28, 27, -4, 15, 32, 6, -10, 18, 29, 40, 90, 112, 121, 124, 118, 116, 83, 9, -49, -44, -11, -35, -113, -169, -171, -147, -111, -41, 11, 8, -16, -31, -65, -121, -173, -188, -182, -140, -135, -172, -207, -222, -240, -236, -180, -132, -145, -185, -201, -215, -213, -197, -161, -127, -96, -69, -73, -106, -144, -148, -111, -62, -55, -75, -56, -47, -61, -103, -148, -106, -34, 21, 58, 70, 84, 70, 26, -43, -101, -93, -72, -27, 22, 4, -54, -102, -135, -183, -231, -207, -130, -68, -16, 20, 2, -62, -130, -162, -164, -138, -117, -117, -96, -60, -48, -28, 3, 34, 39, 56, 63, 18, -51, -73, -67, -71, -83, -101, -96, -81, -56, -4, 34, 28, -10, -49, -66, -89, -112, -119, -92, -29, 27, 38, 14, -12, 21, 35, -2, -72, -138, -174, -172, -112, -54, -43, -92, -147, -129]
3173a29M4Qk0l4PKl4L2Q4N7K5Nj7j9%j2k7j3L3N3j1k7rMk0k3K3O0M6j7o7l2J6k2j6L9M4K0
3161E3j9J6N1L4Jl3k9J4N0J5m1o2n4k7NL9L0j7m5k0Krj4L7K3jkjj0l3mM0K1k8n1m9j9KK6M8
3148f1J1m7l8jmqJ4L6K1J2lj4K0K3J3J2J1j3k2K4L0Pk0p5l4J4%rj1oMl3j8J9QK2M0M9L4J3
3136B0K9N2J8l2J8%k1J8J0k6m7o9o7pK9J2J2L1J3n2p3o6qP1Q2L7nj2J4K9K3M7N8k1p0o1l2
3124d6K0%kNk1rJ1j0j3J6K7jJ5M3J4m6n2j7L1K9l3l9N3R0L4J5Pk2j8j9m0j0Rk5j5Mj9n0m1
3112a25pM3Q4Q0L7Kn6l7%Pj8rklk4m2l1l6k8K2P1O9J4k0j3J9K9L5J7m6l0nqrl2n9l4rj5PJ7
3100a45L8M8J4RM5M4K3qj6Pk6m7rpk5j8K1O6O5J1m0j8pj8m7m4j3K5N1N8Nk9RL4K2j2o6k8J9
3088ipk2J6Mm3m6LJ3N0N6L5N3O4M2J9J6k2k6pL3K5k9k9J8jp4o7l1jJ7Nj7k3k0k7j8Lpo1n9
$$ y = [-129, -85, -77, -97, -131, -124, -122, -156, -124, -40, 17, 42, 47, 30, 11, 11, -1, -28, -41, -8, 45, 34, 7, -2, 2, -18, -41, -18, 42, 88, 71, 4, -28, -12, -34, -50, -11, 33, 53, 34, 50, 101, 135, 136, 103, 74, 88, 138, 153, 112, 50, -4, -31, -26, 13, 43, 26, -19, -39, -37, -46, -60, -23, 0, -1, -3, -4, -14, -47, -51, -11, 10, -18, -69, -118, -137, -135, -109, -61, -50, -97, -135, -136, -140, -148, -134, -98, -77, -65, -68, -82, -62, -39, -26, -14, -3, -16, -38, -14, 16, 23, 3, -72, -106, -92, -92, -101, -112, -118, -114, -147, -165, -146, -138, -116, -76, -27, 7, 20, 49, 101, 119, 87, 105, 105, 84, 102, 112, 86, 39, -30, -97, -104, -75, -63, -51, -20, -7, -59, -132, -198, -206, -135, -53, -16, -21, -33, -19, 10, 33, 80, 138, 117, 47, -14, -46, -26, -26, -28, -23, -44, -53, -42, -52, -65, -49, -22, -23, -8, 35, 49, 3, -49, -66, -35, -6, -39, -78, -25, 65, 99, 114, 121, 99, 81, 62, 22, 12, 21, -4, -19, -15, -34, -84, -125, -132, -89, -5, 75, 112, 114, 58, 21, 21, 28, 10, 1, -1, -4, -28, -70, -101, -137, -165, -143, -72, -3, 11, -9, -22, -3, 26, 61, 78, 32, 2, -3, -11, -20, -52, -111, -145, -154, -169, -162, -145, -107, -59, -45, -36, 9, 53, 76, 68, 52, 59, 33, -14, -23, -30, -55, -73, -52, 14, 79, 90, 50, 32, 25, 7, -40, -84, -97, -72, -21, 37, 42, 13, 22, 56, 78, 66, 0, -28, -9, -16, -38, -22, -18, -61, -107, -104, -91, -41, 15, 50, 103, 167, 209, 228, 244, 222, 196, 189, 222, 247, 218, 189, 207, 206, 132, 65, 34, 33, 50, 55, 38, 15, -5, -32, -50, -47, -54, -115, -174]
3075a74qK7J9K4O3L9K1Mj9qk4m5j7K7K2J1JK%poJ7K7J3mj9j1NRPJJPk6m0J3N5J4K7J4n4n7
3062d9l4%Jk1j8m0k4LL4O2Q4N9J2j3o5p8k7J3J5K7O0N5J8j4l0j5J9%l0o0p5NK6RKj1LK5oK
3050g6L2L3Nj6QL5j3o1k0M4N8K6k1l5l6k0k4j3L8O3Mo6j02p0K8M8J5J0M5M9j7k2J3K5j2j0
3039e5K6J8J5N8P3J2o4p5k5J5J6k8l9Ook2jj%K9J9l5l7k8l7n9l1OM4O4O0MlL4M4Rk1k6j3J3
3026d1J8L9J2l2n2l8LM0N2K7J0j4ojnm8l7K5N6M4lm5m4l3k4MM9L1k3l9k0k9m3pL2L8jk7j0
3014a42LL8R3Q9N7Ok8n7n0l5qOj6RM0j6n4l7k5K2N4K3QPJ4Jj9MJ0j8K4N0jj1l2l2j2l7k2J8
3002g6M6K0J6N0K2l1l5knm1n2m4JN2K5KJ4K7K2j1l7lN0K6m7m4j1%%j4J2K0J5J9J2j9l7JRm
2989e2J8L8L6L0J7J8J7k1p3n1%O3O0j4m0k1j3MJ6Jj5kJ2Nj9kK9K0K4J2Mj7m4k9j9o6r8o1l4
$$ y = [-174, -182, -155, -136, -112, -49, -10, 11, 15, -4, -12, -36, -81, -98, -71, -49, -38, -37, -35, -35, -42, -48, -31, -4, 9, 5, -14, -25, -20, -11, -4, -3, -2, 5, -21, -61, -48, 7, 21, 48, 62, 8, -49, -83, -83, -82, -103, -121, -161, -185, -182, -148, -86, -2, 57, 69, 56, -9, -87, -114, -101, -86, -59, 1, 56, 74, 60, 30, 15, 34, 34, 4, -56, -131, -126, -100, -91, -89, -100, -97, -72, -78, -76, -44, -11, -6, -22, -14, 21, 8, -53, -73, -29, 29, 55, 34, -1, -37, -57, -81, -94, -56, 7, 11, -55, -157, -227, -199, -151, -136, -126, -81, -32, -49, -71, -58, -33, -45, -55, -29, -11, 4, 62, 135, 147, 83, 8, -17, -2, 14, -14, -53, -47, -53, -75, -76, -77, -77, -48, -29, -64, -101, -129, -166, -225, -256, -250, -206, -142, -82, -78, -81, -47, -3, 6, -15, -41, -54, -41, -23, 16, 28, -4, -56, -94, -91, -51, 1, 28, 38, 24, 18, 17, 12, -36, -73, -48, 8, 52, 49, 4, -40, -73, -97, -93, -44, -13, -36, -75, -95, -124, -167, -174, -142, -104, -105, -132, -142, -139, -101, -8, 81, 138, 144, 116, 59, 9, -26, -34, -28, -44, -35, 5, -11, -65, -102, -127, -105, -51, -28, -20, -13, 1, 2, -17, -13, -3, -21, 3, 53, 52, 41, 9, -23, -35, -72, -94, -76, -30, -10, 6, 56, 78, 47, 12, 10, 5, -36, -88, -132, -131, -79, -54, -52, -38, -11, 11, 0, -37, -40, 10, 36, -11, -55, -66, -66, -66, -80, -68, -48, -33, -14, -2, -21, -58, -57, -48, -52, -34, 4, 40, 70, 87, 105, 122, 101, 28, -23, -23, 40, 100, 86, 46, 25, 12, 16, 32, 33, 18, 16, 28, 33, 14, 12, 41, 61, 85, 97, 101, 84, 40, 11, -8, -74, -172, -233, -267]
2977b67pMM6M0ROL3M6L7M5K0jL5L4l5n6k0j9j6m8l0N2P6O0K1n4r0n3J3M6K3j9l6J4Q7O9J2
2966G7QOJ8Lk9j0rl3p7n6kL8J9k9m6kJ9L5K3j5qk2k6jJ4pj4j2j1J5L0J9L9M4J8m1o4k3L2M0
2953d0K4L0K7lrPJ3l3n3qK2%J3K7l0o5j2J7j1l1pkJ5L9K4j3k6MNlOPJ5L0K3l3m2qj4k8k5K5
2940a23O1K2J0K8K7L5L0Jnn7m5NJ1K3L1J7QRjk2m4o7j0K0Rj5j1J5j6OM1J7K1M9J3k2j4n1n9
2928e3m9m7oMJ5M2L9K0jRM1L2m1o9k0L0K4Krql4l7l7m2j3L7M2RJkJ4L0K1L8L3j4j8j8m7QK2
2915e2M6O4J2j9k5jJ5Nl9o6m0PO0N6K5k6o2m5LK8L4J6k0ok9k8J9J1k6o1l0K6K9J5K4RJ0kP
2903e6J0j0n2j8J8L7P0N1J4J0Jk4k8pl0k4K2K0Pj6k6n9o8%O2M9J1j2%J1L6M0K3j5o0l2jK0
2892b6O2L2l7l7%Km1m2l1l6j2J7J7J1ll4rN0N4L1rl4j4JL5O4K0j0K4L8J0l7n8p3j1M1M9jO
$$ y = [-267, -274, -270, -224, -184, -175, -169, -136, -90, -53, -8, 12, 11, 46, 80, 45, -11, -31, -50, -66, -114, -144, -92, -16, 44, 65, 11, -79, -132, -119, -73, -50, -69, -105, -91, -4, 65, 77, 85, 91, 109, 112, 83, 73, 64, 31, -46, -102, -104, -66, -47, -76, -122, -124, -105, -70, -47, -62, -70, -92, -118, -119, -105, -112, -126, -138, -149, -134, -104, -85, -46, -2, 16, -25, -89, -112, -80, -40, -16, 14, 41, 38, 29, 36, 49, 16, -37, -45, -23, -23, -10, 17, -13, -78, -90, -73, -84, -115, -122, -124, -109, -70, -46, -59, -85, -81, -76, -79, -73, -66, -51, -21, 2, -31, -73, -81, -95, -123, -148, -123, -62, -40, -30, -2, 25, 60, 90, 91, 86, 29, -16, -11, 0, 23, 54, 71, 79, 88, 87, 65, 21, -46, -56, -36, -27, -42, -53, -38, -54, -48, -7, 10, 31, 80, 93, 71, 57, 6, -53, -102, -149, -155, -151, -136, -94, -55, -35, -36, -27, 14, 46, 5, -64, -84, -54, -30, -28, -37, -45, -79, -116, -153, -195, -208, -171, -129, -120, -119, -121, -107, -77, -56, -18, 15, 1, -17, -35, -82, -74, -52, -6, 58, 70, 51, 26, 25, 40, 45, 6, -60, -100, -93, -33, 23, 48, 22, -40, -85, -82, -54, -20, -4, -24, -30, -59, -87, -68, -57, -83, -144, -174, -148, -119, -104, -80, -71, -61, -63, -56, -46, -56, -108, -126, -108, -71, -1, 50, 64, 74, 75, 51, 23, 16, -14, -38, -16, 4, 11, -5, -31, -90, -158, -158, -96, -47, -36, -48, -48, -37, -1, 39, 62, 47, -13, -45, -46, -26, 36, 68, 31, -6, -6, -4, -45, -87, -118, -154, -166, -149, -132, -121, -124, -158, -167, -117, -63, -32, -41, -75, -89, -88, -53, 11, 31, 21, 45, 83, 93, 56, -2, -75, -86, -45, 4, 3, 9]
2879IM5J7n0n5j2rj8oJ9K9K8K1J0k0m9o8n4J1N4L2M6M0j1j9l3n7kN1Ql8n8l7J3M0L5kooj2
2867a14K5L4K3K8J9j1ok3o2n8l2K4N9L0JL4M3O4M1j3LLl5m1m9m9j1K6L0Rj7m2jKMK3j7l8k1
2855a15%J3k3j5L0K1j0J5Lk1J2M7O3M2Ll9l4j6k1m7m3k5k6J0K2K8K4jJ3K3J8L1K7pm2k6j1
2844g7l0kQRL5M8Rn6n7%L0J3J1Oj9JL7M4K3Ok2j3JJ5Pk8m1j2K5M0M7M2Qj9k6l0l5k2qk4l7
2831i3JK7%j2k8k6j5j3K9O1M4J1j8j6NM4M8L5J0pm9l8J0j8o8m1J9M6L8J1j3J5L0j7k9kM7O5
2819I3L3rl0n5m4j9M1M4Mk2l1l3j3L5N5L2k7o3l1L5K7K3N7M3j3o9m8ml1rK6L2J5Kj1J0K1k3
2808D3m2j1j5k9JJ0Jk4PK6J8ll9l6j7LL1P0Q9N8k0l6MJ4lkk7m0k5jL0K7j0j3J5Pom6o8m7R
2795i7O2N0rj9J1K6lk2l4m2m8n2k5j3%j3L3J05J04L6j2o1n3oNL3K5J5jk3j5l2j9J5J4K3L4
$$ y = [9, 54, 71, 21, -34, -46, -55, -73, -79, -60, -31, -3, 18, 28, 8, -41, -109, -163, -152, -98, -66, -20, 20, 9, -10, -43, -100, -102, -51, -43, -81, -139, -176, -163, -123, -88, -90, -96, -102, -114, -89, -55, -32, -4, 15, 4, -2, -25, -87, -145, -177, -153, -94, -64, -63, -29, 14, 78, 119, 106, 109, 112, 77, 36, -13, -62, -73, -47, -17, -8, -25, -67, -68, -66, -62, -39, -56, -94, -115, -115, -102, -125, -140, -110, -89, -99, -84, -81, -102, -90, -43, 20, 62, 65, 26, -8, -24, -45, -92, -135, -160, -186, -176, -154, -126, -102, -103, -90, -67, -49, -18, 9, 2, -40, -66, -77, -107, -109, -101, -92, -57, -9, 0, -56, -113, -113, -83, -70, -59, -53, -72, -71, -34, 10, 33, 39, 17, 4, 5, 20, 27, -1, -42, -54, -29, 11, 58, 100, 108, 89, 63, 33, -2, -24, -32, -56, -93, -92, -65, -65, -77, -105, -131, -146, -159, -130, -69, -25, -14, -32, -48, -43, 1, 49, 84, 94, 87, 38, 0, 10, -8, -76, -117, -98, -52, -14, -3, -16, -1, 29, 12, -17, -19, 28, 93, 126, 117, 87, 32, -12, -31, 10, 54, 58, 36, 5, -28, -41, -6, 49, 81, 54, -9, -40, -5, 22, 45, 102, 145, 132, 63, 15, 11, -20, -29, -3, 29, 44, 46, 35, 45, 66, 43, 1, -10, -25, -54, -53, -43, -42, -66, -59, -33, -15, -18, -57, -93, -110, -107, -76, -6, 83, 141, 121, 85, 89, 103, 100, 98, 71, 31, 6, 5, 35, 62, 52, 39, 54, 61, 55, 9, -59, -106, -97, -35, 15, 6, -13, -2, 24, 21, -1, -35, -77, -125, -177, -202, -215, -215, -228, -195, -90, 14, 50, 38, -23, -76, -82, -77, -44, -19, -4, -5, -28, -43, -75, -94, -79, -65, -42, -8]
2783hmk2nL9J9l3k5J0M6M5KJL1K0k3j7m2q8o5kM8K3l2l4l3j9K5K7J8J6K4M1K8j3n6n5j4K2
2772a05lRPl7m8m5m4rL3M5L9M7qk7K2O6O6ql8J8J7%j4k3k8k7J7K9J9J3j6k2oK1J5MK3J6k2
2759dn1k1J8Oj5j2%mk5m1m8m5JM9N4L2OQOJ2K6L1J5l0l4oJ6L9L2l4l9J3KJ3M7M3j5o4l8j7
2747g4K1M2K4J0oj1m0n2j7RJ3jj5QJ1NL8K9KJ4RJ4J4J7Kj7K8K3k7l7k3j0k1m4m4k6%k0j6J5
2735a53J1NJ9L3L4O0M0j3l0o2j15p8KJ2K5L9RJ3J1mJ3J6K8M8L3M4L6o4j02l9M3K9k1OK9K0
2723b3%pj0J9J1m3m7k0J5POJ8L4N2L8J0jmpRJn5n3Pj3n1lN3L3M5N8Nm6m0o0n3NM6P3K8k2Q
2710B3L6K9k4NJ9l7m3LL9kn1o9m1JNOj2j5PK0J2J9JLJ4K0Ol1j3mm0o2k4P5J01N2KNLk0RJ7
2697D4J6l0l9MJ6k0p2l0K6J5kk2k7%L9M4om1m6p4m9M7O7M1L3M9K3k2m6j9K4M1M6K1nk7j1R
$$ y = [-8, -12, -34, -39, 0, 19, -14, -39, -29, 17, 62, 64, 65, 96, 116, 93, 76, 34, -54, -119, -121, -73, -50, -82, -116, -149, -168, -143, -116, -98, -82, -58, -17, 11, -2, -58, -113, -127, -105, -108, -99, -92, -129, -177, -222, -266, -275, -242, -197, -158, -111, -119, -146, -124, -58, 8, 0, -38, -20, -3, -3, -17, -40, -68, -95, -78, -49, -30, -17, -33, -55, -61, -40, -25, -21, 2, 18, -4, -55, -76, -58, -52, -67, -79, -79, -83, -108, -149, -197, -242, -241, -192, -138, -106, -100, -92, -86, -74, -48, -17, -2, -32, -66, -72, -56, -17, 15, -19, -58, -45, -43, -30, 17, 60, 45, -19, -57, -74, -53, -11, 13, 23, 17, 6, -34, -86, -103, -94, -81, -82, -97, -89, -78, -73, -35, -6, -4, 10, 19, 33, 47, 64, 66, 49, 77, 100, 73, 36, 13, 3, -18, -62, -106, -132, -132, -152, -168, -153, -142, -137, -118, -85, -51, 9, 49, 36, 6, -56, -171, -249, -247, -235, -210, -171, -162, -149, -138, -142, -129, -113, -85, -37, -4, 40, 76, 12, -90, -129, -86, -57, -78, -72, -43, -23, -23, -30, -40, -21, -10, -53, -100, -120, -105, -98, -92, -74, -40, 12, 50, 60, 59, 55, 48, 57, 58, 3, -50, -43, -56, -107, -110, -57, -24, 21, 79, 84, 38, -2, -62, -115, -110, -64, 9, 37, 15, 23, 59, 88, 64, 69, 88, 51, 8, 11, 50, 48, -3, -72, -113, -112, -107, -101, -113, -128, -121, -101, -89, -70, -69, -66, -52, -32, -26, -57, -70, -74, -114, -176, -200, -125, -24, 28, 30, 35, 38, 18, 27, 44, 60, 30, -9, -5, 11, -9, -81, -111, -85, -70, -72, -94, -121, -121, -82, -38, -44, -85, -131, -205, -254, -207, -140, -99, -66, -17, 6, -16, -62, -81, -57, -16, 30, 51, 46, 19, 8, 17]
2686A7k5qJ9Pqk3mJlJ2J2j9k3lk3j2J5J3nnK3L1L0Moqj0j4k2j3j7jQL7N3J4j3RK3Kk2l2n3
2672d2m3RM6K0j2k1k7k9PK7j4m6j0nKL8K2k0l2K3K9kOJ2L9K6RmOJ9j1j2rJjk1k5oqoK4K6k
2659a7onj5J2O4M3j5m8RM5j2l3L5M4J3j0l0j1Klj3l1j6Mll9l2K8K7ok2pj1l9j3L6L3j2j8M0
2647c2K0l8o5l5qMkJ0K4J5jRL7K0j6j2l5j2K6K5nl4j7k9m1lM7M3K8L5K2J0j4n2k1K3K9Rk5
2634f1n2n9%K5L1M2M4K2RK2rK5N1j4m8k5m2n3NM3J3%j6l1KL1J8j8QM8M4Pn2k5J9L4L3J3k8
2622E6l7J3K5P%l0n3m8j4J3L4M1M5K5om5n8n2K9M5RK3pn3k1K6OJ2J4j0k8j0L4L1j1k8m7p2
2611a42n9J1N0jl8j0J6M3P6N8L5J7l0l5k7j2nk2Jjjk8k7qoJrj2pL6N8M3J5J5nj6QOQJl%J0
2597Dk0jM8K0Prm0n6m3nJ7kkK1N%K6k3n6k5K8M7M3K0L7P2J1j00o1mnl7j2O2N6Jj0j9l2PM5
$$ y = [17, -8, -16, 3, 10, 2, -21, -25, -24, -27, -15, -3, -22, -45, -48, -71, -83, -68, -55, -60, -65, -42, -11, 19, 23, 17, 9, -1, -15, -37, -50, -67, -68, -60, -23, 30, 44, 31, 40, 63, 65, 43, 11, -42, -85, -76, -30, -10, -22, -43, -70, -99, -92, -65, -79, -125, -135, -140, -138, -100, -78, -98, -130, -107, -78, -80, -74, -62, -23, 3, 12, 8, 14, 33, 22, 10, 1, 2, 1, -20, -45, -51, -59, -65, -41, -15, -17, -23, -28, -43, -31, 33, 76, 61, 13, 22, 67, 55, 22, 57, 101, 114, 104, 74, 63, 65, 62, 49, 18, 2, 6, 3, -36, -68, -40, -13, -19, -41, -48, -59, -98, -111, -75, -42, -54, -72, -32, -12, -50, -115, -150, -158, -154, -156, -146, -122, -107, -108, -99, -62, -42, -58, -70, -105, -117, -91, -66, -71, -105, -122, -151, -192, -195, -148, -105, -77, -42, -20, -10, -24, -76, -97, -74, -45, -36, -61, -113, -172, -172, -147, -116, -74, -30, -8, 1, 23, 14, 39, 90, 76, 28, 3, -39, -92, -87, -44, -31, -31, -47, -78, -76, -45, -27, -45, -37, 11, 55, 62, 10, -15, 4, 38, 71, 84, 56, 19, 32, 57, 64, 64, 34, -19, -67, -81, -68, -34, 7, 52, 77, 71, 26, -32, -84, -55, -10, -1, 22, 15, -38, -59, -33, -27, -15, -1, -11, -39, -49, -15, 16, 5, -23, -70, -142, -201, -190, -140, -141, -179, -189, -173, -130, -54, 4, 39, 56, 26, -9, -36, -48, -53, -75, -74, -75, -76, -104, -131, -139, -145, -144, -153, -165, -172, -136, -78, -35, -20, -5, -10, -26, -18, -12, -4, -3, -6, -6, 4, -16, -17, 31, 51, 58, 49, 9, -47, -90, -95, -78, -80, -82, -61, -56, -56, -30, -53, -109, -134, -106, -59, -16, 4, 41, 113, 124, 24, -37, -41, -46, -83, -95, -33, 23, 24, 14, -5, -37, -30, 15]
2585A5M7J3k9nKk1k0j0L1K5ok3k0kmj6PK9J4K1J8nk5m6k2Mj4l8j6j1kRM9R1N9ml8l5j1j9l5
2572d3j7J1K8K2ok7k5k9k6Oj9k7PK2L3J7Qj4n0l7kpK2M5L6K4O5L1kj8k6kMJ4M4Rj8OKk7j1
2559B3qm9l6NM1K0rk5n3j1MpNnJ5J5j3l4M0Q4L2ML6L6Okk0k7j7p1r1n0k1J0J2k4n6l7M0O3
2547a75N5O4M6k9n5j6K1K4N6M0l5m9kK8L0J4k1o0n1%L0N9O4L0mk9k1m7m7m0l8j4L6N7%j9k7
2535a25m8OJ8J9M4J9jm6n3mM7O1k3n5l0j5K4N8L7j0J5M6jm8o0l7lJ0L1M6O7L6j2J0J2k0j3
2524BMj7p5p1J0J9J1J6K5J6qJ4N1J4pk6j8l0k5j1j9J5N3K2QJ1j3qJ5L2J2Mjk9j9LpMk0m4j8
2511a05qk6j8olN1N2oLOKk0qMj3K1N5Qrjl4j8M1K1k0j8j2k3k2rj2j4QM6L0j5k2k3k3Qj2qJ6
2498a36M1N7O3L1k1k0Ook3lL2M7j5k5mj1pKll4k1kJ3L4J8Pm3q9n9K9M3LJ2J9L0N9MmK7pnk
$$ y = [15, 62, 75, 46, 41, 43, 22, 2, -8, 23, 48, 42, 19, -1, -3, -7, -23, -16, 13, 27, 48, 66, 61, 36, -10, -32, -28, -42, -80, -96, -107, -109, -100, -51, 40, 99, 95, 57, 22, 11, -8, -43, -60, -49, -21, 1, -5, -32, -57, -86, -112, -106, -125, -152, -145, -123, -90, -73, -65, -79, -129, -166, -168, -175, -153, -108, -72, -48, 17, 48, 46, 28, 2, 0, 4, 18, 62, 71, 53, 59, 61, 34, 23, 15, -34, -70, -65, -24, -4, -13, -38, -91, -102, -98, -105, -100, -105, -90, -75, -88, -122, -82, 2, 34, 38, 74, 110, 116, 114, 94, 67, 50, -21, -112, -162, -183, -173, -161, -185, -241, -278, -238, -175, -120, -56, -10, -39, -94, -110, -89, -65, -9, 31, -4, -53, -55, -27, 3, 17, -4, -64, -115, -115, -85, -26, 38, 68, 64, 35, 14, -33, -80, -120, -158, -172, -136, -79, -79, -98, -125, -173, -167, -149, -130, -86, -67, -68, -114, -167, -171, -124, -63, -86, -141, -171, -186, -162, -104, -67, -77, -62, -16, -17, -65, -125, -162, -165, -155, -124, -78, -11, 25, 13, 23, 35, 15, 2, 6, -11, -86, -157, -147, -128, -117, -101, -76, -60, -68, -54, -3, 11, 4, -22, -40, -70, -95, -106, -125, -110, -57, -35, -27, -16, -29, -37, -22, 10, 22, 26, 25, -4, -23, -20, -27, -23, -43, -87, -105, -113, -139, -157, -163, -166, -115, -63, -69, -66, -60, -58, -78, -86, -82, -95, -74, -19, -11, -20, -21, -55, -73, -32, -11, -31, -49, -61, -84, -106, -115, -127, -141, -133, -87, -57, -72, -94, -117, -140, -132, -144, -152, -136, -95, -38, 25, 56, 35, 15, 21, 15, -8, -11, 21, 68, 53, 28, 24, 13, 6, 8, 5, -29, -50, -52, -39, -5, 13, 20, -23, -112, -171, -142, -99, -96, -84, -65, -35, 24, 28, 24, 51, 44, 39, 37]
2485C7J4kj2K2J2k4l1nk0j9QK1J8K0qokjNNj4k2j3pL1K1jjl0l4l2j1j6j0M7K1MM1j0n9k9J1
2472h1K2K3On3q8l9K0L4K6j9qM4O2K7Rj5m9l5jmK6P2K9o0n9OM9M2L3O5N8jn8m9k5k9l0j6j0
2460g6K1K0qm0n3j8L1K8om5l1j2j2j3j5J7L1lj9ok3J6P2P1M8lj1KJ6M0N2K9J3J8ll4oqj6j6
2447D8n6o8J4N3K8ok1k3nJ1j3k9m2k9J6L5J6kl4k3oj6m6k7QJ9O3N3M2K4J7K1k8n0k0nJ9Oj6
2435g2lk8k2O8R5L1J6Rk1kJ9J0pjJ0l3p4n2l5j4L4K2j3j7j2k7j6j6J1K8K0J9mj3KN5N3m1m7
2423f8L8J9l1l2LK2nj7l3k9lKPMK4K7J0qlLOJ2OJ3kL0L6K9j5o7n8j5K2KoJ4%JJ3M2J7l6l6
2410f2j9J5KML5qj0K5nNJ1l9n0j2J0L1L4PJ4L5Jm7rJ4QPJ2k3m8l7Qk5l2j2j6k1OM5Q4O4J5
2397A7ml4m9l1K1L9N1K7k7l2j8jQJ9K4mm7n6j6J5m4n3QM3L2kl5J0N9L9K2J7Lk3j3Mpk9OL2
$$ y = [37, 51, 49, 37, 59, 71, 47, 16, 11, -9, -28, -20, 1, 19, 39, 31, 25, 23, 22, 27, 32, 18, -4, -17, -24, 7, 28, 27, 26, -4, -38, -70, -81, -97, -107, -60, -39, -35, 6, -4, -63, -92, -81, -59, -36, -30, -83, -171, -210, -190, -156, -130, -149, -157, -113, -51, -24, -15, -30, -79, -114, -115, -119, -93, -21, 8, -52, -111, -105, -56, -14, 19, 84, 142, 141, 83, 34, 9, -20, -50, -66, -76, -55, -35, -43, -83, -136, -154, -123, -95, -101, -146, -177, -189, -201, -214, -229, -212, -181, -184, -203, -209, -232, -216, -144, -73, -25, -28, -39, -37, -21, 19, 71, 100, 113, 131, 128, 94, 88, 80, 64, 48, -8, -76, -62, -9, 19, 13, -8, -31, -36, -25, -38, -67, -109, -138, -122, -87, -71, -73, -107, -130, -136, -152, -198, -225, -217, -198, -135, -82, -40, -16, 1, 22, -6, -56, -76, -81, -62, -56, -72, -75, -103, -125, -57, 38, 69, 85, 94, 73, 71, 90, 100, 93, 92, 102, 69, -5, -57, -92, -106, -72, -50, -63, -80, -92, -119, -135, -151, -140, -112, -92, -73, -77, -90, -88, -33, 20, -21, -68, -30, -11, -42, -74, -71, -49, -54, -71, -104, -133, -136, -134, -127, -123, -99, -72, -62, -70, -73, -70, -64, -52, -46, -33, -35, -5, 31, 60, 45, -22, -80, -95, -73, -71, -77, -63, -63, -62, -49, -7, 10, -26, -62, -81, -66, -64, -60, -25, -33, -43, -18, -23, -18, -7, -46, -96, -108, -98, -67, -33, -26, -12, 23, 24, -23, -32, -18, -10, -3, 9, -14, -62, -99, -91, -116, -148, -160, -176, -197, -191, -146, -62, 2, 17, 13, -21, -70, -101, -80, -41, 10, 37, 10, -22, -40, -41, -33, -14, 10, 6, -41, -97, -113, -98, -142, -195, -187, -144, -112, -114, -149, -139, -80, -41, -19, -2, 1, -22, -35, -31, -38, -67, -61, -29]
2385b9L3J0k4l1L0P5Ml8k5l9m8j3K6L8Qk1j2J8%k5l7n8n3mL4J5J6M2Q3N0Oj3J7L5Rpk5p8n5
2372h6j7k6l8rK3M2J0j1K1J1pK6N8M8Nk3qKk1l0j2j4m2j9J8J2J2M4ln7k6J0OK8L1k8k8lQK2
2360g1K9L0%k6k6K5N9K6k7l5n5n6l5l6j9JL0M8J8j4PM2L0kKk8l1qj4PM2L1j5l9qpl8k5K4K7
2348a37j0j8K9N3L4Jk7j1K7M8M2k5l7j2l3l1KnJ6No2m4pQN7M7mjJ6J7k3m4j2J5Mj7LL5N5N4
2335HJ8lk0n6j17p2O1R1O4P3Ml9k9rJ9K4J8mjK6ok7l9j1J1moQk0k8rJ9K4m1o1qM9O0L5j2j3
2322b3%lkj0j6j0j8k6J1K0J7K6%j4m8n1m0JK7J7k4j7K3L9L1K7Rrk9o1n0k0K0M5L6L3J0M0M2
2310CJ4j7j9J6M2L6K6Nj2k9oqk4m5l9j9opJ3J4MjQM7M2M3lm6l6l2k3J8J7J3J1j0j8NK5Pl3
2298b4j7jj2nRj0m1lK6J8K0K1Oj9pj1k4k9mKlL2L7kjK8M5M2K9l1q2q1m3J0L5K9Ll1j4J3k5
$$ y = [-29, 4, 14, -10, -41, -11, 64, 68, 30, 5, -34, -82, -95, -69, -31, -23, -44, -56, -38, -38, -63, -100, -158, -211, -215, -181, -166, -150, -108, -25, 25, 31, 18, 35, 70, 79, 72, 47, -31, -86, -103, -129, -167, -176, -153, -111, -101, -112, -91, -80, -87, -61, -3, 45, 50, 27, 19, 21, 0, -30, -42, -56, -98, -117, -99, -87, -75, -31, -34, -91, -117, -107, -101, -73, -42, -70, -98, -101, -93, -71, -42, -12, -12, -38, -64, -39, 20, 46, 19, -16, -71, -127, -162, -198, -217, -216, -186, -138, -120, -134, -127, -85, -55, -57, -55, -83, -114, -122, -136, -129, -87, -56, -71, -110, -118, -125, -163, -188, -164, -137, -147, -165, -136, -83, -49, -48, -75, -86, -59, -11, 31, 6, -31, -43, -76, -107, -105, -110, -94, -89, -151, -195, -202, -194, -137, -90, -94, -95, -79, -62, -85, -129, -141, -126, -122, -139, -136, -101, -46, 8, 26, 23, 3, -53, -170, -242, -181, -90, -26, 47, 51, 12, -17, -26, -7, 17, 35, 31, 30, 56, 50, 23, -16, -27, -16, -20, -26, -18, -38, -66, -75, -56, -32, -73, -134, -142, -93, -33, 2, -10, -23, -23, -26, -28, -38, -54, -64, -82, -108, -97, -77, -60, -34, -34, -48, -96, -147, -187, -186, -159, -142, -166, -183, -160, -121, -90, -63, -54, -63, -92, -153, -203, -223, -203, -158, -122, -89, -79, -39, 3, 17, 0, -19, -3, 39, 75, 101, 106, 94, 65, 59, 51, 27, -18, -57, -76, -82, -89, -76, -62, -58, -59, -51, -4, 38, 81, 78, 32, -4, -36, -59, -41, -24, -11, 0, -10, -28, -23, 2, 9, -24, -41, -42, -54, -59, -50, -60, -101, -104, -78, -60, -40, -19, -13, -32, -39, -50, -74, -103, -107, -105, -108, -76, -39, -41, -42, -14, 31, 73, 102, 71, -11, -92, -135, -125, -90, -61, -58, -89, -103, -90, -115]
2285a15n5n7l1J0L1L9P8O4L2M4K7J2%jJ6K4K9Qm7pmo6o5J4L5K7J4k4mK1j5l0k8k2j9j5L1M6
2273cJ1j9j4j4m8m5J7N4N7Nn5n9rK7K0L4K7omK1Lk0j7NqK5M7RJ7J5j5oqj4mkj6o9n0J1K7m
2260g7mJ3K3Olk6n3p1l0L6L4J5M7O2M2M2L8K9jm4l5k2m5m1j0jPJkPJ9J3J2K7J4k6k6k4J9K6
2248ijj7k1J1mpN0K4k2RL7Mk1k7k2J5K7j9jK9NOql5n3l9mqj0rjK7N6N5kj1Mlj8k3rj1J1L3
2234a2K1j4m1j9J6j6l5JJ5J5KK1N3L9QPJj8j7l5l5%j2k7k1oL2M1J1RK7K1k1r3q4nL%JJJ0K5
2221a31NKj7j3K1M8P8O1J0k1l2m7l6l5o0n0J5N3P6N3jl0nL2qk0nk5m9m1J5N7M9Rk6m4k8K6
2209a14j5k2RJ1OkJ9K2j3m4RQ0P1M0Oj6K7M2K2K5k3p7p5n9rJ4j9n6n7j0mjKJ2K2M4N0N4P0
2197D1Ml5j0K1K8J2kk2m2m8m7pj4m1qJ3Lk7j7K1Pj5m5j2P3Q2P0N1j6p6r8m8K7O9Q2O5L2K2
$$ y = [-115, -170, -227, -258, -248, -217, -178, -100, -36, -4, 40, 67, 79, 79, 78, 94, 118, 147, 155, 108, 101, 97, 31, -34, -20, 15, 42, 56, 32, 28, 49, 34, 4, -24, -46, -65, -80, -49, -3, 8, -11, -25, -39, -87, -132, -115, -61, -4, 1, -54, -113, -122, -95, -75, -41, -14, -20, -24, -3, 0, -20, -37, -32, -40, -15, 32, 41, 58, 73, 58, 52, 44, 30, 26, 24, 8, -61, -111, -100, -73, -77, -81, -68, -45, -39, -42, -68, -121, -192, -222, -186, -152, -137, -90, -28, 14, 56, 94, 123, 122, 78, 43, 21, -24, -65, -75, -76, -69, -68, -70, -63, -44, -31, -19, 8, 22, -4, -30, -54, -35, -9, -10, -27, -48, -37, -41, -48, 2, 26, 4, 13, 50, 54, 33, 6, -16, -1, 26, 7, 6, 35, 40, 46, 38, 3, -50, -89, -93, -101, -111, -120, -121, -94, -38, 17, 15, 4, 8, 5, -13, -36, -45, -56, -45, -12, 9, -5, -46, -65, -49, -65, -100, -99, -84, -69, -67, -46, 7, 46, 54, 61, 62, 44, 27, -8, -43, -43, -55, -82, -103, -109, -77, -36, -25, -16, 11, 32, 11, -82, -166, -171, -168, -168, -167, -166, -156, -131, -126, -124, -141, -154, -133, -85, -7, 54, 64, 43, 11, -36, -72, -107, -167, -217, -202, -149, -73, -20, -21, -51, -56, -24, -32, -52, -57, -82, -131, -172, -157, -100, -51, -42, -68, -112, -140, -114, -129, -151, -142, -131, -125, -127, -108, -86, -99, -143, -134, -54, 17, 57, 63, 47, 74, 116, 138, 163, 140, 63, -12, -71, -80, -66, -85, -141, -198, -208, -212, -213, -211, -199, -177, -133, -83, -29, 41, 45, 10, 0, 21, 49, 61, 59, 37, -5, -53, -100, -107, -121, -162, -170, -157, -154, -181, -198, -177, -170, -185, -230, -242, -169, -87, -17, 34, 18, -58, -156, -204, -177, -108, -26, 39, 71, 93]
2185I3j6l9qj9k3j1k1L6N5ol0k3l8j9M9K6mn4n9J5L5J8J2j5l2j3J7K7kn0m1J7PL6N7K0nj2
2174b0K1L8K1j4n4onl5K5J8m6j2K5JKKlMooL6L6L0rj0Kj7n6n4K7M5J5qj2l9o9j5M1K8j9m4
2161a42l8k9PL1L9K8KK2J8Jj8m2k2J1J9Km1n1PN9M1mj0J3L9K8K0l4o3m8l6k6L7P7M2K5ll6
2149g5JK3j4k9%Q%j2K3L1J5K1QkQJl0k2j0K8J4J9L6J9kj3PK9L0j6l5pJ6k1o0m6m2j8j6k4j5
2136a72OL3J3RK4R%lLLl2J4K9jk3m4l4mj7k1J5K6K3J8K2J4rrJ4K8ol4oK5N8L4l8n9nK3Klr
2123h4J2l4r2n1L8L1OJ2P8R7Qk5l8o3k6KL2P1P1K3j5l3n5j1J4Mkl8k5J2K9L2L4J1k2o0m8J4
2111i1kj4oQL2J8Mj6j8KL3L8rn0j9j4m3j4J3K9J6M3N7K3K1mk6l1l7rJ7Kk7k3RKk2KQrJJ1J8
2098g7j5m1OK2j3%M6K1l4k3K5M5N1J8J3mk7n3m5l1j2JJ6J2nl8j8J3J1J7L3O1N3j4n2k1L5K6
$$ y = [93, 77, 38, 30, 11, -12, -23, -44, -8, 47, 41, 11, -12, -50, -69, -20, 6, 2, -52, -111, -96, -61, -43, -31, -46, -78, -91, -74, -47, -49, -99, -140, -123, -116, -80, -23, -3, -8, -20, 1, 39, 60, 46, -8, -14, -19, -54, -29, -11, -57, -69, -44, -43, -41, -39, -42, -38, -44, -50, -14, 22, 52, 43, 33, 35, 18, -38, -92, -65, -20, -5, -13, -25, -64, -133, -148, -107, -79, -98, -142, -180, -209, -202, -171, -132, -104, -102, -80, -62, -61, -79, -121, -143, -132, -113, -111, -152, -203, -196, -137, -96, -100, -110, -97, -58, -30, -10, -44, -107, -155, -191, -217, -180, -103, -61, -36, -39, -75, -74, -51, -65, -94, -94, -86, -86, -98, -75, -44, -29, -8, 0, -2, 6, 7, -23, -45, -55, -27, -13, 6, 42, 61, 59, 46, 53, 82, 112, 96, 61, 54, 70, 49, -11, -57, -99, -117, -133, -157, -172, -166, -133, -120, -111, -87, -78, -78, -81, -78, -75, -107, -93, -64, -65, -88, -132, -166, -170, -187, -208, -193, -167, -144, -126, -104, -90, -99, -108, -94, -66, -72, -106, -112, -87, -29, 5, -33, -92, -97, -74, -72, -75, -84, -72, -106, -198, -249, -211, -180, -174, -162, -84, 13, 21, -4, -42, -105, -131, -129, -97, -26, 45, 68, 53, 20, -35, -46, -32, -28, -30, -68, -93, -81, -52, -20, 14, 25, 3, -57, -105, -91, -93, -107, -113, -105, -73, -55, -51, -67, -85, -83, -50, -12, -21, -71, -90, -104, -147, -161, -148, -119, -103, -60, -3, 20, 41, 37, 11, -20, -57, -66, -49, -47, -74, -97, -88, -86, -108, -106, -98, -107, -106, -95, -77, -92, -133, -127, -105, -118, -118, -72, -51, -85, -108, -83, -38, 13, 31, 44, 40, 13, -40, -85, -116, -128, -127, -111, -99, -104, -142, -160, -147, -136, -119, -86, -25, 28, 14, -38, -59, -24, 2]
2086BKl8m8kL7L3K5L2j0l7l6l5j4L3J5mJ8l5o0k9oJ9K1mL4R1R7L5j3m4p1p9m1oL0P3M6J6J
2074D8J9K6k3p5r6p5pK1M4N6L9lj3J1K8K9ml3k4rK5j9q9m0K0PL6O3K5nk0K2Qk5l9j6K5Nl2
2062i0k8k0mnm3k9K9O3N8N4J8m8n3l8j8J4N8N4J1mOJ7npKj3k8j2kLL1J5l2o5k5M2L4J5K6J5
2050dkk3m3l9kN3O6L8QK2j3o3p6n3j6k6k1K3J4K6L4K3J1kJ4M8M0pl8o4n8NO2N0J2Kj8k6QL8
2037CK0J0K0nl8n9J0M9jl8J3M9L5K3j6j8j2j8qJ7%k7k2j6K5O0J3j1L1J7mmn8o6j4J7j1m8o0
2025a42m5k1K3O0O2J9j9lMj3k0l0m5l8KN6R5P7L0j0pj5k4lj0J8RqL0N3Rj4j8n3n5k0J6J0o
2013d6J7L7L4j1j7k5k4j0k7m1o0l4J6M6O1K8j4o1o1j6M9O2J6lk5m9%L3M1Ml7o5o2m6j3L0N7
2001b16M0L9Nk9k1l7j2J7nK3O0M4L1J4l3k4L8M2K7J5J3K3rl2l2k5l4k5K9N0jKL3k6k7J8oo1
$$ y = [2, 4, -34, -82, -84, -47, -14, 11, 43, 33, -4, -40, -75, -89, -56, -41, -45, -27, -62, -122, -151, -157, -138, -117, -121, -87, 4, 101, 136, 123, 79, 8, -71, -112, -118, -88, -15, 31, 47, 48, 67, 93, 70, -5, -101, -176, -183, -162, -118, -62, -23, -26, -39, -28, 0, 29, 25, -8, -32, -41, -16, -35, -124, -164, -144, -137, -101, -38, -13, -18, -38, -16, -8, -33, -72, -88, -63, -58, -90, -118, -138, -142, -147, -190, -219, -190, -127, -69, -15, 3, -45, -98, -136, -154, -140, -82, -28, -17, -21, -15, 2, -3, -10, -8, -21, -49, -61, -63, -60, -29, -14, -46, -111, -136, -94, -60, -45, -19, -4, -6, -29, -72, -111, -113, -60, 6, 44, 52, 74, 61, -2, -78, -131, -147, -173, -194, -171, -157, -131, -97, -74, -63, -65, -51, -3, 37, 30, -8, -72, -130, -125, -63, -13, -1, 1, -17, -43, -35, 3, 23, 33, 53, 48, 10, -49, -39, 10, 9, -29, -16, 33, 68, 91, 75, 57, 45, 27, 19, 36, 36, 9, -13, -29, -4, 56, 69, 58, 89, 106, 102, 98, 40, -26, -40, -23, -34, -82, -142, -187, -208, -185, -125, -63, -44, -63, -66, -62, -75, -95, -125, -170, -208, -206, -150, -55, 22, 52, 42, 35, 20, -4, -7, -17, 1, 10, 2, 32, 85, 94, 80, 62, 9, -46, -66, -50, -40, -46, -29, 8, 42, 31, 14, -11, -35, -45, -72, -113, -173, -207, -191, -145, -84, -56, -70, -131, -192, -208, -159, -97, -81, -84, -109, -158, -158, -125, -84, -80, -117, -182, -244, -290, -303, -273, -216, -176, -137, -132, -161, -182, -219, -231, -214, -219, -196, -136, -92, -61, -47, -80, -104, -66, -24, 3, 18, 31, 54, 45, 13, -19, -44, -78, -103, -74, -24, -25, -23, 10, -16, -43, -25, -31, -92]
1990i2p8p5oQ5Q6L8j7m2l3j5J8QJ0M2K1MPj5m6l3oLK3L4Qk2J2L0L0K2kk0l1m9j3j1J4L5J7
1978e9J2j2k3LK6jk8k4l5l2j3mJ1J8L2O2L4J2J0j1pj3l4qJ0J4M4K9Pj0k3qK6J9j9k4j3rlP
1965c7Opl1m1m2m9p0k6J6K7Q8J59Q4jrj9k4j7k4kj9n7k9KN2M4qrJ5L0K8L8MkK3j7l4k9j7l
1953gl2n5n6j3J0J9J5L7L6M8K6m3n2j4K5L7K2j4k3l8qL6RkoPj0m5l1J3L7nk9KM5N1L7K5kk7
1940B5jL1Lk2j9j9k3nj5k1PK3Qj3RL8Ml2j2J6npk9m6k1J0M3M7K6J0j8m4l7J7L6L6rk4J7K3
1928GJ3l0j6j2n9m3K1L0J4Okoj9jL8J5J8L9Nk6j9JKNK2ro6o6k1L6K5m4o4K0P6Q7P3K7kj4L
1915F4J6J6k0k7Qjj6K8M2L4Ll7l9J2J0m7m3k4m1k9kK6L4Ok1j8QJ6K1K4kl0m4l3J3J3M1K3p
1903b3KK3L4J2J6k3o6m4j5J4J3K2M8Pj8j0K8Rj5krn2m5onj9LK8jjJ7M4ol8J1L4j5n7l8J1M3
$$ y = [-92, -170, -245, -251, -166, -80, -42, -59, -101, -134, -149, -131, -123, -113, -71, -50, -46, -39, -54, -100, -133, -139, -136, -113, -79, -71, -93, -81, -51, -21, 1, -1, -21, -52, -101, -114, -125, -111, -76, -59, -47, -59, -82, -79, -53, -54, -82, -106, -141, -173, -186, -190, -179, -161, -129, -67, -33, -21, -11, -22, -29, -42, -76, -84, -74, -60, -16, 13, 20, 10, -13, -21, 5, 24, 5, -19, -32, -41, -44, -37, -31, -38, -69, -110, -152, -201, -271, -297, -281, -254, -166, -7, 77, 76, 67, 48, 24, 7, -17, -19, -38, -95, -124, -122, -70, -26, -34, -43, -28, 2, 30, 68, 72, 70, 93, 76, 42, 13, -4, -7, -39, -94, -150, -163, -153, -134, -119, -82, -46, 2, 28, -15, -67, -81, -56, -19, 3, -11, -34, -72, -80, -44, -35, -37, -43, -36, -46, -91, -122, -109, -72, -77, -106, -104, -59, -8, 29, 54, 52, 25, 24, 55, 58, 36, 17, -2, -25, -30, -45, -66, -59, -36, -28, -41, -32, 6, 10, -22, -34, -18, -23, -30, -59, -105, -126, -116, -73, -26, 0, 10, -8, -52, -89, -72, -36, 0, -9, -33, -16, 7, 20, -10, -26, -38, -97, -140, -119, -89, -75, -69, -71, -77, -96, -97, -59, -44, -26, 13, 18, -8, -27, -26, -24, -19, 3, -6, -72, -138, -159, -123, -98, -142, -206, -186, -110, -23, 50, 77, 75, 61, 64, 80, 96, 76, 49, 57, 56, 40, 68, 110, 144, 147, 110, 71, 83, 93, 46, 3, -21, -62, -91, -93, -67, -33, -27, -48, -66, -58, -42, -21, 3, 1, -29, -73, -106, -93, -80, -39, -16, -23, -21, 2, 36, 48, 64, 41, -25, -69, -84, -70, -57, -35, 13, 20, 2, -8, 20, 29, 14, 12, 3, -49, -94, -100, -105, -124, -121, -93, -94, -95, -78, -34, -40, -78, -67, -33, -48, -105, -143, -132, -89]
1890h9M2L7K0pj6J6OjJ7Rj1m1lN2N7K8kqK0K7l8m0m9p6l8j6k4k4J4OJK7L2oj5j7k9j0MNK8
1878a12J6j0qj5OM1K3rj4j8lK1omN6N0rj3K3%l0m0J0K7j3k6j2K2L5L6J2n3l9lJ7L8L1j1m8
1866c2j9K9L6J3j0Mll7n1k6lM0L2J8J8k1l1J3Nk8MK4j3mNQj4k4J7L2J2l5k5K8M6K9Ok6k1o
1853a0Lj9rOn1l6K3L9L9L5L8N0Pn5m6l1k0N2J01Q5J2q0p0p4q5j5L8N6L7rl3J0L1K5j2rJ2R
1841D4%JM6O2K7k2p8p4j5L1J4l6o8n3NN3Qj1K4K1Qj0kJ1rJ1L1J2l4n0KRqL2M3J3J7k8q9l1
1829i3K7O8j2o8n2J3P3Nm2l9n1m0K9L3j0J3K4J9O5P6K7k1k6j0l8k2Qkk3OJ3k1l6l1k6qM0M2
1817i0M0K6K8L4Rj0J0lj8n8p9k6M7O4J3l4j7j4j6kJk4k3KN8P7K0m8p2l0NL7NJK2Mj3m3k7q
1805a52QM7O5L8MJ7J7k0k0l0j03r4l3J3L1PK5M3J8KJ0J0J0L9N6Rn3m2j4l6oM5N4L2LjJ3k3
$$ y = [-89, -47, -10, 10, 3, -13, 3, 9, 8, 25, 34, 23, -18, -21, 31, 88, 116, 114, 106, 126, 153, 115, 75, 26, -50, -88, -104, -128, -152, -138, -132, -131, -104, -72, -78, -93, -110, -139, -149, -145, -140, -112, -96, -106, -114, -129, -123, -82, -59, -68, -82, -100, -103, -82, -88, -92, -36, 14, 5, -8, 15, 15, -15, -55, -45, -18, -31, -57, -69, -47, -12, 24, 36, -17, -56, -59, -42, -4, 27, 16, -32, -51, -22, 14, 27, 17, 21, 18, -19, -70, -96, -99, -59, -27, -9, 9, -12, -43, -30, -25, -53, -49, -25, -38, -42, -37, -29, -43, -67, -50, -18, -6, -41, -66, -38, 8, 37, 43, 17, -4, -10, -7, -26, -35, -29, -80, -116, -93, -54, -15, 20, 58, 108, 115, 60, 14, -17, -37, 15, 116, 201, 213, 133, 63, -11, -96, -111, -73, -17, 20, 11, -22, -12, 19, 44, 32, 23, 35, 44, 44, 45, 91, 153, 180, 158, 80, 6, -9, 22, 36, 0, -68, -121, -116, -63, -55, -66, -42, -21, -13, -23, -25, -14, -23, -12, 19, 31, -3, -53, -51, -42, -50, -18, 25, 38, 55, 27, -62, -93, -66, 2, -10, -78, -130, -117, -44, -39, -81, -120, -171, -211, -182, -149, -159, -146, -122, -103, -38, 38, 65, 44, 18, 8, -30, -52, -44, -46, -69, -63, -50, -71, -107, -138, -164, -172, -132, -90, -50, -24, 4, 38, 47, 37, 47, 44, 26, -32, -111, -137, -90, -26, -13, -47, -64, -78, -94, -96, -95, -119, -142, -140, -82, -5, 15, -33, -105, -135, -130, -93, -88, -87, -65, -61, -74, -117, -144, -152, -144, -97, -32, 6, 10, 27, 44, 24, 4, -26, -129, -223, -256, -243, -212, -205, -180, -137, -119, -117, -107, -97, -87, -48, 8, 17, -36, -78, -92, -128, -134, -89, -35, -3, 0, -1, 12, -11]
$$ [...]
-1510F7
##END=		$$ NMR SPECTRUM
##END=		$$ LINK
