##TITLE=	Jul25-2022-lemw22.10.fid
##JCAMP-DX=	6.0	$$ MestReNova 14.3.3-33362
##DATA TYPE=	LINK
##BLOCKS=	1    
##ORIGIN=	Mestrelab Research S.L.
##OWNER=	hrzepa
##$MNOVA/METADATA=	(DOCUMENT,BASE64)
eyJuYW1lIjoiRG9jdW1lbnQgMSIsInBhZ2VzIjpbeyJpdGVtcyI6WyIxIiAgICAgXX1dfQ==
##TITLE=	Jul25-2022-lemw22.10.fid
##JCAMP-DX=	6.0	$$ MestReNova 14.3.3-33362
##DATA TYPE=	NMR SPECTRUM
##DATA CLASS=	XYDATA
##BLOCK_ID=	1
##ORIGIN=	Bruker BioSpin GmbH
##OWNER=	nmr
##NUMDIM=	1
##$MNOVA/METADATA=	(ITEM,BASE64)
eyJhbmdsZSI6MCwiYXhlcyI6eyJ4Ijp7Im1heCI6MjAuOTU5NjU5OTk5OTU5NzgzLCJtaW4iOi04Ljc
5MDg1ODU0MDY5ODcyNX0sInkiOnsibWF4IjozMjM5NTg2OSwibWluIjotMjk0NjcxMS40MzQ1NzAzMT
I1fX0sInBvaW50cyI6W3sieCI6NTMyMSwieSI6NTgzNX0seyJ4Ijo4NzIyLCJ5Ijo1ODM1fSx7IngiO
jg3MjIsInkiOjgyMDh9LHsieCI6NTMyMSwieSI6ODIwOH0seyJ4Ijo1MzIxLCJ5Ijo1ODM1fV0sInoi
OjB9
##.OBSERVE FREQUENCY=	400.15247108400001252
##.OBSERVE NUCLEUS=	^1H
##.SOLVENT NAME=	CDCl3
##.PULSE SEQUENCE=	zg30
##LONGDATE=	2022/07/25 17:32:15.000
##.ACQUISITIONMODE=	SIMULTANEOUS (DQD)
##$ORIGINAL FORMAT=	Bruker XWIN-NMR
##$MNOVA/SCALES_VERSION=	9
##$PARAMETER FILE=	(acqus, ASCII, /Users/hrzepa/Library/Mobile%20Documents/com~apple~CloudDocs/Bath/FAIR%20NMR%20Submission/Compound%201/1H/acqus, 0)
$$ ##TITLE= Parameter file, TopSpin 4.1.1
$$ ##JCAMPDX= 5.0
$$ ##DATATYPE= Parameter Values
$$ ##NPOINTS= 8	$$ modification sequence number
$$ ##ORIGIN= Bruker BioSpin GmbH
$$ ##OWNER= nmr
$$ $$ 2022-07-25 17:30:22.124 +0100  nmr@chpc-nmr400a
$$ $$ D:/data/lemw22/nmr/Jul25-2022-lemw22/10/acqus
$$ $$ process C:\Bruker\TopSpin4.1.1\prog\mod\xwish3.exe
$$ ##$ACQT0= -1.70581753891579
$$ ##$AMP= (0..31)
$$ 100 100 100 100 100 100 100 100 100 100 100 100 100 100 100 100 100 100
$$ 100 100 100 100 100 100 100 100 100 100 100 100 100 100
$$ ##$AMPCOIL= (0..32)
$$ -1 0 0 0 0 0 0 0 0 0 0 0 0 0 0 0 0 0 0 0 0 0 0 0 0 0 0 0 0 0 0 0 0
$$ ##$AQSEQ= 0
$$ ##$AQ_mod= 3
$$ ##$AUNM= <au_zg>
$$ ##$AUTOPOS= <26 >
$$ ##$BF1= 400.15
$$ ##$BF2= 400.15
$$ ##$BF3= 400.15
$$ ##$BF4= 400.15
$$ ##$BF5= 400.15
$$ ##$BF6= 400.15
$$ ##$BF7= 400.15
$$ ##$BF8= 400.15
$$ ##$BWFAC= (0..63)
$$ 0 0 0 0 0 0 0 0 0 0 0 0 0 0 0 0 0 0 0 0 0 0 0 0 0 0 0 0 0 0 0 0 0 0 0 0
$$ 0 0 0 0 0 0 0 0 0 0 0 0 0 0 0 0 0 0 0 0 0 0 0 0 0 0 0 0
$$ ##$BYTORDA= 0
$$ ##$CHANFCU= (0..24)
$$ 0 0 1 0 0 0 0 0 0 0 0 0 0 0 0 0 0 0 0 0 0 0 0 0 0
$$ ##$CHANREC= (0..24)
$$ 0 0 0 0 0 0 0 0 0 0 0 0 0 0 0 0 0 0 0 0 0 0 0 0 0
$$ ##$CHEMSTR= <none>
$$ ##$CNST= (0..63)
$$ 1 1 145 1 1 1 1 1 1 1 1 1 1 1 1 1 1 1 1 1 1 1 1 1 1 1 1 1 1 1 1 1 1 1 1
$$ 1 1 1 1 1 1 1 1 1 1 1 1 1 1 1 1 1 1 1 1 1 1 1 1 1 1 1 1 1
$$ ##$CPDPRG= (0..8)
$$ <> <> <> <> <mlev> <mlev> <mlev> <mlev> <mlev>
$$ ##$D= (0..63)
$$ 0 0.1 0 0 0 0 0 0 0 0.06 0 0 0 0 0 0 0.0002 0 0 0 0 0 0 0 0 0 0 0 0 0 0
$$ 0 0 0 0 0 0 0 0 0 0 0 0 0 0 0 0 0 0 0 0 0 0 0 0 0 0 0 0 0 0 0 0 0
$$ ##$DATE= 1658766735
$$ ##$DATE_START= 1658766641
$$ ##$DE= 8.794183
$$ ##$DECBNUC= <off>
$$ ##$DECIM= 1680
$$ ##$DECNUC= <off>
$$ ##$DECSTAT= 4
$$ ##$DIGMOD= 3
$$ ##$DIGTYP= 17
$$ ##$DR= 32
$$ [...]
$$ 1 1 1 1 0 0 0 0 0 0 0 0 0 0 0 0 0 0 0 0 0 0 0 0 0 0 0 0
$$ ##$ShimPowRng3= (0..63)
$$ 1 1 1 1 1 1 1 1 1 1 1 1 1 1 1 1 1 1 1 1 1 1 1 1 1 1 1 1 1 1 1 1 1 1 1 1
$$ 1 1 1 1 0 0 0 0 0 0 0 0 0 0 0 0 0 0 0 0 0 0 0 0 0 0 0 0
$$ ##$ShimPowType1= 8
$$ ##$ShimPowType2= 8
$$ ##$ShimPowType3= 0
$$ ##$ShimPowType4= 0
$$ ##$ShimPowType5= 0
$$ ##$ShimPowType6= 0
$$ ##$ShimPowType7= 0
$$ ##$ShimPowType8= 0
$$ ##$ShimSysActGrad= (0..63)
$$ 1 2 3 4 13 5 7 11 10 9 6 8 12 18 19 20 21 15 22 23 24 14 25 16 26 17 27
$$ 28 31 32 33 34 35 36 37 38 0 0 0 0 0 0 0 0 0 0 0 0 0 0 0 0 0 0 0 0 0 0
$$ 0 0 0 0 0 0
$$ ##$ShimSysAngle= <>
$$ ##$ShimSysFunc= (0..63)
$$ 1 2 3 4 5 6 7 8 9 10 0 37 38 35 16 15 14 13 12 11 28 27 26 25 24 23 36
$$ 22 30 29 20 21 34 33 32 31 17 18 19 0 0 0 0 0 0 0 0 0 0 0 0 0 0 0 0 0 0
$$ 0 0 0 0 0 0 0
$$ ##$ShimSysMatId= <292722aa.dat>
$$ ##$ShimSysMatrix= 1
$$ ##$ShimSysMinMaxUG= 130000
$$ ##$ShimSysOffset= <37mm>
$$ ##$ShimSysType= 4
$$ ##$ShimUnit= 3
$$ ##$SpectrOsVersion= <4.1.148.20201202>
$$ ##$TCubeEth= <192.168.180.22>
$$ ##$TCubeSeqDevice= <>
$$ ##$TOSITY= <no>
$$ ##$TRIPLO2= 0
$$ ##$TopSpinVersion= <TopSpin 4.1.1>
$$ ##$TrxFreqFormula= (0..23)
$$ <TrxFreqFormula(2.0,400150000.000000,'TRX',Trx(1.0,'TRX 1200.1',2,5.000000,1290.000000))>
$$ <TrxFreqFormula(2.0,400150000.000000,'TRX',Trx(1.0,'TRX 1200.2',2,5.000000,1290.000000))>
$$ <> <> <> <> <> <> <> <> <> <> <> <> <> <> <> <> <> <> <> <> <> <>
$$ ##$TrxPN= (0..23)
$$ <Z148391> <Z148391> <> <> <> <> <> <> <> <> <> <> <> <> <> <> <> <> <>
$$ <> <> <> <> <>
$$ ##$TrxSN= (0..23)
$$ <02953> <02954> <> <> <> <> <> <> <> <> <> <> <> <> <> <> <> <> <> <> <>
$$ <> <> <>
$$ ##$VCubeEth= (0..23)
$$ <no> <no> <no> <no> <no> <no> <no> <no> <no> <no> <no> <no> <no> <no> <no>
$$ <no> <no> <no> <no> <no> <no> <no> <no> <no>
$$ ##$VTU= 2
$$ ##$VTUETH= <192.168.99.11>
$$ ##$VTUTY= <no>
$$ ##$ValueLine= no
$$ ##$VpuPN= (0..23)
$$ <no> <no> <no> <no> <no> <no> <no> <no> <no> <no> <no> <no> <no> <no> <no>
$$ <no> <no> <no> <no> <no> <no> <no> <no> <no>
$$ ##$VpuSN= (0..23)
$$ <no> <no> <no> <no> <no> <no> <no> <no> <no> <no> <no> <no> <no> <no> <no>
$$ <no> <no> <no> <no> <no> <no> <no> <no> <no>
$$ ##$WBREFAM= (0..31)
$$ 142.7 107.1 100 100 100 100 100 100 100 100 100 100 100 100 100 100 100
$$ 100 100 100 100 100 100 100 100 100 100 100 100 100 100 100
$$ ##$WBREFLM= (0..31)
$$ 0 0 0 0 0 0 0 0 0 0 0 0 0 0 0 0 0 0 0 0 0 0 0 0 0 0 0 0 0 0 0 0
$$ ##$WBREFPH= (0..31)
$$ 72.61 -67.16 0 0 0 0 0 0 0 0 0 0 0 0 0 0 0 0 0 0 0 0 0 0 0 0 0 0 0 0 0
$$ 0
$$ ##$WBSGU= (0..31)
$$ 2 0 1 0 0 0 0 0 0 0 0 0 0 0 0 0 0 0 0 0 0 0 0 0 0 0 0 0 0 0 0 0
$$ ##END=
$$ 
##$DECIM=	1680
##$DSPFVS=	21
##XUNITS=	HZ
##YUNITS=	ARBITRARY UNITS
##FIRSTX=	8387.008713094288396
##LASTX=	-3517.6623655422376942
##DELTAX=	-0.090826125372023752691
##XFACTOR=	1
##YFACTOR=	898.79421369060332836
##FIRSTY=	967.20623779296875
##MINY=	-1632.4345703125
##MAXY=	29450790
##NPOINTS=	131072
##XYDATA=	(X++(Y..Y))
$$ [...]
4079BJ%kjJ%%%Jj%Jj%%jJJ%jjJK%j%%%%jJ%%%JJkjjJJ%%%%jJJkJ%%j%J%%j%J%%j%J%%%j%%
$$ 2 3 3 1 0 1 1 1 1 2 1 1 2 1 1 1 0 1 2 2 1 0 1 3 3 2 2 2 2 2 1 2 2 2 2 3 4 2 1 0 1 2 2 2 2 2 1 2 3 1 2 2 2 1 1 2 2 2 1 1 2 2 2 1 1 2 2 2 2 1 1 1
4073A%%J%jK%j%j%%J%%j%JjJKj%j%%%%JjjJ%J%jJ%%jj%J%j%%%%JjJjjJ%J%%jJjJj%%JjJ%%
$$ 1 1 1 2 2 1 3 3 2 2 1 1 1 2 2 2 1 1 2 1 2 4 3 3 2 2 2 2 2 3 2 1 2 2 3 3 2 3 3 3 2 1 1 2 2 1 1 1 1 1 2 1 2 1 0 1 1 2 2 2 1 2 1 2 1 1 1 2 1 2 2 2
4066Bj%%jJ%%J%%%%j%J%J%%j%%J%%jjJj%J%%j%JJjj%%K%jj%J%jJ%%%%%%%%%jJ%J%jj%Jj%J
$$ 2 1 1 1 0 1 1 1 2 2 2 2 2 1 1 2 2 3 3 3 2 2 2 3 3 3 2 1 2 1 1 2 2 2 1 1 2 3 2 1 1 1 3 3 2 1 1 2 2 1 2 2 2 2 2 2 2 2 2 2 1 2 2 3 3 2 1 1 2 1 1 2
4060B%%%%%%%J%%%%%j%%%j%Jj%J%%Jjj%%JJj%Jj%%jJkJJk%Jj%J%%J%%J%j%%jJ%%jJ%%%%j%
$$ 2 2 2 2 2 2 2 2 3 3 3 3 3 3 2 2 2 2 1 1 2 1 1 2 2 2 3 2 1 1 1 2 3 2 2 3 2 2 2 1 2 0 1 2 0 0 1 0 0 1 1 1 2 2 2 3 3 2 2 2 1 2 2 2 1 2 2 2 2 2 1 1
4054A%Jj%%%%%J%%j%%%J%j%%Jj%J%j%%jK%jK%j%%%Jj%jJjj%J%%JJ%j%%JJ%kJjj%%%J%J%jk
$$ 1 1 2 1 1 1 1 1 1 2 2 2 1 1 1 1 2 2 1 1 1 2 1 1 2 2 1 1 1 0 2 2 1 3 3 2 2 2 2 3 2 2 1 2 1 0 0 1 1 1 2 3 3 2 2 2 3 4 4 2 3 2 1 1 1 1 2 2 3 3 2 0
4047@J%%JjJJ%k%%j%J%%%J%%jj%%JJJj%%k%JJ%%%%%j%%%J%jJ%j%%J%jJ%jJ%%%%j%%%%J%%j
$$ 0 1 1 1 2 1 2 3 3 1 1 1 0 0 1 1 1 1 2 2 2 1 0 0 0 1 2 3 2 2 2 0 0 1 2 2 2 2 2 2 1 1 1 1 2 2 1 2 2 1 1 1 2 2 1 2 2 1 2 2 2 2 2 1 1 1 1 1 2 2 2 1
4041AJj%%%j%%KJ%%j%J%j%jJ%jjJ%%%%%%%J%%%J%jj%%%%j%%K%j%J%%%%%j%jjKJ%%j%J%j%J
$$ 1 2 1 1 1 1 0 0 0 2 3 3 3 2 2 3 3 2 2 1 2 2 1 0 1 1 1 1 1 1 1 1 2 2 2 2 3 3 2 1 1 1 1 1 0 0 0 2 2 1 1 2 2 2 2 2 2 1 1 0 -1 1 2 2 2 1 1 2 2 1 1 2
4034BJjKjj%%jJ%j%JJ%%jjJjJ%%j%%JJ%jjJ%%%%%%%J%j%Jj%jJJk%%%%%%%jJ%jJ%%%%%jJJ%
$$ 2 3 2 4 3 2 2 2 1 2 2 1 1 2 3 3 3 2 1 2 1 2 2 2 1 1 1 2 3 3 2 1 2 2 2 2 2 2 2 2 3 3 2 2 3 2 2 1 2 3 1 1 1 1 1 1 1 1 0 1 1 0 1 1 1 1 1 1 0 1 2 2
4028BJJlJjJj%%%Kjj%%%%%jJ%%%J%JkjJ%J%%%j%jJ%%%J%j%%%J%%j%%J%j%%J%jJ%%j%jJJJj
$$ 2 3 4 1 2 1 2 1 1 1 1 3 2 1 1 1 1 1 1 0 1 1 1 1 2 2 3 1 0 1 1 2 2 2 2 1 1 0 1 1 1 1 2 2 1 1 1 1 2 2 2 1 1 1 2 2 1 1 1 2 2 1 2 2 2 1 1 0 1 2 3 2
4021B%k%J%K%j%%%%%%%%%%jJ%%%j%%%Jj%%J%%j%J%jJJj%%%JkjJJ%%%%%%%jJj%J%%%%J%jJj
$$ 2 2 0 0 1 1 3 3 2 2 2 2 2 2 2 2 2 2 2 1 2 2 2 2 1 1 1 1 2 1 1 1 2 2 2 1 1 2 2 1 2 3 2 2 2 2 3 1 0 1 2 2 2 2 2 2 2 2 1 2 1 1 2 2 2 2 2 3 3 2 3 2
4015Bj%J%%%%%%%%%%J%j%%%kJ%%%%JjK%j%%j%%JJJk%Jj%j%J%jJj%JjJj%%J%jJ%J%%%jj%J%
$$ 2 1 1 2 2 2 2 2 2 2 2 2 2 2 3 3 2 2 2 2 0 1 1 1 1 1 2 1 3 3 2 2 2 1 1 1 2 3 4 2 2 3 2 2 1 1 2 2 1 2 1 1 2 1 2 1 1 1 2 2 1 2 2 3 3 3 3 2 1 1 2 2
4008B%%J%jjj%%J%%%Jjj%JJ%%j%%J%JjjJj%jJ%J%j%%Jjj%JjK%%j%J%%JjJ%jj%%%%JJj%%J%
$$ 2 2 2 3 3 2 1 0 0 0 1 1 1 1 2 1 0 0 1 2 2 2 1 1 1 2 2 3 2 1 2 1 1 0 1 1 2 2 1 1 1 2 1 0 0 1 0 2 2 2 1 1 2 2 2 3 2 3 3 2 1 1 1 1 1 2 3 2 2 2 3 3
4002Cjj%J%%j%%%Jj%JjJ%%jJ%j%%J%j%%%jKJj%jJ%j%J%Jj%%%jJ%j%%J%jJj%%J%%jJj%J%%%
$$ 3 2 1 1 2 2 2 1 1 1 1 2 1 1 2 1 2 2 2 1 2 2 1 1 1 2 2 1 1 1 1 0 2 3 2 2 1 2 2 1 1 2 2 3 2 2 2 2 1 2 2 1 1 1 2 2 1 2 1 1 1 2 2 2 1 2 1 1 2 2 2 2
3995B%%%%%%j%%J%j%JjJj%j%JJj%%j%%J%%jJJ%j%JJ%j%%jJj%%J%j%Kj%j%%jJ%J%%%j%J%jJ
$$ 2 2 2 2 2 2 2 1 1 1 2 2 1 1 2 1 2 1 1 0 0 1 2 1 1 1 0 0 0 1 1 1 0 1 2 2 1 1 2 3 3 2 2 2 1 2 1 1 1 2 2 1 1 3 2 2 1 1 1 0 1 1 2 2 2 2 1 1 2 2 1 2
3989B%%%%%J%j%%%%%Jj%JjJk%%Jj%J%jJj%%J%jJ%%%%jJ%j%%%%J%%Jk%Jj%J%%j%JJkj%KJkj
$$ 2 2 2 2 2 2 3 3 2 2 2 2 2 2 3 2 2 3 2 3 1 1 1 2 1 1 2 2 1 2 1 1 1 2 2 1 2 2 2 2 2 1 2 2 1 1 1 1 1 2 2 2 3 1 1 2 1 1 2 2 2 1 1 2 3 1 0 0 2 3 1 0
3983@J%Jj%jJ%jJ%Jj%%%%%JjjJ%JJj%%%%jJj%J%J%j%%%%%%%%k%JJ%j%%JjJJjj%%J%j%%%%J
$$ 0 1 1 2 1 1 0 1 1 0 1 1 2 1 1 1 1 1 1 2 1 0 1 1 2 3 2 2 2 2 2 1 2 1 1 2 2 3 3 2 2 2 2 2 2 2 2 2 0 0 1 2 2 1 1 1 2 1 2 3 2 1 1 1 2 2 1 1 1 1 1 2
3976BjjJ%%%%%%J%%jjJJ%%%%%J%kJ%jJJj%%j%%JJjjJ%%j%J%%j%%%%Jjj%JJ%%Jjj%%j%J%J%
$$ 2 1 0 1 1 1 1 1 1 1 2 2 2 1 0 1 2 2 2 2 2 2 3 3 1 2 2 1 2 3 2 2 2 1 1 1 2 3 2 1 2 2 2 1 1 2 2 2 1 1 1 1 1 2 1 0 0 1 2 2 2 3 2 1 1 1 0 0 1 1 2 2
3970B%j%J%%%j%%JJJjjJjj%%%%%%%%%J%%%%J%%%j%%kJ%%%%j%JJ%%%%jJJkJ%%%%%J%%%%j%%
$$ 2 2 1 1 2 2 2 2 1 1 1 2 3 4 3 2 3 2 1 1 1 1 1 1 1 1 1 1 2 2 2 2 2 3 3 3 3 2 2 2 0 1 1 1 1 1 0 0 1 2 2 2 2 2 1 2 3 1 2 2 2 2 2 2 3 3 3 3 3 2 2 2
3963B%%%j%Jj%%%J%%%Jj%j%%J%j%%JjJjJ%%%jjJ%J%%%j%%%Jj%JJ%k%Jj%JjjJ%Jj%J%%%%%%
$$ 2 2 2 2 1 1 2 1 1 1 1 2 2 2 2 3 2 2 1 1 1 2 2 1 1 1 2 1 2 1 2 2 2 2 1 0 1 1 2 2 2 2 1 1 1 1 2 1 1 2 3 3 1 1 2 1 1 2 1 0 1 1 2 1 1 2 2 2 2 2 2 2
3957B%%%%%%jJ%%%%%%%%%%jJ%%jjJ%%%J%%%%j%%jJ%j%JJj%J%JkJj%K%k%%%j%JJ%JjJj%j%%
$$ 2 2 2 2 2 2 2 1 2 2 2 2 2 2 2 2 2 2 2 1 2 2 2 1 0 1 1 1 1 2 2 2 2 2 1 1 1 0 1 1 0 0 1 2 1 1 2 2 3 1 2 1 1 3 3 1 1 1 1 0 0 1 2 2 3 2 3 2 2 1 1 1
3950A%%%%%J%j%Jj%%J%%Jj%jJ%%Jj%%%%%%j%J%%%%%jjK%k%J%K%j%jJjJ%%jJjJ%jJj%J%J%%
$$ 1 1 1 1 1 1 2 2 1 1 2 1 1 1 2 2 2 3 2 2 1 2 2 2 3 2 2 2 2 2 2 2 1 1 2 2 2 2 2 2 1 0 2 2 0 0 1 1 3 3 2 2 1 2 1 2 2 2 1 2 1 2 2 1 2 1 1 2 2 3 3 3
3944C%%jjJ%%j%%J%%%%%%j%%JjJj%j%Kj%K%%j%%jJJjJ%jk%J%%%J%j%%Jj%J%%%%%%J%%%jj%
$$ 3 3 3 2 1 2 2 2 1 1 1 2 2 2 2 2 2 2 1 1 1 2 1 2 1 1 0 0 2 1 1 3 3 3 2 2 2 1 2 3 2 3 3 2 0 0 1 1 1 1 2 2 1 1 1 2 1 1 2 2 2 2 2 2 2 3 3 3 3 2 1 1
3937A%J%%j%%%%%jJ%%J%%%%J%%%j%j%%J%%%%jJJj%%j%J%Jj%%J%j%Jk%%J%%%jJjJJj%%JjJ%
$$ 1 1 2 2 2 1 1 1 1 1 1 0 1 1 1 2 2 2 2 2 3 3 3 3 2 2 1 1 1 2 2 2 2 2 1 2 3 2 2 2 1 1 2 2 3 2 2 2 3 3 2 2 3 1 1 1 2 2 2 2 1 2 1 2 3 2 2 2 3 2 3 3
3931C%j%jJ%jJjJJ%k%J%%%%%%Jj%%jJ%K%jj%%%J%%Jk%%%%%%%%J%%jJjjJJ%kjKjjJJ%j%%%J
$$ 3 3 2 2 1 2 2 1 2 1 2 3 3 1 1 2 2 2 2 2 2 2 3 2 2 2 1 2 2 4 4 3 2 2 2 2 3 3 3 4 2 2 2 2 2 2 2 2 2 3 3 3 2 3 2 1 2 3 3 1 0 2 1 0 1 2 2 1 1 1 1 2
3925Bj%%Jj%j%K%%jJ%j%J%JjjJ%J%j%%%%%%j%JJjj%J%jJJj%%j%%%J%Jj%%%%Jj%jJJ%j%jJ%
$$ 2 1 1 1 2 1 1 0 0 2 2 2 1 2 2 1 1 2 2 3 2 1 2 2 3 3 2 2 2 2 2 2 2 1 1 2 3 2 1 1 2 2 1 2 3 2 2 2 1 1 1 1 2 2 3 2 2 2 2 2 3 2 2 1 2 3 3 2 2 1 2 2
3918B%%J%J%kjJj%j%JJ%%%jJ%%j%%JJj%J%j%%%jj%%J%jJ%%JJj%%%J%%%j%JjjJ%j%%J%%%jJ
$$ 2 2 2 3 3 4 4 2 1 2 1 1 0 0 1 2 2 2 2 1 2 2 2 1 1 1 2 3 2 2 3 3 2 2 2 2 1 0 0 0 1 1 0 1 1 1 2 3 2 2 2 2 3 3 3 3 2 2 3 2 1 2 2 1 1 1 2 2 2 2 1 2
3912BJ%%%j%jjJj%Kj%%j%JJj%%%%%%%%J%%%JjJ%j%j%K%j%%%%%%%JjJ%jjJJj%%%%%j%%J%%j
$$ 2 3 3 3 3 2 2 1 0 1 0 0 2 1 1 1 0 0 1 2 1 1 1 1 1 1 1 1 1 2 2 2 2 3 2 3 3 2 2 1 1 3 3 2 2 2 2 2 2 2 2 3 2 3 3 2 1 2 3 2 2 2 2 2 2 1 1 1 2 2 2 1
3905AJ%j%JJ%%jjjJJJj%%jJ%jJJ%j%J%Jjj%%Jj%%j%j%JjK%%jJ%%%%%Jj%%%%%%%jJ%j%%%J%
$$ 1 2 2 1 1 2 3 3 3 2 1 0 1 2 3 2 2 2 1 2 2 1 2 3 3 2 2 3 3 4 3 2 2 2 3 2 2 2 1 1 0 0 1 0 2 2 2 1 2 2 2 2 2 2 3 2 2 2 2 2 2 2 2 1 2 2 1 1 1 1 2 2
3899Bj%%%Jj%%Jj%%%%J%jJJ%j%%JkJJj%%%j%%Jj%j%J%J%k%JJ%%jJ%%Jj%%Jj%%%jJ%j%K%%j
$$ 2 1 1 1 1 2 1 1 1 2 1 1 1 1 1 2 2 1 2 3 3 2 2 2 3 1 2 3 2 2 2 2 1 1 1 2 1 1 0 0 1 1 2 2 0 0 1 2 2 2 1 2 2 2 3 2 2 2 3 2 2 2 2 1 2 2 1 1 3 3 3 2
3892B%%kK%j%JjjJJ%%jJ%%%%j%J%j%J%%%jJj%JJj%jKjJj%%%%%jj%J%J%Jk%%%J%jJjJ%%%%%
$$ 2 2 2 0 2 2 1 1 2 1 0 1 2 2 2 1 2 2 2 2 2 1 1 2 2 1 1 2 2 2 2 1 2 1 1 2 3 2 2 1 3 2 3 2 2 2 2 2 2 1 0 0 1 1 2 2 3 1 1 1 1 2 2 1 2 1 2 2 2 2 2 2
3886B%%jJj%%JJjJj%%%%%%%%%%%Jjj%Jj%%JJjjJ%jJ%jJ%%%%%%%%J%jJj%%%%%j%Jj%%%Jj%J
$$ 2 2 2 1 2 1 1 1 2 3 2 3 2 2 2 2 2 2 2 2 2 2 2 2 3 2 1 1 2 1 1 1 2 3 2 1 2 2 1 2 2 1 2 2 2 2 2 2 2 2 2 3 3 2 3 2 2 2 2 2 2 1 1 2 1 1 1 1 2 1 1 2
3879B%jJ%%%j%%%KkjK%%j%%%%J%j%J%%%J%j%%%J%%%j%%%J%j%j%%%%jJJjJJj%Jj%%%jJj%Jj
$$ 2 2 1 2 2 2 2 1 1 1 1 3 1 0 2 2 2 1 1 1 1 1 2 2 1 1 2 2 2 2 3 3 2 2 2 2 3 3 3 3 2 2 2 2 3 3 2 2 1 1 1 1 1 0 1 2 1 2 3 2 2 3 2 2 2 2 1 2 1 1 2 1
3873A%jJJ%%jJ%%%%jJ%J%jjKJjjjJjJ%%%%%%%j%JJ%j%j%J%j%%J%j%J%%j%%%j%J%J%%%%jJ%
$$ 1 1 0 1 2 2 2 1 2 2 2 2 2 1 2 2 3 3 2 1 3 4 3 2 1 2 1 2 2 2 2 2 2 2 2 1 1 2 3 3 2 2 1 1 2 2 1 1 1 2 2 1 1 2 2 2 1 1 1 1 0 0 1 1 2 2 2 2 2 1 2 2
3867B%%%%%%%%%%j%%jJJ%jJjj%JJ%%%%%%%%%j%JjJJj%%%%%jJ%Jj%%%%j%Kj%%jJ%Jjj%J%%%
$$ 2 2 2 2 2 2 2 2 2 2 2 1 1 1 0 1 2 2 1 2 1 0 0 1 2 2 2 2 2 2 2 2 2 2 1 1 2 1 2 3 2 2 2 2 2 2 1 2 2 3 2 2 2 2 2 1 1 3 2 2 2 1 2 2 3 2 1 1 2 2 2 2
3860BJj%%J%jJ%j%jJ%%%%%%%%%%jJ%j%Jj%J%%%%%%%j%%Jj%J%j%%%%J%J%jjJ%%%%jJ%%%j%j
$$ 2 3 2 2 2 3 3 2 3 3 2 2 1 2 2 2 2 2 2 2 2 2 2 2 1 2 2 1 1 2 1 1 2 2 2 2 2 2 2 2 1 1 1 2 1 1 2 2 1 1 1 1 1 2 2 3 3 2 1 2 2 2 2 2 1 2 2 2 2 1 1 0
3854@JJjJjJ%jJ%%%j%%%JjKj%kKjJj%%%Kj%%J%jjJ%jJ%%JjJjKjkJjJj%JJj%%%jJJj%%%%jJ
$$ 0 1 2 1 2 1 2 2 1 2 2 2 2 1 1 1 1 2 1 3 2 2 0 2 1 2 1 1 1 1 3 2 2 2 3 3 2 1 2 2 1 2 2 2 3 2 3 2 4 3 1 2 1 2 1 1 2 3 2 2 2 2 1 2 3 2 2 2 2 2 1 2
3847Bj%%JJJl%%%KjJ%%%%%jjJj%JJjj%%jJJ%%%%Jj%%%jJ%%%%%Jj%j%%%J%%j%%%Jj%K%k%JJ
$$ 2 1 1 1 2 3 4 1 1 1 1 3 2 3 3 3 3 3 3 2 1 2 1 1 2 3 2 1 1 1 0 1 2 2 2 2 2 3 2 2 2 2 1 2 2 2 2 2 2 3 2 2 1 1 1 1 2 2 2 1 1 1 1 2 1 1 3 3 1 1 2 3
3841Cj%Jj%%%jJ%J%jjjK%%j%%JjJ%Jkj%%Jj%JJ%%%j%J%%%j%%JjJ%%%jjJ%%JJjjJk%J%J%%%
$$ 3 2 2 3 2 2 2 2 1 2 2 3 3 2 1 0 2 2 2 1 1 1 2 1 2 2 3 1 0 0 0 1 0 0 1 2 2 2 2 1 1 2 2 2 2 1 1 1 2 1 2 2 2 2 1 0 1 1 1 2 3 2 1 2 0 0 1 1 2 2 2 2
3834B%%%%Jk%%%J%kJ%%%%K%J%jj%j%JJj%j%%%%%J%jJj%jJJj%j%%J%%%J%j%%J%jJJJj%k%J%
$$ 2 2 2 2 2 3 1 1 1 1 2 2 0 1 1 1 1 1 3 3 4 4 3 2 2 1 1 2 3 2 2 1 1 1 1 1 1 2 2 1 2 1 1 0 1 2 1 1 0 0 0 1 1 1 1 2 2 1 1 1 2 2 1 2 3 4 3 3 1 1 2 2
3828B%%%%%jJj%%%%J%%%jJ%%%%%%%%J%j%j%%%jJJjJ%J%k%J%%%%%kJJ%%%Jk%JjjJJjJj%%%%
$$ 2 2 2 2 2 2 1 2 1 1 1 1 1 2 2 2 2 1 2 2 2 2 2 2 2 2 2 3 3 2 2 1 1 1 1 0 1 2 1 2 2 3 3 1 1 2 2 2 2 2 2 0 1 2 2 2 2 3 1 1 2 1 0 1 2 1 2 1 1 1 1 1
3821AjJ%%%%JJj%%j%K%kJKj%%j%%%%%%%j%%%%jK%j%JkJJ%%j%%JJk%J%j%%J%%%j%J%j%jJJ%
$$ 1 0 1 1 1 1 1 2 3 2 2 2 1 1 3 3 1 2 4 3 3 3 2 2 2 2 2 2 2 2 1 1 1 1 1 0 2 2 1 1 2 0 1 2 2 2 1 1 1 2 3 1 1 2 2 1 1 1 2 2 2 2 1 1 2 2 1 1 0 1 2 2
3815B%%%J%%j%j%J%%%%j%Kj%j%%JJ%j%kJ%jJJj%%J%%jJ%%jJj%Jj%J%%%%jKj%%j%J%%%%%%%
$$ 2 2 2 2 3 3 3 2 2 1 1 2 2 2 2 2 1 1 3 2 2 1 1 1 2 3 3 2 2 0 1 1 0 1 2 1 1 1 2 2 2 1 2 2 2 1 2 1 1 2 1 1 2 2 2 2 2 1 3 2 2 2 1 1 2 2 2 2 2 2 2 2
3808B%jJ%jj%%%J%J%jJJ%j%%%%j%%%%%%JJjj%JKjj%J%kJ%J%j%%%%J%kj%J%J%%Jj%%%%%%%%
$$ 2 2 1 2 2 1 0 0 0 0 1 1 2 2 1 2 3 3 2 2 2 2 2 1 1 1 1 1 1 1 2 3 2 1 1 2 4 3 2 2 3 3 1 2 2 3 3 2 2 2 2 2 3 3 1 0 0 1 1 2 2 2 3 2 2 2 2 2 2 2 2 2
3802Bj%J%%%%%%j%Jj%J%J%%%jJ%jJj%%%j%%Jk%%J%%%j%K%%%%%jJ%Jk%%J%j%%Jj%jJ%%%%%J
$$ 2 1 1 2 2 2 2 2 2 2 1 1 2 1 1 2 2 3 3 3 3 2 3 3 2 3 2 2 2 2 1 1 1 2 0 0 0 1 1 1 1 0 0 2 2 2 2 2 2 1 2 2 3 1 1 1 2 2 1 1 1 2 1 1 0 1 1 1 1 1 1 2
3796B%%%%j%JjJ%jJ%%jjJJ%%Jjj%%%%%jJ%j%JJ%jJj%%%JjJ%%%j%%Jj%%JjJ%j%%jJ%%J%%jk
$$ 2 2 2 2 2 1 1 2 1 2 2 1 2 2 2 1 0 1 2 2 2 3 2 1 1 1 1 1 1 0 1 1 0 0 1 2 2 1 2 1 1 1 1 2 1 2 2 2 2 1 1 1 2 1 1 1 2 1 2 2 1 1 1 0 1 1 1 2 2 2 1 -1
3789a%K%Kjj%J%%JjjJ%Jj%%%%%j%%JjJ%jjJJjkJJjJK%jj%%%JJj%J%jj%J%%j%%%%Jj%%%Kjj
$$ -1 -1 1 1 3 2 1 1 2 2 2 3 2 1 2 2 3 2 2 2 2 2 2 1 1 1 2 1 2 2 1 0 1 2 1 -1 0 1 0 1 3 3 2 1 1 1 1 2 3 2 2 3 3 2 1 1 2 2 2 1 1 1 1 1 2 1 1 1 1 3 2 1
3783A%J%Jj%%j%Jj%jJjJ%J%j%%JjJ%j%%J%Kjk%JJjJ%j%j%%J%jjKJkJj%%%J%jJ%%%%%%%%%%
$$ 1 1 2 2 3 2 2 2 1 1 2 1 1 0 1 0 1 1 2 2 1 1 1 2 1 2 2 1 1 1 2 2 4 3 1 1 2 3 2 3 3 2 2 1 1 1 2 2 1 0 2 3 1 2 1 1 1 1 2 2 1 2 2 2 2 2 2 2 2 2 2 2
3776B%j%%JjKjj%j%J%JjJjJ%%%jJ%%JjJjjJj%Kj%%j%J%j%%%J%jJ%jJ%%%%JjjJ%%j%jJ%%J%
$$ 2 2 1 1 1 2 1 3 2 1 1 0 0 1 1 2 1 2 1 2 2 2 2 1 2 2 2 3 2 3 2 1 2 1 1 3 2 2 2 1 1 2 2 1 1 1 1 2 2 1 2 2 1 2 2 2 2 2 3 2 1 2 2 2 1 1 0 1 1 1 2 2
3770BjJJ%jj%jJ%Jj%%%%%%%%%J%%%%%%j%%J%%%j%%J%%%JjjjJ%%%%%%%%J%%%jj%K%%%%Jj%j
$$ 2 1 2 3 3 2 1 1 0 1 1 2 1 1 1 1 1 1 1 1 1 1 2 2 2 2 2 2 2 1 1 1 2 2 2 2 1 1 1 2 2 2 2 3 2 1 0 1 1 1 1 1 1 1 1 1 2 2 2 2 1 0 0 2 2 2 2 2 3 2 2 1
3763AJJjJ%%jj%%J%%%%JjkJJj%J%%JJjk%J%%j%j%J%J%Jj%%%%%%Jj%%%%%%j%%K%%%j%%%%JJ
$$ 1 2 3 2 3 3 3 2 1 1 1 2 2 2 2 2 3 2 0 1 2 1 1 2 2 2 3 4 3 1 1 2 2 2 1 1 0 0 1 1 2 2 3 2 2 2 2 2 2 2 3 2 2 2 2 2 2 2 1 1 1 3 3 3 3 2 2 2 2 2 3 4
3757Djk%%JjJJ%j%jJ%jJ%%Jk%%%%%%J%j%Jj%j%JJ%%%%%%%j%%JJ%j%j%J%J%k%%J%%%%%%%%%
$$ 4 3 1 1 1 2 1 2 3 3 2 2 1 2 2 1 2 2 2 3 1 1 1 1 1 1 1 2 2 1 1 2 1 1 0 0 1 2 2 2 2 2 2 2 2 1 1 1 2 3 3 2 2 1 1 2 2 3 3 1 1 1 2 2 2 2 2 2 2 2 2 2
3750B%Jj%jJ%%j%%%%%%%Jj%%%%%%JJjj%J%%Jj%jjJJJj%%%%J%jj%J%%%%%%jJ%%%jjJ%%%j%K
$$ 2 2 3 2 2 1 2 2 2 1 1 1 1 1 1 1 1 2 1 1 1 1 1 1 1 2 3 2 1 1 2 2 2 3 2 2 1 0 1 2 3 2 2 2 2 2 3 3 2 1 1 2 2 2 2 2 2 2 1 2 2 2 2 1 0 1 1 1 1 0 0 2
3744B%%%jKjjJ%%j%J%%%%%%%%%%j%%%J%J%j%%jJ%%%%%%jj%J%Jj%%Jj%%%J%Jj%J%j%%jjJ%J
$$ 2 2 2 2 1 3 2 1 2 2 2 1 1 2 2 2 2 2 2 2 2 2 2 2 1 1 1 1 2 2 3 3 2 2 2 1 2 2 2 2 2 2 2 1 0 0 1 1 2 1 1 1 2 1 1 1 1 2 2 3 2 2 3 3 2 2 2 1 0 1 1 2
3738B%%k%%Kj%J%j%%%%%%JjJ%j%J%%%%%%j%J%%%%%J%j%J%%jjJ%%j%%%%J%%j%jJ%%%J%j%%j
$$ 2 2 2 0 0 0 2 1 1 2 2 1 1 1 1 1 1 1 2 1 2 2 1 1 2 2 2 2 2 2 2 1 1 2 2 2 2 2 2 3 3 2 2 3 3 3 2 1 2 2 2 1 1 1 1 1 2 2 2 1 1 0 1 1 1 1 2 2 1 1 1 0
3731@JJj%J%%%%j%%%%J%Jj%jjJKj%j%Kj%j%%%%%JjJ%%%jjJJ%%%%%j%JjJ%JJjj%%jJ%j%%%%
$$ 0 1 2 1 1 2 2 2 2 2 1 1 1 1 1 2 2 3 2 2 1 0 1 3 2 2 1 1 3 2 2 1 1 1 1 1 1 2 1 2 2 2 2 1 0 1 2 2 2 2 2 2 1 1 2 1 2 2 3 4 3 2 2 2 1 2 2 1 1 1 1 1
3725AJ%JjjJ%%%%%JjjjJj%JJJjj%%%Jj%J%kJJ%%%%%%%%%%%%j%%%%J%jJ%%j%%J%%%j%%J%%%
$$ 1 2 2 3 2 1 2 2 2 2 2 2 3 2 1 0 1 0 0 1 2 3 2 1 1 1 1 2 1 1 2 2 0 1 2 2 2 2 2 2 2 2 2 2 2 2 2 1 1 1 1 1 2 2 1 2 2 2 1 1 1 2 2 2 2 1 1 1 2 2 2 2
3718B%%%%J%jjJ%%%jJ%%%j%%%JJj%j%J%%j%Jj%%%%%J%%%JjJ%%jjJJjj%%Jjj%JJ%jJ%%j%%%
$$ 2 2 2 2 2 3 3 2 1 2 2 2 2 1 2 2 2 2 1 1 1 1 2 3 2 2 1 1 2 2 2 1 1 2 1 1 1 1 1 1 2 2 2 2 3 2 3 3 3 2 1 2 3 2 1 1 1 2 1 0 0 1 2 2 1 2 2 2 1 1 1 1
3712A%Jj%Kj%j%J%%jJJ%%%jjJ%%%%j%%%%j%J%Jj%JJ%j%%%jJjjJjJ%J%%Jj%%jJJj%JjJk%%%
$$ 1 1 2 1 1 3 2 2 1 1 2 2 2 1 2 3 3 3 3 2 1 2 2 2 2 2 1 1 1 1 1 0 0 1 1 2 1 1 2 3 3 2 2 2 2 1 2 1 0 1 0 1 1 2 2 2 3 2 2 2 1 2 3 2 2 3 2 3 1 1 1 1
3705AjJ%Jj%J%%%%J%%jjJjJjj%KJj%%%jJ%j%Jj%%%%%jjKJ%%j%%%Jj%JJ%jJj%%%j%J%jJ%%%
$$ 1 0 1 1 2 1 1 2 2 2 2 2 3 3 3 2 1 2 1 2 1 0 0 2 3 2 2 2 2 1 2 2 1 1 2 1 1 1 1 1 1 0 -1 1 2 2 2 1 1 1 1 2 1 1 2 3 3 2 3 2 2 2 2 1 1 2 2 1 2 2 2 2
3699B%jJ%%jjJ%%%j%%JJ%jJ%%%jJ%%JjjJ%jJ%%%%j%J%%%j%KjjJJj%jJ%%Jj%%%Jjjj%J%%%J
$$ 2 2 1 2 2 2 1 0 1 1 1 1 0 0 0 1 2 2 1 2 2 2 2 1 2 2 2 3 2 1 2 2 1 2 2 2 2 2 1 1 2 2 2 2 1 1 3 2 1 2 3 2 2 1 2 2 2 3 2 2 2 2 3 2 1 0 0 1 1 1 1 2
3692Bj%%JJ%%j%%%j%J%jjK%%j%J%%%J%k%JjJ%%%%%jJjK%j%j%JjJ%%%%jJ%j%%%%%%J%%jJ%%
$$ 2 1 1 1 2 3 3 3 2 2 2 2 1 1 2 2 1 0 2 2 2 1 1 2 2 2 2 3 3 1 1 2 1 2 2 2 2 2 2 1 2 1 3 3 2 2 1 1 2 1 2 2 2 2 2 1 2 2 1 1 1 1 1 1 1 2 2 2 1 2 2 2
3686Bj%JJ%j%%%%%%%j%J%%%Jj%%jj%%%JJ%Jj%%%%%%%j%Jj%JkJ%%%%%%Jj%%J%%JjJ%j%JjJk
$$ 2 1 1 2 3 3 2 2 2 2 2 2 2 2 1 1 2 2 2 2 3 2 2 2 1 0 0 0 0 1 2 2 3 2 2 2 2 2 2 2 2 1 1 2 1 1 2 0 1 1 1 1 1 1 1 2 1 1 1 2 2 2 3 2 3 3 2 2 3 2 3 1
3679A%%%%%J%JjjJ%J%jJj%%%%%jJ%%jKj%%j%J%%%jJj%%%%%J%jJjJ%%JjjJ%%%%%Jk%%JjJ%J
$$ 1 1 1 1 1 1 2 2 3 2 1 2 2 3 3 2 3 2 2 2 2 2 2 1 2 2 2 1 3 2 2 2 1 1 2 2 2 2 1 2 1 1 1 1 1 1 2 2 1 2 1 2 2 2 3 2 1 2 2 2 2 2 2 3 1 1 1 2 1 2 2 3
3673Cj%%%%%%%%%%%j%%%JjjJ%%jKjjJJjjJJj%Jj%%J%jjJ%%Jjj%KJ%j%%%Jj%j%K%jJk%JJj%
$$ 3 2 2 2 2 2 2 2 2 2 2 2 2 1 1 1 1 2 1 0 1 1 1 0 2 1 0 1 2 1 0 1 2 1 1 2 1 1 1 2 2 1 0 1 1 1 2 1 0 0 2 3 3 2 2 2 2 3 2 2 1 1 3 3 2 3 1 1 2 3 2 2
3667B%%%%%%%%%j%%%J%%%%%j%%JJj%jJ%Jj%jjJ%%J%%%%k%Jj%JJ%%j%J%j%%%%J%%j%j%JjJ%
$$ 2 2 2 2 2 2 2 2 2 2 1 1 1 1 2 2 2 2 2 2 1 1 1 2 3 2 2 1 2 2 3 2 2 1 0 1 1 1 2 2 2 2 2 0 0 1 0 0 1 2 2 2 1 1 2 2 1 1 1 1 1 2 2 2 1 1 0 0 1 0 1 1
3660AJjj%J%JJ%kJj%J%%%j%JJjjJj%jJJ%%%jJj%J%%%%j%J%JjjJjjJJj%%Jk%%jKJj%%%J%%%
$$ 1 2 1 0 0 1 1 2 3 3 1 2 1 1 2 2 2 2 1 1 2 3 2 1 2 1 1 0 1 2 2 2 2 1 2 1 1 2 2 2 2 2 1 1 2 2 3 2 1 2 1 0 1 2 1 1 1 2 0 0 0 -1 1 2 1 1 1 1 2 2 2 2
3654Bj%JjJ%%%j%%J%%J%%jj%JjJJjjJ%jJ%%j%%Jj%K%j%%%jJJ%%kJ%j%%J%%%j%J%%%jJ%%Jj
$$ 2 1 1 2 1 2 2 2 2 1 1 1 2 2 2 3 3 3 2 1 1 2 1 2 3 2 1 2 2 1 2 2 2 1 1 1 2 1 1 3 3 2 2 2 2 1 2 3 3 3 1 2 2 1 1 1 2 2 2 2 1 1 2 2 2 2 1 2 2 2 3 2
3647B%%jJJk%J%j%%jJJj%%%%%%%J%jJ%%j%%J%j%%K%j%%J%jjJj%J%%j%JjJj%%%JjjJ%JjJ%%
$$ 2 2 2 1 2 3 1 1 2 2 1 1 1 0 1 2 1 1 1 1 1 1 1 1 2 2 1 2 2 2 1 1 1 2 2 1 1 1 3 3 2 2 2 3 3 2 1 2 1 1 2 2 2 1 1 2 1 2 1 1 1 1 2 1 0 1 1 2 1 2 2 2
3641B%%jJj%JJj%jj%J%%%Jj%%JJj%%%jJ%%%%%%j%%%%%J%%%%%jJJ%j%JjjJjjJ%jK%%%%j%JJ
$$ 2 2 2 1 2 1 1 2 3 2 2 1 0 0 1 1 1 1 2 1 1 1 2 3 2 2 2 2 1 2 2 2 2 2 2 2 1 1 1 1 1 1 2 2 2 2 2 2 1 2 3 3 2 2 3 2 1 2 1 0 1 1 0 2 2 2 2 2 1 1 2 3
3634Cjjj%%JJ%JjjJ%%J%JjkJJjjJjJjJ%%Jj%%j%K%kjL%j%%j%%%%%Jj%J%j%%%jJj%jKJ%jJ%
$$ 3 2 1 0 0 0 1 2 2 3 2 1 2 2 2 3 3 4 3 1 2 3 2 1 2 1 2 1 2 2 2 3 2 2 2 1 1 3 3 1 0 3 3 2 2 2 1 1 1 1 1 1 2 1 1 2 2 1 1 1 1 0 1 0 0 -1 1 2 2 1 2 2
3628BjJ%jJJj%%jjJ%%%%%jJJ%jJJ%jj%%J%%jJ%jjJJ%%%%%%%jJjJj%%%J%jJ%%%jjJJ%j%jJJ
$$ 2 1 2 2 1 2 3 2 2 2 1 0 1 1 1 1 1 1 0 1 2 2 1 2 3 3 2 1 1 1 2 2 2 1 2 2 1 0 1 2 2 2 2 2 2 2 2 1 2 1 2 1 1 1 1 2 2 1 2 2 2 2 1 0 1 2 2 1 1 0 1 2
3621B%j%J%%%Jj%Jj%%jJjJ%j%%J%%%%kK%%j%J%%%%%%j%%%jJ%%%Jj%JjJ%jJj%J%%%%%jJ%%j
$$ 2 2 1 1 2 2 2 2 3 2 2 3 2 2 2 1 2 1 2 2 1 1 1 2 2 2 2 2 0 2 2 2 1 1 2 2 2 2 2 2 2 1 1 1 1 0 1 1 1 1 2 1 1 2 1 2 2 1 2 1 1 2 2 2 2 2 2 1 2 2 2 1
3615AJj%%%j%JJ%J%j%jJ%%%%%%%jJ%j%Jj%%J%%%%jJjJJ%j%%J%jk%J%%%%%%%J%j%J%%%%%%%
$$ 1 2 1 1 1 1 0 0 1 2 2 3 3 2 2 1 2 2 2 2 2 2 2 2 1 2 2 1 1 2 1 1 1 2 2 2 2 2 1 2 1 2 3 3 2 2 2 3 3 2 0 0 1 1 1 1 1 1 1 1 2 2 1 1 2 2 2 2 2 2 2 2
3609Bjj%J%J%%%jJ%j%%%JJjjJjJ%j%jJ%j%%KjJ%J%%j%J%%kjJ%%J%kKjJ%%j%JjJJ%%jj%Jj%
$$ 2 1 0 0 1 1 2 2 2 2 1 2 2 1 1 1 1 2 3 2 1 2 1 2 2 1 1 0 1 1 0 0 0 2 1 2 2 3 3 3 2 2 3 3 3 1 0 1 1 1 2 2 0 2 1 2 2 2 1 1 2 1 2 3 3 3 2 1 1 2 1 1
3602AJjJ%%%j%%J%j%J%%%j%%%%%%JjJjJj%%%JjJ%kJ%%%%J%%%%%%%%jK%%j%Jk%%%J%jKj%%j
$$ 1 2 1 2 2 2 2 1 1 1 2 2 1 1 2 2 2 2 1 1 1 1 1 1 1 2 1 2 1 2 1 1 1 1 2 1 2 2 0 1 1 1 1 1 2 2 2 2 2 2 2 2 2 1 3 3 3 2 2 3 1 1 1 1 2 2 1 3 2 2 2 1
3596AJ%j%%Jj%%%Jj%%%Jj%%%J%%jJ%%%%JjJjj%Jj%JJj%%%jJj%J%%%j%%%%J%%%j%Jj%Jj%J%
$$ 1 2 2 1 1 1 2 1 1 1 1 2 1 1 1 1 2 1 1 1 1 2 2 2 1 2 2 2 2 2 3 2 3 2 1 1 2 1 1 2 3 2 2 2 2 1 2 1 1 2 2 2 2 1 1 1 1 1 2 2 2 2 1 1 2 1 1 2 1 1 2 2
3589B%%%j%JJj%%j%%%%%%%%%%J%%%Jj%%%%j%JjK%k%%Jj%%JJj%jJ%%%%jJ%J%%jJjj%j%%JK%
$$ 2 2 2 2 1 1 2 3 2 2 2 1 1 1 1 1 1 1 1 1 1 1 2 2 2 2 3 2 2 2 2 2 1 1 2 1 3 3 1 1 1 2 1 1 1 2 3 2 2 1 2 2 2 2 2 1 2 2 3 3 3 2 3 2 1 1 0 0 0 1 3 3
3583CjjJ%%j%J%%j%j%J%%jJ%%J%%%%%%jJj%%%%%J%%%%%%Jj%%%j%%JJjjJ%JjjjKJ%%%%jJjj
$$ 3 2 1 2 2 2 1 1 2 2 2 1 1 0 0 1 1 1 0 1 1 1 2 2 2 2 2 2 2 1 2 1 1 1 1 1 1 2 2 2 2 2 2 2 3 2 2 2 2 1 1 1 2 3 2 1 2 2 3 2 1 0 2 3 3 3 3 3 2 3 2 1
3576AjK%%%%%%j%Jj%%Jj%%JJ%JjjJjj%%J%%j%%J%jjjJJJj%%%%%%j%JjJJ%j%%%%J%%J%j%jj
$$ 1 0 2 2 2 2 2 2 2 1 1 2 1 1 1 2 1 1 1 2 3 3 4 3 2 3 2 1 1 1 2 2 2 1 1 1 2 2 1 0 -1 0 1 2 1 1 1 1 1 1 1 0 0 1 0 1 2 2 1 1 1 1 1 2 2 2 3 3 2 2 1 0
3570@K%jJjj%%JJ%%jJJ%j%jJ%%%%j%%%%%J%j%J%%%jJ%%Jj%Jj%%kJJ%%%jJ%%jJjJ%jJj%JJ%
$$ 0 2 2 1 2 1 0 0 0 1 2 2 2 1 2 3 3 2 2 1 2 2 2 2 2 1 1 1 1 1 1 2 2 1 1 2 2 2 2 1 2 2 2 3 2 2 3 2 2 2 0 1 2 2 2 2 1 2 2 2 1 2 1 2 2 1 2 1 1 2 3 3
3563CjjJ%%Jj%%%%jJj%%%JJj%%%j%J%%%J%jj%%%%jJ%%%%%%J%%jJJjjJk%%%J%%J%%j%jJjJJ
$$ 3 2 1 2 2 2 3 2 2 2 2 2 1 2 1 1 1 1 2 3 2 2 2 2 1 1 2 2 2 2 3 3 2 1 1 1 1 1 0 1 1 1 1 1 1 1 2 2 2 1 2 3 2 1 2 0 0 0 0 1 1 1 2 2 2 1 1 0 1 0 1 2
3557B%jJjjJ%%Jj%J%jjJJj%J%jJ%%%jJ%jjJJ%j%%%%JJjjKjj%j%%%%J%%%J%jJ%kKj%%%%%j%
$$ 2 2 1 2 1 0 1 1 1 2 1 1 2 2 1 0 1 2 1 1 2 2 1 2 2 2 2 1 2 2 1 0 1 2 2 1 1 1 1 1 2 3 2 1 3 2 1 1 0 0 0 0 0 1 1 1 1 2 2 1 2 2 0 2 1 1 1 1 1 1 0 0
3551@%%J%%JjJjJjJ%%jJjJ%J%jjJJj%JjJjj%%K%jjJ%%j%jJJj%JkJ%j%J%%%%%Jj%%%%%%Kkj
$$ 0 0 0 1 1 1 2 1 2 1 2 1 2 2 2 1 2 1 2 2 3 3 2 1 2 3 2 2 3 2 3 2 1 1 1 3 3 2 1 2 2 2 1 1 0 1 2 1 1 2 0 1 1 0 0 1 1 1 1 1 1 2 1 1 1 1 1 1 1 3 1 0
3544@JJ%%j%jj%JJJj%%J%%JjkJJj%Jj%%%%%J%%%%j%J%%jJ%Jjjj%J%%j%JJJjjJj%jJ%%%%%J
$$ 0 1 2 2 2 1 1 0 -1 -1 0 1 2 1 1 1 2 2 2 3 2 0 1 2 1 1 2 1 1 1 1 1 1 2 2 2 2 2 1 1 2 2 2 1 2 2 3 2 1 0 0 1 1 1 0 0 1 2 3 2 1 2 1 1 0 1 1 1 1 1 1 2
3538B%%%jJ%%%%j%J%%jJj%%jJ%jJ%%J%%jjJ%%%jJ%%%%j%%%JJ%%%%j%%J%jK%jjj%JJ%j%jKj
$$ 2 2 2 2 1 2 2 2 2 2 1 1 2 2 2 1 2 1 1 1 0 1 1 0 1 1 1 2 2 2 1 0 1 1 1 1 0 1 1 1 1 1 0 0 0 0 1 2 2 2 2 2 1 1 1 2 2 1 3 3 2 1 0 0 1 2 2 1 1 0 2 1
3531A%%%JkJ%J%j%%%%Kj%J%%jj%j%J%%%%JJkJ%kJJ%%%kJ%Jj%%%%%%JjJ%%%%%%%%%%%%%%j%
$$ 1 1 1 1 2 0 1 1 2 2 1 1 1 1 1 3 2 2 3 3 3 2 1 1 0 0 1 1 1 1 1 2 3 1 2 2 0 1 2 2 2 2 0 1 1 2 1 1 1 1 1 1 1 2 1 2 2 2 2 2 2 2 2 2 2 2 2 2 2 2 1 1
3525A%%%%%%%J%%%j%J%%%%%J%k%JjjJ%%J%j%%%%%%%J%%%J%jJ%jjJjJj%JJk%%Jj%%J%%j%%J
$$ 1 1 1 1 1 1 1 1 2 2 2 2 1 1 2 2 2 2 2 2 3 3 1 1 2 1 0 1 1 1 2 2 1 1 1 1 1 1 1 1 2 2 2 2 3 3 2 3 3 2 1 2 1 2 1 1 2 3 1 1 1 2 1 1 1 2 2 2 1 1 1 2
3518B%j%Jj%%%%J%%%jJkJ%%J%%jj%%J%%%JjJ%%jJ%jjJJj%j%JjJjJ%%JjJ%%%Jjj%%JjjJ%%%
$$ 2 2 1 1 2 1 1 1 1 1 2 2 2 2 1 2 0 1 1 1 2 2 2 1 0 0 0 1 1 1 1 2 1 2 2 2 1 2 2 1 0 1 2 1 1 0 0 1 0 1 0 1 1 1 2 1 2 2 2 2 3 2 1 1 1 2 1 0 1 1 1 1
3512AJjJjJjJj%%J%%%%j%%J%kJK%j%Jj%j%%%%j%Ljj%J%j%%jJjJ%%j%JJjjJJ%%%%%J%%jjJ%
$$ 1 2 1 2 1 2 1 2 1 1 1 2 2 2 2 2 1 1 1 2 2 0 1 3 3 2 2 3 2 2 1 1 1 1 1 0 0 3 2 1 1 2 2 1 1 1 0 1 0 1 1 1 0 0 1 2 1 0 1 2 2 2 2 2 2 3 3 3 2 1 2 2
3505B%%jJ%j%JjJj%j%Kj%J%%Jj%%j%Jj%%%%%j%J%J%%%J%j%%%%j%kJJJj%J%%jJjjJJ%J%jjj
$$ 2 2 2 1 2 2 1 1 2 1 2 1 1 0 0 2 1 1 2 2 2 3 2 2 2 1 1 2 1 1 1 1 1 1 0 0 1 1 2 2 2 2 3 3 2 2 2 2 2 1 1 -1 0 1 2 1 1 2 2 2 1 2 1 0 1 2 2 3 3 2 1 0
3499@Kjj%J%%jJ%j%%J%%%%%%%%J%jjJ%%%j%%J%%%j%J%%%J%%%jJ%jJjJj%J%%%j%%J%%jjJ%J
$$ 0 2 1 0 0 1 1 1 0 1 1 0 0 0 1 1 1 1 1 1 1 1 1 2 2 1 0 1 1 1 1 0 0 0 1 1 1 1 0 0 1 1 1 1 2 2 2 2 1 2 2 1 2 1 2 1 1 2 2 2 2 1 1 1 2 2 2 1 0 1 1 2
3492BJjj%%%Jjj%J%J%jjJ%jJ%jJ%Jj%%j%%jK%j%%J%%%%J%%%%j%%Kj%%jJ%Jj%Jj%%%j%%%jJ
$$ 2 3 2 1 1 1 1 2 1 0 0 1 1 2 2 1 0 1 1 0 1 1 0 1 1 2 1 1 1 0 0 0 -1 1 1 0 0 0 1 1 1 1 1 2 2 2 2 2 1 1 1 3 2 2 2 1 2 2 3 2 2 3 2 2 2 2 1 1 1 1 0 1
3486AJ%%%%%j%j%J%%J%%%jJ%%%%%kJJj%%%JjjJJjJ%j%%%%%%J%%j%J%%j%j%J%%%%%JjjJJj%
$$ 1 2 2 2 2 2 2 1 1 0 0 1 1 1 2 2 2 2 1 2 2 2 2 2 2 0 1 2 1 1 1 1 2 1 0 1 2 1 2 2 1 1 1 1 1 1 1 2 2 2 1 1 2 2 2 1 1 0 0 1 1 1 1 1 1 2 1 0 1 2 1 1
3480AJ%%%jJ%%%jjJ%%%JJjjJ%j%jJJj%%jJ%%%%%%%j%%JJJj%%jK%jj%jJ%J%kK%%%j%%%J%%j
$$ 1 2 2 2 2 1 2 2 2 2 1 0 1 1 1 1 2 3 2 1 2 2 1 1 0 1 2 1 1 1 0 1 1 1 1 1 1 1 1 0 0 0 1 2 3 2 2 2 1 3 3 2 1 1 0 1 1 2 2 0 2 2 2 2 1 1 1 1 2 2 2 1
3473AJJkkJJJjJjJ%j%%%Jj%%J%j%%%jJJjJjjJJ%%%j%%%%%%%%jJJjJjjJ%Jj%%jKjjJjJ%JjJ
$$ 1 2 3 1 -1 0 1 2 1 2 1 2 2 1 1 1 1 2 1 1 1 2 2 1 1 1 1 0 1 2 1 2 1 0 1 2 2 2 2 1 1 1 1 1 1 1 1 1 0 1 2 1 2 1 0 1 1 2 1 1 1 0 2 1 0 1 0 1 1 2 1 2
3467BJ%%jkJ%Jj%jJ%Jj%Jj%Jj%JjJ%%j%%%J%j%%%%%%%%JjjJJ%j%%%j%J%%%%%JJ%k%J%%%jJ
$$ 2 3 3 3 2 0 1 1 2 1 1 0 1 1 2 1 1 2 1 1 2 1 1 2 1 2 2 2 1 1 1 1 2 2 1 1 1 1 1 1 1 1 1 2 1 0 1 2 2 1 1 1 1 0 0 1 1 1 1 1 1 2 3 3 1 1 2 2 2 2 1 2
3460Bj%%j%JjKJj%%jJ%jJ%%%jJ%%j%%%Jj%jJ%Jj%JjJ%Jj%%%j%J%j%%j%J%%JJjj%Jj%%Kjj%
$$ 2 1 1 1 0 0 1 0 2 3 2 2 2 1 2 2 1 2 2 2 2 1 2 2 2 1 1 1 1 2 1 1 0 1 1 2 1 1 2 1 2 2 3 2 2 2 2 1 1 2 2 1 1 1 0 0 1 1 1 2 3 2 1 1 2 1 1 1 3 2 1 1
3454AjJ%jJJ%%j%%%K%kJj%%j%JJ%%%%j%%jJ%%%%%%JjJ%%%j%%J%%j%%%%%JjJ%j%%JjJ%j%jK
$$ 1 0 1 1 0 1 2 2 2 1 1 1 1 3 3 1 2 1 1 1 0 0 1 2 2 2 2 2 1 1 1 0 1 1 1 1 1 1 1 2 1 2 2 2 2 1 1 1 2 2 2 1 1 1 1 1 1 2 1 2 2 1 1 1 2 1 2 2 1 1 0 2
3447Bj%jJj%J%%jKJjj%%%J%%jJ%%jJ%j%%%JJjJ%%%%%%%J%%JJ%KKLLLMLJJ%mlklllj%%kJ%K
$$ 2 1 1 0 1 0 0 1 1 1 0 2 3 2 1 1 1 1 2 2 2 1 2 2 2 1 2 2 1 1 1 1 2 3 2 3 3 3 3 3 3 3 3 4 4 4 5 6 6 8 10 13 16 19 23 26 27 28 28 24 21 19 16 13 10 9 9 9 7 8 8 10
3441A0J%KLLLLLJklllmljkjjj%j%%%%%%%jjJ%jJ%kJj%Jj%Jj%J%j%%JJjj%%J%j%%J%j%J%%%
$$ 10 11 11 13 16 19 22 25 28 29 27 24 21 18 14 11 10 8 7 6 5 5 4 4 4 4 4 4 4 4 3 2 3 3 2 3 3 1 2 1 1 2 1 1 2 1 1 2 2 1 1 1 2 3 2 1 1 1 2 2 1 1 1 2 2 1 1 2 2 2 2
3435B%jJ%jjJjJ%Jj%%%%%%%%J%%Jj%j%j%J%J%jJj%jJ%%%jJjJ%Jk%%J%%%%%%%J%%%%jJj%J%
$$ 2 2 1 2 2 1 0 1 0 1 1 2 1 1 1 1 1 1 1 1 1 2 2 2 3 2 2 1 1 0 0 1 1 2 2 1 2 1 1 0 1 1 1 1 0 1 0 1 1 2 0 0 0 1 1 1 1 1 1 1 1 2 2 2 2 2 1 2 1 1 2 2
3428B%j%%j%jK%jJ%Jjj%J%%%jJ%jJkJJ%jJ%%%%%%%%%J%%%Jk%%%Jjj%J%%%%%%%J%jJ%j%%j%
$$ 2 2 1 1 1 0 0 -1 1 1 0 1 1 2 1 0 0 1 1 1 1 0 1 1 0 1 -1 0 1 1 0 1 1 1 1 1 1 1 1 1 1 2 2 2 2 3 1 1 1 1 2 1 0 0 1 1 1 1 1 1 1 1 2 2 1 2 2 1 1 1 0 0
3422@J%%%%%%%j%Kk%J%%Jj%%%%%%%%Jj%Jj%JkJ%%%%J%j%Jj%Kj%%jJj%%Jj%%j%%%%%%JjJJ%
$$ 0 1 1 1 1 1 1 1 1 0 0 2 0 0 1 1 1 2 1 1 1 1 1 1 1 1 1 2 1 1 2 1 1 2 0 1 1 1 1 1 2 2 1 1 2 1 1 3 2 2 2 1 2 1 1 1 2 1 1 1 0 0 0 0 0 0 0 1 0 1 2 2
3415Bj%%%%%J%jJ%jJ%j%%%%%%%jJ%Jj%%jJjJjJ%%%%J%j%KkJ%%j%%%%JjkJJjjJJ%%Jj%%jJJ
$$ 2 1 1 1 1 1 1 2 2 1 2 2 1 2 2 1 1 1 1 1 1 1 1 0 1 1 2 1 1 1 0 1 0 1 0 1 1 1 1 1 2 2 1 1 3 1 2 2 2 1 1 1 1 1 2 1 -1 0 1 0 -1 0 1 1 1 2 1 1 1 0 1 2
3409Bj%%jJJjjK%k%J%%%J%J%jj%JJ%j%j%%jJJ%j%%%Jj%%%jJj%JjJjJ%jJjJ%%jjJJ%%%%%%%
$$ 2 1 1 1 0 1 2 1 0 2 2 0 0 1 1 1 1 2 2 3 3 2 1 1 2 3 3 2 2 1 1 1 0 1 2 2 1 1 1 1 2 1 1 1 1 0 1 0 0 1 0 1 0 1 1 0 1 0 1 1 1 0 -1 0 1 1 1 1 1 1 1 1
3402A%%%jJ%%jjJ%jJj%J%%JJjJ%%j%%%%%jJ%%%j%%J%j%%JJ%%%%j%%%%%Jj%j%J%j%%%J%%J%
$$ 1 1 1 1 0 1 1 1 0 -1 0 0 -1 0 -1 -1 0 0 0 1 2 1 2 2 2 1 1 1 1 1 1 0 1 1 1 1 0 0 0 1 1 0 0 0 1 2 2 2 2 2 1 1 1 1 1 1 2 1 1 0 0 1 1 0 0 0 0 1 1 1 2 2
3396B%%j%%J%Jj%JJ%J%jJ%jJkkjK%J%Jk%jJJ%K%JkJ%%jj%jjj%JjJ%%%J%jj%%jJ%J%%JJjj%
$$ 2 2 2 1 1 1 2 2 3 2 2 3 4 4 5 5 4 5 5 4 5 3 1 0 2 2 3 3 4 2 2 1 2 3 3 5 5 6 4 5 5 5 4 3 3 2 1 0 0 1 0 1 1 1 1 2 2 1 0 0 0 -1 0 0 1 1 1 2 3 2 1 1
3389AJj%%%%j%%JJ%%%j%JjjJ%%%%Jj%%%%%%%J%%Jj%j%%%j%Jj%%%%%%JJj%j%J%jJjJ%%%kKJ
$$ 1 2 1 1 1 1 1 0 0 0 1 2 2 2 2 1 1 2 1 0 1 1 1 1 1 2 1 1 1 1 1 1 1 1 2 2 2 3 2 2 1 1 1 1 0 0 1 0 0 0 0 0 0 0 1 2 1 1 0 0 1 1 0 1 0 1 1 1 1 -1 1 2
3383B%%j%j%%%J%%%j%J%Jj%%J%%j%%J%j%%%jJj%%%%%j%JJJ%%j%%%%%j%%%jJJ%Jjj%%JJ%%j
$$ 2 2 2 1 1 0 0 0 0 1 1 1 1 0 0 1 1 2 1 1 1 2 2 2 1 1 1 2 2 1 1 1 1 0 1 0 0 0 0 0 0 -1 -1 0 1 2 2 2 1 1 1 1 1 1 0 0 0 0 -1 0 1 1 2 1 0 0 0 1 2 2 2 1
3376A%J%j%%K%j%%%%%%%J%j%JJjJ%JJjJ%JJ%LJJjjkjj%j%Kk%J%JL%%%KKKJjJkjkjjjj%JJ%
$$ 1 1 2 2 1 1 1 3 3 2 2 2 2 2 2 2 2 3 3 2 2 3 4 3 4 4 5 6 5 6 6 7 8 8 11 12 13 12 11 9 8 7 7 6 6 8 6 6 7 7 8 11 11 11 11 13 15 17 18 17 18 16 15 13 12 11 10 9 9 10 11 11
3370A1Jj%JJJ%JJJ%%Jj%kj%k%J%%%J%%Jj%%jK%k%%%%%%%%%%%%%jJkj%%%%%%%JJJJJJ%%JKK
$$ 11 12 11 11 12 13 14 14 15 16 17 17 17 18 17 17 15 14 14 12 12 13 13 13 13 14 14 14 15 14 14 14 13 15 15 13 13 13 13 13 13 13 13 13 13 13 13 13 13 12 13 11 10 10 10 10 10 10 10 10 11 12 13 14 15 16 16 16 17 19 21
3364B1KKMMNMMKKJjJKLLLKJJj%%LKNQJ0J4J4J5J5J4J1J2J2J3J7K0K2K6L0L8M8O5R3J31J88
$$ 21 23 25 29 33 38 42 46 48 50 51 50 51 53 56 59 62 64 65 66 65 65 65 68 70 75 83 93 107 121 136 151 165 176 188 200 213 230 250 272 298 328 366 414 479 572 703 891
3359H91K77M02N46O65P53P68O39M01Q0k97o05p63p78o56m75l22k16j48r5n0kN7J26K22L51
$$ 891 1168 1570 2116 2781 3534 4302 4941 5342 5422 5125 4520 3757 2979 2323 1848 1526 1310 1162 1067 1017 1015 1072 1198 1420 1771
3357A771N03O32P23P57O55M22J05k77o09p85q21p23n50l88k75k03j58j24r6p4n6m2l1k4j8
$$ 1771 2274 2906 3629 4386 5041 5463 5568 5291 4682 3897 3076 2353 1803 1415 1140 937 779 655 559 485 429 387 356 332 314
3355C14j6j2j2j2j3j3j5j7j6j7j4j1j2qnnkjkkjkkj%jkjmooqnmmkkkkkkkjkjjll%jjjjjkj
$$ 314 298 286 274 262 249 236 221 204 188 171 157 146 134 126 121 116 114 113 111 109 108 106 104 103 103 102 100 99 95 89 83 75 70 66 62 60 58 56 54 52 50 48 47 45 44 43 40 37 37 36 35 34 33 32 30 29
3350B9jjJ%%%%jKJ%kjjjjjj%%jj%%Jj%jj%Jjjj%kjj%%kJJJJJJkj%%%J%j%%j%k%j%%%J%%j%
$$ 29 28 27 28 28 28 28 28 27 29 30 30 28 27 26 25 24 23 22 22 22 21 20 20 20 21 20 20 19 18 18 19 18 17 16 16 14 13 12 12 12 10 11 12 13 14 15 16 14 13 13 13 13 14 14 13 13 13 12 12 10 10 9 9 9 9 10 10 10 9 9
3343I%%%jJJ%jJ%%%%%j%j%%Jj%j%jKJk%%JJj%%JJjj%%JJ%j%%%j%%J%%%j%%J%%%%%%JjjJ%%
$$ 9 9 9 9 8 9 10 10 9 10 10 10 10 10 10 9 9 8 8 8 9 8 8 7 7 6 8 9 7 7 7 8 9 8 8 8 9 10 9 8 8 8 9 10 10 9 9 9 9 8 8 8 9 9 9 9 8 8 8 9 9 9 9 9 9 9 10 9 8 9 9 9
3337I%j%%JjJj%jJ%J%%%%%k%%j%J%JjJj%j%J%%%J%%jJk%JjjKJj%jJ%J%jjJ%%J%j%%jJ%%%%
$$ 9 9 8 8 8 9 8 9 8 8 7 8 8 9 9 9 9 9 9 7 7 7 6 6 7 7 8 7 8 7 7 6 6 7 7 7 7 8 8 8 7 8 6 6 7 6 5 7 8 7 7 6 7 7 8 8 7 6 7 7 7 8 8 7 7 7 6 7 7 7 7 7
3331GJ%J%%j%j%J%J%j%kK%kJ%JJ%J%J%jjJjJ%%%%%%KKJJjjJ%KK%JJKJJKJLMJMNOOQRRRRJ0
$$ 7 8 8 9 9 9 8 8 7 7 8 8 9 9 8 8 6 8 8 6 7 7 8 9 9 10 10 11 11 10 9 10 9 10 10 10 10 10 10 10 12 14 15 16 15 14 15 15 17 19 19 20 21 23 24 25 27 28 31 35 36 40 45 51 57 65 74 83 92 101 111
3324A11POL%lmnpnnlkk%JKMOOOOML%knqpj1j1rrppnnmllkklkjjjjk%JjjkjJjjJj%%j%%%%j
$$ 111 118 124 127 127 124 120 115 108 103 98 95 93 91 91 92 94 98 104 110 116 122 126 129 129 127 122 114 107 96 85 76 67 60 53 48 43 39 36 33 31 29 26 24 23 22 21 20 18 18 19 18 17 15 14 15 14 13 14 13 13 13 12 12 12 12 12 11
3318A1jj%%%%%%%%jj%J%%%k%JJ%%jJ%%%jJ%%%%jJjJ%jJJ%J%%jK%%JK%JKKJKKKK%JjJkkklj
$$ 11 10 9 9 9 9 9 9 9 9 9 8 7 7 8 8 8 8 6 6 7 8 8 8 7 8 8 8 8 7 8 8 8 8 8 7 8 7 8 8 7 8 9 9 10 10 10 9 11 11 11 12 14 14 15 17 19 20 22 24 26 28 28 29 28 29 27 25 23 20 19
3312A9kjk%jk%%kjJJkj%%%j%%jJjJjJj%J%j%%J%%%j%%%%j%J%j%%%J%jJj%Kj%jkJJ%K%j%%%
$$ 19 17 16 14 14 13 11 11 11 9 8 9 10 8 7 7 7 7 6 6 6 5 6 5 6 5 6 5 5 6 6 5 5 5 6 6 6 6 5 5 5 5 5 4 4 5 5 4 4 4 4 5 5 4 5 4 4 6 5 5 4 2 3 4 4 6 6 5 5 5 5
3305Ek%J%J%j%%%%J%%%%jj%%K%%%J%jj%J%%K%%jKJ%JK%%K%Jj%jjjjj%%jjjKJJJJ%%JJJ%jj
$$ 5 3 3 4 4 5 5 4 4 4 4 4 5 5 5 5 5 4 3 3 3 5 5 5 5 6 6 5 4 4 5 5 5 7 7 7 6 8 9 9 10 12 12 12 14 14 15 14 14 13 12 11 10 9 9 9 8 7 6 8 9 10 11 12 12 12 13 14 15 15 14 13
3299A3j%kjjk%j%%%%%%%jKjj%J%%%%%j%%%jJ%%%Jj%j%%JJj%%%JJjj%%Jj%Jj%%j%JjJ%j%%J
$$ 13 12 12 10 9 8 6 6 5 5 5 5 5 5 5 5 4 6 5 4 4 5 5 5 5 5 5 4 4 4 4 3 4 4 4 4 5 4 4 3 3 3 4 5 4 4 4 4 5 6 5 4 4 4 5 4 4 5 4 4 4 3 3 4 3 4 4 3 3 3 4
3293Dj%%JjJjJj%%JJj%%jJ%%%%J%j%%%%j%J%j%J%%JjjJ%%jJ%jJjJ%j%J%%jJJ%%jj%%Jj%%%
$$ 4 3 3 3 4 3 4 3 4 3 3 3 4 5 4 4 4 3 4 4 4 4 4 5 5 4 4 4 4 4 3 3 4 4 3 3 4 4 4 5 4 3 4 4 4 3 4 4 3 4 3 4 4 3 3 4 4 4 3 4 5 5 5 4 3 3 3 4 3 3 3 3
3286C%%J%%j%%%Jj%Kj%%%%%%jJ%%%J%%j%%%j%%%%%%%%%%jJj%J%%j%J%%%%jKj%J%j%Jj%%%%
$$ 3 3 3 4 4 4 3 3 3 3 4 3 3 5 4 4 4 4 4 4 4 3 4 4 4 4 5 5 5 4 4 4 4 3 3 3 3 3 3 3 3 3 3 3 2 3 2 2 3 3 3 2 2 3 3 3 3 3 2 4 3 3 4 4 3 3 4 3 3 3 3 3
3280CjJ%%%J%jJJjj%%%jJ%%J%j%%j%%JJj%%%%%%JjJjKjjJ%%J%J%%%%%J%JJKLMKMLKJjllll
$$ 3 2 3 3 3 3 4 4 3 4 5 4 3 3 3 3 2 3 3 3 4 4 3 3 3 2 2 2 3 4 3 3 3 3 3 3 3 4 3 4 3 5 4 3 4 4 4 5 5 6 6 6 6 6 6 7 7 8 9 11 14 18 20 24 27 29 30 29 26 23 20 17
3273A7mj%j%jJjJJJLMLMKKJjlmmmlkjkjjJj%%j%%jjK%%j%%%jjJ%%%%%J%%%jJ%%Jk%Jj%%%J
$$ 17 13 12 12 11 11 10 11 10 11 12 13 16 20 23 27 29 31 32 31 28 24 20 16 13 11 10 8 7 6 7 6 6 6 5 5 5 4 3 5 5 5 4 4 4 4 3 2 3 3 3 3 3 3 4 4 4 4 3 4 4 4 5 3 3 4 3 3 3 3 4
3267D%%j%%%Jj%%j%J%%%%%%jJ%jjJ%JJ%j%%j%J%%j%%JJ%%j%Jj%%%%jJJk%J%%%j%JJj%%%%j
$$ 4 4 4 3 3 3 3 4 3 3 3 2 2 3 3 3 3 3 3 3 2 3 3 2 1 2 2 3 4 4 3 3 3 2 2 3 3 3 2 2 2 3 4 4 4 3 3 4 3 3 3 3 3 2 3 4 2 2 3 3 3 3 2 2 3 4 3 3 3 3 3 2
3260B%%%%J%%j%jJ%%JjJ%J%%jjJ%Jj%jjK%Jj%%jJjJjJj%JJ%j%Jj%%j%JjJ%%%J%j%%%j%%%J
$$ 2 2 2 2 2 3 3 3 2 2 1 2 2 2 3 2 3 3 4 4 4 3 2 3 3 4 3 3 2 1 3 3 4 3 3 3 2 3 2 3 2 3 2 2 3 4 4 3 3 4 3 3 3 2 2 3 2 3 3 3 3 4 4 3 3 3 3 2 2 2 2 3
3254C%%%%Jj%%%J%j%J%JjkKJjkJJ%j%J%jJ%%%j%%%j%JJjJjJ%J%%%jjKJJJKLKJ%%jkk%jkjj
$$ 3 3 3 3 3 4 3 3 3 3 4 4 3 3 4 4 5 4 2 4 5 4 2 3 4 4 3 3 4 4 3 4 4 4 4 3 3 3 3 2 2 3 4 3 4 3 4 4 5 5 5 5 4 3 5 6 7 8 10 13 15 16 16 16 15 13 11 11 10 8 7 6
3248F%%%%%JJ%JKKJK%j%kkkjj%%%k%%j%jJKjj%%j%JjjJ%%%%%%%%%Jj%J%j%%j%J%%%J%%%Jj
$$ 6 6 6 6 6 6 7 8 8 9 11 13 14 16 16 15 15 13 11 9 8 7 7 7 7 5 5 5 4 4 3 4 6 5 4 4 4 3 3 4 3 2 3 3 3 3 3 3 3 3 3 3 4 3 3 4 4 3 3 3 2 2 3 3 3 3 4 4 4 4 5 4
3241D%%%%%J%LjKKKKJJ%jkjmjk%%j%JjJJJ%KKJJKJ%kkkjk%jjjj%%jJj%Jj%Jj%%%%%%%%Jjj
$$ 4 4 4 4 4 4 5 5 8 7 9 11 13 15 16 17 17 16 14 13 9 8 6 6 6 5 5 6 5 6 7 8 8 10 12 13 14 16 17 17 15 13 11 10 8 8 7 6 5 4 4 4 3 4 3 3 4 3 3 4 3 3 3 3 3 3 3 3 3 4 3 2
3235B%J%%%%%%%%%j%%J%%j%%%%%j%jKJj%%J%%j%%%%jJjJj%J%%%%%jJ%%Jj%%%%%jJ%%%JjjK
$$ 2 2 3 3 3 3 3 3 3 3 3 3 2 2 2 3 3 3 2 2 2 2 2 2 1 1 0 2 3 2 2 2 3 3 3 2 2 2 2 2 1 2 1 2 1 1 2 2 2 2 2 2 1 2 2 2 3 2 2 2 2 2 2 1 2 2 2 2 3 2 1 3
3228C%%%%j%jJJjjJ%Jj%%%%%j%JJj%%%%Jj%%JJ%j%%%j%JJj%%%j%J%%jjJ%%J%j%%J%k%Jj%J
$$ 3 3 3 3 3 2 2 1 2 3 2 1 2 2 3 2 2 2 2 2 2 1 1 2 3 2 2 2 2 2 3 2 2 2 3 4 4 3 3 3 3 2 2 3 4 3 3 3 3 2 2 3 3 3 2 1 2 2 2 3 3 2 2 2 3 3 1 1 2 1 1 2
3222B%%jJj%%J%%%jJ%J%jjjK%%%Jj%j%%J%%JJ%j%%%j%%%jJJ%%J%j%Jjj%%%%KjjJ%k%J%jJJ
$$ 2 2 2 1 2 1 1 1 2 2 2 2 1 2 2 3 3 2 1 0 2 2 2 2 3 2 2 1 1 1 2 2 2 3 4 4 3 3 3 3 2 2 2 2 1 2 3 3 3 4 4 3 3 4 3 2 2 2 2 2 4 3 2 3 3 1 1 2 2 1 2 3
3215CJjj%Jj%%%JJ%%%jK%jj%J%k%J%jJJ%%Jjj%KJ%kj%%%%%Jjj%%%jJ%J%j%jJ%%JjjJ%%Jj%
$$ 3 4 3 2 2 3 2 2 2 2 3 4 4 4 4 3 5 5 4 3 3 4 4 2 2 3 3 2 3 4 4 4 5 4 3 3 5 6 6 4 3 3 3 3 3 3 4 3 2 2 2 2 1 2 2 3 3 2 2 1 2 2 2 3 2 1 2 2 2 3 2 2
3209BJj%%J%j%J%Jk%Jj%Jj%%%%%J%%%%%%%J%JjJ%%j%jj%%%kK%J%%%J%%Jj%jJ%%k%%Jj%%%%
$$ 2 3 2 2 2 3 3 2 2 3 3 4 2 2 3 2 2 3 2 2 2 2 2 2 3 3 3 3 3 3 3 3 4 4 5 4 5 5 5 4 4 3 2 2 2 2 0 2 2 3 3 3 3 4 4 4 5 4 4 3 4 4 4 2 2 2 3 2 2 2 2 2
3202BJ%jjJjjJJ%%J%%j%%J%%jJ%%%%%%KJ%%%%J%jJjj%%jj%jJ%%JjJJJJKjj%JjjjjJk%%jJ%
$$ 2 3 3 2 1 2 1 0 1 2 2 2 3 3 3 2 2 2 3 3 3 2 3 3 3 3 3 3 3 5 6 6 6 6 6 7 7 6 7 6 5 5 5 4 3 3 2 3 3 3 4 3 4 5 6 7 9 8 7 7 8 7 6 5 4 5 3 3 3 2 3 3
3196C%%%j%jJJJj%J%kj%J%%%%%%j%J%jJj%%J%j%Kj%jJ%j%%jK%%Jj%Jj%jJ%J%%%j%%%jJ%%%
$$ 3 3 3 3 2 2 1 2 3 4 3 3 4 4 2 1 1 2 2 2 2 2 2 2 1 1 2 2 1 2 1 1 1 2 2 1 1 3 2 2 1 2 2 1 1 1 0 2 2 2 3 2 2 3 2 2 1 2 2 3 3 3 3 2 2 2 2 1 2 2 2 2
3189BJ%%jJJ%Jj%%%%jj%J%%%%j%J%%%%%%J%%%J%J%%%%j%j%j%%%%%J%%%%JjJ%%JJ%%jjj%%j
$$ 2 3 3 3 2 3 4 4 5 4 4 4 4 4 3 2 2 3 3 3 3 3 2 2 3 3 3 3 3 3 3 4 4 4 4 5 5 6 6 6 6 6 5 5 4 4 3 3 3 3 3 3 4 4 4 4 4 5 4 5 5 5 6 7 7 7 6 5 4 4 4 3
3183CJ%%%j%%K%%J%jkK%%J%j%J%%j%%JkK%%%%Jj%%Jj%JjJ%j%j%%J%%%%JJ%%JJJJJJ%%%jjj
$$ 3 4 4 4 4 3 3 3 5 5 5 6 6 5 3 5 5 5 6 6 5 5 6 6 6 5 5 5 6 4 6 6 6 6 6 7 6 6 6 7 6 6 7 6 7 7 6 6 5 5 5 6 6 6 6 6 7 8 8 8 9 10 11 12 13 14 14 14 14 13 12 11
3177A1kj%JJj%%KjJ%J%JJ%%%%j%%j%%KJJj%Jj%JKJJJKJLNQJ0J2J3J2J1P%pj1j2j1rookj%K
$$ 11 9 8 8 9 10 9 9 9 11 10 11 11 12 12 13 14 14 14 14 14 13 13 13 12 12 12 14 15 16 15 15 16 15 15 16 18 19 20 21 23 24 27 32 40 50 62 75 87 98 105 105 98 87 75 64 55 49 43 41 40 40 42
3171D2KLNORJ1J4J4J2RNkpj0j2j1pnl%LMOPQRQQJ0J2J3J7K2K6L2M4N8Q1J15J69K45L28L87
$$ 42 44 47 52 58 67 78 92 106 118 127 132 130 123 113 101 90 83 78 75 75 78 82 88 95 103 112 120 128 138 150 163 180 202 228 260 304 362 443 558 727 972 1300 1687
3167A687L94L62K70R8j22l26m50m41l44k43j61j06o6l8j4OK4N0Q2J34K04K86L52L69L47K75
$$ 1687 2081 2443 2713 2811 2689 2363 1913 1472 1128 885 724 618 552 514 500 506 530 580 662 796 1000 1286 1638 2007 2354 2629
3165B629J21q5k89m31m51l69k64j81j21p9n2l4k5k1k1k4k7k6k5k2j9j6j2j1rml%MNQQJ2J2
$$ 2629 2750 2665 2376 1945 1494 1125 861 680 559 480 428 394 369 348 327 303 276 250 225 203 184 168 156 145 136 132 129 129 133 138 146 154 166 178
3162A78J0RPJnj2j5j6j3j0qmjLLNQPRJ0QJ1J2J4J9K4L0M0N5P6J08J55K28L17L90M11L92L22
$$ 178 188 197 204 205 200 188 173 157 144 134 126 122 121 124 127 132 140 147 156 166 174 185 197 211 230 254 284 324 379 455 563 718 946 1263 1653 2064 2456 2778
3158B778J65n6k80m46m78l97k87j94j27q1m9k4kJ9M2P5J20J89K74L57L91L79L23J89k0k45
$$ 2778 2943 2887 2607 2161 1683 1286 999 805 678 597 548 524 522 541 583 658 778 967 1241 1598 1989 2368 2691 2880 2860 2615
3156B615m26m91m28l19k22j53j08p4n5m3l3k5k1j8j4j5j1j3j1rppqnmkjkjkkmlJ%jjjmlol
$$ 2615 2189 1698 1270 951 729 576 468 394 339 296 263 238 217 199 185 170 159 146 135 126 119 112 104 99 95 93 92 90 89 87 85 81 78 79 79 78 77 76 72 69 63 60
3152F0llkj%%%%%%jjmllkklJ%jk%jjJ%kj%%%jjJ%J%jJj%%JJk%%Jj%%Kjj%%%%JJJj%%%%J%J
$$ 60 57 54 52 51 51 51 51 51 51 51 50 49 45 42 39 37 35 32 33 33 32 30 30 29 28 29 29 27 26 26 26 26 25 24 25 25 26 26 25 26 25 25 25 26 27 25 25 25 26 25 25 25 27 26 25 25 25 25 25 26 27 28 27 27 27 27 27 28 28 29
3146B9KJjK%JJ%JJJ%JKj%JJ%%%%K%K%%%%%J%%%Jj%jJ%Jkj%%j%%%jj%%j%%j%jjj%%J%j%kJ%
$$ 29 31 32 31 33 33 34 35 35 36 37 38 38 39 41 40 40 41 42 42 42 42 42 44 44 46 46 46 46 46 46 47 47 47 47 48 47 47 46 47 47 48 46 45 45 45 44 44 44 44 43 42 42 42 41 41 41 40 40 39 38 37 37 37 38 38 37 37 35 36 36
3139C6J%%%j%%%%%%JjJJ%jJ%%%JJjK%%%%KJ%%%%JJj%k%%%Jj%j%%%%jkJ%%%%jjj%jkj%jjjj
$$ 36 37 37 37 37 36 36 36 36 36 36 36 37 36 37 38 38 37 38 38 38 38 39 40 39 41 41 41 41 41 43 44 44 44 44 44 45 46 45 45 43 43 43 43 44 43 43 42 42 42 42 42 41 39 40 40 40 40 40 39 38 37 37 36 34 33 33 32 31 30 29
3133B9k%%jk%%jjjkj%Jj%%j%%%j%j%j%%jj%jJJ%k%j%%J%j%%J%j%jJj%%%Jj%JKj%%%%jjj%J
$$ 29 27 27 27 26 24 24 24 23 22 21 19 18 18 19 18 18 18 17 17 17 17 16 16 15 15 14 14 14 13 12 12 11 12 13 13 11 11 10 10 10 11 11 10 10 10 11 11 10 10 9 10 9 9 9 9 10 9 9 10 12 11 11 11 11 11 10 9 8 8 9
3127IJjj%%J%%%JjJ%JJk%j%%%jJJj%jJ%j%%j%Kjj%%jJ%%jJ%jJ%%%%%%%J%j%%Jk%%J%%k%%%
$$ 9 10 9 8 8 8 9 9 9 9 10 9 10 10 11 12 10 10 9 9 9 9 8 9 10 9 9 8 9 9 8 8 8 7 7 9 8 7 7 7 6 7 7 7 6 7 7 6 7 7 7 7 7 7 7 7 8 8 7 7 7 8 6 6 6 7 7 7 5 5 5 5
3120E%JJjJ%k%JjKjJj%%%%%%%%%%Jj%%%%%JjjJ%%%%J%%%jk%J%K%j%%%j%JjJjJJ%j%%%jJ%j
$$ 5 5 6 7 6 7 7 5 5 6 5 7 6 7 6 6 6 6 6 6 6 6 6 6 6 7 6 6 6 6 6 6 7 6 5 6 6 6 6 6 7 7 7 7 6 4 4 5 5 7 7 6 6 6 6 5 5 6 5 6 5 6 7 7 6 6 6 6 5 6 6 5
3114E%%%%j%J%Jj%%jJ%jJ%j%%JJ%j%%%%KjKj%%%%JJJ%JJJ%%j%jkJj%j%k%JKJJ%%%%%%%J%J
$$ 5 5 5 5 5 4 4 5 5 6 5 5 5 4 5 5 4 5 5 4 4 4 5 6 6 5 5 5 5 5 7 6 8 7 7 7 7 7 8 9 10 10 11 12 13 13 13 12 12 11 9 10 9 9 8 8 6 6 7 9 10 11 11 11 11 11 11 11 11 12 12 13
3107A3jjjjj%%jj%%jj%Jj%K%jJj%%%Jj%%J%j%%J%%%jJ%jj%K%%%jjJJ%jJJ%JJjJJ%J%%J%%j
$$ 13 12 11 10 9 8 8 8 7 6 6 6 5 4 4 5 4 4 6 6 5 6 5 5 5 5 6 5 5 5 6 6 5 5 5 6 6 6 6 5 6 6 5 4 4 6 6 6 6 5 4 5 6 6 5 6 7 7 8 9 8 9 10 10 11 11 11 12 12 12 11
3101A1%%j%%j%j%%%%%JJ%JJJJj%%jjjj%j%%j%jjJ%jj%%Jj%%JjJj%j%%JJj%J%%%%j%%J%%j%
$$ 11 11 11 10 10 10 9 9 8 8 8 8 8 8 9 10 10 11 12 13 14 13 13 13 12 11 10 9 9 8 8 8 7 7 6 5 6 6 5 4 4 4 5 4 4 4 5 4 5 4 4 3 3 3 4 5 4 4 5 5 5 5 5 4 4 4 5 5 5 4 4
3094D%%jJJj%%J%%Jj%Jj%%jjJ%%%J%%%J%j%%Jj%%%%%jJJjjJ%jJjjJ%%%%%Jj%%%%J%jjJ%JJ
$$ 4 4 4 3 4 5 4 4 4 5 5 5 6 5 5 6 5 5 5 4 3 4 4 4 4 5 5 5 5 6 6 5 5 5 6 5 5 5 5 5 5 4 5 6 5 4 5 5 4 5 4 3 4 4 4 4 4 4 5 4 4 4 4 4 5 5 4 3 4 4 5 6
3088Fj%%j%JjJ%JjjJJj%jJJ%j%%jJJj%%%%%Jj%J%%%J%KJJLK%J%%jjkkkjj%J%%jJJ%JJ%KLJ
$$ 6 5 5 5 4 4 5 4 5 5 6 5 4 5 6 5 5 4 5 6 6 5 5 5 4 5 6 5 5 5 5 5 5 6 5 5 6 6 6 6 7 7 9 10 11 14 16 16 17 17 17 16 15 13 11 9 8 7 7 8 8 8 7 8 9 9 10 11 11 13 16 17
3082A7%%jjl%kkj%%%%%j%Jj%%%%jjJ%%%jJJj%jJJjjjKJjJ%j%Jj%j%%%%jK%J%%%J%%%KJ%KJ
$$ 17 17 17 16 15 12 12 10 8 7 7 7 7 7 7 6 6 7 6 6 6 6 6 5 4 5 5 5 5 4 5 6 5 5 4 5 6 5 4 3 5 6 5 6 6 5 5 6 5 5 4 4 4 4 4 3 5 5 6 6 6 6 7 7 7 7 9 10 10 12 13
3075A3KK%%%jkkkk%%j%%%%%JJKJKKJ%%Jjkllj%%jj%j%%%%%%j%J%%%%%%jjJ%J%%j%%jJ%J%%
$$ 13 15 17 17 17 17 16 14 12 10 8 8 8 7 7 7 7 7 7 8 9 11 12 14 16 17 17 17 18 17 15 12 9 8 8 8 7 6 6 5 5 5 5 5 5 5 4 4 5 5 5 5 5 5 5 4 3 4 4 5 5 5 4 4 4 3 4 4 5 5 5
3069E%jj%%JJj%%%%%j%Jj%J%jJjJ%%j%%%JJjjJj%%%J%%jjJ%%%jJ%%%%%%J%JjJjj%%%%J%jj
$$ 5 5 4 3 3 3 4 5 4 4 4 4 4 4 3 3 4 3 3 4 4 3 4 3 4 4 4 3 3 3 3 4 5 4 3 4 3 3 3 3 4 4 4 3 2 3 3 3 3 2 3 3 3 3 3 3 3 4 4 5 4 5 4 3 3 3 3 3 4 4 3 2
3062BJJ%jJJjj%J%%%j%%J%%%%%%%%jJj%J%j%%j%J%J%%J%j%Jj%%%%%%%J%%J%%%%%%JjKKjJ%
$$ 2 3 4 4 3 4 5 4 3 3 4 4 4 4 3 3 3 4 4 4 4 4 4 4 4 4 3 4 3 3 4 4 3 3 3 2 2 3 3 4 4 4 5 5 4 4 5 4 4 4 4 4 4 4 4 5 5 5 6 6 6 6 6 6 6 7 6 8 10 9 10 10
3056A0KJ%J%JJjJ%%Jjj%jjK%j%%%%%%J%j%%K%%j%j%jjj%j%%jk%%Jjk%%%%jJjjJ%j%K%J%j%
$$ 10 12 13 13 14 14 15 16 15 16 16 16 17 16 15 15 14 13 15 15 14 14 14 14 14 14 14 15 15 14 14 14 16 16 16 15 15 14 14 13 12 11 11 10 10 10 9 7 7 7 8 7 5 5 5 5 5 4 5 4 3 4 4 3 3 5 5 6 6 5 5
3050Ek%J%%J%%jjjJ%%%%%%%%%%%%jJJj%%%J%%J%j%%J%kjJJJ%jjj%%JJ%%%Jj%%%j%J%jjJ%J
$$ 5 3 3 4 4 4 5 5 5 4 3 2 3 3 3 3 3 3 3 3 3 3 3 3 3 2 3 4 3 3 3 3 4 4 4 5 5 4 4 4 5 5 3 2 3 4 5 5 4 3 2 2 2 3 4 4 4 4 5 4 4 4 4 3 3 4 4 3 2 3 3 4
3043Dj%J%kJ%J%jJlK%%j%%%%J%j%J%%J%jJj%jJJj%jJ%%%%j%%J%%Jj%%jJj%%JJJ%j%%Jj%%%
$$ 4 3 3 4 4 2 3 3 4 4 3 4 1 3 3 3 2 2 2 2 2 3 3 2 2 3 3 3 4 4 3 4 3 3 2 3 4 3 3 2 3 3 3 3 3 2 2 2 3 3 3 4 3 3 3 2 3 2 2 2 3 4 5 5 4 4 4 5 4 4 4 4
3037DjJ%jJ%jJKj%%JK%%JJj%JK%%%%%j%j%j%%%J%%%j%%J%%J%%Jjj%jj%Jj%%jj%j%j%J%j%%
$$ 4 3 4 4 3 4 4 3 4 6 5 5 5 6 8 8 8 9 10 9 9 10 12 12 12 12 12 12 11 11 10 10 9 9 9 9 10 10 10 10 9 9 9 10 10 10 11 11 11 12 11 10 10 9 8 8 9 8 8 8 7 6 6 5 5 4 4 5 5 4 4 4
3030DjJkJJ%%%%jJj%J%jjKjjJj%%J%%jJJ%jJJj%%%%jj%%Jj%JjJ%%%%%%%%%%%Jj%%JkJjJ%J
$$ 4 3 4 2 3 4 4 4 4 4 3 4 3 3 4 4 3 2 4 3 2 3 2 2 2 3 3 3 2 3 4 4 3 4 5 4 4 4 4 4 3 2 2 2 3 2 2 3 2 3 3 3 3 3 3 3 3 3 3 3 3 4 3 3 3 4 2 3 2 3 3 4
3024DJjjJj%%%%jJ%%J%%%jjJj%J%%%J%%%J%jJ%j%jJ%%%%jJjJ%%k%J%%%J%k%%jJ%%%Jj%%%%
$$ 4 5 4 3 4 3 3 3 3 3 2 3 3 3 4 4 4 4 3 2 3 2 2 3 3 3 3 4 4 4 4 5 5 4 5 5 4 4 3 4 4 4 4 4 3 4 3 4 4 4 2 2 3 3 3 3 4 4 2 2 2 1 2 2 2 2 3 2 2 2 2 2
3017B%%J%jJ%%%jJ%%j%%%JjjJ%J%%%jJj%%j%JJ%%jJ%%j%JJj%%%j%J%%%Jk%JK%j%%%jJj%jJ
$$ 2 2 2 3 3 2 3 3 3 3 2 3 3 3 2 2 2 2 3 2 1 2 2 3 3 3 3 2 3 2 2 2 1 1 2 3 3 3 2 3 3 3 2 2 3 4 3 3 3 3 2 2 3 3 3 3 4 2 2 3 5 5 4 4 4 4 3 4 3 3 2 3
3011CJ%%%%%%Jj%%KjkJ%%%J%j%j%Jj%Kjjj%JJ%jJj%%%%Jj%Jj%J%%k%%%%%J%%%%%%j%%J%%j
$$ 3 4 4 4 4 4 4 4 5 4 4 4 6 5 3 4 4 4 4 5 5 4 4 3 3 4 3 3 5 4 3 2 2 3 4 4 3 4 3 3 3 3 3 4 3 3 4 3 3 4 4 4 2 2 2 2 2 2 3 3 3 3 3 3 3 2 2 2 3 3 3 2
3004BJj%Jj%J%%J%Jk%%J%jj%J%jJ%Jj%%j%%%Jj%%%Jj%JjJ%%J%%%j%j%%%%JjJ%%jjJ%J%jJ%
$$ 2 3 2 2 3 2 2 3 3 3 4 4 5 3 3 3 4 4 3 2 2 3 3 2 3 3 4 3 3 3 2 2 2 2 3 2 2 2 2 3 2 2 3 2 3 3 3 4 4 4 4 3 3 2 2 2 2 2 3 2 3 3 3 2 1 2 2 3 3 2 3 3
2998C%j%Jj%%jJJ%%%J%j%J%%%kJjkK%%%J%j%%%%%J%%%%jJj%J%J%j%%J%%kJJj%%j%JjJJjJj
$$ 3 3 2 2 3 2 2 2 1 2 3 3 3 3 4 4 3 3 4 4 4 4 2 3 2 0 2 2 2 2 3 3 2 2 2 2 2 2 3 3 3 3 3 2 3 2 2 3 3 4 4 3 3 3 4 4 4 2 3 4 3 3 3 2 2 3 2 3 4 3 4 3
2992CjJj%%%J%Jjj%%J%J%j%%%%%%J%j%%j%%J%%j%j%JJ%%%%Jj%J%j%j%J%%%j%%%%%%%%J%%j
$$ 3 2 3 2 2 2 2 3 3 4 3 2 2 2 3 3 4 4 3 3 3 3 3 3 3 4 4 3 3 3 2 2 2 3 3 3 2 2 1 1 2 3 3 3 3 3 4 3 3 4 4 3 3 2 2 3 3 3 3 2 2 2 2 2 2 2 2 2 3 3 3 2
2985B%%%%%JjJjjJJjJ%j%J%jJJJKKKKJJKjkllk%%k%jjKjJJj%%jJj%Jj%%%jJ%jjJ%%%%%%%J
$$ 2 2 2 2 2 2 3 2 3 2 1 2 3 2 3 3 2 2 3 3 2 3 4 5 7 9 11 13 14 15 17 16 14 11 8 6 6 6 4 4 3 2 4 3 4 5 4 4 4 3 4 3 3 4 3 3 3 3 2 3 3 2 1 2 2 2 2 2 2 2 2 3
2979C%%%j%Jj%%%%%%Jj%%%J%j%jKj%J%j%jJJ%%JjJ%j%jJjJ%jJ%jK%j%%J%k%J%%%Jj%%jJjJ
$$ 3 3 3 3 2 2 3 2 2 2 2 2 2 2 3 2 2 2 2 3 3 2 2 1 3 2 2 3 3 2 2 1 2 3 3 3 4 3 4 4 3 3 2 3 2 3 3 2 3 3 2 4 4 3 3 3 4 4 2 2 3 3 3 3 4 3 3 3 2 3 2 3
2972C%%%%jJJjJj%Jjj%%J%j%%K%jJjjJ%jjJ%J%J%k%%%%%J%%Jj%%j%%J%j%J%j%%Jj%Jj%K%j
$$ 3 3 3 3 3 2 3 4 3 4 3 3 4 3 2 2 2 3 3 2 2 2 4 4 3 4 3 2 3 3 2 1 2 2 3 3 4 4 2 2 2 2 2 2 3 3 3 4 3 3 3 2 2 2 3 3 2 2 3 3 2 2 2 3 2 2 3 2 2 4 4 3
2966C%%%J%%j%j%%%jJ%%Jj%%jJJ%%j%Jj%J%%%jjJ%j%%%J%J%%%JjJj%%%j%jJJ%%%J%j%%j%J
$$ 3 3 3 3 4 4 4 3 3 2 2 2 2 1 2 2 2 3 2 2 2 1 2 3 3 3 2 2 3 2 2 3 3 3 3 2 1 2 2 1 1 1 1 2 2 3 3 3 3 4 3 4 3 3 3 3 2 2 1 2 3 3 3 3 4 4 3 3 3 2 2 3
2959C%j%JJjjJ%j%J%J%jj%%%%%J%%%%kJjJJjjJJj%%JJ%J%k%%%j%Jj%%JjJ%%%%%JjJj%%%%%
$$ 3 3 2 2 3 4 3 2 3 3 2 2 3 3 4 4 3 2 2 2 2 2 2 3 3 3 3 3 1 2 1 2 3 2 1 2 3 2 2 2 3 4 4 5 5 3 3 3 3 2 2 3 2 2 2 3 2 3 3 3 3 3 3 4 3 4 3 3 3 3 3 3
2953C%%Jj%J%j%jJ%jjJ%%J%jJ%j%Jj%%JJ%%%kJ%%%j%JjJ%%%%jJ%%%j%JjK%%j%%Jjj%J%%j%
$$ 3 3 3 4 3 3 4 4 3 3 2 3 3 2 1 2 2 2 3 3 2 3 3 2 2 3 2 2 2 3 4 4 4 4 2 3 3 3 3 2 2 3 2 3 3 3 3 3 2 3 3 3 3 2 2 3 2 4 4 4 3 3 3 4 3 2 2 3 3 3 2 2
2946B%%%%%%%JjJ%%%kJ%J%%J%j%J%j%Jj%Kk%J%%%KJ%jJJk%%jj%jj%%%Jj%%J%%Jjj%%JJJjk
$$ 2 2 2 2 2 2 2 2 3 2 3 3 3 3 1 2 2 3 3 3 4 4 3 3 4 4 3 3 4 3 3 5 3 3 4 4 4 4 6 7 7 6 7 8 6 6 6 5 4 4 3 2 2 2 2 3 2 2 2 3 3 3 4 3 2 2 2 3 4 5 4 2
2940B%JJj%J%jjJJ%jjJjjJ%J%jjJ%jJ%%%J%jJ%%j%JjJ%%j%%%%J%%jJj%JJJ%%%J%%Kjjjj%%
$$ 2 2 3 4 3 3 4 4 3 2 3 4 4 3 2 3 2 1 2 2 3 3 2 1 2 2 1 2 2 2 2 3 3 2 3 3 3 2 2 3 2 3 3 3 2 2 2 2 2 3 3 3 2 3 2 2 3 4 5 5 5 5 6 6 6 8 7 6 5 4 4 4
2934DjJ%j%j%JJjJ%jjjJjJJ%%jJ%%jJ%j%JjJj%j%KjJj%Jj%J%%%j%%J%%%%%%Jk%%%%J%%kJJ
$$ 4 3 4 4 3 3 2 2 3 4 3 4 4 3 2 1 2 1 2 3 3 3 2 3 3 3 2 3 3 2 2 3 2 3 2 2 1 1 3 2 3 2 2 3 2 2 3 3 3 3 2 2 2 3 3 3 3 3 3 3 4 2 2 2 2 2 3 3 3 1 2 3
2927C%%%j%%J%%%%%%%jjK%%j%J%j%%J%J%jjJ%Jk%jJJ%%Jjj%J%%%%%%JJjj%j%J%jjJJj%%%J
$$ 3 3 3 3 2 2 2 3 3 3 3 3 3 3 3 2 1 3 3 3 2 2 3 3 2 2 2 3 3 4 4 3 2 3 3 4 2 2 1 2 3 3 3 4 3 2 2 3 3 3 3 3 3 3 4 5 4 3 3 2 2 3 3 2 1 2 3 2 2 2 2 3
2921C%%%%%jjJ%JjJ%j%%%%J%%jJjJj%jJ%%%%%%J%%%%%%%%%jj%%J%%%%%%J%jj%K%J%k%JJJ%
$$ 3 3 3 3 3 3 2 1 2 2 3 2 3 3 2 2 2 2 2 3 3 3 2 3 2 3 2 2 1 2 2 2 2 2 2 2 3 3 3 3 3 3 3 3 3 3 2 1 1 1 2 2 2 2 2 2 2 3 3 2 1 1 3 3 4 4 2 2 3 4 5 5
2914Ej%j%%j%%%%%JJj%%j%%J%%%%jJ%jJjJj%%jJJjJ%%%Jj%%jjJ%%J%%%%kJJjJJkjJ%%%%J%
$$ 5 4 4 3 3 3 2 2 2 2 2 2 3 4 3 3 3 2 2 2 3 3 3 3 3 2 3 3 2 3 2 3 2 2 2 1 2 3 2 3 3 3 3 4 3 3 3 2 1 2 2 2 3 3 3 3 3 1 2 3 2 3 4 2 1 2 2 2 2 2 3 3
2908C%%j%j%JJjJ%jjJ%%%JJjJj%jJ%j%%%JJk%Jj%%JJ%j%%%j%Jj%Kj%%j%jJ%j%%K%jJj%%jJ
$$ 3 3 3 2 2 1 1 2 3 2 3 3 2 1 2 2 2 2 3 4 3 4 3 3 2 3 3 2 2 2 2 3 4 2 2 3 2 2 2 3 4 4 3 3 3 3 2 2 3 2 2 4 3 3 3 2 2 1 2 2 1 1 1 3 3 2 3 2 2 2 1 2
2901BjJ%J%%%J%j%%j%J%%%jjJJ%j%%%%%J%%%j%J%%%%%%%j%%%J%jK%%j%%%%J%jjJJjjJ%%%%
$$ 2 1 2 2 3 3 3 3 4 4 3 3 3 2 2 3 3 3 3 2 1 2 3 3 2 2 2 2 2 2 3 3 3 3 2 2 3 3 3 3 3 3 3 3 2 2 2 2 3 3 2 4 4 4 3 3 3 3 3 4 4 3 2 3 4 3 2 3 3 3 3 3
2895C%%%j%%J%%J%%%%jJ%J%%jjJ%jJjjJ%J%j%J%JJjJjjJj%j%Jj%%jJ%j%JJ%%JJ%j%JJ%J%J
$$ 3 3 3 3 2 2 2 3 3 3 4 4 4 4 4 3 4 4 5 5 5 4 3 4 4 3 4 3 2 3 3 4 4 3 3 4 4 5 6 5 6 5 4 5 4 4 3 3 4 3 3 3 2 3 3 2 2 3 4 4 4 5 6 6 5 5 6 7 7 8 8 9
2888IJKLLLKJKJ%kkkllkkjkj%J%%j%%j%%%%jjJJJ%%%%%%%Jk%%%%%J%%%%jJJ%%%K%J%JJKK%
$$ 9 10 12 15 18 21 23 24 26 27 27 25 23 21 18 15 13 11 10 8 7 7 8 8 8 7 7 7 6 6 6 6 6 5 4 5 6 7 7 7 7 7 7 7 7 8 6 6 6 6 6 6 7 7 7 7 7 6 7 8 8 8 8 10 10 11 11 12 13 15 17 17
2882A7%JJKKLJLLLMMNMNPPJ0J2J3J7K2K8L9N6P8J17J79K67L49L79L72L27J98pk39m29m88m02
$$ 17 17 18 19 21 23 26 27 30 33 36 40 44 49 53 58 65 72 82 94 107 124 146 174 213 269 347 464 643 910 1259 1638 2010 2337 2535 2528 2289 1860 1372 970
2878I70k84j87j24q3n9m2l1k5k0j5j3rrnonolll%kjjkljkkJl%k%Jj%j%%%%k%jjjJjj%j%j%
$$ 970 686 499 375 292 233 191 160 135 115 100 87 78 69 64 58 53 47 44 41 38 38 36 35 34 32 29 28 26 24 25 22 22 20 20 21 20 20 19 19 19 19 19 17 17 16 15 14 15 14 13 13 12 12 11 11
2873A1jj%%jJ%%JjjjJ%%%j%%%j%Jj%J%%j%J%J%j%j%J%%%k%%%%jJk%JJJj%Jj%%%jJJ%j%%%%
$$ 11 10 9 9 9 8 9 9 9 10 9 8 7 8 8 8 8 7 7 7 7 6 6 7 6 6 7 7 7 6 6 7 7 8 8 7 7 6 6 7 7 7 7 5 5 5 5 5 4 5 3 3 4 5 6 5 5 6 5 5 5 5 4 5 6 6 5 5 5 5 5
2867E%%%%j%%%j%JjJJjj%JjJJ%j%%%j%%%%J%%%j%J%%%j%j%JJj%jJ%%J%Jk%%%%JJJk%%%J%%
$$ 5 5 5 5 5 4 4 4 4 3 3 4 3 4 5 4 3 3 4 3 4 5 5 4 4 4 4 3 3 3 3 3 4 4 4 4 3 3 4 4 4 4 3 3 2 2 3 4 3 3 2 3 3 3 4 4 5 3 3 3 3 3 4 5 6 4 4 4 4 5 5 5
2861E%%j%%Jj%%%jjJ%%%J%J%%jjJJ%J%%JJ%%j%J%j%jj%jjJ%%Jjj%%JJ%j%%%jJ%j%J%jjJJ%
$$ 5 5 5 4 4 4 5 4 4 4 4 3 2 3 3 3 3 4 4 5 5 5 4 3 4 5 5 6 6 6 7 8 8 8 7 7 8 8 7 7 6 5 5 4 3 4 4 4 5 4 3 3 3 4 5 5 4 4 4 4 3 4 4 3 3 4 4 3 2 3 4 4
2854DJ%j%jj%J%J%%j%%JJ%j%J%j%j%%jJ%%%%J%j%Jj%%%%%%%%%%%%jJJJJJJ%%%%k%jjJ%j%%
$$ 4 5 5 4 4 3 2 2 3 3 4 4 4 3 3 3 4 5 5 4 4 5 5 4 4 3 3 3 2 3 3 3 3 3 4 4 3 3 4 3 3 3 3 3 3 3 3 3 3 3 3 3 2 3 4 5 6 7 8 8 8 8 8 6 6 5 4 5 5 4 4 4
2848DJj%j%%j%J%j%J%jJJ%j%%%%%%%%jJj%%J%%j%Jj%%%%jKJ%%kJ%%j%%J%%%%%%%%jJjJj%J
$$ 4 5 4 4 3 3 3 2 2 3 3 2 2 3 3 2 3 4 4 3 3 3 3 3 3 3 3 3 2 3 2 2 2 3 3 3 2 2 3 2 2 2 2 2 1 3 4 4 4 2 3 3 3 2 2 2 3 3 3 3 3 3 3 3 3 2 3 2 3 2 2 3
2841C%j%J%%%Jj%%%%j%J%%J%%%%%j%%Jj%%jjJJ%JjjJJJ%j%%%jJ%%%j%J%%%%%%jJ%%%%jjJ%
$$ 3 3 2 2 3 3 3 3 4 3 3 3 3 3 2 2 3 3 3 4 4 4 4 4 4 3 3 3 4 3 3 3 2 1 2 3 3 4 3 2 3 4 5 5 4 4 4 4 3 4 4 4 4 3 3 4 4 4 4 4 4 4 3 4 4 4 4 4 3 2 3 3
2835C%%%%%%J%jJjJ%%%%jj%%J%%%j%%J%j%%J%%j%jJJ%Jjj%Kj%%JJjj%J%j%J%%%jJ%jJ%%%%
$$ 3 3 3 3 3 3 3 4 4 3 4 3 4 4 4 4 4 3 2 2 2 3 3 3 3 2 2 2 3 3 2 2 2 3 3 3 2 2 1 2 3 3 4 3 2 2 4 3 3 3 4 5 4 3 3 4 4 3 3 4 4 4 4 3 4 4 3 4 4 4 4 4
2828D%J%k%J%jJ%%%%jJ%j%J%j%%%%j%JJ%%j%%J%J%jj%%%%J%%JjjJ%%JjJ%%%j%Kj%%%Jk%J%
$$ 4 4 5 5 3 3 4 4 3 4 4 4 4 4 3 4 4 3 3 4 4 3 3 3 3 3 2 2 3 4 4 4 3 3 3 4 4 5 5 4 3 3 3 3 3 4 4 4 5 4 3 4 4 4 5 4 5 5 5 5 4 4 6 5 5 5 5 6 4 4 5 5
2822EJj%%%%%JJ%jjJj%JJjjJ%%%JJj%J%j%%%j%%%j%j%Jj%Kj%JjjK%jKJ%J%%%%%Jj%%jJ%%%
$$ 5 6 5 5 5 5 5 5 6 7 7 6 5 6 5 5 6 7 6 5 6 6 6 6 7 8 7 7 8 8 7 7 7 7 6 6 6 6 5 5 4 4 5 4 4 6 5 5 6 5 4 6 6 5 7 8 8 9 9 9 9 9 9 10 9 9 9 8 9 9 9 9
2815I%J%%%JLJjKJJJ%%KJjKJKKLMNORJ1J5J6J8J9J5QMlj0j5j8j8j5j2j0pmj%KLMOONNKKkj
$$ 9 9 10 10 10 10 11 14 15 14 16 17 18 19 19 19 21 22 21 23 24 26 28 31 35 40 46 55 66 81 97 115 134 149 157 161 158 148 133 115 97 82 70 60 53 49 48 48 50 53 57 63 69 74 79 81 83 81 80
2810H0mmmkkKJKMLLMOOOQQJ1J1J1J7J9K3K8L3M1N2O8Q9J18J58K16K90L78M72N53N93N86N03
$$ 80 76 72 68 66 64 66 67 69 73 76 79 83 89 95 101 109 117 128 139 150 167 186 209 237 270 311 363 431 520 638 796 1012 1302 1680 2152 2705 3298 3884 4387
2807D387L42J30j09l39n06n97o12n55m65l68k78k06j52j13q5o4n2m0l4k8k2j9j7j0mjLQJ0
$$ 4387 4729 4859 4750 4411 3905 3308 2696 2141 1676 1308 1030 824 672 559 474 410 358 318 284 256 234 215 198 188 184 183 186 194 204
2804B04J1J1QLkrj3j6j6j5j2olk%jkj%kjjjlmmnponmlkjJKKMMMMLPQPJ0J2J3J6K0K4L1L6M7
$$ 204 215 226 234 237 235 226 213 197 181 166 154 148 145 143 143 142 140 139 139 137 136 135 134 131 127 123 118 111 105 100 96 93 91 90 91 93 95 99 103 107 111 114 121 129 136 146 158 171 187 207 231 262 298 345
2799C45O1P8J03J37J83K45L22M10M95N49N68N26M07K25Kk31m26n52o01n75m97m01l06k27j65
$$ 345 406 484 587 724 907 1152 1474 1884 2379 2928 3496 4022 4429 4654 4656 4425 3999 3447 2846 2271 1774 1373 1067 840 675
2797F75j21q9o8n3m2l5l0k5k1j8j4j1j2rqoomllmljjJJLKMLK%jlkppooonmmklljkkjj%j%k
$$ 675 554 465 397 344 302 267 237 212 191 173 159 148 136 127 119 113 107 103 100 97 93 90 89 88 89 90 93 95 99 102 104 104 103 100 98 91 84 78 72 66 61 57 53 51 48 45 44 42 40 39 38 38 37 37 35
2792C5%%jK%j%J%%J%J%KJJKJ%%KJJKKKKKKJ%jjlllmmlkjjjj%k%%%jJJJ%%j%jJJ%j%jJ%jjj
$$ 35 35 35 34 36 36 35 35 36 36 36 37 37 38 38 40 41 42 44 45 45 45 47 48 49 51 53 55 57 59 61 62 62 61 60 57 54 51 47 43 40 38 37 36 35 34 34 32 32 32 32 31 32 33 34 34 34 33 33 32 33 34 34 33 33 32 33 33 32 31 30
2785C0%%%%%%jJ%%%j%%%J%kJ%%%%%%%%%%%%%%Jj%%JK%%%J%%J%%%j%j%jJ%k%Jkj%%J%%j%%%
$$ 30 30 30 30 30 30 30 29 30 30 30 30 29 29 29 29 30 30 28 29 29 29 29 29 29 29 29 29 29 29 29 29 29 29 30 29 29 29 30 32 32 32 32 33 33 33 34 34 34 34 33 33 32 32 31 32 32 30 30 31 29 28 28 28 29 29 29 28 28 28 28
2779B8%%j%%j%J%J%%j%%jjK%jjJ%jJjJ%jj%Jj%%jjJJjJjjJ%%j%jJj%Jjj%%KJJK%KKJ%kjkl
$$ 28 28 28 27 27 27 26 26 27 27 28 28 28 27 27 27 26 25 27 27 26 25 26 26 25 26 25 26 26 25 24 24 25 24 24 24 23 22 23 24 23 24 23 22 23 23 23 22 22 21 22 21 21 22 21 20 20 20 22 23 24 26 26 28 30 31 31 29 28 26 23
2773B3lj%jJjj%%j%%%%%%j%j%%j%J%%jj%%%%%%%jJ%%%j%J%%%jj%%JjJ%%%j%%jJj%%J%%%j%
$$ 23 20 19 19 18 19 18 17 17 17 16 16 16 16 16 16 16 15 15 14 14 14 13 13 14 14 14 13 12 12 12 12 12 12 12 12 11 12 12 12 12 11 11 12 12 12 12 11 10 10 10 11 10 11 11 11 11 10 10 10 9 10 9 9 9 10 10 10 10 9 9
2766I%%%%%JJ%jj%%J%%j%%jJJ%j%%j%%J%%j%%%Jjj%%J%%%%%%%j%J%j%J%%%%%%jj%K%j%%%%
$$ 9 9 9 9 9 9 10 11 11 10 9 9 9 10 10 10 9 9 9 8 9 10 10 9 9 9 8 8 8 9 9 9 8 8 8 8 9 8 7 7 7 8 8 8 8 8 8 8 8 7 7 8 8 7 7 8 8 8 8 8 8 8 7 6 6 8 8 7 7 7 7 7
2760GJjj%J%jJ%j%J%jJj%JJj%%j%%%%%%%J%j%%jJ%Jj%%%%%%%%J%%j%j%J%JjJjj%%%J%%j%J
$$ 7 8 7 6 6 7 7 6 7 7 6 6 7 7 6 7 6 6 7 8 7 7 7 6 6 6 6 6 6 6 6 7 7 6 6 6 5 6 6 7 6 6 6 6 6 6 6 6 6 7 7 7 6 6 5 5 6 6 7 6 7 6 5 5 5 5 6 6 6 5 5 6
2754F%%Jj%%%j%%%%%%%J%%%%Jj%%jJ%jJj%%jK%jJJjJjj%J%%j%%%%%J%%jj%J%j%JJ%kJ%j%J
$$ 6 6 6 7 6 6 6 6 5 5 5 5 5 5 5 5 6 6 6 6 6 7 6 6 6 5 6 6 5 6 5 5 5 4 6 6 5 6 7 6 7 6 5 5 6 6 6 5 5 5 5 5 5 6 6 6 5 4 4 5 5 4 4 5 6 6 4 5 5 4 4 5
2747E%%%J%%%%%j%Jjj%J%%%jJ%%%j%J%Jj%Jj%%%%Jj%%j%J%%%%%j%Jj%%%%K%%jJ%%%jjJ%%%
$$ 5 5 5 5 6 6 6 6 6 6 5 5 6 5 4 4 5 5 5 5 4 5 5 5 5 4 4 5 5 6 5 5 6 5 5 5 5 5 6 5 5 5 4 4 5 5 5 5 5 5 4 4 5 4 4 4 4 4 6 6 6 5 6 6 6 6 5 4 5 5 5 5
2741E%%%%J%%%J%j%j%%Jj%J%j%%J%j%%Jj%%Jj%Jj%J%%%%j%J%%Jj%%%j%%%%JJ%%Jjjj%%jJK
$$ 5 5 5 5 5 6 6 6 6 7 7 6 6 5 5 5 6 5 5 6 6 5 5 5 6 6 5 5 5 6 5 5 5 6 5 5 6 5 5 6 6 6 6 6 5 5 6 6 6 7 6 6 6 6 5 5 5 5 5 6 7 7 7 8 7 6 5 5 5 4 5 7
2734G%%kJJ%j%%%j%J%JkJ%J%Jj%%J%j%%%%%%%%%%%jJ%Jj%%Jj%%jK%j%%j%J%J%%Jj%j%%Jj%
$$ 7 7 7 5 6 7 7 6 6 6 6 5 5 6 6 7 5 6 6 7 7 8 7 7 7 8 8 7 7 7 7 7 7 7 7 7 7 7 7 6 7 7 8 7 7 7 8 7 7 7 6 8 8 7 7 7 6 6 7 7 8 8 8 9 8 8 7 7 7 8 7 7
2728G%J%jJj%%J%%J%j%%jJ%jJ%%J%%%j%JJJLKJKLKMK%%jklkmkkj%kjjJ%j%%j%%j%J%%j%J%
$$ 7 7 8 8 7 8 7 7 7 8 8 8 9 9 8 8 8 7 8 8 7 8 8 8 9 9 9 9 8 8 9 10 11 14 16 17 19 22 24 28 30 30 30 29 27 24 22 18 16 14 13 13 11 10 9 10 10 9 9 9 8 8 8 7 7 8 8 8 7 7 8 8
2721H%Jjj%%J%%j%J%jjJ%%%j%Jj%%J%jJjJ%%j%%%%%%Jj%%%jJJjJj%JJJJ%JKKLLKLJ%jjjll
$$ 8 8 9 8 7 7 7 8 8 8 7 7 8 8 7 6 7 7 7 7 6 6 7 6 6 6 7 7 6 7 6 7 7 7 6 6 6 6 6 6 6 7 6 6 6 6 5 6 7 6 7 6 6 7 8 9 10 10 11 13 15 18 21 23 26 27 27 26 25 24 21 18
2715A8lkjj%kjj%%%j%%%kJJ%%jj%J%%Jjj%J%%jJ%%j%%%Kj%Kjj%%%jJjjJ%%JjJ%j%%J%j%Jj
$$ 18 15 13 12 11 11 9 8 7 7 7 7 6 6 6 6 4 5 6 6 6 5 4 4 5 5 5 6 5 4 4 5 5 5 4 5 5 5 4 4 4 4 6 5 5 7 6 5 5 5 5 4 5 4 3 4 4 4 5 4 5 5 4 4 4 5 5 4 4 5 4
2708D%%%%%%J%%%%jJ%j%JjJj%%%j%%JJJk%jJ%%%%%Jj%%%J%%j%%%%%jJ%%%J%jjJJjjJjjJ%%
$$ 4 4 4 4 4 4 4 5 5 5 5 5 4 5 5 4 4 5 4 5 4 4 4 4 3 3 3 4 5 6 4 4 3 4 4 4 4 4 4 5 4 4 4 4 5 5 5 4 4 4 4 4 4 3 4 4 4 4 5 5 4 3 4 5 4 3 4 3 2 3 3 3
2702C%Jj%%%%J%jjJJ%%%%jK%%kJ%%%jJJ%jjJj%Jj%%J%%%jJ%%jJ%jJ%jJJ%jJ%jjJJj%j%J%j
$$ 3 3 4 3 3 3 3 3 4 4 3 2 3 4 4 4 4 4 3 5 5 5 3 4 4 4 4 3 4 5 5 4 3 4 3 3 4 3 3 3 4 4 4 4 3 4 4 4 3 4 4 3 4 4 3 4 5 5 4 5 5 4 3 4 5 4 4 3 3 4 4 3
2696C%JjJ%%%J%%jj%J%j%%%J%j%J%%jJ%Jk%Jj%%%Jj%%J%jK%j%j%%%%%%J%%%%%%JjjJ%%j%%
$$ 3 3 4 3 4 4 4 4 5 5 5 4 3 3 4 4 3 3 3 3 4 4 3 3 4 4 4 3 4 4 5 3 3 4 3 3 3 3 4 3 3 3 4 4 3 5 5 4 4 3 3 3 3 3 3 3 4 4 4 4 4 4 4 5 4 3 4 4 4 3 3 3
2689CjJKJkjJ%j%Jj%J%%jJ%%%%%jJ%%%%%jJ%%jJj%Jj%jJJ%j%jJJ%%%%jJjJJ%%j%J%jJ%%Jk
$$ 3 2 3 5 6 4 3 4 4 3 3 4 3 3 4 4 4 3 4 4 4 4 4 4 3 4 4 4 4 4 4 3 4 4 4 3 4 3 3 4 3 3 2 3 4 4 3 3 2 3 4 4 4 4 4 3 4 3 4 5 5 5 4 4 5 5 4 5 5 5 6 4
2683D%%%%jJjjJJj%J%%%%%%J%%j%%j%%%J%%j%J%J%%%JkJ%%%%J%J%JJJLJKKKJ%%%kkjkjlk%
$$ 4 4 4 4 4 3 4 3 2 3 4 3 3 4 4 4 4 4 4 4 5 5 5 4 4 4 3 3 3 3 4 4 4 3 3 4 4 5 5 5 5 6 4 5 5 5 5 5 6 6 7 7 8 9 10 13 14 16 18 20 21 21 21 21 19 17 16 14 13 10 8 8
2676Hj%j%%j%j%J%%%j%%%J%k%K%j%%%%jJj%%%%J%%%%%%%%jJJ%jj%%J%jjJJ%%%%j%%JJ%%jJ
$$ 8 7 7 6 6 6 5 5 4 4 5 5 5 5 4 4 4 4 5 5 3 3 5 5 4 4 4 4 4 3 4 3 3 3 3 3 4 4 4 4 4 4 4 4 4 3 4 5 5 4 3 3 3 4 4 3 2 3 4 4 4 4 4 3 3 3 4 5 5 5 4 5
2670E%JJJJJKLJKJJ%j%jkkljjk%j%j%%%jj%JJ%%k%Jj%%j%%JJJ%j%j%%%%jJJ%%kJ%Kk%%%Jk
$$ 5 5 6 7 8 9 10 12 15 16 18 19 20 20 19 19 18 16 14 11 10 9 7 7 6 6 5 5 5 5 4 3 3 4 5 5 5 3 3 4 3 3 3 2 2 2 3 4 5 5 4 4 3 3 3 3 3 2 3 4 4 4 2 3 3 5 3 3 3 3 4 2
2663BJJ%%%JjjJj%%JjJ%kJJ%%%%%j%j%J%Jjj%%JJj%J%%Jk%%%Jjj%%K%j%%J%jJ%%%j%%%%%%
$$ 2 3 4 4 4 4 5 4 3 4 3 3 3 4 3 4 4 2 3 4 4 4 4 4 4 3 3 2 2 3 3 4 3 2 2 2 3 4 3 3 4 4 4 5 3 3 3 3 4 3 2 2 2 4 4 3 3 3 4 4 3 4 4 4 4 3 3 3 3 3 3 3
2657C%J%j%%%%%JJjj%%%Jj%Jj%%J%kJJjJ%j%Jj%%%J%j%%Jj%%%%%%%%Kj%%%%%%%%%%Jk%j%K
$$ 3 3 4 4 3 3 3 3 3 3 4 5 4 3 3 3 3 4 3 3 4 3 3 3 4 4 2 3 4 3 4 4 3 3 4 3 3 3 3 4 4 3 3 3 4 3 3 3 3 3 3 3 3 3 5 4 4 4 4 4 4 4 4 4 4 4 5 3 3 2 2 4
2650D%%jJj%jJj%J%%JkJJ%j%%J%k%J%Jj%%J%jJ%j%%jJK%jj%%Jj%Kj%%jJj%J%j%%%%j%J%%%
$$ 4 4 4 3 4 3 3 2 3 2 2 3 3 3 4 2 3 4 4 3 3 3 4 4 2 2 3 3 4 3 3 3 4 4 3 4 4 3 3 3 2 3 5 5 4 3 3 3 4 3 3 5 4 4 4 3 4 3 3 4 4 3 3 3 3 3 2 2 3 3 3 3
2644CJjJj%%J%%%%j%%J%jJ%J%jJkJjJ%jJj%Jj%%%%%JJj%%j%%kJK%%%%jJJjj%%JkjKJ%%j%%
$$ 3 4 3 4 3 3 3 4 4 4 4 4 3 3 3 4 4 3 4 4 5 5 4 5 3 4 3 4 4 3 4 3 3 4 3 3 3 3 3 3 4 5 4 4 4 3 3 3 1 2 4 4 4 4 4 3 4 5 4 3 3 3 4 2 1 3 4 4 4 3 3 3
2638C%%jK%jj%JJ%jJ%j%j%%J%%Jj%Jj%%%%JkjJJj%J%%J%J%jjJ%j%JJkjJ%J%%%j%jJJ%j%Jj
$$ 3 3 3 2 4 4 3 2 2 3 4 4 3 4 4 3 3 2 2 2 3 3 3 4 3 3 4 3 3 3 3 3 4 2 1 2 3 2 2 3 3 3 4 4 5 5 4 3 4 4 3 3 4 5 3 2 3 3 4 4 4 4 3 3 2 3 4 4 3 3 4 3
2631CjJ%j%%J%j%Jj%%%%%%%%JJ%%j%%%Kjj%%Jj%%%J%%%kJJkJ%JjkJ%Kj%Jj%%%%jK%j%jJ%%
$$ 3 2 3 3 2 2 2 3 3 2 2 3 2 2 2 2 2 2 2 2 2 3 4 4 4 3 3 3 3 5 4 3 3 3 4 3 3 3 3 4 4 4 4 2 3 4 2 3 3 4 3 1 2 2 4 3 3 4 3 3 3 3 3 2 4 4 3 3 2 3 3 3
2625C%%j%J%j%JJj%%J%%jKj%%jJ%%%Jj%%jjJ%j%%J%J%%%%%%j%JjjJ%%%jJJ%j%JJj%%j%Jj%
$$ 3 3 3 2 2 3 3 2 2 3 4 3 3 3 4 4 4 3 5 4 4 4 3 4 4 4 4 5 4 4 4 3 2 3 3 2 2 2 3 3 4 4 4 4 4 4 4 3 3 4 3 2 3 3 3 3 2 3 4 4 3 3 4 5 4 4 4 3 3 4 3 3
2618C%j%Kj%jJ%Jj%%%%%jJ%Jj%%%J%jjKjjJJ%%%%j%%j%%J%%J%jJ%%j%%%j%J%jJjJj%JJ%%%
$$ 3 3 2 2 4 3 3 2 3 3 4 3 3 3 3 3 3 2 3 3 4 3 3 3 3 4 4 3 2 4 3 2 3 4 4 4 4 4 3 3 3 2 2 2 3 3 3 4 4 3 4 4 4 3 3 3 3 2 2 3 3 2 3 2 3 2 2 3 4 4 4 4
2612DkJ%%J%%j%%%%Jjj%JJj%J%%j%JjJj%jJ%J%%j%J%j%j%%%%JJj%%J%j%%Jj%Jjj%%JJjjJ%
$$ 4 2 3 3 3 4 4 4 3 3 3 3 3 4 3 2 2 3 4 3 3 4 4 4 3 3 4 3 4 3 3 2 3 3 4 4 4 3 3 4 4 3 3 2 2 2 2 2 3 4 3 3 3 4 4 3 3 3 4 3 3 4 3 2 2 2 3 4 3 2 3 3
2605Cj%J%%%jJJ%j%Jj%%%%%%Jk%%J%%%%jJ%%%%%%Jk%KjJ%j%%%%%%jJJjj%J%jJ%%J%j%jK%%
$$ 3 2 2 3 3 3 3 2 3 4 4 3 3 4 3 3 3 3 3 3 3 4 2 2 2 3 3 3 3 3 2 3 3 3 3 3 3 3 4 2 2 4 3 4 4 3 3 3 3 3 3 3 2 3 4 3 2 2 3 3 2 3 3 3 4 4 3 3 2 4 4 4
2599DjJ%j%Jjj%Jj%Jj%JJ%j%%J%j%J%%jkK%j%K%jkJJ%%%%j%Jj%%JJ%kJJj%jJ%%Jj%%Jj%%%
$$ 4 3 4 4 3 3 4 3 2 2 3 2 2 3 2 2 3 4 4 3 3 3 4 4 3 3 4 4 4 3 1 3 3 2 2 4 4 3 1 2 3 3 3 3 3 2 2 3 2 2 2 3 4 4 2 3 4 3 3 2 3 3 3 4 3 3 3 4 3 3 3 3
2592C%%%JjJJj%%Jk%jjK%%%j%J%%Jj%%%%%JjJ%%J%j%j%%%%Jj%J%%j%Jj%J%Jj%j%J%%%%kJ%
$$ 3 3 3 3 4 3 4 5 4 4 4 5 3 3 2 1 3 3 3 3 2 2 3 3 3 4 3 3 3 3 3 3 4 3 4 4 4 5 5 4 4 3 3 3 3 3 4 3 3 4 4 4 3 3 4 3 3 4 4 5 4 4 3 3 4 4 4 4 4 2 3 3
2586CjJ%jK%jJ%j%%%jKjj%J%%%jjJ%J%j%JjJ%%%%J%j%%j%Jj%%%%J%%Jj%%%%%%J%%jj%%jJJ
$$ 3 2 3 3 2 4 4 3 4 4 3 3 3 3 2 4 3 2 2 3 3 3 3 2 1 2 2 3 3 2 2 3 2 3 3 3 3 3 4 4 3 3 3 2 2 3 2 2 2 2 2 3 3 3 4 3 3 3 3 3 3 3 4 4 4 3 2 2 2 1 2 3
2579Cj%JJ%j%j%K%%j%jJJ%j%%jJ%%%%J%%%j%%Jj%j%%JJjJ%j%J%jjJ%%%%%%%%jJ%%J%k%%%J
$$ 3 2 2 3 4 4 3 3 2 2 4 4 4 3 3 2 3 4 4 3 3 3 2 3 3 3 3 3 4 4 4 4 3 3 3 4 3 3 2 2 2 3 4 3 4 4 3 3 4 4 3 2 3 3 3 3 3 3 3 3 3 2 3 3 3 4 4 2 2 2 2 3
2573CjJ%%%%%%%jJ%J%j%%J%j%%jJ%Jj%%JjJj%jJjjJ%K%%%j%%J%j%%Jj%JJk%%%%%%jJ%%%jJ
$$ 3 2 3 3 3 3 3 3 3 3 2 3 3 4 4 3 3 3 4 4 3 3 3 2 3 3 4 3 3 3 4 3 4 3 3 2 3 2 1 2 2 4 4 4 4 3 3 3 4 4 3 3 3 4 3 3 4 5 3 3 3 3 3 3 3 2 3 3 3 3 2 3
2567Cj%Jjj%K%jJ%%%%%JkJ%j%j%J%JjJJ%j%%%j%%jJJ%%%jJjJ%%jJJ%jJjJ%%j%J%J%jj%j%J
$$ 3 2 2 3 2 1 1 3 3 2 3 3 3 3 3 3 4 2 3 3 2 2 1 1 2 2 3 2 3 4 4 3 3 3 3 2 2 2 1 2 3 3 3 3 2 3 2 3 3 3 2 3 4 4 3 4 3 4 4 4 3 3 4 4 5 5 4 3 3 2 2 3
2560C%%%%%jJ%%jJJ%j%%Jj%Jj%jJ%%%j%J%J%j%%%Jj%J%%j%J%%%%%%j%%Kjj%%%JjjjJJ%j%J
$$ 3 3 3 3 3 3 2 3 3 3 2 3 4 4 3 3 3 4 3 3 4 3 3 2 3 3 3 3 2 2 3 3 4 4 3 3 3 3 4 3 3 4 4 4 3 3 4 4 4 4 4 4 4 3 3 3 5 4 3 3 3 3 4 3 2 1 2 3 3 2 2 3
2554C%%%%J%%j%%%%jJj%J%kJJ%%%Jj%%%%%%j%%Jj%%%J%%jjJ%JjJJj%jjJJj%%J%J%%jj%JJj
$$ 3 3 3 3 3 4 4 4 3 3 3 3 3 2 3 2 2 3 3 1 2 3 3 3 3 4 3 3 3 3 3 3 3 2 2 2 3 2 2 2 2 3 3 3 2 1 2 2 3 2 3 4 3 3 2 1 2 3 2 2 2 3 3 4 4 4 3 2 2 3 4 3
2547CJk%%%%%KkJ%%%%J%%jJj%JJj%j%Jjj%J%j%%JjJ%%j%%J%Jj%%j%JJ%j%j%J%%%%Jj%j%%%
$$ 3 4 2 2 2 2 2 2 4 2 3 3 3 3 3 4 4 4 3 4 3 3 4 5 4 4 3 3 4 3 2 2 3 3 2 2 2 3 2 3 3 3 2 2 2 3 3 4 3 3 3 2 2 3 4 4 3 3 2 2 3 3 3 3 3 4 3 3 2 2 2 2
2541B%JJ%jJj%%%J%%%%%jJ%jJ%jj%J%j%%%%K%%%Jjj%%%j%Kj%Jjj%J%%%jJJjJj%jJJj%j%%J
$$ 2 2 3 4 4 3 4 3 3 3 3 4 4 4 4 4 4 3 4 4 3 4 4 3 2 2 3 3 2 2 2 2 2 4 4 4 4 5 4 3 3 3 3 2 2 4 3 3 4 3 2 2 3 3 3 3 2 3 4 3 4 3 3 2 3 4 3 3 2 2 2 3
2534CjJJjJj%Jj%J%j%%%%%Jjj%JjJj%%Kj%%jJ%j%J%jJ%%%jJJj%%Jk%%JjJ%j%%Jj%K%j%J%j
$$ 3 2 3 4 3 4 3 3 4 3 3 4 4 3 3 3 3 3 3 4 3 2 2 3 2 3 2 2 2 4 3 3 3 2 3 3 2 2 3 3 2 3 3 3 3 2 3 4 3 3 3 4 2 2 2 3 2 3 3 2 2 2 3 2 2 4 4 3 3 4 4 3
2528CjJJj%%%%jJ%%J%%%kjJ%%%%%Jj%%%Kj%%j%%jK%Jj%%j%J%%J%%j%%%%%%%%%J%j%%%%J%j
$$ 3 2 3 4 3 3 3 3 3 2 3 3 3 4 4 4 4 2 1 2 2 2 2 2 2 3 2 2 2 2 4 3 3 3 2 2 2 1 3 3 4 3 3 3 2 2 3 3 3 4 4 4 3 3 3 3 3 3 3 3 3 3 4 4 3 3 3 3 3 4 4 3
2521C%%J%%%j%j%JJj%%j%%%%%JJ%%j%%JJ%%jj%J%j%J%%%jj%J%J%%%%jKjj%jJ%%%j%JjKjJ%
$$ 3 3 3 4 4 4 4 3 3 2 2 3 4 3 3 3 2 2 2 2 2 2 3 4 4 4 3 3 3 4 5 5 5 4 3 3 4 4 3 3 4 4 4 4 3 2 2 3 3 4 4 4 4 4 3 5 4 3 3 2 3 3 3 3 2 2 3 2 4 3 4 4
2515Dj%%%%%%%%%%%%Jjj%%%K%%j%%%%%J%%j%%J%j%jjJJ%%%j%JJj%J%%%j%j%JJ%%j%%%%jKj
$$ 4 3 3 3 3 3 3 3 3 3 3 3 3 3 4 3 2 2 2 2 4 4 4 3 3 3 3 3 3 4 4 4 3 3 3 4 4 3 3 2 1 2 3 3 3 3 2 2 3 4 3 3 4 4 4 4 3 3 2 2 3 4 4 4 3 3 3 3 3 2 4 3
2509CkJJJ%jJ%j%jJ%j%J%jJj%J%%J%j%j%%K%j%%%JjJj%j%%%J%j%%KJjjj%J%%%j%J%%%j%J%
$$ 3 1 2 3 4 4 3 4 4 3 3 2 3 3 2 2 3 3 2 3 2 2 3 3 3 4 4 3 3 2 2 2 4 4 3 3 3 3 4 3 4 3 3 2 2 2 2 3 3 2 2 2 4 5 4 3 2 2 3 3 3 3 2 2 3 3 3 3 2 2 3 3
2502C%%%%jJj%%%J%%%%jJJ%%kJ%%%JjJj%%%jJJjJjJ%%j%%%jJ%j%J%jJ%%J%%%%jjJ%%%%%J%
$$ 3 3 3 3 3 2 3 2 2 2 2 3 3 3 3 3 2 3 4 4 4 2 3 3 3 3 4 3 4 3 3 3 3 2 3 4 3 4 3 4 4 4 3 3 3 3 2 3 3 2 2 3 3 2 3 3 3 4 4 4 4 4 3 2 3 3 3 3 3 3 4 4
2496D%%%Jj%j%%%%%jJJ%%%j%%jJJ%j%Kjj%%%jJjJ%%%J%kJ%%%%%%jJ%%%%%%%Jj%%j%Jj%%%j
$$ 4 4 4 4 5 4 4 3 3 3 3 3 3 2 3 4 4 4 4 3 3 3 2 3 4 4 3 3 5 4 3 3 3 3 2 3 2 3 3 3 3 4 4 2 3 3 3 3 3 3 3 2 3 3 3 3 3 3 3 3 4 3 3 3 2 2 3 2 2 2 2 1
2489AJJJ%j%%%%%%j%JjjJ%J%%%%j%%%JJ%k%J%j%J%j%%%J%%J%j%%%%%jJ%JkJ%%%jJJJjj%%%
$$ 1 2 3 4 4 3 3 3 3 3 3 3 2 2 3 2 1 2 2 3 3 3 3 3 2 2 2 2 3 4 4 2 2 3 3 2 2 3 3 2 2 2 2 3 3 3 4 4 3 3 3 3 3 3 2 3 3 4 2 3 3 3 3 2 3 4 5 4 3 3 3 3
2483C%%%jJjJJj%Jj%%%JjJj%JjJ%j%jjJJ%%%%J%k%%J%JJk%%%%J%%%%%%%Jjj%%j%J%jJ%%jj
$$ 3 3 3 3 2 3 2 3 4 3 3 4 3 3 3 3 4 3 4 3 3 4 3 4 4 3 3 2 1 2 3 3 3 3 3 4 4 2 2 2 3 3 4 5 3 3 3 3 3 4 4 4 4 4 4 4 4 5 4 3 3 3 2 2 3 3 2 3 3 3 2 1
2476AJJ%%j%%J%%%J%j%%j%J%JJjjjJj%J%%J%%j%%%J%k%J%%%j%%J%%%%%Jj%%Jj%j%%J%%%%%
$$ 1 2 3 3 3 2 2 2 3 3 3 3 4 4 3 3 3 2 2 3 3 4 5 4 3 2 3 2 2 3 3 3 4 4 4 3 3 3 3 4 4 2 2 3 3 3 3 2 2 2 3 3 3 3 3 3 4 3 3 3 4 3 3 2 2 2 3 3 3 3 3 3
2470C%Jj%J%%jJkKjj%%%%J%J%jj%%J%%JjJJj%j%%J%j%%%%%%%Jj%J%kJJ%jjjK%Jj%jJJ%jJj
$$ 3 3 4 3 3 4 4 4 3 4 2 4 3 2 2 2 2 2 3 3 4 4 3 2 2 2 3 3 3 4 3 4 5 4 4 3 3 3 4 4 3 3 3 3 3 3 3 3 4 3 3 4 4 2 3 4 4 3 2 1 3 3 4 3 3 2 3 4 4 3 4 3
2463CjJ%j%J%%%%%j%%J%Jjj%%%%J%%%%j%JJ%jjJ%%%%jJjJjJ%%j%%JJ%%%%j%%%j%%%%%J%%%
$$ 3 2 3 3 2 2 3 3 3 3 3 3 2 2 2 3 3 4 3 2 2 2 2 2 3 3 3 3 3 2 2 3 4 4 3 2 3 3 3 3 3 2 3 2 3 2 3 3 3 2 2 2 3 4 4 4 4 4 3 3 3 3 2 2 2 2 2 2 3 3 3 3
2457C%JJj%%j%j%%K%jjJ%%JkKj%jJ%%%%jJ%Jk%J%%%%%%%%Jjj%%J%%kJJ%%j%JjJ%Jj%%j%%%
$$ 3 3 4 5 4 4 4 3 3 2 2 2 4 4 3 2 3 3 3 4 2 4 3 3 2 3 3 3 3 3 2 3 3 4 2 2 3 3 3 3 3 3 3 3 3 4 3 2 2 2 3 3 3 1 2 3 3 3 2 2 3 2 3 3 4 3 3 3 2 2 2 2
2451Bj%JJ%%%%j%JjJ%J%%%j%Jk%jJ%JKl%JjJJjj%K%%%%jJ%%j%%%%j%J%J%j%jJJj%jJ%j%%J
$$ 2 1 1 2 3 3 3 3 3 2 2 3 2 3 3 4 4 4 4 3 3 4 2 2 1 2 2 3 5 2 2 3 2 3 4 3 2 2 4 4 4 4 4 3 4 4 4 3 3 3 3 3 2 2 3 3 4 4 3 3 2 3 4 3 3 2 3 3 2 2 2 3
2444C%%Jj%jJJ%j%jJJ%j%%%jJJj%jJ%%j%J%jJj%%J%%jJj%Kj%%Jjj%%jJJJjJ%%jjJJjj%JjJ
$$ 3 3 3 4 3 3 2 3 4 4 3 3 2 3 4 4 3 3 3 3 2 3 4 3 3 2 3 3 3 2 2 3 3 2 3 2 2 2 3 3 3 2 3 2 2 4 3 3 3 4 3 2 2 2 1 2 3 4 3 4 4 4 3 2 3 4 3 2 2 3 2 3
2438C%jJ%%%%%J%jJ%j%%%JjjJ%jJJjJ%jJ%%%jJJ%%k%%%%J%j%Jk%J%%%%Jj%%%%%%%JjjJ%jJ
$$ 3 3 2 3 3 3 3 3 3 4 4 3 4 4 3 3 3 3 4 3 2 3 3 2 3 4 3 4 4 3 4 4 4 4 3 4 5 5 5 3 3 3 3 3 4 4 3 3 4 2 2 3 3 3 3 3 4 3 3 3 3 3 3 3 3 4 3 2 3 3 2 3
2431CJ%jJ%%j%%%jJ%%JjjJ%%j%J%%j%Jj%%%JJj%%J%j%%Jj%j%%J%%%%%%j%J%%%%jJj%%JjJj
$$ 3 4 4 3 4 4 4 3 3 3 3 2 3 3 3 4 3 2 3 3 3 2 2 3 3 3 2 2 3 2 2 2 2 3 4 3 3 3 4 4 3 3 3 4 3 3 2 2 2 3 3 3 3 3 3 3 2 2 3 3 3 3 3 2 3 2 2 2 3 2 3 2
2425B%J%%%j%J%kJJ%jJJj%%J%jjJ%%%%%j%JJj%jJJjjJ%%jJjJ%j%%%J%jJ%%Jj%%J%j%%JjJj
$$ 2 2 3 3 3 3 2 2 3 3 1 2 3 3 2 3 4 3 3 3 4 4 3 2 3 3 3 3 3 3 2 2 3 4 3 3 2 3 4 3 2 3 3 3 2 3 2 3 3 2 2 2 2 3 3 2 3 3 3 4 3 3 3 4 4 3 3 3 4 3 4 3
2418Cj%%J%J%j%%jJ%Jj%J%%JjjjjJJ%%jJ%%j%%J%%%%jJ%%%%%%JkJJj%j%J%j%J%j%%%Jj%Jj
$$ 3 2 2 2 3 3 4 4 3 3 3 2 3 3 4 3 3 4 4 4 5 4 3 2 1 2 3 3 3 2 3 3 3 2 2 2 3 3 3 3 3 2 3 3 3 3 3 3 3 4 2 3 4 3 3 2 2 3 3 2 2 3 3 2 2 2 2 3 2 2 3 2
2412B%%J%jJJj%%%J%kJ%%%%%%j%J%%%j%%J%J%j%J%k%%J%jK%j%jKj%J%jJj%j%Kj%%%%%%%jJ
$$ 2 2 2 3 3 2 3 4 3 3 3 3 4 4 2 3 3 3 3 3 3 3 2 2 3 3 3 3 2 2 2 3 3 4 4 3 3 4 4 2 2 2 3 3 2 4 4 3 3 2 4 3 3 4 4 3 4 3 3 2 2 4 3 3 3 3 3 3 3 3 2 3
2405C%%%%jJj%%%%%Kjj%J%%%J%j%%%%%JjJ%j%%%%%%%JjjjJJJ%%%jjJ%j%%Jj%%%J%%Jj%%%j
$$ 3 3 3 3 3 2 3 2 2 2 2 2 2 4 3 2 2 3 3 3 3 4 4 3 3 3 3 3 3 4 3 4 4 3 3 3 3 3 3 3 3 4 3 2 1 2 3 4 4 4 4 3 2 3 3 2 2 2 3 2 2 2 2 3 3 3 4 3 3 3 3 2
2399B%%Jj%JjK%%j%%JkJ%jJKk%%j%%J%J%j%Jj%Jjj%J%j%Kj%%j%%%JjJ%jJ%%%%%%%%%%%J%%
$$ 2 2 2 3 2 2 3 2 4 4 4 3 3 3 4 2 3 3 2 3 5 3 3 3 2 2 2 3 3 4 4 3 3 4 3 3 4 3 2 2 3 3 2 2 4 3 3 3 2 2 2 2 3 2 3 3 2 3 3 3 3 3 3 3 3 3 3 3 3 4 4 4
2392D%j%j%J%jJ%%Jj%jj%%jLJj%jj%JJj%%J%%%Jk%%%J%%%JjJ%%j%%%%j%K%%jJ%jj%%%%J%%
$$ 4 4 3 3 2 2 3 3 2 3 3 3 4 3 3 2 1 1 1 0 3 4 3 3 2 1 1 2 3 2 2 2 3 3 3 3 4 2 2 2 2 3 3 3 3 4 3 4 4 4 3 3 3 3 3 2 2 4 4 4 3 4 4 3 2 2 2 2 2 3 3 3
2386Cj%J%J%j%Kk%j%JjJ%%%%%%J%j%j%J%%%jJjjJJ%JjK%j%jJjj%J%J%jjjJJ%%%%%%%jJ%%%
$$ 3 2 2 3 3 4 4 3 3 5 3 3 2 2 3 2 3 3 3 3 3 3 3 4 4 3 3 2 2 3 3 3 3 2 3 2 1 2 3 3 4 3 5 5 4 4 3 4 3 2 2 3 3 4 4 3 2 1 2 3 3 3 3 3 3 3 3 2 3 3 3 3
2380C%%%%%%%jJ%%%%Jj%j%J%j%J%%j%j%JJ%%%%%%%%%J%%%JjjjJ%%j%%%%J%jJ%%J%j%j%%Jj
$$ 3 3 3 3 3 3 3 3 2 3 3 3 3 3 4 3 3 2 2 3 3 2 2 3 3 3 2 2 1 1 2 3 3 3 3 3 3 3 3 3 3 4 4 4 4 5 4 3 2 3 3 3 2 2 2 2 2 3 3 2 3 3 3 4 4 3 3 2 2 2 3 2
2373BJ%jJjJ%%Jjj%%%J%jjK%Jjj%%%JJj%%jKj%J%jJ%J%kj%%%J%%Jjj%J%%j%%%JJjj%J%%%J
$$ 2 3 3 2 3 2 3 3 3 4 3 2 2 2 2 3 3 2 1 3 3 4 3 2 2 2 2 3 4 3 3 3 2 4 3 3 4 4 3 4 4 5 5 3 2 2 2 2 3 3 3 4 3 2 2 3 3 3 2 2 2 2 3 4 3 2 2 3 3 3 3 4
2367Dj%%%%%%%%Jj%%J%jJjj%%J%%j%Kj%JJjk%%%J%%%jJ%j%%%J%%j%%%K%%%j%j%J%jJ%Jjj%
$$ 4 3 3 3 3 3 3 3 3 3 4 3 3 3 4 4 3 4 3 2 2 2 3 3 3 2 2 4 3 3 4 5 4 2 2 2 2 3 3 3 3 2 3 3 2 2 2 2 3 3 3 2 2 2 2 4 4 4 4 3 3 2 2 3 3 2 3 3 4 3 2 2
2360BJ%%%J%%j%Kk%%j%%%%JJ%%j%%%jjJ%%%K%%%j%%%%%%%j%%J%%jJjJ%jj%JJj%JJjjJ%%jJ
$$ 2 3 3 3 3 4 4 4 3 3 5 3 3 3 2 2 2 2 2 3 4 4 4 3 3 3 3 2 1 2 2 2 2 4 4 4 4 3 3 3 3 3 3 3 3 2 2 2 3 3 3 2 3 2 3 3 2 1 1 2 3 2 2 3 4 3 2 3 3 3 2 3
2354C%%%%%jJjJ%J%%jj%jJJjJ%kJJjJjJj%JJ%%%j%jjKjjKJj%%%Jj%%Jj%%jJjJ%%%%jJ%jJ%
$$ 3 3 3 3 3 3 2 3 2 3 3 4 4 4 3 2 2 1 2 3 2 3 3 1 2 3 2 3 2 3 2 2 3 4 4 4 4 3 3 2 1 3 2 1 3 4 3 3 3 3 4 3 3 3 4 3 3 3 2 3 2 3 3 3 3 3 2 3 3 2 3 3
2347CJ%%j%Jj%%J%%jJ%j%%%jJJ%j%%Jj%%%%%%%%Jj%JjJ%%%k%J%jJJjjJjJj%%J%J%%%%%j%%
$$ 3 4 4 4 3 3 4 3 3 3 4 4 4 3 4 4 3 3 3 3 2 3 4 4 3 3 3 4 3 3 3 3 3 3 3 3 3 4 3 3 4 3 4 4 4 4 2 2 3 3 2 3 4 3 2 3 2 3 2 2 2 3 3 4 4 4 4 4 4 3 3 3
2341CjJj%Jjj%JkJ%J%%jK%%%%J%%jjJ%%%%j%%J%%%J%%j%%%JjJj%%%%%%jJ%j%JJjJ%%%j%%j
$$ 3 2 3 2 2 3 2 1 1 2 0 1 1 2 2 2 1 3 3 3 3 3 4 4 4 3 2 3 3 3 3 3 2 2 2 3 3 3 3 4 4 4 3 3 3 3 4 3 4 3 3 3 3 3 3 3 2 3 3 2 2 3 4 3 4 4 4 4 3 3 3 2
2334BJjJ%%%J%%%jJjjJJj%JjjJ%Jj%jjJJKk%%%J%%%k%J%%%%%%%%J%jJ%jj%J%J%jJJjj%J%j
$$ 2 3 2 3 3 3 3 4 4 4 4 3 4 3 2 3 4 3 3 4 3 2 3 3 4 3 3 2 1 2 3 5 3 3 3 3 4 4 4 4 2 2 3 3 3 3 3 3 3 3 3 4 4 3 4 4 3 2 2 3 3 4 4 3 4 5 4 3 3 4 4 3
2328Cj%J%j%%J%%%JJj%jjJjJ%%%%%%J%j%%Jj%j%%JJj%%Jjj%%K%%j%%%Kj%%jjJj%Kjj%%%Jj
$$ 3 2 2 3 3 2 2 2 3 3 3 3 4 5 4 4 3 2 3 2 3 3 3 3 3 3 3 4 4 3 3 3 4 3 3 2 2 2 3 4 3 3 3 4 3 2 2 2 4 4 4 3 3 3 3 5 4 4 4 3 2 3 2 2 4 3 2 2 2 2 3 2
2322B%J%j%%J%%j%J%%%J%jjJ%%%%%%%J%%%jjJ%J%jjJ%%jJ%%jJJjjJJjj%%%JJ%j%Jj%%Jj%%
$$ 2 2 3 3 2 2 2 3 3 3 2 2 3 3 3 3 4 4 3 2 3 3 3 3 3 3 3 3 4 4 4 4 3 2 3 3 4 4 3 2 3 3 3 2 3 3 3 2 3 4 3 2 3 4 3 2 2 2 2 3 4 4 3 3 4 3 3 3 4 3 3 3
2315CjJ%%J%%kJ%%%J%jj%JjJ%%k%K%%%jJ%%jJJ%j%%%%J%%%j%J%j%J%%j%%%J%%kJ%Jj%%%%J
$$ 3 2 3 3 3 4 4 4 2 3 3 3 3 4 4 3 2 2 3 2 3 3 3 1 1 3 3 3 3 2 3 3 3 2 3 4 4 3 3 3 3 3 4 4 4 4 3 3 4 4 3 3 4 4 4 3 3 3 3 4 4 4 2 3 3 4 3 3 3 3 3 4
2309D%%j%j%K%%%%%j%%%j%%JJj%%%%%jjK%jJ%%%%J%Jjj%j%J%jJj%Kjj%%J%%Jk%%%Jj%JJ%k
$$ 4 4 4 3 3 2 2 4 4 4 4 4 4 3 3 3 3 2 2 2 3 4 3 3 3 3 3 3 2 1 3 3 2 3 3 3 3 3 4 4 5 4 3 3 2 2 3 3 2 3 2 2 4 3 2 2 2 3 3 3 4 2 2 2 2 3 2 2 3 4 4 2
2302BJJj%kJJj%JjJ%%Jj%%%jJ%Jj%JjJJj%jjJ%%j%%J%j%%%JjJKjkJ%jK%jJjjJJ%j%%%%%j%
$$ 2 3 4 3 3 1 2 3 2 2 3 2 3 3 3 4 3 3 3 3 2 3 3 4 3 3 4 3 4 5 4 4 3 2 3 3 3 2 2 2 3 3 2 2 2 2 3 2 3 5 4 2 3 3 2 4 4 3 4 3 2 3 4 4 3 3 3 3 3 3 2 2
2296B%%%%%%%%%%%JJjj%%Jj%%J%%Jj%%%jj%JJJj%jJJkJ%j%%%JJj%%J%j%%%jJJ%kj%JJ%jJ%
$$ 2 2 2 2 2 2 2 2 2 2 2 2 3 4 3 2 2 2 3 2 2 2 3 3 3 4 3 3 3 3 2 1 1 2 3 4 3 3 2 3 4 2 3 3 2 2 2 2 3 4 3 3 3 4 4 3 3 3 3 2 3 4 4 2 1 1 2 3 3 2 3 3
2289CjJjJ%Jk%JJ%jJj%%J%jKj%j%jJJ%j%%%%%%JJj%%%%j%Jjj%JjJJ%jJ%jjJ%jJjjK%jJj%J
$$ 3 2 3 2 3 3 4 2 2 3 4 4 3 4 3 3 3 4 4 3 5 4 4 3 3 2 3 4 4 3 3 3 3 3 3 3 4 5 4 4 4 4 4 3 3 4 3 2 2 3 2 3 4 4 3 4 4 3 2 3 3 2 3 2 1 3 3 2 3 2 2 3
2283C%%j%%J%jJ%%%J%%%%jJj%%jJ%jJ%Jj%%%J%j%%jJ%%%j%K%jJjjJ%j%%%%%%J%j%%%JJj%%
$$ 3 3 3 2 2 2 3 3 2 3 3 3 3 4 4 4 4 4 3 4 3 3 3 2 3 3 2 3 3 4 3 3 3 3 4 4 3 3 3 2 3 3 3 3 2 2 4 4 3 4 3 2 3 3 2 2 2 2 2 2 2 3 3 2 2 2 2 3 4 3 3 3
2276C%%%jJjKk%J%j%JJjJ%j%%JJjjJ%%j%%%%%JkJ%%%%jJjJ%%%jK%%%j%%%%%jjJJj%Jj%%%J
$$ 3 3 3 3 2 3 2 4 2 2 3 3 2 2 3 4 3 4 4 3 3 3 4 5 4 3 4 4 4 3 3 3 3 3 3 4 2 3 3 3 3 3 2 3 2 3 3 3 3 2 4 4 4 4 3 3 3 3 3 3 2 1 2 3 2 2 3 2 2 2 2 3
2270C%j%%%%%%%%J%JjjJ%Jj%%%J%%%jJJjjjJJ%j%Jj%Jj%%%%%j%J%jJ%%j%%JJ%j%%jJ%%J%j
$$ 3 3 2 2 2 2 2 2 2 2 2 3 3 4 3 2 3 3 4 3 3 3 3 4 4 4 4 3 4 5 4 3 2 3 4 4 3 3 4 3 3 4 3 3 3 3 3 3 2 2 3 3 2 3 3 3 2 2 2 3 4 4 3 3 3 2 3 3 3 4 4 3
2264C%Jj%j%J%j%%JjJ%%jj%%%K%j%JJ%Jjj%%%%%j%%J%%Jjj%%%J%Jj%%%%%%%j%J%%jJ%jK%j
$$ 3 3 4 3 3 2 2 3 3 2 2 2 3 2 3 3 3 2 1 1 1 1 3 3 2 2 3 4 4 5 4 3 3 3 3 3 3 2 2 2 3 3 3 4 3 2 2 2 2 3 3 4 3 3 3 3 3 3 3 3 2 2 3 3 3 2 3 3 2 4 4 3
2257C%%%%Jj%%j%JJ%j%J%%%%kjKJjJjj%%%%JJj%%K%jj%%%%%%%%jJ%%%j%%J%%J%%%jjJjJ%J
$$ 3 3 3 3 3 4 3 3 3 2 2 3 4 4 3 3 4 4 4 4 4 2 1 3 4 3 4 3 2 2 2 2 2 3 4 3 3 3 5 5 4 3 3 3 3 3 3 3 3 3 2 3 3 3 3 2 2 2 3 3 3 4 4 4 4 3 2 3 2 3 3 4
2251Dj%Jj%%Jj%%%JJkkJJ%%%%%%%%JjjJJj%jKjJ%j%%%%%%%jJJjJj%%jJj%%JJj%jJ%jJJ%j%
$$ 4 3 3 4 3 3 3 4 3 3 3 3 4 5 3 1 2 3 3 3 3 3 3 3 3 3 4 3 2 3 4 3 3 2 4 3 4 4 3 3 3 3 3 3 3 3 2 3 4 3 4 3 3 3 2 3 2 2 2 3 4 3 3 2 3 3 2 3 4 4 3 3
2244C%%%%%%%%%J%j%%J%JkjJjjKjJ%j%%J%%J%%kJ%%J%jJjjK%%jJj%J%Jk%J%%jJJjjJ%%%j%
$$ 3 3 3 3 3 3 3 3 3 3 4 4 3 3 3 4 4 5 3 2 3 2 1 3 2 3 3 2 2 2 3 3 3 4 4 4 2 3 3 3 4 4 3 4 3 2 4 4 4 3 4 3 3 4 4 5 3 3 4 4 4 3 4 5 4 3 4 4 4 4 3 3
2238CJ%jJ%%%JjjJ%%j%Jj%%%jJJj%Jj%j%%Jj%J%jJJ%%j%%%%J%j%%Jk%Jj%%K%%j%%%JjjjJJ
$$ 3 4 4 3 4 4 4 4 5 4 3 4 4 4 3 3 4 3 3 3 3 2 3 4 3 3 4 3 3 2 2 2 3 2 2 3 3 2 3 4 4 4 3 3 3 3 3 4 4 3 3 3 4 2 2 3 2 2 2 4 4 4 3 3 3 3 4 3 2 1 2 3
2231CJjj%Jj%%%%%J%%%Jj%Jj%%%%J%%JK%kJ%%%kJJjjJ%%%j%k%K%jJ%j%%%%%%%%Jj%%JjjJ%
$$ 3 4 3 2 2 3 2 2 2 2 2 2 3 3 3 3 4 3 3 4 3 3 3 3 3 4 4 4 5 7 7 5 6 6 6 6 4 5 6 5 4 5 5 5 5 4 4 2 2 4 4 3 4 4 3 3 3 3 3 3 3 3 3 4 3 3 3 4 3 2 3 3
2225C%jJ%J%j%%%%J%%%%%jJ%j%jJ%jJ%%%%jJK%jjj%%J%%%%%%J%%%jjJ%%%j%J%Jj%%%kjK%%
$$ 3 3 2 3 3 4 4 3 3 3 3 3 4 4 4 4 4 4 3 4 4 3 3 2 3 3 2 3 3 3 3 3 2 3 5 5 4 3 2 2 2 3 3 3 3 3 3 3 4 4 4 4 3 2 3 3 3 3 2 2 3 3 4 3 3 3 3 1 0 2 2 2
2218B%%J%%jJ%%%%jJjJJjJJjj%%j%%J%jj%JJ%Jjj%%J%j%J%%%%%%%%jJ%%J%jjjJJjj%J%J%J
$$ 2 2 2 3 3 3 2 3 3 3 3 3 2 3 2 3 4 3 4 5 4 3 3 3 2 2 2 3 3 2 1 1 2 3 3 4 3 2 2 2 3 3 2 2 3 3 3 3 3 3 3 3 3 2 3 3 3 4 4 3 2 1 2 3 2 1 1 2 2 3 3 4
2212D%j%j%J%%j%J%%%J%Jj%%%j%%%%%%%J%Jjj%%Jj%%j%JJ%j%%jjJ%JjJ%%Jj%jJ%%%%j%%%%
$$ 4 4 3 3 2 2 3 3 3 2 2 3 3 3 3 4 4 5 4 4 4 4 3 3 3 3 3 3 3 3 4 4 5 4 3 3 3 4 3 3 3 2 2 3 4 4 3 3 3 2 1 2 2 3 2 3 3 3 4 3 3 2 3 3 3 3 3 2 2 2 2 2
2205B%J%Jj%%%%%%%%%%J%%%jJJ%j%j%J%J%%jjJ%J%K%%j%KJjJkj%k%%%J%j%Jj%%%%j%%%%Jj
$$ 2 2 3 3 4 3 3 3 3 3 3 3 3 3 3 3 4 4 4 4 3 4 5 5 4 4 3 3 4 4 5 5 5 4 3 4 4 5 5 7 7 7 6 6 8 9 8 9 7 6 6 4 4 4 4 5 5 4 4 5 4 4 4 4 4 3 3 3 3 3 4 3
2199CJ%%%j%jJ%JJjjJ%J%j%%%%jJ%%j%%%Jj%%Jj%J%%j%%%Kj%%%%%Jk%Jk%Jj%J%J%j%%%%jJ
$$ 3 4 4 4 4 3 3 2 3 3 4 5 4 3 4 4 5 5 4 4 4 4 4 3 4 4 4 3 3 3 3 4 3 3 3 4 3 3 4 4 4 3 3 3 3 5 4 4 4 4 4 4 5 3 3 4 2 2 3 2 2 3 3 4 4 3 3 3 3 3 2 3
2193C%J%kJJJj%%%j%%%%J%%jjJ%%%%J%%%jJ%%jJ%%j%JJ%j%J%%%%%j%JJ%jjJJ%%Jj%JJ%%%%
$$ 3 3 4 4 2 3 4 5 4 4 4 4 3 3 3 3 3 4 4 4 3 2 3 3 3 3 3 4 4 4 4 3 4 4 4 3 4 4 4 3 3 4 5 5 4 4 5 5 5 5 5 5 4 4 5 6 6 5 4 5 6 6 6 7 6 6 7 8 8 8 8 8
2186HJ%%%J%kJ%%J%J%KJJKKMLNOPRQQONKkmppqrpoomkklj%jjkk%jkJ%J%jjJJ%jjJ%%%JjjJ
$$ 8 9 9 9 9 10 10 8 9 9 9 10 10 11 11 13 14 15 17 19 23 26 31 37 44 53 61 69 75 80 82 80 76 69 62 54 45 38 32 26 22 20 18 15 14 14 13 12 10 8 8 7 5 6 6 7 7 6 5 6 7 7 6 5 6 6 6 6 7 6 5 6
2180FjJJ%j%%%%jJ%%%%%%Jj%%%%%%J%jJ%%%J%JjJ%J%KJKKLNNPQRRJ0J1NMkoqj1j1rrqmmlk
$$ 6 5 6 7 7 6 6 6 6 6 5 6 6 6 6 6 6 6 7 6 6 6 6 6 6 6 7 7 6 7 7 7 7 8 8 9 8 9 9 10 10 12 13 15 17 20 25 30 37 45 54 63 73 84 89 93 91 85 77 66 55 46 37 29 25 21 18 16
2174A6kkjjj%jJjj%j%J%jJjJj%jJ%%%jjJJjj%%J%%%jj%%J%%%%%%%%%%j%J%%j%j%%%%%%Jj%
$$ 16 14 12 11 10 9 9 8 9 8 7 7 6 6 7 7 6 7 6 7 6 6 5 6 6 6 6 5 4 5 6 5 4 4 4 5 5 5 5 4 3 3 3 4 4 4 4 4 4 4 4 4 4 4 3 3 4 4 4 3 3 2 2 2 2 2 2 2 3 2 2
2167BJ%%J%%jJj%j%%%%JJjJ%%j%j%%KJjJ%k%%%%%j%JJj%%JjJj%%%%%%jK%jJJkJj%J%J%j%%
$$ 2 3 3 3 4 4 4 3 4 3 3 2 2 2 2 2 3 4 3 4 4 4 3 3 2 2 2 4 5 4 5 5 3 3 3 3 3 3 2 2 3 4 3 3 3 4 3 4 3 3 3 3 3 3 3 2 4 4 3 4 5 3 4 3 3 4 4 5 5 4 4 4
2161D%J%j%%%%%%%%%%%%J%jJ%%%j%JjJJ%%%%%J%j%J%J%%KKJLLNNMKKjmnnmmjjjjjJ%L%KLK
$$ 4 4 5 5 4 4 4 4 4 4 4 4 4 4 4 4 4 5 5 4 5 5 5 5 4 4 5 4 5 6 6 6 6 6 6 7 7 6 6 7 7 8 8 8 10 12 13 16 19 24 29 33 35 37 36 32 27 22 18 14 13 12 11 10 9 10 10 13 13 15 18 20
2154B0LLLJJJjllklkkkjjj%%Jkj%JjkJ%jJj%jJ%%Jj%%%%%J%j%%JJjJj%%JJjJJ%jK%J%K%J%
$$ 20 23 26 29 30 31 32 31 28 25 23 20 18 16 14 13 12 11 11 11 12 10 9 9 10 9 7 8 8 7 8 7 7 6 7 7 7 8 7 7 7 7 7 7 8 8 7 7 7 8 9 8 9 8 8 8 9 10 9 10 11 11 10 12 12 13 13 15 15 16 16
2148A6JJJ%JJJJK%KKKLMMMPQJ1J5J7K2L0L8M9N7O3O3N6M3K0ol1n3o3o4o0n0m0l1k4k0j5j3
$$ 16 17 18 19 19 20 21 22 23 25 25 27 29 31 34 38 42 46 53 61 72 87 104 126 156 194 243 300 363 426 482 525 545 539 508 455 392 328 268 218 178 147 123 103 88 75
2144G5j0rqonlnjkk%jjj%%%j%jjkk%j%j%Jjjj%j%%%Jjjj%Jj%%J%jjJJj%%jj%%J%%jJj%j%%
$$ 75 65 56 48 42 37 34 29 28 26 24 24 23 22 21 21 21 21 20 20 19 18 16 14 14 13 13 12 12 13 12 11 10 10 9 9 9 9 10 9 8 7 7 8 7 7 7 8 8 7 6 7 8 7 7 7 6 5 5 5 6 6 6 5 6 5 5 4 4 4
2138D%J%j%jJJ%jJJj%%%%%%%J%%jJ%Jjj%J%JjJjJjJ%%%j%%Jk%%j%%Kj%jJj%jJ%%%%j%JjJ%
$$ 4 4 5 5 4 4 3 4 5 5 4 5 6 5 5 5 5 5 5 5 5 6 6 6 5 6 6 7 6 5 5 6 6 7 6 7 6 7 6 7 7 7 7 6 6 6 7 5 5 5 4 4 4 6 5 5 4 5 4 4 3 4 4 4 4 4 3 3 4 3 4 4
2131D%JjjJ%%%%j%%%%%J%%%%j%JJ%%%j%%%%%J%J%j%%jj%J%j%J%Jj%%j%Jj%jJ%J%JjjjK%Jj
$$ 4 4 5 4 3 4 4 4 4 4 3 3 3 3 3 3 4 4 4 4 4 3 3 4 5 5 5 5 4 4 4 4 4 4 5 5 6 6 5 5 5 4 3 3 4 4 3 3 4 4 5 4 4 4 3 3 4 3 3 2 3 3 4 4 5 4 3 2 4 4 5 4
2125D%%%%j%%%K%jJ%JjJJ%j%jJ%jK%%%jJ%Jjk%JJjj%KjjjJ%%J%jJ%%kK%%J%%%%%j%j%%%%J
$$ 4 4 4 4 4 3 3 3 3 5 5 4 5 5 6 5 6 7 7 6 6 5 6 6 5 7 7 7 7 6 7 7 8 7 5 5 6 7 6 5 5 7 6 5 4 5 5 5 6 6 5 6 6 6 4 6 6 6 7 7 7 7 7 7 6 6 5 5 5 5 5 6
2118Fjj%J%%J%j%%J%%JJjJjJ%JJ%jj%j%Jk%Jj%%%j%JJjJ%JJj%J%jjJ%jjJ%%J%j%%%%%Jj%K
$$ 6 5 4 4 5 5 5 6 6 5 5 5 6 6 6 7 8 7 8 7 8 8 9 10 10 9 8 8 7 7 8 6 6 7 6 6 6 6 5 5 6 7 6 7 7 8 9 8 8 9 9 8 7 8 8 7 6 7 7 7 8 8 7 7 7 7 7 7 8 7 7 9
2112Ijjj%KJ%jJJ%%jJ%%JJj%J%jJ%%%%%%jJ%%Jj%%J%JJj%%%K%k%%Kj%J%J%%%%JjjKj%%%KJ
$$ 9 8 7 6 6 8 9 9 8 9 10 10 10 9 10 10 10 11 12 11 11 12 12 11 12 12 12 12 12 12 12 11 12 12 12 13 12 12 12 13 13 14 15 14 14 14 14 16 16 14 14 14 16 15 15 16 16 17 17 17 17 17 18 17 16 18 17 17 17 17 19 20
2105B0%%KJjJ%%jJjk%k%kj%jJJ%jjJKJKKKKJJJjj%kJj%%JjJ%j%KJk%JjjJJKJKKLLLLKKLJ%
$$ 20 20 20 22 23 22 23 23 23 22 23 22 20 20 18 18 16 15 15 14 15 16 16 15 14 15 17 18 20 22 24 26 27 28 29 28 27 27 25 26 25 25 25 26 25 26 26 25 25 27 28 26 26 27 26 25 26 27 29 30 32 34 37 40 43 46 48 50 53 54 54
2099E4jJ%JKKKJKJLLLLKKLMOOOPQQNNMLNNNQJ2J5K0K3K6K9K8K6K3K0J8J7J8J9K0K0J9J9K1
$$ 54 53 54 54 55 57 59 61 62 64 65 68 71 74 77 79 81 84 88 94 100 106 113 121 129 134 139 143 146 151 156 161 169 181 196 216 239 265 294 322 348 371 391 409 426 444 463 483 503 522 541 562
2094E62K5L1M1N0O3P5R0J07J29J60J94K43L11M00N29P13R66J302J685K038K270K318K089J538
$$ 562 587 618 659 709 772 847 937 1044 1173 1333 1527 1770 2081 2481 3010 3723 4689 5991 7676 9714 11984 14302 16391 17929
2092A7929P40k01j147j903k349k450k235j833j413j062p97n97m54l48k73k17j74j44j15r6
$$ 17929 18669 18468 17321 15418 13069 10619 8384 6551 5138 4076 3279 2682 2228 1880 1607 1390 1216 1072 957 861
2090H61p9o5n3m3l3k5j9j3j2j1j3j6k0j9j8j5j3j3j4j6j8k2k2k1j8j6j4j3j1rrrqrpoopoo
$$ 861 782 717 664 621 588 563 544 531 519 508 495 479 459 440 422 407 394 381 367 351 333 311 289 268 250 234 220 207 196 187 178 169 161 152 145 139 133 126 120 114
2087A14nnmkmllljkjllklklmkjk%JJJJK%Jjj%ljjkj%kj%JjJj%jJJKJJLNLNNMKJjklnoolnm
$$ 114 109 104 100 98 94 91 88 85 84 82 81 78 75 73 70 68 65 61 59 58 56 56 57 58 59 60 62 62 63 62 61 61 58 57 56 54 53 53 51 50 50 51 50 51 50 50 49 50 51 53 54 55 58 63 66 71 76 80 82 83 82 80 77 72 66 60 57 52 48
2080D8llllmkkll%j%%J%%j%j%j%%%%%jjjJjK%k%jJ%%%Jj%j%%%jJ%jJ%j%%j%J%j%JkJ%jK%%
$$ 48 45 42 39 36 32 30 28 25 22 22 21 21 21 22 22 22 21 21 20 20 19 19 19 19 19 19 18 17 16 17 16 18 18 16 16 15 16 16 16 16 17 16 16 15 15 15 15 14 15 15 14 15 15 14 14 14 13 13 14 14 13 13 14 12 13 13 12 14 14 14
2074A4jJ%%jJJ%%%%Jj%Jj%%kJ%%%j%Jj%%J%%%jJ%j%J%jkj%%J%%jJJ%%%%%%%jjjjJ%jjJ%Jj
$$ 14 13 14 14 14 13 14 15 15 15 15 15 16 15 15 16 15 15 15 13 14 14 14 14 13 13 14 13 13 13 14 14 14 14 13 14 14 13 13 14 14 13 11 10 10 10 11 11 11 10 11 12 12 12 12 12 12 12 12 11 10 9 8 9 9 8 7 8 8 9 8
2068H%JJj%%%%J%%JJj%%j%%%J%%Jj%j%k%J%jJ%Jj%%%%jJ%%j%%%%%%Jj%JKJ%KLLJ%Jjk%ml%
$$ 8 8 9 10 9 9 9 9 9 10 10 10 11 12 11 11 11 10 10 10 10 11 11 11 12 11 11 10 10 8 8 9 9 8 9 9 10 9 9 9 9 9 8 9 9 9 8 8 8 8 8 8 8 9 8 8 9 11 12 12 14 17 20 21 21 22 21 19 19 15 12 12
2061A2jk%%%J%%%j%JK%%%j%Jj%%j%%j%%%j%J%Jj%jjJKjj%%%%%j%j%J%%Jj%%%J%Jjj%J%%%%
$$ 12 11 9 9 9 9 10 10 10 10 9 9 10 12 12 12 12 11 11 12 11 11 11 10 10 10 9 9 9 9 8 8 9 9 10 9 9 8 7 8 10 9 8 8 8 8 8 8 7 7 6 6 7 7 7 8 7 7 7 7 8 8 9 8 7 7 8 8 8 8 8
2055H%%%kJ%%%%Jj%%j%%Jj%%Jj%%%%JjJJj%%%%%j%JJ%j%J%%KKjJ%j%kj%j%JjJ%jj%%%%j%J
$$ 8 8 8 8 6 7 7 7 7 7 8 7 7 7 6 6 6 7 6 6 6 7 6 6 6 6 6 7 6 7 8 7 7 7 7 7 7 6 6 7 8 8 7 7 8 8 8 10 12 11 12 12 11 11 9 8 8 7 7 8 7 8 8 7 6 6 6 6 6 5 5 6
2049FjJ%jJ%jJ%JJjj%Kj%%%J%J%j%j%%j%%jjJJ%j%J%Jj%%%%J%j%j%%%Jj%%%%%%%%Jj%%%%J
$$ 6 5 6 6 5 6 6 5 6 6 7 8 7 6 6 8 7 7 7 7 8 8 9 9 8 8 7 7 7 6 6 6 5 4 5 6 6 5 5 6 6 7 6 6 6 6 6 7 7 6 6 5 5 5 5 6 5 5 5 5 5 5 5 5 5 6 5 5 5 5 5 6
2042F%JJk%Jj%%%%%%j%jKjJj%%%%%j%%Kjj%Jj%%J%j%J%%%%%%%%%%%jKj%%%%J%%%%j%%%%%J
$$ 6 6 7 8 6 6 7 6 6 6 6 6 6 6 5 5 4 6 5 6 5 5 5 5 5 5 4 4 4 6 5 4 4 5 4 4 4 5 5 4 4 5 5 5 5 5 5 5 5 5 5 5 5 4 6 5 5 5 5 5 6 6 6 6 6 5 5 5 5 5 5 6
2036Fj%Jj%J%jKj%%j%%j%J%%jJj%J%J%jJ%j%JJkjK%j%j%jJ%J%j%JK%jj%Jj%%%%%Jj%%Jj%%
$$ 6 5 5 6 5 5 6 6 5 7 6 6 6 5 5 5 4 4 5 5 5 4 5 4 4 5 5 6 6 5 6 6 5 5 6 7 5 4 6 6 5 5 4 4 3 4 4 5 5 4 4 5 7 7 6 5 5 6 5 5 5 5 5 5 6 5 5 5 6 5 5 5
2029E%J%%%%%j%jJ%%%jJ%J%j%%%k%JJ%j%J%%%%JjJ%kJ%jJ%Jj%%%%J%%j%%%%%%%%j%J%%jJj
$$ 5 5 6 6 6 6 6 6 5 5 4 5 5 5 5 4 5 5 6 6 5 5 5 5 3 3 4 5 5 4 4 5 5 5 5 5 6 5 6 6 4 5 5 4 5 5 6 5 5 5 5 5 6 6 6 5 5 5 5 5 5 5 5 5 4 4 5 5 5 4 5 4
2023D%%JJjj%Jj%%J%%jJJ%%%%j%J%jJ%kJj%%Kjj%K%j%%%%%kK%j%J%jJ%%%J%%j%%j%K%j%%%
$$ 4 4 4 5 6 5 4 4 5 4 4 4 5 5 5 4 5 6 6 6 6 6 5 5 6 6 5 6 6 4 5 4 4 4 6 5 4 4 6 6 5 5 5 5 5 5 3 5 5 4 4 5 5 4 5 5 5 5 6 6 6 5 5 5 4 4 6 6 5 5 5 5
2016E%%%%%%j%jJ%JJ%%%%jJj%%jJj%%%J%%J%jj%J%%%%%J%j%J%%%%%Jj%%%jJJj%JjJjjKKjj
$$ 5 5 5 5 5 5 5 4 4 3 4 4 5 6 6 6 6 6 5 6 5 5 5 4 5 4 4 4 4 5 5 5 6 6 5 4 4 5 5 5 5 5 5 6 6 5 5 6 6 6 6 6 6 7 6 6 6 6 5 6 7 6 6 7 6 7 6 5 7 9 8 7
2010G%J%J%%JJ%jJKKKKMLMOQRJ1J1J0OMjnqj1j1j0ronolmjjjjk%J%kj%J%%%jK%J%%JK%%J%
$$ 7 7 8 8 9 9 9 10 11 11 10 11 13 15 17 19 23 26 30 36 44 53 64 75 85 91 95 94 89 81 70 59 49 40 34 29 23 20 16 15 14 13 12 10 10 11 11 9 8 8 9 9 9 9 8 10 10 11 11 11 12 14 14 14 15 15
2004A5%%jkjkj%%jJj%jJjjJ%jJ%%%%%%jjJ%%%k%%JJJjj%J%j%%%%%Kj%%j%%JjJjj%JJ%jJJj
$$ 15 15 15 14 12 11 9 8 8 8 7 8 7 7 6 7 6 5 6 6 5 6 6 6 6 6 6 6 5 4 5 5 5 5 3 3 3 4 5 6 5 4 4 5 5 4 4 4 4 4 4 6 5 5 5 4 4 4 5 4 5 4 3 3 4 5 5 4 5 6 5
1998E%Jjj%%%J%Jk%%%J%%%jJJ%kJjKjjjJ%jJ%%%%Jj%j%J%jJJjJj%Jj%%j%JJ%%Jj%%Jj%kJ%
$$ 5 5 6 5 4 4 4 4 5 5 6 4 4 4 4 5 5 5 5 4 5 6 6 4 5 4 6 5 4 3 4 4 3 4 4 4 4 4 5 4 4 3 3 4 4 3 4 5 4 5 4 4 5 4 4 4 3 3 4 5 5 5 6 5 5 5 6 5 5 3 4 4
1991D%%Jjj%%J%%%%jJJj%%jJJ%j%jJ%%J%j%%%%%%%jJ%%jJ%%J%%%jjJJ%%%Jj%j%J%%%%%%%j
$$ 4 4 4 5 4 3 3 3 4 4 4 4 4 3 4 5 4 4 4 3 4 5 5 4 4 3 4 4 4 5 5 4 4 4 4 4 4 4 4 3 4 4 4 3 4 4 4 5 5 5 5 4 3 4 5 5 5 5 6 5 5 4 4 5 5 5 5 5 5 5 5 4
1985D%JjjKj%K%%%jjjJ%J%%%J%J%j%K%jJ%jjjj%J%%%J%jjJjJ%%%j%%%%%jJ%Jj%%%J%%%%%%
$$ 4 4 5 4 3 5 4 4 6 6 6 6 5 4 3 4 4 5 5 5 5 6 6 7 7 6 6 8 8 7 8 8 7 6 5 4 4 5 5 5 5 6 6 5 4 5 4 5 5 5 5 4 4 4 4 4 4 3 4 4 5 4 4 4 4 5 5 5 5 5 5 5
1978Ej%jJJ%j%%%JjkK%%%Jj%J%j%%%%%%%J%%j%%%J%%k%%J%Jj%j%J%J%%%%%j%%%j%jJJ%J%j
$$ 5 4 4 3 4 5 5 4 4 4 4 5 4 2 4 4 4 4 5 4 4 5 5 4 4 4 4 4 4 4 4 5 5 5 4 4 4 4 5 5 5 3 3 3 4 4 5 4 4 3 3 4 4 5 5 5 5 5 5 4 4 4 4 3 3 2 3 4 4 5 5 4
1972D%%%Jjj%%K%k%JkjJJ%JJ%jJj%%%%%JjJ%%j%JJ%%j%%J%%j%Jk%%%j%%JJ%jJ%jjJJ%jjJ%
$$ 4 4 4 4 5 4 3 3 3 5 5 3 3 4 2 1 2 3 3 4 5 5 4 5 4 4 4 4 4 4 5 4 5 5 5 4 4 5 6 6 6 5 5 5 6 6 6 5 5 6 4 4 4 4 3 3 3 4 5 5 4 5 5 4 3 4 5 5 4 3 4 4
1965DJ%%%jjJJ%jJ%%%jJ%jJjJJj%jJJ%J%j%jJ%%jJJj%J%jj%j%jJ%%%JJ%J%JJJKKKLMLNKLj
$$ 4 5 5 5 5 4 3 4 5 5 4 5 5 5 5 4 5 5 4 5 4 5 6 5 5 4 5 6 6 7 7 6 6 5 6 6 6 5 6 7 6 6 7 7 6 5 5 4 4 3 4 4 4 4 5 6 6 7 7 8 9 10 12 14 16 19 23 26 31 33 36 35
1959C5llnlmljkkjJjj%j%jJj%Jjj%JjJjJJ%jjJ%j%%jJj%%JJ%%%j%%J%j%%%%%K%%jj%%JJj%
$$ 35 32 29 24 21 17 14 13 11 9 8 9 8 7 7 6 6 5 6 5 5 6 5 4 4 5 4 5 4 5 6 6 5 4 5 5 4 4 4 3 4 3 3 3 4 5 5 5 5 4 4 4 5 5 4 4 4 4 4 4 6 6 6 5 4 4 4 5 6 5 5
1953E%%jJjkJJJ%%j%J%%%%JjjJj%J%jJkJjJ%%%Jj%%%J%%%j%%J%%jjJ%%%%%%%%j%J%%%J%jj
$$ 5 5 5 4 5 4 2 3 4 5 5 5 4 4 5 5 5 5 5 6 5 4 5 4 4 5 5 4 5 3 4 3 4 4 4 4 5 4 4 4 4 5 5 5 5 4 4 4 5 5 5 4 3 4 4 4 4 4 4 4 4 4 3 3 4 4 4 4 5 5 4 3
1946CJjJ%%j%%J%%jJ%%jKjjJ%%j%%%Jj%Jj%%J%%%%jJ%%%jJjJ%%J%j%%%J%jjJjJ%%%JJ%kJ%
$$ 3 4 3 4 4 4 3 3 3 4 4 4 3 4 4 4 3 5 4 3 4 4 4 3 3 3 3 4 3 3 4 3 3 3 4 4 4 4 4 3 4 4 4 4 3 4 3 4 4 4 5 5 4 4 4 4 5 5 4 3 4 3 4 4 4 4 5 6 6 4 5 5
1940E%j%%Jj%%%%%KjkJJjJ%j%%j%jKjJ%j%%JJjj%Kj%%%%%j%J%%%jJJjj%JJj%j%JJj%%%%j%
$$ 5 5 4 4 4 5 4 4 4 4 4 4 6 5 3 4 5 4 5 5 4 4 4 3 3 2 4 3 4 4 3 3 3 4 5 4 3 3 5 4 4 4 4 4 4 3 3 4 4 4 4 3 4 5 4 3 3 4 5 4 4 3 3 4 5 4 4 4 4 4 3 3
1933CJ%%%jjKJ%%j%j%%JJj%%%%%jK%%Jjj%%j%JJj%J%%%%%%%%%jJ%%%j%%J%j%%%%Jj%jJ%%%
$$ 3 4 4 4 4 3 2 4 5 5 5 4 4 3 3 3 4 5 4 4 4 4 4 4 3 5 5 5 6 5 4 4 4 3 3 4 5 4 4 5 5 5 5 5 5 5 5 5 5 4 5 5 5 5 4 4 4 5 5 4 4 4 4 4 5 4 4 3 4 4 4 4
1927DJ%%j%JjJ%j%%JjJ%%J%%jjJjJJ%%%jJk%%%%%%KJjj%j%J%%jJ%%%%%%%j%%j%J%%J%%Jk%
$$ 4 5 5 5 4 4 5 4 5 5 4 4 4 5 4 5 5 5 6 6 6 5 4 5 4 5 6 6 6 6 5 6 4 4 4 4 4 4 4 6 7 6 5 5 4 4 5 5 5 4 5 5 5 5 5 5 5 5 4 4 4 3 3 4 4 4 5 5 5 6 4 4
1920D%%%%%%JjJ%%%j%%%%%jJJj%%%%%%jK%%%j%K%jj%Jj%jJ%J%jj%J%jJ%J%%jjJ%%%jJ%%%%
$$ 4 4 4 4 4 4 4 5 4 5 5 5 5 4 4 4 4 4 4 3 4 5 4 4 4 4 4 4 4 3 5 5 5 5 4 4 6 6 5 4 4 5 4 4 3 4 4 5 5 4 3 3 4 4 3 4 4 5 5 5 4 3 4 4 4 4 3 4 4 4 4 4
1914DJj%jJJj%%%J%%jjJ%%%%%j%%JJ%%j%J%jjJ%Jjj%Jj%%%J%%Kjj%%J%jJJjjjK%JJj%%%%%
$$ 4 5 4 4 3 4 5 4 4 4 4 5 5 5 4 3 4 4 4 4 4 4 3 3 3 4 5 5 5 4 4 5 5 4 3 4 4 5 4 3 3 4 3 3 3 3 4 4 4 6 5 4 4 4 5 5 4 5 6 5 4 3 5 5 6 7 6 6 6 6 6 6
1907FjJjj%JJJj%JjJJ%%j%j%JJj%K%JjJJJ%Jj%KJKJJKJjKj%jj%%%jJJJJJKKLLNNORJ0J5J8
$$ 6 5 6 5 4 4 5 6 7 6 6 7 6 7 8 8 8 7 7 6 6 7 8 7 7 9 9 10 9 10 11 12 12 13 12 12 14 15 17 18 19 21 22 21 23 22 22 21 20 20 20 20 19 20 21 22 23 24 26 28 31 34 39 44 50 59 69 84 102
1901A02K5L6M9O6Q1Q7Q5P1M2jm9q7j03r5p5n5l9k9k0j5j4j0ponmkkkkjjj%lj%J%%%k%J%%%
$$ 102 127 163 212 278 359 446 531 602 644 643 594 507 404 309 234 179 140 111 91 76 62 52 45 39 34 30 28 26 24 22 21 20 19 19 16 15 15 16 16 16 16 14 14 15 15 15 15
1897A5kk%Kjjk%%k%JJJ%jj%%j%%%jJ%jJjj%%%%%J%%Jj%k%KJ%%j%j%JjJ%%%%j%%%%%%Jj%j%
$$ 15 13 11 11 13 12 11 9 9 9 7 7 8 9 10 10 9 8 8 8 7 7 7 7 6 7 7 6 7 6 5 5 5 5 5 5 6 6 6 7 6 6 4 4 6 7 7 7 6 6 5 5 6 5 6 6 6 6 6 5 5 5 5 5 5 5 6 5 5 4 4
1891D%Jj%%%Jj%jJ%%jJJj%JJ%jjJjJ%%j%%%%J%j%J%%j%JJjj%%%%J%%j%Jjj%%J%J%%j%jJj%
$$ 4 4 5 4 4 4 4 5 4 4 3 4 4 4 3 4 5 4 4 5 6 6 5 4 5 4 5 5 5 4 4 4 4 4 5 5 4 4 5 5 5 4 4 5 6 5 4 4 4 4 4 5 5 5 4 4 5 4 3 3 3 4 4 5 5 5 4 4 3 4 3 3
1884CJ%%j%J%%%%jKjj%%%JjJJj%%%%jJ%JJjjJ%j%jJJj%%%JjjJjJJjjJ%%%%jJJj%jjJ%J%J%
$$ 3 4 4 4 3 3 4 4 4 4 4 3 5 4 3 3 3 3 4 3 4 5 4 4 4 4 4 3 4 4 5 6 5 4 5 5 4 4 3 4 5 4 4 4 4 5 4 3 4 3 4 5 4 3 4 4 4 4 4 3 4 5 4 4 3 2 3 3 4 4 5 5
1878Ej%%JjjJ%%jJJj%J%%jj%JJjJJj%%jJ%%j%j%%J%%%Jjj%J%j%K%jJ%%jJ%Jjjj%JJ%jJj%J
$$ 5 4 4 4 5 4 3 4 4 4 3 4 5 4 4 5 5 5 4 3 3 4 5 4 5 6 5 5 5 4 5 5 5 4 4 3 3 3 4 4 4 4 5 4 3 3 4 4 3 3 5 5 4 5 5 5 4 5 5 6 5 4 3 3 4 5 5 4 5 4 4 5
1871EjJ%j%%%%jJJj%%J%jJ%%%j%%%J%j%j%K%j%JJ%%JjJjj%JjJ%jJ%K%JJKJLMNNMLJkjnmmm
$$ 5 4 5 5 4 4 4 4 4 3 4 5 4 4 4 5 5 4 5 5 5 5 4 4 4 4 5 5 4 4 3 3 5 5 4 4 5 6 6 6 7 6 7 6 5 5 6 5 6 6 5 6 6 8 8 9 10 12 13 16 20 25 30 34 37 38 36 35 30 26 22 18
1865A8mkkkJ%jj%J%Jjj%%j%%j%%%%%jjJ%J%jJ%%%JJjkJjJ%%j%%%J%%j%Jj%%%JjjjJJJjJ%j
$$ 18 14 12 10 8 9 9 8 7 7 8 8 9 8 7 7 7 6 6 6 5 5 5 5 5 5 4 3 4 4 5 5 4 5 5 5 5 6 7 6 4 5 4 5 5 5 4 4 4 4 5 5 5 4 4 5 4 4 4 4 5 4 3 2 3 4 5 4 5 5 4
1858Dj%JJ%%j%%%%j%JJJjj%%%jKjjJjJj%JJjJjjJj%%%%JJjjJ%JJk%%Jk%Kj%Jj%J%%j%%%%J
$$ 4 3 3 4 5 5 5 4 4 4 4 4 3 3 4 5 6 5 4 4 4 4 3 5 4 3 4 3 4 3 3 4 5 4 5 4 3 4 3 3 3 3 3 4 5 4 3 4 4 5 6 4 4 4 5 3 3 5 4 4 5 4 4 5 5 5 4 4 4 4 4 5
1852Ejj%Kj%%j%J%%Jj%jJj%%%%Jj%J%Jj%jJ%j%J%Jj%J%%JjjJ%%%k%JjJjJJ%jj%J%%jK%%jj
$$ 5 4 3 3 5 4 4 4 3 3 4 4 4 5 4 4 3 4 3 3 3 3 3 4 3 3 4 4 5 4 4 3 4 4 3 3 4 4 5 4 4 5 5 5 6 5 4 5 5 5 5 3 3 4 3 4 3 4 5 5 4 3 3 4 4 4 3 5 5 5 4 3
1846CKJ%jj%%%%%%j%J%j%%j%J%%J%%j%%J%%%%%%%%%%j%J%%%%%J%%%%%%jJ%%%%%%jjJJ%%J%
$$ 3 5 6 6 5 4 4 4 4 4 4 4 3 3 4 4 3 3 3 2 2 3 3 3 4 4 4 3 3 3 4 4 4 4 4 4 4 4 4 4 4 3 3 4 4 4 4 4 4 5 5 5 5 5 5 5 4 5 5 5 5 5 5 5 4 3 4 5 5 5 6 6
1839Fk%%%%%%%J%j%J%j%%%%%%jJ%J%%j%%%%%jJ%Jjj%%JJjjJ%Jjj%J%%%J%kjJJ%jJjJ%J%%%
$$ 6 4 4 4 4 4 4 4 4 5 5 4 4 5 5 4 4 4 4 4 4 4 3 4 4 5 5 5 4 4 4 4 4 4 3 4 4 5 4 3 3 3 4 5 4 3 4 4 5 4 3 3 4 4 4 4 5 5 3 2 3 4 4 3 4 3 4 4 5 5 5 5
1833Ej%jK%j%%%J%%%jjJ%%J%k%JjjJ%%Kj%%JjJ%j%Jj%%Jj%%jJ%jJJjJ%jJ%Jj%j%%%J%%Jjj
$$ 5 4 4 3 5 5 4 4 4 4 5 5 5 5 4 3 4 4 4 5 5 3 3 4 3 2 3 3 3 5 4 4 4 5 4 5 5 4 4 5 4 4 4 5 4 4 4 3 4 4 3 4 5 4 5 5 4 5 5 6 5 5 4 4 4 4 5 5 5 6 5 4
1826D%%%Jjj%%%%%%J%%%%%%%%Kjj%JjJ%jjJ%%%%%%%%Jjj%JJ%%%k%%J%%%kJ%%%J%%jjJJ%%%
$$ 4 4 4 4 5 4 3 3 3 3 3 3 3 4 4 4 4 4 4 4 4 4 6 5 4 4 5 4 5 5 4 3 4 4 4 4 4 4 4 4 4 5 4 3 3 4 5 5 5 5 3 3 3 4 4 4 4 2 3 3 3 3 4 4 4 3 2 3 4 4 4 4
1820Dj%%JjJ%jJjJ%%Jj%%j%%JJ%j%J%%%%JJ%jJjJj%%%jjKjj%J%%%%%jJ%j%%%j%K%jjjJJjJ
$$ 4 3 3 3 4 3 4 4 3 4 3 4 4 4 5 4 4 4 3 3 3 4 5 5 4 4 5 5 5 5 5 6 7 7 6 7 6 7 6 6 6 6 5 4 6 5 4 4 5 5 5 5 5 5 4 5 5 4 4 4 4 3 3 5 5 4 3 2 3 4 3 4
1813D%%J%%%%%j%%%jJJ%j%%jJ%JjJj%j%JJ%%%j%JJj%j%%J%%j%%%%Jj%Jj%%%J%%%j%Jk%Kj%
$$ 4 4 4 5 5 5 5 5 5 4 4 4 4 3 4 5 5 4 4 4 3 4 4 5 4 5 4 4 3 3 4 5 5 5 5 4 4 5 6 5 5 4 4 4 5 5 5 4 4 4 4 4 5 4 4 5 4 4 4 4 5 5 5 5 4 4 5 3 3 5 4 4
1807DJ%%%j%%%%jJ%Jj%J%%j%%jKJkJ%%%kjK%%Jjj%%%J%%%%jJj%J%%%%%Jj%J%jj%%JJ%%jjJ
$$ 4 5 5 5 5 4 4 4 4 4 3 4 4 5 4 4 5 5 5 4 4 4 3 5 6 4 5 5 5 5 3 2 4 4 4 5 4 3 3 3 3 4 4 4 4 4 3 4 3 3 4 4 4 4 4 4 5 4 4 5 5 4 3 3 3 4 5 5 5 4 3 4
1800D%jKjjj%J%K%kJ%%J%%%J%l%%%J%j%%J%%Jjj%J%J%jJj%J%j%j%%J%%Jj%%%%%%%JjjJ%%J
$$ 4 4 3 5 4 3 2 2 3 3 5 5 3 4 4 4 5 5 5 5 6 6 3 3 3 3 4 4 3 3 3 4 4 4 5 4 3 3 4 4 5 5 4 5 4 4 5 5 4 4 3 3 3 4 4 4 5 4 4 4 4 4 4 4 4 5 4 3 4 4 4 5
1794Ej%%%%%%Jj%JjJ%%jj%J%j%J%%jK%%j%J%%%j%%j%JJkJ%%Kjj%%%JkjJJ%jJjKj%%%Kj%%%
$$ 5 4 4 4 4 4 4 4 5 4 4 5 4 5 5 5 4 3 3 4 4 3 3 4 4 4 3 5 5 5 4 4 5 5 5 5 4 4 4 3 3 4 5 3 4 4 4 6 5 4 4 4 4 5 3 2 3 4 4 3 4 3 5 4 4 4 4 6 5 5 5 5
1787E%%%%%kJ%%%JJj%j%%jJ%J%jJ%j%Jj%%jJkKJj%%JjJjJ%%Jjjj%%JJ%J%j%%%%j%%Jj%%jJ
$$ 5 5 5 5 5 5 3 4 4 4 4 5 6 5 5 4 4 4 3 4 4 5 5 4 5 5 4 4 5 4 4 4 3 4 2 4 5 4 4 4 5 4 5 4 5 5 5 6 5 4 3 3 3 4 5 5 6 6 5 5 5 5 5 4 4 4 5 4 4 4 3 4
1781D%%J%%%%j%%%%J%jJ%jJj%j%%J%%%Jjj%J%%jJ%%JJjj%%%%%Jj%%%jJ%%jJ%%%%jJ%j%Jjj
$$ 4 4 4 5 5 5 5 5 4 4 4 4 4 5 5 4 5 5 4 5 4 4 3 3 3 4 4 4 4 5 4 3 3 4 4 4 3 4 4 4 5 6 5 4 4 4 4 4 4 5 4 4 4 4 3 4 4 4 3 4 4 4 4 4 3 4 4 3 3 4 3 2
1775BJ%JJ%jJ%j%j%%JJ%j%%%jK%%j%%%%%%%%%%j%jJ%Jk%K%j%%J%%%%%%%%%%Jj%%J%j%%jJj
$$ 2 3 3 4 5 5 4 5 5 4 4 3 3 3 4 5 5 4 4 4 4 3 5 5 5 4 4 4 4 4 4 4 4 4 4 4 3 3 2 3 3 4 2 2 4 4 3 3 3 4 4 4 4 4 4 4 4 4 4 4 5 4 4 4 5 5 4 4 4 3 4 3
1768C%J%%jJ%%%J%%%jJK%jj%%%kJ%%jJ%jJ%%%%%%%Jjj%jJJ%j%Jj%%%K%jJ%%%%jj%J%Jj%%%
$$ 3 3 4 4 4 3 4 4 4 4 5 5 5 5 4 5 7 7 6 5 5 5 5 3 4 4 4 3 4 4 3 4 4 4 4 4 4 4 4 5 4 3 3 2 3 4 4 3 3 4 3 3 3 3 5 5 4 5 5 5 5 5 4 3 3 4 4 5 4 4 4 4
1762DJj%j%JJj%jJJ%jJJjjj%J%J%%jjJjJ%JjJ%%jjJ%J%J%j%j%jJJj%%%%%j%%J%JjJj%%%%j
$$ 4 5 4 4 3 3 4 5 4 4 3 4 5 5 4 5 6 5 4 3 3 4 4 5 5 5 4 3 4 3 4 4 5 4 5 5 5 4 3 4 4 5 5 6 6 5 5 4 4 3 4 5 4 4 4 4 4 4 3 3 3 4 4 5 4 5 4 4 4 4 4 3
1755CJ%%%%J%j%%%J%%%%%j%jJ%%%%%jJ%%%%%%%%j%J%%%j%J%J%jJ%j%j%J%%%jK%jJJjjjJ%J
$$ 3 4 4 4 4 4 5 5 4 4 4 4 5 5 5 5 5 5 4 4 3 4 4 4 4 4 4 3 4 4 4 4 4 4 4 4 4 3 3 4 4 4 4 3 3 4 4 5 5 4 5 5 4 4 3 3 4 4 4 4 3 5 5 4 5 6 5 4 3 4 4 5
1749E%%j%jJ%%J%%%jJj%%%%J%j%%J%%%jJ%%%jj%%%J%jJjKjjJ%%%J%jJjj%J%%%%%%J%%%j%%
$$ 5 5 5 4 4 3 4 4 4 5 5 5 5 4 5 4 4 4 4 4 5 5 4 4 4 5 5 5 5 4 5 5 5 5 4 3 3 3 3 4 4 3 4 3 5 4 3 4 4 4 4 5 5 4 5 4 3 3 4 4 4 4 4 4 4 5 5 5 5 4 4 4
1742D%j%jJ%%J%%j%%%%%J%%%jJj%%J%J%j%%%Jj%%j%J%%Jj%%%%%j%J%J%%j%Jj%J%kJ%%%J%%
$$ 4 4 3 3 2 3 3 3 4 4 4 3 3 3 3 3 3 4 4 4 4 3 4 3 3 3 4 4 5 5 4 4 4 4 5 4 4 4 3 3 4 4 4 5 4 4 4 4 4 4 3 3 4 4 5 5 5 4 4 5 4 4 5 5 3 4 4 4 4 5 5 5
1736E%%jJj%Jj%%Jj%%Jj%%%j%%J%%J%j%%J%j%%%K%k%j%J%j%%J%Jj%%J%%%%%j%%%%Jj%J%j%
$$ 5 5 5 4 5 4 4 5 4 4 4 5 4 4 4 5 4 4 4 4 3 3 3 4 4 4 5 5 4 4 4 5 5 4 4 4 4 6 6 4 4 3 3 4 4 3 3 3 4 4 5 4 4 4 5 5 5 5 5 5 4 4 4 4 4 5 4 4 5 5 4 4
1729D%%%Jj%jJ%j%J%%%%%JJkjJJk%K%jJ%j%J%j%%%%JjjJ%%JJjj%J%J%%j%j%%JKjj%%%%%jK
$$ 4 4 4 4 5 4 4 3 4 4 3 3 4 4 4 4 4 4 5 6 4 3 4 5 3 3 5 5 4 5 5 4 4 5 5 4 4 4 4 4 5 4 3 4 4 4 5 6 5 4 4 5 5 6 6 6 5 5 4 4 4 5 7 6 5 5 5 5 5 5 4 6
1723F%%%%j%J%%jjJ%%j%%J%%%j%J%%%%%jJj%J%j%Kj%jj%J%%%%%J%%%%%%%jjJ%%%J%jjJ%%J
$$ 6 6 6 6 6 5 5 6 6 6 5 4 5 5 5 4 4 4 5 5 5 5 4 4 5 5 5 5 5 5 4 5 4 4 5 5 4 4 6 5 5 4 3 3 4 4 4 4 4 4 5 5 5 5 5 5 5 5 4 3 4 4 4 4 5 5 4 3 4 4 4 5
1717E%%%%j%J%j%J%jjK%%jJ%%%jJjJ%J%j%jJj%%%%%%jJjJ%Jj%J%J%k%%Jj%%%J%jj%%%%%J%
$$ 5 5 5 5 5 4 4 5 5 4 4 5 5 4 3 5 5 5 4 5 5 5 5 4 5 4 5 5 6 6 5 5 4 5 4 4 4 4 4 4 4 3 4 3 4 4 5 4 4 5 5 6 6 4 4 4 5 4 4 4 4 5 5 4 3 3 3 3 3 3 4 4
1710D%J%j%%j%%JJKk%%%%jjJJ%jJjJ%jJk%J%JJ%kJjJj%%J%%%%%%%J%%j%%%Jjj%%J%JjjJj%
$$ 4 4 5 5 4 4 4 3 3 3 4 5 7 5 5 5 5 5 4 3 4 5 5 4 5 4 5 5 4 5 3 3 4 4 5 6 6 4 5 4 5 4 4 4 5 5 5 5 5 5 5 5 6 6 6 5 5 5 5 6 5 4 4 4 5 5 6 5 4 5 4 4
1704D%%%J%%%%jJ%%JjJkJ%%Jjjj%J%%%%j%J%jJJ%%j%%%%%%%%%JjJ%%jJJjkJ%jJJ%j%%%Jjj
$$ 4 4 4 4 5 5 5 5 5 4 5 5 5 6 5 6 4 5 5 5 6 5 4 3 3 4 4 4 4 4 3 3 4 4 3 4 5 5 5 4 4 4 4 4 4 4 4 4 4 5 4 5 5 5 4 5 6 5 3 4 4 3 4 5 5 4 4 4 4 5 4 3
1697CJ%%%%%jJjJ%%%%%%J%j%jJJj%J%%kJ%j%%%JJ%jJ%%%j%Jj%%jJ%J%%jJ%%j%%JJj%%jJj%
$$ 3 4 4 4 4 4 4 3 4 3 4 4 4 4 4 4 4 5 5 4 4 3 4 5 4 4 5 5 5 3 4 4 3 3 3 3 4 5 5 4 5 5 5 5 4 4 5 4 4 4 3 4 4 5 5 5 4 5 5 5 4 4 4 5 6 5 5 5 4 5 4 4
1691D%J%%J%jJj%%%%jjJ%J%j%JJj%%jJj%%Jj%jK%jJj%%jJJ%jjJ%J%%%%j%%%%%Jj%jJ%JjjJ
$$ 4 4 5 5 5 6 6 5 6 5 5 5 5 5 4 3 4 4 5 5 4 4 5 6 5 5 5 4 5 4 4 4 5 4 4 3 5 5 4 5 4 4 4 3 4 5 5 4 3 4 4 5 5 5 5 5 4 4 4 4 4 4 5 4 4 3 4 4 5 4 3 4
1684Dj%%%JJjJ%jJ%jJ%%jJ%%Jj%%%j%%J%%jj%J%%J%%jJ%%j%J%JjjJj%J%%%%%J%j%%jjJJ%%
$$ 4 3 3 3 3 4 5 4 5 5 4 5 5 4 5 5 5 4 5 5 5 6 5 5 5 5 4 4 4 5 5 5 4 3 3 4 4 4 5 5 5 4 5 5 5 4 4 5 5 6 5 4 5 4 4 5 5 5 5 5 5 6 6 5 5 5 4 3 4 5 5 5
1678E%%%%%k%JJ%%%j%%Jj%J%jJj%J%j%K%j%%%%%J%%%%%%%%j%Jj%j%Jj%%%Kjj%%%%%Kj%%jj
$$ 5 5 5 5 5 5 3 3 4 5 5 5 5 4 4 4 5 4 4 5 5 4 5 4 4 5 5 4 4 6 6 5 5 5 5 5 5 6 6 6 6 6 6 6 6 6 5 5 6 5 5 4 4 5 4 4 4 4 6 5 4 4 4 4 4 4 6 5 5 5 4 3
1671CJJ%%j%%%%%%J%%J%jj%%%%%%%%Jj%JjjJJJk%%%J%%%jJj%JjJ%%j%%%%%%J%%%%j%%J%%j
$$ 3 4 5 5 5 4 4 4 4 4 4 4 5 5 5 6 6 5 4 4 4 4 4 4 4 4 4 5 4 4 5 4 3 4 5 6 4 4 4 4 5 5 5 5 4 5 4 4 5 4 5 5 5 4 4 4 4 4 4 4 5 5 5 5 5 4 4 4 5 5 5 4
1665D%JJ%kJJjjJJj%%%JJk%jjJJ%%J%j%%J%%%%jjJJjjJJjjJJ%%%jjJ%j%%%%%%J%Jj%%j%J%
$$ 4 4 5 6 6 4 5 6 5 4 5 6 5 5 5 5 6 7 5 5 4 3 4 5 5 5 6 6 5 5 5 6 6 6 6 6 5 4 5 6 5 4 5 6 5 4 5 6 6 6 6 5 4 5 5 4 4 4 4 4 4 4 5 5 6 5 5 5 4 4 5 5
1659EJ%%%%j%%%jKj%Jj%%%%%jjJJ%%j%%J%%%%%%%%%%j%%%J%%%j%%J%jJ%%%%%j%Kj%%jJ%jj
$$ 5 6 6 6 6 6 5 5 5 5 4 6 5 5 6 5 5 5 5 5 5 4 3 4 5 5 5 4 4 4 5 5 5 5 5 5 5 5 5 5 5 4 4 4 4 5 5 5 5 4 4 4 5 5 4 5 5 5 5 5 5 4 4 6 5 5 5 4 5 5 4 3
1652CJJ%%jJ%%%%%jjJJ%%%%%%%%J%j%%%%%%%%j%%%%%J%%J%j%jjJ%Jj%Jj%J%%%j%J%%jjLj%
$$ 3 4 5 5 5 4 5 5 5 5 5 5 4 3 4 5 5 5 5 5 5 5 5 5 6 6 5 5 5 5 5 5 5 5 5 4 4 4 4 4 4 5 5 5 6 6 5 5 4 3 4 4 5 4 4 5 4 4 5 5 5 5 4 4 5 5 5 4 3 6 5 5
1646E%%%Jj%j%J%%%%jJ%%J%j%j%JjJ%%Jj%jjJJ%%j%J%%%%%%kJJ%j%%%JjJJj%%%%%j%%J%%J
$$ 5 5 5 5 6 5 5 4 4 5 5 5 5 5 4 5 5 5 6 6 5 5 4 4 5 4 5 5 5 6 5 5 4 3 4 5 5 5 4 4 5 5 5 5 5 5 5 3 4 5 5 4 4 4 4 5 4 5 6 5 5 5 5 5 5 4 4 4 5 5 5 6
1639F%%jjK%%%j%%JjJj%%%Jj%%%%%%Jj%%%%%J%%JjjjJjJJ%%jj%J%jJ%%%%%JjJjjJ%%%%Jj%
$$ 6 6 6 5 4 6 6 6 6 5 5 5 6 5 6 5 5 5 5 6 5 5 5 5 5 5 5 6 5 5 5 5 5 5 6 6 6 7 6 5 4 5 4 5 6 6 6 5 4 4 5 5 4 5 5 5 5 5 5 6 5 6 5 4 5 5 5 5 5 6 5 5
1633EKj%j%J%Jj%%j%%%jJ%JJk%%%%%%JjjJjJ%J%%jJjjJ%%%jJ%%%%%J%j%Kjj%jJ%%%%%j%J%
$$ 5 7 6 6 5 5 6 6 7 6 6 6 5 5 5 5 4 5 5 6 7 5 5 5 5 5 5 5 6 5 4 5 4 5 5 6 6 6 5 6 5 4 5 5 5 5 4 5 5 5 5 5 5 6 6 5 5 7 6 5 5 4 5 5 5 5 5 5 4 4 5 5
1626E%J%j%jK%jkJ%%jJj%J%K%%j%%%j%J%j%%%JjJJk%%%%J%j%%%Jj%%JKk%J%%jjjK%%%%%j%
$$ 5 5 6 6 5 5 4 6 6 5 3 4 4 4 3 4 3 3 4 4 6 6 6 5 5 5 5 4 4 5 5 4 4 4 4 5 4 5 6 4 4 4 4 4 5 5 4 4 4 4 5 4 4 4 5 7 5 5 6 6 6 5 4 3 5 5 5 5 5 5 4 4
1620DK%jJJjjj%%J%jJ%%Jj%%%j%J%%jJ%%jJ%%J%jJj%%Jj%%%%J%%%jJ%j%%jJ%%%%%%%%j%%%
$$ 4 6 6 5 6 7 6 5 4 4 4 5 5 4 5 5 5 6 5 5 5 5 4 4 5 5 5 4 5 5 5 4 5 5 5 6 6 5 6 5 5 5 6 5 5 5 5 5 6 6 6 6 5 6 6 5 5 5 4 5 5 5 5 5 5 5 5 5 4 4 4 4
1613D%J%J%%j%jJJjkK%%jJ%%%j%%%KjJ%%%j%%%JjjJJJjkJ%%J%jJj%%%jK%%%Jjj%jJJ%%Jk%
$$ 4 4 5 5 6 6 6 5 5 4 5 6 5 3 5 5 5 4 5 5 5 5 4 4 4 4 6 5 6 6 6 6 5 5 5 5 6 5 4 5 6 7 6 4 5 5 5 6 6 5 6 5 5 5 5 4 6 6 6 6 7 6 5 5 4 5 6 6 6 7 5 5
1607E%%JJj%%%%%%%J%%jJjj%J%Jj%J%JjjJ%JJ%%%%%%J%%%JJJ%JJ%JJKLJMMORJ1J5J9K1K3K1
$$ 5 5 5 6 7 6 6 6 6 6 6 6 6 7 7 7 6 7 6 5 5 6 6 7 6 6 7 7 8 7 6 7 7 8 9 9 9 9 9 9 9 10 10 10 10 11 12 13 13 14 15 15 16 17 19 22 23 27 31 37 46 57 72 91 112 135 156
1601A56J6Mpj7k6k7k2j7j3rpmllkkjjjk%%%j%%%j%j%%%%J%%J%J%%Jj%%jj%%j%Jjj%%j%%j%
$$ 156 172 176 169 152 126 99 77 60 47 38 31 27 24 21 19 17 16 15 14 12 12 12 12 11 11 11 11 10 10 9 9 9 9 9 10 10 10 11 11 12 12 12 13 12 12 12 11 10 10 10 9 9 10 9 8 8 8 7 7 7 6 6
1595F%Jj%K%%%%jj%%%%%%J%%%k%K%%k%J%%j%K%j%jJ%Jj%%%%jJ%%%Jj%j%%%%%JjJJj%%%%%%
$$ 6 6 7 6 6 8 8 8 8 8 7 6 6 6 6 6 6 6 7 7 7 7 5 5 7 7 7 5 5 6 6 6 5 5 7 7 6 6 5 6 6 7 6 6 6 6 6 5 6 6 6 6 7 6 6 5 5 5 5 5 5 6 5 6 7 6 6 6 6 6 6 6
1589FJ%jjJjJ%%%%J%%j%%J%j%%%%J%j%%k%%%%%J%%J%%jJ%%%j%JjJ%%J%jJ%%%%j%Jj%j%J%J
$$ 6 7 7 6 5 6 5 6 6 6 6 6 7 7 7 6 6 6 7 7 6 6 6 6 6 7 7 6 6 6 4 4 4 4 4 4 5 5 5 6 6 6 5 6 6 6 6 5 5 6 5 6 6 6 7 7 6 7 7 7 7 7 6 6 7 6 6 5 5 6 6 7
1582GJ%j%j%JjJ%%%%%%%%jJ%j%J%%%%%j%j%j%%JJj%%J%jJjKj%%jJJ%%j%Jj%JJj%j%%%jJ%%
$$ 7 8 8 7 7 6 6 7 6 7 7 7 7 7 7 7 7 7 6 7 7 6 6 7 7 7 7 7 7 6 6 5 5 4 4 4 5 6 5 5 5 6 6 5 6 5 7 6 6 6 5 6 7 7 7 6 6 7 6 6 7 8 7 7 6 6 6 6 5 6 6 6
1576F%%j%K%%%kJ%%%J%%%jj%%%Jk%%%J%%%%JJ%j%%j%KjjJJ%%%j%jJJ%jJJ%jJJjJ%j%Jj%J%
$$ 6 6 6 5 5 7 7 7 7 5 6 6 6 6 7 7 7 7 6 5 5 5 5 6 4 4 4 4 5 5 5 5 5 6 7 7 6 6 6 5 5 7 6 5 6 7 7 7 7 6 6 5 6 7 7 6 7 8 8 7 8 9 8 9 9 8 8 9 8 8 9 9
1570I%Jj%j%j%jJ%J%jj%%j%K%%Jj%%%%%%J%%%jj%%j%J%j%%K%%j%JJj%%JJj%%jJ%jj%K%j%J
$$ 9 9 10 9 9 8 8 7 7 6 7 7 8 8 7 6 6 6 5 5 7 7 7 8 7 7 7 7 7 7 7 8 8 8 8 7 6 6 6 5 5 6 6 5 5 5 7 7 7 6 6 7 8 7 7 7 8 9 8 8 8 7 8 8 7 6 6 8 8 7 7 8
1563HJjj%JkjJJj%J%j%J%%%Jj%%j%Jj%jJJ%%%J%JJ%Jj%j%J%jJ%J%J%k%K%%j%%%%J%j%%%jJ
$$ 8 9 8 7 7 8 6 5 6 7 6 6 7 7 6 6 7 7 7 7 8 7 7 7 6 6 7 6 6 5 6 7 7 7 7 8 8 9 10 10 11 10 10 9 9 10 10 9 10 10 11 11 12 12 10 10 12 12 12 11 11 11 11 11 12 12 11 11 11 11 10 11
1557A1%%j%j%%JJ%%%J%j%jj%%j%%%%%JJ%j%J%J%J%%%jJJJ%JKjj%%%%%%%%kk%JkjJJ%JJ%%J
$$ 11 11 11 10 10 9 9 9 10 11 11 11 11 12 12 11 11 10 9 9 9 8 8 8 8 8 8 9 10 10 9 9 10 10 11 11 12 12 12 12 11 12 13 14 14 15 17 16 15 15 15 15 15 15 15 15 15 13 11 11 12 10 9 10 11 11 12 13 13 13 14
1550A4%j%Jj%j%jJJ%JJ%JJj%%j%%JJ%%jJJ%JjJJ%JLJJLJLKMLLLK%kkllkkjjjjjj%JJ%%jJJ
$$ 14 14 13 13 14 13 13 12 12 11 12 13 13 14 15 15 16 17 16 16 16 15 15 15 16 17 17 17 16 17 18 18 19 18 19 20 20 21 24 25 26 29 30 33 35 39 42 45 48 50 50 48 46 43 40 38 36 35 34 33 32 31 30 30 31 32 32 32 31 32 33
1544C3%%%j%JjjJJ%%J%J%j%jjK%KJJJJ%%%%K%Kj%J%llmm%jJ%KJ%J%%KKLMLLKJj%jlj%%%Jj
$$ 33 33 33 33 32 32 33 32 31 32 33 33 33 34 34 35 35 34 34 33 32 34 34 36 37 38 39 40 40 40 40 40 42 42 44 43 43 44 44 41 38 34 30 30 29 30 30 32 33 33 34 34 34 36 38 41 45 48 51 53 54 53 53 52 49 48 48 48 48 49 48
1538D8%JJJJ%%J%JjjJjLLLLOONNLKJJ%%J%KLLKMNOMLLKJ%J%JKJLNONNPRJ0J1J1J4J6J8K2K4
$$ 48 48 49 50 51 52 52 52 53 53 54 53 52 53 52 55 58 61 64 70 76 81 86 89 91 92 93 93 93 94 94 96 99 102 104 108 113 119 123 126 129 131 132 132 133 133 134 136 137 140 145 151 156 161 168 177 187 198 209 223 239 257 279 303
1532C03K5L0L1L5L8M3N0N6O1O4O5O3N9N7N9O9P9R2J02J11J17J28J46J81K30K96L79M94O50
$$ 303 328 358 389 424 462 505 555 611 672 736 801 864 923 980 1039 1108 1187 1279 1381 1492 1609 1737 1883 2064 2294 2590 2969 3463 4113
1529D113Q71J175J590K164K911L705M143L933L396K459R05j019k932m449m891m276l297k408
$$ 4113 4984 6159 7749 9913 12824 16529 20672 24605 28001 30460 31365 30346 27414 22965 18074 13798 10501 8093
1528H093j741j261r27o92n28m12l31k61k07j61j26j01q2p0o4o6p0o9o4n3m0k6j7oOJ9L5N1
$$ 8093 6352 5091 4164 3472 2944 2532 2201 1940 1733 1572 1446 1345 1263 1193 1129 1063 993 924 860 807 767 741 724 718 724 743 778 829
1525H29O9Q3Q8Q6O9L9mm9q8j13j19j12r7q1o8n6m6l9l1k8k4k0j9j7j4j2rpmlkjJ%jmnqj2j2
$$ 829 898 981 1069 1155 1224 1263 1259 1210 1122 1009 890 778 681 600 532 476 430 391 360 332 308 288 269 252 238 226 217 210 206 203 201 200 201 201 200 196 191 183 171 159
1521A59j2j1j0omkjj%JJ%jllllmkllllkljlkljlkjkllkk%LKKKNKKJKJ%KLJK%KLLQJ1J7K1K4
$$ 159 147 136 126 120 116 114 113 112 112 113 114 114 113 110 107 104 101 97 95 92 89 86 83 81 78 77 74 72 69 68 65 63 62 60 57 54 52 50 50 53 55 57 59 64 66 68 69 71 72 72 74 77 78 80 80 82 85 88 96 107 124 145 169
1516A69K3J9J0kj2j9k1j6j2n%LN%mrj3j8j7j3ronllkklkjjjj%%%jkjjKjk%j%J%%j%%%j%%%
$$ 169 192 211 221 219 207 188 167 151 139 134 134 137 142 142 138 129 116 98 81 68 59 53 48 45 42 40 38 35 33 32 31 30 29 29 29 29 28 26 25 24 26 25 23 23 22 22 23 23 23 22 22 22 22 21 21 21 21
1510B1J%%%j%%%JK%jjJ%%%Jj%%j%%%j%%%Jk%J%jJJk%%j%j%%j%Jj%JJj%J%Jjj%jjjjjjJ%%j
$$ 21 22 22 22 22 21 21 21 21 22 24 24 23 22 23 23 23 23 24 23 23 23 22 22 22 22 21 21 21 21 22 20 20 21 21 20 21 22 20 20 20 19 19 18 18 18 17 17 18 17 17 18 19 18 18 19 19 20 19 18 18 17 16 15 14 13 12 13 13 13 12
1504A2JkJJ%%JJjJJ%jj%JJj%%JJj%%%jj%%jj%J%%%J%%%j%%%%%k%%j%%%J%j%Jj%Jj%%%J%%j
$$ 12 13 11 12 13 13 13 14 15 14 15 16 16 15 14 14 15 16 15 15 15 16 17 16 16 16 16 15 14 14 14 13 12 12 13 13 13 13 14 14 14 14 13 13 13 13 13 13 11 11 11 10 10 10 10 11 11 10 10 11 10 10 11 10 10 10 10 11 11 11 10
1498A0%JJj%%j%J%%%K%%JJ%%jJj%jjJ%%%%%kK%%jJ%%kJ%J%k%%%%%%jj%Kj%%j%K%j%JJ%%%j
$$ 10 10 11 12 11 11 11 10 10 11 11 11 11 13 13 13 14 15 15 15 14 15 14 14 13 12 13 13 13 13 13 13 11 13 13 13 12 13 13 13 11 12 12 13 13 11 11 11 11 11 11 11 10 9 9 11 10 10 10 9 9 11 11 10 10 11 12 12 12 12 11
1491A1%%j%J%%j%K%%j%%%j%J%j%%j%J%jJ%%Jj%jJ%%jJjjjJ%%%%%Jk%Kj%%%%JJ%%%jJjJ%%%
$$ 11 11 11 10 10 11 11 11 10 10 12 12 12 11 11 11 11 10 10 11 11 10 10 10 9 9 10 10 9 10 10 10 11 10 10 9 10 10 10 9 10 9 8 7 8 8 8 8 8 8 9 7 7 9 8 8 8 8 8 9 10 10 10 10 9 10 9 10 10 10 10
1485A0%%%j%j%J%j%KjJJj%%j%%JJk%%JjJ%j%Jj%%j%%%%%J%%j%JjJ%jJ%j%%%%%J%%%j%%JjJ
$$ 10 10 10 10 9 9 8 8 9 9 8 8 10 9 10 11 10 10 10 9 9 9 10 11 9 9 9 10 9 10 10 9 9 10 9 9 9 8 8 8 8 8 8 9 9 9 8 8 9 8 9 9 8 9 9 8 8 8 8 8 8 9 9 9 9 8 8 8 9 8 9
1479IkJ%JjJ%%JJj%%%%%jj%K%%%jJ%j%%j%J%%%%J%jj%%j%Jj%jJ%JJ%%%%JjjJ%%Jj%KJJJKK
$$ 9 7 8 8 9 8 9 9 9 10 11 10 10 10 10 10 10 9 8 8 10 10 10 10 9 10 10 9 9 9 8 8 9 9 9 9 9 10 10 9 8 8 8 7 7 8 7 7 6 7 7 8 9 9 9 9 9 10 9 8 9 9 9 10 9 9 11 12 13 14 16 18
1472A8%%%kkk%jjJ%kjJ%%%%%jJj%J%%j%%%%%%Jj%%jKJjj%Jj%%Jj%J%%j%%Kjj%J%%%%k%J%J
$$ 18 18 18 18 16 14 12 12 11 10 11 11 9 8 9 9 9 9 9 9 8 9 8 8 9 9 9 8 8 8 8 8 8 8 9 8 8 8 7 9 10 9 8 8 9 8 8 8 9 8 8 9 9 9 8 8 8 10 9 8 8 9 9 9 9 9 7 7 8 8 9
1466IjJjj%K%k%%%%%J%%%%%%jK%jj%J%%%%J%j%jJ%%KjkJ%%%jJ%%%%%Jk%Jj%%%J%%j%%%%J%
$$ 9 8 9 8 7 7 9 9 7 7 7 7 7 7 8 8 8 8 8 8 8 7 9 9 8 7 7 8 8 8 8 8 9 9 8 8 7 8 8 8 10 9 7 8 8 8 8 7 8 8 8 8 8 8 9 7 7 8 7 7 7 7 8 8 8 7 7 7 7 7 8 8
1459H%%%J%%J%j%jJ%j%jJ%%J%j%JJ%%jJjJJj%JKj%%%JJ%JJK%JJJJKMNOQJ1J5J9K2K3K0J6P
$$ 8 8 8 8 9 9 9 10 10 9 9 8 9 9 8 8 7 8 8 8 9 9 8 8 9 10 10 10 9 10 9 10 11 10 10 11 13 12 12 12 12 13 14 14 15 16 18 18 19 20 21 22 24 28 33 39 47 58 73 92 114 137 157 173 180
1454A80pj7k5k7k2j8j4qqnlkjlkjjj%J%jj%%kJ%%jjJJ%j%%JKJ%j%%jj%%J%jJjJjJ%KJ%KJ%
$$ 180 173 156 131 104 82 64 50 42 34 29 26 24 23 20 18 17 16 15 15 16 16 15 14 14 14 12 13 13 13 12 11 12 13 13 12 12 12 13 15 16 16 15 15 15 14 13 13 13 14 14 13 14 13 14 13 14 14 16 17 17 19 20 20
1448B0LKMMQJ0J4J9K4K6K6K1J0kj6l0l2k8k1j3rqnlljlkjJ%jjj%J%%jJjjJ%jkJ%j%J%j%jJ
$$ 20 23 25 29 33 41 51 65 84 108 134 160 181 191 189 173 143 111 83 62 49 40 32 27 24 21 20 17 15 14 15 15 14 13 12 12 13 13 13 12 13 12 11 12 12 11 9 10 10 9 9 10 10 9 9 8 9
1443I%Jj%%%j%%Jj%J%%%Jjj%%%J%%%Jjj%%JjjKJjk%%K%%j%J%%%%j%j%%J%%J%jJ%j%%%%j%%
$$ 9 9 10 9 9 9 9 8 8 8 9 8 8 9 9 9 9 10 9 8 8 8 8 9 9 9 9 10 9 8 8 8 9 8 7 9 10 9 7 7 7 9 9 9 8 8 9 9 9 9 9 8 8 7 7 7 8 8 8 9 9 8 9 9 8 8 8 8 8 7 7 7
1436GJjJj%JjJ%%%%%J%%%jJkJJj%Jj%jKJj%j%%Jj%j%%Jj%J%%%%jJ%Jj%jJJj%%JJj%j%JJ%j
$$ 7 8 7 8 7 7 8 7 8 8 8 8 8 8 9 9 9 9 8 9 7 8 9 8 8 9 8 8 7 9 10 9 9 8 8 8 9 8 8 7 7 7 8 7 7 8 8 8 8 8 7 8 8 9 8 8 7 8 9 8 8 8 9 10 9 9 8 8 9 10 10 9
1430I%Jk%J%%j%J%%%%j%J%%Jj%jj%J%j%%jjJ%J%jJ%%J%%jJ%%%j%%%J%%J%j%%%j%JjJj%%%%
$$ 9 9 10 8 8 9 9 9 8 8 9 9 9 9 9 8 8 9 9 9 10 9 9 8 7 7 8 8 7 7 7 6 5 6 6 7 7 6 7 7 7 8 8 8 7 8 8 8 8 7 7 7 7 8 8 8 9 9 8 8 8 8 7 7 8 7 8 7 7 7 7 7
1423G%%JjKjJJj%J%j%jjJJj%%jJJjjJJ%jjJ%%k%KJ%%%kJ%%JjjJ%jJjjLj%J%%j%%J%%%jJjJ
$$ 7 7 7 8 7 9 8 9 10 9 9 10 10 9 9 8 7 8 9 8 8 8 7 8 9 8 7 8 9 9 8 7 8 8 8 6 6 8 9 9 9 9 7 8 8 8 9 8 7 8 8 7 8 7 6 9 8 8 9 9 9 8 8 8 9 9 9 9 8 9 8 9
1417I%jJjj%%jJJjJ%%%%%JJjkJJJjK%jj%j%%j%J%%%%%j%%J%%%%J%%jJ%%j%%JJ%jj%%JJjjj
$$ 9 9 8 9 8 7 7 7 6 7 8 7 8 8 8 8 8 8 9 10 9 7 8 9 10 9 11 11 10 9 9 8 8 8 7 7 8 8 8 8 8 8 7 7 7 8 8 8 8 8 9 9 9 8 9 9 9 8 8 8 9 10 10 9 8 8 8 9 10 9 8 7
1411GJ%JkjJJJjJ%j%%%%JJj%Jj%jj%J%%%%%K%%J%%jJ%%Jj%JK%j%J%%%%kJ%%%j%JjjJJk%J%
$$ 7 8 8 9 7 6 7 8 9 8 9 9 8 8 8 8 8 9 10 9 9 10 9 9 8 7 7 8 8 8 8 8 8 10 10 10 11 11 11 10 11 11 11 12 11 11 12 14 14 13 13 14 14 14 14 14 12 13 13 13 13 12 12 13 12 11 12 13 11 11 12 12
1404A2%KJJJ%%jj%jkj%%%jjJjJJjJ%Jj%%%%J%%%%JJJjJJ%%%j%%J%%kJjj%j%%%J%j%K%jJ%j
$$ 12 12 14 15 16 17 17 17 16 15 15 14 12 11 11 11 11 10 9 10 9 10 11 10 11 11 12 11 11 11 11 11 12 12 12 12 12 13 14 15 14 15 16 16 16 16 15 15 15 16 16 16 14 15 14 13 13 12 12 12 12 13 13 12 12 14 14 13 14 14 13
1398A3J%jkj%%JJ%JJ%Jjj%J%%%jj%%J%%%%%KjJ%%JJ%%%JJJK%j%Jj%%%%%JJ%%Jj%jJJ%JKJ%
$$ 13 14 14 13 11 10 10 10 11 12 12 13 14 14 15 14 13 13 14 14 14 14 13 12 12 12 13 13 13 13 13 13 15 14 15 15 15 16 17 17 17 17 18 19 20 22 22 21 21 22 21 21 21 21 21 21 22 23 23 23 24 23 23 22 23 24 24 25 27 28 28
1391B8jJj%j%JJ%KJJj%%%j%%%LL%%%JJKKLLLLNONKMLkmpronnljjJKJMLLLj%klkkjjJJJj%%
$$ 28 27 28 27 27 26 26 27 28 28 30 31 32 31 31 31 31 30 30 30 30 33 36 36 36 36 37 38 40 42 45 48 51 54 59 65 70 72 76 79 77 73 66 57 51 46 41 38 37 36 37 39 40 44 47 50 53 52 52 50 47 45 43 42 41 42 43 44 43 43 43
1385D3j%%%%JJ%jjKJKMOOMNLLJ%jj%%KLJLLKKLLJK%JJJJKJLMNNQQJ1J1J5J4J2J1J1RJ1J3J9
$$ 43 42 42 42 42 42 43 44 44 43 42 44 45 47 51 57 63 67 72 75 78 79 79 78 77 77 77 79 82 83 86 89 91 93 96 99 100 102 102 103 104 105 106 108 109 112 116 121 126 134 142 153 164 179 193 205 216 227 236 247 260 279
1380B79J9K1K3K4K7L0L6M5N3O2O6O8O4N9N1M9N3O6Q7J14J40J74K07K58L16L96N10O74R17J287
$$ 279 298 319 342 366 393 423 459 504 557 619 685 753 817 876 927 976 1029 1095 1182 1296 1436 1610 1817 2075 2391 2787 3297 3971 4888 6175
1377F175J844K664L689M534M560M113L359J829l36k589m615n561m998l806k698j896j342r66
$$ 6175 8019 10683 14372 18906 23466 27579 30938 32767 32431 29842 25227 19666 14668 10862 8164 6268 4926 3960
1375C960p07n31m12l34k67k14j72j41j16r6p8o4m8l7k3j7j4j5k2l2m1n0m7m4l4l0k3j9j5j2
$$ 3960 3253 2722 2310 1976 1709 1495 1323 1182 1066 970 892 828 780 743 720 703 689 674 652 620 579 529 482 438 404 374 351 332 317 305
1372C05rj0prqj0rj0rrrj1rrqqppqqpnmlmlklmjkmnnlmlkljJLMLKKK%jjlmjkkkjjjkk%kl%
$$ 305 296 286 279 270 262 252 243 233 224 215 206 195 186 177 169 161 154 147 139 131 124 119 115 112 108 105 103 100 96 95 93 89 84 79 76 72 69 67 64 63 64 67 71 74 76 78 80 80 79 78 75 71 70 68 66 64 63 62 61 59 57 57 55 52 52
1367E2lkklnmkj%KLLOLNNLKL%jnonmmmmnnkk%%K%JJ%jJ%jjJJ%jJjjkJkJJj%J%%jj%%%JkJ%
$$ 52 49 47 45 42 37 33 31 30 30 32 35 38 44 47 52 57 60 62 65 65 64 59 53 48 44 40 36 32 27 22 20 18 18 18 20 20 21 22 22 21 22 22 21 20 21 22 22 21 22 21 20 18 19 17 18 19 18 18 19 19 19 18 17 17 17 17 18 16 17 17
1360A7%Kjk%%%j%Kj%Jj%%j%jJ%JKj%JJ%jJ%%JJ%j%%J%jJjj%%Jj%k%%J%JJjj%%jjJj%%%jJj
$$ 17 17 19 18 16 16 16 16 15 15 17 16 16 17 16 16 16 15 15 14 15 15 16 18 17 17 18 19 19 18 19 19 19 20 21 21 20 20 20 21 21 20 21 20 19 19 19 20 19 19 17 17 17 18 18 19 20 19 18 18 18 17 16 17 16 16 16 16 15 16 15
1354A5%%J%Jjj%%J%kjj%%j%%%%%%%%J%JJJJj%J%%%%jJ%J%j%%Jjkj%%Jj%J%jjJ%%Jjj%%%%j
$$ 15 15 15 16 16 17 16 15 15 15 16 16 14 13 12 12 12 11 11 11 11 11 11 11 11 11 12 12 13 14 15 16 15 15 16 16 16 16 16 15 16 16 17 17 16 16 16 17 16 14 13 13 13 14 13 13 14 14 13 12 13 13 13 14 13 12 12 12 12 12 11
1347A1%%Jj%%%%%%jjJJ%Jj%J%%%%%Jk%%jJJ%K%%JjJ%%%J%j%j%Jj%J%%%kJJj%%jJJj%jJj%%
$$ 11 11 11 12 11 11 11 11 11 11 11 10 9 10 11 11 12 11 11 12 12 12 12 12 12 13 11 11 11 10 11 12 12 14 14 14 15 14 15 15 15 15 16 16 15 15 14 14 15 14 14 15 15 15 15 13 14 15 14 14 14 13 14 15 14 14 13 14 13 13 13
1341A3%J%j%J%Jj%JJJJKKJKjkk%jj%j%%kJJj%%%jJ%j%J%J%J%JJ%%%JJJK%JKJJJLJKKJJLMM
$$ 13 13 14 14 13 13 14 14 15 14 14 15 16 17 18 20 22 23 25 24 22 20 20 19 18 18 17 17 17 15 16 17 16 16 16 16 15 16 16 15 15 16 16 17 17 18 18 19 20 20 20 20 21 22 23 25 25 26 28 29 30 31 34 35 37 39 40 41 44 48 52
1335E2NOPRJ1J5K0K9M2O2R3J31J57J59J51J17M6m9j40j97j93j48j00o8m6l4k4j5j3j0qomn
$$ 52 57 63 70 79 90 105 125 154 196 258 351 482 639 798 949 1066 1112 1063 923 726 533 385 285 217 171 137 113 98 85 75 67 61 57 52
1332E2ljkl%JKKLORQQNMkpj1j3qpnmkkk%%kJjJ%K%Jj%J%jjjjjj%%J%%j%J%j%%J%J%%%%JJJ
$$ 52 49 48 46 43 43 44 46 48 51 57 66 74 82 87 91 89 82 71 58 50 43 38 34 32 30 28 28 28 26 27 26 27 27 29 29 30 29 29 30 30 29 28 27 26 25 24 24 24 25 25 25 24 24 25 25 24 24 24 25 25 26 26 26 26 26 27 28 29
1325B9jJ%jj%%jJj%%%%%%%%J%%kJJ%j%%%KJ%jjJJ%J%%KKjJ%%J%JjK%jJJJJjJ%JJj%j%%%J%
$$ 29 28 29 29 28 27 27 27 26 27 26 26 26 26 26 26 26 26 26 27 27 27 25 26 27 27 26 26 26 26 28 29 29 28 27 28 29 29 30 30 30 32 34 33 34 34 34 35 35 36 35 37 37 36 37 38 39 40 39 40 40 41 42 41 41 40 40 40 40 41 41
1319D1%j%j%%%%j%j%%j%Jj%Jj%K%J%jJ%jJJ%j%%J%%%J%J%%JJ%JK%%JJ%%%J%%Jj%j%%j%jj%
$$ 41 41 40 40 39 39 39 39 39 38 38 37 37 37 36 36 37 36 36 37 36 36 38 38 39 39 38 39 39 38 39 40 40 39 39 39 40 40 40 40 41 41 42 42 42 43 44 44 45 47 47 47 48 49 49 49 49 50 50 50 51 50 50 49 49 49 48 48 47 46 46
1313D6%J%jjj%jJ%k%kjJJ%jk%%%%j%%%%%%%jJ%jJJ%%JjjK%jJJj%%jJJJ%jj%J%Jj%jJj%%%%
$$ 46 46 47 47 46 45 44 44 43 44 44 42 42 40 39 40 41 41 40 38 38 38 38 38 37 37 37 37 37 37 37 37 36 37 37 36 37 38 38 38 39 38 37 39 39 38 39 40 39 39 39 38 39 40 41 41 40 39 39 40 40 41 40 40 39 40 39 39 39 39 39
1306C9%j%%%%%Jkj%%%JJKj%JKJMNQJ0J3J9K4K6K6K1J1lj9l0l3k7k0j4j0olmmkjkkj%jj%J%
$$ 39 39 38 38 38 38 38 38 39 37 36 36 36 36 37 38 40 39 39 40 42 43 47 52 60 70 83 102 126 152 178 199 210 207 188 158 125 98 78 64 54 48 45 41 37 35 34 32 30 29 29 28 27 27 28 28
1301B8%jjj%%%%jJj%%j%j%j%jJjj%J%JjjjJ%jJk%%%%%%j%%%jJ%%jJjjJ%%jjJ%%JJ%k%%Jj%
$$ 28 28 27 26 25 25 25 25 25 24 25 24 24 24 23 23 22 22 21 21 20 21 20 19 19 20 20 21 20 19 18 19 19 18 19 17 17 17 17 17 17 17 16 16 16 16 15 16 16 16 15 16 15 14 15 15 15 14 13 14 14 14 15 16 16 14 14 14 15 14 14
1295A4Jj%j%%j%JjJJj%Jj%j%Jj%%%%JjJj%%%j%J%jJ%jJ%%%%%%%%%j%%Jj%jJ%j%%%%JjJJjj
$$ 14 15 14 14 13 13 13 12 12 13 12 13 14 13 13 14 13 13 12 12 13 12 12 12 12 12 13 12 13 12 12 12 12 11 11 12 12 11 12 12 11 12 12 12 12 12 12 12 12 12 12 11 11 11 12 11 11 10 11 11 10 10 10 10 10 11 10 11 12 11 10
1289A0j%K%j%%%j%J%%%%JJjjjJ%J%j%%kJJjJJ%%j%%Jj%%jJkJJ%j%%J%jJ%J%j%jJ%j%%Jj%J
$$ 10 9 9 11 11 10 10 10 10 9 9 10 10 10 10 10 11 12 11 10 9 10 10 11 11 10 10 10 8 9 10 9 10 11 11 11 10 10 10 11 10 10 10 9 10 8 9 10 10 9 9 9 10 10 9 10 10 11 11 10 10 9 10 10 9 9 9 10 9 9 10
1282A0%kJKj%%%%kJJ%k%%JJ%%j%%J%%%%k%%J%%JJ%j%jJ%%%jJ%j%J%j%%%J%%%j%Jj%j%Jj%J
$$ 10 10 8 9 11 10 10 10 10 10 8 9 10 10 8 8 8 9 10 10 10 9 9 9 10 10 10 10 10 8 8 8 9 9 9 10 11 11 10 10 9 10 10 10 10 9 10 10 9 9 10 10 9 9 9 9 10 10 10 10 9 9 10 9 9 8 8 9 8 8 9
1276I%Jj%jJJ%Jkj%%J%%%Jj%%%%J%JJk%Jj%%%%%%J%jJj%Jk%j%Kj%jJJjjJJj%%%jJjJ%J%jJ
$$ 9 9 10 9 9 8 9 10 10 11 9 8 8 8 9 9 9 9 10 9 9 9 9 9 10 10 11 12 10 10 11 10 10 10 10 10 10 10 11 11 10 11 10 10 11 9 9 8 8 10 9 9 8 9 10 9 8 9 10 9 9 9 9 8 9 8 9 9 10 10 9 10
1270A0%%%%j%%JJjj%%J%%j%J%J%%jJ%Jj%%J%jJJjJ%%j%j%%%J%jjj%%JJ%%j%j%%%j%J%%J%J
$$ 10 10 10 10 10 9 9 9 10 11 10 9 9 9 10 10 10 9 9 10 10 11 11 11 10 11 11 12 11 11 11 12 12 11 12 13 12 13 13 13 12 12 11 11 11 11 12 12 11 10 9 9 9 10 11 11 11 10 10 9 9 9 9 8 8 9 9 9 10 10 11
1263A1%kJ%%%%%j%%JJj%%K%%K%%%J%Jjjj%J%J%J%%JJJ%%k%%l%%j%%%jjJjkJjJJjJ%%%%%jJ
$$ 11 11 9 10 10 10 10 10 10 9 9 9 10 11 10 10 10 12 12 12 14 14 14 14 15 15 16 15 14 13 13 14 14 15 15 16 16 16 17 18 19 19 19 17 17 17 14 14 14 13 13 13 13 12 11 12 11 9 10 9 10 11 10 11 11 11 11 11 11 10 11
1257A1%%Jj%%%%jJj%%%%%%%%jJJ%JjJj%J%%J%JKj%JJJ%JJ%%J%jjkjj%jj%%%j%%%%Jj%Jj%K
$$ 11 11 11 12 11 11 11 11 11 10 11 10 10 10 10 10 10 10 10 10 9 10 11 11 12 11 12 11 11 12 12 12 13 13 14 16 15 15 16 17 18 18 19 20 20 20 21 21 20 19 17 16 15 15 14 13 13 13 13 12 12 12 12 12 13 12 12 13 12 12 14
1250A4J%k%KJjJ%j%jj%%%%jj%J%jJJjjJ%%%%%jJJj%JJJ%JJJ%JjJ%j%kjJjj%%j%j%%j%JK%%
$$ 14 15 15 13 13 15 16 15 16 16 15 15 14 13 13 13 13 13 12 11 11 12 12 11 12 13 12 11 12 12 12 12 12 12 11 12 13 12 12 13 14 15 15 16 17 18 18 19 18 19 19 18 18 16 15 16 15 14 14 14 13 13 12 12 12 11 11 12 14 14 14
1244A4JJ%%JKJ%JKJ%jjkjjk%jj%j%j%Jjj%%J%%%j%%JJ%%%J%%%%%%%%Jj%%kJJjjJ%%j%%JjJ
$$ 14 15 16 16 16 17 19 20 20 21 23 24 24 23 22 20 19 18 16 16 15 14 14 13 13 12 12 13 12 11 11 11 12 12 12 12 11 11 11 12 13 13 13 13 14 14 14 14 14 14 14 14 14 15 14 14 14 12 13 14 13 12 13 13 13 12 12 12 13 12 13
1238A3%J%%JJJJJKKJKK%%%kkkkkjkj%j%%%jj%Jj%JJjJjJ%j%%jjJJj%J%jj%JJJj%%%%%%%Jj
$$ 13 13 14 14 14 15 16 17 18 19 21 23 24 26 28 28 28 28 26 24 22 20 18 17 15 14 14 13 13 13 13 12 11 11 12 11 11 12 13 12 13 12 13 13 12 12 12 11 10 11 12 11 11 12 12 11 10 10 11 12 13 12 12 12 12 12 12 12 12 13 12
1231A2J%jj%J%J%JKJJ%KK%J%%jjljjjj%%k%Jjjj%J%%%Jj%Jj%jJ%%j%jJ%j%J%%%J%%%%%j%J
$$ 12 13 13 12 11 11 12 12 13 13 14 16 17 18 18 20 22 22 23 23 23 22 21 18 17 16 15 14 14 14 12 12 13 12 11 10 10 11 11 11 11 12 11 11 12 11 11 10 11 11 11 10 10 9 10 10 9 9 10 10 10 10 11 11 11 11 11 11 10 10 11
1225A1J%lK%jK%%%%%%%jK%%JjJ%Jj%%jjJjjjJJ%jj%JJ%k%Kjj%%%%%%%%%%J%j%jJJ%jJ%k%%
$$ 11 12 12 9 11 11 10 12 12 12 12 12 12 12 12 11 13 13 13 14 13 14 14 15 14 14 14 13 12 13 12 11 10 11 12 12 11 10 10 11 12 12 10 10 12 11 10 10 10 10 10 10 10 10 10 10 10 11 11 10 10 9 10 11 11 10 11 11 9 9 9
1219IjJKj%%jJ%%%%%JjJj%jJ%jJ%%%%J%j%%%JjjJ%j%%Jj%K%%jj%J%jJ%%%JjjJ%%%jjJ%%%j
$$ 9 8 9 11 10 10 10 9 10 10 10 10 10 10 11 10 11 10 10 9 10 10 9 10 10 10 10 10 11 11 10 10 10 10 11 10 9 10 10 9 9 9 10 9 9 11 11 11 10 9 9 10 10 9 10 10 10 10 11 10 9 10 10 10 10 9 8 9 9 9 9 8
1212HJJ%%Jj%%%jj%JJj%JjJk%Jj%%J%%%J%J%k%K%j%%jJJ%j%%Jj%%%Jj%Jj%JjJ%j%JjJ%j%J
$$ 8 9 10 10 10 11 10 10 10 10 9 8 8 9 10 9 9 10 9 10 8 8 9 8 8 8 9 9 9 9 10 10 11 11 9 9 11 11 10 10 10 9 10 11 11 10 10 10 11 10 10 10 10 11 10 10 11 10 10 11 10 11 11 10 10 11 10 11 11 10 10 11
1206A1jj%J%jjJJ%J%k%J%jjJJ%J%jjJKkJjJ%%jjJJ%%%%jJ%%k%%J%%J%j%%%Jj%jJjjJJJ%j%
$$ 11 10 9 9 10 10 9 8 9 10 10 11 11 9 9 10 10 9 8 9 10 10 11 11 10 9 10 12 10 11 10 11 11 11 10 9 10 11 11 11 11 11 10 11 11 11 9 9 9 10 10 10 11 11 10 10 10 10 11 10 10 9 10 9 8 9 10 11 11 10 10
1199A0%%jJ%%%%%j%J%Jj%%%%%Jj%jJJ%%j%%%JJjjJ%%%%%jjjK%jJJj%%jJ%%jJJ%%j%%%j%J%
$$ 10 10 10 9 10 10 10 10 10 10 9 9 10 10 11 10 10 10 10 10 10 11 10 10 9 10 11 11 11 10 10 10 10 11 12 11 10 11 11 11 11 11 11 10 9 8 10 10 9 10 11 10 10 10 9 10 10 10 9 10 11 11 11 10 10 10 10 9 9 10 10
1193A0%jjJ%%JjJJj%J%kJJj%J%%jJj%jJ%%JjJ%JjJ%jjJ%%JjJ%k%%J%%jJjJ%%%j%%jJ%%Jjj
$$ 10 10 9 8 9 9 9 10 9 10 11 10 10 11 11 9 10 11 10 10 11 11 11 10 11 10 10 9 10 10 10 11 10 11 11 12 11 12 12 11 10 11 11 11 12 11 12 12 10 10 10 11 11 11 10 11 10 11 11 11 11 10 10 10 9 10 10 10 11 10 9
1187IK%j%%%%%%%%%%%J%%j%%jJ%%%%%%%%JJjj%%%%%Jj%%jJ%%J%%J%j%j%%%%%j%K%k%J%J%j
$$ 9 11 11 10 10 10 10 10 10 10 10 10 10 10 10 11 11 11 10 10 10 9 10 10 10 10 10 10 10 10 10 11 12 11 10 10 10 10 10 10 11 10 10 10 9 10 10 10 11 11 11 12 12 11 11 10 10 10 10 10 10 9 9 11 11 9 9 10 10 11 11 10
1180A0%%%%%j%J%J%jjJ%Jj%%%j%JJjJ%%%%%j%j%KJ%jJjj%%%%K%j%%%%%JjjjKjJ%%jJj%%%%
$$ 10 10 10 10 10 10 9 9 10 10 11 11 10 9 10 10 11 10 10 10 10 9 9 10 11 10 11 11 11 11 11 11 10 10 9 9 11 12 12 11 12 11 10 10 10 10 10 12 12 11 11 11 11 11 11 12 11 10 9 11 10 11 11 11 10 11 10 10 10 10 10
1174A0jJJj%%J%j%%jK%j%%Jj%j%JJj%J%%%%%%jJJj%%jj%JJ%%%%%%%JjjJ%JjJj%%%j%%%%%J
$$ 10 9 10 11 10 10 10 11 11 10 10 10 9 11 11 10 10 10 11 10 10 9 9 10 11 10 10 11 11 11 11 11 11 11 10 11 12 11 11 11 10 9 9 10 11 11 11 11 11 11 11 11 12 11 10 11 11 12 11 12 11 11 11 11 10 10 10 10 10 10 11
1168A1j%%Jj%%%jJj%Jj%K%%jJ%%%J%k%%%%J%%%jJ%%%jJ%j%J%%%j%%%J%j%%%J%J%k%%%J%%%
$$ 11 10 10 10 11 10 10 10 10 9 10 9 9 10 9 9 11 11 11 10 11 11 11 11 12 12 10 10 10 10 10 11 11 11 11 10 11 11 11 11 10 11 11 10 10 11 11 11 11 10 10 10 10 11 11 10 10 10 10 11 11 12 12 10 10 10 10 11 11 11 11
1161A1j%JjjJ%Jj%%%%JJjJjjJj%J%j%JJjj%J%%jjJJ%%Jj%%%%j%%%Jj%%%J%%%%%%%%%j%%Jj
$$ 11 10 10 11 10 9 10 10 11 10 10 10 10 10 11 12 11 12 11 10 11 10 10 11 11 10 10 11 12 11 10 10 11 11 11 10 9 10 11 11 11 12 11 11 11 11 11 10 10 10 10 11 10 10 10 10 11 11 11 11 11 11 11 11 11 11 10 10 10 11 10
1155A0jJKjjJ%%%jJJj%%j%J%%%%%%Jj%jJj%J%j%%%%J%jJ%%Jj%%%%jJ%%j%J%j%%%%%%%%K%%
$$ 10 9 10 12 11 10 11 11 11 11 10 11 12 11 11 11 10 10 11 11 11 11 11 11 11 12 11 11 10 11 10 10 11 11 10 10 10 10 10 11 11 10 11 11 11 12 11 11 11 11 11 10 11 11 11 10 10 11 11 10 10 10 10 10 10 10 10 10 12 12 12
1148A2kj%J%J%j%%JjJ%j%%J%%%%jjJJj%%J%%%jjJ%J%%j%%JJj%J%jJjj%%%%JJkJJj%j%J%%%
$$ 12 10 9 9 10 10 11 11 10 10 10 11 10 11 11 10 10 10 11 11 11 11 11 10 9 10 11 10 10 10 11 11 11 11 10 9 10 10 11 11 11 10 10 10 11 12 11 11 12 12 11 12 11 10 10 10 10 10 11 12 10 11 12 11 11 10 10 11 11 11 11
1142A1%%%%%k%J%%Jj%%%%J%%%jJj%%Kjj%%%%%J%j%%J%%%Jj%%J%%%j%%Jjj%J%JjJ%jjJ%%Jj
$$ 11 11 11 11 11 11 9 9 10 10 10 11 10 10 10 10 10 11 11 11 11 10 11 10 10 10 12 11 10 10 10 10 10 10 11 11 10 10 10 11 11 11 11 12 11 11 11 12 12 12 12 11 11 11 12 11 10 10 11 11 12 11 12 12 11 10 11 11 11 12 11
1136A1%J%j%%Jj%jJ%%Jj%%j%J%%Jjj%J%%j%%JJ%jJj%%%%jjJKjJjJj%%JjJ%k%%%J%j%J%%%j
$$ 11 11 12 12 11 11 11 12 11 11 10 11 11 11 12 11 11 11 10 10 11 11 11 12 11 10 10 11 11 11 10 10 10 11 12 12 11 12 11 11 11 11 11 10 9 10 12 11 12 11 12 11 11 11 12 11 12 12 10 10 10 10 11 11 10 10 11 11 11 11 10
1129A0%%J%%%kJJ%J%%%%%%j%J%%j%j%jJJ%Jj%%%%%%%%%%jJ%%J%j%Jj%Jj%%j%J%jJ%%%J%jJ
$$ 10 10 10 11 11 11 11 9 10 11 11 12 12 12 12 12 12 12 11 11 12 12 12 11 11 10 10 9 10 11 11 12 11 11 11 11 11 11 11 11 11 11 11 10 11 11 11 12 12 11 11 12 11 11 12 11 11 11 10 10 11 11 10 11 11 11 11 12 12 11 12
1123A2j%%%%jJJk%Jj%JjK%%%%jjJ%Jj%j%%J%%jJ%%J%j%%jJ%%jjJJjJJj%JkJ%%%%%jJ%J%%%
$$ 12 11 11 11 11 11 10 11 12 10 10 11 10 10 11 10 12 12 12 12 12 11 10 11 11 12 11 11 10 10 10 11 11 11 10 11 11 11 12 12 11 11 11 10 11 11 11 10 9 10 11 10 11 12 11 11 12 10 11 11 11 11 11 11 10 11 11 12 12 12 12
1117A2j%%Jj%Jj%%%Jj%j%%KJJkj%%%JkJJj%%%%J%jJj%%%jJ%%J%j%%Jj%%%JjjJ%Jk%%J%j%J
$$ 12 11 11 11 12 11 11 12 11 11 11 11 12 11 11 10 10 10 12 13 14 12 11 11 11 11 12 10 11 12 11 11 11 11 11 12 12 11 12 11 11 11 11 10 11 11 11 12 12 11 11 11 12 11 11 11 11 12 11 10 11 11 12 10 10 10 11 11 10 10 11
1110A1%%%J%%j%%%jJ%jJ%%%jJ%%%jJ%Jj%%%J%%j%%%%J%%j%Jjj%%%JJj%%%j%JJj%%%J%%%%j
$$ 11 11 11 11 12 12 12 11 11 11 11 10 11 11 10 11 11 11 11 10 11 11 11 11 10 11 11 12 11 11 11 11 12 12 12 11 11 11 11 11 12 12 12 11 11 12 11 10 10 10 10 11 12 11 11 11 11 10 10 11 12 11 11 11 11 12 12 12 12 12 11
1104A1j%J%j%J%%jJ%j%%%%%%J%JjJ%kJJ%%%%%%j%%jJjJJJjj%%%jJ%%%%%%JkjK%J%%%%%j%%
$$ 11 10 10 11 11 10 10 11 11 11 10 11 11 10 10 10 10 10 10 10 11 11 12 11 12 12 10 11 12 12 12 12 12 12 12 11 11 11 10 11 10 11 12 13 12 11 11 11 11 10 11 11 11 11 11 11 11 12 10 9 11 11 12 12 12 12 12 12 11 11 11
1098A1%%%JkJ%%%%Jj%jJJj%%%%%j%%%KJj%jJj%%%%%J%%%%%%JjkJJj%%Jj%JjJ%%%%jJj%j%J
$$ 11 11 11 11 12 10 11 11 11 11 11 12 11 11 10 11 12 11 11 11 11 11 11 10 10 10 10 12 13 12 12 11 12 11 11 11 11 11 11 12 12 12 12 12 12 12 13 12 10 11 12 11 11 11 12 11 11 12 11 12 12 12 12 12 11 12 11 11 10 10 11
1091A1jJ%%jJ%%j%J%%%%jJ%jJ%%%JjJ%jJ%%%jJJkjJ%j%J%%%J%j%%%%%JJj%%j%J%jJjj%J%%
$$ 11 10 11 11 11 10 11 11 11 10 10 11 11 11 11 11 10 11 11 10 11 11 11 11 12 11 12 12 11 12 12 12 12 11 12 13 11 10 11 11 10 10 11 11 11 11 12 12 11 11 11 11 11 11 12 13 12 12 12 11 11 12 12 11 12 11 10 10 11 11 11
1085A1J%j%%%%%%J%j%%K%jJj%jjJjJjJ%%%%jJJjJjj%%K%j%%%J%j%JJjj%%jJ%JJjJj%%j%Jj
$$ 11 12 12 11 11 11 11 11 11 11 12 12 11 11 11 13 13 12 13 12 12 11 10 11 10 11 10 11 11 11 11 11 10 11 12 11 12 11 10 10 10 12 12 11 11 11 11 12 12 11 11 12 13 12 11 11 11 10 11 11 12 13 12 13 12 12 12 11 11 12 11
1079A1%J%%%jJ%%%j%%%jJJjJj%j%J%%%%j%J%k%%JJJj%%kKJj%%J%j%JkJjJ%JjjJJ%j%%%%J%
$$ 11 11 12 12 12 12 11 12 12 12 12 11 11 11 11 10 11 12 11 12 11 11 10 10 11 11 11 11 11 10 10 11 11 9 9 9 10 11 12 11 11 11 9 11 12 11 11 11 12 12 11 11 12 10 11 10 11 11 12 11 10 11 12 12 11 11 11 11 11 12 12
1072A2%j%%J%%kJj%Jj%J%jJj%JjJ%J%%Jjj%%%%K%jj%j%%J%j%%%JKj%jJ%j%j%%%JJJkJKk%j
$$ 12 12 11 11 11 12 12 12 10 11 10 10 11 10 10 11 11 10 11 10 10 11 10 11 11 12 12 12 13 12 11 11 11 11 11 13 13 12 11 11 10 10 10 11 11 10 10 10 10 11 13 12 12 11 12 12 11 11 10 10 10 10 11 12 13 11 12 14 12 12 11
1066A1%Jj%%%J%jjJ%%%J%%%%%jj%%%%%JjJjJ%%%%J%%%Kkj%jJJ%kJJ%%%Jj%%jjJ%J%%%jJj%
$$ 11 11 12 11 11 11 11 12 12 11 10 11 11 11 11 12 12 12 12 12 12 11 10 10 10 10 10 10 11 10 11 10 11 11 11 11 11 12 12 12 12 14 12 11 11 10 11 12 12 10 11 12 12 12 12 13 12 12 12 11 10 11 11 12 12 12 12 11 12 11 11
1059A1jJ%%J%jj%K%j%%%%%Jj%j%%K%j%%%%JjJ%%j%jJJj%Jk%%J%Jj%jJ%jJ%%jJ%%jJ%%%jJ%
$$ 11 10 11 11 11 12 12 11 10 10 12 12 11 11 11 11 11 11 12 11 11 10 10 10 12 12 11 11 11 11 11 12 11 12 12 12 11 11 10 11 12 11 11 12 10 10 10 11 11 12 11 11 10 11 11 10 11 11 11 10 11 11 11 10 11 11 11 11 10 11 11
1053A1%%JjJ%%%jjK%jJ%j%%J%j%%jJ%%%%%%%j%J%J%j%%%%%%J%j%%%jJKjj%JjJjjJ%j%J%%%
$$ 11 11 11 12 11 12 12 12 12 11 10 12 12 11 12 12 11 11 11 12 12 11 11 11 10 11 11 11 11 11 11 11 11 10 10 11 11 12 12 11 11 11 11 11 11 11 12 12 11 11 11 11 10 11 13 12 11 11 12 11 12 11 10 11 11 10 10 11 11 11 11
1047A1%jJJ%j%%%J%%Jjj%%j%J%%%%J%%jkJJ%jJ%%%%jJ%%%jJ%%jJ%%%%jJ%J%%jJj%jJJj%%%
$$ 11 11 10 11 12 12 11 11 11 11 12 12 12 13 12 11 11 11 10 10 11 11 11 11 11 12 12 12 11 9 10 11 11 10 11 11 11 11 11 10 11 11 11 11 10 11 11 11 10 11 11 11 11 11 10 11 11 12 12 12 11 12 11 11 10 11 12 11 11 11 11
1040A1%%%%%Jj%%Jj%%%j%J%%%%jK%jJ%j%%%Jk%jJJ%%J%%%%jj%%%J%jJ%%%J%j%%%%j%J%jJ%
$$ 11 11 11 11 11 11 12 11 11 11 12 11 11 11 11 10 10 11 11 11 11 11 10 12 12 11 12 12 11 11 11 11 12 10 10 9 10 11 11 11 12 12 12 12 12 11 10 10 10 10 11 11 10 11 11 11 11 12 12 11 11 11 11 11 10 10 11 11 10 11 11
1034A1%jJj%J%%%%jJ%%%j%%J%%Jj%J%%j%j%J%jjJj%JJ%%Jjj%%%J%jJJ%%j%%%%%%J%k%J%%%
$$ 11 11 10 11 10 10 11 11 11 11 11 10 11 11 11 11 10 10 10 11 11 11 12 11 11 12 12 12 11 11 10 10 11 11 10 9 10 9 9 10 11 11 11 12 11 10 10 10 10 11 11 10 11 12 12 12 11 11 11 11 11 11 11 12 12 10 10 11 11 11 11
1028A1%jJ%%J%jjJjJj%J%jj%JJJ%%%j%%%%%%JjJ%%%j%jJ%%jJ%j%%jJJ%%%%j%%Kj%%J%j%Jj
$$ 11 11 10 11 11 11 12 12 11 10 11 10 11 10 10 11 11 10 9 9 10 11 12 12 12 12 11 11 11 11 11 11 11 12 11 12 12 12 12 11 11 10 11 11 11 10 11 11 10 10 10 9 10 11 11 11 11 11 10 10 10 12 11 11 11 12 12 11 11 12 11
1021A1%%%%J%%j%%jJ%Jj%%%%j%%%JjJj%J%j%JJj%J%j%J%%j%%J%j%%%J%%Jjj%J%%%J%JjJ%j
$$ 11 11 11 11 11 12 12 12 11 11 11 10 11 11 12 11 11 11 11 11 10 10 10 10 11 10 11 10 10 11 11 10 10 11 12 11 11 12 12 11 11 12 12 12 11 11 11 12 12 11 11 11 11 12 12 12 13 12 11 11 12 12 12 12 13 13 14 13 14 14 13
1015A3%JjJ%jK%j%%%JJjjJJj%jJ%jj%%%%jJ%%%j%jJJjjJJ%jjJ%%jj%%%%Kj%J%%%%j%%%jJJ
$$ 13 13 14 13 14 14 13 15 15 14 14 14 14 15 16 15 14 15 16 15 15 14 15 15 14 13 13 13 13 13 12 13 13 13 13 12 12 11 12 13 12 11 12 13 13 12 11 12 12 12 11 10 10 10 10 10 12 11 11 12 12 12 12 12 11 11 11 11 10 11 12
1009A2j%%%%%%%j%%J%%%jJjJJJk%jJJj%j%J%%Jj%%%%jJ%j%%jJ%JJjJ%%%k%%%j%JJ%%%%j%%
$$ 12 11 11 11 11 11 11 11 11 10 10 10 11 11 11 11 10 11 10 11 12 13 11 11 10 11 12 11 11 10 10 11 11 11 12 11 11 11 11 11 10 11 11 10 10 10 9 10 10 11 12 11 12 12 12 12 10 10 10 10 9 9 10 11 11 11 11 11 10 10 10
1002A0JJ%j%j%%J%%J%%j%J%%kjJJ%%Jj%%%jJ%J%j%jJjJ%%%%J%%%%%j%j%%%J%Jjj%JJjj%%%
$$ 10 11 12 12 11 11 10 10 10 11 11 11 12 12 12 11 11 12 12 12 10 9 10 11 11 11 12 11 11 11 11 10 11 11 12 12 11 11 10 11 10 11 11 11 11 11 12 12 12 12 12 12 11 11 10 10 10 10 11 11 12 11 10 10 11 12 11 10 10 10 10
996A0J%%jJ%j%%%JjJ%%%%j%j%K%%%JkjJJ%%jJj%jJJjJ%j%Jj%J%jJ%%Jj%%%%%J%jj%%%%J%%
$$ 10 11 11 11 10 11 11 10 10 10 10 11 10 11 11 11 11 11 10 10 9 9 11 11 11 11 12 10 9 10 11 11 11 10 11 10 10 9 10 11 10 11 11 10 10 11 10 10 11 11 10 11 11 11 12 11 11 11 11 11 11 12 12 11 10 10 10 10 10 11 11 11
989A1%J%%%jj%JJk%%J%j%%%%%%J%%j%%%J%Jj%j%%%KjjJ%%k%%Jj%%%J%JJjkJ%jJ%%%%%%%%k
$$ 11 11 12 12 12 12 11 10 10 11 12 10 10 10 11 11 10 10 10 10 10 10 10 11 11 11 10 10 10 10 11 11 12 11 11 10 10 10 10 12 11 10 11 11 11 9 9 9 10 9 9 9 9 10 10 11 12 11 9 10 10 9 10 10 10 10 10 10 10 10 10 8
983HJJ%J%%%%%%%Jj%j%%%%J%%%Jj%%%%%%%j%J%%%%%Jj%%%%j%J%jjJ%%%%%JJjj%%J%k%J%Jj
$$ 8 9 10 10 11 11 11 11 11 11 11 11 12 11 11 10 10 10 10 10 11 11 11 11 12 11 11 11 11 11 11 11 11 10 10 11 11 11 11 11 11 12 11 11 11 11 11 10 10 11 11 10 9 10 10 10 10 10 10 11 12 11 10 10 10 11 11 9 9 10 10 11 10
976A0%Jj%J%%JjjJ%%%%jJ%%j%%%Jj%j%KjJ%j%%J%j%%Jj%JjJ%%j%%%J%j%J%j%%%%J%j%%Jjj
$$ 10 10 11 10 10 11 11 11 12 11 10 11 11 11 11 11 10 11 11 11 10 10 10 10 11 10 10 9 9 11 10 11 11 10 10 10 11 11 10 10 10 11 10 10 11 10 11 11 11 10 10 10 10 11 11 10 10 11 11 10 10 10 10 10 11 11 10 10 10 11 10 9
970I%%J%K%jj%%%%%%%Jj%J%%%%j%%%%JkJ%Jj%jJ%%%J%%%j%%%%jJ%%%J%kJ%JjJj%%J%%%%%j
$$ 9 9 9 10 10 12 12 11 10 10 10 10 10 10 10 10 11 10 10 11 11 11 11 11 10 10 10 10 10 11 9 10 10 11 10 10 9 10 10 10 10 11 11 11 11 10 10 10 10 10 9 10 10 10 10 11 11 9 10 10 11 10 11 10 10 10 11 11 11 11 11 11 10
963A0J%%j%%%%Jj%%Jj%J%%j%%%%%%%%J%j%%KkjJ%%%%%%%j%%JJkJ%J%%Jjj%%%%%%%%%%%%%j
$$ 10 11 11 11 10 10 10 10 10 11 10 10 10 11 10 10 11 11 11 10 10 10 10 10 10 10 10 10 11 11 10 10 10 12 10 9 10 10 10 10 10 10 10 10 9 9 9 10 11 9 10 10 11 11 11 12 11 10 10 10 10 10 10 10 10 10 10 10 10 10 10 9
957IJ%J%jjJ%%%jJJ%%j%j%%Jj%%%J%jJJ%j%%%jJJJ%kJ%%J%kj%%%%jJ%J%jJ%j%J%jJ%%%%%%
$$ 9 10 10 11 11 10 9 10 10 10 10 9 10 11 11 11 10 10 9 9 9 10 9 9 9 9 10 10 9 10 11 11 10 10 10 10 9 10 11 12 12 10 11 11 11 12 12 10 9 9 9 9 9 8 9 9 10 10 9 10 10 9 9 10 10 9 10 10 10 10 10 10 10
950A0%J%j%Jj%Jj%%%J%%j%%%jK%%jj%J%jJjJ%%J%Jj%%jJ%jj%%Jj%J%%%jJJ%j%%jJ%%%%%%%
$$ 10 10 11 11 10 10 11 10 10 11 10 10 10 10 11 11 11 10 10 10 10 9 11 11 11 10 9 9 10 10 9 10 9 10 10 10 11 11 12 11 11 11 10 11 11 10 9 9 9 10 9 9 10 10 10 10 9 10 11 11 10 10 10 9 10 10 10 10 10 10 10 10
944A0%%%%Jjj%%%%%%%%%J%%%%%%%j%%J%%j%%J%j%%%%J%j%JJJjjjJ%JJjj%%%%%%Jj%%%j%%J
$$ 10 10 10 10 10 11 10 9 9 9 9 9 9 9 9 9 9 10 10 10 10 10 10 10 10 9 9 9 10 10 10 9 9 9 10 10 9 9 9 9 9 10 10 9 9 10 11 12 11 10 9 10 10 11 12 11 10 10 10 10 10 10 10 11 10 10 10 10 9 9 9 10
938A0%%JjJjJj%%JjJ%%j%Jjj%KjjJ%%%%%%j%JjJ%%%%%%%jJ%%%%%%jJ%%jJ%%%jJjjK%%jJj%
$$ 10 10 10 11 10 11 10 11 10 10 10 11 10 11 11 11 10 10 11 10 9 9 11 10 9 10 10 10 10 10 10 10 9 9 10 9 10 10 10 10 10 10 10 10 9 10 10 10 10 10 10 10 9 10 10 10 9 10 10 10 10 9 10 9 8 10 10 10 9 10 9 9
931I%J%%%%%j%%%%%%jJjJJ%jJkJJ%%j%%%%J%j%%JJk%%J%%%J%%%%%%%%%j%J%j%%%%%jJ%jJ%
$$ 9 9 10 10 10 10 10 10 9 9 9 9 9 9 9 8 9 8 9 10 10 9 10 8 9 10 10 10 9 9 9 9 9 10 10 9 9 9 10 11 9 9 9 10 10 10 10 11 11 11 11 11 11 11 11 11 11 10 10 11 11 10 10 10 10 10 10 9 10 10 9 10 10
925A0j%%J%%%%j%%%J%j%K%Jjj%%%%%%jJ%%%%jJ%J%%kJ%%JjjjJ%jJJ%%%j%Kjj%%%jJ%%%J%j
$$ 10 9 9 9 10 10 10 10 10 9 9 9 9 10 10 9 9 11 11 12 11 10 10 10 10 10 10 10 9 10 10 10 10 10 9 10 10 11 11 11 9 10 10 10 11 10 9 8 9 9 8 9 10 10 10 10 9 9 11 10 9 9 9 9 8 9 9 9 9 10 10 9
918I%%%%%JjJj%J%%%jjJ%J%Jjj%%%%%%Jj%J%kJ%j%K%jJjJ%%jJ%j%%J%%%j%%%JJkJ%%%%%%j
$$ 9 9 9 9 9 9 10 9 10 9 9 10 10 10 10 9 8 9 9 10 10 11 10 9 9 9 9 9 9 9 10 9 9 10 10 8 9 9 8 8 10 10 9 10 9 10 10 10 9 10 10 9 9 9 10 10 10 10 9 9 9 9 10 11 9 10 10 10 10 10 10 10 9
912I%%K%jj%%%%%Jj%Jj%%%%%%JjjJj%KjJj%%jK%j%jJ%%jJ%jJ%J%j%%%%jJJ%j%%j%K%%j%J%
$$ 9 9 9 11 11 10 9 9 9 9 9 9 10 9 9 10 9 9 9 9 9 9 9 10 9 8 9 8 8 10 9 10 9 9 9 8 10 10 9 9 8 9 9 9 8 9 9 8 9 9 10 10 9 9 9 9 9 8 9 10 10 9 9 9 8 8 10 10 10 9 9 10 10
905A0j%%Jj%%J%%jj%%K%j%Jj%J%%j%j%%JJ%%j%%%%J%j%jJ%J%%jj%%%JJj%j%%%K%%j%Jj%J%
$$ 10 9 9 9 10 9 9 9 10 10 10 9 8 8 8 10 10 9 9 10 9 9 10 10 10 9 9 8 8 8 9 10 10 10 9 9 9 9 9 10 10 9 9 8 9 9 10 10 10 9 8 8 8 8 9 10 9 9 8 8 8 8 10 10 10 9 9 10 9 9 10 10
899A0j%J%jj%%JJj%jJj%J%%J%jjJ%j%jJ%J%%%%jJjJ%%%%Jj%j%%%Jj%%%%%%%J%Jj%J%%jJj%
$$ 10 9 9 10 10 9 8 8 8 9 10 9 9 8 9 8 8 9 9 9 10 10 9 8 9 9 8 8 7 8 8 9 9 9 9 9 8 9 8 9 9 9 9 9 10 9 9 8 8 8 8 9 8 8 8 8 8 8 8 8 9 9 10 9 9 10 10 10 9 10 9 9
892I%%%%%%jK%j%%%%j%J%jJ%%%JkjJ%%%J%J%%j%j%%J%j%Jj%%%%%J%%j%J%J%j%%%j%%J%%%%
$$ 9 9 9 9 9 9 9 8 10 10 9 9 9 9 9 8 8 9 9 8 9 9 9 9 10 8 7 8 8 8 8 9 9 10 10 10 9 9 8 8 8 9 9 8 8 9 8 8 8 8 8 8 9 9 9 8 8 9 9 10 10 9 9 9 9 8 8 8 9 9 9 9 9
886Ij%JjJ%%%%JjjJJjjJ%%J%%j%JjjKJk%J%%%%jJjjJ%Jj%%%%%%%j%%JJk%K%j%%Jjk%J%jjJ
$$ 9 8 8 9 8 9 9 9 9 9 10 9 8 9 10 9 8 9 9 9 10 10 10 9 9 10 9 8 10 11 9 9 10 10 10 10 10 9 10 9 8 9 9 10 9 9 9 9 9 9 9 9 8 8 8 9 10 8 8 10 10 9 9 9 10 9 7 7 8 8 7 6 7
879G%KJjjJJ%j%%J%jJJkJ%jj%%%%jJ%%%%Kjj%%%%%%%J%%%j%%%%%Jj%%%%J%jJ%j%J%jJj%j%
$$ 7 7 9 10 9 8 9 10 10 9 9 9 10 10 9 10 11 9 10 10 9 8 8 8 8 8 7 8 8 8 8 8 10 9 8 8 8 8 8 8 8 8 9 9 9 9 8 8 8 8 8 8 9 8 8 8 8 8 9 9 8 9 9 8 8 9 9 8 9 8 8 7 7
873GJ%J%j%J%%%%%%J%jJj%%j%%%%%%jJ%%%%%J%%JjJ%%%kJj%%JjJ%j%%%%%%Kj%%%j%%%J%%%
$$ 7 8 8 9 9 8 8 9 9 9 9 9 9 9 10 10 9 10 9 9 9 8 8 8 8 8 8 8 7 8 8 8 8 8 8 9 9 9 10 9 10 10 10 10 8 9 8 8 8 9 8 9 9 8 8 8 8 8 8 8 10 9 9 9 9 8 8 8 8 9 9 9 9
866I%%%%%%jj%JjK%j%J%%%%%%k%%Jj%J%J%jJ%j%J%jjJ%j%%KjJj%JjJ%kJJ%%%%%%JjjJ%%j%
$$ 9 9 9 9 9 9 9 8 7 7 8 7 9 9 8 8 9 9 9 9 9 9 9 7 7 7 8 7 7 8 8 9 9 8 9 9 8 8 9 9 8 7 8 8 7 7 7 9 8 9 8 8 9 8 9 9 7 8 9 9 9 9 9 9 9 10 9 8 9 9 9 8 8
859Hj%JJjJjjJ%J%Jk%J%j%J%%k%JK%%kJ%j%jJ%%%%%JjJJ%j%jjJJ%%%%j%%J%%%%j%%j%jJJJ
$$ 8 7 7 8 9 8 9 8 7 8 8 9 9 10 8 8 9 9 8 8 9 9 9 7 7 8 10 10 10 8 9 9 8 8 7 8 8 8 8 8 8 9 8 9 10 10 9 9 8 7 8 9 9 9 9 9 8 8 8 9 9 9 9 9 8 8 8 7 7 6 7 8 9
853I%%%%%j%%Jj%%J%j%%%%J%%%%jJ%%j%Jj%J%jjJ%%%%%jJ%%%j%K%jj%%J%%%%%%%%%J%j%%j
$$ 9 9 9 9 9 9 8 8 8 9 8 8 8 9 9 8 8 8 8 8 9 9 9 9 9 8 9 9 9 8 8 9 8 8 9 9 8 7 8 8 8 8 8 8 7 8 8 8 8 7 7 9 9 8 7 7 7 8 8 8 8 8 8 8 8 8 8 9 9 8 8 8 7
846GJ%%Jj%%%%j%%J%jKj%JjjJ%JjjJJj%j%Kj%%%jjJ%%%%JJ%j%%Jj%%%%%%%%%JjjKJ%jjJ%%
$$ 7 8 8 8 9 8 8 8 8 8 7 7 7 8 8 7 9 8 8 9 8 7 8 8 9 8 7 8 9 8 8 7 7 9 8 8 8 8 7 6 7 7 7 7 7 8 9 9 8 8 8 9 8 8 8 8 8 8 8 8 8 8 9 8 7 9 10 10 9 8 9 9 9
840IJJJj%%j%%j%jjJjJJj%jJ%jJJ%jJjJ%%%k%%J%%%Jj%%%%%%%%%%%%%J%jKjkJ%%jJ%j%JJ%
$$ 9 10 11 12 11 11 11 10 10 10 9 9 8 7 8 7 8 9 8 8 7 8 8 7 8 9 9 8 9 8 9 9 9 9 7 7 7 8 8 8 8 9 8 8 8 8 8 8 8 8 8 8 8 8 8 8 9 9 8 10 9 7 8 8 8 7 8 8 7 7 8 9 9
833I%%j%j%jJ%j%J%%J%%J%%%jJ%jj%%%%JJkJJj%%%jjK%%%%%%Jjj%%%%%%J%Jj%Jjj%%%j%Jj
$$ 9 9 9 8 8 7 7 6 7 7 6 6 7 7 7 8 8 8 9 9 9 9 8 9 9 8 7 7 7 7 7 8 9 7 8 9 8 8 8 8 7 6 8 8 8 8 8 8 8 9 8 7 7 7 7 7 7 7 8 8 9 8 8 9 8 7 7 7 7 6 6 7 6
827F%JJ%j%%%JjJ%%JjJ%jjJ%%%j%%jJJJk%Kj%Jjj%JjJj%%%J%j%J%%%j%J%%%J%jjJJ%jJjjK
$$ 6 6 7 8 8 7 7 7 7 8 7 8 8 8 9 8 9 9 8 7 8 8 8 8 7 7 7 6 7 8 9 7 7 9 8 8 9 8 7 7 8 7 8 7 7 7 7 8 8 7 7 8 8 8 8 7 7 8 8 8 8 9 9 8 7 8 9 9 8 9 8 7 9
820I%%%%j%%Jj%j%KjjJ%%j%JjJ%J%%%%jJjjJj%%%K%jJJk%J%%Jj%%j%%%%%%J%JjjjJj%%%j%
$$ 9 9 9 9 9 8 8 8 9 8 8 7 7 9 8 7 8 8 8 7 7 8 7 8 8 9 9 9 9 9 8 9 8 7 8 7 7 7 7 9 9 8 9 10 8 8 9 9 9 10 9 9 9 8 8 8 8 8 8 8 9 9 10 9 8 7 8 7 7 7 7 6 6
814FJJj%%J%j%J%%j%K%%%%j%%JjJkJjJJj%%%%%%%jJ%j%%%J%%%Jjj%%%%J%J%jJj%jj%J%%%j
$$ 6 7 8 7 7 7 8 8 7 7 8 8 8 7 7 9 9 9 9 9 8 8 8 9 8 9 7 8 7 8 9 8 8 8 8 8 8 8 8 7 8 8 7 7 7 7 8 8 8 8 9 8 7 7 7 7 7 8 8 9 9 8 9 8 8 7 6 6 7 7 7 7 6
807F%jJ%%Jj%KJj%%%JJjJ%j%Jj%K%jjJ%k%JjjJjJJj%j%J%JjJ%j%j%JJj%%%%%%%J%%j%%%%j
$$ 6 6 5 6 6 6 7 6 6 8 9 8 8 8 8 9 10 9 10 10 9 9 10 9 9 11 11 10 9 10 10 8 8 9 8 7 8 7 8 9 8 8 7 7 8 8 9 8 9 9 8 8 7 7 8 9 8 8 8 8 8 8 8 8 9 9 9 8 8 8 8 8 7
801G%J%%jJ%J%%%%jjJ%jJ%%j%%%jJ%%jJJ%jJ%%jJj%%jJJ%j%%%Jjj%KJk%J%%j%j%J%%jJ%%j
$$ 7 7 8 8 8 7 8 8 9 9 9 9 9 8 7 8 8 7 8 8 8 7 7 7 7 6 7 7 7 6 7 8 8 7 8 8 8 7 8 7 7 7 6 7 8 8 7 7 7 7 8 7 6 6 8 9 7 7 8 8 8 7 7 6 6 7 7 7 6 7 7 7 6
794FJJ%jK%j%%%%%%jJjJJj%%J%jjJ%%%jj%%J%%%%jJjJ%%%%J%%jJ%%j%J%j%%jJ%%%%%J%Jj%
$$ 6 7 8 8 7 9 9 8 8 8 8 8 8 8 7 8 7 8 9 8 8 8 9 9 8 7 8 8 8 8 7 6 6 6 7 7 7 7 7 6 7 6 7 7 7 7 7 8 8 8 7 8 8 8 7 7 8 8 7 7 7 6 7 7 7 7 7 7 8 8 9 8 8
787Hj%J%%%jJ%jJJj%j%%%Jj%Jj%%%j%%J%%J%J%jkJJ%J%kJ%jJ%jJjjJ%%%jJ%%jJ%%%Jj%%%%
$$ 8 7 7 8 8 8 8 7 8 8 7 8 9 8 8 7 7 7 7 8 7 7 8 7 7 7 7 6 6 6 7 7 7 8 8 9 9 8 6 7 8 8 9 9 7 8 8 7 8 8 7 8 7 6 7 7 7 7 6 7 7 7 6 7 7 7 7 8 7 7 7 7 7
781GJj%Jj%Jj%%J%j%jJ%%%j%%%J%%%%%J%%jjJjJ%%%j%%JJ%%j%%J%Jjk%JjJ%%J%j%%jJJj%J
$$ 7 8 7 7 8 7 7 8 7 7 7 8 8 7 7 6 7 7 7 7 6 6 6 6 7 7 7 7 7 7 8 8 8 7 6 7 6 7 7 7 7 6 6 6 7 8 8 8 7 7 7 8 8 9 8 6 6 7 6 7 7 7 8 8 7 7 7 6 7 8 7 7 8
774Hj%j%%%JJj%jJ%%j%J%Jj%%jJj%JJj%JkJjJ%jJ%%Jj%%%%%%jJ%%j%%J%%j%%J%j%%Jj%%%J
$$ 8 7 7 6 6 6 6 7 8 7 7 6 7 7 7 6 6 7 7 8 7 7 7 6 7 6 6 7 8 7 7 8 6 7 6 7 7 6 7 7 7 8 7 7 7 7 7 7 7 6 7 7 7 6 6 6 7 7 7 6 6 6 7 7 6 6 6 7 6 6 6 6 7
768G%%j%%%%J%%%%%Jj%jJJkJj%J%%j%%jK%%%Jj%%%%%%%JjJ%jjJJ%%jj%%J%%%jJ%J%k%J%%j
$$ 7 7 7 6 6 6 6 6 7 7 7 7 7 7 8 7 7 6 7 8 6 7 6 6 7 7 7 6 6 6 5 7 7 7 7 8 7 7 7 7 7 7 7 7 8 7 8 8 7 6 7 8 8 8 7 6 6 6 7 7 7 7 6 7 7 8 8 6 6 7 7 7 6
761FJ%jJj%%%%%%%%J%JjjjJ%Kj%%j%%jJ%Jj%%%%J%j%%J%%J%jJjJj%JjjJ%k%JJ%j%%JkJ%%%
$$ 6 7 7 6 7 6 6 6 6 6 6 6 6 6 7 7 8 7 6 5 6 6 8 7 7 7 6 6 6 5 6 6 7 6 6 6 6 6 7 7 6 6 6 7 7 7 8 8 7 8 7 8 7 7 8 7 6 7 7 5 5 6 7 7 6 6 6 7 5 6 6 6 6
755FJ%Jj%jJ%jjK%%%j%%J%jjJ%%J%%j%%J%%J%j%%%j%%%%%%%J%%j%%J%JjJjj%%J%j%%J%J%k
$$ 6 7 7 8 7 7 6 7 7 6 5 7 7 7 7 6 6 6 7 7 6 5 6 6 6 7 7 7 6 6 6 7 7 7 8 8 7 7 7 7 6 6 6 6 6 6 6 6 7 7 7 6 6 6 7 7 8 7 8 7 6 6 6 7 7 6 6 6 7 7 8 8 6
748F%J%jJ%j%J%JjjJ%%%%kJ%%J%%%Jjj%%J%jJj%Jj%%J%%%j%%J%j%%%%%%J%%jJJjJkjJ%%%J
$$ 6 6 7 7 6 7 7 6 6 7 7 8 7 6 7 7 7 7 7 5 6 6 6 7 7 7 7 8 7 6 6 6 7 7 6 7 6 6 7 6 6 6 7 7 7 7 6 6 6 7 7 6 6 6 6 6 6 6 7 7 7 6 7 8 7 8 6 5 6 6 6 6 7
742G%%%jJ%jJ%j%%%JjJ%j%%J%%%%%j%%%%J%%%%%Jjj%Jj%jJJj%%%%jJ%J%Jj%%j%Jjj%%%%%J
$$ 7 7 7 7 6 7 7 6 7 7 6 6 6 6 7 6 7 7 6 6 6 7 7 7 7 7 7 6 6 6 6 6 7 7 7 7 7 7 8 7 6 6 7 6 6 5 6 7 6 6 6 6 6 5 6 6 7 7 8 7 7 7 6 6 7 6 5 5 5 5 5 5 6
735FJk%JjJ%jJ%J%%j%%%jJ%Jj%KjJj%j%JJjJjjJj%%%%%J%Jj%jjJ%J%j%Jj%jJ%%J%%j%%%J%
$$ 6 7 5 5 6 5 6 6 5 6 6 7 7 7 6 6 6 6 5 6 6 7 6 6 8 7 8 7 7 6 6 7 8 7 8 7 6 7 6 6 6 6 6 6 7 7 8 7 7 6 5 6 6 7 7 6 6 7 6 6 5 6 6 6 7 7 7 6 6 6 6 7 7
729Gj%%j%JJ%jJ%%%%jJJ%j%jJj%%JJk%%jKJj%jJj%%Jj%%%Jj%%%%Jj%J%%%%jjJ%JjJ%%%j%%
$$ 7 6 6 6 5 5 6 7 7 6 7 7 7 7 7 6 7 8 8 7 7 6 7 6 6 6 7 8 6 6 6 5 7 8 7 7 6 7 6 6 6 7 6 6 6 6 7 6 6 6 6 6 7 6 6 7 7 7 7 7 6 5 6 6 7 6 7 7 7 7 6 6 6
722F%%j%J%j%%J%%%%%%j%J%%%%JJkkJ%%%%%K%jj%%%J%%JjJj%%%jJJ%%jJ%%%jjJKjj%jJJ%j
$$ 6 6 6 5 5 6 6 5 5 5 6 6 6 6 6 6 6 5 5 6 6 6 6 6 7 8 6 4 5 5 5 5 5 5 7 7 6 5 5 5 5 6 6 6 7 6 7 6 6 6 6 5 6 7 7 7 6 7 7 7 7 6 5 6 8 7 6 6 5 6 7 7 6
716FjJ%jJ%%%j%%Jj%%J%%%J%jjK%j%J%j%jJ%%%JKkj%j%%J%%%J%%%%kJJ%%%%Jjj%%Jj%%%%J
$$ 6 5 6 6 5 6 6 6 6 5 5 5 6 5 5 5 6 6 6 6 7 7 6 5 7 7 6 6 7 7 6 6 5 6 6 6 6 7 9 7 6 6 5 5 5 6 6 6 6 7 7 7 7 7 5 6 7 7 7 7 7 8 7 6 6 6 7 6 6 6 6 6 7
709Gj%%Jk%Kj%%%%%J%j%%%%j%%J%J%%%%jjJ%j%%%JJjJjJ%j%%%%%%J%%%j%J%%j%Jj%%%%%Jj
$$ 7 6 6 6 7 5 5 7 6 6 6 6 6 6 7 7 6 6 6 6 6 5 5 5 6 6 7 7 7 7 7 6 5 6 6 5 5 5 5 6 7 6 7 6 7 7 6 6 6 6 6 6 6 7 7 7 7 6 6 7 7 7 6 6 7 6 6 6 6 6 6 7 6
702F%J%%%%%j%%jjJJ%%%%%%%%%JJjj%%Jj%j%J%%%%J%%j%%Kjj%J%%j%jJ%%Jj%%J%j%%%%j%J
$$ 6 6 7 7 7 7 7 7 6 6 6 5 4 5 6 6 6 6 6 6 6 6 6 6 7 8 7 6 6 6 7 6 6 5 5 6 6 6 6 6 7 7 7 6 6 6 8 7 6 6 7 7 7 6 6 5 6 6 6 7 6 6 6 7 7 6 6 6 6 6 5 5 6
696F%%%%%JjjJ%%%%j%J%jJ%jJ%%%%%J%kJ%%JjJjJkJ%jJ%%Jj%%%%J%jJjJ%j%j%%%JjJ%%%%%
$$ 6 6 6 6 6 6 7 6 5 6 6 6 6 6 5 5 6 6 5 6 6 5 6 6 6 6 6 6 7 7 5 6 6 6 7 6 7 6 7 5 6 6 5 6 6 6 7 6 6 6 6 6 7 7 6 7 6 7 7 6 6 5 5 5 5 6 5 6 6 6 6 6 6
689F%%%%J%j%%%%%%%%%%jJJ%jJjj%J%%J%j%%Jj%Jj%JjJ%%%j%jJ%%%jKJj%%%jJjJ%%%j%%%j
$$ 6 6 6 6 6 7 7 6 6 6 6 6 6 6 6 6 6 6 5 6 7 7 6 7 6 5 5 6 6 6 7 7 6 6 6 7 6 6 7 6 6 7 6 7 7 7 7 6 6 5 6 6 6 6 5 7 8 7 7 7 7 6 7 6 7 7 7 7 6 6 6 6 5
683EJ%%%%%JJ%jj%JjJ%jJ%%jJj%J%%%%jjJ%j%%JJj%%Jj%%jJJ%j%%jJJJjj%%Kjj%jJJj%%j%
$$ 5 6 6 6 6 6 6 7 8 8 7 6 6 7 6 7 7 6 7 7 7 6 7 6 6 7 7 7 7 7 6 5 6 6 5 5 5 6 7 6 6 6 7 6 6 6 5 6 7 7 6 6 6 5 6 7 8 7 6 6 6 8 7 6 6 5 6 7 6 6 6 5 5
676EJJj%%Jj%jJ%%%%Jj%%%Jj%J%jJjJjJjJjjJ%%J%j%%%Jj%Jj%j%%JJjJ%%%%%%j%J%%%j%%%
$$ 5 6 7 6 6 6 7 6 6 5 6 6 6 6 6 7 6 6 6 6 7 6 6 7 7 6 7 6 7 6 7 6 7 6 5 6 6 6 7 7 6 6 6 6 7 6 6 7 6 6 5 5 5 6 7 6 7 7 7 7 7 7 7 6 6 7 7 7 7 6 6 6 6
670F%jJJ%j%Jj%Jj%jJ%%jJ%%j%%%J%%%Jj%j%JJ%%%j%%J%%%%jJj%JJjJjjJ%%%jj%J%%jJK%j
$$ 6 6 5 6 7 7 6 6 7 6 6 7 6 6 5 6 6 6 5 6 6 6 5 5 5 5 6 6 6 6 7 6 6 5 5 6 7 7 7 7 6 6 6 7 7 7 7 7 6 7 6 6 7 8 7 8 7 6 7 7 7 7 6 5 5 6 6 6 5 6 8 8 7
663G%%%jJ%%%jjJJj%%J%%j%j%J%%jJjJJjjJ%%J%%Jjj%%%%%JjJ%Jjj%JjJ%%%k%J%%%jJJ%jJ
$$ 7 7 7 7 6 7 7 7 7 6 5 6 7 6 6 6 7 7 7 6 6 5 5 6 6 6 5 6 5 6 7 6 5 6 6 6 7 7 7 8 7 6 6 6 6 6 6 7 6 7 7 8 7 6 6 7 6 7 7 7 7 5 5 6 6 6 6 5 6 7 7 6 7
657GjJ%%%%%%%Jj%j%%%%%JjjJ%jJ%J%%%j%%%j%J%%J%j%J%%%%%%j%Jj%jJJJ%j%j%%%%%%%%%
$$ 7 6 7 7 7 7 7 7 7 7 8 7 7 6 6 6 6 6 6 7 6 5 6 6 5 6 6 7 7 7 7 6 6 6 6 5 5 6 6 6 7 7 6 6 7 7 7 7 7 7 7 6 6 7 6 6 5 6 7 8 8 7 7 6 6 6 6 6 6 6 6 6 6
650FJ%j%%%%Jj%j%J%J%j%%%J%%%%j%J%j%%%%%%%%%J%%j%%%%J%%j%%%jjK%J%j%%%%%%jJjKJ
$$ 6 7 7 6 6 6 6 6 7 6 6 5 5 6 6 7 7 6 6 6 6 7 7 7 7 7 6 6 7 7 6 6 6 6 6 6 6 6 6 6 7 7 7 6 6 6 6 6 7 7 7 6 6 6 6 5 4 6 6 7 7 6 6 6 6 6 6 6 5 6 5 7 8
644Hk%%%%j%JjJJj%%%%jJ%J%%%%j%%%J%j%%jJ%jJJ%%%%Jjj%%%%J%%j%%%JjJjKjj%%Jj%%%%
$$ 8 6 6 6 6 6 5 5 6 5 6 7 6 6 6 6 6 5 6 6 7 7 7 7 7 6 6 6 6 7 7 6 6 6 5 6 6 5 6 7 7 7 7 7 8 7 6 6 6 6 6 7 7 7 6 6 6 6 7 6 7 6 8 7 6 6 6 7 6 6 6 6 6
637F%Jk%J%jJ%%Jj%j%%JJj%%%%Jj%%j%%JJj%Jj%%%j%JJJjJjj%JJ%jj%%%j%K%%%%%j%jJJ%j
$$ 6 6 7 5 5 6 6 5 6 6 6 7 6 6 5 5 5 6 7 6 6 6 6 6 7 6 6 6 5 5 5 6 7 6 6 7 6 6 6 6 5 5 6 7 8 7 8 7 6 6 7 8 8 7 6 6 6 6 5 5 7 7 7 7 7 7 6 6 5 6 7 7 6
631F%J%jJJjJk%%J%%%%j%%%J%%%Jj%%%Jk%jJJ%%jJ%%%%%%J%%jjJjjJJ%%%%%j%J%j%JjjJ%%
$$ 6 6 7 7 6 7 8 7 8 6 6 6 7 7 7 7 7 6 6 6 6 7 7 7 7 8 7 7 7 7 8 6 6 5 6 7 7 7 6 7 7 7 7 7 7 7 8 8 8 7 6 7 6 5 6 7 7 7 7 7 7 6 6 7 7 6 6 7 6 5 6 6 6
624FJ%%%%jJ%jJj%%J%%jjJK%%j%%j%%J%%%%j%%j%J%JJ%k%%%K%j%%%kJj%K%j%%jJJj%Jj%jJ
$$ 6 7 7 7 7 7 6 7 7 6 7 6 6 6 7 7 7 6 5 6 8 8 8 7 7 7 6 6 6 7 7 7 7 7 6 6 6 5 5 6 6 7 8 8 6 6 6 6 8 8 7 7 7 7 5 6 5 5 7 7 6 6 6 5 6 7 6 6 7 6 6 5 6
617F%J%%%%%J%%j%j%J%%Jj%%Jj%%jJJ%%%J%jj%%%%%%%%%J%j%J%%%J%j%%%Jj%Jj%%%%%%J%%
$$ 6 6 7 7 7 7 7 7 8 8 8 7 7 6 6 7 7 7 8 7 7 7 8 7 7 7 6 7 8 8 8 8 9 9 8 7 7 7 7 7 7 7 7 7 7 8 8 7 7 8 8 8 8 9 9 8 8 8 8 9 8 8 9 8 8 8 8 8 8 8 9 9 9
611IJ%jj%JJjjJ%%jJJ%j%%Jk%%J%%%%%%%%j%J%jj%%%J%%%%%J%%Jk%J%%%jJJJkj%J%%%Jj%%
$$ 9 10 10 9 8 8 9 10 9 8 9 9 9 8 9 10 10 9 9 9 10 8 8 8 9 9 9 9 9 9 9 9 9 8 8 9 9 8 7 7 7 7 8 8 8 8 8 8 9 9 9 10 8 8 9 9 9 9 8 9 10 11 9 8 8 9 9 9 9 10 9 9 9
604IJj%Jj%%%%%%%Jj%jJ%%k%%%JJ%jJJJjkjJ%%%Jj%j%J%j%J%%%J%%j%%%%j%j%%Jj%J%J%%%
$$ 9 10 9 9 10 9 9 9 9 9 9 9 9 10 9 9 8 9 9 9 7 7 7 7 8 9 9 8 9 10 11 10 8 7 8 8 8 8 9 8 8 7 7 8 8 7 7 8 8 8 8 9 9 9 8 8 8 8 8 7 7 6 6 6 7 6 6 7 7 8 8 8 8
598H%%j%%%JjjKJ%j%%j%J%j%Jj%Jj%%J%%%J%j%j%J%%%%%j%J%j%J%%%%j%jJ%%%%%%%%%KjjJ
$$ 8 8 8 7 7 7 7 8 7 6 8 9 9 8 8 8 7 7 8 8 7 7 8 7 7 8 7 7 7 8 8 8 8 9 9 8 8 7 7 8 8 8 8 8 8 7 7 8 8 7 7 8 8 8 8 8 7 7 6 7 7 7 7 7 7 7 7 7 7 9 8 7 8
591HjJ%%%j%J%jJ%J%j%%j%J%%%j%Lj%%%jJj%J%%%j%%%%%%%%jJ%%JjjJ%%jJJjj%%J%%%%j%%
$$ 8 7 8 8 8 8 7 7 8 8 7 8 8 9 9 8 8 8 7 7 8 8 8 8 7 7 10 9 9 9 9 8 9 8 8 9 9 9 9 8 8 8 8 8 8 8 8 8 7 8 8 8 9 8 7 8 8 8 7 8 9 8 7 7 7 8 8 8 8 8 7 7 7
585G%%J%%%JjJ%%%%jJ%%%%j%JJ%Jj%jjJ%%JjjJ%%jJJj%%jJ%jJ%j%J%J%kJJ%j%%%J%kjJJ%j
$$ 7 7 7 8 8 8 8 9 8 9 9 9 9 9 8 9 9 9 9 9 8 8 9 10 10 11 10 10 9 8 9 9 9 10 9 8 9 9 9 8 9 10 9 9 9 8 9 9 8 9 9 8 8 9 9 10 10 8 9 10 10 9 9 9 9 10 10 8 7 8 9 9 8
578HJJ%%%%j%%%J%JjJj%%%%Kj%J%%%jJ%j%J%%j%%jJj%%j%J%%JJj%%j%J%j%J%%%%%%Jj%%%%
$$ 8 9 10 10 10 10 10 9 9 9 9 10 10 11 10 11 10 10 10 10 10 12 11 11 12 12 12 12 11 12 12 11 11 12 12 12 11 11 11 10 11 10 10 10 9 9 10 10 10 11 12 11 11 11 10 10 11 11 10 10 11 11 11 11 11 11 11 12 11 11 11 11 11
572A1%Jj%%jK%%Jjj%JjJ%%J%jJ%JjJ%jj%%%K%jJj%Jj%J%kjJ%%%J%jJ%%jJKkjKjJ%%%JjjJj
$$ 11 11 12 11 11 11 10 12 12 12 13 12 11 11 12 11 12 12 12 13 13 12 13 13 14 13 14 14 13 12 12 12 12 14 14 13 14 13 13 14 13 13 14 14 12 11 12 12 12 12 13 13 12 13 13 13 12 13 15 13 12 14 13 14 14 14 14 15 14 13 14 13
565A3%J%%Jjj%K%j%%%Jj%J%J%%J%%%%%%jjjJ%%%%JJJj%J%j%%J%j%%J%J%jJ%%J%%%%jJ%J%J
$$ 13 13 14 14 14 15 14 13 13 15 15 14 14 14 14 15 14 14 15 15 16 16 16 17 17 17 17 17 17 17 16 15 14 15 15 15 15 15 16 17 18 17 17 18 18 17 17 17 18 18 17 17 17 18 18 19 19 18 19 19 19 20 20 20 20 20 19 20 20 21 21 22
559B2j%JJj%%J%%%%Kj%JK%j%JJ%J%%%JJ%%%%JJ%%%K%J%%KJ%%%K%KJ%%%KJJ%JLJJJ%JJKJKK
$$ 22 21 21 22 23 22 22 22 23 23 23 23 23 25 24 24 25 27 27 26 26 27 28 28 29 29 29 29 30 31 31 31 31 31 32 33 33 33 33 35 35 36 36 36 38 39 39 39 39 41 41 43 44 44 44 44 46 47 48 48 49 52 53 54 55 55 56 57 59 60 62 64
552F4KJLKJLKKLLKLMLKLMMNNMMNOPNOPPNRQRRRRRJ0J3J0J0J3J2J2J2J3J2J0J1J1J0QQONMJ
$$ 64 66 67 70 72 73 76 78 80 83 86 88 91 95 98 100 103 107 111 116 121 125 129 134 140 147 152 158 165 172 177 186 194 203 212 221 230 239 249 262 272 282 295 307 319 331 344 356 366 377 388 398 406 414 420 425 429 430
547D30J%lknnpqpj0qqrrrrqqrpnnnnommmnkkjj%jJ%KLJKKLLMNNNOQOPRRQPPJ0J0QQQPPNPN
$$ 430 431 431 428 426 421 416 409 401 394 384 376 368 359 350 341 332 324 316 307 300 295 290 285 280 274 270 266 262 257 255 253 252 251 251 250 251 251 253 256 257 259 261 264 267 271 276 281 286 292 300 306 313 322 331 339 346 353 363 373 381 389 397 404 411 416 423 428
541D28JK%klmopqj0j0j2j1j1j4j3j1j2j3j1j1j1j0j1rrrqqqqopooplonmmmlmmmkllkklljl
$$ 428 429 431 431 429 426 422 416 409 401 391 381 369 358 347 333 320 309 297 284 273 262 251 241 230 221 212 203 195 187 179 171 165 158 152 146 139 136 130 125 121 117 113 110 106 102 98 96 93 90 88 86 83 80 79 76
536G6kjlj%kk%kkjjjj%k%JkkJkj%jjjk%jjjj%jjjjj%%jj%kjjj%%%%jjJjjJ%j%jjj%j%jJ%%
$$ 76 74 73 70 69 69 67 65 65 63 61 60 59 58 57 57 55 55 56 54 52 53 51 50 50 49 48 47 45 45 44 43 42 41 41 40 39 38 37 36 36 36 35 34 34 32 31 30 29 29 29 29 29 28 27 28 27 26 27 27 26 26 25 24 23 23 22 22 21 22 22 22
530B2JkjJ%%%Jjj%j%%%%Jj%Jj%j%%%JjjjJj%JjJ%j%Kjj%j%J%j%j%%%%%jJJ%%%j%KJj%%jj%
$$ 22 23 21 20 21 21 21 21 22 21 20 20 19 19 19 19 19 20 19 19 20 19 19 18 18 18 18 19 18 17 16 17 16 16 17 16 17 17 16 16 18 17 16 16 15 15 16 16 15 15 14 14 14 14 14 14 13 14 15 15 15 15 14 14 16 17 16 16 16 15 14 14
523A4%%j%%%J%JjJ%%%%j%JkJ%%%jj%%%J%J%k%%JKjkJ%%%%jJj%%jJ%j%jJ%%%J%%jJ%%jJ%%%
$$ 14 14 14 13 13 13 13 14 14 15 14 15 15 15 15 15 14 14 15 13 14 14 14 14 13 12 12 12 12 13 13 14 14 12 12 12 13 15 14 12 13 13 13 13 13 12 13 12 12 12 11 12 12 11 11 10 11 11 11 11 12 12 12 11 12 12 12 11 12 12 12 12
517A2%JkK%j%%%jJ%%Jj%kJ%%%%JJj%j%%jJ%Jj%%%jJj%J%%j%Jj%%j%JJjJj%%%%%%%%Jjj%Jj
$$ 12 12 13 11 13 13 12 12 12 12 11 12 12 12 13 12 12 10 11 11 11 11 11 12 13 12 12 11 11 11 10 11 11 12 11 11 11 11 10 11 10 10 11 11 11 10 10 11 10 10 10 9 9 10 11 10 11 10 10 10 10 10 10 10 10 10 11 10 9 9 10 9
510I%%%%%J%%%J%%%j%j%%JJ%kJJj%%%jJ%J%j%%%Jj%%k%JK%jJ%%%j%%J%j%%%%J%%%k%%jKJk
$$ 9 9 9 9 9 9 10 10 10 10 11 11 11 11 10 10 9 9 9 10 11 11 9 10 11 10 10 10 10 9 10 10 11 11 10 10 10 10 11 10 10 10 8 8 9 11 11 10 11 11 11 11 10 10 10 11 11 10 10 10 10 10 11 11 11 11 9 9 9 8 10 11 9
504I%%jJ%JJ%k%JJJj%%j%%J%%%%jjJ%%jJj%J%%%%Jj%%j%%%%%Kj%Jj%J%j%%J%%j%%J%%jJJk
$$ 9 9 9 8 9 9 10 11 11 9 9 10 11 12 11 11 11 10 10 10 11 11 11 11 11 10 9 10 10 10 9 10 9 9 10 10 10 10 10 11 10 10 10 9 9 9 9 9 9 11 10 10 11 10 10 11 11 10 10 10 11 11 11 10 10 10 11 11 11 10 11 12 10
497A0%JJj%%jJj%%%%%Jjj%%J%%%%jJJ%j%%%%%%%%J%jJJj%%%Jjj%J%j%JjJj%Kj%J%%JJ%%J%
$$ 10 10 11 12 11 11 11 10 11 10 10 10 10 10 10 11 10 9 9 9 10 10 10 10 10 9 10 11 11 10 10 10 10 10 10 10 10 10 11 11 10 11 12 11 11 11 11 12 11 10 10 11 11 10 10 11 10 11 10 10 12 11 11 12 12 12 13 14 14 14 15 15
491A5%%Jjjjk%%%JkJ%J%j%jJ%%%Jj%j%KJjjjJJ%jJJk%%%%JJ%%JkJ%j%%j%%%J%%J%%%%%JjJ
$$ 15 15 15 16 15 14 13 11 11 11 11 12 10 11 11 12 12 11 11 10 11 11 11 11 12 11 11 10 10 12 13 12 11 10 11 12 12 11 12 13 11 11 11 11 11 12 13 13 13 14 12 13 13 12 12 12 11 11 11 11 12 12 12 13 13 13 13 13 13 14 13 14
484A4JjJJ%%Jjjj%J%j%jJ%%jJJ%jj%%%%%%kJJj%%%jJ%J%J%jJ%jKJ%jKjJ%Jj%j%%%jjjJjJ%
$$ 14 15 14 15 16 16 16 17 16 15 14 14 15 15 14 14 13 14 14 14 13 14 15 15 14 13 13 13 13 13 13 13 11 12 13 12 12 12 12 11 12 12 13 13 14 14 13 14 14 13 15 16 16 15 17 16 17 17 18 17 17 16 16 16 16 15 14 13 14 13 14 14
478A4%%%j%J%%%%%Jj%K%jJ%jJ%%J%%JJj%%%%JjJ%J%JJJ%%J%JJJ%K%jJ%KJ%%Jj%%ljjjkjkj
$$ 14 14 14 14 13 13 14 14 14 14 14 14 15 14 14 16 16 15 16 16 15 16 16 16 17 17 17 18 19 18 18 18 18 18 19 18 19 19 20 20 21 22 23 23 23 24 24 25 26 27 27 29 29 28 29 29 31 32 32 32 33 32 32 32 29 28 27 26 24 23 21 20
471B0%%kjk%J%j%j%j%%JjJ%j%j%jJ%%%jjJ%JjJj%jjJJjJJj%J%%jj%%j%JjjjJ%%J%J%jJ%%%
$$ 20 20 20 18 17 15 15 16 16 15 15 14 14 13 13 13 14 13 14 14 13 13 12 12 11 12 12 12 12 11 10 11 11 12 11 12 11 11 10 9 10 11 10 11 12 11 11 12 12 12 11 10 10 10 9 9 10 9 8 7 8 8 8 9 9 10 10 9 10 10 10 10
465A0JJjj%%j%JJj%JjJj%JJjj%Jjj%%%%%K%j%%Jk%%Kj%%%%j%j%JJ%jJ%%%%jjJJ%j%jjKJj%
$$ 10 11 12 11 10 10 10 9 9 10 11 10 10 11 10 11 10 10 11 12 11 10 10 11 10 9 9 9 9 9 9 11 11 10 10 10 11 9 9 9 11 10 10 10 10 10 9 9 8 8 9 10 10 9 10 10 10 10 10 9 8 9 10 10 9 9 8 7 9 10 9 9
459IJ%%%%%jj%%%%%J%%Jj%%%%%%%J%%jJj%%%%J%%j%%Jj%%%%%%%j%%JjJJj%%jJj%jK%j%%Kj
$$ 9 10 10 10 10 10 10 9 8 8 8 8 8 8 9 9 9 10 9 9 9 9 9 9 9 9 10 10 10 9 10 9 9 9 9 9 10 10 10 9 9 9 10 9 9 9 9 9 9 9 9 8 8 8 9 8 9 10 9 9 9 8 9 8 8 7 9 9 8 8 8 10 9
452IJj%%JjJ%JkJ%%%%Jj%KjJ%jJj%%J%%J%%%%%jJ%JK%KJKLLJJJL%%jjkkjkjjJjKJ%%KLLMK
$$ 9 10 9 9 9 10 9 10 10 11 9 10 10 10 10 10 11 10 10 12 11 12 12 11 12 11 11 11 12 12 12 13 13 13 13 13 13 12 13 13 14 16 16 18 19 21 24 27 28 29 30 33 33 33 32 31 29 27 26 24 23 22 23 22 24 25 25 25 27 30 33 37 39
445C9MOOQJ1J0RJ0QMJjorj0j2j0qponlmlklk%jjjkj%jKj%JjJJJKJKKKLMjjjklljkjj%j%JJ
$$ 39 43 49 55 63 74 84 93 103 111 115 116 115 109 100 90 78 68 60 53 47 42 39 35 32 30 27 25 25 24 23 22 20 19 19 18 20 19 19 20 19 20 21 22 24 25 27 29 31 34 38 37 36 35 33 30 27 26 24 23 22 22 21 21 22 23
440B3%JKKKKLKMNPPRRRRQPM%nrrj0j1j0roommlljkjkk%%j%k%%j%%%j%%%%j%J%%%J%JjJ%j%
$$ 23 23 24 26 28 30 32 35 37 41 46 53 60 69 78 87 96 104 111 115 115 110 101 92 82 71 61 52 46 40 36 32 29 26 25 23 22 20 18 18 18 17 17 15 15 15 14 14 14 14 13 13 13 13 13 12 12 13 13 13 13 14 14 15 14 15 15 14 14
433A4JJ%%%j%JjjJj%%jJJ%JJ%j%%%J%JKJJ%KJKKKKMLNQRJ0J3J7K0K3K3K1J7R%j1j9k4k5k2
$$ 14 15 16 16 16 16 15 15 16 15 14 15 14 14 14 13 14 15 15 16 17 17 16 16 16 16 17 17 18 20 21 22 22 24 25 27 29 31 33 37 40 45 53 62 72 85 102 122 145 168 189 206 215 215 204 185 161 136 114
428A14j9j4j2j0pnmmlljk%k%jJjj%jj%kkJ%j%%%%%%%%j%%JJJJj%JK%KJJLKMKNNQQJ1J6J7K1
$$ 114 95 81 69 59 52 47 43 39 36 33 32 30 30 28 28 27 28 27 26 26 25 24 24 22 20 21 21 20 20 20 20 20 20 20 20 20 19 19 19 20 21 22 23 22 22 23 25 25 27 28 29 32 34 38 40 45 50 58 66 77 93 110 131
422A31K3K2J9J2Mnj6k2k6k4k1j5j3j0roollkkkkkjj%%j%%jjj%%j%%k%j%J%j%%jjJ%JjjJjJ
$$ 131 154 176 195 207 211 206 190 168 142 118 97 82 69 59 50 44 38 35 32 30 28 26 24 22 21 20 20 20 19 19 19 18 17 16 16 16 15 15 15 13 13 12 12 13 13 12 12 12 11 10 11 11 12 11 10 11 10 11
417A1j%%%Jj%jjJ%%jJ%jJJj%%%%j%Jj%%%J%%%%j%Jj%K%j%kJ%%Jj%JjjJ%j%%JJj%Jj%%%JJj
$$ 11 10 10 10 10 11 10 10 9 8 9 9 9 8 9 9 8 9 10 9 9 9 9 9 8 8 9 8 8 8 8 9 9 9 9 9 8 8 9 8 8 10 10 9 9 7 8 8 8 9 8 8 9 8 7 8 8 7 7 7 8 9 8 8 9 8 8 8 8 9 10 9
411I%%%Jj%%jJ%Jj%%%%%JjjKjjJ%%%%%%jJ%jJ%j%J%jJ%j%%%%%%j%%J%%%jJ%%%j%JJj%%%%j
$$ 9 9 9 9 10 9 9 9 8 9 9 10 9 9 9 9 9 9 10 9 8 10 9 8 9 9 9 9 9 9 9 8 9 9 8 9 9 8 8 9 9 8 9 9 8 8 8 8 8 8 8 7 7 7 8 8 8 8 7 8 8 8 8 7 7 8 9 8 8 8 8 8 7
404G%Jj%K%%%%jj%Kj%J%Jj%J%j%%jJ%J%%jj%%%%%%%%%%jJ%%%jJ%%j%JJj%Jj%%%%%jJ%Jj%%
$$ 7 7 8 7 7 9 9 9 9 9 8 7 7 9 8 8 9 9 10 9 9 10 10 9 9 9 8 9 9 10 10 10 9 8 8 8 8 8 8 8 8 8 8 8 7 8 8 8 8 7 8 8 8 7 7 8 9 8 8 9 8 8 8 8 8 8 7 8 8 9 8 8 8
398HJ%%%jJj%JjJjjJ%Jj%J%jJ%j%J%J%%jJ%%j%%%%%%jJ%J%%%%%jJ%JJJ%Jj%J%j%jjjj%%JJ
$$ 8 9 9 9 9 8 9 8 8 9 8 9 8 7 8 8 9 8 8 9 9 8 9 9 8 8 9 9 10 10 10 9 10 10 10 9 9 9 9 9 9 9 8 9 9 10 10 10 10 10 10 9 10 10 11 12 13 13 14 13 13 14 14 13 13 12 11 10 9 9 9 10 11
391A1j%J%jJj%%%%%Jj%%%%jJjJjj%%%J%jJj%JJj%%%%J%j%%J%%jJJJj%J%%J%%j%%%j%jJ%jj
$$ 11 10 10 11 11 10 11 10 10 10 10 10 10 11 10 10 10 10 10 9 10 9 10 9 8 8 8 8 9 9 8 9 8 8 9 10 9 9 9 9 9 10 10 9 9 9 10 10 10 9 10 11 12 11 11 12 12 12 13 13 13 12 12 12 12 11 11 10 11 11 10 9
385IJj%J%%%%%%%J%%%%j%%jJ%j%%%%%jj%jJJ%%jK%%%%%j%%%%jjJJJj%J%%%%%%%jJ%k%Jj%J
$$ 9 10 9 9 10 10 10 10 10 10 10 10 11 11 11 11 11 10 10 10 9 10 10 9 9 9 9 9 9 8 7 7 6 7 8 8 8 7 9 9 9 9 9 9 8 8 8 8 8 7 6 7 8 9 8 8 9 9 9 9 9 9 9 9 8 9 9 7 7 8 7 7 8
378H%%%%%jJjjJ%Jj%%J%%J%%%k%%JJ%kJJ%%kjJJjJ%%J%k%%%Kj%%%Jk%JJ%jj%%j%JJjJ%jJj
$$ 8 8 8 8 8 8 7 8 7 6 7 7 8 7 7 7 8 8 8 9 9 9 9 7 7 7 8 9 9 7 8 9 9 9 7 6 7 8 7 8 8 8 9 9 7 7 7 7 9 8 8 8 8 9 7 7 8 9 9 8 7 7 7 6 6 7 8 7 8 8 7 8 7
372GJ%%%j%kK%j%jKJj%jJJ%%%%jjJJ%jJJj%%JkJJj%%%%%%%%%%%jJjjJ%JJjj%%%J%%jJjJ%%
$$ 7 8 8 8 8 7 7 5 7 7 6 6 5 7 8 7 7 6 7 8 8 8 8 8 7 6 7 8 8 7 8 9 8 8 8 9 7 8 9 8 8 8 8 8 8 8 8 8 8 8 8 7 8 7 6 7 7 8 9 8 7 7 7 7 8 8 8 7 8 7 8 8 8
365H%jJ%jJ%j%j%Jj%JjJ%%Jj%%%Jj%j%JJ%j%%%%j%JJj%%j%JKjj%%jjJJkJ%jJj%%%KJj%%jJ
$$ 8 8 7 8 8 7 8 8 7 7 6 6 7 6 6 7 6 7 7 7 8 7 7 7 7 8 7 7 6 6 7 8 8 7 7 7 7 7 6 6 7 8 7 7 7 6 6 7 9 8 7 7 7 6 5 6 7 5 6 6 5 6 5 5 5 5 7 8 7 7 7 6 7
358GJ%%%j%%j%%%%J%%%%%jJkjJJJjJ%%%j%jJ%jKJk%JJ%jjJj%%%%JJkj%%%%%%J%k%K%jJJk%
$$ 7 8 8 8 8 7 7 7 6 6 6 6 6 7 7 7 7 7 7 6 7 5 4 5 6 7 6 7 7 7 7 6 6 5 6 6 5 7 8 6 6 7 8 8 7 6 7 6 6 6 6 6 7 8 6 5 5 5 5 5 5 5 6 6 4 4 6 6 5 6 7 5 5
352EKk%J%%%%%%%%j%%%J%j%%%%J%%%j%%J%%%j%J%%%Jj%%J%jj%%%Jj%%J%%j%%K%j%%j%%%%J
$$ 5 7 5 5 6 6 6 6 6 6 6 6 6 5 5 5 5 6 6 5 5 5 5 5 6 6 6 6 5 5 5 6 6 6 6 5 5 6 6 6 6 7 6 6 6 7 7 6 5 5 5 5 6 5 5 5 6 6 6 5 5 5 7 7 6 6 6 5 5 5 5 5 6
345F%J%%%j%Jj%%%J%jj%%%%%%%%jJ%%jJ%%Jj%%jjKJj%%JJjjKkjJJ%%%%%jJ%%%%k%%J%%JjJ
$$ 6 6 7 7 7 7 6 6 7 6 6 6 6 7 7 6 5 5 5 5 5 5 5 5 5 4 5 5 5 4 5 5 5 6 5 5 5 4 3 5 6 5 5 5 6 7 6 5 7 5 4 5 6 6 6 6 6 6 5 6 6 6 6 6 4 4 4 5 5 5 6 5 6
339Fj%j%%JJJjjJJj%%%%jJJk%%%Jj%%%%%%jJ%Jk%%J%J%k%J%%%%%%J%%%j%J%%%%%%jJ%%J%k
$$ 6 5 5 4 4 4 5 6 7 6 5 6 7 6 6 6 6 6 5 6 7 5 5 5 5 6 5 5 5 5 5 5 5 4 5 5 6 4 4 4 5 5 6 6 4 4 5 5 5 5 5 5 5 6 6 6 6 5 5 6 6 6 6 6 6 6 5 6 6 6 7 7 5
332Ej%%K%%j%JJjjJ%Jj%j%%%J%j%Jj%J%%%Jjj%KjJ%%%jJ%%%j%j%JJ%jj%J%jjKJ%%%j%%%j%
$$ 5 4 4 4 6 6 6 5 5 6 7 6 5 6 6 7 6 6 5 5 5 5 6 6 5 5 6 5 5 6 6 6 6 7 6 5 5 7 6 7 7 7 7 6 7 7 7 7 6 6 5 5 6 7 7 6 5 5 6 6 5 4 6 7 7 7 7 6 6 6 6 5 5
326EJ%%%jJ%jJ%jKj%%J%%j%Jj%JjJ%%J%%%%j%%Jjjj%%JJkJ%%J%%%%j%jJ%%%Jjj%%%%J%Jjj
$$ 5 6 6 6 6 5 6 6 5 6 6 5 7 6 6 6 7 7 7 6 6 7 6 6 7 6 7 7 7 8 8 8 8 8 7 7 7 8 7 6 5 5 5 6 7 5 6 6 6 7 7 7 7 7 6 6 5 6 6 6 6 7 6 5 5 5 5 5 6 6 7 6 5
319E%%JJjj%%%%%J%%jJ%%jJJk%%%J%%%j%J%%%%%%%%%J%%%j%%%%j%J%%%jJJj%j%J%%%jJ%%J
$$ 5 5 5 6 7 6 5 5 5 5 5 5 6 6 6 5 6 6 6 5 6 7 5 5 5 5 6 6 6 6 5 5 6 6 6 6 6 6 6 6 6 6 7 7 7 7 6 6 6 6 6 5 5 6 6 6 6 5 6 7 6 6 5 5 6 6 6 6 5 6 6 6 7
313Gj%%%j%J%%%jJjJ%%%jJjJJj%%%%%%%%J%%jjJ%k%J%JjJ%%j%JJ%%j%%j%%%%%Jj%%%%%jJ%
$$ 7 6 6 6 6 5 5 6 6 6 6 5 6 5 6 6 6 6 5 6 5 6 7 6 6 6 6 6 6 6 6 6 7 7 7 6 5 6 6 4 4 5 5 6 5 6 6 6 5 5 6 7 7 7 6 6 6 5 5 5 5 5 5 6 5 5 5 5 5 5 4 5 5
306EjJJ%j%%%%k%JJj%%JJj%Jj%jK%%jJj%%j%K%j%%%%J%j%%%j%%J%%%%J%%jj%J%kJ%%%j%J%
$$ 5 4 5 6 6 5 5 5 5 5 3 3 4 5 4 4 4 5 6 5 5 6 5 5 4 6 6 6 5 6 5 5 5 4 4 6 6 5 5 5 5 5 6 6 5 5 5 5 4 4 4 5 5 5 5 5 6 6 6 5 4 4 5 5 3 4 4 4 4 3 3 4 4
300DJ%j%JJJjj%Jj%j%%%j%Kj%Jj%j%KJjj%%%%%JJj%J%k%Jjj%J%%%%%J%j%%%%j%%JJjJ%j%j
$$ 4 5 5 4 4 5 6 7 6 5 5 6 5 5 4 4 4 4 3 3 5 4 4 5 4 4 3 3 5 6 5 4 4 4 4 4 4 5 6 5 5 6 6 4 4 5 4 3 3 4 4 4 4 4 4 5 5 4 4 4 4 4 3 3 3 4 5 4 5 5 4 4 3
293C%%JjjJ%J%JJjj%%%%jJj%Jj%%Jj%JJ%%k%JJ%jjJjJ%%J%jJ%j%%Jj%J%jj%%JJJ%k%%%%%%
$$ 3 3 3 4 3 2 3 3 4 4 5 6 5 4 4 4 4 4 3 4 3 3 4 3 3 3 4 3 3 4 5 5 5 3 3 4 5 5 4 3 4 3 4 4 4 5 5 4 5 5 4 4 4 5 4 4 5 5 4 3 3 3 4 5 6 6 4 4 4 4 4 4 4
286DJjJkJJjj%J%jJ%%jJ%%%%%%Jj%%JJkkJJ%%j%J%j%Jj%%%%J%%%%%jJj%J%%%%%%%%J%%%k%
$$ 4 5 4 5 3 4 5 4 3 3 4 4 3 4 4 4 3 4 4 4 4 4 4 4 5 4 4 4 5 6 4 2 3 4 4 4 3 3 4 4 3 3 4 3 3 3 3 3 4 4 4 4 4 4 3 4 3 3 4 4 4 4 4 4 4 4 4 5 5 5 5 3 3
280C%Jj%J%j%%%%%%%Jj%%%J%%Jj%%j%%%%%%%%j%JJjj%KJjj%JJ%k%%%%jJ%%JjJ%jjJJj%Jjj
$$ 3 3 4 3 3 4 4 3 3 3 3 3 3 3 3 4 3 3 3 3 4 4 4 5 4 4 4 3 3 3 3 3 3 3 3 3 2 2 3 4 3 2 2 4 5 4 3 3 4 5 5 3 3 3 3 3 2 3 3 3 4 3 4 4 3 2 3 4 3 3 4 3 2
273BJ%%%JjJjJ%%%%%%%%j%%JjJ%j%%%%%%KjjjK%jj%J%jJ%%JJj%j%JJk%%Jj%j%JJj%J%%%%%
$$ 2 3 3 3 3 4 3 4 3 4 4 4 4 4 4 4 4 4 3 3 3 4 3 4 4 3 3 3 3 3 3 3 5 4 3 2 4 4 3 2 2 3 3 2 3 3 3 4 5 4 4 3 3 4 5 3 3 3 4 3 3 2 2 3 4 3 3 4 4 4 4 4 4
267D%j%%J%%%%jJjJ%%Jj%%jJ%j%JJj%Jjj%Jj%%%J%%%jJjjJ%J%%jJ%%%%%jj%%J%%%%Kjj%j%
$$ 4 4 3 3 3 4 4 4 4 4 3 4 3 4 4 4 5 4 4 4 3 4 4 3 3 4 5 4 4 5 4 3 3 4 3 3 3 3 4 4 4 4 3 4 3 2 3 3 4 4 4 3 4 4 4 4 4 4 3 2 2 2 3 3 3 3 3 5 4 3 3 2 2
260B%%J%jJ%JJjjJ%j%%%k%K%%jJ%jJjJ%%%%%%%%Jj%%%%Jj%JJjj%%%Jj%%jJ%%%%%J%jJjJJ%
$$ 2 2 2 3 3 2 3 3 4 5 4 3 4 4 3 3 3 3 1 1 3 3 3 2 3 3 2 3 2 3 3 3 3 3 3 3 3 3 4 3 3 3 3 3 4 3 3 4 5 4 3 3 3 3 4 3 3 3 2 3 3 3 3 3 3 4 4 3 4 3 4 5 5
254E%%kJ%%%jjJJ%jK%j%jJ%%j%Jk%%%JjJ%%%Jjj%J%%%%Jk%%%J%%%%%J%%%j%%%Jj%%%J%j%j
$$ 5 5 5 3 4 4 4 4 3 2 3 4 4 3 5 5 4 4 3 4 4 4 3 3 4 2 2 2 2 3 2 3 3 3 3 4 3 2 2 3 3 3 3 3 4 2 2 2 2 3 3 3 3 3 3 4 4 4 4 3 3 3 3 4 3 3 3 3 4 4 3 3 2
247B%%%JjjJ%%%JJ%%Jjj%%J%jJ%j%J%j%kJJ%jJjJJj%%jJj%JJjjjJJj%JjJ%%jJ%%%jJj%JJ%
$$ 2 2 2 2 3 2 1 2 2 2 2 3 4 4 4 5 4 3 3 3 4 4 3 4 4 3 3 4 4 3 3 1 2 3 3 2 3 2 3 4 3 3 3 2 3 2 2 3 4 3 2 1 2 3 2 2 3 2 3 3 3 2 3 3 3 3 2 3 2 2 3 4 4
241D%%kJJj%%%JJkjJjJ%jJJjjK%jjJ%JjjJ%%%%%%jJ%J%%jJjjJ%j%JJjJJkJ%j%%j%J%%Jk%J
$$ 4 4 4 2 3 4 3 3 3 3 4 5 3 2 3 2 3 3 2 3 4 3 2 4 4 3 2 3 3 4 3 2 3 3 3 3 3 3 3 2 3 3 4 4 4 3 4 3 2 3 3 2 2 3 4 3 4 5 3 4 4 3 3 3 2 2 3 3 3 4 2 2 3
234C%%Kk%%%JjJjj%%JJ%j%J%%jjJJ%k%%K%jJj%jK%%%j%J%j%%j%Jj%J%%Jj%%%Jjj%%Jj%%%J
$$ 3 3 3 5 3 3 3 3 4 3 4 3 2 2 2 3 4 4 3 3 4 4 4 3 2 3 4 4 2 2 2 4 4 3 4 3 3 2 4 4 4 4 3 3 4 4 3 3 3 2 2 3 2 2 3 3 3 4 3 3 3 3 4 3 2 2 2 3 2 2 2 2 3
228C%JjJj%%%Jj%%JJ%j%j%jjJ%%%K%jJj%%J%jJ%jJj%JjJJjJj%%j%%%%%%%j%%Jj%%%J%j%J%
$$ 3 3 4 3 4 3 3 3 3 4 3 3 3 4 5 5 4 4 3 3 2 1 2 2 2 2 4 4 3 4 3 3 3 4 4 3 4 4 3 4 3 3 4 3 4 5 4 5 4 4 4 3 3 3 3 3 3 3 3 2 2 2 3 2 2 2 2 3 3 2 2 3 3
221CkJ%J%%%%%%%Jj%%%%%%%%%%J%j%j%JJ%%%jJj%%%%%J%jJJj%j%jJ%%%%jJjJJj%j%JJJjjJ
$$ 3 1 2 2 3 3 3 3 3 3 3 3 4 3 3 3 3 3 3 3 3 3 3 3 4 4 3 3 2 2 3 4 4 4 4 3 4 3 3 3 3 3 3 4 4 3 4 5 4 4 3 3 2 3 3 3 3 3 2 3 2 3 4 3 3 2 2 3 4 5 4 3 4
215D%%%j%%%%jJj%JJj%J%j%%J%jJjJj%%%j%%%jJJ%%J%j%%J%%j%%Jj%Jj%J%j%j%J%%j%%%%%
$$ 4 4 4 4 3 3 3 3 3 2 3 2 2 3 4 3 3 4 4 3 3 3 4 4 3 4 3 4 3 3 3 3 2 2 2 2 1 2 3 3 3 4 4 3 3 3 4 4 4 3 3 3 4 3 3 4 3 3 4 4 3 3 2 2 3 3 3 2 2 2 2 2 2
208B%JJ%j%%jJ%j%J%%JkJ%jJ%%%jJ%jJ%%jJjJj%J%jJ%%JjjJJ%j%%%J%%j%%%%%J%%%%%jj%J
$$ 2 2 3 4 4 3 3 3 2 3 3 2 2 3 3 3 4 2 3 3 2 3 3 3 3 2 3 3 2 3 3 3 2 3 2 3 2 2 3 3 2 3 3 3 4 3 2 3 4 4 3 3 3 3 4 4 4 3 3 3 3 3 3 4 4 4 4 4 4 3 2 2 3
201Cj%J%j%%J%%%J%j%%JjJ%jj%J%%%%J%j%%%jjJJ%J%%%jJ%j%%%%%%J%%%j%%%%jJJ%jj%%Kj
$$ 3 2 2 3 3 2 2 2 3 3 3 3 4 4 3 3 3 4 3 4 4 3 2 2 3 3 3 3 3 4 4 3 3 3 3 2 1 2 3 3 4 4 4 4 3 4 4 3 3 3 3 3 3 3 4 4 4 4 3 3 3 3 3 2 3 4 4 3 2 2 2 4 3
195CjJJjkKj%JjjJJJ%%%jJj%%%j%J%jJ%%jJ%jJJj%jKjJj%%%Jj%jJ%J%%j%%J%j%Jj%%j%jJK
$$ 3 2 3 4 3 1 3 2 2 3 2 1 2 3 4 4 4 4 3 4 3 3 3 3 2 2 3 3 2 3 3 3 2 3 3 2 3 4 3 3 2 4 3 4 3 3 3 3 4 3 3 2 3 3 4 4 4 3 3 3 4 4 3 3 4 3 3 3 2 2 1 2 4
188D%%j%%%J%%j%%%%jJJ%jJj%%%jJ%j%%j%JJ%%kJ%%JJj%%jJj%J%jJ%%k%J%%J%j%%%%%%%%J
$$ 4 4 4 3 3 3 3 4 4 4 3 3 3 3 3 2 3 4 4 3 4 3 3 3 3 2 3 3 2 2 2 1 1 2 3 3 3 1 2 2 2 3 4 3 3 3 2 3 2 2 3 3 2 3 3 3 1 1 2 2 2 3 3 2 2 2 2 2 2 2 2 2 3
182C%j%%J%jJ%j%%jJ%J%%%%%%%J%jJj%%%%%Jj%%%%j%%Jj%%J%%%%JJj%jKkjjJJ%%jJ%j%%J%
$$ 3 3 2 2 2 3 3 2 3 3 2 2 2 1 2 2 3 3 3 3 3 3 3 3 4 4 3 4 3 3 3 3 3 3 4 3 3 3 3 3 2 2 2 3 2 2 2 3 3 3 3 3 4 5 4 4 3 5 3 2 1 2 3 3 3 2 3 3 2 2 2 3 3
175C%%%j%Jj%%JJj%%%j%J%%%%jj%JJ%Jj%%%%%jJ%%%%j%JJj%jJJjjjJ%%J%jJjJJ%k%J%%%j%
$$ 3 3 3 3 2 2 3 2 2 2 3 4 3 3 3 3 2 2 3 3 3 3 3 2 1 1 2 3 3 4 3 3 3 3 3 3 2 3 3 3 3 3 2 2 3 4 3 3 2 3 4 3 2 1 2 2 2 3 3 2 3 2 3 4 4 2 2 3 3 3 3 2 2
169B%K%%%j%%%%j%%%JJj%%%j%J%jjKjJjJKjkJ%jK%jjJ%%%%%%Jjj%J%%%J%%%%j%jJ%%j%J%%
$$ 2 2 4 4 4 4 3 3 3 3 3 2 2 2 2 3 4 3 3 3 3 2 2 3 3 2 1 3 2 3 2 3 5 4 2 3 3 2 4 4 3 2 3 3 3 3 3 3 3 4 3 2 2 3 3 3 3 4 4 4 4 4 3 3 2 3 3 3 2 2 3 3 3
162C%%%%%JJk%%Jj%%j%JJ%j%%%JJjjjJ%kJJjJJ%jj%%J%%j%J%%j%%J%%%%%jjK%j%J%%%J%jj
$$ 3 3 3 3 3 3 4 5 3 3 3 4 3 3 3 2 2 3 4 4 3 3 3 3 4 5 4 3 2 3 3 1 2 3 2 3 4 4 3 2 2 2 3 3 3 2 2 3 3 3 2 2 2 3 3 3 3 3 3 2 1 3 3 2 2 3 3 3 3 4 4 3 2
156BJjkJJJ%%%%%%j%%%%Jjj%JJ%j%%J%%%J%%j%J%j%j%JJj%%%%%j%J%jJ%J%jj%%%%%JJ%jjJ
$$ 2 3 2 0 1 2 3 3 3 3 3 3 3 2 2 2 2 2 3 2 1 1 2 3 3 2 2 2 3 3 3 3 4 4 4 3 3 4 4 3 3 2 2 3 4 3 3 3 3 3 3 2 2 3 3 2 3 3 4 4 3 2 2 2 2 2 2 3 4 4 3 2 3
149Cj%J%%%jJJj%j%%JJJjj%%%j%%J%Jj%%%%%%%%%%JjJj%j%%%j%J%%%%%%J%%jJ%Jj%%%%%Jj
$$ 3 2 2 3 3 3 3 2 3 4 3 3 2 2 2 3 4 5 4 3 3 3 3 2 2 2 3 3 4 3 3 3 3 3 3 3 3 3 3 3 4 3 4 3 3 2 2 2 2 1 1 2 2 2 2 2 2 2 3 3 3 2 3 3 4 3 3 3 3 3 3 4 3
143C%j%J%%%j%J%%%JJjjJ%%jj%jJJj%JjjK%%jJ%kJJJkJJjJ%j%%jJj%%jK%kJK%%j%jJJj%%%
$$ 3 3 2 2 3 3 3 3 2 2 3 3 3 3 4 5 4 3 4 4 4 3 2 2 1 2 3 2 2 3 2 1 3 3 3 2 3 3 1 2 3 4 2 3 4 3 4 4 3 3 3 2 3 2 2 2 1 3 3 1 2 4 4 4 3 3 2 3 4 3 3 3 3
136CJj%%%jK%j%%J%%%%%j%%jJ%%Jj%%%%%Kjj%Jj%%%%%%J%jj%J%j%Jj%J%%%jJJj%Jk%J%%j%
$$ 3 4 3 3 3 3 2 4 4 3 3 3 4 4 4 4 4 4 3 3 3 2 3 3 3 4 3 3 3 3 3 3 5 4 3 3 4 3 3 3 3 3 3 3 4 4 3 2 2 3 3 2 2 3 2 2 3 3 3 3 2 3 4 3 3 4 2 2 3 3 3 2 2
130BJ%%j%JJj%%%%j%J%%%Jj%jJ%%jJ%%%%%j%%JjJj%%%jK%%%%%jJ%%j%%%J%%%%%%%%%%j%jJ
$$ 2 3 3 3 2 2 3 4 3 3 3 3 3 2 2 3 3 3 3 4 3 3 2 3 3 3 2 3 3 3 3 3 3 2 2 2 3 2 3 2 2 2 2 1 3 3 3 3 3 3 2 3 3 3 2 2 2 2 3 3 3 3 3 3 3 3 3 3 3 2 2 1 2
123B%J%Jj%jJ%%%%jJj%%%J%j%%%JjJ%%%%Jjj%Jj%%%J%jJ%j%Jj%J%%%%%%j%J%kJ%Kj%%jJ%j
$$ 2 2 3 3 4 3 3 2 3 3 3 3 3 2 3 2 2 2 2 3 3 2 2 2 2 3 2 3 3 3 3 3 4 3 2 2 3 2 2 2 2 3 3 2 3 3 2 2 3 2 2 3 3 3 3 3 3 3 2 2 3 3 1 2 2 4 3 3 3 2 3 3 2
116BJJ%j%jJJjjJ%k%JJJj%j%%%%%%%J%%%%j%%JjjJ%Jj%JjJJj%%J%jjJjJ%j%J%%%%j%%%%%%
$$ 2 3 4 4 3 3 2 3 4 3 2 3 3 1 1 2 3 4 3 3 2 2 2 2 2 2 2 2 3 3 3 3 3 2 2 2 3 2 1 2 2 3 2 2 3 2 3 4 3 3 3 4 4 3 2 3 2 3 3 2 2 3 3 3 3 3 2 2 2 2 2 2 2
110BjJJ%%jJJj%%jJ%%%%%j%%%J%%Jj%%Kjj%J%j%jJj%JJj%j%%J%jK%%%jJj%%j%%J%j%J%J%%
$$ 2 1 2 3 3 3 2 3 4 3 3 3 2 3 3 3 3 3 3 2 2 2 2 3 3 3 4 3 3 3 5 4 3 3 4 4 3 3 2 3 2 2 3 4 3 3 2 2 2 3 3 2 4 4 4 4 3 4 3 3 3 2 2 2 3 3 2 2 3 3 4 4 4
103D%kJ%%%%%Jj%%j%J%jJ%%%j%%%%%JjJj%%J%%J%jj%%%%%%J%J%jj%J%%Jj%%j%Jj%J%%%jJ%
$$ 4 4 2 3 3 3 3 3 3 4 3 3 3 2 2 3 3 2 3 3 3 3 2 2 2 2 2 2 3 2 3 2 2 2 3 3 3 4 4 3 2 2 2 2 2 2 2 3 3 4 4 3 2 2 3 3 3 4 3 3 3 2 2 3 2 2 3 3 3 3 2 3 3
97C%%%%j%%%%%jJJ%Jj%%j%jJJ%%%jJ%%j%JjJ%%Jj%%%%%%%%%J%jj%%J%%%%J%%kJ%j%Jj%%%j
$$ 3 3 3 3 3 2 2 2 2 2 2 1 2 3 3 4 3 3 3 2 2 1 2 3 3 3 3 2 3 3 3 2 2 3 2 3 3 3 4 3 3 3 3 3 3 3 3 3 3 4 4 3 2 2 2 3 3 3 3 3 4 4 4 2 3 3 2 2 3 2 2 2 2 1
90A%J%JjJj%%%%J%jJj%%%%j%K%k%%JK%%%%j%Jj%%%j%J%jJ%%j%%J%jJ%%%%j%J%%%J%jJ%j%%
$$ 1 1 2 2 3 2 3 2 2 2 2 2 3 3 2 3 2 2 2 2 2 1 1 3 3 1 1 1 2 4 4 4 4 4 3 3 4 3 3 3 3 2 2 3 3 2 3 3 3 2 2 2 3 3 2 3 3 3 3 3 2 2 3 3 3 3 4 4 3 4 4 3 3 3
$$ [...]
-3518A
##END=		$$ NMR SPECTRUM
##END=		$$ LINK
