##TITLE=	Sep04-2015.30.fid
##JCAMPDX=	6.0	$$ NMR Plug-in v.1.14 of MestReNova 12.0.4-22023
##DATATYPE=	LINK
##BLOCKS=	3
##ORIGIN=	Bruker BioSpin GmbH
##OWNER=	nmrsu
##TITLE=	Sep04-2015.30.fid
##JCAMPCS=	3.7	$$ Molecule Plug-in 1.10 of MestReNova 12.0.4-22023
##ORIGIN=	Bruker BioSpin GmbH
##OWNER=	nmrsu
##BLOCKID=	1
##NAMES=	
##ATOMLIST=	
$$ AN	AS	NH
	1	C	1
	2	O	 
	3	C	2
	4	C	 
	5	C	 
	6	C	1
	7	C	1
	8	C	1
	9	C	2
	10	C	1
	11	C	1
	12	C	2
	13	O	 
	14	C	3
	15	Cl	 
	16	Cl	 
	17	H	 
	18	H	 
	19	Br	 
	20	Cl	 
	21	C	 
	22	C	 
	23	C	1
	24	Br	 
	25	H	 
	26	H	 
	27	H	 
##BONDLIST=	
$$ AN1	AN2	BT
	22	1	D
	23	1	S
	2	21	S
	21	3	S
	3	4	S
	5	6	S
	6	7	S
	7	2	S
	4	8	S
	8	9	S
	9	10	S
	10	11	S
	11	12	S
	12	5	S
	5	13	S
	13	4	S
	7	14	S
	8	15	S
	6	16	S
	5	17	S
	4	18	S
	11	19	S
	10	20	S
	21	22	S
	23	24	S
	23	25	S
	22	26	S
	21	27	S
##MAXRASTER=	32768
##XYRASTER=	
$$ AN	X	Y	Z
	1	17677	-12424	0
	2	9172	1285	0
	3	-949	-8661	0
	4	-8019	-5660	0
	5	-7895	8530	0
	6	-774	11408	0
	7	6295	8406	0
	8	-15141	-8537	0
	9	-22210	-5536	0
	10	-25087	1584	0
	11	-22087	8654	0
	12	-14966	11531	0
	13	-5018	1409	0
	14	11772	13790	0
	15	-15208	-16217	0
	16	-707	19087	0
	17	-7828	16210	0
	18	-8086	-13340	0
	19	-27469	14132	0
	20	-32768	1651	0
	21	6171	-5784	0
	22	10010	-12433	0
	23	25349	-12434	0
	24	32010	-8602	0
	25	32768	-14428	0
	26	6174	-19087	0
	27	13590	-3796	0
##STEREOCENTER=	
$$ AN	SD
	4	M
	5	P
	6	M
	7	M
	8	P
	10	M
	11	M
	21	P
	23	P
	23	P
##END=	

##TITLE=	Sep04-2015.30.fid
##JCAMPDX=	6.0	$$ NMR Plug-in 1.14 of MestReNova 12.0.4-22023
##BLOCKID=	2
##DATATYPE=	NMRSPECTRUM
##DATACLASS=	XYDATA
##NUMDIM=	1
##ORIGIN=	Bruker BioSpin GmbH
##OWNER=	nmrsu
##.OBSERVEFREQUENCY=	125.77036383080600501
##.OBSERVENUCLEUS=	^13C
##.SOLVENTNAME=	CDCl3
##.PULSESEQUENCE=	zgpg30
##LONGDATE=	2015/09/07 04:35:00.000
##.ACQUISITIONMODE=	SIMULTANEOUS (DQD)
##$ORIGINALFORMAT=	Bruker XWIN-NMR
##$PARAMETERFILE=	(acqus, ASCII, //ch-nmrserv2.ch.ic.ac.uk/AV500%20since%20update/brad/nmr/Sep04-2015/30/acqus, 0)
$$ ##TITLE= Parameter file, TOPSPIN		Version 3.2
$$ ##JCAMPDX= 5.0
$$ ##DATATYPE= Parameter Values
$$ ##NPOINTS= 11	$$ modification sequence number
$$ ##ORIGIN= Bruker BioSpin GmbH
$$ ##OWNER= nmrsu
$$ $$ 2015-09-07 04:35:01.355 +0100  nmrsu@nmrpc
$$ $$ /opt/topspin/data/brad/nmr/Sep04-2015/30/acqus
$$ $$ process /opt/topspin3.2/prog/mod/shimcntl
$$ ##$ACQT0= -1.89075630252101
$$ ##$AMP= (0..31)
$$ 100 100 100 100 100 100 100 100 100 100 100 100 100 100 100 100 100 100
$$ 100 100 100 100 100 100 100 100 100 100 100 100 100 100
$$ ##$AMPCOIL= (0..19)
$$ 0 0 0 0 0 0 0 0 0 0 0 0 0 0 0 0 0 0 0 0
$$ ##$ANAVPT= -1
$$ ##$AQSEQ= 0
$$ ##$AQ_mod= 3
$$ ##$AUNM= <au_zg>
$$ ##$AUTOPOS= <3 >
$$ ##$BF1= 125.757789
$$ ##$BF2= 500.13
$$ ##$BF3= 125.757789
$$ ##$BF4= 125.757789
$$ ##$BF5= 125.757789
$$ ##$BF6= 125.757789
$$ ##$BF7= 125.757789
$$ ##$BF8= 125.757789
$$ ##$BYTORDA= 0
$$ ##$CAGPARS= (0..11)
$$ 0 0 0 0 0 0 0 0 0 0 0 0
$$ ##$CFDGTYP= 0
$$ ##$CFRGTYP= 9
$$ ##$CHEMSTR= <none>
$$ ##$CNST= (0..63)
$$ [...]
$$ ##$SguType= 3
$$ ##$ShimPowMaxUA= (0..63)
$$ 130000 130000 130000 130000 130000 130000 130000 130000 130000 130000 130000
$$ 130000 130000 130000 130000 130000 130000 130000 130000 130000 130000 130000
$$ 130000 130000 130000 130000 130000 130000 130000 130000 130000 130000 130000
$$ 130000 130000 130000 130000 130000 130000 130000 0 0 0 0 0 0 0 0 0 0 0
$$ 0 0 0 0 0 0 0 0 0 0 0 0 0
$$ ##$ShimPowMaxUC= (0..63)
$$ 130000 130000 130000 130000 130000 130000 130000 130000 130000 130000 130000
$$ 130000 130000 130000 130000 130000 130000 130000 130000 130000 130000 130000
$$ 130000 130000 130000 130000 130000 130000 130000 130000 130000 130000 130000
$$ 130000 130000 130000 130000 130000 130000 130000 0 0 0 0 0 0 0 0 0 0 0
$$ 0 0 0 0 0 0 0 0 0 0 0 0 0
$$ ##$ShimPowMaxUG= (0..63)
$$ 524287 524287 524287 524287 524287 524287 524287 524287 524287 524287 524287
$$ 524287 524287 524287 524287 524287 524287 524287 524287 524287 524287 524287
$$ 524287 524287 524287 524287 524287 524287 524287 524287 524287 524287 524287
$$ 524287 524287 524287 524287 524287 524287 0 0 0 0 0 0 0 0 0 0 0 0 0 0 0
$$ 0 0 0 0 0 0 0 0 0 0
$$ ##$ShimPowRcbType= 3
$$ ##$ShimPowRes= (0..63)
$$ 1e-20 1e-20 1e-20 1e-20 1e-20 1e-20 1e-20 1e-20 1e-20 1e-20 1e-20 1e-20
$$ 1e-20 1e-20 1e-20 1e-20 1e-20 1e-20 1e-20 1e-20 1e-20 1e-20 1e-20 1e-20
$$ 1e-20 1e-20 1e-20 1e-20 1e-20 1e-20 1e-20 1e-20 1e-20 1e-20 1e-20 1e-20
$$ 1e-20 1e-20 1e-20 1e-20 0 0 0 0 0 0 0 0 0 0 0 0 0 0 0 0 0 0 0 0 0 0 0 0
$$ ##$ShimPowRng0= (0..63)
$$ 1 1 1 1 1 1 1 1 1 1 1 1 1 1 1 1 1 1 1 1 1 1 1 1 1 1 1 1 1 1 1 1 1 1 1 1
$$ 1 1 1 1 0 0 0 0 0 0 0 0 0 0 0 0 0 0 0 0 0 0 0 0 0 0 0 0
$$ ##$ShimPowRng1= (0..63)
$$ 1 1 1 1 1 1 1 1 1 1 1 1 1 1 1 1 1 1 1 1 1 1 1 1 1 1 1 1 1 1 1 1 1 1 1 1
$$ 1 1 1 1 0 0 0 0 0 0 0 0 0 0 0 0 0 0 0 0 0 0 0 0 0 0 0 0
$$ ##$ShimPowRng2= (0..63)
$$ 1 1 1 1 1 1 1 1 1 1 1 1 1 1 1 1 1 1 1 1 1 1 1 1 1 1 1 1 1 1 1 1 1 1 1 1
$$ 1 1 1 1 0 0 0 0 0 0 0 0 0 0 0 0 0 0 0 0 0 0 0 0 0 0 0 0
$$ ##$ShimPowRng3= (0..63)
$$ 1 1 1 1 1 1 1 1 1 1 1 1 1 1 1 1 1 1 1 1 1 1 1 1 1 1 1 1 1 1 1 1 1 1 1 1
$$ 1 1 1 1 0 0 0 0 0 0 0 0 0 0 0 0 0 0 0 0 0 0 0 0 0 0 0 0
$$ ##$ShimSysFunc= (0..63)
$$ 1 2 3 4 5 6 7 8 9 10 0 37 38 35 16 15 14 13 12 11 28 27 26 25 24 23 36
$$ 22 30 29 20 21 34 33 32 31 17 18 19 0 0 0 0 0 0 0 0 0 0 0 0 0 0 0 0 0 0
$$ 0 0 0 0 0 0 0
$$ ##$ShimSysMatrix= 0
$$ ##$ShimSysType= 4
$$ ##$TFXNUM= 0
$$ ##$TRIPLO2= 0
$$ ##$VTU= 2
$$ ##$VTUETH= <149.236.99.21>
$$ ##$VTUTY= <no>
$$ ##$WBREFAM= (0..15)
$$ 100.1 100 100 100 100 100 100 100 100 100 100 100 100 100 100 100
$$ ##$WBREFLM= (0..15)
$$ 1 0 0 0 0 0 0 0 0 0 0 0 0 0 0 0
$$ ##$WBREFPH= (0..15)
$$ -0.06 0 0 0 0 0 0 0 0 0 0 0 0 0 0 0
$$ ##$WBSGU= (0..15)
$$ 0 0 0 0 0 0 0 0 0 0 0 0 0 0 0 0
$$ ##$XFAC= 2
$$ ##END=
$$ 
##$DECIM=	560
##$DSPFVS=	20
##XUNITS=	HZ
##YUNITS=	ARBITRARY UNITS
##FIRSTX=	30429.710770154182683
##LASTX=	-5283.4850306270554938
##XFACTOR=	-1.0899135044642853654
##YFACTOR=	0.00015327004687500000372
##NPOINTS=	32768
##XYDATA=	(X++(Y..Y))
$$ [...]
-17681 -391540 130568 652678 622331 591984 378122 164261 15394 -133472 -98824 -64176 -105037 -145898
-17669 -145898 -186759 -227619 -84965 57688 307393 -176962 -318899 -460836 -648652 -836468 -508149
-17658 -508149 -179829 -279711 -379592 -43626 292339 -44582 -381504 -290225 -198945 -291180 -383416 -153783
-17646 -153783 75848 -122719 -321288 15394 352077 260558 169040 -40042 -249125 -152349 -55574 -409939
-17634 -409939 -764305 -323439 117426 278480 439533 248850 58166 383618 -24988 -20687 -16386 -375292
-17622 -375292 -734197 -542558 -350918 -143986 62945 269877 476809 292578 108346 153508 -535389
-17611 -535389 -604924 -674459 -484014 -293570 -355458 -417347 -433357 -449367 -534194 115037 45501 -24032 -140402
-17598 -140402 -256771 -373141 -489510 -938501 -1387491 -674220 39050 181704 324358 -404683 -1133724
-17587 -1133724 -975777 -83770 13004 109780 -267883 88513 215516 342519 -96315 -535150 -178754
-17576 -178754 177642 -91058 -359760 -521410 -683061 202851 -134667 -380429 107868 112528 117187 -15789
-17564 -15789 -148765 -350560 -552355 -325948 -99541 -309938 -520335 -180187 159959 194249 228539 79313
-17552 79313 -69911 -343989 -618066 -463943 -309819 -304801 -299783 -294765 -289747 -319138 -348529 -194405 -40281
-17539 -40281 -81142 -122003 -162863 -203724 -275649 -347573 -878285 -674937 -154261 -367645 -282817 -197989 -459164
-17526 -459164 -353308 -18059 -416869 -601579 -419259 -695726 -605163 -312805 -20448 -133353 -246258
-17515 -246258 -194763 -143269 -642320 -1141371 -1149137 -1156903 -1004093 -851283 -492019 -499785 -1019864 -805882
-17503 -805882 -688916 -571949 -684376 -62743 367728 64140 -170629 -38370 -55216 -72062 194010
-17492 194010 460083 1146711 1099279 294848 -142552 74893 -441720 -706001 -970281 -794891 -619500
-17481 -619500 -444109 -268719 -288313 -307907 -633359 -958812 -867532 -776252 -256771 262709 -65610 -393930
-17469 -393930 -294048 -194166 -174572 -154978 -135384 -115790 -203246 -290702 -638138 -985574 -1122733 -525831
-17457 -525831 -525353 -524875 -495962 -467049 -254621 -42193 24952 92097 105717 -247691 -234071 513608 397239
-17444 397239 280869 401540 522210 467012 44785 -550443 -411612 -280428 -149243 -170988 -192732 -30962
-17432 -30962 130807 212290 293772 -297632 -889038 -696682 -504325 -740171 -976016 -701461 -426905 -152349
-17420 -152349 122205 163544 204882 246221 287560 -263701 -814963 -723922 101177 910985 986732 840733
-17408 840733 1061763 1654364 534158 -379592 -559284 -628102 -696920 -352830 -8739 -31679 -54618 105956
-17396 105956 266532 438577 610622 170951 -268719 188395 645509 490908 336306 441684 547061
-17385 547061 285409 23757 -367884 -759526 -784138 -808750 -374575 59600 340846 -111967 -886648
-17374 -886648 -927270 -363822 -167404 -169793 -172183 54821 -85204 -309341 200581 687565 440489 422806
-17362 422806 405124 -25466 -456057 -630970 -805882 -636705 -467527 -30723 39050 -281144 132719
-17351 132719 57210 -18297 -231442 -444588 -390106 -335625 -327023 -318421 305720 195802 -319377 -467527
-17339 -467527 -340404 -213282 -246735 -280189 -125348 29492 818 -27856 253151 534158 448135 362113
-17327 362113 188634 15155 461039 172863 -363822 -533478 -527265 -154022 -763349 -1005646 -613287
-17316 -613287 -587958 -478519 -369079 -282578 -196078 -623801 -1051525 -630492 157570 272745 -346139 82539
-17304 82539 511218 -13041 -537301 -449844 -362388 -267285 -172183 14677 -532522 -574099 118382 306198
-17292 306198 494014 540371 -147331 -766216 -161669 -268241 -741843 -749012 -756181 -816874 -877568 -754747
-17280 -754747 -631926 -513884 -395841 -277799 -159757 -473740 -787722 -734675 -681628 -410656 -139685
-17269 -139685 -189865 -240045 -221406 531291 488757 79194 -246735 -205636 -256294 60078 1773 -423560
-17257 -423560 -825954 -861319 -571710 -282100 76326 -299305 -174094 -48883 -336581 -624279 -684495
-17246 -684495 -744711 -621412 -498113 -153066 191979 169996 148012 81105 14199 -236221 -486643 -492378
-17234 -492378 -498113 -503847 -509582 -568364 -627147 -502414 -377681 87318 552318 573824 -138729 42395 223521
-17221 223521 -230009 -683539 -708868 -367167 203927 40962 -576967 -827866 -474695 -121525 -318899
-17210 -318899 -516273 -713647 -911021 -863709 -816396 -769084 -721771 -789156 -856540 -923925 -991309 -1229783
-17198 -1229783 -1468257 -1049135 -630014 -654387 55299 443834 98310 -157367 321013 294728 268444
-17187 268444 383618 -235266 -716515 -463704 124595 -21165 -281622 -175050 -183174 -191299 7030 205360
-17175 205360 -47450 -300261 -208981 -117702 160915 72503 -222362 216830 -237655 -692141 -489032 -285923
-17163 -285923 -44582 196758 -173616 -543991 -776730 -1009469 -630492 -251514 -10173 231167 105479
-17152 105479 -20209 -485209 -950209 -803493 -656777 -471828 -286879 265098 -406355 -563585 13243
-17141 13243 100700 188156 287082 386008 301419 216830 166411 115992 -301455 -718904 -773146 -827388 -514600
-17128 -514600 -201812 -7545 186722 13960 -158801 -10412 137976 332244 -207547 -392735 -577923
-17117 -577923 -441959 -305996 -307668 -309341 -311013 -312686 -360237 -407789 -868249 -594649 -527504 -460358 -760243
-17104 -760243 -326067 163126 652319 330989 9659 66828 123997 135288 146578 656800 432962 438517
-17092 438517 444073 2311 -439450 -514182 -588914 -448590 -308266 -122062 -669919 -346080 -22240 -111309
-17080 -111309 -200379 -384073 -567767 -384431 -201096 -384790 -568484 -798057 -293570 -291897 -290225 -609703
-17068 -609703 -929182 -1099554 -1269927 -828583 -387239 -306234 -225230 -327740 -430250 -345422 -260595 -175767
-17056 -175767 -90939 -116029 -141119 -120330 -99541 -499307 -165014 -243629 -322244 -462031 -601818 -129888
-17044 -129888 342041 121966 -98108 48847 195802 69815 -56171 1355 58883 -17402 -93687 -169972
-17032 -169972 -246258 317847 881952 589654 297357 -178455 -654268 -105455 -290702 -72121 146459
-17021 146459 319161 491863 259304 26744 161214 295684 449270 602857 389413 175969 -64236
-17010 -64236 -304442 -315255 -326067 -497396 65335 215157 364980 52192 -260595 -665140 -335625 322686
-16998 322686 246938 217069 187200 600825 280391 5836 -268719 28297 325314 301180 277046 -68238
-16986 -68238 320535 342280 -370034 -455340 -540646 -304801 -68955 -192493 -316031 -439569 -563107 -482103
-16974 -482103 -401098 46935 494970 614207 733444 653873 -159757 -267046 -374336 84212 542760
-16963 542760 508112 473464 255301 37138 51236 65335 79433 93531 176447 259363 158765 58166
-16951 58166 -191538 -441242 -323917 -206592 -158084 -109577 -244585 -379592 -143269 93053 329376 565699
-16939 565699 327943 90186 35943 -18297 264859 548017 464145 380273 200820 21367 -158084 -337537
-16927 -337537 -71106 195324 262948 -403488 -125587 152313 -640289 -698832 -732524 -766216 -1304575 -619500
-16915 -619500 249089 383618 808713 499749 753516 1007282 664626 321969 136064 -49839 -52229
-16904 -52229 -54618 141799 338217 -107666 180509 373105 -168359 -480430 -58441 6075 70592 180987
-16892 180987 291383 413248 535114 656979 778844 613968 449091 330093 211095 -167881 187200
-16881 187200 129374 71547 66768 61989 57210 52431 28536 4641 -19253 -43149 110735 264620 158526
-16868 158526 52431 -263940 153747 342041 530335 673228 816121 653156 490191 82539 -325112
-16857 -325112 -426905 -528699 -18775 491147 328182 165216 9898 -145420 -117224 -89027 124356
-16846 124356 337740 321730 305720 802023 564266 311216 58166 -328696 -715559 -796563 -877568 -538018
-16834 -538018 -198467 -210654 -222840 330332 149446 197953 246460 447896 649333 422567 195802 472747
-16822 472747 749692 63184 110735 -139924 -390584 -289508 -188431 174535 537503 181704 -174094
-16811 -174094 276807 -6350 -473023 -205636 -197272 -188909 -134667 -80425 42634 165694 -17103 -199901
-16799 -199901 -192493 -185086 -177678 -170271 -571949 -973627 -824760 -675893 -561435 -446977 -103125 240725
-16787 240725 -222123 49086 213246 377405 313127 248850 184572 120294 -154261 -428817 -152827 123161
-16775 123161 322686 522210 538220 554230 195563 -163102 -338254 -513405 -994415 -1475425 -1161204
-16764 -1161204 -846982 -674220 -501458 -389868 -889994 -984857 -712691 -685212 -657732 -565258 -472784 -196795
-16752 -196795 79194 -30484 -140163 17783 175730 211334 -364778 -596800 -461792 -488316 -147809
-16741 -147809 55060 -109099 -540885 -605641 -265135 -291658 -347334 -403010 -298110 -193210 -183891 -174572
-16729 -174572 -188192 -201812 -155217 -475651 -543752 -137 314083 16588 -105037 140365 -11129 -162624
-16717 -162624 -451756 -129171 -150677 -172183 -155456 -138729 -282578 -426427 -142075 -224752 -525353 -214238
-16705 -214238 -499546 -417825 -283056 -515317 -724639 -566931 -256294 54343 -162624 -379592 -118657
-16694 -118657 142277 97354 52431 118382 184333 250283 316234 544015 771795 571375 370954 308169
-16682 308169 245385 182600 119816 131584 143352 -28393 -200140 190127 580395 787148 993901 398732
-16670 398732 -196436 -485747 -775058 -643813 -512569 -564840 -617111 -277501 62109 95861 129613 220713
-16658 220713 311813 563489 815165 798199 414204 -474456 -139685 76565 -74212 -224991 -375769
-16647 -375769 -440525 -138251 232840 -130127 -535150 -206114 46457 299029 686848 340607 -28573
-16636 -28573 336306 513847 324358 203688 83017 -128454 -339927 -123197 93531 119099 144667 -135623
-16624 -135623 -415913 118561 653036 147594 -357848 -133054 91739 -119314 403690 390488 10256
-16613 10256 264680 519104 853816 454468 -273677 -267763 -182039 -463345 -675833 -888321 -577026 -265732
-16601 -265732 -504983 -744233 -635570 -526906 -418243 -309580 -242972 -176364 -415614 -654865 -948776
-16590 -948776 -1242686 -986052 -729418 -434551 -139685 -28333 83017 -279711 -642440 -209937 222565
-16579 222565 131285 40006 -104798 -616633 -761437 -172183 233557 272267 47174 556141 889240 -1093
-16567 -1093 -207069 -413046 -267285 -121525 -29289 62945 155180 247416 67366 -112684 -292734 -472784
-16555 -472784 -335506 -198228 -244465 -290702 -398111 -505520 -612929 -720338 -655701 -591065 -709943 -828822
-16543 -828822 -480311 -131800 33195 198192 -38250 -274693 -258803 -609942 -1094895 -845787 -237297
-16532 -237297 371193 169159 -32874 -257847 251239 611339 359723 131046 514086 740373 599631
-16521 599631 275373 -48883 209900 468685 176925 -114834 -150438 -186042 -221645 -257249 14438 286126
-16509 286126 129613 -26900 118621 264142 -18536 -301216 -601101 -900985 -650325 -399665 -382221
-16498 -382221 -364778 -347334 -329891 -293928 -257966 -38489 180987 56374 -68238 -169912 -271586 -187834
-16486 -187834 262948 461397 48130 -368959 -174333 -17939 505484 274298 43112 140724 238336
-16475 238336 301538 364741 733802 1102863 1007402 911941 1183509 843361 407633 338934 -12682 247416
-16463 247416 200820 154225 -282339 -718904 -387000 -55096 276807 608711 627110 645509 480394 315278
-16451 315278 35466 -244346 26385 297118 128179 -40759 -209698 -378637 -474934 -571232 -484014 -396797
-16439 -396797 -416630 -436463 -586286 -736109 -1038860 -485209 -413285 -341360 -359521 -377681 -395841 -414002
-16427 -414002 -317465 -220929 -552594 -884259 -263940 356378 387919 419461 493058 -45060 173819 25669
-16415 25669 -92850 155658 174775 193891 -501936 -1197763 -1098359 -998955 -777208 -555461 -394886 -846026
-16403 -846026 -654865 -96674 216830 530335 285409 40484 -204441 -449367 -419020 -388673 -404205 -419736
-16391 -419736 -73973 -462270 -437658 -413046 -181980 49086 -25705 -100497 -95957 -91417 -270392 -449367
-16379 -449367 -261311 -73256 -313403 -553549 -906481 -1259413 -939456 -619500 -253665 112169 294489
-16368 294489 476809 155897 -165014 110497 -348051 -623084 -898118 -790829 -683539 -354503 -25466
-16357 -25466 334155 -40281 -181502 411337 163066 -85204 -344467 130329 192218 254106 101894 -50317
-16345 -50317 -202529 -354742 -143747 67246 -27617 -122481 61750 245982 2012 -241956 -69433 103089
-16333 103089 -397275 -897640 -545425 -193210 -70389 52431 243115 -300261 -430728 -561196 -347573
-16322 -347573 -133950 232601 -134906 -425471 18022 2729 -12563 -131083 -249603 -184608 -119613 -323200
-16310 -323200 -526787 -424515 -322244 -552594 -782943 -707434 -631926 -412329 -192732 26863 246460
-16299 246460 274895 303330 -81142 268444 149685 30925 263903 496881 378122 259363 140604
-16288 140604 21845 -173855 -369557 -14713 340129 549690 759250 341802 -75646 -519857 -230009
-16277 -230009 -398948 -567887 287799 409425 26385 -356653 -374336 -392018 -363822 -335625 -922969 -776252
-16265 -776252 -805405 -100497 149446 32359 -237655 -507671 -907676 -940651 -338971 -471350 -308863
-16254 -308863 -146376 153747 453870 157570 -138729 -465615 -58441 669883 664148 528423 25669
-16243 25669 73459 121249 -37414 -196078 -268002 -339927 16349 372626 365697 358767 168323 -22121 -44343
-16230 -44343 -66566 -88788 -111011 -224991 -338971 -192971 -46972 107629 -471828 -1051286 -896684 -684734
-16218 -684734 -472784 -643156 -813529 -584374 -355219 -431923 -508626 -474456 -440286 -406116 -371946 -126782
-16206 -126782 118382 -141119 -400620 -683061 -231442 59600 -16386 -254860 240725 919826 864867
-16195 864867 511697 525556 516476 140365 282303 791270 1032611 539893 460083 13243 -273020 -559284
-16183 -559284 -376247 -193210 -193688 -194166 84451 363068 458171 553274 103089 -347095 -369079 -391062 68680
-16170 68680 528423 437621 346820 526511 706203 748259 56254 -314598 -685451 -803971 -555461 -235266
-16158 -235266 -649130 -443632 -238133 -250559 -262984 -91895 79194 57210 35227 59122 83017 -416869
-16146 -416869 -182696 273223 362113 443715 525317 400464 275612 357214 438816 -30126 -499068 -140282
-16134 -140282 218503 271430 324358 178478 32598 559606 1086614 469521 -147570 -91775 -35980 42754
-16122 42754 121488 -52109 508351 369162 -137057 -337418 -170749 286484 9659 -221287 -85204
-16111 -85204 -48883 -12563 -136818 -261073 -3005 255062 -37414 -329891 -138729 52431 -62265 -176962
-16099 -176962 -322244 -467527 -184608 98310 183855 269399 49086 -171227 -192732 -214238 -52229 109780
-16087 109780 149446 189112 412293 635473 449569 263665 261275 258886 70711 -117463 107271 -402054
-16075 -402054 -494648 -587242 -611017 99266 476929 487562 238216 355900 530932 705964 598078 490191
-16063 490191 297715 105239 -523083 -417347 89827 229972 194249 158526 390428 622331 670719 719106
-16051 719106 564863 410620 -171824 -754269 -463943 -173616 116709 407036 81822 -243390 -140402
-16040 -140402 -37414 107629 252673 237141 221609 -27139 91141 232362 -360476 -221645 -82814
-16029 -82814 10137 103089 123400 143711 -218300 -580312 -865859 -417347 -351157 -1019027 -1266343 -779598
-16017 -779598 -690469 -968370 -945191 -310296 -19492 -95718 -233115 -370512 -530849 -691186 -603012 -514839
-16005 -514839 -426666 -338493 -556178 -773863 -685690 -597517 -611137 -624757 -332519 -40281 41678 123639
-15993 123639 205599 287560 17783 -251992 -338254 187200 456498 358767 -251276 -494289 -394169 -294048
-15981 -294048 12526 319101 411576 504050 290666 77282 -73017 -223318 54582 332483 63662
-15970 63662 -205158 -550443 -284012 579 -326545 -271347 -216150 -214477 -212804 33554 -87116 -232637
-15958 -232637 233557 493297 141321 95203 49086 -35263 -119613 -426188 -732763 -488794 -244824 -237894
-15946 -237894 -230965 -246974 -262984 130091 156136 -299544 -143508 -6589 -481386 -199184 83017 449330
-15934 449330 -40759 -699071 -745667 -731091 -716515 -480191 -243868 -69672 104523 95203 -525831 -665140
-15922 -665140 -437419 -209698 -349007 -456535 47652 184810 321969 359723 397478 129374 -138729
-15911 -138729 -291180 -443632 -167881 107868 -212804 -533478 -854151 -1174824 -1094536 -1014248 -933961 -853673
-15899 -853673 -391062 71547 83017 94487 419461 377405 14199 262709 178598 94487 -257249 -608986
-15887 -608986 -374276 -139566 -317764 238097 -28035 -294167 -285027 -275888 -523860 -37772 264799 -166687
-15875 -166687 -613467 -1060247 -849431 95442 488817 148131 -116089 -380309 -965681 -816994 -408326
-15864 -408326 340 169099 337859 323104 308348 25967 -256413 -156471 -56530 290547 -96435 -330488
-15852 -330488 -564541 -550085 198431 228180 257930 46816 -164297 -375411 -586525 -357967 -129410 -84368
-15840 -84368 -39325 176805 392937 -476726 -612332 -128574 355183 211931 68680 -179709 -428100
-15829 -428100 -492975 -557851 -293928 -30006 -71942 -113878 89170 292219 -55275 -402771 -306772 -210773
-15817 -210773 -420633 -630492 -353846 -77199 -60532 -43865 -895071 -1012217 -425890 160437 395506
-15806 395506 -103484 -189566 -275649 -403787 -531924 -231861 68202 -341898 -751999 -856242 -960484
-15795 -960484 -812394 -664304 -516213 -368123 -143867 80389 304645 528901 298193 67485 264979
-15784 264979 462472 147653 -167165 -436105 -705045 -962515 -485926 -284609 -83292 555783 460800
-15773 460800 518745 576691 68799 294967 536428 777889 356019 -65849 185169 436188 488399 540610
-15761 540610 592820 645031 599392 553752 508112 462472 370954 279435 600825 188156 179793 171429 117187
-15748 117187 62945 -25705 -114356 -615916 -383416 -63937 255540 483261 -23077 -433835 -844593 -429533
-15736 -429533 -14474 202732 -314120 -723922 -1133724 -549487 34749 -298588 -631926 -763588 -895250
-15725 -895250 -721055 -546859 -403249 -259639 -421887 -584135 -648891 -713647 -350201 13243 399628
-15714 399628 786013 866540 947067 555425 163783 77999 -7784 -32396 -57008 224237 505484 222804
-15702 222804 -59875 85645 231167 414921 598675 354227 109780 -231920 -573621 -609464 -645307
-15691 -645307 -126782 391743 604410 817077 645509 473942 -110533 39050 -29289 -97629 -120091 -142552
-15679 -142552 9898 162349 314800 467251 237380 7508 -405877 -819264 -379115 61033 72981
-15668 72981 84929 -308385 -701699 -299783 102133 256974 411815 61989 -287835 -817352 -612809
-15657 -612809 -515317 -417825 -482820 -547815 -612809 -677804 -689274 -700744 -712213 -723683 -618544 -513405 -591782
-15644 -591782 -670158 -565019 -459880 -354742 -249603 30448 310499 361157 411815 623048 100221 -193210
-15632 -193210 -486643 -459104 -431565 -404025 -376486 -398649 -420812 -442975 -465137 -22778 419581 250223
-15620 250223 80866 3267 -74332 -151931 -229531 -129589 -29648 460262 950173 583681 584218 34211 95920
-15607 95920 146160 196400 -82157 -360715 -463405 -566094 -57067 451959 -3960 -459880 -304084 -148287
-15595 -148287 -225708 -303128 -197033 -90939 -75646 -60353 77282 581948 788402 383140 -22121 -427383
-15583 -427383 -470155 -512928 -372185 -231442 -297154 -362866 -245063 -127260 -8500 110258 -138012 -386283
-15571 -386283 -416630 -446977 -477324 -507671 -198527 110616 419760 728903 456917 184930 -87056 -359043
-15559 -359043 -351934 -344825 -337716 -330607 -170570 -10532 149505 309543 213425 117307 21188 -74929 -171047
-15546 -171047 -267166 -363284 -459403 -415973 -372543 -329114 -285685 -127558 30567 188693 346820 -66566
-15534 -66566 -479952 -526309 -572666 -630492 -688318 -562630 -436941 17544 472030 559487 279913 -141119
-15522 -141119 49564 -126782 -303128 -99063 105000 309065 -98585 -448889 -432162 -430728 -796324 -1116042
-15510 -1116042 -1068729 -1067296 -1065862 -1114130 -1162399 -843637 -524875 -557612 -590348 -256055 78238 183138
-15498 183138 288038 25907 -236221 -257488 -278755 67007 412770 418266 423762 245743 67724 165455
-15486 165455 263187 360918 458649 109063 -240523 21606 283736 225671 167606 109541 51475 39289
-15474 39289 27102 14916 2729 -482103 -966936 -595366 -223796 -96913 29970 156853 283736 125789
-15462 125789 -32157 589834 477765 583621 689477 565938 442401 410142 377884 345625 313367 223760
-15450 223760 134153 44546 -45060 91858 228778 319818 410859 761879 378839 -615916 -876612 -599428
-15438 -599428 -322244 -366211 -410178 -813529 -1216879 -565019 86840 295206 -230487 -389151 -547815
-15427 -547815 -140641 -467527 -947342 -1427157 -1306725 -452234 402257 522688 505484 488279 425196 362113
-15415 362113 8464 -345184 -331802 -318421 -18297 281825 214918 148012 -103842 -355697 -424038 -492378
-15403 -492378 -641006 -789634 -571232 -352830 140843 634518 761162 887806 570956 254106 304286
-15392 304286 354466 -178395 -711258 -387717 -64176 -15908 32359 -531088 -1094536 -1061561 -1028586 -185086
-15380 -185086 658413 855787 319101 241203 163305 6791 584338 672511 393654 107151 187678 38811
-15368 38811 -110055 -56291 -2527 -499307 -262028 -238850 518387 602737 687087 563788 440489 317190
-15356 317190 193891 231167 268444 259841 251239 292339 -400620 -481864 -196078 40006 -90939 -198945
-15344 -198945 60078 -78513 -217105 -80425 -310775 -311730 421373 879204 970006 1079924 455782 -191299
-15332 -191299 -104320 74415 253151 -72779 -398709 -481625 -564541 -219256 126028 62228 -1571 -65371
-15320 -65371 -129171 -82098 -35024 317906 670838 515281 359723 204166 48608 -7784 -64176 -372902
-15308 -372902 -314598 45741 -327979 -495245 -295482 -46016 -163580 -518185 -505759 -615677 8464
-15297 8464 227344 -287835 -112922 61989 213963 365936 284692 570479 657457 10376 -374813 -392974
-15285 -392974 -174094 -322244 -7784 -60353 -342316 109780 220653 331527 -62265 -456057 -394886
-15274 -394886 -333714 -578400 -823087 -347095 128896 176686 224476 12287 -199901 -228575 -257249 -188431
-15262 -188431 -119613 255062 629739 79194 -471350 -349007 -226663 211095 648855 291383 -66088
-15251 -66088 432842 931774 757817 583860 387919 191979 -141597 -475173 -544947 119338 370715
-15240 370715 622092 363068 104045 395566 687087 466296 245504 24713 -196078 -451278 -706479
-15229 -706479 -778164 -849850 -630970 -412090 -621412 -830733 -539212 -247691 456738 427107 -34546 -496201
-15217 -496201 -330846 -165492 -510777 -856062 -895489 -934916 -829061 -723205 -433835 -144464 -160952 -177439
-15205 -177439 -453906 -730374 -945669 -426905 91858 -123436 -69672 -15908 450764 183377 -259878
-15194 -259878 30925 46457 61989 -121286 -304562 -181980 -59397 -185325 -311252 -54857 201537
-15183 201537 577886 220175 275373 330571 255779 180987 106195 31404 202254 373105 238097 103089
-15171 103089 121010 138932 156853 174775 -22360 -219495 -34307 150879 531052 177164 -482581 -408267
-15159 -408267 -496440 -584613 -321049 -57486 -69194 -80903 90902 262709 388935 515161 259065 2968
-15147 2968 -310476 110138 530753 217308 -305458 -828224 -479295 -130366 -91118 -51870 -196137 -340404
-15135 -340404 -376188 -411971 -264239 -116507 -182876 -249244 -499128 -749012 -830674 -912336 -810482 -708629
-15123 -708629 -507372 -306115 -104858 96398 47891 -615 386725 40006 -42910 241203 731771 488279
-15111 488279 49803 345386 365697 386008 -52468 -490944 -753552 -282100 117187 149446 -208264 168084
-15099 168084 418266 -65610 -228336 -391062 -590109 -55096 89947 -132039 -239328 -346617 -109816
-15088 -109816 126984 -40102 -207189 -741306 -1275423 -532581 210259 341384 472508 305421 138334
-15077 138334 -28752 -195839 -569380 -942921 -704746 -466571 -582522 -698474 -447395 -196317 -113460
-15066 -113460 -30603 52252 135108 -28632 -192374 -356116 -519857 -297453 -75049 514385 1103819 884222
-15054 884222 664626 628544 592462 606082 619703 21606 -576489 -585808 -595127 -604446 -613765 -447216 -280667
-15041 -280667 -114117 52431 72264 92097 111930 131763 -203963 -539690 -431923 409903 280630 151357
-15029 151357 -115551 -382460 4402 391265 166411 -58441 174775 407991 641208 874425 771198
-15018 771198 667971 564744 461517 633562 805607 610622 415638 243592 71547 83017 94487
-15007 94487 68680 42873 200581 358289 187200 16110 280869 -188431 -425471 -295482 -50795 193891
-14995 193891 -39325 -272542 -322244 -371946 -533955 -695965 -490944 -285923 -321766 -357609 -393452 -429295
-14983 -429295 -295959 -162624 -29289 104045 11809 -80425 -172660 -264896 -254382 -243868 -416869 -589870
-14971 -589870 -789634 -989397 -577445 -165492 -197033 -228575 -260117 -291658 -55574 180509 485412 56254
-14959 56254 -58919 192935 -151633 -496201 -366689 129852 442878 21845 163783 -61309 -446977
-14948 -446977 -832645 -900985 -235266 -5394 224476 445507 299507 -282339 -130127 331766 59600
-14937 59600 -74929 -209459 -306712 330093 875142 196758 38333 -120091 12048 144189 -87594
-14926 -87594 -319377 -184130 -48883 262231 573346 983865 170951 134153 464384 511697 559009 -35980
-14914 -35980 -630970 -858930 -1086890 -651281 -215672 -147093 -78513 -32874 12765 58405 104045 -29050
-14902 -29050 -162146 71786 305720 161154 16588 55538 94487 -132337 -359162 -218957 -78752 118800
-14890 118800 316353 146877 -22599 78417 179434 280451 381468 306616 231764 202792 173819 -303427
-14878 -303427 -46613 -202708 -358804 -499606 -640408 -414181 -187953 -267584 -347215 -59815 227583
-14867 227583 -47031 -321647 -229232 -136818 95442 327704 667015 272267 148968 25669 -143508
-14856 -143508 -312686 -432162 -551638 -671114 -790590 -619500 -448411 -93806 260797 -266091 -792979
-14845 -792979 -402293 -11607 88513 188634 288754 388875 206077 23279 -159518 -342316 -337776
-14834 -337776 -333236 -328696 -324156 -315972 -307788 -727805 -1147822 -845250 -542677 -10711 -212804 -265792 -318779
-14821 -318779 10555 339890 42216 -255457 -124930 5597 -237357 -480311 -371528 -262745 -337477
-14810 -337477 321849 140067 -41715 209482 460680 406020 351360 189649 27939 172086 316234
-14799 316234 163783 11331 501183 256974 -270153 -63220 571912 472986 -93328 74415 410381
-14788 410381 746347 776455 72503 87318 102133 -295959 -694053 -587481 -480908 -160235 -573621 -574099
-14776 -574099 -574577 -357131 -139685 31881 203449 417072 -103364 -623801 -410178 -170988 68202 47413
-14764 47413 26624 277285 527945 350404 172863 118621 64379 193652 322925 322208 321491 320774 320057 170234
-14750 170234 20412 -129410 -279233 -440525 -601818 -763110 -924403 -945191 -965980 -23315 185288
-14739 185288 -198706 -582702 -462031 -341360 -307907 -274454 -57486 159482 173819 188156 202493 216830
-14727 216830 147056 77282 313367 549451 426152 302853 179554 56254 -246974 -550204 -425232
-14716 -425232 -300261 -102648 94965 -13280 -121525 -12802 95920 -24749 -145420 154464 -279711
-14705 -279711 -117463 44785 80150 115514 -154978 -425471 -428339 -431206 -128215 174775 219697 264620
-14693 264620 3685 -257249 -292614 -327979 -363344 -398709 5836 410381 -56769 -523919 -1086651 -915322
-14681 -915322 -438136 -695009 -474934 -254860 -508865 -762871 -634554 -506237 -194405 117426 196041
-14670 196041 274656 536786 798916 709309 619703 346581 73459 -31440 -136340 309304 754949 776216
-14658 776216 797483 558770 320057 -291419 -168837 -92134 -749490 -149004 -282578 -309102 -335625 -629775
-14646 -629775 -189865 97115 384096 862239 606321 212768 -180785 -221884 -262984 -120569 21845
-14635 21845 72503 123161 326748 -203724 -598472 -259161 -195122 -131083 154702 440489 -114834 63901
-14623 63901 366414 668927 466774 264620 257452 250283 243115 235946 607277 978608 722930 467251 177164
-14610 177164 621136 652200 683264 539654 396044 -160474 17066 133436 249805 -16147 -282100
-14599 -282100 -343511 -404921 -160474 83973 83734 83495 -344945 -773385 -368840 35704 669644 569523
-14587 569523 431170 292817 414443 536070 237141 -61787 312172 686131 830697 975263 936314
-14576 936314 897365 537025 176686 244548 312411 -24988 -362388 -393930 -425471 -506715 -587958 -363344
-14564 -363344 -138729 -67044 4641 76326 148012 142038 136064 130091 124117 14916 -94284 25907 146100
-14551 146100 -135145 317668 770481 489235 77999 -333236 4880 342997 183377 23757 -89983
-14540 -89983 -203724 -638616 -339449 -147331 44785 95442 146100 196758 247416 76326 -94762 -51751
-14528 -51751 725319 761401 63423 -175767 -414957 -218300 -21643 175013 371671 23518 -324634
-14517 -324634 -458686 141321 328420 -218539 -306712 -394886 -68000 258886 35227 -188431 272267
-14506 272267 732966 765463 797961 384096 -29767 183377 396522 1179327 1228074 772154 316234 168562
-14494 168562 20890 -126782 -274454 -273020 -271586 -453668 -635749 -763349 -890949 -880913 -870877 -134428
-14482 -134428 -132039 -680194 -494289 -640050 -785811 -457491 -129171 -481386 -833601 -681150 205360
-14471 205360 74893 -55574 165694 386964 229733 72503 221131 369759 421851 473942 480155 486368
-14459 486368 825201 429975 264142 98310 -94284 -286879 -708868 -396797 -348529 -300261 -206114 -111967
-14447 -111967 161871 435710 526034 616357 217308 -181741 -565497 -215194 -173616 -132039 -44582 42873
-14435 42873 -60831 -164536 37616 239769 428541 617313 851964 1086614 197236 41917 391265
-14424 391265 740612 546105 351599 157092 -37414 -94284 -151155 -253904 -356653 172863 -31679
-14413 -31679 -465615 -165492 279913 -8739 -266807 -524875 -542080 -559284 -989397 -685451 -293570 98310
-14401 98310 153747 209184 95442 715761 1519595 1589369 1032133 474898 299985 125073 200581 276090
-14389 276090 168084 60078 -9695 -79469 -378637 56254 339651 623048 814687 272267 188634 105000
-14377 105000 159004 213007 261275 309543 510741 -22121 -631448 -506715 245026 262709 281347 299985
-14365 299985 456260 612534 776455 940376 553752 167128 342519 517909 265098 12287 -83770
-14354 -83770 -179829 -459403 -738976 -500502 -262028 -23554 214918 273700 332483 -67522 266532 578603
-14342 578603 156614 147534 138454 649333 426152 -164058 -20209 452436 925083 587205 249327 33793
-14330 33793 -181741 -30245 121249 382663 644076 706681 35227 -234788 -504803 -637183 -769562
-14319 -769562 -453190 -136818 156614 450047 59122 -698832 -1296211 -1159531 -818308 -477085 -701699
-14308 -701699 -926314 -565975 -205636 -212326 -219017 -183652 -148287 70592 289471 565699 841928 529379
-14296 529379 216830 -239089 -327979 -225708 610622 812298 279913 -367167 -280189 -303845 39528 268205
-14284 268205 129852 392937 1023053 582665 509307 585055 293772 25430 491147 1044798 1965479
-14273 1965479 2587948 1497611 1443369 1389127 616118 -156890 -234071 -311252 -411373 -511494 -252231
-14262 -252231 -359998 -353069 387919 777172 432364 592223 385052 -190343 -398709 -652953 -907198
-14251 -907198 -649130 -391062 -132994 125073 -3005 -131083 107868 346820 214918 83017 -48883
-14240 -48883 -180785 -92850 -4916 -100497 -196078 -54618 86840 -628102 -1343046 -1200631 -1058216 -1099315
-14228 -1099315 -1140415 -741843 -343272 -97629 -586047 -961918 -603729 -291419 -713169 -867293 -1021417
-14217 -1021417 -1267298 -779120 -161907 455304 483739 512174 349448 -180307 -572427 -230487 -151394
-14206 -151394 -439330 -864904 -1290477 -1150212 -1376977 -1443167 -775297 -669441 -563585 -365972 -902419
-14195 -902419 -903614 -904808 -646024 -1121299 -1410191 -475651 101 -258205 -485926 20412 557336 360201
-14183 360201 -311013 241203 265815 -76602 -159040 -241479 -346856 -452234 -225947 340 -140402 -281144
-14171 -281144 -89266 102611 110974 119338 -75885 -271108 -351635 -65132 462233 255540 117665 -20209
-14159 -20209 -174572 -328935 -483298 -637660 -562630 -487599 -435507 -383416 -60831 -105276 -723205 -607075
-14147 -607075 -318899 -30723 96876 224476 223043 -145420 -376247 126984 205838 -82337 -324634 -199901
-14135 -199901 -189865 -179829 -582702 -251514 -505281 -1126078 -676371 -593693 -452473 -311252 -376486 -441720
-14123 -441720 -162863 115992 -216866 -549726 -758331 -966936 -992026 -1017116 -713408 -409700 -473023 -536345
-14111 -536345 -307907 -79469 126028 -35502 231167 -236221 -588914 -207547 175730 -175050 -525831
-14100 -525831 -142552 206316 -178873 -105276 -31679 18978 69636 579081 354466 -218061 -56530 13243
-14088 13243 83017 -392018 -867054 -1158575 -1450096 -1045790 -641484 -604207 -566931 -434312 -301694 -329652
-14076 -329652 -357609 -121764 481111 724603 234034 -141836 216352 574541 198670 -249842 35704
-14065 35704 458888 148012 187439 226866 -146615 -520096 -362149 -204202 -46255 111691 284931 458171
-14053 458171 264381 70592 266771 462950 292100 121249 313605 505962 331288 156614 268683
-14042 268683 380751 309304 237858 281108 324358 367608 410859 148251 -114356 -629297 -410178 -230726
-14030 -230726 -418303 -720577 -1022851 -751640 -480430 -392735 -305040 -322483 -339927 -357370 -374813 -197272
-14018 -197272 -19731 -209220 -398709 -108382 181943 449330 716717 460322 -163102 -992982 -1088801
-14007 -1088801 -830972 -573143 -85921 401301 360918 320535 -63937 -448411 -552116 -288791 364502
-13996 364502 283736 302375 321013 110258 -100497 -279711 -458925 -271108 -83292 -166925 -250559 124595
-13984 124595 -234310 -598950 -229531 728665 952801 718151 850530 776455 335350 95920 223521
-13973 223521 305242 386964 143711 -99541 -159279 -219017 -149004 -78991 358050 795093 723647 652200
-13961 652200 580753 509307 246699 -15908 111452 238813 -207308 -286401 -159040 -765739 -538018 -310296
-13949 -310296 -518423 -726550 -300022 -240523 -410417 153747 691149 861522 466057 437621 233318
-13938 233318 29014 -588197 -471350 -113400 -122481 304286 364024 232601 -265852 30925 327704 238336
-13926 238336 148968 -307429 -763827 -734675 -705523 -309341 86840 200103 313367 495448 310499 10854
-13914 10854 445268 466774 121249 7030 -107188 -611376 -1115564 -583657 -51751 -131561 -211371 -95957
-13902 -95957 19456 203688 -346139 -590109 -467049 -619261 -404444 -657971 -911499 -958573 -1005646 -746861
-13890 -746861 -488077 -596322 -704567 -349246 6075 -5633 -17342 146817 310977 108107 -94762
-13879 -94762 17783 130329 242876 355422 330332 305242 280152 255062 450286 645509 473703 301897
-13867 301897 256257 210617 96159 348731 499988 -82814 -413285 -376725 -267524 208706 134392 60078
-13855 60078 437860 815643 826396 837149 389114 -58919 -139924 -220929 -66805 87318 119099 -583179
-13843 -583179 -987247 -167881 513847 461517 143352 -174811 -232996 -291180 -490825 -690469 -890113 -1089757
-13831 -1089757 -1115445 -1141132 -860961 -580790 -162983 254823 -367287 -989397 -806719 -624040 -854270
-13820 -854270 -350440 459 351360 442281 533202 413846 294489 175133 55777 135228 214679 -11726
-13808 -11726 -238133 -278277 -318421 -358565 -398709 -542080 -685451 -477085 -268719 -897640 -792501 -427383
-13796 -427383 -62265 -178873 -295482 138454 572390 520777 469163 234034 -1093 73459 148012 222565
-13784 222565 297118 196758 96398 -111011 415638 414682 413726 275134 136542 302016 467490 1045873
-13772 1045873 890196 554827 219458 21726 -176006 3804 183616 57569 -68477 8106 84690
-13761 84690 161274 237858 33434 -170988 -482461 -59875 -256652 -453429 -604327 -755225 -282937 189351
-13749 189351 524003 124595 241322 358050 321849 1019708 906684 793659 910029 1026399 378122
-13738 378122 -270153 -123197 23757 195563 367370 233318 99266 186961 274656 362352 450047 301658
-13726 301658 153269 4880 -143508 94248 332005 263903 195802 97115 -1571 -100258 -198945 -439092
-13714 -439092 -679238 -735870 -792501 -460119 -127737 -101214 -74690 -120808 -166925 -29528 107868 143950
-13702 143950 180031 170234 160437 410620 -73256 -98346 -123436 -462270 -67044 -268241 -469438 -299783
-13690 -299783 -130127 -143986 -157845 30925 219697 -96196 -412090 -689752 -233354 -235744 -238133 133675
-13678 133675 -228575 -590826 -219017 68680 356378 261753 167128 64857 -37414 533202 1103819
-13667 1103819 951846 799872 647899 495926 312650 129374 251956 374538 298312 222087 -267046
-13656 -267046 -22121 2968 28058 404885 781712 229494 -322722 -324395 -326067 -292614 -259161 -42193
-13644 -42193 174775 -13518 -201812 160437 522688 523644 524600 97354 -329891 -91895 146100 567611
-13632 567611 989122 503572 18022 83017 148012 308588 469163 201537 -66088 19934 105956 146100
-13620 146100 186244 211095 -498113 -457969 316234 584338 118382 111213 104045 -6350 -116746 -823565
-13608 -823565 -796324 -243390 309543 235468 161393 -77080 -315554 -554027 -792501 -524397 -256294 -171704
-13596 -171704 -87116 -33112 20890 120771 220653 -355219 -197033 -145898 -94762 -123914 -153066 -365733 -578400
-13583 -578400 -296676 -14952 -375530 -2049 772871 813731 273462 -266807 33076 332961 632845
-13572 632845 932729 605604 278480 -2766 -284012 -761198 -504325 58405 -112922 -20448 72025
-13561 72025 -19014 -110055 -136101 571912 316473 61033 149685 238336 464623 690910 817077 209184
-13549 209184 -169315 186244 -24032 499749 472986 446224 335350 224476 419461 614446 427107
-13538 427107 239769 -131083 -501936 -542080 -582224 -71823 438577 237858 37138 -25944 -89027 287560
-13526 287560 -69911 -197989 -326067 -217105 -108143 -182696 -257249 -144464 -31679 -347095 -662511
-13515 -662511 -645307 -628102 -565019 -501936 -977928 -719860 -691186 -662511 -461792 -261073 46696 -379592
-13503 -379592 -272781 -165970 78477 322925 139171 -44582 -411851 -779120 -495484 -211848 -111728
-13492 -111728 -11607 -156173 -300738 -445304 -589870 -581507 -573143 -610659 -648174 -81620 -249125 -263701
-13480 -263701 -278277 -343511 325314 611817 164261 -126543 316712 255301 193891 521732 115514 -137773
-13468 -137773 -391062 -472306 180509 328659 -257249 -307907 375494 294250 213007 166172 119338 500705
-13456 500705 882072 656740 431409 206077 -19253 210378 440011 363785 287560 318385 349209 74176
-13444 74176 -200857 -215911 -230965 -505998 -781032 -1301707 -1088323 -859647 -630970 -566692 -502414 -277560
-13432 -277560 -52707 -126065 -566453 -1213295 -1126078 -905047 -684017 -722966 -761915 -513405 -264896 -199901
-13420 -199901 -134906 -138729 -142552 -100497 -58441 -430250 -68000 -118657 -169315 -265852 -362388 -275410 -188431
-13407 -188431 13243 214918 -294526 -436941 -583179 4641 225432 79194 -43149 -165492 -310775
-13396 -310775 -456057 -89027 278002 117426 -43149 -592260 -774341 -704089 -1367897 -1328231 -554505
-13385 -554505 -10173 167128 -198467 -197033 -80903 402257 178120 -46016 -247213 -448411 -490944 -533478
-13373 -533478 -576011 -618544 -217583 183377 156136 128896 208706 288515 184810 81105 237380 393654
-13361 393654 244071 94487 22323 -49839 61511 172863 -29289 -231442 -127737 -24032 101655
-13350 101655 227344 47174 -132994 -408745 -684495 -264418 155658 -63698 83973 461039 104045
-13339 104045 22323 307632 134153 327704 77760 -172183 29014 230211 75848 -78513 72981
-13328 72981 224476 261514 298551 519104 739656 769047 798438 506678 214918 -209698 99744 363307
-13316 363307 626871 492819 358767 224715 90663 194607 298551 402496 506439 67485 -371468
-13305 -371468 -443393 -515317 -299544 -83770 132002 347776 219458 91141 574541 1057940 725319
-13294 725319 392699 840016 553274 320057 86840 -192254 -471350 -514361 -557373 -233354 90663
-13283 90663 147056 203449 76326 -50795 -67761 -84726 -285207 -485687 -257966 -30245 197475 425196
-13271 425196 301180 177164 129613 82061 -233115 675139 528184 381229 462472 543716 624960 706203
-13259 706203 611578 516953 422328 327704 91619 -144464 -380548 -616633 -393930 -171227 51475 274178
-13247 274178 143950 13721 -529415 -338493 -365494 -392496 -190104 12287 -274693 -561674 -527504 -493334
-13235 -493334 -214477 -669680 -528460 -387239 -73495 240247 186961 133675 206555 279435 -14713 -308863
-13223 -308863 88991 486845 517670 548495 376689 204882 216591 228300 -284729 -797758 -454385 -111011
-13211 -111011 98549 308109 517670 727231 443595 159959 -123675 -407311 280152 967616 309304
-13200 309304 -349007 -425949 -502892 -579834 -656777 -408745 -160713 -279711 -398709 -200379 -2049 12765
-13188 12765 27580 352077 676573 389353 102133 306198 510263 347298 184333 -368601 -921535
-13177 -921535 -862753 -803971 -504325 -204680 507873 486368 323403 160437 -48405 -257249 -135862 -14474
-13165 -14474 -76602 -138729 -434074 -729418 -657732 -586047 -791545 -997044 -835512 -673981 -868010 -1062039
-13153 -1062039 -613765 -899552 -814246 5119 228061 83973 -392735 -502414 -451517 -767650 -477802
-13142 -477802 -187953 -104559 -21165 169279 359723 183138 6552 90424 174296 212290 250283 548256
-13130 548256 112169 -346856 -71823 15872 -263462 -863948 -1097404 -933244 -769084 -581985 -394886
-13119 -394886 -117224 160437 -127737 -415913 -402054 345864 313844 281825 230689 179554 311933 444312
-13107 444312 232601 20890 -7306 -35502 92336 220175 -19014 -258205 -164775 -71345 -854 69636
-13095 69636 394371 352077 317429 -451278 -371229 -291180 -257010 -222840 -374575 -526309 -311013 -95718
-13083 -95718 -109816 -123914 -138012 -152110 47891 247894 539654 97354 -482581 -328457 -21404 285648
-13071 285648 280869 276090 271311 266532 -28811 -324156 -267763 -211371 -965502 -985574 -500980 -16386 -40281
-13058 -40281 -64176 -363344 71547 526750 247894 427824 607755 355661 103567 34988 -33591 -79230
-13046 -79230 -124870 -476368 -827866 -602057 -376247 78955 -199901 -125826 -51751 -23554 4641 21367
-13034 21367 38094 54821 71547 55777 40006 24235 8464 134153 259841 385530 511218 376211
-13022 376211 241203 -77319 -395841 -419975 -444109 -162386 119338 -252709 -624757 -568603 -512450 -593932
-13010 -593932 -675415 -451039 -226663 187678 602020 710504 818988 751604 684220 433320 182421 267966
-12998 267966 353510 255540 157570 71069 -15430 203927 423284 218264 13243 -191777 -396797 -353308
-12986 -353308 -309819 -449844 -589870 -645785 -701699 -207069 287560 220175 152791 85406 18022 120532
-12974 120532 223043 -102648 -428339 -230248 -32157 -17581 -3005 -261789 -520574 -351157 -181741
-12963 -181741 113842 409425 32120 -345184 -427144 -509105 -132278 -489510 -1125839 -1028108 -716276 -404444
-12951 -404444 -193927 16588 456498 162349 -315314 -792979 -398948 -4916 -13220 -21523 -213342 -405160
-12939 -405160 -463166 -521172 -150976 219219 302673 386127 469581 553035 464444 375852 -18596 -413046
-12927 -413046 -544648 -676251 -379652 -83053 129433 341921 126207 -89505 -213461 -337418 -33172
-12916 -33172 271072 403272 535472 117127 -301216 -411851 -522486 -633120 -743755 -563824 -383894
-12905 -383894 -203963 -24032 180748 385530 406797 428063 456977 485890 86601 -312686 -304801 -296915
-12893 -296915 -289030 -281144 -311491 -341838 -372185 -402532 -148048 106434 177403 248372 166411 84451 186005
-12880 186005 287560 100162 -87235 -274633 -462031 -454444 -446858 -622786 -798714 -433655 -68597 112946
-12868 112946 294489 479856 665223 300045 -65132 40902 146937 252971 359006 507097 655187
-12857 655187 619762 584338 690373 796407 474241 152074 449270 746467 370775 -4916 -159518
-12846 -159518 -314120 -285207 -256294 265815 787925 881833 975741 897603 819466 741329 663192 447418
-12834 447418 231645 15872 -199901 -61070 77760 -89266 -256294 -21882 212529 18739 -175050
-12823 -175050 -114595 -54140 -177201 -300261 66051 432364 370476 308588 97115 -114356 -19970 74415
-12811 74415 314083 553752 487562 421373 343713 266054 494253 722452 231884 -258683 45980 350643
-12799 350643 122922 -104798 -149004 -193210 -111250 -29289 465579 226388 201298 176208 288754 401301
-12787 401301 77999 -245302 -308624 362113 260080 158048 101894 45741 73698 101655 129613 157570
-12775 157570 -62982 -283534 168801 621136 228539 -164058 -373141 -582224 -602057 -621890 -91178
-12764 -91178 439533 419700 399867 196519 -6828 179793 366414 247177 127940 169279 210617 251956
-12752 251956 293295 237380 181465 538459 161393 -192732 -546859 -273976 -1093 -122003 -242912 -547337
-12740 -547337 -851761 -613287 -374813 -136340 102133 40722 -20687 -82098 -143508 154464 452436 322208
-12728 322208 191979 -91178 -374336 -229292 -84248 -172421 -260595 33554 327704 487084 -87594
-12717 -87594 -249364 -411134 -247930 -84726 -105037 -125348 -195361 -265374 92814 451003 243354 35704
-12705 35704 133914 232123 519821 807519 299985 -207547 256018 719584 510263 300941 101177 -98585
-12693 -98585 298074 694733 17066 73459 267488 461517 300224 138932 -22360 -183652 -96435 -9217
-12681 -9217 77999 165216 250522 335828 421134 506439 274417 42395 -189626 -421648 -594888 -768128
-12669 -768128 -635510 -502892 -167642 167606 196997 226388 169756 113125 -127021 -367167 -634076 -900985
-12657 -900985 -372663 155658 116709 77760 38811 -137 87079 174296 689715 -18297 -269436 213485
-12645 213485 -98824 -411134 -478758 -546381 -889277 -498113 -11368 -258683 -70150 485412 494253 503094
-12633 503094 534875 566655 315517 64379 -3244 -70867 -96435 -122003 35943 193891 -299185 -792262
-12621 -792262 -734794 -677326 -703970 -730613 -734316 -738020 -825835 -546620 -60950 -309341 -114237 80866 46577
-12608 46577 12287 -324036 -660361 -79111 502138 437263 372388 -105396 150879 -51631 -254143 -594291
-12596 -594291 -934439 -643754 -353069 -368242 -383416 -558567 -733719 -603012 -472306 10137 492580
-12585 492580 256257 19934 294011 -165970 -235983 61033 -211609 -484253 -428100 -371946 -117224 137498
-12573 137498 392221 646943 358767 70592 -79947 -230487 362591 221609 80627 673706 544194
-12562 544194 414682 331049 247416 97474 -52468 -202410 -352352 -288194 -224035 -159876 -95718 5716
-12550 5716 107151 208586 310021 75012 -159996 -395005 -630014 -509224 -388434 -267644 -146854
-12539 -146854 -71942 2968 77880 152791 132122 111452 136662 161871 -313761 -55335 180151 48608
-12527 48608 -226903 -502414 -189148 124117 395327 666537 570717 474898 219458 -35980 274417 584816
-12515 584816 757578 196280 -709107 -880435 -1057260 -867054 -470394 -73734 223521 520777 206316
-12504 206316 -108143 -319377 -530610 -130127 270355 -158801 -587958 -405399 -222840 -202051 -181263
-12493 -181263 -343989 -506715 -558567 -610420 -295243 19934 -66327 -152588 128179 408947 330332 251717
-12481 251717 173102 94487 -164058 -422604 -69433 283736 -35980 -355697 -675415 -995132 -446021
-12470 -446021 103089 254584 -327979 -818786 -575533 -408745 125073 95681 -300738 -100736 99266
-12459 99266 -75407 -250081 -57725 134631 303092 471553 272984 74415 -250320 -575055 -288074
-12448 -288074 -1093 -26422 -51751 -260595 -469438 -575055 -680672 -786288 -891905 -589392 -286879
-12437 -286879 -596083 -905286 -790112 -674937 -559762 -444588 -315554 -186520 -241000 -295482 -487599
-12426 -487599 -679716 -504803 -329891 -284012 -238133 -8739 220653 94487 -31679 -157845 -284012
-12415 -284012 -264179 -244346 -224513 -204680 -108382 -12085 -282817 -553549 -100736 352077 193174 34271
-12403 34271 188873 343474 131046 -81381 -81859 -82337 -82814 -83292 -267285 -451278 -268241 -85204 -125826
-12390 -125826 -166448 -207069 -247691 147534 542760 326270 109780 -306473 -722727 -771951 -821175 -656299
-12378 -656299 -491422 -693575 -895728 -621890 -348051 -441242 -534433 -501458 -468483 -435507 -402532 -373619
-12366 -373619 -344706 -499307 -653909 -143269 367370 21606 -324156 -212087 -100019 -171466 -242912 -50556
-12354 -50556 141799 334155 526511 275612 24713 -226186 -477085 -517707 -558328 -415435 -272542 30925
-12342 30925 334394 270833 207272 273700 340129 -449844 -1239819 -1019744 -799670 -396080 7508 116709
-12330 116709 225910 -276604 -779120 -406116 -33112 -27139 -21165 -145181 -269197 -393213 -517229 -302172
-12318 -302172 -87116 -239089 -391062 -489510 -587958 -319377 -50795 87796 226388 -246735 -719860
-12307 -719860 -883303 -1046746 -598472 -150199 -123197 -96196 114320 324836 107151 -110533 -328218
-12296 -328218 -545903 -172899 200103 190784 181465 -248408 55777 -7067 -69911 -685212 -566453 -432401
-12284 -432401 -298349 -160474 -22599 -144703 -266807 -551399 -101931 775738 919348 604171 288993
-12273 288993 356139 423284 565699 708115 544672 381229 447180 513130 762596 1012061 313367 -385327
-12261 -385327 -411134 -436941 -164536 107868 74415 40962 -313642 -668246 -59397 -184608 -210415 -236221
-12249 -236221 -124392 -12563 -313642 -614721 -487599 -360476 171907 704292 441445 178598 7747
-12238 7747 -163102 629500 688043 218981 -250081 198431 -87116 5836 98788 -37653 -174094 -371707
-12226 -371707 -569320 -354025 -872789 -871594 -870399 -915083 -959767 -625952 -292136 41678 375494 -66805
-12214 -66805 -509105 -278516 -47928 25907 99744 -86399 -1006602 -1187907 -1369211 -923506 -477802 -207966
-12202 -207966 61870 148191 234512 125849 17186 137916 -475412 -622308 -769203 -778463 -787722 -517886
-12190 -517886 -248050 -406415 -564780 -390525 -216269 -42013 132241 190844 249447 170414 91380 -239985
-12178 -239985 162708 114260 65812 302614 -72301 -126065 187200 118143 49086 -364061 -165492 -149482
-12166 -149482 -500502 -94523 -55574 -142791 -230009 110974 451959 261992 439055 975502 900232 664387
-12154 664387 1040258 605604 170951 316473 461995 424001 386008 470358 554708 639058 723408 466774
-12142 466774 210139 -46494 -303128 25191 353510 131285 -90939 81583 254106 426630 599153
-12131 599153 523166 447180 409425 371671 45741 331527 479677 260797 18978 -222840 -327023 -431206
-12119 -431206 -571710 -1079243 -952121 -213282 250283 346820 137498 295206 669883 432842 364024
-12108 364024 -71823 -25944 386964 19934 -347095 -190343 -33591 -60353 -87116 -64176 -41237 -18297
-12096 -18297 4641 32359 60078 -218061 -496201 -587003 -677804 -585091 -492378 -650086 -807794 -55574
-12084 -55574 -159757 -447455 -735153 -525831 -316509 -358386 -400262 -13937 372388 200521 28655 40304
-12072 40304 51953 -47270 -146495 427167 633801 -42730 -107546 -149422 -191299 173998 -72420 25250
-12060 25250 122922 109720 96518 -100198 -296915 -551936 -806958 -878464 -949970 -799729 -649489 -805106
-12048 -805106 -960723 -887126 -813529 -510538 -207547 -241000 459605 380273 300941 -213282 -727506 -675893
-12036 -675893 -624279 -148287 -406355 -435029 -463704 -113878 235946 585772 935597 753994 572390 390787
-12024 390787 209184 190067 170951 197714 224476 -287835 -66088 -73734 -81381 226149 533680 887090
-12012 887090 506439 68441 -369557 -486404 -603251 -305279 -7306 -30484 -53662 -917951 -1048180
-12001 -1048180 -734914 -421648 -156173 109302 7747 -93806 -378876 -663945 -581985 -500024 -304323
-11990 -304323 -108621 132958 -359521 -439092 -518663 -689991 -127260 -324395 -521530 -305756 -89983
-11979 -89983 110497 310977 -268480 -113878 76087 266054 -63937 -393930 -582463 -36936 279196
-11968 279196 595330 298074 818 -296437 -593693 -554505 -515317 -109099 297118 256018 214918 403212
-11956 403212 591506 72503 287560 135586 -16386 -549248 -348051 -559762 -771473 -665857 -560240
-11945 -560240 141799 109780 -212804 -535389 -536823 -538257 -295004 -51751 7986 67724 -33352 -134428
-11933 -134428 -235505 -336581 -173855 -11129 -215433 -419736 -14235 391265 429736 468207 479916 491624
-11921 491624 319818 148012 482783 817555 540610 263665 239052 214440 373343 532246 266771
-11910 266771 1296 102850 204404 191262 178120 27341 -123436 -254143 349209 585532 87796
-11899 87796 152074 216352 -376964 -970281 -703372 -436463 -322483 -942563 -1050330 -424038 -623562 -823087
-11887 -823087 -631209 -439330 -247452 -55574 -169554 -283534 15394 -419736 -80664 258408 184572
-11876 184572 110735 67485 24235 -19014 -62265 166411 395088 256735 118382 201776 285170 1534
-11864 1534 -282100 -317226 -352352 -20448 311455 54582 -202290 -138012 -73734 336545 12765 101894
-11852 101894 191023 211334 231645 894258 2290931 5458714 3977452 1624495 984343 355661 -273020
-11841 -273020 -427622 -582224 -311969 -41715 45024 131763 153508 175252 196997 218742 48369 -122003
-11829 -122003 74654 271311 272984 274656 92814 -89027 15394 119816 224237 328659 146339 -35980
-11817 -35980 -218300 -400620 -219734 -38847 142038 322925 450286 577647 93292 -391062 -255577
-11806 -255577 -120091 -30484 59122 909551 1025921 285887 279913 105717 -68477 32598 133675 -224035
-11794 -224035 152313 895692 905011 498793 92575 68680 44785 -67044 -178873 15155 209184 116470
-11782 116470 23757 359245 694733 544672 394610 244548 94487 -30245 -154978 316712 54343
-11771 54343 -43626 -141597 -147809 580037 807996 1035957 759250 482544 484934 487323 489713 492102 427824
-11758 427824 363546 -6589 -376725 -16625 343474 565938 54343 -179112 -412568 -386044 -359521 -264179
-11746 -264179 -168837 -119374 -69911 299746 -64654 -16147 32359 210856 389353 384335 379317 530096 680874
-11733 680874 525794 370715 318862 267010 398672 530335 594374 658413 722452 786491 334394 -117702
-11721 -117702 -141597 -165492 -77558 10376 -85204 -180785 121249 423284 541804 660324 240725 -178873
-11709 -178873 -369079 -559284 -650086 -6828 330571 -66088 -425471 -784855 -517229 -249603 -66088
-11698 -66088 117426 -81381 -280189 -873984 -733719 -165253 -330846 -771712 -1212578 -1072314 -197989
-11687 -197989 -78752 40484 312650 -149243 -179112 -208981 21128 251239 -26183 -303606 -581029
-11676 -581029 -858452 -917951 -977450 -685212 -392974 -660839 -194644 -110772 -760960 -1070880 -646741 -681389
-11664 -681389 -716037 -463345 -210654 -141477 -72301 -60473 -48644 -220331 -392018 -620098 -848177 -892741
-11652 -892741 -937306 -1150093 -1362879 -612212 -595605 -634435 -673264 -329771 13721 -51870 -117463 -183055
-11640 -183055 -248647 -298946 -349246 -216030 -82814 698 84212 -138132 -360476 -138729 83017 289471
-11628 289471 -238133 -521052 -803971 -995132 -452234 -490466 -528699 -92850 342997 40962 -261073
-11617 -261073 -547815 -100497 -121525 -142552 295206 -1093 -270631 -540168 -962635 -651042 -563107 -475173
-11605 -475173 -524875 -574577 -708390 -842203 -960723 -345184 -93209 158765 273103 387442 337381 287321
-11593 287321 237260 187200 126626 66051 -254501 -575055 -627983 53148 15513 -22121 -60711 -99302 -137893
-11580 -137893 -176484 -108024 -39564 -276963 -514361 -562510 -610659 -658808 -706956 -992145 -1277334 -1256665
-11568 -1256665 -1235996 -962635 -689274 -415913 -142552 -400620 -658688 -610898 -563107 -148287 266532
-11557 266532 -404444 -341360 -392974 -444588 -266807 -89027 -302172 -515317 20890 557097 382185 -526787
-11545 -526787 -885214 -509582 -345184 -180785 -398709 -616633 -723683 -830733 -1243642 -1656551 -1238146
-11534 -1238146 -819742 -401337 17066 -42432 -101931 -528460 -954988 -628341 -301694 -342077 -382460 -434312
-11522 -434312 -486165 -354503 -222840 -186759 -150677 -68716 13243 -826193 -931571 -884020 -836468 -251753
-11510 -251753 -401098 -504564 -608030 -512689 -417347 -322005 -226663 -346617 -466571 -540646 -614721 -1216402
-11498 -1216402 -1084022 -997522 -911021 -738498 -565975 19456 -129171 -549248 -969325 -1236474 -769562
-11487 -769562 -483298 -197033 -48405 100221 -68477 -237177 -38847 159482 -7306 -174094 26146
-11476 26146 226388 266054 305720 -67522 293295 472747 652200 510502 368803 165933 -36936 -652714
-11464 -652714 -534433 -131322 271789 109063 -53662 35943 125550 215157 304764 100700 -103364 -307429
-11452 -307429 -511494 -295004 -78513 137976 354466 -4438 -363344 -355219 -347095 -553072 -759048 -353308
-11440 -353308 52431 33793 15155 409425 69636 -48405 -166448 36660 239769 277524 315278 -13996
-11428 -13996 -343272 -99063 145144 -222362 -589870 -495006 -400142 107629 -118657 -245541 -372424 -178156
-11416 -178156 16110 335589 655068 607516 559965 137737 -284490 -339688 -394886 -508985 -623084 -737184
-11404 -737184 -851283 -521888 -192493 -230128 -267763 -213641 -159518 307512 40484 10495 -19492 -95359
-11392 -95359 -171227 -79350 12526 104403 196280 112289 28297 -101572 -231442 162468 -177678 -655462
-11380 -655462 -766216 -880794 -628341 37019 -31679 -58680 -85682 -158562 -231442 -281383 -331324 -312447
-11368 -312447 -660600 -1113891 -833123 -667051 -500980 -55813 -344706 -174811 -4916 -485926 -232876
-11357 -232876 448374 762596 182182 -31201 137737 306676 71308 -164058 -491183 -84248 223282
-11346 223282 -203246 -583896 -230487 -17222 196041 88154 -19731 -51153 -82576 650647 160437
-11335 160437 -607911 -152827 149326 451481 115156 -221168 -190462 -159757 -129530 -99302 -252590 -405877
-11323 -405877 -176842 52192 97712 143233 112289 81344 302733 157092 68799 714566 970364 492102
-11311 492102 153986 -184130 -591065 -263940 -575294 -519618 -28094 -270631 9659 289949 164977
-11300 164977 -327023 -830495 -599906 -438136 -276365 -137296 1773 140843 279913 166650 53387
-11289 53387 -59875 -173138 -6350 160437 281347 402257 741090 345864 363546 381229 315876 250522
-11277 250522 491027 731532 635593 539654 443715 347776 163902 -19970 25549 -662989 -560121 -457252
-11265 -457252 -400262 -343272 -275529 -207786 -140043 -72301 -356295 -640289 -740768 -841247 -526906 -212565
-11253 -212565 -448769 -684973 -840889 -996805 -724519 -452234 -362627 -273020 -183413 -93806 -103603 -113400
-11241 -113400 -123197 -132994 -500263 -867532 -806599 -745667 -657971 -570276 -299066 -27856 253868 535592
-11229 535592 389114 242637 -106471 -455579 -376486 -297393 -61548 174296 410142 645987 174535
-11218 174535 -296915 26863 350643 269280 187917 381826 -158323 -377322 137737 790434 709071 535950
-11206 535950 362829 -162027 -686885 -450920 -214955 -407192 -599428 -521172 -442915 -364658 -286401 -319018
-11194 -319018 -351635 -567767 -783899 -269794 244309 207869 171429 207630 243831 280033 316234 304286
-11182 304286 292339 -316031 -190343 -152588 -114834 -214716 -314598 -578878 -843159 -679238 -515317 -534911
-11170 -534911 -554505 -390584 -226663 -403010 -579356 -495723 -412090 95920 -130127 56732 243592 48130
-11158 48130 -147331 -36936 73459 -271108 -615677 -532044 -448411 -958095 -1467779 -1182231 -896684 -454385
-11146 -454385 -12085 2012 16110 164022 311933 436904 561876 453631 -21643 -703372 -651042 -526787
-11134 -526787 -402532 -232398 -62265 84929 232123 73459 -85204 77282 239769 708115 1176460
-11123 1176460 750170 323880 203449 83017 256018 429019 418505 407991 328659 249327 -82337 -46972
-11111 -46972 247416 -192254 -654865 -383416 285648 220653 193891 -199901 -766933 -599906 10615 254106
-11099 254106 115276 -23554 -185325 -347095 -317704 -288313 -258922 -229531 -73973 81583 237141 392699
-11087 392699 -271825 -936350 -316270 303808 124834 -54140 -538973 -1023806 -987725 -951643 -487360
-11076 -487360 -23077 -94045 -165014 -190104 -215194 -638377 -327501 -383655 -439808 -790351 -406833 -376
-11064 -376 -327979 -463465 -231920 588400 674662 435949 197236 -64415 -326067 -550204 -407311 -12085
-11052 -12085 -350918 -888560 -692141 -67522 -176962 -516751 -122481 118860 360201 245982 131763
-11041 131763 201059 270355 93531 -83292 -260117 -436941 -388195 -339449 -290702 -241956 -122481 -3005
-11029 -3005 116470 235946 26624 -182696 -208503 -234310 -92850 48608 6552 -35502 -169315 -303128
-11017 -303128 281825 132719 -79469 -291658 -320333 -349007 -907198 -731330 -540168 -349007 -422604 -496201
-11005 -496201 -661556 -826910 -596561 -366211 -112922 140365 -424515 -622368 -812573 -268719 441445
-10994 441445 417549 -65132 -547815 -537779 -527743 -425949 -324156 -438375 -552594 -238611 75371 123639
-10982 123639 171907 -85682 -343272 -235744 -128215 -326545 -524875 -351157 -177439 -95479 -13518 39767
-10970 39767 93053 -159518 -412090 -200140 11809 -82098 -176006 -185803 -195600 -21882 151835 -152349
-10958 -152349 -456535 -210176 36183 206077 375972 240008 104045 302614 501183 72742 -355697
-10947 -355697 -631209 -172660 530574 866779 443834 387919 492580 230211 218264 206316 156136 -628102
-10935 -628102 -466093 -304084 -692619 -347095 -339927 -332758 -96196 140365 29731 -80903 -604446 -393930
-10923 -393930 218025 829980 570240 310499 -21882 -354264 -503131 -651998 -571471 -490944 -104559
-10912 -104559 281825 275373 268921 -43388 -355697 -488316 -620934 -570037 -519140 -491183 -463226 -389390 -315554
-10899 -315554 -566692 -83770 628544 606799 225193 577647 1067737 823767 518626 213485 290666
-10888 290666 367847 135347 -97152 98549 294250 386725 479199 617552 755905 93292 164738 542043
-10876 542043 185288 178359 171429 -477802 -392974 -462987 -533000 -465376 -397753 -393213 -388673 -78274 232123
-10863 232123 -12085 -256294 -194644 -132994 144667 422328 562354 702380 1199878 963315 420895
-10852 420895 612534 221131 -170271 -164058 -157845 -267285 357334 874903 169040 -406833 -248647 184810
-10840 184810 -115790 -500502 -151155 -566453 -981751 -771951 -562152 -444109 -326067 -244346 -162624
-10829 -162624 -80903 818 -251992 -504803 -207069 90663 223998 357334 184810 12287 -167881
-10818 -167881 -348051 -512928 56254 -25466 -107188 -448889 -790590 -438375 -86160 82539 251239
-10807 251239 264142 277046 198192 119338 195324 271311 41439 -188431 -53185 82061 33793 -14474
-10795 -14474 191501 397478 924605 717673 488757 259841 168562 77282 228778 380273 271789 163305
-10783 163305 838582 290427 -410656 -377681 -237655 -97629 -217583 -337537 -82814 171907 74893
-10772 74893 -22121 110258 -491422 -1062517 -410178 -142075 126028 42395 -41237 -287357 -533478 -963113
-10760 -963113 -1392748 -1079721 -766694 -545425 -324156 -766216 -1208277 -610420 -12563 162827 338217
-10749 338217 85406 -167404 -343750 -520096 -390584 -261073 -36936 187200 227822 268444 177164 85884
-10737 85884 86362 86840 -56052 -198945 -158323 -117702 -94284 -70867 -47450 -24032 18500 61033 -79947 -220929
-10723 -220929 -208981 -197033 -1571 193891 -36936 -267763 -498591 -729418 -742321 -755225 -951643 -1148061
-10711 -1148061 -820698 -493334 17544 528423 427585 326748 95920 -134906 -272064 447180 378839
-10700 378839 310499 525078 739656 403690 67724 -298827 -665379 -481386 -297393 93053 483500
-10689 483500 568089 652678 478243 303808 -176484 -656777 -441242 -225708 -170749 -115790 -243390 -3960
-10677 -3960 90186 -427383 -409700 -24988 -542558 -693097 -43865 238336 -228814 -328935 -392735 -89505
-10665 -89505 -153305 -217105 -241717 -266329 -382699 -499068 -284729 -70389 -39564 -8739 136781 282303
-10653 282303 -376 -283056 -213999 -144942 -504086 -863231 -490227 -117224 -4199 -258205 -70628
-10642 -70628 -494767 -712452 -563107 -77319 408469 611339 814209 489474 164738 -45299 -255338
-10631 -255338 -439569 -256771 -28094 -533478 -620217 -339927 -701939 -696920 -600145 -503370 -429533 -355697
-10619 -355697 -193927 -766216 -1055587 -610898 -538018 -832167 -445782 -59397 82300 223998 -62504
-10608 -62504 -349007 -42193 264620 143233 21845 275134 528423 -13518 -555461 -384372 -213282
-10597 -213282 -225708 -238133 70592 379317 259841 140365 -79469 -299305 -90939 117426 -178873
-10586 -178873 -475173 -587958 -700744 -647219 -593693 -234310 125073 -115790 -356653 -597517 -838380
-10575 -838380 -705583 -572785 -569977 166889 513787 493656 -23495 -540646 -744293 -213880 -96375 21128
-10563 21128 119517 217905 10435 -197033 -502951 -808869 -1122434 -701939 -128514 77880 -380967 -839814
-10551 -839814 -1046328 -1252842 -1275841 -1298840 -1054213 -809586 -381444 46696 -29050 -104798 2968 110735
-10539 110735 -163819 -438375 -407072 -375769 -696204 -1016638 -786527 -556417 -353069 -149721 -252231
-10528 -252231 -354742 -217344 -79947 57449 194846 408708 622570 285887 -50795 -169554 -288313
-10517 -288313 -407072 -525831 -189626 146578 77521 8464 -384312 -410059 321192 318385 -101154 -520693
-10505 -520693 -557910 -595127 -536763 -478399 -420035 -361671 -521231 -680791 -656836 -632881 -473202 -313522
-10493 -313522 29671 372865 452257 531649 427526 323403 234572 145742 56911 -31918 81882 195683
-10481 195683 615342 1035001 501421 -32157 229494 491147 236663 -17820 155897 329615 279674
-10470 279674 229733 179793 129852 171668 213485 255301 297118 -313881 -924880 -495962 -67044 -330130
-10458 -330130 -593215 -428100 -262984 -68238 126506 15394 -95718 -53901 -12085 29731 71547 -111489
-10446 -111489 -294526 -477563 -660600 -293092 74415 136064 197714 271789 345864 114081 -117702 -464182
-10434 -464182 -810661 -728940 -647219 -679716 -712213 -438853 -165492 31404 228300 172863 484456 744435
-10422 744435 270355 232123 193891 -39325 -272542 -77558 117426 20412 -76602 -127737 -178873 -654387
-10410 -654387 -395841 -122003 151835 452436 753038 617791 849574 1066064 548495 30925 247416
-10399 247416 435710 256974 78238 266532 665103 329615 1773 -326067 -228575 -131083 12287
-10388 12287 155658 -339449 -100497 115514 -35502 -167642 -299783 -149004 1773 -153305 -308385
-10377 -308385 -73495 161393 -6111 -785333 -425232 -65132 99983 265098 170234 442401 563549
-10366 563549 -171704 -478758 70592 501421 565222 216113 -132994 -145659 -158323 -476846 -795369 -387478
-10354 -387478 20412 244787 469163 61989 -345184 -201812 -58441 -79469 -100497 -465615 -219017
-10343 -219017 -247691 -276365 123161 522688 685175 235946 -213282 -50795 288515 627827 699512 159482
-10331 159482 -212326 -217105 -466571 -716037 -612809 -509582 -834557 -792501 -333714 -486643 -823087 -792501
-10319 -792501 -517468 -854151 -624996 -28811 295923 253629 12526 -228575 -470633 -712691 -977689
-10308 -977689 -1242686 -762154 -648652 -879241 -498113 -123197 -115312 -413285 -711258 -397514 -83770
-10297 -83770 229972 543716 434993 326270 217547 108824 -473979 -1056782 -821414 -586047 -460358
-10286 -460358 32359 234512 -175050 -64654 45741 -310296 -666335 -695487 -724639 -65610 -18297 -169793
-10274 -169793 290427 460083 -226663 -715081 -591782 -437897 -284012 -351874 -419736 -304084 -188431
-10263 -188431 -250559 -312686 -68955 174775 269399 364024 458649 553274 427585 301897 772632 509307
-10251 509307 418027 326748 556619 786491 762118 737745 805129 138454 -421170 -246735 248850 10376
-10239 10376 -35980 -82337 -495723 -909110 -1376021 -1108873 -1025240 -1308637 -1251766 -827866 -610420 -392974
-10227 -392974 -695487 -630970 -841725 -318421 62945 77282 -252470 -215194 147056 142277 7508 -494289
-10215 -494289 -952121 -675893 -193210 -444588 -814485 -450322 -338493 -593693 -574816 -555939 -972910
-10204 -972910 -655821 -617827 -579834 -312447 -45060 -257488 -469916 -315314 -160713 -155217 -149721 -121286
-10192 -121286 -826910 -474217 -488555 -663467 -838380 -936828 -301216 334394 235946 -40281 -316509 -26900
-10180 -26900 262709 131763 818 236902 472986 553513 634040 347537 61033 244787 428541 -167642
-10168 -167642 -29767 -14235 1296 -120808 -242912 162588 568089 361874 155658 134392 113125 275373
-10156 275373 437621 378122 318623 442639 566655 80866 -404921 -523681 -642440 -826193 -1009947
-10145 -1009947 -826671 -643395 -572904 -502414 -271347 -407311 -199184 -725117 -746384 -400620 231884
-10134 231884 130329 97593 64857 -331085 -727028 -511255 -295482 -274693 -253904 -49600 154702 420178
-10122 420178 685653 629978 574302 136303 432364 453153 473942 926756 645509 -2766 83017 46457
-10110 46457 9898 19217 28536 229016 429497 18261 -392974 -475412 -557851 -227380 103089 -663706
-10098 -663706 -696443 -1004451 -1312460 -676132 -773863 -458686 -143508 -92134 -40759 -402293 -29767 147773
-10086 147773 325314 502855 680396 735594 56732 -622129 -566931 -428578 -290225 -105993 78238
-10075 78238 -43388 -165014 493297 417549 41678 -334192 -557134 -46016 52192 150401 -317226 -784855
-10063 -784855 -581746 -378637 -83770 -522964 -579834 97354 -295959 -689274 -646741 -604207 -194644 214918
-10051 214918 597719 980520 996291 1012061 689477 366892 227822 88752 33793 -21165 107390 235946
-10039 235946 273700 311455 28058 -255338 -477563 34271 -50317 -134906 -168240 -201574 -234907 -268241
-10027 -268241 -152469 -36697 -287955 -539212 -334550 -129888 74773 279435 197355 115276 33195 -48883
-10015 -48883 -125228 -201574 -94404 12765 303450 594135 517790 441445 389951 338456 149326 -39803
-10003 -39803 -515676 -257488 46577 -383416 -567887 -18297 72503 163305 223521 283736 527467 771198
-9991 771198 397478 23757 78238 132719 -15430 -163580 -441720 14199 254106 126984 206316 285648
-9979 285648 667015 314322 -260117 -467527 -118657 230211 74415 -81381 -137 448135 -74690
-9968 -74690 136542 854473 838343 134033 -203246 155300 146817 207152 267488 172982 445507 786849
-9956 786849 394132 238455 816838 714686 245504 -27736 -300977 -199542 635951 1425567 502377
-9945 502377 -69075 -273498 -214118 -521769 72862 1401553 4703029 4823580 2007893 905011 19456
-9934 19456 -132039 83495 299029 342519 386008 -121047 -628102 -489988 -351874 -213760 -75646 -224274
-9922 -224274 -372902 -215672 -58441 352316 763074 623287 483500 397239 310977 607038 903099 1475389
-9910 1475389 1313619 624243 668927 86601 -128693 -321049 -513405 -746861 -980317 -907915 -835512 -640767
-9898 -640767 -446021 -388912 -331802 -286162 493536 516236 171907 267249 362591 251478 140365 324358
-9886 324358 508351 279435 784579 945633 1106686 1237154 1367622 1807771 1024487 539415 421373
-9875 421373 574780 728187 353988 -20209 -126304 -232398 -522008 -811617 -531566 -251514 -154978
-9864 -154978 -58441 45741 149923 208228 266532 642164 283736 -89983 -463704 -397753 -331802 -82337
-9852 -82337 167128 332483 497837 357334 216830 -96674 -410178 -295482 -180785 255062 690910
-9841 690910 209184 -272542 -15669 241203 46935 -147331 -173377 -566453 -860125 -419736 44546
-9830 44546 508829 223760 -61309 200342 461995 417788 373582 457932 542282 626632 710982 550646
-9818 550646 390309 275851 161393 1010389 2593444 6057527 5361939 2070379 980998 289232 331527
-9807 331527 638580 1679692 1298564 550407 157809 132241 618986 371671 184572 364502 705008
-9796 705008 311455 -120330 -552116 -693336 -100497 196997 -239567 -217344 -195122 -367884 -540646 -453429
-9784 -453429 -366211 -40998 -449844 -346378 124117 67007 9898 -330130 -670158 -243868 182421 302853
-9772 302853 423284 429019 434754 624004 813254 589595 365936 -41237 -448411 -572666 -696920 -362388
-9760 -362388 -761915 -1094058 -692141 -542558 -760004 -518663 -277321 124595 526511 236424 -53662
-9749 -53662 206794 467251 242159 17066 -208025 -433118 -435746 -438375 -58680 321013 352794 -349485
-9737 -349485 -646502 -209459 -28573 -214716 80866 376450 771437 1900484 5132306 6651323 3919865
-9726 3919865 1555438 727948 634518 506678 378839 -161907 31404 312650 -140163 -65371 -357609
-9715 -357609 -672786 -253904 -270870 -287835 12048 311933 183616 55299 179314 303330 243831 184333
-9703 184333 -46255 -276843 -507432 -738020 -620695 -503370 -569559 -635749 -372185 -108621 -150916 -193210
-9691 -193210 -17581 158048 333677 509307 424001 338695 436904 535114 530096 525078 825918 1126758 703336
-9678 703336 279913 185288 90663 80150 436666 579081 1455556 971917 121249 211095 667971 864867
-9666 864867 694733 -10651 18022 491147 230211 267488 304764 101177 264620 657457 316234 509307
-9654 509307 1069410 948978 828546 738700 648855 536070 423284 118382 -553549 -781987 -276365 -114834
-9642 -114834 -320333 -273498 -226663 -3960 218742 257930 297118 114559 -68000 55299 178598 22801
-9630 22801 -132994 -265852 -398709 -405399 -45060 139410 -410178 -650086 -155934 720540 862955 561876
-9618 561876 260797 97354 -66088 -172421 -278755 -568603 -858452 -842442 -826432 -504564 -182696 -479235
-9606 -479235 -775775 -644112 -512450 -434312 -356175 -698593 -1408041 -1709359 -1276617 -851522 -426427 -234549
-9594 -234549 -42671 103328 249327 691627 399867 -151872 -703611 -884498 -1065384 -573382 -81381
-9583 -81381 -245302 -409223 -267285 -125348 -6350 112647 -74212 -261073 -53185 154702 33793
-9572 33793 -87116 86362 -107188 -507193 -173138 -62743 47652 -101931 -251514 -305517 -359521 389353
-9560 389353 771198 -4438 -46016 149446 344908 322447 299985 277524 255062 247894 240725 50042 -140641
-9547 -140641 -59875 20890 -81859 -184608 -92373 -137 397955 796049 138932 -518185 -387717 109780
-9535 109780 264142 -315554 -444109 161393 315756 470119 777411 350643 10854 -328935 -943997
-9524 -943997 -824999 -530132 -235266 -513884 -58441 361396 414204 367608 321013 473225 -108621 -430489
-9512 -430489 -18297 305959 -103842 13960 -235266 -729179 -489032 -784138 -712213 290666 70114
-9501 70114 -425710 -187475 -323917 -827388 -696204 169040 177881 186722 80866 -24988 87079 566177
-9489 566177 1267023 744435 40722 71069 24952 -21165 -441959 -128693 643359 191979 174535 157092
-9477 157092 109063 61033 -128454 416116 868929 98310 -199184 -496679 -258922 -21165 -47211 -73256
-9465 -73256 -328696 -584135 -118896 -387717 -243629 -99541 -127499 -155456 137737 430931 609189 53387
-9453 53387 -43626 -140641 -287357 299985 520299 6552 24235 41917 197236 352555 312889 273223
-9441 273223 -87594 -448411 -786288 -390106 -406833 -423560 -371468 -319377 145622 -123436 -101931 -80425
-9429 -80425 -563585 -312686 217308 13243 84451 155658 371432 587205 191262 -204680 114320 433320
-9417 433320 385291 337262 176447 15633 221848 428063 351360 274656 197953 121249 -223796 -568842
-9405 -568842 156614 148012 -212326 161393 489235 83017 -121525 -326067 -423560 213007 471075 -4916
-9393 -4916 -22121 -39325 -105515 -171704 -54379 62945 -312925 -688796 -865859 -308863 -95957 116948
-9381 116948 329854 542760 1092110 907400 523883 140365 187678 234990 -130605 237858 487801 737745
-9369 737745 834759 197714 370237 542760 72981 337262 804173 1271085 2823793 5599935 4534927
-9358 4534927 1757113 1120306 483500 49325 -384850 -429056 -473262 -739215 -638138 -147093 -390106
-9347 -390106 -185803 18500 -190104 -398709 -390345 -381982 -740649 -1099315 -647457 -195600 -110772 -25944
-9335 -25944 -327262 -628580 -562869 -497157 -202051 93053 21128 -50795 -98346 -145898 -560479 -975060
-9323 -975060 -651759 -328457 -372185 -415913 -389868 -363822 -154261 55299 -182457 -420214 121966 -69911
-9311 -69911 -252709 -435507 -297154 -158801 -502175 -845549 -577206 -308863 -446738 -584613 -699549
-9300 -699549 -814485 -684734 -187953 148251 -249603 -84009 81583 270116 -275410 -369795 -97152
-9289 -97152 -122719 218742 128179 -329413 -741127 -1152840 -811378 -469916 -311969 -154022 141082 436188
-9277 436188 364263 292339 17783 -256771 -531327 -805882 -518423 -230965 56493 343952 107629 -128693
-9265 -128693 -181502 -234310 -152349 -70389 -516034 -594649 -761198 -193688 190306 207272 96159 -14952
-9253 -14952 -149004 -283056 -164775 -46494 71786 190067 -216389 -622845 -463465 -304084 176447
-9242 176447 -77080 -720577 -630014 -527026 -791067 -986291 -814485 -592976 -4438 -455818 -907198
-9231 -907198 -675176 -443154 -516990 -590826 -301455 -12085 93770 199625 388636 577647 583143 588639
-9219 588639 521494 454348 81344 -291658 -269436 -247213 -224991 -202768 -123197 -43626 -147570 -251514 -99302
-9206 -99302 52909 -223079 -499068 -86877 325314 -57725 -440764 -322483 -204202 97593 399389
-9195 399389 188873 -21643 -10412 818 -426666 -242434 -96435 49564 145861 242159 32598 -543991
-9183 -543991 -729179 -302650 -243151 -183652 -62982 57688 33076 8464 -160474 282303 725080 556141
-9171 556141 605127 654112 504289 354466 628305 1269173 1351851 822812 721974 254106 627349 1000592
-9159 1000592 634040 267488 206794 146100 -56052 -258205 -437419 -616633 -624757 -265852 85406 -175050
-9147 -175050 -401098 -15430 -12085 -8739 -167881 -327023 -486165 -645307 -590348 -535389 -174572 186244
-9135 186244 72264 -41715 -339210 -636705 -20448 595807 294489 -6828 -44343 -81859 -119374 -156890
-9123 -156890 -186759 -216627 -246497 -276365 102850 482066 433081 384096 235707 87318 -305756 -331802
-9111 -331802 207989 136064 2968 -130127 -171466 -212804 -208264 -203724 -284729 368325 256735 145144 530574
-9098 530574 181943 246221 310499 -34307 -379115 -418064 -457013 -2766 451481 278718 105956 -221645
-9086 -221645 184810 315995 447180 845990 510741 -130366 -37414 19217 75848 361874 647899 758056
-9074 758056 868212 718390 568567 164977 495448 229494 -36458 248133 532724 190306 -152110
-9063 -152110 -610181 -334192 201776 737745 692583 647421 296401 -54618 -160474 -266329 -66327 133675
-9051 133675 35466 -62743 144905 352555 241920 131285 326509 521732 537264 552796 614207 675617
-9039 675617 -367107 -675773 -357430 -39086 99564 238216 -51333 -340882 -292077 -243271 233736
-9028 233736 710743 954534 1198324 1442115 1685905 1111047 536189 465997 395805 723228 316592 -90043
-9016 -90043 237380 486427 735475 1060987 652439 328002 737625 1239006 1740386 1599405 1458423
-9005 1458423 904533 1084703 978130 871558 994379 1117200 1259137 1401075 824245 981476 1253403
-8994 1253403 1525330 1873721 1488053 815643 877292 1397729 1918166 1566908 1215648 1414934 1614220
-8983 1614220 1385304 1156388 667493 1402031 1295458 1188885 1051727 1648629 1925514 2202399 1974619
-8972 1974619 1746838 1993138 2239437 1690505 1141573 1113556 1085539 1608067 2130594 2729587 3328579
-8961 3328579 3178219 3027858 2543921 2794044 3181803 3569561 4561391 5553220 7707310 10595460 9108882
-8950 9108882 6398870 4973463 4282116 3896627 4245198 4532597 4819996 4905541 4991086 4893116 4795145
-8939 4795145 5607103 6419061 6802817 7186575 7700320 8214067 9201893 10189720 11456642 13457623 15152748
-8928 15152748 16847872 19458658 23782250 28748144 36405594 46949576 57493562 69306862 92620422
-8919 92620422 133765536 214794547 378772306 707424130 999999999 826937300 495531783 294544208
-8911 294544208 186353796 140558451 116356707 87995275 61988959 47972291 38421150 33519056
-8903 33519056 29152213 27966296 26505106 26756721 26266633 28468094 29935498 34583825 39446253 49447102
-8893 49447102 58775059 70794572 87623708 122804337 185726303 319852072 595777540 968843594
-8885 968843594 939583657 586603475 339129016 199072004 129178847 86935284 66392123 50498011
-8877 50498011 43137343 35042612 32170413 27585406 27007144 24226700 25265662 23613072 25691954 26058027
-8867 26058027 30384964 32509725 39864658 45506788 59452013 75599415 108691366 160134818 270440663
-8858 270440663 489142682 867043901 999035097 692154156 399220360 231657859 143618473
-8851 143618473 94438368 68014132 50337436 40246025 31537906 26500089 21798711 18810142 15855983
-8842 15855983 15104001 13266223 11428445 9957697 9221009 8209049 7931147 7144757 6358368 5679028
-8832 5679028 5733748 5344973 5690258 5163848 4637437 3789876 3676374 3455821 3235269 3530851 3826435
-8821 3826435 3693816 3561199 3241242 2921286 2647208 2373130 1674913 1710756 1517205 1323655 1497133
-8810 1497133 1670612 1247668 1558783 1395818 1232853 1115766 998680 694256 389831 513608 637385
-8799 637385 1002981 1368577 1305972 1243367 1054595 865823 447657 763552 798438 833325 914091 994857
-8787 994857 949456 904055 751604 1333213 1252447 1171681 953279 734877 577647 420417 569045 717673
-8775 717673 877771 1037868 112169 -79469 92097 263665 297596 331527 267966 204404 140843 77282
-8763 77282 29014 -19253 -480430 -207547 56732 321013 325314 329615 395088 460561 526034 591506 933446
-8750 933446 1275386 623287 -28811 -313881 135108 125311 115514 576930 304286 138693 -26900 -192493
-8738 -192493 -358087 -630731 -169315 -148526 -127737 -15191 97354 -501219 -365733 -459641 -553549 -481147
-8726 -481147 -408745 -336342 -263940 76087 416116 572629 729142 466535 203927 -58680 -321288 -308624
-8714 -308624 -295959 282542 861044 1202506 809908 853158 529379 18261 -492856 74176 641208 144428
-8702 144428 -352352 -237416 -122481 -512211 -901941 -435268 31404 231406 431409 516714 234990
-8691 234990 -192015 115037 192696 -96674 115514 327704 126984 -73734 207272 121249 -247691 117426
-8679 117426 829502 318146 -262028 -108143 106912 -45060 -403488 -27856 375494 44785 195802
-8668 195802 346820 -121525 -222840 249327 -12563 -262028 -511494 -195122 121249 391743 662236
-8657 662236 611578 560920 -23315 126506 184572 242637 346581 -283534 -363105 -75646 158287 25191
-8645 25191 -314359 80150 291144 135108 231406 327704 89469 -148765 -19970 108824 -244107 -597039
-8633 -597039 -582941 -568842 -333953 -99063 -70628 -409223 16827 -291180 -805644 -953077 -493095 -400142
-8621 -400142 -437180 -841247 -1260608 -945908 -256532 432842 843122 519343 241442 -36458 450286
-8610 450286 937030 812059 687087 266771 -153544 305481 764507 348014 298551 501421 -29767
-8599 -29767 -255099 253629 120055 -13518 -89744 -165970 124834 415638 8464 -398709 -438853 -478997
-8587 -478997 -266807 -54618 157570 369759 -98585 -566931 -423560 -280189 -205636 -131083 -102408 660324
-8575 660324 1764282 2868239 5394436 3271589 965227 371671 114559 -142552 -342316 -542080
-8565 -542080 -374813 -207547 -151155 -94762 -634793 -440764 -192254 56254 350643 645031 606799 568567
-8553 568567 1310273 1317919 1025443 732966 761640 790314 486368 182421 -350918 -150199 -267763 -385327
-8541 -385327 -502892 -620456 -313642 -740888 -755225 -769562 -653909 -538257 -422604 -306951 -348051 -389151
-8529 -389151 -246735 -104320 118860 342041 -291180 -924403 -850328 -776252 -289269 197714 -571232 -606119
-8517 -606119 -686885 -767650 -1116042 -1464433 -1201109 -937784 -662034 -386283 -110533 165216 -132516 -430250
-8505 -430250 -529176 105956 207750 309543 -154500 -618544 -608508 -598472 -588436 -578400 -545664 -512928
-8493 -512928 -480191 -447455 -414718 -381982 -349246 -316509 -400381 -484253 -614004 -743755 -307668 -605641 -490705
-8480 -490705 -375769 -268480 -161191 359006 145144 3924 -137296 -140880 -144464 96637 337740 257691
-8468 257691 177642 17305 591028 384813 178598 222565 266532 310499 354466 352555 350643 532246 713850
-8455 713850 731054 748259 581948 415638 314322 213007 -71823 -356653 -266807 -176962 -87116 2729
-8443 2729 92575 182421 88752 -4916 -163580 -322244 -480908 -639572 -622368 -605163 -1000867 -662511 -486404
-8430 -486404 -310296 -271825 -233354 -301933 -370512 -668485 -232398 -37175 158048 399150 640252 181704
-8418 181704 -276843 -429533 -582224 -264657 52909 64618 76326 187439 298551 409664 520777 295445
-8406 295445 70114 -155217 -380548 -196795 -13041 170712 354466 99983 -154500 -225469 -296437 141082
-8394 141082 578603 465579 352555 38811 -274932 -160474 -46016 106673 259363 -214955 -689274
-8383 -689274 -1143521 -863709 -1027391 -457013 98071 -80903 -229292 -377681 -191538 -5394 -538018
-8372 -538018 -336581 -276604 -216627 -110772 -4916 126984 258886 8464 -241956 -530610 -85204 -52707
-8360 -52707 -20209 16110 52431 -217105 -486643 -568842 -651042 -427383 -203724 152791 509307 896409
-8348 896409 549451 -218061 -251514 -437897 -624279 -497157 -370034 -59397 251239 160437 69636 -434074
-8336 -434074 -203724 177164 558053 556619 555186 320535 85884 -11129 -108143 -268241 -1162399 -1169567 -1176736
-8323 -1176736 -1107440 -304084 -219495 -134906 -376247 -617589 -675415 -733241 -622845 -512450 -952599 -1392748
-8311 -1392748 -974582 -556417 -444109 -331802 -483298 -634793 -235744 163305 97832 32359 -33112 -98585
-8299 -98585 -278755 -458925 -256771 -54618 275612 -128215 -119135 -110055 -204202 -298349 112169 522688
-8287 522688 712416 168084 220175 272267 714327 1156388 680874 205360 52909 -99541 -435507 -771473
-8275 -771473 -652475 -533478 -414480 -295482 -378876 -462270 -362149 -262028 -479235 -696443 49803 796049
-8263 796049 106673 151357 211334 271311 113364 -44582 103328 251239 244071 236902 -183174 130807
-8251 130807 291861 452914 277524 102133 -392496 -153066 86362 -408267 -325590 -242912 -22599 197714
-8239 197714 246460 295206 -84248 -463704 -327023 -190343 -7784 174775 -590826 -622368 -271586 79194
-8227 79194 59122 39050 -409223 -857496 -311969 233557 274417 -418781 -328218 -237655 -192971 -148287 167845
-8214 167845 483978 371910 259841 155419 50998 130091 209184 576691 944199 699990 455782 330093
-8202 330093 204404 101655 -1093 -509105 -650086 -752835 -243868 -78991 -281144 -605641 -930137
-8191 -930137 -901463 -872789 -844115 -815441 -511494 -207547 -270631 -333714 -197989 -62265 73459 209184
-8179 209184 -247691 -704567 -549726 -394886 -339688 -284490 -412807 -541124 -92134 356856 -65849 -121525
-8167 -121525 544433 353988 94726 202493 -33829 -270153 -116507 37138 46457 55777 65096 74415 -225947
-8154 -225947 -526309 -214955 96398 -84487 -265374 -262745 -260117 -249842 -239567 -45777 148012 -75885
-8142 -75885 -299783 -156651 -13518 164022 341563 -69672 -480908 -514600 -181263 37377 -600384 8225
-8130 8225 249805 -5633 -261073 61750 -227141 -309580 -759048 -1047941 -969803 -754030 -538257 -644590
-8118 -644590 -750924 -490227 -229531 54104 337740 254345 170951 124595 78238 31881 -14474 168562
-8106 168562 351599 -77080 -505759 -458447 -411134 -363822 -316509 -349485 -382460 -48405 285648 255540
-8094 255540 225432 34749 455782 865345 1274908 621614 -31679 -614243 -1196808 -701222 -205636
-8083 -205636 64379 -32635 -634315 -624279 -630014 -635749 -419736 -203724 -121525 -39325 -324156 -608986 -510538
-8070 -510538 -412090 -313642 -215194 -437897 -660600 -271586 117426 108346 99266 90186 81105 492580 904055
-8057 904055 696167 855309 1042169 494970 -29289 180509 493536 806563 309065 -188431 -281622
-8046 -281622 -374813 -284490 -194166 -84726 24713 -118179 105956 422806 5597 -709824 -201812 459127
-8034 459127 386008 603454 86840 -101931 -290702 -158323 -25944 33793 93531 -30245 -154022 -350440
-8022 -350440 -546859 -399187 -251514 -103842 -323200 -565497 -73734 -301933 -530132 -345422 -160713
-8011 -160713 -193927 -227141 -260356 -293570 -200618 -107666 54104 -518185 -731091 -576967 -308146 -39325
-7999 -39325 -112206 -185086 -5633 -193210 -506954 -86638 -102170 -117702 -119852 -122003 59361 240725 28297
-7986 28297 -184130 -29528 125073 283020 440967 -12802 -466571 -220690 25191 -317704 -660600
-7975 -660600 -566692 -105754 -493573 -147331 309782 32837 214679 396522 130091 -136340 -471589
-7964 -471589 -72779 280152 266054 -107427 -480908 -652714 -824521 -629297 -434074 -139446 155180
-7953 155180 -161907 -478997 -477085 -475173 -14474 -287835 -553549 -85204 -75646 -66088 -166448 -266807 -321288
-7940 -321288 -375769 -437897 234034 309543 385052 30448 -324156 -204680 -85204 -485687 -152110 -47928
-7928 -47928 56254 -298349 -652953 -457013 -261073 -198945 -136818 -74690 -12563 -285685 -558806 -648413
-7916 -648413 -738020 -697637 -657254 -616872 -576489 14438 605366 523405 441445 187439 -66566 61750
-7904 61750 190067 288038 -348051 -143030 61989 270833 479677 382663 285648 153269 20890 -157367
-7892 -157367 -335625 71069 -256294 -889516 -788678 -569559 -350440 -513644 -676849 -560957 -445065
-7881 -445065 -329174 -213282 -318182 -423082 -344467 -265852 -164297 -62743 38811 140365 95442 50520
-7869 50520 556141 1061763 756861 451959 330571 209184 97354 -14474 561876 -85204 -44104 -3005
-7857 -3005 -38370 -73734 -110294 -146854 -321049 -495245 -971476 -713647 -639333 -565019 -641723 15633 -366928
-7844 -366928 -749490 -1093819 -704089 -8500 -46972 -224991 -403010 -321049 -239089 -535628 -832167 -455818
-7832 -455818 -79469 -147570 -215672 -237894 -260117 -293809 406558 388158 369759 526571 683383 411994
-7820 411994 140604 25967 -88669 -203306 -317943 -173556 -29170 -190641 -352113 -257428 -162744 -251574
-7808 -251574 -340404 -593634 -846863 -1405950 -1965037 -1407742 -850447 -599010 -347573 -353248 -358923 -58740
-7796 -58740 241442 182242 123041 -349067 -87116 -210415 -333714 -411134 -488555 -657732 -826910 -1103138
-7784 -1103138 -645307 -383416 -121525 2729 126984 71547 16110 -39325 -94762 -511972 -929182 -749968
-7772 -749968 -570754 -781509 -258205 265098 54343 -313164 -680672 -467049 -253426 136064 -208503
-7761 -208503 -186042 -163580 65275 -439928 -715738 -991548 -785631 -579715 -419677 -259639 -147391 -769203
-7749 -769203 -595784 -422365 255719 199745 -116208 -432162 -293630 -155097 -16565 121966 157271 192576
-7737 192576 -200319 -593215 -843697 -1094178 -794114 -494050 -293391 -92731 -197929 -303128 -422604
-7726 -422604 -542080 -401576 -261073 62945 -347095 38094 423284 740612 323880 -276365 -142552
-7715 -142552 -215194 -287835 -131083 25669 -17342 -60353 80150 220653 169996 119338 496881 874425
-7703 874425 804651 734877 481589 228300 -2049 -232398 -34546 163305 325075 486845 342758 198670
-7691 198670 429258 659847 217547 -224752 -124153 -23554 8225 407036 427346 -286401 -380787 -475173
-7679 -475173 -325828 -176484 -27139 122205 -106949 -336103 -159996 16110 -438614 -1260369 -1248660
-7668 -1248660 -502892 -32396 438099 403929 369759 179793 -10173 -39564 -68955 -266568 -831211 -730613
-7656 -730613 104045 862239 886373 696406 506439 243831 -18775 -441959 -498113 -931093 -630014 -168359
-7644 -168359 293295 43829 -205636 531291 534158 120294 73459 3685 -433118 -629058 -457969 240725
-7632 240725 572390 -65849 -704089 -447694 -191299 -122242 -53185 199387 451959 211334 -29289 -269914
-7620 -269914 -510538 -361193 -211848 -62504 86840 270833 454826 332961 211095 -13996 -239089
-7609 -239089 -464182 -689274 -713647 -738020 -762393 -786766 -597039 -407311 -217583 -27856 -22838 -17820 -12802
-7596 -12802 -7784 -2766 2251 7269 12287 -137534 -287357 -391301 -495245 -962396 -695487 -635032 -941607
-7583 -941607 -724400 -507193 -572904 -638616 -853434 -334192 368564 337262 271550 205838 522449 839060
-7571 839060 513369 187678 45501 -96674 42873 182421 750170 1317919 876337 434754 -113878
-7560 -113878 71547 46696 21845 -140641 -303128 -232398 -161669 -90939 -20209 -152110 -284012 -110055
-7548 -110055 63901 -52707 -169315 -285923 -402532 -143508 115514 -7784 -131083 -908154 -951165
-7537 -951165 -734197 -517229 -376964 -236700 -279950 -323200 -117940 87318 292578 497837 -107427 -712691
-7525 -712691 -446260 -179829 -146615 -847460 -906003 -964546 -1374827 -1051047 -834318 -617589 -905525 -1193462
-7513 -1193462 -563824 65812 168801 271789 -53423 -378637 -386522 -394408 -356414 -318421 -917473 -782465
-7501 -782465 -341599 -634793 -534194 -433596 79911 -140641 -484492 -94284 -162863 -231442 -319138 -406833
-7489 -406833 -494528 -582224 -251276 79672 104762 129852 74654 19456 -463943 -947342 -646024 -344706
-7477 -344706 -548054 -751401 -1176497 -867532 -971476 -1075420 -956422 -837424 -718426 -599428 -480430
-7466 -480430 -361432 -242434 -123436 31881 187200 296640 406080 614924 89708 -206114 -501936
-7455 -501936 -322483 -143030 -269436 -395841 -579595 -763349 -396558 -29767 107629 245026 428302
-7444 428302 611578 91380 305242 106195 -92850 215396 523644 82539 -358565 -772907 -453190
-7433 -453190 -240523 -27856 -21643 -15430 174296 364024 -46494 -457013 -439330 -421648 -344945 -268241 221370
-7420 221370 -23077 68919 160915 207033 253151 251478 249805 64618 -120569 -221645 -322722 -423799 -524875
-7407 -524875 -337059 -149243 -267285 -385327 -239567 -93806 51953 197714 96876 -3960 -104798
-7396 -104798 -205636 -31201 143233 271789 400345 459127 -216150 -891427 -832645 -628580 -424515 -358087
-7384 -358087 -291658 -122958 45741 -45538 -136818 -625713 -380548 -242434 -104320 63184 230689 92336
-7372 92336 -46016 155897 357811 131524 -94762 -136579 -178395 -220212 -262028 -116507 29014 358050
-7360 358050 687087 555425 423762 -426666 -543036 -640289 -737542 -330130 -656777 -1193701 -996566 -952360
-7348 -952360 -908154 -818069 -727984 -637899 -547815 -597517 -647219 -391062 -134906 -27856 79194 2729 -73734
-7335 -73734 -123436 -173138 -39325 94487 83017 71547 -169315 -410178 231167 138454 -627147 -658688
-7323 -658688 -219973 218742 703336 1187930 3511496 5835063 3937787 2040510 1202267 364024 -481864
-7312 -481864 -104320 1091393 451959 -478041 -551638 -541124 -530610 -160713 209184 433798 658413 1066542
-7300 1066542 1474672 900232 325792 424240 522688 421373 320057 218742 117426 631650 1145874
-7289 1145874 796049 446224 1197488 847663 482544 484456 237858 -8739 -232398 -456057 -210415
-7278 -210415 35227 97354 159482 72503 -14474 793182 1600839 1754723 1541578 2773614 4617365 7439863
-7266 7439863 7203778 4214971 3305998 5052735 7166502 5036487 2906471 1839312 1628557 1853649
-7256 1853649 2078742 2093557 2108372 1595582 1082791 306198 -103364 -321766 -1151885 -1516525 -1024762
-7245 -1024762 -685929 -714125 -700266 -1053437 -550204 -46972 333916 714805 912180 497837 -126782
-7234 -126782 -384372 -458447 -532522 -470394 -408267 -346139 -284012 -263940 -243868 -392018 -907198 -1452964 -1142327
-7221 -1142327 -785811 -62265 18978 -511494 -369079 -226663 253091 732846 662057 591267 371372 151477
-7209 151477 -68418 -288313 -131620 25071 -468184 -349724 -384192 -418661 -414898 -411134 -600444 -789753
-7197 -789753 -673204 -556656 -279532 -2407 -153485 -304562 -423142 -541721 -660301 -778881 -247512
-7186 -247512 283856 -178813 -641484 -906003 -436463 -379831 -323200 -549487 -775775 -696204 -616633 -588675
-7174 -588675 -560718 -119852 -413046 -473023 -533000 -332997 -132994 104284 341563 150640 -40281 -135623
-7162 -135623 -230965 -326306 -421648 -144225 133197 227105 321013 120532 -79947 -96913 -113878 30268
-7150 30268 174416 12705 -149004 37198 223401 -3303 504050 277344 50639 298014 545389
-7139 545389 215456 -114476 -444408 -774341 -642141 -509941 -377741 -245541 -82755 80030 59301
-7128 59301 38572 -50974 -140521 75789 292100 305780 319460 638998 958536 557575 156614 -244346
-7116 -244346 -645307 -686885 -728462 -341838 44785 100700 156614 212529 268444 240247 212051 183855 155658
-7103 155658 180509 205360 337262 -264896 -362388 -459880 -672070 -517229 -100497 -417825 -528699 -272542
-7091 -272542 33315 -27856 117426 629739 522449 415160 514325 613490 483261 353032 39289 -274454
-7079 -274454 -481147 -687840 -802776 -183652 202254 -145898 354705 488279 307393 126506 -77319
-7068 -77319 -281144 -247930 -214716 124356 463428 339890 216352 528662 106912 -448650 -637183 -527504
-7056 -527504 -417825 -694292 -970759 -574338 -177917 -114117 -50317 -170032 -289747 -138012 13721 119577
-7044 119577 225432 755666 551840 -95479 -375769 -181980 378839 83256 -212326 103806 419939
-7033 419939 -59158 -538257 -726789 -915322 -797997 -680672 -597755 -514839 -431923 -349007 -162624 23757
-7021 23757 34271 -322244 -709346 -362388 -451278 -540168 -424515 -308863 234990 778844 695689 612534
-7009 612534 -59397 -364300 282781 -293570 -342316 -24032 -210415 -29767 403212 102133 -487599
-6998 -487599 -710302 -596561 -115790 -128215 -140641 -558328 -976016 -701939 -427861 -337298 -246735 84690
-6986 84690 416116 97593 -220929 -432401 -276843 85168 -286879 10137 307154 374777 442401 130568
-6974 130568 -181263 -187236 -193210 -172421 -151633 121488 27580 -408506 -110533 263903 271311 267249 263187
-6961 263187 419700 576213 429019 281825 318146 354466 207272 60078 -87116 -234310 -196078 -157845
-6949 -157845 -119613 -81381 -31679 18022 -115790 -249603 120771 491147 609189 1094261 1866075 1903829
-6937 1903829 1620433 1704066 1301193 898320 763074 1361887 2927976 6206872 5937812 2977201 1061046
-6926 1061046 368325 371432 7508 -459641 -926792 -1241014 -821175 -444348 -434551 -562391 43829 53626
-6914 53626 430453 279674 128896 15872 -97152 -210176 -323200 -210654 -98108 -8500 81105 244309
-6902 244309 40484 272506 -229531 -544230 -858930 -607792 -356653 -525592 -694531 -297632 99266
-6891 99266 343235 -146854 -430489 -347095 -134667 77760 381946 -47928 -481625 -548293 -683778 -819264
-6879 -819264 -511255 -203246 -262267 -321288 9659 340607 312172 -83292 -322005 173341 255779 -28811
-6867 -28811 -118418 -208025 46457 300941 323641 346342 2012 -342316 -380787 -419259 -778881 -1138503
-6855 -1138503 -1203737 -534911 -439569 -711258 -654148 -597039 -746384 -895728 -732524 -569320 -1002540 -701699
-6843 -701699 -664662 -627624 -728223 -828822 -791784 -754747 -717709 -680672 -563346 -446021 -695726 -945430
-6831 -945430 -450561 44307 -72540 -189387 -581507 -973627 -1388686 -1069685 -951404 -466093 -49600
-6820 -49600 -367167 -929421 -757614 -677565 -597517 -422843 -248169 -73495 101177 130568 159959 189351
-6808 189351 218742 114320 9898 -94523 -198945 -226903 -254860 -282817 -310775 -182935 -55096 72742
-6796 72742 200581 244309 288038 285887 283736 203210 -611376 -646024 -680672 -397992 -115312 29731 174775
-6783 174775 -427622 -295959 -210176 -124392 -378876 -633359 -704328 -775297 -758331 -741366 -586764 -432162
-6771 -432162 70353 -161191 -163341 -165492 -180964 -196436 -624817 -319138 250343 819825 578782 337740
-6759 337740 -159458 -656657 -52766 551123 23339 -504445 -420513 -336581 -127917 80747 -368183 -817113
-6747 -817113 -145838 -208623 -42013 124595 122982 121369 486786 852203 625019 397836 170653 -56530
-6735 -56530 238097 532724 460322 387919 407275 426630 400106 373582 463667 -180307 -457252 -137 40245
-6722 40245 80627 350404 620181 281586 -57008 -395602 -734197 -644590 -554983 -1107679 -926314 -353069
-6710 -353069 -513884 -582941 -651998 -365494 -78991 253389 -148287 -132098 -115909 -145599 -175289 -151453
-6698 -151453 -127618 -103783 -79947 -144046 -208145 -272243 -336342 -316330 -296318 -276306 -256294 10316 276926
-6685 276926 176507 76087 -24331 -124751 -225170 -325590 -30305 264979 -51452 -367884 -340225
-6674 -340225 -312567 36242 385052 901427 683742 511935 340129 30687 -278755 -221168 -163580 234273
-6662 234273 632128 418266 204404 59361 -85682 -230726 -375769 -776014 -1176258 -720099 -263940
-6651 -263940 -293331 -322722 -168598 -14474 546822 1108120 1057701 1007282 612773 218264 7269 -203724
-6639 -203724 -366450 -529176 -646024 -762871 -902658 -308385 285887 146100 25430 -95240 -78274
-6628 -78274 -61309 70353 202015 -278038 -758092 -655582 -553072 -267046 18978 -474934 -968848 -1263953
-6616 -1263953 -824999 -744472 -663945 -354025 -44104 -284729 -525353 -398948 -272542 -308146 -343750 -195839
-6604 -195839 -47928 -278516 -509105 -540885 161393 40722 -79947 -154739 -229531 123878 477287 218981
-6592 218981 -39325 -38608 -37892 -450083 -128215 -181024 -233832 -240762 -247691 -115073 17544 150162 282781
-6579 282781 247177 211573 -191060 -593693 -531088 -468483 -359998 -985574 -1156186 -1326797 -1176258 -1025718
-6567 -1025718 -666813 -307907 -132516 42873 -240523 -523919 -623801 -723683 -350440 22801 -169793
-6556 -169793 -362388 -872311 -648174 -301694 44785 1042169 816121 8942 -64176 -76124 -88071 312889
-6544 312889 713850 672272 630694 222087 -186520 -365733 -544947 -724161 -903375 -926792 -950209 -973627
-6532 -973627 -997044 -749012 -500980 -619978 -738976 -529654 -320333 -294526 -268719 -116746 35227 -179829
-6520 -179829 -394886 -234310 -73734 -280189 -486643 -249603 -12563 224476 461517 395088 328659 262231
-6508 262231 195802 167606 139410 111213 83017 -194644 -472306 320535 379317 -215672 -76602 -442198
-6496 -442198 -73734 87318 248372 271789 295206 536547 777889 820422 128896 -180307 -489510 -523442
-6484 -523442 -557373 188634 200581 -154500 224476 412293 600109 879682 425196 -75168 -575533 -555939
-6472 -555939 -536345 341563 485412 430453 375494 217308 59122 -282578 -624279 -815918 -1007558 -832167
-6460 -832167 -656777 -714603 -772429 -463226 -154022 137976 429975 110258 -209459 -238611 -267763 -296915
-6448 -296915 -326067 -326545 -327023 -281622 -236221 -404921 160437 312889 465340 275612 85884 -103842 -293570
-6435 -293570 -85682 122205 -36936 -196078 -174572 -153066 235468 624004 588161 552318 929384 572390
-6423 572390 474420 376450 49086 -278277 -571232 -864187 -958334 -318421 -154500 9420 219219 429019
-6411 429019 267966 106912 -54140 -215194 -268241 -321288 -557851 -794413 -958334 -1122255 -674459 -226663
-6399 -226663 -84726 57210 290905 -209459 -641006 -338493 -494767 -651042 -748056 -845071 -789156 818
-6387 818 309065 -116746 -129649 591506 389353 187200 397955 608711 93053 -422604 -571232 -719860
-6375 -719860 -618066 -516273 -490944 -465615 175252 -407311 -1081633 -1021895 -545425 -68955 682786 700468
-6363 700468 385530 70592 -290225 -651042 -570276 -489510 -362866 -236221 -514839 -59397 -16864 25669
-6351 25669 244787 463906 71308 -321288 -507432 -693575 -696204 -698832 -787483 -876134 -1194179 -778164
-6339 -778164 -507432 -236700 -287118 -337537 -383177 -428817 -474456 -520096 -970998 -1421900 -817591 -213282
-6327 -213282 272506 24235 -376964 -778164 -1171718 -831211 -291897 247416 -14952 -277321 -539690
-6316 -539690 -802059 -1179125 -1556191 -1520348 -1484505 -1337789 -457013 -187953 -652953 -884737 -1116520 -981273
-6304 -981273 -846026 -1317717 -1055348 -609464 -897640 -1036710 -1175780 -749012 -322244 -658210 -994176
-6293 -994176 -1330143 -932049 -820698 24713 350165 -58441 -482342 -172183 -183174 -194166 353032 166172
-6281 166172 -158323 -115790 -471828 -460836 -36936 -347095 -515795 -684495 -577923 -471350 -446021 -1154752
-6269 -1154752 -1045312 -568842 -482342 -395841 -676371 -956900 -768128 -946386 -161191 -110055 116948 -23077
-6257 -23077 -231920 -73734 114081 -65132 -14952 35227 50998 66768 -146854 -360476 366414 359245
-6245 359245 397955 436666 -132516 -701699 -414480 -127260 -316031 -504803 -693575 -882347 -413524 55299
-6233 55299 157092 258886 223043 187200 564266 207272 -279711 -766694 -687840 -608986 -600384 -591782 -223796
-6220 -223796 511218 668927 92575 135586 178598 -105276 -389151 -305996 -222840 -242912 -262984 -466571
-6208 -466571 -670158 -423560 -176962 -113878 -50795 -209459 -368123 -526787 -685451 -333714 18022 193891
-6196 193891 -364300 -589870 -448411 -490466 -899552 -919385 -205158 -133233 -428339 -138490 -582702 -499307
-6184 -499307 -48883 -3721 -325590 -624518 -556417 -396558 -236700 -53901 128896 -19014 -166925 52192
-6172 52192 271311 337501 403690 102850 -197989 -296198 -394408 -653192 -544947 -685212 -91417 158287
-6160 158287 -326067 -495723 -665379 -322722 -347095 -409700 261753 420895 213007 141799 437621 91141
-6148 91141 478721 281347 83973 115992 148012 -38370 -224752 -105276 14199 30448 46696 -120569
-6136 -120569 -287835 -287835 -287835 -287835 -287835 -421648 -555461 -505759 -456057 -302411 -148765 -300977 -453190 -460119 -467049 -45777
-6120 -45777 375494 527228 678963 647182 615401 377167 138932 -53423 -245780 -465376 49086 150640
-6108 150640 252195 -20926 -294048 -383655 -473262 -653670 -834079 -708629 -583179 -499785 -416391 -332997
-6096 -332997 -249603 62467 374538 136064 -102408 33793 169996 306198 442401 359723 277046 500227
-6084 500227 723408 774543 825679 326270 -173138 -407789 -642440 -448889 -255338 -8262 238813 432364
-6072 432364 258886 -344706 -214238 115037 77282 -117224 -311730 90186 -241956 -528101 -447216 -389270
-6060 -389270 -698354 -908034 -750685 -363941 -711258 -1108276 -771235 -633001 -494767 159601 79911
-6049 79911 30806 -18297 -324514 103328 -65252 -233832 -402412 -570993 -66685 437621 376091 314561
-6037 314561 -52826 -420214 107032 634279 366294 98310 -114117 -326545 -233115 -139685 -138012 -136340
-6025 -136340 -440525 -744711 -286162 172385 -41954 -256294 -30962 194369 113842 33315 -27617 -88549
-6013 -88549 -149482 -210415 -489271 -768128 -297632 172863 769525 632128 479438 326748 391982 457215
-6001 457215 17783 -421648 -691066 -226424 -174692 -122958 -124751 -126543 -128335 -130127 -370871 -611615 -11248
-5988 -11248 -144942 -221287 -297632 -236341 -175050 -75049 24952 -58561 -142075 -30603 80866 192337
-5976 192337 303808 260439 217069 -9815 -236700 -253307 -269914 95801 461517 321371 -552833 -830614
-5964 -830614 -1108395 -705642 -302889 -205994 -109099 -272184 -435268 -261909 645509 620061 -139446 -256652
-5952 -256652 -373858 -108502 156853 -5992 -168837 -205516 -242195 134033 -223796 -302531 -381265 -322364
-5940 -322364 -263462 -284848 -306234 -144106 18022 111691 205360 -542080 -555461 -419736 -284012 -102408
-5928 -102408 79194 -101453 -282100 87796 457693 204404 -48883 3685 56254 -61548 -179351 -113639
-5916 -113639 -47928 -330130 -612332 -343989 -75646 -198228 -320810 -443393 -565975 -577684 -589392 -172899
-5904 -172899 243592 -23435 -290464 138334 567133 173938 147773 297476 -164536 -400023 -23794
-5893 -23794 405960 -265374 -627027 -988681 -868607 -748534 -270989 206555 -478160 -551160 -230367 -276604
-5881 -276604 -246377 150879 84570 629978 915405 589117 174894 127701 225791 323880 381587 -172421
-5869 -172421 -282937 -26422 -201932 -377442 -55932 -101453 -120210 -750685 -1060008 -1369331 -1258099 -1146867
-5857 -1146867 -1035635 -924403 -818905 -713408 -913769 -1114130 -683659 -253187 -740290 -615677 -47569
-5846 -47569 153508 -73615 -300738 -244943 -189148 -316868 -444588 -494289 -543991 -410178 -276365 -452234
-5834 -452234 -628102 -620456 -612809 -673981 -735153 -796324 -857496 -303128 251239 255062 -108143 -579356 -438853
-5821 -438853 -237177 -35502 -2049 31404 454826 878248 533202 -423560 -760960 -241956 143233 -83292
-5809 -83292 -256294 182421 -160115 -502653 -378756 -254860 -432998 -611137 -483417 -355697 85526
-5798 85526 526750 295087 63423 -65013 -193449 -321886 -450322 -308266 -166209 -330010 -493811
-5787 -493811 -454982 -416152 -193808 28536 -54977 -138490 -527862 -917234 -717829 -518423 -135503 247416
-5775 247416 284692 321969 175730 29492 32359 35227 451003 132719 357334 581948 577169 572390 66768
-5762 66768 -438853 -317465 -196078 382185 226388 322925 419461 53387 54343 307632 -173138 -703611
-5750 -703611 -500024 -143508 -154022 -435985 -1084978 -999911 -914845 -808033 -701222 -43865 613490 139171
-5738 139171 -335148 -136579 61989 333200 604410 982670 626871 519582 412293 442639 472986 211573
-5726 211573 -49839 -311252 -572666 -516751 -460836 -473740 -119613 260319 -93806 -424993 -389151 2251
-5714 2251 26624 -147809 -322244 -260595 -198945 -91417 16110 -526309 -334670 -372424 -777208 -321766
-5702 -321766 -233354 -718426 -836468 -759526 -682583 -766216 -849850 -911260 -972671 -850566 -728462 -376964
-5690 -376964 -25466 -224513 -423560 -212565 -1571 25907 53387 -366450 -786288 -777925 -769562 -743755
-5678 -743755 -717948 -692141 -666335 -606119 -545903 -302172 -58441 -174094 -289747 -99541 90663 -258205
-5666 -258205 -607075 -703611 -1167178 -1198719 -496201 -328935 -528699 -250559 27580 -267763 -563107 -199901
-5654 -199901 163305 289471 -318421 -444588 -203724 -215194 -226663 75609 377884 313127 248372 -34307
-5642 -34307 -316987 -33829 249327 355661 -272064 -303367 -334670 -599189 -863709 -975299 -352830 -155695
-5630 -155695 -692619 -403727 -114834 -235027 -355219 -291897 -228575 -123197 -17820 133436 284692 -179590
-5618 -179590 90186 -7067 -104320 -472545 -106710 -153783 -200857 -64415 72025 -158562 -389151 -386522
-5606 -386522 -383894 -14235 355422 48369 -258683 45980 350643 423045 495448 384335 273223 112408
-5594 112408 -48405 -209220 -370034 -102648 164738 -179590 -523919 -531805 -539690 64140 667971 489952
-5582 489952 311933 546822 47652 -73017 -193688 -543752 -893817 -582463 -271108 -326784 -382460 -354025
-5570 -354025 -325590 -480669 -635749 -497396 -359043 -220690 -82337 -62504 -42671 -512211 -247691 181226
-5558 181226 -613287 -1132530 -917712 -527026 -870399 -709107 -547815 -697159 -112445 151118 -319377
-5547 -319377 -606358 -159279 -170988 -182696 -315793 -448889 -214955 18978 -125587 -270153 -231203 -192254
-5535 -192254 137259 466774 383379 299985 510980 -12085 -122242 -232398 -186759 -141119 -95479 -49839
-5523 -49839 -99780 -149721 442639 300941 76326 585772 185288 -582224 -176006 -503847 -648174 -425471
-5511 -425471 -176006 73459 231167 21845 -485687 -259161 105000 102133 -154978 -412090 -760960 -375769
-5499 -375769 -284968 -561196 -837424 -379592 -212326 -412090 -359521 -306951 -495245 -683539 -260117 163305
-5487 163305 265815 368325 -140880 -650086 -539929 -429772 -319616 -209459 -356414 -503370 -696204
-5476 -696204 -154978 156853 468685 673467 144189 -235983 117904 242398 -137 -280905 -194644
-5465 -194644 -337776 -480908 -355458 -230009 -356892 -116746 360440 103567 -329174 -761915 -1003018
-5454 -1003018 -1244120 -1141132 -1038144 -308146 54821 -423321 -167404 -140880 -481386 -982468 -749490
-5443 -749490 -635032 -520574 -107905 -429295 -192493 411337 151118 -109099 -331085 -553072 -591543
-5432 -591543 -630014 -458208 -286401 -527504 -34546 148729 332005 -50556 -433118 -508626 -584135 -338493
-5420 -338493 -92850 458649 276090 -67044 -43149 -145420 -247691 -327023 -406355 -95718 214918 -86160
-5408 -86160 -387239 -10651 365936 375494 385052 188156 -8739 -457969 -540168 -276365 -746622 -1239819
-5396 -1239819 -998955 -459880 -654865 -956900 -1258935 -1365746 -738498 -524158 -309819 -229292 -148765
-5385 -148765 -435268 -721771 -517946 -314120 -293809 -273498 -283773 -294048 -487838 -681628 -605880 -530132
-5373 -530132 -454385 -378637 -360237 -341838 -323439 -305040 -209220 -113400 -17581 78238 219936 361635 916242
-5360 916242 736789 511218 285648 14199 -257249 -173138 -89027 270355 -104320 -658688 -478997 -391062
-5348 -391062 -303128 -234310 -165492 -96674 -27856 -168359 -308863 9420 -406355 -596561 -52707 32359
-5336 32359 117426 -52707 -222840 -209459 -196078 283736 763552 631650 499749 359245 218742 -151155
-5324 -151155 213007 3685 -205636 -185564 -165492 -496201 -826910 -545903 -264896 -121525 21845 -18297
-5312 -18297 -58441 -106232 -154022 -155934 -157845 -630014 -368123 -106232 -578400 -430250 -282100 -179829 -77558
-5299 -77558 231167 539893 481589 423284 345864 268444 191023 113603 59122 4641 -49839 -104320 -196078
-5286 -196078 -287835 -333714 -379592 -708390 -303128 -310775 -318421 104523 527467 583382 639297 309065 -21165
-5273 -21165 15633 52431 -208981 -470394 -548293 -626191 -424993 -223796 -22599 178598 126506 74415
-5261 74415 389353 704292 801306 898320 811820 725319 409425 93531 -23554 593418 977174 1360931
-5249 1360931 1178850 996768 674662 352555 642164 931774 930818 929862 317190 -295482 -361432 -427383
-5237 -427383 -126304 174775 -24988 -224752 -241000 -257249 8942 275134 541326 807519 274656 -258205
-5225 -258205 34749 -406355 -644829 -149243 254584 658413 756383 854353 1197010 2273726 2851034
-5214 2851034 4162401 6177242 4032411 1497611 186244 -161669 224476 56254 -111967 -234310
-5204 -234310 -356653 48608 453870 492102 530335 959850 1389366 794257 933207 743360 553513 409545
-5192 409545 265576 419819 574063 315397 56732 210976 -368840 -336940 429019 259722 90424
-5181 90424 -32993 -156412 266890 690193 501780 313367 224357 135347 229853 324358 713252 1102146
-5169 1102146 879324 656501 250283 -155934 -975060 -1060127 -793457 -526787 -214238 98310 170951
-5158 170951 243592 -50795 -345184 -280189 -215194 216830 648855 356378 63901 138454 213007 23757
-5146 23757 -165492 -171227 -176962 122205 421373 353510 285648 87796 -110055 13243 136542 290308
-5134 290308 -289986 -273856 -257727 -153664 -49600 -129052 -208503 -296557 -384610 -212685 -40759 704650
-5122 704650 716000 589714 463428 656143 848857 1316844 1050772 517073 717434 459007 200581
-5111 200581 248969 297357 804532 577647 320177 796766 631053 465340 160198 -144942 -144225 -143508 208945
-5098 208945 561398 1831427 1878023 1794628 2445294 4564079 5459431 2447445 1148264 705486 262709
-5087 262709 182421 102133 327704 553274 641208 729142 388875 48608 -27856 -104320 -456057 -73734
-5075 -73734 373582 86840 258886 430931 539654 648377 451242 254106 -88310 -430728 -589631
-5064 -589631 -748534 -651281 -554027 -915561 -543036 146817 102611 -278038 -658688 -272781 113125 -296198
-5052 -296198 -705523 -598711 -491900 -385089 -278277 -255577 -232876 630933 760684 458410 156136 358528
-5040 358528 560920 599153 637385 369759 102133 48608 -4916 125073 255062 -16386 -287835 -253426
-5028 -253426 -219017 -89027 40962 -12563 -66088 -38370 -10651 17066 44785 -156890 -358565 -9695
-5016 -9695 339173 282781 226388 124117 21845 561876 367847 403212 438577 573824 709071 844317
-5004 844317 979564 483978 -11607 -201335 -391062 -481386 -571710 -478519 -385327 2251 389831 479199
-4992 479199 201537 -77080 378361 856743 601064 192457 517909 384574 251239 301419 351599 470597
-4980 470597 222565 -300738 -89983 -62743 -402532 -201335 733921 1049816 142277 -570276 -548770 -137296
-4968 -137296 -92850 -365733 -638616 -383894 -129171 -356175 -583179 -764305 -945430 -1034798 -390106 -158323
-4956 -158323 73459 -218539 -510538 -496679 -482820 -416391 -349963 -283534 -217105 97832 412770 299507
-4944 299507 186244 242159 298074 170473 42873 -203246 -449367 -267285 -85204 51953 189112 349209
-4932 349209 509307 122683 103089 152313 -532522 -1158097 -1049613 -642917 -603251 -295959 11331 -10173
-4920 -10173 -31679 -278755 -525831 -589392 -652953 -792979 -933005 -644829 -356653 119816 596285 736311
-4908 736311 142277 -543513 -495245 -232876 29492 -123914 -277321 -2527 272267 577647 883027
-4897 883027 1050772 484456 332961 181465 167606 153747 197236 240725 100700 -39325 -180307 -321288
-4885 -321288 -462270 -603251 -13996 575258 613968 652678 222326 -208025 -87832 32359 -92134 -216627
-4873 -216627 331766 268444 269160 636907 331766 26624 -171466 -369557 -177678 14199 29253 -567409
-4861 -567409 -858213 -537301 -208742 119816 142516 165216 614207 451481 82300 -286879 -266091 -245302
-4849 -245302 -492139 -738976 -1032170 -713647 -785094 -489510 -492139 -861797 -1002062 -1142327 -840053 -537779
-4837 -537779 -235505 66768 44068 21367 -1332 -24032 113125 250283 915047 968094 967616 967138 500227
-4824 500227 -578400 -517707 -89983 93053 276090 202971 129852 117904 -505759 -732524 -592260 -230248
-4812 -230248 131763 570240 -337059 -693814 -683539 -478280 -273020 -44821 183377 105717 28058 133914
-4800 133914 239769 50998 -137773 239292 4641 7030 621136 807041 381229 -312208 -393930 -307429
-4788 -307429 -220929 22323 265576 57688 -150199 80627 -55574 -329413 8464 250761 493058
-4777 493058 513608 901188 1023053 288515 -186042 -293570 -22599 -363344 -704089 -433118 -165970
-4766 -165970 -265852 -426905 -587958 -221406 145144 -161191 -467527 -365733 -263940 -162146 -60353
-4755 -60353 -230009 -399665 -263462 -127260 -60114 7030 -109338 -225708 -376486 -527265 -127499 272267
-4743 272267 232362 192457 152552 112647 34510 -43626 -121764 -199901 108107 416116 295923 175730 -13280
-4730 -13280 -202290 -391301 -580312 -192971 194369 31164 -132039 -413763 -695487 -426666 -157845
-4719 -157845 121966 401779 253389 105000 -295720 -696443 -1326558 -1222614 -1047941 -873267 -836229
-4708 -836229 -799192 -750685 -702177 -470155 -238133 -23315 191501 406319 621136 380990 140843 84212
-4696 84212 27580 112408 197236 -146137 -489510 -446738 -403966 -361193 -318421 -158562 1296 -144703 -290702
-4683 -290702 -180546 -70389 315039 -33591 -647935 -528221 -439092 -349963 -765500 -1181037 -923686 -666335
-4671 -666335 -710063 -753791 -981034 -1208277 -781748 -355219 -234549 -113878 -23794 66290 156375 246460
-4659 246460 -103125 -452712 -496440 -540168 -159518 221131 464145 -26900 -284729 -542558 -846265 -1149973
-4647 -1149973 -1099076 -1048180 -813768 -579356 -230248 118860 238575 1092349 915764 739179 608472
-4636 608472 477765 450286 422806 211812 818 -415674 -832167 -1111024 -655821 -372663 -89505 346581
-4624 346581 48608 137259 225910 -52468 -330846 -941846 -818786 -496918 -175050 -332997 -490944 -281861
-4612 -281861 -72779 109541 291861 290666 289471 -91178 -471828 -240762 -9695 -225947 -442198 -704328
-4600 -704328 -232398 -3244 225910 133914 41917 -313881 -669680 -658449 -647219 -413763 -180307 -130366
-4588 -130366 -80425 -179590 -278755 -332041 -385327 -599189 -78991 28297 135586 74654 13721 -47211 -108143
-4575 -108143 -182457 -256771 -331085 -405399 -514122 -622845 78955 780756 870841 226866 -600623 -694053
-4563 -694053 -187236 319579 260558 201537 95203 -11129 -484492 -957856 -620695 -283534 -313403 -343272
-4551 -343272 -7067 329137 298312 267488 649572 1031655 1046709 1061763 966899 872036 868929 131763 -647457
-4538 -647457 -692619 -171944 -385327 -459164 -533000 -469200 -405399 -24271 356856 370954 385052 604649
-4526 604649 824245 432125 40006 -191538 -423082 -241717 -60353 -258444 277524 354705 431887 1006088
-4514 1006088 846229 732249 618269 717434 816599 304047 -208503 39767 288038 352794 417549 316951
-4502 316951 216352 115753 15155 -395124 -805405 -649847 -494289 -89983 -419736 -749490 -345184
-4491 -345184 112647 570479 462472 354466 450047 545628 274178 2729 90663 178598 518865 492102
-4479 492102 264620 771198 1254836 1004415 409903 -184608 -213282 -241956 -236221 -230487 -224752 -219017 -327979
-4466 -327979 -436941 65812 568567 177403 -213760 -245541 89708 348492 -126782 -602057 -710302
-4455 -710302 -195361 -414480 -794174 -439808 -372185 -304562 -374575 -444588 -558567 -672547 -419498 -166448
-4443 -166448 -73973 18500 -26661 -71823 -501219 -196556 108107 -321288 -429533 -537779 -508388 -478997
-4431 -478997 -420692 -362388 -923447 -1117476 -493334 -603251 -70867 461517 -135862 -366211 267488 167128
-4419 167128 689954 1946841 4396574 5133501 2461065 1012061 847663 683264 190067 -303128 -436941
-4408 -436941 -203724 272267 14199 -175050 -364300 -457969 -551638 -461792 -371946 -137534 96876 331288
-4396 331288 565699 486606 407513 -38608 -484731 -171944 140843 270116 399389 456021 512652 569284
-4384 569284 625915 448374 270833 93292 -84248 13482 111213 208945 306676 199864 93053 -13757
-4372 -13757 -120569 -269436 -418303 -200140 18022 -102170 -222362 -159040 -95718 -342077 -588436 -513644
-4360 -513644 -438853 222804 150401 123878 97354 -280905 -659166 -181024 297118 -6111 -309341 -854
-4348 -854 307632 77043 -153544 -200618 -247691 142994 533680 113842 -305996 -339688 360679 36421
-4336 36421 -287835 -88071 111691 -300261 -712213 22801 757817 804651 117426 -334670 -786766 -428339
-4324 -428339 -69911 51475 172863 294250 415638 603454 791270 612056 432842 330093 227344
-4313 227344 124595 21845 297596 573346 237380 -98585 -121047 -143508 201059 545628 369281 192935
-4301 192935 383618 574302 489713 405124 320535 235946 105479 -24988 -155456 -285923 -263462 -241000
-4289 -241000 -218539 -196078 -70389 55299 -277799 123161 558531 259841 236424 213007 88274 -36458
-4277 -36458 251717 539893 13721 221609 383618 545628 148729 -248169 -323917 -399665 29253 -275888
-4265 -275888 -168120 -60353 -36697 -13041 10615 34271 142038 249805 -55335 373582 121966 -129649
-4253 -129649 -182457 498793 755666 278480 214201 149923 488996 94009 295445 496881 335111 173341
-4241 173341 -355458 -884259 -505998 -127737 -116507 -105276 -185803 -266329 20173 306676 176447 46218
-4229 46218 283020 519821 -160952 -841725 -666096 -490466 -130366 229733 23996 -181741 -689513
-4218 -689513 -463226 -512211 -194166 156375 139888 -266568 61033 331288 234512 -68716 362113 413248
-4206 413248 -269675 -493811 -717948 -628580 -539212 -702177 -498113 -146854 -529654 -660122 -423560 -286401
-4194 -286401 217786 400823 216830 -342794 -535389 -383894 -599428 -1059649 -1519870 -901941 -284012
-4183 -284012 -295004 -305996 -684017 -1062039 -667768 -273498 -490944 -708390 -606597 -504803 -403010 -301216
-4171 -301216 -31201 238813 141799 44785 22323 -137 -45538 -90939 -201335 -678760 -1202064 -991309
-4159 -991309 -183174 257930 133197 375494 373105 370715 483022 -138729 -435507 1773 3207 -362388
-4147 -362388 -58919 244548 158048 71547 -251514 -574577 -744711 -180785 474898 396522 409903 423284
-4135 423284 211095 -1093 559009 752082 998680 511218 46696 -50795 -420692 -423560 -403488 -383416
-4123 -383416 -325112 100221 364980 -104320 -307907 -511494 -393930 -276365 -170271 -64176 -348051
-4112 -348051 -631926 -545903 -826910 -1084978 -731330 -182696 -1093 264620 163305 -94762 -352830
-4101 -352830 -22121 -58441 -645307 -620456 -572666 -524875 -843159 -794413 -967414 -528699 139410 195802
-4089 195802 -15430 -593693 -659644 -725595 -447455 -169315 -86160 -3005 -286879 -570754 -576967 -583179 -428817
-4076 -428817 -274454 -1571 -95718 -327501 52431 -143030 -338493 -839814 -729418 -814007 -898596 -761437
-4064 -761437 -624279 -572188 -520096 -835035 -1149973 -952599 -755225 -741366 -727506 -912455 -1097404 -670636
-4052 -670636 -243868 -19731 204404 61511 -81381 -491900 -902419 -945908 -622368 -180307 -349963
-4041 -349963 -359043 -1093 22323 45741 -53185 -152110 -1019505 -1275184 -812095 -716037 -521530 -327023
-4029 -327023 -522486 -717948 -523442 -328935 -134428 60078 -1571 -63220 -491900 -920579 -687840 -455101
-4017 -455101 -38847 377405 467729 558053 281347 4641 -237655 -479952 -355219 -230487 -316031 -401576
-4005 -401576 -120091 161393 83495 5597 -72301 -150199 -331324 -512450 -58919 394610 794615 1561650
-3993 1561650 1632858 1092349 477287 229255 348253 834281 892108 338217 518387 698557 509068
-3982 509068 319579 130091 -59397 -157128 -254860 14438 283736 442161 600587 713133 825679 1381720
-3970 1381720 1203701 643359 450047 999397 1915777 1761653 873469 455543 771676 1133688 272267
-3959 272267 378122 483978 666298 1582678 2518174 2719611 1789371 859132 693061 526989 108585
-3948 108585 57210 743719 696167 266293 203449 157809 112169 -48167 -208503 -525592 -108621 -104559
-3936 -104559 -100497 99983 300463 592701 150879 -405638 -228097 -356414 249327 612295 241203 -267524
-3924 -267524 -409223 -30962 -19731 -62026 262709 799633 113125 -473979 -1061083 -822370 -583657 -230248
-3912 -230248 490191 830219 436188 363307 -76602 -631209 -451756 -142313 167128 673467 445746
-3901 445746 -171944 -55574 76087 -159279 -371707 -217105 92336 34749 -45777 240725 580753 186722
-3889 186722 -207308 132719 430214 360679 176447 -7784 -237894 -468005 -338732 157570 495209
-3878 495209 98788 -274693 85884 -260834 -607553 -755464 -169315 164022 -236700 -201574 200581
-3867 200581 13960 -172660 -473979 -775297 -549965 409425 344191 278957 294011 309065 324119 339173
-3855 339173 -6350 -351874 -85682 180509 -80903 -342316 -236700 -131083 164738 460561 802262
-3844 802262 409903 342519 275134 345386 415638 178120 -59397 -296915 -534433 -278755 -23077 232601
-3832 232601 488279 327226 166172 372149 578125 386486 194846 3207 -188431 -370034 -551638
-3821 -551638 -366211 -180785 -354742 -528699 -90939 346820 -8739 -364300 -842203 -96674 60078
-3810 60078 -517229 -1063950 -876612 16110 174775 -41237 -257249 -473262 -322244 218742 25669
-3799 25669 -129171 -284012 -48883 -180785 -450322 14199 -117702 -616633 -376486 -136340 -286162
-3788 -286162 -435985 -88788 258408 605604 952801 399628 -153544 -95001 -36458 -46733 -57008 -67283
-3776 -67283 -77558 -224513 -371468 -518423 -665379 -797041 -928704 -203963 520777 67007 -386761 -228814
-3764 -228814 -70867 -287596 -504325 -1179842 -1121299 -277321 -167404 -416869 -299305 -227619 -155934 122205
-3752 122205 400345 113603 -173138 -276365 -379592 -238133 -96674 44785 186244 271311 356378 441445
-3740 441445 526511 313367 100221 254106 407991 277046 146100 61033 -24032 -407311 -56530 -118657
-3728 -118657 -180785 -170271 -159757 -149243 -138729 -116746 -94762 -72779 -50795 -105276 -159757 -30723 98310
-3715 98310 319101 539893 393654 247416 188156 128896 -113878 -356653 -220929 -85204 -316509 -547815
-3703 -547815 -467527 -387239 -306951 -226663 -276365 -326067 -8739 308588 641208 973829 450047 -73734
-3691 -73734 -77558 -81381 281825 645031 721496 797961 1562606 3061311 1776707 492102 354466 216830
-3679 216830 238813 260797 -38370 -337537 -434074 203449 1299759 1172637 869646 566655 -179829 -192254
-3667 -192254 -621412 -316509 -378637 -440764 -260117 -79469 101177 281825 386008 490191 227344 -35502
-3655 -35502 -485687 -935872 -942563 -215194 252195 719584 376450 33315 -264896 -563107 -570754 -578400
-3643 -578400 534158 423284 388875 354466 308588 262709 -12563 446224 281825 117426 44785 -27856
-3631 -27856 -216389 329137 1165229 1267262 1487814 484934 -150916 -52707 149685 -381982 -454862 -527743
-3619 -527743 -627386 -727028 -459641 -192254 -218300 -244346 -270392 -296437 -35741 224954 118621 12287
-3607 12287 -347334 -706956 -883064 -1059171 -619739 -180307 -352591 -524875 -329652 -134428 60795
-3596 60795 256018 416833 577647 371432 165216 -29528 -224274 -235505 -246735 -177678 -108621 -223079
-3584 -223079 -337537 -450083 -562630 -491661 -420692 -693814 -966936 -383655 199625 147295 94965 -324395
-3572 -324395 -743755 -773146 -802537 -464898 -127260 -222601 -317943 -413285 -508626 -382221 -255816 -542319
-3560 -542319 -828822 -674698 -1254634 -1222853 -457013 -299066 -141119 -120808 -100497 -367884 -635271 -535628
-3548 -535628 -435985 -439569 -443154 -446738 -450322 -543752 -637183 -409462 -181741 45980 -460358 -186759 86840
-3535 86840 120532 154225 187917 221609 152074 82539 -598711 -1279963 -1076137 -872311 -852000 -831689 -826671
-3522 -826671 -821653 -770757 -719860 -1014965 -576011 -366450 -156890 -96435 -35980 -342555 -649130 -395602
-3510 -395602 -142075 -255577 -369079 -299066 -229053 -159040 -89027 230689 550407 870124 1189842 1578377
-3498 1578377 1966912 3364780 3049842 1960700 1605618 1143485 681352 31881 116470 -211848 -540168
-3487 -540168 -144942 250283 416116 581948 1133927 951846 815643 679441 630216 580993 -202290 237858
-3475 237858 869168 766419 373105 713850 654112 594374 488757 1117200 1585068 1318876 1144441 1337036
-3463 1337036 1028788 1087570 1008716 562832 -97152 -390106 173341 369759 -83770 -170271 -325590 -113878
-3451 -113878 59600 233079 -159279 -551638 -499546 -80425 568089 482544 -31201 -177917 34749 247416
-3439 247416 326270 405124 736311 700468 1043125 2119842 3204205 4288568 6424318 9783502 11475759
-3428 11475759 13902073 17907383 15795528 12001452 9430809 8342622 7988496 5791574 3961681 3408748
-3418 3408748 3589873 3381029 3172185 2722478 2272771 1823064 1373356 1443608 1513860 1584112 1654364 1735846
-3406 1735846 1817329 1898811 1980294 1973842 1967390 1777424 1587457 1374551 1161645 1063436 1332257 1520790
-3394 1520790 975263 796766 1352329 2408734 3098110 4085697 5073285 3369321 2399415 1681843 1698331
-3383 1698331 1810399 1555438 1185779 816121 912896 1009672 1129387 1249101 779800 677529 804651
-3372 804651 197714 500705 1170725 1427837 1317919 1009194 700468 980520 1260571 852442 444312
-3361 444312 426152 407991 659369 1277776 1758547 1505258 1431661 1725094 1835011 1577899 1237632 1631424
-3349 1631424 1428793 859132 748259 637385 503572 369759 288277 206794 308826 410859 31164
-3338 31164 -348529 -116507 115514 63662 11809 143472 275134 479438 683742 521015 358289 502377
-3326 502377 646465 1501674 1745165 1006088 267010 101416 -64176 102850 269877 620419 970962
-3315 970962 667732 364502 -122242 -608986 -379831 -150677 261992 674662 513847 353032 192218
-3304 192218 31404 -68238 -167881 -267524 -367167 -436224 -505281 -207308 90663 464145 837627 599392
-3292 599392 361157 543477 725797 541088 356378 534875 713372 891869 1070366 847424 624482
-3281 624482 218025 -188431 222804 634040 678246 722452 586966 451481 354227 256974 -272303 -189865
-3269 -189865 397239 127940 -202529 -533000 -649369 -154022 -112684 -71345 337023 745391 1126997 896887
-3257 896887 192696 -144464 -122242 -100019 128657 357334 108107 -141119 -268002 -27856 330332 76804
-3245 76804 419700 395566 -3244 -35024 -66805 -465615 -605402 -378159 -380309 -382460 -522247 -662034 -434790
-3232 -434790 -207547 -274932 -342316 -409700 -477085 -406833 -336581 -266329 -196078 -356175 -516273 -554027 -224752
-3219 -224752 35704 -315554 -506237 -329891 -88788 152313 49325 -53662 -168120 -282578 -236461
-3208 -236461 -190343 -478758 -1134202 -1407324 -946386 -229292 120771 -133233 -387239 -216627 -46016
-3197 -46016 124595 295206 175252 55299 -64654 -184608 -2527 179554 -5394 -190343 -444109
-3186 -444109 -697876 -584613 -471350 -435746 -400142 2490 405124 670121 935119 634279 333438 -422365
-3174 -422365 -444109 -267046 -89983 -73495 -57008 -40520 -24032 -24749 -25466 340846 707159 733205 759250
-3161 759250 601781 444312 294489 144667 583621 1022575 788641 187678 -53901 438577 1007043
-3150 1007043 841450 951129 1060807 681113 301419 105239 -90939 -149482 -208025 -610659 -1013293
-3139 -1013293 -624518 131285 504767 144189 -282339 -341838 -286640 -231442 381946 995335 1249340 1136316
-3127 1136316 782429 1162601 1542773 1188885 770003 718151 597480 476809 98310 -280189 -46972
-3116 -46972 186244 -85204 -356653 -444588 -532522 -383416 -234310 281825 797961 537981 278002 385052
-3104 385052 492102 113842 -264418 -275649 -286879 -80186 126506 149685 172863 73698 -25466 242398
-3092 242398 510263 193174 -123914 -257488 -391062 -198467 -5872 324358 654590 1344204 1299759
-3081 1299759 850052 767375 969528 1171681 586249 818 279435 1292113 1471327 916481 607994
-3070 607994 666537 679202 324836 513369 701902 714566 -6828 -875417 -1009947 -43388 189112 -304801
-3058 -304801 -64654 290188 278002 197893 117785 381766 645748 577109 508471 256317 4163 574003
-3046 574003 1143843 1101967 1060091 563250 66410 -63400 -193210 -223617 -254023 -284430 -314837 -184668
-3034 -184668 -54499 -704268 -619978 -738319 -856660 -730314 130091 225850 321610 -102588 -526787 -514600
-3022 -514600 231645 121488 -722727 -897879 -1073031 -1087607 -1102183 -1101466 -733719 230450 460561 82778
-3010 82778 72025 -30484 234034 275851 317668 382423 447180 466057 484934 136781 -211371 -63459 84451
-2997 84451 232362 380273 298790 217308 250522 650766 1280703 1176580 636608 -270392 -504505 -371588
-2985 -371588 -720398 -702177 -96136 -224154 -734496 -877807 -680851 -483895 -11667 -273498 -655761
-2974 -655761 -670994 -556238 -74451 -28513 -349604 -51333 -120091 -243330 -366570 -604506 -108382 204225
-2962 204225 -217225 -569858 -555461 -826193 -1096926 -733002 -369079 -314837 -260595 -252231 -243868 6313
-2950 6313 -477563 -548531 -619500 -736347 -853195 -970042 -1086890 -725834 -364778 -3721 357334 76087
-2938 76087 -205158 -119374 -33591 69397 172385 642403 1112421 695450 278480 228539 178598 -43149
-2926 -43149 -264896 -119613 25669 365936 706203 862955 1019708 832370 645031 457693 270355
-2915 270355 159482 48608 121249 193891 -152110 -498113 -484731 -104320 180509 -268719 84929 438577
-2903 438577 103089 -232398 -200857 -169315 68680 306676 185288 -303128 -702655 -368123 -102408 163305
-2891 163305 54343 -54618 -163580 -272542 -32635 207272 515997 90663 -32635 211095 18978
-2880 18978 -173138 -226663 -280189 -333714 -387239 -337537 -287835 -238133 -188431 -106232 -24032 402257 828546
-2867 828546 1025443 855309 799872 1478495 2874212 3535870 4319870 3880438 1552331 447657 229972
-2856 229972 379317 -214955 -442198 -485926 -529654 -313403 -97152 4402 -261073 -370751 253629 748020
-2844 748020 1976471 3564305 2949960 1639788 1063675 686370 676095 321730 334394 392937 818510
-2833 818510 1473477 1394384 1256509 1118634 934880 751126 743241 735355 681591 627827 597002 -167881 -359282
-2820 -359282 -183652 206077 595807 152074 -291658 11809 315278 251717 188156 147534 106912 66290
-2808 66290 25669 382663 739656 737267 367847 -93328 179554 567133 587683 659369 364024 252195
-2796 252195 140365 -97629 -335625 -344228 -352830 -506715 73459 263665 -280189 28536 -29767 -294526
-2784 -294526 -559284 -803015 -1046746 -678760 -310775 -183652 -56530 -296437 -536345 -525831 -515317 -757136
-2772 -757136 -264896 89708 77282 -3960 -85204 -570276 -321288 -668724 -1016160 -839814 -663467 -120091
-2760 -120091 423284 656979 890674 512652 134631 173341 212051 67246 -77558 236424 550407 168562
-2748 168562 -580312 173341 192935 -9217 -211371 -117224 -23077 -295959 -568842 -902897 -1236951 -714603
-2736 -714603 -192254 54582 301419 227105 152791 -235027 111213 21606 -68000 -123197 -545425 -271825
-2724 -271825 735833 1636442 3271111 4645800 4307684 2702406 1097128 730576 364024 609189
-2714 609189 854353 732488 610622 197236 -216150 -262506 -308863 -320810 -332758 -344706 -356653 -179351
-2702 -179351 -2049 404646 77282 -238611 -554505 -472784 342997 402734 462472 201059 -60353 -153544
-2690 -153544 -246735 -339927 -433118 -243629 -54140 135347 324836 154941 -14952 -184847 -354742 10615
-2678 10615 375972 374299 372626 374777 376928 379078 381229 173102 -35024 -59636 -84248 231406 547061 495687
-2664 495687 444312 153986 -136340 -59636 17066 -32396 -81859 -314837 -547815 -297871 -47928 202015
-2652 202015 451959 480155 508351 353032 197714 -185086 -567887 -170749 -507671 -336103 -164536 695211
-2640 695211 331527 -350201 -297871 121488 540849 730815 920782 881355 841928 748976 -78035 -721533
-2628 -721533 -630970 -410417 -189865 122444 -299305 207033 713372 990317 2001321 3914609 3625715
-2617 3625715 1578138 1243367 1340620 1437874 1229269 1020664 1370250 985777 1014212 1042647 1183868 1325088
-2605 1325088 1053400 781712 899993 284214 35466 520777 203210 -114356 -19014 76326 37855 -615
-2593 -615 144428 289471 277763 266054 208467 150879 395327 -94284 -492139 333438 734638 1135838
-2581 1135838 1766432 4599205 5612121 3444112 2514829 851486 345864 -159757 313367 52431
-2571 52431 177642 302853 382185 461517 338217 214918 321013 -306951 -544947 -782943 -699788 -616633
-2559 -616633 -399665 -182696 -149243 -115790 36183 188156 -26900 -241956 -116746 8464 133675 258886
-2547 258886 85884 -87116 -260117 -433118 -379831 -326545 -273259 -219973 -269914 -319855 -369795 -419736 -274693
-2534 -274693 -129649 -581029 -298349 87557 473464 293533 113603 346581 579559 445507 311455
-2523 311455 131524 -48405 -228336 -408267 -203963 340 204643 408947 544433 679918 1228313
-2512 1228313 1042647 1090915 1139184 361635 318146 -50317 -418781 -129649 159482 94009 28536 146578
-2500 146578 264620 180031 95442 377884 660324 785057 909790 667493 425196 -615 -426427 -240523
-2488 -240523 -54618 94009 242637 24235 -194166 -305517 -416869 37616 492102 1419713 1613264
-2477 1613264 705725 532246 687565 842884 432364 21845 -11129 -44104 -77080 -110055 -135384 -160713
-2465 -160713 -186042 -211371 -203246 -195122 -186998 -178873 169517 517909 682786 847663 371193 -105276 -214716
-2452 -214716 -324156 -230965 -137773 -411612 -685451 -593693 -501936 -410178 -318421 -77558 163305 220653
-2440 220653 278002 154702 31404 -413046 -857496 -1084022 -576489 -481864 -387239 -208503 -29767 -218061
-2428 -218061 -406355 -319377 -232398 -328935 -425471 -410178 -394886 -196078 2729 -85204 -173138 381229 201537
-2415 201537 72264 677051 456021 234990 48369 -138251 42156 222565 461278 699990 525794
-2404 525794 351599 632367 179076 -457730 -360476 -342077 -323678 -259400 -195122 -249364 -303606 9181
-2392 9181 321969 -176723 -675415 -776491 -143508 305959 21367 -171466 -364300 -205636 -46972 -255338
-2380 -255338 -463704 -190343 83017 -10651 -104320 -8739 86840 182421 278002 220653 163305 105956 48608
-2367 48608 305242 561876 206794 -148287 207750 563788 308109 52431 -216627 -485687 -387717 -289747
-2355 -289747 -245302 -200857 210617 622092 553274 484456 2729 255062 358289 461517 -1093 -463704
-2343 -463704 -236221 -8739 448135 170951 153747 136542 440489 744435 647899 551362 -141597 -100497
-2331 -100497 357334 815165 951846 1088526 580993 73459 223521 373582 -53662 253151 147056
-2320 147056 40962 312172 583382 671077 758773 422090 85406 176925 268444 224237 180031 -47689
-2308 -47689 -275410 -464898 -654387 -660361 -666335 -686646 -706956 -543752 -380548 -347334 -314120 -831450 -1348781
-2295 -1348781 -1046029 -743277 -624040 -504803 -236461 31881 300224 568567 686370 804173 738462
-2284 738462 672750 802023 931296 1060569 1189842 1132732 1075622 1018513 961404 831653 701902 572151
-2272 572151 442401 645270 848140 622809 397478 7747 -381982 -343511 -305040 -84009 137020 174535
-2260 174535 212051 272506 332961 -157128 -647219 -867054 -1086890 -633837 -180785 -194166 -207547 -526787
-2248 -526787 -846026 -612809 -379592 -329891 -280189 94487 469163 415638 362113 184333 6552 -171227
-2236 -171227 -349007 -373858 -398709 -423560 -448411 -566931 -685451 -375769 -66088 -69911 -73734 -77558 -81381
-2223 -81381 -238850 -396319 -247930 -99541 -84965 -70389 -361671 -652953 -634554 -616155 -291897 32359
-2211 32359 -220690 -473740 -420931 -368123 -306712 -245302 -183891 -122481 -477802 -833123 -760243 -687362 -755942
-2198 -755942 -824521 -587242 -349963 -495006 -640050 -280428 79194 383140 -46972 -530610 -647219
-2187 -647219 -909110 -436941 -148287 -226663 -268719 -310775 -375769 -440764 -402532 -364300 -303128 -241956 -572666
-2174 -572666 -536345 -64176 -326067 -633837 -207547 -240045 -272542 -513405 -754269 -444588 -134906 -272542
-2162 -272542 -410178 -119613 170951 149446 127940 289949 451959 220175 -11607 -243390 -475173 -662989
-2150 -662989 -850805 -732763 -614721 -255816 103089 278480 453870 75609 -302650 -130366 41917
-2139 41917 -321049 -684017 -741127 -798236 -280905 236424 493775 17066 -161430 -339927 -380787 -421648
-2127 -421648 -287835 -154022 -203724 -253426 -199901 -146376 -92850 -39325 -340404 -641484 -392018 -142552
-2115 -142552 233079 608711 66768 -475173 -395602 -316031 -52946 210139 220892 231645 -63459 -358565
-2103 -358565 -493095 -627624 -578639 -529654 -255099 19456 294011 568567 316234 63901 18022 -27856
-2091 -27856 -104320 186244 683264 446224 274178 102133 -299305 -700744 -555461 -410178 285648 981476
-2079 981476 760684 539893 135586 -268719 -210415 -152110 -399665 -647219 -409223 -171227 502616 442401
-2067 442401 -485687 -1046746 -942563 -838380 -538496 -238611 -244585 -250559 -420931 -591304 -333475 -75646
-2055 -75646 -165731 -255816 -345900 -435985 -262267 -88549 -98346 -108143 82061 272267 156614 40962 -212326
-2042 -212326 -465615 -413046 -360476 72503 505484 387919 270355 187200 104045 -162624 -429295 -446260
-2030 -446260 -463226 -480191 -497157 -628819 -760482 -708629 -656777 -553310 -449844 -346378 -242912 -170032
-2018 -170032 -97152 -330130 -563107 -533478 -503847 -474217 -444588 -816396 -1188205 -1009469 -830733 -736109
-2006 -736109 -641484 -241000 159482 -242912 -645307 -741843 -838380 -907676 -976972 -618066 -259161 -190821
-1994 -190821 -122481 -482342 -842203 -864665 -887126 -481386 -75646 -262506 -449367 -636227 -823087 -809228
-1982 -809228 -795369 -597995 -400620 -233832 -67044 99744 266532 3207 -260117 -95240 69636
-1971 69636 -128693 -327023 25191 377405 -28333 -434074 -289269 -144464 76804 298074 -153544
-1960 -153544 -605163 -761437 -917712 -768128 -618544 -369557 -120569 -177439 -234310 -107666 18978 -37892
-1948 -37892 -94762 73937 242637 411337 580037 504050 428063 168562 -90939 -44582 1773 94009
-1936 94009 186244 -747100 -946386 -1176258 -672070 -561674 -451278 -600862 -750446 -464182 -177917 -273976
-1924 -273976 -370034 -684017 -263940 171429 606799 355422 104045 -147331 -398709 22801 444312
-1913 444312 315278 186244 49564 -87116 -223796 -360476 -153066 54343 78238 102133 -181263 -464659
-1901 -464659 -748056 -1031453 -768128 -504803 -547337 -589870 -505281 -420692 -106710 -526787 -656299 -785811
-1889 -785811 -655343 -524875 -478519 -432162 -202290 27580 -6350 -40281 -74212 -108143 4163 116470
-1877 116470 -199423 -515317 -299783 -84248 590073 530335 60197 324119 129254 -65610 -115193 -164775
-1865 -164775 -107307 -783899 -401457 -19014 -156531 -294048 241322 42634 -3124 -48883 -549129 -315314
-1853 -315314 -188551 -61787 -183533 -305279 -243509 -181741 -234668 -287596 -340524 -393452 -343152 -292853 17425
-1840 17425 327704 672272 282781 122683 -37414 -224274 -411134 -414480 -417825 -397275 -376725 -356175 -335625
-1827 -335625 -185086 -34546 115992 266532 109302 -47928 177164 402257 742046 347776 366414
-1816 366414 385052 329137 273223 33793 -205636 9898 225432 548017 136542 40603 -55335 -59517
-1804 -59517 -63698 46816 -576728 -649728 -355697 36780 62228 -707554 -743277 -266688 209900 120652
-1792 120652 31404 -201932 -435268 -301575 -167881 -355339 -542797 -363224 -183652 -462867 -742082
-1781 -742082 -409581 -77080 -616274 -1155469 -838260 -521052 -639094 -757136 -508149 -259161 -293092
-1770 -293092 -327023 -360954 -394886 -665857 -936828 -840769 -744711 -618066 -491422 -364778 -238133 -52468
-1758 -52468 133197 -292853 -718904 -579117 -439330 -116029 207272 262948 318623 30209 108824 -80186
-1746 -80186 464862 619942 775021 385769 -3483 -25705 -47928 -307190 -566453 -213999 138454 -376008
-1734 -376008 -890471 -793218 -695965 -564302 -432640 -484492 -536345 -706718 -877090 -703372 -529654 -505042
-1722 -505042 -847460 -1075181 -568842 70353 -24510 -27617 -30723 -33829 -36936 143472 323880 -32396 -388673
-1709 -388673 -561435 -734197 -566692 -399187 -644590 -889994 -347812 -539690 -341599 223521 104284
-1698 104284 -14952 -180068 388875 786013 816121 471553 -240045 -489032 -370990 159959 -43149
-1687 -43149 -452712 -128215 349209 826635 497359 168084 205838 243592 242398 241203 -157607 667015
-1675 667015 1139900 389353 196997 371671 133436 -104798 69875 244548 90424 303330 722691
-1664 722691 407991 117904 -172183 103567 379317 219219 59122 -100975 -261073 -111489 38094
-1653 38094 187678 337262 310977 284692 258408 232123 248610 265098 -85443 -435985 -572427 -708868
-1641 -708868 -478280 -247691 -196795 -145898 -507910 -135862 -69672 -3483 154464 312411 1689967 3801584
-1629 3801584 2671103 1173593 559248 311933 408708 138454 70830 3207 -18536 -407311 -402293 336784
-1617 336784 685892 300941 31881 -237177 59600 356378 572868 789358 799394 442401 569045
-1606 569045 -38370 -485209 -197989 -159279 -120569 -35980 48608 -38847 -126304 38572 -163580 -251037
-1594 -251037 395566 453392 -222840 -627624 -298349 -83770 130807 360679 223521 -165970 178598
-1583 178598 800111 687565 422090 156614 326987 497359 -379831 -522964 -377442 -598950 -246974
-1572 -246974 105000 648138 457215 273939 -276365 -284729 -293092 -324395 -355697 -130844 94009 135347
-1560 135347 176686 -110772 -398231 -73973 250283 85168 -79947 121966 323880 243413 162946 -223378
-1548 -223378 -609703 -189327 231048 513787 62467 -108800 -280069 145085 -163819 -633300 -368720
-1537 -368720 -172959 -344228 -447634 -551040 -493871 -436702 -226604 -16505 346521 -24510 -805584 -852598
-1525 -852598 -242016 368564 371253 -360118 -930914 -767650 -361193 -321766 -30006 261753 224715 187678
-1513 187678 196519 205360 -301933 -75168 457454 256018 -193927 -643873 -833840 -1023806 -691902 -359998
-1501 -359998 -456296 -552594 -98346 355900 504289 652678 110974 -430728 -544230 -657732 -622129 -586525
-1489 -586525 -550921 -515317 -578938 -642559 -476786 -311013 -734018 -422962 -66028 -443154 -599488 -21762
-1477 -21762 -78692 -502653 -532820 171071 -233772 -638616 -320631 -2646 9480 21606 22264 22921 23578 24235
-1463 24235 -211191 -446618 -498531 -550443 -499128 -447813 -557074 -666335 -439569 154225 159243 -569798
-1451 -569798 -885931 -1202064 -768845 -335625 -338254 -340882 -527026 -713169 -551399 -389629 -411373 -433118
-1439 -433118 -360476 -287835 -169315 -50795 -379592 25669 224476 56254 69636 83017 50520 18022
-1427 18022 -132994 -651042 -1329665 -1274228 -1159651 -311013 -379951 -448889 -536942 -624996 -407192 -189387
-1415 -189387 -564183 -938979 -1130259 -1321540 -1218433 -1115325 -874581 100221 144069 187917 231764 275612
-1403 275612 518268 26863 -5753 -38370 -582343 -392257 -186878 18500 -28453 -75407 -76482 -77558 -340404
-1390 -340404 130807 5597 -119613 -49839 19934 -216150 -452234 -505759 -559284 228300 281825 354466
-1378 354466 427107 453870 480633 273223 65812 118382 170951 -47928 -1000867 -1433848 -643395 -192254
-1366 -192254 258886 -8739 -276365 10376 297118 400345 503572 449927 396283 342638 288993 200940
-1354 200940 112886 254226 395566 180390 699274 575855 452436 730457 274417 47772 -178873
-1343 -178873 -427502 -676132 -924761 -1173390 -680313 -187236 -18 187200 190904 194607 611220 293772
-1331 293772 148370 2968 -4797 -12563 98549 209661 -107427 -424515 -665140 -905764 -962874 -1019983
-1319 -1019983 -1035037 -1050091 -805166 -560240 74654 -24510 -261311 -498113 -193927 110258 -350201 -76602
-1307 -76602 70830 -515795 -337776 -159757 -195839 -231920 -268002 -304084 -351635 -399187 -140880 117426
-1295 117426 169756 222087 90902 -40281 -152349 -264418 -376486 -488555 -145659 197236 769525 607755
-1283 607755 480394 353032 439772 526511 747064 233557 -417586 -1068729 -787005 -505281 -529415 -553549
-1271 -553549 -691425 -829300 -707195 -585091 -206830 -562630 -505520 -448411 -309580 -170749 -628341 -351874
-1259 -351874 -507432 -662989 -589153 -515317 -442437 -369557 -602535 -835512 -479713 -123914 -73973 -24032
-1247 -24032 -127976 -231920 -30006 171907 -107905 -387717 -361671 -335625 -206353 -77080 -376008 -674937
-1235 -674937 -534194 -393452 -252709 -111967 29970 171907 -236700 -645307 -683061 -720816 -330369 60078
-1223 60078 -249125 -558328 -439330 -320333 -121047 78238 461039 843839 504528 165216 -174094
-1212 -174094 -513405 -650086 -786766 -617589 -448411 -211371 25669 -287835 -601340 -670158 -738976 -501936
-1200 -501936 -264896 -683539 -1102183 -847938 -593693 -484731 -375769 -450322 -524875 -574577 -624279 -368123
-1188 -368123 -111967 -268719 -425471 -398709 -371946 -626191 -880435 -706479 -532522 -633837 -735153 -1065862
-1176 -1065862 -662511 -380548 -98585 -321288 -543991 -1133724 -1723457 -1005646 -287835 -756897 -858930
-1165 -858930 -203963 -283056 -281861 -280667 -325351 -370034 -496918 -623801 -322483 -21165 -79230 -137296 -172421
-1152 -172421 -207547 -156173 262231 458888 -78513 -382699 -686885 -608747 -530610 -620695 -710780 -1030258
-1140 -1030258 -615677 -334909 -54140 -278038 -501936 -509343 -516751 -524158 -531566 -856301 -1181037 -955227
-1128 -955227 -729418 -588675 -447933 -613048 -778164 -583896 -389629 -501219 -612809 -759765 -906720
-1117 -906720 -625474 -344228 -208264 -72301 -119852 -167404 -272303 -377203 -298588 -219973 -38131 143711
-1105 143711 -26183 -196078 68680 -400620 -869922 -605163 -703611 -802059 -548770 -295482 -255338 -215194
-1093 -215194 31404 278002 264620 618269 750170 148012 -342316 -832645 -573621 -314598 116470
-1082 116470 547539 428063 308588 223521 138454 53387 -31679 -525831 -1019983 -1208277 -1396571 -1242925
-1070 -1242925 -1089279 -752118 -414957 -521291 -627624 -558090 -121525 175491 -261550 -285685 57210
-1059 57210 208945 360679 229494 98310 184093 269877 -630731 -797280 -378876 -327501 -207308 -87116
-1047 -87116 -114117 -141119 -168120 -195122 -168598 -142075 -115551 -89027 205121 499271 365219 231167 51236
-1034 51236 -128693 -308624 -488555 -213521 61511 -259878 152791 -111250 -375292 -287596 -199901 -218300
-1022 -218300 -236700 4880 246460 770959 561398 581231 601064 207989 -185086 -807555 -695965 -419975
-1010 -419975 -143986 -127976 -111967 -36936 38094 67246 96398 511697 192935 -141119 -475173 -220451
-998 -220451 34271 -261550 -557373 -528221 -499068 -164058 170951 124595 78238 -381026 -106232 30925
-986 30925 168084 167606 167128 208706 250283 291861 333438 485890 638341 240247 -157845 -328457 -499068
-973 -499068 -241479 16110 -81859 -179829 -231920 -284012 -720338 -422604 -354264 -285923 -580790 -875656
-961 -875656 -864665 -853673 -978406 -1103138 -922013 -740888 -445065 -149243 -281622 -414002 -329413 -244824
-949 -244824 267966 780756 658891 537025 598675 660324 507037 353749 383977 414204 20053 -374097
-937 -374097 -49481 275134 -24391 410142 431767 453392 50639 -352113 -571351 -790590 -571112 -351635
-925 -351635 97235 -187953 -262865 -337776 -275051 -212326 -73137 66051 205241 344430 219817 95203
-913 95203 -335267 -765739 -706240 -646741 -403727 -160713 -280905 -401098 -521291 -641484 -379354 -117224
-901 -117224 -283295 -449367 -282817 -116268 50281 216830 -6589 -230009 -453429 -676849 -410895
-890 -410895 -144942 304525 753994 556380 358767 344669 330571 270594 210617 150640 90663 85765 80866
-877 80866 75968 71069 -75288 -221645 -368004 -514361 -697040 -879719 -855943 -832167 -1087487 -975777 -428219
-864 -428219 -614721 -807914 -267046 -529057 -1158097 -624877 -91656 -498949 -906242 -966578 -1026913 -659047
-852 -659047 -291180 -596202 -901224 -778045 -654865 -528937 -403010 28775 460561 196519 -67522
-841 -67522 218981 505484 145861 -213760 -22838 168084 -141836 -451756 -134667 182421 400106 -116268
-829 -116268 -632643 -414957 -216389 -17820 410142 838104 380990 -76124 139649 355422 74176
-818 74176 -207069 -60114 86840 -67044 -220929 -321288 -54618 269399 -140641 -527743 -180785 15155
-806 15155 211095 -342316 -895728 -745667 -595605 -629058 -662511 -494289 -326067 -157845 10376 419461
-794 419461 828546 419461 10376 29492 -318421 -589870 -127260 140365 40962 -196078 -66088 181943
-782 181943 429975 333916 237858 -198467 -634793 -704089 -773385 -127737 517909 307154 96398 15633
-770 15633 -65132 -145898 -226663 -369557 -512450 -288313 -64176 22323 108824 195324 281825 526989 772154
-757 772154 650289 528423 421851 315278 208706 102133 -134906 -371946 -241956 -111967 -188431 -264896
-745 -264896 -341360 -417825 -388195 -358565 -328935 -299305 -659644 -1019983 -768606 -517229 -567170 -617111 -667051
-732 -667051 -716992 -782226 -847460 -545664 -243868 -227858 -211848 -195839 -179829 -221168 -262506 -166209 -69911
-719 -69911 16827 -630492 -497874 -365255 -217344 -69433 -105037 -140641 -130366 -120091 -109816 -99541 -138968
-706 -138968 -178395 -217822 -257249 -24988 207272 -172183 -551638 -277321 -3005 -95718 -188431 -118657
-694 -118657 -48883 -208503 365936 615401 864867 1160211 1455556 1243068 1030580 818092 605604 618687
-682 618687 631770 828367 1024965 326927 -371110 -212745 -54379 27520 109421 -267464 89708 528124
-670 528124 232481 579141 925800 503990 82181 272088 461995 337441 212887 134212 55538 -822191
-658 -822191 -965861 -666036 -366211 -368601 -370990 -235744 -100497 290905 -51751 -440286 -94762 270833
-646 270833 -97629 -7306 83017 -25466 -133950 -242434 -350918 -356414 -361910 -367406 -372902 -431923 -490944
-633 -490944 -182935 125073 50759 -23554 -97869 -172183 -437658 -703133 -356892 -10651 44844 100341
-621 100341 -211191 -522725 -176663 169398 -96256 -361910 -302590 -243271 -474516 -705762 -1296391 -663587
-609 -663587 -535449 -407311 -210116 -12921 758 14438 -98048 -210534 -368900 206794 -60532 -327860
-597 -327860 -365793 -403727 -97570 208586 71249 -800148 -517707 -235266 -182218 -129171 -217583 -305996
-585 -305996 -394408 -482820 -248169 -13518 68202 -584135 -575055 168084 268921 369759 261275 152791
-573 152791 457215 27580 -130605 -288791 118860 526511 463906 401301 292817 184333 435232 -47928
-561 -47928 -485209 -922491 -1000449 -1078407 -544648 -10890 346999 704889 451062 197236 224417 251598
-549 251598 278778 305959 164918 23876 -163043 -349963 -64714 -513525 -182398 148729 433977 719226
-537 719226 683323 647421 131704 350046 155479 -39086 68381 175850 -83711 -343272 -124631 94009
-525 94009 6791 -80425 142038 364502 -177678 14199 83734 -580790 -235983 108824 101894 94965 -95479
-512 -95479 -285923 -474456 -662989 -668007 -673025 -712452 -751879 -791306 -830733 -610181 -389629 -398470 -407311 252912
-498 252912 179076 -361193 -534433 -835692 -1136950 -987068 -837185 -1046686 -1256187 -792800 -329413 -18955
-486 -18955 291502 97294 -96913 -168777 493417 8643 -109099 194667 865465 871020 142516 18082
-474 18082 260678 75072 -477563 -867711 -523800 -19313 -248886 -348469 -448052 -287656 -127260 18022
-462 18022 163305 -119613 -402532 -758092 -1113652 -1041011 -968370 -721771 -475173 23757 155658 -224752
-450 -224752 128896 199625 -463704 -855584 -513405 -377681 -608986 -614721 113603 138454 -203724 188156
-438 188156 -154022 -534433 -914845 -905286 -895728 -702655 -509582 -423560 -337537 -435029 -532522 -461792 -391062
-425 -391062 -14474 362113 178598 -4916 -4916 -4916 -43149 -81381 -119613 -157845 -199901 -241956 -284012 -326067
-411 -326067 -414002 -501936 -589870 -677804 -595605 -513405 -431206 -349007 -209459 -69911 482544 300941 68799
-398 68799 -163341 -211968 -260595 -423918 146817 411695 -57486 -209339 -361193 -558926 -756658 -595008
-386 -595008 -433357 -455221 -477085 -618425 -759765 -901105 -1042445 -889396 -736347 -766814 -797280 -491302
-374 -491302 -185325 350046 151357 -318779 -788917 -632045 -475173 -319198 -163222 -7246 148729
-363 148729 33255 -82217 108167 298551 67425 -163700 -211311 -258922 -230069 -201215 -401755 -602296
-351 -602296 -289090 -709943 -534374 -358804 -477622 -596441 -715260 -834079 -883124 -932168 -675355 -418542
-339 -418542 -700804 -983065 -1127691 -538257 -372066 -205875 235588 -57008 -154619 -252231 -579237 -906242
-327 -906242 -629178 -352113 337859 293772 184691 75609 -262865 -601340 -588556 -575772 -379473 -183174
-315 -183174 -296557 -409939 -523322 -636705 -126901 382902 219817 56732 -52826 -162386 33912
-304 33912 230211 48668 -132875 -268540 -404205 -933662 -729059 -264478 200103 331109 462114 287261
-292 287261 112408 75191 37975 184273 330571 405184 479796 248551 17305 485710 954116 260259
-280 260259 300463 714387 -95120 -170570 -246019 -130306 -14594 -128275 -241956 -263701 -1019505 -505998
-268 -505998 7508 -83053 -173616 -80664 12287 -308624 -629536 -338732 -47928 32598 113125 -173377
-256 -173377 -459880 -122719 214440 -60114 -334670 -276604 -218539 23040 264620 -106471 -477563 -894534
-244 -894534 -577445 -317704 -57964 -119374 -180785 307871 796527 -30006 -122481 320296 29014 -170510
-232 -170510 -370034 -404205 -438375 -105515 227344 460800 694256 315995 -62265 -91417 -120569 -149721
-220 -149721 -178873 -188909 -198945 -208981 -219017 -138251 -57486 206794 471075 -147809 -766694 -575055 -383416
-207 -383416 162110 -26422 -505520 -250559 -783182 -92373 139649 371671 175491 -20687 -400381
-196 -400381 -780076 -911260 -1042445 -990114 -937784 -508626 -79469 -262028 -444588 -424515 -404444 -384372
-184 -384372 -364300 -405399 -446499 -487599 -528699 -332758 -136818 59122 255062 10137 -234788 -571471
-172 -571471 -174094 -51990 -663945 -205397 253151 164977 76804 -11368 -99541 -459164 -818786 -765500
-160 -765500 -712213 -779359 -112445 -41954 28536 148729 268921 205599 142277 134392 126506 -64893 -256294
-147 -256294 -141836 -27378 -692858 -624279 -167165 289949 181226 72503 86123 99744 -116029 402257
-135 402257 283020 163783 273939 384096 448374 512652 576930 641208 497120 353032 285409 217786
-123 217786 43112 1091871 1483035 4076378 7794706 18119572 19635720 9162227 4790605 2621162
-113 2621162 1965718 1310273 899157 -246019 -121883 2251 -301814 -605880 -757017 -174094 622928
-102 622928 685892 550048 414204 740971 333677 339293 344908 292219 239530 49205 -141119 -442317 -9456
-89 -9456 622212 1253881 971798 689715 728784 767853 936911 371910 219817 67724 218742 369759
-77 369759 153747 -62265 249327 560920 505484 450047 121249 -207547 -169315 -131083 -69911 -8739 52431
-64 52431 113603 282781 451959 254106 56254 179554 302853 242637 182421 147056 111691 213963 316234
-51 316234 628783 207272 15155 -176962 -277680 -378398 -112086 154225 49683 -54857 -159398 -263940
-39 -263940 -278635 -293331 -308026 -322722 -329771 -336820 -343869 -350918 12885 376689 128776 -119135 11451 142038
-25 142038 89110 36183 58763 81344 -263104 -607553 -428219 -248886 343355 201537 -107427 -416391
-13 -416391 -572427 5597 56015 106434 -164297 -435029 -268958 -102887 -303845 -504803 -292853 -80903
-1 -80903 -235983 -391062 -412807 -434551 -502175 164261 58405 -47450 -61548 -75646 -699549 -589392 -525114
11 -525114 -460836 -530371 -599906 -485926 -371946 3924 379795 388636 397478 77521 -242434 34032 -423560
24 -423560 -353547 -283534 -672308 -327023 -597278 -867532 -480191 -92850 258647 610145 594613 579081
36 579081 567372 555664 176925 -201812 -102648 -3483 233318 470119 515759 -172660 -677565 -448411 -120091
49 -120091 208228 628305 314322 -37892 -390106 -176484 37138 132241 227344 47174 601064 787925
61 787925 240725 -352352 278002 135108 -7784 -74212 -140641 87318 315278 130329 679441 330093
73 330093 -19253 44307 107868 -126782 -361432 -229053 -96674 -105993 -115312 242398 600109 254345 -91417
$$ [...]
##END=	
##TITLE=	Sep04-2015.30.fid
##JCAMPDX=	6.0	$$ NMR Plug-in 1.14 of MestReNova 12.0.4-22023
##BLOCKID=	3
##DATATYPE=	NMRPEAKTABLE
##DATACLASS=	PEAKTABLE
##.OBSERVEFREQUENCY=	125.77036383080600501
##.OBSERVENUCLEUS=	^13C
##NPOINTS=	15
##FIRSTX=	22.345653373150152987
##LASTX=	200.94038657956548377
##XFACTOR=	1
##YFACTOR=	1
##FIRSTY=	866.02391236521532392
##XUNITS=	PPM
##YUNITS=	ARBITRARY UNITS
##PEAKTABLE=	(XY..XY)
22.345653373150152987, 866.02391236521532392
38.265844885454200153, 817.97036595622114419
44.1238356781010026, 861.16929411483499734
45.169963892277820605, 955.4179658214787878
60.045496313115215514, 996.5216363675373259
62.926408388208628253, 1099.4017609825762065
62.96595156311617103, 1181.5812706690867344
63.410884143547342262, 897.76458283226338608
74.286974385130960741, 810.56890854556240811
81.105524143202785581, 872.37764153939724565
84.297833560683386622, 1029.96788462567838
85.030173756269519458, 960.02197293173969683
86.119962655087391568, 788.60030554453976492
102.6578585001316668, 841.75155010121261512
200.94038657956548377, 247.72226258596126058
##END=	
##END=	
