##TITLE=	Jun25-2015.41.fid
##JCAMPDX=	6.0	$$ NMR Plug-in v.1.14 of MestReNova 12.0.4-22023
##DATATYPE=	LINK
##BLOCKS=	3
##ORIGIN=	Bruker BioSpin GmbH
##OWNER=	nmr
##TITLE=	Jun25-2015.41.fid
##JCAMPCS=	3.7	$$ Molecule Plug-in 1.10 of MestReNova 12.0.4-22023
##ORIGIN=	Bruker BioSpin GmbH
##OWNER=	nmr
##BLOCKID=	1
##NAMES=	
##ATOMLIST=	
$$ AN	AS	NH
	1	C	1
	2	O	 
	3	C	2
	4	C	 
	5	C	 
	6	C	1
	7	C	1
	8	C	1
	9	C	2
	10	C	1
	11	C	1
	12	C	2
	13	O	 
	14	C	3
	15	Cl	 
	16	Cl	 
	17	H	 
	18	H	 
	19	Br	 
	20	Cl	 
	21	C	 
	22	C	 
	23	C	1
	24	Br	 
	25	H	 
	26	H	 
	27	H	 
##BONDLIST=	
$$ AN1	AN2	BT
	22	1	D
	23	1	S
	2	21	S
	21	3	S
	3	4	S
	5	6	S
	6	7	S
	7	2	S
	4	8	S
	8	9	S
	9	10	S
	10	11	S
	11	12	S
	12	5	S
	5	13	S
	13	4	S
	7	14	S
	8	15	S
	6	16	S
	5	17	S
	4	18	S
	11	19	S
	10	20	S
	21	22	S
	23	24	S
	23	25	S
	22	26	S
	21	27	S
##MAXRASTER=	32768
##XYRASTER=	
$$ AN	X	Y	Z
	1	17677	-12424	0
	2	9172	1285	0
	3	-949	-8661	0
	4	-8019	-5660	0
	5	-7895	8530	0
	6	-774	11408	0
	7	6295	8406	0
	8	-15141	-8537	0
	9	-22210	-5536	0
	10	-25087	1584	0
	11	-22087	8654	0
	12	-14966	11531	0
	13	-5018	1409	0
	14	11772	13790	0
	15	-15208	-16217	0
	16	-707	19087	0
	17	-7828	16210	0
	18	-8086	-13340	0
	19	-27469	14132	0
	20	-32768	1651	0
	21	6171	-5784	0
	22	10010	-12433	0
	23	25349	-12434	0
	24	32010	-8602	0
	25	32768	-14428	0
	26	6174	-19087	0
	27	13590	-3796	0
##STEREOCENTER=	
$$ AN	SD
	4	M
	5	P
	6	M
	7	M
	8	P
	10	M
	11	M
	21	P
	23	P
	23	P
##END=	

##TITLE=	Jun25-2015.41.fid
##JCAMPDX=	6.0	$$ NMR Plug-in 1.14 of MestReNova 12.0.4-22023
##BLOCKID=	2
##DATATYPE=	NMRSPECTRUM
##DATACLASS=	XYDATA
##NUMDIM=	1
##ORIGIN=	Bruker BioSpin GmbH
##OWNER=	nmr
##.OBSERVEFREQUENCY=	400.20240119999999706
##.OBSERVENUCLEUS=	^1H
##.SOLVENTNAME=	CDCl3
##.PULSESEQUENCE=	zg30
##LONGDATE=	2015/06/25 18:26:00.000
##.ACQUISITIONMODE=	SIMULTANEOUS (DQD)
##$ORIGINALFORMAT=	Bruker XWIN-NMR
##$PARAMETERFILE=	(acqus, ASCII, //ch-nmrserv2.ch.ic.ac.uk/Av400C/brad/nmr/Jun25-2015/41/acqus, 0)
$$ ##TITLE= Parameter file, TOPSPIN		Version 3.2
$$ ##JCAMPDX= 5.0
$$ ##DATATYPE= Parameter Values
$$ ##NPOINTS= 11	$$ modification sequence number
$$ ##ORIGIN= Bruker BioSpin GmbH
$$ ##OWNER= nmr
$$ $$ 2015-06-25 18:26:05.505 +0100  nmr@CZC2439F63
$$ $$ /opt/topspin/data/brad/nmr/Jun25-2015/41/acqus
$$ $$ process /opt/topspin3.2.2/prog/mod/shimcntl
$$ ##$ACQT0= -2.20588235294118
$$ ##$AMP= (0..31)
$$ 100 100 100 100 100 100 100 100 100 100 100 100 100 100 100 100 100 100
$$ 100 100 100 100 100 100 100 100 100 100 100 100 100 100
$$ ##$AMPCOIL= (0..19)
$$ 0 0 0 0 0 0 0 0 0 0 0 0 0 0 0 0 0 0 0 0
$$ ##$ANAVPT= -1
$$ ##$AQSEQ= 0
$$ ##$AQ_mod= 3
$$ ##$AUNM= <au_zg>
$$ ##$AUTOPOS= <13 >
$$ ##$BF1= 400.2
$$ ##$BF2= 400.2
$$ ##$BF3= 400.2
$$ ##$BF4= 400.2
$$ ##$BF5= 400.2
$$ ##$BF6= 400.2
$$ ##$BF7= 400.2
$$ ##$BF8= 400.2
$$ ##$BYTORDA= 0
$$ ##$CAGPARS= (0..11)
$$ 0 0 0 0 0 0 0 0 0 0 0 0
$$ ##$CFDGTYP= 0
$$ ##$CFRGTYP= 9
$$ ##$CHEMSTR= <none>
$$ ##$CNST= (0..63)
$$ 1 1 145 1 1 1 1 1 1 1 1 1 1 1 1 1 1 1 1 1 1 1 1 1 1 1 1 1 1 1 1 1 1 1 1
$$ [...]
$$ ##$Sgu1PowerLevels= (0..7)
$$ 90 74 58 42 26 10 0 0
$$ ##$Sgu2PowerLevels= (0..7)
$$ 90 74 58 42 26 10 0 0
$$ ##$Sgu3PowerLevels= (0..7)
$$ 0 0 0 0 0 0 0 0
$$ ##$Sgu4PowerLevels= (0..7)
$$ 0 0 0 0 0 0 0 0
$$ ##$Sgu5PowerLevels= (0..7)
$$ 0 0 0 0 0 0 0 0
$$ ##$Sgu6PowerLevels= (0..7)
$$ 0 0 0 0 0 0 0 0
$$ ##$Sgu7PowerLevels= (0..7)
$$ 0 0 0 0 0 0 0 0
$$ ##$Sgu8PowerLevels= (0..7)
$$ 0 0 0 0 0 0 0 0
$$ ##$SguType= 3
$$ ##$ShimPowMaxUA= (0..63)
$$ 130000 130000 130000 130000 130000 130000 130000 130000 130000 130000 130000
$$ 130000 130000 130000 130000 130000 130000 130000 130000 130000 0 0 0 0
$$ 0 0 0 0 0 0 0 0 0 0 0 0 0 0 0 0 0 0 0 0 0 0 0 0 0 0 0 0 0 0 0 0 0 0 0 0
$$ 0 0 0 0
$$ ##$ShimPowMaxUC= (0..63)
$$ 130000 130000 130000 130000 130000 130000 130000 130000 130000 130000 130000
$$ 130000 130000 130000 130000 130000 130000 130000 130000 130000 0 0 0 0
$$ 0 0 0 0 0 0 0 0 0 0 0 0 0 0 0 0 0 0 0 0 0 0 0 0 0 0 0 0 0 0 0 0 0 0 0 0
$$ 0 0 0 0
$$ ##$ShimPowMaxUG= (0..63)
$$ 524287 524287 524287 524287 524287 524287 524287 524287 524287 524287 524287
$$ 524287 524287 524287 524287 524287 524287 524287 524287 524287 0 0 0 0
$$ 0 0 0 0 0 0 0 0 0 0 0 0 0 0 0 0 0 0 0 0 0 0 0 0 0 0 0 0 0 0 0 0 0 0 0 0
$$ 0 0 0 0
$$ ##$ShimPowRcbType= 3
$$ ##$ShimPowRes= (0..63)
$$ 1e-20 1e-20 1e-20 1e-20 1e-20 1e-20 1e-20 1e-20 1e-20 1e-20 1e-20 1e-20
$$ 1e-20 1e-20 1e-20 1e-20 1e-20 1e-20 1e-20 1e-20 0 0 0 0 0 0 0 0 0 0 0 0
$$ 0 0 0 0 0 0 0 0 0 0 0 0 0 0 0 0 0 0 0 0 0 0 0 0 0 0 0 0 0 0 0 0
$$ ##$ShimPowRng0= (0..63)
$$ 1 1 1 1 1 1 1 1 1 1 1 1 1 1 1 1 1 1 1 1 0 0 0 0 0 0 0 0 0 0 0 0 0 0 0 0
$$ 0 0 0 0 0 0 0 0 0 0 0 0 0 0 0 0 0 0 0 0 0 0 0 0 0 0 0 0
$$ ##$ShimPowRng1= (0..63)
$$ 1 1 1 1 1 1 1 1 1 1 1 1 1 1 1 1 1 1 1 1 0 0 0 0 0 0 0 0 0 0 0 0 0 0 0 0
$$ 0 0 0 0 0 0 0 0 0 0 0 0 0 0 0 0 0 0 0 0 0 0 0 0 0 0 0 0
$$ ##$ShimPowRng2= (0..63)
$$ 1 1 1 1 1 1 1 1 1 1 1 1 1 1 1 1 1 1 1 1 0 0 0 0 0 0 0 0 0 0 0 0 0 0 0 0
$$ 0 0 0 0 0 0 0 0 0 0 0 0 0 0 0 0 0 0 0 0 0 0 0 0 0 0 0 0
$$ ##$ShimPowRng3= (0..63)
$$ 1 1 1 1 1 1 1 1 1 1 1 1 1 1 1 1 1 1 1 1 0 0 0 0 0 0 0 0 0 0 0 0 0 0 0 0
$$ 0 0 0 0 0 0 0 0 0 0 0 0 0 0 0 0 0 0 0 0 0 0 0 0 0 0 0 0
$$ ##$ShimSysFunc= (0..63)
$$ 1 2 3 4 5 7 9 11 15 16 8 10 12 14 6 17 13 18 19 20 0 0 0 0 0 0 0 0 0 0
$$ 0 0 0 0 0 0 0 0 0 0 0 0 0 0 0 0 0 0 0 0 0 0 0 0 0 0 0 0 0 0 0 0 0 0
$$ ##$ShimSysMatrix= 0
$$ ##$ShimSysType= 1
$$ ##$TFXNUM= 0
$$ ##$TRIPLO2= 0
$$ ##$VTU= 2
$$ ##$VTUETH= <149.236.99.20>
$$ ##$VTUTY= <no>
$$ ##$WBREFAM= (0..15)
$$ 135.5 97.7 100 100 100 100 100 100 100 100 100 100 100 100 100 100
$$ ##$WBREFLM= (0..15)
$$ 0 0 0 0 0 0 0 0 0 0 0 0 0 0 0 0
$$ ##$WBREFPH= (0..15)
$$ 72.26 -67.22 0 0 0 0 0 0 0 0 0 0 0 0 0 0
$$ ##$WBSGU= (0..15)
$$ 0 0 0 0 0 0 0 0 0 0 0 0 0 0 0 0
$$ ##$XFAC= 2
$$ ##END=
$$ 
##$DECIM=	2496
##$DSPFVS=	20
##XUNITS=	HZ
##YUNITS=	ARBITRARY UNITS
##FIRSTX=	6397.6051963886802696
##LASTX=	-1615.093050493819419
##XFACTOR=	-0.12226593800080109986
##YFACTOR=	3.8796128906249999126e-05
##NPOINTS=	65536
##XYDATA=	(X++(Y..Y))
$$ [...]
-8273 982470 948261 914052 839758 765464 674229 674617 776171 877725 790308 702891 649832 688396 736295
-8260 736295 692572 660301 628030 678792 729555 688694 647834 590988 534141 568917 603693 598384 593075 541955
-8246 541955 490835 522390 553945 631311 708677 682968 657259 585738 514218 485646 457074 474312 491551
-8233 491551 574644 657736 746555 743751 657289 570826 631341 691856 672201 652547 678703 704859 655618 606377
-8219 606377 557136 507895 452928 397960 388804 379648 362499 345349 419822 494295 528683 563072 597460 631848
-8205 631848 650011 668175 640527 612879 656811 700744 653053 605363 562296 519229 567784 616339 623855 631371
-8191 631371 730509 829647 816166 802685 829289 855893 908266 869016 789682 710347 668324 626301 584277
-8178 584277 542254 544133 546012 547891 549770 592688 635606 678524 721442 661285 601128 540971 480814 524478
-8164 524478 568142 611806 655469 621827 588184 597490 606795 538794 424982 374160 414961 514934 569096 563131
-8150 563131 557166 597281 637395 631699 626002 600263 574524 594597 614669 586305 557942 483767 409592 433721
-8136 433721 457849 527789 597728 580460 563191 545922 528654 560059 591465 531248 471032 529876 588721
-8123 588721 558807 528892 550515 617950 668205 626837 592032 603037 614042 579237 516753 545892 609390
-8110 609390 672887 679598 640497 575628 602381 669219 736056 762809 789562 843874 898185 831287 718579
-8097 718579 705128 783299 861470 848019 792098 781987 857772 887746 866183 844619 820193 795766 713002
-8084 713002 630237 639095 647953 695942 743930 746107 748285 761915 775545 789175 802805 762988 723172 729167
-8070 729167 735162 653411 571661 588214 696389 745392 748583 783269 817956 763406 708856 654306 599756 640646
-8056 640646 681536 722426 763316 722128 680940 639752 598563 543059 487555 523673 559791 607839 655887
-8043 655887 744020 832153 923148 922522 881811 841100 848616 856132 863648 871163 861500 851837 842174 832510 826665 820819
-8027 820819 814973 809128 805191 801254 720965 640676 554064 467453 518274 569096 567426 565756 552633 631132 678614
-8012 678614 634473 590332 637813 765464 801492 726811 652129 675720 699312 722904 746495 685145 623795
-7999 623795 663612 703428 776171 757292 744139 730986 791322 851658 906268 960877 1008806 965112 927145
-7986 927145 889178 947605 1006032 963293 920554 877337 925743 993237 1060731 1055691 959028 868092 777155 785566
-7972 785566 793977 756576 719175 719951 720726 822668 924610 954017 891802 753236 706291 771966 837640 807875
-7958 807875 778110 725677 764867 798331 831795 810857 789920 768983 748046 828037 908027 907848 816047 769102
-7944 769102 813780 852732 800061 791054 782046 818851 764032 720667 677301 704561 731821 755025 778229 841518
-7930 841518 904806 846886 697344 605065 512787 517260 613357 734267 855177 846290 837402 828514 819626 837461
-7916 837461 855297 796780 738263 716014 693765 717326 740888 785208 829528 873848 918168 815510 712853
-7903 712853 665550 709870 732239 754608 782703 810798 800717 790636 780555 770474 766359 762243 712316 662389
-7889 662389 664954 667519 746435 825352 855118 884883 868837 852791 812886 772980 733074 693168 688903 684638
-7875 684638 726184 767730 825502 883273 839877 796482 730658 756457 862425 968393 1005644 951273 942714
-7862 942714 934154 944205 862634 775336 779660 804028 736772 640885 697701 834688 971674 950230 928786
-7849 928786 1043820 1158855 1218535 1186593 1100905 1015218 979160 1034724 1096014 1157304 1178510 1199715 1224739
-7836 1224739 1249762 1320596 1391430 1391639 1391848 1346246 1300643 1281406 1262169 1197121 1132073 1185370 1238667 1291964
-7822 1291964 1345261 1404762 1464263 1523764 1583265 1658990 1734716 1810442 1886167 1971884 2057601 2219670 2381739
-7809 2381739 2556215 2730691 2966249 3293429 3681690 4161574 4832338 5716887 6816176 8007087 9182728
-7798 9182728 10266746 11115505 11506153 11350884 10676422 9651696 8535347 7441904 6501164 5731739
-7788 5731739 5176100 4775074 4526751 4388184 4249617 4242757 4327520 4486159 4736420 5055399 5465999 6022622
-7776 6022622 6793031 7760047 8879766 10086812 11293859 12243218 12795547 12796233 12277725 11388911 10286312
-7765 10286312 9123346 8052003 7192537 6546856 6036700 5526544 5096557 4819274 4631228 4443181 4356301
-7754 4356301 4269421 4243622 4217824 4192025 4166227 4133330 4100433 4015998 4023186 4114361 4205536 4296711 4387886
-7741 4387886 4437067 4394626 4312101 4229575 4093603 3957631 3770121 3674234 3668895 3663557 3704029 3836124 3951039
-7728 3951039 4065955 4104519 4143082 4357255 4724133 5014657 5305183 5672060 6191640 6884922 7730907
-7717 7730907 8719367 9860530 11051322 12150492 13116045 13806733 14153836 13981746 13305256 12292816
-7707 12292816 11175394 10057972 9091344 8338502 7843347 7500897 7252932 7096590 7008964 7012961 7135303
-7696 7135303 7410349 7834281 8349836 8915973 9573733 10374653 11328277 12304806 13281337 14290315 15207671
-7685 15207671 15754959 15844136 15488563 14797041 13948997 13100954 12460970 12156934 12247065 12673145 13232840
-7674 13232840 13700913 13947567 13797189 13310863 12549668 11594256 10547220 9572719 8812003 8261255 7802130
-7663 7802130 7415538 7120569 6952058 6936251 7008248 7171868 7478648 7877050 8290722 8612772 8995963
-7652 8995963 9531859 10250999 11061760 11882067 12549668 12957674 13029733 12719552 12073424 11198240 10231434
-7641 10231434 9325709 8572688 8039179 7658373 7381240 7104106 6909051 6866699 7047677 7320277 7484076
-7630 7484076 7495171 7382194 7269217 6993992 6718767 6414911 6111053 5959901 5808747 5779877 5751006 5722136
-7618 5722136 5693265 5578499 5463732 5440588 5417444 5363282 5309120 5346580 5384040 5560842 5737645 5700662
-7606 5700662 5663679 5644472 5625264 5606057 5586850 5638268 5689686 5954890 6220094 6642773 7065453 7560667
-7594 7560667 8208584 8982482 9848003 10742156 11636309 12460493 12948727 12954037 12440151 11563596 10412173
-7583 10412173 9161492 8063516 7252813 6716977 6324302 5931627 5672567 5627292 5797712 5968132 6164082
-7572 6164082 6360032 6657149 6954265 7358274 7914987 8609133 9394903 10162538 10930173 11638636 12255476
-7561 12255476 12603175 12553845 12004409 11057943 9921015 8875709 7998378 7334832 7007234 7137748 7737827
-7550 7737827 8673854 9783582 11168176 12848635 14529094 15310508 14656506 12828592 10725813 9053943
-7540 9053943 7901268 7065453 6504504 6321499 6413359 6577755 6894854 7588941 8618976 9753995 10889015
-7529 10889015 12281722 13827133 14773181 14344895 12552711 10210794 8191465 6844032 5893629 5248635
-7519 5248635 4767796 4470203 4182153 3894103 3728217 3745575 3833559 3921542 4020979 4120415 4243235 4366054
-7507 4366054 4336169 4306285 4119879 3933473 3655444 3377416 3227754 3078092 2928431 2778769 2653922
-7496 2653922 2529074 2556931 2584787 2506825 2428862 2442522 2456182 2586279 2716375 2846472 2976568 3141023
-7484 3141023 3305478 3256147 3206817 3054411 2902006 2749600 2597195 2343384 2089574 1988467 1887360
-7473 1887360 1854970 1822580 1790190 1757800 1708709 1659617 1702147 1744677 1752849 1761022 1769193 1777366 1680435 1583503
-7459 1583503 1578194 1572886 1613388 1653890 1700119 1746348 1879427 2104128 2454810 2988737 3545569 4194024
-7447 4194024 4930283 5758165 6403995 6500091 5972009 5016358 4156146 3479179 3033176 2770418 2615984
-7436 2615984 2553173 2562896 2664241 2817124 3153251 3621086 4180543 4848234 5607548 6259970 6484820 6058770
-7424 6058770 5205150 4259907 3497909 3001949 2689234 2447145 2296678 2235925 2175171 2120144 2065117 2038364
-7412 2038364 2011611 1984858 1958105 1931352 1904599 1877846 1851093 1812171 1773250 1734328 1695407 1681299 1667192
-7399 1667192 1653085 1638978 1567308 1495639 1515592 1535545 1578403 1621262 1664120 1706979 1601428 1495878 1543031
-7386 1543031 1590184 1633520 1676855 1811813 1946771 2103442 2260113 2416783 2573454 2724398 2875342 3026286
-7374 3026286 3177231 3358477 3539723 3720970 3902216 3881130 3860043 3838957 3817871 3803585 3789298 3775012
-7362 3775012 3760726 3746440 3732154 3717868 3703582 3633702 3563822 3493942 3424062 3306462 3188862 3071262 2953663
-7349 2953663 2907881 2862100 2724696 2587293 2551055 2514818 2478581 2442343 2395607 2348872 2302136 2255400 2197212
-7336 2197212 2139023 2080835 2022646 2076510 2130374 2184238 2238102 2377862 2517622 2657381 2797141 2860549
-7324 2860549 2923957 3078987 3234017 3455855 3677694 3899532 4121370 4399517 4677665 4955813 5233961
-7313 5233961 5676265 6118570 6560874 7003178 7361018 7718859 8034705 8442174 9071063 9852656 10697240
-7302 10697240 11541824 12265556 12836586 13146109 13119683 12698137 12001725 11112523 10223321 9421447 8772276
-7291 8772276 8287263 7954953 7714266 7473577 7242434 7011291 6757838 6504386 6250933 5997480 5577962
-7280 5577962 5158444 4891629 4624815 4433876 4242936 4051997 3861057 3704476 3547895 3391314 3234733
-7269 3234733 3084565 2934396 2875849 2817303 2767346 2717389 2667432 2617475 2589947 2562419 2586428 2610437 2665941
-7256 2665941 2813068 3061361 3309653 3494956 3680258 3865561 4050864 4300111 4549358 4758521 4876061
-7245 4876061 4896014 4915967 4884382 4852797 4841255 4829713 4818171 4806628 4809283 4811937 4814592 4817246 4785542 4753838
-7231 4753838 4722134 4690431 4575455 4460480 4293967 4219076 4209085 4199094 4200555 4202016 4258236 4406079 4639817
-7218 4639817 5026260 5636031 6398507 7225881 8205960 9475698 10959222 12480923 13849920 14844792
-7208 14844792 15381552 15349490 14737153 13674549 12398158 11083593 9860650 8804726 8084751 7702633
-7198 7702633 7534302 7524400 7514498 7472146 7429794 7355948 7282101 7217799 7153496 7136556 7272319 7545516 7818712
-7185 7818712 8099544 8533080 9231939 10083501 10755160 11090870 11067725 10647552 9900973 8879527 7880987
-7174 7880987 7096232 6606118 6329790 6135540 6093993 6264324 6434655 6547721 6508083 6422635 6337187 6242194
-7162 6242194 6147201 5939590 5731978 5518640 5305302 5076336 4755747 4435159 4206192 4081255 3956318
-7151 3956318 3837108 3717898 3588666 3459434 3290118 3120802 2977254 2925329 2913489 2901648 2850796 2799945
-7139 2799945 2749093 2698241 2704654 2711066 2717479 2723891 2840059 2956228 2986500 3016772 3096673 3268197 3546613
-7126 3546613 3825029 4247321 4761235 5330504 5991396 6747727 7595681 8374918 9001452 9418494 9560670
-7115 9560670 9397438 9020420 8605227 8342737 8294033 8520196 9018213 9668934 10058150 9867091 9216012
-7104 9216012 8564933 8186812 8083558 8040909 8089881 8245746 8554316 9010816 9681103 10649162 11831007
-7093 11831007 13216378 14754451 16254349 17540461 18323606 18465393 17988731 16992876 15610010 14135524
-7083 14135524 12764110 11667566 10926057 10581579 10525329 10621783 10793336 10964889 11224247 11483605 11582624
-7072 11582624 11467858 11213748 10806936 10238592 9517543 8790768 8063993 7461290 7011291 6759806 6599944
-7061 6599944 6436146 6272347 6022652 5772958 5515628 5258298 5102134 5037593 5075888 5114183 5158205 5202227
-7049 5202227 5192802 5183378 5173953 5164528 5253436 5342345 5339631 5336917 5237808 5138700 4999506 4860314 4800813 4832934
-7035 4832934 4956678 4988799 4913074 4837348 4755896 4674444 4496240 4318036 4139831 3961627 3858821 3756014
-7023 3756014 3699018 3642023 3590754 3539484 3579838 3620191 3618551 3616910 3569459 3522007 3559766 3597524 3635282 3673041
-7009 3673041 3782379 3891718 4113675 4427255 4843432 5442855 6158714 6874573 7651513 8428454 9190124
-6998 9190124 9768550 9921552 9646983 9124270 8418313 7685634 6952953 6445511 6243477 6242343 6424455
-6987 6424455 6614201 6803947 6963153 7122359 7128860 7135363 7035747 6936131 6744894 6553656 6322334 6091011
-6975 6091011 5859689 5628366 5472918 5317471 5253645 5189820 5177532 5165244 5244578 5323913 5330713 5337513 5435935
-6962 5435935 5534358 5714859 5895359 6075860 6256361 6385801 6515242 6553060 6590878 6481719 6372559 6171777
-6950 6171777 5970995 5720018 5469041 5309686 5150331 4953755 4757179 4468980 4180781 3902604 3624426
-6939 3624426 3392060 3159694 2982682 2805671 2674471 2543271 2353495 2163718 2126646 2089574 2080179 2070784
-6927 2070784 2107200 2143616 2041883 1940150 1884229 1828307 1822014 1815721 1717805 1619890 1641871 1663852 1594210
-6914 1594210 1524569 1452065 1379560 1398678 1417796 1461966 1506137 1596119 1686101 1745542 1804983 1818614 1832244
-6901 1832244 1988914 2145585 2149551 2153518 2199478 2245439 2199777 2154115 2015399 1876683 1783778 1690873 1654278
-6888 1654278 1617683 1581088 1544492 1558510 1572528 1592272 1612016 1622216 1724039 1865946 2007853 2127809
-6876 2127809 2247765 2407806 2659469 2941673 3223877 3502263 3780649 3936037 3938722 3813516 3688311
-6865 3688311 3636595 3584878 3578973 3573067 3527316 3481564 3430086 3378608 3286092 3101952 2917813 2825296 2743098
-6852 2743098 2660901 2492807 2324713 2208158 2091602 1975045 1858490 1812320 1766151 1719982 1673813 1619055
-6840 1619055 1564296 1515264 1466231 1512520 1650431 1782615 1914799 2019306 2123812 2306580 2489347 2665434
-6828 2665434 2627735 2374342 2120949 1942954 1764958 1592689 1420420 1392325 1455852 1473568 1399662 1308577
-6816 1308577 1217491 1273383 1329275 1410936 1492597 1528446 1564296 1550517 1536738 1568770 1600802 1611360 1621918
-6803 1621918 1724098 1826279 1965680 2105082 2231123 2357163 2466979 2363009 2110153 1857297 1710379
-6792 1710379 1655083 1594061 1533039 1542255 1551471 1566414 1581356 1643064 1796394 1984082 2171771 2363277 2463161
-6779 2463161 2391253 2227723 2113821 1999920 1886018 1772116 1742560 1804626 1866691 1837135 1759858 1682582
-6767 1682582 1599579 1516576 1510402 1504228 1538139 1663673 1841698 2019723 2102309 2093272 2040392 1987512 1858281
-6754 1858281 1729049 1720072 1802717 1839551 1784762 1762423 1740084 1763557 1695407 1664478 1633550 1596895 1560240
-6741 1560240 1608646 1657052 1705458 1753864 1794634 1835405 1851361 1775695 1654696 1533696 1483321 1432947 1471331
-6728 1471331 1509716 1548101 1586486 1590721 1594956 1650729 1706502 1712645 1810412 1963533 2116654 2227782 2338910
-6715 2338910 2450038 2561166 2606440 2651714 2702715 2753716 2841700 3021306 3149374 3277443 3369243 3461045
-6703 3461045 3552846 3644647 3607128 3569608 3532088 3494568 3445595 3396623 3347651 3298678 3287017 3275355 3263693
-6690 3263693 3252031 3099119 2946206 2793294 2640381 2557617 2474853 2392088 2309324 2245648 2181971 2118295
-6678 2118295 2054619 2039378 2024137 2008897 1993656 2061449 2129241 2197033 2264825 2349796 2434768 2571276 2707785
-6665 2707785 2934962 3253762 3473303 3479059 3287583 3096107 3068787 3133090 3176395 3219701 3293548 3459017
-6653 3459017 3574380 3689743 3759295 3828846 3830636 3740803 3650970 3652760 3746649 3840538 3884798 3837436 3792937
-6640 3792937 3748438 3744024 3739610 3663139 3586668 3464385 3342103 3251316 3160529 3069742 2978954 3011314 3043674
-6627 3043674 2990139 2844980 2693141 2541303 2460089 2378876 2335838 2292801 2295575 2298348 2222861 2147374 2178780
-6614 2178780 2210186 2251255 2292324 2201685 2111047 2014683 2009941 2091094 2172248 2233837 2295425 2316929 2338433
-6601 2338433 2371390 2495969 2614821 2733674 2725255 2716837 2662608 2608379 2565603 2522826 2586942 2651058 2656479
-6588 2656479 2661900 2799028 2936155 2996931 2966085 2910424 2854763 2758182 2661601 2559294 2548610 2533153 2517696
-6575 2517696 2450702 2475330 2553881 2540811 2447570 2354330 2303083 2251836 2200590 2149343 2095807 2042271 2007823
-6562 2007823 2064998 2109765 2062910 1945429 1919571 2002992 2086412 2120204 2062373 1973047 1883722 1788669 1693617
-6549 1693617 1666804 1639992 1658990 1677989 1729437 1780885 1700626 1620367 1584965 1641185 1645867 1650550 1607512 1564475
-6535 1564475 1521437 1478400 1431254 1384108 1348415 1221100 1138641 1147805 1267679 1387553 1426303 1465053 1549615
-6522 1549615 1634176 1573669 1513161 1471742 1521945 1581214 1548862 1497421 1445980 1438442 1430904 1377554 1324205 1280877
-6508 1280877 1237548 1240031 1242514 1276493 1310470 1304364 1298257 1330200 1453765 1525792 1597819 1555319 1512818 1470318
-6494 1470318 1427817 1350958 1274099 1277410 1372342 1406194 1348423 1271564 1194705 1240606 1286506 1332407 1378307
-6481 1378307 1340221 1302135 1212511 1214509 1255399 1296289 1266553 1236818 1217581 1198344 1224918 1251492 1338700
-6468 1338700 1425908 1406224 1386539 1346812 1307086 1267359 1227632 1180985 1134339 1164045 1193751 1147104 1100458
-6455 1100458 1002274 995713 1021064 1046415 1001141 955866 982172 1008478 1080595 1152711 1196196 1239681 1237355 1235028
-6441 1235028 1213614 1192200 1216596 1240993 1285134 1329275 1327605 1325935 1346216 1366497 1310426 1254355 1238369 1222383
-6427 1222383 1206396 1190410 1181105 1171799 1162494 1153189 1180627 1208067 1235505 1262944 1256025 1249106 1242186 1235267 1199954
-6412 1199954 1164641 1129329 1094016 1115967 1137918 1159869 1181821 1197538 1213256 1228974 1244691 1260409 1276127
-6399 1276127 1291845 1307563 1297273 1286983 1276694 1266404 1265658 1264913 1309978 1446666 1543210 1487049 1333540 1271653
-6385 1271653 1383467 1495281 1526925 1466947 1410071 1353195 1397485 1441775 1440254 1438733 1391401 1344068 1349109
-6372 1349109 1354149 1313378 1272608 1350183 1427757 1505332 1582907 1581505 1580103 1578702 1577300 1619800 1662301 1655173
-6358 1655173 1556422 1481890 1498979 1596239 1693498 1774532 1855567 1860249 1864932 1857684 1850437 1843189 1835942 1857326
-6344 1857326 1878711 1900095 1921480 1857863 1794247 1831796 1869346 1917394 1873820 1719535 1565250 1516904 1560180
-6331 1560180 1628271 1696361 1649924 1603486 1602860 1602233 1657082 1711930 1665611 1619293 1535753 1543836 1601547 1659259
-6317 1659259 1656127 1561373 1466619 1463488 1528118 1592749 1663106 1733463 1740890 1748316 1755743 1763169 1789683 1816198
-6303 1816198 1796901 1777604 1798154 1818703 1738086 1657469 1615983 1666119 1721981 1686220 1652369 1710140 1786999
-6290 1786999 1863858 1832870 1801882 1816705 1831528 1818435 1805341 1752164 1698986 1692573 1777783 1811456 1845128
-6277 1845128 1840475 1835823 1907522 1979221 2068100 2156978 2138964 2120949 2112240 2103532 2100549 2097566 2025867 2045790
-6263 2045790 2121069 2196347 2208993 2221639 2234284 2246930 2354061 2461193 2549236 2545657 2503902 2553769 2683806
-6250 2683806 2813843 2817899 2821955 2826012 2830068 2884200 2938333 2992465 3046597 3093095 3139592 3277711 3415830
-6237 3415830 3591648 3767467 3851662 3935858 3907435 3879012 3697885 3516758 3446341 3375925 3305508 3235091
-6225 3235091 3281111 3327131 3373151 3419171 3368319 3317467 3266616 3215765 3010300 2804836 2690994 2577152
-6213 2577152 2494537 2411922 2329307 2246691 2282422 2318152 2353882 2389613 2439420 2489228 2447413 2405599 2421048
-6200 2421048 2436498 2451947 2467396 2450993 2434589 2509807 2585026 2545717 2506407 2467098 2427789 2423553 2419318 2323461
-6186 2323461 2227603 2135563 2043524 2165269 2287015 2274309 2261604 2248898 2236193 2217761 2199329 2180897 2162466
-6173 2162466 2145465 2128465 2111465 2094465 2054559 2014653 2066370 2118086 2155606 2193126 2139023 2084921 2038453
-6160 2038453 1991986 2098223 2204459 2279439 2354419 2337777 2321135 2293039 2264944 2236849 2208754 2218000 2227246
-6147 2227246 2236491 2245737 2254983 2264229 2273474 2282720 2330858 2378995 2427133 2475270 2531997 2588724 2599640 2610556
-6133 2610556 2681122 2751688 2730631 2709575 2701880 2694185 2732302 2770418 2681599 2592781 2656665 2720551 2804478 2888405
-6119 2888405 2972333 3056261 3021843 2987424 2947280 2907135 2828815 2658873 2546194 2586219 2662034 2737849 2731586
-6106 2731586 2725323 2762962 2800601 2746618 2692634 2577570 2462505 2347440 2232375 2129718 2027060 2016025
-6094 2016025 2004990 1995386 1985783 1930368 1874953 1780408 1685863 1625676 1657111 1694631 1640529 1552068 1463607 1471540
-6080 1471540 1479474 1441596 1403718 1425013 1446308 1467604 1488899 1512102 1535306 1472614 1409922 1400676 1483053 1611240
-6066 1611240 1647806 1588931 1530057 1505541 1572647 1711333 1850019 1948621 2047222 2087605 2127988 2076749 2025509
-6053 2025509 1991390 1957270 1923150 1889030 1787148 1685266 1629195 1573124 1485319 1397515 1401332 1405150 1414694
-6040 1414694 1424238 1347886 1271534 1256383 1332854 1403599 1474344 1484007 1493671 1594956 1696242 1738832 1781422
-6027 1781422 1778201 1774980 1717358 1659736 1697554 1826994 1949247 1979877 1976149 1972421 2000188 2027955 2009911 1991867
-6013 1991867 1933977 1876086 1818196 1760306 1789266 1818226 1847186 1876146 1892102 1908059 1832393 1756727 1800361
-6000 1800361 1843995 1853270 1770923 1687622 1695943 1744349 1701133 1619741 1538348 1603933 1669518 1767941 1866363 1939971
-5986 1939971 1921957 1822819 1723681 1674171 1716284 1781302 1846321 1892251 1846560 1746467 1646374 1681806 1808861
-5973 1808861 1887718 1874953 1919452 1963951 1955003 1946056 1937108 1928161 1906329 1884497 1939017 1993537 2050920 2108304
-5959 2108304 2184775 2352868 2496893 2549296 2582610 2615925 2654011 2692098 2724458 2756818 2873165 2897890 2811904
-5946 2811904 2725919 2707696 2781095 2900306 2927894 2872509 2817124 2832364 2847605 2801764 2755923 2658545 2652788
-5933 2652788 2639874 2626960 2619772 2612584 2646435 2680287 2714138 2747990 2828308 2908627 2857239 2805850 2737282 2760337
-5919 2760337 2869288 2978238 3010121 3042004 3073887 3105770 3118565 3131360 3144155 3156950 3110631 3064313 3119161
-5906 3119161 3174010 3245083 3224533 3158172 3183434 3236612 3289790 3241802 3193813 3110512 3027211 3020262 3013313 2980982
-5892 2980982 2948652 2916322 2883991 2907016 2930041 2901528 2964638 3082626 3200613 3247975 3295337 3333156 3370974
-5879 3370974 3408792 3446610 3506617 3566625 3697259 3827892 3974750 4029986 3999326 3968666 3998610 4028555 3865710
-5866 3865710 3702866 3612556 3613868 3609454 3605040 3592126 3579212 3520486 3461761 3463162 3464564 3465966 3467368 3422959
-5852 3422959 3378549 3358954 3430981 3526869 3622756 3678559 3734361 3831322 3928283 3979433 4030582 4065508 4100433
-5839 4100433 4135358 4170283 4211411 4252540 4404379 4647840 4872213 5004964 4960197 4762726 4502175 4241624
-5827 4241624 3925718 3701434 3576408 3543004 3521053 3407479 3230439 3145020 3053874 2962729 2845815 2820524
-5815 2820524 2850587 2880651 2936364 2992077 2977165 2962252 2920616 2970603 3096942 3131658 3031327 2930996 2931831
-5802 2931831 3085370 3217912 3258832 3253941 3249049 3341745 3434441 3450785 3467129 3442434 3417739 3347233 3276727
-5789 3276727 3203596 3130465 3057334 2984204 2873851 2763499 2708501 2745126 2758130 2771134 2682971 2594808 2523825
-5776 2523825 2452842 2458210 2463579 2526927 2590275 2546731 2503186 2505453 2507720 2515713 2523706 2553590 2675097 2796604
-5762 2796604 2826489 2829650 2832812 2906599 2980386 3051310 3122233 3086264 3050296 3037232 3024169 3011105 2998042 2953722
-5748 2953722 2909402 2865082 2820762 2841342 2861921 2882500 2903079 2950621 2998162 3045703 3093244 3106426 3119609
-5735 3119609 3132791 3145974 3181436 3216898 3252360 3287822 3365277 3442732 3495373 3456392 3377565 3298737 3290536
-5722 3290536 3282334 3226412 3170490 3139383 3199897 3221640 3243382 3194499 3145616 3067147 2988677 2864396 2740116
-5709 2740116 2698868 2657620 2616372 2575124 2510016 2444908 2486693 2528478 2579628 2630778 2636116 2641455 2586666 2531878
-5695 2531878 2477089 2422301 2452215 2482130 2441419 2400708 2441120 2573156 2699464 2825773 2857716 2889658 2875790
-5682 2875790 2861921 2881456 2900992 2920527 2940062 2841968 2743874 2670594 2688936 2759770 2830605 2882351 2842475
-5669 2842475 2756848 2671220 2686759 2702298 2679660 2657023 2634386 2611749 2624902 2638055 2651207 2664360 2650790
-5656 2650790 2637219 2577838 2518457 2461461 2404466 2372284 2431726 2575154 2718582 2757027 2703848 2614403 2616581
-5643 2616581 2637846 2659111 2630748 2602384 2619832 2637279 2602175 2567071 2486156 2405241 2357730 2310219 2369600
-5630 2369600 2428982 2516757 2604531 2686580 2768628 2825863 2791474 2732272 2673069 2668387 2663704 2659022 2654339 2644885
-5616 2644885 2635430 2625976 2616521 2621144 2625767 2630390 2635013 2712170 2789327 2820673 2852019 2822343 2792667 2839343 2886020
-5601 2886020 2910744 2935469 2960194 2984919 2949040 2913160 2831470 2749779 2675724 2601668 2628779 2655890 2691591
-5588 2691591 2635669 2574021 2603994 2696005 2696393 2561255 2426118 2371151 2407806 2499816 2591826 2660930 2730035
-5575 2730035 2692247 2654459 2665553 2676648 2733554 2790461 2788194 2785927 2783660 2781394 2844503 2907613 2970723 3033832
-5561 3033832 3021544 3009256 2996968 2984681 3013193 3041706 3024407 3007109 2958315 2909522 2937080 2964638 2970723
-5548 2970723 2976807 2937080 2897353 2882441 2867528 2898427 2929325 3044301 3159276 3218896 3186894 3120533 3054173
-5535 3054173 3037441 3112332 3155727 3199122 3141351 3083580 3075438 3067296 3104965 3142634 3256535 3370437 3432801
-5522 3432801 3495165 3448727 3310667 3218419 3217793 3290655 3363517 3365754 3367991 3473303 3578615 3689653 3709069
-5509 3709069 3688073 3667076 3686164 3705252 3702389 3699525 3650851 3602177 3583089 3564001 3544913 3525825 3591678 3657532
-5495 3657532 3647033 3636535 3728634 3820734 3888019 3863682 3848889 3834096 3859387 3884679 3966280 4047881 4104668
-5482 4104668 4069832 4038814 4007796 4077945 4148093 4188476 4228859 4168076 4107292 4114272 4212873 4259937 4307001
-5469 4307001 4346906 4386812 4407630 4336825 4236435 4227666 4329608 4431550 4545541 4659532 4754435 4757715 4781039
-5456 4781039 4895984 5010930 5034253 5037056 5131482 5327074 5431044 5371812 5312579 5302975 5384995 5474857 5564720
-5443 5564720 5614497 5664276 5622431 5580587 5584553 5588520 5621596 5654672 5641936 5629201 5656551 5683900 5757061 5830221
-5429 5830221 5846476 5862731 5924797 5986862 6090922 6194981 6299040 6403100 6483776 6564453 6650855 6737259
-5417 6737259 6846567 7047498 7248429 7357737 7390724 7423710 7450970 7478230 7639106 7799982 7960858 8121734
-5405 8121734 8323172 8524610 8726048 8927486 9067842 9208198 9302744 9397288 9399734 9402180 9303459 9204739
-5393 9204739 9048754 8984392 9036466 9180162 9250371 9167875 8984213 8800550 8632158 8555389 8503434 8451479
-5381 8451479 8369013 8286547 8280433 8274318 8226211 8178104 8124269 8162057 8197937 8233816 8229611 8225406 8189705 8154005
-5367 8154005 8118304 8082604 8130652 8178700 8180937 8183173 8110968 8038761 8042907 8047052 8015885 7984718 7953551 7922384
-5353 7922384 7927484 7932584 7937684 7942784 7948809 7954833 7985673 8108134 8236322 8364509 8422072 8479634 8501883 8524133
-5339 8524133 8546382 8568631 8674868 8781105 8887341 8993578 9194181 9394783 9540030 9593656 9633920 9674184
-5327 9674184 9708721 9743259 9788533 9833807 9823726 9722023 9636545 9551066 9536213 9521360 9531084 9540806 9504718
-5314 9504718 9468630 9463082 9457535 9451988 9446440 9495532 9544624 9593716 9642808 9672812 9702816 9809171 9915527 9925728
-5300 9925728 9935928 9970942 10097579 10223261 10348944 10348645 10348347 10397678 10538631 10633772 10728914 10806876 10976462
-5287 10976462 11170861 11365260 11509821 11654383 11798944 11943506 11984039 12024570 12019292 12014013 12002530 11991047
-5275 11991047 12080731 12170415 12145571 12029104 11964175 11899246 11870345 11841445 11812545 11783645 11718477 11653309 11536604
-5262 11536604 11511521 11535113 11558705 11588023 11617340 11619935 11622530 11625125 11627720 11612688 11597656 11582624 11567593 11622232
-5248 11622232 11676871 11737237 11797602 11879443 12052904 12256907 12460910 12660140 12950994 13316291 13773209 14306361
-5236 14306361 14992216 15851772 16711328 17528890 18254829 18734535 18817210 18422207 17752339 17032840 16404965
-5225 16404965 15965106 15677951 15600765 15523578 15465569 15407559 15511796 15707657 15831939 15956219 16153033 16502552
-5213 16502552 16963260 17423965 18048828 18887476 19892192 20896905 21974153 23051402 24003266 24435937
-5203 24435937 24200528 23445926 22414548 21383171 20430055 19690723 19248210 19080563 19052259 19023955 19005196
-5192 19005196 19078059 19271176 19555914 19886972 20370733 21112181 22067415 23105683 24143950 25216576 26289201
-5181 26289201 27089343 27492458 27511903 27378644 27337964 27449987 27600186 27658760 27580024 27348583 26989251 26629920
-5169 26629920 26367938 26197579 26147472 26188990 26401342 26766397 27310882 28008071 28880869 29906372 31071215
-5158 31071215 32449847 33961197 35472547 36737664 37483585 37574791 37146801 36482122 35909067 35634737
-5148 35634737 35574190 35715978 36132632 36795524 37672199 38653859 39635519 40632448 41537753 42196825 42581033
-5137 42581033 42904155 43318902 43840540 44453800 45228832 46217650 47412617 48760288 50258756 51909925
-5127 51909925 53627906 55345884 56990851 58483114 59837947 61101148 62255558 63409961 64638809
-5118 64638809 66020361 67632882 69459180 71407648 73447734 75575626 77856228 80285707 82806811
-5109 82806811 85403437 88091680 90905902 93811749 96797767 99936489 103279454 106714031 110146701
-5100 110146701 113579384 117155218 120883755 124803170 128875301 133018050 137160800 141247178 145241931
-5091 145241931 149078254 152639715 155754518 158411209 160773946 162922887 164829904 166523125 168078909
-5082 168078909 169420923 170430797 170982559 171179276 171040051 170591732 169746367 168454357 166826380 164950274
-5072 164950274 162860373 160522342 157970516 155262173 152401113 149356829 146159828 142792944 139334435
-5063 139334435 135832027 132329631 128924775 125611545 122338412 119065267 115833165 112601062 109460585
-5054 109460585 106320107 103182964 100045828 96964045 93882261 90894959 88060361 85395652 82883641
-5045 82883641 80489623 78187222 75943994 73792391 71716189 69639982 67621039 65602097 63572180
-5036 63572180 61633887 59838752 58196315 56612106 55119515 53686097 52344300 51076527 49808757
-5027 49808757 48638335 47467913 46395796 45323676 44303097 43282516 42256686 41322478 40489435 39656395
-5017 39656395 38788996 37921594 37149636 36469297 35797311 35033704 34230008 33517937 32911803 32305673 31705267
-5006 31705267 31104860 30464845 29824831 29285982 28838757 28357173 27875589 27445544 27015496 26582440 26149382
-4995 26149382 25710596 25363433 24991456 24619479 24253228 23886978 23551745 23216512 22881279 22546046 22257579
-4984 22257579 21969112 21669192 21460895 21250688 20948860 20618398 20287939 20093003 19989689 19834838 19679987
-4973 19679987 19455464 19230942 18960608 18690274 18466706 18243139 18111192 17979247 17914049 17848852 17783654
-4962 17783654 17718458 17698116 17677776 17651709 17717264 17760391 17803518 17760749 17717980 17807872 17897765 17896036 17894305
-4949 17894305 17882077 17869850 17857621 17845392 17764448 17683502 17703723 17815567 18003763 18191959 18233177 18274394
-4937 18274394 18336609 18398824 18420954 18351462 18221873 18092284 18002779 18004897 18123451 18333628 18665967 19089929
-4925 19089929 19559224 20120143 20753595 21539752 22409896 23127335 23562273 23722344 23670657 23405185 23059543
-4914 23059543 22805524 22896997 23324420 24064883 25080215 26329853 27732192 29149803 30353628 31169966
-4904 31169966 31406032 31050369 30175513 29004764 27742390 26609817 25813193 25405964 25395763 25698605 26215234
-4893 26215234 26840185 27373515 27597622 27302531 26493977 25288394 23828938 22369483 21072873 19990046
-4883 19990046 19107645 18377947 17825768 17426292 17158524 16890754 16627281 16272185 15877004 15481823 15179219
-4872 15179219 14876615 14675177 14565361 14506963 14448566 14390170 14423395 14612187 14800979 15005041 15209103 15557757
-4860 15557757 16059114 16703633 17561936 18634025 19919898 21295486 22671074 23923782 24901623 25446168
-4850 25446168 25593682 25577040 25774183 26383626 27512261 29178225 31241218 33350023 35061799 35838262
-4840 35838262 35362553 33672849 31097462 28327439 25893364 23982298 22651508 21805553 21356626 21075676
-4830 21075676 20886347 20785299 20836956 21102399 21581626 22263186 23219615 24481449 26201396 28677702 32161855
-4819 32161855 36974533 43528034 52104861 62727922 74965830 87967251 100249058 109629486 113779800
-4810 113779800 111363863 103183355 91979303 80729445 71403652 64571437 60029780 57167864 55252711
-4801 55252711 53558980 51712545 49751582 47943324 46522073 45742179 45783071 46648563 48101962 49830231
-4791 49830231 51302719 52011688 51651611 50283689 48329765 46223137 44221494 42219851 40258294 38388355
-4781 38388355 36664443 35093232 33793072 32951024 32712158 32931400 33540037 34545708 35904294 37537748
-4771 37537748 39426981 41713243 44889008 49500187 55978177 64441313 74663877 86016461 97422483
-4762 97422483 106965508 112213759 111201141 103755877 91821112 78457975 66163764 56179197 48546266
-4753 48546266 42860312 38548695 35084585 32139666 29627092 27511547 25709045 24181411 22947729
-4744 22947729 21988916 21125543 20353792 19653651 19106213 18650399 18286206 18068990 18004479 18067858 18131235
-4733 18131235 18209406 18195955 17991624 17512426 16840439 16168454 15479287 14790122 14236361 13682601 13342626
-4722 13342626 13002651 12810607 12618565 12518144 12417723 12425627 12433531 12487246 12540961 12642394 12743830 12891076
-4710 12891076 13038321 13146019 13253719 13458765 13663812 13890810 14209429 14577678 14945928 15368101 15942977
-4699 15942977 16729730 17730268 18977042 20559763 22589143 25015555 27866552 31053500 34236631 37022730
-4689 37022730 39047220 40063865 39969587 38867466 37278600 35842438 34860567 34397893 34618570 35969252
-4679 35969252 38671366 42992139 49606691 59550191 73036417 89301858 107468450 126703982 144767509
-4670 144767509 156753417 157483143 145843861 126015827 104385899 85435914 70547854 59412489
-4662 59412489 51361743 45624581 41444998 38284714 35887948 34034239 32577555 31370927 30439164 29610479
-4652 29610479 28781790 27943562 27258034 26733800 26423352 26410675 26856112 27774871 29090659 30738578 32661364
-4641 32661364 34702496 36407680 37272993 37130458 35972443 33928747 31394488 28860232 26652379 24780474
-4631 24780474 23070817 21574946 20334972 19308785 18486838 17817595 17167441 16517286 15916761 15407856
-4621 15407856 15053089 14698321 14349278 14000237 13714187 13428134 13090546 12844578 12713349 12582119 12364993
-4610 12364993 12147867 11967963 11788058 11653965 11519873 11464040 11408207 11352375 11296543 11214942 11133341 11091824
-4598 11091824 11141931 11242620 11343308 11297020 11250732 11240710 11230690 11186310 11050308 10916215 10873744 10926713
-4586 10926713 10979683 10988749 10997816 11006883 11015950 11047236 11078522 11161347 11152548 11099848 11047147 11080342 11113537 11065131
-4572 11065131 11016725 11008404 11091705 11178824 11265943 11324429 11291294 11217357 11235044 11357714 11572006 11730944 11889881
-4559 11889881 11957196 12024511 11979206 11842281 11705354 11660050 11620472 11580894 11455421 11329947 11278171 11226395
-4547 11226395 11266241 11306087 11338298 11370509 11402720 11434931 11446861 11458790 11470721 11482651 11540392 11598133 11564252
-4534 11564252 11530371 11653131 11775890 11864291 11861070 11871211 11972973 12069009 12073424 12072350 12071276 12064476 12057676 12108140
-4520 12108140 12158604 12209068 12259532 12394609 12529687 12664764 12799841 12913921 13028002 13050460 13072918 13171490
-4508 13171490 13270063 13368633 13467206 13514239 13561274 13699930 13838587 14063258 14287929 14594678 14901429 15135644
-4496 15135644 15217156 15166960 15025143 14973277 15013034 15142505 15271975 15414807 15466015 15290078 15022518 14806108
-4484 14806108 14681321 14651972 14622625 14601866 14581109 14651972 14722837 14801336 14879835 14912524 14945212 14883414 14821616
-4471 14821616 14759820 14698022 14684780 14671538 14658295 14645053 14707208 14769363 14837245 14813505 14802171 14790838 14865399
-4458 14865399 14939963 15009753 15079544 15149334 15219124 15370845 15522563 15674284 15826003 16004446 16182888 16361332
-4446 16361332 16539775 16852311 17164847 17477383 17789919 17961202 18132487 18151069 18169650 18002481 17835311
-4435 17835311 17759764 17684218 17778555 17872891 17967228 18061563 18113429 18165295 18308783 18452271 18619619 18786968
-4423 18786968 18908504 19030041 19269952 19509864 19749777 19989689 20085486 20181285 20277082 20372880 20520693 20668506
-4411 20668506 20816318 20964131 21100491 21236850 21525913 21814977 22023513 22232049 22348963 22465878 22553205
-4400 22553205 22640533 22727860 22815188 22884382 22953575 22976958 23000341 23070490 23140637 23302409 23464179 23574651
-4388 23574651 23685122 23795594 23906066 23987905 24069746 24243207 24416670 24657894 24899119 25231965 25564811
-4377 25564811 25996917 26429018 26964199 27499377 28130474 28944815 30098922 31680601 33899816 36790931
-4367 36790931 40390209 44539220 48938283 53245731 56745748 58474405 57708262 54559937 50014371 45285559
-4357 45285559 41110392 37729282 35096426 33135463 31594436 30480980 29651937 29006136 28468183 28021852
-4347 28021852 27697682 27465137 27275541 27085942 27054776 27023611 26973711 26923814 26919730 26915643 26806574 26697502
-4335 26697502 26680055 26662608 26670452 26678296 26640328 26602360 26645517 26688673 26731830 26774987 26875737 26976486 27077236
-4322 27077236 27177982 27308318 27438653 27517450 27687871 27877858 28067841 28217741 28367641 28591987 28816329
-4311 28816329 28887968 28959609 29064770 29169934 29229286 29288637 29377575 29466513 29601263 29736013 29944249 30152487
-4299 30152487 30314914 30477340 30764794 31052248 31303433 31554620 31859817 32317721 32832887 33256432 33568311
-4288 33568311 33880191 34277966 34675744 35045840 35415939 35871933 36327926 36778194 37136839 37455402 37773962
-4277 37773962 38086081 38398197 38618694 38839192 39031053 39222918 39374696 39526478 39823085 40211317 40593822
-4266 40593822 40976327 41329247 41682166 42080897 42479625 42957185 43434742 43912298 44389858 44856915 45323974
-4255 45323974 45781491 46239005 46567916 46744121 46798165 46852208 46877619 46994651 47222395 47541760 47976012
-4244 47976012 48410264 48855969 49301671 49764555 50319061 50990005 51752568 52617733 53574523 54577116 55579716
-4233 55579716 56490690 57401658 58400438 59796250 61725952 64235937 67417810 71546451 76786017 83155590
-4223 83155590 90510097 98505965 106559565 113605323 118528507 120550307 119346246 115301892 109428906
-4214 109428906 103097815 97328744 92689678 89535658 88244623 89095262 91747806 95621980 100503996
-4205 100503996 106180555 111337911 113670253 111574185 105671975 98456516 92109554 87503413 84422762
-4196 84422762 82502656 81733561 81880690 82777971 84347152 86550055 89302695 92349761 95580076 98825658
-4186 98825658 101887996 104555216 106917015 109370445 112373611 116141379 120336700 124333517 127291954
-4177 127291954 128681340 128177215 125978069 122740542 119288741 116631018 115416335 115973019 118469039 122736426
-4167 122736426 128370508 134676497 140559023 145036682 147162692 146295705 142458639 136483708 129630739
-4158 129630739 122961008 117287671 112774885 109422638 107108798 105524110 104489153 103874134 103686681 103750598
-4148 103750598 104119916 104657218 105499920 106609845 108147355 110089536 112337113 115004149 118220922 122063777
-4138 122063777 126578539 131841540 137776448 144513036 151799372 159408799 167201463 175053305 182996773
-4129 182996773 191163563 199757931 209278063 220080903 232425583 246052959 260718742 276178589 292138521
-4120 292138521 308403861 324951728 341927135 358798407 373776167 384249133 388919380 388653441 385883201
-4111 385883201 382899152 380709143 379280778 378035637 376133869 372582930 366791034 358494786 347396456
-4102 347396456 333427273 316602972 297640817 277489478 257246514 237860620 219879580 203591661
-4094 203591661 188952938 175767287 163986515 153465546 143982959 135443326 127819916 120960013 114772016
-4085 114772016 109138891 104055496 99430212 95232493 91508159 88089233 85067338 82350852 79976511
-4076 79976511 77785420 75747032 74014052 72548307 71265799 70221900 69605566 69549880 70196634 71776790
-4066 71776790 74792366 79716740 86626256 95070457 104522499 114264669 122754676 127503433 126296755
-4057 126296755 118909367 107460068 95086919 84027013 75101027 68282349 63173958 59378816 56461730
-4048 56461730 54185993 52398903 50947774 49726647 48658227 47742510 46918419 46023699 45037357 44016657
-4038 44016657 42995956 42058290 41120621 40223041 39417079 38710376 38003672 37302698 36601722 35853501 35105283
-4027 35105283 34519312 34024963 33578333 33131703 32776698 32421693 32020038 31526762 31085025 30643287 30228273
-4016 30228273 29813258 29438330 29155020 28942817 28730613 28529860 28329107 28111177 27984869 27892917 27800968
-4005 27800968 27636185 27379780 27129099 26970042 26854888 26831356 26924261 27108788 27312883 27516975 27650441
-3994 27650441 27631204 27421087 27058266 26619093 26179921 25697085 25214249 24771497 24420368 24105505 23790643
-3983 23790643 23487233 23183824 23011168 22930133 22849099 22676442 22417890 22159336 22047761 21936186 21793771
-3972 21793771 21651358 21508943 21366528 21268017 21169505 21065268 20961029 20811934 20571216 20382037 20192856
-3961 20192856 20062849 19932842 19888731 19844620 19743364 19550487 19409146 19420510 19441416 19370701 19208365 19046026
-3949 19046026 18968153 18890280 18665429 18440579 18328348 18307739 18235592 18163445 18063533 17963619 17863705 17763792
-3937 17763792 17621884 17479977 17338070 17196162 17134902 17073642 17018107 16962574 17067377 17263806 17460233 17565038
-3925 17565038 17536824 17508608 17468942 17429275 17221632 16922368 16623106 16415463 16170123 15924783 15685169 15445556
-3913 15445556 15359601 15273644 15187689 15101733 15006233 14910734 14769423 14628113 14511617 14395121 14354975 14314831
-3901 14314831 14251304 14187777 14124250 14060722 14036326 14011928 13987532 13963134 13847354 13731574 13615794 13500012
-3889 13500012 13433861 13367710 13301557 13235406 13132987 13030566 12928148 12825729 12733808 12641888 12549967 12458047
-3877 12458047 12337942 12217836 12208441 12290669 12338538 12294785 12201403 12108021 12061404 12014788 11968172 11921555 11868258
-3864 11868258 11814961 11761664 11708366 11694200 11680033 11665866 11651699 11680480 11709261 11661690 11614119 11580864 11547609
-3851 11547609 11514355 11481100 11410624 11340147 11346022 11351898 11235700 11119502 11114014 11200149 11261468 11231166 11151235
-3838 11151235 11071304 10997100 10922896 10919316 10915737 10931247 10855133 10693124 10531115 10486377 10441640 10356817 10271995
-3825 10271995 10148997 10117621 10166415 10215209 10271637 10236444 10145896 10055347 10031606 10007865 10029936 10052006 9960145
-3812 9960145 9868285 9770697 9764732 9808396 9852060 9825098 9798136 9786445 9774754 9661896 9549038 9512532 9567649
-3799 9567649 9571228 9574807 9574210 9573613 9573017 9572421 9583277 9594133 9604990 9615846 9586140 9556435 9526729 9497023 9478771
-3784 9478771 9460517 9442265 9424012 9380228 9336445 9286936 9237426 9220367 9111685 8957191 8894320 9008013 9121706
-3771 9121706 9160956 9108583 8997992 8979023 9009684 9040343 9055256 9070168 9085080 9099993 8999424 8898854 8823098
-3758 8823098 8838965 8846719 8854474 8791603 8728732 8713581 8698430 8759631 8820832 8888504 8956177 8916957 8877738 8861423
-3744 8861423 8845109 8758169 8671229 8621988 8664369 8701025 8737679 8661715 8585751 8586139 8586526 8587630 8588733 8544026
-3730 8544026 8499318 8561503 8623688 8584707 8545726 8480976 8507848 8559535 8611222 8582739 8554256 8479962 8405668
-3717 8405668 8395974 8386282 8422400 8458517 8454551 8450584 8446617 8442650 8425800 8408949 8392097 8375246 8376528 8377811 8379094
-3702 8379094 8380377 8405042 8429707 8322665 8215623 8179206 8234413 8314433 8394454 8401701 8408949 8416196 8423444 8435463
-3688 8435463 8447483 8459502 8471522 8400449 8329376 8258303 8187230 8188691 8190153 8191614 8193075 8190481 8187886 8185291 8182697
-3673 8182697 8132382 8082067 8108104 8134141 8103153 8072165 8148070 8223974 8235934 8247893 8214042 8180191 8168530
-3660 8168530 8156868 8145207 8133545 8213505 8293466 8205453 8117439 8121764 8126089 8130413 8134737 8155287 8175837 8196386
-3646 8196386 8216936 8188094 8159254 8130413 8101572 8137631 8173689 8209747 8245806 8291408 8337011 8382613 8428215
-3633 8428215 8441368 8454521 8513485 8572449 8549573 8526698 8580173 8633650 8704305 8774960 8769264 8763568 8689184 8614800
-3619 8614800 8586228 8557656 8498543 8439429 8380317 8321204 8314583 8307961 8301340 8294719 8288098 8281476 8274855 8268235 8279508
-3604 8279508 8290782 8302056 8313330 8355144 8396959 8484585 8572211 8649099 8725988 8665443 8604898 8596846 8588793 8580741
-3590 8580741 8572688 8461858 8351029 8347092 8343155 8369759 8396362 8422966 8449570 8444202 8438833 8479276 8519718 8553480
-3576 8553480 8587242 8544652 8502062 8566484 8630906 8618976 8607046 8560757 8514469 8468181 8421893 8463886 8505880
-3563 8505880 8547873 8589867 8602274 8614681 8627089 8639496 8609790 8580085 8504567 8429051 8382165 8335281 8420103
-3550 8420103 8504925 8559923 8523297 8483809 8535943 8659658 8737560 8740065 8742571 8759750 8776929 8794108 8811288
-3537 8811288 8876186 8941086 8950630 8868552 8822263 8775975 8723960 8671945 8609432 8546919 8530217 8513515 8570839
-3524 8570839 8628162 8609133 8590105 8591119 8592134 8638959 8685784 8693479 8701174 8708868 8716564 8727122 8737679 8748237
-3510 8748237 8758795 8717995 8677194 8636393 8595593 8589151 8582709 8576266 8569825 8510413 8451002 8391591 8332179 8302354
-3496 8302354 8272529 8242704 8212879 8261494 8310108 8282372 8254634 8269845 8285056 8300266 8315477 8339516 8363555
-3483 8363555 8387594 8411633 8404176 8396720 8392127 8387534 8426307 8510890 8547754 8492995 8409605 8372025 8379303 8386580
-3469 8386580 8360215 8333849 8307484 8281118 8336832 8392545 8371906 8351267 8302891 8254514 8206138 8157762 8163787
-3456 8163787 8169812 8126207 7990981 7860765 7822172 7831299 7794613 7732160 7715518 7772364 7783400 7732160 7680921
-3443 7680921 7727985 7775049 7789663 7712655 7658552 7650261 7645787 7595502 7562396 7620913 7693746 7674956 7550228
-3430 7550228 7471311 7549571 7627832 7663145 7698458 7770992 7843527 7860706 7786263 7742838 7699413 7650261 7601110
-3417 7601110 7572000 7542891 7590134 7637376 7667082 7696788 7680683 7664577 7698100 7731623 7765147 7798670 7779701
-3404 7779701 7760732 7741764 7722795 7684738 7646682 7608625 7570568 7556103 7541638 7521447 7501255 7443842 7294807
-3391 7294807 7145772 7088358 7176014 7263669 7301696 7248101 7180189 7112278 7044366 6976455 6932821 6980809 7028798
-3378 7028798 6985164 6902400 6819635 6736871 6654107 6603792 6645100 6741762 6838425 6808152 6777880 6747608 6717335
-3365 6717335 6704869 6692402 6685662 6678921 6641640 6695981 6744595 6793211 6755213 6717217 6755571 6793926 6787424 6780922
-3351 6780922 6774421 6767919 6759926 6751932 6673314 6594695 6580976 6658879 6736781 6723062 6638478 6553895 6570478 6587060
-3337 6587060 6574057 6561052 6446883 6332713 6206225 6171360 6161309 6151257 6098258 6045259 6154508 6263757
-3325 6263757 6259910 6164440 6068970 6065123 6071774 6078425 6090802 6103179 6104581 6105983 6107385 6108787 6148365 6187943 6233247
-3310 6233247 6186929 6111024 6035119 6060381 6085643 6135718 6185795 6165246 6144696 6109503 6165932 6268172 6278789
-3297 6278789 6206375 6133959 6162710 6191462 6170107 6148753 6127398 6106043 6049376 5992708 5936040 5879373 5819365
-3284 5819365 5759358 5699349 5639342 5666184 5693027 5771407 5758165 5692430 5626696 5631587 5636479 5586969 5537460 5487950
-3270 5487950 5438441 5430209 5421977 5413746 5405514 5521354 5637194 5697680 5666542 5599615 5532688 5419949 5307211
-3257 5307211 5252691 5289793 5351710 5413627 5452160 5490694 5529228 5567762 5578618 5589474 5581243 5481389 5402054
-3244 5402054 5414342 5531614 5648886 5614408 5488308 5362208 5327730 5418220 5508708 5580109 5559888 5453771
-3232 5453771 5347654 5373243 5398833 5340197 5281561 5222925 5164290 5125696 5087103 5048509 5009915 4996494 4983073
-3219 4983073 4969652 4956231 4942809 4929388 4915967 4902546 4904633 4906721 4908809 4910896 4886261 4861626 4836990 4812355
-3205 4812355 4839883 4867412 4894940 4922469 4871736 4821004 4764545 4799709 4901203 5002698 5029749 4965178 4892972
-3192 4892972 4912388 4950892 4989396 4927688 4865980 4880624 4895268 4826880 4758491 4735913 4713336 4784767 4856198
-3179 4856198 4927628 4999059 4955008 4910956 4866905 4822853 4832994 4843134 4853275 4863415 4784797 4706178 4719182
-3166 4719182 4732185 4783842 4835499 4841345 4847190 4759505 4671820 4736838 4801856 4798993 4796130 4839078 4882026 4958378
-3152 4958378 5034730 5019459 5004189 4934279 4864370 4947164 5029958 5046898 5063839 5034969 5006098 5028347 5050597
-3139 5050597 5072846 5095095 5166019 5236943 5307867 5378791 5407005 5435219 5371812 5308404 5303214 5298025 5338646 5379268
-3125 5379268 5293193 5207118 5212666 5218213 5165542 5112871 5151823 5190774 5195845 5200915 5205985 5211055 5145500 5079944
-3111 5079944 5106012 5132078 5183169 5234259 5193727 5153195 5102164 5051134 5045914 5040695 5035476 5030256 5025037 5019817
-3097 5019817 5033686 5047554 5015612 4983670 4946001 4908332 5023366 5138401 5163723 5189044 5168555 5148065 5174340
-3084 5174340 5200617 5226892 5253168 5411151 5569134 5635494 5701855 5641549 5581243 5566748 5552253 5532032 5511810
-3071 5511810 5537400 5562990 5612917 5662844 5621149 5579453 5504354 5429255 5354155 5279056 5315979 5352903 5389826
-3058 5389826 5426749 5396865 5366980 5337095 5307211 5258238 5209266 5251915 5294565 5314309 5334053 5399609 5465164
-3045 5465164 5479778 5494392 5463195 5431999 5384577 5337155 5335544 5333934 5350934 5367934 5384935 5401935 5335902 5269870
-3031 5269870 5295460 5321050 5363461 5405872 5448283 5490694 5478704 5466715 5546348 5625980 5676981 5727981 5824794
-3018 5824794 5921605 6014600 6107594 6200588 6293582 6329849 6366117 6356573 6347029 6368025 6389022 6318397 6247771 6197665
-3004 6197665 6147559 6143264 6138970 6158535 6178100 6197665 6217231 6178935 6140640 6193967 6247294 6329253 6411212 6493171
-2990 6493171 6575131 6618436 6661742 6705048 6748354 6813611 6878867 6944125 7009382 7104583 7199785 7340797 7481809
-2977 7481809 7675314 7868818 7970700 8072582 8231251 8389921 8548589 8707258 8906966 9106674 9306382
-2966 9306382 9506090 9788234 10070378 10306712 10543045 10766016 10988988 11364663 11740339 12197615 12654892
-2955 12654892 13066357 13477823 14034357 14590892 15239047 15887203 16436072 16984942 17493725 18002510 18615324
-2944 18615324 19319760 20167356 21167656 22240968 23405900 24607102 25808303 26831985 27641880 28216995
-2934 28216995 28578325 28630789 28408382 27991281 27574177 27049229 26524281 26066139 25760703 25447629 25134557
-2923 25134557 24785217 24435877 24192475 23949073 23659860 23370648 23138818 22906989 22720970 22534952 22387109
-2912 22387109 22239267 22167776 22096286 22219493 22342700 22572801 22802899 23171387 23539875 23919816 24299755
-2901 24299755 24782651 25448792 26324901 27506415 29028652 30734135 32531240 34145098 35297981 35901132
-2891 35901132 36088163 36275198 36754274 37783087 39563968 42138905 45459917 49208498 53056340 56720935
-2881 56720935 59457855 60545572 59571788 56826637 53124221 49116401 45146753 41482520 38476817 36143012
-2871 36143012 34336037 32956631 31953855 31134326 30457955 29873208 29415392 29140823 28866257 28500066
-2861 28500066 28078520 27656973 27229700 26802427 26297851 25793272 25431852 25070432 24861777 24744744 24732695
-2850 24732695 24903890 25061724 25219557 25312492 25405428 25438711 25471996 25257137 25042278 24991576 25124117 25483807
-2838 25483807 25935118 26382254 26829389 27205901 27582409 27978009 28373607 28782568 29283150 29988928 31000114
-2827 31000114 32133461 33358433 34568136 35594591 36348089 36674018 36569061 36036536 35286409 34536281
-2817 34536281 33868232 33383426 33013151 32826119 32832827 32839539 32811891 32784243 32643977 32503711 32226008 31948308
-2805 31948308 31647107 31345903 31126781 30907656 30906136 30996235 31141692 31470393 31978520 32669894 33462433
-2794 33462433 34254972 35102866 35859139 36376810 36589076 36495812 36097143 35530498 34963853 34480239 33996629
-2783 33996629 33650450 33304270 32980522 32656771 32292936 32020724 31974704 32111930 32319779 32527631 32667717
-2772 32667717 32807804 33024245 33240684 33489575 33738462 33758298 33778130 33895313 34012497 34267111 34521728
-2761 34521728 34762980 35004234 35058429 34929374 34617374 34305378 33844492 33383605 32855913 32328221 31949413
-2750 31949413 31570604 31239040 31090723 31053113 31107125 31239399 31463295 31767362 32254672 32784095 33313518
-2739 33313518 33747502 34181483 34499030 34816577 35067315 35226431 35200394 34991114 34680665 34370217 34094125
-2728 34094125 33818036 33618299 33418562 33176710 32934861 32757907 32764200 32833485 32902767 32937692 32972618 33053353
-2716 33053353 33134091 33144201 32971067 32600373 32138055 31658561 31270684 30884482 30406655 29888745 29462457
-2705 29462457 29119201 28775944 28331523 27887102 27319563 26752024 26016510 25280998 24717276 24153553 23696724
-2694 23696724 23239895 22953874 22667852 22305479 21943105 21575959 21208815 20918021 20627227 20231927 19836627
-2683 19836627 19441327 19046026 18762391 18478755 18118769 17758781 17534318 17309854 17192285 17074715 17001047
-2672 17001047 16927379 16777361 16627341 16503567 16379793 16393452 16407112 16414091 16421070 16428051 16435029 16393364 16351699
-2659 16351699 16355844 16359990 16421399 16482808 16504133 16433835 16360676 16287514 16254439 16221363 16074713 15928065 15781415
-2646 15781415 15634765 15414627 15194489 15014436 14926005 14843300 14760596 14677891 14595186 14561394 14435981 14209400
-2634 14209400 13982820 13885083 13787346 13649525 13420081 13170654 12921229 12711887 12502545 12234032 11965517
-2623 11965517 11788625 11611733 11426491 11241248 11010193 10779139 10645434 10511728 10337939 10164148 10006703
-2612 10006703 9940879 9915140 9889400 9838847 9788294 9783552 9778810 9760706 9742602 9724499 9706395 9687337 9668278
-2599 9668278 9551871 9435464 9343216 9159345 8935389 8711433 8670722 8630011 8493861 8266087 8057402 7940338
-2587 7940338 7857634 7774929 7678863 7582796 7486730 7390664 7266205 7141745 7023012 6904279 6861897 6911138
-2575 6911138 6960379 6917998 6830521 6743045 6655568 6568091 6488250 6500031 6511812 6431970 6342764 6253557 6164350
-2562 6164350 6075144 5938218 5892914 5853336 5722136 5537728 5444942 5447597 5450251 5448134 5446016 5455352 5373064 5278251
-2548 5278251 5275059 5306227 5337394 5226355 5115317 5044363 5065032 5060409 5055786 4965268 4874749 4855810 4836871
-2535 4836871 4772121 4707371 4677069 4646767 4616464 4586162 4558723 4531284 4561109 4499312 4441094 4474497 4502175
-2522 4502175 4438230 4431550 4424869 4412462 4400054 4355735 4311415 4267095 4222775 4155549 4088324 4112721 4137118 4143142
-2508 4143142 4149167 4063569 3977971 3991631 4005291 3978866 3952441 3905825 3950830 3955752 3869051 3719359 3661290
-2495 3661290 3759742 3858194 3848800 3839405 3744114 3648823 3524900 3492600 3561466 3630331 3740773 3851215 3921572
-2482 3921572 3900307 3903856 3907405 3905228 3903051 3865084 3827117 3789149 3751182 3694127 3637072 3671639 3706206 3751510
-2468 3751510 3796815 3746679 3604920 3519472 3525646 3566178 3606710 3622905 3639100 3666748 3602773 3451948 3392746
-2455 3392746 3484338 3575931 3649509 3631465 3517981 3404497 3308192 3303509 3390449 3385767 3321434 3257102 3278665
-2442 3278665 3300229 3336108 3371988 3413594 3363577 3228529 3093482 3166494 3239505 3208487 3177469 3180809 3275772
-2429 3275772 3319675 3271955 3281499 3291043 3300587 3310131 3319675 3329219 3312099 3294980 3277860 3260740 3259846 3258951 3212245
-2414 3212245 3165539 3234316 3303092 3276428 3158143 3036994 3007467 3073380 3139293 3125932 3112570 3099209 3085847
-2401 3085847 3173652 3261456 3196557 3131658 3069622 3007586 3037173 3066759 3035264 3003769 2972273 2940778 2981340
-2388 2981340 3021902 3062464 3103026 3143588 3184150 3224712 3265274 3221849 3178424 3134998 3091573 3053874 3016176
-2375 3016176 2978477 2940778 3001472 3062166 3031237 3000309 2940748 2881188 2913250 2945312 2856403 2767495 2770209
-2362 2770209 2772923 2792816 2812710 2832603 2852496 2807073 2761649 2807848 2854047 2842982 2831917 2820852 2809787
-2349 2809787 2799438 2789088 2687117 2585145 2597702 2610258 2622814 2635371 2619683 2603994 2679929 2755863 2715361
-2336 2715361 2674859 2634357 2593854 2588187 2582521 2576854 2571187 2548341 2525495 2502649 2479803 2425224 2370644 2468768
-2322 2468768 2566892 2544762 2522632 2500502 2478372 2503962 2529551 2555141 2580731 2505155 2429578 2445624 2461670
-2309 2461670 2469245 2476821 2484397 2491972 2493821 2495670 2497519 2499369 2484993 2470617 2456242 2441866 2534383 2626900 2627795
-2294 2627795 2628690 2583535 2538380 2584847 2631314 2555619 2479923 2404227 2328531 2317734 2306938 2296141 2285345 2324177
-2280 2324177 2363009 2401841 2440673 2412548 2384423 2356298 2328173 2296231 2264288 2323968 2383648 2321164 2258681
-2267 2258681 2236283 2305506 2304105 2302703 2307027 2311352 2304105 2296857 2289610 2282362 2223577 2164792 2054469 2035769 2102488
-2252 2102488 2169206 2241651 2314096 2291101 2268106 2245111 2222116 2230556 2238997 2247437 2255877 2134520 2013162 2044508
-2238 2044508 2075854 2042540 2009225 2010269 2102935 2245230 2295903 2195780 2095658 2018560 2033085 2087694 2142304
-2225 2142304 2151102 2159901 2168699 2177497 2044806 1912115 1935945 2051398 2111495 2079970 2105709 2131448 2142393
-2212 2142393 2153339 2158559 2163778 2174724 2094047 2013371 2024316 2119727 2215137 2163569 2112002 2035620 1959238 1882856
-2198 1882856 1806475 1852972 1899469 1945966 1992463 2027508 2062552 2097596 2132641 2128793 2124946 2121098 2117251 2128674
-2184 2128674 2140097 2059898 1979698 1935050 1890402 1937377 1984351 2031325 2078300 2033652 1989004 1938868 1888732
-2171 1888732 1924492 1960252 1938749 1825622 1804119 1874237 1949605 2024973 2014444 2003916 2041108 2078300 2109765
-2158 2109765 2141230 2225188 2217523 2108691 1999860 2020827 2041794 2062761 2083728 2040332 1996937 1953542 1910146
-2145 1910146 1885839 1861532 1928847 1996162 2059659 2123156 2033950 1944743 1954794 1964845 1883274 1801703 1795171
-2132 1795171 1788639 1873730 1958821 1927475 1896129 1864783 1833437 1772743 1712049 1742977 1773906 1883095 1992284
-2119 1992284 2009851 2027418 1945370 1863321 1872895 1882469 1886316 1890164 1802389 1714614 1723949 1733284 1742620 1751955 1767016
-2104 1767016 1782078 1797140 1812201 1784315 1756429 1728542 1700656 1766301 1831945 1805968 1779990 1765227 1750463
-2091 1750463 1735700 1720937 1700447 1679957 1659468 1638978 1665462 1691947 1718432 1744916 1746586 1748256 1749927 1751597
-2077 1751597 1769015 1786432 1712228 1638023 1693617 1749211 1713182 1677154 1664508 1651862 1639216 1626571 1608198
-2064 1608198 1589826 1571454 1553082 1591258 1629434 1667610 1705786 1711512 1717238 1722965 1728691 1803224 1877756 1860667
-2050 1860667 1843577 1797855 1752134 1706412 1660690 1630239 1599788 1569337 1538885 1586695 1634504 1682313 1730123
-2037 1730123 1621053 1511983 1494535 1477088 1509269 1541450 1573631 1605812 1544940 1484067 1514816 1545566 1574407
-2024 1574407 1603247 1632088 1660929 1634832 1608735 1582638 1556541 1534262 1511983 1636681 1761379 1827144 1801285
-2011 1801285 1735342 1669399 1613000 1556601 1540287 1615595 1669668 1723740 1783539 1843339 1826786 1810233 1793680
-1998 1793680 1777127 1723353 1669578 1655888 1733821 1786940 1840058 1807280 1774502 1742575 1710647 1678720 1646792
-1985 1646792 1614864 1582937 1551009 1519081 1450171 1381260 1346708 1403778 1449395 1403390 1363112 1414455 1489778
-1972 1489778 1565101 1646151 1727200 1651728 1576256 1535142 1585651 1602755 1528238 1459446 1482277 1581460 1680643
-1959 1680643 1632849 1585054 1551919 1518783 1485647 1452512 1459461 1466410 1467633 1468856 1516129 1471779 1478967 1486155
-1945 1486155 1479981 1473807 1416096 1450007 1568621 1687235 1603516 1519797 1525792 1623409 1721026 1727021 1670503 1613984
-1931 1613984 1551740 1489495 1469244 1448993 1428741 1408490 1416469 1424447 1432425 1440403 1442655 1444907 1447158 1449410 1498666
-1916 1498666 1547922 1505556 1463189 1453273 1443356 1433439 1423522 1409430 1395337 1381245 1367153 1387419 1407685 1427951
-1902 1427951 1448217 1439613 1431008 1422404 1413799 1348885 1283971 1310679 1337388 1368853 1400318 1355432 1310545 1244662
-1888 1244662 1178778 1189247 1199715 1217581 1235446 1253311 1271176 1305266 1339356 1373446 1407536 1432500 1457463
-1875 1457463 1482426 1507390 1473181 1438971 1393309 1439270 1487616 1444340 1330438 1308159 1373685 1439210 1373029
-1862 1373029 1306847 1259306 1211765 1210035 1208305 1290562 1372820 1378725 1384630 1334226 1283822 1279229 1274636 1352121
-1848 1352121 1429606 1482277 1443326 1375802 1308278 1229302 1241948 1307086 1372223 1443087 1513951 1557138 1600325
-1835 1600325 1536618 1472912 1439747 1406582 1373416 1340251 1376160 1412069 1402167 1392266 1473986 1555706 1582072 1516815
-1821 1516815 1476849 1436884 1391192 1345500 1362798 1380097 1397395 1414694 1446547 1478400 1464442 1450484 1409803
-1808 1409803 1369121 1328440 1287759 1310784 1333809 1311022 1288236 1258769 1229302 1245646 1261990 1319582 1377174
-1795 1377174 1333600 1290026 1246451 1294499 1388358 1390595 1295484 1200372 1179703 1250657 1306340 1270401 1194377
-1782 1194377 1209975 1257546 1305117 1251521 1197926 1194914 1191901 1188889 1185877 1245855 1305833 1264645 1223456 1207082
-1768 1207082 1282331 1306041 1329752 1362023 1394294 1438017 1390118 1273503 1248509 1328500 1408490 1402108 1304103
-1755 1304103 1206098 1199715 1233418 1267120 1199656 1132192 1147880 1163568 1179256 1194943 1203951 1212958 1221965 1230972
-1741 1230972 1221846 1212719 1203593 1194466 1185340 1176213 1167087 1157961 1129537 1101114 1072691 1044268 1104604 1164940 1225275
-1726 1225275 1285612 1280332 1275053 1168608 1062163 964307 958074 946114 934154 898215 862276 881692 992730
-1713 992730 1098997 1205263 1179822 1154382 1141825 1129269 1116713 1104156 1111642 1119128 1080803 1042478 1016038
-1700 1016038 989599 1008970 1028341 1044849 1061358 1032054 1002751 1075569 1148387 1221204 1294022 1261856 1229690
-1687 1229690 1197523 1165357 1219683 1274010 1227169 1180329 1208887 1329066 1378621 1336552 1240322 1235714 1219654
-1674 1219654 1203593 1172262 1140930 1185951 1230972 1254146 1277320 1224142 1170964 1168369 1165775 1163180 1160585 1126734
-1660 1126734 1092882 1104842 1116802 1167892 1218982 1199447 1179912 1131386 1174484 1211854 1249225 1256055 1262885 1250627
-1646 1250627 1146746 1051933 1048741 1095179 1141617 1097386 1053155 1085277 1117399 1134175 1150952 1167728 1184505
-1633 1184505 1186965 1189426 1186160 1182894 1212078 1149639 1138738 1127837 1076851 1025866 974880 923894 968706 1013518
-1619 1013518 1058330 1103142 1067785 1032427 997070 961712 941148 920583 900019 879455 879887 880320 880752 881185 977251
-1604 977251 1073317 1129299 1093658 1113372 1133086 1147074 1161062 1191275 1221488 1217342 1121574 1065891 1101830 1137769
-1590 1137769 1082086 1024852 1059240 1179524 1208186 1168131 1128076 1082295 1036513 978086 919659 952854 986049
-1577 986049 1006837 1027625 1048413 1069201 1083040 1096879 1064907 1032934 975193 917452 951333 985214 1037468
-1564 1037468 1089721 1141974 1194228 1219758 1245288 1265092 1284896 1295513 1214509 1093419 972330 1021124 1069917
-1551 1069917 1084353 1007166 922820 930098 971733 1013369 1051187 1089005 1081012 1073019 1077612 1082205 1132609 1183013
-1537 1183013 1173291 1163568 1108034 1052499 1034664 1016829 1004720 992611 988137 1075286 1110897 1146508 1162673 1178838
-1523 1178838 1206456 1142452 1082265 1113700 1179494 1245288 1161718 1078149 1040391 1002632 955330 908027 906536
-1510 906536 905045 967260 1029474 1051605 982112 932663 883213 919659 956105 944831 933558 922284 911010 906417
-1496 906417 901824 988853 1075882 1036811 997741 1004481 1011222 1011281 1011341 1011401 1011460 1077135 1142809 1116862 1090914 1105051
-1480 1105051 1119188 1133325 1147462 1111642 1075823 1040003 1004183 879604 755025 783150 811275 839877 868479
-1467 868479 851270 834061 892250 950438 974269 906476 775813 736772 848526 960281 1089214 1126525 1062670
-1454 1062670 998814 988167 977519 966872 956224 931261 906297 972956 1039615 1038541 1037468 990583 943698 968393
-1440 968393 993088 931887 870686 871521 963979 1056436 1057271 989390 921508 853627 785745 700445 706768 753176
-1426 753176 799584 825949 852314 924491 996667 906118 815570 826187 928428 992492 1056556 1034724 1012892
-1413 1012892 961205 909519 903643 897768 884257 870746 903047 935347 927324 919301 911278 903255 953451 1003646
-1399 1003646 1019483 943698 835821 819566 898752 977937 959774 941610 923447 905283 847751 790219 732686
-1386 732686 675154 740739 806324 871909 937494 932901 928308 877904 827500 840086 852672 941610 1030548 995892
-1372 995892 961235 926578 891922 835314 778706 798450 818194 851598 885002 872595 860188 859234 858279 857325 856370
-1357 856370 837521 818672 799822 780973 762123 743274 724425 705575 767522 829468 891415 953361 872148
-1344 872148 790934 816614 842293 889923 937554 939373 941193 895292 849391 940924 1032457 999501 966544 887776
-1330 887776 809008 763645 718281 749269 780257 788101 795945 803789 811633 866242 920852 929650 938449 886643 834837
-1315 834837 859383 883929 933289 982649 894576 806503 770445 734386 774680 814973 819954 824935 875727 926519
-1301 926519 938538 950558 962577 974597 878769 782941 687114 591286 618099 644911 671724 698537 703398 708260
-1287 708260 713121 717982 699103 680224 615534 550843 624541 698238 695584 692929 688366 683803 755592 827381 878172
-1272 878172 928964 903404 877844 809933 742021 719921 697821 691945 686070 680194 674319 737637 800956 818463
-1258 818463 835970 776171 716372 732925 749478 850644 951810 946084 848735 707484 718937 827738 844918
-1245 844918 776917 708916 766895 824875 858995 801492 795527 789562 880350 971137 1006569 950379 891325 832272
-1231 832272 813303 794334 722635 650936 686129 721323 698298 675273 728600 781927 788966 796005 803043 810082
-1217 810082 769401 728719 688038 647357 591882 536408 557285 578163 599995 621827 689470 757113 851360
-1204 851360 945607 877606 809605 722516 727049 756397 785745 731105 676466 698179 719891 766418 812945 813661
-1190 813661 814377 743721 673066 648222 623378 577537 531696 592747 653799 643748 633697 669457 705217 649355
-1176 649355 593493 608256 623020 610523 506404 472911 531040 625436 628209 611895 595581 629850 664119
-1163 664119 744199 824279 770743 717207 709482 701758 601844 501930 478369 607511 750014 800896 775425
-1150 775425 749955 731642 713330 765643 817956 826366 743155 659943 668354 687084 705814 730270 754727 744825
-1136 744825 734923 725021 715119 728123 741127 754130 767134 745779 724425 703070 681715 667012 652308 637604
-1122 637604 622900 665461 708021 750581 793141 763645 734148 704651 675154 655201 635248 634383 725140 786789
-1108 786789 756815 616130 475446 405387 335328 320624 397543 498799 600055 661226 722397 720577 718758
-1095 718758 671127 623497 610135 596774 654038 711302 762839 722754 657855 592956 608942 624929 570289
-1082 570289 515650 502050 580072 652368 724663 728123 731583 735042 738502 744825 751148 757471 763794 734088 704382
-1067 704382 674677 644971 622900 600830 649385 697940 773785 758008 686875 615743 607600 599458 667668 735877
-1053 735877 681924 627971 593105 649862 679896 618307 608256 598205 624183 558538 492893 518871 615474
-1040 615474 712077 646432 580788 498918 417049 442072 467095 522659 578223 557435 536647 477534 418420
-1027 418420 439477 552156 661971 680164 648729 617293 603991 590689 577387 564086 462979 361872 316121
-1014 316121 361992 441624 521257 600890 680522 715298 658452 653143 647834 646104 644374 585381 618009 679270
-1000 679270 648908 547920 538555 605125 671694 606556 541419 525910 510401 537840 565279 557166 503243 463635
-986 463635 515650 617293 627315 559075 536647 582100 581742 503123 424505 490000 555496 575180 594865 579237
-972 579237 563608 471628 379648 448007 516366 508373 500379 515113 529847 498769 467691 428979 390266 427905
-958 427905 465544 450214 434884 465365 495846 491969 488092 452719 463158 501751 448723 350837 298763 340219
-944 340219 427487 471807 470316 456895 443473 446277 540703 654217 676108 556749 437389 396738 356086
-931 356086 361246 366406 416422 466439 441058 369865 320386 362528 457163 551798 585351 618904 649594 680284
-917 680284 674945 623795 544013 555854 576284 550903 528385 551678 558031 518573 504883 491193 471777 406550
-903 406550 312691 310454 318865 281464 221158 252474 317194 336103 329244 414006 548636 591644 528713 511594
-889 511594 580370 649146 644434 639722 642108 644494 601069 557643 622065 686487 644017 601546 612760 623974
-875 623974 632325 640676 614669 542850 445263 439298 576672 714046 755979 706291 668055 629820 585858 541896
-861 541896 511773 481649 451526 421403 471449 521496 565815 610135 611806 521853 426175 422119 472463 431186
-847 431186 355549 279913 355549 431186 455284 479383 605602 640199 518274 396350 308903 313079 357339
-834 357339 401599 554661 707723 759618 719891 704979 690066 669427 648789 654873 660957 514338 367718
-821 367718 354953 342188 329423 316658 342068 367479 392890 418301 484274 550247 463516 376785 395038 413291
-807 413291 431543 449796 472016 494236 516455 538675 523673 508671 493669 478667 452212 425757 353491 281226
-793 281226 386478 491730 556898 530443 501125 471807 431036 481888 554691 627494 559045 490597 482753
-780 482753 566531 650310 642466 600263 558061 510132 462204 557256 652308 646194 548457 486988 425519 404134
-766 404134 382750 423878 465007 460324 455642 491044 526446 470226 414006 440342 466677 458654 359009 312810
-752 312810 358234 438015 517797 576821 635845 603246 570647 595312 619978 644643 669308 650101 630894 611686
-738 611686 592479 590451 588423 586395 584367 668950 753534 685414 617293 636978 656662 584724 512787 526148
-724 526148 539510 552871 566233 694122 822012 888820 802924 727526 743751 851598 959446 1141736 1324026
-711 1324026 1597939 1871851 2199747 2527643 2886079 3336138 3814829 4140816 4186209 4078899 3945820
-700 3945820 3812741 3542229 3119012 2754969 2390925 2026881 1662838 1448515 1386897 1239383 1091868
-689 1091868 1041703 991537 941372 891206 833405 775604 717804 660003 690007 720011 750014 780018 726304
-676 726304 672589 618874 565159 576344 587528 598712 609897 578133 546370 514606 482842 520750 558657 556480
-662 556480 554303 640139 817598 859532 687680 540643 546310 601605 565279 532292 590928 603753 524955
-649 524955 440431 447530 488986 530443 577596 624750 626092 627434 589646 551857 514069 476281 368106 259931
-635 259931 304459 348988 427875 506762 494027 389669 292977 348988 456537 472463 488390 504316 514516
-622 514516 524717 549471 574226 598981 623736 629402 635069 640736 646403 602202 558001 513801 469600 495071
-608 495071 520541 546012 571482 620336 669189 672231 675273 652547 629820 515471 401122 375890 350658 386508
-594 386508 330735 316956 455881 554721 561938 554363 546787 533485 520183 540285 560387 626301 692214 707096
-580 707096 721979 645239 568500 511802 455105 444219 433333 434377 435421 482276 529131 503451 477772 452093
-566 452093 426414 462532 498650 534768 570886 571691 572496 664924 757351 784641 811931 799136 786341 805042
-552 805042 915364 974149 880230 666833 545057 520631 496204 532859 661136 737876 661912 582607 594925
-539 594925 603425 520303 430500 432319 514308 443593 311677 271383 374250 385494 319431 253369 273203 293036
-525 293036 399482 505927 612372 718818 635337 551857 560000 568142 591972 615802 593821 571840 598533
-512 598533 625227 611835 598444 501065 495309 579267 510520 363513 369209 493251 617293 622393 627494 632594
-498 632594 637694 617025 596356 621499 646641 586365 526089 557435 588781 518960 449140 430857 412575 418629
-484 418629 516306 671247 642943 565965 580609 681149 690066 589228 580012 662419 653203 560954 560328 651324
-470 651324 650697 609628 660182 756546 761288 616190 562714 656215 658094 559761 461428 448991 436554 460384
-456 460384 484214 660748 837282 930814 1024345 1123602 1222860 1156052 1180866 1262944 1161778 916975 763794
-443 763794 761408 759022 714642 670263 717505 764748 694600 624451 645925 667399 702235 737070 771906 806742
-429 806742 695077 583412 624451 665491 543327 421164 573868 726572 796005 865437 997860 947038
-417 947038 757829 660241 713449 766657 725379 684101 734446 784790 758783 732776 859472 986169 949782
-404 949782 913396 968632 1023867 907312 790755 887985 985214 1033531 1081847 1282868 1483888 1482576 1481263
-391 1481263 1693736 1906209 1946384 1986558 1982830 1795857 1435184 1166133 1108958 1051784 889864 727944
-379 727944 840891 953838 906446 859055 964367 1069679 1024673 979667 1026283 1072900 921001 769102
-367 769102 830989 892876 808740 724604 854253 983902 880678 777453 888015 998576 976774 954972
-355 954972 1024792 1094612 988823 883034 991030 1099026 1011609 924192 989479 1054766 906268 757769
-343 757769 884138 1010506 937285 864065 1004630 1145195 1022346 899497 1051515 1203533 1163240 1122946
-331 1122946 1174275 1225604 1181493 1137381 1245974 1354567 1179733 1004899 1227095 1449291 1339356 1229421
-319 1229421 1333272 1437122 1306429 1175736 1375265 1574794 1550994 1435571 1593107 1933887 2058257
-308 2058257 1999383 2089395 2271029 2212154 2061657 2121128 2180599 1957568 1734537 1860816 2170339 2168729
-296 2168729 2075496 2278127 2664003 2887779 3111556 3789627 4650942 5542798 6862226 8838279 11119740
-285 11119740 13098181 14893376 16566408 17078890 15468789 12698137 10461951 9141986 8026264 7093787
-275 7093787 6810300 6954385 6770156 6402682 6615483 7255855 7467225 7495350 8042668 9017557 9625956
-264 9625956 10051112 11255057 13130897 14980196 17134902 20427251 24513661 28119049 31296872 34245636
-254 34245636 35545201 33521546 29360037 26137661 24686645 23449416 22395430 22960107 24929658 26464004
-244 26464004 27815105 31204801 36732353 42275178 48245569 57529637 70295357 84011174 99254035
-235 99254035 120566870 149637065 185884338 235630638 310910932 414594133 534826032 661379764
-227 661379764 794226862 921729264 1000000000 978066432 850083806 668685533 500100938 375586587
-219 375586587 290076686 230434833 189968740 162971154 141944269 123574441 109413035 99435730
-211 99435730 90466254 81344074 74100158 69207879 64533202 59400413 55484007 53186257 50754893 47804338
-201 47804338 46117410 46293467 46805471 46920445 47742750 49572901 50551726 48995668 45275031 40485471
-191 40485471 35157624 30165731 26690851 24712474 23031865 21137472 19791859 19270847 18654395 17579831
-181 17579831 16724898 16389159 15938890 15091593 14512482 14391482 14121595 13393597 12871272 12807058 12536696
-170 12536696 11808220 11331707 11435467 11466694 11039809 10654978 10667176 10637381 10271637 9970793 10005897 10006643
-158 10006643 9732521 9563861 9731149 9883167 9760318 9889430 10598818 11502902 12315364 13364279 14871305
-147 14871305 16309615 17045486 16941486 16073967 14450564 12491212 10922210 10055645 9431497 8807351
-137 8807351 8386490 8240497 8069689 7624015 7280252 7272438 7230266 6913226 6631499 6624640 6671226 6504028
-125 6504028 6372142 6454041 6482494 6236080 6035477 6109741 6149647 5975768 5811790 5922679 6033568 5869590
-113 5869590 5678890 5701974 5725059 5534358 5340794 5422097 5469041 5302200 5122952 5157489 5192027 5012779
-101 5012779 4827715 4856436 4896610 4784081 4635284 4700273 4811072 4708087 4608441 4661500 4745099 4614914
-89 4614914 4472320 4482431 4538353 4441571 4319497 4411209 4548732 4472470 4331308 4342850 4396386 4297218 4125515
-76 4125515 4106517 4102789 4007438 3955990 4118328 4330294 4328474 4200346 4224922 4348755 4380966 4358777 4489291
-63 4489291 4659889 4677785 4553951 4430118 4392181 4201539 3974631 3900427 3898756 3805464 3712052 3771344 3830636
-50 3830636 3737224 3591320 3537039 3559109 3489558 3383738 3430623 3523320 3463311 3352721 3333752 3360594 3295815
-37 3295815 3169148 3195185 3263216 3117461 2882947 2862219 2994195 3034548 2957510 2972094 3087845 3111974 3027301
-24 3027301 2942627 2934306 2925985 2923390 3012418 3181615 3198108 3103891 3009674 3012806 3015937 2983756 2951575 2934664
-10 2934664 2826131 2760546 2847665 2934783 2869198 2721326 2665076 2746260 2827443 2835138 2842833 2835257 2736060 2627795
3 2627795 2672234 2823566 2822194 2703431 2676290 2725502 2774713 2765944 2757176 2805671 2762544 2615388 2559854 2611212
17 2611212 2570948 2477239 2475151 2518874 2470975 2304731 2230109 2296738 2363367 2418543 2473719 2547983 2469544 2307117
31 2307117 2297394 2417469 2445922 2307833 2261365 2325608 2389851 2308071 2226291 2312485 2398680 2350900 2303120 2255341
45 2255341 2207561 2127332 2047103 2104307 2161511 2164076 2166641 2169206 2171771 2181971 2192171 2253909 2224025 2128256 2032489
60 2032489 2013072 1993656 2022915 2143795 2310487 2385557 2332498 2279439 2272192 2264944 2177527 2181733 2262290 2251225
74 2251225 2140306 2029387 2050175 2070963 2059301 2047640 2142871 2238102 2152952 2067801 2059003 2050204 2024227 1998249
88 1998249 2048624 2098998 2021244 1943491 1942089 1940687 1918289 1895890 1949844 2003797 1962310 1920824 1925148 1929473 1959566
103 1959566 1989660 2071291 2061299 1958731 1856163 1915843 1975523 1880590 1785657 1776620 1859205 1879278 1899350 1925148
117 1925148 1950947 1951931 1952915 2005437 1966337 1882886 1799436 1817152 1834868 1781004 1727140 1835524 1943908 1904122
131 1904122 1772713 1738653 1704593 1631402 1558212 1591914 1625616 1643690 1661764 1679838 1697912 1613865 1529818
144 1529818 1638560 1747302 1748913 1658901 1666238 1673575 1664687 1655799 1692722 1729646 1677333 1625020 1719684 1814349
158 1814349 1800211 1694452 1634504 1666178 1644167 1622156 1605872 1589587 1581893 1574198 1566503 1558808 1517829 1476849
172 1476849 1527492 1578135 1588693 1599251 1609809 1620367 1652160 1683954 1715747 1747541 1647627 1547713 1539422 1531131
186 1531131 1554245 1577359 1600474 1623588 1581803 1540018 1589856 1639694 1638232 1636771 1635309 1633848 1592302 1550756
200 1550756 1600832 1650908 1603635 1556362 1543448 1622156 1674141 1634504 1652131 1669757 1647776 1625795 1603814 1581833
214 1581833 1559852 1537871 1515890 1493909 1511744 1529580 1547415 1565250 1569724 1574198 1578672 1583145 1533457 1483769
228 1483769 1474165 1556184 1579984 1603784 1587500 1571215 1551233 1531250 1511267 1491285 1472256 1453228 1525822 1598416
242 1598416 1567457 1536499 1597163 1657827 1684133 1710438 1776829 1934841 2085010 2235179 2396801 2558422 2815484
255 2815484 3164167 3552936 3941704 4222149 4502593 4861298 5220003 5292388 5150987 4906512 4570415 4062883
267 4062883 3555352 3164257 2925866 2741875 2466263 2246005 2117370 1995655 1873939 1792308 1802299 1841877
279 1841877 1789832 1743514 1788818 1769551 1750284 1736744 1723204 1709663 1696122 1682582 1669041 1643332 1617623 1586188
293 1586188 1554752 1541450 1436526 1331602 1318300 1291994 1265688 1290920 1316152 1353791 1391430 1337447 1283464
306 1283464 1254772 1226081 1231748 1329037 1426326 1431992 1449112 1466231 1458596 1450961 1397515 1344068 1367928 1391788
320 1391788 1461459 1531131 1498204 1465277 1432350 1399424 1396083 1392743 1389402 1386062 1358026 1329991 1301956 1273920
334 1273920 1280243 1286566 1292889 1299212 1269745 1240277 1210810 1181343 1209140 1236937 1264734 1292531 1279020 1265509
348 1265509 1251999 1238488 1171531 1104574 1133057 1253162 1293098 1241411 1189724 1229660 1260051 1198821 1143316
361 1143316 1179435 1190738 1202042 1219072 1236102 1255995 1275889 1377860 1479832 1540764 1448993 1345768 1334166
374 1334166 1325428 1316689 1256413 1287759 1289876 1200372 1116593 1124437 1152324 1180210 1168012 1155813 1230465 1305117
388 1305117 1288147 1271176 1140632 1010088 940626 1023867 1127032 1138574 1119576 1100577 1072989 1045401 1006360
401 1006360 1058942 1143018 1135472 1032487 929501 1004988 1080475 1150236 1219997 1227572 1143525 1059478 1067054 1082265
415 1082265 1097475 1118413 1139350 1151220 1163090 1174961 1186831 1139529 1092226 993386 986169 1005793 1025418 999232
429 999232 1064668 1127241 1189814 1294380 1398946 1459372 1367093 1217551 1159631 1159929 1160227 1108988 1149371 1262915
443 1262915 1284836 1150236 1015636 946889 878143 901018 923894 920762 917631 903047 980084 1061894 1052082 956373
457 956373 952288 1019424 1086560 1067800 1049040 1095179 1141318 1095835 1050352 1070007 1089661 1017694 945726 969198
471 969198 992671 970332 947993 986020 1024046 1016262 1008478 1017873 1027267 1036662 1046057 1048771 1051485 968303 885122
486 885122 820073 846647 913306 979965 994371 1008776 977370 945965 997592 1049219 1066487 992134 900362 900213
500 900213 934422 968632 964665 960698 1042627 1124557 1136129 1056078 970302 976148 997264 926757 861977 888820
514 888820 995832 1102844 1062878 1022913 988674 954435 920196 885957 897529 909101 920673 932245 948589
527 948589 964933 889655 814377 807815 801254 840503 879753 887508 895262 903017 910771 919898 929024 938151 947277 956403
543 956403 965530 974656 983783 992193 1000604 1009015 1017425 988614 959803 930993 902182 905224 908266 865497 822728 857265
559 857265 891802 834718 777632 791650 805668 819686 833703 896396 959088 930157 901227 871492 841756 857832
573 857832 873907 924342 974776 933587 892399 904896 917392 975700 1034008 1146717 1259425 1219430 1179435
586 1179435 1147194 1114953 1082712 1050471 1002960 955449 907938 860427 927920 995414 971286 947158 909668 872178
600 872178 834688 797198 784164 771131 758097 745064 809336 873609 937882 1002155 974328 946501 872864 799226
614 799226 905015 1010804 963889 916975 874593 832212 835642 839072 815779 792485 723381 654276 733820 813363
628 813363 801284 789205 845842 902480 913306 924133 943579 963024 890848 818672 858160 897648 845514 793380
642 793380 813065 832749 852433 872118 851718 831317 810917 790517 787415 784313 781211 778110 786461 794812 803163
657 803163 811514 805071 798629 792187 785745 807935 830124 852314 874504 937763 1001021 972658 944294 914977 885659
672 885659 856341 827023 843516 860009 836417 812826 746286 771369 836537 901704 898394 895083 886046 877009 846021
687 846021 723411 646611 661434 749507 837581 778676 719772 783031 846290 762571 678852 644464 701698 713121
701 713121 632922 629074 625227 615653 606079 645895 685712 771339 856967 905373 953779 910562 867346 920285 973225
716 973225 986079 907312 899169 891027 877158 863290 870895 878500 886106 893711 923268 952824 896485 840146 813989
731 813989 879455 899110 827142 794305 761467 814526 867585 950230 1032875 962816 801135 715805 783180 850554
745 850554 917929 929829 941729 919271 805191 613804 514039 570796 627553 663552 699551 689738 679926 677749
759 677749 675571 719205 762839 809486 856132 862693 777632 684936 592240 533903 567187 667519 767850 879634
773 879634 899796 895143 890490 880111 869732 824637 779541 780257 780973 821773 862574 811752 760930 706052 651175
788 651175 642108 633041 644017 654992 574345 493699 557315 620932 684549 748165 750700 753236 755771 758306 743423
803 743423 728540 627762 526983 488241 541120 639811 646880 574614 502348 464440 518155 609091 700028 705068
817 705068 710109 769788 829468 793708 666326 593344 611985 619172 626360 645210 664059 682908 701758 695793
831 695793 689828 775485 861142 841339 821535 755920 690305 656185 622065 587946 553826 581981 610135 638290
845 638290 666445 647834 629223 656424 683624 754488 825352 743513 661673 642824 623974 565040 506106 468347
859 468347 522211 616160 710109 755383 800657 754309 707961 646820 585679 616160 646641 677122 707603 692273
873 692273 676943 729256 781569 839609 806026 765762 725498 725319 725140 716849 708558 614371 520183 521436 614311
888 614311 667101 628269 611358 686070 755055 732418 686875 641332 590063 538794 530234 521674 558926 596177
902 596177 656334 716491 746107 684101 625465 719533 819328 827500 739277 651055 648729 646403 605184 563966
916 563966 614371 664775 595879 526983 498172 560984 614042 667101 588453 509804 438791 367778 464739 561700
930 561700 556301 550903 545505 540106 607242 674378 741514 808650 746555 684459 698716 712972 710049 707126 658392
945 658392 609658 615086 620514 625943 631371 680701 730032 779362 828693 715239 601784 564682 527580 552513
959 552513 577447 556570 535692 489523 443354 504078 564801 635069 705337 775604 845872 788250 730628 673006
973 673006 615385 619799 624213 628627 633041 712853 792664 826665 860665 760095 659526 635308 611090 692482
987 692482 773874 748374 722874 681149 639424 597698 555973 470823 385673 407415 429157 432766 436375 439984
1001 439984 443593 434675 425757 416840 407922 425728 443533 461339 479144 501244 523345 545445 567545 555287 543029
1016 543029 607123 671217 694421 717625 695017 672410 581086 489762 535871 581981 610434 638887 743692
1029 743692 848497 869314 890132 804057 717982 625465 532948 577865 622781 618069 613357 608644 603932 575837
1043 575837 547741 519646 491551 465365 439179 489344 539510 541299 543089 590689 638290 627672 617055 606437
1057 606437 595819 616220 636620 733372 830124 765583 701042 682312 663582 679985 696389 636441 576493 512727
1071 512727 448961 461547 474133 444249 414364 460832 507299 511773 516246 566531 616816 566114 515411 510520
1085 510520 505629 494057 482484 516724 550963 542254 533545 524836 516127 491193 466260 441326 416392 503541 590689
1100 590689 677838 764987 725200 685414 645627 605841 519288 432736 453077 473418 465126 456835 494355 531875
1114 531875 586007 640139 694272 748404 682282 616160 550038 483916 544968 606020 590719 575419 515262 455105
1128 455105 394948 334791 364944 395097 425250 455403 485556 515709 545863 576016 578968 581921 584874 587826
1142 587826 544968 502109 413440 324770 268162 211554 292380 373206 473119 573033 504973 436912 391041 345170
1156 345170 375651 406133 448066 490000 531934 573868 574763 575658 576552 577447 586931 596416 605900 615385 642525 669666
1172 669666 650996 632325 579296 526268 580131 633995 628478 622960 617442 611925 561551 511176 552424 593672
1186 593672 583860 574047 558508 542969 498799 363006 313108 354834 457521 468586 445293 421999 469332 516664
1200 516664 563996 611328 603305 595283 587260 579237 615116 650996 681149 711302 744616 686308 587916 489523
1214 489523 492297 495071 452033 408996 424654 440312 501781 563250 636173 709095 690394 671694 693198 714702
1228 714702 736206 757709 685682 613655 547354 481053 472016 554601 637187 628150 582846 537541 486511 435480
1242 435480 344962 254443 265090 367360 471539 575717 584456 501572 415348 329124 389878 450631 522838
1255 522838 595044 575628 556212 508880 461547 505837 550127 551470 552812 554154 555496 506971 458446 404194
1269 404194 441565 456030 470495 404790 339086 303714 359963 410487 461011 446635 432259 417884 403508 373623
1283 373623 343739 359665 375592 356206 336819 409055 481291 526357 571423 610762 650101 641720 541717 441714
1297 441714 433333 478876 524418 569961 615504 632415 557703 534529 511355 495548 479741 463933 448126 439000
1311 439000 429873 466558 503243 552812 602381 508790 415199 330198 397901 522867 556212 506404 456596 492685
1325 492685 528773 476102 423431 416571 409712 460593 511474 470733 429993 449379 468765 488151 507537 469063
1339 469063 430589 483737 536885 538496 540106 541717 543327 550426 557524 564622 571721 573093 574465 575837 577209 616488
1355 616488 655768 603425 551082 529280 507478 485676 463874 375502 287131 290382 293633 319789 345946 372102
1369 372102 398259 492744 587230 590093 592956 567187 541419 515650 489881 495607 501334 507060 512787 476519 440252
1384 440252 403985 367718 422954 478190 533426 588661 595223 601784 562535 523285 503601 483916 555854 627792
1398 627792 590928 554064 563012 571959 514457 456954 491074 525194 548815 572437 504436 436435 383227 330019
1412 330019 368434 406848 458625 510401 562177 613953 596297 578640 591525 696031 769997 691259 560984
1425 560984 522331 564801 607272 563847 520422 585798 651175 624929 598683 588751 578819 568887 558956 551887 544819
1440 544819 583561 622304 619053 615802 612551 609300 617502 625704 557554 489404 464321 439238 414155 389073 436524
1455 436524 483976 455075 426175 432826 439477 446128 452779 494742 536706 502318 467930 486630 505330 478219
1469 478219 451109 393457 335805 333509 422835 547712 672589 665759 658929 656871 654813 652755 650697 633727 616757
1484 616757 550157 391936 313884 327454 390653 453853 465991 478130 490269 502408 448693 394978 396618 489881
1498 489881 567903 645925 622781 599637 552633 505629 458625 411620 387045 362469 414245 466021 444309 422596
1512 422596 389431 447888 559791 580072 495369 410666 318328 317612 341711 365809 402315 438821 398974 359128
1526 359128 283015 206902 241499 367718 468705 478070 437807 397543 421224 444905 539212 633518 596595
1539 596595 468049 391041 314033 283791 253548 217579 273232 352060 430887 439089 447291 423998 400704 377411
1553 377411 354118 374250 394381 338161 281941 297301 312661 398646 484632 549322 522390 409562 296735
1566 296735 349972 403210 406819 318805 247493 267804 368285 468765 444219 419673 395127 370581 350062
1579 350062 329542 354834 380125 454091 528057 495130 462204 408996 355788 348391 340995 344097 347198 350300 353402
1594 353402 388088 422775 350569 278362 266283 254204 242125 230046 261631 293215 324800 356384 307800 259215
1608 259215 204903 242215 352895 463575 469272 383346 260199 228674 277318 325963 304936 283910 262883
1621 262883 241857 228465 215074 272308 329542 340219 259274 178329 189007 273173 357339 370879 384420 384599
1635 384599 384778 430768 476758 533247 589735 539331 488927 475028 461130 447231 433333 462382 491432 520481
1649 520481 549531 488151 426771 365392 304012 312303 320595 374697 428800 417943 407087 396231 385374 425101
1663 425101 464828 428203 391578 302938 214298 202010 189722 253787 317851 301745 194017 99055 95714 203084
1677 203084 310454 320475 330496 340518 350539 335984 321430 306875 292320 314033 335746 351732 367718
1690 367718 403269 347198 199505 143434 259155 374876 404701 434526 428322 422119 415915 409712 449319 488927
1704 488927 442638 396350 382630 460533 486899 513264 490000 466737 449200 431663 384301 428561 472821 425459
1718 425459 385732 346005 300552 255099 248299 241499 234699 227899 245913 263927 281941 299956 267387 234818
1732 234818 288145 341472 360441 287787 266671 245555 246987 248418 249850 251281 225990 200698 175407 150115
1746 150115 183519 216923 250327 283731 298047 312363 326679 340995 334582 328170 321758 315345 274575 233804
1760 233804 198760 163715 165415 258738 300522 342307 311558 280808 341681 402553 417138 431722 446307 460891
1774 460891 401032 341174 281315 221456 256560 291664 321042 350419 358800 275559 192317 200698 298554 396410
1788 396410 408369 420329 417019 413708 318775 223842 222441 221039 219637 218235 268371 318507 328558 246987 224349
1803 224349 201712 179075 156438 103260 141704 220233 298763 271831 244899 309589 374279 429426 484572 387015
1817 387015 289457 246778 204098 161419 118739 119007 119276 151040 136992 118650 191930 328200 418659 401271
1831 401271 383883 363632 343381 295810 248239 200668 153097 155155 157213 159271 161329 204426 247523 290620
1845 290620 333717 313824 293931 274038 254145 283731 313317 308545 212151 131981 143434 215014 240783 257723
1859 257723 274664 288741 302819 328349 353879 379409 404939 356742 308545 351970 395396 352925 310454 267983
1873 267983 225512 280152 334791 386567 438344 363185 242215 242453 334314 378187 330437 282687 326559 460146
1887 460146 502109 387552 272994 237413 201831 166250 130669 138990 147311 155633 163954 205440 246927 288413
1901 288413 329900 365660 401420 437180 472940 486511 500081 422029 343977 353730 363483 373236 382988 387104 391220
1916 391220 303714 216207 191691 167175 142659 118143 127746 137350 146953 156557 231060 305563 342844 288503
1930 288503 271980 301268 299061 296854 286057 275261 267327 259394 256471 299359 285938 180894 146476 264762
1944 264762 342963 329542 293603 257664 322891 388118 376994 365869 314659 263450 242781 313735 390415 375472
1958 375472 300403 316956 404134 399690 294438 189186 154559 119932 122527 125122 127716 130311 153426 176540
1972 176540 245465 314391 312691 310991 355102 399213 367092 334970 302849 270727 198521 126315 191542 256769
1986 256769 287161 317552 347944 378336 367688 357041 346393 335746 322652 309559 296466 283373 271234 259095
2000 259095 292768 326440 282806 239172 195538 151904 165535 179164 192795 206424 210749 215074 238486 353521
2014 353521 466647 488151 343590 199028 174243 241081 256381 271682 311796 351911 443563 443593 366853 290113
2028 290113 283999 277885 288950 300015 311080 322145 328439 334732 386836 438940 382243 325545 314659 303773
2042 303773 271324 238874 154887 162522 189245 215968 248418 280868 305682 330496 278959 227421 201652 175884
2056 175884 251281 326679 394799 371297 298166 225035 233983 334553 383585 432617 412933 393248 373564 353879
2070 353879 383823 413768 443712 473656 426264 378872 331481 284089 252922 221755 190587 159420 144478 129536
2084 129536 190945 252355 302312 352269 325874 299478 244451 189424 134397 79370 89242 99114 108986 118858
2098 118858 172156 225453 232939 240425 211644 182863 154082 125301 97444 69588 87542 105497 113907 122318
2112 122318 176540 230762 230106 229449 228793 228137 223663 219190 260527 301864 310514 319163 327812 336461 277348 218235
2128 218235 204933 191631 115816 40001 40538 41075 55928 70781 85633 100486 127269 154052 135024 115995
2142 115995 130371 144746 235474 326202 235593 144985 191810 238636 264464 290292 270310 250327 225453 200579
2156 200579 282598 364616 423729 482842 404522 326202 249790 173378 173319 173259 148385 123511 144448 165385 241857
2171 241857 318328 318447 318566 224200 129834 142360 154887 164073 173259 182445 191631 130192 68752 83665 98577
2186 98577 167771 236965 306159 375353 403508 431663 322384 213105 134845 56584 146297 236011 254145
2199 254145 272278 214060 155841 188708 221576 254443 287310 242871 198431 153992 109553 103290 97027 90763
2213 90763 84500 75374 66247 51394 128164 240365 352567 317791 283015 272099 261183 250267 239351 262794
2227 262794 286236 309679 333121 344156 355191 371953 297092 169471 41850 9669 69110 119962 170813
2240 170813 193033 123630 49456 66903 118709 170515 169829 169143 214268 259394 247613 235832 315673 395515
2254 395515 349376 303236 302908 302580 246658 190737 169173 239232 317880 304907 257574 210242 216625 223007 321012
2269 321012 419017 436852 454688 380901 307114 230702 154290 169501 184712 171291 157869 230344 302819 299777
2283 299777 205112 110448 107406 117725 128044 144090 160136 164252 168368 172484 176600 161627 146655 131683 116711
2298 116711 143017 169322 195628 221933 190975 160017 129059 98100 121065 144031 166996 189961 193838 197716
2312 197716 201593 205470 193600 181729 118322 146536 226288 306040 299896 293752 357756 421761 394143 366525
2326 366525 359904 353283 346662 340040 381467 422894 372699 322503 246539 170575 140422 110269 130699 151129
2340 151129 263181 375234 329810 284387 238964 193540 273978 354416 343232 332047 283641 235235 278452
2353 278452 321668 339116 356563 328200 299836 281971 264106 246241 228376 194942 161508 219697 277885 244451
2367 244451 211018 177584 144150 229539 314928 308694 302461 246599 190737 226497 262257 250416 238576 226735
2381 226735 214895 174422 133950 93477 53005 96519 140034 183549 227063 241946 256829 271711 286594 189663
2395 189663 92732 87423 82114 53900 25685 43282 60879 95893 130908 120111 109314 178687 248060 225811
2409 225811 203561 232671 261780 290889 319998 283254 246509 295661 344812 317373 198312 90704 135799
2422 135799 241022 346244 369388 392532 433512 474491 423849 373206 382690 392174 355848 319521 298942 278362
2436 278362 257783 237204 279615 322026 318626 315226 251759 188291 216446 244601 269892 295184 320475 345767
2450 345767 389192 432617 384420 336223 223126 110030 88556 67082 82785 98488 114191 129894 166593
2463 166593 203293 148370 93448 69543 45638 113356 181073 197253 213433 229613 245794 234773 223753 121110
2477 121110 18468 44669 70870 51260 31650 97459 163268 137454 111641 18065 -75510 -77464 -79417 18497
2491 18497 116413 214328 312244 386299 460354 381706 303057 184324 65591 -7330 -80252 -11923 56405
2504 56405 78923 101441 181043 260646 248627 236607 205500 174392 143285 112178 157899 203621 203531 203442 285431
2519 285431 367420 296705 225990 225975 225960 180134 134308 159107 183907 254517 325128 268803 212479 156155 99830
2534 99830 103633 107435 111238 115041 121170 127299 133428 139557 154275 168994 183713 198431 198118 197805 151681 105556
2550 105556 209273 312989 325083 337177 305652 274127 242602 211077 176689 142301 107913 73524 56793
2563 56793 40061 69140 98220 84351 70482 148236 225990 229062 232134 235206 238278 247076 255874 264673 273471
2578 273471 238128 202786 167443 132101 138752 145403 152054 158705 156706 154708 152710 150711 194524 238337 190528
2593 190528 142718 122109 101500 172514 243527 207647 171768 90077 8387 85604 162820 194226 225632 194047
2607 194047 162462 176689 190915 164103 137290 64666 -7956 28220 64398 100576 136753 140541 144329 148117
2621 148117 151904 164282 176659 143225 109792 129088 148385 76060 3734 49754 95774 141794 187814 213553
2635 213553 239292 219219 199147 256381 313615 370850 275380 155812 127866 191542 255218 213911 172603
2648 172603 131295 89988 87065 84142 81219 78296 89690 101083 112476 123869 106153 88437 116532 144627
2662 144627 187038 229449 180238 131027 147550 164073 180596 197119 158287 119455 80623 41791 44713 47636
2676 47636 50559 53482 59268 65054 70840 76626 77581 78535 125301 172066 220740 269415 226467 183519 210481 237443
2692 237443 310215 382988 305921 228853 243408 257962 307591 357220 254145 151069 114802 78535 42268
2705 42268 6001 29383 52766 -15472 -83712 -50785 -17858 15067 47994 94044 140094 186143 232193 236250
2719 236250 240306 244362 248418 252952 257485 262018 266552 236727 206902 177077 147252 147848 148445 149041 149638 209407 269176
2736 269176 304131 247464 220860 194256 207737 221218 200340 179463 87960 -3542 -34262 26640 133353
2749 133353 148445 65233 -17978 -23 17931 36363 54794 73226 91658 74777 57896 41015 24134 71317
2763 71317 118500 165684 212867 164610 116353 68096 19839 70840 121841 172842 223842 248120 272397 296675
2777 296675 320952 298106 275261 258141 241022 223902 298405 372907 355788 275678 195568 109732 23896 64040
2791 64040 104185 144329 184473 217698 250923 284148 317373 333419 349465 319700 289934 198610 107286 71317
2805 71317 126971 217937 308903 350241 299956 264494 229032 187844 146655 160822 174989 189156 203323 213195
2819 213195 223067 187128 151189 55122 -40943 4241 141048 243616 254562 215879 177196 117516 57837
2832 57837 43968 30099 79221 128343 101112 73882 85782 97683 155394 213105 226527 239948 253369 266790
2846 266790 208632 150473 86588 114325 157333 200340 172722 145104 200519 255934 265538 275141 232372 189603
2860 189603 152561 115518 119515 215133 259215 303296 324949 346602 419792 401360 308486 215611 223902 232193
2874 232193 182624 133055 138841 236250 352746 469242 454031 438821 347974 257127 126195 -4735 -29729
2887 -29729 36899 103528 78535 63444 48352 103886 159420 197775 236130 228674 221218 218772 216326 213881 211435
2902 211435 240485 269534 298584 327633 287936 248239 208542 168845 172096 175347 178598 181849 237830 293812
2916 293812 300164 214895 130580 137887 246360 263211 205977 148743 192675 236607 210868 185129 159391 133652
2930 133652 158257 182863 136843 90823 15217 31233 72063 112893 110060 107227 150204 193182 142629 92076
2944 92076 41522 -9030 11518 32068 52617 73167 36452 -262 -36976 -73691 -57436 -41181 -24927 -8672
2958 -8672 -1962 4748 57270 109792 99323 88854 154738 220621 196791 172961 149131 125301 104960 84619
2972 84619 64279 43938 -262 -44462 -88663 -132863 -73989 -15114 89570 194256 172006 149757 146596 235057
2986 235057 307412 288145 219249 150354 84321 18289 -22929 27475 74539 121602 174392 227183 242751 258320
3000 258320 197537 136753 78953 21152 -42374 -14279 76805 167891 153992 48471 -19827 3495 76447
3013 76447 149399 168905 188410 207916 227421 240246 253071 265896 278720 226646 174571 198849 223126 262674
3027 262674 302222 295959 289696 249074 208453 167831 127209 130729 134248 137767 141287 156259 171231 186203 201175
3042 201175 166757 132339 97921 63503 86349 109195 132041 154887 155066 155245 155424 155603 100427 45250 96967
3057 96967 148683 116651 84619 71675 150354 192765 143553 54258 56584 92046 127508 92344 57180 73554
3071 73554 89928 106302 122676 131415 140153 148892 157631 124376 91121 57866 24611 19989 15366 10743 6120
3086 6120 31083 56047 81010 105974 65084 24194 29115 34036 105765 177494 172871 168249 117188 66128 15067
3101 15067 -35992 -59375 -82757 -74645 -112344 -156962 -109958 20078 150115 143673 137231 130788 124346 95834
3115 95834 67321 38808 10295 30457 50619 25924 -44581 -89558 -42911 86767 216446 203919 191393
3128 191393 178866 166340 134755 103170 172752 242334 230792 127627 95088 154171 258111 270429 202577
3141 202577 134725 139408 144090 194584 245078 252146 259215 280599 347795 373951 308486 169531 122199 179373
3155 179373 236548 223097 209646 184742 159838 134934 110030 106988 103946 100904 97862 111044 124227 137410
3169 137410 150592 171410 192228 221635 159420 77163 40717 79668 118620 118322 118023 117725 117427 83725 50022
3184 50022 62131 74240 62012 49784 82412 160852 158168 63861 -27581 -27402 -24957 -22511 -14339 -6167 -14220
3199 -14220 -22272 -30325 -38378 14650 67679 44356 21032 46384 71735 142897 214060 200042 186024 126195
3213 126195 66366 94342 122318 193242 264166 223902 137827 96609 147013 220323 202010 103528 5046 -13086
3227 -13086 -31220 -49353 -67487 -64624 -61761 -58897 -56034 -57466 -58897 -14518 29861 -14518 -58897 -17381 24134
3242 24134 72331 28906 -20244 22225 105735 97623 49426 92851 195449 298047 253667 209288 162045 114802
3256 114802 67559 20317 74896 129476 92433 55391 41254 27117 -72915 -172948 -156783 -48996 7253
3269 7253 63503 106392 149280 157810 74717 -48817 -80729 38152 157034 201474 154290 158645 162999 223425
3283 223425 283850 252653 221456 201712 181968 162224 142480 157668 172857 102149 31441 -4907 50365 105638
3297 105638 69289 31509 -6271 41843 89958 -1268 -92495 -183722 -274950 -249382 -223815 -198247 -172680 -112754
3311 -112754 -52828 7097 67023 88534 110045 131556 153068 107771 62474 17178 -28118 -57347 -86575 -24181
3325 -24181 38212 49068 59924 70781 81637 79370 77103 74837 72570 67440 62310 17096 -28118 -67487 -15234
3340 -15234 77103 169442 187336 205231 131504 57777 28668 -440 16260 32962 18169 3376 -11416 -26209
3354 -26209 43543 113296 177323 241350 230933 128895 78393 27892 67343 106794 146245 185696 198424 211152
3368 211152 223880 236607 224759 212911 201063 189216 136328 83441 24828 57837 117568 177300 141592 14262
3382 14262 -20490 -55244 -95724 -136204 -193199 -250195 -154487 -58778 -29878 -977 27922 56822 39196 21569
3396 21569 3943 -13683 -31309 -48936 -66562 -84189 -76882 -69575 -62268 -54961 -25702 3555 32813 62072 35975
3411 35975 9878 29592 49307 54705 60103 -20393 -100891 -186638 -180762 -73720 33320 60193 87065 113937
3425 113937 140810 52438 -35932 -84219 -40883 46354 133592 134934 136276 157780 179284 200788 222291 152173
3439 152173 82054 52021 113609 168040 222470 191005 159540 107077 54615 93776 132936 85782 38629 -8523
3453 -8523 -55676 -16934 21808 54824 87840 137797 96132 54466 104423 145790 187158 142629 98100 132429
3467 132429 166757 155275 143792 169531 195270 186651 86409 15992 37198 92761 148325 81726 15127 40150
3481 40150 65173 25417 -14339 -54096 -93852 -106886 -119919 -132953 -145986 -61433 23120 16052 8983 76358
3495 76358 143732 119485 95237 56315 17394 70095 122795 144001 165206 140601 115995 104751 93507 82263
3509 82263 71019 62638 54258 45877 37496 11757 -13981 51901 117785 218026 318268 326888 335507 271831 208154
3524 208154 144478 80802 75344 69886 110239 150592 202160 253727 213672 173617 137380 101142 110716 120290
3538 120290 137499 154708 80295 5881 27862 49843 71824 93805 78833 63861 48889 33917 38033 42149
3552 42149 46264 50380 18706 -12967 -44641 -76315 -88901 -101488 -22451 56584 140511 224439 155662 86886
3566 86886 -21020 -128927 -84129 -39332 57001 153336 203860 254383 176063 97742 19422 -58897 -68919
3579 -68919 -78940 -88961 -98982 -116639 -134295 -60329 13636 96669 179701 171112 162522 174929 187336 199744
3593 199744 212151 101739 -8672 -27462 -46252 -26865 -7479 57717 122915 154231 185547 171052 156557
3606 156557 126792 97027 67261 37496 -30385 -98266 -74526 -50785 -51859 -52932 -54006 -55080 -32055 -9030
3620 -9030 13994 37019 65770 94521 123272 152024 64279 -23465 -19588 -15711 12980 41671 -21258 -84189
3634 -84189 -92958 -101726 -18872 63980 26580 -10820 -13862 74717 155841 145343 100486 55629 30815 6001
3648 6001 -64624 -135249 -90393 -45536 -679 44177 21271 -1633 -24539 -47445 -92421 -137397 -233910 -238802
3662 -238802 -237967 -237132 -230570 -224009 -179748 -135488 -91228 -46967 -9388 28190 19959 11727 53035 94342 49754
3677 49754 5166 9252 104960 200668 204754 155871 106988 52379 -2230 -58748 -115267 -80163 -45059 -19499
3691 -19499 6060 31620 57180 120916 184652 91867 -92540 -159557 -134951 -75987 -17023 -25822 -34620 -83503
3705 -83503 -132386 -89915 44177 178270 220740 185905 151069 110507 69945 60879 51812 -43150 -138113 -208261
3719 -208261 -186787 -73691 -52217 -110196 -168176 -79178 9818 -29073 -67964 -11416 136753 279197 330019
3732 330019 285401 240783 233386 225990 218593 211196 198193 185189 126374 67559 7790 -51978 -35395 -18813
3746 -18813 50738 120290 79132 -53648 -125348 -105424 -35873 33678 7313 -19051 394 19839 62191 104542
3760 104542 141167 177793 134248 -918 -136085 -179629 -122007 -64385 4688 -17858 -88186 -158513 -158215 -157916
3774 -157916 -79357 -798 52945 15067 -42374 -99817 -56094 -12371 8446 29264 50082 70900 111999 153097
3788 153097 194196 235295 200996 166698 132399 98100 90286 82472 151010 219547 203144 186740 124525 62310
3802 62310 26528 -9254 31315 71884 106727 141570 100061 58552 81943 105333 82912 60491 28526 -3438
3816 -3438 4681 12801 67209 29995 -83570 -105514 9975 125465 135970 54854 -731 35304 59887 84470
3830 84470 77558 70646 17923 -34799 -44999 -55199 -8135 -52694 -116340 -88365 -41301 5762 8924 12085 15246
3845 15246 18408 -381 -19171 -37960 -56750 -30444 -4139 22166 48471 40419 32366 24313 16260 33977 51693
3860 51693 69409 87125 55212 23299 -8613 -40525 -37878 -35231 -32584 -29937 2295 34528 66762 98995 132183
3875 132183 165370 122206 79042 72145 65248 104162 143076 105281 67485 29689 -8106 -1044 6016 13077 20138
3890 20138 52013 83889 115764 147640 122251 96863 71474 46085 31471 16857 2243 -12371 -15532 -18693
3904 -18693 -21855 -25016 -24360 -23704 -23048 -22392 22166 66724 4390 -57943 -90691 -123439 -110375 -97312 -96656 -96000 11548
3921 11548 119097 80623 42149 3674 -34799 -40824 -46848 -52873 -58897 -101398 -143899 -79507 -15114 20645
3935 20645 56405 92165 127925 19094 -89736 -122216 -154695 -125139 -95582 -142378 -189173 -210557 -231942
3948 -231942 -176975 -122007 -164388 -206770 -249151 -291532 -180732 -69933 40866 151666 159391 167115 174840
3961 174840 182564 184891 187217 189544 191870 207558 223246 132041 40836 13099 -14637 3436 21510 91121 160733
3976 160733 92911 25089 58314 91539 48412 5285 -85561 -176408 -160362 -144316 -65280 13755 46980 80205
3990 80205 133473 186740 138841 90942 46891 94462 142032 97981 26252 -45476 -16039 13397 -51411 -116221
4004 -116221 -49324 17573 71109 33022 -5063 48471 57389 66307 80951 95595 37705 -20185 -78075 -135965
4018 -135965 -164985 -194005 -223024 -252044 -191350 -130656 -115774 -100891 34305 169501 218802 176480 111253
4031 111253 46026 -24927 -95880 -85710 -75540 -65369 -55199 37048 129297 196731 172543 77968 -16606 -71096
4045 -71096 -125586 -38825 47935 88884 -22869 -137725 -160959 -107840 -54722 -107542 -160362 -167371 -174380 -179241
4059 -179241 -184103 -188964 -193826 -206322 -218819 -124423 -30027 8774 47577 86379 125181 156348 187515 142331
4073 142331 97146 101112 105079 109046 113013 64487 15962 13248 10534 -48489 -107512 -90184 -72856 -85114 -97372
4088 -97372 -109630 -121888 -49532 22822 -42255 -107333 -152369 -197405 -166088 -134772 -45238 44296 139557 143196
4102 143196 19899 -103396 -125526 -147657 -102144 -56631 -11118 34394 29324 24254 19183 14113 -28655 -71424
4116 -71424 -114193 -156962 -104291 -51620 1050 53721 1915 -49890 -101696 -153502 -117504 -81505 -45506 -9507
4130 -9507 2153 13815 25476 37138 -828 -38795 -76763 -114730 -73840 -32950 7939 48829 70631 92433
4144 92433 43610 -5212 -37811 21211 126046 139259 72302 5345 -21527 -48399 -66622 -84845 -1902 81040
4158 81040 79042 -14578 -56661 -98744 -145121 -191499 -157708 -32294 67351 75374 5136 -19290 -15681 -57883
4172 -57883 -97223 -90751 -77598 -64445 -48429 -32413 -56482 -80550 -104619 -128688 -97401 -66115 5255 76626
4186 76626 133234 98220 -17918 -88245 -44999 -1753 -62536 -123319 -145927 -168534 -145330 -122126 -94151 -66175
4200 -66175 -84010 -101845 -120963 -140081 -127704 -161137 -200298 -147836 -52425 -48638 -79924 -111210 -71871 -32532
4214 -32532 -61910 -91287 -74854 -58420 -36230 -14041 -37662 -61283 -96358 -131432 -60568 56107 71854 -4019
4228 -4019 -54125 -58420 -42673 -72736 -131432 -98505 -68770 -130656 -161048 -145628 -132118 -118607 -102233 -85859
4242 -85859 -24629 36601 21480 6359 5553 4748 3943 3137 -59703 -122544 -93763 -64982 -94419 -123856 -107482
4257 -107482 -91108 -54215 -17321 19571 56465 14143 -28178 -70499 -112821 -132893 -152965 -81415 -9865 53094
4271 53094 116055 87393 58731 50350 41970 79400 116830 57866 -1097 -60061 -119025 -96059 -73094 -50129
4285 -50129 -27164 -4198 18766 41731 64696 6538 -51620 -109779 -167938 -138292 -108646 -78999 -49353 -56511
4299 -56511 -63669 -70827 -77985 -85143 -92301 -99459 -106617 -93017 -79417 -65817 -52217 -41480 -30743 -65817 -100891
4314 -100891 -146911 -192931 -147329 -101726 -135339 -168952 -202564 -236177 -169578 -102979 -128002 -153025 -143690 -134355
4328 -134355 -125019 -115684 -59404 -3125 -38467 -73810 -21348 31113 129387 227660 216654 205649 148833 92016
4342 92016 82919 73823 110537 147252 77581 7909 -15950 -39809 20317 80444 48949 17453 -39332 -96119
4356 -96119 -61283 -26448 -37423 -48399 -13564 21271 -3900 -29073 -8434 12204 29026 45847 62668 79489
4370 79489 67202 54914 42626 30338 -8672 -47683 -86694 -125705 -120426 -115147 -109868 -104589 -54454 -4318 45817
4385 45817 95953 28697 -38557 -60001 -81445 -8404 64637 -15025 -94687 -120784 -146881 -172978 -199075 -146911
4399 -146911 -94747 -42583 9580 -24151 -57883 -91615 -125348 -81773 -38199 5374 48949 39673 30398 -24688
4413 -24688 -79775 -139634 -199492 -167729 -135965 -89408 -42852 -87917 -132983 -89289 -45596 -47713 -49831 11996
4427 11996 73823 44028 14232 -1246 -16725 -32204 -47683 -84636 -121590 -158543 -195496 -185683 -175871 -166059
4441 -166059 -156246 -129195 -102144 -120904 -139664 -68710 2243 -79507 -161257 -148283 -135309 -168146 -200984 -152697
4455 -152697 -104410 -56124 -7837 -10492 -13146 -15800 -18455 -75510 -132565 -97998 -63431 23866 111164 152650
4469 152650 194137 102007 9878 9371 8864 1646 -5570 -58599 -111628 -75898 -40167 -4437 31292 25983 20675
4484 20675 15366 10057 -11476 -33009 -8732 15545 55331 95118 -17799 -130716 -115744 -100772 -39988 20794
4498 20794 -7658 -36111 -64564 -93017 11190 115399 127985 140571 68066 -4437 14680 33798 81547
4511 81547 129297 136962 53005 -15681 -84368 -67159 -49950 -70917 -91884 -112851 -133818 -130090 -126362 -122633 -118905
4526 -118905 -108496 -98087 -41867 14352 -31071 -76494 -30295 15903 -26657 -69217 -25881 17453 53601 -1872
4540 -1872 -5809 -9746 -32771 -55796 -78821 -101845 -113418 -124990 -136562 -148134 -125348 -102561 -79775 -56989
4554 -56989 -74406 -91824 -160780 -138113 -102084 -66055 -115923 -165790 -147895 -130000 -203728 -277455 -197524 -117593
4568 -117593 -72020 -118070 -114104 -18514 25536 -22034 -84875 -147716 -164746 -181776 -215031 -156664 -6674 51693
4582 51693 -23555 -98803 -88156 -77508 -28804 19899 22792 25685 -61134 -147955 -194691 -149804 -105872 -61940
4596 -61940 -58092 -54245 -55169 -56094 -57018 -57943 -67726 -77508 -1395 74717 38212 -89915 -166506 -90393 48233 95237
4612 95237 -10462 -116161 -145509 -174857 -204205 -233553 -161615 -89677 -113179 -228303 -289981 -260037 -195734
4625 -195734 -131432 -120098 -108765 -97431 -86098 -134892 -183685 -140857 -98028 -72170 -46311 -66264 -86217 -46043
4639 -46043 -5869 -112672 -219475 -275218 -239339 -197733 -247749 -292994 -246616 -165880 -85143 -156873 -228602
4652 -228602 -248793 -268985 -254818 -149029 -48966 51096 9431 -32234 11996 56226 79460 11071 -51590
4665 -51590 -114253 -121649 -129046 -136442 -143839 -166506 -189173 -125944 -62715 -4497 -37901 -117116 -104709 -26448 51812
4680 51812 -11178 -74168 -127495 -89200 -16546 56107 121125 94521 27833 -38855 28310 95476 71019 46563
4694 46563 -8434 -63431 -32532 -1633 45906 1825 -82340 -166506 -99877 -33248 -58241 -83235 -123021 -162808
4708 -162808 -110972 -59136 27057 113251 104006 3137 -46431 -4377 -19588 -34799 -19469 -4139 11190 26520
4722 26520 7969 -10581 -23406 -36230 -58599 10653 28369 46085 4688 -36708 -129642 -130955 -96000 -61045
4736 -61045 -20364 20317 18527 16738 14948 13159 47636 82114 116592 151069 205470 259871 274187 196880 103349
4751 103349 9818 -43627 -97073 -8314 80444 134845 97623 28906 51812 63265 74717 67709 60700 7880
4765 7880 -44939 -93942 -142944 -100324 -57704 -77836 -97968 -118100 -138232 -71513 -4795 16111 37019 11876
4779 11876 -13265 53214 119693 77372 35050 84351 133652 97772 61893 -19797 -101488 -107781 -114074 -74556
4793 -74556 -35037 -55825 -76613 -143213 -209812 -240144 -270476 -209186 -147895 -174887 -201878 -76166 49545
4806 49545 47368 45191 43013 40836 53214 65591 -13653 -92898 -156873 -220847 -132118 -43388 -45327 -47266 -49204
4821 -49204 -51143 -33994 -16844 -91317 -165790 -152906 -140021 -127137 -114253 -88007 -61761 -35515 -9269 -19051
4835 -19051 -28834 -38616 -48399 -25732 -3065 -72020 -140976 -106975 -72975 -38974 -4974 23299 51573 79847
4849 79847 108121 62191 16260 -29669 -75599 -87172 -98744 -110316 -121888 -41897 38092 118083 198073 142539
4863 142539 87005 31471 -24062 -74824 -125586 -84726 -43866 23717 91300 67261 43222 33738 24254 14769
4877 14769 5285 -36648 -78582 -120516 -162450 -148551 -134653 -120754 -106856 -133042 -159229 -93793 -28357 -15711
4891 -15711 -3065 9580 22225 -9030 -40287 -71543 -102800 -68680 -34560 -440 33678 30576 27475 24373
4905 24373 21271 22941 24611 -19529 -63669 -117354 -171039 -133102 -95165 -86336 -77508 -114491 -151474 -108288 -65101
4920 -65101 -113537 -161973 -113418 -64862 -62119 -59375 14948 89272 71974 54675 23061 -8553 -40167 -71782
4934 -71782 -124393 -177004 -137993 -98982 -91347 -83712 -167699 -251686 -245960 -240233 -234507 -228781 -291771 -354761 -326129
4949 -326129 -297497 -231644 -165790 -191559 -217328 -214793 -212258 -163911 -115565 -70082 -24599 -70738 -208500 -277067
4963 -277067 -192931 -57257 -13206 -115177 -217149 -172143 -127137 -77956 -28774 -25404 -22034 23329 68693
4976 68693 68245 67798 -14727 -97252 -179778 -262304 -221712 -181120 -140528 -99937 -91317 -82698 -74078 -65459 -122693
4991 -122693 -179927 -191350 -202773 -127823 -52873 -69545 -86217 -128658 -171099 -121918 -72736 26192 125122 71347
5005 71347 17573 -73422 -164418 -163792 -163166 -177332 -191499 -159855 -128211 -115654 -103098 -4646 93805 52140 -81147
5020 -81147 -117086 -153025 -134563 -116102 -21288 73524 15157 -43210 -82489 -30146 -29341 -120158 -205249 -198717
5034 -198717 -158543 -118368 -72468 -26567 -30295 -34023 -43478 -52932 -51411 -141513 -180076 -218640 -205666 -192692 -179718
5049 -179718 -166745 -108974 -51203 841 52886 13308 -117891 -249091 -288669 -288639 -288609 -288580 -288550 -234119 -271311 -363858
5065 -363858 -456405 -366423 -276441 -186459 -96477 1139 98756 110478 30576 -19737 -70052 -116549 -163046 -199045
5079 -199045 -82340 76358 143434 66456 -10521 -16874 -23227 -46759 -70291 -17471 35348 -8702 -52754 4360
5093 4360 61475 96639 40180 -16278 18885 37198 55510 3197 -49115 -127197 -205278 -228005 -159109 -132446
5107 -132446 -105782 -119204 -132625 -113596 -94568 -75540 -56511 -70738 -84964 -99191 -113418 -127644 -141871 -79745
5121 -79745 -17620 -106528 -195436 -204175 -121291 -60359 -91049 -161823 -140976 -122484 -103993 -79775 -55557 -73333
5135 -73333 -91108 -108884 -126660 -97670 -68680 -116042 -163404 -194541 -225679 -256816 -287953 -279274 -270595 -261916
5149 -261916 -253237 -190157 -127077 -63998 -918 -9418 -17918 -66503 -115088 -132177 -57645 35975 129595 96281
5163 96281 -28655 -117325 -53290 53691 69051 -22481 -114014 -117742 -121470 -125198 -128927 -162241 -195556 -228870
5177 -228870 -262184 -276560 -290936 -305311 -319687 -314975 -310262 -259739 -209215 -171576 -133937 -172650 -211363 -194720
5191 -194720 -178078 -85084 7909 26222 44535 -13504 -71543 -94270 -116997 -139723 -162450 -239816 -317182 -287655
5205 -287655 -258128 -236237 -214345 -192454 -170562 -204831 -239100 -284822 -238921 -163434 -179569 -245333 -311097 -229645
5219 -229645 -148193 -91556 -126541 -126212 -125884 -85472 -45059 -26508 -7956 10594 29145 -2886 -34918 -168117
5233 -168117 -301315 -346708 -300480 -229437 -158394 -58719 40956 58552 -76554 -239398 -402243 -397113 -300360
5246 -300360 -220787 -141214 -107453 -73691 2064 -13802 -109839 -205875 -213152 -128807 -44462 -51739 -116132 -180524
5260 -180524 -174290 -168057 -129374 -90691 -52008 -13325 35855 85037 57866 30696 10206 -10283 -30773 -51262
5274 -51262 -81117 -110972 -49204 12562 -2021 -16606 -31190 -45774 -126690 -207605 -193080 -86933 -21825 -48339
5288 -48339 -49085 -4019 -26955 -141513 -224575 -261827 -258993 -210349 -130209 -141692 -152220 -116937 -87380 -103635
5302 -103635 -177153 -250672 -238295 -225917 -208559 -237012 -294097 -259560 -236475 -259202 -250433 -241665 -218819 -195973
5316 -195973 -178853 -161734 -144614 -219117 -296483 -282227 -251925 -267434 -305848 -252640 -139306 -71782 -93972
5329 -93972 -161973 -233075 -212556 -154815 -97073 -83235 -69396 -55557 -41718 -40853 -39988 -39124 -38259 -12579 13099
5344 13099 38778 64458 -6972 -78403 -115475 -60926 -52187 -135070 -217954 -209215 -195019 -272444 -344144 -324220
5358 -324220 -215538 -106856 -113656 -166267 -191917 -125944 -28476 68991 137827 115041 -8911 -132863 -131253
5371 -131253 -129642 -128032 -126421 -94270 -62119 -121590 -181061 -159646 -138232 -116818 -95403 -58719 -22034 14650
5385 14650 51335 51961 52587 -38408 -129404 -168862 -208321 -247779 -287237 -241516 -195794 -155799 -115804 -103486 -182790
5400 -182790 -327949 -427296 -354612 -281929 -206382 -130835 -156455 -182075 -207694 -233314 -180196 -127077 -73959
5413 -73959 -20841 -45983 -71126 -4646 61833 44445 27057 9669 -7718 -46103 -84487 -122872 -161257 -143332
5427 -143332 -125407 -107482 -89558 -52545 -15532 21480 58493 18527 -21437 -61403 -101368 -91705 -82042 -72378
5441 -72378 -62715 -87887 -113060 -138232 -163404 -137039 -110674 -84308 -57943 -45774 -33606 -113060 -192513 -186071
5455 -186071 -179629 -173187 -166745 -154815 -142885 -130955 -119025 -95642 -72259 -48876 -25494 -30415 -35336 -40257 -45178
5470 -45178 -107363 -169548 -140111 -110674 -32801 45071 31322 17573 -3811 -25195 -46580 -67964 -93524 -119084
5484 -119084 -144644 -170204 -64057 42089 29890 -135011 -274144 -260574 -189740 -118905 -111061 -103217 -95373
5497 -95373 -87529 -117891 -148253 -178615 -208977 -197345 -185713 -174082 -162450 -129821 -97193 -64564 -31936 -43210
5511 -43210 -54483 -65757 -77031 -131253 -185475 -148074 -110674 -143899 -177124 -210349 -243574 -193766 -143958 -94151
5525 -94151 -44343 -64206 -84070 -103933 -123797 -172113 -220430 -222935 -225440 -234626 -243812 -100295 43222 57419
5539 57419 71616 -5809 -83235 -67129 -51024 -34918 -18813 -68441 -118070 -76077 -34083 -40764 -47445 -8314
5553 -8314 30815 82353 133890 93805 53721 29861 6001 -109481 -224963 -210259 -195556 -89229 17096
5566 17096 42298 67500 1080 -65340 -72110 -78880 -131462 -184043 -205129 -226216 -247302 -268388 -232926 -197464
5580 -197464 -162002 -126541 -137844 -149148 -160451 -171755 -200238 -228721 -211393 -194064 -230182 -266300 -210796 -155292
5594 -155292 -158602 -161913 -211035 -260156 -168981 -77806 -78254 -78701 -71752 -64803 -57854 -50904 -73542 -96179 -118816 -141453
5610 -141453 -181747 -222040 -216522 -211005 -176855 -142706 -200178 -257651 -228512 -199373 -124423 -49473 -78552 -107632
5624 -107632 -136711 -165790 -164030 -162271 -160511 -158751 -118816 -78880 -130567 -182254 -243007 -303761 -272892 -242023
5638 -242023 -200656 -159288 -117921 -76554 -143541 -210528 -231703 -252879 -271192 -289504 -216194 -142885 -153085 -163285
5652 -163285 -173485 -183685 -169071 -154457 -139842 -125228 -147686 -170145 -192603 -215061 -195526 -175990 -156455 -136920
5666 -136920 -131223 -125526 -119830 -114133 -68352 -22571 -68412 -114253 -168176 -222100 -270297 -318494 -280795 -151474
5680 -151474 -22153 15545 27952 40359 47040 53721 18408 -16904 -52217 -87529 -112672 -137814 -162957 -188099
5694 -188099 -210379 -232658 -209126 -185594 -106230 -26865 12413 -39929 -97044 -154158 -125377 -96596 -147269 -197942
5708 -197942 -208529 -127495 -96089 -64684 -73363 -82042 -97640 -113239 -83026 -52813 304 53422 14918 -23585
5722 -23585 -63133 -102681 -142228 -181776 -177422 -173067 -168713 -164359 -123498 -82638 -41778 -918 -23048 -45178 -67308
5737 -67308 -89438 -57406 -25374 -84964 -144555 -112523 -80491 -94270 -108049 -127793 -147537 -121470 -95403 -126600
5751 -126600 -157797 -143183 -128569 -119711 -110853 -147806 -184759 -219803 -254848 -289892 -324936 -305341 -285746 -260425
5765 -260425 -235103 -208828 -90929 -18843 -38378 -117325 -196271 -189322 -182373 -128658 -74943 -21229 32485 -52664
5779 -52664 -137814 -188606 -147776 -64952 -73750 -116907 -160064 -116788 -73512 -30236 13039 3823 -5391 -14607 -23823
5794 -23823 -75033 -126242 -131641 -137039 -103307 -69575 -60657 -143362 -220698 -298034 -243663 -189292 -157827 -126362
5808 -126362 -54811 16738 106899 105437 -12460 -130358 -152816 -175275 -151922 -128569 -94866 -61164 -103814
5821 -103814 -146464 -177660 -208857 -240054 -271251 -256160 -241068 -220251 -199433 -219654 -148253 -76852 -97073 -159885
5835 -159885 -222696 -214882 -207068 -165850 -124632 -133042 -233075 -320701 -316705 -201998 -87291 -87112 -86933 -86754 -86575
5850 -86575 -104738 -122902 -141065 -159229 -120128 -81028 -41927 -2826 -18127 -33427 -48727 -64027 -146136 -228244
5864 -228244 -203459 -178675 -214972 -251269 -211214 -171159 -148283 -125407 -102531 -79656 -72766 -65877 -58987 -52097
5878 -52097 -3214 45668 88825 131981 163894 104185 44475 76388 46264 16141 -59792 -44104 -23 44057
5892 44057 -68382 -180822 -208321 -144197 -131611 -119025 -109302 -99579 -38318 -68680 -109540 -150400 -196987 -243574
5906 -243574 -235760 -227945 -174320 -120695 -123379 -126063 -52396 21271 79639 138006 89481 40956 -15204 -71364
5920 -71364 -51173 -30981 -34650 -38318 -87798 -137278 -156216 -175155 -194094 -213033 -205129 -197226 -189322 -181418 -168743
5935 -168743 -156067 -143392 -130716 -169578 -208440 -170950 -133460 -138918 -144376 -149834 -155292 -171934 -188576 -205219
5949 -205219 -221861 -238503 -255146 -266062 -276978 -266420 -164239 -62059 -51501 -139246 -226991 -213570 -200149
5962 -200149 -210707 -221265 -231823 -242381 -299704 -357028 -420078 -391506 -280378 -169250 -107751 -137874 -153681
5975 -153681 -169488 -114670 -59852 -70499 -81147 -91794 -102442 -84457 -66473 3048 -19051 -151862 -284673
5988 -284673 -306773 -237251 -180136 -123021 -65906 -8792 -3334 -89498 -175662 -170204 -112254 -54304 3645 61594
6002 61594 93776 34334 -105275 -244886 -263288 -190068 -156932 -215419 -280109 -253177 -151802 -50427 -7270
6015 -7270 -55736 -159557 -263377 -268895 -274413 -279930 -285448 -206024 -126600 -148343 -170085 -199105 -136502 -49085
6029 -49085 38331 37943 37556 -33457 -104470 -201491 -206889 -126391 -45894 -80878 -115863 -150848 -185833 -177989 -170145
6044 -170145 -116490 -62834 13725 90286 75224 60163 55838 51514 1378 -48757 -149476 -250195 -259291 -268388
6058 -268388 -251835 -235282 -218730 -202177 -204712 -207247 -118160 -29073 -59524 -89975 -120426 -150878 -124065 -97252
6072 -97252 -162062 -226872 -190783 -154695 -118607 -82519 -71245 -59971 -48697 -37423 -66950 -96477 -126004 -155530
6086 -155530 -158334 -161137 -163941 -166745 -119800 -72856 -25911 21032 -73273 -167580 -261886 -356193 -304476 -252760
6100 -252760 -201043 -149327 -168236 -187145 -206054 -224963 -166334 -107706 -140700 -173694 -205733 -237773 -224001 -210229
6114 -210229 -154941 -99653 -135988 -172322 -214382 -256443 -252693 -248942 -245788 -242634 -239480 -236326 -208358 -180390 -152421
6129 -152421 -124453 -168064 -211676 -209476 -207277 -243253 -279229 -223584 -167938 -120009 -72080 -69963 -67845 -21825
6143 -21825 24194 -21407 -67010 -111658 -156306 -155143 -153979 -111777 -69575 -118995 -168415 -100802 -33188 -57197
6157 -57197 -81207 -86128 -91049 -95970 -100891 -93166 -85442 -77717 -69992 -59404 -48817 -38229 -27641 -55788 -83936
6172 -83936 -66272 -48608 10094 68797 -25203 -119204 -115617 -112031 -108444 -104858 -53551 -2245 49060 100367 97988
6187 97988 95610 93231 90853 -22235 -135324 -95709 -56094 19310 94715 78498 62280 57516 52751 47987 43222
6202 43222 12324 -18574 -49473 -80371 -76912 -73452 -69992 -66533 -92182 -117832 -143481 -169131 -151832 -134534 -163046
6217 -163046 -191559 -289266 -386972 -393056 -399141 -365140 -331140 -205517 -79894 -56869 -33845 -56631 -79417 -82161
6231 -82161 -84905 -87649 -90393 -72885 -55378 -37871 -20364 -52485 -84607 -116728 -148850 -148999 -149148 -149297 -149446 -122872
6247 -122872 -96298 -69724 -43150 -37573 -31995 -26418 -20841 -49622 -78403 -107184 -135965 -133967 -131969 -129970 -127972
6262 -127972 -125974 -123976 -121977 -119979 -107065 -94151 -81236 -68322 -66861 -65399 -63938 -62476 -78433 -94389 -110346
6277 -110346 -126302 -73542 -20781 -59643 -98505 -145479 -192454 -147806 -103158 -183536 -263914 -252670 -241426 -231137
6291 -231137 -220847 -164746 -108646 -53499 1646 56793 111939 88198 64458 40717 16976 -33487 -83950 -134414
6305 -134414 -184878 -182373 -179868 -177362 -174857 -151355 -127853 -18455 90942 80802 -20960 -122723 -132863 -165909
6319 -165909 -198956 -226275 -253595 -169727 -85859 -36350 -78463 -120576 -71066 -78821 -86575 -105007 -123439 -50248
6333 -50248 22941 -27939 -78821 -129702 -180583 -226931 -273279 -319627 -365975 -362695 -359414 -356133 -352852 -326935 -301017
6348 -301017 -275099 -249181 -223263 -197345 -171427 -145509 -158483 -171457 -184431 -197405 -183655 -169906 -156157 -142407
6362 -142407 -124900 -107393 -89886 -72378 -73959 -75540 -77121 -78701 -108437 -138172 -167908 -197643 -154844 -112046
6376 -112046 -69247 -26448 -60806 -95165 -129523 -163881 -223054 -282227 -249777 -217328 -175334 -133341 -97073 -60806
6390 -60806 -70350 -171517 -272683 -282227 -210349 -138471 -152488 -166506 -226335 -286164 -340266 -394369 -395025 -304059
6404 -304059 -178734 -53410 -40704 -119621 -198538 -185833 -123856 -61880 -85800 -109719 -72557 -35395 -89856
6417 -89856 -144316 -192096 -239875 -287655 -335435 -369853 -404271 -438689 -473107 -431739 -390372 -297467 -296185 -321626
6431 -321626 -347066 -286611 -226156 -245154 -264153 -283151 -302150 -296334 -290518 -284702 -278886 -267702 -256518 -245333
6445 -245333 -234149 -133251 -32353 -26895 -113060 -225231 -245781 -170890 -96000 -91735 -87470 -83205 -78940 -103068
6459 -103068 -127197 -151325 -175453 -142318 -109182 -76047 -42911 -44611 -46311 -48011 -49711 -125855 -201998 -182701
6473 -182701 -71782 -19678 -59196 -133072 -206949 -198747 -190545 -182343 -174141 -175483 -176825 -178168 -179510 -175125 -170741
6488 -170741 -166357 -161973 -180941 -199910 -127256 -54603 -85024 -115446 -59971 -4497 21390 -44343 -110077 -84189
6502 -84189 -16307 51573 33559 15545 -22034 -59613 -97193 -134772 -191440 -248107 -304775 -361442 -341758 -322073
6516 -322073 -216493 -110912 -77866 -136442 -195019 -161973 -98773 -35574 -58271 -80968 -78850 -76733 -74615 -72498
6530 -72498 -115475 -158453 -252969 -255862 -214852 -173843 -218730 -263616 -203161 -142706 -116609 -182134 -201849 -129941
6544 -129941 -63759 -89200 -125616 -162032 -118279 -74526 20764 24433 -11983 -48399 -90840 -133281 -175722 -218163
6558 -218163 -237698 -257234 -276769 -296304 -209186 -122067 -126570 -131074 -131760 -132446 -133132 -133818 -6614 120588 91270
6573 91270 -29669 -135339 -149386 -214972 -280557 -352345 -332512 -272593 -212675 -189024 -165373 -227617 -289862
6586 -289862 -290906 -200328 -161287 -122246 -102293 -82340 -62387 -42434 -64117 -85800 -107482 -129165 -196659 -264153
6600 -264153 -240025 -215896 -231375 -246854 -262334 -277813 -228393 -178973 -129553 -80133 -51113 -22093 -84696 -147299
6614 -147299 -221354 -295410 -277843 -260276 -240353 -220430 -200506 -180583 -174022 -167460 -160899 -154337 -152071 -149804 -147537
6629 -147537 -145271 -106737 -68203 -29669 8864 33201 57538 41791 -65578 -171039 -276500 -296066 -315631
6642 -315631 -276500 -237370 -198240 -159109 -148611 -138113 -127614 -117116 -153681 -190247 -226812 -263377 -235044 -206710
6656 -206710 -178376 -150043 -177183 -204324 -225738 -247153 -255205 -171636 -88066 -96119 -144257 -192394 -154636 -116877
6670 -116877 -79119 -41360 -95224 -149088 -231584 -314080 -304954 -295827 -309606 -323385 -190187 -56989 27415 20197
6684 20197 -27104 -74406 -72080 -69754 -67427 -65101 -78880 -92659 -106439 -120218 -114909 -109600 -104291 -98982 -110853
6699 -110853 -122723 -134593 -146464 -131611 -116758 -101905 -87052 -93673 -100295 -106916 -113537 -133520 -153502 -167759
6713 -167759 -182015 -241068 -208500 -135846 -63192 -116519 -169846 -188815 -116161 -105782 -187026 -211005 -234984 -178794
6727 -178794 -122604 -66413 -10223 -64266 -118309 -172352 -226395 -274711 -323027 -422881 -431113 -378502 -325891 -267553
6741 -267553 -209215 -162330 -115446 -74287 -33129 -35246 -128986 -222726 -224844 -160153 -95463 -116668 -137874 -117563
6755 -117563 -97252 -76942 -56631 -110763 -164895 -133132 -101368 -53380 -97014 -180732 -264451 -252730 -241009 -229288
6769 -229288 -217566 -143332 -69098 -86486 -103874 -119353 -134832 -150311 -165790 -217268 -268746 -320224 -371702 -291473
6783 -291473 -211243 -165373 -211124 -287416 -272086 -222398 -172710 -149744 -126779 -103814 -80849 -115863 -150878 -94270
6797 -94270 -37662 -26865 -16069 -5272 5523 35408 65293 3555 -58182 -89379 -120576 -151772 -182969 -206740
6811 -206740 -230510 -162659 -94807 -98535 -102263 -60180 -18097 -11327 -4556 -89408 -174260 -147448 -120635 -93822
6825 -93822 -67010 -80163 -93315 -106468 -119621 -144227 -168832 -193438 -218044 -216880 -215717 -214554 -213391 -254221 -295052
6840 -295052 -335882 -376712 -355865 -335017 -314169 -293322 -261021 -228721 -196420 -164120 -132058 -99996 -67934 -35873
6854 -35873 -38169 -40466 -42762 -45059 -66443 -87828 -109212 -130597 -100444 -70291 -131760 -193229 -187175 -181120 -175066
6869 -175066 -169011 -182045 -195078 -208112 -221145 -289862 -358579 -335673 -312768 -330901 -349035 -321357 -293680 -224009
6883 -224009 -154337 -176289 -198240 -160064 -121888 -83712 -45536 -16546 12443 -50189 -112821 -135369 -157916 -134653
6897 -134653 -111389 -179748 -248107 -270655 -293202 -300480 -307757 -223412 -139067 -75420 -11774 -39750 -67726 -142467
6911 -142467 -217208 -246139 -275069 -230988 -186906 -234447 -281988 -263676 -245363 -181239 -117116 -153443 -189769 -180285
6925 -180285 -170801 -167997 -165194 -208201 -251209 -288252 -325294 -209633 -93972 -127197 -160422 -193647 -226872 -203608
6939 -203608 -180345 -202892 -225440 -273757 -322073 -278767 -235461 -218163 -200864 -183566 -166267 -168057 -169846 -171636
6953 -171636 -173425 -101488 -29550 -49234 -68919 -109600 -150281 -190962 -231644 -213629 -195615 -177601 -159587 -122484
6967 -122484 -85382 -48280 -11178 -60776 -110375 -159974 -209573 -199999 -190426 -180852 -171278 -129255 -87231 -136830
6981 -136830 -186429 -220758 -255086 -289415 -323743 -356759 -389776 -331170 -272564 -218730 -164895 -111061 -57227 -74496
6995 -74496 -91765 -154844 -217924 -175066 -132207 -180971 -229735 -219117 -208500 -289504 -370509 -340803 -311097 -235581
7009 -235581 -160064 -208142 -256219 -258486 -260753 -248704 -236654 -316227 -395800 -370867 -345933 -366811 -387688 -409520
7023 -409520 -431352 -300480 -169608 -163404 -157201 -150997 -144793 -68919 6955 -8792 -24539 -78522 -132506 -140678
7037 -140678 -148850 -104530 -60210 -107512 -154815 -257830 -360846 -372239 -383632 -262363 -141095 -111449 -81803
7050 -81803 -89796 -97789 -151593 -205398 -181896 -158394 -180703 -203012 -121769 -40525 -5093 30338 8506 -13325
7064 -13325 -75242 -137158 -205756 -182731 -134892 -87052 -121291 -155530 -189769 -224009 -197643 -171278 -144913 -118547
7078 -118547 -118905 -119263 -220787 -322312 -412980 -412025 -325175 -238325 -233553 -228781 -183924 -139067 -107572 -167699 -252640
7093 -252640 -337582 -288908 -240233 -241188 -333764 -364991 -304596 -225112 -145628 -167311 -188994 -210677 -232360 -229705
7107 -229705 -227051 -224396 -221742 -184729 -147716 -110703 -73691 -122276 -170860 -270983 -279483 -221175 -162867 -98833
7121 -98833 -34799 -61910 -89021 -167669 -154695 -27194 100307 130460 7909 -104052 -63312 40419 52528
7134 52528 -67070 -186668 -235640 -284613 -260097 -235581 -165253 -94926 -125765 -156604 -187443 -218282 -205935
7147 -205935 -193587 -181239 -168892 -129821 -90751 -51680 -12609 -23406 -34202 -44999 -55796 -78045 -100295 -122544
7161 -122544 -144793 -143869 -142944 -142020 -141095 -140171 -139246 -138321 -137397 -76584 -15771 45042 105855 55957 6060 -43836 -93733
7178 -93733 -120247 -146762 -173276 -199791 -161406 -123021 -84636 -46252 -17888 10474 38838 67202 15396 -36409
7192 -36409 -134027 -231644 -244290 -256935 -193229 -129523 -130716 -131909 -133102 -134295 -188934 -243574 -298213 -352852 -312052
7207 -312052 -271251 -230451 -189650 -200864 -212079 -223293 -234507 -226633 -218759 -210886 -203012 -213033 -223054 -233075
7221 -233075 -243097 -257890 -272683 -287476 -302269 -196868 -91466 -10879 -21915 -56810 -91705 -132327 -172948
7234 -172948 -195198 -217447 -239696 -261946 -225977 -190008 -154039 -118070 -178734 -239398 -168355 -97312 -60627 -115565
7248 -115565 -164776 -213987 -210707 -207426 -204145 -200864 -173724 -146583 -119442 -92301 -80282 -68263 -56243 -44224
7262 -44224 -41748 -39273 -137963 -236654 -242291 -156306 -76047 4211 2392 573 -77598 -155769 -173336 -190903 -248554
7277 -248554 -306206 -366721 -335614 -249151 -162688 -159736 -156783 -153830 -150878 -152697 -154516 -156336 -158155 -171278 -184401
7292 -184401 -197524 -210647 -135965 -61283 -41957 -114253 -200387 -286522 -271490 -256458 -225202 -193945 -92063
7305 -92063 9818 -10700 -122842 -234984 -255504 -217805 -180106 -136681 -93256 -89915 -86575 -140499 -102800 -44104
7319 -44104 -77031 -159587 -242142 -267911 -293680 -273637 -253595 -290816 -328038 -340445 -261230 -201103 -140976 -182015
7333 -182015 -223054 -236416 -249777 -263139 -276500 -235223 -193945 -82042 29861 53005 -15472 -129762 -152429
7346 -152429 -91108 -29788 -124990 -220191 -231405 -150997 -70589 -81803 -58897 -35992 -18813 -1633 -56989 -112344
7360 -112344 -121888 -131432 -129523 -127614 -202057 -276500 -249777 -223054 -242142 -261230 -295350 -329470 -317778 -306087
7374 -306087 -252402 -198717 -99221 274 58731 117188 68752 20317 -41480 -103277 -58182 -13086 39285 91658
7388 91658 67679 43699 4450 -34799 -28237 -21676 -72617 -123558 -128688 -133818 -161853 -189889 -217924 -245960 -212198
7403 -212198 -178436 -144674 -110912 -126779 -142646 -158513 -174380 -200029 -225679 -251328 -276978 -237728 -198478 -159229
7417 -159229 -119979 -151892 -183804 -215717 -247630 -207008 -166387 -125765 -85143 -115625 -146106 -176587 -207068 -212735
7431 -212735 -218401 -183983 -149565 -71663 -85382 -154457 -223531 -202892 -182254 -207426 -232598 -210528 -188457 -185475
7445 -185475 -274114 -407611 -449485 -355835 -262184 -210050 -249539 -294753 -248346 -179987 -203250 -266599 -238325
7458 -238325 -157558 -76792 -66652 -56511 -54006 -51501 -150162 -248823 -253893 -167341 -151415 -227110 -224545 -130358
7472 -130358 -41897 -45059 -49175 -53290 -63133 -72975 -109540 -146106 -176945 -207784 -250344 -201282 -203757 -206233 -214435
7487 -214435 -222637 -154487 -86336 -168981 -251626 -309457 -275665 -215151 -154636 -134206 -113775 -85949 -58122 -100921
7501 -100921 -143720 -198926 -162509 -101279 -40048 -33695 -27343 -20990 -14637 -123767 -232896 -235133 -237370 -288043
7515 -288043 -338715 -364574 -298810 -268358 -237907 -247540 -257174 -265376 -273578 -281779 -289981 -279095 -268209 -257323 -246437
7530 -246437 -278618 -310799 -348707 -294992 -211691 -128390 -150072 -263377 -355686 -356372 -307429 -258486 -262990 -267493
7544 -267493 -317808 -368123 -361054 -353986 -270565 -187145 -133311 -79477 -101995 -124512 -117683 -110853 -104023 -97193 -95135
7559 -95135 -93077 -91019 -88961 -117444 -145927 -174410 -202892 -166476 -130060 -93644 -57227 -134623 -212019 -289415
7573 -289415 -366811 -318226 -269641 -221056 -172471 -187533 -202594 -217656 -232717 -256369 -280020 -273130 -312052 -366721
7587 -366721 -345038 -274681 -204324 -171188 -92242 1020 17931 -77777 -219296 -294008 -292367 -254460 -262363 -287446
7601 -287446 -236177 -185385 -210945 -219326 -181896 -182641 -259739 -336836 -337582 -279632 -267493 -359384 -374923 -231077
7615 -231077 -87231 -45506 -80133 -107124 -88305 -74257 -106021 -99609 -93196 -89647 -86098 -55587 -25076 5434
7629 5434 35945 14918 -6107 -27134 -48160 -139813 -231465 -231495 -231524 -216284 -201043 -185803 -170562 -151206 -131849
7644 -131849 -204115 -276381 -276113 -275844 -275576 -275307 -198687 -122067 -137069 -152071 -165164 -178257 -191350 -204443 -175543
7659 -175543 -146643 -117742 -88842 -124841 -160839 -196838 -232837 -239010 -245184 -251358 -257532 -212168 -166804 -121440
7673 -121440 -76077 -31101 13874 -29908 -73691 -39213 41075 49784 -17858 -125348 -187026 -187622 -188219 -143004
7687 -143004 -97789 -155650 -289862 -303939 -211124 -140260 -145748 -130239 -114730 -103993 -93256 -76792 -60329 -43866
7701 -43866 -27402 -60568 -93733 -126898 -160064 -155053 -150043 -145032 -140021 -161734 -183447 -205159 -226872 -225202 -223531
7716 -223531 -221861 -220191 -281511 -342831 -312529 -282227 -263735 -245244 -226752 -208261 -195496 -182731 -169966 -157201
7730 -157201 -137278 -117354 -97431 -77508 -122484 -167460 -212436 -257412 -270774 -284136 -297497 -310859 -244051 -177243
7744 -177243 -110435 -43627 -55557 -67487 -79417 -91347 -130000 -168653 -115684 -62715 38689 140094 140332 48949
7758 48949 -92063 -233075 -278648 -232598 -173425 -114253 -202057 -289862 -268865 -247869 -226872 -205875 -182910
7771 -182910 -159944 -228602 -297259 -320105 -342951 -304715 -358102 -339193 -167580 -36052 3853 13218 22583 77760
7785 77760 41313 -84129 -209573 -188040 -166506 -104888 -43269 69886 91419 14650 -62119 -52992 -43866 -65280
7799 -65280 -86694 -16486 53721 35677 17632 -411 -18455 -57496 -96537 -135577 -174618 -179539 -184461 -189382
7813 -189382 -194303 -199224 -204145 -209066 -213987 -184311 -154636 -73422 -83831 -136234 -188636 -155143 -121649 -130388 -139127
7828 -139127 -142139 -145151 -158662 -80550 -2439 -15950 -70768 -125586 -82101 -38616 -78164 -163523 -201163 -147179
7842 -147179 -101786 -102203 -99758 -51501 -12788 -19886 1646 23180 -5630 -34441 -63252 -92063 -89379 -86694 -81147
7857 -81147 -75599 -63371 -5332 32664 -20960 -131849 -242739 -252462 -262184 -322968 -383751 -398723 -413695 -382856
7871 -382856 -352017 -275367 -198717 -191261 -183804 -130537 -77270 -58361 -39452 22404 84261 46145 -37781 -104530
7885 -104530 -79656 -56690 -79536 -116698 -153860 -234447 -315034 -319270 -323505 -285746 -247988 -210229 -172471 -204861
7899 -204861 -237251 -269641 -302031 -282883 -263735 -201640 -139544 -155948 -218163 -232658 -155530 -109898 -110077 -107393
7913 -107393 -58897 -53111 -93137 -104530 -115923 -130179 -144435 -158692 -172948 -204145 -235342 -266539 -297736 -256398
7927 -256398 -215061 -179450 -143839 -145181 -238146 -331110 -332452 -214494 -96537 -52068 -7599 -5600 -49413 -118995
7941 -118995 -96954 -27194 42566 11160 -20244 -11685 -3125 -40376 -77628 -94837 -112046 -86307 -60568 -92093
7955 -92093 -169429 -269671 -278290 -226782 -129463 -77001 -116161 -278081 -440001 -500754 -408804 -277723 -238265
7968 -238265 -305699 -373133 -414799 -456464 -498130 -539795 -465024 -390253 -315482 -240711 -195884 -151057 -207396 -263735
7982 -263735 -253267 -151176 -100623 -50069 -43896 -37722 -132714 -227707 -314110 -308890 -217775 -126660 -115416 -104172
7996 -104172 -138739 -173306 -215508 -257711 -299913 -342115 -264541 -186966 -57854 -20364 -80222 -140081 -199940
8009 -199940 -259798 -248793 -146165 -43538 -32532 -41569 -50606 -65369 -80133 -140707 -201282 -216045 -230809 -279930
8023 -279930 -329052 -301822 -274592 -215210 -155829 -96447 -37066 -10134 16797 -32622 -82042 -92808 -103575 -114342
8037 -114342 -125109 -159736 -194363 -228989 -263616 -254818 -246019 -237221 -228423 -211035 -193647 -176259 -158871 -107124
8051 -107124 -55378 -49443 -43508 -109153 -174797 -164090 -153383 -84249 -15114 -22332 -29550 -31995 -34441 -36887 -39332
8066 -39332 -111449 -183566 -148790 -114014 -171815 -229616 -268328 -215419 -140737 -157678 -224247 -290816 -225679 -160541
8080 -160541 -150758 -232598 -287237 -341877 -295350 -248823 -256697 -264570 -272444 -280318 -244111 -207903 -272862 -337821 -390372
8095 -390372 -351302 -256876 -162450 -98565 -34680 -102502 -170324 -236237 -210528 -129463 -48399 -77150 -105902 -94568
8109 -94568 -83235 -125348 -259083 -291652 -232598 -154457 -167938 -200506 -233075 -260872 -288669 -368004 -355716 -237102
8123 -237102 -118488 -162122 -205756 -185445 -165134 -194452 -315392 -380023 -353031 -337493 -321954 -309278 -296603
8136 -296603 -238116 -179629 -179182 -178734 -178287 -177839 -211750 -245661 -279572 -313483 -292994 -272504 -292099 -311694 -387599
8151 -387599 -371881 -275993 -180106 -115565 -142646 -164001 -185355 -147537 -109719 -178794 -247869 -286880 -325891 -288550
8165 -288550 -251209 -221503 -191798 -207903 -224009 -293739 -363470 -356849 -350228 -304476 -258725 -289325 -319926 -322371
8179 -322371 -324817 -327263 -329708 -279662 -229616 -179569 -129523 -156067 -182611 -209156 -235700 -223114 -210528 -197942
8193 -197942 -185355 -194720 -204085 -142825 -81564 -61343 -132744 -198419 -264093 -298631 -333168 -291353 -249539 -160959
8207 -160959 -72378 -60150 -47922 -85800 -123677 -161555 -199433 -215359 -231286 -247212 -263139 -242172 -221205 -200238
8221 -200238 -179271 -142079 -104888 -67696 -30504 -131700 -232896 -309278 -294038 -268299 -242560 -287446 -332333
8234 -332333 -253625 -174917 -142020 -109123 -151623 -194124 -236624 -279125 -312797 -346470 -273250 -200029 -193617 -187204
8248 -187204 -180792 -174380 -113984 -53589 -100086 -146583 -139634 -132684 -125735 -118786 -182701 -246616 -234179 -221742 -212168
8263 -212168 -202594 -294187 -385779 -431083 -384765 -283092 -181418 -154188 -126958 -145539 -164120 -186996 -209872
8276 -209872 -186936 -164001 -155381 -146762 -138142 -129523 -205487 -281451 -363142 -353210 -297467 -241725 -256607 -271490 -209066
8291 -209066 -146643 -84219 -21795 -76763 -131730 -238235 -253118 -224873 -196629 -162659 -128688 -52724 23240
8304 23240 -17232 -149327 -205785 -262244 -278618 -294992 -216880 -138769 -54931 -62715 -61462 -60210 -64684 -69157 -76494
8319 -76494 -83831 -91168 -98505 -85561 -72617 -59673 -46729 -88186 -129642 -94747 -59852 -50666 -41480 -32294 -23108
8334 -23108 -129404 -235700 -261827 -196331 -99579 -94449 -138948 -183447 -117235 -51024 -9627 -59852 -167759
8347 -167759 -275665 -278588 -189889 -128867 -159467 -190068 -129046 -70171 -102919 -185296 -267672 -258427 -249181 -285746
8361 -285746 -322312 -322610 -322908 -323206 -323505 -307578 -291652 -275725 -259798 -234567 -209335 -184103 -158871 -133639 -108407
8376 -108407 -83175 -57943 -119412 -180882 -242351 -303820 -254579 -205338 -156097 -106856 -143511 -180166 -216821 -253476
8390 -253476 -263407 -273339 -283271 -293202 -285955 -278708 -271460 -264213 -256965 -249718 -242470 -235223 -214852 -194482 -122574 -142288
8406 -142288 -182999 -223710 -270148 -316585 -281213 -245840 -210468 -175096 -187443 -199791 -166327 -132863 -184818 -236774
8420 -236774 -212377 -187980 -183625 -179271 -174917 -170562 -242918 -315273 -307459 -208022 -134355 -152309 -219893 -287476 -286820
8435 -286820 -286164 -245423 -204682 -204026 -294992 -315333 -244051 -78940 -5451 -42673 -79894 -85621 -91347 -142885 -194422
8450 -194422 -172948 -151474 -130000 -108526 -120456 -132386 -12609 107167 162522 126255 89988 53721 57538
8463 57538 -30266 -142885 -255504 -213987 -172471 -176766 -181061 -175811 -170562 -165313 -160064 -142706 -125348 -107989 -90631
8478 -90631 -99996 -109361 -118726 -128091 -124572 -121053 -117533 -114014 -91407 -68799 -122544 -176289 -227289 -278290 -283480 -288669
8494 -288669 -256637 -224605 -192573 -160541 -153323 -146106 -215240 -284374 -250433 -216493 -182552 -148611 -111360 -74108
8508 -74108 -113209 -152309 -154188 -156067 -203757 -251447 -266449 -281451 -250642 -219833 -135577 -51322 -16695 -73691
8522 -73691 -177332 -189352 -121202 -53052 -134742 -216433 -217954 -127853 -81893 -127555 -121679 -115804 -93703 -163225
8536 -163225 -288102 -412980 -403704 -394428 -425238 -456047 -457270 -366870 -276471 -277693 -279871 -282048 -244140 -206233
8550 -206233 -159736 -113239 -143093 -172948 -193557 -214166 -188964 -163762 -154785 -145807 -136830 -127853 -164687 -201521
8564 -201521 -192543 -183566 -145957 -108347 -147090 -185833 -162688 -139544 -116400 -93256 -144555 -195854 -247153 -298452
8578 -298452 -281988 -265525 -203250 -140976 -93017 -45059 -73452 -101845 -187204 -272564 -312112 -351659 -295767 -239875
8592 -239875 -183983 -128091 -111807 -95523 -79238 -62954 -63848 -64743 -65638 -66533 -59285 -52038 -130686 -209335 -274621 -248286
8608 -248286 -181866 -115446 -116788 -118130 -119472 -120814 -183238 -245661 -308085 -370509 -366005 -361502 -265376 -169250 -94121
8623 -94121 -18992 -35485 -51978 -129553 -207128 -193080 -179032 -227021 -275009 -277186 -279364 -205040 -130716 -90751
8637 -90751 -142407 -269462 -304894 -244886 -184878 -225082 -265286 -271132 -185355 -124393 -155053 -128449 -101845 -10462
8651 -10462 80921 71138 -30266 -66771 -103277 -99698 -96119 -160302 -224486 -242858 -261230 -332094 -402958 -382200
8665 -382200 -361442 -351361 -341280 -291115 -240949 -160243 -171159 -176348 -181538 -170025 -158513 -147000 -135488 -155471
8679 -155471 -175453 -195436 -215419 -250583 -285746 -229288 -172829 -153592 -134355 -75033 -15711 67231 58552 -51292
8693 -51292 -161137 -182224 -203310 -132774 -62238 -61701 -61164 -60627 -60090 -105365 -150639 -161555 -80849 -35694 -82161
8708 -82161 -162987 -243812 -182432 -121053 -105484 -89915 -110465 -131014 -151564 -172113 -174529 -176945 -179361 -181776 -115953
8723 -115953 -50129 -18664 -78821 -162837 -155232 -113268 -71305 -109093 -146881 -138858 -130835 -162897 -194959 -141125
8737 -141125 -87291 -16516 -37364 -52485 -67606 -34053 -500 -12758 -25016 23925 72868 76000 79132 50768
8751 50768 22404 39852 57300 -31429 -120158 -168802 -125825 -49443 26938 -43657 -114253 -193706 -273160 -312529
8765 -312529 -260276 -237609 -214942 -272444 -329947 -305848 -190127 -120218 -141930 -164597 -187264 -129762 -72259
8778 -72259 -89438 -198240 -307041 -324220 -258367 -192513 -212556 -232598 -224963 -217328 -163881 -110435 -83712 -56989
8792 -56989 -121888 -186787 -198210 -209633 -175245 -140857 -129374 -117891 -112135 -106379 -108258 -201759 -341072 -388762
8806 -388762 -305699 -222637 -225470 -228303 -188069 -147836 -107602 -67368 -59583 -51799 -38288 -24778 -50875 14650
8820 14650 80175 54079 12711 -28655 -75749 -122842 -168355 -213868 -259381 -304894 -265465 -226037 -186608 -147179
8834 -147179 -141632 -136085 -176348 -216612 -234924 -253237 -185654 -118070 -53171 -79894 -202057 -324220 -366214 -316585
$$ [...]
##$OBSERVEDINTEGRALS=	(X Y Z)
(4.3157508304409386568, 4.385320156718101714, 1)
(3.7097193516630060373, 3.7653775960939928069, 0.98500714900637575955)
(3.9561377783865938618, 3.9973346157399469725, 1.1129080241047979438)
(6.0552722061857799929, 6.0802440954322589661, 0.51698102770065179623)
(5.4130721411447435543, 5.4539006967648555602, 0.61456637535689495611)
(4.9924257913113416762, 5.0331722122285293963, 0.94171447943180086604)
(1.4510119882730447838, 1.4706231559651372631, 2.5112321084251778558)
(2.3116362690609930652, 2.3767322590291803941, 1.1194432758706551745)
(2.5898897163759921902, 2.6466891586031349171, 1.1388506573267664912)
(2.7615644350175880817, 2.822193053125212181, 1.085128195757752767)
(3.2118310560257978814, 3.2745730770207313043, 1.0532406534089586714)
(3.4769666931334173299, 3.5366728098866593299, 1.0528876832230187333)
(2.1567233288382405831, 2.2301447063322563658, 1.118886237632459757)
(4.0459217829671949573, 4.0784876712965267842, 1.1012981056882271691)
(6.0904982528523134988, 6.1144447263567887063, 0.1088742935001066614)
(5.3641110683482677857, 5.3913301054283415681, 0.14686324968619826614)
(4.954178686175315427, 4.9730371597968403563, 0.99644507348021604809)
(1.486226591840043243, 1.5058911959563658911, 0.94000770634745589582)
(1.4711575202074282931, 1.4806157672959854299, 0.57319166354379025297)
(3.9127599469293463663, 3.9459757999635427517, 1.2239203707229220353)
(2.6974161162137835213, 2.7051132063670877415, 0.042862591639240860131)
(2.6735718695432195702, 2.6845318566093379076, 0.042848392323705471185)
##END=	
##TITLE=	Jun25-2015.41.fid
##JCAMPDX=	6.0	$$ NMR Plug-in 1.14 of MestReNova 12.0.4-22023
##BLOCKID=	3
##DATATYPE=	NMRPEAKTABLE
##DATACLASS=	PEAKTABLE
##.OBSERVEFREQUENCY=	400.20240119999999706
##.OBSERVENUCLEUS=	^1H
##NPOINTS=	111
##FIRSTX=	1.4542250054862693176
##LASTX=	6.112109452502072493
##XFACTOR=	1
##YFACTOR=	1
##FIRSTY=	4366.7763341543322895
##XUNITS=	PPM
##YUNITS=	ARBITRARY UNITS
##PEAKTABLE=	(XY..XY)
1.4542250054862693176, 4366.7763341543322895
1.4631374743000389316, 2018.8198682070924406
1.4695640682441819536, 4416.0172670107858721
1.4787289149205642413, 1390.6868047225907503
1.4820048835639252349, 293.75677812108745002
1.4938357049703818724, 373.37556699135581084
1.4980207710266391086, 574.78243209092056532
1.5025993641756854036, 192.05623515817313773
1.5075955549838779834, 715.20828503333780191
2.1374843864979680141, 384.99599733013940295
2.1653328911414373437, 717.51980682331202388
2.173814247603387706, 370.62786260886906575
2.1932388695037441373, 432.16746705630993119
2.2017859441529399334, 599.28202900215092086
2.2296048549808658024, 511.24975323164437668
2.3096340270872461886, 401.35975949488602055
2.3179048854013704073, 379.27442769025390135
2.3359149989409480064, 375.83480445287472094
2.3435341045676412186, 295.03361693782198927
2.3475325621753531102, 503.84353423985089648
2.3556627047898772709, 453.61263500607805099
2.3733685541430618038, 450.91316476424060511
$$ [...]
2.8092456629166346893, 359.53057328383226832
2.8124360909985410828, 294.90763609319856187
3.2128578982945632525, 503.35381343616671757
3.218084435467126081, 382.30738084037943736
3.2326823241032927037, 532.40271816678637151
3.2376550708518974098, 454.23796801512867205
3.2538120559570398171, 445.95116371708411407
3.2589850251339314013, 360.17755986229383325
3.2736393844426707744, 478.42446191343316286
3.2785931434663617701, 371.78660230349845506
3.4881893073313632314, 552.24012766877126523
3.5124404850275001699, 1280.5127494719290553
3.5166702929746564976, 94.542641664036565885
3.5368513661662248637, 800.13270330887428372
3.7122152878178487079, 256.03094328052446826
3.7276915468481242044, 562.74347015313924203
3.7367566044010924742, 374.90073381377550277
3.7430343995246335709, 582.30880000948025099
3.7516190027181637312, 544.58251499641676219
3.7584507758877734318, 292.79119187902898602
3.7669086640104665342, 453.38178993596767441
3.7821264214259686653, 196.49872059670346403
3.9147456258380186611, 331.58973548233086603
3.9194052408882527061, 728.9532488645537569
3.9237827468736061753, 405.84711194766890685
3.9384326344344029458, 12.064374475421191235
3.9420461574160028384, 1051.4800169878017186
3.9463943504376004512, 960.37563833422893822
3.9506530446702416981, 12.064374475421191235
3.965115735723695245, 853.46077820904156397
3.9904707271936938895, 591.66061436431573384
4.0507732551451498537, 433.19525152917702826
4.0559402728425562046, 414.30769064114929279
4.0607527956070041952, 241.67065722867971544
4.0649138803753421811, 12.064374475421191235
4.0688466518755426193, 892.03670765760557515
4.073585017567506128, 495.47012004510622774
4.3241266178663790853, 137.59403326034379234
4.3288372286121106214, 263.49656062387941802
4.33394040671422065, 164.26704744241408207
4.3418979323920661173, 322.48381686721381811
4.3573005684582941655, 367.96214631354274616
4.3659801772615116633, 83.390950205553082242
4.3709382813814912083, 323.96296538268262566
4.3756000615649472962, 93.527343064178964482
4.9534805055409512065, 516.07022222307875836
4.9612394337632421681, 514.23349033144461373
4.9644087559021148337, 890.5703046962710232
4.9723361186786085852, 905.1078166544710939
5.0020405139104955339, 910.96800331872236711
5.0101566359311870968, 104.7322686584135738
5.0212440462318959078, 947.08218687666692404
5.3637782884378708559, 181.03605183610915219
5.377594693359454503, 233.37234709955868084
5.3903130264684584461, 168.23720690059343497
5.4181057659144533645, 684.24447423996252837
5.4318910332613690173, 1369.0337960718356953
5.4456170966464672034, 751.6176258177172258
6.0576677533047469382, 811.38815693134517915
6.0628085806123754864, 754.168072802020788
6.0719586291203757611, 765.27867927784245694
6.0771392321867647723, 726.40957498042519092
6.0924165917303518825, 144.1391062705630759
6.0978550615228268583, 138.87365320422665604
6.1066423614375153761, 129.97166285455460866
6.112109452502072493, 144.74906701040401913
##END=	
##END=	
