##TITLE=	YmAm$SO$QlKDg8OPn9wmWA.61.ser
TM-VI-147 cosy

##JCAMP-DX=	6.0	$$ MestReNova 14.3.0-30573
##DATA TYPE=	LINK
##BLOCK_ID=	1
##BLOCKS=	2    
##ORIGIN=	Mestrelab Research S.L.
##OWNER=	hrzepa
##$MNOVA/LINK_BLOCK_TYPE=	ITEM	$$ NMR Spectrum
##$MNOVA/ITEM/POLYGON=	(XY..XY)
5321,5835
8722,5835
8722,8208
5321,8208
5321,5835
##$MNOVA/ITEM/Z=	0
##$MNOVA/ITEM/ANGLE=	0
##TITLE=	YmAm$SO$QlKDg8OPn9wmWA.61.ser
##JCAMP-DX=	6.0	$$ MestReNova 14.3.0-30573
##BLOCK_ID=	2
##DATA TYPE=	MNOVA NMR VIEW DATA
##DATA CLASS=	MNOVA VIEW DATA
##$MNOVA/2D/THRESHOLD=	11.308110237121582031
##$MNOVA/ITEM/ZOOM/X=	-1.2849598716208046056,	11.297249999948046906
##$MNOVA/ITEM/ZOOM/Y=	-1.2849598716208046056,	11.297249999948046906
##END=	
##TITLE=	YmAm$SO$QlKDg8OPn9wmWA.61.ser
##JCAMP-DX=	6.0	$$ MestReNova 14.3.0-30573
##BLOCK_ID=	3
##DATA TYPE=	nD NMR SPECTRUM
##DATA CLASS=	NTUPLES
##NUMDIM=	2
##ORIGIN=	Bruker BioSpin GmbH
##OWNER=	nmr
##.OBSERVE FREQUENCY=	400.20200099999999566
##.OBSERVE NUCLEUS=	^1H
##.SOLVENT NAME=	CDCl3
##.PULSE SEQUENCE=	cosygpqf
##LONGDATE=	2021/11/02 17:25:22.000
##.ACQUISITIONMODE=	SIMULTANEOUS (DQD)
##$ORIGINAL FORMAT=	Bruker XWIN-NMR
##$MNOVA/SCALES_VERSION=	9
##$PARAMETER FILE=	(acqu2s, ASCII, /private/var/folders/f6/rjf_tdyn2v98c5c0wvkgn4s80000gn/T/YmAm$SO$QlKDg8OPn9wmWA/61/acqu2s, 0)
$$ ##TITLE= Parameter file, TOPSPIN		Version 3.2
$$ ##JCAMPDX= 5.0
$$ ##DATATYPE= Parameter Values
$$ ##NPOINTS= 221	$$ modification sequence number
$$ ##ORIGIN= Bruker BioSpin GmbH
$$ ##OWNER= nmr
$$ $$ 2021-11-02 17:34:21.591 +0000  nmr@CZC2439F63
$$ $$ /opt/topspin/data/agmb/nmr/Nov02-2021/61/acqu2s
$$ $$ process /opt/topspin3.2/prog/mod/go
$$ ##$ACQT0= 0
$$ ##$BF1= 400.2
$$ ##$FnMODE= 1
$$ ##$NUC1= <1H>
$$ ##$NusJSP= 0
$$ ##$NusT2= 1
$$ ##$NusTD= 220
$$ ##$O1= 2001.00000000702
$$ ##$SFO1= 400.202001
$$ ##$SW= 12.5944462247833
$$ ##$SW_h= 5040.32258064516
$$ ##$TD= 220
$$ ##END=
$$ 
##$PARAMETER FILE=	(acqus, ASCII, /private/var/folders/f6/rjf_tdyn2v98c5c0wvkgn4s80000gn/T/YmAm$SO$QlKDg8OPn9wmWA/61/acqus, 0)
$$ ##TITLE= Parameter file, TOPSPIN		Version 3.2
$$ ##JCAMPDX= 5.0
$$ ##DATATYPE= Parameter Values
$$ ##NPOINTS= 12	$$ modification sequence number
$$ ##ORIGIN= Bruker BioSpin GmbH
$$ ##OWNER= nmr
$$ $$ 2021-11-02 17:34:24.871 +0000  nmr@CZC2439F63
$$ $$ /opt/topspin/data/agmb/nmr/Nov02-2021/61/acqus
$$ $$ process /opt/topspin3.2/prog/mod/shimcntl
$$ ##$ACQT0= 1000000
$$ ##$AMP= (0..31)
$$ 100 100 100 100 100 100 100 100 100 100 100 100 100 100 100 100 100 100
$$ 100 100 100 100 100 100 100 100 100 100 100 100 100 100
$$ ##$AMPCOIL= (0..19)
$$ 0 0 0 0 0 0 0 0 0 0 0 0 0 0 0 0 0 0 0 0
$$ ##$ANAVPT= -1
$$ ##$AQSEQ= 0
$$ ##$AQ_mod= 3
$$ ##$AUNM= <au_zg>
$$ ##$AUTOPOS= <33 >
$$ ##$BF1= 400.2
$$ ##$BF2= 400.2
$$ ##$BF3= 400.2
$$ ##$BF4= 400.2
$$ ##$BF5= 400.2
$$ ##$BF6= 400.2
$$ ##$BF7= 400.2
$$ ##$BF8= 400.2
$$ ##$BYTORDA= 0
$$ ##$CAGPARS= (0..11)
$$ 0 0 0 0 0 0 0 0 0 0 0 0
$$ ##$CFDGTYP= 0
$$ ##$CFRGTYP= 9
$$ ##$CHEMSTR= <none>
$$ ##$CNST= (0..63)
$$ [...]
$$ 0 0 0 0
$$ ##$ShimPowMaxUC= (0..63)
$$ 130000 130000 130000 130000 130000 130000 130000 130000 130000 130000 130000
$$ 130000 130000 130000 130000 130000 130000 130000 130000 130000 0 0 0 0
$$ 0 0 0 0 0 0 0 0 0 0 0 0 0 0 0 0 0 0 0 0 0 0 0 0 0 0 0 0 0 0 0 0 0 0 0 0
$$ 0 0 0 0
$$ ##$ShimPowMaxUG= (0..63)
$$ 524287 524287 524287 524287 524287 524287 524287 524287 524287 524287 524287
$$ 524287 524287 524287 524287 524287 524287 524287 524287 524287 0 0 0 0
$$ 0 0 0 0 0 0 0 0 0 0 0 0 0 0 0 0 0 0 0 0 0 0 0 0 0 0 0 0 0 0 0 0 0 0 0 0
$$ 0 0 0 0
$$ ##$ShimPowRcbType= 3
$$ ##$ShimPowRes= (0..63)
$$ 1e-20 1e-20 1e-20 1e-20 1e-20 1e-20 1e-20 1e-20 1e-20 1e-20 1e-20 1e-20
$$ 1e-20 1e-20 1e-20 1e-20 1e-20 1e-20 1e-20 1e-20 0 0 0 0 0 0 0 0 0 0 0 0
$$ 0 0 0 0 0 0 0 0 0 0 0 0 0 0 0 0 0 0 0 0 0 0 0 0 0 0 0 0 0 0 0 0
$$ ##$ShimPowRng0= (0..63)
$$ 1 1 1 1 1 1 1 1 1 1 1 1 1 1 1 1 1 1 1 1 0 0 0 0 0 0 0 0 0 0 0 0 0 0 0 0
$$ 0 0 0 0 0 0 0 0 0 0 0 0 0 0 0 0 0 0 0 0 0 0 0 0 0 0 0 0
$$ ##$ShimPowRng1= (0..63)
$$ 1 1 1 1 1 1 1 1 1 1 1 1 1 1 1 1 1 1 1 1 0 0 0 0 0 0 0 0 0 0 0 0 0 0 0 0
$$ 0 0 0 0 0 0 0 0 0 0 0 0 0 0 0 0 0 0 0 0 0 0 0 0 0 0 0 0
$$ ##$ShimPowRng2= (0..63)
$$ 1 1 1 1 1 1 1 1 1 1 1 1 1 1 1 1 1 1 1 1 0 0 0 0 0 0 0 0 0 0 0 0 0 0 0 0
$$ 0 0 0 0 0 0 0 0 0 0 0 0 0 0 0 0 0 0 0 0 0 0 0 0 0 0 0 0
$$ ##$ShimPowRng3= (0..63)
$$ 1 1 1 1 1 1 1 1 1 1 1 1 1 1 1 1 1 1 1 1 0 0 0 0 0 0 0 0 0 0 0 0 0 0 0 0
$$ 0 0 0 0 0 0 0 0 0 0 0 0 0 0 0 0 0 0 0 0 0 0 0 0 0 0 0 0
$$ ##$ShimSysFunc= (0..63)
$$ 1 2 3 4 5 7 9 11 15 16 8 10 12 14 6 17 13 18 19 20 0 0 0 0 0 0 0 0 0 0
$$ 0 0 0 0 0 0 0 0 0 0 0 0 0 0 0 0 0 0 0 0 0 0 0 0 0 0 0 0 0 0 0 0 0 0
$$ ##$ShimSysMatrix= 0
$$ ##$ShimSysType= 1
$$ ##$TFXNUM= 0
$$ ##$TRIPLO2= 0
$$ ##$VTU= 2
$$ ##$VTUETH= <149.236.99.20>
$$ ##$VTUTY= <no>
$$ ##$WBREFAM= (0..15)
$$ 135.5 97.7 100 100 100 100 100 100 100 100 100 100 100 100 100 100
$$ ##$WBREFLM= (0..15)
$$ 0 0 0 0 0 0 0 0 0 0 0 0 0 0 0 0
$$ ##$WBREFPH= (0..15)
$$ 72.26 -67.22 0 0 0 0 0 0 0 0 0 0 0 0 0 0
$$ ##$WBSGU= (0..15)
$$ 0 0 0 0 0 0 0 0 0 0 0 0 0 0 0 0
$$ ##$XFAC= 2
$$ ##END=
$$ 
##$DECIM=	3968
##$DSPFVS=	20
##.ACQUISITIONSCHEME=	NOT PHASESENSITIVE
##NTUPLES=	nD NMR SPECTRUM
##VAR_NAME=	FREQUENCY1,	FREQUENCY2,	SPECTRUM
##SYMBOL=	F1,	F2,	Y
##.NUCLEUS=	1H,	1H
##.OBSERVE FREQUENCY=	400.20200099999999566,	400.20200099999999566
##VAR_TYPE=	INDEPENDENT,	INDEPENDENT,	DEPENDENT
##VAR_FORM=	AFFN,	AFFN,	ASDF
##VAR_DIM=	1024,	1024,	1048576
##UNITS=	HZ,	HZ,	ARBITRARY UNITS
##FIRST=	4521.1594499999982872,	4521.1594499999982872,	0.077128894627094268799
##LAST=	-514.24094062501069402,	-514.24094062501069402,	0.17387378215789794922
##MIN=	-514.24094062501069402,	-514.24094062501069402,	0.00013475626474246382713
##MAX=	4521.1594499999982872,	4521.1594499999982872,	766.3116455078125
##FACTOR=	1,	1,	0.0014894112115571894652
##PAGE=	F1=4521.16
##FIRST=	4521.1594499999982872,	4521.1594499999982872,	0.077128894627094268799
##DATA TABLE=	(F2++(Y..Y)), PROFILE
$$ [...]
##PAGE=	F1=-3374.03
##FIRST=	4521.1594499999982872,	4521.1594499999982872,	0
##DATA TABLE=	(F2++(Y..Y)), PROFILE
1479A79j05J4l7J08JO1k5O0j81L9R4p5q8RK1K9J82l4k04J28O8m5r8k1o2J42O2n5q7J14k5n3
1322A16R7r1O8j51N2J6l3k2R1O3j08J07Nj30n2K46j35L0j2n1oK5j8O3j4o4oL8M0Ql1J45k9
1159B57k03J00o6K1k4n3O2O3oo8pJ16lk6jo0O1Q0p2j40R7n7N4M3k0N1q1o2J37k9p3K6j4J26
992B29j03k8Q2o5j00P5pN0n4L3J9l9K0mn2O2j4o8J07L9m4jj3J7n4P7r5K8O9r6R9N1m6j21K9
820H2n7N2J11m8L6n3O5r4OJ2o3O2o5O2JN9P6r7o7J03k9j12M2J02L3j42Q6J13j66P0Q2J516
662A778R16k260J3m23M8J00j06L4l9N5L4o6kK46J77J905M889n136o74J081P51j515j301l03
544B02M66R50m6J345k29k70L723k83K287j877l316j965l26l81N5j69R8m3j11K02j51q3J23
431B01p3M7k8j16QQ0o4J13M9qj24J52j11n5J3K0L42k08j68k5J00M9oj36K32j60Q5p6LM3o0
$$ plain form
1479 179 74 88 51 159 160 221 196 256 75 114 208 133 45 54 75 104 286 252 48 176 244 199 101 80 18 160 222 167 80 194 169 116
1322 116 213 122 190 39 91 107 74 52 143 206 98 205 210 80 28 274 139 169 157 106 100 125 107 170 156 92 86 124 164 172 141 286 257
1159 257 54 154 88 109 85 32 94 157 151 83 76 192 189 163 162 102 163 243 171 31 128 71 125 168 148 199 118 56 193 164 91 117 103 229
992 229 126 98 180 115 15 90 83 133 79 112 131 92 112 108 56 118 104 36 143 182 138 137 124 141 87 164 69 97 166 70 169 220 174 53 82
820 82 25 77 188 140 176 123 188 94 100 112 49 111 46 108 109 168 244 147 80 183 154 42 84 186 219 77 163 276 110 180 262 1778
662 1778 2694 434 447 24 72 172 66 100 61 116 150 84 82 328 505 2410 7299 2163 1489 2570 3321 1806 505 202
544 202 668 1618 1572 2917 2688 2418 6141 5858 8145 6268 2952 987 661 280 335 166 264 221 110 312 161 78 201
431 201 128 175 147 31 39 119 55 168 217 209 85 237 126 71 84 104 446 238 70 45 145 194 188 52 284 124 209 133 136 179 119
278A19jM1m9J36k03O6J42n5q1o5J46O9n5q4N3l7Qk4q9NO4K3J90k32J98r1j22J62q4l7pqJ19
116B17j51K2M1Rp8m5K7M4P9k5n6KK4n5J14q5o1M3N9rJ3l9O3m3j2N0o5M3P6o5k6k7R9p3p5R3
-61A28K1o4Q6j27J64p6K7kl7l5l3K49q3j47No5O7J43p8r8j7J41j1j0j38P8l2j2N4J05j26R8
-219A75nj47J22%n7J48o5l0n3o9K03j45Q8j8m0LQP7L1O6q0m7n5r2R3p6P0k6J35N3o0q3K3N
-386A52j02P8j04N8K5K0Q2j27J6L0J55j89k0J03l4Nm9K4o1J3nJ13n4l3K9l6
$$ plain form
278 119 118 159 110 246 43 109 251 196 115 50 196 265 210 126 179 142 150 126 37 42 106 129 319 87 285 194 72 234 150 113 106 98 217
116 217 66 88 129 138 60 15 42 86 165 140 84 86 110 55 169 84 23 66 125 116 129 90 153 110 98 148 83 126 202 137 111 84 183 110 35 128
-61 128 149 85 171 44 208 132 159 157 120 85 52 301 218 71 76 11 78 221 143 45 28 169 158 148 10 88 56 44 98 203 77 175
-219 175 170 23 145 145 88 236 171 141 88 19 222 77 165 147 107 110 118 195 226 292 212 165 110 18 111 35 105 79 214 267 207 124 147 152
-386 152 50 128 24 82 107 127 209 82 98 128 283 94 74 177 143 148 99 123 62 75 70 183 129 96 125 89
-514H9
##PAGE=	F1=-3383.88
##FIRST=	4521.1594499999982872,	4521.1594499999982872,	0
##DATA TABLE=	(F2++(Y..Y)), PROFILE
4521G6MJ14j44j6Q3m0MP0m9o9J32p0R4j56J82j51N7m5K58j58j23J88j88J05J19o1Kppj54k3
4369B7O8O0j18O0j3Q2m5L7M7o3L9m7MQ6o8m9J91k49J29o2n3PJ79j73m6M8l2R0N9q7P3p6n2
4206E3l3J10J04j08l2o4N1O0Ko4P0P2n5j21J50J1j48K4jo1J63m0k4q4L2K7m6O7J3J93q1j43
4049I7p5O9J28q8k7L9J0j16K13j60o7J0J01J16k5m1N7j89L5M7L8q0O3m4KJ9l7p1J8Q8K3N0
3891B03qp3m3K8Q5l6N6j22J9l2M0k5O3j06O7K6J03j18qQ0o6k0p3K38o8j45K6R2l7M7q2J27
3734B38j5P1r0m8j13N0n2P7m5M0K3k8O4j36K08o%K1j05l2l1Lj7J1JR4j4r0jJ1RL2p9J06J77
3561C34j20J4j45K7q5R7m4k2OL0K8O4j18O6o4P0l0O8J1mo2q3J27M2j28l7R2O3k5p0o2J88q
3399B20O9p6j64R7p7J54J05j27k3qj13L8%J03k1Q3p5m8m7J2Qn3L4J73O7j95n0kJ3l7J9P8p7
$$ plain form
4521 76 80 194 50 34 117 77 81 151 102 33 165 95 189 33 215 64 121 76 334 176 53 241 53 158 277 216 218 211 204 50 27
4369 27 95 155 37 97 84 166 121 158 205 142 181 134 138 224 156 107 298 49 178 116 63 70 249 76 30 78 46 136 195 108 181 105 53
4206 53 20 130 234 126 94 30 81 141 143 79 149 221 166 45 195 206 58 82 81 20 183 143 119 35 67 94 48 115 128 321 240 97
4049 97 22 91 219 131 104 143 153 37 250 90 23 33 134 250 225 184 241 52 87 134 172 92 155 111 113 132 95 24 42 130 153 203
3891 203 195 122 79 107 192 156 212 90 109 77 117 92 155 49 116 142 245 127 119 199 133 113 40 278 210 65 91 183 146 193 111 238
3734 238 223 294 204 156 43 93 41 118 73 113 136 108 172 36 244 238 238 259 154 122 91 94 77 88 89 183 169 79 78 89 98 130 51 157 334
3561 334 214 228 83 110 25 122 78 56 62 92 120 184 66 132 68 138 108 176 187 183 121 38 165 207 79 42 134 197 172 102 40 228 220
3399 220 289 213 49 146 69 223 328 201 178 170 57 95 95 198 177 260 185 137 90 102 110 57 91 264 331 136 86 84 97 60 79 157 80
3236H0L9L2K2m4l7M6o0L4%l8k0N5q3J25RJ6j67R5n8J2m2P9O6r4K4k2n3P0K14J44k63M4j86
3074C9J58J7j13K93k13K08k30M6j08K14j9m4q7j2m3K8LJ07Rk01J04R5j1j82N2L2n7L0O6M8
2926B29l4l3l9o3M3n7Q1P5j17J51M7p9r4O9q4J46o0J87j47p0j6J7j12J51j05l7J02q3J62m3
2779A87q9lK7r3J37q3Q5o0lk2Q8m2p4j6K11j09L2j34K6J37j24m5M1M2Q2Rj16K03j68j7m0m5
2621B4O8l4J16r5j9Q8p3n5J07j4KMk6J87o8j22J85r6j35N2jL8N8j64R0n7J1Q9m1p9J20Rp1
2459I8L5mM9m4N1m4p6K2k3k5N0k5m8M2M5J28j67O7n9R2j8jj0N0o8N2L0k9n3k3M8j6p2j7N1
2286H8M5Q7j72R9OJo1Kk7kk8N7K3k5n2J35Q8q7M0R5n2j58l1N0m4l4Nl1P6L2r1J58p7k6l5J3
2109F7jJ44p1J34n4m7J14n1j35rm0P1l8o2L4J34qk9l6jK0K8p4p9K33k0j65N8r1P5l6j7J13
$$ plain form
3236 80 119 151 173 129 92 138 78 112 112 74 54 109 26 151 160 176 9 104 46 58 16 95 161 67 91 69 16 86 300 444 181 225 39
3074 39 197 214 101 394 181 389 159 205 97 311 292 248 161 149 106 134 137 244 253 52 156 251 240 58 110 142 85 115 181 229
2926 229 195 162 123 60 103 46 127 202 85 236 283 204 110 179 95 241 181 368 221 151 135 152 40 191 86 49 151 68 230 187
2779 187 98 95 122 29 166 83 168 108 105 83 171 129 55 39 250 141 173 39 65 202 78 33 74 116 198 207 91 294 126 109 69 24
2621 24 92 58 174 79 60 148 75 20 127 113 115 119 93 280 212 90 275 179 44 96 95 133 191 27 117 60 71 160 119 40 160 169 98
2459 98 133 129 178 134 185 141 65 87 64 39 89 64 16 58 103 231 64 131 72 164 146 145 135 185 117 169 199 170 117 94 142 126 54 37 88
2286 88 133 220 48 147 153 154 93 95 68 66 38 95 118 93 41 176 264 177 217 312 260 102 71 121 77 43 48 17 93 125 34 192 115 89 54 67
2109 67 66 210 139 273 219 172 286 235 100 91 51 122 84 22 56 190 182 153 117 116 136 164 90 11 244 224 59 117 26 101 65 48 161
1947A61m6j3P0j16j1N6m6J4J36P2j18%J2m3n0O8n8O2J6M3ko3K7M5j35LR6N5m3r8R5O8j76o7
1779A4R8j9p1P8K2n5J55j14N3o5J2l6l5J0Q2p6N7M8K0NJ22J68J204l49R75r60P8j60j109l7
1632A15o5J5l5P0n0R4n1J6kj8O6r1J22p4n4P3o7J3J50p7p9%P1K07j4Q45k07N17j149K11m95
1479E7L4k4rQ4PR0j0M8j69LR4j01q6J8NQ0K02p6j79R9P1m5r5Rq1R8J19p3l0Q3k5o8P0j18J07
1307A89j29P1J6r8K1Q0Q3j47J10J6j15n4K50j55j3k3j9mlL8K2Kn1l0L0N6M6%J06l3j98P7p5
1145F6K2nk3LO6kj2%N2J4k0J5m6K6J26p0k01J18q4M7P8kL2j09n6J84o2m4L9p8J62p7m2R6q0
972A33p2O2k4J9p6N9J6m5M3J7NL9m3o6Q9Onql0Lj7M0r5%Q7q9P4N9%r3l4n2Q3J35p3O1l4j1
785A63o0K8m9%M0q1M0L8O3O0j04n4J18k8j00K8J30k4r4qJ20r3L7J83K088P97k757Mm21KJ09
$$ plain form
1947 161 115 102 172 56 45 101 55 69 205 277 159 159 171 128 78 146 88 150 166 209 207 144 171 216 81 84 180 235 192 94 189 257 81 14
1779 14 112 93 22 100 122 67 222 108 161 96 108 72 37 47 129 53 110 158 178 183 305 473 1677 1328 2303 1343 1421 1261 152 115
1632 115 50 65 30 100 50 144 93 109 107 89 155 64 186 112 58 131 64 77 227 150 71 71 142 349 335 1180 973 1490 341 552 57
1479 57 91 67 58 142 149 239 229 277 108 111 205 104 18 36 41 121 323 247 68 167 238 193 98 107 26 124 243 170 140 223 198 130 200 82 189
1307 189 60 131 147 49 70 150 233 86 196 212 97 43 293 138 125 102 83 79 76 114 136 138 87 57 87 143 189 189 295 262 64 141 66
1145 66 88 83 60 63 129 127 115 115 167 181 161 176 130 156 282 212 11 129 45 92 170 168 200 91 35 219 157 113 152 74 236 159 117 213 133
972 133 61 123 99 118 42 101 117 72 115 132 137 176 133 67 156 162 157 149 119 122 105 145 50 50 137 48 122 181 181 88 54 2 85 220 147 208 174 163
785 163 103 131 82 82 122 41 81 119 182 242 138 84 202 174 74 102 232 208 114 106 226 133 170 353 2441 3238 481 485 64 66 175
633A75o6pl1O2k7k3k3K15J83J618M474m370n21J147J359j978j710l50P22J047j17J611o50
519B740j17L735K076N088o463l543k598q9n29N6j23L6k8p6J07n1j51J73j12N8k4q6l3O4m8
396F2J06J4N3j38J45j21l0K9kL06j93j47l8J17lj8r6K38j52O9m3k1m9rL0K4K0Q6j92P8J08
244B33k1r8m0J64N3n9j01N1n4J2j0p2l0Q1L0J46j76J84j02j21J69r5l6J5MR8j68M1O8j4j10
91D2J5Qj4J30o7l3j1M1m7J18o3j06O5L4oL7q6J48q8L7j1l9oO9p4K7p3Q0Mr4P5Rk2N0r8J59
-86B10p4L8Pr5j3k2K09r5m9kn8PJ84r4q3l3J47o5jj06R6m1l9M5J00j01R4m1r2J27o0k5J46
-248B21o8l0o0l5K12j81Q8n6k6j1N3O3M0N6p2j8p9l7N3j01Q7m6K04j8k5j02J1M4j13O6j05
-401A5P8J7MJ15j27l1M4J46j48l3Q1K3j4o4N4j14M0k5J39q5m3P4o9
$$ plain form
633 175 109 102 71 133 106 83 60 275 458 2076 6550 2180 1659 2806 4165 2187 477 127 849 1896 1779 3390 2740
519 2740 2623 6358 8434 13522 7059 3516 918 829 300 356 233 269 241 165 272 221 70 243 131 189 165 79 46 110 62
396 62 168 182 235 97 242 121 91 120 118 424 231 84 46 163 160 142 46 284 132 201 158 137 88 79 109 133 153 239 47 125 233
244 233 212 114 74 238 291 232 131 182 128 140 130 58 28 109 139 285 109 293 191 70 239 144 108 123 127 225 57 98 166 152 42
91 42 57 65 51 181 114 81 70 111 64 182 119 13 78 112 106 143 57 205 117 154 143 104 98 167 93 120 47 127 131 37 112 121 99 149 51 210
-86 210 136 174 181 86 73 51 260 165 116 114 56 63 247 153 70 37 184 119 118 12 108 67 28 73 173 72 166 125 33 160 100 75 221
-248 221 153 123 63 28 240 59 147 91 65 54 107 170 210 266 194 176 97 60 113 12 99 53 257 239 214 112 123 167 54 120 15
-401 15 93 110 114 229 102 71 115 261 113 80 161 184 170 106 160 46 86 61 200 115 72 146 77
-514G7
##PAGE=	F1=-3393.72
##FIRST=	4521.1594499999982872,	4521.1594499999982872,	0
##DATA TABLE=	(F2++(Y..Y)), PROFILE
4521A08m7J11j10l1M9POL0j1j00J83m5K4j32J10n7R2j24J85o7j03J23j24P3Q6mm2Q2j1k03
4373E8k0J9P9m8j3lN8MK8j0Qj1j1j3Q3m7p7K21k66J41o2o2l9K04j34m9N6n3J00P7j17Q8q0
4211A09n7pP8J36j03p9o7O4M7K2q2L3J30p9j28K05%j95N9k0m7J09lj8n1J7K4k6L4J5K29j08
4054B41j33q3N5J10n8m8N9M2r0J29j43o2K8J04J16o1%N2k00M7O8N3j07M5k9kOPj26M3R6k0
3896A39M0Kj25PM3Q6o5N7q3Mn7O7j9N1r4K5O6Q1q2k0P8q8L8j12J96l6j37j3J55n5Pn8J49K4
3729B71K7j34k9r9K9m7J24o1O2lm9O1j19K33J0l0jq6k4n1J1kJ6q1J47n3m3K3k3K4J7l8MK22
3561C08o4m1j36N5p5P2m0J0l1L7J0R8r0n1K5K7pJ17J3j6q4j05Q7N6j38L1O5O7l9q4k8J95k
3399B42P6j21j33P9r2J70J10j15p2K6r3j4M6R1m9R8m9r5k2M7j8l2L9J41R4j77n8Knq7L1N2
$$ plain form
4521 108 61 172 62 31 80 87 93 123 112 12 195 150 174 42 152 95 187 63 248 181 78 201 77 150 236 232 190 272 261 58
4373 58 38 57 136 88 75 72 130 134 162 152 160 149 138 125 208 161 84 305 39 180 118 56 17 221 87 38 94 41 141 218 101 189 109
4211 109 52 45 123 259 156 77 10 74 121 143 61 94 224 145 17 222 222 27 86 66 19 128 125 107 56 73 97 71 105 120 349 241
4054 241 108 25 80 190 132 84 143 185 95 224 81 19 47 151 267 206 206 258 58 105 173 226 119 164 135 133 139 146 20 63 159 139
3896 139 179 181 56 63 106 192 127 184 101 105 48 115 96 147 53 78 144 225 143 123 201 113 151 39 235 199 62 49 204 149 156 98 247 271
3729 271 298 164 135 36 65 18 142 81 143 140 91 152 33 266 276 246 245 159 135 84 95 93 109 28 175 122 79 102 79 103 120 82 86 308
3561 308 244 203 67 122 47 119 79 89 58 95 105 203 113 62 87 114 107 224 237 221 137 32 119 175 37 68 133 200 161 77 49 244 242
3399 242 318 197 64 143 51 221 331 216 144 170 77 63 109 200 151 249 200 105 83 130 112 80 119 260 354 177 119 121 116 29 60 112
3241A12m2M4M7L0k5o4K0n6N4l0ooP7r4M5P7Qj80R5m5K6k2MQ9j19O7o8jP5J72Q8j60K4j56Q0
3069A60M1j81N05m08K49k21P2j22J90J9l3r4j6p7M6QQ4J5j88J10J18p2j60N3N2j05L4R3N0
2926B22l1k3o4k8K4k8M8N1q3J74L1r2n5L8q0J10J4J65j43o9k5k0r0O8m3l2J11q2J40n3r7K8
2769H6L6n9J20q9P2o8k5jJ11m3j06k6K70j18pj02M9Q7j18l0N0K8O5%q0J88k07K6n1j5J0l4
2611A9J20k9l3N2m0n3P6j3K3j5K1J73r0j29K22j13j60Q4lJ0M0j46R7p7J8N9ro7J28N7q3M9
2454A88k4Rn1N9j4q0Pk7j0M6m4onL2J37j27M8o9R2o5M6j6O8o3N0L4k3m1k8L9J1o1m9M8L9L9
2277A89j28L5N3or7oMKj0J29l5k0q5J34R3j11M8Q1n2j21n8P9J2p1k6pL6j0J9J53q0j06RLL2
2104H2Q1k1J30m6j9J03o7j09m8l5M7J4p2K3J11j4n9Mk6M9K9p3p5K13l2j19M1r0J03m3l8P8
$$ plain form
3241 112 70 114 161 191 166 102 122 66 120 90 84 78 155 61 106 183 191 11 106 61 87 65 69 158 39 106 38 37 112 284 372 212 236 80 160
3069 160 201 20 525 117 366 145 217 95 285 304 271 177 161 84 130 138 222 237 49 159 277 205 45 98 150 45 79 172 222
2926 222 191 168 104 76 100 72 120 171 88 262 293 201 146 184 104 214 228 393 250 181 156 136 46 114 71 39 150 68 208 155 58 86
2769 86 122 63 183 94 166 98 73 72 183 140 34 8 278 160 153 51 100 187 69 39 89 117 182 182 102 290 83 109 58 43 53 19
2611 19 139 110 77 129 89 36 112 99 122 107 128 301 211 82 304 191 31 115 112 122 162 16 113 36 54 113 104 37 165 222 139 188
2454 188 164 173 122 181 167 87 94 67 57 103 59 53 48 80 217 90 138 69 161 96 142 126 194 131 181 215 192 151 123 162 173 112 63 111 150 189
2277 189 61 96 149 143 46 40 44 46 36 165 130 110 25 159 252 141 189 270 218 97 39 118 130 59 33 26 62 52 71 224 144 38 47 50 82
2104 82 163 142 272 226 207 310 243 134 86 51 98 112 40 63 174 160 101 105 79 128 157 84 9 222 190 71 112 22 125 82 44 122
1947A22k8k9J04j00k0K0Kk3J54M4r0J9l2Mk6L6l8K8PK3Lj0L3J8j49J9J02O2q0j13J15P3j34
1784A16p5N7k1NP1m3k5J42o8N7p6o2nl8k1J33o9K4M3L4n5K12J03k94J236r84P46J83q48K6
1637E04m17l2J08j26O2k4O9l5mJ4k4J30k11J63m3p1K9m8K3J56j02p8Q7N0M88n1J346m99Q16
1494B280k034O37o95j01k5K3K4K7J10j1K8j32l3R5j17m5j4QJ07K12r6j50M8P1m3p0K2r0M0
1351G6J73p1J5M4j6p0L2j25J22p9R4j7j33M8M8J06j64R6L3j11k9K32j74o5j8lJ2k3R2k2K0
1199A23m6j3j7N7R1K5P4m0j91O5q3K7L7l6k4M9j5O3L1m1L9k9N0m6j3J63n4k35J20j09M1J08
1041A71pK7q0q4K04o7l6M2j29J90n7l4J04j13j7L9l8j9pqMk8O4L0N5J7o4m9N5k5L0k2j7j1
874A20j0J6q1j9Q1o4L1O8L6p0p0k2R3J30p3N6Jq7m6P5j10N9Lm7j5J02N1K5j06k8R7j6p2J8
$$ plain form
1947 122 94 65 169 69 49 69 71 48 202 246 156 175 143 147 121 157 119 147 154 177 180 170 203 221 72 91 193 255 175 62 177 250 116
1784 116 41 98 77 82 153 110 85 227 159 216 140 78 73 35 14 147 78 102 145 179 124 336 439 145 1381 397 1143 1326 478 504
1637 504 87 55 163 37 99 75 144 109 105 119 95 225 14 177 134 63 92 44 67 223 121 43 130 180 668 617 1963 1464 2280
1494 2280 246 883 188 87 62 85 109 136 246 235 263 131 98 193 76 31 17 25 132 344 248 98 146 217 174 104 126 36 76
1351 76 249 178 193 237 221 151 183 58 180 101 195 178 45 93 141 247 83 179 212 101 72 304 130 65 47 44 56 33 125 103 123
1199 123 77 64 47 104 195 220 294 254 63 128 45 72 109 73 49 98 83 146 177 136 175 146 196 150 137 300 246 11 131 22 63 171
1041 171 164 191 111 27 231 164 128 170 41 231 174 140 244 131 114 153 115 96 89 81 85 57 121 151 206 223 159 110 165 140 170 148 131 120
874 120 110 126 45 26 107 43 74 142 178 108 38 16 109 239 166 222 223 136 90 165 55 114 117 70 55 157 208 233 127 99 196 180 108 126
706A26J21l8o7o1P5k6PJ94J608M33k064J09l37ON4JJ0q9N4n2L6m4J72J76J236L705l263m17
569A665J152J917k234k061K74k7P27k15J107J1M82O011m0O957q940k864l013k5n94K7K7j24
460B20qm4RR2j96J83j46J01o3J4j09M8m3J00nP4r4J05j06l8M0j1K65j59j40m0J16l5n1l3K11
308B57j07J5Nn5q0L2K5J4P2M6j57O6P0J0r7l8J97L4n4j21N6o0nLn0o7J12K0J01j11J51r3j15
145G6J59r9n7N4J6R8j95M5J09l7j45P2rn8J63q9rn5P1l5J33m5j14M9K4l7P0r8J84j24Q3q5
-12A15Mn0O5o5O7j20O9O4j11N6J9qJ6p4J50o5M3Nj40L2PJ34r2N0k5m6m5J97p0q8k6J16q6j
-180I7n5Q4l7n1%J03q8J07r3l4J21j00K4J25r1mn9%J74j89R3p2j3LO0L6N3L9m7j4o8%Jn8N4
-352A01k9J90m7rj05%M7q9M8p1Q2k4j5J45q3j09Q3P9o3m8O3N3m6rL3j57O5m6J42p0m2P9j05
$$ plain form
706 126 247 209 142 81 156 130 137 331 1939 2372 308 417 80 86 140 141 151 62 116 64 100 56 228 404 1640 5345 2082 1665
569 1665 2817 4734 2500 439 713 686 1413 1198 2305 2316 2798 8809 8769 15726 6786 3922 909 884 290 317 344 220
460 220 212 168 177 269 73 256 110 211 148 162 53 101 58 158 153 227 133 238 132 94 134 123 388 229 89 49 165 130 79 46 257
308 257 150 165 170 115 35 67 92 106 178 224 67 133 203 213 116 78 275 309 255 134 190 130 125 128 78 11 123 143 244 133 284 191 76
145 76 235 136 79 133 149 247 52 97 206 169 24 96 87 29 192 103 94 39 110 75 208 163 49 98 122 85 155 57 241 117 200 115
-12 115 119 69 134 69 136 16 85 149 38 94 113 105 121 47 197 132 175 180 40 72 79 213 121 171 146 100 55 252 182 94 68 184 98 97
-180 97 42 126 89 38 38 141 53 160 67 33 154 54 78 203 112 108 49 49 223 34 127 55 42 45 105 141 194 233 186 172 104 104 105 47 101
-352 101 72 262 215 206 101 101 148 59 107 36 118 94 79 224 141 32 115 194 131 83 146 199 153 144 177 20 85 39 181 111 69 148 43
-514D3
##PAGE=	F1=-3403.57
##FIRST=	4521.1594499999982872,	4521.1594499999982872,	0
##DATA TABLE=	(F2++(Y..Y)), PROFILE
4521A55j08P1k9K6n4L7L9n9N1o5J43J5o9j11K4N4J38j59L7P3j19J10j24Q5KQ0j14K11n8j69
4373A13o9J0P8Lo7J4KO4J0p1Q1p5N9l0L4Nq3K00k10J07p4m2LJ11o0l8M9o8P7J14j52Q4o6l1
4206H2J5RJ54o4j40J1K5LO4j02l1J79p2j26K44j9j50pMm9L4N7m5mK3jlNkK67j37j00q5N0O9
4034A58m2n3N6J04q2O7j23n4RJ18J18q9J5N5j95M2J05N7r8%mj8J3L7j30L6Q3l9kL2j36LM8
3871I1R7j01O7m9j5m8O3JJ7p0j2Q5P1l6l6O3j12J11j62J61K5j13n8J84p9k8k1J45P5l1j56
3719A29j6p0jl1J59j06J09m0o1N8l7J70L1p4lo8mo6RJ6K5p7J16r3P1k6p1O7J8K1j17K29Jj01
3551A67j01O1k9L0m8L0n1J9K1J21o3j39J09j3qJ54J1k6j00r1K6O1j17Q0K7N8l9r0J4J77j3
3399B38R1j61q5M5j01J79J00r4j08N7n9p7R9P2q8J07j2j38J6Q2o2OL0R4J07j32n0kl0q2L6
$$ plain form
4521 155 47 118 89 115 61 98 137 78 129 64 207 222 153 42 66 120 258 99 136 209 90 200 76 161 163 243 129 340 282 113
4373 113 44 54 132 135 68 82 84 148 158 87 168 93 152 122 156 161 78 278 68 175 101 59 62 173 113 75 124 56 133 247 95 179 113 82
4206 82 97 106 260 196 56 67 92 95 159 57 26 205 133 7 251 232 82 75 79 30 64 121 76 72 95 94 91 96 94 361 224 124 39 89 158
4034 158 116 63 119 223 141 208 85 31 40 158 276 187 202 257 62 104 209 266 168 168 164 146 159 196 66 102 185 146 144 176 40 43 91
3871 91 188 87 154 105 90 42 105 106 123 53 41 126 197 161 125 188 76 187 25 186 211 98 40 224 145 117 96 241 316 285 129
3719 129 113 43 42 11 170 64 173 133 72 130 93 263 294 220 217 149 145 79 88 104 129 52 168 75 146 120 49 116 134 155 38 267 268 167
3551 167 66 127 98 128 80 110 59 78 99 220 157 18 127 114 106 260 271 245 145 54 80 141 24 104 131 189 150 60 74 251 238
3399 238 329 168 83 128 27 206 306 212 104 161 102 25 124 196 108 215 203 65 81 163 101 107 137 231 338 206 156 154 124 42 78
3246G8Lj7M5N6J5Qp9nn0P2o6M0pR8o9m6J14kj81Q7j4L1J0p9J07j31J04j00L5O9J67On6j6j07
3074A20N8pK1N02n99K19j90Q7j23J75K9kj06j6q7N0mP0J6j69J10J45j36j06J7O0j26O7R1M5
2926B11m8K1q8J3rOmL7m4J76L2j21Mj8n3O1P7J60j41n7k9n2m4n3K8l1J07q4J44n9j25L6O9
2764A22l3Q8o2M0o3m4J0J11l5j13K8K35j07m8o8P7J9r4ML8OM7j4l9J93k54N4n4M6m5kN0M1
2602A34m1J1Pn4L1j1N9l9N6J42r0j40K46j22j48R6qk1L4j26J04q3j3M4M8m6O7J16q2N9pl1
2444A92o8N2Np9Ll4LL5n1K1l1J6J30q6L3q0J12j22P8j7Q2m3K9M7l1j2m7M0L9m2n7J9K5Lq8
2272G6l4R6Nj17klJ9M5J55j06j5q2J19Q6j28M9N5m1q8n9Q2Q1r5n7pK9k9R4J15p3j01Lj4M4
2104A02kK7J38m1RP1o1q1o8l3QP1p3%J09m0o8L2o2J07J8p9n1J64m4o6K3r3J38o5n5L5ol6J28
$$ plain form
3246 78 81 64 109 165 180 188 109 104 54 126 60 100 93 191 122 76 190 188 7 94 80 111 121 42 149 18 122 22 57 126 293 299 243 227 120
3074 120 178 171 192 694 95 314 124 211 88 263 292 290 184 168 81 131 127 197 213 44 154 299 163 57 74 134 8 75 166 211
2926 211 163 184 96 109 100 106 102 139 95 271 303 182 186 168 115 176 253 413 272 215 186 134 90 37 65 34 141 57 201 142 17 53 122
2764 122 89 177 115 155 92 48 58 169 134 21 49 284 177 129 61 138 157 63 67 105 111 158 144 105 298 44 98 44 90 45 43 93 134
2602 134 93 104 111 57 88 77 136 97 153 295 205 65 311 189 41 137 129 108 142 16 120 37 24 68 116 70 137 253 171 230 223 192
2444 192 124 176 181 102 105 71 74 109 58 79 48 64 194 108 141 61 173 51 129 112 194 151 180 227 196 184 137 177 216 174 117 136 161 164 76
2272 76 42 138 143 26 24 21 40 85 240 134 119 37 156 242 114 163 218 177 89 30 112 193 98 41 34 63 34 128 243 170 69 72 58 102
2104 102 100 127 265 224 233 304 243 162 94 61 69 140 67 67 176 136 68 100 38 145 163 84 33 197 153 87 110 17 155 90 35 70 64 28 156
1932A56o6k4jOm7J44K9k9Po2M0LPnk3j5K5OL3M2qj39QR9P9j16j17J29P1q7q5K3k4Q9N3j08
1755I3OJ23j9O0r8j15K6l2K2R7m7j1J9N1j05K85K21J381j27O93J620k628J212j744p59j56
1627F8J79k09N3KL8ll0L7l6J77k47J44k9o7k1nJ0J53j17p7J81R3J148m04L009j947K315m185
1489B30J587j345m00RK9m8O2J15k9Np9m8R0j12j3m3L3R3K07r6j18j4P4m4k6J9r3%J97n4M3
1337B31mRn6j5j00R8k3J22o8j18M3lJ33j44N0N6j21J1J98j81j10L9m2N1rR4o7L0l6N4r0K1
1179E3J34M4M9m4j85O5q4M5P4q4j3J3m0J58M2j28P2m7J01p1l4J73k3k56J19j14L2J22l1L5
1031A77qj36J90m5l8L2j49J96n3qJ02j46N4Mm4m6P5j04pJQ1L5R2kp5k5J0m2N8m2K4k0k6pn1
859E7j0M1j7m3P9O0n9n6k5J15R9n8K8N5j53n7J32j62J11l3Kp5J87K3j5j06%M3J0l9K5P1j5
$$ plain form
1932 156 90 66 65 71 24 168 197 168 175 113 153 156 163 158 135 120 145 151 184 226 218 79 87 186 265 149 32 161 232 145 60 83 59 148 201 93
1755 93 99 222 203 263 165 50 76 44 66 163 116 105 124 175 70 355 576 1957 1830 2523 4143 1515 2727 983 224 68
1627 68 247 38 91 93 131 128 98 135 99 276 29 173 144 77 56 51 61 214 97 20 201 294 1442 1038 4047 2100 4415 230
1489 230 1817 472 72 81 110 62 124 239 210 215 136 88 178 66 53 10 43 136 343 247 129 115 189 145 119 138 45 45 242 188 231
1337 231 227 236 180 165 65 163 140 262 194 76 119 116 249 105 155 211 90 101 299 118 8 47 5 56 47 141 74 104 68 122 32 53
1179 53 187 231 280 236 51 116 32 77 151 67 54 67 27 185 227 99 171 124 225 154 120 293 270 14 133 19 51 173 142 177
1031 177 169 33 223 178 140 172 23 219 166 158 260 114 168 172 128 82 157 53 46 47 128 163 255 253 178 153 163 121 179 137 161 141 115 108 57
859 57 47 88 71 28 107 167 108 52 27 142 241 183 211 266 113 56 188 26 137 104 106 31 218 241 226 120 120 163 173 134 159 230 215
697B15n3m6l5K2J1J49O08j53o56K09j75L1n1P1P8j78J5mP2q6J54J61Q23K715k040l41J081
564B597K315k189k159R87j417J559K03k21J325J995P545o875J1922r523j587m773n99o13q9
470D03J15l20J1r6l2K17j64R6j49J55j37J55k04P2p0R7rO3j5M2p2o7L3oK21j10j46k1Q8l6
323A14n7j6J63l5o9O5r0L8J5o3K1R5K5j21M3N4K5r0n9K45Ol5j38P2p0l3J3k5q3J31rP5n5J04
155B56n6j08J27r0q2Q4L4J19j97J5J42n3j42P0j2q5J73o9k2p9Q2k3J58m3j13M1J6p4R6q0J76
3B61j53J22j49M1o4N3mL7j30J04M5j29L5P8m8Pp4J44n4M4j5j35O3L8N4p3J21o1k1q2J83j5
-155B23j12pP1p9kk4P7l9l3p1J05p3J13q2m9J07p8M5J01j41M0l3J2J01j27N9j9K5m3L8K3N8
-312A86J8j5l1pj7k5m0M8J3R2j6k3p6k0L6p4P8r6J38j09j1J39qj32Q6l6M3l4N2K3q8J11k3
$$ plain form
697 215 162 116 81 103 114 263 871 718 62 271 96 127 76 147 225 47 62 58 130 44 198 359 1182 3897 1857 1516 2597
564 2597 4912 2723 564 1551 134 1693 1896 1675 3000 4995 12540 5665 17587 8064 6477 1704 1105 492 403
470 403 518 198 209 113 81 298 134 230 81 236 99 254 50 122 52 149 140 203 188 230 158 91 124 118 339 229 83 62 150 114
323 114 57 41 204 169 100 165 75 113 128 65 86 181 206 85 128 182 207 117 58 303 309 274 136 208 138 105 118 93 10 141 132 207 152 256
155 256 200 92 219 129 47 131 165 284 87 102 244 191 49 119 107 22 195 126 104 25 107 84 242 199 86 127 143 69 165 85 261
3 261 108 230 81 122 58 111 107 144 14 118 163 34 69 147 99 106 32 176 122 166 151 16 79 117 171 98 219 158 137 55 238 223
-155 223 111 104 175 96 94 70 147 108 75 4 109 36 149 67 18 125 47 92 193 52 92 59 71 172 45 104 85 110 67 105 128 186
-312 186 204 189 158 151 134 109 69 117 130 222 206 183 107 87 123 49 127 31 169 60 49 188 180 48 134 98 141 107 159 182 94 205 182
-475A82j25M1o0Q7K3m8M2r1
$$ plain form
-475 182 57 98 38 125 148 100 142 51
-514E1
##PAGE=	F1=-3413.41
##FIRST=	4521.1594499999982872,	4521.1594499999982872,	0
##DATA TABLE=	(F2++(Y..Y)), PROFILE
4521B10j16pM9O8p5KO9r3M0QM3R9j49q0N2J6J84j68j42K45j63J85k27J42j16J73j91L44j34
4378B68q2j35O7M6j3n2M2q8J10j9j22J54j48J48m2n6P4n3J22j02N0q7j3O4j4K4l5N4p0M9J32
4226B73j79O2k6k1L6o0J53j5j56O6k0m0J16j30J5R6k7j22K58m2r2r2N8p2j7J08j02N3M4k2
4078A03Lk0l6L03j61l1j12O3J9m4l7K0J79p7L0j04m6l4J34J24j06PO6j89L8J45N1p5m9K3m7
3926A40M5N1j25M1N0m0n9P4q6m5L0J12j51J02l9l2J7K2J2k8j8J0OP4J8n3L1r9J59k10J39P1
3768B19q1o8J67j00n5K1J22J26q9j61qk0m5J4J43j59J71q3n3M9N2P5N0j26J8n3K5q2OM1M0
3615A56o0N6j08J69q3j25J33J8P4j63J51O6j54n6N1jK4p0M2n4k0N1J29m2r9P8j7m0J72Rl6
3463B51j01p4j3M9l7O7j3L7k4r3M5J54m3J08j84k8Np2J46Q0p3j11O7j4q7Q8N4j16Q8L7j58
$$ plain form
4521 210 94 87 136 204 129 131 200 107 147 155 198 297 148 68 120 136 320 152 10 255 92 277 50 192 76 249 58 402 268
4378 268 186 51 118 164 151 99 141 53 163 144 22 176 28 176 134 78 152 99 221 119 169 82 69 133 119 143 108 162 92 141 273
4226 273 94 156 130 109 145 85 238 223 67 133 113 73 189 59 74 170 143 21 279 237 145 53 111 39 22 130 28 81 125 103
4078 103 106 86 50 353 192 161 49 112 131 87 50 70 249 172 202 98 52 18 152 276 170 177 243 54 92 237 288 213 164 187 140
3926 140 185 236 111 152 202 162 103 177 91 46 76 188 37 139 100 68 85 107 119 91 73 83 89 163 181 128 159 60 219 9 148 219
3768 219 138 70 237 137 82 103 225 351 262 101 93 73 28 42 185 26 197 114 61 110 162 237 287 161 179 126 151 69 75 116 156
3615 156 96 152 44 213 130 5 138 156 230 67 218 284 130 74 125 124 148 78 120 66 46 97 226 184 85 163 146 106 278 287 251
3463 251 150 76 63 112 75 142 129 166 142 49 94 248 205 313 129 101 106 34 180 260 187 76 143 129 42 130 184 68 156 193 35
3310C5N3J06j14M1J6M5J04o2l8j2m6p5O5n3lM0N8j6M7p9k3j7P1j20R5k6J24n2p5Q7%j75O9
3148G0K6K1M8j37J14j17J14r8L4N0J88n4J5o8n9Q4r5K70M80p40R3j43R1j12J79NM0j18j4p1
3000I6N0m1O9Rj39J00J68j92k9l0M1m8N4N9L0p9R1q6L3n6L3n6M0j1J62M8j60O6q5j3J4J18
2843B56J65j39l9k6p1k0q8L7l7Q3p3J58o1j29J4Q2k1O4j7lm2m7mR2j6j04P5J79p8q3l9R1m3
2680A16n5L2K7j3K6l6KK12k98P2n2R9m3Qn5R9l5l3O2o2qmQ4n5P8R3p3j46K55j26j05R3j3n2
2513I4M2q3Q8p5l8N2N1k8j8J68o2O4L2o6r1M1J0p6J5m5QJ6k7K5l4nJ18o9L3q7J43j69P5lQ1
2341A80qnO7n1K9p8M9O4k4m9j9Rj3n9o7R4L4r0No2L1Q3J86j78j5o3J10P3j25L4J9j5o8k4N4
2168A08J53j27n5m7M0PR6O9n6o3l3j7M8n8L7J49l8L2K3l6n3p1m4k6J24p8j6J27o7l7J1o4J44
$$ plain form
3310 35 88 194 80 121 137 182 286 224 186 174 128 53 118 65 62 102 160 144 191 112 89 72 143 23 118 92 216 164 89 176 176 1 70
3148 70 96 117 165 28 142 25 139 41 75 125 313 259 274 206 147 231 136 406 886 146 239 96 187 75 254 259 299 181 167 96
3000 96 146 105 174 183 44 144 312 120 91 61 102 54 108 167 197 118 209 123 156 100 133 77 117 106 268 316 156 222 137 124 138 256
2843 256 421 282 243 217 146 126 38 75 38 121 48 206 145 16 30 112 91 155 138 135 93 46 42 134 118 14 89 268 190 107 68 159 116
2680 116 61 93 120 107 133 97 99 311 13 85 33 132 89 97 42 141 106 73 135 73 65 61 145 90 168 261 188 42 297 171 66 159 146 94
2513 94 136 53 141 66 28 80 131 103 85 253 191 255 287 221 130 171 181 105 120 75 83 99 72 97 63 58 176 107 140 53 196 27 102 99 180
2341 180 172 167 234 183 212 134 183 247 223 174 155 164 151 92 25 119 153 63 68 6 37 120 306 128 113 50 160 233 108 142 161 146 78 54 108
2168 108 261 134 79 32 72 79 175 244 188 125 92 75 123 65 102 251 213 245 268 232 179 108 64 38 162 84 68 195 128 91 102 38 182
2006A82Kr0l5J17m9k0Mr9J81j01o7RlqJ13k1k6ok6n1J01L3N1l0p1O2K8j4K9p1n4N1K5M0N1
1834B37k5j11l2R3J01j42r9J19O8m6q3j0k7J68K5j50K1J03K7N1j19j27L5mL2O5k4l2j2O3n9
1681A06K60M29L129j410K688J726m990K927l424j057k90K01k65N0J8J2L7n5N3m9K08k51J19
1568A72l1o0n5M4j1J42r2j07K65J43J735l36N083l049L576o344J737k060o69M4jj14J00J12
1450B24o7k1j6l3P8r2j0k4J8P2J92q4q3o7P8n1K8%q7K3J43k4N2n5M6l2n8p1O5K4J53j27q5
1287A09L3n7J58r8k2Q5j39N7J53j76m3M4m7J6RP9j03K2j4J21j41l0J52N6K5l8j77P2p3O8R0
1135A91j46K3k7j0J97K7j95J05o3J55j16k6J48J9k68J17r2J7J19n6M6O3j97J69qm0Nj17J65
992B05o9L1Q6j64J24l2m8m9J27j81j5L0Q5L9J10j3q2Qm2m0O9n5P2k0m5m5ppJ7K2q0N0P1o0
$$ plain form
2006 182 184 94 59 176 127 107 111 12 193 92 25 34 31 23 136 115 89 83 57 6 107 140 191 161 90 152 180 166 195 124 70 121 146 186 237
1834 237 212 101 69 162 263 121 22 141 209 163 80 70 43 211 236 86 107 210 237 288 169 42 77 73 105 170 146 114 102 165 106
1681 106 366 795 3924 2514 5202 6928 1938 4865 1441 384 94 295 30 80 98 110 147 92 145 96 304 53 172
1568 172 141 81 26 70 59 201 109 2 267 410 2145 1809 6892 3843 7419 1075 2812 752 83 127 126 12 112 224
1450 224 157 136 120 87 165 73 63 39 57 129 321 237 154 87 165 114 142 142 55 78 221 197 249 194 240 208 150 79 144 168 321 194 109
1287 109 142 85 243 145 123 208 69 126 279 103 60 104 57 73 82 161 58 80 66 187 46 16 168 224 249 211 34 106 33 101 191
1135 191 45 68 41 31 228 255 60 165 102 257 141 115 263 282 14 131 39 56 175 119 165 228 31 200 192 152 157 40 205
992 205 136 167 253 89 213 181 133 84 211 30 15 45 130 169 279 266 184 192 150 110 179 124 196 176 131 86 79 72 89 111 31 81 152 92
825I2nn9J45N6m3nJ16j97q1J76j61J13n2N3j39K76j7m4j09K4l0N1k2O0rK6l9j0j38M0O1J29
667B58J084K04j257j84K0M5r5M9J73k06o3P6O6j09J37J42M34J686r41k43R10K462j811j942
549H95J652j463L821O45K146k448K366P622j2733K2494j3516j109p476j301p33j99M9l98k
455C12k13R1J20p6o6o5J53k25L11l03J31j15J15j4L6O0k8j8j09kJ1J70n1j59K3L3oNr0R9M7
303A77j60J31j11J38M1j85N0Q4K3r7J9P7J7q5q6K82k1j2j39R3r2n9J6J1q5J30n5P7j7N4mj00
145A12Q4p1n3M6N6J46j67k5J47n9j22K9kr6J58j3o5l3L0lJ78n8j00M2Jp8R0o7J59j71J45j55
-12H5L0l7K1O7k8r3J37j1j47K6J50j21M9r3J26m5L7n0l1J4O8j1m7J53r7J0j00J52N0j48K4
-165A40K5n5Nk5Q7o0Jp9M1ML9Pj16O9OJ8Q9j44K1J0KJ4j5nN4N8j13L4L5M4%J0n9P7p4kp2P8
$$ plain form
825 92 87 28 173 229 186 181 297 100 19 195 34 147 95 148 9 285 268 224 115 139 109 160 138 198 189 215 176 166 28 68 129 258
667 258 1342 1546 289 105 125 170 75 124 297 91 28 104 170 61 198 340 774 2460 1519 1276 2186 4648 2837 895
549 895 2547 1084 4905 5550 7696 5248 7614 15236 2503 24997 11481 10372 2896 1595 862 663 712 314 312
455 312 99 190 310 234 168 103 256 31 342 39 170 55 170 156 192 252 224 206 97 95 106 276 225 66 89 122 116 121 31 130 177
303 177 17 148 37 175 216 31 81 165 188 91 110 187 204 119 33 315 294 282 143 236 144 85 101 112 27 157 102 179 162 216 212 112
145 112 196 125 72 118 174 320 153 128 275 216 94 123 121 25 183 170 105 72 102 99 277 219 119 161 162 84 174 107 266 95 240 85
-12 85 115 78 99 166 138 45 182 171 24 50 200 79 128 35 161 116 153 103 72 86 154 143 96 249 152 162 62 214 264 116 140
-165 140 165 110 115 90 177 117 118 39 80 84 123 130 14 83 89 107 196 52 73 83 85 99 84 79 133 191 78 112 147 191 191 201 142 219 145 143 71 149
-352A49L8m8P9p3j1n8P7j30J62j77K23k11Q1K3Q6r6N2j24J02J4M2n0j31K44o6p0K1o4j9J50
-499B15o6J3m1
$$ plain form
-352 149 187 139 218 145 134 76 153 23 185 8 231 20 101 124 210 114 166 42 144 158 200 150 19 263 197 127 148 84 65 215
-499 215 149 162 121
-514A21
##PAGE=	F1=-3423.26
##FIRST=	4521.1594499999982872,	4521.1594499999982872,	0
##DATA TABLE=	(F2++(Y..Y)), PROFILE
4521B58j14JL6R1o6k5P9p4k9R6r3J91j84n0J23r9K12j49r7J85j72K53l29J79j88K10j74L71
4383D42k05J5j97J23L8q4mR4j56J15n9r3J70j65J67n9j28J22j4K3K1lp8PR7j07Q7l3N5n5N3
4231A89R7j89K8L6l6N5j10J37J4j13Q3p0l6J36j58R8k5L3j31K61o1m5j49R8q5J1O8j04N3N9
4083A44j1k3l5o9L18j71N9j62P5qo6j2k7K39o0Lq5l4m0J00J31j14j2Q1j81M5J67L8m8q2L6
3930A96q1Q9N4j07N1Rl6j11J18n7m4jJ10j53J14o5j8O7%pn6M8K8j06Q2P1n9j7j9J37k05J04
3773A36P7m6p8J51j18p0O1R4J60j32j56pM8r6M8J05j49J79j22j8K5J31k6N5j71M7l0N2j05
3630D5J9O3O1p2J1o6J98j34q0J24KJ14j90P7J18j89j9L2RM9j03N3m9m8P3J16k4n2M6Lq2J70
3473B75J2n0p8p3j4J9L4N4m9PKj04O7J34q9J20j79L0l5j7Q0N6n7o1L6L4o2L2L7r1RR4j28N7
$$ plain form
4521 258 144 145 181 272 206 181 260 186 157 253 160 351 167 117 240 141 353 204 107 292 120 373 44 223 35 245 71 442
4383 442 237 252 55 178 216 132 128 222 66 181 122 29 199 34 201 142 14 136 122 145 166 163 85 92 189 82 169 136 191 136 189
4231 189 286 97 125 161 125 180 70 207 221 108 191 121 85 221 63 161 136 169 38 299 238 193 44 142 57 68 136 32 85 144
4083 144 133 110 75 6 324 153 212 50 125 117 51 39 12 251 191 194 109 75 35 135 266 152 140 221 40 85 252 290 242 160 196
3930 196 115 204 258 151 202 211 175 64 182 125 81 80 190 37 151 86 68 135 135 128 72 120 148 42 124 195 136 119 100 237 32 136
3773 136 213 167 89 240 122 52 113 207 367 235 79 72 120 24 72 177 28 207 85 67 92 223 197 252 81 128 98 150 45
3630 45 64 127 188 116 127 61 259 125 45 169 171 285 95 172 290 101 82 114 123 172 69 122 73 25 98 214 190 138 184 187 105 275
3473 275 287 237 159 86 72 91 125 179 130 137 139 35 102 236 147 267 88 118 83 66 146 202 145 84 120 154 92 124 161 70 79 173 45 102
3305A02J14j46M8KNQ4K0l0k0m3r1J22j07LK6N4m8P8o2l6M5N3j44R7m8J51m5o3K6K0j63L4O6
3143A04PQ3j49R2r5J13r8L8J2K21n5L5j19l6J27j54N09M47q65o2q9Q7r5J93l6Q0j29nm3N0
2995A68r1Q0rr1P7J75k22N2m2k3K4M8K6Pj11J74p1L6j10M3q5N6NJ38P6j86J04j40K5k0J32
2843B45J71j40k0j5p9j4p2J4l6L8k4J46o3j13M9Ok2N7K7m7nm5l2O6J1r7J17J11l8j13pQ4q6
2680G4j3N3J8j5ln4K7K30k78N7n7J20j7Pj23J00j2p1J12o2k9J7O0n2Q3L3m6j24K31j27m6Q3
2523A76k0q1N8m0P5p2j8O2Kj2r2J82k0O3P9j03j09L6Mp5M1n8%kJ5J8j4l7J18r2N0q6J70j88
2355C0L5K6O0L5l9Q8p5P1j12N8Q6j7k2o1orm5k9K2O9o6Qq6QJ11K11k34j7m0J03O0j04Oj2J3
2183A26n6J3K3K17j62m1r0M1L6R5K6l3l1o9j1O1l9k4J50l5M4l2jk5o8o4l3J55q6j6J45o9j2
$$ plain form
3305 102 216 70 118 120 125 209 229 199 179 136 45 167 60 63 89 143 95 173 111 75 120 173 29 126 78 229 184 121 147 167 4 38 104
3143 104 111 194 45 137 42 155 57 95 107 328 273 308 189 153 280 126 635 1082 217 155 66 153 58 251 215 295 166 161 118 168
2995 168 77 157 148 57 134 309 87 139 97 74 98 146 172 179 68 242 171 207 97 140 55 111 116 254 330 144 248 108 133 113 245
2843 245 416 276 256 241 162 148 76 90 54 92 68 214 151 38 87 93 71 128 155 108 103 58 26 92 103 6 123 234 196 83 76 160 74
2680 74 61 114 132 117 114 60 87 317 39 96 39 159 142 149 26 126 114 43 155 93 64 81 141 89 172 205 159 35 266 139 93 176
2523 176 156 75 133 93 168 96 78 140 142 130 38 220 200 263 342 239 130 166 170 95 136 78 78 76 91 109 95 58 176 84 134 48 218 30
2355 30 65 91 151 186 147 235 160 231 119 177 263 246 224 163 157 148 103 74 96 165 99 107 21 29 140 351 117 100 60 163 223 119 125 113 126
2183 126 70 83 106 323 161 120 30 71 107 202 228 195 164 95 84 145 106 82 232 197 241 209 208 183 115 51 18 173 87 71 216 147 135
2021A35k7k8J44j3r5l2Q7n5Rj1r7K21j46p2O0n7K3O5L1k7k0m6j0oO0J22p7o2P8L6k2N7j03
1858A22j05R0P0KN5k3q5q7Q9J19j53o4Q3O9j5n9n1k3K29j0j48RP8O8K3j27j10K9L1RN3j3k8
1696A27l9N4K2J62M84M018j799L473J583n786L568m232j158l55J76k40RK1LP6p7M9o2K38k50
1573F5J06l9o4m4O8l1J23l5j16K74J36J958P19O795k425L188q132R44k547q30P5o1q8O0J09
1450B08j21m7N0kO9q1k1J8j2N1J69o3n1o9N4o0P4k7o9N4P0NM8j06R0nq2o0M1N5J82j77n4L0
1282A61j01J72m7r7J15j49Q7J11j60J0N8n7k0K1P5j11j5J8J68j79j3R0O9mj9j58P8n7P7R7
1135B20j94N8o1O3J83j0k20J14p1K04j75LJ01P0k71J12o2JJ11n4L9J03k50J56K5l6k8o9J26
992A88r7P2O0j57J73n4n7m1J51j85k0J1Q3N0J02j5q5M4r0k6O1m8J00jo5j00M3nJ2M9p5j5P6
$$ plain form
2021 135 108 80 224 211 116 84 171 116 125 114 17 238 92 20 80 23 46 111 142 115 95 49 39 33 93 215 138 76 154 190 168 225 122
1858 122 17 107 177 179 234 211 126 39 128 247 94 30 113 182 167 108 57 34 263 253 105 114 192 260 283 156 46 75 106 115 168 155 127
1696 127 88 142 164 326 810 4828 3029 6502 8085 2299 5867 1635 477 122 298 58 67 88 91 167 90 139 77 315 65
1573 65 171 132 68 24 92 61 184 149 33 307 443 2401 3120 9915 7490 10678 2546 3490 943 113 188 127 39 99 208
1450 208 87 40 90 88 157 76 55 73 61 112 281 218 167 98 152 92 166 139 70 124 194 199 247 141 231 226 144 84 125 180 362 185 131 161
1282 161 60 232 185 88 203 54 141 252 92 102 160 103 83 104 179 68 53 71 239 60 47 137 206 202 183 25 103 46 123 220
1135 220 26 84 23 86 269 259 39 153 82 286 111 114 215 285 14 126 64 65 176 122 161 264 14 170 195 159 131 62 188
992 188 91 163 223 66 239 185 128 87 238 53 33 44 127 177 279 264 179 223 133 107 168 120 220 219 154 54 97 92 104 153 78 63 139
830A39o0M5j06J72J8m3k3J65k03o6J49j07O6m6R7j80L22n8n5j23M4j05J06l8J19q5O1j5J1
687B01j39qR5J46J972N09k344l34M6N2l1q7K59j61n0K7O1r9J10J16J24Q12j66o0O13K313j154
554B823j525K242r66P054J178N739q853K97P925n201K5086k2404m96r132j739q53k95n1l81
460D48qk40J34k5K0k45Q7Q7k20L66l82J86j55J64omR9q9O0j70n1L7J08J0j68P7k5L0O0j26
313E9rJ11r2O2q6J51J07l00Q7M3L9r0%J24lp5n7K34l0kj17J06j15o5nO4j00J24j06J01jJ4
155A73M4r1M6m7Lk7P4J62j05p0J32n9r7k7J4q6J14N8j00J4l2K7J89r0p7N6j9o1O2p3J53j73
-2H7J39r3l6J3j4J16r1m4J54n4j67O4J64j91J25j00Q6l6J5o8N1l8J01m4l5J49j16L3j04J30
-150A96R4j80O6j7k8J7n2J16r5L6r0jR0p5J03j29j5R8j9R1p7o7M0j5m8P7o0J12Q7j81N4N1
$$ plain form
830 139 79 124 18 190 208 165 142 307 104 38 187 80 146 100 197 17 339 281 226 103 147 42 148 110 229 144 205 190 201
687 201 62 54 149 295 2267 2776 432 98 144 196 165 78 337 176 126 153 214 115 225 341 465 1277 1111 1051 1664 3977 2823
554 2823 1298 3540 2574 9628 10806 16545 7692 7989 15914 10713 35799 13395 12899 3767 2028 1175 880 829 448
460 448 440 200 334 309 329 84 171 258 38 404 22 208 53 217 211 207 306 217 277 107 56 93 201 211 43 120 95 125 185 59
313 59 50 161 69 131 45 196 303 3 90 133 172 82 82 206 203 128 71 305 275 273 156 262 147 82 77 141 41 165 59 160 159 173
155 173 217 126 172 125 128 101 175 337 232 162 294 235 138 111 125 39 153 211 111 125 93 120 309 219 142 198 179 118 180 107 260 87
-2 87 226 133 97 110 96 212 121 77 231 177 10 74 238 47 172 72 158 122 137 69 120 82 183 139 104 253 137 170 66 196
-150 196 290 110 176 159 131 148 96 212 117 153 63 62 152 77 180 51 36 134 115 206 129 62 102 87 39 116 56 168 255 74 128 179
-308A79L2k3K7q7J54j50N4j36J34L4j88K09j48P1r9J62j75J94j91K27k34J26j19J68n4L2o9
-440A30J1O9L1j16l4K05p0l2J6q5k0J70q6K5l2
$$ plain form
-308 179 211 188 215 128 282 132 186 50 184 218 30 239 91 162 63 225 50 244 53 280 46 172 53 221 167 199 130
-440 130 141 210 241 125 91 296 226 194 210 125 105 275 189 214 182
-514A82
##PAGE=	F1=-3433.1
##FIRST=	4521.1594499999982872,	4521.1594499999982872,	0
##DATA TABLE=	(F2++(Y..Y)), PROFILE
4521B81j26N5j2R0m2k5P2n6j03J95k47K79j83j5J59j84J96q9n3R6r4K36l15J19j44J39j03
4388A26L14k14O2k34J51N3j83M4J69k09J20j16l6J89j64J38q6k7K4ln2J25m5m3K2Q6j46J22
4250A87l4M3j8Q2J5j73k0J09o0O3j19J07Nm3Q0j11J9J01j48J48j07O8j28K32o5k5j38Q5p1
4108H4K5K3m2pN4L2o7m5OK06j51J37k17P7Kr7oM8J60k1l0o5j6nK1J35j08k8Q9j28K1J63K7
3945B77k4q7J7q7J05N6p6O0l0l6j21J29n2j0j8Q0q6Q1j05L4O9lm9m9J02K0j86O8J07l6p1P4
3788A53P8j75R2M6j3r7J41j25p4R0P8J63j41j54j9J29j43O7M5o3J22j51L4J2J72j02K6j71
3650B0M4K1O0j31N1O9P9j05mKJ70j75j6J22l6J36k09L6J51j99LLPR2j44P3m4j9M6P7oj0J8
3487A82L4j13J46L0p4l5q9J1j5Q6N1q1k5L0j02O0J19j38J22j41P2o9L0J4L6m1Pj5Q4l9k5J1
$$ plain form
4521 281 155 210 198 288 246 221 293 237 134 329 82 361 178 163 322 138 334 245 192 288 194 430 115 234 90 229 126
4388 126 440 226 288 54 205 258 75 119 288 79 199 83 47 236 72 210 124 97 121 118 66 191 146 103 125 211 65 187
4250 187 153 196 178 260 275 102 82 191 131 194 75 182 187 144 224 113 132 233 85 233 126 194 66 298 233 208 70 155 84
4108 84 109 132 90 83 137 169 102 57 63 269 118 255 38 115 117 20 14 62 222 201 171 106 90 85 106 241 133 105 194 66 87 250 277
3945 277 253 166 183 96 201 257 181 241 211 175 54 183 131 121 103 183 97 178 73 107 176 173 124 75 177 197 11 79 186 150 79 153
3788 153 231 56 148 194 181 84 225 100 26 116 194 357 216 62 43 172 29 96 141 78 200 49 83 95 267 165 191 20
3650 20 64 85 145 14 65 134 213 108 104 106 276 101 85 207 171 307 98 134 285 86 89 92 99 191 47 120 76 57 103 180 174 164 182
3487 182 216 103 249 279 205 170 81 92 77 163 214 133 108 138 36 96 215 77 199 58 130 61 91 105 141 100 107 92 176 137 112 123
3330A23k3q8J35q3N6J05j31Nj1mM2R6l3j3l0j12J86j58OOL8n5P6k4n0J15L6j36M4n2J68n2
3172A82m3j2M6j61LQ4PJ01j31N1o8J11j11N8l8K50j7L2j44o1J65j48O90M13r83j89m9Q4p3
3030D9J92p1J06j34J8k5N1j26Q8m0l4N4J59k14J16k7r0O0M0Nk0j27K47o3L6j56L0o7N7RJ11
2877B34J04j71R2j58M4l7J17J72j42qNq1j6p3K4k6k3M5J14o3j02J01p2j7M9M8p9L5m8n8O1
2725G1K5r3J44M3jj36L1N6q1KO5J9ml6k7oK32k26O3q0J07K2kj15K0J7p0J22m2k7L2qj6O5k6
2552A40k1n3J57j26J9P1l3j07P7NO5p6J3O8m5np5Q6L7O0J21j41j16L6Kq2O9o0k6j7N7J5K7
2390A42p8J30j58Q6p0J81k02QM8K4P4n6J01r5J00j37O2J00k1K1j06j1Km1K0n2R9n2J8j04j2
2237B1J33K14k59j9k0R2M4o8k7k7K5m0M0pK67j95k2j14K5N3R2qrj5r5nR0j1o5J18k7M0q5L6
$$ plain form
3330 123 100 12 147 64 120 225 94 99 88 84 126 222 189 176 146 34 220 62 68 74 112 57 133 109 59 174 210 74 118 66 234 182
3172 182 139 127 173 12 15 99 106 207 76 127 59 170 59 117 79 329 312 344 200 139 304 156 846 1259 276 87 38 122 49
3030 49 241 170 276 142 160 135 186 60 148 108 74 128 287 73 189 162 72 132 172 177 157 30 277 214 250 94 124 57 114 123 234
2877 234 338 167 259 101 145 108 225 397 255 247 252 171 155 82 106 80 57 102 216 153 51 152 80 63 112 160 81 116 68 10 71
2725 71 96 3 147 190 189 53 84 140 59 61 126 145 141 105 78 72 304 78 141 61 168 190 188 73 93 110 40 162 120 93 125 117 101 166 140
2552 140 119 66 223 97 116 187 154 47 124 129 194 118 131 199 154 149 74 160 197 257 378 237 121 157 159 77 146 86 60 43 100 115 142
2390 142 64 194 36 122 52 233 31 39 87 111 185 129 230 135 235 98 160 260 239 260 154 143 145 104 124 72 171 119 137 33 21
2237 21 154 368 109 90 70 162 206 138 111 84 109 69 109 102 369 174 152 38 63 116 208 200 191 176 81 76 166 155 90 208 181 221 136 172
2070A72Pp2q6QJ44r7JJ48m3j4n1JJ42k8q6m3P6o9K7j7q2K44j89o8J18r3QK8Q1k6n0k2Lj6K3
1898G9J45j10n5J07K1j5O8j07r4N7J24n3N4np6j25P8J26j52l5M4Q1kj1r8k0K65l7j12j6M1
1745A67J01k6j08r8M2M9l4O7k4Mm8KJ02l6K26M136j341K892Q71m373K779l968r37l06J12j30
1617A21p2K3J1J01q7J4p2K85k57J03n0o6j7P9n1J00K0q6J96K4J560L174P405P42L11q826j069
1484C616k653q45J25j29m3J4J13j45K0k0K6P8r7k5P3n0L5J38l5l6j3Np0J04n5m6O9RL1L7j52
1332G9J30J8p1q1L5O4K05k08l4L7j14J56jj60J38j32P9R4j45L2Q6p1o0L9P3r5o4N5J82j97
1184F9%K8Q8m0J1j29Q1l8O3J02j73L3q4J25J59m8j92P3o8K48k38L5N3J22k66J01k8j8J00k0
1036A49J9R4k48J38K5k1n8j1Q3j32J10K6j15J80n1p6m1J64j44k5k8Q9O5O9pq9Q0j23j4L4j0
$$ plain form
2070 172 179 107 21 29 173 76 77 225 182 168 117 118 260 232 146 103 179 110 137 120 38 282 93 25 143 50 58 86 167 141 91 69 72 56 79
1898 79 224 114 59 166 187 172 240 133 39 96 220 167 221 216 140 15 93 219 67 32 76 157 155 144 46 26 291 254 142 126 167
1745 167 268 242 134 36 78 127 93 160 136 140 92 94 196 160 386 4522 3181 6073 6944 2571 5350 1382 445 139 251 121
1617 121 49 72 83 184 97 111 39 324 67 170 120 54 37 116 65 165 185 99 295 319 1879 5053 12458 13200 13511 4685 3616
1484 3616 963 118 243 114 71 85 198 53 73 53 79 157 60 35 108 58 93 231 196 160 147 152 82 186 131 85 154 163 194 231 79
1332 79 209 227 156 75 110 174 379 171 137 174 60 216 215 55 193 61 140 234 89 121 207 136 76 115 188 93 29 84 266 69
1184 69 69 97 185 145 156 27 108 70 133 235 62 95 11 136 295 247 55 128 60 308 70 105 158 280 14 115 87 69 169 149
1036 149 168 262 14 152 177 156 98 87 170 38 148 174 59 239 188 112 71 235 91 66 38 127 192 261 254 165 245 122 108 142 132
884A32Q9M8r6j59Q6KK8N8o2p5Q1m3O3j41J74Mp2qJ80j58p5J05l0Mj9J34k01L19r2n6j45O3
726A38j05J01q8J91j12O0K2Kj14l6Q7J48K291M85k692k06m8O3O2k31L04n6m1m8P6r0Q9P9o0
583B71L05J31K09K18J868l47j012K691j20J0898J947J0325j7770m948J3445J003K3418l2690
495I842J921p960j734p86m07j02k94L8k28J23j07P4l24J77mj52L43m03J89j56K01N2r2J24
377C35j35J60k52p1M2M7N5j61J20n5L6R9r5r8Q6K3jp5J12J99l40O7qO7j01nJ56j5m0k3J36
224B65Nk5o8R6j20n4n5J25j14J02j42J35nlP2r1L1k3M2p5O9J55j4j19J06o2o5p5K5o8N8J25
67B33r0K8r4N7J99j38m1Q1m3m7K8r3J63j63J07nj06O3m1J32j30RJ38o3j67J05J19k34K02r2
-81A17M4j4k7l0O0q7J31l4m3J14j04L2j03J45Q5j96J25n8j1K8q4J46j13M8j01j0J49j71J55
$$ plain form
884 132 221 269 173 14 100 102 130 188 126 51 132 89 152 11 185 189 117 109 289 131 56 161 131 135 116 250 49 368 276 220 75 138
726 138 33 134 46 237 125 185 207 209 95 59 146 294 2585 3070 378 172 124 187 249 18 322 266 225 177 253 163 252 331 271
583 271 576 707 916 1134 3002 2655 1643 4334 4214 15112 17059 27384 9614 4666 18111 19114 42532 9842
495 9842 11763 3803 2069 1283 876 774 480 518 290 413 306 380 56 233 229 77 420 17 206 50 251 303 211 335
377 335 200 360 108 37 79 126 181 20 140 85 121 220 125 27 113 136 135 60 172 371 31 98 90 157 56 51 207 192 152 129 265
224 265 270 245 177 273 153 99 44 169 55 157 15 150 145 142 214 123 154 131 173 98 167 322 308 189 295 233 168 93 118 50 108 233
67 233 143 171 77 134 333 195 154 235 192 145 173 80 243 80 187 182 76 139 98 230 100 109 247 184 17 122 241 7 209 117
-81 117 161 147 120 90 150 63 194 160 117 231 127 159 56 201 286 90 215 157 146 174 90 236 123 171 70 60 209 38 193
-224A93j10p7J55n7J04mj34L5k7LM2r0J53R6k21R0M0N3p3M7j07K09k26J17j79J73jj24J64
-367B44k14J37j09K24j60J45j50J72j93J17j34J21k0L5j1q1J10J7j36M4J33m9nJ1j18M7J16
-499B93r0N5n3
$$ plain form
-224 193 83 6 161 104 208 204 70 105 78 81 123 33 186 282 61 151 191 244 171 218 111 320 94 211 32 205 204 80 244
-367 244 30 167 58 282 122 267 117 289 96 213 79 200 180 215 204 123 233 250 114 158 291 242 237 248 130 177 293
-499 293 203 258 205
-514B05
##PAGE=	F1=-3442.94
##FIRST=	4521.1594499999982872,	4521.1594499999982872,	0
##DATA TABLE=	(F2++(Y..Y)), PROFILE
4521B73j50J11m4N2j1J3N1p4j65L08l13K63j71O5J27j77Q3L8n9nP6J15j83rp7O1m7K34j10
4378B75ok05J16R5k58L4K64k54J51j74pK39j70Q4j11R1m7m7l1J46q1J2N1K0j50J61m7K3M0
4236B14J20r9j30q0J74m7K2o0N4l5K2O5j11Q5J6p5J37j14N1r7J52m3m1o6K5k5J9j8L0p7K5
4083I3J00j16l6P8P1q3J64k52O1M7j24M1O7M8N1q9m0J1M8p6J37r1k0P1k7n1J49K8op6k8k6
3926A24M5O3l4O0n1m7p6Q8m6K6k4L2jL8j05O3M8lj01j9J55j9j58k2J06K5j19J48mj25J00%
3768A67Qj14J35j28l3O7Q7J28j06j65m2K08j57O0l0K7O3j61Q3M8J37j24m8k6o3P2M4o6QN4
3620A33Q6j34J3O0J00j98M2J47r3J38k12L3J52j91K2l8lJ40j88J10l2MK4OK0J6%O3j18J03
3473B05O6j13J5j11N1n3J21O7j10n1M8m7j0J07j48Q2p0R4r5N0l2J6ML3n7J29k1p0l1M5j7K3
$$ plain form
4521 273 123 234 190 242 231 244 295 221 56 364 51 314 143 208 335 158 241 279 220 215 291 406 223 214 137 198 151 385 275
4378 275 269 64 180 275 17 51 315 61 212 38 31 270 100 184 73 164 117 70 39 185 104 116 167 187 37 198 151 174 214
4236 214 334 235 105 25 199 152 174 114 168 133 155 220 109 194 210 135 272 158 209 112 264 221 180 114 139 114 133 115 145 68 93
4083 93 193 77 41 119 190 107 271 19 80 127 3 44 111 159 210 121 81 92 140 64 201 110 90 161 134 83 232 260 254 178 150 124
3926 124 169 232 198 258 207 160 84 172 126 152 128 160 159 197 92 155 203 200 99 80 235 216 58 36 142 167 48 196 192 67 167 167
3768 167 175 61 196 68 35 102 189 317 211 46 4 212 55 115 85 112 175 14 97 145 282 158 110 84 21 93 137 71 79 133
3620 133 219 85 98 158 258 60 102 249 156 294 82 115 267 76 98 60 57 197 9 119 87 91 115 121 141 157 157 220 102 205
3473 205 271 158 173 62 113 60 181 248 138 87 135 88 78 185 37 119 49 143 48 98 66 82 86 119 62 191 170 100 69 114 97 120
3315A20m3N8Q2q0o2l2N8m3J46m8J8k9p6K05j99JqjO%L6p2J81K9j30k9j1J64p5m0J5M5j54J4
3148D6L5L4Q8r1nl1J03j27Q2p9K59K0M7j45j22J77q9Q08L86j085k33o5R1l1J42q1J04j20M7
3005A65k1M3j17P7p5J3M6J10j65J53Mj47O7K7lm7j18L00p5L7j80kj8M4OR1J19j21L7j30M4
2853A64n2Q9J69j44j4L4p9j8r3O3po1P8P9o0q5J40j04J0JL7p3N5n7n7P9np2J42j1J5j37N9
2690H5K0k5oN3L1Qn7K0o9K05j60R1j14P9O8k2q7o7M0l0Q8Jj3L1r7N1K8o5j3L3P3j15O7N9n7
2518A34j21R6M3N8q1M6O5o7j3l7l5R6N7J46j76j10M9Qj01Q8m4m8k5N9K6Q4j19J34j80P3l8
2365F7J67k03M7Lj3R6l3Q9r7R9j49O7R9l8P5j47oJ0m3Q2j20J12m3M0j29mJ41J86k42k5nP3
2208A56K3k1o4j9RnN4m5L02k11j2j17K4M2Q2l0J1j7j03nJ31pn9N7pJ9j25O1N2r3o0J8J18j05
$$ plain form
3315 120 77 135 217 137 75 43 101 58 204 156 174 145 69 274 75 76 68 67 73 73 109 37 218 247 117 88 77 241 166 126 141 186 32 46
3148 46 81 115 203 112 107 76 179 52 134 55 314 334 381 236 114 291 202 1010 1396 311 78 13 104 73 215 134 238 118 165
3005 165 144 187 70 147 72 85 131 241 76 229 233 86 153 180 177 130 12 312 237 274 94 92 74 118 124 215 334 213 250 120 164
2853 164 112 201 370 226 212 246 167 149 56 119 112 51 129 208 148 63 203 99 109 110 147 74 129 72 15 94 89 17 159 148 163 26 85
2690 85 105 80 74 127 158 166 109 129 60 265 105 196 82 161 229 207 120 53 93 63 151 152 139 170 73 124 152 87 74 107 180 65 132 191 134
2518 134 13 109 152 210 129 175 240 173 160 123 88 184 241 387 211 101 150 158 57 145 101 53 28 87 113 197 78 212 32 105 67
2365 67 234 31 78 81 68 164 131 220 123 222 73 140 239 201 276 129 123 133 90 172 52 164 121 161 32 28 169 355 113 88 83 156
2208 156 179 158 94 75 84 79 133 88 390 179 167 50 74 116 198 168 179 162 59 54 185 178 119 176 169 188 63 124 176 83 23 41 159 54
2040E4L2J25Nl5n2J8J36m0o5o7Q2r2L4nn8K44k13o5J63j25k2J1J18j9r4L0jK0k0J10j13o5
1883C1J53qKN8q8p1RJ61r1M3K5r1p9PJ21j39j8KJ12j3N5j39k6K74m9o7k8kJ09q7n5n7M5K0
1716A19n6Q9o7P1l7q9K32n3P45O518l857O043m33n840M144o054j059k22l2L5j68M0K2J04q4
1592A11l9k6L05k94J17o3k9l7R2o3P4M6JJ5j81Q04O733O301O920n537p809l969k674o86J57
1469B69j71k2nJ21q6O2j40L5J04j46K9Q5p0L2P8Pm6O3l5q7J22p6k6O5l0N1L0j90J54L5k8j32
1312E2N2M9K15k07k8M8j08J21L7j87J33j00M0J25j51L0J20r2r7O8O0o1r7Q4J53j77j5j2J17
1169A72p2L5j12R5j4K1J08j20j9p8J68J15p0j44No2K94k90M8K5J63k52Q4Pm1Q3K7NL1j69J19
1017A62l2Np1O0K9j37J04lm5J35j3j10o1J79p9rr1J35N1K2Rr4J09j28k1JM2M3J34j49j47M4
$$ plain form
2040 54 86 211 216 181 129 147 283 243 178 111 193 101 135 130 72 316 103 38 201 76 54 65 183 164 70 100 99 119 99 209 96 31
1883 31 184 176 178 236 148 77 86 247 156 199 224 133 54 61 182 43 25 27 139 126 181 42 16 290 241 174 146 144 253 166 111 54 99 119
1716 119 63 152 85 156 119 30 262 209 954 7472 3615 9658 9225 3385 7529 1475 416 194 162 197 29 69 91 195 111
1592 111 72 46 351 57 174 111 82 45 137 74 148 194 195 210 29 833 7566 13867 20787 15250 7441 3472 798 112 269
1469 269 98 76 71 192 106 168 28 63 167 21 50 135 65 97 175 182 136 199 164 77 199 123 97 162 132 183 213 23 177 212 184 52
1312 52 104 153 368 161 133 181 73 194 231 44 177 77 117 242 91 121 241 149 52 120 180 119 22 106 259 82 67 55 172
1169 172 100 135 23 118 104 125 233 113 94 16 184 299 229 85 90 28 322 32 80 105 268 16 100 107 66 149 176 181 212 43 162
1017 162 130 135 64 124 153 16 120 117 72 207 194 84 23 202 123 114 23 158 209 231 240 146 255 127 106 107 149 192 326 177 30 74
859G4K5P9L1l5j32R1j6M4j20J12L1j39N6J36o2j32P6O2n8LJ75k12K75j06o6j29M4k%l6J40
706B09n9K4N5m3p7m7O4J29K228K14k551J7r7P2J64k11J47J01l0j51J14r4P3J9r1K37rM20j17
564G10J153M57m85K910R58J4837L006J5499k7437j79J8238n093J7163l7208N527o364j747
480A945n41o64j07j73J43k20L3n2qj97J04j04r4L09k96P9l0J07J97k67J64j58K71l48ol3K1
347G5O1j09J07k4j9J20Lj43pJ02Jj21O7K92l59N0o2J06j28J0J54j2K5j2J9R4r3J0N1r2n1j13
190BJ76r8M8j05J33m0K5O8j12M3MN0p3K6J29R2j73P9p5k4q8L0p5L0J51j8Jj48P0K14j94QJ15
27B71p6m0pj19J88j55P4P5j33Q0n2J05j23M8Q6k5j46J17L0j51J74n6nL4r3K0L7j23J44J7p1
-125A25P5o7Mj08J99J0j85K10j10qL4p7J32p5Or4RJ51j22N2o7l9J05q8J13Q1j76mlM5k6p6
$$ plain form
859 74 99 178 209 174 42 133 117 161 41 153 184 45 101 237 175 43 119 181 123 126 301 89 364 258 192 63 107 105 105 69 209
706 209 150 174 229 186 109 62 126 255 2483 2697 146 163 66 138 302 91 238 339 309 158 272 178 251 270 179 416 407 827 710
564 710 1863 2320 1835 4745 5703 20540 23546 39045 11608 11429 29667 24574 41737 4529 10056 3692 1945
480 1945 1404 740 633 460 603 383 416 364 356 159 263 159 65 374 78 157 127 234 431 164 328 170 441 93 87 54 75
347 75 136 27 134 110 91 211 214 71 64 166 167 46 113 405 46 96 34 140 12 22 176 164 189 177 196 290 197 207 258 166 115 2
190 2 178 80 128 23 156 116 141 209 97 140 144 194 121 147 276 368 195 274 199 175 87 117 42 72 223 205 206 58 128 342 148 156 271
27 271 195 155 148 29 217 62 136 211 78 158 106 211 88 136 222 197 51 168 198 47 221 165 160 194 101 121 158 35 179 196 125
-125 125 200 133 137 29 228 238 53 263 153 145 179 102 234 159 165 71 80 231 109 161 94 55 160 72 185 266 90 86 83 128 102 26
-283B6J71O5k06J17j0J21j67Q6j31K48k92J73j08J07o6L3L9j16M4k9J84p4J8m7N4q5M7m6k3
-426A33J0O7L6j34R0J2r9N9R5n5L2jj39J14K9m5N7p4
$$ plain form
-283 26 197 262 56 173 163 284 117 203 72 320 28 201 93 200 134 167 206 90 134 105 289 215 233 186 240 155 202 156 133
-426 133 143 210 246 112 202 214 115 174 269 214 246 245 106 220 249 204 261 187
-514A87
##PAGE=	F1=-3452.79
##FIRST=	4521.1594499999982872,	4521.1594499999982872,	0
##DATA TABLE=	(F2++(Y..Y)), PROFILE
4521B87r9O0qk0oQ6K4j75k5K42j23J5j69J96lk8j68K49j44j01L07j15Q4j69J0l2j3J21J01
4378C84j99n3k0J69j40n3K06k48J83r5n3K07j22n8k5J33p8r7O3P0j42J15P3j06p0J72q6K9
4241A59R2J50k28n9k9Q2M6j03P7l1j4jL9l1J16j21O2O0l3k2l6J4K3j09O4o1N2j4m0R7j73J7
4083D5J54j60M3Q8p4L9J18j80k4J02j38J13Qo8J58j87J4K7J15j85J54o6K6pJ03j64J56M8%
3940B58q3n8P2p4P2J6M5m0p2lJ0K1lj6j5Q5k1l6L5K6j6j42OK21r0r0n6OJ28j40J77j05n6J27
3773A89n1J8j05J16j37O3k5J22N7k1j87J8J73j25L0j01Q5K5j03O0J35L0q8j14O2k1JK1L1n8
3625A00K4P4j03PJ08mj53L7K01j66J34k03P4J02j70N0o3m3J77j30O7%rK3p5M7J6qP9q6L8J30
3468B75j72N5j01P4r1J37J02j30p2M6L9j12J04p7l3J7J04j09K7k2k3Q1jq7J72qj00o8P1P5
$$ plain form
4521 287 188 248 240 220 214 300 324 149 124 366 243 258 89 285 282 254 86 335 191 90 397 282 366 197 207 175 162 283 384
4378 384 185 132 112 281 141 88 294 46 229 134 81 288 166 108 83 216 138 41 104 174 32 147 220 114 44 216 130 159
4241 159 251 401 173 114 85 167 213 110 187 156 142 141 180 149 265 144 206 266 233 211 175 189 212 103 167 106 158 144 104 201 28 45
4083 45 199 39 82 170 96 135 253 73 49 151 13 126 134 66 224 37 51 78 193 8 162 96 122 115 218 54 210 258 258
3940 258 175 117 189 115 187 203 248 208 136 133 143 164 161 145 130 215 194 158 193 219 203 61 67 288 198 108 52 58 186 46 223 118 62 189
3773 189 138 156 51 167 30 93 68 190 247 226 39 57 230 105 135 34 119 144 41 101 236 266 178 64 126 105 106 127 158 100
3625 100 124 198 95 102 210 206 53 90 291 125 259 56 130 232 62 112 49 6 183 53 120 120 111 134 59 106 122 114 193 107 145 275
3468 275 103 158 57 131 40 177 279 149 77 123 162 50 154 77 44 61 165 56 83 61 38 119 118 31 203 195 95 27 98 173
3320A73q1NN0M8j0j09o4J38r5J26p5P6o1J0J93k20j7j1l1O5q3Q9p4J98L7j26r9M6J60j14o8
3168G6J05Rj22K0l6Q8M7l7o6J2P9j06P6p8K22K9R8j40j60J26nQ76L69j165k12r2Q1L0M7n7
3020A14O8o4N6k5J9p2N8q7J3O5K7q5J62N2k07O4J7mp2p9L23j11L8j62l0KM3mR2J01n1m1p6
2857A44M4q2P3J62j42n0P6p7j4j13J11J6m6L7N2n2o2J55q8L1o4Pj5L8o2m3R9o1l8J21k9j5
2700A13n5J4%L0QQN7Oo3O3j30J50r1J33j48M7J14n8l4j09J1J7M5N0K0Mj68J18k1o0j4Q4J4
2538A55p4N2O0r5n0M6O4N6q4P2N6n8l5j6r4J08N8J46j97r7Q6J4j30Q7ml4l6qN5J49j46J08
2380B14j05k6J3J21j58Q1p1l6R0L3N3p7O3j45Q0O9n7J29j79QPm5J58j77J01l8P5j64K4J49
2232A90J24j89l5J2M2mM3j11%k4N0O0r4L17k00j6j07O1jP4n1K3m0p1nJ52l1j9j6L4k1j40O2
$$ plain form
3320 173 92 97 147 195 185 76 12 150 55 181 106 182 121 131 324 104 87 76 45 110 27 116 42 240 277 151 52 98 258 144 76
3168 76 181 190 68 88 52 140 187 150 84 96 175 69 145 67 289 318 416 276 116 242 237 1113 1482 317 105 13 94 124 171 114
3020 114 182 118 174 149 168 96 154 67 80 145 172 87 249 301 94 158 175 171 99 20 343 232 270 108 78 80 123 119 211 312 261 220 144
2857 144 188 106 179 341 199 149 225 148 134 21 132 148 102 139 191 139 77 232 144 175 111 118 103 141 79 36 135 74 36 157 128 113
2700 113 58 72 72 102 110 118 175 181 118 181 51 201 110 243 95 142 256 198 164 55 66 83 128 178 198 202 34 152 131 71 57 141 155
2538 155 81 133 193 98 48 94 158 214 130 202 258 200 165 149 55 163 221 367 170 73 159 173 43 130 126 92 56 48 103 252 106 214
2380 214 109 83 96 217 59 140 69 33 123 156 209 132 195 50 130 199 142 271 92 100 107 62 220 43 144 106 181 17 41 190
2232 190 314 125 90 102 144 140 183 72 72 48 98 158 64 381 181 165 58 119 118 192 141 164 124 53 48 200 169 150 134 168 147 7 69
2070F9J12j24J1k7R4j04O5P2P2o9l0K3J26m8l9r2R3j06J8K7k6K13j99p6J98j57o1K1J29jj33
1917E1P3oM3l5L8p4p1J77l5K7K5n2o5j8J68r7K5N6j34Oo6J19j20j4J1J05n5J28j53m9K49k8
1760B29m2rk2N3j34K8M9qn9L0L2j33J71ok4L16L58K155J4117j1249J6482k36j6580J1739j3628
1637C629k740n12k67J65k47O3K5Q0o1l8M4K61l72J60q5L9p5Q0o0M8K8J46k67N25K353P572
1509A0494L152J6075j4316m767o157l725n18Oj29o8J1J19j9Q5k05M6J03j50P5M0n4M5k8P1
1391A86o7J15n1j16J36q1j7M0m3P9K7j70J10N1J9j88Q7NK09j73l2O1j07Q5P0j57Q1p9qK10
1243B82j89J9J54j27j03R0K6j1j07J05P8j16m1PJ09o1%r6J12J5m5J17o1p9m1J97M3n3j05n6
1095F3l2K97k89kM5J65k31P6L2o7N7P3Qq0n2J38j45M4o1J38l1r2K8k2L6N1N6j55RR2JL6j80
$$ plain form
2070 69 181 57 68 41 135 31 96 168 240 171 141 164 290 242 203 111 204 98 116 143 117 330 131 55 253 96 35 56 185 184 51
1917 51 124 118 161 126 164 90 19 196 161 188 213 161 96 78 246 149 174 230 96 102 36 155 35 21 32 137 82 210 57 8 257 229
1760 229 187 178 156 209 75 103 152 144 85 115 147 14 185 179 155 471 829 2984 17101 5852 22334 22098 5518 17257 3629
1637 3629 889 377 110 275 28 91 116 196 135 97 141 402 30 190 105 144 69 149 89 137 165 311 44 569 2922 10494
1509 10494 13646 29721 15405 10638 4481 756 238 244 115 47 58 177 158 243 38 84 187 37 112 152 98 143 115 186
1391 186 119 234 183 67 203 122 105 145 102 181 208 38 148 199 218 30 117 122 331 158 126 187 80 165 235 78 159 80 72 282
1243 282 93 112 266 139 36 126 152 141 34 139 217 101 60 67 176 115 115 19 131 146 101 218 157 78 37 234 277 224 119 63
1095 63 31 328 39 37 82 247 16 92 124 57 114 187 195 115 63 201 56 100 39 177 146 54 82 60 96 147 203 48 57 149 150 186 6
933FK25j2k4K9r7J22r8n7KO0k5K57k21r4n6O3J71m0Oj82J08lLn7NJ09j36O2K4P8k15O0J57
770B30j02oK18k05J92q3j14Rp4J21j36J54o7O5oO0j22l1k3M7J16K258O5k352j39O7l0K19j08
628B23j17K76j3k81J69j06M8p0M5Q4J01L45j33J31J160mK812K078J8290M359K0678l4170J5929
514C1834J9504k2927K1778k3372l178j6885l431r38r88k81k72Q7k84j68R4k70Mm0j86o9K58
411B70q2l7J42j47M47n25K37j27L37m13O6j59P2Jj5L2P1r6Q1J67k27O8j6P7j93N1L18l51L2
268H1l8P5o4m4J27JR8k5q5K02j82R9l5k3p3o4J01k6n0k3J34j08J05L7j59P2L5K6k8n6R9J92
111D01k17N2j00K0m4L9j34Q4P6J11o0j61L3K34k54P3J56j21l4m7n7J46j44P6Q8q6L3l1K0o0
-37I2P0LN7j21J03r9KR1K3n1R2j79M6K8j11Q4J13j26R0m9k5o9K07j29j23L08j74j7J3J3L4
$$ plain form
933 6 231 219 195 224 127 249 151 94 96 156 131 388 167 73 17 80 251 211 217 35 143 140 143 86 91 200 64 126 150 228 13 73 230
770 230 128 122 340 135 327 244 130 139 65 186 50 204 137 202 196 256 134 103 80 127 243 2501 2566 214 75 142 112 331 223
628 223 106 382 369 88 257 151 199 129 174 258 359 704 571 702 1862 1858 4670 6748 25038 29397 50075 15905 31834
514 31834 51338 28411 50189 26817 23639 6754 3323 2385 1397 1116 844 931 647 479 573 303 307 267 81 12 270
411 270 188 151 293 146 593 68 305 178 515 102 168 9 81 82 67 99 170 74 155 322 95 163 147 224 31 82 400 49 81
268 81 43 118 54 10 137 138 236 211 126 328 146 245 210 187 114 50 151 125 75 52 186 78 183 220 61 133 168 194 166 110 209 401
111 401 184 236 136 156 112 151 17 101 177 288 228 67 100 334 80 153 309 188 154 107 50 196 52 128 216 130 163 132 152 92
-37 92 162 165 222 101 204 105 107 198 221 170 262 83 129 157 46 130 243 117 207 158 133 64 271 142 19 327 153 136 149 162 196
-189A96M0r9k1J8P5Pj10k2M8%p0O1J97k09k8N7J0p4J6J38l7q8R8q8K14l04J53j50K63k22R4
-342A63K7j9j62K06j07J05j05J03K4J02j99J27j41J18q9P8j65O0R8N6o5q1M7K9n7J71j55Q9
-480B58j6m8O2q2J10n2q
$$ plain form
-189 196 236 137 116 134 209 216 106 84 132 132 62 123 320 111 83 140 150 76 92 230 193 105 203 115 329 25 178 28 291 69 163
-342 163 190 171 9 215 108 213 108 211 235 337 138 265 124 242 153 231 66 126 224 280 215 134 181 210 153 324 169 258
-480 258 242 194 256 174 284 232 224
-514B24
##PAGE=	F1=-3462.63
##FIRST=	4521.1594499999982872,	4521.1594499999982872,	0
##DATA TABLE=	(F2++(Y..Y)), PROFILE
4521D30Jn7O5j6o3J05J5k45J39L3Q8j29j30K00j64J62k01K22k55K4K89m51M84k62O4j15Nk0
4383B18L20m81J94j09J90l5j2k3j03J21K4q7Q4nk72J99N3p5j2oN5j49J51N3k22R3J04j42J07
4241B33P3J58l11LN6j19K20k70K45j41J16j09j3R8J03k69K18q2J38j37M4j68J41k07K11r3
4113A38R4o8k6J31k22R7N0j35J11M8j21R4L1n5n5R2j50J76r2q2J93j70K9n4J94j84J10n3Q2
3970B03j47K51k87J91Q0j0j41J3J06j67N5O1QJ2r9P1q6J55j25J7j6J19j05R5m4K2m0j17k3
3827E2K84j92K0m8n2J44j24J58j93J0J62j08K4m5Q9j41J32j26J54m9J12j98O6R1m9nq5J2M6
3684A41n1J0K52j32oo4k4P1q5LJ40j23j9M3Lo3J62j28rn4K59k37J50k03J51mj29P9k5o4J05
3532A49j3j0N1o2M5n9Pk0k7Q1j0n3K14k37O5j8M6r8J06J50j37q7K2J39k23J26l7n8M0J13j22
$$ plain form
4521 430 431 374 439 423 360 465 480 235 374 407 495 366 236 436 272 434 233 455 200 224 513 62 546 284 348 233 238 218
4383 218 538 57 251 142 332 297 285 262 159 280 304 217 301 296 24 223 276 201 189 183 238 89 240 293 71 164 268 126 233
4241 233 306 464 153 156 212 93 313 43 288 147 263 154 141 239 342 73 291 209 347 210 254 86 227 20 231 138
4113 138 232 164 138 269 47 144 194 59 170 218 97 191 222 167 112 204 54 230 138 56 249 79 108 54 248 64 174 121 203
3970 203 56 307 20 211 291 281 140 153 259 92 147 208 216 228 129 200 114 269 144 161 145 264 159 254 210 232 192 75 52
3827 52 336 144 164 116 64 208 84 242 49 59 221 113 137 92 181 40 172 46 200 151 263 65 131 222 173 168 83 95 141
3684 141 90 100 352 220 214 150 126 197 112 115 255 132 113 156 159 96 258 130 121 67 326 89 239 36 187 183 54 133 108 44 149
3532 149 136 126 177 115 160 101 108 88 61 142 132 79 293 56 121 103 149 51 157 307 170 83 105 244 21 147 110 52 92 205 83
3379H3l5O0l8R6m8r9J98Rj19ln3J77j55O5K0J0O7j19m3J24j07Q1j01J23j25J26J69k07n7n
3232I4J2L1k5K0l8J41O8j28r2K5J81j69j13K13m5n5J2r3J35nJ9r9K9L7l4L3m4J49%J91j53
3079B97j30jQ6R06L71j235j70p8K9J12p2nKM4K2j6k8rL9n4n3J13q1J7J35J16k64N8K0nr7K
2921G1K94j64L5r6j8n6O8k7J31L4K5j23nM2j31Q0J59j30j22J27o4j7m2P7L8j2m8M7l9m0J44
2769B38m7M5j31k3P1On4m4J15j30J3Q1Kj03P7o7L3K5N5m3P6j2n5R4j83Q1k9J79j74K5J49j08
2611A62M3j01n6L9L5O7P9n7j23Q9p2k2K0N7Ll2j4Q3j39M7k1O0N8q0Q4M6k9o2k0l3L4N7J20
2449C22j79r7J53pj47N4N5%p0o5O8K12j49M3qj29Q0M1o8R2j49l6N3J19J4m5Oj34J14Ko4J69
2291B50j94J9Nl9K25k13O1l8J23j72J7J79K9j09m6L1Jl9J26j73L1m8R8O4j55L10j54l8q8J17
$$ plain form
3379 83 48 108 70 166 118 19 217 226 107 104 51 228 73 138 158 168 235 116 73 197 90 171 70 193 68 194 363 156 99 94
3232 94 106 137 112 132 94 235 303 175 83 108 289 120 7 220 175 120 132 39 174 169 188 89 118 155 121 154 110 259 259 450 297
3079 297 167 166 252 1158 1529 294 124 46 75 187 115 110 112 156 178 162 134 125 164 110 57 170 89 106 241 357 93 151 171 166 69 71
2921 71 365 201 236 140 122 66 134 107 238 272 297 174 169 211 80 160 319 189 67 194 130 113 71 148 186 174 126 173 134 94 238
2769 238 191 236 105 82 153 159 105 61 176 46 59 140 142 39 116 49 82 107 162 119 195 183 128 222 39 120 91 270 96 121 270 162
2611 162 205 104 48 87 122 189 268 211 88 177 105 83 103 160 163 131 117 200 61 108 87 147 205 125 209 255 226 164 144 111 145 202 322
2449 322 143 46 199 192 45 99 154 154 84 19 87 299 150 193 185 56 136 177 109 201 52 16 69 188 202 157 163 29 143 145 81 250
2291 250 56 75 80 41 266 53 114 76 199 27 44 223 252 143 97 128 129 90 216 43 74 26 124 188 33 343 189 151 63 180
2144A80m9Q1q4K5p8RNJ21p7L9r1R7p7n1j1J51r7J2p0P5p2O7jJ46j09J3J4J09l6k7r7Q9q1m7
1976G8Q4OJ50j41j06K28j89q6M3J00L8j31O1mM9l5n2Nk5J22m3N0k8lp5j9J37o2%Q2k06J20
1819A48j09J31j15j7N9N8j20J90j40n6J67L6n7M8Jr0l1K4J77j02r8J13o8m8J38L1Q8M76Q60
1676A694M156K5850k1594L1690N59l3444K3686k5337n441j114m46R1k84O0K9L2j6K4P2K00
1578D67m43J91j07J09q6K3m5K9m0L32k30J107N375O879j948K7527k5288J25o469o112q93l45
1469A58K8j70L5R3L4J11k25R4N6j05Q1k7j3O0j59J53m8Q6l8j54J55p4j9Km4J40J4j49P1P5
1322B21K8j87R4o7J83j09m1P3j14M5J09r2Pq6n1L26k39J4J74j78m1O4k5N3j09J31l9k2k6M2
1174A38O5l3p7l7R3M3j21J24j0j40J8K29o0J4q1n5j2K29k58m6Q4J08j98R5L2r8K4J13K6j76
$$ plain form
2144 180 131 212 128 153 75 84 89 210 133 172 81 178 101 50 39 190 93 105 35 110 38 105 104 250 141 154 168 277 241 214 117 206 125 78
1976 78 162 168 318 177 71 299 110 24 67 167 205 74 135 131 180 145 93 98 73 195 152 202 174 171 96 77 214 152 152 234 28 148
1819 148 39 170 55 38 97 155 35 225 85 29 196 232 175 223 224 134 103 127 304 202 104 217 149 101 239 270 358 834 1694
1676 1694 5850 31700 10106 41796 42355 8911 32597 7260 1819 705 259 350 66 126 155 187 171 195 267 467
1578 467 24 215 108 217 131 154 109 138 98 430 200 1307 6682 13561 11613 39140 13852 13977 7508 1396 503 158
1469 158 186 16 51 144 178 289 64 158 214 109 190 163 150 210 51 204 156 242 204 50 205 131 112 114 70 210 224 75 146 221
1322 221 249 62 156 89 272 163 122 195 81 126 235 143 150 64 13 339 100 114 288 110 69 133 108 161 52 183 144 122 96 138
1174 138 203 170 93 56 149 192 71 195 185 45 63 292 232 246 165 110 98 327 69 23 107 215 17 112 144 46 70 183 209 33
1026C3L1J91j90K3n6K06q3p7m5j9J09n4J45j63J15p5Q7J04k42K89j15n6N1r6J11l2j21P4%
884A45r7M07k97l9m7j2K80j50O3k22J35k3m5M5j34K33o7Mj21K23j83j1J92j19o3K65j77P8
746B63%k24K22j69J88k01K78l19K36j9L2k26K5M9L0J24K489L78k602m04J88r6J31J9k01K08
618C99J1l50J41p0k4j0J86r4L72J08J78m32J099L37K305L005K0693N955K5190l4899L6426
514F0526J9095l9083N6201l6376j0341l6612o771k192j459o57n88j33m31l51J06m82O3k06
426C09j05m7N7J33j6J96m82P45n94J45m6K91l92P7j85K0k3L9o0J96q5r0L60l00J92k50K23
293C08j97N4J98l06JP9m1L7p5J33j9J23m3q8K08k16J34j62Q7j29K3k8J08j58O4J47j59J85
155B68qj56N3M5nK7j65J01K44k31K8j17M0M9N1j36Q3n7K70j40j17k8K08k93J43J96j71j2p2
$$ plain form
1026 33 64 255 65 88 32 238 155 78 33 14 123 69 214 51 166 91 178 282 40 329 214 158 209 113 224 192 71 145 145
884 145 48 455 158 119 72 60 340 190 253 31 166 143 98 143 9 242 175 179 58 281 98 87 279 160 97 362 185 263
746 263 263 39 261 92 280 79 357 38 274 255 287 61 86 135 165 289 2778 3156 554 150 338 242 373 392 191 399
618 399 410 60 201 131 107 97 283 189 561 669 847 415 1514 1851 4156 7161 27854 33809 58999 24100 60526
514 60526 79621 40538 96739 60363 50022 13410 6639 4447 2988 2331 1743 1610 1179 828 934 452 515 309
426 309 204 157 214 347 331 527 45 790 196 341 295 586 194 271 86 106 83 122 62 258 173 83 443 143 335 85 308
293 308 111 165 363 57 58 137 96 133 58 191 172 295 252 164 372 156 290 128 215 86 109 81 189 31 95 242 83 268
155 268 260 104 157 202 197 224 59 160 404 173 201 84 124 173 224 88 171 114 384 244 127 99 307 14 157 353 182 170 98
12I8L3Q2q7R0mNo3L2j14M6P5q2J51r5O9k07J50l4J53p6J24k46K2O3p9m3K33k12K03p8k9j8
-145A62J66l23J03L00k32j4q1J75j31K17k18R1Oo7J74j84l4J36j14Pp9L16k25RQ1o6m4P3J09
-288C13j92R1N3q1J99k33M8n9J35p8k9J42j25j4P4j87L06j42J44k03L33l76K51k71K73j62
-416B10J03p2M0N9K1P0k24R9J22j88K77k37R5j3O7n5r7K22k00J30
$$ plain form
12 98 131 213 126 216 212 217 154 186 72 118 193 111 262 167 236 29 179 145 298 222 346 100 122 185 106 63 296 84 287 209 180 162
-145 162 328 5 108 408 176 162 81 256 125 342 124 215 221 154 328 144 110 246 132 139 60 376 151 160 241 175 131 204 313
-288 313 121 212 265 184 383 150 198 139 274 196 167 309 184 170 244 57 363 221 365 162 495 119 370 99 372 210
-416 210 313 241 281 340 361 431 207 306 428 240 517 280 375 362 429 374 277 499 299 429
-514D29
##PAGE=	F1=-3472.48
##FIRST=	4521.1594499999982872,	4521.1594499999982872,	0
##DATA TABLE=	(F2++(Y..Y)), PROFILE
4521G07N7j19R7L7j22Q1K9k40J66j17K16j45j40J49j94K09j14Q7k60J35J33m12N18k75P2j63
4393C92J4n8L77n15J91p1J41NM5k09K2N2J25j12n3J25k64J93k7o8O8r1J13j68J66Jj74J07
4255C27M0j71J96LJ34k79rJ20k95L66k55K28k20K42j71n6J56O6k46K05k76L82k57J11k09J55
4127B87j10J29m5P8j24MJ36j97J30q6n6J37j7m2M3k5M0o9P8j64K20j81J2J12p1Kj70K57j58
3985A50J11p2J29k68L45k89J49J04l3k62J93N8j48ON9m7Q4j00J16j44K64l00Q7L1Q3k12K70
3852C64j57M2m8m4o1K85l15J66m2K2K3q3J12j23m7J80j61L5PR8j55J63j46J09j64K65k05R2
3714B12j6N6l1o8r7J37n3k7L64l24J16nj82K01j62j4K42j65p2J5J11j72K33k07J09r8K48k50
3576A01J72k28K23j37n3Q5L2j06J3J32r3J05j30P7J6m2m3j02P4Q5j36K78k57LJ08mp0L6J92
$$ plain form
4521 707 764 645 742 779 657 738 767 527 693 576 792 647 507 656 462 671 557 644 384 519 652 240 758 483 555 392
4393 392 406 348 725 210 401 330 471 476 521 312 334 386 511 399 346 471 207 400 373 305 373 282 395 227 393 394 220 327
4255 327 367 196 392 395 529 250 241 361 66 432 177 405 185 427 256 200 356 422 176 381 105 487 230 341 132 287
4127 287 177 306 261 339 215 219 355 158 288 202 146 283 266 224 267 242 282 213 291 127 347 166 178 290 219 221 51 308 150
3985 150 261 189 318 50 395 106 255 359 326 64 257 315 167 173 232 185 269 169 285 141 405 105 192 223 306 94 364
3852 364 207 249 201 157 96 381 66 232 190 212 235 152 264 141 94 274 113 148 155 253 98 261 115 224 60 325 120 212
3714 212 196 252 221 153 56 193 140 113 477 153 269 264 82 283 121 107 349 184 112 127 238 66 299 92 201 103 351 101
3576 101 273 45 268 131 78 163 195 89 102 234 141 246 116 193 209 167 124 22 96 181 45 323 66 69 177 173 103 139 331
3433C31j26j00LK14k87J57p1j2L2J16j37q1J34l5P1o0j05J99L6j38O0j83K39j72J08k2k4J43
3296B90j20k7R2j15Q1j04J02j73K20J39j60j14JP7m6P2n8JM6J24j39k5o7K31k29J5J32j05
3158A41M6j0j02J36m4O0r6J3k9P1j2j4P0o5L14j92m8j40J52R23L95j316j17n0n1K19j88N4
3020A20q7J78l9K1p9M1K0mj20J51j39P5O8J90k93L6M8j5j19R5K29k26L3Njj45J10o5K05p4
2872B19R7j91P2L1j98J15J68j08j65J22k1m8M4L7N0K6j54O4j8l5J24lN0j76l2J43j9m2o5J29
2725B16j76M5K3O6j15J14j19P7l5J21o0N9l4m8J18k36M9qK17j86J7J70j74J43q3q7KQ4J9J64
2577C43j48k6K4j12J6P1qL6j3j01J38j44R4p8L5O0o6P5M2J1r1m4O0l2M7P0r0j21K13n3j41
2424F7rJ23L7j17jk9K63j28n4R4k09J44o5N3Q0k04k3J1J78rj5l5j38J60p3l5J60j60j4M2j5
$$ plain form
3433 331 205 105 108 322 35 192 121 109 141 257 120 39 173 138 209 149 44 243 279 141 201 18 257 85 193 171 147 290
3296 290 170 143 235 120 201 97 199 26 246 385 225 111 112 189 143 215 157 158 204 328 189 164 97 328 99 114 246 141
3158 141 187 177 75 211 167 227 131 144 115 186 174 160 230 165 479 287 239 99 251 1174 1569 253 136 86 35 254 66 120
3020 120 33 211 172 193 114 155 175 171 51 202 63 138 206 396 103 139 187 172 53 148 377 151 184 189 188 43 153 88 293 219
2872 219 316 125 197 228 30 145 313 205 40 162 141 93 137 174 224 250 96 160 142 107 231 228 278 102 70 213 194 152 87 216
2725 216 40 85 108 174 59 173 54 131 96 217 157 216 182 134 252 16 65 57 274 88 105 275 101 244 161 74 76 160 179 343
2577 343 195 169 193 81 97 168 160 196 183 82 220 76 170 92 127 187 121 196 238 249 158 114 174 142 189 259 169 48 261 208 67
2424 67 58 181 218 101 100 71 334 206 152 246 37 181 116 169 249 45 22 33 211 202 187 152 14 174 101 66 226 66 52 94 79
2272G9K25k22ll6J70j31m9K31q5j4m9M4l9p8K11k46Q9k4P8P3k06K66p9o3p3J73q7J02j23K2
2124A56j15R0J6O7j26R2j46J63j39L1qJ12j1n4p3N3l4L8l9J71j39O4pQ6Km5n7N3k4j52J61
1971A86L1O2n0j47K60k22o2L1M0J01j02MK0L5l0r5N7J4M9l0O6r2N4r7KP7Nl1J08j77J23j06
1814H4J45j49j5R7K2j23J60j04n6O5J36j20J34M9k93J94m4L12k31l3R1j65N6J04O7K22O96
1681A301J442O582M0311l3976N0162J584n4314L8557l9805q810j883o66o1l05N2L0l1N0R6
1588C16R9J15m32J42j09J56o5o3k8J8j04M86l9J656Q945N318q324L9858l6866N999n324r277
1479B477j627q17K58j84n6L8P5J42k04J52no3Q5q9K9O7k33J82J4k6Oj74J63o5k0k3o7K33j3
1337B55j49Q1J02k3j43Q8j41J29k3n3Q6j16j8J59no3j17J9L27k69PJ81k45M5K6o3J09j11J59
$$ plain form
2272 79 304 82 79 43 213 82 33 264 179 165 116 160 121 43 254 8 97 73 151 224 18 284 205 142 69 242 155 257 134 156
2124 156 41 131 147 214 88 180 34 197 58 89 81 193 182 128 55 108 74 112 73 244 105 169 162 248 250 205 148 201 177 25 186
1971 186 217 279 229 82 342 120 58 89 129 230 128 132 152 187 157 62 119 133 182 152 218 126 180 83 85 162 167 136 244 67 190 84
1814 84 229 80 65 162 184 61 221 117 61 126 262 142 276 325 32 226 182 494 263 230 321 156 212 316 383 605 1301
1681 1301 2743 9325 49636 15660 65822 67406 13092 51649 11844 3034 1151 485 424 119 171 201 170 220 316
1588 316 415 530 98 240 131 287 222 159 131 149 45 531 492 2148 11093 16411 8087 47945 11079 17078 11754 2477
1479 2477 850 33 291 107 51 89 164 306 102 254 249 186 271 182 211 278 45 227 241 215 221 47 210 145 125 102 35 268 255
1337 255 106 187 289 266 123 211 70 199 176 123 209 93 75 234 229 166 49 68 395 126 133 314 69 114 140 77 186 75 234
1194B34j84R2L2M9K8l0j50M3N9O4j78J17J4j72P2K69j83J13o7k6j6J42k23j0O4J9j47J35J3
1051A73j34L1J14M8n2j38K74j37l6j03K55j21q6n6RJ11r6J73j10J71k14J43J74l11L45k38
923A89m8N1q3P3O3j89J62r3l3M26l35qNq9L36k69J22k44J68q0p5J62j11K03j0l7j14J89j21
780B10m0J55j14j54L09j30n3J48k40L06k08K00j76K97l65K24m0mk96L6J49jJ26K549Q75k953
652H10m41K03j23K6J16j51k1K7k21j03J14p0K28J07K55J47J28L47K2L29L93J391L433K1602
534B8548P670K8389k9179N9177J6313m2015J05800p3332j7745o1392j1114l892k130j162r73
460B963m23o16n03k4n51n7l27l7o9L5J54N8K04n46P54n55L6oJ76l25M9j85q6N6J4o3K39l2
323C33j66M02l15K71m29L29j99N1M1k24m5K01j53J23r0K10p0R6l8k0J10j68Q6k78J91k18J37
$$ plain form
1194 234 50 142 174 223 251 221 71 114 173 237 59 176 190 18 90 359 176 289 222 196 180 322 99 89 153 172 25 160 173
1051 173 39 70 184 232 180 42 316 179 143 40 295 174 88 32 41 152 56 229 119 290 76 219 393 82 427 189
923 189 141 192 109 182 245 56 218 125 92 518 183 175 180 91 427 158 280 36 204 124 49 211 100 303 293 256 142 331 210
780 210 170 325 211 57 366 236 183 331 91 397 189 389 213 510 145 369 329 325 29 65 214 213 339 2888 3763 810
652 810 369 572 449 475 591 440 419 446 225 122 236 166 394 501 756 903 1031 1378 1400 1729 2122 3513 6946 28548
534 28548 36218 64607 35428 94605 110918 68903 174703 101371 83626 22234 11120 7228 5098 3936 2963
460 2963 2540 1924 1421 1397 846 789 462 425 356 391 545 603 807 261 1015 460 496 490 666 341 390 205 119 175 189 126 365 333
323 333 167 569 254 525 96 425 226 277 318 94 49 250 97 220 130 340 270 366 328 308 418 250 336 58 249 31 168
190A68j32K29j57O4J43j49K15n7j07J2J6pN1k40J31K03j88J3n8qJ22N2j12M0j13L53k21n0
52B13l5R6j77Q7K19j95J7m3L0P7l6R6j21R2j74J22j61N8P4q9J68o8L2r1P1j46K83p7J12k61
-96A73k6J20q7p5K48l24L83j17k9K0J18k36O2K70k60J0k27L44k93L92k83J62j1j80K83j55
-224B82n6J63j58J7p0K69k14N0Q6j17rJ09Q6k42J62J1LQ1j08l6qL0J4o5J63j41P3o2l9K56
-371E30j05J29l16M55l67J85j78K08j17KP9K2K8l7J97k66J16J67k48L12k39O0LJ25j33n1K43
-504H04k62K04
$$ plain form
190 168 36 265 108 172 315 166 381 324 217 229 245 238 289 49 180 383 195 208 150 142 264 316 204 244 131 484 263 213
52 213 178 274 97 184 403 208 225 182 212 289 253 349 228 320 146 268 107 165 239 150 318 250 282 191 262 116 399 322 434 173
-96 173 147 267 180 105 353 29 412 295 266 286 404 168 230 500 240 250 23 367 74 466 183 345 334 154 437 282
-224 282 226 389 231 248 178 447 233 283 369 252 243 352 438 196 358 369 372 453 345 309 301 331 345 280 443 302 375 313 274 530
-371 530 425 554 238 693 326 511 333 541 424 426 505 527 555 518 715 449 565 732 484 796 557 617 620 745 612 561 804
-504 804 542 746
-514G46
##PAGE=	F1=-3482.32
##FIRST=	4521.1594499999982872,	4521.1594499999982872,	0
##DATA TABLE=	(F2++(Y..Y)), PROFILE
4521A049Q1j37R9R6j72N3M7k26J54j96K53j09j68Q7j45J68k3l7k05J69j6k50M05k45N9j84
4393F07J3l6L41m61R5MJ05kR8k95P3pJ94j26j57K14k37J59p7o6J29j67J93k14J93n5j08R7
4255E07qj82K66p5R3j98m7J56l09L45j91J67k31L02j79p8J44J6j52J20m02N70l45J39j27Q5
4127C86m1M5K5M9j70K5J37j59J35j87QJ51q7M6j1nN4q4Q1j73K35k13N0M9K4k2k56K83j32J39
3980C82j05J69l11L42k59J12J14o6l30L34l0p9kJ1q3J25p6J28j44L10m63J71P2K5l11M36k73
3847A99P3pj3p1K40l55K40m1J02r9k9N9l0j11J84j83L9K3J33j90J84j29M2j39K85k17J01j12
3709A78J52m4p4j27J88q8l5M48n20K65K7l45L26j95l8L06j68j26L0J50k72K95j66J03p8J71
3581C63j81J66k65K72k38J0P5Q5j61n9K70j77J53j71Q9R1p2m5j45N8J32j49K54k37p3K14n0
$$ plain form
4521 1049 1130 993 1092 1188 1016 1069 1116 890 1044 848 1101 992 824 911 766 934 911 874 669 838 822 572 977 732 791 607
4393 607 620 584 925 464 559 563 668 666 764 469 542 535 729 603 446 660 423 582 505 439 568 401 594 380 573 518 410 507
4255 507 499 317 583 508 601 403 356 512 203 548 357 524 293 595 416 338 482 498 346 466 64 634 289 428 301 386
4127 386 345 390 415 464 294 319 456 297 432 245 253 404 317 363 352 347 401 317 398 225 460 247 297 346 370 348 92 375 243 382
3980 382 277 446 135 477 218 330 444 378 48 382 352 273 271 282 199 324 248 376 232 542 79 250 322 347 36 472 199
3847 199 272 265 252 181 421 66 306 265 367 268 239 298 268 157 341 158 197 220 353 163 347 218 260 121 406 189 290 178
3709 178 330 286 212 85 273 185 150 598 78 343 370 25 351 156 118 424 256 130 160 310 38 333 167 270 192 363
3581 363 182 348 83 355 117 127 202 287 126 67 337 160 313 142 231 322 250 205 60 118 250 101 355 118 45 259 209
3448B09m4j0J91r4j14J9K30l18K03j47L3M5J08j51o0J39k9L6l2j42K10P0j58J03k05J69j27
3315A34J11n6m4K01j20rM5j17J23j18M6p1J52J10q7j79J1J40j44J89j28L0o2J96j52M8j70
3182G9K81k80J47L2j54J59m5r5J20m8O9q4jj17J88l4rnj49M49k61O4j71J14R46M41j421n1
3045A64l5j01K90k61Q5r3K13j03P8q7L7%M3j16J16p5K6l2K63k72rR5l3j28J70J44k71L6J04
2902B48jj81J13j15K92j89J55k20J30Oj93Q5J98r3r5JM7j01J04K0M5O4k43P7J5n1J16J6M8
2759B98j76k0J72k7l4j02J43j63J6m3J44m3N4j06P3j01J78l8J2m9n1J35k51J02n8J93j78K3
2621A03J73k49K49o2r4n9J61p6K69k59Q8m9j31O0J06r1R6rj90K15j14Q5j12J0M8m3N1M8M1
2478B65j15q2J52n6K0NN0j59K47j12j09o0J56O8j61Q2j28K93r2j56J75k15J55j87J94M8k16
$$ plain form
3448 209 165 155 346 252 138 157 387 69 272 125 158 203 311 160 100 239 210 246 214 72 282 352 194 297 92 261 134
3315 134 245 189 145 346 226 217 262 145 268 150 196 125 277 387 300 121 132 272 128 317 189 219 157 353 201 249 79
3182 79 360 80 227 259 105 264 219 124 244 196 265 181 180 63 251 217 208 203 54 503 242 306 135 249 1195 1636 215 164
3045 164 129 28 318 57 142 49 262 159 237 150 187 187 230 114 230 155 181 149 412 140 131 226 193 65 235 379 108 144 248
2902 248 247 66 179 64 356 167 322 102 232 238 45 130 328 235 140 141 188 87 191 211 256 320 77 154 169 118 234 250 298
2759 298 122 102 274 247 213 111 254 91 107 64 208 165 219 113 186 85 263 225 237 188 137 272 21 123 65 258 80 103
2621 103 276 27 276 214 120 61 222 146 415 156 244 195 64 124 230 139 235 226 36 251 137 222 110 120 168 125 176 224 265
2478 265 150 68 220 164 184 189 239 80 327 215 106 46 202 270 109 191 63 356 264 108 283 68 223 36 230 278 62
2346F2j0L1J35qLl2j60J86p9k3J13j06p2J21j9J87k09p0jJ69o5j46L02k04Q7m2M7o3o7K28
2198B95k63J08oM0Q7k21J78Rp4p3K16j09J20j46J6j10J13K1J5j35R0r7J46j83Q9OM6J11j57
2055A32k6L5k3%K5Q4j38J03m6O5O7j02K4rM5j98J78M1l8N1j86K93k50k5J4m1J83p1o6P0J0
1903B01m1lqL8k5nP9j59J16j15J8L2O7o3J35q9M6p8J59k08kJ22lr1P2m7m9RK07j97K12J02
1745D32l27K37r3M57l85P6Mk32J47Q6R8L70R40K048R172N5757m7093O9866K731p6819N4679
1642G2151n5302j2465k711r42k23l30N6J2q9J21J59J35Ql90O6q1J72k1j47l0J4k5M60J99K182
1519B979J2559L131j4003N0312m6285J0849l240j2604k469j038K19j98j51l3J00J78j54J99
1430C51o2l3R0j23M9O1k07J18R0j78P2j48J40o4onj18L10n3j44J10J30j16p5Q2j96M6P4p3
$$ plain form
2346 62 52 83 218 210 213 181 21 207 128 105 218 112 40 161 142 329 120 50 49 218 153 7 309 105 192 150 197 134 67 295
2198 295 32 140 134 174 261 40 218 227 153 80 296 187 307 161 177 67 180 201 216 81 171 74 220 37 126 132 178 289 132
2055 132 106 141 118 118 143 227 89 192 146 211 278 176 200 191 236 38 216 257 219 270 84 377 127 102 116 75 258 187 121 191 201
1903 201 160 157 149 187 162 157 236 77 193 78 96 128 195 132 267 178 224 146 305 97 95 217 214 123 195 148 99 108 315 118 330 432
1745 432 105 342 249 706 321 397 401 169 316 402 500 870 1810 3858 13030 68787 21694 91560 94291 17472 72151
1642 72151 16849 4384 1673 731 508 178 234 246 157 278 437 572 580 190 256 175 347 326 179 149 163 138 598 797 2979
1519 2979 15538 18669 4666 54978 8693 19542 16302 3698 1229 191 410 212 61 28 128 306 152 351
1430 351 289 256 346 223 272 333 126 244 334 156 228 80 220 156 150 145 27 337 284 140 250 380 264 189 271 75 121 195 122
1287A22J04r5j01K00J01j29j09N2K94k65j6J90l17J19ql5J14j19J86k32J09R6M8jo1j72J05
1154A80J8P8j97R4kj07N0L17l00K09n6Nk5M8j77K1M4p4p5J64jj69Q9P8N8O3l07L50q1p1j63
1002F1K74j39j11OmR3l6J07m7K08k89J50K33l80L78l55K5Jn8QJ77k06J82j48Q0L61l22lM6
859B92j25L31l46J43k40J99j68NJ96p7J63L2o0o1R4m9o2J00j00k16L05p1j86L32k11L08k25
726C03J99j30K72l29J64q4k5k54o0K39m6J06K171J353k945l38K12j31l9J59r6k13Op1k81K82
598D24m2L43P3N85l7L41L49K54K01L30N50L003K0739R302K9779j8246Q1853J1767l1625J59414
500B69357j24656k4911q7869j5853n758k901j726j359p53p98o40k38n56k32m08l1q6R4Q2J41
401H99K01n76P28m99k6j1M5k46kj74k09J62k9k4K35L8j69L44k74K92m72L36k20L1p3j50q8
$$ plain form
1287 122 226 131 30 230 331 202 93 145 439 174 158 348 31 150 142 107 221 102 288 56 165 261 309 308 247 75 180
1154 180 198 276 79 173 171 64 114 431 131 340 284 289 264 312 135 156 200 126 51 215 214 45 134 212 270 333 26 376 295 224 61
1002 61 335 196 85 91 87 180 144 251 204 412 123 273 506 126 504 149 174 175 117 125 302 96 278 130 210 571 249 246 292
859 292 167 498 152 295 55 254 86 91 287 210 373 405 345 284 378 329 267 367 267 51 356 285 99 431 220 528 303
726 303 502 372 644 315 479 395 370 116 56 295 249 355 2526 3879 934 596 808 677 638 797 701 488 494 423 142 424
598 424 382 725 798 1383 1346 1687 2036 2290 2491 2821 3371 6374 27113 36415 66194 47948 129801 141568 109943 269357
500 269357 144701 119790 31921 16068 10310 7409 5683 4324 3571 2773 2133 1895 1339 1107 699 668 582 676 758 899
401 899 1100 524 1252 753 727 716 761 515 513 339 130 292 263 239 474 512 343 687 413 705 233 569 349 380 307 157 69
268F9L01k27J59p7K86j23N8kL2j1q8%k15J23k40J73n0J74j37P2J19j16K22j04n0j3m3K6L7
126C55k24J15J11j05J8qk0J33L5o8l4n4L26k87J6j9l2p5N7K10j69K6%k6J22%Q9k10J42k62
-22A62K03j30j1P8n2J35m0LJ2rj54L16o6O6k27n9J55j26k6J76l30M71j38m2N5P4j49K1K26
-165E94k59L9k23L29l26M40l06J99l0j83K60r8m3J52j58k6KJ67j77O5R0j26j7J54O1k14J60
-298E26k3R2n5J5q0Rk4M4n9J41j07J04j25O1J78l6R4l11M69l35J03q0J29l4j21K25kJ9r1K99
-445A025k83J32J98k71K99k01K7J4J51j67k2K40k66K29
-514A105
$$ plain form
268 69 370 143 302 225 511 388 446 444 476 465 377 377 162 285 45 218 168 342 205 277 396 280 502 398 348 335 292 318 355
126 355 131 246 357 252 270 262 242 375 410 342 308 254 580 293 309 290 258 183 240 450 281 307 307 281 403 403 492 282 424 162
-22 162 365 235 224 302 250 385 345 348 360 351 197 513 447 513 286 227 382 256 230 406 76 547 409 367 422 496 347 368 594
-165 594 335 374 151 480 154 594 288 487 457 274 534 436 393 545 387 361 363 530 353 418 508 382 365 519 580 366 526
-298 526 503 595 540 555 475 484 460 504 445 586 479 583 458 519 697 661 755 444 913 578 681 601 730 696 575 800 798 817 726 1025
-445 1025 742 874 1072 801 1100 899 926 940 1091 924 902 1142 876 1105
-514 1105
##PAGE=	F1=-3492.17
##FIRST=	4521.1594499999982872,	4521.1594499999982872,	0
##DATA TABLE=	(F2++(Y..Y)), PROFILE
4521A389Q2j23Q2J48k10L0O3k10J22k24K34o0j89K4p7J02O0j39j29J53j17j21K81j93L6j77
4393H37lj1K88l87k9R9P6k4J33l22R8n9K27j22k20K51j91J00r7o1J60k18K62k59K16r4n6Q2
4255F76l7j93L24j48N0j13q2J68k86K87j11R4j94L09j61r5J14m0n1K4l20N46l82J23k9K7k
4122D98k6R0K2k01L5J38j10J06k38M9J50j46J21n3N3J8r7R7j71K20j99L9J2J05m7l20L00j09
3985C36J66j41K06l43L28k16P2J14j00k42L18j30%K4m2q5J15l7J14j15L14n28J96Q2k1k66
3857A19M41l49Q1P6l0o3J78k85K07m4J76k09L4J0M0j58J81j73K9J7J71k22J89q8l2n8K54k30
3719B62R2j56J99m7r3q9J80j31j2M93o72M01K7l42K83j80n9L12j30j75O8J30k67K64r0M6k7
3586B87P7p9J39k82K88k64J5O3J25k11o6L39k51J83j67P2J53q5n5j77P9J44j57K09k02q4K43
$$ plain form
4521 1389 1471 1348 1430 1578 1368 1398 1461 1251 1373 1149 1383 1323 1134 1158 1081 1183 1243 1104 975 1128 1011 890 1171 978 1014 837
4393 837 834 823 1111 724 695 794 870 846 979 657 755 696 923 801 581 832 641 741 644 583 743 525 787 528 744 650 594 676
4255 676 639 446 770 622 672 559 477 645 359 646 535 629 435 744 583 488 602 562 511 535 215 761 379 502 473 500 498
4122 498 472 562 584 383 418 556 446 552 314 363 513 367 488 435 488 506 409 506 335 555 356 395 407 512 465 145 445 336
3985 336 502 361 567 224 552 336 408 522 422 180 498 368 368 392 350 265 380 343 457 342 656 128 324 406 385 119
3857 119 560 211 292 368 338 275 453 168 375 331 507 298 332 342 382 224 405 232 261 278 449 227 416 328 296 238 492 262
3719 262 354 198 397 350 257 168 348 217 205 698 26 427 454 112 395 215 156 468 338 163 231 361 94 358 268 314 287
3586 287 364 285 424 142 430 166 181 244 369 158 92 431 180 363 196 268 421 336 281 104 183 327 170 379 177 93 336
3453C36p6m0j1J43m9j31O0K02l38K64k14M5P4R2j59k8J27k5PJ0j95K32J06j75J21k21Q9m7
3315A99Q2o7n4K33j19J6j1j11J82j58nM8M8Q7nk37L3J79k47L13j83M1j43K53j54J00k17K71
3177C74k98K49n8j68K44q9q8J02k2N2q0Pj86K66k7l0o9j04M42l49J83j25L7R76M97j537J8
3045B17m8o5K68k92Q9m3J71j46J30n8j0j4P9p3M4Lk7j32L12k11n8J37n1j24K16N6k48L7J49
2902C08k2j60Q5j68L62k66J79j93J43l0j08j9K49r8k3j02J11j45J23L1K3R3k58L6N8p6J28
2769B61pM7j33k5J91k7k8j49J52j26l3q0J94L2k6n6M3j28J87Qm2m5p3J48k21J41q6J11j50
2626H0L2J68k28K46l8r7r1K04j81L77l66J98j21j27J25R8j77J63j0k01K28q1N5j16OJ2k1L2
2488A69N5N1j30j14K17m8j6n5J87j98K61j62o4n5J20Q9j95J64k07K98n3k20J98j62J22j96
$$ plain form
3453 336 260 220 209 352 303 172 232 434 96 360 146 191 265 357 198 170 297 272 279 289 94 326 432 257 378 157 246 199
3315 199 281 214 160 393 274 290 279 168 350 192 187 235 283 370 365 128 161 340 93 406 223 264 121 374 220 320 103 374
3177 374 76 325 267 99 343 254 166 268 246 298 218 225 39 305 278 248 179 75 517 168 351 226 263 1239 1736 199 217
3045 217 169 104 372 80 169 126 297 151 281 223 213 199 278 205 249 252 225 93 405 194 136 273 222 98 314 370 122 159 308
2902 308 286 126 211 43 405 139 318 125 268 238 130 111 360 262 239 137 248 103 226 257 280 373 115 151 209 133 261
2769 261 254 301 168 143 334 307 279 130 282 156 123 43 237 269 243 187 230 102 289 297 255 210 137 285 64 205 119 230 80
2626 80 112 280 52 298 260 163 72 276 95 472 106 304 183 56 181 279 102 265 255 54 282 201 256 140 146 158 137 169
2488 169 224 275 145 31 248 200 184 129 316 118 379 217 153 98 218 307 112 276 69 367 314 94 292 130 252 56
2360E6K29%j99J3M5O1J6ROj99J93j5p2R6q2j10J96l9J32j76j31O3J17K0j97L16l04J79l5M9
2213B37p4k8J98k59J14PoJ02k38J10Q7o8q5K37j13J22j38Oj09J22J8k2r7K7j0J05j86J09L
2070A71l0K55k73M5K2k5l9J05k5r2J09r8N7J34j83J21o8R8j81J46L0j16J26k12L25k67NNj31
1927A4K71m7j25J34j8p4J13q4M2q6K1R3k18J73j09MN6P1r4J64j3m1l4J59k70K1J34j9o2k5
1779A51K5l7L5K03k31K33J45k81J87j19O03n44K00j28k60K16Q3J21N14J174K604J1587P0086
1666H6567n9246Q8209L897r8025O9948o9730j5927l486j242l54l77Q4l7j17J70K11J78j12
1578F11l23k9l0J63L1k04o4J8P4L70M51K607J5683O51j3898N3123m9942J1730o79j5500l262
1474A581j182J28k12k35OL5J82r5K26j00k5R8j28M6M0j53L5J63l36J50r3R8p3L0L1j53L33
$$ plain form
2360 56 285 285 86 99 144 205 221 230 236 37 230 215 143 239 157 47 243 204 336 160 29 92 209 229 32 348 44 223 188 237
2213 237 163 135 333 74 188 195 189 291 53 163 250 182 97 334 221 343 205 211 102 224 242 220 123 150 140 245 59 168 171
2070 171 141 396 123 168 190 165 126 231 206 114 223 125 182 316 133 254 186 284 103 249 279 163 289 77 402 135 140 145 14
1927 14 285 238 113 247 229 155 268 184 226 140 161 254 36 209 100 104 160 231 137 301 288 247 213 372 102 123 257 238 176 151
1779 151 176 139 174 377 146 379 524 243 430 311 914 370 570 442 182 398 481 602 1116 2290 4894 16481 86567
1666 86567 27321 115530 119427 21402 91350 21620 5693 2207 965 611 234 318 281 164 334 545 723 611
1578 611 288 259 229 392 423 219 155 173 247 617 1068 3675 19358 20009 6111 59234 9292 21022 20343 4843 1581
1474 1581 399 527 315 80 86 121 303 208 434 334 309 407 279 325 365 212 247 410 74 224 131 229 156 186 217 64 397
1341C97r6j18J30J53k23PP1k23m9J63r7J23n0j15J44K17j98o5M1K48k25o1K11l38J25l2K9
1209A69R5j33K06j86M5J42M7k6j14j26J20j9Q5k00Q6n8j8J9L64l73K55l9K9l0m1j16L1K5j51
1066H8NJ67jj95J44N2O2J37l77L43l0r9j96K49j35j37P1j0O8K4M9PK27l33J50K77m42L77m31
923A11J34q8k4p5K93j79J34j22J38K81k68j0O2j36K89l34R1k14K23k54J19J94n2J26O3p2j7
790D13J1J2p8M1q2k07K30j6k99N11j98K94k19J89p2K16k65J05j45j8k25j24K89r5O6J396J790
657C520k589j40K20j20p1J63n7l13n4O0l37L46kM16R0Q07j22N86L07L63L17L59L29J884J8039
534B4001J0577K9101m253J01557P096j1756K09219j81559l0861j12102k0288p510l648k265
465G309j688j084r47p50m86n34l95m67o4r6J65pK14J96n86O92m46o0l1p5j71o5j55l08K44
$$ plain form
1341 397 301 183 313 466 243 250 321 98 49 212 115 238 188 73 217 434 236 171 212 460 235 174 385 47 172 140 169
1209 169 264 131 337 151 196 338 385 359 245 119 239 220 305 105 191 133 115 134 498 125 380 341 370 340 299 183 214 239 88
1066 88 93 260 259 64 208 260 322 459 82 425 395 296 100 349 214 77 148 138 206 230 279 286 513 180 330 607 165 542 111
923 111 245 157 133 58 351 172 306 184 322 603 335 325 387 251 540 206 297 83 306 52 171 365 313 439 502 430 413
790 413 424 436 358 399 317 110 340 324 25 536 338 632 413 602 530 746 481 586 441 423 198 74 363 268 334 1730 3520
657 3520 931 791 1011 891 820 983 926 613 559 619 282 628 626 1042 1132 1939 1817 2403 2710 3073 3390 3749 4078 5962 24001
534 24001 34578 63679 59426 160983 168079 156323 365542 183983 153122 41020 20732 13222 9574 7309
465 7309 5621 4537 3590 2840 2354 1820 1425 958 894 798 963 956 1170 1366 780 1472 1026 966 935 860 689 624 469 161 405
342D05o8J5K16J09j47K50j93K59m56L29k57kj10j18j36L85k66J50l4L31j69L4M7O2j27j0r4
209D05r6Pj87J26N4R8j09R0R0q2K12j38Kk1j14P0Pj87Q2M3l5L6OJ4J16%rj25M2K59l24O5K
47C99j16l2O0J73j08J5M2j01J91K9P1k70J61l02K49j00p6R1k9J07j2k0R2p5j13K93m9lj48
-96D19r2J70j71L2Q7k69M90j36o4Q4M1q2lJ68k32N4k10K98l19M47l20K26m5j42J84m9J1J11
-234F88j40q6R4N3j18M7J03j09o0K11K8j68J44m7J67j71J15r9Rn5M6m5J17o1J01j18J11Q6
-371H43M9M7k68M56l09L8kN3N9k28L46l6K7j30L69k84J46K18k68K51j35lJ6J59j67j3K24k33
-509A225K21
-514A446
$$ plain form
342 405 337 352 568 677 530 780 587 846 390 719 462 460 350 232 96 481 215 365 331 662 493 527 574 636 509 499 405
209 405 309 316 129 255 309 407 298 388 478 396 608 470 472 451 337 407 414 227 309 352 317 353 359 373 489 489 480 355 397 656 332 397 399
47 399 283 251 311 484 376 391 433 332 523 552 623 353 514 212 461 361 285 376 347 454 442 422 514 439 326 619 570 567 419
-96 419 327 497 326 358 445 176 666 530 466 550 591 509 506 674 442 496 286 584 265 712 392 618 573 431 615 566 577 688
-234 688 548 462 556 609 491 538 641 532 472 683 711 543 687 640 807 636 751 652 661 606 652 607 724 663 764 646 757 843
-371 843 892 939 671 1127 818 856 854 907 966 738 1084 1048 1075 945 1314 1030 1176 1394 1126 1377 1242 1239 1255 1414 1247 1234 1458 1225
-509 1225 1446
-514 1446
##PAGE=	F1=-3502.01
##FIRST=	4521.1594499999982872,	4521.1594499999982872,	0
##DATA TABLE=	(F2++(Y..Y)), PROFILE
4521A666O7r1N9J83k30J2O9j83P5k18J88j5j93l9rL5J27k11n2J01j52m5J61j25Lj40l6QK36
4378A251l01j66K07L8l8J41l16J26j05K26j01k52K49j32K8r7m5J63k44L06k88K21j03k5O2
4255H05m6k05L69k12J6m0j07J58k44K21m0L4j36K81j34j06Q6r7L5o1k11M79l67P1O4qPp2J35
4113F75Kk14L4J38n3M5k44P9J29j82J72p8J13l5j06J18j52J79j61JkJ68p4l62L14q7J79j72
3975D24K33l56L12j72K8J04j26j37K73k15O5P2q9p0P8RP9o9K85n20J89N8l6j97L90l55M4J72
3837D73p2m1J09k01J58m7K33k96J00l5Q5j88J72j36KPJ98k35J68k3j14K4K23k41P2j50J98
3704D43m5j10l9J48j63K3N09p05M42Nk91J94j33o6K61n9k16R7R1k13K02k6k1L6qK3R5k60K63
3561D77k39rN0J45k37m1L54l05J89j23L6J95q0q1j89R6J61j72J61j55r0K55q2n9J6P3Jj47
$$ plain form
4521 1666 1733 1642 1701 1884 1654 1666 1735 1552 1627 1409 1597 1582 1389 1350 1341 1376 1503 1292 1240 1341 1189 1144 1305 1180 1183 1043 1007 1015 1251
4378 1251 950 784 991 1029 991 1132 816 942 837 1063 962 710 959 827 855 758 713 876 632 938 650 871 768 743 805
4255 805 759 554 923 711 727 687 580 738 494 715 675 709 573 854 720 614 700 603 638 577 366 845 478 549 613 605 612 540 675
4113 675 677 463 497 635 582 627 383 462 591 409 581 503 616 581 475 593 441 620 459 460 458 626 552 190 504 417 596 424
3975 424 657 301 613 441 469 573 447 310 583 368 433 505 416 346 424 433 512 443 728 208 397 455 419 222 612 257 301 473
3837 473 401 360 469 268 426 379 612 316 416 381 466 278 450 314 316 323 521 286 454 431 317 341 564 323 395 245 443
3704 443 398 288 249 397 234 257 766 61 503 508 217 411 278 212 473 414 198 295 386 173 375 349 328 364 356 379 474 214 477
3561 477 238 229 279 424 187 146 500 195 384 261 297 492 412 331 142 238 399 227 388 233 143 398 316 257 273 346 347 200
3424B00J04J54l48L22k40J5J04P6j55kJ10k6oM7k47K57J32j80J18k37K5L9L2n3o4K40j03M1
3286C55p1r5K36k15l0J53o8P9O2k77P6J79l41M28k20L4j56K55j33J13j93J93k63K88j09j53
3158A27K85j37q1Q5K1K1r1M5j87K51Lo4j19J2L46m40K90o0rR96N43j631P3p8j9K28l15J00
3020A95mJ17j52J55j2p0j7R5rm7P9o9j71K84j31q9J59o6j13K34j5j68K3J51n9j15O2k03L79
2877D23k73J59j48J35o6j4j28L10j22M8j83J58j69J10O7j5J09k20l7J08r3J45o5N9p9n1K19
2744C87l0j7k00J53p5r0l0J59R9j13J3jj10J46N8p9l3j00J57j85J59r9L0j11L8J64j72J88
2606C06j0j01q1J88k54M57m40K76j81j08K05N0k47K19j0j49J82m8J2r0J8l0j0L8M3M4j31r5
2469E3K03k3m5r0K84k33K57j88j8l8O6R8k10K28k50K75k4k29J60p4N6j11J79n8j62M7M3k3
$$ plain form
3424 200 304 458 110 432 192 207 311 387 232 230 340 314 308 355 108 365 497 317 435 198 223 262 294 241 177 417 314 355
3286 355 284 189 425 210 180 333 265 344 406 129 205 384 43 471 251 285 129 384 251 364 171 364 101 389 280 127
3158 127 412 275 194 279 300 321 230 275 88 339 342 278 159 171 517 77 367 307 298 1294 1837 206 279 201 182 410 95 195
3020 195 191 308 156 311 299 229 212 307 298 251 330 261 90 374 243 154 313 247 134 368 353 185 208 359 300 185 247 44 423
2877 423 150 309 161 296 230 216 88 398 276 324 141 299 130 240 307 292 401 181 144 252 159 304 239 298 219 168 387
2744 387 357 340 140 293 218 128 98 257 356 243 256 255 145 291 349 270 237 137 294 109 268 169 199 88 126 290 118 306
2606 306 296 195 114 302 48 505 65 341 160 52 257 307 60 279 269 120 302 254 266 176 194 164 154 192 235 279 148 53
2469 53 256 233 188 98 382 149 406 218 200 162 228 326 116 344 94 369 345 116 276 202 258 147 326 268 106 153 196 173
2331A73N6PN7k42J85P4j48J13q9j21K52o7P1j30j75J23M6J13k21K94l27K05l3N9q2J3J54k45
2193A15J09K8o0J13k56Q4J35n7r5K37r9J02r9j0j26J38Ml0o6m5P3P5j80J22k0j06M01l73J17
2050B31Ol0o8J60j05m0J07j58P9J65k46J90r5J14j51J22%j30J26k11L45k65J8J0j23K55l1
1917B75j56J87m7j13K17j44K5j26M0J10k48K07r1k8J21L6j17J83N2j25J5J44l24N3J32k5m2
1784B11j18J05k2P5J84k24K03J72k12J04j23P36o86L13k82k46K54R3J33O36J360L030J3482
1671A9178Q1166o8667J02508M950j14871Q2151q0952j8689m095j522m30m45J30j13j03J84
1592C80K46K24k26k50j22K9J39P8k31j22K9J59K54O76K866J7831j739r649M9486m7552Q791
1489B1297J885j7459l873j260L4k28k96P5LJ32n5K35j14l8J08j13K7Rq2n1K15m30J90k7M1
$$ plain form
2331 173 229 236 293 51 236 310 162 275 186 65 317 250 321 191 16 139 185 298 77 371 44 249 216 275 193 206 360 115
2193 115 224 252 192 305 49 133 268 211 116 353 254 356 257 247 121 259 263 233 167 122 195 270 90 212 192 86 487 114 231
2050 231 237 207 139 299 194 154 261 103 182 347 101 291 196 310 159 281 281 151 277 66 411 146 164 174 51 306 275
1917 275 119 306 259 146 363 219 244 118 158 268 20 227 136 108 229 265 148 331 383 258 273 417 93 146 278 253 211
1784 211 93 198 176 251 435 211 414 586 374 478 355 1091 405 718 436 190 444 537 670 1306 2666 5696 19178
1671 19178 100344 31677 134185 139135 24264 106415 25463 6774 2679 1157 727 282 412 299 196 380
1592 380 626 850 624 374 252 281 420 498 267 145 174 333 587 1263 4129 21960 20221 10572 60058 12506 21297
1489 21297 23182 5723 1850 590 624 396 100 175 178 310 255 490 376 338 446 333 360 369 287 236 451 21 211 184 225
1366B25q3Q4O1j83L29j33p1J32J62l15Q9N4k20j19K11j15J32Rj07M6L35k73MNJ96j63j13K33
1228D12l26R5m2Q6Q3j49K15j46MJ57N7n5j73m1J03m9R1k05J03j16N0oL99l94K45j7M6l0j17
1085B80m3K0Nj79O3J37J2k05J78L7P1J63l87L02J3j27j85J79j07j58J24nL6P2J0M5K26l51
948B26J48L10m91L39m16K10j80Lj37L70j27L7l1J47J96j83k4N1j25K22k53nj76K40k75J60
820B36J99l8Q8Q9q2J7m3M9q7j3o5j73J49K3k99N74k00K72j88J61pJ43j89N6k12J4k10j58K99
677D05j31K8M62K219k135P7K27r0q5J43l9l21j36J61l50L70M3M46J50Q95j18P87K66M27M52
554D153M75N23R91J3895J1159K6400J0174J15399M353J2319K47405k34346l4654j30172k3712
480B4362q872m239k701j906j373j033q12p27n13m96n09j13r9K26q9K68J90n76O52m06p4m8
$$ plain form
1366 225 142 226 287 104 433 300 229 361 523 208 297 351 131 12 223 108 240 249 142 188 523 250 254 259 455 292 179 412
1228 412 86 181 139 225 308 159 374 228 232 389 446 391 218 177 280 231 322 117 220 104 154 148 547 153 398 381 427 397 280
1085 280 237 257 262 83 146 283 295 90 268 305 376 539 152 454 467 340 155 334 227 69 193 188 224 296 306 351 577 226
948 226 374 684 193 532 116 326 146 149 12 382 255 292 261 408 604 421 397 448 323 545 292 287 111 351 76 236
820 236 435 397 485 574 492 509 466 515 428 415 350 177 326 349 50 624 424 696 508 669 662 805 616 672 460 474 264 106 405
677 405 274 302 764 2983 848 925 1152 1062 977 1120 1081 760 624 785 435 805 848 1294 1444 2339 2221 3008 3274 3701 4153
554 4153 4628 5151 6142 20037 31196 57596 67770 183169 187522 199841 447246 212900 178246 48074 24362
480 24362 15490 11251 8550 6644 5271 4238 3426 2699 2186 1690 1181 1068 969 1195 1106 1374 1564 988 1640 1234 1160 1112
372A112j74j00j31j34l67K88r5M3J90J70j06J34q7J83l97L19l02l5r5j12j94M58k74J02L6
249D32L32j97K7R4P9k24N2j82L4j15j25O6J59J6p5J10O9n9J82j43L6j4j83J07k3j36K9K9r
106C68N8nQ0Q6m4N0k13J46J76l30R2J7j41m9R1J14k9qP8j75K62N1M8l09J63l02K63p6j28J15
-42D49l4R3K2m9J52j19o6K45k6q2l0j42J73k05Q4lj89M76j18q1J04J4l8j1J06j85M9j80K56
-184F65l10M49l33K49n8r4J10l1R7N2j14j45J89o1m4jJ29q2j20K69j0j13J22o3K18k46J81
-317I05r9np3L9l5J08k7Q1o9J23%J35j2k04M29k91jN1j4J47l04M28p6M3j44L98k69J59K17
-460A640k39J82n6k9QJ56j45j5J93j72J89
-514A712
$$ plain form
372 1112 938 838 707 573 206 494 399 442 632 802 696 830 743 926 529 848 546 511 416 304 110 568 294 396 432
249 432 764 567 594 688 767 543 595 413 447 332 207 273 432 448 373 483 552 493 675 532 568 554 371 478 455 319 348 377 368
106 368 426 421 501 587 543 593 380 526 702 372 464 481 340 291 382 496 467 459 537 362 624 675 723 414 577 275 538 462 334 449
-42 449 415 508 530 481 633 514 448 693 667 585 555 413 586 381 465 462 273 749 631 550 654 668 630 619 725 540 589 409 665
-184 665 355 804 471 720 662 568 678 647 744 796 682 537 726 665 621 620 749 667 547 816 806 693 815 752 970 724 905
-317 905 806 801 728 767 732 840 813 894 825 948 948 1083 1071 867 1296 1005 1004 1055 1041 1188 884 1312 1236 1279 1135 1533 1264 1423 1640
-460 1640 1401 1583 1527 1498 1506 1662 1517 1502 1695 1523 1712
-514 1712
##PAGE=	F1=-3511.85
##FIRST=	4521.1594499999982872,	4521.1594499999982872,	0
##DATA TABLE=	(F2++(Y..Y)), PROFILE
4521A828M5n1L6J98k29lO5j48K1j84J29J8j81r3N1k5J72k46J2K8j24j9M8m2m2p5p7J3J92k11
4373A106l01L20j4l5J27k95J66j44J93o3k65K28p1m5q9j1J40k47L18k90K02q1j1L4l6k19M01
4241A018k65pK0j22J36j95J63MKp8K33j13r9O7j54R5j18j00L82l05nJ38j8rq8J51rk05K4J33
4093F76Ol7k15J04R0j90J97q7J53q6j06J41j22J22j20l9kK11j04l72L20o1J68j94K45l47K99
3960F50j29k3Q7j40l1K08k65J02J28j25n2L4O1J9qK33m70J70Qj8j30L08l01k6K62j20rL7j12
3817C48R9m6K66l55J61p1J14k08J56q1l5JK06k21J18O3k04J06J89k44M4j14J71m2j13jJ01
3684D08j75O1M96o94M54k3k26J02p9n6J72K7k41J04N4j44J44Pp8R5o6J05L7j97J99j82m2L4
3547B96J45k30j7L41l34J71n5oK13n8j23j69Q7J93j91J18j00j04K59p2r5N5QL9j52J37J04
$$ plain form
4521 1828 1873 1822 1858 2056 1827 1824 1889 1741 1762 1578 1707 1725 1544 1451 1502 1477 1649 1403 1415 1443 1319 1300 1348 1306 1264 1189 1112 1125 1317 1106
4373 1106 805 1125 1111 1076 1203 908 1074 930 1123 1060 795 1023 952 907 818 807 947 700 1018 728 930 849 838 872 836 617 1018
4241 1018 753 746 766 644 780 585 748 752 754 676 909 796 697 764 610 705 587 487 869 564 559 697 679 670 582 733 724 519 543 676
4093 676 682 645 430 534 624 434 631 544 697 611 505 646 524 646 526 487 485 696 592 220 540 479 647 453 698 351 650
3960 650 521 498 585 445 414 622 357 459 587 462 410 444 505 524 516 749 279 449 457 439 309 617 316 290 552 432 423 460 348
3817 348 447 401 667 312 473 402 516 308 464 383 348 349 555 334 452 515 311 417 606 362 406 292 463 421 308 307 408
3684 408 233 294 790 96 550 527 301 403 324 268 440 467 226 330 384 240 384 391 313 408 342 447 484 287 486 304 262 296
3547 296 441 211 194 535 201 372 317 311 524 466 343 174 261 454 263 381 281 177 436 364 269 324 332 371 219 356 460
3414D60l51L67k33l8J27O6j41J2R7l8%O8k81K72J45j69R8k52pJ08k6j8q3K22o4O0j22p4K73
3271D78k78j7K18j72R6Q7k92J36J42l66M73k37J3j13K06q3Q4j34Q5j84K65j09j41L05j81q0
3143B01P3P0j8j12J07j86K17M1r9j49R2K65m77L25Oj5R84N61j672J16j11K9J78l32J18K5N7
3010B94j20J48L6j32mR1O3j42J44r9j39J83n2r1J58p7r6K22o0p3pJ44j01o4N6k14L37k28J17
2867B94j11J24r2P3k26L70j60J16k48J86j72Q2J15o1J09j55j17J60r6J54j39R4m2r1K60m4
2739C83Lk46J38j3j40M8R5J46j94Q8n0o4P5R7q6k6j14J55j49J57j08k1p9M5J63j41J37J7j02
2597B14m8J29k25M38m42K86k18q9K90k4k71K37rq4J17j4l5m4L5o2lN2J4L1j16o8J54Oo2q5
2449A04L22k57K35j86J8j5J7R3k09K67k52K24qk18J11K5l2j4J23j16j17Q5L3j03R9lJ10k76
$$ plain form
3414 460 109 476 243 205 332 398 257 269 366 328 328 396 115 387 532 363 461 209 202 310 284 266 183 405 341 401 279 205 478
3271 478 200 183 401 229 325 412 120 256 398 32 505 268 281 168 374 291 375 241 326 142 407 298 157 462 281 201
3143 201 274 344 326 214 321 135 352 393 294 145 237 502 25 350 356 341 1325 1886 214 330 219 248 426 94 212 237 294
3010 294 174 322 358 226 222 313 376 234 378 279 140 323 271 180 338 261 165 387 327 254 247 391 290 226 282 68 405 177 294
2867 294 183 307 215 288 62 432 272 388 140 326 154 236 351 290 399 244 127 287 191 345 206 300 258 167 427 383
2739 383 386 140 278 265 125 173 268 414 220 308 258 194 269 366 280 254 140 295 146 303 195 174 95 140 303 162 299 316 214
2597 214 166 295 70 508 66 352 134 45 335 311 40 277 268 184 301 287 252 208 243 181 178 230 244 275 159 91 245 251 189 104
2449 104 426 169 404 218 236 221 238 331 122 389 137 361 353 135 246 271 239 225 348 232 115 200 233 130 229 226 336 60
2311F0J65J65k24J40j14j01K76r2J1p7j94J63l1J99k26K50k86J77l5Q0r8O1J03k21Q7O3j16
2178A85J14k68R2J53n2q8K13p4O8m1k4j59J61j6j2o0q4J20O5j80J35n5j70N25m30J67j5l1
2040B39q3J79j35j8J19k13J25J43k36J77p6R0j12J07m6o9M4j75L39k43J5L2j02K15k1j55K15
1907C55q0j37K88j75qj49N5J26k33J97p1n8J81lj28J82J09j98O3J16l58Q8J20k2m0j83J76
1775B13j1J05J72k09J62J73j23Mj13Q39p89L96m32j99K59J12J32P17J472L261J4562Q7252
1666A07955p3891J10539N751j24774Q9409q7204k0320m449j741m36n23J83j98o4J71K61K68
1583I37l21j82j95Q4J05J08k28j89M6K17J33Q35K923J8667l691m787M2817m1476M509M026
1484B4338j8146m201j263l9k49l24J39kO8m1K31j06o5J16q8Lk5qj27K36l37Q4L7l3q2J45P8
$$ plain form
2311 60 225 390 166 306 192 91 367 275 286 209 15 178 147 346 120 370 84 261 226 306 208 269 372 151 238 301 185
2178 185 299 31 123 276 224 136 349 275 343 302 278 119 280 264 252 192 108 228 293 113 248 193 23 548 118 285 270 239
2040 239 156 335 200 182 301 88 213 356 120 297 221 311 199 306 260 191 235 60 399 156 171 203 101 316 295 140 355
1907 355 275 138 426 251 243 94 149 275 42 239 168 110 291 288 160 342 451 253 316 432 74 162 282 260 220 37 213
1775 213 202 307 479 270 432 605 482 486 373 1212 423 819 387 188 447 559 691 1408 2880 6141 20703 107955
1666 107955 34064 144603 150354 25580 114989 27785 7465 3016 1275 839 316 499 301 237 408 669 937
1583 937 616 434 239 323 428 536 308 119 165 382 515 1350 4273 22940 19249 14462 57279 15803 20312 24338
1484 24338 6192 1991 728 689 440 116 255 253 321 280 511 405 340 456 368 371 346 338 211 447 110 194 231 198 116 261 339
1351C39k04L04j60j2J22J48l66J54K6j84j17J70j08J15P3r5o5M42l48R2m6J44q9j60K42l00
1223A17O9m1J18Q2j61K05j14rJ36Q2r1k10M5O5o8J02k16J34j19M7j4M06l85K06J1N6k6j73
1085B54L2nj7j60R9P2L4j86J82K2R0J43l44K40M9j61j30P6n9j67J57J0JJ04j1O1K08l40J41
943C95L30n19K66l07K28k40Nq8L14n3r7J00J21J15p6m7J9j00J48j39j07j34K44k51J44K19
815D90l7M7J16r8L8o0O1q9n7m8j35Q9L5k45N68k12K47j33J09N9P3j19J9k65N7k01j66K69j37
672B75J2r2K315j765K36K30m5r2J10m1k57k15K23l36L64Q7M31K35Q64p0R14K35M78N24O14
549E234P89P47R439J0708K2037K2469J21184N230L4694K67588k73534l5674j39008k5552r620
475A6731m569k964j979j576j043q12r12n20n03n32j59r7K66j50K98J80n43O06l80p4m7k50
$$ plain form
1351 339 135 439 279 267 389 537 171 325 351 167 50 220 112 227 300 205 140 582 234 326 280 424 335 175 417 117
1223 117 186 145 263 345 184 389 275 266 402 484 393 183 228 293 225 327 111 245 126 173 159 565 180 386 397 453 427 254
1085 254 286 281 264 104 203 275 309 123 305 327 417 560 216 456 505 344 214 290 231 64 221 231 232 336 325 386 594 254 395
943 395 725 206 472 165 393 153 158 70 384 331 234 334 455 570 494 447 466 366 514 375 268 134 378 127 271 490
815 490 453 500 616 518 556 496 557 468 411 363 228 317 352 107 675 463 710 577 686 745 818 699 718 453 510 309 143 412 275
672 275 287 195 2510 745 981 1211 1166 1074 1184 1143 886 671 894 558 922 1009 1440 1675 2539 2469 3383 3618 4096 4620 5234
549 5234 6023 6770 16209 26917 48954 71423 192607 197837 232531 500119 226585 190911 51903 26351 16731
475 16731 12162 9198 7219 5643 4600 3788 2876 2356 1853 1321 1162 1065 1331 1181 1479 1659 1116 1722 1342 1268 1221 971
367I71l2j90j16l91K98j01N6J60K13n2PL1P6l03L01l37o0o3j05k56N08k52K8J19K91k01L1
234F31J26R5k99R4k47J57k30o4J0K45o3l0J16O9o0J36j09M1Nk35J25m4p7l7N9k2P8l5J65N3
86F53q7R6k84K40Q8l01R1K6j22j02J41L9N5l4J00k29L19O0L1l37J61k77K54o1j59J47o4Q9
-52E33O2r1J98j34l3J82Mj59J10k11J70k17J19q0j04M34r4p9J10j3j2pM8j25K0j29K12l08
-189D06M47l47K70o7n3O4n4J98j3r1j81K69j67L5o7J67n9j77L15m9n1Q8o6K39k75K11q1l3
-327H78p8L2l7J20j4N7qJ10o4K09p9j23L83k76j7P9o3K15l47M71j16O1j31L84k42J70J90j87
-465A577J09K0m9rJ47j12j8J49r8J43
-514A859
$$ plain form
367 971 939 749 633 242 540 439 495 655 868 816 823 854 930 627 928 591 531 468 363 107 615 363 391 510 801 600 631
234 631 757 852 553 647 400 557 327 263 273 518 455 425 541 610 550 686 577 618 623 388 513 469 392 355 414 392 470 435 600 653
86 653 566 662 378 618 706 405 496 522 400 298 439 478 533 499 599 370 689 749 780 443 604 327 581 520 361 508 444 533
-52 533 595 504 702 568 535 717 721 562 672 461 631 414 533 453 349 783 689 610 720 707 695 688 736 611 631 502 714 406
-189 406 853 506 776 709 656 720 666 864 851 760 579 848 681 716 649 816 757 580 895 846 795 883 817 1056 781 992 911 878
-327 878 800 832 795 915 901 958 950 1060 996 1205 1126 1003 1386 1110 1093 1172 1109 1324 977 1448 1332 1393 1262 1646 1404 1574 1764 1577
-465 1577 1686 1706 1657 1648 1795 1683 1665 1814 1716 1859
-514 1859
##PAGE=	F1=-3521.7
##FIRST=	4521.1594499999982872,	4521.1594499999982872,	0
##DATA TABLE=	(F2++(Y..Y)), PROFILE
4521A843K8j6J5J98k10j6N0j04l4j29O9L4j51j34R4o8J91k44N0m7n1k8n4M9r4Nj13LJ56j23
4373A169m17M28q5j1R9k68K14j74J40j5k69K05k3j02q5M1J06k39K99k62J57l3j0Jj2k29M17
4241A042l03k0O5j30J15j54J30KJ0l5J81j09o9N8k04J24j40pK72k07r3J85nm4p6J40j4j73
4103E41MJ23O0j21j64J23L7j68K00q8J66j19r9J59q3O1r0o9MK36j34l50L14l1J34j99K30l07
3965C70K82q7p6O4j34N3J38k70J05J80j47l6qJ14o0O3J68l98J49n8K6p5K12k10j09L31j57
3832D30K4l1k5L7m1K72l83K10r7J36k26J35j3p7lK00j78L8J62k97J84J54k45K1o7J35m1r8
3694C16J7M5j60Q8M61o56M43m3j62K8l7k9O3J13k51R5K8q3J10%j10J36q8J51k3j04J08j05
3556C51p6J2J30j89kL02l32J35J9m4K05j8j76j15M6K35k11Q6m3j23K52n1j38R2l5N4j39J49
$$ plain form
4521 1843 1871 1855 1870 2068 1858 1842 1892 1788 1754 1625 1694 1728 1577 1443 1537 1469 1660 1416 1466 1419 1368 1340 1286 1335 1241 1246 1133 1136 1292 1169
4373 1169 752 1180 1095 1084 1183 915 1129 955 1095 1080 811 1016 993 891 806 847 953 714 1013 751 908 875 865 866 854 625 1042
4241 1042 739 719 784 654 769 615 745 747 757 722 903 794 725 783 579 703 563 556 828 621 528 713 708 664 588 728 714 541
4103 541 545 668 728 607 443 566 603 435 635 547 713 594 495 654 571 632 542 473 477 713 579 229 543 512 646 447 677 370
3965 370 652 565 489 553 419 472 610 340 445 625 478 442 434 548 488 551 719 321 470 412 438 363 575 365 256 587 430
3832 430 454 423 398 435 394 666 283 493 396 532 306 441 428 351 348 548 370 408 570 273 457 611 366 387 320 455 414 316
3694 316 333 378 218 306 767 111 554 511 349 377 340 311 374 487 236 331 359 276 386 386 276 412 324 475 452 348 456 351
3556 351 275 287 417 228 226 528 196 331 350 306 511 493 317 202 248 483 272 358 315 192 444 393 255 347 312 366 227 376
3419C76O3l45L89k06q4J32O4j19J1R1o2K4P1k91K69J46j47P3k67JJ46p5K5j15J82MO5j60m4
3276B17K83l35K8K32k39J38N4k79K05P7k87M09k37j0n1J34rJ9n8k5q3J92o2j45L15k13q3O5
3138B52J16n9j35J80j92J82P7j27j52J21K08l72K09N9QR26N38j633J51j36O9J28l38J36M4
3015B60jo8J20P7j83K2P0J27k21J86j13q6O9J1o4J39q7p3J86p5J2n2J42j39j8P1k13K55j58
2872A96P5r0J17j04J39k89M10j98J71l01J96j54N1J62j07R6q0j89K04q7J48k08J50l2j35L08
2744D49p6L6k77J04N6j75J28K8J61k54J53r3rJJ08n5l7r7J34j18J40j16l6o0N3J63j35J01
2606B77L9r7nM8j38L57l97K54k25o7L51j09k30K04qk1M4K1q0PN4q0ON9k3K1r0n0R6L0o2o3
2449A23L23k72J98j59M1J1j7P4j92K76k16J50jk11Q7J13j31Q2O9j63o8J13K6j72J36k2J60
$$ plain form
3419 376 439 94 483 277 193 325 389 270 281 372 310 334 405 114 383 529 382 455 188 189 335 260 285 170 352 356 421 261 217
3276 217 500 165 193 425 186 324 378 99 304 381 94 503 266 256 205 339 330 349 291 266 183 375 313 168 483 270 187 252
3138 252 368 309 174 354 162 344 421 294 142 263 471 99 308 367 375 1301 1839 206 357 221 290 418 80 216 260
3015 260 259 191 311 388 205 227 297 424 203 389 276 190 259 270 206 345 258 185 371 296 308 256 398 259 241 312 99 354 196
2872 196 271 181 298 194 333 44 454 256 427 126 322 168 219 381 274 370 290 101 305 218 366 158 308 276 141 449
2744 449 373 409 132 236 292 117 245 273 434 180 333 240 231 232 340 285 248 151 285 167 307 191 155 95 148 311 176 277
2606 277 316 219 214 262 124 481 84 338 113 46 397 288 58 262 254 233 277 298 218 225 279 199 205 264 241 262 172 122 218 248 186 123
2449 123 446 174 372 213 254 265 248 322 130 406 190 340 339 128 215 328 197 279 348 185 117 230 256 84 220 198 358
2316C58k96J38K41k80J57j41n1K56j06m2k5j72J67j02K61k08J87k20J29l6J09j22J14M7j83
2193A80M6J14j69R9k41Q4J61o0o2J70m4L0K3l7j97J90m3L0q2p1J14P4j82J37q4j33N22m35
2055A34J88m1k7q0J61j16l0J46k52J67Q4j56Q8j1L0o7R8r4J7o6j08L02k05lP0r9J82j8j25
1912A69K13j14j34L16j74n0j60P1J35k03J73n5p4K12l2j24J55J61k52J03P9l63J13J12j7n5
1784B05j51J65oJ14J74j97J29J45k7r3r2Q89q34M35n51j30K33J36J16P42J494L262J4657Q7346
1666A08161p4071J11009O170j26161R0565q7463k0552m492j866l77n91K28k66k2J39K56L04
1583I71l84j31k31J23O5J19k02k52O8K40L2R01K771J8071m949m79L4520l3487M28N430j7449
1479F175m192j193p9k73l17J94nJ2m7K20q2r7J19o3j6n2N2j79K20k14mQ9j21n2J90P8k09K58
$$ plain form
2316 358 62 200 441 161 318 177 126 382 276 234 209 37 204 102 363 155 342 122 251 215 324 202 316 363 180
2193 180 226 340 171 270 29 113 274 214 152 322 278 308 331 294 97 287 244 274 192 121 235 309 127 264 180 47 569 134
2055 134 322 281 254 174 335 219 189 335 83 250 334 178 266 255 285 218 316 222 239 173 65 367 162 159 229 130 312 294 169
1912 169 382 268 134 450 276 226 66 137 272 69 242 187 113 325 293 169 324 485 233 336 415 52 165 277 260 205
1784 205 54 219 213 327 501 304 433 578 551 458 366 1255 421 856 305 175 408 544 660 1402 2896 6158 20815 108161
1666 108161 34090 145099 151269 25108 115673 28210 7658 3166 1300 923 332 560 294 272 411 667 971
1583 971 587 456 225 348 413 532 330 78 146 386 418 1319 4090 22161 17212 16733 51253 17766 18194 23624 6175
1479 6175 1983 790 711 438 121 315 310 322 275 495 413 316 435 372 356 304 356 177 397 183 179 268 147 95 285 363 154 412
1341D12j71M7J07J05l51J81j2j17j25J27o9O6J31q2j69N19m09J85j01R7j8j86K27k55N4l4
1213A59J21R2j70J74q7%Q5J23j34j97R5J3p2J20k37J70o8k1JL75l51J50M8N6j9k06R8l1m2
1071B45j23J34j9N7j35J55KJ18Q7k60J66Q3k04l9m1jj67J71K6l0J25k3N6J79l00J23L39n25
933A99J74j50K10k54k4m0K40L3k43K38P3M4M4q3k0p2Q6k2j93r2K35k13R9K50m3JJ47j24N0
790E50m6N4q7q8l0j01N7K3j72N20k30K22n7K9J21K5p6Kk90R2j89j50K03j05K9L63J394j403
652F60K97K23J4j05P4n8j48k77K50l02L31J23L79L15P51k0R53K09N15N26P20R57R25N976R065
529B2353J6659L0669J17946J0370N0153K66356k91769l3800j37085k5486r635m570l018j898
460G245j664r69p54j000n75m01n36j83r2K78j83L05J62m82N42l57o8k0l06L3k32r8l97K87
$$ plain form
1341 412 241 288 395 500 149 330 318 201 76 203 134 200 331 249 80 599 190 375 274 371 353 167 394 139 193 159
1213 159 280 372 202 376 289 289 374 497 363 166 261 274 202 322 85 255 187 166 167 542 191 341 389 445 426 220 318 287 245
1071 245 122 256 237 294 159 314 316 434 521 261 427 510 306 267 226 225 58 229 255 225 350 327 383 562 262 385 724 199
933 199 373 223 433 179 155 115 355 388 145 383 456 500 544 461 441 369 455 433 240 148 383 170 269 519 476 477 624 500 550
790 550 504 558 471 383 353 252 309 332 160 680 450 672 615 644 765 790 714 716 426 518 329 179 382 277 306 669 2063 660
652 660 957 1180 1194 1089 1163 1105 957 680 930 628 959 1082 1461 1776 2527 2507 3460 3669 4184 4710 5430 6387 7312 13288 22353
529 22353 39012 69681 187627 197997 248150 514506 222737 188937 51852 26366 16731 12161 9143 7245
460 7245 5581 4612 3858 2858 2283 1882 1346 1163 1071 1349 1166 1471 1633 1151 1693 1336 1268 1248 942 975 743 645 248 535
342E35q8N4J32K34Pj22J47m0j86K65l47p0l4r0l14N31k02n8J96K16j76M1J36J15l53J18k79
209C68K54l22j1l1K95j28K6R6R7r1Q3l6J3L4k62J19n3j3j04J02n2R4p6K47K4j17J18l29L16
67F61Mk44O5L2q2j65K00l8J28n3R7k50L53N4K2l53J59k37K28n1j72J82j08Q8J05j46K38j24
-71E93k4J12M3k25K56k96J63k03J35j36l0L73p2m9R8m2kNLo2k8n8J68l11M36l52K81p1k7O0
-219G38j18K95o9p7j84L16k51J05j33K09m4k19L38q6J6M2n6K27k57K13n6p2o8K7m9J46k1L9
-357I51M3P9r1K59j53k4L11k57j6Q8r6K61l59M74j49P3q8L26k05J78J37j19M6Q0o2l3J36p8
-495A712j5R5k2R3
-514A863
$$ plain form
342 535 447 501 633 867 874 752 899 859 673 938 591 521 487 397 83 614 412 354 550 766 590 631 767 882 529 647 368
209 368 622 300 289 258 553 425 451 547 644 553 636 600 613 647 385 504 451 438 334 436 384 478 402 649 673 556 674 345 661
67 661 665 421 486 518 436 271 471 433 561 508 605 355 708 762 784 431 590 353 581 530 358 540 432 520 625 479 717 593
-71 593 569 681 724 499 755 459 622 419 554 418 388 761 689 640 738 696 694 699 702 640 612 554 722 411 847 495 776 705 678 738
-219 738 620 915 846 769 585 901 650 755 622 831 787 568 906 820 836 878 822 1049 792 1005 949 877 809 836 787 933 912 951
-357 951 994 1073 982 1241 1088 1064 1375 1118 1102 1190 1094 1355 996 1470 1321 1394 1306 1632 1427 1605 1742 1623 1669 1749 1687 1654 1790 1712
-495 1712 1697 1792 1770 1863
-514 1863
##PAGE=	F1=-3531.54
##FIRST=	4521.1594499999982872,	4521.1594499999982872,	0
##DATA TABLE=	(F2++(Y..Y)), PROFILE
4521A705K6O%J84j73l3K8n5q3o1J2L7j07j60J19r3J83k07N6j07M6n5j46J46j50Q6j31k4J27
4378A176m5m95N15j68K7O7k37K56j89P7L4k68J93Lj32r5J07P1k27K55k13J00K8j4l6J4k27
4246E77M14l22k7R6j34J07j28J26m9N8j5J34j27j0N3k44J27j26N5J66r2j81K04K1q2m3J06
4113F64j3j27k2J09R9j89r8J29j9j25J87q3J49j28q9J75m6Qp8p9RK46j65k96K92KQ0j81J84
3970E95k39K56m2j27L8j07J04O9k31Q0K15j51k4m4J63j48J37J01l20J28j24Q4l6J14j04j86
3842B01L72j77N7q9M8j8l6K54l80K39j08J60k50J15N3j20nJ85j08o5K61l81K51J17k44J5k7
3709C20J03m6o8J5j4j13R3M07n83L97m8j11j1k1J3m1J78k45P5K0n0J09m2j00J41p7J59p6j
3566C83Oj8j05j6J06j21OK41k98R3P4p1J73L8k31l5k0K77k30P1Pj35K29l3j70J14m3L7j03
$$ plain form
4521 1705 1731 1737 1737 1921 1748 1715 1743 1688 1605 1544 1556 1593 1486 1326 1445 1352 1535 1328 1384 1277 1323 1268 1122 1268 1118 1204 1073 1049 1176
4378 1176 1131 636 1151 983 1010 1077 840 1096 907 984 1018 750 943 946 814 719 826 897 670 925 712 812 840 826 790 804 577
4246 577 991 669 642 738 604 711 583 709 660 718 703 837 710 700 753 509 636 510 565 731 639 458 662 683 601 558 664
4113 664 651 524 502 611 710 521 423 552 533 408 595 512 661 533 444 619 573 581 503 424 433 679 514 218 510 512 592 411 595
3970 595 356 612 570 443 481 374 478 547 316 396 611 460 436 392 555 407 544 645 325 453 329 413 377 491 387 201
3842 201 573 396 453 364 412 394 358 612 232 471 363 523 273 388 441 321 316 501 393 328 589 208 459 576 332 347 320
3709 320 423 377 309 324 310 197 290 697 114 511 463 352 341 320 333 292 470 225 300 320 270 379 337 237 378 301 460 384 383
3566 383 389 371 266 250 356 235 241 482 184 277 351 280 453 491 260 225 205 482 252 323 330 195 424 391 221 335 292 329 226
3424B26J37L2l24L81j69r6J09O8r7jR4r4N4O0k72K43J39j21N1k76L7J52j01O4j58J23R8N2
3286D11j84jK63l76R2J96k57J94k8k45K73kj80L11k22k1kO0P8o6J3j15J9Q6J9j61L16k24r3
3143A54O2J52r5j50K45k07J59R7j39j27R9J76k75R7R2N0Q19M67j496J72j45R4Q7l20J37N4
3015B59m9j5Q9R9k13N2M5J65k72K06j13l3k8M3rJ12j02m7J40o4P2j06J44j60J6R8k02J53q1
2872A99L9q4J15j02J77k96M10k17J96l40J91j17K4J96j43P1rk40K32p1J30k61K17n0j69L51
2744D49j26Q0k82N1J21j81J91l3J47k83J91j18M4o0Q2J1p2m1R0r2J15j20k5n2O2J57j45Q4
2606B45M8q2L9k5n8K63l42K19k06l1L60j87j66J62qK9k5N3j17N0P4q6K3M7n6K0o6l1K9M9n0
2454A74l8L06k79J54j21N1M1l3M6j58K57j59O1Nk16J04J69k21J61K1j83k1J14L0k07J44n0
$$ plain form
3424 226 363 395 71 452 283 187 296 364 267 266 360 266 320 380 108 351 490 369 420 144 181 333 232 296 138 261 359 411
3286 411 227 226 489 113 205 401 144 338 310 65 338 336 156 467 245 224 222 282 360 294 307 192 211 297 316 155 471 247 154
3143 154 216 368 273 123 368 161 320 417 278 151 250 426 151 248 340 390 1209 1676 180 352 207 301 388 68 205 259
3015 259 210 195 284 383 170 222 267 432 160 366 253 220 192 235 226 338 236 189 329 265 337 231 375 215 231 329 127 280 199
2872 199 238 154 269 167 344 48 458 241 437 97 288 171 195 391 248 319 310 70 302 231 361 100 317 267 98 449
2744 449 323 403 121 172 293 112 303 270 417 134 325 207 251 191 273 284 212 171 261 169 284 164 139 87 149 306 161 245
2606 245 293 211 250 225 167 430 88 307 101 70 430 243 77 239 231 260 235 288 171 221 295 209 232 279 223 243 177 146 175 224 174
2454 174 136 442 163 317 196 247 288 255 301 143 400 241 302 307 91 195 364 143 304 325 142 121 235 265 58 202 152
2321A52K09l03J10K85l00J50j53K2J83r8q3K2j32J52j51K80j70J14j34O2l3J40j49J67j0j32
2193B00qJ73k11O8j57L0J65q1j6J12j4%P2l9k31K15o9Q3j21j8O3R8j83J27r7n9M49m03J91
2050C39o9k4n8J15o0p2J86k66J82Rm1m1Q5m8k3R4j36R3j59k5K38j61k7J16j10J58j8q1J83
1907C79j41j05L01j42r0j47O8J35j62J38m3p0K01m3j07J03K13k90J34M4l44J24J16j6q6o3
1779A07J07qJ01J92j96J15R1O6j64p2Q73q16M29o16n3J77J65Q3P06J427L033J3747Q1414o9164
1661C1744J03836O124j18813Q5444q1671j9338m224j877k66o30K53k94%J03K30L26m16r5k24
1568B12J40J8J20j61k94Q8K29l4Q59K443J6169n409K679K5736k4906k660N954j5502l854j059
1469G68q3k95k77K34j6k7o8K14n6j18J08m2k6o5Q9j99J67p8o4J26k14K8J86O6j99K00j67R5
$$ plain form
2321 152 361 58 168 453 153 303 150 172 355 257 174 196 64 216 65 345 175 289 155 217 184 324 175 342 332 200
2193 200 192 365 154 222 65 95 260 179 163 275 261 261 333 294 63 278 209 292 171 153 216 314 131 258 161 102 551 148 339
2050 339 270 246 188 303 243 171 357 91 273 282 241 200 285 237 214 308 172 265 106 81 319 158 131 247 137 295 277 196 379
1907 379 238 133 434 292 202 55 123 258 96 234 191 121 322 279 172 275 488 198 332 376 32 156 272 256 170 107
1779 107 214 206 307 499 303 418 509 575 411 339 1212 396 825 209 156 333 498 581 1287 2714 5747 19494 100908 31744
1661 31744 135580 141704 22891 108335 26664 7326 3102 1225 959 329 582 288 288 391 621 947 531 436 212
1568 212 352 370 490 329 35 123 352 318 1177 3620 19789 14380 17059 42795 17889 15229 21183 5681 1827 768
1469 768 685 390 113 347 331 304 236 450 394 276 384 342 316 251 340 141 308 230 166 292 78 106 292 358 159 359 192 287
1332B87R4L2k62J60n6k8j32P8pmJ75o7k17N17m34K60j51N7M3j87J84j91N5l1J04J05j72J22
1194C34o1K6RJ77j80j27R0m3o1J46k66J97Rj16L8L05k96Q7Q8N2j4k15J46m9o8q7J75j22P2
1051B46n1J03k6J49Rj49Q8J19k53O4j46N1j49J66L6n4J38l1L1J46k38R6L36n09Q2J2J76k26
913B16p5LJ52J21l58L42J3j1J65j34n3n3N4P2k48n2K13j72L7K88n3n0J82j57N1j2M3q4j07
770C33j0p8N4j2p9M27k44J98K9p2J70J1o9Qk75R6j60j17J08l9O6O09N65r18K63K00P9j25M2
628A060q3j8l14K43k52K77J39L06L68N95PR04J85N19M84P51R78J200M009O572J1097L3809
519F2836J06194J9015N5480K44116k85480k9444j24776k3526q917m239k858j683j625q24o53
446C616r61o82k01n21j74q9K60j85K93J32l90M51l28o3L3l41R0k51p5l99K66o4M4J06K39N9
$$ plain form
1332 287 381 413 151 311 255 227 95 173 166 162 337 270 53 570 136 396 245 302 345 158 342 151 206 175 279 384 212 334
1194 334 273 299 308 485 305 178 268 225 164 310 44 241 250 134 172 477 181 268 356 408 394 179 325 276 208 121 296 174 246
1051 246 195 298 272 421 430 281 369 488 235 299 153 204 55 221 257 203 341 310 341 487 249 345 681 172 254 266 442 216
913 216 141 144 296 417 59 401 414 403 568 434 381 328 382 454 206 154 367 195 232 520 467 417 599 442 493 481 524 440 333
770 333 323 245 299 287 208 635 391 589 618 546 716 727 658 666 391 487 327 210 318 279 345 954 1519 601 864 1064 1143 1018 1060
628 1060 977 959 645 888 636 913 1052 1358 1726 2321 2328 3232 3417 3936 4420 5171 6149 7349 11358 17930 29027 62836
519 62836 169030 188045 243525 487641 202161 172717 47941 24415 15498 11259 8401 6718 5093 4269 3616
446 3616 2655 1973 1772 1251 1077 988 1248 1063 1356 1488 1098 1549 1221 1158 1191 850 940 689 614 215 481 417 461 567 806 865
318H65k44K51j47o1K08l22o8j3o7l58N24j36j36K48J21j20M6J22J39l82J26k75L16l78K1m6
190B34L01j74R1M7J49j49L4O2m1O5k56R2n4M9j59J34p4R8j16L04Qj30J12l43L68o8j69J9M1
47D75m1k17K56j05J83o1O5k36L60L2K4l56J59j92J92m6j67K11j51Q0J48k03K69r0m5M4Q9k73
-91D04L84l78J51j66J31j63K2L02o1J0P3p6JJ3k1mq9L2J18l10M08l34K73p1j7R8k09L66j05
-234G82p5j52L22l01J52j85K47l8k32L27j17Q7j6l8J89k04J99l4j17l8K1o9J78m2L3O9L7p7
-371I08K80k27Q7K11k25j0R0j16K81l46M45j72P9k7K37j64J82O5m7MJ17o9n9J28n2kL6M3M9
-514A726
$$ plain form
318 865 621 872 725 664 872 550 482 469 402 44 568 432 296 544 665 545 591 713 852 470 596 321 637 259 280 234
190 234 535 361 452 499 648 499 533 595 554 619 363 455 401 450 291 425 351 449 333 637 645 515 627 284 652 584 415 434 475
47 475 434 217 473 368 551 490 555 319 679 711 735 379 538 346 538 492 325 536 385 465 613 410 679 589 544 588 677 404
-91 404 788 410 561 395 526 363 385 687 626 636 709 633 634 647 626 622 533 565 683 373 781 447 720 649 632 730 521 887 782
-234 782 707 555 877 576 728 543 790 752 520 847 730 817 801 763 952 748 947 913 796 758 779 710 888 846 879 948 985 908
-371 908 1188 961 1048 1259 1034 1024 1114 998 1279 933 1378 1206 1285 1258 1495 1331 1513 1578 1531 1535 1652 1583 1524 1652 1600 1598 1634 1677 1726
-514 1726
##PAGE=	F1=-3541.39
##FIRST=	4521.1594499999982872,	4521.1594499999982872,	0
##DATA TABLE=	(F2++(Y..Y)), PROFILE
4521A436M6QrJ64j26n6Rpj25J5m2L1n1j71J25j00J52j49L6j40J42q0k31K42k02J51j21o9J07
4378I85J7n20N65k53P2L9j97K74j86J3P8k70K05Jj32j19J76M5k17J97j58M7Q4j6p0L4k09L90
4241H75l17l6J17j37J18j19J41j36J32j6R9j62P3M5k70J14q4P9P9K1k58K03M3j08jN9op6n3
4098D19R8J16k29k3J14p0p2J71p9J05j09q1J87j4l3q5o4NK49j95k21K57L3J2j32J03j48K14
3960E28J1j69J4o8J17J3j64M3K24j37j7p4K03k29K08M0k54J14j75J38j5L1ok48L86j74Q4j31
3822B93R7n6l1K11l44K40j04J93k84R8J10j59rJ71k2j72L38m46L00Q7k49L7lQ0n8l3Jp0l8
3679A78P2L36m77L17l2p9j4l7O4j14K03k23O2J5m8J38j08l2R7m7J39j15R2q9O8j29n2Q6l7
3537B34RJ61k36P0Q4q4J21J01k70N3r1L00k41P0M1j28J84k2j79J12j5j1m7J02J5k80L37j32
$$ plain form
4521 1436 1482 1490 1481 1645 1519 1463 1472 1465 1340 1355 1313 1344 1293 1122 1247 1147 1299 1150 1186 1046 1188 1108 877 1119 917 1068 947 878 985
4378 985 1002 482 1047 794 866 905 708 982 796 809 887 617 822 823 691 572 748 793 576 773 615 662 746 730 660 694 485 875
4241 875 558 522 639 502 620 501 642 506 638 622 721 559 632 677 407 521 437 516 595 616 358 561 604 496 495 554 548 472 419
4098 419 517 633 404 381 495 425 353 524 445 550 441 360 547 533 500 415 351 356 605 410 189 446 479 491 359 462 314 528
3960 528 539 370 384 316 433 446 282 325 549 412 395 321 524 295 503 543 289 403 228 366 351 382 376 128 514 340 424 293
3822 293 390 334 303 514 170 410 306 499 215 313 423 264 255 426 404 232 570 124 424 511 262 299 296 376 318 285 286 216 178
3679 178 250 586 109 426 394 315 301 264 328 214 417 194 256 271 223 361 253 221 318 271 410 295 387 298 366 237 185 271 234
3537 234 243 404 168 238 322 238 359 460 190 243 152 452 211 281 322 194 378 356 177 289 274 263 216 318 333 53 390 258
3399B58n5N9O3p6k0J06j33Q5L7k25J94J29j01M3k73Q0J36j00R4k07N2K05K3j93N2K18l86J48
3261B13J22k24K40j31j96L24p3o6J97k01mJ8j1J66j56O6j66J03l2J15j82L05k10j06O3J69
3133C43j21j26K64k26J52R7j36q3M2J66k05J8R8J01O69L54j264J75j40J03N7k63J06N4p8K5
3005A82O8R7k14P1L0J64k84K02r6Or2L6O7Q9j28k3J04m3J00j59J51j60L8J22j79M8oMq6J16
2857B25q7J79k55L80k01J77l50J59o5OK08j57L7M9k61K34n5J08k91K77q4j61L54j89J31k56
2729A12j7J75j57K26q0J13k78J93j20Q4r2J5J02j24M9K2p4R3j06j5m4O4J44j64Q6M3n7P6n5
2587B14k6J75k93J95j72J1L24k47j00J33j1O3q4P9j43P6R5q4M6J6p2K4n0om3O4l0j2K76k81
2439A37J10q0N0P1l4J2j03K13r5l6K5k31J50J86k71J95j5j58J0P6N1j88J08r3K59k92Q3K86
$$ plain form
3399 258 203 262 325 249 229 335 202 287 324 99 293 422 321 364 91 171 307 207 301 94 146 351 374 181 233 451 65 213
3261 213 335 111 351 220 24 348 275 209 406 205 201 219 208 374 218 284 118 221 189 304 122 427 217 111 174 343
3133 343 222 96 360 134 286 383 247 164 206 372 167 185 283 384 1053 1407 143 318 178 281 338 75 181 235 157 182
3005 182 250 347 133 204 234 398 114 316 220 226 134 170 237 326 198 175 279 236 336 177 328 168 206 328 149 197 191 195 109 225
2857 225 138 317 62 442 241 418 68 227 162 168 376 219 256 305 44 278 223 331 40 317 233 72 426 237 368 112
2729 112 95 270 113 339 259 372 94 287 167 251 159 174 276 152 201 223 149 242 136 121 77 141 285 121 207 250 193 269 214
2587 214 188 363 70 265 93 104 428 181 81 214 203 266 182 261 118 194 289 205 251 267 195 219 169 163 120 184 154 142 418 137
2439 137 247 167 217 288 254 266 163 376 281 245 270 39 189 375 104 299 284 126 136 212 263 75 183 90 349 57 140 426
2301D26k83J24j31Q8O7o4j11O0q7J23j51K34j13L6l2j9k5J62j68K10o5p1o2K23k34K5o2k3
2163G7J61j11L8M7J4j7R7l1k43K28r5J38j68M9rJ31j78J02q1mL53l47J82r4k5j7N3J1j26K30
2016C65k57J64o7Q7j82J93j28J6Q8j58J39k00M4J59j19n1J59j32J48k3k9J30j53n6K47q7j17
1883A80j00K8J24j14R9l6m8J51l5p9L2K64l07J49J8l06J19J33k1j24K3M5j4P2K19k01J20J6
1745D07J44j91n2P77p37L84o15K0R4K00L6O15J281K610J1980P0390n9951R0173N596j03908
1647A9253P4877p0737j6867l693j775j22o28K50k68j0O9J89L28m18p1j78J39l7J25j20k63
1543D3N7J91n2P13J996J3294n121M445J7461j6796m424N639j2644l248q86n1l10k15K58m1
1445C09m6r4K17l7j13P1k2k8n7R6j82Q4N0r6J48k53R8J35M4j75J42j49J23Q7o3j24J06j04
$$ plain form
2301 426 143 267 136 224 291 227 116 176 89 212 61 295 182 218 186 167 142 304 136 346 281 210 148 371 137 162 100 77
2163 77 238 127 165 212 226 209 306 275 32 260 165 303 135 184 175 306 128 230 149 145 498 151 333 239 214 197 250 261 135 365
2016 365 108 272 205 292 110 303 175 191 279 121 260 60 104 263 144 93 252 120 268 245 216 346 193 137 384 297 180
1883 180 80 108 232 118 217 181 133 284 249 170 202 466 159 308 326 20 139 272 251 127 150 195 181 253 472 271 391 407
1745 407 551 360 308 1085 348 732 117 137 231 431 467 1082 2363 4973 16953 87343 27392 117565 123161 19253
1647 19253 94130 23393 6526 2833 1058 936 308 558 290 280 349 538 866 448 377 199 338 301 426 306 43
1543 43 100 291 239 952 2948 16242 11121 15566 33027 16231 11807 17446 4802 1554 668 617 307 92 350 309
1445 309 263 169 386 349 236 307 285 257 200 296 114 198 248 152 300 47 145 280 324 149 291 142 265 352 289 165 271 167
1307A67P1j19J7O0p7J97n2j58L92l79K68j85K5Q6j67J20j12O4l3Q2J15j69N2l2O4q3K34k14
1169B34l2M5r2l5J71k75J86R5k12Q9K01k23K7J28M9k0k02J72n3r1o2K17k19P2N7L8o2J75p2
1026C06l0J6J53k98J57k14P8j09J45L1o7J51m6mJ13j63O5L16m74K4J37J35j73j29L6O2J98
894D16l15K86m6m5K66j93o4n7O0J27k68j6J81j33k7L18o1r8K15j89L8L0L7q0j15J0p0P6n9
751B24K3K99k44J72J14j84K02L7j01L4k15N2j07p2mM8R9Q26j60m86J63J59J48j54J8j11J09
618H89l22K09j93K12J32K30L77M23J7P77J61M76M28O91Q66J358L093M017O201L2045Q7833
514A39920K9146N0206K05037k55717k3469j04266k0007p593l633k513j382j468o29n41p83
441B308q19N4m92j25r3K17j61K70Q3k65L27k80o8J05l49J28k48l6m10K45m0L3Q3K34R4l48
$$ plain form
1307 167 238 119 136 196 119 316 264 106 498 119 387 202 227 313 146 266 154 218 185 267 382 213 265 233 297 214 448 234
1169 234 202 247 155 120 291 16 202 297 85 174 375 152 179 307 356 336 134 306 253 162 100 317 98 170 227 265 203 378 306
1026 306 276 292 445 147 304 90 168 59 204 235 168 319 273 269 382 219 284 600 126 150 287 422 249 120 156 218 416
894 416 101 387 341 296 562 369 305 248 308 435 167 151 332 199 172 490 429 331 546 357 395 425 462 382 267 277 207 283 224
751 224 247 546 302 474 588 404 606 643 542 576 361 413 306 234 230 278 377 1203 1043 557 720 879 1027 873 891 780 889
618 889 567 776 583 795 927 1157 1534 1957 1974 2751 2912 3388 3816 4507 5373 6731 9824 13841 20042 52087 139920
514 139920 169066 219272 424309 168592 145123 40857 20850 13257 9624 7111 5729 4261 3632 3091 2308
441 2308 1489 1543 1051 926 833 1050 889 1159 1242 977 1304 1024 956 1061 712 840 592 556 146 391 351 384 467 701 795 447
313D47L31k28N9J29k60n8Mm8l65M73o5j78K51K5l6L8Q8J62l87J18k32L33l79K0l6K65j97J60
175D34l0K16k24JJ64j10R4k17M9n2J04j94J45q0R4j52L22J0j26Q3l29L95j23r0l5N5j1k47
37A46K99j49K11n6Oj90L46nL5l47J60j49J54m6j47K23j73N8J82k40K80l9r5j2J38l02M79m42
-101C25J34j14J13j59M2K28n8Q8L9j12MJ1k1L7j46J30N8k95L55k76K33o6k3J73l07L91j13
-234F71q0r8K90l14J69k10K74l9k14K79j41J56p5j9J35j31J84k5j59NJ4r4K04o2L8O5j0k4
-371G89K66k92K02Q9j78rR6j27K76l13L93j85Q0M2J30j24J82j5K0j5J28o7q8J26l9K4k3R2
-509A460J6
-514A476
$$ plain form
313 447 778 550 609 738 478 420 424 376 11 484 419 241 492 517 481 519 607 769 382 500 268 601 222 242 206 471 274 434
175 434 404 620 396 397 561 451 545 328 377 325 429 235 380 300 394 242 564 574 448 531 202 597 474 384 349 404 393 146
37 146 445 296 507 451 457 267 613 608 643 296 456 307 461 415 268 491 318 376 558 318 598 559 464 452 590 288 767 325
-101 325 459 345 458 299 341 569 511 599 638 526 530 541 520 557 411 541 599 304 659 383 616 550 527 700 393 784 671
-234 671 591 493 783 469 638 428 702 663 449 728 587 743 668 649 784 653 837 812 653 658 672 578 782 720 758 823 813 789
-371 789 1055 763 965 1054 876 867 963 836 1112 799 1192 1007 1087 1129 1259 1135 1317 1302 1322 1307 1435 1368 1280 1406 1367 1391 1368 1460
-509 1460 1476
-514 1476
##PAGE=	F1=-3551.23
##FIRST=	4521.1594499999982872,	4521.1594499999982872,	0
##DATA TABLE=	(F2++(Y..Y)), PROFILE
4521A080Q8pj4J44p7q6%L4j55R0r5K2J4j69J07q3J00q4%j38K18r7l02L26k42J88p9j28R4N6
4373H05m68N48l21J10J7j37K49j63l7J09k79K42k7j08j51K40L1k10J37j15K0J17j0r9L8j70
4246C68L45k85n2J28j41J53j22J56k37K11k6P5k07J74K6k78R7l1O7K5J11l15J96M2j08L8J3
4113D23Rl9q6R7J06k34N9O9j00k9J60p5M2o6p8J93Qn8j04l1oK51k26j35K13N2n4n6pm4J58
3960D12O7j96kl0J00k9q6J1K04j07j6r7K29k89K69rk10J08k02J76j4k3P0k89L76j53J08j47
3822B31J10p0l3J51k61J91q3K27l18Q9J44j91j2J61O6k45L60m77L17P0k63R6mO7p2pj3j17
3684A14N4K6K53l44K12jo5J1p8J17j35J76j93P7mp6J90j82Q6Qj4J10j44J64j65J40j44r1Q3
3542A85M0J4O7j54Q5L1q1N9J61k68J15j30K76k37P4N7j00J20k3j53Q1M2q2J9N5Nk03K54j03
$$ plain form
4521 1080 1168 1161 1147 1291 1214 1128 1128 1162 1007 1097 1002 1024 1038 869 976 893 993 909 909 771 989 892 590 916 674 862 783 655 749 805
4373 805 337 885 564 674 691 554 803 640 603 712 433 675 648 540 389 629 660 450 587 472 492 609 599 500 538 368
4246 368 713 428 376 504 363 516 394 550 313 524 498 573 366 540 566 288 385 354 421 446 557 242 438 480 372 410 423
4113 423 432 393 307 404 510 276 335 404 304 275 435 360 402 336 258 451 459 401 297 266 260 511 285 150 363 415 361 305 298 254 412
3960 412 479 283 281 251 351 322 236 247 451 344 328 231 460 171 440 431 221 329 127 303 289 266 336 47 423 270 378 231
3822 231 341 271 238 389 128 319 236 463 145 234 378 187 175 336 402 157 517 40 357 427 164 260 256 323 251 244 231 114
3684 114 168 194 447 103 315 314 249 260 182 299 164 340 147 224 220 144 334 152 238 246 232 342 198 362 197 337 193 102 185
3542 185 225 239 306 152 237 268 187 246 407 139 254 124 400 163 237 294 194 314 291 138 219 261 179 198 253 258 55 309 206
3399B06K8J0L5o0l5J18j69J09Qj62J31J20r4N5k55J13J05q1J19k26k4K83j8j82J00J60l23
3266G1J42L1j52K56k15r8K98j26M1Q1j77M4Lo5K36k34R0j56J42j46K10j98K82j70j18O1J67
3133C00j34l8K04k43J60P4j15l9k3J67j66j8P7J55M95K15r62J52j21R6L8j84N7M5q2M0P0O7
2995B87j73O1L9J14k60J83n5J2j07j6J53P5j65mR4k4R1j96J55j37N3J25j41l9O9m9p9J05o0
2853A11J46j86L37j54J18k99P9nmJ93j38mQ4k45K05m3R1k71K87j20p8K80k55J79k00q9K08
2720B27j11K31j11P7k41J55r3R8r2p7K00j72J45o1o3P7n4l4l3N5J23j81J01K8k9J03l5m8J07
2577B92k49J77j38N3K57k75m4J19j9Q2j27R7j61Q1J19p9P1k4n9K4n1L0j16P6pRK42k81P1m2
2429A28M1R7k9k3k7J54m2j26O7j71J20J74k51J57l9q5J6MQ6j42N7j44L08k60N4K42k37Q9o0
$$ plain form
3399 206 234 244 279 219 184 302 133 242 250 88 219 339 245 300 45 158 263 182 301 75 51 334 316 134 234 394 71
3266 71 213 244 92 348 133 35 333 207 248 329 152 196 199 134 370 136 226 70 212 66 276 78 360 190 72 133 300
3133 300 166 128 332 89 249 323 208 169 146 313 147 129 206 361 856 1071 109 261 140 236 274 90 147 192 110 150 220 287
2995 287 114 175 214 328 68 251 196 208 101 85 238 313 148 144 238 214 305 109 264 127 180 305 164 125 194 145 66 171 111
2853 111 257 71 408 254 372 73 152 147 143 336 198 194 278 33 238 195 286 15 302 182 104 384 129 308 108 19 227
2720 227 116 347 236 313 72 227 134 232 140 63 263 91 236 175 112 189 135 101 68 123 246 65 166 194 165 268 233 185 292
2577 292 43 220 82 135 392 117 73 192 173 255 128 225 64 145 264 185 256 232 173 197 146 176 60 136 129 138 380 99 170 128
2429 128 169 266 237 214 187 341 299 173 240 69 189 363 112 269 230 145 161 165 251 109 166 22 330 70 124 366 129 218 158
2286A58J18p2qj18Q0n3R0j15J45m9l6P4r4j9J63j68K34j16or1K39k35k5K6n0J38j37Q2j6M4
2139A83k7R7j0j96J90j17J87k07J02p7J57j61P2m4L2K41k78J61j13l3M1qQ0j67K52k28J17
2006B46j29K10k98K78k00M8P7j59J53j67P3P6q3p3J88j54J49l1K1O6j44KJ62k1j23n0k5J06
1868A98o8O7l3j8P1mn1l3L00k92J33J0k61J10J44l1j47Q0j0k2L0K51k04J33o4J96j70l4O10
1725H91o11L15n43P1qK44k4M85J082K057R628N5973m7862P2148M658q3772O0528n6353j3521
1632E386k984j578L2n85K24j98n0M8J37L08l98n1j09J28j01J50q9j86%J39l2M95J499R916
1514A2101m268M888J0439r917m895M684r339k485o95Ll11j41K63p7m0j17K24l2p2Jjk6k8P7
1396B36j33QJ29j10J64j82P1O6K2j42R3j21J24Q8j68K7M6j51J65q1m7J13j40J97l6p0K25k33
$$ plain form
2286 158 276 204 196 78 158 105 195 80 225 176 140 214 120 101 264 96 330 214 208 117 356 121 96 122 72 210 73 155 139 183
2139 183 156 253 243 47 237 120 307 100 202 125 282 121 193 149 181 422 144 305 192 159 200 192 272 105 357 129 246
2006 246 117 327 29 307 107 155 232 73 226 59 132 208 125 52 240 86 235 204 225 291 147 149 311 290 167 117 92 198
1868 198 130 197 164 146 217 213 162 129 429 137 270 280 19 129 273 242 95 175 165 143 173 424 220 353 289 485 315 281 891
1725 891 280 595 52 123 115 359 335 820 1902 3959 13587 69560 21698 93846 98504 14732 75260 18907 5386
1632 5386 2402 824 856 271 495 297 247 295 432 740 342 291 182 310 209 359 270 84 84 223 191 686 2185 12101
1514 12101 7833 12721 23160 13243 8348 13032 3693 1208 513 516 205 64 327 250 210 93 317 285 213 214 213 187 159 236
1396 236 103 111 240 130 294 112 183 249 271 129 222 101 225 313 145 172 218 67 232 151 104 217 77 274 238 168 393 160
1258A60J94j96%J05j34N0k9O9l5O8J15j62k4KJ06j84K87k22M7j6j22J0J80k09Q3J79k95J47
1120A74P8j41k2J60N6m4j71J78m5j08n6K57k78M6J66k3j01J87j43Q0l6J75l25K12k03M9m9
987G3J14Oo7J65o9m1Q0q7M0K76m17M4J66J00j16j60N3k1K51k12J71r3m7L19k47m8r2J07J33
844C81k59K1J42j02q0L30o0j43K41k10J4O8M1p8j08K5p5J12j07J19J57k28J42J85k88K12R9
711E51j62P3j19l9k8k8j16J35J08J102l86n80M2R9K14j86Kj31K12l07J59j29J43R9J70L39
583A237K57K7N87J41L84L83N48O73J304K528K060K624K6511O5742L8088L6541J56102k07891
495A27846j6984p9069j5513n880k862k029j062j217m26m47m82r38L00m52m1j11J62j19K39
401I15J8j14J74k09q6J79l18J30k27K5m30K31k7K7N6K31J04m27L86k73J59L6j73m7K5m0k66
$$ plain form
1258 160 354 158 158 263 129 179 150 219 184 252 367 205 181 183 289 105 392 170 217 201 79 89 269 60 143 322 27 174
1120 174 252 111 89 249 305 261 90 268 223 115 59 316 38 84 250 227 126 313 170 250 214 389 64 276 73 122 73
987 73 187 193 126 291 222 181 261 174 214 490 73 117 283 383 267 107 160 139 390 178 349 256 209 528 281 233 141 248 381
844 381 122 143 285 183 103 433 373 230 471 261 275 343 384 306 198 223 148 260 153 272 429 201 343 528 240 452 551
711 551 389 462 343 304 276 248 132 267 375 1477 1091 511 553 652 866 680 682 551 763 456 615 486 629 728 898 1237
583 1237 1494 1521 2108 2249 2633 3016 3564 4237 5541 8069 10129 12753 39264 105006 143094 179635 335737 127846
495 127846 110862 31793 16280 10400 7538 5509 4447 3230 2804 2357 1875 937 1237 785 744 633 795 676 915
401 915 933 819 993 784 698 877 559 689 462 487 57 288 261 288 344 575 679 252 638 365 524 560 387 340 365 325 59
268E9L22pj67J98o2O9J7L8J75l60R3j59L07l16k5oK00j99K25j22K83l03mK45j77J14j50km9
126B37J44k08J39o9Q0j74K90L7j14M1k88L95j56k4q6Q0lk49L20j62K13m0p6j19L13n3N7l27
-12A98J56j09J21n2j17K10j61K3J98k19K41K0j64m8J81l12N29m67J10o1Q6j28L2J57o3J74
-140E35jj39OnKN7j87K26j4k62K80j72J54n4m5K71l88L62r6q1m5K33k90J52k02K84m3j69K02
-283E71j58K18j22qP4n5J82l8j91N5Nj19K16o6M7L7o2O0K20l39L06m0j14k4J18j40K52k59
-421F26L22j91Q2J00L0r7J78q7P2j7J22n9j16J32m0N8p7J23l
-514A158
$$ plain form
268 59 381 374 207 405 343 412 429 467 642 282 375 216 523 207 182 176 376 177 402 280 563 260 256 501 324 438 288 286 237
126 237 381 173 312 243 323 149 439 476 362 403 115 510 354 330 244 324 321 72 392 230 443 403 327 208 521 468 525 198
-12 198 354 245 366 314 197 407 246 269 467 248 489 509 345 297 478 166 695 228 338 277 363 235 267 424 361 535
-140 535 534 395 401 396 398 455 268 494 480 218 498 326 480 426 381 652 264 626 530 449 404 637 347 499 297 581 538 369 571
-283 571 413 631 509 501 575 520 702 664 473 528 533 414 630 564 611 648 586 646 866 527 833 793 679 655 773 633 885 626
-421 626 948 757 839 939 969 872 1050 963 1035 1018 1140 1081 965 1097 1057 1115 1038 1161 1158
-514 1158
##PAGE=	F1=-3561.08
##FIRST=	4521.1594499999982872,	4521.1594499999982872,	0
##DATA TABLE=	(F2++(Y..Y)), PROFILE
4521F92J46l1j1J21l7j13PN7j69J54j46J3Q8j60O5m4M0l6l0j04K61j06l45L81k62J89j1j95
4383D14R0P3l18M33l52J24%m8J72j24o7J26k94L00p8o5j79K84K5k00Q9j03L8J09Oj16K1j08
4246B52K75k24p4J25j40J97j15J42l13K64l4O0k51K79qk58P8J6K7J3J64l43J99lp7O6k0L8
4108C35l4j15J09O9k06J45or7k1J65n8m2j1p9J90K4p6j21J0j6K57k64n2J73M6j05L4j25N3
3965A82J02J16k01%j7P3n8j6oJ62p0j6j18K39k94K93m4j89J06j94J85l1m3J17k38K83j25J29
3827C27j27P6n7m4Q1j18P5m8K49l23P1J57k16KJ41J40k27K76m01K36P0k86J82k7O5q2kj6j43
3684C1J33k8J59j98J10K7o4N0j33J64r7J01j59J25n1j10K40k32K09j00J4Q5j65K03k11J89
3556B92j50j28J10R0J8l0o4J24n7o9PJ95k00J19j10J88k03O5N2n9N2l9q8K9J05j59Q2RKj16
$$ plain form
4521 692 838 807 796 917 880 767 774 831 662 816 670 683 771 611 676 632 672 636 606 502 763 657 312 693 431 620 609 414
4383 414 504 577 259 692 340 464 464 416 588 464 397 523 229 529 451 386 207 491 516 316 405 302 340 449 455 339 360 252
4246 252 527 303 229 354 214 411 296 438 125 389 355 415 164 443 435 177 255 271 298 311 475 132 331 328 251 317 297 335
4108 335 301 186 295 364 158 303 297 200 179 344 286 244 233 154 344 368 292 171 181 165 422 158 106 279 325 220 254 129 182
3965 182 284 400 199 199 182 255 197 181 175 337 267 251 133 372 78 371 327 138 244 50 235 204 161 278 40 323 198 327
3827 327 200 276 219 175 256 138 213 165 414 91 162 319 103 105 246 386 159 435 34 270 340 54 236 209 274 192 190 174 31
3684 31 164 136 295 97 207 234 170 220 87 251 154 255 96 221 170 60 300 68 277 177 191 276 111 314 103 292
3556 292 142 14 124 214 232 202 138 262 205 136 143 338 138 257 147 335 132 197 249 190 242 203 115 144 249 90 172 181 183 67
3409F7J55q4J22j0k1m3l7J17j88J14j9r9P1J13j06Q5j96J08O1o3J52j84QJ89o3j33J09J07
3271C32k16Q8m7o4K26k29pK13j52J28k0j55J05k7p8K53k89Q7o5J03j35J89k02K48j15j09M0
3138A02J44j28O7J04k54J80L3q2oo9J63j59oL6K05L19P6o36J07r9Q0K7j07QL2o3L3R1J9r7
2990A20J5P6K7k12J65Lk0o9p7K02O9k02NJ04j4N8k05J55r7O2R7r3p7J28j25k8M8k1P9j04K88
2838C57r1M1j93k7M0lJ54q8m8R5k01J57l9Q5j81K17j52L2J78k83J80j24o1J25n5K09j25N8
2700B57j86Q8m1Q2p5o2J85j46J71j47o1P1K2p7k2L7J00j89J14J6oJ19Or6O8j73J19j08Q4J79
2552C29k57j1J14l0R6j54J00j67O3J43p7R4o0j4Qo6P4j58O5QK9K06k80M2j2L7J05k4n7N7J00
2400C03j1j99J30p8M1J47j86P8n4MJ2q3J29r3J6j12K63k09K4J64j76N9L4J16j89M6r2O3l5
$$ plain form
3409 67 222 138 260 250 229 186 149 266 78 192 173 74 145 258 152 237 41 149 210 147 299 115 123 312 249 116 225 332
3271 332 116 204 157 93 319 90 83 296 144 272 252 97 202 175 97 350 61 148 83 186 51 240 38 286 171 62 102
3138 102 246 118 185 289 35 215 248 166 160 91 254 95 89 125 330 649 725 89 196 97 177 204 97 105 137 74 107 198 217 120
2990 120 135 211 238 26 191 194 174 105 28 230 299 97 102 206 192 250 45 200 103 165 262 169 92 220 95 67 115 94 173 69 357
2838 357 266 307 114 87 127 124 278 190 142 237 36 193 154 239 58 275 123 155 333 50 230 106 45 170 115 324 199 257
2700 257 71 159 118 200 125 63 248 102 273 126 65 136 158 81 59 96 196 7 121 137 131 250 256 160 228 55 174 66 150 329
2552 329 72 61 175 145 241 87 187 20 83 226 149 243 183 169 177 111 185 27 92 100 129 335 55 97 85 122 227 203 146 203 303
2400 303 292 93 223 145 186 333 147 225 171 175 187 104 233 140 156 44 307 98 122 286 110 169 203 319 130 176 84 147 112
2257A12N7p1O4%r6J67j30k4J32j43K34j60N1p3J98k11p4Q9m0R9j23P5o9P8l8P9K4j25J34j29
2109H7K18k16J15j24J62j31N5lN2J22k05J29j25m7J10n4J29j56K18j90N4j44K88k51K04k52
1981D5O9N8j38J42j09R4Kn7q8J94j68J56m2O5Mj16O1N6M4j07k0o7Q7l1N1l8Pj9M6k9m2K78
1824C88k32P5J4k16J12J27l8j46R9n3l0j6K78j93J36j32K14j12j3L92m54K33l92P8j10K87
1696B96r0L40Q54J451P041M0269l4680N2413L462o1386M4531m0623r798k206j316J74n14J88
1607D06j06j05M0Q5K66l64l0l0J14j72K11q3j14l9Q9pK62J023O539l112M319N093m685m374
1489E226L391o081j691n09O0k90n7K38j21or0J88l9pr2K7k8J4M9p4L0P8j18J77r9K9jMj04
1346A04O2q5R5R4k63J57oj27J78k6r4J38j81J72j6J2N7o5J00j78j9R6j01nM1O3l3O6J05j50
$$ plain form
2257 112 169 98 162 162 66 233 103 79 211 68 302 142 193 120 318 107 33 122 82 181 58 133 64 142 104 183 207 82 216 87
2109 87 305 89 204 80 242 111 166 163 215 337 132 261 136 89 199 145 274 118 336 146 200 56 344 93 297 45
1981 45 114 172 34 176 67 161 163 106 18 212 44 200 158 223 227 111 172 228 272 165 145 78 165 134 185 147 154 135 181 152 110 388
1824 388 156 231 245 29 141 268 230 84 183 130 100 84 362 169 305 173 387 275 262 654 200 433 41 119 9 296
1696 296 206 546 1400 2851 9892 50161 15481 67894 71356 9970 54501 13878 4080 1874 558 732 218 406
1607 406 300 195 235 320 586 222 192 162 276 104 315 232 118 79 168 161 423 1446 7985 4873 9192 14285 9600 5226
1489 5226 8617 2536 845 336 396 106 49 287 166 160 70 258 219 212 120 147 119 133 182 108 138 216 98 275 176 205 204 208 104
1346 104 166 81 176 270 7 164 158 31 209 183 89 227 46 218 202 214 271 206 306 128 109 205 104 99 140 203 170 236 341 191
1199A91o9J9J41k64L03j87Q0p5r8N0J54j41l0K53k99J40l5o4j9J45P6r3j19J69l6j15n8K76
1061B95k22j0J98o9j15J62j86J60m6J58k85J82j22k2J3Q5l4n5J76r7o8M7k5L5K08l09R5J05
923B54Q1p1j46M6o2K42j22P8j08j1K87k82oj31J56R9k30N6J03q0j11L12m7j74K53k12k2R5
785B47N5p7q1K3q7J51j41J87K5j92J03K32l57J88J85k23J05j1j56O9Mj99J90Q7J287k23r41
652D50o2K5K73k12j2j34K73k74J11p0P8M4J37K65J10N7L58J33K55L61L46M59J044J913Q93
529F821O62J8934M3155M3378J8522J05599j50504j1117n3261j0749m040k060j464p91r04k73
451A908l91r8r70M59m06O9j48J10o8K00n7M6Nj08j21K35k39Q8k00J03l85J60l1L5J9K32R4
318E41m79M12k78K33o0q1l3N0m3j56J75K1j08J05j31J85j7j5J66k98M8o6K48k04r9L2J22j83
$$ plain form
1199 191 122 141 282 18 321 134 214 139 41 91 245 104 74 327 28 168 133 69 50 195 271 178 59 228 192 77 19 295
1061 295 73 63 261 192 77 239 53 213 167 325 40 222 100 78 91 176 142 87 263 166 98 145 120 155 363 54 149 254
923 254 335 264 118 164 102 344 222 300 192 181 468 186 180 49 205 304 74 130 233 153 42 354 307 133 386 174 152 247
785 247 302 225 144 167 80 231 90 277 302 110 213 445 88 276 461 238 343 332 176 245 249 50 240 327 1614 1391 450
652 450 388 413 686 474 462 328 601 327 438 368 446 490 627 892 1002 1059 1417 1550 1805 2166 2512 2971 4015 5928 6821
529 6821 7483 26417 69572 112950 131472 237071 86567 75450 22189 11440 7400 5340 3876 3085 2181 1908
451 1908 1517 1419 449 908 502 571 423 533 465 665 608 654 659 551 430 665 426 514 314 417 32 192 161 196 215 447 541
318 541 62 474 196 429 369 288 255 305 262 106 281 302 194 299 168 353 336 321 487 189 237 171 419 215 116 148 270 87
180H7K71k11L35l61K9K75k24J19o8n3m6J61k05J39n8O0j77K11Q8j05kj91L35j66J8j23J10
47B48j3k20L10j48J94j7j63l2K64j07R1l03J41o7R3o5q3J67j05j2J80j06J19Q1k35o3K12l07
-91E4N30m32P0k3N8p4mR4o9K46l7j53J1l4M5M7j98L06r8k08J91l6M9l8p9L77m25K74o6o0k2
-244B96J66k35J10j66K79m7j09J05j63K62j33k5K0J0K03q0k02J00rj40K12l8M3Lj21J61J47
-376F49l58L79j48m4o0J62j58K12j72K25j94R4J32m3r2J75j41J07j4J06m1j45J42m5Q9j20
-504F97J38j2
$$ plain form
180 87 358 147 482 121 150 425 201 320 252 199 153 314 109 248 190 250 73 284 372 267 265 74 409 243 261 138 248
47 248 235 15 325 177 371 354 191 159 423 316 407 104 245 178 271 206 123 290 185 173 353 247 366 447 212 149 361 54
-91 54 584 152 222 199 257 183 179 273 204 450 413 260 271 237 282 329 131 437 339 131 322 286 335 297 218 595 170 444 378 318 296
-244 296 462 227 337 171 450 403 294 399 236 498 365 340 360 370 573 493 291 391 382 242 454 416 459 462 341 502 649
-376 649 291 670 522 478 418 580 422 634 462 687 493 587 719 676 584 759 618 725 711 817 776 631 773 728 817 697
-504 697 835 823
-514H23
##PAGE=	F1=-3570.92
##FIRST=	4521.1594499999982872,	4521.1594499999982872,	0
##DATA TABLE=	(F2++(Y..Y)), PROFILE
4521C29K07n0QQ7j7j31M9M3j55J85j87PJ61j48jJ7rk9l1l8K56j19k80L26k52J57O9k65R7O8
4373C54r0K31l07Q0j8P0N1p7p0J24l06L64j42j7j38K51J4j78O7j36J14M8L1j08k5l1J89j43
4236B02q3R4j11K19q2P7k09J40k8N2k30L15n3j84L4M0k3M2J70l10J96j01j6Q2k4P2p0j24J27
4093B14Mj37K08r5m3p6J89j3j32K6p2J68L8r5j25M7jK54k98JJ46J2j31J18j65O6P0J36j76
3950A38J7m0N7q4L5mJ13l9j4j28K21j74K14o6j64Q2j39J47n6l2J34j06J23r7J45q1Pk0o2J0
3803A37M7p4kK40k46KJ55k34P9O6J85j45J24k57J00Q6k11J67n6P1p8k5mo1R6p0N5n3N3J8o6
3650I9Q3j76J89l0J7j26J82j15l9J80j76K29j96L7P3j80K05k08J91j44k1L1R5K4j16K1J55
3517B84j26o2J7J48r5Q8o7Q0j30K6L2j8lo9LlJ32k21J22k2K2o4O9p2J92Mq2k6j6Q8j62P7k8
$$ plain form
4521 329 536 486 494 581 564 433 482 525 370 555 368 375 536 388 387 404 395 366 335 297 553 434 154 480 228 385 454 189 286 354
4373 354 264 495 188 268 250 320 371 294 224 348 42 406 264 247 109 360 374 196 263 127 241 289 320 212 187 156 345 202
4236 202 119 213 102 321 239 316 107 247 219 271 41 356 303 119 153 193 170 212 382 72 268 167 151 233 209 281 211 87 214
4093 214 218 81 289 194 151 75 264 251 119 145 73 241 279 184 59 106 105 359 61 62 208 220 89 207 42 108 178 314 138
3950 138 155 115 172 88 123 119 232 193 179 51 272 98 312 246 82 164 25 172 116 84 218 112 235 138 283 202 209 189 127 137
3803 137 184 110 108 348 102 104 259 25 104 170 355 210 334 77 177 263 52 219 163 234 156 131 127 66 162 92 147 94 147 165 99
3650 99 182 6 195 165 182 56 238 123 84 264 88 317 121 158 231 51 256 48 239 95 74 105 200 224 108 129 284
3517 284 158 96 113 261 166 254 187 267 137 163 195 177 174 105 108 105 237 16 138 116 138 74 143 71 263 267 185 159 143 231 69 146 118
3355A18n7M4Q6j28J23j19Q2J0o2J97j22M3P1j03k7M9O9j23L6o8kJ50j55J1J27j52J85r9j22
3212F2J44m7l1J89l01N0N5K9kN4j62J87o1q8RJ09j02J41Mk20J74k2m0Mo9J30j71M4PK24J66
3059D66j3l65N2q5O3K0n2k4J7l1J3J20k9j7m4J27n7j43J37N4p7Ok9J05O8k08k0J13nJ6j52
2907B6J33n7N7M5m1m5J40k09N2l7K5j0k1K35l2l2p1o4OJ4R7k1q4Q6j52J12l8Q5j14J55j69
2754G1J20R4j56J8m0k0K2kJ70j30O8j32K0J1M7n8N4P9n7J27k19o6O8Q7j14j6J7P7r2K7J3J9
2597A07J08M5j40N9q2K8p8R7J08j75k2J11m5J16j68Q5j05l1J63q0J10p2M5k6q4J19j25oRM5
2449A16J74k79L6LN5P6k9p9J27O3jk44J97ll6J15j16Mo3Q0J1j67J73n1j2n6J90j51mQ0j22
2296H7M3J14J04k10L4n7K6k3K3l4L3Mj35K34j25l4P2j06K18j82Q2l0J25j66p3P7qO2o6J0q7
$$ plain form
3355 118 61 105 191 63 186 67 149 159 97 294 172 215 286 183 156 205 274 151 187 119 117 267 112 123 250 98 283 184 62
3212 62 206 159 128 317 16 66 121 150 148 202 40 227 166 78 87 196 94 235 239 19 193 171 131 135 66 196 25 69 76 300 466
3059 466 453 88 140 55 118 138 86 62 79 48 61 181 152 135 91 218 161 18 155 209 132 138 109 214 282 74 54 167 162 178 26
2907 26 159 102 159 204 163 118 258 49 101 64 89 79 58 293 261 229 158 94 100 114 211 190 106 192 40 152 114 199 85 240 71
2754 71 191 285 129 147 107 87 109 107 277 147 215 83 103 114 161 103 157 236 179 306 87 21 89 176 62 46 63 140 48 75 88 107
2597 107 215 260 120 179 97 125 47 144 252 77 55 166 121 237 69 154 49 18 181 101 211 139 184 158 74 193 68 62 71 116
2449 116 290 11 47 50 105 181 152 73 200 263 262 18 215 212 176 291 175 179 116 196 207 40 213 162 150 94 284 133 129 209 87
2296 87 130 244 348 138 172 115 141 118 141 107 140 144 9 243 118 84 156 50 268 86 168 138 263 97 24 101 93 155 89 99 12
2144A2J03o0N6O9o9Q8j12K14j91P9j29J30r2O8J7O8Nj34Q3j27m4J60p6J53j04J39j53rn6K55
1996C43j78J12k57N7L2j03J28p2J25n5m0p4J53j51J50n9J00l7q1J08n5J02p9j3q1O5nN4n5
1853A34K3r3R7k0J5J92j46nK0j70J26P8l9j28R2p7l4n0K76j56J11j71J93l7J4J63k89J50k27
1711D2Q4k0J45j48K04O19Q70M569K5360k2169L3608K212l9785K9057k5648o209j465j027K87
1617E86m36J63k2j49L7M5J97l19lM1J04k18K76j02o3n1N5j6Q8O17L605j930L188J511j170
1494F034l320K101l311r90l43J00k27K0J76j65N1JR2m3M6j78O2l7N1L3l3J00l0j31J88l3j5
1361A99m5ro4N3n7M7J02j06K4m5J4O3L1j09J28j79J13J1O7q6P5K5j31k6N3p3j1O5M1k6P2R0
1204C06j30k1l2J55j73J39j18P2j27OL9J10q7r1K70k51R0p7l9N2O7R5j57l4J37l8j13PK03
$$ plain form
2144 12 115 55 111 180 111 199 87 301 110 189 60 190 98 166 183 251 256 122 205 78 34 194 118 271 167 306 153 144 88 343
1996 343 165 277 20 77 109 6 134 62 187 132 92 18 171 20 170 111 211 174 93 201 146 248 169 156 75 140 135 189 134
1853 134 157 64 161 141 156 348 202 197 217 47 173 251 212 84 176 99 65 15 291 135 246 75 268 231 245 408 119 269 42
1711 42 126 106 251 103 307 926 1796 6365 31725 9556 43164 45376 5591 34648 9000 2791 1326 299 586
1617 586 150 313 291 142 179 224 421 102 99 140 244 26 302 200 137 86 141 125 213 830 4435 2505 5693 7204 6034
1494 6034 2714 4815 1504 514 171 271 44 64 240 75 126 127 219 176 222 44 106 69 120 153 120 220 190 59 247 214 199
1361 199 154 145 81 134 77 124 226 120 144 99 113 176 207 98 226 47 160 171 238 152 227 252 121 95 148 75 64 129 170 144 216 306
1204 306 176 155 123 278 105 244 126 198 71 77 116 226 139 48 318 67 157 80 41 93 160 255 98 64 201 163 50 57 260
1061B60j38J2J21r6o1P5r8R9lQ6j89R7l9o9N1O5q1k9J74j21o0%OO6J03j31P1L6Q0m5r1K3m0
898A34J56o5K5p2K2J87k80L8l7O8M2j87Q2P0o9j08K57k1j88K49j92m2Q3P2p2k8pr8J81j36
751F4J96p2j44N8K46k50OK77k18P5Q4k47J49J3j74J32M3J233k9j077j18n3L19k15m0r0K61
618D29k32R2l5K2j9J27J74LJ10J16J47J09L68J22K78O42J178L86K08J1203K2979M3557P07
505H2671O1578r3281o806l0727o392k322j360q69o23n51k61l52K83q51M72l55J90k09Q6j4
406C07J40j30J88j57K3j69K49j13Mj73J79k47K2n1O4l0K25P8l10K15k42K73j39j4j4P2m9n8
268A43O7Ol5J2j73K89n9n8J29j94k4L2J70p9j66O2N9j48K70k78L65l33O4K34k30R7Or4l6J40
121B38j90J74p5L6j49J05J44j08l4k6J96j56L1j34J34k1j21K09j17J66Rk36O1J97j57J40k52
$$ plain form
1061 260 122 134 255 159 98 173 75 174 171 257 68 165 126 57 108 173 92 63 237 116 56 56 62 128 231 100 171 207 287 242 151 174 134
898 134 290 225 250 178 200 387 107 145 108 176 218 31 113 183 114 6 263 242 54 303 111 69 152 224 152 124 117 19 200 64
751 64 260 188 44 102 348 98 104 381 163 238 322 75 224 237 63 195 238 1471 1442 365 247 194 513 298 258 168 429
618 429 197 289 254 276 257 384 558 561 671 787 934 1043 1411 1533 1811 2453 3631 4017 4225 15428 38407 81964 82671
505 82671 144249 50968 44162 13435 7043 4721 3361 2492 1869 1318 1057 705 988 137 609 254 444 235 321 307
406 307 447 317 505 348 371 202 451 338 342 169 348 101 123 72 136 106 331 409 99 314 72 345 206 192 178 250 201 143
268 143 210 216 181 193 20 309 250 192 321 127 103 135 305 226 60 122 181 33 303 25 390 57 121 355 125 222 228 134 98 238
121 238 48 222 147 183 34 139 283 175 141 115 311 155 186 52 186 165 44 253 136 302 311 75 136 333 176 316 64
-12F4P7j5O4q2m8R5j0j4J05N7m6J33k76o9K18k17M14l18J2k2L1pm6L5n9K78o4j46J7o6R4Q
-170A97j73L55j82j40J11Q5m1k6j27M80l97J36m5Qo2J11j65N6j02K52n0n0Qj32K56q5q5j9
-308A74N2K40j42j76J18k8j54J98K8J2j9j87K60O1l30L87k03J9j19K27j77J60l4Q1j88J13
-435C73J27o5j24J74j60J27k5Q8j3j69J48m2J02j44J44j9
$$ plain form
-12 64 141 126 190 108 60 155 145 131 236 293 247 380 104 35 253 36 450 132 144 122 153 146 100 135 76 354 290 144 161 95 189 197
-170 197 24 379 197 57 168 253 212 186 59 539 142 278 233 241 179 290 125 181 79 331 281 231 239 107 363 278 193 174
-308 174 226 466 324 148 266 238 84 282 310 322 303 116 376 437 107 494 291 310 191 418 241 401 367 448 260 373
-435 373 500 435 311 485 325 452 427 515 502 333 481 439 541 397 541 522
-514E22
##PAGE=	F1=-3580.77
##FIRST=	4521.1594499999982872,	4521.1594499999982872,	0
##DATA TABLE=	(F2++(Y..Y)), PROFILE
4521D8K45m5O0K4l3j18J36l3p6J36j86RJ98j35q9R7rr2M0M2J70j40kN4k00J02J29l07J10L3
4373A68J16L5j41o9l4J85p3l7l3Q7p0J87k08K5M0P9rj43Q5j59J66m5O6o3j07M8R6o1k1j0K8
4221A28J25k7k8J9r9j1N3NJ23r4n4n3L9p1R7J40j82J36k26N9R0J5P8j23n0Q1p5KJ82j66M3
4068A56j27J71O1j54k1l1R6O0j28o2K8O8K10k50n5J36m7q2J43k1j14J00R5j29L9p1O7j25O1
3926G4QQ1l2pn5J15l4J18p8q1qp0R1n8j9J24JJ1p0J42l8o3K6q2j3J47j77K8J85j17r3J51j59
3763D8J02l0J90o1k3j38K2R5o5N8p5Q1n6p1J9J5M8q3n8Q2O2m8n8R6p1N7L3k5j02K08j66P4
3606A60O9q1J97k58N7O9j59J44j22J13j27Q3m7Q4K7j46N9J61j31p5Q6J8NN7k8j1m8j8MJ2l3
3453A21r4Q5J3R7j75N1k2P2p9J2m8K03M0j21qJ1L9j06K0Mn5O4K4r5R8n9O6m1q5K51o8O1j5
$$ plain form
4521 48 293 248 308 332 299 181 317 284 208 344 158 167 365 230 141 238 229 137 177 219 389 249 247 301 101 203 332 25 135 168
4373 168 284 319 178 109 75 260 187 150 117 204 134 321 113 138 178 257 248 105 190 31 197 152 218 155 48 96 192 131 110 100 128
4221 128 253 226 198 217 118 107 160 165 288 194 140 87 126 55 152 292 110 246 20 79 169 184 262 139 89 170 95 97 279 113 156
4068 156 29 200 261 107 86 55 151 211 83 21 49 117 327 77 22 158 111 29 172 151 37 137 232 103 142 71 138 13 74
3926 74 82 163 131 124 69 184 150 268 190 109 101 31 122 64 45 169 170 181 111 253 215 152 178 96 83 230 53 81 266 149 56 207 48
3763 48 150 120 310 249 226 88 110 205 140 198 123 204 148 77 96 111 159 76 18 100 162 114 56 152 81 138 171 146 44 252 86 160
3606 160 229 148 345 87 144 213 54 198 76 189 62 145 98 182 209 63 122 283 152 77 163 181 186 243 215 204 156 138 142 154 121
3453 121 27 112 125 222 47 98 76 148 69 81 33 236 276 155 147 158 197 91 111 115 60 124 148 53 151 92 158 117 32 283 215 276 261
3291B61j31Q9l9M5o1Jk7J5M6o4J4O6j45K12j49n9J26m4K4R5k31lJ11l9J02m3j05J39l3q0k
3138I1P5o8J71p8j32J28p9jnk8P0q9J0M8J63N7J9k45J1r7O1Ol0j4nj7%J41n9L8r4J74p4r1
2971E7J01O3j26R1jJ2N9j59p4Q7Pj8m9J07m0L3qJK3J18k71J15r7O1q0L4J76J3q8M1l2r1M8
2808A13L6L8r9O6j11P9k6P6p4J09j62J56M8l2j44M1j2m5L6J20j27R9q2k0K8J3n6J61PK1P4
2656C31k66l0K1J16j30opN8Jn2K1N9N6O3j59P4j6o2m2Q5O2p2m7J10o4J46j72N2k9n6Q7q8J23
2493A67m5Q1o6p8J48r7o1oN8J47k19L2l3R8J6n2m9J31N1qj56J48N1j02Q8o0m5o8J30J1j80
2341C2J63k3l0k1J34q5l4K4r3M0J60Q9j53j9l5j5nj2qN3l7q1J98j05l6J1q1K01j47M8J2N2
2183A97j05k4nL7L5k1n6KM6p7M1J01l8N2o8J79j55K1r9P0n2J06J7P7r8o8L1j23O4J02q2J58
$$ plain form
3291 261 130 219 180 225 164 165 138 153 199 135 149 215 70 282 133 74 200 156 180 275 44 41 152 113 215 172 67 206 173 93 91
3138 91 166 98 269 191 59 187 108 107 102 74 144 55 65 113 276 333 352 107 118 21 82 88 58 44 39 22 22 163 104 142 48 222 148 57
2971 57 158 221 95 186 185 197 256 97 23 110 117 99 50 157 117 150 142 143 166 284 13 128 31 92 12 46 222 235 147 188 156 65 113
2808 113 149 187 88 154 43 122 96 172 98 207 45 201 249 217 73 114 102 57 93 213 86 185 103 83 111 124 68 229 236 257 331
2656 331 65 35 56 172 42 36 29 87 88 36 57 116 172 235 76 150 134 72 30 115 177 105 58 168 104 250 78 130 101 45 132 44 167
2493 167 122 203 137 59 207 110 49 43 101 248 29 61 28 126 142 90 41 172 223 215 59 207 258 156 244 184 139 71 201 212 32
2341 32 195 172 142 121 255 170 136 160 67 107 267 356 203 184 149 134 129 117 109 162 125 44 242 137 101 112 31 232 85 133 145 197
2183 197 92 68 63 100 135 114 58 60 106 29 70 171 133 185 117 296 141 162 63 133 81 187 204 281 183 115 146 23 87 189 107 265
2026B65m7N5j27n5M5J93j19L9k05QJ4m1R5o0J43r7k8m8R4p8J04p9J20l9o3J37j46J41m7k3
1878A51o1L6J7N9q3L2o8P0k1P3J08o7p5J7j22J43J8m0j12Q5q0k0J0J51j01N8j60J29L0M7l4
1725A90j27N8r6J18N0L1j55R4L72L73K507J2929j1743J7866J158k1515J5900j3136l197q49
1627H28p24L38l70J64K7j42RL1J04k40LR2R9j17K04j28l5l9L6o3L9L06J445r73J984m18P63
1494C223k258J191j408m89j97R4j00L1J12j87R1P9K2l0N2j71M1l6N9L1j6J51j11j50J92Nn8
1361A63n4j6k8N9n0LJ05K4q1p4J18k9P7r2R7j48L6M3Q7j84J56nq1j7rn3M1L1Oj8Q0P8r8P6
1194B43j09J39r0j3n1N8j64R3L3P9n4o2K00k17N6j1p9Q0K4R0k13O5R7n4j02O6J13o4M2L9j10
1041A24J6pLON8rj16Q0j6p1N4N2j18OJ48j20j4k5m7J36k8L9RrR2m0j7LpN4m5J6nJ5P7k25M8
$$ plain form
2026 265 218 273 146 91 136 329 210 249 44 52 66 25 120 60 203 106 78 30 124 46 150 71 191 152 89 226 80 221 174 151
1878 151 90 126 143 202 119 151 83 153 132 205 313 246 171 188 66 209 227 187 75 160 80 60 70 221 120 178 18 147 177 224 190
1725 190 63 121 25 143 193 224 69 163 535 908 3415 16344 4601 22467 23625 2110 18010 4874 1677 828
1627 828 104 442 72 236 263 121 130 161 265 25 28 120 219 102 306 178 143 104 140 77 116 422 1867 894 2878 2460 3223
1494 3223 965 2156 748 259 62 156 56 87 199 12 103 182 204 174 226 55 96 60 119 150 134 285 174 24 216 221 163
1361 163 109 93 65 124 74 77 182 206 125 51 169 140 217 125 222 74 110 153 240 56 212 207 126 109 100 47 88 119 125 107 187 265 167 243
1194 243 134 273 183 170 119 177 13 106 139 218 164 102 302 85 141 130 51 131 155 245 32 97 194 140 38 104 217 153 195 234 124
1041 124 140 133 136 142 200 191 75 155 139 68 122 174 56 62 210 90 76 51 4 140 112 151 160 151 243 203 186 189 182 236 191 207 202 217 294 69 117
859A17O8k9j9j00N8M3o4o0J56J5j60K07j50K9m0Q7o0L1n3m0J32r1J46j06q3%K20o1j48K70
711C15j11k9J28j84R9lj08L1lR32R5q87j34o3K90j67j11P4J06j85J34m7k7m0R4Q8pJ32q5J78
564E05l2L97p3J66J84M58K83P47N183P277L8517j3142L1422m5723m612j4871l004r41q60k97
465A584n29j79n30R4J65m62K54k80K66k85J23K4M1j38K33k82J78j69J51K6q8j17J99j41n2
342H6m9Q5m5J53P8r0l7j32K35j67mJ7O5m1J3J9m9K0n0NJ65j00p8O3n7q7Q9R1K4j76N3M4q9
180E4J85j67K26j66KJ84j82M5L9j17j0P0j32K11j26J1q9Q5J03j24k9Q5P3j33K3p9J00Mp7J22
32A91r2J43L5k32R4J24j78J84j58o1N5K3q6ooJ01K0j6J93j68J56k17n0J24p6K18j66k5o8P
-116F3O2o5k9N1J78p3j17J6rN5n2l3K76k44n0Q8R1n9l3l5M05l32K2o2J11j63Q7r9J7J7J58
$$ plain form
859 117 185 156 137 37 95 138 74 14 170 185 25 232 82 111 71 158 98 129 76 36 168 77 223 117 34 34 254 193 45 315
711 315 204 175 303 119 218 215 107 138 135 1067 1162 275 141 78 368 201 90 164 270 85 219 172 145 105 199 287 280 412 327 505
564 505 473 870 797 963 1147 1605 1888 2635 7818 15095 53612 40470 71892 26169 21557 6686 3682 2741 1881 1584
465 1584 1055 876 346 440 605 143 397 117 383 98 221 245 286 148 381 99 277 108 259 285 197 80 279 138 86
342 86 37 122 77 230 308 218 181 49 284 117 113 130 195 154 167 186 137 157 107 112 277 177 99 162 105 18 107 198 222 46 99 143 54
180 54 239 72 298 132 134 318 136 181 220 103 93 163 31 242 116 127 38 123 226 102 73 158 231 98 121 42 142 146 69 191
32 191 99 242 277 45 139 263 85 269 111 50 105 128 42 36 30 131 151 135 328 160 316 99 49 173 97 315 149 124 56 63
-116 63 125 60 31 82 260 187 70 86 77 132 80 47 323 79 29 117 208 149 116 81 486 154 176 114 225 62 149 50 67 84 242
-268B42n5qn9J6J04Rj67oL5K70k02q1P5n7p2R4J18m5qj42K17k3j46K09j56L6j61K66j66R5
-416B32J28j01j21Q6Q7k3k04J78j04J18o7O2K5j44J10j2P0j33J44m3
$$ plain form
-268 242 187 179 120 136 240 249 82 76 111 381 179 98 173 116 44 138 256 211 203 61 278 255 109 318 162 198 37 303 137 232
-416 232 360 259 138 224 311 288 84 262 158 276 209 271 296 152 262 250 320 187 331 288
-514B88
##PAGE=	F1=-3590.61
##FIRST=	4521.1594499999982872,	4521.1594499999982872,	0
##DATA TABLE=	(F2++(Y..Y)), PROFILE
4521A57l0J1J21n2j10J3J72j52Q4j7n1K6Q4j11r7Q9P1r6Q1M6M6j38K08j86j05P8J08j21j5
$$ plain form
4521 157 127 138 259 207 97 110 282 130 214 197 146 172 256 145 48 137 208 112 193 239 285 147 355 169 64 142 250 129 114
$$ [...]
-514A16
##END NTUPLES=	nD NMR SPECTRUM
##END=	
##END=	
