##TITLE=	yleQAzhUTNuix6mKJP3qLw.21.ser
TM-VI-146repeat solid dmso d6 cosy

##JCAMP-DX=	6.0	$$ MestReNova 14.3.0-30573
##DATA TYPE=	LINK
##BLOCK_ID=	1
##BLOCKS=	2    
##ORIGIN=	Mestrelab Research S.L.
##OWNER=	hrzepa
##$MNOVA/LINK_BLOCK_TYPE=	ITEM	$$ NMR Spectrum
##$MNOVA/ITEM/POLYGON=	(XY..XY)
5321,5835
8722,5835
8722,8208
5321,8208
5321,5835
##$MNOVA/ITEM/Z=	0
##$MNOVA/ITEM/ANGLE=	0
##TITLE=	yleQAzhUTNuix6mKJP3qLw.21.ser
##JCAMP-DX=	6.0	$$ MestReNova 14.3.0-30573
##BLOCK_ID=	2
##DATA TYPE=	MNOVA NMR VIEW DATA
##DATA CLASS=	MNOVA VIEW DATA
##$MNOVA/2D/THRESHOLD=	25.479600906372070313
##$MNOVA/ITEM/ZOOM/X=	-1.2849598716208046056,	11.297249999948046906
##$MNOVA/ITEM/ZOOM/Y=	-1.2849598716208046056,	11.297249999948046906
##END=	
##TITLE=	yleQAzhUTNuix6mKJP3qLw.21.ser
##JCAMP-DX=	6.0	$$ MestReNova 14.3.0-30573
##BLOCK_ID=	3
##DATA TYPE=	nD NMR SPECTRUM
##DATA CLASS=	NTUPLES
##NUMDIM=	2
##ORIGIN=	Bruker BioSpin GmbH
##OWNER=	nmr
##.OBSERVE FREQUENCY=	400.20200099999999566
##.OBSERVE NUCLEUS=	^1H
##.SOLVENT NAME=	DMSO_weak
##.PULSE SEQUENCE=	cosygpqf
##LONGDATE=	2021/11/04 15:56:56.000
##.ACQUISITIONMODE=	SIMULTANEOUS (DQD)
##$ORIGINAL FORMAT=	Bruker XWIN-NMR
##$MNOVA/SCALES_VERSION=	9
##$PARAMETER FILE=	(acqu2s, ASCII, /private/var/folders/f6/rjf_tdyn2v98c5c0wvkgn4s80000gn/T/yleQAzhUTNuix6mKJP3qLw/21/acqu2s, 0)
$$ ##TITLE= Parameter file, TOPSPIN		Version 3.2
$$ ##JCAMPDX= 5.0
$$ ##DATATYPE= Parameter Values
$$ ##NPOINTS= 221	$$ modification sequence number
$$ ##ORIGIN= Bruker BioSpin GmbH
$$ ##OWNER= nmr
$$ $$ 2021-11-04 16:05:55.256 +0000  nmr@CZC2439F63
$$ $$ /opt/topspin/data/agmb/nmr/Nov04-2021/21/acqu2s
$$ $$ process /opt/topspin3.2/prog/mod/go
$$ ##$ACQT0= 0
$$ ##$BF1= 400.2
$$ ##$FnMODE= 1
$$ ##$NUC1= <1H>
$$ ##$NusJSP= 0
$$ ##$NusT2= 1
$$ ##$NusTD= 220
$$ ##$O1= 2001.00000000702
$$ ##$SFO1= 400.202001
$$ ##$SW= 12.5944462247833
$$ ##$SW_h= 5040.32258064516
$$ ##$TD= 220
$$ ##END=
$$ 
##$PARAMETER FILE=	(acqus, ASCII, /private/var/folders/f6/rjf_tdyn2v98c5c0wvkgn4s80000gn/T/yleQAzhUTNuix6mKJP3qLw/21/acqus, 0)
$$ ##TITLE= Parameter file, TOPSPIN		Version 3.2
$$ ##JCAMPDX= 5.0
$$ ##DATATYPE= Parameter Values
$$ ##NPOINTS= 12	$$ modification sequence number
$$ ##ORIGIN= Bruker BioSpin GmbH
$$ ##OWNER= nmr
$$ $$ 2021-11-04 16:05:58.614 +0000  nmr@CZC2439F63
$$ $$ /opt/topspin/data/agmb/nmr/Nov04-2021/21/acqus
$$ $$ process /opt/topspin3.2/prog/mod/shimcntl
$$ ##$ACQT0= 1000000
$$ ##$AMP= (0..31)
$$ 100 100 100 100 100 100 100 100 100 100 100 100 100 100 100 100 100 100
$$ 100 100 100 100 100 100 100 100 100 100 100 100 100 100
$$ ##$AMPCOIL= (0..19)
$$ 0 0 0 0 0 0 0 0 0 0 0 0 0 0 0 0 0 0 0 0
$$ ##$ANAVPT= -1
$$ ##$AQSEQ= 0
$$ ##$AQ_mod= 3
$$ ##$AUNM= <au_zg>
$$ ##$AUTOPOS= <52 >
$$ ##$BF1= 400.2
$$ ##$BF2= 400.2
$$ ##$BF3= 400.2
$$ ##$BF4= 400.2
$$ ##$BF5= 400.2
$$ ##$BF6= 400.2
$$ ##$BF7= 400.2
$$ ##$BF8= 400.2
$$ ##$BYTORDA= 0
$$ ##$CAGPARS= (0..11)
$$ 0 0 0 0 0 0 0 0 0 0 0 0
$$ ##$CFDGTYP= 0
$$ ##$CFRGTYP= 9
$$ ##$CHEMSTR= <none>
$$ [...]
$$ 0 0 0 0
$$ ##$ShimPowMaxUC= (0..63)
$$ 130000 130000 130000 130000 130000 130000 130000 130000 130000 130000 130000
$$ 130000 130000 130000 130000 130000 130000 130000 130000 130000 0 0 0 0
$$ 0 0 0 0 0 0 0 0 0 0 0 0 0 0 0 0 0 0 0 0 0 0 0 0 0 0 0 0 0 0 0 0 0 0 0 0
$$ 0 0 0 0
$$ ##$ShimPowMaxUG= (0..63)
$$ 524287 524287 524287 524287 524287 524287 524287 524287 524287 524287 524287
$$ 524287 524287 524287 524287 524287 524287 524287 524287 524287 0 0 0 0
$$ 0 0 0 0 0 0 0 0 0 0 0 0 0 0 0 0 0 0 0 0 0 0 0 0 0 0 0 0 0 0 0 0 0 0 0 0
$$ 0 0 0 0
$$ ##$ShimPowRcbType= 3
$$ ##$ShimPowRes= (0..63)
$$ 1e-20 1e-20 1e-20 1e-20 1e-20 1e-20 1e-20 1e-20 1e-20 1e-20 1e-20 1e-20
$$ 1e-20 1e-20 1e-20 1e-20 1e-20 1e-20 1e-20 1e-20 0 0 0 0 0 0 0 0 0 0 0 0
$$ 0 0 0 0 0 0 0 0 0 0 0 0 0 0 0 0 0 0 0 0 0 0 0 0 0 0 0 0 0 0 0 0
$$ ##$ShimPowRng0= (0..63)
$$ 1 1 1 1 1 1 1 1 1 1 1 1 1 1 1 1 1 1 1 1 0 0 0 0 0 0 0 0 0 0 0 0 0 0 0 0
$$ 0 0 0 0 0 0 0 0 0 0 0 0 0 0 0 0 0 0 0 0 0 0 0 0 0 0 0 0
$$ ##$ShimPowRng1= (0..63)
$$ 1 1 1 1 1 1 1 1 1 1 1 1 1 1 1 1 1 1 1 1 0 0 0 0 0 0 0 0 0 0 0 0 0 0 0 0
$$ 0 0 0 0 0 0 0 0 0 0 0 0 0 0 0 0 0 0 0 0 0 0 0 0 0 0 0 0
$$ ##$ShimPowRng2= (0..63)
$$ 1 1 1 1 1 1 1 1 1 1 1 1 1 1 1 1 1 1 1 1 0 0 0 0 0 0 0 0 0 0 0 0 0 0 0 0
$$ 0 0 0 0 0 0 0 0 0 0 0 0 0 0 0 0 0 0 0 0 0 0 0 0 0 0 0 0
$$ ##$ShimPowRng3= (0..63)
$$ 1 1 1 1 1 1 1 1 1 1 1 1 1 1 1 1 1 1 1 1 0 0 0 0 0 0 0 0 0 0 0 0 0 0 0 0
$$ 0 0 0 0 0 0 0 0 0 0 0 0 0 0 0 0 0 0 0 0 0 0 0 0 0 0 0 0
$$ ##$ShimSysFunc= (0..63)
$$ 1 2 3 4 5 7 9 11 15 16 8 10 12 14 6 17 13 18 19 20 0 0 0 0 0 0 0 0 0 0
$$ 0 0 0 0 0 0 0 0 0 0 0 0 0 0 0 0 0 0 0 0 0 0 0 0 0 0 0 0 0 0 0 0 0 0
$$ ##$ShimSysMatrix= 0
$$ ##$ShimSysType= 1
$$ ##$TFXNUM= 0
$$ ##$TRIPLO2= 0
$$ ##$VTU= 2
$$ ##$VTUETH= <149.236.99.20>
$$ ##$VTUTY= <no>
$$ ##$WBREFAM= (0..15)
$$ 135.5 97.7 100 100 100 100 100 100 100 100 100 100 100 100 100 100
$$ ##$WBREFLM= (0..15)
$$ 0 0 0 0 0 0 0 0 0 0 0 0 0 0 0 0
$$ ##$WBREFPH= (0..15)
$$ 72.26 -67.22 0 0 0 0 0 0 0 0 0 0 0 0 0 0
$$ ##$WBSGU= (0..15)
$$ 0 0 0 0 0 0 0 0 0 0 0 0 0 0 0 0
$$ ##$XFAC= 2
$$ ##END=
$$ 
##$DECIM=	3968
##$DSPFVS=	20
##.ACQUISITIONSCHEME=	NOT PHASESENSITIVE
##NTUPLES=	nD NMR SPECTRUM
##VAR_NAME=	FREQUENCY1,	FREQUENCY2,	SPECTRUM
##SYMBOL=	F1,	F2,	Y
##.NUCLEUS=	1H,	1H
##.OBSERVE FREQUENCY=	400.20200099999999566,	400.20200099999999566
##VAR_TYPE=	INDEPENDENT,	INDEPENDENT,	DEPENDENT
##VAR_FORM=	AFFN,	AFFN,	ASDF
##VAR_DIM=	1024,	1024,	1048576
##UNITS=	HZ,	HZ,	ARBITRARY UNITS
##FIRST=	4521.1594499999982872,	4521.1594499999982872,	0.12169782817363739014
##LAST=	-514.24094062501069402,	-514.24094062501069402,	0.12584987282752990723
##MIN=	-514.24094062501069402,	-514.24094062501069402,	7.7239114034455269575e-05
##MAX=	4521.1594499999982872,	4521.1594499999982872,	3134.663818359375
##FACTOR=	1,	1,	0.0015042462184609237119
##PAGE=	F1=4521.16
##FIRST=	4521.1594499999982872,	4521.1594499999982872,	0.12169782817363739014
##DATA TABLE=	(F2++(Y..Y)), PROFILE
$$ [...]
##PAGE=	F1=-1464.22
##FIRST=	4521.1594499999982872,	4521.1594499999982872,	0
##DATA TABLE=	(F2++(Y..Y)), PROFILE
$$ plain form
155 28 130 128 214 133 85 151 91 37 123 237 68 111 34 234 170 214 177 121 50 81 230 266 131 94 95 37 67 42 133 266 284 341 208
-7 208 197 141 39 124 94 94 27 191 220 88 136 33 152 158 108 194 172 153 105 147 255 106 171 72 145 228 57 80 66 105 55 55 118
-170 118 10 21 213 204 63 117 144 30 149 64 97 134 133 106 119 192 48 104 180 156 132 19 74 75 32 112 145 174 182 14 149 79
-327 79 48 228 131 184 73 79 114 45 84 92 144 69 148 116 82 131 176 19 109 152 229 285 127 159 233 266 169 33 72 199 242 81 108
-490 108 209 65 149 119 148
$$ packed form
155B8J02kQ6q1m8O6o0n4Q6J14j69M3p7K00o4M4l7n6p1L1J49L6j35l7Jn8L0k5R1J33J8N7j33
-7B08j1n6j02Q5l0%o7J64K9j32M8j03J19On0Q6k2j9m8M2J08j49O5r9P3Q3j71K3j4L9n0%O3
-170A18j08J1J92rj41N4K7j14J19q5L3L7jk7J3P3j44N6P6k4k4j13N5Jm3Q0L3K9Qj68J35p0
-327G9l1J80r7N3j11OL5o9L9QN2p5P9l2l4M9M5j57R0M3P7N6j58L2P4L3r7j36L9J27M3j61K7
-490A08J01j44Q4l0K9
-514A48
##PAGE=	F1=-1474.07
##FIRST=	4521.1594499999982872,	4521.1594499999982872,	0
##DATA TABLE=	(F2++(Y..Y)), PROFILE
$$ plain form
4521 262 127 169 144 177 73 177 100 42 81 96 267 219 233 152 199 132 212 26 156 115 53 19 219 200 345 181 91 209 122 157
4373 157 289 228 33 234 108 101 148 130 167 182 167 174 57 110 27 49 201 147 164 181 169 152 190 239 174 97 127 120 157 88 94 170 56
4211 56 163 201 322 51 228 95 172 68 118 98 154 204 282 155 272 142 59 192 218 362 135 125 20 228 134 165 207 192
4073 192 48 147 121 52 3 300 201 32 146 122 106 246 150 121 179 105 7 220 132 199 176 183 201 132 187 195 289 297 254 131 186 227 155
3911 155 245 93 172 108 50 135 117 88 25 92 143 162 126 70 192 121 124 123 55 123 205 176 79 38 137 63 162 274 167 137 76 176 227
3748 227 331 130 48 128 130 162 171 41 197 223 319 70 149 182 19 57 92 114 168 263 170 216 200 52 62 15 157 99 203 112 79
3596 79 200 195 369 121 67 46 119 176 141 79 154 124 192 40 164 210 184 134 68 167 131 57 27 159 114 131 116 146 213 70 29 36 144
3433 144 184 95 123 62 175 198 64 51 61 133 93 49 34 43 128 43 77 156 90 16 65 196 73 76 194 94 83 107 61 50 66 18 58
$$ packed form
4521B62j35M2k5L3j04J04p7n8L9J5J71m8J4q1M7o7Q0j86J30m1o2l4K00j9J45j64r0J18q7L5
4373A57J32o1j95K01j26pM7j8L7J5j5Pj17N3q3K2J52n4J7J7j2j7L8M9o5p7L0pL7o9OP6j14
4211E6J07L8J21k71J77j33P7j04N0k0N6N0P8j27J17j30q3J33K6J44k27j0j05K08r4L1M2j5
4073A92j44R9k6o9m9K97r9j69J14k4j6J40r6k9N8p4r8K13q8O7k3PJ8o9N5QR4Qm3j23N5M1p2
3911A55R0j52P9o4n8Q5j8k9o3O7N1J9l6n6J22p1Ljo8O8Q2k9r7m1R9p4R9J12j07l0o1J00N1
3748B27J04k01q2Q0KL2Rj30J56K6R6k49P9L3j63L8L5K2N4R5r3M6j6j48J0m7J42n8J04r1l3
3596G9J21nJ74k48n4k1P3N7l5o2P5l0O8j52J24M6k6n0o6R9l6p4l0J32m5J7j5L0O7j43m1PJ08
3433A44M0q9K8o1J13K3j34j3J0P2m0m4j5RQ5q5L4P9o6p4M9J31j23LJ18j00j1K4m6j1J6m8M0
$$ plain form
3271 58 53 78 211 188 32 29 92 115 73 249 200 136 24 149 152 119 124 140 167 111 93 115 26 173 55 40 179 38 17 96 166 67 81
3108 81 60 243 107 10 111 87 127 26 292 268 54 67 27 125 17 122 18 75 94 47 139 119 158 70 89 103 91 177 56 56 89
2956 89 64 112 51 242 190 237 289 127 155 139 62 56 149 165 88 134 146 226 221 225 617 806 514 456 133 60 65 89 46 68 26 179 159 103
2789 103 29 168 183 149 59 289 155 173 127 90 85 58 122 53 340 231 235 127 338 221 276 122 195 255 57 63 139 72 71 74 53 130
2631 130 250 55 113 78 111 89 63 27 118 64 129 146 126 107 127 286 197 183 113 102 207 85 42 248 259 39 85 157 185 63 34
2478 34 121 112 28 111 17 284 236 139 127 160 186 119 25 205 128 97 266 133 72 161 69 217 142 206 196 58 57 234 148 125 90 94 106
2316 106 64 65 71 61 34 166 173 112 89 149 63 198 133 229 112 43 185 58 64 133 61 53 70 86 23 141 120 74 119 193 38 115 106 105 121
2144 121 64 100 103 101 169 125 88 214 178 75 124 214 177 97 217 169 115 198 217 91 134 54 177 173 52 100 227 184 156 38 130 290
$$ packed form
3271E8nK5J33k3j56lO3K3m2J76m9o4j12J25Ll3NJ6K7n6j8K2q9J47j18j5J39j41k1P9P0r9J4
3108H1k1J83j36r7J01k4M0j01K66k4k14J3m0R8j08J05j04N7J9m7R2k0L9q8J9J4j2Q6j21%L3
2956H9k5M8o1J91n2M7N2j62K8j6p7oR3J6p7M6J2Q0nML92J89k92n8l23p3NK4m3K2m2J53k0n6
2789A03p4J39J5l4r0K30j34J8m6l7nk7O4o9K87j09Mj08K11j17N5j54P3O0j98OP6o7jLk1P7
2631A30J20j95N8l5L3k2k6l6R1n4O5J7k0j9K0J59q9j4p0j1J05j22m3K06J1k20M6P2K8j22k9
2478C4Q7rq4Q3r4K67m8r7j2L3K6o7r4J80p7l1J69j33o1Q9r2J48p5O4j0j38jJ77q6k3l5MJ2
2316A06m2JOj0k7J32Po1k3O0q6J35o5R6j17o9J42j27OO9p2qJ7J6o3J18k1m6M5P4j55P7rjJ6
2144A21n7L6LkO8m4l7J26l6j03M9R0l7q0J20m8n4Q3J9j26M3q0J23mj21M8J27m3k8j18R2J60
$$ plain form
1986 290 218 80 131 176 67 158 144 767 2480 1772 257 272 209 292 13 127 156 145 218 33 218 256 49 97 144 261 133
1853 133 143 127 240 131 96 137 75 93 13 52 73 158 170 153 149 164 36 187 143 144 87 85 103 107 66 69 163 135 307 237 225 46 287 177
1686 177 209 61 295 100 298 182 191 101 41 153 515 1135 1357 1884 1911 1472 994 788 435 234 166 102 203 194 270 184 976
1553 976 4321 2483 615 1044 837 891 862 720 636 631 402 679 1531 6579 111354 124351 14562 3661 2267 1693
1455 1693 1085 914 1236 967 733 474 834 290 414 327 229 212 95 11 376 383 268 220 201 631 519 5925 6367 986 356
1332 356 132 212 68 238 86 182 161 301 82 150 84 165 225 206 203 72 70 182 150 115 168 87 120 152 176 119 94 154 109 78 36 79
1174 79 71 74 232 260 96 254 388 72 188 164 125 179 151 82 233 179 190 54 65 101 21 91 181 56 323 162 48 279 213 71
1026 71 243 152 150 106 183 43 31 170 210 94 202 89 110 116 11 99 149 181 160 137 165 209 57 171 176 134 126 240 82 40 155
$$ packed form
1986B90p2j38N1M5j09R1j4O23J713p08j515J5o3Q3k79J14K9j1P3j85J85L8k07M8M7J17j28
1853A33J0j6J13j09l5M1o2J8q0L9K1Q5J2j7mJ5j28J51m4Jn7kJ8Mm1LR4k8J72p0j2j79K41j10
1686A77L2j48K34j95J98j16Rr0o0J12L62O20K22N27K7m39m78k06l53k01o8o4J01rP6q6P92
1553I76L345j838j868M29k07N4k9j42q4nk29K77Q52N048J04775J2997j09789j0901j394n74
1455A693o08j71L22k69k34k59L60n44J24q7r8j7j17q4L65Pj15m8j9M30j12N406M42n381o30
1332C56k24Q0j44J70j52R6k1J40k19O8o6Q1O0j9lj31kJ12l2l5N3q1L3L2K4n7k5O0m5l1m2M3
1174G9qLJ58K8j64J58J34l16J16k4l9N4k8o9J51n4J1j36J1L6q0P0R0j25K67j61j14K31o6j42
1026G1J72r1km4P7j40j2J39M0j16J08j13K1Oj05Q8N0L2k1k3K8M4j52J14Nm2qJ14j58m2J15
$$ plain form
874 155 162 94 187 233 31 67 249 266 231 212 140 125 134 79 177 95 196 139 164 146 61 116 264 154 153 193 82 117 173 54 93 46 49 171
706 171 94 128 138 309 198 70 96 241 175 150 102 162 119 144 11 31 172 37 74 141 73 112 257 113 191 304 161 145 207 76
559 76 236 17 62 130 139 157 37 70 128 63 53 147 228 174 109 120 187 99 42 494 1190 340 1235 846 327 161 156 92 131 76 193
406 193 12 105 264 46 170 175 172 277 152 92 89 111 177 116 131 99 129 46 102 52 235 120 116 32 133 197 110 110 50 76 109 16 240
244 240 119 97 100 73 61 59 124 70 134 69 115 131 63 151 247 169 234 29 68 130 227 107 79 147 114 64 83 251 91 101 35 204 186
81 186 216 172 135 60 96 224 271 150 131 103 83 152 70 211 284 288 366 207 228 161 34 141 117 153 22 216 183 97 166 24 170
-71 170 154 133 177 164 158 128 144 259 92 191 119 105 251 82 136 23 126 109 66 118 44 65 221 201 45 174 143 31 126 70 81
-224 81 166 124 96 124 200 32 94 188 116 141 82 30 104 39 116 198 162 204 18 169 100 39 231 154 226 94 57 151 100 110 125 170 72
$$ packed form
874A55Po8R3M6k02L6J82J7l5j9p2j5Rn5R8q2J01n7K5j8q5N5J48j10jM0j11L5N6j19L9m7LJ22
706A71p7L4J0J71j11j28K6J45o6k5m8O0m3K5j33K0J41j35L7O7o8L9J45j44P8J13j43j6O2j31
559G6J60k19M5O8RJ8j20L3N8o5j0R4Q1n4o5J1O7q8n7M52O96q50Q95l89n19j66no4L9n5J17
406A93j81R3J59k18J24NlJ05j25o0lK2O6o1J5l2L0q3N6n0J83j15mq4J01O4q7%o0K6L3r3K24
244B40j21k2Lk7j2kO5n4O4o5M6J6o8Q8R6p8O5k05L9O2R7j20k8O8l3n0J9J68j60J0o6J69j8
81A86L0m4l7p5L6J28M7j21j9k8k0O9q2J41P3MP8j59K1o7j27J07k4L6j31J94l3q6O9j42J46
-71A70j6k1M4j3ol0J6J15j67R9p2j4J46j69N4j13J03j7m3N2p4K1J56k0j56J29l1j12R5n6J1
-224H1Q5m2k8K8P6j68O2R4p2K5n9n2P4o5P7Q2l6M2j86J51o9o1J92p7P2j32l7R4n1J0J5M5r8
$$ plain form
-386 72 154 114 96 78 198 32 114 172 200 317 94 242 264 228 180 45 86 212 278 5 148 273 47 196 84 220
$$ packed form
-386G2Q2m0j8j8J20j66Q2N8K8J17k23J48K2l6m8j35M1J26O6k73J43J25k26J49j12J36
-514B20
##PAGE=	F1=-1483.91
##FIRST=	4521.1594499999982872,	4521.1594499999982872,	0
##DATA TABLE=	(F2++(Y..Y)), PROFILE
$$ plain form
4521 260 127 181 146 158 138 158 122 27 96 128 291 225 228 202 205 122 181 47 135 131 88 38 238 191 341 202 61 205 136 157 302 219
4364 219 29 237 63 112 149 151 133 169 152 162 70 122 21 74 243 124 171 186 174 143 166 227 208 69 105 76 148 70 113 211 49
4211 49 151 187 305 59 229 76 176 53 116 107 128 198 266 127 294 184 81 177 163 349 134 70 15 235 149 165 216 176 85
4068 85 95 104 45 24 297 195 25 160 158 121 232 132 105 100 59 31 216 105 197 192 205 223 107 192 211 309 319 258 141 194 231 126
3911 126 221 130 163 100 64 172 151 93 27 114 152 147 142 53 229 156 123 113 52 137 188 201 80 57 151 25 131 226 114 120 85 174 224
3748 224 365 148 47 149 137 137 133 46 209 227 340 92 112 164 34 77 122 89 130 258 198 237 235 83 57 66 143 72 204 132 67
3596 67 179 195 399 127 81 58 119 173 173 134 175 121 177 17 169 171 197 155 84 145 133 74 17 171 148 146 102 168 226 102 22 60 172
3433 172 201 128 115 33 142 182 75 48 96 137 115 42 19 87 135 29 122 162 58 35 65 189 127 106 206 75 108 93 57 51 74 19
$$ packed form
4521B60j33N4l5J2k0K0l6r5O9L2J63o6Lk6Lq3N9j34Q8mm3n0K00m7J50j39j41J44o9K1J45q3
4364B19j90K08j74M9L7Kj8L6j7J0r2N2j01N3J69j19M7J5j2l1K3O1j9j39L6k9P2p8M3R8j62
4211D9J02L6J18k46J70j53J00j23O3rK1P0O8j39J67j10j03R6j4J86k15o4n5K20q6J6N1m0r1
4068H5J0Rn9k1K73j02j70J35kl7J11j00k7nm1k8J85j11R2nJ3J8j16Q5J9R8J0o1j17N3L7j05
3911A26R5r1L3o3l6J08k1n8o6Q7L8nnq9J76p3l3j0o1Q5N1J3j21k3R4j26J06R5j12Ol5Q9N0
3748B24J41k17j01J02j2%mq7J63J8J13k48K0N2j30M3M5l3M1J28o0L9kj52k6RP7p1J32p2o5
3596F7J12J6K04k72m6k3O1N4%l9M1n4N6j60J52KK6m2p1O1j2n9n7J54k3km4O6N8j24q0L8J12
3433A72K9p3j3q2J09M0j07k7M8M1k2p3k3O8M8j06R3M0j04k3L0J24o2k1J00j31L3j5l6oK3n5
$$ plain form
3276 19 63 69 88 195 201 22 47 97 106 57 215 188 159 35 164 125 119 160 135 120 110 143 126 63 157 71 41 185 23 39 123 221 42
3113 42 76 71 261 98 29 108 95 137 3 296 276 62 62 37 131 24 147 35 88 100 60 168 144 155 72 90 42 76 168 22 75
2961 75 91 62 118 64 381 253 224 278 132 163 129 64 59 132 187 100 134 137 177 167 200 582 755 442 480 152 74 106 124 46 72 72 208
2798 208 139 92 42 146 173 134 62 272 181 207 148 110 100 87 104 62 338 269 269 120 296 236 294 100 153 246 56 68 118 125 74 116
2641 116 16 85 217 68 153 55 86 90 79 22 109 88 130 128 125 76 96 292 227 204 113 138 230 74 44 263 254 26 74 144 152 76 25 116
2474 116 120 48 135 1 275 220 136 130 177 210 134 31 206 141 100 275 182 64 181 95 229 131 174 151 68 46 212 121 141 92 91 119
2316 119 56 72 88 97 35 160 183 87 89 113 31 204 111 198 118 59 201 79 72 131 75 26 65 123 44 102 76 71 137 156 28 110 113 93 105
2144 105 108 98 89 121 155 134 73 184 137 28 100 240 201 99 224 176 138 182 207 56 135 54 160 156 115 79 224 157 172 77 154 322
$$ packed form
3276A9M4OJ9J07Oj79K5N0Rm9J58k7k9j24J29l9oM1k5j5j0L3j7o3R4q6l0J44j62J6Q4R8j79
3113D2L4nJ90j63o9P9j3M2j34K93k0k14%k5R4j07J23j12N3J2m0J08k4J1q3J8m8L4R2j46N3
2961G5J6k9N6n4L17j28k9N4j46L1l4o5nP3N5q7L4LM0j0L3L82J73l13L8l28p8L2J8p8K6%J36
2798B08o9m7n0J04K7l9p2K10r1K6n9l8j0j3J7m2K76o9%j49J76o0N8j94N3R3j90J2N0Pn1M2
2641A16j00O9J32j49Q5r8L1Mj1n7Q7k1M2klm9K0J96o5k3r1K5R2j56l0K19rk28M8P0Qp6n1R1
2474A16Mp2Q7j34K74n5q4oM7L3p6j03J75o5m1J75r3j18J17q6J34r8M3k3q3k2J66r1K0m9jK8
2316A19o3J6J6Ro2J25K3r6KK4q2J73r3Q7q0n9J42j22pN9n6m9L9N8p9N8k6nO6J9j28Q2Lk0J2
2144A05Lj0rL2L4k1o1J11m7j09P2J40l9j02J25m8l8M4K5j51P9q1J06mm1l6J45o7J5r5P7J68
$$ plain form
1986 322 259 118 127 181 88 100 160 607 1759 1206 206 239 255 237 7 124 129 159 247 43 246 274 29 48 133 272 123 132 148
1843 148 238 102 148 128 51 119 35 61 105 156 134 131 165 156 70 169 145 179 142 82 102 125 72 99 149 158 356 283 285 75 321 174 210 74
1676 74 325 133 276 188 222 161 114 263 528 989 1225 1685 1613 1481 1058 808 376 157 140 129 251 88 359 273 571 2130
1548 2130 1282 607 916 890 946 942 779 659 576 416 771 1771 7454 128283 147194 18391 4887 2871 2133 1427
1450 1427 1165 1447 1165 847 555 973 347 456 321 257 187 141 97 340 445 301 276 244 552 401 4201 4439 768 215
1332 215 124 132 109 215 120 197 214 321 126 206 80 136 229 228 204 92 52 198 190 112 168 105 106 155 175 101 95 125 85 120 37 97 130 76
1164 76 242 302 116 209 407 91 216 155 103 217 143 52 256 180 225 58 54 87 15 100 152 2 320 173 53 327 242 122 277
1021 277 175 165 88 212 34 44 157 226 50 190 136 181 155 19 108 182 215 139 94 155 230 53 149 157 144 144 239 103 52 144 147 109
$$ packed form
1986C22o3j41RN4r3J2O0M47J152n53j000L3J6j8k30J17NL0Q8k04K03K8k45J9Q5J39j49RJ6
1843A48R0j36M6k0p7O8q4K6M4N1k2lL4rq6R9k4L4l7o0K0K3n3K7N0RJ98p3Kk10K46j47L6j36
1676G4K51j92J43q8L4o1m7J49K65M61K36M60p2j32m23k50m32k19j7j1J22j63K71q6K98J559
1548B130q48o75L09k6N6mj63j20q3j60L55J000N683J20829J8911j28803j3504k016p38p06
1450A427k62K82k82l18k92M18o26J09j35o4p0m6m4K43J05j44k5l2L08j51L800K38l671n53
1332B15r1Qk3J06r5P7J7J07j95Q0j26N6R3jk4j12m0J46qp8N6o3JM9K0p4oL0m0L5q3O0L3n4
1164G6J66O0j86R3J98l16J25o1n2J14p4r1K04p6M5j67mL3p2Q5N2j50L18j47j20K74q5j20J55
1021B77j02j0p7J24j78J0J13O9j76J40n4M5k6j36Q9P4L3p6m5O1P5j77R6Qj3%R5j36n1R2Ll8
$$ plain form
864 109 242 254 8 65 219 268 248 230 124 92 165 64 175 62 153 142 154 129 58 133 328 166 121 171 99 149 183 71 132 67
716 67 100 139 85 162 161 352 236 46 111 254 185 158 100 187 96 168 34 16 143 56 124 107 90 120 302 169 192 275 153 154 176 64
559 64 253 8 32 148 138 172 7 75 143 76 102 142 223 186 143 143 121 20 21 370 1097 194 1205 656 379 230 129 71 118 93
411 93 186 42 68 210 59 171 189 149 260 130 88 103 133 208 110 142 91 104 75 96 30 248 96 94 31 133 160 124 97 44 45 122
254 122 61 310 108 63 70 119 84 122 114 53 152 74 95 152 59 190 275 173 227 36 15 147 228 92 84 153 147 131 54 245 112 98 36
91 36 166 192 208 164 143 63 110 212 261 170 162 96 119 230 145 273 287 280 369 199 232 180 81 142 151 209 55 226 158 96 175 35 173
-71 173 154 160 169 141 155 145 146 253 82 197 157 84 250 85 162 34 169 149 66 109 73 100 227 185 30 217 132 71 98 64 87 176
-229 176 119 94 120 199 29 86 180 69 155 121 29 122 29 97 227 126 207 45 168 97 39 216 173 236 99 43 153 153 127 153 172
$$ packed form
864A09J33J2k46N7J54M9k0j8j06l2P3j01J11j13R1j1J2k5p1P5J95j62m5N0p2N0L4j12O1o5
716F7L3L9n4P7jJ91j16j90O5J43o9k7n8Q7r1P2j34j8J27q7O8j7j7L0J82j33K3Q3j22JK2j12
559F4J89k45K4J16j0L4j65O8O8o7K6M0Q1l7m3%k2j01JL49P27r03J011n49k77j49j01n8M7k5
411I3R3j44K6J42j51J12J8m0J11j30m2J5L0P5r8L2n1J3k9K1o6K18j52ko3J02K7l6k7n3JP7
254A22o1K49k02m5PM9l5L8qo1R9p8K1N7r3J31Q5j02N4j91k1J32Q1j36qO9oj6p7J91j33j4o2
91C6J30K6J6m4k1q0M7J02M9r1qo6K3J11q5J28J4pQ9j70L3n2r9O1RN8j54J71o8o2P9j40J38
-71A73j9ORk8J4j0JJ07j71J15m0p3J66j65P7j28J35k0q3M3l6K7J27m2j55J87q5o1K7l4K3Q9
-229A76n7k5K6P9j70N7R4j11Q6l4r2R3r3O8J30j01Q1j62J23p1n8J77m3O3j37n6J10%k6K6J9
$$ plain form
-381 172 112 148 108 88 53 203 34 102 215 142 327 83 287 269 211 156 96 102 200 279 63 160 297 49 221 79 266
$$ packed form
-381A72o0L6m0k0l5J50j69O8J13p3J85k44K04j8n8n5o0OR8P9k16R7J37k48J72j42J87
-514B66
##PAGE=	F1=-1493.76
##FIRST=	4521.1594499999982872,	4521.1594499999982872,	0
##DATA TABLE=	(F2++(Y..Y)), PROFILE
$$ plain form
4521 205 141 132 98 95 149 81 105 45 91 105 272 225 201 212 167 180 99 39 51 107 93 71 202 180 309 191 40 173 127 160 289 166
4364 166 12 190 49 90 165 138 69 150 140 144 92 100 33 97 250 54 194 156 158 161 143 208 211 73 92 45 120 44 172 217 66 120 187
4201 187 249 57 221 53 164 61 116 94 98 207 220 120 290 212 96 139 117 301 163 19 43 210 174 148 203 149 92 21 85
4058 85 63 27 254 178 32 169 177 120 211 118 87 38 36 70 175 83 194 174 218 222 117 174 224 309 337 261 154 184 215 76 210 142
3901 142 124 85 95 207 183 109 23 136 158 148 139 55 246 177 103 120 42 126 176 219 97 72 149 18 125 164 75 82 104 145 222 365
3743 365 171 49 161 148 121 105 59 214 225 331 128 66 135 51 88 141 89 83 248 207 247 252 106 43 99 121 43 201 129 86 142
3591 142 199 403 131 87 70 118 163 194 200 183 112 137 48 166 119 190 175 102 126 133 72 37 181 183 153 80 193 217 117 2 93 185 205
3428 205 166 91 21 107 159 68 44 137 122 119 62 18 119 148 92 147 178 49 57 71 174 171 137 229 66 107 82 32 33 65 47 73 85 89 156
$$ packed form
4521B05o4rl4lN4o8K4o0M6J4J67m7k4J1m5J3q1o0J2N6j4k2J31k2J29j18j51J33m6L3J29j23
4364A66j54J78j41M1P5k7o9Q1j0Mn2Qo7O4J53j96J40l8KLj8O5Lj38J9m7P5p6J28M5j51N4O7
4201A87O2j92J64j68J11j03N5k2MJ09J3j00J70p8j16M3k2J84j38j44K4J67l6k6N5n4n7p1O4
4058H5k2l6K27p6j46J37Qn7R1r3l1m9kL4J05r2J11k0M4Mj05N7N0Q5K8p6j07L0L1j39J34o8
3901A42j8l9J0J12k4p4q6J13K2j0rq4J91o9p4J7p8Q4N0M3j22k5P7j31J07L9q9PK2M1P7J43
3743C65j94j22J12j3k7j6m6J55J1J06k03o2O9q4L7N3n2oJ65m1M0Nj46o3N6K2p8J58p2m3N6
3591A42N7K04k72m4j7M8M5L1Oj7p1K5q9J18m7P1j5p3K4Po1l5J44Kl0p3J13K4j00j15R1R2K0
3428B05l9p5p0Q6N2r1k4R3j5ln7m4J01K9n6N5L1j29QJ4J03ll4R2j63M1k5n0JL2j8K6J2MO7
$$ plain form
3256 156 196 15 66 103 111 53 174 160 180 37 169 77 121 179 129 68 108 182 121 80 136 103 45 171 31 64 144 252 46 86 89 272
3099 272 96 55 135 92 133 22 279 268 73 75 29 141 32 163 57 98 107 79 184 161 159 62 84 42 112 167 39 95 98 72 139 149
2941 149 515 281 192 241 123 172 99 74 89 101 203 95 143 119 113 139 151 534 647 401 489 168 86 143 156 53 71 109 229 129
2793 129 81 69 122 150 129 59 235 201 233 156 111 113 119 111 72 329 302 252 111 245 270 292 78 117 221 83 73 102 164 75 177 89
2636 89 62 158 100 176 37 50 105 83 27 89 113 149 111 100 45 77 263 251 185 118 172 247 61 36 257 252 13 57 137 125 76 60 132
2474 132 111 62 148 43 252 207 125 138 178 225 149 27 182 158 120 255 228 83 189 117 207 128 141 87 70 73 173 93 137 84 106
2321 106 108 63 52 88 137 87 175 196 59 90 67 19 189 120 153 142 59 189 97 80 120 117 4 82 139 77 80 90 84 135 97 57 93 98 57
2149 57 98 159 83 57 122 130 129 42 168 99 35 62 229 215 134 223 164 150 169 168 16 118 59 137 129 143 52 187 137 161 108 187 335 311
$$ packed form
3256A56M0j81N1L7Qn8J21j4K0j43J32r2M4N8n0o1M0P4o1m1N6l3n8J26j40L3Q0J08k06M0LJ83
3099B72j76m1Q0m3M1j11K57j1j95Km6J12j09J31j06M1Rk8J05k3kr7K2m2P0N5j28N6Lk6O7J0
2941A49L66k34q9M9j18M9p3k5J5J2J02j08M8k4oK6J2L83J13k46Q8l21q2N7J3j03J8L8J20j00
2793A29m8j2N3K8k1p0J76l4L2p7m5KOql9K57k7n0j41J34K5K2k14L9J04j38j0K9O2q9J02q8
2636H9k7R6n8P6j39J3N5k2n6O2K4L6l8j1n5L2J86j2o6o7N4P5j86k5K21nk39M4Q0j2m9j6P2
2474A32k1m9Q6j05K09m5q2J3M0M7p6j22J55k4l8J35k7j45J06p2R0p9J3n4j7LJ00q0M4n3K2
2321A06Km5j1L6M9n0Q8K1j37L1k3m8J70o9L3j1q3J30r2j7M0lj13P8N7o2LJ0oN1l8m0L6Nm1
2149E7M1O1p6k6O5Qjq7J26o9o4K7J67j4q1Q9n9j4J9jj52J02n9P8qJ4r1J35n0K4n3P9J48k4
$$ plain form
1981 311 160 98 165 91 30 161 415 843 460 220 247 280 145 20 146 97 173 234 77 256 258 65 38 94 228 133 90 135 192
1839 192 61 165 101 30 126 89 31 129 142 61 136 148 112 94 93 135 185 177 36 78 108 38 98 98 180 381 311 267 108 272 101 187 76
1676 76 278 190 199 221 212 186 117 277 442 660 840 1381 1188 1157 891 630 190 40 138 107 225 58 305 285 219 586 445 351
1538 351 485 577 599 610 429 268 138 1012 767 990 4663 78392 95846 13540 3785 2257 1695 1035 779 1033 825
1435 825 498 252 759 169 268 178 131 84 128 136 218 387 238 252 148 362 98 875 790 272 152 95 69 118 148 108 187 208 279
1292 279 185 189 58 46 185 219 164 76 41 150 190 64 109 92 74 114 128 83 80 73 69 117 53 93 148 123 204 289 160 197 365 173 203
1130 203 130 106 220 111 42 232 180 217 66 31 34 17 93 91 43 281 204 76 329 264 143 286 206 144 77 204 19 40 115 211
982 211 7 179 165 257 176 8 113 199 248 122 52 121 211 42 141 126 135 154 208 128 53 124 131 106 291 251 11 46 159 243 271 222
$$ packed form
1981C11j51o2O7p4o1J31K54M28l83k40K7L3j35j25J26m9P6O1j57J79Kj93k7N6J34r5m3M5N7
1839A92j31J04o4p1R6l7n8R8J3q1P5J2l6j8jM2N0qj41M2L0p0O0%Q2K01p0m4j59J64j71Q6j11
1676G6K02q8RK2rk6o9J60J65K18J80N41j93l1k66k61m40j50R8l1J18j67K47k0o6L67j41r4
1538C51J34R2K2J1j81j61j30Q74k45K23L673P3729J7454q2306r755j528n62o60k56K54k08
1435H25l27k46N07n90R9r0m7m7M4QQ2J69j49J4j04K14k64P77q5n18j20n7k6M9L0m0P9K1P1
1292B79r4Mj31j2J39L4n5q8l5J09M0j26M5j7j8M0J4m5lpmM8o4M0N5k5Q1Q5j29L7J68j92L0
1130B03p3k4J14j09o9J90n2L7j51l5Lj7P6km8K38p7j28K53o5j21J43q0o2o7J27j85K1P5R6
982B11k04J72j4R2q1j68J05Q6M9j26p0O9R0j69R9j5RJ9N4q0p5P1Pk5J85m0k40L5J13Q4K8m9
$$ plain form
825 222 106 56 188 67 174 67 97 140 119 124 54 137 355 185 97 130 108 169 196 82 176 106 132 98 60 157 178 385 248 69
677 69 136 253 195 149 103 198 80 166 61 19 91 86 171 89 102 130 305 211 171 219 153 151 152 51 235 37 28 147 140 173 65 112 160 113
510 113 140 140 207 201 157 145 27 42 33 287 847 97 1091 416 332 239 75 61 135 110 171 75 38 144 77 171 175 145 228 105 79 111 136
347 136 227 102 149 89 59 98 88 35 241 76 72 39 134 106 118 80 53 32 117 149 347 112 14 31 135 103 181 103 86 159 66 62 155
185 155 53 239 279 184 189 34 27 177 212 85 99 162 183 180 43 224 120 109 75 124 175 189 162 140 68 118 195 234 185 179 80 136 290
22 290 202 304 272 276 342 192 202 200 122 122 192 241 113 212 151 76 144 72 157 164 168 171 104 142 157 152 235 87 192 174 109 220 73 142 80 238
-155 238 159 51 97 104 116 233 155 38 230 107 87 70 35 79 152 124 119 112 183 44 93 144 41 155 121 80 119 24 80 212 75
-308 75 178 86 141 69 55 200 173 199 88 19 105 163 144 171 139 141 134 92 40 43 180 33 87 224 85 285 139 274 222 250 81
$$ packed form
825B22j16n0J32j21J07j07L0M3k1Np0Q3K18j70q8L3k2O1K7j14R4p0K6l4l8R7K1K07j37j79
677F9O7J17n8m6m6R5j18Q6j05m2P2nQ5q2J3K8J75r4m0M8o6kJj01J84j98rJ19pL3j08M7M8m7
510A13K7%O7om4j2j18J5rK54N60p50R94o75q4r3j64j4P4k5O1r6l7J06o7R4Ml0Q3j23k6L2K5
347A36R1j25M7o0l0L9j0n3K06j65ml3R5k8J2l8k7k1Q5L2J98k35r8J7J04l2P8p8j7P3r3mR3
185A55j02J86M0r5Nj55pJ50L5j27J4O3K1lj37J81j04j1l4M9N1J4k7k2p2N0P7L9m9or9N6J54
22B90q8J02l2MO6j50J0kp8%P0M9j28R9o1p5O8p2Q5PMLo7L8J5nQ3j48J05j8o5J11j47O9o2J58
-155B38p9j08M6PJ2J17p8j17J92j23k0j7l5M4P3k8npP1j39M9N1j03J14l4m1L9r5N6J32j37
-308G5J03r2N5p2j4J45k7K6j11o9Q6N8j9K7l2Kpm2n2LJ37j47N4J37j39K00j46J35n2K8j69
$$ plain form
-460 81 107 71 172 242 87 158 258 100 182 130 246
$$ packed form
-460H1K6l6J01P0j55P1J00j58Q2n2J16
-514B46
##PAGE=	F1=-1503.6
##FIRST=	4521.1594499999982872,	4521.1594499999982872,	0
##DATA TABLE=	(F2++(Y..Y)), PROFILE
$$ plain form
4521 131 227 71 89 133 116 128 35 173 91 37 218 243 219 161 70 270 62 51 104 76 114 126 97 183 254 185 42 147 106 197 241
4369 241 61 94 85 99 62 206 79 61 138 126 110 128 37 97 124 217 73 241 95 119 206 139 197 177 122 70 53 89 35 241 180 129
4211 129 57 212 154 82 217 71 139 93 119 69 62 225 140 146 253 246 134 82 91 212 228 36 82 157 207 120 168 121 75 93 88 116 12
4049 12 169 172 29 174 169 112 196 106 85 24 63 123 90 95 194 115 230 197 165 130 232 289 358 259 172 164 173 54 225 125 56 61 153 244
3881 244 199 137 15 153 156 161 115 110 229 194 62 151 65 88 179 209 135 85 131 67 143 92 57 31 137 102 227 320 212 63 161 165 110
3719 110 112 79 209 222 287 163 19 108 84 95 139 120 66 239 192 246 242 113 25 96 99 38 202 115 123 85 213 380 138 93 78 118
3561 118 155 200 273 167 115 74 82 153 82 164 208 128 113 126 52 75 173 212 160 38 226 179 111 48 132 186 189 210 53 52 80 126 52 36
3394 36 186 87 95 106 65 126 168 160 144 204 73 73 83 156 197 154 262 82 76 85 36 27 36 91 94 99 84 100 170 21 80 115 130 97 125 116 205 47
$$ packed form
4521A31R6j56J8M4j7J2r3J38q2n4J81K5k4n8r1K00k08j1N3k8L8J2k9Q6P1o9j43J05m1R1M4
4369B41j80L3rJ4l7J44j27j8P7j2j6J8r1O0K7R3j44J68j46K4Q7o7N8k0n5n2j7L6n4K06o1n1
4211A29p2J55n8p2J35j46O8m6K6n0pJ63q5OJ07pj12n2RJ21J6j92M6P5N0q7M8m7m6J8nK8j04
4049A2J57Lj43J45nn7Q4r0k1o1L9O0l3NR9p9J15l3l2l5J02N7O9r9q7qRj19J71j00o9NR2R1
3881B44m5o2j22J38LNm6nJ19l5j32Q9q6K3R1L0p4n0M6o4P6n1l5k6J06l5J25R3j08j49R8Mn5
3719A10Kl3J30J3O5j24j44Q9k4J1M4j9n4J73m7N4mj29q8P1Lo1J64q7Ql8J28J67k42m5j5M0
3561A18L7M5P3j06n2m1QP1p1Q2M4q0j5J3p4K3R8L9n2j22J88m7o8o3Q4N4LK1j57jK8M6p4j6
3394C6J50r9QJ1m1O1M2qj6O0j31%J0P3M1m3J08j80oRm9rRN5LNj5J6P0j49N9L5J5l3K8rQ9j58
$$ plain form
3207 47 153 14 123 178 111 12 104 197 108 75 123 147 37 133 65 102 165 257 77 108 105 276 105 68 189 85 118 24 256 246 94
3054 94 103 16 151 39 168 76 110 120 105 182 171 167 70 72 103 165 167 93 106 114 90 171 235 633 267 147 174 89 189 58 89 135 64 217
2887 217 76 162 94 52 139 78 478 503 406 501 174 102 172 174 59 62 131 238 128 64 84 97 119 144 36 191 217 245 153 93 120 153
2729 153 121 92 306 315 220 70 198 323 263 94 102 183 125 74 106 178 79 227 163 67 81 151 171 22 28 142 71 43 56 133 186 100
2572 100 49 43 76 196 275 121 136 196 256 65 46 224 253 31 42 143 113 57 120 159 89 69 160 109 216 203 103 153 160 219 175 19
2414 19 144 183 150 220 266 124 174 154 153 136 115 20 68 98 111 105 110 60 147 64 96 18 77 159 166 201 210 49 97 37 2 146 161 119 192 36
2237 36 139 130 99 91 182 18 115 126 122 83 126 125 133 64 74 93 52 44 88 214 64 46 96 105 113 37 173 91 21 67 178 231 201 209 142 156 174
2055 174 97 40 70 86 130 90 128 109 108 155 123 136 249 323 357 197 44 133 110 90 145 261 335 344 253 274 300 22 76 193 66 198
$$ packed form
3207D7J06j39J09N5o7r9R2R3q9l3M8K4j10R6o8L7O3R2j80L1lJ71j71l7J21j04L3r4K32j0j52
3054I4Rq7J35j12J29r2L4J0j5P7j1mr7KL1O2Kp4J3Qk4Q1O4L98l66j20K7q5J00j31L1M6p1J53
2887B17j41Q6o8m2Q7o1M00K5r7R5l27p2P0Kj15LO9J07j10o4K0J3K2K5j08J55K6K8r2o0K7L3
2729A53l2k9K14Rr5j50J28J25o0j69QQ1n8n1L2P2r9J48o4r6J4P0K0j49OJ14p1k8J3P7N3q6
2572A00n1oL3J20P9j54J5O0O0j91j9J78K9k22J1J01l0n6O3L9p0k0R1n1J07j3j00N0PN9m4j56
2414A9J25L9l3P0M6j42N0k0jj7k1r5M8L0J3oNn0Q7q3L2p8N9Q2PL5Rj61M8o0l5J44J5m2P3j56
2237C6J03rl1qR1j64R7J1ml9M3jQo9J0J9m1qM4J26j50j8N0RQp6J36q2p0M6J11N3l0Qo7J4J8
2055A74p7n7L0J6M4m0L8j9jM7l2J3J13P4L4j60j53Q9k3k0N5J16P4Rr1K1K6k78N4J17j27J32
$$ plain form
1898 198 173 70 268 208 147 81 34 118 170 62 75 107 98 129 92 19 107 182 52 165 143 80 165 105 102 77 78 168 154 206 92 73 40
1735 40 87 87 82 204 394 330 173 224 139 131 174 193 140 276 100 275 141 207 53 152 220 476 722 1164 1001 646 447 500 123
1592 123 268 272 93 174 167 58 209 264 611 179 301 370 245 401 410 572 756 814 2189 1593 1739 4947 61983 57716 3943
1469 3943 1053 217 145 431 562 271 259 492 577 158 464 218 157 190 197 11 148 242 175 162 142 175 401 386 2911 4017
1341 4017 647 437 56 107 50 12 94 200 116 210 325 83 161 125 105 177 108 17 117 23 130 53 41 86 130 92 65 51 70 110
1194 110 10 86 103 94 109 213 120 203 247 244 251 307 131 114 156 177 56 66 171 199 154 101 68 73 80 85 18 87 208 264 133 274 286 128
1026 128 264 257 81 110 151 91 33 59 171 81 155 172 332 162 30 101 206 282 120 76 84 138 91 166 125 98 151 146 163 37 90 113
869 113 80 339 228 53 52 88 177 307 184 82 23 200 93 180 97 25 142 54 143 80 146 333 226 108 68 101 170 214 81
$$ packed form
1898A98k5j03J98o0o1o6m7Q4N2j08J3L2rL1l7p3Q8P5j30J13k2o3Q5o0lk5JR0j4N2j14j9l3
1735D0M7%nJ22J90o4j57N1q5qM3J9n3J36j76J75j34O6j54R9O8K56K46M42j63l55j99N3l77
1592A23J45Mj79Q1pj09J51N5L47m32J22O9j25J56RJ62J84N8J375n96J46L208N7036m267n3773
1469C943k890q36p2K86J31k91j2K33Q5m19L06k46o1L3Pj86J37R4o7j3k0L3K26j5K525J106
1341D017l370k10l81N1n7l8Q2J06q4R4J15k42P8l6k0P2o9r1J00r4J07p7j2M5M4l8k7j4J9M0
1194A10j00P6J7rJ5J04r3Q3M4lPN6j76j7M2K1j21J0J05K8m5n3l3NPNo7O9J21N6j31J41J2j58
1026A28J36pj76K9M1o0n8K6J12r0P4J7J60j70j32P1J05P6j62m4QN4m7P5m1k7N3nJ7j26N3K3
869A13l3K59j11j75jL6Q9J30j23j02n9J77j07Q7q3p2J17q8Q9o3O6J87j07j18m0L3O9M4j33
$$ plain form
726 81 227 158 131 74 28 117 185 406 231 138 173 240 209 121 114 198 65 133 88 46 62 101 207 119 103 151 263 235 135 162 177 129 149
564 149 44 172 103 47 137 163 156 131 155 173 139 165 140 175 216 154 124 90 74 71 239 364 349 886 148 253 194 40 90 187 125 170
406 170 100 1 91 82 173 129 172 183 74 66 111 112 224 103 174 77 99 98 108 83 224 70 66 53 130 52 92 67 94 35 83 244 334 144
239 144 55 62 113 118 229 86 134 156 44 19 156 37 305 246 210 121 68 54 215 173 86 119 166 215 199 44 213 110 145 153 90 128
81 128 165 184 134 88 121 173 188 191 179 98 125 335 228 302 247 290 283 197 141 222 146 84 237 239 195 171 151 37 65 139 129 187 150 184 62
-91 62 112 170 153 212 115 197 171 165 160 104 71 120 329 128 17 89 149 105 245 121 89 213 85 108 95 42 47 87 139 176 109 146 82 121
-258 121 85 95 117 71 172 107 111 123 146 54 108 144 92 21 101 211 141 107 106 61 6 112 193 199 78 163 152 82 56 13 117 92 145 178
-426 178 177 169 264 207 105 359 67 82 24 192 190 56 210 147 209 60 251 133
$$ packed form
726H1J46o9k7n7m6Q9O8K21j75r3L5O7l1q8pQ4j33O8m5m2J6L9J06q8j6M8J12k8j00K7J5m8K0
564A49j05J28o9n6R0K6pk5K4J8l4K6k5L5M1o2l0l4j6lJ68J25j5N37p38J05n9j54N0R7o2M5
406A70p0r9R0rR1m4M3J1j09qM5JJ12j21P1r7K2jJ0k5J41j54mj3P7p8M0k5K7n9M8J61R0j90
239A44q9PN1NJ11j43M8K2j12k5J37j19K68n9l6q9n3j4J61m2q7L3M7M9j6j55J69j03L5Qo3L8
81A28L7J9n0m6L3N2J5Lj2q1K7K10j07P4n5M3pq6n6Q1p6o2J53Km4k4k0j14K8P4j0N8l7L4j22
-91F2N0N8j7N9r7Q2k6onn6l3M9K09k01j11P2O0m4J40j24l2J24j28K3j3n3NM0N2L7o7L7o4L9
-258A21l6J0K2m6J01o5MJ2K3r2N4L6n2p1Q0J10p0l4jm5n5J06Q1Oj21Q5j1p0k6m3J04k5N3L3
-426A78jqR5n7j02K54k92J5n8J68kj34J54o3O2j49J91j18
-514A33
##PAGE=	F1=-1513.45
##FIRST=	4521.1594499999982872,	4521.1594499999982872,	0
##DATA TABLE=	(F2++(Y..Y)), PROFILE
$$ plain form
4521 258 425 268 282 349 190 368 113 366 176 149 217 326 355 142 96 411 274 189 323 194 232 214 77 228 208 265 72
4388 72 209 166 290 190 105 227 84 222 159 275 32 177 174 117 84 185 73 196 189 163 240 318 114 121 274 189 227 110 192
4246 192 48 99 125 100 312 112 234 60 275 33 163 236 159 110 154 133 79 21 253 25 209 194 309 222 90 94 84 320
4108 320 86 127 111 246 83 114 126 81 229 129 210 61 52 208 73 180 134 115 203 94 117 35 114 195 58 155 207 20 250
3965 250 165 231 70 240 252 387 243 197 165 108 143 264 100 78 57 232 289 193 173 4 168 144 182 84 203 183 220 51 208
3822 208 141 27 204 165 180 96 98 115 171 13 74 92 187 118 244 225 276 112 148 192 93 147 98 198 223 211 194 100 121 155 121 108
3665 108 168 136 233 156 234 203 102 50 56 101 101 219 128 172 17 247 332 155 114 80 125 150 190 348 118 144 11 128 146 124 122 262
3507 262 171 108 109 20 118 142 234 178 31 269 112 85 124 175 195 155 259 48 84 64 80 72 31 242 40 52 175 129 104 200 224 109
$$ packed form
4521B58J67j57J4O7j59J78k55K53j90k7O8J09K9k13m6L15j37q5J34j29L8j8j37J51k0N7j93
4388G2J37m3J24j00q5J22j43J38o3J16k43J45ln7l3J01j12J23pk6P7P8k04PJ53q5L8j17Q2
4246A92j44N1K6k5K12k00J22j74K15k42J30P3p7m9M4k1n4n8K32k28J84j5J15q7j32Mj0K36
4108C20k34M1j6J35j63L1J2m5J48j00Q1j49rJ56j35J07m6j9Q8j09K3q2P9Q1j37R7N2j87K30
3965B50q5O6j61J70J2J35j44m6l2n7L5J21j64k2k1J75N7r6k0j69J64k4L8r8J19k0L7j69J57
3822B08o7j14J77l9J5q4KJ7N6j58O1J8R5o9J26j9N1j64L6M4r9N4m9J00K5j2j7r4K1L4l4j3
3665A08O0l2R7p7P8l1j01n2OM5%J18r1M4j55K30Q5j77m1l4M5K5M0J58k30K6j33J17J8k2kJ40
3507B62r1o3Jq9R8K4R2n6j47K38j57k7L9N1K0m0J04k11L6k0J6qm1K11k02J2J23m6k5R6K4j15
$$ plain form
3350 109 235 102 78 99 150 200 149 307 125 26 116 108 94 12 149 129 112 81 47 126 55 101 138 159 181 62 86 242 79 112 57
3197 57 124 162 77 50 94 182 109 89 137 205 58 70 126 157 189 235 112 135 118 279 128 60 260 122 112 9 256 222 133 142 63 156
3040 156 41 160 90 126 146 144 163 182 200 140 62 166 214 156 147 106 135 110 215 306 720 217 126 85 25 221 89 107 194 51 228
2887 228 63 189 62 65 149 14 413 409 434 545 169 131 195 177 63 47 133 234 140 49 106 92 105 188 38 179 239 241 151 55 122
2734 122 186 119 118 264 304 247 29 190 391 200 160 122 142 175 71 131 165 99 252 234 86 89 219 134 66 77 205 41 69 43
2587 43 148 236 96 61 79 97 103 305 40 168 214 270 99 96 166 260 68 33 170 133 66 198 193 96 80 200 198 171 216 72 177
2434 177 128 184 215 44 130 219 188 217 298 195 129 218 73 160 102 78 75 103 54 173 80 28 217 20 148 123 102 158 258 224 234
2282 234 59 117 92 56 80 219 154 272 47 45 199 143 36 258 31 165 78 177 105 160 202 180 151 107 153 30 147 58 274
$$ packed form
3350A09J26j33k4K1N1N0n1J58j82r9R0qj4q2J37k0j7l1l4P9p1M6L7K1K2j19K4J56j63L3n5
3197E7O7L8q5k7M4Q8p3k0M8O8j47J2N6L1L2M6j23K3j7J61j51o8K00j38j0j03K47l4q9Rp9R3
3040A56j15J19p0L6K0kJ9J9J8o0p8J04M8n8rm1K9k5J05R1M14n03r1m1o0J96j32J8Q7j43J77
2887B28j65J26j27LQ4j35L99mK5J11l76l8O4j8j14j6Q6J01r4r1N7j4J3Q3j50J41O0Kr0r6O7
2734A22O4o7jJ46M0n7k18J61K01j91m0l8K0L3j04O0L4o6J53j8j48LJ30q5o8J1J28j64K8k6
2587D3J05Q8j40l5J8J8OK02k65J28M6N6j71lP0R4j92l5J37l7o7J32nr7j6J20kk7M5j44J05
2434A77m9N6L1j71Q6Q9l1K9Q1j03o6Q9j45Q7n8k4lK8m9J19r3n2J89j97J28k5k1N6J00l4J0
2282B34j75N8k5l6K4J39o5J18k25kJ54n6j07K22k27J34q7R9p2N5M2k2k9m4M6j23J17q9K16
$$ plain form
2139 274 68 116 43 117 132 107 205 152 57 157 108 272 295 201 133 180 203 24 108 34 144 183 92 94 234 13 234 118 184 349
1991 349 292 396 228 56 113 181 209 136 194 816 895 219 297 356 167 162 266 92 247 77 27 315 176 259 184 142 66 254 194
1848 194 54 118 220 43 191 113 119 318 192 249 228 270 239 176 272 102 295 294 172 274 263 187 94 259 180 242 322 459 401 211
1701 211 448 173 400 288 424 118 427 243 379 162 353 278 216 263 878 1198 887 948 658 351 820 529 614 534 361
1578 361 398 463 401 555 990 1313 997 1393 1685 1583 1846 1884 2081 2286 2235 3767 3344 5804 18448 299610 322666 35213
1469 35213 9449 4609 3217 3061 2881 2445 2158 2149 1978 1150 1407 1012 693 694 569 288 370 624 336 566 432 650 903
1356 903 930 5369 6838 1274 751 251 262 134 242 318 347 209 347 582 190 402 379 238 211 203 173 261 183 19 245 257
1228 257 231 307 263 228 181 167 279 112 186 192 177 29 343 142 70 383 363 81 485 28 197 263 88 97 130 164 256 32 182
$$ packed form
2139B74k06M8p3P4J5k5R8n3r5J00m9J64K3r4o8M7K3j79Q4p4J10L9r1KJ40k21K21j16O6J65
1991C49n7J04j68j72N7O8K8p3N8O22P9o76P8N9j89nJ04j74J55j70n0K88j39Q3p5m2p6J88o0
1848A94j40O4J02j77J48p8OJ99j26N7k1M2l1o3R6j70J93jj22J02j1p6r3J65p9O2Q0J37n8j90
1701B11K37k75K27j12J36l06L09j84J36k17J91p5o2M7O15L20l11O1k90l07M69k91Q5q0j73
1578C61L7O5o2J54M35L23l16L96K92j02K63L8J97K05n1J532m23K460J2644K81162K3056k87453
1469C5213k5764m840j392j56j80m36k87rj71q28K57l95l19Jj25k81Q2K54k88K30j34K18K53
1356I03K7M439J469n564n23n00J1j28J08P6K9j38J38K35l92K12k3j41k7ql0Q8p8j64K26J2
1228B57k6P6m4l5m7j4J12j67P4Oj5j48L14k01p2L13k0k82M04m57J69O6j75RL3L4R2k24J50
$$ plain form
1085 182 186 242 190 188 157 168 152 351 229 168 315 98 230 337 70 190 84 219 145 127 152 179 137 178 402 112 99 76 221
943 221 331 166 172 151 44 205 232 207 33 135 87 215 12 50 116 56 397 232 137 137 130 68 362 136 69 49 204 134 202 141
795 141 89 166 72 201 162 201 259 307 165 17 68 149 237 67 286 221 85 133 91 122 189 426 207 228 221 220 237 77 135 194 36
642 36 91 130 123 144 119 257 191 102 188 177 240 97 163 225 86 179 65 77 195 107 166 223 130 200 191 180 142 178 153 127 230 168 105 220
475 220 89 141 254 186 629 649 405 300 118 82 126 255 142 216 141 61 127 116 187 68 226 126 43 51 101 69 191 124 240
332 240 59 229 79 173 155 224 93 87 67 118 42 67 59 161 64 59 344 274 207 141 152 52 135 263 56 171 150 19 57 186 49
180 49 395 172 256 60 158 81 253 123 100 140 157 236 186 69 247 94 217 260 111 63 156 239 141 129 119 152 124 189 177 176 85
27 85 382 229 286 236 333 196 219 93 243 151 58 282 200 300 124 161 92 78 229 145 223 135 210 44 60 190 149 196 173 240 180
$$ packed form
1085A82MN6n2kl1J1j6J99j22o1J47k17J32J07k67J20j06J35p4j8K5K7m2M1K24k90j3k3J45
943B21J10j65Ok1j07J61K7k5j74J02m8J28k03L8O6o0L41j65r5%po2K94k26o7k0J55p0O8o1
795A41n2P7r4J29l9L9N8M8j42j48N1Q1Q8j70K19o5j36M8m2L1O7K37k19K1pjJ7j60N8N9j58
642C6N5L9pK1k5J38o6q9Q6j1O3j43O6O2j39R3j14J2J18q8N9N7r3P0rj1l8L6k5k6J03o2o3J15
475B20j31N2J13o8M43K0k44j05j82l6M4J29j13P4p5q0O6j1P1j19J58j00q3QN0l2J22o7J16
332B40j81J70j50R4j8O9j31ok0N1p6K5qJ02r7nK85p0o7o6J1j00Q3J28k07J15k1j31L8J29j37
180D9L46k23Q4j96R8p7J72j30k3M0J7P9n0j17J78j53J23M3j49m8R3Q3r8j2j0L3k8O5j2jr1
27H5K97j53N7n0R7j37K3j26J50r2r3K24q2J00j76L7o9j4J51q4P8q8P5j66J6J30m1M7k3O7o0
$$ plain form
-125 180 244 105 207 45 151 437 60 34 87 210 73 271 114 171 191 136 194 191 144 79 61 172 256 126 86 137 171 103 183
-268 183 31 32 305 147 249 222 89 127 47 219 90 42 184 268 90 53 205 181 166 84 300 275 124 215 242 126 196 78
-406 78 66 203 287 125 371 51 447 172 138 524 270 155 183 329 219 100 364 90 382 160 439 83
$$ packed form
-125A80O4j39J02j62J06K86l77k6N3J23j37J98j57N7K0n5N8lm7o5j8J11Q4j30m0N1L4o8Q0
-268A83j52JK73j58J02k7j33L8q0J72j29m8J42Q4j78l7J52k4j5q2K16k5j51R1K7j16P0j18
-406G8j2J37Q4j62K46l20L96k75l4L86k54j15K8J46j10j19K64k74K92k22K79l56
-514H3
##PAGE=	F1=-1523.29
##FIRST=	4521.1594499999982872,	4521.1594499999982872,	0
##DATA TABLE=	(F2++(Y..Y)), PROFILE
$$ plain form
4521 543 707 578 557 634 419 672 309 609 339 350 366 489 570 323 317 616 546 393 586 409 421 340 304 323 234 429 137 351
4383 351 321 425 243 315 399 296 399 331 369 183 314 272 137 143 261 212 322 306 181 434 426 267 235 362 294 308 49 265
4246 265 107 163 231 199 382 129 366 215 370 137 280 291 283 103 241 164 150 39 292 120 301 173 407 347 210 140 71
4113 71 425 138 175 157 288 50 72 192 156 385 195 337 149 126 291 165 192 88 145 236 92 172 56 179 280 218 240
3980 240 255 115 293 172 304 74 247 203 422 208 228 220 50 262 322 141 206 123 321 346 162 213 8 185 118 210 89
3847 89 319 145 269 132 286 250 78 247 110 220 114 62 159 202 71 125 202 255 226 271 85 354 192 131 229 62 184
3714 184 112 192 231 110 224 213 191 262 174 61 222 238 231 107 213 141 73 108 36 148 194 262 199 233 92 308 268 184 159 77 139
3561 139 147 169 417 34 191 108 194 178 216 94 327 232 110 81 19 157 92 251 210 128 317 50 72 221 224 233 124 311 108
$$ packed form
4521E43J64j29k1P7k15K53l63L00k70J1J6J23Q1k47oK99p0j53J93j77J2q1l6J9q9J95k92K14
4383C51l0J04j82P2Q4j03J03o8L8j86J31m2j35OJ18m9J10j6j25K53qj59l2J27o8J4k59K16
4246B65j58N6O8l2J83k53K37j51J55k33J43J1qj80J38p7j4j11K53j72J81j28K34o0j37p0o9
4113G1L54k87L7j8J31k38K2J20l6K29j90J42j88k3J65j26K7j04N7R1j44Q0j16J23J01o2K2
3980B40J5j40J78j21J32k30J73m4K19k14K0qj70K12O0j81O5q3J98K5j84N1k05J77o7R2j21
3847H9K30j74J24j37J54l6j72J69j37J10j06n2R7M3j31N4P7N3k9M5j86K69j62o1R8j67J22
3714A84p2Q0L9j21J14j1k2P1q8j13J61J6pj24J06p2o8L5p2J12M6O8o3L4j41K16m0q4k5q2O2
3561A39QK2K48l83J57q3Q6j6L8j22K33r5j22k9o2J38o5J59m1q2J89k67K2J49LRj09J87k03
$$ plain form
3419 108 106 56 24 133 44 303 66 77 267 202 81 246 280 46 265 121 75 113 168 179 127 360 188 79 176 202 183 76 217
3276 217 175 127 86 40 71 106 138 177 197 284 24 149 293 122 53 131 123 136 31 108 77 142 136 171 180 276 134 16 209 226 218 192 138
3113 138 163 129 285 167 32 335 218 143 55 302 219 189 189 137 152 36 142 103 153 188 197 152 208 274 253 67 232 252 127 196
2966 196 96 157 125 267 352 763 158 186 74 63 270 187 126 261 79 239 86 217 44 124 162 120 333 496 448 642 159
2833 159 180 215 171 70 27 120 219 173 74 157 136 141 258 119 241 277 226 165 5 123 217 104 144 218 268 353 132 241 465 107
2685 107 244 178 109 226 65 166 125 143 252 302 123 210 299 76 156 146 289 8 107 97 159 286 95 175 126 144 88 348 143
2542 143 211 237 305 152 167 89 270 113 23 215 189 146 293 239 169 116 283 304 120 253 36 209 93 117 260 100 173 268
2405 268 236 292 333 296 54 300 63 200 106 161 100 81 136 267 116 84 314 134 213 271 182 148 350 235 276 72 154 170 144
$$ packed form
3419A08kn0l2J09q9K59k37J1J90o5j21J65L4k34K19j44m6L8N5J1n2K33j72j09R7K6j9j07J41
3276B17m2m8m1m6L1L5L2L9K0Q7k60J25J44j71o9P8qJ3j05P7l1O5oL5RR6j42j18J93J7qk6n4
3113A38K5l4J56j18j35L03j17p5q8K47q3l0%n2J5j16J06l9N0L5Rm5N6O6k1j86J65K0j25O9
2966A96j00O1l2J42Q5M11o05K8j12j1K07q3o1J35j82J60j53J31j73Q0L8m2K13J63m8J94m83
2833A59K1L5m4j01m3R3R9m6r9Q3k1NJ17j39J22L6n1o1j60J18R4j13M0P4N0Q5k21J09K24l58
2685A07J37o6o9J17j61J01m1J8J09N0j79Q7Q9k23Q0j0J43k81R9j0O2J27j91Q0m9J8n6K60k05
2542A43O8K6O8j53J5p8J81j57r0J92k6m3J47n4p0n3J67K1j84J33k17J73j16K4J43j60P3R5
2405B68l2N6M1l7k42K46k37J37r4N5o1j9N5J31j51l2K30j80P9N8q9l4K02j15M1k04Q2J6k6
$$ plain form
2262 144 79 287 254 377 129 86 300 210 45 333 62 227 14 237 149 202 315 289 274 184 256 142 286 16 335 109 217
2129 217 46 181 223 199 264 259 172 280 146 354 406 240 175 249 252 143 192 136 231 293 190 137 392 169 355 224 266 480 273
1986 273 434 263 161 167 293 345 210 252 1096 1208 100 334 477 370 273 364 184 323 130 117 410 279 393 339 326 294
1858 294 389 394 212 300 376 129 358 254 231 490 382 389 396 511 375 379 531 254 570 482 352 410 481 369 277 491 369 471 561
1716 561 629 585 501 754 481 755 533 733 429 664 531 568 424 641 655 638 745 1388 1720 266 706 1420 1178 1352 1004
1592 1004 1048 901 780 834 920 1034 1243 1945 2176 2203 2874 3382 3382 3809 3907 4096 4266 4023 5547 5660 11369 37036 619247
1479 619247 683350 79162 21688 10944 7731 6764 6121 5439 4761 4387 3860 2759 2680 2053 1420 1325 1060 710 790 1141
1381 1141 944 1225 1018 1289 1558 1458 5479 6768 1600 1030 576 534 428 583 695 622 564 702 937 521 737 701 534
$$ packed form
2262A44o5K08l3J23k48m3K14r0j65K88k71J65k13K23q8N3J13k6j5r0P2j14J44k70L19k26J08
2129B17j71J35M2k4O5nq7J08j34K08N2j66o5P4Lj09M9n6R5O2j03n3K55k23J86j31M2K14k07
1986B73J61j71j02OJ26N2j35M2Q44J12j108K34J43j07r7R1j80J39j93j3K93j31J14n4j3l2
1858B94R5Nj82Q8P6k47K29j04k3K59j08PPJ15j36MJ52k77L16q8j30N8P1j12r2K14j22J02R0
1716E61O8m4q4K53k73K74k22K00l04K35j33L7j44K17J4j7J07O43L32j454M40P14k42J74l48
1592A004M4j47j21N4Q6J14K09P02K31K7O71N08%M27R8J89J70k43J524J13N709K5667N82211
1479F19247O4103o04188n7474j0744l213r67o43o82o78l74n27j101p9o27o33r5k65l50Q0L51
1381A141j97K81k07K71K69j00M021J289n168n70m54m2j06J55J12p3n8J38K35m16K16l6j67
$$ plain form
1268 534 416 427 410 454 451 198 506 545 478 552 535 496 415 347 501 296 398 318 330 162 509 356 228 562 545 218 694 203
1130 203 373 419 71 238 229 295 346 142 302 353 458 342 376 338 299 241 457 357 42 356 138 249 446 209 308 184 387
997 387 316 282 221 298 188 227 464 60 193 101 272 414 271 301 300 191 355 330 342 76 132 146 284 60 79 165 127 470 325
854 325 262 260 272 104 433 161 105 120 207 182 240 204 215 231 199 298 282 312 141 426 246 111 12 106 263 45 348 292 33 242
706 242 203 251 214 461 231 325 280 200 292 29 162 202 25 135 198 238 268 181 340 285 135 241 69 230 74 237 288 41
569 41 239 123 121 303 210 265 316 134 264 219 181 123 181 182 76 248 235 147 351 140 235 327 495 752 463 505 350 57 115 148
421 148 319 174 313 222 150 226 216 225 101 291 85 31 36 82 68 129 165 340 92 385 100 265 249 269 156 126 81 95 76 93
273 93 60 240 128 147 443 208 289 242 261 50 168 284 15 191 153 52 135 258 116 506 108 322 152 285 123 286
$$ packed form
1268E34j18J1j7M4lk53L08L9o7P4j7l9q1o8J54k05J02q0J2j68L47j53j28L34j7l27M76m91
1130B03J70M6l48J67rO6N1k04J60N1J05j16L4l8l9n8K16j00l15L14k18J11J97k37R9j24K03
997C87p1l4o1P7j10L9K37m04J33r2J71J42j43L0jj09J64k5J2k66N6J4J38k24J9Q6l8L43j45
854C25o3kJ2j68L29k72n6J5Q7k5N8l6J1J6l2R9j6L0j71K85j80j35r9R4J57k18L03n6k59K09
706B42l9M8l7K47k30R4m5q0R2k63J33M0j77J10O3M0L0q7J59n5j50J06j72J61j56J63N1k47
569D1J98j16kJ82r3N5N1j82J30m5l8n8N8Jj06J72j3q8K04k11R5R2J68K57k89M2j55k93N8L3
421A48J71j45J39r1p2P6j0Rj24J90k06n4NM6j4O1L6J75k48K93k85J65j6K0j13l0m5J4j9J7
273I3l3J80j12J9K96k35Q1m7J9k11J18J16k69J76l8j01Q3J23j42L90l98K14j70J33j62J63
$$ plain form
145 286 114 122 156 135 241 157 126 332 124 323 381 204 107 186 321 174 184 112 148 54 188 211 282 63 449 240 307 269 405
3 405 108 258 165 259 142 103 326 128 420 141 206 217 249 331 248 268 185 250 75 13 219 152 209 256 329 244 347 168 347 195
-145 195 184 553 75 98 97 277 59 316 170 278 230 258 345 324 279 199 197 234 346 169 4 204 238 238 283 103 179 469 262
-288 262 423 350 216 235 180 307 189 110 301 362 128 240 357 349 374 260 454 416 289 323 385 220 367 200 203 348 480 252
-426 252 608 305 676 321 421 726 528 354 396 541 376 281 582 326 613 450 681 384
$$ packed form
145B86j72QL4k1J06q4l1K06k08J99N8j77r7P9J35j47J0p2L6r4J34K3P1k19L86k09O7l8J36
3D05k97J50r3R4j17l9K23j98K92k79O5J1L2Q2q3K0q3O5j75o2K06o7N7M7P3q5J03j79J79j52
-145A95j1L69m78K3jJ80k18K57j46J08m8K8Q7k1m5q0kL7J12j77j65K00L4%M5j80P6K90k07
-288B62J61p3j34J9n5J27j18p9J91O1k34J12J17qK5j14J94l8j27L4O2j65J47j67LJ45J32k28
-426B52L56l03L71l55J00L05j98j74M2J45j65r5L01k56K87j63K31k97
-514C84
##PAGE=	F1=-1533.13
##FIRST=	4521.1594499999982872,	4521.1594499999982872,	0
##DATA TABLE=	(F2++(Y..Y)), PROFILE
$$ plain form
4521 878 1029 938 867 946 712 997 544 876 541 576 592 701 810 594 574 864 847 634 861 666 640 494 553 450 336 622
4393 622 236 515 515 581 408 553 587 531 607 532 478 360 447 402 200 253 346 368 460 455 320 630 554 456 403 460 429 413 134 329 216
4241 216 238 360 313 453 276 505 404 481 304 411 376 422 137 338 210 244 101 339 280 408 264 522 482 362 224 239
4113 239 529 190 224 262 327 57 104 293 261 544 276 482 257 295 392 281 209 103 194 283 122 229 110 257 372 402 329
3980 329 344 258 356 242 378 165 254 147 454 157 263 313 105 385 395 248 349 223 404 413 119 253 25 207 81 243
3852 243 139 445 195 336 232 377 374 182 297 134 248 141 50 194 235 155 191 321 334 362 305 87 432 284 132 272
3724 272 32 208 115 202 244 48 256 335 290 392 243 89 278 344 232 71 185 64 39 176 122 220 298 327 298 305 195 389
3586 389 208 224 214 67 157 137 147 473 80 247 211 279 251 317 139 390 303 118 49 51 185 71 261 249 246 361 131 123 324
$$ packed form
4521H78J51r1p1P9k34K85m53L32l35L5J6J09J09k16k0K90j7k13K27j95k6j46N9j03j14K86
4393F22l86K79%O6j73J45L4n6P6p5n4j18Q7m5k02N3R3K2R2nj35L10p6r8n3N7l1j6k79J95j13
4241B16K2J22m7J40j77K29j01P7j77J07l5M6k85K01j28L4j43K38n9J28j44K58m0j20j38J5
4113B39K90l39L4L8O5k70M7J89l2K83k68K06k25L8R7j11p2j06R1Q9j61J07j19J47J15L0p3
3980C29J5q6R8j14J36k13Q9j07L07k97J06N0k08K80J0j47J01j26J81Rk94J34k28J82j26J62
3852B43j04L06k50J41j04J45lj92J15j63J14j07r1J44M1q0L6J30J3K8n7k18L45j48j52J40
3724B72k40J76r3Q7M2j96K08P9m5J02j49j54J89O6j12j61J14j21k5J37n4R8P8K9k9Pj10J94
3586C89j81J6j0j47R0k0J0L26l93J67l6O8k8O6j78K51q7j85o9KJ34j14J90j2lJ15k30qK01
$$ plain form
3443 324 275 300 130 362 177 114 44 38 204 79 363 148 172 374 278 131 297 326 46 287 127 75 123 204 143 118 416 260
3305 260 179 254 302 279 151 290 224 147 96 62 28 169 185 231 240 386 126 262 354 168 79 198 119 115 22 159 54 114 180 294
3158 294 232 354 235 111 303 299 252 132 149 187 142 291 219 37 406 341 207 130 382 254 257 239 221 134 32 122 117 189 237 262
3010 262 182 251 381 384 90 305 279 79 234 82 175 129 319 369 750 148 295 186 167 333 297 145 333 117 246 128 238
2877 238 83 174 187 230 230 717 432 786 157 249 235 172 87 13 102 197 225 133 231 225 205 343 222 346 335 207 198 52 131 243 89
2725 89 165 229 213 482 258 329 534 51 330 263 104 274 53 203 64 205 233 370 181 345 382 83 269 220 382 58
2597 58 158 171 174 326 95 312 173 207 210 400 296 262 276 364 213 244 16 279 163 9 263 272 253 394 296 274 176 396 418
2454 418 76 308 17 243 96 26 300 177 245 330 296 418 377 416 56 382 173 251 127 239 141 33 269 365 204 187 427
$$ packed form
3443C24m9K5j70K32j85o3p0oJ66j25K84k15K4K02r6j47J66K9k80K41j60n2M8Q1o1k5K98j56
3305B60q1P5M8k3j28J39o6p7n1l4l4J41J6M6RJ46k60J36R2j86q9J19p9mr3J37j05O0O6J14
3158B94o2J22j19j24J92mm7j20J7L8m5J49p2j82L69o5j34p7K52j28Lj8j8q7j02R0nP2M8K5
3010B62q0O9J30Lk94K15k6k00J55j52R3m6J90N0L81o02J47j09j9J66l6j52J88k16J29j18J10
2877B38j55R1J3M3%M87k85L54o29R2j4o3q5p4Q9R5K8r2R8ok0J38j21J24j1j28rj46P9J12j54
2725H9P6O4j6K69k24P1K05m83K79o7j59J70k21J50j39J41K8J37j89J64L7k99J86m9J62l24
2597E8J00J3LJ52k31K17j39L4LJ90j04l4J4Q8j51L1k28K63j16j54K54Rj9J41r8k2r8K20K2
2454D18l42K32k91K26j47p0K74j23O8Q5l4J22m1L9l60L26k09P8j24J12r8j08K36R6j61j7K40
$$ plain form
2321 427 269 283 441 285 176 427 229 334 92 199 247 259 189 360 379 496 229 242 418 287 145 396 119 294 108
2198 108 294 214 262 449 427 398 293 375 276 436 85 395 163 327 137 270 354 300 337 387 320 415 287 468 520 335 258 353
2060 353 310 288 283 263 333 427 328 254 565 341 498 385 375 618 308 481 313 277 279 419 490 361 415 1112 1303 163 411 638
1922 638 579 400 477 301 418 302 270 531 474 536 527 539 550 561 619 404 518 544 317 554 425 397 678 599 561 606 776 558 632
1779 632 828 465 864 697 621 595 719 582 495 753 603 728 870 877 860 860 1102 841 1142 845 1082 790 965 859 835 768 1003
1647 1003 1103 1128 1271 1782 2060 752 680 2255 2019 1871 1511 1538 1338 1282 1355 1482 1763 2081 3025 3293 3676 4575 5271 5432
1528 5432 6025 6199 6359 6444 5950 7277 8197 17739 58195 983502 1098489 130944 36338 18507 13106 11128 9909
1445 9909 8889 7766 6949 6002 4600 4124 3214 2271 1987 1613 1225 1319 1701 1671 2009 1733 2006 2236 1904 3213 4006 1552
$$ packed form
2321D27j58J4J58j56j09K51j98J05k42J07M8J2p0J71J9J17k67J3J76j31j42K51k77J75j86
2198A08J86q0M8J87k2k9j05Q2r9J60l51L10k32J64j90J33Q4n4L7N0o7R5j28J81N2j85p7R5
2060C53m3k2nk0P0R4r9p4L11k24J57j13j0K43l10J73j68l6KJ40P1j29N4O97J91j140K48K27
1922F38n9j79P7j76J17j16l2K61n7O2rJ2J1J1N8k15J14K6k27K37j29k8K81p9l8M5J70k18P4
1779F32J96l63L99j67p6k6J24j37q7K58j50J25J42Pj7%K42k61L01k97K37k92J75j06k4o7K35
1647A003J00K5J43N11K78j308p2J575k36j48l60K7k00n6P3J27K81L18R44K68L83Q99O96J61
1528E432N93J74J60Q5m94J327R20R542M0456R25307J14987r67545r4606j7831n401j978j219
1445I909j020j123q17r47j402m76r10r43k84l74l88R4L82l0L38k76K73K30l32J309P93k454
$$ plain form
1337 1552 1287 979 904 806 982 1160 964 1007 1146 1344 915 1128 1054 883 707 697 696 673 749 439 807 865 778 831 856 797 702 571
1199 571 741 518 650 466 514 353 692 625 506 763 769 500 911 427 592 604 230 404 353 473 458 347 445 549 697 518
1071 518 598 537 465 419 567 500 159 406 255 359 567 374 457 371 576 520 459 348 428 305 330 511 126 302 195 357 528
938 528 412 444 475 397 522 445 492 191 176 270 363 132 168 243 249 555 488 413 402 426 282 512 274 175 209 218 230 288 288 351 331 338 421
775 421 423 452 40 562 338 211 72 57 288 35 408 366 146 366 332 429 275 522 323 419 348 188 372 47 188 236 92
642 92 251 290 373 400 285 452 386 215 299 105 212 71 326 352 84 316 209 279 413 344 401 424 199 319 243 183 94 179 218
500 218 79 276 339 244 467 246 342 440 525 674 386 305 301 96 116 162 369 232 433 333 256 332 358 290 209 354 117 51 27
357 27 56 141 68 215 454 183 545 197 362 358 348 244 167 101 65 102 155 80 322 217 276 533 241 378 351 376 159 224 294 38
$$ packed form
1337A552k65l08p5r8J76J78j96M3J39J98m29K13p4j71j76j0jk3P6l10L68N8q7N3K5n9r5j31
1199E71J70k23J32j84M8j61L39o7j19K57Ok69M11m84J65J2l74J74n1J20j5j11R8J04J48j79
1071E18Q0o1p2m6J48o7l41K47j51J04K08j93Q3q6K05n6o1j11Q0j23K5J81l85J76j07J62J71
938E28j16L2L1p8J25p7M7l01j5R4R3k31L6P5OL06o7p5j1K4j44K30k38r9L4RJ2N8%O3k0PQ3
775D21KK9m12N22k24j27j39j5K31k53L73m2k20K20l4R7j54K47j99R6p1j60J84l25J41M8j44
642I2J59L9Q3K7j15J67o6j71Q4j94J07j41K55K6k68K32j07P0J34o9N7K3k25J20p6o0q9Q5L9
500B18j39J97O3r5K23k21R6R8Q5J49k88q1mk05K0M6K07j37K01j00p7P6K6o8q1J45k37o6k4
357B7K9Q5p3J47K39k71L62l48J65mj0j04p7o6l6L7N3p5K42j05N9K57k92J37k7K5k17O5P0k56
$$ plain form
209 38 191 171 110 221 351 207 621 210 398 292 431 181 315 193 141 162 116 228 155 205 437 218 449 500 333 235 248
76 248 421 223 242 103 174 49 197 300 393 145 539 304 395 344 494 134 309 290 270 130 179 367 34 540 239 294 366
-56 366 441 431 400 315 295 301 112 103 255 178 252 354 443 360 469 312 502 358 233 665 206 167 119 334 122 377 260 400 341
-199 341 413 530 472 431 345 362 320 434 234 94 272 316 405 385 272 354 642 417 614 491 410 355 355 401 317 174 442 468 267
-342 267 451 533 545 599 499 630 600 486 466 550 334 548 349 402 508 696 487 859 613 927 561 758 935 813 612 632
-470 632 781 590 517 822 611 880 781 951 739
$$ packed form
209C8J53k0o1J11J30j44M14m11J88j06J39k50J34j22n2K1m6J12p3N0K32k19K31N1j67r8J3
76B48J73j98J9j39P1j25J48J03R3k48L94k35R1n1J50l60J75j9k0j40M9J88l33N06l01N5P2
-56C66P5j0l1q5k0Oj89rJ52p7P4J02Q9q3J09j57J90j44j25M32m59l9m8K15k12K55j17J40n9
-199C41P2J17n8m1q6J7m2J14k00j40J78M4Q9k0j13Q2K88k25J97j23q1n5%M6q4j43K68K6k01
-342B67J84Q2J2N4j00J31l0j14k0Q4k16K14j99N3J06J88k09L72k46L14l66J97J77j22k01K0
-470F32J49j91p3L05k11K69r9J70k12
-514G39
##PAGE=	F1=-1542.98
##FIRST=	4521.1594499999982872,	4521.1594499999982872,	0
##DATA TABLE=	(F2++(Y..Y)), PROFILE
$$ plain form
4521 1209 1338 1299 1167 1241 1013 1296 783 1132 748 795 822 925 1032 879 832 1114 1136 877 1108 927 851 660 787 587 461
4398 461 800 358 662 709 731 604 791 763 758 811 728 586 534 559 535 290 369 428 521 593 607 500 802 686 644 581 553 569 508 256
4250 256 375 333 319 486 426 519 449 627 604 587 464 532 478 554 193 428 256 338 171 387 439 509 413 629 601 519 329 397 619
4108 619 238 269 368 357 102 172 401 364 687 362 623 369 461 485 403 226 189 241 326 177 276 188 342 457 576 403 457 397
3970 397 426 338 446 263 257 91 473 107 300 413 191 496 476 369 485 331 466 478 100 286 43 235 51 278 192 565
3842 565 309 405 326 471 495 287 342 236 258 176 83 215 270 232 257 431 416 495 335 270 496 372 161 313 68 212 106 232
3704 232 262 151 286 445 391 527 308 190 331 440 228 98 153 17 30 244 216 296 399 401 395 376 294 476 181 269 266 58
3566 58 174 117 130 508 207 300 308 367 337 409 232 438 371 129 49 70 197 131 263 285 367 395 250 205 419 325 378 171 408 236
$$ packed form
4521A209J29l9j32P4k28K83n13L49l84M7K7J03J07j53m7K82K2k59K31j81p6j91J27k00j26
4398D61L39m42L04M7K2j27J87k8nN3q3j42n2K5k4k45P9N9R3P2J4j07L02j16m2o3k8J6o1k52
4250B56J19m2j4J67o0R3p0J78k3j7j23O8n4P6l61K35j72Q2j67K16N2P0r6K16k8q2j90O8K22
4108F19l81L1R9j1k55P0K29l7L23l25K61k54R2K4q2j77l7N2Q5j49R9q8J54J15J19j73N4o0
3970C97K9q8J08j83oj66L82l66J93J13k22L05k0j07J16j54J35J2l78J86k43J92j84K27q6L73
3842E65k56R6p9J45K4k08N5j06K2q2r3J32N5l8K5J74j5P9j60o5K26j24k11J52k45J44j06J26
3704B32L0j11J35J59n4J36k19j18J41J09k12j30N5j36J3K14k8Q0J03Koj9q2J82k95Q8lk08
3566E8J16n7J3L78l01R3QN9l0P2j77K06o7k42q0K1J27o6J32K2Q2K8j45m5K14r4N3k07K37j72
$$ plain form
3419 236 108 25 100 266 129 411 234 273 477 345 229 342 359 138 297 124 85 128 241 113 162 467 330 282 335 395 365
3286 365 226 357 267 171 101 63 57 235 227 293 288 471 239 379 410 206 180 250 112 108 63 196 37 158 223 427 274 429 340 207
3138 207 393 363 284 71 143 205 160 293 276 101 467 464 279 217 467 309 328 283 302 102 48 108 133 231 280 330 251 298 497 511
2990 511 120 383 296 27 259 67 185 120 359 362 681 209 412 300 268 403 396 165 401 150 247 161 245 145 205 230 333
2857 333 108 954 401 945 166 334 252 191 110 28 95 177 284 201 307 336 264 426 331 452 402 196 235 109 147 259 94 180
2720 180 330 148 590 378 419 584 166 401 362 123 309 36 235 8 272 209 433 248 466 457 180 387 291 468 111
2597 111 219 241 194 346 98 449 215 275 340 450 442 318 328 432 275 317 84 281 210 39 297 367 360 490 356 381 245 515
2459 515 526 65 369 44 272 146 81 324 268 311 396 361 548 433 534 171 446 289 301 159 307 183 48 402 451 296
$$ packed form
3419B36j28q3P5J66j37K82j77L9K04j32j16J13J7k21J59j73l9M3J13j28M9L05j37m8N3O0l0
3286C65j39J31r0r6p0l8oJ78qO6nJ83k32J40L1k04k6P0j38mm5J33j59J21O5K04j53J55q9j33
3138B07J86l0p9k13P2O2m5J33j7j75L66lj85o2K50j58J9m5J9k00n4O0K5R8M9N0p9M7J99J4
2990E11l91K63q7k69K32j92J18o5K39LL19m72K03j12l2J35pk31K36k51R7q6Q4j00O0K5J03
2857C33k25Q46n53N44p79J68q2o1q1q2O7Q2J07q3J06K9p2J62r5J21n0k06L9j26L8J12j65Q6
2720A80J50j82M42k12M1J65m18K35l9k39J86k73J99k27K64o3K24j85K18rk77K07r6J77l57
2597A11J08K2m7J52k48L51k34O0O5J10qj24J0J04j57M2k33J97p1j71K58P0pJ30j34K5j36K70
2459E15J1m61L04l25K28j26o5K43n6M3Q5l5J87j15J01l63K75j57J2j42J48j24j35L54M9j55
$$ plain form
2331 296 306 539 402 349 610 384 256 475 210 394 129 241 309 384 313 430 503 611 325 401 533 356 255 437 191 353
2203 353 218 342 290 336 582 566 504 411 485 413 576 178 448 211 431 229 355 492 396 407 515 472 544 438 590 621 453
2070 453 352 464 364 431 371 389 438 558 470 382 726 507 641 553 490 734 399 530 379 388 409 536 630 537 618 985 1303 404
1932 404 518 797 769 527 590 419 515 482 434 648 686 666 717 750 794 740 835 595 729 701 515 743 599 571 857 814 731 819 1028
1789 1028 752 885 1118 688 1134 900 911 790 944 792 713 1004 841 973 1188 1138 1165 1210 1439 1194 1501 1166 1420 1142 1284
1666 1284 1177 1135 1116 1365 1546 1585 1736 2038 2195 1973 1453 2940 2696 2298 2004 2023 1786 1787 1866 2060 2475 2930 4074 4485 5166
1543 5166 6250 7088 7441 8165 8416 8531 8488 7723 8681 10560 23979 78789 1338937 1507814 183240 51359 26256
1460 26256 18596 15533 13697 12296 10734 9465 8087 6400 5523 4323 3139 2570 2150 1753 1866 2223 2397 2790 2466
$$ packed form
2331B96J0K33j37n3K61k26j28K19k65J84k65J12O8P5p1J17P3J08k86P6J32j77j01J82k46J62
2203C53j35J24n2M6K46j6o2r3P4p2J63l98K70k37K20k02J26J37r6J1J08m3P2j06J52L1j68
2070D53j01J12j00O7o0J8M9J20q8q8L44k19J34q8o3K44l35J31j51RK1J27R4r3Q1L67L18q99
1932D04J14K79k8k42O3j71R6l3m8K14L8k0N1L3M4n4R5k40J34k8j86K28j44k8K86m3q3Q8K09
1789A028k76J33K33m30M46k34J1j21J54j52p9K91j63J32K15n0K7M5K29k45L07l35K54k78J42
1666A284j07m2j9K49J81L9J51L02J57k22n20J487k44l98k94J9k37JP9J94M15M55J144M11O81
1543E166J084Q38L53P24K51J15m3p65R58J879J3419N4810J260148J68877j324574j31881k5103
1460B6256p660l063j836j401j562j269j378j687q77j200j184n69m20l97J13L57J74L93l24
$$ plain form
1366 2466 2693 2844 2246 1832 3929 1287 1557 1394 1308 1204 1377 1637 1310 1459 1594 1736 1307 1520 1386 1223 1014 965 988
1253 988 885 1031 691 1104 1168 1085 1101 1181 1078 997 804 961 745 892 615 691 545 865 896 790 955 998 780 1102 647 817
1125 817 787 401 567 485 637 574 552 592 745 925 693 812 728 638 603 663 640 319 455 392 510 677 531 621 565 756 721 635
987 635 477 554 442 456 539 229 411 312 455 651 560 583 646 600 681 557 631 306 255 392 437 210 266 322 385 638 667 570 540 562
839 562 460 588 405 251 307 234 272 336 385 475 448 466 549 565 589 173 689 426 302 165 65 308 58 458 436 293 486 457
702 457 609 361 600 441 498 417 183 463 99 206 294 173 379 393 505 522 407 568 480 318 352 237 196 70 397 409 164
569 164 394 315 434 509 488 538 529 292 362 266 190 82 179 248 141 315 445 355 557 378 449 566 370 461 400 234 212 149 87 189
421 189 399 312 550 451 366 423 515 369 318 405 189 71 32 29 224 113 264 556 291 686 326 444 469 432 340 202 134 31
$$ packed form
1366B466K27J51n98m14K097k642K70j63q6j04J73K60l27J49J35J42m29K13j34j63k09m9K3
1253I88j03J46l40M13O4q3J6Q0j03q1j93J57k16J47k77P6j46L20L1j06J65M3k18L22m55J70
1125H17l0l86J66q2J52o3k2M0J53J80k32J19q4r0l5O0k3l21J36o3J18J67j46R0n6J91l5q6
987F35j58P7j12J4Q3l10J82r9J43J96r1K3O3m6Q1j24P4l25n1J37M5k27N6N6O3K53K9r7l0K2
839E62j02J28j83j54N6p3L8O4M9R0k7J8Q3J6K4m16N16k63j24j37j00K43k50M00k2j43J93k9
702D57J52k48K39j59N7q1k34K80l64J07Q8j21K06J4J12J7j15J61q8j62L4j15m1j26L27J2k45
569A64K30p9J19P5k1N0rk37P0r6p6j08R7O9j07J74J30r0K02j79P1J17j96R1o1j66k2o3o2J02
421A89K10q7K38r9q5N7R2j46n1Q7k16j18l9lJ95j11J51K92k65L95l60J18K5l7r2j38o8j03
$$ plain form
283 31 116 220 122 390 319 402 607 376 460 454 478 272 296 294 92 173 194 174 304 436 307 719 387 473 428 574 243 339 302 150
135 150 156 127 198 216 292 537 336 573 600 472 369 315 522 269 293 92 223 117 219 421 490 262 632 413 521 435 580
3 580 252 361 411 272 128 255 405 70 642 361 403 515 625 515 560 356 420 359 138 199 291 230 308 448 556 493 596 468
-135 468 648 508 301 757 343 232 154 371 209 442 355 523 474 572 716 612 578 490 522 412 510 308 198 330 392 575
-263 575 479 450 530 799 580 794 628 598 474 529 489 441 227 589 565 431 655 702 744 811 743 799 793 679 615 708 446 715 500
-406 500 612 660 904 740 1093 919 1168 806 1098 1120 1087 885 855 1009 809 767 1043 886 1147 1107 1210 1099
-514 1099
$$ packed form
283C1Q5J04r8K68p1Q3K05k31Q4oK4k06K4kk02Q1K1k0J30J32j29M12l32Q6m5J46l31R6l7j52
135A50Ok9P1J8P6K45k01K37K7j28j03n4K07k53K4k01J31j06J02K02O9k28L70k19J08q6J45
3E80l28J09N0j39j44J27J50l35N72k81M2J12J10j10M5k04O4o1k21O1R2o1P8J40J08o3J03j28
-135D68J80j40k07M56m14j11p8K17j62K33q7J68m9R8J44j04l4q8L2j10R8k02j10J32O2J83
-263E75r6k9Q0K69k19K14j66l0j24N5m0m8k14L62k4j34K24M7M2O7o8N6oj14o4R3k62K69k15
-406E00J12M8K44j64L53j74K49l62K92K2l3k02l0J54k00m2K76j57K61m0J03j11
-514A099
##PAGE=	F1=-1552.82
##FIRST=	4521.1594499999982872,	4521.1594499999982872,	0
##DATA TABLE=	(F2++(Y..Y)), PROFILE
$$ plain form
4521 1481 1580 1604 1406 1473 1269 1522 992 1337 924 972 1009 1120 1197 1126 1053 1318 1374 1082 1292 1149 1015 809 970 709 575 928
4393 928 481 767 868 852 778 996 898 944 978 889 678 676 632 644 384 465 493 648 700 730 672 923 794 799 737 624 691 569 369 396
4246 396 432 395 586 523 567 606 711 786 665 598 621 579 656 247 493 293 419 240 422 576 583 561 708 680 655 433 522 680 274
4103 274 307 447 374 155 235 495 448 794 437 735 466 599 546 513 234 287 275 353 239 303 269 422 523 714 451 567 510
3970 510 484 426 499 345 252 54 474 96 337 498 261 580 551 474 595 426 496 530 138 307 62 265 75 313 225 661
3842 661 425 463 396 554 592 377 371 343 250 213 125 220 307 293 308 515 489 599 354 436 533 440 202 343 130 196 85 272 279 260
3694 260 306 528 473 647 355 296 372 512 214 156 119 83 50 301 293 361 480 472 469 433 375 549 199 311 300 57 186 84 123 518
3547 518 330 345 387 443 412 476 329 459 426 141 86 72 191 212 255 309 474 412 359 284 488 366 446 214 444 278 89 9 154
$$ packed form
4521A481R9K4j98O7k04K53n30L45m13M8L7J11P7p1p3K65N6k92K10j43j34k06J61k61j34L53
4393I28m47K86J01j6p4K18r8M6L4q9k11km4J2k60Q1K8J55N2L0n8K51j29No2j13O7j22k00K7
4246C96L6l7J91o3M4L9J05P5j21o7K3m2P7m09K46k00J26j79J82J54Pk2J47k8k5k22Q9J58m06
4103B74L3J40p3k19Q0K60m7L46l57K98k69J33n3l3k79N3j2P8j14O4l4J53J01J91k63J16n7
3970E10k6n8P3j54r3j98M20l78K41J61k37L19k9p7J21j69P0L4l92J69k45K03j90K38q8M36
3842F61k36L8o7J58L8k15ok8r3l7q8R5Q7j4J5K07k6J10k45Q2R7r3k38J41k13O6j11J87Pj9
3694B60M6K22n5J74k92n9P6J40k98n8l7l6l3K51qO8J19qll6n8J74l50J12j1k43J29j02L9L95
3547E18j88J5M2N6l1O4j47J30l3k85n5j4J19K1M3N4J65o2n3p5K04j22Q0k32K30j66j89q0J45
$$ plain form
3404 154 304 189 439 310 357 559 395 329 371 374 226 296 116 102 131 261 120 237 502 386 372 401 465 429 290 411 296
3271 296 192 94 38 95 296 252 352 335 519 344 479 449 234 282 280 101 115 88 215 53 240 253 544 297 492 426 290 466
3133 466 406 306 60 119 211 178 282 332 169 510 563 340 300 533 359 391 315 363 57 83 104 147 271 308 389 328 334 599 613 147
2985 147 456 302 55 267 53 183 101 376 348 561 284 511 388 349 468 466 183 456 176 237 174 233 208 213 288 416 21
2853 21 1143 405 1085 181 424 262 221 133 49 104 165 336 264 366 453 301 491 427 531 461 199 258 157 165 265 117 190 466
2715 466 90 657 473 492 607 288 445 460 148 325 28 257 71 331 199 484 307 553 514 282 490 349 534 151
2597 151 282 294 217 343 106 565 246 333 446 484 555 372 378 488 329 375 155 270 247 82 307 459 446 567 406 468 306
2464 306 616 613 89 420 68 290 206 181 323 363 352 455 416 652 490 628 284 476 391 335 190 357 217 130 508 512 366
$$ packed form
3404A54J50j15K50j29M7K02j64o6M2Lj48P0j80j4K9J30j41J17K65j16j4K9O4l6j39J21j15
3271B96j04r8n6N7K01m4J00j7J84j75J35l0k15M8kj79J4k7J27j62J87J3K91k47J95o6j36J76
3133D66o0j00k46N9R2l3J04N0j63L41N3k23m0K33j74L2p6M8l06K6K1M3J24L7Q1o1OK65J4m66
2985A47L09j54k47K12k14J30q2K75k8K13k77K27j23l9J19kk83K73k80O1o3N9k5NP5J28l95
2853B1J122p38O80r04K43j62m1q8q4N5O1J71p2J02Q7j52J90o4J04p0k62N9j01QJ00j48P3K76
2715D66l76N67j84J9J15l19J57J5l12J77k97K29j86K60j32K85j77K46l9k32K08j41J85l83
2597A51J31J2p7J26k37M59l19Q7J13L8P1j83OJ10j59M6k20J15k3j65K25J52j3J21j61O2j62
2464C06L10ln24L31l52K22q4k5J42M0j1J03l9K36j62J38l44J92q5n6j45J67j40q7L78Mj46
$$ plain form
2331 366 421 632 513 398 751 457 356 487 189 440 178 269 347 500 419 487 605 705 397 541 626 403 359 449 265 392
2203 392 317 373 359 405 689 682 577 512 565 531 683 267 488 239 517 305 418 611 475 459 626 601 646 563 693 690 561 433
2065 433 555 401 552 441 492 526 663 590 488 850 641 759 696 586 805 503 568 450 478 530 624 747 695 794 818 1365 622
1932 622 617 912 911 637 680 517 596 639 574 733 867 764 876 923 989 892 1007 751 899 822 689 891 744 718 1000 991 865 996
1794 996 1228 919 1094 1356 880 1337 1058 1166 953 1121 965 894 1203 1039 1166 1454 1352 1433 1490 1706 1486 1772 1439 1691
1676 1691 1429 1562 1432 1407 1399 1656 1904 1921 2067 2208 2200 3086 2373 3337 3094 2607 2423 2424 2166 2204 2276 2552 3050 3645 4923 5502
1548 5502 6397 7621 8542 9083 9877 10191 10246 10054 9041 9524 12350 29061 95427 1626943 1844216 227600 64346
1464 64346 32959 23327 19267 16865 15103 13174 11528 9767 7866 6646 5197 3894 2979 2579 2199 2335 2628 2996
$$ packed form
2331C66N5K11j19j15L53k94j01J31k98K51k62R1P8J53q1O8J18J00l08J44Q5k23m4R0j84J27
2203C92p5N6j4M6K84pj05o5N3l4J52m16K21k49K78k12J13J93j36j6J67k5M5q3J30lj29j28
2065D33J22j54J51j11N1L4J37p3j02L62k09J18o3j10K19l02O5j18K8N2R4J23n2R9K4N47p43
1932F22nK95jk74M3j63P9M3o5J59J34j03J12M7O6r7J15k56J48p7j33K02j47k6K82rj26J31
1794I96K32l09J75K62m76M57k79J08k13J68j56p1L09j64J27K88j02Q1N7K16k20K86l33K52
1676A691k62J33j30k5qK57K48J7J46J41qQ86p13R64k43m87j84Jk58L8P2K76M98N95J278N79
1548E502Q95J224R21N41P94L14N5j92j013M83K826J6711O6366J531516K17273j616616j63254
1464F4346l1387r632m060k402j762j929j646j761j901j220j449j303r15m00l80J36K93L68
$$ plain form
1376 2996 3428 3096 3243 3305 2507 4797 8042 1130 1829 1731 1658 1540 1687 2039 1594 1837 1970 2042 1628 1848 1643 1493 1278
1263 1278 1185 1234 1053 1252 911 1348 1403 1349 1318 1462 1286 1252 1003 1125 937 1081 739 829 703 998 1125 1034 1106 1192 1010 1235
1135 1235 826 1009 937 552 696 602 751 673 726 721 906 1102 839 981 881 785 751 726 753 448 490 514 651 751 654 773 728 898
997 898 882 783 576 659 561 569 541 315 501 424 542 752 688 695 785 763 808 644 732 400 340 484 490 281 353 384 509 702 821 706
849 706 654 655 607 649 512 317 396 245 304 374 479 563 565 560 657 684 695 308 782 500 371 254 125 322 87 490 491 436 584 557
702 557 758 445 674 543 551 479 180 545 143 208 364 250 488 488 609 619 518 659 552 416 388 354 188 59 434 449 235
569 235 456 426 551 576 618 642 613 379 392 288 205 107 183 260 208 357 527 452 608 503 539 668 457 306 457 718 254 168
431 168 58 239 410 400 640 553 461 480 659 443 403 434 258 81 51 28 291 209 303 626 393 786 458 496 564 497 427 227
$$ packed form
1376B996M32l32J47O2p98K290L245o912O99r8p3j18J47L52m45K43J33P2m14K20k05j50k15
1263A278r3M9j81J99l41M37N5n4l1J44j76l4k49J22j88J44l42R0j26K95J27r1P2Q6j82K25
1135A235m09J83p2l85J44r4J49p8N3nJ85J96k63J42j00r6l4k5K7l05M2K4J37J00r7J19m5J70
997H98j6r9k07Q3r8Qk8k26J86p7J18K10o4PR0k2M5j64Q8l32o0J44Ok09P2L1J25J93J19j15
849G06n2Jm8M2j37j95P9j51N9P0J05Q4KnR7K7J1l87M74k82j29j17j29J97k35M03Jn5J48k7
702E57K01l13K29j31Qp2k99L65m02O5J56j14K38%J21J0j01J41j07j36k8l4j66j29L75J5k14
569B35K21l0J25K5M2K4k9k34J3j04q3r8P6P7n2J49J70p5J56j05L6J29k11j51J51K61m64q6
431A68j10J81J71j0K40q7r2J9J79k16m0L1j76j77l0k3K63q2R4L23k33L93l28L8O8o7p0k00
$$ plain form
293 227 178 28 121 270 176 433 420 500 655 523 521 538 550 370 365 288 140 144 210 236 375 495 399 780 560 533 536 691 297 354 403
140 403 144 141 170 155 306 373 613 451 671 664 598 486 366 609 297 329 82 272 175 246 542 559 376 701 529 639 513 642
3 642 370 406 503 269 134 316 433 165 707 472 505 638 773 571 697 383 527 413 149 285 320 294 357 523 645 612 706
-130 706 603 762 621 377 813 461 283 195 378 291 498 436 630 586 709 870 723 697 608 652 487 563 374 295 366 455 720
-263 720 550 611 677 915 722 933 742 745 574 678 558 542 263 720 630 583 822 835 914 976 948 933 960 836 738 835 537 840
-401 840 628 799 778 1073 960 1277 1174 1359 1008 1388 1245 1311 1131 1028 1187 993 991 1209 1108 1375 1374 1417 1406
-514 1406
$$ packed form
293B27m9j50R3J49r4K57j3Q0J55j32kJ7J2j80np7j48MO6K6J39J20r6L81k20k7LJ55l94N7M9
140D03k59lK9j5J51O7K40j62K20po6j12j20K43l12L2k47J90r7P1K96J7j83L25j72J10j26J29
3F42k72L6R7k34j35J82J17k68N42k35L3J33J35k02J26l14J44j14k64J36L5k6O3J66J22l3R4
-130G06j03J59j41k44M36l52j78q8J83q7K07o2J94m4J23J61j47k6q9M4j65P6j89p9P1Q9K65
-263G20j70O1O6K38j93K11j91Lj71J04j20j6k79M57r0m7K39J3P9O2k8j5K7j24r8R7k98L03
-401H40k12J71k1K95j13L17j03J85l51L80j43O6j80j03J59j94kK18j01K67jM3j1
-514A406
##PAGE=	F1=-1562.67
##FIRST=	4521.1594499999982872,	4521.1594499999982872,	0
##DATA TABLE=	(F2++(Y..Y)), PROFILE
$$ plain form
4521 1649 1711 1804 1545 1605 1434 1638 1136 1456 1037 1084 1117 1249 1279 1292 1200 1434 1521 1213 1385 1296 1102 915 1074 795 657 982
4393 982 584 808 963 924 896 1138 965 1063 1076 987 736 762 655 709 465 524 526 728 763 798 805 974 855 896 846 658 771 579 456
4250 456 391 492 458 643 587 584 721 739 922 700 686 657 660 710 283 520 310 474 300 435 673 613 673 744 702 748 515 595 702
4108 702 291 335 486 374 202 280 553 497 846 487 797 531 693 560 591 226 372 287 358 292 308 339 484 560 789 465 649
3975 649 580 511 486 528 399 234 72 452 126 368 554 298 625 605 539 663 493 485 557 194 312 77 288 128 339 228
3847 228 714 511 496 426 614 646 439 376 419 224 245 160 206 341 332 333 558 543 656 354 560 538 473 236 354 186 162 57 311
3704 311 290 347 309 567 519 733 374 383 396 550 186 210 86 130 60 337 340 402 528 524 507 465 429 594 233 341 307 69 190 46
3556 46 120 498 430 374 438 490 460 505 406 448 457 152 122 57 171 282 239 315 546 409 440 343 523 389 490 236 462 296 67
$$ packed form
4521A649O2R3k59O0j71K04n02L20m19M7L3J32L0J3r2K34Q7l08J72q9j94j87J59k79j38L25
4393I82l98K24J55l9k8K42j73R8J3q9k51K6j07N4k44N9KK02L5L5PJ69j19M1n0j88J13j92j23
4250D56o5J01l4J85n6lJ37J8J83k22j4k9LN0m27K37k10J64j74J35K38o0O0P1m2M6k33Q0J07
4108G02m11M4J51j12j72P8K73n6L49l59L10k66J62j33L1l65J46q5P1o6J6L1J45P6K29l24J84
3975F49o9o9k5M2j29j65j62L80l26K42J86k56L27k0o6J24j70qP2l63J18k35K11j60K11j11
3847B28M86k03j5p0J88L2k07o3M3j95K1q5M6J35rJK25j5J13l02K06k2o5k37J18j68k4j05K54
3704C11k1N7l8K58m8K14l59RJ3J54l64K4j24M4p0K77LO2J26mj7m2l6J65l61J08l4k38J21j44
3556D6P4L78o8n6O4N2l0M5r9M2Rl05l0o5J14J11m3P6K31j37L1r7J80j34J01k54K26j66k29
$$ plain form
3414 67 31 193 313 251 438 366 411 603 420 406 378 362 298 284 107 115 132 257 160 309 513 420 434 440 503 460 334 444 306 204
3266 204 73 11 116 343 250 396 376 521 424 544 457 249 362 285 86 123 90 213 87 312 263 624 298 532 475 349 510
3133 510 421 309 113 83 203 186 254 379 224 533 619 377 366 567 383 435 326 394 16 122 102 155 303 313 425 388 346 666
2995 666 672 163 511 296 106 259 41 168 78 364 351 402 341 575 437 396 513 497 195 487 192 214 162 204 258 197 350 470
2857 470 144 1252 490 1175 188 502 260 242 150 69 116 162 371 310 392 556 306 522 494 565 501 211 256 191 179 259 142 201
2720 201 586 82 675 530 533 596 381 455 536 166 316 46 266 121 370 210 513 342 593 544 362 558 387 567 172
2597 172 339 322 235 319 117 640 263 369 514 492 617 417 411 515 367 410 204 248 266 123 289 535 496 611 435 518 343
2464 343 680 663 115 449 83 292 252 260 295 453 359 491 450 708 535 678 378 464 467 341 211 386 233 210 570 539 399
$$ packed form
3414F7l6J62J20o2J87p2M5J92j83j4k8j6o4j4j77QJ7J25r7J49K04r3J4OO3m3j26J10j38j02
3266B04j31o2J05K27r3J46k0J45r7J20q7k08J13p7j99L7l3J23j26K25m9L61l26K34n7j26J61
3133E10q9j12j96l0J20j7O8J25j55L09Q6k42j1K01j84N2j09O8l78J06k0N3J48J0J12l7m2L20
2995F66On09L48k15j90J53k18J27r0K86j3N1o1K34j38m1J17j6l02K92k95K2n2M2N4o1J53J20
2857D70l26J108p62O85r87L14k42j8r2q1M7M6K09o1Q2J64k50K16k8P1o4k90M5o5j2Q0j17N9
2720B01L85n04N93j45LO3k15P4Q1l70J50k70K20j45K49j60L03j71K51m9j82J96j71J80l95
2597A72J67j7q7Q4k02N23l77J06J45k2J25k00oJ04j48M3k06M4J8j43J66K46l9J15j76Q3j75
2464C43L37j7n48L34l66K09m0QL5J58r4J32m1K58j73J43l00Q6Lj26j30J75j53k3L60l1j40
$$ plain form
2331 399 516 687 582 421 842 488 447 460 177 459 226 274 355 588 490 521 667 761 432 639 681 415 444 428 324 402 388
2198 388 386 404 449 747 755 607 579 598 610 742 334 508 240 572 354 441 690 523 479 706 680 702 640 757 715 635 485 606 411
2055 411 633 483 556 580 723 667 554 912 721 831 790 642 813 583 577 509 537 619 665 825 802 896 685 1565 759 673 954 983
1917 983 711 730 577 641 753 660 768 984 812 975 1027 1105 986 1106 845 998 887 809 971 831 810 1080 1099 934 1103 1343
1789 1343 1023 1222 1501 1004 1440 1140 1338 1050 1223 1069 1003 1314 1162 1275 1619 1472 1608 1656 1854 1674 1905 1614 1847 1603
1671 1603 1745 1579 1593 1561 1818 2112 2080 2221 2346 2183 3797 3066 3387 3174 2783 2698 2663 2400 2454 2506 2867 3388 4101 5427 6135
1548 6135 7140 8444 9381 10073 10859 11207 11198 10860 9669 9656 13254 32094 105185 1796801 2048645 256305 73049
1464 73049 37460 26491 21678 18854 16822 14656 12782 10740 8747 7294 5686 4401 3152 2822 2477 2633 2857 3361
$$ packed form
2331C99J17J71j05j61M21l54m1J3k83K82k33M8Q1K33r8L1J46R4l29K07M2k66K9j6j04P8j4
2198C88kJ8M5K98Qj48k8J9J2J32m08J74k68L32k18Q7K49j67m4K27k6K2o2J17m2q0j50J21j95
2055D11K22j50P3K4J43n6j13L58j91J10m1j48J71k30oo8K8Q2M6J60k3R4k11Q80q06q6K81K9
1917I83k72J9j53O4J12r3J08K16j72J63N2P8j19J20k61J53j11p8J62j40k1K70J9j65J69K40
1789A343l20J99K79m97M36l00J98k88J73j54o6L11j52J13L44j47J36M8J98j80K31k91K33k44
1671A603J42j66J4l2K57K94l2J41J25j63J614p31L21k13l91q5l5k63N4N2L61N21P13J326P08
1548F135J005J304R37O92P86L48rl38j191j3L598J8840P3091J691616K51844j792340j83256
1464G3049l5589j0969m813k824k032k166j874k042j993j453j608j285j249l30l45J56K24N04
$$ plain form
1376 3361 3797 3514 3566 3561 2725 5938 9846 1244 2033 1907 1867 1736 1844 2286 1759 2068 2204 2201 1818 2055 1779 1642 1449 1317
1258 1317 1389 1144 1375 1059 1494 1530 1521 1441 1654 1377 1423 1130 1206 1056 1182 814 902 798 1063 1274 1198 1185 1312 1153 1281 931
1130 931 1132 1025 660 768 682 794 738 841 810 1002 1199 928 1071 971 875 833 745 820 525 500 599 747 768 726 883 834 975
997 975 970 885 622 722 638 644 513 361 559 509 600 806 771 762 870 857 882 689 778 456 406 532 510 334 416 413 602 730 917 797
849 797 722 690 697 684 571 364 460 239 324 389 552 597 662 604 722 762 749 405 823 549 408 326 179 334 108 495 520 552 644
706 644 612 852 506 719 602 571 520 170 600 173 192 427 308 557 559 663 675 597 702 590 485 402 437 188 42 430 466
574 466 283 490 528 608 604 710 691 661 438 409 300 227 144 191 251 261 391 565 520 614 594 599 704 783 366 531 1106 362 144 82
426 82 291 403 478 687 617 527 493 767 495 449 436 304 81 74 49 328 293 326 649 468 830 568 509 623 527 486 238 225 68
$$ packed form
1376C361M36k83N2nq36L213L908q602P89j26m0j31J08M42n27L09J36ll83K37k76j37j93j32
1258A317P2k45K31l16M35L6rq0K13k77M6k93P6j50J26l68Q8j04K65K11p6j3J27j59J28l50
1130I31K01j07l65J08q6J12n6J03l1J92J97k71J43j00r6m2q8P5k95k5R9J48K1m2J57m9J41
997I75nq5k63J00q4Oj31j52J98n0R1K06l5rJ08j3K5j93Q9l22n0J26k2j76Q2lJ89J28J87j20
849G97p5l2Pj3j13k07R6k21Q5O5J63M5O5n8J18M0j3l44M18k74j41q2j47J55k26L87K5L2R2
706F44l2K40l46K13j17l1n1l50M30m27J9K35j19K49KJ04J2p8J05j12j05q3L5k49j46L88L6
574D66j83K07L8Q0mJ06j9l0k23k9j09p3q3M7O0J0J30J74m5R4k0NJ05P9m17J65N75p44k18o2
426H2K09J12P5K09p0r0l4K74k72m6j3j32k23pk5K79l5L3L23j81L62k62n9J14r6m1k48j3j57
$$ plain form
283 68 126 297 228 440 507 547 669 632 552 587 577 437 416 274 175 109 210 291 422 513 469 788 695 565 599 764 329 355 475 125
135 125 120 220 104 387 436 652 538 723 681 687 568 387 665 297 344 81 303 212 267 636 589 466 722 619 715 561 661
3 661 457 433 551 261 136 354 444 239 723 555 575 712 863 590 786 390 591 455 150 349 336 353 381 561 692 690 776
-130 776 695 826 679 445 820 539 309 231 356 353 532 486 707 648 801 965 784 769 677 733 528 583 416 373 374 495 818 587
-268 587 726 770 971 819 1007 813 822 637 778 596 604 277 813 648 699 928 906 1028 1067 1078 1008 1071 927 810 909 591 907
-401 907 712 934 843 1174 1106 1386 1334 1465 1133 1580 1284 1450 1309 1120 1286 1111 1149 1289 1240 1523 1538 1535 1612
-514 1612
$$ packed form
283F8N8J71o9K12O7M0J22l7q0L5j0j40k1j42r9o6J01Q1J31R1m4L19r3j30L4J65m35K6J20l50
135A25nJ00j16K83M9K16j14J85m2Oj19j81K78l68M7k63K22r1N5L69m7j23K56j03R6j54J00
3F61k04k4J18k90j25K18R0k05M84j68K0J37J51k73J96l96K01j36l05J99j3J7K8J80J31kQ6
-130G76q1J31j47k34L75k81k30p8J25lJ79m6K21n9J53J64j81j5r2N6k05N5j67m3JJ21L23k31
-268E87J39M4K01j52J88j94Rj85J41j82Ql27N36j65N1K29k2J22L9J1p0O3j44j17R9l18L16
-401I07j95K22r1L31o8K80n2J31l32M47k96J66j41j89J66j75L8J40m9K83J5lP7
-514A612
##PAGE=	F1=-1572.51
##FIRST=	4521.1594499999982872,	4521.1594499999982872,	0
##DATA TABLE=	(F2++(Y..Y)), PROFILE
$$ plain form
4521 1684 1705 1865 1557 1616 1475 1624 1192 1468 1063 1114 1126 1286 1266 1346 1251 1436 1554 1247 1372 1339 1096 956 1086 827 696 954
4393 954 645 780 974 934 935 1196 949 1100 1085 1004 751 775 624 719 517 538 521 748 769 795 876 948 852 919 892 648 793 535 507
4250 507 359 495 499 647 613 558 777 704 990 683 720 630 706 708 295 503 303 496 342 422 715 589 728 730 664 781 561 608
4113 608 679 282 354 479 352 237 304 563 505 834 502 798 553 732 521 623 200 430 277 338 324 295 384 516 563 786
3985 786 444 680 600 499 507 527 417 209 113 411 151 391 575 295 625 624 551 680 517 433 551 238 300 87 297 181 351
3852 351 201 714 549 497 411 641 646 465 352 450 185 266 183 179 365 342 324 555 569 656 333 623 510 465 252 339 222 116
3714 116 32 340 291 401 291 555 519 772 361 436 395 550 143 249 68 150 53 345 348 413 533 546 501 462 447 598 254 356
3576 356 283 86 182 43 115 449 490 382 454 498 472 490 447 404 460 159 139 31 142 330 217 300 569 383 484 371 517 388
$$ packed form
4521A684K1J60l08N9j41J49m32K76m05N1J2J60k0Q0r5J85J18l07J25l3k43j40J30k59j31K58
4393I54l09J35J94m0JK61k47J51j5q1k53K4j51R5k02K1j7K27K1K6Q1P2r6O7k7k44J45k58k8
4250E07j48J36MJ48l4n5K19p3K86l07L7r0P6Km13K08k00J93j54Q0K93j26J39Ko6J17k20M7
4113F08P1l97P2J25j27j15O7K59n8L29l32K96k45J79k11J02m23K30j53O1j4k9Q9J32M7K23
3985G86l42K36q0j01QK0j10k08r6K98k60K40J84k80L30jp3J29j63q4J18l13O2k13K10j16J70
3852C51j50N13j65n2q6K30Nj81j13R8k65Q1q3mJ86k3j8K31J4Q7l23K90j13m5k13Q7j17j06
3714A16q4L08m9J10j10K64l6K53m11P5m1J55m07J06j81Q2r7K92LO5J20J3m5l9j5J51l44J02
3576C56p3j97R6j39P2L34M1j08P2M4k6J8m3m3N6l01k0j08J11J88j13Q3K69j86J01j13J46j29
$$ plain form
3438 388 504 229 460 291 55 54 211 290 307 406 397 426 599 414 442 362 319 344 262 97 118 128 225 201 354 497 424 456 443 501
3291 501 454 350 450 293 204 39 73 117 373 219 417 403 473 466 566 429 252 404 264 69 124 71 193 116 350 251 653
3158 653 283 546 472 378 516 408 289 169 49 180 181 207 411 253 534 622 381 403 563 374 450 314 387 63 157 99 156
3025 156 321 292 430 417 332 685 678 165 538 278 135 234 31 141 67 324 382 220 366 595 443 402 526 483 196 490 194
2892 194 181 129 164 286 163 402 488 246 1268 633 1194 178 556 242 244 156 87 116 164 381 331 378 626 278 512 522 543
2759 543 513 223 224 207 184 238 159 215 660 132 645 542 535 554 426 430 577 174 280 75 258 148 383 229 510 344 580 541
2621 541 405 578 399 561 171 382 322 242 281 126 658 263 375 538 467 618 442 414 505 383 420 226 218 262 151 243 581
2488 581 501 615 436 521 347 694 669 132 448 92 276 275 305 242 522 331 491 456 705 552 672 438 406 510 314 214
$$ packed form
3438C88J16k75K31j69k36jJ57P9J7R9rK9J73j85K8q0m3K5q2j65K1J0R7k4J53J43p3L2j3N8
3291E01m7j04J00j57q9j65L4M4K56j54J98j4P0pJ00j37j77J52j40j95N5n3J22p7K34r9M02
3158F53l70K63p4r4J38j08j19j20j20J31JK6K04j58K81Q8k41K2J60j89P6j36P3l24R4n8N7
3025A56J65k9J38j3q5L53pn13L73k60j43R9k03J10p4K57N8j62J46K29j52m1J24m3k87K94k96
2892A94j3n2L5J22j23K39Q6k42J022o35N61j016L78l14Kq8o9K9M8K17n0M7K48l48K34J0K1
2759E43l0k90Jj7k3N4p9N6M45n28N13j03pJ9j28MJ47m03J06k05J83j10K35j54K81j66K36l9
2621E41j36J73j79J62l90K11o0q0L9j55N32l95J12J63p1J51j76k8R1j22L7j94qM4j11R2L38
2488E81q0J14j79Q5j74L47k5n37L16l56J84jL0o3K80j91J60l5K49j53J20k34l2J04j96j00
$$ plain form
2360 214 388 227 274 577 526 386 574 692 600 413 867 468 509 402 173 445 260 254 334 632 514 525 676 768 421 681
2232 681 690 389 496 377 358 378 423 381 411 454 743 775 590 598 575 636 743 367 504 211 589 367 418 714 534 461 742 693 700
2090 700 656 765 687 659 498 606 389 662 489 570 587 727 687 571 899 735 843 818 646 751 615 546 540 557 660 650 847
1957 847 838 902 703 1838 789 669 914 974 735 731 589 636 809 671 742 1012 802 997 1041 1126 999 1118 861 1009 884 855
1829 855 965 841 830 1084 1116 923 1117 1355 1044 1245 1530 1034 1425 1129 1393 1060 1234 1085 1018 1315 1186 1281 1650 1470 1651
1706 1651 1684 1851 1729 1873 1658 1856 1633 1793 1592 1654 1571 1818 2135 2041 2198 2444 2202 3937 3349 3132 2973 2807 2773 2685 2434
1583 2434 2492 2513 2946 3428 4219 5494 6261 7266 8567 9452 10234 10932 11277 11207 10757 9489 9053 13108 32525 106288 1817533
1479 1817533 2083876 264146 75891 38948 27527 22330 19299 17142 14909 13002 10824 8890 7348 5703
$$ packed form
2360B14J74j61M7L03n1j40J88J18r2j87M54l99M1j07k29K72j85oQ0K98j18J1J51R2l47K60
2232F81Rl01J07j19j9K0M5m2L0M3K89L2j85Qk3O1J07l76J37k93L78k22N1K96j80p3K81m9P
2090G00m4J09p8k8j61J08k17K73j73Q1J7J40m0j16L28j64J08k5j72J05j36o9oJ7J03j0J97
1957H47rO4j99J135j049j20K45O0k39mj42M7J73j38P1K70k10J95M4Q5j27J19k57J48j25k9
1829H55J10j24j1K54L2j93J94K38l11K01K85m96L91k96K64l33J74j49o7K97j29R5L69j80J81
1706A651L3J67j22J44k15J98k23J60k01O2q3K47L17r4J57K46k42J735n88k17j59j66l4q8k51
1583B434N8K1M33M82P91J275P67J005J301Q85P82O98L45p0m50j268m36M055J9417P3763J711245
1479A817533K66343j819730j88255l6943j1421n197l031k157k233j907k178j934j542j645
$$ plain form
1410 5703 4549 3075 2824 2529 2703 2875 3425 3819 3649 3613 3577 2913 4044 7438 1555 2101 1870 1876 1741 1810 2326 1770 2106
1297 2106 2255 2179 1840 2105 1768 1641 1495 1338 1425 1137 1380 1107 1516 1526 1569 1446 1723 1331 1482 1157 1189 1079 1178 822 894
1174 894 813 1045 1317 1255 1175 1333 1187 1226 946 1163 1034 707 770 708 757 751 879 843 1014 1196 943 1069 980 891 833 712 831 538
1036 538 476 634 779 718 740 924 866 974 963 927 604 732 659 664 455 360 575 552 616 797 795 768 889 862 892 680 760 463 440 528
889 528 489 361 444 403 650 714 935 825 732 662 716 683 568 385 485 209 331 377 590 569 725 589 730 786 737 447 802 566
751 566 410 367 213 348 115 471 516 623 656 613 875 526 718 605 556 529 151 615 187 158 470 336 576 594 655 683 628
618 628 684 586 510 389 477 187 46 391 458 296 488 603 594 590 745 673 666 456 410 296 250 174 199 219 292 406 551 547 572 634 620
465 620 651 1027 437 612 1244 400 86 131 319 375 530 684 627 553 457 822 510 446 408 319 73 97 66 331 346 328 619 502
$$ packed form
1410E703j154j474k51k95J74J72N50L94j70l6l6o64J131L394n883N46k31Oj35O9N16n56L36
1297B106J49p6l39K65l37j27j46j57Q7k88K43k73M09J0M3j23K77l92J51l25L2j10R9l56P2
1174H94q1K32K72o2q0J58j46L9k80K17j29l27O3o2M9oJ28l6J71J82k53J26q9q9n8j21J19k93
1036E38o2J58J45o1K2J84n8J08j1l6l23J28p3Nk09r5K15k3O4J81kk7J21k7L0k12Q0k97k3Q8
889E28l9j28Q3m1K47O4K21j10r3p0N4l3j15j83J00k76J22M6K13k1J56j36J41N6m9k90L55k36
751E66j56m3j54J35k33L56M5J07L3m3K62l49J92j13m9k7l78M64m28k9L12j34K40J8O1K8n5
618F28N6r8p6j21Q8k90j41L45O7j62J92J15rmJ55p2pk10m6j14m6p6K5K0P3J14J45mK5O2j4
465F20L1L76n90J75O32q44l14M5J88N6J55J54n7p4r6L65l12o4l8q9k46K4l1K65J5j8K91j17
$$ plain form
327 502 809 636 483 635 515 505 241 263 110 134 297 269 407 570 533 647 679 546 592 551 466 437 256 191 75 192 331
195 331 438 489 505 738 769 561 607 780 333 336 504 97 98 257 51 438 471 649 580 717 647 722 602 373 681 268 334 91
57 91 306 223 271 686 578 518 682 661 732 568 627 500 438 548 252 123 363 432 281 686 598 599 721 881 571 808 374 599
-81 599 473 147 377 338 393 373 557 686 713 793 728 829 671 489 773 565 308 252 311 386 536 498 742 644 832 983 784
-214 784 783 684 754 523 568 422 422 351 505 852 583 779 792 956 852 1001 829 816 651 817 595 619 271 852 608 757 961
-347 961 899 1067 1068 1109 1009 1105 936 816 917 596 905 736 992 843 1191 1153 1401 1375 1462 1160 1639 1224 1482 1389 1113 1285
-475 1285 1142 1215 1271 1260 1564 1573 1541 1682
-514 1682
$$ packed form
327E02L07j73j53J52j20j0k64K2j53K4J63k8J38J63l7J14L2j33M6m1q5k9j81o5j16J17J39
195C31J07N1J6K33L1k08M6J73m47LJ68m07JJ59k06L87L3J78o9J37p0P5j20k29L08m13O6k43
57I1K15q3M8M15j08o0J64k1P1j64N9j27o2J10k96j29K40O9j51M05q8JJ22J60l10K37m34K25
-81E99j26l26K30l9N5k0J84J29K7Q0o5J01j58j82K84k08k57n6N9P5J50l8K44r8J88J51j99
-214G84jr9P0k31M5j46%p1J54L47k69J96J3J64j04J49j72j3j65J66k22K4l48N81k44J49K04
-347I61o2J68JM1j00R6j69j20J01l21L09j69K56j49L48l8K48k6Q7l02M79m15K58r3k76J72
-475A285j43P3N6j1L04Rl2J41
-514A682
##PAGE=	F1=-1582.36
##FIRST=	4521.1594499999982872,	4521.1594499999982872,	0
##DATA TABLE=	(F2++(Y..Y)), PROFILE
$$ plain form
4521 1578 1559 1775 1438 1504 1386 1483 1149 1366 995 1061 1036 1218 1160 1278 1199 1318 1467 1179 1260 1269 994 922 1014 798 689 848 650
4388 650 688 901 883 890 1163 847 1054 999 938 719 713 542 674 529 507 475 704 714 721 873 850 778 865 866 591 750 443 518 306 439
4241 439 514 599 597 485 765 607 978 617 694 542 708 649 278 446 273 483 360 382 698 514 715 668 572 747 561 560 615
4108 615 247 364 430 310 255 306 520 471 759 477 735 525 715 434 604 156 454 249 295 327 273 399 509 531 701 396
3980 396 652 570 443 488 494 400 192 150 358 149 399 559 253 580 604 507 643 495 347 512 258 274 88 290 222 344 150
3847 150 659 534 465 353 629 590 454 302 430 138 276 190 145 375 324 284 504 562 599 294 618 453 415 246 299 232 65
3714 65 34 356 280 417 257 495 471 757 318 444 368 513 90 269 82 143 43 322 320 391 496 533 454 424 430 561 248 351
3576 351 229 98 160 79 107 374 504 369 435 464 446 431 444 331 433 161 128 24 118 351 193 264 538 339 487 364 476
$$ packed form
4521A578j9K16l37O6j18R7l34K17l71O6k5J82n8J18p9J19J49k88Q1Rk75p2R2k16j09J59j98
4388F50L8K13j8PK73l16K07n5o1k19oj71J32j45k2l2K29J0PJ52k3p2Q7Jk75J59l07P5k12J33
4241D39P5Q5kj12K80j58L71l61P7j52J66n9l71J68j73K10j23K2L16j84K01m7r6J75j86jN5
4108F15l68J17O6j20n5N1K14m9K88k82K58k10J90k81J70m48K98k05M6L2n4J26J10K2J70l05
3980C96K56q2j27M5Or4k08m2K08k09K50J60l06L27K4r7J36j48j48J65k54J6j86K02o8J22j94
3847A50N09j25o9j12K76l9j36j52J28k92J38q6m5K30n1m0K20N8L7l05L24j65l8j69N3o7j67
3714F5l1L22p6J37j60K38k4K86m39J26p6J45m23J79j87O1j00K79kP1J05L7p9l0OJ31l13J03
3576C51j22j31O2q1K8K67J30j35O6K9j8j5J3j13J02k72l3j04R4K33j58P1K74j99J48j23J12
$$ plain form
3443 476 359 487 195 436 265 66 69 208 239 349 348 400 403 544 377 432 327 241 365 232 85 111 117 171 225 362 455 396 432
3300 432 408 462 415 336 429 261 192 7 139 104 383 164 407 411 386 462 546 364 246 401 223 51 115 36 162 133 347 217
3163 217 624 260 531 414 376 483 372 245 212 44 145 161 147 425 251 511 572 352 408 525 335 435 281 340 118 178
3035 178 99 153 326 247 400 407 296 654 630 150 530 247 137 195 26 106 76 266 428 36 360 567 409 370 498 427 185
2902 185 461 180 138 85 122 283 116 433 469 315 1195 784 1137 151 573 209 222 154 104 99 164 361 323 325 649 221 463 506
2764 506 466 496 227 167 207 183 202 167 230 672 193 578 511 496 487 414 375 573 170 221 103 238 150 366 238 470 312 518 508
2621 508 403 546 385 518 155 406 298 231 238 127 615 249 348 518 409 561 440 382 461 372 403 223 187 231 159 181 590
2488 590 460 579 409 475 314 657 628 139 414 100 247 271 311 173 562 275 450 431 643 535 610 458 310 522 253
$$ packed form
3443D76j17J28k92K41j71j99LJ39L1J10jN2LJ41j67N5j05q6J24j33j47K6ON4N4J37R3n9L6
3300D32k4N4m7p9R3j68o9j85J32l5K79k19K43Mk5P6Q4j82j18J55j78j72O4p9J26k9K14j30
3163B17M07l64K71j17l8J07j11j27l3j68J01J6j4K78j74K60O1k20N6J17j90J00j54N9k22O0
3035A78p9N4J73p9J53Pj11L58k4m80L80k83j10N8j69Q0l0J90J62l92L24K07j58l9J28p1k42
2902A85K76k81m2n3L7J61j67L17L6j54Q80m11L53r86M22l64J3o8n0nO5J97l8KL24m28K42M3
2764E06m0L0k69o0M0k4J9l5O3M42m79L85o7j5rp3l9J98m03N1j18J35q8K16j28K32j58K06j0
2621E08j05J43j61J33l63K51j08o7Pj11M88l66R9J70j09J52j21n8P9q9L1j80l6M4p2K2M09
2488E90j30J19j70O6j61L43k9m89K75l14J47K4M0j38L89k87J75j9K12j08P5j52j48K12k69
$$ plain form
2365 253 199 367 203 311 528 476 332 588 645 567 375 822 398 532 329 170 397 272 210 288 627 488 499 628 722 369
2237 369 663 652 330 511 300 360 325 416 360 376 419 674 741 528 568 496 603 688 362 476 153 568 345 350 681 505 406 734
2099 734 638 637 613 715 610 632 469 555 338 634 460 534 541 674 647 543 809 681 790 778 597 626 588 474 532 539 643 578 808
1957 808 798 816 875 2053 719 609 800 885 705 680 552 574 806 600 661 948 737 939 961 1052 925 1042 798 930 813 819
1829 819 872 771 775 1012 1040 833 1036 1261 976 1160 1439 967 1299 1021 1321 977 1154 1010 933 1209 1108 1183 1540 1345 1548
1706 1548 1577 1694 1646 1678 1561 1715 1514 1697 1469 1573 1430 1658 1974 1826 2027 2435 2210 3508 3180 2706 2579 2653 2618 2478
1588 2478 2254 2311 2297 2775 3167 3985 5110 5853 6764 7964 8738 9535 10083 10387 10269 9761 8532 7817 11937 30275 98528
1484 98528 1685303 1943402 249668 72348 37150 26259 21106 18118 16006 13885 12150 9998 8276 6798
$$ packed form
2365B53n4J68j64J08K17n2j44K56N7p8j92M47m24J34k03j59K27j25o2P8L39j39J1J29R4l53
2237C69K94j1l22J81k11O0l5R1n6J6M3K55O7k13M0p2J07Q5l26J14l23M15k23NL31j76r9L28
2099G34r6jk4J02j05K2j63Q6k17K96j74P4PJ33k7j04K66j28J09j2j81K9l8j14N8PJ04o5K30
1957H08j0J8N9J178j334j10J91Q5j80k5j28K2K32k06O1K87k11K02K2R1j27J17k44J32j17O
1829H19N3j01MK37K8k07K03K25k85J84K79m72L32k78L00l44J77j44p7K76j01P5L57j95K03
1706A548K9J17m8L2j17J54k01J83k28J04j43K28L16j48K01M08k25J298l28m74j27P4l5j40
1588B478k24N7j4M78L92Q18J125P43R11J200P74P97N48L04j18n08j229p15M120J8338O8253
1484I8528J586775K58099j693734j77320l5198j0891n153k988k112k121j735k152j722j478
$$ plain form
1415 6798 5244 4279 2781 2578 2346 2530 2684 3185 3485 3483 3382 3339 3036 3538 2927 2103 2014 1623 1680 1554 1589 2152 1626 1943
1297 1943 2116 1979 1687 1986 1612 1491 1407 1241 1335 1029 1268 1046 1409 1393 1483 1330 1661 1156 1419 1072 1077 1001 1073 759 810 748
1169 748 941 1248 1200 1073 1248 1110 1076 869 1092 962 689 701 673 650 709 837 816 939 1094 882 975 905 830 752 631 785 489
1036 489 418 614 742 603 697 880 825 893 859 909 527 683 620 622 369 315 546 546 586 721 756 712 838 777 838 617 681 420 438 472
889 472 427 358 435 356 645 653 871 785 681 577 661 644 504 381 464 155 329 337 586 484 745 519 677 754 659 431 719 548
751 548 380 375 222 365 109 417 479 638 617 559 826 501 666 548 511 498 122 585 184 110 482 333 541 586 585 640 607 608 542
608 542 482 354 472 176 74 325 427 273 449 638 515 539 716 589 625 428 396 269 271 191 202 169 301 396 486 532 487 614
470 614 601 512 1112 425 687 1105 339 71 169 309 320 547 630 582 536 378 818 483 396 353 303 66 116 71 300 362 307 539
$$ packed form
1415F798j554r65j498k03k32J84J54N01L00kj01m3l03N02o11q24q9l91N7j26L5N63n26L17
1297A943J73j37k92K99l74j21q4j66R4l06K39k22L63j6R0j53L31n05K63l47Np6P2l14N1o2
1169G48J93L07m8j27J75j38l4k07K23j30k73J2k8k3N9J28k1J23J55k12R3p0p5p8j21J54k96
1036D89p1J96J28j39R4J83n5O8l4N0l82J56o3Kk53n4K31%M0J35L5m4J26o1O1k21O4k61J8L4
889D72m5o9P7p9K89QK18q6j04j04Q4j7j40j23Q3l09J74QK49j02K61k26J58P7r5k28K88j71
751E48j68nj53J43k56L08O2J59k1n8K67l25J65j18l7j3l76M63m01p4L72j49K08M5jN5l3Jo6
608E42o0j28J18k96j02K51J02j54J76J89j23K4J77j27L6j97l2j27Kq0J1l3J32R5R0M6m5J27
470F14j3q9O00o87K62M18p66k68R8J40J1K27Q3m8m6j58M40l35q7m3n0k37N0m5K29O2n5K32
$$ plain form
332 539 491 725 652 425 594 463 478 244 281 145 144 268 289 339 602 461 589 657 504 549 474 456 423 237 190 46 160 350
195 350 421 428 503 637 772 519 558 739 306 290 485 74 76 269 33 448 470 606 567 653 566 698 586 325 652 213 302 111
57 111 275 210 255 680 529 525 580 648 686 533 541 492 417 496 244 91 342 395 289 600 599 571 662 827 516 757 337 549 464 148
-91 148 365 327 408 329 508 626 675 750 697 772 598 500 676 536 280 248 251 387 503 468 731 572 796 919 721 737 628 714
-229 714 474 517 388 435 300 483 815 539 762 738 873 817 915 782 729 608 792 552 587 248 829 511 750 919 812 1027
-357 1027 978 1038 933 1054 859 752 860 553 836 697 966 777 1120 1093 1322 1291 1346 1088 1558 1068 1400 1359 1010 1183 1081
-480 1081 1178 1156 1168 1486 1473 1430 1607
-514 1607
$$ packed form
332E39m8K34p3k27J69j31J5k34L7j36jJ24K1N0K63j41J28O8j53M5p5j8l3j86m7j44J14J90
195C50P1PP5J34J35k53L9J81m33j6J95m11KJ93k36M15K2J36l9Q6q7J32j12k61L27m39Q9j91
57A11J64o5M5M25j51mN5O8L8j53Qm9p5P9k52j53K51N3j06L11jk8R1J65l11K41m20K12q5l16
-91A48K17l8Q1p9J79J18M9P5n3P5j74r8J76j40k56l2LJ36J16l5K63j59K24J23j98J6j09Q6
-229G14k40M3j29M7j35J83L32k76K23k4J35n6R8j33n3j21J84k40L5l39N81l18K39J69j07K15
-357A027m9O0j05J21j95j07J08l07K83j39K69j89L43k7K29l1N5k58M70m90L32m1l49J73j02
-480A081R7k2J2L18j3m3J77
-514A607
##PAGE=	F1=-1592.2
##FIRST=	4521.1594499999982872,	4521.1594499999982872,	0
##DATA TABLE=	(F2++(Y..Y)), PROFILE
$$ plain form
4521 1350 1298 1549 1208 1288 1182 1238 1018 1165 839 940 866 1049 982 1099 1055 1096 1275 1021 1068 1098 815 815 880 711 641 685 596 549
4383 549 756 779 767 1046 674 939 830 798 646 586 421 585 496 441 395 605 605 590 799 696 642 748 777 498 648 319 493
4250 493 240 330 498 506 548 370 693 462 890 514 615 405 662 545 239 358 222 437 354 321 625 400 636 567 441 650
4122 650 517 465 522 192 370 350 248 254 289 429 404 632 414 622 453 650 311 537 100 446 209 238 299 254 384 461 472
3990 472 545 335 565 500 350 437 433 355 206 174 301 118 389 512 180 498 546 415 560 432 238 445 255 239 81 266
3862 266 247 316 91 553 474 405 262 579 485 412 233 365 89 272 182 121 369 282 217 415 523 495 245 546 377 330 221
3729 221 239 215 15 52 354 256 398 220 400 381 691 253 408 315 446 40 271 121 116 67 268 264 339 420 485 376 356 384 488
3586 488 214 331 152 101 126 110 94 281 473 334 385 395 387 339 401 242 380 154 89 51 114 347 173 210 457 282 456 326
$$ packed form
4521A350n2K51l41Q0j06N6k20J47l26J01p4J83o7J17m4M1J79k54M7L0k83%O5j69p0M4q9m7
4383E49K07K3j2K79l72K65j09l2j52o0j65J64q9n5m6K10%j5K09j03n4J06K9k79J50l29J74
4250D93k53R0J68QM2j78L23k31M28l76J01k10K57j17l06J19j36K15q3l3L04k25K36o9j26K09
4122F50j33n2N7l30J78k0j02OL5J40k5K28k18K08j69J97l39K26m37L46k37K9O1m5J30P7J1
3990D72P3k10K30o5j50Q7mp8j49l2J27j83K71J23l32L18M8j31J45j28j94K07j90j6j58J85
3862B66j9O9k25M62p9o9j43L17r4p3j79J32k76J83r0o1K48q7o5J98J08k8k50L01j69m7j09
3729B21J8k4k00L7L02r8J42j78J80j9L10m38J55r3J31m06K31j50nm9K01mP5Q1O5j09k0K8J04
3586D88k74J17j79n1K5j6j6J87J92j39N1J0qm8O2j59J38k26o5l8O3K33j74L7K47j75J74j30
$$ plain form
3448 326 408 304 451 149 394 226 85 75 184 170 371 275 379 350 447 313 380 282 137 367 196 69 105 97 104 224 329 395
3310 395 342 366 345 392 351 296 382 216 178 53 201 83 377 95 368 397 283 417 490 270 234 352 167 32 106 22 129 132
3172 132 302 169 545 238 491 309 350 416 321 184 234 65 105 135 84 422 220 467 480 296 383 460 277 391 231 263 162
3040 162 182 110 152 316 187 340 360 247 577 539 122 488 203 112 146 26 66 98 213 472 161 326 499 348 311 428 341
2907 341 165 404 149 91 50 91 249 68 437 419 351 1051 907 1018 110 552 166 186 147 120 65 158 315 290 241 620 149
2774 149 383 449 348 455 219 96 192 179 153 165 240 625 249 487 445 423 410 346 302 526 158 147 126 210 131 324 229 395 252
2631 252 419 450 358 468 348 447 139 410 257 203 202 115 514 224 291 462 324 459 408 319 390 335 364 199 164 177 142 115 562
2488 562 382 509 359 388 250 573 546 145 350 108 208 241 280 99 565 200 373 382 531 482 502 438 189 507 167 168 326
$$ packed form
3448C26Q2j04J47l02K45j68j41j0J09j4K01r6J04k9R7j34O7r8j45K30j71j27L6qPJ20J05O6
3310C95n3K4k1M7m1n5Q6j66l8j25J48j18K94k82K73K9j14J34P3k20l6J18j85j35P4q4J07L
3172A32J70j33L76l07K53j82M1O6r5j37N0j69M0L0n1L38k02K47J3j84Q7P7j83J14j60L2j01
3040A62K0p2M2J64j29J53K0j13L30l8m17L66k85r1L4j20M0L2J15K59l11J65J73j51l7J17q7
2907C41j76K39k55n8m1M1J58j81L69j8o8P00j44J11r08M42l86K0l9k7n5R3J57k5m9L79m71
2774A49K34O6j01J07k36j23R6j3k6J2P5L85l76K38m2k2j3o4m4K24l68j1k1Q4p9J93r5J66j43
2631B52J67L1r2J10j20R9l08K71j53n4jq7L99k90O7J71j38J35n1q9P1n5K9j65l5J3l5k7M47
2488E62j80J27j50K9j38L23k7m01K05k42J00L3L9j81M66l65J73RJ49m9K0o4k49L18l40JJ58
$$ plain form
2355 326 176 315 435 399 249 557 552 496 313 714 290 514 259 155 323 262 147 228 574 419 452 531 630 289 592 574 247
2222 247 489 210 328 249 373 331 304 346 554 659 432 499 375 519 589 325 426 76 513 295 248 596 443 322 684 527
2095 527 523 523 613 496 560 404 462 266 558 404 454 445 574 557 481 656 570 681 682 505 460 507 370 484 489 570 457 714 696 664 1001
1942 1001 2082 581 514 633 733 624 586 477 457 747 461 539 800 630 812 799 900 775 895 671 776 685 713 710 632 660
1814 660 875 883 681 871 1081 833 983 1246 816 1087 834 1138 814 998 857 766 1013 946 1000 1311 1118 1316 1361 1407 1442 1352
1686 1352 1343 1445 1272 1475 1235 1366 1171 1370 1665 1487 1751 2253 2101 2674 2637 2263 2099 2313 2249 2075 1890 1953 1902 2388 2657
1563 2657 3446 4340 4984 5743 6747 7364 8107 8471 8699 8553 8052 6970 6156 9947 25756 83313 1424353 1653010
1474 1653010 215522 63072 32393 22931 18232 15528 13624 11772 10383 8407 7021 5741 4393 3607 2337
$$ packed form
2355C26j50J39J20l6j50L08nn6j83M01m24K24k55j04J68o1j15Q1L46j55L3P9R9l41L03j8l27
2222B47K42k79J18p9J24m2k7M2K08J05k27O7j24J44P0k64J01l50M37k18m7L48j53j21L62j57
2095E27m%R0j17O4j56N8j96K92j54N0rJ29j7p6J75q6J11Jj77m5M7j37J14NQ1j13K57j8l2L37
1942A001J081j501o7J19J00j09l8j09k0K90k86P8K61j70J82j3J01j25J20k24J05r1K8lp8K8
1814F60K15Qk02J90K10k48J50K63m30K71k53L04l24J84j41r1K47o7N4L11j93J98M5M6L5r0
1686A352rJ02j73K03k40J31j95J99K95j78K64N02j52N73l7l74j64K14o4j74j85O3n1M86K69
1563B657P89Q94O44P59J004O17P43L64K28j46n01j082q14L791J5809N7557J341040K28657
1474A653010j437488j52450l0679r462m699k704j904j852j389j976j386j280j348p86j270
$$ plain form
1400 2337 2120 1967 2146 2318 2695 2860 3055 2916 2857 3005 9095 8732 2785 1815 1232 1329 1221 1237 1803 1358 1614 1815 1638
1287 1638 1389 1720 1337 1218 1206 1045 1140 838 1064 890 1196 1158 1279 1115 1480 886 1251 891 894 836 891 635 667 619 767 1081
1159 1081 1046 897 1071 941 852 721 930 825 613 579 582 492 615 727 732 790 910 754 810 757 704 605 515 694 390 330 548 646
1021 646 441 612 754 723 747 672 840 406 583 533 526 265 240 483 493 515 589 663 602 729 618 733 511 556 337 403 375 331 330
879 330 393 284 591 559 735 685 579 452 547 567 390 359 398 86 321 275 540 359 720 410 572 673 529 366 588 500 328
746 328 351 208 381 93 340 414 601 534 465 715 435 568 441 445 428 89 512 167 57 461 300 461 535 464 552 540 485 466
608 466 407 303 428 154 100 247 376 221 378 628 388 460 629 453 544 361 366 223 286 196 199 108 289 359 380 482 369 541
470 541 547 318 1084 382 740 762 218 150 188 264 237 524 535 488 483 271 756 418 306 279 263 63 126 63 241 343 267 421 438
$$ packed form
1400B337k17j53J79J72L77J65J95j39n9J48O090l63n947r70n83R7j08J6N66m45K56K01j77
1287A638k49L31l83j19j2j61R5l02K26j74L06l8J21j64L65n94L65l60Ln8N5k56L2m8J48L14
1159A081l5j49J74j30q9j31K09j05k12l4Lr0J23J12NN8J20j56N6n3n3r9r0J79l04o0K18R8
1021F46k05J71J42l1K4p5J68m34J77n0pk61k5K43J0K2P4P4o1J27j11J15k22M5k19O6k8m4j
879C30O3j09L07l2J76n0j06j27R5K0j77l1L9l12K35m6K65j81L61l10J62J01j44j63K22q8j72
746C28K3j43J73k88K47P4J87o7o9K50k80J33j27Mj7l39M23l45j10M04j61J61P4p1Q8j2n5j9
608D66n9j04J25k74n4J47J29j55J57K50k40P2J69j76R1j83Nj43O3r0Lr1J81P0K1J02j13J72
470E41Ok29P66p02L58K2n44o8L8P6k7K87J1m7nk12M85l38j12k7j6k00O3o3J78J02p6J54J7
$$ plain form
327 438 589 613 348 507 380 411 254 273 167 155 218 286 247 602 344 502 575 431 464 356 409 379 223 175 20 125 344 373
190 373 342 464 502 707 442 463 650 255 219 423 73 54 254 86 418 436 532 501 542 452 618 527 253 582 149 254 136
57 136 212 177 218 619 453 490 427 587 588 463 417 434 374 407 236 43 292 334 265 481 559 501 544 713 433 643 283 450 425 156
-91 156 313 308 395 254 425 523 582 652 609 666 474 474 540 462 230 218 186 357 437 404 676 444 699 785 608 640 520 621 391 436
-239 436 318 411 229 432 710 460 682 619 735 720 763 677 578 516 710 469 514 212 748 368 681 816 656 916 813 881
-367 881 793 925 710 627 746 466 714 605 861 657 972 937 1161 1101 1128 933 1351 838 1221 1223 829 995 936 1046 963 982 1300
-499 1300 1257 1218 1403
-514 1403
$$ packed form
327D38J51K4k65J59j27L1j57J9j06j2O3O8l9L55k58J58P3j44L3j08N3l0j56m8j55J05K19K9
190C73l1J22L8K05k65K1J87l95l6K04l50j9K00j68L32J8R6l1M1r0J66r1k74L29m33J05j18
57A36P6l5M1M01j66L7o3J60Jj25m6J7o0L3j71j93K49M2o9K16P8n8M3J69k80K10l60J67k5k69
-91A56J57nQ7j41J71R8N9P0m3N7j92%O6p8k32j2l2J71Q0l3K72k32K55Q6j77L2j20J01k30M5
-239D36j18R3j82K03K78k50K22o3J16j5M3q6r9o2J94k41M5l02N36l80L13J35j60K60j03O8
-367H81q8J32k15q3J19k80K48j09K56k04L15l5K24o0K7j95M18n13L83Kl94J66n9J10q3J9L18
-499A300m3l9J85
-514A403
##PAGE=	F1=-1602.04
##FIRST=	4521.1594499999982872,	4521.1594499999982872,	0
##DATA TABLE=	(F2++(Y..Y)), PROFILE
$$ plain form
4521 1040 966 1226 907 1003 898 929 822 894 621 773 648 801 764 839 848 807 1008 803 832 852 587 653 722 580 562 494 488 388 570
4378 570 642 590 866 456 779 604 609 546 417 278 467 422 355 293 464 457 427 668 513 462 589 639 383 503 183 437 168 187
4241 187 455 385 475 229 576 291 742 391 497 244 576 415 191 253 157 367 326 247 512 267 504 443 294 506 440 342
4113 342 413 134 373 256 176 238 259 307 317 472 324 477 349 552 174 437 46 410 166 181 246 247 348 377 397 340 282 435
3975 435 407 232 368 352 295 254 183 250 67 359 439 89 394 460 295 444 341 122 359 236 206 68 232 256 268 47 413
3842 413 383 324 155 495 347 349 158 269 45 258 160 119 348 224 141 303 459 364 197 424 294 225 182 169 175 30 65 336
3704 336 222 350 201 294 265 585 176 336 244 362 35 260 168 75 111 191 195 269 317 411 280 270 320 393 158 299 66 95 82
3561 82 125 80 180 406 282 315 301 305 231 333 159 307 139 36 72 132 321 161 147 341 222 401 270 326 231 409 122 344
$$ packed form
4521A040p4K60l19R6j05L1j07P2k73J52j25J53l7P5Rm1K01k05K9K0k65O6O9j42j8o8oj00J82
4378E70P2n2K76m10L23j75No3j29j39J89m5o7o2J71pl0K41j55n1J27N0k56J20l20K54k69J9
4241A87K68p0R0k46L47k85M51l51J06k53L32j61k24O2r6K10m1p9K65k45K37o1j49K12o6r8
4113C42P1k79K39j17q0O2K1M8J0J55j48J53j28K03l78K63l91L64k44J5O5JJ01K9K0n7n8J53
3975D35k8j75J36j6n7m1p1O7j83K92Q0l50L05O6j65J49j03k19K37j23l0j38J64K4J2k21L66
3842D13l0n9j69L40j48Kj91J11k24K13r8m1K29j24q3J62J56r5j67K27j30o9m3j3Oj45L5K71
3704C36j14J28j49R3k9L20m09J60r2J18l27K25r2r3L6Q0MP4M8R4j31j0N0P3k35J41k33K9j3
3561H2M3m5J00K26j24L3j4Mp4J02j74J48j68j03L6O0J89j60j4J94j19J79j31N6r5J78k87K22
$$ plain form
3424 344 181 97 71 144 98 372 207 340 282 323 233 297 235 67 361 162 52 108 72 35 200 260 326 268 269 267 302 274 239 316 167
3271 167 176 99 255 69 359 24 305 362 210 342 414 161 219 267 109 14 112 60 105 120 226 115 428 221 432 176 309
3138 309 327 266 126 232 78 70 121 45 405 183 402 364 223 338 387 215 328 173 175 188 168 129 156 297 128 262 284 198 465
2995 465 420 87 418 149 67 95 29 26 121 191 499 331 277 403 278 240 325 241 138 326 105 43 55 77 188 36 412 348 356
2853 356 866 984 867 64 496 121 153 141 139 24 145 250 241 144 542 90 289 361 208 400 201 38 169 178 96 155 241 536
2715 536 293 396 359 328 335 237 226 445 142 69 141 179 105 266 200 294 177 302 378 279 359 301 365 141 393 211 161 179 91 371
2567 371 192 217 382 227 335 350 234 308 277 308 161 148 106 101 70 504 279 419 294 276 166 456 439 151 264 109 166 195
2429 195 222 32 528 122 274 321 388 401 368 387 59 474 67 134 273 163 288 315 305 164 491 431 407 240 562 165 463
$$ packed form
3424C44j63q4k6P3m6K74j65J33n8M1r0O4o2j68K94j99j10N6l6l7J65O0O6n8JkL5k8l5P7j49
3271A67Rp7J56j86K90l35K81N7j52J32P2k53N8M8j58r5R8n2M5J5J06j11L13k07K11k56J33
3138C09J8o1j40J06j54qN1p6L60k22K19l8j41J15M9j72J13j55KJ3k0l9K7J41j69J34K2q6K67
2995D65m5l33L31k69q2K8o6lR5P0L08j68n4J26j25l8Q5q4j03J88k21o2J2K2J11j52L76o4Q
2853C56N10J18j17q03M32l75L2j2kj15J21J05rr7L98m52J99P2j53J92j99j63J31Rq2N9Q6K95
2715E36k43J03l7l1Pr8j1K19l03p3P2L8p4J61o6R4j17J25P6r9Q0n8O4k24K52j82n0J8q8K80
2567C71j79K5J65j55J08J5j16P4l1L1j47j3m2nl1M34k25J40j25j8j10K90j7k88J13j55N7K9
2429A95K7j90M96m06J52M7O7J3l3J9l28M15m07O7J39j10J25K7j0j41L27o0k4j67L22l97K98
$$ plain form
2296 463 213 130 236 233 77 165 486 322 395 400 507 207 484 470 160 437 117 270 167 307 299 207 251 404 542 319 406 231
2159 231 403 467 267 361 7 436 229 132 477 359 226 606 385 377 404 479 363 457 317 346 187 449 332 345 313 445 435
2026 435 406 466 423 531 553 390 282 387 251 406 417 453 306 577 556 481 929 1859 424 409 444 542 503 465 382 301 646 280
1888 280 400 596 501 642 585 697 575 707 508 576 521 557 508 451 505 697 673 496 652 844 644 746 985 613 827 597
1760 597 881 602 793 654 546 765 731 766 1004 828 997 1079 1038 1153 952 1044 1094 952 1169 936 1071 846 1011 1270 1091
1637 1091 1410 1884 1801 1683 1875 1882 1610 1811 1724 1547 1407 1486 1402 1859 1991 2706 3313 3803 4396 5134 5567 6205 6385 6514 6365
1514 6365 5932 5076 4336 7479 19773 63335 1081200 1264603 167825 49735 25527 18152 14228 11995 10426
1440 10426 8947 8012 6332 5349 4362 3295 2638 1837 1531 1472 1628 1837 2055 2068 2449 2293 2168 2720 13490 15009 3202
$$ packed form
2296D63k50q3J06lj56Q8L21j64P3NJ07l00K77j4l10K77l20J53j03J40qr2M4J53J38k23Q7j75
2159B31J72O4k00R4l54M29k07r7L45j18j33L80k21qK7P5j16R4j40K9j59K62j17J3l2J32j0
2026D35k9O0m3J08K2j63j08J05j36J55J1L6j47K71k1p5M48R30j435j5L5R8l9l8q3q1L45l66
1888B80J20J96r5J41n7J12j22J32j99O8n5L6m9n7N4J92k4j77J56J92k00J02K39l72K14k30
1760E97K84k79J91j39j08K19l4L5K38j76J69Q2m1J15k01R2N0j42K17k33J35k25J65K59j79
1637A091L19M74q3j18J92Pk72K01q7j77j40P9q4M57J32P15O07M90N93P38M33O38J80J29j49
1514F365m33q56p40L143J2294M3562J017865J83403j096778j18090k4208p375l924k233j569
1440A0426j479r35j680r83r87j067o57q01l06n9J56K09K18J3L81j56j25N52J0770J519j1807
$$ plain form
1337 3202 1552 806 915 827 836 1357 1024 1184 1411 1219 1000 1355 991 875 931 785 882 599 804 670 919 865 993 838 1216
1213 1216 571 1008 646 672 616 669 474 494 455 551 847 825 678 830 715 587 534 704 649 499 430 450 313 487 572 605 595 676
1076 676 583 606 560 538 422 384 577 264 224 452 510 259 504 568 584 561 435 735 270 449 414 391 155 155 399 407 413 425 536 454
928 454 582 412 595 382 407 230 343 255 216 282 328 206 500 447 552 541 441 310 397 461 247 325 300 39 308 202 463
795 463 232 655 286 436 561 369 269 426 428 267 303 176 382 77 250 332 520 416 352 565 342 438 302 371 325 62
667 62 408 138 8 408 250 352 451 316 429 442 338 370 299 248 358 122 113 172 316 157 283 576 242 366 499 290 437
534 437 268 320 170 292 189 190 49 262 299 253 407 233 430 469 129 1017 366 751 350 141 226 188 215 137 464 413 364 403
396 403 160 652 327 192 198 209 65 126 45 167 298 214 285 355 422 526 270 391 282 317 270 239 170 161 154 260 155 571 206
$$ packed form
1337C202j650p46J09q8RN21l33J60K27j92k19L55l64j16N6j46R7k83K05j34K49n4J28j55L78
1213A216o45M37l62K6n6N3j95K0l9R6K96k2j47J52j15j28n3J70n5j50o9K0j37J74Q5L3j0Q1
1076F76r3K3m6k2j16l8J93l13m0K28N8k51K45O4J6k3j26L00m65J79l5k3k36%K44QOJ2J11q2
928D54J28j70J83k13K5j77J13q8l9O6M6j22K94n3J05j1j00j31Q7O4k14P8k5k61K69j06K61
795D63k31M23l69J50J25j92j00J57Kj61L6j27K06l05J73Q2J88j04o4K13k23R6j36O9m6k63
667F2L46k70j30M00j58J02R9j35J13J3j04L2p1n1J10k36rN9J44j59J26K93l34J24J33k09J47
534D37j69N2j50J22j03Jj41K13L7m6J54j74J97L9l40Q88o51L85m01k09Q5l8K7p8L27n1m9L9
396D03k43M92l25j35OJ1j44O1q1J22J31q4P1P0O7J04k56J21j09L5m7l1o9rpJ06j05M16l65
$$ plain form
254 206 397 454 340 350 218 338 314 214 153 18 97 313 303 248 396 360 588 342 339 528 188 130 329 91 31 213 146 354
116 354 371 439 391 404 322 500 436 173 482 102 205 157 127 135 167 512 367 422 246 496 455 371 279 337 314 295 226 22 221 261
-32 261 215 351 489 405 387 561 333 485 224 322 363 166 231 285 359 160 321 394 449 515 483 531 326 420 384 359 169 166 124 305
-180 305 346 320 589 283 557 603 471 510 380 491 293 340 230 356 151 358 551 361 555 455 563 581 571 531 392 391 588
-312 588 358 415 172 621 198 563 671 455 755 600 670 607 739 514 461 596 353 562 479 697 507 774 717 942 846 839
-440 839 723 1055 571 973 1006 604 747 733 846 721 740 1032 964 937 1107
-514 1107
$$ packed form
254B06J91N7j14J0j32J20k4j00o1j35P9K16j0n5J48l6K28k46lJ89l40n8J99k38o0J82o7K08
116C54J7O8m8J3q2J78o4k63L09l80J03m8l0QL2L45j45N5j76K50m1q4r2N8k3j9o9k04J99M0
-32B61m6J36J38q4j8J74k28J52k61R8M1j97O5N4P4j99J61P3N5O6l2M8k05R4l6k5j90lm2J81
-180C05M1k6K69l06K74M6j32L9j30J11j98M7j10J26k05K07J93j90J94j00J08J8j0m0j39jJ97
-312E88k30N7k43M49m23L65J08k16L00j55P0o3J32k25n3J35k43K09q3K18j90K67n7K25r6p
-440H39j16L32m84M02L3m02J43j4J13j25J9K92o8k7J70
-514A107
##PAGE=	F1=-1611.89
##FIRST=	4521.1594499999982872,	4521.1594499999982872,	0
##DATA TABLE=	(F2++(Y..Y)), PROFILE
$$ plain form
4521 698 616 857 585 694 582 605 595 594 373 589 423 510 542 541 616 495 709 559 588 572 348 464 577 428 467 309 345 234
4383 234 383 497 388 654 232 603 357 400 437 234 132 344 316 270 185 306 292 265 503 329 266 416 477 269 336 59 364
4250 364 99 35 391 257 393 92 438 120 558 271 360 93 464 281 161 149 87 282 284 175 381 140 342 311 149 340
4122 340 343 221 306 115 375 173 118 216 220 187 231 300 223 329 230 442 44 329 43 354 129 143 176 248 302 265 320 121 253
3980 253 287 310 108 302 262 240 317 178 210 65 312 351 19 287 361 175 313 238 41 266 211 184 53 195 248 205 47 260
3842 260 284 234 51 388 197 278 101 164 28 239 134 135 313 161 84 188 377 235 159 272 218 123 136 101 124 69 69 302 182
3699 182 283 204 210 143 455 97 245 164 273 65 238 211 33 151 102 132 192 204 322 184 181 253 293 90 263 24 84 32 117
3556 117 65 81 318 220 238 203 214 132 258 123 224 122 67 81 159 281 160 96 210 167 339 214 242 151 375 141 304 144
$$ packed form
4521F98q2K41k72J09j12K3j0jk21K16j66Q7L2jP5j21K14j50K9j6k24J16J13j49L9j58L6j11
4383B34J49J14j09K66m22L71k46M3L7k03j02K12k8m6q5J21j4k7K38j74o3J50O1k08O7k77L05
4250C64k65o4L56j34J36l01L46l18M38k87Q9k67L71j83j20j2o2J95Kj09K06k41K02l1j62J91
4122C40Lj22Q5j91K60k02n5R8Ml3M4O9p7J06r9K12l98K85k86L11k25J4L3P2N4l7N5j99J32
3980B53L4K3k02J94m0k2P7j39L2j45K47L9l32K68P4j86J38p5j97K25n5k7j31J42N3m3j58K13
3842B60K4n0j83L37j91Q1j77O3j36K11j05JJ78j52p7J04J89j42p6J13n4r5J3l5K3n5%K33j20
3699A82J01p9Oo7L12l58J48q1J09k08J73k7j78J18m9L0O0J2J18j38lP2M0k03J73k39O0n2Q5
3556A17n2J6K37r8J8l5J1q2J26j35J01j02n5J4P8J22j21o4J14m3J72j25K8r1K24k34J63j60
$$ plain form
3419 144 96 60 94 60 354 166 293 213 194 149 202 196 158 357 150 37 123 51 36 159 169 262 187 165 192 205 195 180 237 122 191
3266 191 137 299 71 334 34 229 315 217 254 332 62 199 162 64 17 136 94 103 111 134 73 297 208 361 44 264 230 217 112
3123 112 208 72 45 130 76 379 178 323 246 146 287 325 169 256 117 114 192 141 143 162 271 102 179 199 160 338 296 54 332
2981 332 88 26 54 45 19 144 206 509 478 222 295 219 175 203 150 113 240 58 15 74 69 111 43 361 270 334 677 1007 735 20
2833 20 416 86 143 143 160 28 126 176 192 68 428 90 201 254 94 341 176 64 146 182 39 137 228 435 320 327 278 226 275
2690 275 108 163 348 128 6 147 147 86 205 157 181 104 187 306 184 239 261 290 156 360 169 117 171 58 206 160 141 291
2552 291 132 217 273 140 228 206 244 121 128 29 41 70 430 168 323 226 160 76 324 333 154 168 96 129 142 152 18 455 61 179
2405 179 259 235 302 230 320 63 434 36 116 220 168 238 193 209 124 405 309 323 168 389 61 389 198 107 152 195 31 108 378
$$ packed form
3419A44m8l6L4l4K94j88J27q0j9m5N3ol8J99k07j13Q6p2j5J23J0R3p5k2K7J3j0j5N7j15O9
3266A91n4J62k28K63l00J95Q6r8L7P8k70J37l7r8m7J19m2RQK3o1K24q9J53l17K20l4j3j05
3123A12R6j36k7Q5n4L03k01J45p7j00J41L8j56Q7j39lP8n1KJ9J09j69P7K0l9J78m2k42K78
2981C32k44o2K8rk6J25O2L03l1k56P3p6m4K8n3l7J27j82m3N9nM2o8L18r1O4L43L30k72p15
2833B0L96l30N7%J7j32R8N0J6j24L60l38J11N3j60K47j65j12Q2L6j43R8R1K07j15Pm9n2M9
2690B75j67N5J85k20j22J41%o1J19m8K4p7Q3J19j22N5K2K9j34K04j91n2N4j13J48m6j9J50
2552B91j59Q5N6j33Q8k2L8j23Pr9J2K9L60k62J55r7o6q4K48Rj79J4p2L3J3J0j34M37l94J18
2405A79Q0k4O7p2R0k57L71l98Q0J04n2P0m5J6q5K81r6J4j55K21l28L28j91r1M5M3j64P7K70
$$ plain form
2262 378 213 344 262 372 158 359 357 92 366 37 196 96 235 271 105 150 252 408 204 309 90 281 344 205 289 86
2134 86 349 165 23 344 267 142 516 248 226 279 335 231 343 227 227 117 335 262 226 162 310 303 335 277 268 366 421 276 148
1991 148 251 139 313 339 313 147 420 409 317 703 1425 298 321 262 348 363 336 288 131 520 91 269 368 372 460 356 477 358
1853 358 509 345 363 348 380 301 260 340 506 447 318 418 591 445 494 704 399 568 349 596 380 572 437 312 507 503 519
1720 519 674 524 645 780 649 824 544 718 720 614 837 624 740 519 641 853 702 1040 1375 1318 790 1079 1523 1144
1602 1144 1211 1135 987 894 997 888 1280 1287 1893 2199 2508 2955 3403 3646 4151 4180 4199 4073 3751 3161 2620 4927 13337 41944
1484 41944 713696 843973 114717 34636 17726 12748 9782 8124 6953 5889 5434 4120 3541 2889 2130 1583
1405 1583 1377 913 958 1070 1311 1384 1258 1770 1607 1341 2123 13551 16133 2932 1212 453 543 469 478 903 689 732 976
$$ packed form
2262C78j65J31q2J10k14K01kk65K74l29J59j00J39L6j66M5J02J56k04J05k19J91O3j39Q4k03
2134H6K63j84j42L21p7j25L74k68k2N3N6j04J12j16%j10K18p3l6o4J48pL2n8rR8N5j45j28
1991A48J03j12J74K6k6j66K73j1r2L86P22j127K3n9Q6J5k7m8j57L89m29J78R9MQ8j04J21j19
1853C58J51j64J8j5L2p9m1Q0J66n9j29J00J73j46M9K10l05J69k19K47k16J92j35j25J95mJ6
1720E19J55j50J21J35j31J75k80J74Kj06K23k13J16k21J22K12j51L38L35n7n28K89M44l79
1602A144O7p6j48r3J03j09L92PO06L06L09M47M48K43N05K9J9j26l22n90n41K307Q410K8607
1484D1944O71752J30277p29256q0081j6910m978k966j658j171j064m55j314n79o52p59n47
1405A583k06m64M5J12K41P3j26N12j63k66P82J1428K582j3201j720p59R0p4RM25k14M3K44
$$ plain form
1292 976 799 589 954 630 523 638 503 611 352 534 428 631 564 676 546 912 270 734 385 448 384 449 308 325 293
1169 293 330 589 576 454 564 475 323 346 454 467 370 292 300 158 343 400 457 392 433 397 400 348 365 235 261 455 140 117 347 364
1021 364 102 398 359 433 366 187 614 169 303 285 242 52 93 313 306 296 254 400 294 422 197 452 256 262 117 272 131
889 131 100 225 251 150 389 338 353 381 290 176 242 335 102 289 186 90 293 132 370 177 561 183 304 439 206 167 255
756 255 345 209 243 135 358 69 163 246 414 279 246 401 239 297 152 300 206 44 291 102 31 332 197 235 345 166 288
623 288 332 197 272 179 198 277 87 111 113 254 109 178 495 112 269 348 129 318 169 265 142 287 173 176 52 229 223 124 323
480 323 98 302 382 111 933 337 700 141 225 261 175 195 52 376 281 236 308 88 522 228 74 124 155 70 114 28 92 238
342 238 161 151 259 248 407 204 273 186 215 283 186 153 159 91 215 111 514 76 288 325 242 226 82 255 243 209 135 47 83 261
$$ packed form
1292I76j77k10L65l24j07J15j35J08k59J82j06K03o7J12j30L66o42M64l49O3o4O5j41J7l2
1169B93L7K59j3j22J10q9j52K3J08J3r7p8Qj42J85N7N7o5M1l6Ln2J7j30K6J94l15k3K30J7
1021C64k62K96l9P4o7j79M27m45J34j8m3j90M1K20pj0m2J46j06J28k25K55j96Oj45J55j41
889A31l1J25K6j01K39n1J5K8r1j14O6R3k33J87j03r6K03j61K38j93L84l78J21J35k33l9Q8
756B55R0j36L4j08K23k89R4Q3J68j35l3J55j62N8j45J48r4j62K47j89p1L01j35L8J10j79J22
623B88M4j35P5r3J9P9j90K4KJ41j45O9L17l83J57P9k19J89j49R6j23J45j14Lj24J77or9J99
480C23k25K04Q0k71Q22n96L63n59Q4L6q6K0j43L24r5m5P2k20M34k94j54N0L1q5M4q6O4J46
342B38p7j0J08j1J59k03O9q7K9O8r7l3Oo8J24j04M03m38K12L7q3j6j44J73j2l4p4q8L6J78
$$ plain form
195 261 222 161 313 241 441 234 211 394 121 36 220 111 22 156 202 273 287 340 258 266 200 366 331 104 369 106 172 169 34 92
47 92 115 376 289 337 61 398 311 272 154 219 245 178 211 77 144 189 154 233 403 309 230 401 229 312 169 188 286 171 130 262 305
-106 305 66 213 264 300 363 343 390 196 350 229 249 108 99 72 243 250 236 485 135 396 405 345 371 234 346 204 247 166 278
-248 278 82 272 363 261 407 277 380 425 370 364 205 258 447 238 310 137 470 41 419 508 240 572 374 443 405 527 309
-381 309 279 435 234 405 348 504 356 559 473 696 580 523 495 722 309 695 743 376 479 505 611 470 488 724 646 630 770
$$ packed form
195B61l9o1J52p2K00k07k3J83k73q5J84j09q9J34M6P1J4N3q2Qo6J66l5k27K65k63O6lj35N8
47I2K3K61q7M8k76L37q7l9j18O5K6o7L3j34O7M5l5P9J70r4p9J71j72Q3j43J9R8j15m1J32M3
-106C05k39J47N1L6O3k0M7j94J54j21K0j41rk7J71Pj4K49l50K61Ro0K6j37J12j42M3q1J12
-248B78j96J90R1j02J46j30J03M5n5oj59N3J89k09P2j73L33m29L78Q9k68L32j98O9l8J22k18
-381C09l0J56k01J71n7J56j48K03q6K23j16n7k8K27m13L86M8l67J03K6J06j41J8K36p8j6J40
-514G70
##PAGE=	F1=-1621.73
##FIRST=	4521.1594499999982872,	4521.1594499999982872,	0
##DATA TABLE=	(F2++(Y..Y)), PROFILE
$$ plain form
4521 379 310 497 293 407 285 313 375 310 134 415 230 216 351 253 395 209 420 328 375 301 136 281 466 286 370 174 190
4388 190 120 246 368 198 441 91 437 124 204 336 74 6 235 194 202 86 155 133 147 334 173 95 258 315 184 176 41 283
4250 283 44 111 314 144 313 92 302 43 372 170 229 81 346 171 168 60 19 195 233 128 269 47 176 192 42 179
4122 179 244 134 215 150 373 133 121 198 179 143 168 142 127 206 119 338 62 246 81 292 100 138 103 245 258 143 254 98
3985 98 248 161 230 4 255 175 204 370 162 186 138 254 260 89 198 264 99 188 140 98 181 191 180 38 163 226 134 60 124 198
3837 198 145 35 271 58 211 95 71 51 219 118 152 271 108 93 96 288 153 133 116 159 89 91 43 79 100 66 256 139 210
3694 210 215 183 32 324 34 152 86 197 83 212 243 13 172 18 95 123 104 236 106 102 197 205 33 232 91 73 17 89 54
3551 54 5 226 159 172 124 131 79 194 147 143 115 140 74 185 236 169 95 102 126 279 178 164 87 355 187 291 126 82 47 41 92 323
$$ packed form
4521C79o9J87k04J14j22K8O2o5j76K81j85j4J35r8J42j86K11r2M7p4j65J45J85j80Q4j96J6
4388A90p0J26J22j70K43l50L46l13Q0J32k62o8K29m1Qj16O9k2J4J87j61p8J63N7j31qj35K42
4250B83k39O7K03j70J69k21K10k59L29k02N9j48K65j75lj08m1J76L8j05J41k22J29J6j50J37
4122A79O5j10Q1o5K23k40j2P7j9l6K5k6j5P9q7K19k76J84j65K11j92L8l5J42J3j15J11j56
3985I8J50q7O9k26K51q0K9J66k08K4m8J16Oj71J09O6j65Q9m8m2Q3J0j1j42J25O3r2p4O4P4
3837A98n3j10K36k13J53j16k4k0J68j01L4J19j63j5LJ92j35k0j7M3p0Km8L6K1l4J90j17P1
3694B10Nl2j51K92k90J18o6J11j14J29L1k30J59j54P7K8j9J32j30mR5Qj72J99j41j8n6P2l5
3551E4m9K21o7J3m8Pn2J15m7mk8K5o6J11N1o7p4PK4J53j01j4p7K68j68J04j65m4l5oN1K31
$$ plain form
3394 323 164 246 155 91 79 112 173 267 358 172 34 139 49 84 110 79 211 110 109 134 111 127 135 155 90 212 163 334 83 305 73
3241 73 157 267 271 171 259 70 174 56 61 40 165 116 118 124 45 67 182 193 286 95 225 147 180 149 166 47 25 153 120 348 218
3089 218 240 150 79 241 292 149 189 77 127 172 115 140 163 243 125 108 134 137 212 189 35 241 34 52 50 76 67 165 230 506 595 173
2931 173 190 184 126 78 98 94 156 38 56 81 53 42 57 292 198 290 521 976 665 22 327 72 152 154 180 64 103 107 163 87 294 125
2774 125 139 143 127 291 149 99 133 187 29 116 206 364 323 293 234 133 233 48 123 254 118 59 143 112 85 151 112 69 55 98 248
2621 248 98 128 243 243 165 314 137 94 175 26 46 133 82 205 56 142 190 51 161 132 182 93 94 62 28 85 354 69 236 165
2474 165 79 1 197 262 148 73 65 102 93 92 42 354 56 129 208 96 205 113 252 160 395 120 125 178 175 180 92 125 147 317 220 265 110
2311 110 221 90 307 200 110 99 158 71 65 271 114 311 160 249 156 239 250 74 288 45 116 61 180 247 39 58 127 273
$$ packed form
3394C23j59Q2r1o4j2L3O1R4R1j86j38J05r0L5K6l1J32j01jK5k3J6QK0o5J22m9J71k51K22k32
3241G3Q4J10Mj00Q8j89J04j18Nk1J25m9KOp9K2J15J1R3j91J30p8L3l1J7j19k2J28l3K28j30
3089B18K2r0p1J62N1j43M0j12N0M5n7K5K3Q0j18j7K6LP5k3j54K06k07J8kK6rR8O5K76Q9m22
2931A73J7on8m8K0mO2j18J8K5k8j1J5K35r4R2K31M55l11o43L05k55Q0KK6j16L9MN6p6K07j69
2774A25J4Mj6J64j42n0L4N4j58Q7R0J58m1l0n9j01J00j85P5J31j36n9Q4l1k7O6l9m3j4M3J50
2621B48j50L0J15%p8J49j77m3Q1j49K0Q7n1J23j49Q6M8j39J10k9N0q9Jl2l4N7K69k85J67p1
2474A65q6p8J96O5j14p5qL7rjn0L12k98P3P9j12J09r2J39r2K35k75NN3lNq8L3K2J70r7M5j55
2311A10J11j31K17j07r0j1N9q7oK06j57J97j51Q9r3Q3J1j76K14k43P1n5J19O7k08J9O9J46
$$ plain form
2173 273 101 227 40 190 247 155 217 148 267 118 61 220 183 117 429 170 111 175 205 119 238 152 128 67 248 207 123 29 189
2031 189 188 285 142 144 211 319 187 160 132 75 227 269 173 8 265 281 261 711 997 245 264 111 197 225 222 212 75 386 81 172
1883 172 152 264 297 157 271 159 333 215 174 192 210 124 88 189 328 243 185 216 357 273 273 450 214 361 130 329 193 367
1745 367 241 102 277 304 300 378 265 319 508 300 508 192 421 389 324 533 351 430 255 319 473 373 672 824 731 208 417
1612 417 1113 707 607 579 491 442 566 440 742 655 1135 1166 1301 1639 1823 1888 2262 2196 2107 2026 1831 1509 1222 2662 7452 22405
1484 22405 377931 455850 64503 20167 10216 7569 5592 4516 3743 3068 3037 2107 1870 1541 1068 796 1009 373
1396 373 517 565 807 784 567 1125 950 477 1253 8293 10407 1778 746 224 293 220 224 516 415 334 581 447 226 581
1277 581 306 230 380 244 375 152 298 205 381 308 381 284 618 30 470 169 257 192 268 179 185 179 143 347 338 268 316 266 95 191
$$ packed form
2173B73j72J26j87J50N7r2O2o9J19j49n7J59l7o6L12k59n9O4L0q6J19q6k4o1J81m1q4r4J60
2031A89jR7j43KO7J08j32k7k8n7J52M2r6j65K57J6k0M50K86p52J9j53Q6K8lj0j37L11l05R1
1883A72k0J12L3j40J14j12J74j18m1J8J8q6l6J01J39q5n8L1J41q4%J77k36J47k31J99j36J74
1745C67j26j39J75K7mP8j13N4J89k08K08l16K29l2o5K09j82P9j75O4J54j00K99J52r3n23K09
1612D17O96m06j00k8q8m9J24j26L02q7M80L1J35L38J84O5L74o6q9q1j95l22k87J440M790J4953
1484B2405L55526P7919l91347m4336r951k647j977j076p73o75l1r30k37l29m73k72K13o36
1396C73J44M8K42k3k17N58j75m73P76P040K114q629j032n22O9p3MK92j01q1K47j34k21L55
1277E81k75p6J50j36J31k23J46r3J76p3P3r7L34n88M40l01Q8o5P6q9Ool6K04rp0M8n0j71R6
$$ plain form
1130 191 226 308 252 201 161 134 208 239 308 218 222 226 227 163 213 77 174 348 74 56 255 240 101 317 180 293 191 45 492 163
982 163 171 168 111 32 92 243 220 186 103 281 156 274 10 328 165 140 23 202 23 27 169 177 141 275 252 174 230 150 70 109 205
830 205 27 257 77 150 276 76 280 226 451 145 218 327 85 99 96 261 164 181 99 305 70 107 171 302 142 164 252 144
692 144 165 26 240 106 34 177 63 53 245 154 134 230 39 147 230 107 189 70 159 200 53 94 80 201 110 74 401 64
554 64 179 203 11 205 89 211 164 272 148 158 105 195 140 27 244 46 180 299 199 788 233 575 353 348 235 154 187
421 187 74 271 157 135 212 104 388 140 35 71 110 76 90 40 44 180 123 43 168 102 273 153 183 107 137 280 130 121 147 45
273 45 162 144 435 48 189 223 153 123 35 177 179 201 124 83 78 197 142 91 228 181 291 141 110 266 79 50 112 127 43 95 246
121 246 196 198 247 125 149 115 241 229 63 257 134 170 168 55 55 98 228 235 252 103 311 175 180 80 102 172 73 189 124 98 138 95
$$ packed form
1130A91L5Q2n6n1m0k7P4L1O9r0MMJo4N0j36R7J74k74j8J99j5j39K16j37J13j02j46M47l29
982A63Qln7p9O0J51k3l4q3J78j25J18k64L18j63k5j17J79j79MJ42Ql6J34k3p8N6q0q0L9R6
830B05j78K30j80P3J26k00K04n4K25l06P3J09k42J4lJ65r7J7q2K06k35L7O4J31j60K2Q8j08
692A44K1j39K14j34p2J43j14j0J92r1k0R6j91J08Q3j23Q2j19Q9M1j47M1j4J21r1l6L27l37
554F4J15K4j92J94j16J22m7J08j24J0n3R0n5j13K17j98J34J19j00N89n55L42k22nj13q1L3
421A87j13J97j14k2P7j08K84k48j05L6L9l4J4n0MJ36n7q0J25o6J71j20L0p6L0J43j50rK6j02
273D5J17j8K91l87J41L4p0l0q8J42KK2p7m1nJ19n5n1J37m7J10j50l1J56j87k9O2J5q4N2J51
121B46n0KM9j22K4l4J26j2j66J94j23L6kj13%M3J30PJ7j49K08j36Nj00K2P0r9J16o5k6M0m3
$$ plain form
-37 95 150 315 238 148 260 133 152 131 82 209 168 28 239 243 65 120 155 163 221 213 268 168 280 95 153 61 37 44 186 179 180 384 120
-199 120 247 232 269 251 104 205 145 184 172 191 56 183 179 183 260 117 210 282 191 204 49 152 308 150 222 116 321 141 274
-342 274 351 47 398 170 236 216 319 144 111 289 139 267 249 315 244 364 249 453 371 227 284 403 106 427 476 182 236
-475 236 287 384 248 282 424 355 347 445
$$ packed form
-37I5N5J65p7r0J12j27J9k1m9J27m1j40K11Mj78N5L5QN8qN5j00J12j85N8r2k4PJ42pJK04k64
-199A20J27j5L7j8j47J01o0L9j2J9j35J27mMP7j43R3P2r1J3j55J03J56j58P2j06K05j80J33
-342B74P7l04L51k28O6k0J03j75l3J78j50J28j8O6p1J20j15K04q2j44N7J19k97L21M9k94N4
-475B36N1R7j36L4J42o9qR8
-514D45
##PAGE=	F1=-1631.58
##FIRST=	4521.1594499999982872,	4521.1594499999982872,	0
##DATA TABLE=	(F2++(Y..Y)), PROFILE
$$ plain form
4521 131 132 193 79 191 67 96 195 90 75 273 97 62 216 33 217 60 180 139 217 75 59 146 383 193 284 135 53 81
4383 81 201 275 82 258 180 300 67 75 253 96 100 152 76 164 16 48 20 125 195 71 100 133 181 154 51 101 208 16 218
4241 218 234 74 242 184 191 151 220 100 137 159 245 117 197 5 43 115 179 125 216 49 66 123 101 47 152 110 147 193 362 140 173
4088 173 185 144 202 148 55 53 136 47 251 129 219 108 232 77 147 54 228 222 48 208 260 254 121 180 88 233 100 194 401 145
3940 145 177 214 198 183 147 146 184 105 88 61 159 114 182 188 31 140 194 65 54 84 140 70 91 158 53 156 121 9 74 204 130 164
3783 164 228 79 130 63 201 153 115 21 125 140 56 5 68 125 61 203 98 142 214 198 54 217 62 79 33 145 88 186 260 33
3635 33 168 57 87 77 78 169 66 42 163 138 58 208 137 70 60 57 47 69 146 111 131 90 81 90 148 181 78 125 199 55 203 193 185 132
3468 132 101 100 228 168 97 73 339 229 313 129 57 35 19 137 287 178 208 112 88 54 40 166 346 356 215 44 147 58 116
$$ packed form
4521A31JO1j14J12j24K9R9j05j5J98j76l5J54j83J84j57J20m1P8j42j6Q7K37j90R1j49q2K8
4383H1J20P4j93J76p8J20k33QJ78j57MN2p6Q8j48L2k8J05P0j24K9L3M8k7j03N0J07j92K02
4241B18J6j60J68n8Pm0O9j20L7K2Q6j28Q0j92L8P2O4n4R1j67J7N7k2n4J05m2L7M6J69k22L3
4088A73J2m1N8n4r3kQ3q9K04j22R0j11J24j55P0r3J74oj74J60N2oj33N9r2J45j33R4K07k56
3940A45L2L7j6j5l6jL8p9j7k7R8m5O8Oj57J09N4j29j1L0N6p0K1O7j05J03l5j12O5J30p4L4
3783A64O4j49N1o7J38m8l8r4J04J5q4n1O3N7o4J42j05M4P2j6j44J63j55J7m6J12n7R8P4k27
3635C3J35j11L0j0JR1j03k4J21k5q0J50p1o7j0lj0K2P7l5K0m1rRN8L3j03M7P4j44J48j0qn3
3468A32l1jJ28o0p1k4K66j10Q4j84p2k2j6J18J50j09L0r6k4l4j4J26J80J0j41j71J03q9N8
$$ plain form
3325 116 63 77 176 44 145 103 30 85 115 82 89 224 174 359 95 274 88 105 229 314 109 203 133 141 34 84 65 189 128 138
3177 138 158 38 88 131 173 212 180 196 114 157 195 112 33 7 172 151 317 267 165 92 31 206 287 145 136 68 169 134 105 115 151 214
3020 214 160 66 126 127 109 118 34 161 67 88 75 117 117 181 241 501 685 137 102 171 97 34 101 85 85 63 99 76 23 72 59 213 146 229
2853 229 422 896 660 57 242 78 159 170 195 87 78 58 163 137 165 152 109 43 210 254 122 109 137 189 68 94 182 347 300
2710 300 282 243 62 206 142 104 188 118 97 129 71 91 113 82 27 50 57 209 71 46 246 229 157 259 111 110 188 29 91 123 56 132
2552 132 29 132 118 22 109 67 131 88 44 135 98 86 284 48 169 121 100 56 101 247 132 10 19 84 55 73 40 239 86 142
2405 142 170 12 137 41 198 225 364 182 148 154 169 129 54 66 177 246 190 242 76 93 150 227 207 139 100 131 113 45 185 63 301
2252 301 154 159 163 138 163 90 213 93 44 63 153 228 86 16 56 152 29 172 117 160 194 123 154 186 199 97 106 124 120 153 355 174
$$ packed form
3325A16n3J4R9j32J01m2p3N5L0l3PJ35n0J85k64J79j86J7J24Q5k05R4p0Qj07N0j9J24o1J0
3177A38K0j20N0M3M2L9l2J6q2M3L8q3p9k6J65k1J66n0j02p3o1J75Q1j42ro8J01l5k9J0L6O3
3020B14n4r4O0Jj8Rq4J27r4K1j3M2%O4O0K60J84n48l5O9p4o3O7j6%k2L6k3n3M9j3J54o7Q3
2853B29J93M74k36o03J85j64Q1J1K5j08rk0J05k6K8j3m3o6J67M4j32j3K8N2j21K6Q8J65m7
2710C00j8l9j81J44o4l8Q4p0k1L2n8K0K2l1n5K3PJ52j38k5K00j7p2J02j48jP8j59O2L2o7P6
2552A32j03J03j4r6Q7m2O4m3m4R1l7j2J98k36J21m8k1m4M5J46j15j22RO5k9J8l3J99j53N6
2405A42K8j58J25r6J57K7J39j82l4OJ5m0p5J2J11O9n6N2j66J7N7P7k0o8l9L1j8o8J40j22K38
2252C01j47NMk5K5p3J23j20m9J9R0P5j42p0M0R6j23J43n5M3L4p1L1L2J3j02RJ8mL3K02j81
$$ plain form
2095 174 107 123 111 41 156 112 69 40 216 174 73 114 103 131 257 136 115 106 261 135 235 84 92 171 221 61 98 134 189 318
1947 318 1098 950 259 244 30 159 108 148 158 203 261 198 122 47 188 177 84 111 20 202 143 64 86 70 1 45 78 183 97 131 134
1794 134 171 156 149 274 91 254 42 117 110 200 100 57 105 167 149 181 157 68 293 49 257 73 214 170 168 299 150 193 140 83
1647 83 167 142 348 360 181 254 160 645 311 120 143 145 161 254 134 314 206 536 377 347 609 601 517 779 684 500 480 400 345 342
1499 342 990 2975 7359 116438 150223 23870 8298 4012 3310 2217 1645 1213 851 1124 550 546 489 235 644 657
1400 657 63 215 184 374 321 88 593 401 315 357 3647 2500 182 176 55 208 112 87 235 253 110 286 224 95 293 59
1273 59 123 207 45 211 113 149 32 202 160 151 93 369 123 249 122 126 127 156 139 90 154 73 155 146 157 153 135 77 92 104 196 164 172 91
1105 91 219 100 109 178 116 94 90 120 113 104 41 141 266 109 110 193 171 174 276 113 182 73 200 378 204 73 80 95 92 121 199 182 111
$$ packed form
2095A74o7J6j2p0J15m4m3k9J76m2j01M1j1K8J26j21k1rJ55j26J00j51QP9N0j60L7L6N5J29
1947C18P80j48o91j5k14J29n1M0J0M5N8o3p6p5J41j1r3K7r1J82n9p9K2j6o9M4L3J05q6L4L
1794A34L7j5pJ25j83J63k12P5pR0j00m3M8O2j8L2k4q9K25k44K08j84J41m4kJ31j49M3n3n7
1647H3Q4k5K06J2j79P3r4M85l34j91K3KJ6R3j20J80j08L30j59l0K62qq4K62r5j84k0q0n5l
1499C42O48J985M384J09079L3785j26353j5572m286p02j093n72m32l62K73n74mn7k54M09J3
1400F57n94J52l1J90n3k33N05j92q6M2L290j147k318oj21J53r6k5J48J8j43J76o2j29J98k34
1273E9O4Q4j62J66r8L6j17J70m2rn8K76k46J26j27MJK9j7m9O4q1Q2rJ1mj8n8J5J2R2l2Qq1
1105I1J28j19RO9o2k2mL0pro3J00J25j57JQ3k2LJ02j63O9j09J27J78j74j31PJ5lK9P8j7p1
$$ plain form
943 111 16 194 108 162 129 243 133 55 61 144 64 86 122 116 159 175 198 76 112 44 21 25 84 111 228 9 191 258 48 214 290 339
785 339 158 207 240 105 99 37 188 133 124 79 227 73 108 120 209 63 107 137 67 61 105 197 109 28 83 31 60 163 130 83 122 52 23
623 23 150 111 135 36 131 139 27 70 69 161 133 18 315 101 104 91 92 117 72 173 210 249 115 140 152 164 60 74 182 131 83 233 228
460 228 552 81 382 500 457 162 127 149 127 165 68 94 122 133 266 85 112 45 77 87 59 67 70 134 116 48 102 90 144 111 150 52 116
298 116 255 96 87 125 45 111 190 344 100 117 177 91 100 117 125 127 185 120 119 71 136 72 43 155 177 164 97 89 163 90 114 22 135 65 42
126 42 273 149 117 168 25 72 101 147 143 53 161 151 191 153 126 28 132 87 211 180 227 243 60 107 77 53 103 12 160 154 124 120 59
-37 59 107 238 199 201 160 69 41 116 77 147 159 62 217 183 130 52 90 96 121 116 189 230 222 17 91 43 54 60 151 163 169 303 204 165 154 249 183
-219 183 20 89 121 169 220 108 77 103 99 153 137 40 73 181 58 79 64 114 187 163 169 111 195 254 152 218 113 256 37 78 73 143
$$ packed form
943A11r5J78q6N4l3J14j10p8OQ3q0K2L6oM3J6K3j22L6o8k3MN9K7J17k19J82O7k10J66P6M9
785C39j81M9L3j35oo2J51n5rm5J48j54L5J2Q9j46M4L0p0oM4R2q8q1N5n2K9J03l3m7L9p0k9
623B3J27l9K4r9R5Qj12M3jR2k8j15K97k14Lj3JK5m5J01L7L9j34K5J2J2j04J4J08n1m8J50n
460B28L24m71L01J18m3k95l5K2k2L8r7K6K8J1J33j81K7o7L2J0k8QLO4j8o8N4j2N4l3L9r8O4
298A16J39j59rL8q0O6P9J54k44J7O0q6RJ7QKN8o5jm8O5o4k9J12K2j3o7qP4p3K4r2J13p0k3
126D2K31j24l2N1j43M7K9M6mr0J08j0M0l8k7r8J04m5J24l1M7J6j83M7l0k4N0r1J48ol0mo1
-37E9M8J31l9Km1r1k8P5l9P0J2r7J55l4n3p8L8OK5nP3M1qk05P4m8J1OR1J2OJ34r9l9j1R5o6
-219A83j63O9L2M8N1j12l1K6mN4j6r7L3J08j23K1j5N0P3k4On8Q4N9j02O6j05J43k19M1nP0
$$ plain form
-376 143 116 38 186 102 168 215 161 204 223 102 239 275 57 122 149 110 205 242 59 120 114 210 110 188 193 145 151 179
$$ packed form
-376A43k7p8J48q4O6M7n4M3J9j21J37L6k18O5K7l9R5L7j83O1oR6j00P8Nm8OK8
-514A79
##PAGE=	F1=-1641.42
##FIRST=	4521.1594499999982872,	4521.1594499999982872,	0
##DATA TABLE=	(F2++(Y..Y)), PROFILE
$$ plain form
4521 74 170 33 87 130 136 93 85 104 213 173 33 251 142 151 98 184 50 11 125 81 146 116 304 169 214 152 82 88 208 217 127 135 262
4359 262 201 186 120 190 181 169 104 56 155 40 76 102 158 129 53 189 53 108 167 65 126 144 26 281 165 72 183 240 126 218 149
4206 149 65 121 195 180 129 217 45 96 51 123 147 229 65 137 144 177 39 76 114 102 216 339 154 224 174 124 264 158 125 25 119
4054 119 60 184 157 232 117 182 62 150 69 193 193 107 187 364 257 155 155 136 221 48 202 399 135 177 272 162 141 178 125 128
3906 128 125 51 14 192 73 181 197 40 126 157 34 33 139 117 46 118 66 126 117 142 22 89 196 164 170 191 72 151 77 126 183 109
3748 109 125 117 189 54 19 88 145 59 154 60 86 194 210 108 165 113 52 52 122 90 162 259 45 139 106 88 59 130 132 64 14 147 91 100
3581 100 195 156 77 91 72 49 111 95 83 121 97 88 107 110 195 53 142 231 32 212 156 203 162 157 85 185 166 47 95 317 258 353 145
3419 145 24 25 60 170 250 184 180 88 137 71 10 173 382 342 256 59 143 61 129 24 153 154 6 193 101 46 82 109 57 122 220 170
$$ packed form
4521G4R6j37N4M3Om3qJ9J09m0j40K18j09Rn3Q6j34l9J14m4O5l0J88j35M5o2p0OJ20Rr0QJ27
4359B62o1j5o6P0rj2o5m8R9j15L6K6N6k9p6J36j36N5N9j02O1J8j18K55j16r3J11N7j14R2o9
4206A49q4N6P4j5n1Q8j72N1m5P2K4Q2j64P2PL3j38L7L8j2J14J23j85P0n0n0J40j06l3j00R4
4054A19n9J24k7P5j15O5j20Q8q1J24%q6Q0J77j07j02%j9Q5j73J54J97k64M2R5j10k1L7n3L
3906A28lp4l7J78j19J08J6j57Q6L1j23jJ06k2p1P2n2O0rK5j20O7J07l2OK1j19P9p4M9N7p4
3748A09J6qP2j35l5O9N7q6R5r4K6J08J6j02N7n2o1%P0l2P2R7k14R4l3j8k9P1Ko8n0J33n6R
3581A00R5l9p9J4j9k3O2j6j2L8k4rJ9LQ5j42Q9Q9j99J80n6M7m1np2J00j9j19M8K22n9R5k08
3419A45j21JL5J10Q0o6mr2M9o6o1J63K09m0q6j97Q4q2O8j05J29Jj48J87r2n5L6K7n2O5R8n0
$$ plain form
3261 170 370 103 238 82 83 209 321 78 164 170 99 95 104 88 201 132 148 192 92 108 154 148 142 220 180 136 151 228 64 78 34 178
3104 178 167 285 295 117 70 7 182 293 142 105 83 190 90 113 71 123 184 182 57 154 131 62 89 39 109 133 105 96 160 164 189 230
2946 230 501 748 117 43 166 85 114 122 85 33 89 137 78 28 132 50 138 123 157 382 783 679 94 171 87 152 184 202 92 53
2798 53 51 176 167 78 162 99 49 260 231 97 94 155 182 99 76 168 368 256 270 280 23 188 209 94 160 127 117 108 26 96 92 86 97 58
2631 58 53 184 102 34 253 230 126 200 85 143 207 54 186 130 51 81 40 148 75 72 68 22 96 99 18 195 158 71 220 104 136 98
2474 98 148 83 83 264 111 72 38 75 30 97 29 143 108 163 147 81 136 53 166 256 342 217 165 150 143 101 79 51 183 204 199 246 67
2311 67 77 174 160 218 169 126 117 135 49 136 92 308 204 121 150 61 102 100 147 125 20 65 147 210 130 60 47 59 56 148 155 166 181 102 105 200
2134 200 149 95 113 79 86 193 294 194 155 135 65 22 106 102 66 23 224 155 88 199 65 155 244 179 160 116 230 105 281 110 115
$$ packed form
3261A70K00k67J35j56JJ26J12k43Q6Op1mRj6J13o9J6M4j00J6M6ooP8m0m4J5P7j64J4m4J44
3104A78j1J18J0j78m7o3J75J11j51l7k2J07j00K3m2N2O1kj25R7k3o9K7n0P0K4k8rO4MK5M1
2946B30K71K47o31p4J23q1K9Ql7n2N6M8n9n0J04q2Q8j5L4K25M01j04n85P7q4O5L2J8j10l9
2798E3kJ25rq9Q4o3n0K11k9j34lO1K7q3k3R2K00j12J4J0k57J65K1j15O6l3j0rq2P0moJ1l9
2631E8nJ31q2o8K19k3j04P4j15N8O4j53J32n6p9L0m1J08p3lmm6P4Lq1J77l7q7J49j16L2l8
2474I8N0o5%J81j53l9l4L7m5O7o8J14l5N5j6o6N5q3J13R0Q6j25n2j5pm2k2k8J32K1nM7j79
2311F7J0R7j4N8m9m3rJ8q6Q7m4K16j04q3K9q9M1kM7k2j05M5Q2O3q0p0j3J2lR2PJ1J5p9LR5
2134B00n1n4J8l4PJ07J01j00l9k0p0m3Q4ml6m3K01o9o7J11j34R0Q9o5j9m4J14j25J76j71N
$$ plain form
1981 115 153 195 63 152 60 137 373 1431 1187 298 254 83 205 26 128 121 302 157 259 106 157 140 105 148 77 103 124 117 105
1839 105 79 27 64 127 72 78 64 123 189 48 102 163 211 49 246 137 50 141 82 62 153 2 126 124 152 223 108 153 131 161 202 162
1681 162 145 196 156 35 122 176 66 54 77 145 241 294 339 312 189 84 272 139 147 199 123 136 34 202 167 313 263 73 164 372
1533 372 189 273 497 472 454 448 464 539 1313 3673 49339 46969 3362 362 276 376 247 279 443 585 147 429 322 196
1415 196 314 488 144 214 82 53 91 51 170 215 68 885 752 12793 14432 2101 485 142 253 120 94 61 212 227
1297 227 156 167 239 137 102 201 147 95 132 183 155 78 99 164 44 72 188 181 90 183 73 171 120 158 40 176 123 42 43 132 177 118 175
1135 175 54 157 142 111 168 128 290 47 23 82 98 104 21 101 191 45 94 142 208 144 174 165 159 202 263 139 108 81 288 277 226 25
977 25 53 170 128 140 185 198 105 83 148 157 105 203 200 131 9 108 98 114 126 89 79 172 98 170 116 56 62 41 31 22 151 202 64 209 237
$$ packed form
1981A15L8M2j32Q9r2P7K36J058k44q89m4j71J22j79J02pJ81j45J02j53N1j7l5M3p1K6K1pj2
1839A05k6n2L7O3n5Oj4N9O6j41N4O1M8j62J97j09q7R1n9k0R1j51J24kK8P1j15M5k2L0M1m0
1681A62j7N1m0j21Q7N4j10j2K3O8R6N3M5k7j23j05J88j33QN2p6J3j02J68l5J46n0j90R1K08
1533C72j83Q4K24k5j8oJ6P5P74K360M5666k370m3607l000q6J00j29L2J64J42m38K82j07j26
1415A96J18J74l44P0j32k9L8m0J19M5j47Q17j33J2041J639j2331j616l43J11j33k6l3J51J5
1297B27p1J1P2j02l5R9n4n2L7N1k8p7K1O5j20K8J16pr1R3j10R8n1L8j18J36n3q1JQ9M5n9N7
1135A75j21J03j5l1N7m0J62k43k4N9J6Oq3Q0R0j46M9M8O6o4L0roM3O1j24l1k7K07j1n1k01
977B5K8J17m2J2M5J3r3k2O5Rn2R8lo9j22R9j0J6J2l7j0R3p4P2n4o0Ok1j0rJ29N1j38J45K8
$$ plain form
805 237 50 182 320 239 166 232 181 168 118 133 135 116 72 84 135 74 131 91 161 140 60 67 15 37 181 172 175 38 28 33 58 102 130 101 59
633 59 95 78 103 139 111 78 108 103 10 48 71 134 142 91 253 113 64 65 128 85 97 162 248 222 79 124 187 136 42 113 140 187 33 189 199
460 199 281 200 147 569 544 165 98 112 181 73 71 95 47 131 167 72 157 29 55 105 26 93 105 112 127 87 80 160 34 70 153 28 134
298 134 210 103 72 95 62 77 216 250 110 86 170 73 144 162 123 82 159 120 154 58 101 23 14 106 184 81 112 119 95 125 146 39 139
135 139 76 13 277 144 60 110 74 44 119 97 86 45 88 152 215 127 172 8 179 45 203 133 303 193 33 67 77 110 46 65 128
-17 128 162 174 122 56 82 176 175 274 117 79 72 116 122 114 149 130 194 135 172 19 64 137 98 69 160 286 176 66 71 53 98 92 147 184 183 249
-194 249 257 186 186 248 181 66 41 112 180 255 47 98 38 192 162 53 91 51 135 31 62 117 127 95 233 153 114 113 318 71 119 206
-352 206 161 98 28 77 27 172 120 151 113 117 227 72 217 155 109 73 262 193 48 84 171 72 74 51 201 51 144 120 195 152 96 153
$$ packed form
805B37j87J32J38q1p3O6n1j3n0J5Kj9m4J2N1o1N7m0P0k1q0Pn2K2J44rLj37j0NK5M4K8k9m2
633E9L6j7K5L6k8l3L0nr3L8K3O3Qn1J62j40m9JO3m3J2O5Q6k6j43M5O3n1r4P1K7M7j54J56J0
460A99Q2q1n3M22k5l79o7J4O9j08kK4m8Q4L6r5Q5j28K6N0p9O7J2PJ5m0pQ0j26L6Q3j25J06
298A34P6j07l1K3l3J5J39L4j40k4Q4r7P1J8l9m1P7l9L4r6M3p8rR2P8j03L1Pk4L0K1j07J00
135A39o3o3K64j33q4N0l6l0P5k2j1m1M3O4O3q8M5j64J71j34J58p0J70j10j60L4J0L3o4J9O3
-17A28L4J2n2o6K6R4jR9j57l8pM4OqL5j9O4n9L7j53M5P3l9k9R1J26j10j10Nj8M5oN5L7jO6
-194B49Qp1%O2o7j15k5P1O8P5k08N1o0J54l0j09L8m0Q4j04L1N5J0l2J38q0l9jK05k47M8Q7
-352B06m5o3p0M9n0J45n2L1l8MJ10j55J45o2m6l6J89o9j45L6Q7r9Kk3J50j50R3k4P5m3n6N7
$$ plain form
-509 153 59
$$ packed form
-509A53r4
-514E9
##PAGE=	F1=-1651.27
##FIRST=	4521.1594499999982872,	4521.1594499999982872,	0
##DATA TABLE=	(F2++(Y..Y)), PROFILE
$$ plain form
4521 132 206 152 133 172 210 149 63 170 285 118 16 371 102 219 34 246 113 61 78 159 179 146 216 175 161 148 152 77 197 177
4373 177 173 98 278 139 232 175 148 225 206 98 129 167 64 111 156 181 136 59 229 15 115 186 108 123 97 35 299 115 88 132 249
4221 249 116 242 167 55 144 184 158 155 212 69 139 20 68 164 256 46 220 203 231 73 40 103 74 211 302 152 251 161 124 288
4073 288 172 190 40 116 80 130 153 242 108 146 58 136 103 144 171 182 188 401 251 177 141 145 204 32 216 365 138 178 303 160
3926 160 137 182 107 91 115 70 26 197 58 184 200 68 118 121 73 14 173 123 86 123 38 159 93 146 12 100 198 200 174 167 73 146 80
3763 80 71 194 120 187 124 207 79 34 109 159 65 123 35 48 156 203 131 168 151 61 76 115 104 142 243 48 91 131 81 59 175 118 67
3601 67 35 143 58 125 191 151 91 105 130 62 127 83 72 123 105 116 106 69 185 68 153 230 18 209 126 216 170 188 75 146 160 45
3443 45 113 282 272 389 165 11 36 93 190 217 174 159 88 164 81 40 183 371 311 278 72 127 52 125 7 220 136 38 209 125
$$ packed form
4521A32P4n4j9L9L8o1q6J07J15j67j02L55k69J17j85K12j33n2J7Q1K0l3P0m1j4j3Mp5J20k0
4373A77mp5J80j39R3n7k7P7j9j08L1L8j03M7M5K5m5p7J70k14J00P1p8J5k6o2K64j84k7M4J17
4221B49j33J26p5j12Q9M0k6lN7j43P0j19M8R6R2k10J74j7K8j58l3O3k9J37R1j50R9r0l7J64
4073B88j16J8j50P6l6N0K3Q9j34L8q8P8l3M1K7J1OK13j50p4l6MN9j72J84J49k27M0J25j43
3926A60k3M5p5j6K4m5m4J71j39J26J6j32N0Lm8n9J59n0l7L7q5J21o6N3j34Q8R8Kk6pr4P3o6
3763H0rJ23p4O7o3Q3j28m5P5N0r4N8q8J3J08M7p2L7j7r0J5L9j1L8J01j95M3M0n0k2J16n7n1
3601F7l2J08q5O7O6m0o0J4K5o8O5m4j1N1j8J1j0l7J16j17Q5P7k12J91q3R0m6J8j13P1J4j15
3443D5O8J69j0J17k24j54K5N7R7K7m3j5p1P6q3m1J43J88o0l3k06N5p5P3j18K13q4r8J71q4
$$ plain form
3296 125 99 101 103 96 173 200 153 365 111 198 60 72 203 292 74 135 177 52 125 117 106 202 131 144 213 127 119 185 121 78 214 171 166 161 244
3123 244 62 139 72 172 168 248 288 104 60 8 159 289 132 101 100 182 75 126 35 85 152 186 58 172 141 82 77 44 107 193 101 105
2966 105 196 198 189 200 506 785 107 40 160 91 160 140 90 10 110 167 104 84 175 41 86 130 80 391 677 683 132 124 92 129 191 198 80
2803 80 29 71 182 176 100 164 100 115 270 218 76 72 179 165 120 66 169 391 205 239 311 29 171 232 86 158 145 122 83 32 98
2651 98 83 118 141 60 43 161 125 55 249 224 79 143 57 171 222 71 232 144 37 52 37 157 76 98 35 30 79 111 77 236 199
2498 199 47 154 144 142 92 175 81 117 274 97 110 90 70 13 127 58 145 119 159 137 112 181 83 152 256 325 225 171 160 104 92 91
2341 91 60 163 189 206 266 75 121 163 120 234 187 148 111 140 59 124 128 321 244 121 111 4 69 98 97 146 59 53 142 193 152 85 43 40
2173 40 96 151 151 163 180 84 75 195 117 98 92 92 82 214 238 185 184 165 52 28 84 99 84 6 236 135 102 241 60 200 237 190 197 172
$$ packed form
3296A25k6KKpP7K7m7K12k54Q7j38J2J31Q9k18O1M2j25P3qj1R6p1J3O9q6qO6o4m3J36m3nnQ3
3123B44j82P7o7J00mQ0M0j84m4n2J51J30j57l1jQ2j07N1r1N0O7L4j28J14l1n9nl3O3Q6r2M
2966A05R1KrJ1L06K79o78o7J20o9O9k0n0q0J00N7o3k0R1j34M5M4n0L11K86On51ql2L7O2Pj18
2803H0n1M2J11op6O4o4J5J55n2j42mJ07j4m5n4J03K22j86L4P2k82J42O1j46P2j3k3l9n1O6
2651I8j5L5K3q1j7J18l6p0J94k5j45O4q6J14N1j51J61q8j07J5j5J20q1K2o3nM9L2l4J59l7
2498A99j52J07j0kn0Q3r4L6J57j77J3k0k0n7J14o9Q7k6M0k2k5O9r8O9J04O9j00n4j1n6j2j
2341I1l1J03K6J7O0j91M6M2m3J14m7l9l7K9q1O5MJ93p7j23j0j07O5K9jM9q7oQ9N1m1o7m2l
2173D0N6N5%J2J7r6rJ20p8j9o%j0J32K4n3jj9j13k4N6J5j5p8K30j01l3J39j81J40L7m7Pk5
$$ plain form
2006 172 201 74 286 126 111 154 183 112 154 84 115 367 1471 1295 338 278 121 237 23 133 97 352 81 271 107 216
1878 216 106 67 181 134 151 94 96 141 105 82 74 169 126 28 83 107 233 37 88 192 212 34 261 173 115 164 15 75 192 36 149
1725 149 169 180 274 178 97 185 216 223 190 166 234 100 15 171 196 115 193 98 170 353 513 370 320 167 274 419 244 203 251 137
1578 137 191 99 293 114 534 517 376 472 752 610 629 902 825 767 648 636 877 2033 7461 120711 135100 16664 3937
1464 3937 2514 1163 1186 1143 1172 1213 762 826 731 487 602 499 718 203 48 130 281 167 258 33 234 1145 1234 19079 23110
1341 23110 3484 919 301 321 175 175 30 197 315 157 173 289 108 168 231 142 154 115 215 208 126 50 192 81 111 81 163
1209 163 25 194 68 190 111 167 24 186 137 49 89 134 255 138 208 66 196 135 76 153 169 324 71 52 26 90 131 53 114
1066 114 245 38 101 144 170 154 219 159 163 183 254 137 68 112 305 191 215 12 70 228 146 139 196 233 134 109 139 199 95 217 181
$$ packed form
2006A72K9j27K12j60j5M3K9p1M2p0L1K52J104j76r57o0j57J16k14J10l6K55k71J90j64J09
1878B16j10l9J14m7J7n7KM5l6k3qR5m3r8N5K4J26j96N1J04K0j78K27q8n8M9j49O0J17j56J13
1725A49K0J1R4r6q1Q8L1Pl3k4O8j34q5J56K5q1P8r5P2J83J60j43n0j53J07J45j75m1M8j14
1578A37N4r2J94j79M20j7j41R6K80j42J9K73p7n8j19j2K41J156N428J13250J4389j18436j2727
1464C937j423j351K3m3K9M1m51O4r5k44J15j03K19n15j55Q2J51j14R1k25K01R11Q9J7845M031
1341B3110j9626k565o18K0j46%j45J67J18j58J6J16j81O0O3q9J2l9J00pq2p6J42j11L0l0Q2
1209A63j38J69j26J22p9N6j43J62m9q8M0M5J21j17P0j42J30o1n9P7J6J55k53j9k6O4M1p8O1
1066A14J31k07O3M3K6j6O5o0MK0P1j17o9M4J93j14K4k03N8J58q2pN7L7r9k5L0O0j04J22l6
$$ plain form
913 181 120 12 134 66 134 132 68 69 170 50 155 151 66 104 43 29 89 148 173 87 204 215 60 172 308 161 149 251 150 210 118
761 118 193 107 106 23 109 47 76 142 73 163 224 28 35 19 67 221 160 223 65 38 56 59 76 148 138 107 104 141 86 143 102 92 88 92 3 40 77
578 77 117 126 146 218 93 80 102 123 109 110 171 263 198 49 115 208 113 98 117 119 206 42 167 143 237 369 116 584 598 303 67 201
421 201 248 41 104 83 30 93 97 74 168 7 44 127 7 116 123 115 137 99 97 201 57 45 152 44 144 150 119 82 65 74 64 219 162
259 162 80 85 160 79 176 173 159 36 124 122 184 40 112 29 18 87 174 55 136 133 74 160 143 68 143 75 13 260 158 34 76 109 47 123
91 123 80 62 29 40 150 229 95 191 21 214 145 197 114 328 158 101 80 50 147 42 92 100 150 206 118 60 55 129 146 312 119 118 104
-71 104 120 148 111 147 172 173 108 178 14 43 185 111 71 158 302 138 88 76 68 122 122 161 197 194 215 261 235 223 229 205 109 77 103 186 256 38
-248 38 106 11 272 177 36 103 110 123 54 100 119 127 39 292 152 113 81 330 45 57 239 108 131 66 123 63 192 156 160 119 111 235
$$ packed form
913A81o1j08J22o8O8ko4JJ01j20J05mq5L8o1j4O0N9K5q6J17J1j55J12J36j47j2J02j01O0r2
761A18P5q6jq3Q6o2K9O6o9R0O1j96Pj6M8J54o1O3j58k7J8LJ7P2j0l1lL7n5N7m1j0mMq9L7L7
578G7M0RK0P2j25j3K2K1j4JO1R2o5j49O6R3r5j5J9KQ7j64J25k4R4J32k53M68J4k95k36J34
421B01M7k07O3k1n3O3Mk3R4j61L7Q3j20J09PqK2l8kJ04j44j2J07j08J00Ol1l7j7Rj0J55n7
259A62q2NP5q1R7lj4j23Q8kO2j44P2q3j1O9Q7j19Q1ln9Q6j7p5P5o8o2K47j02j24M2L3o2P6
91A23m3j8l3J1J10P9j34R6j70J93o9N2q3K14j70n7k1l0R7j05N0QN0N6q8n8nP4J7J66j93jj4
-71A04J6K8l7L6K5Jo5P0j64K9J42p4m0Q7J44j64n0j2qN4%L9L6lK1M6k6j2Ok4r6l2K6Q3P0k18
-248C8O8r5K61r5j41O7PJ3o9M6J9Qq8K53j40l9l2K49k85J2J82j31K3o5N7o0J29l6Mm1qJ24
$$ plain form
-406 235 64 233 128 138 51 244 263 68 160 169 102 63 48 268 91 163 149 201 224 120 212 127
$$ packed form
-406B35j71J69j05J0q7J93J9j95R2Ro7l9j5K20j77P2j4N2K3j04R2q5
-514A27
##PAGE=	F1=-1661.11
##FIRST=	4521.1594499999982872,	4521.1594499999982872,	0
##DATA TABLE=	(F2++(Y..Y)), PROFILE
$$ plain form
4521 123 179 192 131 184 218 149 63 167 295 99 84 415 73 203 21 240 143 87 48 170 158 157 143 165 117 112 181 47 154 140
4373 140 172 106 234 104 211 187 132 233 219 132 176 193 79 112 171 188 147 43 220 9 143 195 113 103 66 51 281 91 91 88
4226 88 217 134 236 199 59 156 139 160 167 177 92 171 37 18 165 265 1 272 253 262 64 83 73 59 178 253 131 250 150 137
4078 137 270 176 225 48 102 87 86 129 227 88 123 68 109 124 95 164 228 202 380 239 164 125 122 176 40 228 305 147 175 302 182
3926 182 143 163 77 63 76 78 36 179 50 185 192 105 113 90 107 35 170 147 125 118 69 159 81 139 24 110 205 226 177 157 76 120 61 46
3758 46 179 144 207 133 193 106 49 120 167 76 117 45 32 113 182 132 183 169 62 77 111 132 130 214 54 46 141 63 61 195 110 65 61 145 46
3586 46 134 190 127 108 101 190 85 124 92 61 121 100 139 101 46 155 82 148 196 27 194 99 219 157 186 72 110 151 84 123 237 270
3428 270 405 186 45 72 114 198 190 151 140 104 163 73 65 191 323 264 275 83 102 43 109 33 268 117 60 188 164 137 119 89 137
$$ packed form
4521A23N6J3o1N3L4o9q6J04J28j96j5L31l42J30j82K19r7n6l9J22j2jj4K2m8nO9j34J07j4
4373A40L2o6J28j30J07k4n5J01j4q7M4J7j14L3N9J7m1j04J77k11J34N2q2j0l7j5K30j90%l
4226H8J29q3J02l7j40R7j7K1PJ0q5P9j34j9J47J00k64K71j9Rj98J9j0j4J19P5j22J19j00j3
4078A37J33r4M9j77N4j5jM3R8j39L5n5M1J5k9O9O4k6J78j41p5l9lN4j36J88P7j58K8J27j20
3926A82l9K0q6j4J3Km2J43j29J35Pq7Qk3J7p2J35k3k2pm9R0p8N8j15Q6R5K1m9k0q1M4n9j5
3758D6J33l5O3p4O0q7n7P1M7r1M1p2j3Q1O9n0N1j4j07J5L4K1kQ4j60qR5p8kJ34q5m5mQ4r9
3586D6Q8N6o3j9pQ9j05L9l2l1O0k1L9l8n5J09p3O6M8j69J67r5J20o2K9j14L8M1o7L9J14L3
3428B70J35k19j41K7M2Q4ql9j1l6N9r0qJ26J32n9J1j92J9n9O6p6K35j51n7J28k4k7j8l0M8
$$ plain form
3276 137 226 167 127 341 120 156 31 52 198 235 78 112 161 41 124 126 117 195 123 123 212 145 123 196 98 22 172 164 179 179 244 96 198
3113 198 107 158 156 205 247 109 45 19 134 268 120 118 114 148 107 131 67 60 117 170 50 166 149 99 61 51 139 239 78 101 219 212 179
2951 179 158 508 793 99 61 153 110 173 156 97 14 129 186 146 144 198 44 80 159 28 446 643 665 170 100 95 99 185 181 56 16 96
2793 96 169 172 150 171 113 160 246 211 66 74 206 138 135 63 179 390 181 186 324 56 150 215 81 163 165 118 64 78 105 82 163 160 73 26
2626 26 133 128 66 226 201 27 94 30 185 225 79 232 153 20 41 24 158 90 103 15 51 76 116 125 256 216 30 83 163 171 97 180
2469 180 59 140 259 99 123 129 69 29 150 110 228 124 126 134 115 228 113 147 235 310 212 165 179 75 88 82 64 131 187 204 287 91
2311 91 135 132 119 251 188 159 107 132 67 124 146 330 259 130 55 42 60 91 75 157 84 31 127 174 157 101 50 75 121 172 116 138 172 70
2144 70 62 176 97 104 69 126 93 213 177 143 193 183 39 19 76 89 109 26 233 112 94 243 55 230 228 168 215 214 170 36 259 112
$$ packed form
3276A37Q9n9m0K14k21L6j25K1J46L7j57L4M9j20Q3KrP8p2%Q9o7k2P3r8p6J50qJ5%O5j48J02
3113A98r1N1kM9M2j38o4k6J15J34j48kmL4m1K4o4pN7N3j20J16j7n0l8j0Q8J00j61K3J18pl3
2951A79k1L50K85o94l8R2m3O3j7n9q3J15N7m0kN4j54L6P9j31M18J97K2m95p0nMQ6mj25m0Q0
2793I6P3Lk2K1n8M7Q6l5j45QJ32o8lp2J16K11k09NJ38k68R4O5j34Q2Km7n4J4K7k3Q1lq7m7
2626B6J07no2J60k5j74O7o4J55M0j46J53p9j33K1j7J34o8J3q8L6K5M0RJ31m0j86N3Q0Qp4Q3
2469A80j21Q1J19j60K4Oo0m0J21m0J18j04KQj9J13j15L4Q8P5r8m7J4j04J3oj8O7N6J7Q3j96
2311I1M4lj3J32o3k9n2K5o5N7K2J84p1j29p5j3J8L1j6Q2p3n3R6M7j7n6n1K5M6N1n6K2L4j02
2144G0qJ14p9Pl5N7l3J20l6l4N0j0j44k0N7J3K0q3K07j21j8J49j88J75ko0M7jm4j34K23j47
$$ plain form
1986 112 84 153 173 135 112 119 113 294 1167 1130 368 304 137 231 36 129 100 358 34 252 123 222 75 43 184 170 159 98 67 145
1839 145 113 101 65 188 165 58 72 86 234 58 97 182 209 30 258 162 128 161 26 59 186 27 184 204 172 271 184 100 170 266
1691 266 159 195 130 227 106 21 189 177 97 270 67 202 350 537 427 252 368 373 394 218 165 220 138 172 111 263 109 550
1553 550 488 416 428 741 623 569 847 741 686 520 600 891 1939 7345 117699 136347 18397 4677 3005 1529 1340
1450 1340 1225 1188 1207 852 772 770 480 727 1993 1950 48 53 95 470 222 299 132 305 1049 1163 17594 22572 3578 984
1332 984 346 316 199 215 45 134 325 137 150 252 80 158 201 133 155 121 208 229 124 52 180 79 100 51 104 71 149 69 167 92
1184 92 151 32 174 110 57 116 142 295 146 193 107 177 150 48 126 184 320 103 90 20 53 130 61 123 258 74 85 135 144 150 247 165
1026 165 156 138 234 113 52 110 268 118 177 23 79 258 156 117 223 263 159 103 153 210 92 189 165 93 30 148 43 130 110 60
$$ packed form
1986A12k8O9K0l8k3PoJ81Q73l7p62o4j67R4j95R3k9K58l24K18j29R9j47l2J41j4j1o1l1P8
1839A45l2j2l6J23k3j07J4J4J48j76L9Q5K7j79K28r6l4L3j35L3J27j59J57K0l2R9q7q4P0R6
1691B66j07L6o5R7j21q5J68j2q0J73k03J35J48J87j10j75J16NK1j76n3N5q2L4o1J52j54M41
1553E50o2p2J2L13j18n4K78j06n5j66Q0K91J048N406J10354J8648j17950j3720j672j476j89
1450A340j15l7J9l55q0kk90K47J266m3j902NM2L75k48P7j67J73P44J14J6431M978j8994k594
1332I84o38l0j17J6j70Q9J91j88J3J02j72P8M3o8K2l4Q7K1j05p2J28j01K1m9N3l3P8q0R8p5
1184I2N9j19J42o4n3N9K6J53j49M7q6P0k7j02P8N8J36k17j3p0L3P7o9O2J35j84J1N0ROR7q2
1026A65rj8R6j21o1N8J58j50N9j54N6J79j02l9J06M0j04n6N0N7j18R7k4p2o3J18j05Q7k0n0
$$ plain form
879 60 72 155 31 146 152 77 117 34 27 124 110 137 88 180 192 63 163 264 111 120 258 136 236 100 221 102 95 25 144 44 84
726 84 132 55 186 281 71 54 42 74 227 151 238 92 50 73 64 76 176 176 172 111 168 85 126 97 82 72 92 4 48 87 106 88 184 203 61
554 61 112 128 110 143 100 179 254 183 42 109 217 104 147 92 112 192 52 163 103 416 448 330 544 588 408 39 308 283 78 115
406 115 47 77 32 56 71 153 35 55 146 31 141 124 132 137 102 124 210 119 66 134 78 134 88 117 94 51 89 58 204 92 39 88 132 77
239 77 181 162 200 16 85 125 207 22 142 60 36 86 151 51 146 123 83 188 111 67 151 63 1 226 165 19 75 104 67 107 78 58
81 58 27 25 165 230 63 189 53 228 222 184 121 310 149 153 118 13 149 77 97 82 122 210 103 60 31 88 112 311 146 148 103 124
-76 124 157 118 153 191 155 103 150 8 33 205 110 99 159 279 100 84 93 85 123 145 174 184 192 193 226 261 225 185 222 147 98 96 173 222 51
-248 51 105 39 304 181 50 71 142 115 50 108 90 99 39 323 151 102 83 299 45 33 220 76 114 63 126 86 169 148 174 103 128
$$ packed form
879F0J2Q3j24J15Op5M0q3pR7j4K7m9R2J2j29J00J01j53RJ38j22J00j36J21j19pp0J19j00M0
726H4M8p7J31R5k10j7j2L2J53p6Q7j46m2K3rJ2J00%mo1N7q3M1k9j5j0K0q8M4L9J9j8R6J9j42
554F1N1J6j8L3m3P9P5p1j41O7J08j13M3n5K0Q0j40J11o0L13L2j18K14M4j80l69K69k5k05L7
406A15o8L0m5K4J5Q2j18K0R1j15J10j7QNl5K2Q6r1n3O8n6N6m6K9k3m3L8l1J46j12n3M9M4n5
239G7J04j9L8j84O9M0Q2j85J20q2k4N0O5j00R5k3m0J05p7m4Q4q8o2K25o1j46N6K9l7M0k9k0
81E8l1kJ40O5j67J26j36J75ol8o3J89j61Ml5j05J36p2K0j5M0Q8j07m3k9N7K4J99j65Km5K1
-76A24L3l9L5L8l6n2M7j42K5J72r5j1O0J20j79j6RqL8K2K9J0QJL3L5l6m0L7p5m9kP7M9j71
-248E1N4o6K65j23j31K1P1k7o5N8j8Ro0K84j72m9j9K16k54j2J87j44L8n1O3m0Q3k1K6p1K5
$$ plain form
-401 128 218 74 232 96 129 118 193 255 72 181 119 140 96 32 280 101 173 137 182 254 96 224 142
$$ packed form
-401A28R0j44J58j36L3j1P5O2j83J09o2K1m4o4K48j79P2l6M5P2j58J28q2
-514A42
##PAGE=	F1=-1670.96
##FIRST=	4521.1594499999982872,	4521.1594499999982872,	0
##DATA TABLE=	(F2++(Y..Y)), PROFILE
$$ plain form
4521 68 124 173 141 157 181 114 68 111 262 101 177 398 72 125 52 191 128 94 56 135 104 145 154 133 77 56 175 45 94 102 128 101 153
4359 153 84 141 162 139 220 219 180 193 226 105 100 157 190 136 16 173 22 162 196 88 78 43 80 243 91 87 47 163 151 220 215 68
4201 68 144 80 168 163 115 126 192 49 23 150 247 61 297 283 270 51 134 53 56 125 197 100 221 153 153 216 167 234 51 86 107 69 101
4039 101 188 66 112 84 80 130 83 177 242 217 317 221 127 108 78 141 49 235 234 152 163 272 207 138 129 34 33 20 73 37 149 40 178
3876 178 176 143 112 67 123 54 135 179 151 112 83 137 78 126 75 122 215 236 178 153 88 84 31 49 144 166 195 136 150 125 64 124 169 88 127 71
3699 71 31 83 165 122 184 164 51 55 102 162 129 178 69 69 150 40 64 192 101 65 88 151 67 133 188 99 129 81 238 116 107 99 42 109
3532 109 83 154 110 80 117 89 121 137 38 169 74 210 128 157 79 80 154 127 136 187 252 392 209 75 123 123 198 171 121 122 123 141 54 89 195
3360 195 251 208 244 91 75 66 90 62 295 95 76 137 202 159 132 69 163 264 131 97 298 132 117 8 17 188 165 81 93 131 85
$$ packed form
4521F8N6M9l2J6K4o7m6M3J51j61P6K21l26N3p3J39o3l4l8P9l1M1Rk1n6k1J19j30M9QK6k7N2
4359A53o9N7K1k3Q1jl9J3L3j21nN7L3n4j20J57j51J40L4j08j0l5L7J63j52mm0J16j2O9nj47
4201F8P6o4Q8nm8J1O6j43k6J27R7j86K36j4j3k19Q3q1LO9P2r7J21o8%O3m9O7j83L5K1l8L2
4039A01Q7j22M6k8mN0m7R4O5k5J00r6r4j9l0O3r2J86jq2J1J09o5o9rr5jj3N3l6J12j09J38
3876A78kl3l1m5N6o9Q1M4k8l9k9N4n9M8n1M7R3K1n8k5o5mn3J8R5K2K9n9J4k5o1O0M5q1L9n6
3699G1m0N2Q2m3O2k0j13MM7O0l3M9j09%Q1j10K4J28r1l6K3O3q4O6N5q9L0m8J57j22rqn7O7
3532A09k6P1m4l0L7k8L2J6r9J31r5J36q2K9p8JP4k7RN1O5J40j83j34M8%P5k7n0JJJ8q7L5J06
3360A95N6m3L6j53j6rK4k8K33k00j9O1O5m3k7o3R4J01j33l4K01j66j5j09RJ71k3q4J2L8m6
$$ plain form
3207 85 104 136 124 184 106 87 189 152 121 190 83 23 110 153 170 194 237 125 245 131 144 136 154 185 120 30 37 106 228 109 144 123 99
3045 99 148 126 111 78 83 141 35 136 145 96 39 58 174 265 43 90 226 199 163 115 499 768 90 72 149 127 160 174 103 10 150 192
2887 192 184 202 203 58 99 197 103 539 718 643 202 91 97 69 165 156 44 28 125 138 169 183 189 133 186 198 210 74 103 230 105 152 68
2725 68 184 358 215 119 315 93 122 170 80 168 183 108 59 113 119 90 217 163 106 43 99 125 81 189 155 31 56 20 185 214 79
2572 79 197 152 54 37 37 158 97 94 28 68 84 114 150 253 208 38 29 164 201 108 168 40 141 216 108 116 144 75 61 162 162 315 126
2410 126 72 133 108 265 146 143 204 294 185 155 205 92 81 56 57 111 189 201 298 110 119 108 146 261 175 163 100 121 68 121 145 324 254
2247 254 141 33 86 67 90 84 161 96 23 107 151 155 116 87 93 132 198 65 95 156 62 61 154 88 116 74 160 111 193 110 81 198 182 22
2080 22 16 72 74 143 56 217 85 74 217 45 234 209 138 225 239 157 40 214 80 44 148 158 137 45 135 123 181 609 741 378
$$ packed form
3207H5J9L2j2O0p8j9J02l7l1O9j07o0Q7M3J7K4M3j12J20j14J3qJ8L1o5r0PO9J22j19L5k1k4
3045I9M9k2j5l3NN8j06J01Rm9n7J9J16R1k22M7J36k7l6m8L84K69o78j8P7k2L3J4p1r3J40M2
2887A92qJ8Jj45M1R8r4M36J79p5m41j11Ok8R6rj12j6R7J3L1J4On6N3J2J2j36K9J27j25M7q4
2725F8J16J74j43r6J96k22K9M8r0Q8J5p5m9N4Ok9J27n4n7o3N6K6m4J08l4j24K5l6J65K9j35
2572G9J18m5r8j7%J21o1lo6M0J6L0L6J03m5j70rJ35L7r3O0j28J01P5j08QK8o9j4J01%J53j89
2410A26n4O1k5J57j19lO1R0j09l0N0j13j1k5JN4P8J2R7j88Rj1L8J15q6j2o3K1n3N3K4J79p0
2247B54j13j08N3j9K3oP7o5p3Q4M4Ml9k9OL9O6j33L0O1r4jR3o6K8m2Q6m9Q2q3k9J17j6j60
2080B2oN6KO9q7J61j32j1J43j72J89k5p1Q7J4q2j17J74j34l6J04J0k1r2R0j2N8M28J32l63
$$ plain form
1932 378 325 140 193 36 105 125 327 24 229 153 188 46 44 195 181 145 122 40 139 107 97 89 202 184 92 44 94 201 59 125 139
1779 139 189 84 235 115 95 136 23 24 157 4 223 227 145 224 162 118 144 279 52 171 50 194 143 52 167 139 41 302 56
1637 56 160 230 449 460 242 419 352 255 117 80 146 125 122 53 161 75 422 307 300 183 497 393 283 527 421 401 229 463
1499 463 682 1117 4715 70909 85194 12737 3223 2332 1131 908 817 769 817 615 455 584 291 820 4126 3507 203
1396 203 141 32 557 194 371 182 314 633 563 7241 10994 2156 582 227 181 146 168 26 12 286 85 93 175 40 96
1273 96 140 120 120 131 178 210 91 95 131 62 72 62 58 103 77 90 121 59 126 45 143 67 71 116 172 295 156 151 154 113 174 48 99 179 282 127
1095 127 116 18 24 121 56 128 242 124 79 121 128 152 262 179 137 101 205 133 51 82 206 61 125 71 75 263 168 77 255 280 172 85
938 85 174 193 79 152 142 62 50 157 32 114 71 62 77 132 31 143 139 81 111 34 66 125 53 94 83 144 172 57 145 201 92 111 258
$$ packed form
1932C78n3j85N3j57O9K0K02l03K05p6L5j42kJ51j4l6k3q2R9l2j0qJ13j8r2m8N0J07j42O6J4
1779A39N0j05J51j20k0M1j13JJ33j53K19Mq2P9o2m4K6J35k27J19j21J44n1r1J15k8r8K61k46
1637E6J04P0K19J1k18J77o7r7j38l7O6k1lo9J08q6L47j15pj17L14j04j10K44j06k0j72K34
1499D63K19M35L598O6194J4285p2457r514q91j201k23r1m8M8k02j60J29k93N29L306o19l304
1396B03o2j09N25l63J77j89J32L19p0O678L753q838j574l55m6l5K2j42j4K74k01QQ2j35N6
1273I6M4k0%J1M7L2j19ML6o9J0j0mM5k6J3L1o2O7q1R8p6MM5N6J23j39nLm1O1j26N1Q0J03j55
1095A27j1r8OR7o5P2J14j18m5M2PK4J10q3m2l6J04p2q2L1J24j45O4n4MJ88r5r1J78K5j08q7
938H5Q9J9j14P3j0q0j2J07j25Q2m3rJ5N5j01J12mn8L0p7L2N9p2M1j1O1K8j15Q8N6j09J9J47
$$ plain form
775 258 130 259 89 225 110 75 73 182 93 98 104 39 206 309 120 105 64 62 209 133 226 112 48 77 66 77 202 215 222 142 164 92
618 92 103 94 67 63 96 13 57 102 100 38 212 202 59 132 142 134 174 74 174 225 181 54 102 217 118 178 55 113 154 54 165 101 516
455 516 422 495 456 456 359 24 298 203 107 117 4 118 44 35 67 125 74 79 155 49 172 113 150 126 115 148 199 160 100 110 114 109 36 91 99
283 99 66 117 46 185 55 71 86 90 61 160 144 235 69 54 129 220 17 167 97 49 84 128 40 139 100 99 208 74 44 163 56 26
126 26 180 155 12 100 67 97 79 91 56 46 36 196 217 43 178 93 220 273 161 141 261 165 192 157 48 119 105 91 78 89 187
-27 187 80 67 51 48 92 282 184 164 84 128 158 122 166 195 138 107 95 19 77 200 96 141 151 227 62 70 122 101 102 161 178 145 177 183 168
-199 168 256 195 127 223 187 98 93 142 161 47 97 59 289 175 50 15 150 112 62 88 60 53 57 325 151 80 104 239 54 30 168
-352 168 57 64 35 93 75 119 109 176 75 156 177 80 216 52 111 150 134 188 65 161 82 144 92 76 254 92 153 96 171 237 61
$$ packed form
775B58j28J29j70J36j15l5kJ09q9NOo5J67J03j89j5m1kJ47p6R3j14o4K9j1J1J25J3Pq0K2p2
618I2J1rk7mL3q3M4M5ko2J74j0j43P3J0qM0j00J00N1m4j27M8J15r9O0j23N8M1j00J11o4M15
455E16r4P3l9%r7l35K74r5r6J0j13J14p4rL2N8n1NP6j06J23n9L7k4j1L3N1l9o0J0Mnp3N5Q
283I9l3N1p1J39j30J6J5Mk9R9j6R1j66j5P5R1k03J50p0m8L5M4q8R9l9jJ09j34l0J19j07l0
126B6J54k5j43Q8l3L0j8J2l5j0j0J60K1j74J35q5J27N3j12k0J20r6K7l5j09P1j4j4j3J1R8
-27A87j07j3j6lM4J90r8k0q0M4L0l6M4K9n7l1j2p6N8J23j04M5J0P6j65QN2k1JN9J7l3L2Oj5
-199A68Q8o1o8R6l6q9nM9J9j14N0l8K30j14j25l5J35l8n0K6k8pMK68j74p1K4J35j85k4J38
-352A68j11Pk9N8j8M4j0O7j01Q1K1r7J36j64N9L9j6N4j23R6p9O2n2j6J78j62O1n7P5O6j76
$$ plain form
-504 61 197 106
$$ packed form
-504F1J36r1
-514A06
##PAGE=	F1=-1680.8
##FIRST=	4521.1594499999982872,	4521.1594499999982872,	0
##DATA TABLE=	(F2++(Y..Y)), PROFILE
$$ plain form
4521 39 117 124 193 111 126 83 98 30 214 112 267 347 104 13 86 131 94 106 94 90 49 122 222 87 41 29 148 84 43 80 58 75 73
4359 73 66 46 115 154 200 215 223 185 255 143 120 126 193 109 16 114 38 171 191 48 59 20 114 203 104 88 31 117 156 214 219 78 116 25 177
4186 177 149 36 168 199 49 48 130 208 122 306 288 259 93 174 79 59 68 138 70 172 173 167 147 143 218 54 83 155 97 78 133 55 106 96
4019 96 66 128 119 200 232 225 234 198 83 98 29 108 60 231 172 148 141 222 223 121 84 24 4 40 84 36 118 26 160 154 174 112 53 123 57 84
3842 84 206 161 105 78 107 80 115 125 132 219 229 174 148 110 58 5 52 103 176 160 129 90 135 75 122 163 98 139 93 35 78 166 112 170 135
3670 135 39 16 89 185 137 143 87 123 166 18 65 169 89 69 111 156 96 132 179 79 154 58 267 145 88 94 24 89 63 166 132 125 81
3507 81 92 73 71 40 135 49 189 96 116 93 61 180 164 166 143 217 347 233 102 179 123 192 159 97 106 130 111 33 108 195 175 155 192 96
3340 96 53 112 85 95 302 71 90 76 224 164 140 46 169 278 99 73 241 146 84 19 24 168 96 76 74 102 130 75 146 129 173 78
$$ packed form
4521C9P8PO9q2J5m3J5o8J84j02J55Q0k43r1P3M5l7J2j2mm1P3J00j35m6j2J19o4m1L7k2J7k
4359G3pk0O9L9M6J5Ql8P0j12k3OO7q4r3R8p6J33K0j43J1l9R4Q9r9j6n7Q6L9N8Nj41L8r1J52
4186A77k8j13J32L1j50jQ2P8q6J84j8k9j66Q1r5k0RP0o8J02Jok0mP5j64K9P2n8j9N5p8N1j0
4019I6l0O2rQ1L2pRl6j15J5o9P9m8J71n9k4pQ1Jj02l7o0k0L6M4m8Q2r2J34oK0o2n9P0o6K7
3842H4J22m5n6k7K9k7L5J0PQ7J0n5k6l8n2n3M7N1P3j6l1l9M5o0M7M1o5M1m6n8M3Q8n4N8l5
3670A35r6k3P3R6m8On6L6M3j48M7J04q0k0M2M5o0L6M7j00P5r6K09j22n7Op0O5k6J03l4pm4
3507H1J1j9kl1R5q6J40r3K0k3l2J19j6Kk3P4J30j14j31P7n6O9l3o2RK4j9p8P5Q7k0k0L7r6
3340I6m3N9k7J0K07k31J9j4J48o0k4r4J23J09j79k6J68r5o2o5NJ44p2k0kK8K8n5P1j7M4r5
$$ plain form
3182 78 44 150 152 116 180 82 54 55 133 142 198 229 137 277 140 138 119 99 131 143 31 50 77 179 106 167 127 54 175 116 135 111 55 106
3015 106 17 94 125 77 27 62 200 268 16 87 217 160 145 80 473 710 79 75 149 133 138 190 102 15 170 184 208 248 195 74 113 231
2857 231 198 646 857 639 225 83 100 47 131 130 67 42 158 102 169 199 212 148 194 139 211 99 130 246 71 171 86 176 296 282
2710 282 54 288 133 93 112 83 173 193 95 67 132 137 105 273 164 147 76 70 133 104 146 92 67 27 31 173 187 75 142 143 101 35 67
2547 67 159 97 79 42 86 100 104 149 230 180 55 85 151 216 124 144 53 122 152 108 95 135 90 95 162 202 382 126 12 129 109 286 173
2385 173 138 173 273 154 150 237 131 76 21 44 121 192 209 287 126 88 116 180 255 157 162 91 118 67 113 130 298 237 155 81 126 83 104
$$ packed form
3182G8l4J06Kl6O4r8k8JP8RN6L1r2J40j37kj9k0L2J2j12J9K7J02p3O1m0p3J21n9J9k4n6N1
3015A06q9P7L1m8n0L5J38O8k52P1J30n7j5o5L93K37o31mP4j6NN2q8q7J55J4K4M0n3j21L9J18
2857B31l3M48K11k18m14j42J7n3Q4jo3k5J16n6O7L0J3o4M6n5P2j12L1J16j75J00q5R0J20j4
2710B82k28K34j55m0J9k9R0K0r8k8O5Nl2J68j09j7p1oO3k9M2n4k5m0MJ42J4j12O7Jm2o6L2
2547F7R2o2j8l7M4J4MM5Q1n0j25L0O6O5r2K0r1O9L0m4j3M0m5NO7M0J80k56j14J17k0J77j13
2385A73l5L5J00j19mQ7j06n5n5K3P7P1J7P8j61l8K8O4P5r8Np1K7n1M6J7J68o1q2p4M5m3K1
$$ [...]
-514H3
##END NTUPLES=	nD NMR SPECTRUM
##END=	
##END=	
