##TITLE=	AF5CnHVBRXOa3G1ywTZbBA.71.ser
TM-VI-171 CDCl3 Sc+ Bz-pyr. cosy

##JCAMP-DX=	6.0	$$ MestReNova 14.3.0-30573
##DATA TYPE=	LINK
##BLOCK_ID=	1
##BLOCKS=	2    
##ORIGIN=	Mestrelab Research S.L.
##OWNER=	hrzepa
##$MNOVA/LINK_BLOCK_TYPE=	ITEM	$$ NMR Spectrum
##$MNOVA/ITEM/POLYGON=	(XY..XY)
5321,5835
8722,5835
8722,8208
5321,8208
5321,5835
##$MNOVA/ITEM/Z=	0
##$MNOVA/ITEM/ANGLE=	0
##TITLE=	AF5CnHVBRXOa3G1ywTZbBA.71.ser
##JCAMP-DX=	6.0	$$ MestReNova 14.3.0-30573
##BLOCK_ID=	2
##DATA TYPE=	MNOVA NMR VIEW DATA
##DATA CLASS=	MNOVA VIEW DATA
##$MNOVA/2D/THRESHOLD=	25.204774856567382813
##$MNOVA/ITEM/ZOOM/X=	-1.2849598716208046056,	11.297249999948046906
##$MNOVA/ITEM/ZOOM/Y=	-1.2849598716208046056,	11.297249999948046906
##END=	
##TITLE=	AF5CnHVBRXOa3G1ywTZbBA.71.ser
##JCAMP-DX=	6.0	$$ MestReNova 14.3.0-30573
##BLOCK_ID=	3
##DATA TYPE=	nD NMR SPECTRUM
##DATA CLASS=	NTUPLES
##NUMDIM=	2
##ORIGIN=	Bruker BioSpin GmbH
##OWNER=	nmr
##.OBSERVE FREQUENCY=	400.20200099999999566
##.OBSERVE NUCLEUS=	^1H
##.SOLVENT NAME=	CDCl3
##.PULSE SEQUENCE=	cosygpqf
##LONGDATE=	2021/11/18 14:42:02.000
##.ACQUISITIONMODE=	SIMULTANEOUS (DQD)
##$ORIGINAL FORMAT=	Bruker XWIN-NMR
##$MNOVA/SCALES_VERSION=	9
##$PARAMETER FILE=	(acqu2s, ASCII, /private/var/folders/f6/rjf_tdyn2v98c5c0wvkgn4s80000gn/T/AF5CnHVBRXOa3G1ywTZbBA/71/acqu2s, 0)
$$ ##TITLE= Parameter file, TOPSPIN		Version 3.2
$$ ##JCAMPDX= 5.0
$$ ##DATATYPE= Parameter Values
$$ ##NPOINTS= 221	$$ modification sequence number
$$ ##ORIGIN= Bruker BioSpin GmbH
$$ ##OWNER= nmr
$$ $$ 2021-11-18 14:51:00.951 +0000  nmr@CZC2439F63
$$ $$ /opt/topspin/data/agmb/nmr/Nov18-2021/71/acqu2s
$$ $$ process /opt/topspin3.2/prog/mod/go
$$ ##$ACQT0= 0
$$ ##$BF1= 400.2
$$ ##$FnMODE= 1
$$ ##$NUC1= <1H>
$$ ##$NusJSP= 0
$$ ##$NusT2= 1
$$ ##$NusTD= 220
$$ ##$O1= 2001.00000000702
$$ ##$SFO1= 400.202001
$$ ##$SW= 12.5944462247833
$$ ##$SW_h= 5040.32258064516
$$ ##$TD= 220
$$ ##END=
$$ 
##$PARAMETER FILE=	(acqus, ASCII, /private/var/folders/f6/rjf_tdyn2v98c5c0wvkgn4s80000gn/T/AF5CnHVBRXOa3G1ywTZbBA/71/acqus, 0)
$$ ##TITLE= Parameter file, TOPSPIN		Version 3.2
$$ ##JCAMPDX= 5.0
$$ ##DATATYPE= Parameter Values
$$ ##NPOINTS= 12	$$ modification sequence number
$$ ##ORIGIN= Bruker BioSpin GmbH
$$ ##OWNER= nmr
$$ $$ 2021-11-18 14:51:04.245 +0000  nmr@CZC2439F63
$$ $$ /opt/topspin/data/agmb/nmr/Nov18-2021/71/acqus
$$ $$ process /opt/topspin3.2/prog/mod/shimcntl
$$ ##$ACQT0= 1000000
$$ ##$AMP= (0..31)
$$ 100 100 100 100 100 100 100 100 100 100 100 100 100 100 100 100 100 100
$$ 100 100 100 100 100 100 100 100 100 100 100 100 100 100
$$ ##$AMPCOIL= (0..19)
$$ 0 0 0 0 0 0 0 0 0 0 0 0 0 0 0 0 0 0 0 0
$$ ##$ANAVPT= -1
$$ ##$AQSEQ= 0
$$ ##$AQ_mod= 3
$$ ##$AUNM= <au_zg>
$$ ##$AUTOPOS= <49 >
$$ ##$BF1= 400.2
$$ ##$BF2= 400.2
$$ ##$BF3= 400.2
$$ ##$BF4= 400.2
$$ ##$BF5= 400.2
$$ ##$BF6= 400.2
$$ ##$BF7= 400.2
$$ ##$BF8= 400.2
$$ ##$BYTORDA= 0
$$ ##$CAGPARS= (0..11)
$$ 0 0 0 0 0 0 0 0 0 0 0 0
$$ ##$CFDGTYP= 0
$$ ##$CFRGTYP= 9
$$ ##$CHEMSTR= <none>
$$ ##$CNST= (0..63)
$$ [...]
$$ 0 0 0 0
$$ ##$ShimPowMaxUC= (0..63)
$$ 130000 130000 130000 130000 130000 130000 130000 130000 130000 130000 130000
$$ 130000 130000 130000 130000 130000 130000 130000 130000 130000 0 0 0 0
$$ 0 0 0 0 0 0 0 0 0 0 0 0 0 0 0 0 0 0 0 0 0 0 0 0 0 0 0 0 0 0 0 0 0 0 0 0
$$ 0 0 0 0
$$ ##$ShimPowMaxUG= (0..63)
$$ 524287 524287 524287 524287 524287 524287 524287 524287 524287 524287 524287
$$ 524287 524287 524287 524287 524287 524287 524287 524287 524287 0 0 0 0
$$ 0 0 0 0 0 0 0 0 0 0 0 0 0 0 0 0 0 0 0 0 0 0 0 0 0 0 0 0 0 0 0 0 0 0 0 0
$$ 0 0 0 0
$$ ##$ShimPowRcbType= 3
$$ ##$ShimPowRes= (0..63)
$$ 1e-20 1e-20 1e-20 1e-20 1e-20 1e-20 1e-20 1e-20 1e-20 1e-20 1e-20 1e-20
$$ 1e-20 1e-20 1e-20 1e-20 1e-20 1e-20 1e-20 1e-20 0 0 0 0 0 0 0 0 0 0 0 0
$$ 0 0 0 0 0 0 0 0 0 0 0 0 0 0 0 0 0 0 0 0 0 0 0 0 0 0 0 0 0 0 0 0
$$ ##$ShimPowRng0= (0..63)
$$ 1 1 1 1 1 1 1 1 1 1 1 1 1 1 1 1 1 1 1 1 0 0 0 0 0 0 0 0 0 0 0 0 0 0 0 0
$$ 0 0 0 0 0 0 0 0 0 0 0 0 0 0 0 0 0 0 0 0 0 0 0 0 0 0 0 0
$$ ##$ShimPowRng1= (0..63)
$$ 1 1 1 1 1 1 1 1 1 1 1 1 1 1 1 1 1 1 1 1 0 0 0 0 0 0 0 0 0 0 0 0 0 0 0 0
$$ 0 0 0 0 0 0 0 0 0 0 0 0 0 0 0 0 0 0 0 0 0 0 0 0 0 0 0 0
$$ ##$ShimPowRng2= (0..63)
$$ 1 1 1 1 1 1 1 1 1 1 1 1 1 1 1 1 1 1 1 1 0 0 0 0 0 0 0 0 0 0 0 0 0 0 0 0
$$ 0 0 0 0 0 0 0 0 0 0 0 0 0 0 0 0 0 0 0 0 0 0 0 0 0 0 0 0
$$ ##$ShimPowRng3= (0..63)
$$ 1 1 1 1 1 1 1 1 1 1 1 1 1 1 1 1 1 1 1 1 0 0 0 0 0 0 0 0 0 0 0 0 0 0 0 0
$$ 0 0 0 0 0 0 0 0 0 0 0 0 0 0 0 0 0 0 0 0 0 0 0 0 0 0 0 0
$$ ##$ShimSysFunc= (0..63)
$$ 1 2 3 4 5 7 9 11 15 16 8 10 12 14 6 17 13 18 19 20 0 0 0 0 0 0 0 0 0 0
$$ 0 0 0 0 0 0 0 0 0 0 0 0 0 0 0 0 0 0 0 0 0 0 0 0 0 0 0 0 0 0 0 0 0 0
$$ ##$ShimSysMatrix= 0
$$ ##$ShimSysType= 1
$$ ##$TFXNUM= 0
$$ ##$TRIPLO2= 0
$$ ##$VTU= 2
$$ ##$VTUETH= <149.236.99.20>
$$ ##$VTUTY= <no>
$$ ##$WBREFAM= (0..15)
$$ 135.5 97.7 100 100 100 100 100 100 100 100 100 100 100 100 100 100
$$ ##$WBREFLM= (0..15)
$$ 0 0 0 0 0 0 0 0 0 0 0 0 0 0 0 0
$$ ##$WBREFPH= (0..15)
$$ 72.26 -67.22 0 0 0 0 0 0 0 0 0 0 0 0 0 0
$$ ##$WBSGU= (0..15)
$$ 0 0 0 0 0 0 0 0 0 0 0 0 0 0 0 0
$$ ##$XFAC= 2
$$ ##END=
$$ 
##$DECIM=	3968
##$DSPFVS=	20
##.ACQUISITIONSCHEME=	NOT PHASESENSITIVE
##NTUPLES=	nD NMR SPECTRUM
##VAR_NAME=	FREQUENCY1,	FREQUENCY2,	SPECTRUM
##SYMBOL=	F1,	F2,	Y
##.NUCLEUS=	1H,	1H
##.OBSERVE FREQUENCY=	400.20200099999999566,	400.20200099999999566
##VAR_TYPE=	INDEPENDENT,	INDEPENDENT,	DEPENDENT
##VAR_FORM=	AFFN,	AFFN,	ASDF
##VAR_DIM=	1024,	1024,	1048576
##UNITS=	HZ,	HZ,	ARBITRARY UNITS
##FIRST=	4521.1594499999982872,	4521.1594499999982872,	0.058960713446140289307
##LAST=	-514.24094062501069402,	-514.24094062501069402,	0.06436564028263092041
##MIN=	-514.24094062501069402,	-514.24094062501069402,	0.00010717973782448098063
##MAX=	4521.1594499999982872,	4521.1594499999982872,	2323.684814453125
##FACTOR=	1,	1,	0.0015195508569196150648
##PAGE=	F1=4521.16
##FIRST=	4521.1594499999982872,	4521.1594499999982872,	0.058960713446140289307
##DATA TABLE=	(F2++(Y..Y)), PROFILE
$$ [...]
##PAGE=	F1=-1464.22
##FIRST=	4521.1594499999982872,	4521.1594499999982872,	0
##DATA TABLE=	(F2++(Y..Y)), PROFILE
$$ plain form
460 146 155 148 210 128 271 243 77 81 192 124 237 94 61 75 199 113 164 178 88 181 144 137 119 103 92 70 192 131 159 107 33 57 42 18
293 18 91 129 232 31 95 181 58 130 201 184 189 272 109 116 47 118 154 55 113 54 21 47 65 36 102 61 150 173 165 87 175 72 31 46 102
121 102 49 252 241 201 191 99 60 107 70 244 187 33 88 66 74 72 84 94 126 241 128 240 124 303 82 118 90 94 9 148 197 168
-37 168 183 136 26 48 88 58 192 114 73 48 128 130 116 131 171 70 162 97 100 85 67 49 141 78 98 77 44 28 86 80 166 167 112 97 121 135
-214 135 157 155 157 67 88 188 41 79 54 88 179 90 63 69 84 83 97 144 104 162 278 316 241 72 160 171 199 62 91 116 279 117 111 172
-381 172 131 53 147 193 181 160 201 58 214 137 114 176 37 64 180 18 168 71 105 125 237 101 57 91 44 68 110
$$ packed form
460A46RpO2q2J43k8j66MJ11o8J13j43l3J4J24q6N1J4r0R3l7pj8j6j1k2J22o1K8n2p4K4j5k4
293A8P3L8J03k01O4Q6j23P2P1j7NQ3j63Po9P1L6r9N8n9l3K6J8k9O6m1Q9K3qp8Q8j03m1J5N6
121A02n3K03j1m0j0r2l9M7l7J74n7j54N5k2QkJ2J0L2J15j13J12j16J79k21L6k8Mq5J39M9k9
-37A68J5m7j10K2M0l0J34p8m1k5Q0Kj4J5M0j01R2o5Lj5j8j8R2o3K0k1l3j6N8oQ6Jn5j5K4J4
-214A35K2kKr0K1J00j47L8k5L4R1q9k7OJ5jJ4M7m0N8J16L8p5j69Q8J1K8j37K9K5J63j62oO1
-381A72m1p8R4M6j2k1M1j43J56p7k3O2j39K7J16j62J50r7L4K0J12j36m4L4m7K4M2
-514A10
##PAGE=	F1=-1474.07
##FIRST=	4521.1594499999982872,	4521.1594499999982872,	0
##DATA TABLE=	(F2++(Y..Y)), PROFILE
$$ plain form
4521 110 221 102 159 133 203 100 268 77 110 175 125 90 181 100 159 119 131 75 294 128 85 91 214 48 173 254 168 41 41 81
4373 81 153 154 253 135 68 163 106 98 137 142 242 172 222 107 78 102 80 102 40 121 172 6 109 64 119 60 80 73 216 93 76 182 174 240
4206 240 142 223 42 144 163 183 198 98 167 66 100 169 160 151 43 129 189 180 118 135 202 147 144 154 76 103 115 149 246 144 119 71 62 26
4039 26 119 103 120 75 154 112 61 147 91 126 152 12 92 81 146 87 103 85 126 79 63 85 101 121 90 92 231 90 76 59 207 19 59
3876 59 91 31 218 170 150 169 67 119 112 53 101 150 48 98 230 180 130 281 140 86 114 80 231 127 131 70 64 36 99 55 101 63 105
3714 105 83 176 95 125 210 51 40 153 298 55 169 88 157 187 140 21 70 190 48 132 129 106 140 134 148 88 174 198 57 182 258
3561 258 150 159 110 101 129 166 77 111 151 226 203 144 39 152 195 191 160 123 163 114 82 57 101 108 22 70 145 118 81 94 91 72 123 101 157 83
3384 83 264 176 143 101 148 36 97 123 127 88 32 113 135 232 25 62 258 394 259 230 110 194 139 45 161 225 49 136 133 170 47
$$ packed form
4521A10J11j19N7k6P0j03J68j91L3O5n0l5R1q1N9m0J2n6K19j66m3OJ23j66J25Q1q6j27%M0
4373H1P2JR9j18o7R5n7qL9NJ00p0N0j15k9K4k2K2o2Q1N1j66J03m5N5n9K0pJ43j23j7J06qO6
4206B40r8Q1j81J02J9K0J5j00O9j01L4O9rrj08Q6O0ro2J7O7n5lJ0p8K7J2L4R7j02k5m8rl6
4039B6R3j6J7m5P9m2n1Q6n6L5K6j40Q0j1O5n9J6j8M1m7j6K2J6K0l1KJ39j41j4j7J48j88M0
3876E9L2o0J87m8k0J9j02N2pn9M8M9j02N0J32n0n0J51j41n4K8l4J51j04Mo1ok8O3m4M6l8M2
3714A05k2R3q1L0Q5j59j1J13J45k43J14q1O9L0m7j19M9J20j42Q4lk3L4oJ4o0Q6K4j41J25P6
3561B58j08Rm9rK8L7q9L4M0P5k3n9j05J13M3ml1l7M0m9l2k5M4Pq6M8P5k7l7J3lj9N1k2N6p4
3384H3J81q8l3m2M7j12O1K6Ml9n6Q1K2R7k07L7J96J36j35k9j20Q4n5r4J16O4j76Q7lL7j23
$$ plain form
3232 47 94 181 79 66 96 151 47 149 151 107 100 57 176 77 159 216 105 117 140 33 272 523 731 1151 457 162 177 704 121
3089 121 352 138 98 78 217 191 228 172 152 122 221 730 460 477 260 146 76 74 271 654 791 703 20 179 33 41 48 68 63 136
2941 136 202 103 250 180 360 159 123 204 102 151 459 566 610 450 30 66 30 118 14 45 107 65 77 100 102 293 60 84 28 89
2793 89 116 25 93 152 136 151 18 46 44 72 76 173 41 197 125 200 247 207 91 218 168 182 126 221 168 133 210 874 1491 1230 724 262
2636 262 138 83 44 62 89 45 44 62 49 79 73 202 284 232 137 98 31 148 102 137 139 87 125 50 108 106 52 247 213 40 50 102 62 115
2469 115 82 50 162 128 177 55 95 86 115 172 117 152 8 101 140 155 60 252 111 109 8 169 172 94 67 117 67 92 92 100 161 134 174 175
2301 175 95 76 134 48 54 132 75 64 148 93 168 86 123 129 133 96 15 146 142 147 178 61 128 53 174 119 177 113 144 74 118 17 75 42 22
2129 22 147 114 108 90 126 123 207 142 29 145 68 71 111 31 132 177 137 57 76 101 166 117 105 199 538 1885 1081 178 62 14 159
$$ packed form
3232D7M7Q7j02j3L0N5j04J02Km4pm3J19r9Q2N7j11J2K3j07K39K51K08M20o94k95J5N27n83
3089A21K31k14m0k0J39k6L7n6k0l0R9N09k70J7k17j14p0kJ97L83J37q8o83J59j46QPK0nP3
2941A36O6r9J47p0J80k01l6Q1j02M9L08J07M4j60m20L6l6Q8j04L1O2m2J2K3KJ91k33K4n6O1
2793H9K7r1O8N9j6J5j33K8kK8MR7j32J56p2P5M7m0j16J27n0J4n6R5n3l5P7O64O17k61n06m62
2636B62j24n5l9J8K7m4jJ8j3L0oJ29Q2n2r5l9o7J17m6L5Kn2L8p5N8kn4J95l4j73J0N2m0N3
2469A15l3l2J12l4M9j22M0rK9N7n5L5j44R3L9J5r5J92j41kj01J61Lp8k7N0n0K5%QO1k7M0J
2301A75q0j9N8q6OP8n7j1Q4n5P5q2L7OMl7q1J31mNL1j17O7p5J21n5N8o4L1p0M4j01N8l3k0
2129B2J25l3oj8L6lQ4o5j13J16p7LM0q0J01M5m0q0J9K5O5m9j2R4L39J347q04r03j16m8J45
$$ plain form
1976 159 163 61 89 79 206 72 109 194 133 328 187 20 31 92 119 129 72 70 58 139 46 60 32 115 120 133 160 264 178 232 230 215 65
1814 65 70 262 267 149 101 12 97 110 47 205 263 73 50 116 133 178 133 169 73 67 60 85 111 163 108 164 126 135 7 45 71 196 37 238
1647 238 25 144 146 228 38 194 139 28 121 44 148 79 175 33 332 265 92 222 364 426 3586 4194 1142 1526 2141 3081
1519 3081 6202 6096 16702 4981 19750 3317 7766 2230 13759 29378 6189 1933 924 592 426 488 167
1435 167 414 196 303 289 169 169 52 92 309 123 80 80 127 41 182 132 150 367 90 115 75 234 190 204 189 146 170 76 62 134
1287 134 101 65 155 122 145 183 184 76 77 179 237 143 81 34 83 148 138 117 51 149 77 135 172 225 200 157 116 246 250 157 113 207 178 140 128
1115 128 157 79 37 176 135 149 278 180 91 151 137 115 176 214 85 112 82 200 97 106 140 31 87 164 229 165 57 88 179 451 223
962 223 9 98 141 120 59 49 15 83 153 25 80 108 41 202 156 78 29 155 241 287 117 39 99 93 228 79 25 134 128 264 144
$$ packed form
1976A59Mj02K8j0J27j34L7Q5o1J95j41j67J1O1K7J0n7kj2Q1r3J4k8Q3NJ3K7J04q6N4kj5j50
1814F5NJ92Nj18m8q9Q5J3o3J58N8j90k3O6J7M5m5L6r6opK5K6N2n5N6l8Rj28L8K6J25j59K01
1647B38k13J19KQ2j90J56n5j11R3p7J04o9R6j42K99o7j73J30J42O2L160O08l052L84O15R40
1519C081L121j06J0606j1721J4769j6433M449n536J1529J5619k3189m256j009l32j66O2l21
1435A67K47k18J07j4j20%j17M0K17j86m3%M7q6J41n0J8K17k77K5m0J59m4J4j5m3K4r4j4P2
1287A34l3l6R0l3K3L8Jj08JJ02N8r4o2m7M9O5j0k1o6R8p2N8L7N3k5m3m1J30Mr3m4R4k9l8j2
1115A28K9p8m2J39m1J4J29r8q9O0j4k2O1L8j29K7l0J18j03RL4j09N6P7O5o4j08L1R1K72k28
962B23k14Q9M3k1o1j0l4O8P0j28N5K8o7J61m6p8m9J26Q6M6j70p8O0oJ35j49n4J09oJ36j20
$$ plain form
810 144 49 141 157 19 47 74 147 150 60 62 98 201 291 208 160 75 136 92 220 47 173 235 57 175 52 160 8 151 101 46 138
657 138 83 76 103 96 155 21 195 95 1 140 142 169 207 201 120 245 225 176 163 139 44 150 124 257 41 272 1181 3308 27944 33915
510 33915 7002 33024 30529 4261 951 393 176 106 79 209 160 182 376 204 370 306 36 129 203 98 271 100 73
396 73 55 178 134 137 166 77 223 98 162 126 136 96 95 186 131 150 123 49 67 56 43 78 151 218 51 106 189 20 139 183 214 208 271 97
229 97 153 47 140 198 41 119 49 24 60 93 35 147 96 154 150 143 111 166 78 38 55 86 67 228 269 223 192 90 64 55 71 227 187 27
62 27 86 69 67 121 97 95 107 275 121 204 150 308 71 96 104 66 19 190 170 189 174 93 19 33 94 52 164 138 41 53 116 133 114 155 171
-111 171 105 113 92 47 85 118 46 141 45 120 127 29 68 85 116 110 165 168 100 118 122 160 201 174 75 78 142 57 69 52 72 164 63 67 56 156 74
-293 74 73 120 167 191 361 307 267 34 137 213 157 8 127 82 252 171 65 174 76 77 227 214 236 134 229 81 164 194 152 203 78
$$ packed form
810A44r5R2J6j38K8K7P3Lr0KL6J03R0q3m8q5O1m4J28j73J26O2j78J18j23J08j52J43n0n5R2
657A38n5pK7pN9j34J74j00r4J39KK7L8oq1J25k0m9j3k4r5J06k6J33k16K31R09K127K4636N971
510C3915k6913K6022k495k6268l310n58k17p0k7J30m9K2J94j72J66o4k70R3P4j05J73j71k7
396G3j8J23m4LK9q9J46j25O4l6J0m0jR1n5J9k7p4J8j1j3L5P3O7j67N5Q3j69J19M4L1oO3j74
229I7N6j06R3N8j57P8p0k5L6L3n8J12n1N8mpl2N5q8m0J7L1j9J61M1m6l1j02k6rJ6J56m0j60
62B7N9j7kN4k4kJ2J68j54Q3n4J58k37K5Ql8m7J71k0J9j5q1p4J4O1m2J12k6r7J2O3J7j9M1J6
-111A71o6Qk1m5L8L3p2R5r6P5Pr8L9J7L1oN5Lo8J8ML8M1k7r9LO4q5J2j7K0R2j01Mj1J00q2
-293G4jM7M7K4J70n4m0k33J03P6n6j49J19m5J70q1j06J09r8JJ50j3K2j02R5j48Q3L0m2N1j25
$$ plain form
-445 78 29 203 89 169 89 161 67 275 114 133 101 114 133 143
$$ packed form
-445G8m9J74j14Q0q0P2r4K08j61J9l2J3J9J0
-514A43
##PAGE=	F1=-1483.91
##FIRST=	4521.1594499999982872,	4521.1594499999982872,	0
##DATA TABLE=	(F2++(Y..Y)), PROFILE
$$ plain form
4521 114 317 149 159 234 260 7 331 122 106 216 183 161 175 189 233 54 196 121 368 99 55 119 244 107 203 249 207 36
4383 36 87 105 170 242 276 114 119 195 78 87 145 129 191 115 233 121 126 141 94 172 63 119 194 8 165 37 174 37 121 104 248
4231 248 67 66 193 114 310 149 222 38 147 202 164 229 117 158 93 152 158 134 161 102 104 213 156 164 117 216 188 131 126 125 147 119 120 234
4063 234 152 163 73 82 26 155 85 148 73 199 126 90 127 146 122 215 19 74 47 165 145 104 83 161 62 97 122 91 160 81 33 235 122
3901 122 68 65 233 42 29 108 10 186 142 125 178 31 138 96 36 101 184 89 123 309 205 94 279 141 89 106 47 242 70
3758 70 142 26 96 37 49 41 88 120 152 39 188 79 90 221 43 61 123 332 62 195 128 170 190 128 46 83 253 51 97 120
3611 120 180 180 141 146 62 169 229 45 161 265 110 119 45 87 121 172 89 101 152 190 209 183 46 170 206 203 175 150 186 125 124 34 106 139
3443 139 19 115 126 104 109 80 127 100 131 97 157 17 244 220 96 137 173 69 85 105 128 101 35 106 141 218 83 64 258 389 251
$$ packed form
4521A14K03j68J0P5K6k53L24k09j6J10l3k2J4J4M4j79J42p5K47k69m4O4J25j37R6M6m2j71
4383C6N1J8O5P2L4j62NP6j17RN8j6O2p6J18j12NJ5m7P8j09N6P5j86J57j28J37j37Q4j7J44
4231B48j81jJ27p9J96j61P3j84J09N5l8O5j12M1o5N9Ok4K7n9KJ09n7Qm7R9k8n7njK2k8JJ14
4063B34q2J1r0Rn6J29p0O3p5J26p3l6L7J9k4R3j96N5k7J18k0m1k1P8r9L5K5l1O9p9m8K02j13
3901A22n4lJ68j91j3P9r8J76m4j7N3j47J07m2o0O5Q3r5L4J86j04j11J85j38n2J7n9J95j72
3758G0P2j16P0n9J2qM7L2L2j13J49j09J1J31j78J8O2K09k70J33o7M2K0o2q2L7J70k02M6K3
3611A20O0%l9Nq4J07O0j84J16J04j55Rp4M2L4N1q3J2N1L8J9k6j37J24L6lk8k5L6o1jr0P2L3
3443A39j20R6J1k2Nk9M7k7L1l4O0j40K27k4j24M1L6j04J6K0K3k7o6P1L5P7j35j9J94J31j38
$$ plain form
3291 251 220 121 171 132 58 164 235 67 157 122 167 26 94 184 59 74 134 153 20 106 152 97 107 83 170 59 160 193 112 103 122 29
3133 29 254 513 873 1167 414 156 148 645 117 361 118 106 91 212 149 205 172 154 93 224 705 332 465 258 94 97 47 297
2995 297 700 904 798 95 225 23 86 42 69 63 101 141 110 271 229 529 184 143 196 112 123 486 675 479 355 80 62 48
2857 48 116 33 49 86 49 70 126 118 340 80 38 52 98 116 26 110 101 140 148 34 46 28 95 79 172 40 241 114 213 249 218 58 228
2695 228 162 187 150 248 157 125 239 791 1290 1219 739 256 68 134 58 96 110 51 55 51 51 59 91 226 269 212 103 91 23 198 60 63
2538 63 124 57 124 67 100 110 17 174 157 50 84 100 57 134 61 54 187 151 164 63 54 71 123 146 105 154 41 99 158 158 13 187 111
2375 111 139 29 184 181 120 83 134 100 86 62 120 135 124 174 203 67 50 142 39 57 128 61 53 127 91 174 52 150 137 138 111 32 147
2213 147 136 120 197 63 115 64 181 117 206 111 195 74 140 33 45 45 24 131 101 110 87 108 142 181 182 16 129 59 56 101 30 112 101
$$ packed form
3291B51l1r9N0l9p4J06P1j68R0l5M5j41O8R0j25J5O0J9j33Q6M6n5J0k4Q7j11J01L3q1rJ9r3
3133B9K25K59L60K94p53k58qM97n28K44k43j2j5J21o3N6l3j8o1J31M81l73J33k07j64Ln0K50
2995B97M03K04j06p03J30k02O3m4K7oL8M0l1J61m2L00l45m1N3q4J1L63J89j96j24k75j8j4
2857D8O8q3J6L7l7K1N6qK22k60m2J4M6J8r0Q4rL9Qj14J2j8O7j6R3j32K01j27R9L6l1j60J70
2695B28o6K5l7R8r1l2J14N52M99p1m80m83j88O6p6L8J4n9Mm%QL2J35M3n7j09j2o8J75j38L
2538F3O1o7O7n7L3J0r3J57j7j07L4J6m3P7p3pJ33l6J3j01rJ7N2K3m1M9j13N8N9%j45J74p6
2375A11K8j10J55lo1l7N1l4j4k4N8J5j1N0K9j36j7R2j03J8P1o7qP4l6Q3j22R8j3Jk7p9J15
2213A47j1j6P7j34N2n1J17o4Q9r5Q4j21O6j07J2%k1J07l0Rk3K1L4L9Jj66J13p0lM5p1Q2j1
$$ plain form
2050 101 194 69 104 123 214 62 116 167 733 2486 1383 160 78 27 113 141 59 59 98 216 41 69 219 110 340 163 27
1917 27 54 72 130 146 71 121 96 157 110 55 16 169 122 104 164 246 205 261 237 253 68 32 255 251 194 79 29 42 159 80 164 258 107
1755 107 104 170 170 236 167 186 86 112 67 102 166 174 48 220 116 138 30 83 36 220 41 168 41 135 105 302 74 245 192 108
1607 108 216 96 198 88 130 47 315 359 95 336 599 639 2028 3041 1419 2074 2858 4469 9052 8633 26295 8400
1499 8400 30683 5994 10004 4841 36786 76634 19001 5205 2513 1587 1148 1075 647 743 493 512 418 302 186
1405 186 95 110 232 157 178 126 193 180 278 236 122 408 157 111 68 233 206 189 272 138 238 47 72 235 181 81 106 111 133 123
1258 123 190 106 60 194 214 194 83 64 134 171 99 160 67 113 89 161 209 197 237 181 71 254 196 212 128 203 144 122 96 138 27 78
1100 78 193 136 130 304 220 102 141 137 146 133 207 114 142 100 196 98 115 112 29 166 135 250 169 75 77 197 441 204 20 113 133 110 92
$$ packed form
2050A01R3j25L5J9R1j52N4N1N66J753j103j223q2n1Q6K8q2%L9J18j75K8J50j09K30j77j36
1917B7K7J8N8J6p5N0k5O1m7n5l9J53m7j8O0Q2m1N6k4J6j85l6K23mn7j15n0J3J17p9Q4R4j51
1755A07lO6%O6o9J9j00K6m5L5O4Qj26J72j04K2j08N3m7J84j79J27j27R4l0J97k28J71n3q4
1607A08J08j20J02j10M2q3K68M4k64K41K63M0J389J013j622O55P84J611M583m19J7662j7895
1499H400K2283k4689M010n163L1945L9848n7633j3796k692r26m39p3m28R6k50J9r4j16j16
1405A86r1J5J22p5K1n2O7j3R8m2j14K86k51m6m3J65k7j7Q3j34J00j91K5J63n4j00K5NK2j0
1258A23O7q4m6J34K0k0j11j9P0L7p2O1r3M6k4P2M8j2M0n6j10J83n8J6q4P5n9k2k6M2j11N1
1100G8J15n7oJ74q4j18L9mRj3P4r3K8m2R6r8J7lq3J37l1J15q1r4KJ20K44k37j84R3K0k3j8
$$ plain form
938 92 85 54 73 159 68 70 87 43 210 165 46 23 122 258 253 119 71 116 66 255 39 23 139 61 239 87 54 153 146 52 73 87 159
775 159 230 63 61 116 175 260 219 164 68 116 113 157 76 206 262 117 188 50 197 71 176 112 80 165 135 91 96 154 147 49 220 61 89
613 89 178 171 229 234 214 178 318 286 233 249 180 72 165 216 311 50 427 1638 4996 42381 51573 10032 49627 45718 6438
490 6438 1538 610 280 107 95 294 181 205 553 292 481 363 99 187 206 92 297 113 93 47 136 150 91 157 58 263 41
357 41 188 122 196 86 119 171 134 124 128 63 68 90 73 79 162 184 90 118 196 23 162 160 242 218 248 84 198 57 135 223 16 134 94
195 94 43 101 130 25 177 127 139 121 114 131 136 83 61 81 61 97 189 296 232 173 74 77 95 69 194 189 50 76 109 59 177 112 94 90 297
22 297 116 161 176 305 51 104 112 27 34 228 122 215 161 58 48 45 153 53 119 148 106 92 98 140 129 179 174 153 87 100 70 94 161 59
-145 59 140 20 147 166 37 126 99 145 44 166 245 94 121 107 178 246 177 114 131 107 115 79 55 132 156 55 95 44 220 58 58 118
$$ packed form
938I2pl1J9Q6r1KJ7m4J67m5j19k3R9J36nj34m8M5n0J89k16j6J16p8J78j52l3R9pr4K1J4P2
775A59P1j67kN5N9Q5m1n5r6M8lM4q1J30N6j45P1j38J47j26J05o4l2Q5l0m4NN8pr8J71j59K8
613H9Q9pN8Nk0l6J40l2n3J6o9j08R3N1R5k61L77J211L358L7385R192m1541L9595l909l9280
490F438m900r28l30j73j2J99j13K4L48k61J89j18k64Q8J9j14K05j84k0m6Q9J4n9O6r9K05k22
357D1J47o6P4j10L3N2l7j0Mo5NK2j7OQ3K2r4K8P8j73J39kQ2k4L0j64J14j41P8Q8k07J18m0
195I4n1N8K9j05J52n0J2j8pJ7Nn3k2K0k0L6R2J07o4n9r9LJ8k6J25nj39K6L3n0J18o5j8mK07
22B97j81M5J5J29k54N3Qq5PJ94j06R3n4j03j0lJ08j00O6K9m2j4OM2j1N0nk1o6J3l0K4O7j02
-145E9Q1j20J27J9j29Q9k7M6j01J22P9j51K7j4P1O8o9o3J7k4Ql6k4P7K4j01M0n1J76j62%O0
$$ plain form
-303 118 227 194 429 270 284 64 125 255 104 48 172 109 216 227 3 167 54 133 298 211 296 110 250 116 102 253 189
-435 189 284 132 24 234 178 192 118 229 55 322 142 229 159 193 218 194
$$ packed form
-303A18J09l3K35j59J4k20O1J30j51n6J24o3J07J1k24J64j13P9J65q7Q5j86J40j34j4J51o4
-435A89R5j52j08K10n6J4p4J11j74K67j80Q7p0L4K5k4
-514A94
##PAGE=	F1=-1493.76
##FIRST=	4521.1594499999982872,	4521.1594499999982872,	0
##DATA TABLE=	(F2++(Y..Y)), PROFILE
$$ plain form
4521 167 395 203 172 326 297 121 387 169 180 259 247 233 205 279 292 60 251 164 425 102 106 148 259 182 246 254 244 79 143 119
4373 119 199 311 308 107 169 222 76 97 160 164 129 118 239 146 161 203 121 242 113 123 215 27 219 72 221 13 160 166 271 42
4226 42 115 198 50 363 159 223 26 155 234 146 261 134 156 118 190 155 114 165 159 66 216 120 205 80 214 228 116 91 201 179
4078 179 117 93 215 170 209 92 90 55 190 82 177 93 237 137 141 118 208 116 266 40 68 33 186 209 110 95 194 39 131 164 74
3926 74 180 69 50 227 147 93 72 259 69 7 125 15 146 121 85 183 20 154 80 57 90 205 123 138 367 208 55 281
3788 281 143 119 102 15 247 76 145 45 116 43 32 28 86 168 196 20 198 66 61 223 41 88 83 347 80 212 148 184 186 135 76
3635 76 89 297 56 72 125 247 223 141 148 49 160 261 23 128 259 77 91 56 79 105 170 91 114 162 152 189 204 66 191 207
3487 207 208 176 169 200 133 170 18 110 163 58 170 97 86 114 57 158 147 144 100 179 38 222 258 61 156 191 107 58 92 117 123 26 94
$$ packed form
4521A67K28j92l1J54k9j76K66k18J1P9j2j4k8P4J3k32J91q7K61l23MM2J11p7O4Qj0j65O4k4
4373A19Q0J12lk01O2N3j46K1O3Ml5j1J21r3J5M2q2J21j29J0R2j88J92j47J49k08J47OJ05k29
4226D2P3Q3j48L13k04O4j97J29P9q8J15j27K2l8P2l5m1N1or3J50r6Q5j25J34J4j12k5J10k2
4078A79o2k4J22m5L9j17kl5J35j08R5q4J44j00Mk3R0r2J50k26K8l5J53K3r9j5R9j55R2L3r0
3926G4J06j11j9J77q0n4k1J87j90o2J18j10J31k5l6R8j63J34p4k3L3J15q2J5K29j59j53K26
3788B81j38k4j7q7K32j71O9j00P1p3j1mN8Q2K8j76J78j32nJ62j82M7nK64k67J32o4L6Kn1n9
3635G6J3K08k41J6N3J22k4q2Pr9J11J01k38J05J31j82J4l5K3K6O5p9K3M8j0L7J5j38J25J6
3487B07Jl2pL1o7L7j52R2N3j05J12p3j1K8n7J01j1lm4P9j41J84L6j97R5L5q4m9L4K5Or7O8
$$ plain form
3325 94 140 196 142 72 254 368 232 196 146 144 137 76 154 240 86 167 127 156 7 141 180 48 89 158 143 40 61 154 90 115 102 163
3168 163 47 146 160 164 113 129 72 244 529 1003 1157 363 181 243 636 129 350 105 107 86 181 88 169 163 150 85 210 647 197
3025 197 469 265 69 109 24 307 719 988 873 203 253 30 116 37 66 62 52 78 113 265 257 630 190 154 178 106 117 458 746
2882 746 520 376 141 59 76 109 75 55 66 33 65 142 126 369 105 23 86 105 129 31 104 67 146 141 54 65 62 111 82 168 47 268
2725 268 102 230 238 216 42 218 147 181 170 263 144 116 247 770 1137 1188 727 254 58 194 61 119 138 50 49 32 52 61 137 233
2577 233 237 186 89 102 48 236 84 31 107 8 123 83 87 104 60 90 114 61 118 95 47 142 45 50 201 171 168 60 5 48 123 108 97 157
2410 157 77 116 160 156 47 107 101 168 46 189 181 139 127 148 129 82 48 128 101 119 172 203 39 24 143 23 118 126 46 56 125 80 183
2247 183 51 172 156 130 127 61 127 119 88 192 62 98 70 176 116 224 99 229 73 157 47 33 77 23 126 90 108 81 85 159 164
$$ packed form
3325I4M6N6n4p0J82J14j36l6n0kpo1P8Q6j54Q1m0K9j49J34L9j32M1O9j5j03K1R3o4K5j3O1
3168A63j16R9J4Mn1J6n7J72K85M74J54p94j82O2L93n07K21k45Kk1R5r3Q1oj3o5J25M37m50
3025A97K72k04j96M0q5K83M12K69j15o70N0k23Q6p9K9mj0K6L5J52qL73m40l6K4p2J1L41K88
2882G46k26j44k35q2J7L3l4k0J1l3L2P7j6K43k64q2O3J9K4r8P3l7P9nq7J1lM9k9Q6j21K21
2725B68j66J28Qk2j74J76p1L4j1R3j19k8J31N23L67N1m61m73j96J36j33N8J9q8jj7K0RP6R6
2577B33Mn1r7J3n4J88j52n3P6r9J15m0MJ7m4L0K4n3N7k3m8R5r7NJ51l0lj08n5M3P5j5j1O0
2410A57q0L9M4mj09O0oO7j22J43qm2j2K1j9m7l4Q0k7J8N3L1j64j5J19j20R5Qq0J0O9m5J03
2247A83j32J21j6k6lo6O6ql1J04j30L6k8J06o0J08j25J30j56Q4j10j4M4n4J03l6J8k7MP4N
$$ plain form
2095 164 225 29 103 48 67 76 52 103 57 249 76 129 136 257 37 115 144 855 2729 1511 136 111 56 69 110 66 25 110 215
1952 215 45 47 227 95 331 136 34 83 70 152 163 68 157 127 187 163 67 8 199 138 78 167 225 210 273 240 268 102 25 245 237
1799 237 217 72 42 56 178 103 125 233 152 144 204 198 263 193 204 93 137 91 130 203 153 6 258 100 127 59 89 73 227 36 114
1647 114 61 152 116 342 160 272 236 185 270 141 220 121 99 141 318 463 240 504 797 844 984 2130 1677 2556 3473 5802
1519 5802 12031 11170 36533 12478 42051 9855 13015 7958 49572 103459 27042 7521 3588 2303 1678 1479
1440 1479 984 1015 682 640 511 392 173 93 90 171 203 276 216 256 291 334 311 134 401 208 124 108 216 210 137 309 128 289 31
1297 31 119 312 240 78 65 108 134 85 186 126 95 187 190 230 81 94 173 187 65 178 107 89 129 175 239 167 253 185 23 242 147 248
1140 248 132 195 111 91 108 117 50 115 178 130 109 307 246 128 137 116 204 74 196 134 161 112 203 106 131 94 38 224 101 264 157
$$ packed form
2095A64O1j96P4n5J9Rk4N1m6J92j73N3PJ21k20P8K9P11J874j218j375k5n5J3M1m4m1Q5J05
1952B15j70KJ80j32K36j95j02M9j3Q2J1r5Q9l0O0k4r6n9J91o1o0Q9N8j5O3l3K8j66p7K20q
1799B37k0j45l0J4J22p5K2J08q1qO0oO5p0J1j11M4m6L9P3n0j47K52j58K7o8L0j6J54j91P8
1647A14n3R1l6K26j82J12l6n1Q5j29P9r9k2M2J77J45k23K64K93M7J40J146m53Q79R17K329
1519E802O229q61K5363k4055K9573l2196L160n057M1614N3887p6417j9521l933j285o25j99
1440A479m95L1l33m2j29j19k19q0lQ1L2P3o0M0L5M3k3j77K67j93q4j6J08op3J72j81J61k58
1297C1Q8J93p2j62j3M3K6m9J01o0l1R2LM0j49J3P9J4j22J13p1j8M0M6O4p2Q6o8j62K19r5J01
1140B48j16O3q4k0J7Ro7O5O3m8k1J98o1j18Rk1Q8j30J22o2K7m9R1r7K5l7n6J86j23J63j07
$$ plain form
987 157 102 115 208 387 173 36 130 118 98 120 139 85 57 167 123 66 77 50 215 165 20 53 78 259 207 110 94 127 33 268 45
834 45 42 129 26 217 35 56 164 139 95 103 113 149 291 54 71 126 164 228 219 167 65 102 139 73 126 217 267 183 203 40 228 123
677 123 199 117 116 201 187 101 77 231 133 121 231 62 195 208 193 276 263 223 240 383 343 321 344 232 127 200 298 368 58 583 2095
524 2095 6717 57097 69674 13188 66526 61304 8686 2155 836 377 107 133 389 214 212 719 379 589 411 198
426 198 247 206 129 314 132 118 47 68 159 29 154 50 293 32 212 108 262 64 144 150 131 83 122 77 63 139 105 98 159 133 126
273 126 138 198 62 186 133 267 218 206 74 243 80 100 231 32 159 155 78 152 167 26 188 147 112 94 94 147 95 86 92 121 34 123
116 123 142 315 226 137 54 92 173 69 148 198 83 59 170 50 233 125 94 83 305 109 123 190 294 28 140 115 42 50 256
-27 256 65 233 145 77 84 63 206 49 68 145 193 146 79 149 153 200 180 198 111 110 121 104 185 79 144 67 168 185 68 176 132 162 20
$$ packed form
987A57n5J3R3J79k14j37R4j2k0K2J9n4k8J10m4n7J1k7J65n0j45L3K5J81n2r7j6L3r4K35k23
834D5lQ7j03J91j82K1J08k5m4QJ0L6J42k37J7N5L8O4rn2j02L7L7o6N3R1N0q4K0j63J88j05
677A23P6q2jQ5j4q6k4J54r8j2J10j69J33J3j5Q3j3m0J7J43m0k2K3j12j05P3R8P0l10N25J512
524B095M622N0380J2577n6486N3338n222n2618o531j319m59k70K6K56j75kN07l40K10j78k13
426A98M9m1p7J85j82j4p1K1R1j30J25j04K43k61J80j04J54j98Q0Oj9m8L9m5j4P6l4pO1k6p
273A26J2O0j36J24n3J34m9j2j32J69j63K0J31j99J27mp7P4J5j41J62m1l5j8%N3n2rOK9q7Q9
116A23J9J73q9q9q3L8Q1j04P9N0j15k4J11j20J83j08l1j1K22j96J4O7J04k66J12k5p3QK06
-27B56j91J68q8o8Pk1J43j57J9P7M8m7o7P0MM7k0J8q7jJ1j7Q1j06O5p7J01J7j17J08m4L0j42
$$ plain form
-189 20 171 313 73 141 105 205 272 166 162 198 85 167 104 66 206 152 72 122 65 263 38 64 132 267 171 468 210 288 133
-332 133 150 284 58 91 215 182 179 274 66 150 112 196 345 197 345 109 271 152 97 298 218 367 186 78 265 261 238 161
-470 161 297 126 367 187 320 229 265 293 254
$$ packed form
-189B0J51J42k40O8l6J00O7j06mL6j13Q2o3l8J40n4q0N0n7J98k25K6O8J35r6K97k58P8j55
-332A33J7J34k26L3J24l3lR5k08Q4l8Q4J49j48J48k36J62j19n5K01q0J49j81j08J87mk3p7
-470A61J36j71K41j80J33r1L6K8l9
-514B54
##PAGE=	F1=-1503.6
##FIRST=	4521.1594499999982872,	4521.1594499999982872,	0
##DATA TABLE=	(F2++(Y..Y)), PROFILE
$$ plain form
4521 220 431 242 186 386 300 216 420 210 252 288 292 287 235 344 321 102 278 190 450 131 143 173 256 241 287 270 263 120 189 112 224
4369 224 345 342 118 202 235 93 122 176 209 66 175 235 178 173 256 141 295 150 128 230 55 266 108 250 23 182 232 290
4231 290 34 163 192 11 391 168 222 28 164 254 134 288 140 170 135 206 150 111 158 198 26 192 79 236 37 201 261
4098 261 104 67 276 191 107 63 195 196 250 123 81 89 213 93 196 121 258 138 196 124 253 114 292 63 70 78 203 266 120
3955 120 109 219 18 156 203 56 181 57 100 212 160 123 82 285 87 49 137 32 115 109 42 180 18 168 71 90 60 209
3817 209 145 141 395 192 20 286 147 159 97 51 242 105 135 81 117 49 77 11 98 200 228 47 210 62 49 215 50 118 43
3675 43 339 94 220 144 195 174 163 102 84 309 58 66 144 295 266 123 151 52 149 290 11 95 242 64 84 120 80 78 155 88 131
3522 131 180 122 143 206 89 214 198 208 162 175 196 135 202 11 109 170 94 217 71 66 99 30 171 205 158 97 196 73 201 277 49
$$ packed form
4521B20K11j89n6K00q6q4K04k10M2L6Mnn2J09k3k19J76q8K60l19J2L0Q3j5M6j7pj43O9p7J12
4369B24J21lk24Q4L3j42K9N4L3j43J09O0n7nQ3j15J54j45k2J02j75K11j58J42k27J59N0N8
4231B90k56J29K9j81L80k23N4j94J36R0j20J54j48L0l5P1n6l9M7M0j72J66j13J57j99J64O0
4098B61j57l7K09q5q4m4J32JN4j27m2QJ24j20J03p5J37j20N8p2J29j39J78k29PQJ25O3j46
3955A20j1J10k01J38M7j47J25j24M3J12n2l7m1K03j98l8Q8j05Q3oo7J38j62J50r7J9l0J49
3817B09o4mK54k03j72K66j39J2o2m6J91j37L0n4L6o8K8o6Q7J02K8j81J63j48j3J66j65O8p5
3675D3K96k45J26p6N1k1j1o1j8K25k51QP8J51k9j43K8r9R7J41k79Q4J47j78K0L6m0kP7o7M3
3522A31M9n8K1O3j17J25j6J0m6J3K1o1O7j91R8O1p6J23j46nL3o9J41L4m7o1R9j23J28P6k28
$$ plain form
3369 49 152 199 138 23 86 95 145 13 84 130 171 187 85 241 331 207 163 174 126 152 93 131 236 91 174 126 135 5 188 174 59
3217 59 109 162 135 91 40 159 81 121 111 160 42 116 127 212 138 148 108 252 594 1117 1133 340 227 377 670 136 320 112 93
3074 93 68 130 31 127 150 143 115 184 555 127 499 276 98 113 32 303 716 1044 928 309 255 31 129 40 57 63 33 37 113 226 261
2921 261 647 176 155 151 90 159 377 761 622 415 180 58 103 91 105 66 48 19 63 145 127 380 122 45 116 110 143 38 75 74 152
2769 152 130 67 94 92 125 79 162 49 268 96 252 213 190 53 189 142 168 183 267 127 112 239 849 1087 1120 691 251 111 239
2626 239 57 128 165 50 30 29 47 83 193 212 192 156 82 116 80 250 154 81 84 53 123 88 70 81 118 26 108 75 145 79 40 133 59 39
2459 39 200 175 186 48 70 6 114 55 93 146 108 135 139 155 84 23 90 196 55 183 174 150 177 154 142 83 59 122 65 124 174 170 22
2296 22 19 140 1 179 131 39 60 126 59 185 62 185 177 106 142 69 85 97 64 162 69 82 75 150 116 222 84 235 76 174 42
$$ packed form
3369D9J03M7o1j15O3RN0j32P1M6M1J6j02J56R0j24m4J1m8K6n9L8J05j45Q3m8Rj30J83j4j15
3217E9N0N3k7m4n1J19p8M0j0M9j18P4J1Q5p4J0m0J44L42N23J6p93j13J50K93n34J84k08j9
3074I3k5O2r9R6K3pk8O9L71m28L72k23j78J5q1K71M13L28j16o19n4k24R8q9J7Ol0MP6J13L5
2921B61L86m71k1mo1O9K18L84j39k07k35j22M5j2J4l9j8k9M4Q2j8K53k58p7P1oL3j05L7jP8
2769A52k2o3K7kL3m6Q3j13K19j72J56l9k3j37J36m7K6J5Q4j40j5J27O10K38L3m29m40j40J28
2626B39j82P1L7j15k0jJ8L6J10J9k0l6p4L4l6J70r6p3Ll1P0l5j8J1L7r2Q2l3P0o6l9R3p4k0
2459C9J61k5J1j38K2o4J08n9L8N3l8K7MJ6p1o1O7J06j41J28rk4K7k3j2n9k4O3n7N9N0mj48
2296B2lJ21j39J78m8r2K1O6o7J26j23J23qp1L6p3J6J2l3R8r3J3pP5l4J06j38J51j59R8j32
$$ plain form
2144 42 51 112 12 129 97 102 63 61 162 166 248 37 66 36 91 45 69 113 67 291 78 130 131 288 50 103 145 895 2605 1436 109
1991 109 147 71 36 61 66 24 101 194 62 71 211 100 296 104 31 105 69 189 171 68 164 147 211 199 105 30 193 162 74 163 211 184
1834 184 261 250 248 146 67 212 230 200 94 64 106 162 101 98 178 208 152 206 228 244 187 235 76 119 110 143 205 105 23 262 63 84 74
1671 74 55 102 222 22 98 81 152 124 318 203 236 226 225 251 182 194 209 119 278 381 542 375 632 882 936 1098 1669 1810 2863
1528 2863 3909 6927 14778 13338 45740 16715 52098 14570 17121 10053 39004 82771 23114 6977 3284
1455 3284 2168 1622 1404 954 1064 644 594 525 415 95 61 7 164 213 297 223 230 302 303 307 100 324 203 173 140 169 182 76 272
1312 272 113 278 46 135 335 254 45 57 82 160 84 150 114 125 142 174 224 62 95 176 186 61 156 130 91 168 179 251 151 232 155
1159 155 16 205 124 249 114 166 79 67 143 84 88 151 123 106 94 283 244 141 142 73 253 26 190 134 166 110 213 101 143 84
$$ packed form
2144D2RO1j00J17l2Nl9kJ01MQ2k11K9l0N5m6K4M4m6K24k13N2JJ57k38N3M2P50J710j169j327
1991A09L8p6l5K5Nm2P7R3j32RJ40j11J96j92p3P4l6J20j8j03R6j7O4j2r4p5J63l1q8Q9M8k7
1834A84P7j1kj02p9J45J8l0j06l0M2N6o1lQ0L0n6N4K2J6n7M8j59M3rL3O2j00q2K39j99K1j0
1671G4j9M7J20k00P6j7P1k8J94j15L3j0jK6o9J2J5r0J59J03J61j67K57K50N4J62N71J41J053
1528B863J046L018P851j440L2402k9025L5383l7528K551p068K8951M3767n9657j6137l693
1455C284j116n46k18m50J10m20n0o9j10l20l4n4J57M9Q4p4PP2JMk07K24j21l0l3K9J3j06J96
1312B72j59J65k32Q9K00q1k09J2K5P8p6O6l6J1J7L2N0j62L3Q1J0j25R5k6l9P7J1P2j00Q1p7
1159A55j39J89q1J25j35N2q7j2P6n9MO3k8j7j2J89l9j03Jo9J80k27J64n6L2n6J03j12M2n9
$$ plain form
1012 84 45 241 84 266 123 137 157 212 293 139 55 145 92 86 134 178 97 40 167 154 69 67 54 218 152 46 84 44 233 162 85 94
854 94 126 42 257 88 63 100 52 210 24 56 167 130 118 124 132 117 317 36 91 124 163 200 204 176 68 103 153 32 192 199 245 230 213
692 213 28 240 149 217 117 143 233 223 109 61 290 112 175 217 106 297 221 203 305 289 226 292 440 388 415 435 291 174 250
549 250 356 404 62 718 2494 8241 70108 85791 16020 81434 75199 10706 2716 1031 447 116 176 487 252
455 252 204 852 451 683 447 296 301 206 185 317 154 144 51 27 164 42 154 72 308 91 233 87 320 47 168 128 112
323 112 33 109 91 57 194 135 131 144 72 150 165 186 94 195 102 289 207 147 80 279 113 42 230 71 188 209 128 193 200 38 176
170 176 150 92 81 96 157 66 88 120 168 15 136 100 316 206 93 34 104 234 73 97 211 120 37 232 40 276 129 99 75
27 75 299 100 102 184 279 26 181 118 95 64 271 34 237 125 114 111 78 233 38 45 136 276 197 63 156 176 209 189 220 147 110 158
$$ packed form
1012H4l9J96j57J82j43J4K0N5Q1j54q4R0n3oM8M4q1n7J27j3q5kj3J64o6j06L8m0J89p1p7R
854I4L2q4K15j69k5L7m8J58j86L2J11l7j2OQj5K00k81N5L3L9L7Mk8j08L5N0j21J60PM6j5j7
692B13j85K12r1O8j00K6R0j0j14m8K29j78O3M2j11J91p6j8J02j6o3O6J48n2K7K0j44j17P6
549B50J06M8l42O56J776N747O1867J5683o9771O5414o235o4493p990j685n84l31O0L11k35
455B52m8O48m01K32k36j51Nr5k1J32j63j0r3k4J37j22J12q2K36k17J42j46K33k73J21m0j6
323A12p9P6j8l4J37n9mJ3p2P8J5K1r2J01r3J87q2o0o7J99j66p1J88j59J17K1q1O5Pj62J38
170A76k6n8j1J5O1r1K2L2M8j53J21l6K16j10j13n9P0J30j61K4J14r1q3J95j92K36j47l0k4
27G5K24j99KQ2R5k53J55o3k3l1K07k37K03j12j1ll3J55j95PR1J40p9j34R3K0L3k0L1p3l7M8
$$ plain form
-130 158 105 180 100 149 117 174 178 113 214 168 172 65 173 353 37 168 121 228 267 142 204 252 80 202 122 76 264 148 78 134
-278 134 103 270 33 76 144 281 130 469 140 277 192 195 288 50 111 241 252 154 301 131 120 171 256 359 193 369 130 283
-416 283 185 157 311 227 412 221 120 287 318 283 203 351 188 397 229 379 279 312 334 293
$$ packed form
-130A58n3P5q0M9l2N7Mo5J01m6Mj07J08J80l16J31m7J07L9j25O2M8j72J22q0m6J88j16p0N6
-278A34l1J67k37M3O8J37j51L39l29J37q5LR3k38O1J30J1r8J47j70j1N1Q5J03j66J76k39J53
-416B83r8k8J54q4J85j91j01J67L1l5q0J48j63K09j68J50j00L3K2m1
-514B93
##PAGE=	F1=-1513.45
##FIRST=	4521.1594499999982872,	4521.1594499999982872,	0
##DATA TABLE=	(F2++(Y..Y)), PROFILE
$$ plain form
4521 233 408 244 179 396 259 267 414 232 289 284 299 304 228 368 310 106 259 188 426 151 146 190 231 267 307 287 254 137 216 69
4373 69 224 336 361 151 206 225 104 149 183 236 23 225 217 215 156 274 138 322 157 127 227 92 298 127 258 34 180 281
4236 281 311 45 185 169 62 387 165 213 69 169 261 135 305 128 194 136 199 135 126 132 208 35 142 44 250 23 183 281
4098 281 100 63 339 178 91 24 177 217 279 153 51 119 218 101 196 136 258 122 239 145 266 131 284 78 77 133 211 306
3960 306 128 111 232 21 164 233 51 170 38 127 195 154 142 97 306 86 92 136 46 106 106 48 171 51 176 60 113 12 193
3817 193 157 138 392 168 27 294 151 193 88 97 224 110 111 104 98 49 119 15 124 210 242 74 228 61 51 200 59 147 28
3675 28 308 93 222 119 201 151 198 118 71 285 57 81 160 315 305 81 153 68 137 310 39 80 220 76 87 182 85 36 126
3532 126 89 134 202 105 79 192 107 234 188 207 137 166 164 129 207 13 106 156 126 244 75 44 72 35 167 260 167 81 192 102 187 267
$$ packed form
4521B33J75j64o5K17j37QJ47j82N7nJ5Np6J40n8k04J53p1K38k75nM4M1L6M0k0l3j17P9j47
4373F9J55J12K5k10N5J9j21M5L4N3k13K02qkn9J18j36J84j65l0J00j35K06j71J31k24J46J01
4236B81L0k66J40j6j07L25k22M8j44J00R2j26J70j77O6n8O3o4rOP6j73J07r8K06k27J60R8
4098B81j81l7K76j61q7o7J53M0O2j26j02O8R9j17R5o0J22j36J17r4J21j35J53k06jN6P8R5
3960C06j78j7J21k11J43O9j82J19j32Q9O8m1j2m5K09k20OM4r0O0%n8J23j20J25j16N3j01J81
3817A93l6j9K54k24j41K67j43M2j05RJ27j14Jpom9P0j04J09Q6L2j68J54j67j0J49j41Q8j19
3675B8K80k15J29j03Q2n0M7q0m7K14k28K4P9J55j0k24P2q5O9J73k71M1J40j44J1R5r7m9R0
3532A26l7M5O8r7k6J13q5J27m6J9p0K9kl5P8j94R3N0l0J18j69l1K8l7J32R3r3q6J11r0Q5Q0
$$ plain form
3374 267 47 126 196 156 53 84 69 160 40 72 113 147 211 110 218 279 185 125 188 126 172 103 99 221 77 188 109 103 5 210 173
3222 173 78 128 144 138 144 58 166 70 124 103 162 37 70 105 235 168 158 129 281 700 1216 1114 370 275 508 706 138 278 136
3079 136 61 41 78 41 86 133 130 162 158 436 206 559 280 132 109 62 290 708 1074 959 395 231 28 124 60 43 62 95 50 107
2931 107 157 245 578 146 147 113 78 232 262 705 670 399 188 61 120 57 112 83 31 25 64 136 121 374 126 88 132 124 144 47 37 85
2774 85 154 121 69 123 112 143 76 158 49 235 96 281 178 134 63 149 156 153 188 265 100 117 235 987 1128 1006 637 237 160 258
2626 258 67 120 187 47 22 71 37 106 246 161 147 128 78 126 100 234 230 109 56 123 124 78 53 37 170 58 121 92 164 50 45 105
2469 105 87 34 183 159 210 35 132 62 97 27 104 118 139 141 92 161 102 77 85 228 60 167 168 152 223 147 131 97 78 109 31 138 191
2306 191 107 31 39 140 24 227 148 63 55 107 31 173 70 184 193 82 158 50 32 78 64 117 93 63 85 106 121 191 74 210 85
$$ packed form
3374B67k20P9P0m0j03L1j5R1j20L2M1L4O4j01J08O1r4o0O3o2M6o9mJ22j44J11p9or8K05l7
3222A73r5N0J6oOq6J08r6N4k1N9j25L3L5J30o7j0k9J52M19N16j02p44r5K33J98n68J40j42
3079A36p5k0L7l7M5M7lL2mK78k30L53k79j48k3m7K28M18L66j15n64j64k03R6o4j7J9L3m5N7
2931A07N0Q8L33m32Jl4l5J54L0M43l5k71k11j27N9o3N5k9n2oL9P2j5K53k48l8M4qK0r7j0M8
2774H5O9l3n2N4j1L1o7Q2j09J86j39J85j03m4p1Q6PlL5P7j65J7J18P52J41j22l69m00p7R8
2626B58j91N3O7j40k5M9l4O9J40q5j4j9n0M8k6J34mj21n3O7Jm6k5j6J33j12O3k9P2j14nO0
2469A05j8n3J49k4N1j75R7p0L5p0P7J4K1Km9O9n9k5QJ43j68J07Jj6P1p6j6l4j9L1p8J07N3
2306A91q4p6QJ01j16K03p9q5qN2p6J42j03J14Rj11P6j08j8M6j4N3k4l0K2K1J5P0j17J36j25
$$ plain form
2154 85 195 17 84 146 13 131 132 88 27 43 141 191 235 48 44 44 106 63 73 141 69 315 87 93 109 309 52 102 187 824 2191
2001 2191 1196 95 191 79 10 35 60 53 59 150 74 96 181 130 233 62 15 121 48 242 157 85 148 157 210 224 171 46 161 177 134
1848 134 146 214 132 222 280 186 194 126 142 233 133 129 126 121 148 65 100 100 278 116 193 272 167 142 289 27 60 136 131 158 113 46 227 82
1681 82 49 91 88 111 246 91 136 150 134 106 208 166 114 133 232 135 269 182 370 235 473 523 593 478 650 796 826 1349 1511 1737
1533 1737 2929 4141 7743 16929 14781 52286 20578 59260 19665 22240 12233 8670 8379 4019 2641 1046
1455 1046 847 769 643 398 727 322 348 510 411 83 267 189 238 272 226 115 62 165 143 185 52 199 119 280 189 124 110 170
1317 170 140 112 178 121 95 293 213 77 131 18 235 105 66 71 139 45 180 159 63 82 124 170 93 87 128 143 180 194 237 161 169 80 25
1154 25 162 121 208 67 99 53 112 167 28 102 198 34 51 81 236 201 122 158 54 271 101 192 111 154 89 219 70 153 81 34
$$ packed form
2154H5J10j78O7O2j33J18Jm4o1J6R8N0M4j87m%O2m3J0O8p2K46k28OJ6K00k57N0Q5O37J367
2001B191r95j101R6j12o9K5K5pOR1p6K2Q5n1J03j71m7J06p3J94q5p2O3RN3J4n3j25J15J6m3
1848A34J2O8q2R0N8r4Qo8J6R1j00mlnK7q3L5%J78j62P7P9j05k5J47k62L3P6nK7m5o7J81j45
1681H2l3M2lK3J35j55M5J4j6k8J02m2n2J9R9r7J34q7J88j35K38N0P0j15J72J46L0N23J62K26
1533A737J192J212L602R186k148L7505l1708L8682l9595K575j0007l563k91m360j378j595
1455A046j99p8j26k45L29m05K6J62r9l28J84p8M9L4m6j11n3J03k2M2j33J47q0J61r1o5j4O0
1317A70l0k8O6n7k6J98q0j36N4j13K17j30l9NO8r4J35k1r6J9M2M6p7oM1J5L7J4M3p6Qq9n5
1154B5J37m1Q7j41L2m6N9N5j39P4R6j64J7L0J55l5p9L6j04K17j70R1q1M3o5J30j49Q3p2m7
$$ plain form
1007 34 207 116 247 65 182 174 215 170 114 75 160 58 75 132 184 83 57 152 150 74 60 51 220 122 87 99 73 178 135 39 64 111 76
844 76 215 133 76 62 70 222 34 55 153 120 110 126 128 75 299 26 106 120 165 181 171 197 81 123 151 107 264 151 193 243 209 16
687 16 229 144 224 113 160 250 230 130 76 317 86 196 170 157 373 214 198 318 303 224 326 488 414 497 504 354 199 298 381 400
539 400 72 811 2775 9347 79502 97573 18089 92150 85365 12201 3135 1158 471 138 213 577 285 188 935
446 935 498 750 473 378 344 206 239 304 177 175 52 142 168 113 157 108 304 143 248 65 359 85 187 109 70 43 91 106 55
303 55 248 160 171 123 40 159 193 158 118 176 78 305 190 79 111 297 148 27 221 105 215 243 190 208 223 43 141 145 97 92 112
150 112 163 80 92 142 210 25 130 74 286 178 50 20 113 261 83 55 222 159 12 278 29 295 119 111 51 279 92 111
12 111 152 264 55 214 121 140 79 268 72 223 105 139 117 92 229 25 67 124 342 234 49 154 191 202 201 203 163 91 173 85
$$ packed form
1007C4J73r1J31j82J17qM1m5n6l9Q5j02J7N7N2j01k6R5kp6j4rJ69r8l5J2k6J05m3r6K5M7l5
844G6J39q2n7j4QJ52j88K1R8l3j0J6Kn3K24k73Q0J4M5J6j0K6j16M2K8m4J57j13M2N0l4j93
687A6K13q5Q0j11M7R0k0j00n4K41k31J10k6j3K16j59j6J20j5p9J02J62p4Q3Pj50j55R9Q3J9
539D00l28P39J964O572P0155J8071p9484P4061o785p3164r066j977o87l33P5L64k92r7P47
446I35m37K52k77r5l4j38L3O5j27kj23R0K6n5M4m9J96j61J05j83K94k74J02p8l9k7M8J5n1
303E5J93q8J1m8q3J19L4l5m0N8r8K27j15j11L2J86j49j21J94j16J10K8n3J8J5j80R8Mm8nK0
150A12N1q3J2N0O8j85J05n6K12j08j28l0R3J48j78k8J67o3j47K66k49K66j76qo0K28j87J9
12A11M1J12k09J59r3J9o1J89j96J51j18L4k2k5J37k04M2N7K18j08j85J05L7J1jKm0p2Q2q8
$$ plain form
-135 85 140 117 153 153 160 145 160 246 190 182 82 160 353 27 180 138 237 226 111 225 279 95 216 119 74 291 141 60 123 126 233 47
-293 47 73 139 268 96 429 79 253 219 232 258 82 102 240 292 158 306 178 75 201 302 335 203 354 154 271 214 205
-426 205 282 202 399 220 132 285 332 300 222 384 212 395 245 382 285 319 322 285
$$ packed form
-135H5N5k3L6%Pj5J5Q6n6qj00P8J93l26J53m2R9j1j15J14N4j84J21r7m5K17j50q1O3LJ07j86
-293D7K6O6J29j72L33l50J74l4J3K6j76K0J38N2j34J48j28j03J26J01L3j32J51k00J17n7r
-426B05P7q0J97j79q8J53M7l2p8J62j72J83j50J37r7L4Ll7
-514B85
##PAGE=	F1=-1523.29
##FIRST=	4521.1594499999982872,	4521.1594499999982872,	0
##DATA TABLE=	(F2++(Y..Y)), PROFILE
$$ plain form
4521 193 316 192 133 345 177 255 362 226 283 240 262 273 174 348 270 59 178 152 350 139 114 201 179 253 294 296 208 121 226
4378 226 15 181 297 348 207 175 187 92 166 169 234 62 245 181 258 111 242 105 330 128 121 194 140 310 123 248 29 155
4241 155 301 344 63 184 128 103 358 142 191 132 168 258 145 305 95 221 117 177 107 155 84 187 73 70 29 245 45 168
4103 168 285 108 63 383 140 81 32 163 229 297 173 18 143 200 93 175 127 238 93 259 178 242 171 242 74 96 180 212
3965 212 319 126 95 233 46 149 251 74 159 9 123 184 129 137 116 322 67 129 118 61 114 115 90 161 124 172 44 115 60 158
3817 158 163 135 359 156 60 301 153 215 82 144 195 84 78 110 78 39 145 54 156 200 235 100 248 61 68 186 63 172 43
3675 43 258 72 227 82 201 118 227 119 60 236 62 116 157 306 339 30 152 102 123 316 65 100 195 107 85 241 81
3542 81 24 83 103 117 225 92 11 174 115 246 185 205 116 148 104 121 183 54 109 121 153 244 115 30 44 74 148 304 167 47 158
$$ packed form
4521A93J23j24n9K12j68P8J07j36N7m3K2J1r9J74p8k11J19k6J98k11k5Q7k2P4M1Kq8q7J05
4378B26k11J66J16N1j41l2J2r5P4LO5j72J83o4P7j47J31j37K25k02pP3n4J70j87J25k19J26
4241A55J46M3k81J21n6k5K55k16M9n9L6R0j13J60k10J26j04O0p0M8p1J03j14lm1K16k00J23
4103A68J17j77m5L20k43n9m9J31O6O8j24j55J25N7j07Q2m8J11j45J66q1O4p1P1j68K2Q4L2
3965B12J07j93l1J38j87J03J02j77Q5j50J14O1n5Qk1K06k55O2j1n7N3Jk5P1l7M8j28P1n5R8
3817A58Nk8K24k03r6K41j48O2j33O2N1j11oL2l2l9J06r1J02M4L5j35J48j87PJ18j23J09j29
3675D3K15j86J55j45J19q3J09j08n9J76j74N4M1J49L3l09J22n0K1J93k51L5R5q8k2J56j60
3542H1n7N9K0J4J08j33q1J63n9J31o1K0q9L2m4J7O2j29N5J2L2R1j29q5J4L0P4J56j37j20J11
$$ plain form
3389 158 139 181 223 36 88 184 157 115 82 56 165 85 53 93 131 212 158 189 213 173 90 177 141 190 104 77 198 48 210 96 56 9
3232 9 196 179 91 144 115 150 191 77 172 61 128 77 169 25 10 115 221 199 152 136 317 819 1298 1110 436 314 620 708 141
3089 141 232 164 9 17 85 68 48 114 114 208 149 301 315 640 271 142 102 102 272 718 1079 964 448 184 39 113 92 27 63 167
2941 167 72 92 69 218 435 109 130 71 85 313 179 587 632 316 166 77 124 29 91 107 21 53 73 115 110 355 111 145 127 155
2793 155 128 55 67 74 149 121 63 145 128 164 84 155 63 169 97 320 138 47 65 110 186 142 185 261 61 127 251 1119 1196 854 579
2641 579 211 193 250 105 93 200 37 52 131 22 120 289 81 114 107 97 141 100 189 297 105 31 194 128 65 37 45 209 87 126
2493 126 114 183 15 62 58 112 54 157 126 236 30 179 156 76 108 142 89 172 127 34 174 99 161 82 274 73 144 168 152 265 125
2341 125 103 129 100 120 8 147 231 46 52 68 148 50 259 179 117 49 66 41 153 95 162 205 106 176 24 62 75 93 98 136 33 115
$$ packed form
3389A58j9M2M2j87N2R6k7m2l3k6J09q0l2M0L8Q1n4L1K4m0q3Q7l6M9q6k7J21j50J62j14m0m7
3232IJ87j7q8N3k9L5M1j14R5j11O7n1R2j44j5J05J06k2m7j6J81N02M79j88o74j22L06Q8n67
3089A41R1o8j55QO8j7k0O6%R4n9J52J4L25l69j29m0%J70M46L61j15n16k64j45P4k1o5L6J04
2941A67r5K0k3J49K17l26K1n9J4K28j34M08M5l16j50q9M7r5O2J6q6L2K0M2nK45k44L4j8K8
2793A55k7p3J2PP5k8n8Q2j7L6q0P1r2J06p2K23j82r1J8M5P6m4M3P6k00O6J24Q68P7l42k75
2641E79l68j8N7j45j2J07j63J5P9j09R8J69k08L3pj0M4m1Q9J08j92p4J63o6o3k8QJ64j22L9
2493A26j2O9j68M7mN4n8J03l1J10k06J49k3q0L2L4n3Q3m5r3J40p5O2p9J92k01P1K4j6J13j40
2341A25k2K6k9K0j12J39Q4j85OJ6Q0r8K09q0o2o8J7k5J12n8O7M3r9P0j52L8J3J8NL8j03Q2
$$ plain form
2183 115 81 140 131 80 161 102 221 47 127 186 56 135 192 67 54 45 87 241 180 84 99 93 100 128 70 182 55 320 122 25 87 323
2026 323 43 143 280 599 1610 858 104 250 102 25 131 87 92 22 110 106 97 185 184 151 60 38 145 28 311 116 135 158 165 183
1878 183 257 268 77 169 178 246 129 241 115 169 335 85 257 209 57 258 12 185 234 86 225 53 150 120 364 31 235
1745 235 339 38 130 375 113 127 220 130 106 257 162 189 225 189 168 246 170 360 229 255 309 226 208 115 56 157 82 305 83 455
1597 455 346 603 442 740 747 687 619 588 578 487 1131 1321 1487 2783 4231 8215 18183 15224 54922 23584 62502 24580
1489 24580 27991 18889 91416 180757 43926 9345 4467 2682 1717 1180 930 112 513 460 697 550 373 633 503
1396 503 478 553 346 305 276 178 165 85 299 280 112 448 325 249 149 371 109 215 105 271 118 237 166 231 275 121 367
1263 367 147 92 130 186 112 242 42 178 153 45 171 159 76 138 243 162 255 211 206 119 53 46 196 124 147 36 19 82 208 180 70
$$ packed form
2183A15l4N9rn1Q1n9J19j74Q0N9j30P9N7j25j3rM2J54o1r6J5oPK8n8J12j27K65j98r7O2K36
2026C23k80J00J37L19J011p52p54J46j48p7J06m4Np0Q8mrQ8jl3r1k2J07j17K83j95J9K3PJ8
1878A83P4J1j91R2RO8j17J12j26N4J66k50J72m8j52K01k46J73M9j48J39j72R7l0K44l33K04
1745B35J04l01R2K45k62J4R3r0k4J51r5K7L6l6k1P8p6J90j31K6N4q3j8r3n9J01p5K23k22L72
1597D55j09K57j61K98Po0o8l1j0r1O44J90J66J296J448L984R968k959L9698l1338L8918l7922
1489B4580L411r102P2527Q9341j36831l4581m878j785r65n37k50q18M01n3K37j47j77K60j30
1396E03k5P5k07m1k9r8j3q0K14j9j68L36j23p6j00K22k62J06j10J66j53J19p1O5M4j54K46
1263C67k20n5L8N6p4J30k00J36k5j08J26j2q3O2J05q1R3m4nq7o6pJ50p2K3j11j7O3J26k8j10
$$ plain form
1110 70 88 267 123 47 92 202 109 81 193 139 251 200 211 95 127 77 225 42 186 93 25 129 193 201 48 237 160 222 58
967 58 115 101 189 63 86 141 148 56 120 136 110 84 99 37 228 81 131 89 137 106 135 33 47 102 98 143 177 76 57 74 251 16 59
805 59 119 132 71 115 92 94 234 47 101 134 170 173 121 228 106 162 148 165 334 77 107 214 194 18 194 112 220 118 168 244 199
652 199 180 118 309 66 174 90 201 403 189 183 315 300 219 341 529 415 555 539 418 204 329 368 351 91 845 2896 9862
519 9862 83832 103210 19046 97011 90226 12940 3344 1192 443 171 246 649 307 178 956 513 780 489 435 376
421 376 212 282 282 201 217 42 264 174 171 164 143 284 181 260 59 377 159 198 103 10 109 80 116 61 294 175 214 110 93 157 214
268 214 120 140 134 98 319 179 30 161 291 178 96 207 130 236 251 257 188 239 51 85 163 115 121 127 165 116 108 157 242 65 108 74 223
106 223 156 13 33 127 246 100 55 227 197 11 301 23 284 107 136 43 246 93 150 105 248 88 231 125 171 101 250
$$ packed form
1110G0J8J79j44p6M5J10r3k8J12n4J12n1J1j16L2n0J48j83J44r3o8J04O4Qj53J89p7O2j64
967E8N7j4Q8j26K3N5Pr2O4J6k6k6J5o2J91j47N0m2M8l1K9j02J4N5mM5L4j01j9J7J77k35M3
805E9O0J3o1M4k3KJ40j87N4L3L6Ln2J07j22N6j4J7J69k57L0J07k0j76J76q2J08j02N0P6m5
652A99j9o2J91k43J08q4J11K02k14oJ32j5q1J22J88j14J40j6j21k14J25L9j7k60P54K051O966
519I862P3970J9378q4164P7965o785p7286r596k152p49k72P5M03l42j29P78m43K67k91n4n9
421C76j64P0%q1J6j75K22r0lpk1J41j03P9k01L18k18L9r5r3R9k9L6n5K33j19L9j04j7O4N7
268B14r4K0ol6K21j40j49J31J30j13q2J11p7J06J5Oo9N1j88L4P8m8OOL8m9qM9Q5j77M3l4J49
106B23o7j43K0R4J19j46m5J72l0j86K90k78K61j77K9r3K03j53N7m5J43j60J43j06M6p0J49
$$ plain form
-27 250 120 195 100 159 94 106 197 38 84 110 382 250 40 135 195 177 215 138 147 58 170 42 68 128 147 167 134 94 195 285 186 205
-184 205 68 128 314 99 161 140 227 154 81 218 271 131 209 98 55 280 140 78 88 123 152 56 48 112 236 111 351 59 222
-327 222 200 246 199 139 79 210 288 208 297 194 38 192 322 275 213 297 178 217 253 222 202 137 323 177 102 250 295 276 202 396
-475 396 187 354 218 319 243 290 259 211
$$ packed form
-27B50j30P5r5N9o5J2R1j59M6K6K72j32k10R5O0j8L8p7Rq9J12j28K6O0J9K0l3m0J01R0r9J9
-184B05j37O0J86k15O2k1Q7p3p3J37N3j40P8j11m3K25j40o2J0L5K9r6qO4J24j25K40k92J63
-327B22k2M6m7o0o0J31P8q0Q9j03j56J54J30m7o2Q4j19L9L6l1k0o5J86j46p5J48M5j9p4J94
-475C96k09J67j36J01p6M7l1m8
-514B11
##PAGE=	F1=-1533.13
##FIRST=	4521.1594499999982872,	4521.1594499999982872,	0
##DATA TABLE=	(F2++(Y..Y)), PROFILE
$$ plain form
4521 133 174 91 79 234 108 178 266 206 248 180 209 203 148 306 254 57 45 93 237 90 93 210 99 199 247 303 147 96 237 137
4373 137 91 269 295 283 120 124 53 168 131 207 119 227 139 315 55 162 40 339 75 118 127 195 298 98 228 16 132 285
4236 285 399 91 195 91 137 319 108 154 209 162 250 161 291 39 251 78 166 99 197 28 155 107 16 47 219 56 160
4103 160 271 124 65 412 86 114 110 158 234 316 175 68 162 163 68 135 101 211 77 253 220 205 229 171 48 135 211 208 306 113 59
3950 59 223 77 113 258 120 172 49 91 195 93 107 138 330 50 153 88 85 136 138 122 167 220 149 59 91 141 113 166 135 306 177
3798 177 96 306 150 231 95 197 165 49 45 104 100 24 153 104 190 176 205 127 269 73 113 191 72 195 62 199 45 240 61
3655 61 197 78 241 104 56 201 85 171 127 270 365 82 143 152 103 304 81 145 169 152 67 298 61 100 33 135 82 245 74
3512 74 66 168 108 245 191 201 122 133 39 115 136 121 128 71 176 218 163 37 26 120 120 331 162 28 98 191 183 148 20 69 166 143 176
$$ packed form
4521A33M1q3j2J55j26P0Q8o0M2o8K9on5J58n2j97j2M8J44j47LJ17j11J00M8N6j56n1J41j00
4373A37m6J78K6j2j63Mp1J15l7P6q8J08q8J76k60J07j22K99k64M3RO8J03k00J30k12J16J53
4236B85J14l08J04j04M6J82k11M6N5m7Q8q9J30k52K12j73Q8o7R8j69J27m8r1L1J72j63J04
4103A60J11j47n9L47l26K8mM8P6Q2j41j07R4Jr5O7l4J10j34J76l3j5K4n8j23Q7P6lR8j93n4
3950E9J64j46L6J45j38N2j23M2J04j02J4L1J92k80J03o5lN1Kj6M5N3p1r0L2N0k8N3l1J71j29
3798A77q1K10j56Q1j36J02l2j16mN9mp6J29m9Q6j4K9p8J42j96M0P8j19J23j33J37j54J95j79
3655F1J36j19J63j37m8J45j16Q6m4J43R5k83O1Rm9K01k23O4K4j7q5K31k37L9o7J02n3J63j71
3512G4qJ02o0J37n4J0p9J1r4P6K1j5Pn7J05M2n5j26j1R4%K11j69j34P0R3ql5j28M9R7k3L3
$$ plain form
3350 176 83 71 162 135 28 87 134 194 226 165 134 174 61 138 154 206 96 90 171 55 239 131 8 35 147 190 99 160 93 157 226
3197 226 88 177 64 139 39 185 15 61 154 169 232 127 139 350 922 1360 1125 499 337 710 665 152 198 193 57 38 151
3064 151 67 22 92 94 245 164 163 403 723 241 125 94 153 259 766 1065 943 457 122 65 111 129 47 93 234 100 68 72 192
2921 192 236 83 107 64 102 383 238 444 540 193 121 110 115 91 43 135 28 89 91 87 96 329 73 204 94 204 100 71 139 52 136
2769 136 134 66 155 146 186 118 149 97 81 90 370 99 70 82 89 225 140 179 254 22 135 292 1196 1236 712 531 197 214 224 156 56
2616 56 202 41 90 197 6 120 319 32 103 96 150 168 88 130 351 77 49 257 135 79 21 137 232 91 119 145 213 60 95
2474 95 30 138 86 140 86 263 31 202 267 54 203 204 111 209 92 94 196 78 232 70 335 103 121 178 162 301 100 94 176
2331 176 134 178 59 144 297 105 78 108 168 76 282 220 195 69 75 101 148 154 125 216 181 195 87 134 93 139 156 193 37 170 146 181
$$ packed form
3350A76r3j2R1k7j07N9M7O0L2o1l1M0j13P7J6N2j10oQ1j16J84j08j23K7J12M3r1O1o7O4O9
3197B26j38Q9j13P5j00J46j70M6R3J5O3j05J2K11N72M38k35o26j62L73m5n13M6nj36j9J13
3064A51q4m5P0KJ51q1jK40L20m82j16l1N9J06N07K99j22m86l35n7M6J8q2M6J41j34l2MJ20
2921A92M4j53K4m3L8K81j45K06R6l47p2j1Nk4m8R2j07O1KmRK33k56J31j10J10j04k9O8q7Q4
2769A36ko8Q9rM0o8L1n2j6RK80k71k9J2PJ36q5L9P5k32J13J57R04M0n24j81l34J7J0o8j00
2616E6J46j61M9J07j91J14J99k87P1pN4J8q0M2K21k74k8K08j22n6n8J16R5j41K8K6O8j53L5
2474I5o5J08n2N4n4J77k32J71O5k13J49Jr3R8j17KJ02j18J54j62K65k32J8N7j6J39k01oQ2
2331A76m2M4j19Q5J53j92k7L0O0r2K06o2k5j26OK6M7Ok9R1l5J4j08M7m1M6J7L7j56J33k4L5
$$ plain form
2173 181 44 114 117 130 251 120 179 230 114 156 267 75 149 74 2 314 89 142 185 169 74 202 88 229 99 314 189 112
2035 112 111 344 82 218 423 283 1129 502 121 326 156 79 256 171 152 145 154 185 69 273 257 111 155 95 195 107 389 87
1898 87 216 247 189 167 322 391 144 277 176 388 154 288 220 164 417 74 347 318 158 321 161 280 379 65 385 168
1770 168 251 276 464 110 371 430 179 279 492 285 311 386 230 216 465 350 261 422 396 318 458 327 559 421 462 546 471
1637 471 458 377 250 482 365 535 381 732 644 895 722 1078 1047 937 922 721 653 406 531 1093 1354 2608 4304 8372
1519 8372 18357 14540 53073 25390 61548 28750 33872 32125 212013 428025 108369 24864 12007 7364
1450 7364 4850 3623 2754 1461 1507 1220 1172 911 769 1107 945 896 1025 824 816 770 658 609 473 659 613 381 669 559 501
1327 501 392 627 427 430 390 494 329 350 282 444 472 297 548 233 293 314 315 320 383 184 364 315 188 246 268 240 224 375 158
$$ packed form
2173A81j37P0LJ3J21j31N9N1j16M2J11j92P4p5p2L12k25N3M3j6r5J28j14J41j30K15j25p7
2035A12jK33k62J36K05j40Q46o27l81K05j70p7J77q5j9pRL1j16K04j6j46M4o0J00q8K82l02
1898H7J29L1n8k2J55O9k47J33j01K12k34J34o8n6K53l43K73k9j60J63j60J19R9l14L20k17
1770A68Q3K5J88l54K61N9k51J00K13k07K6P5j56j4K49j15q9J61k6p8J40j31K32j38M1Q4p5
1637D71j3q1j27K32j17J70j54L51q8K51j73L56l1j10j5k01o8k47J25N62K61J254J696M068
1519H372R985l817L8533k7683L6158l2798N122j747J79888K16012l19656q3505j2857m643
1450G364k514j227q69j293M6k87m8k61j42L38j62m9J29k01qm6j12m9j36J86m6k32K88j10n8
1327E01j09K35k00Lm0J04j65K1o8J62K8j75K51l15O0K1JNO3j99J80m9j27N8K2k8j6J51k17
$$ plain form
1184 158 369 231 290 248 216 132 337 164 184 149 169 161 324 206 205 85 357 295 180 171 246 27 124 256 254 200 306 250 155 95 131
1031 131 254 124 270 141 100 117 294 130 144 301 134 239 144 148 141 248 138 142 205 68 106 210 152 70 111 184 29 250 68
889 68 182 54 212 110 164 126 133 141 108 75 226 61 111 77 288 44 89 79 184 70 134 23 185 127 81 73 175 177 176 56 263
736 263 147 221 179 200 396 18 10 143 187 42 144 85 205 148 170 217 130 259 169 279 81 110 41 231 377 151 178 296 277
593 277 217 345 560 391 583 530 476 204 334 326 257 118 814 2835 9705 82421 101823 18714 95234 88998 12803
490 12803 3307 1122 363 209 284 693 312 188 914 497 771 497 465 396 236 315 277 224 274 17 375 184 207 181 171 257
362 257 204 270 98 377 245 204 133 87 180 88 120 76 327 179 257 117 158 158 223 113 176 107 157 335 194 75 217 261 199 155
214 155 186 150 251 237 323 142 252 96 14 221 125 158 132 165 146 137 165 259 129 88 109 139 166 24 69 155 194 123 85 227 233 34
$$ packed form
1184A58K11j38N9m2l2q4K05j73K0l5K0qJ63j18jj20K72o2j15rP5k19R7J32kn4J06n6r5o0L6
1031A31J23j30J46j29m1J7J77j64J4J57j67J05r5MpJ07j10MO3j37L8J04n8q2M1P3j55K21j82
889F8J14j28J58j02N4l8PQl3l3J51j65N0l4K11k44M5j0J05j14O4j11J62n8m6qJ02Kjj20K07
736B63j16P4m2K1J96l78qJ33M4j45J02n9J20n7K2M7q7J29r0J10j98K9o9J90J46k26K7J18j9
593B77o0J28K15j69J92n3n4k72J30qo9j39O96K021O870P2716J9402q3109P6520o236p6195
490A2803r496k185p59j54P5M09l81j24P26m17K74k74l2o9j60P9l8n3N0k57L58j91K3k6j0Q6
362B57n3O6j72K79j32m1p1m6R3r2L2m4K51j48P8j40M1%O5j10O3o9N0J78j41j19J42M4o2m4
214A55L1l6J01j4Q6j81J10j56q2K07r6L3k6L3j9rK8R4j30m1K1L0K7j42M5Q6L9p1l8J42Oj99
$$ plain form
57 34 302 34 248 125 181 120 211 106 210 89 229 116 230 128 184 136 224 173 164 135 200 65 125 162 85 79 90 394 245 52
-91 52 93 188 155 233 33 111 57 164 47 56 135 128 161 117 34 210 342 152 252 41 110 249 186 110 122 205 60 61 178 229 178 190
-248 190 95 49 238 164 189 30 96 60 54 33 68 197 155 244 82 205 133 237 156 231 103 171 233 297 294 177 94 141 310 185 218
-401 218 207 218 116 322 233 76 87 217 109 25 183 219 216 141 408 130 291 163 213 200 271 196 92
$$ packed form
57C4K68k68K14j23N6o1R1j05J04j21J40j13J14j02N6m8Q8n1rk9O5j35O0L7p7oJ1L04j49j93
-91E2M1R5l3P8k00P8n4J07j17RP9pL3m4q3J76J32j90J00k11O9J39o3p6J2Q3j45JJ17N1n1J2
-248A90r5m6J89p4K5j59O6l6ok1L5J29m2Q9j62J23p2J04q1P5j28O8O2O4lj17q3M7J69j25L3
-401B18j1J1j02K06q9j57J1J30j08q4J58L6lp5K67k78J61j28N0j3P1p5j04
-514I2
##PAGE=	F1=-1542.98
##FIRST=	4521.1594499999982872,	4521.1594499999982872,	0
##DATA TABLE=	(F2++(Y..Y)), PROFILE
$$ plain form
4521 202 163 105 170 82 206 67 160 223 236 210 239 161 288 298 334 202 172 102 165 49 166 228 34 118 187 326 159 146 278 286
4373 286 59 309 210 368 121 45 47 153 81 178 184 185 140 388 100 113 49 372 99 132 43 249 262 58 217 57 158 237 474
4231 474 139 260 123 177 295 105 112 294 157 244 179 269 39 286 35 201 159 247 95 162 141 107 81 175 66 159 243 145 95
4088 95 432 59 185 202 171 247 356 161 138 178 111 35 84 96 195 114 229 263 218 294 97 42 191 223 208 266 90 16 204 113
3940 113 71 261 179 213 118 65 233 73 63 157 331 78 161 59 120 183 172 134 201 325 114 117 44 223 79 168 139 244 225 136
3793 136 308 143 262 130 261 157 97 44 94 165 44 144 156 220 144 154 160 286 116 183 221 108 220 95 147 71 262 82
3655 82 191 37 237 75 66 236 124 245 72 222 383 169 124 208 77 272 87 197 143 203 41 351 23 187 44 183
3527 183 41 261 48 122 176 86 229 198 197 160 141 115 121 94 206 166 28 192 171 207 59 15 164 93 341 159 84 22 250 194
$$ packed form
4521B02l9n8O5q8J24j39R3O3J3k6K9p8J27J0L6j32l0p0O3j16J17O2j94Q4O9J39j67j3J32Q
4373B86k27K50r9J58k47p6KJ06p2R7OJm5K48k88J3o4L23k73L3q9K06J3k04J59j60J01P9K37
4231D74l35J21j37N4J18j90PJ82j37Q7o5R0k30K47k51J66m2Q8j52O7k1l4k6R4j09R3Q4r8n0
4088I5L37l73J26J7l1P6J09j95k3M0o7p6M9J2R9q1J15L4m5P6j97n5J49L2j5N8j76p4J88r1
3940A13m2J90q2L4r5n3J68j60j0R4J74k53Q3j02O1O3j1l8O7J24k11Lp3J79j44Q9k9J05j9q9
3793A36J72j65J19j32J31j04o0n3N0P1j21J00J2O4p6J0OJ26j70O7L8j13J12j25N2p6J91j80
3655H2J09j54K00j62rJ70j12J21j73J50J61k14m5Q4j31J95j85J10n4O0j62L10l28J64j43J39
3527A83j42K20k13P4N4r0J43l1jl7j9k6Ok7J12m0j38J64k1L6j48m4J49p1K48j82p5o2K28n6
$$ plain form
3379 194 50 53 97 147 122 225 87 99 160 183 45 110 171 168 300 162 47 188 41 75 154 219 85 122 149 118 268 205 90 67
3232 67 71 199 117 179 102 148 249 96 180 79 166 44 214 48 133 211 89 264 94 150 375 994 1391 1149 532 343 785
3099 785 603 179 191 224 131 78 224 41 38 69 75 270 190 50 462 789 191 107 90 209 257 850 1035 898 421 55 91 127
2961 127 166 92 157 288 157 47 171 174 13 85 88 114 113 429 367 359 494 133 83 155 99 183 25 160 50 125 115 61 81 302 11
2808 11 252 39 263 85 107 211 87 120 156 97 152 173 202 171 136 142 49 77 424 68 197 138 89 268 147 170 242 60 137 343
2661 343 1191 1222 676 501 230 228 203 208 56 197 88 124 260 12 107 335 142 113 102 220 208 103 111 386 62 97 305 145
2523 145 121 9 243 244 90 118 183 262 130 145 97 176 117 153 63 291 28 198 379 36 297 279 187 249 58 199 226 47 281
2380 281 46 405 147 114 197 192 334 112 152 234 179 259 128 126 381 193 103 160 197 103 305 264 286 118 176 175 185 231 106 224
$$ packed form
3379A94j44LM4N0k5J03j38J2O1K3j38O5O1lJ32j38j15J41j47L4P9O5j34L7K7l1J50o3j15k3
3232F7MJ28q2O2p7M6J01j53Q4j01Q7j22J70j66Q5P8j22J75j70N6K25O19L97k42o17j89M42
3099G85j82m24J2L3r3n3J46j83lL1OJ95q0j40M12L27n98q4j7J19M8N93J85j37m77l66L6L6
2961A27L9p4O5J31j31j10J24Lj61P2LK6jL16o2qJ35l61n0P2n6Q4j58J35j10P5j0n4K0K21k91
2808A1K41k13K24j78K2J04j24L3L6n9N5K1K9l1l5Or3K8L47l56J29n9m9J79j21K3P2j82P7K06
2661C43Q48L1n46j75k71kk5Nj52J41j09L6J36k48R5K28j93k9j1J18j2j05QK75l24L5K08j60
2523A45k4j12K34Jj54K8O5P9j32J5m8P9n9L6r0K28k63J70J81l43K61j8r2O2j91J41K7j79K34
2380B81k35L59k58l3Q3nJ42k22M0Q2n5Q0j31kK55j88r0N7L7r4K02m1K2j68N8jJ0M6j25J18
$$ plain form
2232 224 271 215 180 197 125 195 248 257 112 239 250 239 59 179 134 172 283 203 234 277 182 208 347 142 267 117 112 400 61 211
2085 211 276 259 52 270 148 275 199 309 274 253 182 383 161 308 603 552 1309 215 132 413 236 150 386 287 234 297 271
1952 271 299 39 414 341 192 285 166 271 222 470 160 316 384 245 236 426 528 244 436 199 541 240 344 378 254 524
1824 524 224 459 448 332 427 365 412 542 199 572 322 393 462 572 283 557 540 408 508 628 500 526 609 408 426 699 583
1691 583 450 645 631 515 695 546 803 647 732 834 803 782 744 590 871 718 877 725 1060 998 1215 1044 1462 1403 1353 1401
1563 1401 1238 1282 1168 840 1328 1794 2703 4471 8265 17416 12786 46979 25838 56931 31710 39360 50001 355907
1474 355907 724531 186916 44057 21333 13200 8796 6632 4983 3218 2705 2152 1788 1401 1233 1626 1497 1444
1391 1444 1607 1472 1470 1370 1253 1144 952 1084 1017 722 920 855 804 713 911 802 717 769 767 618 627 526 692 698 502 759 361 531
$$ packed form
2232B24M7n6l5J7p2P0N3Rj45J27J1j1j80J20m5L8J11q0L1M3r5K6J39k05J25j50nK88l39J50
2085B11O5j7k07K18j22J27p6J10l5k1p1K01k22J47K95n1P57j094q3K81j77q6K36r9n3O3k6
1952B71K8k60L75p3j49R3j19J05m9K48l10J56O8j39rJ90J02k84J92k37L42l01J04L4j24K70
1824E24l00K35j1j16R5o2M7J30l43L73k50P1O9J10k89K74j7j32J00J20j28K6Q3k01J8K73j16
1691E83j33J95j4j16J80j49K57j56Q5J02l1k1l8j54K81j53J59j52L35o2K17j71M18n9n0M8
1563A401j63M4j14l28M88M66R09J768L794R151m630L4193k1141L1093k5221P650J0641L05906
1474C55907L68624n37615j42859k2724q133m404k164j649j765n13n53l64l87j68L93j29n3
1391A444J63j35kj00j17j09j92J32o7k95J98o5n1r1J98j09q5N2kj49Rj01J66Oj96K57l98J70
$$ plain form
1253 531 549 503 559 583 420 591 517 404 384 412 437 377 517 248 515 337 402 472 407 261 527 270 338 295 351 255 443 270 374
1110 374 160 460 485 341 304 364 192 259 347 371 169 408 307 271 103 234 320 248 393 226 212 258 411 59 256 369 154
977 154 268 275 201 201 334 234 230 321 46 222 316 216 129 160 288 62 294 123 239 49 295 225 218 234 252 226 124 134 284 41
830 41 179 98 323 127 148 97 257 174 219 69 295 10 122 55 230 189 186 28 294 206 297 258 224 447 117 146 66 211 77
687 77 102 118 183 198 168 178 54 354 218 254 130 27 163 248 301 108 202 265 235 223 349 580 346 587 483 525 220 319 267
544 267 130 149 724 2601 8901 75507 93640 17128 87092 81860 11811 3030 957 250 251 339 704 298 214 816
446 816 454 724 497 473 407 285 342 315 248 339 37 458 197 216 207 187 240 213 281 172 367 332 215 201 188 248 115 117 96 342
298 342 169 295 147 215 179 219 178 232 162 227 358 237 127 269 212 210 197 159 173 265 221 381 120 267 177 65 304 120 196
$$ packed form
1253E31J8m6N6K4j63J71p4j13k0K8K5o0J40k69K67j78O5P0o5j46K66k57O8m3N6r6J88j73J04
1110C74k14L00K5j44l7O0j72O7Q8K4k02K39j01l6j68J31Q6p2J45j67j4M6J53l52J97J13k15
977A54J14Pp4%J33j00mR1k75J76R4j00q7L1J28k26K32j71J16j90K46p0pJ6J8k6j02J0J50k43
830D1J38q1K25j96K1n1J60q3M5j50K26k85J12o7J75m1lj58K66q8R1l9l4K23l30K9q0J45j34
687G7K5J6O5J5l0J0j24L00j36L6j24j03J36Q5N3j93R4O3l0j2J26K31k34K41j04M2l05R9n2
544B67j37J9N75J877O300O6606J8133p6512O9964n232p0049q781k073p07JQ8L65m06q4O02
446H16l62K70k27k4o6j22N7k7o7R1l02M21k61J9rk0N3k7O8j09J95l5j17j4j3O0j33Kk1K46
298C42j73J26j48O8l6M0m1N4p0O5J31j21j10J42n7kj3l8J4R2m4J60k61J47r0j12K39j84P6
$$ plain form
155 196 127 163 163 176 174 261 212 109 169 118 214 67 116 193 133 147 113 222 265 59 299 58 210 189 240 229 196 134 281 144 205 137
-2 137 210 127 185 179 207 239 155 203 270 119 151 169 148 59 65 381 223 91 50 176 173 261 114 113 123 179 129 175 139 95 145 141 23 202
-170 202 412 88 324 79 179 196 275 74 95 194 44 57 109 159 231 176 157 107 201 222 340 42 96 151 49 103 45 171 190
-312 190 123 116 225 61 221 221 354 187 185 134 406 320 136 184 63 274 85 234 141 290 72 428 299 101 205 202 144 92
-450 92 107 162 165 91 451 142 272 175 199 278 343 278 189
$$ packed form
155A96o9L6%J3kQ7m9j03O0n1R6j47M9P7o0J4l4J09M3k06K40k41J52k1N1j1l3o2J47j37O1o8
-2A37P3q3N8oK8L2q4M8O7j51L2J8k1q9OL16j58j32m1J26lQ8j47jJ0N6n0M6l6m4N0mj18J79
-170B02K10l24K36k45J00J7P9k01K1R9j50J3N2N0P2n5j9n0R4K1J18k98N4N5j02N4n8J26J9
-312A90o7pJ09j64J60%J33j67kn1K72q6j84M8j21K11j89J49r3J49k18L56j29j98J04ln8n2
-450I2J5N5Lp4L60l09J30r7K4P9O5o5q9
-514A89
##PAGE=	F1=-1552.82
##FIRST=	4521.1594499999982872,	4521.1594499999982872,	0
##DATA TABLE=	(F2++(Y..Y)), PROFILE
$$ plain form
4521 382 378 270 339 126 374 158 169 312 300 356 380 248 507 368 484 372 390 213 257 143 283 256 143 60 170 384 272
4388 272 265 359 438 210 412 142 443 225 47 133 129 83 184 257 155 214 471 202 233 149 432 213 165 105 294 207 21 232
4250 232 120 231 169 558 204 365 213 228 306 157 92 378 160 244 198 254 126 325 77 277 259 301 196 232 179 189 126 120
4113 120 101 160 209 164 156 454 110 268 297 206 280 419 133 207 194 58 46 46 147 204 178 206 301 306 357 94 110 253 218 213 208 67
3955 67 54 179 155 74 270 242 269 194 119 288 104 71 171 323 133 151 60 165 254 207 127 258 419 104 189 24 290 93
3817 93 168 147 187 283 174 307 138 319 172 335 184 185 83 97 238 92 124 202 240 115 88 199 295 180 264 264 166 247 150 129
3670 129 132 287 115 189 24 218 49 90 323 167 331 27 187 390 248 91 261 58 220 86 246 120 252 43 395
3547 395 29 276 106 238 36 275 35 155 186 50 200 197 197 210 173 228 142 107 298 216 60 198 114 242 86 6 201 75
$$ packed form
4521C82mj08O9k13K48k16J1J43j2N6K4j32K59j39J16j12J8j77M4j14J40k7j13q3J10K14j12
4388B72pR4P9k28K02k70L01k18j78Q6mm6J01P3j02N9K57k69L1q4K83k19m8o0J89q7j86K11
4250B32j12J11o2L89l54J61j52J5P8j49o5K86k18Q4m6N6j28J99k48K00j8M2j05L6n3J0o3o
4113A20j9N9M9m5qK98l44J58K9r1P4J39k86P4j3j36j2%J01N7k6K8R5NN1k63J6J43l5nnj41
3955F7j3J25k4q1J96k8K7p5p5J69j84l3J00J52j90J8r1J05Q9m7q0J31J61l15Q5j65K66j97
3817I3P5k1M0R6j09J33j69J81j47J63j51Jj02J4J41j46L2P8L8j25k7J11R6j15Q4%r8Q1r7k1
3670A29LJ55j72P4j65J94j69M1K33j56J64l04J60K03j42j57J70k03J62j34J60j26J32k09L52
3547C95l66K47j70J32k02K39k40J20L1j36J50l%J3l7N5q6l5J91q2j56J38q4J28j56q0J95j26
$$ plain form
3409 75 343 167 152 75 303 213 68 112 138 132 103 253 96 123 173 224 92 156 233 148 365 189 38 209 28 27 137 229 80
3266 80 148 141 191 290 286 187 96 43 202 158 208 128 121 259 109 186 99 207 99 255 94 198 274 16 291 75 172 391 1026 1382
3118 1382 1160 523 335 857 577 230 215 261 201 120 290 16 70 43 68 282 215 86 497 820 131 137 92 263 270 951 994 835
2981 835 348 9 110 152 198 139 234 321 242 60 259 170 220 110 92 177 109 443 480 410 586 223 105 205 84 283 102 175
2843 175 79 158 136 56 65 277 69 280 47 323 115 160 271 165 121 178 144 139 204 208 235 112 192 145 67 473 63 318 222 99
2695 99 312 158 159 225 119 128 391 1104 1159 792 485 309 244 215 250 114 193 153 153 311 26 83 338 251 136 128 288 251 168 167 405
2542 405 100 149 333 156 169 4 348 250 116 140 226 319 205 203 172 230 139 190 84 315 25 170 476 40 381 353 275 288
2405 288 88 301 263 31 307 26 472 193 134 222 239 360 175 241 295 228 336 209 100 468 262 124 215 232 130 334
$$ packed form
3409G5K68j76j5p7K28r0j45M4K6ok9J50j57K7N0N1j32O4P7q5K17j76j51J71j81jJ10R2j49
3266H0O8pN0R9mr9r1n3J59m4N0q0pJ38j50P7q7J08j08J56j61J04P6k58K75k16R7K19O35L56
3118A382k22o37j88N22k80l47j5M6o0q1J70k74N4k7K5K14o7j29M11L23o89Om5J71PO81M3j59
2981H35m87l39J01M2M6n9R5Q7p9j82J99q9N0j10j8Q5o8L34L7p0J76l63j18J00j21J99j81P3
2843A75r6P9k2q0RK12k08K11k33K76k08M5J11j06m4N7l4nO5MK7j23Q0m7p8M06m10K55r6j23
2695I9K13j54JO6j06RK63P13N5l67l07j76o5k9L5j36P9m0%J58k85N7K55q7j15qJ60l7q3jK38
2542D05l05M9J84j77J3j65L44r8j34K4Q6R3j14kl1N8r1N1j06K31k90J45L06m36L41k8p8J3
2405B88k00K13l8k32K76k81M46k79n9Q8J7J21j85O6N4o7J08j27j09L68k06j38R1J7j02K04
$$ plain form
2277 334 301 380 174 295 252 253 308 161 227 352 235 278 238 165 252 336 323 204 311 353 304 165 265 196 226 310 284 288 319 251 281
2124 281 419 235 393 164 237 487 182 276 359 351 84 322 231 315 311 315 360 397 265 444 246 394 796 1161 2004 224 136 501
1986 501 328 230 502 415 327 462 403 424 91 569 422 306 424 239 356 347 540 288 419 526 324 373 548 660 356 599
1858 599 261 684 354 397 543 380 642 378 577 582 505 559 575 560 701 377 746 483 557 641 673 469 744 654 642 754 763 729
1720 729 737 854 615 654 924 826 675 860 859 729 921 784 1049 876 1028 1130 1164 1122 1122 974 1260 1085 1255 1060 1387 1346 1520
1588 1520 1363 1846 1775 1848 1967 1948 2090 2090 1949 2135 2654 3179 4728 7934 15481 10200 37658 24956 49837 33161 43921
1484 43921 69396 502796 1029102 268775 64183 31158 19373 12993 9760 7278 5144 3909 3070 2394 1915
1410 1915 1708 2108 2104 2041 2209 2165 2172 1993 1869 1695 1449 1513 1413 1075 1167 1163 1106 1058 1190 1176 1035 1159 1053 930 946 801 938 920
$$ packed form
2277C34l3P9k06J21m3JN5j47O6J25j17M3m0p3Q7Q4j3j19J07M2m9j39J00o9L0Q4k6ML1o8L0
2124B81J38j84J58k29P3K50l05R4Q3qk67K38r1Q4mMM5L7j32J79j98J48M02L65Q43j780q8L65
1986E01j73r8K72q7q8J35n9K1l33M78j47j16J18j85J17rJ93k52J31J07k02M9J75J12l04K43
1858E99l38M23l30M3J46j63K62k64J99Np7N4J6j5J41l24L69k63P4Q4L2k04K75r0j2J12Rl4
1720G29QJ17k39L9K70r8j51J85jj30J92j37K65j73J52J02L4m2%j48K86j75J70j95L27m1J74
1588A520j57M83p1P3J19j9J42%j41J86N19N25J549L206P547n281K7458j2702K4881j6676J0760
1484D3921K5475M33400N26306p60327k04592l3025j1785o380l233k482k134j235q39o76m79
1410A915k07M00mo3J68m4Pj79j24j74k46O4j00l38R2mn7m8J32j4j41J24j06j23J6j45J37j8
$$ plain form
1273 920 704 971 509 772 798 712 799 805 664 829 723 632 538 575 630 555 647 407 666 487 524 715 598 409 720 416 514 448
1135 448 538 345 549 362 559 283 559 668 506 463 501 362 415 456 468 237 497 369 399 164 352 408 380 527 335 344 422
1002 422 531 107 359 434 234 305 384 260 275 433 333 328 458 179 356 422 302 235 223 390 113 349 200 297 123 381 360
869 360 288 344 373 322 171 251 346 53 243 137 350 225 224 172 327 307 343 172 402 157 165 108 280 200 199 103 313 278 380 357
721 357 261 483 211 289 138 265 116 110 184 164 253 162 147 129 448 261 272 187 112 296 253 207 72 251 225 186 238 362 585 289
574 289 574 417 558 259 307 211 29 181 591 2228 7575 64195 79953 14531 73849 69916 10121 2558 721
480 721 153 290 407 677 267 243 681 393 651 492 468 410 351 369 388 269 400 100 499 216 198 238 188 246 217 297 263 351
342 351 409 244 287 288 306 151 111 119 337 150 322 186 258 214 212 278 300 260 289 388 292 161 309 154 213 224 131 208 284 232 422 184
$$ packed form
1273I20k16K67m62K63K6q6Q7Oj41J65j06r1r4L7N5p5R2k40K59j79L7J91j17j89L11l04R8o6
1135D48R0j93K04j87J97k76K76J09j62m3L8j39N3M1J2k31K60j28L0k35J88N6k8J47j92RP8
1002D22J09m24K52P5k00P1P9j24J5J58j00nJ30k79J77O6j20o7j2J67k77K36j49R7j74K58k1
869C60p2N6K9n1j51Q0R5k93J90j06K13j25jn2J55k0L6j71K30k45Qn7J72q0jr6K10l5J02k3
721C57r6K22k72P8j51J27j49oP4k0Q9r1j5j8L19j87J1q5p5J84m3m6j35J79k6l9N2J24K23k96
574B89K85j57J41k99M8r6j82J52M10J637N347N6620J5758o5422N9318l933n9795p563j837
480G21n68J37J17K70m10k4M38k88K58j59k4n8n9J8J9j19J31l00L99k83j8M0n0N8k9Q0l4Q8
342C51N8j65M3JJ8j55m0QK18j87J72j36P2m4kO6K2m0K9R9r6j31J48j55N9J1r3P7P6n2J90k38
$$ plain form
185 184 284 275 140 386 104 233 113 161 164 215 189 255 305 165 240 218 277 119 165 234 128 167 131 217 290 86 311 85 208 275
37 275 305 344 217 176 349 214 179 149 176 118 182 223 217 317 184 281 351 231 180 229 217 54 51 352 194 142 99 166 238 305 259 194
-120 194 205 224 215 303 144 57 141 196 72 178 483 10 406 156 306 207 355 157 90 225 138 67 23 73 282 191 253 189 225
-263 225 298 502 122 169 306 63 199 97 169 201 33 157 284 166 224 358 489 287 277 50 514 375 117 275 78
-386 78 236 86 280 213 385 231 559 431 284 383 334 288 233 130 235 207 185 534 270 368 307 366 465 497 471 420
$$ packed form
185A84J00rj35K46k82J29j20M8LN1k6O6N0j40P5k2N9j58M6O9j06L9l6Q6P3k04K25k26J23O7
37B75L0L9j27m1J73j35l5l0K7n8O4M1oJ00j33R7P0j20n1M9j2j63lL01j58n2m3O7P2O7m6o5
-120A94J1J9rQ8j59q7Q4N5j24J06L05m73L96k50J50r9J48j98o7J35q7p1m4N0K09r1O2o4L6
-263B25P3K04l80M7J37k43J36j02P2L2j68J24J27j18N8J34J31k02j0k27M64j39k58J58j97
-386G8J58j50J94o7J72j54L28j28j47R9m9m6n5j03J05k8k2L49k64R8o1N9R9L2k6n1
-514D20
##PAGE=	F1=-1562.67
##FIRST=	4521.1594499999982872,	4521.1594499999982872,	0
##DATA TABLE=	(F2++(Y..Y)), PROFILE
$$ plain form
4521 571 614 429 514 301 536 329 299 437 408 532 551 386 729 482 641 536 596 340 404 265 397 286 264 125 233 468
4393 468 402 394 459 566 367 526 185 492 353 121 231 108 155 227 328 177 318 547 303 404 241 498 337 208 221 319
4265 319 139 46 270 187 312 111 632 278 471 310 285 341 223 114 451 174 245 217 255 213 360 153 361 361 351 288 321 220
4127 220 254 175 67 157 158 178 177 227 480 175 342 381 255 329 490 99 265 208 32 89 63 221 234 235 209 330 420 409 160 195
3980 195 307 205 217 141 65 110 151 198 123 289 296 322 266 206 344 150 143 177 306 184 125 88 213 332 233 113 319 487 154
3837 154 256 97 330 137 164 164 141 336 207 303 145 391 205 406 229 267 131 122 300 146 100 234 245 99 19 240 297
3704 297 245 341 300 229 273 221 153 189 306 139 191 52 189 70 128 405 199 417 95 187 384 304 47 300 75 157 93 283
3566 283 107 289 86 424 89 356 166 288 67 289 57 166 182 13 168 186 204 255 211 329 171 159 382 268 105
$$ packed form
4521E71M3j85Q5k13K35k07l0J38k9J24J9j65L43k47J59j05O0k56O4j39J32j11k2j39J08K35
4393D68o6qO5J07j99J59l41L07j39k32J10j23M7P2J01j51J41K29k44J01j63K57j61j29J3R8
4265C19j80r3K24q3J25k01N21l54J93j61k5N6j18j09L37k77P1k8L8m2J47k07K08%j0o3L3j01
4127B20L4p9j08R0JK0jN0K53l05J67L9j26P4J61l91J66n7j76N7k6J58J3Jk6J21R0j1k49L5
3980A95J12j02J2p6p6M5M1M7p5J66PK6n6o0J38j94pL4J29j22n9l7J25J19r9j20K06J68l33
3837A54J02j59K33j93K7%k3J95j29R6j58K46j86K01j77L8j36rJ78j54m6J34J1j46q0K21N7
3704B97n2R6m1p1M4n2o8L6J17j67N2j39J37j19N8K77k06K18l22R2J97q0k57K53k25Q2o4J90
3566B83j76J82k03L38l35K67j90J22k21K22k32J09J6j69J55J8J8N1m4J18j58j2K23j14j63
$$ plain form
3443 105 194 59 263 111 22 226 71 345 185 213 160 337 237 177 176 166 123 94 256 103 138 205 255 134 212 300 144 405
3305 405 230 115 229 18 99 105 236 88 159 150 256 299 354 288 113 128 197 213 245 148 78 258 130 193 115 255 149 297 140
3163 140 247 335 101 308 94 195 399 1016 1323 1140 467 319 935 634 310 257 297 258 158 340 60 101 16 85 283 230
3035 230 158 518 808 88 210 100 303 293 1043 950 762 253 66 118 170 220 179 307 328 337 99 319 178 426 144 121 233
2902 233 92 422 547 523 757 317 162 252 79 376 177 173 114 184 148 77 49 256 161 285 120 376 168 221 311 241 151 191
2764 191 191 120 230 201 296 83 240 235 77 505 95 416 315 103 348 166 145 203 168 108 427 947 1073 986 474 395 267 258
2626 258 276 176 198 216 176 343 33 52 332 339 169 170 340 288 252 237 408 152 196 338 166 206 6 436 256 169 178 266 367
2483 367 277 260 234 292 149 228 118 334 43 125 542 71 443 413 350 318 156 383 302 50 309 59 522 229 173 246 287 375
$$ packed form
3443A05Q9j35K04j52q9K04j55K74j60K8n3J77j00o0jj0m3k9J62j53L5O7N0j21P8Q8j56K61
3305D05j75j15J14k11Q1OJ31j48P1rJ06M3N5o6j75J5O9J6L2r7p0J80j28O3p8J40j06J48j57
3163A40J07Q8k34K07k14J01K04O17L07j83o73j48O16l01l24n3M0l9j00J82k80M1q5O9J98n3
3035B30p2L60K90p20J22j10K03j0P50r3j88n09j87N2N2N0m1J28K1Rk38K20j41K48k82k3J12
2902B33j41L30J25k4K34m40j55R0j73K97j99mn9P0l6p1k8K07r5J24j65K56k08N3R0p0r0M0
2764A91%p1J10k9R5k13J57nj58M28m10L21j01k12K45j82k1N8l5o0L19N20J26q7n12p9j28r
2626B58J8j00K2J8m0J67l10J9K80Pj70JJ70n2l6j5J71k56M4J42j72M0k00M30j80q7RQ8J01
2483C67r0j7k6N8j43P9j10K16k91Q2M17m71L72l0o3l2j62K27q1k52K59k50M63k93n6P3M1Q8
$$ plain form
2346 375 252 329 350 268 391 291 86 543 300 138 266 268 157 366 322 462 224 404 321 321 368 258 216 410 251 366 251
2213 251 207 302 402 381 296 372 434 362 257 359 250 284 327 347 332 349 309 355 470 327 509 203 354 560 297 325 423 433 137
2070 137 350 319 344 408 338 431 519 339 513 314 456 970 1722 2659 408 150 578 418 309 582 534 410 616 522 534 171
1942 171 708 488 400 550 302 432 464 589 419 508 642 404 523 663 766 461 732 339 795 463 436 687 496 753 510
1819 510 677 698 646 689 760 698 830 551 872 624 716 783 752 637 891 754 841 973 872 938 906 1080 808 858 1103 1037 881 1036
1681 1036 1039 921 1102 999 1252 1072 1299 1384 1494 1415 1446 1340 1587 1407 1598 1332 1659 1630 1762 1627 2173 2104 2312 2502 2656
1558 2656 2853 2954 3003 3075 3539 3811 4947 7384 12806 7169 26701 22925 41747 33000 47003 86845 628922 1292963
1469 1292963 340934 82013 39931 24913 16794 12504 9255 6907 4919 3817 2866 2363 2123 2473 2683 2586 2734
$$ packed form
2346C75j23P7K1q2J23j00k05M57k43j62J28Kj11K09m4J40k38J80q3%M7j10m2J94j59J15j15
2213B51m4R5J00k1q5P6O2p2j05J02j09L4M3K0j5J7m0M6J15j43J82l06J51K06k63K8R8J0k96
2070A37K13l1K5O4p0R3Q8j80J74j99J42N14P52R37k251k58M28j60j09K73m8j24K06r4J2l63
1942A71N37k20q8J50k48J30L2J25j70Q9J34k38J19J40J03l05K71l93M56l32k7K51j91K57k43
1819E10J67K1n2M3P1o2J32k79L21k48R2O7l1j15K54j37Q7J32j01O6l2J74k72N0K45o6j56J55
1681A036Lj18J81j03K53j80K27Q5J10p9L1j06K47j80J91k66L27k9J32j35N46o9K08J90J54
1558B656J97J01M9P2M64K72J136K437N422n637J9532l776J8822q747J4003L9842N42077O64041
1469A292963r52029k58921m2082j5018q119m290l249k348j988j102r51n03k40L50K10r7J48
$$ plain form
1386 2734 2777 2805 2541 2401 2177 1885 1877 1735 1381 1371 1430 1356 1372 1422 1491 1331 1497 1303 1212 1233 1051 1142 1102 871 1154 651 977 1018
1248 1018 903 1003 1009 872 1038 896 835 670 730 786 722 740 578 796 630 633 934 758 548 883 569 664 586 703 415 627 452
1115 452 734 414 635 817 652 617 618 510 559 561 530 362 564 420 513 239 463 492 497 638 450 475 558 642 203 436 488 321
977 321 341 458 312 353 524 418 418 585 308 482 511 382 332 286 473 165 401 275 346 211 461 479 358 441 474 406 245 358
839 358 404 95 294 181 362 323 300 252 374 437 472 265 491 295 205 184 312 203 210 172 316 354 456 449 322 503 286 418
702 418 267 325 151 160 240 155 300 155 140 256 523 295 331 237 223 412 247 189 52 300 185 145 256 387 569 235 553
569 553 365 572 305 323 176 158 213 437 1773 5927 50213 62836 11328 57495 54958 7991 1968 449 176 323
470 323 474 618 227 263 530 324 564 479 456 405 416 397 462 285 442 174 490 241 159 261 176 271 221 312 358 330 465 291
$$ packed form
1386B734M3K8k64j40k24k92qj42l54j0N9p4J6N0O9j60J66j94r1K1j82R1m0k31K83n03L26M1
1248A018j15J00Oj37J66j42o1j65O0N6o4J8j62K18j66LL01j76k10L35l14R5p8J17k88K12j75
1115D52K82l20K21J82j65l5Jj08M9Kl1j68K02j44R3k74K24K9NJ41j88K5Q3Q4m39K33N2j67
977C21K0J17j46M1J71j06%J67k77J74K9j29n0m6J87l08K36j26P1j35K50J8j21Q3L3o8j61J13
839C58M6l09J99j13J81l9k3m8J22O3L5k07K26j96r0k1J28j09Pl8J44L8J02pj27J81k17J32
702D18j51N8j74RQ0q5J45j45j5J16K67k28L6r4j4J89j65n8j37K48j15m0J11J31J82l34L18
569E53j88K07k67J8j47j8N5K24J336M154M4286J2623n1508M6167k537m6967o023j519k73J47
470C23J51J44l91L6K67k06K40q5k3n1J1j9O5j77J57k68L16k49q2J02q5R5n0R1M6k8J35j74
$$ plain form
332 291 371 373 347 185 109 140 309 128 334 223 285 247 212 378 364 355 331 416 342 175 329 95 213 235 112 248 311 277 439 283
185 283 299 369 202 449 93 265 93 160 150 243 213 248 394 223 307 340 334 173 209 268 191 177 140 211 307 114 347 109 257 357
37 357 364 444 260 222 400 265 156 152 133 102 181 261 250 395 233 350 420 355 210 300 283 85 71 317 170 190 191 165 318 362 384
-116 384 299 279 283 284 419 152 44 160 253 109 153 539 100 482 231 442 270 412 277 124 292 215 78 68 19 326 236
-248 236 347 270 311 368 643 197 266 450 93 299 160 180 184 123 207 357 321 252 498 611 376 393 161 598 433 165 353
-381 353 184 226 182 350 349 479 401 689 587 462 555 485 442 374 240 374 309 333 636 417 529 473 564 672 664 676 649
$$ packed form
332B91Q0Kk6j62p6L1J69j81K06j11O2l8l5J66j4rk4Q5p4j67J54k34J18K2j23J36O3l4J62j56
185B83J6P0j67K47l56J72j72O7j0R3l0L5J46j71Q4L3oj61L6N9p7j4l7P1R6j93K33k38J48J00
37C57PQ0j84l8J78j35j09mj9l1P9Q0j1J45j62J17P0o5j45R0j7j98j4K46j47K0Jk6J53M4K2
-116C84q5k0MJJ35k67j08J16R3j44M4L86m39L82k51K11j72J42j35j53J68p7j37j0m9L07r0
-248B36J11p7M1N7K75m46O9J84l57K06j39K0Mo1Q4J50l6o9K46J13k35J7k32M37j65k68J88
-381C53j69M2m4J68jJ30p8K88j02j25R3p0m3o8j34J34o5K4L03k19J12n6R1J08qJ2k7
-514F49
##PAGE=	F1=-1572.51
##FIRST=	4521.1594499999982872,	4521.1594499999982872,	0
##DATA TABLE=	(F2++(Y..Y)), PROFILE
$$ plain form
4521 722 810 542 659 444 661 476 429 550 507 681 697 502 908 585 756 667 751 450 520 374 483 308 366 206 319 554
4393 554 504 499 552 645 496 615 285 501 468 174 318 104 233 273 386 231 416 597 380 556 308 541 442 248 321 317 68
4260 68 81 314 247 374 110 678 346 545 391 335 372 270 152 503 193 240 233 269 287 379 225 427 439 389 354 389 257 292 218
4118 218 61 217 147 159 179 289 504 225 392 436 303 376 545 69 307 214 58 126 98 284 271 270 235 343 513 446 216 276
3980 276 344 190 209 82 82 156 125 237 171 312 333 357 321 288 387 184 218 173 282 222 89 114 261 397 242 116 367 520 225
3837 225 306 168 335 175 155 184 107 377 229 294 167 457 219 460 272 327 176 154 340 200 77 247 232 100 61 277
3709 277 290 290 401 314 283 288 291 192 225 313 146 195 78 157 118 169 452 213 489 167 212 366 328 8 316 120 100 118 302 110
3561 110 305 130 432 144 413 214 322 89 305 84 160 157 47 148 171 213 283 241 402 199 204 443 316 132 181 18 269
$$ packed form
4521G22Q8k68J17k15K17j85m7J21m3J74J6j95M06l23J71q9Q4l01P0j46J09j75N8j60J13K35
4393E54n0nN3R3j49J19l30K16l3k94J44k14J29M0J13j55J85J81k17J76k48K33r9j94P3mk49
4260F8J3K33o7J27k64N68l32J99j54n6L7j02j18L51l10M7pL6J8R2j54K02J2n0l5L5j32L5p4
4118B18j57J56p0J2K0J10K15k79J67M4j33P3J69m76K38r3j56O8k8J86j3jl5J08J70o7k30O0
3980B76O8j54J9j27%P4l1J12o6J41K1K4l6l3R9k03L4m5J09o0j33K5J47J36j55j26K51J53k95
3837B25Q1j38J67j60k0K9p7K70j48O5j27K90k38K41j88N5j51k2J86j40j23J70j5j32l9K16
3709B77J3%J11q7l1NLr9L3Q8j67M9j17P9l9N1K83k39K76l22M5J54l8l20L08j96k0J8J84j92
3561A10J95j75L02k88K69j99J08k33K16k21P6lj10J01K3M2P0m2J61k03NK39j27j84M9j63K51
$$ plain form
3428 269 130 47 236 74 352 202 255 231 347 255 272 232 174 125 100 237 106 142 251 275 158 266 356 149 411 268 172 239
3291 239 16 174 66 237 103 155 169 301 290 397 380 112 204 185 262 285 150 30 246 150 201 121 300 180 328 176 274
3158 274 387 175 309 131 204 402 958 1207 1073 374 299 1021 767 416 300 323 297 186 372 100 128 15 116 275 228
3035 228 205 531 756 104 287 112 320 314 1106 908 685 152 113 116 174 231 203 359 307 418 136 342 193 590 176 162 270
2902 270 80 372 562 608 907 352 216 288 83 447 237 153 151 200 147 104 34 236 252 268 179 416 213 277 327 295 197 189 228 103
2754 103 242 182 346 60 277 298 102 512 141 473 402 97 365 164 125 178 199 78 449 747 1000 1159 460 458 292 304
2626 304 285 222 212 263 193 349 34 18 321 389 205 216 366 312 330 283 400 189 230 318 173 224 5 492 260 223 211 296 389
2483 389 337 302 273 347 146 252 141 343 78 77 565 111 473 449 397 333 221 432 337 69 289 103 546 247 218 261 322 375
$$ packed form
3428B69j39q3J89j62K78j50N3k4J16r2J7m0n8m9k5J37j31L6J09K4j17J08R0k07K62j43r6O7
3291B39k23J58j08J71j34N2J4J32j1J07j7k68R2j9P7K3j35j20K16r6N1q0J79j20J48j52R8
3158B74J13k12J34j78P3J98N56K49j34o99p5P22k54l51j16K3k6j11J86k72K8j13J01J59m7
3035B28k3L26K25o52J83j75K08oP92j98k23n33l9LN8N7k8J56n2J11k82K06j49L97m14j4J08
2902B70j90K92J90M6K99n55j36P2k05L64k10q4kM9n3m3p0K02J6J6q9K37k03O4N0l2r8qL9j25
2754A03J39o0J64k86K17K1j96M10l71L32p1l05K68k01l9N3K1j21L71K98K53J59o99kj66J2
2626C04j9o3j0N1p0J56l15j6L03O8j84J1J50n4J8m7J17k11M1Q8j45N1k19M87k32l7j2Q5R3
2483C89n2l5k9P4k01J06j11K02k65jM88m54L62k4n2o4j12K11r5k68K20j86M43k99k9M3O1N3
$$ plain form
2346 375 315 395 391 287 409 362 100 592 301 143 301 299 179 390 322 517 258 479 373 369 400 357 188 436 262 427 234
2213 234 243 333 438 422 369 409 477 401 321 443 270 336 329 382 357 362 349 412 489 401 599 225 443 608 378 349 456 491 181 348 394
2060 394 357 469 368 473 600 388 574 348 480 1095 2094 3000 582 189 637 492 373 609 622 466 735 609 606 241
1942 241 808 525 454 643 342 482 552 607 529 565 710 461 647 745 827 537 813 405 857 544 450 787 574 836 600 739
1814 739 775 729 793 891 799 905 685 930 722 842 864 793 757 972 822 972 1127 932 1092 1005 1248 948 1000 1201 1180 1026 1144
1681 1144 1139 1059 1208 1152 1374 1201 1496 1552 1736 1608 1662 1624 1793 1630 1840 1495 1826 1803 1901 1790 2383 2329 2648 2896 3212 3416
1553 3416 3599 3774 3843 4190 4303 4968 6604 9731 4187 16001 20021 33954 31311 48078 99088 712244 1470378
1469 1470378 390937 94460 46147 28882 19579 14395 10564 8145 5557 4269 3111 2668 2410 2663 3129 2978
$$ packed form
2346C75o0Q0mj04J22m7k62M92k91j58J58kj20K11o8J95k59K21j06mL1m3j69K48j74J65j93
2213B34RR0J05j6n3M0O8p6q0J22j73O6pN3k5Nj3O3P7q8J98l74K18J65k30k9J07L5l10J67M6
2060C94l7J12j01J05J27k12J86k26J32O15R99R06k418l93M48j45j19K36J3j56K69j26ll65
1942B41N67k83p1J89l01J40P0N5p8L6J45k49J86R8Q2k90K76m08M52l13r4L37k13K62k36J39
1814G39L6m6O4R8r2J06k20K45k08J20K2p1l6K15j50J50J55j95J60q7K43l00N2K01k1j54J18
1681A144nq0J49n6K22j73K95N6J84j28N4l8J69j63K10l45L31k3R8j11N93n4L19K48L16K04
1553C416J83J75O9L47J13O65J636L127n544J1814M020J3933k643J6767N1010O13156P58134
1469A470378j079441k96477m8313j7265r303n184l831k419k588j288j158m43k58K53M66j51
$$ plain form
1391 2978 3093 3187 3260 2920 2752 2508 2182 2117 1931 1588 1496 1608 1509 1598 1566 1697 1552 1725 1472 1413 1430 1229 1268 1212 974 1277 760
1258 760 1112 1168 1042 1140 1155 1010 1181 1003 979 748 850 879 849 777 721 883 727 703 1092 862 650 986 697 756 685 821 452
1125 452 665 516 870 528 676 909 751 738 689 610 663 641 543 483 599 446 591 302 547 546 580 702 553 583 636 727 283 476
987 476 524 380 365 492 346 422 590 473 483 680 413 580 564 439 398 336 523 207 431 335 376 289 523 559 413 509 539 456
849 456 324 434 447 140 331 217 359 400 365 314 386 542 577 331 548 404 235 250 321 192 217 222 302 419 508 513 394 503 331
706 331 515 384 368 173 212 268 162 328 147 154 368 566 319 397 271 309 491 233 284 50 330 154 124 267 411 530 202
574 202 524 359 563 334 371 166 273 240 294 1302 4193 35556 44714 7995 40331 39096 5730 1350 182 272
475 272 342 518 532 183 265 388 256 475 457 439 391 461 418 509 290 456 248 433 270 107 271 153 300 230 321 442 299
$$ packed form
1391B978J15R4P3l40j68k44l26o5j86l43r2J12r9Q9l2J31j45J73k53n9J7k01L9n6k38L03n17
1258G60L52N6j26R8J5j45J71j78k4k31J02K9l0p2n6J62j56k4L89k30k12L36k89N9p1J36l69
1125D52K13j49L54l42J48K33j58j3m9p9N3k2r8o0J16j53J45k89K45jL4J22j49L0N3R1m44J93
987D76M8j44j5J27j46P6J68j17J0J97k67J67j6j25m1o2J87l16K24r6M1q7K34L6j46R6L0q3
849D56j32J10J3l07J91j14J42M1l5n1P2J56L5k46K17j44j69J5P1j29K5NQ0J17Q9Nj19J09j72
706C31J84j31j6j95L9N6j06J66j81PK14J98k47P8j26L8J82k58N1k34K80j76l0J43J44J19l28
574B02L22j65K04k29L7k05J07l3N4J008K891L1363R158l6719L2336j235l3366m380j168R0
475B72P0J76J4l49Q2J23j32K19j8j8m8P0m3R1k19J66k08J85j63j63J64j18J47p0R1J21j43
$$ plain form
342 299 489 343 432 433 364 210 113 157 262 116 327 247 295 261 227 460 409 419 343 432 371 172 329 48 211 235 112 282 339
199 339 332 428 368 302 442 244 481 94 291 71 158 122 254 242 243 466 264 355 441 373 219 241 287 255 175 141 201 311 133 394
52 394 124 319 416 405 513 299 265 424 282 149 145 95 80 180 289 286 454 276 394 457 465 234 353 336 116 101 286 157 223
-91 223 277 172 386 419 465 393 332 335 319 508 162 75 190 293 142 145 569 197 531 288 554 333 440 382 167 368 265 85
-229 85 148 95 355 292 417 334 407 414 740 256 350 560 119 389 208 191 153 211 253 422 462 287 604 696 436 489 287 643 468
-371 468 241 406 278 253 266 418 472 548 535 795 719 606 687 592 564 490 347 501 399 470 720 536 685 617 719 846 790 839
-509 839 829
$$ packed form
342B99J90j46Q9Jo9j54r7M4J05j46K11q0M8l4l4K33n1J0p6Q9o1j99J57k81J63K4j23J70N7
199C39pR6o0o6J40j98K37l87J97k20Q7l6J32j2JK23k02R1Q6o8j54K2M6l2q0l4O0J10j78K61
52C94k70J95R7j1J08k14l4J59j42j33mn0j5J00J09lJ68j78J18O3Qk31J19j7k20j5J85j29O6
-91B23N4j05K14L3M6p2o1Lj6J89l46q7J15J03j51LM24l72L34k43K66k21J07n8k15K01j03j80
-229H5O3n3K60o3J25q3P3PL26m84R4K10m41K70j81j7l8N8M2J69M0j75L17R2k60N3k02L56j75
-371D68k27J65j28k5J3J52N4P6j3K60p6j13Q1r5k8p4j43J54j02P1K50j84J49o8J02J27n6M9
-509H39j0
-514H29
##PAGE=	F1=-1582.36
##FIRST=	4521.1594499999982872,	4521.1594499999982872,	0
##DATA TABLE=	(F2++(Y..Y)), PROFILE
$$ plain form
4521 804 933 585 748 529 730 569 519 621 564 773 785 563 1011 643 800 746 827 523 577 448 524 310 430 261 380 617
4393 617 552 558 615 659 575 656 363 465 548 194 375 115 293 296 418 275 486 606 421 659 338 544 511 275 387 286 4
4260 4 102 345 288 402 150 681 397 569 440 369 379 281 180 525 212 223 241 283 336 372 282 458 475 411 379 418 280 301 247 107
4113 107 261 128 152 170 325 512 252 405 453 339 404 562 55 327 207 84 150 118 320 302 273 264 340 561 461 241 338
3980 338 354 177 183 62 100 184 105 268 200 330 346 368 350 346 404 193 275 163 252 242 52 133 304 432 228 144 388 512 284
3837 284 328 225 306 195 144 201 79 399 235 281 193 499 210 483 296 355 210 180 353 244 57 242 204 109 125 302 278
3704 278 301 435 296 316 282 349 227 232 306 138 197 92 125 162 205 450 204 532 220 235 333 315 69 307 168 93 156 300 125
3561 125 297 161 419 184 438 246 331 95 320 98 150 112 93 147 164 216 290 254 432 218 225 470 354 137 162 24 259
$$ packed form
4521H04J29l48J63k19K01j61n0J02n7K09J2k22M48l68J57n4Q1l04N4j29P6k14J20j69J19K37
4393F17o5ON7M4q4Q1k93J02Q3l54J81k60J78LJ22j43K11J20j85K38l21K06l3k36J12j01k82
4260DR8K43n7J14k52N31k84J72j29p1J0r8j01L45l13J1J8M2N3L6r0J76J7o4l2L9j38K1n4j40
4113A07J54j33K4J8J55J87k60J53M8j14O5J58n07K72j20j23O6l2K02j8k9rP6K21j00k20R7
3980C38J6j77Oj21L8Q4p9J63o8J30J6K2j8mN8k11Q2j12Q9j0j90Q1J71J28k04q4K44J24k28
3837B84M4j03Q1j11n1N7j22L20j64M6q8L06k89K73j87N9j45l0J73j09j87J85l8r5J6J77k4
3704B78K3J34j39K0l4O7j22NP4j68N9j05L3L7M3K45k46L28l12J5R8j8k46K38j39p5O3J44j75
3561A25J72j36K58k35K54j92Q5k36K25k22N2l8j9N4J7N2P4l6J78k14PK45j16k17K5j38K35
$$ plain form
3428 259 139 70 228 74 358 209 272 277 333 258 341 271 162 136 122 203 102 138 297 285 154 311 386 153 380 288 202 233 29
3286 29 232 47 230 117 145 189 321 262 408 453 91 254 169 289 317 136 31 221 162 206 116 333 185 337 194 278 423
3153 423 219 291 166 191 398 852 1037 959 259 275 1105 937 531 330 326 315 197 382 120 147 47 148 256 210 230 536 671
3020 671 149 343 122 311 318 1126 873 616 72 149 105 163 229 208 379 262 469 158 329 209 699 203 201 283 90 308 530
2887 530 622 983 317 254 306 89 482 276 116 187 211 131 123 21 214 330 235 209 439 234 316 318 315 239 173 248 95 236 152 375
2739 375 60 299 325 127 489 186 484 467 83 354 151 101 155 204 41 454 539 958 1253 436 482 314 330 277 242 227 282
2606 282 204 332 30 14 306 393 236 254 362 320 386 294 381 202 246 279 173 222 8 506 255 260 226 309 375 378 320 282 379 133
2459 133 254 144 340 116 44 542 151 465 455 407 328 267 441 361 76 252 136 537 244 257 258 336 359 346 431 414 281 385
$$ packed form
3428B59j20o9J58j54K84j49O3NN6p5Q3p0j09k6j4Q1j01L6J59j2j31J57P5k33K27r2q6L1k04
3286B9K03j85J83j13K8M4J32n9J46M5l62J63q5J20K8j81j05J90n9M4r0K17j48J52j43Q4J45
3153D23k04P2j25K5K07M54J85p8p00J6Q30j68m06k01mj1j18J85k62K7j00J01J08m6K0L06J35
3020F71n22J94k21J89PQ08k53k57n44P7m4N8O6k1J71j17K07l11J71j20M90m96kQ2j93K18K22
2887E30R2L61o66o3N2k17L93k06j60P1K4q0qj02J93J16r5k6K30k05Q2Klp6o6P5j53J41q4K23
2739C75l15K39K6j98L62l03K98j7l84K71k03n0N4M9j63M13Q5M19K95q17M6j68J6n3l5j5N5
2606B82p8J28l02j6K92Q7j57J8J08m2O6r2Q7j79M4L3j06M9k14M98k51Nl4Q3O6Ln8l8R7k46
2459A33J21j10J96k24p2M98l91L14j0m8p9o1J74q0k85J76j16M01k93J3JP8K3j3Q5j7j33J04
$$ plain form
2321 385 408 129 603 267 139 316 318 191 394 298 535 271 508 398 382 398 435 142 426 264 449 193 267 338 439 438 409
2188 409 418 474 412 347 501 251 374 314 384 358 356 362 437 470 438 648 223 489 621 411 342 455 518 202 317 442 352 484 390 479
2040 479 628 403 612 340 458 1152 2211 2929 752 245 670 535 413 575 664 482 799 652 625 286 856 527 456 689
1922 689 351 495 597 587 598 575 720 478 719 778 830 568 829 438 860 577 435 829 596 872 640 747 796 740 850 947
1794 947 844 913 754 908 760 911 871 788 808 969 842 1014 1191 926 1166 1015 1327 1007 1058 1197 1232 1081 1165 1139 1115 1218
1666 1218 1214 1390 1240 1581 1600 1846 1663 1731 1775 1842 1715 1930 1522 1858 1834 1909 1823 2434 2402 2781 3066 3500 3674 3911 4140 4260
1538 4260 4458 4465 4686 5601 6622 1976 7784 16558 27133 28321 46746 103724 737541 1529191 409743 99278
1460 99278 48694 30586 20885 15109 10966 8543 5712 4367 3092 2779 2518 2656 3338 3142 3222 3311 3453 3066 2859 2631
$$ packed form
2321C85K3k79M74l36j28J77Kj27K03r6K37k64K37j10j6J6L7k93K84j62J85k56P4P1J01jk9
2188D09RN6o2o5J54k50J23o0P0k6kOP5L3l2K10m25K66J32k10o9J13O3l16J15J25r0J32r4Q9
2040D79J49k25K09k72J18O94J059P18k177n07M25j35j22J62Q9j82L17j47k7l39N70l29p1K33
1922F89l38J44J02j0J1k3J45k42K41N9N2k62K61l91M22k83j42L94k33K76k32J07M9n6J10R7
1794I47j03O9j59J54j48J51m0q3K0J61j27J72J77k65K40j51L12l20N1J39L5j51Q4k6k4J03
1666A218mJ76j50L41J9K46j83O8M4O7j27K15m08L36k4P5q6O11l2L79K85M34J74K37K29J20
1538D260J98PK21R15J021m646N808Q774J0575J188J8425N6978O33817P91650j119448l10465
1460I9278n0584j8108r701n776m143k423k831j345j275l13k61J38O82j96Q0Q9J42l87k07k28
$$ plain form
1361 2631 2290 2191 1966 1658 1519 1664 1537 1696 1594 1758 1655 1803 1525 1498 1501 1305 1291 1231 992 1316 814 1154 1218 1104 1186 1211
1233 1211 1054 1233 1025 1043 750 915 892 912 748 811 912 756 717 1162 893 696 1014 775 772 726 874 451 658 539 941 603
1105 603 671 927 788 802 700 646 712 680 504 568 598 441 620 340 589 556 616 701 625 648 644 773 330 474 537 392 367 484 354
962 354 467 624 487 510 726 475 634 569 465 422 360 534 231 429 369 381 340 556 586 437 538 558 463 388 466 467 173 352
825 352 238 344 445 404 345 361 606 638 356 567 470 248 288 305 165 217 245 271 459 525 539 453 481 341 565 464 380 176 247
682 247 257 177 331 138 166 447 565 332 441 281 356 522 210 393 52 330 147 122 265 422 468 201 483 388 529 332
554 332 426 165 351 256 196 874 2595 22085 27886 4999 24522 24340 3635 798 55 348 344 525 432 144 251 272
446 272 200 390 425 414 367 474 424 514 280 436 307 339 301 48 263 122 318 241 318 500 252 477 384 456 459 352 219 123 166
$$ packed form
1361B631l41r9k25l08j39J45j27J59j02J64j03J48k78k7Lj96j4o0k39L24n02L40O4j14Q2K5
1233A211j57J79k08J8k93J65k3K0j64O3J01j56l9M45k69j97L18k39lm6J48m23K07j19M02l38
1105F03O8K56j39J4j02n4O6l2j76O4L0j57J79k80K49l3O0Q5p6K3mJ29m43J44O3j45k5J17j30
962C54J13J57j37K3K16k51J59o5j04m3o2J74l03J98o0J2m1K16L0j49J01K0r5p5P8Jk94J79
825C52j14J06J01m1n9J6K45L2k82K11r7k22M0J7j40N2K8K6J88O6J4q6K8j40K24j01q4k04P1
682B47J0q0J54j93K8K81J18k33J09j60P5J66l12J83l41K78j83k5J43J57M6k67K82r5J41j97
554C32R4k61J86r5o0O78J721J9490N801k2887J9523j82k0705k837p43K93mJ81r3k88J07K1
446B72p2J90L5j1m7J07n0R0k34J56j29L2l8k53K15j41J96p7P7J82k48K25r3P2Lj07j33r6M3
$$ plain form
303 166 202 124 299 254 288 248 249 510 424 440 324 427 371 165 309 16 206 225 124 297 359 372 389 417 287 480 263 477 99
160 99 308 46 150 82 244 268 239 511 276 372 503 389 250 256 286 291 162 133 184 303 138 433 125 366 437 421 539 318
22 318 294 415 265 158 129 84 55 172 308 306 481 296 405 453 544 248 376 369 126 117 259 154 233 337 182 426 462 485 460
-120 460 355 364 312 557 173 110 214 308 175 153 569 281 540 318 620 366 436 450 196 426 287 85 205 151 364 336 446
-253 446 368 479 422 774 290 399 621 131 453 232 197 139 272 284 464 562 304 655 726 457 541 378 640 464 304 427
-381 427 338 290 316 458 551 573 607 858 794 695 755 628 630 564 420 581 443 568 756 601 796 705 797 954 841 930 929
$$ packed form
303A66L6p8J75m5L4m0JK61q6J6j16J03n6k06J44k93J90J9j01J73O2J3J7K8j30J93k17K14l78
160I9K09k62J04o8J62K4k9K72k35R6J31j14j39OL0Nj29k9N1J19j65K95l08K41P1j6J18k21
22C18k4J21j50j07k9m5k9J17J36kJ75j85J09M8R1k96J28pk43rJ42j05P9J04j55K44L6K3k5
-120D60j05Rn2K45l84o3J04R4j33k2M16k88K59k22L02k54P0J4k54K30j39k02J20n4K13k8J10
-253D46p8J11n7L52m84J09K22m90L22k21l5n8J33J2J80R8k58L51P1k69Q4j63K62j76j60J23
-381D27q9m8K6J42R3K2L4K51o4r9O0j27Ko6j44J61j38J25J88j55J95r1R2J57j13Q9j
-514I29
##PAGE=	F1=-1592.2
##FIRST=	4521.1594499999982872,	4521.1594499999982872,	0
##DATA TABLE=	(F2++(Y..Y)), PROFILE
$$ plain form
4521 803 963 549 766 544 734 593 550 633 566 791 796 557 1019 640 761 762 811 548 564 476 513 290 445 280 400 640 539
4388 539 558 637 603 592 643 395 387 583 179 392 125 325 283 419 287 517 569 418 698 332 500 534 286 410 229 55 109
4255 109 350 307 391 183 634 421 537 448 377 353 252 191 515 223 194 237 281 353 336 322 445 458 415 356 398 280 284 258 157 278
4108 278 100 148 150 330 492 256 380 425 355 400 533 60 327 188 96 162 119 324 319 244 277 320 554 450 231 371 337 160
3970 160 136 90 110 191 97 286 205 334 334 353 352 372 392 178 302 151 218 245 22 147 338 429 191 183 375 468 313 322 259 247 191
3817 191 134 207 59 399 225 264 210 505 180 471 296 349 225 191 338 273 41 220 164 117 172 312 260 268 439 248 322 251
3679 251 383 250 211 283 115 192 95 91 190 226 400 172 537 248 243 286 271 129 273 207 138 195 279 139 266 173 386 204 428
3537 428 256 314 93 329 97 150 67 134 155 169 203 274 246 414 222 223 455 376 123 141 46 237 138 87 202 71 353 200 261
$$ packed form
4521H03J60m14K17k22J90j41m3Q3o7K25Nk39M62l79J21JM9k63J6q8L7k23J55j65J20K40j01
4388E39J9P9l4j1N1k48qJ96m04K13k67K00m2J36j32K30N2j51K80l66J68L4k48J24j81j74N4
4255A09K41m3Q4k08M51k13J16q9p1k4j01o1L24k92k9M3M4P2j7j4J23J3m3n9M2j18Mk6j01J21
4108B78j78M8KJ80J62k36J24M5p0M5J33m73K67j39r2O6m3K05np5L3M3K34j04k19J40l4j77
3970A60k4m6K0Q1r4J89q1J29%J9jK0K0k14J24j51O7K7k23J25J91R1k38qJ92R3j55Ro3j2n6
3817A91n7P3j48L40j74L9n4K95l25K91j75N3j24l4J47o5k32J79n6m7N5J40n2QJ71j91P4p1
3679B51J32j33l9P2j68P7r7mR9L6J74k28L65k89nM3j5j42J44o6o9N7Q4j40J27r3K13j82K24
3537D28j72N8k21K36k32N3q3O7K1J4L4P1k8J68j92JK32p9k53J8r5J91r9n1J15j31K82j53O1
$$ plain form
3394 261 296 302 242 379 286 134 152 155 166 91 127 334 285 120 343 385 145 318 287 204 208 47 265 74 211 128 140 200 315 220
3246 220 389 495 55 270 153 284 331 110 68 186 161 205 103 347 165 320 191 263 437 226 256 191 152 388 705 830
3118 830 810 153 242 1172 1110 634 340 303 314 190 370 115 157 79 172 228 175 241 525 570 185 366 127 278 296 1101 848 568
2981 568 61 176 90 144 217 192 363 199 477 160 289 220 751 220 233 269 117 247 465 554 971 226 275 300 95 475 291
2848 291 70 214 218 106 130 25 192 383 200 205 445 225 334 287 295 261 148 248 97 211 118 379 78 303 315 141 437
2715 437 219 451 499 65 312 128 74 139 185 29 441 362 934 1239 398 461 324 326 256 233 239 267 208 297 27 42 289 352 251
2572 251 275 328 314 411 267 353 192 241 229 165 200 20 476 234 274 217 303 322 394 308 263 377 114 238 127 324 149 38 475
2429 475 183 420 431 377 304 288 409 366 73 205 148 496 221 284 233 325 332 333 432 413 250 322 424 158 575 207 128 306 319
$$ packed form
3394B61L5Oo0J37r3j52J8LJ1p5L6K07m9j65K23M2k40J73l1q3Mj61K18j91J37q3J2O0J15r5
3246B20J69J06m40K15j17J31M7k21m2J18k5M4j02K44j82J55j29P2J74k11L0o5l9K36L17J25
3118H30k0o57Q9R30o2m76k94l7J1j24J80k55M2p8R3N6n3O6K84M5l85J81k39J51J8Q05k53k80
2981E68n07J15q6N4P3k5J71j64K78l17J29o9N31n31J3L6j52J30K18Q9M17p45M9K5k05L80j84
2848B91k21J44Mj12K4j05J67J91j83NK40k20J09m7Ql4j13J00j51J14r3K61l01K25J2j74K96
2715D37k18K32M8m34K47j84n4O5M6j56M12p9N72L05q41O3j37Kp0k3OK8n9Q9k70J5K47O3j01
2572B51K4N3j4R7j44Q6j61M9j2o4L5j80M56k42M0n7Q6J9P2q6m5J14k63J24j11J97j75j11M37
2429D75k92K37J1n4p3j6J21m3k93J32n7L48k75O3n1R2PJR9j9j63P2J02k66M17l68p9J78J3
$$ plain form
2286 319 190 374 253 512 261 485 392 357 365 475 83 385 257 427 137 274 315 409 422 408 396 425 393 333 522 195 389
2154 389 281 351 332 335 351 423 416 429 649 195 483 598 394 305 420 512 198 263 456 330 450 389 449 603 378 617 293 392
2016 392 1133 2080 2500 944 294 673 538 424 485 650 453 800 646 582 300 845 491 410 681 325 470 591 529 619 535
1893 535 672 448 726 754 772 548 780 427 805 557 390 809 557 850 628 695 753 678 850 920 825 850 743 811 734 906 804
1760 804 737 782 885 810 958 1155 851 1151 937 1302 972 1022 1087 1188 1036 1095 1036 1077 1132 1175 1293 1180 1536 1520 1803 1570 1644
1627 1644 1768 1728 1650 1850 1413 1747 1719 1779 1716 2308 2299 2681 2974 3464 3582 3836 4067 4243 4291 4226 4085 4430 3813 1894 5621
1504 5621 12852 21226 24350 42877 99757 700037 1458477 393870 95593 47113 29734 20515 14540 10395
1435 10395 7913 5372 4126 2830 2680 2421 2473 3231 3043 3097 3120 3350 2954 2705 2528 2190 2089 1837 1578 1430 1586 1436
$$ packed form
2286C19j29J84j21K59k51K24r3l5QJ10l92L02j28J70k90J37M1R4J3j4j2K9l2o0J89l27J94
2154C89j08P0j9LJ6P2pJ3K20m54K88J15k04q9J15R2l14O5J93j26J20o1O0J54k25K39l24R9
2016C92P41R47M20j556o50L79j35j14O1J65j97L47j54o4k82N45l54q1K71l56J45J21o2R0q4
1893E35J37k24K78K8J8k24K32l53L78k48j67M19k52K93k22O7N8p5J72P0r5K5j07O8p7J72j02
1760H04o7M5J03p5J48J97l04L00k14L65l30N0O5J01j52N9n9M1N5M3J18j13L56j6K83k33P4
1627A644J24m0p8K00m37L34k8O0o3N92rL82K93M90J18K54K31J76M8o5j41L45o17j919L727
1504E621P231Q374L124J8527N6880O00280P58440j064607k98277m8480j7379r219n975m145
1435A0395k482k541j246j296j50k59N2P58j88N4K3K30l96k49j77l38j01k52k59j48J56j50
$$ plain form
1327 1436 1646 1496 1666 1621 1723 1446 1453 1434 1266 1205 1154 922 1261 802 1097 1153 1081 1134 1165 998 1181 957 1020 670 914 824 903
1194 903 653 833 876 709 667 1134 843 676 960 787 712 702 854 414 609 515 935 627 622 866 756 795 651 612 698 668 418
1061 418 598 559 402 594 345 581 518 600 633 653 660 580 773 339 436 525 354 345 436 336 478 621 455 495 717 484 636 518
923 518 459 400 353 505 232 390 373 359 358 554 551 424 522 532 422 426 451 459 188 357 240 326 448 412 341 302 620 641 335 547 487
770 487 243 292 266 126 208 237 226 466 500 524 477 435 317 560 497 357 162 261 209 191 310 124 166 482 519 331 448 266 357
628 357 500 176 465 51 298 163 120 248 406 387 216 424 416 469 296 458 161 381 255 171 536 1309 11195 14112 2736
505 2736 11725 12235 1936 414 217 380 327 486 331 114 223 190 161 306 382 378 333 450 405 476 254 384 344 232 328 27
377 27 239 90 316 251 297 525 190 427 402 438 450 312 209 128 166 143 145 252 241 264 206 262 523 404 415 275 396 343 165
$$ packed form
1327A436K10j50J70m5J02k77Pj9j68o1n1k32L39m59K95N6p2N3L1j67J83k24O3l50K44r0P9
1194I03k50J80M3j67m2M67k91j67K84j73p5j0J52m40J95r4M20l08nK44j10L9j44l9Q6l0k50
1061D18J80l9j57J92k49K36o3Q2L3K0Pq0J93m34R7Q9j71rR1j00J42J43j66M0K22k33J52j18
923E18n9n9m7J52k73J58j7j4jJ96lj27R8J0j10MK5Qk71J69j17Q6J22l6p1l9L18K1l06K12o0
770D87k44M9k6j40Q2K9j1K40L4K4m7m2j18K43o3j40j95R9n2j8J19j86M2L16L7j88J17j82R1
628C57J43l24K89m14K47j35m3J28J58j9j71K08qN3j73J62k97K20j26q4L65P73R886K917j1376
505B736Q989N10j0299j522j97J63n3J59j55k17J09l3k9J45P6mm5J17m5P1k22J30m0j12R6l01
377B7K12j49K26o5M6K28l35K37k5L6J2j38j03q1L8k3KJ07j1K3n8N6K61j19J1j40J21n3j78
$$ plain form
234 165 273 11 192 206 138 284 363 380 325 418 253 474 261 440 94 315 22 134 41 211 286 230 522 256 356 519 385
101 385 263 253 263 292 142 117 158 281 124 451 112 380 417 410 523 305 305 374 221 174 104 107 37 151 322 300 468 289 379 410
-47 410 578 248 366 377 105 111 229 152 218 356 185 433 474 442 489 345 364 260 563 185 133 224 294 208 161 540 338 502
-184 502 316 628 361 403 466 202 450 285 76 232 181 350 356 430 367 510 388 740 295 401 626 128 483 229 205 168
-312 168 304 289 473 605 292 642 695 436 537 419 588 415 338 414 354 311 325 456 573 549 602 867 794 716 748 593 627 585
-450 585 444 600 430 610 726 599 838 722 784 978 803 932 932
$$ packed form
234A65J08k62J81J4o8J46P9J7n5R3j65K21k13J79l46K21k93J12r3J70P5n6K92k66J00J63j34
101C85j22j0J0K9j50k5M1J23j57L27l39K68L7pJ13k18%O9j53m7p0Lp0J14J71k2J68j79R0L1
-47D10J68l30J18J1k72OJ18p7O6J38j71K48M1l2M7j44J9j04L03l78n2R1P0q6m7L79k02J64
-184E02j86L12k67M2O3k64K48j65k09J56n1J69OP4o3J43j22L52m45J06K25m98L55k54k4l7
-312A68J36j5J84J32l13L50N3k59J01j18J69j73p7P6o0m3J4J31J17k4N3K65p3p8L2j55L4m2
-450E85j41J56j70J80J16j27K39j16O2J94j75J29%
-514I32
##PAGE=	F1=-1602.04
##FIRST=	4521.1594499999982872,	4521.1594499999982872,	0
##DATA TABLE=	(F2++(Y..Y)), PROFILE
$$ plain form
4521 726 900 445 711 491 679 549 521 582 514 731 732 492 936 577 643 720 707 520 489 457 452 250 407 266 374 615 467
4388 467 498 613 486 548 580 375 283 574 132 364 122 329 237 386 264 506 492 373 671 299 414 512 279 389 163 96
4260 96 110 326 303 345 197 543 413 455 416 360 298 190 187 473 225 155 221 258 337 273 346 386 391 401 291 335 255 245 251 199 262 67
4103 67 140 121 302 442 240 320 355 348 363 457 72 309 163 99 169 100 297 319 189 270 290 496 414 194 374 295 133 76 121 110
3955 110 176 101 289 186 320 304 316 331 361 349 143 296 140 185 238 7 161 359 387 134 216 328 397 305 292 265 172 167 130 197
3807 197 60 375 202 246 210 472 135 425 271 312 219 182 300 283 30 189 124 117 200 303 238 195 418 175 300 197 390
3675 390 262 174 249 80 182 90 58 196 225 315 126 500 250 237 229 206 182 220 230 185 225 244 143 218 165 340 201 385 244
3532 244 272 95 325 90 166 81 170 153 178 172 242 219 351 210 203 398 379 94 124 63 208 128 102 159 69 330 177 224 287 262 209
$$ packed form
4521G26J74m55K66k20J88j30k8O1o8K17Jk40M44l59O6P7j3j87l1l2nk02J57j41J08K41j48
4388D67L1J15j27O2L2k05r2K91m42K32k42K07r2J49j22K42j4j19K98l72J15R8k33J10k26o7
4260I6J4K16k3M2j48L46j30M2l9n6o2j08lK86k48p0O6L7P9o4P3M0NJ0j10M4q0j0On2O3j95
4103F7P3j9J81J40k02Q0L5pJ5R4l85K37j46o4P0o9J97K2j30Q1K0K06q2k20J80p9j62n7M5j1
3955A10O6p5J88j03J34j6J2J5L0j2k06J53j56M5N3k31J54J98K8k53Q2J12O9r2j3k7r3nl7O7
3807A97j37L15j73M4l6K62l37K90j54M1r3l7J18j7k53J59o5pQ3J03o5m3K23k43J25j03J93
3675C90j28q8P5j69J02r2l2J38K9R0j89L74k50j3qk3k4L8J0m5M0J9j01P5n3J75j39J84j41
3532B44K8j77K30k35P6q5Q9j7K5oP0k3J32j41pJ95j9k85L0o1J45q0k6N7r0K61j53M7O3k5n3
$$ plain form
3379 209 386 275 99 164 192 142 74 112 353 277 59 358 354 127 237 261 180 167 62 274 110 180 139 148 197 286 177 343 505
3236 505 41 254 137 245 324 83 92 141 145 194 91 338 129 278 170 237 428 201 207 204 93 370 546 620 649 124 195 1203
3099 1203 1253 703 326 255 299 164 338 87 157 108 183 191 125 247 493 470 200 353 122 227 249 1034 831 555 92 192 76
2966 76 133 199 162 313 131 441 142 235 224 752 226 257 231 139 208 386 406 885 123 280 269 109 426 285 33 226 223 83
2828 83 126 46 172 407 179 172 434 183 329 241 244 258 125 228 104 172 86 356 95 287 272 142 365 235 384 492 45
2695 45 242 101 51 130 147 64 408 250 892 1114 337 401 315 290 229 200 244 223 201 259 37 65 269 275 247 273 272 297 407 211 316
2542 316 166 215 184 151 164 35 407 198 263 187 279 236 385 272 221 339 94 211 96 296 173 37 376 203 344 382 312
2410 312 263 284 344 351 64 153 138 427 185 292 189 296 303 273 405 387 202 231 409 185 509 131 109 275 298 175 329 194
$$ packed form
3379B09J77j11j76O5K8n0o8L8K41p6k18K99mk27J10K4q1j3j05K12j64P0m1RM9Q9j09J66J62
3236E05m64K13j17J08P9k41RM9MM9j03K47k09J49j08O7J91k27Olj11K77J76P4K9n25P1J008
3099A203N0n50l77p1M4j35J74k51P0m9P5Qo6J22K46k3k70J53k31J05K2P85k03k76m63J00j16
2966G6N7O6l7J51j82L10k99R3j1N28n26L1k6r2O9J78K0M79p62J57j1j60L17j41k52J93lj40
2828H3M3q0J26K35k28pK62k51J46q8LJ4j33J03j24O8q6K70k61J92j5j30K23j30J49J08m47
2695D5J97j41n0P9J7q3L44j58O42K22p77O4q6k5o1k9M4k1k2N8k22K8K04Ok8K6jK5J10j96J05
2542C16j50M9l1l3J3j29L72k09O5p6R2m3J49j13n1J18k45J17j15K00j23j36L39j73J41L8p0
2410C12m9K1O0Pk87Q9j5K89k42J07j03J07Pl0J32j8j85K9J78k24L24l78k2J66K3j23J54j35
$$ plain form
2272 194 452 231 417 356 299 312 471 20 319 240 363 79 263 265 355 377 365 350 338 350 286 499 115 380 234 289 279 302 317
2129 317 368 335 373 605 144 428 542 335 247 354 475 172 196 435 295 380 359 388 536 317 587 229 297 1047 1778 1946
2001 1946 1183 315 644 496 402 353 583 384 738 597 483 284 778 424 325 623 270 412 538 439 591 448 575 374
1883 374 667 676 662 482 675 371 699 485 318 732 464 770 572 592 649 555 795 820 749 727 656 659 651 823 677 646 684 735 729 818
1735 818 1029 712 1052 785 1180 846 902 887 1061 900 948 848 952 964 1043 1098 1033 1368 1326 1617 1346 1418 1607 1473 1452 1610 1191
1602 1191 1511 1480 1529 1488 2020 2028 2361 2637 3110 3167 3396 3606 3805 3732 3621 3236 3197 1556 2703 7373 9206 15822 19767 36717
1484 36717 87816 606558 1271157 346231 84111 41703 26509 18577 12832 8973 6250 4655 3638 2403
1415 2403 2385 2124 2162 2787 2700 2737 2654 2974 2609 2322 2223 1905 1832 1567 1362 1245 1388 1225 1458 1285 1440 1455 1502 1246 1288 1242 1123
$$ packed form
2272A94K58k21J86o1n7J3J59m51K99p9J23k84J84KR0K2j2j5j2J2o4K13l84K65j46N5j0K3J5
2129C17N1l3L8K32m61K84J14k07q8J07J21l03K4K39j40Q5k1K9J48k19K70l58O8P50P31J68
2001A946p63q68L29j48r4m9K30j99L54j41j14j99M94l54r9K98l53J42J26r9J52j43J27k01
1883C74K93Rj4j80J93l04L28k14j67M14k68L06j98K0N7r4K40K5p1k2p1LqJ72j46l1L8N1oQ9
1735H18K11l17L40k67L95l34N6j5J74j61M8j00J04J2P9N5o5L35m2K91k71P2J89j34k1J58m19
1602A191L20l1M9m1N32QL33K76M73N7K29K10J99p3j11l85l9j641J147M670J833O616L945J6950
1484C6717N1099N18742O64599r24926k62120m2408j5194p932n745l859k723j595j017j235
1415B403j8k61L8O25q7L7q3L20l65k87r9l18p3k65k05j17J43j63K33j73J55J5M7k56M2m6j19
$$ plain form
1282 1123 1026 995 779 1121 726 954 983 980 995 1024 856 1034 814 920 517 846 689 826 505 789 780 596 561 1014 721 596
1154 596 835 731 591 615 768 347 525 450 851 599 535 734 662 718 551 519 628 605 299 572 489 337 520 319 522 439
1026 439 539 510 631 615 458 729 314 373 489 272 302 354 295 450 589 381 440 660 439 591 415 426 339 316 445 213 319
894 319 346 313 339 515 461 375 463 469 342 431 395 423 181 346 222 312 411 385 306 221 585 587 273 492 458 222 266 208 80 191 203
741 203 168 437 437 473 457 367 267 506 480 304 138 252 133 198 270 100 149 471 434 313 414 226 316 434 133 484 45 241
603 241 187 110 217 359 297 229 345 416 388 231 452 156 366 233 190 310 480 3622 4419 1558 3048 3634 780 324 311
480 311 367 292 403 239 95 190 133 141 218 332 331 290 393 358 403 214 308 352 149 346 82 209 63 293 257 260 511 127 347
337 347 392 380 409 249 182 124 156 103 165 193 211 229 143 258 501 353 347 208 342 290 171 226 27 169 178 144 245 346 355 246 372
$$ packed form
1282A123r7l1k16L42l95K28K9lJ5K9j68J78k20J06m03L29j57J37l21K84rj84l5M53k93j25
1154E96K39j04j40K4J53m21J78p5M01k52o4J99p2N6j67l2J09k3l06K73q3j52J83k01K03q3
1026D39J00k9J21j6j57K71m15N9J16k17L0N2n9J55J39k08N9K20k21J52j76J1q7k3J29k32J06
894C19K7l3K6J76n4q6Q8Oj27Q9l6K8k42J65j24R0R9k6p9q5L64Kl14K19l4k36M4n8j28J11J2
741B03l5K69%L6j6r0j00K39k6j76j66J14j19O5P2j70M9L22l7j21J01j88R0J18l01L51m39J96
603B41n4p7J07J42o2o8J16P1k8j57K21k96K10j33m3J20J70L142P97k861J490N86k854m56j3
480C11N6p5J11j64j44R5n7QP7J14jm1J03l5M5j89R4M4k03J97k64J27j46K30l6LK51l84K20
337C47M5j2K9j60o7n8L2n3O2K8J8J8q6J15K43j48oj39J34n2j19N5j99J42Rl4J01J01Rj09J26
$$ plain form
185 372 205 428 246 375 73 311 29 110 35 162 293 214 499 207 311 493 364 261 234 221 264 122 93 123 246 96
57 96 443 84 361 359 376 474 262 294 306 174 184 74 137 35 122 337 268 415 254 321 337 566 234 328 360 54 80 188 144 181
-91 181 331 180 410 445 345 480 308 335 173 526 196 144 219 257 233 152 490 363 419 287 578 323 350 428 188 436 266
-224 266 57 230 186 312 344 371 332 495 317 647 270 356 580 121 477 202 216 218 309 266 449 588 251 567 608 379 477
-357 477 408 498 328 338 372 323 305 296 411 537 480 525 822 720 671 669 498 557 558 417 557 364 594 630 534 804 667 685 917 684
-504 684 850 843
$$ packed form
185C72j67K23j82J29l02K38k82Q1p5J27J31p9K85k92J04J82j29j03k7j3M3j42k9L0J23j50
57I6L47l59K77kJ7R8k12L2J2j32J0j10O3j02Q7K15o9J47j61O7J6K29l32R4L2l06K6J08m4L7
-91A81J50j51K30L5j00J35j72K7j62L53l30n2P5L8k4q1L38j27N6j32K91k55K7P8k40K48j70
-224B66k09J73m4J26L2K7l9J63j78L30l77Q6K24m59L56k75J4KR1m3J83J39l37L16M1k29R8
-357D77o9R0j70J0L4m9j8rJ15J26n7M5K97j02m9kj71N9Jj41J40j93K30L6r6K70j37J8K32k33
-504F84J66p
-514H43
##PAGE=	F1=-1611.89
##FIRST=	4521.1594499999982872,	4521.1594499999982872,	0
##DATA TABLE=	(F2++(Y..Y)), PROFILE
$$ plain form
4521 593 759 296 596 387 578 453 444 482 421 608 607 390 781 468 468 633 540 447 373 399 353 199 323 228 312 546 355 392 550
4378 550 330 456 482 311 180 529 64 298 107 308 168 325 213 457 391 295 591 262 303 455 253 334 117 122 114 276
4250 276 281 279 194 421 373 341 353 320 223 114 172 406 216 113 195 216 291 193 359 291 286 371 198 243 205 194 228 228 216 36 126 87 250
4088 250 365 210 236 256 320 301 348 84 278 153 97 179 65 248 303 119 250 258 400 356 148 350 237 93 24 142 103 143
3950 143 110 278 153 291 272 262 298 316 280 100 260 131 161 227 12 175 363 314 66 237 255 312 262 253 246 91 126 135 170 84
3803 84 331 173 229 189 406 85 354 227 253 191 154 246 272 21 157 98 109 208 275 212 97 378 102 256 127 369 263 150
3665 150 209 37 171 82 39 186 204 216 84 426 234 229 163 132 221 162 232 214 237 203 133 161 142 289 183 317 211 217 110 307
3517 307 100 192 139 200 134 181 123 200 181 255 184 178 308 363 60 113 78 181 119 118 106 73 287 145 170 256 222 171 365 240 69
$$ packed form
4521E93J66m63L00k09J91j25rL8o1J87jk17L91l13%J65r3r3p4K6m6j54J24r5Q4K34j91L7J58
4378E50k20J26K6j71j31L49m65K34j91K01j40J57j12K44o6r6K96l29M1J52k02Q1k17NqJ62
4250B76Nkq5K27m8l2J2l3r7j09N8K34j90j03Q2K1P5r8J66o8nQ5j73M5l8j1L4%j2j80R0l9J63
4088B50J15j55K6K0O4j9M7k64J94j25n6Q2j14J83N5j84J31QJ42m4k08K02j13j44o9J18l9M0
3950A43l3J68j25J38j9j0L6J8l6j80J60j29L0O6k15J63J88m9k48J71J8N7n0rpj55L5RL5q6
3803H4K47j58N6m0K17l21K69j27K6o2l7R2K6k51J36n9J1R9O7o3j15K81k76J54j29K42j06j13
3665A50N9j72J34q9m3J47J8J2j32L42j92no6l1Q9n9P0j8K3l4p0K8j9J47j06J34j06Oj07J97
3517C07k07R2n3O1o6M7n8P7j9P4p1oJ30N5l03N3l5J03o2jj2l3K14j42K5Q6l4n1J94j25j71
$$ plain form
3364 69 167 222 133 53 96 351 261 19 353 302 100 152 215 138 125 70 267 140 139 154 161 175 245 152 280 483 84 212 126 179 293
3212 293 68 100 95 117 172 94 308 98 221 143 209 398 155 150 208 49 346 438 468 499 173 131 1185 1332 717 288 190 271 125
3069 125 291 46 150 129 177 145 73 254 442 388 198 309 107 174 184 940 815 572 110 196 68 143 184 122 240 76 366
2936 366 108 181 220 717 221 272 176 147 190 313 191 766 138 272 217 135 345 264 48 220 223 79 111 70 156 399 181 131
2798 131 411 116 305 185 180 231 113 195 112 126 61 309 107 255 206 132 285 230 303 446 29 154 78 44 125 102 101 359 204
2656 204 803 898 245 319 284 228 201 162 246 156 186 233 60 83 245 185 222 248 202 274 381 142 268 132 171 161 136 122 51 312
2508 312 159 233 140 243 132 351 220 165 268 78 187 72 260 187 22 260 208 249 317 223 213 260 259 314 57 103 106 338 146
2365 146 279 133 259 285 174 357 337 147 132 370 215 418 54 85 230 257 148 266 130 365 188 318 296 221 249 424
$$ packed form
3364F9R8N5q9q0M3K55r0k42L34n1k02N2O3p7j3n5J97j27jJ5PJ4P0r3J28K03l99J28q6N3J14
3212B93k25L2nK2N5p8K14k10J23p8O6J89k43nN8j59K97R2L0L1l26m2J054J47o15m29r8Q1j46
3069A25J66k45J04k1M8l2p2J81J88n4j90J11k02O7J0P56j25k43m62Q6j28P5M1o2J18j64K90
2936C66k58P3L9M97m96N1r6k9M3J23j22N75o28J34n5q2K10q1k16J72Lj44L2m1Q6K43k18n0
2798A31K80k95J89j20nN1j18Q2q3J4o5K48k02J48m9p4J53n5P3J43m17J25p6l4Q1k3jK58j55
2656B04N99R5o53P4l5n6k7l9Q4r0L0M7j73K3J62o0L7K6m6P2J07k39J26j36L9j0k5j4p1K61
2508C12j53P4r3J03j11K19j31n5J03j90J09j15J88p3j65K38n2M1O8r4j0M7jN5k57M6LK32j92
2365A46J33j46J26K6j11J83k0j90j5K38j55K03l64L1J45K7j09J18j36K35j77J30k2p5K8J75
$$ plain form
2237 424 42 242 218 264 31 238 198 289 307 291 289 229 295 219 433 30 345 180 208 207 264 272 281 242 278 526 79 336 462 252
2090 252 175 268 416 135 137 385 251 294 294 311 443 232 527 191 195 914 1419 1683 1468 301 588 411 352 203 474 287 626
1957 626 517 342 251 666 336 220 527 198 333 447 329 523 330 447 271 556 556 517 382 533 282 559 378 227 614
1834 614 334 644 488 452 498 396 695 667 631 564 510 477 529 673 514 531 538 547 613 621 839 529 889 588 982 653 724 629 882
1691 882 699 746 608 760 740 844 835 825 1106 1053 1323 1033 1096 1325 1128 1159 1254 898 1188 1159 1196 1178 1611 1630 1878 2118 2508 2518
1553 2518 2682 2872 3044 2899 2769 2270 2036 163 2984 7834 5898 10684 14964 28911 70000 473892 1000909 275431
1464 275431 66945 33456 21519 15451 10345 6986 3790 3858 3045 1921 1934 1659 1788 2056 2176 2195 2009 2398 2093
1371 2093 1785 1776 1491 1466 1207 1046 991 1104 944 1166 993 1121 1187 1185 955 1038 962 905 787 780 587 915 598 758 733 822 791 813
$$ packed form
2237D24l82K00k4M6k33K07m0R1J8j6ko0O6p6K14m03L15j65K8jN7QRl9L6K48m47K57J26k10
2090B52p7R3J48k81KK48j34M3%J7J32k11K95l36MP19N05K64k15j167K87j77n9j49K71j87L39
1957F26j09j75r1M15l30j16L07l29J35J14j18J94j93J17j76K85%l9j35J51k51K77j81j51L87
1834F14k80L10j56l6M6j02K99k8l6o7n4l3N2J44j59J7PRO6QK18l10L60l01L94l29P1r5K53
1691H82j83M7j38J52k0J04rj0K81n3K70k90O3K29j97L1R5l56K90k9L7j8M33J9K48K40L90J0
1553B518J64J90J72j45j30m99k34j873K821M850j936M786M280J3947M1089M03892N27017p25478
1464B75431k08486l3489j1937o068n106l359l196O8q13j124J3k75J29K68J20J9j86L89l05
1371B093l08rk85k5k59j61n5J13j60K22j73J28O6kk30Q3p6n7j18pj93L28l17J60k5Q9l1K2
$$ plain form
1233 813 657 815 623 764 316 723 509 696 324 695 638 438 415 825 547 472 662 617 438 481 633 260 420 360 706
1110 706 528 424 551 523 583 420 386 515 502 166 499 396 258 411 271 423 334 447 355 563 521 302 648 267 302 435
982 435 166 248 249 238 385 534 280 359 572 352 512 274 376 250 257 367 179 226 292 253 289 444 331 301 370 385 243 407
844 407 310 366 151 320 188 304 341 327 249 137 512 484 181 413 396 192 223 139 33 167 151 104 378 351 402 393 284 204 412
702 412 422 232 126 223 45 195 220 61 121 421 324 276 350 166 245 339 91 454 37 173 204 93 178 283 213 225 253 378
564 378 293 149 405 151 314 191 210 193 368 837 1879 1437 2955 1394 318 394 338 323 247 288 167 86 161 87 136 125 278
431 278 274 242 315 289 314 167 220 331 143 352 139 182 48 254 257 209 463 96 246 353 297 345 173 142 108 139 97 175 127 170
283 170 188 71 236 450 281 253 138 269 225 175 174 50 136 145 140 186 311 300 164 288 150 352 226 295 46 296 56 82 70
$$ packed form
1233H13j56J58j92J41m48M07k14J87l72L71n7k00k3M10k78p5J90m5j79M3J52l73J60o0L46
1110G06j78j04J27k8O0j63l4J29j3l36L33j03j38J53j40J52q9J13r2K08m2k19L46l81L5J33
982D35k69Q2Jj1J47J49k54P9K13k20J60k38J02j26PJ10j88M7O6l9L6J55j13l0O9J5j42J64
844D07r7N6k15J69j32J16L7j4p8j12L75k8l03K32j7k04L1q4j06J34j6m7K74k7N1rj09q0K08
702D12J0j90j06R7j78J50K5j59O0L00r7m8P4j84P9R4k48L63m17J36L1j11Q5J05p0J2K8J25
564C78q5j44K56k54J63j23J9j7J75M69J042m42J518j561j076P6n6j5p6M1j21q1P5p4M9j1J53
431B78ml2P3k6K5j47N3J11j88K09k13M3j34K06Lm8K54l67J50J07n6M8j72l1l4L1m2P8m8M3
283A70J8j17J65K14j69k8j15J31m4n0jj24Q6RnM6J25j1j36J24j38K02j26O9k49K50k40K6j2
$$ plain form
140 70 106 286 189 446 140 246 436 333 251 201 167 219 112 65 84 204 78 411 48 316 274 327 405 195 267 225 153 184 41
-2 41 160 40 97 351 215 329 202 239 248 513 207 271 322 23 43 134 129 130 265 165 366 375 215 437 255 282 67 455 205
-145 205 147 204 206 242 124 430 356 304 236 483 265 287 346 160 385 236 31 207 173 256 300 284 272 440 224 513 221 274 493
-288 493 123 438 162 226 257 290 222 394 517 190 446 479 295 373 356 387 218 312 311 252 276 237 331 455 383 396 732 586 571
-431 571 538 368 437 496 346 467 261 530 479 423 701 555 525 788 507 702 685
$$ packed form
140G0L6J80r7K57l06J06J90j03q2n0l4N2j07m7J9J20j26L33l63K68m2N3P8k10P2m2p2L1j43
-2D1J19j20N7K54j36J14j27L7RK65l06O4N1k99K0R1nJJ35j00K01Rj60K22j82K7k15L88k50
-145B05n8N7KL6j18L06p4n2o8K47k18K2N9j86K25j49k05J76l4Q3M4j6j2J68k16K89k92N3K19
-288D93l70L15k76O4L1L3o8J72J23l27K56L3j84P8j7L1j69R4jn9K4l9R4J24p2J3L36j46j5
-431E71l3j70O9N9j50J21k06K69n1n6K78j46l0K63k81J95j7
-514F85
##PAGE=	F1=-1621.73
##FIRST=	4521.1594499999982872,	4521.1594499999982872,	0
##DATA TABLE=	(F2++(Y..Y)), PROFILE
$$ plain form
4521 436 568 135 444 256 449 329 335 356 309 445 449 284 588 335 268 522 345 342 240 317 233 148 206 180 233 443 227 260 461
4378 461 160 337 367 221 131 462 24 208 89 271 88 248 147 384 291 199 478 244 190 376 211 259 122 133 127 215 249
4246 249 218 182 290 310 217 273 265 144 88 156 326 197 77 163 166 226 113 367 176 165 331 105 147 138 140 197 243 152 23 112 52
4093 52 186 272 173 144 144 275 226 227 96 238 174 95 193 24 192 271 46 230 237 286 284 117 309 177 44 57 151 93 101 115 255
3940 255 115 254 255 202 263 244 197 63 203 123 153 219 35 180 346 224 26 243 169 228 197 219 211 19 80 147 130 109 272 145
3793 145 213 150 320 46 275 179 185 148 110 183 242 12 134 96 105 201 234 182 46 331 89 199 56 327 257 163 170 13 166 81
3645 81 64 173 169 135 67 326 213 226 94 65 243 123 214 218 228 162 110 106 110 243 161 237 159 159 129 278 134 218 191 226 96 170 63
3483 63 158 141 142 148 160 203 330 27 112 88 161 118 139 51 82 229 112 114 209 189 150 325 190 63 156 238 127 29 79 327 239 101
$$ packed form
4521D36J32m33L09j88J93j20OK1m7J36Mj65L04k53o7K54j77lj02P7q4q5N8k6N3K10k16L3K01
4378D61l01J77L0j46r0L31m38J84j19J82j83J60j01K37r3r2K79k34n4J86j65M8j37J1oQ8L4
4246B49l1l6J08K0r3N6qj21n6O8J70j29j20Q6LO0j13K54j91j1J66k26M2rKN7M6r1j29Q9o0
4093E2J34Q6r9k9%J31m9Jj31J42o4p9R8j69J68P9k25J84PM9kj67J92j32j33J3R4n8QJ4J40
3940B55j40J39Jn3O1j9m7j34J40q0L0O6j84J45J66j22j98K17p4N9l1K2qj92O1O7j7k1J63j27
3793A45O8o3J70k74K29r6Ol7l8P3N9k30J22l8RR6L3n2j36K85k42J10j43K71p0r4Pj57J53q5
3645H1j7J09ml4o8K59j13J3j32k9J78j20R1MJ0o6n2mMJ33q2P6p8%l0J49j44Q4k7L5j30P4j07
3483F3R5j7JOJ2M3J27l03Q5k4P3m3K1q8L1J47j17KR5k0l9J75j35j27R3Q2j11r8N0K48q8j38
$$ plain form
3325 101 329 243 77 85 154 88 100 72 253 158 93 172 165 138 201 154 208 439 132 162 120 97 246 69 91 60 82 139 110 265 94
3172 94 167 127 185 351 119 92 203 100 320 443 432 370 214 53 1107 1311 666 230 124 235 81 235 23 140 140 156
3045 156 98 67 265 382 332 189 246 90 137 121 833 793 602 112 190 67 171 177 83 161 63 267 75 141 213 664 205 279 118
2902 118 136 174 272 74 660 239 255 152 169 250 235 75 195 213 95 90 93 145 365 198 114 381 53 271 128 139 186 112 154
2759 154 117 81 50 246 119 213 130 116 216 207 231 367 18 69 71 55 121 69 129 298 175 657 640 121 234 233 152 176 146 250 80
2606 80 173 230 89 96 217 125 182 204 128 252 344 89 213 102 116 164 129 82 64 210 141 193 84 205 32 299 164 105 175 69
2459 69 173 89 221 194 16 147 201 150 249 124 162 225 170 258 59 65 61 243 115 243 79 229 286 52 300 267 99 81 321
2316 321 248 315 28 58 184 201 114 198 71 268 140 208 220 140 190 342 86 166 196 146 20 203 133 222 223 202 226 122 241 157
$$ packed form
3325A01K28q6j66QO9o6J2k8J81r5o5P9pk7O3m7N4K31l07L0m2k3J49j77K2l1K2N7k9J55j71
3172I4P3m0N8J66k32k7J11j03K20J23j1o2j56j61J054K04o45m36j06J11j54J54k12J17%J6
3045A56n8l1J98J17n0j43N7j56M7j6P12m0j91m90P8j23J04Or4P8r8K04j92O6P2M51m59P4j61
2902A18J8L8R8j98N86m21J6j03J7Q1j5j60J20J8j18nLN2K20j67q4K67l28K18j43J1M7p4M2
2759A54l7l6l1J96j27R4q3j4J00rK4J36l49N1Kj6O6n2O0J69j23M82j7n19J13jq1K4l0J04j70
2606H0R3N7j41PJ21r2N7K2p6J24R2k55J24j11J4M8l5m7j8J46o9N2j09J21j73K67j35n9P0j06
2459F9J04q4J32k7j78J31N4n1R9j25L8O3n5Q8j99OmJ82j28J28j64J50N7k34K48l3j68j8K40
2316C21p3O7k87L0J26J7q7Q4j27J97j28O8J2q0N0J52k56Q0L0n0j26J83p0Q9Jk1K4j04J19q4
$$ plain form
2168 157 336 50 291 124 119 130 229 224 176 154 159 426 36 227 370 172 104 174 346 102 109 318 204 220 201 228 344 141 444
2026 444 218 114 757 1096 1942 1774 267 513 292 280 71 342 182 483 422 181 219 526 243 118 412 134 249 337
1907 337 213 431 204 309 162 412 415 362 269 377 179 406 258 130 474 195 492 396 300 324 229 567 493 496 387 336 295 392
1770 392 476 345 406 376 355 480 404 620 328 692 381 748 424 522 355 687 476 522 357 535 497 614 547 592 795 749 975
1637 975 686 736 976 753 826 843 588 828 811 830 839 1142 1166 1319 1511 1768 1761 1828 2019 2117 1953 1829 1343 1079 933 2676 6572
1504 6572 3158 5974 10328 20405 49368 324811 694181 193720 47105 23809 15646 11697 7583 4831 1499
1430 1499 3486 2517 1502 1391 1084 1399 1167 1572 1551 1317 1731 1496 1190 1268 1022 1051 818 682 709 781 642 828 664 766
1312 766 868 831 620 750 645 655 532 546 380 676 441 547 448 637 558 570 439 562 421 584 105 566 318 539 146
$$ packed form
2168A57J79k86K41j67nJ1R9nm8k2NK67l90J91J43j98o8P0J72k44PK09j14J6j9K7J16k03L03
2026D44k26j04O43L39Q46j68j507K46k21j2k09K71j60L01o1k41L8L07k83j25K94k78J15Q8
1907C37j24K18k27J05j47K50Ln3r3J08j98K27j48j28L44k79K97r6r6K4r5L38p4Lj09n1m1R7
1770C92Q4j31O1l0k1J25p6K16k92L64l11L67l24R8j67L32k11M6j65J78l8J17o7M5K03m6K26
1637I75k89N0K40k23P3J7k55K40j7J9RL03K4J53J92K57pO7J91R8j64j24m86k64j46J743L896
1504F572l414K816M354J0077K8963K75443L69370n00461j46615k3296q163l949m114k752l332
1430A499J987r69j015j11l07L15k32M05k1k34M14k35l06P8k46K9k33j36K7P2j39J86j64J02
1312G66J02l7k11J30j05J0j23J4j66K96k35J06r9J89p9J2j31J23j41J63m79M61k48K21l93
$$ plain form
1189 146 575 471 269 255 600 350 330 471 466 285 321 475 163 309 263 527 436 304 347 364 415 282 239 382 378 41 399 294
1051 294 184 284 216 298 223 344 204 461 395 140 547 221 237 368 63 197 132 174 293 467 182 267 473 250 415 120
923 120 319 151 191 286 140 129 218 188 219 351 188 214 258 299 164 362 217 297 101 279 147 297 253 245 182 72 417 353 78
780 78 322 321 160 182 77 29 139 93 47 300 267 325 296 194 140 299 336 156 146 182 54 183 170 18 88 344 208 221 270 94
633 94 161 237 77 387 36 111 206 78 143 188 154 202 158 309 195 67 325 148 238 134 217 163 474 2238 3881 1580 4585
500 4585 3322 350 423 318 267 199 159 119 86 141 47 141 39 226 210 195 234 211 233 123 133 284 185 342 191 172 47 208
362 208 251 150 390 123 140 291 204 270 99 97 81 117 109 173 65 133 151 18 204 383 205 161 87 187 161 163 121 71 97 113 126
209 126 123 262 228 94 183 98 261 209 217 50 271 79 57 99 64 264 157 373 81 176 365 294 236 157 117 171 112 40 52 157
$$ packed form
1189A46M29j04k02j4L45k50k0J41nj81L6J54l12J46m6K64r1j32M3J7N1j33m3J43ml37L58j05
1051B94j10J00o8Q2p5J21j40K57o6k55M07l26J6J31l05J34o5M2J19J74k85Q5K06k23J65k95
923A20J99j68M0R5j46j1Q9l0L1J32j63K6M4M1j35J98j45Q0j96J78j32J50m4qo3j10L45o4k75
780G8K44jj61K2j05m8J10m6m6K53l3N8k9j02n4J59L7j80j0L6j28J29j3j52P0K56j36J3M9j76
633I4O7P6j60L10l51P5R5j28O5M5l4M8m4J51j14j28K58j77R0j04Q3n4L11J764J643k301L005
500D585j263k972P3j05n1o8m0m0l3N5r4R4j02J87j6j5L9k3K2j10J0J51r9J57j51j9j25J61
362B08M3j01K40k67J7J51q7O6j71kj6L6qO4j08O8J8j33J86J79j78m4p4J00k6Km2n0K6J6J3
209A26lJ39l4j34Q9q5J63n2Qj67K21j92k2M2l5K00j07K16k92R5J89p1n8p9m0N4n9p2J2J05
$$ plain form
62 157 107 363 16 260 175 276 333 120 229 153 168 174 27 173 41 89 359 151 226 149 150 158 431 171 204 267 99 75 71 104 76
-91 76 171 144 316 268 81 372 200 215 51 361 211 147 184 158 233 82 366 318 175 174 362 207 224 238 127 308 203 6
-229 6 180 149 192 232 186 197 356 126 364 159 172 384 138 377 129 225 269 253 168 317 410 124 299 332 200 244 279 276 113
-371 113 274 242 153 233 168 234 347 281 255 612 421 438 384 232 293 420 251 350 150 437 296 292 549 413 336 617 306 518
-509 518 491
$$ packed form
62A57n0K56l47K44q5J01N7k13J09p6J5Oj47J46j32M8K70k08P5p7JQK73k60L3O3j68k4mL3k8
-91G6R5k7J72m8j87K91j72J5j64L10j50o4L7k6P5j51K84m8j43jJ88j55J7J4j11J81j05j97
-229FJ74l1M3M0m6J1J59k30K38k05J3K12k46K39k48R6M4j6q5J49R3k86J75L3j32M4L5lj63
-371A13J61l2q9Q0o5O6J13o6k6L57j91J7n4j52O1J27j69R9k00K87j41mK57j36p7K81l11K12
-509E18k7
-514D91
##PAGE=	F1=-1631.58
##FIRST=	4521.1594499999982872,	4521.1594499999982872,	0
##DATA TABLE=	(F2++(Y..Y)), PROFILE
$$ plain form
4521 291 364 16 284 124 313 206 217 230 200 273 288 212 397 204 83 408 167 221 119 230 112 108 74 135 163 320 108 125
4383 125 363 5 217 256 127 164 389 87 114 80 228 14 168 84 301 220 106 357 246 119 293 157 177 147 131 140 172
4250 172 215 187 167 185 232 110 198 203 94 140 143 245 170 54 131 127 155 68 373 74 51 284 77 94 64 91 163 243 91 36 105 20
4093 20 128 181 134 62 46 220 153 121 106 195 213 90 207 31 139 230 22 219 234 174 205 117 265 132 33 95 147 84 62 112
3945 112 226 85 216 258 145 234 157 120 46 138 111 160 217 73 170 309 134 82 238 98 154 136 204 177 37 40 163 83 126 207
3798 207 123 197 100 230 45 205 140 119 97 61 119 198 6 124 106 118 183 188 151 126 285 142 141 31 271 243 198 141 61 171 95
3645 95 104 176 134 112 72 218 197 231 28 37 246 127 178 196 198 127 81 65 79 206 145 157 94 106 141 243 176 236 224 245 43 152 14
3483 14 121 107 42 112 155 117 284 7 120 91 152 124 157 30 94 169 80 74 153 159 157 272 136 83 133 235 114 15 59 284 212 175
$$ packed form
4521B91P3l48K68j60J89j07J1J3l0P3J5p6J85j93j21L25k41N4j02J11j18ml4O1K8J57k12J7
4383A25K38l58K12L9j29L7K25l02K7l4J48k14J54q4K17q1j14K51j11j27J74j36K0l0j6RL2
4250A72M3k8k0J8M7j22Q8Nj09M6LJ02p5j16P7mK8q7L05k99k3K33k07J7l0K7P2Q0j52n5O9q5
4093B0J08N3m7p2j6J74o7l2j5Q9J8j23J17j76J08R1k08J97J5o0L1q8J48j33r9O2N2o3k2N0
3945A12J14j41J31M2j13Q9p7l7p4R2k7M9N7j44R7J39j75n2J56j40N6j8O8k7j40LJ23q0M3Q1
3798B07q4P4r7J30j85J60o5k1k2l6N8P9j92J18j8J2O5Nl7k5J59j43jj10K40k8m5n7q0J10p6
3645I5RP2m2k2m0J46k1L4k03RK09j19N1J8Kp1m6j6J4J27o1J2o3J2L5J02o7O0j2K1k02J09j38
3483A4J07j4o5P0M3l8J67k77J13k9O1k8L3j27O4P5q9oP9OkJ15j36n3N0J02j21r9M4K25p2l7
$$ plain form
3325 175 290 191 75 72 85 41 103 67 237 164 54 188 152 90 159 169 136 381 166 138 123 12 188 77 70 59 44 101 127 218 113
3172 113 133 136 166 296 129 43 193 172 294 523 480 250 218 31 975 1172 550 161 72 194 41 177 53 128 139 125 58 122
3035 122 278 332 303 183 183 93 124 92 731 761 622 108 176 74 201 180 56 106 82 162 75 116 208 615 181 279 72 112 146 285
2887 285 354 602 316 229 89 203 170 203 87 152 188 113 69 110 134 314 215 131 350 88 235 75 153 140 111 118 120 44 57 178
2739 178 136 166 58 100 175 173 186 264 13 54 83 69 115 59 145 230 131 463 445 33 164 168 85 157 162 258 20 183 250 119 105 184
2582 184 139 137 151 66 233 306 91 154 83 59 174 132 51 71 129 159 155 34 172 71 235 117 50 76 69 171 131 185 195 52 72
2429 72 185 75 188 35 119 191 95 189 75 57 19 155 97 185 53 214 304 74 244 184 69 127 278 279 217 76 37 149 140
2286 140 80 136 31 181 99 109 139 78 142 239 107 99 180 25 37 166 102 164 138 124 173 77 203 135 220 103 222 74 36 79 202
$$ packed form
3325A75J15r9j16lJ3m4O2l6J70p3j10J34l6o2O9J0l3K45k15k8j5j11J76j11pj1j5N7K6R1j05
3172A13K0LL0J30j67q6J50k1J22K29m3k30l2j87R44J97o22l89q9J22j53J36j24P5J1j4o7O4
3035A22J56N4k9j20%r0L1l2O39L0j39n14O8j02J27k1j24N0k4Q0q7M1R2M07m34R8k07M0L4J39
2887B85O9K48k86q7j40J14l3L3j16O5L6p5m4M1K4J80r9q4K19k62J47j60P8j3k9PKp6J3J21
2739A78m2L0j08M2P5kJ3P8k51M1K9j4M6n6Q6Q5r9L32j8m12J31Mq3P2NR6k38J63O7j31j4P9
2582A84m5kJ4q5J67P3k15O3p1k4J15m2q1K0N8L0mj21J38j01J64j18o7K6pJ02m0N4J0j43K0
2429G2J13j10J13j53Q4P2r6R4j14j8l8J36n8Q8j32J61R0k30J70o0j15N8J51Jo2j41l9J12r
2286A40o0N6j05J50q2J0L0o1O4R7j32qQ1j55J2J29o4O2k6j4M9r6J26o8Q5j17J19j48l8M3J23
$$ plain form
2134 202 180 68 84 37 323 80 119 278 122 50 87 279 96 112 248 161 188 94 150 255 91 350 282 87 598 846 2405
2001 2405 2050 260 432 155 195 73 211 88 335 331 31 206 379 164 69 295 108 175 229 107 333 104 180 74 263
1878 263 272 223 167 227 84 268 156 37 336 110 340 314 159 156 84 433 333 368 224 164 142 264 264 195 288 239 188 350 209
1735 209 410 139 492 201 522 199 330 126 511 283 310 136 312 270 391 280 371 488 466 631 361 397 623 409 508
1612 508 450 310 484 486 483 528 682 706 779 919 1020 1030 984 1197 1194 1057 960 622 440 1220 1999 4377 1155 2120 6214 12264
1484 12264 29224 182841 399534 114171 27803 14324 9846 7921 5105 2984 3150 3885 2214 1272 856 464
1405 464 1017 319 1000 894 706 1088 913 635 781 576 648 468 324 442 470 369 512 348 431 550 504 293 471 345 428
1282 428 312 328 191 438 284 367 172 459 333 338 237 315 242 410 116 397 145 381 99 457 305 131 107 375 163 196
$$ packed form
2134B02k2j12J6m7K86k43L9J59j56p2L7J92j83J6J36q7K7r4N6J05j64K59o8j95N11K48J559
2001B405l55j790J72k77M0j22J38j23K47ml00J75J73k15r5K26j87O7N4j22K26k29P6j06J89
1878B63Rm9n6O0j43J84j12j19K99k26K30k6j55lp2L49j00L5j44o0k2J22%o9R3m9n1J62j41
1735B09K01k71L53k91L21l23J31k04L85k28K7j74J76m2J21j11R1J17k2J65k70L6K26k14R9
1612E08n8j40J74KlM5J54K4P3J40J01J0m6K13lj37r7l38j82P80P79K378l222R65M094O050
1484A2264J6960J53617K16693k85363q6368j3479m478j925k816k121J66P35j671r42m16l92
1405D64N53o98O81j06j88L82j75k78J46k05P2j80j44J18K8j01J43j64Q3J19m6k11J78j26Q3
1282D28j16J6j37K47j54Q3j95K87j26Nj01P8p3J68k94K81k52K36k82L58j52j74k4K68k12L3
$$ plain form
1154 196 292 305 169 162 321 66 205 183 351 344 190 163 211 243 160 108 249 255 65 298 199 141 162 171 167 132 254 118 347 257 36
1002 36 444 198 186 295 58 160 24 113 190 395 152 187 383 189 322 54 266 58 132 213 109 53 134 131 147 249 91
869 91 132 143 232 163 308 136 230 42 224 109 282 167 149 120 63 320 217 48 233 254 133 162 74 68 111 49 60 217 224 259
721 259 182 108 88 187 243 92 185 136 124 164 131 50 56 255 107 154 191 20 93 158 106 305 52 76 190 74 121 105 136 160 76 224
564 224 109 1 228 142 156 77 216 186 417 1877 3702 1678 4121 3131 271 391 273 220 155 45 91 90 125 40 148 71
436 71 180 145 155 177 154 179 87 68 222 215 318 233 183 58 164 236 90 307 166 57 214 122 196 58 63 47 94 116 160 17 119
283 119 129 57 176 309 146 122 82 104 110 131 71 85 66 95 104 74 208 152 63 82 61 175 199 163 91 239 92 39 114 66 229 121
126 121 291 95 113 293 244 214 108 95 133 114 38 61 112 159 308 32 212 80 233 267 69 187 124 195 163 51 178 45
$$ packed form
1154A96R6J3j36pJ59k55J39k2J68pj54k7M8L2q3n2J41Oj90K33r9n8K1Rml5J22j36K29r0k21
1002C6M08k46j2J09k37J02j36Q9P7K05k43L5J96j94J33k68K12k08P4Q1j04n6Q1lJ6J02j58
869I1M1J1Q9o9J45j72R4j88J82j15J73j15j8k9n7K57j03j69J85K1j21K9q8oM3o2J1J57PL5
721B59p7p4k0R9N6j51R3m9j2M0l3q1OJ99j48M7L7j71P3O5n2J99k53K4J14j16M7j6L1K4q4J48
564B24j15j08K27q6J4p9J39l0K31J460J825k024K443r90k860J20j18n3o5j10M6jL5q5J08p7
436G1J09l5J0K2k3K5r2j9J54pJ03q5n0j25J06P2j46K17j41j09J57r2P4j38Nj6M7K2M4j43J02
283A19J0p2J19J33j63k4m0K2OK1o0J4j9K9Rl0J34n6q9J9k1J14K4l6p2J48j47n3P5m8J63j08
126A21J70j96J8J80m9l0j06j3L8j9p6K3N1M7J49k76J80j32J53L4j98J18o3P1l2j12J27j33
$$ plain form
-12 45 94 356 89 124 115 69 79 336 133 135 201 169 141 20 73 39 67 121 270 137 47 293 155 150 141 261 213 147 165 130 209 44
-170 44 302 258 68 110 241 170 167 126 99 220 170 38 160 126 133 155 100 118 260 48 226 97 78 271 154 306 125 209 247
-312 247 206 118 230 289 68 152 189 107 114 199 187 83 242 181 44 189 119 147 241 204 170 482 257 298 241 115 160 349 164 231
-460 231 74 338 109 170 371 271 153 436 120 330 303
$$ packed form
-12D5M9K62k67L5rm6J0K57k03KO6l2k8j21N3l4K8N4J49j33r0K46j38nrJ20m8o6J8l5P9j65
-170D4K58m4j90M2J31p1lm1k7J21n0j32J22l4PK2n5J8J42k12J78j29j9J93j17J52j81Q4L8
-312B47m1q8J12N9k21Q4L7q2PQ5j2j04J59o1j37J45p0K8R4l7l4L12k25M1n7j26M5J89j85O7
-460B31j57K64k29O1K01j00j18K83l16K10k7
-514C03
##PAGE=	F1=-1641.42
##FIRST=	4521.1594499999982872,	4521.1594499999982872,	0
##DATA TABLE=	(F2++(Y..Y)), PROFILE
$$ plain form
4521 190 182 108 139 16 188 106 112 133 117 123 154 187 248 109 74 309 93 104 28 156 31 86 56 102 126 197 20 14 270 113 119 171
4364 171 51 211 325 138 63 82 187 46 100 61 222 189 47 252 251 127 221 98 101 156 120 144 180 185 192 150 145 150 60 148 141 111 193
4201 193 134 175 139 46 103 119 101 94 378 93 55 236 123 117 10 53 129 227 69 48 114 8 99 106 99 28 64 161 97 75 113 151 247
4039 247 77 214 71 99 185 67 216 243 82 132 125 230 114 77 107 132 78 54 99 196 73 180 267 99 215 67 95 49 81
3896 81 92 171 221 120 138 251 59 133 228 97 102 122 210 163 74 37 177 35 129 148 110 180 58 153 65 162 122 66 49 41 70 146 26
3734 26 125 110 146 160 145 120 184 240 191 94 70 210 222 224 128 104 185 118 140 198 111 133 74 125 190 234 40 58 234 157 130 153 152 97 61
3561 61 52 56 180 139 88 26 62 138 212 213 243 231 254 16 137 53 94 87 76 88 160 126 230 21 132 90 147 127 165 67 104 122 50 70
3394 70 94 129 176 216 88 107 103 213 90 41 38 227 183 231 241 154 98 106 15 9 109 59 218 156 47 195 123 46 123 178 72 321
$$ packed form
4521A90qp4L1j23J72q2OK1j6OL1L3O1j39l5K35k16J1p6J28j25N5l0M6K4P1j77oK56j57ON2
4364A71j20J60J14j87p5J9J05j41N4l9J61l3j42K05jj24R4j23LN5l6K4L6NPm2nNr0Q8pl0Q2
4201A93n9M1l6r3N7J6j8pK84k85l8J81j13oj07M3P6R8j58k1O6j06R1Ppp1L6R7o4k2L8L8R6
4039B47j70J37j43K8Q6j18J49K7j61N0pJ05j16l7L0K5n4k4M5R7j23J07Q7j68J16j48K8m6L2
3896H1J1P9N0j01J8J13j92P4R5j31NK0Q8m7q9l7J40j42R4J9l8P0j22R5q8R7m0n6j7qK9P6j20
3734B6R9j5L6J4j5k5O4N6m9r7k4J40J2Kr6k4Q1o7K2N8q7K2n9N1O5M4j94J8J76p7k7K3jn5l6
3561F1rMJ24m1n1o2L6P6P4JL0j2K3k38J21q4M1pj1J2P2l4J04k09J11m2N7k0L8r8L7J8p2K0
3394G0K4L5M7M0j28J9mJ10j23m9lJ89m4M8J0q7n6Qr1oJ00n0J59o2j09J48p2p7P7N5j06K49
$$ plain form
3236 321 178 170 134 61 132 82 49 82 16 65 131 178 128 127 158 151 240 174 9 177 232 268 599 530 123 183 110 807 924 380 89 49
3079 49 151 36 127 78 116 126 91 39 182 289 306 295 186 144 128 123 101 645 720 618 110 159 86 219 188 59 111 94 69 111 99
2926 99 210 584 152 273 61 86 106 347 625 591 352 199 73 229 142 173 81 96 147 118 52 118 121 257 219 149 322 161 202
2784 202 32 192 111 102 95 120 21 73 113 156 123 29 88 165 138 172 152 20 108 104 73 109 63 148 164 113 248 458 190 122 100 77 148
2621 148 186 264 63 225 284 148 110 149 176 101 100 56 217 273 124 98 79 21 173 144 34 72 106 190 129 59 148 133 167 81 16 36
2464 36 74 171 172 155 192 91 94 165 81 145 47 88 160 61 113 106 77 42 91 87 109 61 212 323 182 199 100 57 182 253 297 137 106 49
2296 49 137 88 52 94 46 124 79 54 63 61 108 132 104 49 175 80 46 136 125 119 61 101 137 131 185 158 103 127 150 33 34 100 184 143 41 43 71
2114 71 233 130 32 197 113 51 44 224 116 118 192 124 194 62 78 185 122 258 339 94 452 653 2767 2235 316 358 27 113
$$ packed form
3236C21j43ql6p3P1n0l3L3o6M9O6M7n0jL1pQ9o6j65J68N5L6L31o9m07O0p3O97J17n44k91m0
3079D9J02j15R1m9L8J0l5n2J43J07J7j1j09m2j6nk2N44P5j02n08M9p3J33l1j29N2j7k5M2j2
2926I9J11L74m32J21k12K5K0K41K78l4k39j53j26J56q7L1r2J5N1k9o6O6LJ36l8p0J73j61M1
2784B02j70J60q1rpK5r9N2M0M3l3r4N9P7k7L4k0j32Q8ml1L6m6Q5J6n1J35K10k68o8k2k3P1
2621A48L8P8k01J62N9j36l8L9K7p5jm4J61N6j49k6j9n8J52k9j10L8L4Q4o1p0Q9j5L4q6o5K0
2464C6L8R7Jj7L7j01LP1q4O4r8M1P2r9N2pk9l5M9mK2m8J51J11j41J7r9m3J25P1M4j60l1n7
2296D9Q8m9l6M2m8P8m5k5RkM7K4k8n5J26r5l4R0j1on8M0L6oN4k7n5K4K3j17JO6Q4m1j02KK8
2114G1J62j03r8J65q4o2pJ80j08KP4o8P0j32J6J07o3J36Q1k45L58K01K114n32j919M2l31Q6
$$ plain form
1976 113 129 108 47 207 257 118 209 244 119 111 191 118 118 149 36 243 85 87 55 131 145 123 105 102 50 190 122 44 223 153 213 259 45
1814 45 75 30 309 222 265 102 45 41 164 70 85 190 169 70 238 97 245 34 317 79 349 10 177 150 377 192 148 46
1676 46 125 94 206 92 190 232 250 342 123 136 330 141 250 185 116 201 226 203 289 289 310 349 432 385 438 282 530 428 343 295 376
1524 376 253 1082 1251 2263 336 759 2905 5452 12386 67191 157193 47846 11762 6360 4935 4644 3433 2000
1435 2000 5795 4746 2207 1336 616 152 627 314 578 304 275 562 422 217 382 216 307 225 45 224 216 162 308 95
1317 95 162 283 270 67 244 127 286 178 162 50 231 161 257 52 320 156 155 79 118 112 268 264 238 26 248 212 360 163 86
1174 86 13 182 70 95 150 168 110 29 192 26 118 138 223 273 93 105 87 97 71 37 135 156 130 224 125 145 69 150 51 89 193 147
1017 147 252 130 134 357 203 145 222 114 141 82 69 112 325 203 141 312 224 252 165 223 25 94 158 93 65 52 89 100 156 133 67
$$ packed form
1976A13J6k1o1J60N0j39R1L5j25qQ0p3%L1j13K07j58Kl2P6J4k2j8ln2J40o8p8J79p0O0M6k14
1814D5L0m5K79q7M3j63n7mJ23r4J5J05k1r9J68j41J48k11K83k38K70l39J67k7K27j85m4j02
1676D6P9l1J12j14R8M2J8R2k19J3J94j89J09o5o9Q5K5k3Q6%K1L9Q3m7N3j56K48j02q5m8Q1
1524C76j23Q29J69J012j927M23K146K547O934N4805R0002j09347l6084n402j425k91j211j433
1435B000L795j049k539q71p20m64M75l13K64k74k9K87j40k05J65j66R1q2j80J79qn4J46k13
1317I5O7J21j3k03J77j17J59j08j6j12J81p0R6k05K68j64jp6L9oJ56mk6k12K22l6J48j97p7
1174H6p3J69j12K5N5J8n8q1J63j66R2K0Q5N0j80J2j8J0k6l4R8K1k6R4r9K0p6Q1r9L8J04m6
1017A47J05j22MK23j54n8P7j08K7n9j3M3K13j22o2J71q8K8q7N8j98O9O4o5k8j3L7J1N6k3o6
$$ plain form
864 67 43 196 219 257 92 176 41 159 85 253 108 49 72 90 236 107 123 163 210 114 160 122 102 87 37 118 143 236 212 74 36
711 36 56 94 164 55 224 95 168 139 112 101 32 168 48 93 132 61 82 122 145 227 78 75 158 84 118 116 142 106 29 137 57 45 140
549 140 128 81 65 207 224 260 669 2354 1759 2557 1878 160 329 231 190 123 87 74 92 107 66 153 137 139 83 128 162 150 155 62 63 153
391 153 217 281 263 205 77 133 213 44 234 197 79 134 59 134 84 58 14 73 111 139 26 131 128 93 168 241 123 159 102 27 82 85 28
229 28 87 58 106 80 58 160 87 79 66 41 112 196 153 138 204 94 27 113 88 181 79 215 154 65 233 184 179 57 104 117 108 61 98 78
62 78 204 251 57 187 29 200 206 90 153 150 213 159 82 183 75 96 338 40 51 109 32 25 245 101 71 130 215 198 63 39 54
-91 54 32 99 239 11 125 211 124 99 202 167 211 144 145 130 181 41 241 186 84 57 143 158 120 49 78 134 139 74 151 108 98 100 46 45
-258 45 169 49 118 60 57 180 157 236 150 177 197 158 81 144 177 33 35 78 37 5 137 132 141 224 140 62 154 123 102 166 173 191 359 127
$$ packed form
864F7k4J53K3L8j65Q4j35J18p4J68j45n9K3J8J46j29J6M0M7r6M6l8k0j5n0Q1K5R3k4j38l8
711C6K0L8P0j09J69j29P3k9k7j1o9J36j20M5L9p1K1M0K3Q2j49lQ3p4L4kK6l6p7J08q0j2R5
549A40j2m7j6J42J7L6M09J685n95P98o79j718J69r8m1o7l6j3J8J5m1Q7j6Kn6M5L4j2Nr3JR0
391A53O4O4j8n8j28N6Q0j69J90l7j18N5p5P5n0k6m4N9L8K8j13J05ll5P5P3j18L6n7p5N5Ln7
229B8N9k9M8k6k2J02p3qj3k5P1Q4m3j5O6j10o7Q6k5R3j02J36o1q9J68m9nj22M7J3rm7L7k0
62G8J26M7j94J30j58J71Oj16O3lO3n4p7J01j08K1K42k98J1N8p7pK20j44l0N9Q5j7j35k4J5
-91E4k2O7J40k28J14Q6q7k5J03l5M4o7Jj5N1j40K00n5j02k7Q6J5l8p1K9N6No5P7m3j0Kn4j
-258D5J24j20O9n8lJ23k3P9q6K7K0l9p7O3L3j44KM3m1l2J32nRQ3q4p8R2l1k1O4PJ8J68k32
$$ plain form
-426 127 173 139 45 90 291 136 132 91 253 56 79 196 162 20 273 35 169 162
$$ packed form
-426A27M6l4r4M5K01j55mm1J62j97K3J17l4j42K53k38J34p
-514A62
##PAGE=	F1=-1651.27
##FIRST=	4521.1594499999982872,	4521.1594499999982872,	0
##DATA TABLE=	(F2++(Y..Y)), PROFILE
$$ plain form
4521 148 82 157 33 59 83 41 40 85 79 62 67 179 166 95 157 235 148 28 24 104 80 82 163 84 131 100 40 70 196 183 58 122 30 233
4354 233 275 165 94 82 156 89 53 91 155 176 62 176 240 158 168 42 37 137 102 132 223 165 204 130 156 76 74 131 88 156 218 128 118
4191 118 108 48 84 135 89 130 385 163 113 190 163 150 66 27 96 196 84 55 136 29 106 57 73 63 116 105 74 90 117 111 259 55
4034 55 213 99 74 142 93 214 254 32 73 117 210 116 118 92 108 76 77 83 168 72 143 264 68 207 22 138 57 47 70 176 228 168
3876 168 86 179 7 164 220 144 77 156 226 173 91 58 188 11 121 107 106 163 61 107 79 147 122 32 15 69 80 99 52 130 105 175
3719 175 136 114 94 195 195 217 69 94 151 195 225 120 135 202 140 164 221 101 147 65 83 182 230 92 74 212 185 78 96 98 75 68 58
3556 58 42 162 137 38 56 34 119 189 235 237 216 250 71 137 88 73 80 136 82 166 192 175 36 142 93 143 117 158 103 112 101 21 87 38 98
3384 98 184 163 59 124 74 179 60 75 23 163 154 264 191 127 127 145 48 29 97 55 193 136 67 188 83 51 92 172 20 266 168
$$ packed form
4521A48o6P5j24K6K4m2jM5oj7NJ12j3p1O2P8q7j20mQ0k4KQ1p9M7l1o0L0J26j3j25O4r2K03
4354B33M2j10p1j2P4o7l6L8O4K1j14J14O4q2J0j26nJ00l5L0R1n8L9p4K6q0kN7m3O8O2r0j0
4191A18j0o0L6N1m6M1K55k22n0P7k7j3q4l9O9J00j12k9Q1j07P7m9J6j0N3j1l1J6K7oJ48k04
4034E5J58j14k5O8m9J21M0k22M1M4R3r4Kk6J6l2JOQ5r6P1J21j96J39j85J16q1j0K3J06N2o0
3876A68q2R3j72J57N6p6o7P9P0n3q2l3J30j77J10j4jN7j02M6k8O8k5r0j7N4J1J9m7P8k5P0
3719A75l9k2k0J01%K2j48K5N7M4L0j05J5O7o2K4N7j20M6q2J8R9M8j38j8J38k7j07J8Kk3pj0
3556E8j6J20k5r9J8k2Q5P0M6Kk1L4j79O6m9j5PN6n4Q4K6j7j39J06m9N0k6M1n5Rj1q0O6m9O0
3384I8Q6k1j04O5n0J05j19J5n2J40rJ10p3o4%J8r7j9O8m2J38n7o9J21j05l2M1Q0j52K46r8
$$ plain form
3232 168 231 154 113 90 78 55 105 33 54 116 144 131 133 173 143 191 218 22 158 268 241 632 544 66 119 175 637 606 179 25 39
3079 39 118 64 102 90 104 102 67 38 229 297 303 299 195 145 174 116 115 577 676 588 126 146 102 220 194 84 150 91 39 154 79 219 576
2917 576 129 264 77 83 68 434 860 599 357 170 111 240 160 147 60 40 93 105 45 117 105 200 208 145 300 218 174 27 221 110
2769 110 85 97 118 19 87 63 169 93 59 80 164 114 173 47 37 147 131 65 103 65 139 104 185 43 613 340 110 54 121 150 196
2616 196 262 107 287 323 172 114 118 189 90 66 92 203 243 149 52 88 58 156 157 28 69 126 212 119 120 133 161 106 58 44 105 79 163 199
2449 199 135 182 120 140 145 122 122 91 70 132 80 45 144 100 75 75 82 22 71 210 331 254 172 59 58 210 241 294 81 113 89 145 72 32 75
2277 75 79 114 84 63 32 74 84 46 80 17 177 161 51 119 163 86 8 133 117 185 180 189 25 127 97 13 82 144 176 112 113 33 145 170
2109 170 160 26 137 123 82 82 188 147 108 161 94 210 158 31 136 169 182 368 96 330 524 2912 2279 403 304 104 72
$$ packed form
3232A68O3p7m1k3j2k3N0p2K1O2K8j3KM0l0M8K7j96J36J10k7L91q8m78N3N6M62l1m27j54J4
3079C9P9n4L8j2J4kl5k9J91O8Omj04n0K9n8jM62R9q8m62K0m4J18k6j10O6n9n2J15p5J40L57
2917E76m47J35j87Oj5L66M26k61k42j87n9J29q0j3q7k0N3J2o0P2j2R5Qo3J55q2m4j47J94j11
2769A10k5J2K1r9O8k4J06p6l4K1Q4n0N9j26j0J10j6o6L8l8P4l5Q1j42N70k73k30n6O7K9M6
2616A96O6j55J80L6j51n8MP1r9k4K6J11M0r4r7L6l0R8Jj29M1N7Q6r3JJ3K8n5m8j4O1k6Q4L6
2449A99o4M7o2K0Nk3%l1k1O2n2l5R9m4k5%Po0M9J39J21p7q2j13jJ52L1N3k13L2k4N6p3m0M3
2277G5ML5l0k1l1M2J0l8L4o3J60j6j10O8M4p7p8J25j6O8nRj64J02l0q4O9O2L2o4Jq0J12K5
2109A70j0j34J11j4m1%J06m1l9N3o7J16n2j27J05L3J3J86k72K34J94K388o33j876r9k00l2
$$ plain form
1976 72 139 70 70 126 208 215 211 138 109 161 108 127 81 123 58 172 108 87 76 41 53 79 96 27 80 204 155 107 151 221 132 235 31 156
1809 156 75 208 179 191 61 109 43 102 96 32 127 161 30 151 115 156 127 185 52 263 119 79 265 291 206 99 130 33 77 79 114
1656 114 65 90 142 140 131 99 167 25 76 241 114 61 50 77 152 32 36 148 137 173 50 251 98 149 138 190 501 272 712 757 1417
1504 1417 753 1968 585 882 675 11197 12665 3449 1224 1238 1453 2203 2744 1982 7797 5574 2427 1673 939 681
1405 681 217 484 389 152 123 214 78 194 110 24 57 162 225 77 60 62 282 135 32 97 194 212 91 148 266 151 88 57 77
1263 77 121 221 201 241 104 63 26 95 42 173 352 106 76 158 297 294 82 114 90 49 149 56 61 119 84 64 104 100 52 125 186 230 19
1100 19 186 48 59 31 74 51 97 159 193 79 167 64 152 57 97 165 187 219 53 213 298 218 105 159 145 132 151 71 115 262 259 134
943 134 264 302 220 245 192 71 72 121 86 107 22 69 110 99 197 29 52 192 270 218 82 144 100 90 80 213 100 44 50 114 176 82 178
$$ packed form
1976G2O7o9%N6Q2Pmp3k9N2n3J9m6M2o5J14o4k1j1l5J2K6J7o9N3J24m9m8M4P0q9J03k04J25
1809A56q1J33k9J2j30M8o6N9oo4R5L4j31J21l6M1k9N8j33K11j44m0J86K6q5j07L1r7M4KL5
1656A14m9K5N2krl2O8j42N1J65j27n3j1K7P5j20MJ12j1L6j23K01j53N1j1N2L11k29M40M5O60
1504A417o64J215j383K97k07J0522J468r216k225J4K15P50N41p62N815k223l147p54p34k58
1405F81m64K67r5k37k9R1j36J16q4q6L3J05O3j48j7KK20j47j03O5R7J8j21N7J18j15o3l1K0
1263G7M4J00k0M0j37m1l7O9n3J31J79k46l0Q2J39lk12L2k4m1J00r3NN8l5k0M0mm8P3O1M4k11
1100A9J67j38J1k8M3k3M6O2L4j14Q8j03Q8r5M0O8K2L2j66J60Q5q0j13N4j4j3J9q0M4J47lj25
943A34J30L8q2K5n3j21JM9l5K1q5M7M1j1R8j68K3J40P8n2j36O2m4j0j0J33j13n6OO4O2r4R6
$$ plain form
780 178 124 187 98 160 164 121 67 40 173 88 267 189 32 40 53 41 118 55 248 71 180 114 109 139 21 92 52 93 97 127 110 116 177 169 110
608 110 85 116 102 124 188 148 48 40 62 61 64 95 110 29 106 189 249 95 764 986 1789 848 669 256 263 205 171 102 156 60 88 85 91 153
441 153 178 102 56 118 180 183 146 46 97 88 193 238 277 229 103 124 179 55 188 212 136 68 10 92 123 67 15 55 96 118 48 150 137
278 137 110 175 185 126 204 113 36 77 60 18 77 72 135 60 57 124 47 98 128 30 84 197 172 182 175 88 17 102 99 125 38 158 206 36 189
106 189 118 134 9 111 119 90 87 135 63 229 198 73 187 82 169 150 133 137 192 220 168 107 191 128 96 304 16 63 115 61 41 172
-52 172 79 18 60 230 234 106 37 88 103 80 228 131 166 131 101 76 225 92 206 134 127 140 162 61 188 110 144 48 84 156 82 69
-209 69 66 64 116 109 141 99 93 102 36 18 99 75 53 61 101 142 142 175 182 135 130 120 56 70 89 23 68 61 56 80 102 108 191 218 123 149 137 155 107 143 174
-411 174 233 256 79 81 92 50 107 242 169 66 122 194 179 37 47 112 104 148 116 55 111
$$ packed form
780A78n4O3q9O2Mm3n4k7J33q5J79p8j57QJ3j2P7o3J93j77J09o6nL0j18P1m0M1ML0j7OO1qn9
608A10k5L1j4K2O4m0j00qK2jLL1J5q1P7Q3O0j54O69K22Q03r41j79m13Pn8l4o9N4r6K8lOO2
441A53K5p6m6O2O2Ll7j00N1rJ05M5L9m8j26K1N5j24J33K4p6o8n8Q2L1n6n2M0M1K2p0J02j3
278A37k7O5J0n9P8r1p7M1j7m2N9nO3p5lO7p7N1L0r8N4J13k5J0pq7p1Q5lK6q7J20M8j70J53
106A89p1J6j25J02Qk9lM8p2J66l1j25J14j05Q7j9j7MN5K8n2o1Q4o3l2K08k88M7N2n4k0J31
-52A72r3o1M2J70Mj28o9N1J5k3J48r7L5l5l0k5J49j33J14p2pJ3K2j01J27p8L4r6L6P2p4j3
-209F9lkN2pL2m2oRo6j8Q1k4k2QM0M1%L3Pm7nj0o4J4J9o6M5pnK4K2OQ3K7r5K6j2J8m8L6L1
-411A74N9K3j77KJ1m2N7J35p3j03N6P2j5j42J0O5qM4l2o1N6
-514A11
##PAGE=	F1=-1661.11
##FIRST=	4521.1594499999982872,	4521.1594499999982872,	0
##DATA TABLE=	(F2++(Y..Y)), PROFILE
$$ plain form
4521 137 113 161 48 93 13 24 45 67 83 107 34 155 135 117 178 189 180 85 37 78 118 90 237 75 156 87 66 109 146 207 39 102 39
4359 39 225 241 166 129 68 147 116 27 129 106 152 80 129 210 167 135 28 13 95 80 109 265 156 203 109 159 17 79 131 55 195 210
4201 210 128 73 82 59 76 151 108 150 394 204 139 149 184 158 107 14 60 151 90 60 160 48 126 41 66 88 138 64 82 95 115 78 243
4039 243 26 205 113 65 107 101 206 259 47 36 85 200 120 145 53 82 80 102 71 145 68 101 242 52 208 82 187 65 38 55
3891 55 170 233 211 22 101 18 177 216 184 79 193 244 190 92 75 195 51 103 92 110 148 94 97 86 145 128 20 10 99 134 76 77
3734 77 133 92 194 111 101 78 155 146 217 66 97 97 162 199 106 149 217 151 174 226 92 139 58 100 167 216 133 78 187 198 35 39 50 62
3566 62 91 63 38 146 135 36 123 65 88 168 240 220 187 235 114 147 101 55 81 163 88 169 247 126 51 148 105 141 89 136 129 117 98 37
3399 37 102 27 71 173 117 51 131 57 139 43 109 37 106 124 274 148 103 151 177 100 54 63 64 157 111 87 168 52 87 69 150 19 218
$$ packed form
4521A37k4M8j13M5q0J1K1K2J6K4p3J21k0j8O1J1rr5m8M1M0k8J47j62Q1o9k1M3L7O1j68O3o3
4359C9J86J6p5l7o1P9l1q9J02k3M6p2M9Q1m3l2j07j5Q2j5K9J56j09M7r4N0j42O2N2p6J40J5
4201B10q2n5Rk3J7P5m3M2K44j90o5J0L5k6n1r3M6R1o1l0J00j12P8q5K5K2N0p4J8J3K0l7J65
4039B43k17J79r2m8M2oJ05N3k12j1M9J15q0K5r2K9kK2l1P4p7L3J41j90J56j26J05j22k7J7
3891E5J15O3k2j89P9q3J59L9l2j05J14N1n4r8j7J20j44N2j1J8L8n4Lj1N9j7j08j0Q9L5n8J
3734G7N6m1J02q3j0k3P7rP1j51L1%O5L7r3M3O8o6K3N2j34M7q1M2O7M9q3n5J09J1j63MJ1J2
3566F2K9k8k5J08j1r9Q7n8K3Q0P2k0l3M8j21L3m6m6K6Q2p5Q1P8j21p5R7m3L6n2M7pj2j9o1
3399C7O5p5M4J02n6o6Q0p4Q2r6O6p2O9J8J50j26m5M8K6p7m6RJR3m6k4Q1j16L5j8Q1j31J99
$$ plain form
3236 218 139 288 179 140 71 68 86 120 58 80 84 108 122 132 173 146 154 247 38 136 277 207 619 525 196 41 217 504 309 57 27
3084 27 20 109 97 114 99 91 72 65 32 259 301 306 307 203 171 214 98 124 526 640 541 162 142 119 200 195 114 185 75 73 194 54 231 583
2917 583 121 254 96 110 66 524 1035 610 362 152 150 234 178 129 40 42 44 75 52 113 86 150 184 115 284 247 150 52 227 119 62
2764 62 119 119 23 93 36 166 80 75 74 154 108 176 52 58 168 162 49 94 72 123 56 289 119 750 459 118 73 161 161 182 243 132 353
2602 353 362 191 117 104 167 101 60 125 188 215 157 25 104 100 124 169 30 63 139 218 120 183 125 159 64 56 79 156 77 144 209 124 165 136 167
2429 167 128 149 113 110 59 108 111 51 178 113 92 89 89 65 78 198 318 282 163 106 69 210 230 267 42 99 137 161 93 13 71 109 133 100
2262 100 73 80 86 69 62 53 8 183 210 55 115 192 64 62 168 106 214 179 207 89 115 99 46 107 173 175 84 161 54 180 135 166 52
2099 52 106 141 107 124 176 179 83 154 70 218 244 79 104 197 134 362 90 233 509 2818 2158 473 279 187 111 105 84 83 99 183 269
$$ packed form
3236B18p9J49j09l9o9lJ8L4o2K2MK4J4J0M1k7QR3k09R8J41p0M12r4l29j55J76K87j95k52l0
3084B7pQ9j2J7j5qj9pl3K27M2NJj04l2M3j16K6M02J14r9l79k0k3Q1nq1P1j10kJ21j40J77L52
2917E83m62J33j58J4m4M58N11m25k48k10kQ4n6m9q9KKL1k3O1k7O4L4o9J69l7r7r8J75j08n7
2764F2N7%r6P0n7J30q6njQ0m6O8j24OJ10oj13M5k2N1o7K33j70O31k91l41m5Q8%K1O1j11K21
2602C53Rj71p4j3O3o6m1O5O3K7n8j32P9mK4M5j39L3P6P9r8O3n8L4r5qK3P7p9O7O5q5M1k9L1
2429A67l9K1l6ln1M9Lo0J27o5k1l%k4J3J20J20l6j19n7l7J41K0L7k25N7L8K4o8q0N8L8K4l3
2262A00k7POj7prm5J75K7j55O0P7j28kJ06o2J08l5K8j18K6j6n3O1O6Kr1P7j07J26m5L1j14
2099E2N4L5l4J7N2Lr6P1q4J48K6j65K5R3o3K28k72J43K76K309o60j685j94r2p6ok1jJ6Q4Q6
$$ plain form
1947 269 198 76 108 201 49 115 64 138 88 123 102 134 89 50 41 70 103 55 95 254 195 152 123 260 104 232 71 228 73 136 175
1794 175 138 81 169 58 74 194 35 102 160 53 88 133 138 176 102 53 241 183 43 317 241 221 136 154 93 136 19 164 14 120
1647 120 127 42 204 166 163 91 16 344 170 140 52 139 98 177 159 185 158 397 130 502 137 385 345 346 528 193 300 684 1696
1504 1696 743 2073 809 2313 5617 49701 94541 23373 5369 2749 660 720 2520 2132 8834 6066 2729
1420 2729 2144 1428 1111 460 254 342 432 176 86 139 323 45 139 94 175 365 22 70 72 318 246 106 62 212 323 15 229
1287 229 291 146 95 91 30 150 212 267 217 155 70 75 162 32 130 376 22 106 113 331 257 91 122 130 55 209 75 33 164 48 114
1135 114 57 156 35 117 210 212 34 242 85 117 32 93 12 70 158 193 53 183 104 166 118 111 157 193 248 85 259 273 225 68 132
982 132 156 128 184 105 161 215 284 140 233 364 224 282 175 94 51 103 75 133 69 65 151 111 226 23 108 206 298 192 78 129 151 26
$$ packed form
1947B69p1j22L2R3j52O6n1P4n0L5k1L2m5l9rK9L3m8M0J59n9m3k9J37j56J28j61J57j55O3L9
1794A75l7n7Q8j11J6J20j59O7N8j07L5M5NL8p4m9J88n8j40K74p6k0q5J8o1M3j17J45j50J06
1647A20Pq5J62l8lp2p5L28j74l0q8Q7m1P9j8K6k7K39k67L72l65K48m0JJ82l35J07L84J012
1504A696r53J330j264J504L304M4084M4840p1168j8004k620k089O0J800l88O702k768l337
1420B729n85p16l17o51k06Q8R0k56r0N3J84k78R4m5Q1J90l43M8KK46p2j40m4J50J11l08K14
1287B29O2j45n1mo1J20O2N5n0o2q5NQ7j30R8K46l54Q4PK18p4j66L1Qp5J54j34m2J31j16O6
1135A14n7R9j21Q2R3Kj78K08j57L2q5O1q1N8Q8L5j40J30p9O2m8pM6L6N5j63J74J4m8j57O4
982A32K4k8N6p9N6N4O9j44R3J31j40N8j07q1m3N2k8N8o4mQ6m0J15k03Q5R8R2j06j14N1K2j25
$$ plain form
825 26 83 169 118 124 69 136 142 123 200 116 171 81 150 185 122 54 30 217 51 282 185 79 83 84 42 100 65 253 67 163 96 113 155 20
657 20 37 55 147 83 181 129 102 196 139 140 95 69 127 128 249 150 23 51 9 75 66 108 101 30 148 160 243 68 1607 922 1692 509 982
495 982 359 210 189 153 90 189 44 74 64 113 148 188 70 95 123 201 216 136 44 131 39 153 193 274 249 134 130 136 94 174 213 175 66
332 66 40 74 150 67 35 41 75 99 58 162 145 112 181 147 127 223 108 85 91 101 39 69 85 169 47 43 106 37 107 172 25 80 200 192 221
160 221 161 82 27 87 94 73 42 124 236 24 163 72 95 34 96 129 61 111 163 67 229 150 82 197 133 133 94 160 150 229 219 183 127 202
-7 202 191 110 258 14 93 118 81 72 129 66 42 17 213 245 130 80 123 144 65 237 234 176 60 78 76 212 39 198 116 111 143 157 72
-170 72 153 43 176 82 62 146 53 96 66 25 110 141 121 98 104 134 35 70 66 79 26 67 128 161 115 124 205 94 78 100 38 15 34 20 110
-342 110 97 97 128 86 98 214 213 115 211 139 178 119 152 177 240 184 95 28 69 62 121 192 201 33 124 164 250 38 68 118 160 67 142 12 117
$$ packed form
825B6N7Q6n1On5O7Oj9P7q4N5r0O9L5o3o8k4J87j66K31r7j06MJm2N8l5J88j86R6o7J7M2j35
657B0J7J8R2o4R8n2k7R4n7Jm5k6N8JJ21r9j27K8m2O6rM2pp1J18J2Q3j75J539o85P70j183M73
495I82o23j49k1l6o3R9j45L0j0M9L5M0j18K5K8P8J5q0r2Q7r2J14M0Q1k5j15mOm2Q0L9l8j09
332F6k6L4P6q3l2OL4K4m1J04j7l3O9l4k0R6j15k3OJ0o2L0J6Q4j22mO3o9P0O5j47N5J20qK9
160B21o0p9n5O0Pk1l1Q2J12k12J39r1K3o1O2L3o8N0N2r6J62p9o8J15o4%l9O6j0P9j0l6n6P5
-7B02j1q1J48k44P9K5l7rN7o3k4k5J96L2j15n0M3K1p9J72ln8j16J8kJ36j73J59q2nL2J4q5
-170G2Q1j10J33r4k0Q4r3M3l0m1Q5L1k0k3OL0r9L5mJ3n3M1O1L3m6RQ1j11j6K2o2k3J9j4R0
-342A10j3%L1m2J2J16jr8R6p2L9n9L3K5O3n6q9o7M1pN9P1Rj68R1M0Q6k12L0N0M2r3P5j30J05
-514A17
##PAGE=	F1=-1670.96
##FIRST=	4521.1594499999982872,	4521.1594499999982872,	0
##DATA TABLE=	(F2++(Y..Y)), PROFILE
$$ plain form
4521 125 143 141 83 94 56 54 67 42 98 130 19 112 110 119 149 164 169 135 24 71 123 105 275 76 190 132 81 113 122 195 32 89 29 192
4354 192 217 146 142 40 161 133 12 161 83 110 72 98 169 149 116 62 53 52 56 86 289 156 184 95 133 31 58 130 59 219 176 135 31
4191 31 68 79 79 157 125 150 404 207 139 116 197 141 129 18 27 95 73 69 182 68 143 55 79 102 132 55 105 77 106 54 199 7 191
4029 191 111 65 82 94 193 254 63 27 36 192 117 161 4 60 90 119 71 126 58 53 198 47 218 124 217 70 36 62 155 229 245 58
3871 58 24 23 179 217 206 91 212 256 197 83 87 198 89 83 90 117 138 123 101 90 141 135 26 20 115 190 92 95 134 83 198 86 103 81
3704 81 76 96 198 71 82 50 126 154 77 147 227 148 170 204 72 114 69 122 140 195 158 71 167 195 39 36 43 58 115 58 51 133 135 70 181
3532 181 121 56 141 229 198 157 216 141 151 92 39 89 159 95 161 277 90 65 150 122 147 47 105 146 122 98 80 114 76 63 143 81 57
3369 57 128 57 103 59 140 63 86 98 264 121 78 163 198 135 79 23 80 118 101 101 145 63 113 62 117 44 176 100 324 204 142 76 51
$$ packed form
4521A25J8kn8J1l8kJ3k5N6L2j11R3kRL0J5Nl4j11M7N2j8J70j99J14n8n1L2RP3j63N7o0J63
4354A92K5p1mj02J21k8j21J49p8K7l8K6P1k0l3n4rjML0K03j33K8q9L8j02K7P2p1J60m3m1j04
4191C1L7J1%P8l2K5K54j97o8k3Q1n6j2j11RO8k2mJ13j14P5q8K4K3L0p7N0k8K9n2J45j92J84
4029A91q0m6J7J2R9O1j91l6RJ56p5M4j57N6L0K9m8N5o8nJ45j51J71r4R3j47l4K6R3P4J6j87
3871E8l4jJ56L8j1j15J21M4n9j14MJ11j09oPK7K1j5k2j1N1oj09oR5P5r8LL9n1J15j12J7k2
3704H1nK0J02j27J1l2P6K8p7P0Q0p9K2L4j32M2m5N3J8N5l7q7R6K8j56lPJ5N7n7pQ2Ko5J11
3532A81o0o5Q5Q8l1m1N9p5J0n9n3N0P0o4O6J16j87k5Q5k8K5j00N8M1k4k4j8L4l8j3Q0o2k4
3369E7P1p1M6m4Q1p7K3J2J66j43m3Q5L5o3n6n6N7L8j7%M4q2N0n1N5p3J32p6K24j20o2o6k5
$$ plain form
3207 51 120 122 79 112 63 65 109 120 157 156 130 259 50 114 263 167 574 490 319 37 234 426 283 238 63 11 123 128 141 111 78 43
3049 43 79 15 268 302 304 315 203 197 237 74 138 489 618 491 215 148 134 165 190 142 205 50 91 228 30 238 592 132 248
2907 248 117 148 96 601 1141 637 399 155 170 211 174 118 49 92 61 33 70 112 69 106 157 72 273 245 130 72 211 120 43 150
2759 150 126 26 86 33 141 78 71 66 130 114 178 114 79 176 197 46 78 93 106 30 380 220 812 532 136 116 185 174 146 208 139 408
2602 408 391 203 120 120 119 118 74 144 171 189 151 22 120 136 88 178 43 59 132 208 127 239 122 138 58 83 112 181 65 115 202 120 140
2439 140 137 174 114 156 105 110 49 99 143 102 200 112 93 100 111 143 97 173 283 266 167 161 86 185 206 220 21 75 184 177 120 10 69 132 156
2267 156 114 65 125 97 67 110 62 11 186 229 58 122 209 52 116 189 97 219 179 206 141 110 143 84 110 178 178 61 184 95 175 116
2109 116 150 53 100 173 126 152 186 210 66 157 47 218 298 142 83 200 114 324 88 160 594 2513 1885 501 286 228 168 47
$$ packed form
3207E1O9Km3L3m9KM4J1L7jk6J29k09O4J49r6M07q4j71k82J97J92j43m5j75n2J12NJ3l0l3l5
3049D3L6o4K53L4KJ1j12oM0j63O4L51J29j27k76o7j4L1K5m8O3j55M1J37j98K08L54m60J16
2907B48j31L1n2N05N40n04k38k44J5M1l7n6o9M3l1k8L7M2m3L7N1q5K01k8j15n8J39r1p7J07
2759A50k4j00O0n3J08o3pnO4j6O4o4l5R7K1j51L2J5J3p6L50j60N92k80l96k0O9j1k8O2o9K69
2602D08j7j88q3%jjm4P0K7J8l8j29R8J6m8R0j35J6P3P6q1J12j17J6q0K5K9O9j16N0Q7q2K0
2439A40lL7o0M2n1No1N0M4m1R8q8j9PJ1L2m6P6J10j7r9op5R9K1J4j99N4J09pn7j10N9O3K4
2267A56m2m9O0k8l0M3m8n1J75M3j71O4Q7j57O4P3r2J22m0K7o5l1L3n9K6O8%j17J23q9Q0n9
2109A16L4r7M7P3m7K6L4K4j44R1j10J71Q0j56n9J17q6K10k36P2M34J919o28j384k15n8o0j21
$$ plain form
1971 47 88 75 93 174 281 171 66 99 230 38 85 72 155 102 92 62 172 108 72 74 57 94 75 88 290 222 180 118 265 102 233
1819 233 88 263 33 94 172 94 96 196 46 73 231 38 96 139 86 42 111 134 177 64 32 227 188 50 308 211 198 160 127 116
1671 116 154 13 152 38 145 113 70 216 167 171 79 34 368 191 169 90 152 65 242 226 169 190 470 136 550 157 411 356 325
1528 325 424 60 151 694 1676 419 1405 1278 3056 7030 55246 110246 29012 6556 3523 1211 218 2212 2025
1435 2025 8842 6087 2983 2604 1863 1419 1190 1024 268 509 200 94 207 354 85 157 157 142 423 29 74 72 320 291 117
1312 117 117 211 353 33 259 292 111 92 85 68 179 197 261 222 185 62 91 179 66 123 344 63 100 90 318 240 112 112 143 83 227
1159 227 101 27 209 10 129 47 189 69 98 237 218 67 253 101 152 31 86 32 45 149 201 36 186 130 179 150 113 152
1021 152 166 290 121 277 272 218 50 156 167 128 179 134 191 187 272 141 214 391 246 283 165 98 27 100 59 143 93 67 191 156 222
$$ packed form
1971D7M1j3J8Q1J07j10j05L3J31j92M7j3Q3n3j0l0J10o4l6Kj7L7j9J3K02o8m2o2J47j63J31
1819B33j45J75k30O1P8p8KJ00j50K7J58j93N8M3n3m4O9K3M3j13l2J95l9j38K58r7j3l8l3j1
1671A16L8j41J39j14J07l2m3J46m9Mr2m5L34j77k2p9O2q7J77j6n7K1K80l34M14l93K54n5l1
1528C25R9l64R1N43R82j257R86j27J778L974M8216N5000q1234k2456l033k312r93J994j87
1435B025O817k755l104l79p41m44k29j66p56K41l09j06J13J47k69P2%j5K81l94M5kK48k9j74
1312A17%R4J42l20K26L3j81j9pj7J11J8O4l9l7j23K9Q8j13N7K21k81L7j0K28p8j28%L1o0J44
1159B27j26p4J82j99J19q2J42j20K9J39j9j51J86j52N1j21N5n4J3J04N2j65J50n6M9k9l7L9
1021A52J4J24j69J56nn4j68J06J1l9N1m5N7mQ5j31P3J77j45L7j18o7p1P3m1Q4n0k6J24l5O6
$$ plain form
869 222 35 143 225 301 177 71 123 186 37 87 132 129 183 110 159 129 154 192 120 153 61 131 184 101 47 8 247 25 269 190 97 114
711 114 132 50 87 72 239 71 127 93 115 148 17 34 39 198 90 220 129 69 207 138 165 112 26 153 123 281 154 67 51 34 74
559 74 69 132 107 51 174 122 207 118 1845 1199 1445 1056 1342 363 169 172 137 83 185 25 51 56 136 139 171 57 149 135 212 232 124
406 124 60 162 34 108 152 254 262 169 140 87 127 176 205 195 112 104 70 163 53 50 30 51 86 61 160 145 105 173 130 116 209 88 117 116 157
234 157 52 79 90 198 48 29 104 35 107 187 41 84 203 203 253 161 82 55 80 76 62 85 105 243 24 158 94 103 67 55 136 32
76 32 130 178 75 211 107 89 206 173 88 42 170 185 255 213 196 145 211 254 143 205 8 101 118 84 90 115 54 78 62 170 230 130
-81 130 129 154 152 51 257 302 173 13 64 83 169 15 189 93 102 132 158 71 148 24 179 119 51 122 29 93 79 38 126 168 90 105 116
-244 116 154 50 113 69 62 19 56 135 195 85 89 213 63 92 96 30 25 10 27 112 111 122 147 75 95 211 202 99 244 157 183 114 165 172 208
$$ packed form
869B22j87J08Q2P6j24j06N2O3j49N0M5lN4p3M9l0K5L8p2L3r2P0N3q3n4l9K39k22K44p9r3J7
711A14J8q2L7j5J67j68N6l4K2L3j31J7NJ59j08J30r1o0J38o9K7n3q6J27l0J58j27q7j6j7M0
559G4nO3k5n6J23n2Q5q9J727o46K46l89K86r79j94Ll5n4J02j60K6NQ0LL2j14R2j4P7K0j08
406A24o4J02j28P4M4J02Qr3k9n3M0M9K9j0q3ql4R3j10lk0K1L5k5R9j5m0O8m3j4R3j21K9jM1
234A57j05K7J1J08j50j9P5o9P2Q0j46M3J19%N0r2p9k7K5mj4K3K0J38k19J34o4Rl6j2Q1j04
76C2R8M8j03J36j04j8J17l3q5m6J28J5P0m2j7n1O6M3j11O2j97R3J7l4OK5o1K4j6J08O0j00
-81A30jK5kj01K06M5j29j60N1J9Q6j54J74r6RL0K6q7P7j24J55o0o8P1r3O4j4m1Q8M2p8J5J1
-244A16L8j04O3m4pm3L7P9O0j10MJ24j50K9Mo6nj5J7Q5jJ1K5p2K0J16rj03J45q7K6o9N1PL6
$$ plain form
-416 208 144 98 17 41 60 100 136 205 31 100 153 270 64 135 141 185 31 120 22 110
$$ packed form
-416B08o4m6q1K4J9M0L6O9j74O9N3J17k06P1OM4j54Q9r8Q8
-514A10
##PAGE=	F1=-1680.8
##FIRST=	4521.1594499999982872,	4521.1594499999982872,	0
##DATA TABLE=	(F2++(Y..Y)), PROFILE
$$ plain form
4521 107 139 129 98 74 92 96 75 19 113 121 32 58 80 97 96 151 130 165 16 76 103 118 279 87 227 164 94 94 121 167 28 74 8 146
4354 146 198 115 137 24 187 147 36 188 95 58 42 72 128 111 102 86 84 59 33 80 289 155 150 89 80 62 20 119 79 229 130 146 16
4191 16 69 102 87 154 130 132 407 176 127 90 210 107 137 33 51 43 42 84 197 91 156 86 98 110 109 71 134 59 95 42 137 35 172
4029 172 97 70 66 79 180 237 71 31 30 179 108 168 57 51 102 129 76 112 45 16 139 51 231 143 220 66 36 83 133 215 266 127
3871 127 45 16 178 217 211 102 212 256 186 80 96 198 127 69 85 121 134 140 101 95 131 147 49 39 119 234 123 103 132 90 189 58
3714 58 114 104 26 56 168 75 58 10 95 108 36 132 229 132 156 157 40 81 88 125 103 173 166 61 157 183 69 76 74 56 136 45 76 123 141 107
3537 107 224 181 46 105 204 177 144 201 150 138 64 34 108 135 96 140 282 72 76 150 137 163 19 76 158 126 94 123 128 121 80 102 59 68
3369 68 118 63 75 86 167 89 114 77 243 111 59 163 201 151 103 61 98 97 118 109 136 92 119 68 81 58 134 62 333 224 127 90 31 146
$$ packed form
4521A07L2j0l1k4J8Mk1n6R4Qq9K6K2J7jN5k1L5j49O0K7J5J61j92J40o3p0%K7M6j39M6o6J38
4354A46N2q3K2j13J63m0j11J52r3l7j6L0N6j7rj6kk5k6M7K09j34no1rj8m2R9m0J50r9J6j30
4191A6N3L3j5O7k4KK75k31m9l7J20j03L0j04J8qjM2J13j06O5p0J2J2jl8O3p5L6n3R5j02J37
4029A72p5k7mJ3J01N7j66m0jJ49p1O0j11oN1K7n3L6o7k9J23q8J80q8P7j54l0M7N0Q2N1j39
3871A27q2k9J62L9oj09J10M4p0j06J6J02p1n8J6L6J3Ol9oL6J6r8j0Q0J15j11k0K9m2R9j31
3714E8N6j0p8L0J12r3j7m8Q5J3p2R6R7r7K4Jj17M1PL7k2P0pj05R6K6j14Pkj8Q0r1L1M7J8l4
3537A07J17m3j35N9R9k7l3N7n1j2p4l0P4K7l9M4J42k10MP4j3K6j44N7Q2l2l2K9Npm1K2m3R
3369F8N0n5J2J1Q1p8K5l7J66j32n2J04L8n0m8m2L7jK1rK7m4K7n1J3k3P6p2K71j09r7l7n9J15
$$ plain form
3202 146 111 95 139 99 35 96 104 127 165 116 254 63 94 229 124 513 459 394 98 229 382 475 397 85 43 146 157 162 126 64 38
3049 38 98 30 262 299 299 325 195 213 238 58 167 465 616 450 276 161 146 122 185 165 212 22 87 256 29 238 590 154
2912 154 249 143 183 125 654 1183 708 469 182 169 178 148 108 77 136 111 24 93 121 57 74 135 47 263 217 114 86 183 104 46 181
2759 181 143 29 66 36 98 75 49 59 95 122 180 150 95 183 231 77 58 123 93 30 442 257 795 555 156 156 192 184 96 157 132 442
2602 442 404 207 125 157 70 132 92 147 151 169 139 24 134 163 62 185 62 59 107 191 134 281 119 115 69 122 144 185 49 82 181 117
2444 117 109 127 167 102 148 91 103 39 120 176 139 202 97 81 98 140 204 132 137 228 217 174 196 100 146 165 162 46 68 225 186 141 40 68
2277 68 142 174 123 50 157 111 77 136 101 13 182 224 60 134 220 52 169 196 90 204 178 189 166 117 189 122 94 161 179 46 188
2124 188 140 139 99 116 37 108 212 141 168 212 238 86 159 21 217 316 192 67 186 103 258 96 101 685 2059 1516 483 317
$$ packed form
3202A46l5j6M4m0o4O1QK3L8m9J38j91L1J35j05L89n4o5k96J31J53R3p8l12m2J03J1Nl6o2k6
3049C8O0o8K32L7%K6j30J8K5j80J09K98J51j66j74j15j5k4O3k0M7j90O5J69k27K09L52m36
2912A54R5j06M0n8N29N29m75k39k87j3Rl0m0l1N9k5q7O9K8o4J7O1q8K16m6j03k8R7p9n8J35
2759A81l8j14L7l0O2k3k6J0L6K7N8l0n5Q8M8j54j9O5l0o3M12j85N38k40l99%L6qq8O1k5L10
2602D42l8j97q2L2q7O2m0N5MJ8l0j15J10K9j01J23j23lM8Q4n7J47j62mm6N3K2M1j36L3R9o4
2444A17qJ8M0o5M6n7J2o4Q1N6l7O3j05j6J7M2O4p2NR1j1m3K2r6M6J9lj16K2J57l9m5j01K8
2277F8P4L2n1p3J07m6l4N9l5q8J69M2j64P4Q6j68J17K7j06J14k6J1k3m9P2o7k8O7J8j33J42
2124A88m8jm0J7p9P1J04p1K7M4K6j52P3j38J96R9j24j25J19q3J55j62NN84J374n43j033j66
$$ [...]
-514D2
##END NTUPLES=	nD NMR SPECTRUM
##END=	
##END=	
