##TITLE=	B9y$vcfsQUenbgMTyF3NnQ.41.ser
TM-VI-136solid cosy

##JCAMP-DX=	6.0	$$ MestReNova 14.3.0-30573
##DATA TYPE=	LINK
##BLOCK_ID=	1
##BLOCKS=	2    
##ORIGIN=	Mestrelab Research S.L.
##OWNER=	hrzepa
##$MNOVA/LINK_BLOCK_TYPE=	ITEM	$$ NMR Spectrum
##$MNOVA/ITEM/POLYGON=	(XY..XY)
5321,5835
8722,5835
8722,8208
5321,8208
5321,5835
##$MNOVA/ITEM/Z=	0
##$MNOVA/ITEM/ANGLE=	0
##TITLE=	B9y$vcfsQUenbgMTyF3NnQ.41.ser
##JCAMP-DX=	6.0	$$ MestReNova 14.3.0-30573
##BLOCK_ID=	2
##DATA TYPE=	MNOVA NMR VIEW DATA
##DATA CLASS=	MNOVA VIEW DATA
##$MNOVA/2D/THRESHOLD=	16.942537307739257813
##$MNOVA/ITEM/ZOOM/X=	-1.2849598716208046056,	11.297249999948046906
##$MNOVA/ITEM/ZOOM/Y=	-1.2849598716208046056,	11.297249999948046906
##END=	
##TITLE=	B9y$vcfsQUenbgMTyF3NnQ.41.ser
##JCAMP-DX=	6.0	$$ MestReNova 14.3.0-30573
##BLOCK_ID=	3
##DATA TYPE=	nD NMR SPECTRUM
##DATA CLASS=	NTUPLES
##NUMDIM=	2
##ORIGIN=	Bruker BioSpin GmbH
##OWNER=	nmr
##.OBSERVE FREQUENCY=	400.20200099999999566
##.OBSERVE NUCLEUS=	^1H
##.SOLVENT NAME=	CDCl3
##.PULSE SEQUENCE=	cosygpqf
##LONGDATE=	2021/10/25 16:37:05.000
##.ACQUISITIONMODE=	SIMULTANEOUS (DQD)
##$ORIGINAL FORMAT=	Bruker XWIN-NMR
##$MNOVA/SCALES_VERSION=	9
##$PARAMETER FILE=	(acqu2s, ASCII, /private/var/folders/f6/rjf_tdyn2v98c5c0wvkgn4s80000gn/T/B9y$vcfsQUenbgMTyF3NnQ/41/acqu2s, 0)
$$ ##TITLE= Parameter file, TOPSPIN		Version 3.2
$$ ##JCAMPDX= 5.0
$$ ##DATATYPE= Parameter Values
$$ ##NPOINTS= 221	$$ modification sequence number
$$ ##ORIGIN= Bruker BioSpin GmbH
$$ ##OWNER= nmr
$$ $$ 2021-10-25 16:46:04.084 +0100  nmr@CZC2439F63
$$ $$ /opt/topspin/data/agmb/nmr/Oct25-2021/41/acqu2s
$$ $$ process /opt/topspin3.2/prog/mod/go
$$ ##$ACQT0= 0
$$ ##$BF1= 400.2
$$ ##$FnMODE= 1
$$ ##$NUC1= <1H>
$$ ##$NusJSP= 0
$$ ##$NusT2= 1
$$ ##$NusTD= 220
$$ ##$O1= 2001.00000000702
$$ ##$SFO1= 400.202001
$$ ##$SW= 12.5944462247833
$$ ##$SW_h= 5040.32258064516
$$ ##$TD= 220
$$ ##END=
$$ 
##$PARAMETER FILE=	(acqus, ASCII, /private/var/folders/f6/rjf_tdyn2v98c5c0wvkgn4s80000gn/T/B9y$vcfsQUenbgMTyF3NnQ/41/acqus, 0)
$$ ##TITLE= Parameter file, TOPSPIN		Version 3.2
$$ ##JCAMPDX= 5.0
$$ ##DATATYPE= Parameter Values
$$ ##NPOINTS= 12	$$ modification sequence number
$$ ##ORIGIN= Bruker BioSpin GmbH
$$ ##OWNER= nmr
$$ $$ 2021-10-25 16:46:07.365 +0100  nmr@CZC2439F63
$$ $$ /opt/topspin/data/agmb/nmr/Oct25-2021/41/acqus
$$ $$ process /opt/topspin3.2/prog/mod/shimcntl
$$ ##$ACQT0= 1000000
$$ ##$AMP= (0..31)
$$ 100 100 100 100 100 100 100 100 100 100 100 100 100 100 100 100 100 100
$$ 100 100 100 100 100 100 100 100 100 100 100 100 100 100
$$ ##$AMPCOIL= (0..19)
$$ 0 0 0 0 0 0 0 0 0 0 0 0 0 0 0 0 0 0 0 0
$$ ##$ANAVPT= -1
$$ ##$AQSEQ= 0
$$ ##$AQ_mod= 3
$$ ##$AUNM= <au_zg>
$$ ##$AUTOPOS= <51 >
$$ ##$BF1= 400.2
$$ ##$BF2= 400.2
$$ ##$BF3= 400.2
$$ ##$BF4= 400.2
$$ ##$BF5= 400.2
$$ ##$BF6= 400.2
$$ ##$BF7= 400.2
$$ ##$BF8= 400.2
$$ ##$BYTORDA= 0
$$ ##$CAGPARS= (0..11)
$$ 0 0 0 0 0 0 0 0 0 0 0 0
$$ ##$CFDGTYP= 0
$$ ##$CFRGTYP= 9
$$ ##$CHEMSTR= <none>
$$ ##$CNST= (0..63)
$$ [...]
$$ 0 0 0 0
$$ ##$ShimPowMaxUC= (0..63)
$$ 130000 130000 130000 130000 130000 130000 130000 130000 130000 130000 130000
$$ 130000 130000 130000 130000 130000 130000 130000 130000 130000 0 0 0 0
$$ 0 0 0 0 0 0 0 0 0 0 0 0 0 0 0 0 0 0 0 0 0 0 0 0 0 0 0 0 0 0 0 0 0 0 0 0
$$ 0 0 0 0
$$ ##$ShimPowMaxUG= (0..63)
$$ 524287 524287 524287 524287 524287 524287 524287 524287 524287 524287 524287
$$ 524287 524287 524287 524287 524287 524287 524287 524287 524287 0 0 0 0
$$ 0 0 0 0 0 0 0 0 0 0 0 0 0 0 0 0 0 0 0 0 0 0 0 0 0 0 0 0 0 0 0 0 0 0 0 0
$$ 0 0 0 0
$$ ##$ShimPowRcbType= 3
$$ ##$ShimPowRes= (0..63)
$$ 1e-20 1e-20 1e-20 1e-20 1e-20 1e-20 1e-20 1e-20 1e-20 1e-20 1e-20 1e-20
$$ 1e-20 1e-20 1e-20 1e-20 1e-20 1e-20 1e-20 1e-20 0 0 0 0 0 0 0 0 0 0 0 0
$$ 0 0 0 0 0 0 0 0 0 0 0 0 0 0 0 0 0 0 0 0 0 0 0 0 0 0 0 0 0 0 0 0
$$ ##$ShimPowRng0= (0..63)
$$ 1 1 1 1 1 1 1 1 1 1 1 1 1 1 1 1 1 1 1 1 0 0 0 0 0 0 0 0 0 0 0 0 0 0 0 0
$$ 0 0 0 0 0 0 0 0 0 0 0 0 0 0 0 0 0 0 0 0 0 0 0 0 0 0 0 0
$$ ##$ShimPowRng1= (0..63)
$$ 1 1 1 1 1 1 1 1 1 1 1 1 1 1 1 1 1 1 1 1 0 0 0 0 0 0 0 0 0 0 0 0 0 0 0 0
$$ 0 0 0 0 0 0 0 0 0 0 0 0 0 0 0 0 0 0 0 0 0 0 0 0 0 0 0 0
$$ ##$ShimPowRng2= (0..63)
$$ 1 1 1 1 1 1 1 1 1 1 1 1 1 1 1 1 1 1 1 1 0 0 0 0 0 0 0 0 0 0 0 0 0 0 0 0
$$ 0 0 0 0 0 0 0 0 0 0 0 0 0 0 0 0 0 0 0 0 0 0 0 0 0 0 0 0
$$ ##$ShimPowRng3= (0..63)
$$ 1 1 1 1 1 1 1 1 1 1 1 1 1 1 1 1 1 1 1 1 0 0 0 0 0 0 0 0 0 0 0 0 0 0 0 0
$$ 0 0 0 0 0 0 0 0 0 0 0 0 0 0 0 0 0 0 0 0 0 0 0 0 0 0 0 0
$$ ##$ShimSysFunc= (0..63)
$$ 1 2 3 4 5 7 9 11 15 16 8 10 12 14 6 17 13 18 19 20 0 0 0 0 0 0 0 0 0 0
$$ 0 0 0 0 0 0 0 0 0 0 0 0 0 0 0 0 0 0 0 0 0 0 0 0 0 0 0 0 0 0 0 0 0 0
$$ ##$ShimSysMatrix= 0
$$ ##$ShimSysType= 1
$$ ##$TFXNUM= 0
$$ ##$TRIPLO2= 0
$$ ##$VTU= 2
$$ ##$VTUETH= <149.236.99.20>
$$ ##$VTUTY= <no>
$$ ##$WBREFAM= (0..15)
$$ 135.5 97.7 100 100 100 100 100 100 100 100 100 100 100 100 100 100
$$ ##$WBREFLM= (0..15)
$$ 0 0 0 0 0 0 0 0 0 0 0 0 0 0 0 0
$$ ##$WBREFPH= (0..15)
$$ 72.26 -67.22 0 0 0 0 0 0 0 0 0 0 0 0 0 0
$$ ##$WBSGU= (0..15)
$$ 0 0 0 0 0 0 0 0 0 0 0 0 0 0 0 0
$$ ##$XFAC= 2
$$ ##END=
$$ 
##$DECIM=	3968
##$DSPFVS=	20
##.ACQUISITIONSCHEME=	NOT PHASESENSITIVE
##NTUPLES=	nD NMR SPECTRUM
##VAR_NAME=	FREQUENCY1,	FREQUENCY2,	SPECTRUM
##SYMBOL=	F1,	F2,	Y
##.NUCLEUS=	1H,	1H
##.OBSERVE FREQUENCY=	400.20200099999999566,	400.20200099999999566
##VAR_TYPE=	INDEPENDENT,	INDEPENDENT,	DEPENDENT
##VAR_FORM=	AFFN,	AFFN,	ASDF
##VAR_DIM=	1024,	1024,	1048576
##UNITS=	HZ,	HZ,	ARBITRARY UNITS
##FIRST=	4521.1594499999982872,	4521.1594499999982872,	0.12874154746532440186
##LAST=	-514.24094062501069402,	-514.24094062501069402,	0.0087109366431832313538
##MIN=	-514.24094062501069402,	-514.24094062501069402,	0.00020683962793555110693
##MAX=	4521.1594499999982872,	4521.1594499999982872,	2582.126708984375
##FACTOR=	1,	1,	0.0016485167349085314264
##PAGE=	F1=4521.16
##FIRST=	4521.1594499999982872,	4521.1594499999982872,	0.12874154746532440186
##DATA TABLE=	(F2++(Y..Y)), PROFILE
$$ [...]
##PAGE=	F1=-932.627
##FIRST=	4521.1594499999982872,	4521.1594499999982872,	0
##DATA TABLE=	(F2++(Y..Y)), PROFILE
$$ plain form
4521 137 94 143 17 172 20 168 191 23 162 116 327 135 161 15 114 240 69 65 187 191 141 75 60 180 112 129 79 62 138
4378 138 11 174 46 36 213 178 122 58 118 62 315 198 31 46 118 21 75 118 87 276 91 147 259 64 104 33 206 100
4241 100 69 31 205 89 37 19 72 30 35 190 131 118 208 46 35 86 142 53 80 79 66 40 39 138 100 113 161 96 122 35 25 86 189 166
4073 166 97 99 87 71 21 51 177 37 125 97 322 130 89 118 13 83 83 102 48 74 144 150 175 171 112 109 97 223 114 136 29 115 78
3911 78 54 32 75 15 85 79 102 19 73 178 52 113 65 36 27 47 47 168 46 120 103 31 138 113 146 261 97 224 140 68 80 108 95
3748 95 99 122 73 111 207 331 253 121 69 139 88 153 175 62 55 86 45 65 44 56 34 174 92 3 161 198 92 132 141 88 21 135 58
3586 58 166 194 147 42 142 154 81 102 14 93 43 51 233 162 172 149 195 121 71 163 249 109 105 79 49 111 94 42 137 110 80 122 155 111
3419 111 206 136 68 90 70 94 172 295 16 90 75 130 36 46 27 122 80 240 204 132 62 28 111 193 129 111 13 18 31 22 99 246 105
$$ packed form
4521A37m3M9j26J55j52J48K3j68J39m6K11j92K6j46R9J26j71mJ22Mn0o6j5J20o8J7n0j7P6
4378A38j27J63j28j0J77l5n6o4O0n6K53j17j67J5P2r7N4M3l1J89j85N6J12j95M0p1J73j06
4241A00l1l8J74j16n2j8N3m2NJ55n9j3R0j62j1N1N6q9K7jj3k6jR9l8J3M8o5K6q7j0O1J03k3
4073A66o9Kj2j6n0L0J26j40Q8k8K25j92m1K9j05P0%J9n4K6P0OK5mn9lj2J26j09K2j07Q6l7
3911G8k4k2M3o0P0oK3q3N4J05j26O1m8k9rK0%J21j22P4j7p2J07k5L3J15j64J27q4p2J2K8j3
3748I5MK3m9L8R6J24p8j32n2P0n1O5K2j13pL1m1K0k1J2k2J40q2q9J58L7j06M0Rn3o7J14p7
3586E8J08K8m7j05J00J2p3K1q8P9n0QJ82p1J0k3M6p4n0R2Q6j40mk6l0O2j7n2R5k7l0M2L3m4
3419A11R5p0o8K2k0K4P8J23k79P4j5N5r4J0j9R5m2J60l6p2p0l4Q3Q2o4j8r8NJ3rP7J47j41
$$ plain form
3256 105 157 143 76 109 60 111 38 28 90 72 63 286 300 1 762 384 568 139 1100 743 772 398 379 360 277 340 319 632 845 113
3108 113 458 250 240 227 94 172 130 90 53 113 38 168 213 156 135 107 66 93 169 91 51 175 88 79 165 242 313 246 598 542 1192 839
2951 839 1029 217 267 349 240 198 404 197 282 298 218 475 852 585 242 172 142 147 69 3 23 20 97 114 21 79 100 116 183 71 146
2798 146 78 123 89 257 91 117 195 184 38 9 134 118 31 110 104 116 169 175 126 17 96 103 51 113 200 190 112 49 202 165 144 178 138
2636 138 129 100 32 115 199 119 172 186 139 139 55 123 120 181 141 59 80 92 159 66 81 144 219 124 75 109 52 43 106 130 108 60 107 149 225 128 24
2454 24 87 44 82 131 41 34 37 133 85 45 96 63 169 217 167 132 146 187 85 134 169 75 78 66 116 62 88 13 106 148 240 72 164 242 156
2282 156 201 178 79 140 100 93 128 109 153 112 246 56 110 133 174 132 42 39 53 152 118 81 110 85 110 144 120 82 99 113 196 44 41 82 147
2109 147 230 61 118 167 149 92 71 80 192 224 119 45 85 73 44 85 48 15 60 84 50 106 68 99 89 104 86 160 216 120 65 170 160
$$ packed form
3256A05N2j4o7L3m9N1p3j0O2j8rK23J4k99P61l78J84m29R61l57K9l74j9j9q3O3k1L13K13p32
3108A13L45k08j0j3j33P8m2m0l7O0p5J30M5n7k1k8m1K7P6p8m0J24q7rQ6P7P1o7L52n6O50l53
2951H39J90q12N0Q2j09m2K06k07Q5J6q0K57L77k67l43p0l0Np8o6K0lP7J7r3N8K1J6O7j12P5
2798A46o8M5l4J68j66K6P8j1j46k9J25j6q7P9oJ2N3Om9j09P9Pn2O2Q7j0p8o3J53l7k1L4m0
2636A38rk9o8Q3Q4q0N3J4m7%q4O8lO1m0q2K1J2O7r3J5O3P5r5m9L4n7rO3K4k2m8M7M2P6r7j04
2454B4O3m3L8M9r0pLR6m8m0N1l3J06M8n0l5J4M1j02M9L5r4Lj2N0n4K6p5R3M2R2j68R2P8q6
2282A56M5k3r9O1m0pL5j9M4m1J34j90N4K3M1m2r0lJ4R9l4l7K9k5K5L4k4l8J7J4Q3j52lM1O5
2109A47Q3j69N7M9j8n7k1RJ12L2j05p4M0j2k9M1l7l3M5K4l4N6l8L1j0J5j8P4N6r6n5J05j0
$$ plain form
1947 160 331 274 100 48 57 97 187 32 62 198 172 90 75 293 26 55 148 125 115 109 354 120 340 733 991 2177 1570 1779
1809 1779 759 777 1113 1321 1269 1495 984 605 1268 3357 4914 9778 5534 11010 7802 5125 4756 2499 1025 1149
1711 1149 320 590 359 264 317 431 143 152 155 206 248 188 93 63 149 127 140 123 142 109 73 52 61 170 139 36 182 101 142 104 32 92
1553 92 56 37 91 297 181 232 227 97 109 89 98 117 84 66 138 55 217 147 110 78 37 40 39 30 98 96 40 125 155 108 59 122 89 252 179 213
1376 213 185 64 141 117 83 68 167 76 133 59 62 176 121 104 36 119 97 173 80 72 176 187 150 123 178 239 111 191 144 188 102 77 110 53
1209 53 179 89 124 120 55 121 109 64 23 111 115 36 100 169 259 151 69 17 79 93 77 63 59 93 116 166 86 40 157 157 254 161 111 154 158 210
1031 210 113 109 186 245 216 120 165 74 43 48 68 82 135 107 73 141 143 47 37 97 281 122 106 214 173 38 47 117 122 216 246 222 122 120 115 53
854 53 156 34 129 73 90 18 116 147 26 138 56 89 86 164 220 48 112 29 136 74 193 86 147 191 76 199 44 173 19 140
$$ packed form
1947A60J71n7j74n2RM0R0j55L0J36k6q2j5K18k67K9R3k3j0oK45k34K20L93K58J186o07K09
1809A779j020J8L36K08n2K26n11l79O63K089J557M864m244N476l208k677l69k257j474J24
1711A149q29K70k31r5N3J14k88RLN1M2o0r5l0Q6k2J3j7J9l3l6k1RJ09l1j03J46q1M1l8p2O0
1553I2l6j9N4K06j16N1nj30J2k0RJ9l3j8P2q3J62p0l7l2m1LjrO8kn6Q5L0m7m9O3l3J63p3L4
1376B13k8j21P7k4l4j5R9r1N7p4LJ14n5j7o8Q3k2P6r3qJ04J1l7k7N5O1j28Q0m7M4q6k5L3n7
1209E3J26r0L5mo5O6j2m5m1Q8Mp9O4O9R0j08q2n2O2J4j6j4mL4K3N0q0m6J17%R7r3n0M3MN2
1031B10r7mP7N9k9r6M5r1l1NK0J4N3k8l4O8Kr6j0O0J84j59j6J08m1j35RP0NR4L0k4j00kno2
854E3J03j22R5n6J7p2R8L1j21J12q2L3lP8N6j72O4q3J07o2J19j07O1M4j15J23j55J29j54J21
$$ plain form
706 140 115 127 63 40 187 231 168 246 108 227 144 77 172 114 26 89 84 354 221 427 296 917 1124 1445 1144 1041 1250 3446
569 3446 8296 24374 3256 11407 19064 3123 2988 1066 471 169 515 229 251 375 223 289 135 162 188 149 238 5
460 5 81 191 244 189 85 209 212 186 30 125 146 203 166 178 123 106 65 392 383 804 381 644 529 354 388 222 255 209 55 109 288
308 288 72 207 136 86 49 163 162 119 201 205 91 91 181 46 157 120 105 127 303 61 165 68 90 148 72 98 85 119 158 61 28 74
150 74 69 122 133 131 120 71 105 120 140 64 101 173 167 78 61 30 78 84 78 74 65 86 191 30 116 109 46 24 141 46 100 85 100 78 83 81 29 23 91 44
-47 44 155 94 120 185 91 111 166 258 178 121 172 30 186 193 140 72 123 155 139 42 139 200 7 120 69 103 155 37 33 143 62 15 108
-209 108 166 27 236 111 195 185 33 150 132 176 229 110 187 118 109 56 43 160 143 102 54 177 154 227 114 60 132 102 178 85 158
-362 158 95 114 92 26 45 233 189 199 34 75 90 152 148 138 152 216 183 26 173 176 97 101 191 29 154 52 105 152 111 80 46
$$ packed form
706A40k5J2o4k3J47M4o3P8j38J19q3o7R5n8q8O3nK70j33K06j31O21K07L21l01j03K09K196
569C446M850J6078k1118Q151P657j5941j35j922n95l02L46k86K2J24j52O6j54K7K6l9Q9k33
460EP6J10N3n5j04J24Lk6j56R5K1N7l7J2n5j7m1L27rM21m23K63j15j75L4j66L3m6j54N4J79
308B88k16J35p1n0l7J14jm3Q2Mj14%R0j35J11l7j5K2J76k42J04r7K2N8p6K6j3L4L9r7l3M6
150G4nN3J1kj1m9L4J5K0p6L7P2oq9j7l1M8OomrK1J05j61Q6po3k2J17r5N4j5J5k2Nkn2oO8m7
-47D4J11o1K6O5r4K0N5R2q0n7N1j42J56Pn3o8N1L2j6r7R7O1j93J13n1L4N2j18mJ10q1m7R3
-209A08N8j39K09j25Q4j0j52J17j8M4N3j19P7o9rn3j3J17j7m1m8J23k3P3j13n4P2l0P6r3P3
-362A58o3J9k2o6J9J88m4J0j65M1J5O2mj0J4O4l3j57J47Lp9MR0j62J25j02N3M7m1l1l4
-514D6
##PAGE=	F1=-942.471
##FIRST=	4521.1594499999982872,	4521.1594499999982872,	0
##DATA TABLE=	(F2++(Y..Y)), PROFILE
$$ plain form
4521 146 137 187 43 213 39 182 184 33 187 182 321 189 163 72 129 269 111 46 121 240 144 106 86 130 151 134 91 38 168 13
4373 13 115 57 91 217 225 95 117 86 107 308 191 40 98 128 28 71 160 113 234 105 153 224 52 96 81 228 91 75 39 249
4226 249 67 19 73 76 72 51 206 166 145 175 31 93 84 147 77 100 52 49 28 19 160 122 114 163 101 46 31 5 92 186 182 124 121 88 82 20 89
4044 89 162 63 92 116 350 143 81 150 28 62 83 105 67 112 166 145 188 208 114 128 110 201 123 126 63 113 86 57 36 51 45 154 63 128
3876 128 24 76 166 57 66 77 26 35 44 37 158 93 124 113 44 179 119 131 225 61 188 182 44 82 87 106 87 118 46 128 239 286 236 127
3709 127 94 149 76 95 198 95 39 118 80 58 20 56 30 134 101 25 178 217 85 121 141 63 16 133 56 146 206 126 4 188 141
3556 141 75 124 39 88 50 40 203 140 187 114 157 101 56 150 250 90 130 82 59 108 114 64 98 110 69 97 190 140 181 142 100 59 101 101
3389 101 173 277 28 103 64 128 49 104 11 144 89 234 187 118 19 35 121 193 131 95 43 43 34 15 115 250 114 197 151 77 130 67
$$ packed form
4521A46rN0j44J70j74J43Kj51J54nJ39j32k6r1N7J40j58o5P5J19r6l8k0M4K1j7m3n3J30j55
4373A3J02n8L4J26Qj30K2l1K1K01j17j51N8L0j00M3Q9m7J21j29M8P1j72M4j5J47j37j6l6K10
4226B49j82m8N4Lmk1J55m0k1L0j44O2rO3p0K3m8lk1rJ41l8qM9o2n5j5k6Q7R4mn8ll3oo2O9
4044H9P3r9K9K4K34k07o2O9j22L4K1K2l8M5N4k1M3K0r4J4j8R1p8Lo3N0k7k9k1J5oJ09r1O5
3876A28j04N2R0j09RJ1n1RRpJ21o5L1j1o9J35o0J2R4j64J27oj38L8NJ9j9L1p2Q2J11M7n0j09
3709A27l3N5p3J9J03j03n6P9l8k2l8L6k6J04l3p6J53L9j32L6K0p8m7J17p7R0O0q0j22J84m7
3556A41o6M9q5M9l8j0J63o3M7p3M3n6m5R4J00j60M0m8k3M9On0L4J2m1K8R3n0M1l9m2m1M2%
3389A01P2J04k49P5l9O4p9N5r3J33n5J45m7o9r9J6Q6P2o2l6n2%rj9J00J35j36Q3m6p4N3o3
$$ plain form
3232 67 151 45 40 88 54 13 331 399 65 818 479 796 413 1801 1007 738 477 307 313 259 325 435 680 917 258 371 250
3099 250 220 193 81 193 161 100 30 113 33 169 183 153 106 111 108 117 207 115 43 213 119 79 202 281 282 284 393 231 649 513 924 243
2941 243 299 404 169 216 390 182 282 322 110 232 727 445 363 120 157 152 57 19 49 41 53 88 35 76 113 118 179 43 170 86
2793 86 118 110 287 103 148 178 193 48 40 99 83 27 107 111 85 163 145 159 15 83 110 18 154 239 221 150 72 233 224 150 165 136 111 87
2626 87 64 109 191 98 191 184 109 138 33 130 151 207 169 44 98 34 115 85 103 188 253 129 55 77 81 30 124 147 117 59 131 187 270 114
2459 114 47 71 50 109 93 73 30 29 97 68 61 94 54 180 189 177 150 113 185 82 138 169 77 38 75 133 51 91 34 75 126 212 75 142 245
2286 245 125 215 170 84 195 171 66 122 98 141 125 255 71 120 126 157 138 63 14 36 153 108 96 102 64 109 147 122 64 81 123 171 25
2124 25 7 83 156 253 61 109 188 185 113 95 112 182 222 99 78 100 76 59 50 66 19 83 81 45 92 52 103 84 109 70 143 199 101 52 162
$$ packed form
3232F7Q4j06nM8l4m1L18O8l34P53l39L17l83J388p94k69k61j70On4O6J10K45K37o59J13j21
3099B50l0k7j12J12l2o1p0Q3q0J36J4l0m7NlRR0r2p2J70r4m0J23P9JKJ09j62M18j36M11o81
2941B43N6J05k35M7J74k08J00M0k12J22M95k82q2k43L7nr5l8L0qJ2L5n3M1L7NO1j36J27q4
2793H6L2qJ77j84M5L0J5j45qN9j6n6Q0Mk6P8j8J4j44O8K7r2J36Q5j8p1p8J61rp4J5k9k5k4
2626H7k3M5Q2r3R3pp5K9j05R7K1N6l8j25N4o4Q1l0J8Q5O5j24p4K2Mn1R4K3l0n8P2N6Q3j56
2459A14o7K4k1N9j6k0m3jO8k9pL3m0J26Rj2k7l7P2j03N6L1r2l9L7N8q2M0n7M1N1Q6j37O7J03
2286B45j20R0m5q6J11k4j05N6k4M3j6J30j84M9OL1j9p5m9K2J17m5j2Ol8M5L8k5n8J7M2M8j46
2124B5j8P6P3R7j92M8P9lp2j8J7P0M0j23k1K2k4j7rJ6m7O4kl6M7m0N1j9K5l9P3N6r8m9J10
$$ plain form
1952 162 174 334 296 111 48 54 69 183 44 82 205 186 103 19 286 44 83 126 149 72 136 359 145 302 525 620 1248 959 1137
1809 1137 631 561 1115 1493 1726 2207 2151 1393 804 4190 4838 17064 10215 20131 9469 6883 5449 2679 1462 1302
1711 1302 574 648 332 420 225 475 140 164 206 234 293 205 99 79 101 162 157 115 188 109 100 39 48 193 108 37 178 87 156 106 56 118
1553 118 53 24 81 282 186 235 250 135 106 97 95 79 78 74 125 85 188 170 118 50 51 33 45 31 76 90 52 79 169 124 51 131 79 253 203
1381 203 233 182 66 148 135 104 76 150 92 120 49 49 178 182 137 24 140 88 185 80 23 161 168 137 141 176 194 118 197 135 183 137 67 103
1213 103 63 197 108 97 118 85 92 75 104 23 139 163 46 73 169 254 111 87 38 73 91 77 60 70 80 135 142 122 28 125 104 225 135
1051 135 117 167 155 177 66 134 191 231 222 135 173 128 29 79 57 74 155 151 101 157 142 34 40 99 279 99 107 232 192 19 61 143 133 196
884 196 245 224 142 123 93 84 134 59 126 88 59 17 95 167 61 121 57 103 68 96 198 43 104 37 102 99 188 122 138 202 68 214 25
$$ packed form
1952A62J2J60l8j85o3OJ5J14j39L8J23j9q3q4K67k42L9M3K3p7O4K23k14J57K23R5O28k89J78
1809A137n06p0N54L78K33M81n6p58n89L386O48J2226o849R916j0662k586j434k770j217j60
1711A302p28P4l16Q8j95K50l35K4M2K8N9q8j06k0K2O1nm2P3p9ro1RJ45q5p1J41r1O9n0n0O2
1553A18o5k9N7K01r6M9J5j15k9rkj6jmN1m0J03j8n2o8Jj8J2j4M5J4l8K7R0m5p3Q0n2J74n0
1381B03L0n1j16Q2j3l1k8P4n8K8p1%J29Mm5j13J16n2R7j05n7J38Pl1ML5J8p6P9o2M8m6p0L6
1213A03m0J34q9j1K1l3Pj7K9q1J16K4j17K7R6Q5j43k4m9L5J8j4j7J0J0N5Pk0r4R7k1J21r0
1051A35j8N0j2K2j11O8N7M0rq7L8m5r9N0k2J7Q1mn0N6j5j08ON9J80j80QJ25m0j73M2Q2j0O3
884A96M9k1q2j9l0rN0p5O7l8k9m2P8P2j06O0o4M6l5K8J02j55O1o7O5lQ9o6J6O4j34J46j89
$$ plain form
721 25 157 55 48 129 134 60 88 191 211 189 252 147 207 137 85 121 125 49 84 97 377 234 508 327 1039 1330 1767 1802 2006 2088 4151
569 4151 9573 17927 2953 9281 14462 5314 3091 1214 420 169 553 203 313 248 256 295 103 124 200 105 187 22 66
455 66 169 204 156 105 176 200 196 37 71 132 158 153 128 105 125 115 301 366 830 363 679 520 367 366 282 272 234 67 78 254 67 208
298 208 113 104 41 147 149 80 176 154 74 69 185 46 194 91 130 140 270 51 180 48 80 154 79 105 85 135 111 71 78 31 68 113 127
135 127 133 105 45 119 158 154 79 87 155 157 36 82 39 70 108 104 94 81 122 194 40 139 84 45 41 162 82 100 77 114 35 106 119 78 61 96 17
-47 17 110 41 139 158 90 144 161 228 164 104 149 61 199 209 152 72 107 129 61 63 135 214 54 127 89 120 177 113 100 73 50 19 64 170 84
-219 84 230 194 185 181 71 117 138 192 183 117 206 119 118 6 17 171 166 84 59 170 172 231 134 73 120 84 169 92 183 93 96 131 55 57 294 157
-396 157 203 11 68 152 146 101 133 141 282 141 59 214 166 167 73 220 55 128 106 160 151 135 111 69
$$ packed form
721B5J32j02pQ1Np4K8J03K0k2O3j05O0p0n2L6Mp6L5J3K80j43K74j81P12K91M37L5K04Q2K063
569D151N422Q354j4974O328N181r148k223j877p94k51L84l50J10o5QL9j92K1P6r5Q2j65M4
455F6J03L5m8n1P1K4mj59L4O1K6nk5k3K0j0J86O5M64m67L16j59j53jq4j0l8j67J1J76j87J41
298B08r5ro3J06Ko9R6k2q0nJ16j39J48j03L9J0J30k19J29j32L2P4p5K6k0N0k4m0Pm7L7M5J4
135A27Ok8o0P4L9mp5QO8Kj21M6m3L1L8mj0j3M1P2j54R9n5l9mJ21q0J8k3L7p9P1J3m1j7L5p9
-47A7R3o9R8J9o8N4J7O7o4o0M5q8J38J0n7q0L5K2o8KP2P9j60P3l8L1N7o4j3k7k3l1M5J06q6
-219H4J46l6rmj10M6K1N4ro6Q9q7jj12J1J54nq2k5J11KN9r7o1M7l6Q5p7R1r0LL5p6KK37j37
-396A57M6j92N7Q4om5L2QJ41j41q2J55m8Jr4J47j65P3k2N4rj6k4m2
-514F9
##PAGE=	F1=-952.316
##FIRST=	4521.1594499999982872,	4521.1594499999982872,	0
##DATA TABLE=	(F2++(Y..Y)), PROFILE
$$ plain form
4521 128 184 191 93 234 88 173 154 89 192 292 263 258 127 142 103 259 158 86 88 272 102 153 70 104 195 103 119 55 194 42 51
4369 51 66 139 178 255 116 159 23 148 256 191 91 155 117 56 51 195 114 170 122 162 169 49 106 141 240 96 111 36 271 21 16 131
4211 131 67 94 86 192 210 173 120 28 152 105 144 90 116 11 59 48 44 158 141 110 163 88 61 39 26 71 170 196 126 164 70 84 42 117
4044 117 120 104 67 141 351 160 58 168 57 42 92 97 97 124 184 150 188 245 107 146 119 167 128 104 86 125 91 82 38 35 85 220 94
3881 94 139 54 117 141 53 52 87 26 72 42 32 139 121 117 115 69 209 113 127 177 33 131 213 25 70 65 116 75 117 40 144 257 226 206
3714 206 120 115 147 78 87 234 142 44 141 111 35 31 62 37 80 109 46 176 230 72 108 145 46 14 121 68 117 201 85 49 211 122 77
3551 77 131 74 91 55 44 184 104 192 119 139 75 65 122 224 76 156 73 71 109 127 98 61 104 70 87 213 174 149 137 132 20 127 99
3389 99 163 238 58 103 67 104 93 156 23 176 93 197 162 106 78 67 127 169 130 68 70 93 48 51 129 257 128 221 164 93 158 86 202
$$ packed form
4521A28N6Pr8J41j46Q5j9o5J03J00k9nj31J5l9J56j01p2KJ84j70N1q3L4R1r2J6o4J39j52R
4369E1J5P3L9P7j39M3j36J25J08o5j00O4l8o1nJ44q1N6m8M0Pj20N7L5R9j44J5p5K35k50nJ15
4211A31o4K7qJ06J8l7n3r2J24m7L9n4K6j05M8j1mJ14j7l1N3p5k7k2j3M5R9K6p0L8r4J4m2P5
4044A17Lj6l7P4K10j91j02J10j11j5N0N%K7O0l4L8N7j38L9k7M8l9k4j8L9l4rm4lN0J35j26
3881I4M5q5O3K4q8jL5o1M6l0j0J07j8mkm6J40r6J4N0j44R8Q2j88M5nN1m1M2p7J04J13l1k0
3714B06q6nL2o9RJ47r2r8R7l0p6mL1k5M3K9o3J30N4j58L6L7r9l2J07n3M9Q4j16l6J62q9m5
3551G7N4n7J7l6j1J40q0Q8p3K0o4j0N7J02j48Q0q3kL8J8k9l7M3l4J7J26l9k5j2nj12J07k8
3389I9O4P5j80M5l6L7j1O3j33J53q3J04l5n6k8j1O0M2l9o2KK3m5LP8J28j29R3n7p1O5p2J16
$$ plain form
3227 202 55 56 81 24 43 385 486 134 876 504 967 1004 2504 1341 658 497 231 284 244 323 571 806 959 318 276 279 199
3094 199 152 68 216 196 106 22 114 25 178 142 149 83 106 161 136 221 126 46 236 154 84 232 308 261 321 238 594 606 878 993 458
2941 458 357 425 98 219 361 155 255 344 171 105 680 378 474 62 164 148 65 37 72 57 16 48 51 86 113 122 165 46 176
2798 176 107 118 124 307 119 182 146 183 55 78 60 54 60 100 114 53 140 110 192 52 66 113 35 180 285 245 200 110 267 272 146 148 139 101
2631 101 79 98 108 176 88 197 177 84 125 44 141 158 212 181 50 108 35 73 101 114 229 291 120 32 58 117 29 133 161 132 60 134
2474 134 213 288 86 98 60 47 136 54 107 94 80 46 67 93 79 85 192 143 175 191 92 182 88 160 173 83 18 86 148 36 94 40 58 109
2306 109 178 84 112 236 92 225 166 95 237 236 89 106 94 117 133 240 87 128 115 149 142 79 19 14 157 86 105 113 35 99 140 108 35
2144 35 64 143 164 14 30 91 160 263 58 97 195 208 138 141 155 151 210 77 107 100 91 98 17 96 53 95 77 45 77 38 95 69 95 60 129 160
$$ packed form
3227B02j47JK5n7J9L42J01l52P42l72M63L7J500j163o83j61k66N3m0P9K48K35J53o41m2Lq0
3094A99m7q4J48k0r0q4R2q9J53l6Po6K3N5k5Q5r5q0J90q2p0J48P6m7O0q3L56J2K72J15n35
2941D58j01O8l27J21J42k06J00Q9j73o6N75l02R6m12J02j6q3k8L5j5m1L2LL5K7RM3j19J30
2798A76o9J1OJ83j88O3l6L7j28K3j8oOM0J4o1Q7l0Q2j40J4M7p8J45J05m0m5r0J57Nj26Krl8
2631A01k2J9J0O8q8J09k0r3M1q1R7J7N4l1j31N8p3L8K8J3J15O2j71q8K6N9q8J04K8k9p2P4
2474A34P9P5k02J2l8j3Q9q2N3j3j4l4K1K6j4OJ07m9L2J6r9R0r4P2J3r0o5O8O2j12N8n4J8N1
2306A09O9r4K8J24j44J33n9p1J42jj47J7j2K3J6J07j53M1j3L4po3o0nJ43p1J9Qp8O4M1l2p3
2144C5K9P9K1j50J6O1O9J03k05L9R8J3p0LJ4mN9j33L0prPq1P9m3M2j8l2L2l9N7k6K6l5O9L1
$$ plain form
1967 160 83 39 147 175 314 304 125 45 114 37 168 29 118 210 175 111 24 253 70 106 89 157 15 166 319 169 284 379 282
1824 282 506 550 623 518 292 995 1457 2031 2813 3489 3242 2550 4143 8590 22092 18201 28422 5484 12866 5007
1725 5007 2465 1689 1257 816 612 361 497 146 434 169 233 267 214 296 214 184 68 53 171 160 121 216 87 136 55 47 197
1592 197 69 67 169 72 174 99 80 147 59 23 76 252 194 239 260 176 111 92 92 40 90 66 111 125 148 172 125 15 56 63 61 44 65 81
1425 81 87 40 187 137 36 129 93 232 216 238 185 73 136 147 123 84 126 92 106 62 47 165 236 156 64 167 72 187 82 30 150
1273 150 152 121 168 170 166 114 201 107 171 172 70 93 94 211 126 70 120 102 65 52 128 24 161 201 52 65 164 239 67 102 61 64 73 76 51 82
1095 82 90 145 115 148 12 78 48 195 98 123 200 166 140 21 144 192 189 232 130 181 182 68 109 52 89 166 179 116 182 130 57 67 104 263
928 263 95 105 223 204 8 84 165 126 178 215 221 175 131 63 94 125 76 107 103 26 53 82 169 68 101 35 136 37 39 172 36 93 57
$$ packed form
1967A60p7m4J08K8J39j0j79q0O9p7J31j39Q9R2l5o4q7K29j83L6j7O8j42J51J53j50J15R5r7
1824B82K24M4P3j05k26P03M62N74P82O76k47o92J593M447J3502l891J0221k2938P382p859
1725E007k542p76m32m41k04k51J36l51K88k65O4L4n3Q2q2l0j16j5J18j1l9R5j29M9q1qJ50
1592A97j28kJ02r7J02p5j9O7q8l6N3J76n8M5K1q4o5j9%n2N0k4M5J4K3K4m7j10M1Pkj7K1J6
1425H1Om7J47n0j01R3l6J39j6K2n3j12O3J1k4l9M2l4J4m4j5J18P1q0r2J03r5J15j05n2J20
1273A50Kl1M7Kmn2Q7r4O4Jj02K3JJ17q5n6N0j8l7j3P6j04J37M0j49J3R9P5j72L5m1LRLk5L1
1095H2QN5l0L3j36O6l0J47r7K5P7l4k6j19J23M8lM3j02N1Jj14M1n7L7P7J3o3O6n2p3J0L7J59
928B63j68J0J18j9j96P6Q1l9N2L7Om6m4o8L1L1m9L1mp7K7K9Q7j01L3o6J01r9KJ33j36N7l6
$$ plain form
766 57 83 138 158 161 127 180 82 211 40 149 99 90 140 146 95 133 170 199 192 274 151 217 104 100 57 128 141 98 191 392 232 589 375 1030
598 1030 1463 2085 2685 3369 3791 5291 8166 6907 15737 4878 7595 8545 1521 1167 341 399 473 294 365 92 396 348
490 348 52 261 214 84 139 94 58 134 149 111 158 111 167 220 71 23 135 100 130 107 118 143 164 172 311 815 365 714 487 371
342 371 338 337 302 243 64 60 212 60 223 70 128 26 108 140 43 147 102 44 54 183 65 218 93 176 128 216 54 196 91
199 91 58 160 92 104 74 111 47 88 109 36 51 128 118 123 114 21 111 192 161 90 62 146 120 56 68 48 74 118 130 124 96 159 186 46 165 69
22 69 45 72 169 101 112 56 124 40 118 142 120 123 98 37 54 6 160 124 80 190 151 164 157 88 123 102 191 214 134 84 87 91 24 93 136 194 112
-160 112 111 116 140 187 185 138 49 17 44 22 163 124 199 276 154 169 103 51 133 202 152 131 194 144 88 46 38 147 188 79 35 151 220 200
-327 200 142 91 120 66 142 79 180 117 62 154 103 40 320 161 197 58 65 198 125 32 126 144 328 70 86 253 127 231 63 234
$$ packed form
766E7K6N5K0Ll4N3r8J29j71J09n0rN0On1L8L7K9pQ2j23O6j13mm3P1J3m3R3K01j60L57k14O55
598A030M33O22O00O84M22J500K875j259Q830j0859K717R50p024l54q26N8P4j79P1k73L04m8
490C48k96K09m7j30N5m5l6P6J5l8M7m7N6N3j49m8J12l5L0k3J1K5K1QJ39N04m50L49k27j16
342C71l3jl5n9j79mJ52j52J63j53N8j02Q2L2r7J04m5n8J0J29j18J53j25Q3m8Q8j62J42j05
199I1l3J02o8J2l0L7o4M1K1p3J5P7j0Nrr3R0Q1l1p1k8Q4k6o4J2k0K6M4J2ok8O3K7j40J19r6
22F9k4K7R7o8J1n6O8q4P8K4k2Lk5o1J7m8J54l6m4J10l9J3po9L5k1Q9K3q0n0LMo7O9M3N8q2
-160A12jNK4M7km7q9l2K7k2J41l9P5P7j22J5o6n2Q2O9n0k1O3n0n6m2qJ09M1j09m4J16O9k0
-327B00n8n1K9n4P6o3J01o3n5R2n1o3K80j59L6j39PJ33p3r3R4J8J84k58J6J67j26J04j68J71
$$ plain form
-475 234 95 89 151 211 127 146 120 116
$$ packed form
-475B34j39oO2O0q4J9k6m
-514A16
##PAGE=	F1=-962.16
##FIRST=	4521.1594499999982872,	4521.1594499999982872,	0
##DATA TABLE=	(F2++(Y..Y)), PROFILE
$$ plain form
4521 113 239 145 192 243 159 167 154 187 185 396 147 313 44 216 45 198 214 128 212 271 2 196 21 173 232 34 148 77 207
4378 207 126 31 81 174 85 261 179 178 83 184 155 200 173 204 75 97 9 219 73 108 152 150 117 71 144 209 237 121 159 41 257 68
4221 68 22 186 55 89 123 150 260 185 62 47 202 152 137 88 123 59 61 109 86 127 163 93 153 48 174 55 55 21 139 207 94
4068 94 208 33 66 81 126 61 155 51 176 324 182 43 166 90 58 104 85 107 107 208 176 156 280 100 150 127 140 125 74 92
3921 92 143 96 117 33 21 134 253 171 130 95 165 111 42 86 86 74 105 44 43 111 137 105 104 108 221 116 137 114 36 68 228 56 37 63
3753 63 118 74 118 82 166 252 155 172 111 128 126 97 132 252 196 67 146 137 17 65 80 34 34 111 64 151 232 58 92 146 40 50 100 96 108
3581 108 175 36 96 209 105 87 120 101 103 62 68 170 82 175 173 125 44 103 86 172 70 176 53 89 120 127 122 58 99 91 94 216 209 121 114
3409 114 163 25 145 85 148 181 64 94 90 68 133 183 57 215 89 136 128 102 150 92 123 125 128 26 88 137 85 92 135 264 146 227 174
$$ packed form
4521A13J26r4M7N1q4Qj3L3kK11k49J66k69J72j71J53J6q6Q4N9k69J94j75J52N9j98J14p1J30
4378B07q1r5N0R3q9J76q2jr5J01k9M5k7L1j29K2q8K10j46L5M4kl3m6P3O5K8j16L8j18K16j89
4221F8m6J64j31L4L4K7J10p5j23j5J55n0j5m9L5o4KM8k3M1L6p0O0j05J26j19%l4J18O8j13
4068I4J14j75L3J5M5o5R4j04J25J48j42j39J23p6l2M6j9K2%J01l2k0J24j80N0k3J3j5n1J8
3921I2N1m7K1q4j2J13J19q2m1l5P0n4o9M4%j2L1o1jO8K6l2jMJ13j05K1k3p8L2J60j72j9K6
3753F3N5m4M4l6Q4Q6r7J7o1J7kk9L5J20n6j29P9rj20M8J5m6%P7m7Q7Q1j74L4N4j06J0N0mJ2
3581A08O7j39O0J13j04j8L3j9Km1OJ02q8R3km8q1N9j7Q6j02J06j23L6L1Pno4M1qLJ22pq8p
3409A14M9j38J20o0O3L3j17L0mk2O5N0j26J58j26M7qk6M8n8L1KLj02O2M9n2PM3J29j18Q1n3
$$ plain form
3246 174 120 179 100 252 55 67 67 40 89 439 545 200 921 478 1106 1597 3205 1750 577 446 157 273 236 328 706 1045
3118 1045 951 301 192 314 188 114 49 232 241 104 33 116 16 193 95 142 71 91 207 155 205 121 64 236 194 92 241 316 252
2976 252 352 200 987 964 1344 1180 704 420 400 42 194 332 121 200 357 280 136 703 344 558 4 160 130 93 71 77
2848 77 65 40 36 62 111 100 125 144 69 164 128 125 132 308 136 219 108 156 56 111 49 40 97 87 111 45 101 99 216 99 66 102 79 190
2680 190 338 258 251 144 304 300 133 133 146 92 81 131 109 164 91 189 168 84 100 72 152 138 198 172 66 106 66 69 114 103 255 333 98
2518 98 45 65 156 20 135 171 142 58 114 226 271 58 154 57 28 156 57 137 152 121 10 100 129 53 134 201 90 173 231 83 172
2365 172 92 194 181 92 34 91 155 13 99 27 65 96 135 97 87 213 84 226 169 109 266 285 125 87 104 80 128 206 90 131 114
2213 114 153 143 85 51 27 161 59 111 131 13 77 137 79 11 55 172 189 22 51 88 158 256 51 92 182 214 157 200 194 106 193 59
$$ packed form
3246A74n4N9p9J52j97J2%k7M9L50J06l45P21m43O28M91J608j455j173j31k89J16l7R2L78L39
3118A045r4o50j09J22j26p4o5J83Rj37p1Q3j00J77r8M7p1K0J16n2N0q4n7J72m2j02J49P5o4
2976B52J00j52P87k3L80j64m76k84k0l58J52J38k11P9J57p7j44N67l59K14n54J56l0l7k2O
2848G7j2k5mK6M9j1K5J9p5R5l6lPJ76j72Q3j11M8j00N5o2rN7j0K4o6N6kJ17j17l3L6k3J11
2680A90J48q0pj07J60mj67%J3n4j1N0k2N5p3R8k1q4J6k8Q0j4O0k6j06M0m0LM5j1J52P8k35
2518I8n3K0R1j36J15L6k9q4N6J12M5k13R6r7k9J28r9Q0J5l1j11R0K9p6Q1O7j11Q3N8j48Q9
2365A72q0J02j3q9n8N7O4j42Q6p2L8L1L9l8j0J26j29J42n7o0J57J9j60l8J7k4M8P8j16M1j7
2213A14L9j0n8l4k4J34j02N2K0j18O4O0n8o8M4J17J7j67K9L7P0R8k05M1R0L2n7M3oq8Q7j34
$$ plain form
2055 59 133 84 105 126 21 130 93 93 72 52 65 55 73 49 66 66 117 103 69 28 127 160 277 296 139 45 189 36 136 15 161 213
1898 213 132 130 56 190 99 133 31 140 86 196 229 198 291 338 135 248 374 397 381 166 772 1174 2103 3200 4845 5753 6421
1765 6421 7302 17407 31209 33869 58494 19952 29284 6399 3037 2118 1269 1115 687 537 529 320 365 228 383 328
1666 328 191 263 238 296 21 126 145 134 151 216 61 162 115 70 180 54 120 156 49 193 95 94 171 84 31 80 207 209 251 254 222
1514 222 140 75 104 24 109 41 98 164 108 148 135 34 47 114 80 52 83 69 119 34 204 147 29 113 135 197 219 228 191 83 107 153 139
1351 139 89 100 74 100 86 60 138 279 156 112 199 60 177 82 68 146 143 105 200 156 165 98 204 59 150 201 82 82 124 215 143 61 132
1189 132 97 74 87 127 22 176 222 33 92 148 217 62 111 76 46 41 81 39 94 118 156 93 170 20 24 6 165 59 126 260 179 104
1031 104 47 143 193 122 249 104 191 231 116 135 65 122 158 188 106 223 97 105 116 118 241 127 97 185 213 12 114 172 107 176 149
$$ packed form
2055E9P4m9K1K1j05J09l7%k1k0J3j0J8k4J7%N1j4l4m1R9L3J17J9j57r4J44j53J00j21J46N2
1898B13q1kp4J34r1L4j02J09n4J10L3l1R3M7k03J13J26K3j6k15O06M02R29J097J645R08O68
1765F421Q81J0105J3802K660K4625l8542R332k2885l362r19q49j54m28j50qk09M5j37J55n5
1666C28j37P2k5N8k75J05J9j1J7O5j55J01m7m5J10j26O6L6j07J44r8jP7q7n3M9J27KM2Ll2
1514B22q2o5K9q0Q5o8N7O6n6M0j3j01J3O7l4k8L1j4N0q5J70n7j18Q4K2O2K2Rl7j08K4M6j4
1351A39n0J1k6K6j4k6P8J41j23m4Q7j39J17r5j4P8ll8R5m4Ro7J06j45R1N1j19%M2R1p2q2P1
1189A32l5k3J3M0j05J54M6j89N9N6O9j55M9l5l0nM0m2N5K4L8o3P7j50Mj8J59j06O7J34q1p5
1031A04n7R6N0p1J27j45Q7M0j15J9p0N7L6L0q2J17j26QJ1KJ23j14l0Q8K8k01J02N8o5O9k7
$$ plain form
879 149 219 227 152 51 75 149 88 103 108 12 92 86 145 47 74 48 191 25 112 155 57 101 104 91 173 106 207 126 116 128 196 135 167 143 229
706 229 129 199 164 172 167 206 169 331 95 291 78 190 48 174 289 200 450 391 293 764 523 856 1495 2407 3761 5137 6339
574 6339 7881 6756 56795 41967 12543 55430 27052 3263 1829 806 966 312 576 458 187 692 480 86
485 86 640 226 167 178 234 143 188 156 98 256 61 143 262 108 56 147 89 117 140 184 176 220 55 211 767 393 744 429 371 317
337 317 390 324 215 36 114 179 92 260 73 159 38 75 133 45 111 76 41 66 164 129 220 130 248 96 142 72 213 149 39 165
190 165 107 106 54 37 23 121 108 113 25 176 115 110 147 19 84 218 157 76 19 155 61 96 32 67 110 109 158 164 112 187 165 50 191 76
22 76 55 126 153 118 146 16 133 94 132 155 147 180 98 49 45 8 184 87 44 252 143 69 150 112 102 152 170 196 80 106 80 34 72 137
-145 137 148 132 171 70 152 169 185 227 150 89 58 58 75 139 137 163 341 115 170 122 44 114 191 169 140 143 174 39 89 95 77 223 117 30
$$ packed form
879A49P0Qp5j01K4P4o1J5Nr6Q0oN9r8K7k6J43j66Q7M3r8M4Lj3Q2o7J01q1j0J2O8o1L2k4Q6
706B29j00P0l5QnL9l7J62k36J96k13J12j42J26J15q9K50n9r8M71k41L33O39R12J354J376J202
574F339J542j125N0039j4828k9424M2887k8378k3789j434j023J60o54K64j18k71N05k12l94
485H6N54m14n9J1N6r1M5l2n8J58j95Q2J19j54n2R1n8K8K3M4qM4j65J56N56l74L51l15n8n4
337C17P3o6j09j79P8O5q7J68j87Q6j21L7N8q8O6l5l5K5R8l5R1r0J18j52M6p0J41o4j10J26
190A65n8jn2j7j4R8j3Nq8J51o1nL7j28O5J34o1q1n7J36r4L5o4L5M3jM9On2P5k2j15J41j15
22G6k1P1K7l5K8j30J17l9L8K3qL3q2m9ml7J76r7m3K08j09p4Q1l8j0N0J8K6j16K6k6m6L8O5
-145A37J1j6L9j01Q2J7J6M2p7o1l1%J7O4kK6J78k26N5m8p8P0P7k2k9LL1j35N0Oj8J46j06q7
$$ plain form
-312 30 122 283 129 137 124 133 61 101 80 168 153 65 162 168 77 291 242 193 129 65 214 114 80 144 144 324 103 126 305 98 287 154
-470 154 242 133 119 197 268 99 148 146 180
$$ packed form
-312C0R2J61j54Qj3Rp2M0k1Q8j5q8R7Or1K14m9m9o4o4J49j00l4O4%J80k21K3J79k07J89j33
-470A54Q8j09j4P8P1j69M9kL4
-514A80
##PAGE=	F1=-972.005
##FIRST=	4521.1594499999982872,	4521.1594499999982872,	0
##DATA TABLE=	(F2++(Y..Y)), PROFILE
$$ plain form
4521 232 342 150 357 310 294 251 262 340 218 501 28 353 97 309 124 142 302 200 394 255 174 235 145 292 275 70 202
4388 202 110 204 261 97 134 213 65 250 268 201 228 221 29 210 283 240 9 148 89 237 11 141 216 126 147 140 210 289 213 168 211
4236 211 81 197 175 47 243 82 99 163 113 313 189 96 111 235 214 147 78 132 125 42 203 134 94 198 97 133 37 287 82
4093 82 89 56 97 217 26 240 81 26 143 120 92 211 47 227 269 211 70 150 124 118 108 102 89 87 246 219 91 310 108 140 141
3940 141 151 112 62 92 158 110 156 61 21 192 239 268 107 144 202 105 56 115 67 144 126 61 80 90 166 105 94 158 208 144 159 40 42 58
3773 58 224 108 22 81 122 103 122 150 201 219 92 155 108 129 82 118 190 236 259 96 128 160 78 108 115 20 80 106 78 107 215 44 90
3611 90 141 56 102 87 146 143 128 51 140 188 90 105 100 104 129 82 114 152 113 128 237 98 22 155 54 103 77 181 36 120 141 119 127 106
3443 106 103 135 114 196 239 105 78 185 73 160 65 137 128 44 86 138 79 168 184 99 254 75 80 87 118 211 107 110 95 127 36 94 173 145
$$ packed form
4521B32J10j92K07m7j6m3J1P8j22K83m73L25k56K12j85J8J60j02J94j39q1O1r0J47j7k05J32
4388B02r2R4N7j64L7P9j48J85J8o7K7pj92J81P3m3k31J39n9J48k26J30P5r0K1pP0P9p6m5M3
4236B11j30J16k2j28J96j61J7O4n0K00j24r3J5J24k1o7o9N4pq3J61o9m0J04j01L6r6K50k05
4093H2Pl3M1J20j91K14j59n5J17k3k8J19j64J80M2n8j41Q0k6oj0oj3kJ59k7j28K19k02L2J
3940A41J0l9n0L0O6m8M6r5m0J71M7K9j61L7N8r7m9N9m8P7j8o5J9J0P6o1j1O4N0o4J5j19KJ6
3773E8J66j16q6N9M1j9J9K8N1J8j27O3m7K1m7L6P2M6K3j63L2L2q2L0Pr5O0K6k8K9J08j71M6
3611I0N1q5M6j5N9lj5p7Q9M8r8J5nMK5m7L2L8l9J5J09j39p6J33j01M9k6J04j45Q4K1k2Qk1
3443A06lL2k1Q2M3j34k7J07j12Q7r5P2rq4M2N2n9Q9J6q5J55j79NPL1R3j04Lj5L2r1N8P9k8
$$ plain form
3276 145 138 131 271 168 217 176 152 185 106 293 46 88 47 107 119 484 569 263 939 480 1270 2167 3914 2206 548 326 93
3143 93 268 239 328 816 1314 933 247 154 333 202 88 16 235 301 94 38 122 52 212 59 131 74 72 233 177 160 107 100 211
3000 211 235 106 227 299 249 366 240 1289 1308 1724 1417 948 488 324 58 138 312 82 122 368 421 249 803 303 617
2877 617 43 141 99 127 125 65 74 70 94 68 137 83 123 125 88 141 139 133 135 284 158 259 76 123 66 135 94 38 129 63 107 63 49 127 221 150
2700 150 98 71 128 183 393 256 296 169 338 302 114 126 155 76 97 160 109 168 104 170 161 114 68 99 162 94 168 139 77 88 93 117 126 68
2533 68 261 377 70 88 91 193 40 130 174 145 57 74 228 216 59 210 58 36 163 100 157 194 143 60 149 158 20 181 196 61
2385 61 187 253 84 153 86 233 191 103 47 88 149 19 108 26 90 83 86 114 78 179 114 219 180 125 283 310 149 85 124 32 110 160
2227 160 77 133 136 165 141 84 72 60 157 39 117 137 49 42 157 42 60 63 201 232 36 65 69 153 232 43 105 151 209 159 263 222 65
$$ packed form
3276A45ppJ40j03M9m1k4L3p9J87k47M2m1O0J2L65Q5l06O76m59P90Q97J747j708j658k22k33
3143I3J75k9Q9M88M98l81o86r3J79j31j14p2K19O6k07n6Q4p0J60j53P2n7kJ61n6j7n3pJ11
3000B11K4j29J21P2n0J17j26J049J9M16l07m69m60j64k66Q0J74k30M0K46N3j72N54n00L14
2877F17n74R8m2K8ko0RmK4k6O9n4M0Kl7N3koKJ49j26J01j83M7n7O9m1n6R1o6M4m4j4P8R4p1
2700A50n2k7N7N5K10j37M0j27J69l6j88J2K9p9K1O3n1N9o4O6rm7m6L1O3o8P4k9o2J1NK4Rn8
2533F8J93J16l07J8LJ02j53R0M4k9q8J7J54j2j57J51j52k2J27o3N7L7n1q3Q9Rj38J61J5j35
2385F1J26O6j69O9o7J47m2q8n6M1O1j30Q9q2O4pLK8l6J01o5J05l9n5J58K7j61o4L9r2P8N0
2227A60q3N6LK9k4n7j2j2R7j18P8K0q8pJ15j15J8LJ38L1j96K9MQ4P9j89O2M6N8n0J04m1j57
$$ plain form
2065 65 179 47 157 54 112 134 54 154 131 75 70 71 58 101 40 36 52 89 112 35 62 20 114 131 230 271 150 70 258 80 88 81 209
1903 209 220 66 161 99 102 126 162 60 106 208 227 149 274 346 425 408 395 397 579 343 528 648 770 1999 3396 6125 8740
1770 8740 11912 16260 33808 60297 83309 124377 65441 55782 15078 6309 3721 2198 1826 1253 995 740 715
1686 715 548 414 627 445 325 280 322 433 72 259 88 71 201 197 117 175 207 122 158 105 187 149 33 207 109 93 184 130 42
1543 42 95 151 234 273 231 272 184 48 136 52 130 10 84 196 79 99 156 98 26 169 94 52 113 60 141 61 213 158 69 82 197 159
1386 159 216 209 196 95 65 155 158 91 82 41 108 110 99 99 311 141 156 228 63 155 76 85 146 150 101 237 138 185 90 207 23 127 215 98
1218 98 72 145 203 161 75 165 70 122 153 97 42 188 222 17 137 120 189 95 116 75 43 71 100 78 104 156 185 85 197 38 48 34
1061 34 133 45 117 339 177 99 107 158 200 75 271 66 208 274 155 162 88 166 131 182 75 282 50 178 174 153 227 181 87 121 216
$$ packed form
2065F5J14j32J10j03N8K2q0J00k3n6nJj3M3o1mJ6L7K3p7K7m2R4J7R9M1j21q0J88j78QpJ28
1903B09J1j54R5o2LK4L6j02M6J02J9p8J25P2P9j7j3KJ82k36J85J20J22J229J397K729K615
1770H740L172M348J7548K6489K3012M1068n8936r659m0704q769k588j523l72n73k58k55k5
1686G15j67j34K13j82j20m5M2J11l61J87j71j7J30mq0N8L2q5L6n3Q2l8j16J74r8j6R1n4q8
1543D2N3N6Q3L9m2M1q8j36Q8q4P8j20P4J12j17K0N7n8p2J43p5m2O1n3Q1q0J52n5q9J3J15l8
1386A59N7pj3j01l0R0Lo7rm1O7Kj1%K12j70J5P2j65R2p9RO1Mm9J36r9M7r5J17j84J04Q8j17
1218I8k6P3N8m2q6R0r5N2L1n6n5J46L4k05J20j7O9r4K1m1l2K8K9k2K6N2K9j00J12j59J0j4
1061C4R9q8P2K22j62p8QN1M2j25J96k05J42O6j19Pp4P8l5N1j07K07k32J28mk1P4m6r4L4R5
$$ plain form
908 216 27 145 157 119 200 49 231 301 192 100 76 200 102 144 99 42 139 118 92 74 60 147 268 116 230 172 118 146 167 130 197
756 197 55 274 159 50 211 222 271 234 220 384 109 303 260 213 240 241 157 435 48 434 193 374 215 313 489 395 902 390
618 390 480 1179 824 533 1474 2759 4969 7238 9608 12456 16057 136375 85178 30688 134010 62345 10837
534 10837 4308 1930 1818 576 970 650 471 1136 726 266 1250 229 342 374 449 315 380 306 191 398 164 185 331
421 331 156 136 171 221 182 236 311 253 295 210 64 701 444 757 349 375 321 450 332 138 64 212 214 187 322 166 202 84 107
278 107 126 71 73 96 119 125 116 242 203 201 342 97 53 101 230 193 41 170 127 137 45 93 93 176 100 207 81 246 131 111 181 30
121 30 64 230 150 49 60 193 85 131 111 109 177 81 188 204 129 192 136 74 221 113 100 207 110 171 207 44 150 154 163 162 153 221 100
-42 100 68 122 50 232 60 62 329 148 68 140 176 97 208 144 146 15 129 142 44 118 202 196 28 228 42 198 210 170 232 155 109
$$ packed form
908B16j89J18J2l8Q1j51J82P0j09r2k4J24r8M2m5n7R7k1k6j8j4Q7J21j52J14n8n4K8K1l7O7
756A97j42K19j15j09J61J1M9l7j4J64k75J94m3m7K7Jq4K78l87L86k41J81j59R8J76r4N07n12
618C90R0O99l55k91R41J285K210K269K370K848L601J20318n1197n4490J03322p1665n1508
534A0837o529k378j12j242L94l20j79O65m10m60R84j021J13L2P5j34O5p4j15K07k34K1J46
421C31j75k0L5N0l9N4P5n8M2q5j46O37k57L13m08K6n4J29j18j94p4J48Kk7J35j56L6j18K3
278A07J9n5KK3K3OrJ26l9kJ41k45m4M8J29l7j52J29m3J0r2M8%Q3p6J07j26J65j15k0P0j51
121C0L4J66q0j01J1J33j08M6k0kO8r6J07J6p5O3n6o2J47j08j3J07r7O1L6j63J06MRjrO8j21
-42A00l2N4p2J82j72KK67j81q0P2L6p9J11o4Kj31J14J3r8P4Q4oj68K00j86J56J2m0O2p7m6
$$ plain form
-194 109 147 100 156 132 138 180 385 138 208 138 152 103 151 229 143 49 189 141 146 180 46 289 198 119 120 342 37 140 174 163 108 97
-352 97 160 218 191 167 202 260 198 198 369 216 233 102 207 156 224 237 171 279 273 239 398 209 356 310 290 209 254 282 364 160 216 262
-509 262 290
$$ packed form
-194A09L8m7N6k4OM2K05k47P0p0J4m9M8P8q6r4J40m8NL4j34K43r1p9JK22l05J03L4j1n5j1
-352I7O3N8k7k4L5N8o2%J71j53J7j31J05n1O8J3o6J08ol4J59j89J47m6k0q1M5K8Q2k04N6M6
-509B62K8
-514B90
##PAGE=	F1=-981.849
##FIRST=	4521.1594499999982872,	4521.1594499999982872,	0
##DATA TABLE=	(F2++(Y..Y)), PROFILE
$$ plain form
4521 465 530 346 583 503 503 443 451 546 349 634 247 409 286 449 301 278 447 342 597 307 402 299 333 426 351 200 315 181
4383 181 208 433 204 235 297 265 252 386 272 404 268 172 220 413 265 125 203 220 276 133 277 321 164 264 247 300 377 173
4246 173 238 265 149 109 299 105 318 159 193 218 179 367 221 187 208 248 280 195 98 169 187 66 325 196 151 249 175 127 138 380
4098 380 132 128 154 63 230 74 254 199 61 231 126 213 267 76 295 199 247 115 135 160 205 101 169 57 142 305 271 64
3960 64 336 141 126 165 202 93 104 116 173 147 200 135 71 257 179 372 100 197 218 143 115 119 59 226 142 101 148 116 233 135 116 216
3803 216 171 192 187 51 27 117 206 166 107 104 157 160 137 234 247 165 80 175 118 119 15 135 250 182 333 127 97 187 157 163 163 39 145 111
3635 111 85 69 178 30 132 139 97 162 116 215 201 63 112 174 163 76 122 95 76 170 116 181 126 174 51 290 75 55 208 30 52
3483 52 102 163 63 167 166 128 114 177 121 200 139 161 259 105 47 191 120 175 61 133 148 42 90 207 145 203 165 147 286 53 117
$$ packed form
4521D65O5j84K37q0%o0QR5j97K85l87J62j23J63j48k3J69j05K55k90R5j03L4R3p5j51J15j34
4383A81K7K25k29L1O2l2j3J34j14J32j36r6M8J93j48j40P8J7N6j43J44M4j57J00j7N3P7k04
4246A73O5K7j16m0J90j94K13j59L4K5l9J88j46l4K1M0L2q5r7P1J8j21K59j29m5R8p4m8J1K42
4098C80k48mK6r1J67j56J80n5j38J70j05Q7N4j91K19r6M8j32K0K5M5j04O8j12Q5J63l4k07
3960F4K72j95j5L9L7j09J1J2N7k6N3o5o4J86p8J93k72R7K1p5k8Mo0J67q4m1M7l2J17r8j9J00
3803B16m5K1nj36k4R0Q9m0n9lN3Lk3R7J3q2q5R5n7Jj04J20J15o8J51k06l0R0l0O%j24J06l4
3635A11k6j6J09j48J02Pm2O5m6R9j4j38M9O2j1q7M6k7j9R4n4O5n5M8j23K39k15k0J53j78K2
3483E2N0O1j00J04jl8j4O3n6P9o1K2R8j54n8J44p1N5j14P2J5j06M8J17o2N8l8j8J39k33O4
$$ plain form
3330 117 42 157 251 116 103 140 136 108 97 200 222 187 121 274 193 193 174 185 173 111 315 65 136 38 187 125 514 555 320 918 593
3177 593 1518 2706 4616 2630 565 153 48 260 258 312 878 1506 918 219 179 330 240 84 28 223 379 82 46 134 112
3054 112 229 78 117 90 65 235 209 96 93 152 166 276 129 206 259 244 354 267 1482 1564 2007 1682 1187 566 206 112 71 301
2917 301 44 31 403 603 403 950 240 661 73 110 67 157 197 63 91 91 163 77 152 89 116 115 101 121 134 134 141 236 185 303 74
2764 74 107 99 149 151 39 155 30 104 77 9 170 206 203 151 30 181 166 442 239 328 184 366 279 95 128 167 54 126 188 103 196
2611 196 127 151 159 155 35 124 167 43 132 85 80 51 129 183 135 20 243 421 63 135 121 220 95 119 166 148 81 24 226 129 88 261
2454 261 56 88 153 142 163 214 143 91 199 170 39 217 168 89 225 252 99 133 71 266 201 110 67 79 141 58 124 76 129 69 34
2301 34 135 81 140 159 200 197 143 292 314 153 118 147 28 90 119 50 144 173 178 138 78 76 90 140 46 124 122 94 19 204 40 114 87 221
$$ packed form
3330A17p5J15R4j35j3L7mk8j1J03K2l5o6J53q1%j9J1j2o2K04k50P1r8J49o2L89M1k35N98l25
3177E93R25J188J910j986k065m12j05K12kN4N66O28n88o99m0J51r0j56n6J95J56k97l6Q8k2
3054A12J17j51L9k7k5J70k6j13lN9J4J10j47P7N3j5J10q7J215Q2M43l25m95o21l60r4m1K30
2917C01k57j3L72K00k00N47p10M21n88L7m3R0M0j34K8%P2q6P5o3K7jj4K0J3%PR5n1J18k29
2764G4L3qN0Kj12J16j25P4k7o8J61L6ln2j21J51j5K76k03Q9j44J82q7j84L3L9j13P2O2q5R3
2611A96o9K4Qmj20Q9M3j24Q9m7nk9P8N4m8j15K23J78l58P2j4R9j25K4M7j8o7n7K02r7m1J73
2454B61k05L2O5j1K1N1p1n2J08k9j31J78m9p9J36K7j53L4o2J95o5r1m3J2O2q3O6m8N3o0l5
2301C4J01n4N9J9M1ln4J49K2j61l5K9j19O2K9o9R4K9Nm0o0kJ4N0r4P8kk8p5J85j64P4k7J34
$$ plain form
2134 221 273 49 76 41 148 196 40 143 105 208 138 324 234 79 174 41 179 15 115 121 91 160 158 37 74 106 60 158 15
1991 15 45 98 126 126 42 67 19 117 93 182 230 162 128 310 140 70 166 266 247 85 193 168 17 146 190 171 105 363 275 278 435 478
1834 478 629 719 472 600 936 675 1012 1016 979 2060 3674 7360 12000 18645 29633 59242 112802 170063 222614 134903
1735 134903 90194 29689 11900 6645 4126 3127 2275 1754 1295 1271 1044 769 968 688 619 468 477 603 212 414 89
1632 89 64 267 196 241 187 321 200 171 191 259 159 88 210 140 87 181 193 59 125 104 271 302 196 321 224 35 177 82 149 61
1484 61 80 217 66 42 195 174 21 219 95 45 131 59 151 93 207 175 133 47 270 138 212 196 193 106 26 156 185 100 77 40 135
1332 135 130 162 55 333 122 192 247 76 121 63 74 147 177 125 283 124 219 133 209 98 122 211 115 64 154 170 184 89 227 60 182
1179 182 225 63 95 196 200 77 184 82 158 123 123 58 100 168 136 160 121 203 241 94 239 51 99 51 97 75 88 426 150 168 174
$$ packed form
2134B21N2k24K7l5J07M8j56J03l8J03p0J86r0j55R5j33J38j64J00Ol0O9kj21L7L2m6R8j43
1991A5L0N3K8%q4K5m8R8k4Q9M8o8l4J82j70p0R6J00j9j62J08k5j51J29M4j9o6K58q8LJ57M3
1834D78J51R0k47J28L36k61L37Ml7J081J614L686M640O645J0988K9609N3560N7261N2551q7711
1735A34903m4709o0505j7789n255k519r99q52n21m59k4k27k75J99k80o9j51RJ26l91K02l25
1632H9k5K03p1M5n4J34j21k9K0O8j00p1J22p0n3R4J2j34O6k1J67L1j06J25r7j89J42r5O7q8
1484F1J9J37j51k4J53k1j53J98j24n0Q6p2R2n8J14l2m2q6K23j32P4j6lq7q0J30K9q5k3l7R5
1332A35nL2j07K78k11P0N5j71M5n8J1P3L0n2J58j59R5q6P6j11K4Q9r6n1R0J6J4r5J38j67J22
1179A82M3j62L2J01Mj23J07j02P6l5%o5M2O8l2K4l9Q2L8j47J45j88M8m8M6k2J3L38k76J8O
$$ plain form
1026 174 219 216 148 295 52 234 303 177 192 115 221 97 183 85 359 77 274 233 213 234 243 82 39 213 50 181 116 200 253
884 253 91 272 392 251 177 151 260 122 213 80 69 200 186 29 184 119 288 362 239 361 233 200 213 232 199 214 89 371
746 371 243 187 333 339 438 352 348 542 144 435 375 272 374 321 255 581 255 630 404 627 449 524 731 655 1543 460 769
613 769 1869 1263 429 1570 3187 6217 9512 13345 18746 33417 243990 145253 54592 242376 113188 21774
534 21774 8372 3639 2886 1279 1418 942 813 1698 1098 532 2084 220 589 682 735 553 650 535 343 573 314 285
426 285 429 228 259 235 425 329 395 492 378 395 417 116 642 508 741 250 391 366 523 345 5 186 331 343 324 404 283
293 283 257 138 175 120 81 92 144 232 225 70 390 198 305 449 174 76 132 244 210 57 179 167 209 94 261 172 254 166 310
150 310 178 324 162 134 199 42 101 219 174 105 162 262 213 172 250 173 266 51 216 231 146 163 113 138 265 186 184 312 88 266
$$ packed form
1026A74M5lo8J47k43J82O9j26J5p7J06j24Q6r8K74k82J97m1k0K1Rj61m3J74j63J31o5Q4N3
884B53j62J81J20j41p4k6J09j38R1j33j1J31j4j57J55o5J69P4j23J22j28l3J3J9l3J5j25K82
746C71j28n6J46OR9q6mJ94l98K91o0j03J02n3o6L26l26L75k26K23j78P5K07p6Q88j083L09
613G69J100o06q34J141J617L030L295L833N401J4671K10573r8737r0661J87784j29188r1414
534B1774j3402m733p53j607J39m76j29Q85o00n66J552j864L69R3N3j82R7j15j92K30k59k9
426B85J44k01L1k4J90r6O6R7j14J7K2l01N26j34K33m91J41k5J57j78l40J81J45J2j9Q0j21
293B83k6j19L7n5l9J1N2Q8pj55L20j92J07J44k75r8N6J12l4j53J22j2M2j15J67q9Q2q8J44
150C10j32J46j62k8O5j57N9J18m5o9N7J00m9m1P8p7R3k15J65J5q5J7n0K5J27p9kJ28k24J78
$$ plain form
3 266 293 121 180 211 208 168 137 247 122 135 216 142 323 95 185 414 174 200 146 247 104 267 112 82 130 162 264 147 191 288
-145 288 292 112 286 118 250 258 145 209 183 95 255 207 250 214 188 275 420 247 281 172 260 154 92 302 177 84 189 312 235
-288 235 301 213 397 308 233 205 389 136 192 238 237 210 198 296 363 253 318 324 390 360 83 513 279 371 207 240 258 410 404 291 297 490
-445 490 435 560 420 472 509 432 350 451 435 524 326 402 470 475
$$ packed form
3B66K7j72N9L1lm0l1J10j25J3Q1p4J81k28R0K29k40K6n4J01j43J63j55l0M8L2J02j17M4R7
-145B88Mj80J74j68J32Qj13O4k6q8J60m8M3l6k6Q7J45j73L4j09Q8j06o2K10j25r3J05J23p7
-288B35O6q8J84q9p5k8J84k53N6M6jk7j2R8O7j10O5OO6l0k77M30k34R2j64L3J8J52oj13OJ93
-445D90n5J25j40N2L7p7q2J01j6Q9j98P6O8N
-514D75
##PAGE=	F1=-991.693
##FIRST=	4521.1594499999982872,	4521.1594499999982872,	0
##DATA TABLE=	(F2++(Y..Y)), PROFILE
$$ plain form
4521 762 800 640 854 795 768 698 683 789 558 816 496 527 516 649 520 532 653 554 803 478 659 421 550 566 467 345 487
4388 487 297 270 620 358 374 439 501 308 535 400 593 334 355 248 545 296 279 263 383 362 280 452 459 295 411 376 404 469
4250 469 143 327 320 238 146 425 197 423 261 345 293 320 423 309 272 322 250 343 279 173 248 244 161 462 276 277 316 300 171 261
4103 261 437 207 174 261 92 258 195 258 340 158 339 179 353 316 137 372 140 287 164 148 206 309 100 265 96 260
3975 260 382 321 175 362 193 130 200 263 88 179 174 202 208 256 239 145 328 82 469 142 254 210 192 198 95 118 308 172 160 244
3827 244 190 325 188 181 273 118 241 218 134 16 179 188 225 212 140 229 231 170 326 296 110 124 222 136 102 72 147 309 98 416 164
3675 164 104 226 240 231 215 86 196 150 82 102 139 38 212 151 157 221 186 297 259 14 176 195 162 81 131 128 19 220 156 265 120
3522 120 236 72 320 118 102 255 14 96 141 120 114 227 194 177 94 258 150 274 167 142 266 117 74 178 164 195 99 126
$$ packed form
4521G62L8j60K14n9k7p0j5J06k31K58l20L1j1J33j29J2J21r9K49l25J81k38J29J6r9j22J42
4388D87j90k7L50k62J6O5O2j93K27j35J93k59K1j07K97k49j7j6J20k1q2J72Pj64J16l5K8O5
4250D69l26J84pq2r2K79k28K26j62Q4n2K7J03j14l7N0p2R3o4j06P5mq3L01j86JL9j6j29R0
4103B61J76k30l3Q7j69J66o3O3Q2j82J81j60J74l7j79K35k32J47j23j6N8J03k09J65j69J64
3975B60J22o1j46J87j69o3P0O3j75R1nK8OM8j7r4J83k46L87l27J12m4j8Oj03K3J90j36j2Q4
3827B44n4J35j37pR2j55J23k3q4j18J63RL7j3p2Q9Ko1J56l0j86J4R8q6l4l0P5J62k11L18k52
3675A64o0J22J4rj6j29J10m6o8K0L7j01J74o1OO4l5J11l8k45J62J9l3q1N0lj09K01o4J09j45
3522A20J16j64K48k02j6J53k41Q2M5k1oJ13l3j7q3J64j08J24j07k5J24j49m3J04j4L1r6K7
$$ plain form
3384 126 241 117 109 289 218 240 150 196 303 32 200 28 215 267 127 131 227 166 185 121 222 303 232 114 272 218 160 183 215 152
3236 152 129 315 125 208 54 272 104 525 511 370 852 795 1883 3214 5246 2924 567 81 43 247 294 282 878 1544
3118 1544 856 242 230 306 287 105 84 199 468 81 79 153 182 241 131 97 113 83 209 249 45 80 215 122 316 163 219 210 236
2976 236 311 261 1569 1752 2217 1992 1427 656 110 170 111 289 35 77 487 807 563 1086 174 695 79 73 85 177 276 117
2848 117 117 107 228 106 151 125 109 116 109 117 110 127 154 184 212 349 106 130 150 149 202 42 174 14 102 73 69 204 184 255 215 61 236
2685 236 151 478 210 342 186 382 233 81 138 185 68 163 220 86 240 162 153 163 194 7 146 163 51 98 30 79 21 177
2547 177 253 134 64 204 460 93 176 148 231 163 100 144 163 135 40 227 28 123 305 49 147 129 171 152 209 122 99 242 161 100
2400 100 235 115 134 276 232 122 124 58 282 206 108 107 67 150 101 146 140 177 56 39 162 85 105 196 173 219 159 300 308 139 173 167 97
$$ packed form
3384A26J15j24qJ80p1K2r0M6J07k71J68j72J87N2j40MR6o1J9o4J01Q1p1j18J58n4n8K3L2o3
3236A52k3J86j90Q3j54K18j68M21j4j41M82n7J088J331K032k322k357m86l8K04M7j2N96O66
3118A544o88o14j2P6j9j82k1J15K69l87kP4K9N9j10l4J6l0J26M0k04L5J35r3J94j53N6rK6
2976B36P5n0J308J83M65k25n65p71n46O0n9J78k54M2M10L20k44N23r12N21o16oJ2R2R9j59
2848A17%j0J21j22M5k6j6PpQpJ7K7L0K8J37k43K4K0jN3j60J32j60Q8k9mJ35k0P1m0j54J75
2685B36q5L27k68J32j56J96j49j52N7M7j17R5N7j34J54p8rJ0L1j87J39J7j12M7o8M9n8J56
2547A77P6j19p0J40K56l67Q3k8Q3o8o3M4J9k8r5J87j99R5J82k56R8j8M2j9N7q7k3J43q1o1
2400A00J35j20J9J42m4j10Ko6K24p6r8jm0Q3m9M5oL7j21j7J23p7K0R1k3M6o0J41Qj69L4op0
$$ plain form
2237 97 102 99 33 171 212 188 138 73 62 111 120 76 133 97 135 73 265 82 161 119 228 297 61 88 46 148 152 55 198 57 223 97
2080 97 377 231 131 180 47 199 30 117 92 134 145 169 22 85 154 74 217 67 68 167 172 165 111 85 21 138 57 142 177 183 208 339
1922 339 211 154 259 334 307 201 215 258 126 157 218 303 189 541 365 528 675 687 926 1035 688 948 1376 1226 1570 1741
1794 1741 1942 2737 4447 8682 15300 25968 45922 93027 183535 287988 343592 223162 128815 48485 19158
1720 19158 10504 6662 4896 3593 2750 2102 1952 1695 1256 1388 1056 990 781 681 802 390 582 217 203 350 259 395
1612 395 224 449 297 243 295 328 182 176 198 173 104 160 266 81 173 113 316 333 154 357 243 70 213 109 171 125 109 225
1474 225 69 78 247 255 56 255 83 36 127 68 157 126 183 202 208 66 345 148 211 199 177 115 39 159 222 132 89 99 180 144 241 55
1317 55 348 128 217 248 86 79 48 34 143 227 174 336 127 263 217 210 184 151 187 133 56 150 114 214 86 308 124 247 290 107
$$ packed form
2237I7Nlo6J38M1k4n0o5j1M9Rm4N7l6L8o2J92j83P9m2J09O9k36K7m2J02Mr7J43j41J66j26
2080I7K80j46j00M9j33J52j69Q7k5M2J1K4j47O3O9q0J43j50JR9Npn4k6o4J17q1Q5L5OK5J31
1922C39j28n7J05P5k7j06J4M3j32L1O1Q5j14L52j76J63J47J2K39J09l47K60M28j50L44J71
1794A741K01P95J710M235O618J0668J9954M7105R0508J04453N5604j20430r4347q0330k9327
1720A9158q654l842j766j303q43o48j50k57m39J32l32o6k09j00J21m12J92l65j4J47r1J36
1612C95j71K25j52n4N2L3j46oK2k5o9N6J06j85R2o0K03J7j79K03j14j73J43j04O2m6j6J16
1474B25j56RJ69Qj99J99j72m7R1n9Q9l1N7J9Oj42K79j97O3j2k2o2p6J20O3r0m3J0Q1l6R7j86
1317E5K93k20Q9L1j62pl1j4J09Q4n3J62k09J36m6pk6l3L6n4p7R4l6J00j28K22j84J23M3j83
$$ plain form
1169 107 169 198 167 144 223 38 123 137 147 47 187 285 192 258 153 253 316 112 288 59 129 52 55 124 36 508 103 282 250 311
1021 311 243 258 319 91 263 313 178 225 146 287 112 226 175 450 174 382 279 290 260 301 80 49 212 87 227 81 321
889 321 333 238 346 489 323 260 252 315 148 283 86 100 277 286 125 331 229 455 465 381 492 315 291 287 288 291 244 177 495 376
741 376 385 486 523 622 505 516 686 248 572 501 365 535 454 459 758 534 863 671 921 733 774 993 950 2330 661 1119 2772
608 2772 1797 1002 1976 3725 7392 11722 17172 26052 55290 371876 218220 82024 373008 175887 35383
534 35383 13709 5884 4057 2163 1866 1291 1189 2330 1572 866 3088 211 889 1061 1067 832 956 797 517 764 469
431 469 405 557 329 429 357 669 525 606 714 529 510 618 313 614 570 686 146 425 454 616 398 175 350 462 519 484
303 484 500 397 319 184 236 124 73 190 219 366 356 163 556 255 429 558 282 183 156 249 195 83 204 239 313 190 451 272
$$ packed form
1169A07O2K9l1k3P9j85Q5J4J0j00J40R8r3O6j05J00O3k04J76k29P0p7LO9q8M72m05J79l2O1
1021C11o8J5O1k28J72N0j35M7p9J41j75J14n1K75k76K08j03J1l0M1k21l1J63j25J40j46K40
889C21J2r5J08J43j66o3qO3j67J35j97J4J77Rj61K06j02K26J0q4J11j77k4mJLm7o7L18j19
741C76RJ01L7R9j17J1J70m38L24p1j36J70q1NK99k24L29j92K50j88M1K19m3J380j669M58J653
608B772r75p95R74J749L667M330N450Q880K9238L16586j53656j36196K90984j97121j40504
534C5383k1674p825j827j894k97n75j02J141p58p06K222k877O78J72Ok35J24j59k80K47k95
431D69o4J52k28J00p2L12j44Q1J08j85j9J08l05L01m4J16n40K79K9J62k18k23J75J12N7l5
303D84J6j03p8j35N2j12n1J17K9J47j0j93L93l01J74J29k76r9k7R3n4j12J21L5P4j23K61j79
$$ plain form
165 272 347 305 411 284 398 195 165 192 72 168 186 252 228 291 359 364 237 406 248 364 71 234 238 163 102 123 237 335 298 296 433
12 433 175 382 400 209 220 260 251 175 120 268 183 242 319 276 451 184 342 497 223 331 194 305 112 326 63 128 261 233
-125 233 418 266 311 388 421 269 346 221 302 305 127 200 247 92 370 366 359 362 310 406 468 385 372 234 352 262 87 375 277 247 207
-278 207 509 360 456 410 539 435 361 345 420 292 296 314 364 352 363 462 564 369 500 513 551 538 226 654 376 532 364 377 402
-421 402 632 617 500 487 733 688 789 679 647 732 654 544 690 649 744 554 675 744 731
$$ packed form
165B72P5m2J06j27J14k03l0K7j20R6J8O6k4O3O8Nj27J69j58J16k93J63Mp5o1K1J14R8l7kJ37
12D33k58K07J8j91J1M0rp6n5J48q5N9P7m3J75k67J58J55k74J08j37J11j93K14k63O5J33k8
-125B33J85j52M5P7L3j52P7j25Q1Lj78P3M7j55K78mpLn2R6O2q3j3j38J18r0j75K88r8l0m0
-278B07L02j49R6m6J29j04p4j6P5j28MJ8N0j2J1R9J02j95J31J3L8j3l12M28k78J56j68J3K5
-421D02K30j5j17j3K46m5J01j10l2Q5p8j10J46m1R5j90J21O9j3
-514G31
##PAGE=	F1=-1001.54
##FIRST=	4521.1594499999982872,	4521.1594499999982872,	0
##DATA TABLE=	(F2++(Y..Y)), PROFILE
$$ plain form
4521 1080 1120 972 1139 1130 1054 975 926 1040 802 1037 749 717 762 892 761 817 894 810 993 714 910 595 766 710 602 489 690
4388 690 443 400 797 552 537 616 747 420 699 560 771 419 520 321 662 352 455 331 562 492 436 640 610 467 558 508
4260 508 512 555 173 425 369 342 317 540 312 556 376 517 383 476 482 433 335 436 259 398 381 276 356 300 287 597 373 417 395
4118 395 435 257 385 451 293 230 366 164 309 324 276 485 269 454 269 491 355 214 445 148 324 214 194 266 417 141
3990 141 371 199 397 470 364 306 390 254 159 243 317 121 264 247 260 282 325 355 232 401 50 546 211 310 193 226 290 45
3852 45 213 382 230 233 358 281 416 250 264 320 80 283 251 211 80 228 199 282 325 197 319 304 222 413 335 114 176 273 155
3709 155 103 172 157 366 54 502 208 177 276 314 306 263 132 228 213 70 179 147 85 305 187 230 275 272 378 305 95 237 200 198
3561 198 128 128 183 76 271 196 355 166 288 198 324 202 147 289 33 165 184 55 167 298 225 250 107 339 186 343 195
$$ packed form
4521A080M0j48J67rp6p9m9J14k38K35k88l2M5J30j31N6P7q4J83k79J96l15J71n6j08j13K01
4388F90k47m3L97k45j5P9J31l27K79j39K11l52J01j99L41l10J03j24K31p0n6K04l0j43R1n0
4260E08MM3l82K52n6k7k5K23k28K44j80J41j34R3Om9r8J01j77J39j7j05Q0n6j3L10k24M4k2
4118C95M0j78J28O6j58o3J36k02J45J5m8K09k16J85j85K22j36j41K31k97J76j10k0P2J51k76
3990A41K30j72J98P3j06n8Q4j36r5Q4P4j96J43j7J3K2M3L0j23J69l51M96l35R9j17L3O4k45
3852D5J68J69j52LJ25p7J35j66J4N6k40K03l2m0j31J48k9Q3M3j28J22j5q2J91p8k21O2R7j18
3709A55n2O9j5K09l12M48k94l1R9L8qm3j31R6j5j43J09l2o2K20j18M3M5lJ06p3k10J42l7k
3561A98p0%N5j07J95p5J59j89J22r0J26j22n5J42k56J32J9j29J12J31p3K5j43K32j53J57j48
$$ plain form
3428 195 176 259 128 133 148 207 220 159 110 345 216 137 370 280 278 169 241 301 42 272 74 282 260 149 198 313 215 258 168 241
3281 241 377 267 122 265 240 122 219 242 148 164 297 203 292 80 350 58 516 449 412 749 1019 2362 3684 5705 3005
3158 3005 503 284 63 236 344 253 807 1405 696 270 276 270 329 150 141 176 556 106 129 180 247 248 185 70 138 116 157 296 92
3015 92 59 282 128 353 206 289 180 234 242 231 1566 1924 2404 2380 1675 760 205 230 222 270 77 165 618 994 689 1152 178
2882 178 724 63 41 150 186 351 205 146 129 281 152 142 168 106 122 119 129 69 120 176 175 233 394 154 172 205 139 235 54 185
2734 185 59 102 49 127 222 177 303 285 128 287 150 495 177 338 170 379 172 78 155 206 132 205 260 60 286 205 184 172
2597 172 224 7 166 145 100 77 97 89 80 231 321 123 135 154 487 136 206 170 222 230 78 109 197 207 89 238 90 158 338 41
2449 41 202 94 185 128 190 87 87 276 136 171 236 58 170 327 209 145 132 66 274 206 94 156 67 192 144 173 203 230 56
$$ packed form
3428A95j9Q3j31NJ5N9J3o1m9K35j29p9K33r0kj09P2O0k59K30j98K08k2j11M9J15r8M3r0P3
3281B41J36j10j45J43k5j18R7K3r4J6J33r4Q9k12K70k92M58o7l7L37K70J343J322K021k700
3158C005k502k19k21J73J08r1N54N98p09m26OoN9j79rL5L80m50K3N1O7Jo3j15O8k2M1J39k04
3015I2l3K23j54K25j47Q3j09N4Qj1J335L58M80k4p05r15n55K5qM8j93Q8M53L76l05M63r74
2882A78N46o61k2J09L6J65j46n9j7J52j29j0K6o2J6lJ0o0N1N6jN8J61k40J8L3o6R6j81J31
2734A85j26M3n3P8R5m5J26j8j57J59j37L45l18J61j68K09k07r4P7N1p4P3N5k00K26q1k1j2
2597A72N2k17J59k1m5k3K0qrJ51R0j98J2J9L33l51P0l6N2Qj52L1Q8J0j18J49j48O8J80k97
2449D1J61j08R1n7O2j03%J89j40L5O5j78J12J57j18o4j3o6K08o8j12O2q9J25m8K9L0K7j74
$$ plain form
2306 56 89 194 86 87 214 138 243 167 311 310 112 236 182 173 153 106 68 209 241 187 139 74 48 119 129 114 142 106 167 141 320 126
2149 126 191 152 219 302 79 103 91 156 108 89 261 56 255 52 416 217 180 194 71 211 70 123 59 181 116 163 95 103 207
2006 207 103 273 130 93 237 222 218 168 109 24 166 50 115 124 215 299 345 288 279 349 410 394 323 227 355 235 160 260 439 314 726
1853 726 507 804 960 948 1275 1343 1115 1369 1849 1851 2164 2589 3101 3949 5810 10197 18378 33020 63125 132287 263834
1750 263834 424281 472005 319927 166641 69326 27335 14815 9434 6883 5033 3865 3028 2685 2387 1808
1676 1808 1850 1490 1376 1141 902 1010 588 749 379 370 449 370 554 299 574 397 343 404 390 203 273 167 195 161 125 341 104
1543 104 236 178 365 356 114 372 238 125 240 139 196 186 169 222 84 158 300 331 90 275 62 30 101 81 167 156 155 237 285
1400 285 125 411 173 214 214 147 117 72 159 266 186 115 165 239 155 321 106 354 165 233 227 85 33 60 28 129 295 233 387 148
$$ packed form
2306E6L3J05j08JJ27p6J05p6J44jj98J24n4rk0m7l8J41L2n4m8o5k6P1J0j5K8l6O1k6J79j94
2149A26O5l9O7Q3k23K4j2O5m8j9J72k05J99k03L64j99l7J4j23J40j41N3o4J22o5M7o8QJ04
2006B07j04J70j43l7J44j5mn0n9q5J42j16O5RR1Q4M6n7rP0O1j6p1r6J28j20p5J00J79j25M12
1853G26k19K97J56j2L27O8k28K54M80KL13M25N12Q48J861M387Q181J4642L0105O9162J31547
1750B63834J60447M7724j52078j53286r7315m1991j2520n381k551j850j168q37l43k98n79
1676A808M2l60j14k35k39J08m22J61l70rP9p9J84k55K75j77n4O1j4j87P0j06K8l4l6K16k37
1543A04J32n8J87rk42K58j34j13J15j01N7j0j7N3j38P4J42L1k41J85k13l2P1k0Q6j1jQ2M8
1400B85j60K86k38M1%o7l0m5Q7J07q0p1N0P4q4J66k15K48j89O8oj42n2K7l2J01J66o2J54k39
$$ plain form
1253 148 315 316 206 261 193 146 147 56 137 48 251 61 394 216 312 341 196 252 186 142 200 251 22 83 154 191 88 284 402 260
1105 260 355 199 302 390 133 329 67 130 49 39 183 45 572 83 407 330 406 279 354 338 135 285 296 166 260 187 363
972 363 195 313 290 544 282 485 305 369 290 347 72 133 231 136 284 147 454 428 382 443 576 395 335 346 355 179 339 140
834 140 147 370 402 265 491 363 628 562 525 606 391 380 357 329 395 312 280 634 538 597 654 727 803 670 697 796 378 697 623 488
687 488 698 631 714 947 850 1107 960 1216 1032 1025 1244 1242 3178 967 1490 3784 2367 1757 2668 4358 8368 13594 20621
574 20621 33424 78956 506559 296565 110000 512274 243768 50352 19840 8525 5191 3086 2256 1640
505 1640 1565 2964 2096 1237 4159 238 1211 1462 1409 1119 1257 1054 688 947 615 524 708 454 632 526 925 743 841 951
387 951 678 622 791 498 627 614 590 106 480 571 728 504 386 535 593 698 645 594 489 375 215 273 149 94 318 324 509
$$ packed form
1253A48J67Jj10N5o8m7Jr1Q1q9K03j90L33j78R6K9j45N6o6m4N8N1k29O1P1L7j03J96J18j42
1105B60R5j56J03Q8k57J96k62O3q1j0J44j38N27m89L24p7P6j27P5j6k03J50J1j30R4p3J76
972C63j68J18k3K54k62K03j80O4p9N7k75O1R8r5J48j37L07k6m6O1J33j81o0J1Rj76J60j99
834A40PK23L2j37K26j28K65o6l7Q1k15j1k3k8O6q3l2L54r6N9N7P3P6j33K7R9m18L19p4j35
687D88K10o7Q3K33r7K57j47K56j84pK19kJ936k211N23K294j417o10R11J690M010N226P027
574B0621J2803M5532M27603k09994j86565M02274k68506j93416l0512j1315l334k105q30o16
505A640p5J399q68q59K922l921R73K51n3k90J38k03l66K59l32r1J84k54J78j06L99j82R8J10
387I51k73n6J69k93J29j3k4m84L74R1J57k24j18J49N8J05n3n1j05j14j60N8j24n5K24OJ85
$$ plain form
254 509 504 330 712 368 555 651 387 279 168 241 146 129 252 341 431 316 634 399 442 472 496 381 459 213 186 159 130 238 160
111 160 365 371 434 473 516 328 556 323 455 120 231 224 188 64 171 360 426 438 424 556 311 493 511 295 259 292 283 182 144
-32 144 304 276 369 424 438 594 299 507 565 288 438 272 339 118 381 19 270 386 354 581 392 467 488 558 423 405 324 347
-170 347 345 149 260 332 180 483 556 481 529 467 540 546 517 465 311 417 393 184 445 427 425 284 708 505 631 613 690 560 487 501
-317 501 437 448 422 400 528 518 560 634 783 535 692 728 724 705 470 777 491 698 549 592 571 870 847 759 772 979 959 1054 950
-460 950 863 954 914 762 950 896 995 818 991 1048 1030
-514 1030
$$ packed form
254E09nj74L82l44J87R6k64j08j11P3r5j7J23Q9R0j15L18k35M3L0K4j15P8k46k7k7k9J08p8
111A60K05OO3L9M3j88K28k33J32l35J11pl6j24J07J89O6J2j4J32k45J82J8k16l6L3rj01l8
-32A44J60k8R3N5J4J56k95K08N8k77J50j66O7k21K63l62K51J16l2K27j89P5K1P0j35j8q1K3
-170C47kj96J11P2j52L03P3p5M8o2P3Ok9n2j54J06k4k09K61j8kj41M24k03J26j8P7j30p3J4
-317E01o4J1k6k2J28j0M2P4J49k48J57L6mj9k35L07k86K07j49M3k1K99k3q8J3K07k0R5j04
-460I50q7R1m0j52J88n4R9j77J73N7j8
-514A030
##PAGE=	F1=-1011.38
##FIRST=	4521.1594499999982872,	4521.1594499999982872,	0
##DATA TABLE=	(F2++(Y..Y)), PROFILE
$$ plain form
4521 1375 1439 1292 1399 1448 1317 1231 1145 1266 1039 1262 976 941 997 1142 998 1081 1132 1071 1149 955 1118 789 949 851 730 615 889
4388 889 598 567 941 758 703 794 969 555 852 720 914 513 646 432 745 435 629 409 729 639 579 816 750 639 682 620
4260 620 613 622 253 521 404 451 505 626 439 697 488 675 476 616 541 560 367 533 288 444 479 386 469 365 421 709 477
4127 477 544 474 556 358 488 425 370 294 456 246 379 444 331 611 382 556 365 606 383 291 502 219 354 262 256 339 512
3994 512 220 469 313 527 555 395 419 421 315 196 289 355 180 347 320 343 354 398 465 318 468 164 591 278 359 194 236 375
3857 375 49 314 440 305 310 474 370 484 312 344 348 113 314 284 272 159 261 251 334 433 271 405 371 281 482 354 179
3724 179 222 312 168 143 273 168 414 150 581 256 268 333 366 377 300 163 242 280 52 259 214 155 392 237 302 318 359 442 334
3581 334 170 289 186 250 203 110 236 178 314 236 441 242 325 325 302 286 182 305 72 221 221 55 214 369 258 322 170 410
$$ packed form
4521A375O4j47J07M9j31q6q6J21k27K23k86l5N6J45j44Q3N1o1P8j94J63l29J60r8j21j15K74
4388H89k91l1L74j83n5R1J75m14K97j32J94m01J33k14L13l10J94k20L20r0o0K37o6j11M3o2
4260F20pRl69K68j17M7N4J21j87K58k09J87j99J40p5J9j93J66k45J56L5r3Q3j04N6K88k32
4127D77O7p0Q2j98J30o3n5p6J62k10J33O5j13K80k29J74j91K41k23r2K11k83J35r2oQ3J73
3994E12k92K49j56K14K8j60K4Kj06j19R3O6j75J67k7K3J1M4O7j47J50l04M27l13Q1j65M2J39
3857C75l26K65J26j35NJ64j04J14j72L2Mk35K01l0j2j13J02j0Q3R9j62J34l4r0K01j28j75
3724A79M3R0j44k5J30j05K46k64M31l25J2O5L3J1p7j37P9L8k28K07m5n9K37j55O5J6M1Q3j08
3581C34j64J19j03O4m7r3J26n8J36p8K05j99Q3%k3j6j04J23k33J49%j66J59J55j11O4j52K40
$$ plain form
3443 410 227 393 223 245 239 134 192 116 249 245 224 94 431 321 169 435 321 312 218 276 278 76 313 124 348 242 181 278 376
3300 376 274 317 222 261 428 284 146 253 255 83 280 262 179 211 274 282 375 101 409 9 486 386 445 625 1215 2923 4084
3168 4084 5890 2839 366 473 81 236 397 250 673 1129 461 269 307 234 354 218 190 176 628 146 177 215 294 253 227
3045 227 43 163 149 92 341 159 27 345 189 382 251 388 196 250 175 202 1502 2134 2649 2864 1928 868 361 292 330
2921 330 247 128 233 767 1135 745 1111 279 747 35 43 224 188 411 301 172 164 313 201 147 200 108 126 136 143 17 127 204
2784 204 237 242 429 209 208 254 130 241 75 188 102 110 17 181 227 203 341 351 189 327 168 488 153 316 135 354 106 86
2646 86 178 227 208 246 304 36 322 249 225 184 242 8 178 111 138 75 196 114 153 276 380 104 197 109 495 174 221 188 196 288 79
2493 79 71 241 283 125 260 184 192 355 35 243 56 186 105 179 45 86 298 116 239 226 98 193 363 204 159 148 95 239
$$ packed form
3443D10j83J66j70K2oj05N8p6J33mk1j30L37j10j52K66j14rr4N8Kk02K37j89K24j06o1R7R8
3300C76j02M3r5L9J67j44j38J07Kj72J97j8q3L2O3QR3k74L08m00M77j00N9J80N90J708J161
3168D084J806l051k473J07l92J55J61j47M23M56o68j92L8p3J20j36k8j4M52m82L1L8P9m1k6
3045B27j84J20j4n7K49j82j32L18j56J93j31J37j92N4p5K7J300O32N15K15r36j060n07o9L8
2921C30q3j19J05N34L68l90L66q32M68p12QJ81l6K23j10j29qJ49j12n4N3r2J8J0Pj26J10P7
2784B04L3NJ87k20jM6j24J11j66J13q6Qr3J64M6k4J38J0j62J38j59L20l35J63j81K19k48k0
2646H6R2M9j9L8N8k68K86p3k4m1N8k34J70o7K7o3J21q2L9J23J04k76R3q8L86l21M7l3QR2k09
2493G9qJ70M2j58J35p6QJ63l20K08j87J30q1P4j34M1K12j82J23j3j28R5J70j59m5j1n3J44
$$ plain form
2355 239 196 71 200 86 255 182 200 253 281 75 133 222 89 92 209 105 265 162 326 334 77 298 190 250 213 125 116 248 254
2213 254 172 141 74 76 110 186 154 149 170 185 209 356 160 198 182 198 288 104 118 136 173 71 134 322 103 293 63 437 198 209 212
2060 212 105 214 102 134 42 228 98 145 177 123 256 141 319 192 114 302 265 274 207 131 24 188 77 103 110 252 386 333
1922 333 361 411 425 482 483 427 239 440 323 163 327 559 447 894 679 1060 1244 1220 1619 1623 1600 1790 2284 2450 2733 3416 4214
1789 4214 5317 7453 11837 20949 38871 78839 172325 342209 560275 588800 411326 198216 89453 35465
1720 35465 19030 12038 8777 6390 4941 3928 3374 3014 2340 2296 1915 1721 1482 1105 1198 778 903 543 536 558 488 697
1612 697 396 682 487 440 500 435 204 364 121 203 240 96 412 122 302 253 406 363 87 357 215 184 260 179 224 234 243 212
1474 212 108 229 342 390 112 274 46 31 59 93 187 179 150 274 354 179 462 190 219 228 107 111 99 153 306 253 148 221 305 162
$$ packed form
2355B39m3j25J29j14J69p3J8N3K8k06N8Q9j33LJ17j04J60j03J64Qk57K21j08O0l7q8rJ32O
2213B54q2l1o7KL4P6l2nK1J5K4J47j96L8j6J6R0j84J4J8L7j02O3J88k19J90k30L74k39J1L
2060B12j07J09j12L2r2J86j30M7L2n4J33j15J78j27p8J88l7Ro7p6j07J64j11K6PJ42J34n3
1922C33K8N0J4N7Jn6j88K01j17j60J64K32j12M47k15L81J84k4L99Mk3J90M94J66K83O83P98
1789D214J103K136M384R112J7922L9968R3486J69884K18066K8525j77474k13110j08763n3988
1720C5465j6435o992l261k387j449j013n54l60o74m4l81j94k39l77R3m20J25l60pK2p0K09
1612F97l01K86j95m7O0o5k31J60k43Q2L7j44L16k90J80m9J53m3k76K70j42l1P6q1M5J0Rl1
1474B12j04J21J13M8k78J62k28j5K8L4R4qk9J24Q0j75K83k72K9Rj21Mj2N4J53n3j05P3Q4j43
$$ plain form
1327 162 390 162 346 212 240 180 71 24 105 100 106 373 289 426 177 364 410 195 318 229 94 156 76 122 75 288 21 469
1189 469 308 374 371 282 332 155 149 233 265 67 39 193 246 157 374 503 333 436 250 342 443 151 346 85 99 64 89 254 134
1046 134 610 147 519 409 480 316 418 346 161 293 250 160 292 240 440 297 416 400 626 380 568 303 434 307 377 51
918 51 201 287 196 349 273 576 522 505 545 639 452 390 410 375 217 374 219 215 472 516 411 642 500 782 638 650 688 441 451
775 451 417 361 496 416 390 768 706 794 817 913 960 818 857 854 505 793 729 624 848 823 978 1126 1161 1330 1233 1472 1303 1240 1452
633 1452 1490 3978 1310 1838 4771 2903 2498 3462 5008 9029 14870 23217 39805 101273 630871 370352 135024
549 135024 642456 308063 64875 26075 11328 6143 3905 2527 1937 1899 3519 2597 1599 5158 323 1514
470 1514 1828 1716 1372 1507 1271 834 1097 738 634 867 587 841 711 1161 956 1065 1170 796 710 916 646 670 626 467
$$ packed form
1327A62K28k28J84j34K8o0j09m7Q1nOK67q4J37k49J87M6k15J23q9j35O2q0M6m7K13k67M48
1189D69j61O6lq9N0j77oQ4L2j98k8J54N3q9K17J29j70J03j86R2J01k92J95k61J4l5K5J65j20
1046A34M76m63L72j10P1j64J02p2j85J32m3r0J32n2K00j43J19j6K26k46J88k65J31j27P0l26
918E1J50Q6r1J53p6L03n4j7M0R4j87o2K0l5j58J57j55mK57M4j05K31j42K82j44J2L8k47J0
775D51l4n6J35q0k6L78o2Q8K3R6M7j42L9ll49K88o4j05K24k5J55J48L5J69r7K39j69o3K12
633A452L8K488k668N28K933j868m05R64J546M021N841Q347J6588O1468N29598k60519k35328
549A35024N07432l34393k43188l8800j4747n185k238j378n90l8J620r22r98L559m835J191
470A514L14j12l44J35k36m37K63l59j04K33k80K54j30M50k05J09J05l74q6K06k70K4m4j59
$$ plain form
352 467 207 549 698 846 639 600 710 707 850 781 671 542 412 228 282 196 175 452 448 645 646 513 834 496 663 712 468 346
214 346 165 222 70 194 319 458 546 458 783 542 522 634 554 449 497 209 183 110 210 301 206 487 510 574 588 648 426 674
76 674 384 522 163 201 193 231 156 231 493 525 585 547 664 449 579 607 368 285 301 294 195 221 362 387 494 523 606 722 424 652
-71 652 606 358 507 352 349 135 424 130 425 489 508 726 508 635 570 677 551 454 410 381 376 214 372 418 316 583 748 604
-209 604 682 619 655 641 617 547 381 447 522 300 512 595 599 408 881 649 801 790 827 665 598 645 449 584 547 490 702 684 759 791
-357 791 986 719 868 930 885 837 711 866 609 848 734 832 746 1096 1060 1027 1067 1198 1205 1313 1194 1083 1148 1163 971 1198 1137 1239
-495 1239 1088 1300 1343 1328
-514 1328
$$ packed form
352D67k60L42J49J48k07l9J10lJ43o9j10j29j30j84N4q6k1K77mJ97Jj33L21l38J67M9k44j22
214C46j81N7j52J24J25J39Q8q8L25k41k0J12q0j05M8k88k6p3J00R1r5K81K3O4J4O0k22K48
76F74k90J38l59L8qL8p5P5K62L2O0l8J17k15J30K8k39q3J6pr9K6J41K5J07K9Q3J16k98K28
-71F52m6k48J49j55lk14K89k94K95O4J9K18k18J27o5J07j26r7m4k9nj62J58M6j02K67J65j44
-209F04P8o3L6j4k4p0j66O6P5k22K12Q3Mj91M73k32J52j1L7j62o7M7j96J35l7n7K12j8P5L2
-357G91J95k67J49O2m5m8j26J55k57K39j14R8q6L50l6l3M0J31PJ08j19j11O5J5j92K27o1J02
-495A239j51K12M3j5
-514A328
##PAGE=	F1=-1021.23
##FIRST=	4521.1594499999982872,	4521.1594499999982872,	0
##DATA TABLE=	(F2++(Y..Y)), PROFILE
$$ plain form
4521 1602 1705 1550 1595 1694 1517 1425 1305 1434 1226 1451 1150 1152 1189 1356 1200 1285 1325 1298 1250 1148 1252 965 1069 976 825 709 1048
4388 1048 738 729 1033 943 851 937 1134 679 963 851 1001 599 715 552 782 528 777 496 856 774 692 955 853 782 764 693
4260 693 695 661 339 601 420 552 671 674 560 821 585 790 557 714 589 664 372 596 333 481 552 483 565 440 543 782
4132 782 572 637 540 640 449 550 375 420 361 520 324 449 538 417 698 478 628 446 681 400 354 529 303 370 305 316
4004 316 409 579 312 545 415 629 621 409 493 447 366 221 330 375 242 415 378 435 409 462 554 388 523 263 598 325 390 236
3867 236 227 439 130 402 480 379 380 573 439 514 363 407 352 182 330 312 312 240 276 327 377 517 344 468 420 333 522 347 249
3724 249 266 329 172 207 364 176 449 252 640 301 348 386 387 433 322 170 245 332 41 329 294 236 457 287 362 347 433 476 346
3581 346 229 323 159 296 285 84 275 278 341 275 508 316 343 431 261 347 204 302 118 256 244 143 248 430 287 376 252
$$ packed form
4521A602J03j55M5R9j77r2j20J29k08K25l01KL7J67j56Q5M0k7m8j02J04k87J04r3j51j16L39
4388A048l10rL04r0r2Q6J97m55K84j12J50m02J16j63K30k54K49k81L60q2q2K63j02p1j8p1
4260F93Kl4l22K62j81J32J19Lj14K61k36K05k33J57j25P5k92K24k63J48P1o9Q2j25J03K39
4132G82k10O5r7J00j91J01j75M5n9J59j96J25Q9j21K81k20J50j82K35k81m6J75k26O7o5J1
4004C16R3J70k67K33j30K14qk12Q4m6q1j45J09M5j33J73l7N7k6N3R2j66J35k60L35k73O5j54
3867B36rK12l09K72P8j01JJ93j34P5j51M4n5j70J48j8%p2L6N1N0J40j73J24m8q7J89j75r8
3724B49J7O3j57L5J57j88K73j97L88l39M7L8JM6j11j52P5Q7k91K88l5n8K21j70P5j5Q6M3j30
3581C46j17R4j64J37j1k01J91LO3o6K33j92K7Q8j70Q6j43R8j84J38j2j01J05J82j43Q9j24
$$ plain form
3448 252 458 267 413 248 315 209 130 241 106 291 264 283 109 482 415 197 469 338 334 268 297 238 113 314 170 400 229
3315 229 220 350 407 328 357 266 282 451 280 179 235 261 47 346 277 232 256 265 345 444 110 440 83 439 333 468 509 1355 3505
3172 3505 4347 5729 2453 222 616 95 245 443 282 494 830 346 244 320 211 355 298 226 208 669 189 212 255 310
3054 310 267 253 50 181 174 57 374 210 33 396 258 399 289 484 239 284 170 204 1423 2419 3016 3421 2169 964
2936 964 490 354 411 227 173 271 900 1216 715 954 414 762 48 72 288 190 447 390 191 208 320 239 179 212 109 123 161
2803 161 148 48 153 234 322 238 445 266 222 291 136 215 105 182 135 135 47 229 230 245 367 403 231 351 196 456 144 278 80
2661 80 305 50 103 208 243 277 281 345 43 343 284 258 198 250 6 179 66 158 86 291 146 223 301 422 90 242 89 478
2523 478 198 220 201 164 327 121 52 284 349 144 291 247 226 354 31 267 31 180 109 201 17 125 305 128 295 208 186
$$ packed form
3448B52K06j91J46j65O7j06p9J11j35J85k7J9j74L73o7k18K72j31mo6K9n9j25K01j44K30j71
3315B29rJ30N7p9K9r1J6J69j71j01N6K6k14K99o9m5K4RQ0R9l34L30l57L56j06J35M1Q46K150
3172C505Q42J382l276k231L94n21J50J98j61K12L36m84j02P6j09J44n7p2j8M61m80K3M3N5
3054C10m3j4k03J31pj17L17j64j77L63j38J41j10J95k45M5j14L4J219R96N97M05j252j205
2936I64m74j36N7j84n4R8O29L16n01K39n40L48p14K4K16r8K57n7j99J7J12q1o0L3j03J4L8
2803A61j3j00J05Q1Q8q4K07j79m4O9j55P9j10P7m7%q8J82JJ5J22L6j72J20j55K60l12J34j98
2661H0K25k55N3J05L5L4MO4l02L00n9k6o0N2k44J73j13R2p2K05j45P7P8J21l32J52j53L89
2523D78k80K2j9l7J63k06o9K32O5k05J47m4k1J28l23K36k36J49p1R2j84J08J80j77J67q7k2
$$ plain form
2390 186 203 378 223 157 159 128 181 176 68 226 116 319 212 225 284 323 105 165 239 102 110 180 84 283 143 340 374 43 350
2247 350 187 320 260 148 156 276 248 141 138 68 129 90 267 190 151 250 187 268 364 184 180 205 173 266 137 129 167 199 45 180 371
2095 371 148 325 111 436 182 215 228 139 206 123 151 52 270 115 123 256 144 291 180 349 242 128 358 292 320 226 145 20
1957 20 198 104 100 154 281 455 313 419 533 476 538 552 495 262 498 376 174 418 643 568 1024 850 1259 1480 1457 1897 1848
1824 1848 2003 2149 2602 2929 3200 4101 5112 6517 8959 13336 22721 42699 90672 207444 406124 674678 674830
1740 674830 482671 218702 105901 42476 22602 14081 10266 7447 5803 4658 3912 3477 2763 2664 2253 1974 1745
1656 1745 1260 1334 934 1024 683 674 662 583 798 494 756 550 512 565 461 183 433 73 196 321 102 468 129 359 316 430
1528 430 350 82 309 194 237 278 226 252 259 311 198 131 280 362 424 121 256 45 46 21 101 214 192 185 305 406 213 490 190
$$ packed form
2390A86J7J75j55o6Kl1N3nj08J58j10K03j07J3N9L9k18O0P4j37QP0r6J99j40J97L4l31L07
2247C50j63J33o0j12QJ20k8j07lp0O1l9J77p7l9R9o3Q1R6j80mK5l2R3j29qL8L2j54J35J91
2095C71k23J77k14L25k54L3J3q9O7q3K8r9K18j55QJ33j12J47j11J69j07j14K30o6K8r4q1j25
1957B0J78r4mN4J27J74j42J06J14n7O2J4n7k33K36j22k02K44K25p5M56j74M09K21k3M40m9
1824A848J55J46M53L27K71R01J011J405K442M377R385J9978M7973J16772J98680K68554J52
1740F74830j92159k63969j12801o3425j9874q521l815k819j644j145p46m35p14r9m11k79k29
1656A745m85P4m00R0l41rj2p9K15l04K62k06l8N3j04k78K50l60J23J25k19L66l39K30m3J14
1528D30q0k68K27j15M3M1n2K6PN2j13o7J49Q2O2l03J35k11Jk5Q0J13k2pJ20J01j93K77l00
$$ plain form
1386 190 221 224 68 95 118 139 334 316 181 259 366 166 435 207 318 249 242 111 44 64 163 172 78 447 332 442 199 397 482
1243 482 174 344 246 44 155 114 115 164 318 59 519 381 427 376 343 396 104 185 234 266 115 28 254 303 228 441 571 397
1105 397 487 295 368 458 165 327 112 44 97 153 332 226 614 238 596 476 516 347 440 339 162 282 178 173 315 299 509
972 509 393 510 484 681 452 615 273 472 302 386 27 245 368 260 410 409 665 596 590 634 667 479 420 433 371 264 387 299
834 299 296 573 606 543 761 616 892 678 736 725 452 494 465 392 579 532 497 876 851 946 951 1048 1069 922 969 848 610 852 807 749
687 749 970 997 1210 1265 1422 1498 1449 1650 1501 1382 1589 1659 4608 1626 2117 5591 3331 3107 4174 5553 9283 15352 24564
574 24564 44212 119026 727082 429031 153677 744968 359481 76963 31617 13987 6804 4480 2629
510 2629 2137 2151 3916 2996 1903 5936 442 1751 2102 1939 1552 1668 1413 935 1190 830 727 1009 709 1024 880 1343
$$ packed form
1386A90L1Lj56K7K3K1J95j8j35P8J07k00K69k28J11o9pj31o7K0R9Rr4L69j15J10k43J98Q5
1243D82l08J70r8k02J11m1JM9J54k59M60j38M6n1l3N3k92Q1M9L2j51q7K26M9p5K13J30j74
1105C97R0j92P3R0k93J62k15o8N3N6J79j06L88l76L58j20M0j69R3j01j77J20j04nJ42j6K10
972E09j16J17k6J97k29J63l42J99j70Q4l59K18J23j08J50jK56o9oM4L3j88n9J3o2j07J23q8
834B99lK77L3o3K18j45K76k14N8j1k73M2k9p3J87m7l5L79k5R5NR7K1j47M7j21k38K42m5n8
687G49K21K7K13N5J57P6m9K01j49j19K07P0K949k982M91L474k260k24J067J379L730O069R212
574B4564J9648P4814O08056k98051k75354N91291l85487k82518m5346j7630p183k324j851
510B629m92J4J765r20j093M033n494J309L51j63l87J16k55m78K55l60j03K82l00L15j44M63
$$ plain form
401 1343 1132 1237 1335 860 754 976 738 721 603 351 341 618 811 952 765 788 847 785 948 870 717 548 417 229 267 255
273 255 282 570 574 759 759 680 899 604 734 728 511 374 152 199 22 266 395 570 638 596 877 680 572 764 575 473 507 182
135 182 155 67 296 354 318 592 622 691 681 738 510 742 420 551 187 143 155 293 274 286 619 610 715 648 740 561 627 669 417 290
-12 290 285 286 220 317 429 498 595 602 757 809 541 751 610 420 529 412 344 170 446 268 561 555 666 828 598 783 621 757
-150 757 635 484 466 403 399 295 487 492 457 657 912 712 791 738 737 729 667 607 429 446 628 405 574 748 747 540 1006 768 938
-293 938 916 923 733 681 751 461 689 649 579 854 825 928 914 1143 881 1003 1083 1007 913 909 909 715 961 887 1053 901 1277 1223 1258 1310
-440 1310 1363 1384 1517 1375 1267 1283 1356 1139 1399 1334 1434 1327 1554 1582 1578
-514 1578
$$ packed form
401A343k11J05R8m75j06K22k38j7j18k52j0K77J93J41j87K3N9o2J63p8j53j69j31j88L8j2
273B55K7K88MJ85%p9K19k95J30ok17j37k22M7j77K44J29J75O8m2K81j97j08J92j89j02L4l25
135A82k7q8K29N8l6K74L0O9j0N7k28K32l22J31l64m4J2J38j9J2L33rJ05o7R2j79O6M2k52j27
-12B90nJo6R7J12O9R7PJ55N2k68K10j41j90J09j17o8j74K76j78K93oJ11J62k30J85j62J36
-150G57j22j51j8o3mj04J92Nl5K00K55k00P9n3jqo2o0j78J7J82k23J69J74jk07M66k38J70
-293I38k2Pj90n2P0k90K28m0p0K75k9J03j4K29k62J22Q0p6r4m%j94K46p4J66j52L76n4L5N2
-440A310N3K1J33j42j08J6P3k17K60o5J00j07K27K8m
-514A578
##PAGE=	F1=-1031.07
##FIRST=	4521.1594499999982872,	4521.1594499999982872,	0
##DATA TABLE=	(F2++(Y..Y)), PROFILE
$$ plain form
4521 1725 1869 1707 1696 1821 1619 1529 1378 1522 1331 1567 1247 1304 1313 1495 1339 1397 1432 1452 1281 1256 1294 1087 1108 1066 872 757 1138
4388 1138 841 852 1065 1071 961 1018 1213 769 1007 929 1020 660 723 651 769 607 876 579 922 870 758 1034 902 872 790 715 749
4255 749 665 405 653 413 631 785 676 655 902 653 838 614 753 613 725 360 617 380 507 583 553 626 514 633 802
4132 802 637 683 581 675 512 558 335 429 420 551 390 502 593 503 732 546 654 497 702 406 394 518 377 370 335 364 464 605
3994 605 398 586 486 690 653 405 512 464 401 225 361 379 294 457 410 516 438 499 606 427 557 325 569 342 395 302 225
3862 225 470 213 459 499 431 433 637 476 499 394 441 331 247 330 331 329 309 274 402 406 565 400 495 447 365 527 308 301 310 318 165 270
3704 270 436 176 465 329 671 332 399 423 372 462 327 148 246 358 54 383 352 317 487 320 400 359 481 470 343 265 330
3571 330 133 325 356 64 291 361 348 310 547 367 345 500 209 371 213 281 160 269 248 228 265 469 306 401 330 474 302
$$ packed form
4521A725J44j62j1J25k02r0j51J44j91K36l20N7RJ82j56N8L5K0j71k5L8k07K1m2j94j15L81
4388A138k97J1K13Oj10N7J95m44K38p8R1l60O3p2J18j62K69k97L43n2j12K76j32l0q2p5L4
4255G49q4k60K48k40K18J54j09k1K47k49J85k24J39j40J12l65K57k37J27P6l0P3j12J19J69
4132H02j65M6j02R4j63M6k23R4rJ31j61J12R1r0K29j86J08j57K05k96j2J24j41pl5K9J00J41
3994F05k07J88j00K04l7k48J07m8o3j76J36J8q5J63m7J06p8O1J07j79J30k32K44k27N3r3p7
3862B25K45k57K46M0o8KK04j61K3j05M7j10q4Q3Jkk0l5J28MJ59j65R5m8q2J62k19pRQj53J05
3704B70J66k60K89j36L42l39O7K4n1R0j35j79R8J12l04L29l1l5J70j67Q0m1J22j1j27p8O5
3571C30j97J92L1k92K27P0j3l8K37j80k2J55k91J62j58O8j21J09k1k0L7K04j63R5p1J44j72
$$ plain form
3438 302 397 264 366 174 118 276 127 327 270 328 160 488 488 216 463 336 338 300 302 188 146 277 204 428 232 257 398 399 365
3296 365 372 289 301 440 256 212 208 259 24 400 284 281 290 279 380 490 103 438 159 380 302 481 432 1425 4017 4384 5207 1947
3158 1947 278 696 106 253 473 331 299 704 524 219 314 206 330 377 245 256 667 224 224 292 289 292 259 90 191 190 108 384
3020 384 238 88 427 311 399 311 555 274 324 238 245 1378 2770 3495 3985 2362 1023 569 410 454 212 203 275 989 1246
2897 1246 605 697 551 761 94 101 330 195 454 457 198 249 303 255 225 202 104 112 191 139 104 190 261 391 222 432 318 208 309
2754 309 160 160 142 169 153 174 95 266 242 280 376 429 246 356 222 399 148 230 20 236 43 124 238 248 324 308 371 70 345
2611 345 302 268 209 249 33 165 36 165 98 369 172 279 300 438 98 263 98 435 205 202 209 141 344 186 69 316 392
2478 392 150 322 272 254 332 26 271 43 172 144 252 37 182 297 167 327 187 266 205 366 250 139 156 155 110 146 110
$$ packed form
3438C02R5j33J02j92n6J58j49K00n7N8j68L28%k72K47j27Kl8Kj14m2J31p3K24j96K5J41Jl4
3296C65Pq3J2J39j84m4mN1k35L76j16lRj1J01J10l87L35k79K21p8J79m9R93K592L67Q23l260
3158A947j669M18n90J47K20j42l2M05j80l05R5j08J24M7j32J1M11m43%O8lLl3j69J01jq2K76
3020C84j46j50L39j16Q8q8K44k81N0q6PJ133J392P25M90j623j339m54j59M4k42rP2P14K57
2897A246o41R2j46K10o67PK29j35K59Lk59N1N4m8l0k3r8QP9n2l5Q6P1J30j69K10j14j10J01
2754C09j49%j8K7j6K1p9J71k4L8R6N3j83J10j34J77k51Q2k10K16j93Q1J14J0P6j6O3l01K75
2611C45m3l4n9M0k16J32j29J29o7K71j97J07K1J38l40J65j65L37k30lPo8K03j58j17K47P6
2478C92k42J72n0j8P8l06K45k28J29k8J08k15J45J15j30J60j40P9o1J61j16j11J7jm5L6l6
$$ plain form
2346 110 227 145 368 232 242 288 346 136 180 238 122 130 132 81 292 112 345 416 17 387 170 375 284 175 180 287 223 99 129
2203 129 52 176 67 343 215 149 318 174 311 339 199 141 217 150 248 169 132 177 226 30 218 399 177 346 148 414 173
2070 173 199 240 165 187 131 173 65 301 149 105 323 159 303 214 361 272 132 403 295 347 226 149 17 194 120 100 218 295
1932 295 493 294 449 625 497 563 581 522 292 520 389 195 515 676 656 1096 984 1373 1623 1614 2056 1989 2235 2392 2744 3214
1804 3214 3491 4539 5671 7314 9976 14347 23438 43950 96734 232085 444533 748011 714987 521656 224895
1730 224895 116069 47370 25072 15266 11093 8016 6304 5095 4209 3702 3003 2889 2438 2101 1884 1343 1393 1031 1097
1637 1097 778 764 743 634 839 570 783 577 546 584 462 148 469 69 183 390 141 501 122 393 359 430 317 90 232
1514 232 197 276 300 273 276 257 360 185 146 303 351 427 122 226 50 77 61 107 239 192 237 321 434 220 491 170 215 199 57
$$ packed form
2346A10J17q2K23j36J0M6N8k10M4N8j16QKn1K11j80K33P1l99L70k17K05r1j09NJ07o4j24L0
2203A29p7J24j09K76j28o6J69j44J37K8j40n8P6o7R8p9l7M5M9j96J88J81k22J69j98K66k41
2070A73K6M1p5K2n6M2j08K36j52m4K18j64J44q9J47q9j40K71j08N2j21p7j32J77p4k0J18P7
1932B95J98j99J55J76j28O6J8n9k30K28j31j94L20J61k0M40j12L89K50rM42o7K46J57L52M70
1804C214K77J048J132J643K662M371R091K0512N2784J35351K12448L03478l3024j93331k96761
1730B24895j08826o8699k2298r806m173l077j712j209q86n07o99j14m51l37k17n41N0l62O6
1637A097l19j4k1j09K05k69K13k06l1L8j22l14L21m00J14K07k49L60l79K71l4P1j13k27J42
1514B32l5P9K4k7Lj9J03j75l9J57M8P6l05J04j76K7j6M6J32m7M5Q4J13k14K71l21M5j6j42
$$ plain form
1371 57 69 134 122 340 364 207 271 410 163 449 235 267 264 238 29 10 98 220 233 54 503 356 430 205 401 522 145 336
1233 336 240 49 144 158 120 248 334 132 533 421 464 354 368 435 45 224 206 258 160 71 318 349 288 471 598 441 500 323
1095 323 376 428 169 269 144 63 138 210 405 301 583 319 623 523 504 363 420 312 139 255 95 201 324 352 556 464
967 464 573 526 700 484 620 219 474 273 374 58 262 450 318 455 531 705 632 628 691 654 464 418 412 346 319 382 365 374 660
825 660 652 641 830 693 938 675 771 712 423 501 498 429 631 631 589 939 945 1029 1036 1107 1116 962 1011 776 682 869 849 842 1049 1121 1372 1340 1594
662 1594 1581 1572 1722 1595 1428 1635 1724 4969 1856 2290 6116 3590 3492 4654 5868 9080 14954 24429 45926 129511 780434
559 780434 463540 163271 804063 390073 84829 35698 16176 7121 4705 2528 2214 2287 4093 3223 2101
485 2101 6363 562 1883 2239 2044 1631 1711 1462 978 1211 882 797 1110 801 1148 1002 1444 1243 1327 1417 857 741 969 765
$$ packed form
1371E7J2O5j2K18K4j57O4J39k47K86k14L2lk6k09j9Q8J22J3j79M49j47P4k25J96J21l77J91
1233C36r6j91R5J4l8J28Q6k02M01j12M3j10J4O7l90J79j8N2r8q9K47L1o1J83J27j57N9j77
1095C23N3N2k59J00j25q1P5P2J95j04K82k64L04j00j9j41N7j08j73J16j60J06J23K8K04r2
967D64J09m7J74k16J36m01K55k01J01l16K04J88j32J37P6J74p3mO3l7j90m6oo6k7O3j7RK86
825F60qj1J89j37K45k63R6n9k89P8lo9K02%m2L50OQ4PP1Rj54M9k35r4J87k0pK07P2K51l2K54
662A594j3rJ50j27j67K07Q9L245l113M34L826k526r8J162J214L212N874R475K1497Q3585O50923
559G80434l16894l00269O40792m13990l05244m9131j9522r055k416k177l14P3J806q70j122
485B101M262n801J321L56j95m13Q0k49m84K33l29q5L13l09L47j46M42k01Q4R0n60j16K28k04
$$ plain form
367 765 760 545 298 467 675 889 1024 852 921 919 813 976 895 723 506 384 230 250 313 384 652 679 834 823 802 896 669 757
229 757 694 510 361 136 190 118 330 464 654 691 706 902 788 578 842 553 446 486 139 113 73 375 396 444 663 687 766 736
91 736 771 562 749 425 534 191 65 124 364 375 323 719 663 803 709 768 625 631 682 438 268 247 262 260 406 485 588 655 646 867
-56 867 837 632 786 570 464 507 437 337 219 442 413 654 581 798 870 647 883 630 780 666 484 484 414 419 369 573 542 574
-194 574 696 1020 785 836 800 774 780 657 638 447 422 693 481 626 857 849 647 1061 843 1015 971 960 752 724 801 469 753 713
-332 713 655 956 918 1038 985 1229 985 1073 1160 1072 924 1031 900 790 1022 982 1217 1012 1384 1312 1414 1457 1450 1466 1629 1465 1380 1340
-470 1340 1457 1237 1519 1458 1549 1500 1710 1725 1733
-514 1733
$$ packed form
367G65nk15k47J69K08K14J35j72O9kj06J63q1j72k17j22j54K0O3P1K68K7J55j1k1R4k27Q8
229G57o3j84j49k25N4p2K12J34J90L7J5J96j14k10K64k89j07M0l47k6m0L02K1M8K19K4P9l0
91G36L5k09J87l24J09l43j26N9K40J1n2L96n6J40r4N9j43ON1k44j70k1J5kJ46P9J03O7rK21
-56H67l0k05J54k16j06M3p0j00j18K23k9K41p3K17P2k23K36k53J50j14j82%p0Nn0K04l1L2
-194E74J22L24k35N1l6k6Oj23j9j91k5K71k12J45K31qk02M14k18J72m4j1k08k8P7l32K84m0
-332G13n8L01l8J20n3K44k44Q8Q7q8j48J07j31j10K32m0K35k05L72p2J02M3pJ6J63j64q5m0
-470A340J17k20K82o1R1m9K10J5Q
-514A733
##PAGE=	F1=-1040.92
##FIRST=	4521.1594499999982872,	4521.1594499999982872,	0
##DATA TABLE=	(F2++(Y..Y)), PROFILE
$$ plain form
4521 1725 1902 1739 1686 1806 1608 1525 1349 1517 1330 1588 1255 1365 1353 1531 1391 1402 1432 1510 1236 1257 1243 1130 1062 1103 862 752
4393 752 1142 894 911 1035 1117 1016 1021 1194 806 973 942 966 682 679 707 710 653 907 643 913 909 769 1039 886 900 756 683 766 631
4250 631 437 668 387 676 833 633 707 923 681 810 635 725 603 735 347 592 411 519 564 586 640 568 679 768 659 676
4122 676 586 654 538 509 330 393 460 548 436 522 603 563 711 572 629 509 667 401 405 470 429 356 346 391 489 586 460 584 512 703
3975 703 642 380 473 464 412 209 378 371 329 466 411 570 435 498 616 424 564 344 508 328 369 364 257 461 281 477 497 447
3837 447 462 655 473 447 399 441 291 295 310 337 326 352 262 463 415 568 423 479 447 370 497 239 327 350 282 148 315 480 164
3694 164 456 370 665 340 411 436 327 459 314 101 251 351 76 419 369 383 476 329 410 352 497 423 329 276 305 133 329
3561 329 404 74 281 413 332 334 553 384 332 523 159 356 211 247 191 264 237 291 265 476 306 397 388 454 325 347 268 391 145
$$ packed form
4521A725J77j63n3J20j98q3j76J68j87K58l33J10j2J78j40J1L0P8k74K1j4j13o8M1k41j10
4393G52L90k48J7J24Q2j01NJ73l88J67l1K4k84lK8Ln7K54k64K70mj40K70j53J4j44p3Q3j35
4250F31j94K31k81K89J57k00P4K16k42J29j75R0j22J32l88K45j81J08M5K2N4p2J11Q9j09J7
4122F76r0O8j16k9j79O3O7Q8j12Q6Q1m0J48j39N7j20J58k66MO5m1p3j0M5R8R7j26J24p2J91
3975G03o1k62R3rn2k03J69pm2J37n5J59j35O3J18j92J40k20J64j80M1nj07K04j80J96K0n0
3837D47J5J93j82k6m8M2j50MJ5K7j1K6r0K01m8J53j45N6l2p7J27k58Q8K3o8j34J67J65l16
3694A64K92q6K95l25P1K5j09J32j45k13J50J00k75L43n0J4R3j47Q1n8J45p4r4n3K9j72J96
3561C29P5l30K07J32q1KK19j69n2J91l64J97j45L6n6P3k7N4k6K11j70R1rO6j29K2p9J23k46
$$ plain form
3419 145 102 293 155 352 259 352 216 452 531 219 415 320 319 306 289 134 173 207 223 427 245 284 413 356 377 363 287 314 402 216
3271 216 237 169 249 28 427 283 308 306 303 381 508 81 404 221 316 291 488 413 1420 4356 4112 4376 1507 469 710 116
3143 116 250 485 372 143 826 747 233 288 215 282 439 248 298 618 245 212 316 233 326 247 130 189 199 171 365 241 146 435
3005 435 338 377 311 590 284 353 322 311 1397 3139 3987 4462 2459 1020 589 455 456 194 215 249 1016 1247 445 386 675 737
2877 737 134 122 345 196 430 494 191 278 265 246 262 180 88 93 221 121 148 221 281 425 198 385 360 165 309 188 84 180
2739 180 151 153 216 135 288 264 295 367 422 234 342 237 323 151 180 73 153 73 145 265 241 338 322 374 90 330 299 250 213 244 67
2587 67 137 73 167 107 418 185 313 273 424 125 260 109 369 197 169 212 139 338 252 91 330 405 151 345 259 270 286 19
2449 19 257 65 164 185 305 57 230 274 207 329 164 321 203 327 265 107 139 170 48 109 169 203 163 391 243 245 265 344 164
$$ packed form
3419A45m3J91j38J97r3R3j36K36P9l12J96r5jj3j7j55L9L4J6K04j82L9J29n7K1j4p6K7Q8j86
3271B16K1o8Q0k21L99j44K5klP8J27m27L23j83R5k5J97p5J007K936k44K64k869j038K41n94
3143A16J34K35j13k29O83p9n14N5p3O7J57j91N0L20l73l3J04q3R3p9j17N9J0k8J94j24r5K89
3005D35r7L9o6K79l06O9l1j1J086J742Q48M75k003j439m31j34Jk62K1L4P67K31q02n9K89O2
2877G37o03j2K23j49K34O4l03Q7j3j9J6q2r2NJ28j00K7P3O0J44k27J87k5j95J44j21j04R6
2739A80k9KO3q1J53k4L1P2N5j88J08j05Q6j72K9j07Q0q0P2J20k4R7j6N2k84K40l1m9l7L1j77
2587F7P0o4R4o0L11k33J28m0J51k99J35j51K60j72k8M3p3J99q6j61K39P5k54J94q6J1J6k67
2449A9K38j92R9K1J20k48J73M4o7J22j65J57j18J24o2j58L2L1j22O1O0L4m0K28j48KK0P9j80
$$ plain form
2306 164 179 218 144 147 73 87 291 75 335 444 6 401 142 408 278 205 183 277 186 56 113 30 204 60 398 224 140 358
2168 358 149 331 286 208 88 218 135 245 194 126 166 248 32 240 400 188 353 161 374 169 166 244 178 159 125 194 68 318
2031 318 176 93 366 164 290 237 352 275 125 434 269 349 210 144 27 178 120 98 273 286 493 281 447 676 484 546
1903 546 561 507 315 504 363 220 594 653 698 1101 1053 1388 1647 1660 2066 2024 2257 2483 2684 3265 3553 4661 5821 7564 10279
1779 10279 14571 22935 42450 96043 242021 450327 766967 701647 521158 215906 118276 49420 26150
1716 26150 15452 11124 7984 6348 5159 4213 3654 3014 2925 2435 2085 1873 1342 1361 1057 1109 814 791 784 634 812 612 759
1602 759 563 537 552 435 136 462 116 172 435 182 508 101 395 380 402 271 96 135 219 295 321 310 290 229 383 174 148 298
1464 298 309 399 127 193 47 118 111 110 254 178 278 320 434 201 468 137 200 152 82 41 146 113 322 388 218 257 428 152 431
$$ packed form
2306A64J5L9p4Lp4J4K04k16K60J09m38L95k59K66j30p3k2R4r1j30N7q3J74j44L38j74q4K18
2168C58k09J82m5p8j20J30q3J10n1o8M0Q2k16K08J60k12J65j92K13k05lP8o6j9l4O9j26K50
2031C18j42q3K73k02J26n3J15p7j50L09j65Q0j39o6j17J51n8k2J75J3K07k12J66K29j92O2
1903E46J5n4j92J89j41j43L74N9M5M03m8L35K59J3M06m2K33K26K01N81K88J108J160J743K715
1779A0279M292Q364J9515N3593J45978K08306L16640o5320j80489l05252r7630o8856k3270
1716B6150j0698m328l140j636j189r46n59o40q9m90l50k12n31J9l04N2k95k3pj50J78k00J47
1602G59j96k6J5j17k99L26l46N6K63k53L26m07K94j5K2j31j75L9Q4P6K6j1k0o1J54k09k6J50
1464B98J1R0k72O6j46P1pjJ44p6J00M2J14k33K67l31O3m8p0m1J05l3K09O6j70L9J71k76K79
$$ plain form
1322 431 247 192 254 228 60 26 122 264 276 50 528 360 391 191 374 522 111 293 212 90 124 197 129 311 329 203 508
1189 508 423 481 310 352 444 75 250 156 248 199 112 365 376 327 459 580 458 474 330 365 353 157 178 172 152 176 247 463 347 519
1041 519 374 597 540 447 360 364 264 102 216 77 224 315 387 571 496 594 519 678 470 583 152 440 228 343 112 255 511
908 511 361 470 619 690 619 621 703 604 403 388 355 306 374 366 404 433 719 642 691 839 718 909 626 749 655 360 471 515 466 646
761 646 692 649 947 967 1030 1059 1083 1091 926 978 647 716 839 850 885 1073 1167 1437 1332 1650 1559 1580 1677 1569 1367 1583 1679 4998 1960
618 1960 2330 6261 3638 3597 4808 5862 8424 13712 22794 44636 131081 782249 468207 162379 810137 394908
539 394908 87255 37729 17604 7112 4531 2220 2160 2289 4018 3233 2162 6359 653 1882 2218 2009 1599 1629
451 1629 1413 959 1153 890 836 1145 847 1189 1052 1445 1270 1316 1399 788 669 897 733 775 460 326 566 706 916 1041 879
$$ packed form
1322D31j84n5O2k6j68l4R6J42J2k26M78j68L1k00J83J48m11J82q1j22L4P3o8J82J8j26L05
1189E08q5N8j71M2R2l69J75r4R2m9q7K53J1m9J32J21j22J6j44L5j2j96K1ok0K4P1K16j16J72
1041E19j45K23n7r3q7Mj00j62J14j39J47R1P2J84p5R8p5J59k08J13m31K88k12J15k31J43K56
908E11j50J09J49P1p1KQ2r9k01j5l3m9O8qL8K9K86p7M9J48j21J91k83J23r4k95J11M4m9J80
761F46M6m3K98K0O3K9K4Qj65N2l31O9J23J1L5J88R4K70j05L18r1K1R7j08k02K16R6L319l038
618A960L70L931k623m1J211J054K562N288R082K1842Q6445O51168l14042l05828O47758m15229
539C94908l07653m9526k0125j0492k581k311o0J29J729p85j071M197n706J229L36k09m10L0
451A629k16m54J94k63n4L09k98L42j37L93j75M6Q3o11j19K28j64M2l15j34K40J40K10J25j62
$$ plain form
327 879 983 912 780 933 850 687 424 318 239 252 358 457 684 744 860 824 856 823 675 728 612 466 319 128 208 203 368 513
190 513 692 695 769 857 845 535 857 490 370 437 101 100 107 430 422 548 688 698 786 740 742 571 694 399 471 178 51 105 429 439
42 439 337 778 671 831 721 744 630 595 638 429 224 195 231 308 470 514 643 664 647 919 796 682 749 491 480 447 422 338 266
-101 266 409 541 688 569 877 845 645 914 596 741 645 451 463 415 438 420 612 560 647 693 1054 808 808 796 764 776 591 632
-239 632 431 391 703 516 657 902 888 704 1040 860 1016 948 930 720 722 791 462 772 729 707 986 945 1067 996 1230 1008 1066
-371 1066 1148 1070 871 1057 840 821 1023 1001 1295 1060 1398 1310 1464 1482 1448 1438 1621 1454 1400 1308 1448 1252 1536 1490 1563 1579 1740
-504 1740 1747 1765
-514 1765
$$ packed form
327H79J04p1j32J53q3j63k63j06p9J3J06R9K27O0J16l6L2l3j48N3j16j46j47j91Q0nJ65J45
190E13J79LP4Q8j2l10L22l67j20O7l36jPL23qJ26J40J0Q8m6Kj71J23k95P2k93j27N4L24J0
42D39j02M41j07J60j10K3j14l5M3k09k05k9L6P7J62M4J29K1j7K72j23j14O7k58j1l3k5q4p2
-101B66J43J32J47j19L08l2k00K69l18J45r6j94J2m8K3j8J92n2Q7M6L61k46%j2l2J2j85M1
-239F32k01m0L12j87J41K45j4j84L36j80J56o8j8k10KO9l29L10m3k2K79m1J22p1K34k22N8
-371A066Q2p8j99J86k17j9K02k2K94k35L38q8J54J8l4j0J83j67n4r2J40j96K84m6P3J6J61
-504A740PJ8
-514A765
##PAGE=	F1=-1050.76
##FIRST=	4521.1594499999982872,	4521.1594499999982872,	0
##DATA TABLE=	(F2++(Y..Y)), PROFILE
$$ plain form
4521 1604 1795 1647 1567 1648 1486 1418 1218 1426 1224 1510 1175 1322 1304 1453 1345 1303 1321 1460 1117 1151 1111 1088 939 1076 800 697
4393 697 1059 887 891 954 1069 1008 948 1077 784 863 887 849 659 602 707 618 654 864 676 829 882 726 968 805 864 669 601 743
4255 743 562 430 644 346 681 808 552 708 878 663 711 617 636 556 694 348 526 418 511 493 581 604 587 674 686 628 621 553
4118 553 584 521 409 353 316 472 514 453 502 569 579 639 554 558 481 580 381 388 389 453 326 335 390 480 525 490 539 489 668 586 338 382 449 396
3950 396 176 377 351 340 439 379 586 400 453 584 376 544 323 426 289 311 402 320 413 325 455 476 422 462 622 430 371 373 408
3807 408 239 320 270 327 305 363 252 497 401 526 406 424 421 349 437 145 325 378 227 124 330 495 141 420 375 624 321 385
3670 385 419 261 422 282 46 258 315 92 437 340 424 428 309 393 325 476 343 308 264 247 170 306 423 99 246 429 297
3537 297 342 525 363 309 499 121 304 203 207 206 245 219 323 251 448 283 369 417 398 332 270 257 391 135 89 289 168 362 230
$$ packed form
4521A604J91j48q0Q1j62o8k00K08k02K86l35J47j8J49j08m2J8J39l43L4m0k3j49J37k76j03
4393F97L62j72MO3J15o1o0J29k93P9K4l8j90n7J05q9L6K10j88J53N3j56K42j63N9j95o8J42
4255G43j81j32K14k98L35J27k56J56J70k15M8r4J9q0J38l46J78j08R3j8Q8K3j7Q7J2n8po8
4118E53L1o3j12n6l7J56M2o1M9O7J0O0q5Mp7R9j99PJO4j27RN5R0M5l5M9n0J79q2k48M4O7n3
3950C96k20K01k6j1R9o0K07j86N3J31k08J68k21J03j37K2R1q2R3q8J30K1n4M0J60j92n9KL5
3807D08j69Q1n0N7k2N8j11K45r6J25j20J8lp2Q8k92J80N3j51j03K06J65l54K79m5K49l03O4
3670C85L4j58J61j40k36K12N7k23L45r7Q4Mj19Q4o8J51j33l5m4j7p7J36J17l24J47J83j32
3537B97M5J83j62n4J90l78J83j01MjL9k6J04p2J97j65Q6M8j9o6o2j3J34k56m6K00j21J94j32
$$ plain form
3394 230 353 255 382 540 201 331 299 279 283 261 89 194 120 223 395 256 295 391 285 363 333 265 312 347 167 252 116 235
3256 235 40 419 273 306 300 319 345 497 45 346 260 259 297 491 437 1342 4428 3488 3346 1382 632 665 125 228 479 390 165
3123 165 1012 954 317 243 232 218 473 240 324 529 246 180 316 150 358 221 160 174 205 216 317 223 192 419 339 334 285 586 263
2981 263 361 395 390 1476 3459 4361 4759 2415 939 556 482 422 170 209 202 980 1238 307 197 777 688 153 134 332 185 376
2853 376 495 169 286 213 214 275 160 64 70 244 108 173 238 287 418 169 307 386 101 294 205 36 214 133 135 244 162 290 283
2710 283 284 340 381 199 312 236 232 147 139 147 67 96 160 279 221 318 319 351 96 302 278 204 208 237 101 99 120 177 111 432 182 322 227 380
2542 380 155 234 106 290 177 125 208 155 311 306 99 325 385 154 353 216 266 220 14 228 81 152 216 341 66 252 239
2410 239 231 300 141 346 200 267 258 65 112 170 55 70 223 160 163 385 243 233 218 315 185 163 184 158 157 15 88 278 49 305
$$ packed form
3394B30J23r8J27J58l39J30l2k0Mk2j72J05p4J03J72j39L9R6j06P8l0o8M7L5j80Q5j36J19
3256B35j95L79j46L3oJ9K6J52m52L01q6jL8J94n4R05L086r40j42j964p50L3n40J03K51q9k25
3123A65Q47n8o37p4j1j4K55k33Q4K05k83o6J36j66K08j37o1J4L1J1J01r4l1K27q0nm9L01l23
2981B63R8L4nJ086J983R02L98k344j476l83p4o0k52L9pP78K58r31j10N80q9n35j9J98j47J91
2853C76J19l26J17p3JO1j15r6OJ74j36O5O5M9J31k49J38P9k85J93q9j69J78q1KJ09q2J28p
2710B83JN6M1j82J13p6mq5qQq0K9O4J19n8R7JL2k55K06k4p4MK9j36kK1N7o6L21k50J40r5J53
2542C80k25P9j28J84j13n2Q3n3J56nk07K26O0k31J99j37N0m6k06K14j47P1O4J25k75J86j3
2410B39qO9j59K05j46O7rj93M7N8j15J5J53o3LK22j42j0j5R7j30k2K1k6jj42P3J90k29K56
$$ plain form
2262 305 449 20 392 105 415 246 236 166 248 144 53 90 36 204 73 421 214 126 364 119 325 212 212 33 206 125 257
2129 257 204 113 139 261 50 242 373 179 345 151 322 162 127 237 176 130 107 209 61 315 182 82 383 154 259 245
2001 245 324 249 109 447 215 323 186 134 51 159 104 95 306 257 453 268 412 678 440 487 490 462 318 454 307 237 636 581
1863 581 687 1037 1040 1303 1546 1582 1923 1941 2075 2409 2435 3080 3371 4448 5560 7237 9796 13866 21192 38445 88742 235313
1755 235313 421979 727499 636476 480903 193341 112122 48312 25752 14694 10376 7341 5917 4829 3921
1686 3921 3342 2796 2749 2244 1932 1719 1257 1243 1010 1057 784 755 771 584 720 612 686 511 488 474 383 177 412 165 166 451 209
1553 209 485 72 360 380 347 221 94 33 238 292 334 327 287 179 375 166 139 270 240 345 144 167 45 157 151 113 257 154
1415 154 294 300 407 167 424 109 178 95 112 22 150 122 279 381 212 220 417 132 384 245 103 222 213 139 55 139 288 300
$$ packed form
2262C05J44m29L72k87L10j69j0p0Q2j04r1L7n4J68j31L48k07q8K38k45K06j13%j79J73q1J32
2129B57n3r1K6J22k11J92J31j94J66j94J71j60l5J10o1m6k3J02j48K54j33j00L01k29J05j4
2001B45P9p5j40L38k32J08j37n2q3J08n5rK11m9J96j85J44K66k38M7Lk8j44J36j47p0L99n5
1863E81J06L50LK63K43L6L41J8J34L34K6O45K91J077J112J677K559M070P326J7253N0297J46571
1755B35313J86666L05520r1023j55573k87562q1219o3810k2560j1058m318l035j424j088r08
1686C921n79n46m7n05l12k13m62j4k33M7k73k9J6j87J36j08P4j75k3j4r1k06K35k47JK85k42
1553B09K76m13K88K0l3j26j27o1K05N4M2pm0j08J96k09k7J31l0J05k01K3j22J12ol8J44j03
1415A54J40OJ07k40K57l15O9q3J7r0J28k8J57J02j69QJ97k85K52j39j42J19rp4q4Q4J49J2
$$ plain form
1277 300 61 512 345 331 155 316 484 79 224 169 120 102 222 135 344 305 256 447 384 474 248 300 424 160 256 102 237
1145 237 226 141 384 379 339 407 522 444 413 315 338 243 126 67 192 238 207 256 494 354 432 394 521 524 353 335 287 199 80 174 151
992 151 227 288 396 549 484 568 464 618 411 513 82 376 179 296 162 230 535 379 450 663 618 558 574 663 525 301 335
859 335 277 259 420 344 409 460 740 574 687 787 686 805 541 674 568 276 408 513 489 622 698 664 898 909 950 1018 980 995
721 995 820 876 482 708 766 811 870 1034 1124 1395 1237 1584 1432 1469 1522 1429 1208 1440 1534 4687 1920 2231 5997 3463 3414 4606
593 4606 5500 7373 11786 19865 40510 123480 731822 441993 151118 761824 373148 83857 37426 18070
524 18070 6851 3976 1737 1994 2157 3695 3014 2077 5913 694 1745 2042 1837 1462 1433 1279 885 1025 852 838 1103
421 1103 837 1138 1022 1346 1207 1205 1278 663 545 778 660 757 355 375 625 705 884 992 838 966 826 688 828 742 612 316
$$ packed form
1277C00k39M51j67j4j76J61J68m05J45n5m9j8J20q7K09l9m9J91o3R0k26N2J24k64R6j54J35
1145B37j1q5K43nm0O8J15p8l1r8K3r5j17n9J25M6l1M9K38j40P8l8J27Lj71j8m8q8j19R4k3
992A51P6O1J08J53o5Q4j04J54k07J02m31K94j97J17j34O8L05j56P1K13m5o0J6Q9j38k24L4
859C35n8j8J61p6O5N1K80j66J13J00j01J19k64J33j06k92J32J05k4J33P6l4K34J1M1O8l8J5
721I95j75N6l94K26N8M5N9J64R0K71j58L47j52L7N3r3k21K32R4L153k767L11L766k534m9J192
593D606Q94J873M413Q079K0645Q2970O08342k89829k90875O10706l88676k89291m6431j9356
524A8070j1219k875k239K57J63J538o81r37L836n219J051K97k05l75k9j54l94J40j73j4K65
421A103k66L01j16L24j39kP3o15j18K33j18R7m02K0K50Q0J79J08j54J28j40j38J40q6j30k96
$$ plain form
293 316 229 250 280 383 482 658 757 832 760 831 691 624 653 498 388 271 129 242 267 372 533 672 647 771 752 839 449 810
155 810 393 258 370 104 144 128 453 428 606 667 655 745 691 652 535 590 346 370 158 137 92 471 456 325 785 628 791 683
17 683 668 574 529 541 395 171 140 203 351 495 507 649 619 602 905 691 681 648 384 465 366 369 343 297 353 627 656 529 887 757
-130 757 594 870 526 643 580 388 408 405 451 435 599 539 663 648 1007 772 713 728 709 713 484 590 389 369 656 507 658 876
-268 876 858 701 946 819 937 855 836 644 673 725 432 748 698 722 938 899 1011 945 1147 941 981 1052 1002 768 986 738 797 968
-406 968 940 1275 1037 1314 1219 1396 1385 1359 1305 1492 1349 1320 1195 1326 1181 1442 1430 1473 1552 1640 1641 1663
-514 1663
$$ packed form
293C16q7K1L0J03R9J76R9P5p2P1j40o7K9j55j10j17j42J13K5J05J61J39k5J24j9Q7l90L61
155H10m17j35J12k66M0j6L25k5J78O1j2R0n4l9j17N5k44K4k12k1m5L79j5j31M60j57J63j08
17F83j5r4m5J2j46k24l1O3J48J44J2J42l0j7L03k14j0l3k64Q1r9Lk6m6N6K74K9j27L58j30
-130G57j63K76l44J17o3j92K0lM6j6J64o0J24j5L59k35n9J5j9Mk29J06k01k0K87j49J51K18
-268H76j8j57K45j27J18q2j9j92K9N2k93L16n0K4K16l9J12o6K02k06M0P1n0k34K18k48N9J71
-406I68k8L35k38K77r5J77j1k6n4J87j43k9j25J31j45K61j2M3P9Q8JK2
-514A663
##PAGE=	F1=-1060.6
##FIRST=	4521.1594499999982872,	4521.1594499999982872,	0
##DATA TABLE=	(F2++(Y..Y)), PROFILE
$$ plain form
4521 1382 1566 1450 1360 1372 1276 1229 1005 1265 1030 1344 1019 1182 1179 1270 1207 1118 1119 1312 944 958 928 970 762 989 696 602 902 822
4383 822 795 835 935 940 811 881 706 699 773 688 591 520 653 510 609 753 670 685 790 636 835 671 777 546 484 684 467 389 582
4241 582 302 645 720 448 654 774 602 558 562 501 481 610 362 431 400 480 379 542 525 561 619 570 547 529 485 477 467 276 371 215
4093 215 451 457 437 444 497 544 531 495 456 420 460 342 347 288 444 286 302 360 438 435 482 459 422 592 491 283 254 420 354 139 358 317
3935 317 330 384 318 563 340 366 522 286 498 273 337 239 230 406 384 336 338 401 434 357 435 545 351 290 320 347 188 320 213 304
3788 304 272 341 253 502 364 446 351 339 370 306 357 46 297 386 165 101 311 480 112 355 345 551 277 329 373 192 354 235
3650 235 61 261 256 99 438 269 432 351 261 355 283 422 242 283 234 164 218 261 411 120 190 411 248 328 470 310 278 436
3512 436 99 228 194 169 200 217 208 321 226 385 238 329 412 314 322 179 230 372 148 84 268 161 356 187 332 266 293 516 163
$$ packed form
4521A382J84j16r0J2r6m7k24K60k35L14l25J63lR1o3q9JJ93l68J4l0M2k08K27k93r4L00q0
4383H22k7M0J00Nj29P0j75pP4q5r7p1J33j43R9J44q3J5J05j54J99j64J06k31o2K00k17p8J93
4241E82k80L43P5k72K06J20j72m4Mo1k0J29k48O9l1Q0j01J63j7L6N8m9k3j8m4qj0j91R5j56
4093B15K36Ok0PN3M7j3l6l9l6M0j18Nn9J56j58J6N8P8lM7k3l7J70j01k08k9J66o6k15K19m1
3935C17J3N4o6K45k23K6J56k36K12k25O4r8rJ76k2m8KO3L3p7P8J10j94o1L0K7j59J32j07R1
3788C04l2O9q8K49j38Q2r5j2L1o4N1l11K51Q9k21o4K10J69l68K43j0K06k74N2M4j81J62j19
3650B35j74K00nj57L39j69J63q1r0R4p2J39j80M1m9p0N4M3J50k91P0K21j63Q0J42j60l2J58
3512D36l37J29l4k5L1J7rJ13r5J59j47R1Q3r8Qj43N1J42k24o4J84j07J95j69J45o6K7K23l53
$$ plain form
3369 163 224 276 221 236 218 71 207 63 205 341 252 287 337 196 326 285 231 289 287 117 252 53 218 44 374 253 274 276 314
3227 314 279 461 25 274 270 218 313 495 474 1202 4176 2532 2278 1622 723 574 133 188 460 379 271 1148 1273 471 178
3104 178 255 154 469 224 327 413 227 138 288 60 379 189 174 148 212 237 245 188 220 382 317 275 238 550 221 346 450 476
2966 476 1583 3665 4512 4809 2197 778 485 488 363 155 191 145 894 1231 312 432 848 618 147 132 294 154 301 463
2848 463 134 269 158 166 257 156 37 53 256 119 177 235 279 371 138 206 393 33 267 200 105 237 121 105 248 176 271 287
2710 287 251 297 310 150 273 218 137 135 116 210 29 106 162 276 192 267 296 307 85 266 242 136 192 225 129 62 153 193 115 410 166
2557 166 305 169 309 176 193 87 218 154 79 196 172 270 337 88 303 337 158 339 161 241 138 18 190 90 134 224 349
2424 349 67 243 196 234 246 118 340 194 193 229 22 80 157 94 46 258 111 144 353 232 206 157 260 198 139 145 162 159 44 82
$$ packed form
3369A63O1N2n5J5j8j47J36j44J42J36q9L5N0j41J30m1n4N8kj70J35j99J65j74L30j21K1KL8
3227C14l5J82m36K49mn2R5J82k1P28K974j644k54o56q99j49m41N5K72q1j08Q77J25q02k93
3104A78P7j01L15k45J03Q6j86q9J50k28L19j90j5k6O4K5Qn7L2J62o5m2l7L12l29J25J04K6
2966D76J107K082Q47K97k612j419k93Lj25k08L6m6P49L37r19J20M16k30m71j5J62j40J47J62
2848D63l29J35j11QR1j01j19J6K03j37N8N8M4R2k33O8J87l60K34o7r5J32j16j6J43p2R5J6
2710B87l6M6J3j60J23n5q1kj9R4j81P7N6J14q4P5K9J1k22J81k4j06N6L3r6o7R1M0p8K95k44
2557A66J39j36J40j33J7j06J31o4p5J17k4R8O7k49K15L4j79J81j78Q0j03j20J72j00M4R0J25
2424C49k82J76m7L8J2j28K22j46jL6k07N8P7o3m8K12j47L3K09j21k6m9J03o2n9OJ7lj15L8
$$ plain form
2277 82 253 59 256 430 42 361 65 395 198 260 137 204 108 91 63 77 172 88 408 186 107 333 91 296 134 211 27
2144 27 182 118 272 196 95 105 260 72 221 322 158 324 130 264 149 93 219 164 103 79 213 53 292 166 64 371
2016 371 129 224 237 280 201 85 442 140 271 156 125 79 151 74 90 311 213 379 248 351 632 374 392 379 400 290 380 242
1878 242 238 628 479 622 915 946 1134 1337 1392 1652 1748 1732 2182 2043 2697 2969 3932 4948 6403 8610 12281 18370 32543
1765 32543 76063 212776 363942 635810 530126 407553 160946 98581 44212 23998 13223 9027 6197
1701 6197 5079 4146 3380 2823 2385 2375 1900 1663 1452 1104 1055 904 945 696 663 703 496 577 573 576 432 412 364 310 239 327 197 164
1563 164 436 214 437 48 290 366 272 175 81 74 238 267 335 320 264 119 339 156 122 225 162 275 164 155 75 185 178 116 245
1420 245 124 281 263 360 139 364 109 157 39 132 34 143 143 217 344 189 167 378 103 319 233 39 178 191 199 73 152 286
$$ packed form
2277H2J71j94J97J74l88L19k96L30j97O2j23O7r6j7k8J4R5q4L20k22p9K26k42K05j62P7j84
2144B7J55o4J54p6j01J0J55j88J49J01j64J66j94J34j15n6J26n5o1k4J34j60K39j26j02L07
2016C71k42R5J3M3p9j16L57l02J31j15l1m6P2p7J6K21r8J66j31J03K81k58J8j3K1j10R0j38
1878B42mL90j49J43K93L1J88K03N5K60R6j6M50j39O54K72R63J016J455K207L671O089J4173
1765C2543M3520J36713J51166K71868j05684j22573k46607o2365n4369k0214j0775m196k830
1701F197j118r33p66n57m38j0m75k37k11l48m9j51M1k49l3M0k07Q1mLj44k0m8n4p1Q8j30l3
1563A64K72k22K23l89K42P6r4r7r4pJ64K9O8j5n6j45K20j83l4J03o3J13j11rq0J10po2J29
1420B45j21J57j8R7k21K25k55M8j18R3r8J09%P4J27j55k2K11k75K16q6j94J39J3Qj26P9J34
$$ plain form
1282 286 306 73 455 314 263 103 236 413 55 144 121 131 94 230 131 344 264 284 361 314 445 176 225 380 240 245 77 223
1145 223 239 155 370 356 323 324 435 404 324 281 299 117 85 52 200 305 228 233 493 323 331 379 411 474 240 291 202 125 102 134 224 204
987 204 247 376 491 429 500 373 531 315 423 32 293 144 240 198 194 517 369 396 658 500 456 500 573 431 172 267 196 212
849 212 446 319 379 446 716 457 632 682 604 641 432 559 473 190 323 488 485 564 648 626 798 777 801 918 818 841 661 727 307
706 307 660 653 738 797 932 995 1253 1062 1409 1216 1254 1283 1202 976 1229 1312 4083 1745 2002 5362 3086 2979 4081 4814 6032
583 6032 9429 16038 34152 107900 636634 388748 131116 666348 328252 75173 34858 17504 6440
519 6440 3126 1163 1752 1913 3168 2595 1857 5086 675 1488 1743 1552 1245 1155 1085 770 844 773 796 983 773 1001 918 1161
401 1161 1063 1012 1072 506 384 631 575 707 240 393 636 669 796 877 736 876 676 549 678 589 509 203 142 250 315 384 452
$$ packed form
1282B86K0k33L82j41n1j60J33J77l58Q9k3J0l7J36r9K13q0K0P7m7J31k69M9J55j40Nj68J46
1145B23J6q4K15j4l3JJ11l1q0m3J8j82l2l3J48J05p7NK60j70QM8L2O3k34N1q9p7k3L2R0k0
987B04M3J29J15o2P1j27J58k16J08l91K61j49R6m2mL23j48K7K62j58m4M4P3j42k59R5p1J6
849B12K34j27O0O7K70k59J75N0p8L7k09J27q6k83J33J65lP9Q4k2J72k1K4J17j00K3j80O6m20
706C07L53pQ5N9J35O3K58j91L47j93L8K9q1k26K53Q3K771k338K57L360k276j07J102P33J218
583F032L397O609J8114P3748N28734k47886k57632N35232l38096k53079m0315j7354j1064
519F440l314j963N89J61J255n73p38L229m411Q13K55j91l07r0p0l15P4p1K3J87k10K28q3K43
401A161r8n1O0n66j22K47n6J32m67J53K43L3J27Q1j41J40k00j27J29q9q0l06o1J08O5O9O8
$$ plain form
268 452 579 716 753 640 733 523 524 545 372 290 246 131 270 302 336 520 593 554 713 606 769 333 711 275 129 295 142
135 142 202 126 439 408 605 608 569 650 594 516 459 458 277 247 137 216 73 482 424 288 740 539 688 604 550 470 448 406 345 143 90
-17 90 186 374 477 463 604 530 517 828 538 629 499 269 420 280 296 343 302 282 653 566 473 824 623 499 758 438 502 488
-155 488 302 330 382 450 413 543 478 625 565 889 680 567 611 622 598 366 515 329 362 556 459 623 785 763 640 791 728 790
-293 790 711 693 538 581 619 375 686 625 694 819 788 878 840 994 797 832 890 881 634 833 615 717 866 815 1159 946 1144 1058
-431 1058 1220 1186 1198 1093 1258 1174 1153 1018 1114 1039 1248 1292 1292 1421 1425 1424 1443
-514 1443
$$ packed form
268D52J27J37L7j13R3k10JK1j73q2m4j15J39L2L4J84P3l9J59j07J63m36L78m36j46J66j53
135A42O0p6L13l1J97Ll9Q1n6p8n7jj81l0j10P9j43M09n8j36M52k01J49q4n4q0k2m2o1k02n3
-17I0R6J88J03j4J41p4j3L11k90R1j30k30J51j40J6M7m1k0L71q7r3L51k01j24K59l20O4j4
-155D88j86K8N2O8l7J30o5J47o0L24k09j13M4J1k4k32J49j86L3J94r7J64J62k2j23J51o3O2
-293G90p9j8j55M3L8k44L11o1O9J25l1R0l8J54j97L5N8rk47J99k18J02J49n1L44k13J98q6
-431A058J62l4J2j05J65q4k1j35R6p5K09M4%J29MjJ9
-514A443
##PAGE=	F1=-1070.45
##FIRST=	4521.1594499999982872,	4521.1594499999982872,	0
##DATA TABLE=	(F2++(Y..Y)), PROFILE
$$ plain form
4521 1095 1255 1183 1099 1023 1013 990 747 1058 783 1114 813 970 1000 1012 996 877 864 1089 743 712 725 801 554 854 565 483 698
4388 698 710 642 695 735 823 637 640 583 513 617 506 490 455 555 402 525 592 625 505 647 517 665 504 658 411 347 596 355
4250 355 323 491 261 576 586 336 553 629 504 384 478 344 396 496 378 323 362 426 244 479 416 492 526 442 428 417 392 355 389
4108 389 133 361 111 400 392 389 357 398 464 403 405 348 338 330 284 289 183 403 238 253 302 370 332 442 354 323 489 370 225 112 381
3955 381 292 113 323 270 301 310 237 504 266 248 443 167 433 208 254 194 139 377 425 243 320 335 376 263 384 436 247 223 245
3812 245 273 146 294 144 272 226 294 261 477 307 342 268 240 300 252 270 81 248 370 114 90 258 441 82 266 291 456
3679 456 214 259 303 138 266 176 117 256 186 100 424 169 407 261 193 306 232 341 140 255 194 66 257 200 371 125 120
3547 120 365 194 292 396 240 242 352 89 145 183 145 176 181 211 291 195 295 179 287 375 213 295 90 193 340 167 89 230
$$ packed form
4521A095J60p2q4p6j0k3k43L11k75L31l01J57L0J2j6j19j3K25l46l1J3P6k47L00k89q2K15
4388F98J2o8N3M0Q8j86Ln7p0J04j11j6l5J00j53J23O7L3j20J42j30J48j61J54k47o4K49k41
4250C55l2J68k30L15J0k50K17P6j25j20R4j34N2J00j18n5L9O4j82K35o3P6L4q4j4j1k5l7L4
4108C89k56K28k50K89qll2M1O6o1Kn7j0qm6Nj06K20j65J5M9O8l8J10q8l1J66j19j45j13K69
3955C81q9j79K10n3L1Rp3K67k38j8J95k76K66k25M6o0n5K38M8j82P7J5M1j13J21N2j89k4K2
3812B45K8j27J48j50J28m6O8l3K16j70L5p4k8O0m8J8j89J67J22k56k4J68J83l59J84K5J65
3679D56k42M5M4j65J28r0n9J39p0q6L24k55K38j46o8J13p4J09k01J15o1j28J91n7J71k46n
3547A20K45j71R8J04j56KJ10k63N6L8l8L1NL0Q0r6J00j16J08Q8j62Q2k05J03J47j73p8J41
$$ plain form
3409 230 134 336 136 292 245 201 464 109 114 253 155 173 165 88 215 112 170 275 228 263 262 108 276 227 195 243 234 74 237 37
3261 37 200 38 298 226 223 240 285 196 406 75 203 247 194 328 505 506 1017 3607 1375 1422 2025 742 459 138 136 437 339
3128 339 361 1238 1797 668 107 279 120 428 202 310 288 190 98 231 67 382 161 174 117 221 234 161 141 225 327 280 211
2995 211 176 490 183 314 494 565 1684 3720 4408 4595 1810 565 400 473 287 175 174 88 783 1217 441 724 882 546
2877 546 115 117 243 104 214 404 88 229 111 116 212 167 23 58 252 153 163 212 258 295 108 103 379 66 235 173 172 246 122
2734 122 73 220 178 237 266 205 242 218 99 234 184 58 123 109 251 93 105 148 253 159 198 255 250 63 225 200 63 168 205 146
2587 146 37 165 210 124 361 143 269 116 225 186 143 55 184 139 43 176 183 223 339 63 268 272 155 306 120 197 54 26
2449 26 150 92 107 206 326 64 202 154 215 176 101 311 183 114 185 25 52 134 116 56 268 77 106 302 212 171 97 186 204 117
$$ packed form
3409B30r6K02k00J56m7m4K63l55NJ39r8J8qp7J27j03N8J05m7L5jj54J68m9l2M8rj60J63k00
3261C7J63j62K60p2lJ7M5q9K10l31J28M4n3J34J77JN11K590k232M7O03j283k83l21kL01r8
3128C39K2Q77N59j129n61J72j59L08k26J08k2r8r2J33j64L15k21J3n7J04J3p3k0Q4J02m7o9
2995B11l5L14l07J31J80P1J119K036O88J87k785j245j65P3j86j12jq6O95M34p76K83J58l36
2877E46m31KJ26j39J10J90l16J41j18NR6m5j44L5J94r9J0M9M6L7j87nK76l13J69o2jP4j24
2734A22m9J47m2N9K9o1L7k4j19J35n0j26O5j4J42j58J2M3J05r4L9N7nj87J62k5j37J05L7n9
2587A46j09J28M5q6K37k18J26j53J09l9m3q8J29m5r6J33PM0J16k76K05Mj17J51j86P7j43k8
2449B6J24n8J5R9J20k62J38m8O1l9p5K10j28o9P1j60K7Q2j8o0K12j91K9J96r0m1p4Q9J8q7
$$ plain form
2301 117 115 154 151 81 74 217 85 190 387 76 317 34 350 153 272 110 153 81 126 35 125 113 93 363 144 87 272 71 247
2159 247 84 204 59 149 111 279 170 74 78 245 92 182 256 133 292 116 208 129 72 190 146 82 45 204 50 250 137 40
2021 40 336 91 200 212 226 140 63 417 56 200 126 119 105 161 36 85 288 168 283 218 274 547 295 275 247 338 234 293 189
1878 189 221 571 378 515 752 786 908 1056 1122 1303 1470 1297 1837 1579 2185 2410 3198 4096 5218 6929 10047 14797 25600
1765 25600 60062 177832 285672 506976 399925 313188 123828 79785 37731 21164 11378 7381 4773
1701 4773 3971 3207 2677 2185 1852 1852 1466 1316 1126 906 829 757 787 566 536 589 387 408 501 447 340 324 244 224 286 219 206 162 393
1558 393 199 371 52 197 345 185 142 62 153 214 222 319 288 219 58 283 140 106 173 109 201 174 155 130 193 190 119 218 100 243
1410 243 216 300 137 297 132 147 21 143 48 124 164 144 284 156 107 319 70 246 215 106 129 165 232 78 162 261 299 81
$$ packed form
2301A17kL9lp0pJ43j32J05J97l11K41k83L16j97J19j62M3p2M5r1R0j2k0K70k19n7J85k01J76
2159B47j63J20j45R0l8J68j09r6MJ67j53R0P4j23J59j76R2p9n7J18m4o4l7J59j54K00j13r7
2021D0K96k45J09J2J4q6p7L54l61J44p4pj4N6j25M9K03j20J15o5N6K73k52k0k8R1j04N9j04
1878A89L2L50j93J37K37L4J22J48O6J81J67j73N40k58O06K25P88Q98J122J711L118M750J0803
1765B5600L4462J17770J07840K21304j07051q6737j89360m4043m2054j6567r786l997k608
1701D773q02p64n30m92l33%l86j50j90k20p7p2L0k21l0N3k02K1R3n4j07j6q0k0O2o7j3m4K31
1558C93j94J72l19J45J48j60m3q0R1O1QR7l1o9j61K25j43l4O7o4R2k7j9k5O3lp1R9j18J43
1410B43k7Q4j63J60j65J5j26J22r5P6M0k0J40j28m9K12k49J76l1j09K3L6O7j54Q4R9L8k18
$$ plain form
1273 81 361 273 202 52 149 319 44 80 83 121 105 220 116 311 217 281 264 226 400 103 145 323 302 221 92 201 237 156 330
1130 330 312 283 230 332 345 221 236 255 12 69 155 199 343 237 182 460 261 229 334 283 398 134 235 126 52 145 100 271
992 271 158 195 330 405 339 402 264 431 198 329 52 206 132 183 213 152 459 330 317 609 353 333 413 446 335 40 192 131
854 131 174 447 290 320 392 652 308 538 543 486 438 320 423 392 122 230 440 444 480 553 538 662 589 610 775 625 649 476 558
711 558 159 575 513 642 675 777 798 1037 831 1157 941 967 995 924 707 977 1046 3280 1471 1675 4448 2557 2367 3319 3893
588 3893 4539 6935 11820 26476 86725 510823 316427 105179 538040 267244 62548 30438 15984 5961
519 5961 2127 689 1488 1591 2510 2037 1536 4000 597 1149 1369 1194 982 837 866 633 637 659 711 800 662 800 758 919
401 919 859 767 813 344 213 480 504 624 120 367 602 602 669 710 590 732 488 385 508 418 393 110 108 229 333 363 372 457 630
$$ packed form
1273H1K80q8p1j50R7J70k75L6LL8j6J15j04J95r4O4j7l8J74k97M2J78k1q1j29J09L6q1J74
1130C30j8k9n3J02J3j24J5J9k43N7Q6M4J44j06n5K78j99l2J05n1J15k64J01j09p4R3m5J71
992B71j13L7J35P5o6O3j38J67k33J31k77J54p4N1L0o1L07j29j3K92k56k0Q0L3j11k95J52o1
854A31M3K73j57L0P2K60l44K30Nn7m8j18J03l1k70J08K10ML6P3j5J24p3K1J65j50K4j73Q2
711E58l99M16o2J29L3J02K1K39k06L26k16K6K8p1k17K70O9K234j809K04K773j891j90R52N74
588C893O46K396M885J4656O0249M24098j94396k11248M32861k70796k04696l2110j4454j0023
519E961l834j438P99J03R19m73n01K464l403N52K20j75k12j45K9k33MK2N2Q9j38J38m2J61
401I19o0r2M6m69j31K67K4J20n04K47K35%O7M1j20J42k44j03J23r0k5k83kJ21J04L0RQ5J73
$$ plain form
259 630 635 483 578 346 398 420 265 187 255 125 278 308 266 475 468 430 607 443 647 213 580 151 6 225 180 243 106 394
121 394 360 543 523 459 515 465 354 360 329 202 125 117 271 41 457 351 231 651 418 539 500 406 344 366 258 287 167 48 184
-22 184 369 421 393 513 411 407 698 364 531 331 173 353 205 225 325 277 210 613 436 411 702 466 376 596 351 341 387
-155 387 210 246 347 424 356 457 380 542 458 720 548 401 468 518 449 278 414 262 362 415 386 551 648 615 534 601 603 601 542 525
-303 525 421 457 494 300 596 523 624 651 629 692 693 795 601 645 698 727 494 626 495 590 730 653 967 805 911 857 962 923
-440 923 991 841 955 965 924 808 848 848 982 1102 1048 1206 1132 1133 1141
-514 1141
$$ packed form
259F30Nj52R5k32N2K2j55p8O8j30J53L0m2K09pl8J77j64K04m34L67m29j45K19m5O3j37K88
121C94l4J83k0o4N6n0j11Ol1j27p7qJ54k30M16j06j20M20k33J21l9r4o2K2j08K9j20j19J36
-22A84J85N2k8J20j02mK91l34J67k00j58J80j48K0J00m8o7M03j77k5K91k36r0K20k45j0M6
-155C87j77L6J01P7o8J01p7J62q4K62j72j47O7N0o9j71J36j52J00N3k9J65R7l3q1O7Kkn9j7
-303E25j04L6L7j94K96p3J01K7k2O3JJ02j94M4N3K9k33J32j31R5J40p7L14j62J06n4J05l9
-440I23O8j50J14J0m1j16M0%J34J20n4J58p4JQ
-514A141
##PAGE=	F1=-1080.29
##FIRST=	4521.1594499999982872,	4521.1594499999982872,	0
##DATA TABLE=	(F2++(Y..Y)), PROFILE
$$ plain form
4521 785 912 891 825 657 738 739 492 834 532 853 589 726 795 720 744 619 608 827 549 458 535 612 345 691 426 362 480 567
4383 567 465 550 504 674 454 398 434 342 443 334 375 413 431 309 418 407 549 321 471 389 490 329 526 288 209 494 240
4250 240 251 384 229 485 433 236 423 467 383 230 377 188 324 368 384 222 311 352 136 403 295 393 408 318 289 303 292 237
4113 237 304 44 317 58 326 330 312 255 286 357 275 302 262 248 219 212 221 94 335 188 198 224 290 231 377 240 212 375 239 176 22
3960 22 338 218 108 277 211 260 230 153 421 189 120 360 59 358 147 188 167 54 325 429 154 278 279 306 155 316 317 134
3822 134 180 161 199 115 245 74 237 170 238 265 427 236 232 177 144 216 199 188 172 187 333 97 91 182 384 60 161 223 354 142
3675 142 193 217 113 169 113 157 242 118 107 396 72 354 174 116 254 182 246 62 223 154 32 274 137 313 116 50 300
3542 300 144 240 315 174 205 265 86 76 169 138 138 143 223 242 164 191 118 245 315 111 252 31 153 305 177 102 182 98 306 93
$$ packed form
4521G85J27k1o6j68Q1Jk47L42l02L21k64J37O9p5K4j25j1K19k78r1P7P7k67L46k65o4J18Q7
4383E67j02Q5m6J70k20n6L6r2J01j09M1L8J8j22J09j1J42k28J50q2J01j61J97k38p9K85k54
4250B40J1J33j55K56n2j97J87M4q4j53J47j89J36M4J6j62Q9M1k16K67j08R8J5r0k9J4j1n5
4113B37O7k60K73k59K68Mj8n7L1P1q2K7m0j4k9pRj27K41j47J0K6O6n9J46j37k8J63j36o3j54
3960B2L16j20j10J69o6M9l0p7K68k32o9K40l01K99k11M1k1j13K71J04k75J24JK7j51J61Jj83
3822A34M6j9L8q4J30j71J63o7O8K7J62j91mn5l3P2j7j1j6J5J46k36oR1K02l24J01O2J31k12
3675A42N1K4j04N6n6M4Q5j24j1K89l24K82j80n8J38p2O4j84J61o9j22K42j37J76j97o6K50
3542C00j56R6P5j41L1O0j79j0R3l1%NQ0J9p8K7p3J27P0k04J41k21J22J52j28p5Q0q4K08k13
$$ plain form
3394 93 241 196 123 392 54 45 228 88 105 111 114 218 176 127 213 189 229 183 66 224 165 161 178 190 42 209 95 181 22 201 194
3241 194 170 201 236 114 340 138 147 196 179 334 520 523 822 2805 681 1189 2444 722 341 142 81 418 278 436 1343
3118 1343 2462 867 99 299 134 356 173 278 178 140 73 151 144 366 145 162 95 227 210 78 88 208 263 237 163 114 419
2985 419 183 273 534 652 1756 3623 4097 4163 1295 383 320 437 207 234 169 43 678 1182 584 970 881 508 65 88 192
2862 192 40 127 328 41 176 79 76 150 178 33 80 232 191 138 173 229 204 80 55 347 133 203 127 214 242 133 55 163 173 196
2715 196 218 155 179 122 54 199 137 77 117 107 267 145 98 118 210 130 122 199 194 45 184 162 64 138 176 150 37 156 220 147 295 121
2557 121 224 91 149 186 94 22 200 139 36 150 185 181 309 46 226 207 140 260 116 143 48 29 114 89 72 162 279 64 136
2414 136 118 182 104 92 269 163 44 139 59 40 108 115 78 250 80 54 243 184 141 71 103 203 111 103 134 134 99 72 176 106 113 328
$$ packed form
3394I3J48m5p3K69l38rJ83j40J7OLJ04m2m9Q6k4M0m6j17J58n9mJ7J2j48J67j14Q6j59J79p
3241A94k4L1L5j22K26k02RM9j7J55J86LK99J983k124N08J255j722l81j99o1L37j40J58R07
3118A343J119j595p68K00j65K22j83J05j00l8o7P8pK22k21J7o7J32j7j32J0J20N5k6p4m9L05
2985D19k36R0K61J18J104J867M74O6k868r12o3J17k30K7o5j26O35N04n98L86q9l73m43K3J04
2862A92j52Q7K01k87J35r7lP4K8j45M7J52m1n3L5N6k5j24k5K92k14P0p6Q7K8j09p8J08J0K3
2715A96K2o3K4n7o8J45o2o0M0j0J60j22m7K0R2q0qP7nj49J39k2r8P4L8k6j13J19O4p3J48j74
2557A21J03j33N8L7r2p2J78o1j03J14L5mJ28k63J80j9o7J20j44K7r5j9Q5k5j7R0J17k15P2
2414A36j8O4p8j2J77j06j19R5q0j9O8Pl7J72j70k6J89n9m3p0L2J00r2qL1%l5k7J04p0PK15
$$ plain form
2257 328 116 269 33 289 134 269 106 102 60 147 20 171 36 84 296 98 70 192 60 188 100 192 77 112 106 270 131
2124 131 56 66 222 105 131 184 114 253 121 160 108 62 152 128 71 15 182 50 192 104 15 284 46 194 173 168 84 56 376 25
1976 25 124 99 114 123 184 21 84 243 134 179 179 200 437 215 155 119 285 158 205 168 186 471 307 381 568 586 660 752 818 941 1142
1824 1142 849 1429 1121 1626 1778 2360 3141 3882 5037 7517 10920 18553 43182 135795 199594 361624 266316 212643
1735 212643 87488 58565 29800 17620 9498 5800 3395 2779 2149 1915 1531 1283 1261 1014 942 797 694 602 592 606
1637 606 413 397 444 276 239 410 320 250 244 139 140 300 106 190 156 328 168 299 78 104 322 96 122 44 205 171 164 290 234
1494 234 159 6 217 115 95 124 121 131 165 160 191 177 186 120 178 91 191 164 239 151 227 157 152 37 145 52 96 176 72 214 119 48 250
1332 250 53 175 192 178 85 137 236 77 169 218 287 92 244 227 159 68 71 218 47 85 73 95 127 200 93 255 174 248 173 143 347
$$ packed form
2257C28k12J53k36K56j55J35j63mm2Q7j27J51j35M8K12j98k8J22j32J28q8R2j15L5oJ64j39
2124A31p5J0J56j17K6N3p0J39j32L9n2m6R0k4n7n6J67j32J42q8q9K69k38J48k1nq4k8L20l51
1976B5R9k5J5RO1j63O3J59j09M5%K1K37k22o0l6J66j27M7l7J8K85j64P4J87J8P4R2O6J23K01
1824A142k93N80l08N05J52N82P81P41J155K480L403P633K4629R2613O3799J62030r5308n3673
1735B12643j25155k8923k8765j2180q122l698k405o16o30k34l84k48k2k47p2j45j03r2j0J4
1637F06j93j6M7j68l7J71r0p0oj05JJ60j94Q4l4J72j60J31k21K6K18k26K6p8J61l4pJ26n6
1494B34p5j53K11j02k0K9lJ0L4nL1j4Ro6N8q7J00k7P5q8P6p0nj15J08r3M4Q0j04J42r5p1K02
1332B50j97J22J7j4r3N2R9j59R2M9O9j95J52j7o8r1LJ47j71L8j2K2L2P3j07J62q1P4p5l0K04
$$ plain form
1179 347 45 85 261 337 191 108 169 223 152 275 256 226 147 228 279 119 187 210 109 111 233 192 352 235 117 398 187 139 269
1036 269 156 304 76 175 68 21 180 71 285 97 142 269 307 228 291 165 334 80 249 82 131 129 132 204 110 372 267 226
898 226 527 199 212 325 301 250 92 121 95 148 423 257 246 306 555 150 423 392 354 225 221 289 337 81 149 370 370 382 433 411
751 411 511 375 408 607 430 445 296 400 104 459 359 536 521 588 563 782 574 868 647 654 699 636 448 719 770 2398 1147
618 1147 1290 3389 1944 1677 2441 2868 3045 4590 7730 18523 63037 372299 235463 76729 395412 199259
539 199259 47868 24835 13718 5447 1190 732 1260 1237 1810 1419 1161 2814 472 777 974 813 711 524 654
446 654 494 436 524 589 582 519 567 570 656 623 509 540 213 82 346 460 515 31 307 537 513 526 513 425 558 299 225 341 257 276
298 276 81 144 183 324 326 254 312 515 495 314 396 194 267 291 201 96 276 110 256 289 175 406 314 294 475 283 496 123
$$ packed form
1179C47l02M0J76P6j46q3O1N4p1J23j9l0p9Q1N1j60O8K3j01KJ22m1J60j17j18K81k11m8J30
1036B69j13J48k28R9j07m7J59j09K14j88M5J27L8p9O3j26J69k54J69j67M9kLP2r4K62j05m1
898B26L01l28J3J13k4n1j58K9k6N3K75j66j1O0K49m05K73l1l8j29mO8M8k56O8K21%J2N1k2
751D11J00j36L3J99j77J5j49J04k96L55j00J77j5O7k5K19k08K94k21PM5o3j88K71N1J628j251
618A147J43K099j445k67P64M27J77J545L140J0793M4514L09262j36836j58734L18683j96153
539A99259j51391k3033j1117q271m257m58N28k3N73l91k58J653k342L05J97j61j02j87J30
446F54j60n8Q8O5po3M8LQ6l3j14L1l27j31K64J14N5m84K76K30k4J3j3q8J33k59p4J16q4J9
298B76j95O3L9J41Kp2N8K03k0j81Q2k02P3K4r0j05J80j66J46L3j14K31r2k0J81j92K13l73
$$ plain form
160 123 439 36 98 171 203 257 86 326 290 433 431 344 365 323 189 254 242 129 48 95 297 8 403 253 162 533 281 366 389
17 389 257 236 294 145 232 217 23 191 333 337 312 391 281 289 534 205 404 172 129 275 148 187 288 223 150 514 292 348 549
-125 549 313 245 415 283 185 292 134 169 300 372 277 361 260 432 341 531 395 252 322 417 290 251 302 197 354 254 314
-258 314 447 494 439 405 400 463 401 378 360 310 315 370 228 491 407 519 464 447 484 518 580 389 453 511 558 365 402 403 430 575 497 729
-416 729 637 651 650 662 645 769 592 630 759 668 597 574 639 684 889 777 942 809 815 807
$$ packed form
160A23L16m03O2P3L2N4j71K40l6J43kq7K1m2j34O5j2j13q1M7K02k89L95j50r1L71k52Q5K3
17C89j32k1N8j49Q7j5j94J68J42Mk5P9j10QK45l29J99k32m3J46j27L9J01o5p3L64k22N6K01
-125E49k36o8J70j32r8J07j58L5J31P2r5Q4j01J72r1J90j36j43P0R5j27l9N1j05J57j00O0
-258C14J33M7n5l4nO3o2k3j8n0NN5j42K63q4J12n5j7L7L4O2j91O4N8M7j93L7JK7J45p8K32
-416G29r2J4jJ2j7J24j77L8J29r1p1k3O5M5K05j12J65j33Oq
-514H07
##PAGE=	F1=-1090.14
##FIRST=	4521.1594499999982872,	4521.1594499999982872,	0
##DATA TABLE=	(F2++(Y..Y)), PROFILE
$$ plain form
4521 493 595 614 577 336 494 511 303 614 339 593 383 490 594 439 488 383 404 560 394 244 380 437 161 524 297
4398 297 261 281 413 309 411 285 511 287 218 282 232 279 207 272 377 298 239 306 225 454 170 289 274 347 175 401 196 101
4260 101 395 135 188 276 208 384 285 166 284 313 256 154 273 58 284 241 372 148 255 266 152 324 180 287 284 212 154
4127 154 204 202 149 232 126 252 99 242 281 216 155 176 249 162 204 216 166 151 137 149 52 249 144 148 137 211 143 298 132 110 267
3975 267 114 149 131 292 143 117 227 144 214 158 98 329 117 58 286 133 281 99 147 151 24 261 394 90 219 248 231 52
3837 52 242 205 38 154 80 143 90 181 13 203 105 193 251 361 160 134 107 79 128 156 119 239 121 284 113 95 96 317 62
3694 62 55 155 255 73 151 127 107 80 68 169 221 70 123 357 96 286 108 46 206 139 150 49 190 126 118 265 92 245 99
3551 99 40 226 107 184 241 138 167 193 92 46 148 140 97 110 231 191 135 90 77 200 244 32 198 59 120 269 169 117 131 72
$$ packed form
4521D93J02J9l7k41J58J7k08L11k75K54k10J07J04j55M9j05K1J56j66j50J36N7k76L63k27
4398B97l6K0J32j04J02j26K26k24o9O4n0M7p2O5J05p9n9O7q1K29k84J19j5P3j72K26k05r5
4260A01K94k60N3Q8o8J76r9j19J18K9n7j02J19k15K26m3J31k24J07J1j14J72j44J07lp2n8
4127A54N0kn3Q3j06J26j53J43L9o5o1K1P3q7M2J2n0j5j4J2r7J97j05Mj1P4o8J55j66k2J57
3975B67j53L5j8J61j49k6J10q3P0n6o0K31k12n9K28j53J48j82M8Mj27K37J33l04J29K9j7j79
3837E2J90l7j67J16p4O3n3R1j68J90r8Q8N8J10k01k6k7k8M9K8l7J20j18J63j71j8JK21k55
3694F2pJ00J00j82P8k4k0k7j2J01N2j51N3K34k61J90j78o2J60o7J1j01J41o4qJ47j73J53j46
3551I9n9J86j19P7N7j03K9K6j01m6J02qm3J3J21m0n6m5j3J23M4k12J66j39O1J49j00n2J4n9
$$ plain form
3404 72 272 77 188 128 69 308 42 89 202 29 45 78 131 214 214 86 165 142 195 122 116 177 107 127 107 150 23 173 142 161 3
3251 3 103 163 145 172 178 56 269 199 116 124 164 323 540 522 665 1930 1559 1539 2819 705 240 144 41 409 207 515 1512
3118 1512 3117 1019 195 310 167 266 138 241 102 84 66 62 203 338 139 144 107 228 175 17 41 177 194 197 152 74 349
2985 349 225 235 571 726 1788 3414 3696 3612 748 401 258 387 137 309 182 21 599 1116 706 1159 865 538 15
2872 15 50 159 36 73 247 32 121 65 54 89 178 48 103 198 219 111 124 203 110 60 108 301 183 175 71 224 229 150 62 87 166
2720 166 165 149 109 116 43 25 174 84 135 121 101 260 175 87 76 151 110 55 136 154 52 142 134 130 108 142 141 43 130 221 180 228 108 180 111
2547 111 115 187 50 43 236 149 43 117 181 153 249 66 184 156 110 213 135 87 115 28 88 80 34 99 216 67 58 92 142 54 89 223
2390 223 133 42 107 84 49 87 99 92 211 106 5 185 151 134 97 42 198 124 97 105 111 95 75 138 116 36 260 159 227 53 225 140
$$ packed form
3404G2K00j95J11o0n9K39k66M7J13j73J6L3N3Q3%j28P9k3N3p3oO1p0K0k0M3j27J50l1J9j58
3251CJ00O0j8K7Oj22K13p0q3QM0J59K17j8J43J265l71k0J280k114m65r6j03L68k02L08R97
3118A512J605k098q24J15j43R9j28J03j39j8j8mJ41J35j99Nl7J21n3j58K4J36J7Lm5p8K75
2985C49j24J0L36J55J062J626K82q4k864l47j43J29k50J72j27j61N78N17m10M53k94l27n23
2872A5L5J09j23L7J74k15Q9n6j1L5Q9j30N5R5K1j08J3P9r3n0M8J93j18qj04J53Np9q8K5P9
2720A66jj6m0Pp3j8J49r0N1j4k0J59q5q8j1P5m1n5Q1J8j02R0qmk2L4jr8Q7R1m1M8j20P2o9
2547A11MP2j37pJ93q7j06P4O4k8R6j83J18k8m6J03p8m8K8q7O0qm6O5J17j49rL4N0q8L5J34
2390B23r0r1O5k3l5L8J2pJ19j05j01J80l4j7l7n5J56p4k7QOj6k0O3k2q0K24j01O8j74J72q5
$$ plain form
2232 140 254 121 63 40 149 41 214 51 64 220 60 59 106 54 129 139 176 78 76 104 243 87 48 66 197 109 77 120 104 210
2085 210 134 124 92 52 109 114 70 35 150 45 124 76 17 222 3 192 121 112 63 71 325 87 86 83 109 130 203 55 88 183 122 86 138
1922 138 149 321 141 71 48 240 79 131 166 141 347 269 246 385 378 423 474 537 631 802 478 1020 738 1103 1162 1550 2221 2594
1784 2594 3228 5086 7229 12259 27796 92804 118682 221687 149556 120500 56955 37863 21484 13757 7801
1711 7801 4593 2480 1726 1139 1195 961 760 697 609 605 512 499 412 427 427 262 273 290 180 94 316 225 176 188 81 78 277 53 153
1568 153 147 251 130 235 106 91 299 21 113 48 228 119 104 251 166 100 34 153 84 91 84 160 75 135 163 244 138 165 117 128 99
1415 99 135 116 185 156 160 172 164 34 145 45 64 175 11 153 88 6 185 72 115 164 225 53 111 213 78 167 172 274 106 121
1268 121 181 135 124 35 124 58 127 90 64 146 176 70 187 140 194 100 99 295 61 69 202 341 164 108 126 204 152 223 194 165 107 134
$$ packed form
2232A40J14j33n8k3J09j08J73j63J3J56j60jM7n2P5J0L7r8kK8J39j56l9J8J31q8l2M3j6J06
2085B10p6j0l2m0N7Nm4l5J15j05P9m8n9K05k19J89p1rm9QK54k38jlK6K1P3j48L3R5o1l6N2
1922A38J1J72j80p0k3J92j61N2L5k5K06p8k3J39pM5N1O3R4J71l24N42k82L65N9L88O71L73
1784B594O34J858K143N030J5537O5008K5878J03005p2131k9056o3545j9092j6379p727n956
1711G801l208k113p54n87N6k34k01o3q8mr3j3q7J5%j65J1J7j10q6K22r1m9J2j07lJ99k24J00
1568A53oJ04j21J05j29j5K08k78R2o5J80j09j5J47q5o6o6J19o9PpP6q5O0K8Q1j06K7m8J1k9
1415I9L6j9O9k9MJ2qj30J11j00J9J11j64J42o5q2J79j13M3M9O1j72N8J02j35Q9NJ02j68J5
1268A21O0m6j1q9Q9o6O9l7k6Q2L0j06J17m7N4r4jJ96k34QJ33J39j77n6J8P8n2P1k9k9n8K7
$$ plain form
1110 134 215 50 140 170 179 168 277 184 334 222 86 318 120 76 198 47 205 91 121 34 62 200 54 268 33 93 210
977 210 212 116 186 117 253 53 192 97 87 121 93 174 74 272 191 138 426 64 118 246 168 185 185 60 82 138 377 221 177 201 440
825 440 6 306 253 233 47 146 184 300 57 106 285 271 282 313 263 365 167 230 435 261 254 158 281 141 323 209 435 356
687 356 392 324 530 323 588 373 366 431 376 248 484 512 1562 831 894 2329 1326 1009 1574 1886 1689 2622 4213 11259 39999
564 39999 239257 156735 49182 257538 133735 33192 18834 11008 4885 731 1112 1112 894 1157 824 781 1694
480 1694 322 428 611 457 463 258 474 370 283 380 444 360 363 339 384 407 388 273 296 165 141 241 436 389 123 238 465 413
342 413 400 317 272 379 158 102 198 135 171 107 186 119 284 282 124 163 390 353 166 218 118 157 172 179 44 283 92 207 254 85
195 85 322 157 166 341 144 342 111 310 58 164 138 209 244 91 250 208 295 345 241 223 187 63 159 224 75 86 73 293 53
$$ packed form
1110A34Q1j65R0L0Rj1J09r3J50j12j36K32j98m4J22j51J58j14L0q7K8J38j46K14k35O0J17
977B10Kr6P0o9J36k00J39r5j0L4k8Q1j00J98q1n3K88l62N4J28p8J7%j25K2N6K39j56m4K4K39
825D40m34L00n3k0j86R9L8J16k43M9J79j4J1L1n0J02j98O3K05j74pr6J23j40J82j14K26p9
687C56L6o8K06k07K65k15pO5n5j28K36K8J050p31O3J435j003l17N65L12j97R33J591P046K8740
564C9999J99258q2522j07553K08356j23803j00543j4358p826o123m154L81%k18K63l33m3R13
480A694j372J06J83j54Ok05K16j04q7R7O4q4Lk4M5K3j9j15K3j31k4J00J95m7k66J15K27n2
342D13j3q3m5J07k21n6R6o3L6o4P9o7J65kj58L9K27l7j87N2j00L9J5Pj35K39j91J15M7j69
195H5K37j65RJ75j97J98k31J99k52J06k6P1L5j53J59m2Q7N0j04j8l6j24R6O5j49J1j3K20k40
$$ plain form
52 53 331 147 91 407 149 198 286 122 193 241 148 186 259 64 204 270 243 234 258 159 182 360 123 267 52 127 206 109 186 234 149
-101 149 108 373 161 287 406 191 133 246 238 62 213 106 112 248 295 195 269 133 317 231 350 247 175 195 334 146 262
-234 262 191 139 328 95 269 322 352 259 280 216 330 225 248 224 220 174 263 187 385 290 392 293 271 288 333 381 206 298 363 394 258
-386 258 207 352 263 416 391 481 469 398 473 372 401 559 390 326 589 421 414 350 439 401 680 514 665 508 521 499
$$ packed form
52E3K78j84n6L16k58M9Q8j64P1M8r3L8P3j95J40O6k7rK4r9K3J78k37J44k15P5P9r7P7M8q5
-101A49m1K65k12J26J19k15n8J13qj76J51j07OJ36M7j00P4j36J84q6J19j03p2K0J39j88J16
-234B62p1n2J89k33J74N3L0r3K1o4J14j05K3k4mm6Q9p6J98r5J02r9k2J7M5M8j75R2O5L1j36
-386B58n1J45q9J53k5R0j2p1P5j01K9J58j69o4K63j68po4Q9l8K79j66J51j57J3k2
-514D99
##PAGE=	F1=-1099.98
##FIRST=	4521.1594499999982872,	4521.1594499999982872,	0
##DATA TABLE=	(F2++(Y..Y)), PROFILE
$$ plain form
4521 249 353 382 380 163 311 327 246 416 273 362 228 305 420 229 267 222 289 322 298 137 265 296 58 369 203 197 140 265 223
4378 223 284 143 353 153 187 146 205 146 169 210 330 174 192 207 70 353 105 125 187 262 96 292 141 105 313 58 147 179
4241 179 197 287 162 132 166 190 141 171 185 55 270 132 345 123 198 178 228 249 86 200 171 131 53 134 140 117 187 191 192 135 158 242
4083 242 114 74 79 168 83 132 201 103 124 84 79 69 157 110 109 57 141 72 217 44 61 179 14 146 202 245 81 129 178 77 168 101
3926 101 117 240 56 144 224 245 212 68 129 131 53 200 327 69 158 236 160 44 171 118 77 133 20 118 70 112 35 174 36 172
3778 172 217 286 89 66 101 74 51 126 68 275 67 233 134 95 24 250 89 40 97 171 21 132 43 102 46 83 152 199 74 145
3630 145 309 180 216 72 33 166 108 74 60 157 121 180 231 84 179 85 87 148 91 135 186 136 130 147 112 46 123 137 69 97 224 150 111
3468 111 57 71 147 176 65 136 86 101 236 146 131 89 76 239 89 145 54 40 221 83 130 176 15 49 94 131 202 220 62 129 101
$$ packed form
4521B49J04K9kk17J48J6q1J70j43Q9j34P7J15j91L8m5O7L3k4j61J28L1k38L11j66on7J25m2
4378B23O1j41K10k00L4m1N9n9K3M1J20j56J8J5j37K83k48K0O2P5j66J96j51l6K08k55Q9L2
4241A79J8R0j25l0L4K4m9L0J4j30K15j38K13k22P5k0N0K1j63J14k9m0p8Q1Ok3P0MJn7K3Q4
4083B42j28m0NQ9q5M9O9r8K1m0nj0Q8m7jn2Q4o9J45j73J7J18j65J32N6M3j64M8M9j01R1o7
3926A01J6J23j84Q8Q0K1l3j44O1Kp8J47J27k58Q9P8p6j16J27n3m1N6j13R8m8M2p7J39j38J36
3778A72M5O9j97k3L5k7k3P5n8K07k08J66r9l9p1K26j61m9N7P4j50J11q9N9n6L7O9M7j25P1
3630A45J64j29L6j44l9J33n8l4j4R7l6N9N1j47R5r4KO1n7M4N1n0oJ7l5o6P7J4o8K8J27p4l9
3468A11n4J4P6K9j11P1n0J5J35r0j5m2j3J63j50N6r1j4J81j38M7M6j61L4M5L7P1J8j58O7k8
$$ plain form
3315 101 171 97 176 143 59 89 68 111 17 133 166 139 28 71 140 156 165 120 49 196 251 118 49 142 292 563 502 598 1234 2494 1939
3163 1939 3115 709 170 145 48 407 135 605 1738 3624 1081 322 303 192 173 101 205 71 32 65 26 237 304 136
3045 136 128 148 219 137 40 41 140 126 162 170 81 293 275 209 601 775 1784 3157 3336 3067 372 576 212 329 114 379 210 32
2907 32 552 1023 807 1301 866 630 56 37 152 112 99 172 68 88 65 46 65 163 63 121 159 229 94 75 193 51 58 150 245
2764 245 210 152 19 206 212 167 82 31 158 156 68 74 61 53 18 158 41 173 130 89 232 181 76 34 82 102 9 80 133 70 104 120 187
2602 187 83 110 121 41 95 213 216 172 107 146 149 130 194 21 89 266 160 42 81 173 141 165 104 147 132 73 180 153 44 165 24
2449 24 78 66 4 33 152 72 21 72 102 65 90 182 97 86 98 99 69 79 76 90 163 133 61 137 118 151 128 79 190 144 90 69 92 71 75 118
2272 118 113 42 200 196 200 71 171 148 233 139 50 33 133 71 251 131 39 147 52 51 31 55 83 163 159 68 43 102 204 48 51 67 179
$$ packed form
3315A01P0p4P9l3q4L0k1M3r4J16L3k7j11M3O9J6Rm5p1J47N5j33o9R3J50K71o1R6O36J260n55
3163A939J176k406n39k5r7L59k72M70J133J886k543p59j9j11j9p2J04j34l9L3l9K11O7j68
3045A36qK0P1q2r7JR9j4L6Qq9K12j8o6L92J74J009J373J79k69k695K04l64J17k15K65j69j78
2907C2N20M71k16M94m35k36n74j9J15m0j3P3j04K0k3j9J9R8j00N8L8P0j35j9J18j42PR2R5
2764B45l5n8j33J87Om5q5n1J27kq8Oj3ql5J40j17J32m3m1J43n1j05m2M8K0r3P1N3o3L4J6O7
2602A87j04K7J1q0N4J18Lm4o5L9Lj9O4j73O8J77j06j18L9R2l2K4o1M3j5n9J07k7j09J21j41
2449B4N4j2o2K9J19q0n1N1L0l7K5R2q5j1J2Jl0J0lJ4P3l0p2P6j9L3k3m9J11m6n4k1K3k1MM3
2272A18np1J58mMj29J00k3Q5r4q9j7J00o2J80j20r2J08r5jk0K4K8Q0mr1k5N9J02j56LJ6J12
$$ plain form
2109 179 106 29 76 98 170 135 100 85 36 70 105 80 68 113 33 59 54 34 154 38 178 61 68 76 96 273 125 130 88 102 124 208 84
1947 84 96 119 121 40 104 135 219 76 93 96 198 42 86 160 93 222 241 145 221 192 225 268 334 430 487 322 666 472 682 638 897 1447
1789 1447 1517 1770 3107 4189 7375 15890 54770 55344 107316 71059 49514 36149 20179 13781 9941 6319 3834
1706 3834 2278 1098 530 598 568 351 241 316 375 294 361 294 271 275 131 182 149 117 20 233 185 128 158 81 68 222 119 106 135
1563 135 170 91 193 131 160 279 56 112 71 223 68 65 208 99 77 61 108 56 90 56 181 35 88 165 279 85 127 106 78 112
1415 112 88 78 142 141 97 174 171 26 146 30 36 160 46 125 69 35 140 103 70 132 242 36 89 170 86 151 146 263 121 27 141
1263 141 122 173 61 49 69 155 110 58 156 161 59 125 113 129 56 111 247 107 78 153 317 143 88 77 187 162 185 136 112 112 60 162
1105 162 83 101 136 213 213 287 179 300 200 128 233 84 56 133 41 110 107 88 22 88 204 61 228 22 54 173 140 28 109 135
$$ packed form
2109A79p3p7M7K2P2l5l5j5m9L4L5k5j2M5q0K6nk0J20j16J40j17PQK0J77j48Nm2J4K2Q4j24
1947H4J2K3Kq1O4L1Q4j43J7LJ02j56M4P4o7J29J9r6P6k9L3M3O6R6N7j65L44j94K10m4K59N50
1789A447P0K53J337J082L186Q515L8880N74N1972l6257k1545j3365j5970o398l840l622k485
1706C834j556j180n68O8l0k17j10P5N9q1O7o7k3Mj44N1l3l2r7K13m8n7L0p7j3J54j03j3K9
1563A35L5p9J02o2K9J19k23N6m1J52j55lJ43j09k2j6M7n2L4l4J25j46N3P7J14j94M2k1k8L4
1415A12k4j0O4jm4P7lj45J20j16OJ24j14P9n6l4J05l7l3O2J10k06N3Q1q4O5nJ17j42r4J14
1263A41j9N1j12j2K0Q6m5n2R8Nj02O6j2J6p3N5J36j40k9P5J64j74n5j1J10k5K3m9k4%n2J02
1105A62p9J8L5P7%P4j08J21j00p2J05j49k8P7r2O9lj9o6O6J16j43J67k06L2J19l3j12Q1K6
$$ plain form
957 135 194 132 159 98 86 100 70 131 65 174 112 67 320 71 82 181 107 142 238 34 75 142 316 185 135 91 320 106 207 148 153
805 153 138 97 143 264 31 111 195 166 194 218 121 240 39 121 275 131 100 105 214 165 180 83 352 200 221 116 314 109 351
662 351 151 193 215 168 169 298 294 882 570 530 1396 772 448 828 1094 579 1174 1569 5421 20273 127075 89728 25409
549 25409 140826 78801 20416 13191 8193 4245 984 1430 1046 598 621 326 442 794 180 161 319 177 261 75
451 75 339 268 228 242 294 168 214 150 228 203 187 90 123 194 234 166 420 256 221 191 411 317 324 156 166 217 139 74 91 84 88 129 206 58
283 58 222 241 43 40 274 229 95 74 136 80 70 167 65 266 76 136 215 69 236 22 88 230 38 210 136 213 124 190 125 202
135 202 214 117 178 131 164 275 158 117 75 111 90 245 86 126 65 265 101 258 56 30 292 41 75 203 19 214 211 211 154 277
-12 277 128 220 188 162 175 142 57 102 196 156 146 62 121 167 86 192 174 67 79 221 77 232 318 128 88 127 204 54 152 124 85
$$ packed form
957A35N9o2K7o1j2J4l0O1o6J09o2m5K53k49J1R9p4L5R6k04M1O7J74j31n0m4K29k14J01n9N
805A53j5m1M6J21k33Q0Q4k9K8K4r7J19k01Q2J54j44l1NJ09m9J5r7K69j52K1j05J98k05K42
662C51k00M2K2m7JJ29mN88l12m0Q66o24l24L80K66n15N95L95L852J4852J06802l7347o4319
549B5409J15417o2025n8385p225m998l948l261M46l84m48K3k95J16L52o14j9J58j42Q4j86
451G5K64p1m0J4N2j26M6o4P8k5j6r7L3P1M0o8K54j64l5l0K20r4Pj68J0N1p8o5J7pMM1P7j48
283E8J64J9j98lK34m5j34k1O2n6j0R7j02K01j90O0P9j46J67k14O6J42j92J72p4P7q9O6o5P7
135B02J2r7O1m7L3J11j17m1m2L6k1J55j59M0o1K00j64J57k02k6K62k51L4J28j84J95l%n7J23
-12B77j49R2l2k6J3l3q5M5R4m0j0q4N9M6q1J06j8j07J2J42j44J55Q6j90m0L9P7j50R8k8l9
$$ plain form
-165 85 203 203 130 187 20 215 141 204 130 186 98 280 66 263 101 89 284 38 262 192 246 100 182 68 219 115 175 139 156
-308 156 62 178 185 290 184 260 175 127 132 158 224 121 218 271 249 170 113 326 110 267 349 255 322 181 343 167 239 382 273 86
-455 86 465 223 274 243 271 199 491 290 411 286 296 283
$$ packed form
-165H5J18%p3N7j67J95p4O3p4N6q8J82k14J97j62j2J95k46K24p0N4j46Q2j14J51j04O0l6J7
-308A56r4J16PJ05j06P6q5m8NK6O6j03R7N3k2p9n7K13k16J57Q2r4O7j41J62j76P2J43j09j87
-455H6L79k42N1l1K8p2K92k01J21j25J0j3
-514B83
##PAGE=	F1=-1109.83
##FIRST=	4521.1594499999982872,	4521.1594499999982872,	0
##DATA TABLE=	(F2++(Y..Y)), PROFILE
$$ plain form
4521 86 224 214 241 217 211 195 274 249 299 179 149 204 283 182 138 200 241 132 246 158 178 194 119 240 174 164 100 137 208 176 159 216 55
4359 55 235 65 218 71 195 192 265 70 164 132 42 257 124 64 130 224 131 204 119 176 256 63 123 103 193 202 75 116 115 115 69 196
4201 196 129 112 262 79 308 134 145 96 278 182 26 157 85 74 59 99 115 135 162 216 163 143 87 208 30 33 14 130 66 106
4054 106 188 63 102 96 16 85 76 86 83 29 86 36 143 27 95 124 90 154 232 206 41 137 137 18 128 59 168 167 23 214 177 329
3896 329 160 52 124 101 52 152 242 71 115 224 98 104 110 68 142 114 45 120 68 52 62 150 40 171 168 210 33 41 128 90 59 105
3739 105 36 280 68 193 148 86 58 188 126 112 61 107 29 122 29 91 84 126 111 180 111 163 257 242 158 58 69 140 87 57 48 131 134 213
3571 213 176 89 126 85 119 71 100 106 159 142 103 133 144 39 100 120 72 107 196 123 90 118 80 87 122 110 74 89 97 207 119 140 80 91 208
3399 208 105 120 23 36 138 116 143 155 45 98 135 116 179 197 56 93 82 161 103 220 122 28 47 97 75 17 96 162 114 54 131 130 177
$$ packed form
4521H6J38j0K7k4oj6P9k5N0j20l0N5P9j01m4O2M1j09J14q8K0J6p5J21o6j0o4L7P1l2j7N7j61
4359E5J80j70J53j47J24lP3j95R4l2r0K15j33o0O6R4r3P3q5N7Q0j93O0k0R0Rj27M1j%m6J27
4201A96o7j7J50j83K29j74J1m9J82r6j56J31p2j1j5M0J6K0K7N4n3k0n6J21j78Lj9J16o4M0
4054A06Q2j25L9oq0O9rJ0ln4N7n0J07j16O8K9l4O4P8k6j65R6%j19J10o9J09jj44J91l7J52
3896C29j69j08P2k3m9J00R0j71M4J09j26OOm2P4k8o9P5n2j6J0Q8j10J31lM2j77QQ7l8l1M6
3739A05o9K44k12J25m5o2k8J30o2j4n1M6p8R3r3O2pM2j5O9o9N2R4j5q4j00J1P1n3l0rQ3LP9
3571B13l7q7L7m1L4m8K9ON3j7l9L0J1j05O1K0m8L5Q9p3l3K8l8PL5j2l6J5QJ10q8K1o0J1J17
3399B08j03J5r7J3J02k2K7J2j10N3L7j9O3J8j41L7j1P9n8J17r8r4J9N0k2n8P9O6m8o0P7jM7
$$ plain form
3236 177 177 70 53 125 288 143 54 116 241 584 464 621 988 3051 2190 3295 711 136 148 73 405 74 695 1981 3893
3113 3893 1025 451 279 204 96 75 178 67 20 62 93 247 275 129 115 195 201 104 59 75 113 64 132 190 106 259 310 201 616
2971 616 788 1757 2918 3077 2623 476 735 176 269 157 429 245 55 523 916 893 1417 916 747 102 78 160 185 151 113
2848 113 100 98 76 42 85 136 82 138 129 221 93 39 204 106 78 159 186 213 134 39 165 195 180 103 91 151 167 15 59 33 93 31 149
2685 149 56 185 138 72 192 165 65 37 23 108 22 65 120 78 77 118 223 71 96 94 35 58 201 246 134 114 126 187 152 211 26 135
2528 135 279 162 36 42 163 135 67 141 118 126 46 165 159 29 191 23 81 48 31 65 103 75 87 57 71 96 94 147 57 117 101 105 91
2365 91 83 56 73 123 154 108 99 87 175 145 133 180 161 87 33 91 33 63 121 102 106 175 224 186 84 142 139 216 149 60 64 105 101 281 196 17 90
2183 90 66 43 40 64 60 168 144 53 16 94 158 20 55 65 169 99 30 61 83 139 120 90 85 11 52 108 98 96 81 23 42 32 45 85 67 145
$$ packed form
3236A77%j07j7P2J63j45q9O2J25L43j20J57L67K063q61J105k584n75J2p5L32l31O21J286J912
3113C893k868n74j72p5j08k1J03j11m7M2L1J54K8j46j4Q0Or7m5J6L8m9O8N8q4J53N1j09M15
2971F16J72R69J161J59m54k147K59n59R3j12K72j84j90M68L93k3N24n01j69o45k4Q2K5l4l8
2848A13j3kk2l4M3N1n4N6rR2j28n4J65r8k8Q1K7K7p9r5J26L0j5p7j2O0J6j52M4k6O0o2J18
2685A49r3J29m7o6J20k7j00k8j4Q5q6M3N5m2jM1J05j52K5kn9K3J43M5j12k0J2O1l5N9j85J09
2528A35J44j17j26OJ21k8o8P4k3Qq0J19oj30J62j68N8l3j7L4L8k8J2l0J4K5kN3r0O0j6Mj4
2365I1qk7J7N0L1m6rj2Q8l0j2M7j9p4n4N8n8L0N8j9MO9M9l8j02N8lP7o7q9MM1mJ80q5j79P3
2183I0k4k3lK4mJ08k4r1l7P8O4j38L5J0J04p0o9L1K2N6j9l0np4M1N6j0kj5n8J9j0J3M0j8P8
$$ plain form
2006 145 2 47 88 121 225 134 194 111 96 106 192 97 103 62 116 69 83 148 155 28 141 129 156 80 82 137 53 125 195 133 90 49 92 167
1839 167 249 346 224 389 409 319 409 259 535 888 762 929 1827 2238 4296 8984 27162 28781 44666 56463 23416
1735 23416 26246 7351 7462 6471 4959 3314 2418 1066 840 222 453 150 108 280 319 170 322 248 132 175 47 131
1627 131 50 95 75 177 191 113 140 89 84 146 178 74 120 97 57 176 150 222 265 104 118 94 202 29 81 165 63 100 78 98 55 89
1469 89 35 176 19 44 162 290 48 77 89 54 120 67 62 109 104 40 169 166 55 151 14 18 138 82 128 60 59 125 128 51 99 231 33
1307 33 71 119 95 121 153 251 130 88 112 111 204 84 1 74 159 120 85 154 157 64 98 88 66 44 132 207 143 74 115 272 131 58 43 177
1140 177 174 164 86 85 126 17 121 127 75 107 217 236 266 178 259 170 185 158 78 67 87 96 33 92 81 28 96 196 82 176 56 33 166
977 166 101 68 78 162 157 189 141 88 100 72 61 89 90 96 42 23 221 137 88 132 142 120 248 59 68 157 248 154 126 12 210 177 137 100 130
$$ packed form
2006A45j43M5M1L3J04r1O0q3j5J0Q6r5Om1N4m7J4O5Pj27J13j2K7p6KN5q4P2P0o2m3m1M3P5
1839A67Q2R7j22J65K0r0R0j50K76L53j26J67Q98M11K058M688J8178J619J5885J1797l3047
1735B3416K830j8895J11r91j512j645q96j352k26o18K31l03m2J72L9j49J52p4j16M3j28Q4
1627A31q1M5k0J02J4p8K7n1nO2L2j04M6k3m0J19k6P2M3j61J4k4J08j73N2Q4j02L7k2K0m3L4
1469H9n4J41j57K5J18J28k42K9J2l5O6n3nM7no4J29lj11R6j37MJ20n6M6o8jO6Lp7M8J32j98
1307C3L8M8k4K6L2R8j21m2K4jR3j20q3P3Q5l9l5O9Lr3L4j0k2k2Q8P5o4o9M1J57j41p3j5J34
1140A77lj0p8jM1j09J04On2L2J10J9L0q8Q1q9J5k7q0j1K0Ro3N9j1n3O8J00j14R4j20k3J33
977A66o5l3J0Q4nL2m8n3J2k8j1K8JOn4j9J98q4m9M4J0k2J28j89RQ9R1r4k8j14J98l3m0l7L0
$$ plain form
805 130 241 69 163 216 2 133 112 83 127 160 83 149 148 110 142 48 40 117 186 158 46 49 293 70 121 69 161 54 181 9 234
652 234 63 40 182 175 125 460 390 233 689 334 47 275 647 229 352 329 1564 5597 47777 41979 7824 58358 40495
539 40495 11120 8499 5594 3520 1257 1580 1024 371 242 71 173 349 109 134 123 126 113 87 244 189 257 120 160 40
421 40 86 63 126 61 82 62 95 232 286 112 401 132 296 178 386 236 305 98 143 93 187 94 41 82 31 135 201 56 149 212
273 212 118 87 184 136 130 51 161 35 26 146 92 227 66 57 183 125 160 73 114 155 44 122 144 160 161 183 126 187 181 140 122 82 117 227
106 227 98 82 21 188 52 261 144 141 80 222 141 199 43 40 201 54 89 145 58 237 197 253 138 269 196 237 99 118 142 91
-42 91 20 59 62 198 91 97 91 164 79 180 116 38 48 110 67 191 298 130 122 96 168 89 105 146 93 177 109 98 115 62 147 81 108 76 211
-214 211 32 250 105 232 59 47 230 131 272 85 181 33 126 60 138 99 158 106 115 77 116 189 214 101 140 140 59 53 49 121 152 206
$$ packed form
805A30J11j72R4N3k14J31k1k9M4L3p7O6jl8L2r4qP7O9k8j12LK44k23N1n2R2j07J27j72K25
652B34j71k3J42pn0L35p0j57M56l55k87K28L72m18J23k3J235M033M2180n798l4155N0534j7863
539D0495k9375k621k905k074k263L23n56o53j29j71J02J76k40K5j1Lj3k6J57n5O8j37M0j20
421D0M6k3O3o5K1k0L3J37N4j74K89k69J64j18K08j50O9k07M5n0R4r3n3M1n1J04O6j45R3O3
273B12r4l1R7m8op9J10j26rJ20n4J35j61rJ26n8L5q7M1M1j11P8K2J6JK2n7O1om1j8m0L5J10
106B27j29j6o1J67j36K09j17lo1J42q1N8j56lJ61j47L5N6q7J79m0N6j15J31p3M1j38J9K4n1
-42I1p1L9LJ36j07OoP3q5J01o4p8J0O2m3J24J07j68qk6P2p9J6M1n3Q4o8j1J7n3Q5o6K7l2J35
-214B11j79K18j45J27j73j2J83r9J41j87R6j48R3o6P8l9N9n2Rl8L9P3K5j13L9%q1omP2L1N4
$$ plain form
-371 206 216 136 95 155 300 33 146 334 93 206 22 255 184 195 246 236 107 374 128 173 252 142 188 329 132 207 204 173
-509 173 222
$$ packed form
-371B06J0q0m1O0J45k67J13J88k41J13j84K33p1J1N1j0j29K67k46M5P9j10M6J41j97P5ll1
-509A73M9
-514B22
##PAGE=	F1=-1119.67
##FIRST=	4521.1594499999982872,	4521.1594499999982872,	0
##DATA TABLE=	(F2++(Y..Y)), PROFILE
$$ plain form
4521 106 187 120 143 273 177 103 287 126 319 56 124 183 183 242 156 252 196 6 199 182 104 119 165 150 198 144 114 45 201 93 210
4369 210 111 19 250 91 223 64 218 188 185 42 144 85 107 174 131 142 93 196 173 135 120 231 220 106 104 53 191 132 26 100
4221 100 140 98 80 192 110 142 242 115 270 150 97 36 282 130 34 149 46 41 91 86 110 161 141 205 166 129 33 172 77 37 52
4068 52 111 86 113 162 46 66 138 38 88 42 69 62 68 42 71 83 58 136 107 164 163 226 184 30 141 105 27 95 24 212 115 51 243 149
3901 149 373 133 56 120 79 18 120 155 68 111 200 50 136 66 49 182 98 74 134 90 38 73 131 101 178 130 139 23 42 142 94 113
3743 113 90 18 265 109 169 153 70 98 137 161 154 53 65 47 109 86 81 112 164 60 167 147 173 206 275 120 45 89 134 70 81 19 116
3581 116 153 217 109 79 107 92 128 15 123 94 155 136 97 145 179 40 88 89 89 124 151 103 70 171 81 33 90 131 29 71 95 182 110
3419 110 140 109 94 182 118 112 74 53 64 132 132 138 65 143 174 98 149 152 47 49 87 157 117 243 112 25 25 135 63 14 66 130 85 77 185 127
$$ packed form
4521A06Q1o7K3J30r6p4J84j61J93k63O8N9%N9q6R6n6j90J93j7p8J5M6j5M8n4l0o9J56j08J17
4369B10r9r2K31j59J32j59J54l0lj43J02n9K2O7m3J1m9J03k3l8j5J11j1j14kn1J38n9j06P4
4221A00M0m2j8J12q2L2J00j27J55j20n3o1K46j52r6J15j03nN0nK4N1k0O4l9l7r6J39r5m0J5
4068E2N9k5K7M9j16K0P2j00N0m6K7pOk6K9J2k5P8k9N7jO3m2j54J11l6p8O8p1J88r7o4J92r4
3901A49K24k40p7O4m1o1J02L5q7M3Q9j50Q6p0j7J33q4k4O0m4n2L5N8l0P7m8Rj16J9J00m8J9
3743A13k3p2K47j56O0j6q3K8L9K4pj01J2j8O2k3nL1N2j04J07k0K6L3O9j55p5M4M5o4J1o2R7
3581A16L7O4j08l0K8j5L6j13J08k9O1j9l9M8L4j39M8J%L5K7m8l3J01r0m8N7M1j02M2K4Q7p2
3419A10L0l1j5Q8o4ol8k1J1O8%Op3P8L1p6N1Lj05KL8P0m0J26j31q7%J10p2m9N2O4m5qJ08n8
$$ plain form
3241 127 181 196 32 40 59 304 178 117 89 178 599 417 679 1025 3138 2284 3335 678 131 156 91 396 35 763 2202
3118 2202 3902 850 572 243 209 51 76 158 84 53 56 131 237 256 114 108 234 179 81 60 103 107 40 101 196 122 243 322 208 609
2971 609 758 1726 2729 2876 2289 641 811 148 213 218 452 281 86 495 810 975 1535 1023 856 130 125 169 253 194 77
2848 77 120 127 93 38 104 103 105 157 122 195 100 36 229 183 104 136 128 197 119 72 112 177 191 125 150 140 190 91 71 45 111 47 145 99 174 143 58
2665 58 147 131 54 72 69 122 27 91 102 72 79 126 233 74 104 64 38 29 190 264 117 124 117 216 156 233 42 179 279 150 50 5 158
2503 158 120 32 171 96 126 58 159 154 34 193 32 91 30 50 131 82 76 135 50 56 116 102 118 20 131 100 105 113 92 48 45 106 169 141 72
2331 72 58 191 146 170 167 171 102 26 115 22 40 136 86 158 193 236 178 93 131 111 210 148 70 109 68 130 303 238 20 55 76 36 77 78 56
2159 56 158 132 38 10 78 114 14 55 62 159 93 60 63 54 122 92 93 87 22 63 127 121 118 63 44 86 17 55 20 85 101 62 54 87 143 183 121 245
$$ packed form
3241A27N4J5j64QJ9K45j26o1k8Q9M21j82K62L46K113q54J051k657n47K5o5L05l61P28J439
3118B202J700l052k78l29l4j58K5Q2p4l1LP5J06J9j42oJ26n5r8k1M3Mo7O1R5p4J21P9j14M01
2971F09J49R68J003J47n87j648J70o63O5NK34j71j95M09L15J65N60n12j67p26nM4Q4n9j17
2848G7M3Pl4n5O6jKN2l5P3r5o4J93m6p9L2qO9p8m7M0O5J4o6K5j0N0r9k0k6O6o4R8m6P5l1q5
2665E8Q9j6p7J8lN3r5O4J1l0PM7J07j59L0m0k6rJ61P4j47PpR9o0P7j91J37J00j29j00m5J53
2503A58l8q8J39p5L0o8J01nj20J59j61N9o1K0Q1m9oN9q5OO0j4J6r8J11l1NQk1m4lO1O3k8o9
2331G2j4J33m5K4lMo9p6Q9r3J8R6n0P2L5M3n8q5L8k0R9o2p8L9m1O2J73o5k18L5K1m0M1Jk2
2159E6J02k6r4k8O8L6j00M1PR7o6l3LrO8l0Joo5M1O4oln5j9M2o9L8l5O5J6l9qL3N6M0o2J24
$$ plain form
1971 245 140 94 80 155 94 101 32 101 90 76 167 138 50 166 126 117 111 95 98 34 98 126 176 9 41 70 147 234 310 70 459 261 225 284
1804 284 113 482 554 394 817 1239 1642 2936 6970 16665 38316 55336 67621 38365 22671 3519 2999 3567 3635
1711 3635 2768 2434 1229 1234 304 564 213 464 484 491 223 379 236 34 134 74 105 63 98 97 159 206 123 121 83 88 71 210 92
1568 92 97 49 28 178 161 255 266 134 127 110 175 13 116 122 87 122 88 116 79 88 17 153 34 57 154 274 76 20 76 81 121 76 70 82
1400 82 56 13 163 150 99 156 13 12 116 107 131 57 81 137 141 63 68 199 38 53 78 94 81 176 233 129 145 94 103 213 95 20 69 144
1233 144 116 118 140 162 73 118 69 16 52 136 173 162 53 86 216 127 31 57 171 179 147 49 91 132 31 90 143 65 83 203 236 223 178
1071 178 221 135 222 108 76 78 65 123 43 53 91 40 95 182 99 122 68 30 167 86 108 83 170 137 218 127 73 110 49 66 80 121 58 18
903 18 9 138 165 85 102 179 112 220 81 63 174 181 131 126 86 119 205 99 94 135 290 65 196 155 38 150 57 79 85 130 170 105 218
$$ packed form
1971B45j05m6j4P5o1Po9O9j1j4R1k9q8J16m0roj6Lo4O4K8N0j67L2K9P7Q7P6k40L89j98l6N9
1804B84j71L69P2j60M23M22M03J294M034R695K1651J7020J2285k9256j5694j9152n20N68O8
1711C635q67l34j205Nr30K60l51K51K0Pk68J56j43k02J00o0L1m2L5jO2M7q3kl8Nj7J39j18
1568I2Nm8k1J50j7R4J1j32pj7O5j62J03Ol5L5l4K8l7Rp1J36j19K3R7J20j98n6N6NM0m5oJ2
1400H2k6m3J50j3n1N7j43jJ04rK4p4K4N6Mp8NJ31j61J5K5J6j3R5N7j04J6n1RJ10j18p5M9P5
1233A44k8KK2K2q9M5m9n3L6Q4L7j1j09L3J30q9r6K6J14Ql2r8M2M1j01N9N3p8J8J20L3j3m5
1071A78M3q6Q7j14l2Kj3N8q0J0L8n1N5Q7q3K3n4l8J37q1K2k5Q7l3Q1r1n4L7o1J7J4M1o3m0
903A8rJ29K7q0J7P7o7J08j39j8J11Pn0nm0L3Q6j06nM1J55k25J31m1j17J12r3K2OM5M0o5J13
$$ plain form
741 218 116 61 5 85 119 168 133 87 103 255 38 129 159 75 147 87 90 315 31 70 178 117 12 348 280 71 286 53 178 80
593 80 579 704 356 994 1465 3531 26735 22098 7080 31037 22583 6606 5099 3465 2746 1299 1557 1003 220
500 220 32 260 26 477 150 214 44 232 26 135 181 129 295 23 55 65 9 110 100 14 134 120 126 251 295 69 376 76
362 76 344 175 378 177 310 137 171 43 213 85 58 73 4 133 177 95 92 199 179 156 128 84 163 94 159 7 84 127 106 176
214 176 60 21 164 166 103 121 167 114 92 85 133 138 174 157 135 171 155 149 89 76 174 201 75 94 63 230 41 254 204 148 100 173 169 165 82
42 82 76 138 101 138 119 90 236 185 260 135 237 259 256 20 118 133 120 76 51 40 205 127 96 41 175 87 144 70 101 10 130 69 169
-120 169 302 153 157 105 126 87 66 153 121 173 34 89 49 105 122 50 60 80 209 24 231 144 171 68 22 185 174 272 85 141 101
-273 101 100 127 88 108 164 96 90 133 78 174 152 64 48 146 81 63 143 69 179 203 168 75 32 191 262 98 96 304 100 126 73 187 260
$$ packed form
741B18j02n5n6Q0L4M9l5m6J6J52k17R1L0q4P2o0LK25k84L9J08o1j05L36o8k09K15k33J25r8
593H0M99J25l48O38M71K066K3204m637j5018K3957q454j5977j507j634p19j447K58n54p83
500B20j88K28k34M51l27O4j70J88k06J09M6n2J66k72L2J0n6J01j0q6J20j4OJ25M4k26L07l00
362G6K68j69K03k01J33j73L4j28J70j28k7J5o9J29M4q2lJ07k0k3k8m4P9o9O5j52P7M3k1P0
214A76j16l9J43Ko3J8M6n3k2pM8NL6j7k2L6j6oo0j3R8K7j26J9l1J67j89K13n0n6m8P3mmq3
42H2oO2l7L7j9k9J46n1P5j25J02K2lk36R8J5j3m4k5j1J65p8l1n5J34q8N7p4L1r1J20o1J00
-120A69J33j49Mn2K1l9k1Q7l2N2j39N5m0N6J7p2J0K0J29j85K07q7K7j03m6J63j1R8j87N6m0
-273A01jK7l9K0N6o8oM3n5R6k2q8j6R8o5j8Q0p4J10K4l5r3m3J59P1j64kK08k04K6n3J14P3
$$ plain form
-435 260 210 164 224 199 296 155 94 271 50 259 193 82 70 219 137 242
$$ packed form
-435B60n0m6O0k5R7j41o1J77k21K09o6j11j2J49q2J05
-514B42
##PAGE=	F1=-1129.51
##FIRST=	4521.1594499999982872,	4521.1594499999982872,	0
##DATA TABLE=	(F2++(Y..Y)), PROFILE
$$ plain form
4521 172 163 115 66 264 164 36 260 83 299 45 96 186 117 284 208 286 132 77 135 168 40 65 167 131 232 118 102 48 160
4378 160 59 219 55 71 218 135 213 63 219 173 105 96 124 58 130 108 101 198 60 155 185 81 134 257 199 141 79 29 189 81
4231 81 13 83 172 114 110 167 106 154 208 166 239 160 63 54 246 104 52 140 50 40 94 77 101 177 111 168 167 106 7 130 137 41 76 81 98 124
4054 124 126 55 27 169 78 85 70 55 41 94 8 116 53 67 166 127 220 167 197 182 30 144 87 58 70 10 241 84 82 230 134 376
3896 376 130 74 112 97 39 102 83 60 129 167 17 141 39 38 198 90 91 153 122 64 73 114 149 191 135 78 48 37 131 85 149 81 7
3734 7 246 145 161 153 51 113 98 184 167 62 40 52 96 132 73 119 191 40 159 174 173 162 281 102 27 95 153 57 93 43 113 165 198
3571 198 43 47 126 97 115 75 155 86 162 121 111 175 209 80 92 47 100 132 92 85 49 201 74 37 78 132 49 43 88 161 127 135 150 77 160
3399 160 129 111 111 77 13 130 109 126 85 180 205 102 116 98 22 34 100 152 133 245 106 34 53 152 83 5 45 79 56 94 210 124 161
$$ packed form
4521A72rm8m9J98j00j28K24j77K16k54N1R0o9J67p6P8j54n5N8L3j28K5J02l6J01j14j6n4J12
4378A60j01J60j64J6J47q3P8j50J56m6o8rK8o6P2k2pR7j38R5L0j04N3J23n8n8o2n0J60j08
4231H1o8P0Q9n8mN7o1M8N4m2P3p9r7rJ92j42n2Q8r0j0N4j7K4P6o6N7jo1r9J23Pr6L5NJ7K6
4054A24Kp1k8J42r1Pj5j5j4N3q6J08o3J4R9l9R3n3L0j5j52J14n7k9J2o0K31j57kJ48r6K42
3896C76k46n6L8j5n8O3j9k3O9L8j50J24j02jJ60j08JO2l1n8RM1L5M2n6n7l0j1R4m6O4o8p4
3734GK39j01J6qj02O2j5Q6j7j05k2J2M4L6n9M6P2j51J19J5jj1J19j79p5O8N8r6L6n0P0N2L3
3571A98j55MP9k9J8m0Q0o9P6m1j0O4L4j29J2m5N3L2m0pl6J52j27l7M1N4q3oM5P3l4QJ5p3Q3
3399A60l1j8%l4o4J17k1J7m1R5K5j03J4j8p6J2O6N2j9J12j39p2J9R9o9p8M0L4k3L8J16q6L7
$$ plain form
3236 161 206 27 40 35 296 205 163 65 120 603 370 725 954 2792 2298 3249 592 149 171 101 370 38 791 2371 3683
3113 3683 575 675 206 217 39 96 145 124 77 50 137 214 245 92 105 255 157 68 61 116 121 80 67 184 126 237 310 226 584 689
2966 689 1706 2578 2641 2003 626 788 133 165 267 442 307 123 459 719 1068 1675 1168 935 139 161 170 312 223 66 132
2843 132 153 112 36 106 72 127 178 132 157 107 48 257 251 127 90 77 169 104 91 69 160 202 150 183 124 216 155 92 59 112 60 147 136 149
2675 149 146 56 104 86 43 98 131 142 21 116 81 58 103 136 221 82 121 34 52 33 184 265 117 132 113 234 138 252 55 217 271
2523 271 124 85 37 163 91 123 194 81 125 84 149 141 34 177 45 102 22 58 183 82 74 162 58 58 123 112 92 19 133 91 100 133
2365 133 99 56 14 111 179 158 50 29 193 136 187 148 171 131 54 152 68 15 147 71 194 229 230 164 94 120 76 214 140 72 152 30
2208 30 155 315 252 32 38 76 41 93 91 56 142 123 26 30 56 83 17 48 58 141 91 84 64 16 117 71 106 93 59 79 155 141 134 65 79 123
$$ packed form
3236A61M5j79J3nK61r1m2r8N5M83k33L55K29J838m94R51k657m43K2p0K69l32P53J580J312
3113C683l108J00m69J1j78N7M9k1m7k7Q7P7L1j53J3J50r8q9pN5Nm1j3J17n8J11P3q4L58J05
2966F89J017Q72O3o38j377J62o55L2J02J75j35j84L36K60L49O07n07k33p96K2RJ42q9j57O6
2843A32K1m1p6P0l4N5N1m6K5n0n9K09oj24l7j3R2o5j3k2R1M2n2L3n9R2o1o3l3N3n2Q7j1J3
2675A49lr0M8j8m3N5L3J1j21R5l5k3M5L3Q5j39L9q7J8j9J51Q1j48J5j9J21r6J14j97J62N4
2523B71j47l9m8J26p2L2P1j13M4m1O5qj07J43j32N7q0L6J25j01qQ8j04%O5j1k0p3J14m2RL3
2365A33l4m3m2R7O8k1j08k1J64n7N1l9K3m0p7R8q4n3J32p6J23L5Jo6p0K6m4J38p4o8Q0j22
2208C0J25J60o3k20OL8l5N2kl5Q6j9r7MK6K7o6L1J0Q3n0pk0m8J01m6L5j3l4K0P6j4po9J4M4
$$ plain form
2031 123 47 68 52 94 79 113 69 81 161 147 99 273 165 97 52 99 76 87 45 76 89 84 181 142 92 165 101 86 118 108 56 38 120 46
1863 46 208 60 81 102 133 211 267 151 459 186 149 230 189 482 379 342 867 947 1615 2393 6397 18828 42402 66142 65554
1740 65554 42351 19546 6203 1034 1364 2358 2092 2180 1280 1417 480 756 264 998 765 903 369 484 228 100 128
1637 128 118 83 96 103 96 171 212 147 105 69 74 49 219 133 67 59 14 185 160 257 282 148 133 114 152 15 140 81 119 119 89 138 101 86 9
1464 9 134 56 100 137 235 116 35 88 120 116 99 90 61 36 56 160 128 136 158 19 10 99 121 118 59 108 162 144 85 48 156 43 32 69 81
1292 81 41 193 207 120 174 87 101 204 103 21 54 116 97 142 120 167 77 153 76 20 69 123 140 161 20 62 163 128 36 86 165 172 128
1130 128 41 108 131 40 67 130 63 64 183 218 170 176 194 99 229 90 73 87 55 129 89 41 101 51 101 168 102 81 56 35 157 74 120 94
962 94 158 132 225 114 55 109 45 86 114 142 62 59 21 78 156 64 96 184 110 168 88 63 187 121 118 115 136 55 198 87 89 131 289 83 219
$$ packed form
2031A23p6K1j6M2j5L4m4J2Q0j4m8J74j08o8m5M7k3J1m2L1J3nR7l9n0P3o4j5L2j0n2j8Q2p4
1863D6J62j48K1K1L1P8N6j16L08k73l7Q1m1K93j03l7N25Q0O68P78M004J2431K3574K3740n88
1740F5554k3203k2805j3343n169L30R94k66Q8r00J37r37K76m92P34k33J38n34J15k56j28K8
1637A28j0l5J3PpP5M1o5m2l6Nk5J70q6o6qm5J71k5R7K5j34j5j9L8j37J25n9L8%l0M9l7j5p7
1464IJ25p8M4L7R8j19q1N3L2mj7rk9k5K0J04l2QK2j39rQ9K2ln9M9N4j8n9l7J08j13j1L7J2
1292H1m0J52J4q7N4q7J4J03j01q2L3O2j9M5k2M7r0P6p7n6M9N4J7K1j41M2J01l5r2N0P9Pm4
1130A28q7O7K3r1K7O3o7JJ19L5m8OJ8r5J30j39j7J4l2P4m0m8O0n0N0O7o6k1k5k1J22q3M6k6
962I4O4k6R3j11n9N4o4M1K8K8q0ll8N7P8r2L2Q8p4N8q0k5J24o6llK1q1J43j11KM2J58k06J36
$$ plain form
790 219 95 66 161 58 120 68 112 241 112 239 92 84 25 98 98 148 115 186 133 233 92 159 194 34 180 58 123 345 79 94
642 94 133 94 64 341 206 158 229 135 250 202 595 893 404 1090 2123 7392 40291 23849 12876 40748 18626 5912
534 5912 3005 1977 1989 1123 1396 962 149 49 334 119 555 197 229 47 286 48 145 147 83 306 63 14 85 67 134 123
406 123 32 183 134 121 252 266 33 344 140 362 157 368 142 307 162 198 76 207 47 79 59 19 133 144 119 88 198
273 198 203 189 108 73 164 100 136 50 132 136 113 127 58 81 156 178 69 122 203 93 122 85 120 122 170 136 146 155 137 139 77 83 224 193 102 97 84
91 84 237 51 224 248 160 107 122 182 148 95 98 102 120 153 129 92 218 166 241 137 193 304 277 57 131 140 151 120 54 93 181 167 70 17
-76 17 180 99 89 40 149 32 191 47 157 285 175 173 95 88 55 37 144 150 178 58 88 14 107 128 38 37 78 178 71 215 153
-229 153 92 75 31 164 171 253 147 110 130 79 170 63 94 172 101 72 159 68 134 102 83 46 141 96 65 226 57 169 177 119 79 48 186
$$ packed form
790B19j24k9R5j03O2n2M4J29j29J27j47qn9P3%N0l3P1n3J00j41O7L5j60J46j22O5K22k66J5
642I4L9l9l0K77j35m8P1r4J15m8L93K98m89O86J033N269L2899j6442j0973K7872k2122j2714
534E912k907j028J2q66K73m34q13j00K85k15M36l58L2j82K39k38R7Ko4K23k43m9P1j8O7j1
406A23r1J51m9j3J31J4k33L11k04K22k05K11k26J65j45L6j22J31j60L2k0m0J14J1k5l1J10
273A98Nj4q1l5R1o4L6q6Q2Mk3J4o9K3P5K2j09N3Q1j10K9l7L5KM8l4J0Rj8Ko2OJ41l1r1nj3
91H4J53j86J73K4q8n3J5O0l4n3LMJ8L3k4l7J26n2P5j04N6J11k7k20P4RJ1l1o6L9Q8j4r7n3
-76A7J63q1j0m9J09j17J59j44J10J28j10kp8pl3j8J07OK8j20L0p4R3K1r0jM1J00j07J44o2
-229A53o1j7m4J33PQ2j06l7K0n1R1j07L1P8p1k9Q7r1O6l2j9l7R5m5l1J61j69J12Qn8m0l1J38
$$ plain form
-391 186 212 130 123 244 156 85 108 123 277 220 146 198 232 221 193 30 255 19 290 84 102 48 225 115 231
$$ packed form
-391A86K6q2pJ21q8p1K3J5J54n7p4N2L4j1k8j63K25k36K71k06J8n4J77j10J16
-514B31
##PAGE=	F1=-1139.36
##FIRST=	4521.1594499999982872,	4521.1594499999982872,	0
##DATA TABLE=	(F2++(Y..Y)), PROFILE
$$ plain form
4521 208 126 147 47 205 150 28 206 113 245 77 46 183 95 289 241 285 84 108 55 130 45 67 136 173 253 87 57 86 89 74
4373 74 185 57 110 155 163 194 42 202 148 40 136 100 50 124 61 48 220 28 104 172 41 144 254 186 164 53 26 181 55
4231 55 23 80 186 139 124 145 93 161 169 203 217 165 71 100 181 103 59 116 49 53 79 65 83 182 72 116 147 88 31 86 175 45 78 52 97
4058 97 130 87 84 52 181 103 81 90 46 23 111 28 150 66 58 186 167 258 166 159 187 41 148 91 76 49 36 257 68 100 181 120 343
3896 343 136 91 102 141 105 92 43 55 144 139 5 124 27 30 197 88 99 174 150 83 73 97 178 211 169 33 65 27 103 74 163 76 13
3734 13 238 165 162 149 36 106 73 187 156 76 25 50 95 167 64 115 210 77 156 187 167 125 266 102 27 92 189 51 86 82 116 163
3576 163 166 38 10 158 96 88 131 189 73 172 107 131 208 231 132 106 3 98 125 30 76 28 209 71 64 82 124 75 27 74 146 153 130 188
3409 188 46 141 145 111 132 98 47 114 86 115 110 205 228 136 97 51 21 88 113 139 152 227 97 40 83 146 112 14 32 24 48 108 203 113 119 203
$$ packed form
4521B08q2K1j00J58n5j22J78r3J32j68l1J37q8J94m8M4k01K4n3P5q5K2O9L7Q0j66l0K9Lj5
4373G4J11j28N3M5QL1j52J60n4j08R6l6n0P4o3j3J72j92P6O8j31J03J10o8k2j11k7J55j26
4231E5l2N7J06m7j5K1n2O8QL4J4n2r4K9Q1p8m4N7o7MK6j4J8R9j10M4L1n9n7N5Q9j30L3k6M5
4058I7L3m3ll2J29p8k2Rm4k3Q8q3J22q4qJ28j9R1r2pK8j46J07n7j5k7j3K21j89L2Q1o1K23
3896C43k07m5J1L9l6j3m9J2Q9nj34J19r7LJ67j09J1P5k4o7j0K4Q1L3m2j36L2l8P6k9Q9q7o3
3734A3K25p3lj3j13P0l3J14l1q0n1K5M5P2j03N1R5j33P9L1k0m2J41j64p5O5R7j38L5mL4M7
3576A63Lj28k8J48o2qM3N8j16R9o5K4P7K3r9k6j03R5K7r5M6m8J81j38pJ8M2m9m8M7P2Pk3N8
3409A88j42R5Ml4K1l4n1O7k8K9nR5K3r2l9m6l0O7K5K6J3P5j30n7M3O3l4r8J8qK4O0R5r0OQ4
$$ plain form
3232 203 56 86 89 263 214 188 47 99 590 336 743 773 2201 2369 3098 460 189 190 104 327 68 769 2463 3306 235
3108 235 752 181 232 34 120 138 170 93 49 113 183 234 70 102 255 141 68 77 113 142 124 30 159 124 225 281 250 545 599 1705
2961 1705 2433 2318 1721 437 680 123 125 291 397 317 163 410 658 1194 1846 1321 972 133 179 162 359 238 73 139 170
2838 170 125 35 92 48 141 198 141 112 110 52 279 301 140 40 39 135 91 95 73 149 214 174 190 98 242 205 108 63 104 63 151 162 127 148
2670 148 64 69 47 30 111 181 159 28 129 68 52 128 141 191 89 136 9 66 54 184 251 128 136 109 241 111 261 66 247 259
2523 259 89 123 75 176 49 194 209 72 121 104 135 123 28 151 59 113 39 54 213 79 72 168 73 65 120 122 66 46 130 75 91 148
2365 148 103 79 39 125 186 160 35 26 180 122 187 124 165 158 81 189 110 38 145 66 211 252 205 139 86 96 67 220 127 66 182 6
$$ packed form
3232B03j47L0LJ74m9k6j41N2M91k54M07L0J428J68P29k638k71Jq6K23k59P01J694Q43l071
3108B35N17n71N1j98Q6J8L2p7m4O4P0N1j64L2J53j14p3RL6K9j8r4J29l5J01N6l1K95N4J106
2961A705P28j15n97j284K43n57KJ66J06q0j54K47K48N36O52n25l49q39M6j7J97j21j65O6L1
2838A70m5r0N7m4R3N7n7k9kn8K27K2j61j00jR6m4Mk2P6O5m0J6r2J44l7r7m5M1m1Q8J1l5K1
2670A48q4Nk2j7Q1P0k2j31J01o1j6P6J3N0j02M7j27N7j2J30O7j23Qk7J32j30J50j95J81J2
2523B59j70L4m8J01j27J45J5j37M9j7L1j2r5J23r2N4p4J5J59j34pR6r5qN5Kn6k0Q4n5J6N7
2365A48m5k4m0Q6O1k6j25rJ54n8O5o3M1pp7J08p9p2J07p9J45M1m7o6n3J0k9J53r3o1J16j76
$$ [...]
-514E
##END NTUPLES=	nD NMR SPECTRUM
##END=	
##END=	
