##TITLE=	g2eZN$SaRmmNgVa$$kqo1Q.91.ser
TM-VI-254, Na+unprotect. pyr. cosy

##JCAMP-DX=	6.0	$$ MestReNova 14.3.0-30573
##DATA TYPE=	LINK
##BLOCK_ID=	1
##BLOCKS=	2    
##ORIGIN=	Mestrelab Research S.L.
##OWNER=	hrzepa
##$MNOVA/LINK_BLOCK_TYPE=	ITEM	$$ NMR Spectrum
##$MNOVA/ITEM/POLYGON=	(XY..XY)
5321,5835
8722,5835
8722,8208
5321,8208
5321,5835
##$MNOVA/ITEM/Z=	0
##$MNOVA/ITEM/ANGLE=	0
##TITLE=	g2eZN$SaRmmNgVa$$kqo1Q.91.ser
##JCAMP-DX=	6.0	$$ MestReNova 14.3.0-30573
##BLOCK_ID=	2
##DATA TYPE=	MNOVA NMR VIEW DATA
##DATA CLASS=	MNOVA VIEW DATA
##$MNOVA/2D/THRESHOLD=	16.411603927612304688
##$MNOVA/ITEM/ZOOM/X=	-1.2849598716208046056,	11.297249999948046906
##$MNOVA/ITEM/ZOOM/Y=	-1.2849598716208046056,	11.297249999948046906
##END=	
##TITLE=	g2eZN$SaRmmNgVa$$kqo1Q.91.ser
##JCAMP-DX=	6.0	$$ MestReNova 14.3.0-30573
##BLOCK_ID=	3
##DATA TYPE=	nD NMR SPECTRUM
##DATA CLASS=	NTUPLES
##NUMDIM=	2
##ORIGIN=	Bruker BioSpin GmbH
##OWNER=	nmr
##.OBSERVE FREQUENCY=	400.20200099999999566
##.OBSERVE NUCLEUS=	^1H
##.SOLVENT NAME=	MeOD
##.PULSE SEQUENCE=	cosygpqf
##LONGDATE=	2022/01/24 17:25:12.000
##.ACQUISITIONMODE=	SIMULTANEOUS (DQD)
##$ORIGINAL FORMAT=	Bruker XWIN-NMR
##$MNOVA/SCALES_VERSION=	9
##$PARAMETER FILE=	(acqu2s, ASCII, /private/var/folders/f6/rjf_tdyn2v98c5c0wvkgn4s80000gn/T/g2eZN$SaRmmNgVa$$kqo1Q/91/acqu2s, 0)
$$ ##TITLE= Parameter file, TOPSPIN		Version 3.2
$$ ##JCAMPDX= 5.0
$$ ##DATATYPE= Parameter Values
$$ ##NPOINTS= 221	$$ modification sequence number
$$ ##ORIGIN= Bruker BioSpin GmbH
$$ ##OWNER= nmr
$$ $$ 2022-01-24 17:34:11.825 +0000  nmr@CZC2439F63
$$ $$ /opt/topspin/data/agmb/nmr/Jan24-2022/91/acqu2s
$$ $$ process /opt/topspin3.2/prog/mod/go
$$ ##$ACQT0= 0
$$ ##$BF1= 400.2
$$ ##$FnMODE= 1
$$ ##$NUC1= <1H>
$$ ##$NusJSP= 0
$$ ##$NusT2= 1
$$ ##$NusTD= 220
$$ ##$O1= 2001.00000000702
$$ ##$SFO1= 400.202001
$$ ##$SW= 12.5944462247833
$$ ##$SW_h= 5040.32258064516
$$ ##$TD= 220
$$ ##END=
$$ 
##$PARAMETER FILE=	(acqus, ASCII, /private/var/folders/f6/rjf_tdyn2v98c5c0wvkgn4s80000gn/T/g2eZN$SaRmmNgVa$$kqo1Q/91/acqus, 0)
$$ ##TITLE= Parameter file, TOPSPIN		Version 3.2
$$ ##JCAMPDX= 5.0
$$ ##DATATYPE= Parameter Values
$$ ##NPOINTS= 12	$$ modification sequence number
$$ ##ORIGIN= Bruker BioSpin GmbH
$$ ##OWNER= nmr
$$ $$ 2022-01-24 17:34:15.179 +0000  nmr@CZC2439F63
$$ $$ /opt/topspin/data/agmb/nmr/Jan24-2022/91/acqus
$$ $$ process /opt/topspin3.2/prog/mod/shimcntl
$$ ##$ACQT0= 1000000
$$ ##$AMP= (0..31)
$$ 100 100 100 100 100 100 100 100 100 100 100 100 100 100 100 100 100 100
$$ 100 100 100 100 100 100 100 100 100 100 100 100 100 100
$$ ##$AMPCOIL= (0..19)
$$ 0 0 0 0 0 0 0 0 0 0 0 0 0 0 0 0 0 0 0 0
$$ ##$ANAVPT= -1
$$ ##$AQSEQ= 0
$$ ##$AQ_mod= 3
$$ ##$AUNM= <au_zg>
$$ ##$AUTOPOS= <54 >
$$ ##$BF1= 400.2
$$ ##$BF2= 400.2
$$ ##$BF3= 400.2
$$ ##$BF4= 400.2
$$ ##$BF5= 400.2
$$ ##$BF6= 400.2
$$ ##$BF7= 400.2
$$ ##$BF8= 400.2
$$ ##$BYTORDA= 0
$$ ##$CAGPARS= (0..11)
$$ 0 0 0 0 0 0 0 0 0 0 0 0
$$ ##$CFDGTYP= 0
$$ ##$CFRGTYP= 9
$$ ##$CHEMSTR= <none>
$$ ##$CNST= (0..63)
$$ [...]
$$ 0 0 0 0
$$ ##$ShimPowMaxUC= (0..63)
$$ 130000 130000 130000 130000 130000 130000 130000 130000 130000 130000 130000
$$ 130000 130000 130000 130000 130000 130000 130000 130000 130000 0 0 0 0
$$ 0 0 0 0 0 0 0 0 0 0 0 0 0 0 0 0 0 0 0 0 0 0 0 0 0 0 0 0 0 0 0 0 0 0 0 0
$$ 0 0 0 0
$$ ##$ShimPowMaxUG= (0..63)
$$ 524287 524287 524287 524287 524287 524287 524287 524287 524287 524287 524287
$$ 524287 524287 524287 524287 524287 524287 524287 524287 524287 0 0 0 0
$$ 0 0 0 0 0 0 0 0 0 0 0 0 0 0 0 0 0 0 0 0 0 0 0 0 0 0 0 0 0 0 0 0 0 0 0 0
$$ 0 0 0 0
$$ ##$ShimPowRcbType= 3
$$ ##$ShimPowRes= (0..63)
$$ 1e-20 1e-20 1e-20 1e-20 1e-20 1e-20 1e-20 1e-20 1e-20 1e-20 1e-20 1e-20
$$ 1e-20 1e-20 1e-20 1e-20 1e-20 1e-20 1e-20 1e-20 0 0 0 0 0 0 0 0 0 0 0 0
$$ 0 0 0 0 0 0 0 0 0 0 0 0 0 0 0 0 0 0 0 0 0 0 0 0 0 0 0 0 0 0 0 0
$$ ##$ShimPowRng0= (0..63)
$$ 1 1 1 1 1 1 1 1 1 1 1 1 1 1 1 1 1 1 1 1 0 0 0 0 0 0 0 0 0 0 0 0 0 0 0 0
$$ 0 0 0 0 0 0 0 0 0 0 0 0 0 0 0 0 0 0 0 0 0 0 0 0 0 0 0 0
$$ ##$ShimPowRng1= (0..63)
$$ 1 1 1 1 1 1 1 1 1 1 1 1 1 1 1 1 1 1 1 1 0 0 0 0 0 0 0 0 0 0 0 0 0 0 0 0
$$ 0 0 0 0 0 0 0 0 0 0 0 0 0 0 0 0 0 0 0 0 0 0 0 0 0 0 0 0
$$ ##$ShimPowRng2= (0..63)
$$ 1 1 1 1 1 1 1 1 1 1 1 1 1 1 1 1 1 1 1 1 0 0 0 0 0 0 0 0 0 0 0 0 0 0 0 0
$$ 0 0 0 0 0 0 0 0 0 0 0 0 0 0 0 0 0 0 0 0 0 0 0 0 0 0 0 0
$$ ##$ShimPowRng3= (0..63)
$$ 1 1 1 1 1 1 1 1 1 1 1 1 1 1 1 1 1 1 1 1 0 0 0 0 0 0 0 0 0 0 0 0 0 0 0 0
$$ 0 0 0 0 0 0 0 0 0 0 0 0 0 0 0 0 0 0 0 0 0 0 0 0 0 0 0 0
$$ ##$ShimSysFunc= (0..63)
$$ 1 2 3 4 5 7 9 11 15 16 8 10 12 14 6 17 13 18 19 20 0 0 0 0 0 0 0 0 0 0
$$ 0 0 0 0 0 0 0 0 0 0 0 0 0 0 0 0 0 0 0 0 0 0 0 0 0 0 0 0 0 0 0 0 0 0
$$ ##$ShimSysMatrix= 0
$$ ##$ShimSysType= 1
$$ ##$TFXNUM= 0
$$ ##$TRIPLO2= 0
$$ ##$VTU= 2
$$ ##$VTUETH= <149.236.99.20>
$$ ##$VTUTY= <no>
$$ ##$WBREFAM= (0..15)
$$ 135.5 97.7 100 100 100 100 100 100 100 100 100 100 100 100 100 100
$$ ##$WBREFLM= (0..15)
$$ 0 0 0 0 0 0 0 0 0 0 0 0 0 0 0 0
$$ ##$WBREFPH= (0..15)
$$ 72.26 -67.22 0 0 0 0 0 0 0 0 0 0 0 0 0 0
$$ ##$WBSGU= (0..15)
$$ 0 0 0 0 0 0 0 0 0 0 0 0 0 0 0 0
$$ ##$XFAC= 2
$$ ##END=
$$ 
##$DECIM=	3968
##$DSPFVS=	20
##.ACQUISITIONSCHEME=	NOT PHASESENSITIVE
##NTUPLES=	nD NMR SPECTRUM
##VAR_NAME=	FREQUENCY1,	FREQUENCY2,	SPECTRUM
##SYMBOL=	F1,	F2,	Y
##.NUCLEUS=	1H,	1H
##.OBSERVE FREQUENCY=	400.20200099999999566,	400.20200099999999566
##VAR_TYPE=	INDEPENDENT,	INDEPENDENT,	DEPENDENT
##VAR_FORM=	AFFN,	AFFN,	ASDF
##VAR_DIM=	1024,	1024,	1048576
##UNITS=	HZ,	HZ,	ARBITRARY UNITS
##FIRST=	4521.1594499999982872,	4521.1594499999982872,	0.21058893203735351563
##LAST=	-514.24094062501069402,	-514.24094062501069402,	0.15559323132038116455
##MIN=	-514.24094062501069402,	-514.24094062501069402,	0.00054892391199246048927
##MAX=	4521.1594499999982872,	4521.1594499999982872,	1238.761962890625
##FACTOR=	1,	1,	0.0014554639837776762318
##PAGE=	F1=4521.16
##FIRST=	4521.1594499999982872,	4521.1594499999982872,	0.21058893203735351563
##DATA TABLE=	(F2++(Y..Y)), PROFILE
$$ [...]
##PAGE=	F1=1656.44
##FIRST=	4521.1594499999982872,	4521.1594499999982872,	0.7395508885383605957
##DATA TABLE=	(F2++(Y..Y)), PROFILE
214 116 103 69 98 131 159 72 226 133 35 154 120 35 124 101 38 24 156 213 163 134 151 143 188 141 109 39 45 194 43 30 110 71 65 66 101
42 101 69 38 102 86 164 134 108 36 161 182 25 148 209 212 230 130 111 164 134 42 179 102 207 215 23 250 53 263 178 142 78 124
-116 124 82 76 294 175 65 184 176 88 145 101 103 205 152 151 60 19 63 187 220 119 154 156 73 178 87 145 197 29 48 115 62 54 84
-278 84 83 77 91 112 29 119 144 51 89 111 200 303 258 202 103 193 210 68 96 33 105 117 108 59 119 238 294 239 17 93 94 65 69 135 367
-450 367 247 63 94 179 129 139 85 63 143 86 105 160 104
-514A04
##PAGE=	F1=1646.6
##FIRST=	4521.1594499999982872,	4521.1594499999982872,	0.3198458552360534668
##DATA TABLE=	(F2++(Y..Y)), PROFILE
4521 85 137 156 100 74 118 58 53 27 54 110 165 122 84 110 169 110 101 155 106 159 42 114 182 35 62 132 44 146 46 83 48 121 120 159 18
4349 18 46 82 82 107 138 129 159 74 88 23 29 171 118 88 126 65 164 76 280 154 77 125 194 62 114 85 57 92 162 133 68 98 142 113 115
4177 115 159 102 121 138 64 71 57 201 234 53 79 226 107 105 115 184 263 38 147 158 108 169 221 214 243 141 91 205 211 10 125 34
4019 34 11 108 122 83 174 243 229 198 34 95 128 207 233 181 86 229 236 72 33 102 36 190 102 76 136 66 138 100 74 181 56 113 133
3857 133 98 51 78 71 124 124 148 107 142 137 131 109 78 143 147 259 270 309 210 169 58 176 62 138 191 54 32 184 293 185 73 219
3699 219 283 179 215 253 127 26 81 125 129 43 104 58 90 73 159 197 114 135 89 74 219 200 43 30 53 168 35 135 97 167 155
3547 155 238 88 38 114 161 197 349 244 188 278 55 167 253 112 233 141 176 130 147 278 193 101 87 140 243 119 92 134 186 140
3399 140 154 80 143 78 171 103 105 161 160 191 99 40 99 117 110 185 18 212 206 122 135 228 177 170 133 92 150 164 93 152 271 193 190 40 119 195
3222 195 152 38 81 199 155 45 92 63 97 56 67 232 101 176 184 82 102 181 57 128 120 96 140 70 369 497 2522 6830 2796
3079 2796 717 436 179 81 141 237 24 68 274 116 182 179 255 500 525 2547 8234 3655 1744 799 240 5 344 72
2961 72 214 105 214 191 218 72 95 77 330 210 25 146 113 29 65 177 123 102 217 232 155 116 189 120 115 119 10 161 95 89 202
2808 202 254 254 126 67 113 131 148 231 240 173 68 116 15 59 201 98 116 42 40 45 61 89 52 126 232 406 160 100 162 98 105 119 189
2646 189 230 132 260 199 37 127 117 61 77 45 59 100 73 112 154 168 96 135 71 113 16 215 195 17 139 68 163 231 103 184 86 157
2488 157 249 175 119 128 231 217 7 73 199 88 104 152 209 126 209 113 43 73 90 134 159 99 29 72 72 113 159 50 78 138 76 104 49
2326 49 50 55 115 193 190 161 160 221 86 44 152 311 201 34 189 112 75 120 66 139 224 30 82 131 187 85 227 137 93 47 101 105 68
2163 68 34 178 222 166 180 174 137 209 292 243 142 187 206 72 203 95 162 133 123 115 83 112 45 195 196 164 292 219 126 144 113 171 107
2001 107 107 141 123 210 252 160 257 74 65 273 219 101 222 169 87 128 140 52 185 124 107 96 69 69 149 122 122 85 12 96 158 132 261 156
1834 156 181 103 133 237 86 139 52 103 43 82 171 147 164 68 120 73 52 35 178 128 43 132 92 20 115 125 97 180 286 45 480 183
1676 183 34 68 116 9 65 154 84 123 58 195 58 174 114 115 62 212 231 60 138 149 133 194 159 40 129 109 171 234 107 228
1528 228 121 128 132 86 121 46 57 35 96 151 128 158 151 205 230 167 115 33 58 88 172 142 254 172 191 269 118 132 127 112 225 218 119 30 154
1356 154 326 302 155 554 433 187 92 144 170 175 155 56 104 95 55 100 32 114 85 27 186 4 73 163 87 53 134 38 93 242 415
1204 415 194 236 219 232 172 119 98 196 160 115 78 86 74 198 193 128 104 45 54 110 177 163 150 170 193 110 82 151 102 24 221 280 82 161
1036 161 310 250 111 218 185 44 86 156 98 97 97 97 96 105 129 149 192 196 98 87 245 370 132 68 95 28 115 62 152 107 172 128 65 72 71
864 71 90 44 102 182 237 175 23 99 109 164 312 301 60 149 117 102 121 83 129 121 24 62 171 78 82 96 170 143 69 184 78 185 215
702 215 171 132 140 103 194 37 110 227 142 49 89 227 106 77 141 143 174 97 93 124 141 60 158 155 59 159 115 106 69 53 6 15 134 566 136
529 136 572 522 430 66 255 270 192 103 86 88 96 86 39 80 50 133 107 153 337 235 41 17 124 71 231 152 101 43 125 193 129 120 6
367 6 87 299 176 77 135 277 183 86 200 129 133 144 141 108 89 164 125 105 245 58 274 122 8 48 118 166 209 396 177 92 131 101
209 101 64 103 137 183 74 250 158 12 148 92 54 119 140 37 32 169 203 202 137 164 128 196 178 117 8 82 184 13 28 106 50 79
52 79 32 95 74 28 97 84 157 115 117 55 123 151 17 153 231 259 279 143 99 154 144 11 183 140 160 183 22 240 47 232 158 155 118
-111 118 132 99 76 293 192 80 216 191 89 160 105 71 167 131 152 57 12 70 217 210 147 204 182 79 202 106 137 200 46 79 125
-263 125 52 53 140 144 60 90 70 65 95 138 118 102 114 214 269 225 179 90 180 194 67 118 59 97 113 133 41 156 213 240 210 32 105 75
-431 75 67 57 144 349 249 52 118 199 137 119 88 37 154 76 113 119 86
-514H6
##PAGE=	F1=1636.76
##FIRST=	4521.1594499999982872,	4521.1594499999982872,	0.071972273290157318115
##DATA TABLE=	(F2++(Y..Y)), PROFILE
4521 86 150 173 117 105 123 28 58 23 61 111 165 134 100 103 183 88 88 167 91 253 38 66 163 23 67 76 42 128 48 72 78 78 99 174 25 31
4344 31 56 122 106 159 137 123 76 62 26 53 170 98 83 123 74 147 69 291 140 54 135 196 80 93 122 9 112 152 119 85 126 207
4186 207 157 98 143 79 130 133 75 82 46 173 197 38 98 220 129 64 86 136 279 81 150 96 143 151 222 186 259 135 100 253 234 49
4029 49 97 59 14 112 131 115 144 220 216 186 24 114 110 208 188 171 95 240 240 89 23 115 11 167 108 103 162 95 183 101 42 216 79 167
3862 167 122 78 57 91 60 117 89 144 102 158 132 137 114 99 146 156 274 258 277 152 163 45 167 89 133 200 72 68 200 293 165 78
3704 78 227 261 170 215 272 138 19 124 140 176 105 112 49 75 65 133 178 122 113 124 102 232 179 41 47 94 113 49 135 72 164 177 245 98
3537 98 50 136 188 210 318 243 168 250 57 153 246 74 224 172 216 93 92 252 218 74 47 145 246 119 102 130 161 165 146 71 169 64
3379 64 185 98 128 151 148 183 97 40 110 77 133 163 54 207 154 85 126 228 181 172 124 140 142 144 121 101 240 168 152 53 100 174 123 71 113
3207 113 210 116 43 124 90 110 55 58 204 149 185 202 44 75 152 58 172 76 42 111 102 351 464 2378 6728 2745 666 463 185
3064 185 138 219 249 48 46 358 112 165 265 304 589 723 3165 12209 8997 2217 1034 400 39 418 116 234 50 228
2946 228 208 221 25 139 69 347 176 97 184 119 78 65 208 154 106 211 223 134 93 184 96 123 125 22 158 87 108 192 255 250 127
2793 127 37 127 161 134 233 278 196 110 151 23 52 229 124 102 42 54 76 49 88 40 142 237 401 167 135 175 133 123 128 205 187 128
2636 128 250 213 27 153 115 40 41 37 73 129 62 108 149 193 106 144 110 138 19 194 176 25 105 35 172 194 149 198 75 161 232 131
2478 131 123 108 241 239 36 129 173 17 41 125 163 128 197 109 19 67 56 125 113 124 20 26 67 124 142 61 117 134 68 97 41 29 47 102
2311 102 218 198 160 133 197 146 92 189 319 158 57 161 149 61 120 17 140 234 37 119 156 210 97 217 137 70 59 93 109 99
2163 99 28 115 192 156 123 141 105 171 306 255 142 195 208 57 201 110 183 108 142 67 113 86 44 236 201 127 279 187 109 153 143 159
2006 159 80 121 119 101 196 202 242 285 83 120 300 228 108 214 180 74 132 127 40 186 132 121 107 52 107 150 117 105 62 35 102 178 146
1843 146 273 140 212 124 105 230 75 134 87 96 22 43 180 192 164 79 106 107 60 36 205 122 30 116 71 40 55 103 53 123 259 140
1686 140 554 190 58 94 42 52 93 197 86 115 49 209 60 139 94 87 43 182 229 55 133 155 117 193 160 26 115 114 134 196 90
1533 90 207 94 91 86 70 92 66 66 40 97 140 133 168 161 235 242 190 177 70 55 50 132 141 189 200 189 260 120 119 97 94 235 215 90 34 114 241
1351 241 226 147 527 438 207 120 155 145 123 102 70 82 74 64 123 47 145 114 36 220 60 75 186 77 63 140 51 113 238 431 174
1199 174 231 224 235 210 164 118 182 136 110 88 95 98 213 212 145 142 18 101 135 170 142 139 163 190 129 41 108 103 15 234 308 123 154 290 251 111
1021 111 231 184 76 108 202 119 69 91 96 111 119 141 173 234 186 60 53 199 309 125 107 89 28 89 65 142 125 193 150 24 66 72 82
859 82 35 106 189 271 181 37 42 100 159 324 270 77 148 149 108 128 102 111 169 16 84 191 97 63 133 183 128 69 190 118 165 239 181 147
692 147 170 72 166 79 138 259 180 62 140 239 96 56 131 163 202 81 140 139 188 94 147 126 46 169 114 110 44 24 12 60 130 546 191
529 191 637 536 458 72 264 269 196 99 57 45 92 109 67 112 63 135 119 101 308 211 66 43 127 28 260 191 116 25 134 233 169 165
372 165 60 114 270 140 105 119 259 182 85 190 124 121 113 120 90 98 154 147 110 241 78 268 116 11 39 132 180 240 411 173 75 143
214 143 105 69 114 131 200 72 249 167 11 126 54 77 108 172 36 70 164 180 225 125 165 103 204 211 112 39 125 153 74 53 93 43
57 43 91 15 82 85 27 93 85 135 91 123 93 101 135 20 147 239 295 317 141 76 132 148 31 184 174 116 149 26 224 98 209 127 161
-106 161 149 138 120 88 275 205 95 234 199 92 171 109 39 137 117 157 67 46 88 244 197 159 228 198 105 225 120 120 192 82 107
-258 107 133 33 50 190 197 55 96 37 106 130 124 191 128 119 214 232 185 159 80 159 173 65 137 85 75 97 145 57 178 181 175 180 70 97 84
-431 84 90 74 146 322 241 42 134 205 135 89 84 62 168 63 133 66 58
-514E8
##PAGE=	F1=1626.91
##FIRST=	4521.1594499999982872,	4521.1594499999982872,	0.015840975567698478699
##DATA TABLE=	(F2++(Y..Y)), PROFILE
4521 82 162 189 134 120 117 81 90 16 65 117 163 150 132 94 186 51 86 178 93 335 93 20 130 23 59 27 92 113 59 55 105 48 82 191
4354 191 49 29 41 156 107 168 132 86 79 38 52 61 150 68 76 125 80 134 78 280 127 56 130 185 100 99 158 65 143 123 85 111 142 253
4186 253 187 83 118 53 129 132 92 115 79 122 154 74 123 200 151 48 89 84 273 126 138 55 169 136 220 167 266 132 112 285 237 85
4029 85 72 93 26 124 140 142 103 175 207 171 10 125 110 202 134 161 117 228 217 99 7 129 19 131 108 113 174 120 208 99 116 231
3871 231 87 226 121 50 65 99 54 121 63 130 85 169 122 140 120 108 142 158 278 244 258 92 152 40 163 117 127 212 81 88 201
3719 201 285 145 85 235 223 136 194 262 142 19 172 161 205 141 114 60 66 56 104 150 125 82 150 148 229 145 59 71 120 62 81 127 48
3556 48 150 199 245 115 61 145 206 217 269 228 138 199 55 136 237 27 216 193 244 68 60 207 220 84 23 148 241 124 107 120
3409 120 136 189 144 74 186 53 191 126 163 129 121 153 96 49 129 45 162 138 88 188 93 88 131 221 165 171 105 185 142 117 137 42 197
3246 197 133 97 62 64 148 83 112 129 215 81 74 158 124 117 53 80 158 192 194 220 76 57 109 69 215 23 26 92 137 304 394 2048 6058
3084 6058 2467 549 459 178 205 301 253 95 14 440 139 152 331 338 634 783 3226 17825 16744 2318 1119 511 71
2971 71 481 172 262 32 239 215 245 22 183 49 346 128 147 213 143 131 110 235 174 102 189 211 121 84 176 64 140 121 47 148
2823 148 141 129 166 253 247 134 26 135 178 118 222 302 210 144 170 51 61 240 145 86 37 68 103 34 114 17 155 242 379 164 173 180
2665 180 160 140 133 215 132 125 233 223 88 171 102 74 23 79 109 141 49 98 137 198 106 139 144 154 34 154 145 34 77 3 179 161 175 195
2498 195 57 161 202 97 131 77 232 246 67 178 149 59 41 87 113 123 168 112 22 86 26 116 63 164 69 23 80 133 115 85 140
2346 140 122 61 99 47 45 76 118 237 196 156 100 155 195 145 211 308 121 86 113 179 88 144 42 131 220 44 152 177 220 106 191 137
2188 137 45 61 77 112 135 31 50 158 141 66 122 79 137 311 258 130 192 196 36 197 127 196 73 166 33 131 56 86 264 205 111
2035 111 255 153 86 144 154 146 73 128 83 77 162 141 315 381 126 173 334 241 104 187 174 68 130 107 24 182 127 134 130 63 138 133 138 91
1868 91 48 66 95 184 154 274 129 226 148 96 227 70 132 123 84 16 26 189 235 159 89 93 140 71 45 217 106 22 78 57 93 26 77
1706 77 21 73 281 253 628 184 96 121 43 91 125 227 90 123 95 210 82 95 97 53 28 143 210 54 127 165 108 182 155 26 105
1553 105 113 78 150 59 167 67 68 34 82 67 103 84 52 116 132 117 158 170 262 235 195 223 90 56 32 98 134 110 224 173 235 118 102
1391 102 67 81 234 205 77 60 65 214 214 124 457 423 216 151 165 112 59 45 74 60 58 62 125 57 162 148 38 252 108 71 199 75
1233 75 87 141 62 136 219 414 151 214 202 232 238 202 129 154 99 105 113 109 123 218 217 153 168 16 141 148 162 116 135 156 178 141 27 72 105 37
1056 37 238 317 160 138 259 242 111 228 173 121 127 244 150 66 110 87 120 138 153 194 274 172 49 6 136 238 104 131 80 55
908 55 67 50 128 138 201 171 27 60 61 68 35 89 187 287 183 50 16 82 169 313 223 90 140 178 116 121 109 94 206 17 109 202 118
746 118 69 163 195 103 67 201 169 139 243 176 158 186 46 152 128 166 259 199 112 196 240 74 30 118 169 213 63 183 160 216 125 154
588 154 101 41 164 96 116 29 2 40 103 122 544 175 705 532 505 87 274 268 209 112 19 36 87 124 84 138 74 117 158 39 266
436 266 178 91 72 125 39 274 207 122 40 136 256 196 198 132 149 220 93 139 125 229 155 78 167 134 100 70 86 83 117 128 158 123 218 96
268 96 256 109 22 41 129 184 252 399 162 55 149 110 87 134 117 207 63 225 158 36 100 13 94 97 176 39 91 143 148 231 97 152
111 152 74 209 233 95 68 162 113 135 72 70 61 90 64 70 91 38 96 87 101 66 123 134 99 136 24 133 234 318 337 133 49 101 143 69
-56 69 181 202 87 121 34 214 162 195 93 154 160 139 142 110 239 209 104 235 203 93 175 108 10 116 106 161 82 81 107 263 185 155
-214 155 224 190 125 249 127 94 175 115 127 141 4 49 224 237 62 101 19 136 191 101 254 166 127 202 198 139 148 78 132 149 73 151
-371 151 108 47 75 143 95 184 146 106 154 111 72 110 126 110 140 287 221 38 139 197 120 64 80 101 182 50 157 16 24
-514B4
##PAGE=	F1=1617.07
##FIRST=	4521.1594499999982872,	4521.1594499999982872,	0.039023775607347488403
##DATA TABLE=	(F2++(Y..Y)), PROFILE
4521 75 167 203 152 119 104 129 122 13 63 126 160 165 163 86 173 5 108 183 119 389 142 20 89 38 40 27 130 103 73 39 128 82 67 209
4354 209 64 26 39 173 107 161 114 54 82 33 86 63 116 32 68 131 86 128 106 247 114 66 107 164 112 115 191 120 180 82 49 141 144 275
4186 275 202 72 89 31 119 132 101 146 112 56 112 123 147 171 179 70 105 53 247 167 111 41 180 122 216 157 266 122 115 298 222 111
4029 111 64 111 59 148 145 158 62 120 204 163 17 127 126 193 85 155 150 193 171 98 26 144 50 90 102 106 170 137 209 97 196 225 83 278
3862 278 149 46 74 106 56 133 53 98 56 177 110 139 129 105 142 154 276 229 254 39 140 43 164 141 119 222 77 89 188 276
3714 276 136 91 236 187 84 155 222 137 16 208 186 213 147 108 87 59 58 73 122 122 47 165 190 212 100 76 91 126 38 110 115 45 127
3551 127 218 237 127 73 137 209 213 210 203 100 134 56 125 232 23 220 201 255 63 77 151 199 105 49 151 232 143 106 111 120 208 145 92 196
3384 196 53 189 168 202 102 94 107 94 66 147 23 196 117 112 161 54 122 140 205 134 163 80 222 151 87 134 32 145 93 59 66 21
3227 21 117 54 152 129 211 61 115 191 156 117 55 119 114 224 197 233 154 75 65 83 252 31 99 85 167 236 303 1586 4944 2005 389
3074 389 427 159 282 381 254 145 39 510 204 183 373 377 684 810 3000 25448 25730 2269 1110 590 124 536 240
2961 240 297 133 254 223 291 66 218 28 329 71 174 236 171 182 154 256 189 87 158 198 121 82 167 41 159 111 77 138 215
2818 215 141 128 245 238 143 52 140 179 103 200 313 218 168 177 76 88 228 151 68 27 74 125 27 160 19 156 241 343 151 206 179
2665 179 172 155 130 221 72 125 215 230 144 174 82 117 67 131 142 136 37 85 120 186 93 120 167 157 50 109 109 46 69 36 182 134 182 176 36
2493 36 160 164 97 141 45 205 236 87 213 133 121 98 48 68 112 129 118 72 110 44 110 38 209 121 70 98 139 79 108 144 102 56 101
2331 101 63 71 107 150 243 191 151 63 101 234 194 210 276 94 117 53 199 129 173 100 113 181 55 176 193 217 113 152 139 42 54 57 121
2168 121 168 45 35 127 122 28 125 68 114 303 248 105 175 167 14 190 135 196 38 194 10 132 28 127 271 211 144 234 125 64
2021 64 121 147 138 80 129 40 81 114 79 364 489 193 219 359 248 96 144 153 81 124 80 18 173 106 146 162 70 160 103 169 81 56 100
1858 100 71 174 164 269 121 226 174 97 222 84 133 158 67 54 26 201 269 149 88 88 165 84 60 218 84 16 34 55 133 85
1711 85 50 63 85 356 361 696 168 124 147 92 120 155 235 96 142 137 194 108 58 112 30 25 102 176 56 125 174 110 161 143 29 102 105 12
1543 12 119 27 116 39 64 16 106 66 144 106 69 133 119 83 129 178 283 209 179 246 89 63 37 75 128 27 240 147 197 116 84 42 75
1381 75 221 189 80 82 28 250 245 87 358 387 215 176 171 78 17 49 70 44 55 50 108 58 173 184 31 276 136 58 198 76 115
1228 115 136 75 153 192 369 136 187 159 227 252 231 138 113 55 105 144 132 140 208 204 148 179 51 167 150 160 85 140 147 159 143 59 61 109 64
1056 64 231 303 181 122 227 227 112 212 155 156 143 278 174 93 147 70 119 158 157 205 299 156 86 56 68 169 74 133 79 89 63 37
898 37 106 142 197 185 66 51 46 49 44 54 176 281 177 65 65 56 197 281 168 102 128 200 124 108 101 79 225 18 137 207 142 82 173 206
731 206 75 67 210 224 109 226 160 166 191 36 152 175 184 222 199 160 245 230 50 8 104 157 199 52 216 185 220 146 176 83 34 146
574 146 62 121 22 15 72 136 112 570 103 793 522 575 89 285 266 222 149 64 66 76 130 90 152 82 82 207 61 220 145 114 99 119
416 119 66 267 199 117 55 128 259 203 214 204 180 152 42 171 145 193 106 74 143 152 76 27 45 87 140 91 159 139 176 104 238 102 47
254 47 61 111 177 242 357 147 42 147 111 115 158 98 202 46 186 134 60 83 30 104 99 150 57 95 113 111 225 58 126 51 205 239
96 239 69 91 187 91 187 82 40 89 76 112 73 88 52 103 88 65 47 113 170 109 146 22 116 218 326 336 130 47 70 129 99 177 223
-66 223 80 110 48 218 222 187 62 134 149 133 159 139 189 203 104 218 206 92 167 100 23 105 93 158 93 111 124 270 176 135 198 161 133
-229 133 275 130 62 157 141 137 146 33 56 234 261 70 103 17 149 249 79 301 207 136 184 175 85 150 87 103 121 97 162 126 43 57
-386 57 135 137 175 113 43 134 152 39 134 161 149 126 245 186 43 130 178 97 80 77 133 192 40 180 53 22
-514B2
##PAGE=	F1=1607.22
##FIRST=	4521.1594499999982872,	4521.1594499999982872,	0.096399240195751190186
##DATA TABLE=	(F2++(Y..Y)), PROFILE
4521 67 167 208 169 111 93 158 145 21 54 136 153 176 186 80 145 50 146 176 157 406 179 52 45 58 38 49 150 96 84 32 148 136
4364 136 53 222 69 16 41 167 105 140 87 34 82 47 122 78 78 7 59 140 94 126 142 201 102 69 73 135 113 121 219 157 214 41 74 171
4196 171 133 273 204 69 69 18 102 132 99 165 131 20 83 169 163 141 211 103 112 57 208 197 69 32 173 107 210 148 257 109 106 291
4039 291 194 129 79 109 102 181 146 164 52 68 207 164 37 119 150 187 70 151 184 141 113 86 59 161 79 52 94 86 151 145 186 107 257
3876 257 198 83 317 200 90 82 111 64 145 53 56 14 186 98 131 138 95 157 147 279 218 251 20 129 55 167 156 111 225 63 77
3724 77 165 272 139 89 226 176 50 108 157 122 19 223 210 200 128 94 113 53 70 41 104 112 19 167 217 185 49 82 107 113 62 132
3566 132 99 68 100 233 221 128 83 117 192 191 155 174 63 64 59 123 235 68 240 194 248 72 112 97 159 121 89 153 222 175 104 111 110 218
3399 218 147 123 199 59 179 205 236 77 87 63 94 84 159 9 230 104 126 129 79 153 143 179 95 148 55 246 166 60 118 91 91 57
3241 57 95 65 56 80 78 189 124 199 63 154 220 179 108 66 162 99 244 187 234 235 111 53 92 280 79 174 89 190 156 211 1066 3580
3084 3580 1436 214 377 135 364 447 251 187 86 553 276 260 395 434 757 927 2903 32885 33579 2251 1088 665
2976 665 195 579 315 332 234 270 244 337 99 240 48 299 47 177 257 185 223 184 267 206 64 128 185 131 79 157 62 177 106
2833 106 107 136 282 140 84 229 218 147 81 146 165 92 169 312 219 181 175 90 124 193 138 52 21 75 140 35 208 49 143 229 296 133
2675 133 226 173 167 172 115 220 32 132 197 234 190 164 83 153 110 179 161 115 37 74 108 173 67 95 176 145 63 90 78 70 81 66 179 115
2508 115 174 150 19 162 121 126 147 46 163 213 90 230 123 170 148 28 32 95 89 119 125 129 83 110 71 250 172 105 115 142 37 122
2350 122 128 77 51 93 84 84 125 178 237 187 144 29 42 265 233 185 228 78 146 33 206 163 196 155 91 122 71 190 198 200 121 108 147 64
2183 64 43 38 138 188 65 89 106 95 42 142 74 102 284 225 69 142 124 19 180 127 179 26 220 22 121 14 155 256 216
2040 216 201 227 115 49 86 124 134 88 127 6 110 69 38 382 576 272 252 362 241 100 96 129 110 116 50 37 158 72 155 197 64
1888 64 174 67 197 80 73 131 37 154 182 265 114 216 198 97 212 112 136 194 47 98 33 214 290 135 73 92 178 97 78
1745 78 212 79 38 52 65 155 138 30 122 136 451 453 756 149 140 174 127 137 178 220 104 158 161 161 123 65 126 47 39 71 131 61 131 178
1578 178 122 135 123 31 103 95 66 130 42 63 23 74 62 128 84 178 125 85 137 96 44 82 185 297 170 146 244 71 82 42 67 128 55
1415 55 247 119 154 125 76 40 77 195 170 95 93 59 292 272 39 247 332 203 194 171 54 85 103 58 43 63 30 77 55 184 217 16
1258 16 285 142 39 184 73 137 127 89 163 162 304 133 152 104 226 253 246 150 63 51 114 176 158 145 184 176 131 175 88 179 141 165 60
1095 60 150 133 138 135 89 68 119 93 211 266 183 119 201 210 112 186 130 173 158 301 185 127 190 56 111 174 151 203 299 142 131 116 26 114
928 114 53 112 91 124 79 60 77 137 183 191 96 37 37 30 52 8 154 255 158 78 96 41 234 236 118 123 119 213 128 94 80 71 223 15 165
756 165 209 170 96 162 212 62 73 214 274 81 193 137 178 195 38 153 213 186 153 186 195 281 209 49 32 87 129 159 68 235 207 199
598 199 150 196 75 22 121 20 123 35 22 101 156 103 618 44 917 520 665 88 294 260 230 194 132 89 56 126 91 154 89 41
451 41 254 130 183 125 130 121 114 82 243 170 107 58 111 239 190 212 268 201 71 26 192 166 156 46 84 128 166 61 41 27 96 164 59
288 59 152 154 120 94 217 95 84 96 84 160 212 286 130 53 138 106 151 183 80 185 17 145 104 80 76 67 106 114 106 87 80 87 75 212 22
116 22 91 45 193 232 36 112 195 114 225 85 36 113 65 148 91 74 61 106 86 38 41 97 196 120 153 13 96 196 317 314 139 79 55
-47 55 111 115 170 232 86 124 67 232 268 179 39 107 123 117 171 170 130 186 96 190 207 87 148 85 52 106 78 147 98 132 138 263 170 104 160
-219 160 125 129 297 131 33 150 160 137 148 74 70 217 265 70 104 28 142 289 87 328 244 144 168 163 23 169 107 75 93 131
-367 131 175 138 85 58 133 171 157 87 40 119 185 28 145 188 181 105 199 136 52 108 153 72 124 72 149 192 36 196 95 55
-514E5
##PAGE=	F1=1597.38
##FIRST=	4521.1594499999982872,	4521.1594499999982872,	0.17748740315437316895
##DATA TABLE=	(F2++(Y..Y)), PROFILE
4521 62 161 203 180 111 97 165 153 39 36 139 139 178 195 73 112 100 187 148 193 388 200 76 12 77 65 55 151 91 92 34 159 179 39
4359 39 225 66 9 41 136 101 103 59 25 79 59 153 110 55 35 53 150 105 122 175 153 94 61 63 102 107 111 237 169 235 37 130 196 116 248
4186 248 193 68 74 22 87 132 87 166 133 87 75 203 167 114 241 133 104 66 166 217 21 17 148 95 202 135 243 109 83 264
4039 264 159 143 102 90 143 217 143 159 84 33 213 170 53 105 176 188 97 147 211 80 64 65 95 177 103 44 86 58 118 142 143 134 291 153
3871 153 103 336 259 146 86 114 71 147 55 57 35 199 92 117 146 83 185 141 288 218 239 49 117 73 165 161 105 220 44 57 139
3719 139 272 152 78 203 195 87 84 79 100 42 216 231 171 95 75 128 48 86 15 97 95 30 158 226 154 15 76 117 90 96 149 78 97 85
3551 85 241 198 118 89 94 153 151 121 150 44 26 64 130 244 103 267 174 223 80 142 83 113 127 132 155 208 206 111 125 98 216 150 163 199
3384 199 62 160 226 259 59 102 65 100 98 162 3 254 99 134 97 120 169 137 148 63 128 42 255 177 51 96 140 42 31 147 60
3232 60 116 42 124 218 128 184 77 186 236 189 90 80 202 122 252 163 218 303 140 76 91 292 114 240 97 209 80 148 565
3089 565 2191 853 69 320 119 437 481 242 211 115 550 327 349 400 503 842 1193 3303 36871 37239 2132 1100
2981 1100 747 268 597 378 349 310 277 266 360 109 246 89 260 98 160 272 171 249 196 263 229 43 103 169 138 73 144 96
2843 96 189 118 134 143 323 129 43 206 184 136 102 154 144 86 139 303 215 181 169 87 158 142 108 48 39 82 147 46 244 72 120 205 247
2680 247 119 228 166 148 189 93 213 65 147 178 235 223 143 122 178 138 216 165 81 56 65 120 179 35 70 171 118 68 118 60 103 98 87
2518 87 166 102 158 121 17 163 79 154 152 84 115 188 76 229 111 204 185 57 9 70 62 110 173 144 118 120 108 282 217 126 128 141 12
2355 12 126 99 51 50 71 105 77 121 190 219 188 130 15 14 291 260 144 177 70 169 98 201 182 208 203 72 56 87 192 191 171 127 79
2193 79 162 88 33 34 159 190 84 134 94 60 64 158 96 103 259 199 27 96 75 36 163 99 142 43 239 60 107 32 167 220 212 251 238
2031 238 121 49 47 93 129 88 122 43 137 58 50 366 627 355 271 336 214 122 64 109 144 106 28 62 139 30 158 232 49 177 33
1878 33 218 101 83 154 50 135 206 264 108 198 218 89 196 140 138 228 27 139 55 225 297 119 43 94 178 109 97 204 107 68
1730 68 102 78 158 172 36 183 180 535 523 803 134 143 198 145 141 188 185 112 163 162 115 120 97 131 77 59 70 86 73 145 172 136 108 98 36 107
1553 107 82 140 169 78 19 51 88 96 141 97 195 136 99 129 58 59 28 188 302 127 102 219 45 114 49 68 144 126 241 100 122 149
1396 149 92 60 82 158 149 116 88 96 299 274 15 150 263 182 205 168 55 148 151 35 54 70 11 44 56 199 242 23 275 126 38
1243 38 164 58 146 119 94 166 132 231 137 115 51 233 243 245 165 13 99 128 206 182 138 151 136 105 157 123 179 126 176 61 156 110 125
1081 125 117 107 69 137 124 176 209 169 136 185 194 109 156 100 170 178 312 185 154 227 60 99 185 134 188 274 138 168 168 57 89 72 74 105 156
908 156 99 95 46 123 160 186 114 19 33 18 60 54 122 215 128 89 105 71 268 187 88 157 119 214 127 83 57 67 200 12 189 210 200 113
741 113 134 208 82 78 212 311 64 149 116 196 204 49 145 231 172 67 173 212 296 180 77 60 69 89 101 102 238 218 157 132 196 69
583 69 20 100 35 121 67 23 122 163 95 673 124 1074 540 765 96 300 247 224 234 196 99 31 112 97 148 96 43 287 185 171 122
431 122 136 129 115 83 207 129 97 51 84 198 160 196 316 206 12 68 199 177 126 42 105 126 168 68 78 61 104 187 62 142 167 67
273 67 63 191 85 123 138 64 137 165 199 115 76 125 96 188 205 64 161 22 113 75 97 66 98 102 134 98 125 50 84 46 196 49 58 50 173
101 173 220 8 128 186 154 248 85 77 127 81 166 110 53 62 97 77 26 51 80 209 122 149 3 76 169 292 274 155 118 72 91 113 159
-61 159 229 88 150 88 247 292 168 27 80 97 93 174 199 78 159 83 160 203 78 119 60 79 121 61 130 94 140 147 243 164 71 128 114
-224 114 117 311 133 37 164 173 127 144 112 84 180 250 59 103 48 118 304 136 338 271 145 157 157 45 198 136 52 67 164 191 144
-376 144 139 77 147 191 137 72 84 109 206 51 140 204 200 81 161 74 55 77 124 62 165 64 147 178 46 203 121 77
-514G7
##PAGE=	F1=1587.53
##FIRST=	4521.1594499999982872,	4521.1594499999982872,	0.21188712120056152344
##DATA TABLE=	(F2++(Y..Y)), PROFILE
4521 64 153 186 181 132 118 152 147 61 6 130 116 170 189 70 85 139 220 100 215 341 206 95 30 93 95 44 136 91 99 35 162 197 23
4359 23 217 57 22 40 87 98 56 43 19 74 61 170 145 59 59 60 161 115 112 195 116 94 47 97 65 99 88 244 154 238 63 177 210
4196 210 106 207 173 62 96 44 88 135 77 149 121 144 84 220 156 99 255 152 79 60 129 223 33 28 106 94 191 115 231 133 48
4044 48 222 127 159 120 60 174 246 136 149 128 33 220 173 59 93 202 196 125 138 222 26 67 45 127 188 118 78 82 28 76 131 88 169
3881 169 296 101 133 332 310 199 82 111 71 133 60 106 87 216 92 101 150 74 217 141 300 235 213 78 101 91 155 154 103 203
3734 203 25 46 119 271 168 56 167 223 137 106 3 77 74 194 244 137 69 54 127 43 96 32 91 72 53 142 217 125 53 58 123 77
3576 77 122 165 53 122 96 242 169 97 91 88 93 95 115 136 55 72 71 138 254 124 291 142 187 80 160 117 85 124 176 157 189 225 135 157
3409 157 74 201 155 208 195 58 134 224 265 49 119 104 114 104 153 5 260 100 139 66 150 166 123 121 57 110 56 249 177 73 83
3256 83 169 17 19 180 52 172 40 163 239 145 167 91 211 235 183 63 88 233 157 249 124 187 344 149 95 78 283 135 286
3113 286 106 230 20 130 149 976 351 87 268 122 486 468 222 215 116 492 345 425 392 569 938 1601 4334 34930 34132
2990 34132 1935 1167 834 325 579 408 332 338 260 265 346 89 232 127 214 156 126 271 125 254 193 243 252 55 81 144 133 80
2853 80 125 117 193 146 151 156 332 119 19 176 141 104 115 162 130 86 118 288 209 172 162 66 182 91 66 62 70 102 145 52 259 83 95 170
2685 170 200 112 215 159 119 206 83 202 105 167 157 232 246 116 172 189 144 238 153 43 84 60 159 207 6 51 153 83 66 163 52
2533 52 136 108 97 140 88 144 95 26 162 49 168 156 126 74 173 47 209 94 219 210 103 27 38 64 94 209 155 141 140 128 301
2380 301 253 130 141 133 56 118 68 27 56 35 119 48 98 186 195 196 113 30 64 310 273 98 134 63 184 159 184 185 209 239 61 51 95 184
2213 184 171 135 130 85 183 105 31 49 178 174 100 162 86 32 81 165 129 116 237 183 20 42 38 45 138 59 92 56 247 106 106 55 166 167 193
2040 193 280 254 137 61 14 68 121 79 116 71 149 88 80 321 640 430 275 282 167 146 71 100 173 96 35 86 113 12 154 261 35
1888 35 169 11 228 138 83 163 107 132 227 265 102 177 232 73 176 159 133 259 12 168 87 233 293 101 21 83 166 117 114 196
1740 196 145 96 143 88 145 180 54 240 204 593 573 836 119 128 220 147 130 186 136 120 156 141 65 96 120 126 102 79 93 54 97 162 157 147
1573 147 91 69 44 109 75 206 207 104 27 88 103 118 142 97 194 138 107 118 14 111 43 189 296 90 54 177 41 157 79 75 172
1420 172 179 225 98 116 182 128 83 90 112 125 137 67 116 255 244 60 108 191 156 213 165 69 196 183 7 72 71 13 26 71 216 255 49
1258 49 246 95 66 148 34 139 115 86 166 101 159 140 83 40 249 225 229 180 43 150 142 231 201 122 114 93 77 129 153 171 110 186 88
1095 88 152 78 125 90 113 55 165 159 127 141 143 165 179 182 104 127 69 153 203 312 177 165 250 82 87 188 109 164 224 144 193 205 83 97
928 97 108 50 112 178 112 117 24 100 131 172 118 13 28 25 75 114 84 168 91 100 93 124 291 143 87 196 131 204 126 76 49 63 159 22 205
756 205 209 225 133 106 194 114 78 202 328 63 101 103 220 220 75 123 227 147 47 171 207 288 144 105 85 61 53 69 139 227 215 99
598 99 92 170 60 41 93 72 114 104 21 130 163 86 712 201 1237 587 859 111 298 227 202 257 245 97 28 91 113 142 101 78 297
446 297 218 185 128 130 122 126 73 172 101 93 46 46 143 119 169 339 194 86 107 188 175 110 99 127 130 157 87 104 98 104 205 93 134 178 75 16
268 16 160 69 156 179 63 111 111 111 101 97 115 85 219 217 49 134 67 93 54 114 54 122 93 148 156 159 8 102 26 180 92 53 53 152 211 33
91 33 136 164 181 258 91 126 128 118 163 120 31 57 74 61 31 66 71 209 114 131 22 53 138 253 221 166 148 104 72 94 144 215 80 176
-76 176 103 252 290 152 22 66 92 76 172 220 66 129 74 135 189 68 85 34 106 146 51 113 81 136 152 213 153 54 121 139 104 310
-234 310 137 63 189 181 108 132 137 88 133 213 39 99 71 84 293 197 337 283 136 147 156 113 229 170 36 44 187 211 147 190 103 170
-391 170 193 127 72 118 105 209 70 122 207 206 59 153 26 50 42 92 78 187 52 129 150 69 197 127 83
-514H3
##PAGE=	F1=1577.69
##FIRST=	4521.1594499999982872,	4521.1594499999982872,	0.16154937446117401123
##DATA TABLE=	(F2++(Y..Y)), PROFILE
4521 69 145 158 169 164 143 127 128 90 34 106 81 149 174 76 74 161 241 60 218 272 197 111 49 106 115 24 110 100 109 36 152 188 13 194 53
4349 53 35 41 43 103 18 47 13 70 51 169 169 71 74 81 173 121 97 195 99 103 42 140 28 95 63 237 114 220 80 201 212 112 158 143
4182 143 43 113 75 108 143 81 118 104 184 94 217 131 97 249 159 42 41 105 217 78 59 53 105 174 100 223 173 11 170 112 180
4029 180 127 42 187 260 126 138 169 54 225 169 55 91 225 210 138 122 212 38 97 46 151 194 124 123 86 16 38 116 33 197 273
3876 273 50 157 305 345 242 67 98 60 102 68 150 135 234 94 85 148 73 241 147 308 264 180 103 82 104 137 138 106 176 8 57
3724 57 111 263 185 27 127 238 172 138 60 69 107 176 249 107 72 47 112 40 96 59 77 44 68 123 193 100 87 36 128 85 138 179 32
3561 32 139 128 232 139 70 86 111 16 44 116 129 74 114 82 142 261 129 299 105 145 72 167 158 91 115 217 155 164 230 168 198 39
3404 39 174 164 251 185 47 103 198 249 44 127 139 138 103 131 9 245 102 140 39 164 150 106 111 75 107 84 231 160 110 89 173 40
3246 40 12 184 44 214 85 187 248 167 152 101 231 214 162 30 84 253 185 242 78 147 351 133 99 57 253 143 305 107
3108 107 258 16 134 144 74 150 141 224 146 500 400 194 214 104 397 351 485 385 610 1035 2083 5829 27299 23477 2629
2985 2629 1358 925 359 524 396 273 308 210 222 293 42 197 158 165 198 81 250 62 238 179 209 263 92 63 111 116 112 99 115
2843 115 185 175 155 169 306 121 37 142 94 49 122 167 131 88 111 269 203 156 158 33 192 83 21 85 105 135 139 52 249 80 74 132
2685 132 161 115 194 154 88 221 109 192 128 188 134 223 259 88 212 185 128 243 131 33 111 59 213 239 28 41 127 56 64 200 42
2533 42 161 111 94 100 73 139 72 34 157 53 166 164 163 72 175 14 177 72 212 223 155 59 7 80 80 230 165 147 166 126 303 277
2375 277 118 158 116 96 104 51 14 67 21 121 25 65 167 170 210 103 38 105 321 268 63 107 59 192 204 159 172 200 260 62 108 91
2218 91 166 138 92 125 107 210 120 37 68 189 145 112 166 72 57 97 163 164 139 227 187 55 27 56 43 106 53 50 56 243 151 123 77 155 106
2045 106 157 283 258 155 86 25 62 107 64 110 89 143 118 111 259 626 488 267 207 103 158 92 99 189 86 55 104 79 49 142 278
1893 278 29 147 5 229 178 74 159 164 148 240 265 100 153 236 53 157 166 118 284 27 179 119 240 286 83 66 54 147 118
1750 118 126 183 173 117 169 100 126 162 71 287 203 621 607 853 90 91 237 133 105 170 85 124 141 101 19 53 126 117 122 95 113 55 129 177
1583 177 133 153 92 42 50 108 85 259 230 112 52 123 119 126 132 82 176 131 109 124 52 157 95 191 280 65 16 126 66 204 130 89 204
1420 204 206 200 104 128 216 172 105 98 61 99 155 35 115 167 194 94 130 126 132 217 163 81 223 199 40 94 68 23 27 93 229 255 74 198
1253 198 59 100 145 23 115 113 62 164 69 97 134 65 69 267 205 200 186 86 189 150 250 209 100 82 53 54 96 173 162 100 194 120 133
1090 133 41 135 59 109 35 200 198 67 72 113 193 179 170 96 101 38 138 233 303 169 160 258 104 83 183 79 138 157 152 203 224 88 116 138
923 138 86 106 188 114 116 24 70 97 151 109 37 32 39 104 169 46 125 67 115 67 180 299 114 101 230 148 188 130 77 59 56 106 43 211
756 211 204 242 151 99 168 136 66 187 324 67 63 105 245 241 111 88 199 123 118 179 181 258 105 123 104 76 60 121 168 205 195 41 35 117
588 117 46 65 95 96 104 140 19 126 159 75 715 256 1372 655 927 122 286 196 165 257 275 89 61 74 134 142 101 100 283 226 211
436 211 131 112 101 146 58 144 109 94 60 10 86 77 135 333 162 144 138 162 159 113 148 141 130 134 103 116 127 95 212 122 134 187 135 55 127 49
259 49 176 212 74 86 63 65 83 108 116 81 237 219 34 111 113 79 48 133 66 139 78 155 225 183 42 125 18 164 128 77 48 138 212 54
91 54 131 133 187 257 113 170 116 153 138 122 22 61 48 41 58 82 75 196 95 97 42 30 105 205 161 164 164 130 55 63 124 195 65 191 108 243
-86 243 265 137 20 74 109 86 165 228 93 104 77 117 168 56 49 39 131 177 55 101 61 119 149 177 135 61 132 172 97 293 140 86
-244 86 211 184 81 115 144 76 102 158 23 92 91 50 259 252 328 279 121 130 158 173 251 204 26 28 195 232 149 230 128 192 178 134 84
-406 84 138 108 195 77 98 199 198 43 186 88 52 15 57 103 184 48 102 111 97 178 114 71
-514G1
##PAGE=	F1=1567.85
##FIRST=	4521.1594499999982872,	4521.1594499999982872,	0.079201728105545043945
##DATA TABLE=	(F2++(Y..Y)), PROFILE
4521 70 139 123 144 193 165 101 104 122 80 76 36 120 159 90 78 161 244 101 203 192 178 126 58 114 124 35 82 118 127 44 130 154 33 161 67
4349 67 39 48 68 120 64 61 16 72 26 146 175 78 84 104 183 121 82 173 97 118 63 173 20 92 51 216 61 184 83 198 203 130 113
4186 113 107 12 114 109 136 157 99 81 92 201 100 198 94 108 221 149 3 27 98 202 114 86 21 119 153 103 220 213 47 114 118 202
4029 202 118 66 179 254 114 131 203 82 227 158 43 100 244 224 136 102 180 61 115 65 162 192 121 167 96 38 50 105 32 208 231
3876 231 20 159 258 360 271 49 73 38 57 77 170 171 244 95 77 139 83 251 156 303 295 156 121 63 107 111 119 112 144 14 78 122 246
3714 246 198 5 94 230 182 154 98 89 134 188 244 91 93 70 85 43 85 81 53 19 73 105 157 77 106 31 132 98 144 188 32 148 162
3551 162 214 111 46 76 147 69 76 106 119 87 142 100 137 262 122 286 72 108 62 164 187 107 102 250 146 135 219 201 243 15 140
3399 140 178 285 168 34 73 155 213 41 123 159 170 96 99 14 207 103 134 35 168 126 87 117 99 122 114 205 126 148 107 151 56 5
3241 5 163 36 238 133 197 245 185 140 110 245 176 128 38 67 260 200 236 54 111 323 93 87 50 206 147 294 94 290 27
3099 27 130 304 467 321 145 187 179 477 282 172 237 148 327 388 538 393 587 1065 2462 7255 19751 7430 4404
2985 4404 1688 1009 378 451 352 180 230 130 135 218 46 147 183 122 214 31 215 62 201 163 166 256 134 59 84 105 162 66 90
2843 90 166 194 145 176 250 132 66 110 52 22 130 169 146 90 114 248 199 138 156 19 185 119 20 111 142 175 138 47 218 66 58 97
2685 97 130 123 179 151 61 233 159 184 129 204 113 206 265 64 231 166 97 233 102 73 131 62 264 258 48 38 98 67 78 224 22 170
2528 170 106 80 52 64 147 62 41 149 83 150 181 192 105 186 40 137 52 183 222 211 95 38 92 86 234 171 138 190 103 287 285 95
2370 95 181 92 126 99 63 26 81 63 110 79 62 141 146 226 110 33 136 319 245 53 93 79 200 228 133 150 187 265 72 153 72 139 96
2208 96 49 113 124 239 138 49 83 189 113 117 149 45 104 118 155 193 160 231 205 79 77 91 30 69 108 73 45 229 187 144 98 141 47
2045 47 111 263 240 170 122 48 66 92 49 106 96 121 135 147 207 601 518 248 134 46 151 101 97 190 82 78 114 33 79 123 279 33
1888 33 115 16 221 209 64 143 207 171 242 258 101 128 226 36 142 159 90 300 54 167 142 245 277 65 123 11 129 110 130
1745 130 160 182 129 179 115 114 126 82 317 181 623 630 851 49 36 253 108 67 144 42 125 127 51 15 19 123 114 136 108 121 73 160 183
1583 183 107 153 108 23 50 99 116 294 234 101 67 153 133 122 116 63 150 118 105 155 110 184 134 196 252 51 37 73 91 247 191 109 227
1420 227 207 168 106 140 244 214 123 103 12 68 166 38 97 118 171 115 159 84 117 214 161 88 226 199 87 114 65 35 29 114 232 242 89
1258 89 140 38 127 153 51 78 111 27 160 43 51 117 65 91 283 186 165 183 113 209 152 264 207 73 59 30 42 62 179 155 98 200
1100 200 146 102 25 145 31 99 40 234 236 12 48 89 215 180 157 84 78 11 134 263 284 166 136 251 119 88 172 53 117 83
953 83 151 201 223 75 135 155 141 87 181 106 89 33 37 63 128 92 67 65 49 139 213 29 94 76 136 42 234 292 112 119 249 165 172 138 88
780 88 71 43 54 67 205 194 248 160 114 135 139 44 168 299 66 58 120 267 258 150 45 152 114 162 185 139 210 69 130 117 109 97 192
618 192 179 174 159 48 44 50 29 84 94 99 95 166 17 112 152 57 672 310 1451 730 953 119 263 155 121 236 285 79 95 78 150
465 150 146 91 107 247 217 234 125 85 74 170 55 127 143 95 86 57 53 55 99 299 114 182 168 133 131 129 182 144 125 105 107 117 145 76 205 136
288 136 144 196 194 123 93 45 180 232 82 65 63 99 58 108 129 87 235 208 23 98 153 63 60 155 107 150 57 158 274 191 97 140 22 149
121 149 156 104 35 135 215 62 112 102 170 249 150 202 99 177 96 118 29 84 52 31 100 98 86 175 71 53 59 33 71 159 102 146 163 144 39
-52 39 38 101 179 49 192 100 218 222 135 23 96 128 117 159 222 115 92 95 106 146 43 24 76 153 203 70 102 38 95 137 145 109 80 139
-219 139 190 99 260 140 97 217 179 48 93 127 47 112 86 39 86 101 38 208 289 312 262 104 102 166 217 255 230 22 25 186 247 152
-376 152 250 150 205 153 157 102 143 117 166 76 76 182 181 34 237 161 83 27 28 121 159 58 80 69 125 149 89 49
-514D9
##PAGE=	F1=1558
##FIRST=	4521.1594499999982872,	4521.1594499999982872,	0.078210689127445220947
##DATA TABLE=	(F2++(Y..Y)), PROFILE
4521 63 132 86 111 209 179 91 81 154 125 73 18 85 155 105 86 144 231 177 172 110 153 142 60 118 123 70 66 137 151 60 98 118 66 122 95 32 58
4339 58 111 148 117 72 31 80 14 101 158 80 92 122 190 116 75 134 96 131 98 192 51 87 57 184 50 138 73 171 189 148 88 67 39 98
4172 98 136 160 173 119 46 95 197 104 168 63 130 181 121 33 44 103 181 137 102 65 123 125 125 218 245 91 61 133 222 91 109 149 227 99
4004 99 129 223 113 225 144 31 113 257 233 123 83 131 60 116 83 159 182 108 200 106 64 94 105 62 194 177 20 136 196 354 283
3852 283 54 35 5 7 83 161 192 240 98 83 120 102 244 161 283 317 154 130 49 96 80 99 118 114 34 98 153 223 207 34 79 199
3694 199 170 149 109 123 150 231 232 88 112 107 54 52 64 98 33 27 65 92 115 53 112 51 132 100 142 184 40 148 185 190 87 39 59 179 152
3522 152 143 80 101 89 157 120 120 255 108 251 66 92 61 151 198 109 88 268 132 104 199 223 282 60 106 198 304 142 24 54 107
3369 107 160 38 111 165 204 86 64 19 151 101 118 59 167 105 71 127 124 147 140 176 79 180 127 108 57 11 128 32 244 172 195 230
3212 230 194 128 119 251 129 88 86 44 253 204 234 86 104 276 39 66 76 153 152 258 69 316 43 116 349 672 392 120 158
3069 158 209 427 145 164 281 238 341 454 591 408 442 898 2475 7773 21274 9599 6057 1985 1045 382 387 303 93
2956 93 139 44 33 151 110 98 203 102 201 15 189 128 148 147 121 229 169 76 91 126 211 40 48 139 194 122 172 178 138 100 90 31 98
2793 98 144 167 164 88 121 228 198 128 154 56 164 154 48 135 177 215 153 48 177 49 47 74 106 132 179 147 43 241 208 178 110 210
2636 210 99 181 266 46 225 135 67 209 73 116 139 67 297 255 57 43 73 102 109 234 9 160 97 61 8 77 166 79 49 144
2488 144 118 141 208 212 139 193 82 96 54 134 206 262 130 72 95 110 228 170 114 205 71 255 278 72 207 69 140 116 90 42 92
2336 92 100 87 148 108 114 122 235 129 20 158 300 207 62 87 125 213 231 109 127 173 254 88 176 41 109 52 23 98 129 265 161
2183 161 63 91 178 90 117 116 9 151 139 146 206 171 239 221 87 124 120 17 33 170 119 29 208 208 153 116 126 29 85 234 197 180 167
2021 167 72 64 77 42 104 95 91 138 188 206 574 509 219 113 90 126 92 90 173 85 107 113 21 107 102 260 42 82 39 205 222 60 121 229
1853 229 189 234 238 107 107 200 33 138 145 52 305 86 136 152 248 266 57 178 52 121 92 127 122 171 138 175 135 122 101 87 325 145
1696 145 608 644 825 79 74 267 75 33 112 17 125 118 5 34 66 128 121 146 116 117 93 179 180 82 149 126 22 43 82 158 307 224 75
1533 75 77 180 143 112 99 47 123 105 95 198 159 186 155 200 211 48 63 28 104 278 252 128 233 183 133 96 138 260 247 136 105 37
1376 37 37 168 83 67 252 238 125 176 73 115 206 155 87 204 186 136 126 69 53 38 132 226 219 89 78 49 143 164 81 38 103 25 155
1213 155 45 27 87 75 99 291 168 134 171 120 207 146 271 192 44 45 32 42 34 166 152 102 204 158 72 61 148 36 87 69 260
1061 260 267 63 92 83 226 179 140 66 58 19 139 288 259 169 101 231 122 102 158 39 106 10 134 190 207 55 147 155 187 61 161
908 161 97 55 43 16 39 105 71 96 113 52 170 240 46 77 103 161 47 277 273 132 136 249 178 160 145 106 78 25 37 90 188 175 243
746 243 160 130 102 119 34 148 260 54 82 143 281 264 186 31 94 126 165 175 87 151 45 127 127 145 129 246 171 137 114 99 118 35
588 35 20 94 82 85 90 179 15 94 136 41 590 385 1459 789 927 102 233 105 86 201 278 67 123 99 156 148 76 110 200 203 248 109
431 109 55 56 192 79 115 175 96 112 111 72 67 64 241 59 202 204 117 95 152 200 138 117 77 98 117 152 50 183 134 161 203 235 183 61
263 61 74 170 240 83 58 107 141 27 96 146 99 211 188 29 92 179 52 81 173 151 155 37 167 291 180 153 146 35 134 178 123 13
106 13 139 209 55 81 75 135 235 193 218 90 186 43 120 34 120 89 41 145 112 95 150 50 21 70 66 42 133 45 115 146 140 29 55
-56 55 78 174 51 179 85 184 178 157 41 120 138 147 155 200 120 87 122 99 131 27 39 116 172 217 89 119 36 69 117 126 84 101 133 183 107
-229 107 215 134 95 202 167 19 64 89 21 143 7 66 98 98 60 149 302 286 238 97 65 183 240 237 243 31 37 163 250 156 246 166
-386 166 207 128 184 124 139 129 129 76 69 155 161 27 280 225 131 48 34 123 126 74 78 38 144 114 56 44
-514D4
##PAGE=	F1=1548.16
##FIRST=	4521.1594499999982872,	4521.1594499999982872,	0.08093191683292388916
##DATA TABLE=	(F2++(Y..Y)), PROFILE
4521 43 118 47 77 207 184 98 71 177 163 113 75 52 164 113 98 117 200 242 139 36 133 152 54 116 117 103 75 147 177 78 68 121 105
4359 105 85 122 14 65 133 183 159 76 45 85 62 43 116 84 99 132 189 109 81 88 83 137 131 201 74 74 65 146 104 96 56 128 174 164 88 37 97
4177 97 72 149 174 186 137 22 108 176 108 139 77 158 146 77 55 68 109 163 151 104 104 112 94 146 211 262 126 15 137 235 48 153 104
4014 104 184 80 127 229 140 222 131 31 123 262 232 114 70 77 33 106 91 141 165 89 210 108 90 136 117 75 157 121 9 92 128
3862 128 331 279 92 14 31 50 81 127 195 221 114 100 92 125 221 154 250 320 171 129 51 71 48 86 119 93 53 113 198 197 210 57 80
3699 80 149 140 129 95 160 151 282 212 85 122 141 26 68 39 110 53 51 44 87 74 21 107 69 125 85 137 163 36 139 191 162 68 46 39 199
3527 199 221 201 44 73 84 161 136 90 238 92 200 88 98 69 131 195 90 77 266 124 76 177 225 311 103 84 223 303 107
3384 107 22 54 83 101 33 96 164 234 80 34 27 90 94 91 88 168 92 58 128 146 172 155 151 28 197 146 54 43 19 99 31 232 197 189 205 193
3207 193 117 133 246 84 51 134 32 238 201 234 136 125 239 63 48 110 119 155 211 42 323 87 97 313 631 363 117 144 223
3064 223 369 80 152 305 303 376 484 645 432 224 415 1855 6476 23358 19072 6303 1937 943 349 335 260 82 76
2951 76 24 90 105 144 81 210 111 161 47 196 178 90 128 85 188 189 98 123 169 241 54 14 115 171 92 155 109 133 131 95 40 163 161
2789 161 158 180 79 126 211 196 133 148 88 133 168 59 156 210 251 181 68 137 47 44 63 90 142 189 143 36 245 242 166 78 202 95 151
2626 151 262 31 197 98 61 178 48 152 130 72 303 232 53 53 54 140 149 233 45 132 85 50 49 108 193 114 61 145 151 160 240 225 160
2464 160 191 122 60 77 70 174 298 158 99 91 137 216 159 84 205 67 214 255 66 234 74 139 149 122 58 96 122 59 210 159 92
2311 92 95 230 147 9 172 263 161 81 95 179 233 212 92 114 162 230 108 175 8 82 37 52 87 126 281 184 74 91 159 87 118
2159 118 87 51 192 153 139 200 165 239 224 78 163 142 31 14 220 149 28 185 212 143 129 116 63 109 215 134 180 211 98 57 66
2006 66 43 103 90 65 130 228 256 547 460 181 161 168 88 66 80 144 101 144 103 80 143 85 218 56 69 65 184 213 65 106 228 196 223
1843 223 206 115 95 157 42 141 128 18 299 120 89 147 246 247 75 222 114 131 65 116 73 149 148 162 154 149 126 86 310 104 581 644
1686 644 774 169 172 282 38 61 82 13 125 107 43 42 115 157 134 154 120 105 112 178 169 61 143 141 40 50 61 200 297 206 40 89 206
1524 206 146 101 86 41 108 92 88 236 190 163 159 194 157 57 78 32 104 291 302 142 216 140 95 79 123 259 266 140 105 70 24 159 130
1361 130 35 443 369 131 187 75 123 196 143 82 161 165 182 127 84 72 63 146 211 185 74 28 65 148 170 102 38 88 65 152 65 25 51 85
1194 85 94 287 153 115 154 106 185 136 271 166 16 36 39 45 22 136 151 109 207 155 69 101 145 64 77 97 270 283 115 135 107 233
1036 233 176 116 41 38 46 139 303 229 173 67 207 116 120 142 37 105 50 99 174 180 42 151 140 214 38 129 103 85 56 46 35 86 53
874 53 122 164 47 189 246 63 65 125 185 76 304 247 161 149 227 183 151 143 123 82 8 64 105 162 151 230 150 135 77 78 65 131 214 34
706 34 109 162 287 255 214 73 38 151 129 142 34 93 42 117 134 174 147 272 145 96 71 141 184 97 29 96 60 57 93 177 18 75 110
544 110 56 494 465 1393 811 844 74 200 52 80 167 263 55 143 119 152 142 68 131 161 199 249 84 33 58 205 120 100 197 98 129
391 129 157 98 89 36 167 18 212 244 132 58 175 209 128 110 63 79 122 150 29 148 118 176 205 251 223 32 116 152 241 85 74
239 74 155 162 7 75 162 114 168 159 44 91 185 61 100 182 181 158 61 186 276 153 203 144 56 121 193 139 19 143 187 41 44 51 90 218
71 218 235 219 96 181 12 137 31 153 128 51 182 124 98 127 42 58 73 100 35 140 15 78 117 121 37 88 54 181 73 153 77
-81 77 150 151 199 73 136 137 159 152 166 109 86 153 93 122 5 65 147 186 211 111 150 68 53 94 122 74 128 117 148 115 164 119 78 166 144 30
-258 30 31 35 71 166 73 89 132 83 91 96 290 244 218 100 43 203 241 199 241 54 60 129 239 161 218 173 199 115 202 146 130 135 99 87 74 122
-435 122 142 22 300 274 177 69 51 108 105 80 88 43 149 77 23 65
-514F5
##PAGE=	F1=1538.31
##FIRST=	4521.1594499999982872,	4521.1594499999982872,	0.058728039264678955078
##DATA TABLE=	(F2++(Y..Y)), PROFILE
4521 13 93 5 48 184 188 101 86 182 187 161 132 49 172 119 121 97 154 282 121 44 132 149 41 105 111 126 93 135 204 94 75 167 146 59
4354 59 134 21 65 125 219 183 67 54 80 118 29 52 93 104 139 175 105 91 72 56 132 158 207 82 49 65 107 154 85 38 88 158 180 97
4186 97 48 160 58 143 173 193 152 13 120 148 111 126 121 188 135 21 59 84 105 153 160 94 125 84 64 153 198 263 149 30 122 240
4029 240 21 188 61 135 63 124 221 155 218 127 41 130 259 217 121 66 53 32 98 87 111 140 66 194 98 115 170 135 70 100 69 32
3871 32 70 83 294 261 136 65 69 93 71 77 183 186 141 120 58 146 188 129 209 304 193 119 68 41 30 86 114 88 68 128 251 171 203 74
3704 74 80 90 105 110 67 194 138 326 185 76 124 162 7 89 31 116 92 71 23 92 40 16 99 78 107 65 135 124 14 124 174 137 54
3542 54 51 20 203 269 239 10 43 73 155 143 54 216 72 138 113 112 74 110 186 57 70 243 134 52 156 203 326 132 79 250 279
3389 279 67 22 64 97 54 21 78 158 253 85 18 44 50 86 59 115 177 86 47 118 161 194 155 133 16 190 162 4 22 20 98 32 208
3227 208 205 188 169 183 111 154 228 47 35 173 38 219 196 231 184 148 243 149 60 134 117 142 183 45 299 148 79 236 463 297
3079 297 153 145 205 334 132 104 273 281 322 404 732 578 664 689 818 3235 12539 13935 3986 1232 595 265 249 183 69 42
2951 42 15 133 45 110 113 187 142 106 64 228 196 37 100 63 140 186 114 150 208 238 85 51 112 128 63 121 76 116 151 119 54 199 175
2789 175 135 196 63 124 204 186 156 135 102 101 162 50 171 238 279 212 107 104 65 51 55 83 155 195 139 35 245 254 145 48 181 102 123
2626 123 253 19 156 67 77 144 34 175 106 77 277 195 37 60 43 172 186 226 80 93 79 58 88 141 221 151 71 155 178 210
2478 210 268 231 160 182 159 35 101 6 124 312 176 115 86 153 205 138 55 188 105 171 222 92 256 114 127 181 153 76 93 126 37
2326 37 255 196 81 68 208 159 14 177 211 120 105 120 225 254 179 85 116 151 204 127 155 36 64 72 90 85 125 283 197 77 78 138
2168 138 102 125 92 110 226 152 133 173 144 223 212 56 191 155 54 39 248 152 47 163 199 110 137 108 90 152 212 64 164 247
2021 247 125 69 60 47 103 81 54 122 261 324 520 376 138 218 234 52 40 73 110 126 187 91 134 187 74 157 81 77 84 158 182 69
1863 69 107 206 191 213 160 123 100 102 56 145 115 56 283 154 42 129 237 216 111 248 170 156 41 103 29 133 161 145 164 186 180 78
1706 78 275 71 547 623 693 264 273 296 26 117 65 21 129 80 68 49 147 202 145 158 120 95 133 155 155 49 138 153 68 88 41 230
1548 230 265 190 12 105 231 140 95 84 36 109 81 94 257 195 120 149 173 94 72 82 59 93 281 335 145 175 86 57 65 97 240 269
1391 269 136 104 88 53 141 166 15 627 515 141 206 78 139 192 126 76 101 140 220 115 108 84 91 156 191 145 48 48 72 146 170 111 75
1228 75 69 96 153 83 25 23 92 77 269 137 110 141 79 149 124 260 132 23 29 39 48 28 90 146 116 209 137 97 132 137 89 70 115 257 278
1056 278 151 161 152 242 175 87 14 18 75 122 304 196 177 64 185 104 138 127 35 110 92 50 156 149 42 145 117 221 32 95 130
903 130 160 72 80 42 78 40 142 207 34 190 231 74 50 134 201 103 312 217 186 155 185 182 141 125 133 89 22 83 110 129 125 210 138 131 67
731 67 32 109 120 168 34 129 174 284 230 232 117 37 179 78 87 29 49 46 101 141 191 147 269 121 53 45 166 232 143 39 92 37 24
569 24 106 159 23 64 76 101 425 519 1254 776 713 44 173 28 94 151 247 47 156 127 142 124 89 171 149 211 237 54 29 69 203
416 203 166 81 206 106 133 186 107 105 33 91 48 220 283 167 31 200 214 117 103 72 56 132 139 39 116 96 183 201 240 238 14 156
259 156 131 239 95 102 198 164 37 48 170 125 109 126 61 89 167 81 104 177 188 160 119 209 234 118 241 139 81 110 199 157 61 140
101 140 145 48 8 27 46 199 267 206 109 168 67 166 36 176 157 49 200 131 91 110 47 97 72 124 56 164 71 48 87 93 61 113 30
-61 30 190 97 122 90 128 152 244 113 139 129 148 148 125 89 92 187 86 115 22 83 163 195 183 143 189 109 58 88 122 82 162 101 93 113 114 101
-239 101 59 114 112 50 40 28 138 167 142 105 172 66 120 63 258 183 209 104 79 219 228 151 227 82 91 92 211 166 170 167 184 121 198 169
-406 169 125 129 88 112 84 84 125 21 285 305 206 100 50 79 111 66 91 70 136 41 23 87
-514H7
##PAGE=	F1=1528.47
##FIRST=	4521.1594499999982872,	4521.1594499999982872,	0.051738794893026351929
##DATA TABLE=	(F2++(Y..Y)), PROFILE
4521 33 56 54 40 136 199 83 127 165 200 199 185 92 165 142 158 96 99 293 138 101 159 127 17 90 108 136 109 95 228 108 127 217 185 43
4354 43 125 58 54 89 252 182 50 56 68 174 85 39 103 106 152 147 106 97 105 18 116 171 216 74 11 58 80 183 107 36 80 141 200 100 83
4182 83 218 73 118 155 193 170 15 125 131 109 128 165 213 144 59 45 88 87 152 174 76 122 43 55 144 181 248 157 64 83 239 77 206
4019 206 70 92 63 125 200 155 215 134 52 132 246 185 140 69 79 94 94 80 72 112 41 154 76 138 195 152 61 38 25 94 127 112 247 237
3852 237 170 116 100 120 57 24 158 140 172 135 50 162 149 82 174 268 216 105 92 33 49 101 107 91 78 143 299 140 187 85 69 33
3694 33 76 108 38 221 115 351 151 57 124 162 11 117 57 116 128 84 49 104 24 57 97 81 76 70 140 70 26 106 134 118 45 48 23 189
3527 189 290 252 31 40 63 137 139 50 193 43 76 130 121 69 102 181 31 64 207 155 51 140 153 328 141 83 275 232 25 20 70
3374 70 116 51 8 58 148 261 106 23 72 72 85 45 133 201 84 37 99 159 213 135 125 43 153 177 39 37 14 116 36 178 193 194 125
3212 125 168 113 185 200 31 63 198 32 203 194 217 225 157 277 242 116 147 129 105 210 87 242 220 73 150 281 265 183 144 145 348
3059 348 125 118 214 128 151 243 945 985 1545 2118 2602 6184 24382 16766 2011 566 240 344 121 122 65 187 115 74 142
2936 142 27 200 114 204 88 84 262 184 2 76 47 95 155 135 162 230 199 106 96 142 85 45 72 86 93 150 145 65 191 182 91 218 42
2774 42 111 212 165 190 113 94 79 145 35 180 256 298 235 159 76 88 63 42 83 176 184 138 36 244 247 118 46 154 118 105 238 48
2616 48 122 68 85 112 37 181 75 84 220 154 11 64 36 195 210 216 109 58 91 75 117 167 247 182 77 171 196 272 285 234 139 173 195
2454 195 22 115 64 63 298 179 125 91 152 199 106 37 154 152 140 185 134 271 165 114 202 182 96 82 116 31 275 211 79 44 170
2301 170 164 16 171 149 107 134 153 252 269 138 83 124 139 191 139 128 68 56 112 123 88 128 270 195 71 54 124 131 139 128 167 251 131
2139 131 122 129 116 189 189 27 208 160 71 69 255 124 71 144 175 61 138 104 101 181 215 34 132 270 145 112 58 49 103 69 59 125 280
1976 280 388 509 275 96 257 274 39 46 76 83 160 228 87 174 229 65 81 119 85 88 125 133 64 127 169 174 212 104 133 124 56 72 142
1814 142 110 108 263 184 48 103 223 175 155 251 212 183 51 91 53 143 172 129 159 222 226 65 231 58 502 577 579 344 363 308 60
1661 60 171 70 42 137 34 71 62 157 245 148 155 116 93 156 119 148 57 134 165 102 145 36 243 214 185 31 126 251 124 99 91 33 123
1499 123 68 117 254 170 68 135 139 33 87 78 76 77 249 348 137 116 33 21 74 66 200 255 124 104 90 87 116 188 19 775 649 156
1341 156 243 101 167 199 103 72 29 116 245 92 135 81 110 161 172 110 27 90 68 142 168 111 109 48 111 157 92 20 33 94 53 239 119
1179 119 117 131 66 116 113 237 91 55 26 30 53 29 35 134 119 212 106 127 151 129 104 70 121 222 250 166 166 204 258 180 52 18 10 101 85
1007 85 289 160 177 94 175 93 153 115 26 118 110 12 141 118 44 129 92 211 40 71 167 234 83 107 43 94 32 156 234 15 173
854 173 197 80 35 128 206 123 296 188 207 152 130 175 125 94 135 105 44 81 101 91 107 188 128 126 68 52 148 117 130 64 141 175 272 194
687 194 238 153 77 204 102 16 66 33 40 79 148 192 130 248 133 20 50 175 254 165 42 85 28 7 128 126 27 62 62 154 405 528
529 528 1053 678 546 30 156 77 98 158 238 49 167 121 133 96 130 213 165 229 213 27 38 72 182 209 64 208 122 121 190 95
382 95 108 56 41 74 230 309 202 33 225 215 109 94 98 37 139 122 62 110 86 178 188 204 227 22 191 114 239 117 132 232 156
229 156 63 21 171 127 41 96 78 86 125 96 88 160 172 167 188 229 181 85 263 142 108 105 192 178 112 130 89 82 22 48 10 180 286 187 114
57 114 152 117 197 70 183 174 34 196 133 72 103 53 119 76 132 85 184 133 46 76 82 90 123 6 196 113 96 116 124 168 279 156 124 117
-111 117 116 142 86 71 115 219 85 103 50 86 160 198 132 190 225 149 80 112 115 95 200 98 36 97 72 94 70 59 71 57 102 83 204
-273 204 145 190 119 204 77 147 54 212 104 210 95 136 220 219 102 212 110 129 62 167 172 120 144 164 146 166 195 125 111 95 150
-426 150 94 57 111 32 231 321 207 149 24 62 135 29 81 110 105 23 70 98
-514I8
##PAGE=	F1=1518.62
##FIRST=	4521.1594499999982872,	4521.1594499999982872,	0.087137632071971893311
##DATA TABLE=	(F2++(Y..Y)), PROFILE
4521 86 53 126 73 70 224 37 185 131 212 228 231 155 137 200 201 107 58 283 178 156 206 94 27 95 121 134 117 25 249 124 195 250 216
4359 216 28 90 99 36 49 280 157 66 55 65 226 125 130 110 100 175 102 116 91 147 60 97 170 231 57 38 48 78 183 132 57 109
4201 109 124 222 100 121 264 100 78 125 187 195 28 119 146 100 135 196 229 154 135 33 83 65 154 198 58 94 16 82 125 166 222 156
4044 156 97 20 233 139 198 117 65 88 135 170 143 211 150 65 130 225 138 157 80 111 162 88 85 27 82 30 108 45 155 208 166 71 53 23
3876 23 169 206 182 192 220 183 160 120 130 62 18 124 88 195 143 93 171 111 19 160 221 242 96 116 57 82 121 104 94 82 159 332
3719 332 97 162 93 51 38 68 121 38 239 93 355 111 32 128 139 21 151 90 108 154 88 97 117 22 96 109 91 36 108 157 31
3566 31 80 89 77 109 45 43 45 162 284 239 54 73 54 113 131 98 176 9 22 135 128 53 117 187 48 60 176 172 82 130 89 316 133
3404 133 88 290 164 22 15 71 116 66 37 36 131 259 148 48 112 108 104 75 138 238 83 25 92 138 231 104 125 51 85 194 64
3251 64 81 31 134 43 147 161 207 77 152 127 227 180 79 129 210 9 196 196 191 263 146 305 335 203 168 137 78 289 156 181
3104 181 304 111 105 165 285 178 123 37 424 18 343 356 199 359 503 1361 1632 2656 3944 5913 15780 82267 67851
2990 67851 11183 3072 1269 808 371 425 329 508 366 124 405 246 360 26 316 161 144 282 166 9 116 45 72
2877 72 112 186 178 238 154 109 156 192 100 48 40 95 73 120 168 74 135 185 27 250 31 91 239 130 229 86 64 75 142 59 182 261 310
2715 310 246 220 57 107 75 33 83 206 153 141 40 245 227 113 59 145 140 101 216 109 120 101 72 85 56 169 68 94 142 118 21
2562 21 71 38 212 216 202 127 53 127 86 138 181 264 203 75 190 203 335 281 235 97 167 228 19 115 117 31 256 168 132 109 134 200 65
2400 65 31 109 189 128 153 183 275 210 110 204 204 119 66 106 29 270 201 86 32 123 169 13 156 85 124 160 187 253 274 95 80 133 125
2237 125 200 136 112 94 50 144 148 89 127 246 175 58 24 125 170 157 162 211 266 91 100 77 99 142 161 28 217 155 79 100 244 69
2080 69 93 128 146 8 131 103 99 185 207 78 84 280 152 165 62 50 103 54 66 138 283 445 541 193 66 270 282 47 74 90
1932 90 71 197 260 101 194 259 54 8 167 89 75 88 78 51 156 125 146 219 44 144 157 81 91 131 110 155 243 208 87 76 207
1779 207 130 197 230 235 204 85 84 93 171 174 114 137 254 248 48 197 65 444 506 433 400 435 312 100 214 92 68 147 40 51 74 145
1622 145 274 141 145 106 97 180 102 156 87 134 185 138 209 44 235 152 194 51 145 259 98 111 105 46 145 49 149 227 116 19 123
1469 123 106 51 96 69 81 61 197 340 118 45 23 12 106 39 146 227 110 105 77 113 92 197 25 868 752 171 295 154 206
1327 206 214 76 70 49 99 255 68 159 60 112 161 156 106 44 129 56 139 167 109 132 31 105 159 97 9 48 92 28 204 98 134 122 93
1164 93 114 104 201 49 87 29 18 65 18 19 114 116 214 71 145 158 120 112 77 117 167 200 160 152 254 279 194 17 39 22 120 32 258 125
997 125 172 125 182 89 160 111 12 127 106 68 133 91 41 105 70 187 47 73 197 290 81 121 37 129 25 165 241 14 145 148 88
844 88 36 112 196 133 257 159 225 140 69 168 99 54 131 132 70 59 81 53 107 172 122 126 75 104 174 119 103 99 144 168 250 157 231 175 112 221
667 221 187 73 91 38 21 53 156 179 98 232 185 49 63 169 249 161 38 78 45 29 157 83 25 70 94 202 413 511 820 529
519 529 366 39 146 131 81 172 237 55 180 103 133 64 172 236 188 242 181 39 54 66 143 244 53 209 142 95 165 65 98 89
372 89 68 79 242 316 230 48 252 213 102 78 129 28 136 100 78 139 101 161 169 158 196 35 215 103 242 149 156 250 146 84 16
219 16 164 118 30 82 98 84 65 98 52 138 135 179 255 238 137 63 266 160 131 106 171 199 168 116 29 118 39 109 11 160 290 173 108
57 108 139 163 223 122 174 180 30 171 127 41 109 58 119 92 120 115 188 195 62 97 108 122 116 18 195 115 87 142 126 184 297 195 96 104 78
-116 78 135 59 64 149 246 106 89 76 71 137 194 65 253 248 185 106 153 92 98 236 103 68 64 44 116 120 24 27 55 177 123 258 103 212
-283 212 132 214 124 172 53 160 15 223 69 194 200 233 64 213 133 168 55 110 186 118 108 144 189 102 227 134 97 108 203 108
-431 108 81 109 60 142 324 178 218 47 98 171 46 89 168 81 76 133 107
-514A07
##PAGE=	F1=1508.78
##FIRST=	4521.1594499999982872,	4521.1594499999982872,	0.15216264128684997559
##DATA TABLE=	(F2++(Y..Y)), PROFILE
4521 144 122 210 130 58 260 52 250 121 233 267 273 226 89 287 246 117 90 268 222 210 263 87 77 140 157 127 125 73 266 141
4373 141 266 263 235 21 35 138 39 85 302 111 137 63 96 267 140 225 109 87 206 43 131 72 177 142 96 155 249 62 99
4231 99 40 108 158 146 89 145 110 240 105 163 289 122 42 105 178 226 50 105 185 80 135 210 232 151 211 65 75 90 151 233 48
4078 48 45 51 124 111 153 190 151 129 61 223 192 160 156 47 123 156 134 134 202 170 86 122 199 83 161 102 138 220 69 110 29 55 47 102 20 162
3901 162 206 173 100 114 57 246 275 252 137 225 172 194 127 125 97 42 87 47 203 143 150 175 81 77 174 169 279 103 139 77 113 136 111 96
3734 96 86 170 342 41 131 100 53 85 78 132 55 248 86 339 69 12 139 98 40 187 118 99 169 83 144 126 23 127 132 121 25
3581 25 149 185 72 142 75 8 113 55 50 68 126 256 202 71 110 47 102 133 156 169 57 30 134 143 46 150 198 72 57 175 169 128
3424 128 128 94 294 117 103 292 82 61 8 68 92 65 78 34 106 251 209 90 163 132 136 124 128 280 85 27 115 99 251 90 134
3271 134 58 17 215 80 128 69 154 52 123 112 222 50 149 157 279 194 162 230 216 63 203 206 153 297 125 303 422 309 228
3128 228 155 172 394 255 196 405 197 155 122 317 151 103 129 558 226 676 719 653 907 1124 1956 2432 3865 5936 9736
3005 9736 27393 161959 141509 23366 6475 2719 1518 888 934 739 974 737 451 764 561 590 217 476 267
2912 267 245 288 176 26 212 93 125 131 274 238 259 203 108 245 251 168 72 101 84 58 65 186 86 58 192 77 295 59 87 287
2764 287 80 267 66 18 82 168 117 183 251 318 246 286 87 119 93 52 75 245 104 149 50 248 207 153 59 175 166 115 186 189 150 145
2606 145 40 63 83 142 104 108 68 90 60 93 57 222 205 186 133 78 175 85 152 187 272 213 73 211 196 390 255 233 40 162 260
2454 260 31 103 155 90 192 146 143 135 104 208 21 39 64 213 125 129 232 269 241 114 188 221 144 48 112 18 247 170 97 41 75 177
2296 177 31 134 31 147 178 215 230 270 57 73 137 117 222 116 127 114 42 165 162 87 115 219 144 46 38 147 210 174 180 235 269
2144 269 43 68 26 102 91 135 61 217 137 73 130 223 9 113 113 120 55 116 102 86 163 180 109 38 279 145 210 74 54 102 37 67
1986 67 147 272 494 632 178 65 259 260 51 101 107 68 233 276 125 190 265 43 84 218 102 68 52 57 35 184 87 109 230 17
1839 17 154 191 138 109 113 115 195 226 220 114 68 194 87 231 189 237 215 115 84 118 195 161 101 99 279 241 31 192 90 372 416 263
1681 263 432 486 306 136 240 122 89 157 116 15 78 113 283 124 125 91 99 202 135 180 127 136 215 169 269 50 207 87 217
1538 217 65 156 249 64 128 125 75 168 26 178 180 57 28 116 108 107 97 61 75 48 131 315 92 37 56 39 144 22 94 189 105 104 55
1376 55 128 83 199 34 896 810 180 351 226 254 227 46 67 126 96 249 60 174 26 95 156 146 141 70 167 47 138 172 112 144
1228 144 24 81 154 103 5 50 86 29 172 73 158 108 136 151 94 153 21 115 39 21 84 19 66 89 108 217 49 145 153 107 117 89 107
1066 107 101 139 138 125 290 295 213 15 49 28 125 31 214 90 161 143 204 94 158 119 11 136 81 127 134 69 42 80 55 157 59 91 209
903 209 320 64 120 32 169 19 175 229 38 120 94 96 49 91 173 134 197 130 243 127 13 169 70 22 127 169 101 30 61 27
756 27 124 178 119 129 86 146 183 119 88 126 141 155 220 132 211 181 142 228 268 159 101 46 7 46 163 156 57 241 245 94 74 152 227 139 33
583 33 73 73 40 188 34 17 83 142 233 414 526 617 356 217 47 138 179 43 182 241 55 196 78 146 34 207 230 200 244
441 244 147 77 78 55 87 269 52 211 161 57 111 25 79 129 108 67 249 301 249 56 277 207 94 55 160 26 120 74 83 179 132
288 132 138 156 131 156 45 228 101 244 185 173 247 141 102 36 158 97 99 95 122 83 20 87 47 122 87 197 309 236 131 52 248 194
131 194 146 111 137 215 222 101 35 143 46 181 18 141 279 173 92 131 206 235 183 152 179 66 136 112 4 124 64 95 119 93 146
-22 146 174 253 73 130 155 154 97 39 191 98 99 163 123 197 292 225 84 88 81 129 51 75 181 264 154 87 94 38 109 185 14 326 251 214
-189 214 130 192 52 87 265 103 133 25 44 159 183 38 37 72 256 141 293 57 206 147 197 187 193 58 114 83 250 28 248
-332 248 161 276 43 238 147 202 73 45 220 177 81 130 248 12 265 150 121 127 266 128 143 130 102 30 321 137 301 134
-470 134 162 227 128 149 244 116 153 212 135
-514A35
##PAGE=	F1=1498.93
##FIRST=	4521.1594499999982872,	4521.1594499999982872,	0.17780083417892456055
##DATA TABLE=	(F2++(Y..Y)), PROFILE
4521 202 211 298 196 153 295 155 314 185 269 329 312 297 39 384 283 131 154 271 259 268 320 139 135 212 211 126 143 183 279 155 333
4369 333 267 238 53 32 168 82 156 315 56 234 86 145 292 130 310 100 74 236 28 147 42 189 232 127 133 269 102
4236 102 164 33 157 112 145 122 175 106 246 125 210 292 142 64 132 168 255 74 82 229 51 123 208 222 137 281 115 69 164 139
4088 139 270 52 20 79 166 115 141 157 149 156 151 214 229 92 173 22 154 183 97 145 186 189 117 106 169 48 148 135 165 259 38 148
3930 148 84 33 74 143 44 155 187 175 127 166 91 311 318 311 100 252 136 221 121 119 145 45 59 56 194 141 203 178 73 171 206 120
3773 120 326 126 160 82 136 139 125 104 92 172 328 44 107 109 90 127 89 130 66 244 104 305 46 35 161 65 70 220 137 107 172
3620 172 70 182 128 42 143 162 164 69 178 225 119 204 67 61 128 77 72 86 86 214 147 93 142 40 130 153 207 171 119 60 135 174 74
3458 74 183 206 85 57 206 142 173 134 189 264 117 134 277 5 99 9 67 53 49 122 71 84 242 287 142 217 146 167 180 104 318
3305 318 90 57 163 69 272 130 150 101 122 240 105 169 116 186 61 113 60 242 88 171 209 337 245 265 358 224 147 220 229 117
3158 117 328 124 266 498 419 330 210 332 507 381 303 525 309 249 95 344 174 166 325 736 549 1065 1173 1203 1557 1862
3030 1862 2637 3265 5007 7812 13494 39176 253787 228557 36983 10308 4389 2378 1540 1565 1252 1536 1188 884
2941 884 1176 927 864 453 665 375 366 283 231 80 326 174 235 233 380 354 321 342 140 359 312 240 116 183 65 47 43 203 104
2798 104 143 217 182 348 109 124 351 20 299 84 56 91 208 186 185 229 325 242 353 158 124 124 88 60 283 45 157 64 255
2656 255 194 212 44 231 194 144 148 276 191 191 37 46 113 105 155 122 86 69 100 133 88 228 182 167 131 108 223 79 163 191 269 215 86
2493 86 236 176 433 207 227 43 153 287 54 84 177 148 127 116 159 160 78 220 30 69 50 228 121 114 278 252 254 114 156 235
2346 235 169 34 135 11 219 124 105 64 37 191 67 107 35 154 183 238 191 262 26 64 139 128 239 79 163 130 29 176 166
2203 166 81 89 200 110 46 80 182 244 187 178 234 259 64 48 19 110 60 112 97 212 111 55 153 200 89 130 97 100 101 95 101 71 126 136 118
2031 118 63 275 122 236 94 64 102 22 64 143 251 540 765 219 79 230 217 57 123 122 57 262 274 145 166 244 46 153
1893 153 262 134 107 49 95 45 206 74 70 236 68 161 218 188 124 99 122 224 212 221 121 89 188 54 251 133 225 212 131 90
1745 90 124 200 133 89 58 293 211 16 215 132 299 323 83 450 519 291 166 246 154 99 164 187 38 71 69 271 103 98 74 92 219
1592 219 183 215 168 139 251 189 318 48 167 27 249 78 156 217 28 145 146 107 183 34 198 124 96 51 112 144 151 91 56 62 36
1440 36 59 277 63 104 78 60 179 17 87 149 109 99 30 131 97 205 57 861 820 180 400 301 298 231 18 60 194 107 229
1297 229 79 177 17 64 145 142 188 83 207 53 136 185 122 148 27 43 141 113 21 46 79 54 156 48 183 85 172 198 83 95
1149 95 41 135 59 43 107 60 98 72 92 220 60 129 140 87 125 100 100 36 87 108 94 306 298 229 44 49 22 113 94 163 61 142 144 235 107
977 107 148 139 34 143 43 182 144 53 60 60 46 128 80 108 198 325 45 103 46 202 16 190 205 62 109 52 101 60 72 140 126 125
820 125 102 265 121 48 180 54 43 128 212 136 57 76 55 146 206 111 125 105 171 173 113 84 143 133 142 182 129 176 170 174 220 323 236 99
652 99 69 42 81 165 129 13 269 292 136 84 129 200 107 40 69 111 41 218 13 18 96 182 238 405 615 551 203 196 44 129 218 30
495 30 187 244 42 213 52 170 13 227 191 193 237 120 117 104 50 22 280 55 212 173 42 40 39 59 176 133 55 245 265 261 54
342 54 297 196 85 35 186 27 88 47 76 215 168 123 167 144 123 51 232 110 241 217 181 220 142 121 52 162 70 161 120 146 87
190 87 79 65 109 126 40 220 338 223 160 46 215 234 150 116 103 223 268 87 75 152 53 251 10 126 255 190 79 128 245 232
42 232 245 123 174 110 111 89 40 141 75 52 149 67 176 148 300 77 160 203 182 75 53 188 65 118 182 110 213 268 244 129 66
-111 66 129 122 55 105 201 269 217 105 99 38 116 169 81 402 231 238 147 219 4 63 288 92 185 69 66 205 244 47 85 120 330 135
-268 135 306 60 182 161 154 250 208 80 98 172 293 29 294 108 336 40 277 157 224 98 32 274 251 114 133 311 93
-401 93 305 180 182 157 332 153 213 174 152 92 316 135 389 238 228 302 219 241 326 193 241 299 188
-514A88
##PAGE=	F1=1489.09
##FIRST=	4521.1594499999982872,	4521.1594499999982872,	0.12788771092891693115
##DATA TABLE=	(F2++(Y..Y)), PROFILE
4521 253 299 378 260 260 321 268 365 290 309 412 349 358 57 472 308 159 212 297 280 329 368 208 192 287 269 136 173 291 285 162 391
4369 391 277 224 101 99 186 135 219 319 52 337 117 193 300 102 375 85 75 254 96 158 21 184 319 178 110 284 152
4236 152 228 32 216 57 129 147 197 109 237 155 258 275 161 114 195 160 272 96 55 264 27 103 198 200 115 338 161 68 251
4093 251 115 297 70 93 88 203 132 123 129 151 175 238 207 246 28 161 22 171 207 64 175 164 203 150 81 141 78 118 171 198 271
3940 271 37 185 139 27 102 185 79 130 151 169 142 202 123 354 329 351 108 287 83 243 106 122 193 38 64 93 169 152 244
3798 244 185 88 262 239 82 377 159 177 73 148 126 140 124 97 165 295 119 108 121 135 162 94 113 68 227 133 258 75 65 191
3650 191 101 106 244 143 138 166 52 204 121 81 144 196 206 112 191 272 146 261 66 123 153 107 99 99 51 167 82 125 170 32 189 181
3492 181 243 184 179 77 147 217 114 205 207 88 64 247 96 210 143 295 229 146 177 243 86 135 19 70 51 54 162 122 89 231 373
3340 373 193 266 158 186 234 72 343 97 101 219 97 294 196 169 172 235 265 152 196 164 236 67 120 72 268 150 209 280 395
3197 395 308 369 494 236 242 246 263 110 352 171 210 555 513 452 301 510 611 516 429 652 424 340 71 369 283 295 534 928
3059 928 915 1455 1634 1768 2202 2585 3285 3998 5906 9274 16583 49229 344225 316174 50014 14022 6068 3279
2971 3279 2249 2233 1796 2113 1650 1361 1577 1291 1140 700 852 476 480 273 308 156 435 264 374 355 482 497 421 500 215
2848 215 481 367 295 175 261 80 49 130 223 127 296 258 286 400 170 179 424 44 321 134 125 96 241 254 194 200 333 242 414
2705 414 236 123 166 125 57 313 14 163 81 260 185 262 49 288 224 185 105 355 231 233 93 37 140 64 203 131 153 61 140
2562 140 179 124 230 164 148 128 135 261 88 173 195 258 212 123 264 145 458 141 214 112 140 308 80 65 188 186 105 83 178 181 76
2410 76 237 72 118 76 240 112 100 315 230 248 101 114 253 190 36 160 46 203 79 108 94 14 205 109 78 64 138 178 258
2267 258 146 255 2 55 139 159 240 35 205 144 14 181 162 74 73 194 83 60 119 220 261 199 156 208 239 134 82 49 106 76
2119 76 92 127 205 85 30 162 185 168 144 80 90 129 68 95 67 96 87 119 118 276 88 235 123 81 107 18 60 120 224 589 924 263
1962 263 90 190 177 81 148 130 36 280 252 154 133 200 62 201 291 174 175 87 139 77 217 97 57 232 107 159 236 219 131 101
1814 101 129 245 196 208 106 121 190 35 256 73 205 199 128 99 113 184 93 78 55 295 174 6 244 186 243 243 95 475 541 274
1666 274 189 232 183 96 163 237 88 58 27 242 83 72 61 78 227 215 253 203 139 286 195 349 39 122 21 282 100 142 162 26
1519 26 158 164 131 186 72 203 84 190 59 107 181 176 80 54 46 26 17 230 37 160 85 75 208 19 129 112 116 86 11 124 122 221
1361 221 85 777 785 170 430 363 327 221 25 49 247 128 197 106 168 54 36 130 140 226 80 248 74 134 204 139 147 36 11
1218 11 122 120 34 60 71 76 165 32 202 60 192 234 74 38 67 145 84 69 129 113 111 76 71 224 84 104 121 61 137 103 102 38 94 83
1051 83 78 297 282 238 66 51 15 85 148 118 56 117 129 265 124 130 166 59 147 16 231 160 47 89 53 39 107 106 119 164 311 56
894 56 73 70 220 20 209 179 80 110 56 100 65 60 106 109 55 83 287 123 89 197 69 74 134 254 171 115 126 104 165 239 97 105 126 179
726 179 149 105 85 151 118 129 140 142 130 143 209 200 346 296 92 109 76 128 158 104 38 295 313 167 98 106 186 75 64 61 157 34 241 54
559 54 43 104 208 216 414 749 637 125 292 32 119 243 90 189 242 17 228 27 200 16 232 122 166 226 114 153 123 55
421 55 46 276 56 205 172 86 52 86 57 226 145 66 228 217 270 45 306 184 76 50 202 38 43 29 63 240 202 126 204 175 112
268 112 54 226 129 230 238 180 167 142 141 61 185 60 213 141 162 96 134 38 179 147 34 245 335 204 200 38 175 270 141 119 104
116 104 221 300 75 95 141 72 308 11 117 221 217 85 128 279 213 298 92 168 146 110 62 75 153 90 20 174 79 200 123 334
-32 334 78 179 240 203 72 59 183 19 134 201 89 235 230 251 206 44 177 116 57 149 201 257 279 135 90 102 172 148 138 468
-180 468 193 259 157 231 60 36 305 68 220 146 94 242 294 49 128 181 387 110 295 109 156 169 90 302 212 119 129 243
-317 243 347 85 328 61 393 53 313 167 229 123 90 336 310 189 156 366 198 342 223 251 197 390 179 280 225 204
-445 204 202 310 200 470 342 282 383 301 340 403 275 329 382 247
-514B47
##PAGE=	F1=1479.25
##FIRST=	4521.1594499999982872,	4521.1594499999982872,	0.027192460373044013977
##DATA TABLE=	(F2++(Y..Y)), PROFILE
4521 290 372 437 309 354 329 371 394 396 341 493 378 400 110 536 316 205 251 331 283 385 401 264 242 349 316 152 211 379 280
4378 280 157 435 300 196 152 151 190 187 259 312 107 428 148 226 290 78 409 66 99 257 159 157 50 169 390 229 95 291
4241 291 195 281 46 276 7 102 159 210 108 216 184 301 245 181 158 262 156 268 115 26 282 52 78 188 170 89 379 194
4103 194 67 330 80 302 104 163 78 228 146 97 110 155 182 310 201 242 115 122 78 172 219 55 207 143 213 180 55 116 120 85
3955 85 200 232 257 87 216 188 36 126 203 113 89 101 155 140 220 153 371 309 369 145 311 43 260 92 135 231 50 96 125 132
3807 132 181 264 197 113 340 264 56 422 191 191 57 146 99 150 155 101 154 256 188 136 137 170 190 91 86 68 197 162 203 120 93 224 172
3645 172 143 255 136 182 152 48 205 107 130 129 231 238 142 189 320 144 307 71 171 186 138 123 106 36 124 14 161 192 25
3502 25 253 203 256 207 226 85 166 257 146 206 200 97 75 279 46 232 149 382 195 190 220 191 150 167 30 76 107 94 192 175 123
3350 123 214 457 234 300 176 186 281 54 349 102 149 271 152 311 258 184 247 332 281 212 205 205 296 69 140 139 301 212 249 359
3202 359 443 358 456 618 252 330 274 302 138 365 249 174 585 576 567 403 674 691 640 528 768 521 405 65 398 422 435 728
3064 728 1096 1262 1782 2023 2253 2737 3168 3780 4504 6408 10075 18473 55827 418296 389823 60309 17022 7512
2976 7512 4090 2918 2834 2286 2608 2046 1804 1897 1592 1369 919 1004 561 566 260 386 238 520 345 520 461 557 634 533 632
2853 632 307 586 414 321 242 322 130 72 223 246 154 442 303 372 441 234 226 492 105 328 193 189 98 253 313 206 172 339
2715 339 247 461 302 117 209 159 83 325 59 167 100 260 174 284 96 329 251 230 59 412 267 267 153 38 158 25 241
2582 241 131 204 78 175 220 158 227 167 129 133 162 281 126 184 198 240 205 167 292 111 460 67 192 176 126 322 103 57 195
2439 195 198 140 52 194 195 96 254 103 176 108 255 103 84 339 208 226 80 67 273 204 57 175 85 205 67 102 128 8 213
2296 213 147 50 78 97 166 276 109 248 30 53 143 197 222 42 242 153 5 183 152 66 111 198 66 79 148 249 259 213 124 161
2149 161 213 199 136 65 83 108 71 152 197 75 27 151 183 233 154 63 89 138 39 84 87 101 47 135 161 283 52 204 155 102 117 28 64
1986 64 84 196 653 1102 294 90 147 171 119 182 130 24 284 217 147 107 140 77 223 298 205 243 129 168 109 216 135 88 213 130
1839 130 145 243 229 127 121 130 259 175 185 75 148 198 28 247 23 186 177 105 114 94 150 51 70 96 285 156 4 264 241 223 190
1686 190 246 525 560 265 205 203 205 87 153 254 135 51 32 204 75 63 54 62 219 217 291 227 132 310 185 359 28 80 50 308 129
1533 129 117 93 61 167 174 144 173 111 193 89 281 62 100 200 183 66 50 32 21 74 179 17 199 82 86 228 23 169 87
1391 87 117 63 24 113 145 245 110 663 715 154 433 403 331 197 49 45 279 153 157 131 149 77 49 113 135 245 61 284 97 132
1243 132 229 160 145 49 42 102 120 43 99 60 86 195 40 210 48 197 249 75 43 82 141 108 95 148 169 105 96 44 228 102 82 103
1085 103 32 150 94 120 76 144 73 88 264 249 236 81 69 41 45 187 102 78 89 107 286 143 110 191 85 146 53 272 178 50 120
933 120 52 36 95 128 124 117 292 93 37 92 217 26 231 163 89 105 88 93 69 55 85 86 56 81 307 127 115 209 98 96 142 287 199
770 199 174 187 156 176 260 75 67 147 170 117 103 87 157 98 113 96 156 84 104 243 170 340 330 88 155 102 170 140 89 83 303 305 184 113
603 113 91 187 51 94 49 209 24 255 81 74 106 215 166 463 868 756 138 388 13 110 251 151 191 230 15 238 1
470 1 231 34 223 36 123 215 128 180 126 63 107 261 55 183 158 142 131 127 80 271 149 86 199 162 278 40 303 176 69
327 69 87 205 64 16 44 50 253 230 141 252 194 124 56 213 147 209 242 172 94 136 157 63 224 78 251 150 164 109 169 17 234
175 234 174 72 266 299 182 236 28 147 289 120 115 148 211 314 65 92 114 96 341 36 112 180 245 109 129 301 179 334
37 334 65 156 169 123 54 96 154 105 72 189 120 211 107 349 86 187 260 215 97 58 171 33 144 218 67 256 187 249 285 37
-111 37 206 109 57 196 181 229 328 162 71 175 245 123 174 513 146 278 156 226 114 25 319 40 233 223 116 262 324 69
-248 69 164 237 421 75 265 153 145 166 18 337 202 160 183 288 400 136 346 65 435 77 333 185 215 145 137 392 341 271
-386 271 187 396 287 369 271 306 235 429 200 331 270 249 284 304 284 530 429 315 451 358 425 459 340 403 447 296
-514B96
##PAGE=	F1=1469.4
##FIRST=	4521.1594499999982872,	4521.1594499999982872,	0.094214044511318206787
##DATA TABLE=	(F2++(Y..Y)), PROFILE
4521 307 417 465 334 422 318 445 398 478 352 548 393 414 149 565 304 253 266 355 266 429 412 290 277 386 344 163 244 433
4383 433 260 141 462 326 156 196 178 179 230 272 293 155 492 171 240 266 82 409 45 137 242 208 139 88 149 430 271 93
4246 93 282 225 316 72 329 34 70 153 217 97 190 203 328 211 195 187 313 153 239 131 12 280 95 55 187 138 60 400
4108 400 206 65 387 38 280 147 220 70 241 152 64 103 154 175 357 191 218 217 61 140 155 215 75 228 131 215 200 57
3970 57 98 148 77 215 255 220 137 237 227 51 145 190 147 48 51 134 126 217 178 359 263 364 176 316 75 272 90 143 253 81
3822 81 131 146 92 222 263 209 136 394 278 42 447 216 200 55 132 64 153 188 100 151 225 235 170 156 186 209 81 62 77 157 185
3670 185 147 160 117 253 238 175 250 119 223 134 74 187 94 178 99 268 253 154 177 360 114 337 79 202 220 164 140 104 46 91
3522 91 46 189 209 20 305 209 245 238 251 88 183 284 159 185 189 118 89 291 56 239 148 435 167 230 255 129 189 195 39 81
3374 81 163 139 208 218 163 187 523 258 311 202 164 311 74 335 102 191 317 196 321 301 189 307 398 280 270 190 234 350
3236 350 71 165 205 333 263 274 431 473 382 510 705 265 393 300 335 175 364 329 194 583 592 653 491 795 732 727 578 848
3099 848 581 432 79 417 547 551 877 1202 1529 1986 2272 2574 3068 3506 4028 4687 6424 10078 18828 57803 462869
2995 462869 436408 66062 18792 8491 4683 3445 3267 2636 2931 2300 2137 2078 1780 1505 1074 1092 624 603 252 444
2897 444 307 566 401 650 527 589 736 628 709 391 651 446 313 304 360 185 102 302 265 178 557 337 424 461 294 251 544
2764 544 156 316 242 237 103 239 356 213 152 340 255 485 340 108 241 188 119 317 84 171 117 250 163 271 155 344 272
2631 272 267 17 437 298 286 204 46 160 11 267 123 225 107 201 249 185 217 191 108 147 186 276 180 201 194 219 195 204 313 86
2483 86 430 20 162 223 118 329 118 60 201 183 180 37 205 200 115 271 120 231 134 271 101 68 346 192 194 75 24 289
2346 289 206 84 174 119 213 100 92 160 24 208 174 22 78 39 151 294 87 236 65 61 150 229 193 87 269 156 20 185
2208 185 140 57 182 204 49 101 163 260 238 231 93 101 192 244 184 66 43 135 48 168 185 82 61 120 192 276 157 49 94 128 39 73
2050 73 119 129 32 177 182 291 34 149 184 122 131 37 76 63 166 742 1294 317 76 109 200 159 221 121 59 273 178 126 106 78 84
1898 84 216 283 215 296 161 179 131 205 173 126 178 136 121 238 219 112 149 123 269 148 153 46 161 209 28 225 28 172 151 67
1750 67 133 76 112 37 67 135 265 165 10 271 285 231 165 362 599 578 268 216 171 215 87 135 236 172 52 61 162 86 82 55 52
1597 52 190 187 322 241 116 320 163 346 22 44 63 318 161 85 42 94 171 173 143 145 142 174 116 354 76 94 195 171 52 43 28
1445 28 29 119 129 13 221 70 99 238 33 187 76 106 28 50 106 163 271 123 540 622 134 406 411 305 162 65 57 286 180
1302 180 119 148 127 79 82 94 126 242 34 311 117 130 254 186 145 63 69 90 109 45 142 45 86 235 64 202 58 190 238 87
1154 87 91 84 126 126 115 159 222 86 117 17 234 109 75 95 6 156 72 153 93 193 75 110 209 206 223 90 96 80 15 209 123 111 73
992 73 95 292 161 93 207 113 135 91 303 192 57 150 46 38 86 138 126 77 278 129 26 107 194 33 249 161 88 86 117 90 81
839 81 52 91 69 109 95 318 123 126 208 121 105 147 305 216 226 244 208 178 259 47 13 161 144 86 115 89 167 71 90 54 164 79 60
677 60 268 135 313 336 89 197 118 199 111 87 123 286 269 181 128 87 190 37 123 34 257 28 259 92 106 101 207 101 532
534 532 934 825 210 446 10 105 241 200 190 210 47 241 29 255 56 204 61 71 203 149 195 109 66 156 238 56 142 130
396 130 191 195 155 109 303 146 95 160 109 284 51 287 176 65 124 194 98 73 76 41 257 247 151 294 187 143 57 192 157 183 226
244 226 160 29 120 164 58 270 101 274 143 151 127 181 22 262 197 109 273 233 164 260 23 144 287 89 102 203 198 308 53
101 53 70 78 116 344 65 109 134 269 138 131 307 134 347 48 137 178 129 91 101 140 119 127 190 160 205 100 347 100 184 261 216 130
-56 130 59 146 81 146 226 54 266 150 241 349 55 208 99 55 234 147 186 354 181 62 245 307 94 187 527 106 291
-189 291 149 211 155 39 327 18 228 290 128 261 332 111 190 274 428 44 222 180 152 151 50 350 174 195 236 304 437 175
-327 175 343 106 454 101 332 207 181 162 166 428 341 341 216 391 343 381 316 334 258 438 214 357 299 279 326 297 353 559 486
-470 486 321 489 381 482 483 376 451 486 320
-514C20
##PAGE=	F1=1459.56
##FIRST=	4521.1594499999982872,	4521.1594499999982872,	0.17591105401515960693
##DATA TABLE=	(F2++(Y..Y)), PROFILE
4521 301 427 458 330 452 288 475 375 521 339 558 385 399 164 555 272 287 258 354 234 451 397 284 297 390 349 161
4393 161 263 446 223 122 466 339 112 229 174 157 256 259 263 184 516 181 234 230 102 376 25 175 213 240 104 118 133 434
4255 434 298 99 257 241 328 100 367 55 38 126 220 74 169 209 333 186 196 201 336 153 185 146 32 256 136 39 192 110
4118 110 32 401 197 67 411 13 233 192 257 99 241 151 38 106 146 154 375 174 179 302 21 197 127 191 98 230 134 210
3980 210 210 98 86 155 108 216 258 170 173 245 251 66 156 152 182 73 56 106 110 191 195 323 205 337 183 296 121 276 104 135 256
3827 256 110 158 156 55 263 241 214 152 421 277 39 445 229 203 74 108 43 151 215 100 159 210 249 196 173 180 219 65 63 96
3679 96 111 199 96 189 138 271 288 197 229 97 251 117 113 151 92 217 61 301 253 146 160 381 65 351 87 216 253 177 149
3537 149 94 67 71 94 204 219 20 333 193 212 269 251 90 189 290 147 145 179 144 102 283 108 233 138 446 146 254 277 70
3394 70 200 215 45 83 203 169 208 245 194 148 558 264 294 230 125 318 106 303 98 222 352 210 318 314 181 336 423 257
3256 257 315 153 244 389 77 189 253 353 300 281 481 477 372 519 739 269 418 320 351 198 347 393 243 545 559 696 544
3123 544 852 723 759 572 872 593 413 152 407 634 613 958 1218 1669 2032 2338 2670 3141 3537 3975 4511 5944 9288
3010 9288 17586 54812 469711 447299 66237 19022 8845 4959 3748 3457 2784 3018 2363 2299 2082 1821 1520 1139
2921 1139 1099 656 581 263 462 348 565 421 743 538 569 781 687 716 445 663 461 274 350 369 231 121 352 274 195 623
2793 623 352 431 453 343 248 567 193 285 271 260 112 201 377 209 142 329 256 481 340 98 253 212 148 290 85 176 132 226
2656 226 164 224 207 330 284 287 25 423 323 287 236 56 143 34 280 109 215 132 214 262 203 199 219 84 166 201 247 235 228 179 199
2503 199 181 222 320 89 367 85 128 246 120 329 121 65 202 144 195 44 209 197 122 284 119 275 158 281 108 61 335
2370 335 185 157 105 35 293 196 111 157 142 208 141 86 186 50 189 186 14 69 35 142 313 81 215 103 71 163 248 164 123 282
2222 282 153 37 190 126 45 252 209 28 123 163 247 202 251 79 41 180 262 214 58 8 151 28 175 166 92 98 72 205 295 152
2075 152 42 103 107 78 71 150 150 26 228 178 292 50 78 203 136 147 42 86 88 136 843 1479 342 52 77 234 192 256 104 100
1927 100 249 145 97 120 31 77 185 249 200 323 176 173 137 187 203 149 133 126 90 224 195 88 176 114 277 119 117 62 155 217 33
1775 33 195 45 163 126 21 156 63 89 64 69 160 239 183 21 265 308 236 157 440 675 590 275 222 155 212 109 109 189 199 50
1627 50 79 124 107 113 55 51 140 131 342 242 90 311 140 310 23 18 61 308 188 52 93 124 173 160 129 108 158 155 133 401 103 93
1469 93 167 146 49 42 43 50 145 93 17 230 54 118 236 47 179 78 83 15 85 105 173 288 120 422 517 112 349 384 248 120 66
1317 66 79 270 204 93 161 109 63 108 73 110 221 25 325 130 130 277 218 150 78 80 91 89 48 176 25 83 272 90 177 71 178
1164 178 204 107 132 74 101 135 125 161 263 63 128 34 239 103 86 107 15 151 42 198 86 226 79 130 145 168 202 92 116
1021 116 118 41 211 159 143 80 102 282 177 84 206 146 111 121 318 200 60 178 30 47 73 133 125 79 273 149 55 114 154 44
874 44 257 168 78 52 140 102 97 52 114 73 150 114 318 112 122 186 135 106 145 302 218 267 292 254 175 234 17 49 168 103 69 139 92
711 92 184 45 58 16 166 130 30 277 104 274 313 92 228 125 210 74 97 156 247 212 159 141 91 180 27 150 27 297 53
569 53 254 83 135 91 188 56 585 935 825 359 452 29 101 214 230 182 183 72 237 63 262 78 182 145 30 188 165 195
431 195 73 65 188 216 62 85 91 222 235 168 132 313 141 83 122 63 284 74 263 183 61 153 167 132 131 106 36 252 253 148 325
278 325 158 160 60 165 154 159 194 144 100 94 159 49 312 113 279 123 123 148 177 34 257 210 140 260 151 152 273 20 163 262
131 262 55 80 249 183 284 38 38 39 121 318 95 105 86 283 161 134 291 84 335 44 106 181 120 149 101 115 127 168 176 186 180
-22 180 94 328 114 172 240 205 155 70 107 118 142 219 57 255 126 227 388 77 185 85 51 252 105 135 353 190 92 299
-160 299 344 65 178 507 84 297 137 194 173 51 328 21 208 336 127 240 316 156 211 282 405 45 172 186 159 123
-288 123 102 339 129 217 276 292 445 199 320 145 445 114 309 224 133 174 173 433 312 388 235 348 359 376 346 327 257 414
-426 414 217 352 305 289 322 286 390 549 504 297 485 365 502 472 378 466 490 313
-514C13
##PAGE=	F1=1449.71
##FIRST=	4521.1594499999982872,	4521.1594499999982872,	0.2215099632740020752
##DATA TABLE=	(F2++(Y..Y)), PROFILE
4521 275 402 417 298 443 247 457 331 516 305 518 354 359 153 508 225 294 232 326 192 446 359 251 304 357 333 145 263
4388 263 418 167 108 448 330 70 247 138 126 263 229 223 190 495 176 217 187 112 315 22 208 178 254 59 136 125 400 306
4250 306 106 214 241 312 123 385 56 15 84 221 52 158 199 311 179 181 202 328 153 110 162 53 216 171 36 197 89
4118 89 33 381 169 80 399 50 168 230 267 156 230 147 44 113 131 125 363 149 132 356 91 238 96 147 114 212 144 196 209
3975 209 148 79 144 143 205 235 116 187 243 260 81 158 101 216 138 101 76 109 142 204 271 149 292 163 257 150 268 125 108 241
3827 241 126 174 155 25 291 205 207 161 421 261 42 414 230 200 96 77 56 148 230 103 172 204 227 208 186 152 218 45 84 118
3679 118 66 201 56 201 153 272 315 204 196 82 263 104 152 105 103 241 26 327 242 118 142 380 43 348 91 216 278
3547 278 174 150 78 88 64 126 204 219 26 330 159 165 292 229 91 177 275 113 98 169 160 115 257 154 223 122 413 130 258
3404 258 282 52 183 226 45 82 220 178 193 248 212 98 551 254 248 255 89 298 126 261 94 234 378 189 302 297 162 327
3266 327 407 213 339 98 236 405 89 209 279 352 317 268 498 451 330 480 712 262 399 328 342 198 317 430 277 473
3138 473 481 688 548 839 660 730 514 829 556 354 276 360 670 607 960 1132 1661 1907 2209 2526 2946 3259 3624 4001 5044
3015 5044 7850 14972 47421 437428 420366 60817 17675 8514 4871 3782 3370 2705 2849 2218 2259 1907 1711 1404
2926 1404 1104 1022 653 503 318 423 348 519 400 783 492 501 760 697 654 459 616 457 213 371 349 261 119 366 267 199
2798 199 633 343 393 412 374 225 553 211 238 274 255 124 147 375 190 139 302 246 447 302 89 238 231 160 254 66 182 142
2661 142 186 187 153 242 289 282 285 52 374 342 266 246 69 104 55 279 95 180 141 210 258 214 175 236 57 180 203 196 279 260 154 181 162
2498 162 215 309 116 274 152 95 242 129 324 116 69 195 91 178 57 204 188 115 293 102 301 183 279 114 69 308
2370 308 184 121 145 74 279 172 132 129 150 185 174 94 201 78 156 183 41 62 103 145 330 89 182 140 79 179 252 146 141 278
2222 278 146 53 195 108 33 303 211 39 143 151 212 161 266 81 30 174 250 219 45 55 157 17 174 138 94 129 21 209
2085 209 294 138 42 113 81 125 88 167 151 13 271 150 279 71 23 207 138 162 44 85 124 108 924 1618 372 21 57 253
1947 253 218 277 83 135 213 124 69 130 25 63 135 212 160 320 171 154 126 167 219 151 83 106 60 201 164 59 197 119 281 96
1799 96 83 106 131 220 37 161 45 155 105 27 179 49 89 90 77 166 213 189 34 250 308 222 150 477 727 588 273 227 173 196
1652 196 142 78 133 218 35 85 94 128 144 48 59 75 66 350 233 61 285 133 255 24 39 53 274 208 27 160 150 175 135 104
1504 104 71 154 151 133 420 130 95 123 112 61 59 70 75 149 90 15 230 35 140 224 65 153 86 51 62 127 110 175 290 98 316 412
1346 412 91 270 324 164 80 50 98 237 223 89 170 99 52 124 54 90 191 52 325 133 132 292 251 159 91 74 101 68 61 194
1199 194 3 91 296 114 139 73 164 154 129 158 58 76 139 123 152 284 46 129 74 245 89 100 139 28 134 39 248 59 241
1056 241 82 147 89 148 175 88 119 144 64 198 191 168 101 121 254 190 83 184 181 73 141 317 201 59 207 20 58 52 113 125 106
903 106 270 151 84 113 106 62 255 173 62 28 158 123 108 61 135 98 171 127 308 99 109 144 136 101 136 278 205 293 325 291 167 188
746 188 27 114 168 51 71 163 97 201 26 19 19 166 195 52 268 86 232 266 90 244 126 203 35 117 178 192 146 118 157 96
598 96 152 20 174 44 323 87 244 57 156 80 164 98 596 884 778 566 408 42 97 171 239 167 153 84 226 97 249 93
460 93 163 209 54 165 171 180 26 59 203 200 79 16 47 231 247 166 141 296 133 52 102 44 274 97 236 197 54 171 128 161 179
308 179 129 35 240 244 133 343 125 169 67 133 144 145 154 127 184 59 144 38 341 113 265 98 90 169 171 39 218 208 162 224 80
155 80 143 271 12 185 216 35 59 278 171 247 21 33 18 106 267 125 99 44 286 176 137 252 36 300 49 67 187 95
17 95 213 123 90 126 191 149 195 141 84 294 119 157 198 182 167 92 57 136 132 195 71 219 115 208 397 92 143 67 42 244 65 81
-140 81 326 191 144 332 345 39 152 452 77 290 123 185 165 52 316 29 179 355 113 204 282 189 229 258 358 67 124
-273 124 171 151 86 130 309 69 224 293 258 418 209 276 171 408 111 267 226 78 180 160 403 267 403 241 275 334 355
-406 355 352 286 229 358 211 316 287 279 276 267 390 501 483 247 441 316 484 424 348 446 462 276
-514B76
##PAGE=	F1=1439.87
##FIRST=	4521.1594499999982872,	4521.1594499999982872,	0.23393227159976959229
##DATA TABLE=	(F2++(Y..Y)), PROFILE
4521 233 346 347 243 396 205 397 272 465 256 432 304 300 120 434 169 271 197 274 147 413 303 214 304 291 305 116 242
4388 242 358 94 109 406 294 40 249 79 94 251 192 176 177 431 159 200 145 102 238 44 230 147 251 56 140 127 336
4255 336 296 110 163 228 270 134 383 42 16 45 221 61 149 178 264 185 154 192 291 151 36 179 72 163 196 44 192 75
4118 75 65 346 129 101 354 84 110 255 250 214 211 144 67 117 116 93 328 116 85 370 153 258 74 89 119 177 150 174 204 191 76
3965 76 121 164 192 186 71 179 232 258 95 151 60 243 200 137 50 126 72 204 212 114 235 119 207 155 247 146 69 214 129 177 146 5
3807 5 298 169 186 162 400 227 49 354 220 192 109 45 79 143 230 108 177 194 174 204 191 111 208 23 105 135 31 189 31 197
3660 197 161 254 317 196 158 87 259 98 183 56 121 249 40 338 228 74 125 353 96 328 87 206 289 156 144 67 110
3527 110 67 141 196 206 37 296 111 125 297 193 92 149 244 61 65 153 157 126 219 190 216 104 342 112 241 275 89 146 227 38
3379 38 74 213 165 168 227 217 43 499 232 178 272 86 255 125 216 97 227 392 135 274 252 141 277 353 160 339 40
3246 40 212 399 107 223 281 327 316 246 479 397 263 401 627 246 339 320 306 175 280 431 279 377 371 634 501 759 550
3113 550 642 420 719 476 268 416 280 654 533 883 954 1509 1634 1911 2170 2522 2723 3030 3242 3870 6016 11451 36976
3000 36976 371782 360464 50810 15003 7559 4434 3545 3026 2417 2452 1890 2026 1580 1473 1172 978 871 612 383
2907 383 416 325 304 436 343 767 399 396 675 660 534 427 519 434 149 362 302 276 92 346 244 188 591 315 314 342 385 198 499
2764 499 209 180 249 222 136 89 351 162 139 260 222 386 231 87 196 243 151 220 50 183 145 133 221 90 255 228 266 259 67
2621 67 301 349 226 235 90 49 77 260 89 133 129 190 243 221 151 231 29 181 187 132 307 287 133 168 139 187 279 149 158 212 67 212
2464 212 136 315 109 76 177 35 133 60 191 175 96 298 81 304 208 263 113 86 270 186 88 175 107 246 135 145 97 144 144
2321 144 195 115 205 100 112 168 66 63 162 163 339 105 139 168 81 194 242 135 139 258 140 71 196 82 21 324 208 84 156 134
2173 134 165 120 272 85 72 165 214 197 31 93 156 18 168 101 86 147 46 197 277 114 46 119 55 168 117 167 130 29 298
2031 298 102 251 85 75 196 126 172 46 71 145 83 951 1672 398 17 46 246 237 281 60 157 169 107 58 130 32 55 78 185
1888 185 104 290 144 127 102 152 218 129 40 87 38 171 130 32 209 147 278 88 58 146 94 214 37 128 33 144 88 65 197 32
1740 32 97 106 87 155 189 176 45 226 287 187 136 476 729 563 253 231 215 173 172 46 106 231 25 90 76 143 167 34 73 18 20
1588 20 344 214 42 245 155 189 28 77 44 218 219 22 209 172 176 104 76 52 130 168 117 415 147 97 76 77 81 89 101 101 134 114 6
1425 6 228 20 157 202 87 123 93 16 108 173 118 169 274 63 221 316 75 183 241 61 51 21 108 194 236 100 176 92 82 133
1277 133 41 68 167 79 313 128 136 296 280 169 101 54 113 55 89 194 28 109 298 137 93 58 146 99 151 170 48 67 145 106 134
1125 134 285 43 122 115 248 72 110 182 42 107 75 293 28 238 89 162 81 144 148 79 102 148 69 173 213 183 115 138 213 198 80
972 80 141 215 30 152 298 193 54 236 54 66 28 87 128 123 259 135 105 107 70 86 242 174 45 61 171 143 102 82 145 128 173
820 173 130 290 103 94 86 126 92 121 236 180 304 341 314 156 131 63 173 163 28 83 177 105 214 20 24 42 170 252 85 243 83
667 83 190 203 83 245 127 181 28 141 189 133 86 68 179 97 108 22 193 70 333 121 233 17 170 70 139 156 558 811
529 811 714 783 320 47 92 119 230 147 124 81 211 125 213 97 150 245 90 131 166 152 24 46 202 192 104 54 26 217 234 153 135
377 135 252 127 13 112 71 251 116 211 215 51 176 85 182 212 139 43 222 222 120 352 123 164 80 101 141 141 117 109 248 31 122
224 122 26 351 110 233 79 68 186 178 39 154 192 174 173 93 130 255 11 197 161 47 55 285 159 205 18 60 42 73 205
81 205 153 93 49 276 181 135 190 22 248 53 37 199 61 272 174 83 113 195 111 187 94 82 248 112 143 138 146 164 117 9 135
-71 135 119 155 87 164 113 181 374 99 93 48 24 210 32 31 279 185 198 342 309 20 117 372 68 268 106 192 133 44 291 29
-219 29 144 346 92 160 237 204 245 205 291 90 83 144 121 47 133 265 10 219 281 210 358 210 217 180 345 90 214 208 24 182
-367 182 136 341 227 387 235 187 273 323 334 217 176 281 197 253 250 254 202 239 358 418 429 177 365 249 433 349 296 399 406 215
-514B15
##PAGE=	F1=1430.02
##FIRST=	4521.1594499999982872,	4521.1594499999982872,	0.20924226939678192139
##DATA TABLE=	(F2++(Y..Y)), PROFILE
4521 184 269 259 178 321 170 308 210 378 203 314 246 235 74 345 114 218 162 204 104 357 238 200 306 203 273 79 205
4388 205 282 12 121 342 237 34 237 17 63 221 159 126 152 335 137 190 109 77 155 69 238 132 234 111 133 138 254 271
4250 271 112 119 205 209 131 363 32 21 65 218 91 135 150 197 194 131 179 234 146 85 200 90 106 211 58 173 68 92 301 83
4103 83 122 286 107 101 261 212 256 191 144 83 112 106 70 277 84 47 344 194 258 70 25 121 132 142 144 198 218 76 94 165 184 121
3945 121 42 155 217 250 108 136 59 257 246 152 40 150 14 195 158 107 173 76 160 137 213 159 52 179 122 170 130 20 281
3803 281 146 157 159 366 178 61 274 201 184 110 23 93 134 213 110 164 172 100 189 187 70 190 9 116 141 32 166 19 180
3660 180 159 219 297 173 127 107 244 97 202 11 136 243 76 329 219 23 115 306 152 294 74 186 281 129 131 79 130
3527 130 78 140 186 180 53 238 60 127 282 153 93 110 209 15 67 125 133 133 177 216 212 87 246 87 208 256 123 104 219 24
3379 24 60 184 135 136 184 213 24 403 206 96 277 118 196 103 180 112 203 394 62 239 191 135 193 276 124 318 60 177 373
3236 373 127 234 265 280 296 226 427 320 182 295 504 225 251 293 247 139 247 395 247 274 246 544 409 631 409 512
3108 512 312 556 367 170 536 189 596 406 744 712 1246 1260 1497 1667 1948 2028 2288 2357 2604 4089 7618 25283 284293
2995 284293 278242 38010 11487 6142 3722 3083 2489 1978 1895 1438 1643 1160 1153 862 785 674 534 244 530 183 222
2892 222 334 262 699 282 271 542 582 380 358 391 395 117 326 231 281 45 295 211 163 509 277 210 252 378 190 410 190 122
2754 122 203 166 144 38 308 140 141 204 185 306 144 91 133 250 123 197 76 176 142 71 251 101 247 157 233 211 70 222
2616 222 342 176 205 116 21 103 224 95 91 99 157 222 230 138 205 9 166 157 67 317 300 134 160 113 150 238 180 37 264 47 162
2464 162 134 306 115 91 147 37 75 49 173 162 72 300 77 284 227 234 103 103 227 185 60 183 128 200 89 150 71 127 101 202
2316 202 138 200 113 63 146 84 67 203 188 337 120 95 181 74 203 222 118 124 223 139 91 191 48 16 310 199 133 157 120 127 87
2163 87 270 81 102 149 168 150 18 114 146 19 160 61 73 149 88 164 253 82 49 117 32 198 147 151 95 63 304 43 212 92
2016 92 124 175 99 173 51 49 141 62 907 1618 411 52 43 216 251 264 38 167 122 87 69 120 24 67 37 177 42 242 102 96
1868 96 76 145 202 91 25 86 30 137 100 16 210 184 262 93 46 175 56 198 33 106 39 131 73 90 206 37 98 117 101 131
1720 131 170 147 51 192 256 141 108 436 667 510 212 234 262 150 189 14 133 238 65 108 73 147 180 13 96 76 48 326
1583 326 189 58 196 192 126 40 113 40 148 220 32 234 190 175 72 60 64 92 196 93 390 148 96 39 46 96 121 132 121 104 141
1430 141 13 224 16 165 171 110 111 98 21 144 216 129 156 243 26 137 246 63 112 159 51 43 30 103 153 241 110 179 86 126 136
1277 136 42 49 161 96 293 116 138 287 301 175 108 26 119 58 125 179 56 126 274 157 47 26 122 57 169 169 53 78 162 81
1130 81 109 265 46 113 155 249 62 117 228 67 77 114 322 38 220 104 179 114 138 128 66 77 129 56 141 224 187 113 146 166 206
977 206 69 80 242 39 157 266 176 44 264 104 64 36 80 135 122 237 105 117 100 73 115 222 169 34 101 178 152 77 111
834 111 144 149 164 123 264 127 92 25 109 81 99 183 150 300 342 322 145 73 99 217 154 81 95 176 114 220 15 63 57 181 294 107
677 107 206 92 149 138 76 233 132 149 58 164 186 79 57 41 207 91 57 33 206 94 327 149 221 30 176 61 118 195
539 195 482 744 650 960 211 44 85 64 210 127 100 64 194 143 161 87 142 249 112 90 153 115 57 24 189 188 135 117 61 182
391 182 203 133 116 183 122 44 137 109 217 128 190 234 61 172 61 196 227 136 60 196 191 128 357 156 147 100 78 156 140 92 90 284
234 284 45 98 13 340 119 187 77 76 195 196 33 75 163 174 130 153 104 225 36 199 116 67 74 272 143 166 44 82 72 35 146
81 146 179 91 92 253 178 122 116 54 188 50 58 208 25 319 235 102 90 184 66 167 55 95 193 95 134 72 104 148 139 46 118 108 106
-81 106 100 101 114 147 325 99 46 49 11 159 16 14 220 174 243 331 242 15 80 278 47 230 80 211 83 35 252 23 106 311
-229 311 71 120 190 200 259 137 214 110 54 113 76 26 116 215 71 206 241 160 272 206 153 168 261 54 160 173 20 182 118 258
-376 258 210 346 221 115 192 284 293 136 111 197 178 175 199 222 132 199 302 313 354 99 274 188 361 258 237 338 334 140
-514A40
##PAGE=	F1=1420.18
##FIRST=	4521.1594499999982872,	4521.1594499999982872,	0.15168489515781402588
##DATA TABLE=	(F2++(Y..Y)), PROFILE
4521 137 183 166 114 234 149 212 156 269 153 189 197 179 40 257 73 150 135 126 68 288 174 218 314 108 247 41 161 206 72
4378 72 139 263 169 45 216 68 37 179 133 79 129 223 119 184 83 54 79 90 233 134 206 168 119 153 173 236 108 103 174 140 114
4226 114 331 54 18 113 211 115 116 122 119 199 126 165 168 136 165 223 109 53 216 71 140 66 102 256 46 137 210 119 134 248 165 272
4068 272 174 144 87 96 105 62 222 67 33 282 210 243 73 57 129 92 118 112 193 224 75 76 147 182 56 36 131 200 241 119 117 77 252
3906 252 268 145 43 174 99 181 123 114 118 98 129 103 170 161 87 147 117 156 111 40 239 143 127 153 330 117 77 184 178 181 104 30 94 116
3739 116 182 101 129 137 23 167 176 56 167 23 114 133 55 136 27 160 146 171 261 141 116 127 227 102 206 32 143 229 108
3596 108 300 216 50 120 250 187 253 54 154 251 105 110 111 146 92 126 179 144 74 169 27 170 247 121 94 73 181 58 79 83 96
3443 96 135 134 232 207 72 141 53 167 230 141 78 204 6 42 141 99 101 129 206 68 277 180 20 267 149 132 71 164 135 168 384
3291 384 51 206 128 152 87 192 130 280 121 140 335 144 243 239 218 263 216 353 230 98 181 371 202 150 250 176 115 228
3153 228 329 193 190 123 435 286 480 257 362 212 362 248 78 611 133 512 251 568 443 920 848 1037 1109 1322 1293
3030 1293 1512 1482 1432 2358 4062 14205 189531 187613 24586 7727 4497 2852 2476 1854 1472 1273 937 1178 722
2936 722 811 523 562 464 426 114 617 69 113 232 175 593 184 147 386 480 224 263 255 340 137 269 142 281 32 226 173 125
2798 125 403 239 100 159 357 205 299 157 75 149 105 147 4 253 147 146 142 138 220 60 100 59 252 82 187 121 158 134 27
2656 27 262 161 223 89 187 151 65 157 320 131 164 145 86 130 169 105 79 59 119 202 242 143 158 16 134 119 39 310 295 160 159
2503 159 87 131 193 206 87 304 30 102 120 298 137 113 110 79 55 29 159 151 56 298 102 243 231 195 86 116 185 178 34 169
2355 169 134 146 45 147 65 105 84 195 154 186 117 18 123 91 67 222 209 318 125 60 177 61 203 201 91 104 179 146 110 180
2208 180 21 23 264 180 175 145 119 125 65 262 77 119 133 145 88 10 118 130 23 154 25 61 136 111 119 230 46 48 105 24 210 169
2050 169 130 64 90 292 21 168 93 150 154 61 163 62 45 111 40 799 1467 405 84 44 165 258 232 20 165 76 59 84 111
1907 111 8 92 66 181 32 190 53 65 66 148 174 63 34 107 44 99 74 18 198 212 234 99 43 192 48 177 35 108 69
1765 69 117 57 101 203 78 90 128 118 101 153 109 50 149 228 100 70 357 539 430 158 233 299 133 187 16 172 237 116 141 86
1617 86 138 179 15 122 132 64 302 158 89 144 227 94 59 140 43 75 214 40 234 202 167 49 67 86 54 219 75 352 134
1474 134 95 33 22 101 147 158 130 70 158 40 218 19 159 131 131 120 99 48 167 249 141 133 201 48 71 215 56 84 133 162 52
1322 52 75 82 122 239 112 178 82 160 134 53 37 170 103 269 103 137 265 310 176 110 23 117 67 161 156 82 128 224 174 21 21 89 46
1159 46 180 159 63 93 189 64 81 229 44 109 190 245 69 125 268 102 50 139 326 66 193 121 194 144 116 117 54 84 90 42 108
1007 108 222 181 90 149 121 213 52 23 255 80 160 225 150 35 290 158 48 74 108 146 104 204 70 123 96 101 145 200 160 36
859 36 131 177 145 37 144 133 157 155 108 231 159 108 45 88 66 73 131 126 280 327 316 141 21 130 245 143 127 104 158 120 220 9
702 9 92 64 196 314 117 164 103 116 83 75 214 139 116 83 180 172 33 74 79 236 80 21 45 210 110 307 164 208 77 174 52
549 52 100 207 389 699 576 1060 143 34 77 24 189 118 83 40 179 150 106 65 134 227 117 49 134 75 69 26 169 181 163 161 99
396 99 131 162 113 98 102 121 83 157 142 173 133 174 250 84 161 79 206 226 119 79 164 157 161 357 190 119 126 74 181 132 79 70 284 73
229 73 76 4 310 142 133 86 97 194 213 27 18 124 165 129 198 66 185 69 198 105 82 96 240 120 142 77 89 98 54 112 198 96
71 96 135 220 168 95 58 79 128 38 92 204 24 346 288 130 63 164 21 136 48 112 133 75 131 40 62 129 150 85 97 105 58 104 63
-91 63 115 111 254 91 9 85 47 105 31 43 157 157 273 305 156 16 49 187 15 180 43 232 26 39 204 14 65 259 56
-234 56 97 151 182 270 88 139 127 37 90 40 46 95 169 134 190 178 118 175 203 104 135 166 11 118 137 48 183 126 170 217 297 205 101
-396 101 110 244 239 81 60 126 156 99 144 193 119 149 234 199 274 52 188 154 283 170 186 278 257 65
-514F5
##PAGE=	F1=1410.34
##FIRST=	4521.1594499999982872,	4521.1594499999982872,	0.095382750034332275391
##DATA TABLE=	(F2++(Y..Y)), PROFILE
4521 104 98 78 60 149 137 133 120 157 113 94 169 146 69 180 67 85 120 52 54 220 123 243 328 50 226 9 121 143 149 162 175 102 55
4359 55 190 124 20 131 111 40 122 123 113 175 71 61 15 104 216 139 166 209 102 168 117 197 99 115 137 88 88 291 90 16 154 199
4201 199 124 106 103 40 196 138 154 103 123 229 246 127 23 213 80 98 65 89 223 48 142 140 119 162 219 131 259 161 142 83 72
4049 72 111 69 170 74 43 195 204 221 75 124 150 83 79 85 188 205 70 71 126 179 56 51 126 185 232 127 99 85 228 264 118 46 191
3886 191 175 165 110 119 93 167 115 67 123 149 128 124 121 140 89 59 177 147 109 149 299 53 99 94 155 189 99 49 86 86 141 78 76 100 46 142
3709 142 162 68 138 40 97 113 77 110 53 151 121 120 216 106 129 140 213 117 196 64 142 213 131 251 217 108 139 200 195 209 31 110 203
3547 203 95 85 149 154 103 100 172 101 100 117 54 222 199 105 97 54 171 102 77 32 64 132 95 237 193 61 43 11 124 198 141 78 184
3384 184 16 46 91 72 68 79 200 106 138 164 66 241 164 75 67 171 157 131 360 124 187 89 183 24 117 161 230 170 109 292 158
3232 158 251 212 156 222 215 269 138 27 91 264 180 54 194 106 131 226 244 132 164 17 323 157 334 117 219 136 167 139 9
3089 9 633 160 418 102 383 192 582 462 604 586 739 633 804 735 522 1054 1244 5316 101892 102583 12604 4312 2874
2976 2874 1953 1821 1225 997 693 467 706 373 503 205 345 284 302 46 636 152 18 156 109 468 166 62 235 374
2857 374 110 163 134 273 172 204 57 281 91 155 137 80 289 206 7 97 333 224 190 122 59 108 77 145 7 196 181 151 84
2715 84 87 140 50 109 42 249 41 183 159 127 128 77 252 211 192 32 130 95 62 121 285 115 124 172 144 157 100 113 95 35 86 186 256
2552 256 162 98 35 90 88 76 291 274 196 166 64 144 158 227 179 326 12 41 95 292 164 134 70 110 100 36 156 144 60 293 136
2400 136 185 218 154 67 124 150 163 13 137 123 96 47 141 79 86 105 178 162 168 117 15 103 84 58 220 221 282 114 50 157 50 191
2242 191 186 76 90 135 163 128 166 53 48 193 151 203 122 132 151 58 250 93 126 136 167 41 32 109 110 36 150 27 55 114 113 94 215
2080 215 33 39 84 51 200 178 125 62 98 264 73 126 92 152 143 17 141 76 68 64 10 655 1252 380 111 48 101 252 190 13 159
1927 159 49 35 92 112 29 117 116 189 87 148 39 36 74 160 139 89 33 134 79 57 55 22 174 220 194 96 47 198 68 154 48 133
1770 133 100 106 36 101 188 127 85 143 137 71 134 70 47 103 213 81 63 244 359 335 101 225 319 124 166 46 194 225 157 176 111
1617 111 113 163 41 143 165 55 274 124 116 96 247 115 80 153 57 56 198 46 217 209 150 42 84 102 57 227 68 308 113
1474 113 100 42 15 93 163 176 124 61 158 72 206 19 139 88 147 131 98 65 173 269 153 104 159 94 42 216 51 85 181 263 67
1322 67 115 52 107 231 103 169 87 172 127 63 31 181 100 244 91 134 234 304 173 108 51 106 78 190 134 104 111 153 187 40 70
1169 70 50 53 183 143 64 100 218 81 53 189 41 115 217 238 91 138 298 141 36 143 296 78 162 135 204 159 77 119 50
1026 50 131 54 60 83 205 168 53 158 89 220 40 72 250 109 161 183 116 31 310 209 22 117 151 158 81 166 39 124 96 123 170
874 170 185 150 45 150 171 122 52 175 120 148 153 94 192 185 132 93 65 46 45 95 117 247 303 296 152 22 150 255 128 149 112 128 121
711 121 218 36 106 63 206 313 115 124 114 104 47 81 191 145 89 96 183 147 5 97 127 261 65 46 50 201 116 277 163 192 120
559 120 161 42 83 190 305 670 487 1065 204 22 73 48 178 127 75 14 168 150 82 35 123 187 107 32 116 36 58 78 144 168
411 168 184 179 129 72 121 98 101 43 122 106 164 162 126 134 159 259 108 148 112 216 216 97 97 128 125 200 346 204 88 150 83 200 114 67 52
239 52 250 87 60 28 266 165 79 95 110 181 216 24 84 85 149 160 215 38 143 106 206 119 89 112 195 87 139 112 80 118 107 108
81 108 207 110 169 182 157 54 83 95 78 19 111 183 54 349 318 152 53 144 33 97 66 118 74 65 133 80 43 115 150 112 89 112 36 96
-86 96 86 116 76 172 79 18 137 87 65 51 63 98 136 281 273 72 10 26 111 21 121 23 247 36 55 155 14 23 199 43 101 125
-244 125 159 275 121 93 139 30 82 66 67 95 136 180 176 102 90 86 201 102 91 71 37 96 123 59 188 157 106 231 264 189 124 70 208
-406 208 191 106 75 89 135 69 95 173 163 93 165 97 206 91 132 146 211 115 151 231 187 30
-514C0
##PAGE=	F1=1400.49
##FIRST=	4521.1594499999982872,	4521.1594499999982872,	0.083775565028190612793
##DATA TABLE=	(F2++(Y..Y)), PROFILE
4521 89 32 10 23 88 127 91 110 61 86 101 155 142 114 122 85 64 116 12 72 166 94 253 340 96 207 19 95 103 210 191 87 44 63
4359 63 163 160 29 88 85 14 134 106 117 156 68 94 34 107 189 135 117 226 86 179 100 159 83 129 98 93 56 250 125 36 179 186 115
4196 115 126 102 31 184 149 148 54 110 269 264 140 47 205 86 58 65 56 207 77 139 93 110 167 181 133 220 152 138 80 46 119 82 124
4034 124 92 59 97 186 198 77 181 179 111 31 74 181 162 59 72 122 169 105 85 146 171 221 131 87 81 190 237 81 45 201 227 146
3876 146 106 115 108 232 109 57 75 122 153 113 127 127 67 72 105 146 111 153 276 30 124 15 137 208 103 68 71 51 94 47 15 82 91 114
3709 114 153 74 105 55 71 88 97 103 88 163 88 77 170 78 153 142 207 141 179 91 137 200 144 191 220 156 160 176 174 168 15 56 147 107 61 182
3532 182 151 107 66 160 61 129 124 89 264 144 105 104 62 174 131 59 35 70 123 62 226 167 52 35 30 86 161 126 85 162 36 83 42
3369 42 67 42 64 199 130 27 162 118 202 161 37 112 192 172 100 321 181 187 99 211 127 76 183 174 201 88 251 167 258 190 121
3217 121 182 217 193 58 44 83 218 156 23 132 69 173 231 153 94 190 72 218 88 214 44 106 87 4 72 51 607 216 330
3074 330 42 216 18 281 156 253 172 277 181 241 202 327 421 597 1707 33314 34439 3720 1719 1491 1148 1212 698
2961 698 646 283 92 299 308 272 79 174 191 180 76 559 237 128 121 95 344 206 100 121 288 112 74 46 197 194 140 96 284
2818 284 142 107 109 36 183 177 75 110 314 231 137 95 67 100 114 139 13 150 220 153 53 37 79 94 112 112 243 30 182 178 92 130
2661 130 136 224 239 162 9 69 79 68 105 239 131 106 194 184 180 30 112 112 54 71 172 267 183 42 66 58 82 112 262 243 228 177 47
2498 47 167 139 241 239 325 12 9 63 287 185 150 36 126 140 82 165 142 79 281 166 113 185 116 49 126 123 141 20 99 101 69 91 133
2336 133 98 74 132 153 162 147 115 33 88 68 43 205 219 233 89 66 134 55 167 181 110 83 100 187 141 155 102 85 113 117 215 95 150 177
2168 177 71 237 135 132 163 212 83 70 98 92 56 149 49 61 106 100 123 208 71 23 54 91 171 171 144 80 82 228 116 95 90 132 143 31
2001 31 108 91 91 27 29 503 1018 339 132 52 31 225 146 23 154 63 42 91 121 56 136 163 201 135 125 77 38 79 175 106 140 15
1843 15 155 127 13 40 29 141 203 146 79 63 199 84 133 63 165 121 100 23 96 163 170 96 158 159 47 111 36 49 75 211 92 118
1686 118 127 154 254 53 209 318 117 134 76 194 203 176 202 139 75 132 63 149 170 26 245 92 134 57 248 154 100 152 79 113 173
1533 173 53 192 211 124 50 94 109 94 217 67 261 101 117 43 22 75 165 182 104 90 141 106 188 27 109 48 153 131 98 70 164
1381 164 273 161 70 122 133 43 225 48 77 239 346 91 141 37 113 218 86 155 100 162 113 71 31 184 91 217 83 129
1243 129 195 285 171 103 78 92 94 208 119 122 79 76 196 56 119 12 52 174 129 55 96 242 119 29 157 52 133 233 227 119 158
1090 158 318 175 35 126 232 69 135 141 206 159 31 129 62 183 79 99 79 175 155 47 179 78 225 50 132 226 119 164
953 164 151 79 39 321 250 20 155 194 166 65 128 19 119 101 127 186 179 140 57 165 168 90 116 203 114 124 162 93 151 198 149 123 43
790 43 30 16 90 124 203 273 268 182 61 158 248 113 140 119 91 114 213 72 104 56 207 292 102 89 121 124 37 92 169 148 73 95 171 113
623 113 28 110 162 277 54 73 45 174 111 242 149 171 151 137 31 61 148 243 641 403 984 314 15 79 82 184 155 84 18 157
475 157 148 109 4 108 140 89 52 101 6 51 145 120 148 192 170 148 15 84 92 128 89 128 111 155 166 80 134 145 257 126 137 138 227 206
308 206 82 112 94 101 231 318 192 62 165 92 204 89 52 47 185 82 51 57 219 173 45 97 106 157 202 29 138 54 132 183 205
155 205 69 110 141 223 129 93 118 143 47 153 145 66 128 155 112 206 131 188 143 147 4 135 106 58 21 108 148 79 328 316 164 74 130
-7 130 72 53 80 106 33 70 132 112 57 112 138 130 99 123 62 74 125 117 45 88 61 44 191 121 54 67 71 46 111 267 239 57 6 13 59 57 58
-189 58 72 251 81 74 114 44 29 143 32 118 110 135 274 193 103 143 30 83 106 75 118 129 205 166 33 75 63 200 138 89 46 76
-347 76 90 137 53 200 192 97 238 265 175 133 96 179 169 160 114 83 116 108 67 167 204 38 104 58 164 142 115 138 153 117 126 198 128 78
-514G8
##PAGE=	F1=1390.65
##FIRST=	4521.1594499999982872,	4521.1594499999982872,	0.11146439611911773682
##DATA TABLE=	(F2++(Y..Y)), PROFILE
4521 93 53 46 2 69 114 85 117 39 76 148 142 152 148 93 106 85 118 61 109 139 87 242 344 147 187 38 79 86 250 222 14 28 68 138
4354 138 173 51 72 56 8 155 167 123 130 69 128 75 100 155 114 64 216 75 184 101 123 64 129 59 131 25 211 153 64 187 175
4201 175 98 167 121 90 165 147 149 58 104 282 272 146 73 194 87 47 61 33 205 108 130 76 94 148 141 162 167 148 135 91 44 126 93 79
4034 79 107 79 9 165 174 86 223 207 145 25 78 171 101 42 72 138 152 145 131 172 156 205 131 83 80 144 194 43 48 200 246 122 91 102
3867 102 135 278 100 78 32 82 155 112 125 118 45 78 47 132 123 165 257 75 148 48 130 234 115 88 53 50 46 31 58 104 109 85 154 61
3699 61 70 68 41 72 110 118 122 189 55 58 130 64 175 135 210 170 162 114 134 188 148 129 223 188 171 181 127 134 23 14 117 130 48 208 138 101 25
3517 25 141 31 158 170 118 287 92 118 116 76 179 146 46 84 94 110 36 200 134 46 85 65 56 121 102 84 142 54 132 2 78 31
3360 31 82 203 138 115 171 148 157 144 30 166 215 173 77 266 205 196 128 230 209 84 181 115 212 79 216 170 259 178 132 150 215 133
3202 133 26 87 125 215 129 68 74 89 212 233 75 95 225 136 125 148 136 104 59 60 129 81 80 546 257 257 106 87 140 79 76 44 103 95
3035 95 275 145 168 595 478 1451 4170 19101 13274 2532 572 507 534 721 346 474 282 160 76 445 137 242 105
2921 105 203 96 88 387 278 230 111 112 236 234 166 76 238 161 26 11 117 196 90 191 290 174 109 93 18 96 143 115 151 307
2774 307 220 177 85 72 112 162 133 45 129 246 150 64 8 50 116 107 176 234 50 189 174 76 141 184 187 246 139 26 23 115 81 87 190 156
2606 156 123 209 200 196 56 101 120 74 72 159 272 200 58 110 82 96 133 228 216 249 189 39 176 132 247 260 299 36 43 31 281 190 158
2444 158 12 131 158 133 175 143 98 260 186 35 139 83 35 121 102 114 45 73 88 83 133 127 116 68 145 127 158 125 110 36 79 52 32
2282 32 184 207 176 62 90 129 78 132 183 166 74 75 214 148 152 152 127 46 85 214 72 165 189 94 221 193 143 198 250 144 119 105 84
2119 84 77 150 63 79 134 96 176 207 121 32 24 135 132 149 171 88 44 191 146 79 89 99 146 69 69 104 99 59 78 360 802 298 148 58 38
1947 38 178 104 40 152 96 63 80 132 77 148 207 223 172 121 113 79 69 189 83 182 13 164 178 31 28 47 105 166 96 49 91 198
1789 198 82 117 74 192 129 100 46 93 131 199 116 167 181 37 84 15 61 90 214 135 184 151 86 231 46 186 297 109 111 104 174
1637 174 171 169 211 164 26 88 79 136 150 10 213 64 139 32 229 184 118 142 101 168 143 69 173 210 95 64 93 107 128 190 68 216
1479 216 109 145 39 30 52 156 179 74 126 111 137 166 52 75 41 145 121 97 66 144 263 164 42 95 159 51 224 44 57 276
1332 276 407 127 148 70 138 205 65 136 112 138 96 74 41 178 79 186 79 124 153 259 176 99 101 86 119 215 111 135 64 58 199
1179 199 60 161 24 43 157 131 54 93 256 157 19 141 83 162 238 211 147 184 331 202 36 92 136 37 118 139 200 154 50
1036 50 141 82 219 131 137 104 132 145 98 210 83 225 70 170 185 107 168 136 44 51 319 275 56 183 226 168 59 98 16 108 109 114
879 114 188 180 129 66 185 176 66 177 223 115 91 177 111 119 192 151 132 22 39 10 107 140 152 243 238 220 97 149 229 110 103 124 63 100
711 100 200 107 86 45 197 258 84 59 121 161 51 102 149 146 69 84 142 75 49 110 183 284 53 88 29 130 95 206 127 143 169 102
554 102 22 33 88 199 601 380 844 411 20 96 106 206 195 110 45 146 148 146 22 90 104 76 71 93 15 88 216 103 126 183 140
401 140 157 37 58 92 162 146 138 107 132 155 41 135 132 243 133 130 150 237 201 87 128 75 88 246 271 155 49 166 99 187 66 33
244 33 67 104 56 46 88 184 161 58 94 87 126 173 42 168 41 114 179 172 111 92 173 243 121 93 117 97 43 170 173 68 126 191 106 194
76 194 155 193 111 142 48 166 120 86 52 90 116 96 286 285 164 103 125 104 6 88 87 47 76 123 117 73 113 117 147 114 132 98 42 151 118 18
-101 18 39 39 77 238 139 61 74 70 8 83 232 205 102 31 7 29 88 25 128 240 111 92 97 89 80 99 45 137 98 111 269 259 138 136
-268 136 30 85 130 71 144 150 210 158 60 63 107 197 174 149 108 106 84 152 36 217 220 117 235 286 163 120 127 163 184 199 137 79 99 152
-435 152 73 173 219 14 56 98 148 175 119 112 111 144 98 169 80 121
-514A21
##PAGE=	F1=1380.8
##FIRST=	4521.1594499999982872,	4521.1594499999982872,	0.18595276772975921631
##DATA TABLE=	(F2++(Y..Y)), PROFILE
4521 110 99 72 9 76 99 96 130 82 87 172 122 158 167 91 122 95 122 97 150 132 88 214 335 173 164 54 57 90 265 248 70 71 74 115 166
4349 166 77 92 46 8 172 223 123 110 76 159 114 83 119 79 50 185 69 183 93 91 47 115 19 162 10 176 171 93 181 168 85 209
4191 209 151 131 142 129 158 106 108 273 265 143 92 184 84 65 56 78 204 132 117 75 75 113 105 189 114 146 132 112 68 131 101 33 115 103 76
4019 76 149 145 102 247 228 173 71 85 157 28 31 69 156 133 168 180 189 138 182 126 90 93 98 144 26 67 189 229 92 61 84 150 297 91
3852 91 102 13 32 135 114 107 112 25 74 75 106 135 179 235 108 168 90 137 260 131 110 35 96 2 57 122 147 102 57 166 31 40 81 29
3684 29 83 114 138 148 216 45 64 97 61 190 121 218 199 154 136 138 177 146 76 224 200 165 198 69 108 40 59 144 157 58 231 117 85
3522 85 18 117 28 182 213 137 291 52 142 132 89 180 150 64 122 106 94 24 165 105 42 104 88 37 84 76 74 125 69 182 24 91 40
3360 40 97 211 128 190 183 155 118 120 33 210 230 160 63 197 195 203 150 239 263 113 154 55 205 77 190 169 249 178 169 129 211 99 58 112
3192 112 149 209 95 81 37 122 235 221 39 108 248 181 47 216 108 153 79 52 199 107 88 466 269 201 128 7 195 163 166
3049 166 122 219 226 402 359 283 665 478 1545 4638 39387 34853 4286 869 219 275 397 211 421 395 281 214 543 89
2931 89 327 143 233 116 80 166 314 310 101 124 157 225 215 81 219 188 45 32 49 179 67 273 295 180 137 90 42 45 100 121
2784 121 177 311 198 240 84 69 122 196 129 90 135 253 142 84 45 51 113 94 220 223 61 202 147 105 158 217 150 239 124 30 58
2631 58 156 90 57 146 174 154 219 189 205 116 84 116 75 78 149 270 211 112 160 128 109 142 190 201 259 196 41 163 124 242 244 249 60 59 24
2459 24 273 176 158 10 127 150 180 174 144 111 228 197 60 85 58 30 108 84 85 73 76 110 120 163 125 129 68 140 103 151 105 99 31 78 58
2286 58 38 166 192 121 60 113 152 104 87 186 215 55 57 237 151 158 195 166 56 63 206 59 171 186 116 201 253 164 223 269 191 171 132
2124 132 90 96 154 69 105 186 115 215 208 172 74 29 175 99 116 186 79 40 165 164 79 90 62 142 96 32 117 88 94 128 244 649 283
1962 283 158 66 101 114 70 65 152 125 74 61 137 92 154 244 254 195 132 132 131 41 196 79 206 46 160 222 76 21 70 73 126 57 21
1799 21 126 198 62 106 78 206 125 104 82 94 92 212 136 165 199 41 55 24 80 124 215 202 237 286 241 271 79 162 260 99 121 132
1642 132 142 132 136 197 182 35 41 86 105 114 42 175 48 131 24 194 201 134 129 118 205 115 97 169 206 78 81 89 97 148 151 69 177 128 179 46
1464 46 39 44 138 172 51 152 74 159 150 88 45 70 121 108 94 55 119 243 163 42 73 168 84 208 39 50 285 443 170 136 114 175
1307 175 191 47 118 118 110 80 77 61 165 71 151 75 123 110 230 187 99 123 100 152 215 104 147 107 124 195 58 191 46 36 138 159
1149 159 86 106 260 185 34 138 127 195 232 190 167 213 338 220 35 60 21 10 114 133 192 151 102 145 104 230 173 166 141 81 139
997 139 154 242 96 218 87 181 136 82 174 136 26 60 302 280 87 195 245 160 51 78 26 92 120 88 174 182 114 72 212 195 68
844 68 222 233 118 55 195 138 112 169 132 129 9 67 34 129 160 100 216 212 256 128 124 204 131 66 128 55 82 177 132 58 32 180 219 69
677 69 45 111 203 86 109 131 139 68 70 96 43 72 102 190 281 64 92 12 77 77 175 108 112 174 58 18 17 29 153 550 434 683 483 30
510 30 116 120 233 237 142 75 136 145 170 40 73 94 81 78 95 22 141 282 101 106 161 109 158 77 53 97 189 179 149 106 102 132 18 141 125
337 125 216 130 126 145 239 196 104 146 85 85 245 212 104 52 148 105 155 55 14 100 74 12 45 118 174 129 89 88 56 90 139 57 174 40
170 40 95 142 126 138 85 200 253 93 90 111 85 97 184 194 100 115 210 88 171 176 182 88 140 91 170 138 129 84 87 115 102 229 230 151 122 129 126 48
-17 48 93 95 74 68 101 91 78 108 92 165 120 133 134 12 161 119 9 90 13 117 270 135 80 71 61 32 53 180 173 127 60 11 37 116 78
-189 78 175 217 127 108 106 142 134 74 82 151 82 82 260 308 165 121 33 85 133 63 160 188 199 146 110 49 142 189 194 219 152 124 68 148 13 233
-367 233 232 123 223 299 150 104 140 163 218 220 140 66 80 183 96 184 206 51 27 127 141 186 127 68 81 161 65 134 46 152
-514A52
##PAGE=	F1=1370.96
##FIRST=	4521.1594499999982872,	4521.1594499999982872,	0.27958533167839050293
##DATA TABLE=	(F2++(Y..Y)), PROFILE
4521 133 132 78 18 75 83 123 140 107 115 169 98 155 168 105 134 82 120 122 190 129 89 182 311 173 138 71 22 102 258 263 126 124 81 94 147 101
4344 101 124 73 14 183 256 116 116 87 186 153 55 85 53 100 139 70 177 70 67 43 90 22 175 26 146 178 115 166 164 88 240 184
4186 184 156 120 100 173 160 116 250 240 135 104 180 77 79 60 131 195 145 100 77 54 73 76 199 87 144 127 133 94 136 104 22 116 127 127
4019 127 137 113 115 253 236 188 109 86 145 48 45 61 160 119 176 223 191 115 152 118 107 114 56 97 39 94 168 177 56 20 71 146 289 94 118
3847 118 34 22 100 115 73 107 7 60 128 75 143 186 205 122 179 114 151 283 145 135 19 147 39 87 174 192 84 46 181 14
3699 14 33 93 53 111 108 149 160 232 68 75 68 70 194 105 227 220 155 156 150 164 140 44 223 195 144 212 53 89 61 99 193 180 78 253 95
3527 95 62 58 98 38 196 237 146 276 43 173 149 102 175 146 90 140 100 77 32 129 103 38 101 98 25 55 54 70 113 83 224 35 103 55
3360 55 97 218 103 226 187 143 98 96 31 235 232 137 56 119 160 198 160 240 288 142 111 8 187 82 172 166 226 186 204 117 206 92
3202 92 73 120 147 178 54 69 51 144 239 194 54 108 260 207 25 251 116 179 99 62 216 113 82 377 256 157 109 43 188 263
3054 263 179 149 220 259 405 444 271 582 406 1273 3823 42560 38315 3575 701 349 407 266 190 373 399 304 281 568
2936 568 117 334 184 233 178 92 93 375 362 84 121 110 183 245 78 214 191 58 53 71 148 79 327 295 164 160 100 59 54 48 99 182
2779 182 316 177 282 77 72 128 208 130 134 150 241 129 95 72 54 95 75 242 208 58 214 105 157 174 233 122 224 118 27 101
2631 101 181 90 21 116 181 181 225 162 201 159 68 103 55 82 148 265 217 158 204 165 111 140 152 199 259 193 54 129 111 224 198 183 81
2469 81 58 43 261 146 153 11 121 123 212 156 145 116 182 200 141 31 41 31 89 71 58 104 98 158 161 177 128 135 78 120 88 143 92 78 39
2296 39 80 81 50 152 185 78 82 133 187 123 37 188 241 23 36 254 152 167 225 193 93 60 202 54 167 178 129 181 308 192
2149 192 231 266 219 218 166 104 108 163 69 134 238 148 228 209 218 124 62 205 95 77 179 63 103 157 174 91 95 31 131 111 31 128 64 108
1981 108 173 252 639 317 162 77 151 42 47 99 151 145 73 46 135 102 152 268 286 205 152 133 181 20 192 93 209 73 142 250 120
1829 120 24 93 53 112 63 52 157 196 29 98 77 205 115 108 119 96 53 208 151 152 208 51 33 41 101 152 212 279 267 403 343 327 111
1666 111 146 212 89 155 163 106 89 90 165 187 94 52 85 61 72 60 131 43 113 23 153 206 146 120 127 222 107 132 176 200 86 97 95 84 153
1494 153 110 73 149 146 212 65 51 63 117 169 65 159 46 169 150 130 28 103 84 100 86 45 98 217 164 67 61 159 138 176 30 73
1337 73 270 451 212 109 150 212 178 37 106 117 89 70 80 83 151 72 113 70 124 71 206 196 104 149 129 188 212 99 159 172 184 183 65
1174 65 210 55 38 128 207 138 137 254 202 55 133 176 226 216 164 177 242 340 231 32 71 101 65 121 126 182 153 143 135 122 213 194 184 177
1007 177 38 134 197 263 111 202 97 162 86 64 184 140 34 61 271 262 103 189 250 144 31 72 44 74 132 59 145 177 93 71 238
854 238 215 83 242 233 111 19 209 167 136 132 95 129 26 96 53 149 179 59 194 196 279 148 86 182 174 105 128 61 64 144 140 29 20 163
687 163 182 65 61 94 239 134 111 114 126 68 69 42 61 103 95 187 272 80 87 40 58 69 150 102 86 168 14 19 51 70 90 494 513 539 527
514 527 40 129 126 255 270 174 106 137 134 173 49 63 102 104 74 104 26 184 332 121 89 135 109 151 107 77 109 202 184 152 115 74 105 25
347 25 150 124 180 122 125 128 227 183 117 159 110 87 230 160 53 79 111 114 123 55 22 137 157 43 47 141 189 89 116 81 33 56 109 73 159
175 159 43 74 83 82 141 83 222 244 58 82 107 119 161 191 205 145 107 215 68 142 187 161 73 135 114 148 157 171 108 124 147 96 167 165 127
3 127 126 136 140 99 98 139 88 42 65 46 78 93 74 183 113 122 167 34 158 122 34 150 16 154 281 105 120 56 49 55 27 119 144 122 88
-170 88 23 76 145 135 206 184 134 124 123 194 185 69 126 159 59 49 248 334 174 103 37 84 117 62 159 228 185 127 139 33 156 175 194
-332 194 270 167 137 51 119 9 238 227 103 203 283 134 110 143 178 249 225 127 58 58 199 124 194 176 75 33 129 129 177 135 15
-485 15 64 158 46 91 44 171
-514A71
##PAGE=	F1=1361.11
##FIRST=	4521.1594499999982872,	4521.1594499999982872,	0.33746799826622009277
##DATA TABLE=	(F2++(Y..Y)), PROFILE
4521 153 150 69 26 60 69 164 146 119 147 148 84 139 156 121 142 58 107 141 225 120 88 157 276 153 113 91 35 110 234 263 167 183 88 75
4354 75 124 119 152 108 34 185 264 100 146 100 205 187 24 69 80 154 95 77 168 37 53 49 62 65 167 40 120 172 128 145 160 98 253
4191 253 210 165 104 66 189 206 121 222 199 123 114 188 71 79 78 169 175 145 82 78 36 40 53 186 94 139 119 144 109 137 102 69 111 144 148 125
4014 125 86 118 244 230 192 133 78 135 118 73 52 142 113 173 253 179 91 120 109 128 135 21 58 59 119 141 100 17 46 83 121 260 112 125
3847 125 47 69 59 114 30 104 12 40 166 43 150 181 165 125 180 123 167 299 152 160 19 187 74 107 211 229 72 62 191 57
3699 57 50 104 80 137 93 145 153 233 94 80 38 98 191 92 228 230 156 173 167 147 134 39 217 176 112 217 113 73 91 119 228 193 98 280
3532 280 88 41 90 94 48 195 238 143 245 63 206 163 119 167 135 104 142 82 62 46 105 128 29 97 101 22 45 44 77 106 96 256 32
3369 32 118 65 85 217 65 225 180 120 95 83 28 240 220 113 62 38 124 177 159 234 287 164 78 60 166 93 160 162 190 198 226 109
3212 109 202 106 66 113 124 126 14 41 80 153 225 153 61 92 270 219 66 250 131 191 109 75 192 106 70 280 227 120 64 63 150 319
3054 319 147 120 157 223 334 452 199 440 474 1118 3233 34355 30359 1468 171 262 542 276 159 294 314 274 270 541
2936 541 187 289 210 207 231 127 173 411 388 72 108 87 124 259 77 206 182 63 80 136 109 106 347 284 131 169 116 64 79 9
2789 9 63 170 313 169 296 57 96 139 199 135 166 156 216 112 96 87 53 74 51 242 191 49 210 59 209 187 236 109 211 124
2641 124 27 131 182 83 26 104 182 194 229 142 181 176 68 86 29 86 163 261 220 191 230 180 102 133 117 208 251 178 72 83 96 197 137
2478 137 110 95 43 62 244 102 147 9 113 85 224 121 144 114 126 198 212 18 32 31 67 67 37 137 127 209 195 174 134 134 95 91 81
2316 81 135 89 49 57 76 103 57 139 187 53 107 144 214 129 20 188 239 17 29 263 152 172 236 199 109 68 212 62 155 172 133 169
2159 169 351 223 221 245 227 248 191 119 114 180 68 161 276 176 210 208 256 173 96 221 113 47 152 72 170 164 180 110 106 13 118 115 58
1996 58 137 46 99 202 411 798 392 160 90 183 29 51 139 145 155 65 60 126 111 141 272 308 201 178 118 222 55 179 114 192 88
1843 88 115 258 160 38 109 47 135 107 98 177 189 14 88 75 190 107 107 153 95 34 193 160 131 203 58 27 52 124 167 206 351 270 464
1681 464 366 363 128 146 160 82 190 197 85 48 60 126 174 148 107 79 40 40 60 83 44 88 17 126 204 155 114 126 218 124 171 185 192 106 109
1509 109 116 72 145 74 75 134 156 239 86 65 88 97 177 102 145 54 164 172 170 26 131 38 95 72 40 87 188 169 94 73 134 191 130 15
1341 15 95 236 432 242 77 172 236 168 40 106 115 73 70 86 102 139 79 81 68 126 45 191 200 114 179 161 219 212 97 173 233 224 162 90 221
1169 221 56 41 130 261 191 172 240 213 73 118 224 244 192 133 173 266 333 237 32 110 208 115 136 121 170 155 165 109 133 173 194 192 203
1007 203 52 126 221 270 126 177 103 120 48 80 200 142 43 52 233 224 102 165 241 123 1 80 64 57 143 52 107 160 67 64 257 224 91
844 91 235 223 93 15 212 191 176 91 54 147 53 120 65 167 196 54 173 190 283 153 45 171 225 182 122 62 49 107 131 28 11
692 11 155 154 73 94 74 267 183 107 95 109 68 94 45 111 143 102 178 258 98 77 79 105 78 132 109 79 153 47 28 88 137 22 445 572
524 572 428 546 51 128 128 264 287 201 133 155 111 155 52 65 110 130 63 119 47 201 358 155 72 119 140 138 128 118 125 200 165 141 123
362 123 58 80 37 161 132 139 118 123 105 201 154 115 162 133 89 206 143 29 127 58 126 111 54 55 172 255 102 49 156 211 61 138 73
199 73 53 28 93 88 130 50 51 53 75 120 93 238 215 59 70 106 163 221 191 206 190 113 210 66 109 186 132 61 127 112 110 170 201 120 177 188
22 188 78 106 104 95 115 143 150 150 99 188 91 18 21 55 92 68 74 197 97 103 195 60 150 128 56 195 45 179 269 53 174 32 37 66 26
-150 26 56 120 90 108 33 125 176 184 219 148 140 139 133 235 226 80 164 161 31 14 234 338 168 89 42 84 89 70 147 258 183 100 147 19 150
-322 150 156 174 290 153 151 58 77 32 226 205 62 169 231 118 135 150 199 269 220 106 71 33 203 154 192 143 83 50 110 109 153 142
-480 142 42 64 136 64 51 69 180
-514A80
##PAGE=	F1=1351.27
##FIRST=	4521.1594499999982872,	4521.1594499999982872,	0.3401470482349395752
##DATA TABLE=	(F2++(Y..Y)), PROFILE
4521 163 153 52 29 34 62 204 145 125 178 119 85 117 138 130 146 62 81 160 252 110 88 137 240 122 91 110 94 105 200 249 192 240 94
4359 94 58 105 129 171 135 58 180 254 77 182 109 209 210 40 83 134 192 74 89 160 6 52 53 37 109 145 48 100 154 129 123 156 103
4196 103 247 224 159 96 40 201 238 118 196 148 110 120 204 68 66 107 187 144 130 69 81 31 27 33 155 112 129 104 137 109 128 98 110 102
4029 102 147 141 117 82 106 224 211 186 142 62 130 174 101 43 101 109 162 266 157 75 88 102 148 149 50 32 82 137 116 11 21 100 116 78
3862 78 221 134 127 50 106 39 107 34 102 27 16 184 28 160 162 117 130 171 123 179 309 152 183 34 210 100 113 233 254 77 87
3709 87 189 95 65 112 101 156 75 125 126 217 111 80 13 139 186 85 217 227 150 185 186 128 133 47 210 151 77 214 178 53 126 118 233
3547 233 188 114 309 106 48 108 100 60 177 218 126 203 93 237 170 137 162 115 98 138 74 51 59 96 160 15 116 110 22 46 47 89 107
3384 107 109 273 16 140 67 66 203 24 198 162 93 94 89 39 226 197 101 84 49 125 142 151 223 266 173 94 110 147 105 153 158 145 207 231
3217 231 101 199 126 42 93 87 82 49 22 104 151 197 104 50 67 281 220 89 218 133 194 113 78 145 104 61 177 191 85 16 78 129 346
3054 346 119 71 108 177 248 429 135 325 630 1257 3668 22399 19753 1413 670 178 620 325 154 214 188 243 221 485
2936 485 261 221 223 189 274 156 84 346 393 73 93 76 81 257 103 193 170 74 103 191 66 128 331 259 90 166 133 61 96 59 42
2784 42 150 294 174 282 25 135 160 176 146 178 146 185 94 92 92 49 59 29 222 175 53 184 40 250 197 226 111 208 138 34
2636 34 145 159 75 54 106 179 191 234 166 140 168 92 67 53 95 195 261 217 209 234 168 84 121 90 222 237 151 93 44 88 166 91 45 102
2469 102 23 77 222 54 143 21 106 49 214 76 143 106 65 188 261 55 32 29 49 70 25 172 160 252 219 155 137 123 114 60 84 132
2311 132 96 15 73 62 114 63 125 195 38 126 143 220 121 71 190 213 60 58 264 152 169 226 181 104 80 234 87 138 171 131 173 376
2154 376 252 204 209 218 250 200 132 113 199 71 181 291 193 164 204 282 213 128 222 130 52 112 113 224 170 184 131 120 13 111 113 81 143 55
1986 55 71 211 597 1024 478 151 103 192 90 84 183 135 155 63 96 112 123 121 253 313 188 202 96 245 94 158 135 162 88 84 245
1834 245 195 57 115 49 168 154 136 181 175 54 74 79 163 106 97 180 89 65 177 169 107 183 57 33 52 147 169 199 404 245 449 316
1676 316 366 121 156 111 76 210 233 99 30 81 103 144 190 157 68 78 26 52 35 43 63 6 134 198 160 114 121 197 151 205 191 182 120 116 144
1504 144 66 129 48 67 131 154 254 101 78 107 85 197 140 109 87 144 204 202 25 153 26 87 61 41 84 158 178 117 111 96 226 72
1346 72 16 102 193 388 251 56 175 239 161 57 114 124 54 82 96 116 132 84 69 71 128 48 181 194 128 213 187 236 215 100 188 280
1189 280 237 129 129 226 55 34 138 308 233 199 220 224 83 89 262 243 165 105 156 281 310 234 32 140 285 154 154 118 151 152 168 72
1031 72 135 124 178 192 212 89 113 223 260 137 147 111 65 36 119 222 147 46 36 200 174 87 129 221 99 40 95 84 43 150 75
879 75 77 131 45 58 260 219 87 207 206 69 47 199 209 217 65 68 182 84 134 71 182 209 76 150 184 268 140 36 176 270 251 109
721 109 51 40 84 106 45 11 156 137 82 129 69 283 223 96 75 94 69 131 107 163 187 131 166 240 116 64 114 157 93 118 119 94 136 91
554 91 40 116 192 119 412 601 344 546 67 115 129 255 281 220 153 183 75 122 54 79 107 148 51 134 83 188 357 192 55 121
406 121 168 120 146 166 145 183 131 112 117 61 64 44 169 145 99 121 121 85 164 109 96 147 146 85 179 165 40 185 18 135 128 51 97 201 337
234 337 155 52 159 224 67 156 63 86 19 89 102 94 62 29 111 110 86 124 248 169 102 61 109 199 272 188 197 226 133 199 87 76 169 102
67 102 46 114 84 73 174 214 118 220 219 50 55 61 57 94 142 160 196 93 223 98 68 41 126 124 44 89 204 80 81 214 72 141 136 70
-101 70 222 71 185 239 20 225 6 30 66 56 8 103 43 114 39 170 207 220 215 115 150 152 130 257 253 103 189 155 9 20 218
-253 218 324 154 85 47 87 67 75 138 267 199 70 137 13 131 133 137 276 122 173 92 62 61 192 169 33 118 151 111 151 165 219 272
-411 272 210 86 89 29 196 186 173 123 79 66 84 84 121 142 85 78 101 91 56 95 180
-514A80
##PAGE=	F1=1341.42
##FIRST=	4521.1594499999982872,	4521.1594499999982872,	0.32584989070892333984
##DATA TABLE=	(F2++(Y..Y)), PROFILE
4521 157 142 39 27 7 68 228 139 129 201 94 92 96 123 130 144 101 51 180 268 107 93 117 211 88 74 126 154 85 162 226 203 287 97
4359 97 52 91 132 179 149 80 171 233 48 214 112 196 218 91 118 183 209 80 108 156 27 58 50 18 147 114 52 88 128 119 101 157 96
4196 96 225 221 142 98 32 206 247 104 174 94 95 124 222 74 48 137 183 105 102 74 82 46 28 17 117 126 116 81 111 98 106 101 140 91 133 114
4019 114 129 100 80 196 181 173 139 42 126 209 120 38 44 100 147 258 131 76 62 99 162 154 108 43 109 145 101 77 53 146 151 38 186 151
3852 151 125 54 125 59 93 78 100 41 9 184 58 173 136 68 150 151 117 183 312 146 201 50 211 117 108 242 263 89 107 174 120
3699 120 73 116 113 164 64 91 80 186 115 79 39 183 187 86 193 209 132 190 206 106 141 56 208 129 48 205 231 28 161 98 206
3547 206 162 125 335 140 78 109 108 75 142 181 97 156 123 260 169 152 165 86 77 141 90 50 71 93 187 21 152 131 22 46 57 99 115
3384 115 123 276 18 170 63 49 174 29 156 139 67 83 116 63 201 166 103 114 118 159 98 139 205 237 166 135 150 129 113 149 157 96
3227 96 208 218 96 194 142 20 67 45 101 97 38 123 144 160 54 32 49 290 222 88 167 118 188 108 68 96 124 64 75 163 52 18
3069 18 98 155 359 124 35 114 167 189 405 111 282 737 1408 4277 12912 15056 3279 1258 395 651 369 210 185 71
2951 71 239 172 417 310 157 223 226 309 179 374 252 395 78 80 69 93 245 144 179 162 92 109 227 25 135 284 218 48
2813 48 160 144 59 105 103 67 128 255 182 248 17 175 186 147 164 165 118 159 77 88 88 45 47 16 187 163 77 136 65 274 204 208 124 217 152
2641 152 43 144 115 80 73 117 176 173 239 229 78 137 126 49 104 114 235 264 204 217 212 130 66 105 72 241 216 117 112 39 92 138 106 46
2474 46 102 19 90 196 12 143 45 98 39 188 34 140 96 28 170 282 81 39 25 38 74 25 210 196 283 229 126 135 102 128
2326 128 34 95 140 108 17 78 41 109 81 116 199 18 144 129 203 106 120 195 172 97 96 258 145 161 196 139 83 90 258 120 116 170 133
2163 133 189 381 272 191 164 195 220 186 143 107 215 83 193 280 202 101 198 295 238 157 211 137 77 79 156 256 162 186 149 135 29
2011 29 112 110 95 143 70 33 200 730 1206 544 134 111 177 135 129 226 123 148 72 133 96 139 95 208 301 170 215 83 245 119 133
1858 133 149 129 75 60 217 223 77 113 55 192 194 162 170 154 89 56 88 131 112 77 199 78 107 170 182 90 148 47 34 36 169 162 189 430
1691 430 193 357 217 339 86 163 70 66 209 267 141 49 114 117 97 213 193 53 122 18 61 16 37 48 13 169 189 164 120 117 165
1538 165 174 229 191 166 122 118 168 66 109 33 47 132 144 255 110 88 115 81 224 172 57 122 113 233 221 21 165 72 79 66 40 87 127
1376 127 184 133 155 52 237 32 55 104 147 323 236 56 159 219 158 86 125 147 33 102 108 125 130 87 81 79 128 64 172 181 143 245 204
1213 204 234 218 109 202 310 228 91 171 230 58 23 142 339 258 209 197 238 83 50 287 221 139 95 127 280 266 220 31 149
1071 149 322 173 173 117 119 141 158 47 128 88 154 182 201 115 97 205 235 143 113 117 25 46 161 250 160 48 35 186 123 75 89 195
913 195 75 77 111 99 35 150 102 89 97 51 62 246 199 77 172 183 72 81 163 220 252 78 122 219 120 135 72 194 213 97 122 172 234
751 234 109 69 192 301 295 92 40 37 88 71 53 15 160 129 85 160 89 285 244 77 58 84 71 171 166 207 228 172 150 218 132 52 139
588 139 187 102 107 126 116 119 123 55 129 230 247 405 612 273 530 91 93 129 231 255 234 163 207 33 81 56 103 97 154 43 148 125 151
426 151 328 223 38 127 175 95 163 214 163 156 94 64 93 73 59 47 170 160 66 129 118 77 129 55 64 115 147 75 155 196 42 243 74
263 74 135 153 55 140 222 393 194 56 151 222 88 168 52 112 31 89 114 64 72 16 173 150 57 167 252 120 148 70 114 219 307 184
106 184 177 248 151 186 115 45 141 75 28 99 38 65 164 209 100 239 235 23 19 42 23 68 131 175 236 78 233 123 129 94 195 160 35
-56 35 109 205 74 66 219 70 135 147 73 229 92 170 199 91 261 18 32 57 94 47 90 10 103 37 203 232 238 199 91 161 162 116
-214 116 256 264 128 198 143 39 49 201 300 143 86 49 87 72 65 152 251 227 51 120 14 105 108 88 234 97 202 128 97 99 141 125
-371 125 85 48 80 123 142 181 230 256 198 70 97 59 180 218 132 121 66 78 72 65 85 130 111 95 62 109 98 112 173
-514A73
##PAGE=	F1=1331.58
##FIRST=	4521.1594499999982872,	4521.1594499999982872,	0.32664129137992858887
##DATA TABLE=	(F2++(Y..Y)), PROFILE
4521 132 120 41 24 34 84 229 129 130 211 76 93 90 119 122 136 140 46 200 275 119 100 90 194 55 66 132 204 56 126 199 202 315 94
4359 94 67 80 127 176 149 97 160 208 17 234 105 164 210 146 153 219 204 91 137 159 44 65 41 13 174 88 52 89 103 102 81 165 79
4196 79 192 199 113 105 39 205 232 81 155 47 75 123 232 88 44 163 162 64 64 92 77 68 25 8 98 136 102 49 70 81 71 120 152 81
4029 81 102 89 163 122 45 166 147 157 125 31 120 221 128 39 20 84 128 232 108 85 48 102 165 150 174 90 136 146 95 151 78 176 177 58
3862 58 165 157 120 69 126 83 71 113 99 52 28 173 108 184 112 32 177 125 111 180 308 134 210 65 192 123 97 243 258 94 121
3709 121 149 128 79 113 115 163 67 51 19 144 109 78 75 216 195 94 158 180 104 188 223 87 160 67 217 116 30 195 266 16 187
3556 187 66 151 120 132 352 176 110 93 110 93 95 135 57 110 150 273 164 162 175 52 50 154 114 57 81 92 203 55 186 156 18
3404 18 37 72 109 128 135 266 50 207 58 37 131 67 112 116 45 64 151 93 176 134 109 143 172 190 55 126 182 209 141 171 179 106 115 146 157
3232 157 51 199 186 94 182 145 49 55 6 158 137 52 138 139 120 25 43 52 291 234 71 113 88 170 92 49 60 157 76 61 149 26 35 115
3064 115 200 370 135 28 119 182 178 394 124 304 770 1412 4443 9630 16553 4216 1575 618 635 387 275 218 37 254
2946 254 142 345 320 113 207 313 339 233 1081 624 422 82 74 71 128 231 178 169 161 109 99 238 13 120 214 167 20 158 149 70
2798 70 104 136 100 109 200 187 200 58 209 205 123 188 129 77 144 63 83 78 45 33 21 145 158 103 86 93 275 207 184 141 232 159 60 134 62
2626 62 101 88 133 173 145 244 299 2 94 160 37 154 146 273 266 180 217 169 73 53 85 59 257 188 83 125 49 100 121 155 93 95 41 102
2459 102 168 29 151 75 89 57 152 26 136 89 71 143 271 96 51 26 32 73 36 249 229 302 225 96 126 74 132 24 109 160 122
2306 122 44 71 42 92 118 123 196 19 162 103 166 103 163 202 131 120 128 243 128 156 157 84 57 95 271 151 88 168 143 205 364 280 188
2144 188 115 165 160 148 151 99 222 102 193 248 212 37 191 297 247 183 192 134 99 75 185 262 136 188 163 151 57 116 112 102 135 69 18
1981 18 176 767 1274 569 113 109 141 163 176 262 111 138 81 160 79 156 66 144 274 155 210 91 220 125 105 154 101 67 57 183
1834 183 242 96 103 64 200 218 171 147 129 112 34 98 97 120 49 210 71 142 179 197 90 101 31 29 10 184 147 178 428 121 213 123
1676 123 298 46 157 39 53 188 292 185 66 132 152 40 214 210 33 153 18 93 46 26 54 32 209 174 171 134 117 128 186
1533 186 238 188 145 115 120 182 68 91 40 30 128 128 241 122 90 117 82 249 196 3 154 75 246 221 19 164 112 79 91 33 89
1381 89 97 182 142 193 44 231 77 109 122 103 244 197 63 125 178 160 124 132 176 51 123 121 129 134 85 101 88 127 78 158 167 153 270 209 212
1209 212 219 121 214 325 200 70 211 231 63 35 136 351 262 200 174 252 68 17 294 179 120 108 93 261 202 190 28 134 316
1066 316 174 188 117 72 125 147 77 118 93 128 162 171 122 81 174 204 142 80 114 56 57 199 279 183 57 65 192 87 82 65 171 56 104
903 104 126 107 33 141 120 133 86 78 76 218 169 76 150 158 116 114 106 223 275 106 172 249 158 122 76 202 210 113 90 147 186 67 100 209 312
731 312 307 73 52 39 103 34 47 20 158 123 81 185 121 273 242 57 56 83 70 204 209 234 257 214 132 189 144 49 148 189 97 98 129 134 108
559 108 138 68 125 248 375 424 622 234 512 126 71 129 201 216 243 168 214 15 47 59 132 87 143 37 157 163 101 276 242 23
411 23 122 160 60 181 254 173 121 70 8 59 86 63 45 161 170 44 134 116 83 114 22 27 74 142 60 137 217 26 289 129 126 168 74 177
244 177 228 418 216 59 135 201 101 171 41 126 39 91 124 48 75 22 211 179 59 204 247 95 183 98 120 219 324 183 147 251
96 251 158 174 140 19 107 55 7 89 30 93 142 188 69 230 235 29 19 33 22 44 108 195 264 60 216 165 185 142 250 185 42 129
-61 129 197 85 67 209 54 136 160 63 214 106 136 161 160 273 31 46 40 132 79 76 46 76 30 219 245 233 177 77 166 164 92 233
-219 233 261 148 192 126 74 75 185 276 146 84 50 82 95 35 190 212 255 57 110 13 81 83 36 172 110 236 152 134 145 82 82 152 44
-381 44 125 145 103 187 227 222 179 57 90 91 160 246 74 129 49 84 78 64 51 103 119 108 43 114 138 117 159
-514A59
##PAGE=	F1=1321.74
##FIRST=	4521.1594499999982872,	4521.1594499999982872,	0.30546668171882629395
##DATA TABLE=	(F2++(Y..Y)), PROFILE
4521 90 90 50 31 65 102 205 116 124 207 66 86 105 128 109 121 163 79 218 272 138 107 58 187 26 64 126 234 54 95 172 193 318
4364 318 85 94 68 120 163 140 108 147 186 15 244 90 120 187 197 181 237 184 93 171 168 51 70 34 27 186 87 49 99 87 84 61 180
4201 180 56 154 157 78 113 45 197 195 54 136 13 47 114 226 103 57 178 134 27 25 107 64 91 16 9 119 145 90 11 55 74 31
4044 31 154 146 75 57 96 207 139 14 134 113 139 107 41 106 208 124 44 82 64 107 192 94 88 52 112 157 134 236 149 154 144 90 204
3881 204 94 190 186 102 159 152 113 96 107 99 44 132 96 61 40 162 167 188 99 48 198 97 108 172 299 122 209 75 157 118 85 239 241
3719 241 88 129 122 122 87 101 109 156 83 38 50 101 94 77 106 231 204 107 122 143 75 179 234 76 187 76 240 115 30 184 284 57
3561 57 200 32 88 85 136 355 209 133 69 104 108 50 86 16 72 168 273 160 167 188 30 29 165 126 69 92 94 207 98 204 176 28
3404 28 24 88 129 142 143 243 84 245 63 32 87 99 81 99 28 62 181 123 157 109 107 167 206 201 35 110 156 194 102 191 194 73 108 144
3236 144 158 15 184 139 101 157 135 92 73 28 212 164 54 147 140 78 49 78 66 279 256 72 80 63 140 68 30 49 185 93 147 147 24
3074 24 55 122 236 380 127 53 94 192 209 401 176 369 763 1313 4217 12257 18282 4145 1598 748 571 365 319 266
2956 266 73 274 126 276 294 88 176 410 362 346 2046 1330 491 104 77 85 154 224 193 164 169 117 97 224 41 81 130 129 43 162
2808 162 146 95 94 160 121 94 136 187 148 94 230 210 109 212 77 39 142 57 77 66 47 28 29 103 158 120 94 114 253 206 156 155 242
2646 242 154 87 125 52 127 107 153 169 114 248 355 87 66 188 32 196 189 303 261 145 209 114 17 50 61 49 261 153 64 129
2498 129 45 102 118 198 130 84 64 110 135 52 164 107 78 77 120 41 129 93 117 111 235 105 62 35 19 72 59 288 253 310 211 79 110
2336 110 42 124 33 120 186 137 64 56 78 66 166 145 185 63 174 73 115 127 198 207 102 125 150 217 99 163 133 44 33 94 265 171
2178 171 57 168 156 210 329 270 190 75 138 82 92 154 94 216 128 184 208 231 53 184 289 243 202 168 131 110 93 193 243 95
2031 95 189 172 169 89 120 117 104 120 47 54 152 696 1194 535 95 94 91 174 217 285 101 127 80 171 62 172 43 74 238 146 186 113 172
1868 172 115 76 146 85 86 69 152 252 111 88 73 194 222 165 122 106 121 16 106 70 126 35 215 84 165 196 212 106 50 26 25 38
1711 38 188 126 165 404 48 101 119 276 88 136 20 43 150 301 218 68 131 185 27 195 205 23 167 50 129 66 13 71
1573 71 52 243 151 180 147 117 91 184 232 183 115 108 125 183 68 78 64 63 118 113 216 145 85 124 81 266 209 63 179 38 239 199 28
1410 28 149 139 95 123 25 91 77 170 145 214 95 229 114 177 162 73 163 143 64 78 124 165 162 135 201 96 141 129 129 142 82 118 94 123
1243 123 83 140 159 154 285 202 174 217 132 222 327 166 104 243 228 65 68 117 341 248 173 152 259 39 40 285 124 115 133 61 224
1090 224 123 146 27 100 272 160 198 119 16 112 150 123 109 123 97 129 126 113 70 137 172 134 53 96 91 62 230 304 205 76 104 206
933 206 81 102 62 155 60 115 133 110 38 123 127 182 122 106 92 181 136 90 156 134 168 145 34 218 281 130 205 266 197 101 89 201 202 128
766 128 57 108 131 20 118 220 302 289 55 78 43 107 23 38 23 144 114 70 202 152 245 217 46 74 87 64 226 230 238 270 249 115
608 115 152 147 60 139 163 76 90 130 143 104 136 73 105 246 487 453 643 266 517 171 59 130 181 178 247 175 201 44 51 65 163 93 118
446 118 29 162 190 66 208 244 15 102 135 16 198 281 172 81 66 59 56 96 73 37 138 172 31 131 117 93 122 56 32 54 139
293 139 43 125 221 10 315 166 107 165 101 196 218 410 219 63 118 166 106 161 31 131 37 93 133 46 69 36 217 192 72 221
145 221 232 120 203 130 125 200 321 189 107 237 149 164 159 3 77 47 18 86 83 132 111 160 29 197 221 50 33 27 41 33 75 217 275
-17 275 53 179 210 224 179 284 191 54 146 180 117 81 183 30 145 175 54 178 110 92 141 215 258 32 72 22 168 99 58 66
-165 66 36 37 217 242 204 154 66 164 155 64 196 248 160 176 107 107 103 173 256 161 76 59 69 116 18 237 157 279 70 117 19 72 59 38 104
-337 104 150 267 159 150 195 40 59 213 134 220 162 41 173 211 173 152 52 72 115 137 264 27 139 33 86 83 75 22 66 114 115
-490 115 60 108 168 111 139
-514A39
##PAGE=	F1=1311.89
##FIRST=	4521.1594499999982872,	4521.1594499999982872,	0.25273895263671875
##DATA TABLE=	(F2++(Y..Y)), PROFILE
4521 36 59 55 50 90 112 166 100 109 187 63 74 129 145 93 98 164 114 232 261 155 111 29 185 13 60 107 241 89 71 149 182 296 70
4359 70 122 53 117 142 126 112 135 170 36 245 70 73 156 238 194 240 161 88 204 178 54 74 35 44 181 111 43 110 86 67 43 192 38
4196 38 117 100 53 118 49 187 142 28 115 18 18 93 200 120 71 181 107 21 15 111 43 111 9 12 159 151 78 30 107 86 46 195 125 79
4029 79 16 129 245 154 33 103 83 119 93 58 82 176 111 50 133 48 86 140 93 77 68 129 138 104 283 207 159 144 77 231 104 187 175
3867 175 134 159 145 105 123 73 109 36 135 91 67 44 156 225 182 96 80 204 81 111 159 283 113 195 80 112 104 72 233 214 73
3714 73 136 102 104 98 76 96 146 105 76 119 80 77 78 126 221 207 119 96 104 57 165 233 74 219 81 267 123 50 172 286 105 198 7
3551 7 69 103 136 345 232 141 52 94 118 41 43 36 55 174 262 166 171 198 39 20 164 120 81 103 107 202 144 199 180 57 32 106 156 150 146 210
3374 210 114 279 81 39 76 126 76 88 23 93 196 146 144 93 93 182 219 189 51 93 132 191 58 194 198 32 94 140 156 13 165 85
3217 85 114 119 118 133 104 54 252 175 50 150 151 40 80 115 77 252 278 114 87 77 104 60 23 67 198 110 215 145 37 101 116 252
3059 252 384 100 103 78 185 259 423 249 446 745 1218 3865 17744 19672 3376 1405 773 467 308 337 306 89 294
2946 294 117 221 245 68 135 487 378 495 3151 2183 588 160 92 112 166 225 187 158 185 117 134 187 60 27 45 149 80 168
2808 168 139 125 73 177 130 84 76 184 98 120 235 197 105 231 30 58 151 65 72 55 49 50 33 68 159 122 150 129 211 200 127 162 237 145
2641 145 124 131 98 149 130 174 164 85 249 385 171 88 208 36 226 236 320 246 102 196 57 72 53 36 40 246 113 64 124 23
2493 23 90 128 224 153 74 84 108 98 65 177 137 68 92 105 42 122 105 148 79 187 116 70 44 5 83 92 320 263 310 193 84 90 14 109
2326 109 45 124 212 150 79 48 120 51 213 172 169 114 176 51 65 170 222 205 91 112 156 175 63 184 147 73 18 84 235 175 53
2173 53 179 164 203 284 244 189 69 127 61 26 150 97 195 159 164 176 254 104 178 275 228 214 145 136 111 109 180 202 47 190 178 188 119 122
2006 122 121 99 101 16 89 133 534 972 439 85 67 42 171 245 293 90 120 66 164 46 181 34 61 198 143 146 132 109 98 45 128
1853 128 74 124 81 133 251 121 70 78 176 203 152 101 91 116 29 111 56 129 62 215 122 171 213 220 130 17 47 42 85 180 99 152 365 77
1686 77 179 159 292 162 105 13 50 101 291 230 51 117 206 82 163 181 53 164 90 156 70 6 86 70 263 121 186 152 111 59
1538 59 170 211 173 73 109 133 173 63 72 92 112 109 101 187 181 75 145 71 271 211 117 196 20 210 157 44 119 148 116 157 32 92 83
1376 83 147 146 217 156 253 111 252 206 77 91 87 65 23 68 173 195 133 212 138 150 129 126 153 77 127 96 118 82 122 158 144 285 184 134
1209 134 211 138 223 320 142 167 263 217 64 102 90 311 223 136 131 253 1 68 263 68 124 157 39 173 44 92 30 65 207 139
1061 139 200 124 45 104 168 159 108 152 54 87 77 96 68 102 149 121 43 63 113 62 253 318 214 97 142 214 91 113 62 150 90 107 131
898 131 109 46 96 121 222 179 124 100 143 110 103 175 112 210 167 48 203 266 143 217 271 235 86 112 189 194 147 40 61 76 23 121 220
736 220 271 248 40 98 46 94 48 56 25 119 99 57 211 175 203 176 55 100 88 53 233 225 218 267 272 105 106 140 79 118 122 40 81 128 142 108
559 108 116 66 78 230 568 455 673 350 565 225 57 131 183 153 247 193 169 61 76 73 192 113 82 19 164 202 71 133 227 17
411 17 76 128 39 212 290 156 45 69 114 96 101 84 22 105 160 18 118 121 101 135 84 67 79 142 29 118 211 38 319 181 86 142
254 142 129 195 189 373 205 65 106 121 111 136 31 131 23 96 139 43 67 55 192 186 73 210 208 166 208 154 127 165 298 198 61
101 61 209 125 155 170 20 62 53 48 90 124 168 75 135 19 159 206 61 43 39 54 45 40 236 264 60 132 248 241 203 299 178 71 156 153
-66 153 165 102 143 22 160 189 69 124 103 48 143 250 220 20 105 18 195 111 44 65 9 66 200 220 154 130 53 156 135 39 153
-219 153 233 161 157 91 135 133 168 240 180 62 81 47 127 82 279 102 295 78 137 40 80 35 83 42 190 290 146 146 243 59 74 261
-376 261 218 297 165 52 138 185 119 115 63 62 124 118 270 85 151 19 81 73 89 0 29 101 114 83 96 183 99 116
-514A16
##PAGE=	F1=1302.05
##FIRST=	4521.1594499999982872,	4521.1594499999982872,	0.23294988274574279785
##DATA TABLE=	(F2++(Y..Y)), PROFILE
4521 28 44 53 72 110 113 125 81 85 157 65 61 151 164 81 69 145 139 239 244 165 114 22 184 36 47 75 223 124 55 128 170 252 53 143 37
4349 37 121 117 112 110 120 163 43 241 57 45 120 264 192 231 148 87 230 186 57 78 42 58 163 140 36 113 93 53 31 194 39 87
4191 87 35 72 119 54 176 83 8 94 36 40 61 155 139 80 169 90 45 41 99 21 126 12 18 192 148 64 67 171 107 95 235 93 93 50
4024 50 160 269 169 55 72 54 99 92 73 48 134 96 52 166 48 68 85 103 54 87 149 115 59 308 254 148 147 57 235 110 173
3871 173 147 147 156 142 99 143 30 124 65 126 80 68 38 154 273 164 97 108 194 93 121 146 263 111 171 77 64 88 58 228 181 52
3714 52 144 95 80 104 40 80 136 127 120 181 99 61 79 134 191 197 124 85 72 57 147 219 75 250 82 291 140 78 158 277 153 189 15
3551 15 116 156 131 322 245 133 56 86 120 64 13 76 59 167 242 180 177 197 48 15 147 101 93 112 125 191 186 172 170 96 59 124 179 150
3384 150 141 170 135 302 104 53 110 153 94 84 33 137 191 155 132 85 70 186 213 161 70 76 113 191 30 185 193 24 75 133 150 35
3227 35 148 40 132 71 113 168 130 72 274 169 53 146 168 15 104 147 82 216 286 172 114 112 79 88 28 108 189 125 249 135 47
3074 47 161 100 244 373 70 157 121 161 299 442 307 500 713 1158 3510 23059 21467 2354 1116 718 343 243 335
2961 335 333 98 305 118 184 193 48 92 526 388 640 4230 3041 682 241 116 146 171 226 163 150 206 112 195 132 69 59 35
2823 35 216 117 171 127 156 47 190 128 76 36 181 59 133 224 168 102 236 58 105 168 88 77 48 49 77 34 46 158 106 198 142 161
2665 161 193 101 163 215 144 163 151 140 163 149 190 157 67 244 385 238 130 219 46 245 279 321 219 59 175 9 130 56 25
2523 25 33 209 81 67 111 24 64 146 229 160 68 95 94 63 76 184 159 57 103 106 30 121 120 162 55 151 137 72 47 43 112 131 342 258 305
2350 305 177 100 67 17 97 60 118 232 162 92 58 154 68 250 193 151 164 164 55 42 214 234 196 90 84 149 118 47 211 181 113 14
2193 14 69 184 167 103 205 161 194 240 205 180 97 135 139 44 137 108 162 196 135 166 270 141 171 255 206 214 124 154 104 113 150 147 22 186
2026 186 181 206 141 121 120 88 85 41 118 120 325 651 287 82 33 48 155 255 281 73 119 42 139 34 179 38 119 156 143 96 140 47
1868 47 90 13 104 58 164 91 125 237 126 53 80 151 165 142 86 87 99 55 112 58 131 101 213 173 162 223 216 151 45 72 69 128 159 66
1701 66 142 322 153 273 167 323 222 70 15 70 54 262 219 21 97 213 126 131 142 92 149 128 168 59 13 91 85 270 86 183
1553 183 140 98 36 149 180 160 18 117 140 155 54 73 114 155 112 93 163 222 65 178 48 263 204 157 203 39 160 97 61 83
1405 83 142 132 189 57 96 115 118 151 204 214 307 77 326 241 111 46 57 77 35 21 177 213 130 209 164 145 115 121 163 72 129 92 112 77
1238 77 116 160 122 271 157 113 198 135 219 308 141 231 269 195 62 131 62 266 195 96 110 232 44 84 233 40 137 175 32 114
1090 114 51 46 34 67 144 119 196 134 100 99 193 180 114 176 9 41 45 83 75 74 135 106 53 27 128 55 265 318 204 115 172 207 96 105 48
918 48 149 127 82 117 108 52 67 107 249 234 130 97 110 96 105 190 93 231 175 123 180 227 147 210 265 267 95 137 165 192 168 51 24 36
751 36 58 110 211 229 192 26 104 47 65 71 94 27 91 80 51 210 188 156 135 72 127 83 42 224 196 177 249 281 109 51 117 100 95 101 14
578 14 67 123 134 121 82 48 52 204 613 405 707 438 647 283 59 134 204 144 244 219 135 64 93 84 214 137 46 23 169 200 91
426 91 67 193 28 72 154 98 220 280 126 57 81 149 134 98 91 17 69 135 5 98 128 103 137 89 93 109 150 23 112 194 63 302 176
263 176 69 104 150 172 143 315 178 66 105 78 126 97 41 134 6 103 142 30 82 78 143 164 59 170 177 207 201 166 123 119 259 208 16
101 16 179 94 146 173 35 63 70 84 98 143 196 41 125 62 144 205 58 52 63 69 75 32 248 232 66 93 270 234 216 302 150 98 155 121
-66 121 224 133 91 47 177 200 105 55 84 28 153 266 169 7 140 32 211 117 48 46 53 105 176 180 92 106 43 150 101 21 114 224
-224 224 153 143 85 157 162 168 219 193 45 111 22 128 151 306 83 302 84 157 72 94 15 118 19 218 301 117 143 286 86 98
-371 98 291 281 341 150 134 87 158 84 70 84 73 115 104 262 151 165 9 70 51 100 16 14 88 106 94 84 185 83 97
-514I7
##PAGE=	F1=1292.2
##FIRST=	4521.1594499999982872,	4521.1594499999982872,	0.25112742185592651367
##DATA TABLE=	(F2++(Y..Y)), PROFILE
4521 82 63 47 96 123 104 104 56 62 122 71 53 166 185 85 38 115 151 238 223 168 118 36 183 59 22 38 183 144 46 109 159 196 41
4359 41 152 25 129 99 101 105 104 163 33 234 70 51 83 269 176 214 146 97 245 186 62 86 47 62 135 159 30 105 100 46 35 180
4201 180 54 67 32 118 117 63 167 27 2 73 59 79 32 99 164 89 141 84 67 59 76 7 135 16 30 210 131 53 94 222 123 138
4044 138 265 58 115 89 174 273 182 59 42 23 80 104 80 5 100 92 52 179 63 62 36 113 30 104 171 96 9 305 280 125 151 38
3886 38 221 116 150 112 143 144 147 100 151 14 150 104 109 67 65 24 147 301 140 101 130 179 128 139 134 240 118 139 68 20 85 43 225
3724 225 148 32 152 94 58 98 6 66 127 145 160 228 134 52 82 133 148 176 118 81 61 63 128 189 69 274 80 302 158 106 138 260
3566 260 194 185 35 161 205 119 291 245 109 66 82 118 78 8 110 68 147 218 194 181 183 41 43 129 80 103 118 141 177 220 129 150 138
3404 138 87 139 186 140 129 127 144 307 126 70 149 182 118 87 48 178 170 147 116 85 51 179 192 129 86 61 99 187 46 167 183 71
3246 71 59 122 143 63 131 57 150 44 129 195 144 83 275 151 69 136 187 31 121 171 88 175 275 222 142 142 79 127 42 159 162 138 242
3084 242 112 53 218 78 212 340 57 199 174 120 304 435 322 507 645 1073 3057 25417 22301 1470 840 620
2976 620 224 206 318 343 109 295 127 162 152 36 56 518 394 744 5106 3760 741 328 141 182 174 214 127 138 224 107
2848 107 252 71 68 131 99 291 153 166 113 183 38 198 121 69 37 178 48 136 201 129 95 224 102 145 185 125 95 50 47 96 34
2695 34 39 155 76 218 153 131 193 82 162 175 165 198 174 161 167 156 196 144 66 233 355 276 166 222 61 254 310 305 179 28 145
2542 145 38 169 59 42 27 154 87 61 94 70 26 170 220 152 69 97 67 59 93 180 167 48 112 113 25 133 133 161 46 152 169 71
2385 71 47 91 153 172 348 236 293 164 117 45 33 100 82 102 241 171 103 76 173 100 268 202 135 207 143 72 56 246 233 180 97 51
2227 51 131 51 80 232 208 133 23 53 119 154 170 240 147 194 216 161 166 127 149 213 99 115 122 121 237 106 169 272 161 162 232 179 205 106
2060 106 180 91 105 114 86 51 176 180 219 153 115 114 72 79 78 141 109 129 342 107 79 8 90 129 245 252 50 124 17 103 26 162 42 171
1893 171 114 141 45 132 48 100 20 84 31 195 102 121 211 125 52 87 121 115 142 70 94 74 84 114 68 131 138 208 222 142 222 197 160 69 90
1720 90 98 162 132 32 139 282 227 332 145 324 251 40 20 93 57 222 189 20 79 208 152 112 94 128 127 153 166 37 16 86 96
1568 96 264 51 166 110 82 23 123 144 142 47 122 140 131 41 80 124 181 130 86 151 257 61 206 12 246 192 181 198 63 100 35
1415 35 77 54 124 136 218 85 101 157 88 166 184 267 382 116 389 259 146 47 65 103 92 27 175 214 128 191 170 126 87 119 169 62
1258 62 123 84 105 74 126 160 90 242 124 125 176 123 208 292 158 284 258 163 65 152 46 209 169 63 91 196 88 89 201 60 148
$$ [...]
-514A06
##END NTUPLES=	nD NMR SPECTRUM
##END=	
##END=	
