##TITLE=	X$EQolnGTqujJfjuNjlReA.61.ser
TM-VI-251, Na+PMB-pyr cosy

##JCAMP-DX=	6.0	$$ MestReNova 14.3.0-30573
##DATA TYPE=	LINK
##BLOCK_ID=	1
##BLOCKS=	2    
##ORIGIN=	Mestrelab Research S.L.
##OWNER=	hrzepa
##$MNOVA/LINK_BLOCK_TYPE=	ITEM	$$ NMR Spectrum
##$MNOVA/ITEM/POLYGON=	(XY..XY)
5321,5835
8722,5835
8722,8208
5321,8208
5321,5835
##$MNOVA/ITEM/Z=	0
##$MNOVA/ITEM/ANGLE=	0
##TITLE=	X$EQolnGTqujJfjuNjlReA.61.ser
##JCAMP-DX=	6.0	$$ MestReNova 14.3.0-30573
##BLOCK_ID=	2
##DATA TYPE=	MNOVA NMR VIEW DATA
##DATA CLASS=	MNOVA VIEW DATA
##$MNOVA/2D/THRESHOLD=	24.377576828002929688
##$MNOVA/ITEM/ZOOM/X=	-1.2849598716208046056,	11.297249999948046906
##$MNOVA/ITEM/ZOOM/Y=	-1.2849598716208046056,	11.297249999948046906
##END=	
##TITLE=	X$EQolnGTqujJfjuNjlReA.61.ser
##JCAMP-DX=	6.0	$$ MestReNova 14.3.0-30573
##BLOCK_ID=	3
##DATA TYPE=	nD NMR SPECTRUM
##DATA CLASS=	NTUPLES
##NUMDIM=	2
##ORIGIN=	Bruker BioSpin GmbH
##OWNER=	nmr
##.OBSERVE FREQUENCY=	400.20200099999999566
##.OBSERVE NUCLEUS=	^1H
##.SOLVENT NAME=	MeOD
##.PULSE SEQUENCE=	cosygpqf
##LONGDATE=	2022/01/24 17:46:26.000
##.ACQUISITIONMODE=	SIMULTANEOUS (DQD)
##$ORIGINAL FORMAT=	Bruker XWIN-NMR
##$MNOVA/SCALES_VERSION=	9
##$PARAMETER FILE=	(acqu2s, ASCII, /private/var/folders/f6/rjf_tdyn2v98c5c0wvkgn4s80000gn/T/X$EQolnGTqujJfjuNjlReA/61/acqu2s, 0)
$$ ##TITLE= Parameter file, TOPSPIN		Version 3.2
$$ ##JCAMPDX= 5.0
$$ ##DATATYPE= Parameter Values
$$ ##NPOINTS= 221	$$ modification sequence number
$$ ##ORIGIN= Bruker BioSpin GmbH
$$ ##OWNER= nmr
$$ $$ 2022-01-24 17:55:25.778 +0000  nmr@CZC2439F63
$$ $$ /opt/topspin/data/agmb/nmr/Jan24-2022/61/acqu2s
$$ $$ process /opt/topspin3.2/prog/mod/go
$$ ##$ACQT0= 0
$$ ##$BF1= 400.2
$$ ##$FnMODE= 1
$$ ##$NUC1= <1H>
$$ ##$NusJSP= 0
$$ ##$NusT2= 1
$$ ##$NusTD= 220
$$ ##$O1= 2001.00000000702
$$ ##$SFO1= 400.202001
$$ ##$SW= 12.5944462247833
$$ ##$SW_h= 5040.32258064516
$$ ##$TD= 220
$$ ##END=
$$ 
##$PARAMETER FILE=	(acqus, ASCII, /private/var/folders/f6/rjf_tdyn2v98c5c0wvkgn4s80000gn/T/X$EQolnGTqujJfjuNjlReA/61/acqus, 0)
$$ ##TITLE= Parameter file, TOPSPIN		Version 3.2
$$ ##JCAMPDX= 5.0
$$ ##DATATYPE= Parameter Values
$$ ##NPOINTS= 12	$$ modification sequence number
$$ ##ORIGIN= Bruker BioSpin GmbH
$$ ##OWNER= nmr
$$ $$ 2022-01-24 17:55:29.236 +0000  nmr@CZC2439F63
$$ $$ /opt/topspin/data/agmb/nmr/Jan24-2022/61/acqus
$$ $$ process /opt/topspin3.2/prog/mod/shimcntl
$$ ##$ACQT0= 1000000
$$ ##$AMP= (0..31)
$$ 100 100 100 100 100 100 100 100 100 100 100 100 100 100 100 100 100 100
$$ 100 100 100 100 100 100 100 100 100 100 100 100 100 100
$$ ##$AMPCOIL= (0..19)
$$ 0 0 0 0 0 0 0 0 0 0 0 0 0 0 0 0 0 0 0 0
$$ ##$ANAVPT= -1
$$ ##$AQSEQ= 0
$$ ##$AQ_mod= 3
$$ ##$AUNM= <au_zg>
$$ ##$AUTOPOS= <51 >
$$ ##$BF1= 400.2
$$ ##$BF2= 400.2
$$ ##$BF3= 400.2
$$ ##$BF4= 400.2
$$ ##$BF5= 400.2
$$ ##$BF6= 400.2
$$ ##$BF7= 400.2
$$ ##$BF8= 400.2
$$ ##$BYTORDA= 0
$$ ##$CAGPARS= (0..11)
$$ 0 0 0 0 0 0 0 0 0 0 0 0
$$ ##$CFDGTYP= 0
$$ ##$CFRGTYP= 9
$$ ##$CHEMSTR= <none>
$$ ##$CNST= (0..63)
$$ [...]
$$ 0 0 0 0
$$ ##$ShimPowMaxUC= (0..63)
$$ 130000 130000 130000 130000 130000 130000 130000 130000 130000 130000 130000
$$ 130000 130000 130000 130000 130000 130000 130000 130000 130000 0 0 0 0
$$ 0 0 0 0 0 0 0 0 0 0 0 0 0 0 0 0 0 0 0 0 0 0 0 0 0 0 0 0 0 0 0 0 0 0 0 0
$$ 0 0 0 0
$$ ##$ShimPowMaxUG= (0..63)
$$ 524287 524287 524287 524287 524287 524287 524287 524287 524287 524287 524287
$$ 524287 524287 524287 524287 524287 524287 524287 524287 524287 0 0 0 0
$$ 0 0 0 0 0 0 0 0 0 0 0 0 0 0 0 0 0 0 0 0 0 0 0 0 0 0 0 0 0 0 0 0 0 0 0 0
$$ 0 0 0 0
$$ ##$ShimPowRcbType= 3
$$ ##$ShimPowRes= (0..63)
$$ 1e-20 1e-20 1e-20 1e-20 1e-20 1e-20 1e-20 1e-20 1e-20 1e-20 1e-20 1e-20
$$ 1e-20 1e-20 1e-20 1e-20 1e-20 1e-20 1e-20 1e-20 0 0 0 0 0 0 0 0 0 0 0 0
$$ 0 0 0 0 0 0 0 0 0 0 0 0 0 0 0 0 0 0 0 0 0 0 0 0 0 0 0 0 0 0 0 0
$$ ##$ShimPowRng0= (0..63)
$$ 1 1 1 1 1 1 1 1 1 1 1 1 1 1 1 1 1 1 1 1 0 0 0 0 0 0 0 0 0 0 0 0 0 0 0 0
$$ 0 0 0 0 0 0 0 0 0 0 0 0 0 0 0 0 0 0 0 0 0 0 0 0 0 0 0 0
$$ ##$ShimPowRng1= (0..63)
$$ 1 1 1 1 1 1 1 1 1 1 1 1 1 1 1 1 1 1 1 1 0 0 0 0 0 0 0 0 0 0 0 0 0 0 0 0
$$ 0 0 0 0 0 0 0 0 0 0 0 0 0 0 0 0 0 0 0 0 0 0 0 0 0 0 0 0
$$ ##$ShimPowRng2= (0..63)
$$ 1 1 1 1 1 1 1 1 1 1 1 1 1 1 1 1 1 1 1 1 0 0 0 0 0 0 0 0 0 0 0 0 0 0 0 0
$$ 0 0 0 0 0 0 0 0 0 0 0 0 0 0 0 0 0 0 0 0 0 0 0 0 0 0 0 0
$$ ##$ShimPowRng3= (0..63)
$$ 1 1 1 1 1 1 1 1 1 1 1 1 1 1 1 1 1 1 1 1 0 0 0 0 0 0 0 0 0 0 0 0 0 0 0 0
$$ 0 0 0 0 0 0 0 0 0 0 0 0 0 0 0 0 0 0 0 0 0 0 0 0 0 0 0 0
$$ ##$ShimSysFunc= (0..63)
$$ 1 2 3 4 5 7 9 11 15 16 8 10 12 14 6 17 13 18 19 20 0 0 0 0 0 0 0 0 0 0
$$ 0 0 0 0 0 0 0 0 0 0 0 0 0 0 0 0 0 0 0 0 0 0 0 0 0 0 0 0 0 0 0 0 0 0
$$ ##$ShimSysMatrix= 0
$$ ##$ShimSysType= 1
$$ ##$TFXNUM= 0
$$ ##$TRIPLO2= 0
$$ ##$VTU= 2
$$ ##$VTUETH= <149.236.99.20>
$$ ##$VTUTY= <no>
$$ ##$WBREFAM= (0..15)
$$ 135.5 97.7 100 100 100 100 100 100 100 100 100 100 100 100 100 100
$$ ##$WBREFLM= (0..15)
$$ 0 0 0 0 0 0 0 0 0 0 0 0 0 0 0 0
$$ ##$WBREFPH= (0..15)
$$ 72.26 -67.22 0 0 0 0 0 0 0 0 0 0 0 0 0 0
$$ ##$WBSGU= (0..15)
$$ 0 0 0 0 0 0 0 0 0 0 0 0 0 0 0 0
$$ ##$XFAC= 2
$$ ##END=
$$ 
##$DECIM=	3968
##$DSPFVS=	20
##.ACQUISITIONSCHEME=	NOT PHASESENSITIVE
##NTUPLES=	nD NMR SPECTRUM
##VAR_NAME=	FREQUENCY1,	FREQUENCY2,	SPECTRUM
##SYMBOL=	F1,	F2,	Y
##.NUCLEUS=	1H,	1H
##.OBSERVE FREQUENCY=	400.20200099999999566,	400.20200099999999566
##VAR_TYPE=	INDEPENDENT,	INDEPENDENT,	DEPENDENT
##VAR_FORM=	AFFN,	AFFN,	ASDF
##VAR_DIM=	1024,	1024,	1048576
##UNITS=	HZ,	HZ,	ARBITRARY UNITS
##FIRST=	4521.1594499999982872,	4521.1594499999982872,	0.17127801477909088135
##LAST=	-514.24094062501069402,	-514.24094062501069402,	0.2140595167875289917
##MIN=	-514.24094062501069402,	-514.24094062501069402,	0.00033483299193903803825
##MAX=	4521.1594499999982872,	4521.1594499999982872,	3118.341064453125
##FACTOR=	1,	1,	0.0014818027345141451985
##PAGE=	F1=4521.16
##FIRST=	4521.1594499999982872,	4521.1594499999982872,	0.17127801477909088135
##DATA TABLE=	(F2++(Y..Y)), PROFILE
$$ [...]
##PAGE=	F1=-430.564
##FIRST=	4521.1594499999982872,	4521.1594499999982872,	0.19998291134834289551
##DATA TABLE=	(F2++(Y..Y)), PROFILE
$$ plain form
2749 163 309 500 561 456 225 187 151 82 88 158 79 104 108 159 228 111 107 64 153 84 161 129 134 54 68 123 66 144 132 199 245 81 36 210
2582 210 183 76 157 118 52 62 158 287 225 31 35 33 133 106 97 98 135 58 77 82 88 93 176 185 158 190 194 63 144 82 37 47 128 117 33 79 58
2400 58 101 78 142 94 57 91 88 317 85 201 80 73 89 113 146 85 314 163 145 176 178 140 245 177 67 19 96 91 203 116 170 146 95
2237 95 127 81 142 66 77 232 235 191 172 235 114 34 80 101 204 113 218 148 45 60 71 42 53 320 296 91 38 182 230 287 152
2085 152 40 189 43 182 63 387 860 8403 12340 2150 400 100 167 328 153 295 274 358 813 1098 4773 43474
1976 43474 50079 9758 1972 1112 419 407 311 499 50 340 367 166 295 184 323 204 138 89 130 171 138 37 281 33
1858 33 92 111 183 12 69 109 105 46 211 161 95 52 22 163 290 137 120 117 62 106 245 229 132 139 135 140 69 30 71 62 240 72 253 707
1691 707 1690 2065 1822 834 302 64 63 110 143 89 129 72 112 107 179 197 85 24 163 235 45 143 200 120 92 56 23 95 174 211 181
$$ packed form
2749A63J46J91O1j05k31l8l6o9OP0p9K5MN1O9j17mm3Q9o9P7l2Nq0J4N5n7P8j2O7M6j64m5J74
2582B10k7j07Q1l9o6J0R6J29o2j94MkJ00k7rJL7p7J9NONQ3Rk7L2Mj31Q1o2m5J0Q1j1q4M6k1
2400E8M3k3O4m8l7L4lK29k32J16j21pJ6K4L3o1K29j51j8L1Kl8J05o8j10m8P7nJ12q7N4k4n1
2237I5L2m6O1p6J1J55Lm4j9O3j21q0M6K1J03r1J05p0j03J5J1k9J1K67k4k05n3J44M8N7j35
2085A52j12J49j46J39j19L24M73P543L937j0190j750l00O7J61j75J42k1Q4M55K85L675L8701
1976D3474O605m0321p786q60o93j2r6J88m49K90K7k01J29j11J39j19o6m9M1M1l3j01K44k48
1858C3N9J9P2j71N7M0mn9J65n0o6m3l0J41J27j53j7ln5M4J39j6r7PmNp1l9M1rJ78j68J81M54
1691G07R83L75k43r88n32k38jM7L3n4M0n7M0nP2J8j12o1J39P2j90R8N7q0k8l6l3P2P9L7l0
$$ plain form
1538 181 171 303 34 94 474 721 562 198 290 175 91 51 122 82 129 153 202 86 67 116 257 82 277 126 123 164 91 174 80
1396 80 77 77 386 94 110 110 59 48 81 60 311 209 510 237 97 194 148 208 153 58 54 38 70 167 121 173 80 235 263 107 178 133 205
1233 205 142 124 79 24 184 187 126 160 176 91 112 145 48 75 86 73 117 205 118 63 85 88 159 194 302 66 111 89 124 216 94 15 12 114
1066 114 202 70 107 28 49 152 132 76 185 131 141 124 36 166 32 151 245 116 100 124 130 191 169 142 34 146 120 159 126 70 153
913 153 123 104 74 144 206 198 118 133 127 89 103 175 193 104 110 185 66 145 161 84 147 155 141 166 202 101 50 93 108 145 44 115 149 79 50 3
736 3 139 179 133 175 141 48 163 147 55 101 191 190 117 150 116 131 167 140 104 54 112 126 132 126 131 147 105 77 110 181 128 46 193 128 78 81 85 258
549 258 194 1057 3297 1655 929 3332 1629 345 150 109 17 347 113 223 230 271 7 140 28 93 195 93 173 168 84 20
421 20 97 52 260 209 35 65 49 155 174 75 83 140 65 134 41 177 177 73 136 178 128 226 215 174 154 115 145 174 150 122 190 92 109 130
$$ packed form
1538A81j0J32k69O0L80K47j59l64R2j15q4m0P1m0M7K4M9j16j9M9J41j75J95j51lM1p3Q3r4
1396H0l%L09k92J6%n1j1L3k1K51j02L01k73j40R7m6O0n5r5mj6L2R7m6N2r3J55K8j56P1m5P2
1233B05o3j8m5n5J60Lo1L4J6q5K1L3r7K7J1j3M4Q8q7n5K2LP1L5J08k36M5k2L5R2j22p9lJ02
1066A14Q8j32L7p9K1J03k0n6J09n4J0j7q8J30j34J19R4j29j6K4OO1k2k7j08J12k6L9l3n6Q3
913A53l0j9l0P0O2qq0J5ol8J4P2J8q9OP5j19P9J6p7O3Qj4K5L6j01n1M3J5L7j01P1L4p0k9m7
736CJ36M0m6M2l4r3J15j6r2M6R0jp3L3l4J5L6k7l6n0N8J4OoNJ6m2k8L3P1n3q2J47o5n0LMJ73
549B58o4Q63K240j642p26K403j703j284j95m1r2L30k34J10PM1k64J33j12O5J02j02Q0nq4o4
421B0P7m5K08n1j74L0j6J06J9r9QN7p5O9r3J36%j04O3M2n0R8j1m1k0l9L0K9k4k8O8r8J7K1
$$ plain form
254 130 80 150 184 91 73 68 94 20 125 120 107 103 164 175 35 86 180 45 77 38 131 304 225 105 195 109 143 135 144 217 116 124 60 101 66
81 66 163 170 171 101 210 185 98 15 196 149 182 166 52 139 191 119 184 96 186 91 166 2 71 101 65 114 195 248 184 113 91 141 324 239 35
-91 35 226 63 251 138 34 134 244 142 171 96 276 65 167 22 172 176 162 39 93 195 94 133 158 135 77 51 124 94
-229 94 85 169 15 171 261 1 250 112 112 67 69 116 115 101 103 74 153 195 69 148 124 21 142 152 55 171 201 246 132 133 119 136 100
-391 100 89 60 72 167 188 66 97 79 67 36 148 106 154 45 72 181 192 44 118 85 123 7 147 106 77
$$ packed form
254A30n0P0L4r3j8nK6p4J05nj3mO1J1j40N1R4j35L2l9R3J73p9j20R0q6L4qRP3j01Qo4M1l5
81F6R7PJp0J09k5q7q3J81m7L3j6j14Q7N2p2O5q8R0r5P5j64O9L0l6M9Q1N3o4p1k2N0J83q5k04
-91C5J91j63J88j13j04J00J10j02K9p5J80k11J02j45J50Mj4j23N4J02j01L9K5k3n8k6P3l0
-229I4rQ4j54J56R0k60K49j38%m5KM7jj4Kk9P9M2j26P9k4j03J21J0r7J16L0M5j14Jj4J7l6
-391A00j1k9J2R5K1j22L1j8j2l1J12m2M8j09K7J09J1j48P4l3L8j16J40m1k9
-514G7
##PAGE=	F1=-440.408
##FIRST=	4521.1594499999982872,	4521.1594499999982872,	0.11301771551370620728
##DATA TABLE=	(F2++(Y..Y)), PROFILE
$$ plain form
4521 149 27 199 108 157 132 79 90 29 49 105 142 163 89 215 46 143 86 75 160 102 55 119 115 123 207 172 147 103 187 159 170 59 68 117
4354 117 91 173 251 72 137 145 49 57 139 252 41 39 125 154 38 220 89 6 62 60 94 89 121 48 108 149 78 133 150 53 82 75 134 68 99
4182 99 93 9 165 83 39 78 68 115 66 10 175 147 190 125 109 40 8 95 130 228 114 222 215 48 173 253 117 124 60 41 86 217 294
4019 294 85 249 148 44 178 257 213 118 69 110 46 145 122 95 241 191 188 131 59 30 190 65 168 51 212 140 113 131 54 225
3871 225 277 88 54 78 195 61 142 142 82 214 23 100 101 29 179 107 137 184 94 99 123 92 126 58 132 207 227 48 92 98 115 184 107
3709 107 50 51 175 276 75 92 107 220 151 225 177 78 41 40 32 116 60 26 29 233 184 167 42 100 54 199 64 27 274 237 148 109
3551 109 113 132 137 63 100 96 200 209 216 178 52 81 84 208 213 236 105 73 151 217 88 113 148 220 147 122 212 58 28 33 127 163 162 38 117 82
3374 82 96 77 57 64 145 122 60 105 46 104 117 149 185 51 387 281 175 163 101 191 110 133 56 27 23 44 108 214 212 186 97 226 90
$$ packed form
4521A49j22J72r1M9k5n3J1o1K0N6L7K1p4J26j69R7n7j1Q5n8m7O4mQQ4l5k5m4Q4k8J1j11RM9
4354A17k6Q2P8j79O5Qr6QQ2J13k11kQ6K9j16J82j31q3N6kL4nL2p3O0M1p1N5J7r7K9pN9o6L1
4182I9oq4J56q2m4L9j0M7m9n6J65k8M3o5j6o9l2Q7L5R8j14J08pj67J25Q0j36Po4j9M5J31P7
4019B94k09J64j01j04J34P9m4r5m9M1o4R9k3k7J46n0ln7p2k9J60j25J03j17J61p2k7J8p7J71
3871B25N2j89l4K4J17j34Q1%o0J32j91P7Jp2J50p2L0M7r0NK4l1L4o8P4P5K0j79M4OJ7O9p7
3709A07n7JJ24J01k01J7J5J13o9P4m8r9l7jqQ4n6l4LK04m9j7j25N8m6J45j35l7K47l7q9l9
3551A09MJ9Np4L7mJ04RPl8j26K9LJ24NK3j31l2P8O6j29K5L5P2p3k5R0j54l0NR4L6jj24P9l5
3374H2J4j9k0PQ1k3o2M5n9N8J3L2L6j34L36j06j06j2o2R0q1K3p7k9mK1O4J06kk6q9J29j36
$$ plain form
3212 90 240 284 188 199 56 270 84 68 148 187 207 325 89 135 143 120 28 157 90 74 93 201 192 119 85 130 74 63 110 271 89
3059 89 167 193 124 206 146 92 59 105 124 88 275 310 40 132 155 207 52 13 75 132 83 170 204 40 130 168 175 79 142 144 65 195 367
2897 367 28 73 137 262 214 63 230 568 489 10 117 23 61 60 157 126 262 141 95 48 18 159 103 100 301 283 114 254 289
2754 289 185 334 578 541 415 217 161 127 73 85 150 60 100 84 119 205 122 180 49 204 101 150 157 160 67 43 71 43 123 99 170 227
2597 227 94 29 197 178 100 129 67 28 12 191 227 180 44 46 21 134 139 52 61 136 81 92 94 104 81 185 175 165 197 214 54 126 75
2434 75 82 37 96 107 75 33 61 118 101 166 115 38 127 130 331 88 226 107 101 93 153 144 82 281 176 141 168 155 133 277 228 139 29 58
2267 58 98 234 140 176 141 90 100 53 126 24 67 232 250 244 215 278 129 38 45 118 240 86 224 140 50 84 76 54 81 304 317 76
2109 76 94 193 233 347 137 15 208 63 189 82 364 803 8361 12451 2141 299 144 208 386 155 315 263 427 741
$$ packed form
3212I0J50M4r6J1j43K14j86j6Q0L9K0J18k36M6Qk3r2J29o7j6J9J08rp3l4M5n6j1M7J61j82
3059H9P8K6o9Q2o0n4l3M6J9l6J87L5k70R2K3N2j55l9O2N7m9Q7L4j64R0L8Pr6O3Kp9J30J72
2897C67l39M5O4J25m8j51J67L38p9m79J07r4L8jR7l1J36j21m6m7l0J41n6lK01j8j69J40L5
2754B89j04J49K44l7j26j98n6l4n4J2O5r0M0j6L5Q6q3N8j31J55j03M9PLr3k4K8k8Q0k4P1N7
2597B27j33o5J68j9p8K9o2l9j6J79L6m7j36Kk5J13Nq7RP5n5J1KJ0k3J04j0j0L2J7j60P2n1
2434G5Pm5N9J1l2m2K8N7j7O5n1p7Q9LK01k43J38j19oqO0ro2J99j05l5K7j3k2J44m9q9j10K9
2267E8M0J36r4L6l5n1J0m7P3j02M3J65J8ok9O3j49r1PP3J22j54J38q4r0L4qk2K7K23J3k41
2109G6J8R9M0J14k10j22J93j45J26j07K82M39P558M090j0310j842j55O4J78k31J60n2J64L14
$$ plain form
1991 741 998 4687 53164 60911 6912 3613 1780 723 696 468 650 166 473 407 96 295 180 380 214 98 106 157
1883 157 139 30 64 348 28 131 133 232 10 81 95 120 67 187 149 112 84 67 140 255 120 132 129 67 133 201 254 158 134 137 129 48 62
1720 62 57 45 229 83 337 793 1764 2240 1867 940 268 72 70 44 135 72 117 89 74 61 144 204 110 46 151 252 59 170 197
1578 197 110 105 75 22 64 180 177 165 169 332 38 183 441 601 348 471 364 111 94 50 116 113 146 128 187 70 68 134 267 61 252
1425 252 98 112 203 74 155 69 10 145 351 85 131 87 72 39 91 49 326 234 578 258 84 161 177 260 158 103 25 78 40 154
1277 154 123 176 102 239 212 110 187 140 177 120 121 73 65 171 195 125 185 219 82 98 107 43 100 111 68 106 221 156 57 146 71 155 207 282
1110 282 36 116 104 124 213 91 40 2 108 154 27 153 27 99 180 119 50 185 97 121 51 26 144 72 149 273 96 68 135 124
962 124 176 180 162 64 164 85 145 120 90 154 147 105 90 143 193 226 152 148 133 105 73 140 144 88 121 176 79 127 196 103 115 160 124 124 206 118 73
$$ packed form
1991G41K57L689M8477P747n3999l299j833j057k7k28J82m84L07o6l11J99j15K00j66j16QN1
1883A57j8j09L4K84l20J03KR9k22P1J4K5n3J20l8l7k8j7P3J15j35J2lo2O6O8N3r6k4Lqq1J4
1720F2nj2J84j46K54M56R71M76l73r27o72j96kk6R1o3M5k8j5j3Q3O0r4o4J05J01j93J11K7
1578A97q7nl0n3M2J16lj2MJ63k94J45K58J60k53J23j07k53j7m4O6lL3j8N9j17kO6J33k06J91
1425B52j54J4R1j29Q1q6n9J35K06k66M6m4j5l3N2m2K77r2L44l20j74P7J6Q3j02n5p8N3l8J14
1277A54l1N3p4J37k7j02P7m7L7n7Jm8qJ06K4p0O0L4j37J6Ro4N7J1m3L8J15o5r9Q9p5Q4N2P5
1110B82k46Q0j2K0Q9j22n1l8J06M6j27J26j26P2Q1o1o9J35q8K4p0k5J18p2P7J24j77k8O7j1
962A24N2Mj8r8J00p9O0k5l0O4pm2j5N3N0L3p4mj5k8l2O7Mn6L3N5r7M8O9r3J2M5l6%Q2q8m5
$$ plain form
780 73 77 87 129 51 134 182 76 101 29 111 169 160 151 154 22 174 159 41 113 218 144 106 140 73 143 158 157 68 73 138 110 120 146 111 172 88
603 88 39 137 209 138 46 197 121 106 162 65 287 241 1131 3633 1768 1128 3692 1778 332 159 84 50 306 95 250 195 260
470 260 36 171 24 97 231 111 202 167 47 25 95 63 253 216 23 65 26 131 126 101 66 132 57 164 75 131 156 79 130 190 145
318 145 208 204 165 181 126 113 207 157 124 195 112 102 100 73 146 181 94 57 56 72 49 130 122 132 102 163 181 47 107 204 25 133 108 169 329
145 329 241 124 201 90 136 193 202 230 92 137 37 90 80 196 187 166 56 207 186 78 26 191 131 207 182 36 118 173 109 173 87
-7 87 164 100 174 15 77 112 59 110 192 211 199 140 90 143 357 290 75 206 55 218 147 37 123 259 146 153 99 283 76 175 48
-160 48 140 165 182 61 78 181 129 144 145 141 45 54 137 83 72 194 35 175 270 23 269 137 120 110 100 87 106 118 108 123 140 197 75
-322 75 138 133 32 162 143 55 192 204 287 156 156 128 140 86 86 58 64 178 190 62 98 109 66 67 185 34 152 45 33 154 173 40
$$ packed form
780G3MJ0M2p8Q3M8j06K5p2Q2N8rrLj32J52j5j18P2J05p4l8L4o7P0J5jq9NO5k8J0K6l5O1q4
603H8m9R8P2p1r2J51p6j5N6r7K22m6Q90K502j865o40K564j914j446j73p5l4K56k11J55n5O5
470B60k24J35j47P3J34j20R1l5j20k2P0l2J90l7j93M2l9J05nk5l5O6p5J07q9N6K5p7N1O0m5
318A45O3ml9J6n5j3R4n0l3P1q3j0kk7P3L5q7l7jJ6k3Q1qJ0l0O1J8j34O0R7j79J08k5O1J60
145C29q8j17P7j11M6N7RK8j38M5j00N3j0J16rk1j10J51k1j08n2J65o0P6k5j46Q2N5o4O4q6
-7H7P7o4P4j59O2L5n3N1Q2J9j2n9n0N3K14o7k15J31j51J63p1j10Q6J36j13Pn4J84k07R9j27
-160D8R2K5J7j21J7J03n2J5Jmr6RQ3n4j1J22j59J40R5k47K46j32j7j0j0j3J9J2j0J5J7N7j22
-322G5O3nj01J30j9q8J37J2Q3j31%k8J2n4%k8OJ14J2j28L6J1m3JJ18j51J18j07j2J21J9j33
$$ plain form
-480 40 95 64 117 4 166 126 127
$$ packed form
-480D0N5l1N3j13J62m0J
-514A27
##PAGE=	F1=-450.252
##FIRST=	4521.1594499999982872,	4521.1594499999982872,	0.048245750367641448975
##DATA TABLE=	(F2++(Y..Y)), PROFILE
$$ plain form
4521 155 25 213 76 143 108 38 54 29 52 111 130 160 79 215 44 156 87 51 140 98 69 106 98 135 228 161 111 105 169 136 161 85 58
4359 58 106 83 143 250 45 160 190 49 109 125 247 48 85 151 144 71 254 76 20 48 93 87 79 130 49 113 145 70 163 188 39 87
4201 87 59 122 110 162 90 22 168 65 2 99 93 109 49 16 161 180 219 143 108 47 49 94 136 253 80 233 200 46 150 221 99 150
4044 150 46 60 74 235 305 85 242 168 28 174 230 187 124 67 91 56 110 129 101 274 138 143 98 72 43 229 59 175 69
3901 69 211 198 95 82 81 158 298 147 35 93 200 83 112 117 94 233 81 94 122 58 151 99 139 188 92 92 109 96 139 106 174 201
3743 201 243 88 112 74 119 176 128 60 28 161 260 39 82 127 251 139 208 181 56 34 47 58 148 100 37 69 248 199 176 27 87
3591 87 45 185 86 43 324 285 134 132 103 147 112 42 133 127 189 185 212 178 95 79 74 162 204 232 76 89 156 203 100 92 108 175 142 141 183 51
3414 51 39 59 101 157 179 66 114 77 142 45 56 59 142 101 78 68 54 131 114 156 201 63 358 287 168 174 124 245 144 126 37 36 24 81
$$ packed form
4521A55j30J88j37O7l5p0J6k5K3N9J9L0q1J36j71J12o9l6Q9m2k9L7qL7R3o7n0oO4l3K5p6k7
4359E8M8k3O0J07k05J15L0j41O0J6J22j99L7O6pp3J83j78n6K8M5oqN1q1O4L2p5R3K5j49M8
4201H7k8O3j2N2p2o8J46j03o3R7oJ6o0l3J45J9L9p6l5o1KM5M2J17j73J53l3j54J04P1j22N1
4044A50j04J4J4J61P0k20J57p4j40J46N6m3o3n7K4l5N4J9k8J73j36Nm5k6k9J86j70J16j06
3901F9J42j3j03j3jP7J40j51j12N8J07j17K9Nk3J39j52J3K8o4R3n2M0M9r6%J7j3M3l3O8K7
3743B01M2j55K4l8M5N7m8o8l2J33R9k21M3M5J24j12O9k7j25k2J3J1R0m8o3L2J79m9k3j49O0
3591H7m2J40r9m3K81l9j51kk9M4l5p0R1oO2mK7l4q3j6nQ8M2K8j56J3O7M7j03qJ6O7l3jM2j32
3414E1j2K0M2N6K2j13M8l7O5r7J1LQ3m1k3j0j4P7j7M2M5j38K95p1j19On0J21j01j8q9jj2N7
$$ plain form
3246 81 117 254 197 154 111 247 91 231 277 174 197 89 257 89 81 146 192 195 354 93 150 143 98 29 171 74 92 84 196 188 113 59
3089 59 126 81 63 75 293 96 121 175 85 211 192 74 82 156 118 113 454 455 47 109 128 230 91 37 77 138 69 155 205 33 93 150
2931 150 205 95 109 114 49 192 341 26 112 153 265 280 166 503 214 190 74 60 17 89 27 128 116 252 137 78 49 58 106 81
2784 81 127 315 269 97 247 303 206 319 559 444 305 212 102 88 67 63 142 53 82 53 87 168 144 246 66 237 117 154 183 179
2636 179 70 21 23 25 112 51 133 176 106 21 181 163 115 106 4 19 44 210 162 118 50 59 22 143 164 13 38 119 97 101 95 111 66 182
2469 182 152 157 198 216 38 119 73 110 57 57 75 102 28 74 129 105 183 123 48 148 183 311 97 255 123 117 113 178 141 95 229 179 113
2306 113 153 125 109 288 246 190 53 32 110 238 154 150 141 76 46 37 114 16 40 234 234 272 240 313 111 84 35 123 252 109 197 140 71
2144 71 99 71 62 105 272 313 80 116 187 221 383 110 48 218 111 157 80 293 704 7679 11431 2010 294 169 287 356 102
$$ packed form
3246H1L6J37n7m3m3J36j56J40M6j03K3j08J68j68qO5M6LJ59k61N7pm5o9J42r7J8qJ12qp5n4
3089E9O7m5j8J2K18j97K5N4r0J26j9j18QP4l8nL41Jm08O2J9J02j39n4M0O1o9Q6N0j72O0N7
2931A50N5j10J4No5J43J49l15Q6M1J12J5j14L37k89k4j16j4m3P2o2J01j2J36j15n9k9RM8k5
2784H1M6J88m6j72J50N6r7J13K40j15j39r3j10j4k1mP9q9K9k9L4Q1k4J02j80J71j20L7K9m
2636A79j09m9KKQ7o1Q2M3p0q5J60j8m8rj02J5K5J66m8m4o8Rl7J21K1j51K5Q1k2MoJ6m5J16
2469A82l0NM1J8j78Q1m6L7n3%J8K7p4M6N5k4P8o0p5J00L5J28k14J58j32omO5l7m6J34n0o6
2306A13M0k8j6J79m2n6j37k1P8J28q4mro5l0rP7r8K4J94%L8l2P3k02k7m9Q8J29j43Q8n7o9
2144G1K8k8rM3J67M1k33L6P1L4J62k73o2J70j07M6p7K13M11O975L752r421j716j25J18O9k54
$$ plain form
2011 102 111 108 575 251 666 3059 35469 45002 2985 5397 2063 779 770 409 588 174 422 303 150 171 90 336 249
1898 249 36 104 154 139 90 109 360 24 168 165 263 65 103 147 95 101 172 117 120 128 94 113 185 128 107 108 91 130 141 267 193 122 162 100
1730 100 47 84 105 82 177 108 512 1130 2336 2829 2295 1175 306 82 66 29 144 58 91 118 41 19 105 210 138 80 150 268
1592 268 89 201 177 95 107 90 47 26 183 144 164 147 353 37 246 411 240 1193 697 412 52 80 61 109 141 154 118 164 73
1450 73 70 139 259 58 213 82 76 230 42 148 62 60 210 301 68 137 58 70 40 89 26 307 179 524 213 89 116 197 297
1307 297 159 146 14 100 18 146 137 149 126 230 136 117 190 148 146 94 117 101 101 158 175 112 193 248 99 117 74 36 112 132 61 94 231
1145 231 178 58 188 44 147 194 243 12 105 121 120 210 75 64 11 109 97 76 189 14 156 210 102 26 159 65 111 29 48 122
997 122 94 146 283 72 35 150 114 144 171 165 83 171 47 143 108 102 141 148 103 106 143 181 251 159 163 145 118 40 89 105 79 123 154 90 123 218
$$ packed form
2011A02RlM67l24M15K393L2410R533m2017K412l334j284rl61J79m14K48j19j53K1q1K46q7
1898B49k13O8N0j5m9J9K51l36J44lR8j98L8M4n2OP1n5LQl4J9P2n7k1Jj7L9J1J26p4p1M0o2
1730A00n3L7K1k3R5o9M04O18J206M93n34j120q69k24j6l7J15q6L3K7p7k2Q6J05p2n8P0J18
1592B68j79J12k4q2J2j7m3k1J57l9K0j7K06l16K09J65j71R53m96k85l60K8j9M8L2J3l6M6r1
1450G3lO9J20k01J55j31oJ54j88J06q6kJ50R1k33O9p9J2l0M9o3K81j28L45l11j24K7Q1J00
1307B97j38j3j32Q6q2J28rJ2k3J04r4j9P3m2kn2K3j6%N7J7o3Q1N5j49J8m3l8P6K0p1L3J37
1145B31n3j20J30j44J03M7M9k31R3J6jR0j35j1n3R8j2k1J13j75J42N4j08p6J33r4M6q2J9P4
997A22k8N2J37k11l7J15l6L0K7oq2Q8j24R6l5oL9Pm5LL7L8P0r2Mj8k7p8M9J6k6M4L1o4L3R5
$$ plain form
820 218 110 74 154 116 122 220 134 84 72 66 91 67 146 199 67 146 60 77 151 187 133 171 21 172 164 20 109 241 129 103 124 38 137
657 137 150 174 56 131 162 78 86 142 86 183 67 6 164 238 140 40 194 108 124 231 77 306 300 1230 3982 2040 1486 4049
519 4049 1906 332 165 50 93 249 97 273 158 235 66 189 14 109 252 127 225 171 16 67 96 58 233 213 11 52
391 52 8 97 58 111 49 107 28 190 116 76 136 80 120 187 141 181 186 154 207 120 92 245 152 121 208 130 97 75 62 147 176 87 55 47 43 63
214 63 134 128 142 101 158 178 64 116 214 26 197 172 198 328 250 162 210 75 126 239 242 234 49 139 15 81 83 211 203 155 43 190 183
52 183 59 48 181 114 226 188 38 95 151 87 154 101 121 114 181 19 110 118 51 97 176 169 188 160 82 161 371 335 107 181 26 199 148
-111 148 47 110 268 145 122 98 288 99 161 105 119 164 186 93 58 179 156 166 140 133 31 75 132 78 54 233 80 163 288 50
-258 50 259 170 127 157 139 79 89 117 121 149 127 175 87 140 138 57 182 107 50 199 212 293 174 155 152 125 76 79 53 61 186 187 66 81 122
$$ packed form
820B18j08l6Q0l8OR8q6n0j2oK5k4P9N3j32P9q6J7P4L6n4L8j50J51qj44Q9J32j12k6K1q6R9
657A37J3K4j18P5L1q4QN6n6R7j16o1J58P4r8j00J54q6J6J07j54K29oR30K752j942n54K563
519D049k143j574j67j15M3J56j52J76j15P7j69J23j75R5J43j25R8n4j55N1K9l8J75k0k02M1
391E2m4Q9l9N3o2N8p9J62p4m0O0n6M0O7m6M0Nl2N3q7k8J53r3l1Q7p8l3k2j3Q5K9q9l2qmK0
214F3P1oJ4m1N7K0j14N2R8j88J71k5K6J30p8q8M8j35N1J13Lqj85R0j24O6KJ28qm8j12J47p
52A83j24j1J33o7J12l8j50N7N6o4O7n3K0pO7j62R1Qo7M6P9pJ9k8p8P9K10l6k28P4j55J73n1
-111A48j01O3J58j23k3k4J90j89O2n6J4M5K2r3l5J21k3J0k6pj02M4N7n4k4J79j53Q3J25k38
-258E0K09q9m3L0j8o0J0K8MK8k2M8q8N3kq1J25p5n7J49J3Q1j19j9lk7m9Lk6QJ25Jj21J5M1
$$ plain form
-431 122 77 89 197 44 163 27 13 135 141 53 64 47 87 3 156 148 167
$$ packed form
-431A22m5J2J08j53J19j36j4J22Oq8J1j7M0q4J53qJ9
-514A67
##PAGE=	F1=-460.097
##FIRST=	4521.1594499999982872,	4521.1594499999982872,	0.043175589293241500854
##DATA TABLE=	(F2++(Y..Y)), PROFILE
$$ plain form
4521 163 95 221 33 137 61 38 25 65 64 103 98 165 85 194 58 167 78 44 111 110 95 105 58 150 228 177 67 103 144 99 134 87 59
4359 59 77 103 95 239 35 162 208 36 154 99 244 89 128 159 133 105 267 88 21 37 146 76 98 121 71 119 139 84 175 217 56
4206 56 75 53 100 160 212 88 24 161 45 39 113 120 114 40 32 156 203 223 165 97 51 90 83 122 269 63 222 162 79 115 178 73 172 47
4039 47 84 73 227 294 96 207 181 35 158 190 167 145 76 67 73 55 121 112 278 88 96 60 94 78 255 65 185 93 192 244 58 52
3881 52 111 98 314 213 29 116 200 104 85 92 118 233 145 112 146 100 105 83 148 183 98 85 86 105 153 156 212 177 253 120 123 43 119 169 137
3709 137 65 34 152 237 17 84 132 268 117 183 182 43 41 67 93 177 148 43 131 248 207 171 25 75 50 161 125 62 367 305 118
3556 118 163 95 145 107 73 165 165 170 152 200 183 126 68 69 101 185 222 47 114 156 183 107 63 77 124 123 157 168 63 47 95 63 138 192 123 121
3379 121 76 177 29 66 63 140 79 86 34 76 147 91 173 209 85 307 282 148 175 170 288 185 119 36 48 34 110 132 277 165 115 106
$$ packed form
4521A63o8J26j88J04p6k3j3M0jL9nO7q0J09j36J09q9l4O7jj5J0m7R2P8n1j10L6M1m5L5m7k8
4359E9J8K6qJ44k04J27M6j72J18n5J45j55L9L1k6k8J62j79o7J6J09p0K2K3n0M8K0n5R1M2j61
4206E6J9k2M7O0N2j24o4J37j16oP4Pop4qJ24M7K0n8o8m6L9pL9J47k06J59o0q3L6O3j05R9j25
4039D7L7j1J54O7j98J11k6j46J23L2k3k2o9rOj8O6rJ66j90Ql6L4j6J77j90J20r2R9N2j86o
3881E2N9j3K16j01j84Q7Q4r6j9PK6J15q8l3L4m6Nk2O5L5q5j3JJ9M8LN6l5P6j33Lq0P6N0l2
3709A37p2l1J18Q5k20O7M8J36j51O6jj39kK6K6Q4k9j05Q8J17m1l6j46N0k5J11l6o3L05o2j87
3556A18M5o8N0l8l4R2%Nj8M8j7n7n8JL2Q4L7j75O7M2K7p6m4J4M7jL4J1j05j6M8l2P5N4o9k
3379A21m5J01j48L7lP7o1Pn2M2P1n6Q2L6j24K22k5j34K7nJ18j03o6q3J2j4P6K2J45j12n0r
$$ plain form
3222 106 247 95 206 258 143 182 120 233 93 104 134 173 187 356 89 154 141 78 47 183 88 118 87 173 179 110 41 113 73 76 54
3069 54 303 117 82 164 77 210 237 52 96 202 116 112 689 675 64 70 105 245 133 65 64 133 72 131 191 24 66 125 224 133 100 96
2912 96 38 199 304 52 152 168 246 331 399 878 747 410 161 9 21 140 40 95 101 232 124 66 61 100 71 69 144 304 246 72
2764 72 224 305 224 259 462 279 168 196 20 51 65 26 136 52 57 21 65 125 169 295 97 247 126 180 194 183 60 53 66 48 108
2611 108 13 96 103 120 15 176 141 123 108 63 14 96 209 101 76 67 75 41 162 178 50 55 85 106 104 89 105 75 166 121 132 192 198 35
2444 35 133 88 121 95 51 32 108 82 100 130 89 189 121 90 144 238 264 96 283 130 122 144 180 138 114 168 171 66 135 91 82 276 231 215
2277 215 80 47 128 219 155 99 146 54 48 19 115 65 41 237 187 271 249 337 62 152 51 110 245 164 146 161 101 114 70 84 135 228 282
2114 282 138 110 178 223 398 133 68 256 149 113 53 186 594 6479 9455 1796 398 367 521 511 497 423 306 801 894 1865
$$ packed form
3222A06J41j52J11N2j15L9o2J13j40J1L0L9J4J69k67O5j3o3l1J36r5L0l1Q6Oo9o9P2m0Lk2
3069E4K49j86l5Q2q7J33K7j85M4J06q6mN77j4o11OL5J40j12o8jO9o1N9O0j67M2N9R9r1l3m
2912I6n8J61J05k52J00J6P8Q5O8M79j31l37k49j52J2J19j00N5OJ31j08n8nL9k9kP5J60n8j74
2764G2J52Q1q1L5K03j83j11K8j76L1J4l9J10q4Nl6M4O0M4J26j98J50j21N4J4j1j23pJ3j8O0
2611A08r5Q3PJ7j05J61l5j8j5m5m9Q2J13j08k5rQl4J21J6j28NL0K1kj5J6l0R1m5J1O0Oj63
2444C5R8m5L3k6m4j9P6k6J8L0m1J00o8l1N4R4K6j68J87j53qK2L6m2k4N4Lj05O9m4rJ94m5j6
2277B15j35l3Q1R1o4n6M7r2ok9R6n0k4J96n0Q4k2Q8k75R0j01N9J35q1j8J5o0J3m4J4N1R3N4
2114B82j44k8O8M5J75k65o5J88j07l6o0J33M08N885K976p659j398l1J54j0j4p4j17M95R3R71
$$ plain form
1986 1865 4605 24355 12479 8318 5339 1701 462 555 117 295 269 198 188 326 102 90 211 313 103 111 137 152 204
1873 204 171 317 114 232 173 296 151 105 245 34 152 165 106 119 175 101 88 97 144 61 62 125 98 88 270 228 123 186 66 68 89
1720 89 148 127 93 137 724 1597 3153 3641 2953 1466 392 89 49 81 180 39 71 151 21 95 71 221 167 114 164 281 119
1588 119 236 145 94 99 100 57 36 186 135 182 113 358 34 271 427 616 2221 818 428 72 60 68 107 171 162 124 144 89 65 138
1440 138 230 70 167 80 37 239 12 151 69 122 262 256 50 130 28 50 49 94 120 259 158 400 98 93 70 201 313 154 183
1297 183 40 101 10 136 162 98 146 209 52 124 183 150 116 70 113 130 126 145 136 89 186 261 123 155 67 22 110 142 52 81 234 180 64
1135 64 209 36 137 157 193 72 82 144 107 207 60 84 27 116 38 143 210 16 208 237 82 3 109 40 106 90 74 103 96 141
987 141 276 48 62 159 115 103 145 148 91 165 8 142 91 111 118 127 95 126 148 180 270 139 177 164 126 28 31 108 79 115 125 94 134 226 106
$$ packed form
1986A865K740J9750j1876m161k979l638j239R3m38J78k6p1j0J38k24j2J21J02k10QK6J5N2
1873B04l3J46k03J18n9J23j45m6J40k11J18J3n9J3N6p4j3RM7q3JO3k7j0J82m2j05O3j20KK1
1720H9N9k1l4M4N87Q73J556M88o88j487j074l03m0L2R9j41L2Q0j30P4k4J50n4n3N0J17j62
1588A19J17r1n1NJm3k1J50n1M7o9K45l24K37J56J89J605j403l90l56j2QL9O4rl8K0n5k4P3
1440A38R2j60R7q7m3K02k27J39q2N3J40ok06Q0j02K2jM5K6J39j01K42l02nk3J31J12j59K9
1297A83j43O1r1J26K6o4M8O3j57P2N9l3l4m6M3J7mJ9rm7R7P5j38L2q8m5Q8L2r0K9J53n4j16
1135F4J45j73J01K0L6j21J0O2l7J00j47K4n7Q9p8J05O7j94J92K9j55p9J06o9O6j6j6K9pM5
987A41J35k28J4R7m4j2M2Ln7P4j57J34n1K0PRl2L1K2L2R0j31L8j3l8r8LP7k9L6J0l1M0R2j20
$$ plain form
815 106 29 140 112 155 240 145 88 80 62 33 84 158 201 55 178 93 83 127 205 121 187 54 158 165 10 86 260 165 115 100 32 123 146
652 146 183 70 176 181 35 41 116 65 177 46 25 183 272 137 34 177 103 133 279 101 312 359 1339 4277 2425 1923 4338
519 4338 2007 336 170 72 142 186 125 289 117 194 92 190 3 128 255 143 240 176 9 114 96 44 202 199 1 28 39
387 39 71 38 95 36 66 21 209 161 30 119 82 107 172 116 146 158 144 232 97 86 286 136 113 215 139 93 49 42 148 170 73 68 61 30
219 30 65 136 141 139 102 150 167 81 114 212 53 261 222 215 303 248 198 216 64 113 271 263 232 13 134 9 74 75 204 213 133 53 155 179
52 179 36 82 169 97 231 188 56 82 138 59 125 132 77 127 186 7 159 119 47 80 150 128 152 166 87 196 361 370 125 157 22 196
-106 196 142 64 97 261 136 81 103 287 129 128 147 137 168 174 127 34 184 166 189 143 108 52 112 106 73 31 278 123 144 311 79 218
-263 218 203 133 197 166 105 69 98 143 149 123 137 102 156 133 86 201 48 43 189 226 260 184 135 187 94 71 95 45 80 190 186 82 46 111
$$ packed form
815A06p7J11k8M3Q5r5n7qj8k9N1P4M3j46J23q5j0M4P8q4O6j33J04Pj55P6J74r5n0j5o8R1K3
652A46L7j13J06Nj46OP5n1J12j31k1J58Q9j35j03J43p4L0J46j78K11M7R80K938j852n02K415
519D338k331j671j66r8P0M4o1J64j72P7j02R8j87J25J27j12R7o4j67J05j8n2J58lj98K7J1
387C9L2l3N7n9L0m5J88m8j31Q9l7K5O5n6L0J2j4Q8j35j1K00j50k3J02p6m6m4pJ06K2r7npl1
219C0L5P1Nkl7M8J7q6L3R8j59K08l9pQ8n5n0J8j52M9J58ql1k19J21j25O5JJ29Rq0q0J02K4
52A79j43M6Q7p2J34m3j32K6N6p9O6Pn5N0N9j79J52m0p2L3P0k2K4J4p9J09J65Rk45L2j35J74
-106A96n4p8L3J64j25n5K2J84j58jJ9j0L1Om7r3J50j8K3m6l5n6O0ol3m2K47j55K1J67k32J39
-263B18j5p0O4l1o1l6K9M5Ok6J4l5N4k3m7J15j53nJ46L7L4p6m9N2r3k3K4n0L5J10mj04l6O5
$$ plain form
-431 111 107 103 190 64 192 7 77 127 113 60 52 39 84 19 133 170 184
$$ packed form
-431A11mmQ7j26J28j85P0N0j4n3qj3M5o5J14L7J4
-514A84
##PAGE=	F1=-469.941
##FIRST=	4521.1594499999982872,	4521.1594499999982872,	0.025778159499168395996
##DATA TABLE=	(F2++(Y..Y)), PROFILE
$$ plain form
4521 186 170 222 98 140 36 102 89 105 103 88 72 183 110 154 99 177 81 69 78 144 133 120 55 163 208 220 25 111 113 79 107 68 66 36
4354 36 150 37 218 83 146 197 14 185 66 240 124 161 142 123 127 255 135 24 30 197 60 140 95 96 131 134 114 162 229 95
4206 95 49 54 94 211 243 86 36 150 28 76 119 136 117 50 40 159 213 204 188 80 52 126 57 96 272 63 190 104 138 80 133 43
4049 43 189 64 118 82 197 272 114 152 185 41 132 140 156 183 92 49 94 17 99 126 253 79 62 51 118 122 262 69 196 113 160
3896 160 266 17 34 129 73 321 266 32 141 197 113 70 71 143 214 201 135 168 148 54 60 162 173 101 75 65 115 164 202 238 149 252
3739 252 138 133 14 111 163 134 64 55 149 208 38 88 121 272 91 148 181 74 59 99 124 200 188 46 177 228 204 152 41 72 62
3586 62 131 165 84 390 292 106 191 92 124 107 113 199 206 148 115 182 192 144 54 72 44 158 205 68 151 153 161 113 42 62 76 88 167 170 86 44
3409 44 124 18 104 200 177 149 79 198 45 82 73 135 76 88 37 100 150 52 204 215 104 249 267 121 168 215 317 233 110 36 61
$$ packed form
4521A86j6N2j24M2j04O6j3J6kj5j6J11p3M4n5P8r6j2RO6j1j3o5J08M5J2j95Q6Kl4K8l9kl0
4354C6J14j13J81j35O3N1j83J71j19J74j16L7j9j9MJ28j20j11OJ67j37Q0m5JL5Lk0M8O7j34
4206I5m6NM0J17L2j57n0J14j22M8M3J7j9o7j0J19N4rj6j08k8P4o9L9J76k09J27q6L4n8N3r0
4049D3J46j25N4l6J15P5j58L8L3j44R1QJ6K7r1m3M5p7Q2K7J27j74j7j1O7MJ40j93J27q3M7
3896A60J06k49J7R5n6K48n5k34J09N6q4m3JP2P1j3o6L3k0r4OJ02J1p2k6j0N0M9L8L6q9J03
3739B52j14nj19R7N2k9p0rR4N9j70N0L3J51j81N7L3j07j5M0K5P6j2j42J31N1k4n2j11L1j0
3586F2O9L4q1L06r8j86Q5r9L2j7OQ6Pn8l3O7J0m8r0J8k8J14M7j37Q3KQm8p1K0J4J2P9Lq4m2
3409D4Q0j06Q6R6k3k8p0J19j53L7rO2n9J2n1O3N0r8J52J1j11J45J8j46M7M7J02q4j23p4K5
$$ plain form
3256 61 52 124 150 281 139 83 83 226 102 173 227 108 157 149 206 92 134 115 130 189 331 78 148 137 80 60 186 122 145 100 135 164
3099 164 107 31 93 54 100 75 302 149 53 164 79 206 272 46 98 236 114 85 1008 1079 74 28 100 253 162 88 38 119 89
2956 89 98 162 23 53 95 224 177 123 106 35 210 267 69 184 174 211 359 685 1296 1491 1018 254 48 30 188 62 67 85 209
2813 209 103 67 59 122 58 71 149 273 217 42 188 297 236 193 410 91 242 162 69 62 64 15 130 51 59 32 58 91 190 323 122
2661 122 234 124 217 187 165 38 102 134 86 106 69 71 39 137 13 185 114 132 132 115 5 135 190 59 115 102 89 74 187 186 90 83
2503 83 41 113 105 78 90 108 143 85 99 176 164 51 163 109 121 138 106 47 99 124 125 122 62 184 119 127 123 281 205 85 301 138 131 166 159
2331 159 128 133 112 160 34 118 58 82 244 194 218 110 66 151 183 145 49 146 36 126 11 133 127 109 233 124 244 244 348 6 219
2178 219 78 88 230 219 89 195 138 132 110 120 163 185 245 210 110 202 260 400 203 82 326 165 119 25 72 495 4948 6895
$$ packed form
3256F1rP2K6J31j42n6%J43j24P1N4j19M9qN7j14M2j9J5N9J42k53P0j1n7k0J26o4K3m5L5K9
3099A64n7p6O2l9M6k5K27j53r6J11q5J27O6k26N2J38j22k9R23P1j005m6P2J53r1p4n0Q1l0
2956H9RO4j39L0M2J29m7n4j7p1J75N7j98J15j0L7J48L26O11J95m73p64k06j8J58j26NJ8J24
2813B09j06l6qO3o4J3P8J24n6j75J46J09o1m3K17l19J51q0r3pKm9J15p9Qk7K6L3R9J33k01
2661A22J12j10R3l0k2j27O4L2m8K0l7Kl2R8j24J72p1J8%j7j10J30N5j31N6j3j3j5J13jr6p
2503H3m2P2qk7J2J8L5n8J4P7j2j13J12n4J2J7l2n9N2K5Jlo0J22o5QmJ58p6j20K16j63pL5p
2331A59l1Nk1M8j26Q4o0K4J62n0K4j08m4Q5L2l8r6R7j10R0j15J22oj8J24j09J20%J04l42K13
2178B19j41J0J42j1j30J06n7ok2J0M3K2O0l5j00R2N8J40j97j21K44j61m6r4M7M23M453J947
$$ plain form
2040 6895 1523 558 662 836 882 979 1013 681 867 2177 3781 10411 79329 58229 16362 2895 954 242 129 403
1942 403 173 554 207 401 548 367 275 125 376 205 145 122 158 287 236 240 224 317 163 342 238 96 344 52 201 164 148
1809 148 119 209 106 85 45 150 77 45 155 61 74 262 258 141 194 71 103 85 169 157 29 159 926 2074 3944 4417 3583 1731
1671 1731 467 96 26 119 225 18 72 191 10 178 53 241 188 146 187 294 146 269 108 117 83 111 58 78 192 151 207
1538 207 79 340 37 259 495 1516 3285 826 419 138 64 73 120 208 176 135 130 107 53 136 186 83 125 81 71 228 36 159
1400 159 89 171 292 231 46 118 6 37 73 142 282 193 372 467 77 90 36 193 306 143 213 65 88 20 120 186 38 155
1263 155 179 64 126 165 142 90 59 111 148 137 132 101 77 169 258 140 192 86 8 97 136 49 67 229 163 75 209 62 125 103 143 133
1105 133 59 173 83 202 63 106 41 121 18 206 215 40 247 256 61 23 45 35 99 138 93 92 82 138 258 30 111 159 136 61 109
$$ packed form
2040F895n372r65J04J74M6R7L4l32J86J310J604O630O8918k1100m1867j3467j941p12j13K74
1942D03k30L81l47J94J47j81r2j50K51j71o0k3L6J29n1Mj6R3j54J79j04j42K48k92J49l7j6
1809A48k9R0j03k1m0J05p3l2J10r4J3J88mj17N3j23L2j8Q4j2j28J30P67J148J870M73q34j852
1671A731j264l71p0R3J06k07N4J19j81J68j25J88n3m2M1J07j48J23j61Rl4K8n3K0J14m1N6
1538B07j28K61l03K22K36J021J769k459m07k81p4RM7Q8l2m1nk3n4Q3N0j03M2m4j0J57j92J23
1400A59p0Q2J21o1j85P2j12L1L6O9J40q9J79R5l90J3n4J57J13j63P0j48K3o8J00O6j48J17
1263A55K4j15O2L9k3n2l1N2L7j1nl1k4R2Q9j18N2j06p8Q9L9q7J8J62o6q8J34j47O3k2M0j0
1105A33p4J14r0J19j39M3o5Q0j03J88Rj75K07Rj95l8K2j0O4L9m5jj0N6J20k28Q1M8k3p5M8
$$ plain form
953 109 113 88 147 30 133 79 122 89 108 84 149 164 191 281 100 185 185 128 53 25 151 91 98 98 87 146 222 92 15 119 107 190 257 149
785 149 88 92 88 68 97 172 197 39 198 122 140 97 208 108 201 82 136 162 32 51 270 218 139 71 44 117 148 182 93 201 192 14
628 14 47 73 54 154 36 46 189 306 132 40 142 118 133 302 123 305 406 1426 4437 2859 2370 4500 2074 335
510 335 173 139 189 133 161 294 71 144 106 173 7 148 244 155 246 178 17 166 90 42 161 174 4 25 72 73 108 57 37 19 82
357 82 223 205 48 100 91 90 147 75 106 127 136 250 65 89 322 111 107 203 135 89 30 31 144 173 57 81 103 59 67 130 156 123 105 137 151
185 151 98 107 199 89 320 252 218 261 233 221 212 73 107 289 267 225 67 132 27 74 64 178 212 100 53 112 178 11 125 155 81
32 81 220 184 77 86 138 52 90 166 89 134 185 17 209 114 46 69 119 96 104 153 115 237 334 390 133 140 72 203 136 83 84 234 118 47
-135 47 114 276 157 96 172 185 171 155 153 27 189 155 205 152 71 80 155 67 65 8 312 158 127 334 110 152 226 137 226 179 147 59 78
$$ packed form
953A09Mk5N9j17J03n4M3l3J9k4O5J5K7R0j81Q5%n7p5k8J26o0P%j1N9P6j30p7J04j2Q3O7j08
785A49o1Mmk0K9P5K5j58J59p6J8m3J11j00R3j19N4K6j30J9K19n2p9o8k7P3L1L4q9J08rj78
628A4L3K6j9J00j18J0J43J17j74r2J02k4J5J69j79J82J01J020L011j578m89K130k426j739
510C35j62l4N0n6K8J33k23P3l8O7j66J41R6q9R1o8j61J49p6m8J19J3j70K1M7JL5n1k0j8O3
357H2J41j8j57N2rjN7p2L1K1RJ14j85K4K33k11mR6o8m6n9JJ13K9j16K4K2m4QO3K6l3j8L2J4
185A51n3RR2j10K31o8l4M3k8j2rj39L4J82k2m2j58O5j05M7j0J14L4j12m7N9O6j67J14L0p4
32H1J39l6j07RN2q6L8P6p7M5N1j68J92r5o8K3N0k3QM9l8J22R7N6k57Po8J31o7n3JJ50j16p1
-135D7O7J62j19o1P6J3j4j6kj26J62l4N0n3q1RP5q8kn7L04j54l1K07k24M2P4q9Q9m7l2q8J9
$$ plain form
-298 78 166 130 132 97 113 184 113 105 217 39 38 164 240 198 182 115 225 56 78 136 37 115 195 195 106 11 81 148 113 177 58 232 48
-460 48 157 130 124 67 87 53 154 44 143 188 180
$$ packed form
-298G8Q8l6Kl5J6P1p1qJ12j78jJ26P6m2j6o7J10j69K2N8r9P8Q0%q9r5P0O7l5O4j19J74j84
-460D8J09k7on7K0l4J01j10R9M5q
-514A80
##PAGE=	F1=-479.786
##FIRST=	4521.1594499999982872,	4521.1594499999982872,	0.045985996723175048828
##DATA TABLE=	(F2++(Y..Y)), PROFILE
$$ plain form
4521 219 228 218 184 141 81 147 162 130 144 73 88 197 148 108 138 183 102 100 51 176 170 134 106 164 180 267 36 129 84 105 102 37 72 20 195
4349 195 26 186 131 116 167 22 194 53 224 142 182 105 110 128 224 186 46 19 232 40 180 60 107 148 131 145 124 217 133 26
4201 26 64 114 249 257 85 63 134 42 99 120 134 114 76 44 163 207 170 201 65 58 151 29 74 257 69 140 44 204 61 102 55 199
4044 199 76 157 88 152 244 132 89 176 44 103 87 149 230 109 55 111 70 67 133 207 114 75 82 139 164 246 67 200 123 123 256 55
3886 55 15 132 84 318 293 40 167 189 105 63 57 160 187 238 153 183 190 45 34 172 165 101 66 57 127 172 236 244 130 233 143 143 21
3724 21 95 156 122 56 65 148 174 62 86 97 265 65 98 181 120 81 132 144 211 208 47 200 192 190 124 53 80 78 103 198 118 385 251 106
3556 106 204 91 87 98 144 233 242 129 76 158 199 147 45 79 50 129 180 123 198 148 142 122 49 64 41 43 165 177 109 36 141 30 57 202
3389 202 217 190 79 205 68 94 83 121 90 89 62 120 137 16 242 227 114 200 244 93 168 248 334 278 96 29 74 75 120 159 270
$$ packed form
4521B19Rj0l4m3o0O6J5l2J4p1J5J09m9m0L0M5q1km9J25ol6k8N8J6Q7k31R3m5K1lo5L5n2J75
4349A95j69J60n5j5N1j45J72j41J71q2M0p7NJ8R6l8j40k7K13j92J40j20M7M1j7J4k1R3q4j07
4201B6L8N0J35Qj72k2P1r2N7K1J4k0l8l2J19M4l7L1j36pR3j22M5J83j88P1r6J60j43M1m7J44
4044A99j23Q1o9O4R2j12m3Q7j32N9j6O2Q1j21n4N6m1lO6P4r3l9PN7K5Q2j79J33p7%J33k01
3886E5m0J17m8K34k5k53J27K2q4m2oJ03K7N1q5L0Pj45j1J38po4l5rP0M5O4Qj14J03r0%j22
3724B1P4O1l4o6RQ3K6j12K4J1J68k00L3Q3o1l9N1J2O7lj61J53qko6p1K7kK5R5q0K67j34j45
3556A06R8j13mJ1M6Q9Rj13n3Q2M1n2j02L4k9P9N1n7P5n0ok0p3J5k3KJ22J2o8p3J05j11K7J45
3389B02J5k7j11J26j37K6j1L8l1jk7N8J7j21K26j5j13Q6M4j51P5Q0Q6n6j82o7M5JM5L9J11
$$ plain form
3236 270 148 77 54 187 107 143 185 96 119 174 185 86 161 97 69 200 290 70 138 132 107 65 174 153 166 119 96 135 99 26 75 46 122
3074 122 114 294 183 37 167 77 206 287 58 90 250 110 53 1388 1663 101 70 111 257 172 99 9 104 99 59 121 15 59
2936 59 74 201 214 154 130 44 217 243 75 198 169 175 356 890 1533 1951 1509 329 106 42 216 70 64 67 190 77 79 47 120
2793 120 68 77 141 232 186 38 143 279 239 227 551 188 420 129 146 105 72 50 123 50 102 64 59 88 199 323 129 203 110 246
2646 246 167 125 11 148 198 118 106 117 77 73 154 13 193 85 145 157 141 8 151 158 53 179 140 96 106 205 187 111 105 29 115 102
2488 102 65 76 138 124 59 80 145 126 65 187 112 116 177 174 102 86 140 133 113 36 167 129 140 100 295 154 72 298 161 150 157 125 106 141
2321 141 71 157 66 98 51 99 191 141 208 130 59 165 137 128 52 131 31 185 50 151 184 186 207 73 197 218 339 43 257 97
2173 97 78 209 249 58 209 157 134 157 146 162 148 223 242 118 240 289 377 239 82 377 144 146 6 0 397 3287 4243 1179
$$ packed form
3236B70j22p1k3J33q0L6M2q9K3N5J1r9P5o4k8J31R0k20O8ok5m2J09k1J3m7k3L9l6p3M9k9P6
3074A22qJ80j11j46J30r0J29Q1k29L2J60j40n7J335K75j562l1M1J46q5p3r0R5nm0O2j06M4
2936E9J5J27J3o0k4q6J73K6j68J23k9OJ81N34O43M18m42j180k23o4J74j46oLJ23j13Kl2P3
2793A20n2RO4R1m6j48J05J36m0j2L24l63K32k91J7m1l3k2P3p3N2l8nK9J11J24j94P4r3J36
2646B46p9m2j14J37N0q0j2J1m0mQ1j41J80j08O0J2j6j33J43Pj05J26l9m4J0R9j8p6op6Q6j3
2488A02l7J1O2j4o5K1O5j9o1J22p5MO1lp2j6N4pk0p7J31l8J1m0J95j41q2K26j37j1Pl2j9L5
2321A41p0Q6r1L2m7M8R2n0O7p8p1J06k8rp6P9j00J54j35J01L3KK1j34J24K1J21k96K14j60
2173I7j9J31M0j91J51n2k3K3j1J6j4P5J9j24J22M9Q8j38j57K95k33Kj40oL97K890R56l064
$$ plain form
2035 1179 653 868 1037 1179 1323 1514 1035 579 3365 5456 16079 124487 100532 22306 3604 1567 1019 405
1947 405 850 540 779 463 602 686 561 396 160 385 260 163 108 139 311 262 166 302 374 159 374 284 107 405 121 216
1819 216 184 192 122 207 109 94 72 138 132 79 154 65 84 237 270 154 186 111 128 84 161 153 90 165 1075 2457 4549 4977 4020 1912 511
1666 511 102 16 142 251 26 74 233 9 240 76 261 196 177 207 305 167 288 69 146 64 122 59 105 201 165 226 58 294
1528 294 47 221 587 2472 4329 780 401 205 86 89 146 254 193 142 111 120 37 128 140 87 97 71 131 205 58 161 110 204
1391 204 296 226 62 108 19 57 104 236 484 128 679 829 277 90 24 178 279 128 236 82 72 33 104 198 21 151 143 136
1253 136 125 136 122 67 67 117 153 138 109 108 101 146 240 147 214 109 26 77 110 57 55 214 131 87 197 84 106 47 101 183 59 202 49
1090 49 194 81 134 48 122 59 254 212 56 261 261 43 54 41 63 88 165 100 93 67 142 235 34 145 154 167 31 66 69 75 119 59 108
$$ packed form
2035A179n26K15J69J42J44J91m79m56K786K091J0623J08408k3955p8226j8702k037n48o14
1947D05M45l10K39l16J39Q4j25j65k36K25j25r7n5L1J72m9r6J36P2k15K15r0j77K98k84R5
1819B16l2Qp0Q5r8j5k2O6on3P5q9J9J53L3j16L2p5J7m4P7qo3P5R10J382K092M28r57k108j401
1666E11m09q6J26J09k25M8J59k24K31j64J85o5j9L0R8j38J21k19P7q2N8o3M6R6l6O1j68K36
1528B94k47J74L66J885J857l549l79j96j19LN7J08o1n1l1Rq3R1J2n3J0k6O0P4j47J03n1R4
1391B04R2p0j64M6q9L8M7J32K48l56N51J50n52j87o6J54J01j51J08j54j0l9P1R4j77J30qp
1253A36j1J1j4n5%N0L6j5k9jpM5R4r3O7j05q3N1L3n3kJ59q3m4J10j13K2n9N4Q2j24J43j53
1090D9J45j13N3q6P4o3J95m2j56K05%k18J1j3K2K5P7o5pk6P5R3k01J11RJ3j36L5LOM4o0M9
$$ plain form
928 108 86 132 61 125 76 169 188 198 282 55 179 204 128 79 73 201 114 73 78 68 154 206 70 48 96 95 209 268 145 88 99 127 162 98
761 98 180 196 14 209 138 207 66 194 94 207 97 112 157 52 38 264 263 163 44 48 116 152 170 117 207 190 61 105 32 57 115
608 115 52 58 184 333 131 62 103 143 124 299 135 283 430 1458 4422 3299 2765 4508 2098 324 169 203 227 118 192
485 192 285 23 104 105 140 8 162 225 157 241 172 10 217 77 64 112 139 7 57 95 98 163 27 53 32 147 232 240 87 75 108 71
327 71 117 38 65 102 132 255 67 101 343 84 105 166 116 85 55 64 133 185 48 80 151 97 72 112 167 105 106 116 130 111 100 181 124 364
160 364 266 202 208 206 220 198 108 117 296 259 216 120 140 37 79 54 143 194 71 34 72 182 47 170 140 63 195 180 95 97 145 75 63 188
-7 188 145 139 173 50 245 105 48 72 90 80 75 124 151 266 297 388 141 132 115 216 142 96 72 191 90 58 122 253 175 101 185 228 170
-170 170 138 161 61 184 127 210 163 34 109 189 47 55 18 320 179 112 350 140 83 230 137 240 178 185 80 83 177 107 144 70 111
$$ packed form
928A08k2M6p1O4m9R3J9J0Q4k27J24K5p6m9oJ28q7m1Nj0Q6N2j36k2M8jJ14N9j23n7J1K8L5o4
761I8Q2J6j82J95p1O9j41J28j00J13j10J5M5j05j4K26jj00j19MO8L6J8n3R0j7j29M4p3K5N8
608A15o3OJ26J49k02o9M1M0j9J75j64J48J47J028K964j123n34J743k410j774j55L4K4j09P4
485A92R3k62Q1JL5j32J54O3o8Q4o9j62K07j40j3M8K7j32N0L8LO5j36K6k1J15Q5Qj53j2L3l7
327G1M6p9K7L7L0J23j88L4K42k59K1O1n0l1l0RO9N2j37L2P1n4k5M0N5o2JJ0J4j9j1Q1n7K40
160C64r8o4OkJ4k2r0RJ79l7m3r6K0j03M2k5Q9N1j23l7L8J10j35J23l0p7J32j5q5KM8p0j2J25
-7A88m3oL4j23J95j40n7K4J8j0nM9K7J15L1R1k47rj7J01p4m6k4J19j01l2O4J31p8p4Q4M3n8
-170A70l2K3j00J23n7Q3m7j29P5Q0j42Ql7L02j41o7K38k10n7J47r3J03o2Pj05LR4p0L7p4M1
$$ plain form
-322 111 213 83 106 225 111 36 135 243 137 162 108 252 25 92 173 33 145 211 210 128 48 42 184 122 161 50 263 74 233
-465 233 132 162 78 124 69 236 63 194 193 164
$$ packed form
-322A11J02j30K3J19j14p5R9J08j06K5n4J44k27O7Q1j40J12O6jq2q0oJ42o2L9j11K13j89J59
-465B33j01L0q4M6n5J67j73J31jk9
-514A64
##PAGE=	F1=-489.63
##FIRST=	4521.1594499999982872,	4521.1594499999982872,	0.065077342092990875244
##DATA TABLE=	(F2++(Y..Y)), PROFILE
$$ plain form
4521 233 245 211 236 115 100 142 210 118 151 43 105 182 174 85 148 178 116 108 47 176 188 120 140 143 164 289 85 141 72 137 115 9 77
4359 77 47 211 69 136 153 77 135 44 179 76 188 133 187 67 86 105 186 214 59 19 240 15 195 29 96 158 130 166 69 177
4211 177 154 51 91 136 260 262 95 81 99 72 102 120 109 116 108 43 158 182 132 190 55 75 159 70 70 222 71 76 88 263 68 108 97
4049 97 200 68 195 76 101 206 146 33 158 50 77 55 142 275 117 77 118 101 29 123 151 141 128 114 157 194 212 59 191
3906 191 126 93 210 103 12 117 87 312 288 38 193 174 79 59 55 165 169 248 165 193 212 85 32 169 167 103 63 64 137 177 248 227
3748 227 122 191 141 144 35 65 137 112 44 59 150 139 79 75 61 247 43 30 184 160 98 150 152 205 205 47 200 152 167 91 49 94 88 93
3581 93 217 166 343 197 118 196 88 42 85 159 265 266 116 41 128 192 137 32 84 90 98 148 180 248 143 126 134 63 81 34 15 146 173
3419 173 127 32 145 71 12 198 240 229 67 197 83 94 95 93 95 96 74 126 109 61 274 246 115 175 211 82 181 259 344 305 84 22
$$ packed form
4521B33J2l4K5j21j5M2O8r2L3j08O2P7qq9O3L0o2qo1J29J2o8K0LK1J25k04N6o9O5k2j06O8
4359G7l0J64j42O7J7p6N8r1J35j03J12n5N4j20J9J9Q1K8j55m0K21k25J80j66O7O2k8L6r7J08
4211A77k3j03M0M5J24Kj67j4J8k7L0J8j1Pqo5J15K4n0N8j35K0Q4q9%J52j51NJ2J75j95M0j1
4049I7J03j32J27j19K5J05o0j13J25j08K7k2Q7J33j58m0M1j7p2R4K8j0j3j4M3L7J8j53J32
3906A91o5l3J17j07r1J05l0K25k4k50J55j9r5k0mJ10MP9q3K8J9j27n3J37ko4m0JP3M0P1k1
3748B27j05O9n0Lj09L0P2k5o8J5R1j1o0mj4J86k04j3J54k4o2N2KN3%j58J53m8J5p6m2M5oN
3581I3J24n1J77j46p9P8j08m6M3P4J06Jj50p5Q7O4n5j05N2OQN0L2O8j05j7Qp1J8m7j9J31K7
3419A73m6r5J13p4n9J86M2j1j62J30j14J1JkKJk2N2j7m8K13k8j31O0L6j29R9P8Q5l9k21o2
$$ plain form
3261 22 83 102 104 148 250 184 101 57 137 105 125 131 103 79 192 174 82 178 85 12 213 242 78 132 125 129 62 141 168 182 133 78 90 81 23 63
3084 63 65 134 147 286 204 35 157 68 219 278 62 76 238 104 77 1764 2318 170 150 117 262 158 91 44 95 90 22 78 18
2941 18 77 88 156 237 176 146 73 207 245 78 180 160 150 318 964 1485 1937 1757 358 171 55 218 60 100 42 174 57
2808 57 92 30 105 94 78 119 191 152 74 91 255 231 352 827 397 510 140 192 143 105 68 115 61 146 84 65 107 197 296 108 160 93
2651 93 251 145 72 20 178 253 133 116 142 116 113 168 34 179 50 161 169 135 13 141 126 80 230 162 93 124 204 180 100 119 68
2498 68 110 85 57 79 146 111 74 88 95 93 69 190 84 110 208 234 150 80 123 121 112 22 137 149 114 87 261 131 71 261 204 161 102 89
2331 89 67 127 35 179 85 71 81 88 108 75 198 122 19 149 91 99 56 87 51 194 108 157 221 249 152 79 132 161 300 35 239 96
2173 96 86 180 228 92 170 128 86 173 146 95 105 195 185 73 243 239 296 172 118 358 132 112 74 49 248 1662 2001 693 525
$$ packed form
3261B2O1J9KM4J02o6q3m4Q0l2K0Ok8k4J13j8r2R6r3p3K01K9j64N4pMo7P9K7J4m9n5J2rn8M0
3084F3KO9J3J39q2j69J22q9J51N9k16J4J62j34k7J687N54k148k0l3J45j04o7m7N1no8N6o0
2941A8N9J1O8Q1o1l0p3J34L8j67J02k0j0J68O46N21M52j80j399j87j16J63j58M0n8J32j17
2808E7L5o2P5j1j6M1P2l9p8J7J64k4J21M75m30J13l70N2m9l8l7M7n4Q5o2j9M2R0R9j88N2o7
2651I3J58j06p3n2J58P5j20j7K6k6lN5j34J45j29J11Ql4j22J28j5m6J50o8o9L1Q0k4q0J9n1
2498F8M2k5k8K2O7l5l7J4Pkk4J21j06K6R8K6q4p0M3krr0J15J2l5k7J74j30o0J90n7m3n9j3
2331H9k2O0r2J44r4j4J0PK0l3J23p6j03J30n8Qm3L1l6J43q6M9O4K8r7p3N3K9J39k65K04j43
2173I6j0R4M8j36P8m2m2Q7k7n1J0R0j0j12J70mN7j24n4K40k26k0l8k5J99J414L39j308j68
$$ plain form
2031 525 787 913 1156 1300 1720 1502 1033 3974 6023 18607 120799 94795 23779 8894 2751 1560 639 976
1942 976 605 681 446 525 583 530 342 130 314 236 113 134 95 251 206 145 292 347 177 343 237 162 396 145 176 249 191 104
1804 104 150 91 72 56 115 148 77 99 69 68 190 245 147 166 136 117 104 118 102 117 155 1136 2654 4890 5240 4214 1980 552 93
1661 93 7 155 232 52 43 260 54 257 135 268 183 206 217 308 175 275 29 157 49 129 59 104 208 156 231 55 221 48
1524 48 182 675 3264 5267 786 391 271 87 135 176 300 207 148 71 124 34 102 112 76 92 66 178 178 59 147 120 222 275
1386 275 216 91 101 19 77 128 358 693 82 994 1277 467 104 40 167 242 107 255 84 66 42 105 189 38 140 100 185 131
1248 131 105 94 50 75 139 142 137 70 150 141 129 205 142 213 126 45 57 68 68 48 187 108 95 179 82 75 33 85 209 89 220 23 178 96
1081 96 168 50 118 81 277 214 65 244 248 45 97 107 107 75 171 90 104 85 155 209 50 147 160 188 37 20 58 55 86 73 67 112 139 60
$$ packed form
2031E25K62J26K43J44M20k18m69K941K049J2584J02192k6004p1016j4885o143j191r21L37
1942I76l71P6k35P9N8n3j88k12J84p8j23K1l9J56m5o1J47N5j70J66j06p5K34k51L1P3n8q7
1804A04M6n9j9j6N9L3p1K2l0jJ22N5r8J9l0j9j3J4j6J5L8R81J518K236L50j026k234j428m59
1661I3q6J48P7j80rK17k06K03j22J33q5K3J1R1j33J00k46J28j08Q0p0M5J04n2P5j76J66j73
1524D8J34M93K589K003m481l95j20j84M8M1J24r3n9p7N3r0O8J0l6J6k6J12%j19Q8k7J02N3
1386B75n9j25J0q2N8N1K30L35o11R12K83q10l63o4J27P5j35J48j71j8k4O3Q4j51J02m0Q5n4
1248A31k6j1m4K5O4Lno7Q0rj2P6o3P1q7q1J2J1%k0J39p9j3Q4r7pm2N2J24j20J31j97J55q2
1081I6P2j18O8l7J96o3j49J79Mk03N2J0%l2R6q1J4j9P0N4j59R7J3K8j51j7L8lL1j3oM5K7p9
$$ plain form
913 60 169 93 176 220 183 273 19 157 215 132 93 111 238 146 47 69 36 154 178 48 64 80 76 207 267 131 89 103 164 252 83 180
756 180 195 44 217 135 261 39 166 79 206 97 102 149 72 63 233 291 177 35 41 103 151 152 141 200 174 100 158 48 68 69 76 66 175
593 175 338 139 95 97 160 106 272 135 245 423 1417 4259 3703 3055 4380 2065 302 148 242 249 142 213 262 48 110 91
465 91 101 27 158 208 146 222 151 18 260 56 91 61 102 6 90 102 128 185 61 77 68 209 231 257 114 49 128 54 85 42 38 90 134
303 134 243 107 127 342 64 105 106 82 83 105 110 117 198 55 57 186 134 78 72 167 99 95 87 107 117 95 162 147 386 268 166 150 167 189 180
131 180 147 141 290 245 205 160 148 33 83 42 112 151 68 12 55 182 112 208 124 47 161 174 102 103 151 96 68 187 196 146 145 80 255 97
-37 97 56 86 69 85 87 82 172 267 259 356 153 138 139 225 159 102 66 141 55 88 110 222 174 136 198 241 161 135 144 107 161 92 208 171 20 140
-214 140 197 69 46 24 285 183 81 354 173 84 207 133 235 170 199 120 101 159 105 141 44 85 225 53 91 217 165 41 121
$$ packed form
913F0J09p6Q3M4l7R0k54J38N8q3l9J8J27r2r9K2l3J18K4j30J6J6mJ31O0j36m2J4O1Q8j69R7
756A80J5j51J73q2J26k22J27q7J27j09NM7p7rJ70N8j14j42OO2M8Jj1N9k6p4N8j10K0JPj0J09
593A75J63j99m4KO3n4J66j37J10J78R94K842n56o48J325k315j763j54R4Pj07P1M9k14O2j9
465I1J0p4J31N0o2P6p1j33K42k04L5l0M1r6Q4J2K6N7j24J6rJ41K2K6j43o5P9p4L1m3mN2M4
303A34J09j36K0K15k78M1Jk4JK2NPQ1j43KJ29n2n6oR5o8mqK0J0k2O7j5K39j18j02j6J7K2r
131A80l3oJ49m5m0m5j2j15N0m1P0L9q3n6M3J27p0R6q4p7J14J3p2JM8n5k8J19Rn0jo5J75j58
-37I7m1L0j7J6KnR0R5qR7k03j5JQ6o6n7l6P5q6L3K2J12m8l8O2M3q0k6Rl7N4o9J16l7j51J20
-214A40N7j28k3k2K61j02j02K73j81q9J23p4J02o5K9p9j9N8n4L6r7M1J40j72L8J26n2j24Q0
$$ plain form
-357 121 225 123 118 99 247 23 90 180 25 151 239 210 136 72 16 196 119 130 63 256 67 271 116 176 81 134 64 283 57
-499 57 237 170 149
$$ packed form
-357A21J04j02nj9J48k24O7R0j55J26Q8k9p4o4n6J80p7J1o7J93j89K04j55O0r5N3p0K19k26
-499E7J80o7k1
-514A49
##PAGE=	F1=-499.474
##FIRST=	4521.1594499999982872,	4521.1594499999982872,	0.042023457586765289307
##DATA TABLE=	(F2++(Y..Y)), PROFILE
$$ plain form
4521 198 198 214 222 33 60 64 217 65 101 36 75 114 159 118 109 150 105 70 79 123 166 58 137 109 183 266 159 126 87 140 127 19 86 57
4354 57 179 96 57 133 64 138 68 144 101 126 93 176 68 59 74 163 196 48 75 223 26 174 60 58 144 136 169 13 117 147 89 141
4196 141 136 228 271 128 70 34 96 92 118 62 136 139 30 134 144 98 143 54 113 138 152 71 172 66 6 179 301 79 152 129 190 29
4039 29 227 34 43 149 158 18 128 70 54 77 126 309 106 106 109 93 20 84 102 138 196 131 174 204 165 52 164 129 82 134 134 42 97
3876 97 63 311 246 19 214 150 36 54 72 158 163 225 183 208 205 122 74 149 169 118 59 79 144 182 230 190 110 125 147 126 44 16 98 113
3709 113 53 48 152 108 89 61 37 214 29 74 195 188 103 142 156 177 177 48 178 121 136 58 24 110 79 117 212 228 260 148 139 168 85
3547 85 43 78 158 295 268 116 48 92 162 125 4 82 114 57 113 229 294 139 113 143 59 117 75 50 107 151 143 29 141 100 62 190
3389 190 248 257 40 174 83 79 114 50 74 115 61 109 71 115 290 269 113 167 172 109 196 241 358 296 104 32 90 134 103 113 226 217 136
$$ packed form
4521A98%J6Qj89K7MJ53j52L6o5L9L9M5m1rM1m5l5RM4M3j08P9k8P4Q3j07l3l9N3j3j08O7k9
4354E7J22q3l9P6o9P4p0P6m3K5l3Q3j08rJ5Q9L3j48K7J48j97J48j14kQ6qL3j56J04L0n8N2
4196A41nR2M3j43n8l6O2mK6n6P4Lj09J04J0m6M5q9N9K5J4q1J01j06o0J73J22k22P3k3O1j61
4039B9J98j93RJ06Rj40J10n8j6K3M9J83k03%Lj6p3O4J8L6N8o5M3L0l9j13J12l5m7N2%r2N5
3876I7l4K48o5k27J95o4j14J8J8Q6NO2m2K5lq3m8P5K0n1n9K0O5L8M8m0q0J5K2k1q2k8Q2J5
3709A13o0nJ04m4j9k8k4J77j85M5J21pq5L9J4K1%j29J30n7J5p8l4Q6l1L8R5J6L2j12rK9q3
3547H5m2L5Q0J37k7j52o8M4P0l7j21P8L2n7N6J16O5j55k6L0q4N8m2k5N7M4qj14J12m1l8J28
3389A90N8Rk17J34r1mL5o4K4M1n4M8l8M4J75k1j56N4No3Q7M5J17o2j92p2N8M4l1J0J13rq1
$$ plain form
3227 136 98 83 90 115 73 100 82 197 171 96 178 79 66 218 196 94 140 123 132 52 99 164 196 142 93 33 63 24 54 95 130 165 284 204
3059 204 58 125 54 255 239 48 63 197 98 130 2054 2898 265 241 107 273 140 68 101 100 60 8 66 77 92 128 102 243 184
2917 184 141 129 167 279 89 118 164 149 248 1251 1937 2131 2043 321 240 73 191 31 162 27 150 67 100 13 112 136 66 84
2779 84 160 118 124 34 230 217 478 1166 624 485 199 197 168 166 58 111 103 167 92 96 129 192 249 54 112 93 225 128 65 58 182 296 129
2616 129 149 140 177 115 188 89 130 29 180 163 105 27 119 113 128 269 152 99 126 177 166 64 142 107 111 45 76 109 121 102 129 119 49 76
2449 76 93 161 50 116 235 282 186 105 68 123 122 44 91 183 47 92 171 155 97 183 271 140 36 59 79 92 42 244 56 106 124 28
2291 28 20 29 218 67 95 93 111 58 49 59 124 131 207 184 251 291 136 139 101 108 241 69 161 139 146 191 158 209 54 58 47 156 195 94 152 164
2114 164 53 99 261 49 182 67 305 272 299 68 266 240 164 196 575 34 22 246 412 805 895 1680 2484 3002 3552 4662
$$ packed form
3227A36l8j5PK5m2K7j8J15k6p5Q2r9j3J52k2j02M6j7Rq0M7O5L2n4m9o0L0l9L0M1L5L5J19q0
3059B04j46O7p1K01j6j91J5J34r9L2J924Q44k633k4j34J66j33p2L3jm0n2N8J1J5L6k6J41n9
2917A84m3j2L8J12j90K9M6j5R9J003O86J94q8j722q1j67J18j60J31j35J23q3L3q7R9K4p0J8
2779H4P6m2Or0J96j3K61O88n42j39k86kk9kj08N3qO4p5ML3O3N7j95N8j9J32r7o3pJ24J14j67
2616A29K0rL7o2P3r9M1j01J51j7n8p8R2oJ5J41j17n3K7N1j1j02P8l5Mo6L1L3J2j9K7j0p0K7
2449G6J7O8j11O6J19M7r6q1l7N5jp8M7R2j36M5P9j6n8Q6Q8j31j04K3K0J3n0K02j88N0J8r6
2291B8qRJ89j51K8kJ8n3rJ0O5PP6k3O7M0j55Ll8PJ33j72R2k2PM5l3N1j55Mj1J09L9j01N8J2
2114A64j11M6J62k12J33j15K38l3K7k31J98k6p6L2L79n41j2K24J66L93R0P85Q04N18N50J110
$$ plain form
1986 4662 15239 47636 8149 20736 11907 2971 1452 565 528 414 29 146 236 230 232 40 371 350 255 81 311 201
1878 201 164 127 264 151 253 287 239 59 303 330 136 141 382 137 87 69 111 38 76 169 126 63 80 39 56 168 177 168 176 149 55 177
1720 177 58 53 90 176 1098 2601 4936 5228 4214 1926 625 72 45 173 156 102 40 258 133 212 223 256 159 238 214 309 170
1588 170 220 73 133 81 147 61 71 221 118 219 76 131 32 170 737 3702 5965 899 397 340 47 211 208 338 215 163
1460 163 28 124 75 55 129 48 120 117 210 167 52 116 114 233 243 181 134 91 10 90 137 489 872 57 1264 1688 608 129 92 167
1312 167 209 79 276 76 86 49 134 161 13 144 49 199 154 98 75 46 68 180 112 149 34 196 168 147 148 129 183 145 54 50 42 80
1154 80 51 147 141 89 155 63 27 46 123 205 130 222 41 155 102 204 58 124 78 265 230 90 194 212 81 154 159 160 69 159 63 113 138
992 138 176 186 57 108 194 181 69 34 108 36 52 68 7 137 141 102 204 149 157 262 134 260 8 117 212 146 93 144 253 185 38
$$ packed form
1986D662J0577L2397l9487J2587q829q936j519q87l7j14l85J17R0oKj92L31k1r5j74K30j10
1878B01l7l7J37j13J02L4m8j80K44K7j94NK41k45n0j8M2p3L8R3m3o3J7m1J7J12RrQk7r4J22
1720A77j19nL7Q6R22J503K335K92j014k288j301n53k7J28j7n4o2K18j25P9J1L3r7P9k4R5j39
1588A70N0j47O0n2O6q6J0J50j03J01j43N5r9J38N67K965K263n066n02n7k93J64lJ30j23n2
1460A63j35R6m9k0P4q1P2lR3m3j15O4kJ19J0o2m7m3q1Q0M7L52L83q15J207M24j080m79l7P5
1312A67M2j30J97k00J0l7Q5K7j48J31r5J50m5n6k3k9K2J12o8L7j15J62k8k1Jj9N4l8r1mqL8
1154H0k9R6on2O6r2l6J9P7Q2p5R2j81J14n3J02j46O6m6J87l5j40J04J8j31P3NJr1R0r6N0K5
992A38L8J0j29N1Q6j3j12l5P4p2J6J6o1J30Ml9J02n5QJ05j28J26k52J09R5o6n3N1J09o8j47
$$ plain form
839 38 78 51 142 147 58 57 81 51 186 255 111 93 106 190 320 59 173 178 117 230 110 292 40 131 72 201 89 118 135 103 73 175
682 175 300 176 52 54 62 137 136 164 190 142 129 194 76 75 79 95 78 176 310 158 134 144 160 75 228 121 192 385 1315 4016 4009 3194
524 3194 4162 1961 276 110 244 249 178 222 229 108 147 86 62 83 129 204 128 185 112 62 286 39 114 21 69 16 117 90 160 167 91
372 91 118 92 265 214 251 126 51 145 50 60 58 73 77 144 219 137 173 310 69 116 30 38 82 159 150 101 193 83 4 194 174 79 1 150
204 150 116 65 53 85 117 90 150 148 381 265 109 88 114 133 172 176 172 269 232 186 183 138 26 75 42 96 82 73 74 66 166 193 230 109 37 129
27 129 162 93 110 161 93 91 154 225 164 120 100 229 94 73 103 58 105 105 51 161 235 226 286 173 164 142 227 177 104 73 100 37 97 74 189
-145 189 156 166 222 209 140 157 106 152 118 66 208 170 21 175 162 81 71 26 199 169 21 339 215 142 159 128 208 159 176 173 96 101
-303 101 144 105 12 37 206 44 100 184 181 64 134 186 141 40 71 190 59 48 137 54 127 279 176 116 66 31 167 82 104 70 187
$$ packed form
839C8M0k7R1Nq9jK4l0J35O9j44j8J3Q4J30k61J14No1J13j20J82k52R1n9J29j12K9J7l2l0J02
682A75J25j24j24KQP5jK8K6m8j3O5j18jMJ6j7R8J34j52k4J0J6q5J53j07P1J93R30K701pq15
524C194R68k201j685j66J34Np1M4Pj21L9o1k4K1M6P5p6N7p3n0K24k47P5r3M8n3J01k7P0Pp6
372I1K7k6J73n1L7j25p5R4r5J0kJ5MO7P5q2L6J37k41M7q6QM4P7rm9R2j10p9J90k0r5p8J49
204A50l4n1j2L2L2k7O0kK33j16j56k1K6J9L9MmR7l7m6lm5j12M9l3N4j4rJqJ00K7L7j21p2R2
27A29L3o9J7N1o8kO3P1o1m4k0J29j35k1L0m5M7%n4J10P4rO0j13rk2Q5n0p3l1K7o3O0k3J15
-145A89l3J0N6j3o9J7n1M6l4n2J42l8j49J54j3q1j0m5J73l0j48L18j24p3J7l1Q0m9J7lp7N
-303A01M3l9r3K5J69j62N6Q4lj17P0N2m5j01L1J19j31j1Q9q3P3J52j03o0n0l5J36q5K2l4J17
$$ plain form
-455 187 83 241 115 133 88 118 71 261 18 235 103 160
$$ packed form
-455A87j04J58j26J8m5L0m7J90k43K17j32N7
-514A60
##PAGE=	F1=-509.319
##FIRST=	4521.1594499999982872,	4521.1594499999982872,	0.077916346490383148193
##DATA TABLE=	(F2++(Y..Y)), PROFILE
$$ plain form
4521 106 109 283 148 134 116 118 219 157 84 170 61 25 93 199 58 97 111 47 160 112 110 92 154 148 246 205 270 72 128 97 149 53 126
4359 126 76 105 129 73 89 156 204 123 131 112 74 25 149 95 91 125 177 119 63 167 213 96 125 136 32 94 159 149 33 110 110 126 222 108
4191 108 146 302 192 35 70 103 120 107 41 181 168 8 85 126 69 71 95 181 80 250 75 137 57 83 269 308 87 215 134 176
4044 176 56 256 45 32 76 180 49 88 104 33 115 101 331 70 150 81 65 87 14 110 102 272 127 192 190 116 53 123 139 106 71
3891 71 149 85 127 28 323 170 27 224 114 18 49 105 143 161 174 218 250 163 161 132 119 158 149 50 99 145 189 176 137 90 48 175 98
3729 98 73 54 34 128 97 67 152 91 93 51 85 161 47 192 222 213 99 106 174 137 137 49 138 110 107 25 35 131 57 176 174 300 139 120 160
3556 160 121 85 97 84 143 322 243 144 111 71 120 137 53 74 124 10 88 263 329 140 103 146 36 173 151 79 69 124 164 18 144
3404 144 113 116 179 252 270 19 138 63 84 153 59 19 153 27 64 55 163 286 290 120 155 140 164 208 196 384 241 176 65 96 175
$$ packed form
4521A06LJ74j35j4j8KJ01o2p3Q6j09l6O8J06j41L9J4o4J13m8kj8O2oR8m1O5j98N6l1N2r6P3
4359A26n0K9K4n6J6O7M8q1Qj9l8m9J24n4mL4N2n8n6J04M6j17K9J1j04O2O5j0j16P7%J6R6j14
4191A08L8J56j10j57L5L3J7j3o6J40j3j60P7M1n7KK4Q6j01J70j75O2q0K6J86L9k21J28q1M2
4044A76j20K00k11j3M4J04j31L9J6p1Q2j4K30k61Q0o9j6K2p3R6qJ70j45O5kp4o3P0J6l3l5
3891G1P8o4M2r9K95j53j43J97j10r6L1N6L8J8J3M4L2q7kk9j3L9rr9M9M6M4j3l9m7m2J27p7
3729I8k5j9k0R4l1l0Q5o1Km2L4P6j14J45L0rj14PO8l7%q8Q9k8lq2J0R6p4J19kJ26j61j9M0
3556A60l9l6J2j3N9J79p9r9l3m0M9J7q4K1N0j14P8J75O6j89l7M3j10J37k2p2j0N5M0j46J26
3404A44l1LO3P3J8k51J19p5K1O9r4m0J34j26L7rJ08J23Mj70L5j5K4M4j2J88j43o5j11L1P9
$$ plain form
3251 175 138 59 201 229 174 146 27 77 115 83 68 163 183 183 141 160 75 114 214 151 107 167 135 126 35 108 155 215 156 121 64 77 27 48
3084 48 124 111 169 298 184 109 108 35 319 172 47 57 137 94 169 2186 3263 360 337 94 293 170 72 178 124 72 12 103
2946 103 161 90 168 96 241 184 117 212 89 350 115 9 206 177 156 2302 3996 4108 3174 244 301 102 147 19 242 86
2818 86 115 114 104 24 169 190 47 37 138 92 185 46 225 223 571 1578 943 580 274 164 181 246 28 118 176 153 114 172 163 215
2670 215 210 46 64 129 169 118 139 111 155 331 112 210 130 258 94 237 179 40 89 216 145 102 69 136 135 202 314 103 153 145 150 165
2513 165 105 202 152 147 26 131 176 68 111 210 187 122 97 179 116 155 161 272 324 221 176 49 206 154 120 71 249 95 149 67 235
2360 235 166 81 365 71 189 52 196 106 148 360 43 244 183 128 199 153 303 57 249 103 240 106 178 198 256 28 369
2227 369 298 332 334 295 251 235 235 264 265 184 308 309 342 221 419 172 211 270 226 402 374 395 324 367 421 507 310 405 451 640 378 622
$$ packed form
3251A75l7p9J42K8n5k8j19N0L8l2j5R5K0%m2J9q5L9J00o3m4O0l2rr1P3M7O0n9l5n7J3n0K1
3084D8P6j3N8J29j14p5jp3K84j47j25J0Q0m3P5K017J077k903k3k43J99j23r8J06n4n2o0R1
2946A03N8p1P8p2J45n7o7R5j23K61k35j06J97k9k1K146J694J12r34k930N7j99M5j28K23j56
2818H6K9jj0q0J45K1j43j0J01m6R3j39J79kL48J007o35l63l06j10J7O5k18R0N8k3l9N8rN2
2670B15nj64J8O5M0n1K1k8M4J76k19R8q0J28j64J43n8j39M9J27p1m3l3O7jO7J12k11N0qNJ5
2513A65o0R7n0nj21J05M5j08M3R9k3o5k5Q2o3L9OJ11N2j03m5j27J57n2l4m9J78j54N4q2J68
2360B35o9q5K84k94J18j37J44r0M2K12l17K01o1n5P1m6J50k46J92j46J37j34P2K0N8k28L41
2227C69p1L4Kl9m4j6%K9Jq1J24JL3j21J98k47L9N9m4J76k8K1p1M3N4Q6j97R5M6J89k62K44
$$ plain form
2070 622 334 595 619 610 1135 176 1072 973 919 1244 1448 1495 2235 4219 5883 1910 1206 4427 177318 184710 21473 9037
1962 9037 1727 1255 1641 1122 1575 1378 1277 1258 1020 791 647 1009 774 576 361 633 493 391 438 566 244 440 565
1848 565 339 299 562 382 251 328 592 194 222 246 296 220 292 360 220 231 299 159 183 303 148 303 278 224 116 322 153 213
1711 213 150 294 993 2283 4693 5035 4122 1759 723 136 158 234 92 200 183 236 252 101 336 230 182 294 217 337 180
1588 180 150 200 75 178 215 108 76 261 85 202 131 83 35 206 763 3678 6301 1070 432 416 58 308 250 364 229
1464 229 191 123 136 152 85 195 54 191 223 243 195 93 99 105 246 228 110 198 79 64 139 142 618 981 50 1450 1988 674 160
1322 160 174 183 193 48 308 87 145 74 193 139 74 191 57 178 198 139 97 68 45 240 71 188 106 247 161 223 82 125 127 183
1174 183 53 61 92 99 68 111 226 64 123 107 44 29 206 169 176 210 65 128 110 239 93 167 48 215 268 156 136 154 144 225 189
$$ packed form
2070F22k88K61K4rN25r59Q96r9n4L25K04M7P40J984J664l973p04L221J72891P392j63237j2436
1962I037p310m72L86n19M53j97j01j9k38k29j44L62k35j98k15K72j40j02M7J28l22J96J25
1848E65k26m0K63j80j31P7K64l98K8K4N0p6P2O8j40J1O8j40K4J20j55J55k5n4j08K06j69O0
1711B13o3J44O99J290K410L42r13k363j036n87K2P6j42J08j7N3J6j51K35j06m8J12p7J20j57
1588A80l0N0j25J03L7j07l2J85j76J17p1m8m8J71N57K915K623n231o38j6l58K50n8J14j35
1464B29l8o8J3J6o7J10j41J37L2K0m8j02OOJ41j8j18Q8j19j5P5LM76L63r31J400N38j314n14
1322A60J4RJ0j45K60k21N8p1J19n4o5J17j34J21K0n9m2k9k3J95j69J17q2J41q6O2j41M3KN6
1174A83j30QL1Pl1M3J15j62N9j6o3j5J77l7PL4j45O3j8J29j46P4j19J67N3j12k0J8j0Q1l6
$$ plain form
1021 189 219 73 145 22 113 210 213 184 44 26 257 142 115 100 171 38 43 49 67 147 150 170 210 239 109 315 48 256 20 74 194
869 194 171 78 183 239 227 79 125 132 112 150 112 33 104 39 158 232 90 99 107 201 354 73 175 133 213 259 83 294 72 101 75 193
711 193 93 149 114 152 49 107 299 164 96 108 48 101 128 185 188 95 150 212 80 69 171 116 109 204 242 189 182 202 142 33 172 91 134
549 134 320 1193 3745 4139 3154 3896 1767 254 78 202 228 207 221 194 170 174 134 30 174 71 222 135 135 74 121 288 56
416 56 133 50 48 43 145 78 198 132 95 185 116 318 175 227 126 84 154 65 58 51 138 41 168 215 131 241 246 104 156 51 10 79 208
254 208 175 93 158 136 78 166 232 93 102 113 152 16 28 66 118 80 153 129 348 265 71 46 57 117 183 192 210 231 222 156 189 100 71 60 94
81 94 104 51 54 159 100 123 287 233 99 50 112 142 62 143 185 72 118 118 236 199 156 104 167 100 99 114 55 138 103 98 115 191 210 175 208 217
-96 217 140 221 184 116 98 77 87 71 61 171 158 187 269 131 110 209 100 197 55 65 225 157 49 218 95 56 148 82 80 150 104 307
$$ packed form
1021A89L0j46P2j23R1R7Lk9j40j8K31j15k7j5P1j33NOJ8Q0LK0M0K9j30K06k67K08k36N4J20
869A94k3r3J05N6j2j48M6Pk0L8l8p9P1o5J19P4j42RQR4J53k81J02m2Q0M6j76K11k22K9k6J18
711A93j00N6l5L8j03N8J92j35o8J2o0N3K7N7Lr3N5O2j32j1J02n5pR5L8n3pK0o0j09J39q1M3
549A34J86Q73K552L94r85P42k129j513j76J24K6k1J4k7k4Mm0j04J44j03J51q7%o1M7J67k32
416E6P7q3knJ02o7J20o6l7R0o9K02j43N2j01m2P0q9ppQ7r7J27M7q4J10Nj42N2j05m1O9J29
254B08l3q2O5k2n8Q8O6j39RJ1L9j36J2L8N2l8P3k4K19q3j94k5J1O0O6RJ8K1ro6L3q9k9j1L4
81I4J0n3LJ05n9K3J64n4j34m9O2L0q0Q1M2j13M6%J18l7m3n2O3o7jJ5n9Q3l5nJ7P6J9l5L3R
-96B17p7Q1l7o8j8k1J0j6j0J10j3K9Q2j38k1R9j09R7j42J0J60o8j08J69j23l9R2o6kP0m6K03
$$ plain form
-253 307 274 188 106 135 150 158 105 244 69 35 224 24 120 94 156 75 178 124 146 111 182 154 146 79 113 68 143 72 58 152 116 342 110
-416 110 87 75 88 93 32 206 92 44 242 124 243 77 183 177 189 147 109 208 46 238
$$ packed form
-253C07l3q6q2K9J5Qn3J39j75l4J89k00R6k6O2q1J03n4K2l5P1k8qo7L4m5P5p1j4R4l6K26k32
-416A10k3j2J3No1J74j14m8J98j18J19j66J06oJ2m2l8R9j62J92
-514B38
##PAGE=	F1=-519.163
##FIRST=	4521.1594499999982872,	4521.1594499999982872,	0
##DATA TABLE=	(F2++(Y..Y)), PROFILE
$$ plain form
4521 160 232 459 219 384 354 377 341 397 294 374 243 218 129 320 201 116 231 212 300 314 156 297 297 291 359 190 421 53 203
4378 203 19 212 130 217 162 141 212 246 160 310 327 228 204 127 157 103 130 111 185 257 235 22 170 291 275 203 133 243 118 17
4231 17 207 115 51 220 72 174 338 109 19 368 281 125 205 92 214 81 116 240 197 69 36 188 77 123 195 278 25
4098 25 359 111 182 52 174 345 282 109 290 121 181 170 298 162 128 97 225 94 44 147 38 141 74 346 43 215
3970 215 38 145 181 88 192 99 351 104 214 151 77 65 105 159 172 152 166 149 236 106 352 89 93 218 69 72 38 150 139 170
3822 170 118 278 326 104 227 200 118 125 189 45 122 142 202 85 93 99 93 230 127 135 149 56 157 162 121 148 97 95 62 164 91 98 326 271
3655 271 250 114 80 222 121 117 49 90 108 100 17 107 166 96 263 97 375 24 125 180 75 91 152 88 125 347 189 204 201 110 136
3502 136 187 135 87 137 83 89 278 346 151 95 145 64 249 252 110 113 148 203 11 173 117 157 170 259 267 79 104 31 155 214 150 78 213
$$ packed form
4521A60P2K27k40J65l0K3l6N6j03Q0j31k5q9J91j19q5J15j9Q8J4j58J41%oO8j69K31l68J50
4378B03j84J93q2Q7n5k1P1L4q6J50J7r9k4p7L0n4K7j9P4P2k2k13J48J21j6p2p0J10j25j01
4231A7J90r2o4J69j48J02J64k29r0L49q7j56Q0j13J22j33L5J24m3j28l3J52j11M6P2Q3k53
4098B5L34k48P1j30J22J71o3j73J81j69O0j1J28j36l4l1J28j31n0J03j09J03o7K72l03J72
3970B15j77J07L6r3J04r3K52k47J10o3p4j2M0N4J3k0J4j7Q7j30K46k63MJ25j49Ll4J12j1L1
3822A70n2J60M8k22J23k7q2PO4j44P7K0O0j17QOoJ37j03QJ4r3J01Nm1K7n1kl3J02p3PK28n5
3655B71k1j36l4J42j01mo8M1J8qq3R0N9p0J67j66K78l51J01N5j05J6O1o4L7K22j58J5lr1K6
3502A36N1n2m8N0n4OJ89O8j95n6N0q1J85Lj42LL5N5j92J62n6M0J3Q9Qj88K5p3J24N9o4p2J35
$$ plain form
3340 213 59 20 95 203 261 304 141 128 144 231 228 136 426 141 281 117 109 228 195 56 177 216 213 191 49 108 139 178 39 278
3192 278 156 221 208 128 72 136 201 106 114 214 175 161 48 197 179 248 194 147 154 129 27 56 153 98 173 332 161 181 193 42 410
3040 410 81 110 65 103 92 182 2122 3312 433 430 125 327 265 139 276 172 162 2 152 258 67 198 166 255 184 115 314
2907 314 49 451 159 158 287 234 61 4066 7335 7644 5400 318 345 143 130 88 332 174 103 182 115 67 252 246 55 36
2779 36 125 101 259 129 263 281 653 2090 1429 1093 354 129 194 335 74 140 270 102 185 287 226 286 230 163 70 194 115
2646 115 118 228 186 100 366 124 296 172 357 142 326 299 85 183 281 129 179 135 224 183 300 386 67 263 230 201 212 237 303
2503 303 221 233 114 208 278 88 170 313 303 256 176 319 147 328 259 335 379 276 287 170 357 226 238 165 364 256 277 231 365
2360 365 282 156 481 60 397 118 359 229 304 521 196 442 278 337 427 321 461 224 449 283 435 250 403 417 441
$$ packed form
3340B13j54l9P5J08N8M3j63j3J6Q7lr2K90k85J40j64qJ19l3j39J21L9lk2j42N9L1L9j39K39
3192B78j22O5j3q0n6O4O5r5QJ00l9j4j13J49j8O9n4m7Pk5j02K9R7n5P5J59j71K0J2j51L68
3040D10l29K9m5L8j1R0J940J190k879ll05K02o2j26J37j04j0j60J50J06j91J31l2Q9p1o9J99
2907C14k65M02k92jJ29n3j73M005L269L09k244n082K7k02j3m2K44j58p1P9o7m8J85oj91j9
2779C6Q9k4J58j30J34J8L72J437o61l36p39k25O5J41k61O6J30j68Q3J02o1O0n6o7r3J24p9
2646A15LJ10m2q6K66k42J72j24J85k15J84k7k14R8R8j52N0m4Q9m1J17Q6l19J96l3k9J1K5O6
2503C03q2J2j19R4P0j90Q2J43j0m7q0J43j72J81o9P6M4j03J1j17J87j31J2p3J99j08K1m6J34
2360C65q3j26L25m21L37k79K41j30P5K17l25K46j64N9R0j06J40k37K25j66J52j85J53J4K4
$$ plain form
2237 441 237 596 503 509 428 559 427 469 487 467 557 447 577 575 610 503 711 475 498 587 456 741 766 771 697 856 905 981 834 907
2090 907 998 1099 801 1041 736 1051 1178 1302 2275 759 2437 2450 2631 3159 3415 3573 4072 6608 9373 2074 6064 16379
1981 16379 478467 481006 39021 6957 4073 3715 4156 3485 3806 3518 3111 2965 2496 2025 1631 1902 1434 1108 766
1888 766 1062 907 837 969 1036 749 973 1008 789 796 936 707 538 660 870 450 479 543 595 506 608 653 484 514 608 400 386 560
1750 560 328 532 467 405 327 536 352 444 364 489 903 1746 4190 4775 4025 1505 800 309 334 360 272 348 379 257 404 93
1622 93 470 225 296 390 260 428 262 197 380 96 319 342 207 192 347 148 219 217 177 108 276 751 3209 6235 1240 509
1494 509 507 199 414 320 382 268 238 261 184 259 212 308 143 300 361 311 276 183 159 129 274 263 13 284 104 148 256 182 736 996
1346 996 104 1528 2135 653 198 277 217 204 58 358 156 245 135 281 177 208 279 151 136 260 210 152 110 45 314 104
$$ packed form
2237D41k04L59r3Oq1J31j32M2J8k0R0j10J30kL5j07K08k36K3Q9j31K85K5Np4J59M9P6j47P3
2090I07R1J01k98K40l05L15J27J24R73j516J678J3J81N28K56J58M99K536K765p299L990J0315
1981A6379M62088K539m41985l2064k884l58M41o71L21k88m07j46m69m71l94K71m68l26l42
1888G66K96j55p0J32O7k87K24L5k19PJ40k29j69J22K10m20K9O4N2q9J02M5j69L0R4k08j4J74
1750E60k32K04o5o2p8K09j84R2q0J25M14Q43K444N85p50k520p05m91K5K6q8P6L1j22J47l11
1622I3L77k45P1R4j30J68j66o5J83k84K23K3j35j5J55j99P1km0o9J68M75K458L026m995p31
1494E09kl08K15r4O2j14l0K3p7P5m7R6j65J57O1n0l5r3k4l0J45j1k50K71j80M4J08p4N54K60
1346I96q92J424O07j482m55P9o0j3j46L00k02Q9j10J46j04L1P1j28j5J24n0n8m2o5K69k10
$$ plain form
1218 104 249 223 317 111 341 114 159 70 247 61 83 160 138 101 138 331 69 113 228 132 51 309 116 224 201 78 113 137
1081 137 276 153 252 52 140 329 259 170 85 224 303 192 278 81 155 51 98 292 275 230 15 91 339 110 175 178 225 67 79
938 79 39 150 135 180 256 189 352 56 383 75 276 62 74 164 197 50 232 197 270 153 205 242 61 222 192 51 145 74 139
795 139 200 74 105 110 203 357 147 209 68 325 312 114 270 115 104 84 184 124 182 92 218 34 122 305 163 170 184 148 41
652 41 131 200 195 39 171 218 62 45 292 159 164 261 132 233 240 250 119 19 114 56 99 240 1112 3430 4031 2923 3589 1486
514 1486 251 115 120 197 225 214 169 226 174 223 34 297 42 270 199 110 115 187 262 101 149 94 34 84 183 117 247 159 90 276 164
362 164 371 114 198 120 119 151 92 89 29 215 37 210 272 77 329 154 160 226 127 59 69 249 185 105 89 213 184 119 317 143 237
209 237 71 193 60 33 55 131 61 174 122 298 281 155 103 99 227 210 206 262 175 216 112 182 33 154 82 186 148 168 41 257
$$ packed form
1218A04J45k6R4k06K30k27M5q9J77j86K2P7k2l7L7J93k62M4J15r6q1K58j93J08k3j23L5K4
1081A37J39j23R9k00Q8J89p0q9q5J39P9j11Q6j97P4j04M7J94j7m5k15P6K48k29O5LM7j58J2
938G9m0J11j5M5P6o7J63k96L27l08K01k14J2R0L3j47J82l5P3j17N2L7j81J61l0j41R4p1O5
795A39O1j26L1NR3J54k10O2j41K57j3j98J56j55j1k0J00o0N8r0J26j84Q8J83j42PJ4l6j07
652D1R0O9nj56J32M7j56j7K47j33NR7j29J01PJ0j31j00R5n8M3J41Q72K318O01j108O66k103
514A486j235j36NP7K8j1m5N7n2M9j89K63k55K28p1q9NP2P5j61M8n5o0N0R9o6J30q8o9J86j12
362A64K07k57Q4p8jL2n9lo0J86j78J73O2j95K52j75OO6r9o8J0J80o4q0j6J24k9o5J98j74R4
209B37j66J22j33k7K2P6p0J13n2J76j7j26n2mJ28j7mN6q7M1j04P0j49J21p2J04l8K0j27K16
$$ plain form
62 257 169 53 384 217 104 83 119 121 12 222 234 108 165 181 249 252 265 96 84 118 130 121 75 187 112 189 88 204 244 30 268
-91 268 302 173 213 186 153 141 65 167 23 153 195 237 228 344 91 111 293 192 247 41 96 267 138 136 271 151 29 267 187
-234 187 161 176 263 275 350 209 128 167 58 189 29 339 128 176 347 124 281 232 134 147 298 73 59 183 271 210 161 236 272
-376 272 134 279 250 173 309 216 444 134 152 184 206 91 182 421 221 180 501 126 481 255 378 377 392 61 284 283 226 398
$$ packed form
62B57q8j16L31j67j13k1L6Kj09K10J2j26N7J6O8LJ3j69j2L4J2rm6J12p5P7j01J16M0k14K38
-91B68L4j29M0k7l3j2p6J02j44J30M2M2rJ16k53K0J82j01N5k06N5J71j29kJ35j20j22K38q0
-234A87k6J5Q7J2P5j41q1L9j09J31j60L10k11M8J71k23J57m9r8J3J51k25j4J24Q8o1m9P5L6
-376B72j38J45k9p7J36r3K28l10J8L2K2j15R1K39k00m1L21l75L55k26J23jJ5l31K23jn7J72
-514C98
##PAGE=	F1=-529.008
##FIRST=	4521.1594499999982872,	4521.1594499999982872,	0
##DATA TABLE=	(F2++(Y..Y)), PROFILE
$$ plain form
4521 417 520 722 504 708 677 702 604 709 587 631 504 465 345 478 425 272 434 438 492 607 348 561 534 484 522 335 597
4388 597 194 309 140 325 250 352 307 333 354 457 339 500 492 372 334 180 303 238 171 114 302 422 329 211 330 438 416
4255 416 343 257 380 229 118 281 100 39 369 134 246 482 208 155 472 387 291 359 81 343 46 210 302 232 158 119 314
4122 314 156 281 338 394 147 468 193 289 67 266 403 223 167 368 142 233 309 365 310 246 229 293 163 68 192 80 151 81
3985 81 369 130 294 69 306 297 208 307 204 426 78 240 91 63 90 160 191 273 285 211 232 390 223 394 132 175 193 58
3847 58 122 15 200 169 214 124 365 423 118 330 273 176 92 232 75 145 136 220 38 112 170 206 308 236 221 261 162 201 234 187 138
3694 138 126 98 99 253 82 167 462 344 308 178 141 292 175 146 53 40 100 133 69 192 221 202 369 19 449 172 159 198 78
3551 78 102 197 80 125 368 119 281 313 188 249 261 235 142 177 177 117 273 339 174 98 153 154 339 364 164 212 242 260 45 228 123
$$ packed form
4521D17J03K02k18K04l1K5r8J05j22M4j27l9j20J33n3j53J62MN4J15k59K13k7n0L8j87K62
4388E97m03J15j69J85p5J02m5K6K1J03j18J61qj20l8j54J23o5o7n7J88J20r3j18J19J08k2
4255D16p3q6J23j51j11J63j81o1L30k35J12K36k74n3L17q5r6O8k78K62k97J64R2p0p4l9J95
4122C14j58J25N7N6k47L21k75R6k22J99J37j80n6K01k26R1P6N6n5o4j7O4j30r5J24j12P1p0
3985H1K88k39J64k25K37rq9R9j03K22l48J62j49k8K7P0L1Q2J2p4K1J58j67J71k62M3J8j35
3847E8O4j07J85l1M5r0K41N8l05K12n7r7q4J40j57P0rQ4j82P4N8L6J02p2j5M0r9L9L3m7m9
3694A38j2k8JJ54j71Q5K95j18l6j30l7J51j17k9r3j3O0L3o4J23K9j9J67l50M30k77j3L9j20
3551G8K4R5j17M5K43k49J62L2j25O1J2k6r3L5%o0J56O6j65p6N5JJ85K5k00M8L0J8k15J83j05
$$ plain form
3399 123 178 164 274 248 157 120 59 268 294 262 195 289 145 108 153 234 220 305 176 94 199 302 284 119 480 30 400 188 136
3256 136 288 250 128 153 185 252 235 133 187 198 292 125 408 144 284 283 90 81 130 181 83 132 279 240 259 116 314 256 299 264
3108 264 167 246 193 25 82 185 134 197 384 177 270 347 98 519 46 199 88 157 88 172 1871 3010 468 513 214 374
2981 374 387 236 390 239 278 36 195 349 39 216 250 305 198 192 423 194 572 219 353 385 307 64 6269 11439 12021
2857 12021 8339 615 362 193 185 172 423 275 170 260 149 124 335 295 93 103 135 154 346 223 344 391 794 2693 2084
2734 2084 1884 435 170 219 418 167 175 372 59 296 425 324 394 318 299 154 272 145 138 310 279 66 409 196 397 280
2606 280 471 272 447 437 229 293 370 143 294 215 346 249 412 487 170 406 369 338 305 397 428 319 348 214 295 403 212 278
2469 278 432 454 410 294 491 278 525 396 421 462 365 418 319 537 338 383 315 518 444 456 477 525 435 350 608 225 622 239
$$ packed form
3399A23N5j4J10k6r1l7o1K09K6l2o7R4j44l7M5Q1j4Q5j29q2J05J03j8j65L61m50L70k12n2
3256A36J52l8j22K5L2O7j7j02N4J1R4j67K83k64J40jj93rM9N1r8M9J47l9J9j43J98n8M3l5
3108B64r7P9n3j68N7J03n1O3J87k07R3P7k49M21m73J53j11O9o9Q4J699J139k542M5k99J60
2981C74J3j51J54j51L9k42J59J54l10J77L4N5j07oK31k29L78l53J34L2p8k43O205N170N82
2857A2021l682p724k53j69qj3K51j48j05R0j11k5K11m0k02J0L2J9J92j23J21M7M03J899o09
2734B084k00j449k65M9J99k51QJ97l13K37J29j01P0p6j9j45J18j27pJ72l1k13L43k13K01j17
2606B80J91j99J75j0k08O4P7k27J51p9J31r7J63P5l17K36l7l1l3R2L1j09K9j34Q1J08j91O6
2469B78J54K2m4j16J97k13K47j29K5M1r7N3r9K18j99M5o8K03p4J2K1M8r0q5K58l83L97l83
$$ plain form
2331 239 541 404 492 709 399 670 412 597 683 515 666 431 674 521 669 431 683 680 661 503 865 763 757 594 872 650
2203 650 754 793 771 913 799 908 915 940 874 1053 835 844 962 776 1159 1228 1237 1193 1442 1512 1588 1470 1529 1638 1633 1356 1503 1214 1593
2060 1593 1866 2150 3283 2138 4041 4292 4767 5540 5979 6286 6726 9349 13037 6284 14799 43324 864228 857405 69417
1967 69417 29687 11085 8093 7740 6718 6745 6237 5454 5088 4325 3553 2855 2916 2194 1739 1235 1546 1398 1376 1619 1628 1397
1858 1397 1660 1568 1390 1395 1387 1173 919 1051 1190 788 803 888 962 862 982 1010 831 866 961 714 629 873 609 807 706 659 591 796
1720 796 595 705 642 720 930 1122 3487 4513 3953 1225 821 543 557 536 534 531 605 380 574 303 613 283 459 527 356 574
1592 574 414 372 599 237 487 504 336 347 470 267 303 320 312 210 365 713 2416 5839 1392 629 613 373 519 422 402 338
1464 338 305 412 271 386 368 459 270 431 510 424 397 293 271 199 316 341 121 383 185 251 421 273 836 915 203 1494 2124
$$ packed form
2331B39L02j37Q8K17l10K71k58J85Q6j68J51k35K43j53J48k38K52lj9j58L62j02oj63K78k22
2203F50J04L9k2J42j14J09PK5o6J79k18RJ18j86L83O9Rm4K49P0P6j18N9J09nk77J47k89L79
2060A593K73K84J133j145J903K51M75P73M39L07M40K623L688o753Q515K8525Q20904o823p87988
1967F9417l9730j8602k992l53j022K7n08p83l66p63p72o98O1p22m55n04L11j48k2K43Rk31
1858A397K63r2j78Nqk14k54J32J39m02J5Q5P4j00J20K8j79L5R5k47q5K44k64J98j01m7o8K05
1720G96k01J10o3P8K10J92K365J026n60k728m04k78J4k1klP4k25J94k71L10l30J76O8j71K18
1592E74j60m2K27l62K50J7j68J1J23k03L6J7qj02J55L48J703L423m447p63j6k40J46r7k0o4
1464C38l3J07j41J15j8R1j89J61P9q6k7j04k2p2J17K5k20K62j98O6J70j48N63P9p12J291O30
$$ plain form
1332 2124 550 247 382 265 239 125 420 265 376 224 394 271 378 383 266 111 328 290 214 165 105 392 227 321 358 412
1204 412 34 476 240 233 110 326 102 111 220 194 148 234 436 162 171 381 233 156 413 110 267 216 81 130 190 318 225 362
1066 362 140 121 402 380 308 81 313 379 171 332 85 200 125 84 377 365 318 84 225 427 185 242 257 260 111 131 72 233
928 233 101 235 352 168 476 125 462 214 322 124 123 137 217 19 286 130 309 249 304 368 55 338 287 117 197 134 137 165
790 165 66 108 125 207 350 248 273 114 438 387 196 234 158 151 91 173 172 207 101 291 141 230 339 199 271 267 271 44 139 207 206 33
633 33 200 226 66 30 423 235 238 339 10 286 303 279 117 67 62 67 136 171 1118 3009 3672 2519 3223 1153 275 203 41 178
495 178 232 204 170 274 150 328 85 437 149 345 299 162 219 254 211 153 162 136 16 139 239 203 308 274 133 380 246 423
357 423 36 198 124 142 135 121 135 81 296 145 269 380 31 431 57 229 309 190 104 54 278 185 140 34 309 303 142 422
$$ packed form
1332B124j574l03J35j17k6j14K95j55J11j52J70j23J07Nj17j55K17l8p6m9o0K87j65R4L7N4
1204D12l78M42k36pj23K16k24RJ09k6m6Q6K02k74RK10j48p7K57l03J57n1j35M9O0J28r3J37
1066C62k22j9K81k2p2k27K32O6k08J61k47J15p5m1K93j2m7k34J41K02k42N7J5Lj49K0n9J61
928B33j32J34J17j84L08l51L37k48J08j98jJ4Q0j98K67j56J79o0N5O4l13K83n1j70Q0o3LK8
790A65r9M2J7Q2J43j02K5j59L24n1j91L8p6po0Q2jL5j06J90j50Q9J09j40P2mMk27R5O8jj73
633C3J67K6j60l6L93j88LJ01l29K76J7k4j62n0nNO9L5R47J891O63j153P04k070q78p2j62J37
495A78N4k8l4J04j24J78k43L52k88J96m6j37N7L5m3n8Rk6j20J23J00l6J05l4j41K47j34J77
357D23l87J62p4J8pj4J4n4K15j51J24J11l49M00l74J72Q0j19q6n0K24r3m5j06K75oj61K80
$$ plain form
219 422 223 389 100 234 142 42 56 164 36 214 183 260 324 289 198 216 393 244 235 328 103 214 54 170 83 259 157 301
81 301 226 314 133 357 271 41 475 197 128 127 147 126 57 332 306 221 248 331 291 322 406 99 100 146 164 125 129 250 186 300 192 310
-76 310 341 151 357 412 256 215 205 212 199 43 263 111 282 274 376 322 444 234 189 401 325 307 132 153 329 140 270 335 344
-219 344 134 416 329 370 272 450 288 435 226 225 225 68 270 178 462 283 369 503 311 478 398 239 260 435 160 77 279
-352 279 402 354 258 423 488 388 455 489 389 511 394 588 308 309 354 382 260 406 691 444 459 828 422 782 542 642 662
-485 662 649 349 515 509 472 626
$$ packed form
219D22j99J66k89J34r2j00J4J08j28J78l1P7O4l5r1J8J77j49rR3k25J11j60J16q7J76j02J44
81C01p5Q8j81K24q6k30M34k78o9jK0k1o9K75k6q5K7Q3m0L1Q4l07JM6J8l9MJ21o4J14j08J18
-76C10L1j90K06N5j56m1j0Pj3j56K20j52J71qJ02n4J22k10m5K12p6j8j75K1J76j89J30O5R
-219C44k10K82q7M1r8J78j62J47k09j%j57K02r2K84j79Q6J34j92J67q0j59K1J75k75q3K02
-352B79J23m8r6J65O5j00O7L4j00J22j17J94k80JM5K8j22J46K85k47J5L69m06L60k40J00K0
-485F62j3l00J66ol7J54
-514F26
##PAGE=	F1=-538.852
##FIRST=	4521.1594499999982872,	4521.1594499999982872,	0
##DATA TABLE=	(F2++(Y..Y)), PROFILE
$$ plain form
4521 729 853 1027 861 1068 1040 1052 936 1048 913 908 802 732 615 656 672 482 674 690 715 931 588 852 807 688 717 553 775
4388 775 374 436 302 464 401 513 484 563 531 683 550 699 679 533 478 275 457 379 272 137 422 596 446 429 512 592 590 503
4250 503 415 531 340 252 372 137 62 521 254 342 637 356 342 598 496 488 511 117 477 59 299 358 276 264 239 461 270
4118 270 453 508 514 289 568 299 409 101 352 440 142 254 442 235 325 456 454 473 372 376 367 252 149 230 136 151 130 408 259
3975 259 374 163 492 424 333 434 350 487 88 264 19 75 129 258 235 394 416 289 324 558 348 439 260 260 155 115 160 23
3837 23 250 229 302 204 471 520 227 457 341 262 123 268 129 159 128 242 182 185 267 319 400 370 314 379 272 254 302 251 123 168
3689 168 106 154 341 182 247 583 432 377 277 246 370 264 195 68 13 83 191 138 275 294 330 479 149 514 322 214 216 131
3551 131 115 226 57 158 384 101 356 435 274 395 341 337 226 236 271 152 250 307 205 118 181 263 435 471 248 317 364 329 84
$$ packed form
4521G29J24J74j66K07k8J2j16J12j35nj06p0j17M1J6j90J92J6K5K16l43K64m5j19K9j64K22
4388G75m01O2j34J62o3J12k9P9l2J52j33J49k0j46n5k03J82p8j07j35K85J74j50j7Q3Q0kq7
4250E03q8J16j91q8J20k35p5M59k67Q8K95k81j4K56j02qK3l94L60m18K40N9q2j2k5K22j91
4118B70J83N5Ok25K79k69J10l08K51Q8k98J12J88k07R0J31kJ9j01Mrj15j03Q1r4J5k1K78j49
3975B59J15k11L29o8r1J01q4J37l99J76k45N6N4J29k3J59K2j27L5K34k10R1j79%j05m0M5j37
3837B3K27k1P3r8K67M9k93K30j16p9j39J45j39L0l1J14o0LQ2N2Q1l0n6O5j07j8M8n1j28M5
3689A68o2M8J87j59O5L36j51n5j00l1J24j06o9j27n5P0J08n3J37J9L6J49l30L65j92j08Kq5
3551A31j6J11j69J01K26k83K55P9j61J21n4mj11J0L5j19R8N7j02q7O3Q2J72L6k23O9M7l5k45
$$ plain form
3409 84 293 145 176 160 293 217 238 189 132 394 383 376 321 371 239 210 206 258 172 292 219 94 279 367 380 191 538 156 515 269
3261 269 173 343 288 197 130 161 287 278 229 282 279 405 241 535 183 358 353 66 105 98 159 122 174 352 319 381 208 429 364 357 350 181
3104 181 326 252 29 116 220 208 249 446 240 367 517 172 631 158 286 122 247 78 157 1502 2399 459 577 328
2985 328 429 503 337 503 316 395 80 230 417 79 229 321 386 229 316 522 361 696 289 556 480 378 131 8599 15744
2862 15744 16575 11508 1003 350 244 276 263 503 374 280 335 209 187 401 330 133 175 174 224 438 318 443 526 1044 3332
2739 3332 2840 2773 514 266 258 483 267 217 467 148 421 566 439 509 432 433 261 353 237 182 373 378 135 460 302 501 412
2606 412 590 424 575 574 373 406 463 190 410 298 470 322 522 600 316 560 524 505 418 551 554 435 472 306 379 534 355
2474 355 409 554 614 567 427 671 439 719 547 510 568 478 550 471 715 474 531 489 684 631 655 727 687 603 554 726 409 831 390
$$ packed form
3409H4K09j48L1j6J33p6K1m9n7K62j1pn5N0j32k9mN2q6J20p3j25J85Q8J3j89L47l82L59k46
3261B69r6J70n5r1o7L1J26rm9N3lJ26j64K94l52J75nk87L9pO1l7N2J78l3O2j73K21o5ppj69
3104A81J45p4k23Q7J04j2M1J97k06J27J50l45M59m73J28j64J25j69P9J345Q97j940J18k49
2985C28J01P4j66J66j87P9l15J50J87l38J50R2O5j57Q7K06j61L35m07K67p6j02k47Q468P145
2862A5744Q31n067j0505o53j06L2j3K40j29r4N5j26k2K14p1j97M2jN0K14j20J25Q3N18K288
2739C332m92o7k259k48qK25k16n0K50l19K73J45j27P0p7Jj72R2j16n5J91Nk43L25j58J99q9
2606D12J78j66J51jk01L3N7k73K20j12J72j48K00P8k84K44l6j9q7J33Lj19L7j66P3J55j79
2474C55N4J45O0m7j40K44k32K80j72l7N8r0P2p9K44k41N7m2J95n3K4P2m0q4m9J72l17M22m41
$$ plain form
2331 390 716 593 689 898 621 894 569 873 931 708 887 646 893 769 912 621 977 951 888 778 1140 1033 1024 804 1187
2208 1187 888 1048 1107 1099 1279 1167 1254 1280 1278 1263 1394 1203 1196 1345 1120 1592 1701 1733 1731 2045 2163 2226 2132 2176 2276 2168 1925 1937 1696
2065 1696 2150 2593 3052 4177 3915 5709 6267 7047 8044 8702 9156 9615 12024 16339 11296 24744 74409 1283672 1265672
1971 1265672 107574 64262 20490 13636 11997 10428 10013 9198 8000 7339 6248 5147 4159 3878 2927 2362 1697
1888 1697 2012 1901 1928 2299 2264 2093 2381 2169 2031 2017 1849 1663 1328 1434 1506 1140 1145 1233 1340 1244 1360 1385 1197 1233 1308 1056 874
1755 874 1188 911 1082 954 937 865 1065 849 957 930 948 1088 740 2682 4243 3885 1039 791 800 793 733 808 718 832 567 738
1627 738 526 750 390 629 682 479 738 596 572 828 404 656 669 470 505 606 389 429 423 447 322 456 674 1460 5290 1520
1499 1520 766 726 551 607 534 439 426 388 556 378 517 527 629 413 562 652 562 535 402 392 291 364 428 251 481 297 360 603
$$ packed form
2331C90L26j23R6K09k77K73l25L04N8k23J79k41K47j24J43k91L56k6o3j10L62j07rk20L83
2208A187k99J60N9qJ80j12Q7K6kj5J31j91pJ49k25M72J09L2kL14J18O3r4M4J00j08k43J2k41
2065A696M54M43M59J125k62J794N58P80R97O58M54M59K409M315n043J3448M9665J209263j8000
1971A265672j158098m3312m3772o854j639j569m15q15j198o61j091j101r88k81r51n65o65
1888A697L15j11K7L71l5j71K88k12j38j4j68j86l35J06P2l66NQ8J07r6J16K5j88L6P5k52j82
1755H74L14k77J71j28j7p2K00k16J08k7J8J40l48J942J561l58k846k48Rpo0P5r0J14k65J71
1627G38k12K24l60K39N3k03K59j42k4K56m24K52J3j99L5J01k17M0oK4j25J34K18P86L830l770
1499A520p54m0j75N6p3r5j3l8J68j78J39J0J02k16J49R0r0k7j33j0j01P3O4j77K30j84O3K43
$$ plain form
1361 603 392 913 767 316 1366 1977 389 305 475 320 289 212 480 394 518 325 522 379 560 484 383 146 391 365 267
1238 267 225 183 460 380 390 494 520 130 606 379 322 203 401 163 142 264 254 201 353 527 294 274 537 336 288 502 186
1105 186 300 254 84 173 255 369 297 478 250 226 473 499 473 169 400 440 132 376 83 262 204 106 460 469 419 192 357 508
967 508 326 310 325 273 163 186 116 306 64 302 449 196 594 248 547 353 382 192 175 138 225 45 335 65 338 355 404
834 404 497 147 464 388 189 252 200 142 137 66 104 162 225 368 357 351 247 539 474 285 212 195 216 93 155 218 222 157 360 283 351 404
677 404 266 386 345 384 146 152 200 211 89 239 249 133 93 544 336 322 425 169 341 362 286 143 109 48 132 212 161 1195 2457
534 2457 3114 1987 2783 878 323 300 138 192 230 191 202 308 127 431 154 576 273 433 404 251 337 310 144 202 173 177 25
401 25 202 307 302 380 416 228 480 349 468 77 241 148 149 112 149 188 173 372 280 338 499 168 531 108 303 387 236 143 38
$$ packed form
1361F03k11N21j46m51J050O11j588q4J70j55l1p7K68q6J24j93J97j43J81p6j01k37K45k6r8
1238B67m2m2K77q0J0J04K6l90M76k27n7j19J98k38k1J22j0n3J52J74k33k0K63k01m8K14l16
1105A86J14m6j70Q9Q2J14p2J81k28k4K47K6k6l04K31M0l08K44k93J79n8r8L54Rn0k27J65J51
967E08j82j6J5n2j10K3p0J90k42K38J47k53L98l46K99j94K9j90j7l7Q7j80K90k70K73J7M9
834D04R3l50L17p6j99O3n2n8np1L8N8O3J43j1oj04K92o5j89p3j7K1j23O2O3Mo5K03p7O8N3
677D04j38J20m1L9k38OM8J1j22J50J0j16m0M51k08j4J03k56J72K1p6j43l4o1Q4Q0n1J034J262
534B457O57j127P96j905n55k3j62N4L8l9J1J06j81L04k77M22l03J60k9j53Q6k7j66N8k9Mj52
401B5J77J05nP8L6j88K52j31J19l91J64r3Jl7L7L9j5J99r2N8J61l31L63m23J95Q4j51r3j05
$$ plain form
259 38 294 190 191 142 413 418 259 531 315 537 192 269 222 39 70 210 39 267 295 267 394 428 300 344 567 278 284 402 30
116 30 212 19 160 205 370 257 422 328 461 267 447 394 140 550 197 161 176 193 172 131 456 390 365 356 505 363 399 548
-22 548 144 222 177 196 134 205 323 306 421 346 452 477 336 458 535 359 237 255 282 263 18 364 247 418 388 531 463 557 418
-165 418 308 521 459 378 228 234 397 189 431 404 570 270 577 492 584 405 642 375 512 276 333 299 213 387 355 599 473
-298 473 575 674 527 684 570 412 404 564 309 232 390 559 535 426 623 721 673 652 760 624 736 597 756 521 501 551 599
-431 599 463 669 975 729 762 1182 772 1103 867 938 987 925 679 777 800 750 890
$$ packed form
259C8K56j04Jm9K71Nj59K72k16K22l45P7m7j83L1J40j71K28K8k8J27L4j28M4K23k89OJ18l72
116C0J82j93J41M5J65j13J65r4J33j94J80n3k54M10l53l6J5J7k1m1L25o6k5rJ49j42L6J49
-22E48m04P8m5J9o2P1J18j7J15p5J06K5j41J22P7j76j22J8K7j9k45L46j17J71l0J43o8R4j39
-165D18j10K13o2q1j50OJ63k08K42k7J66l00L07q5R2j79K37k67J37k36N7l4q6J74l2K44j26
-298D73J02R9j47J57j14j58qJ60k55p7J58J69k4j09J97R8m8k1J08j36J12j39J59k35k0N0M8
-431E99j36K06L06k46L3M20m10L31k36P1M9o2k46R8K3n0J40
-514H90
##PAGE=	F1=-548.696
##FIRST=	4521.1594499999982872,	4521.1594499999982872,	0
##DATA TABLE=	(F2++(Y..Y)), PROFILE
$$ plain form
4521 1042 1174 1323 1220 1414 1386 1374 1269 1365 1219 1165 1089 983 887 829 906 704 910 930 940 1235 825 1127 1067 872 913 768 924
4388 924 566 559 463 603 557 674 665 784 713 887 752 877 860 682 610 388 591 505 396 205 528 755 568 644 686 730 756 660
4250 660 560 679 435 377 468 193 153 649 378 445 777 508 519 721 594 684 637 193 589 122 370 402 327 372 360 602 391
4118 391 605 679 619 425 646 405 515 141 424 457 59 351 502 361 431 586 549 632 483 510 430 347 238 255 191 158 188 457
3980 457 398 436 268 669 541 443 554 491 527 141 278 58 99 178 360 285 518 527 379 409 713 461 474 385 331 115 185 181 73
3837 73 291 299 412 293 579 596 349 583 397 347 207 291 186 159 121 262 332 266 356 420 492 496 399 484 368 309 354 303 106 213
3689 213 117 219 417 296 328 670 522 438 387 349 439 351 228 99 46 60 253 215 342 376 455 576 287 563 439 275 235 184
3551 184 127 235 26 215 392 185 415 551 352 533 411 426 318 295 349 181 212 249 235 153 227 370 524 554 346 403 482
$$ packed form
4521A042J32J49j03J94k8j2j05R6j46n4p6j06r6n8P7k02K06K0J0K95m10L02o0j95M1j45J56
4388I24l58pr6J40m6J17rJ19p1J74j35J25j7j78p2k22K03q6j09j91L23K27j87P6M2M4K6r6
4250F60j00J19k44n8R1k75m0M96k71O7L32k69J1K02j27R0m7m44L96m67K48L2p5M5j2K42k11
4118C91K14P4o0j94K21k41J10l74K83L3l98K92J51j41P0J55l7Q3j49K7q0q3j09J7o4l3L0K69
3980D57n9L8j68M01j28r8J11o3L6l86J37k20M1P9J82p5K33Rj48L0L04k52J3q9n4k16P0mj08
3837G3K18QJ13j19K86J7k47K34j86n0j40Q4j05k7l8J41P0o6R0O4P2Mr7Q5j16n9M5n1j97J07
3689B13r6J02J98j21L2L42j48q4n1l8R0q8j23j29n3J4J93l8J27L4P9J21k89K76j24j64m0n1
3551A84n7J08k09J89J77k07K30J36j99J81j22J5j08k3N4j68L1L7j4q2P4J43J54L0k08N7P9
$$ plain form
3419 482 396 116 349 182 150 155 309 183 312 273 208 512 466 478 434 443 325 302 246 275 122 264 264 143 360 416 494 286 589
3276 589 301 609 349 210 380 303 244 107 173 315 320 325 374 365 500 352 642 253 423 405 67 135 50 141 193 234 422 398 494
3133 494 308 524 473 407 433 189 382 293 45 148 254 291 310 505 316 460 669 245 728 271 354 162 324 64 166 1148
3005 1148 1590 408 615 442 484 589 427 595 388 495 125 253 445 150 246 365 472 272 447 591 520 803 361 737
2887 737 551 425 168 10708 19619 20621 14411 1400 316 289 364 350 558 456 388 390 282 242 436 348 158 242 231 291
2769 291 527 397 535 655 1377 3919 3585 3601 576 358 302 519 354 257 539 273 536 687 550 606 534 544 366 426 324
2646 324 240 407 469 227 510 413 591 531 700 562 685 685 493 503 539 247 508 366 572 393 615 698 456 701 662 662 521
2513 521 673 657 548 582 371 448 647 488 539 660 752 704 548 827 588 879 685 577 675 588 656 605 864 607 654 661 826 791
$$ packed form
3419D82q6k80K33j67l2NJ54j26J29l9o5L04m6J2m4Rj18k3n6K9j53J42%j21K17N6P8k08L03
3276E89k88L08k60j39J70p7n9j37O6J42NNM9rJ35j48K90l89J70j8l38O8q5R1N2M1J88k4R6
3133D94j86K16n1o6K6k44J93q9k48J03J06L7J9J95j89J44K09m24M83m57Q3j92J62k60J02R82
3005A148M42j182K07j73M2J05j62J68k07J07l70J28J92k95R6J19J07k00J75J44p1K83m42L76
2887G37j86j26k57J0540Q911J002o210j3011j084k7P5j4K08j02o8Kj08m0J94q8j90Q4j1O0
2769B91K36j30J38J20P22K542l34J6l025k18n6K17j65r7K82k66K63J51j37N6p2J0j78O0j02
2646C24q4J67O2k42K83r7J78o0J69j38J23%j92J0L6k92K61j42K06j79K22Q3k42K45l9%j41
2513E21J52j6j09L4k11P7J99j59N1J21R2m8j56K79k39K91j94j08R8q7O8n1K59k57M7PJ65l5
$$ plain form
2375 791 839 938 822 759 734 813 578 993 544 854 765 863 1056 823 1078 719 1122 1132 870 1084 831 1073 987 1126 789 1235
2247 1235 1189 1085 1013 1374 1266 1257 1007 1457 1099 1304 1380 1391 1593 1489 1555 1613 1565 1602 1675 1519 1494 1672 1427 1970 2111 2182 2222 2569
2109 2569 2757 2785 2714 2740 2802 2615 2399 2270 2102 2637 3248 3875 4934 5651 7207 8069 9110 10271 11126 11692 12188 14175 18744
1996 18744 16190 34458 105110 1672118 1642570 150232 106190 31047 19604 16346 14079 13115 11953 10351
1927 10351 9364 7956 6539 5334 4610 3503 2868 2071 2381 2336 2409 2907 2840 2728 3016 2712 2604 2563 2244 2081 1693 1745 1768
1814 1768 1444 1446 1528 1665 1589 1679 1718 1519 1554 1590 1370 1083 1451 1181 1310 1168 1189 1104 1296 1074 1160 1175 1139 1292 980 1910 3923
1681 3923 3778 1064 758 1035 1001 915 1045 875 1022 758 866 722 861 506 772 826 594 879 768 748 1031 561 798 805 583
1558 583 638 725 490 558 508 565 427 536 662 481 4831 1602 883 828 702 668 630 492 507 478 669 485 630 663 788 553
$$ packed form
2375G91M8R9j16o3k5P9k35M15m49L10q9R8J93k33K55l59M03J0k62K14k53K42q6J39l37M46
2247A235m6j04p2L61j08rk50M50l58K05P6J1K02j04O6N8m8L7P3j56k5J78k45N43J41P1M0L47
2109B569J88K8p1K6O2j87k16j29j68N35O11O27J059P17J556Q62J041J161Q55N66M96J987M569
1996A8744k554J8268P0652J567008k9548j492338m4042p5143j1443l258k267r64j162j602
1927A0351r87j408j417j205p24j107o35p97L10m5P3M98o7j12K88l04j08m1l19j63l88N2K3
1814A768l24KQ2J37p6R0L9j99L5L6k20k87L68k70J29j42K1q5J92k22Q6J5l6J53l12R30K013
1681C923j45k714l06K77l4q6J30j70J47k64J08j44J39l55K66N4k32K85j11k0K83m70K37Pk22
1558E83N5Q7k35O8n0N7j38J09J26j81M350l229p19n5j26l4l8j38J5k9J91j84J45L3J25k35
$$ plain form
1430 553 668 764 694 663 493 497 382 403 497 368 559 417 455 770 506 960 610 418 1176 1744 202 361 538 367 343 303
1302 303 518 520 646 423 648 468 723 563 483 208 435 425 300 282 261 503 534 441 613 616 279 710 503 404 288 457 225
1169 225 172 290 306 252 469 589 438 380 672 427 422 558 281 314 294 93 223 316 424 357 579 359 357 528 593 625 265 471
1031 471 475 86 402 79 319 277 172 532 565 505 317 464 570 471 367 368 261 218 236 153 360 80 364 533 271 688 370
898 370 625 468 440 249 210 173 221 94 368 97 349 458 487 614 252 575 480 252 300 263 139 127 76 93 216 258 426 460
761 460 418 388 613 551 355 229 219 282 92 127 247 228 235 413 434 453 484 341 498 409 464 253 165 178 202 136 278 284 220 179 637
608 637 439 401 504 322 389 406 274 174 136 85 205 290 222 1292 1849 2464 1394 2306 827 383 388 258 229 222 176 256 326 148
470 148 517 231 690 389 520 491 338 446 349 88 243 176 219 66 267 374 393 454 546 337 560 455 489 179 303 185
$$ packed form
1430E53J15R6p0l1j70Mj15K1R4j29J91j42L8L15k64M54l50j92P58N68j542J59J77j71k4m0
1302C03K15KJ26k23K25j80K55j60q0k75K27j0j25j8k1K42L1r3J72Ll37M31k07r9j16J69k32
1169B25n3J18J6n4K17J20j51n8K92k45nJ36k77L3k0k01J30R3J08o7K22k20kJ71O5L2l60K06
1031D71Ml89L16l23K40m2j05L60L3o0j88J47J06r9j04Jj07m3J8q3K07k80K84J69k62M17l18
898C70K55j57k8j91l9l7M8j27K74k71K52J09K9J27l62L23r5k28M8l7j24j2n1J7J23M2J68L4
761D60m2l0K25o2j96j26j0O3j90L5J20j9PJ78K1J9L1j43J57q9N5k11q8J3K4o6J42Oo4m1M58
608F37j98l8J03j82O7J7j32j00l8n1J20Q5o8J070N57O15j070R12j479m44Nj30k9pm6Q0P0j78
470A48L69k86M59l01J31k9j53J08r7k61J55o7M3j53K01J07J9O1R2k09K23j05L4l10J24j18
$$ plain form
342 185 143 100 171 240 270 431 422 402 601 322 616 218 371 442 263 175 33 302 208 248 267 509 511 397 623 402 657 294 296
199 296 285 41 94 257 86 326 421 318 480 549 393 458 721 307 336 473 72 209 85 158 330 471 361 531 433 591
71 591 411 511 518 227 598 232 193 222 254 237 198 572 471 511 467 668 444 469 667 218 346 205 227 150 287 397 431 536
-66 536 500 585 616 509 554 652 452 275 327 347 323 65 454 393 540 511 667 620 663 589 433 635 569 449 314 328 456 267 598
-209 598 472 785 407 726 653 769 539 809 504 568 369 424 375 361 518 526 731 661 764 833 741 863 722 594 556 664 463
-342 463 386 504 719 715 611 811 933 949 839 1021 838 951 790 917 728 694 740 825 660 935 1226 1033 1043 1511 1113 1394
-470 1394 1177 1220 1299 1178 1001 1032 1085 1023 1149
-514 1149
$$ packed form
342A85m2m3P1O9L0J61rk0J99k79K94l98J53P1j79q8j42K69r4M0J9K42Kj14K26k21K55l63K
199B96j1k44N3J63j71K40R5j03J62O9j56O5K63m14K9J37m01J37j24P3J72J41j10J70r8J58
71E91j80J00Pk91L71l66l9K9L2j7l9L74j01M0m4K01k24K5J98m49J28j41K2p7J37J10L4J05
-66E36l6Q5L1j07M5R8k00j77N2K0k4k58L89o1J47k9J56m7M3p4j56K02o6j20j35J4J28j89L31
-209E98j26L13l78L19p3J16k30K70l05O4j99N5m9j4J57QK05p0J03O9r2J22j41j28l8J08k01
-342D63p7J18K15mj04K00J22J6j10J82j83J13j61J27j89l4M6Q5j65K75K91j93J0M68l98K81
-470A394k17M3P9j21j77L1N3o2J26
-514A149
##PAGE=	F1=-558.541
##FIRST=	4521.1594499999982872,	4521.1594499999982872,	0
##DATA TABLE=	(F2++(Y..Y)), PROFILE
$$ plain form
4521 1303 1431 1559 1517 1691 1655 1617 1540 1607 1451 1357 1316 1179 1116 968 1088 903 1102 1116 1133 1469 1017 1341 1265 1003 1073 936 1014
4388 1014 743 656 595 718 692 810 818 961 866 1034 913 1004 1002 790 708 496 684 596 513 299 602 874 672 822 821 829 883 787 663
4246 663 799 498 469 554 234 271 735 482 535 878 634 662 816 663 845 717 276 655 188 414 431 376 465 462 714 496 711
4113 711 824 690 530 692 488 588 175 474 454 64 439 542 482 523 680 627 764 556 609 463 434 317 259 237 189 236 497
3980 497 526 465 369 806 629 522 645 597 537 202 275 129 126 230 446 333 621 602 455 470 828 545 489 484 376 89 247 185
3842 185 128 317 360 514 365 671 633 449 681 431 411 291 298 231 142 117 277 468 335 415 499 567 587 461 559 437 353 382 336
3699 336 96 253 130 284 470 391 398 709 596 472 483 426 483 414 228 143 71 43 308 292 381 453 554 643 407 589 505 326
3561 326 254 220 134 225 29 277 386 289 446 642 410 637 459 485 399 335 395 197 167 174 258 194 274 455 593 595 438 453 574
$$ packed form
4521A303J28J28m2J74l6l8p7O7j56r4m1j37o3j48J20j85J99J4J7L36m52L24p6k62P0j37P8
4388A014k71q7o1J23k6J18QJ43r5J68j21R1kk12q2k12J88q8q3k14L03K72k02J50jQN4r6j24
4246F63J36l01k9Q5l20L7M64k53N3L43k44K8J54j53J82j28m41L79m67K26J7n5Q9lK52k18K15
4113G11J13j34j60J62k04J00m13K99k0l90L75J03o0M1J57n3J37k08N3j46k9j17n8k2m8M7K61
3980D97K9o1r6M37j77j07J23m8o0l35P3j46lJ04K16j13K88j9j47J5L58k83n6nj08k87J58o2
3842A85n7J89M3J54j49L06l8j84K32k50k0j20Po7q9k5J60J91j33Q0Q4O8K0j26R8j22q4K9m6
3699C36k40J57j23J54J86p9PL11j13j24J1n7N7o9j86q5p2k8K65j6Q9P2J01Q9k36J82q4j79
3561C26p2l4q6R1j96K48J09r7J57J96k32K27j78K6q6o4O0j98l0PQ4o4Q0J81J38Kj57J5J21
$$ plain form
3419 574 449 135 382 221 104 146 318 153 368 347 270 603 525 553 512 489 388 367 271 285 75 223 307 201 423 440 596
3286 596 364 622 415 668 413 235 386 294 259 88 215 331 356 403 444 438 561 437 712 316 463 428 77 160 37 130 261
3153 261 294 474 459 571 398 582 560 435 492 188 405 308 68 177 277 360 360 547 375 537 774 300 793 365 385 197
3025 197 368 52 205 987 779 332 623 538 529 628 494 645 441 562 155 265 425 215 268 375 540 315 558 617 645 876
2897 876 421 868 584 434 170 12264 22463 23533 16587 1742 274 321 425 420 577 507 468 413 353 277 436 347 155
2784 155 294 287 339 598 448 598 752 1713 4357 4189 4225 608 412 339 519 413 289 575 384 617 769 634 662 602 614
2661 614 451 480 374 299 408 536 302 544 507 651 608 785 658 752 750 571 565 578 292 572 407 637 451 673 757 561 805
2528 805 754 780 592 739 716 635 660 397 489 721 588 648 730 840 802 632 931 696 978 784 598 760 668 715 703 958 712
$$ packed form
3419E74j25l14K47j61j17M2J72j65K15k1p7L33p8K8m1k3j01k1r6J4k10J48Q4j06K22J7J56
3286E96k32K58k07K53k55j78J51r2l5j71J27J16K5M7M1oJ23j24K75l96J47l5l51Q3j23R3J31
3153B61L3J80j5J12j73J84k2j25N7l04K17r7k40J09J00Q3%J87j72J62K37m74M93m28K0j88
3025A97J71l16J53P82k08m47K91q5rR9j34J51k04J21m07J10J60k10N3J07J65k25K43N9K8K31
2897H76m55M47k84j50k64J2094J0199J070o946j4845j468M7J04nJ57p0l9n5o0p6J59q9j92
2784A55J39pN2K59j50J50J54R61K644j68L6l617j96p3J80j06j24K86j91K33J52j35K8o0J2
2661F14j63K9j06p5J09J28k34K42l7J44m3J77j27R4kj79oJ3k86K80j65K30j86K22Q4j96K44
2528H05n1K6j88J47k3q1K5k63R2K32j33O0Q2J10l8j70K99k35K82j94j86J62r2M7j2K55k46
$$ plain form
2395 712 729 804 910 899 974 1073 903 870 860 849 700 1083 674 931 889 986 1151 969 1188 833 1303 1250 971 1222 951 1182 1135
2262 1135 1275 905 1409 1348 1220 1168 1522 1418 1408 1156 1634 1244 1473 1567 1594 1793 1708 1757 1851 1748 1830 1842 1729 1685 1887 1640 2223
2129 2223 2390 2506 2575 2925 3192 3160 3112 3121 3121 2891 2686 2440 2356 2971 3719 4483 5488 6957 8288 9387 10599 11830 12817 13431
2011 13431 13946 15397 19837 20152 42410 130553 1963346 1923245 193775 149707 41196 25097 20109 17079
1942 17079 15526 14036 12096 10810 9142 7478 6164 4979 3811 3159 2285 2587 2627 2743 3340 3254 3194 3451 3099 3008 2939
1839 2939 2493 2348 1946 1925 1926 1645 1649 1725 1880 1839 1881 1953 1735 1771 1758 1600 1218 1614 1370 1450 1307 1368 1264 1444 1233 1281 1335 1261
1701 1261 1461 1402 1324 3522 3603 1249 770 1204 1136 1046 1206 971 1145 907 933 856 924 601 858 929 673 963 895 866 1173 684
1573 684 887 882 651 721 803 550 658 562 652 508 589 686 523 4660 1604 951 899 797 693 681 547 561 558 735 572 705 755
$$ packed form
2395G12J7P5J06j1P5R9j70l3j0j1j49L83m09K57m2R7J65j82K19l55M70n3k79K51k71K31m7
2262A135J40l70N04o1j28n2L54j04j0k52M78l90K29R4K7J99q5M9R4j03Q2J2j13m4K02k47N83
2129B223J67J16O9L50K67l2m8R%k30k05k46q4O15P48P64J005J469J331J099J212J231R87O14
2011A3431N15J451M440L15K2258Q8143J832793m0101j729470m4068j08511j6099m988l030
1942A7079j553j490j940j286j668j664j314j185j168o52q74L02M0J16N97q6o0K57l52r1o9
1839B939m46j45m02k1Jk81MP6J55m1M2P2k18L6j3j58l82L96k44Q0j43O1j04J80k11M8N4p4
1701A261K00n9p8K198Q1k354m79M34o8r0J60k35J74k38K6p7O8l23K57P1k56K90o8k9L07m89
1573F84K03nk31P0Q2k53J08r6R0j44Q1R7j63M137l056o53n2j02j04j2j34J4lJ77j63J33N0
$$ plain form
1440 755 905 667 726 829 788 755 551 564 453 423 527 456 600 526 520 893 590 970 526 487 969 1475 41 400 561 394
1312 394 391 384 518 623 733 498 751 518 842 604 547 260 446 457 310 326 327 511 663 466 700 676 423 771 589 463 343
1179 343 479 272 194 298 336 287 561 613 569 462 761 495 532 572 360 304 315 104 263 358 473 395 649 445 470 551 647 739
1041 739 343 512 473 47 406 78 358 332 253 581 632 554 438 530 600 587 407 374 228 264 277 172 390 139 411 588 349
908 349 742 467 681 540 480 279 223 219 209 143 378 179 335 542 538 701 344 650 548 293 332 309 121 136 101 79 271 291
770 291 500 546 456 507 649 598 393 273 222 334 90 86 250 227 313 441 568 519 553 403 588 447 493 348 178 142 177 164 308
628 308 318 303 266 685 523 462 561 445 421 421 247 187 145 132 267 352 304 1364 1407 1845 817 1890 983 438 455 354 261 209
490 209 156 314 329 203 577 303 758 478 588 538 400 528 363 93 272 169 262 112 322 427 457 518 639 429 604 543
$$ packed form
1440G55J50k38N9J03m1l3k04J3j11l0J04p1J44p4oL73l03L80m44l9M82N06j434L59J61j67
1312C94lpJ34J05J10k35K53k33L24k38n7k87J86J1j47J6JJ84J52j97K34k4k53L48j82j26j20
1179C43J36k07p8J04L8m9K74N2m4j07K99k66L7M0k12n6J1k11J59R5J15p8K54k04K5Q1R6R2
1041G39l96J69l9m26L59l28K80k6p9L28N1p8j16R2P0j3j80l3j46L6J3j05K18k51K72J77k39
908C49L93k75K14j41o0k01n6mj0o6K35j99J56K07mJ63l57L06j02k55L9k3j88J5l5k2J92K0
770B91K09M6r0N1J42n1k05j20n1J12k44mJ64k3Q6J28J27m9L4j50J85j41M6j45j70l6L5j3J44
628C08J0j5l7M19j62o1R9j16k4%j74o0m2j3J35Q5m8J060M3M38j028J073r07n45J7j01r3n2
490B09n3J58J5j26L74k74M55k80J10n0j38J28j65k70J79j03R3j50K10J05L0O1J21k10J75o1
$$ plain form
362 543 473 275 352 220 136 124 186 284 350 464 550 447 663 461 672 306 418 462 272 200 38 305 232 301 380 582 569 516 677
219 677 464 727 385 312 319 78 127 294 139 381 533 372 562 629 463 536 832 327 373 526 146 202 148 167 439 545 451
86 451 609 522 681 538 539 622 284 612 288 215 259 324 297 247 662 531 634 555 789 508 518 739 297 442 223 256 168 362
-52 362 457 531 631 625 682 725 646 621 742 513 317 396 398 368 135 517 527 631 619 753 759 741 716 536 722 631 506 377 421 495 344
-204 344 743 529 951 520 837 786 896 645 923 627 593 476 484 443 488 637 662 835 810 905 952 920 983 830 752 690 717 596
-342 596 512 605 854 867 766 962 1085 1174 987 1227 993 1119 940 1040 892 854 890 1025 817 1161 1401 1307 1258 1762 1390 1604
-470 1604 1418 1442 1548 1366 1263 1241 1307 1252 1357
-514 1357
$$ packed form
362E43p0j98P7j32q4j2O2R8O6J14Q6j03K16k02K11l66J12M4j90p2j62K67p3O9P9K02j3n3J61
219F77k13K63l42p3Pk41M9J67j55K42J52j61J90O7j66P3K96n05M6J53l80N6n4J9K72J06r4
86D51J58q7J59j43JQ3l38L28l24p3M4O5k7n0M15j31J03p9K34k81J0K21m42J45k19L3q8J94
-52C62R5P4J00oN7M3p9k5J21k29j96P9Kl0k33L82J0J04j2J34Oj8k5j80J86r1j25j29M4P4j51
-204C44L99k14M22m31L17n1J10k51K78k96l4j17Qm1M5J49K5J73k5R5M7l2O3j53p8o2K7j21
-342E96q4R3K49J3j01J96J23Q9j87K40k34J26j79J00j48l8L6J35k08L44K40r4m9N04l72K14
-470A604j86K4J06j82j03k2O6n5J05
-514A357
##PAGE=	F1=-568.385
##FIRST=	4521.1594499999982872,	4521.1594499999982872,	0
##DATA TABLE=	(F2++(Y..Y)), PROFILE
$$ plain form
4521 1470 1579 1690 1700 1848 1798 1740 1698 1733 1566 1452 1443 1288 1259 1046 1190 1044 1214 1216 1260 1593 1130 1456 1368 1058 1162 1025 1026 881
4383 881 704 677 786 779 895 916 1066 964 1093 1005 1054 1077 834 757 577 721 634 601 389 633 936 737 936 891 870 946 859 703
4246 703 871 518 511 617 244 392 766 546 594 918 709 748 858 689 941 736 346 660 242 425 444 412 525 530 778 559
4118 559 753 916 714 587 697 532 616 195 493 435 131 499 558 569 581 720 667 848 574 657 458 497 372 238 265 235 265
3985 265 513 624 453 448 877 670 557 692 646 515 252 249 185 151 276 502 370 685 631 497 496 878 587 475 540 383 90
3852 90 289 175 176 324 396 587 406 726 621 509 732 439 444 350 290 251 110 115 282 572 384 430 551 608 628 488 589 467
3714 467 376 380 345 101 281 146 338 493 448 446 693 639 470 544 463 496 439 189 192 85 34 344 358 385 513 608 665 488 587 508
3566 508 352 273 233 136 199 58 333 364 375 444 691 439 684 475 506 454 345 399 196 125 101 269 232 307 504 630 587 505 457
$$ packed form
4521A470J09J11J0J48n0n8m2L5j67j14rj55k9k13J44j46J70KM4L33m63L26q8l10J04j37Jj45
4383H81j77k7J09pJ16K1J50j02J29q8M9K3k43p7j80J44q7l3k12K44L03j99J99m5k1P6q7j56
4246G03J68l53pJ06l73J48L74k20M8L24k09L9J10j69K52k05l90L14m18J83J9l2J13NK48k19
4118E59J94J63k02j27J10j65Q4m21K98n8l04L68N9J1J2J39n3J81k74Q3j99L9j25j34K7l0L0
3985B65K48J11j71nM29k07j13J35m6j31k63lo4l4J25K26j32L15n4j34jL82k91j12O5j57k93
3852I0J99j14JJ48P2J91j81L20j05j12K23k93Nr4o0l9j41NJ67K90j88M6J21N7K0j40J01j22
3714D67r1Ml5k44J80j35J92J55m5kK47n4j69P4q1L3n7k50Lj07n1L10J4K7J28R5N7j77R9p9
3566E08j56p9m0r7O3j41K75L1J1O9K47k52K45k09L1n2j09N4k03p1k4J68l7P5J97J26m3q2m8
$$ plain form
3424 457 624 478 137 380 248 47 130 315 136 400 395 306 653 547 592 540 496 419 391 281 287 27 171 341 242 457 433 663
3286 663 405 628 480 683 450 238 358 267 240 74 258 332 382 446 482 485 577 481 734 347 468 418 78 171 87 131 308 336
3148 336 501 490 595 460 595 608 428 516 177 393 294 92 205 285 402 382 560 400 586 811 325 813 427 375 220 371
3020 371 52 248 1055 514 250 601 597 555 610 530 642 462 590 164 265 359 255 288 351 571 349 627 592 714 904 455
2892 455 931 572 395 149 13014 23820 24857 17693 1977 241 335 449 462 555 521 499 398 410 285 400 330 122 324
2779 324 331 353 644 456 618 796 1966 4560 4534 4531 598 416 362 486 433 305 571 459 647 798 672 665 620 632 497 506 374
2646 374 346 375 565 341 550 568 672 625 829 693 762 755 596 578 571 312 592 410 655 482 686 763 612 854 777 838 617 738
2508 738 717 676 691 377 494 740 637 716 749 859 843 660 963 744 1000 823 564 800 699 713 749 983 766 740 896 914 939
$$ packed form
3424D57J67j46l41K43j32k01Q3J85j79K64nq9L47j06M5n2m4p7k8j10Ok60J44J70r9K15k4K30
3286F63k58K23j48K03k33k12J20r1k7j66J84P4N0O4L6LR2r6K53l87J21n0l40R3q4M4J77K8
3148C36J65j1J05j35J35J3j80Q8l39K16r9k02J13Q0J17k0J78j60J86K25m86M88l86n2j55J51
3020C71l19J96Q07n41k64L51mm2N5q0J12j80J28m26J01R4j04L3O3K20k22K78l5J22J90m49
2892D55M76l59j77k46J2865J0806J037p164j5716j736R4J14J3R3l4k2j01J2j25J15p0k08K02
2779C24PK2K91j88J62J78J170K594k6ll933j82n4J24n3j28K66j12J88J51j26pm5J2j35Rj32
2646C74k8K9J90k24K09J8J04m7K04j36O9pj59j8pk59K80j82K45j73K04P7j51K42p7O1k21J21
2508G38k1m1J5l14J17K46j03P9L3J10j6j83L03k19K56j77k59K36j01J4L6K34k17k6J56J8K5
$$ plain form
2375 939 1032 1108 915 914 912 822 750 1086 751 934 942 1038 1164 1031 1204 883 1382 1260 992 1274 985 1200 1186 1330 948 1466 1398 1269
2237 1269 1216 1552 1460 1446 1219 1687 1294 1520 1634 1669 1841 1783 1820 1949 1790 1903 1860 1792 1730 1951 1718 2300 2488 2645 2721 3046
2109 3046 3387 3276 3255 3246 3167 2942 2724 2413 2408 3094 3922 4767 5753 7573 8756 9977 11238 12428 13455 14036 14532 15434 19418
1996 19418 22524 47302 146520 2104423 2056085 233595 187896 49285 29220 22655 18905 16816 15071 12910
1927 12910 11411 9582 7781 6470 4924 3786 3177 2299 2593 2719 2875 3523 3428 3405 3606 3256 3166 3077 2543 2414 2039 1940
1819 1940 1946 1706 1713 1792 1943 1945 1929 2045 1807 1842 1779 1702 1255 1644 1443 1476 1339 1442 1316 1477 1297 1301 1381 1296 1544 1697 1058 3045
1681 3045 3348 1447 815 1271 1169 1100 1264 984 1182 983 923 909 926 657 873 969 698 971 952 908 1224 750 907 883 662
1558 662 737 826 563 706 575 696 555 608 734 1366 4734 1509 953 919 820 679 668 585 572 608 741 620 726 790 955 733
$$ packed form
2375I39R3P6j93jkr0p2L36l35J83QR6J26j33J73l21M99j22k68K82k89K15j4J44l82N18o8j29
2237A269n3L36r2j4k27M68l93K26J14L5J72n8L7J29j59J13m3o8o2K21k33N82J88J57P6L25
2109C046L41j11k1rp9k25k18l11nO86Q28Q45R86J820J183J221J261J190J027N81M96R02L984
1996A9418L106K4778R9218J957903m8338j822490m5699j38611k0065o565l750k089j745k161
1927A2910j499j829j801j311j546j138o09q78K94J26J56O48r5k3K01l50r0q9n34j29l75r9
1819A940Ok40PP9J51Kj6J16k38L5o3p7m47L89k01L3j37J03j26J61j80MQ0q5K48J53o39J987
1681C045L03j901o32M56j02o9J64k80J98j99o0j4J7k69K16R6k71K73j9m4L16m74J57k4k21
1558F62P5Q9k63J43j31J21j41N3J26O32L368l225n56l4r9j41j1q3j3L6J33j21J06O4J65k22
$$ plain form
1430 733 723 836 822 791 567 580 492 418 507 502 592 606 541 949 624 938 534 508 791 1201 132 409 541 393 424 444 472 686
1292 686 760 538 811 516 895 600 561 286 417 456 295 347 375 475 746 458 742 683 534 782 620 486 357 463 292
1169 292 204 294 341 296 617 595 663 499 789 527 596 539 406 267 308 109 284 371 505 403 676 490 543 532 647 794 393
1036 393 516 431 41 385 81 373 361 330 598 653 555 534 546 590 648 423 341 181 293 300 170 395 192 433 600 403 745
903 745 523 703 557 493 276 213 255 200 187 363 248 295 594 547 747 404 677 581 305 336 331 94 153 135 65 311 312 554 603
761 603 456 585 641 601 389 318 204 362 87 35 224 225 376 438 664 540 588 438 639 454 466 415 183 97 138 169 321 340
623 340 364 338 677 569 496 581 521 432 400 209 174 138 176 305 389 376 1387 1376 1350 330 1657 1143 472 491 411 269 193 127 362
480 362 317 251 603 356 765 526 625 536 428 570 351 139 288 150 301 150 360 452 485 559 679 482 604 598 413 354 370
$$ packed form
1430G33j0J13j4l1k24J3q8p4Q9nR0J4o5M08l25L14m04k6K83M10j069K77J32j48L1K0K8K14
1292F86P4k22K73k95L79k95l9k75J31L9j61N2K8J00K71k88K84n9j49K48j62j34j29J06j71
1169B92q8R0M7m5L21k2O8j64K90k62O9n7j33j39M1j99J75Q7J34j02K73j86N3j1J15J47m01
1036C93J23q5l90L44l04K92j2l1K68N5r8k1J2M4N8k25q2j60J12Pj30K25k03K41J67j97L42
903G45k22J80j46o4k17o3M2n5j3J76j15M7K99m7K00l43K73r6k76L1nk37N9j8p0K46JK42M9
761F03j47J29N6m0k12p1j14J58k75n2J89JJ51O2K26j24M8j50K01j85J2n1k32q6M1L1J52J9
623C40K4k6L39j08p3Q5o0q9l2j91l5l6L8J29Q4j3J011j1k6j020J327n14o71J9q0j42p6o6K35
480C62m5o6L52k47M09k39R9q9j08J42k19k12J49j38J51j51K10R2L3P4J20j97J22oj85n9J6
$$ plain form
347 370 245 143 171 192 313 398 463 646 461 672 558 689 356 430 444 263 219 43 309 249 341 465 619 580 593 681 490 731
209 731 449 317 318 131 163 314 183 422 611 398 619 656 501 563 883 330 381 552 204 193 197 182 513 577 514 643 578 718
71 718 627 522 689 297 589 343 222 278 392 338 267 710 557 715 598 851 537 533 749 363 495 225 284 179 414 494 581
-61 581 690 700 728 778 729 646 789 527 352 441 422 388 208 538 627 678 690 771 850 772 778 598 767 636 539 408 494 505 401 842
-209 842 564 1037 587 891 869 947 704 967 711 583 565 506 494 569 722 742 890 890 977 1006 1034 1022 874 861 778 714 687 587 677
-352 677 938 962 857 1053 1148 1313 1067 1342 1059 1212 1019 1098 982 952 974 1165 907 1307 1470 1501 1369 1889 1552 1697 1543
-475 1543 1562 1688 1454 1420 1366 1423 1397 1477
-514 1477
$$ packed form
347C70j25j02K8K1J21Q5O5J83j85K11j14J31l33P4J4j81m4j76K66o0R2J24J54l9J3Q8j91K41
209G31k82j32Jj87L2J51j31K39J89k13K21L7j55O2L20n53N1J71l48j1Mj5L31O4o3J29o5J40
71G18r1j05J67l92K92k46j21N6J14n4p1M43j53J58j17K53l14mK16l86J32k70N9j05K35Q0Q7
-61E81J09J0K8N0m9q3J43k62j75Q9j9l4j80L30Q9N1J2Q1P9p8Oj80J69j31r7j31Q6J1j04M41
-209H42k78M73m50L04k2P8k43K63k56j28j8n9j2P5J53K0J48%Q7K9K8j2j48j3q3o4k7j00R0
-352F77K61K4j05J96R5J65k46K75k83J53j93P9j16l0K2J91k58M00J63L1j32N20l37J45j54
-475A543J9J26k34l4n4N7k6Q0
-514A477
##PAGE=	F1=-578.229
##FIRST=	4521.1594499999982872,	4521.1594499999982872,	0
##DATA TABLE=	(F2++(Y..Y)), PROFILE
$$ plain form
4521 1513 1595 1690 1738 1855 1785 1723 1710 1722 1540 1432 1446 1293 1292 1046 1198 1101 1228 1210 1301 1584 1145 1450 1356 1027 1158 1021 952 960 691
4378 691 696 798 800 914 940 1082 988 1049 1015 1017 1067 804 748 620 695 616 643 451 615 931 745 967 883 844 934 861 674 883 492 494
4231 494 649 217 499 735 560 607 889 720 767 836 665 954 692 389 601 277 400 443 425 543 556 786 566 725 939
4108 939 683 585 660 527 596 195 480 401 179 519 551 602 590 701 657 872 530 647 411 529 392 194 271 280 274 492 676 400
3970 400 494 869 656 547 684 624 462 280 201 224 167 306 519 390 697 611 493 481 853 582 429 547 352 102 305 155
3842 155 208 310 401 615 412 731 560 519 723 422 443 368 270 242 75 111 276 633 406 394 575 603 612 474 567 455 370 347
3704 347 329 122 290 165 374 482 453 466 625 639 432 558 453 474 424 116 240 92 24 354 404 353 546 609 637 517 555
3571 555 448 345 290 221 129 163 78 372 325 426 411 689 437 666 455 484 472 323 362 178 104 92 266 260 316 508 626 527 535
$$ packed form
4521A513Q2R5M8J17p0o2j3J2j82j08J4j53jk46J52r7J27j8R1K83m39L05r4l29J31j37o9Qk69
4378F91NJ02KJ14K6J42r4O1l4KN0k63n6j28P5p9K7j92J64L16j86K22q4l9R0p3j87K09l91K
4231D94J55m32K82K36j75M7K82j69M7O9j71K89k62l03K12l24J23M3j8J18J3K30k20J59K14
4108I39k56r8P5j33O9m01K85p9k22L40L2N1j2J11m4K15l42J17k36J18j37j98P7RoK18J84k76
3970D00R4L75k13j09J37o0j62j82p9K3n7J39K13j29L07q6j18j2L72k71j53J18j95k50K03j50
3842A55N3J02R1K14k03L19j71m1K04l01K1p5r8k8j67L6J65L57k27j2J81K8Rj38R3j12q5k3
3704C47j8k07J68j25K09J08k9J3J59J4k07J26j05K1n0l08J24j48o8L30N0n1J93O3K8j20L8
3571E55j07j03n5o9r2L4q5K94m7J01j5K78k52K29k11K9j2j49L9j84p4j2J74oN6J92J18r9Q
$$ plain form
3428 535 412 623 478 125 343 257 16 108 299 127 406 407 309 655 523 589 511 460 416 369 282 280 20 114 357 256 455 393
3291 393 681 398 601 488 650 452 212 298 231 195 66 283 316 391 442 481 498 542 477 703 334 437 376 66 164 132 142 329
3153 329 348 496 481 562 480 562 609 383 499 163 348 254 113 233 275 408 368 541 383 599 771 313 784 448 327 223
3025 223 333 61 273 1171 938 182 553 609 556 536 533 581 445 576 149 255 264 260 295 298 560 369 642 520 715 882 455 921
2887 921 513 312 140 12828 23471 24397 17564 2070 233 330 430 471 494 494 472 347 438 263 337 303 61 325 355 327
2769 327 658 419 588 775 2071 4473 4542 4459 543 368 371 426 411 302 527 484 620 772 656 610 583 595 494 500 321 375 312
2636 312 550 341 522 586 651 577 821 664 708 698 568 534 516 296 566 376 626 479 650 714 599 839 726 826 589 670
2508 670 661 660 669 319 461 699 627 735 708 804 822 626 912 725 940 794 473 785 669 651 739 934 756 687 920 832 906 1005 1034
$$ packed form
3428E35j23K11j45l53K18q6k41R2J91j72K79Jr8L46j32O6p8n1m4m7q7kk60R4K43j01J99o2
3291C93K88k83K03j13J62j98k40Q6o7l6j29K17L3P5N1L9J7M4o5K26l69J03o1l10R8l2J0J87
3153C29J9J48j5Q1q2Q2M7k26J16l36J85r4j41J20M2J33m0J73j58K16J72m58M71l36j21j04
3025B23J10k72K12Q98k33p56L71N6n3k0lM8j36J31m27J06RmL5LK62j91K73j22J95J67m27M66
2887I21m08k01j72J2688J0643R26o833j5494j837R7J00M1K3%k2j25R1j75P4l4k42K64L0k8
2769C27L31k39J69J87J296K402O9q3l916j75LN5j5j09K25m3J36J52j16m6k7J2j01Oj79N4o3
2636C12K38k09J81O4O5p4K44j57M4j0j30l4j8k20K70j90K50j47J71O4j15K40j13J00k37Q1
2508F70rjRl50J42K38p2J08k7R6J8j96K86j87K15j46l21L12j16j8Q8J95j78o9K33q8P4R9K9
$$ plain form
2365 1034 857 877 883 733 720 1003 761 862 913 1009 1087 996 1123 856 1345 1161 927 1228 925 1121 1130 1280 911 1397 1324 1220 1151
2232 1151 1452 1380 1361 1180 1601 1241 1432 1570 1605 1723 1700 1730 1886 1683 1805 1721 1697 1619 1850 1649 2184 2387 2569 2631 2906 3307
2104 3307 3103 3113 3089 2927 2752 2501 2192 2249 2984 3821 4671 5652 7414 8510 9719 10903 11944 12912 13374 13812 14243 17557
1996 17557 22941 48346 150399 2068211 2015083 264280 214119 53918 31266 23538 19230 16743 14862 12631
1927 12631 11049 9183 7385 6159 4469 3424 2914 2111 2401 2592 2788 3423 3328 3324 3452 3148 3048 2950 2377 2264 1955 1784
1819 1784 1821 1617 1623 1719 1845 1888 1812 1975 1719 1750 1648 1655 1190 1532 1387 1383 1255 1400 1250 1384 1256 1217 1306 1239 1514 1813 1103 2530
1681 2530 3027 1566 835 1223 1089 1064 1212 908 1128 970 834 874 858 669 814 934 661 898 928 871 1171 750 855 806 612
1558 612 682 788 527 692 547 692 564 591 787 2011 4728 1338 886 882 765 631 585 589 533 614 689 618 687 764 922 739 654
$$ packed form
2365A034j77K0Oj50j3K83k42J01N1R6P8r1J27k67M89j84k34L01l03J96RJ50l69M86p3j04o9
2232A151L01p2j9j81M21l60J91J38L5J18k3L0J56k03J22q4k4p8K31k01N35K03J82O2K75M01
2104C307k04J0k4j62j75k51l09N7P35Q37Q50R81J762J096J209J184J041R68M62M38M31L314
1996A7557N384K5405J02053J917812n3128j750803n0161j60201k2652p728m308k487j881k231
1927A2631j582j866j798j226j690j045n10q03K90J91J96O35r5mJ28l04j00r8n73j13l09j71
1819A784L7k04OR6J26M3p6J63k56L1j02Pm65L42j45mj28J45j50J34j28l9Q9o7K75K99p10J427
1681B530M97j461p31L88j34k5J48l04K20j58j36M0j6j89J45J20k73K37L0n7L00m21J05m9j94
1558F12P0J06k61J65j45J45j28K7J96J224K717l390m52mj17j34m6Mn6Q1P5p1O9P7J58j83q5
$$ plain form
1425 654 787 783 763 542 540 494 390 436 506 531 647 512 930 599 866 562 478 667 931 221 384 482 358 432 474 381 694 717
1287 717 538 816 459 874 550 519 286 349 418 263 338 399 398 767 420 733 631 592 743 592 472 328 411 281 201 282 320
1154 320 272 629 539 700 483 751 520 602 464 412 207 273 103 283 350 511 380 654 484 568 470 594 784 408 478 351
1026 351 60 339 77 365 355 389 578 620 505 583 516 539 641 414 275 127 297 304 151 379 223 433 563 420 696 528
898 528 681 516 474 240 185 272 206 221 326 285 230 607 512 747 419 651 570 289 308 324 84 165 171 54 324 313 563 624 414
756 414 611 593 553 347 342 168 361 85 25 172 223 413 405 705 517 577 439 642 429 390 442 176 53 94 152 312 341 398 380
613 380 615 565 498 559 539 419 341 166 138 121 214 307 395 424 1352 1592 983 104 1599 1175 475 492 422 248 176 87 388 295 264
470 264 594 376 707 526 623 480 416 565 315 172 289 118 333 173 371 444 471 564 661 482 558 610 311 406 347 253 171 218
$$ packed form
1425F54J33mk0k21km6j04M6P0K5J16j35M18l31K67l04q4J89K64p10J63R8j24P4M2r3L13K3
1287G17j79K78l57M15l24l1k33O3O9j55P5O1jL69l47L13j02l9J51j51j20j44Q3j30q0Q1L8
1154C20m8L57r0J61k17K68k31Q2j38n2k05O6j70J80O7J61j31K74j70Q4r8J24J90l76P0j27
1026C51k91K79k62K88j0L4J89M2j15P8o7K3J02k27j39j48J70Pj53K28j56K10J30j43K76j68
898E28J53j65m2k34n5Q7o6J5J05m1n5L77r5K35l28K32q1k81J9J6k40Q1Oj17K70j1K50O1k10
756D14J97j8m0k06nj74J93k76o0J47N1J90qL00j88O0j38K03k13l9N2k66j23M1N8J60K9N7j8
613C80K35n0o7O1k0j20p8j75k8j7R3R3Q8K9R28K40o09q79J495m24p00J7p0j74p2q9L01r3l1
470B64L30k18L31j81R7j43o4J49k50j43J17j71K15j60J98P3K7R3R7j79P6N2k99R5n9r4q2M7
$$ plain form
332 218 190 322 402 427 697 439 629 593 663 359 401 391 237 233 48 315 247 362 512 611 540 613 631 473 666 477 312 282 183
190 183 197 315 208 440 641 383 636 622 501 532 867 311 359 543 236 184 228 195 542 563 539 627 592 692 662 461 707 265
52 265 529 382 213 276 448 352 256 706 538 743 584 843 522 506 693 404 499 208 309 178 432 500 568 703 714 719 761 749
-86 749 620 782 489 373 451 416 378 276 509 677 675 710 713 873 748 764 607 761 579 540 403 534 484 426 878 570 1026 593
-224 593 877 886 915 704 933 731 543 610 491 524 589 758 753 885 887 966 984 1062 971 845 905 801 651 721 599 708 953 984 863
-367 863 1070 1110 1344 1065 1345 1026 1212 1011 1078 984 969 979 1220 915 1347 1421 1583 1359 1869 1573 1656 1528 1559 1692 1428 1446
-495 1446 1385 1412 1433 1484
-514 1484
$$ packed form
332B18k8J32Q0K5K70k58J90l6P0l04M2j0j54mj85K67o8J15J50R9p1P3J8j58J93j89j65l0r9
190A83J4J18j07K32K01k58K53j4j21L1L35n56M8J84l07n2M4l3L47K1k4Q8l5J00l0k01K46m42
52B65K64j47j69O3J72r6r6M50j68K05j59K59l21j6J87k89R5k91J01j31K54O8O8J35J1NM2j2
-86G49j29J62k93j16P8l5l8j02K33J68kL5LJ60j25J6j57J54j82l9j37J31n0n8M52l08M56m33
-224E93K84RK9k11K29k02j88O7j19L3O5J69nJ32KP9J8P8r1j26O0j04j50P0j22J09K45L1j21
-367H63K07M0K34k79K80l19J86k01O7r4j5J0K41l05M32P4J62k24N10k96Q3j28L1J33k64J8
-495A446o1K7K1N1
-514A484
##PAGE=	F1=-588.074
##FIRST=	4521.1594499999982872,	4521.1594499999982872,	0
##DATA TABLE=	(F2++(Y..Y)), PROFILE
$$ plain form
4521 1426 1477 1558 1625 1709 1618 1572 1571 1578 1374 1302 1325 1192 1209 964 1118 1060 1140 1101 1248 1444 1059 1320 1234 915 1057 930 803 969 617
4378 617 652 752 749 863 887 1012 933 904 945 898 974 705 684 619 612 543 633 472 553 860 694 916 797 753 850 788 585 833 425 423
4231 423 645 155 574 649 521 572 792 664 719 750 592 885 591 396 485 288 345 431 407 515 538 736 510 634 889 600
4103 600 526 589 475 533 177 437 355 200 495 524 576 548 627 597 831 434 583 329 528 373 131 256 308 267 434 676 314
3970 314 500 785 587 495 621 535 387 285 136 243 171 317 496 387 652 545 442 431 752 533 357 508 287 108 295
3847 295 133 217 279 369 595 382 681 457 479 657 387 412 341 247 203 55 103 258 644 400 313 573 550 545 424 492 406 336 290
3704 290 290 151 279 185 387 440 406 454 518 591 369 518 400 422 370 30 279 94 8 335 422 294 545 555 561 492 496 335 305 305
3556 305 189 112 130 83 391 273 433 354 636 404 587 400 428 449 273 288 146 114 151 251 272 298 467 581 424 523 327
$$ packed form
4521A426N1Q1O7Q4r1m6jPk04p2K3j33J7k45J54n8Q0l9J47J96l85K61q6l19J42j27j27J66l52
4378F17L5J00lJ14K4J25p9k9M1m7P6k69k1o5po9R0j61Q1L07j66K22j19m4R7o2k03K48m08k
4231D23K22m90M19P5j28N1K20j28N5L1j58K93k94j95Q9j97N7Q6k4J08K3J98k26J24K55k89
4103F00p4O3j14N8l56K60q2j55K95K9N2k8P9l0K34l97J49k54J99j55k42J25N2m1J67K42l62
3970C14J86K85j98r2J26q6j48j02j49J07p2J46J79j09K65j07j03j1L21k19j76J51k21j79J87
3847B95j62Q4O2R0K26k13K99k24K2J78k70K5p1r4m4j48M8J55L86k44q7K60k3nj21O8q6p0m6
3704B90%j39J28r4K02N3l4M8O4P3k22J49j18K2n2l40K49j85q6L27Q7j28K51J0Oo9Mj61l0%
3556C05j16p7J8m7L08j18J60p9K82k32J83j87K8K1j76J5j42l2L7J00K1K6J69J14j57R9j96
$$ plain form
3424 327 572 450 113 274 247 69 86 269 117 389 380 278 611 453 549 432 383 382 305 275 260 70 62 351 240 417 324 649
3286 649 345 542 444 577 422 157 215 196 139 65 282 287 382 391 443 476 459 430 626 276 374 307 46 141 160 162 324 326 464 431 481
3133 481 453 490 565 304 444 160 281 198 128 262 250 381 318 490 329 575 661 263 710 427 254 204 262 72 273 1189 1241
3000 1241 139 486 570 533 415 506 469 390 526 121 237 174 229 284 223 508 372 598 413 647 816 419 848 417 199 177
2872 177 11733 21478 22247 16235 2007 244 306 370 447 403 433 388 272 433 215 257 271 23 297 357 259 640 342 514
2754 514 691 1996 4087 4193 4015 452 280 366 347 355 280 456 456 539 697 584 506 498 513 443 461 226 382 231 493 304 463
2621 463 560 592 473 759 579 597 590 499 436 425 245 502 309 557 440 569 617 526 764 608 747 514 549 561 587 599 236 395
2483 395 604 558 706 612 683 741 537 783 643 809 700 340 717 583 539 678 821 680 588 872 674 804 898 864 740 762
$$ packed form
3424C27K45j22l37J61k7j78J7J83j52K72rj02L33j58R6j17m9jp7l0j5j90qK89j11J77r3L25
3286F49l04J97r8J33j55k65N8j9n7p4K17NR5RN2L3j7k9J96l50R8o7k61R5J9KJ62KJ38l3N0
3133D81k8L7P5k61J40k84J21q3p0J34j2J31o3J72j61K46Q6l98M47k83j73n0N8j90K01R16N2
3000A241j102L47Q4l7j18R1l7p9J36m05J16o3N5N5o1K85j36K26j85K34J69l97M29m31k18k2
2872A77J1556R745P69o012j4228j763O2O4P7m4L0m5j16J61k18M2J4k48K74O0r8L81k98J72
2754E14J77J305K091J06j78l563j72Q6j9Qp5J76%Q3J58j13p8qJ5p0J8k35J56j51K62j89J59
2621D63R7L2j19K86j80J8pr1o3j1j80K57j93K48j17J29M8r1K38j56J39k33L5J2K6J2l63J59
2483C95K09m6J48r4P1N8k04K46j40J66j09l60L77j34m4J39J43j41r2K84j98J30R4l4j24K2
$$ plain form
2355 762 780 596 619 851 699 729 805 908 929 873 958 755 1201 971 788 1092 785 957 979 1131 803 1215 1138 1081 992 1236 1190
2222 1190 1167 1049 1389 1099 1221 1384 1412 1461 1473 1503 1670 1443 1554 1447 1461 1373 1606 1448 1890 2106 2290 2321 2527 2968 2670 2713
2095 2713 2676 2443 2352 2054 1821 1905 2663 3434 4208 5160 6568 7578 8657 9649 10453 11280 11554 11902 12003 14583 21414 45449
1986 45449 141770 1859992 1806310 280508 223534 54275 30881 22602 17995 15319 13441 11297 9784 8012
1917 8012 6357 5254 3716 2785 2417 1763 2059 2267 2505 3058 2973 2965 3019 2794 2675 2581 2021 1925 1714 1486 1571 1396 1395 1520 1607
1794 1607 1678 1552 1753 1492 1513 1389 1466 1038 1295 1215 1189 1068 1252 1080 1179 1120 1048 1127 1097 1363 1775 1306 2035 2663 1578 783
1666 783 1073 911 946 1063 759 999 872 682 762 727 641 695 829 570 756 826 771 1022 686 745 666 513 568 697 454 619 486
1533 486 642 542 548 832 2319 4292 1152 762 790 643 558 441 554 449 570 587 566 592 685 809 681 528 690 676 676 483
$$ packed form
2355G62J8j84K3K32j52L0P6J03K1n6Q5k03M46k30j83L04l07J72K2J52l28M12p7n7q9K44m6
2222A190k3j18L40k90J22J63K8M9J2L0J67k27J11j07J4q8K33j58M42K16J84L1K06M41k98M3
2095B713l7k33r1k98k33Q4P58P71P74R52J408J010J079R92Q04Q27K74L48J01K580O831K4035
1986D5449R6321J718222n3682j525802n6974j69259k3394q279m607k676j878k144j513j772
1917H012j655j103j538r31l68o54K96K08K38N53q5qN4k25j19r4n60r6k11k28Q5j75jJ25Q7
1794A607P1j26K01k61K1j24P7m28K57q0k6j21J84j72R9n9p2P9l0K66M12m69P29O28j085p95
1666G83K90j62L5J17l04K40j27j90Q0l5q6N4J34k59J86P0n5K51l36N9p9j53N5J29k43J65j33
1533D86J56j00OK84J487J973l140l90K8j47q5j17J13j05J21J7k1K6R3J24j28j53J62j4%j93
$$ plain form
1405 483 451 459 348 322 469 424 646 436 841 517 763 540 406 580 661 254 326 397 292 412 471 259 645 610 501 761 356
1273 356 781 465 427 266 247 346 226 297 401 289 721 358 677 526 587 667 507 425 262 332 241 187 266 282 215 599 453 672
1135 672 416 655 474 548 360 379 131 221 85 260 296 485 330 588 424 550 370 493 710 391 405 244 76 274 59
1012 59 339 315 423 519 535 411 573 453 451 567 380 189 78 273 287 122 349 222 415 477 398 600 484 616 426 423 178
879 178 149 265 227 246 274 284 148 581 438 704 389 579 514 250 248 288 113 167 198 49 305 294 521 606 339 581 512 460 277
736 277 337 139 331 81 86 114 219 421 347 684 459 517 407 597 378 282 422 154 36 74 122 281 321 401 384 507 509 470 493
593 493 501 386 253 132 91 103 242 270 372 438 1257 1724 673 297 1544 1040 438 461 391 201 158 36 383 267 234 556
465 556 359 593 482 582 382 370 516 258 180 276 76 351 178 352 401 421 527 593 428 473 579 182 428 288 246 207 247
$$ packed form
1405D83l2Qj11k6J47m5K22k10M05l24K46k23j34J74Q1m07P2P1j05J20N9k12L86l5j09K60m05
1273C56M25l16l8j61j9R9j20P1J04j12M32l63L19j51O1Q0j60q2j63P0r1n4P9J6o7L84j46K19
1135F72k56K39j81P4j88J9k48R0j36J75L6J89j55K58j64J26j80J23K17l19J4j61j68J98k15
1012E9K80k4J08R6J6j24J62j20kJ16j87j91j11J95J4j65K27j27J93O2p9K02j16J32j90lk45
879A78k9J16l8J9K8J0j36M33j43K66l15J90o5k64kM0j75N4L1j49K56j1K27Q5k67K42o9n2j83
736B77O0j98J92k50NK8J05K02p4L37k25N8j10J90k19r6J40k68j18L8M8J59M0Q0j7J23Kl9K3
593D93Qj15j33j21m1J2J39K8J02O6Q19M67j051l76J247n04o02K3p0j90m3j22L47j16l3L22
465E56j97K34j11J00k00j2J46k58p8R6k00K75j73J74M9K0J06O6j65M5J06l97K46j40m2l9M0
$$ plain form
332 247 182 312 362 358 697 383 539 557 600 319 331 315 196 243 57 318 224 359 518 560 456 576 533 413 543 465 299 221
195 221 223 221 297 210 429 619 327 603 534 466 451 787 270 311 499 238 179 236 199 522 505 525 564 561 604 641 363 674 195 437
47 437 398 192 251 481 336 218 651 476 714 513 771 466 440 578 411 455 174 326 165 411 473 491 666 669 661 674 708 547
-91 547 721 406 375 422 378 340 336 433 667 626 677 589 821 670 680 562 704 472 509 363 536 432 414 846 544 921 537 796
-229 796 833 813 647 829 681 483 598 446 529 540 736 697 817 800 874 887 1001 838 747 880 755 540 691 549 693 896
-357 896 925 784 1012 976 1267 976 1236 898 1120 917 983 897 900 907 1181 841 1274 1262 1536 1234 1701 1450 1488 1371 1435 1559 1293
-490 1293 1341 1291 1278 1353 1379
-514 1379
$$ packed form
332B47o5J30N0mL39l14J56J8M3k81J2j6j19M7j86K61r4J35J59M2j04J20m3j20J30p8j66p8
195B21KkP6q7K19J90k92K76o9o8j5L36n17M1J88k61n9N7l7L23j7K0L9lM3L7k78L11m79K42
47D37l9k06N9K30j45j18M33j75K38k01K58l05k6J38j67M4k81J52j61K46O2J8J75LqJ3L4j61
-91E47J74l15l1M7m4l8mR7K34m1N1q8K32j51J0j18J42k32L7j46J73j04j8M32l02L77l84K59
-229G96L7k0j66J82j48j98J15j52Q3J1J96l9J20j7P4J3J14j63r1J33j25k15J51j42J44K03
-357H96K9j41K28l6K91k91K60l38K22k03O6q6LPK74l40M33j2K74l02M67k51L8j17O4J24k66
-490A293M8n0j3P5K6
-514A379
##PAGE=	F1=-597.918
##FIRST=	4521.1594499999982872,	4521.1594499999982872,	0
##DATA TABLE=	(F2++(Y..Y)), PROFILE
$$ plain form
4521 1224 1248 1316 1385 1434 1326 1315 1305 1328 1098 1088 1104 1006 1027 814 968 928 968 907 1110 1199 893 1088 1026 740 875 773 602 909
4383 909 494 557 656 636 755 767 869 807 681 809 718 814 555 573 577 489 430 571 449 457 736 591 796 649 610 708 649 454 731
4241 731 331 315 606 70 608 521 438 494 643 553 618 613 479 746 450 369 334 276 268 410 359 450 484 639 400 498 775 478 426
4098 426 494 387 439 151 370 301 197 428 485 496 463 512 495 732 305 475 227 496 319 60 223 309 251 345 624 209 469
3965 469 640 477 415 512 392 299 267 73 245 162 306 439 364 559 447 353 356 591 451 270 433 204 104 263 119 203 236
3832 236 306 532 325 583 328 400 546 343 363 276 225 143 63 92 231 607 371 201 547 455 443 346 377 332 278 218 236 181 248
3689 248 203 379 372 315 413 391 500 299 432 313 350 291 95 303 94 36 290 413 221 513 454 452 420 417 189 242 317 144 88
3547 88 107 74 385 217 397 286 545 348 461 318 351 386 206 193 103 140 208 226 266 258 390 500 294 477 218 484 398 113
$$ packed form
4521A224K4O8O9M9j08j1j0K3k30j0J6r8K1k13J54m0M0o1K03Q9l06J95o2k86J35j02j71L07
4383I09m15O3R9k0J19J2J02o2j26J28r1R6k59J8Mq8n9J41j22QK79j45K05j47l9R8n9j95K77
4241G31m00j6K91n36N38q7q3N6J49r0O5nj34K67k96q1l5n8qJ42n1R1L4J55k39R8K77k97n2
4098D26O8j07N2k88K19o9j04K31N7J1l3M9j7K37m27J70k48K69j77k59J63Q6n8R4K79m15K60
3965D69J71j63o2R7j20r3l2j94J72q3J44J33p5J95j12r4LK35j40j81J63k29j00J59j44Q4L3
3832B36P0K26k07K58k55P2J46k03K0q7n1q2q0K9J39L76k36j70L46r2j2r7L1m5n4o0J8n5O7
3689B48m5J76pn7R8k2J09k01J33j19L7n9j96K08k09n8K54J23j92K92n9kl2lk28N3P5j73n6
3547H8J9l3L11j68J80j11K59j97J13j43L3L5j80j3r0L7O8J8M0qJ32J10k06J83k59K66q6k85
$$ plain form
3409 113 187 221 111 74 225 99 356 316 219 532 347 479 320 282 326 210 262 228 115 41 322 200 346 234 573 255 458
3276 458 362 478 366 82 129 167 99 70 256 251 357 300 376 424 339 351 516 189 292 224 29 110 168 183 303 274 414 346 370 385
3128 385 392 482 202 364 176 206 141 138 286 214 330 241 416 246 518 500 186 601 367 183 166 172 77 251 1068 1295 114 409
2990 409 484 491 269 460 326 308 453 110 212 153 169 253 142 426 356 504 289 524 715 356 732 297 86 236 9901 18168
2862 18168 18771 13930 1801 259 269 281 395 298 350 262 195 392 152 173 241 107 243 339 159 596 238 409 555 1745
2744 1745 3441 3538 3271 340 172 350 262 279 244 374 382 419 591 470 370 379 402 354 397 108 368 153 401 247 382 495
2616 495 508 334 648 460 450 456 409 299 314 166 411 224 464 370 454 492 406 643 444 619 405 399 445 468 492 153 307 473
2478 473 444 637 474 519 615 411 595 517 629 557 189 605 459 400 579 663 550 475 760 467 652 734 630 589 587 621 436 470
$$ packed form
3409A13P4L4j10l7J51j26K57m0r7L13j85J32j59l8M4j16N2l4j13p4K81j22J46j12L39l18K03
3276D58r6J16j12k84M7L8o8k9J86nJ06n7P6M8q5J2J65l27J03o8j95Q1N8J5J20k9J40o8K4J5
3128C85PR0k80J62j88L0o5lJ48p2J16q9J75j70K72j8l14M15k34j84j7Or5J74Q17K27j181K95
2990D09P5Pk22J91j34j8J45l43J02n9J6Q4j11K84p0J48k15K35J91l59L76m35k11J50R665Q267
2862A8168O03m841j2129j542J0J2J14r7N2q8o7J97k40K1O8j34J36R6j80M37l58J71J46J190
2744A745J696R7k67k931j68J78q8J7l5J30QL7J72j21j00RK3m8M3k89K60k15K48j54J35J13
2616D95J3j74L14j88j0Om7j10J5j48K45j87K40r4Q4L8q6K37j99J75k14oM6K3K4l39J54J66
2478D73k9J93j63M5R6k04J84p8J12p2l68M16j46n9J79Q4j13p5K85k93J85Q2j04m1kL4j85L4
$$ plain form
2341 470 658 578 559 637 753 714 685 741 598 975 728 597 890 594 736 761 910 649 957 870 877 776 937 923 900 853 1084 898
2203 898 925 1111 1127 1107 1141 1179 1341 1115 1196 1085 1132 1035 1262 1158 1471 1693 1857 1848 1972 2434 2052 2128 2082 1803 1813 1464 1379 1442
2065 1442 2192 2834 3462 4322 5257 6112 6979 7704 8215 8854 8897 9145 9091 11024 18317 39226 122474 1516377 1466662 278343
1967 278343 214258 50296 28146 20018 15424 12803 11065 9145 7843 6282 4884 3900 2818 1978 1786 1339 1648
1883 1648 1804 2087 2497 2428 2397 2389 2256 2115 2039 1538 1459 1366 1098 1242 1088 1074 1233 1278 1358 1196 1419 1169 1176 1049 1170 835 971
1750 971 965 928 811 1035 843 896 919 825 876 890 1100 1637 1568 1661 2285 1496 659 861 670 768 850 562 822 711 493 596 546 584
1612 584 546 671 446 569 670 635 798 571 604 488 383 416 572 361 505 407 558 499 490 863 2234 3303 1024 597 658
1489 658 475 472 260 483 330 483 452 472 456 571 634 569 365 565 516 545 405 328 394 307 188 401 284 606 327 701 394
$$ packed form
2341D70J88q0j9P8J16l9k9N6j43L77k47j31K93k96J42K5J49k61L08q7Pj01J61j4k3m7K31j86
2203H98K7J86J6k0L4L8J62k26Q1j11M7r7K27j04L13K22J64rJ24M62l82P6m6k79J0l49q5O3
2065A442P50O42O28Q60R35Q55Q67P25N11O39M3K48n4J933P293K0909Q3248J393903m9715j188319
1967B78343o4085j63962k2150q128m594k621j738j920j302j561j398r84j082q40j92m47L09
1883A648J56K83M10o9l1qj33j41p6n01p9r3k68J44j54j4J59M5Q0j62K23k50Pj27J21l35J36
1750I71ol7j17K24j92N3K3r4N1J4K10N37o9R3O24p89q37K02j91R8Q2k88K60j11k18J03n0L8
1612E84l8J25k25J23J01l5J63k27L3j16j05L3J56k11J44r8J51n9rL73J371J069k279m27O1
1489F58j83lk12K23j53J53l1K0j6J15O3o5k04K00m9K9j40p7O6q7j19K13j17L22k79L74l07
$$ plain form
1356 394 640 454 309 490 396 240 246 300 203 365 437 132 546 455 437 655 224 631 361 300 240 129 250 198 230 382 177
1223 177 617 289 581 389 520 571 379 359 171 243 181 172 247 237 133 534 355 581 315 515 398 444 245 316 58 166 62
1090 62 222 216 431 263 488 319 499 246 361 589 347 307 124 83 201 24 305 243 430 428 414 291 504 373 338 441 327
957 327 102 45 225 254 95 315 190 388 353 346 471 401 515 304 346 104 113 235 255 263 217 246 62 523 341 626 322 473
820 473 419 203 165 233 156 162 208 57 257 260 435 549 251 506 413 334 194 304 150 279 79 144 104 211 401 276 606 384
682 384 418 349 510 310 172 360 119 55 101 99 235 281 380 348 372 409 423 395 417 340 159 125 63 93 256 196 325 418 1107 1641
534 1641 372 404 1334 767 366 407 330 143 143 36 346 241 166 497 305 443 405 509 264 298 437 190 163 253 29 353
406 353 167 304 329 347 451 488 331 360 511 71 422 211 231 239 250 174 286 286 267 650 303 418 458 509 246 235 233 143 247 70
$$ packed form
1356C94K46j86j45J81r4j56ON4r7J62P2l05M14r1j8K18m31M07k70o1o0j11J21n2L2J52k05
1223A77M40l28K92j92J31N1j92k0j88P2o2rP5j0j04M01j79K26k66K00j17M6j99P1k58J08j04
1090F2J60oK15j68K25j69J80k53J15K28k42m0j83m1J18j77K81o2J87kj4j23K13j31l5J03j14
957C27k25n7J80K9j59K20j25J98l5pJ25p0J14k11M2k42RJ22K0Qm6K9j84M61j82K85l04J51
820D73n4k16l8O8p7OM6j51K00LJ75J14k98K55r3p9j40J10j54J29k00O5m0J07J90j25L30k22
682C84L4o9J61k00j38J88k41o4M6kJ36M6R9l2K4L7J4k8K2p7j81l4o2L0J63o0J29R3O89N34
534A641j269L2R30n67m01M1p7j87%j07L10j05p5L31j92J38l8J04k45L4J39k47k7R0k24L24
406C53j86J37K5J8J04L7j57K9J51m40L51k11K0QJ1p6J12%j9L83l47J15M0N1k63j1kr0J04j77
$$ plain form
259 70 315 184 337 485 472 337 492 404 322 386 414 280 152 243 232 264 188 388 550 243 522 408 405 339 658 211 250 427
121 427 212 175 225 189 460 413 474 465 491 467 572 242 594 105 320 388 167 206 485 293 167 550 379 636 400 649 375
-12 375 343 421 383 375 125 332 145 352 417 364 585 576 570 531 617 441 615 291 361 360 313 285 387 325 601 539 597 419 700 551 543
-165 543 474 602 334 450 298 500 357 370 753 486 740 428 666 719 664 547 674 568 420 530 385 513 430 662 585
-288 585 697 647 718 732 865 647 597 794 648 397 606 448 635 773 792 639 891 771 1101 811 1038 702 952 751 829
-411 829 739 757 772 1057 699 1103 1025 1369 1021 1412 1207 1224 1100 1215 1310 1072 1127 1099 1048 1170 1181
-514 1181
$$ packed form
259G0K45j31J53J48j3j35J55q8q2O4K8j34j28R1j1L2p6K00J62l07K79j14lo6L19m47L9J77
121D27k15l7N0l6K71m7O1rK6k4J05l30L52m89K15O8k21L9K79j92j26L83j71K57k36K49k74
-12C75l2P8l8qk50K07j87K07O5n3K21rol9Q6j76J74l24P0jm7k8J02o2K76o2N8j78K81j49q
-165E43o9J28k68J16j52K02j43J3L83k67K54l12K38N3n5j17J27j06j48J10j45J28q3K32p7
-288E85J12n0P1J4J33k18n0J97j46k51K09j58J87J38J9j53K52j20L30k90K27l36K50k01P8
-411H29r0J8J5K85l58M04p8L44l48L91k05J7j24J15R5k38N5k8n1J22J1
-514A181
##PAGE=	F1=-607.763
##FIRST=	4521.1594499999982872,	4521.1594499999982872,	0
##DATA TABLE=	(F2++(Y..Y)), PROFILE
$$ plain form
4521 943 951 1003 1063 1073 961 999 957 1017 760 828 821 767 782 618 781 727 743 664 913 890 679 791 771 531 643 586 384 793 342 434
4373 434 527 478 610 604 682 633 416 634 505 615 384 432 504 350 295 470 389 343 580 457 631 464 438 533 464 307 593 231
4236 231 197 540 23 597 374 325 387 467 409 482 449 345 568 290 315 180 246 183 380 287 363 406 511 254 343 617 335 309
4098 309 393 281 332 135 292 243 178 330 437 377 351 377 372 590 171 345 127 443 244 13 182 280 233 239 534 103 408 463
3960 463 347 325 373 223 209 232 63 235 143 278 358 328 430 335 240 271 397 356 181 339 122 94 217 120 175 187 220 440 252
3817 252 453 191 298 413 299 306 188 204 76 76 78 198 531 330 78 500 337 326 261 241 246 205 141 174 211 207 214 355 287 196 348
3665 348 266 383 240 315 207 273 213 190 309 93 79 223 377 151 454 325 326 316 332 39 176 323 101 64 96 59 356 171
3527 171 327 220 441 278 313 219 272 292 138 98 57 163 243 196 245 210 294 395 159 406 112 376 334 127 104 188 135 83 170
$$ packed form
4521I43QN2O0J0j12L8m2O0k57O8pn4J5j64J63n4J6p9K49k3k11J12k0k40J12n7k02M09m51R2
4373D34R3m9J32oP8m9k17K18j29J10k31M8P2j54n5J75q1m6K37j23J74j67k6R5o9j57K86l62
4236B31l4L43n17N74k23m9O2Q0n8P3l3j04K23k78K5j35O6o3J97r3P6M3J05k57Q9K74k82k6
4098C09Q4j12N1j97J57m9o5J52J07o0k6K6nK18m19J74k18L16j99k31J69R8m7OK95m31L05N5
3960D63j16k2M8j50j4K3j69J72r2J35Q0l0J02r5r5L1J26m1j75J58k17k8J23r7N5J2L3K20j88
3817B52K01k62J07J15j14Pj18J6j28%KJ20L33k01k52M22j63j1o5k0Nm1o4L3L7mPJ41o8r1J52
3665C48q2J17j43P5j08O6o0k3J19k16j4J44J54k26L03j29Jj0J6k93J37J47k22l7L2l7K97j85
3527A71J56j07K21j63L5r4N3K0j54m0m1J06Q0m7M9l5Q4J01k36K47k94K64m2k07k3Q4n3n2Q7
$$ plain form
3384 170 70 316 225 144 432 222 393 211 182 261 101 240 181 152 61 273 150 255 136 472 150 363 269 371 297 47
3256 47 59 144 97 83 208 217 322 187 293 353 201 257 390 107 209 142 33 84 161 199 274 206 359 240 253 293 283 377 98 275
3108 275 204 139 99 142 300 174 279 152 332 150 440 316 97 475 278 144 118 80 73 221 832 1135 90 330 364 436
2981 436 139 405 178 211 369 142 183 199 99 210 86 330 323 377 168 366 595 288 601 172 84 287 7619 14067 14528
2857 14528 11013 1485 265 226 176 325 202 259 119 145 323 87 100 218 183 171 306 42 532 135 290 390 1364 2624
2739 2624 2691 2357 225 84 323 180 202 200 300 282 284 473 334 223 251 282 250 320 46 338 117 291 194 293 403 413 188
2606 188 500 335 298 328 323 145 204 71 309 144 362 282 322 368 264 500 263 464 279 247 356 329 368 93 215 330 306
2474 306 544 315 344 466 274 378 373 431 391 59 466 331 260 464 485 387 391 603 249 474 544 374 434 380 438 287 308 460
$$ packed form
3384A70j00K46r1q1K88k10J71j82k9P9j60J39n9k9r1K12j23J05j19L36l22K13r4J02p4k50
3256D7J2Q5m7j4J25RJ05j35J06O0j52N6J33k83J02o7j09N1P7L8P5o8J53j19J3M0j0R4k79J77
3108B75p1o5m0M3J58j26J05j27J80j82K90j24k19L78j97j34k6l8pJ48O11L03j045K40L4P2
2981D36k97K66k27L3J58k27M1J6j00J11j24K44pN4k09J98K29l07L13m29q8K03P332O448M61
2857A4528l515r528j220l9n0J49j23N7j40K6J78k36J3J18l5j2J35k64M90l97J55J00R74J260
2739B624O7l34k132j41K39j43K2kJ00j8KJ89j39j11K8L1l2P0k74K92k21J74r7R9J10J0k25
2606A88L12j65l7L0nj78N9j33K38j65K18q0M0M6j04K36k37K01j85l2J09k7L9k75J22J15k4
2474C06K38k29K9J22j92J04nN8m0l32M07j35p1K04K1r8MK12l54K25P0j70O0n4N8j51K1J52
$$ plain form
2336 460 421 385 438 573 474 469 517 414 707 488 388 657 396 494 517 653 481 676 565 645 552 606 622 612 634 736 680 607 798
2193 798 799 734 764 819 958 757 796 700 781 669 880 841 1002 1219 1349 1301 1336 1808 1357 1465 1414 1121 1235 843 968 946 1660 2131
2055 2131 2570 3251 3765 4361 4983 5413 5617 6059 5866 6032 6001 7516 14303 30852 96161 1096738 1055202 256477
1967 256477 187844 42696 23548 16238 11975 9643 8152 6549 5564 4300 3223 2347 1949 1140 1158 952 1268 1288
1878 1288 1620 1839 1792 1724 1681 1630 1473 1420 1020 949 988 692 900 750 722 909 920 992 814 1027 817 803 689 821 631 613 690
1745 690 646 532 797 590 580 693 589 596 647 756 1454 1850 1565 1941 1351 500 647 414 565 620 355 632 519 308 409
1622 409 342 508 411 488 321 368 487 501 538 428 464 309 246 261 434 271 378 327 454 448 421 872 1907 2126 989 411 506
1489 506 292 383 82 385 193 369 308 351 303 445 427 422 192 436 330 398 327 193 310 281 93 315 132 540 207 537 252
$$ packed form
2336D60l9l6N3J35r9nM8j03K93k19j00K69k61R8K3J36j72J95j11Q0r3N4J6j0K2J02n6p3J91
2193G98Jo5L0N5J39k01L9r6Q1j12K11l9J61K17J30m8L5M72m51J08n1k93J14l92J25k2P14M71
2055B131M39O81N14N96O22M30K04M42j93J66l1J515O787J6549O5309J000577m1536p98725
1967B56477o8633j45148j9148p310m263k332j491j603r85j264j077q76l98q09J8k06L16K0
1878A288L32K19m7o8m3n1j57n3m00p1L9k96K08j50k8J87J1P2j78K13k10j4j14J32j90j8P7
1745F90m4j14K65k07j0J13j04PN1J09O98L96k85L76n90q51J47k33J51N5k65K77j13k11J01
1622D09o7J66r7P7j67M7J19J4L7j10L6j55o3J5J73j63J07n1J27ok7M51J035K19j137n78R5
1489E06k14R1l01L03j92J76o1M3m8J42j8nk30K44j06O8p1j34J17k9j88K22j83M08l33L30k85
$$ plain form
1356 252 513 329 210 372 157 201 162 208 104 297 381 94 413 283 362 515 87 448 261 158 222 12 145 181 145 348
1228 348 120 472 227 461 243 405 474 232 290 73 164 114 164 227 199 65 447 264 444 201 354 307 310 147 236 54 124
1095 124 51 177 127 356 192 373 187 434 116 220 443 286 202 9 84 137 27 269 151 413 317 280 165 386 300 218
967 218 293 266 38 44 163 213 82 278 133 360 213 277 328 297 393 172 252 36 82 186 278 274 164 180 36 446 239 528 238
825 238 353 299 166 79 167 192 160 197 79 191 220 324 460 179 400 312 194 115 248 200 214 85 194 159 195 358 202 484
687 484 315 296 274 397 239 115 269 81 71 148 106 181 226 344 279 234 282 372 291 309 287 115 147 86 93 254 96 267 368 915
539 915 1396 322 424 957 477 272 344 257 100 133 105 279 219 95 426 224 285 313 414 178 216 349 119 128 226 17 337
406 337 146 233 239 263 342 371 207 237 420 134 393 153 214 255 226 170 254 195 169 564 215 284 316 403 159 141 168 89 244 83
$$ packed form
1356B52K61j84j19J62k15M4l9M6j04J93Q4k87L19j30P9J53m28L61j87j03O4k10J33L6l6K03
1228C48k28L52k45K34k18J62O9k42N8k17R1n0N0O3k8j34L82j83J80k43J53m7Lj63Q9j82P0
1095A24p3J26n0K29j64J81j86K47l18J04K23j57q4j93P5N3j10K42j18K62r6l7j15K21q6q2
967B18P5k7k28OJ19N0j31J96j45K27j47O4N1l1R6k21Q0k16M6J04R2mj10J6j44M10k07K89k90
825B38J15n4j33q7Q8K5l2L7j18J12K9J04J36k81K21q8j18p9J33m8J4j29J09l5L6J63j56K82
687D84j69j9k2J23j58j24J54j88j0P7m2P5M5J18o5m5M8R0q1J8k2j72L2o1PJ61j58J71J01N47
539I15M81j074J02N33m80k05P2q7j57L3k8J74o0j24L31k02O1K8J01k36L8J33k30RR8k09L20
406C37j91Q7OK4P9K9j64L0J83k86K59k40O1M1k9n6Q4n9k6L95l49O9L2Q7k44j8K7p9J55j61
$$ plain form
259 83 301 138 298 423 365 199 380 264 215 232 334 258 109 242 226 222 149 322 444 148 405 272 329 227 500 150 191
126 191 336 164 169 198 165 370 306 399 349 396 301 472 118 482 35 192 355 143 151 458 232 126 418 264 523 267 501
-7 501 266 229 249 323 279 69 326 133 264 343 209 474 457 462 362 498 323 483 167 332 276 229 228 428 216 489 428 485 235
-150 235 528 413 380 360 471 194 376 223 435 267 303 616 402 519 285 509 561 507 423 494 414 364 419 320 480 279 550
-283 550 444 543 458 523 545 681 428 422 662 500 247 480 317 546 605 603 463 727 530 877 595 790 473 743 539 645
-411 645 539 562 602 872 515 867 754 1112 760 1047 891 911 760 940 988 804 846 841 765 914 926
$$ packed form
259H3K18j63J60J25n8j66J81j16m9J7J02p6j49J33j6mp3J73J22k96K57j33N7j02K73l50M1
126A91J45j72NK9l3K05o4R3n0M7r5J71l54L64m47J57J63k12QL07k26j06K92j54K59k56K34
-7E01k35l7K0P4m4k10K57j93J31P9j34K65j7Nj00J36j75J60l16J65n6m7jK00k12K73o1N7k50
-150B35K93j15l3k0J11k77J82j53K12j68L6L13k14J17k34K24N2n4q4P1q0n0N5r9J60k01K71
-283E50j06R9q5O5K2J36k53oK40j62k53K33j63K29N9kj40K64j97L47k82J95l17K70k04J06
-411F45j06K3M0K70l57L52j13L58l52K87j56K0j51J80M8j84M2np6J49J2
-514I26
##PAGE=	F1=-617.607
##FIRST=	4521.1594499999982872,	4521.1594499999982872,	0
##DATA TABLE=	(F2++(Y..Y)), PROFILE
$$ plain form
4521 632 635 670 716 687 586 675 586 698 419 566 523 518 517 409 594 492 505 412 689 569 455 476 516 322 399 413 198 639 189
4378 189 307 391 302 457 427 482 438 153 449 294 413 232 279 410 219 159 347 308 229 418 318 454 275 262 353 263 169 442
4241 442 152 126 458 109 547 229 201 271 291 266 336 287 216 383 137 245 100 202 104 341 202 277 319 373 102 195 444 197
4103 197 210 299 183 229 146 219 187 153 217 383 243 240 245 261 429 73 215 78 380 167 75 139 224 212 131 422 16 333 288 226
3955 226 243 226 64 130 188 104 217 124 239 273 285 286 228 131 192 208 269 107 247 75 85 170 135 148 139 124 337 177 313 65 195
3803 195 288 260 252 101 180 27 74 67 163 435 287 37 436 215 214 193 115 163 129 72 113 238 169 215 321 195 82 270 164 265
3655 265 204 188 100 206 179 263 297 91 124 146 321 105 377 189 202 201 253 106 133 321 82 59 84 48 306 145 236 165 349
3512 349 204 171 122 209 180 94 63 16 178 252 167 212 171 201 282 50 328 88 274 266 141 72 160 142 105 108 35 276 119 70 328
$$ packed form
4521F32LL5M6k9j01Q9q9J12k79J47m3njj08J85j02J3r3K77j20j14K1M0j94P7J4k15M41m50
4378A89J18Q4q9J55l0N5m4k85K96j55J19j81M7J31j91o0J88l9p9J89j00J36j79j3R1r0r4K73
4241D42k90k6L32l49M38l18k8P0K0k5P0m9p1J67k46J08j45J02r8K37j39P5M2N4k71R3K49k47
4103A97J3Q9j16M6q3P3l2l4O4J66j40lNJ6J68l56J42j37L02k13r2O4Q5j2q1K91m06L17m5o2
3955B26J7j7j62O6N8q4J13r3J15L4J2Jn8r7O1J6O1j62J40j72J0Q5l5J3rj5K13j60J36k48J30
3803A95R3k8qj51P9j53M7pR6K72j48k50L99k21jk1p8M8l4n7M1J25o9M6J06j26j13J88j06J01
3655B65o1j6q8J06k7Q4L4k06L3K2J75k16K72j88J3jN2j47K7J88k39k3K5l6K58j61R1p1J84
3512C49j45l3m9Q7k9q6l1m7J62P4q5M5m1L0Q1k32K78k40J86qj25o9Q8j8l7Lp3K41j57m9K58
$$ plain form
3360 328 98 304 161 129 197 25 209 121 173 80 214 117 156 49 363 92 271 205 282 233 127 33 122 113 100 147 193 281 78
3217 78 211 276 65 168 269 111 142 88 57 81 144 206 246 140 312 131 156 215 184 265 67 198 228 97 81 144 299 140 256
3074 256 80 254 58 356 139 24 349 174 141 72 9 62 202 535 845 61 256 229 375 145 351 76 119 289 191 151
2946 151 239 61 164 108 237 278 239 67 199 474 239 475 57 162 311 5238 9807 10171 7921 1107 255 184 74 252
2828 252 141 175 51 138 244 35 59 202 238 98 264 72 457 85 184 226 928 1762 1812 1441 129 97 284 106 143 156
2700 156 251 194 164 358 210 88 148 178 164 243 145 298 146 180 167 211 299 322 63 335 234 190 239 263 56 114 41 213 105
2557 105 269 192 187 280 122 364 98 311 157 123 329 216 250 76 142 203 171 444 160 198 321 153 175 239 248 235 90 321
2419 321 250 150 356 314 216 358 428 61 303 360 143 308 174 265 199 165 301 257 237 244 398 243 264 338 242 444 321 196
$$ packed form
3360C28k30K06j43l2O8j72J84q8N2r3J34r7L9j07L14k71J79o6P7m9j06r4Q9rj3M7M6Q8k03
3217G8J33O5k11J03J01j58L1n4l1K4O3O2M0j06J72j81K5N9l1Q1j98J31L0j31j6O3J55j59J16
3074B56j76J74j96K98k17j15L25j75l3o9o3N3J40L33L10p84J95k7J46k30K06k75M3J70r8m0
2946A51Q8j78J03n6J29M1l9j72J32K75k35K36m18J05J49M927M569L64k250o814q52p1j10J78
2828B52j11L4j24Q7J06k09K4J43L6j40J66j92L85l72R9M2P02Q34N0l71j312l2J87j78L7J3
2700A56R5n7l0J94j48j22O0L0j4P9r8J53j52L4j3M4Q8K3k59K72j01m4M9K4k07N8p3J72j08
2557A05J64p7nR3j58K42k66K13j54l4K06j13L4j74O6O1l2K73k84L8J23j68K2O4Rj3j45K31
2419C21p1j00K06m2r8J42P0l67K42N7k17J65j34R1o6l4J36m4k0PJ54j55K1P4r6K02j23j25
$$ plain form
2282 196 432 252 271 292 407 334 430 273 426 366 303 336 365 437 396 485 359 505 479 434 409 486 591 434 427 370 500 340 527
2139 527 563 574 759 862 784 720 1203 709 832 802 524 731 345 699 520 1164 1446 1700 2116 2374 2617 3009 3158 3081 3350
2016 3350 2958 3096 3292 4726 10152 21804 67442 669500 639516 216946 148927 32789 17872 11890 8228
1942 8228 6372 5194 3945 3331 2409 1649 899 1252 407 708 723 1003 816 1190 1200 1176 1070 1031 1019 877 832 574 484 665
1824 665 345 620 448 418 604 597 652 486 642 509 474 373 485 475 274 449 393 284 589 377 281 486 378 336 402 391 1269
1691 1269 2123 1796 1754 1181 379 494 204 373 424 186 462 338 173 233 150 425 333 316 230 187 311 400 284 283 357 168 124
1558 124 160 305 206 272 260 346 399 340 850 1780 2077 1002 221 362 145 300 116 278 68 250 177 226 160 329 226 265 62
1425 62 323 163 267 265 74 219 270 154 223 8 462 119 377 118 399 228 135 245 53 165 98 136 38 218 314 176 270
$$ packed form
2282A96K36j80J9K1J15p3R6j57J53o0o3L3K9P2m1Q9j26J46k6m5k5P7J05j57pn7J30j60J87
2139E27L6J1J85J03p8o4M83m94J23l0k78K07l86L54j79O44K82K54M16K58K43L92J49p7K69
2016C350l92J38J96J434N426J1652M5638O02058k9984m22570o8019j16138j4917n982l662
1942H228j856j178j249o14r22p60p50L53q45L01J5K80j87L74J0k4j06l9j2j42m5k58r0J81
1824F65l20K75j72l0J86pN5j66J56j33l5j01J12j0k01J75n6j09L05k12r6K05j08m2O6j1Q78
1691A269Q54l27m2n73q02J15k90J69N1k38K76j24j65O0q3K75r2j7q6m3J24Q9j16jP4j89m4
1558A24L6J45r9O6j2Q6N3n9N10R30K97j075p81J41k17J55j84J62k10J82p3M9o6J69j03L9k03
1425F2K61j60J04kj91J45N1j16O9k15M54l43K58k59K81j71r3J10j92J12o7L8r8J80R6j38R4
$$ plain form
1292 270 143 291 368 35 262 187 39 211 90 70 167 63 303 162 307 183 331 124 270 391 97 233 22 116 59
1169 59 164 209 177 115 350 202 287 102 195 217 170 107 160 102 103 60 136 79 269 135 263 51 370 39 92 299 220 110 89 85
1021 85 108 86 234 52 382 204 161 68 242 248 109 179 211 39 60 101 176 81 239 65 334 106 204 189 197 269 50 151 16
879 16 63 125 287 281 124 101 90 366 162 428 172 236 173 156 70 103 210 164 163 110 128 181 219 347 144 282 225 64 56 182 255
726 255 152 101 234 222 171 304 134 341 274 176 196 273 179 142 181 67 76 192 138 132 165 301 190 129 146 334 223 199 233 153 177
574 177 122 97 234 33 215 301 714 1228 682 393 709 494 189 286 188 94 130 175 192 204 131 353 131 152 228 310 185 138 277
431 277 56 97 200 57 306 122 149 147 187 216 269 81 120 322 234 351 164 202 250 179 170 221 118 78 452 137 157 161 296 84
283 84 120 143 48 233 87 278 108 250 343 258 62 264 134 117 148 239 233 122 223 203 176 109 239 319 65 271 166 251 161
$$ packed form
1292B70j27J48P7l33K27p5j48J72j21k0R7j04K40j41J45j24J48k07J46J21k94J36k11R4n7
1169E9J05M5l2o2K35j48Q5j85R3K2m7o3N3n8Jm3P6n7J90j34J28k12L19l31N3K07p9j10k1m
1021H5K3k2J48j82L30j78m3r3J74Oj39P0L2j72K1M1P5r5J58j74K69k28R8j5QP2k19J01j35
879A6M7O2J62oj57k3j1K76k04K66k56O4o3j7q6L3J07m6jn3J8N3L8J28k03J38n7j61qJ26P3
726B55j03n1J33j2n1J33j70K07o7r8K0P7r4l7L9j14RJ16n4oL3J36j11o1J7J88j11k4L4q0K4
574A77n5k5J37k01J82Q6M13N14n46k89L16k15l05R7r8r4L6M5J7J2p3K22k22K1P6Q2j25m7J39
431B77k21M1J03j43K49j84K7kM0K9N3j88L9K02q8J17j87L8M8p1rN1j03m0L74l15K0MJ35k12
283H4L6K3r5J85j46J91j70J42R3q5j96K02j30j7L1R1oj11J01k0k7o7J30Q0k54K06j05Q5r0
$$ plain form
140 161 339 116 141 240 106 158 163 127 270 204 312 239 295 136 365 41 355 70 72 304 124 101 404 165 123 275 151 394
3 394 142 353 155 115 99 242 187 28 306 138 159 264 64 353 338 356 216 378 218 346 68 292 185 136 187 457 164
-130 164 352 311 362 69 329 279 224 243 330 94 298 161 357 178 224 462 302 299 139 354 386 386 303 316 251 319 288 260 435
-273 435 117 420 302 377 269 319 354 483 218 256 505 342 124 336 181 442 419 388 297 548 292 638 358 539 257 528
-401 528 315 461 333 355 429 658 318 609 500 809 498 661 556 600 412 657 646 534 549 555 478 628 659
$$ packed form
140A61J78k23K5R9j34N2Nl6J43o6J08p3N6j59K29l24L14k85KK32j80k3L03k39m2J52j24K43
3C94k52K11j98m0j6J43n5j59K78j68K1J05k00K89j5J8j40J62j60J28k78K24j07m9N1K70k93
-130A64J88m1N1k93K60n0n5J9Q7k36K04j37J96j79M6K38j60lj60K15L2%q3J3o5O8l1k8J75
-273D35l18L03j18P5j08N0L5J29k65L8K49j63k18K12j55K61k3l1r1K51k56L46k80J81k82K71
-401E28k13J46j28K2P4K29l40K91j09L09l11J63j05M4j88K45j1j12J5Op7J50L1
-514F59
##PAGE=	F1=-627.451
##FIRST=	4521.1594499999982872,	4521.1594499999982872,	0
##DATA TABLE=	(F2++(Y..Y)), PROFILE
$$ plain form
4521 343 349 362 401 334 261 389 247 418 153 340 256 302 286 218 435 271 294 189 471 286 259 192 298 152 187 294 134 471
4383 471 62 201 278 136 324 264 302 258 98 283 115 239 148 134 307 121 43 223 229 134 277 208 299 117 110 196 73 59 303
4241 303 120 160 373 174 467 113 88 166 141 171 200 162 129 230 33 176 159 154 55 294 120 215 237 250 79 85 283 103 161
4098 161 223 124 143 173 171 139 132 109 324 120 171 135 206 279 70 113 114 317 116 128 105 151 189 33 310 56 259 161 156 183 99 91 78
3935 78 145 135 195 111 197 205 243 149 145 77 129 105 211 64 182 85 87 132 160 142 101 31 240 115 190 41 115 206 225 206 67 151 47
3773 47 55 60 129 336 253 122 361 112 121 163 88 90 60 18 62 260 150 206 281 105 98 189 96 190 185 77 14 163 214 305 273 89 162
3611 162 69 251 84 293 84 97 95 191 208 131 308 94 79 63 50 246 135 140 129 293 136 61 66 173 63 104 110 16 181 239
3463 239 142 175 156 130 184 76 257 151 196 203 144 101 143 137 123 43 9 243 29 21 233 17 225 192 144 143 101 169 57 177 84 159
$$ packed form
4521C43OJ3L9o7p3J28j42J71k65J87q4M6j6o8K17j64K3j05K82j85k7o7J06j46L5J07j60L37
4383D71m09J39P7j42J88o0L8m4j60J85j68J24r1j4J73j86p8J80Or5J43o9R1j82pQ6j23j4K44
4241C03j83M0K13j99K93l54k5P8k5L0K9l8l3J01j97J43j7nr9K39j74R5K2J3j71OJ98j80N8
4098A61O2r9J9L0kl2pk3K15k04N1l6P1P3k09M3JK03k01J2k3M6L8j56K77k54K03r8nK7q4qj3
3935G8O7j0O0q4Q6QL8r4mo8N2k4J06j47J18r7KM5K8j8m1p0K09j25P5j49P4R1J9j9j39Q4j04
3773D7QNO9K07q3j31K39k49RM2p5Kl0m2M4J98j10N6P5j76pR1r3R4nj08o3J49N1R1l2j84P3
3611A62r3J82j67K09k09J3kR6J7p7J77k14j5j6j3J96j11Nj1J64j57p5NJ07j10M1Or4J65N8
3463B39r7L3j9k6N4j08J81j06M5Pn9m3M2oj4q0l4K34k14qK12k16K08l3m8jm2O8j12J20r3P5
$$ plain form
3305 159 128 72 55 262 143 194 204 228 190 208 34 105 119 118 80 180 239 58 147 204 69 102 168 170 104 92 91 95 127 201 220 111 276
3143 276 42 101 201 111 163 134 150 234 82 77 144 281 123 266 77 195 35 280 3 73 238 70 142 54 58 44 201 240 516
3000 516 35 194 106 313 243 305 113 60 223 230 120 241 93 125 165 161 226 114 29 50 364 222 365 33 213 303 3115 6021
2862 6021 6354 5095 722 228 152 45 191 129 109 153 144 183 20 75 193 265 67 218 166 377 117 118 107 528 1004 1073 726
2729 726 96 151 234 42 112 118 234 174 103 259 148 27 115 119 139 180 229 252 189 84 163 149 202 244 33 175 174 176 202 233 158 57
2572 57 118 141 126 193 113 67 248 7 262 61 187 52 56 349 205 156 75 117 124 83 347 29 135 204 75 121 139 127 131 150 185
2419 185 244 98 276 172 63 353 266 84 178 206 84 243 7 142 196 71 225 114 143 122 254 66 107 260 130 228
2291 228 279 56 251 225 106 143 217 237 277 42 265 246 150 111 243 299 118 338 311 301 210 310 170 243 326 218 178 225 385
$$ packed form
3305A59l1n6j7K07j19N1J0K4l8J8j74P1J4jl8J00N9j81Q9N7j35L3O6Ko6j2jML2P4J9j09J65
3143B76k34N9J00r0N2k9J6Q4j52nO7J37j58J43j89J18j60K45k77P0J65j68P2q8Mj4J57L9K76
3000E16m81J59q8K07p0O2j92n3J63Pj10J21j48L2M0mO5j12q5K1L14j42J43l32J80R0K812K906
2862F021L33j259m373m94p6j07J46o2k0M4rL9j63N5J18P2j98J51n2K11k60Jj1M21M76O9l47
2729G26o30N5Q3j92P0OJ16o0p1J56j11j21Q8MK0M1M9K3o3j05P9j4N3M2k11J42jKK6L1p5j01
2572E7O1K3j5O7q0m6J81k41K55k01J26j35MK93j44m9q1M2Pm1K64l18J06O9j29M6J8j2MJ9L5
2419A85N9j46J78j04j09K90q7j82R4K8j22J59k36J35N4j25J54j11K9k1J32j88M1J53j30R8
2291B28N1k23J95k6j19L7P4K0M0k35K23j9r6l9J32N6j81K20k7j0r1J00j40P3Q3j08m0M7J60
$$ plain form
2149 385 142 275 380 305 377 511 412 233 727 278 324 429 233 437 339 610 299 792 891 1032 1106 1309 1183 1380 1303 989
2021 989 1134 644 955 1712 3230 6621 13571 40923 296970 281052 165008 104144 22186 12018 7638 4765
1942 4765 3501 2669 1760 1513 969 435 221 767 191 596 672 858 484 862 689 681 574 587 514 500 377 343 182 471 192
1819 192 463 259 262 371 355 412 312 322 325 297 171 249 391 32 297 216 135 450 260 57 338 229 171 191 123 1113 2347 2166
1681 2166 1858 1032 363 430 130 220 315 140 334 215 132 103 107 345 320 197 190 87 168 341 94 166 295 108 33 167 202 173
1543 173 215 210 247 353 239 785 2140 3181 986 49 251 142 231 228 177 77 153 85 125 65 240 71 123 132 241 121 184 229
1405 229 63 128 266 239 136 117 390 135 242 51 310 215 112 226 191 155 90 95 99 137 246 246 141 133 238 247 121 117 156 99 200
1253 200 161 104 148 69 252 214 146 154 206 90 159 329 89 195 89 101 44 164 198 171 198 255 180 155 49 61 148 50 128 107 133
$$ packed form
2149C85k43J33J05p5P2J34r9j79M94m49M6J05j96K04r8K71l11M93R9J41P4K03j26J97p7l14
2021I89J45m90L11P57J518L391O950K7352K56047j5918j16044o0864q1958j0168m380k873
1942D765j264q32r09k47n44n34k14N46n76M05P6J86l74L78j73qj07J3p3j4j23l4j61K89k79
1819A92K71k04LJ09j6N7j00J0Lk8j26P8J42l59K65q1q1L15j90k03K81j09n8K0o8R90J234j81
1681B166l08q26o69O7l00R0R5j75J94j19q3k9MK38k5j23pj03Q1J73k47P2J29j87p5J34L5k9
1543A73M2nL7J06j14N46J355J041k195r37K02j09Q9ln1j00P6o8M0o0J75j69N2RJ09j20O3M5
1405B29j66O5J38k7j03j9K73k55J07j91K59r5j03J14l5l6o5NML8J09%j05qJ05Rj26mL9n7J01
1253B00l9n7M4p9J83l8o8QN2j16O9J70k40J06j06J2n7J20L4k7K7N7p5k5j06J2Q7r8P8k1K6
$$ plain form
1100 133 88 77 106 128 184 106 180 80 320 117 35 183 157 70 156 89 121 145 197 44 348 118 102 80 100 226 46 181 179 49
953 49 73 59 154 77 194 42 307 142 138 70 129 161 43 58 43 65 61 280 283 101 48 124 296 139 339 160 140 83 168 133 52 209
795 209 173 113 142 100 142 147 221 127 170 165 50 38 123 292 109 119 262 264 142 247 78 198 259 76 123 154 139 178 148 88 79 224
638 224 168 101 106 261 96 117 26 315 232 108 181 199 197 149 101 196 130 181 241 566 1425 1088 351 1065 796 172 236 134 102 133
490 133 237 97 193 232 288 59 89 170 209 239 80 239 20 94 184 84 264 102 63 76 129 87 212 39 40 232 298 306 213 192
342 192 222 116 167 190 98 19 326 83 65 66 201 63 173 151 43 213 81 250 110 196 259 173 69 163 36 79 181 144 209
199 209 164 195 169 129 90 151 193 35 140 145 183 163 198 127 97 150 63 147 129 79 179 130 227 163 207 72 272 107 231 99 78 239
42 239 105 78 332 102 148 143 63 267 68 230 61 36 91 152 122 56 276 155 53 201 99 244 245 265 177 282 161 225 85
$$ packed form
1100A33m5j1K9K2N6p8P4j00K40k03q2J48k6q7Q6o7L2K4N2j53L04k30j6k2K0J26j80J35kj30
953D9K4j4R5p7J17j52K65j65mo8N9L2j18J5j5K2mK19Lj82n3P6J72j57K00j79k0n7Q5l5q1J57
795B09l6o0K9m2M2NP4r4M3nj15j2Q5J69j83J0J43Kj22J05j69J20O1j83M7L1j5L9l0o0rJ45
638B24n6o7NJ55j65K1r1K89q3j24P3J8km8m8R5o6N1O0L25Q59l37p37P14k69o24O4j02l2L1
490A33J04j40R6L9N6k29L0Q1L9L0j59J59k19P4R0j00J80j62l9J3N3m2J25j73JJ92O6Qr3k1
342A92L0j06N1K3r2p9L07k43j8JJ35j38J10k2j08J70j32J69j40Q6O3q6j04R4j27M3J02l7O5
199B09m5L1k6m0l9O1M2j58J05NL8k0L5p1l0N3q7Q4j8n0J00m9R7o4M4j35K00j65J24j32k1J61
42B39j34k7K54k30M6nq0K04j99J62j69k5N5O1l0o6K20j21j02J48j02J45JK0q8J05j21O4j40
$$ plain form
-101 85 246 102 46 167 472 196 211 202 248 53 138 174 118 141 197 103 227 139 280 104 148 319 202 141 73 223 220 329 212
-244 212 164 119 279 167 209 386 69 296 194 222 119 139 188 304 54 143 344 202 95 199 80 342 245 189 178 379 91
-376 91 421 131 331 122 343 108 304 153 194 285 453 140 375 318 511 275 307 255 342 133 411 336 303 286 282 233 357 420
$$ packed form
-101H5J61j44n6J21L05k76J5rM6j95Q5L6n6K3N6r4J24q8J41j76M4J71j17o1o8J50lJ09j17
-244B12m8m5J60j12M2J77l17K27j02K8j03K0M9J16k50Q9K01j42j07J04j19K62r7n6j1K01k88
-376I1L30k90K00k09K21k35J96j51M1R1J68l13K35n7J93k36L2n2Q7k09K78p5l3j7mm9J24O3
-514D20
##PAGE=	F1=-637.296
##FIRST=	4521.1594499999982872,	4521.1594499999982872,	0
##DATA TABLE=	(F2++(Y..Y)), PROFILE
$$ plain form
4521 153 129 115 171 82 81 172 24 215 162 175 58 159 166 86 322 170 149 21 289 103 115 91 148 102 79 246 187 311 49 130
4373 130 212 16 229 139 169 144 253 156 38 115 153 27 204 69 55 115 172 77 184 157 195 79 20 79 79 15 195 123 223 296
4226 296 211 371 60 26 93 51 165 93 120 123 144 95 120 220 106 66 242 63 183 171 165 179 69 157 114 156 167 122 83 196 157
4073 157 106 124 54 261 63 173 67 219 181 88 84 152 259 103 171 83 72 161 43 217 92 199 140 163 152 84 172 79 109 142
3926 142 172 106 159 170 205 70 95 112 87 166 186 61 156 102 99 115 187 161 84 46 160 82 107 112 97 188 188 167 102 118 66 21 57 98 253
3753 253 232 167 279 49 53 165 152 33 9 19 25 274 149 188 241 33 190 118 66 192 171 26 72 149 278 315 243 87 188
3611 188 5 173 71 209 101 35 15 147 265 148 280 110 106 28 62 187 125 53 108 268 79 42 98 163 49 145 150 34
3473 34 176 213 126 144 158 100 142 127 203 204 148 151 135 122 137 123 131 20 42 218 89 54 161 78 163 230 165 105 163 126 60 165 75 125
$$ packed form
4521A53k4j4N6q9jR1j48J91n3J3j17J01Pq0K36j52k1j28K68j86J2k4N7m6k3J67n9J24k62Q1
4373A30Q2j96K13r0L0k5J09r7j18P7L8j26J77j35j4O0N7r5J07k7L8j16n9N9%o4J80p2J00P3
4226B96q5J60l11l4O7m2J14p2K7LK1m9K5J00j14m0J76j79J20j2oJ4j10Q8m3M2J1m5l9J13l9
4073A57n1J8p0K07j98J10j06J52l8r3mO8J07j56O8q8j1Q9j18J74j25J07n9K3j1o8Q8r3L0L3
3926A42L0o6N3J1L5j35K5J7k5P9K0j25R5n4lJ6P2k6p7l8J14p8K5Nj5R1%k1o5J6n2m5L6M1J55
3753B53k1o5J12k30MJ12j3j19k4J0OK49j25L9N3k08J57p2n2J26k1j45M6P7J29L7p2j56J01
3611A88j83J68j02J38j08o6k0J32J18j17J32j70mp8L4J25o2p2N5J60j89l7N6O5j14R6Nj16
3473C4J42L7q7J8J4n8M2j5P6Jn6Lj6j3J5j4Qj11K2J76j29l5J07q3Q5O7o5o0N8l7o6J05r0N0
$$ plain form
3305 125 166 61 105 180 207 143 246 211 173 267 24 104 110 135 15 171 201 119 114 147 158 67 96 207 90 123 133 109 117 182 194 127 246
3143 246 50 88 245 83 84 189 136 220 79 80 143 249 132 288 112 161 88 224 94 124 154 38 127 69 89 23 210 47 224
3000 224 41 145 77 254 318 264 168 62 179 246 100 202 126 102 216 115 173 29 71 71 277 223 270 97 229 266 1609 3327
2862 3327 3703 2950 382 189 132 112 162 135 69 225 138 169 30 113 186 263 99 172 225 297 148 110 113 273 531 638 492 132
2725 132 181 176 11 98 87 242 220 110 181 170 93 138 118 160 139 280 208 216 18 160 111 128 183 68 50 142 210 189 213 243 35 175
2567 175 105 158 139 58 53 251 81 209 133 111 35 59 370 273 91 66 131 108 104 261 61 150 127 73 230 92 131 115 163 72 272
2414 272 101 231 72 57 336 150 152 148 94 177 234 131 112 223 31 224 44 104 157 160 121 42 264 126 102 294 70 136 265
2272 265 61 141 132 193 225 133 191 174 233 88 258 224 112 236 389 250 43 327 206 148 249 176 176 293 400 175 209 297 297
$$ packed form
3305A25M1j05M4P5K7o4J03l5l8R4k43Q0OK5j20J56L0q2nL3J1r1K9J11j17L3J0k4QO5J2o7J19
3143B46j96L8J57j62JJ05n3Q4j41JO3J06j17J56j76M9p3J36j30L0L0j16Q9n8K0o6J87j63J77
3000B24j83J04o8J77O4n4r6j06J17O7j46J02p6k4J14j01N8j44M2%K06n4M7j73J32L7J343J718
2862C327L76p53k568j93n7k0N0k7o6J56q7L1j39Q3P3P7j64P3N3P2j49l8LJ60K58J07j46l60
2725A32M9nj65Q7j1J55k2j10P1j1p7M5k0M2k1J41p2Qj98J42m9J7N5j15j8R2O8k1K4L0k08J40
2567A75p0N3j9q1nJ98j70J28p6k2p6K4L11r7j82k5O5k3mJ57k00Q9k3n4J57j38L9j6M8r1K00
2414B72j71J30j59j5K79j86Kmn4Q3N7j03j9J11j92J93j80O0N3Ll9p9K22j38k4J92k24O6J29
2272B65k04Q0rO1L2r2N8j7N9j45J70l4j12J24J53j39k07K84j21n8J01p3%J17J07k25L4Q8%
$$ plain form
2129 297 126 400 305 213 450 349 39 453 368 403 531 588 321 582 541 722 477 715 577 553 483 579 538 1075 1206 1795 2852
1996 2852 4271 7468 20550 22690 38316 108170 60616 12441 6815 4041 2082 1489 1108 711 671 689 568 722
1907 722 582 478 639 662 754 353 644 400 388 408 460 189 487 198 357 229 401 260 411 231 272 248 207 305 309 138 284
1775 284 310 156 227 348 203 238 150 147 374 233 148 257 164 200 67 229 994 2444 2446 2146 936 414 405 166 125 294 199 246
1637 246 183 132 72 216 282 326 167 169 135 84 306 131 113 259 107 19 210 131 155 198 168 161 309 117 671 2604 3988 885
1499 885 104 189 218 182 281 93 151 95 69 91 82 183 82 18 218 193 199 166 216 119 45 258 284 65 188 338 200 146 89 250
1351 250 246 127 356 308 172 115 82 161 63 187 277 50 198 209 191 166 116 159 171 177 195 166 125 134 200 231 19 124 101 123 149 287
1194 287 169 171 131 95 56 154 194 176 258 172 186 138 43 70 117 69 149 93 136 66 89 91 191 115 101 139 169 284 181 86 111 104 93 189
$$ packed form
2129B97j71K74r5r2K37j01l10M14q5L5J28N7k67K61m1J81k45K38j38k4p0R6m1N37J31N89J057
1996B852J419L197J3082K140J5626O9854m7554m8175n626k774j959n93l81l97m0J8j21J54
1907G22j40j04J61K3R2m01K91k44j2K0N2k71K98k89J59j28J72j41J51j80M1k4m1R8Mj71J46
1775B84K6j54P1J21j45L5q8lK27j41q5J09r3L6j33J62P65J450Kl00j210n22rk39m1J69r5M7
1637B46o3n1o0J44O6M4j59Kl4n1K22j75j8J46j52q8J91p9K4M3l0pJ48j92N54J933J384l103
1499H85p81Q5K9l6R9j88N8n6k6K2rJ01j01o4K00k5Ol3N0r7p4K13K6k19J23J50j38n4n7J61
1351B50mj19K29m8j36n7l3P9r8J24R0k27J48J1j8k5n0M3J2OJ8k9m1RO6L1k12J05k3K2K6J38
1194B87j18Km0l6l9R8M0j8Q2q6J4m8r5K7M7m8Q0n6M3p0K3KJ00p6j4L8L0J15j03r5K5pj1R6
$$ plain form
1026 189 93 146 193 161 117 323 105 112 127 50 228 74 246 175 39 80 51 151 64 144 99 278 228 88 23 113 84 101 46 54 89
$$ packed form
1026A89r6N3M7l2m4K06k18PJ5p7J78j54J72p1j36M1k9J00q7Q0m5J79n0j40o5R0k9J7n5QL5
$$ [...]
-514A44
##END NTUPLES=	nD NMR SPECTRUM
##END=	
##END=	
