##TITLE=	ayuY6FdqQZeJqpo6Akc3$w.71.ser
TM-VI-252, Na+Ph-pyr cosy

##JCAMP-DX=	6.0	$$ MestReNova 14.3.0-30573
##DATA TYPE=	LINK
##BLOCK_ID=	1
##BLOCKS=	2    
##ORIGIN=	Mestrelab Research S.L.
##OWNER=	hrzepa
##$MNOVA/LINK_BLOCK_TYPE=	ITEM	$$ NMR Spectrum
##$MNOVA/ITEM/POLYGON=	(XY..XY)
5321,5835
8722,5835
8722,8208
5321,8208
5321,5835
##$MNOVA/ITEM/Z=	0
##$MNOVA/ITEM/ANGLE=	0
##TITLE=	ayuY6FdqQZeJqpo6Akc3$w.71.ser
##JCAMP-DX=	6.0	$$ MestReNova 14.3.0-30573
##BLOCK_ID=	2
##DATA TYPE=	MNOVA NMR VIEW DATA
##DATA CLASS=	MNOVA VIEW DATA
##$MNOVA/2D/THRESHOLD=	16.220979690551757813
##$MNOVA/ITEM/ZOOM/X=	-1.2849598716208046056,	11.297249999948046906
##$MNOVA/ITEM/ZOOM/Y=	-1.2849598716208046056,	11.297249999948046906
##END=	
##TITLE=	ayuY6FdqQZeJqpo6Akc3$w.71.ser
##JCAMP-DX=	6.0	$$ MestReNova 14.3.0-30573
##BLOCK_ID=	3
##DATA TYPE=	nD NMR SPECTRUM
##DATA CLASS=	NTUPLES
##NUMDIM=	2
##ORIGIN=	Bruker BioSpin GmbH
##OWNER=	nmr
##.OBSERVE FREQUENCY=	400.20200099999999566
##.OBSERVE NUCLEUS=	^1H
##.SOLVENT NAME=	MeOD
##.PULSE SEQUENCE=	cosygpqf
##LONGDATE=	2022/01/24 18:07:10.000
##.ACQUISITIONMODE=	SIMULTANEOUS (DQD)
##$ORIGINAL FORMAT=	Bruker XWIN-NMR
##$MNOVA/SCALES_VERSION=	9
##$PARAMETER FILE=	(acqu2s, ASCII, /private/var/folders/f6/rjf_tdyn2v98c5c0wvkgn4s80000gn/T/ayuY6FdqQZeJqpo6Akc3$w/71/acqu2s, 0)
$$ ##TITLE= Parameter file, TOPSPIN		Version 3.2
$$ ##JCAMPDX= 5.0
$$ ##DATATYPE= Parameter Values
$$ ##NPOINTS= 221	$$ modification sequence number
$$ ##ORIGIN= Bruker BioSpin GmbH
$$ ##OWNER= nmr
$$ $$ 2022-01-24 18:16:09.601 +0000  nmr@CZC2439F63
$$ $$ /opt/topspin/data/agmb/nmr/Jan24-2022/71/acqu2s
$$ $$ process /opt/topspin3.2/prog/mod/go
$$ ##$ACQT0= 0
$$ ##$BF1= 400.2
$$ ##$FnMODE= 1
$$ ##$NUC1= <1H>
$$ ##$NusJSP= 0
$$ ##$NusT2= 1
$$ ##$NusTD= 220
$$ ##$O1= 2001.00000000702
$$ ##$SFO1= 400.202001
$$ ##$SW= 12.5944462247833
$$ ##$SW_h= 5040.32258064516
$$ ##$TD= 220
$$ ##END=
$$ 
##$PARAMETER FILE=	(acqus, ASCII, /private/var/folders/f6/rjf_tdyn2v98c5c0wvkgn4s80000gn/T/ayuY6FdqQZeJqpo6Akc3$w/71/acqus, 0)
$$ ##TITLE= Parameter file, TOPSPIN		Version 3.2
$$ ##JCAMPDX= 5.0
$$ ##DATATYPE= Parameter Values
$$ ##NPOINTS= 12	$$ modification sequence number
$$ ##ORIGIN= Bruker BioSpin GmbH
$$ ##OWNER= nmr
$$ $$ 2022-01-24 18:16:12.986 +0000  nmr@CZC2439F63
$$ $$ /opt/topspin/data/agmb/nmr/Jan24-2022/71/acqus
$$ $$ process /opt/topspin3.2/prog/mod/shimcntl
$$ ##$ACQT0= 1000000
$$ ##$AMP= (0..31)
$$ 100 100 100 100 100 100 100 100 100 100 100 100 100 100 100 100 100 100
$$ 100 100 100 100 100 100 100 100 100 100 100 100 100 100
$$ ##$AMPCOIL= (0..19)
$$ 0 0 0 0 0 0 0 0 0 0 0 0 0 0 0 0 0 0 0 0
$$ ##$ANAVPT= -1
$$ ##$AQSEQ= 0
$$ ##$AQ_mod= 3
$$ ##$AUNM= <au_zg>
$$ ##$AUTOPOS= <52 >
$$ ##$BF1= 400.2
$$ ##$BF2= 400.2
$$ ##$BF3= 400.2
$$ ##$BF4= 400.2
$$ ##$BF5= 400.2
$$ ##$BF6= 400.2
$$ ##$BF7= 400.2
$$ ##$BF8= 400.2
$$ ##$BYTORDA= 0
$$ ##$CAGPARS= (0..11)
$$ 0 0 0 0 0 0 0 0 0 0 0 0
$$ ##$CFDGTYP= 0
$$ ##$CFRGTYP= 9
$$ ##$CHEMSTR= <none>
$$ ##$CNST= (0..63)
$$ [...]
$$ 0 0 0 0
$$ ##$ShimPowMaxUC= (0..63)
$$ 130000 130000 130000 130000 130000 130000 130000 130000 130000 130000 130000
$$ 130000 130000 130000 130000 130000 130000 130000 130000 130000 0 0 0 0
$$ 0 0 0 0 0 0 0 0 0 0 0 0 0 0 0 0 0 0 0 0 0 0 0 0 0 0 0 0 0 0 0 0 0 0 0 0
$$ 0 0 0 0
$$ ##$ShimPowMaxUG= (0..63)
$$ 524287 524287 524287 524287 524287 524287 524287 524287 524287 524287 524287
$$ 524287 524287 524287 524287 524287 524287 524287 524287 524287 0 0 0 0
$$ 0 0 0 0 0 0 0 0 0 0 0 0 0 0 0 0 0 0 0 0 0 0 0 0 0 0 0 0 0 0 0 0 0 0 0 0
$$ 0 0 0 0
$$ ##$ShimPowRcbType= 3
$$ ##$ShimPowRes= (0..63)
$$ 1e-20 1e-20 1e-20 1e-20 1e-20 1e-20 1e-20 1e-20 1e-20 1e-20 1e-20 1e-20
$$ 1e-20 1e-20 1e-20 1e-20 1e-20 1e-20 1e-20 1e-20 0 0 0 0 0 0 0 0 0 0 0 0
$$ 0 0 0 0 0 0 0 0 0 0 0 0 0 0 0 0 0 0 0 0 0 0 0 0 0 0 0 0 0 0 0 0
$$ ##$ShimPowRng0= (0..63)
$$ 1 1 1 1 1 1 1 1 1 1 1 1 1 1 1 1 1 1 1 1 0 0 0 0 0 0 0 0 0 0 0 0 0 0 0 0
$$ 0 0 0 0 0 0 0 0 0 0 0 0 0 0 0 0 0 0 0 0 0 0 0 0 0 0 0 0
$$ ##$ShimPowRng1= (0..63)
$$ 1 1 1 1 1 1 1 1 1 1 1 1 1 1 1 1 1 1 1 1 0 0 0 0 0 0 0 0 0 0 0 0 0 0 0 0
$$ 0 0 0 0 0 0 0 0 0 0 0 0 0 0 0 0 0 0 0 0 0 0 0 0 0 0 0 0
$$ ##$ShimPowRng2= (0..63)
$$ 1 1 1 1 1 1 1 1 1 1 1 1 1 1 1 1 1 1 1 1 0 0 0 0 0 0 0 0 0 0 0 0 0 0 0 0
$$ 0 0 0 0 0 0 0 0 0 0 0 0 0 0 0 0 0 0 0 0 0 0 0 0 0 0 0 0
$$ ##$ShimPowRng3= (0..63)
$$ 1 1 1 1 1 1 1 1 1 1 1 1 1 1 1 1 1 1 1 1 0 0 0 0 0 0 0 0 0 0 0 0 0 0 0 0
$$ 0 0 0 0 0 0 0 0 0 0 0 0 0 0 0 0 0 0 0 0 0 0 0 0 0 0 0 0
$$ ##$ShimSysFunc= (0..63)
$$ 1 2 3 4 5 7 9 11 15 16 8 10 12 14 6 17 13 18 19 20 0 0 0 0 0 0 0 0 0 0
$$ 0 0 0 0 0 0 0 0 0 0 0 0 0 0 0 0 0 0 0 0 0 0 0 0 0 0 0 0 0 0 0 0 0 0
$$ ##$ShimSysMatrix= 0
$$ ##$ShimSysType= 1
$$ ##$TFXNUM= 0
$$ ##$TRIPLO2= 0
$$ ##$VTU= 2
$$ ##$VTUETH= <149.236.99.20>
$$ ##$VTUTY= <no>
$$ ##$WBREFAM= (0..15)
$$ 135.5 97.7 100 100 100 100 100 100 100 100 100 100 100 100 100 100
$$ ##$WBREFLM= (0..15)
$$ 0 0 0 0 0 0 0 0 0 0 0 0 0 0 0 0
$$ ##$WBREFPH= (0..15)
$$ 72.26 -67.22 0 0 0 0 0 0 0 0 0 0 0 0 0 0
$$ ##$WBSGU= (0..15)
$$ 0 0 0 0 0 0 0 0 0 0 0 0 0 0 0 0
$$ ##$XFAC= 2
$$ ##END=
$$ 
##$DECIM=	3968
##$DSPFVS=	20
##.ACQUISITIONSCHEME=	NOT PHASESENSITIVE
##NTUPLES=	nD NMR SPECTRUM
##VAR_NAME=	FREQUENCY1,	FREQUENCY2,	SPECTRUM
##SYMBOL=	F1,	F2,	Y
##.NUCLEUS=	1H,	1H
##.OBSERVE FREQUENCY=	400.20200099999999566,	400.20200099999999566
##VAR_TYPE=	INDEPENDENT,	INDEPENDENT,	DEPENDENT
##VAR_FORM=	AFFN,	AFFN,	ASDF
##VAR_DIM=	1024,	1024,	1048576
##UNITS=	HZ,	HZ,	ARBITRARY UNITS
##FIRST=	4521.1594499999982872,	4521.1594499999982872,	0.065136678516864776611
##LAST=	-514.24094062501069402,	-514.24094062501069402,	0.11832494288682937622
##MIN=	-514.24094062501069402,	-514.24094062501069402,	0.00026083175907842814922
##MAX=	4521.1594499999982872,	4521.1594499999982872,	1377.098876953125
##FACTOR=	1,	1,	0.0014636624726160302017
##PAGE=	F1=4521.16
##FIRST=	4521.1594499999982872,	4521.1594499999982872,	0.065136678516864776611
##DATA TABLE=	(F2++(Y..Y)), PROFILE
$$ [...]
##PAGE=	F1=-1040.92
##FIRST=	4521.1594499999982872,	4521.1594499999982872,	0
##DATA TABLE=	(F2++(Y..Y)), PROFILE
$$ plain form
-371 255 57 330 214 194 43 137 146 74 126 248 108 48 51 138 109 31 135 205 202 87 25 161 33 63 29 136 38 120 108
$$ packed form
-371B55j98K73j16k0j51R4Rp2N2J22j40o0LQ7k9p8J04P0lj15o2J36j28L0l4J07r8Q2j2
-514A08
##PAGE=	F1=-1050.76
##FIRST=	4521.1594499999982872,	4521.1594499999982872,	0
##DATA TABLE=	(F2++(Y..Y)), PROFILE
$$ plain form
4521 224 25 40 37 59 131 36 20 63 277 45 90 124 67 136 227 70 123 224 253 37 126 109 36 170 217 137 163 107 146 111 104 139
4364 139 172 103 148 189 52 74 127 118 158 257 268 207 188 235 168 196 103 124 121 178 360 125 120 150 77 104 247 219 132 142 173 89 156 243
4196 243 206 116 58 218 66 88 71 190 93 255 110 69 116 132 177 98 82 94 184 126 158 50 72 190 40 373 188 39 188
4054 188 154 80 76 102 198 255 177 230 31 71 72 134 198 168 217 127 161 178 166 30 129 143 122 39 165 50 271 21 22 255 298 99
3896 99 181 256 236 133 211 80 182 184 40 39 107 22 80 82 3 160 59 94 116 92 119 98 89 50 139 102 110 174 128 275 241 119 4
3734 4 105 66 195 108 111 62 85 24 113 52 192 234 152 138 104 99 167 14 110 106 152 218 21 81 74 144 182 214 246 40 38 32 120 102 89 97
3556 97 86 202 219 119 110 61 69 45 108 69 278 104 240 223 146 124 89 107 118 217 113 93 156 42 75 147 208 95 139 20 152
3404 152 189 83 205 107 68 93 62 56 84 160 163 37 120 133 222 48 179 75 126 182 84 57 187 119 82 148 85 34 138 159 48
$$ packed form
4521B24j99J5lK2P2r5j6M3K14k32M5L4n7O9R1j57N3J01K9k16Q9j7p3J34M7q0K6n6L9l5pL5
4364A39L3o9M5M1j37K2N3rM0R9J1o1j9M7o7K8r3K1lN7J82k35nL0p3K7J43k8q7J0L1q4O7Q7
4196B43l7r0n8J60j52K2j7J19r7J62j45m1M7J6M5p9j6J2R0n8L2j08K2J18j50L33j85j49J49
4054A88l4p4mK6R6N7p8N3j99M0JO2O4l0M9r0L4J7j2j36R9J4k1q3J26j15K21k50JK33M3j99
3896I9Q2P5k0j03P8j31J02Kj44jO8q5N8Kp9J57j01L5K2k4K7k1rl9Q9l7QO4m6J47l4j22j15
3734DJ01l9J29q7Lm9K3o1Q9o1J40M2q2j4l4nO8j53R6mM6O6j97O0pP0L8L2L2k06koQ8j8j3Q
3556I7j1J16J7j00rm9Qk4O3l9K09j74J36j7p7k2l5J8J1R9j04k0O3j14L3P2O1j13M4j19J32
3404A52L7j06J22r8l9K5l1oK8P6Lj26Q3J3Q9j74J31j04N1N6r8k7J30o8l7O6o3n1J04K1j11
$$ plain form
3251 48 53 56 96 96 95 79 100 166 135 67 147 82 148 82 189 52 149 332 116 219 78 47 340 822 671 906 420 188 96 125 112
3099 112 141 134 95 157 304 642 215 135 74 143 70 116 186 54 18 7 68 99 315 141 60 197 141 144 129 268 435 687 817 492
2951 492 254 216 135 156 62 124 89 186 70 68 147 190 128 133 172 186 452 314 136 61 153 59 13 101 15 107 139 39 89 56 135 253
2793 253 313 113 70 74 134 59 140 265 251 146 104 98 74 84 85 53 90 130 103 36 161 190 57 100 29 102 122 106 44 111 69 266 166
2631 166 53 82 20 97 115 88 32 179 210 127 156 172 75 137 131 270 48 63 99 170 142 137 69 147 63 78 179 147 249 182 72 91
2474 91 103 189 103 115 179 155 165 148 70 165 33 149 82 96 98 72 29 176 148 80 155 103 98 148 113 25 155 62 108 170 98 211 270 102
2306 102 25 45 93 20 67 163 32 102 71 34 142 132 70 140 115 196 138 150 114 191 103 239 166 29 90 21 103 66 176 161 87 78 106
2144 106 161 116 6 167 89 34 117 54 101 126 109 100 94 223 226 136 98 109 77 51 102 108 167 38 276 167 159 168 131 97 47 145 216 206 1597
$$ packed form
3251D8NLM0%jj6K1O6l1o8Q0o5O6o6J07j37R7J83k16J03j41l1K93M82j51K35m86k32r2K9j3
3099A12K9pl9O2J47L38m27q0o1O9p3M6P0j32l6j1O1L1K16j74q1J37n6Lj5J39J67K52J30l25
2951D92k38l8q1K1r4O2l5R7j16kP9M3o2NL9J4K66j38j78p5R2r4m6Q8q6R2L2j00N0l3P9J18
2793B53O0k00m3MO0p5Q1J25j4j05m2ok4J0Jl2L7M0k7o7J25K9j33M3p1P3K0j6o2O7m2J97j00
2631A66j13K9o2P7J8k7n6J47L1q3K9J6r7O2oJ39k22J5L6P1k8no8P8q4J5J01l2J02o7j10J9
2474I1J2Q6q6J2O4k4J0j7p8R5j32J16o7J4Kk6m3J47k8o8P5n2nN0l5q8J30r3M6O2p2J13N9j68
2306A02p7K0M8p3M7R6j31P0l1l7J08j0o2P0k5Q1n8J2l6P7q8J36p3j37O1o9Q2l7J10j5p4rK8
2144A06N5m5j10J61p8n5Q3o3M7K5j7roJ29Lr0l8J1l2k6N1ON9j29K38j09qRl7l4n0R8P1j0J391
$$ plain form
1971 1597 3005 1087 238 119 86 142 107 38 228 196 71 106 94 208 86 87 6 35 98 44 104 107 60 205 194 17 150 119 129
1829 129 161 87 103 117 77 267 167 190 72 284 285 664 670 675 247 347 294 404 524 443 687 332 736 1343 3245 19560 29803
1696 29803 41374 36692 18287 9246 1668 805 606 468 197 437 169 240 141 193 365 185 190 92 109 93 11 46 171 165
1578 165 82 93 126 74 186 120 42 85 162 101 111 187 190 19 175 126 149 45 157 79 311 177 41 179 109 182 93 81 127 273
1430 273 70 145 100 75 301 50 244 49 132 150 101 218 26 56 104 136 123 136 658 925 466 121 130 70 32 139 108 181 159
1287 159 128 135 136 97 234 191 101 55 149 41 105 209 197 100 140 133 101 114 72 158 73 57 118 224 132 204 142 92 144 133 103 140 122 145
1120 145 211 53 258 169 65 172 233 110 255 138 80 122 80 158 67 221 81 83 81 158 17 200 144 129 60 33 158 145 48 202
972 202 57 40 134 160 161 33 125 100 88 158 162 207 215 127 105 144 309 289 272 158 55 70 220 103 26 126 70 184 93 88 271 127
$$ packed form
1971A597J408j918q49j19l3N6l5o9J90l2j25L5j2J14j22Jq1K9O3n4O0Lm7J45j1j77J33l1J0
1829A29L2p4J6J4m0J90j00K3j18K12JL79ONm28J00n3J10J20q1K44l55M04O07J902J6315J0243
1696B9803J1571m682j8405r041p578q63j99j38k71K40k68P1r9N2J72j80Nr8J7j6q2L5J25o
1578A65q3J1L3n2J12o6p8M3P7o1J0P6Lj71J56m9K3j04J12p8K32j34j36J38p0P3q9j2M6J46
1430B73k03P5m5k5K26k51J94j95Q3J8m9J17j92L0M8L2j3J3N22K67m59l45Ro0l8J07l1P3k2
1287A59l1PJl9J37m3r0m6R4j08O4J04j2r7M0pl2J3m2Q6q5j6O1J06r2P2o2n0N2j1l0L7j8K3
1120A45O6j58K05q9j04J07O1j23J45j17n8M2m2P8r1J54j40KkP7j41J83n6j5o9k7J25j3r7J54
972B02j45j7R4K6Jj28R2k5j2P0MM5Qq8k2L9J65k0j7j14j03J5J50j17p7J00n6J14r1nJ83j44
$$ plain form
815 127 188 118 42 30 174 144 114 68 93 233 159 239 170 22 228 117 178 64 245 114 294 82 95 157 162 201 318 160 225 308
667 308 194 154 45 264 286 190 274 260 257 223 288 194 336 341 76 339 356 439 601 731 776 728 1610 5237 19346 24600 7027
534 7027 19202 24584 3097 1247 1046 770 456 549 505 304 340 412 342 271 204 408 200 111 396 157 184 157 175 273 124
411 124 101 345 40 176 108 173 185 229 135 39 230 61 204 224 115 49 208 82 134 40 98 79 120 266 28 265 71 135 45
268 45 118 93 126 11 303 267 195 325 91 214 180 163 139 40 64 98 289 241 116 170 41 83 165 93 102 215 281 56 47 110 22 111
111 111 213 29 114 120 171 66 83 132 104 180 94 174 82 79 117 76 134 98 116 132 184 166 90 154 86 138 151 118 236 176 61 180 13
-52 13 152 125 74 44 50 185 195 95 192 213 79 60 229 85 179 91 125 43 87 84 140 90 127 47 261 131 183 100 102 101 167 139 99 105
-219 105 75 79 75 164 38 236 238 261 290 177 209 145 232 167 131 251 148 116 44 111 283 187 296 176 73 56 88 79 20 19 218 52
$$ packed form
815A27O1p0p6j2J44l0l0m6K5J40p4Q0o9j48K06j11O1j14J81j31J80k12J3O2NL9J17j58O5Q3
667C08j14m0j09K19K2r6Q4j4ll4O5r4J42Nk65K63J7Q3J62J30M5m8Q82L627J4109N254j7573
534G027J2175N382k1487j850k01k76l14R3m4k01L6P2p0p1o7K04k08q9K85k39K7k7J8R8j49
411A24k3K44l05J36o8O5J2M4r4r6J91j69J43K0j09o6J59j26N2r4N8j9M1J46k38K37j94O4r0
268D5P3k5L3j15K92l6p2J30k34J23l4j7k4r9K4L4J91m8j25N4j29M2Q2p2RJ13O6k25rO3q8Q9
111A11J02j84Q5ON1j05J7M9k8P6q6Q0r2lL8m1N8l6J8J6N2j8p6O4o8N2J3l3J18o0j15J19j67
-52A3J39k7n1l0OJ35J0j00R7K1j34j9J69j44R4q8L4q2M4lN6n0L7q0K14j30N2q3KjO6k8m0O
-219A05l0MmQ9j26J98KK3K9j13L2o4Q7o5l6J20j03l2p2O7J72r6J09j20j03j7L2rn9jJ99j66
$$ plain form
-376 52 357 267 177 25 135 147 118 94 258 80 37 43 114 97 9 135 230 194 112 24 160 10 43 8 162 66 130 83
$$ packed form
-376E2L05r0r0j52J10J2k9k4J64j78m3OP1j7q8J26R5l6q2q8J36j50L3l5J54r6O4m7
-514H3
##PAGE=	F1=-1060.6
##FIRST=	4521.1594499999982872,	4521.1594499999982872,	0
##DATA TABLE=	(F2++(Y..Y)), PROFILE
$$ plain form
4521 189 60 20 69 37 139 52 56 114 224 85 85 180 78 155 179 91 130 253 211 19 97 162 56 180 208 90 119 93 156 89 76
4369 76 122 154 143 103 163 8 80 104 138 155 197 250 149 139 207 139 225 136 98 107 197 335 119 130 195 97 146 260 227 159 139 141 87 160
4201 160 265 208 143 62 173 67 93 50 216 75 246 145 84 133 169 205 108 65 130 149 127 157 53 49 200 48 347 190 21
4058 21 213 190 90 130 56 212 270 168 184 43 49 58 122 185 133 217 169 172 148 151 31 174 138 114 53 131 47 275 47 50 270 254 87
3896 87 190 228 212 166 203 122 185 200 17 30 106 29 121 72 27 157 84 97 147 113 126 122 83 62 164 87 125 183 169 264 227 97 34
3734 34 98 99 215 129 108 72 96 35 101 20 163 243 173 189 140 105 173 24 133 97 174 181 57 78 92 146 194 236 238 25 62 49 145 95
3566 95 76 109 107 163 199 116 96 27 96 27 114 85 295 125 242 185 166 120 76 114 128 202 115 100 161 41 42 120 153 93 142 13 85 187
3399 187 45 210 137 63 106 43 98 91 166 171 7 78 155 224 47 162 93 133 175 98 100 195 116 103 136 71 32 107 123 53 40 56 107 107
$$ packed form
4521A89j29m0M9l2J02q7MN8J10j39%R5j02P7K4q8L9J23m2j92P8O5j06J24K8j18K9k6O3o7j3
4369G6M6L2j1m0O0j55P2K4L4J7M2N3j01j0O8o8Q6q9l8RR0J38k16J1O5r8M9J14l3o8k0Kn4P3
4201A60J05n7o5q1J11j06K6m3J66j41J71j01o1M9L6L6r7m3O5J9k2L0j04mJ51j52K99j57j69
4058B1J92k3j00M0p4J56N8j02J6j41ORO4O3n2Q4m8Lk4Lj20J43l6k4o1P8q4K28k28LK20j6j67
3896H7J03L8j6m6L7q1O3J5j83J3P6p7R2m9m5J30p3J3N0l4J3ml9k1J02p7L8N8j4R5l7j30o3
3734C4O4JJ16q6k1l6K4o1O6q1J43Q0p0J6m9l5O8j49J09l6P7Pj24K1J4N4M8M2Kk13L7j3R6n0
3566I5j9L3kN6L6q3k0o9O9o9Q7k9K10j70J17n7j9m6m4L8J4P4q7j5O1j20JP8L3o0M9j29P2J02
3399A87j42J65p3p4M3o3N5pP5Nj64P1P7O9j77J15o9M0M2p7KR5p9j3L3o5l9P5J6p0j3J6N1%
$$ plain form
3232 107 97 45 123 119 139 69 159 72 124 45 146 39 133 303 122 225 103 18 344 731 637 971 446 190 121 113 108 176 118 134 143
3079 143 370 808 302 103 77 130 69 79 172 66 33 10 76 84 274 81 40 187 136 137 139 260 429 703 858 532 267 215 132
2936 132 180 10 105 89 172 36 35 164 212 169 175 229 224 428 305 127 55 157 46 54 58 61 118 141 22 67 74 123 221 284 125 78 87 139
2769 139 97 117 244 266 168 117 68 108 82 95 15 105 113 52 50 120 208 27 92 34 118 134 145 77 118 79 240 170 46 89 47 76 108 112
2602 112 36 185 176 93 186 164 76 110 111 257 80 97 129 211 155 132 117 177 74 93 164 93 216 181 105 129 145 192 103 96 173 169 160 154 25
2429 25 155 39 107 103 129 101 121 5 206 186 66 125 93 80 124 80 5 176 103 114 180 105 202 281 100 52 64 107 15 64 169 91
2272 91 47 87 52 133 88 129 194 148 196 168 172 63 153 150 256 185 64 76 20 94 111 132 141 72 87 98 177 126 11 184 95 57 108 31
2104 31 74 135 154 119 80 186 173 114 102 121 109 55 74 38 142 48 312 193 124 163 119 99 19 97 177 95 1085 2037 532 170 35
$$ packed form
3232A07j0n2P8mK0p0R0q7N2p9J01j07R4J70j81J03j22q5L26L87r4L34n25k56o9qnO8n8J6R
3079A43K27M38n06j99k6N3o1J0R3j06l3k3O6QJ90j93m1J47n1JKJ21J69K74J55l26k65n2q3
2936A32M8j70R5j6Q3j36jJ29M8m3ON4nK04j23j78p2J02j11QMLN7K3j19M5PM9R8O3j59m7RN2
2769A39m2K0J27K2r8n1m9M0k6J3q0R0Qo1kP0Q8j81O5n8Q4J6J1o8M1l9J61p0j24M3m2K9L2M
2602A12p6J49rq3R3k2q8L4JJ46j77J7L2Q2n6k3j5O0j03J9P1p1J23l5p6K4J6M7q9pP7mroj29
2429B5J30j16O8mK6k8K0j16K01k0j20N9l2j3M4m4p5J71p3J1O6p5R7P9j81m8J2M3r2M9J05p8
2272I1m4M0l5Q1m5M1O5m6M8k8Mj09R0lJ06p1j21J2n6P4J7K1Ro9J5J1P9n1j15J73q9l8N1p7
2104C1M3O1J9l5l9J06j3n9j2J9j2n4J9l6J04r4K64j19o9L9m4k0q0P8Q0q2R90R52j505l62j35
$$ plain form
1952 35 77 117 126 72 178 222 87 103 89 235 96 89 24 46 96 80 104 116 83 207 228 44 131 76 105 170 128 136 105 69 242 204 194
1789 194 33 248 266 523 541 394 183 246 182 309 473 568 897 725 1394 1578 5283 15218 16721 30624 22359 14704 6868
1676 6868 1767 901 564 536 182 433 92 227 55 99 343 187 182 65 177 81 13 84 165 147 18 132 176 101 146 103 64
1543 64 113 191 102 119 177 163 6 160 135 155 51 148 96 335 125 72 198 137 201 79 59 87 258 86 137 127 65 259 16 217
1396 217 81 134 214 124 203 31 56 84 126 146 148 569 787 490 120 139 82 11 149 151 130 177 134 100 129 95 219 187 103 59 160
1243 160 53 105 192 205 134 139 159 91 133 104 164 76 141 126 278 150 205 185 79 190 145 144 162 118 139 201 58 247 164 97 210 206
1085 206 84 274 119 109 118 81 155 84 204 85 53 55 169 35 169 173 117 84 88 111 99 69 251 64 61 101 164 206 41 139 156 144
928 144 156 84 179 239 115 113 115 307 299 319 179 90 87 211 64 28 152 99 206 86 85 297 122 249 99 53 66 163 189 139 70 82
$$ packed form
1952C5M2M0Rn4J06M4j35J6j4J46j39po5K2N0j6K4J2l3J24K1j84Q7n5K9O5m2Ql1l6J73l8j0
1789A94j61K15J8K57J8j47k11O3o4J27J64R5L29j72O69J84L705R935J503J3903q265p655p836
1676F868n101q66l37k8l54K51l41J35j72M4K44j56nj17J12r6o8P1Q1j8j29J14M4p5M5m3l9
1543F4M9P8q9J7N8j4j57J54k5K0j04R7n2K39k10n3J26o1O4j22k0K8J71j72N1j0o2J94k43K01
1396B17j36N3Q0r0P9j72K5K8M2K0KM21K18k97l70J9n7p1J38Kk1M7m3l4K9l4J24l2q4m4J01
1243A60j07N2Q7J3p1NK0o8M2k9O0q8O5j5J52j28N5k0j06J11m5jJ8m4K1O2j43J89q3o7J13m
1085B06j22J90j55j0Rl7P4p1J20j19l2KJ14j34J34Mn6l3MK3j2l0J82j87lM0O3M2j65R8J7j2
928A44J2p2R5O0j24kKJ92qK0j40q9lJ24j47l6J24n3J07j20jK12j75J27j50m6J3R7K6n0o9J2
$$ plain form
770 82 280 151 274 179 39 274 136 154 8 241 85 285 134 59 215 213 203 319 154 196 371 200 188 57 320 294 197
638 197 355 313 263 296 362 259 414 377 246 399 437 521 707 849 937 463 1042 3421 37587 36004 5992 38334 34671
524 34671 1131 1065 1066 802 441 615 616 339 379 503 379 474 193 488 261 158 450 162 182 180 176 264 141 134 364 20 234
391 234 120 176 267 259 93 75 296 110 231 212 52 39 221 86 117 87 101 55 172 272 32 257 64 123 55 162 123 104 25
249 25 295 253 182 328 70 196 152 188 122 59 67 75 258 188 144 166 29 85 198 90 109 236 291 101 31 100 26 109 237 70 113
96 113 71 148 102 126 131 105 203 141 194 114 56 100 76 106 61 125 118 181 153 81 203 139 143 104 103 253 162 54 204 32 205 167 117 43 78
-76 78 243 152 89 226 250 139 73 231 61 207 90 106 61 47 106 124 108 125 54 276 84 237 129 114 91 155 144 99 117 107
-224 107 73 23 149 73 253 241 272 281 228 217 152 251 180 115 267 193 176 71 131 276 183 280 133 74 130 74 43 29 39 160 81 375
$$ packed form
770H2J98j29J23r5j40K35j38J8j46K33j56K00j51p5J56kj0J16j65M2J75j71j2j31K63k6r7
638A97J58m2n0L3O6j03J55l7j31J53L8Q4J86J42Q8m74N79K379L4166j583l0012L2342l663
524C4671l3540o6Jk64l61J74Jk77M0J24j24R5k81K95k27j03K92k88K0kmQ8j23pK30l44K14
391B34j14N6R1qj66j8K21j86J21j9j60j3J82j35L1l0J4m6J17J00k40K25j93N9o8J07l9j9p9
249B5K70m2p1J46k58J26m4L6o6o3QQJ83p0m4K2j37N6J13j08J9J27N5j90p0O9p4Q3J28j67M3
96A13m2P7m6K4Nk6R8o2N3q0n8M4k4L0m5O4pO3k8p2J22o4Ml9jJ50r1j08J50j72J73l8n0p4L5
-76G8J65r1o3J37K4j11o6J58j70J46j17J6m5j4N9J8j6J7p1K22j92J53j08j5k3O4j1m5J8j0
-224A07l4n0J26p6J80j2L1Rn3j1o5R9p1o5J52p4j7j05O0J45r3R7j47n9N6n6l1j4J0J21p9K94
$$ plain form
-381 375 284 174 24 130 128 166 51 241 39 46 42 93 107 57 111 252 153 176 56 137 53 46 28 173 95 122 82
$$ packed form
-381C75r1j10j50J06kL8j15J90k02PmN1J4n0N4J41r9K3j20Q1q4pj8J45p8K7m0
-514H2
##PAGE=	F1=-1070.45
##FIRST=	4521.1594499999982872,	4521.1594499999982872,	0
##DATA TABLE=	(F2++(Y..Y)), PROFILE
$$ plain form
4521 107 128 70 143 14 163 99 149 163 153 151 67 227 60 183 110 124 92 304 133 37 46 234 117 198 176 46 71 82 176 55
4373 55 32 126 111 195 56 136 81 80 68 193 155 112 220 135 102 189 92 247 170 71 91 246 287 129 134 231 112 193 262 221 162 148 98
4211 98 100 146 280 223 168 74 116 59 89 99 232 75 224 166 99 129 218 237 139 48 174 80 141 155 66 31 191 64 297 199 11
4058 11 242 226 80 192 19 220 266 140 160 40 34 42 130 163 102 195 200 189 100 129 41 224 136 97 68 92 49 252 67 73 284 187
3901 187 75 206 176 187 210 184 152 178 204 51 61 100 61 155 89 70 148 123 108 168 153 127 151 66 84 176 64 129 162 200 238 201 91
3739 91 74 96 146 216 157 122 79 97 62 93 70 162 226 179 236 175 114 162 40 162 80 179 132 98 89 124 140 193 246 213 19 88 71 171
3571 171 86 79 113 119 123 172 112 87 29 129 36 100 107 290 151 226 125 180 124 70 106 136 167 122 105 163 43 19 95 95 97 138 39 29 183
3399 183 16 210 163 59 124 21 132 107 166 170 53 24 165 212 47 135 102 137 148 108 131 216 104 112 117 53 36 78 80 48 16 42
$$ packed form
4521A07K1n8P3j29J49o4N0J4j0kq4J60j67J23p3J4l2K12j71r6RJ88j17Q1k2j30K5J1R4j21
4373E5k3R4j5Q4j39Q0n5jj2J25l8m3J08q5l3Q7r7J55p7r9K0J55M1j58NR7j19Q1O9m1n9j4n0
4211I8KM6J34n7n5r4M2n7L0J0J33j57J49n8o7L0Q9J9r8r1J26r4O1J4q9l5J60j27K33r8j88
4058A1K31j6j46J12j73K01M6j26K0j20oQQ8L3o1R3Nj1q9K9q8J83q8l9k9K4m3K03j85OK11r7
3901A87j12J31l0J1K3k6l2K6K6j53J0L9l9R4o6j9P8k5j5O0j5k6K4q5J8R2j12O5L3L8L8l7j10
3739I1j7K2N0P0n9l5m3J8l5L1k3R2O4m7N7o1o1M8j22J22q2R9m7l4rL5J6N3N3l3j94O9j7J00
3571A71q5pL4OMM9o0k5n8J00r3O4PJ83j39P5j01N5n6n4L6L0L1m5j7N8j20k4P6%KM1r9j0J54
3399A83j67J94m7j04O5j03J11k5N9Mj17k9J41M7j65Q8l3L5J1m0K3Q5j12QNo4j7M2Kl2l2K6
$$ plain form
3241 42 127 127 115 58 140 85 139 68 163 52 92 29 90 27 110 264 117 212 126 8 347 584 552 977 433 180 138 107 99 203 101
3089 101 167 134 404 886 351 71 77 126 57 64 176 77 40 19 86 67 223 15 25 168 114 131 158 243 412 690 828 528 250
2946 250 190 120 188 57 98 129 183 22 19 177 229 211 217 276 245 376 270 100 42 138 38 112 45 112 146 132 19 33 78 97 181 239
2789 239 135 84 100 142 136 107 197 270 174 133 50 149 75 104 59 129 105 33 75 69 220 77 89 48 130 132 165 118 108 87 218 157 42 82
2621 82 72 62 105 142 48 184 138 88 203 147 71 102 79 247 115 136 147 254 145 116 166 195 108 111 153 42 165 176 139 151 197 183
2464 183 102 74 164 180 164 156 33 131 53 61 113 156 95 162 15 230 225 48 84 87 74 96 92 38 189 144 109 195 119 182 267 125 79 87 122
2291 122 15 63 173 161 62 101 72 104 42 200 235 178 200 196 206 6 117 190 257 186 107 67 41 99 148 83 125 73 102 104 172 138 22
2129 22 201 91 79 120 22 61 134 192 129 44 144 120 80 100 131 144 50 37 57 111 67 326 224 100 164 99 115 76 75 161 15 610
$$ packed form
3241D2Q5%j2n7Q2n5N4p1R5j11M0o3O1o3Q3J54j47R5q6j18L39K37l2M25n44k53m2l1qJ04j02
3089A01O6l3K70M82n35k80OM9o9PJ12r9l7k1O7j9J56k08J0J43n4J7K7Q5J69K78J38l00k78
2946B50o0p0O8j31M1L1N4j61lJ58N2j8ON9l1J31j06j70n8R6j00P4o7O7L4j4j13J4M5J9Q4N8
2789B39j04n1J6M2ok9R0P3r6m1q3R9p4K9m5P0k4p2M2oJ51j43J2m1Q2KL3m7j0k1J31o1j15M0
2621H2j0j0M3L7r4J36m6n0J15n6p6L1k3J68j32K1J1J07j09k9N0K9q7LM2j11J23J1l7J2M6j4
2464A83q1k8R0J6j6qj23R8p8QN2M3o1O7j47K15nj77L6Lj3K2mn4J51m5l5Q6p6O3Q5j42m6QL5
2291A22j07M8J10j2r9L9k9L2o2J58L5n7K2mJ0k00J11P3O7p1p9m0k6N8M9o5M2n2K9KO8l4j16
2129B2J79j10j2M1r8L9P3N8o3q5J00k4m0K0L1J3r4j3K0N4m4K59j02j24O4o5J6l9jQ6j46N95
$$ plain form
1971 610 1364 474 88 96 58 108 140 88 125 209 101 102 99 239 116 94 61 61 102 145 139 129 105 195 265 61 100 34 91 161 165 183 65 96
1804 96 183 249 206 8 203 267 487 514 342 328 224 66 94 460 734 1206 1384 2575 3145 12613 10251 25239 17890 6454
1686 6454 9966 5561 2671 1338 713 748 388 378 189 236 145 131 340 209 161 52 248 87 33 132 154 107 65 149 229 105
1558 105 97 97 81 151 213 106 125 163 132 29 136 156 169 68 146 123 343 88 130 213 163 212 58 35 44 229 104 131 146 57 216
1405 216 45 167 111 148 252 148 177 46 52 61 166 150 142 392 623 492 118 146 88 9 152 197 79 192 142 46 109 106 202 172
1258 172 97 50 178 66 111 204 193 155 148 170 110 130 127 166 84 222 149 315 168 193 219 49 223 164 172 162 125 113 190 75 205 171
1100 171 116 251 179 45 302 103 142 120 101 142 95 190 104 14 14 177 75 128 203 111 105 147 67 47 92 293 93 90 101 139 246 80
943 80 125 221 182 153 49 142 269 121 93 89 275 309 355 215 111 120 214 30 83 172 124 227 80 113 314 104 318 99 53 143
$$ packed form
1971F10P54q90l86Ql8N0L2n2L7Q4j08JlJ40j23k2l3%M1M3oj0k4R0P0k04L9o6N7P0MJ8j18L1
1804I6Q7O6m3j98J95O4K20K7j72j4j04j58K8L66K74M72J78J191N70R468k362J4988p349j1436
1686F454L512m405k890j333o25L5l60j0j89M7r1j4K09j31m8j09J96j61n4R9K2m7m2Q4Q0j24
1558A05q%j6P0O2j07J9L8l1j03J07K0J3j01P8k3K20k55M2Q3n0M9j54k3RJ85j25K7J5q9J59
1405B16j71J22n6L7J04j04K9j31ORJ05j6qK50K31j31l74K8n8p9J43M5j18J13n0r6O3lR6l0
1258A72p5m7J28j12M5R3j1l8pK2o0K0lL9q2J38p3J66j47K5K6j70J74n9Qj0l7j2P7j15J30l4
1100A71n5J35p2j34K57j99L9k2j9M1m7R5q6r0%J63j02N3P5r2oM2q0k0M5K01k00lJ1L8J07j66
943H0M5R6l9k9j04R3J27j48k8mJ86L4M6j40j04RR4j84N3Q9m8J03j47L3K01k10K14k19m6R0
$$ plain form
795 143 148 251 185 66 90 310 159 320 209 43 302 190 164 77 263 39 300 209 59 258 307 193 348 153 213 418 258
662 258 239 97 383 345 245 416 402 337 391 505 421 461 511 547 531 634 711 899 1020 1149 353 426 907 71868 63231 5131
534 5131 74558 58047 3748 1549 1205 900 466 743 724 446 440 730 463 835 236 634 330 306 534 219 223 225 252 272
416 272 130 179 394 71 299 149 232 337 332 101 105 382 119 262 235 90 64 215 132 121 161 131 51 240 291 88 257 70
278 70 127 74 187 157 98 58 245 248 161 343 87 191 152 204 114 74 80 93 208 145 183 135 43 76 227 68 127 255 304 153 26
126 26 103 33 114 272 86 104 33 139 124 180 118 85 217 195 208 138 45 74 98 70 48 147 65 185 125 87 241 173 167 51 86 245
-32 245 138 57 225 65 265 165 163 60 87 295 88 91 257 280 181 78 216 75 207 90 164 95 26 130 103 136 138 63 277
-175 277 31 257 159 113 94 131 180 105 99 159 126 74 144 124 263 243 277 276 254 205 149 276 177 99 284 230 229 111 133 258 169 246 89
$$ packed form
795A43NJ03o6j19K4K20j51J61j11j66K59j12k6q7J86k24K61r1j50J99M9j14J55j95O0K05j60
662B58j9j42K86l8j00J71j4o5N4J14q4M0N0L6j6J03P7J88J21J29p96P3M81P0961q637n8100
534E131O9427j6511n4299k199l44l05m34K77j9k78oK90k67L72n99L98l04k4K28l15MKK7K0
416B72j42M9K15l23K28j50Q3J05nk31MK77k63J43k7j45k6J51q3j1M0l0q0J89N1k03J69j87
278G0N7n3J13l0n9m0J87Lq7J82k56J04l9N2r0m0OJ3J15o3L8m8r2L3J51j59N9J28M9j51j27
126B6P7p0Q1J58j86J8p1J06j5N6o2l3J32k2J3p0r3K9K4k8k2R9q2J20o0l8J54o8oj16L5J59
-32B45j07q1J68j60K00j00kj03K7K08k07LJ66K3r9j03J38j41J32j17P4o9o9J04k7L3Kp5K14
-175B77k46K26r8m6j9L7M9p5oO0l3n2P0k0J39k0L4jk2m9n6J27r9p8J85n4jj18K2J25q9P7j57
$$ plain form
-337 89 54 201 66 25 58 77 87 138 388 260 209 43 124 97 205 7 191 43 37 74 120 126 134 93 276 78 263 111 89 107
-485 107 72 80 163 116 115 122
$$ packed form
-337H9l5J47j35m1L3J9J0N1K50j28n1j66Q1k7J08j98J84j48oL7M6OQm1J83j98J85j52k2J8
-485A07l5QQ3m7jP
-514A22
##PAGE=	F1=-1080.29
##FIRST=	4521.1594499999982872,	4521.1594499999982872,	0
##DATA TABLE=	(F2++(Y..Y)), PROFILE
$$ plain form
4521 23 226 156 251 103 235 176 260 208 112 235 52 262 9 221 89 169 31 374 58 104 75 315 190 233 120 50 91 76
4383 76 200 49 30 148 41 258 95 137 160 85 38 256 153 40 183 145 101 201 56 258 209 105 72 320 226 170 130 257
4246 257 122 243 255 199 139 173 60 134 128 286 254 186 90 78 52 75 174 229 103 198 174 113 98 276 263 190 54 219 18 157
4098 157 156 84 46 160 71 243 212 28 268 246 49 257 14 231 247 97 168 21 53 30 146 134 90 155 220 222 76 99 61 269
3950 269 137 78 81 62 70 208 75 82 299 107 52 227 108 165 265 155 168 168 196 100 85 89 102 178 102 126 129 173 126 173 197 118 177
3788 177 43 109 171 38 129 116 222 193 175 136 107 96 197 195 181 145 81 86 94 90 144 183 179 169 282 203 133 130 59 191 61 161 77 141
3620 141 109 166 132 177 247 184 49 106 87 198 87 99 113 118 87 136 106 79 88 156 77 73 135 273 178 199 51 189 140 67 81 136 120
3458 120 146 120 165 50 4 86 61 106 128 60 42 173 4 203 181 66 151 11 154 138 153 161 107 33 163 189 49 99 106 146 117
$$ packed form
4521B3K03p0R5j48J32n9Q4n2r6J23j83K10k53K12j32Q0j38L43l16M6k9K40j25M3j13p0M1j5
4383G6J24j51j9J18j07K17j63M2K3p5m7K18j03j13J43l8m4J00j45K02m9j04l3K48r4n6m0J27
4246B57j35J21J2n6o0L4j13P4oJ58l2o8r6j2k6K3R9N5j26R5k4o1j5J78j3p3j36J65k01J39
4098A57jp2l8J14q9J72l1j84K40k2j97K08k43K17J6j50P1j47L2k3J16j2m4O5O5Kj46K3l8K08
3950B69j32n9Lj9QJ38j33PK17j92n5J75j19N7J00j10J3%K8r6j5MJ3P6p6K4LM4m7M7K4p9N9
3788A77j34O6O2j33R1j3J06k9j8l9k9j1J01kj4l6o4NQmN4L9mj0J13p9p0lp1J32j30J00q4O4
3620A41l2N7l4M5P0o3j35N7j9J11j11J2J4Nl1M9l0k7RO8p9mO2J38r5K1j48J38m9p3J4N5j6
3458A20K6k6M5j15m6Q2k5M5K2o8j8J31j69J99k2j15Q5j40J43j6J5Qn4p4J30K6j40N0PM0k9
$$ plain form
3305 117 111 151 242 86 122 92 60 46 58 39 32 26 17 151 142 145 101 137 86 136 61 161 46 55 66 28 27 84 224 101 183 149 27 351 400
3133 400 429 911 379 160 144 103 80 217 98 183 131 399 851 351 98 74 133 52 79 207 86 36 30 90 49 179 76 49 143
2990 143 78 137 184 220 395 665 728 491 201 150 95 173 134 105 161 211 32 60 181 242 248 254 302 243 311 213 67 37 94 33 181 62
2833 62 156 179 113 26 42 68 61 139 183 143 91 106 159 173 113 134 273 167 148 56 187 68 109 91 156 111 80 83 21 225 144 88 71 134
2665 134 119 161 160 81 95 206 137 65 96 95 55 106 179 60 184 103 112 203 129 74 107 38 254 144 171 150 292 104 91 213 195 141
2508 141 118 141 26 109 175 160 153 247 162 92 68 152 188 178 150 81 99 57 29 105 176 80 192 31 246 261 28 56 87 76 67 142 74
2346 74 185 174 92 209 126 155 225 160 101 111 135 10 58 173 220 113 117 92 74 20 275 256 204 213 223 245 46 108 216 238 168 143
2188 143 62 68 111 168 54 118 114 119 116 141 148 34 215 79 91 143 32 64 124 225 129 34 109 84 44 95 141 177 40 20 141 75 87
$$ packed form
3305A17oM0R1j56L6l0l2j4J2j9porJ34rLm4L6n1N0p5J00j15RJ1l8jN7J40j23Q2l4j22L24M9
3133D00K9M82n32k19j6m1k3J37j19Q5n2K68M52n00k53k4N9q1K7J28j21n0oO0m1J30j03k7R4
2990A43o5N9M7L6J75K70O3k37k90n1n5P8l9k9N6N0j79K8J21O1OOM8n9O8r8j46l0N7o1J48j19
2833F2R4K3o6q7J6K6pP8M4m0n2J5N3J4o0K1J39j06j9r2J31j19M1j8O5m5l1Lo2K04q1n6j7O3
2665A34j5M2jp9J4J11o9p2L1jm0N1P3j19J24q1RR1p4n5L3o9K16j10K7k1J42j88j3J22j8n4
2508A41k3K3j15Q3O6j5pR4q5p0k4Q4L6j0k8o9J8m2k8P6P1r6J12j61K15J5k33K8L1j1rP5o8
2346G4J11j1q2J17q3K9P0o5n9J0K4j25M8J15M7j07Mk5j8n4K55j9n2RJ0K2j99O2J08K2p0k5
2188A43q1OM3N7j14O4mNlK5Pj14J81j36J2N2j11L2O0J01r6r5P5k5m0N1M6L6j37k0J21o6J2
$$ plain form
2026 87 318 259 93 176 76 132 120 94 197 72 332 1069 563 14 175 39 113 147 85 80 161 110 106 132 219 141 106 101 62 112 216
1873 216 196 156 114 170 299 70 76 54 137 146 197 243 42 143 94 298 220 51 147 289 531 479 364 551 387 349 276 741 1062
1730 1062 1711 2319 4242 6014 24528 12486 71266 29355 52341 8069 13938 5043 2477 1459 1229 828 492
1647 492 498 408 361 351 388 281 190 121 320 121 82 186 152 56 129 140 276 82 38 117 117 190 228 117 123 149 110 60 104 166 193 80
1489 80 151 153 337 94 195 225 185 217 36 29 4 194 126 134 157 52 179 68 99 136 172 256 160 148 69 46 38 217 125 108 172 553
1332 553 462 117 155 103 31 148 237 50 196 158 40 83 133 186 143 93 35 213 68 112 233 163 161 158 161 157 101 143 166 99 293 156
1174 156 334 184 173 240 50 233 188 178 137 143 80 183 108 140 191 105 291 166 14 329 94 176 134 138 110 110 183 146 28 45 184
1021 184 133 81 230 127 108 199 34 14 97 330 140 131 146 80 278 136 78 285 191 157 107 93 299 152 40 77 221 323 388
$$ packed form
2026H7K31n9j66Q3j00N6j2k6J03j25K60P37n06n49J61j36P4L4o2nQ1n1mK6Q7p8l5nl9N0J04
1873B16k0m0m2N6J29k29Ok2Q3RN1M6k01J01m9K04p8j69R6J42K42n2j15J87j64l8p3M65L21
1730A062O49O08J923J772J8514j2042N8780m1911K2986m4272N869q895k566j018k30m01l36
1647D92Or0m7j0L7j07r1o9J99j99l9J04l4r6P3J1J36j94m4P9%P3L8j11OK6l9n0M4O2K7j13
1489H0P1KJ84k43J01L0m0L2j81pk5J90o8QK3j05J27j11L1L7L6Q4r6j2p9k3qJ79r2j7O4L81
1332E53r1l45L8n2p2J17Q9j87J46l8j18M3N0N3m3n0n8J78j45M4J21p0klLmn6M2K3o7J94j37
1174A56J78j50j1O7j90J83m5j0m1Oo3J03p5L2N1q6J86j25j52L15k35Q2m2Mk8%P3l7j18J7J39
1021A84n1n2J49j03j9R1j65k0Q3K33j90rJ5o6J98j42n8K07r4l4n0j4K06j47j12L7J44J02O5
$$ plain form
879 388 271 120 170 236 23 137 186 155 244 72 146 319 91 393 126 75 238 120 321 250 84 115 319 186 367 266 102
746 102 316 276 216 185 319 81 339 311 117 284 434 171 407 172 285 442 379 318 184 473 454 339 474 521 477 503 705
613 705 667 573 746 987 722 948 985 1163 1220 1320 335 876 3033 121830 112584 5177 127672 101584 9327 2613
514 2613 1418 997 502 915 848 667 502 1194 623 1327 403 846 446 518 653 315 312 312 346 301 189 242 452 202 382 225
387 225 344 400 444 165 132 476 81 294 268 220 128 198 229 149 270 181 120 317 326 167 267 103 148 76 192 197 128 129 175 262 136
234 136 376 158 203 199 212 122 91 105 128 144 129 231 83 91 90 259 18 158 275 316 200 47 109 33 128 320 74 78 70 177 154
81 154 239 111 74 217 244 215 146 55 45 120 20 66 186 26 204 100 110 269 186 205 54 74 208 98 81 241 92 334 116
-61 116 210 96 104 336 67 90 280 298 198 79 179 137 172 113 239 150 99 151 106 173 165 71 257 66 237 184 94 114 146 226 125
$$ packed form
879C88j17j51N0O6k13J14M9l1Q9j72P4J73k28L02k67n1J63j18K01p1j66L1K04j33J81j01j64
746A02K14m0o0l1J34k38K58k8j94J67J50k63K36k35J13J57o3o1j34K89j9j15J35M7m4K6K02
613G05l8r4J73K41k65K26L7J78N7J00r85N41K157J18797r246j07407J22495k6088r2257o714
514B613j195m21m95M13o7j81j65O92n71P04r24M43m00P2J35l38l%L4m5j12N3K10k50J80j57
387B25J19N6M4k79l3L44l95K13k6m8r2P0L1q0J21q9o1J97Rj59J00j64M5p2J16No9JM6Q7j26
234A36K40k18M5mJ3r0l1J4K3J6j5J02j48QjJ69k41J40J17M1j16j53O2p6R5J92k46MqJ07k3
81A54Q5j28l7J43K7k9o9r1j0P5j00M6J20j60J78j04J0J59q3J9j51K0J34j10j7J60j49K42k18
-61A16R4j14QK32k69K3J90J8j00j19J00m2L5n9J26q9n1N2m5O7qr4J86j91J71n3r0K0L2Q0j01
$$ plain form
-214 125 49 228 197 134 154 185 261 245 268 282 247 180 152 314 158 103 321 259 268 162 122 237 155 200 85 55 255 75 99 121 137
-367 137 68 213 404 200 279 78 120 86 230 35 119 112 56 143 210 149 238 149 317 37 362 179 51 168 135 149 139 141 162 199
$$ packed form
-214A25p6J79l1o3K0L1P6j6K3J4l5o7k8J62j56n5K18o2Rj06m0J15q2M5j15l0K00j80K4K2J6
-367A37o9J45J91k04P9k01M2l4J44j95Q4pn6Q7O7o1Q9q9J68k80L25j83j28J17l3J4j0KK1L7
-514A99
##PAGE=	F1=-1090.14
##FIRST=	4521.1594499999982872,	4521.1594499999982872,	0
##DATA TABLE=	(F2++(Y..Y)), PROFILE
$$ plain form
4521 186 343 279 380 224 359 273 375 261 173 327 89 288 84 274 200 234 145 455 146 197 186 395 261 288 49 99 184
4388 184 81 227 112 108 194 56 328 190 191 233 113 81 309 145 103 158 138 133 254 110 260 255 192 60 407 177 232 114 273
4246 273 125 291 243 161 101 218 93 186 138 285 300 198 110 105 76 52 245 204 144 181 172 127 70 339 279 259 87 260 127 164
4098 164 160 101 82 107 64 220 228 55 293 244 5 317 51 244 218 45 183 36 84 27 166 113 106 119 229 274 134 65 88 300
3950 300 145 76 95 71 105 164 78 81 312 45 17 247 59 151 322 123 170 158 174 146 90 81 147 191 107 188 99 228 151 160 233 101
3793 101 190 20 130 149 15 140 84 237 131 170 209 123 98 242 157 200 163 84 65 125 86 217 208 108 141 331 219 164 80 81
3645 81 216 48 121 40 183 131 214 128 148 249 167 99 111 93 221 110 134 121 105 55 100 101 71 161 173 123 44 165 254 201 166 27
3487 27 191 165 61 44 122 81 189 159 171 73 28 97 83 124 115 74 68 155 17 188 191 91 190 44 166 182 122 147 155 80 149 161 56
$$ packed form
4521A86J57o4J01j56J35q6J02j14q8J54k38J99k04J90p4L4q9L10l09N1j1K09j34K7k39N0Q5
4388A84j03J46j15mQ6j38K72j38JM2j20l2K28j64m2N5k0nJ21j44J50no3j32L47k30N5j18J59
4246B73j48J66m8q2o0J17j25R3m8J47J5j02q8nk9k4J93m1o0L7rm5n7K69o0k0j72J73j33L7
4098A64mn9j9K5m3J56Qj73K38m9k39L12k66J93k6j73J38j47M8n7J39n3pJ3J10M5j40o9K3K12
3950C00j55o9J9k4L4N9q6LK31k67k8K30j88R2J71j99M7j2J6k8n6rO6M4q4Q1q9J29p7RP3j32
3793A01Q9j70J10J9j34J25n6J53j06L9L9q6k5J44q5M3l7p9j9O0l9J31rj00L3J90j12n5q4J
3645H1J35j68P3q1J43n2Q3q6K0J01q2o8J2j8J28j11K4j3j6n0M5Jl0R0J2n0p9J21Q9n3l5j39
3487B7J64k6j04j7P8m1J08l0J2r8m5O9j4M1rm1oQ7j38J71Lj00R9j46J22J6o0K5Qp5O9J2j05
$$ plain form
3325 56 61 105 165 118 109 169 266 73 142 63 103 57 47 27 21 63 43 177 142 178 140 123 119 132 49 158 78 17 109 33 34 69 193 83 149
3153 149 169 39 355 211 289 777 288 136 137 99 52 218 121 177 133 351 697 301 169 70 147 71 102 249 94 21 45 85 40
3010 40 161 147 95 120 39 161 207 190 390 648 592 443 128 124 58 134 211 122 168 243 40 108 176 251 272 284 306 216 248 143 66 53
2853 53 35 32 253 71 186 209 90 29 94 48 27 102 122 146 100 112 197 204 123 64 280 150 167 78 213 68 109 96 178 127 133 73 67
2690 67 229 205 81 104 124 97 135 194 44 102 205 129 102 149 118 53 109 218 65 188 73 140 190 123 104 112 12 280 167 196
2542 196 136 317 31 69 253 175 161 108 123 45 63 186 162 132 289 131 74 92 140 192 200 137 127 65 50 69 77 187 71 212 51
2390 51 254 290 9 79 98 85 36 193 106 161 190 75 218 125 127 159 193 115 139 142 14 46 165 261 156 133 109 84 46 345 254 223
2232 223 237 251 279 81 130 224 200 138 171 56 94 130 167 88 122 173 141 125 83 151 56 219 63 85 163 40 77 108 253 125 101
$$ packed form
3325E6NM4O0m7rO0R7j93O9p9M0m6j0k0oM2k0J34l5L6l8j7mJ3q3J09q0o1R2p6JL5J24j10O6
3153A49K0j30L16j44P8M88m89j52Jl8m7J66r7N6m4K18L46l96j32r9P7p6L1J47j55p3K4M0m5
3010D0J21j4n2K5q1J22M6j7K00K58n6j49l15mo6P6P7q9M6P5k03O8O8P5K1J2K2r0L2j05p7j3
2853E3j8lK21j82J15K3j19o1O5m6k1P5K0K4m6J2Q5Pq1n9K16j30J7q9J35j45M1j3Q2n1Oo0o
2690F7J62k4j24K3K0k7L8N9j50N8J03p6k7M7l1o5N6J09j53J23j15O7N0o7j9Qj00K68j13K9
2542A96o0J81k86L8J84p8j4n3J5p8J8J23k4l0J57j58n7J8M8N2Qo3j0o2j5J9QJ10j16J41j61
2390E1K03L6k81P0J9j3m9J57q7N5K9j15J43r3KL2L4p8K4Lj28L2J19R6j05k3k4k5l8K99r1l1
2232B23J4J4K8j98M9R4k4o2L3j15L8L6L7p9L4N1l2j6m2O8r5J63j56K2P8j23L7L1J45j28k4
$$ plain form
2080 101 96 76 32 92 149 204 27 45 218 37 104 290 294 97 198 66 141 154 128 257 103 321 827 495 31 219 43 141
1942 141 151 67 47 114 113 119 186 184 165 123 142 58 123 280 263 197 113 144 330 85 116 110 229 159 226 307 141 195 26 345 237 97
1784 97 102 337 617 414 384 808 681 740 754 1271 1600 2425 3479 6260 9773 40161 25459 136239 67010 116663 17023
1681 17023 28535 8659 4250 2654 1969 1447 898 927 737 635 630 504 394 312 246 392 173 160 239 171 80 186 122 308
1563 308 49 49 168 178 222 239 138 109 138 105 93 70 148 228 88 162 197 318 119 256 238 201 221 22 43 34 159 156 151 160 60 155
1405 155 75 41 152 196 226 157 123 95 47 15 246 93 58 42 574 379 123 169 139 74 141 269 68 188 181 119 61 175 169 101 111
1253 111 25 266 58 107 259 116 152 168 132 216 49 168 164 125 349 136 341 201 151 245 111 216 217 161 93 170 97 185 155 70
1105 70 222 58 329 172 59 345 90 207 164 187 61 145 185 209 71 111 195 208 32 248 168 90 237 32 46 76 366 204
$$ packed form
2080A01nk0m4O0N7N5j77J8J73j81O7J86Mj97J01j32P5J3k6J29j54K18N06l32m64J88j76R8
1942A41J0q4k0O7jOO7kj9m2J9q4O5J57j7o6q4L1J86k45L1oJ19p0O7Q1j66N4j69L19j08j40
1784I7NK35K80k03l0M24j27N9J4N17L29Q25J054K781L513L0388j4702J10780o9229M9653r9640
1681A7023J1512j9876m409j596o85n22n49K9j90j02nj26j10q2o6J46k19j3P9o8r1J06o4J86
1563C08k59%J19J0M4J7j01k9K9l3j2k3P8Q0j40P4L5J21j99J37j8l7K0j99K1rJ25lnRj00R5
1405A55q0l4J11M4L0o9l4k8m8l2K31j53l5j6N32j95k56M6l0o5O7J28k01J20po2n8J14oo8J0
1253A11q6K41k08M9J52j43L6J6l6Q4j67J19ml9K24k13K05j40n0R4j34J05Jn6o8P7p3Q8l0q5
1105G0J52j64K71j57j13K86k55J17m3K3j26Q4M0K4j38M0Q4J3j76K16q0p8J47k05J4L0K90j62
$$ plain form
967 204 189 205 21 303 199 12 340 178 174 160 35 322 208 45 89 182 344 424 347 126 234 272 68 196 192 203 254 96
830 96 186 319 134 470 183 133 346 106 387 328 136 159 313 230 406 354 209 335 389 310 317 410 195 399 434 213 309 576
692 576 171 494 260 406 457 551 442 326 611 616 492 563 678 671 650 958 1006 880 1087 1568 955 1371 1337 1504 1455 1426 259
559 259 1938 7226 185576 181612 7504 195681 163751 16243 3964 1642 1055 626 1147 1056 1020 554 1890
475 1890 887 1923 682 1111 648 770 809 445 455 453 449 356 358 358 551 387 500 352 493 468 582 254 177 567 66 333 298
342 298 374 232 199 374 207 410 260 219 395 377 256 285 172 177 85 202 247 202 239 175 299 130 433 242 227 271 217 136 125
199 125 145 166 92 152 291 88 172 153 301 64 197 296 323 234 72 126 26 152 383 67 71 133 263 212 297 134 116 202 280 216
52 216 135 87 45 146 46 116 242 143 241 115 144 287 181 244 99 69 146 44 131 252 124 410 27 257 148 163 360 147
$$ packed form
967B04j5J6j84K82j04j87L28j62mj4j25K87j14j63M4R3J62Q0p7k21J08L8k04J28mJ1N1j58
830I6R0J33j85L36k87n0K13k40K81n9j92K3J54q3J76n2j45J26N4p9PR3k15K04L5k21R6K67
692E76m05L23k34J46N1R4j09j16K85Nj24P1J15pk1L08M8j26K07M81o13M16l4J67m9k9j167
559B59J679N288J78350l964j74108J88177l1930j47508j2279k322n87m29N21r1l6m66J336
475A890j003J036j241M29m63J22L9l64J0kmr3K%J93j64J13j48J41k5J14l28p7L90n01K67l5
342B98P6j42l3J75j67K03j50m1J76j8j21K9j13Nr2J17M5m5L7o4J24j69L03j91j5M4n4q1j1
199A25K0K1p4O0J39k03Q4j9J48k37J33R9K7q9j62N4j00J26K31l16MO2J30n1Q5j63j8Q6P8o4
52B16q1m8m2J01j00P0J26r9R8j26K9J43j06O3j45l0P7j02Q7J21j28K86l83K30j09J5J97k13
$$ plain form
-86 147 81 292 306 186 79 117 223 108 169 304 224 181 168 158 214 198 80 215 127 183 206 61 150 231 275 162 43 301 268
-229 268 184 174 248 245 247 241 300 214 154 192 366 135 145 390 284 293 219 121 219 156 156 125 127 282 125 193 216 219 161 302 423 129 366
-391 366 127 121 129 248 65 103 198 141 246 335 194 361 259 382 165 464 251 129 233 240 231 149 199 272 310
$$ packed form
-86A47o6K11J4j20j07L8J06j15O1J35q0m3j3j0N6j6j18J35q8N6K3j45Q9Q1M4j13j19K58l3
-229B68q4j0P4lKoN9q6o0L8J74k31J0K45j06Rp4r8R8o3%l1KJ55j57O8K3Ln8J41J21k94K37
-391C66k39oQJ19j83L8R5n7J05Q9j41J67j02J23k17K99k13j22J04Prq2N0P3L8
-514C10
##PAGE=	F1=-1099.98
##FIRST=	4521.1594499999982872,	4521.1594499999982872,	0
##DATA TABLE=	(F2++(Y..Y)), PROFILE
$$ plain form
4521 369 464 435 515 362 515 376 481 327 279 411 172 320 203 340 350 320 312 540 281 306 313 465 320 356 69 148 296 109
4383 109 258 199 196 266 165 402 291 280 292 165 150 340 135 180 167 99 177 335 208 260 306 290 79 489 170 296 87 278
4246 278 120 336 233 114 101 276 178 247 194 284 350 207 136 155 123 42 300 156 186 193 169 142 134 400 284 339 123 291 232 153
4098 153 159 113 121 43 45 247 249 89 315 229 60 367 97 253 187 11 181 93 111 36 199 115 144 129 230 335 216 49 120 311
3950 311 158 95 114 114 145 158 88 92 321 96 35 265 97 149 368 92 161 151 139 186 75 98 191 199 121 244 56 277 177 141
3803 141 253 77 182 31 142 111 19 173 135 246 69 197 281 118 100 276 108 211 167 88 47 155 75 280 226 49 95
3670 95 380 221 200 36 102 232 46 66 71 223 155 260 132 112 259 174 158 107 90 237 149 175 140 78 31 91 104 64 238 183
3522 183 163 44 195 250 216 138 92 188 193 54 16 91 93 240 216 182 108 66 115 124 147 103 86 73 135 25 167 196 129 239 80 169
$$ packed form
4521C69R5k9Q0j53J53j39J05j54m8J32k39J48j17J37J0l0qK28k59K5PJ52j45L6k87P9J48j87
4383A09J49n9lP0j01K37j11j1J2j27j5J90k05M5j3o8P8J58j27N2M6j6k11M10l19J26k09J91
4246B78j58K16j03j19j3J75r8O9n3R0O6j43p1J9l2q1K58j44L0Pk4k7qK66j16N5k16J68n9p9
4098A53Om6Qp8KK02Kj60K26q6j69L07k70J56o6j76J70q8J8p5J63q4K9j5J01J05j19j67P1J91
3950C11j53o3J9%L1J3p0MK29k25o1K30j68N2K19k76O9j0j2M7j11K3R3Qp8J23j88K21j00l6
3803A41J12j76J05j51J11l1r2J54l8J11j77J28Q4j63j8J76j68J03m4p9m1J08q0K05n4j77M6
3670I5K85j59k1j64O6J30j86K0NJ52o8J05j28k0J47q5j6n1j7J47q8K6l5o2m7O0J3m0J74n5
3522A83k0j19J51N5l4p8m6R6Nj39l8P5KJ47k4l4p4m2M9RK3m4j7j3O2j10J42K9o7J10j59Q9
$$ plain form
3364 169 228 76 130 185 105 126 130 70 50 101 192 165 100 198 285 72 173 35 153 65 36 54 46 98 96 199 124 210 166 132 160 126 41
3202 41 165 125 31 142 90 36 78 179 83 126 187 50 359 106 182 600 179 110 118 95 16 210 160 154 139 264 449 210 246 66
3054 66 164 101 115 285 99 22 63 75 51 173 199 147 108 54 193 218 153 403 651 505 415 88 141 13 75 279 142 151 270 41
2907 41 154 160 258 276 305 296 171 206 75 109 75 58 42 319 62 195 227 83 25 140 22 40 77 77 141 113 132 246 229 126 27
2754 27 290 133 190 102 225 76 105 76 188 147 178 56 128 234 249 64 138 100 70 91 212 13 110 214 142 139 216 143 63 113
2606 113 252 64 195 48 157 170 137 159 121 56 313 186 206 107 324 76 67 281 140 161 83 96 55 47 207 150 93 318 91
2464 91 63 129 126 193 227 120 163 45 50 129 33 192 90 228 83 253 309 26 125 121 101 8 226 132 116 193 86 221 122 102 82
2311 82 217 121 169 142 39 28 148 283 183 151 127 126 68 399 225 235 267 281 302 96 159 213 150 105 189 48 115 160 142 144 127 231
$$ packed form
3364A69N9j52N4N5q0K1Mo0k0N1R1k7o5R8Q7k13J01j38J18q8k9J8qN2kJ03p5Q6m4l4K8l4q5
3202D1J24m0r4J11n2n4M2J01r6M3O1j37L09k53P6M18m21o9Qk3p9J94n0oj5J25J85k39L6j80
3054F6R8o3J4J70j86p7M1J2k4J22K6n2l9n4J39K5o5K50K48j46r0l27N3j28O2K04j37RJ19k29
2907D1J13OR8J8K9rj25L5j31L4l4j7j6K77k57J33L2j44n8J15j18J8L7%O4k8J9J14j7j03r9
2754B7K63j57N7q8J23j49K9k9J12m1L1j22P2J06J5j85P4l8l0K1J21j99R7J04p2lP7p3q0N0
2606A13J39j88J31j47J09J3l3K2l8o5K57j27K0r9K17k48rK14j41K1p8J3m1qJ60n7n7K25k27
2464I1k8O6lO7L4j07M3j18NP9r6J59j02J38j45J70N6k83R9mk0r3K18r4j6P7j07J35r9k0k0
2311H2J35r6M8k7j03j1J20J35j00l2k4jn8L31j74J0L2J4K1k06O3N4o3m5Q4j41O7M5j8Kj7J04
$$ plain form
2154 231 173 133 19 145 86 211 53 61 172 41 95 91 274 125 173 113 83 63 95 151 224 14 66 279 6 114 253 324 105
2011 105 225 92 142 188 161 305 108 338 367 334 40 219 71 192 155 37 24 150 108 145 249 153 183 144 183 69 131 327
1873 327 330 237 110 136 359 110 208 167 338 219 259 367 270 239 142 378 260 140 148 408 725 389 484 1085 1037 1175 1307 1898
1735 1898 2285 3272 4744 8404 13956 57844 42681 212442 114658 193611 31107 46541 13090 6446 4106
1661 4106 2880 2186 1458 1429 1150 940 937 683 521 485 398 457 233 257 284 211 174 238 143 325 78 134 235 255 250 250 162 83 135 108
1514 108 120 44 100 267 107 175 265 293 132 305 250 208 229 20 54 67 132 192 178 159 90 145 84 84 158 209 166 139 109 117 68 12 238
1351 238 102 65 211 578 253 140 185 189 133 133 290 103 168 208 203 67 227 151 69 151 29 324 52 100 268 61 129 188 101
1209 101 273 27 218 167 155 387 90 341 219 132 232 185 175 249 120 60 202 168 195 209 77 256 21 360 189 107 343
$$ packed form
2154B31n8m0j14J26n9J25j58QJ11j31N4mJ83j49M8o0l0k0L2N6P3k10N2K13k73J08J39P1k19
2011A05J20j33N0M6k7J44j97K30K9l3k94J79j48J21l7j18j3J26m2L7J04r6L0l9L9j14O2J96
1873C27Lr3j27K6K23k49R8m1J71j19M0J08r7l1r7K36j18j20QK60L17l36R5O01m8J38J32N91
1735A898L87R87J472L660N552M3888j5163J69761r7784P8953j62504J5434l3451o644k340
1661D106j226o94p28k9k79k10lk54j62l6q7N9k24K4K7p3l7O4r5J82k47N6J01K0n%q8p9N2k7
1514A08J2p6N6J67j60O8R0K8j61J73n5m2K1k09L4J3O5O0j4j9o9N5o1%P4N1m3k7l0Qm9n6K26
1351B38j36l7J46L67l25j13M5Mn6%J57j87O5M0nj36J60p6q2Q2j22K95k72M8J68k07O8N9q7
1209A01J72k46J91n1j2K32k97K51j22q7J00m7j0P4j29o0J42l4K7J4j32J79k35L39j71q2K36
$$ plain form
1076 343 91 234 205 239 33 208 191 282 118 181 214 294 17 254 218 55 253 69 72 46 402 280 258 262 124 322 260 93
938 93 379 168 205 189 30 332 280 153 115 230 373 465 440 137 305 313 128 263 193 272 265 162 247 330 227 542 268 212 459
795 459 162 440 406 203 222 314 289 434 470 336 382 514 434 466 524 329 473 561 336 357 712 239 609 414 560 501 748 606
657 606 511 785 813 690 702 879 895 847 1246 1422 1364 1515 2243 1206 1867 1743 1907 1740 1492 105 3088 11696 257476
544 257476 262821 11894 272651 237825 23812 5420 1828 1087 904 1449 1387 1468 595 2729 1245 2568 1025
460 1025 1400 921 1038 993 599 640 636 569 441 582 532 687 606 653 513 658 551 725 352 259 644 181 391 331 535 365 247
327 247 551 293 563 363 325 465 435 341 311 269 203 149 250 306 307 373 295 358 168 507 314 251 342 225 147 181 200 212 125 212 359
175 359 194 274 237 354 165 233 317 323 248 87 168 46 186 456 130 146 198 369 293 345 184 181 171 299 211 104 141 93 190 127
$$ packed form
1076C43k52J43k9L4k06J75j7R1j64O3L3Q0k77K37l6j63J98j84Lk6L56j22k2Mj38J98o2j67
938I3K86k11L7j6j59L02n2j27l8J15J43R2k5l03J68Qj85J35p0P9pj03Q5Q3j03L15k74n6K47
795D59k97K78l4k03J9R2k5J45L6j34M6J32q0L2N8j95J44Q8k25K1L55m73L70j95J46n9K47j42
657F06r5K74K8j23J2J77J6m8L99J76n8J51P28j037O61j24J64j67k48j387K983Q608K45780
544B57476N345k50927K60757l4826k14013j8392l592p41j83N45o2Q1q73K134j484J323j543
460A025L75m79J17m5l94M1mo7j28J41n0J55q1M7j40J45j07J74l73r3L85m63K10o0K04j70j18
327B47L04k58K70k00l8J40l0r4l0m2o6n4J01N6JO6p8O3j90L39j93o3R1j17p8L4J9J2q7Q7J47
175C59j65Q0l7J17j89O8Q4Op5j61Q1j22J40K70l26J6N2J71p6N2j61lj0J28q8j07L7m8R7o3
$$ plain form
27 127 199 309 272 291 172 184 293 165 275 128 73 91 37 198 264 176 485 89 300 210 255 363 240 61 292 307 148 85
-111 85 47 320 52 243 353 307 257 190 238 253 229 91 152 168 117 229 61 197 351 330 215 142 367 328 220 196 300 215 251
-253 251 193 328 181 153 273 429 147 210 480 308 313 269 152 206 173 131 169 230 278 215 297 330 311 271 397 448 106 450 183
-396 183 125 199 272 94 212 294 253 374 475 273 493 381 465 303 555 320 249 297 374 316 231 300 412 446
$$ packed form
27A27P2J10l7J9j19J2J09j28J10j47n5J8n4J61O6q8L09l96K11r0M5J08j23j79K31J5j59o3
-111H5l8K73k68J91J10m6n0o7M8J5k4j38O1J6n1J12j68J36J54k1j15p3K25l9j08k4J04q5L6
-253B51n8J35j47k8J20J56k82O3K70j72Nm4j17N4l3m2L8O1M8o3Q2L3j9m0J26N1l42L44k67
-396A83n8P4P3j78J18Q2m1J21J01k02K20j12Q4j62K52k35p1M8P7n8q5O9J12L4
-514D46
##PAGE=	F1=-1109.83
##FIRST=	4521.1594499999982872,	4521.1594499999982872,	0
##DATA TABLE=	(F2++(Y..Y)), PROFILE
$$ plain form
4521 549 571 606 638 495 675 467 567 404 382 474 273 370 337 414 504 416 489 616 404 416 436 516 359 424 167 188 408 153 293
4378 293 291 285 360 275 473 378 377 338 224 216 345 144 228 209 56 219 422 312 266 356 378 123 554 204 345 68 274 102 378
4236 378 230 73 165 337 277 307 275 287 396 216 170 190 171 77 329 91 219 237 179 155 252 448 283 421 150 309 312 123
4098 123 149 114 160 55 66 295 282 131 339 219 118 401 145 251 162 66 156 158 130 50 253 139 195 183 231 390 286 80
3960 80 151 300 176 117 143 167 182 205 112 135 321 170 86 283 156 160 394 73 145 144 93 215 52 147 229 211 157 284 17 311
3812 311 203 132 252 52 149 66 141 68 34 220 229 247 80 243 334 91 97 293 57 218 154 93 61 180 58 324 235 109 37
3670 37 423 210 237 74 116 238 46 28 121 259 181 297 141 88 283 192 219 105 83 241 189 216 163 41 33 130 124 58 312 187
3522 187 188 75 219 263 216 123 138 179 220 56 48 45 142 285 276 200 146 109 129 161 175 90 104 63 133 28 145 197 168 292 112 164 266
$$ packed form
4521E49K2L5L2j43J80k08J00j63k2R2k01R7l3P7R0q8P3J27k12J2K0Q0j57O5k57K1K20k55J40
4378B93koP5q5J98r5jl9j14qJ29k01Q4j9j53J63K03j10m6R0K2k55M31l50J41k77K06j72K76
4236C78j48j57R2J72o0L0l2J2J09j80m6K0j9r4K52k38J28J8n8k4R7J96j65J38k71J59Lj89
4098A23K6l5M6j05J1K29j3j51K08j20j01K83k56J06q9r6R0Kk8q0K03j14N6j2M8J59j04k06
3960H0P1J49j24n9K6K4J5K3r3K3J86j51q4J97j27MK34l21P2jn1J22j63R5Q2j8n4J27k67K94
3812C11j08p1J20k00R7q3P5p3l4J86RJ8j67J63R1k43OJ96k36J61o4o1l2J19j22K66q9j26p2
3670C7L86k13K7j63M2J22j92j8R3J38p8J16j56n3J95r1K7j14k2J58n2K7n3j22qR7oo6K54j25
3522A87Jj13J44M4m7r3J5M1M1j64qlR7J43rp6n4l7K0L2J4q5J4m1P0j05J17N2k9J24j80N2J02
$$ plain form
3360 266 28 116 192 101 95 105 87 84 87 221 224 91 239 298 73 205 37 195 67 28 82 82 122 148 218 91 237 174 175 200 119 45
3202 45 186 168 70 159 136 25 98 187 111 128 198 70 359 200 192 433 87 86 90 96 30 195 197 122 147 147 194 99 312 61 180 127 115
3040 115 302 103 52 84 66 74 201 224 198 113 108 221 209 108 425 662 545 426 164 184 40 5 329 160 122 290 46 192
2902 192 135 264 258 315 284 117 201 25 161 91 134 60 367 40 183 231 108 18 167 18 73 68 80 129 130 168 291 246 122 76
2754 76 296 125 212 121 221 96 97 47 182 168 212 68 176 245 267 48 163 65 43 46 209 41 118 229 168 168 273 171 79 118
2606 118 275 60 198 30 158 154 159 226 151 96 339 202 200 76 309 184 85 293 95 141 60 66 59 51 230 133 50 328 46 81
2459 81 162 115 192 254 108 184 61 71 188 28 190 132 251 130 244 314 54 166 148 122 28 232 146 55 190 133 219 125 84
2316 84 61 230 116 199 131 68 11 124 288 191 168 147 167 83 428 173 240 293 309 308 91 176 185 101 92 200 58 130 196 94 194
$$ packed form
3360B66k38Q8P6r1oJ0j8lLJ34Lj33J48N9k25J32j68J58j28l9N4%M0K6P0j27J46o3JK5q1p4
3202D5J41j8r8Q9k3j11P3Q9p6J7P0j28K89j59qK41l46jMOo6J65Kp5K5%M7r5K13k51J19n3j2
3040A15J87j99n1L2j8QJ27K3k6q5nJ13j2j01L17K37j17j19k62K0j44l5L24j69l8J68k44J46
2902A92n7J29oN7l1j67Q4j76J36p0M3p4L07l27J43M8j23r0J49j49N5nJ2M9JL8J23m5j24m6
2754G6K20j71Q7r1J00j25Jn0J35j4M4j44J08O9K2k19J15r8k2LJ63j68P7J11o1%J05j02r2L9
2606A18J57k15J38j68J28mNO7p5n5K43j37kj24K33j25r9K08j98M6q1OpqJ79r7q3K78k82L5
2459H1Q1m7P7O2j46P6j23J0J17j60J62n8J19j21J14P0k60J12j8k6r4K04q6r1J35n7Q6r4m1
2316H4k3J69j14Q3o8o3n7J13J64r7k3k1K0q4L45k55O7N3J6jk17Q5Rq4rJ08j42P2O6j02J00
$$ plain form
2163 194 124 273 212 141 84 128 118 189 68 39 166 50 116 77 283 139 234 146 96 101 105 142 233 15 76 321 30 116 217 344
2016 344 112 250 141 140 229 195 328 119 376 534 433 18 177 108 253 164 16 37 245 98 179 309 151 195 162 222 93
1883 93 132 346 385 263 117 164 385 139 320 220 441 298 300 414 402 266 254 391 293 181 263 490 842 478 691 1354 1397
1750 1397 1598 1866 2505 3007 4128 5955 10389 17993 75218 60675 289831 164822 273679 46475 65623 17767
1671 17767 8784 5614 3836 2956 2055 1936 1583 1239 1234 903 633 668 553 507 294 359 313 269 278 291 220 326 155 222 305 331
1543 331 273 261 182 49 137 103 138 44 81 301 147 183 349 267 122 337 258 204 242 23 57 102 114 230 206 165 136 150 119 153 155
1391 155 204 87 112 107 131 106 43 191 140 126 327 525 220 155 195 243 198 126 304 133 142 235 279 98 282 136 99 200 38 376
1243 376 77 100 251 28 98 224 107 315 102 292 175 180 408 24 337 235 119 201 255 123 282 72 97 234 249 212
$$ packed form
2163A94p0J49o1p1n7M4j0P1j21k9J27j16O6l9K06j44R5q8n0NML7R1k18O1K45k91Q6J01J27
2016C44k32J38j09jQ9l4J33k09K57J58j01m15J59o9J45q9j48K1K08j47Q1J30j58M4l3O0j29
1883I3L9K14L9j22j46M7K21k46J81j00K21j43KJ14j2j36j2J37r8j12Q2K27L52l64K13O63M3
1750A397K01K68O39N02J121J827M434P604N7225j4543K29156j25009J08857k27204J9148m7856
1671A7767q983l170j778q80r01j19l53l44nl31k70L5j15m6k13O5m6m4RJ3p1J06j71O7Q3K6
1543C31n8j2p9j33Q8l4L5r4L7K20j54L6J66q2j45K15p9n4L8k19L4M5J2J16k4m1k9J4l1L4K
1391A55M9j17K5nK4k5o3J48n1j4K01J98l05o5M0M8m5p2J78j71RR3M4j81J84j46l7J01j62L38
1243C76k99K3J51k23P0J26j17K08k13J90j17NK28l84L13j02j16Q2N4j32J59k10K5J37J5l7
$$ plain form
1115 212 260 154 284 111 381 207 147 318 94 256 254 288 90 289 199 355 167 247 237 377 65 247 264 44 244 123
987 123 90 95 437 361 330 307 238 336 313 192 397 198 242 195 98 327 354 270 149 346 404 507 537 151 374 343 194 333 195
844 195 355 293 245 332 360 335 602 368 293 566 267 475 474 269 294 347 359 453 602 463 466 633 568 620 639 466 552 673 470 437
697 437 821 360 741 600 727 601 940 787 715 964 1020 897 876 1108 1117 1080 1537 1868 1933 1976 2934 1452 2378 2158 2328 2056
569 2056 1569 282 4179 15903 328857 345537 17292 349409 313994 31153 6819 1950 1128 1290 1806 1800
490 1800 1947 631 3590 1647 3189 1378 1674 1219 1294 1180 759 840 840 710 550 818 735 841 831 824 683 814 644 850
372 850 442 371 703 331 467 388 683 508 336 736 395 710 475 423 524 491 409 346 379 224 259 338 370 425 512 450 427 235
234 235 586 359 269 393 236 155 252 268 267 209 302 427 323 384 317 407 272 263 332 320 244 85 230 95 230 533 233 256 259 467
$$ packed form
1115B12M8j06J30j73K70j74o0J71k24J62kL4j98J99r0J56j88Q0j0J40l12J82J7k20K00j21
987A23l3NL42p6l1k3o9R8k3j21K05j99M4m7r7K29K7q4j21J97N8J03L0l86K23l1j49J39j38
844A95J60o2m8Q7K8k5K67k34p5K73k99K08jk05K5N3J2R4J49j39LJ67o5N2J9j73Q6J21k03l3
697D37L84m61L81j41J27j26L39j53p2K49N6j23k1K32Rl7M57L31O5M3R58j482R26k20J70k72
569B056m87j287L897J1724L12954J6680l28245L32117l5415k82841k4334m869q22J62N16o
490A800J47j316K959j943J542j811K96m55P5j14m21Q1%j30j60K68q3J06j0pj41J31j70K06
372H50m08p1L32l72J36p9K95j75j72M00l41L15k35n2J01l3q2o3L3j55L5P9L2N5Q7o2k3j92
234B35L51k27r0J24j57q1R7J6jn8R3J25j04O1o7R0j35rO9j2p6j59J45j35J35L03l00K3LK08
$$ plain form
86 467 375 379 239 242 129 296 201 60 211 156 248 215 300 377 392 339 240 221 288 146 294 132 86 128 109 275 279 251 551 210 335
-66 335 272 352 341 318 34 277 304 99 104 98 417 121 319 387 387 319 222 320 282 248 107 74 179 109 266 119 252 471 393 276
-214 276 248 416 373 237 212 330 175 259 129 360 197 190 375 490 215 278 563 332 333 303 204 204 196 142 204 342 252 327 398 446
-362 446 394 373 485 473 159 513 238 135 273 313 135 350 393 368 511 610 377 618 491 545 431 623 379 372 354 518 402
-495 402 352 428 552 593
$$ packed form
86D67r2Mj40Lj13J67r5j41J51n5R2l3Q5P7J5n3r9j9O7j42J48j62m6M2j9J66Mk8L00l41J25
-66C35o3Q0j1k3k84K43K7k05NoL19k96J98O8%o8r7R8l8l4j41l3J05p0J57j47J33K19p8j17
-214B76k8J68m3j36k5J18j55Q4j30K31j63pJ85J15k75O3K85k31Jl0r9%qn4O2J38r0P5P1M8
-362D46n2k1J12j2l14L54k75j03J38M0j78K15M3k5J43R9k33K41j27N4j14J92k44pj8J64j16
-495D02n0P6J24M1
-514E93
##PAGE=	F1=-1119.67
##FIRST=	4521.1594499999982872,	4521.1594499999982872,	0
##DATA TABLE=	(F2++(Y..Y)), PROFILE
$$ plain form
4521 700 648 767 731 597 813 529 623 477 466 506 374 439 466 485 640 505 648 673 495 511 535 540 374 480 269 217 509 203
4383 203 329 377 361 460 372 532 437 462 371 277 270 324 178 242 262 102 257 497 407 278 398 440 173 589 248 369 93 260
4246 260 68 414 236 78 248 389 372 354 356 289 428 223 205 197 208 131 328 30 237 298 210 164 379 473 280 494 161 311
4108 311 351 83 128 99 196 125 138 327 328 177 364 239 161 417 185 233 147 116 116 219 144 68 325 166 255 238 237 425 328 127
3960 127 180 268 197 129 182 222 211 273 146 201 308 228 131 304 195 176 390 75 123 137 45 232 62 213 256 230 202 301 72 324
3812 324 226 148 230 39 93 106 128 66 43 267 322 242 144 289 357 56 90 292 23 227 125 94 101 201 52 346 234 196 58
3670 58 453 185 265 132 119 232 39 73 165 288 208 318 151 98 315 202 272 123 77 231 218 244 180 2 53 186 160 49
3532 49 371 191 194 108 231 286 199 125 160 166 246 75 82 15 191 314 327 220 180 146 136 196 202 76 130 66 162 33 128 196 203 340 135
$$ packed form
4521G00n2J19l6j34K16k84R4j46j1M0j32O5K7J9J55j35J43K5j78J6K4Nj66J06k11n2K92l06
4383B03J26M8j6R9q8J60r5K5r1r4pN4j46O4K0j60J55K40r0j29J20M2k67M16l41J21k76J67
4246B60j92L46j78j58J70J41j7j8Ko7J39k05j8qJ1p7J97k98K07O1q8m6K15R4j93K14l33J50
4108C11M0k68M5k9R7p1J3J89Jj51J87j25p8K56k32M8q6l1%J03p5p6K57j59Q9j7jJ88r7k01
3960A27N3Q8p1o8N3M0j1O2j27N5J07q0r7J73j09j9K14l15M8J4r2J87j70J51M3k6k8R9k29K52
3812C24r8p8Q2j91N4J3K2o2k3K24N5q0r8J45O8l01L4K02k69K04j02l1PJ00j49K94j12l8j38
3670E8L95k68Q0j33j3J13j93L4R2J23q0J10j67n3K17j13P0j49m6J54j3K6o4j78N1J33k6j11
3532D9L22j80Lq6J23N5q7p4L5OQ0j71Po7J76J23J3j07m0l4j0O0Oj26N4o4R6j29R5O8PJ37k05
$$ plain form
3369 135 155 285 61 106 173 69 61 90 103 132 63 243 272 84 284 306 67 232 74 219 61 41 108 116 134 191 232 59 256
3227 256 162 229 231 111 60 213 200 103 157 167 18 113 215 150 147 198 103 350 293 274 342 91 69 58 104 72 182 221 102 156 21
3074 21 293 60 359 56 188 145 103 296 103 83 103 68 99 231 222 241 125 161 233 180 58 439 660 662 466 264 220 90 66
2931 66 357 171 107 300 62 217 108 267 218 314 281 64 231 20 205 96 200 81 389 42 151 219 152 17 168 42
2803 42 101 71 119 113 150 209 321 254 121 123 292 128 227 136 203 126 92 70 159 188 233 114 202 261 256 71 172 32 36 52 185 69
2646 69 125 243 190 188 305 200 94 124 284 61 194 42 143 148 177 295 204 125 349 212 180 71 273 282 108 286 53 104
2508 104 70 60 71 53 249 120 60 317 16 117 181 108 187 276 111 185 93 101 237 83 180 177 284 182 227 302 82 194 167 143
2360 143 56 210 147 19 191 193 214 138 75 138 231 102 227 108 96 17 99 281 181 181 168 194 99 424 108 235 307 330 296 71
$$ packed form
3369A35K0J30k24M5O7j04qK9J3K9o9J80K9j88K00K2k39J65j58J45j58k0O7QJ8N7M1j73J97
3227B56r4O7Kj20n1J53j3r7N4J0j49R5J02o5lN1r5K47n7j9O8k51k2j1M6l2J10L9j19N4j35
3074B1K72k33K99l03J32m3m2J93j93k0K0l5L1J32rJ9j16L6P2n3j22L81K21Kj96k02m4j30k4
2931F6K91j86o4J93k38J55j09J59m9R6l3k17J67k11J85j09J04j19L08l47J09O8o7j35J51j26
2803D2N9l0M8oL7N9J12o7j33KJ69j64R9r1O7p7l4k2Q9K9M5j19Q8N9nj85J01j40MJ6J33j16
2646F9N6J18n3kJ17j05j06L0J60k23J33j52J01NK9J18r1p9K24j37l2j09K02Rj74J78k33N1
2508A04l4j0J1j8J96j29o0K57l01J01O4p3P9Q9j65P4r2QJ36j54R7lJ07j02M5P5k20J12k7k4
2360A43q7J54o3j28J72KK1p6o3O3R3j29J25j19j2p9Q2J82j00%j3K6r5L25l16J27P2K3l4k25
$$ plain form
2213 71 176 150 79 108 206 102 138 229 31 229 105 294 252 150 163 99 145 155 103 75 149 82 140 72 274 163 273 182 118 136
2065 136 115 120 234 31 76 346 52 111 197 348 121 264 194 142 270 232 324 157 548 1401 790 44 106 150 306 175 46
1932 46 77 340 85 216 357 175 204 174 255 114 129 334 419 263 132 210 403 159 433 261 522 367 345 440 518 270 339
1799 339 378 331 215 394 565 951 631 929 1580 1705 1944 2350 2993 3640 4851 6934 11923 21283 89669 76607 356875
1696 356875 210018 345235 60627 83078 22022 10928 6957 4692 3646 2588 2369 1971 1489 1481 1131 704 833
1612 833 684 535 351 451 317 331 370 345 318 320 239 296 362 395 291 267 193 22 141 80 144 63 170 325 196 181 431 243 90
1469 90 351 258 188 258 21 60 145 103 261 227 183 185 167 179 207 147 178 43 79 116 135 151 85 139 163 173 422 480 389 155 193 290 262
1307 262 122 314 155 122 257 338 134 331 135 164 244 49 406 122 114 210 74 67 271 158 334 175 376 189 192 411 49
$$ packed form
2213G1J05k6p1K9R8j04L6R1j98J98j24J89m2j02J3o4M6J0n2k8P4o7N8o8K02j11J10r1o4J8
2065A36k1NJ14k03M5K70k94N9Q6J51k27J43p0n2J28l8R2j67L91Q53o11p46O2M4J56j31j29
1932D6L1K63k55J31J41j82K9l0Q1j41J5K05Q5j56j31P8J93k44K74j72K61j55k2R5P8k48O9
1799C39L9m7j16J79J71L86l20K98O51J25K39M06O43O47J211K083M989R360O8386j3062K80268
1696C56875j46857J35217k84608K2451o1056j1094l971k265j046j058k19l98m82ql50m27J29
1612H33j49j49j84J00j34J4L9k5k7Kq1N7O6L3j04k4p4j71J19o1O4q1J07J55j29j5K50j88j53
1469I0K61r3p0P0k37L9Q5m2J58l4m4Kj8J2K8o0L1j35L6L7J9J6o6N4K4J0K49N8r1k34L8R7k8
1307B62j40J92j59l3J35Q1k04J97j96K9Q0j95L57k84qR6j36pK04j13J76j59K01j87LK19l62
$$ plain form
1174 49 329 247 113 157 308 100 312 78 162 260 318 237 300 229 296 202 387 216 178 271 97 274 303 325 151 374 208 415
1036 415 215 304 257 445 110 227 294 105 214 186 107 191 463 431 397 334 337 343 351 279 392 262 277 191 164 310 415 381 190 475
889 475 431 539 622 164 433 353 255 399 205 436 342 328 426 407 436 641 467 360 651 379 495 518 321 360 415 431 467 733
751 733 568 568 727 689 762 731 587 622 750 601 533 889 496 866 782 883 743 1094 953 909 1111 1208 1074 1047 1331 1302 1315 1790
613 1790 2282 2485 2400 3541 1662 2832 2523 2701 2356 1690 624 5067 19300 389672 417675 22696 415255 381027
524 381027 37299 7996 1997 1204 1694 2169 2211 2381 668 4338 2029 3700 1686 1889 1486 1506 1341 901 1023 1034
426 1034 856 665 1025 926 986 1028 980 832 937 728 937 513 494 740 477 550 475 800 637 440 901 492 827 573 498 566
298 566 531 448 389 483 244 385 441 429 536 635 587 489 308 656 368 280 415 247 167 329 343 326 290 409 482 445 483 375 447 366
$$ packed form
1174D9K80q2j34M4J51k08K12k34Q4R8N8q1O3p1O7r4J85j71l8R3j74J77K9K2j74K23j66K07
1036D15k00Q9m7J88l35J17O7j89J09k8p9Q4K72l2l4o3LOQp2J13j30J5q6k7J46J05l4j91K85
889D75m4J08Q3m58K69q0r8J44j94K31r4j4R8j9K9K05j74j07K91k72J16K3j97L9N5J6L6K66
751G33j65%J59l8P3l1j44L5J28j49o8L56l93L70q4J01j40L51j41m4K02R7j34k7K84k9J3M75
613A790M92K03q5J141j879J170l09J78l45o66j066M443J4233L70372K8003l94979L92559l4228
524C81027l43728k9303n999p93M90M75M2J70j713L670k309J671k014K03m03K0j65m40J22J1
426A034j78j91L60r9O0M2m8j48J05k09K09m24j9K46k63P3p5L25j63j97M61m09L35k54p5O8
298E66l5q3n9R4k39J41N6j2J07R9m8r8j81L48k88q8J35j68q0J62J4j7l6J19P3l7L8j08P2q1
$$ plain form
150 366 282 336 320 231 63 295 157 279 602 340 366 311 534 439 395 282 284 91 274 185 67 286 223 309 298 405 435 483 375
8 375 300 244 270 132 298 122 107 220 179 350 295 339 596 316 355 325 433 292 371 12 246 301 78 136 203 503 216 381 404
-135 404 456 360 260 387 293 246 127 35 158 183 317 188 306 572 455 335 342 439 395 234 215 330 134 271 55 390 266
-268 266 250 477 537 306 333 617 354 352 313 254 219 211 178 230 446 229 438 485 546 453 456 553 492 223 541 286 152 337 368 190
-416 190 478 487 463 636 724 482 720 572 603 530 658 424 479 394 647 483 475 556 667 730
$$ packed form
150C66q4N4j6q9j68K32j38J22L23k62K6n5K23r5m4j13Kj93J83q9j18K19o3Q6j1J07L0M8j08
8C75p5n6K6j38J66j76j5J13m1J71n5M4K57k80L9l0J08j41P9l59K34N5k23N8O7L00k87J65K3
-135D04N2r6j00J27r4m7j19r2J23K5J34j29J18K66j17j20PR7m4j61j9J15j96J37k16L35j24
-268B66j6K27O0k31K7K84k63kl9n9l5ql3N2K16k17K09M7O1r3LR7o1k69L18k55j34J85L1j78
-416A90K88Rk4J73Q8k42K38j48L1p3J28k34N5q5K53j64qQ1J11O3
-514G30
##PAGE=	F1=-1129.51
##FIRST=	4521.1594499999982872,	4521.1594499999982872,	0
##DATA TABLE=	(F2++(Y..Y)), PROFILE
$$ plain form
4521 802 685 890 781 652 906 551 643 530 523 500 460 514 569 537 742 568 762 701 543 574 598 535 367 512 359 231 587
4388 587 245 355 445 413 548 443 569 456 518 389 312 308 284 223 226 306 184 286 546 480 289 427 465 215 589 280 361 146
4250 146 238 42 440 249 117 318 421 450 381 423 280 442 225 235 174 225 184 299 72 239 357 257 164 490 470 276 544
4118 544 153 298 344 76 99 67 225 184 226 327 377 223 385 286 179 415 208 201 137 159 96 266 155 90 400 183 318 272
3980 272 252 430 334 168 202 225 219 125 226 271 227 331 183 268 280 263 162 326 203 190 355 93 97 127 53 237 104 281 267
3837 267 254 238 294 140 311 246 173 190 45 41 147 103 118 48 299 396 233 196 323 344 52 77 274 37 239 86 91 145 214 74
3689 74 344 222 266 135 463 148 281 172 109 214 36 118 198 310 235 317 158 132 346 194 308 160 76 204 230 252 185
3556 185 42 76 235 205 31 409 197 183 134 227 303 166 140 157 151 268 100 105 74 226 322 355 238 203 170 135 236 226 59 158
$$ packed form
4521H02j17K05j09j29K54l55R2j13pk3m0N4N5l2K05j74J94o1j58L1K4o3j68J45j53j28L56
4388E87l42J10R0l2J35j05J26j13O2j29p7mk4o1LQ0j22J02K60o6j91J38L8k50L74l09Q1k15
4250A46R2j96L98j91j32K01J03K9o9M2j43J62k17J0o1N1m1J15k27J67J18j00r3L26k0j94K68
4118E44l91J45M6k68K3l2J58m1M2J01N0j54J62r9j07K36k07po4K2o3J70j11o5L10k17J35m6
3980B72k0J78r6j66L4K3or4J01M5m4J04j48Q5J2j7j01J64j23j3J65k62ML0p4J84j33J77j4
3837B67j3j6N6j54J71o5p3J7j45mJ06m4J5p0K51R7j63l7J27K1k92K5J97k37K02j53NN4O9j40
3689G4K70j22M4j31L28l15J33j09o3J05j78Q2Q0J12p5Q2j59k6K14j52J14j48q4J28K6K2o7
3556A85j43L4J59l0j74L78k12j4m9R3P6j37k6J7oJ17j68Nl1J52R6L3j17l5l3l5J01j0j67R9
$$ plain form
3409 158 100 212 54 118 191 226 373 145 144 281 117 103 130 15 35 86 112 179 29 252 298 83 316 308 53 246 120 221
3271 221 50 67 132 141 136 215 244 59 267 133 269 253 100 75 236 219 125 143 179 53 112 253 186 168 187 142 330 331 331 338 135 63
3113 63 28 115 112 176 225 111 161 112 558 156 380 55 185 154 82 269 98 106 117 83 121 256 197 270 131 202 221 134 18 433
2966 433 625 761 506 340 233 137 126 359 171 131 298 83 226 88 266 156 301 286 34 280 21 238 90 246 98
2843 98 382 83 106 194 193 26 140 62 117 75 156 99 172 240 327 249 126 157 275 137 230 146 177 159 99 128 118 207 239 166 202 280
2685 280 219 122 161 36 58 90 143 83 127 249 197 200 304 226 100 131 278 69 181 73 119 152 184 355 266 137 341 210 157
2542 157 100 218 348 132 264 39 55 106 88 93 49 260 119 110 286 55 151 183 108 176 289 130 167 125 129 272 132 161 214 322
2395 322 232 203 271 108 207 174 155 78 162 136 78 202 247 205 155 74 217 221 82 248 74 116 31 82 264 160 189 185 206 122 386
$$ packed form
3409A58n8J12j58O4P3L5J47k28jJ37j64j4K7j15K0N1K6O7j50K23M6k15K33qk55J93j26J01
3271B21j71J7O5RnP9K9j85K08j34J36j6j53k5J61j7r4J8L6j26N9J41o7j8J9m5J88J%Pk03p2
3113F3l5Q7lO4M9j14N0m9M46m02K24l25J30l1p2J87j71QJ1l4L8J35n9P3j39P1J9q7j16M15
2966D33J92J36k55j66j07r6j1K33j88m0J67k15J43j38J78j10J45j5k52K46k59K17j48J56j48
2843I8K84k99K3Q8jj67J14p8N5m2Q1n7P3O8Q7p8j23L1J18j38R3q4L1j8o0K9j0Q9L2p3L6P8
2685B80o1r7L9j25K2L2N3o0M4J22n2LJ04p8j26L1J47k09J12j08M6L3L2J71q9j29K04j31n3
2542A57n7J18J30k16J32k25J6N1j8Nm4K11j41rJ76k31R6L2p5O8J13j59L7m2MJ43j40K9N3J08
2395C22r0k9O8j63R9l3j9p7Q4k6n8J24M5m2n0q1J43Mj39J66j74M2q5N1J82j04K9mK1q4K64
$$ plain form
2242 386 56 216 302 339 270 45 162 126 98 134 204 167 141 247 59 243 71 289 280 157 224 65 162 114 144 138 127 125 166 78 244
2090 244 188 283 213 150 168 123 83 228 48 68 354 65 103 202 333 129 262 239 148 301 274 301 203 784 2204 1157 97
1957 97 26 191 341 183 77 124 408 70 245 384 202 208 174 280 120 122 290 425 232 143 256 411 160 534 287 571
1829 571 406 382 444 602 249 387 342 363 244 513 619 1031 769 1125 1726 1909 2160 2684 3286 4070 5312 7528 12758 23307
1711 23307 98883 87990 402924 243213 397027 71383 96222 25191 12546 7929 5309 4147 2968 2654
1642 2654 2252 1654 1637 1327 718 958 768 534 399 517 292 384 436 394 407 312 315 343 397 436 300 261 192 44 140 39 136 84
1504 84 286 333 238 168 491 222 43 347 248 162 270 17 73 192 94 276 237 205 231 189 242 238 138 132 117 45 132 130 190 134 189 174
1346 174 193 538 520 578 135 175 328 316 120 323 166 120 273 375 164 366 151 228 272 70 406 164 139 150 124 39 317
$$ packed form
2242C86l30J60Q6L7o9k25J17l6k8L6P0l7k6J06j88J84j72K18rj23O7j59R7m8L0oj1kM1q8J66
2090B44n6R5p0o3J8m5m0J45j80K0K86k89L8R9J31k04J33k3r1J53k7K7r8N81J420j047j060
1957I7p1J65J50j58j06M7K84l38J75J39j82Ol4J06j60KJ68J35j93q9J13J55k51L74k47K84
1829E71j65k4O2J58l53J38m5K1j19K69J06M12k62L56O01J83K51N24O02P84J242K216N230J0549
1711B3307P5576j0893L14934j59711J53814l25644K4839p1031j2645m617k620j162j179l14
1642B654m02n98j7l10o09K40j90k34j35J18k25R2N2m2J3r5LK8N4L9j36l9o9j48R6j01R7n2
1504H4K02M7r5p0L23k69j79L04r9q6J08k53N6J19r8J82l9l2K6m2N3mj00oj5p2Q7kO0n6N5j5
1346A74J9L45j8N8m43M0J53j2j96K03j57m6J53J02k11K02k15P7M4k02L36k42k5J1k6q5K78
$$ plain form
1213 317 219 326 229 452 204 186 398 115 311 254 116 108 339 137 335 145 217 275 361 268 322 288 288 279 376 216 197 211 100 285
1066 285 343 345 195 448 214 452 252 346 263 488 149 200 299 182 172 249 125 292 474 479 450 343 403 341 372 343 367 326 303 191
918 191 220 290 446 469 235 580 447 547 678 172 473 338 302 449 226 498 403 395 507 455 514 651 547 400 700 472 506
785 506 531 353 409 497 491 478 837 638 658 779 772 874 781 676 674 779 709 616 906 619 958 929 1001 888 1185 1073 1063 1193 1349
642 1349 1183 1178 1505 1421 1506 1961 2598 2927 2713 3970 1806 3156 2772 2961 2576 1835 955 5629 21425 430562 467981
539 467981 27160 460118 428341 41377 8802 1975 1297 2034 2475 2532 2695 705 4850 2324 4021 1897 2008
455 2008 1673 1646 1446 1004 1154 1189 981 764 1173 1066 1098 1167 1093 936 1011 782 973 552 605 759 597 622 575 867 731 535
327 535 1017 563 897 638 538 588 548 452 435 562 266 500 533 469 624 722 680 527 367 702 341 290 401 251 189 400 415
$$ packed form
1213C17r8J07r7K23k48j8K12k83J96n7j38qK31k02J98j90P2N8Q6r3N4l4%rR7j60j9J4j11J85
1066B85N8Kj50K53k34K38k00R4q3K25l39N1R9j17j0P7j24J67J82Nk9j07O0o2L1k9K4m1k3j12
918A91K9P0J56K3k34L45j33J00J31n06L01j35l6J47k23K72r5qJ12n2N9J37j04j47L00k28L4
785E06K5j78N6Q8oj3L59j99K0J21pJ02r3j05kJ05p0r3K90k87L39k9P2j13K97j12j0J30J56
642A349j66nL27q4Q5M55O37L29k14J257k164J350l84J89l85p41q80M674J5796M09137L7419
539D67981m40821M32958l1777l86964l2575o827o78P37M41N7J63j990M145k526J697k124J11
455B008l35k7k00m42J50L5k08k17M09j07L2O9p4j57P5k29J91m21N3J54j62K5m7K92j36j96
327E35M82m54L34k59j00N0m0r6j7J27k96K34L3o4J55R8m2j53j60L35l61n1J11j50o2K11J5
$$ plain form
195 415 378 348 514 515 536 557 400 461 430 290 326 326 222 33 347 221 324 651 428 455 349 556 472 390 301 303 89 237 167 137
47 137 353 286 356 365 492 471 532 389 341 249 245 126 292 126 134 310 233 414 302 423 610 391 354 362 483 222 393 32 199
-96 199 297 118 174 299 566 292 420 405 504 379 288 429 285 222 148 109 112 267 372 247 350 639 502 381 407 437 393 212
-234 212 201 300 102 288 21 416 346 309 559 555 393 361 622 371 359 299 284 254 211 220 252 528 235 530 545 610 474 513 587 495
-381 495 271 527 321 176 384 425 251 573 559 520 725 803 565 785 612 621 587 654 450 554 413 739 554 574 661 735 835
$$ packed form
195D15l7l0J66JK1K1j57O1l1j40L6%j04j89L14j26J03L27k23K7j06K07q4q2q9Kk14J48p0l0
47A37K16o7P0RJ27k1O1j43m8r2mj19J66j66QJ76p7J81j12J21J87k19l7QJ21k61J71l61J67
-96A99R8j79N6J25K67k74J28j5R9j25r1J41j44o3p4l9LJ55J05j25J03K89j37j21K6L0m4j81
-234B12j1R9j98J86k67L95p0l7K50mj62l2K61k51j2o0j5l0m3RL2K76k93K95J5O5j36L9P4r2
-381D95k24K56k06j45K08M1j74L22j4l9K05P8k38K20j73Rl4O7k04J04j41L26j85K0Q7P4J00
-514H35
##PAGE=	F1=-1139.36
##FIRST=	4521.1594499999982872,	4521.1594499999982872,	0
##DATA TABLE=	(F2++(Y..Y)), PROFILE
$$ plain form
4521 840 679 952 782 648 939 528 627 550 547 458 515 576 631 559 792 592 813 695 544 596 614 501 340 513 429 233 634
4388 634 271 364 486 430 604 478 577 432 538 390 324 329 234 260 195 332 249 304 558 520 289 439 449 241 552 293 321 197
4250 197 211 89 452 264 152 361 424 501 381 465 250 439 218 253 126 219 225 249 132 223 398 303 155 566 438 265 560
4118 560 127 274 291 124 69 22 243 219 314 289 415 260 393 338 165 397 208 166 126 194 123 291 165 112 464 186 370
3985 370 274 274 402 303 194 213 185 238 106 268 308 228 365 216 318 236 274 172 344 180 196 294 116 73 115 107 230 143 339
3842 339 262 276 252 265 203 274 262 189 141 55 91 183 71 177 53 306 441 225 221 340 298 86 62 242 55 254 47 85 183
3699 183 216 111 319 198 309 208 451 104 281 188 90 188 62 140 218 324 255 291 159 167 369 170 319 202 76 164 222
3566 222 236 183 76 96 267 248 6 420 203 162 151 206 302 121 158 135 134 283 118 119 129 245 304 357 248 211 174 129 281 247
$$ packed form
4521H40j61K73j70j34K91m11R9p7lq9N7O1N5p2K33k00K21j18j51N2J8j13j61J73q4j96M01
4388F34l63R3J22n6J74j26R9j45J06j48o6Nr5K6o5J37q3N5K54l8k31J50J0k08L11k59K8j24
4250A97J4j22L63j88j12K09O3P7j20Q4k15J89k21L5j27R3OK4j17R1J75r5j48M11j28j73K95
4118E60m33J47J7j67n5m7K21k4R5k5J26j55J33n5j73K32j89m2m0O8p1J68j26n3L52k78J84
3985C70r6%J28r9j09J9k8N3j32J62M0q0J37j49J02q2L8j02J72j64J6R8j78m3M2qJ23q7J96
3842C39p7J4k4J3o2P1j2p3m8q6L6R2j12J06j24K53J35k16mJ19m2k12k4J80j87J99k07L8R8
3699A83L3j05K08j21J11j01K43l47J77r3r8R8j26P8P8J06o9L6j32QK02j99J49j17j26Q8N8
3566B22J4n3j07K0J71j9k42M14k17m1j1N5R6j81L7k3jJ49j65JJ0J16N9N3j09l7l7m5J52l4
$$ plain form
3419 247 37 182 142 259 89 108 180 233 385 143 132 254 157 105 75 48 39 90 109 220 22 244 299 86 322 307 53 243
3281 243 169 203 50 93 151 152 133 217 251 84 268 95 280 263 85 85 244 223 134 132 174 104 96 292 211 178 161 178 298 310 331 346
3123 346 148 69 21 123 144 176 209 138 156 215 764 239 372 62 170 155 56 228 90 113 124 105 135 271 159 282 126 226
2985 226 183 79 50 403 555 797 524 369 218 181 167 336 159 176 282 102 217 87 257 80 277 284 40 329 18 259
2857 259 77 265 108 346 131 57 162 221 39 91 73 120 78 180 93 194 249 308 233 134 180 246 146 219 154 148 187 122 182 63
2710 63 222 234 210 178 297 164 175 133 60 87 119 92 82 122 245 187 205 270 246 99 135 264 76 162 106 92 157 177 399 318 132
2557 132 318 192 145 138 153 370 158 235 61 21 140 125 113 53 259 125 154 240 94 173 166 113 161 293 158 135 152 151 288 168
2410 168 134 235 355 269 174 221 129 204 169 154 90 101 117 124 217 284 191 166 78 275 203 60 259 31 129 41 77 240 144 187 190 204
$$ packed form
3419B47k10J45m0J17j70J9P2N3J52k42j1J22r7n2l0k7rN1J9J11j98K22N5k13K36j5k54J90
3281B43p4L4j53M3N8Jj9Q4L4j67J84j73J85j7j78%J59k1q9kM2p0qJ96q1l3j7J7J20J2K1J5
3123C46j98p9m8J02K1L2L3p1J8N9N49n25J33l10J08j5r9J72j38K3J1j9L0J36j12J23j56J00
2985B26m3j04k9L53J52K42k73j55j51l7j4J69j77J7J06j80J15j30J70j77J97Pk44K89l11K41
2857B59j82J88j57K38k15p4J05N9j82N2j8M7m2J02q7J01N5N9p5r9M6O6j00P3o5oL9o5O0j19
2710F3J59J2k4l2J19j33J1m2p3K7L2k7j0M0J23n8J8O5k4j47L6J29j88Q6n6j4O5K0K22q1j86
2557A32J86j26m7pJ5K17k12P7j74m0J19j5j2o0K06j34K9Q6j46P9pn3M8J32j35k3J7jJ37j20
2410A68l4J01J20q6r5M7r2P5l5j5o4J1J6PR3O7r3k5q8J97p2j43J99k28R8q8L6J63r6M3LJ4
$$ plain form
2252 204 147 320 89 182 276 329 235 22 139 131 129 153 191 238 140 243 138 237 25 263 288 157 256 52 168 72 182 199 110 166
2104 166 193 95 193 205 261 234 180 194 126 34 218 59 55 349 68 96 225 300 138 242 268 150 309 312 268 235 974 2756 1443
1962 1443 139 68 227 353 182 97 169 440 55 261 389 215 207 161 293 107 118 219 402 173 140 287 402 141 607
1839 607 292 581 405 401 429 639 207 393 294 375 264 600 638 1063 848 1233 1763 1974 2211 2818 3341 4221 5426 7638 12752
1716 12752 23741 101350 93086 420540 259218 420677 77141 102946 26751 13379 8378 5582 4374 3132
1647 3132 2740 2380 1708 1676 1453 672 1024 790 502 431 547 240 414 464 429 470 306 374 353 403 449 295 239 180 75 132 13
1514 13 117 100 385 322 259 149 512 201 33 332 228 129 274 16 97 239 84 272 239 218 265 208 291 246 131 78 194 14
1376 14 150 115 215 185 327 223 194 681 580 695 100 140 354 355 120 332 166 131 279 386 183 378 177 273 278 101 371
$$ packed form
2252B04n7J73k31R3R4N3r4k13J17qkK4L8M7r8J03j05R9k12K38K5j31R9k04J16r6J10J7q9N6
2104A66K7r8R8J2N6k7n4J4o8r2J84j59mK94k81K8J29P5j62J04K6j18J59Lm4l3P39J782j313
1962A443j304p1J59J26j71q5P2K71l85K06J28j74qm6J32j86J1J01J83k29l3J47J15k61M66
1839F07l15K89j76mK8K10m32J86r9Q1j11L36L8M25k15L85N30K11K37O07N23Q80J205K212N114
1716A2752J0989P7609q264L27454j61322J61459l43536K5805p6195j3372n001k796j208j242
1647C132l92l60o72l2k23p81L52k34k88p1J16l07J74N0l5M1j64O8k1N0M6j54n6n9j05N7j19
1514A3J04j7K85o3o3j10L63l11j68K99j04r9J45k58Q1J42j55J88l3k1M7n7Q3m5j15n3J16j80
1376A4J36l5J00l0J42j04k9M87j01J15n95M0K14Jk35K12j66l5J48J07k03J95k01R6Nj77K70
$$ plain form
1243 371 194 170 93 161 15 347 268 289 257 506 214 162 373 162 278 252 131 67 342 191 348 216 250 272 376 299 320 325
1105 325 260 327 346 203 207 161 99 286 364 347 213 500 217 459 270 370 248 500 177 170 276 255 138 302 142 376 463 492
967 492 486 330 425 328 376 374 326 366 316 198 261 279 438 523 280 640 448 523 690 173 492 307 329 476 250 530 455 438 552
825 552 488 556 627 593 406 704 525 513 509 360 428 568 529 484 893 664 713 782 801 941 776 721 696 754 781 660 873 708 995
682 995 1016 1060 995 1195 1125 1153 1192 1419 1205 1237 1596 1452 1614 2020 2763 3182 2859 4149 1858 3297 2858 3056 2662 1947 1205
559 1205 5787 21997 444820 488257 29874 476652 448104 42783 9130 1895 1357 2246 2663 2693 2834 732
480 732 5039 2480 4098 1979 2009 1747 1696 1473 1050 1206 1280 1057 824 1237 1126 1155 1223 1138 976 1027 786 955 553 686 761
357 761 670 667 658 874 776 603 1065 589 910 659 540 585 537 420 478 602 288 582 595 479 673 762 711 532 399 713 286 308
$$ packed form
1243C71j77k4p7O8j46L32p9K1l2K49k92n2K11k11J16k6j21o4K75j51J57j32L4K2J04p7K1N
1105C25o5O7J9j43Mm6o2J87P8j7j34K87k83K42j89J00j22K52l23pJ06k1j17J64j60K34Q7K9
967D92oj56R5r7M8km8M0n0j18O3J8J59Q5k43L60j92P5J67n17L19j85K2J47k26K80p5j7J14
825E52o4O8P1l4j87K98j79j2mj49O8J40l9m5M09k29M9O9J9J40j65n5k5N8K7j21K13j65K87
682I95K1M4o5K00p0K8L9K27k14L2L59j44J62M06P43M19l23J290k291J439m39J98l94p15p42
559A205M582J6210M22823M3437m58383M46778k8548m05321l3653p235n38Q89M17L0J41k102
480G32M307k559J618k119L0k62n1k23m23J56P4k23k33M13j11K9O8q5j62N1k41J69m02J33P5
357G61r1lrK16r8j73M62m76L21k51j19M5m8j17N8J24l14K94J3j16J94Q9n1j79j33L14m27K2
$$ plain form
219 308 355 245 215 455 471 409 371 601 517 581 593 389 442 453 286 301 336 224 58 373 276 357 670 479 507 371 526 470 366
76 366 291 298 123 192 148 215 404 337 378 406 545 475 532 379 356 230 220 127 280 163 158 374 261 460 292 485 590 423 331 378
-71 378 495 138 384 55 141 289 171 209 369 598 331 428 386 528 377 295 440 257 182 167 179 63 333 413 285 374 666
-204 666 520 407 434 410 366 181 170 251 88 307 78 432 403 352 607 536 455 358 576 380 344 266 286 302 194 254 270 578 267
-347 267 583 569 629 452 540 579 474 307 466 339 199 408 466 301 624 598 529 761 836 607 805 606 591 596 615 452 588
-480 588 408 779 606 629 721 747 888
$$ packed form
219C08M7j10l0K40J6o2l8K30q4O4J2k04N3J1j67J5L5j12j66L15r7Q1L13j91K8j36J55n6j04
76C66p5Pj75O9m4O7J89o7M1K8J39p0N7j53k3j26j0r3J53j17nK16j13J99j68J93J05j67r2M7
-71C78J17l57K46l29Q6J48j18L8J60K29k67R7m2J42j51q2J45j83p5j5J2j16K70Q0j28Q9K92
-204F66j46j13K7k4m4j85j1Q1j63K19k29L54k9n1K55p1q1r7K18j96l6p8K0J6j08O0J6L08l11
-347B67L16j4O0j77Q8L9j05j67J59j27j40K09N8j65L23k6o9K32P5k29J98j99j5NJ9j63J36
-480E88j80L71j73K3R2K6J41
-514H88
##PAGE=	F1=-1149.2
##FIRST=	4521.1594499999982872,	4521.1594499999982872,	0
##DATA TABLE=	(F2++(Y..Y)), PROFILE
$$ plain form
4521 811 634 941 735 590 905 465 577 530 539 388 529 612 641 542 785 570 791 655 500 574 585 439 305 480 472 222 650
4388 650 276 349 495 408 618 473 549 370 519 371 309 336 187 275 175 334 279 310 533 518 273 434 399 248 486 285 255
4255 255 232 180 167 446 276 170 371 395 516 355 478 196 418 199 257 63 195 246 193 170 195 411 335 137 595 384 245
4122 245 536 89 243 204 183 42 45 250 226 384 223 430 281 377 373 123 368 184 137 116 224 166 290 172 132 504 180
3990 180 402 243 298 345 243 200 211 164 248 77 300 327 218 370 241 338 180 262 163 350 133 190 222 136 60 98 158 212 163
3847 163 376 243 287 237 224 251 218 274 186 94 57 166 206 40 224 62 283 453 221 214 339 225 117 48 201 61 266 19
3709 19 82 210 203 145 275 166 321 262 420 59 264 178 69 157 103 139 224 330 264 242 154 194 380 152 305 237 76 114 198
3566 198 200 180 97 113 273 277 42 405 204 144 155 170 278 72 174 103 118 288 120 124 170 250 263 334 241 205 155 120 327 262 19
$$ packed form
4521H11j77L07k06j45L15m40J12m7Rj51J41Q3K9r9K43k15K21j36j55P4J1j46j34J75qk50M28
4388F50l74P3J46q7K10j45P6j79J49j48o2K7j49Q8j00J59n5L1K23j5k45J61l5j51K38k01l0
4255B55k3n2j3K79j70j06K01K4J21j61J23k82K22k19N8j94J32N1n3k3K5K16p6j98M58k11j39
4122B45K91m47J54l9k1j41LK05k4J58j61K07j49R6mk50K45j84m7k1J08n8J24j18m0L72l24
3990A80K22j59N5M7j02m3J1m7Q4j71K23K7j09J52j29R7j58Q2r9J87k17N7L2q6p6L8O0N4m9
3847A63K13j33M4n0j3K7l3N6q8r2l7J09M0j66J84j62K21J70k32pJ25j14j08o9J53j40K05k47
3709A9O3J28pn8J30j09J55n9J58l61K05q6j09Q8n4L6Q5J06o6k2q8M0J86k28J53o8j61L8Q4
3566A98Kk0q3J6J60Mk35L63k01o0J1J5J08k06J02p1J5J70j68MM6Q0J3P1r3l6n0l5K07o5k43
$$ plain form
3414 19 195 173 290 129 89 160 221 371 131 122 212 173 110 48 106 57 94 97 255 63 216 278 89 294 301 80 221 217 178 77 118
3261 118 163 148 135 198 251 104 258 67 259 260 66 88 232 216 132 150 154 157 74 318 221 175 124 204 253 245 268 324 122 86 38 122 168
3099 168 179 177 161 139 280 879 290 335 77 145 154 32 182 78 104 126 128 137 269 119 273 109 231 120 26 87 360 459 770
2956 770 514 347 178 218 183 294 133 217 251 116 195 100 241 5 242 264 45 368 61 272 61 259 109 286 172 23
2828 23 135 231 55 31 74 112 81 189 88 211 231 263 207 136 194 209 153 200 161 120 200 155 220 2 232 220 238 138 306 106
2680 106 215 96 72 114 130 45 70 109 227 162 203 209 255 99 137 248 76 141 131 71 155 160 422 350 112 288 158 150 170 87 343
2528 343 193 209 82 56 160 154 123 67 247 132 177 185 122 179 137 118 146 290 186 102 172 167 288 190 105 240 374 288 144 157 143
2375 143 192 157 139 94 45 98 145 227 297 173 166 84 308 178 45 257 15 135 47 79 211 156 176 179 191 165 236 151 131 234 297
$$ packed form
3414A9J76k2J17j61m0P1O1J50k40rR0l9o3o2N8m9L7LJ58j92J53O2j89K05Pk21J41ml9j01M1
3261A18M5j5j3O3N3j47J54j91J92Jj94K2J44j6q4J8MLq3K44r7m6n1Q0M9qK3N6k02l6m8Q4M6
3099A68J1kj6k2J41N99n89M5k58O8Rj22J50j04K6K2KRJ32j50J54j64J22j11r4O1K73R9L11
2956G70k56j67j69M0l5J11j61Q4L4j35P9r5J41k36K37K2k19L23l07K11k11J98j50J77j14j49
2828B3J12R6j76k4M3L8l1J08j01J23K0L2n6p1N8J5n6M7l9m1Q0m5O5k18K30j2J8j00J68k00
2680A06J09j19k4M2J6q5K5L9J18o5M1OM6j56L8J11j72O5j0o0Q4NK62p2k38J76j30qK0q3K56
2528C43j50J6j27k6J04ol1n6J80j15M5Qo3N7m2j9K8J44j04q4P0nJ21r8q5J35J34q6j44J3j4
2375A43M9l5j8m5m9N3M7Q2P0j24pq2K24j30j33K12k42J20q8L2J32n5K0LJ2k6P1q5k0J03O3
$$ plain form
2222 297 198 19 117 157 154 159 162 306 135 214 210 210 31 222 269 149 253 81 163 43 209 246 106 193 218 117 125 214 211 242 197 210
2065 210 121 22 206 60 40 334 64 92 255 252 143 203 277 140 293 338 232 245 1061 2985 1615 157 132 252 341 171
1937 171 105 204 433 39 260 372 206 197 134 291 80 121 133 353 95 119 299 373 114 644 278 553 363 395 399 626 155
1804 155 362 249 354 275 641 617 1031 848 1232 1683 1889 2092 2733 3155 4064 5166 7243 11894 22520 96704 91234
1701 91234 407129 255775 412537 77176 102159 26435 13290 8236 5465 4287 3052 2610 2332 1646 1587 1482
1622 1482 577 1020 749 443 440 535 173 408 452 443 499 301 408 324 379 434 275 200 157 97 117 69 90 113 445 294 253 137 483
1479 483 178 83 313 197 95 267 18 124 277 72 248 233 209 283 218 315 232 128 48 251 14 163 95 220 230 475 331
1346 331 201 836 553 710 77 90 368 374 124 337 154 144 276 372 193 366 201 293 260 137 302 204 203 93 181 11 354
$$ packed form
2222B97r9j79R8M0lNLJ44j71P9m%j79J91M7j20J04j72Q2j20J66L7j40Q7K5j01QQ9lL1m5J3
2065B10q9r9J84j46k0K94k70K8J63lj09O0P4j37J53M5j06J3Q16J924j370j458k5J20Q9j70
1937A71o6R9K29l94K21J12j66ro3J57k11M1J2K20k58K4J80P4k59N30l66K75j90L2MK27m71
1804A55K07j13J05p9L66k4M14j83L84M51K06K03O41M22R09J102K077M651J0626P4184n470
1701I1234L15895j51354J56762l35361K4983p5724j3145n054k771j178j235m42k78o86n9j05
1622A482r05M43k71l06lR5l62K35M4rN6j98J07q4N5N5j59p5m3o0K0m8K1K3L32j51m1j16L46
1479D83l05r5K30j16j02J72k49J06J53k05J76j5k4P4o5R7q3j04q0K03k37J49o8J25J0K45j44
1346C31j30O35k83J57o33J3K78Ok50K13j83j0J32R6j79J73j65R2l3j23J65r8jj10Q8j70L43
$$ plain form
1213 354 295 228 255 530 212 123 338 182 230 242 160 52 320 230 349 270 254 249 364 323 294 340 219 340 299 180 212 154 95 276
1066 276 360 329 204 523 212 438 262 378 208 480 189 148 228 311 130 334 151 427 432 467 502 297 400 302 362 373 275 375
928 375 313 201 283 285 388 537 320 644 431 465 652 168 486 275 331 476 265 525 482 453 548 495 557 568 595 376 663 531
790 531 515 453 343 414 605 535 477 886 646 716 735 769 954 715 717 683 681 804 651 796 749 964 1029 1048 1038 1122 1099 1164 1104 1407 1136
638 1136 1211 1580 1392 1614 1952 2748 3204 2807 4044 1803 3225 2756 2962 2582 1971 1326 5523 20985 429794 475020
539 475020 30305 461783 436821 41316 8937 1774 1336 2293 2689 2656 2774 734 4871 2467 3908 1919 1883
455 1883 1694 1646 1413 1033 1168 1289 1067 832 1209 1091 1149 1189 1104 944 984 732 890 517 721 745 688 673 698 820 763 635 1036
323 1036 563 865 630 505 556 500 358 510 596 305 615 616 448 677 751 676 497 398 685 216 336 283 229 236 487 500 412 355
$$ packed form
1213C54n9o7K7K75l18q9K15j56M8J2q2j08K68r0J19p9j6nJ15m1k9M6j21J21m1j19L2n8n9J81
1066B76Q4l1j25L19l11K26j76J16j70K72k91m1Q0Q3j81K04j83K76NL5L5k05J03r8O0J1r8J00
928C75o2j12Q2KJ03J49k17L24k13L4J87m84L18k11N6J45k11K60m3k9R5n3O2J1K7k19K87j32
790E31j6o2j10P1J91p0n8M09k40P0J9L4J85k39Kl4kJ23j53J45m7K15O5J9j0Q4k3O5o0L03k71
638A136P5L69j88K22L38P96M56l97J237k241J422m69K06l80o11o45M197J5462M08809M5226
539D75020m44715M31478k4962l95505l2379p163m38R57L96l3J18k040M137k404J441j989l6
455A883j89m8k33l80J35J21k22k35L77j18N8M0q5j60M0k52J58l73K04K4n7j5K5J22n7j28M01
323A036m73L02k35j25N1n6j42J52Q6k91L10Jj68K29P4p5j79r9K87m69J20n3n4PK51J3q8n7
$$ plain form
185 355 654 489 572 588 345 391 430 269 263 343 233 115 368 314 368 657 482 514 374 449 436 325 255 275 157 148 127 281 428
42 428 368 373 416 557 442 487 345 341 193 205 137 265 214 173 405 256 483 260 512 535 411 285 371 469 58 348 69 91 272
-101 272 210 234 401 597 328 408 346 524 356 276 421 217 143 183 229 60 370 426 299 373 652 501 406 419 365 319 158 122
-239 122 206 83 326 115 435 423 368 613 478 480 322 485 379 299 228 260 350 165 269 281 590 297 589 555 599 390 537
-371 537 527 425 339 363 339 212 410 480 329 623 591 491 734 818 600 776 556 516 558 551 426 577 381 760 628 631 721 700
-509 700 878
$$ packed form
185C55K99j65Q3J6k43M6L9j61oQ0j10j18K53n4N4K89j75L2j40P5j3j11p0K0j18rk1J54J47
42D28o0NM3J41j15M5j42mj48J2o8J28n1m1K32j49K27k23K52K3j24j26Q6R8m11K90k79K2J81
-101B72o2K4J67J96k69Q0o2J78j68q0J45k04p4M0M6j69L10N6j27P4K79j51r5J3n4m6j61l6
-239A22Q4j23K43k11L20j2n5K45j35Kj58J63j06q0p1L2R0j85J04J2L09k93K92l4M4k09J47
-371E37j0j02q6K4k4j27J98P0j51K94l2j00K43Q4k18J76k20m0M2pj25J51j96L79j32LR0k1
-509G00J78
-514H78
##PAGE=	F1=-1159.05
##FIRST=	4521.1594499999982872,	4521.1594499999982872,	0
##DATA TABLE=	(F2++(Y..Y)), PROFILE
$$ plain form
4521 721 562 857 652 489 810 373 501 477 500 298 499 613 600 486 720 506 702 586 424 513 519 354 269 416 482 203
4393 203 635 260 309 474 348 588 431 485 287 469 331 270 330 147 262 185 312 269 300 473 472 245 414 329 235 403 262
4260 262 177 244 149 246 421 280 168 348 335 493 309 462 123 383 173 245 30 160 240 149 178 161 391 342 113 575 318
4127 318 213 473 51 214 109 228 24 105 248 213 424 144 416 281 333 377 70 334 140 119 108 249 194 267 172 148 516
3994 516 176 405 185 319 269 166 186 195 162 246 48 313 321 200 346 254 323 118 235 142 341 71 175 158 148 65 72 198 185
3852 185 157 387 215 284 194 182 276 157 281 163 70 53 225 212 35 251 77 230 433 217 180 321 138 131 39 153 56 270
3714 270 16 88 225 173 166 217 135 306 291 375 26 232 148 59 125 142 121 218 329 259 176 149 209 377 166 268 254 73 68 165 155
3561 155 184 105 127 253 288 90 369 197 139 147 125 231 44 185 70 106 279 102 119 191 244 204 291 215 188 117 112 364 268 32
$$ packed form
4521G21j59K95k05j63L21m37J28k4K3k02K01J14j3j14K34k14J96j16j62Q9Oj65q5J47O6k79
4393B03M32l75M9J65j26K40j57N4j98J82j38o1O0j83J15p7J27m3L1J73jk27J69q5r4J68j41
4260B62q5O7r5R7J75j41j12J80j3J58j84J53l39K60k10P2k15J30Q0r1K9j7K30m9k29M62k57
4127C18j05K60m22J63j05J19k04Q1J43l5K11k80K72j35N2M4l07K64j94k1j1J41n5P3r5k4L68
3994E16l40K29k20J34n0j03K0Rl3Q4j98K65Qj21J46r2O9k05J17r3J99k70J04j7j0q3PJ26j3
3852A85k8K30j72O9r0j2R4j19J24j18r3j7J72j3j77K16j74J53K03k16l7J41j83pr2J14r7K14
3714B70k54P2J37n2pN1q2J71j5Q4l49K06q4q9O6J7k1R7J11p0q3k7O0J68k11J02j4j81nR7j0
3561A55K9p9K2J26L5j98K79j72n8Qk2J06j87J41j15L6J73j77J7P2N3m0Q7p6k7p1nK52r6k36
$$ plain form
3414 32 193 183 295 167 62 131 193 335 113 116 168 162 118 97 145 65 97 89 283 103 170 240 89 233 291 114 180 260 165 116 140
3261 140 166 132 143 162 239 106 237 74 208 245 43 86 202 201 122 195 126 207 64 319 219 160 79 216 199 159 170 315 77
3118 77 112 49 110 183 174 139 167 108 302 906 308 272 95 114 152 23 140 65 83 127 148 124 248 85 244 87 217 44 20 110
2971 110 315 361 706 478 279 124 245 177 238 95 243 208 123 168 114 220 84 200 219 40 386 124 282 53 234 104
2843 104 211 203 39 129 218 75 26 68 96 88 183 79 221 188 197 177 134 204 172 157 177 171 97 193 192 240 73 235 202 248 96 303 71
2680 71 234 66 66 137 125 39 52 89 198 130 191 135 252 115 137 231 68 121 144 62 143 138 421 355 80 257 114 164 191 47 274
2528 274 236 194 92 92 162 168 122 84 226 133 176 130 134 169 104 118 143 282 207 88 181 181 275 199 90 232 376 287 120 83 150 173 143
2365 143 117 90 48 86 139 225 282 150 156 94 314 153 48 243 58 143 59 81 182 198 157 151 167 169 148 201 69 185 248 165 37
$$ packed form
3414C2J61j0J12j28j05O9O2J42k22LN2om4k1M8q0L2qJ94j80O7P0j51J44N8j77O6Q0r5m9K4
3261A40K6l4J1J9P7j33J31j63J34L7k02M3J16jp9P3o9Q1j43K55j00n9q1J37j7m0J1J45k38
3118G7L5o3O1P3rl5K8n9J94O04n98l6j77J9L8j29J17p5J8M4K1k4J24j63J59j57J30j73k4R0
2971A10K05M6L45k28j99j55J21o8O1j43J48l5q5M5n4J06j36J16J9j79L46k62J58k29J81j30
2843A04J07qj64R0Q9j43m9M2K8qR5j04J42l3Rk0m3P0l2j5K0op4R6jM8j67J62l3M6j52K07k32
2680G1J63j68%P1j2q6J3L7J09o8O1n6J17j37K2R4j63N3K3q2Q1nK83o6k75J77j43N0K7j44K27
2528B74l8m2j02%P0Om6l8J42r3M3m6ML5o5J4K5J39p5j19R3%R4p6j09J42J44q9j67l7O7K3l0
2365A43k6k7m2L8N3Q6N7j32Oo2K20j61j05J95j85Q5q4K2J01J6m1oJ6Kk1N3j32J16O3q3j28
$$ plain form
2213 37 101 181 169 150 116 361 126 163 264 167 79 177 225 133 220 120 146 50 223 269 115 200 238 139 59 216 137 239 192 212 109
2060 109 78 190 54 31 311 57 86 282 200 145 152 263 110 255 341 198 245 1038 2926 1670 145 172 263 311 149 107 223
1927 223 394 31 244 338 177 177 98 275 63 134 44 289 13 82 291 323 101 640 249 496 288 364 362 566 114 303 227
1794 227 297 275 628 557 935 773 1124 1496 1669 1825 2451 2766 3627 4570 6406 10313 19859 85795 82968 365467 233982
1691 233982 374456 71749 94033 24289 12300 7536 4981 3899 2744 2285 2116 1483 1385 1402 455 942 656 364
1602 364 423 484 123 361 401 431 491 288 413 260 329 393 239 150 130 106 95 113 61 123 455 252 219 142 403 155 129 297 161
1460 161 67 251 20 143 302 59 211 222 175 282 217 307 200 129 77 282 40 166 75 205 260 593 458 233 1024 521
1332 521 647 101 32 371 374 130 334 132 151 262 337 194 332 213 284 220 168 205 194 233 148 183 40 334 295 151 227 522
$$ packed form
2213C7O4Q0j2j9l4K45k35L7J01r7q8R8M8r2Q7j00K6r6J73M6j54Q5L8r9q0J57p9J02m7K0j03
2060A09l1J12j36k3K80k54K9J96q2n5PJ11j53J45Q6j43M7P93J888j256j525K7R1M8j62m2J16
1927B23J71l63K13R4j61%p9J77k12P1r0K45k76O9K09L2k22N39l91K47k08P6kK04m52J89p6
1794B27P0k2L53p1L78j62L51L72J73J56O26L15Q61R43J836L907R546O5936k827K82499j31485
1691B33982J40474l02707K2284o9744j1989m764k555j082j155m59j69o33r8J7r47M87k86k92
1602C64N9O1l61K38M0L0O0k03J25j53O9O4j54q9k0k4j1J8n2O2L32k03l3p7K61k48k6J68j36
1460A61r4J84k31J23J59k43J52J1m7J07o5R0j07p1n2K05k42J26r1J30N5L33j35k25P91n03
1332E21J26n46o9L39Lk44K04k02J9J11P5j43J38j19P1o4n2L7j1L9q5L5j43K94l9j44P6K95
$$ plain form
1194 522 192 76 298 172 170 227 199 61 278 244 337 299 232 205 335 330 248 332 180 318 240 147 213 192 88 254 328 297 174 512
1046 512 195 393 226 368 149 432 180 136 164 343 145 341 149 435 383 406 498 245 334 266 332 343 221 354 293 187 284
913 284 303 305 511 348 592 397 380 567 158 458 263 308 451 259 483 474 439 491 473 522 479 554 316 581 487 507 370 305 367
770 367 598 508 450 812 589 663 645 680 912 606 670 635 573 777 585 685 737 864 966 965 1004 975 996 1094 941 1311 990 1099 1454
628 1454 1246 1499 1765 2551 2989 2562 3668 1638 2944 2474 2683 2332 1874 1294 4891 18619 387413 430150 28298
534 28298 417340 396024 37230 8252 1631 1209 2169 2538 2420 2523 702 4372 2284 3472 1726 1644 1523 1502
446 1502 1273 954 1042 1214 1004 781 1096 965 1079 1070 993 844 891 620 791 449 703 709 650 634 680 713 697 625 936 486 772 557
308 557 439 500 441 274 526 545 309 594 592 374 635 692 583 428 365 619 145 368 201 205 244 491 494 386 306 667 434 508
$$ packed form
1194E22l30j16K22j26kN7k8j38K17l4R3l8o7k7J30nq2Q4j52J38p8r3O6k1j04J66P4l1j23L38
1046E12l17J98j67J42k19K83k52m4K8J79j98J96j92K86n2K3R2k53Q9o8O6J1j22J33o1j06R7
913B84J9KK06j63K44j95j7J87m09L00j95M5J43j92K24rl5N2j8M9m3P5k38K65r4K0j37o5O2
770C67K31r0n8L62k23P4j8L5K32l06O4l5o2K04j92J00N2J27J02jL9k9K1R8j53L70l21J09L55
628A454k08K53K66P86M38m27J106k030J306m70K09l51m58n80L597J3728L68794M2737m01852
534B8298L89042k1316l58794k8978o621m22R60L69j18J03j821L670k088J188j746q2j21k1
446A502k29l19Q8J72k10k23L15j31J14rp7j49M7k71J71l42K54On9j6M6L3j6p2L11m50K86k15
308E57j18O1n9j67K52J9k36K85kk18K61N7j09j55o3K54m74K23j67ML9K47Lj08q0L61k33P4
$$ plain form
170 508 543 278 315 367 242 219 340 234 166 330 330 350 610 437 476 360 337 378 273 198 237 175 117 107 323 425 377 340 392 524
22 524 372 408 294 299 145 201 157 249 255 177 399 218 482 208 496 452 360 220 344 417 56 294 72 85 242 228 243 393 564
-120 564 283 362 287 494 320 236 380 175 134 191 254 95 379 399 289 345 604 446 375 367 310 264 164 68 200 75 339 124
-258 124 420 403 351 580 388 464 260 368 365 229 197 211 381 131 259 279 566 302 547 503 528 301 509 438 347 371 231 323
-396 323 208 391 460 327 573 535 420 644 751 547 703 471 408 483 478 373 528 335 688 612 583 660 606 805
$$ packed form
170E08L5k65L7N2j25k3J21j06o8J64%K0K60j73L9j16k3M1j05p5L9o2n8j0K16J02m8l7N2J32
22E24j52L6j14Nj54N6m4R2Op8K22j81K64k74K88m4r2j40J24P3l61K38k22J3J57j4J5J50J71
-120E64k81P9p5K07j74q4J44k05m1N7O3j59K84K0j10N6K59j58p1qn7m6j00r6J32j25K64k15
-258A24K96j7n2K29j92P6k04J08lj36l2J4J70k50J28K0K87k64K45m4K5k27K08p1r1K4j40R2
-396C23j15J83O9j33K46l8j15K24J07k04J56k32o3P5nj05J55j93L53p6k9P7n4J99
-514H05
##PAGE=	F1=-1168.89
##FIRST=	4521.1594499999982872,	4521.1594499999982872,	0
##DATA TABLE=	(F2++(Y..Y)), PROFILE
$$ plain form
4521 587 481 713 550 369 671 273 405 404 438 198 429 575 517 402 605 411 564 497 329 421 428 258 241 330 460 181 596
4388 596 228 247 429 258 519 359 391 215 400 273 215 312 112 225 214 270 222 274 389 387 213 383 271 209 320 234 106
4255 106 231 122 313 382 273 148 298 252 436 256 420 39 340 144 220 78 127 209 134 154 130 341 322 89 511 253
4127 253 171 379 37 193 87 249 34 158 240 196 427 84 373 257 259 349 77 297 86 108 110 271 199 227 163 158 498 186
3990 186 375 111 331 186 90 156 167 166 232 34 303 290 182 302 255 273 59 199 120 316 11 151 124 151 77 36 223 149
3852 149 123 370 183 264 131 148 276 110 281 127 73 53 257 197 51 254 98 157 387 208 131 291 60 125 36 104 46
3719 46 263 18 102 227 130 170 150 124 273 293 322 33 190 111 66 94 169 107 198 322 244 117 152 210 362 209 218 251 69 56
3571 56 131 122 194 106 137 211 278 139 320 182 142 128 84 168 65 190 46 102 255 66 102 190 235 133 239 167 166 65 107 384
$$ packed form
4521E87j06K32j63j81L02l98J32jL4k40K31J46n8j15K03j94J53o7j68R2Pj70j7Q9J30k79M15
4388E96l68J9J82j71K61j60L2j76J85j27n8R7k00J13j1N6m8N2J15kj74J70j12o2J11q6j28
4255A06J25j09J91O9j09j25J50m6J84j80J64l81L01j96P6j42M9Q2p5K0k4K11j9k33M22k58
4127B53q2K08l42J56j06J62k15J24Q2m4K31l43K89j16KR0k72K20k11K2KJ61p2K8o4nL40l12
3990A86J89k64K20j45r6O6J1jO6j98K69j3j08J20m7J8k14J40p9J96l05J40k7K7p4m1J87p4
3852A49k6K47j87Q1j33J7J28j66J71j54n4k0K04o0j46K03j56N9K30j79p7J60k31O5q9O8n8
3719D6K17k45Q4J25r7M0k0k6J49K0K9k89J57p9m5K8P5o2R1J24p8j27L5N8J52j53RL3j82j3
3571E6P5rP2q8L1P4O7j39J81j38m0j4m4Q4j03J25j44N6J53j89L6Q8M5j02J06p2jj01M2K77
$$ plain form
3424 384 265 60 177 167 274 196 50 97 152 283 93 113 141 127 131 155 160 62 96 111 305 133 114 193 87 145 278 136 124 293
3276 293 178 151 159 162 107 153 121 214 90 206 98 137 217 20 81 158 183 116 248 102 246 80 287 206 137 48 214 139 82 155
3128 155 388 72 143 47 91 192 155 104 155 65 282 865 300 192 111 89 149 42 104 56 74 135 165 98 209 57 197 66 187
2985 187 66 53 119 281 282 638 427 183 79 256 153 175 47 251 159 125 144 125 196 154 163 156 55 381 196 290 61 199 92
2843 92 133 222 55 148 186 97 70 58 81 102 166 63 221 127 119 150 135 208 138 155 157 182 86 164 227 247 142 230 185 241 72 286 80
2680 80 228 58 46 156 110 63 37 64 161 99 167 73 238 145 137 214 59 102 142 63 120 117 399 336 42 231 75 171 201 74 180
2528 180 279 189 91 113 148 169 114 96 200 131 151 85 129 146 76 108 157 274 217 101 180 195 258 201 101 218 358 267 107 13 151
2375 151 154 138 101 85 79 85 109 210 246 126 139 110 298 128 68 217 93 160 79 80 166 249 136 110 130 152 71 232 20 147 186 140
$$ packed form
3424C84j19k05J17j0J07p8j46M7N5J31j90K0K8j4MK4Nr8L4J5J94j72j9P9j06N8J33j42j2J69
3276B93j15k7QLn5M6l2R3j24J16j08L9Q0j97O1P7K5o7J32j46J44j66K07q1o9q9J66p5n7P3
3128A55K33l16P1r6M4J01l7n1N1r0K17N83n65j08q1k2O0j07O2m8J8O1L0o7J11j52J40j31J21
2985A87j21j3O6J62JL56k11k44j04J77j03K2j28K04r2l4J9j9P1m2Rpj01L26j85R4k29J38j07
2843I2M1Q9j67R3L8q9k7j2K3K1O4j03J58r4qL1j5P3p0J7KK5r6P8O3K0j05Q8m5N6j69K14k06
2680H0J48j70j2J10m6m7k6K7R7o2O8r4J65r3qP7j55M3M0p9N7lK82o3k94J89j56R6L0j27J06
2528A80R9r0r8K2L5K1n5j8J04o9K0o6M4J7p0L2M9J17n7j16P9J5O3n7j00J17J40r1j60r4J38
2375A51Lj6l7j6oOK4J01L6j20J3k9J88j70o0J49j24O7q1JQ6Q3j13k6K0K2q1J61k12J27L9m6
$$ plain form
2218 140 61 92 189 178 129 59 393 112 98 293 115 117 139 168 115 167 153 122 70 218 265 128 184 248 157 98 222 53 226 163 196
2065 196 90 125 170 45 37 285 55 74 300 161 144 93 231 60 211 318 174 254 936 2692 1619 108 187 257 270 121
1937 121 118 226 333 46 217 294 132 148 59 245 85 155 36 224 68 42 268 255 121 601 217 420 193 317 323 469 104
1804 104 235 229 219 265 562 467 790 638 931 1233 1350 1457 2029 2242 2986 3736 5258 8250 16200 70501 69873 303022
1696 303022 197988 313306 62012 79950 20663 10577 6399 4220 3277 2263 1822 1763 1248 1103 1224 335 794
1612 794 535 279 381 402 141 275 324 396 449 260 389 175 261 333 190 95 104 102 69 137 37 132 416 200 169 158 279 133 158
1469 158 285 122 52 227 26 149 310 45 170 206 119 263 204 272 156 132 111 286 66 153 61 171 271 655 556 275 1301
1337 1301 857 611 142 28 361 356 138 318 103 149 238 289 192 282 211 248 161 191 90 168 258 203 169 74 288 272 68 183 484
$$ packed form
2218A40p9L1R7j1m9p0L34k81j4J95j78KK2K9n3N2j4l1n2J48M7j37N6O4r1n9J24j69J73o3L3
2065A96j06L5M5j25qK48k30J9K26j39j7n1J38j71J51J07j44Q0O82J756j073j511P9P0J3j49
1937A21lJ08J07k87J71P7j62J6q9J86j60P0j19J88j56k6K26j3j34M80l84K03k27J24OJ46l65
1804A04J31oj0M6K97r5L23j52K93L02J17J07N72K13P44P50J522K992P950N4301o28K33149
1696C03022j05034J15318k51294J7938n9287j0086m178k179r43j014m41n9n15j45J21q89M59
1612G94k59k56J02K1k61J34M9P2N3j89J29k14Q6P2j43r5Rkl3O8j00R5K84k16l1j1J21j46K5
1469A58J27j63p0J75k01J23J61k65J25L6q7J44n9O8j16k4k1J75k20Q7r2J10J00L84r9k81J026
1337A301m44k46m69j14L33nk18J80k15M6Q9N1r7R0p1L7q7L0j01P8R0n5l4r5K14j6k04J15L01
$$ plain form
1194 484 153 31 258 139 106 211 246 74 225 231 311 300 188 145 299 317 187 303 153 271 175 109 213 237 78 220 271
1061 271 254 133 473 163 336 165 343 81 364 152 134 105 343 157 326 138 399 322 320 479 178 241 223 288 295 170 314
928 314 258 148 266 320 205 453 359 493 351 289 445 144 413 277 263 408 228 413 429 399 390 425 457 368 476 237 470 404
790 404 478 272 251 294 545 452 401 678 507 560 526 550 820 465 588 555 447 701 470 552 673 710 835 822 898 776 834 954
652 954 725 1146 794 918 1234 1033 1284 1482 2198 2569 2159 3074 1381 2487 2047 2255 1939 1653 1120 4002 15345 323718
544 323718 360423 24120 349628 331875 31182 7178 1481 980 1900 2223 2017 2119 630 3617 1957 2846
465 2846 1429 1321 1263 1280 1069 825 845 1063 879 676 917 769 956 889 820 691 760 462 675 361 634 648 565 554 600 568 593
332 593 575 782 374 650 451 354 419 369 183 520 459 294 524 529 262 554 596 450 334 308 523 87 393 132 177 233 465
$$ packed form
1194D84l31j22K27j19l3J05L5j72J51OQ0j1j12m3J54J8j30J16j50J18r6o6J04K4j59J42N1
1061B71j7j21L40l10J73j71J78k62K83k12j8k9K38j86J69j88K61p7kJ59l01O3j8O5Pj25J44
928C14n6j10J18N4j15K48r4J34j42o2J56l01K69j36j4J45j80J85J6l0rL5L2q9J08k39K33o6
790D04P4k06k1M3K51r3n1K77j71N3l4K4K70l55J23l3j08K54k31Q2J21L7J25j3P6j22N8J20
652I54k29M21l52J24L16k01K51J98P16L71m10R15j693J106m40K08l16k86n33K882J1343L08373
544C23718L6705l36303L25508j7753l00693k4004n697n01R20L23k06J02j489K987j660Q89
465B846j417j08n8J7k11k44K0K18j84k03K41j48J87o7o9j29O9k98K13l14K73J4q3j1M6l2K5
332E93j8K07m08K76j99r7O5n0j86L37o1j65K30Nk67K92M2j46j16k6K15m36L06k61M5N6K32
$$ plain form
199 465 449 334 237 639 363 399 468 204 226 277 210 173 321 217 200 267 324 303 539 353 403 330 211 308 214 131 189 174 103 94 335
47 335 396 361 287 339 454 274 312 237 234 102 203 183 228 273 168 364 154 459 145 437 351 281 145 305 351 113 232 63 122
-96 122 198 227 233 346 508 209 299 216 441 273 190 328 143 165 191 254 114 366 332 261 293 532 364 320 288 250 218 196 61 236
-244 236 62 345 107 385 350 302 515 274 411 184 250 339 145 178 156 386 101 222 261 511 275 465 421 430 206 460 325
-376 325 248 394 88 293 185 355 409 295 484 434 335 504 642 459 595 362 290 382 410 296 450 279 578 552 495 547 484
-509 484 678
$$ packed form
199D65j6j15r7M02k76L6O9k64K2N1o7l7J48j04j7O7N7k1K36j86N0p3j19R7r4q3N8j5p1rK41
47C35O1l5p4N2J15j80L8p5lj32J01k0M5M5j05J96k10L05l14K92q6p0j36J60M6k38J19j69N9
-96A22P6K9OJ13J62k99R0q3K25j68q3J38j85K2K6O3j40K52l4p1L2K39j68m4l2l8l2k2j35J75
-244B36j74K83k38K78l5m8K13k41J37k27O6Q9j94L3k2K30k85J21L9K50k36J90m4Rk24K54j35
-376C25p7J46l06K05j08J70N4j14J89n0r9J69J38j83J36k33p2R2K8j14J54j71K99k6n7N2o3
-509D84J94
-514F78
##PAGE=	F1=-1178.74
##FIRST=	4521.1594499999982872,	4521.1594499999982872,	0
##DATA TABLE=	(F2++(Y..Y)), PROFILE
$$ plain form
4521 428 401 534 448 255 511 183 299 327 362 97 331 503 407 306 455 302 407 400 231 314 332 169 224 233 408 170 541
4388 541 188 173 367 150 426 273 277 196 327 205 156 283 80 173 236 213 151 232 292 275 181 346 259 178 256 213 76 201 99
4246 99 360 341 254 117 232 157 354 207 359 45 292 120 187 117 109 157 137 107 108 272 276 74 421 197 125 268 56 182 158
4103 158 243 64 198 232 201 393 86 308 210 162 299 140 259 31 93 120 288 182 182 143 163 456 206 318 34 331 109
3970 109 47 121 130 164 209 39 270 237 169 252 246 198 13 164 110 278 36 125 120 148 85 12 232 107 73 330 153 228 63 125 254
3817 254 102 272 95 81 66 256 162 61 234 120 83 323 187 94 254 66 104 41 59 38 244 14 119 218 78 156 80
3684 80 138 233 272 267 49 142 84 78 64 180 115 168 307 223 122 164 197 333 255 168 229 67 91 102 118 200 107 139 155 250 181 267 164
3522 164 139 100 70 103 93 191 39 105 217 31 71 167 229 59 189 103 145 9 106 381 249 87 149 129 231 210 87 64 108
$$ packed form
4521D28k7J33q6j93K56l28J16K8L5k65K34J72r6j01J49j53J05pj69Q3J8j63N5RJ75k38L71
4388E41l53j5J94k17K76j53Mq1J31j22m9J27k03R3O3k3o2Q1O0j7r4J65q7q1P8m3j37J25j02
4246I9K61j9q7j37J15p5J97j47J52l14K47j72O7p0qM8k0l0JJ64Mk02L47k24p2J43k12J26k4
4103A58Q5j79J34L4l1J92l07K22r8m8J37j59J19k28O2K7J68j06%l9K0K93k50J12k84K97k22
3970A09o2P4RL4M5j70K31l3o8Q3om8j85J51n4J68k42Q9nK8o3p3K20j25l4K57j77P5j65O2J29
3817B54j52J70j77j4j5J90r4j01J73j14l7K40j36r3J60j88L8o3J8k1K06k30J05R9j40P8p6
3684H0N8R5L9nk18R3n8oj4J16o5N3J39q4j01M2L3J36p8q7O1j62K4J1J6Q2r3L2J6R5o9Q6j03
3522A64k5l9l0L3j0R8j52O6J12j86M0R6O2j70J30q6M2j36R7K75j32j62O2k0J02k1j23k3M4
$$ plain form
3379 108 225 71 112 138 82 151 202 148 56 91 158 321 151 72 144 84 41 265 138 64 312 202 173 168 152 81 160 98 178 63 166
3227 166 115 58 178 6 77 113 168 123 292 96 272 104 223 188 112 67 201 85 54 280 523 123 177 31 76 196 120 79
3089 79 127 14 235 782 271 114 124 82 146 67 74 55 101 155 175 60 158 32 136 54 145 152 79 117 262 236 583 372 86 77 248
2936 248 118 109 27 244 109 125 126 132 170 205 148 98 103 356 268 295 81 166 78 62 231 53 179 138 115 95 49 81 123 139 52 209
2779 209 60 44 133 150 204 111 146 145 194 90 113 257 251 202 214 174 225 74 260 103 198 66 38 172 92 75 30 42 118 78 131 84
2621 84 219 181 137 194 68 84 126 75 89 100 359 298 20 211 69 161 204 115 96 313 186 83 116 120 158 111 99 172 128 107 60
2469 60 109 115 59 86 181 268 215 123 168 208 245 199 126 204 324 233 103 62 147 137 147 104 90 90 90 63 184 197 103 120 132 273 107 93
2301 93 185 115 189 106 80 169 292 122 71 80 113 26 241 72 132 120 127 86 87 181 184 100 32 399 92 31 294 59 137 113 128 102 118
$$ packed form
3379A08J17j54M1K6n6O9N1n4r2L5O7J63j70p9P2o0m3K24j27p4K48j10k9nj6p1P9o2Q0j15J03
3227A66n1n7J20j72P1L6N5m5J69j96J76j68J19l5p6m5J34j16l1K26K43m00N4j46M5J20p6m1
3089G9M8j13K21N47n11j57J0m2O4p9Pj9M6N4K0j15R8j26J04q2R1Pp3L8J45k6L47k11k86rJ71
2936B48j30rq2K17j35J6JOL8L5n7n0NK53q8K7k14Q5q8j6J69j78J26m1k3k0m6L2M2J6q7J57
2779B09j49j6Q9J7N4r3L5jM9j04K3J44om9J2m0N1j51J86j57R5j32k8J34q0j7m5J2P6m0N3m7
2621H4J35l8m4N7j26J6M2n1J4J1K59o1k78J91j42R2M3q9j9K17j27j03L3ML8m7j2P3m4k1m7
2469F0M9On6K7R5Q7n3r2M5M0L7m6p3P8J20r1j30m1Q5j0J0m3j4%%k7J21J3r4J7J2J41j66j4
2301I3R2p0P4q3k6Q9J23j70n1RL3q7K15j69O0j2Pm1JR4Lq4o8L67l07o1K63k35P8k4J5k6J6
$$ plain form
2139 118 174 90 84 196 236 136 148 246 169 192 239 54 209 115 162 65 158 146 52 51 258 61 51 306 151 140 38 190 9 176
1991 176 269 170 278 810 2411 1484 55 180 234 223 92 147 211 264 76 184 246 79 112 34 206 123 179 97 173 127 55 238
1853 238 172 152 534 192 340 99 265 283 352 118 172 240 158 245 453 359 622 469 688 939 982 1047 1546 1666 2247 2797 3975
1720 3975 6011 12117 53321 54283 230343 154114 239469 49757 62205 16132 8403 5009 3319 2529 1693 1299
1642 1299 1326 979 788 980 247 595 418 200 317 304 198 163 237 343 384 216 338 85 187 262 136 48 85 87 44 131 22
1509 22 140 343 151 123 168 127 112 166 273 85 55 200 41 137 304 45 134 181 55 230 184 217 108 132 127 267 90 125 61
1366 61 127 259 652 593 300 1681 1544 731 172 80 339 327 148 288 70 138 204 236 189 226 193 193 93 201 42 134 275 238
1228 238 143 106 224 232 11 139 425 98 29 223 100 48 196 292 95 171 197 274 276 132 81 268 283 122 256 140 208 116 70
$$ packed form
2139A18N6q4oJ12M0j00J2R8p7K3M7j85J55r4M7r7R3j2r4jK07j97j0K55j55j1j02J52j81J67
1991A76R3r9J08N32J601r27j429J25N4j1j31N5O4N3j88J08O2j67L3p8J72q3N6q2P6m6p2J83
1853B38o6k0L82l42J48k41J66J8O9k34N4O8q2Q7K08r4K63j53K19K51M3O5M99J20N81N50J178
1720C975K036O106M1204R62J76060p6229Q5355j89712J2448m6073p729l394j690p90q36l94
1642A299K7l47j91J92p33L48j77k18J17j3j06l5P4J06M1j68J22k53J02P5j26q8L7Km3Q7j09
1509B2J18K03j92k8M5m1j5N4J07j88l0J45j59R6J67k59Q9M7j26J75m6L3j09K4nJ40j77L5o4
1366F1O6J32L93n9k93J381j37q13n59r2K59j2j79J40k18O8O6L2m7L7l3%j00J08j59R2J41l7
1228B38r5l7J18Qk21J28K86l27o9J94j23n2J48R6j97P6K6P7Kj44n1J87J5j61J34j16O8r2m6
$$ plain form
1085 70 210 264 69 180 197 209 102 411 115 279 92 301 31 284 108 134 95 312 150 293 122 327 258 229 449 101
957 101 140 178 235 235 124 267 211 86 232 321 128 373 351 369 298 222 305 124 357 303 204 357 175 327 356 336 262 357 376 247
810 247 374 158 345 297 421 171 189 205 452 375 333 505 413 421 393 399 694 313 488 453 322 588 325 406 568 523 658 640 742
667 742 551 637 764 483 931 581 695 952 779 1001 1142 1734 2008 1658 2346 1060 1914 1532 1728 1447 1330 841 3005
554 3005 11744 247549 276027 18400 268075 253818 24101 5866 1336 684 1532 1782 1506 1625 521 2716
475 2716 1532 2110 1072 954 952 1005 829 661 604 857 712 531 697 532 799 677 611 510 606 277 556 269 524 560 447
352 447 441 471 407 469 490 599 257 520 328 265 320 294 113 490 354 258 419 436 127 445 476 301 231 243 409 50 400 110
214 110 148 204 412 369 268 174 577 289 261 375 142 140 176 181 132 284 179 208 192 299 230 451 244 312 291 89 236 157 65 138
$$ packed form
1085G0J40N4j95J11J7J2j07L09k96J64j87K09k70K53j76K6l9K17j62J43j71K05o9k9K20l48
957A01L9L8N7%j11J43n6j25J46Q9j93K45k2J8p1p6Q3j81K33n4r9J53j82J52K9k0p4R5J9j29
810B47J27k16J87m8J24k50J8J6K47p7m2J72r2Qk8OK95l81J75l5j31K66k63Q1J62m5J35j8J02
667G42j91Q6J27k81M48l50J14K57j73K22J41N92K74l50O88j286Q54l82J96k81j17m89K164
554C005Q739K35805K8478k57627K49675j4257k29717j8235m530o52Q48K50k76J19j104K195
475B716j184N78j038j18kN3j76j68n7K53j45j81J66j65K67j22o6j01R6l29K79k87K55L6j13
352D47oL0o4O2K1J09l42K63j92o3N5k6j81L77j36r6J61J7l09L18L1j75p0J2J66l59L50k90
214A10L8N6K08m3j01r4M03k88k8J14k33kL6Nm9J52j05K9j6J07o9K21k07O8k1k02J47p9r2P3
$$ plain form
67 138 160 100 97 318 347 327 228 263 361 163 214 183 154 83 202 211 201 265 153 310 80 420 87 341 247 188 71 262 289 154 172
-86 172 54 158 144 212 205 272 437 125 227 141 372 217 160 275 124 210 183 235 105 338 236 225 228 447 270 245 198 192 205 234
-234 234 121 281 53 339 73 330 277 228 430 155 329 106 162 304 79 161 114 362 81 159 230 435 221 359 320 322 140
-367 140 396 206 139 398 52 250 146 305 335 240 369 301 261 336 503 356 466 246 188 270 357 204 359 217 451 453 385
-499 385 401 359 515
$$ packed form
67A38K2o0lK21K9k0r9L5R8j98N1l1k9p1J19Rj0O4j12J57k30L40l33K54r4n9j17J91K7j35J8
-86A72j18J04j4O8pO7J65l12J02q6K31j55n7J15j51Q6k7N2j30K33j02j1LK19j77k5m7oJ3K9
-234B34j13J60k28K86k66K57n3m9K02k75J74k23N6J42k25Q2m7K48k81P8P1K05k14J38l9Kj82
-367A40K56j90o7K59l46J98j04J59L0r5J29o8m0P5J67j47J10k20n8Q2Q7j53J55j42K34Ko8
-499C85J6m2J56
-514E15
##PAGE=	F1=-1188.58
##FIRST=	4521.1594499999982872,	4521.1594499999982872,	0
##DATA TABLE=	(F2++(Y..Y)), PROFILE
$$ plain form
4521 269 329 349 359 167 357 127 191 262 287 2 223 405 288 219 290 197 274 303 144 204 247 132 213 143 334 177 477 153
4383 153 100 295 41 327 186 159 227 261 139 113 243 61 122 240 153 73 179 196 153 148 305 295 153 225 206 97 163 82 386
4241 386 311 225 89 162 69 261 171 287 117 245 104 150 132 108 90 137 45 99 202 212 71 328 157 82 158 74 179 222 212
4098 212 100 219 230 239 330 120 232 146 63 243 197 219 15 73 132 296 151 141 115 164 398 223 244 33 318 54 63 99 89
3955 89 152 187 46 218 168 161 212 228 114 35 136 114 232 61 98 117 144 83 63 226 65 47 274 126 180 40 108 216 123 251
3807 251 89 84 87 224 110 54 195 140 64 250 149 96 215 121 78 50 47 38 214 20 131 200 46 128 15 161 199 234 214 55
3660 55 94 79 85 34 176 135 133 283 206 185 181 171 292 284 133 195 68 137 81 130 198 118 134 96 216 211 222 150 121 73 85 80 107 191 51
3487 51 111 171 59 27 128 229 23 151 30 130 42 111 356 221 108 115 75 178 208 141 35 80 173 49 110 148 55 173 232
$$ packed form
4521B69O0K0J0j92J90k30O4P1K5k85K21J82j17o9P1r3P7K9j59O0M3j15Q1p0J91j57L00l24
4383A53n3J95k54K86j41k7O8L4j22k6J30j82O1J18q7q0J06J7m3nJ57j0j42P2j9j09O6q1L04
4241C86p5q6j36P3r3J92r0J16j70J28j41M6j8k4j8M7r2N4J03J0j41K57j71p5P6q4J05M3j0
4098B12j12J19J1RR1k10J12q6q3J80m6K2k04N8N9J64j45j0k6M9K34j75K1k11K85k64RL6j0
3955H9O3L5j41J72n0pN1J6j14p9J01k2J18j71L7J9K7o1k0J63j61j8K27j48N4j40O8J08r3J28
3807B51j62nLJ37j14n6J41n5p6J86j01n3J19r4m3k8lrJ76j94J11O9j54Q2j13J46L8L5k0j59
3660E5L9j5On1J42m1kJ50p7k1mj0J21qj51O2j27O9n6M9O8q0J6l8J20nJ1p2k9m8J2nK7Q4j40
3487E1O0O0j12l2J01J01k06J28j21J00q8O9K45j35j13Pm0J03L0o7j06M5R3j24O1L8r3J18N9
$$ plain form
3345 232 121 63 80 210 329 158 85 97 80 61 253 119 40 316 217 177 163 139 64 156 113 143 36 124 117 20 131 9 74 82 162
3192 162 141 315 108 284 121 133 168 90 104 184 72 64 410 649 173 212 19 75 200 77 69 93 39 184 678 226 94 134
3054 134 94 139 90 49 66 145 184 179 31 103 6 69 56 97 226 102 115 260 228 542 325 41 103 220 76 44 76 226 66 127
2907 127 113 137 142 234 162 105 162 319 334 293 106 139 72 7 230 37 206 81 126 105 49 100 149 108 73 187 23 45 127 179 192
2754 192 93 129 135 203 104 50 277 260 245 191 170 205 84 233 116 153 72 71 185 82 71 33 34 73 71 86 141 209 213 139 171 96 63 100
2587 100 96 56 87 307 251 51 198 87 131 203 145 95 328 177 72 104 86 145 122 96 145 127 55 57 78 82 48 53 204 267 205 140 148
2424 148 214 246 192 151 194 276 189 102 114 139 123 170 125 110 80 96 30 153 153 82 103 154 250 90 115 151 122 223 131 88 186 317 123
2262 123 66 35 57 34 231 127 135 61 123 106 87 166 191 67 79 378 69 42 270 11 139 96 142 100 111 185 54 90 157 190 137
$$ packed form
3345B32j11n8J7J30J19j71p3J2j7j9J92j34p9K76r9m0j4k4p5R2m3L0j07Q8pr7J11j22O5QQ0
3192A62k1J74k07J76j63J2L5p8J4Q0j12qL46K39m76L9j93N6J25j23qK4n4J45M94m52j32M0
3054A34m0M5m9m1J7P9L9nj48P2r7O3j3M1J29j24J3J45l2L14k17k84O2J17j44l2L2J50j60O1
2907A27j4K4NR2p2n7N7J57J5m1j87L3o7o5K23j93J69j25M5k1n6N1M9m1l5J14j64K2Q2N2J3
2754A92r9L6OO8r9n4K27j7j5n4k1L5j21J49j17L7q1jJ14j03j1l8JL9kJ5N5O8Mp4L2p5l3L7
2587A00mm0L1K20n6k00J47j11M4P2n8n0K33j51j05L2j8N9k3k6M9j8p2KK1Ml4NJ51O3o2o5Q
2424A48O6L2n4m1M3Q2q7q7J2K5j6M7m5j5l0J6o6J23%p1K1N1R6j60K5L6k9J01r2m3R8J31j94
2262A23n7l1K2k3J97j04Qp4O2j7j9P9K5j24J2K99l09k7K28k59J28m3M6m2J1P4j31L6O7L3n3
$$ plain form
2109 137 97 230 173 286 267 138 193 58 114 45 174 119 75 63 231 75 16 301 165 135 21 161 81 161 200 190 305 715
1971 715 2172 1299 29 158 198 172 74 184 182 199 111 153 200 33 75 42 159 150 196 134 141 159 105 210 84 175 451 181 266 61
1824 61 222 245 239 129 128 243 178 219 318 247 464 299 437 659 617 656 1094 1118 1524 1896 2736 3910 8196 36892 38955 159109
1696 159109 109803 164867 37126 43531 11373 6108 3571 2435 1781 1138 805 866 709 497 716 196 382 326 140
1602 140 241 208 249 46 161 279 304 157 266 28 115 190 82 26 78 70 27 97 20 151 254 121 116 170 35 91 151 258 58
1460 58 64 173 64 108 285 71 108 143 40 185 164 155 66 129 123 230 111 87 69 80 227 587 557 292 2087 2325 976 185
1322 185 121 306 293 156 246 37 119 164 187 187 175 162 135 31 202 152 103 282 249 109 129 150 183 77 112 355 49 62 198 87
1174 87 10 185 330 131 126 150 227 236 72 57 246 232 63 197 130 148 74 37 202 266 64 137 125 170 96 337 52 235 51 244
$$ packed form
2109A37m0J33n7J13j9j29N5j35N6o9J29n5m4j2J68j56n9K85j36l0j14J40q0Q0L9j0J15M10
1971G15J457q73j270J29M0k6r8J10kJ7q8M2M7j67M2l3J17rM6o2PJ8n4J05j26R1K76k70Q5k05
1824F1J61K3oj10jJ15o5M1R9p1K17j65J38K22m2L9M38K4M06L72Q40J174M286K8696K063J20154
1696A59109m9306N5064j27741O405l2158n265k537j136o54o43l33O1j57k12K19n20J86n6j86
1602A40J01l3M1k03J15J18K5j47J09k38Q7P5j08n6N2qm3P0p7J31J03j33nN4j35N6O0J07k00
1460E8OJ09j09M4J77k14L7L5j03J45k1rq9O3oJ07j19k4j8J1J47L60l0k65J795K38j349p91
1322A85o4J85j3j37R0k09Q2M5K3%j2j3k7j04J71n0m9J79l3j40K0K1L3j06L5K43l06J3J36j11
1174H7p7J75J45j99nK4P7Rj64j5J89j4j69J34o7J8p4l7J65O4k02P3j2M5p4K41k85J83j84J93
$$ plain form
1026 244 70 202 57 129 131 254 121 252 106 232 196 162 410 23 63 137 175 171 85 222 158 24 188 298 131 282 325 248
889 248 249 209 172 98 297 320 140 306 116 246 268 259 132 281 290 134 264 107 221 184 337 86 126 111 334 291 254 325 321 267
741 267 265 256 551 172 385 341 215 450 172 258 436 329 458 445 565 337 440 548 247 693 382 467 648 509 695 789 1220
608 1220 1388 1131 1579 719 1295 994 1166 912 943 543 2062 8417 168732 188469 12010 183306 172621 16995
519 16995 4488 1207 406 1132 1271 959 1109 386 1791 1065 1354 700 588 634 706 584 480 349 622 532 366 470 292
406 292 630 473 396 329 443 86 447 196 388 450 315 311 312 252 349 381 413 194 408 207 184 210 222 112 434 250 205 298 330
263 330 23 324 348 164 131 197 290 35 383 132 120 164 336 264 200 156 493 229 117 276 109 77 85 162 97 232 125 188 125
121 125 258 143 360 133 220 247 15 169 116 12 96 147 97 119 277 285 282 178 179 262 72 132 143 67 89 193 233 171 233 142 255
$$ packed form
1026B44j74J32j45P2KJ23j33J31j46J26l6l4K48l87M0P4L8mq6J37o4j34J64J10j67J51M3p7
889B48Jm0l7p4J99K3j80J66j90J30K2rj27J49Rj56J30j57J14l7J53k51M0j5K23m3l7P1mn4
741B67krK95l79K13m4j26K35k78Q6J78j07J29j3J20k28J03J08l01M46l11Q5J81j39J86R4M31
608A220J68k57M48q60N76l01J72k54L1m00J519O355J60315J9737j76459J71296j0685j55626
519A6995j2507l281q01P26J39l12J50p23J405p26K89o54j12M6P2j22j04j31K73r0j66J04j78
406B92L38j57p7o7J14l57L61k51J92O2j35mJo0R7L2L2k19K14k01k3K6J2j10L22j84m5R3L2
263C30l07L01K4j84l3O6R3k55L48k51j2M4J72p2o4m4L37k64j12J59j67l2QP7o5J35j07O3o3
121A25J33j15K17k27Q7K7k32J54n3j04Q4N1n0K2J58Qlj04JQ3j90O0J1p6K2J04M0o2O2r1J13
$$ plain form
-32 255 62 370 64 221 151 95 44 224 245 171 121 66 177 87 192 164 187 364 81 150 73 297 156 153 226 110 249 171 206
-175 206 70 306 138 190 164 360 183 163 110 138 224 264 186 308 66 323 39 262 200 144 342 58 233 39 124 268 96
-308 96 133 102 310 68 81 191 347 161 249 215 219 139 322 100 38 377 161 199 99 247 252 175 246 156 215 163 353 260 334 137
-455 137 133 162 314 111 267 152 328 328 272 257 252 338
$$ packed form
-32B55j93L08l06J57p0n6n1J80K1p4n0n5J11r0J05k8K3J77k83O9p7K24j41lP3j16J39p8L5
-175B06j36K36j68N2k6J96j77k0n3K8Q6M0p8J22k42K57k84K23o2n6J98k84J75j94Q5J44j72
-308I6L7l1K08k42J3J10J56j86Q8l4Mq0J83k22o2L39k16L8j00J48Np7P1r0N9n2J90r3P4j97
-455A37mK9J52k03J56j15J76%n6j5nQ6
-514C38
##PAGE=	F1=-1198.43
##FIRST=	4521.1594499999982872,	4521.1594499999982872,	0
##DATA TABLE=	(F2++(Y..Y)), PROFILE
$$ plain form
4521 130 261 192 287 117 235 107 91 214 226 81 126 295 178 165 135 107 219 212 75 103 186 166 204 85 246 200 405 134
4383 134 48 219 65 246 112 51 261 210 84 102 194 80 97 221 98 27 117 112 57 107 262 344 142 218 211 121 129 71 392 297
4236 297 191 76 96 55 171 150 215 169 202 92 116 119 112 22 124 18 100 159 144 76 255 128 48 69 86 175 255 166 137 223 239 292
4078 292 248 144 156 75 83 204 231 180 46 59 137 290 118 114 87 161 334 225 166 85 292 42 80 108 48 132 177 50 156 97
3930 97 155 198 205 53 60 120 120 181 60 75 99 147 70 113 210 40 89 213 103 125 92 92 172 145 218 111 83 106 168 52 31 143 154
3768 154 112 179 98 120 180 158 56 62 83 45 177 31 135 176 84 94 47 174 178 191 166 59 56 86 83 5 162 143 102 247 196 251 194
3606 194 132 237 287 120 157 73 184 83 134 183 134 118 47 188 224 195 147 84 64 106 120 103 192 70 113 122 105 26 84 234 81
3453 81 128 49 123 83 120 315 181 121 80 23 128 192 192 14 87 134 28 108 156 78 191 244 105 86 66 251 327 156 127 57 75
$$ packed form
4521A30J31o9R5j70J18j28j6J23J2j45M5J69j17j3l0k8J12pj37K8Q3k0L8j19J61m6K05k71
4383A34q6J71j54J81j34o1K10n1j26J8R2j14J7J24j23p1R0nn5N0J55Q2k02P6pr0Qn8L21r5
4236B97j06j15K0m1J16k1O5m6L3j10K4Lpr0J02j06Q2N9j5o8J79j27q0K1J7Q9Q0q9k9Q6J6N3
4078B92m4j04J2q1QJ21K7n1j34J3P8J53j72mk7P4J73j09n9q1K07k50L8K8o0Q4M5j27J06n9
3930I7N8M3Pj52PO0%O1j21J5K4M8p7M3R7j70M9J24j10K2l3%Q0k7P3j07k8K3O2j16k1J12J1
3768A54m2O7q1K2O0k2j02OK1l8J32j46J04M1r2J0m7J27MJ3k5j07lL0lp8J57j9m1J45n1N5n7
3606A94o2J05N0j67L7q4J11j01N1M9m9j6p1J41L6k9m8o3k0M2J4j7Q9j22M3Rj7p9N8J50j53
3453H1M7p9P4m0L7J95j34o0m1n7J05O4%j78P3M7j06Q0M8p8J13N3j39j9k0J85P6j71k9p0J8
$$ plain form
3300 75 149 244 83 79 307 215 161 138 124 64 142 148 127 25 84 104 82 79 16 72 71 164 158 313 123 282 126 43 148 80 133 168 117 63
3133 63 492 719 201 242 48 84 205 51 72 68 88 167 565 168 151 142 107 128 108 31 85 183 212 176 67 54 26 14 71 52 276
2981 276 123 122 275 255 510 295 84 121 175 30 20 126 204 42 132 104 137 113 240 186 168 218 285 386 283 131 123 86 31 219
2833 219 23 222 24 128 115 66 124 175 78 115 160 61 96 127 212 171 83 102 124 207 118 39 285 271 264 160 170 188 87 211 117
2680 117 101 74 115 192 85 52 44 44 29 77 45 194 216 238 143 155 126 45 70 121 32 79 245 204 87 188 100 92 201 160 146 322 161
2518 161 64 79 51 136 142 89 119 134 34 61 46 51 37 12 219 266 190 149 125 209 262 179 167 186 220 141 96 148 127 112 204 150 140 67 99
2346 99 63 123 131 65 91 170 236 78 129 119 115 254 150 104 204 320 137 97 77 21 37 206 162 134 16 119 114 94 166 198 33 118
2188 118 333 45 93 227 45 127 82 192 110 149 189 17 93 108 143 128 44 203 172 363 300 211 184 12 62 54 177 91 102 67
$$ packed form
3300G5P4R5j61mK28r2n4k3j4o0P8Ok1j02N9K0k2lo3N6jR3oJ55j90J59j56q3J05o8N3L5n1n4
3133F3M29K27n18M1j94L6J21j54K1mK0P9L98l97j7rl5K1k0p7N4R8K9l6j09j3k8j2N7j9K24
2981B76j53jJ53k0K55k15k11L7N4j45j0J06P8j62R0k8L3k4J27n4j8N0O7J01j03j52ql7n5J88
2833B19j96J99j98J04j3m9N8N1r7L7M5r9L5L1Q5m1q8J9K2Q3q9p9K46j4pj04J0J8j01J24r4
2680A17j6k7M1P7j07l3q%j5M8l2J49K2K2r5J2k9q1K5N1q9M7J66m1j17J01q8qJ09m1j4J76j61
2518A61r7J5k8Q5On3L0J5j00K7j5Nj4k5K07M7p6m1k4Q4N3q3j2J9L4p9m5N2k1j5R2n4j0p3L2
2346I9l6O0Qo6K6P9O6j58N1j0mJ39j04m6J00J16j83m0k0n6J6J69m4k8j18J03nk0P2L2j65Q5
2188A18K15k88M8J34j82Q2m5J10q2L9M0j72P6J5L5j5q4J59l1J91o3q9k7j72N0qJ23q6J1l5
$$ plain form
2040 67 202 88 25 286 182 127 53 160 154 161 124 223 317 679 2011 1118 83 128 155 122 74 217 143 147 144 126 160 47 40 58 109
1888 109 157 201 145 121 162 152 190 46 182 365 178 207 115 196 207 162 125 102 232 246 190 181 144 346 178 231 435 299 341 756
1740 756 662 916 1164 1699 2228 4928 23569 26948 100738 73038 101529 26434 26666 7032 4007 2271 1715 1162
1652 1162 717 443 441 460 285 470 165 201 260 101 163 129 276 84 113 210 222 90 183 70 53 128 38 36 85 69 24 47 31 168
1504 168 172 124 146 186 189 67 116 233 51 75 150 89 64 259 111 94 94 90 134 148 106 60 120 107 184 125 54 77 39 180 479 457 253
1341 253 2399 2987 1225 186 148 267 259 160 197 8 92 125 149 185 139 124 105 51 197 246 83 277 235 75 139 89 134 126 106
1199 106 285 71 88 185 110 24 178 354 177 100 101 176 192 19 101 233 171 25 134 115 109 63 20 183 243 64 98 85 141 107
1051 107 264 33 207 102 175 116 128 32 115 166 182 77 215 101 131 141 149 367 62 79 104 114 107 49 182 113 76 141 251 179
$$ packed form
2040F7J35j14o3K61j04n5p4J07oPl7R9R4L62J332q93j035M5K7l3m8J43p4Mlj8L4j13pJ8N1
1888A09M8M4n6k4M1j0L8j44J36J83j87K9r2Q1J1m5l7k3J30J4n6rl7K02j68N3K04j36M2M15
1740G56r4K54K48N35N29K700J8641L379P3790k7700K8491p5095K32j9634l025j736n56n53
1652A162m45k74kJ9j75J85l05L6N9j59O2l4J47j92K9R7J2j32R3j13j7P5r0kM9j6m5K3j6J37
1504A68Mm8K2M0Lj22M9J17j82K4P5o1k5J95j48j7%mM4J4m2m6O0j3P7n9p1K3l8J41K99k2k04
1341B53K146N88j762j039l8J19qr9L7j89Q4L3K4L6m6j5j9n4J46M9j63J94m2j60O4n0M5qk0
1199A06J79k14J7R7p5q6J54J76j77p7JP5J6j73Q2J32o2j46J09j9om6m3J63O0j79L4j3N6l4
1051A07J57k31J74j05P3n9J2r6Q3N1J6j05J38j14L0J0QK18l05J7K5J0pn8J33o9l7O5J10p2
$$ plain form
903 179 194 287 174 214 231 91 67 239 320 93 263 90 192 183 175 61 210 210 52 161 113 115 83 232 55 67 34 205 213 176 193
751 193 240 123 168 146 408 77 289 237 144 303 51 124 296 155 263 270 401 200 281 332 42 458 219 285 366 250 420 460
613 460 714 792 646 861 409 705 504 628 391 536 429 1334 5875 96218 108435 5982 105115 98351 10748 3200
514 3200 1106 362 782 755 449 636 245 952 611 664 357 263 350 412 363 301 109 389 367 213 277 81 474 326 224 185
387 185 284 90 353 169 242 325 188 180 148 126 248 260 249 224 331 111 128 100 160 158 357 162 142 178 232 149 208 228 74 50 192
234 192 183 43 344 157 91 120 245 152 144 186 402 197 34 183 99 68 57 151 69 171 70 146 94 208 62 274 45 147 207
91 207 85 115 112 32 74 147 86 151 221 220 235 158 106 172 93 76 122 22 97 172 244 148 190 145 216 129 316 82 103 78 35 93 200 226
-76 226 169 91 99 177 49 173 116 112 298 118 73 21 229 95 154 180 90 275 157 174 44 279 116 161 124 278 121 83 43 89
$$ packed form
903A79J5R3j13M0J7j40k4J72Q1k27J70j73J02rqj14J49%j58J09m8Kl2J49j77J2l3J71Ql7J7
751A93M7j17M5k2K62l31K12n2r3J59k52P3J72j41J08PJ31k01Q1N1k90M16k39O6Q1j16J70M0
613D60K54P8j46K15m52K96k01J24k37J45j07R05M541R0343J2217j02453R9133o764q7603p548
514C200k094p44M20k7l06J87l91P07l41N3l07r4Q7O2m9o2j92K80k2j54O4j96L93j48j02l9
387A85R9j94K63j84P3Q3j37ql2k2J22J2j1k5J07k20J7k8O0kJ99j95k0L6N4q3N9K0j54k4J42
234A92rj40L01j87o6K9J25r3qM2K16k05j63J49q4l1j1R4q2J02j01P6n2J14j46K12k29J02O0
91B07j22L0lq0M2P3o1O5P0jJ5p7n2O6p9j7M6j00P5P5P2r6M2m5P1q7J87k34K1k5m3N8J07K6
-76B26n7p8QP8j28J24n7mJ86j80m5n2K08j34N9K6r0J85j18J7j30K35j63M5l7J54j57l8m0M6
$$ plain form
-224 89 256 279 237 308 94 296 46 190 134 87 264 80 137 21 115 244 144 88 106 242 57 1 150 258 123 156 119 138
-362 138 168 245 41 69 333 233 148 58 183 180 114 133 38 197 44 208 188 215 53 125 69 273 38 188 88 224 195 174 171
-504 171 173 170
$$ packed form
-224H9J67K3m2P1k14K02k50J44n6m7J77j84N7j16R4J29j00n6J8J36j85n6J49J08j35L3l7J9
-362A38L0P7k04K8K64j00q5r0J25lo6J9r5J59j53J64k0K7j62P2n6K04k35J50j00J36k9k1l
-504A71Kl
-514A70
##PAGE=	F1=-1208.27
##FIRST=	4521.1594499999982872,	4521.1594499999982872,	0
##DATA TABLE=	(F2++(Y..Y)), PROFILE
$$ plain form
4521 40 192 114 224 100 166 101 36 178 190 150 81 185 88 143 62 40 234 132 32 24 151 215 194 89 158 222 322 134 50 143
4373 143 145 201 61 44 269 173 49 116 142 117 103 186 63 67 55 48 89 60 218 378 141 215 218 130 112 68 385 298 159 80 41 108
4216 108 99 133 150 197 164 79 88 83 114 44 105 68 107 158 97 84 214 103 38 39 92 166 256 115 169 215 258 340 165 159 93 18 176 196 239
4044 239 149 68 68 130 269 87 104 69 154 272 205 108 117 257 53 82 134 11 109 181 62 94 40 149 205 180 78 72 111 118 131 37
3886 37 63 66 153 52 153 186 55 137 155 84 68 139 79 132 157 176 140 88 114 98 35 33 87 163 152 117 40 137 157 170 44 78 132 58
3719 58 138 35 129 150 144 65 93 168 166 154 125 80 44 91 75 20 148 127 90 198 190 295 196 87 170 262 116 124 78 229 122 121 159 144
3551 144 95 29 177 219 188 152 33 85 117 168 82 193 88 107 76 137 79 58 241 130 119 113 125 107 131 267 134 124 50 44 93 167
3394 167 231 4 112 113 29 109 160 110 195 241 132 112 48 275 312 149 165 36 70 210 235 39 114 292 196 130 93 105 75 117 180
$$ packed form
4521D0J52p8J10j24O6o5o5J42J2m0o9J04r7N5q1k2J94j02j00qJ27O4k1j05O9O4J00j88q4R3
4373A43KN6j40j7K25r6j24O7K6k5j4Q3j23Mj2pM1k9J58J60k37P4Lq8j8m4L17q7j39p9l9O7
4216A08rL4J7M7l3q5RnL1p0O1l7L9N1o1j3J30j11o5JN3P4R0j41N4M6M3Q2j75oo6p5J58K0M3
4044B39r0q1%O2J39j82J7l5Q5J18o7r7RJ40k04K9N2j23R8P2j19L2n4J09N6k5j02oL9PJ3r4
3886C7K6LQ7j01J01L3j31Q2J8p1j6P1o0N3K5J9l6n2K6j6o3kN4P6j1l5p7R7K0J3j26L4N4p4
3719E8Q0j03R4K1op9K8P5kj2k9m5l6M7j6n5J28k1l7J08qJ05r9j09Q3R2j46Qm6J51j07jL8j5
3551A44m9o6J48M2l1l6j19N2L2N1q6J11j05J9l1O1n8k1J83j11j1oJ2j8K4J36j33j0p4oM9P4
3394A67O4k27J08Jq4Q0N1n0Q5M6j09k0o4K27L7j63J6j29L4J40K5j96P5J78r6o6l7J2l0M2O3
$$ plain form
3241 180 144 30 59 88 130 27 33 75 67 174 162 287 130 268 122 85 130 81 144 157 177 49 505 712 210 264 86 88 211 74
3094 74 86 68 129 191 444 102 213 149 111 111 117 25 110 204 230 168 120 20 53 51 96 23 293 136 140 301 306 490 283 123 118 119 19
2931 19 77 165 182 52 143 109 131 86 228 202 230 257 262 418 262 153 118 118 51 197 44 223 38 123 142 101 144 197 55 157 133
2779 133 89 125 128 237 144 79 67 107 200 123 103 280 276 254 127 170 179 84 192 111 58 76 154 195 101 25 64 57 10 96 60 236 239 255 146
2606 146 156 148 37 46 145 41 77 179 161 119 180 95 74 202 163 177 293 140 65 45 29 136 165 80 93 148 73 65 36 29 31 31 220 262
2439 262 177 152 107 194 289 158 172 176 159 92 81 162 112 103 241 171 175 88 102 105 99 131 48 83 171 224 72 132 93 99 272 159 125 214 302
2267 302 154 128 146 83 21 173 174 119 11 108 106 106 189 204 4 134 269 24 126 174 85 111 64 239 123 192 187 21 95 59 123
2114 123 110 37 172 169 416 328 263 181 45 45 87 174 65 124 60 170 95 70 266 189 115 74 184 215 162 54 252 306 700 1943
$$ packed form
3241A80l6j14K9K9M2j03OM2qJ07j2J25j57J38j46l7M5m9O3J3K0j28M56K07n02N4j78KJ23j37
3094G4J2j8O1O2K53l42J11o4l8%Or2Q5R4K6o2m8j00L3kM5p3K70j57MJ61NJ84k07j60nJj00
2931A9N8Q8J7j30R1l4K2m5J42k6K8K7NJ56j56j09l5%o7J46j53J79j85Q5J9m1M3N3j42J02k4
2779A33m4L6LJ09r3o5j2M0R3p7k0J77mk2j27M3Rr5J08q1n3J8P8M1r4p6L9pm7Q6l6J76LJ6j09
2606A46J0qj11RR9j04L6J02j8m2O1q5k1J28l9J4J16j53p5k0j6J07K9q5J3N5p5qk9pK%J89M2
2439B62q5k5m5Q7R5j31J4Mj7o7j1Q1n0rJ38p0Mq7J4LoL2q3L5Q8N3j52O0l9OJ73j13l4Q9Q8
2267C02j48k6J8o3o2J52Jn5j08R7k%Q3J5k00J30J35k45J02M8q9K6m7J75j16O9nj66P4l6O4
2114A23j3p3J35lK47q8o5q2j36%M2Q7j09N9o4J10p5k5J96p7p4m1J10L1n3j08J98N4L94J243
$$ plain form
1967 1943 1009 134 100 113 77 85 232 98 105 170 108 125 87 17 63 62 142 187 133 100 141 190 176 113 171 285 174 165 168 184 170 145 107 85
1799 85 210 299 164 85 56 276 169 178 288 64 171 576 339 497 691 972 1221 2648 15088 21217 65830 52128 62056
1686 62056 19994 14317 3633 2344 1252 1245 778 545 338 124 239 183 269 150 111 198 72 94 74 278 172 93 144 145
1568 145 24 108 101 26 83 31 44 104 94 37 62 50 191 110 150 174 247 321 49 71 197 61 83 135 113 15 230 151 90 55 126 87
1410 87 138 90 87 110 89 139 129 53 79 15 127 351 335 196 2515 3353 1383 179 163 227 229 156 148 30 59 96 126 182 121 86 128
1258 128 101 192 313 80 260 203 56 134 82 97 154 104 220 124 102 181 140 31 176 360 222 89 59 123 153 33 145 222 107
1115 107 39 83 105 105 77 24 153 206 69 70 102 127 115 204 106 193 161 100 145 67 62 93 183 124 41 191 114 40 98 171 322 130 125 78
948 78 59 51 13 144 100 144 100 186 213 121 244 178 199 246 113 33 188 301 92 232 120 182 119 97 113 164 143 73 79 145 65 24 119
$$ packed form
1967A943r34q75l4J3l6QJ47j34PO5o2J7l8p0M6jQ0M5n4l3M1M9j4o3N8J14j11rLJ6j4k5l8k2
1799H5J25Q9j35p9k9K20j07RJ10k24J07M05k37J58J94K81K49J427J2440O129M4613j3702R928
1686F2056m2062n677j0684j289j092pm67k33k07k14J15n6Q6j19l9Q7j26K2k0K04j06p9N1J
1568A45j21Q4pp5N7n2J3O0j0n7K5j2J41q1M0K4P3P4k72K2J26j36K2N2k2r8K15p9o1l5P1l9
1410H7N1m8lK3k1N0j0p6K6o4J12K24j6j39K319Q38j970j204j6O4Kp3qj18K9L7L0N6o1l5M2
1258A28k7R1J21k33J80n7j47P8n2J5N7n0J16r6k2P9m1j09J45J84j38j33l0O4L0j20J12P7j15
1115A07o8M4K2%k8n3J29N3j37JL2K5j2Q9r8Q7l2o1M5p8nL1R0n9q3J50p7p4N8P3J51j92nm7
948G8j9ql8J31m4M4m4Q6K7r2J23o6K1M7j33q0J55J13k09J40j12O2o3k2J6N1k1p0OO6q0m1R5
$$ plain form
785 119 84 19 64 83 150 107 192 174 68 139 96 283 101 208 161 125 167 99 72 169 44 101 157 285 230 205 143 128 248 111 231
633 231 158 32 254 186 268 308 284 269 226 244 203 177 72 167 628 994 4416 36620 44459 2631 40844 39214 5945 2122
514 2122 1045 566 589 316 123 253 145 298 215 141 79 67 156 159 188 142 100 184 245 136 193 97 351 278 185 138 141 232 280 187 103
362 103 200 83 85 26 77 171 141 125 283 285 95 111 43 108 197 263 102 79 73 175 252 118 138 78 28 217 114 65 293 165 59
209 59 78 149 75 113 223 319 194 129 106 89 92 96 140 47 111 60 91 110 152 69 201 55 108 177 126 86 142 57 71 160 67 178 162 158 198
37 198 169 94 104 154 61 120 92 96 140 243 145 153 161 204 195 261 103 97 45 86 143 194 228 155 96 135 162 76 158 69 82 244 165 3 20 178
-140 178 52 145 134 70 287 144 146 92 261 188 139 119 205 95 19 39 54 284 279 265 282 124 262 73 130 87 106 207 137 53 48
-293 48 96 242 173 32 104 169 56 75 111 176 124 101 42 91 186 174 64 133 274 262 117 43 118 140 71 68 110 197 134 88 147 129 33
$$ packed form
785A19l5o5M5J9O7m3Q5j8j06P1m3J87j82J07m7l6M2o8k7R7j25N7N6J28n5k5o2j5J20j37J20
633B31p3j26K22o8Q2M0k4j5m3J8m1k6j05R5M61L66L422L2204P839m1828L8213j630l3269l823
514B122j077m79K3k73j93J30j08J53q3p4o2j2Q9LK9m6m2Q4O1j09N7r6K54p3r3m7LR1M8r3q4
362A03R7j17Kn9N1R4l0j6J58Kj90J6o8O5Q9O6j61k3oJ02P7j34K0o0n0J89j03m9K28j28j06
209E9J9P1p4L8J10R6j25o5k3j7LMM4r3O4n1L1J9M2q3J32j46N3O9n1m0N6q5J4Q9r3J11j6mM0
37A98k9p5J0N0r3N9k8MM4J03r8QQM3rO6j58on2M1N7N1L4p3n9L9K7q6Q2q9J3J62p9j62J7J58
-140A78j26R3j1o4K17j43Kn4J69p3m9k0Q6j10p6K0J5K30nj4J7j58J38j89N7m3J9J01p0q4n
-293D8M8J46o9j41P2O5j13J9L6O5n2k3n9M9R5j2j10O9J41j2j45p4P5K2o9lM2Q7o3m6N9j8r6
$$ plain form
-455 33 120 27 226 49 128 37 144 73 97 199 121 32
$$ packed form
-455C3Q7r3J99j77P9r1J07p1K4J02p8q9
-514C2
##PAGE=	F1=-1218.11
##FIRST=	4521.1594499999982872,	4521.1594499999982872,	0
##DATA TABLE=	(F2++(Y..Y)), PROFILE
$$ plain form
4521 64 121 135 163 101 151 88 79 153 174 199 108 93 25 129 138 5 252 66 28 43 130 245 187 120 90 230 229 141 72 72 199 195 37 103
4354 103 244 146 41 130 97 143 115 144 54 98 16 31 144 41 173 387 142 205 219 128 119 69 373 307 134 87 9 145 56 114
4206 114 100 204 132 65 69 41 112 94 95 97 114 178 100 92 194 80 62 59 96 146 232 74 193 202 282 372 93 173 48 62 254 204 226 139
4039 139 95 91 111 235 58 105 71 144 221 164 91 131 218 55 83 155 29 86 192 85 51 35 139 218 157 120 75 102 105 91 5 70
3881 70 23 158 34 173 161 78 164 107 76 22 171 78 104 159 128 168 103 110 27 85 84 53 163 169 73 37 136 151 159 36 99 180 76 101
3714 101 25 113 124 205 57 123 146 156 126 90 119 60 89 61 40 141 88 99 137 177 309 185 43 99 213 104 100 84 270 182 98
3561 98 130 141 72 35 181 197 194 157 33 120 117 201 49 192 96 91 39 146 122 75 246 166 116 161 135 115 143 218 88 115 27 79 74 143
3394 143 253 18 133 105 52 115 162 126 182 227 188 134 29 279 284 140 188 44 68 239 222 3 132 282 173 92 39 88 89 85
$$ packed form
4521F4N7J4K8o2N0o3rP4K1K5r1j5o8J04Rj33K47j86l8J5Q7J15n8o7l0J40jq8o9%J27mj58O6
4354A03J41r8j05Q9l3M6k8K9r0M4q2J5J13j03J32K14k45O3J4r1rn0L04o6j73m7p8J36q9N8
4206A14j4J04p2o7Mk8P1j8JKJ7O4p8qJ02j14j8lL7N0Q6j58J19RQ0R0k79Q0j25J4J92n0K2q7
4039A39m4mK0J24j77M7l4P3P7n7p3M0Q7j63K8P2j26N7J06j07l4j6J04P9o1l7m5K7Lj4q6O5
3881G0m7J35j24J39j2q3Q6n7l1n4J49r3K6N5l1M0o5Pq3N8jl1J10Or6l6R9J5Qj23O3Q1j04K5
3714A01p6Q8J1Q1j48O6K3J0l0l6K9n9K9k8k1J01n3J1L8M0J32j24j42N6J14j09mj6J86q8q4
3561I8L2J1o9l7J46J6ll7j24Q7lQ4j52J43r6nn2J07k4m7J71q0n0M5k6k0K8P5j30K7q8N2nO9
3394A43J10k35J15k8n3O3M7l6N6M5l9n4j05K50Nj44M8j44K4J71j7k19J29J50j09q1n3M9Jm
$$ plain form
3246 85 200 179 31 61 88 166 26 62 84 56 184 150 244 124 245 113 163 115 89 136 151 230 39 450 632 208 274 119 81
3104 81 216 106 109 80 159 228 319 41 254 152 101 90 116 24 136 202 231 156 169 3 73 84 123 40 278 136 161 322 355 476
2956 476 289 163 98 60 70 126 187 163 79 156 132 116 63 204 201 274 273 248 422 230 172 119 154 58 165 73 209 83 113 186 147 156
2798 156 209 44 189 114 99 127 122 246 114 76 25 83 182 117 160 261 265 216 97 165 177 83 171 101 45 84 182 193 127 34 91 73 43
2636 43 123 111 266 266 264 149 173 156 47 44 159 65 78 110 125 142 171 74 107 206 163 175 246 122 77 15 38 146 186 72 65 167 110
2474 110 69 57 28 47 73 208 253 167 151 96 170 319 134 169 159 99 52 60 158 94 99 275 187 208 140 104 136 84 135 25 78 155 203
2311 203 72 122 74 86 271 155 146 214 268 166 148 205 142 20 142 162 87 20 85 80 117 223 205 27 122 194 19 142 122 114 100
2159 100 46 268 132 224 177 52 99 48 143 84 79 147 169 438 344 290 181 67 85 124 173 52 137 42 135 93 111 245 185 96 82
$$ packed form
3246H5J15k1j48L0K7P8j40L6K2k8J28l4R4j20J21j32N0m8k6M7J5P9j91M11J82m24O6j55l8
3104H1J35j10Lk9P9O9R1k78K13j02n1j1K6r2J12O6K9p5J3j66P0J1L9q3K38j42K5J61L3J21
2956D76j87j26o5l8J0N6O1k4q4P7k4j6n3J41lP3jk5J74j92n8n3L5r6J07r2J36j26L0P3l9R
2798A56N3j65J45p5j5K8nJ24j32l8n1N8R9o5M3J01Mm9j19O8J2r4Q8p0n6L9R8J1o6r3N7j8l0
2636D3Q0j2J55%kj15K4j7j09lJ15r4J3L2J5J7K9r7L3R9m3J2P1j24m5o2K3J08M0j14pJ02n7
2474A10m1j2k9J9K6J35M5q6j6n5P4J49j85L5j0o0m7QR8o4NJ76q8K1o8l6L2n2N1j10N3P7M8
2311B03j31N0m8J2J85j16rO8N4j02j8N7o3j22J22K0p5o7O5nL7J06j8j78R5P2j75J23k0qj4
2159A00n4K22j36R2m7j25M7n1R5n9nO8K2K69r4n4j09j14J8L9M9j21Q5r5R3m2J8J34o0q9j4
$$ plain form
2006 82 213 257 156 28 268 272 760 1978 1016 169 81 81 53 95 227 52 69 186 100 96 119 34 58 47 109 155 103 70 102 215
1858 215 162 178 147 217 162 140 203 176 133 162 86 68 186 312 147 111 13 233 226 261 205 123 188 504 169 299 481 600 973 1502
1711 1502 11535 21474 56850 49284 53578 18634 9685 1641 1267 630 987 635 566 399 210 74 142 234 191 175 116
1607 116 59 51 41 257 225 82 86 81 34 79 106 60 60 58 49 133 128 61 130 76 213 73 176 180 339 422 63 62 147 76 91 131 131 45 201 181
1430 181 95 80 140 77 134 104 111 101 82 104 122 74 70 13 77 227 284 147 2382 3316 1398 165 168 193 201 141 113 61 24 87 118 177
1273 177 112 58 170 139 188 346 88 232 159 74 116 124 75 163 92 167 165 107 183 156 26 179 350 257 85 33 74 123 67 167 209
1120 209 48 60 78 121 124 99 31 109 168 76 58 131 124 113 173 176 185 204 49 158 39 89 67 183 128 62 185 138 32 82 190 278 183
957 183 152 61 30 43 24 112 124 193 76 123 223 80 209 212 203 235 154 0 144 268 125 210 164 203 86 66 157 156 92 118 51 168
$$ packed form
2006H2J31M4j01j28K40MM88J218r62q47q8%k8M2J32j75J7J17q6mK3q5K4j1O2M6n2l3L2J13
1858B15n3J6l1P0n5k2O3k7m3K9p6j8J18J26j65l6r8K20pL5n6q2O5L16l35J30J82J19L73N29
1711A502J0033R939L5376p566M294l4944q949q044l74o37L57l52o9j67j89j36O8R2m3j6n9
1607A16n7qj0K16l2j43Mnm7M5K7m6%krQ4no7O9n4J37j40J03MJ59Q3l59jQ5p1J5M0%q6J56k0
1430A81q6j5O0o3N7l0Pj0j9K2J8m8mn7O4J50N7j37K235R34j918j233LK5Qo0k8n2l7O3L1N9
1273A77o5n4J12l1M9J58k58J44p3q5M2Qm9Q8p1P5kn8P6k7j30J53J71r3j72n2M1M9n6J00M2
1120B09j61J2J8M3Lk5o8P8N9r2j8P3pj1O0LRJ9j55J09j19N0k2J16n5o6J23m7j06N0J08Q8r5
957A83l1r1l1J3j9Q8J2O9j17M7J00j43J29LrL2q1j54J44J24j43Q5m6L9j17k0R1jo4K6o7J17
$$ plain form
800 168 105 66 49 108 29 113 22 107 57 261 118 143 173 90 185 155 139 140 146 73 168 140 94 109 75 154 235 325 217 70 241 77 83 292
633 292 143 162 267 48 121 207 235 227 270 314 356 241 445 249 908 1073 3980 7131 14251 4981 6806 14713 2750 1355
514 1355 1032 779 607 273 348 73 172 286 97 351 143 199 165 144 89 64 256 60 183 178 256 202 271 304 261 180 45 332
377 332 233 216 16 89 27 112 116 116 113 40 59 320 253 140 124 122 68 213 158 70 34 11 180 318 93 109 98 64 244 114 89 245
219 245 156 23 44 70 112 108 240 260 206 196 59 66 109 128 123 37 81 106 51 136 96 133 145 84 104 160 145 100 181 75 75 175 39 193
52 193 109 107 176 192 141 64 188 73 131 148 86 101 232 163 143 179 212 242 211 114 192 57 149 181 204 241 138 131 163 140 127 141 30 104
-116 104 202 189 66 35 154 63 123 87 73 287 137 122 160 254 262 122 127 146 89 45 64 52 301 264 266 239 148 225 88 98 59 154 174
-278 174 165 13 60 59 261 175 37 97 104 78 129 74 109 131 87 19 87 184 124 92 167 213 256 124 51 68 138 54 103 187 208 215 27 127
$$ packed form
800A68o3l9j7N9p9Q4r1Q5n0K04j43K5L0q3R5l0j6JOp3R5k8m6J5l4P9Q1R0j08j47J71j64OK09
633B92j49J9J05k19P3Q6K8qM3M4M2j15K04j96O59J65K907L151P120r270J825P907j1963j395
514A355l23k53j72l34P5k75R9J14j89K54k08N6l4k1n5k5J92j96J23nP8n4O9L3m3q1j35K87
377C32r9j7k00P3o2Q5M%lp3J9K61o7j13j6kn4J45n5q8l6k3J69J38k25J6j1l4J80j30k5J56
219B45q9j33K1K6M2mJ32K0n4j0j37PM3J9nq6M4K5n5Q5m0L7J2o1K0N6j5m5Q1j06%J00j36J54
52A93q4kO9J6n1p7J24j15N8J7o2J5J31o9k0L6L3L0l1r7P8j35R2L2K3L7j03pL2k3j3J4j11P4
-116A04R8j3j23l1J19r1O0l6j4K14j50j5L8R4Qj40NJ9n7m4J9j2K49l7Kk7r1P7j37J0l9R5K0
-278A74rj52M7jK02q6j38O0Pk6N1n5L5K2m4o8O8R7o0l2P5M6M3j32p3J7P0q4M9Q4K1Pj88J00
$$ plain form
-445 127 97 54 99 70 174 80 87 55 80 32 49 264 96 87
$$ packed form
-445A27l0m3M5k9J04r4Pl2K5m8J7K15j68r
-514H7
##PAGE=	F1=-1227.96
##FIRST=	4521.1594499999982872,	4521.1594499999982872,	0
##DATA TABLE=	(F2++(Y..Y)), PROFILE
$$ plain form
4521 90 51 168 113 115 160 64 115 147 163 226 145 49 14 110 198 35 239 39 42 75 115 249 188 144 74 218 125 142 82 35 225 207 26
4359 26 133 191 125 55 133 71 147 117 108 61 107 59 58 164 83 126 368 134 185 208 125 147 69 359 318 118 87 36 159 43 95 68
4201 68 192 106 50 64 54 110 128 108 103 119 191 132 104 170 69 97 64 103 118 197 56 204 187 306 382 43 188 24 107 308 208
4049 208 200 158 141 113 80 192 43 111 88 129 185 108 101 133 182 46 102 161 60 61 199 113 50 49 126 226 139 144 72 90 87 79 38 93 20
3876 20 154 30 169 143 91 167 69 87 37 188 93 90 153 77 192 121 94 35 131 144 75 155 166 51 94 120 159 131 28 122 221 95
3719 95 69 1 90 103 257 68 134 114 142 110 69 163 75 84 43 51 140 41 115 70 149 290 163 16 48 153 78 83 90 303 245 83 102
3556 102 125 65 35 188 165 203 153 92 154 110 211 24 189 90 71 15 129 146 107 245 186 113 189 149 108 155 174 56 94 16 92
3404 92 57 127 258 34 142 101 73 122 165 123 149 212 247 152 18 265 242 129 196 61 75 235 205 34 135 283 161 60 52
$$ packed form
4521I0l9J17n5KM5r6N1L2J6O3q1r6l5R6Q8j63K04k00LL3M0J34o1m4p0J44r3J7o0m7J90j8j81
4359B6J07N8o6p0P8o2P6l0rm7M6m8jJ06q1M3K42k34N1K3q3K2p8K90m1k00l1n1J23j16N2k7
4201F8J24q6n6J4j0N6J8k0nJ6P2n9k8O6j01K8l3L9J5P9j41J48j7J19P6l39J45j64Q3K01j00
4049B08qm2j7k8l3J12j49O8k3M1N6p7pL2M9j36N6N9j01JJ38q6o3jP7J00q7Np2J8lqm1N5p3
3876B0J34j24J39k6n2P6r8J8n0J51r5lO3p6J15p1k7n9R6J3o9Q0J1j15M3K6L9k8j03R4R9j26
3719I5k6o8Q9J3J54j89O6k0K8l2m1R4q8Rm1QQ9r9P4m5P9J41j27j47L2J05p5NPK13n8j62J9
3556A02K3o0l0J53k3L8n0o1O2m4J01j87J65r9j9n6J14J7l9J38n9p3P6m0m1M7J9j18L8p8P6
3404I2l5P0J31k24J08m1k8M9M3m2K6O3L5r5j34K47k3j13O7j35J4J60l0j71J01J48j22j01q
$$ plain form
3261 52 84 102 51 203 212 31 81 109 195 64 96 97 34 189 120 194 107 215 105 214 103 96 111 147 269 38 358 500 210 267
3113 267 138 65 216 121 137 88 177 250 200 49 266 149 81 66 105 14 161 181 213 142 206 8 84 95 146 63 232 117 178 326
2966 326 379 454 311 217 80 20 119 162 189 147 107 169 163 95 48 176 184 293 264 234 397 191 190 124 183 58 122 94 183 117 103 232
2808 232 193 157 206 42 203 107 104 105 108 237 88 72 23 54 152 103 197 234 239 159 73 152 176 94 140 88 56 94 196 189 160 76 121 95 64
2636 64 152 161 283 281 265 153 193 149 63 55 158 83 77 51 92 155 160 42 158 213 169 146 190 111 95 38 55 159 204 68 33 185 134 74
2469 74 80 51 75 108 183 236 164 150 94 145 344 114 158 137 46 56 49 141 73 100 298 197 235 195 106 156 76 129 9 75 121 162 77 101
2301 101 60 85 247 137 164 208 224 166 152 241 181 57 126 128 45 18 56 51 118 246 200 52 86 117 33 141 85 134 97 32 273 126
2144 126 240 156 76 104 88 178 56 114 141 172 427 342 290 178 67 128 157 178 60 138 25 108 81 141 227 172 70 79 230 276 142
$$ packed form
3261E2L2J8n1J52Rj81N0K8Q6j31L2Jo3J55o9P4q7J08j10J09j11pJ5L6J22k31L20J42k90N7
3113B67j29p3J51r5J6m9Q9P3n0j51K17j17o8j5L9r1J47K0L2p1O4j98P6J1N1q3J69j15O1J48
2966C26N3P5j43r4j37o0R9M3K7m2m0O2oo8m7J28QJ09k9l0J63k06jo6N9j25O4k8Q9o6j4J29
2808B32l9l6M9j64J61r6lJLJ29j49j6m9L1R8m9R4L7Nq0q6P9K4q2M6n2l2L8J02pk9q4M5k6l1
2636F4Q8RJ22kj6j12M0m4q6qJ03p5ok6M1O3Nj18J16N5m4k3M4p9j6n7J7J04M5j36l5J52n1o0
2469G4Ok9K4L3P5N3p2j4n6N1J99k30M4k1r1J0pR2o8K7J98j01L8m0q9N0q0N3j20O6M6M1q5K4
2301A01m1K5J62j10K7M4J6n8j4Q9o0j24O9Kq3k7L8nO7J28m6j48L4L1q4J08n6M9l7o5K41j47
2144A26J14q4q0K8j6R0j22N8K7L1K55q5n2j12j11O1K9K1j18P8j13Q3k7O0Q6n5j02RJ51M6j34
$$ plain form
1991 142 63 266 225 842 2116 1117 181 78 63 65 98 199 7 36 189 104 81 138 60 47 79 69 116 65 29 58 225 142 223 113
1843 113 162 142 126 220 168 93 168 79 50 165 282 143 167 62 198 275 332 146 219 226 447 130 233 378 471 960 1162 10328
1706 10328 23638 58152 53773 58221 20024 10892 1362 786 491 804 578 593 428 354 181 105 492 310 395 28 114
1602 114 52 34 223 241 67 42 36 79 110 89 98 55 82 54 165 158 88 186 103 228 54 193 162 430 486 99 120 90 92 98 132 142 98
1440 98 176 193 109 135 131 117 136 121 120 98 84 85 102 89 49 8 40 162 376 127 2017 2862 1260 142 167 169 175 112 104 90 30 94 119
1277 119 170 103 51 201 162 183 346 99 197 112 113 94 164 69 158 68 128 188 103 184 156 17 187 328 277 82 29 36 99 91 164 193 9
1115 9 73 107 160 147 121 40 55 146 82 60 144 128 105 181 231 176 227 96 158 56 97 46 171 176 97 196 161 82 101 191 235 219 158 51
948 51 52 80 62 90 156 219 76 105 217 78 190 233 217 195 167 31 111 229 154 190 196 233 74 105 166 175 61 141 81 174 160 103 114
$$ packed form
1991A42p9K03m1O17J274r99r36j03j5KL3J01j92K9J53q5k3N7p8j3L2j0M7n1l6K9J67q3Q1j10
1843A13M9k0j6R4n2p5P5q9k9J15J17j39K4j05J36P7N7j86P3PK21l17J03J45R3M89K02R166
1706A0328J3310L4514m379M448l8197r132r530n76k95L13k26J5j65p4j73p6L87j82Q5l67Q6
1602A14o2j8J89J8j74k5oM3L1k1Rm3K7k8J11pp0R8q3J25j74J39l1K68N6l87K1l0KOL4J0m4
1440I8P8J7q4K6mj4J9j5jk2j4JJ7j3m0m1L2J22K14k49J890Q45j602j118K5KOo3qj4o0O4K5
1277A19N1o7n2J50l9K1J63k47R8q5Jj9P0r5Q9r0O0O0q5Q1k8j39J70J41n1j95n3PO3qP3K9j84
1115IO4L4N3j3k6q1J5R1o4k2Q4j6k3P6N0n5N1j31O2j02M1n1J25Np9R9l5p9J9R0M4j6o1j07
948E1JK8j8K8O6O3j43K9J12j39J12M3j6k2k8j36Q0J18p5L6OL7j59L1O1Rj14Q0o0R3j4n7J1
$$ plain form
785 114 114 58 141 104 79 47 309 65 203 220 78 124 189 81 164 175 97 201 200 115 173 147 192 226 396 246 164 302 67 111 362
633 362 224 288 342 178 362 400 370 511 363 566 549 492 716 528 1151 1350 4244 33572 33562 7389 34628 33440 893
519 893 1041 1066 930 720 530 543 216 257 564 309 601 277 292 244 306 87 129 364 131 165 236 349 254 224 342 333 224 99
382 99 386 214 233 107 53 43 183 186 154 77 72 59 322 216 178 145 199 36 204 56 58 47 69 217 345 129 133 93 86 252 149
229 149 104 213 136 29 23 68 176 116 229 229 217 225 67 40 114 143 102 42 106 155 70 156 48 183 107 83 114 153 151 137 215 94 80
67 80 180 29 190 65 68 169 212 188 49 187 88 148 183 72 57 215 188 161 187 232 266 172 122 274 78 204 206 224 255 126 179
-86 179 174 118 176 119 15 128 166 186 122 36 153 99 102 47 104 274 134 102 217 257 308 105 124 101 82 80 73 74 307 237 241 192 164 190
-253 190 88 95 41 188 158 161 59 58 27 291 158 94 97 55 113 156 39 73 116 85 45 106 170 123 119 171 162 228 153 56 76 152 54 153 228
$$ packed form
785A14%n6Q3l7k5l2K62k44J38J7j42M6O5j08Q3J1p8J04jq5N8k6M5L4J70j50q2J38k35M4K51
633C62j38O4N4j64J84L8l0J41j48K03j7n7K24j88O23J99K894K9328j0k6173K7239j188l2547
519H93J48K5j36k10j90J3l27M1L07k55K92l24J5m8O2k19M2K35k33L4P1J13r5l0J18rj09j25
382I9K87j72J9j26n4j0J40Ll2p7nj3K63j06l8l3N4j63J68j48Kj1K2J48J28k16Mm0pJ66j03
229A49m5J09p7j07oM5J08o0J13%j2Qj58k7P4K9m1o0O4M9q5Q6j08J35p6k4L1L9kj4P8j21j4
67H0J00j51J61j25LJ01M3k4j39J38r9O0L5j11j5J58k7k7K6M5L4r4n0J52j96J26KJ8L1j29N3
-86A79nn6N8n7j04J13L8K0o4q6J17n4Ln5N7J70j40l2J15M0N1k03J9k3j9kpJK33p0Mm9k8K6
-253A90j02Pn4J47l0Lj02jl1K64j33o4Lm2N8M3j17L4M3l1m0O1O4m7mN2rO6p5r7K0P6r8R9P5
$$ plain form
-426 228 230 256 59 109 104 57 76 99 124 90 59 96 42 89 56 309 112 155
$$ packed form
-426B28KK6j97N0nm7J9K3K5l4l1L7n4M7l3K53j97M3
-514A55
##PAGE=	F1=-1237.8
##FIRST=	4521.1594499999982872,	4521.1594499999982872,	0
##DATA TABLE=	(F2++(Y..Y)), PROFILE
$$ plain form
4521 87 14 181 98 132 171 36 125 165 148 227 168 69 34 95 220 56 196 69 49 81 105 232 198 157 100 186 21 131 85 80 226
4369 226 218 17 135 122 113 75 123 72 126 103 82 66 97 100 84 144 123 79 325 117 158 185 132 185 65 340 328 111 79 57 152 45
4211 45 80 51 170 84 38 70 107 112 144 133 90 117 189 159 121 130 85 132 58 109 87 165 53 201 172 321 370 20 196 9 135 340
4054 340 200 172 196 203 128 44 149 76 117 105 110 165 46 108 131 153 32 134 149 85 33 195 137 67 44 111 229 128 151 68 73 70 102
3891 102 68 124 58 140 41 139 139 94 150 37 111 70 192 114 85 144 31 214 134 71 84 163 197 115 140 157 44 143 97 171 93 33 146
3729 146 250 111 46 35 65 92 293 83 126 81 124 102 79 198 79 80 26 53 141 61 128 39 108 243 132 34 76 102 41 69 95
3576 95 323 295 90 87 99 81 42 190 127 207 137 142 181 98 201 52 181 70 59 20 93 146 132 233 191 105 197 162 93 167 134 51
3419 51 66 17 82 31 122 249 46 140 101 85 124 167 103 101 209 298 168 30 236 191 118 193 74 92 205 183 51 137 294 164
$$ packed form
4521H7p3J67q3L4L9j35Q9M0j7P9n9r9l5O1J25j64J40j27k0L2K4J27l4m1n7Q6j65J10m6nJ46
4369B26qk01J18j3rl8M8n1N4k3k1j6L1Lj6O0k1m4K46k08M1K7n3N3j20K75j2k17l2k2R5j07
4211D5L5k9J19q6m6L2L7NL2j1m3K7P2l0l8Rm5M7p4N1k2P8j12J48k9J49M9l50J76j87J26K05
4054C40j40k8K4Pp5q4J05p3M1j2NN5j19O2K3K2j21J02J5o4n2J62n8p0k3O7J18j01K3q3NlL2
3891A02l4N6o6Q2r9R8%m5N6j13P4m1J22p8k9N9j13J83q0o3J3P9L4q2K5J7j13R9m6P4p8o0J13
3729A46J04j39o5j1L0K7K01k10M3m5M3k2k3J19j19Jn4K7Q8q0O7q9O9J35j11r8M2K6o1K8K6
3576I5K28k8k05lJ2j8l9J48o3Q0p0NL9q3J03j49J29j11j1l9P3N3j4J01m2q6R2l5o9P4l3q3
3419E1J5m9O5n1R1J27k03R4l9j6L9M3o4kJ08Q9j30j38K06m5p3P5j19J8J13k2j32Q6J57j30
$$ plain form
3271 164 52 116 106 113 29 191 234 47 104 139 220 89 126 108 6 183 76 152 81 179 101 231 91 99 83 140 289 61 293 353
3123 353 224 243 140 56 213 112 166 86 181 249 102 86 249 141 64 39 86 7 182 149 176 126 225 18 86 85 158 77 165 81 184
2971 184 302 361 409 354 283 98 57 161 179 173 133 133 177 186 74 43 148 162 291 234 212 344 147 208 128 198 54 73 102 152 138 94
2813 94 264 229 150 184 42 199 108 123 65 86 210 69 64 71 34 115 86 210 205 213 104 58 130 168 115 99 67 64 104 201 184 196 122 148
2646 148 125 72 175 200 284 278 259 160 203 131 80 62 142 90 70 56 58 156 144 18 201 218 188 101 131 114 114 77 68 172 217 70 23 200
2478 200 145 80 97 83 102 132 150 219 167 151 94 125 357 107 142 110 37 90 69 118 56 105 307 200 253 239 109 167 74 108 55 74
2321 74 79 100 86 76 50 94 199 108 176 201 176 153 144 248 194 94 131 81 19 17 48 69 110 245 187 75 42 45 50 129 70 144 98 34 254
2149 254 102 243 122 91 109 129 205 45 134 156 173 387 321 265 170 48 158 183 186 81 128 43 108 60 157 214 157 43 68 232
$$ packed form
3271A64j12O4j0Pq4J62M3j87N7L5Q1j31L7j8j02J77j07P6p1R8p8J30j40Qj6N7J49k28K32O0
3123C53j29J9j03q4J57j01N4q0R5O8j47j6J63j08p7k5M7p9J75l3K7n0R9k07O8jP3q1Q8q4J03
2971A84J18N9M8n5p1j85m1J04J8om0%M4Rj12l1J05J4J29n7k2J32j97O1q0P0j44J9K9N0j4m4
2813I4J70l5p9L4j42J57r1J5n8K1J24j41nPl7Q1k9J24nQj09m6P2L8n3j6l2lM0R7j7J2p4K6
2646A48k3n3J03K5Q4oj9r9M3p2n1j8Q0n2k0j4KR8j2j26J83J7l0q7L0j7%l7rJ04M5j47m7J77
2478B00n5o5J7j4J9L0J8O9n2j6n7L1K32k50L5l2p3N3k1M9o2M9K02j07N3j4j30N8r3L4n3J9
2321G4NK1j4j0k6M4J05r1O8K5k5k3rJ04n4j00L7n0o2kL1K1M1J35n8j12l3LNP9n9P4m6o4K20
2149B54j52J41j21l1J8K0P6j60Q9K2J7K14o6n6r5j22J10K5Lj05M7q5O5m8R7N7n7j14K5J64
$$ plain form
2001 232 275 126 98 245 183 931 2322 1252 172 83 53 86 96 157 37 29 180 118 92 144 84 39 117 37 99 34 14 30 221
1858 221 115 243 76 119 117 120 227 160 49 154 89 31 148 217 149 193 92 167 301 362 90 270 224 367 128 165 251 394 815
1716 815 973 9222 25113 57230 56862 59479 21592 11836 1485 637 557 604 486 560 392 415 345 163 890 488 766
1612 766 123 225 70 61 185 225 58 22 27 106 146 57 133 60 100 63 192 177 111 215 127 229 37 198 125 492 510 132 190 71
1464 71 107 105 132 146 145 157 183 121 180 108 166 142 128 108 99 85 80 72 87 25 27 32 243 534 123 1495 2080 1009 109 163 155 146 70 116 114 69
1287 69 103 123 163 91 63 213 174 171 315 108 160 73 154 80 186 66 143 39 108 196 94 177 146 16 195 300 278 80 41 27
1140 27 83 107 143 175 37 79 128 201 165 139 54 7 142 85 66 136 135 103 217 262 163 229 164 153 76 85 50 155 220 118 215 173 116 138
972 138 176 196 238 150 46 74 109 98 81 174 224 86 142 209 87 187 234 233 136 155 59 87 193 167 164 215 261 68 152 145 198 46 143
$$ packed form
2001B32M3j49k8J47o2P48J391j070j080q9l0L3J0O1j20qJ51o2k6N2o0m5P8q0O2o5k0J6J91
1858B21j06J28j67M3kLJ07o7j11J05o5n8J17O9o8M4j01P5J34O1k72J80m6J43k39L7Q6J43M21
1716H15J58Q249J5891L2117l68K617l7887r756j0351q48q0M7j18P4j68K3p0j82P27m02K78
1612G66o43J02j55rJ24M0j67l6NP9M0q9P6p3M0l7J29j5o6J04q8J02j92J61p3L67J8l78N8j19
1464G1L6kK7J4jJ2K6o2N9p2N8k4j4k0rj4nqJ5o2KNK11K91m11J372N85j071r00N4qrp6M6km5
1287F9L4K0M0p2k8J50l9lJ44k07N2q7Q1p4J06j20P7j04O9Q8j02Q3l1j30J79J05k2j98l9j4
1140B7N6K4L6L2j38M2M9P3l6k6q5m7J35n7j9P0jl2J14M5r9O6o5j1p7Rl5J05O5j02R7m2n7K2
972A38L8K0M2q8j04K8L5j1j7R3N0j38N6O7j22J00M7jr7J9r6K8J06k6lN1M6j93Q4pN3j52R7
$$ plain form
810 143 111 166 209 127 181 105 78 154 163 64 73 318 37 229 258 44 97 202 32 198 196 153 203 230 156 214 186 211 217 428 255 235 320
647 320 160 143 404 273 359 392 266 514 500 455 666 407 722 662 644 885 749 1329 1670 4922 45960 43480 8683 47528
529 47528 42481 781 1182 1130 1011 819 727 643 300 326 709 430 723 353 315 286 433 108 184 426 204 159 263 424 259
406 259 187 364 371 245 165 399 219 231 168 115 44 239 216 173 87 143 68 294 170 195 162 257 17 175 72 64 76 111 250 342 169
254 169 160 69 96 238 177 105 202 113 78 16 117 218 125 191 220 219 220 98 56 112 146 94 56 150 194 110 168 31 212 83 55 122 149
91 149 153 174 238 114 90 172 66 168 32 44 169 219 217 47 154 104 163 197 58 21 197 208 187 181 257 271 149 129 325 99 248
-61 248 220 245 265 119 227 165 105 220 86 26 138 131 160 163 28 160 130 101 28 138 249 130 85 255 266 322 80 102 71 69 100
-214 100 69 99 304 201 197 157 173 159 77 97 29 199 148 128 90 51 64 318 136 139 110 25 147 156 11 84 73 75 53 128 161 164 164 151
$$ packed form
810A43l2N5M3q2N4p6k7P6Rr9RK45k81J92K9k14N3J05j70J66km3N0K7p4N8k8K5OK11j73k0Q5
647C20j60j7K61j31Q6L3j26K48j4m5K11k59L15o0j8K41j36N80L41L252M1038k480l4797L8845
529D7528n047m1700M01n2j19j92r2q4l43K6L83k79K93l70l8k9J47l25P6K42k22m5J04J61j65
406B59p2J77Pj26q0K34j80J2o3n3p1J95k3m3q6N6p5K26j24K5l3R5k40J58j03qJ2L5J39R2j73
254A69rr1K7J42o1p2R7q9l5o2J01J01r3O6K9jJj22m2N6L4n2l8R4M4q4N8j37J81j29k8O7K7
91A49MK1O4j24k4Q2j06J02j36J2J25N0kj70J07n0N9L4j39l7J76J1k1oP6J4j22k0J96k26J49
-61B48k8K5K0j46J08o2o0J15j34o0J12pK9Lj35J32l0k9p3J10J11j19m5J70J1N6k42K2l1kL1
-214A00l1L0K05j03mm0J6j4q2K0o8J70n1k0l8l9J3K54j82Lk9q5J22Rj45P3j1Kk2P5L3L%j3
$$ plain form
-381 151 121 203 175 56 123 166 67 188 235 257 260 66 84 108 47 84 110 85 86 38 125 77 114 94 324 156 187
$$ packed form
-381A51l0Q2k8j19O7M3r9J21M7K2Lj94J8K4o1L7K6k5Jm8Q7m8L7k0K30j68L1
-514A87
##PAGE=	F1=-1247.65
##FIRST=	4521.1594499999982872,	4521.1594499999982872,	0
##DATA TABLE=	(F2++(Y..Y)), PROFILE
$$ plain form
4521 65 57 179 121 140 178 17 110 192 127 202 177 85 47 107 209 81 146 101 47 62 98 201 215 160 119 140 89 107 93 130 206 218 12
4359 12 118 53 114 93 104 81 85 78 64 70 77 130 108 91 142 36 265 94 130 157 147 221 57 312 333 108 64 68 132 58 74 43 144 67
4191 67 32 82 154 118 146 156 72 111 170 172 144 85 118 163 56 112 65 148 45 184 159 323 340 16 190 17 151 353 182 148 237
4039 237 272 138 32 112 133 125 116 88 151 39 102 130 132 26 165 123 100 13 180 153 81 33 94 229 126 151 70 52 61 134 81 157 87
3876 87 123 57 93 148 94 128 17 138 93 185 130 86 132 22 232 141 51 115 179 236 149 118 152 38 179 78 177 51 54 167 261
3724 261 121 35 75 47 91 310 100 103 57 105 99 112 215 68 81 29 49 136 116 140 94 59 176 99 48 124 98 11 54 99 326 322 112
3561 112 90 70 102 68 184 92 201 112 175 195 85 175 91 169 45 65 31 49 124 145 211 183 85 190 172 77 178 97 61 44 19 52
3404 52 13 125 231 50 132 106 86 119 166 72 53 224 333 182 50 196 136 111 183 84 117 159 158 53 153 306 174 63 173
$$ packed form
4521F5qJ22n8J9L8j61R3Q2o5P5k5r2l8O0J02j28O5m5n4J5L6J03J4n5m1K1n1J8j4L7P6J2k06
4359A2J06o5O1k1J1k3Mpj4OPN3k2j7N1j06K29j71L6K7j0P4j64K55K1k25m4MO4p4J6l1J01p7
4191F7l5N0P2l6K8J0q4L9N9Kk8n9L3M5j07N6m7Q3j03J39k5J64J7l24J74j73J34K02j71l4Q9
4039B37L5j34j06Q0K1qrk8O3j12O3K8Kj06J39m2k3q7J67k7p2m8O1J35j03K5q1j8RP3n3P6p0
3876H7L6o6L6N5n4L4j11J21m5R2n5m4M6j10K10r1r0O4O4N7q7l1L4j14J41j01R9j26LJ13R4
3724B61j40q6M0k8M4K19k10Lm6M8oJ3J03j47J3n2K0Q7k0K4m6l5J17p7n1P6k6q7M3M5K27mk10
3561A12k2k0L2l4J16r2J09q9O3K0j10R0q4P8j24K0l4J8P5K1O6k8r8J05j8r5J01q1l6j7k5L3
3404E2l9J12J06j81Q2k6k0L3M7r4j9J71J09j51j32J46o0k5P2r9L3M2jj05J00J53j32j11J10
$$ plain form
3261 173 144 123 40 167 240 74 126 167 245 93 145 109 18 165 26 132 52 143 104 216 80 98 79 130 289 125 334 247 245 202
3113 202 129 79 208 90 195 79 173 224 38 101 208 131 71 16 62 37 196 120 127 108 225 31 85 65 157 84 87 37 180 253 301
2961 301 359 429 356 148 98 189 176 146 119 150 176 190 67 47 122 153 275 195 183 271 101 223 129 196 47 32 99 121 146 85 277
2808 277 246 139 143 44 175 112 157 21 58 173 65 54 116 58 80 71 195 182 210 101 43 101 147 136 68 37 62 113 199 178 227 169
2651 169 166 155 64 186 224 266 255 242 167 195 107 96 61 114 85 63 110 21 143 123 34 227 219 215 63 81 128 130 115 77 179 224 77 56
2483 56 209 146 85 108 119 123 142 115 207 175 153 93 111 351 109 123 82 70 121 110 95 54 113 300 194 258 261 110 172 74 74 112 75 49
2316 49 26 97 59 41 104 131 72 179 196 130 128 125 227 180 124 149 35 54 28 81 130 105 215 165 96 49 23 66 112 67 146 98 52 217
2149 217 61 237 81 98 115 159 218 70 139 180 169 324 285 219 154 30 175 200 193 100 109 79 135 33 157 204 143 28 52 220
$$ packed form
3261A73k9k1q3J27P3j66N2M1P8j52N2l6r1J47j39J06q0R1l9J12j36J8j9N1J59j64K09q7km3
3113B02p3n0J29j18J05j16R4N1j86O3J07p7o0n5M6k5J59p6Pj9J17j94N4k0R2p3Ln0J43P3M8
2961C01N8P0p3k08n0R1j3l0k7L1K6J4j23k0P5L1J22q0j2Q8j70J22r4O7j49j5O7K2K5o1J92
2808B77l1j07Mr9J31o3M5j36L7J15j08j1O2n8K2rJ24j3K8j09n8N8M6j1o8l1K5N1Q6k1M9n8
2651A69lj1r1J22L8M2j1j3p5K8q8j1l5N3k9k2M7q9J22k0q9J93qmj52J8M7Kj5l8J02M5j47k1
2483E6J53o3o1K3J1MJ9k7R2l2k2o0J8K40k42J4m1j2N1j1j5m1N9J87j06O4Lj51O2r8%L8l7k6
2316D9k3P1l8j8O3K7n9J07J7o6klJ02m7n6K5j14J9k6N3M9k5J10n0o9m7k6M3M6m5P9m8m6J65
2149B17j56J76j56J7J7M4N9j48O9M1j1J55l9o6o5j24J45K5pr3Rl0N6j02J24M7o1j15K4J68
$$ plain form
2001 220 258 115 134 211 168 1007 2529 1365 148 88 40 99 90 111 78 58 159 135 128 138 100 39 145 34 128 41 56 51 204 85
1853 85 240 39 84 92 117 232 157 8 126 98 18 128 142 155 189 106 149 307 355 55 292 193 272 133 74 100 314 550 780
1711 780 8001 25390 52620 56772 55441 22384 11250 1318 545 575 380 349 479 317 411 490 307 1354 705 1256
1612 1256 244 368 82 91 153 189 70 29 44 117 166 30 164 70 111 71 207 181 120 208 148 215 24 196 84 512 499 150
1474 150 248 124 117 110 125 145 184 147 153 123 201 78 203 151 126 78 101 83 79 36 70 40 68 45 395 684 110 995 1203 755 76 156
1317 156 152 114 18 131 130 106 104 124 161 82 84 206 179 152 261 109 126 63 191 83 188 61 122 31 111 197 83 158 135 16 201
1164 201 273 264 83 57 43 85 119 116 154 61 84 129 233 172 147 73 63 145 82 68 111 140 119 263 264 145 215 221 147 87 60 73 142 242
997 242 120 233 166 145 172 152 165 241 134 48 84 119 128 72 170 213 95 185 209 86 188 225 248 72 129 84 74 162 164 129 226 283 66
$$ packed form
2001B20L8j43J9P7m3Q39J522j164j217o0m8N9rK1l3k0J01k4pJ0l8o1J06j11R4q7J5nJ53j19
1853H5J55k01M5QK5J15p5j49J18k8q0J10J4J3L4q3M3J58M8l00K37r9P9j39n9K6K14K36K30
1711G80P221J7389K7230M152j331l3057j1134r932p73L0j95l1J30j62R4P9j83J047o49N51
1612A256j012J24k86RO2L6j19m1J5P3M9j36J34r4M1m0J36k6o1Q8o0O7j91J72j12M28j3l49
1474A50R8j24ppJ5K0L9l7Ol0P8j23J25n2k5m8K3j8mm3L4l0K8k3L50K89n74Q85K08m48o79Q0
1317A56ml8r6J13jk4kK0L7p9KJ22k7k7J09j52J7o3J28j08J05j27O1r1Q0Q6j14P5k3j19J85
1164B01P2rj81k6j4M2L4lL8r3K3M5J04o1k5p4j0Q2o3j4M3K9k1J44Jj19P0Op4o0k7J3O9J00
997B42j22J13o7k1K7k0J3P6j07q6L6L5Rn6R8M3j18R0K4j23J02L7K3j76N7m5j0Q8Kl5R7N7k17
$$ plain form
834 66 186 108 212 37 126 127 149 249 144 218 86 90 166 204 64 105 293 78 226 282 19 90 200 29 224 201 190 184 238 176
687 176 241 186 203 193 428 241 268 306 226 164 418 289 378 416 315 581 509 482 714 397 789 705 707 967 902 1438 1965 5742 47810
544 47810 43149 9053 49066 42086 1886 1478 1201 1032 871 835 676 333 360 753 471 751 392 286 290 515 115 204
436 204 449 249 147 253 472 234 147 372 375 249 207 380 236 213 198 173 30 275 215 172 129 198 64 247 119 190 172 291
298 291 30 135 166 86 94 143 265 321 197 170 39 97 201 189 89 199 96 128 19 151 233 131 134 216 208 192 127 99 112 142 112
145 112 72 188 222 145 178 53 221 70 13 126 147 148 201 247 128 108 154 113 133 8 33 169 211 225 50 99 120 168 193 43 38
-7 38 181 217 208 162 285 263 143 136 343 125 281 223 262 269 115 267 138 101 254 44 32 131 90 116 189 18 165 151 123 33 158
-160 158 212 120 72 270 276 308 48 65 56 56 109 59 118 297 159 145 140 177 135 69 89 31 192 134 77 114 46 110 333 126 165 124 12
$$ packed form
834F6J20p8J04j75Q9JK2J00j05P4j32MP6L8j40M1J88k15J48N6k63P1J10j71J95k3j1oN4o2
687A76O5n5J7j0K35j87K7L8q0o2K54j29Q9L8j01K66p2k7K32l17L92q4KK60o5N36N27L777M2068
544D7810m661l4096M0013o980m0200m08k77j69j61l6j59l43K7L93k82K80l59j06MK25m00Q9
436B04K45k00j02J06K19k38q7K25Lj26m2J73j44k3j5k5j43K45o0m3m3O9j34J83j28P1j8J19
298B91k61J05L1q0QM9J22N6j24k7j31N8J04j2j00J10j03L2j09J32Q2j02LQ2qj6o5k8J3L0l0
145A12m0J16L4p7L3j25J68j51n7J13K1JN3M6j19k0M6m1K0j25K5J36M2J4j75M9K1M8K5j50n
-7C8J43L6rm6J23k2j20pK07k18J56n8L9Pj54J52j29l7J53k10j2R9m1K6P3j71J47j4k8r0J25
-160A58N4r2m8J98OL2k60J7r%N3n0N9J79j38j4nL7m2o6K0n8J61n8n7L7o8O4K23k07L9m1j12
$$ plain form
-322 12 170 134 33 119 13 56 49 147 169 215 226 118 82 198 177 54 168 179 92 206 216 277 237 45 46 97 50 117 107 61 82 34
-480 34 135 131 109 130 313 199 190
$$ packed form
-322A2J58l6j01Q6j06M3pR8K2M6J1j08l6J16k1j23J14J1q7J14J0O1m0j92JN1m7O7j0m6K1m8
-480C4J01mk2K1J83j14r
-514A90
##PAGE=	F1=-1257.49
##FIRST=	4521.1594499999982872,	4521.1594499999982872,	0
##DATA TABLE=	(F2++(Y..Y)), PROFILE
$$ plain form
4521 34 81 170 145 131 175 19 76 212 103 159 176 84 61 136 175 117 124 121 35 23 93 166 234 153 120 87 178 82 106 166 170 205 17 89 27
4349 27 131 104 80 84 44 53 47 75 54 147 133 21 136 34 195 78 100 128 164 243 46 273 326 108 48 71 109 83 77 37 118 53 33
4186 33 97 188 125 140 169 78 105 144 172 166 78 154 182 63 113 65 145 26 155 150 307 297 22 165 46 159 353 159 128 270 333
4034 333 148 63 90 191 136 119 74 136 91 86 136 118 38 185 88 105 42 162 159 95 63 77 227 135 154 81 32 59 158 75 186 108 113
3871 113 79 74 165 108 122 30 157 106 167 135 89 118 55 244 143 47 132 181 253 172 92 155 27 198 74 171 20 77 181 252 122
3719 122 36 111 47 95 303 122 80 48 92 103 153 207 44 89 56 43 126 156 157 151 13 100 68 51 156 142 41 41 104 308 318 133
3561 133 108 48 113 104 173 67 187 96 189 195 78 137 124 154 46 77 41 48 84 144 183 167 51 174 175 70 189 66 69 60 19 10 52 128
3394 128 209 43 127 116 79 110 159 39 44 253 348 192 67 145 83 113 172 98 148 106 132 47 184 308 176 78 215 183 133 61 142
$$ packed form
4521C4M7Q9k5j4M4j56N7J36j09N6J7r2k3P5L9n8Plq6j2P0P3O8q1l3l3R1r6K4O0ML5j88P2o2
4349B7J04k7k4Mm0RoK8k1R3j4j12J15j02J61j17K2K8L6P9j97K27N3k18o0K3L8k6om0Q1o5k0
4186C3O4R1o3J5K9r1K7L9K8oq8P6K8j19N0m8Q0j19J29nJ57j0k75J43j19J13J94j94l1J42O3
4034C33j85q5K7J01n5j7m5O2m5nN0j8q0J47r7J7o3J20lo4l2J4J50r2J9p3m9K7R9q3J11p8N
3871A13l4nR1n7J4r2J27n1O1l2m6K9o3J89j01r6Q5M9P2q1q0O3j28J71j24R7j51N7J04P1j30
3719A22q6P5o4M8K08j81m2l2M4J1N0N4j63M5l3j3Q3L0Joj38Q7l2j7J05j4j01%O3K04J0j85
3561A33k5o0O5rO9j06J20r1R3Oj17N9j3L0j08L1l6PL6O0L9j6j16J23Jj05J19j23Lrm1rM2P6
3394A28Q1j66Q4j1l7L1M9j20NK09R5j56j25P8o2L0N9p4N0m2K6q5J37J24j32r8J37l2n0p2Q1
$$ plain form
3241 142 230 97 146 187 267 75 147 100 34 139 33 135 25 109 112 177 70 96 107 117 273 219 444 241 262 146 112 119 208 86
3094 86 218 74 156 184 25 90 153 129 100 29 42 73 200 108 77 87 206 44 86 59 144 83 31 36 167 198 231 366 537 427 202
2941 202 128 202 153 127 105 157 163 170 74 58 95 175 258 162 149 188 59 233 129 176 33 52 93 95 144 72 267 239 129 84 55 137 115
2779 115 193 30 46 135 83 53 157 104 70 61 156 167 240 149 22 74 111 149 84 16 53 123 195 167 249 211 173 178 42 180 229 228 218 217
2611 217 174 169 82 114 53 80 74 68 159 29 118 106 57 234 214 241 69 46 147 139 151 84 179 222 87 93 209 144 84 115 154 138 139 84 206
2439 206 182 154 91 99 326 110 103 57 98 139 154 78 72 122 279 178 249 256 108 175 74 35 174 80 68 58 105 60 31 108 51 48 167
2277 167 190 91 94 103 182 144 143 166 44 84 43 125 195 118 159 136 116 93 64 80 94 65 141 100 84 167 25 224 48 100 125 175 215 105
2109 105 130 202 156 248 241 159 129 52 180 207 193 107 84 113 172 4 142 195 130 41 33 199 232 114 173 170 181 1050 2656 1425 116
$$ packed form
3241A42Q8j33M9M1Q0j92P2m7o6J05j06J02j10Q4LO5j07K6J1J0J56n4K25k03K1j16l4PQ9j22
3094H6J32j44Q2K8j59O5O3k4k9p1J3L1J27r2l1J0J19j62M2k7Q5o1n2NJ31L1L3J35J71j10k25
2941B02p4P4m9k6k2N2OPr6j6L7Q0Q3r6j3L9j29J74j04M7j43J9M1KM9p2J95k8j10m5k9Q2k2
2779A15P8j63J6Q9n2l0J04n3l4rR5J1P3r1j27N2L7L8o5o8L7P0P2k8Q2l8l8Nj36J38M9jj0j
2611B17m3nq7L2o1K7ooR1j30Q9j2m9J77k0K7j72k3J01qJ2o7R5M3j35OJ16o5o0L1L9j6Jn5J22
2439B06k4k8o3QK27k16pm6M1M1J5p6oN0J57j01P1Pj48O7j01l9J39r4j2j0M7m5k9P7n7lJ19
2277A67K3r9LRP9l8jK3j22M0m1Q2P0p7M1k3k0k3k9J6J4k9P6m1j6Q3j42J99j76N2K5N0M0j10
2109A05K5P2m6R2pq2l0p7J28K7j4q6k3K9N9j68J38N3o5q9qJ66L3j18N9lJ1Q69J606j231j309
$$ plain form
1957 116 90 26 101 85 79 116 87 132 152 173 123 106 42 158 41 174 67 89 79 177 69 217 15 50 70 116 241 162 52 104 92
1804 92 34 102 98 155 164 107 141 298 321 63 295 152 186 155 46 110 261 263 685 7193 24739 46640 54413 48793 22347 9766
1676 9766 1041 494 520 178 196 384 235 368 603 462 1819 943 1798 348 523 90 109 133 152 91 42 63 114 168 43
1553 43 189 80 117 75 205 171 109 165 164 192 74 194 59 497 461 145 284 189 121 112 111 140 216 148 109 110 194 51 219 158 123 48
1396 48 100 81 77 21 43 84 117 57 539 791 118 1022 1018 694 67 144 156 80 41 139 136 139 99 122 167 83 111 188 182 129 192 96 104 86 217
1223 217 97 174 52 101 49 127 200 70 125 132 7 202 250 239 92 76 53 106 128 104 133 77 88 108 248 164 142 90 114 139 74 64
1066 64 74 141 149 309 235 130 189 256 144 85 39 99 134 235 108 239 141 172 195 129 144 235 115 57 80 109 152 56 143 197 98 208
908 208 213 74 181 214 257 29 102 108 72 137 152 84 233 295 71 205 69 209 31 95 127 127 280 157 225 63 95 187 230 78
$$ packed form
1957A16k6o4P5j6oL7k9M5K0K1n0j7o4J16j17J33j07K2j0R8j08J48k02L5K0M6J25p9j10N2j2
1804I2n8O8mN7Rn7L4J57K3k58K32j43L4l1j09O4J51KM22O508J7546K1901P773n620k6446j2581
1676I766q725n47K6l42J8J88j49J33K35j41J357q76Q55j450J75m33J9K4J9o1m9K1N1N4j25
1553D3J46j09L7m2J30l4o2N6jK8j18J20j35M38l6l16J39r5o8rjK9P6o8l9JQ4j43J68o1l5p5
1396D8N2j9mn6K2M1L3o0M82K52o73R04ml24o27P7J2p6l9R8lLm0K3M5q4K8P7on3O3r6Qj8J31
1223B17j20P7j22M9n2P8P3j30N5Pj25J95M8j1j47j6k3N3K2k4K9n6J1K0J40q4k2n2K4K5o5j0
1066F4J0O7QJ60p4j05N9O7j12n9m6O0L5J01j27J31r8L1K3o6J5R1j20n8K3K9M3r6Q7N4r9J10
908B08Nj39J07L3M3k28P3Ol6O5J5o8J49O2k24J34j36J40j78O4L2%J53j23O8j62L2R2M3j52
$$ plain form
761 78 133 247 134 200 295 69 88 193 68 239 188 208 160 235 171 261 157 179 157 410 211 268 273 270 172 416 291 353 427 338 587
608 587 464 472 691 351 792 699 704 981 990 1481 2178 6405 43320 38084 8820 43905 37456 2912 1723 1249 1012 875
500 875 864 678 342 358 744 452 727 414 226 276 556 121 196 443 273 131 221 496 195 110 369 354 245 230 342 258 185
367 185 202 220 59 297 194 157 168 237 51 195 82 166 173 299 58 97 248 117 103 168 260 295 209 165 14 92 147 184 62 191
$$ packed form
761G8N5J14j13O6R5k26J9J05j25J71n1K0m8P5o4R0j04K2k2K53j99N7Nlr8K44j25O2P4q9K49
608E87j23QK19l40M41r3NK77RM91O97M227L6915n236k9264L5085o449l4544j189m74k37j37
500H75j1j86l36J6L86k92K75l13j88N0K80m35P5K47j70j42R0K75l01q5K59j5j09j5J12q4p3
367A85J7J8j61K38j03l7J1O9j86J44j13Q4PJ26k41L9J51j31j4O5R2L5q6m4j51P8N5L7j22J29
$$ [...]
-514H0
##END NTUPLES=	nD NMR SPECTRUM
##END=	
##END=	
