##TITLE=	9WMQQ9cvRq2tdiX$pijoIQ.51.ser
TM-VI-169 acetone-d6 Mg+Bz-pyr. cosy

##JCAMP-DX=	6.0	$$ MestReNova 14.3.0-30573
##DATA TYPE=	LINK
##BLOCK_ID=	1
##BLOCKS=	2    
##ORIGIN=	Mestrelab Research S.L.
##OWNER=	hrzepa
##$MNOVA/LINK_BLOCK_TYPE=	ITEM	$$ NMR Spectrum
##$MNOVA/ITEM/POLYGON=	(XY..XY)
5321,5835
8722,5835
8722,8208
5321,8208
5321,5835
##$MNOVA/ITEM/Z=	0
##$MNOVA/ITEM/ANGLE=	0
##TITLE=	9WMQQ9cvRq2tdiX$pijoIQ.51.ser
##JCAMP-DX=	6.0	$$ MestReNova 14.3.0-30573
##BLOCK_ID=	2
##DATA TYPE=	MNOVA NMR VIEW DATA
##DATA CLASS=	MNOVA VIEW DATA
##$MNOVA/2D/THRESHOLD=	10.895283699035644531
##$MNOVA/ITEM/ZOOM/X=	-1.2849598716208046056,	11.297249999948046906
##$MNOVA/ITEM/ZOOM/Y=	-1.2849598716208046056,	11.297249999948046906
##END=	
##TITLE=	9WMQQ9cvRq2tdiX$pijoIQ.51.ser
##JCAMP-DX=	6.0	$$ MestReNova 14.3.0-30573
##BLOCK_ID=	3
##DATA TYPE=	nD NMR SPECTRUM
##DATA CLASS=	NTUPLES
##NUMDIM=	2
##ORIGIN=	Bruker BioSpin GmbH
##OWNER=	nmr
##.OBSERVE FREQUENCY=	400.20200099999999566
##.OBSERVE NUCLEUS=	^1H
##.SOLVENT NAME=	Acetone
##.PULSE SEQUENCE=	cosygpqf
##LONGDATE=	2021/11/18 13:58:19.000
##.ACQUISITIONMODE=	SIMULTANEOUS (DQD)
##$ORIGINAL FORMAT=	Bruker XWIN-NMR
##$MNOVA/SCALES_VERSION=	9
##$PARAMETER FILE=	(acqu2s, ASCII, /private/var/folders/f6/rjf_tdyn2v98c5c0wvkgn4s80000gn/T/9WMQQ9cvRq2tdiX$pijoIQ/51/acqu2s, 0)
$$ ##TITLE= Parameter file, TOPSPIN		Version 3.2
$$ ##JCAMPDX= 5.0
$$ ##DATATYPE= Parameter Values
$$ ##NPOINTS= 221	$$ modification sequence number
$$ ##ORIGIN= Bruker BioSpin GmbH
$$ ##OWNER= nmr
$$ $$ 2021-11-18 14:07:18.739 +0000  nmr@CZC2439F63
$$ $$ /opt/topspin/data/agmb/nmr/Nov18-2021/51/acqu2s
$$ $$ process /opt/topspin3.2/prog/mod/go
$$ ##$ACQT0= 0
$$ ##$BF1= 400.2
$$ ##$FnMODE= 1
$$ ##$NUC1= <1H>
$$ ##$NusJSP= 0
$$ ##$NusT2= 1
$$ ##$NusTD= 220
$$ ##$O1= 2001.00000000702
$$ ##$SFO1= 400.202001
$$ ##$SW= 12.5944462247833
$$ ##$SW_h= 5040.32258064516
$$ ##$TD= 220
$$ ##END=
$$ 
##$PARAMETER FILE=	(acqus, ASCII, /private/var/folders/f6/rjf_tdyn2v98c5c0wvkgn4s80000gn/T/9WMQQ9cvRq2tdiX$pijoIQ/51/acqus, 0)
$$ ##TITLE= Parameter file, TOPSPIN		Version 3.2
$$ ##JCAMPDX= 5.0
$$ ##DATATYPE= Parameter Values
$$ ##NPOINTS= 12	$$ modification sequence number
$$ ##ORIGIN= Bruker BioSpin GmbH
$$ ##OWNER= nmr
$$ $$ 2021-11-18 14:07:22.112 +0000  nmr@CZC2439F63
$$ $$ /opt/topspin/data/agmb/nmr/Nov18-2021/51/acqus
$$ $$ process /opt/topspin3.2/prog/mod/shimcntl
$$ ##$ACQT0= 1000000
$$ ##$AMP= (0..31)
$$ 100 100 100 100 100 100 100 100 100 100 100 100 100 100 100 100 100 100
$$ 100 100 100 100 100 100 100 100 100 100 100 100 100 100
$$ ##$AMPCOIL= (0..19)
$$ 0 0 0 0 0 0 0 0 0 0 0 0 0 0 0 0 0 0 0 0
$$ ##$ANAVPT= -1
$$ ##$AQSEQ= 0
$$ ##$AQ_mod= 3
$$ ##$AUNM= <au_zg>
$$ ##$AUTOPOS= <47 >
$$ ##$BF1= 400.2
$$ ##$BF2= 400.2
$$ ##$BF3= 400.2
$$ ##$BF4= 400.2
$$ ##$BF5= 400.2
$$ ##$BF6= 400.2
$$ ##$BF7= 400.2
$$ ##$BF8= 400.2
$$ ##$BYTORDA= 0
$$ ##$CAGPARS= (0..11)
$$ 0 0 0 0 0 0 0 0 0 0 0 0
$$ ##$CFDGTYP= 0
$$ ##$CFRGTYP= 9
$$ ##$CHEMSTR= <none>
$$ [...]
$$ 0 0 0 0
$$ ##$ShimPowMaxUC= (0..63)
$$ 130000 130000 130000 130000 130000 130000 130000 130000 130000 130000 130000
$$ 130000 130000 130000 130000 130000 130000 130000 130000 130000 0 0 0 0
$$ 0 0 0 0 0 0 0 0 0 0 0 0 0 0 0 0 0 0 0 0 0 0 0 0 0 0 0 0 0 0 0 0 0 0 0 0
$$ 0 0 0 0
$$ ##$ShimPowMaxUG= (0..63)
$$ 524287 524287 524287 524287 524287 524287 524287 524287 524287 524287 524287
$$ 524287 524287 524287 524287 524287 524287 524287 524287 524287 0 0 0 0
$$ 0 0 0 0 0 0 0 0 0 0 0 0 0 0 0 0 0 0 0 0 0 0 0 0 0 0 0 0 0 0 0 0 0 0 0 0
$$ 0 0 0 0
$$ ##$ShimPowRcbType= 3
$$ ##$ShimPowRes= (0..63)
$$ 1e-20 1e-20 1e-20 1e-20 1e-20 1e-20 1e-20 1e-20 1e-20 1e-20 1e-20 1e-20
$$ 1e-20 1e-20 1e-20 1e-20 1e-20 1e-20 1e-20 1e-20 0 0 0 0 0 0 0 0 0 0 0 0
$$ 0 0 0 0 0 0 0 0 0 0 0 0 0 0 0 0 0 0 0 0 0 0 0 0 0 0 0 0 0 0 0 0
$$ ##$ShimPowRng0= (0..63)
$$ 1 1 1 1 1 1 1 1 1 1 1 1 1 1 1 1 1 1 1 1 0 0 0 0 0 0 0 0 0 0 0 0 0 0 0 0
$$ 0 0 0 0 0 0 0 0 0 0 0 0 0 0 0 0 0 0 0 0 0 0 0 0 0 0 0 0
$$ ##$ShimPowRng1= (0..63)
$$ 1 1 1 1 1 1 1 1 1 1 1 1 1 1 1 1 1 1 1 1 0 0 0 0 0 0 0 0 0 0 0 0 0 0 0 0
$$ 0 0 0 0 0 0 0 0 0 0 0 0 0 0 0 0 0 0 0 0 0 0 0 0 0 0 0 0
$$ ##$ShimPowRng2= (0..63)
$$ 1 1 1 1 1 1 1 1 1 1 1 1 1 1 1 1 1 1 1 1 0 0 0 0 0 0 0 0 0 0 0 0 0 0 0 0
$$ 0 0 0 0 0 0 0 0 0 0 0 0 0 0 0 0 0 0 0 0 0 0 0 0 0 0 0 0
$$ ##$ShimPowRng3= (0..63)
$$ 1 1 1 1 1 1 1 1 1 1 1 1 1 1 1 1 1 1 1 1 0 0 0 0 0 0 0 0 0 0 0 0 0 0 0 0
$$ 0 0 0 0 0 0 0 0 0 0 0 0 0 0 0 0 0 0 0 0 0 0 0 0 0 0 0 0
$$ ##$ShimSysFunc= (0..63)
$$ 1 2 3 4 5 7 9 11 15 16 8 10 12 14 6 17 13 18 19 20 0 0 0 0 0 0 0 0 0 0
$$ 0 0 0 0 0 0 0 0 0 0 0 0 0 0 0 0 0 0 0 0 0 0 0 0 0 0 0 0 0 0 0 0 0 0
$$ ##$ShimSysMatrix= 0
$$ ##$ShimSysType= 1
$$ ##$TFXNUM= 0
$$ ##$TRIPLO2= 0
$$ ##$VTU= 2
$$ ##$VTUETH= <149.236.99.20>
$$ ##$VTUTY= <no>
$$ ##$WBREFAM= (0..15)
$$ 135.5 97.7 100 100 100 100 100 100 100 100 100 100 100 100 100 100
$$ ##$WBREFLM= (0..15)
$$ 0 0 0 0 0 0 0 0 0 0 0 0 0 0 0 0
$$ ##$WBREFPH= (0..15)
$$ 72.26 -67.22 0 0 0 0 0 0 0 0 0 0 0 0 0 0
$$ ##$WBSGU= (0..15)
$$ 0 0 0 0 0 0 0 0 0 0 0 0 0 0 0 0
$$ ##$XFAC= 2
$$ ##END=
$$ 
##$DECIM=	3968
##$DSPFVS=	20
##.ACQUISITIONSCHEME=	NOT PHASESENSITIVE
##NTUPLES=	nD NMR SPECTRUM
##VAR_NAME=	FREQUENCY1,	FREQUENCY2,	SPECTRUM
##SYMBOL=	F1,	F2,	Y
##.NUCLEUS=	1H,	1H
##.OBSERVE FREQUENCY=	400.20200099999999566,	400.20200099999999566
##VAR_TYPE=	INDEPENDENT,	INDEPENDENT,	DEPENDENT
##VAR_FORM=	AFFN,	AFFN,	ASDF
##VAR_DIM=	1024,	1024,	1048576
##UNITS=	HZ,	HZ,	ARBITRARY UNITS
##FIRST=	4521.1594499999982872,	4521.1594499999982872,	0.18790379166603088379
##LAST=	-514.24094062501069402,	-514.24094062501069402,	0.20066937804222106934
##MIN=	-514.24094062501069402,	-514.24094062501069402,	3.9045073208399116993e-05
##MAX=	4521.1594499999982872,	4521.1594499999982872,	743.0906982421875
##FACTOR=	1,	1,	0.0014324940220513293805
##PAGE=	F1=4521.16
##FIRST=	4521.1594499999982872,	4521.1594499999982872,	0.18790379166603088379
##DATA TABLE=	(F2++(Y..Y)), PROFILE
$$ [...]
##PAGE=	F1=-1464.22
##FIRST=	4521.1594499999982872,	4521.1594499999982872,	0
##DATA TABLE=	(F2++(Y..Y)), PROFILE
1967F7k5O8j8K4p0P3L2j9Q2j31o8J28O6j44N7J20n3p5K8q5P9Rm0po4J16j01J23j0M1m7Om4
1804A18j5m4P8j9o3J08J42j84p6J04q3K9q4K6J00m6N5M9q9m0J9K6r4J11J38Nj86k7J53J5K3
1652B49M9j76p6N8J7N3q8N8J69j23o9NJ40k51K7L7P7l5O5O83O91m49q87k4L31K7l3J507j563
1509D69k24K31N99N57K486J3495k208j0558l119q59j74o5l62J201m30o1p76O7o7j24J50l6
1400A92l6j38J15O4l6j8P9n6q2L8p5Q4p5Q5N3n7NmJ6j00K3Q9K50k30o1M2p7N2j9j1j09J57
1243A60O9j83PJ35j2j32N4pJ7J7J38k06J43j58j7J29q9J18j50R5Q8Q0j31QJ29j35M2J1j02
1100A18M1J7K2q6n2J17Q2j97R0m1n6pQ3J01r4r4j5L4P4Mk3J01q3J12R5k24J7r0P5J03k4p2
943A28L1j11J57mj53O8l1P7q5RM0L9L0j16Q5p5koQ4j06R6K32K28k97k39Q8L4P9j04k7M7k2
$$ plain form
1967 67 42 110 92 116 46 119 151 132 214 83 15 143 209 65 122 242 189 114 142 57 136 145 105 98 34 150 49 172 162 203 156 162 118
1804 118 103 59 137 118 55 163 305 121 45 149 66 95 11 37 137 91 146 195 106 66 85 111 17 128 266 271 85 58 211 226 249
1652 249 298 122 46 104 121 174 86 144 313 190 121 126 266 15 42 79 156 121 186 869 1560 1111 224 200 531 558 525 2032 469
1509 469 245 476 1075 1632 4118 17613 15405 4847 1728 869 695 630 268 1469 1039 978 202 269 202 78 228 192
1400 192 156 18 133 197 161 143 222 166 84 122 47 131 56 141 194 137 142 138 154 54 77 166 416 186 125 167 90 142 123 112 3 160
1243 160 229 46 53 188 176 44 98 91 108 125 263 57 200 42 25 154 65 183 33 128 216 296 165 173 302 167 209 220 118
1100 118 159 176 198 112 60 177 259 62 152 111 55 48 131 232 138 44 29 63 137 141 118 219 136 248 343 119 136 46 121 224 200 128
943 128 159 48 205 201 48 116 85 162 77 86 126 165 195 79 164 89 87 81 165 59 155 387 615 318 79 167 201 280 176 149 196 174
785A74j05N6J3N7j18M0Pj8o0O8n4R1j9j06Q3l2M8Rn5K8M0K3o7p9K15J7o7k3j8j20L6J19k2
623A61r2J33J10J7j01o6p9M8p0K1M0R0k7j56J7N6R7j1j19nM0J07o3j9j19J49K08k22o9R1j30
470C7P05M04l07M38K99j434rJ2j8J3j07R2K9P5o6j21J05o5P7m2J22J8j02p2k4P2o9J87J5j54
323A10Mn5J43j01l2P0O1M6N9r1j78M8O7r1R0oR8j38o4P8n6J71L9M1nj5k27J04J76j88r6J20
165A82l6j03N8R6P9k5k8j37k6K7N4p9J30m4p6M7Q0m1M2j34J13L7p5j08N5L0R4l0q9j2pJ3k6
3F1M0J14j28lo7J48p9m7L5K08n7j69J14j4j29L2L1n5K3L7N2j14L0O9L1j15J08%Mj15L23j50
-155B18j25o7N4kKM9J07j35M5j10K23r8k8QJK5j12M7m7R2p3P2O5m2M8m0j32Q2o9J63j78J02
-312A45n4M9Mp0qL0M2n3lJ5j6N3k1M9r4PJ5O1k0n7Q3M9j01P4L6j47j2P9L0p7m9J09m2p7R6
$$ plain form
785 174 69 125 138 195 77 117 124 106 46 114 60 151 132 26 109 77 125 134 79 107 147 170 103 24 239 256 189 166 148 28 64 183 161
623 161 69 202 312 329 228 162 83 131 61 82 122 212 185 29 46 102 199 188 69 64 104 211 148 129 10 159 367 145 76 167 37
470 37 742 1146 839 1277 1576 142 133 145 127 140 33 125 154 229 163 42 147 82 159 117 239 257 155 83 59 131 62 249 264 110
323 110 114 59 202 101 69 139 200 246 305 214 36 84 151 60 150 144 242 104 40 118 62 233 272 313 308 293 66 170 346 158 62 182
165 182 146 43 101 197 276 251 223 86 60 87 141 62 192 148 72 119 199 158 200 66 179 216 141 33 88 118 212 182 93 81 74 87 61
3 61 101 215 87 84 17 165 86 39 74 282 225 56 170 156 27 59 90 35 58 95 147 33 63 132 163 48 156 156 160 45 368 218
-155 218 93 26 80 78 80 129 236 101 146 36 259 161 133 141 142 167 55 102 55 147 74 146 211 169 217 177 45 127 58 221 43 145
-312 145 91 140 144 74 66 96 138 85 82 97 81 134 113 162 68 75 90 151 131 74 157 206 105 179 215 68 56 135 165 88 39 148 106 29 125
-485A25n2m3J06j10O9J8
$$ plain form
-485 125 73 30 136 26 95 113
-514A13
##PAGE=	F1=-1474.07
##FIRST=	4521.1594499999982872,	4521.1594499999982872,	0
##DATA TABLE=	(F2++(Y..Y)), PROFILE
4521A60j07O8J06j54J11j44L2J46q8j00N3N1k3J1p0J44j02M7N6L5M5m1O8q8j51Q5p7l6J06
4378A43l0P0j26J07N2j4q9N5j54J80o6P1q2M7M3j48P1j00R4M2r8J01l1p5P0J2j0k2p4J07Q3
4226B29j13o8J15r9O1l5R1P4j37P3m9L3K6q8J4J20j24QL1o3J4o6J94j5j42N5J62p2l2r8J24
4073B23k17J59p2J23Pko2j08K2Jk6Q3l0J8l1J40l2J9j71J15L6Q5j68m5N8O2j04M1K2KM9l1
3916A66j20R9J12l4j07j0J35l3j09qk7O0m6O7K32j97j51K5K3J16n0r0J02j4R3N0N8j46l8j36
3768B2R6K4n4L4Q0m1j24J82j27O6m1K1kj5m5Op4J72q8P6j54J41m4M4J8k7k8R0Q1L4j45N8l9
3606A97l2q0m5Q7O7j02Q2L9k9ro6J57L9j89pk9Rl3N7K11k40k4J85p5r9J01q2O7k0p2P9j10
3448C4J70p4j08R0J12lj96J16m5N8p6j2P5j7n8J33%j40J3J08j46J7O3j9mJ64j77kP8L9r6P0
$$ plain form
4521 160 53 121 227 73 184 40 72 218 130 30 83 134 111 122 52 196 94 141 197 232 277 236 304 216 65 150 73 37 143
4378 143 113 183 57 164 216 202 113 168 14 194 128 199 117 164 207 59 130 30 124 166 68 169 138 63 133 145 135 113 39 146 229
4226 229 116 48 163 64 125 90 181 255 118 191 142 175 201 113 127 247 123 131 162 99 113 47 241 226 84 139 301 229 197 99 223
4073 223 6 165 93 216 223 221 159 51 73 74 48 131 101 119 88 228 196 215 44 159 195 280 112 67 125 187 83 124 146 148 197 166
3916 166 46 145 257 223 116 106 241 208 99 91 64 124 78 145 377 180 29 54 77 193 143 53 155 141 234 284 342 196 158 22
3768 22 118 142 88 122 202 161 37 219 92 158 117 138 136 121 76 82 8 180 92 168 14 155 111 155 173 146 118 208 289 323 178 236 197
3606 197 165 85 40 127 194 92 174 213 184 175 109 266 305 116 109 80 89 56 113 324 84 60 245 170 71 172 90 157 137 65 144 34
3448 34 204 130 22 112 224 221 25 141 96 154 78 66 141 124 66 199 199 59 72 180 34 51 114 95 91 255 78 76 154 193 97 167
3291A67n6n6k5P7J1K6j0n6l4J3l6lP4l8k0M5M9N3l7j6j9KMl0J2K31J7j55m0j6M7j1M8P0k2
3118B66j97KK9L2K6KJ37r0l1L7o2J6JlM3K2q5O4j6j17rL61L6ok28j16l5K2p3J30mp5Jl2J03
2946A51mj10M9O9j26N1J48j12R1o2J9Lm7q8J86l5J40P2j49j35qk8mQR5k5O1p0Q2p0p0jJ45
2784B26N6j32l0N8Lo6r0P3J7mO5O3j15m3N4oJ3p5m2J39l7j6M7m9l9J1K5K2j17L9N7M1o7k5
2616E6K5K49j68m5j1P0L9o6Ql7k4P6J3j55O8O2j11O6l7J19K0j51O4l3j2L0m0J4l7k6J29m9
2459A06J68k21O8j2o0J54j54J32j65K34j17J21j32J7K08k4j16j73P3o6N9m5J02n2PJ5q9M8
2321H6J62m2j29m1O2J2q2R5n4J48J6P5p9r8k6j7ok5jLK5O2J62j91q9J54L3j03J41J06k30j09
2163B0OQ1m0Q1j03J05j1R1j92J63n3no9K7JP2o2k5LR8p3K2m3o6O6P5L4q3J10p6k1On1n2L5
$$ plain form
3291 167 111 55 30 107 118 144 134 78 44 57 21 18 92 54 34 79 128 181 144 128 109 111 115 85 97 328 345 190 150 134 181 170 218 288 266
3118 266 69 71 100 132 158 160 297 207 176 213 151 167 168 165 208 230 145 209 193 76 67 428 464 458 230 114 79 101 28 158 154 79 80 48 151
2946 151 147 37 86 155 29 80 228 116 207 145 164 167 120 32 218 183 323 395 246 111 103 75 71 79 174 149 210 140 222 152 82 81 226
2784 226 282 150 120 178 181 115 25 98 115 111 176 239 124 81 135 129 142 67 25 164 127 111 158 109 70 81 106 128 11 50 107 148 81 56
2616 56 81 330 162 117 106 176 215 149 157 120 96 172 185 30 98 160 49 115 78 197 217 66 130 97 85 115 75 89 52 26 155 106
2459 106 274 53 121 109 49 203 49 181 16 250 133 254 122 139 347 323 207 34 107 41 100 55 157 105 112 127 38 86
2321 86 248 206 77 36 98 110 28 123 69 217 233 308 229 131 105 88 82 57 56 59 84 146 308 117 28 182 215 112 253 359 129 20
2163 20 26 107 67 148 45 150 139 230 38 201 148 143 74 101 102 174 112 87 90 188 115 137 94 28 94 169 203 120 230 154 133 139 88 36 71
1991G1OM9p8J0J8n9P9j3N6j07R4Rj0J03j19p9J13O3j26O6J18j18k7Jk5M8K3j7pj31J25o8Q5
1829A53K3L4n8pj4nl4L6j0p7R0J67j46r5J10p1J5q9M3P9k4J7O1j00j5LR3j35O5J47kj87JJ12
1661A80N3L4J8j81r7J04%O4r5K9J63j14o7lJ64k03K3M8O4j03Q1M48K65j04o09J09K25J63l7
1519F22K152k333j00K88R34J160M525K3314l023j8777n494j733m63k16o83J279m01k10n98
1425B43O5j1j89J52Kq9j54Q9P6l6m1J26l0q1L5j37J17j15R4P9j02K0N5J0j06N8K2K48k21k8
1277A51J9r5N6l8Mr3J48L8j48K0J35nj69L3j2O6K9R5j53J34j61j4J12q1J40j63Q8J06O5j57
1130A50j9J48j24M4J2j14N2nK5n7o9J23Q8j67O9m8k5l4P4P3q8o1j0oJ21J9m1R7p6J01R9k63
972H8P2j04R7N1l6r4P2j19J58L7j80P1j4M4r9O8PP9J7j45J14r2n9L8J14j04J18J70Q0k66r1
$$ plain form
1991 71 77 126 48 58 76 17 96 83 139 32 126 135 125 228 109 30 143 206 80 146 264 146 119 120 95 143 166 149 142 11 136 68 153
1829 153 176 210 152 145 131 126 92 128 118 41 131 298 152 57 167 96 111 22 65 144 120 137 198 98 83 86 179 44 109 256 254 67 68 180
1661 180 233 267 285 104 7 111 111 175 80 109 272 158 91 88 252 49 72 120 184 81 162 610 875 771 162 271 496 659 622
1519 622 2774 441 341 629 1563 2723 7248 30562 27539 8762 3268 1535 1072 856 173 1452 1051 841 243
1425 243 308 297 108 260 262 173 19 108 184 148 107 233 203 122 157 20 137 22 116 195 93 113 168 178 72 130 152 400 179 151
1277 151 170 75 131 93 97 4 152 190 42 62 197 192 23 56 44 110 139 234 81 215 54 40 152 71 211 48 136 242 307 150
1130 150 131 279 155 199 211 97 149 144 169 112 43 166 254 87 156 108 83 49 123 196 108 47 37 31 152 171 130 227 151 252 351 88
972 88 160 56 153 204 168 74 146 27 185 222 42 113 99 143 44 112 119 198 215 70 184 92 33 71 185 81 199 369 449 183 92
820I2N5K2M3q6j1Q3pj40LO3J26j31ok1J2o6P5p3J15K5j47P9j3L2Qj2OM0Op3q7K58j5o1l0j7
642A47j29Q6J05k9j27J48R7J9p7n5p6P7o6l4J6J29k9j56j9Q6Q1Kj27n2J12R6r3Lj30J99J57
490C61k05p3Q8j20N76M65p9K96K5j163l6L8lm3j05P6K8R6n9j14O8m0M1oR1O6r6j25j0L9k7
337E0J89Rj50M4p6J32p9m1N0M4N5R2j10j70N1M7r3J21lR9j51n5N4m9K11M6l9KL0k91J35J81
180C35j65p7N5J1r7RJ23J00j0n1j31lP0l7m4J09o8m5L6K6pO1j29J28J4q1r1K9L0J25j5j08
22A02j8kL4n5P9J04j58K7o2J11j13KK7K00p3j28Q3k6j28KJ06l5K6jM7j37M2O9K6n9O0j7Oj02
-145C9K53j30n5o6j3N5l5J04N4j11O3j30K27j09j6K3J5qj42R2m3J23j39J14M1m8M1Kj36Q6
-293A51p0O9q1J08q4L1jp1%N8J5k5k6L7p4Q3n8O9l3k5K7N2l1n6J29K1j00O1N9j53j1M6M4k3
$$ plain form
820 92 147 169 212 126 115 198 191 51 54 117 243 112 106 85 97 31 106 33 148 173 26 105 92 124 132 120 126 166 172 99 12 270 255 194 164 147
642 147 18 104 209 180 53 201 298 317 240 185 109 186 120 86 102 231 202 46 27 113 194 196 69 17 129 225 132 135 5 204 361
490 361 156 83 171 51 627 1092 1013 1309 1334 171 135 173 170 127 22 98 126 222 163 49 117 77 118 112 203 269 173 48 38 77 50
337 50 239 248 98 142 66 198 119 78 128 172 227 319 209 39 90 137 44 165 162 261 110 55 109 60 271 317 278 280 310 19 154 335
180 335 170 93 148 159 62 71 194 294 284 233 102 99 169 132 88 197 129 84 120 146 139 200 71 199 213 132 41 70 100 225 210 102
22 102 84 82 116 61 140 244 86 113 51 162 49 51 78 278 205 77 160 134 6 8 114 79 105 104 151 14 56 125 151 92 152 135 141 39
-145 39 292 162 107 41 28 83 48 152 206 95 158 28 255 146 130 153 168 160 18 110 67 190 51 165 206 158 199 201 65 151
-293 151 81 150 69 177 93 124 123 52 52 110 125 100 74 111 37 120 62 131 98 73 100 152 121 65 194 215 115 176 235 82 71 117 161 138
-460A38q2P8L2j49J34p2mQ8j36J9N5
$$ plain form
-460 138 56 134 166 17 151 79 75 163 27 46 101
-514A01
##PAGE=	F1=-1483.91
##FIRST=	4521.1594499999982872,	4521.1594499999982872,	0
##DATA TABLE=	(F2++(Y..Y)), PROFILE
4521A88j66N3J59j90J50j27M8R0m6j21N7RJM2j14J54j27P0M4M9Q8j24Q0j04j17J42j06o1J46
4378A67k2j2j06J81QJ7q6Qj32J68p2R1r4N1L9j78J16j12J15l9n2R3l5k7N8j7P4p1n8N2O4r5
4221I4n3J81j39K5m2J34N6j11Q8o5j1O5q1L1P9j36LM0o1K9l1J36j3j03K7J39j11l1m9J23j78
4068C5J23o0J46J5J0o8j51Q6j10kJ14j5j6J0J09r8O2j14R2J0R5j72k5NJ18j03L4PL7K1k9j24
3911D2J53Q6r4j10M4J25k0j24l5l8J01o2J04K19k12j48M1k8J04j4q2J15n5R3P9K1j02m7j34
3768B2J11L2o3qQ9k1j18K13j24J6p6P6m4k4J4J0q8K27j28N7j42P7n0J30l2n1j4Q3J36L5j37
3615B08J2m5l0o5l0N6Q4j09J16K4o4K7k7J30N9k28o6l%rP3K43k13r6K03j08q7Q6n1O2Jo4N8
3453A47j14J56o4n6R3O1j4k01J28l1N7p4rJ11o5l5J70m7j42M3N6q1rK0j9j4J66j98pJ05O1
$$ plain form
4521 188 22 75 234 44 194 67 115 205 159 38 95 104 105 147 33 187 60 130 174 223 311 187 267 163 46 188 82 21 167
4378 167 145 133 27 208 216 233 147 155 23 191 119 210 116 167 206 28 144 32 147 108 56 149 114 87 145 128 202 131 73 125 189 94
4221 94 41 222 83 108 66 200 256 145 233 168 157 222 141 172 251 115 118 158 97 126 95 231 218 115 142 281 170 139 90 213 35
4068 35 158 98 244 259 269 201 50 136 26 24 138 123 107 117 226 128 190 76 168 178 273 101 76 81 199 96 130 137 174 195 166 42
3911 42 195 281 187 77 121 246 226 102 67 29 130 68 172 391 179 31 72 44 148 134 52 167 112 205 284 305 203 156 22
3768 22 133 165 102 94 183 162 44 257 133 149 73 149 105 81 95 105 17 244 116 173 31 108 58 188 156 105 91 174 310 345 208
3615 208 220 175 145 80 50 106 190 81 197 221 157 184 157 287 346 118 52 49 49 40 113 356 143 47 250 142 55 141 90 152 153 89 147
3453 147 33 189 125 69 162 223 209 8 136 105 162 88 79 190 125 90 260 213 71 114 170 89 80 100 81 67 233 35 28 133 194
3300A94r2R8o7r6l3Q7K6O4L4j52%m5j7K8K9m3QQ9N3M7n7k0Pm7Ql6M4J97K7j41m1j6K8l1P5
3128B09R0o1k04Q1j4L1qK7J55m9o0J3p0L9L8n2lM8o4O3j7q8o3L12Q6K3k59r6n0O0o9J37L6
2966B21k02N8l0R0Jr7P6M4j15nJ62r6R9n7K7J3m6j13J46j8J52R4j58j49mj5lpJ33m0N3p2R3
2803B35p0q2K2P6P4r9mQ2m9r9m8L3M9oR5O5j16q0L3N6J0j42J6J18n6k3O5l5l9j6pJ14j31K5
2636F6QO9n5n6K8K84j44o6l1P6O8o1k7l4k5R9L1k08J12Rr0M6k9Q1M4j67J15k5j2Qj6m0NnJ38
2464A96r9J36k27J09k8l2R9j21R4r8J76j02J71j27jK40k1j63j98J38o7O6j25J17kj3J0q7M1
2321H2J49n9p6p3N1J6n3J01k8J05j7J05n3j10ml7n5L3j8k5O4M4J83j81p1J32k4r7J85R7k38
2168A28q5k1J52j27Q7j16R6k0J15j77J51n1j2n8J8K9Q1o7k5kR7q7K0n2j1M2R0Jj12J55o3n4
$$ plain form
3300 194 102 200 133 37 4 91 117 181 215 63 63 18 1 29 58 15 23 112 165 212 155 135 142 95 103 67 111 308 335 194 153 137 165 134 209
3128 209 299 238 34 115 101 132 124 151 306 257 197 210 140 179 217 165 162 210 146 209 192 104 41 353 439 462 203 107 57 117 48 185 221
2966 221 19 77 47 137 138 41 117 161 46 41 203 107 206 149 176 189 143 30 176 158 310 404 246 97 93 78 75 68 201 161 214 142 235
2803 235 165 83 105 181 255 156 152 234 185 86 38 71 120 114 209 274 158 78 111 167 177 35 51 169 113 90 155 120 81 65 58 172 41 66
2636 66 74 143 88 32 60 344 200 134 103 179 247 186 159 125 100 199 230 22 134 143 53 99 70 151 195 28 143 118 106 114 98 58 63 58 196
2464 196 97 233 6 115 87 55 154 33 127 29 205 103 274 147 146 386 365 202 4 142 75 141 16 133 131 118 128 41 82
2321 82 231 172 96 23 74 90 37 138 110 215 198 303 250 140 136 99 44 77 59 34 98 142 325 144 73 205 181 84 269 366 128
2168 128 43 22 174 47 134 18 114 94 209 32 183 132 120 62 80 109 190 123 98 96 193 106 126 74 63 105 195 196 84 239 176 122
2011A22Mo0k7L0MQ3p1j3K9m9M1l0R6j28J01j5nJ24j03m8N8P8j19O5J08j72J1j2K4K2J6K2o
1848A80j47R0m2N1O0K7q1qJ0mj2j2pp2O0J86r4j17J25n6j7o6M4L4MqO6r7J3k8J44j52K7J34
1681B35j7j71L9M9R1L0jj47q4R2k2Q0q4K6Q2o6p2oJ57j28mQ4K5j28R5K09n8J64k78J10J03
1528D05K35MK682k739k28J62R66J301N159K5471k331k0939o231k105o23l25o91Q54j52j82
1430F93n07K45j18j64R1N2j23j38M6R2l4o5J60Rr7L4j59R9q3O1P6r2PJ00Jj00P1k3K28k05
1282A57QL0j25M1m8Mn4J20lo7lJ29J1j82M1k5Q3K2O0r7J26j72nJ03p8J49j60O6J12N6j68k6
1125A05J50j17N3J7j28N5l0L3k0q7J18Q3j17L7m0no7O5M8o9n1J6l2J41K8l4R1p2O8R4k86J34
967A81r4Q7Mn0j09J61q6O2P4j90P1OOj08J15k2J10J0j59J42j10p9J07P2j12J70J22m1k06j3
$$ plain form
2011 122 126 66 39 69 73 156 85 72 101 52 93 63 159 31 132 117 112 236 133 85 143 221 102 167 275 103 114 102 126 148 164 186 180
1848 180 33 123 81 132 192 219 138 130 140 136 124 112 105 33 93 279 185 68 193 137 120 54 98 132 136 128 194 97 110 82 226 74 101 235
1681 235 218 47 86 135 226 256 255 108 24 116 94 174 90 116 198 132 60 54 211 83 79 163 188 60 155 364 306 470 192 302 405
1528 405 640 644 3326 587 359 521 1487 2788 7947 33418 31087 10148 3917 1812 1189 864 173 1027 875 693
1430 693 186 431 313 149 240 292 169 31 77 169 135 70 230 239 142 176 17 116 33 94 170 78 85 185 186 86 157 134 362 157
1282 157 165 195 70 111 63 67 13 133 130 63 60 189 200 18 59 34 117 139 199 102 228 56 51 154 76 225 65 131 243 299 131 105
1125 105 255 138 191 208 80 135 105 138 118 31 149 232 115 152 112 107 40 105 153 84 33 49 17 158 186 152 243 171 239 333 47 181
967 181 87 174 178 128 19 180 94 156 230 40 111 117 123 15 130 108 218 228 69 211 101 22 129 201 89 259 381 340 134 121
820A21NJ8lo0RJ01jj57j1R4J65j26p5l4L6o6Q3o3J01P7j75N9J4K3LJ9pL1j2q0q0K76l8n7l9
647A51%j32J28P7l9j24J32P5K9o1m1n8R4n5q2mJ62l3j54l0R0N1K2j15m7J11Q1j12Nj11K30
495B40J01j65r2Q0o0M97Q57l11J72k01q65j41Q9mq3p6N2K0J04m9j01J9j5j2L9N7J15o6j56
352D5rK9l7J88Lj30P8j14J28l2m7K9N2J6J27j29j59M4L5q2J37J0P4j45m6L2l9K36L2j00jR0
195C15k26P5J53j46o0pO4q1mR3J20Qo6j17K9J05j26j3O7q1j5L1k8K0Q0j28J62k0p7p1mK3J53
32B28%j11k8mN0p5J08R5j92P0m9N9j24L7J0J81o1q4L9n3q0M8P1lJ3m8M7j10RO2L5j1J5l5K1
-140A30q4J57r4%o8MN7q6J44K3r1N8j37K22q7m2M8K4l5q6M8l9J38j76J39K3m7K6M8j28P6m9
-298A16l2J5R9j13L4j8l6pN7j6nl9O2j06Q2p3O8L9o6L8L8l2o6J70Mq5J6J00j46j0QL4M3r1
$$ plain form
820 121 126 144 141 81 90 191 190 33 22 116 281 155 80 46 82 16 99 36 137 214 39 98 112 135 138 157 150 181 169 89 9 285 247 190 151
647 151 151 19 147 224 185 61 193 268 297 236 195 137 231 176 94 90 252 219 65 35 125 176 198 83 36 147 228 116 121 10 240
495 240 341 176 84 164 104 601 1458 1147 1319 1118 253 112 201 197 114 38 90 110 214 165 64 83 68 56 95 152 267 201 45
352 45 36 65 28 216 219 89 167 53 181 149 102 131 183 199 326 197 38 82 117 35 172 182 256 111 65 97 58 294 326 226 225 315
195 315 89 164 317 171 111 104 168 87 83 176 296 304 238 121 150 255 129 116 183 102 87 118 90 110 190 62 224 204 127 56 52 75 228
32 228 228 117 89 85 135 60 168 263 71 141 92 151 27 64 74 255 194 110 149 96 16 64 135 132 145 97 144 34 43 105 140 129 144 109 130
-140 130 46 203 109 109 41 45 102 16 160 183 92 150 13 235 148 106 154 178 143 57 105 66 204 28 167 190 143 169 217 89 165 116
-298 116 84 99 198 85 119 101 65 58 115 99 94 55 117 11 93 20 88 127 61 99 137 105 39 209 213 128 144 244 98 88 96 130 173 82
-465H2K4J09j90J26p7M7M5j03l4M3
$$ plain form
-465 82 106 215 25 151 74 121 166 63 29 72
-514G2
##PAGE=	F1=-1493.76
##FIRST=	4521.1594499999982872,	4521.1594499999982872,	0
##DATA TABLE=	(F2++(Y..Y)), PROFILE
4521A73j43k1J94j47J11q0L7N4j9j30M5l4N7M4j17J41r0J8L2P4J25j64O2j29n4J49q0p7J66
4378A97qj07o6K07pJ4m2o8p1J24m0N6r5Q4Nj72J51j23J21j04Q1ml6J0N0p7J81j04n0pM8p3
4221G5l1K24k02L4l3J37L1o2Q0n0p1J04q8N9L5j29j5N6o3M8j8J01j7o2JQ6r5n6pJ30j29O8
4063A41l2J44L5Lm3k06J28j45RR9Rm9M6O7j25P7m3N9k0J21j88j1l9J73r7L0rN2j2kj35J89
3906B26N8j47j00J10Q7rj25n7l0J10p5J44K02k19j42N8q3J22Nq2J14q3Q4Q9qn6n7r3R7M1p2
3753A09l0P1Lq9K14j17m2o2R7n7n1N7J6p4K47j54K8j23M4l5J64p6p1j1J03J41M4j19m3k4l9
3601A21n9JL8P7j12J36Lp4P2oJ07N9k42r3J2J6K5K3K56j59j42J80j28p0Q1l5N1K3n2L7j04
3448D2J23n6QR3Nj9j68J04l3O5p8nJ42j10PJ83q3j44Q1nk6k3j1k2J9R8j57qR7Q6j20J40o2
$$ plain form
4521 173 30 9 203 56 167 87 124 178 159 29 74 40 97 141 24 165 75 93 125 199 324 160 222 93 39 188 108 31 197
4378 197 189 82 16 223 216 230 188 120 49 173 133 189 94 178 183 11 162 39 160 56 137 133 97 107 157 80 261 157 107 100 148 75
4221 75 44 268 66 100 67 204 235 173 253 203 132 236 148 207 242 113 98 154 91 139 121 222 205 143 144 230 135 79 72 202 73 141
4063 141 109 253 288 291 248 42 170 25 34 133 142 93 139 206 81 158 115 174 154 275 87 76 37 210 113 143 134 186 174 172 37 226
3906 226 284 137 37 147 234 225 100 43 13 123 48 192 394 175 33 91 8 130 135 53 167 84 168 257 249 193 136 43 140 181 109
3753 109 79 150 153 64 278 161 119 57 154 97 46 103 119 45 292 138 166 43 87 52 216 140 69 58 161 302 346 227 184 160 121
3601 121 62 63 101 178 66 202 205 131 203 197 304 363 121 28 40 56 81 104 360 201 59 239 111 41 122 87 138 161 109 146 42
3448 42 165 109 117 210 215 196 28 132 99 164 86 81 223 113 120 303 220 76 157 152 126 103 92 70 89 187 30 22 119 205 85 225 163
3286A63j37oO9K0J02Q4k41M7o7j8K4j3K5k3J09N5L1o8l3M0r8J7j0M2J61L4j20m6qJ9m6R7Q4
3123B89j05r1N7n4K5l1M6J69k1q4j2n3M9P8q3q4Q4k6N3l2m5j13K56J16N6k77m4q1R6o3J41
2971B16M8k36N4l7O7K2q9Q5L8j05LJ04p5J00l8J6L1l2j27Q2J7J37J12j43j72J1j0kk5J67n5
2818A64M8o6J00r4q0M2J0R8o6K3R2q3j32L0k4O8%J15N7j02j17KJ07K1j65K5J03o9k4O7j9l7
2661I4m5j0J66j28kk9J07o2j3j4K63j07o3m5O8R0n7o3l3j2J14M4k40J60l0r7J9kL2N0p8P0
2503A47j0jl3K7p8L8j6J48j16P3j41P0j7%J2q6N7k2J09q1K09j26j7K49qj98j52J40p0N3j28
2350C2Q1L9k6K8q1mJ27o5j0r7L6L3k2Q5j4N2l5J15k2j06K0n6n6N0l5l3P8M4J52j46m9R3o7
2188A41q4K22Q2k33m1n2J81j84P6p4N3l0J22j53J45n8j6m1j5O1Q9n9m1J7Q0r4J5n9N7J1Q8
$$ plain form
3286 163 26 20 89 109 211 295 54 101 34 16 40 27 52 29 138 193 224 156 123 163 65 82 72 114 275 309 189 143 135 154 108 205 289
3123 289 184 93 150 96 121 90 136 305 284 200 188 135 184 262 179 95 179 153 206 174 129 16 272 388 444 167 123 42 138 75 216
2971 216 264 28 82 45 112 134 45 130 168 63 66 170 95 195 157 173 204 172 45 127 144 281 393 250 78 89 79 77 52 219 164
2818 164 212 146 246 152 72 114 124 222 156 179 271 188 56 86 62 130 130 245 302 200 83 85 192 213 48 73 176 107 83 150 131 94
2661 94 49 39 205 77 75 46 153 91 78 64 327 220 157 112 180 270 213 150 117 105 219 263 23 183 153 56 75 73 105 155 77 147
2503 147 137 136 103 130 52 90 74 222 106 179 38 108 91 91 103 17 74 52 161 80 289 163 146 395 387 189 37 177 107 160 32
2350 32 113 152 126 154 73 69 196 131 121 24 60 93 71 156 142 194 159 274 252 146 166 110 54 104 69 36 114 158 310 164 115 208 141
2188 141 57 279 361 128 87 35 216 32 108 34 87 57 179 26 171 113 97 56 41 102 191 132 91 108 188 94 109 50 107 118 206
2035B06k1j44J88m3r4J9n6j0K6J4Q6n1m9N6k0K8p0J06j26R5l6qJ39p9j4jJ07j24N3R2k04L9
1878A04j8N9Mj1P7pj44M9k2K5R3K1j14KJ0KK1m8k7m6L2J87l7j34J38l1o5k9L9k6L8k2O9q6
1711A03L4n7J67j51LJ09l4j40O4j0J20RLq6r1P3m2R4n3K0l5K4p0m0J23l7m5J64o0r1J03l2
1553A39o5J90j8%M3J56J30K963k547n30L03n4O74L461J4484K2j2453l924j627l75m04k58J88
1440D98J16L84r93N58l48Jl3R5j47q8K1J00n9n5J51O8j25L1j39M8k7K6L2k1l3J30j2p9N6m1
1292A15J90j84M9M7j41Nk8j8rP9m5K9m5J24K7j62M7j3N8KL9n5J31j92JJ03p7J49j46L5J01
1140B16O2j69j1J39j17P3J6j40O2o1M3Qq8J01O1n3nj8Nj05N7L7m3n2M5j5J07K6kQ0p1J8Q7
977B93k50J48n9N0l3n9k9J65o7l1Q8j68N3L8l2r2J27m5J26Qj51J62j34n1J23L2j22K27J11
$$ plain form
2035 206 185 41 229 186 92 111 55 45 71 85 171 120 71 127 107 135 65 171 45 140 104 96 235 156 142 141 248 124 177 269 65 104
1878 104 86 145 149 138 215 208 64 113 91 116 209 230 116 118 128 130 151 103 76 30 62 249 212 78 216 185 120 91 130 104 142 120 189 103
1711 103 137 80 247 96 99 208 174 34 98 88 208 217 220 134 43 116 74 168 115 135 100 124 54 14 137 100 55 219 159 68 171 139
1553 139 74 264 246 246 289 445 575 3538 991 461 764 710 1384 4845 19329 19351 6898 2974 1347 972 568 310 498
1440 498 614 998 5 563 215 216 183 278 131 43 64 164 105 50 201 269 144 175 36 84 57 83 115 94 61 191 179 100 156 115
1292 115 305 121 170 217 76 81 53 35 26 105 60 89 44 168 195 33 80 67 125 127 166 111 242 50 51 154 77 226 80 115 216
1140 216 278 109 98 237 120 193 209 69 131 70 113 121 33 134 195 142 137 119 124 19 76 113 70 18 63 48 155 181 179 259 188 206 293
977 293 43 191 132 182 149 90 61 226 159 128 216 48 101 139 107 15 142 97 223 231 80 242 108 57 180 212 90 317 428
834D28j40j76J5k0J8ko1J6J01j1j49P8L4J71j08j51k2N0n5P1k7O2J24j93L3N2J3rL9k7L5k3
677A66r0o2K67m9m6n6K9j27J50M1m8p8Q5M5M7n9k5k6Q8k9j20j1J77l3j60j0O8J3M8r2m1R2
519A54O9j19j9o2K40M4j15j09P3PO70J294r25J65P3j086k87J55k2q4n2M3JR7l9q2k6Kk6K9
372F3L1J56k6j53m0P1o0J42J0j11R9j50J26L1o7J3Q0m6J59j49j39J7L8n3J22M1K3j14n5K0
224G9k1K40Jj31rJ48j54L1J12j38n4m0J10n9J2J1J39K9o9j14P0J37k08J0K2q7RL4n7L1R1j33
67D2K09n8o5n6l1RJ67J6r7m1qN1p0J08R7k13J05l7%q6L7j3J52l0l3k1q9j6P1M7L7j9p7L4p2
-106E0j3L8O7Rj2n3L8p6R0n1J3p0M6N1j03J24M0q4K0j11J85l1r6P9K1n0k2jm3J24j65J28K3
-268A65k9nQ3j07O5l6o7O4O7j23N1m9MNJ3l8jk0O5m6rl4N0O6j01M6K2j3m0J39%m6n9J52j35
$$ plain form
834 428 288 112 127 107 125 123 62 78 179 168 19 97 131 302 194 43 21 71 16 87 60 122 246 53 86 138 151 142 181 154 189 166
677 166 76 14 281 232 186 130 159 32 182 223 175 97 182 227 274 215 190 164 252 223 103 92 269 236 76 66 134 147 195 103 62 154
519 154 223 104 85 23 263 307 192 83 156 163 833 2127 1202 1367 1440 354 67 222 200 116 64 107 108 205 166 84 58 60 34 63
372 63 94 250 224 71 31 102 42 184 194 83 182 32 158 189 122 135 215 169 328 179 40 57 95 42 164 205 228 114 59 79
224 79 58 298 299 168 159 307 153 184 296 158 104 64 174 115 127 138 277 306 237 123 193 330 122 132 154 67 76 110 53 84 175 42
67 42 251 193 128 72 41 50 217 233 136 95 87 138 68 176 273 60 165 128 128 42 79 66 218 188 155 134 45 29 100 147 184 165 88 122 50
-106 50 37 75 142 151 139 86 124 48 138 87 100 30 76 127 24 148 188 104 124 13 198 167 71 150 171 121 99 98 55 179 14 142 165
-268 165 136 131 214 107 172 136 69 133 200 77 128 79 83 88 101 63 62 42 107 61 52 18 68 134 33 79 101 88 48 187 187 141 82 234 99
-440I9Qm6NJ13n3n4J56j74O0o0R1ln9l2L
$$ plain form
-440 99 107 61 66 179 126 72 228 54 114 54 145 142 83 51 54
-514E4
##PAGE=	F1=-1503.6
##FIRST=	4521.1594499999982872,	4521.1594499999982872,	0
##DATA TABLE=	(F2++(Y..Y)), PROFILE
4521A04j7K5L1k0Llk8P3k3j06L5Rj9O2p2J11m8p3K9J09J33j32j5r5nO9Rn0J30J2j15j00J96
4359B19J1m1M1j23m3P3K7k9q8J52o4q7J41j25J04m1P4n0n8K9L8j35K75j07p4l%k0k5K19k48
4206D2O0J4O9OJ0L8Oj31J29j16J00j1j02k6O4o4O5m0J04j5m7nMl5p4%J48q6QJ4J10P1l2J1
4039B89k47J26r2oM7L8q9R3J3j11N9M2J2n0J60j91k5k7J70p4J0%L6m7M9j56K01L8j91n5J42
3886A64L5Mr1p7j6P5p5J80J81k00j42P8l9Q3Kj07R6p8P0O2j2k2o9k7N7N6p9j9J0L5m5J81j00
3724A71j03L2M9n6o2O8K2k9K27j66j3r1M8J3J19r8o8l8J47R0O2r2r4K2o4m2K9L0M1j11J48
3571A91k2n6J15qR8L0k30ll5J6Qj3K43q1j67J26j30k5O3k9K9M1m1K3q5Q1n5P4R2n4j3j30P5
3409A28m8P9q3nJ58j38M7J82r7j50J26p1Lj5k9j4P0j7q9L0N4J07j80J87l6j65J6L7lJ49J27
$$ plain form
4521 104 87 112 143 123 126 123 95 168 145 39 74 83 64 126 54 165 117 44 73 182 315 183 168 73 68 137 146 96 226 238 123 23 219
4359 219 230 189 230 107 64 137 164 135 47 199 135 48 189 64 168 127 201 151 93 122 160 25 300 193 119 116 116 96 71 290 42
4206 42 102 116 185 191 201 239 245 114 243 127 227 216 114 88 152 88 153 113 217 202 155 150 154 119 45 45 193 107 115 129 239 310 278 289
4039 289 42 168 76 70 117 155 66 159 172 61 120 162 174 124 284 93 68 41 211 137 147 147 183 136 185 29 230 268 77 22 164
3886 164 199 203 112 35 19 94 19 199 380 180 38 116 77 160 162 55 151 73 143 205 193 171 102 75 132 188 109 90 100 135 90 271 171
3724 171 68 100 149 93 31 99 121 92 319 153 140 49 97 110 229 131 63 25 172 262 324 232 138 160 96 54 83 113 154 43 191
3571 191 169 113 228 220 318 348 118 115 80 96 104 91 334 253 86 212 82 57 120 91 120 161 120 143 58 139 84 158 250 196 183 53 128
3409 128 80 159 76 71 229 91 138 320 223 73 199 128 131 116 87 73 143 126 37 67 121 228 48 235 199 34 50 87 84 233 360
3256C60k95P3o3l1Qk3Q1p3J12O6Kp4n5Q9j52M9K5LJ42L0q6p0RK2n4J13N2j49M6J3q7J5l0M4
3089A12J76or5m0oM7J05p0j85J01K4M2o3Lq6J36J26Q1k74K6q7R2n2J40K5k12M2n9L2N7q5P3
2931A20M9q9L1K8n4Q6oj5N7j7j26K9M5J02J24j11j96L8j9Ml9J84o2M0n2J04j44o0N1l0J23
2779A95m3L2J04j07j41R2o2P1RJ29L6p3j42l1J34M8j71%J02p2j9N5lm4l8%J68j22l3m4J38
2626A68o8K5l3J85n5m6m0L9J01n1r0l7J3J17N1k32J82m2j28LK9k2L7L4%J1J4p7O9p0K2l6J60
2464B33j12jn6M1J2No7n0N3K6L4n5K35j26l8K37J3k16j00J38p5K3r1L7P0l0M2p0n1Q8n8N1
2306A42r8K4M6rO3ojk6Q7J7r0M1o9j8L7m7l8Q6O2O2q8l4M9r0o6K47O2k21Rq6J77k01N6Pj8
2134F8l2J04j23J43o9j6j0n7Q0R0l9p8N9N2r4Qm0R7j0O8l1j46J84k5j27M5n6j3M2L8N8k2q2
$$ plain form
3256 360 65 138 75 44 52 29 110 37 149 215 217 143 88 177 25 74 99 102 244 274 188 118 127 149 95 208 260 111 157 170 83 98 68 112
3089 112 288 282 187 147 141 188 293 223 38 139 163 205 142 145 59 195 321 402 128 154 67 159 107 247 272 60 102 43 75 132 47 120
2931 120 169 80 111 139 85 171 165 150 207 190 64 93 138 240 364 253 57 95 76 80 41 225 163 203 151 255 111 51 102 72 195
2779 195 152 184 288 181 40 132 70 141 150 279 315 242 100 69 203 251 80 80 182 110 91 146 143 99 61 61 229 107 74 30 168
2626 168 100 125 92 277 222 176 136 175 276 225 135 98 111 228 279 47 229 187 59 62 91 69 106 140 140 151 165 88 157 87 109 73 233
2464 233 121 120 64 105 117 122 55 5 58 84 118 63 298 172 134 371 384 168 68 206 131 154 63 100 170 140 182 112 61 149 91 142
2306 142 44 68 114 105 168 162 161 135 222 239 149 190 121 103 140 93 55 141 203 265 177 143 192 102 36 283 345 124 133 47 224 23 79 86 68
2134 68 36 140 17 160 91 75 65 8 88 178 139 61 120 172 78 86 46 143 133 201 170 24 208 183 56 101 45 32 74 112 170 148 66
1971F6Q2J4M2r8O6j12R0n3j7J43m4J5m9J27j31L0P2k04N6k8Q1mn0J41j2j33J8qJ2J13J8j51
1814I2J7j9K3N5o1o6rL1J49J5j40J38J4j31J9K6q2P2k5O9p4M4p7J59j27k1R4m9j05O7rR7l5
1652A51M1l0j10N7n3J05j2k1p4P6l0m9k1N9o6K68j94RJ02j37J63J3M9k26K64k88N38K753j687
1509A650m43R67J07J474N016K2885p865j6739m063j540j81n09l17N78k59O22j049L75n64K23
1410C68j51M7k11K7J7Q0j12jQ4J40j40J8j22O7n7L6m9O8o3J49l2n2K2l9J46j36O5N1j29l3
1263E8J7k5j2L4j6N4r4J26L9j15J6OM8l3M1l9J50k11kJ07p4J39j18kP0Q6j62NJ39j30J05O
1105B13j52Q4j02O4Lo4P7K6J4m8NJ3r9PM8k3lJ3kP1PN1O6p1m3Q2j37Q3Jon4n7N7J32m8r8O6
923A76j11J5Q1o6m4R9o0J21J2j25J68j58k4J25J1j15K53J55k03k49L6jJ4N7j01J3Q8m1r6J41
$$ plain form
1971 66 148 162 204 106 172 60 150 97 80 223 179 194 145 272 141 171 243 39 95 67 148 144 94 235 223 90 108 100 112 225 243 92
1814 92 109 90 113 168 107 41 32 63 212 227 87 225 239 108 127 153 71 143 118 187 113 157 80 239 112 91 185 136 31 98 89 186 151
1652 151 192 162 52 109 56 161 149 128 54 130 100 51 30 89 23 291 97 106 208 71 234 247 296 70 334 46 584 3337 1650
1509 1650 1207 2174 2281 3755 8771 31656 23791 7052 2989 1449 1268 759 442 1020 761 1383 334 709 145 368
1410 368 217 264 53 80 97 177 65 64 148 288 148 166 44 111 54 90 41 109 46 195 163 111 133 94 240 104 169 220 91 58
1263 58 75 50 38 72 56 110 16 142 181 66 82 88 136 103 144 105 255 44 42 149 75 214 96 94 164 250 88 93 232 102 207 213
1105 213 61 145 43 107 110 46 123 149 163 115 120 133 34 41 89 66 63 76 74 145 152 203 269 198 155 237 100 183 184 178 124 67 124 256 208 110 176
923 176 65 80 161 95 51 150 90 211 223 98 266 108 84 209 220 105 358 513 310 61 97 96 110 167 66 79 167 126 30 171
775A71k9J63q2k00J2N2m4K5J1L5J49j99NR8nk5N7n6N2j9j09n5K48m1k1q4N3j15J56km6j1J8
613A62K3O8p1j5J8N7J3j46kJ67k1j76K3L8k8Q2p5l5O7O5j14n4qK37j2p1j10P4M6P92J522j368
455A148J84N22j430l99K09n5l5o4N2j1P0k6o1l9qM9q7K2J80Oj36o6J06m3O0M4j10R8j23Q5
308A42R2j08LJ13r9J86j74j07l3P0k4P7R4n1n6r0K1RK19m5j26QJ66q3nP4j37o3k3J28k1J9
150A76j00J67M3n7j28J18J66k78K5j0q1K1L1m1M0O4j26K50j02m1m9m6K0J30L2o2n7qK8k6O7
-2A66J12k00J05k8o1j4K0k5R8QK6r2q8J3P4L1Q4p0n6j8l2Kj3J19qro0L6p0J14o2lo3M4P3r4
-180E9N4J13q4n7l3R6N2j34P9J1n9K8lq2P7j02P6M8K1p4J06p2O7n5k0O4Lp6N0p3nP0q4k6j4
-352B1M8J5K9r9O0M6lr6L7KM0J6MJ1K7r6J54j19M3j06K8Q3O5j17J05o9r5L6R3l9rl7N1
$$ plain form
775 171 142 305 223 23 35 87 43 68 79 114 263 64 69 167 162 137 194 138 190 171 62 7 255 214 193 109 162 47 203 201 155 144 162
613 162 185 253 182 167 185 242 255 109 107 274 253 77 100 138 110 192 117 82 149 214 100 46 38 275 263 192 82 156 202 994 2516 1148
455 1148 1332 1854 424 25 234 179 144 80 132 121 191 165 104 65 57 106 19 41 221 227 91 25 131 88 148 192 82 180 57 142
308 142 234 126 129 242 143 329 155 48 15 85 61 138 232 181 125 35 56 65 284 239 113 121 287 204 199 273 136 73 50 178 157 176
150 176 76 243 286 229 101 219 385 107 132 122 41 62 93 52 92 156 30 280 178 137 88 42 62 192 224 162 105 97 125 99 166
-2 166 278 78 183 155 94 80 100 75 173 181 207 115 27 40 114 145 229 159 103 85 53 55 42 161 153 144 84 120 50 164 102 99 36 80 153 59
-180 59 113 226 142 85 52 148 200 66 145 156 97 125 122 40 117 15 91 139 160 86 192 120 187 132 112 176 179 103 153 80 75 145 61 35 21
-352 21 69 84 113 14 74 120 117 21 58 60 100 116 120 131 158 62 216 97 140 34 62 145 210 93 198 129 34 70 163 124 115 78 129
-514A29
##PAGE=	F1=-1513.45
##FIRST=	4521.1594499999982872,	4521.1594499999982872,	0
##DATA TABLE=	(F2++(Y..Y)), PROFILE
4521H6J08O4j24R6m1J9j11J31m1o2N3M8k16J80p0J11n8m9KR0Q2l8j41N1l2j00J57QM3N2o9
4369B29j91J85M2j47J48p9j09L0J01j25o2K05j53L2J18j13O8P5k0k1j06L1J0l1J94o7j44Q5
4231A85q6P2n7J68j74QP8n1nR1l8J02j65J15j65J57m7p2J3K7n4O9j03J52Kq2K3q2K6k0k7J32
4073A92n3m6O3N0J19r2Q9k47N5koj7N8j41J59n5n7J2J38m9p6K09j76o0L2R5k3l7M0nq0J13
3916B02j86J86M4k09N1Q3k4J6k0p9m6K5k8J76J59j42j67J15LN2%j37M9l0O5k2K2j6q4N5rQ2
3758A86q1K6q6O5QJ13o1j32J14j9o4l1N2K5L8J76j69o3m0N7O7M0q7m1n3J47PQ8n8j14O6j02
3601G4J2K5J6qq4J35l2l3J49l1J01k5j91R9p7Ml6k1K02J5j76N4j12L4L8k0JM6m0K0o2M3n1
3438F9J20Q6j10J6j07M8m8P6p6k5J54j18N3J73q5j62J77j35lK4m6J3J04j25m5Q0L7J14k51
$$ plain form
4521 86 194 258 134 230 189 208 97 228 187 125 178 226 10 190 120 231 173 124 126 216 298 260 119 170 138 38 195 203 246 298 229
4369 229 38 223 265 118 266 187 78 108 209 84 22 227 74 106 224 111 179 254 234 213 107 138 148 117 311 244 100 185
4231 185 99 171 114 282 108 116 194 143 138 229 191 293 128 243 78 235 188 116 129 156 102 171 68 220 222 140 163 81 107 87 60 192
4073 192 139 93 156 206 325 233 322 75 130 128 122 105 163 22 181 126 69 81 219 170 94 303 127 67 99 194 171 134 174 169 89 202
3916 202 16 202 246 37 88 171 147 163 143 64 18 43 15 191 350 208 41 156 159 211 211 74 123 93 158 136 158 142 58 113 104 186
3758 186 105 131 45 110 118 231 170 38 152 133 69 38 90 115 153 329 160 97 57 114 181 221 134 93 40 187 194 282 224 110 176 74
3601 74 86 111 127 119 35 170 138 105 254 223 324 299 108 207 130 134 98 77 279 294 118 172 60 94 132 112 113 159 119 139 77 120 69
3438 69 189 275 165 181 74 122 74 150 74 49 203 85 138 311 226 64 241 106 103 127 81 94 198 73 28 108 145 259 8
3296HK19Pj77L6j6l3K00J53l10Q4n7k4j9k7J18j10Q8R4l9p8o5J32j59P7K6n3J62jm0j11K5
3143A10M2n3J20Kj90J80l5j13MjJ0J76mq0p4O8L1J11j6j90jP3L7j08M5k9J6J32P3k43Q9o9
2985A13O0l4J33k4j70N4r4nR9q5M1P2o4M4qn2N3L8o0Q4oj11J9K7P1J26p0k02N7l3J2l6J69
2823B18n1J9l7J13k14k7N0jJ20l8J3J20j26r1J03p6N3J8J39jk9j51n5J28R2j83l1J11o7j3
2675A06M4Qo4J0j5J58j21o0k0J32n9L4k8P0J8k9j2j1J06m3j06m6M5J08N2j93J79l6j64J9L5
2523A17m6j1J37p5L2L4j09R5l8k0o0J76j00o7J0L8L3rj02kN4K9l7k4K46j23p0K12L7k17m7
2370I3J34q1k5l5OR6k7L7m7p4K6m3R7p7RM7mL5Nm6PK4O0p0N9p3J7L0n1n8J05Q1n6k0k7Rr1
2188G2m6K57L7k05O6j29J45j78L8Q6q7k8O5p2J32q6j5M3l6L2P1j5j29J12K0r2MJ0Q5oL0l1
$$ plain form
3296 8 227 234 57 93 77 44 244 397 87 171 114 90 71 44 162 52 140 234 195 117 52 184 25 102 128 75 237 236 196 85 110
3143 110 152 99 219 221 31 211 176 63 67 66 76 252 248 168 94 162 193 304 288 98 97 170 207 99 144 115 131 263 336 93 182 113
2985 113 173 139 272 248 78 132 38 33 132 47 88 160 96 140 132 80 133 171 111 195 189 78 97 124 195 321 251 49 106 73 85 49 218
2823 218 167 186 149 262 48 21 71 70 190 152 165 285 159 68 171 95 148 166 305 304 275 124 69 197 289 106 75 186 119 106
2675 106 150 158 94 104 89 247 126 66 46 178 119 153 125 195 213 184 172 161 267 224 118 72 117 225 277 84 263 227 63 82 117
2523 117 71 60 197 122 154 188 79 174 136 116 56 232 132 65 75 113 146 137 35 33 87 116 79 55 301 178 108 320 357 140 93
2370 93 227 146 121 86 92 188 161 198 151 77 103 60 157 80 89 136 132 167 172 126 133 157 217 147 206 133 150 180 129 71 176 257 201 181 154 163 72
2188 72 26 283 320 115 181 52 197 19 57 143 56 28 93 21 153 67 52 95 59 91 162 147 18 130 150 58 62 72 157 151 181 150
2031A50q1J12j1j12M5p5QM3O7QJ6r2Q3N1O1j17Or2Q9p0k3J36KL0n7J02j33NN3j75P0m4Q3k
1863A36q5K00k5j12JoJ2J18J7j83L3o8N2Q3n4o0k1N8Q0M7j27J14Q4k12P1Oj16R5j4O6o1L7
1706A66q6J28q2n6J06n1p7L7O6J4r5J08nj19M1n0J22K5j07Q7k9L5k9m7n1N8K69l14J06R2J0
1553B72p5K28k2j65M17j04M40J825k59l2J846J530M449J4929P3930j7373n7340j5456m595
1460D445j511r19j166Q32k26q4o02K19n05J40k07p2k57R3NK8j13K4j4J87r8nj33J42j82J01
1332A22k6J2o6J65o6k9nl8J09k3J6K7q7j1Pj2n0qR1nr9R8M8n6n1K6O3q0P4o3J85k10j8J02
1164A42p0J22q4l5K0J27j50KJ68j52J43j7j63J25j54J02m1j9M6LO1q2J3K6m9m9N1j8O4m6N
1012I1M3l2J16N2p1j12Q8j3oQ2p7n2m0J11Q0k5j27Ql1k7J23j00J3O3p2J03J6q5J59j80NJ20
$$ plain form
2031 150 69 181 170 58 103 28 36 79 146 154 170 78 161 212 273 156 162 70 159 89 66 202 204 234 177 279 146 151 204 29 99 55 138 136
1863 136 51 251 226 114 115 109 121 239 256 73 106 38 90 173 119 59 38 96 176 223 96 210 294 82 153 159 43 138 124 190 129 166
1706 166 80 208 126 70 176 125 48 85 151 165 70 178 173 54 95 45 167 192 85 172 143 178 149 102 51 109 378 64 170 262 272
1553 272 197 425 403 238 655 551 991 2816 2557 2525 4371 5901 10350 25279 99209 81836 24496 9040 4445
1460 4445 2934 2015 849 1681 1455 1371 769 988 483 623 416 344 87 180 185 213 100 124 110 297 199 194 61 203 21 122
1332 122 96 108 42 207 141 112 107 69 178 155 171 198 111 100 107 95 45 37 128 123 24 122 170 114 63 89 152 72 146 83 268 58 40 142
1164 142 72 194 110 75 95 222 72 74 242 90 233 216 53 178 24 126 85 66 112 115 176 94 107 133 84 35 86 68 132 86 91
1012 91 134 102 218 270 199 87 175 162 156 238 161 109 69 180 260 235 108 116 85 58 181 81 94 157 85 188 204 119 278 98 103 223
854B23Nq3K26K44j93k67j21O3KJ18j49K2P2q8j9J86j04J56n2j75j0P7n3l7M3L1J50j92k7J48
706A96l5l5P5q0O6%j34l6J94j5J9j22N7q1J42n0l1O0o2K2Q9r1k1P1NO6j55J8J30Pj94N8Pp3
539F7J35q2qK3O9r9k5k9K25o6m0r0Q3M3N80J396j227N7P04j298l42J57r8N7j13P1jK2rm1k3
387I8k3R6j13j8J43K4j09l6O8Nk1J08j36P2m6K9J35j67KJ45j24J99k05o9j4O3k0J1J65j36
239A26K1j37K3N2J68r8q3R1R0j3l6M8j40m6lJ15M1jk11J96M0k9j57J64J97l27K9j3m7K4j4
86G0j6Q7ro1K40j56%l7o5O7L3N0%q3Pl4O5j4J38j66Q6k9j20P7Jj5J5L9Q9j60j6k3P5rJ35j30
-91A31J8j09L3J4k9J35n5K3m2Mm6J75j26Qn8j8J20p9m0K25q6j32M1j3J51j27K6K1q2N5N4j52
-248D0J0j4K9O0R6j63J02j7Q3j25N9P3q2K0K8q1q5J95k19P6ML2j9P6r8Q0M3r4j2J2J1N0L1
$$ plain form
854 223 228 145 371 615 422 155 34 97 99 217 68 90 162 74 55 241 137 293 241 66 56 133 80 43 86 117 267 75 48 196
706 196 161 126 201 121 187 187 53 17 211 196 215 93 150 69 211 161 130 190 128 150 239 148 127 198 203 269 114 132 262 269 75 133 140 67
539 67 202 120 112 135 204 105 80 51 276 210 170 80 163 206 786 2182 955 1012 1716 418 76 233 135 192 79 150 149 171 162 121 98
387 98 75 171 58 40 183 207 98 62 130 135 114 222 86 158 112 141 276 109 111 256 132 331 126 57 43 106 86 97 262 126
239 126 147 10 33 85 253 155 72 163 253 240 204 252 112 66 63 178 219 218 7 203 243 214 57 221 418 91 120 107 60 84 70
86 70 54 141 132 71 311 155 155 118 53 120 153 203 203 120 127 93 158 144 282 116 202 173 53 130 131 116 131 170 259 99 83 60 135 126 261 131
-91 131 149 40 73 87 58 193 138 161 119 123 77 252 126 134 76 58 178 99 59 284 198 66 107 94 245 118 144 165 83 138 192 40
-248 40 50 36 65 125 221 58 160 143 226 101 160 233 151 171 199 118 33 228 9 85 89 121 102 178 80 160 203 109 97 109 120 170 201
-411B01j69K3J43j9N0r0P3r2Q9j42K69j50k9R9j68P3P0l7Pn3J06
$$ plain form
-411 201 32 55 198 179 229 139 212 120 209 67 336 186 157 256 88 161 231 194 201 148 254
-514B54
##PAGE=	F1=-1523.29
##FIRST=	4521.1594499999982872,	4521.1594499999982872,	0
##DATA TABLE=	(F2++(Y..Y)), PROFILE
4521B60Q0R4j78J14pk0j27J41m6n2O9O2k68K20j26J29q4Oj3N3nP0k40J61n6j39J59Q3q5J22
4373C77l3k51J72N8k44K14K5k01K8J18j12m2J51j67Q4R1r1K8J87j50N4j56K4l4J09O1Pk60
4236D7K23j71J71j08Q5l3p2J38j81K2J36j46K33j61N5j83J81m8p4J02m9l0O0j84K18L1j64
4103I8Q5o9j8N5k6Q0l3p5R5k9J72j71J85k22n9J10Pn9M4j32J71j32K2l8K24j19r8K64j64o1
3955A07O1j1O2j16J09o0r1J58j99J31Q1j40P4Pp0K8N2o8r9M1lJ17J35n0k18J73L2J2J6j49
3807A22l6N0O6j34Q4k8j07J37r4J16p2Q9j12JO2J7J3o3P9q2p8J6M9J8J07J04j64j17L4M9J24
3655B50o1m3j6m3J00p2J08j5o7O9j55Q2J1j8n7MO8Mn0J78p0J11r5j33K01j17j1r6%J34J23
3502C24j72k2q6R1J7%k1K9n7L0l3J6k7J17P6j51P3j17K4kK9m4p8J29k5%J65n5j73K24j83l7
$$ plain form
4521 260 340 434 256 370 363 343 216 357 311 259 328 390 122 342 216 345 261 267 254 307 302 372 132 293 237 98 257 340 255 377
4373 377 344 93 265 323 79 293 318 117 145 263 151 109 260 93 177 268 177 205 392 242 296 140 164 130 239 300 307 47
4236 47 270 99 270 162 247 214 142 280 99 121 257 111 344 183 238 55 236 188 114 216 167 137 197 13 231 262 98
4103 98 183 114 96 151 125 205 172 97 192 163 335 164 349 127 68 178 185 126 170 38 209 77 99 61 285 166 68 332 168 107
3955 107 168 157 219 103 212 152 61 219 20 151 232 92 166 173 103 131 183 115 16 57 54 171 306 256 38 211 243 255 271 122
3807 122 86 136 202 68 152 124 17 154 60 176 104 193 81 82 144 161 174 111 190 108 30 46 95 113 220 324 160 43 77 126 250
3655 250 189 146 130 87 187 115 223 208 141 210 55 137 148 130 73 77 145 149 99 277 207 318 223 90 291 174 163 67 67 201 324
3502 324 152 130 44 135 152 152 131 160 103 133 100 116 89 206 282 131 204 87 111 109 138 94 16 145 120 120 285 230 57 281 98 61
3345F1Q1o7M8J16j44o7J17L6J12k28J35O0j71N8r2l0K19J58k99R4n2km5n1J54j26L9J40r3
3202A61q0J4R2j17P8Mj12K22o0Rj48J9P6m2J16n1j33K09q2j34nM6m3J63j5l3j16J54RR1O4
3049C56j76j01Q8M8j62P0M9q9J61Qj84J32m1J7oJ19q5j21Q0j32J9Q7q8LQ5k9M0J2q3J4P9q8
2892H2Q9jq0K8k6O1J24l6j75M8l2J4k2J23j6k2k4J33k40qOQ3J01m7l8J45j47rQ8o1PK3J47
2729C18n5K8j41o3Q7J54k04o3J26n7rM9Qr8P6m8J55j28q4L0R9l9J6pn9J11k4L5p6J12l8j05
2572A06o3Q4Q9M5j37J52j4j96N2K9m0o8K02j48N2N3j18R8Rp8q0J94q4j03L7N8L5k9p5kN1L1
2414A42q5kK42j13j14J90N1k05OJ30q4r5L7j4J23j9J0j6p3k7k8J10l5j8L5KJK3o8L7m8J04
2257A99o0P3o5L5L6n0q9J28R0j65M5k8j9o8l6K55Rj94J33j79R7j30L4J49j57k4K2J0J11j17
$$ plain form
3345 61 142 75 123 239 95 28 145 181 293 65 200 260 89 147 55 25 244 402 103 197 145 143 98 47 201 75 114 254 161
3202 161 81 95 187 70 148 152 40 262 202 211 63 82 158 116 232 181 48 257 175 41 36 82 39 202 187 154 38 192 201 292 356
3049 356 180 79 167 215 53 123 172 83 244 252 68 200 159 176 170 289 204 83 163 31 50 137 49 52 137 108 148 160 77 91 170 82
2892 82 171 170 90 118 92 153 277 241 66 114 82 96 74 197 181 159 135 268 28 20 26 109 210 163 125 270 123 114 202 141 148 171 318
2729 318 263 291 150 87 174 328 124 61 187 130 121 170 178 80 156 108 263 135 51 81 180 141 157 150 91 202 178 213 137 249 211 106
2572 106 43 127 216 261 124 276 262 66 118 147 107 39 241 93 145 198 80 178 187 109 29 223 139 36 73 131 166 137 62 60 111 142
2414 142 57 55 297 184 70 260 311 106 112 242 158 63 100 86 209 190 200 184 111 84 56 166 131 113 148 150 151 174 106 143 95 199
2257 199 139 212 147 182 218 168 79 207 297 132 177 149 130 62 26 281 290 96 229 50 147 17 51 200 43 19 41 51 162 45
2109D5j8J09l2J6M1mj13R5j1q5ON0M7K2j9k0j6M1Kn1J5j11Q4kQ9n3N6o7N1Q2P8j31n1o3Q5
1937A67r2j5J14N9K4j6J9j25j5M8j38R3m5M4Mn3J88m3p8mj8J5J18J5k00N1o2J9R3m2mp7R4
1775A38J0N2r6O5J73k99J18j8j10R0J4N7l7Pq7Q6j8j11J50l9n8j0J45p3r1J14j1r9J3l5J64
1622B04L7j71K30j24R8jk2j61J38K42k98Q3P3J48l57N72p1M0M54J82M20O74J278N88K844L465
1494A0565Q452K8699J42910k8809j12506l1208r181l542j696j880K9N65j166K3K29n43J0k64
1405F87j63k76R0on8p8L0n7J31Nk1j73K06k62J20M0j24l8J80j14k2J2n9Q2J09n8j7l7N0m1
1258A38Jr5l5J84o5o9N3O7qj16J9J01j33J27j12K21j85k6O6o4J01m9n0k1J52j32k6K15j72
1115H7J78m9j74J78j90J30j11M5JL2M9q3j7N1J5o0J1k2J37j14OK6q9J84L9o7j75J01R5j01
$$ plain form
2109 45 27 136 104 120 161 157 44 139 128 43 49 99 146 168 149 129 113 154 156 105 120 9 93 91 180 127 183 116 167 249 327 196 145 82 167
1937 167 75 60 174 233 257 241 260 135 120 168 30 123 78 122 126 73 261 218 140 136 118 133 251 266 66 117 55 74 167 125 121 44 138
1775 138 148 200 104 169 342 43 161 143 33 123 137 194 157 164 77 163 145 34 184 145 87 77 222 149 58 172 161 62 75 40 204
1622 204 241 70 300 176 274 273 251 90 228 470 172 255 328 476 119 691 620 660 1114 1296 1716 2390 3668 4256 7100 10565
1494 10565 19017 47716 190626 161817 49311 18103 8922 5380 3684 1804 1833 2398 1232 1255 1484 941 951 687
1405 687 524 248 338 332 274 196 226 169 300 305 284 111 317 55 175 215 91 53 233 119 97 109 50 132 241 183 166 129 179 138
1258 138 139 44 9 193 128 59 112 179 171 55 74 175 42 169 57 278 93 67 133 69 170 121 71 50 202 70 44 259 87
1115 87 265 216 42 220 30 160 49 94 95 127 176 93 76 127 142 82 93 71 208 94 100 126 37 221 260 193 18 119 214 113
967A13J72j51l0k4J45J3jj14p1N0l1J26j30P4K8r4Q6J3k9J27j95M2J21kl6J47L43j30k38k76
820D8O1j5J53j90N2O1j06J6K20j83J56k5j33m3J19o7j07O2M6J41j76n7J87p6k6R0p6N1K8j57
672E4JJ02K2P3j67L4j6J05r6nJ20j52O0J02j08n4J27n9J20j44M2P2M8j96Q5k4j22K06j24N5
524A61m0P5q0L3r3K13j19k3m4R5J8mQ19l95j38K78m18k04R2j51J71j80Q9L2m2J0k3%rR0p6
372A37n6O6K1o8K6k9P3p8J80j75K8M1oJ47k38J5J75j13J87k35l9N1M0l7o7K44k01Q8j17k5
224C5Q6R0j32j8J85l9N2n4L0j40M2n9R7J19m6j41O3J4Pj29J38K28l26J3Pj8L6q9lJ57j01L5
67A39K02k18N2qr1J18r3P7Q1j22L9j28J90j07J60j38P6m0j37J32j1%o3O3J31j98L3m5J04j03
-81I5J81j67J00j91J21j8MJ08j11O5j3j8k9K19k06N8o9o3J36n5j19L27r3j54O8j07K32j10
$$ plain form
967 113 285 134 104 80 225 238 237 123 52 102 71 197 67 141 169 75 161 174 145 272 77 119 240 238 202 349 692 562 324 48
820 48 109 94 247 57 109 170 64 80 300 117 273 248 115 72 191 124 17 79 125 266 90 33 220 144 118 208 132 183 211 54
672 54 55 157 179 252 85 119 103 208 112 107 227 75 135 237 129 75 202 143 263 119 161 233 281 85 170 146 24 230 106 161
524 161 121 196 116 149 56 269 150 127 83 178 196 192 1011 616 478 756 338 134 226 75 246 66 155 187 145 155 132 132 123 213 137
372 137 81 147 168 100 126 97 170 92 272 97 125 166 160 307 69 84 259 146 333 98 59 110 150 113 46 290 89 177 60 35
224 35 121 211 79 61 246 207 259 205 235 95 137 78 175 294 248 107 170 184 191 62 200 428 102 115 122 104 140 51 48 205 104 139
67 139 341 123 175 167 76 194 101 178 259 137 176 48 238 131 291 153 229 189 52 184 173 173 110 173 304 106 139 94 198 95
-81 95 276 109 209 18 139 121 125 233 122 187 174 156 127 346 140 198 129 66 202 147 28 355 262 108 176 69 301 191
-219A91m2Q1j34N2J39k23P1n4P1j6J68k00M1N0R2k43J56J01j37R8Lr1j30K84k32P1J9oJ2O9
-367B61r7J06K7j29K4J9L7K7J7j43l5J59N4j8p5Q9p0J40l38M35j78j02K12j79M9P9l5Rp5J32
$$ plain form
-219 191 149 230 96 148 287 64 135 81 152 136 304 104 145 195 287 44 200 301 164 262 265 174 44 328 96 167 186 180 192 261
-367 261 164 270 297 168 192 211 248 275 292 149 114 273 327 309 234 323 253 393 55 490 312 210 422 243 292 371 336 345 270 402
-514D02
##PAGE=	F1=-1533.13
##FIRST=	4521.1594499999982872,	4521.1594499999982872,	0
##DATA TABLE=	(F2++(Y..Y)), PROFILE
4521D79K6J16j97J02M6o7j23J32m5m6O5O6k89K62j97J44r3M4k5J8o6J43k71J90o0j05Q2J54
4383D85k25K12k4k67J58O1k34J48J37k64N0Q5m6o7Q4r3N4O0n9j4K81k76J31j85J3p9K30p2
4246B84R0l40L11k22K45j61qJ25j45J81k41N3J14k48L55j36l1q9J00Nj35K13j33oN1j31J46
4113B47O3k63J59Nj06J07j5L8k8p6J03j08K15k55K88j93j21J63L2p5Lp3J31j91R2n2K62j81
3975A71j13L11j72k0N9j31J72k16J91j09n0J39j80M8J34o8P7o2p0M3O1m0j37J16o4N5J13N1
3837C09k78K43M5m2N0j36j42J39O1j90J13m1r0J54j64J28m1J46r7j07J06r1J28mQj25qk6P9
3694A27nJ63K0j55j13P4L1J64j71K9kk3L0p7O2L5J5N4k19J45Oo8q0R5j6P7j10K06j14J19j67
3542A32o4K91j53k3j30RM6K39j64p8o4J29J1K5l6nr2M9OmJ2P6N8j42J22j60RO6m1jr1L0J14
$$ plain form
4521 479 505 621 424 526 572 505 382 514 469 423 488 554 265 527 330 474 381 425 400 418 352 495 224 414 354 249 331 485
4383 485 260 472 448 181 339 400 166 314 451 187 237 322 276 209 293 200 254 314 255 241 522 246 377 192 205 126 356 284
4246 284 374 34 345 123 368 207 199 324 179 360 119 172 286 38 393 257 226 137 237 242 107 320 187 181 232 101 247
4113 247 310 47 206 211 105 212 197 235 207 131 234 126 341 86 374 181 60 223 255 180 183 110 241 50 142 90 352 171
3975 171 58 369 197 177 236 105 277 61 252 143 93 232 52 100 234 166 243 181 111 154 215 175 38 154 90 145 258 309
3837 309 31 274 319 277 327 191 49 188 249 59 172 131 41 195 31 159 118 264 167 60 166 75 203 199 207 82 74 48 127
3694 127 122 285 305 150 37 111 142 306 135 164 162 139 169 92 154 189 204 258 39 184 190 122 42 137 121 198 88 294 180 299 132
3542 132 68 359 206 183 53 62 108 347 183 105 41 170 181 206 170 165 73 122 128 124 136 212 270 128 250 90 99 165 124 123 32 62 176
3379A76q5J71k8j67K47k06k7Q0r0Q2J07r8r3J10L8J07k04L5J13j41P8j77M2J64J41k70J08
3246B13m8K6o4r3J88j20j8J91j52o9J25Np7Q4k7j23K61j26M4j38l7J20k8J09r5l4J78j21j52
3104B2J1P7o7J01l2M3j11J82j9N4J52j60j45L7P7j87N2J32j69K21j06j11J47nk8L1R3j34p8
2961H0J05j63Q3M3q8J2L0J4K0P0j28j0R6n1L1kl3J8o8O2J28k6j23J2KMk0O8M0q2k0J65j65
2798A04m4l6J18J02n7j15J77j65P5O6k2n9J8J54j19Q5j09n6J6K29k30q5J39m9mP0mj40J49
2656B08r1J65j51j00R4M9k1j8K6j42J81m1R0j44J24l9q8q8J29O1L1p5J04K1k19Q3K5k6r9K20
2508B69k14O6P1j04Q3O1j40p9J98o7q3kR7J8n0k8j8L5M1p4j6K21r5j53J83L3j81N3J28p8j59
2355A6R4k9J50j0l2K1o3m6l0J00J9n6J4J0k8M3o7M1q0J29p0Q1m3L2N1m8j17J41Q6k29Q7l7
$$ plain form
3379 176 91 262 234 67 314 108 81 161 71 153 260 162 69 179 217 324 120 155 268 127 205 28 70 234 375 105 213
3246 213 165 191 127 34 222 102 84 275 123 54 179 184 107 191 164 41 302 176 220 82 45 165 137 246 151 117 295 174 22
3104 22 33 110 43 144 112 155 44 226 207 261 413 253 108 145 222 35 87 219 50 271 165 54 201 196 168 199 292 158 80
2961 80 185 22 105 148 60 72 102 116 136 206 78 68 164 113 144 142 109 127 59 121 249 223 100 112 114 118 98 166 206 124 104 269 104
2798 104 60 24 142 244 187 72 249 84 159 225 203 144 162 316 197 282 173 117 133 362 132 47 186 137 133 203 199 59 208
2656 208 117 282 131 31 125 174 153 135 161 19 200 159 249 105 229 190 102 14 143 204 235 160 264 285 66 149 174 148 49 269
2508 269 55 121 192 88 171 232 92 13 211 144 61 59 156 174 124 96 78 113 154 80 64 285 190 37 220 253 72 125 253 175 16
2355 16 110 81 231 221 189 210 147 101 71 171 190 134 148 158 130 173 106 147 67 196 126 207 164 196 247 199 82 223 309 80 167 130
2198A30k7k8m3K48k0j91K03k34O1q3M9J84k20k8K6O3J02j48m1J76m5K7J9rp6N6m0m9nN6mP5
2040A84p2pL9j3K2Kpj11J25n6J01j11R1j7mJ05Q7j37r4k4P1j21RQ2J20kN7j02j09k3P1j13
1883D3J16k9j8KJ7J37o8k6j2l6J2J22J0k04P9k6l9P5l5O5j39J34m6K5m6oK73l71J40m6o2N6
1725I7N5M2Mm0q2N1L8j51J94l2l7l6J79j42J4Ql7m7k0j7K27K6j28K47j72J38K7oj91J46K05
1573E60k48M0M8K79l27O41p3K26M75M78M73J50K149J312L830N647J2964M4351K20617m0868
1474B52724j74892m9220j4409o015k707k231j717J943j006p40L86p17j03l26k30l05R3oj70
1381C52n6O2p8K6J27k5k23K43k82R4R1k67J2J88j64k8O9p1M9K05j20m7j4J19r6Rj36qK06j13
1233A24l5K0R9K2j29m7J51j77J75j35K17j49l0J4n1P9k0m0K0Q2j09k3K11j78K04q3j84K34
$$ plain form
2198 130 103 75 32 280 260 69 272 38 99 16 65 249 29 1 27 90 192 44 3 179 134 161 180 171 95 151 111 62 57 113 109 184
2040 184 112 105 144 131 153 155 148 37 162 106 207 96 187 170 166 271 358 221 127 103 174 53 62 144 264 262 319 217 108 85 156 43
1883 43 159 130 112 114 131 268 200 174 162 126 138 260 270 66 145 119 80 155 120 185 46 180 134 159 113 107 380 9 149 103 41 97
1725 97 152 194 198 158 76 127 165 14 208 176 139 103 282 140 154 162 125 78 58 41 268 294 166 413 241 379 406 400 209 355 560
1573 560 312 352 400 679 352 993 920 1146 1621 2099 2572 2722 4871 6183 10013 15660 28624 72975 293592 252724
1474 252724 77832 28612 14203 8188 5481 3250 1533 3476 2470 1730 2116 1399 1296 970 740 435 528 522 352
1381 352 296 358 280 306 433 408 185 428 146 240 331 64 76 264 100 72 141 70 119 324 204 157 143 262 166 175 39 31 237 124
1233 124 89 109 208 230 101 54 205 28 203 68 285 136 106 120 69 148 128 88 108 190 81 58 269 91 295 212 28 262
1095B62k01J33j86J22n9J09j8l8r3Q4Q4o2m2k2K09j79KK0r3J77L4n4j10PJ62j75K44k17Nk1
948H4J74o3K1o2q2L7J0Q9j35J14Kj31Q3kL6P5k03Q8J35j8OL7M12m6j85l49%l8J67k18R5N4
790A87o5k4K44k46J61j4q4p0J62q1j67N8O8J37j54o8J95j29J8Q5m2J4N4j72L3QO2J28k07k0
642G1P7N2j19PJ65k40J26J08j14q7J54j26J69j17O2OR1j75J04n0j28K31j83J35j04P4o1Q3
505B11j58K04j73oK5J05K7P44K31j027Q17j02n86j37N2k16K81k27Q0Q2j15L3oK0L5L1lj03
367A19J2oj5Q9j53J42j00K36k11j0J04rJ26l13N1K00p6J46k44l6J27J5n4j16K88k07J06q8
229A23o0J11oo0j7K36j74J09m7Pj32J41j38P9J98j05n4o0j4K2j1J2K56k64j2J0NM5j33RJ90
76B66j94J48J43k79J06L8j20J59k24J17J65j69P9k18L11j83J61j28Q8n4j05J24pNj11R6J17
$$ plain form
1095 262 61 194 8 130 71 180 162 124 31 115 199 137 95 73 282 103 105 125 32 209 243 189 79 86 248 73 317 100 105 84
948 84 258 195 216 154 72 109 119 208 73 187 189 58 141 139 175 250 47 135 270 252 258 295 707 661 476 127 127 89 256 38 133 187
790 187 122 98 342 96 257 243 159 89 251 170 3 61 129 266 112 44 239 110 128 213 171 185 239 67 100 108 170 298 91 71
642 71 148 200 81 88 253 13 139 247 133 46 200 74 243 126 188 194 285 110 214 164 36 267 84 219 115 189 128 211
505 211 53 257 84 78 103 208 235 979 1210 183 1000 898 312 175 227 11 292 65 145 227 112 145 139 159 194 225 222 119
367 119 131 125 110 199 46 188 88 324 113 103 207 198 324 11 62 262 186 332 88 52 179 194 140 24 312 105 211 123
229 123 63 174 168 108 91 327 153 262 215 222 90 231 93 172 370 265 211 151 137 159 148 160 416 152 140 150 155 200 67 76 266
76 266 72 220 363 84 190 228 108 267 43 160 325 156 235 17 328 145 306 178 266 212 107 231 224 229 118 214 331
-56C31j84L9m8J60k30K05j27J26k18J79q2N4O8j37P9J6Jm8K40k82J29q9l6P6j9j01L29j07
-194C24j50P7j51K63r4j08J73j95L3K12k85J67j23J27j03K20k02j1J04P7l10J95J31j30J18
-317C59j5j15q8K90k31N8K6m5P3M7j06J35Oj22K2L3O3Mj4p0n7J20J06m5q3J08n6J85m01M65
-465F52j99r2K43j91K6J14n5K1r8J35
$$ plain form
-56 331 147 186 138 298 68 273 146 272 54 233 151 205 273 136 215 231 232 184 424 142 271 182 146 222 203 102 431 324
-194 324 174 251 100 363 269 161 334 139 172 384 99 266 143 270 167 387 185 174 278 355 45 240 371 241 359
-317 359 344 229 141 431 200 258 284 239 312 359 253 388 394 272 294 327 390 394 380 310 253 373 479 434 351 459 403 588 187 652
-465 652 453 361 604 413 439 553 498 519 421 556
-514E56
##PAGE=	F1=-1542.98
##FIRST=	4521.1594499999982872,	4521.1594499999982872,	0
##DATA TABLE=	(F2++(Y..Y)), PROFILE
4521F95l0J30k09R2R2j05j16J18m6k8L7O4k74K85k60J45p7O0l1k6q1J72k65J73m4q4K7K00
4383F14l46L01l9k47J31O6j97N1K21k82O6L8K1r0J3nNL6k7n5L53l54J67j88%r9K98j66J49
4241D35l05K65k24K79k09p1K49j95J96k27N4P3k03L13r9j23L0J0P5k25L20k02NN0p9P1R0k70
4103H3J41Q1j65J22pK1l8o5J03j58K25k89L44j73q5J16O3p4m0k3Q8j91J05m2K69k18j24L36
3965D05k00N2L5k22K67k93K44j41KQ5j40J6J35j4P3j05m0O5Qjj65J94j41LR9J34l21L00M0
3822C74j02R9j08k30K09M0j80J05m9q3J56j52N7J3J81p9j89J19j30K00K7p4j31Q4j10J28l4
3689A41J99o2j46m5O4K2J67k73J16JMn3K7p5Q5R5M4k81J84J8j27j8J12r4J45j73K23j48J17
3547B69k16pL59j81k7r0m5m8L48j55r0o2J42K4M6m9m7j31O5O1l0N3K3K9p1J31k16OJ27j10
$$ plain form
4521 695 665 795 586 678 770 665 549 667 621 593 630 694 420 705 445 590 513 573 542 516 435 607 342 515 471 387 414 614
4383 614 268 569 530 283 414 480 283 334 555 273 339 377 398 308 321 316 321 357 330 275 628 274 441 253 253 154 452 286 435
4241 435 130 395 171 450 241 170 419 224 420 193 247 320 117 430 331 208 238 248 323 98 418 216 221 271 192 263 353 83
4103 83 224 305 140 262 255 276 238 173 276 118 343 54 398 225 140 256 319 245 205 182 270 79 184 142 411 193 69 405
3965 405 205 257 292 70 337 44 288 147 149 234 94 110 245 231 304 199 159 224 232 231 66 260 119 122 221 355 34 334 374
3822 374 272 371 263 33 242 282 102 207 158 75 231 79 136 149 330 251 62 181 51 251 278 204 73 157 47 175 141
3689 141 340 278 132 87 151 173 340 67 183 184 188 135 162 87 172 267 311 30 214 232 105 87 199 105 250 77 300 152 269
3547 269 53 46 405 224 197 107 62 14 362 207 117 55 197 221 267 218 171 40 105 166 136 189 212 241 170 301 85 91 218 108
3399A08L8o0m2J83j48J77j8j47K43k08L0K3j12J10Q5l7j10R5L4J00j82n4J48q9R1k13O7J05
3261B17J06k32J26l6L9o7j43K13r7n2K23k05j7J84q3m4Q8n6q4K56j86O5r5r5J44j5J05j21
3123A38L0J60j53j62M3Q8o5J3l2J06p6J66n0J4K27j38j51n5J22j54j1J91k12K77j98o7J37
2990A88L0o3O9N7j52n9J25j78J40Nq3N3p5O6j1J37j64jP2K3n0pJ8k9k5J4J48m9o2l8O1j2l2
2828A16J9R9j44k7J97q9p0l2Q4J22n6j93K03j66J32M6L3j36KJ59j73J22n9l3p6L06k53r1J41
2685A83m7QR6k4j71K06j36J92j91j01J57j0j5n5O6l8R1p7J41k03J43n1n6r3J48L1J0j6M1O4
2538B93k30J00L1j2j18K13k63P2Q7p5N6J14j98l2J64n4n0n7J43j6o3J9m1ON8k0m8J88p1j43
2390E3J71k7j55Q7J33o0j06K4m6J77mp3M9m6n1m0Q3Q2j01j1J7l6M8n2K2m8J21j02Q1nNP1m5
$$ plain form
3399 108 146 86 44 227 79 256 238 91 334 126 156 179 67 177 262 225 115 210 244 344 162 108 256 167 258 45 112 217
3261 217 323 91 217 181 220 153 10 223 126 74 297 92 75 259 176 132 220 164 80 336 150 215 120 25 169 154 259 138
3123 138 168 328 175 13 56 144 79 92 60 166 90 256 206 220 447 309 158 103 225 71 60 251 39 316 118 51 188
2990 188 218 155 224 281 129 70 195 17 157 162 79 132 57 123 112 249 85 84 156 179 129 122 140 111 86 100 248 199 137 99 160 148 116
2828 116 135 234 90 63 260 171 101 69 153 275 219 26 229 63 195 241 274 138 140 299 126 248 189 156 80 386 133 42 183
2685 183 136 144 240 216 45 251 115 307 116 15 172 162 147 92 158 120 211 134 275 72 215 164 108 15 163 194 204 188 229 293
2538 293 63 163 194 182 64 277 14 86 173 98 154 268 70 38 202 148 98 41 184 168 105 124 83 89 147 127 79 267 196 53
2390 53 224 197 42 129 262 202 96 120 74 251 247 174 223 177 126 86 169 251 150 139 156 120 168 116 138 90 211 109 190 185 190 261 216
2227B16j34J34P8k25Q4m9j6Rn1K34m6k00K70k81P9q4P2J96k69J0N3M9J03j58n9J97o7N3Qj6
2080A90n8L7o9Ql1L3n2J40j22LP9m7N6K6j6j08J55j06J06j53J10M4o4J16Q4j33j12K2M3j50
1932C1L9N2J69m3J43k32r2j4J23j06J25lp6j8Q6Q3r2L5k4n2lJ37mj98J13po5L9m2J34j99J77
1775B16q5k4J5r0L67l41O3p6J1OJ02K1O2r5o5M1N4j12J67l6rl7J65j86J17j10o4K1l1k1K95
1622C41Po8K21j71J46N0Qj89J26J66j93LK6L92k18O27l1L83M73P48N54L27K272K017M659P740
1494B0416J7320N9524K95456n1693k35195o6862j9412q591l811k170k976K533J22k505N32
1420B688r26j67l73k79l17Q4Ok86n7J21j06p1K34k0k66K56k76O0J24l80N8J81k02j9J11o4
1292A14K3K46j54l3m6J83j42Rj58J2K02j44o%J37M1j16j21J93k01K00j20J68j12l2m1l0N9
$$ plain form
2227 216 82 216 294 69 153 104 88 97 46 280 234 34 304 23 102 18 90 286 17 27 80 129 232 74 15 212 145 198 206 190
2080 190 132 169 100 108 77 110 58 198 76 79 158 111 167 193 177 69 224 118 224 71 181 225 161 277 361 228 116 138 181 31
1932 31 70 122 291 248 391 159 67 53 176 70 195 192 116 98 184 267 175 210 186 134 131 268 264 66 179 172 107 146 104 238 39 216
1775 216 131 107 122 32 399 58 121 45 56 62 164 185 247 152 87 128 182 70 237 201 192 155 320 134 251 141 77 98 67 46 341
1622 341 348 280 501 330 476 526 534 345 471 637 444 447 473 865 647 1274 1243 1626 2099 2847 3401 3728 6000 8017 12676 20416
1494 20416 37736 97260 392716 341023 105828 38966 19554 10963 7152 4982 2006 4539 4661 2156 2688
1420 2688 1762 1595 1222 943 626 710 716 430 373 494 388 317 551 531 265 521 245 305 429 49 107 288 86 67 178 114
1292 114 137 383 229 196 150 333 191 200 42 54 256 112 106 106 243 284 168 47 240 39 239 119 287 175 143 102 72 131
1154A31%j5O7Lq7K1J44j67K18j13j72K65k01J26j90J39j25K01j10L8j39O7J45n7j02j4K68
1021C41k27mJ9l6R0M0l3l7n9J66j76K45k69M6k8K03j42L7J6n4l4O8M2j11J22j1j70R6l8J06
874B08Ok02J37J56l6L1p9M21N4j12l99l7p1J77k30J35M3j7p7K53k58J48k2m0q3J96r1k01K5
731C5R1J44j34o7J80j88R1N7Pk3O9j79N8m7P4J81k33q3J62lq9l1J90j83P3J09j14n6J04j51
583D4J71q1P7n0J17j35J19p0j09K13k13J86j50O2m6J19k16K06k28O6N3J16P2J604J092k741
455B78J523Q04k132k75M8k00K72k23K8J38j83N6J0K9R8o5R8j54ql2K1J31j91J15r0K71k34
323A33pJ02K4P5k72OK10l5Q7k15p3K05j6o1r1K51j75R6n2j03J52j05N7n4K48k90J55j4k5j21
175I2K24j95N8K50j60L4j61J5l4J24j38K77j63l7j7M1L3j29L0J65k65K59O8l06J28R4j41J83
$$ plain form
1154 131 131 116 183 186 99 120 264 97 315 202 30 295 94 220 30 169 44 245 135 173 34 101 246 189 87 73 341
1021 341 114 110 129 93 183 223 190 153 94 260 84 329 60 106 78 281 139 176 192 138 104 172 214 103 225 214 44 140 102 208
874 208 214 12 149 305 269 300 221 642 696 584 185 148 77 254 24 159 202 185 108 361 103 251 229 189 106 302 211 10 35
731 35 126 270 136 69 249 61 152 209 216 193 262 83 141 94 168 349 116 33 195 192 103 72 262 79 152 261 147 91 195 44
583 44 215 134 211 161 278 143 262 192 83 296 83 269 119 181 135 254 38 244 16 82 135 251 323 1927 3019 278
455 278 1801 2605 473 198 246 46 318 95 123 261 78 134 144 173 271 206 304 150 142 110 131 262 71 186 96 367 133
323 133 126 228 252 327 55 61 271 236 323 108 35 240 224 163 72 323 148 244 192 89 241 136 193 139 387 97 252 238 213 92
175 92 316 121 179 429 269 303 142 157 123 247 109 386 223 186 169 210 243 114 144 309 44 303 371 65 193 287 146 329
37C29k86J18K30k20J22k21L42k35J48j43J22n8q2R5J8rj29J43M9j26J1l3K21l27J74k5J02
-96C30k47K48j57J09K2j20M8M5N5j00K45l41K02j12K0j5K9p9L18j23j39Q5j77K72p5j65K69
-229D47k55J9K54l30K49j73J71j76K49j87l9J46L5k77J51J46q8J07k4j59k1K78k19L6K7o9
-357B98J35K7j23J57qj04QM6Q5j5n2Ro9Q3J39n1j00J31m9K20m49M79k05n9K36j93KJ57q9M9
-504F95j24J24
$$ plain form
37 329 43 161 391 171 293 72 414 179 327 184 306 248 166 261 279 270 141 284 333 207 218 185 406 79 253 228 330
-96 330 83 331 174 283 305 185 233 278 333 233 478 137 339 227 247 232 261 182 500 377 238 323 146 418 343 178 447
-229 447 192 211 465 135 384 211 382 206 455 268 229 375 410 133 284 430 342 449 425 266 245 523 304 340 367 298
-357 298 433 460 337 494 486 382 390 436 521 506 454 463 394 477 616 565 465 596 547 767 318 797 592 533 769 576 578 735 646 695
-504 695 571 695
-514F95
##PAGE=	F1=-1552.82
##FIRST=	4521.1594499999982872,	4521.1594499999982872,	0
##DATA TABLE=	(F2++(Y..Y)), PROFILE
4521H73q1J37k18Q7J23j26j08J01n2MrN6k27K82l01J35m6N8k4r1m9J60k27J26j3q4RK09m24
4378B80L68o7k02Q7Q2j63k6K47k47O4nP3r5n7P6m6K1lr4M00l62J45j65j7r1L06j98J69k55
4236B25J85j77K71k45p2K97k13J78j83M4M5j37K28n7k09J46n9J34l11M02k42jN7m0OJ10k15
4103A67O3J47j95J12qL3o3m7J00j69K04k41L17j69l1N3R2o5p0J6L9j60R0j8K53k23j39L42
3965D30k38J37lk13K72l06K33j56M7J8p8K8P6K9O1j04l0R6p0M4j87K69k19k9R2J83l22L20
3827C80J9j62J58p1k71K34J0j67J20o1r5J63j22k7P9J91o2k31J05n9J67L5j46j00J49j92J78
3694B22o5K21j32j40J9O4L1J24l37J93mL2j33J45j93J14J51M7l22J84M5j74O4R6j52J81j99
3561H2K10j58R7j62l7L93k02j7l0j08J3K90j56o3p3J36N4N9o7q9j16K6J30o4R2k7j2K6J14
$$ plain form
4521 873 792 929 711 798 921 795 687 788 736 740 731 787 560 842 541 676 630 688 664 573 524 684 457 583 570 486 495 704 280
4378 280 648 581 379 466 548 385 359 606 359 423 418 491 396 339 415 369 390 387 293 693 331 476 311 294 203 509 311 480 225
4236 225 410 233 504 259 187 484 271 449 266 310 355 218 446 389 180 326 267 401 90 492 250 249 306 266 272 382 167
4103 167 230 377 182 294 286 319 256 209 309 140 344 103 420 251 220 273 365 300 230 246 285 125 215 197 450 227 88 430
3965 430 192 329 326 113 385 79 312 156 203 221 143 171 247 276 337 233 203 299 229 273 86 355 136 107 199 382 60 380
3827 380 399 237 395 324 53 287 297 130 250 189 94 257 135 108 187 378 316 85 190 131 298 333 187 87 236 44 222
3694 222 157 378 246 106 125 189 220 344 7 200 196 228 95 240 47 161 312 359 37 221 266 92 156 252 100 281 82
3561 82 292 134 231 69 32 425 223 206 176 68 81 371 215 152 79 215 269 328 261 172 56 82 212 148 240 213 201 227 341
3419C41k69K7J57j65O2plJ17j49J53k3j23K17j96R0m3j24J30N6K0j20Q6K0R2j63q2J23j9R4
3276B99k05M4N6O1j90J43oK0m9j41J76o5n2K26k30L5J95j54k3R0q0l6K35k32P7l9r5J07pJ07
3128B67j30O3J54j79j60N8J04o7m6L7P3n2J55q2j4K73j10j38j58J69j04k3J74k12L00k02q7
2995F3J01N8p1R4J1j40n9J33j66J72k2p4Q8j57J05n0J89j72PL6R6j08rN0j03P9o4J80r7Lr7
2843G6J34k9n6JJ32j80k4J84k1p9l7L8J53m3j91J56j34J32M1Q7k04k5J59j58Q4kKj59L54k60
2695A31q5J30n5L3J15m5j69K27j74K25k40o3J87p3j9q2R9N3L7j23J75k29J47o2j9q0J43Jj6
2552A69L5k9J10k28R5N0jj29J96k43J7J03l7K2J58k41J4J35n0j6j06J89o3o8O6p5k3P3N1p7
2405I7J47m8j04J66j06j24R7J48l7n7m4p3J98jj00O6k9n7m6O9J40j42l3K3j5K3l9JJJ15j45
$$ plain form
3419 341 72 99 256 91 153 146 143 260 111 264 241 118 335 139 229 186 62 192 248 268 148 234 254 346 183 101 224 205 299
3276 299 94 138 194 255 65 208 202 222 173 32 208 143 91 317 87 122 317 163 140 230 150 114 349 117 194 155 60 167 160 267
3128 267 137 200 354 175 15 73 177 110 64 101 174 122 277 195 181 454 344 206 48 217 113 90 264 52 352 150 63
2995 63 164 222 151 245 256 116 57 190 24 196 174 100 188 31 136 86 275 103 110 146 242 134 125 175 72 151 87 267 170 173 76
2843 76 210 181 125 126 258 78 54 238 217 138 101 139 292 249 58 214 80 212 253 340 136 111 270 112 196 194 196 37 391 131
2695 131 46 176 121 154 269 224 55 282 108 333 93 30 217 144 125 43 142 195 232 109 284 55 202 140 121 41 184 185 169
2552 169 204 175 285 57 152 202 201 72 268 25 42 145 108 130 288 47 61 196 146 130 24 213 150 82 148 73 50 123 174 97
2405 97 244 196 92 258 152 28 125 273 236 179 135 62 260 259 159 225 196 139 93 162 302 160 127 150 135 158 119 120 121 236 91
2252I1P2N0m2R3m8j35J05P7j81N6n3pL9n3K17o1j93K92k87J14j24R8J87k83L9O8K7J09j59
2109A08q4K04r4Q8%j3o2M5r6O4o0j0n4J74j62LJ03o3R8K8k2j03J75j46J10j61R4J09j21J14
1962B66P4j18j04O3J0j49L9M3J87r2K18l29r2J8J76j06J20K6j19n3J44L3j09R2l5o2k7J56
1824B70j9j83J43j0o0J2p0J86k43K18j13p6P4q6L55k92j3o7M8l7J34lJ28j50l4N0K7o0J31
1681B60m7J9j9J18k05K07k21o1O3j3m8L51qk7J88j35J26O5K1j69R3J32j46k1J8M66j11N82
1543A478M8M97M46R55O37P33K075K585N196R394K0800P1700L55042n9455k83424q1254k3291
1460B4162j0836m835j799k963J566J397m153M12j000j57l86l03l02L0K8l82p0J95j38j37L00
1356F29mk93K50k49K3J39m34Q1J53k16L0R5n0J3K39j53Kj06K32j70%j47MJ81j58J6j0J70N7
$$ plain form
2252 91 163 213 171 264 216 81 186 263 82 138 85 78 117 64 281 220 27 319 32 146 22 120 307 24 63 131 158 267 108
2109 108 24 228 134 222 222 209 147 192 96 160 100 90 36 210 48 51 154 91 189 217 195 92 267 121 231 70 164 273 152 266
1962 266 340 222 118 181 191 42 81 124 311 219 437 108 16 34 210 104 224 250 131 78 222 255 146 238 203 141 114 270
1824 270 251 68 211 201 141 153 83 269 26 244 131 55 129 43 398 106 93 26 74 37 171 168 296 146 112 162 189 129 260
1681 260 213 232 213 331 126 333 112 51 114 101 53 404 396 369 557 422 548 613 634 465 558 690 544 523 541 1007 896 1478
1543 1478 1526 2023 2469 3424 4061 4794 6869 9454 14650 24044 44844 116544 471586 412131 128707 47453 24162
1460 24162 13326 8491 6692 3729 5295 6692 2539 2951 1951 1794 1408 1105 803 833 861 479 409 604 466 329 629
1356 629 625 332 582 333 356 495 61 142 295 79 109 204 154 167 406 253 255 149 381 211 211 64 68 249 91 107 97 267 324
1213C24r3j75K14k18K19r7J05q0l0q9lM4RJ2J00n6o9O9N4j47K24j30j33K57j94J15j70J39
1076B01j80K80k06J29j39%J91m2j61lL08k55rJ8LON9kJ2q6J25j13J82l00Q7m3K31k12M6J05
928B32m3j05J33Jp9J12j4j83J02q6J68o4j47J31J72m6L4j58L52J99n0m50m2j15K00k21J49
795A82K1L0j22K43k19J22n1lq1K17r6k27nJ16J45j15o5J58k40J64J7N6l9O4j77P7n4N5K26
652C99k45p7J58n0l7q9J95r7NJ08j13qM2r7R1m3Q5p8J08q9J36p7j01J77j88J87j77M9l9J44
505B79k68K25j81R0RJ25R3J774J535l226J297J604k739m01N8j86K23j67m9J93k33P4K8J9J64
382C40j76K06j98j1k4K0J43j52K2o4K87k41K5N1Q5Ok02m4K15pJ7j58j25K70n6n2o1K07j40
239A83Q7j0j54K07j95J49p7K24l56J73L5o1j11K81k09L8K58j99J06k33R4j33K39k80K85m5
$$ plain form
1213 324 231 56 270 52 271 174 279 199 169 80 77 121 130 142 242 186 117 186 240 93 317 187 54 311 117 232 62 201
1076 201 21 301 95 224 85 85 276 234 73 70 378 123 114 132 135 141 200 198 210 124 249 136 318 18 105 62 293 81 127 232
928 232 189 84 217 218 139 251 237 54 156 70 238 174 27 158 330 284 318 160 512 711 661 211 169 54 254 33 182
795 182 203 233 111 354 135 257 206 203 122 339 243 16 11 127 272 157 92 250 10 174 191 247 208 272 95 172 118 173 399
652 399 154 77 235 185 148 59 254 157 162 270 157 149 191 94 185 142 227 149 257 168 304 227 126 303 115 302 125 174 135 279
505 279 11 236 55 145 154 279 372 2146 3681 455 1752 3356 617 216 274 88 311 144 95 288 55 129 157 176 340
382 340 164 370 172 161 137 157 300 148 170 106 393 152 177 228 313 319 117 73 288 281 298 140 15 285 229 177 116 323 183
239 183 270 260 106 313 118 267 190 414 58 231 266 205 94 375 166 204 462 263 369 136 230 97 336 56 341 296
111B96o4o4J02j4q6N6J00k88L39j8k65Q6J49j49J90k69P9K67k64J55k08L49k69J40j80J64
-17C34m2p9N3O4m1j24J96n2m0l3rK70l77R8R5O3k80L18k26J60k6p8j0P4J30j75K38l68K54
-160C87j30Q8j19Q5n9K94j32j25R2k01K72m5k14L52l05J3K64l50L02j96J95k25K52j58n5J85
-288D67k8k19J08J37l4Q7k5k16N9K56k00QK1o8J81J3j41J61qq7rN8R7k3r2P9o9M7J59n0j17
-440E52J58m8K43m82M78j91k9K06j81k0J95j26Q7j54J14
$$ plain form
111 296 232 168 270 256 170 226 326 38 377 359 94 180 329 180 370 101 180 447 183 338 130 479 210 350 170 334
-17 334 292 213 266 330 289 165 361 309 269 236 227 497 120 218 313 376 96 414 188 348 322 244 234 308 438 263 501 133 387
-160 387 257 345 226 311 252 546 414 289 381 180 452 407 193 545 240 253 517 167 469 273 468 243 495 337 282 467
-288 467 439 220 328 465 431 518 493 277 336 592 392 400 421 353 534 547 406 567 559 472 463 521 618 595 503 582 513 560 719 669 552
-440 552 710 662 905 423 901 710 681 887 706 686 881 755 842 688 802
-514H02
##PAGE=	F1=-1562.67
##FIRST=	4521.1594499999982872,	4521.1594499999982872,	0
##DATA TABLE=	(F2++(Y..Y)), PROFILE
4521I82j16J36k24R0J29j26j02Q5n9M1n8M2j57K50l13J17j3M9jj78J9J13j57N8K4j03L3J76
4383G37m47M00r4j49L4J06j32p0K07j60L9l3J01p9j22J43r3K2Mj28M23l14Q4j23m0o8K74j84
4246C38J63k00Q5r5K32k61l4K83k00J33j32L5M0q8J34j4k74K39r8J67l66M40k46k3P0j7m2
4113B69J26j48l0K06k09Q9k1P3j04k1R5j54J70j94K91j85K9j4J14m9q7M8j4j12O2J2K18j98
3975B62j58L30k69K14m9j45K29k99K00j55Q6n6LL5KO6L8n5n4J29j50Q6k00L35k86m3R4J96
3837C86k88L07j8k09K15l4k82K40j9j67J55p2j19J75r1r3J39J72m6k40Q4JJ32K9j91o0J86
3704B92k52K19r7K32j79j39O4Q1M8M9k46J39j3N6j94K37k29Q2J83O0l38J47Q4j92J28O7j83
3571A06J76j70J57j38O3p6q9L90k15NK4j52P8K11j66j5r2J30Q8O3q7j23n9n5K04r8J25o9n9
$$ plain form
4521 982 866 1002 778 868 997 871 769 854 795 836 778 820 663 913 600 717 704 753 752 574 593 706 549 607 631 528 561 737
4383 737 290 690 596 447 481 587 455 385 592 432 471 438 539 460 338 481 388 410 414 286 709 395 479 356 316 248 522 338
4246 338 501 301 386 291 523 262 228 511 311 444 312 347 387 299 433 419 145 384 286 453 87 527 281 258 328 311 269
4113 269 395 247 217 423 214 303 282 355 251 230 325 171 341 147 438 253 282 268 382 333 246 294 280 168 230 242 460 262
3975 262 104 434 165 379 330 185 414 115 315 160 246 190 193 228 230 296 334 279 225 354 204 290 90 425 139 96 190 386
3837 386 98 405 387 178 393 359 77 317 298 131 286 214 95 270 179 86 225 397 351 111 195 196 328 357 166 106 292
3704 292 40 259 162 394 215 76 140 221 269 318 72 211 198 254 60 297 68 150 333 393 55 202 286 94 222 289 106
3571 106 282 112 269 131 194 118 29 419 204 209 233 81 159 370 204 189 97 227 315 378 291 168 109 54 258 160 285 216 157
3428A57J14Q4l02P2J49k03P0O4K6L9j04J05k7j05J74j70J38j00j23J40K5O5j28Q9pQ5j45l0
3291A52K7N7Q7j79jK7J2j33J39M4m0pj18J15k9m3K19k24O0J75j93j6R1r7OK06k67Q9J9q0O4
3138A62j0J15j26P3J54k00j48N8J21p2n8R2J0l8J53j14j8K78p6j12j88J41m9mJ12j80K93j63
3000B06j19M9P0l8R1l6j24n2J28j43J87m2n7J06j59Q9q4K05j50mJ2J50j36pO1j86J89j27K08
2857B87j47O3j54K03m1q3K6J17j70%J03L3o9n3j3J89k5j60R7r2R7N2J31k49n1J42n3l9M4M4
2710B29j68L10k40p9J16p6P2J18o2j40K20j96K49k89kJ90j31k2m7O7J19J5j61J85k12J20o5
2577A20J6p1J38k8l9P1r4J51k08O1Q6kj26J68j85m8J06Kj8J92k66N1J14n5K0j44K27j14o7
2434E8J09j16rM4J26r9J08l3o4J63j62r0P4J75j4j8j00j10K12mj10P7j3p2l8N6J87j75m4K6
$$ plain form
3428 157 271 355 53 125 274 71 141 205 231 270 166 271 244 139 313 143 281 181 58 198 223 288 160 249 242 327 182 152
3291 152 179 236 323 144 143 170 182 49 188 232 192 185 67 182 153 110 329 105 165 340 147 131 222 125 131 337 70 159 178 98 162
3138 162 152 267 141 214 368 168 20 78 199 127 69 161 171 133 286 172 154 432 356 244 56 197 148 144 256 76 369 206
3000 206 87 136 206 168 259 223 99 47 175 32 219 177 120 226 67 156 72 277 127 123 135 285 149 142 203 17 206 79 287
2857 287 140 203 49 252 211 128 154 271 101 101 204 237 168 115 102 291 266 106 203 111 208 260 391 142 91 233 180 141 185 229
2710 229 61 371 131 52 168 92 164 282 220 80 300 104 353 64 62 252 121 99 52 119 238 253 92 277 65 185 120
2577 120 136 65 203 175 136 207 113 264 56 117 203 201 75 243 58 10 116 118 100 292 26 77 191 136 156 12 239 125 58
2434 58 167 51 42 86 212 113 221 188 124 287 125 35 109 284 270 252 152 42 254 250 140 217 204 132 94 150 337 162 118 144
2286A44K4k9l2kL9J15j86N6J14r5J09n8j21O0R8j44L9m1k5O9n5K04o3j46K37k50J25j59J24
2144A51J57k67N8P1%J17j53j15K04j20J27j1Lq6P8j15J04q2n8J8J38j83j0J09o6J40J5k6r9
2001I9J83j68J17j39M5J66j59R8O2r5q0R4k0j23RO1J68j42K70l43n9j4K08j00R9N4j43r4J89
1858B43j2j16J31l5o3n8J76l3j49J48k8k9Lj11K05k41K28j33j08J15k5K67k34m8qJl4J19k4
1716A47J91k03LO1j9MQ7n9L5J3N4k00K76l10OL7J8q3L83qk0J66q2Q1P5L8j44N6J07j12l1L1
1558E98M82k7N09J53N52L98J075O94J086J796K921N352J0316K2793P8735L88880o2771l11069
1469A42473q9884k5299j2306n593j350k280m41K278m664k92p09o6l66k84k64r3M5m35p8K70
1371F62j61j69L16K2k96K26k05j0J39m47R6J09k00Q7M2l7K1J94j15K9j60K53j72j6j14k1J51
$$ plain form
2286 144 168 139 107 105 144 259 73 129 243 148 257 199 78 138 236 92 131 90 65 134 79 283 220 74 311 61 186 27 151
2144 151 308 41 99 170 170 287 134 19 223 103 230 219 222 136 214 99 203 121 63 81 219 36 26 135 69 209 224 198 99
2001 99 282 114 231 92 137 303 144 242 304 209 129 223 203 80 89 150 318 176 446 103 44 30 238 138 237 291 148 54 243
1858 243 231 115 246 211 148 90 266 233 84 232 204 175 178 67 272 31 259 126 18 133 108 375 141 93 85 86 52 171 147
1716 147 338 135 138 199 180 184 271 212 247 260 314 114 390 80 86 123 141 58 441 433 413 579 497 578 653 691 547 603 710 598 567 598
1558 598 1080 1053 1562 1715 2267 2665 3740 4434 5520 7316 10237 15589 25905 48698 127433 516313 453542 142473
1469 142473 52589 27290 14984 9391 8041 5761 5320 7598 2934 2642 1933 1867 1501 1217 953 860 905 470 392 662
1371 662 501 332 648 670 374 600 395 385 524 77 173 282 82 169 211 174 195 389 274 303 143 396 224 208 94 73 224
1238B24j61K9rJ88P2o7k16K28k31K40p8M1n8k2j18J8L7J6K4J20r1n1J03l7j24K22j29q4K22
1095C08j88J07j43J37k11L30k81K12j48n4K16k0k09RL21k64qJ7J6o1Q7L4L5q9O7l2R8k65Q3
953A04n8K52k64M7J82m9j60J94k8n6J01j4j66R2j23K05j13q1R1J73l5J0j36K17M10m0n49j7
815A89j67K37k09J52j6O8j38K06j54R5q6K1o6K26r6k23j6J27J13r7n6J28j81J23k6J03l3M0
677B64j67R1m2L6K57k41o1J24q2Oj33J76rn5J02j12M0km6J7j8R1q2O8n0J54o8r6J22j34J65
524C15j83M4m9J67k61K05j27J02p5J16M8P03Q41j618j91K245j769k52K1j63J42n8j35K46k47
401F7P3M4j1K11k75L02k24k1PKJ29r0o1m1K89k34O4k0J60o7j42q4K27Kn5q7j49K90r5k8l8
249A45J68j14Q5L5k07K66k66K03q2J70l38J38Q2r1j01L09j82K1K20k10J45k69J78j95K92l90
$$ plain form
1238 224 63 92 83 271 343 276 60 288 57 297 219 260 202 180 62 80 117 133 157 277 186 135 238 201 77 299 170 86 308
1095 308 120 227 84 221 10 340 59 271 123 69 285 265 56 65 386 122 114 131 147 86 173 207 242 153 220 188 286 21 104
953 104 46 298 34 81 263 214 54 248 220 164 265 251 85 177 54 259 146 65 156 329 294 304 168 385 795 755 206 189
815 189 22 259 50 202 186 254 116 322 168 263 177 198 132 358 262 39 23 150 263 166 110 238 57 180 154 257 224 264
677 264 97 188 146 182 439 198 137 261 179 185 52 228 219 164 266 154 194 192 146 163 145 236 154 222 172 326 258 162 284 150 315
524 315 132 176 127 294 33 238 111 213 138 254 302 1005 1846 228 37 2282 513 261 282 119 261 203 68 314 67
401 67 140 184 173 384 109 411 187 166 173 175 304 214 153 112 401 167 231 211 371 304 162 78 305 307 252 165 16 306 211 183 145
249 145 313 199 284 319 112 378 112 315 233 403 65 203 285 194 93 402 220 241 461 251 396 127 305 110 402 12
121A2K76P2r6j19J88j00j3Q4Qk54L71j04j88J7J90j43J84k33N1K82k94J71j85L33k86J48k34
-12A38K00mr7RJ20q1r8K36j62N9q3K1K93l91J4K05K6l11L72k70J94o8k8q2J04K09k53K21l61
-155A32K76j38J50k19J41l6K48j24j10R8k22K57Jk55M08l34OK53l41L14j88J97k41K27j21
-278C79n8K14j01j45P4J08J5P3k6k78J45K27j75k7J2l8J98Pj56J45Qp5k6P1R2j8j27J29n4
-421E93RJ75n3j28J83n2K52m96M64j56j5J56j47m4K20j51J24j87J12
$$ plain form
121 12 288 360 264 145 333 233 220 304 312 58 429 325 137 154 344 201 385 152 203 485 191 362 177 510 224 372 138
-12 138 338 334 237 246 366 285 187 423 261 320 237 258 551 160 174 379 405 94 466 196 390 322 294 212 316 525 272 493 132
-155 132 408 270 420 201 342 306 554 430 320 418 196 453 454 199 607 273 279 532 191 505 317 514 273 500 379
-278 379 321 535 434 289 363 471 486 559 533 255 400 627 452 425 437 399 597 604 448 593 601 526 500 571 663 645 518 647 593
-421 593 602 777 724 596 779 727 979 483 947 791 776 932 785 741 961 810 934 747 859
-514H59
##PAGE=	F1=-1572.51
##FIRST=	4521.1594499999982872,	4521.1594499999982872,	0
##DATA TABLE=	(F2++(Y..Y)), PROFILE
4521A008j33J26k22R4J12j08r2O7o3O9r1K2p9J97k96R8J1L9L5k76J11L8o3k0N8j34R2J05m17
4378B88L99j14r8k0J32j01q3J10l2j0l8J05m7j74J87j27L6qj55M23k32Rp4o8l1K14j45J48
4241D94j49j7LJ76k54NK43j64P0q6L0N7n8M0K3l06K97j07J73l83M29k13n3Q0rp4J41q1j19
4098A88K54k17O1l9J31j57J2Q7j18J33j67K77k14Q5p5J24k8r1P5p0n1K9M4J66j52j78L05k77
3960A37K57r1n5J70k83J59j41J20j29R4K5p2J00ML6j08J55k14J15k03L82l29m0R2J86k27K66
3827D06p0k35K65ok68K34l7j84J96p4j47J86o1j11J62J29l4k25P3L0J00J9j97l3J99k81K43
3694B79j25K30j89j48Q6J07O3l5j47R4k3O7k22K89k29L9J91P8l30Q7J22j72J61L1j88J39j02
3561A53P7r5K4j6j14L65k26L6O1j66J19J38j83M3j13J32J16N5j02j42jj25K57j19J50j01j06
$$ plain form
4521 1008 875 1001 779 873 985 877 785 852 789 858 767 789 710 907 611 709 720 759 794 518 629 667 604 584 642 508 600 705 288
4378 288 687 573 475 455 587 486 403 513 481 471 433 538 491 317 504 377 413 405 250 673 441 450 376 308 277 491 346 494
4241 494 345 328 331 507 253 258 501 337 407 321 351 408 350 390 413 107 404 297 470 87 516 303 250 330 321 247 388 307 188
4098 188 442 225 286 247 378 221 233 320 202 335 168 445 231 316 241 365 337 246 321 251 200 229 273 439 287 109 414 137
3960 137 394 303 248 418 135 294 153 273 144 238 263 191 291 295 331 223 378 164 279 76 458 129 89 181 367 140 406
3827 406 336 101 366 360 92 326 289 105 301 227 80 266 205 94 256 385 351 126 199 229 329 348 151 118 317 36 279
3694 279 154 384 195 47 133 240 303 268 121 215 192 259 37 326 97 136 327 405 75 162 284 112 273 304 116 255 153
3561 153 230 135 159 143 29 394 168 204 265 99 218 356 173 216 103 235 351 406 304 162 161 36 293 174 324 223 117
3428A17J68N3l05J28J10k26P0J42L8l9l4L9j5r5J15j32J72j42r7J30nQ9j34J03l9P7j22M9
3291B15p5J14P1j43n1J4l2m6R1J11j35N6r7O0Ll9K11k06P3J29j92k4R5j12L8J73k91J03P2
3148A86o3L1k3J26j12P0J53k18j20M1J30p1m3J14m4l5J61j44%K47m3p4j39L2J1J8L8j30K65
3005C64j22j29lO3K8O5p9j18k1J05j15J88n4l7J06j30O9j03J77j03l2KJ79j41lO0j68J86j61
2862G3K20j81J09j89K46m8j03P6O7j33J6J1O6m3p4o5K24oj23M8n3M3Q3J51k61n4R4O5j48N3
2715A64Q4j46K23j87q4J03j04J22R9o9j00K00j93K48l26O6J74j82LJ1j2J50K7j83J70j72P3
2582A59n3M6o7J31n1n6R1j37J73j68qJ45k4j06J30j22k7M2L0o3K12k58O9R1o5O1j63K44j59
2439I7o4J46j48N7m4J90j10P8k8l2J52j83o3L4K12PPj38j56K16j7j02R4kr6j6M8K08j91l8
$$ plain form
3428 117 285 338 33 161 271 45 115 257 295 256 222 261 246 151 266 134 306 164 67 197 192 281 147 250 211 288 166 215
3291 215 140 254 325 182 131 145 113 67 158 269 134 190 93 153 156 117 328 122 195 324 132 108 203 91 129 302 11 114 186
3148 186 123 154 131 257 145 215 368 150 30 71 201 130 87 201 157 122 283 139 139 386 343 269 130 162 173 191 229 99 364
3005 364 242 113 110 173 201 266 187 69 48 153 38 226 172 135 241 111 180 77 254 151 119 121 300 159 156 216 48 234 73
2862 73 293 112 221 32 278 230 127 203 270 137 153 164 230 187 113 48 272 266 143 191 138 181 264 415 154 100 194 259 111 164
2715 164 248 102 325 138 54 157 53 175 274 205 105 305 112 360 34 100 274 92 95 106 94 244 271 88 258 86 159
2582 159 106 152 85 216 165 109 200 63 236 68 60 205 181 75 205 83 56 98 128 65 277 19 88 179 114 175 12 256 97
2439 97 33 179 31 88 44 234 124 202 174 142 294 111 48 82 294 301 308 170 14 230 213 111 205 203 107 91 139 347 156 118
2291A18K4N9r2k8K7N4J12k18M1J74j37J12p6j00J3J44j35M2j9n3Q4o1J97n0j02J49j91J16
2154B04j73J47J13k34P5O3l6J26j41j41J92j36J62k6K9j21J26j18J19r3q4O8J06j86j7Q3o0
2021D7J72Jl8r2J77j69J26j07j1K03j73P0N8o7n6J16m6r1k7R7J22j87K88k72m0n1J99q5O9
1878B33P7j54j30K20n2j10J43j5n8q6J85l7r8J19n5K0J2j52J82j84J98j43r0J07K0J78j71
1745A59m1J0m0qQ4k9K33k57M5O7o8P7L5o6K8N9j4j77L22l66Q0pM9j12L81On1J69k9J6Q7N3
1588F95j24K9R0r3l0P0M28L7M01K71N44L31J095P11J262J524K977N102J0341K2937P9347L90794
1479E18739o1026l13070r1186k5011j2654n913j062q52l753K787l583j870K20O4l35k11k10
1396A074k99M1m19p8L34j61j76K84N6k72J88j47m0J33m39J19N2j52J26k3l4M7J25m9K9j83
$$ plain form
2291 118 142 201 109 81 108 162 274 56 97 271 134 246 170 70 83 227 92 134 115 62 146 85 282 232 130 279 88 204
2154 204 31 178 291 57 132 195 159 285 144 3 195 59 221 195 224 103 229 111 230 137 53 121 227 41 24 107 47
2021 47 219 220 182 90 267 98 224 117 106 309 136 206 264 197 141 257 211 120 93 190 312 125 413 141 101 50 249 164 233
1878 233 310 156 26 246 194 84 227 212 154 68 253 216 118 237 182 202 214 62 244 60 258 115 25 132 152 330 159
1745 159 118 128 88 80 164 135 368 111 156 223 155 232 267 201 229 288 274 97 419 53 133 126 175 63 444 450 399 568 539 555 642 695
1588 695 571 600 690 597 567 637 1065 1102 1503 1774 2318 2649 3744 4455 5717 7241 10218 15320 25661 48598 127945 518739
1479 518739 457713 144643 53457 28446 15792 9879 8817 7965 4212 6999 3416 1546 1766 1830 1495 1284 1074
1396 1074 775 816 397 319 653 492 316 600 656 384 572 425 385 518 79 198 250 98 224 201 167 214 339 290 319 136
1268A36K43j54l1p1n2J19j58L7lJ88Q3m0k45K35k34K60o6j7m9mj05MM2K4J4J28j01l3J19j16
1120A53j05K12j05l8J69j88J07j07J26k20L53k83K32j65q5K19Nk35J0L09k62PJ6Jj01J12P2
987B09L3o9QM5J6j87N5o7K53k79M7K14p1j80K37m3n2R8j6j35P4j32K09j26m0L9J59nl7k6J62
834C93N73p5o98J3j91K52k03J55o7R4j14J37q5P4j14K9m2K26q9j94l5J62L6p7m1R1j06N7n7
692A04J38nJj49J02k7K9K66k20n3Q3j00L1j42J31O1r2R2j11Q1k2j2l8lR3q0J6k7J69l9r0O4
534B51q7J50j54L8q0J97k15J53r9J26j81Q0J18K781J454l316L154L84m629K44j13r6QJ06j94
411H0K69k49Q9L4n1K24l41L66k26m5M4j3Q7j7j00l3K77k17R6r1K32j25j11j12K47rj23rj44
268B9K72j22Ok7J39j05R2P7k49L15l11K16p2R5k58P3J16j08q7L04j24J2J45j91J43k60K38
$$ plain form
1268 136 379 225 194 123 71 190 32 69 66 254 337 297 52 287 53 313 247 230 181 177 72 76 118 142 156 284 183 150 269 153
1120 153 48 260 155 117 286 98 205 98 224 4 357 74 306 141 56 275 280 45 55 364 102 109 125 126 25 137 209
987 209 242 173 181 226 242 55 110 43 296 17 64 278 207 27 264 221 169 267 251 116 190 58 267 141 101 140 299 294 257 231 393
834 393 966 891 193 206 15 267 64 219 152 246 132 269 184 258 144 173 131 357 268 74 39 201 237 160 119 210 104 161 104
692 104 242 237 238 89 191 164 193 459 239 186 269 169 200 58 189 250 158 250 139 220 198 186 148 145 238 158 174 147 316 277 187 251
534 251 164 314 160 198 118 315 100 253 154 280 99 179 297 3078 4532 1216 4370 4754 125 369 256 160 168 274 80
411 80 349 100 189 223 172 396 55 421 195 150 194 181 268 251 151 118 395 178 274 183 415 290 179 67 314 305 182 173 29
268 29 301 179 185 158 297 192 284 361 112 427 116 332 260 355 97 170 286 178 91 395 271 283 428 237 380 120 358
135C58k00K78m00J97J72j29j71K89k17P8J08r7j84L69j82j03m8K11j26J72j88L1K81l04J66
12C61j52K92k86J69k89K19N0j31k9J76j14n7K48k61J56j31N1K87l72n1K76jl25L91k79K06
-116D04r9J7j53J36K72l18J95l25K70j36K00l05J89qJ80r6r3R9k35K22O4k87M26l34pK31l08
-248B01K86j53J82k26J81q4m9K26j68o6M3P3M8P2l2l29K19K01j49o4JJ5J87Oj64J08L5o6m0
-391D94Q8O7%j53J54k6l2J89n9j32K00n8K47m88M39j08j8R0r3p0K29j56J51k18J21
$$ plain form
135 358 158 436 36 233 405 276 105 394 177 255 363 266 82 451 269 166 118 329 203 375 187 218 499 195 361
12 361 209 501 215 384 95 314 364 233 204 380 266 209 457 196 352 221 272 559 187 136 412 411 86 477 198 404
-116 404 305 322 169 305 577 259 454 129 399 263 463 158 347 339 519 423 330 429 194 416 480 193 619 285 278 509 201
-248 201 487 334 516 290 471 387 338 564 396 330 373 446 494 566 534 205 424 625 476 412 413 428 615 621 457 565 600 534 494
-391 494 582 649 649 496 650 624 592 781 722 590 790 732 979 491 930 822 804 894 801 731 960 804 955 737 858
-514H58
##PAGE=	F1=-1582.36
##FIRST=	4521.1594499999982872,	4521.1594499999982872,	0
##DATA TABLE=	(F2++(Y..Y)), PROFILE
4521I50j29J05k10J00P1p4p8M9o1P8r6mmJ30k56Q3K1L6P3l70K13n8M7r9Q2j64J68J0l42L66
4373F37j21n7o2J48o7p6k1J21q0j7Q5nk11K08j40N7l8j70L99j36n7k8r9J2J44j04J40j12j00
4231B50R3J18k23K3J97j17On5L4Q4m2n1N6k98L09r2J59l65L76j52q3Q2qr6J59k4j83K81k25
4088B13L4n3J89k14M9P4o0R0j55K71k49J33j25J18mq6R9j25K1kO6J06j00j87K71k54K48j14
3950B54L4J07k58J10j10J45j93J84mj32J33m4J53j75J66k52J21j82L93l41j5P5J61j51K07
3827C86j30k30K92Pk29K15l3k15K22n6j75J95l6p7J45O2k4j92P6K2P5Pj64k9J93k75K45j45
3689A32K17j52j74Q9J36O3j08n6O3k8O0k05K94k21J1J76J00l08J7J55j29J68nj71Q5j7j2m3
3551A37j1J9j24L37k39P2P8j48J37O8k01J05j37J46J28L5j06j36M4j57K60j19J67j26j39J75
$$ plain form
4521 950 821 926 716 816 887 813 735 784 723 801 705 701 697 827 571 654 675 711 784 414 627 569 616 517 599 435 603 613 271 637
4373 637 516 459 397 545 478 402 381 502 422 405 490 485 274 482 342 399 361 191 590 454 397 369 270 282 426 322 462 350 250
4231 250 343 461 238 261 458 341 347 292 326 410 368 317 373 75 384 292 451 86 462 310 227 309 301 205 364 340 157 438 213
4088 213 247 194 383 169 218 292 232 322 167 438 189 322 197 315 311 225 324 199 220 218 284 390 290 103 374 120 368 254
3950 254 288 395 137 247 137 282 89 273 269 137 270 226 379 204 370 118 239 57 450 109 94 169 330 179 386
3827 386 256 26 318 325 96 311 278 63 285 229 54 249 213 136 281 343 319 127 203 225 300 307 143 114 307 32 277 132
3689 132 349 197 23 112 248 311 203 147 210 182 242 37 331 110 121 297 397 89 106 261 132 300 295 124 209 192 180 137
3551 137 126 145 21 358 119 191 269 121 258 326 125 230 93 239 367 402 296 160 204 47 307 188 355 229 90 265
3424B65K7k77J81O0k43P1K12L2j04M3l6J6r4M5q0J87j65m3R7l5R3j42J27o8O7q8J16j33J28
3281B59M9j06r5J4o9M2L0J78k42J34q9K4K5m2J99j87Q1O8j52m3J05j28O0J36j96K1J05n2J8
3138A47m7J38r0O0J42k24q1RJ24n6j7J10p8m1J72j67K8J96j9k6p8q3O8K9k8p2K26r7j10m1
2990I4L3J08K9j06j05LP7r3J80o3j4R0q8N5j08J19m4o2mJ85j31NM8j04J20j52K07j90J36j85
2843D0K45n1j06J24Lq8K4o5P3mr5q4K23Op9Pj4k1J24J42k37l8L1J59j94RJ16j18J24j06r7
2690E3R3j16J55O1o3o1J74j66K21l45J31J40k13N5L6p8J44N9j81J36j33K5l2P2p0J26o3n8
2552A02Q3j22J49j21p4K04p6p2Q9o1jJL2j04K17k17O9O1p9J06j58K32j91l8J52j40Q7j06K16
2410B40j12N8k6j2J29j77m2j0K53K2K1j57j65J71m1q3J27Jj29K0M4J98j87j4J5Q2j57k5Q8
$$ plain form
3424 265 292 15 196 256 13 84 296 328 224 267 231 247 153 198 118 305 140 97 194 159 252 110 237 169 236 148 264 131 259
3281 259 308 202 107 121 52 94 124 302 60 194 105 129 154 112 311 124 205 273 121 78 183 55 115 251 55 76 181 129 147
3138 147 100 238 148 208 350 126 45 54 178 122 105 215 137 96 268 101 129 325 306 280 202 119 187 216 188 116 342 245 135 94
2990 94 127 235 264 158 53 56 133 40 220 157 143 233 145 200 92 211 167 105 101 286 155 160 208 104 224 72 279 89 225 40
2843 40 285 234 128 252 255 167 191 126 199 195 100 16 239 245 166 173 159 138 262 404 167 129 160 319 125 134 250 132 256 150 53
2690 53 146 30 185 246 183 122 296 130 351 6 137 277 64 119 155 77 221 280 99 235 102 127 95 167 97 223 160 102
2552 102 185 63 212 91 17 221 145 73 162 101 100 101 133 29 246 29 98 159 80 186 28 260 69 31 183 43 130 24 240
2410 240 128 186 160 148 277 100 58 48 301 323 344 187 22 193 152 69 196 197 68 88 132 330 143 129 144 226 69 44 132
2267A32M7R8k35M3K03j47Q9r6p4k6J95j46O3ln0N9p3J95k1o5L7j22R5j57J57O0j89Q8M9q0
2119A26J36j27r8J11j03J53m3N8j56J73j04J08r1o5O0R3j76j0L3m0J78oo2q1J62j49J36q3
1981A33m6K03j61L3O8m5l3J21o2n5o3J37O3k26K77j61l3n8J52o8L6Q8j48j47K29q7r1J27K7
1839B10n4j02J78k6n0O9q3P9L0j84J21r2J45j46o5R8M5R4j08j7Lo7K7M5pK41l11Q9O5j12J53
1686B68k1o2qJ16p8j37L38l73J25l7O7j23L38K8j08J95J4o3J08O3j17K0P9q6k2J30L05R0K62
1543A311L84M74K55J020O74J239J282K752M492R474K1201P3426L60396n4528k89018q4915
1464D9919k2432j1707n672r50K251q904N030l494l559J199P1l44p7j54n66j9k74j11L77j34
1366D50j72K15R4k23J38q1o1J23m16J47nq4J41r0m4Q8M6L4lj64K00j22l7k8q1R4j23K9j3J68
$$ plain form
2267 132 179 277 42 85 288 141 230 134 60 34 229 83 146 143 93 152 79 274 253 188 225 103 198 41 198 258 69 157 206 126
2119 126 262 135 37 148 45 198 155 213 57 230 126 234 143 78 138 231 55 45 78 38 216 210 148 67 229 80 216 133
1981 133 87 290 129 162 230 185 152 273 211 156 93 230 293 67 344 183 150 92 244 176 212 300 152 5 234 147 56 183 210
1839 210 156 54 232 206 156 225 142 221 251 67 188 96 241 95 30 128 173 267 159 142 145 78 105 150 143 384 73 162 227 115 268
1686 268 247 185 177 293 215 78 416 43 168 131 198 75 413 441 333 528 542 479 587 650 533 553 632 546 524 654 959 1049 1311
1543 1311 1695 2169 2424 3444 4118 5357 6639 9391 13883 23357 44558 117984 478380 423852 134834 49919
1464 49919 27487 15780 10108 9158 11409 2505 7535 4041 482 1681 1752 1408 1331 1177 611 592 318 207 584 450
1366 450 278 493 587 364 502 421 360 483 67 214 209 125 266 176 132 220 266 300 297 133 333 211 174 146 65 159 36 65 52 220
1218B20Q6j3k57K26k18K73o2o3n1K0m7m3N6L2k2J30r4j3J20j71p5J73o0%J03j98J16o1J00
1076B07j88L33k21J97j89r4K04K9k34kK76k55L6J4l8k3M3J07J0k9m3J04m6j21M8o8K32k62
938B7N6J90r9j25K14m6o8J10j8j05N5j19J89j06k2k3J36L6j00J09K42O15j08q43K0j68K24
805B73k00J61j21J02n8M9l1O2j23J9j6K21p5j54o3K20p3n4j8M6l5j6o0J52L3l8j28J13j9L4
657B03K46j79n6M8j09L7j14P4R3r6Q0j06J06j5jp2J1Q8q1m1k6J87%p6M2j01J69p8J1j27K41
505C58j67R9r4J70j73J16N49Q561N903j1822Q251K606j3180o15l27Lj25K49k09K51k74J59
396B89j7q8J98l47L65k00q0O7qJ7N8q6l8K51j97J20j53K86j57j18j19K70m0j81O9j29K43j16
259A59K9l4J27j13J03J10k60L28l12J82n4Rj48J2J26j06o6K71n5J2N2j47R8k05K58j60K18
$$ plain form
1218 220 306 293 36 262 44 317 255 192 141 161 114 71 127 159 137 267 173 160 280 109 34 207 147 147 250 52 168 107 207
1076 207 19 352 131 328 139 45 249 278 44 42 318 63 99 113 75 52 95 202 212 183 140 244 198 77 125 57 289 27
938 27 83 273 174 49 263 217 149 259 241 136 191 72 261 155 133 110 246 282 182 291 533 1148 1040 197 217 49 273
805 273 73 234 113 215 157 206 175 237 114 133 117 338 263 109 46 266 193 139 121 167 132 116 56 208 241 203 75 188 169 203
657 203 449 270 214 262 153 190 76 150 243 147 227 121 227 212 211 139 150 238 157 116 90 277 277 201 243 142 311 233 244 117 358
505 358 191 290 196 366 193 309 858 9419 15322 3500 11751 14357 1177 562 235 238 113 362 153 404 130 289
396 289 272 184 382 35 400 200 120 187 179 196 254 168 130 381 184 304 151 437 280 162 43 313 273 92 161 32 275 159
259 159 188 154 281 168 271 381 121 449 137 319 265 274 126 138 264 158 92 363 308 320 372 225 323 118 376 216 434
126D34l62J11K43j57k02L82l50J69J30k00r4L35k43k3r1K04j03J59j40J7K67k90J41j16K29
3D50k64J93l24K09J11j74n4K19j15j6K24l35K38j72P9K51l25o7K80j8l07L66k54J95j14M8
-125C24k10J66L06l56J60k70K42j20K25l65K21K7R4m9p8R9k36J65J36l08M02l01k8K09k56
-248A99K20r8J55j81J20n5k3K12k16PJ1M5N5R1n1l50K67J80j25r9rP6J59Qj66N9O4n4n8J12
-396E55K9K1j65J52J4p5K05o8j31K04o3K28m55M02n5l4J4k4r6K22j35J58k43J38
$$ plain form
126 434 72 183 426 269 67 449 99 268 398 198 104 439 196 173 82 286 183 342 202 219 486 196 337 221 450
3 450 186 379 55 264 375 201 147 366 251 235 459 124 362 190 269 520 195 128 408 390 83 449 195 390 276 324
-125 324 114 280 586 230 390 120 362 242 467 102 323 350 444 395 317 416 180 345 481 173 575 274 246 455 199
-248 199 419 321 476 295 415 360 337 549 333 340 351 396 451 542 491 141 408 588 463 364 355 431 590 598 432 491 555 501 443 555
-396 555 584 605 440 592 606 531 736 668 537 741 678 906 451 853 798 764 778 754 658 880 745 903 660 798
-514G98
##PAGE=	F1=-1592.2
##FIRST=	4521.1594499999982872,	4521.1594499999982872,	0
##DATA TABLE=	(F2++(Y..Y)), PROFILE
4521H27j09P3j82R8J7l3n3K5n3O2o3l5N5O2k03P7J6M0J03m39L08j63J57j67Q6j74K38r5k30
4378B45L03j16k8q2J47l0o1j56K74j65L0M6L7k32K14j33P8p8j73L54m2j00Nj30N8P7p2J41
4241D11r4j48J55P1j70J2J59p4m5l9M1J09l4j30Q1k42K71o6J34l21K94p6j04P3nj14J76J7
4103C42j88K62k31Pm2K22k63Q0N7J7M1j50K60k78J68j58R3J9p5J22j73R6k6P2M7n6j77K32
3965C20k10J91j05J03N1k26N7o1J53k37K58m0j62J57j07K71k35J60k47Q6j01L29l19L1M3J23
3837B83p4J42j86r2J84Mj75J86j2k39K12j2j85J85j5k0J12j5k2j49R7k2N9mj07l9J71k37K23
3694B53j52J93p7k10Q9J50M4j54J2N3l0L2j43K58k10J1J32J20k77m8J79q2J56l7j38M3N4r6
3556A25Pm0M4j30L15k52J03P7j06J37Mk03J49j57J65J19Or3j06O7j60K24r9J81j46j47J28
$$ plain form
4521 827 718 791 609 707 724 691 638 663 610 672 609 574 629 691 488 565 581 621 724 285 593 430 587 420 506 332 570 475 245
4378 245 548 432 404 322 469 439 378 222 496 331 361 407 444 212 426 293 371 293 120 474 432 332 337 207 265 342 270 411
4241 411 317 169 324 395 225 237 396 322 277 238 279 388 354 224 305 63 334 268 402 81 375 299 195 268 263 149 325 342
4103 342 154 416 185 192 150 372 109 189 246 263 304 154 414 136 304 146 239 258 183 305 132 228 202 274 321 265 88 320
3965 320 110 301 196 299 350 124 181 120 273 36 294 254 92 249 142 413 178 338 91 177 76 405 86 117 160 283
3837 283 209 351 165 73 257 261 86 272 260 21 233 221 36 221 206 186 298 283 261 112 209 187 246 242 135 96 267 30 253
3694 253 101 294 217 7 96 246 290 136 148 201 171 203 60 318 108 119 251 371 94 46 225 143 299 262 124 167 221 125
3556 125 132 92 136 6 321 69 172 249 143 280 284 81 230 73 238 357 363 270 164 231 71 295 196 377 231 84 212
3424B12J0k11K14J5k15L9K53J1j42J13j09N6r7l3j7J87j69J6N9o5Q2j51J58q1M6m1J47j31
3286A56R4K5p6j18J6p2Q4k0K34k71J48j00J5L4m4J75j75R2jq4n9J23j38O8R1p9m7R4m9K9p8
3133F7J45o1M8J14k11m3k3R7k2RQ5q6m2J69j73M0J44j0L4k5j79J11K9p5j5J83r4o9o0j1J84
2981B60oj11m5l5N4p0J60o9QO3m5M0r8N3J3p8j9J73j11J6K7l4L3j00J67j75J44j63K20n3r1
2828A28J58o0m0K1j08N2M5j10j0J23Ql2k8K3q0J62J05j83j3k4K13j96m7J28q4K3j0j16R1p9
2680F0J36Om4l0J49j27J74l04J49R4k03Q7M0j19J12R9j60R4j04oj5R2p9J22n7m6M7q2J17r0
2533A12k9J69j51l4N1mK3j4Pr8J70j61O6K4r2J51j40J97k01J5J15j06Q1j05J85j06M3j3rJ00
2385B46j57k3l7K73L6J9j57j37R5q5l7J56jj69O7M6J54j66K2LR1j96k5J48L2O8k27O0J89j24
$$ plain form
3424 212 222 11 225 240 25 64 317 328 186 299 190 246 149 116 99 286 117 133 192 127 209 58 216 135 181 140 287 156
3286 156 250 275 199 81 97 25 109 89 323 52 200 100 115 149 105 280 105 197 196 112 53 176 38 106 197 118 71 165 116 145 67
3133 67 212 151 199 313 102 59 36 133 111 120 205 119 77 246 73 113 257 247 281 256 77 188 217 142 127 310 216 147 87 76 260
2981 260 254 143 98 63 117 47 207 138 146 209 164 204 106 159 172 94 75 248 137 153 180 146 179 79 246 71 215 52 272 219 128
2828 128 286 226 186 207 99 151 196 86 76 199 207 175 147 170 90 252 357 174 161 137 350 154 107 235 151 174 164 48 139 60
2680 60 196 202 158 128 277 150 324 20 169 263 60 147 187 68 180 279 119 213 109 103 88 180 101 223 166 120 167 85 202 112
2533 112 83 252 101 67 118 114 137 123 130 32 202 41 107 131 39 190 50 247 46 61 176 70 151 46 231 125 168 155 146 246
2385 246 89 66 29 302 338 357 200 63 158 73 36 192 191 22 89 135 289 123 145 148 239 43 18 166 198 266 39 99 288 164
2237A64M2j07m5m5K11j51Q9Pj7Qr4J96J5l3q4n8P3j11J50Nj40R9L6j19J35j13l0NPP2o0Q8
2080A95j66J85p7P7p7k4J8R9j58qj1mJ52kj01n2J31j10J44p6m1J54j30mR3l5j0J04o9j5q4
1927I8J65Lk60K43l7k6l7P6n3PQ4j29r9J75j14o2R5P6n5r6J50%j8J4j04J31N0j98L7J4Q2j42
1770G0m7R6N3K1m6Kj5o9O3LL8K15l54J24N9j46K24p4m4p3J77j29q4L20l36J43m8O7j13K56
1622C53N1j74K36M0j47J43O3j27L4P2q8rJ98J32J41J01M73L58J79Q68N88J049J065K301L629
1499A1529P878J7896O2056L03198m4434k43274p2201j7998r519m822n32P837j2365R008r439
1425D818j463j328k86m48R6j20q09j84J21k31L27r4j76J28J26j54Q0j2p5J15l69J58n2j0J36
1302B94j47o0J24k3J12o0j04J33r0k4Oj04Q3o2J9m8J27P6J5k22J72j77K68o3r7o0N2K7q6O8
$$ plain form
2237 164 206 99 54 9 220 69 158 165 148 156 62 258 273 240 156 98 171 60 210 215 75 174 210 91 226 113 83 88 95 167 107 195
2080 195 29 214 137 214 137 113 131 230 72 64 53 49 201 199 98 46 177 67 211 135 94 248 118 114 207 172 162 266 197 182 98
1927 98 263 266 6 249 212 186 149 225 172 179 263 134 35 210 96 34 129 205 150 54 204 204 186 200 96 227 277 79 116 130 212 70
1770 70 23 119 172 193 147 149 134 65 128 131 169 384 30 154 213 67 291 217 173 100 277 148 64 384 48 191 143 210 97 353
1622 353 404 230 466 506 359 502 565 438 472 544 456 447 645 777 918 1019 1492 1850 2029 2897 3485 4534 5599 7900 11529
1499 11529 19407 37303 99359 402557 358123 114849 42648 24650 15131 10309 9777 17614 5249 14257 4818
1425 4818 3355 2027 1741 1293 1389 1269 460 276 397 166 493 399 223 351 477 323 403 391 316 431 62 220 168 158 294
1302 294 147 87 211 188 300 240 136 269 179 155 161 57 140 78 97 49 176 252 267 45 217 40 308 245 148 88 140 167 81 149
1154A49K8p5J30p9QJ21k05%P6pK8L4j70Q2oO0j21K79j37J41k07r4J77N0k05k1K20k15M6J0
1007I7r1J11o1J28k4K1p6J42p9q2O2p7K07k52Q5J36j23l1J52m1r6J38j8q6L7r4J60p5j1r1
859F8J18P8j70K29L59N71j09r21%j52K05k00J70j54Q5Pm0lN7j04j2J1K13n1j21q7K90k01k8
716A08RoK4q0J0R4P7o2j12J25k2M6J96j20o6K7j16K5n4L7N4n7P6r1J00J5j2q4L5O3p2j14l1
554B2K10K7m9R2k14K36K7l8j83L01j30O0r2K30o3K81J082J6753J2568k4197J5247O690k5946
441B914k068n01J4q5J97k05K21l35K88j11j12J60l11K96j49r6L4K8p5J30l9m4K14j72J32k03
313A22L08j52j66p6K62q4j85J06j11K09n7K4o2J37j43J16J31k29K91k65J07l4p6k3m2J15q4
180A39l9K20QK0m2q1J4j18K37q9J30k91L5K75j68j82M21m70K35J51k81jK69k78M5j03J70q4
$$ plain form
1154 149 177 102 232 153 161 282 77 77 153 146 174 208 38 120 114 174 53 332 195 336 129 35 212 262 57 36 256 41 87 97
1007 97 6 117 56 184 160 181 105 247 168 86 148 71 278 26 111 247 124 93 245 204 108 246 228 142 179 85 245 170 159 68
859 68 186 264 94 323 682 1253 1144 223 223 71 276 76 246 92 177 184 144 141 198 94 82 93 306 255 134 47 337 136 108
716 108 117 111 135 55 65 159 236 174 62 187 165 211 407 287 221 248 132 157 103 140 194 137 213 122 222 237 225 141 176 239 167 53 22
554 22 232 259 210 302 88 324 351 313 130 431 301 361 269 499 436 717 1799 18552 31120 6923 22170 28860 2914
441 2914 846 345 359 274 471 266 487 152 440 329 217 377 66 362 213 117 151 179 104 234 195 151 365 193 325 122
313 122 430 278 112 36 298 214 29 135 24 233 176 200 138 275 132 248 379 150 441 176 283 249 173 150 108 223 139
180 139 100 320 328 348 306 225 239 121 358 269 399 108 143 418 250 68 489 19 254 405 124 123 392 114 159 56 226 142
42A42J51r5QK40k51J00q2J53k24K11k98J41J66k15o1K39o9RJ68l74K93k00J00J94k61l0K13
-91C68k6k46K92k01J67j14O2k37J83L02l57J19k06J99r0K20l93K32O6LRo7R8k22R1K07l16
-224A43L36k34n6J93j97J32l7J25j17N9l6J1J70k30O0k9M0L2J25q4l14K63J67j04j25j8J29
-357D04J27J2j66QQ5l5q2J49j6L4j61J31N6j16K22p7j24J92o7K00l92L47pn5o3N0j23K05r0
-499F48J44k57J56
$$ plain form
42 142 293 198 206 446 195 295 213 366 142 353 55 196 362 147 86 325 256 265 433 59 352 152 252 446 185 155 368
-91 368 342 96 388 187 354 240 302 65 248 550 193 312 106 305 215 435 42 274 340 343 352 285 383 161 252 459 143
-224 143 479 245 189 382 185 317 280 405 288 347 311 322 492 262 322 293 333 365 490 406 92 355 522 418 293 275 404
-357 404 531 543 377 385 470 435 353 502 486 520 359 490 546 430 652 575 451 643 576 776 384 731 724 669 606 656 533 738 648
-499 648 792 535 691
-514F91
##PAGE=	F1=-1602.04
##FIRST=	4521.1594499999982872,	4521.1594499999982872,	0
##DATA TABLE=	(F2++(Y..Y)), PROFILE
4521F68q1L3j39Q7m3Qj4nm3K3Oo7R1Jj46Q2kN4J10m59L75k61K49k16O4j49K80j92q9K12j02
4369C35j0p9J24J5n3k66M02k50R1mP2k38K12j06Q6j15j50K77L8j14K0j52R9K5n3J46r7j46
4231A09J71L9j00k3J31m5p3k1L5J19k7j87R4j55K02m0J06k59J94%j11N4Rj30J81M4j27J92
4093C82k31k0J5K05k75P8L3J08j1j38K29k82J77j61M0L6n7J40k07J65m1O1Kl5j44J95j66J06
3955B04n4J31Rj83jPJ32k32K83o7j23J40j68L47k66J39j97NJ9K11k74R2PP6j3Q9j88J5N5j5
3807A80j18J53J8j94J14N4j59J40KL8Q3r2k9j02J28r1N1j3m2n2J35j69J76j45J60J9k31Q6
3670A00J37Mj62M8O4l2j3n4K09k05M4N8J35k42p1J73n6J33o2r4L8Q4j63M8n4O2j07K69k42
3527D9J02O4n1J24n5j47J33j61J72R0k8o1n8O8j50J70p1J98j60j33M4Nj24K24j0j66%K49k0
$$ plain form
4521 668 587 620 481 568 525 533 519 514 471 494 500 433 524 525 379 461 459 513 623 164 539 278 527 311 375 226 506 314 225 437 335
4369 335 325 246 370 385 332 66 468 218 309 305 377 139 351 245 331 216 66 343 381 267 287 135 234 259 206 352 255 109
4231 109 280 319 219 196 327 282 209 188 223 342 315 128 222 67 269 229 335 76 270 270 159 213 222 92 273 317 190 382
4093 382 151 131 146 351 76 154 187 295 284 146 375 93 270 109 149 185 128 268 61 226 185 246 248 213 69 264 98 204
3955 204 150 281 290 107 106 113 245 13 296 229 106 246 78 425 159 298 101 106 125 336 62 154 161 237 224 313 125 140 195 180
3807 180 62 215 233 39 153 207 48 188 190 228 311 219 190 88 216 125 176 163 121 69 204 35 211 66 226 245 14 100
3670 100 237 241 79 127 191 159 146 92 301 96 140 198 333 91 20 193 137 270 208 114 152 236 73 121 67 129 22 291 49
3527 49 151 215 164 288 233 86 219 58 230 320 292 231 173 241 91 261 190 388 228 95 139 144 20 244 234 68 68 317 297
3384B97j44J60j59Q9j00r1L2J73j56O5K6r0N8j40J81o7LLJ40r0L9Kn6j17J7j5M6m5K65j98
3236A28Q2j30L4K8k8J24j74J07o2on4J36j30O3L3J8p5M8n5O2j03J40l2L7O8j73j9m3O0K0K9
3084A33M5p1j9J30j51K5J02k3J05J0k28J19J8r9L8J42j12j3o8n5K42l2r6J9r9M7m5J29p5K6
2936A44L6j3J9p1lN3p3m4J46q7L1%K8o0oJ01j39J33j45J91n4o1J74j13JJ1j14J2R6j16N3K9
2779A59jJ5n4N4j14J73M7j11J4n4K22j79p8J14m0p8Q4j27R1m2J11n3j4j5J25q6J20k46J51
2636A88M5j43O9M1j36P0J31j20N0q8nk0J07r3J19l2l1lo0J14q1K3J44k26oK1M9M1j5l4m6P7
2478A50j00O6j4q7J73j15J46j92O6O7o7N5q5J47r0K6J3j4P4j39oj8K41M8Nj41j03M1j35O4
2331G6J17qj63P3N6P9j30O0j3R9j67k1J48J1K8j91P0J41p3k3r8j4l9J72j36J11QL6n1j17J89
$$ plain form
3384 297 153 313 154 243 143 52 84 257 101 166 192 102 160 20 201 134 137 140 280 190 229 231 175 58 75 60 106 61 326 128
3236 128 210 80 114 142 114 238 64 171 109 103 49 185 55 118 151 169 94 142 87 149 46 186 154 191 259 86 67 24 84 104 133
3084 133 178 107 88 218 67 92 194 171 276 286 58 177 195 96 134 276 164 151 83 28 270 238 142 161 62 109 64 193 118 144
2936 144 180 167 186 115 112 165 92 48 194 107 138 138 166 106 100 201 62 195 50 241 187 126 300 187 188 199 85 97 193 77 130 159
2779 159 158 173 119 173 59 232 279 168 182 128 350 171 93 207 167 89 173 46 137 95 206 153 139 124 249 163 283 37 188
2636 188 233 90 159 200 64 134 265 145 195 107 102 82 189 96 215 183 152 149 89 203 122 145 289 63 57 78 127 168 153 119 73 150
2478 150 50 116 102 15 188 73 219 27 93 160 93 148 63 210 120 146 159 145 219 80 74 56 297 345 350 209 106 147 12 76
2331 76 193 185 22 95 151 230 100 160 147 246 79 58 206 217 245 54 124 265 192 169 71 57 18 190 54 165 173 209 158 41 230
2178B30N6ok00j0O0m5J28m5r3J09L5j16Q6j01M4j04J24k0p1J19j24J27m8M2o2K5l5J18j30
2035I3j8l9L2J10J6j53K0O2o0J48q6pP5q9l9J23l3J8N9o6K6p5J67m7j84R2Q0j8Nqn1oN9j02
1868A04l6J08j27k7P3J01o0p1J07L1ql1j13J66O8j93k6R0J7j30jO7M7l9J8%l3l9R1m7R5J69
1711C71l22Q6N0j66K82j16j7j33K13j65k2K67k70J47m0M9r4J60O2k30K79M9k26J94N0j50O4
1578C72P0r3JK58n8J89o1N28K15J13O68M61P67Q55J713K658N846J3601M7260K29313l2486
1474B72190j83932n5294j2474o374l416R64J5305j5338J4228k0148J211m079r59o52K57j38
1396A351r08k87M76l09J28p6k15N7J30p4K7M9q4J09k74J18q1N5J19j83m7J09o0J57j29j2N4
1263B00o7J2K3j23R2rJ5q3P3N0M5j47P8j08K34o3j16p4Q5J03j03O4Oj31J34o5K8J36k28P1
$$ plain form
2178 230 286 280 80 70 130 85 213 168 75 184 219 103 189 88 132 28 152 132 61 180 56 183 135 177 115 140 105 223 93
2035 93 75 36 68 178 194 41 61 123 63 211 125 118 193 104 65 188 155 173 232 166 192 117 284 237 53 145 225 207 212 204 153 147 206 104
1868 104 68 176 49 22 95 196 136 65 172 203 195 164 51 217 285 92 66 156 173 43 42 109 156 117 135 135 102 63 154 107 202 371
1711 371 49 135 185 19 301 185 168 35 248 83 61 328 58 205 165 214 120 280 342 112 391 440 214 408 458 308 372
1578 372 442 349 350 608 550 739 678 1206 1421 1534 2202 2663 3430 4285 5998 8656 14502 28103 75363 304676 272190
1474 272190 88258 32964 20490 14116 10700 11664 26969 11631 25859 5711 6922 2843 1884 1232 1489 1351
1396 1351 443 156 632 323 451 375 160 217 347 273 300 349 265 374 100 218 137 192 311 128 81 190 130 287 158 146 200
1263 200 133 145 168 45 137 128 143 60 133 183 228 81 159 51 285 222 106 32 117 220 117 181 187 56 190 125 153 289 61 132
1115A32j8L5M9l0n9m1N4J2m2K10n2P9j96j14J53O7j56l4J40q4l0JkR8j19J00n1O8q8J56q3
962A55p5R5r6J90k51J14P1j18N0P7l3j27J80j3q8K7o3J31n3Pj59J23R9j75K53M53M63p1r15
820B51k8j43J97k07J87j56O3L6j01nN5o0n2K5K04j9j07r0L57l26NK2n0N7p2O8lJ14n3j11J35
667A93l4N7J26n2q0K7j20mJ9M5o6K4Q1o0O0O2m9o7P3J2m0j96J05J22lj6J94l40K85J34r6k42
510A54L83j14M3p2K92P3N15J726K6855K1078l9618K3667J2243m2039l970o18q6MQ4j95J96
406F01m36M67k41j17J52l19K31r7p4p9J07j41J67Km7J79j42J26k27K85j14k30K0K00j25l1
278A17rr2J72K9Rj13J71j92J27J44j65K09j82Pj7j38R2q3Q5n0nJ61N1M0j27%q1l2J79KL0j96
121A43l1K70j54j29M12m50J56J71l01N4J77k86J04q8J16p6J50n7NJ96j88N2n8P5j64K05k17
$$ plain form
1115 132 114 149 198 168 109 68 122 134 92 302 250 329 133 19 172 239 83 49 189 105 75 76 74 172 53 153 102 170 82 238 155
962 155 80 175 79 269 18 132 203 85 135 212 179 52 232 219 131 158 95 226 173 180 21 144 243 68 321 774 1237 1166 251
820 251 223 80 277 70 257 101 164 200 99 94 149 89 37 62 266 247 140 50 407 81 86 108 58 115 43 111 108 222 169 58 193
667 193 159 216 342 290 210 237 117 113 132 177 111 135 216 156 216 278 229 162 235 247 207 11 116 238 235 219 413 73 358 492 396 154
510 154 537 423 466 394 686 759 1274 3000 29855 50933 11315 34982 47225 5186 1216 598 512 516 600 405 601
406 601 165 632 391 274 426 107 338 241 167 88 195 54 221 223 176 355 213 339 112 397 283 53 73 273 148 117
278 117 108 16 188 217 226 113 284 92 219 363 198 407 225 232 215 77 169 86 171 121 116 277 328 368 241 241 160 128 307 309 339 143
121 143 112 382 228 99 511 61 217 388 87 141 318 32 136 48 164 88 238 181 186 382 194 246 188 263 99 304 87
-12H7M0J99k45m6K28K0J0R5l61K99k01J00J28j95L3J10k8j57J93j36J34j02N8k11J66K59l20
-145A57P6j42J54n2J84l45J78J04p6O4o4J03j95OK68l09K33j38q7J86j39L6J7J00m9J1k0M0
-283C01J04j98Q2q3O2j5J69j32j93J82J59q5j38k5J57J06J8j71l1R2pj17J97m8K2j42R7R7
-421D60j50K38q4j09J62p0J65k92K65K9p3j29J16j51J87k9J10k60J68
$$ plain form
-12 87 127 326 81 35 263 283 293 388 27 326 125 225 353 158 191 301 273 116 309 173 307 205 263 52 218 477 157
-145 157 233 91 245 193 377 32 210 314 238 302 238 341 146 152 420 111 344 206 119 305 166 202 219 319 270 281 261 301
-283 301 405 207 289 206 268 253 422 290 97 279 438 353 215 190 347 453 471 300 269 361 354 237 434 386 408 266 363 460
-421 460 310 548 464 355 517 447 612 320 585 614 541 412 528 377 564 535 645 385 553
-514E53
##PAGE=	F1=-1611.89
##FIRST=	4521.1594499999982872,	4521.1594499999982872,	0
##DATA TABLE=	(F2++(Y..Y)), PROFILE
4521E11n7j1q3O7j02M8L9m4l8k8R6r4J01m5r8J05l4P9Q3m04L89l30L03k45K0q0K79k67O5R3
4373C18p9Lo0Q6O4o1k10L67k98J26n2R1k31K15o9P3j36p3J43R8j04K1j38J07j0l3J37j15r2
4231H8J33J9j9o0J05l8p5L0j3J12k1j84O3p2J38k6Q6j89R1O0j11M0L4j15J39N3l2J05k17m8
4083G6R2J59k27J9OJ99o1j11J72k38J43j22m7M5l6J51k09K07n2L7k0m4q0J57j24%M4J05j6
3940B25j30n1P7Q1j68K47p2m7J09j67L07k58J12j41p1J17Q6k17J53j9K7K2N7r3Jm1m7o8J20
3798A51L9j22j1J33j22R3QQ4O6j54m5m7J50j71N0j8J9o4R4q4J06j23J21J17k41Q8J10n5j32
3655D0N0R5l6o9M3J65k03R2k5J39k09k4J29p4J04p6m8P5O6j97O9l1O1q4K20j91N0N4nJ07j07
3502A80m4O2j32J47M7n8j7mN2j27J11n0K16j63j01n9J2m7K28j2j32k7K16n3j14J81j74R7r3
$$ plain form
4521 511 454 443 360 427 325 373 412 368 330 302 398 304 405 360 262 367 333 412 495 91 480 150 453 208 228 148 427 160 225 318
4373 318 239 242 182 268 332 271 61 428 130 256 204 295 64 279 210 283 147 74 217 315 211 232 94 201 191 158 295 180 88
4231 88 221 240 221 161 266 228 153 183 170 282 261 77 140 68 206 180 266 77 168 228 117 157 191 76 215 268 236 341 124 76
4083 76 168 327 100 119 125 324 263 152 324 86 229 107 60 105 69 220 11 218 166 203 183 139 59 216 92 92 136 241 225
3940 225 95 44 121 202 34 281 209 162 271 104 411 153 265 124 53 170 256 39 192 173 200 222 279 186 187 146 99 31 151
3798 151 190 68 57 190 68 161 169 253 319 165 120 73 223 52 102 84 103 39 133 49 155 32 153 270 29 117 227 172 40
3655 40 90 185 149 80 123 288 85 177 152 291 82 58 187 113 217 141 93 168 234 37 106 75 136 52 272 81 131 185 180 287 180
3502 180 136 198 66 213 260 202 185 181 233 106 217 167 383 220 119 60 72 25 253 241 109 82 298 245 131 312 138 235 142
3360A42n0j6J50j32R3Jr4K9n4J34m1m5K1J07k9j6j8m5r2PM2pl3K61j19K8j72P3RPN7j81J15
3197A32j00O0l3J46j31O8k2P8q5Mo8J11j10J16oK7Pj20pl9N1K8M0lm7K1O8j10%O7n6J84J7
3035B88k20Q5Kj00Q7J07j40M2p2o9K59n2o9O7j63N3j8R2p8L8J9lj0k9l6O4n4o6J13o1M6l4
2877H8P4j25R6K4r5J06j38J72o4k2J74j50L7lr7k5J40j17R7m7j1N2n8N7r6J35k3l4M2o0J95
2725C24j57p1P7J6j72J57j21Q4k2R8j01J7j9J04m9P0j88J43Mo6K0M3j34L7J42o7Np8K5m2J13
2572A92j08J16Kj6n3o9J36q4P2J29k66pNQ9N3pq3J4j7m1O3l9k8J33r7R3j69J02K1k7J3n8J18
2410A82o7J0L9j8P0j38J0LJ95N8j7j13o6K4q9N2N9j4j25N0P5k0q5R1l1J15j15l0J45k0j3j37
2252H0O4P5mr5o7Om7J29q9J11NR3j01j41J72R3K0k88LO2L1R7q8n1J23N1p9Jq3R3j28J50r8
$$ plain form
3360 142 92 76 226 94 187 188 94 123 69 203 162 117 138 245 216 200 182 137 45 52 94 87 54 315 196 224 52 125 134 141 198 17 132
3197 132 32 92 59 205 74 142 120 198 113 117 49 160 50 166 160 187 194 74 67 28 79 107 147 144 97 118 186 76 76 143 87 271 288
3035 288 68 153 155 55 142 249 109 151 79 10 269 217 148 215 52 105 87 179 101 139 158 155 145 116 80 144 90 24 137 76 122 88
2877 88 162 37 133 157 62 168 30 202 138 116 290 140 177 174 77 52 192 75 172 125 114 166 108 165 69 204 181 147 189 129 324
2725 324 167 96 173 189 17 174 53 137 115 213 112 129 110 214 165 235 47 190 194 128 148 191 57 94 236 169 174 96 121 79 192
2572 192 84 200 202 186 133 64 200 116 188 317 51 44 49 138 191 184 101 115 98 57 120 81 53 186 89 182 13 115 136 109 122 64 182
2410 182 115 125 164 146 216 78 88 91 286 344 327 214 148 172 83 135 194 180 55 105 180 160 75 166 135 250 135 105 250 230 217 80
2252 80 144 219 215 120 53 59 12 141 52 163 168 261 160 19 191 284 304 16 19 81 112 209 121 70 193 244 165 166 83 176 48 198 100
2090A00p7J49r0O3k6K7o5P5q8J40r4l8n3N9P0M2j68P3k2j2J57j15L6Nn3o7J36l2N2j1n0O3
1932A86l7J41p3j08m6J61rN7q4o5J0Oo4K4L8j19jR5O9o7k8N4N8j9n6j08J77P9j67J2N6m1j13
1770A8O6J3L6q7R1l0m1J1J03j00J52J12k44J1L9j14K63j37J3o5J05j68K4J86j90J51k7K7q3
1627A35P5N9k62L04M4k74K42L0j78R6P7j04RK90k27K34k04N41P1O3M54L10M76O43J092J728
1499E724L725R024L1535J51162k0621j20987l7043o775k735j634L668K3524j9128K0397l3193
1425F643M173o922j720q82L45k12r14p2M44l46m1j00k94O9M6J2mQ2q7J00j54M4q8J02R7j91
1297A30mL4m9J47j91R4k0o4O8K3j36J11L8Mj10K4J8O9o7j7k7J75n6j27m7P9J65j00N1k9j60
1145B6J26o0M1J73k43J20q1M9O9q7N0j53J00k7K3J44K0J8j49j43J20Q2r7m6N3N7j23j4R6O3
$$ plain form
2090 100 23 172 82 145 119 146 81 156 68 208 114 76 23 82 152 194 26 99 77 65 222 107 143 148 95 28 164 132 184 173 123 186
1932 186 149 290 217 109 63 224 215 272 188 123 133 139 75 99 137 18 17 112 181 114 86 140 198 179 123 15 192 271 104 116 172 131 18
1770 18 84 97 133 46 137 107 66 77 180 80 232 344 100 111 150 36 299 162 175 110 215 47 71 257 67 218 191 218 135
1627 135 210 269 7 311 355 81 323 353 175 271 348 244 253 543 316 550 346 887 958 1021 1475 1785 2261 2904 3996 5724
1499 5724 9449 18473 50008 201170 180549 59562 22519 15744 13009 11375 15043 38567 19439 39836 6643
1425 6643 10816 3894 2174 1292 1637 1425 511 439 883 537 496 396 102 171 217 229 225 307 220 320 166 210 122 224 321 130
1297 130 126 160 111 258 67 161 141 77 145 168 32 143 181 185 75 99 117 186 119 102 75 250 194 67 20 99 264 164 215 186 26
1145 26 152 92 133 306 63 183 102 151 220 133 183 30 130 103 126 270 290 308 159 16 136 218 121 75 128 185 62 48 144 207
997B07j23K6m4Q5p5J48p6q8J41j23J86k42J26Mn4P2mk1j16J93lj10K2l0J12n3L3j44Q8R2p6
844A53J33N04L09%q37m4j38J98k23K09j46P7Oj19j4L7j1m4k1J98J7j17o4M08m08M1nk8J2K6
697A09L9o8J25j7j23J36m3N6O2Or3M4j03l5O2P7k24J35Q7k0QJ14j08k2J14n2Mk00J69Q3r7
544B25PL06l66K37K27j50l02M88j28N6m1L45K18P80K433L7849L0638n6545L2654J8705n9855
441G781o134p31k33R3l1j90J81n56O66l92j00J83l83K08p6n2k17K12j00J20jn1J56j04J03
318C52k11K03n2k05L0J24j19P9r5o9J09J09J3j86K26k51J32J54r1J02q4r4lr8J11j11M4j4
180A05L1J07P0P2j94Q2j23j5R8R9o6r4q8K36j09r0L90m01N8J88k34L7O8j86Q4p6O8q4J50k2
32A61PJ33j07Qn0J2q2J58j28l3J92k43jJ62J29mK1k82K39j51N5O1j39R6Nk6o1R7p6J03q0M2
$$ plain form
997 207 84 110 66 151 76 224 148 60 201 78 264 22 148 152 98 170 166 145 29 222 219 109 131 101 213 160 193 49 137 229 153
844 153 286 790 1099 1099 262 218 80 278 55 264 118 195 201 82 68 105 94 50 29 227 244 127 63 471 63 104 99 71 83 109
697 109 148 80 205 188 65 201 158 214 276 282 189 233 130 95 157 234 10 145 232 212 220 334 226 204 318 266 270 70 239 322 225
544 225 232 538 172 409 636 486 184 672 544 600 559 904 1122 1902 4335 42184 72822 16277 48931 67636 7781
441 7781 1647 916 683 776 745 555 736 180 846 454 354 537 154 362 286 234 17 229 129 249 248 197 353 249 352
318 352 141 344 292 87 117 241 122 201 106 37 146 255 268 82 308 57 189 343 252 354 270 176 173 75 186 75 119 105
180 105 136 243 313 385 191 273 150 135 233 332 266 172 84 320 211 121 511 110 168 356 122 159 227 41 125 49 117 33 183 161
32 161 168 301 194 202 152 164 82 240 112 79 271 28 27 189 318 314 335 53 292 141 196 257 118 214 219 193 132 229 153 256 176 218
-125B18j52J27J88k53M7r0J19j4J16k28O4J34j16R5p1J16j60p8L11k83J00k1r6J67q8m7M2
-258A47Q5J4j8J4L8K4j12O2j51J09p5K09j84m2P3J56o7j36k8J54R9L2j88m6Q1K7j64K51n3
-401C11k7j07O1J28j65K43q9p3J09p7J31j51J43N5q6j70J59j78J78L1O6k48J63
$$ plain form
-125 218 66 193 381 128 175 85 204 190 306 78 142 276 160 255 184 300 140 62 373 90 190 169 73 240 152 105 147
-258 147 232 246 228 242 280 304 192 254 103 212 137 346 162 120 193 349 282 146 118 272 371 403 215 169 250 277 113 364 311
-401 311 284 177 238 366 201 444 355 282 391 314 445 294 437 492 406 236 395 217 395 426 492 244 407
-514D07
##PAGE=	F1=-1621.73
##FIRST=	4521.1594499999982872,	4521.1594499999982872,	0
##DATA TABLE=	(F2++(Y..Y)), PROFILE
4521C94n4m8k4M5j53Q4R7q3n2p1J84j13R8q3n8J39q2J17K9k80L44l31K88k56k0QK35k72J70
4378B52m5n0J7l6L8J17q5o7K43k37O3q4Q7j70J85l6M0j34J0J8J23q1J6o9O6l5NR5j37k5P7
4226A61MO4p8P0n1n6J09r5J00k4q3m8j4J00l0P8j24LR7j12M2O4o2M6M3O1K9j82p1J42J23j71
4068A35m3k6K80j03p5J03j58P6n9j16J3oJ47j14J54o3Nj3o8oJ20o2o4R9L6k9o7l0O7J4j04
3916D3K07m9J6R5j50K11k19R1j12n6J17j3j55J95l4j4K7N4J6o4r0q2nO9L5n2m4J35r6O8JJ13
3758B58O0j92o2K5J37k08L2l0O5p1N2MK3p5O8K00k41Q4R3j25p8K7J36m4j23J31J41k07J36
3615B16q9J23j78J0J23j33P8o8k1J27K9j84N7J8M6p6J83j43oO1J4R3j49N3j5q5J07lp8L0M3
3463A83K9q9O4n7K34j55o3j11Kj4K29%j09n2J72q1o3J76j56Q2p3J1q1J19j04J03k0p2J2OJ01
$$ plain form
4521 394 340 292 268 313 160 244 341 258 206 135 319 206 304 221 163 302 220 337 366 86 430 99 387 131 111 119 354 82 252
4378 252 207 157 174 138 176 293 208 141 384 147 210 126 213 43 228 192 232 98 108 126 249 168 184 115 181 146 151 246 109 84 161
4226 161 165 229 151 221 170 114 223 128 228 204 121 73 59 159 129 207 83 86 183 71 113 177 115 161 204 265 294 112 41 183 306 135
4068 135 92 66 346 243 168 271 113 189 130 14 27 21 168 54 208 145 150 137 69 63 183 121 57 156 192 163 96 66 133 147 43
3916 43 250 201 217 312 162 373 154 245 133 77 194 181 26 221 187 173 200 254 270 206 116 34 29 98 133 81 37 172 76 144 145 258
3758 258 318 126 64 89 226 18 50 20 85 14 66 70 93 18 86 286 45 129 222 97 19 46 182 138 15 146 287 80 216
3615 216 127 250 72 82 205 72 150 82 61 188 217 33 90 108 154 78 261 118 112 173 187 280 131 184 169 84 191 188 110 140 183
3463 183 212 123 187 130 364 209 146 35 37 23 252 252 143 91 263 182 119 295 139 221 148 159 78 197 93 196 176 104 116 122 223
3310B23l0p6J4O1L5n9l6l8n1j3Q6n6J4K18n1kk13J14j2M6kj04J8l6L2j8J60j45P9n5J00q8
3153A15k5p5J61j13R2K0J1o2o4Kk2Q8qM5n3l4O5Qp0OK9r8K49Kj89L8j3q6J40P4j47O9q1m3
2985C1K28o8l9R9k21P5KN9p5M1J2j2m7K3l7M1l2o3P1k7M8o6R5n0Q3m6n5P0j32J57q8K4J58
2823B59j68O5j4p4rJ34j15J21r6lO0l0J6n2P6q6K8O6m8J48j34m0L2P8j65J20j00O2j2R5j12
2670A02K3l5Q5j9L0j36J25k1Nm5M9j17K3J27j0l8p0O3o0J09j25J15L1Kr0j08J66q8J12J19
2523C24k52k5j5J13O3Nj32P0r5RN2m5J9R6r3M9j26J05j3J5m4k5R6l6JM6j7R1j48K2RJ50O5
2360C34l8q0k8K4q2M9J1j5j03M6R7j25l9J08m9J47p2l7J47o0m9p8M4JP3j59k2Qm5R6l1P9l
2198A49J47j33j61J42J20M1k42j6j2J00O5j20k0J47P2m6o6o9J13j10J28j54p3J68q3K7k2N7
$$ plain form
3310 223 193 117 131 192 227 168 132 94 43 30 116 60 74 292 241 239 26 140 128 174 172 68 86 50 82 64 224 79 158 103 203 115
3153 115 90 15 176 63 155 175 186 124 60 62 40 128 120 165 112 78 143 151 81 87 116 18 267 269 80 118 105 19 159 233 86 155 74 31
2985 31 259 191 152 251 30 105 107 166 91 132 144 132 85 108 71 112 80 17 88 61 109 43 138 88 171 125 70 140 8 165 77 101 259
2823 259 91 156 142 68 59 193 78 199 103 100 160 130 146 94 170 84 112 178 130 278 144 104 136 214 49 169 69 131 119 214 102
2670 102 125 90 175 156 186 50 175 154 159 114 163 46 69 196 186 148 78 141 81 190 65 180 211 213 123 15 181 93 205 324
2523 324 72 47 32 145 208 213 81 151 56 65 117 72 91 187 94 143 17 122 109 124 80 55 151 115 116 162 145 236 88 110 119 269 334
2360 334 296 216 188 212 130 179 190 175 72 118 215 90 51 159 110 257 185 148 295 235 186 108 152 153 226 67 45 53 8 104 73 152 149
2198 149 296 163 2 144 264 305 63 47 35 135 200 80 60 207 279 233 167 98 211 101 229 75 2 170 87 114 92 149
2060A49j08J20j31J54n4o1n4P5L8O7j15N7r0K3J74j56P3j8m1p1R6j8Q5j00qQ0J6R7o6n4q7
1907G2J38MJ04j37r4N7n5j5N3k4q9kJ31J8p0K5mP3m7n7n8J27Q5j17P7j5q9q6J25m3K7j01J40
1745A53q2qK8J06j41J95N8j68n5L1m3K15j37L9Lpj10QR3j01J57j7Qq9K5N0j35J62K6j65J60
1592B59J9j66P1R8j22J1K85l39K64k98N03m6K6K60J56K44M29N34R66J852M842J7323Q0919
1479A08090j0604o4269k0290j766Q55K42O929L1561k3199K6407m6457P073r603k435j066L38
1400A806l01r70R3M37l31j57j31l84J57j12R2J1O3r0R4m1l9p3J26P8j79J9l9rR7j93J51p6
1263I9o4J23Mj23J12Q0j5j28rKO5Mq5M1J02l8j33K3K5K08q4L4p2j09O3o4M1K22k42J35j18
1110I9N1R1j35J34j90Q5l2M5R3P0l4q4j48O6R6m2o1k3J74k02k7J65K7j05n0J6M8l7J16o8j05
$$ plain form
2060 149 41 161 30 184 130 69 15 90 128 195 80 137 47 70 244 88 161 143 102 31 127 109 194 94 86 166 182 279 213 159 72
1907 72 210 214 318 181 87 144 89 74 127 103 14 12 143 161 91 116 112 185 138 81 23 150 235 118 195 180 91 5 130 87 114 13 153
1745 153 71 63 91 197 56 251 309 141 86 117 74 289 152 191 194 187 77 85 178 77 234 217 225 136 161 211 76 238 264 99 259
1592 259 278 112 183 281 159 170 455 116 380 82 585 539 565 825 981 1225 1654 2188 3154 5006 9848 27171 108090
1479 108090 97486 33217 12927 11161 12016 12258 19187 50748 27549 53956 7499 14572 4969 2534 1468 1806
1400 1806 1505 535 628 1065 734 577 446 62 219 107 199 210 273 183 277 236 197 124 250 328 149 168 129 120 217 24 175 99
1263 99 35 158 162 39 151 231 216 88 79 81 146 150 65 106 208 170 37 60 85 293 209 243 171 62 125 61 102 324 82 217 99
1110 99 150 241 106 240 50 135 103 148 241 311 277 193 45 111 207 165 104 81 255 53 26 191 218 113 63 79 127 90 206 138 33
957C3J90j54J94k23J20m9L1N0p7j0k3J33J0j41K3lJ11q0O5r7M7P2J9j1N03J41R0p10m5j29
810H0K00k46K36j49J26o2j09L1j7J1j1q2J87N3j45j8M42m33N6n7L4n9J01kp2R4K3j28J20l6
662A68L5M4K2r7O2o5l0L6J11j77N0Q9K4l7J63j77L9J46j09L7k14K36Q2j90%M00l59J78K95
519G62j88l60O06j70R4oL82L60J037L119M8380M0106p2894M1088K5273p7203q289q59l82J66
421A022j30j96J79o68Q51n46o7K28m70K30r3n3j99J84o8J09m2o2J49o3O9j68Q9J4j27j8N1
288B05l4Q5j20o6M4J63M8k73K86l07J33J64k7mJj75J3NN9j21lJ1P4O3O3J15k41J50j02o6Q
135A51J85j42kj33J79l6q2L71l64MJ86j45Lm0l8M2r3N2o8J05J1J9N0k0k2n3j8LP1n4m8J29
-22B03j40j6P0K29k2l7k08J79o3k7Nj02J41p4k1K0K2k6P7n4J8j03J03J07j71M8p0J12ML3j22
$$ plain form
957 33 223 69 263 40 160 111 142 192 115 105 82 215 225 84 107 104 215 135 200 103 150 222 241 230 733 874 964 254 209 80
810 80 280 34 270 121 247 185 76 107 90 101 90 8 195 248 103 85 527 94 150 93 127 68 169 167 95 189 212 84 204 168
662 168 203 247 269 172 234 169 139 175 286 109 159 248 272 235 398 221 260 406 297 334 120 356 438 248 248 648 289 467 762
519 762 574 214 820 650 744 738 1120 1480 2517 5636 54016 94122 21228 62316 87589 10386 2097 1238 856 1022
421 1022 892 696 875 207 1058 512 445 673 203 433 340 287 88 272 204 313 271 209 358 295 364 196 285 299 172 154 205
288 205 171 256 136 70 114 277 325 52 338 31 164 328 301 297 298 123 136 141 200 79 76 87 161 224 287 402 161 311 209 143 151
135 151 336 194 192 59 238 202 120 491 127 131 317 172 175 135 97 139 46 98 30 135 146 165 215 195 173 120 102 105 176 122 74 203
-22 203 63 47 117 346 324 287 79 258 195 168 173 71 212 138 117 137 159 133 210 156 174 71 174 281 110 158 88 200 204 237 115
-175A15l1J46j02R3q8J36j28j32L19k38l9R3m9J04m9p3OP6O2l2P6nn7QJ9k17J63j12K09j96
-322G7M4oJ52n1j20k1J23R9N7k19k4O1M6j86K70l3j03o3L2J49j39K11r5nM0r7J03PkP8j00
-475B85j44J44k06J85P1K7k19J31
$$ plain form
-175 115 84 230 128 221 133 269 141 9 328 90 51 144 95 199 150 77 83 159 221 189 265 260 203 211 230 13 176 64 273 77
-322 77 121 115 267 216 96 75 198 297 354 135 111 172 218 32 302 269 166 103 135 284 145 356 261 256 296 199 302 309 307 385 285
-475 285 141 285 79 264 335 362 143 274
-514B74
##PAGE=	F1=-1631.58
##FIRST=	4521.1594499999982872,	4521.1594499999982872,	0
##DATA TABLE=	(F2++(Y..Y)), PROFILE
4521C42q3n4MM3j74J03J27j01r5k3J79j19R5j21oJ51j39J62k7j83L12k79K28k47N2mJ65j59
4383A49J46j80j6L7j2j7J60j11J1J78j32l9o9M0m5J07j6rj04M8j0Q1n8J1%K6n9N3L7j52J5
4231G0M4j7J45q3L5p7k2J76j75J06m8K0j44J9Q4m9Q4q2k5Q5j27P6Q1j7l4J0J28j9j36o6J34
4078A76J10j32p9n7L38j32l6L3q1J7nq5k9mQ7m1J19p5l2J8k2j3R5J7l5L9l3m7oJ1K7n4l1J49
3911B07pN3J03j53J11j62P8j12J2N9o9p7J93l9n0J4P4R8j35r4r3N9Qj1J7L3L3q3P4k6J29O3
3753C07k11o5R3R7j46pk2K7o7K6O3n7RmK49k33P0R7j99k0MJ66n0q8J18J40k18J67j17Q4j48
3601F5K5J37k02N7%n5J64nj43L4N8M4q4J57j10n2Q4J1Q4j78J23p8m2P1n1p6O1P8Kl3M1r3K36
3438C30j35k4q8l0m0K32J2r6p1J31r5j8J58j30O8m3N0j25Q5p4R8m2l2J9K7P9l6r0J2kR3q5
$$ plain form
4521 342 259 205 209 252 78 181 308 207 112 89 268 149 244 123 117 268 129 291 264 81 393 114 342 95 147 143 308 149
4383 149 295 115 99 136 124 107 267 156 167 345 213 174 105 145 100 207 191 182 78 126 116 197 139 150 150 176 117 170 207 55 70
4231 70 114 97 242 159 194 117 95 271 96 202 154 174 30 49 133 84 168 86 61 146 19 95 176 159 125 135 263 244 108 42 176
4078 176 286 154 75 18 356 224 188 221 140 157 152 67 38 34 121 80 199 124 92 110 88 75 170 187 152 191 158 111 105 116 143 89 58 207
3911 207 200 253 356 203 314 152 230 118 130 189 120 43 236 197 147 161 235 333 198 104 11 70 78 67 84 117 150 67 141 115 244 307
3753 307 96 31 124 221 75 68 46 73 6 32 95 38 47 43 292 59 129 226 27 7 11 177 127 39 157 297 79 246 129 213 65
3601 65 90 227 25 82 82 27 191 186 43 77 135 179 95 252 142 90 174 185 269 91 214 136 94 165 114 38 99 177 179 146 187 94 330
3438 330 195 171 83 53 13 245 257 161 90 221 126 108 266 136 204 161 211 86 171 97 195 153 121 140 167 246 210 120 132 130 223 138
3281A38n6k6ql4J09p8N8J62nok28J30l1P7l8k9r7N5j6k1J78j68R0o1Q8q2l7l1J60j22P9N2
3123B02j5j12l5J6kJ23l4N1j06m0J06m1l8M9rm9K00l1j58%k4l7J66M7j16N1r4l5K13q5j3J14
2966B64k63J01J7L2o7M1Pl0o4N3orjm6L6J0L0o9O3O1M6r6k8L3o6R4j31P4J27j71R6k0n8M4
2798A04R1j11J28j18K8L9On1oL1p3kQ6k6R6j12loJ33j44P1p6K9pJ00q4kn4O8LMr3R9k8N6j12
2621F4N6q4L7Q0L4p2o0R7o4R5j39J15M8K3j12n4P8q3J35J13k00k6n1J14P6J8j71J10j28K6
2474G5L1m1N9P0j05K7q2P8k6O1j16J9P2%NJ8j0J27j54K8kJ13O4m8m7QK6j04N1j9rj01O2J18
2306B48k20LJ06o7J96m6l7J55j07p6k0Ro2J41j80jolQ9j6K9j6J91j43j49P4J34N6j71J0q7
2154C4J15L9j40MJ74Q8k7j05o7J17q7J01j85m1J43r4M0l8J15j50J18j53J54j7q2k5N9K2Q0
$$ plain form
3281 138 82 56 48 14 123 45 103 265 260 254 26 156 125 202 164 135 38 93 77 56 234 66 156 95 183 101 64 33 193 71 150 202
3123 202 187 75 40 56 54 177 143 194 88 48 154 113 75 124 115 66 266 235 77 77 53 16 182 229 113 164 70 35 248 163 150 264
2966 264 1 102 119 151 84 125 132 102 38 91 85 76 75 29 65 75 105 36 99 160 206 110 82 115 49 143 12 86 213 42 138 118 60 104
2798 104 195 84 212 94 122 161 167 116 110 141 68 66 152 126 222 110 107 101 234 90 161 85 114 107 207 123 121 67 135 138 142 49 148 120 176 64
2621 64 120 36 73 153 187 115 55 152 88 183 44 159 207 230 118 64 142 59 194 307 107 81 30 144 220 238 67 177 49 75
2474 75 106 65 124 194 89 116 34 112 86 147 31 50 122 122 127 145 135 262 108 136 134 247 311 263 216 224 250 146 197 178 169 68 130 248
2306 248 28 31 137 70 266 220 183 338 231 155 135 144 82 223 43 42 36 33 122 106 135 119 310 167 18 92 226 282 111 121 34
2154 34 149 188 48 52 226 314 287 182 115 232 145 246 61 20 163 69 109 71 186 36 154 1 155 138 56 31 90 112 192
2011A92o6M0j28L7J97j96R8Ln3p8L2J6J07j75P4M0O8M4k6k5q8P2K5J33j66j26J18p1QM5o2
1858H9q1PJ40rp0P3n8P3q9l1LM8Q4m2J26q3j24l7J49r2K8n0J20j36N3OR6j56K20J2j07r7K5
1696I0J2J72j16N5M1q7m6k1Jj2J65j5qj12J8O5q3O3mKL6K9q5m0J23j46J4K42l08K10j28K18
1538C45r0l6J22MJ20K23J11M58N66J529O763K9794m097k2851p535J917L878J910R981L8407
1440F1519k6746L1190n7830R565j1795l023j168K32l16j105J29M74k51k50j34m48K23k37J58
1346A87N0J2r8R2N4j15m4J28O4j61J3q0K7M7q9R6j10j0J17k5q5Q7J17m2j38k5K6K2N3j09P6
1194A37K7mj40P0j5K28o4J8j09m3Lp1L0K57k14J21j46O2J12j70J80j88N6oK2O1R7p3j9j40
1046G9K1J08Jp9p6K48k39j0J55mp9o4M5mK0O0n6j00K13j86K07k02J13p0Q0J5j12j5O0Q3K2
$$ plain form
2011 192 126 166 38 75 272 76 174 177 124 46 78 94 201 26 100 140 208 252 226 201 113 185 210 343 177 51 169 98 106 151 89
1858 89 8 15 155 146 76 149 91 164 75 44 47 95 179 137 263 180 56 19 168 76 104 54 174 38 91 97 193 37 257 269 162 65 90
1696 90 102 274 158 213 254 167 121 100 101 89 254 239 231 119 137 202 119 182 178 180 216 245 160 120 243 97 111 353 45 255 127 345
1538 345 255 219 341 345 465 688 799 1257 1823 3352 10115 39909 35812 12961 5426 7343 11221 13131 23112 61519
1440 61519 34773 65963 8133 17698 5903 2880 1712 1944 1628 523 652 1126 875 625 491 43 266 29 187
1346 187 237 249 151 243 297 182 138 266 330 169 182 102 129 176 87 183 73 63 180 155 70 157 274 232 94 69 95 117 170 61 137
1194 137 164 160 20 90 75 303 239 257 148 105 108 37 67 324 110 231 85 147 259 89 269 81 137 131 153 214 311 238 219 79
1046 79 100 208 209 130 54 302 63 53 208 204 125 61 106 102 122 182 126 26 239 53 260 58 171 101 181 196 84 69 129 212 234
894B34j58J5J8J21j21R0n1J0O3Q6j40M56j0J81n63l0j08J88k57K51j70J85j33r6J08o4%J6
756A21q6J36Q7j65J1M65m40P0j07Q4q2J13m0m1M9N2j11P9lj1R6k1q8O1j6ok5J34j06l6P8P2
598C24p2K06k41R8J65j43M0k21K95Q9k45l6M67l38J30L36k03m09P14k29J49K1M01M85J246
475C029L694N6983M8197q6409M7796L1028r1675j0136r97m95K07j96k20J88p47R89o79k6K63
382G94n47K72j27q5j32J38o1J27q6q5J58k5K9j12j8N8n0p2rP4L3r9p3pJ81J12l51L27l40J22
234A46J72K3r4N7k24M4O1K6j17m1J3J22K9M1J62k69J93p0j22o8K38j80N7j31P5N9j07L60l42
91A13J8J50p6j9j22P0K4j18O3l7L4M0L8l4N1l1n3qL9lk5k8M6k0n7J1K94l9p0j54J30L4j20
-71A41l2q4J58j02j0N8k1J4N0k7po9R4L1r4Q1q6J27Mm3m7q8J35o6Q7j03J51j09r2K43j87M
$$ plain form
894 234 76 91 109 230 109 199 148 158 221 307 167 623 613 794 231 201 93 281 24 275 105 290 157 61 169 105 105 121
756 121 35 171 258 93 104 569 129 199 92 176 94 207 167 126 175 227 116 195 192 181 277 256 168 229 213 207 182 316 210 174 252 324
598 324 252 458 217 315 480 337 377 156 451 540 295 259 726 388 518 854 651 242 956 727 876 897 1298 1783 3029
475 3029 6723 63706 111903 25494 73290 104318 12643 2507 1510 1015 1222 1026 806 994 247 1236 557 531 794
382 794 247 519 392 307 175 313 252 379 293 208 366 341 370 258 240 298 248 176 167 241 274 175 102 95 276 388 37 364 24 146
234 146 318 341 247 304 80 124 185 211 94 53 66 188 217 258 420 151 344 274 152 84 322 142 199 68 143 202 95 455 113
91 113 131 281 205 186 64 134 158 40 103 66 100 140 178 144 195 164 111 103 142 139 114 86 132 112 55 66 360 321 251 97 227 261 141
-71 141 109 25 183 81 71 129 108 122 172 145 138 69 163 194 100 181 95 222 226 183 136 48 183 117 204 101 252 143 51 294 107 111
-229A11K4%N1k8m9n2M9R5l9J42o1j27J15j5j23P2o2J06o9n2j8J33m3q7j5J03P6R1k55K9N5
-381A57L0p5J39qj68k6J9J65q2J45j10Q2j4j36R1J29j32J06j18l2N8k00J71Q0Mj59N7
$$ plain form
-229 111 135 135 186 158 109 57 106 201 162 304 243 116 231 216 93 165 103 209 140 88 70 203 160 73 58 161 237 328 73 102 157
-381 157 187 112 251 243 75 49 68 233 151 296 186 268 254 118 209 338 206 312 194 162 220 20 191 271 275 116 173
-514A73
##PAGE=	F1=-1641.42
##FIRST=	4521.1594499999982872,	4521.1594499999982872,	0
##DATA TABLE=	(F2++(Y..Y)), PROFILE
4521C47j38pl1P3j51Q6J11q2j54R3R1j05R8j58O3J14j92K00l8j63L10k53K08k27J55m2Q9p3
4383B24J17k95K4N3J9q1J83j20K2J69o0j04j6l0M4O3j1o1n4L9L3J0m8J4L0J7q0Q6j0j52K0
4231D5M1m3K10q9J7j04J6K08k30J38r3Q2j84M4O0o6R9p0J7K8q8O0P8J3p7l8J52l3r4m5R7J09
4073B60j11p9n3L35j43mk6k4j9K5o7j0l1L1JJ05p5p5N7O2p3Q6R2l2ko9q1L8L5pj11O1O2L6
3906A94P3J22j70K6j05O9j25R1k1p4qJ63k9r2nJ07J45j95o6q3R3k2p9Q2Q0m8p9J03p1J41O7
3753B84k24m3J39N1r4kl5rm4L3O4q0L9k4K33k21N3J18k07j9K7J25n0m0Q0J57k36J85j13L4
3606A81j17J9J53j94j3R8r2J36k5r9K4P3O1j10J44r1q6J12lQ3j89J54j19oM4q3j9K7R8k2L8
3453A77K4j15J99j06J0p4m9o2K29J9r4p7J05q7pJ36j08O2mO1j44N1l6Q2p1J2M4K7N7n3r0L9
$$ plain form
4521 347 209 202 171 244 93 179 290 208 54 147 238 133 231 73 136 250 58 258 220 57 367 114 322 95 250 208 297 224
4383 224 341 46 70 123 142 61 244 124 146 315 255 151 135 105 149 212 201 140 86 125 158 168 120 134 164 181 101 187 177 25 45
4231 45 86 43 253 164 181 77 93 301 71 209 116 198 14 58 118 52 151 81 98 126 38 98 176 189 112 74 226 193 99 54 151 260
4073 260 149 70 17 352 209 205 179 155 136 161 94 84 53 84 85 190 115 40 97 159 86 172 264 232 230 161 80 118 153 146 35 96 158 194
3906 194 267 389 219 245 140 209 84 175 154 80 72 235 206 114 109 216 361 166 100 17 110 88 9 91 171 123 44 147 76 217 284
3753 284 60 17 156 207 113 111 76 67 23 56 120 40 79 55 288 67 120 238 31 12 39 164 114 74 154 311 75 260 147 181
3606 181 64 83 236 42 29 127 35 171 146 47 71 144 205 95 239 148 62 174 171 254 65 219 100 94 138 55 36 63 161 139 177
3453 177 201 86 285 179 189 115 66 4 233 252 158 81 186 99 92 228 120 182 178 239 95 146 110 192 121 133 177 204 261 208 118 157
3296A57q5J34q6r2OK3l0R3o6P4J08J9Rk20J21l6Q6n1K9j61Q0k6n1J98j93R6l8N0p0l8J6J52
3138B08j36P8R0n3j02m8J9J2J41l8N9j55o2J40p9j3J12m2j9J54o8j38k1k9L9J51K9q1K7j06
2990F9m1K11j07RJ16k19N3K5K1o0M0jm3J2j6N2n8M5o4K9K8Rm9mJ54J9j28nkmN0q7K6Q2j48
2818A4J21j8o1R6M2j01J20j12N6J1K8j18M0RMr9P9MM8p8J8l2J67j21L5n3j7PJ04m0m1o7N5
2656A00J4on8O8k1Q0j69O2k6N8K3M5q9n1J22m9O8j47J15M8M6j16K7n4n1J22J07j15k3q8R3
2503A35R1L0j91J25j15J2Jm1J04N4j21K6n2L2j1R7j57N2K6M1Qk9nJ67j47K6k3Q7N2l8k2M3
2346B57K2j43M9k7Nj19R1J32k44qQ9q1K51l9k7J65j52r5L1l5n7J40j27k8l7M0J19l4k2l3K17
2193C00j30j28LJ28O5r6N0j16P8K3j50K9J88Q8j7j18p9J20o1Q2k01j8J03j10R5m7J48j59P1
$$ plain form
3296 157 72 206 120 28 34 57 27 120 54 128 236 255 264 44 165 129 215 164 193 32 112 86 35 233 40 136 98 148 78 40 56 208
3138 208 72 150 240 187 85 37 56 68 209 171 230 75 13 153 74 61 173 131 112 266 198 60 39 10 49 200 229 148 175 69
2990 69 28 239 132 141 257 38 91 116 137 77 117 116 73 85 69 121 63 108 44 73 101 110 61 57 211 230 102 97 95 91 141 54 80 162 14
2818 14 135 117 56 152 194 93 213 101 157 168 196 78 118 127 131 32 111 115 163 85 103 71 238 117 152 99 82 89 193 153 112 45 100
2656 100 114 108 50 118 97 177 8 70 44 102 125 170 81 30 152 103 171 24 139 187 233 117 144 90 39 161 268 153 130 42 135
2503 135 226 256 65 190 75 87 88 47 151 205 84 110 58 90 79 176 19 71 97 138 146 117 112 279 132 158 135 222 274 236 214 257
2346 257 279 136 185 158 163 44 135 267 23 15 104 23 274 235 208 373 221 126 157 122 65 205 78 50 13 53 172 138 116 83 300
2193 300 170 42 45 173 238 142 192 76 154 177 27 56 244 332 315 197 118 238 177 259 58 40 143 33 128 81 229 70 141
2050A41j27J10J3r7J9K0K9P1k1K5j35L3K17k26J12L4p1j00k7P5J11j15O9l8R7rM0j2j09K0
1903A49N5J39j76j48J76n3%K6o4q6K0J02Qp1J00r6N8j27L1K5k6P1N2J45j32j46mJ60j24M1
1755A05k1J08j78J01j3O1j36K24k2o6j12K1M9J36q7O4M6j26Lm0p8O5J73k1k6j42M0J11j11
1612A28K2m6J15l6N2k6j16J26j63L2J62j41P5K5j0K7j74J06p3L6J3O6J84P38L92L574K0646
1479B5734l596j6961m260L706N978L113J2248M2998k9006L3909o5471J1375j3202l416j144
1405B005j0j74j196j19N42j15l23j04m73K44k43J59P4l6j13R7J25j73j3J16N5j46j7q3N4K4
1277A57l5N7j22M6J02n4m6N2J48p4j39k5N1j4P5j12R7m0L6j32Q4m7K30m7Nj29J1m5o4RK61
1125B96j57Q1j69R3J27j87J81j65L6L0k2M4J07r8L1j20qJ10L5r3j06K70k25J2R0k2n3jQm0
$$ plain form
2050 141 14 124 137 40 59 79 108 179 158 183 48 81 298 72 184 218 147 47 20 95 206 91 160 122 219 210 250 238 129 149
1903 149 204 343 167 19 195 142 142 168 104 18 38 140 148 77 177 81 139 12 43 68 42 113 165 310 178 32 28 188 64 105
1755 105 84 192 14 115 102 163 27 251 229 163 51 72 121 257 170 234 280 154 157 117 39 104 277 256 230 88 128 239 128
1612 128 150 104 219 183 235 209 93 219 56 88 250 109 184 209 199 226 52 158 85 121 134 200 384 1122 1514 5088 25734
1479 25734 22138 5177 917 4623 10601 13714 25962 68960 39954 73863 8392 19767 6565 3149 2005
1405 2005 1995 1821 625 506 1048 933 610 506 33 277 34 193 267 231 118 215 340 167 154 270 325 179 162 79 133 157
1277 157 122 179 57 103 205 151 105 157 305 231 92 67 118 104 179 67 164 124 160 28 112 65 295 248 253 124 135 90 26 35 296
1125 296 139 220 51 144 271 84 265 100 136 166 144 188 295 197 228 108 100 210 245 152 46 316 91 103 193 171 118 117 125 85
977H5P8j4k3p0J88k09K11j77J07o3Q8k1p9n7J15M7L9j51mL0J31j51R2j3k7O7J27k28L69j09
830C78K39m16nq4J63k32K37k07K34j77j01J96j03j5L0p3Q8J18j53kM75m38Q3j39J11p6Q8o2
692A57oNP1p0J8N4q1J86r1o9L8L2K7r3J40l4j00N7J19r7K40k85J41J67j50J3k11L35R2k62
544C43q3N04l14J00L49j93m41P89k88K06L5L99N82J370M077O2379N3721r5096N1781L5103
446A15323j01110j1394j131n46K07k21k60K01p79J064p74J4K75n94L15j60j41m0R3p1J51j10
337C12j15J73Qj0o0q5O3J3j16n7J68l9m7q3l0J60J91l93L22l36R8J68O1j53P2k34R0N7J8j03
190A13o4pJ74LJ3K02k78K04m4j53q7K15j65O5p5o7J64j57L54l35Q0R5l3k9j19Q1J4j29Q3l0
42H8qO2N8q5P6j6m7lM9k8n3mk2Q2r5QK96n1q0j16R1J17k06m7n2J18m9MK1l8O1J3qk6k0O7k0
$$ plain form
977 85 163 149 126 56 244 35 246 69 176 113 201 180 101 44 159 206 245 94 90 120 251 100 192 179 152 219 346 118 487 378
830 378 617 201 196 112 275 43 280 73 307 130 29 225 122 107 137 64 152 270 117 115 590 152 235 96 207 131 219 157
692 157 151 156 227 157 175 229 148 334 243 174 212 244 271 178 318 284 184 241 360 263 503 218 359 526 376 389 178 513 605 343
544 343 260 764 450 550 899 706 265 1054 766 972 1007 1406 1988 3358 7435 69814 123535 28439 80220 115323
446 115323 14213 2819 1688 1142 1349 1128 868 1069 290 1354 580 594 869 275 590 430 289 249 342 271 422 312
337 312 197 370 378 368 308 223 286 299 183 126 294 255 208 125 95 255 446 53 375 39 137 305 366 213 285 51 141 198 216 113
190 113 49 42 216 219 232 434 156 360 316 163 76 291 126 191 116 49 213 56 410 75 155 250 217 188 69 150 164 35 118 88
42 88 80 142 200 115 191 175 128 125 174 146 93 89 67 149 54 62 358 307 227 111 202 319 113 66 14 132 83 87 108 70 131 144 136 110 90 157 137
-140A37m1J21j20J52lr7nj02R9m7J10j10J53j07o2J93j39P5o2J4L1j9m2m7rJ20m6J83j03j74
-288E3J81l1m7J3j7NO9j78L0Q3m1l1m8J33J8J24k64N7P2kkL4Pj69l0K3J74m6R3j32J52k9j79
-450G5R7J83k15J33j35O8pj27R3P3kj04k3
$$ plain form
-140 137 96 217 97 249 246 149 144 42 141 94 204 94 247 140 78 271 132 207 145 159 190 171 129 82 73 193 147 330 227 53
-288 53 234 203 156 169 152 157 226 48 78 161 120 89 41 174 192 316 52 109 181 179 177 211 218 49 19 42 216 170 263 131 283 254 75
-450 75 172 355 140 273 138 206 199 72 165 238 236 132 109
-514A09
##PAGE=	F1=-1651.27
##FIRST=	4521.1594499999982872,	4521.1594499999982872,	0
##DATA TABLE=	(F2++(Y..Y)), PROFILE
4521C79k03O3r6J15j55Q5Q4m6j97J46M3p1R1j64R5O5k12K03Oj46K59k60K29j94K12l4Ok3R8
4378C78l53M3M9N6j40J83r9j7J98m3j17L7p7P8N4j5j01%NP9l4n5K0J8L8p6Q6m6j43L9K8l4
4221C9K14j01K2j21M8K05k53J73j43J07j74P0K3p5J13q2Q2k7l0J6O3L4q9o3J11j8o4j6O2R4
4073B20r3n4l7K96j35K3p3Mk8L3n6On4OK1R8n5q1N3J22j19Q8J45m9j4p2j12M6M3k8j15J17
3916A46l6O7Q1J49j91l8n9N7j19J55j12m0M1J18jj47mJ25J60k34j5q9J27m0m1N3Q2j06o4J30
3768A55j24J53O5k32kJ61Mm9J4n9k3j3L3N8o5K9k2J94k12M1J49j92l2L4P6m3j3N5J82k57J91
3615B56q6j5q4JJ58j38o3J35r3N9l1n2L0N2R8j47J36p7j07J32j5Q6j82J45j27K4J7p9K2j4
3468D1R6m2J15or3J25p4L6p0n1m9J95J3j04o3R9o1l6J15r8P1L7M9j43K2PO2j03M6P6K0L1p4
$$ plain form
4521 379 176 239 143 258 103 188 272 226 29 175 218 147 238 74 169 234 22 225 231 85 344 84 313 119 331 297 303 280 378
4378 378 25 68 117 173 33 216 117 100 298 255 138 175 98 176 230 215 114 114 119 198 164 109 129 147 185 109 195 149 6 45 73 39
4221 39 253 152 174 53 101 306 53 226 83 190 16 86 109 34 147 65 147 120 90 106 169 203 114 51 162 144 80 64 126 220
4073 220 127 73 36 332 197 220 147 151 123 156 100 106 52 58 79 177 122 41 94 216 97 185 330 281 267 195 83 129 172 144 29 146
3916 146 110 177 258 407 216 178 119 176 57 212 100 60 101 219 218 71 67 192 352 118 103 14 141 101 60 113 195 89 25 155
3768 155 31 184 249 17 15 176 180 131 145 86 63 50 83 141 76 105 83 277 65 106 255 63 31 65 141 98 85 140 322 65 256
3615 256 170 155 71 72 230 92 29 164 71 130 99 47 77 129 227 80 216 139 32 164 149 235 53 198 71 95 112 33 55 41
3468 41 137 95 210 204 111 236 162 198 128 77 28 223 236 132 69 168 107 71 186 88 159 196 245 102 124 131 193 90 136 212 232 263 189
3305A89p8R2j73J50o0q8LL0j4O3m6P2O9K4L3k06J04k4O7m8P4j57L6pj00K15j84P0OJm1n3N1
3143G0J48j51Q7J28r5o4n9nK1J38k2P0j96l1J09j15K4J65p1j8J31r9j26m%M7J21K5n9J5j18
2990F6k9J96j31K6J08j55j0K7K7n8M3j6l8R2j01J24p5P5j10L0L3km1l3J89Jj49K2k7L8L4m3
2833A13k9L3p6J12j7p8J38pq8J05q6O5j4L2j47O9PM2j10kL6J6k2Jm2J70q3Ll1p3L7R9Lp8p0
2661B8M7J5pk7L8j3Q1j11j6L3P2j0Op6m4J25j6L4j42J07L4O7j07J00j64ON6R9ok7j16N2J09
2498B27L8j93J17q6ll3m9J56M2j18K2l5j4J9J17j55N5k8Q1jo6j4K01j29J8m5P0K8mpP2J4j70
2336A27K0j6K3j42J18J37k08n0O2k3K30n0oJ71j88j05O9q0L8N5o9m3m4L4J55n1o4n3K22j00
2188A69r7m4Q4O7k2R3j31L4J6j49N0J83P1j0j11r9J27l2P8k16LM3q8J33l7J42j58K4j01P6
$$ plain form
3305 189 111 203 30 180 120 32 35 65 51 114 68 140 209 233 266 60 164 140 207 159 233 76 112 105 5 220 36 106 112 113 72 19 70
3143 70 218 67 154 282 187 123 64 59 80 218 196 266 70 39 148 33 57 222 151 133 264 165 39 35 35 82 203 228 169 184 66
2990 66 37 233 102 128 236 81 71 98 125 67 110 94 56 148 47 171 96 171 61 91 124 122 81 48 237 238 89 111 84 122 156 113
2833 113 84 117 41 153 136 58 196 189 101 206 120 185 171 203 56 125 132 174 64 62 98 114 92 93 51 221 138 141 110 37 74 173 176 98 28
2661 28 75 90 83 56 94 81 162 51 35 68 140 130 136 60 16 141 125 159 17 124 158 225 118 218 54 60 116 215 209 182 66 118 227
2498 227 265 72 189 103 100 67 18 174 216 98 120 85 71 90 207 52 107 79 160 159 93 79 280 151 169 124 194 222 218 211 283 297 127
2336 127 147 131 154 12 130 267 59 9 71 48 278 228 222 393 205 100 169 89 127 182 113 70 26 60 215 164 100 47 269 169
2188 169 72 28 112 179 157 250 119 153 169 20 70 253 324 314 203 104 231 199 277 61 64 107 19 152 115 257 99 123 22 98
2040I8L2j05O3l1N8M1J9J3j18J9K25k41J21N3r3j19PO5J06n0O3j04R1n4J18oj48j3Q6J21j71
1888A46j42K09l1j8J2m5p5J4L4O7q7J11j14L5m4KJ2l5oJ53J33j53j46LJ52j33O4mQ8j94J15
1735A23r%q5K06m1m9j03K2O8J10n9O2K5j25L7m3q6O8J73l0m8j67P4J59j66K6r7J63n6O6Lj27
1578I4R8j48P3M7m1L2N4n4J35j38P6N9j01O3K78M3J044J327N305L0268m130k5407p182J213
1460C008P040L694J3388M4506k9454L4126o8156J2349j3640l566r24m49J33j147o55N88N1
1376H92l58n5m61K41j92J43P4o9j28J03J66k04J1R8N1j35o5n9Q5L2m3L4j04O9R8p0k3K0J69
1233C20j06j23j7N3j6P1j17J16q4O4j14P8p1K16l9%j19L8q6l4NK02p7K9j85J38J31j85J41
1090B29j28L7N5n2K2J03j06O2r6k5J02O4j00j20K50j73L1lj6m4Q5l4o1J20r7L6n6J51j92J70
$$ plain form
2040 98 130 25 88 57 115 156 175 188 70 89 314 73 194 247 154 35 42 107 213 163 226 122 213 159 277 271 123 110 196 317 146
1888 146 4 213 182 164 176 131 56 70 104 171 84 195 81 116 72 74 86 51 45 198 331 178 32 35 187 54 118 114 202 8 123
1735 123 114 114 29 235 194 145 42 64 132 242 183 245 270 145 182 139 53 121 294 264 216 49 123 282 116 142 45 208 152 218 221 94
1578 94 192 44 117 164 123 155 209 155 290 152 228 287 186 249 527 570 1614 2941 8246 38514 34384 8977 1795 3008
1460 3008 10048 13742 27130 71636 42182 76308 8152 20501 6861 3295 2371 1922 2055 908 253 841 892
1376 892 534 479 18 259 67 210 284 215 87 190 356 152 163 261 312 177 112 53 138 170 127 161 57 126 224 154 131 151 320
1233 320 214 91 74 127 111 182 65 181 97 161 47 125 54 270 231 231 112 150 64 30 35 237 160 189 4 142 273 88 229
1090 229 101 138 193 141 163 266 160 222 126 101 203 267 167 47 297 124 155 152 136 92 177 143 82 202 105 141 85 236 44 214
943B14j41R9n0P6n3oj07J38K3O1j29k5M0J26j53O5J3n8P8J44k57K64r5J77k76K9o8J31j96
800F4K21k50K56j70r9K45j41j5K7m3L7J49j28l9M71m27R1j46J13o1M9n5J7l8Q5j1n7J26j64
657A07K72j50n0JP2O4j49J26K6j31K9J57j12K59l03J63J51j28m0j80L48R0k49j26N12k94Q9
524E54L39j64m51Q16l33K53L3L81O36J388M210O3736N5827r7634N2429L6862j04032j1867
436B983j239n22J63k06l10K14p59J064q09M2K63o06L50j82k10O6N3q6J58j03j41J82L1m6j4
313C36j04K8O1j46r3K35j11J9q9k5J11K66m07K80k97O9J49R4j83N0j98J23J3L4q7p0l0K14
175B42k4mK24k73J85j9j56o6J38j06L2Jj09J66j96L27l28J35N4rl5o9L6Jj07J01m6k3P0P9
27B21r3N3K1n1j8O0k3r8Qm8J42j26L7K58n6p5r0O0J77k80m1PK6M1J0m3m4J18k4rl2M9J6m5
$$ plain form
943 214 73 172 122 198 145 139 32 170 193 254 125 100 140 266 113 178 191 133 211 355 98 362 267 444 168 197 129 260 64
800 64 285 35 291 121 22 267 126 111 138 95 132 281 153 114 585 158 249 103 216 155 204 149 166 128 213 202 145 271 107
657 107 379 229 179 180 252 316 167 293 319 188 217 374 262 521 218 381 532 404 364 184 532 622 373 247 759 465 554
524 554 893 729 278 1094 761 1014 1047 1428 2064 3452 7662 71398 127225 29591 82020 118882 14850 2983
436 2983 1744 1222 1385 1179 869 1083 324 1388 579 621 884 278 628 446 236 302 355 269 427 324 183 365 396 350 336
313 336 232 260 321 175 82 317 206 225 136 111 222 488 81 361 64 133 282 376 193 243 45 168 181 215 128 58 28 242
175 242 218 214 438 165 350 331 175 109 247 141 173 174 65 231 35 362 34 169 223 214 179 110 146 147 40 141 95 72 142 221
27 221 128 181 202 151 133 193 170 72 80 32 174 48 85 343 287 212 122 182 359 79 38 45 71 112 122 79 35 153 129 120 88 137 153 108
-140A08j3J58j59J73pj34J6r7O7o0J63j15J46j16k8J53j00J12r9pL6j4n3k0n6J48n7J85j22
-283B08j44J51l0Lj1Ko0J66j96J6L3k8K5j20J86l7J41k35M2R0k2K7k6K0j33k4NJ68m8Q0j54
-435I5J88j9j97R9J82k34J36j36J20m0j08P2P1Jq3p3
$$ plain form
-140 108 95 253 94 267 260 126 142 45 112 52 215 100 246 130 102 255 155 267 168 161 197 183 130 110 54 202 145 330 208
-283 208 64 215 185 188 177 179 119 285 89 105 138 110 135 15 201 164 305 70 112 202 180 207 181 201 68 44 49 217 169 249 95
-435 95 283 264 67 166 348 114 250 114 234 194 86 158 229 230 147 74
-514G4
##PAGE=	F1=-1661.11
##FIRST=	4521.1594499999982872,	4521.1594499999982872,	0
##DATA TABLE=	(F2++(Y..Y)), PROFILE
4521D14k67J29j53J47j84J00O6rk12J39K8k4O8j38Q3L6j64J37N5q7J53k52K37j46K23Pp7J5
4383C24P1l45L7K3Q8j83J67n7n0K20p9q7P7r1O5P3k7j16L8k6J01m3p7K7k7Q4m3O1q2r8N2j1
4226F6RJ60j11M2j26O7J80k33J78j87J07j12P5qq7J21r6J54q6J8j9L8N6q7m3K0Qm9K0M8M2
4073A65o8j8l9K55j04M5j16J3k0K9n0J1p3RM5P3j9o0K2J48j38R0J72p7jn7j27K4L9k9q2J27
3916A89j21Q2Q3J70j99p2m1M3n4J60j82lO8O6M5k07N5P8J52k41M4o5J10m5rL4N2j38JJ04j38
3763B1J35M9j71MJ41l5j0L4q8j6K2J4N3n4K3j9J55k09M3J75j92k7K9L2l1pN2J98k68J83m3
3611A93n7n0k0J52q0r8J38p5k7k4pN1jJ44j70J13o6q6J11j9Q6j59J06r3M8j9m3K1pM7n9J86
3453B36n5m3N0m4N3o7k5m7J59%j30k8J08m5p4R6r5Q4P8K1j29KN0M7j25N2J11J5jr6n4J49k26
$$ plain form
4521 414 147 276 123 270 86 186 252 243 31 170 198 174 242 104 187 223 59 196 251 164 317 65 302 156 379 386 309 324
4383 324 395 50 87 110 198 15 182 125 75 295 216 129 206 115 180 253 226 110 148 122 223 180 103 130 103 187 144 205 123 25 77 66
4226 66 75 235 124 166 40 107 287 54 232 45 152 40 115 107 20 141 45 199 113 131 112 150 206 119 76 96 104 55 75 123 165
4073 165 97 79 40 295 191 236 120 133 113 142 92 103 30 39 84 157 138 78 100 248 110 200 372 295 294 237 110 134 173 144 62 189
3916 189 68 150 233 403 204 132 91 134 80 240 58 55 123 189 234 27 82 160 312 71 115 50 160 115 106 140 192 54 55 159 21
3763 21 156 205 34 38 179 144 134 168 80 64 86 100 153 99 122 103 258 49 92 267 75 48 77 109 78 71 123 321 53 236 193
3611 193 136 86 66 218 138 40 178 103 76 52 45 96 95 239 69 182 116 30 141 122 208 49 155 62 110 91 48 69 62 109 50 236
3453 236 181 138 188 144 197 130 105 58 217 217 87 59 167 122 48 144 49 133 211 232 103 105 155 202 77 129 240 255 254 158 104 253 27
3291B7J25j3m1m4K1JM5m5O1M6J7N6j81P4PK3l8J10j30k2K6q9J61j16KM6k6nq7O7J41j57J02
3128A64J53j33l8n4l3K9J20PP8k24J0P3j44O7J91r8l9J25j15r8J6OM8P0M4n3J4j27QJ61j41
2976H7K6R5q4p9K0N3o3M8k8j2J30j63J93p9R4j58K8L2om5oJ63j9j56N3m1N3M3j8p0kk9J21
2813A81j9j02J71m8q0R0m6N5l8J9r2N0LM1p0q0M3PL9m6l8J43k3l4nj06N5P7M1j03o2M4NrQ
2641G1Qj1O9l8m4M1P8j7o2k9l3R0K9Jj21Q0J9P5q7J51j99J5pQ6J04m1j31lJ26M1j82R6n1j3
2474A11o5nJ55K6q7kk1l8L8J18j58P3p8J18k9n4m6K09j08Po0O1pM9LR2Kj47n5KL7q7O0J32
2306B46j65n8M4L9J68p0K0J70k07j09R4j20J40k3l6l6m7MJ82n4r4o1J94o2n9n0MO1M8J24j28
2154A59qJ4j45O7J57L9Lq9j19J33LQ8k39K5k6PJ01j7J12j53ro6M8L7j06R9q2R8kN1Jq4KK15
$$ plain form
3291 27 152 139 98 54 75 76 121 76 137 183 200 256 75 149 156 179 141 251 121 99 125 36 197 81 83 129 103 98 11 78 219 62 164
3128 164 317 184 146 92 59 88 208 215 293 69 79 152 8 75 266 168 129 254 139 41 57 63 111 181 225 172 186 59 67 228 87
2976 87 113 208 124 45 65 118 55 103 75 63 193 30 223 144 238 80 108 140 134 89 83 246 227 71 124 83 136 179 161 91 89 60 181
2813 181 162 60 231 183 103 193 147 202 164 183 91 141 144 185 115 35 78 85 124 78 40 183 160 126 121 15 70 147 188 85 23 67 72 63 71
2641 71 79 68 137 99 55 96 174 157 95 66 33 123 152 153 32 112 131 206 119 270 71 86 79 165 269 228 97 94 220 261 79 175 124 111
2474 111 46 41 196 222 135 133 112 74 112 230 72 145 67 185 156 102 56 265 157 164 104 165 158 207 210 302 304 157 102 104 141 54 114 246
2306 246 81 23 67 106 274 204 224 394 187 78 172 52 192 169 133 97 50 54 236 182 88 27 221 159 100 50 54 115 163 287 159
2154 159 151 165 20 87 244 283 286 197 78 211 214 302 63 88 62 69 170 153 265 112 103 37 85 122 16 115 33 131 129 180 181 97 99 314
1986C14k37J26N6j21j03O3J9J06j0O8j46N8r1K00jj94k6J02Q8j55r6K02j7l9Qj9n6Om5J40
1839B00j13J13j14J4L3k7rJq3K14R7j44j32qJ24j17R4J5N1j90J00J8o7l0J73m5n3q0K8P5R0
1686B28l7N0j3r2N9l3o5M2J62m0p3j76J10J83k06M9j47J58m1O3J8r4N8q5R8o4mL6J9lJ39o9
1528B30MR7k05J23K98l1Q94J410N036K8236l360k3849p031L77P187L625J3273M2606k7932
1435D0988L1905o5533J2470j3086l449m51j109N27r96r21J98K13l26j7m02K21j37J31O4r2
1337A98j26R0J82k04J7Q3N0j26j22j8J27M4q5K4n3M7J01o9k1lJ80j31q6j0L2RM9j16J24r9
1189H8O4q0N8q7J91m3Kp9L4j20J9J0J00J0k2r1Q5J21j64P2q3O9N6n0k2R3r4O7p4l4Q4R1r5
1026A76j26J99j00N2j03K7p3J69n4p4J39j76J06n9J12j29P6r3Q6m4O3p9P3j40J37OQ6r8m1
$$ plain form
1986 314 77 203 259 138 35 98 117 223 213 281 135 193 102 302 301 107 81 183 271 116 20 222 205 166 174 155 99 105 60 200
1839 200 87 200 86 100 133 106 97 98 15 229 326 182 50 42 166 49 143 158 209 19 119 137 70 40 213 168 115 35 63 138 228
1686 228 191 241 228 136 195 162 97 139 301 261 188 12 122 305 99 148 1 159 118 181 199 105 163 78 176 112 108 144 163 160 299 230
1528 230 234 331 126 249 547 516 1410 2820 7856 36092 32732 8883 1852 2229 9416 13041 26314 68920 40988
1435 40988 72893 7360 19830 6744 3295 2844 1735 2262 1266 345 543 756 430 413 11 232 95 226 290 198
1337 198 72 162 344 140 157 240 290 164 42 24 151 195 110 134 81 128 229 160 139 136 316 185 99 89 121 130 179 63 187 88
1189 88 152 72 130 43 234 191 193 114 148 28 47 57 157 167 145 54 139 260 96 168 85 154 210 160 138 231 137 204 130 96 180 271 176
1026 176 50 249 149 201 98 125 52 221 167 93 232 56 162 103 215 86 162 69 155 111 174 95 168 28 165 171 257 159 118
884A18N0J03j40K6K9p9R1J42k38J86M9o0j43P0p0R7j55K10k62K20j06o1K15j79ONMk4J81j08
736A77p7M52m02Q9j27R3m5Oj5K1q4J03M6j29K02k48L33j88l6l5R8J04j82R0O6j26%J78j18
593B46K60k92J63J18q0j07j31L31Q3k15j53M89k79R4L13j25m38P87l51K82J3L50O42J295M076
470G371O0843N4179r3652M9643L6032r9965j1482j302m27Q8j60l59K18o87R90p77M8K39n85
377B55L71j90k76J67K3r6J41p2j48J72M4p7K2q9k5R1j58j16K69j68Q4r4JN2L19l94K12k28
239I2L9J11J30j90Kj29J36m7O1p1n6l4K21o2JK24k57J42Rj37n1N8k7j7P6q2J08j86K48k61
91E1J08L9Nm6j8j1j9n3J16p9k1O2J00r0K1O6o8l5O7j1j15lj7J41j49O3K13m9o5p3L3K12l32
-71D3k2M3j7Q4J8j03k8J59n2l2k5J17l9n4JJ87j94J87pj59K6q6N0p2K05j30J41j28J8J06o5
$$ plain form
884 118 168 271 131 157 186 107 198 340 102 288 337 277 134 204 134 231 76 286 24 244 138 77 292 113 119 124 128 104 285 177
736 177 100 552 150 239 112 205 160 166 151 172 88 191 237 108 310 62 395 207 171 136 234 338 156 246 312 186 186 364 246
593 246 506 214 377 495 415 308 177 508 591 376 223 712 433 527 840 715 277 1064 713 995 1008 1358 2000 3295 7371
470 7371 68214 122393 28741 78384 114416 14451 2969 1667 1240 1328 1168 809 1027 340 1330 553 601 840 255
377 255 626 436 160 327 350 254 395 323 175 347 391 314 336 247 222 313 155 39 308 140 224 130 131 183 502 108 320 92
239 92 131 242 372 182 184 55 191 144 205 134 78 44 265 203 204 428 171 313 322 185 134 192 165 148 224 142 250 64 312 51
91 51 159 198 203 157 139 128 109 56 172 93 72 134 234 144 165 231 163 128 195 184 69 66 49 190 41 104 317 268 203 130 163 375 43
-71 43 21 64 47 131 149 46 18 177 125 93 68 185 146 92 93 280 86 273 266 107 133 47 97 25 230 100 241 113 131 237 172
-224A72J20r5m7M8np5Qq6J85o6J39j13o5N9k1L5j5Pq9K15j47l6nJ7M7j47J72n7J34j97J9R9
-381B10l3K9m9M8j33J4j2J43p0R7j63J84Jj85Q6J49j96J11j24J45o8r6P1P1J1q8j04
$$ plain form
-224 172 292 197 150 198 193 118 126 40 225 159 298 185 120 179 158 193 178 185 96 311 164 128 123 140 187 40 212 155 289 92 111 210
-381 210 177 206 157 205 72 86 74 217 147 244 81 265 266 81 167 316 120 231 107 252 184 88 159 230 241 153 49
-514D9
##PAGE=	F1=-1670.96
##FIRST=	4521.1594499999982872,	4521.1594499999982872,	0
##DATA TABLE=	(F2++(Y..Y)), PROFILE
4521D39l22J84j88J56k06J12O0J6k02J05K5J9L6r8M8M1j30R7O4j3M7j84J73q1J94O0j49N7
4383C60K5l17M7j2R8j86J30ol4J98j52l1J01p8K2J04m5j05N8m0R5k8j01K7q7J43OL6j30l0
4236F8L6l3L7R0j08O4j23P5J48j81J45k07Q8k7O2k3j06J16p8K04j53O2m1KQ7p9k4pj5l2M6
4083I3M8m5k1Qn0K09m9N8j55OJK0m7Mp3K5P4K4K1m7QJ40j27Q3J72j01L0l8j30j0K5qo1J26
3916B13j76Q2P6J82j83p2o2L9K2J42j81k5P8J6J01k04Q6j5J32j88O8l2P0l0%J7J7j31N4O3
3768A59r1P2J8p3j6R9o5K4N3j02mM7rM1m8K4j8J18k02N1J91j97j1J4Jk2j8P1J98k63J65Rq9
3606A27k0l3J42l9j45J34m1j01KJ8Q1o9J80j38M4n8k4N1j1P5j32N8j8N1n6j3L9Ok8p4K42j18
3448A32J7kj7O1o0J8o1J32j9j55J8J04m3r7P9q1Q0J15j4j13pQ6M2j21K3J40J8l5j15k2J85
$$ plain form
4521 439 117 301 113 269 63 175 235 251 49 154 179 198 234 136 184 225 95 192 256 243 290 106 279 198 392 452 303 360
4383 360 385 68 115 103 201 15 145 139 105 303 151 120 221 143 165 269 224 119 177 137 232 204 103 130 43 186 192 228 98 68
4236 68 104 71 108 198 90 154 31 106 254 73 218 11 99 72 134 111 5 121 43 247 94 156 115 117 204 125 101 94 79 47 93
4083 93 141 96 75 83 33 242 193 251 96 102 103 123 76 80 7 32 106 130 151 104 112 252 125 208 380 279 309 271 141 131 156 148 87 213
3916 213 37 119 195 377 194 122 60 99 121 263 82 57 135 151 252 48 134 119 251 63 131 99 169 139 139 156 173 42 96 159
3768 159 68 140 158 85 69 168 103 127 180 78 74 121 112 153 105 129 111 229 27 78 269 72 61 75 76 54 36 107 305 42 207 216 127
3606 127 107 74 216 177 32 166 125 24 26 44 125 56 236 98 142 84 60 111 100 175 43 101 83 134 78 65 104 110 82 8 250 132
3448 132 149 147 130 191 131 149 88 220 201 46 64 168 125 28 107 26 106 221 207 94 87 173 215 94 117 257 275 240 125 103 288
3296B88k45Q5M3nq2PQM6o9M3L7OP0j39K8N2l7j9J31q9p6N8o9R8m0m7O0j6J0j18P0J23j51J15
3128A76J62j59l4l9n5M1R4L7Q3k40M2N9j19N2J98j17p8J30j18n6J2J1N0jQ8n6J7j33N4J17
2981B18j22OP8j8j13k6R3p2N1k3J2J32j87K33p7J05j94K6K7j2n1L6J29n3j35P3m6M3P3j5j01
2828I0j1j8J46k3j25J93o6q8Q1nL2o3oJ2J3rJ2np6j7J8P1r3l4R9N6q0K9o5LM6O7j00o0M9j0
2651F3j8N0k8pM6K6m3L4P1j0j11J5l5M7Q4k7j05M8K0N9o0J73j95%j8O0J86o3j34o1J38L6j60
2488H1O9j3j6r0O6J21%l7m2ll9L6J05j61R9j19J48o6%o0J60r4mo1N6m9J11J1J05j6p7j28n
2326H8L3j2j4J10j11n1M7O6J05r2M5J62k09j06J04j46K18n6m3j7o1j6J92m3j13l6J18k5j8
2183A19n4l6L9R8J33j06l7J0j44Q0J14oL0n9j22J17M7J02k66M5o5P8O3NO8j44k6j8K6L2j02
$$ plain form
3296 288 43 128 171 166 84 91 99 145 76 119 156 162 232 93 121 173 136 117 248 159 83 141 72 170 130 83 143 127 137 19 89 212 61 176
3128 176 338 179 145 106 51 92 186 223 306 66 108 167 48 100 298 181 103 233 115 59 71 82 132 131 219 163 180 47 101 218
2981 218 96 102 180 162 49 23 116 44 95 72 84 216 29 262 185 290 96 122 149 137 86 122 251 198 63 136 90 133 206 191 90
2828 90 79 61 207 184 59 252 186 98 179 174 206 143 137 149 162 153 165 160 84 67 85 156 63 29 128 184 104 133 68 71 117 184 84 24 73 63
2651 63 45 95 67 60 106 132 89 123 194 184 73 88 53 100 184 157 52 100 120 179 119 292 97 97 79 139 325 262 128 67 205 241 81
2488 81 150 137 121 31 97 218 218 181 139 136 97 133 238 77 176 57 205 139 139 79 239 145 141 80 136 87 198 209 314 298 221 93 88
2326 88 121 109 95 205 94 43 90 156 261 169 214 376 167 61 165 19 237 181 138 121 60 44 236 193 80 44 162 137 119
2183 119 65 29 68 166 299 193 156 166 22 102 216 210 240 181 59 176 223 325 59 104 39 117 180 185 253 109 83 65 91 123 21
2031B1J17q4R7m4P2j9l5j5J83k09J26M3j56k7P3k3J12LQ2j70K1j19K71Ok23j6Q1M6j32n3J90
1878B19ro5J8Nl0jj07J90j40J13r9LP8m6l0L4p2J89M9j10j17k2P9p5J24L7jj81P6N1p1l3J33
1716A89l9o7n0L4P6P2k5K6n0m0P0j1n4K6J37m8r6j28J07J69k16P9j33O1qM8L2m5L3k4J14j45
1558I4J0M1nK9Q3M7j10R7k19L8L03l4L68J026L184J7848j878j5430m668J140O607L008J1959
1445B3538L7620k4697K7786n8194J1856j1680l083K79j876Q37p49q12n02K40k08k7k80J64
1356B12q6J02O1j09j01N3J75j73lP9N0j12j14lJ38L7j08K0nkJ05n7l5j1J82j45k8j7RL8K3
1204A75r8J06r1L4k5K5q1J49o1J5k8J4j10M8L%Q5n8MK5J01j30mm3J28L3j6q4Q0n9M0n3l9N6
1036A41J14p8j26J34k6P3j76R4j45K36m5q8J37k10J40o8P9m2m9l7P1n1N7r8J38j48J22j1J08
$$ plain form
2031 21 138 54 151 107 179 160 125 110 293 84 210 253 97 70 143 120 232 235 317 147 168 49 320 326 103 87 168 214 82 29 219
1878 219 210 145 163 168 138 137 30 220 80 193 94 97 175 129 99 133 61 250 299 189 72 50 129 54 178 215 214 33 109 160 89 56 189
1716 189 150 83 33 67 143 215 190 216 166 126 196 185 131 157 294 246 150 22 129 298 82 161 28 89 81 129 161 116 149 125 239 94
1558 94 104 145 140 169 252 299 189 286 67 105 408 374 742 1768 4952 22800 20922 5492 824 1964 8571 11579 23538
1445 23538 61158 36461 64247 6053 17909 6229 3146 3425 1549 2386 1637 825 323 563 355 328 48 212
1356 212 126 228 289 180 79 132 307 134 131 210 260 148 34 31 169 206 98 118 113 111 216 159 124 113 295 150 122 105 114 152 175
1204 175 77 183 92 126 101 126 45 194 133 148 120 134 24 72 75 75 160 102 106 131 232 102 98 55 183 216 200 116 196 137 177 124 85 141
1036 141 255 177 51 185 159 232 56 150 5 241 196 108 245 35 175 107 186 144 95 58 129 78 135 37 175 27 149 138 246
894B46n6m7N5P1j32pM0q9J00J26j96J70J75l38k1J21r2O4j09J98k30J24rl2J68k10M0l0O1
751A61r4K14j03j03M15l58P6q5N6l6l2N3Rj34J28Q7j88K70l08L51k02l0o1J07J44j86L6P9
613B66r1j8J77j17K41k60J50P3j8j69p4K88P4j73j56M40k71J09K76q6l99P04l38K88j8L11
485A209O00J104L697N4158M9024q3797M3858L2761q9534j0304j304k81nr4l96K11n75Q51o77
391E06L0K12n36L75j86l22K45Or2R3k4j32J40M8j05N0n2q0J07j56r7K37j89J30r9L5ML36l54
249A30J23j36J2O2J63j76o4m3J30r8Q3n8k3l4K12j13L5J99k32Q0M3j06m8rN3o6J38n5O0j74
101H8J75j63K1N4J5o6K7m9m3K0J26j16j4M2J17r0jJ09r9l3O0mq7l5J3J31j66Q5J64l0n6o3
-56A32J0K22l32nM9J4M3L4j52M3J35o1o3j7J66q6n7J9J99k19J94nj75L1p0L8j7J70j49J32
$$ plain form
894 246 190 143 198 269 137 130 170 81 181 307 111 281 456 118 97 218 126 190 81 279 49 173 164 132 300 90 130 100 161
751 161 67 281 178 75 490 132 208 123 179 143 111 164 173 39 167 254 66 336 28 379 177 147 86 193 337 151 187 266
613 266 175 157 334 217 458 198 348 421 403 234 160 448 522 349 193 633 362 471 747 661 262 966 628 916 898 1209
485 1209 1809 2913 6610 60768 109792 25995 69853 102614 13080 2776 1472 1191 1186 1092 696 907 332 1183 506
391 506 536 748 212 587 401 79 324 330 238 331 307 175 315 363 258 308 256 176 283 127 30 267 78 208 109 144 148 484 130
249 130 253 117 129 191 354 178 114 71 201 103 186 128 105 71 283 170 205 404 172 252 295 189 141 132 185 119 257 202 262 88
101 88 263 100 121 175 190 124 151 102 59 79 205 89 75 117 234 144 143 252 153 120 180 176 89 54 67 198 32 117 281 251 195 132
-56 132 142 364 32 27 76 90 133 167 15 58 193 132 69 52 218 132 75 94 293 74 268 263 88 119 49 87 70 240 91 223
-204B23j34P1N5l5J09p0q0M8J5r9K9j08K32p9O3q1J8l9j2N2qQr1K21q7p6l8Q3L8j39J08l9
-362A58J11j59lJ09n5K1m8R3j68P0k6J03r1J23j61J56K2j47N8R7j31Q9j18J63j02n1N5N6L5
-504B59j08j22
$$ plain form
-204 223 89 160 215 180 289 219 139 187 202 103 132 24 256 177 240 159 177 138 126 178 170 178 87 308 221 145 107 190 228 89 197 158
-362 158 269 110 107 216 161 182 134 227 59 129 103 206 115 238 77 233 255 108 166 263 132 221 103 266 164 113 168 224 259
-504 259 151 29
-514B9
##PAGE=	F1=-1680.8
##FIRST=	4521.1594499999982872,	4521.1594499999982872,	0
##DATA TABLE=	(F2++(Y..Y)), PROFILE
4521D42l55K22k04J51j94J02N7K8j75P7K0L4Pn6OP6j20J03J9N8k9j10Q7j3J42J02j91J01l9
4378C48k71O7m7Q2j57R2L7j0J78k32K5J04m1l2J26o6p4O0l8Q0oj18J9q6J45N1K7j86L9mj9
4226I3M1Rp8P2j10O7J21j23R8j22j1M5L8k5r4O2k2K24k21R8m5m3J28o7k3M2q4mM9M2j30N0
4068G7No3J59K2O5j86j2K6J2m8mLj5R1l5N4m1J1J17r5N8J54j17P3j6j33m5J0K8n4J09j90O8
3906H8O4J80j41n4j01N2N8J31j55o8Q3k9J58j75R2j07J08q9M9JL0lj4lop8N9K5m8L0k7K1l5
3743I6N1q3N3O9q9j0N9l0K5m6L3k2Q1j57K9J94j81lqj2kk3P3J74k36J41O1j11Lm2J42j8j92
3581A9J16Jq9NqJ13j01J63o4m4o3L7lQM5j05M4M8L3p5QP2Mr6l7K18j84P6k2NN9n0O0p8J12
3409B27l5j01jO9m9r2N7l1L4J41m2j00pJ10M6j03j2J48L1o2j29RJ93k41N6R3K4j11rON8j01
$$ plain form
4521 442 87 309 105 256 62 164 221 249 74 151 171 205 212 156 162 238 118 221 240 298 269 159 246 233 375 477 286 387 348
4378 348 77 144 97 179 22 114 151 141 319 87 112 216 175 143 269 203 129 189 151 231 225 107 126 40 185 236 263 77 116 112 93
4226 93 134 143 65 137 27 94 215 92 190 68 57 102 140 115 21 83 61 285 64 162 117 74 202 135 112 154 70 66 115 157 27 77
4068 77 82 19 178 200 265 79 67 93 105 57 53 56 41 132 97 151 110 121 238 143 201 355 238 311 295 162 117 127 155 101 210 20 88
3906 88 152 332 191 137 36 88 146 277 122 54 137 108 266 91 183 76 184 95 144 145 175 172 158 155 149 71 130 155 107 137 110 131 96
3743 96 147 64 117 186 97 87 146 116 141 95 128 106 187 30 59 253 72 69 61 49 47 24 97 271 35 176 237 126 129 87 229 211 19
3581 19 135 136 47 52 44 157 56 219 155 111 48 85 82 90 135 30 74 122 155 80 88 160 164 68 31 249 65 141 119 124 183 133 193 115 227
3409 227 192 91 90 159 110 18 75 44 78 219 177 77 70 180 226 123 111 259 290 228 99 108 301 60 116 209 233 122 113 119 177 76
3251G6J3L8lP1p9l4J04q7PJ21l9j12O9m5M2K6p3N6J2Rj44P4R4j30J19J56j67n3j8o8O0O5O2
3089B22P9k42O2O7j03L3J97j23j29J36j12k1LK1N7r0J54o6K7j32Q9P4q4k5O0L3r5p2R5p8M4
2936H1KK2J12j77K39o9J07k13L4J4k5n3P9J13j06q2O9m7J9J11l0j18nl1J77k6j44K02n3j13
2789H9P6K8Or0l7J33k4k9k9P0m7p1K3P9j19m7N7J41j27O5l2m6J7P9o9p2O0k0l4R7p5J3PP5
2621A47l5L5N0Mj02Ql9J2J37m4j02J7L6K5l3J64j80j1J9L4K23q4j29j13J44K2j28M3K1j2j00
2469B9J23Q6l6J8q4J4k9K6Q2j56J23j46J62r9O7n4Q2r3j2m6N3q0J55K5J08l5Jj47m5LO4p0
2311H9O5n5l2M7P5M9j04N7J49j91r7R9j40K46m8p4Kq7kJ75k3j30jL0KK3n8pJ0J02J18o8n0
2149A71%j38Q2N6n9P5k9q2N0R9J05k86O2l1P8K9K9J6j30l5L4J5J9r9J28n5O1n9O9m7K0k7J30
$$ plain form
3251 76 89 127 124 195 116 82 186 99 106 227 188 76 145 100 142 168 95 151 163 172 28 102 196 66 185 341 174 121 103 35 95 160 222
3089 222 301 59 121 188 85 118 315 192 63 199 87 66 69 90 147 57 211 145 172 40 129 203 119 94 154 187 92 20 115 37 81
2936 81 83 105 217 40 279 210 317 104 138 152 127 74 153 266 160 78 147 100 119 230 200 82 77 46 223 197 53 255 202 89
2789 89 165 193 199 109 72 205 181 152 123 193 146 75 98 177 58 11 68 209 82 147 115 69 86 165 96 24 84 64 30 127 52 65 72 147
2621 147 112 147 197 201 99 107 68 80 217 173 71 88 124 149 116 280 100 89 108 142 365 281 152 39 183 205 77 120 141 129 29
2469 29 152 238 202 220 136 150 121 147 229 73 196 50 212 113 180 126 208 115 103 57 110 30 185 210 318 283 284 137 92 95 159 89
2311 89 154 99 67 114 189 238 134 191 340 149 52 151 11 257 209 135 137 50 48 223 200 70 69 99 101 124 66 59 69 171 289 221 171
2149 171 171 33 115 171 112 187 158 76 126 225 330 44 106 75 153 182 211 227 97 62 96 111 130 31 159 104 165 106 175 128 148 121 251
1986B51j59J21K0j86P1N2n3J17oJ02j79kj16K96J4k27kM0Rj10k1J71lr1L5K3jnj20J81j57
1834F5J10p5KR2n3m8N2n6J66%n8j03l8K6j4J48O2n9j72N7O8l2o6R2k9q2j8L5P4N6k4lo6OP2
$$ plain form
1986 251 92 213 233 47 118 170 117 234 228 330 151 149 33 329 343 116 114 154 163 53 32 203 200 109 144 167 166 161 41 222 65
1834 65 175 100 102 194 141 93 145 89 255 255 197 94 56 82 68 216 278 219 47 104 172 140 74 166 137 55 37 72 146 202 178 175 109 115 187
$$ [...]
-514A40
##END NTUPLES=	nD NMR SPECTRUM
##END=	
##END=	
