##TITLE=	Nov18-2021.61.ser
TM-VI-170 acetone-d6 Ca+Bz-pyr. cosy
##JCAMP-DX=	6.0	$$ MestReNova 14.3.0-30573
##DATA TYPE=	LINK
##BLOCK_ID=	1
##BLOCKS=	2    
##ORIGIN=	Mestrelab Research S.L.
##OWNER=	hrzepa
##$MNOVA/LINK_BLOCK_TYPE=	ITEM	$$ NMR Spectrum
##$MNOVA/ITEM/POLYGON=	(XY..XY)
5321,5835
8722,5835
8722,8208
5321,8208
5321,5835
##$MNOVA/ITEM/Z=	0
##$MNOVA/ITEM/ANGLE=	0
##TITLE=	Nov18-2021.61.ser
##JCAMP-DX=	6.0	$$ MestReNova 14.3.0-30573
##BLOCK_ID=	2
##DATA TYPE=	MNOVA NMR VIEW DATA
##DATA CLASS=	MNOVA VIEW DATA
##$MNOVA/2D/THRESHOLD=	1.1959973573684692383
##$MNOVA/ITEM/ZOOM/X=	-1.2849552731019482366,	11.297254598524760993
##$MNOVA/ITEM/ZOOM/Y=	-1.2849552731019482366,	11.297254598524760993
##END=	
##TITLE=	Nov18-2021.61.ser
##JCAMP-DX=	6.0	$$ MestReNova 14.3.0-30573
##BLOCK_ID=	3
##DATA TYPE=	nD NMR SPECTRUM
##DATA CLASS=	NTUPLES
##NUMDIM=	2
##ORIGIN=	Bruker BioSpin GmbH
##OWNER=	nmr
##.OBSERVE FREQUENCY=	400.20200099999999566
##.OBSERVE NUCLEUS=	^1H
##.SOLVENT NAME=	Acetone
##.PULSE SEQUENCE=	cosygpqf
##LONGDATE=	2021/11/18 14:20:21.000
##.ACQUISITIONMODE=	SIMULTANEOUS (DQD)
##$ORIGINAL FORMAT=	Bruker XWIN-NMR
##$MNOVA/SCALES_VERSION=	7
##$PARAMETER FILE=	(acqu2s, ASCII, //ch-nmrserv3.ch.ic.ac.uk/Av400C/agmb/nmr/Nov18-2021/61/acqu2s, 0)
$$ ##TITLE= Parameter file, TOPSPIN		Version 3.2
$$ ##JCAMPDX= 5.0
$$ ##DATATYPE= Parameter Values
$$ ##NPOINTS= 221	$$ modification sequence number
$$ ##ORIGIN= Bruker BioSpin GmbH
$$ ##OWNER= nmr
$$ $$ 2021-11-18 14:29:20.913 +0000  nmr@CZC2439F63
$$ $$ /opt/topspin/data/agmb/nmr/Nov18-2021/61/acqu2s
$$ $$ process /opt/topspin3.2/prog/mod/go
$$ ##$ACQT0= 0
$$ ##$BF1= 400.2
$$ ##$FnMODE= 1
$$ ##$NUC1= <1H>
$$ ##$NusJSP= 0
$$ ##$NusT2= 1
$$ ##$NusTD= 220
$$ ##$O1= 2001.00000000702
$$ ##$SFO1= 400.202001
$$ ##$SW= 12.5944462247833
$$ ##$SW_h= 5040.32258064516
$$ ##$TD= 220
$$ ##END=
$$ 
##$PARAMETER FILE=	(acqus, ASCII, //ch-nmrserv3.ch.ic.ac.uk/Av400C/agmb/nmr/Nov18-2021/61/acqus, 0)
$$ ##TITLE= Parameter file, TOPSPIN		Version 3.2
$$ ##JCAMPDX= 5.0
$$ ##DATATYPE= Parameter Values
$$ ##NPOINTS= 12	$$ modification sequence number
$$ ##ORIGIN= Bruker BioSpin GmbH
$$ ##OWNER= nmr
$$ $$ 2021-11-18 14:29:24.274 +0000  nmr@CZC2439F63
$$ $$ /opt/topspin/data/agmb/nmr/Nov18-2021/61/acqus
$$ $$ process /opt/topspin3.2/prog/mod/shimcntl
$$ ##$ACQT0= 1000000
$$ ##$AMP= (0..31)
$$ 100 100 100 100 100 100 100 100 100 100 100 100 100 100 100 100 100 100
$$ 100 100 100 100 100 100 100 100 100 100 100 100 100 100
$$ ##$AMPCOIL= (0..19)
$$ 0 0 0 0 0 0 0 0 0 0 0 0 0 0 0 0 0 0 0 0
$$ ##$ANAVPT= -1
$$ ##$AQSEQ= 0
$$ ##$AQ_mod= 3
$$ ##$AUNM= <au_zg>
$$ ##$AUTOPOS= <48 >
$$ ##$BF1= 400.2
$$ ##$BF2= 400.2
$$ ##$BF3= 400.2
$$ ##$BF4= 400.2
$$ ##$BF5= 400.2
$$ ##$BF6= 400.2
$$ ##$BF7= 400.2
$$ ##$BF8= 400.2
$$ ##$BYTORDA= 0
$$ ##$CAGPARS= (0..11)
$$ 0 0 0 0 0 0 0 0 0 0 0 0
$$ ##$CFDGTYP= 0
$$ ##$CFRGTYP= 9
$$ ##$CHEMSTR= <none>
$$ ##$CNST= (0..63)
$$ 1 1 145 1 1 1 1 1 1 1 1 1 1 1 1 1 1 1 1 1 1 10 10 30 40 1 1 1 1 1 1 1 1
$$ [...]
$$ 0 0 0 0
$$ ##$ShimPowMaxUC= (0..63)
$$ 130000 130000 130000 130000 130000 130000 130000 130000 130000 130000 130000
$$ 130000 130000 130000 130000 130000 130000 130000 130000 130000 0 0 0 0
$$ 0 0 0 0 0 0 0 0 0 0 0 0 0 0 0 0 0 0 0 0 0 0 0 0 0 0 0 0 0 0 0 0 0 0 0 0
$$ 0 0 0 0
$$ ##$ShimPowMaxUG= (0..63)
$$ 524287 524287 524287 524287 524287 524287 524287 524287 524287 524287 524287
$$ 524287 524287 524287 524287 524287 524287 524287 524287 524287 0 0 0 0
$$ 0 0 0 0 0 0 0 0 0 0 0 0 0 0 0 0 0 0 0 0 0 0 0 0 0 0 0 0 0 0 0 0 0 0 0 0
$$ 0 0 0 0
$$ ##$ShimPowRcbType= 3
$$ ##$ShimPowRes= (0..63)
$$ 1e-20 1e-20 1e-20 1e-20 1e-20 1e-20 1e-20 1e-20 1e-20 1e-20 1e-20 1e-20
$$ 1e-20 1e-20 1e-20 1e-20 1e-20 1e-20 1e-20 1e-20 0 0 0 0 0 0 0 0 0 0 0 0
$$ 0 0 0 0 0 0 0 0 0 0 0 0 0 0 0 0 0 0 0 0 0 0 0 0 0 0 0 0 0 0 0 0
$$ ##$ShimPowRng0= (0..63)
$$ 1 1 1 1 1 1 1 1 1 1 1 1 1 1 1 1 1 1 1 1 0 0 0 0 0 0 0 0 0 0 0 0 0 0 0 0
$$ 0 0 0 0 0 0 0 0 0 0 0 0 0 0 0 0 0 0 0 0 0 0 0 0 0 0 0 0
$$ ##$ShimPowRng1= (0..63)
$$ 1 1 1 1 1 1 1 1 1 1 1 1 1 1 1 1 1 1 1 1 0 0 0 0 0 0 0 0 0 0 0 0 0 0 0 0
$$ 0 0 0 0 0 0 0 0 0 0 0 0 0 0 0 0 0 0 0 0 0 0 0 0 0 0 0 0
$$ ##$ShimPowRng2= (0..63)
$$ 1 1 1 1 1 1 1 1 1 1 1 1 1 1 1 1 1 1 1 1 0 0 0 0 0 0 0 0 0 0 0 0 0 0 0 0
$$ 0 0 0 0 0 0 0 0 0 0 0 0 0 0 0 0 0 0 0 0 0 0 0 0 0 0 0 0
$$ ##$ShimPowRng3= (0..63)
$$ 1 1 1 1 1 1 1 1 1 1 1 1 1 1 1 1 1 1 1 1 0 0 0 0 0 0 0 0 0 0 0 0 0 0 0 0
$$ 0 0 0 0 0 0 0 0 0 0 0 0 0 0 0 0 0 0 0 0 0 0 0 0 0 0 0 0
$$ ##$ShimSysFunc= (0..63)
$$ 1 2 3 4 5 7 9 11 15 16 8 10 12 14 6 17 13 18 19 20 0 0 0 0 0 0 0 0 0 0
$$ 0 0 0 0 0 0 0 0 0 0 0 0 0 0 0 0 0 0 0 0 0 0 0 0 0 0 0 0 0 0 0 0 0 0
$$ ##$ShimSysMatrix= 0
$$ ##$ShimSysType= 1
$$ ##$TFXNUM= 0
$$ ##$TRIPLO2= 0
$$ ##$VTU= 2
$$ ##$VTUETH= <149.236.99.20>
$$ ##$VTUTY= <no>
$$ ##$WBREFAM= (0..15)
$$ 135.5 97.7 100 100 100 100 100 100 100 100 100 100 100 100 100 100
$$ ##$WBREFLM= (0..15)
$$ 0 0 0 0 0 0 0 0 0 0 0 0 0 0 0 0
$$ ##$WBREFPH= (0..15)
$$ 72.26 -67.22 0 0 0 0 0 0 0 0 0 0 0 0 0 0
$$ ##$WBSGU= (0..15)
$$ 0 0 0 0 0 0 0 0 0 0 0 0 0 0 0 0
$$ ##$XFAC= 2
$$ ##END=
$$ 
##$DECIM=	3968
##$DSPFVS=	20
##.ACQUISITIONSCHEME=	NOT PHASESENSITIVE
##NTUPLES=	nD NMR SPECTRUM
##VAR_NAME=	FREQUENCY1,	FREQUENCY2,	SPECTRUM
##SYMBOL=	F1,	F2,	Y
##.NUCLEUS=	1H,	1H
##.OBSERVE FREQUENCY=	400.20200099999999566,	400.20200099999999566
##VAR_TYPE=	INDEPENDENT,	INDEPENDENT,	DEPENDENT
##VAR_FORM=	AFFN,	AFFN,	ASDF
##VAR_DIM=	1024,	1024,	1048576
##UNITS=	HZ,	HZ,	ARBITRARY UNITS
##FIRST=	4521.1612903296090735,	4521.1612903296090735,	0.11538662761449813843
##LAST=	-514.23910029539968036,	-514.23910029539968036,	0.18212939798831939697
##MIN=	-514.23910029539968036,	-514.23910029539968036,	-0.0085154213011264801025
##MAX=	4521.1612903296090735,	4521.1612903296090735,	536.2762451171875
##FACTOR=	1,	1,	0.0014788519324500689744
##PAGE=	F1=4521.16
##FIRST=	4521.1612903296090735,	4521.1612903296090735,	0.11538662761449813843
##DATA TABLE=	(F2++(Y..Y)), PROFILE
$$ [...]
##PAGE=	F1=2020.69
##FIRST=	4521.1612903296090735,	4521.1612903296090735,	0.12340982258319854736
##DATA TABLE=	(F2++(Y..Y)), PROFILE
2006C44l4Q4K75J79N54J5871R80j4096k563p10m55J75l61L1J01o1j84R6j1K0M5k36L50k35
1888A59j7nj2O4j40K67k48j1Q9p4J06J83k12m1l4O3k0qML5n5J03K5Mj47n3K4L3L3j8K06j76
1730A27o3N2m8J1j3M5M5j09J11q8P0p9J75j17K6kj03J09j24J33j1l7M0l6J07j05Ro1m4L9P3
1578A32k1l0Pp0J62J29j78l4KJ68j52R4j08J03j09j9P5mlq0R04p5q84J99R1R2j26p0j21J26
1430B00m2P9O6k77L15k09qp6J12m6O1l9R2j84J78M2o4l0J03j66M4j45J24n6P0r6P2j9K5K5
1282A51K2l5j00J33o3qP6rr3O5n0k4J5L2l0Q4N0j06Q5j12k1J58j03p1K70j32l4Pr7R2k7o0
1125F5L6O9k8NN6m5J7q3Q8J05j26j27P6J09j9j41NNm0J93p0j3k6L0j01Q7J20j93M8O5l6J08
967B39j59PL5J57j88N9M9p2o9N3QM2m6R8K9j24q3Q3J4m1m8M4j5P2p1Pl3K80J18m8j35k05K10
$$ y = [344, 310, 394, 669, 848, 1402, 17273, 18253, 4157, 1594, 884, 429, 604, 243, 274, 375, 314, 130, 226, 215, 235, 280, 44, 394, 159, 142, 137, 125, 189, 49, 316, 68, 57, 146, 72, 178, 361, 149, 108, 74, 137, 117, 109, 113, 148, 93, 196, 221, 225, 78, 25, 49, 82, 115, 97, 303, 127, 64, 116, 68, 79, 66, 111, 156, 47, 158, 70, 140, 61, 236, 119, 145, 143, 40, 149, 25, 158, 147, 110, 150, 114, 221, 116, 125, 64, 20, 59, 132, 111, 81, 88, 18, 180, 309, 131, 97, 99, 267, 115, 209, 101, 204, 95, 76, 151, 147, 144, 64, 968, 893, 9, 208, 299, 391, 265, 195, 74, 200, 158, 237, 303, 26, 341, 132, 124, 48, 160, 114, 175, 136, 228, 44, 222, 264, 200, 170, 273, 107, 151, 6, 130, 74, 144, 48, 120, 101, 126, 151, 173, 138, 38, 171, 108, 100, 176, 167, 74, 139, 89, 65, 80, 112, 82, 166, 216, 110, 195, 83, 62, 220, 117, 46, 316, 184, 150, 157, 60, 152, 125, 65, 101, 170, 142, 147, 203, 158, 175, 92, 180, 285, 159, 32, 108, 217, 198, 57, 62, 67, 27, 220, 150, 137, 111, 141, 40, 127, 247, 54, 102, 167, 131, 239, 80, 87, 122, 279, 91, 150, 199, 127, 58, 111, 119, 161, 115, 213, 242, 118, 35, 118, 132, 91, 43, 87, 72, 144, 73, 80, 47, 327, 445, 397, 262, 57, 267]
805B67n3r3P2o9o2J05K7n4n5Q6l5n0J83p9K2j12N4r3P0p8M3K8J06j25L3o1k8L0J29j05J42
652B45R3j39j96J04J08R1j93q0J10j2M8Q1j29J5n4k9J3j2j5O3nN1l3JN7m3lJ2Q9J22j75p5
495A10J38p1P7q9L6L6M4j07N3Q7m6j4Qk6j49k7LK7J05P2j04j04RK5K2K3k3J21j82O3K2p9Q9
332A49P3O1q3j36J6K3l3O1q2R6o2J4L3p5Q3J71j49r8Jk5P4M1j16J37m3PK3J66j68j33O3J67
175B56j75Q8L3m5m6k8k8J18M0j47O3j02Q6jN4k0J3l5o8L3m3J0M4R0o7LJ24j13q0QQL6N7j7
8A49J6j23J1K3m1M1J33o2on5k2L3J7Pk6K4l0J57rr7KP7j11Q1q5j5O3q6J03m4j2N9m0p0M6M8
-170A56j10N0nJ60j30n9j2J23l5K0j4j13R7r2K1J22p4J9N2J2j32Q5O9P1j54L9j04Q3l9k1J23
-322B08q8J2Qk5K6K6K1j2k1n5r1R7J3L0j6L9l5L3j27RP0L7O1j7q1j14M1J18m7N2j01j0L9p5
$$ y = [267, 214, 121, 193, 124, 62, 167, 194, 140, 85, 171, 136, 86, 269, 190, 212, 100, 154, 61, 131, 53, 96, 124, 230, 105, 138, 77, 49, 79, 208, 103, 245, 338, 199, 3, 107, 215, 306, 113, 33, 143, 131, 179, 260, 131, 146, 92, 63, 76, 64, 49, 112, 107, 158, 125, 126, 183, 140, 137, 149, 238, 360, 185, 110, 248, 177, 254, 165, 201, 237, 281, 174, 227, 314, 268, 254, 262, 236, 87, 60, 63, 90, 195, 267, 163, 59, 68, 93, 115, 138, 115, 236, 54, 117, 139, 60, 149, 222, 283, 200, 64, 80, 103, 70, 131, 49, 145, 83, 97, 130, 55, 138, 309, 160, 62, 63, 38, 112, 153, 37, 174, 131, 138, 161, 327, 159, 26, 89, 256, 81, 169, 202, 157, 111, 83, 55, 173, 213, 66, 129, 27, 113, 112, 166, 146, 159, 124, 56, 89, 46, 56, 100, 190, 123, 126, 250, 137, 57, 65, 73, 109, 166, 149, 165, 42, 53, 76, 35, 76, 209, 147, 141, 86, 64, 97, 114, 121, 95, 119, 89, 246, 237, 140, 142, 219, 108, 189, 104, 89, 152, 66, 169, 125, 113, 172, 132, 62, 108, 156, 46, 96, 91, 251, 121, 62, 50, 173, 138, 158, 144, 31, 128, 36, 57, 179, 105, 124, 176, 188, 56, 141, 210, 281, 127, 166, 62, 145, 106, 85, 208, 120, 132, 140, 115, 141, 167, 188, 176, 155, 100, 9, 106, 119, 149, 133, 172, 137, 170, 43, 52, 122, 159, 220, 203, 122, 8, 49, 167, 120, 172, 71, 61, 100, 25]
-490B5KJ8L4O8r4
$$ y = [25, 27, 45, 79, 147, 53]
-514E3
##PAGE=	F1=2015.77
##FIRST=	4521.1612903296090735,	4521.1612903296090735,	0.12249083071947097778
##DATA TABLE=	(F2++(Y..Y)), PROFILE
4521H2n4M7k5KL5OJ3k6M3p8J02j36Q1RL0rk3N1N0K5q0o8P8k2J47L5j06j56O8m4J0J53q1l8
4354A21m8j5J23p6L3J17j71P2j22%Q6J78m6p3lkR9p8Nj05R8L1m7j7j8j8J22Nk02J25K0j20
4196G4mN1m1J02j54J07l5j5L6m9K4K5m9N1J8j19RM6M9o0j5J49j42Q6j8l0J3j0n6J21J03r7
4039A70k9j30OJ72n9n8njP0j10J27m1Q1j7j50L2J97j41R0r4l3Q8q1j6J4R1R4k18K54j2j57
3886A34o6o1K29p1j52J48K2j05M8k0J14j21O0j18R5J48j52P7r9l9Q3r6j1Q1N8j39JK8J31p8
3739A29P9Q9j96OO1r5J00M6j21L6J15j65Q0j15J02l9O2ro3J2J12j26K8M3l5n2J14m9Qq4J22
3586A95n2n5O4J43j34J1k7o1mJ44K5q5l5N4j25P5R5O2j96Q5o8l5n1J03m7J9o4J05j9K5l2p5
3428D0O9KL6N3r6L7q8j0J13Rj02Q0j10O8n6R9K3M8j15J0J2L5j23J54m8J30J1k32J04n1lO4
$$ y = [82, 28, 75, 50, 52, 87, 93, 106, 80, 123, 45, 147, 11, 92, 101, 131, 122, 99, 150, 200, 225, 145, 77, 155, 133, 280, 315, 209, 53, 121, 77, 87, 240, 159, 121, 73, 58, 181, 105, 138, 255, 84, 156, 34, 34, 120, 298, 252, 179, 176, 174, 273, 195, 200, 95, 193, 224, 177, 160, 142, 124, 246, 251, 49, 174, 194, 74, 70, 121, 80, 182, 28, 135, 100, 85, 121, 72, 96, 121, 72, 123, 141, 22, 31, 77, 126, 66, 51, 200, 58, 144, 126, 96, 109, 99, 43, 164, 267, 170, 141, 11, 17, 189, 130, 72, 67, 66, 136, 26, 153, 112, 193, 176, 26, 58, 255, 114, 204, 110, 77, 165, 84, 68, 82, 173, 267, 49, 303, 291, 134, 68, 7, 236, 165, 13, 161, 183, 78, 126, 106, 220, 99, 159, 41, 136, 284, 132, 209, 110, 71, 154, 58, 47, 128, 186, 47, 48, 76, 207, 129, 208, 297, 101, 107, 168, 73, 173, 219, 98, 134, 249, 84, 164, 49, 151, 112, 174, 165, 102, 114, 226, 100, 128, 171, 136, 84, 198, 149, 157, 73, 195, 143, 88, 152, 295, 161, 172, 145, 84, 80, 224, 249, 164, 129, 183, 58, 133, 228, 290, 94, 179, 111, 76, 25, 128, 81, 100, 36, 141, 122, 147, 115, 40, 109, 111, 147, 200, 104, 141, 53, 43, 156, 165, 63, 143, 33, 101, 45, 144, 167, 215, 100, 110, 122, 157, 34, 188, 140, 270, 281, 49, 153, 102, 99, 163]
3271A63j11Q7Q3m3M3j20m0MJP9m6L8%q7L0N6Qm9L5O1j08Q0m6K2P5n8k4n9R9M5j80O1mj2m5
3099C8P7n1J22K0N9O7j97m9Q5p8L2Q2j14J16oj01m9J87l4n7o4L8l9J64l6j33K4J66j11K5Q3
2946B66r9o6o3O9k9o6Q7l6P4P3l5J50j89P4j38O5J29r1r2m4J65N4j52m6M0l3L0j9J47p4jJ43
2789B93k12p2J44K7m0L8p7MN1r9N3p2L0L7R0K5j90j4J92r9m2N8J03j19K9O2j3j35M5j7o3R9
2631A16o0K01j10j10Q3n4Q9J03p1j33J16N0r8P9M1j3n8n7j0P9o9J9jq2O7m6o0J0N4kpJ06j
2469A71J83p4k41K55J44k34j34J25J93j58j25M3N9j72R0O0j12N8m6j2O4R0K7k08K05l0j0m6
2331A65J23j62J32j60k3k3oQ7Q7k5o2n1Q5r8O6j18P1l0k9P3P5j07J01kr2J47j68N6l7Q0R8
2178B53j17M1J71k36n3QJ14p8q8J81j38m1N6OQ8Q6k08K01J4j11J22J26j09l5l0q0L89j59k29
$$ y = [163, 52, 139, 222, 179, 222, 102, 62, 66, 67, 146, 100, 138, 138, 51, 81, 137, 145, 96, 131, 192, 84, 164, 118, 140, 215, 157, 133, 74, 173, 218, 38, 99, 95, 83, 38, 115, 64, 186, 206, 265, 332, 135, 86, 171, 93, 125, 207, 93, 209, 203, 102, 53, 240, 206, 149, 85, 123, 84, 248, 212, 79, 103, 269, 158, 183, 266, 167, 101, 38, 107, 78, 12, 99, 63, 137, 210, 175, 325, 136, 210, 72, 137, 266, 175, 83, 39, 204, 258, 106, 60, 100, 67, 97, 78, 225, 151, 150, 293, 81, 9, 153, 180, 140, 178, 101, 105, 156, 57, 110, 38, 68, 105, 195, 220, 30, 16, 208, 109, 67, 125, 228, 109, 138, 200, 187, 52, 97, 80, 17, 116, 56, 257, 147, 37, 120, 66, 155, 258, 187, 54, 170, 220, 122, 201, 242, 229, 171, 114, 104, 183, 114, 133, 132, 50, 117, 71, 11, 21, 75, 73, 66, 172, 171, 354, 280, 39, 294, 438, 204, 70, 195, 388, 230, 105, 148, 207, 35, 125, 185, 73, 131, 85, 73, 137, 227, 254, 46, 251, 221, 211, 165, 288, 126, 258, 98, 75, 52, 46, 133, 220, 195, 133, 82, 167, 69, 135, 17, 88, 58, 29, 102, 177, 70, 171, 169, 77, 224, 56, 112, 75, 155, 253, 136, 177, 348, 112, 59, 67, 181, 103, 15, 196, 58, 17, 73, 79, 167, 253, 45, 246, 260, 149, 271, 397, 288, 253, 223, 143, 532, 373, 144]
2035A44J74k05K51j1J76p3k4Q0L66J46Q73J9842J507j7735l444r06n72J02l26K9O2n8k05P3
1917B66j6RK4k10L21k24M8p0k4P3j04K18j94k6Q5j21R9J82k24j6K1l7L8l4P3mn6J01RN8j72
1765I3J0l5K3L9k3J68j41m2J9o5QrN0P9j16J42j01K7q1K21j37K9K6j08O1j29J30L2o4kj9J83
1607B68j38Lp5k9M3O4l5j8Nn8J59J65k16m4K2J38j00M5j03J02j30J3K5L6L9p7O90j3p23J59
1460B17K6J19r8q3m2M1j8N6N0k27K66j76j2l9P6n3R5q3J19j46R0N7k9p9J48j83K4o6L1K5P9
1307A85j21M9m1M9L2kn7l9J16m0k0K8Jm5K5n0PL0%oP9k1p1J46j57K5J35j10p7K24q5j7n3m9
1140G0J28o6o6mJ00llPl3K3l5N0P5j12r8M2J09j7j32rN2l8J82q7l1J3L3j09J02P7j40N6J8
977A54l7R6j47k4P3J62j67L5O0q5m9K8k1Q6p5Q0Q1j51o1J05nm1o9J04n7O8m9Om3K17J25k7
$$ y = [144, 318, 113, 364, 353, 529, 456, 432, 512, 878, 1024, 1897, 21739, 23246, 5511, 2067, 1161, 589, 691, 365, 394, 456, 398, 193, 266, 250, 259, 283, 73, 394, 170, 218, 148, 124, 197, 93, 311, 117, 91, 176, 55, 154, 336, 112, 96, 117, 80, 118, 84, 157, 153, 97, 198, 207, 265, 93, 103, 68, 91, 130, 107, 275, 134, 92, 111, 46, 54, 45, 95, 174, 58, 200, 99, 126, 45, 266, 129, 158, 184, 76, 137, 8, 138, 170, 106, 104, 85, 268, 130, 133, 58, 29, 72, 136, 101, 83, 88, 30, 189, 354, 138, 94, 116, 254, 154, 199, 96, 198, 68, 81, 106, 142, 181, 104, 794, 781, 58, 217, 243, 362, 264, 181, 139, 180, 162, 218, 268, 41, 307, 131, 119, 80, 156, 103, 198, 115, 234, 88, 178, 235, 206, 127, 275, 92, 116, 50, 81, 106, 185, 64, 113, 72, 121, 153, 151, 94, 55, 171, 131, 111, 139, 140, 95, 120, 70, 77, 107, 107, 101, 180, 159, 88, 234, 77, 102, 237, 127, 50, 274, 189, 172, 119, 70, 198, 132, 66, 62, 162, 159, 156, 163, 130, 153, 118, 168, 243, 131, 33, 75, 184, 167, 35, 26, 78, 40, 222, 135, 104, 117, 150, 41, 143, 220, 80, 136, 154, 117, 213, 66, 42, 115, 277, 110, 145, 205, 120, 71, 99, 78, 164, 89, 169, 250, 99, 38, 143, 138, 97, 28, 132, 75, 143, 94, 100, 57, 274, 399, 372]
820C72r3k61L03r2j73P3K9p9Q7J0j9r1J16oq7J98o8Rq9j4j07J49r3K9QR5j21J02n7o3MJ36
662B07j20J20J47j40j60P2J14R0k33n2J47m2MJ15r8K3o8k6l5J3j0OL1P1J5m1J8m0m3MJ13J47
505C49j74j9J33j18O9q6K2O1J43j72J6N0j1L4l4m3r4k5k4K6J03P1j05j04jJ6PP9n2O9j17M9
347A18Mn3P7JR4k3r5lm0J6M0p0P7q6P1Kn7O1K00j67p5J3n9J8L2n2J16n3N9l0J39j62n5L2J98
175B88j78P0j9j8o4k6J3R4Oj20R0p4P0K0m0L9J3n3n2N8l8m5%J06j4j3J45j06j18N1J2n4R7
12A40K8Nj03oM5p0P3J35q0k6l6k8K1k7J6j4K3mJ50n6l8MN5j11J06j00J3K4r0M6%%P4ln5k5
-165H6N9p6J8K5J06j12j3KQ2MOl8j29J26j19j8J57p4P0L7j3j24Q7PJ36j92N2j02N1kj5J28
-322B12r5pM0m5J8M5J2J1k0o4n2N8K8kQL4m0Or9KO6M9N5o3o5n3mR7l6M1p7L7L3q5j0jM4J00
$$ y = [372, 279, 18, 321, 229, 56, 129, 158, 79, 166, 176, 157, 66, 182, 176, 89, 287, 219, 228, 139, 125, 18, 167, 74, 103, 111, 206, 85, 187, 130, 67, 71, 207, 87, 207, 354, 214, 54, 126, 240, 330, 97, 45, 192, 150, 154, 269, 171, 194, 126, 100, 65, 78, 68, 74, 105, 176, 191, 150, 168, 128, 85, 89, 202, 349, 175, 156, 289, 171, 240, 154, 176, 237, 380, 208, 224, 274, 263, 297, 263, 220, 126, 101, 77, 103, 206, 277, 172, 68, 67, 83, 90, 169, 117, 186, 69, 118, 122, 69, 146, 147, 241, 218, 123, 120, 80, 96, 136, 66, 143, 57, 128, 130, 73, 134, 334, 167, 92, 105, 46, 64, 96, 44, 160, 107, 166, 136, 275, 113, 58, 90, 288, 110, 180, 161, 143, 79, 53, 66, 160, 166, 46, 136, 62, 132, 152, 112, 151, 164, 111, 59, 117, 79, 34, 34, 140, 126, 113, 258, 152, 34, 85, 97, 43, 140, 168, 173, 70, 64, 109, 39, 112, 247, 167, 141, 105, 77, 98, 71, 87, 73, 96, 92, 242, 186, 148, 152, 207, 96, 202, 102, 115, 139, 49, 95, 95, 95, 169, 166, 111, 86, 145, 69, 87, 112, 218, 106, 93, 95, 177, 181, 187, 149, 20, 146, 27, 9, 166, 92, 162, 199, 186, 62, 149, 156, 292, 100, 152, 50, 101, 99, 84, 212, 117, 110, 150, 105, 123, 168, 180, 191, 171, 107, 55, 113, 141, 139, 147, 181, 141, 147, 48, 50, 116, 165, 220, 157, 92, 39, 35, 132, 96, 137, 60, 97, 130, 45, 35, 34, 78, 178]
-509A78j00
$$ y = [178, 78]
-514G8
##PAGE=	F1=2010.84
##FIRST=	4521.1612903296090735,	4521.1612903296090735,	0.1215718388557434082
##DATA TABLE=	(F2++(Y..Y)), PROFILE
4521H2m2M9m3J2M6m5O5m9M5l2R6j73N3M4M5l2j0M5N0L4j09n5R8o9J38O1p8j78M7l1J0J53r4
4359A33o1K2l2J11n5J1J25j74J25j58QL5K37l2q8rm2J00o6J7j27J21M4m5o1j9l6J35%j91J21
4206A49K9p0j3O5p5O9q1J10q8m7Q3n3K2K2l1l4N9p2K1L8Q3n3p5P7j14J77r7oM7n4n2J13J14
4044B63j18l6r2j9J89k2j21O3k3M7q9J40o2O7j0j20K5J44j55J92j43n3R0j13j7M1J18P7k36
3901B7K79j9j46p7m6J30n1o8R3Om3Pj3J09m2jj10R3J67j77J17j37j5O3m9j6L0Q5j55K5N5J25
3743B46j31J51jj46NO0j33J12M4j00NJ70j70O1r5M9k1L4Rm6j9J26j19O9K4n4k8R4p1M3m6P6
3586A98q1l4O2J17j17M9n1j8o0J28M8p4pM8j18M7Q3N0j59K9o8K3l6J22p6k0k9J06k8K8n5o4
3428D3P3J8OP5j22O6r6m0J83Kj72R1j7k9o2J04K4N7j37K2Q9kj39J38pJ16k6j92Q0q5N3J08
$$ y = [82, 40, 89, 46, 58, 104, 59, 124, 75, 120, 88, 184, 11, 64, 108, 153, 121, 111, 156, 206, 240, 131, 76, 174, 105, 243, 304, 226, 48, 95, 64, 74, 227, 133, 72, 94, 62, 173, 118, 129, 254, 80, 205, 47, 55, 90, 327, 295, 207, 198, 156, 256, 190, 207, 80, 201, 245, 200, 139, 120, 84, 219, 219, 28, 149, 178, 108, 95, 160, 85, 154, 73, 183, 95, 48, 131, 78, 100, 122, 91, 57, 116, 44, 65, 103, 186, 133, 58, 135, 21, 198, 101, 95, 142, 88, 36, 149, 263, 145, 109, 17, -2, 187, 165, 44, 107, 84, 131, 42, 182, 120, 187, 177, 57, 82, 226, 71, 263, 120, 67, 157, 44, 27, 68, 186, 263, 27, 306, 287, 141, 64, 18, 148, 97, 29, 122, 128, 85, 92, 79, 188, 146, 145, 35, 128, 295, 118, 235, 98, 83, 146, 97, 81, 111, 196, 41, 66, 121, 246, 115, 266, 265, 119, 124, 184, 51, 163, 207, 107, 112, 282, 112, 173, 78, 127, 106, 140, 149, 103, 84, 210, 91, 160, 184, 130, 102, 196, 125, 168, 122, 198, 117, 83, 145, 262, 145, 194, 143, 125, 65, 193, 241, 167, 160, 208, 90, 137, 220, 270, 111, 140, 72, 95, 59, 181, 105, 85, 56, 162, 134, 162, 107, 43, 116, 134, 140, 215, 93, 159, 63, 23, 206, 208, 36, 127, 110, 81, 19, 123, 147, 204, 67, 89, 178, 176, 37, 175, 168, 284, 258, 66, 146, 61, 114, 222]
3271B22j07jM6MN5j47M8qk6N2llN0q6KN7K9p1L5N2j18O9m1N8M5p6j8l3R4O1j88K3L2J6p0P3
3094A27m6J42%%O5j23r3R6q3M0P6r1R8lj44m2K05k8m2p6K5l1J82oj89Q7J62r2k6P5q0j05p0
2931A0J18j4p5N1J8%J14j75J09j07O8p4P7J09n8q2o5J83O1j93RK2j2l0OJ74q1l4J11j46n4
2779D0J00K3j8L8r3n1Q2p6O7m2K1j2J31%j98J2J73r5j9J4R0n5k0R0Oj83R0km6P3j24K10j07
2616A19q3Q6j10J12J26n7j48J58L6j63J82k8l7n7n3k0J27n3j5pm9L4j4m0j6L0P7l7J00m1J60
2464C19m2k52K47J70k06j73R6K18p3j50K6K6j78N4L4Jj4p8N9P7P0k2j43J81Mmo5J10j41R2
2316B43j02p0j0j0P8P8j5n6l8N4n5P2j68J09j7p2Q2Q3q1M9K9j32J76j96J06k7L1O8m9K0J87
2163C67k64l3jJ13q0q4J87j98K0K5%Q6M1j24J69jn6R4J11j12k1q1mR2j34%K09k37K09o9K00
$$ y = [222, 115, 114, 160, 164, 219, 72, 120, 112, 86, 138, 135, 132, 182, 96, 98, 155, 184, 113, 148, 200, 82, 151, 110, 168, 213, 137, 119, 86, 180, 241, 53, 76, 108, 124, 54, 127, 81, 223, 223, 223, 288, 165, 72, 168, 85, 125, 201, 110, 208, 205, 61, 19, 224, 196, 154, 78, 103, 72, 254, 248, 59, 146, 308, 216, 190, 265, 185, 80, 10, 128, 114, 39, 90, 108, 108, 222, 47, 156, 49, 117, 43, 120, 229, 171, 89, 24, 207, 268, 75, 84, 106, 94, 64, 70, 244, 163, 129, 240, 94, 40, 140, 163, 145, 183, 90, 39, 121, 45, 112, 70, 91, 79, 210, 210, 12, 24, 197, 102, 83, 97, 187, 132, 112, 202, 208, 25, 115, 113, 67, 140, 16, 226, 119, 36, 122, 12, 124, 250, 193, 45, 203, 239, 76, 258, 230, 193, 136, 83, 63, 190, 137, 122, 115, 66, 100, 86, 46, 30, 60, 137, 100, 200, 159, 319, 277, 25, 272, 442, 236, 63, 159, 377, 304, 154, 180, 206, 28, 82, 116, 117, 103, 25, 84, 161, 231, 209, 66, 247, 251, 247, 182, 292, 151, 243, 141, 71, 61, 51, 129, 207, 192, 136, 98, 152, 97, 169, 1, 110, 93, 21, 103, 186, 105, 154, 183, 51, 227, 31, 137, 110, 141, 209, 160, 180, 367, 103, 70, 69, 182, 102, 18, 205, 7, 27, 52, 52, 138, 179, 55, 224, 223, 167, 261, 372, 260, 239, 158, 154, 246, 112, 112, 321, 84, 293, 224, 424]
2011D24mq7R8L24J6R85J3308J156j1684k759p57n41L0k24M4M2k1j94M5k3M8j1j54K56j51O6
1883B32p5q9J15j02J52r2o0O2j00R2J33j71l8R4r1L0j6P8l6n1J23J6M9j50P5r2%L3RJ01p7
1730A54n9K0n0m4J0M5J02o8J19j08qr3K59j48M1N1j15j6n5Q9L3o6j9k3K40j31k6q7rM3N1k3
1573A09m8L1j7J30J78k47m6M3J07m6nj03R8j09J8l6O2R5o2M26O7n59J25l3J56q8j12N3k7P
1425A67L1L9j71J81j09k1nL2o8J36j18J46j08oO3J9j16J60j66jQo2J08R1j41pl0O7L5k5q0
1273D9K2J00k9m5K1j3Lj5j8ON0k8NO1q5L7J31j67O4J06j17q4J83l6k4p2j3J52r7o4n2J23K2
1110A76j1m2k2L0J3LL7q8o3pR2J0r8mJ19o5J45j05m9N2L6j16J16K6r6P2j9m7P5j09l1P5J29
948B34r7nP4r2l0Ln0J29j03O2J34j79l9J28k5m0r9J56r2P3k3J1l0J13J22j3l2k34L10j08k53
$$ y = [424, 420, 333, 431, 755, 771, 1756, 15064, 16220, 4536, 1777, 1020, 479, 509, 285, 329, 371, 350, 156, 201, 178, 226, 215, 61, 317, 166, 232, 157, 68, 183, 81, 233, 141, 81, 143, 43, 135, 268, 97, 59, 153, 62, 92, 76, 154, 118, 67, 190, 206, 255, 105, 180, 88, 88, 121, 130, 231, 154, 95, 115, 65, 21, 31, 76, 178, 110, 229, 121, 113, 20, 279, 131, 172, 223, 108, 92, 37, 126, 159, 93, 74, 51, 291, 160, 134, 47, 38, 81, 132, 109, 61, 92, 75, 205, 383, 136, 90, 133, 240, 194, 189, 86, 184, 75, 93, 57, 119, 214, 152, 578, 645, 86, 211, 178, 334, 246, 134, 187, 160, 167, 198, 237, 66, 247, 138, 117, 112, 144, 76, 212, 94, 240, 132, 126, 189, 208, 92, 252, 86, 85, 93, 31, 139, 230, 89, 82, 52, 119, 154, 129, 49, 71, 171, 142, 97, 118, 105, 108, 93, 75, 81, 131, 103, 108, 169, 84, 121, 252, 85, 149, 255, 138, 54, 237, 201, 177, 105, 92, 244, 147, 83, 31, 154, 176, 165, 123, 101, 131, 144, 147, 184, 96, 33, 26, 118, 128, 30, 26, 145, 80, 225, 120, 71, 123, 159, 43, 159, 185, 89, 161, 142, 95, 170, 61, 30, 105, 234, 137, 132, 206, 114, 84, 87, 37, 166, 63, 125, 259, 80, 41, 169, 144, 104, 5, 161, 69, 142, 119, 130, 100, 213, 335, 322, 290, 56, 366, 258, 5]
795EP7J19j06O2j6K5j19J45K3j22K11o5j1o1p9l0J19r4K7j7Q2q6J38m8r5k6J40j02O4K06j37
642B29j25M1J09P5k30n1J88o7l9J49q2J9l9m7q0M2nn1O7R2O1q3k9m5o5J2J29J62j72L8J26
490C29j64O1q3%P8K49k28l4kL0Q6q1o4k5rn2K5R3O1r7r6kJ5j7J27q6J3LJ9k8m4O6p0J18K8
318B19m6j2q9P8lq0N7j09J36k1m7L1K35j74n3K5r0l4LN9N3l8P8m9O6j36K8LK29j80N1p0Rq1
150D8k5N4P1l0r3J17m5N3M2j33Q9Mo2k8P4m0n7kN1L4l5J62r1j46R4J8r0Q4O6j1m1m9O3j04
-17D2R7J30r1l6lk0Jp5Pj7K2K1J52r5K2NL3j12J32j15M1j5p6J0K5rQ5L0k9k0on2j8N1N9q5
-194I1L3J6L3L4Rm6j56J43p1m7R5n7J14J4l0j07Q4n9J69j97P7q8J9L6k7J18r4j7P1o5mN0K5
-357A66N7k7q3k1J2N1k6K7K7j8n9l3l3O6O5M1j18m0J5m7P4k8K6j9N0L0r1k0k1M6J23j06
$$ y = [5, 82, 201, 95, 157, 141, 166, 47, 192, 215, 93, 304, 239, 228, 167, 88, 58, 177, 83, 110, 93, 175, 89, 227, 179, 84, 58, 198, 96, 160, 366, 229, 104, 145, 254, 329, 99, 48, 236, 169, 130, 279, 197, 216, 177, 130, 50, 92, 87, 36, 103, 195, 256, 173, 144, 99, 34, 46, 175, 337, 165, 203, 329, 165, 226, 143, 143, 221, 470, 242, 208, 206, 236, 322, 241, 177, 152, 143, 91, 116, 209, 270, 173, 77, 75, 90, 73, 200, 114, 127, 130, 149, 121, 77, 143, 73, 191, 219, 173, 161, 72, 150, 147, 67, 124, 15, 151, 130, 83, 114, 349, 175, 122, 147, 57, 23, 26, 85, 138, 100, 178, 129, 195, 59, 87, 90, 319, 139, 190, 120, 129, 48, 23, 77, 148, 118, 25, 142, 97, 150, 192, 59, 148, 152, 90, 62, 136, 96, 39, 37, 88, 122, 87, 249, 158, 12, 106, 124, 34, 118, 184, 173, 132, 83, 146, 42, 139, 269, 178, 142, 139, 119, 120, 45, 52, 35, 57, 78, 230, 135, 157, 162, 195, 83, 215, 100, 141, 126, 50, 60, 85, 76, 161, 191, 162, 142, 136, 84, 66, 117, 176, 91, 124, 140, 173, 207, 216, 170, 14, 157, 86, 39, 134, 77, 191, 205, 175, 68, 152, 93, 262, 65, 142, 54, 73, 109, 82, 200, 106, 89, 160, 95, 91, 141, 166, 223, 196, 113, 92, 104, 155, 129, 156, 183, 165, 106, 73, 40, 106, 171, 212, 94, 54, 69, 22, 96, 68, 94, 75, 125, 155, 64, 44, 23, 69, 192, 86]
-514H6
##PAGE=	F1=2005.92
##FIRST=	4521.1612903296090735,	4521.1612903296090735,	0.11553846299648284912
##DATA TABLE=	(F2++(Y..Y)), PROFILE
4521G8j6L9o6L4O6r1P0n5O1ON4j58LQ9M8j9l9M9L2O3j49j3J02j07J07Q1l9k01O4j4j8J48j14
4359I5j5N0oL4n0OJ08j25J30j71NJ3K55k4r1j4q5J13k7Kj30J48K5m1j06lo0J52k3j45R7M9
4201A66l9j1O6j11M0K0R5j23q1J08l8K4Qk3q6J00m1j0O9Q9oj72L2lJ71j68KR2o3q6J12J28
4044B61j15n7o7oJ50J5r5O7n8L1l8R6m4M2j3q0%J01j54K60j53p3O5j29K7L7J36K0j87K80o4
3891B55j02r6l9O4l5OK2%P2p9j9J13J1l2j03P0J76j79J45j84K4N0j4J1m5R5j43K6R5Q0j44
3739A01J86q6r3L3M4j37J20J5q5j4J85j35L2q3K9%j1J9jn5R8p2Q2L2j02RM6p2O5K8K9r5m2
3576G0O4Q2q6O8p4M3n6M5Q0p4j8P7j08N8L0M2j41Lo1N1j2J38j01m6RP2j3J5n2n6J11J1l0R5
3409B36j33N6q0k4J64K4k25J14L9o8n0N0J2P9r7m2J54j0j62J04L2R2o7j09Q1j06O4J41q1j06
$$ y = [78, 62, 101, 35, 69, 135, 44, 114, 59, 120, 126, 180, 22, 25, 114, 162, 143, 104, 153, 185, 248, 99, 86, 188, 81, 188, 269, 230, 29, 93, 79, 61, 209, 95, 80, 130, 124, 158, 108, 114, 222, 97, 227, 56, 61, 74, 329, 305, 214, 200, 115, 228, 201, 203, 73, 221, 246, 205, 99, 96, 36, 188, 165, 20, 117, 166, 127, 116, 182, 71, 111, 131, 226, 103, 22, 130, 92, 116, 124, 101, 15, 115, 74, 64, 133, 222, 216, 44, 76, 73, 244, 76, 78, 170, 107, 21, 133, 261, 146, 89, 22, 16, 166, 181, 86, 153, 95, 126, 88, 184, 140, 182, 169, 89, 89, 190, 36, 296, 143, 70, 135, 6, 33, 70, 206, 226, 39, 319, 255, 153, 57, 18, 82, 47, 53, 75, 75, 147, 68, 49, 162, 173, 141, 38, 108, 284, 105, 250, 66, 90, 140, 126, 137, 92, 187, 44, 70, 165, 245, 101, 287, 201, 108, 141, 185, 48, 168, 183, 98, 84, 269, 134, 166, 83, 112, 112, 101, 120, 119, 64, 162, 90, 172, 204, 102, 111, 157, 85, 150, 178, 207, 112, 70, 134, 216, 130, 198, 124, 167, 111, 156, 236, 162, 144, 221, 113, 171, 201, 243, 102, 105, 44, 95, 83, 221, 120, 74, 83, 155, 142, 157, 105, 49, 160, 171, 141, 236, 103, 159, 79, 55, 219, 243, 18, 132, 171, 103, 53, 103, 115, 194, 97, 55, 209, 199, 37, 141, 173, 265, 198, 89, 170, 64, 128, 269, 188, 82]
3261H2K0O6L8j54J10j2n1J6Q1o8O6o3j6L8M1p1J3M9j01L6j1Q8J0j01NmN6P8k07J4N4P2j15
3099E9Q4p7J70j0m8O6n5j36Q5o4L5O4n7O7J7j45K5J45o2k2n9Pk2J73L9k08J14K03r5q0N2o2
2941B03j14m9J05j5k5KJ2k8J30L4k9O6n1k03M2J09k3p7n3J77M3j99N8k6K5q6K8J83l8p6M2
2789A67l7o0O1J3RL2j06n3P7p0Q9m0L1j2R3Jj77L4J18n9K3n4O8J0p2J42%j99R7J0%L2j49J64
2621A83q7l6O0o4M2J32o1j16J63L0k13K62r8m1o1n1J4J17On1m2pKL8k3k7O8M8o4P2k2J00k6
2459B47j97K07J52j42k07M8K25M8k10L9m0j43K6l8J29L1j54N6R6Ol0m5J29J3M1j24J18j00
2321A81L3m8r3L3n1L3J16n4j6j2k8N1L4j26P9%j00J01J8j6LP9j99J70j20N8M0j01N8R7m0J68
2163C48k47L8l5J9o1L4O1o4k6J3Jj7O5qlK5m1K30o6j25J07j98J13q5lnJ62j00q5R1m0K17j61
$$ y = [82, 102, 168, 206, 52, 162, 150, 99, 115, 196, 128, 194, 131, 115, 153, 194, 123, 136, 185, 84, 120, 109, 197, 207, 106, 111, 107, 163, 241, 34, 48, 102, 174, 59, 143, 66, 236, 226, 178, 244, 189, 53, 138, 74, 109, 173, 116, 183, 200, 55, 80, 225, 163, 141, 82, 89, 67, 240, 279, 71, 185, 388, 293, 213, 265, 203, 89, 40, 145, 130, 105, 107, 119, 91, 221, 255, 226, 292, 241, 38, 80, 189, 166, 89, 36, 213, 256, 57, 115, 89, 114, 28, 56, 239, 201, 125, 167, 130, 70, 131, 144, 153, 185, 79, 26, 103, 33, 122, 82, 113, 101, 194, 195, 18, 52, 170, 111, 134, 80, 148, 158, 86, 228, 228, 29, 126, 136, 136, 168, 19, 183, 96, 60, 120, 56, 98, 230, 169, 53, 216, 246, 33, 295, 197, 156, 95, 44, 58, 175, 181, 130, 88, 81, 83, 121, 98, 71, 139, 187, 123, 195, 173, 273, 247, 50, 257, 409, 267, 60, 108, 333, 381, 171, 210, 170, 27, 53, 15, 144, 175, 21, 77, 173, 179, 149, 104, 233, 246, 287, 163, 281, 181, 214, 166, 73, 106, 55, 88, 204, 150, 134, 122, 94, 145, 179, 53, 132, 132, 32, 133, 151, 135, 138, 217, 18, 188, 68, 126, 166, 65, 123, 220, 180, 348, 101, 139, 104, 123, 62, 96, 157, 93, 67, 80, 81, 64, 129, 121, 118, 143, 102, 332, 266, 141, 248, 50, 163, 78, 75, 70, 232, 132, 47, 138, 98, 315, 154]
2001A54J71K2J44N17R875k608q132K12o8J7k02j2m6L8J13pj61K5J16j44J46j5P0o1M8j52R9
1868A59j08L5O8j28J6J07n5O7m5j3P6k5j37O8J3m7m5J44Q7m3j09J81j46n6K1N0L5L0j34K0
1720H6L3n0K4n3R9L7M7r5Oq1K00j10L0P0j35q3M7K8Qj3j0k1K09n9j00m0m6N4J7L7j09P6nJ40
1553B38J24k25k3NJ17j7m8j13P3l5Po5K3J87l4K03J17m37J03j02K26j11j18J07m0j0K4K8j26
1410G8J01l2j6j6j2n7J69j48K06j00p9N7L2j16J37j05l3P3j02J12J21j55p5KP6N9p4l5K5O4
1263A57k7m7K0k6N3p2K8J4L6l1k2Q5j44J39R7j83R4R5j57m4J67l9n9k5%J62j04p0q8J31L6
1110A76l1m7j7K8M0l0j4n6poJ6L9n6M3J31o3O9j06p9Q6N7j34J47n8m0P8m6l3K4p6J2O9N6j3
943A59m8R9p9m8j5m8J32j17M9J81k08j3J42m8j8q0J30j14O0PK4j4L7P2QL1j82K86r4k50K5
$$ y = [154, 325, 347, 491, 1008, 10883, 8275, 143, 355, 287, 304, 102, 90, 44, 82, 195, 188, 27, 52, 168, 24, 170, 155, 225, 164, 212, 60, 159, 51, 86, 154, 26, 42, 149, 94, 161, 116, 103, 179, 154, 17, 85, 98, 51, 6, 150, 237, 194, 85, 266, 120, 64, 85, 135, 170, 200, 66, 86, 119, 69, 93, 40, 139, 176, 223, 128, 134, 53, 253, 143, 173, 243, 108, 25, 72, 100, 108, 95, 85, 64, 273, 214, 114, 74, 28, 82, 99, 136, 27, 103, 98, 238, 362, 137, 114, 119, 236, 219, 171, 58, 131, 96, 103, 38, 61, 248, 214, 417, 534, 97, 200, 98, 324, 213, 95, 202, 162, 152, 176, 204, 78, 179, 147, 131, 115, 103, 46, 215, 67, 273, 173, 94, 151, 183, 67, 204, 99, 66, 139, 37, 149, 270, 115, 40, 42, 118, 177, 103, 68, 93, 157, 130, 83, 103, 77, 130, 58, 86, 100, 136, 105, 83, 168, 24, 163, 260, 77, 171, 266, 109, 65, 232, 193, 134, 109, 109, 271, 167, 97, 9, 140, 176, 145, 98, 81, 109, 149, 119, 105, 49, 42, 36, 52, 91, 35, 78, 209, 146, 215, 109, 30, 116, 173, 39, 186, 128, 88, 166, 120, 87, 111, 35, 47, 116, 172, 159, 111, 210, 131, 83, 68, 20, 152, 35, 84, 265, 57, 44, 186, 138, 120, 40, 170, 56, 116, 123, 147, 133, 170, 242, 250, 281, 99, 385, 291, 41, 66]
790F6J63j35P0o9Q0j43J52M1j21J97m7m6l7j16K7Q9p8jOL8j8J43n4j06o4J47n3j1K43j33q0
638A50LJ04L8j74n2J86o8o5J57o9Qlo8r9O7j2m8O3J02P8q9j23l0m2L5J09J53j36N2J15j75
485A67M3n6k9O9L43k62q8m4O5J20j39q1O5Mp3L7P8L3q2r0j8M6m0J36r0m0R6J4p5m0P4p3O0
323A30Q4k1K3j30J24p1p1N0r3J24k2k9KK26j51j8J2j28lK1O1Kj5O3j4m4p2P2l8K53j74L6j19
160G0M9r8J8K9N1l8nR2n9M0P7k18J27j3n2MN2k1o1K6LL6m3J64p2j38J00K2p0L4Q5j4Qp9N6
-12A62j21J20J08j01k4K6j0pq5k6k8J8J8J27q5Q5oKj08J44j02O3l5o6K0Ol8R2M8jJ1p7k8n6
-180D6Q0qk6M2M2m5Q7Om9j44J10Jo0J3m0J49nl8r3P6j02J74j79P7m9oN6k3Q8j02jP4n0n6M3
-352H8P6Q4l4j17K7m3P1n0O1pL2j16L4p4L7J06K4j57%N4o1L9l3L5K9M7K0q0m1k5L1J31j08
$$ y = [66, 229, 94, 164, 95, 175, 32, 184, 225, 104, 301, 254, 208, 171, 55, 82, 171, 93, 92, 98, 136, 118, 261, 207, 101, 37, 184, 131, 120, 363, 230, 150, 153, 257, 295, 121, 69, 255, 187, 122, 279, 210, 218, 215, 147, 48, 115, 103, 55, 118, 220, 298, 209, 86, 56, 14, 49, 158, 311, 175, 227, 342, 167, 210, 154, 125, 194, 537, 275, 187, 143, 208, 328, 189, 108, 173, 177, 104, 141, 219, 252, 170, 80, 62, 108, 68, 204, 114, 74, 170, 184, 109, 69, 143, 70, 130, 214, 193, 216, 86, 210, 139, 68, 118, 25, 149, 127, 98, 100, 326, 175, 157, 169, 41, 38, 59, 120, 122, 107, 170, 156, 112, 40, 112, 74, 327, 153, 189, 70, 119, 21, 39, 68, 119, 81, 76, 168, 109, 149, 226, 8, 135, 122, 70, 74, 126, 105, 44, 70, 73, 109, 66, 230, 158, 20, 120, 142, 72, 106, 191, 177, 185, 106, 162, 41, 161, 269, 168, 144, 170, 160, 153, 68, 42, 14, 32, 50, 177, 92, 177, 171, 173, 65, 209, 107, 170, 135, 69, 89, 95, 57, 149, 197, 196, 207, 130, 102, 46, 126, 118, 92, 134, 176, 131, 218, 224, 175, 31, 141, 142, 82, 95, 55, 204, 199, 161, 68, 144, 42, 216, 37, 114, 65, 59, 115, 92, 180, 78, 77, 151, 101, 45, 88, 164, 248, 214, 97, 124, 81, 152, 102, 163, 156, 188, 72, 106, 32, 69, 175, 199, 42, 42, 96, 35, 74, 41, 76, 105, 152, 172, 92, 51, 26, 57, 188, 80]
-514H0
##PAGE=	F1=2001
##FIRST=	4521.1612903296090735,	4521.1612903296090735,	0.10950507968664169312
##DATA TABLE=	(F2++(Y..Y)), PROFILE
4521G4J1K8q4N9O6r2K9l9O8L5pr9k5Q8N4jo9N4OQ4j82L7J16j38O0Q5Qk15Q9J1n4J34j09N6
4354A38N2mm7m8L2N8p9J31j81PJ0K25oq3k0j28J34K1j2j33J73Pl7j51L8o3J05m5o1M4P3mj8
4191A28N9j47J1J26Q4j48l9O6k6K1j2j4k6L0j2m9R5R5M0k52MQ8J43j96j7J42o8j21J13J42
4044B60j13p7m4RJ09M5p7P2r4K2K2N2k5J6j6m9l2O9j41K95j29j08K1k5qK5J48l9j37K71j15
3891B07l3q8p9J06p2K8Qj7J37j05m6R7L2k8j02M2J86j80J72k30O2L8K0L8j24J01r8pJ36L6
3743B37j25J89j68l7N7K4j07R4j0o6l2K00r9Jp0QK2n5L6N3j09N5j7J03L9j48M0ol9N3J03j8
3586B08n9o7N2L7n7Q7r6J05n4l7J12p5k9J07r8O8l0K4j10j0l0M0OJ50j18o3M7L8kkj6q0J47
3424A95Ml2Q1j38M9o4rJ39M0k12R6N9p6l3%pR2n3j01J85J4j88O7P0O9j08k8J00j11M7J45j9
$$ y = [74, 85, 113, 29, 88, 154, 62, 91, 52, 120, 155, 148, 49, 24, 112, 166, 165, 96, 150, 156, 240, 58, 95, 211, 73, 133, 218, 226, 11, 100, 111, 57, 191, 82, 138, 190, 186, 139, 91, 123, 181, 102, 233, 52, 59, 69, 294, 288, 205, 185, 57, 191, 212, 200, 67, 240, 247, 210, 59, 97, 34, 139, 94, 33, 77, 150, 146, 128, 187, 40, 51, 177, 261, 113, 74, 140, 114, 135, 123, 109, 83, 113, 101, 52, 147, 242, 282, 30, 34, 122, 265, 69, 52, 194, 126, 5, 118, 260, 147, 70, 26, 35, 144, 189, 112, 184, 90, 112, 134, 186, 161, 177, 161, 112, 80, 149, 8, 303, 174, 66, 87, 62, 54, 79, 227, 188, 51, 322, 207, 174, 86, 7, 113, 41, 69, 77, 60, 197, 92, 46, 143, 175, 147, 45, 87, 273, 93, 265, 35, 97, 135, 155, 193, 69, 170, 72, 65, 201, 237, 112, 301, 133, 96, 153, 177, 70, 164, 154, 88, 56, 256, 157, 158, 88, 96, 118, 63, 99, 152, 43, 98, 81, 184, 223, 75, 115, 109, 70, 123, 226, 208, 149, 82, 134, 171, 114, 201, 105, 210, 156, 119, 231, 156, 127, 234, 136, 204, 174, 198, 88, 78, 48, 88, 94, 244, 126, 63, 110, 148, 146, 144, 128, 48, 195, 199, 167, 248, 110, 159, 95, 86, 225, 265, 53, 149, 208, 132, 99, 99, 92, 184, 131, 30, 215, 229, 41, 108, 178, 247, 139, 111, 211, 100, 147, 292, 273]
3266B73k39N1J21k6j40J60k8o8j2J65j34Q3l9l5K0N1o9j0M6q3KJ8J19k6j24K6K5J9R5k26O
3113B1P4J30j61R4j08J99j1q9O0Mj79P4m6L0M5l2L5L4n8K1P8j01Ol4j2j1J62Q5k18J48K37
2961D77j06j36L1l7j14l3Q9n0N8n6jk3J12M46L6K1j45m63n9J07Pn6k3J41lj64Q2q0N6m7j0
2808E7J93Oj39m7J08r5O0k6L5K6j12J8Lo7J42p7N3j%N6j62M8O4k3O5j23L9O3m5J15J7j93M6
2646A04L0O2Pj39Q5q3oP8l7M2N6p6k6J40mj89K59j11n5j8j08J09J3J12j07m0Ol4Q6j0m3J40
2488B43j3r2M3L1NQj22J34J00l8k04j9K13J55k84P0q7j21N3J4N0J41k33M1J05q1JM5O9pJ24
2336C44k21J55o3l0J4j07Q0q5j9J47j40Q7oj28J90l8o4O5K4j20J14j19R3JJ09j75j3P1j08
2193E8J85j75n1K80o4O9j09N7n6j32l4K01j70J82p3O6Lj63J99jj75M6l1L92l72k4K81j00K1
$$ y = [273, 34, 85, 206, 180, 40, 200, 172, 104, 92, 257, 123, 206, 167, 132, 152, 203, 134, 124, 170, 87, 89, 107, 226, 200, 76, 102, 127, 146, 241, 15, 21, 95, 225, 64, 158, 50, 249, 238, 149, 209, 213, 34, 108, 62, 92, 137, 105, 140, 174, 116, 137, 215, 114, 120, 86, 74, 63, 225, 310, 92, 240, 477, 371, 235, 266, 229, 115, 82, 171, 121, 179, 123, 122, 99, 211, 657, 693, 714, 569, 106, 47, 154, 161, 105, 82, 223, 220, 56, 138, 58, 114, 67, 57, 250, 256, 117, 70, 178, 83, 143, 117, 152, 178, 66, 84, 87, 20, 162, 85, 138, 137, 137, 193, 31, 79, 143, 120, 185, 62, 101, 164, 119, 234, 251, 58, 104, 134, 196, 203, 64, 149, 66, 60, 138, 101, 143, 199, 123, 97, 237, 233, 44, 303, 192, 137, 119, 11, 120, 133, 245, 138, 98, 104, 70, 156, 146, 103, 243, 230, 138, 181, 212, 217, 225, 103, 237, 337, 299, 95, 76, 289, 444, 160, 230, 143, 22, 75, 89, 139, 280, 47, 88, 193, 112, 113, 158, 227, 220, 344, 123, 278, 215, 185, 199, 92, 172, 87, 68, 215, 75, 162, 156, 28, 218, 180, 116, 181, 205, 85, 199, 80, 173, 174, 283, 108, 95, 166, 58, 243, 68, 17, 297, 233, 302, 193, 250, 194, 62, 28, 229, 59, 241, 168, 234, 237, 74, 273, 272, 97, 143, 112, 504, 132, 108, 389, 289, 310]
2050C10J35j13P6m5J83j24K73j44J99J20J97J33P97L77M8282R61m3177n909j173q8k62k23
1942G85j34j21MN1j62j0j6r8J55l34K98l81L18o9k5k5q2P2j03O4J34k75J01K6Q5k6N5j78L1
1799A40j04Q4qM2J47k36j5L13j77j21KQ6l5J64k45mJ56j6Rr9j2J87n0n6M5n9M2m1N1P2j74
1647H8J3K4n4l8J13Oj1P5O3j93M3m8j2k8J53j15L6j1J66K1j36%o7J60k9o7r7PP7l5o8RK32
1484B77J6R0P9l63R9j72K95j57p9R1L3p8L1J4q5K0M5j1k8m6l9J93j85K61r6j05L0J0q1P1j7
1332A13m6R0o0M3J62j58p8j5P5P4j24J1K9K8k1m7MJ1Q2j51P6K1K2l3m8J10r4J08M7j47Q9J13
1174B86k05j4J86p7q8K5NJ63j00o6p8P5M9n0Mo9L4P5n1n2PJ6M0j6l7pP3J29n4Jr1r0R5N3j44
1002B7J85j45J3N9l3j4k3n2M8N4k6Q8p4J15p3n4k0l0Q4j22M4J96k05RJ53p3Np0R6j26N4L3
$$ y = [310, 445, 332, 408, 363, 546, 422, 695, 551, 750, 870, 1067, 1200, 1997, 2374, 50656, 51617, 8440, 2531, 1358, 1270, 1008, 785, 651, 530, 534, 585, 423, 413, 397, 299, 454, 120, 418, 37, 355, 286, 261, 236, 154, 226, 123, 187, 321, 46, 147, 173, 258, 232, 287, 109, 140, 36, 120, 112, 154, 301, 65, 50, 363, 186, 65, 67, 153, 118, 282, 37, 33, 189, 173, 182, 83, 71, 258, 208, 152, 197, 138, 180, 139, 190, 262, 88, 101, 125, 71, 33, 146, 152, 141, 216, 279, 86, 129, 81, 69, 41, 194, 79, 115, 104, 270, 291, 155, 155, 88, 248, 219, 152, 55, 62, 139, 104, 36, 45, 277, 293, 383, 462, 99, 198, 26, 321, 164, 85, 176, 209, 131, 162, 176, 91, 111, 156, 145, 117, 71, 32, 225, 40, 301, 205, 100, 130, 140, 59, 130, 113, 67, 157, 97, 140, 302, 144, 66, 51, 126, 200, 76, 87, 116, 144, 123, 76, 80, 91, 173, 22, 98, 119, 141, 108, 60, 170, 76, 184, 231, 84, 173, 286, 81, 67, 253, 176, 88, 113, 118, 281, 181, 115, 37, 112, 161, 111, 115, 46, 80, 155, 104, 52, 59, 75, 115, 99, 62, 55, 128, 257, 203, 204, 113, 23, 118, 171, 27, 212, 67, 80, 139, 106, 92, 69, 17, 65, 119, 93, 181, 107, 222, 149, 95, 75, 45, 129, 7, 51, 247, 42, 51, 204, 131, 136, 66, 162, 36, 90, 123]
844A23L3lK3m8K4R8j26K68p6k59K6J52j51Q4j18J34j66J54N5r6J42k3q0J0j34L5P6n8k5K8
697A02nN3J53r3q5j01J54k3l9K54j56k7k7R2qj09m5J85p0r8J56n7lL4q9j05J04m0JMJ26Q9
539C27r9j95Qj9N8P5J30j04O2Q7j37J4m1o0O1M29l05j08n4O7J21j88q9J53J9r5M9N4kn9p6
387H3l5P9p3J38p4p3J48L6j31m6R8Nq5J20J3O8j80J63j31n4O2n9O5mj6l2K17j27Rrj49M6N8
224A30J6l9J6K2O3j37QM3q3K78j66L3j55P4o1L6j9M5l2P8O1q9J1J04k03P0j5l6M1j0K3o7N6
62I6j9lPJ16m6j22R6J9m1qR5k6O5j00M9j38J34P8j03lM7rlq1n7K9k1k1P7l4J27l8j5r2J23
-111A78n7Q7n6q9O4j7p2Q4N2L3M9j36Qo8O7p0L7M3N9j23J39J2m4j32P8O3q0n3oJ68m3l7p0
-273F8R3j17J03j24P0j6l2P7k0N8j04J7N3Oj29J5J36J19m8j62Q5r1R2p4R5m0Q6j69P5p4KJ37
$$ y = [123, 156, 153, 176, 128, 152, 250, 124, 392, 316, 57, 83, 235, 84, 168, 50, 184, 18, 172, 227, 131, 273, 250, 170, 180, 46, 81, 157, 99, 74, 102, 97, 150, 303, 210, 125, 24, 178, 155, 116, 370, 214, 187, 160, 252, 244, 135, 90, 275, 205, 107, 263, 206, 203, 237, 148, 43, 147, 107, 108, 112, 238, 327, 228, 33, 41, 22, 80, 155, 285, 181, 243, 330, 193, 207, 166, 106, 167, 596, 291, 183, 129, 196, 317, 129, 40, 193, 212, 117, 166, 220, 218, 159, 83, 48, 127, 54, 192, 118, 45, 193, 229, 98, 52, 150, 155, 70, 190, 203, 271, 91, 254, 123, 69, 131, 72, 137, 133, 117, 85, 302, 175, 184, 175, 26, 72, 130, 146, 107, 123, 145, 208, 71, 79, 122, 39, 317, 151, 184, 29, 103, 42, 78, 59, 104, 72, 150, 211, 122, 133, 237, 34, 104, 89, 53, 94, 84, 107, 40, 96, 77, 74, 81, 197, 151, 29, 125, 144, 103, 95, 190, 164, 229, 129, 178, 40, 174, 252, 149, 146, 193, 184, 181, 100, 43, 72, 51, 30, 107, 73, 200, 162, 147, 55, 178, 121, 208, 152, 63, 127, 110, 38, 122, 174, 207, 256, 120, 128, 60, 127, 57, 94, 137, 196, 73, 212, 224, 180, 48, 126, 189, 109, 56, 50, 218, 175, 138, 68, 161, 44, 147, 23, 93, 77, 45, 122, 102, 160, 56, 73, 126, 132, 3, 18, 154, 273, 225, 63, 148, 57, 149, 75, 170, 130, 216, 47, 122, 48, 50, 187]
-431A87J0j26jN4o7J1l1M8O4L0Ro9m8j5mJ17j12
$$ y = [187, 197, 71, 70, 124, 57, 68, 37, 85, 149, 179, 188, 119, 71, 56, 52, 169, 57]
-514E7
##PAGE=	F1=1996.08
##FIRST=	4521.1612903296090735,	4521.1612903296090735,	0.099252335727214813232
##DATA TABLE=	(F2++(Y..Y)), PROFILE
4521F7J3K6l6L5N5q6Pk9O5N7p3k4k4O0L8N0j15O2m5J18j81Q1J16j39j2O9O5j89Q0K6n6J11
4364A92o8O6L5J6j35m0O8lmQ5j58K0K3J43Ln1l8j44J34Q1m9p1J48Ln7j51M5nQo7M2k6Q6RJ6
4191A56J5j59RJ75P9j51lK1j5J4j9mJ1k3K8j00J22P0J02l01kJ22J22j78o0J68m3j33J11J10
4044B44p7j02m7L7P1M7n2P2j23L2N8PK8k4k4l1n8N6r6K49o8j36j8Q8o8K1J53q6r0K55j73M2
3886A87n3j07J63j05oN1l3J20p2j03Q6M5Kj50O1J80j74J66k25O0O7J5O2j70P6l7m2J45pq7
3739A15J62k14J1J05m1m0P3n1m0l3J68m7j3p6KL6l0L5N9j54j4O1J02P8j88N3l9j6J7J82m5
3586B18j4q5J8pl0Q1j04J55l7j18J33n4o5J47j02J08j17L4p1k7K8JJ5J49j33n7Q4j1J0l7O9
3433A81j31J79j0LL3j20J3l8j0R8Q1j82O6M2n4j0j1q2J29m3o7J43M2k06L7P0N3q6J8J10j12
$$ y = [67, 80, 106, 70, 105, 160, 74, 81, 52, 117, 174, 101, 77, 53, 113, 151, 201, 86, 148, 103, 221, 40, 121, 237, 98, 86, 155, 220, 31, 111, 137, 81, 192, 124, 190, 225, 241, 106, 66, 134, 131, 127, 212, 54, 74, 97, 240, 243, 192, 154, 10, 144, 225, 176, 105, 253, 256, 199, 48, 93, 88, 96, 29, 71, 45, 131, 140, 156, 171, 12, 21, 196, 275, 124, 121, 142, 127, 141, 122, 118, 129, 106, 134, 34, 156, 226, 328, 27, 25, 147, 269, 91, 31, 199, 156, 23, 134, 244, 167, 65, 18, 55, 126, 173, 121, 193, 70, 102, 160, 167, 195, 171, 147, 116, 58, 114, 18, 267, 199, 63, 45, 133, 65, 86, 239, 153, 63, 318, 145, 187, 134, 27, 190, 85, 79, 130, 97, 217, 145, 42, 128, 173, 175, 25, 86, 266, 92, 258, 33, 93, 160, 175, 237, 67, 143, 106, 64, 209, 202, 115, 277, 63, 74, 179, 138, 98, 171, 120, 80, 47, 215, 168, 155, 79, 81, 117, 87, 122, 181, 27, 13, 74, 176, 254, 66, 119, 80, 64, 81, 263, 218, 204, 119, 137, 130, 100, 181, 77, 232, 195, 77, 210, 156, 91, 238, 136, 244, 127, 161, 90, 63, 91, 92, 107, 256, 123, 66, 150, 139, 149, 112, 181, 50, 229, 219, 222, 255, 135, 148, 110, 100, 198, 279, 97, 163, 205, 151, 141, 130, 48, 177, 134, 67, 210, 252, 46, 83, 153, 206, 120, 138, 248, 136]
3281A36J2J44O0l20P9J40r5j06J53k5o1n1K32j85R9l3k5MK9m8n4O8o4k8N1J28m7q8k6O5l0
3128A14J22j92l6O4K04k09J29j43J74L4j22P2K8k08P0l5L1J3l4J8N6M6mK7j40J3%l3M6J06
2981B11J17k14J84K59j18j59k6k7q6KM7q7J46j09l2K0O0R72J26j0k81q13j08Q1j8JKJ13j00
2838A53q3J01j22M8L1n5J73P5k05n8J80j53R7j02Q4lr5O5q6k7K14j63R5K9j27J20j10L4J8
2695A28k0J32j41j6R8K2J5O8j97k9N3J38j2j45O1j14PJ37o0J09o8q9P9J04l9j16J75m5q6N6
2547B05j45J32j20K44j88J7kk5Q6oq3K18p0j04pJ14r6Q0p9M9J1J09j73m7J41K34m01J59j17
2405A36r9J04P4j20L09l51J03O0j28O2P1opK20l71K11J4p4L2r0J08r2l1J24j48J28l2q4J95
2262C18j05nP0J0j13J38j91J07O7O6j14k06K47k09K60j03n7K25n1o0O7L3o3j02p3K51k31K54
$$ y = [136, 148, 292, 352, 32, 111, 251, 156, 50, 203, 178, 117, 66, 298, 113, 212, 179, 154, 158, 187, 139, 85, 153, 89, 61, 112, 240, 193, 105, 79, 144, 114, 236, 44, 8, 72, 276, 67, 196, 53, 227, 261, 139, 211, 239, 31, 101, 66, 97, 110, 76, 94, 150, 196, 192, 219, 79, 92, 92, 59, 105, 211, 328, 114, 298, 557, 439, 280, 254, 227, 141, 143, 190, 103, 249, 140, 108, 128, 188, 1160, 1286, 1276, 995, 182, 74, 155, 137, 138, 140, 253, 153, 70, 171, 49, 97, 128, 73, 246, 321, 116, 58, 238, 85, 182, 80, 164, 161, 66, 131, 45, 18, 232, 69, 164, 193, 66, 186, 76, 110, 128, 108, 240, 99, 83, 181, 203, 218, 286, 89, 60, 113, 251, 239, 94, 155, 41, 48, 185, 125, 234, 166, 77, 156, 260, 221, 105, 280, 235, 149, 205, 60, 192, 72, 316, 128, 145, 143, 118, 204, 198, 115, 333, 263, 159, 152, 266, 170, 250, 171, 220, 231, 340, 167, 120, 261, 495, 94, 253, 136, 37, 141, 215, 95, 404, 53, 156, 216, 88, 150, 221, 215, 208, 428, 57, 268, 282, 208, 240, 150, 258, 166, 135, 259, 111, 239, 207, 123, 318, 213, 208, 278, 288, 175, 313, 122, 229, 296, 362, 248, 42, 289, 80, 340, 237, 180, 405, 354, 294, 361, 394, 331, 229, 156, 407, 176, 430]
2124D30j12J43oj53K21l8j09lmL97m24R2K34j3m2K55j20J63p6K97o1M01o8K24L04L71N37J460
1986D300J428J01358N114r1472j4089l025q05m74n26k50k16q9o6j86j02m3j17J23l83K58m18
1883C20L06l7q4Kl9n1q1J40O8l38J64p4J86j22R3j58m1k7P1l5LJ47k78J1L15j52j37l6J11
1740B47n5K04k56o1J95K9rj08p6K44j44qQ0l8j74R3P4O9j99J10j5r6nJ19K7j4j10K38k64J16
1592B13l0j17M0J52o2m7n4K11j36K4J9j70K29q0l8o2n0J64q6q3J17J43J08K2Kl15R9j62K83
1450C34j87j5K2J38j96O7L8j07K2O4j0r0k8M4J35j99L06j06j09J9o3j9jJ04m1O5l2k6J90j42
1302A77l4p4Q5Q4j74O8LKJ7l9m8P6P5j57L6N4mj5l5R3m8N3j3o9L6J50k61M0K16j71q1Q6J3
1140A41J12n0p1k6JL9q4J02j40L5Q6n2k4K9oJ00Jj31L2O3J17j6o8r9k0O3K1j17J79k07P3%
$$ y = [430, 318, 461, 455, 302, 523, 485, 376, 373, 369, 766, 342, 434, 668, 655, 613, 868, 748, 911, 835, 1132, 1071, 1472, 1404, 1628, 1932, 2303, 2840, 4300, 5728, 107086, 112200, 20728, 6639, 3614, 2809, 2335, 1809, 1559, 1343, 1254, 1188, 1002, 900, 857, 740, 863, 480, 738, 320, 626, 589, 505, 507, 468, 417, 336, 476, 544, 206, 370, 296, 482, 360, 453, 295, 254, 227, 298, 263, 266, 413, 135, 146, 461, 309, 172, 136, 247, 192, 396, 140, 79, 274, 303, 294, 186, 110, 354, 210, 202, 282, 244, 70, 163, 237, 306, 107, 217, 202, 106, 101, 220, 247, 233, 123, 361, 97, 213, 183, 66, 106, 258, 196, 149, 95, 306, 170, 194, 213, 43, 272, 192, 154, 92, 42, 206, 120, 37, 154, 297, 405, 427, 429, 114, 213, 51, 334, 147, 132, 154, 292, 96, 163, 201, 94, 116, 180, 170, 80, 52, 96, 231, 32, 338, 232, 123, 142, 79, 60, 59, 163, 122, 187, 155, 129, 319, 177, 143, 69, 154, 238, 64, 132, 135, 137, 154, 115, 67, 143, 218, 61, 97, 151, 147, 132, 97, 190, 142, 195, 182, 113, 149, 299, 38, 78, 294, 123, 42, 128, 141, 253, 203, 132, 106, 107, 146, 62, 164, 24, 59, 145, 93, 69, 98, 92, 192, 193, 62, 94, 157, 274, 258, 190, 91, 71, 134, 155, 38, 217, 10, 83, 83]
982H3K3K6o8rJ2N1r7J73m5O2m0o2Mm4N2r7O9J44j41m0J82j06K3n0K5p0%N5L9nP6j57j2J60
815B16o9K11k2k79N2J03j40J25j76J71j49J14N1o2P6K1j24M2p6mQ8n7o9O9k0P4J74j46l0j16
667D8J18nj4K41k03J7n5J00n5l7l4J52n8j17J26l2j6M7r2n2J07r7O6o1J51P8p8j67Kl0N8M9
510A57R4n3L4O2n4l0l0p9L1M84l23r8j0QR3k04l8J40M7r5L7N9o2k7n2l8P5o4R5k5p6J30P4
347B62j79n9J32P9j42P0QJ52k14J72k03qQ9n5J5J8j8l5J66q9L5k4j49Q2P6m4k3J3jJ32j19
195A39k0%j01K72j39jp8QkM0p0L8rJ44M3j60OJ26j72lqK4M7j10Q5n0N0rn8R6K2mj14J08ll2
17A05JO3k5Q4p2K8j17Q7P6j17L8N6j6M0j25o3Q4m1j3k4M9R3n2k0p6R4LR2m2j24P9j1q8N2M4
-155A42M1R9j76M1n5N2r4N8J5Q0k00J90Mk4j05K8J32j12n7nJ53o8l0n2J12r8jl4N7j8n3Q9
$$ y = [83, 106, 132, 64, 55, 67, 118, 21, 194, 149, 211, 171, 109, 113, 69, 121, 24, 93, 237, 96, 56, 238, 132, 155, 105, 130, 60, 60, 115, 154, 149, 225, 68, 56, 216, 147, 358, 336, 57, 109, 212, 72, 197, 21, 192, 43, 157, 208, 146, 222, 243, 119, 161, 85, 81, 169, 112, 43, 112, 92, 166, 340, 194, 164, 48, 166, 161, 147, 388, 185, 202, 147, 247, 192, 155, 121, 273, 215, 98, 224, 192, 176, 223, 131, 79, 186, 89, 155, 94, 245, 323, 245, 78, 80, 50, 108, 157, 251, 198, 232, 294, 240, 210, 180, 101, 132, 616, 293, 195, 185, 193, 286, 82, 44, 184, 231, 136, 173, 232, 170, 143, 91, 53, 128, 64, 159, 134, 58, 188, 262, 83, 24, 156, 235, 93, 163, 171, 323, 109, 281, 78, 70, 159, 104, 119, 137, 119, 84, 250, 161, 196, 172, 23, 105, 181, 137, 114, 127, 126, 258, 139, 119, 119, 18, 290, 151, 150, 72, 80, 78, 118, 48, 86, 77, 221, 264, 104, 110, 236, 64, 61, 53, 77, 124, 14, 99, 49, 99, 90, 32, 128, 150, 146, 32, 140, 137, 105, 106, 169, 144, 228, 156, 184, 67, 154, 230, 113, 151, 207, 191, 231, 106, 43, 127, 86, 73, 49, 98, 191, 139, 119, 43, 137, 140, 232, 190, 66, 145, 134, 46, 98, 142, 183, 282, 106, 147, 92, 144, 50, 108, 123, 203, 3, 193, 197, 173, 68, 96, 228, 116, 59, 54, 207, 139, 109, 57, 169, 71, 70, 36, 93, 75, 22, 111]
-312A11JL6j13L1L8O4j27L9O4J39l4k26J17r5J01p7R7p2J29j81J00n4m8J54J0q6lK5o2Ml0
-465E2M7R6lpo3k9j3jO0j12
$$ y = [111, 112, 148, 35, 66, 104, 168, 41, 80, 144, 283, 249, 23, 140, 45, 146, 69, 166, 94, 223, 42, 142, 88, 40, 194, 204, 118, 115, 140, 78, 82, 52, 99, 195, 192, 185, 122, 93, 80, 79, 139, 27]
-514B7
##PAGE=	F1=1991.16
##FIRST=	4521.1612903296090735,	4521.1612903296090735,	0.088999584317207336426
##DATA TABLE=	(F2++(Y..Y)), PROFILE
4521F0J5K4J1J2M3p8j7j7O2P9j40N1k3L2K3J00j53P9j11J36j25P0J18j36l8L2Q4j33N9K6l4
4369A11J09m7N2J3L0k01rR4p1O3L1j30L6O0K0K4j0o2n6N1J22q2mJ26Mr1r9K4K5p0oN0q0R3
4201A20J5M5l3q5K8J08O7j43M6k3oLl0L1Oo3Q1j50J48L0J52l37OJ42Q7j37q1J77l4j29J25
4049A66P1n0j27m9P3M0K8n0Q7j38M0R5l9Q3o5l2j4q2M1m9J99j2j55J9J19j42K5J69j34m2K38
3896C13k30J17j9j35K22j40l9R4m9J04m0j55P8L2P4j95Q1J65j78J44j68NJ13%P8j82J9L5o4
3753H0J36o5n0J39k06NJ58r9K8N2q4om0J25Pk7q2nP0J4K4N6k10O3k6R2J44j99M3k7l2n6K70
3591B92o4L2j04j6n0qP0p7J70j5j96J51l7o9J55j03J52j94N2m2n0Q4l8J8J38j28k9Q8k6Qq3
3438H1J62j73J92m0M8qj02k4k0k0N8J22j51L6K4l1K0j2j61J60n4J4N6Q9k06K6M7J3K2nJ12
$$ y = [60, 75, 99, 110, 122, 165, 87, 70, 53, 115, 194, 54, 105, 82, 114, 137, 237, 84, 163, 52, 188, 63, 133, 251, 115, 77, 109, 193, 60, 119, 145, 111, 220, 173, 225, 238, 268, 67, 58, 152, 81, 144, 175, 45, 81, 141, 161, 185, 175, 113, 57, 108, 230, 148, 144, 270, 274, 183, 84, 108, 133, 63, 57, 107, 27, 120, 135, 180, 147, 62, 90, 198, 265, 122, 168, 145, 139, 142, 112, 143, 149, 86, 167, 17, 165, 195, 347, 10, 16, 158, 245, 108, 27, 204, 170, 41, 166, 237, 187, 60, 11, 84, 124, 152, 102, 189, 51, 91, 186, 147, 230, 165, 133, 119, 37, 78, 29, 228, 216, 61, 80, 199, 57, 82, 251, 117, 75, 313, 83, 200, 181, 46, 268, 128, 89, 183, 134, 238, 198, 43, 121, 153, 227, 32, 113, 278, 100, 244, 76, 81, 194, 194, 272, 90, 109, 144, 80, 216, 151, 101, 240, 34, 39, 197, 98, 126, 178, 94, 88, 48, 173, 180, 153, 71, 66, 136, 150, 174, 230, 20, 83, 57, 149, 293, 94, 137, 110, 78, 22, 292, 228, 260, 156, 140, 90, 82, 152, 75, 245, 230, 34, 185, 148, 79, 234, 131, 283, 89, 141, 99, 49, 133, 95, 113, 251, 123, 94, 182, 156, 164, 81, 243, 70, 262, 222, 270, 262, 160, 136, 116, 96, 154, 276, 125, 161, 185, 154, 174, 162, 1, 161, 107, 121, 177, 266, 60, 86, 133, 146, 168, 163, 275]
3286B75j20k8J37J71l71Q9J44j64p2J45k1n6q8K98k36R9m5J2J1jl4q7J02o8j8N4J10m4k8r3
3138G3Q7p7J47j40o1K9K53k49J74j31Q7Q4j48Q5N1k18Q1k4L2j9l6j6O2J37m2Pq5p9M9n4J04
2985A63L3J33k02K30K64j47j66o6j7n8L8Nj24K33j62o3N5jJ541K60k7m67j193j19L5o5N9K6
2848A98P8k07J2J31j38lJ23q8J43J34k60N1J23k29J40j73J75n8q1J07j75J3K94k41J22M5j84
2715E2J46p1OMn0K15j41n0Q6J19j22J19k02p1M3K11l5j15P3j78j2K12j31J97j70m6J29P1p2
2572B17k5M3R6j51J21j92J64k46L60k86J00J5l2O8kj23K92j31o6p4J97j98J86o9m8r0K63j33
2434B56o0Q3K45m74K35r2j00J32J08l16M88m61K25l6m2N6N5n8k0L01m43J90J12r8K2j00J52
2301C60q1m2J02q9P9m0k4J49j14J6J01k2j21J71j86O1J39Mp3j81K20j84K17k6n9J74l6j32
$$ y = [275, 155, 127, 264, 435, 64, 153, 297, 133, 61, 206, 185, 129, 41, 339, 103, 202, 157, 169, 180, 179, 145, 58, 160, 92, 74, 128, 238, 194, 166, 73, 160, 83, 230, 90, 29, 58, 311, 62, 236, 105, 192, 276, 128, 213, 264, 46, 127, 103, 135, 116, 80, 64, 126, 263, 221, 228, 143, 64, 113, 59, 163, 196, 329, 127, 357, 621, 474, 308, 242, 225, 167, 205, 210, 86, 319, 157, 94, 149, 148, 1689, 1949, 1922, 1455, 262, 143, 178, 113, 172, 198, 276, 69, 81, 212, 74, 71, 194, 106, 249, 383, 123, 174, 297, 68, 208, 35, 210, 152, 71, 178, 3, 16, 310, 69, 191, 236, 52, 198, 127, 133, 137, 87, 302, 161, 111, 197, 316, 194, 313, 111, 40, 83, 294, 259, 144, 217, 39, 27, 239, 108, 305, 135, 89, 218, 289, 217, 192, 235, 331, 180, 301, 109, 273, 27, 387, 101, 201, 216, 184, 252, 250, 127, 419, 288, 222, 148, 345, 147, 333, 264, 216, 126, 389, 256, 196, 279, 524, 50, 285, 193, 93, 225, 333, 17, 505, 44, 269, 233, 191, 247, 302, 244, 224, 525, 82, 272, 384, 286, 308, 208, 360, 279, 237, 339, 250, 329, 289, 265, 414, 300, 316, 417, 395, 274, 445, 259, 320, 459, 463, 390, 209, 429, 245, 462, 436, 377, 551, 515, 383]
2163C83J88jp8l0j39K90j94K31j34K11k0j44K43o4l1m4L4L64l57J12K04N6n8L08l9K30o1L95
2026A855j3N35J5L16M88O01R96K226K870J62867J0507j47728k3918n242j690q08q42l95l40
1932B300j93j94k26k09m8j79Q2m38K30m44K78k0j05%k5j38p0K07k2l56K16j85K68j69Q2j19
1804E23j19M7N5o8nJ08j78o5K77j02j56p9J62m8J82k64o6J75O8l2q8m7J66j75J6R3j5k78J27
1661B14J09N2j72J29k4j25M1R8K1j4k90M00k81J39Mk26J69Q4pj22q8K14k68J89M5k14K47j51
1524A73L8m4j4J19j16j03K18K9K40j06k4k61J04j23K34j81K1o0K31l06J12O5j23N7M9j8j61
1391E0K8R8P2j52K86j15j01K1j46L4LJ49m3L3mr6K19j25J0j33Q9R0j90R2k4k4Q8o4r5J45O9
1238B64j64mQ6l3jJ1M3kkr9N1l0J72k23L4K41k70M2K0N3K8Np4K7p2M5r9J58r9n6P5l1K3L4
$$ y = [383, 571, 570, 492, 462, 323, 613, 419, 650, 516, 727, 707, 563, 806, 742, 711, 667, 701, 1065, 708, 820, 1024, 1080, 1022, 1330, 1291, 1521, 1460, 1855, 1842, 2377, 2392, 2708, 3196, 3797, 4793, 7019, 9889, 172756, 183263, 35535, 11617, 6375, 4685, 3877, 3035, 2640, 2300, 2107, 1913, 1687, 1478, 1430, 1251, 1333, 895, 1125, 681, 959, 939, 834, 834, 809, 671, 601, 808, 786, 430, 646, 461, 729, 560, 642, 523, 404, 451, 506, 438, 433, 541, 363, 298, 575, 473, 317, 238, 400, 352, 534, 270, 204, 379, 447, 415, 327, 280, 446, 271, 287, 380, 365, 87, 214, 323, 375, 203, 332, 308, 183, 224, 322, 343, 329, 39, 439, 158, 297, 301, 75, 244, 328, 321, 199, 111, 325, 57, 246, 291, 77, 324, 173, 211, 167, 153, 272, 156, 53, 271, 300, 540, 434, 410, 149, 253, 130, 364, 183, 204, 144, 375, 69, 181, 246, 123, 180, 229, 211, 50, 78, 176, 248, 96, 382, 267, 166, 187, 41, 75, 78, 227, 184, 217, 213, 117, 336, 211, 221, 88, 177, 267, 77, 169, 145, 121, 209, 145, 50, 195, 264, 100, 96, 182, 149, 148, 159, 202, 200, 198, 99, 150, 120, 292, 69, 103, 344, 74, 116, 136, 189, 217, 222, 148, 175, 103, 148, 49, 207, 108, 52, 127, 96, 119, 153]
1071A53m4J61J7k18Q1K6Q2L8j20j11M7O5m3l8J14j29K9o6O9N1o3Nn0N9JQ7J3lj9p1K8n7J9
908A13p2R4R1p6q9K10j38M1l4n1K0q7Q2M8nJ30j77o8J48j8J50K8k88R1K4q9J44j90J89j54
761F7P0M4ml2P9j57P4j7k9J14p1j26J17k6P9J79j91L3j26Q5k0M4K24k53N2r2J29q1j5pJ24
608B67m1j37R6ol1N3j05J1J18j66J19q6J52O6n6r8k8m6N4K3N7j5qN2M2p4j9r4NM98l16q4L7
446B40m9O4j85M8N4P1r3K9O6j23Jl1rL8n1N7K2p8J08J08k32j3J37J21j35k6pK26k49J83k67
293B5M5J16n0l6M2j3l0J07n9N4m7r1O0R5j07KJ9k4K01j06n1m6n4K02j12k2J2o6M8M4j21L1
135F8J4K11K3k31KJ35j56o3J5Q8N5r3K0k8N0j8o6J66q9L8j06J20k4k4J0K3l2J01m2K2p8L2
-22A43O5j31P8N8l3R4j61p1J40n1Mn8M4N0p2j7n0O3O4R6k6j60R4Lr6LJ9N1J49k08Q2m0L8o3
$$ y = [153, 109, 270, 287, 69, 150, 176, 258, 296, 176, 65, 112, 177, 134, 96, 210, 81, 110, 44, 113, 164, 101, 106, 56, 115, 116, 203, 216, 213, 194, 123, 151, 94, 113, 41, 135, 226, 150, 61, 271, 133, 174, 140, 89, 109, 22, 104, 152, 147, 277, 100, 32, 180, 162, 312, 340, 52, 143, 167, 78, 222, 32, 221, 67, 137, 181, 177, 145, 224, 67, 141, 124, 95, 209, 138, 12, 129, 103, 182, 361, 170, 203, 77, 162, 142, 186, 410, 157, 209, 117, 246, 165, 150, 143, 267, 226, 89, 185, 179, 148, 201, 96, 107, 225, 59, 178, 92, 244, 310, 254, 156, 128, 82, 136, 159, 216, 201, 193, 245, 287, 213, 194, 100, 105, 603, 287, 203, 240, 191, 255, 70, 118, 172, 243, 150, 179, 245, 122, 123, 92, 83, 121, 70, 127, 149, 71, 179, 287, 55, 42, 179, 300, 165, 139, 132, 358, 109, 292, 25, 70, 186, 136, 100, 142, 129, 99, 206, 147, 201, 154, 63, 123, 218, 111, 113, 132, 108, 309, 203, 152, 106, 52, 254, 142, 120, 132, 66, 114, 158, 37, 68, 82, 293, 316, 85, 87, 222, 66, 3, 18, 106, 161, 68, 88, 60, 110, 92, 26, 192, 103, 141, 35, 155, 131, 107, 117, 140, 108, 209, 167, 189, 111, 143, 208, 77, 155, 213, 180, 274, 113, 42, 182, 131, 135, 77, 121, 171, 99, 82, 32, 95, 159, 255, 229, 69, 163, 166, 70, 73, 92, 143, 292, 84, 166, 126, 164, 101]
-189A01K3j8R4j25J01j3j4o1oJ88j55k0k9J35r8k4l2J26q4o6K5Q0m9k9L6L7L0j30L6K3J22
-342B04j17P1k5J41j4k16P1o8J06q2O5p0J73j93Q6nn9J43Nn1j2j3n0Ol0M7J28l7k3n6j0j1
-499A04jkp8
$$ y = [101, 124, 106, 200, 75, 176, 163, 149, 88, 82, 270, 115, 95, 66, 201, 103, 79, 47, 173, 89, 23, 48, 128, 79, 50, 86, 123, 153, 23, 59, 82, 204, 87, 158, 133, 274, 260, 44, 115, 47, 153, 71, 136, 66, 239, 46, 132, 127, 68, 211, 216, 165, 153, 140, 90, 96, 66, 113, 241, 204, 181, 125, 115, 104, 103, 101, 23]
-514B3
##PAGE=	F1=1986.23
##FIRST=	4521.1612903296090735,	4521.1612903296090735,	0.068006619811058044434
##DATA TABLE=	(F2++(Y..Y)), PROFILE
4521D5J6L6O0j3Pp1J5m6N3J00j74J05l4K2J8J29j53N6r4P9n6M1J29j36l7J4N6p3K9J2KJ12
4364B49l3Qj4N6k49O4Q6j13J26n8q6M6R3r9N4L3r5K7KJ26r9N1J00L0j22n9mL5j16O2N8j00
4206E9N0LJ01p3k9M4J7N6j16P2l2pj9j8P3l0r3J27j35J20k3J92l25nJ27O7p0r2J47j9j07J48
4049B10J5j8j38n0Q6M2l0l4R7j28M4R9o0J24j08j9k8r1M4j5J19N7j56Q1J21k21OK06j46l2
3901G7K34k66J32L2j33K34j50p2J21n5P4oj65M4K2J58j98O7J45j76J15j13m9J51k8R4j76k4
3763H9R7o8Q4q5l3J11j01q9K17j63Q8L2j12M4n4R1J9Lj01jP7N8L3L4k33J26j19P9J85j68J4
3611A54J7q5o0K65m9O3j06n1o8k6P4l2J52nk28J32nm5J06j04K09k70J08j6p7J03n1L9Q5p8
3463A51j1O4j0j3j16K32j81J58o3Q9m4p1m8%o1M5J35j17OJ9l7P2nj46R0q9J28k4J26k02N2
$$ y = [45, 61, 97, 157, 144, 151, 80, 95, 49, 102, 202, 28, 133, 99, 121, 139, 268, 115, 171, 77, 156, 100, 141, 270, 134, 97, 111, 167, 94, 123, 135, 137, 249, 216, 224, 210, 266, 17, 81, 167, 54, 180, 122, 36, 82, 175, 76, 130, 163, 68, 95, 97, 223, 124, 175, 275, 305, 183, 124, 120, 155, 39, 101, 159, 59, 109, 112, 213, 140, 111, 155, 172, 228, 112, 184, 152, 145, 126, 108, 181, 151, 58, 185, 50, 170, 147, 339, 14, 9, 136, 203, 133, 41, 188, 169, 62, 210, 225, 207, 69, 19, 105, 147, 117, 83, 180, 52, 96, 195, 135, 259, 151, 132, 104, 13, 57, 42, 161, 218, 62, 143, 264, 43, 49, 255, 109, 77, 311, 45, 177, 209, 76, 310, 160, 88, 209, 154, 228, 222, 57, 101, 123, 281, 83, 150, 295, 119, 234, 121, 72, 223, 195, 289, 113, 89, 186, 118, 202, 117, 84, 195, 94, 5, 222, 59, 147, 179, 67, 111, 57, 148, 167, 170, 69, 68, 145, 203, 236, 270, 37, 163, 44, 123, 308, 140, 154, 171, 86, 26, 291, 242, 305, 199, 148, 80, 54, 128, 96, 248, 243, 15, 147, 142, 97, 203, 99, 308, 38, 146, 130, 53, 156, 105, 144, 229, 151, 140, 204, 194, 181, 65, 297, 116, 274, 211, 300, 256, 185, 137, 137, 76, 121, 256, 139, 145, 164, 127, 199, 194, 48, 138, 49, 177, 153, 279, 77, 129]
3310A29mm8J64o9J29j49m8J06K67l79P5J52j69p8J16j7l5r0L00k68J10q5O7M3n5k1n2J04j05
3168I0L4K5O9k3L4j44P9r4J53q0q8J9K55k69K17j18j2J47j81J38K7j97R0l4L2j0m6j2J8K15
3020C34r7pK0k01P4o3J60k5J07j66K55K48j62j28j18Ln7O1j1j48K87j98o4O5o7K078L98k5
2882B553o77j539j15j0j20J11L2P5k88O4J67j26n1J64j02J19J71k89J45N2k83J92k30K59j35
2759A39m0J04j46m4L87k99J09O1j22P1l2l2Kn4K47j31p2O8J97k57K06k32l1k4K49n2q4J05
2621B93k22k2K60k34K82k25K1J17O6j00L5j06K66k30J78k19J63k24L43l58J78L7o8P7k3j66
2493A19L50j58lj24K24k68K77o8j17j73L85j10p4Q2J89l76J57m4j11J54J20l26M78n37L51
2370C97j30L7N1L0q7j1L32m48J40J75r1mj14J77n6n6P7k7L3m1L9Q3q7j2J59o1j39K15j68J5
$$ y = [129, 125, 77, 241, 172, 301, 152, 104, 210, 477, 98, 173, 325, 156, 78, 194, 177, 142, 52, 352, 84, 194, 109, 176, 219, 164, 143, 91, 195, 90, 124, 149, 218, 195, 229, 85, 164, 70, 223, 143, 55, 74, 329, 60, 277, 159, 147, 294, 113, 251, 278, 81, 171, 137, 169, 159, 113, 101, 119, 334, 237, 230, 250, 49, 123, 60, 220, 195, 302, 136, 391, 639, 477, 349, 231, 234, 177, 238, 227, 79, 366, 168, 104, 169, 102, 2180, 2578, 2553, 1876, 337, 222, 212, 92, 203, 235, 310, 22, 86, 253, 127, 76, 240, 138, 257, 428, 139, 284, 336, 53, 245, 15, 274, 139, 99, 203, 57, 13, 400, 101, 210, 271, 149, 220, 188, 156, 158, 104, 351, 220, 148, 216, 413, 156, 362, 130, 99, 75, 324, 272, 188, 293, 71, 49, 309, 75, 357, 132, 153, 270, 336, 236, 271, 165, 431, 201, 379, 160, 323, 99, 442, 84, 262, 299, 231, 308, 285, 119, 469, 311, 308, 184, 408, 140, 417, 349, 232, 59, 444, 334, 260, 342, 531, 155, 312, 268, 157, 311, 431, 105, 583, 46, 397, 267, 304, 355, 385, 298, 287, 619, 171, 311, 486, 395, 391, 277, 454, 398, 342, 419, 392, 425, 384, 423, 506, 419, 407, 566, 505, 366, 581, 413, 428]
2222D28J94n1m1j34J72j29J45M5o5J31jj51K32m3o5M4j99K91j22J92j47K62k6j12K20n7M2
2090A055p8P2L11k67J27J64J17m5L17Q0K74qM74M3O38J08M34O55Q77J420K983M444K23832
1976B38027J6640k03832l4032p549k627j199j117n54m88k92l19k64l39k7k71M6m96K02m29
1883A080K28j6j10j1l5j75p8K42j09l16K14k60L13k01N4o4j70Q1L3q9J1O8r3j41K24l7j61
1750D82j38K34n0J34k39p8J47Q6m7o0%L4j28K6O5J4k34L5J30N4j41J01kj35N3P9M0n8k56L76
1602E24k76J25N7l19K67J1N8j98p0J84j73J00O7k06K29k10J24o0L9N9j19j22K99q7L67k38
1474D32j2k00P5j08K08j72O7j17K74l85J55R3j39P1M0k5j57J4J43Pq8K30q7j34N4j27QM6J36
1332C02o3J4op2J59q5N2k03J28N7j42P7p3jJ35r1j08J55P8j66l6J11p0K0O1Lrk5j58J53o5
$$ y = [428, 622, 571, 530, 396, 568, 439, 584, 629, 564, 695, 694, 543, 775, 732, 667, 711, 512, 803, 681, 873, 726, 988, 962, 850, 1070, 1013, 1055, 977, 1049, 1360, 1093, 1220, 1384, 1501, 1456, 1773, 1853, 2127, 2119, 2593, 2636, 3274, 3382, 3816, 4471, 5348, 6768, 9751, 14195, 238027, 254667, 50835, 16803, 9254, 6627, 5428, 4311, 3757, 3269, 2977, 2658, 2394, 2055, 2028, 1757, 1803, 1307, 1509, 1080, 1308, 1292, 1182, 1171, 1136, 961, 883, 1125, 1016, 700, 914, 654, 967, 766, 820, 756, 586, 667, 700, 611, 622, 690, 597, 456, 680, 643, 482, 344, 578, 528, 662, 423, 345, 492, 578, 531, 471, 471, 505, 377, 403, 468, 482, 248, 283, 413, 467, 326, 427, 425, 290, 343, 422, 462, 404, 148, 524, 248, 373, 430, 111, 378, 389, 447, 249, 179, 363, 190, 290, 357, 151, 380, 170, 294, 234, 273, 332, 213, 91, 390, 303, 670, 432, 420, 220, 295, 187, 395, 223, 290, 173, 447, 62, 217, 310, 171, 242, 282, 257, 100, 114, 257, 264, 176, 406, 319, 185, 239, 112, 120, 166, 302, 239, 253, 247, 175, 334, 249, 301, 98, 226, 283, 141, 218, 145, 144, 279, 188, 80, 235, 313, 147, 111, 222, 152, 172, 233, 236, 227, 202, 44, 197, 132]
1179A32J48j29j7K61l17J28o0J11q0N6n5Q2j39N6o6J23k4j36K2K7L1K9n9K13L6k90J17k9L7
1036B08J00j39r3P5Q2j11N6Qn0K0p6N9N7n0j6r0Q5Q4nP4p9J3n6K2o0J7n8J08K8k8j20K45j42
874A68K6k6j17J30j30O2L7JJ58j58m3L5L5O1Q8k72J07l0qJ16j90J98j67N0J6O2j61J46j71
731B3R7O1q1J62q6j30J06l7N5J88k07P2r8K4n9J28K30l23Q3j16J54n6n7K3J18m8j58R6qj2
583A44J6j09R0J15j94J05n6J23N6m4j7p6k5J8nN0Qo0L9J47j14l7l7o5M77k73o1L9m6Jj13P5
426A71j4R5r4J5P6j67L6l0L6j3j7L6K4q6Q2J54k69N3J03J55j20r3m6K93k61J70k12J2J06n0
278A45l5M3j9JL7n5P3o0k9L0J00j57L3K4l5K45q3r4q6OJ31o9n6R9j39Q4O3j49PJ8K75jk85
116F2J0J05j15qj9J01N8l4q9QK9k4KJ55j76O0q4J43l3n2L8Rm6N5K9J3k8n3P0j32J22K2l5J50
$$ y = [132, 280, 151, 134, 395, 78, 206, 146, 257, 177, 233, 178, 260, 121, 177, 111, 234, 210, 74, 96, 123, 154, 183, 124, 337, 373, 83, 200, 171, 208, 308, 169, 76, 151, 233, 122, 178, 186, 136, 156, 80, 139, 196, 146, 130, 40, 125, 209, 204, 278, 199, 212, 156, 178, 118, 135, 77, 185, 213, 185, 65, 310, 168, 194, 168, 51, 181, 51, 113, 150, 151, 309, 151, 108, 143, 178, 239, 327, 55, 162, 132, 124, 240, 50, 248, 81, 131, 147, 209, 48, 194, 23, 120, 181, 100, 262, 176, 46, 152, 115, 170, 358, 151, 223, 125, 149, 90, 218, 448, 125, 208, 92, 246, 190, 133, 156, 274, 226, 68, 164, 156, 144, 160, 51, 141, 256, 62, 167, 111, 234, 290, 246, 229, 153, 128, 146, 141, 191, 199, 139, 178, 325, 211, 174, 137, 72, 549, 276, 215, 254, 208, 209, 96, 171, 157, 252, 158, 173, 249, 82, 118, 88, 124, 111, 94, 130, 154, 68, 150, 304, 35, 88, 191, 346, 226, 133, 87, 380, 119, 289, 77, 89, 195, 145, 110, 153, 134, 135, 172, 117, 190, 130, 101, 131, 231, 74, 107, 131, 96, 341, 258, 164, 78, 84, 215, 146, 90, 189, 50, 134, 197, 48, 55, 73, 348, 347, 62, 72, 177, 62, 54, 35, 136, 194, 160, 71, 79, 108, 84, 86, 241, 65, 125, 41, 184, 151, 99, 137, 146, 100, 155, 184, 197, 169, 116, 186, 54, 176, 198, 163, 313]
-52C13k11o3J69l9K6o7J1pp6Qn8M4J15Q6Rj69P6J9r2k1k9L8K05k16R7j1K8m5kn1J08n6M2p5
-219A06K4k2K3J60j83K6o2J28j27Km1J49r5kk9J15p7J0o3Q6L8j24RJ8J62j07Q7j14J51J6j78
-371H6k1k2J34q3pm3J91j64N8M0p8J28K6n2k4m1l3J1LqJ65o3l2o5K7k3K2o0j5
$$ y = [313, 102, 39, 208, 169, 195, 128, 139, 132, 56, 64, 6, 50, 165, 251, 260, 91, 167, 186, 94, 73, 44, 82, 287, 71, 168, 157, 185, 140, 138, 87, 195, 139, 181, 106, 130, 108, 131, 291, 108, 134, 72, 200, 73, 75, 34, 183, 88, 86, 57, 172, 95, 105, 42, 128, 166, 42, 51, 69, 231, 124, 211, 97, 248, 264, 86, 65, 43, 177, 94, 87, 44, 235, 71, 129, 169, 91, 219, 245, 193, 169, 128, 95, 106, 109, 101, 266, 203, 171, 106, 133, 110, 132, 72, 57]
-514E7
##PAGE=	F1=1981.31
##FIRST=	4521.1612903296090735,	4521.1612903296090735,	0.071562714874744415283
##DATA TABLE=	(F2++(Y..Y)), PROFILE
4521D8k2P7J04m1l0o4M7p5L5J12j32Q2l4K1J3J58j58L1m5j2RRJ40j36j1K3j9PooL8J16l3n0
4354A96l8Q7k06P3P4j59J97j38n1M8J34k10P2O4j02P0J3P8j10J15P3N6j54j8l3M5j61J29O7
4211B11j21QqJ56j13J9N1o6N5r9R0l3%m0oJ06p3j16J83j20R0q3K23k86J3Q4J9Or4J08j4p5
4054G5J79m1J4j49n0R9M3q3j4P3q4M3R8q1J66j47km6l7rL4K7J12j61J37J13k43l6K20j20n1
3901G9K25k42P9P9j08K05j43q7J34p5N0L3j59K9JK34k01N4J25j73Q5n8j02J88o4J01j60o1
3763F8J65o8kp2k2P8j3r1J89j56R0K2j44Q9n7O4K3K4j19KP0Q7N8K5k56J88k11O6K27j38k0
3611A66N9j47lK03k2N7p9p4p4m4P8nJ16Pj95R0Mk1N6j10K63l10J36j1n8J10p8O2L0k7PM4J1
3448B41n5j03K55j68J07j04J43o7l9p2J3j10Q9R1o6j0Nm9J23Jj32K1o1J53o2J39j94Q3l6r2
$$ y = [48, 26, 103, 207, 166, 136, 72, 119, 44, 79, 191, 59, 141, 107, 128, 141, 299, 141, 172, 127, 115, 124, 133, 273, 137, 126, 149, 130, 137, 131, 125, 163, 279, 246, 196, 158, 245, 39, 112, 186, 27, 224, 86, 35, 83, 217, 7, 79, 143, 41, 111, 124, 202, 92, 207, 280, 336, 182, 164, 131, 176, 15, 144, 211, 90, 98, 90, 246, 133, 152, 203, 137, 192, 93, 183, 150, 150, 110, 104, 210, 137, 21, 204, 84, 174, 91, 314, 28, 41, 125, 144, 150, 56, 164, 150, 75, 254, 213, 227, 78, 28, 127, 170, 87, 73, 146, 62, 105, 203, 122, 288, 141, 139, 93, 56, 47, 81, 108, 220, 59, 196, 309, 66, 30, 250, 130, 79, 304, 62, 141, 220, 112, 317, 174, 87, 221, 146, 196, 229, 70, 99, 100, 334, 133, 187, 312, 139, 224, 166, 64, 252, 188, 289, 129, 68, 233, 165, 163, 91, 69, 147, 134, 43, 232, 76, 166, 188, 44, 133, 76, 140, 163, 187, 68, 70, 140, 227, 285, 310, 54, 242, 31, 97, 324, 186, 166, 225, 78, 75, 278, 256, 313, 234, 160, 86, 42, 120, 115, 231, 238, 43, 133, 137, 116, 172, 62, 325, 15, 151, 140, 82, 192, 114, 176, 206, 179, 186, 230, 241, 186, 83, 338, 170, 277, 173, 316, 249, 210, 138, 151, 41, 130, 221, 155, 145, 150, 101, 224, 225, 93, 114, 53, 206, 144, 283, 89, 172, 136, 44]
3300D4K50j21J41j81o9P5L63l87N7J57j34j09R1qj0q7K67k66J08j37J30Q4j08qj3J09j75J19
3163A82j7J7JJ01j59M3q1J21k2j13L9K17k59K22r1r9K09k14J91Mj77J00m5L3%n6Mj4K35j44
3015B28j2J33k86P1m5J79p9Q6j38K71K24j86p0j47M7r8Q5k8j38L07k28o3Q4j27K499N29j0
2882C088q76j815j05m9j71J52K9R3k37l6K08j00q3J92j28J19J67l14K42ml25K43k24K79k11
2759A34lR8j14r7M47l23P4N7m3J2Lp4nMK17j17q9N4K75l92K94k63L0p1K29o1m8J41k61k9K93
2606C72k86K86k06N3O9P8j11R6k56M23l20K10k05J71j95L08l81J80R3j02Q7l9k05L74j52O3
2478D05j70J97k78L20n1j61j22L68j16p3R3J04k39M1L3j30J67J15k87M13n58M37k00R5K6L1
2350D60r2j8L47m45R8K37q3k9j29J93l8p0N1L5j2m3J01J8o1l0K25j09j64K47j64J0K26j04
$$ y = [44, 294, 173, 314, 133, 64, 139, 502, 115, 172, 329, 195, 86, 177, 169, 159, 72, 339, 73, 181, 44, 174, 258, 150, 142, 129, 238, 63, 182, 165, 182, 183, 284, 125, 168, 87, 208, 186, 73, 112, 329, 70, 292, 201, 102, 311, 97, 288, 292, 115, 215, 170, 203, 203, 147, 151, 137, 372, 228, 216, 349, 63, 134, 89, 268, 189, 275, 137, 408, 632, 446, 376, 229, 276, 178, 263, 235, 97, 404, 176, 113, 197, 70, 2569, 3098, 3088, 2212, 397, 292, 243, 72, 224, 253, 346, 109, 73, 281, 181, 98, 290, 162, 281, 448, 134, 376, 372, 47, 290, 66, 345, 134, 131, 229, 115, 18, 465, 142, 216, 273, 230, 242, 245, 171, 166, 170, 387, 270, 181, 235, 510, 118, 412, 149, 179, 108, 337, 276, 228, 369, 108, 79, 372, 86, 372, 166, 219, 288, 366, 255, 351, 95, 518, 198, 408, 203, 374, 179, 487, 106, 286, 379, 277, 364, 325, 120, 494, 342, 405, 235, 432, 154, 474, 423, 262, 140, 508, 392, 319, 412, 516, 277, 318, 351, 221, 388, 503, 216, 629, 71, 508, 308, 403, 429, 460, 368, 350, 697, 252, 350, 587, 504, 475, 346, 539, 501, 431, 482, 517, 505, 462, 563, 581, 520, 490, 715, 606, 442, 689, 525, 535, 761, 657]
2213F57lr6J15o4Q0J08p9R2L8j45K35q2m8J20k60K96m7J21j26L08l5r1J85n0J15j02J22K45
2075A609j85J41J24J78l3L17J86L09L2N42Q8P16J73N68P70J158J738L619N896K74178K2671
1971C14795k50591m2835r570l478j589j325o95o17l68m24l02m68Nl52K1n43J73m14J73j5q1
1868A500n6l0j97r7K68j83k60J83k99L22k04K9mk28J07J0j11K8K8qk18J81L6j66j98K97n9
1735F71R3k05r0J20R5p0k3N4q9p2J9J9O0j72n8J52M7j19P4J9j44O5N9N9q9k10L10k45J06J07
1588E43m04L73q0J09k56l1J30l7rO9j94K16k30J85q7P9Qj14j53L68j75M57l08lj62K7q6J90
1450D25j67J09j55K68l96J55J28j48P7K3pj29k5J64n0j6J74n9j71Q4p6n1Q5J18p1Pl9j5Q7
1307C29n8J02k64J62J9o1L0j17K6J74j24o6J09R0j65l5J01r6M7P9mk4n7j13J61p2Q6l5o8K77
$$ y = [657, 654, 558, 673, 609, 689, 797, 718, 810, 848, 703, 938, 856, 808, 928, 668, 964, 917, 1038, 912, 1220, 1185, 1094, 1279, 1229, 1344, 1242, 1364, 1609, 1424, 1565, 1689, 1867, 1834, 2151, 2337, 2646, 2678, 3220, 3308, 4024, 4197, 4765, 5535, 6693, 8431, 12050, 17946, 292124, 314795, 64204, 21369, 11799, 8321, 6732, 5407, 4712, 4095, 3727, 3303, 3001, 2533, 2538, 2186, 2207, 1664, 1837, 1423, 1596, 1581, 1500, 1444, 1414, 1217, 1120, 1388, 1205, 945, 1128, 829, 1151, 947, 976, 972, 744, 851, 861, 750, 778, 806, 798, 580, 761, 797, 631, 433, 730, 671, 764, 559, 469, 589, 684, 614, 591, 645, 556, 484, 503, 522, 582, 410, 352, 504, 551, 432, 506, 525, 381, 446, 505, 564, 475, 265, 575, 330, 436, 543, 139, 512, 432, 541, 285, 254, 384, 347, 338, 407, 213, 429, 199, 384, 297, 376, 384, 270, 117, 485, 310, 767, 459, 456, 294, 321, 235, 425, 258, 367, 212, 480, 84, 239, 367, 219, 296, 319, 312, 183, 158, 322, 272, 256, 430, 371, 200, 284, 208, 157, 242, 360, 289, 296, 257, 242, 329, 271, 373, 109, 271, 290, 229, 259, 142, 168, 342, 218, 152, 261, 351, 186, 151, 252, 156, 203, 282, 278, 254, 197, 84, 245, 173, 259, 224, 156, 433]
1159D33l02J53j37J73j84J08l6J37k05O7l3Q6N3k18l0Q6L9J6q4K56M6l43J68q0lJ26j29m8
1021A15O6J03j74J41j05L2J5n2J6O7l2l9j30J04J59q9J44j57M6m0J5o3J5m5J22l4K0j56K76
879C40j12k2j3j80K39j72L8K1L2J46j39j8l6O3k9J47k23R0q0P8Q7j90K03j84P1l8J17j90J21
736A67j22N8J44j37K05r3j25Q7n7K6J93j90P9o6l4j05K02K45l85J14j40J79l1j07M6J20m6
603B27j57J20n9K6m0o6J11J20j76K9J2O7M3l6O4j24Oj1k2N7j4r2N6K13j50n0L4j24M15k07
455B72n9J9Mq2m1J02m8Q7r3PQ6k12P1k9Q5o0MO7nj27N6K01k98J27N4J77r1j47r4L52k69J62
298B78j16m7R2n3l4M4j6M0m3n9R3p4L8NP2j74N4K2k1K48n6j33j17P3O0k5r5J83j81Q9Q3j70
140F0j9K3L31l4l18L9M1m1M3n6R8M2L5j89M2Rk9O9J45k65Q3o2J75l5q7N7K0l5k5O7J3L0j29
$$ y = [433, 131, 284, 147, 320, 136, 244, 208, 345, 140, 207, 174, 260, 313, 95, 65, 151, 190, 206, 122, 378, 424, 81, 249, 169, 166, 292, 163, 115, 181, 284, 110, 251, 146, 178, 193, 141, 157, 224, 192, 153, 23, 127, 286, 197, 341, 184, 230, 190, 205, 142, 157, 112, 234, 200, 220, 64, 340, 228, 206, 193, 13, 252, 80, 118, 139, 171, 317, 178, 160, 124, 187, 158, 305, 82, 172, 92, 170, 257, 67, 270, 86, 157, 119, 236, 46, 167, 45, 103, 247, 110, 315, 222, 97, 184, 127, 153, 346, 156, 235, 169, 135, 30, 232, 477, 92, 206, 66, 245, 214, 107, 153, 273, 227, 70, 190, 131, 157, 117, 51, 162, 282, 106, 135, 147, 214, 257, 221, 285, 161, 167, 156, 134, 191, 177, 85, 141, 354, 204, 154, 188, 64, 479, 272, 213, 232, 236, 154, 113, 215, 167, 254, 161, 168, 254, 42, 113, 84, 169, 109, 113, 180, 175, 48, 104, 305, 7, 134, 188, 365, 274, 127, 33, 385, 116, 278, 162, 115, 207, 154, 120, 164, 148, 188, 145, 86, 179, 105, 143, 148, 220, 46, 100, 122, 101, 349, 293, 160, 43, 116, 176, 151, 56, 239, 58, 147, 230, 60, 41, 64, 395, 361, 43, 82, 123, 82, 125, 69, 167, 209, 244, 55, 97, 106, 77, 146, 291, 26, 109, 47, 222, 187, 100, 157, 177, 142, 117, 184, 197, 227, 98]
-22I8Q2j29J71n5j3K02k64o5J90j9N7q4l0n5p3N3m7MJ48O8L4j67O4L5q7k0n2lK30j90P9J3
-180A75J4k3k3m5R1j4J9j40N6J8N2J32k12P2r4J17j60O1q3J67j09O9p4J50j04O6j45Q9O5j14
-327G3j4OJ93j12R0j88J74M2j45p8j0J66q0p9j6K09j35L0Q5r8J13M7n2m4p7qK4L7o4K02q9
-480B02m1p4N6m3O2j03N0
$$ y = [98, 180, 51, 222, 167, 154, 356, 92, 27, 217, 198, 255, 171, 141, 86, 13, 66, 19, 23, 171, 239, 273, 106, 170, 205, 118, 98, 46, 43, 273, 83, 162, 175, 189, 166, 143, 98, 189, 175, 194, 54, 110, 128, 180, 312, 100, 172, 78, 195, 35, 96, 13, 180, 71, 140, 66, 216, 112, 178, 33, 122, 187, 73, 59, 65, 258, 146, 236, 48, 222, 264, 119, 41, 31, 197, 117, 38, 22, 231, 96, 126, 211, 113, 226, 273, 221, 177, 100, 92, 116, 153, 89, 291, 202, 161, 87, 143, 100, 162, 59, 109]
-514A09
##PAGE=	F1=1976.39
##FIRST=	4521.1612903296090735,	4521.1612903296090735,	0.113860301673412323
##DATA TABLE=	(F2++(Y..Y)), PROFILE
4521G6o0J13J03n2o5p0R6q1lJ19p6M7m0K6K1J64j67RKp9N6k2J55j43JM5p2Q2m2m2Q3J21n5
4359B50j01m3R1j15N6M9j62K35j56l7mJ70j61J0L6p3N1O1Rr5J41N0J03j70j2k7J1j46J45J02
4211B68j53l1J0J76j27K4O8j36M9p4Q2MJ3o9kJ16j14n0J42j05Q4j30K21j99JN7m0O8r4O1K0
4058A40n3K01q0L0j48n0J01M6j12J2L8o9P3O2o8J67j50J5o8Pm1Q0nP8j41J75Q4k12n2J68r3
3906A35n8K12k05L1J00p2J57j24o9R2p5M3L6j17J6MK59j86L6J08j70P2m0j28J94q2R4j39o9
3763E5K11n0r5k0l6M1N7q3J43j03O7pj50J22n0L7OO2j27j7P2Q9Q5K9k60K08k40M8K07r2l4
3611A75Q7j99M8J50jK8j3j10p1n7J08k2P7K4j48N9j4O%j01K99k71J13m4%Q4j05J12m9L5L5
3458B35j9N9r0r7K62j31M8j37J57m9k4o7K3j20J15J0l2L4nj05J60J6j15k9L8P7n3J08j69J08
$$ y = [76, 16, 129, 232, 180, 115, 45, 141, 60, 57, 176, 100, 147, 107, 133, 154, 318, 151, 160, 162, 83, 139, 117, 272, 129, 130, 175, 103, 185, 143, 101, 184, 305, 250, 149, 106, 197, 82, 138, 187, 25, 260, 104, 67, 63, 233, 72, 82, 118, 45, 96, 157, 166, 71, 212, 262, 365, 195, 183, 156, 167, 21, 166, 268, 115, 84, 94, 270, 143, 167, 235, 99, 148, 74, 156, 160, 173, 104, 102, 218, 104, 54, 196, 91, 175, 45, 266, 67, 68, 125, 85, 153, 59, 120, 140, 87, 288, 208, 238, 90, 40, 141, 187, 75, 87, 125, 56, 129, 191, 123, 290, 140, 155, 87, 94, 53, 133, 128, 206, 65, 240, 324, 112, 60, 228, 135, 77, 289, 84, 115, 215, 143, 300, 176, 107, 199, 124, 167, 203, 86, 102, 106, 365, 179, 215, 323, 153, 225, 185, 57, 251, 169, 263, 124, 55, 266, 216, 121, 101, 65, 106, 163, 80, 223, 120, 187, 180, 30, 152, 102, 139, 145, 207, 80, 63, 135, 224, 309, 338, 78, 286, 46, 94, 301, 209, 175, 262, 63, 111, 261, 260, 288, 275, 165, 94, 37, 145, 123, 200, 224, 76, 135, 121, 127, 127, 26, 325, 54, 167, 123, 123, 207, 102, 214, 165, 200, 235, 216, 275, 185, 88, 350, 219, 267, 130, 287, 238, 214, 147, 170, 50, 165, 175, 143, 177, 172, 67, 227, 243, 128, 99, 137, 214, 161, 269, 100, 208]
3310B08n0p7K43j64J48j95o6M5M17l88K3J67r0j27P6j3No1K02k48J21j36J31J02j35kK9J18
3172B83k47J97n6l9M2J42j57Ml5N7K1j26O5J59k24K06n3j26K04k53K51l3j48J17o7M4K2o6
3035A84lj2K10j74qK14l21N1j0J63j00L2p4K25K36k35kj35P6j47R1k2j36L15k26p1R3j05K680
2892B789O41rj024j974p9r3j81J71NJ23j90j20K31n3j16J83j37J51J14l05L07n8l01K30j98
2769A07K91k76M0R0j00j08M72l35K4N5L8j7Lr6l3J05J41r9j04N1L22m44L33k97O9o4J73o6
2631B75k4J74k81m8L07k42J96j56P8LJ00j00J28l89N39l79K24j74J61j39K50l44J24J71j55
2508B99J11p6k09L68j29J06j88J51k42K90j7j62o2L13j44p2J16K2q6o7Q5j44J77R7k20L13
2380F30n20M80k44J16K4K8p2m3L45m40R0K50o1m3j54K07k6q5M8N9m2l0J48o8jn5K88j55j90
$$ y = [208, 158, 81, 324, 160, 308, 113, 47, 92, 509, 121, 144, 311, 221, 94, 170, 157, 162, 101, 303, 55, 176, 40, 171, 273, 138, 136, 165, 283, 36, 233, 177, 138, 180, 322, 165, 169, 134, 191, 212, 86, 151, 310, 86, 292, 239, 113, 317, 64, 315, 282, 134, 251, 184, 228, 250, 184, 181, 169, 379, 205, 197, 411, 90, 141, 131, 294, 194, 226, 152, 377, 613, 378, 376, 241, 317, 170, 261, 239, 103, 418, 192, 121, 214, 109, 2789, 3430, 3421, 2397, 423, 344, 251, 70, 241, 246, 369, 179, 59, 290, 237, 121, 304, 167, 318, 432, 127, 434, 376, 75, 305, 107, 398, 122, 162, 252, 152, 44, 516, 181, 205, 260, 298, 281, 284, 188, 155, 260, 401, 302, 198, 249, 571, 127, 460, 163, 232, 168, 341, 275, 251, 425, 144, 96, 403, 161, 357, 201, 279, 282, 382, 282, 410, 21, 560, 181, 405, 231, 392, 253, 503, 159, 283, 454, 299, 410, 334, 125, 493, 364, 470, 282, 433, 191, 481, 464, 302, 240, 553, 409, 337, 453, 475, 389, 322, 407, 263, 440, 537, 317, 630, 110, 590, 346, 462, 486, 514, 442, 399, 744, 304, 394, 644, 583, 540, 386, 593, 567, 482, 530, 589, 547, 517, 665, 597, 596, 541, 829, 674, 484]
2237D84K65j66L1K30j28Nl0L5J5J6J45p6N9O0j14K13j18j9J62k72K58M7K9p9L01k1p7J43l6
2095A362J73j18J46K04j17J42Q3K23J2K93K56L19P5N70J39P29K20O78Q29J380J891M029O971
1981B0489L04993K7642k79767m8804j0977m086j911j439p87p20m22m89l36n46L2m21on36J18
1888B027l57J32m6k0j14m9j70j19K56k30j63J23l18L06j90J7M7k67R1J0j35O8j5M5k61J32
1760H00J10j65k54L59o5K4j41j00Q8Q7p9J8Q5k03nL6n9J01q8j48J51M9r6J9O3j29L6P3N6j17
1612E06j61K65k17P0J48m52M42j39J37k95J5P7Q0j17Q2j73K03k20K11j36J30o2o1j84L87k27
1484C09N04k80k8j30o3l9J72j86J78j91K32l50J30J38j28N6J2J6r5q2J83r3M0J24j0k40J10
1351B89%j04J02J01o9Rp3N1J5l3J24l08K03l7M6l1j56N1J97j45j5M4J07j58j7Q9j35P5P7J5
$$ y = [484, 749, 583, 614, 844, 716, 721, 691, 726, 741, 757, 902, 826, 885, 945, 831, 1044, 926, 907, 1069, 797, 1055, 1102, 1131, 1052, 1353, 1332, 1255, 1398, 1362, 1535, 1417, 1563, 1767, 1650, 1792, 1875, 2098, 2110, 2403, 2659, 2978, 3053, 3623, 3762, 4491, 4711, 5389, 6218, 7598, 9489, 13518, 20489, 325482, 353124, 73357, 24553, 13576, 9490, 7579, 6140, 5353, 4633, 4211, 3722, 3386, 2840, 2872, 2451, 2445, 1909, 2027, 1670, 1802, 1756, 1736, 1622, 1573, 1403, 1284, 1540, 1310, 1147, 1270, 952, 1258, 1068, 1085, 1132, 865, 956, 966, 831, 899, 884, 929, 668, 800, 910, 745, 491, 850, 785, 809, 668, 568, 656, 743, 664, 682, 767, 564, 559, 595, 536, 637, 549, 401, 552, 601, 505, 524, 587, 458, 494, 567, 623, 506, 345, 610, 393, 463, 611, 159, 601, 462, 599, 304, 319, 396, 476, 359, 441, 268, 471, 251, 462, 326, 456, 394, 333, 149, 536, 309, 813, 533, 505, 375, 312, 273, 445, 259, 437, 246, 478, 128, 258, 396, 268, 324, 336, 352, 257, 175, 358, 265, 305, 429, 419, 179, 289, 289, 185, 287, 388, 319, 328, 255, 306, 321, 288, 412, 104, 307, 270, 316, 285, 129, 180, 377, 232, 217, 261, 368, 210, 193, 282, 147, 222, 299, 314]
1204C14n4p8l1J23o4J4N1j00K72k54J43j85K35k61J16NJ61k49O2J1L3J29k67j01J53M0l1p2
1066A15K73N2l69K15j11j1R2q7j1M7R5j92K14k17Q9M1m2pL3K2q5j44J31J86j34J76k12P8l4
923B03pm7J9k9J15p5M8j47K64o1o1l0j40K44j95M9k0N4J28j21Ko7N9j05J91j49N6p4J06L4
775B44j55K04k24J32q9J56j25oo4K9J98j99K26n6j34O1p2K0J53j28N6k3p9p6J91K59m24J23
638A98j09J50Oj74O0J35m9j31J45j08K9o7K6O0J14j25p9R4RQ1q2J17j43K0j5n6J06o7j19R2
490A18K43j64o5J25j73K92j13n4l5Q3j45MJ26n6O3j11N2M5k00R3m1J05p3J0J15p2j25L9J83
347B69k32J36OJ83p1j60j00L45k62J37j6q7M1j5l1K4JO8j03q4J09o8P6j3N3j20j3M3RK05m3
195B87j42j21J03K3Qj16K27j97O5J13j86m8N0L48o1l08N0J0J8N2o9P1M4Q7k76Q0k0k0J24J30
$$ y = [314, 260, 182, 151, 274, 210, 224, 275, 175, 447, 193, 336, 151, 386, 125, 241, 246, 407, 158, 220, 231, 264, 393, 126, 25, 178, 218, 187, 115, 388, 440, 71, 286, 175, 164, 256, 169, 158, 205, 300, 108, 322, 105, 194, 235, 193, 186, 219, 241, 156, 12, 143, 329, 195, 371, 159, 237, 203, 196, 149, 168, 139, 254, 179, 227, 80, 344, 283, 222, 192, 52, 296, 101, 150, 130, 184, 312, 191, 193, 126, 185, 80, 271, 122, 178, 104, 210, 244, 89, 293, 69, 201, 112, 268, 143, 137, 73, 102, 300, 101, 327, 271, 137, 198, 126, 146, 299, 171, 227, 204, 125, 49, 240, 499, 75, 198, 89, 239, 245, 71, 131, 266, 217, 86, 231, 123, 152, 85, 111, 171, 285, 160, 81, 175, 184, 265, 183, 300, 157, 177, 162, 106, 212, 145, 26, 118, 361, 197, 132, 257, 84, 376, 263, 209, 174, 257, 112, 116, 242, 186, 249, 138, 190, 235, 35, 128, 87, 192, 119, 129, 244, 172, 47, 86, 269, 37, 173, 179, 362, 291, 131, 31, 376, 114, 251, 235, 148, 189, 174, 143, 167, 168, 236, 133, 49, 158, 90, 166, 153, 206, 86, 73, 116, 125, 330, 287, 145, 24, 127, 150, 158, 42, 269, 72, 137, 250, 64, 16, 66, 414, 353, 45, 95, 105, 123, 175, 106, 177, 221, 308, 32, 112, 92, 72, 196, 326]
47C26l01O1k8J81j8j02N3N9j8r8N8M0N7j89J00j17K04j33K2K23k90o8J74QR6j08m1j10k4M6
-101F3qk3J21M8N5j39N9K8p2Nn0k2J99j64L4N1Jk8j7j5O9JJ6j87O5N4P1J02k19R3r5J15k06
-263EJ26j02J50j26J14r7J76j22R8j34L0P4j02j3KJ91j05O3k08J65P2j15p3o6K26q6j16LJ90
-406B20r6PJ06j21J10O8o6n9r3j8O7O8j15K07q5m9o7N2m9P6q0N5
$$ y = [326, 25, 86, 58, 239, 221, 119, 172, 231, 213, 115, 173, 213, 270, 81, 181, 64, 268, 135, 157, 380, 90, 22, 196, 204, 300, 192, 151, 41, 17, 63, 55, 32, 153, 201, 256, 117, 176, 204, 132, 137, 87, 65, 264, 100, 134, 185, 186, 158, 141, 126, 195, 196, 212, 25, 90, 144, 215, 317, 98, 191, 96, 211, 5, 131, 29, 179, 53, 167, 70, 246, 124, 222, 88, 118, 192, 90, 77, 79, 270, 165, 228, 20, 185, 257, 142, 69, 3, 229, 143, 27, 30, 220, 124, 131, 237, 116, 226, 294, 228, 169, 76, 58, 125, 193, 78, 285, 200, 151, 84, 136, 87, 163, 83, 138]
-514A38
##PAGE=	F1=1971.47
##FIRST=	4521.1612903296090735,	4521.1612903296090735,	0.15615789592266082764
##DATA TABLE=	(F2++(Y..Y)), PROFILE
4521A05o9J11J07o0j01p6J46q7m0J26k9Nl9L9K0J64j74qK4j04R1o7J79j41LN9j17J67p8p8
4373G8J18J18o9j46K1J0k3M1L6j53K47j32l5o8K03j18j3k2k4j3J26m3n5J24K7J50j53l8k2
4231A72k2r7J27J41j80n9M2J45j24K5P9j87N9n7O5M2K5r4OR4j22J1R7r6P0j22J63j08qO3j33
4078A7J34q9J3N5l1K23j19M6j48m8R9M3j07ONn0R9K2l0J28j43M6r1N3q2J19J9j2j27K07O7
3926C24j65p0J18o6o5J93j71J7Q7m6R9q3k7L1r1M6M5p5LjK76j70J8R8j58N4k5j22J69r7R1
3773B37j18p7K49m2j78M0l8J6P8n7R9m4M2l5j57J57m4J1j2J01j36l5O0P7J12L5k35J88k37
3630E7O2J59p3m0J26k18O5R3J5jN5j38n9p1J39m0L8L7j06O3o7L2n9l7K78k32Q9o9O6M9j39
3478G4J70j20R7O4r1R8j25r1K64j00oj63J79k4j6p2N7j08J26q3JP9rj52J80J3j09k3J16k0
$$ y = [105, 36, 147, 254, 194, 93, 17, 163, 76, 36, 162, 133, 138, 99, 138, 158, 322, 148, 140, 164, 60, 151, 84, 263, 122, 125, 184, 67, 234, 156, 78, 196, 314, 245, 99, 120, 130, 107, 148, 184, 31, 278, 146, 111, 43, 246, 128, 115, 93, 69, 56, 182, 139, 84, 208, 235, 385, 232, 194, 172, 150, 53, 180, 321, 141, 82, 124, 269, 145, 170, 249, 62, 121, 64, 129, 171, 196, 102, 108, 202, 80, 91, 188, 92, 162, 40, 203, 95, 87, 150, 17, 151, 62, 75, 130, 99, 322, 203, 249, 101, 53, 152, 195, 88, 94, 99, 49, 148, 170, 140, 268, 125, 171, 80, 133, 51, 170, 189, 177, 50, 257, 324, 159, 89, 207, 141, 76, 269, 98, 115, 202, 156, 255, 172, 145, 176, 85, 131, 176, 101, 104, 103, 379, 209, 227, 325, 167, 221, 196, 74, 243, 146, 237, 119, 42, 291, 249, 71, 111, 73, 89, 167, 110, 209, 165, 207, 172, 15, 172, 128, 139, 127, 228, 92, 57, 117, 194, 306, 341, 106, 294, 57, 119, 278, 205, 165, 291, 73, 138, 231, 246, 245, 300, 162, 103, 32, 171, 131, 169, 206, 100, 163, 96, 128, 69, 32, 310, 78, 167, 98, 164, 213, 74, 244, 124, 221, 285, 194, 292, 167, 76, 340, 240, 234, 71, 250, 226, 210, 138, 195, 87, 213, 130, 131, 210, 201, 49, 229, 242, 133, 110, 226, 206]
3330B06l7Q5j52J24n0n1J96j83J68j97m4L3L80l70rJ78l8j37O0j7K0l5J40k24J31p0N1J06
3192B64j50J6O5J20k64K19q8q8P5J74j47k5J4lL0j06P5Q4j59J53j6q5J44k78L05p4j19J35
3054B71q9N4M5p8rrJ84k03j3K86l39M7J7J38j12j2j8J71K48k86P8j10O9j69O0J3j37L17k23
2912A91p9J21o6K661P08j8j113j978n2j26j81J74l7J58j40j70K22Oj37J67j55J71M8k63L38
2789D50r0k56K08j80L03l41Q3Q2p4j07M48l31k9M8J28l8Lj19o1K06N6q8j15N1L66m34L18l19
2651A68J04o2J18p0j0K00l00o8L43j78O4q0R0p6J28q2J60m13N29m05J94j19J46q7J99k98O0
2518B55K40k08J35r2j92L12r0J51k07R3j54K04K4j24l3K55j76p6J34k6L5j71J41j57J86P9
2390E38j54K19m79M95k52Q8M1L2m6p7L31m25R5K50m9m6j69K10k3q5N9N1m1l1J80j42O8r1L40
$$ y = [206, 169, 254, 102, 226, 176, 125, 321, 138, 306, 109, 65, 98, 478, 108, 99, 277, 239, 102, 162, 145, 165, 130, 270, 46, 177, 107, 158, 264, 114, 130, 195, 315, 51, 270, 182, 94, 169, 343, 196, 171, 185, 182, 212, 106, 181, 265, 106, 259, 243, 158, 302, 24, 329, 255, 136, 271, 182, 236, 281, 203, 194, 185, 369, 166, 153, 439, 100, 147, 164, 302, 190, 178, 160, 331, 579, 293, 371, 261, 330, 161, 221, 234, 97, 414, 191, 112, 233, 167, 2828, 3536, 3518, 2405, 427, 375, 249, 68, 242, 205, 363, 223, 53, 275, 281, 144, 311, 156, 327, 375, 112, 450, 360, 104, 312, 132, 435, 94, 177, 259, 185, 78, 526, 195, 166, 214, 342, 304, 307, 188, 127, 333, 389, 301, 186, 237, 603, 169, 487, 168, 272, 210, 328, 258, 248, 448, 148, 80, 423, 245, 309, 229, 319, 243, 371, 289, 449, 36, 565, 160, 354, 235, 381, 294, 493, 195, 255, 495, 287, 422, 330, 138, 450, 360, 511, 304, 397, 243, 447, 471, 347, 314, 569, 393, 317, 451, 425, 460, 289, 430, 273, 459, 538, 384, 603, 124, 619, 367, 455, 496, 528, 482, 405, 736, 311, 406, 656, 607, 561, 392, 602, 579, 494, 553, 604, 563, 532, 712, 570, 638, 547, 887]
2247H87j89k05K68j85Q7K00j48J9L4m4R5n0J71q4K7Q2q5J92j50J6J71k52K04J27n3j9K81j7
2109A380o4J02l8K16j01J37J56n5J42M2K53M2K69K60L22J11N65J56P09K33P26Q26J519J849
1991I757M156P476L10542L0699k85980n0867j1503m364k112j429q23p69m31n09l33n87L6m45
1903B514j4n13P6k90R0p5L9j71m5j22j52K34k62n2M6k89K42j59RJ00k72M2J2j53J08n9J09
1770I93k93P3J72j49k93L75m8l8p1j09N6P9q7N9J14l16O2O3j24J29j5k26J62M9p2l6J08j15
1632E02OQ7N4j45j12K20j89K9J86m68M79k11J55k85M2M3J49k11J11j57J86j76K03j81J85j22
1504C80%k31L91k28M92j96o1j11j67J8J62k14K39k28J96k95J15J46j08K7pM7n2j48J94j19
1376B42J13P2L9l08J36O7j65J11P7n1K6j15J10n6rJ46l52K42r3J55r2j94P4K29j57K6k8J24
$$ y = [887, 698, 493, 761, 576, 663, 863, 715, 734, 768, 724, 819, 769, 940, 856, 883, 965, 880, 1072, 922, 938, 1109, 857, 1061, 1188, 1135, 1116, 1397, 1380, 1316, 1418, 1380, 1596, 1495, 1632, 1788, 1733, 1875, 1917, 2170, 2212, 2481, 2741, 3063, 3174, 3739, 3895, 4604, 4837, 5563, 6389, 7908, 9757, 13913, 21389, 331931, 362630, 76650, 25783, 14280, 9916, 7804, 6375, 5552, 4783, 4352, 3843, 3510, 2923, 2959, 2514, 2500, 1987, 2063, 1773, 1863, 1788, 1827, 1656, 1611, 1489, 1337, 1571, 1309, 1257, 1303, 1014, 1256, 1097, 1106, 1206, 934, 976, 988, 835, 943, 884, 993, 700, 773, 945, 796, 503, 878, 830, 792, 721, 612, 668, 747, 660, 719, 833, 517, 579, 642, 518, 647, 632, 406, 568, 617, 545, 509, 617, 502, 508, 595, 649, 504, 392, 612, 423, 452, 638, 170, 649, 438, 593, 308, 350, 393, 542, 331, 442, 285, 471, 295, 498, 317, 502, 380, 380, 149, 540, 312, 804, 608, 547, 436, 269, 287, 449, 235, 474, 246, 442, 147, 262, 408, 300, 327, 320, 367, 315, 167, 361, 242, 355, 427, 466, 158, 294, 361, 196, 307, 384, 333, 359, 244, 354, 298, 289, 435, 83, 325, 232, 387, 295, 101, 175, 404, 247, 273, 245, 369]
1238C69j52JP8j70J07M2O7q8j04N2Q5m9m9J28j40K60k16J46k19K72k98J20M2J76l00N6N6k8
1100B44J95k86j43J79O5q2o5K70L7l54K39j06J6k1j6K0K0J00j98K54k95J24M7k3k3LQ0j48
962A33j06J29J84j75K12k27Q6k5k5l0K4j4J07j22O6j37K50jr2m5j01K49k19O1o2P7J09j08
825A98J3m0Kj28J80p5K5m3R2Kr8J87k80K02j32J82p2r2l0LK57k74K32oj28L5q6J3J14p5K5
672B03K9j14QJ24K71m62J40p1J05K8j85K0J57m5j06J71j58L1r2J18MJ04q1j28J25l4J15j32
534A45J61j69M3j3q3J64j51o7Q3K27j61o1J91j80J56l2n6r7J69j99M1J41o2L7j19J05Kj86
396B9J14n2J24q7RJ54j11r5j0J34j34J12m4J89m2j63p4L06k51J15Q4j26j0K2k8NJ9R5j63j09
249A2J26o3J05l9M3n7q2O4L2J53l0j53n1N1L6K8j43K68k14M1J35k09j2K9L52j02k54L6L9K6
$$ y = [369, 217, 218, 296, 126, 233, 275, 342, 254, 150, 202, 287, 238, 189, 317, 177, 437, 221, 367, 148, 420, 122, 242, 284, 460, 160, 216, 272, 244, 439, 153, 10, 189, 254, 172, 107, 377, 414, 60, 299, 193, 209, 188, 172, 192, 212, 312, 114, 368, 73, 197, 244, 221, 198, 201, 281, 133, 27, 156, 340, 165, 377, 150, 236, 211, 186, 156, 180, 166, 273, 151, 217, 80, 330, 329, 237, 192, 91, 340, 121, 182, 120, 197, 306, 198, 211, 171, 173, 45, 225, 150, 175, 132, 224, 226, 128, 315, 35, 237, 105, 287, 215, 123, 93, 96, 353, 79, 311, 305, 177, 212, 126, 139, 253, 178, 203, 232, 118, 126, 250, 521, 59, 199, 128, 233, 261, 76, 96, 253, 208, 102, 273, 115, 146, 54, 172, 176, 280, 199, 71, 196, 162, 277, 145, 306, 137, 180, 167, 84, 248, 97, 30, 113, 340, 179, 118, 309, 129, 285, 253, 197, 100, 269, 70, 111, 252, 190, 227, 108, 213, 215, 29, 143, 91, 215, 128, 137, 291, 180, 85, 75, 209, 75, 187, 143, 332, 290, 127, 53, 359, 108, 223, 307, 181, 171, 193, 165, 170, 189, 284, 121, 12, 138, 75, 180, 141, 184, 127, 45, 109, 141, 294, 264, 111, 60, 111, 147, 175, 32, 300, 86, 127, 262, 53, 41, 70, 422, 320, 66, 102, 141, 167]
101A67N2r3M3M4J29l08J05o1j9J69J25l28L8OJ87jj17M9R5oj39J8P0Q7k48J17j05K38k07O2
-47A69K17k72q5J47K0J21j04k5j64K5K5J7n0R4K0O7j03O3J3o6L9l9m2J68j39rQ0j9l5j0K6
-199A49N9k3M0j74K3P9Q0Q1k18J14r6J36k28J38j07J30j47J49j27J97j47J45j09l0Q4r1j3
-332I4mJ83p8rj10P5R2r5l6r1K27q5r3l0J72o1j5J28j46J08Q0q6n9r2m4R1J23j47J61o3n4
-485A36n4L8o2R7m8O1
$$ y = [167, 219, 126, 169, 213, 342, 34, 139, 78, 59, 228, 353, 25, 63, 69, 256, 255, 138, 187, 282, 276, 137, 155, 225, 312, 64, 181, 76, 314, 107, 169, 386, 114, 29, 176, 196, 317, 213, 188, 24, 49, 74, 91, 41, 135, 155, 222, 119, 182, 195, 129, 168, 129, 87, 255, 116, 107, 187, 168, 133, 123, 149, 208, 185, 225, 51, 74, 153, 233, 314, 96, 210, 114, 250, 22, 160, 53, 183, 36, 185, 58, 255, 108, 253, 144, 114, 198, 107, 94, 90, 273, 195, 186, 76, 151, 243, 148, 112, 21, 248, 163, 70, 40, 212, 151, 136, 264, 118, 226, 306, 220, 161, 69, 25, 116, 239, 92, 253, 190, 136, 82, 120, 58, 155, 107, 168]
-514A68
##PAGE=	F1=1966.54
##FIRST=	4521.1612903296090735,	4521.1612903296090735,	0.19794404506683349609
##DATA TABLE=	(F2++(Y..Y)), PROFILE
4521A33p2J00Q8n5j09n0J19n8n1R4J2l3l4M4K5J59j94L1Kr0Q4q4J75j24pP0j22K18j04r5J24
4369A96J25q6j64J28j41M5M3K3j22K30q6m4j20K01p6j3p8L7q6J90o6m3Q6MJ99j07p7j6n4n7
4221G1J27J54k01p6P9R0j06MJ00j85N1m2K8O8O0j20LO1r0N0N6j21Q8r0R0j4m1P4j26R7p2k2
4063D5Q5j5K17j46O5j43n4R0M6r6oj5n1J42l1K8O2j15O3q1O2j07J50M4j06r3K13M9j06q6O9
3911A79o3k5J67j66N7N2m1L1l4K2m1q6N1N8n1NnK60j62J5P5j23M0k7r2J15p2O1j09o0K68l4
3753B65k20O4kk4O6j9M6J3L7p3j37J53k7j6qJ16j27o0O0N2J05O6j99J41k02P6Q3m1n0J60k15
3601H3N0P9Kl5J24j42q3l1J50j02L9P3q0Q8j54N5r2L8K17j86O8j00J34J1j56K22j58R8J08
3458C20j61J13j10j21K52n9l8j74J66J3j4o9P7o8J06j38K7J27l5j46J41J9j03J3J58j11nM7
$$ y = [133, 61, 161, 249, 194, 85, 35, 154, 96, 45, 139, 151, 118, 84, 128, 153, 312, 118, 149, 151, 61, 145, 61, 236, 112, 105, 175, 53, 271, 167, 72, 196, 321, 235, 71, 199, 58, 103, 146, 169, 47, 277, 191, 147, 27, 228, 152, 139, 61, 98, 12, 202, 136, 93, 179, 183, 382, 275, 198, 182, 128, 71, 198, 352, 151, 75, 154, 244, 138, 142, 242, 57, 108, 66, 94, 162, 222, 102, 105, 166, 76, 126, 182, 61, 149, 59, 149, 135, 94, 168, 42, 139, 67, 45, 130, 115, 332, 186, 251, 108, 54, 144, 190, 94, 88, 73, 22, 164, 133, 161, 223, 108, 171, 90, 152, 45, 195, 239, 133, 40, 253, 302, 196, 110, 179, 116, 91, 258, 92, 149, 201, 160, 191, 157, 179, 138, 52, 103, 161, 110, 115, 110, 370, 208, 223, 298, 175, 215, 188, 96, 211, 139, 200, 91, 31, 299, 265, 45, 109, 107, 83, 149, 130, 176, 189, 226, 153, 16, 169, 142, 126, 118, 234, 107, 47, 107, 159, 264, 330, 131, 272, 70, 146, 229, 188, 138, 298, 83, 133, 212, 214, 179, 303, 161, 78, 47, 197, 95, 134, 207, 127, 215, 61, 116, 24, 62, 279, 93, 161, 61, 195, 206, 50, 272, 114, 212, 320, 159, 272, 162, 41, 293, 234, 196, 22, 188, 201, 187, 118, 195, 127, 233, 95, 122, 249, 214, 68, 209, 228, 125, 138, 296, 185, 180, 227]
3320B27j25J29n6j8J32j74J62j49l0L6K80l11m9J72qj08M4j1PmQ3j93J52k0k6R1j41M2N9J36
3172C29k19J83j29q3R4J83j47l6M1n0J6n9O0J8o8P6J9j6M9k13K53q2q7J34r8N7O7r9j0PJ33
3020C23j98j6K98k99M5M6P9q4o3M1P7L04l45J29m7K3j48K0M2j55L15k14q0J46l2K458P28l7
2882C356j110j836l2j51j71J68o0J63q0j97K00O4j64J50j78K08l9j93L34j11j86J51j37K89
2764D38l74J19Q0p6o5L81l12n3J3J75Jk2j10j23L23m9p1j07M4L88l82K73l22J02k1N0o1k6
2626B13K40l11r3L68r7p0k3J07j54J56n0J72l75M33l68J37o3J16k8J48k43KK86k35J42r8j55
2493A57K31m3J54j93K9m8Q8N9n4j6J71j82p7J34m1J19k32J65j69J86O5j01J31l93M60k13J2
2360C99O6M3k2j01K98m16J26K23k1n4j66K03n1m9O3n%m3K00j86J08j18L80k02k19K54k11J58
$$ y = [227, 102, 231, 175, 157, 289, 115, 277, 128, 98, 134, 414, 103, 54, 226, 218, 110, 154, 143, 150, 146, 229, 36, 188, 168, 142, 233, 92, 134, 193, 329, 110, 293, 164, 81, 175, 358, 211, 175, 216, 166, 182, 123, 183, 201, 133, 209, 228, 212, 261, 48, 301, 219, 132, 266, 168, 225, 292, 193, 183, 190, 323, 125, 109, 407, 108, 153, 199, 278, 194, 131, 172, 249, 553, 208, 337, 290, 313, 165, 185, 227, 72, 387, 173, 93, 239, 207, 2665, 3393, 3356, 2246, 410, 378, 227, 56, 224, 164, 327, 247, 50, 250, 314, 150, 300, 122, 330, 291, 98, 432, 321, 135, 286, 149, 438, 64, 183, 263, 187, 122, 503, 191, 138, 151, 326, 327, 305, 195, 72, 395, 346, 275, 168, 212, 600, 218, 491, 169, 271, 250, 300, 239, 213, 453, 142, 49, 417, 320, 250, 227, 334, 180, 336, 286, 458, 83, 516, 148, 285, 222, 338, 310, 458, 215, 217, 503, 268, 410, 312, 157, 388, 345, 499, 306, 335, 287, 375, 434, 380, 364, 535, 353, 276, 410, 369, 488, 256, 421, 252, 438, 503, 402, 533, 140, 600, 387, 399, 465, 508, 486, 385, 683, 267, 393, 616, 595, 541, 375, 578, 527, 478, 541, 536, 536, 493, 693, 507, 615, 497, 877, 675, 456, 710, 499, 657]
2222F57J55j42K5P0j07J44p7J75r1%R9m7J53j59M0J48j91J19K19j50N0K26Mp6Q0k6K07o2R4
2080A537J41j3J16J8K64N4K67K03L04J16N36J49O45K03P20P53J553J619L963P347K89719L1292
1971C41506k68021m8635j1068m259k151j317p81p53l94m93l21n42Jm08km67J5j96Q1j41J29
1868A783k36n2m0k00J99k35L8l7k35J53j09K6J28k53j3Rj64J44q5J46k99K5K24j41k95L40
1740H21j0j00Oj07K5N4r0J14R2l68J03J00j88J43P2k89J42N6m3p6J34q5m2J14L5j37j04K13
1602E85j85J8J72m26M76k49J38k37O1J9J74k54J18j35J75j33J73j96J98j59O7k49L52k09M40
1479G34r0r8q5k64Q8J49k38K78k41J38k06Q1J42q0Nm0Q4j6j78J65j27J50M4P6l65J65J17j99
1341A89J10M4k0L5j33J35q6oJ48l72K74j26K37j50j94N6K54j40N0r3J24j19J2O7k04J29J5
$$ y = [657, 812, 670, 695, 765, 658, 802, 725, 900, 809, 809, 908, 861, 1014, 855, 895, 1043, 852, 971, 1190, 1040, 1090, 1316, 1320, 1244, 1324, 1298, 1505, 1443, 1537, 1678, 1665, 1781, 1799, 2063, 2117, 2384, 2587, 2891, 3007, 3543, 3692, 4337, 4540, 5260, 6013, 7566, 9185, 13148, 20495, 310214, 341506, 73485, 24850, 13782, 9523, 7372, 6055, 5274, 4521, 4127, 3634, 3313, 2771, 2772, 2364, 2362, 1895, 1910, 1714, 1795, 1654, 1783, 1547, 1495, 1455, 1255, 1454, 1219, 1257, 1220, 985, 1138, 1029, 1055, 1183, 930, 917, 926, 762, 906, 821, 967, 668, 693, 917, 776, 481, 821, 811, 711, 717, 610, 635, 689, 599, 713, 805, 437, 540, 640, 452, 595, 667, 378, 520, 576, 533, 457, 591, 506, 464, 578, 613, 476, 372, 585, 400, 418, 590, 164, 640, 391, 529, 292, 353, 372, 546, 292, 410, 275, 450, 317, 490, 294, 492, 333, 400, 151, 503, 294, 734, 644, 546, 461, 197, 285, 434, 196, 474, 233, 371, 165, 246, 388, 308, 313, 273, 357, 341, 163, 328, 201, 351, 395, 471, 106, 271, 388, 189, 299, 343, 323, 358, 225, 360, 274, 268, 416, 44, 318, 192, 429, 279, 85, 141, 395, 255, 305, 212, 336, 217, 229, 296, 92, 221, 236]
1209B36J18j25j21J22N1m9q8J84j58K34j65J09k00K83l02J02P9J54k99J3J12o7K09k53j32
1085D7J33J04j40m9K45J4l13K50n8L0j45O5jK7P8j76K69l16J18N1Kl8k6J36k01n7J06J60j80
943A35K15j84N5l8k5k2L3oR3j31O8j23K21M6r5p2n3K20k26O8o5P4J03q7JJ7p4p9J13j2J0l9
785A41Q0k5l5J87l25K36j54J87l3j42k2lK73l10J90R2j44Pp0J4O4l4jO2j14P3P5K42m58J48
638B01m1O0L7j44m3J59l1q6J80j59nq8J77l8Q4m6q6N7n0J54j88J75j54L8J5q1J77k25J6L7
490A02K02j56l4K37j71J4O5o7j36K07k27M6J67m8j5j36J87m4j77J40m9J09o8j3J74j32n3l6
352H8M0k6P6p5J91n1j28o0K78k05O1J42j25n9Q0m9l1N2J19k10q8R1l1J10p8O6j1j63J04N3
204A61P5l0j30K6l2Q2M0j50K50k04J7J38k13M8j0L32j29j90J6J02JM2j01PM2J62k79P6r0R
$$ y = [236, 354, 229, 108, 230, 281, 232, 144, 328, 170, 404, 239, 348, 148, 431, 129, 231, 310, 464, 165, 178, 290, 223, 432, 179, 47, 180, 284, 144, 95, 340, 354, 41, 291, 233, 263, 118, 183, 182, 209, 287, 111, 380, 64, 182, 233, 235, 197, 171, 307, 106, 49, 155, 315, 135, 350, 166, 221, 183, 158, 136, 169, 163, 256, 125, 193, 70, 291, 337, 242, 170, 117, 337, 111, 179, 114, 188, 291, 204, 205, 222, 148, 69, 182, 170, 180, 141, 221, 196, 161, 348, 23, 259, 105, 292, 259, 117, 95, 92, 365, 55, 245, 337, 193, 200, 130, 144, 208, 174, 173, 235, 121, 194, 269, 511, 53, 201, 160, 220, 257, 113, 70, 229, 198, 112, 292, 133, 128, 40, 217, 179, 263, 217, 131, 188, 138, 292, 104, 279, 125, 163, 178, 97, 274, 49, 65, 102, 304, 148, 114, 351, 180, 194, 259, 192, 56, 263, 36, 82, 249, 201, 186, 50, 237, 193, 16, 156, 107, 216, 148, 135, 309, 177, 124, 88, 128, 102, 178, 103, 294, 243, 115, 55, 333, 128, 189, 331, 206, 147, 227, 178, 147, 199, 318, 108, 20, 111, 80, 190, 112, 178, 167, 4, 108, 161, 236, 206, 76, 102, 70, 152, 192, 42, 292, 88, 105, 243, 30, 78, 68, 400, 271, 81, 97, 199, 200, 242, 141, 148, 190, 352, 73, 149, 59, 68]
57F8J75J08l23J6L8J69J5j16L9J17J8j65k6J04P4k44R9r5K66k44R1J89k39p1Q4L5J23p0Pj76
-91F6JJ1M5o4M7mP7p3Q2op2P3l4n8J59j15k9P8l2l4j9O1N1m9O2j31l3R5O8R8k23J27p2J32
-258B85k32J22r4J16j71J49j28J89j51J71o2o8N6o8j3rJ69k9j14J5j2J15r4j3o8K03r3p6n2
-401D3J58m0j7J28j44P7P5o9p3k9q9R1J54j35P0l0l7l7ol3P2RM9
$$ y = [68, 243, 351, 28, 44, 82, 251, 266, 150, 189, 306, 324, 159, 133, 237, 311, 67, 166, 71, 337, 93, 184, 373, 134, 63, 147, 182, 305, 235, 242, 66, 67, 78, 123, 59, 106, 102, 179, 106, 188, 182, 110, 183, 149, 91, 250, 135, 106, 184, 152, 118, 99, 160, 211, 162, 224, 93, 60, 155, 223, 321, 98, 225, 153, 285, 53, 175, 81, 197, 26, 175, 47, 236, 85, 256, 194, 126, 182, 114, 101, 92, 261, 232, 118, 133, 121, 236, 142, 129, 61, 264, 171, 95, 43, 201, 161, 144, 272, 128, 205, 280, 211, 138, 109, 20, 111, 265, 130, 200, 170, 133, 96, 90, 57, 129, 138, 187]
-514A87
##PAGE=	F1=1961.62
##FIRST=	4521.1612903296090735,	4521.1612903296090735,	0.21518112719058990479
##DATA TABLE=	(F2++(Y..Y)), PROFILE
4521A45p6Q9P5m7p5n0Q8l4o0O1N2o9l0M8K4J45k02Q2m9l9M9o4J57j18k5P6p2K13j23j06J23
4369A88J23q3j60K05k54O7O7Mr5K00n5k9j52J78n6K0j03M7n6J43m8l9L8k8K40n2j08rq8j6
4221H9J27J58k28q6J24K6r6j2J24j40J8l1j4Q6Q6j33J1Jk1O0N2j68Q7m3L5O2q9R7j06L3j4
4068I5pN6oK03j72Q3j37n9Q0M8r2k7j3l0J71r7Q7nq7P9p5O8j07J39P7j91l4J77K9m8q7L4o2
3906I0J6J32j68J04K6l6l7J6P1j00o7M1N8k7Ok3K31j49J8N3r0L5k1o1O1m3L4j14QK20k6k02
3748E6L8M1n8M5J1KP8K9j16q5J17j0m4L0R8j14q1O0K7Q9R0j62R2j58R7jj7n6J99j79JP0qo8
3581A13J94j47j06QJ60j63L9J11n6J11k47O6p0O7J75j48M0r8J69k0j63K48j53P1J26k16J40
3448B51q6j41K14m1n6j03Q4M6qo2Q2m0J07j70L1J53m9j25R3J7q4O1J67j68K1Nr8J35p7KQ2
$$ y = [145, 69, 158, 233, 186, 111, 61, 149, 115, 55, 116, 168, 99, 69, 117, 141, 286, 84, 166, 117, 78, 127, 63, 220, 102, 77, 153, 81, 294, 171, 65, 188, 311, 228, 68, 273, 19, 86, 153, 157, 62, 262, 207, 178, 26, 204, 148, 168, 65, 112, 56, 199, 151, 112, 150, 122, 362, 310, 202, 193, 105, 89, 216, 374, 146, 60, 184, 210, 114, 102, 226, 86, 104, 73, 59, 145, 231, 98, 109, 110, 89, 149, 201, 33, 120, 77, 112, 174, 85, 182, 76, 109, 95, 88, 144, 138, 341, 169, 252, 115, 56, 136, 184, 92, 65, 52, 22, 193, 96, 183, 178, 91, 170, 95, 163, 56, 195, 272, 81, 47, 224, 253, 205, 118, 152, 90, 106, 238, 70, 174, 200, 164, 127, 143, 214, 114, 47, 88, 146, 119, 125, 102, 333, 184, 202, 255, 165, 200, 179, 118, 179, 136, 170, 56, 64, 284, 258, 56, 94, 135, 77, 122, 133, 135, 213, 242, 126, 41, 158, 148, 104, 134, 232, 118, 37, 97, 124, 213, 303, 141, 233, 75, 172, 171, 154, 98, 297, 118, 119, 189, 181, 113, 307, 160, 54, 62, 222, 59, 98, 209, 153, 264, 17, 83, 13, 80, 255, 107, 147, 49, 218, 198, 35, 283, 130, 201, 327, 111, 251, 165, 24, 238, 197, 141, 38, 122, 168, 160, 98, 180, 140, 247, 77, 108, 261, 212, 87, 180, 197, 113, 174, 341, 173, 194, 199, 101, 236, 159, 161, 243]
3296B43j50J54j00k5L1J88k44q8J65K3p8K7ooK8K6j61J60J6p0M4j20Q2L6J35j74J46j45n3
3153H4R7J75j38l9O8r8%j7J9nJ9oL7L7k7j26J68n7o7J20r8O9Q1j30j1K3R1j85l6K94k41N7
2995A58O7J2m0r5R4k0L26l71J73Pm8q6k5O7j80L03j95p3J57qK129O88p9j019j581j2j60j44
2857D5J62q3J54l3j81J53J18j96J33k01K47j27j32L22j24j08R8q9K49l66J44O6p9k3L06l02
2729A53o0nK05K5l5r0j59L97j49m9r9L6M07l35K04k85Q7Rkl6n8K64l13j11L81k9j63RJ38k20
2582A17J67l4J88l33L20k80P5j1P8K3Q5k01k3K98k57J52q6j02J36oJ23j46l0O1l6Q5J7JR6
2439D77j81q2J29l5J59k55J59j77J89M0n9N9k92L92j42o7Q6N5Jj24K65m08J57J86mn1j52J86
2301E11r2%P7o1M0o6K10k20J60j56M07k03k21K28k48K31J09j36L0J06j70J94j05J79r8l8J06
$$ y = [243, 93, 247, 147, 122, 153, 341, 97, 9, 174, 197, 119, 146, 140, 134, 162, 188, 27, 187, 203, 133, 177, 57, 139, 175, 310, 136, 282, 137, 84, 181, 356, 218, 179, 247, 149, 149, 132, 151, 146, 165, 159, 196, 233, 206, 80, 248, 191, 124, 244, 146, 215, 296, 166, 155, 178, 269, 84, 48, 342, 101, 158, 225, 237, 197, 102, 196, 176, 502, 131, 304, 311, 263, 177, 152, 219, 39, 342, 147, 74, 231, 223, 2352, 3040, 2961, 1942, 361, 349, 189, 45, 207, 124, 278, 245, 64, 217, 335, 139, 272, 71, 318, 191, 59, 381, 257, 149, 247, 158, 407, 41, 185, 251, 172, 149, 455, 153, 93, 88, 293, 318, 283, 193, 34, 431, 282, 233, 134, 170, 577, 242, 446, 161, 248, 257, 255, 219, 161, 425, 112, 1, 382, 353, 190, 199, 337, 117, 284, 250, 438, 105, 425, 145, 220, 209, 287, 310, 395, 194, 171, 469, 212, 364, 278, 176, 312, 306, 429, 283, 253, 314, 278, 363, 380, 381, 477, 296, 214, 343, 308, 467, 212, 371, 194, 383, 423, 364, 423, 131, 523, 381, 314, 400, 455, 456, 332, 597, 189, 346, 532, 528, 477, 325, 511, 419, 419, 496, 435, 475, 409, 619, 399, 559, 403, 810, 607, 386, 614, 366, 597, 706, 570, 600, 706, 536, 730, 625, 804, 706, 668, 774]
2168G74rJ13j68O4J25j29K3L00k36J29J59J6q8N7k8J83J0J8J30L1Q1j8K64N5K44J22K65R9
2031B586M85J19N49J39O59O25J454J258L495O610K46282K9302k29115m2518r761l792k003
1947F374j129o76o75l23m45k61m48o8l36L8l93m5j01P0k06K31k90m8N2k47J63k07J27j08j71
1824H78O0o2P5J23k30o4J7j63J72j18J63k61l9K59j09k75K83Pj53R4j05nM0q2J54N5l76J22
1686D60J40k47J47J47l42J34O3j4j27J50m5p9J29Pj19q6K02j85L7J21l47M44k88J22j60M1
1558C05L4J69k93J30j13J63q9J43k12K12k00J30k38K75j64L48L3j20n1l54J58J37k74L04k05
1435B28O3j21M4J37n1j7p3J11J2j98J44j26J95J0J10l88J60J63k38J01KK4N7j39J07p1k3J66
1297C89l76K78j23K70j90j66JK83j19P4j58J24q6K2N6k31J60j1J68j70j45J82Rk8j06J99j51
$$ y = [774, 765, 878, 710, 774, 899, 770, 793, 1093, 857, 986, 1145, 1161, 1073, 1130, 1102, 1285, 1295, 1313, 1443, 1474, 1555, 1537, 1801, 1856, 2100, 2222, 2487, 2586, 3071, 3190, 3739, 3878, 4537, 5162, 6616, 7874, 11369, 17979, 264261, 293563, 64448, 21930, 12169, 8377, 6374, 5245, 4569, 3894, 3571, 3126, 2865, 2417, 2349, 2013, 2051, 1658, 1613, 1512, 1582, 1376, 1607, 1317, 1269, 1321, 1074, 1237, 1030, 1157, 1049, 878, 938, 876, 951, 1074, 844, 780, 797, 634, 806, 688, 851, 590, 551, 810, 701, 426, 709, 716, 563, 657, 552, 547, 587, 505, 659, 714, 338, 460, 600, 353, 500, 647, 305, 439, 502, 488, 361, 511, 466, 387, 516, 523, 404, 318, 520, 335, 372, 493, 146, 590, 302, 424, 264, 305, 339, 508, 215, 345, 232, 395, 306, 449, 237, 449, 249, 379, 141, 416, 252, 600, 633, 513, 462, 108, 266, 403, 129, 433, 228, 291, 170, 214, 351, 300, 283, 210, 321, 333, 135, 279, 153, 348, 358, 468, 80, 240, 403, 165, 266, 268, 292, 349, 210, 317, 246, 223, 389, 13, 291, 168, 438, 248, 82, 83, 366, 247, 321, 163, 287, 201, 223, 279, 48, 208, 197, 365, 195, 50, 232, 241, 213, 107, 306, 155]
1164A55J94j27Q6j68K69k65P1J04J33l00k4J71q8J72j99j00Q0J34j91k5K01l1k22K45j0M4
1036C09k36J12k6L0O0j50K60k97R2L6L4m4m7K00k54qP4J30j77K24j41K5n1k6j3M2pP1j32P9
889A69j12J86O9n8r7pJ58j98P0p3P3R7o7j2P5j49l1M7N0on0M9k9M8J75l15K06j72J79qj46
736A21l2j2K87k91R1J90j61j2m6J4J4kl5J08j02J10O2J76m24J43k3K6O0j18n5J10lq3J71j48
588A36k6q4K37q1O4j1m3qo2J75j95J22r8K3L0m8J53k63P1nJ82j48mK51j28j27J65r9q4J36
441B31k10M0J84l7p1j20K36q7j63J65m4R4n0n0J82j40Lo2n4P3L2j07J95n2q5m7K52j59PJ90
293C46j31j01J46o9o8P3J28k34m6M8pJ15j17Q8L4j68O8P5kl0j08J04j15J28N2j65K23j86K
150H3J40k16J00n8L20j48j25mJ51l7L8j05k5M5J70k08N0j16J5J59J14k95j5O2J43K1j06L7
$$ y = [155, 349, 222, 308, 140, 409, 144, 215, 319, 452, 152, 128, 299, 211, 383, 184, 84, 164, 298, 107, 82, 283, 252, 30, 275, 265, 309, 73, 185, 159, 189, 249, 99, 359, 62, 154, 190, 224, 180, 133, 333, 79, 71, 145, 275, 98, 322, 181, 206, 155, 129, 116, 158, 151, 222, 90, 169, 57, 243, 312, 254, 157, 150, 308, 110, 180, 107, 180, 277, 210, 198, 273, 124, 93, 140, 190, 184, 134, 183, 154, 202, 377, 62, 268, 96, 275, 267, 121, 89, 77, 364, 73, 164, 354, 193, 181, 135, 149, 163, 161, 126, 234, 132, 242, 304, 480, 56, 199, 176, 202, 262, 144, 89, 199, 196, 113, 284, 136, 110, 26, 263, 182, 246, 235, 192, 184, 122, 297, 102, 224, 126, 149, 179, 131, 284, 21, 92, 87, 269, 121, 117, 368, 240, 113, 278, 179, 95, 231, 21, 61, 245, 208, 137, 17, 253, 166, 3, 168, 124, 218, 168, 118, 300, 160, 163, 101, 47, 120, 152, 45, 240, 188, 103, 56, 308, 149, 156, 346, 215, 114, 260, 191, 123, 196, 324, 90, 44, 92, 85, 200, 83, 171, 205, 37, 105, 180, 178, 148, 40, 144, 29, 157, 209, 44, 267, 81, 83, 223, 7, 107, 49, 369, 221, 96, 92, 243, 206, 244, 139, 114, 159, 329, 121, 171, 55, 70, 229, 343, 48, 33, 95, 238, 259, 153, 190]
12A90J22K2j64m2J21M5k33Q9q8K90k48Q7J64k01m8L0M0J17l7M0j93k7L1L9p7%J4O1m8R7k4
-140A69p9R9l6p0J54j16rO9n3Jo3R3L8p4Q3p9q0R6M1J30k14J40m8J20k45J15p3J03j96J49
-288A65j29J72j62J92j9o5Mm2rj3J54K1k19J40j00J31j02J1m5J77r9n0o6J44k1j7J27j42M7
-431A85O1n9p6M6j05N3J50r6j7Qk0k0m2NL1M8L8
$$ y = [190, 312, 334, 170, 128, 249, 294, 61, 150, 62, 352, 104, 191, 355, 154, 106, 136, 176, 293, 256, 296, 103, 76, 107, 146, 69, 69, 83, 144, 96, 193, 169, 90, 189, 153, 83, 237, 121, 112, 181, 128, 129, 66, 159, 197, 123, 206, 127, 47, 143, 184, 314, 100, 240, 192, 312, 67, 182, 109, 212, 16, 165, 36, 208, 46, 238, 219, 154, 158, 116, 107, 94, 248, 269, 50, 190, 90, 221, 119, 130, 85, 262, 163, 113, 47, 191, 170, 153, 280, 138, 185, 246, 187, 111, 157, 52, 105, 255, 159, 142, 150, 130, 110, 68, 73, 104, 152, 190]
-514A90
##PAGE=	F1=1956.7
##FIRST=	4521.1612903296090735,	4521.1612903296090735,	0.19802395999431610107
##DATA TABLE=	(F2++(Y..Y)), PROFILE
4521A33m9O0N1k8j9o9N1j0m3K6O6p8m9O8K3J22j68J16j24K4K5l1J02j09k5N2nJ88j46n8Q0
4369A76J18o7j66K48k34j7J06k1o2J32Ml7j37J27l9L4n4J3k2Q4j2m2j9m5K46J0j11l5j02J4
4221I0J35J28k27p6J44m8n2k7J42r3Jn0lM4J09j18Mn3N6M5R0j61Mj5M0J00j41J05p5k0M7J1
4063A36MJ8J73j81R6j21p5O3O4j03l7j0L2J43j25J20o0p6Q9n6M4o1J01J05k30J0J14L3j5j07
3916H8L8m4M5Q6j68J35L5n7q5N9Q6j01l5J8M2m4L8o3K04j42K8K4k3nJ4n0J5k4J9p0O0J35k7
3753B31j62kJ06r2RM1m2J29L0j54l0P5k2l1P1O7j02o9N8J3J1J09r9K4q6Q0n0Ln4K12j41m7
3596H6Q2k5r0K33j20j44O6J52k34O8J33k2J43k91J4k7N1J61j34L2m4J30m8j29K34j27K2J33
3458C05k50J63k2j10Q7m1l4l0K4N3k1m9O3kJ06j48K3J12n1q2M3K0p0J06J57k04L4j2n9J17
$$ y = [133, 84, 144, 195, 167, 148, 79, 130, 120, 77, 103, 169, 91, 42, 110, 133, 255, 87, 203, 79, 103, 128, 97, 199, 90, 65, 117, 112, 300, 154, 96, 176, 294, 227, 61, 309, 75, 58, 164, 143, 81, 213, 217, 180, 43, 170, 131, 165, 111, 124, 102, 186, 174, 132, 113, 68, 314, 324, 213, 178, 76, 90, 225, 353, 126, 50, 194, 146, 94, 67, 209, 116, 117, 67, 64, 108, 217, 99, 103, 50, 106, 151, 241, 80, 84, 69, 109, 209, 68, 173, 98, 78, 125, 136, 140, 158, 331, 150, 246, 125, 50, 113, 177, 74, 37, 27, 59, 202, 77, 197, 137, 61, 150, 94, 138, 77, 178, 283, 53, 63, 177, 210, 195, 88, 126, 82, 127, 213, 45, 180, 215, 158, 73, 132, 218, 117, 82, 100, 142, 98, 136, 73, 277, 135, 163, 187, 164, 159, 173, 123, 138, 114, 133, 63, 123, 258, 231, 69, 67, 173, 81, 90, 131, 89, 218, 248, 94, 64, 139, 117, 86, 157, 224, 122, 53, 111, 124, 135, 244, 145, 169, 83, 163, 113, 116, 62, 274, 133, 86, 168, 143, 53, 286, 166, 22, 88, 240, 6, 74, 207, 185, 328, 37, 51, 24, 75, 236, 102, 134, 90, 220, 172, 43, 277, 150, 172, 305, 55, 218, 196, 86, 173, 132, 98, 68, 92, 145, 124, 75, 138, 136, 242, 94, 117, 229, 178, 96, 139, 159, 89, 195, 352, 148, 182, 170, 111, 228]
3310B28r6MM8r5J26o2k5J9J00j55o0R9L2l4PJ7l0L7jj02J13M6q5k9p0J31j2J28j16R5j51j5
3153I2R4J60j28k9N3j02l7L4k7mQ2o5K2J00j00l8N6J8n7P6p9O5R6j59LK0N5j55lJ95j48O9
2995A59O3l7J3j24J45p5K97l53J72P6j23jm0M2j92K69j81m2J37MJ708O13j28q42j243k7j56
2862A34j19J72p5R6K4j51J31J16k07J15j98K46j94o3K92j19m9L2k5J95l23J36N9p1OK32l00
2729I2l4oJ84O5m5o4p9L26k35k2p1NM22k85J21k29N7M7n7nr6K92l05k5K80K2k11QJ76k37J22
2577B13mJ88k77J93j47L4J1L2M3M3j93pK69k39J26o3m4O2OP4q4o6J37j25J01Q1OJj25q2R5
2424B59j0J56k19J11j75J85L3n6K9k01K91m4j32Q7O7Jj14K07l74J83J27K9o0j09J46j38Q0
2291C59P6j36R4r0J87k06J74j59L88j83k08J77k69K85P5j29M8J05k00J90r3J85j25m4R4K4
$$ y = [228, 132, 136, 184, 89, 215, 153, 128, 147, 247, 92, 32, 131, 163, 129, 136, 153, 123, 160, 159, 57, 170, 216, 131, 102, 32, 163, 151, 279, 163, 258, 107, 92, 186, 346, 218, 189, 242, 140, 103, 137, 110, 106, 188, 123, 145, 245, 145, 107, 163, 181, 124, 200, 121, 186, 282, 123, 126, 146, 201, 46, 43, 238, 90, 159, 222, 185, 198, 74, 219, 144, 441, 88, 260, 336, 213, 212, 172, 214, 22, 291, 110, 68, 205, 209, 1917, 2530, 2402, 1560, 317, 290, 134, 15, 187, 112, 208, 232, 81, 212, 328, 121, 236, 38, 284, 90, 27, 319, 200, 151, 183, 158, 353, 30, 166, 225, 154, 160, 392, 92, 58, 52, 236, 301, 256, 192, 113, 439, 204, 182, 111, 116, 538, 253, 374, 145, 202, 249, 192, 187, 91, 383, 78, 53, 333, 355, 144, 152, 328, 91, 213, 209, 397, 120, 313, 166, 200, 211, 243, 286, 329, 136, 129, 398, 159, 285, 222, 178, 240, 246, 320, 236, 170, 307, 182, 283, 364, 370, 371, 246, 164, 259, 249, 405, 186, 297, 122, 307, 340, 284, 313, 112, 403, 359, 227, 314, 381, 382, 268, 475, 101, 284, 411, 440, 380, 271, 417, 279, 359, 435, 299, 393, 303, 490, 284, 458, 299, 687, 504, 296, 473, 204, 489, 564, 435, 483, 588, 388, 578, 485, 670, 545, 501, 595, 619]
2163F19O8j34N3Q5n7n2L42k86J75R8K5j13M6rJ11Q0o4J38O0K5l3K64K1K33K7K20N4M20N6M46
2016B918O2N31M83J265Q16K828N432J87922K5073j76151l3625p812l056j714q89n21n44k07
1927B811m06j75l14j54k19R2l40p4k6J03k94L09l05m2J32k91J48j65J74j51j09k0j9J39Q5
1804H89j87r6Kj35J85j45J55j96q3K76r4k26K00L4j86J58r1m1L5q6K13k4l28J06J72k50J15
1671C72K14l70J11O8K1j56J38Jr8J27l5p4r7K23k07Q5K4k23L86l02Q9p0J9L8J44k95J22q9
1533A66J54m8R7j97K04k22J75j91J70j15K44J28q4o5l67J80J22k84K83j34j2l9J6J22m4Rj23
1400A45J01N8j86Q4r0J97oJ05l37J32J72k30Q5n5O6P4j18M8k6n5J75k90J92p3K38j92j22j8
1263G4K45q2O6j79J09n7J1O6k36J65OJ63k03j30J84nk5r2J82j27J30q0O1j04K05j99N4J09
$$ y = [619, 687, 553, 606, 691, 634, 582, 924, 638, 813, 911, 936, 823, 869, 860, 971, 1051, 987, 1125, 1185, 1210, 1177, 1441, 1462, 1695, 1722, 1942, 1996, 2416, 2472, 2918, 2980, 3511, 3994, 5259, 6075, 8903, 14335, 202257, 227330, 51179, 17554, 9742, 6686, 4972, 4083, 3562, 3018, 2811, 2405, 2230, 1916, 1762, 1543, 1635, 1295, 1221, 1195, 1298, 1004, 1313, 1008, 966, 1098, 807, 955, 790, 964, 813, 704, 684, 665, 804, 889, 702, 606, 608, 473, 658, 513, 668, 472, 389, 665, 571, 345, 545, 579, 393, 551, 460, 419, 454, 368, 581, 557, 229, 335, 507, 257, 372, 586, 216, 327, 395, 416, 260, 398, 399, 301, 428, 393, 319, 222, 445, 238, 323, 347, 124, 510, 208, 297, 227, 246, 284, 428, 133, 255, 166, 320, 272, 369, 172, 376, 154, 329, 138, 308, 193, 437, 565, 481, 416, 49, 229, 351, 67, 350, 216, 204, 165, 181, 303, 259, 268, 145, 246, 304, 118, 202, 112, 309, 303, 408, 71, 203, 375, 145, 230, 175, 241, 315, 197, 245, 219, 164, 339, 49, 241, 168, 406, 214, 92, 74, 319, 237, 303, 124, 233, 176, 187, 253, 17, 182, 188, 351, 148, 18, 202, 197, 172, 80, 262, 135, 265, 185, 246, 142, 347, 148, 202, 311]
1125C11R7k68k9J78j00Q8p6r7L3J43j95oJ41p0j14K13M7J3k16J14r8N5L6j20K11k27P8k2Q4
982B04n6o4K50k25j2J2J15j43J96p5qo1j9l9O0nM3q0N4j18J70P8j5j05J9P5j47K9l4P9R3o0
825B11l2J47k16qJ4P0J5j14M5QQ5J61k89J58j81J64Lj01o1KK45k32k1K87j86k3k3K5kj0m3
672I8J13o5J27P6O5l40J30l6K4O9j16j3M3K5j06J56j13k4q5K58r2M0nno6m4J70j71M0qL1J4
514A90j9R9k10M1n5J77j14lK45n7k28K35j32l2M2j55L1J74k3j23k1J73q8j11J43m6P3j7q8
372A01J56r2J8p0p9Q3kr7J64o0ro9K41j03o5J95j04o5J48r8q9N5J59k42j0RL2R4j49J16O0
219B28j59J9Q7n4k5p3J50j35J24N8j63J59j70J8J08j28P7j03K95j50p5KJ64o8M8j08l9M0J48
76B75j07J6j06JJ23J03k29l2N7J12J9p4L6Q2M9j73NR5mj77O7j06L06k09O3J22j44j9LK3Q8
$$ y = [311, 408, 140, 111, 289, 189, 277, 201, 104, 137, 280, 85, 79, 220, 150, 36, 249, 296, 309, 93, 207, 109, 164, 200, 80, 291, 64, 142, 120, 204, 148, 84, 334, 109, 97, 109, 224, 81, 277, 202, 194, 133, 114, 75, 135, 130, 173, 93, 147, 29, 199, 277, 262, 157, 176, 251, 104, 133, 99, 178, 271, 211, 179, 326, 110, 102, 116, 186, 201, 87, 132, 140, 225, 386, 97, 255, 74, 238, 241, 140, 79, 81, 326, 94, 73, 360, 174, 151, 128, 153, 151, 141, 98, 211, 146, 273, 349, 414, 74, 204, 168, 192, 261, 145, 132, 175, 200, 94, 250, 137, 113, 28, 286, 194, 234, 229, 224, 158, 114, 284, 113, 153, 145, 176, 190, 171, 270, 60, 101, 46, 223, 109, 106, 351, 294, 66, 301, 169, 137, 179, 24, 55, 229, 206, 83, 62, 235, 147, 36, 179, 133, 206, 189, 101, 257, 165, 183, 113, 34, 117, 115, 18, 182, 122, 113, 44, 285, 182, 117, 312, 208, 143, 291, 193, 104, 159, 318, 76, 66, 75, 107, 201, 52, 168, 228, 69, 88, 175, 121, 96, 23, 173, 38, 162, 220, 57, 216, 46, 64, 172, 44, 121, 18, 313, 163, 88, 90, 254, 186, 234, 126, 87, 127, 275, 168, 184, 78, 79, 202, 305, 76, 44, 101, 213, 232, 158, 194, 276, 325, 152, 157, 252, 248, 71, 138, 32, 338, 129, 192, 314, 170, 151, 154, 177, 265]
-76B65K5M7k04m9O2No2n0Q3J2m0R2m4p1J01l0o6J47j24L5L4n5L1j05J00L3p3Q5m8q8Q3NJ70
-239C06j96J29j6Q6k36J01m3Q8j77J06j15J26j15J51M1n9m7j6pj5J29P8k73J88j41J45j21
-371I7J6j0J34q7n1n9J41k4%R9j00pM6l1p5J02j15K4J18m4q9M6Pj1p6M8k9Q6J5
$$ y = [265, 290, 337, 133, 84, 146, 151, 89, 39, 122, 134, 94, 186, 142, 71, 172, 142, 76, 223, 99, 134, 168, 113, 144, 39, 139, 172, 99, 184, 136, 48, 131, 136, 306, 110, 239, 223, 309, 73, 174, 131, 219, 42, 148, 33, 159, 44, 195, 236, 177, 130, 114, 107, 92, 221, 299, 26, 214, 73, 218, 97, 113, 103, 237, 150, 99, 40, 181, 157, 157, 256, 156, 149, 195, 164, 89, 191, 76, 100, 218, 174, 85, 131, 138, 127, 51, 99, 70, 156, 171]
-514A71
##PAGE=	F1=1951.78
##FIRST=	4521.1612903296090735,	4521.1612903296090735,	0.15631771087646484375
##DATA TABLE=	(F2++(Y..Y)), PROFILE
4521A05j5M1K5pL5q6NNj7jQ8p7p8Q0J5R2p8R7j37L8J%N4q9k1L4M1J40j61kL7J14m7j69K45
4349C07j93n5J23m9l2N4N4l6j13P6k3M9nl0ML3L3m0p3l6K10P6j11o0j16L0J29J11k10o7J65
4196B05j12Jk3J13m3j0o1J6j5J15j02kn1P9L5J35j54p7J9N2R4j24N6l5o8J12L0m8M2J42j90
4044A31J09j06r1N1Q4j33%k9P1J03j00J17q6p8Q7l6J9k4N3J42j93qN5K4Oj18N0k6P4M1j69
3891B0J58L6n6j12Q0Q0r4NoK7o1O9j10J68j27M7nM3m4M8l9l1r%J7Q6L8m0j13l6J73j26k8P1
3724A29q5J78L2j93K5L3k6qR6J8q2m9O5Rp7J20l6m4j4O3r1L2o0K16j03r5R5m0o0K11q9j13
3566E7M6J32j67j0J47LJ65k80o5j0M3J56j21K4MQ1o8q5K19j01l9J27k33J68L9q3m2m1j9L7
3419H4J9Nj9k0K7J9J14j18PO2m5k9rK5n8J53J46k41M8k9k1J00j15OJ5m1R0l3j7J7J1o7l1L3
$$ y = [105, 90, 131, 156, 149, 184, 98, 103, 108, 91, 90, 178, 101, 23, 103, 118, 210, 132, 229, 92, 130, 131, 131, 185, 96, 75, 109, 150, 290, 129, 127, 164, 278, 231, 62, 307, 114, 59, 182, 133, 101, 155, 209, 173, 60, 136, 113, 162, 157, 127, 131, 164, 197, 157, 84, 48, 258, 334, 223, 163, 47, 77, 206, 317, 107, 40, 205, 93, 94, 71, 184, 141, 131, 70, 86, 71, 186, 84, 82, 31, 110, 145, 280, 126, 49, 68, 120, 214, 90, 146, 111, 43, 155, 185, 137, 179, 321, 131, 240, 134, 43, 94, 178, 45, 45, 16, 87, 190, 90, 207, 121, 43, 130, 94, 113, 89, 142, 284, 91, 83, 138, 162, 168, 50, 100, 74, 148, 189, 20, 178, 214, 158, 46, 126, 206, 112, 117, 111, 138, 77, 146, 36, 204, 77, 124, 119, 162, 118, 166, 127, 96, 87, 87, 104, 190, 228, 188, 75, 39, 212, 86, 58, 129, 44, 222, 254, 61, 86, 119, 93, 85, 181, 199, 117, 68, 133, 142, 65, 185, 149, 105, 91, 154, 63, 95, 35, 251, 148, 53, 148, 108, 48, 259, 170, 57, 103, 235, 68, 58, 205, 208, 373, 93, 28, 18, 61, 217, 96, 120, 124, 205, 137, 52, 271, 170, 131, 258, 25, 193, 232, 149, 107, 66, 47, 84, 103, 108, 89, 69, 96, 115, 229, 111, 118, 180, 135, 106, 97, 122, 64, 217, 363, 122, 170, 141, 120, 220, 105, 111, 126, 85, 175, 142, 125, 142, 153, 86, 55, 88]
3251H8M2Rj4M1n4M6k7m4N1N8q0q1MJ40p2J07n2M7j15kR4J50j18j9L7j06p3Q4n1J8R5j07pJ51
3084B40j74N1l0J17o3J5o0O1J11j89J7J8K8j15O9K5m8Q7N9q5O1j57J94o5K00k91J48J24j40
2941B08L4k3j5j54J76j61lJ08QJ261N12j80o02r00l9j38q2J48l2K3P1j10J22O9j99R2j32J85
2803B47k11j7K37j21Jk2N2J09k48J16L9n5M5J56k97K4K4Q6R4m2k5rK47l16Rj0o0M35k40M5
2656B93j65K9Q4j11K4j38L16k63K8J72O4k07nK09j92KK0J84k25P0j1M3J8l1M6K8k26O7J90
2513C13k14J08m1J4j3J9K1k7o8J79k01J29J21j5o9m4r5M9L7J06j37M3j70J86J3o4M0j34J87
2370B73N1j26M9N3k5q8J67l42K09O2N2n9o0J07j84J61P5k13J49j17J59j59J54j74L56j46j79
2237B05J27k90L32L3j23O5J13k22J78q9J90j52m9Q2N7K3j01M2L8Oj27L84l36K21L6L6j31M4
$$ y = [88, 130, 139, 125, 166, 112, 158, 131, 87, 138, 196, 116, 35, 39, 179, 107, 214, 162, 209, 94, 92, 186, 336, 218, 199, 236, 130, 57, 141, 90, 108, 203, 96, 89, 240, 66, 117, 87, 204, 141, 156, 96, 157, 268, 79, 96, 114, 142, 27, 96, 121, 73, 160, 219, 134, 195, 38, 232, 167, 367, 76, 224, 348, 208, 242, 219, 204, 50, 226, 65, 62, 170, 178, 1439, 1951, 1771, 1169, 269, 230, 92, 10, 158, 126, 149, 220, 110, 232, 301, 102, 194, 62, 247, 36, 19, 256, 135, 136, 114, 166, 275, 27, 143, 182, 127, 172, 328, 31, 55, 79, 165, 259, 217, 192, 183, 430, 114, 123, 113, 53, 488, 248, 293, 128, 157, 241, 130, 154, 16, 332, 69, 97, 269, 333, 126, 121, 330, 138, 140, 160, 344, 119, 189, 178, 221, 239, 208, 254, 282, 56, 123, 313, 99, 207, 166, 180, 167, 186, 207, 180, 112, 291, 90, 219, 340, 325, 256, 212, 117, 166, 203, 309, 172, 215, 45, 231, 244, 180, 220, 86, 273, 324, 198, 247, 300, 275, 187, 354, 12, 221, 283, 335, 276, 216, 323, 139, 300, 375, 162, 311, 194, 353, 194, 348, 174, 530, 384, 205, 332, 42, 374, 407, 284, 349, 462, 240, 418, 329, 519, 367, 318, 400, 457, 480, 379, 421, 459, 465, 338, 722, 386, 607, 643, 679, 548, 592]
2099E92%L2J50j46J45R0l2m8K53k3K22o9J64kL57rL43j4L88L24R79L86K090M026J24508J9352
1971A54058j18096k3471n560k174j349o39l39l87r1l68o6j57k42j01J57k76j03M9J35l82L89
1868I87l22l5K12l31J36j01J75j58p5p9M4J77J9j13r5m4o8J53j52J51j26j44K75o1j61J05
1740C69M9j87J90o5o5L1r1K64j09k25L6K11k46O6K63l80J03P4N7j95J19N6j11J18q5k0j00
1607A27K39k34J63j09o2K98l13O0K2mL8J15k63P9o0J49j8L6j48J65j83J68j37P3p7J31J66
1474D21Nq9k36Q7J00k68K22m2o6L4k1R9m5N3j58P4Q8j65L2n5K01k7R5k47P3J52j83O3j16J09
1327A90R0j05j9K8p9J84k04J11j9J69j65p6L1J36n3O1j94R4k9j0O8j53J04N4J23k31m2R0l
1184A51j7p2J31p1O2l7L7m0J42j35K1R8P1k27J8J26q1l1N9q2j4J53j90K1Q0j08j5J73J00k2
$$ y = [592, 592, 624, 774, 628, 773, 863, 831, 783, 1036, 1013, 1235, 1166, 1330, 1328, 1685, 1676, 2019, 2005, 2393, 2717, 3696, 4082, 6172, 10198, 134706, 154058, 35962, 12491, 6931, 4757, 3408, 2769, 2430, 2043, 1952, 1584, 1518, 1361, 1119, 1018, 1175, 899, 796, 845, 980, 598, 987, 665, 630, 842, 511, 647, 546, 721, 563, 488, 409, 453, 630, 649, 536, 441, 397, 329, 482, 330, 481, 355, 211, 486, 425, 264, 369, 418, 231, 421, 356, 291, 322, 231, 495, 386, 161, 197, 408, 162, 228, 491, 111, 214, 288, 345, 150, 269, 325, 214, 332, 247, 227, 127, 366, 132, 295, 186, 124, 422, 109, 169, 191, 187, 225, 340, 77, 156, 96, 245, 227, 263, 115, 280, 97, 265, 128, 201, 124, 255, 421, 426, 337, 101, 188, 288, 20, 242, 200, 134, 168, 147, 246, 201, 254, 96, 170, 258, 93, 125, 70, 271, 244, 339, 92, 165, 317, 134, 197, 81, 190, 280, 175, 156, 184, 105, 289, 85, 196, 177, 346, 181, 105, 136, 272, 219, 280, 86, 180, 151, 141, 209, 56, 160, 214, 337, 106, 64, 154, 151, 134, 62, 193, 122, 184, 147, 184, 144, 286, 151, 172, 270, 341, 114, 132, 258, 177, 146, 205, 123, 109, 262, 72, 93, 173, 65, 50, 223, 323, 301]
1036C01j63Q3j67Q6J0q9J63j58O4q0J30p2n2K62j59m5n0J02p7J34qm2l7m5o1Q2kJ4j1M4j35
884B2J41M9N8q3Pnr0j8KJ27O4o2o1J96k42J1k3R0L4j77M0L7J15J46k63J18j80J35jk9o2j3
726H3J75j44l7K74k10k6OL7j9j8n0J08l6J44Q9l7k47J08n7L1Q7j15K9k4N3j37J32o1oj02K63
574B93r6K5j3J9j06pJ32j15m2Q2O4m4PM1j48J8j05J72q9j1K35J2k81K90j85Ml1p7J3J56Nj60
416E8N4Q9q2m9J19m6N0J7j25J29m8L0p8l6J3oj1N4p2O3r1K30m6j37J95q1MJ17j23j05K8J82
259B96k42L4k9P0Q8j68J21O6j43k1R8j05%j7J41r9R8M3j69Q6j34N6L0k0M3r3K21j37k9LJ64
106B52j14O7r9j4J2J20rj9r6k0P9R9j55m8N2Q1J7m2L5K3N6j62P1O1o1j09N7r9K80j66M5P9
-52B73q7J0k3NO0P8M5k06o3R3k9l7r3J57l1m7P5n2n2N0j1k5J10j36P5Pm9P1j40R4J6l8N4j4
$$ y = [301, 138, 221, 54, 140, 150, 61, 224, 66, 130, 50, 180, 108, 56, 318, 159, 114, 64, 166, 89, 223, 215, 173, 136, 91, 30, 112, 110, 124, 113, 157, 22, 163, 212, 270, 187, 194, 189, 99, 81, 83, 210, 274, 212, 151, 347, 105, 116, 93, 183, 217, 40, 80, 117, 232, 378, 115, 233, 53, 188, 187, 158, 96, 83, 258, 114, 77, 351, 141, 115, 121, 158, 139, 121, 71, 179, 143, 287, 376, 339, 92, 200, 143, 174, 261, 146, 175, 151, 204, 67, 199, 138, 132, 30, 293, 197, 222, 209, 228, 122, 115, 247, 132, 90, 172, 236, 192, 199, 240, 92, 110, 5, 177, 88, 77, 312, 324, 43, 333, 148, 152, 121, 44, 57, 213, 218, 58, 112, 201, 119, 70, 189, 143, 193, 210, 85, 214, 166, 196, 118, 82, 95, 89, 78, 132, 60, 123, 32, 262, 216, 79, 274, 193, 197, 314, 191, 86, 114, 296, 54, 88, 59, 129, 217, 49, 170, 236, 93, 72, 170, 65, 65, 48, 189, 90, 188, 231, 62, 148, 14, 70, 100, 80, 123, 30, 251, 114, 85, 88, 252, 138, 205, 106, 92, 104, 224, 215, 196, 100, 80, 159, 258, 103, 55, 107, 188, 205, 163, 198, 221, 277, 115, 186, 247, 186, 77, 134, 35, 315, 149, 194, 273, 186, 196, 173, 178, 238, 316, 361, 155, 92, 185, 156, 119, 26, 183, 152, 105, 180, 128, 76, 126, 115, 90, 200, 64, 139, 146, 97, 168, 28, 122, 138, 100, 154, 140]
-219A40r0P7k2J93j95J26K6M2k34Q6j3Q2j50O8r8O1k1P8P0l9q5J1nj9J02J20k31J40j66J59
-367B13j39J5J5R1p5m4m4J39k7J7P2o0o0L1lq2J50j18MQ2Mj20O0K4rp7N9q5J27q
$$ y = [140, 50, 127, 105, 298, 103, 229, 255, 297, 63, 149, 136, 218, 68, 136, 38, 99, 78, 156, 226, 187, 102, 113, 108, 89, 191, 311, 80, 220, 54, 213, 74, 89, 104, 195, 120, 76, 32, 171, 144, 161, 233, 173, 113, 144, 141, 59, 209, 91, 95, 177, 181, 61, 121, 145, 136, 59, 118, 33, 160, 152]
-514A52
##PAGE=	F1=1946.86
##FIRST=	4521.1612903296090735,	4521.1612903296090735,	0.10898565500974655151
##DATA TABLE=	(F2++(Y..Y)), PROFILE
4521G3L1J9rK0O6j00kj8J3NP7n5j15R8K7K7RP3r4J1jjN3j13PK7N1Q5j83Q6k7J05j2j66J93
4349B60j26l8R0o8KlR2n1r8L7mN1N1n6jlQ0l1j08kJ27J16q4j09r4M6J03O6j49o2J70j41L9
4186A02J5O5j3l6o3M8p3R4m8k9kM0L5J68j37j49L9Q2N6n3l5Rr7J60K8q3O6J07j74J13r4j03
4029C8O0O1j43N2j2M5O4m1O5p5q8P8Kl9L0JJ73j21n3PK7Jj06O7pQ1j4j20J31M2n8j02R1K4
3862A61n4L9oJ1j20J32j54J21r2N1m4J26j04J08m6n5k2nJ01J09n4o4p6j0J83j27o7R5j19J89
3714B07M8k32P6j0j2K3R0l1n8k6P6jj13Q8K6j01N5K3r1N2m9J72o3j38J00k8j2J55n5p6J0J24
3556B29r9m8R0O2J57k47j13j4J2J80j29K2M5L5q6n1K01p5p6R1j41J28P4m8j40k8k2P8L2m8
3409G1qQJ8pJ18q0J5k9mMn9N3l9J61J18k55Q3n7J4Q3r3m9J4LN8l0LJ9o0jLj1P5kjM3n3K5m1
$$ y = [73, 104, 123, 114, 134, 200, 100, 98, 80, 93, 98, 175, 120, 5, 103, 130, 157, 166, 239, 145, 156, 155, 154, 207, 94, 101, 128, 179, 264, 81, 167, 140, 245, 233, 67, 260, 134, 96, 186, 118, 120, 117, 209, 158, 60, 97, 93, 144, 195, 139, 138, 135, 215, 184, 76, 74, 201, 317, 233, 124, 30, 76, 179, 245, 96, 34, 204, 63, 102, 117, 182, 169, 133, 70, 118, 45, 139, 91, 62, 60, 100, 135, 303, 166, 17, 56, 138, 194, 141, 106, 115, 18, 178, 206, 123, 189, 296, 122, 235, 141, 38, 98, 159, 16, 68, 56, 101, 165, 124, 189, 114, 26, 104, 106, 67, 97, 98, 271, 150, 97, 104, 131, 132, 26, 93, 86, 167, 153, 33, 164, 206, 148, 46, 137, 161, 107, 146, 140, 151, 31, 163, 9, 130, 38, 89, 45, 171, 67, 175, 129, 74, 52, 47, 148, 257, 203, 139, 63, 53, 236, 109, 42, 137, 18, 207, 255, 23, 99, 89, 77, 100, 190, 159, 101, 75, 151, 150, 37, 125, 151, 50, 105, 128, 37, 89, 40, 212, 149, 11, 111, 83, 71, 226, 171, 95, 105, 229, 130, 82, 172, 234, 391, 144, 31, 17, 29, 209, 80, 102, 147, 182, 96, 45, 246, 171, 95, 186, 45, 173, 247, 199, 59, 31, 9, 87, 119, 71, 63, 71, 89, 82, 200, 120, 135, 106, 102, 106, 47, 100, 61, 222, 340, 85, 168, 111, 125, 208, 115, 66, 80, 83, 141, 111, 114, 133, 73, 72, 75, 64, 139, 137, 136, 179, 126, 151, 110]
3217A10J2m8R0o2n4QJ37j18O6k8M5n2l9J06J28r6k0K2p2p6P1k8L6N7j05n0J73k11J24n2J62
3064B36o0p1k5M4J11j76KJ8K2o6J08j06J7R6M1j02Q1j48K14j6R6k15Q1J67q6kj2n8j08Q4j33
2912C4L6N6J5Q46L88k08l66n81m8j21j1J00J0l0Q4o6J21Pj70N2n2J04j14n3J68r1lp9J39L2
2764A99j78R7Rj2L7J28k26KP0k2J12j2k1N8J62l67L8N1q3L98k09l1r6RJ05j31M8n9K10j90
2616I6J6J08O7j74M2J63j32j09L5J71j72m6J11O7L0n2j4M8k15J08Q2j67O9k1M6k7j0m3M7l7
2469H7J68k07J55P8k7j27O4o1l9P9M6l5m4q6J24j5q7Q0r1Q9J30m0l3Kl8n0J20j39N2QP1o8
2311A66L9K1j46J77M7k59J97j26J18p4P0j61K97j06j38R4j13J35K5j25Q4J11k13J35q7K24
2183C92j97j7M1Q1Mp3J6J2K7j64L87l50K34K2Jj37P0Nn4J96j93J57R0p6n8K50j07K29j39J39
$$ y = [110, 122, 74, 164, 102, 48, 56, 193, 75, 141, 113, 158, 106, 67, 173, 301, 205, 185, 207, 135, 59, 130, 102, 138, 195, 90, 40, 213, 2, 126, 74, 236, 176, 105, 80, 124, 235, 59, 61, 79, 101, 35, 143, 37, 54, 150, 191, 89, 170, 22, 236, 220, 316, 101, 182, 349, 263, 261, 249, 191, 83, 167, 34, 70, 126, 141, 987, 1375, 1167, 801, 220, 172, 51, 40, 140, 150, 120, 204, 138, 259, 266, 96, 148, 96, 200, 86, 33, 201, 110, 107, 28, 167, 199, 21, 118, 127, 115, 152, 280, 54, 56, 126, 104, 216, 204, 183, 241, 403, 36, 74, 125, 42, 440, 231, 200, 104, 113, 218, 87, 135, 76, 286, 96, 112, 220, 287, 113, 155, 318, 186, 77, 112, 283, 111, 65, 176, 243, 273, 221, 207, 255, 40, 148, 230, 63, 132, 111, 157, 130, 120, 77, 124, 87, 255, 48, 203, 281, 254, 127, 191, 130, 91, 170, 216, 181, 137, 51, 175, 160, 73, 153, 62, 151, 281, 241, 208, 210, 172, 122, 242, 103, 155, 163, 234, 166, 205, 226, 80, 257, 304, 45, 242, 116, 234, 160, 230, 69, 366, 260, 122, 216, 103, 238, 263, 138, 222, 333, 120, 255, 168, 392, 195, 178, 219, 300, 304, 231, 247, 259, 286, 122, 509, 159, 393, 415, 416, 279, 349, 354, 300, 496, 303, 460, 550, 474, 416, 666, 559, 788, 649, 788]
2035G88r4K96o8K65r5K35K20O42L8J401K634O5814J3067o3941j3651l378j283r62m04j92k06
1932A126K7l64Q3l7k82k1K11k31j06Q6J80m59M45l04j5K45l66J56m4J47j51n1j22J09K00n6
1804D06n0n1r4M3O6j39J04l2j62K32n5q4L1M2j40J77n0p8L0j03L25k03n9r1K40j90j8K83l05
1661G5K8P5J06k15R0R7j03P7j32M5q6K39k41K19k30J03K12l08K2J02l3M4Q4k11qj2J37rro5
1514I3Q4o6P0o9rm6M0J04J55j08j05J1P7j86P4O4j06J08l6N3n8R1j48J2J02j19jj1J54l6M9
1361B37j52N2J18r9K0j43R5J06q2p6P0p0J68j20K1K4R1r6l5O9M1m4M0j60O5k4j7O0p9O6J01
1209B47O4k38K4qJ2Pm9P4j1l0K4MJ1O9p1J5O0M9j55P2O8o8j30J77q6m9J45j45L1J9k9m1J47
1046B09J19o9j01Q4k34J17Jq9J19j03O8k2P5j15pK33q5n6j30J11j3P8K2n5J6q2m5O7l1ON8
$$ y = [788, 694, 990, 922, 1187, 1092, 1327, 1547, 2189, 2227, 3628, 6262, 72076, 85143, 21202, 7551, 4173, 2890, 1928, 1524, 1332, 1126, 1153, 789, 872, 835, 553, 532, 743, 512, 406, 492, 672, 213, 658, 354, 339, 584, 218, 374, 330, 477, 326, 275, 153, 262, 462, 406, 356, 305, 211, 254, 320, 181, 285, 253, 91, 323, 268, 184, 215, 257, 117, 294, 244, 166, 196, 93, 418, 215, 156, 65, 305, 115, 97, 380, 75, 103, 178, 284, 69, 159, 256, 153, 230, 98, 143, 57, 296, 55, 274, 44, 147, 359, 51, 73, 175, 142, 186, 270, 59, 51, 39, 176, 167, 158, 93, 177, 111, 181, 112, 103, 57, 97, 201, 356, 248, 143, 154, 231, 45, 119, 183, 77, 185, 149, 202, 144, 235, 87, 99, 201, 82, 81, 70, 224, 188, 237, 85, 137, 255, 156, 176, 33, 128, 234, 152, 76, 146, 76, 244, 124, 145, 169, 260, 164, 129, 198, 239, 195, 235, 75, 140, 116, 99, 159, 80, 146, 247, 311, 73, 97, 89, 101, 108, 59, 133, 122, 92, 116, 120, 131, 200, 129, 144, 204, 253, 98, 170, 238, 170, 40, 217, 131, 82, 227, 82, 113, 132, 103, 62, 209, 328, 259, 158, 242, 8, 125, 126, 37, 156, 53, 121, 99, 174, 59, 52, 285, 200, 144, 14, 125, 112, 190, 212, 157, 173, 91, 46, 113, 82, 88, 146]
894A46L5j30J02NJ10l0k3r0k1r3M6J94L9q8p6K14k27J8l8J01L5k03NO0J38J14k29Q5j81J03
746A21J6M4m4m3Q3o2L1J84k29j0lP3l0j7n1R9l3J62R6j40j35P2q3P6P6j32Q4m6N3j72J08k4
588A24M3j20K45r7J4j3mj09M7O1m6j04J63Q7r4Ono0lq3Q3n3k2J88P8k72L14k40Nq0K1QJ08
426A90L6j20L7J6p3J5Q3l9N0K4j62J16NJ7p0k2l8L6J6j8m4Q1r8J91Rj70J45m7P6Q8j63q2j8
263F7J89j95K7k7R4O4j47Q5P3j32m3R7j15L5%J24o9O5L0j55J0nN0r1P7jl4J19j13kJ5J18j30
101H0J06r4L8l4P2P5m6q6k7L8P8q8m2L5O4JJ8K9o6N2j36J52Kj03j9N2r6K21j21L4L4l2M4m5
-66A90j2M4R4M9k01m7R7o9j0r9K06o0n0K8n9Jl8PN0O1j47Q6ol7Q1j18P6j3J1J1J5o2O8rJ30
-239B68j87J51M4j0k20O5J2Q1j18N3q0rM9K5O6pj10L2Pj6N4J53j84R0j69J64j47L7jL1k6k8
$$ y = [146, 181, 51, 153, 158, 268, 238, 215, 125, 104, 11, 57, 251, 290, 202, 126, 340, 113, 131, 93, 194, 229, 26, 31, 91, 229, 343, 114, 199, 18, 121, 137, 181, 137, 94, 177, 115, 146, 330, 101, 91, 88, 161, 131, 114, 63, 162, 129, 291, 387, 247, 112, 184, 101, 177, 253, 121, 205, 159, 212, 40, 148, 124, 167, 47, 292, 195, 209, 196, 192, 83, 130, 191, 145, 41, 204, 291, 197, 203, 198, 138, 135, 52, 135, 82, 60, 248, 326, 54, 368, 128, 133, 53, 74, 82, 190, 226, 106, 143, 159, 86, 101, 184, 145, 195, 219, 57, 173, 178, 195, 125, 103, 65, 101, 117, 99, 55, 136, 38, 229, 238, 68, 213, 166, 242, 330, 167, 85, 67, 256, 61, 88, 61, 155, 219, 72, 157, 230, 98, 55, 152, 37, 72, 72, 196, 127, 192, 222, 67, 77, 72, 122, 31, 108, 107, 73, 192, 79, 77, 92, 210, 80, 186, 92, 130, 96, 168, 243, 197, 111, 84, 122, 200, 112, 70, 105, 169, 170, 188, 217, 151, 203, 67, 219, 221, 118, 99, 151, 55, 276, 155, 189, 223, 191, 235, 190, 178, 222, 316, 365, 164, 117, 214, 145, 135, 36, 242, 182, 132, 160, 101, 102, 64, 71, 121, 182, 35, 121, 115, 78, 159, 41, 117, 104, 115, 126, 141, 79, 147, 138, 268, 81, 232, 276, 266, 46, 111, 123, 204, 86, 139, 59, 50, 99, 124, 190, 183, 73, 105, 112, 96, 150, 303, 119, 209, 40, 204, 57, 94, 93, 124, 98, 70]
-396G0k7J03l0M8K6k1q2K1J3q1J73j28LK4M2o0K2L0kp1N8j20J37k1
$$ y = [70, 43, 146, 116, 164, 190, 169, 87, 108, 121, 40, 213, 85, 88, 112, 154, 94, 116, 146, 144, 73, 131, 11, 148, 127]
-514A27
##PAGE=	F1=1941.93
##FIRST=	4521.1612903296090735,	4521.1612903296090735,	0.086202651262283325195
##DATA TABLE=	(F2++(Y..Y)), PROFILE
4521E8P6kn2L9Q8j22%l4M5J1O2l9j10R2L5m3Q8M0m2rkkN2j36L5J9N8K4j71J41q8J01M2j46
4354A08Q0n4j1O7q6L5n9J28o5q2J1K8L1Q6q4nl1J35j3j35K5L4J47o3j50o4N3P0L7p1p0J63
4196A95j36M3N6K3J6o1p2P2p5J8J3n1M8JK1J87r2j93M5R9J7J8j31M9r3J76K2j22R7Q1j58J17
4039B30p3j07O0K7p5K7lJ3L4K5J3o4r8O9L9r7Q5n1K04n0r7m1L3Jj7OQQ5p0p0J03M9o0r3J04
3867A49l2k2O3J5J5j38J25j21mJ5J6n7J68j39J31p3l2j0n3J81J26j44q9l1K5J84j36j05J20
3724A47j01J40N6k13Q4k9j2M3Q5q1l5kQ1j8q1J3O6j13J08l6p9Q8n6J09k4j16N3ljJ29k6m2
3566A34l6J08k2p7K5J10J51k15j43JjJ57j33K5Q7j2j12k6J92m1j12N4m8Q8R4k7j83M1o6P7
3419I0N2r2jL2N3n5J07n8K4j20L7L7j00Q8k8J61Q9k67J17q5M9O6n7r1%L3K7k8L0L0j35O2L
$$ y = [58, 134, 132, 80, 119, 207, 85, 85, 51, 96, 107, 169, 130, 20, 112, 147, 104, 192, 232, 190, 181, 179, 177, 229, 93, 128, 147, 205, 229, 58, 199, 111, 212, 254, 108, 188, 134, 123, 190, 104, 139, 80, 208, 143, 61, 72, 100, 131, 217, 133, 128, 97, 232, 219, 84, 109, 143, 290, 227, 77, 13, 66, 136, 173, 102, 32, 195, 59, 102, 158, 181, 197, 136, 64, 136, 61, 79, 92, 41, 89, 90, 111, 298, 206, 13, 58, 157, 174, 192, 61, 110, 17, 193, 215, 93, 190, 271, 113, 230, 157, 50, 110, 137, 62, 89, 86, 99, 133, 158, 171, 107, 9, 78, 117, 20, 105, 54, 258, 208, 111, 70, 103, 104, 87, 93, 101, 186, 116, 46, 149, 198, 138, 45, 149, 117, 95, 158, 173, 188, 50, 175, 54, 50, 65, 81, 24, 192, 53, 184, 111, 79, 69, 16, 197, 323, 179, 90, 59, 84, 268, 132, 27, 147, 46, 186, 242, 29, 113, 84, 72, 115, 200, 119, 84, 82, 163, 145, 64, 77, 143, 30, 138, 102, 23, 111, 55, 164, 140, 24, 77, 74, 73, 202, 176, 134, 98, 206, 184, 107, 132, 242, 393, 178, 35, 36, 35, 192, 59, 84, 171, 159, 47, 21, 213, 172, 60, 114, 66, 154, 248, 221, 38, 79, 13, 90, 142, 50, 49, 81, 134, 79, 186, 128, 152, 32, 69, 106, 6, 94, 66, 227, 316, 49, 166, 81, 130, 196, 139, 48, 48, 81, 108, 80, 110, 140, 5, 67, 70]
3256G0k1J04j7J1M5n1Mn9O2j22Q0j4KrJ13j30q%M7J1p5J16J08p5k0Jm1m9K0L3K4K7r4o8J56
3084A81j32O9LJ27l9j38JJ8J30j47l1KK0j4J25o1o5P1M1j03P8n2J62K6N3j44m3K20l5m3rj09
2926A62n9mo3N0NK1N06K73k40j33l33o3j09N7M8M8m1P2l5J08m7j34NJ9L2rp3J16p4j9l7J27
2769A76m9j13P9k2L2K9J16j38l6R9j31J31J8j7J16O8l26NQ5k3L29k14j07k7oJ30j27L1K3J09
2621B40j22%P8L7j21J10R6r2j78K4J49j27o9J25R4M7o1o1R0j12M7j6j20L2j7O1l0l0m0P6k7
2469H3J38j45J39j1k0j48J42j5j15J05l0P1j26L8L9l0r3R3p3M6J54N9r8o7o7%Q6K5p4rO1q4
2311G4J29l0qO8Nj92J58j11R9j7m3r4J83o2r5R4L0n8K3j32R8J11j36K5q6K54k44Q0m2J11j0
2159A82n0j8L8j2p7K72l28K19J6k5j48J58m7q7J57j25J22M5j09n6K49j85K36j43R8k01K62
$$ y = [70, 49, 153, 136, 147, 192, 141, 145, 86, 148, 26, 106, 92, 94, 85, 198, 68, 60, 60, 107, 118, 43, 159, 267, 192, 172, 173, 132, 83, 103, 136, 160, 187, 93, 25, 181, 49, 118, 121, 248, 209, 71, 72, 90, 220, 73, 42, 44, 64, 50, 175, 114, 49, 120, 161, 58, 136, 84, 246, 272, 325, 181, 138, 358, 323, 280, 271, 162, 103, 99, 36, 86, 91, 112, 618, 891, 651, 518, 185, 122, 13, 70, 118, 166, 125, 197, 162, 270, 223, 89, 94, 113, 145, 136, 63, 179, 105, 86, 49, 176, 127, 14, 93, 71, 103, 132, 248, 110, 74, 173, 42, 173, 191, 174, 290, 358, 32, 37, 122, 99, 428, 214, 107, 80, 74, 204, 77, 108, 131, 240, 118, 118, 196, 233, 112, 222, 318, 226, 48, 72, 221, 94, 25, 150, 244, 291, 230, 169, 259, 147, 194, 178, 58, 90, 73, 134, 104, 74, 34, 110, 83, 221, 76, 215, 204, 184, 36, 178, 163, 48, 153, 123, 194, 68, 106, 145, 115, 22, 115, 42, 88, 242, 301, 203, 136, 69, 69, 155, 180, 106, 97, 158, 74, 203, 173, 165, 233, 238, 46, 204, 93, 192, 175, 132, 38, 221, 159, 64, 158, 188, 130, 153, 21, 119, 230, 94, 119, 33, 287, 43, 123, 81, 192, 182, 132, 114, 152, 140, 63, 335, 7, 226, 242, 217, 69, 227, 180, 93, 250, 125, 247, 292, 183, 127, 376, 191, 427, 284, 382, 181, 443]
2026D43j01J72j26O9K12K64j51Q14J499J9543P053k0753n526j553n07n97j90j35m6J23l83
1922A24K64Nk06k2K39k16n2P0K24l37K74k68K8K38l48J61L5L0j01n4n6J27J58j29K8Rj40J58
1784B43m4q2K5K8l7M7m2%m5L3lN2k2p8N7q7L20k53N3j16J53r6o2K31j45p4M9J26j94L8J45
1632B20q7K4j25M1J3J48j39J64j74R0J48k36o1J38m3N2N1j50k1qP8Jn4J7MN1l0Kq9lJ16k8
1474A10J67j38J4l3Q8j02o8J27j20J69o3Op1J38j31L0M4r8J1J0Q8m9lq1P1Q5j5j1r0k3J32
1322A94n6o4M2k2J24o3l6L4K6j6oR4j1o1K3j21K8k7k6N3oK8J45Jk16N2o1QL4k2RM1j07J03
1154A18m5M5mo%J4L5p4J20Qn5k9R5r1q1J43j02M2k5O6q3J04J39j17m2Q0j94N9oq3O6n6R1N9
987A91j3j27RJ76j0o6j33Q5J5N6L9q2O9j18k8N0n0OJ18J8j17P1m8J55K0n8j32K5l3o0K62J7
$$ y = [443, 342, 514, 388, 457, 669, 933, 782, 1596, 3095, 22638, 29691, 8938, 3412, 1859, 1352, 755, 565, 430, 384, 507, 124, 388, 393, 187, 165, 404, 188, 136, 206, 430, 93, 367, 99, 127, 365, 17, 178, 213, 243, 142, 88, 32, 159, 317, 188, 216, 225, 85, 243, 199, 117, 142, 170, 133, 180, 138, 138, 93, 126, 123, 175, 153, 75, 132, 45, 365, 112, 165, 49, 202, 106, 44, 275, 130, 56, 105, 231, 37, 75, 220, 133, 157, 32, 73, 86, 234, 95, 259, 85, 175, 323, 87, 26, 164, 121, 173, 224, 74, 53, 45, 123, 124, 70, 87, 91, 142, 112, 114, 25, 22, 138, 110, 277, 139, 153, 120, 208, 106, 38, 165, 45, 214, 151, 157, 86, 224, 93, 123, 167, 69, 80, 90, 178, 129, 126, 45, 116, 201, 186, 175, 85, 62, 194, 138, 74, 116, 94, 218, 155, 119, 153, 179, 163, 157, 251, 240, 179, 202, 81, 109, 82, 56, 109, 103, 131, 276, 277, 61, 113, 52, 60, 94, 72, 81, 122, 15, 118, 73, 118, 114, 108, 108, 122, 157, 83, 203, 211, 156, 127, 222, 131, 50, 193, 91, 133, 108, 174, 91, 195, 334, 217, 175, 255, 61, 120, 114, 31, 97, 41, 132, 191, 178, 51, 60, 236, 226, 160, 27, 112, 127, 183, 222, 140, 209, 91, 63, 113, 63, 69, 187, 205, 88, 159, 111, 266, 286, 228, 96, 121, 88, 28, 290, 307]
830C07j11q6J99j80K1n7J05K8j44n9N4J32P4k03R9j33J0L9J13l1p3rJ3R0J03k40Pj2J09m3
682A22qm1Q2m0J71R5k34j5L6j08J20O5j58J33n7O6j74N0J0Q7j37K27r8Kk1l6r4J17k8Nr0J68
524B17J20j35Nn1K9k6o1nPj0P5J48k27L08k96Ko0P8lN2O6p9J2o5n5Q6M6l1M9L2j84J15M6j0
357A95p1j7p6R0K0m8%M7r6J60M0j62Q2k6J49N9j96n2j0J42j54J2k6J19M0j27M0P4j08n3P7
204A24q0N4kJ06l8L3J6j42o4J29N2j23O2m0K8K7q2J8J8Q0j38J37r6R2p5M9J18p0p0l6kM8k9
42A04l2K3Q1n0Q3K7j54M7j10K33n6j47P1M7r2J62p6K4j1K3O8p5j9L6R5M0j82j7J00j10J8j04
-116D7K45r8m3j0o1O1q4m3J31J8j57R8j9k6R1r6N7m2O0l1M4l4O8J2N0j97J77O3n4j98M4L6
-273A09Q0q5L1o9k7N9J6M1or6M8J5j2NJ71j49N3j57J67j54O0j8k1L1j1j1N9m1P9k1K7r6J2
$$ y = [307, 196, 110, 309, 129, 150, 93, 198, 226, 82, 23, 77, 209, 283, 80, 179, 46, 56, 95, 208, 177, 104, 95, 108, 198, 301, 61, 68, 56, 165, 122, 114, 73, 155, 115, 286, 381, 147, 132, 168, 60, 180, 245, 87, 220, 163, 229, 55, 105, 115, 202, 65, 292, 194, 196, 175, 139, 45, 162, 134, 139, 49, 217, 337, 202, 207, 156, 185, 159, 98, 93, 100, 90, 165, 313, 86, 394, 98, 100, 40, 118, 115, 167, 233, 154, 166, 101, 46, 132, 178, 147, 196, 228, 44, 159, 205, 195, 124, 107, 31, 121, 141, 93, 93, 140, 44, 204, 244, 82, 164, 138, 287, 346, 150, 98, 88, 230, 76, 88, 62, 181, 221, 94, 134, 208, 100, 47, 124, 44, 98, 96, 202, 164, 197, 213, 71, 7, 136, 188, 65, 127, 87, 115, 142, 60, 78, 96, 176, 38, 175, 79, 171, 96, 145, 263, 193, 123, 87, 85, 133, 104, 72, 95, 176, 126, 209, 236, 82, 129, 19, 252, 196, 49, 120, 167, 75, 237, 161, 185, 174, 197, 265, 190, 171, 207, 302, 342, 160, 143, 243, 133, 151, 47, 292, 194, 151, 141, 80, 141, 57, 14, 145, 163, 6, 104, 85, 59, 150, 54, 111, 69, 129, 98, 142, 108, 176, 188, 238, 41, 218, 281, 227, 29, 73, 109, 189, 104, 135, 66, 39, 98, 114, 155, 149, 53, 101, 116, 104, 109, 280, 131, 184, 27, 194, 40, 100, 82, 61, 92, 81, 70, 129, 88, 167, 146, 173, 77, 89]
-435H9K9r7J80j32J3l4P9%j6L7Lp4M7p7P0l5
$$ y = [89, 118, 21, 201, 69, 82, 48, 127, 127, 111, 148, 151, 77, 124, 47, 117, 82]
-514H2
##PAGE=	F1=1937.01
##FIRST=	4521.1612903296090735,	4521.1612903296090735,	0.11827146261930465698
##DATA TABLE=	(F2++(Y..Y)), PROFILE
4521G9Q1pq3N4O3j14Ok7M0M0J7k4p8P3K5p5J26KJ8k1J0k8P4j65N4L0L8nj09J19j23P6Q8q9
4354A65o4K0K6K6j05Q6q2J34p7o9ON3J2P9q8k2l2J67mj26L1k1J35l1j67k7M5J5J9K2q0J53
4196A99j25K6R1LK3p7o6P9n7o7O0l6M4k5K7J70n5j65K3R0k3P8j92Q7q8J74jj34J17N9j23J09
4039B25o3q0M3j3qpK1l9MP8l4n9m6K5P7r2N5n8K09J0j30n2J6J2O6m5k6J07j18k3Q2M6o8q4
3871C1J30q3j6R9K8N6j23N7p4q2P5j3k5J49j14J04j05OK3q8J83J39j80j24j7Q3J72j50j20
3729B1J22q3Q7P0j48K8J8rLO5q0l0K6P1m1l9l0Q6r8J29r2n1J03o3N8Mo9pK3nJ20k2mr3J02
3556A72M2o8n7J51J33j67j66J2J4J10j17J9R9l3j30J1J47qj27NL8M1J12j0j70P5j02P5M1r1
3409E1J1K7J00o9O5n6K7j16L9K3m9O1n3J57Q0k87J72j19M2P4j5j03k0L6K1n7N3N3j05L5k0
$$ y = [79, 160, 153, 70, 124, 187, 73, 79, 52, 92, 132, 149, 125, 47, 120, 145, 70, 196, 198, 216, 195, 205, 177, 251, 86, 140, 170, 208, 203, 94, 213, 90, 166, 254, 165, 101, 121, 147, 173, 68, 154, 72, 206, 129, 60, 66, 119, 131, 210, 122, 100, 68, 235, 231, 105, 136, 115, 250, 219, 52, 25, 70, 85, 104, 126, 46, 199, 74, 100, 191, 194, 217, 140, 74, 153, 96, 29, 89, 53, 97, 72, 99, 269, 214, 49, 72, 162, 139, 217, 25, 112, 24, 198, 197, 63, 180, 239, 116, 225, 162, 82, 125, 112, 104, 97, 118, 79, 83, 161, 127, 68, 22, 47, 124, 32, 87, 29, 238, 248, 118, 66, 82, 94, 160, 115, 89, 196, 78, 55, 137, 183, 115, 31, 161, 78, 62, 161, 189, 245, 122, 179, 105, 23, 98, 85, 60, 209, 95, 199, 94, 100, 123, 35, 218, 357, 177, 53, 36, 119, 291, 141, 21, 143, 60, 147, 217, 69, 97, 115, 106, 109, 174, 94, 64, 90, 161, 120, 81, 51, 137, 39, 168, 76, 25, 128, 65, 123, 127, 58, 51, 74, 69, 189, 167, 163, 70, 172, 214, 146, 89, 240, 373, 206, 40, 52, 66, 176, 59, 78, 177, 144, 14, 25, 172, 164, 37, 42, 80, 121, 233, 223, 53, 128, 26, 101, 142, 51, 62, 89, 189, 120, 185, 129, 156, 40, 79, 102, 53, 114, 61, 218, 298, 11, 183, 64, 106, 180, 165, 62, 42, 78, 99, 42, 95, 148, 43, 78, 58]
3256E8rR0k1L7M5p6J3o0Q5o8n0K9O1l6R7j15n6kN1M9j03J16P5l6l3JJ7m8n2Q4J9on5n7R4o7
3079G1M2M7R3k3j77K9j2J22j11l5k0M1k5J40lj08K0L7q5N1M3J06O5O4j05j85K64K1q4l8j15
2926A30k8n1LO0l7J0K60J92k58K6j54m6r4P2K1O7l9M5lQ5p5p3p9P8j0N9p4R2o1o2N3Q4p5o2
2759E6J6l3M6J4J19o8m6Q9j92J38N7m4J48J2k33n7P9M9K58k18j40jJ0J35j13J6Q2L5p9m2J02
2606A95k1o2J71N3r1j98lJ33j07K5K7Q0Q6o0r8J50m5%p1q4rK5Pj8l3O9om7J18r0J35j07j1
2444A13l1Q1J8j25J15p6R9j64J29j7l9k6L1p9O5J11J43j37j45n1K6P8J08j50L9j5r1J89nL6
2296B30Mm4j13J15r2J27l1j44K1K8ro5J37O6j55J3j2l8J21l4p1K5J28j42P5r6Q9M4j09rJ04
2144A63r4Q0N6q1j3L5j7n7J80j77R2q4J18j6q4o3Q8R3j41J04M7k2j0j01J89k05J12p4K67l13
$$ y = [58, 49, 139, 118, 155, 200, 124, 137, 77, 162, 94, 44, 73, 134, 98, 195, 80, 24, 22, 73, 122, 19, 135, 210, 174, 141, 142, 159, 111, 59, 143, 162, 156, 101, 44, 138, 71, 113, 160, 253, 230, 53, 82, 70, 192, 81, 46, 26, 67, 42, 182, 179, 71, 91, 128, 43, 94, 137, 243, 308, 372, 267, 82, 346, 367, 283, 245, 130, 102, 51, 54, 114, 77, 87, 347, 539, 281, 307, 153, 107, 13, 85, 106, 173, 134, 179, 176, 261, 186, 113, 34, 112, 102, 161, 87, 179, 118, 56, 109, 193, 118, 56, 72, 39, 85, 99, 218, 150, 104, 193, 1, 139, 196, 152, 300, 312, 79, 22, 101, 150, 408, 190, 50, 49, 59, 194, 81, 97, 179, 214, 135, 93, 195, 174, 112, 283, 336, 245, 47, 44, 177, 70, 95, 122, 202, 288, 228, 130, 280, 235, 235, 164, 80, 71, 96, 103, 85, 52, 121, 115, 68, 186, 96, 231, 124, 113, 82, 163, 181, 56, 171, 95, 194, 30, 159, 142, 103, 77, 108, 29, 94, 205, 348, 211, 66, 15, 41, 119, 227, 77, 116, 101, 10, 199, 194, 230, 234, 190, 77, 192, 100, 227, 196, 52, 73, 101, 92, 27, 164, 230, 75, 88, 76, 38, 159, 125, 54, 79, 207, 65, 140, 44, 133, 177, 68, 59, 163, 69, 149, 205, 124, 111, 146, 129, 72, 252, 75, 167, 83, 201, 185, 101, 38, 126, 219, 78, 182, 229, 207, 197, 96, 285, 80, 192, 118, 385, 72]
1996G2L81OQ10R116l014o944J36j83L8j68J03j42r8L1K07j92o0R5J5m0m0L6j24K37Pj39q0
1863F6J9J34n5o8J15j35n5L4J05j3O6j81P3O1qR8j17Po7M4Q9j15k8K4o0OJ33q4J7p3R6K4J95
1701C47k12K3l0J6k1k3P4kr6j3J28j27j1J57p5k5J6r7J00N6l8Q5p5M0R7j64r4J14m4P4Jj07
1543G4N9m0j0K4m3N4j04J58p6Lp7K7K36J39j54k19P0j6J22n2q5O4j02J75o9l1p8J43r7Q6k0
1391A61j01M6j3M3m7m5j4P0N6N5k7n4j19J51m2Ml1K2Q9l1m6Nk2P0J6P4Lr8j2o8j3k5k2L4K7
1218I6M4J32j1j86K5J9n9K7%%M4o9P4p2K3l6K0Rl3M1j1J20j5k0N4Rj00r3J32o3L7n1J28j00
1051A15P6J25j30j7Q3j50LMq4N9n1J00J32o5j05k7J28L4m3j24N7K8M9Mq4J07j15k6O2r7K6
898G4J26K7j11N5p1J63L1p0j04J4L5j03K42J7j32r0J40j11N3p9J30k6r2o6J0J33J4j70J15
$$ y = [72, 453, 459, 1269, 10385, 7371, 427, 563, 380, 418, 250, 353, 211, 113, 144, 351, 159, 99, 194, 209, 169, 129, 165, 41, 278, 285, 146, 66, 85, 219, 164, 96, 211, 76, 21, 55, 160, 147, 213, 32, 105, 166, 158, 256, 139, 146, 79, 123, 212, 97, 69, 93, 33, 39, 172, 88, 105, 32, 128, 152, 347, 135, 158, 128, 144, 123, 100, 174, 172, 76, 63, 191, 64, 53, 210, 135, 110, 126, 29, 129, 185, 147, 232, 157, 197, 294, 130, 36, 150, 106, 180, 181, 74, 133, 93, 83, 107, 64, 118, 14, 172, 96, 99, 22, 49, 285, 424, 270, 51, 121, 105, 227, 175, 90, 154, 52, 227, 158, 127, 49, 192, 95, 181, 161, 60, 106, 93, 136, 89, 44, 30, 100, 156, 211, 184, 130, 11, 162, 120, 124, 93, 115, 204, 173, 127, 132, 110, 180, 196, 270, 273, 175, 163, 95, 82, 57, 35, 69, 96, 140, 272, 261, 75, 100, 119, 60, 87, 87, 87, 131, 62, 136, 64, 87, 51, 71, 80, 47, 88, 77, 197, 182, 162, 216, 225, 125, 32, 164, 101, 138, 87, 215, 115, 191, 316, 186, 169, 252, 102, 105, 109, 25, 84, 33, 133, 265, 200, 95, 68, 196, 230, 187, 63, 120, 148, 197, 201, 117, 224, 109, 83, 145, 48, 74, 200, 227, 116, 171, 100, 263, 294, 224, 120, 134, 169, 66, 308, 325, 193, 103, 243, 132, 185, 106, 236, 210, 118, 52, 62, 195, 209, 39, 154]
756A54n1o1O3J28j5q4r8M9J38L4j98J7o9J57l9j2m6R1o5J98O5k89Q4j8n0J16K7j82J75n2P1
603B38j61J3J0J20j21J89j15nj0q0RR7j00N0m8J41J34j42m1m1Q5k6m9p0M3J7n6J89j36K69
455D03k97m4K4Q1l8OJ09l6l9j17m6J41J4j6O7Rj76J33L9k8p2k7j5O8ml8K2j1m0Q8P2j35L2
293A29rJ92L4k07l0M8O8j31k0JJ33J4j31OP1q5l0N5o3O6%R3k9K2j4r9k1J32O6j29Lp5Q3k9
126A14p1M2mQ7q2Q1r6J16p3M0R1m9q7k8j2oK7j3J6J12j19J56J6k30K6l6K41r6j35J28L7j03
-32I0J19p2M9m3N6P9r8l8M1O8N0j45J0P9j30M2j03K60j17m1m7n4J11l9q0J10j1j28N9J8n9
-184C6O6m5L6l1Q3n4O9k0O8K3l9j78K09N2r5j18K0PO6n1M1p7qJ5L7Mk7l9M5J9rk9J53j02L6
-357A63j41J40j38R3l9p6R2J7k2M2o8R7m8N0q2RL4j06J49j21K4l9O7M8m4M1Qp2L9m2Pl9
$$ y = [154, 103, 42, 105, 233, 218, 134, 36, 85, 223, 257, 59, 76, 7, 164, 125, 113, 67, 158, 93, 291, 356, 67, 151, 133, 83, 199, 226, 44, 219, 167, 238, 77, 90, 100, 220, 99, 288, 173, 168, 158, 78, 87, 184, 84, 134, 86, 227, 361, 219, 178, 137, 222, 196, 147, 77, 120, 137, 81, 270, 134, 403, 106, 62, 86, 167, 129, 135, 244, 208, 169, 52, 6, 147, 161, 145, 212, 221, 45, 178, 217, 189, 117, 90, 75, 143, 139, 101, 123, 112, 72, 160, 232, 97, 129, 120, 312, 346, 139, 109, 157, 225, 94, 74, 75, 208, 222, 91, 97, 168, 83, 53, 108, 45, 111, 111, 204, 175, 197, 183, 84, 63, 195, 261, 132, 135, 60, 143, 114, 43, 85, 81, 168, 86, 167, 71, 187, 114, 154, 245, 196, 109, 81, 69, 63, 90, 77, 93, 205, 86, 242, 258, 28, 54, 18, 259, 163, 28, 156, 193, 90, 209, 137, 186, 143, 199, 278, 180, 142, 183, 251, 301, 156, 166, 245, 115, 157, 54, 314, 197, 156, 109, 55, 166, 127, 47, 157, 146, 18, 77, 95, 36, 102, 57, 93, 62, 145, 91, 160, 140, 208, 231, 192, 14, 223, 275, 180, 62, 82, 89, 155, 104, 145, 68, 60, 75, 112, 116, 89, 50, 95, 114, 105, 76, 229, 127, 163, 22, 162, 24, 117, 78, 2, 94, 111, 89, 131, 63, 160, 112, 162, 80, 89, 123, 17, 166, 45, 69, 30, 97, 145, 101, 142, 150, 78, 117, 75, 82, 43]
-514D3
##PAGE=	F1=1932.09
##FIRST=	4521.1612903296090735,	4521.1612903296090735,	0.15034027397632598877
##DATA TABLE=	(F2++(Y..Y)), PROFILE
4521A01Q2j8p9L4L4j09L4JK2N6l6j9l7O2J9j04J24j1P4l9L2m6Q8k02P3M0K8k7m7R6j58N2J32
4359B52l3j38PO5j3j17J47j06J41r0n7J0Q8k4N4q4l0l3K00%j21J2l5J12rj22l6M5l2K1O8q6
4201E6J46j21%J36rK9r3o4Q1k6p3K2L%k5J4J36lj24KQ1o8J34k13J00r4J60j6j38J36L7q7J01
4039B20n3n2K5n3N1m9M9q6OR6p5n0J0j4R4m2ol1J87M3j54n4LK7J16o3o3J24j65K3O1M4p2p2
3871B5J41q2o9J41M5J01j16j5l3n3L3l2JJ22q0Q5j37M3N7j23J71J38j87j32k5J18J63j58j02
3729D0R1o1L8Q3q2k8O4j3m5O0o2l2M5O4n8l1m0J01q7J59j39l3J11p0PK8k8k3K4j4J08k8K7
3566A76j42J03J00o6q2J36J12j20j80L1K5N8o7k0J17m9p7J0P6kr1RK4MJ19lj25P6j26Q5L9
3414A50q2OOJ57p6J4o2N9q4K1j1JL5p5J58O7k45J65j48K2O9L7j07m0L7J5q4Q0Q0j10M2m7%
$$ y = [101, 183, 165, 86, 120, 154, 45, 79, 80, 102, 158, 122, 103, 66, 128, 147, 43, 167, 156, 230, 191, 223, 177, 265, 63, 136, 176, 204, 177, 130, 226, 68, 120, 252, 219, 81, 88, 153, 140, 23, 170, 64, 205, 115, 58, 68, 156, 132, 186, 102, 72, 39, 239, 239, 118, 130, 95, 207, 198, 76, 40, 85, 53, 74, 142, 56, 202, 81, 81, 217, 208, 237, 144, 80, 161, 135, 62, 84, 87, 87, 62, 76, 212, 209, 85, 87, 168, 100, 234, 21, 121, 27, 187, 171, 33, 169, 206, 119, 220, 167, 115, 140, 87, 138, 89, 138, 52, 58, 154, 79, 29, 39, 25, 119, 77, 71, 40, 227, 270, 116, 62, 65, 92, 208, 145, 82, 206, 41, 64, 125, 169, 97, 25, 166, 84, 15, 156, 201, 302, 186, 171, 138, 85, 118, 86, 87, 209, 129, 214, 77, 120, 177, 54, 225, 363, 176, 44, 19, 137, 300, 142, 40, 131, 70, 108, 191, 109, 81, 145, 132, 87, 147, 85, 53, 98, 162, 104, 73, 33, 134, 47, 206, 67, 34, 145, 75, 82, 110, 82, 59, 83, 69, 177, 149, 176, 34, 137, 237, 171, 89, 225, 337, 217, 37, 68, 93, 151, 84, 64, 181, 132, 55, 65, 141, 139, 48, 57, 81, 85, 204, 201, 76, 152, 26, 111, 150, 68, 74, 80, 237, 161, 175, 113, 172, 88, 109, 98, 99, 134, 59, 217, 284, 39, 204, 56, 78, 147, 184, 77, 37, 74, 89, 5, 85, 165, 55, 97, 50, 50]
3251E0P5k5O2M6j01K2o8R8K2j44K9P6m3J01q8k6%qM0o7N9N1on3L3M2m3j20J28Ol2om7L1j0
3079H4PR2N8Kk08N7m2J14p4l2l2N3m6J39L9j35j4L3o6K4J37M1R6Q5o0l21L12K6j09n3j09K
2921A00r7P0O9o9QJ29J15k64Q5k8j7q3Q3oQ6l7J8K4N8o3l9j02M4j0J03p1P3m9j04J38L9o1
2764A42l5nnl2J4J12rl1M0j76J09R0p6J52pj68q3N3R9K03k06j01n7N3J00r1RJ08nm1q8J33
2606B01o9j1K22Kr8k09k1J11r1R8k4J1J38l7j15J85lj9r5q2j8N5o0%l3J46n6p1R4n2J15j79
2449C5K4P9RN7j32J15o6O4j54J74m9m5k0jn7Q0O4J85j51j76J3oQ0J23j84R9q0m1J50Q3j4l7
2291B21p1o8J06p2J53n3j88P6p5L6m2J37O0j33l0N0p4Q3K0p2P5J0l1L3p5M8Q1j46K0J10q0
2139A09P3l5K7r5J3O3j5J50k43J78j17J51p6j32N8J10o2O0q1J81j28J93k80L31k92K19K8J00
$$ y = [50, 125, 100, 162, 208, 107, 129, 61, 159, 181, 37, 66, 142, 99, 200, 112, 86, 86, 78, 118, 51, 110, 161, 155, 102, 135, 177, 134, 14, 142, 148, 116, 110, 63, 94, 84, 91, 183, 241, 243, 35, 92, 50, 164, 90, 58, 26, 79, 33, 172, 211, 76, 62, 95, 29, 53, 190, 231, 327, 412, 352, 31, 343, 369, 260, 207, 98, 100, 3, 73, 142, 73, 81, 210, 325, 61, 146, 118, 101, 18, 101, 95, 181, 144, 162, 186, 244, 181, 142, 40, 84, 74, 177, 106, 179, 130, 26, 164, 203, 142, 107, 102, 97, 65, 79, 191, 182, 151, 191, 15, 124, 214, 138, 290, 283, 115, 32, 85, 184, 387, 181, 80, 23, 76, 176, 85, 94, 202, 197, 156, 68, 201, 132, 121, 343, 345, 247, 38, 17, 128, 37, 135, 111, 122, 260, 223, 108, 293, 290, 271, 176, 94, 76, 131, 71, 71, 38, 184, 128, 57, 151, 99, 214, 35, 59, 138, 147, 204, 72, 187, 121, 185, 31, 205, 156, 111, 91, 90, 33, 113, 177, 362, 211, 35, 48, 42, 122, 245, 61, 160, 80, 39, 189, 272, 258, 221, 150, 82, 188, 116, 269, 216, 28, 104, 29, 65, 23, 160, 220, 87, 57, 107, 33, 116, 136, 64, 139, 149, 118, 151, 76, 124, 205, 59, 79, 189, 109, 182, 147, 174, 79, 92, 155, 140, 290, 47, 225, 108, 259, 183, 51, 109, 219, 157, 217, 136, 317, 189, 382, 102, 433, 141, 360, 388, 488]
2001D88p9M18j91M89K3517L93k0929l028k88k93P1Mm1j96j69M46m58m3N8K24l10J44K4j28
1883A23P1J75l15J00m2M3P3j32J28j69k5J04Q0n1k8l3m3O3J09K4j24N0r5J2J58j81J9k7l4
1740C3K1J31j58P0n3R1R0R6j45m0K4m5J9nl9J04r0p4J28q2j9J49q2k7R5j70J38PpL9j2J1O7
1578B65j10j42J07k9R6m8p6J25p2l1N1k6L4j13J64p1l1l2J5L14L32l37l21nL4J85j8j18Rp6
1430G5J64q9m9o4R8m6J54p0j23O6k1J2l9K9oJ0J3J14k3o3r5R1l2O7j02O4N6%o1k8k7J30J3
1268B18L0Q4j35o1k7m6j4j8J5M3M3J28j6j54kJ15j10NMrM7l6M2o7l4J2k7K8M1K6l8Q3rnJ16
1095B72o4r8o2R5l2K4n3J49j05O1J12j44%P7r8m3K2p8N4m6R0J90j09p5o4Q0P1k8j07L7M1M1
938B10l0q6J44j10k6P4j43M6J26K8j01M3o2J40L6q5o3J4P3j06J78M3j15j22P5m6Q6j02J54
$$ y = [488, 409, 827, 636, 1125, 24642, 25035, 4106, 1078, 790, 497, 568, 572, 531, 335, 166, 612, 154, 111, 169, 393, 83, 227, 251, 123, 194, 369, 54, 154, 112, 155, 228, 96, 224, 55, 30, 134, 214, 163, 135, 102, 59, 122, 231, 255, 131, 181, 86, 98, 256, 75, 94, 67, 33, 54, 185, 27, 97, 44, 135, 225, 321, 176, 136, 160, 115, 134, 129, 90, 194, 104, 30, 158, 76, 57, 206, 124, 97, 192, 22, 160, 167, 160, 199, 187, 198, 265, 155, 13, 120, 91, 187, 139, 63, 188, 116, 85, 136, 110, 144, 31, 195, 124, 93, 61, 76, 390, 722, 385, 64, 59, 93, 278, 260, 142, 151, 75, 239, 150, 101, 37, 135, 89, 243, 173, 50, 116, 95, 107, 68, 97, 91, 101, 114, 228, 205, 142, 47, 138, 106, 173, 71, 135, 191, 191, 130, 102, 75, 205, 218, 248, 332, 197, 136, 109, 63, 49, 31, 46, 89, 132, 260, 244, 90, 88, 203, 93, 98, 102, 93, 140, 104, 146, 79, 45, 57, 30, 58, 99, 125, 87, 170, 161, 156, 272, 208, 110, 48, 143, 111, 135, 82, 231, 126, 187, 299, 155, 155, 232, 134, 91, 113, 35, 89, 43, 133, 323, 214, 139, 75, 155, 226, 198, 91, 128, 169, 210, 180, 94, 238, 128, 102, 176, 33, 79, 205, 233, 132, 175, 113, 253, 289, 204, 141, 155, 228, 122, 300, 343, 228, 106, 181, 135, 221, 119, 273]
795B73p8m1p3l3J33l8j28J23K4p6L2J38np9j04K7J26%j22j0n3J18j3k3n6R9r0K17K8k80J37
642A73o4J3R9k2j73J84m3P9j38j6JJ44j03J51j33j1K4r8Q6N4j65J03j4J07J48j50p9k2J23
500B58m2k8j27P2L8j32J74l8K38k81p1O0J02p7m4J44%p6j54N4Q3j3LQ5j3j70J52L2m6o4l0
347H9L0K9k0j9M4o9J6J7R8j13K1k0K04M7k22j2J06pj07n1K6J48j2j34l0P0o3pL3m5P8JP1k9
180A68K0l5n6K1J27P3j31n2q0J00m0q1N7l4J37n2K1j01J49o2J4M7j9r6k0k1m7R6poJ45j90
22D5K25Kk38RlK06j25m7J14K3j09P9o8P5p6Q9Q9j21n5M5M1N9j07L6O0j51O5j00K65j45k9p7
-135G6m7J63J7j04L8k3r9K2R4j16L7KJ9j5P1m2Q9j1N9K6j08p4J61K6j28k9K1o5M9k0N8p8M
-298G3l7O7k5n0K0M0K4Kn4J17p0K7j16J11j21J28n9l6M7M9k9K6r6J14p5P5o9OM0j16J17j05
$$ y = [273, 195, 154, 81, 48, 181, 143, 15, 138, 162, 86, 118, 256, 251, 172, 68, 95, 221, 221, 99, 89, 36, 154, 141, 118, 62, 161, 71, 288, 316, 36, 173, 109, 122, 221, 199, 26, 210, 167, 246, 108, 92, 93, 237, 134, 285, 152, 141, 165, 67, 153, 207, 42, 145, 131, 238, 386, 236, 157, 135, 258, 216, 188, 61, 133, 171, 39, 213, 175, 413, 132, 61, 121, 223, 146, 102, 246, 246, 170, 16, 70, 153, 140, 143, 228, 215, 45, 197, 229, 183, 119, 89, 119, 148, 128, 109, 153, 84, 100, 117, 215, 102, 123, 103, 307, 354, 132, 120, 226, 219, 112, 61, 87, 235, 223, 89, 59, 129, 66, 59, 92, 47, 125, 126, 197, 168, 188, 153, 97, 118, 245, 318, 187, 135, 55, 155, 115, 34, 91, 57, 194, 142, 163, 62, 211, 149, 163, 210, 191, 95, 75, 54, 7, 103, 96, 90, 235, 45, 270, 272, 34, 43, 40, 246, 121, 74, 188, 211, 102, 181, 113, 188, 112, 201, 290, 169, 114, 159, 200, 259, 152, 188, 248, 97, 162, 62, 327, 182, 153, 76, 29, 192, 209, 105, 143, 120, 21, 43, 137, 21, 58, 60, 79, 64, 135, 93, 182, 171, 230, 256, 148, 74, 235, 261, 133, 104, 125, 60, 109, 89, 147, 69, 73, 36, 103, 78, 28, 48, 88, 112, 114, 60, 177, 107, 134, 18, 129, 8, 136, 77, 41, 88, 137, 108, 134, 38, 152, 77, 152, 83, 89, 129, 13, 130, 25]
-455B5M0k0J4R9o6L7Mo2L8j1n8j1
$$ y = [25, 65, 45, 59, 158, 92, 129, 133, 71, 109, 98, 40, 29]
-514B9
##PAGE=	F1=1927.17
##FIRST=	4521.1612903296090735,	4521.1612903296090735,	0.17320318520069122314
##DATA TABLE=	(F2++(Y..Y)), PROFILE
4521A17P6k4o0J3rq9O7K2nO2o5k8J5L6j2p3P8OR9n8O6p8R4k19Q4O4rrMN8j75L4J49K7j09o9
4344H0N7l2p3J46j48J53p8l4J5R4m1Kp0k5jJ76j1q8j0l3R7lo1n6K9j7L4N0q2J50j38oJ43J0
4177B29J5j07m9P4Qo4m6O2l6k1qQ1O5o4m2N8q1J54j83Q8r4J27l8r8J22J2n1R2n1joo1O4o9
4009H1O5j15M6N7o9J0km4O3J9o1LJ76M3j52n3pK6J45o2r7J46j83L8L8M7q2l6J02k6p8J06N4
3847A98J53j13r0Ol1j5l1J4J01k4N8j60O5P7j47J56J23j79j02l8J16J53j63o8L8k3J4O1oq3
3699F0J25l3j00N7l2l6O3M8o3l9j5Q3p2J80j53j9J03q0k5L5Pj5K6%O0l8N8j21L9J13l0n5N9
3537A90J06q2j59PK8K8kn1J06l8l6kJ5J1n0L7j2n0J26pp4N4r6O9L6p4j8K1J78n5l6p6Q0n2
3369A22L0n7M9J5j08J58Q2k25J52j32k9O3O5j13j3J3L6q6M4J00j17P0q2J0K3pJ03M5j48M8
$$ y = [117, 193, 169, 109, 122, 113, 24, 91, 113, 108, 170, 105, 77, 92, 128, 116, 43, 121, 127, 226, 168, 234, 156, 250, 31, 115, 179, 170, 161, 165, 223, 48, 82, 231, 258, 149, 80, 137, 105, 32, 178, 30, 183, 105, 71, 86, 180, 139, 141, 71, 46, 45, 221, 210, 122, 112, 79, 176, 173, 112, 56, 85, 68, 102, 152, 70, 220, 82, 76, 219, 229, 244, 137, 88, 162, 170, 106, 60, 122, 86, 65, 57, 138, 203, 139, 97, 155, 74, 228, 45, 133, 39, 166, 128, 30, 152, 164, 113, 205, 154, 153, 147, 86, 150, 81, 146, 31, 77, 134, 65, 75, 73, 29, 92, 111, 50, 53, 229, 272, 120, 67, 60, 86, 231, 169, 72, 218, 35, 73, 111, 158, 76, 40, 142, 116, 38, 144, 198, 351, 238, 148, 154, 123, 108, 77, 91, 192, 168, 226, 66, 131, 208, 61, 217, 340, 161, 59, 21, 137, 290, 127, 59, 97, 74, 88, 149, 143, 60, 185, 152, 52, 109, 77, 41, 104, 152, 89, 50, 35, 118, 46, 226, 73, 54, 157, 77, 52, 87, 94, 79, 105, 105, 165, 127, 185, 64, 103, 216, 186, 131, 190, 296, 214, 55, 62, 90, 118, 116, 65, 171, 133, 97, 95, 110, 121, 71, 108, 96, 46, 172, 165, 91, 145, 49, 118, 154, 80, 62, 83, 261, 206, 170, 94, 174, 122, 152, 95, 144, 159, 51, 209, 291, 66, 218, 86, 57, 120, 185, 72, 59, 72, 108, 22, 66, 166, 49, 119, 37, 47, 70, 63, 166, 211, 63, 111]
3222A11m6P6J00j21k8M1l9J15n8j0lm5Lj7J4L6Pp4J01M4n6r5M5K2j9K3n8j2J1LQ5O8J1k11
3054B4O7m3J02p5%l5M1n9J34N6j30m0N3o9lJ87J4R2J03rl86L14Pj12p2q3J8q1O2Q8q4j7J26
2892A90L6j54KJ6ln6Q2OO4o4K4M2M1l1j9q2m3J5J11n4O7n9j04J64K1n3j3lJ4j13K7Q3L8qj9
2720A65j22Q2Q6q0J25mj21p8K6J17J58j86n7m8L8N4q5K6J01j6l4p9J34r1K9K40j1j33k17M
2572B3N5o8J42j7j00J94k8r4K04Mk9j05q6j4R0p9n5PJ63q4p6O1k9J03j40J2J09k7N8j07J19
2419B06n3J5j12J73l3q3l3j5k6P0M5K01j38j46k0J7P6Q9j47R3r9j9J03J95r8o6o7m6R0o8J79
2267B83m5j73M3p1J8k0J09M2p2p8P2m1K3L6o2J10o0K1Ln2J7J02r9MP8m6J6k6N0p8k3R7k9J36
2099B85k42J70m0P3j09pLJ02j07J27q9J62j82K75k99L15k69K00N2K8O8L38j85M49K3885J976
$$ y = [111, 65, 141, 241, 120, 92, 133, 94, 209, 151, 141, 138, 93, 96, 79, 93, 129, 136, 62, 163, 207, 151, 56, 101, 123, 104, 127, 69, 57, 68, 71, 156, 224, 235, 24, 91, 48, 150, 75, 75, 40, 81, 22, 156, 212, 82, 42, 95, 26, 23, 210, 224, 316, 419, 410, 24, 338, 345, 233, 161, 78, 96, 15, 77, 165, 81, 64, 190, 226, 72, 74, 90, 87, 31, 113, 119, 183, 119, 143, 185, 226, 195, 176, 94, 51, 66, 177, 123, 190, 131, 27, 191, 212, 159, 146, 143, 157, 44, 71, 154, 192, 184, 165, 43, 125, 211, 131, 256, 252, 131, 53, 79, 196, 354, 168, 111, 63, 101, 155, 70, 96, 197, 181, 147, 68, 202, 111, 140, 380, 369, 236, 19, 23, 78, 10, 152, 135, 35, 229, 201, 107, 311, 315, 286, 181, 95, 81, 171, 92, 37, 44, 207, 123, 47, 108, 79, 182, 42, 54, 163, 136, 194, 87, 206, 153, 168, 56, 229, 196, 113, 80, 65, 39, 109, 154, 355, 217, 71, 51, 68, 144, 233, 86, 179, 80, 61, 164, 359, 261, 195, 128, 82, 172, 104, 283, 238, 65, 108, 37, 55, 35, 144, 186, 114, 36, 108, 67, 90, 126, 64, 174, 114, 135, 138, 86, 103, 205, 106, 110, 188, 142, 158, 132, 182, 104, 81, 178, 149, 285, 43, 213, 173, 246, 137, 130, 133, 235, 128, 255, 166, 328, 146, 421, 122, 437, 168, 368, 420, 448, 516, 854, 669, 1118, 25003, 26979]
1971B6979k1834l688m32m48O5q5M8k48j88N27n20no3M96m71J16J9j17oK07k66R0r5N2R4j42
1843H5J36j16n4J10M4k0r1O1j13J8K22k9j40P1p8k4J83j64M1q9k1M5R0j60J20n8P3J22M3j21
1696A86r6O8m0L2j4j06J50p0q1R1n2l6J76r1l7J25j74J40ll3J2K5K3L5p1j15O0k1J05j05k4
1543E9J55j05ON8l0Rr2J51o8m8Rl2L80N13m02m34n0J7K31Lj59nq0J39r4n7l7L3K8J86q2j52
1386E0N9j9J5m3J16Mp0k2J41pq4o3L8MP0j28O0N7Km2n2j1J40QjJ54j44j26J3n7kl7M1K5L2
1213A21J08Pj38k0K09j25n2jj2M3k5L0o1o4O5l0j0J32L1j05L5j0L5J12q3r9j8O1k7Rl7J35
1056B16p5L4R8j13k6O2l2q7K2m5M1n8Q5K18r4o9j08P6O7j1j01L2N9L1q5n6J44q9j7Q3j76P4
898A00Q9L9r4L9l6J14j2o4k3K4Q1q2J03O9o6j53j9M1R3j07J66j39j6o1k8J26q7k4N1Q5q7j2
$$ y = [26979, 5145, 1457, 1025, 577, 642, 557, 605, 357, 169, 696, 176, 171, 108, 604, 133, 249, 268, 151, 145, 352, 86, 176, 81, 133, 227, 85, 221, 105, 51, 161, 205, 185, 94, 155, 42, 60, 282, 253, 113, 184, 106, 82, 265, 101, 142, 53, 32, 77, 167, 7, 127, 69, 142, 264, 307, 186, 90, 158, 118, 150, 136, 30, 180, 110, 29, 120, 68, 32, 208, 117, 80, 205, 31, 171, 168, 135, 147, 172, 195, 230, 159, 44, 104, 83, 188, 83, 59, 214, 109, 115, 173, 143, 152, 60, 211, 143, 95, 104, 72, 452, 965, 563, 129, 79, 96, 327, 330, 171, 166, 86, 225, 131, 74, 37, 70, 98, 284, 202, 50, 109, 90, 105, 62, 178, 182, 112, 90, 231, 224, 140, 77, 115, 119, 189, 61, 121, 178, 180, 138, 86, 75, 215, 223, 222, 376, 232, 106, 119, 62, 60, 23, 64, 89, 121, 229, 236, 98, 78, 287, 162, 110, 109, 97, 140, 115, 145, 84, 20, 85, 55, 45, 177, 208, 103, 138, 128, 163, 275, 192, 93, 75, 136, 109, 118, 81, 216, 141, 175, 273, 160, 134, 196, 164, 77, 99, 54, 95, 37, 122, 340, 246, 177, 69, 145, 212, 201, 100, 132, 191, 222, 137, 81, 225, 136, 119, 202, 26, 100, 189, 228, 134, 173, 137, 251, 239, 175, 152, 176, 257, 175, 278, 347, 281, 128, 109, 150, 243, 136, 302, 163, 147, 86, 58, 184, 97, 73, 124, 209, 122, 110]
741A10J49J0m4j18K7P8l9k8l4l9O5J6m4o0J02q5K07lj90J23r9N7N7m2j27J34l2Q9j40mjJ42
583B37p5J13j52KL2m5J07lj56J02qQ1J53j47j17L3J03j8l2j42R4J7p3N3L8K15k47o9L6J40
436B72j24p9J79K4j10r2N4J9m1L5R8l5j22J22K6l0q5NK2ol9J0N3q3N8n4J06j00N7m1J90O1
278C50k07j8J42l7j08o5L1J63l7j47k8L9k9PL1n3R1J3M7l2K6n2oM2R3J03j49r3n3Q8l4r3O2
116H7o1K23p2rj31J72k8ppM1j26j8kk1J12l0l0J60k19K52j7k12L8n8J81j36J5J18J2j24O4
-37A67p0Q5o5Q0P6j12q1P0rO7o4M7K8j38Q1r6K40j48k7r5k5J85O7j10l1rr7LJ77j50m1N9R
-199G3pN4k0J09k4O0Nj55L3J27j4j37L6Rr4NJ3P2p4Ko3O6qj3oK6J7Ok9N9m8M2p9M3o0R5m9
-381G2oKP3j5L3j23J07p1O7n5J0M3j12P5o5L5mj7J00p8L4Jm8O3mq4L2
$$ y = [110, 259, 269, 225, 107, 134, 212, 173, 145, 111, 72, 137, 153, 109, 49, 151, 66, 273, 270, 80, 203, 104, 161, 218, 176, 49, 183, 151, 240, 100, 96, 95, 237, 162, 275, 123, 125, 157, 112, 219, 216, 60, 162, 154, 235, 388, 241, 124, 157, 260, 242, 210, 68, 162, 179, 106, 159, 197, 412, 165, 96, 132, 272, 148, 69, 248, 272, 162, 70, 124, 143, 102, 137, 235, 200, 78, 200, 226, 196, 111, 116, 138, 132, 93, 103, 156, 73, 131, 77, 183, 83, 140, 99, 289, 350, 143, 125, 267, 230, 122, 57, 88, 251, 214, 67, 39, 78, 49, 56, 87, 34, 125, 138, 185, 153, 179, 127, 121, 163, 256, 359, 210, 117, 64, 152, 118, 25, 87, 26, 249, 177, 168, 37, 209, 181, 174, 167, 208, 82, 64, 62, 41, 153, 123, 93, 253, 34, 286, 269, 57, 95, 37, 218, 82, 97, 215, 227, 103, 167, 97, 182, 117, 197, 273, 161, 80, 150, 141, 208, 144, 191, 219, 81, 162, 66, 306, 158, 131, 36, 11, 196, 263, 153, 122, 113, 16, 19, 196, 46, 5, 64, 73, 66, 120, 100, 209, 185, 245, 250, 95, 128, 255, 241, 104, 140, 149, 55, 60, 73, 145, 71, 73, 10, 76, 68, 55, 49, 75, 92, 98, 69, 128, 80, 122, 43, 86, 26, 121, 72, 66, 68, 141, 126, 159, 36, 143, 72, 139, 84, 94, 137, 25, 100, 35, 70, 66, 49, 149, 71, 105, 106, 58, 121, 117, 33, 65]
-514F5
##PAGE=	F1=1922.24
##FIRST=	4521.1612903296090735,	4521.1612903296090735,	0.1715170443058013916
##DATA TABLE=	(F2++(Y..Y)), PROFILE
4521A15P9k1m2qn1o9J00M3l2O8r3l7O5J1m3m2N0M1O3p2J14r6P5j94P5O7l8J7M6J3j65M5J31
4359B15N4o4j34N6m3J7Q0j60J31o2pK2R9o7n9l2KQJ30j4m7l1l1Q2LJp7J4mM8L2p8J54j47l
4186H8J33J2Rj12l3O6M3n7j21J13o5rk9K7J32lr1L1o1J41j50Q2r5R4m6m5R5k6j6Q3n8M2k8
4024A46o1Q1q5M7j11P9Rj2N6m9m1J1N9j08M4J57L5j46m7J7qJ75n6j30J68j93O1PM1q2QN1J7
3862A40n4L8N8K02j10j65M6j0o3l0K5Q2L5L6j45N7O0j42J31R8j57n7n3J14J40j73Jm8L2PK1
3709A16N4j15J45l3j33M5j1m0Q2L9o0l9J5M3p9K16j48j4Q6r1n7M2M2nK8J2J3n1Q4n9n1J09
3551A85j2j4nJ01m3j39j7L1kO3q1R5k7Lj3m5K3j8N9l2q7J23k0k2L2o7N4L3o6m2L6J91m2q0
3384A55p9J01k1M0j05R7mj40J57R6k04J43j12n4J5Q8j22K2mN7q6PJ21j30R4q3j4k5J6J44M3
$$ y = [115, 194, 173, 131, 123, 72, 3, 103, 146, 114, 182, 89, 52, 117, 128, 85, 43, 93, 134, 197, 125, 239, 143, 218, 24, 99, 166, 128, 145, 191, 204, 39, 84, 215, 269, 205, 71, 127, 84, 101, 181, 21, 152, 90, 83, 105, 204, 137, 78, 46, 48, 56, 186, 172, 125, 94, 63, 145, 148, 149, 72, 86, 82, 130, 162, 84, 238, 91, 88, 221, 233, 242, 130, 97, 163, 206, 149, 28, 141, 76, 67, 38, 65, 197, 194, 103, 134, 73, 214, 64, 146, 51, 145, 99, 54, 149, 123, 107, 190, 132, 174, 146, 85, 166, 81, 128, 17, 96, 105, 93, 149, 100, 59, 70, 129, 21, 65, 222, 257, 111, 64, 81, 73, 248, 192, 62, 230, 37, 98, 105, 146, 64, 72, 123, 140, 86, 124, 182, 384, 274, 109, 155, 145, 82, 52, 77, 159, 194, 230, 85, 142, 202, 60, 191, 289, 132, 75, 22, 136, 276, 103, 104, 56, 88, 95, 116, 170, 55, 200, 167, 34, 79, 68, 28, 110, 149, 89, 50, 65, 108, 29, 245, 97, 83, 169, 78, 21, 63, 105, 100, 128, 140, 153, 102, 186, 127, 76, 185, 173, 159, 154, 255, 212, 73, 56, 87, 85, 148, 67, 162, 135, 138, 125, 80, 103, 85, 144, 112, 25, 148, 128, 106, 138, 71, 125, 158, 92, 50, 86, 277, 235, 155, 76, 177, 156, 196, 91, 188, 184, 44, 201, 297, 93, 236, 124, 70, 85, 173, 51, 73, 69, 126, 40, 47, 168, 38, 132, 49, 35, 10, 26, 170, 213]
3232B13j94P4k3N4J74j03n1k7l3J33m4j1J1o6l4L4j2M4l1p8J65M3o2o1m3L4J9J1o6m9K3rP8
3069A13P8L6j97O9n3Q2q4L9k9K8p0J19O5j07n1P7o6j5J87k4P5J11L3l48K63k1j20q2n0L5o5
2917B8M4J00r0l6J84J7j02J6j03Jk5Q2N2Rq7L5O6L4ppo2j31M1J18l8O1o9j03J90Lm6R%L4j86
2744C2M7L7P0J4p7o0O2Q2q3R9jp9p8L3J02J21j57l9LJ1mp9M2R9k4n6l2R7q4M8K36j5j59k05
2577CN1j9LJ15K9j26J33no1J97j3l0j08p7KJ00n7j22L5J71j20p2L6j2Q8n4k1J01l4M8r7J26
2419B10m1j9n2J64k5j22m6k8NN9K5K18j26j23o1M7Q0O0j05N2q2j2M4L16j73q8n4l7O2m7J54
2267B55j6j37J9n9qpP2J6lj17Q9j1nJ9n9J36j04L1qpk2J14m4lK8k7k0ML0l9J5N1n8J08j86
2095D7J07M4Kj41J16o0Q4r4R8k0J10k53L43l29K87k51J71K6k9J30K38k27K92J6014K203j5044
$$ y = [213, 19, 93, 70, 124, 298, 195, 144, 117, 84, 217, 173, 162, 173, 107, 73, 107, 95, 139, 108, 30, 195, 238, 176, 115, 72, 106, 125, 136, 70, 21, 44, 35, 113, 191, 227, 30, 99, 46, 128, 44, 83, 54, 82, 12, 131, 196, 89, 38, 115, 49, 34, 221, 197, 272, 383, 416, 68, 331, 310, 190, 108, 58, 93, 28, 72, 172, 82, 46, 230, 247, 145, 161, 58, 59, 34, 116, 168, 177, 90, 125, 191, 225, 218, 211, 149, 18, 59, 177, 139, 200, 131, 28, 218, 221, 175, 184, 184, 218, 32, 79, 116, 186, 200, 123, 63, 125, 207, 124, 223, 222, 143, 65, 98, 200, 321, 164, 125, 128, 139, 135, 56, 98, 197, 173, 117, 85, 182, 98, 146, 382, 367, 208, 3, 54, 35, 38, 153, 182, 56, 189, 184, 123, 320, 307, 277, 169, 92, 94, 194, 137, 15, 50, 221, 101, 29, 65, 53, 141, 87, 66, 167, 133, 181, 84, 210, 169, 150, 98, 262, 237, 115, 69, 41, 46, 105, 130, 348, 222, 99, 38, 85, 165, 225, 120, 172, 90, 78, 122, 438, 265, 177, 123, 86, 148, 101, 255, 239, 102, 121, 62, 54, 47, 119, 135, 132, 15, 104, 93, 88, 107, 48, 184, 80, 111, 103, 96, 74, 188, 144, 141, 169, 142, 122, 126, 156, 117, 132, 183, 125, 233, 47, 154, 198, 200, 59, 175, 115, 199, 105, 203, 183, 293, 40, 383, 54, 341, 90, 261, 287, 258, 388, 626, 399, 691, 16705, 18908, 3864]
1967C864k825k10m37J30j68J59k12k00N46l54j17K27M92o99K0J6j06j0J58j75N8j32P8P4j29
1843D8J35p6k6N9M3M3j27P0j20k8K75l1j78O8m0m0J76j15O5j45k9M8M9r5J49q4M2J42K4j28
1696A74r2O0k0N7n6r8J28n2m5L3k4n7J97j02j4J22j75J46k5p2J9K7M1Pj1o7l0J2J06j71N3
1543G1J45j18O3M9n1po2J24p8k2K4r4M28O55l98n39j9p3K69J6k09K3j07J16r4o1olO6J81o6
1391B23j77N5pK6p1J76L2j34o5J60Qj04j5KL1O5j54N7N8Kk1p7lJ41J1k4K26j54j92N5o9Rn4
1228A6O7OK2R1L5j44RK58j21j12j1j6M0j9J4m4j9L1j0o1K07M5j66j1j2N8R2q5q4K6K6k2nl0
1061G1J14l8J7Q4q3o1L9M3j23K1j1K9p1P2K38q0o3j43Q0O2Pr5K7P7K1j40k6J43o7qR2k10J03
898A21M3M2p8M3j0Q9p8n9K6M2Q7n7K8R7kj67j21J20R8j11J79k01Qm8l1J14q2K6k3J43r7n6
$$ y = [3864, 1039, 829, 392, 522, 354, 513, 301, 101, 647, 293, 176, 403, 895, 196, 216, 232, 126, 116, 274, 99, 157, 25, 103, 177, 48, 183, 107, 81, 140, 183, 226, 99, 169, 49, 21, 296, 265, 87, 155, 115, 75, 251, 136, 201, 56, 27, 75, 124, 29, 178, 94, 136, 278, 302, 174, 82, 142, 122, 179, 123, 25, 153, 101, 56, 89, 65, 8, 205, 103, 89, 211, 36, 182, 157, 85, 104, 131, 172, 179, 168, 101, 71, 83, 189, 18, 71, 216, 98, 161, 210, 159, 152, 90, 214, 136, 114, 138, 44, 472, 1127, 729, 190, 171, 98, 367, 383, 174, 197, 90, 206, 112, 51, 45, 42, 108, 289, 223, 46, 101, 94, 120, 49, 225, 257, 123, 58, 218, 226, 122, 107, 109, 140, 205, 51, 108, 166, 168, 147, 70, 67, 208, 219, 195, 421, 267, 75, 130, 61, 70, 16, 83, 89, 111, 202, 237, 93, 102, 360, 239, 127, 116, 100, 140, 121, 135, 91, 72, 103, 93, 32, 239, 284, 118, 107, 95, 153, 245, 160, 76, 102, 128, 106, 101, 71, 185, 147, 164, 248, 165, 104, 143, 186, 63, 84, 73, 102, 31, 103, 341, 261, 198, 55, 135, 197, 204, 109, 136, 213, 234, 94, 68, 211, 144, 136, 228, 18, 121, 164, 206, 128, 171, 161, 250, 172, 113, 139, 181, 268, 211, 239, 336, 334, 167, 46, 166, 264, 153, 332, 131, 139, 91, 60, 174, 92, 118, 95, 238, 141, 85]
741H5J61K5kj23L6L7q6N8n8k5J2M5o4o5J06q2J98l4j00J09j41R1K3n4q0Q5l1R1j35J8lJ40
583B37m7P5j72J7M0OJ25o4j13O6MN8J57j42j57Q9P5kk8j49J09j3oo0J06J83k03o0MJ69j62
431A42j06K06L9j35k2N5m5o9O6J10n7p3R3J9j4j06L9J5m1n4M5M1n0Q1j43J15q8R5o3J75P6
278C46j95k9J45l4j06p3L5J78o1j61oK8j5KK9o2J04K5J4m2L9o0L7N3N3J30j55j21l2O7j6r4
121B3O4k7K34j00l0j52J95Ok8o1J00j54j7J6J4J36n7n7J65j92K08l9j78P7j16J52j14M4J26
-22B38Nj38M9p2R3n2P0O3j04j06R6o0P6k1N7lj26Q9j00K19j47l0n3l5J75J21j11j12O0r4j6
-175C1K18j61m6L4mmL7LJ20m6N7k0j61J16R6m9j45J00J1j12p5P5N5l6l0qmNN4o8J4J5J1n%
-347G8k5N6m2j5J0M8n1kjQ5j4M8j41R9o7N1m9K2N6j10L5k2L4k2j3R5r2L1kl0R1rn6K0
$$ y = [85, 246, 271, 269, 146, 182, 219, 133, 191, 133, 108, 120, 165, 101, 36, 142, 60, 258, 224, 124, 233, 92, 183, 206, 152, 72, 157, 126, 217, 82, 100, 97, 237, 190, 265, 93, 110, 150, 156, 281, 217, 104, 170, 174, 232, 389, 247, 90, 179, 254, 252, 224, 75, 184, 171, 165, 105, 211, 394, 191, 131, 135, 304, 142, 36, 242, 281, 146, 124, 179, 134, 65, 131, 241, 184, 111, 204, 223, 209, 103, 142, 157, 116, 62, 107, 148, 98, 179, 36, 151, 63, 158, 95, 270, 346, 151, 122, 267, 233, 127, 54, 89, 267, 206, 45, 39, 67, 52, 54, 83, 21, 125, 150, 164, 122, 161, 101, 138, 191, 244, 374, 219, 98, 66, 133, 117, 23, 87, 60, 294, 194, 164, 12, 207, 213, 185, 124, 224, 70, 53, 69, 83, 219, 162, 105, 270, 78, 286, 247, 69, 146, 30, 182, 68, 112, 238, 243, 105, 154, 82, 175, 123, 193, 256, 152, 46, 142, 82, 158, 137, 194, 191, 65, 154, 54, 273, 126, 96, 43, 8, 183, 304, 193, 81, 141, 47, 31, 249, 88, 42, 76, 72, 68, 105, 108, 228, 182, 239, 219, 58, 174, 270, 221, 76, 176, 187, 75, 0, 75, 130, 94, 64, 56, 52, 57, 111, 43, 57, 72, 83, 78, 78, 53, 109, 67, 52, 62, 110, 59, 57, 56, 141, 127, 175, 34, 133, 66, 117, 68, 90, 146, 36, 71, 49, 83, 61, 48, 143, 51, 82, 80, 50, 141, 132, 76, 96]
-514I6
##PAGE=	F1=1917.32
##FIRST=	4521.1612903296090735,	4521.1612903296090735,	0.13415803015232086182
##DATA TABLE=	(F2++(Y..Y)), PROFILE
4521I0Q3j6mk5p6l3R7M2l0L6q2j6O8j0o6j6L9J03j6q9J43q9M5r5RO1n1K7O0j7j25O3Q7O4k6
4349B35j63L2rO6J4q9J4l3K2M8P0q2q6j0M6kO3nnn8j9P6lN5p7j9J2M3Ql8J39j68L9R1K3j7
4172B13j05KN2O7m3j73J40o8kp7J2J80M5j36mk2J11q7N8j00N5m8KO6n6L3M5n0P1n2l1P3r4
4009G7J3n7R1l4M4P9r1l7l4Q9j38O9J36J5j18k8L2o0J85k6j49J83j91P6l4M0q3N4oN6j7l2
3852A04P1K14j08k14O1K5p4o7M1N6J05Nj12K9J5p9P8O9j17k8o0J07J34j69P1j07M2K9m1J03
3704A83j12J20nr4l5k3lP4K9o0L5nnq2K15j07j2O4j05o1L6N2jN0K5l6l6Q7j2r1O6j1L5m4R0
3532B21k1r7l6nOR6q2P0oJ2l4l5JJ4N3l0j07J06k7J1%j4J9N4p8o0P4J68k1j28o3J10J0N0j56
3360G5J33k1j42J24J30k02J26o2n5m9J20j46N6k5Q6q0l7J31j31J04p8m3M9m3J46M7j87M1K3
$$ y = [90, 173, 157, 153, 128, 52, 19, 116, 158, 128, 164, 82, 66, 134, 124, 58, 42, 81, 184, 168, 79, 222, 133, 178, 83, 92, 153, 102, 129, 189, 172, 47, 110, 197, 261, 235, 72, 104, 95, 161, 175, 86, 100, 67, 89, 137, 207, 125, 39, 29, 75, 73, 136, 131, 126, 68, 49, 125, 122, 177, 100, 81, 93, 136, 144, 106, 245, 77, 116, 207, 230, 213, 108, 110, 162, 229, 186, 13, 153, 85, 83, 6, 18, 198, 243, 107, 103, 81, 192, 105, 163, 63, 118, 70, 72, 138, 82, 115, 160, 110, 181, 129, 98, 171, 77, 90, 33, 124, 90, 134, 213, 122, 85, 51, 140, 2, 71, 207, 222, 104, 76, 108, 48, 233, 207, 58, 241, 50, 126, 92, 132, 49, 103, 97, 153, 136, 104, 175, 389, 281, 67, 128, 153, 79, 12, 53, 109, 214, 219, 107, 136, 151, 72, 150, 219, 102, 74, 14, 121, 255, 86, 157, 50, 92, 121, 80, 183, 71, 191, 186, 92, 57, 34, 31, 105, 134, 74, 109, 104, 99, 17, 232, 125, 113, 177, 72, 11, 47, 99, 98, 148, 173, 137, 101, 188, 176, 85, 151, 140, 175, 131, 221, 200, 103, 67, 62, 68, 164, 82, 152, 146, 158, 124, 89, 90, 104, 157, 127, 20, 126, 99, 110, 110, 96, 115, 169, 91, 31, 105, 273, 252, 124, 61, 171, 181, 231, 75, 208, 187, 45, 169, 299, 97, 223, 161, 106, 57, 177, 31, 87, 62, 148, 68, 31, 162, 31, 135, 57, 14, 63, 20, 166, 213, 26, 67, 90]
3217I0L3J90m1p6j09j6J50k5l6K2o7n8N6j4P5r3n7J96M1p9j9o9L0L4k1o9o1J3lL8J03L8j39
3054E7M0l7N3q1L3OJ2o7J13L6p8l3Q0n2m7J77m7L4J10O8k66K11p8j12n7k4N5q8N2R6r3m8K62
2892B87M0j39O9k16rJ1Q7Q2l2j09M6O2O2j1lm2j54L8J06l1N8p4r1J86j3n7L2M2L1k17M8J7
2734A06P2J1j13J2L4P4o9O2J2o4m7N4M9O6j00k9N3lq3n9P3P9l1q4J7N4m8N0K15j1j77j42N7
2572I0q2N8R8N6q5L4j1j0J61l8l7r2n2J5J05l4j64N0J60j42n7J3nP3J1n0Q4j2J3p5J29l7j3
2410A54lJ43j2j75ln7K1M4J1J98p9j15r6P5P6J7o7J6m7j3kM04k26j08l0oj3NR4K7j06Po0R
2242H3j9J7K3M3j14R6k6j1op3J61j17QON5n8P8L7j0j1l8k6K0OkP4l2o0M4p6K9Q3k5q4J16r8
2065I3M0l2K8N5M3j52K19k51J44q5L3l2n4J17J54j11j35N547J586n557j373J86l04J73k51
$$ y = [90, 123, 313, 272, 196, 87, 71, 221, 196, 160, 182, 115, 57, 113, 99, 174, 81, 24, 220, 261, 182, 163, 94, 124, 158, 137, 68, 7, 20, 17, 55, 158, 196, 57, 97, 60, 113, 32, 65, 71, 83, 16, 129, 165, 87, 54, 134, 82, 35, 212, 165, 199, 309, 377, 111, 322, 244, 132, 75, 51, 106, 18, 70, 166, 73, 25, 287, 327, 188, 257, 41, 32, 43, 130, 212, 180, 71, 117, 179, 241, 230, 227, 185, 31, 69, 175, 144, 202, 128, 37, 223, 210, 153, 185, 227, 258, 41, 89, 106, 178, 189, 76, 88, 122, 196, 127, 189, 201, 137, 90, 144, 193, 259, 159, 130, 183, 180, 97, 38, 111, 190, 159, 75, 92, 146, 98, 148, 363, 352, 175, 33, 90, 8, 66, 164, 220, 135, 169, 158, 148, 309, 271, 234, 142, 90, 105, 210, 176, 12, 62, 222, 80, 23, 36, 31, 104, 115, 65, 149, 137, 150, 75, 204, 167, 154, 151, 294, 282, 107, 104, 47, 68, 112, 123, 321, 242, 127, 31, 106, 182, 199, 132, 148, 101, 88, 86, 490, 264, 156, 126, 120, 107, 112, 206, 233, 127, 134, 74, 83, 64, 81, 104, 147, 33, 129, 103, 92, 86, 13, 174, 57, 65, 71, 126, 68, 146, 183, 173, 162, 124, 98, 118, 124, 122, 196, 164, 104, 148, 72, 101, 184, 159, 75, 191, 93, 133, 101, 129, 184, 227, 75, 294, 43, 187, 102, 135, 103, 49, 166, 320, 209, 74, 5621, 7207, 1650, 277, 463, 159, 332, 81]
1942H1K66m2j93M18o7k91N89M73r66j17M6j19qR9o8L6q2ON1q9J19n8M4l6O5J16j43K8q1k6
1794E1K43mk33P0J1p8J64n3O0j62l9K7M0m8J70j06K3J23L2j49l3lNP1q2n8P5l2Mk4J3l2J47
1632A93r7K3N7j43J55l5j16M1mP2j7K3nq8N0O9j08K8J01j20J26K8p2m4j6J06j02M1K5j43M24
1479D52P63l50o29L1j71K96J0k36M6j43J16r1o9M3L0K6J40l3j82K8K1M6j08K15N8j64j16J63
1341A92J4r2MmN7K4j39L9M0J3oo2k4J42qJ8K30j48k25O5n4Kn4O7J7j3P4O3j56O5K60j02j59
1179A40k8j8O0m7J9m3L1JQr5K50N3j90k3m0N7N8o3o2M9jk1j3PO3lQO5n6r4J7J06r9k3K1L4
1002A28j10O2K27m5o5j58J00N2kq4K6R2J3j87K7J14o2K5P5k21J48j5L4n5K2M6O7j62m3N2O8
849A69P5j9mQ7M2j25k03J82M9q4J66k35koo3J37m1J4p5J75q7q0J39N1M6j39N9Rj31J02n3k7
$$ y = [81, 347, 305, 112, 530, 463, 172, 761, 1234, 268, 151, 197, 78, 70, 169, 101, 137, 55, 61, 112, 23, 142, 84, 128, 92, 157, 273, 130, 158, 77, 51, 294, 290, 57, 127, 138, 60, 224, 171, 231, 69, 30, 57, 97, 49, 219, 113, 136, 259, 291, 142, 109, 106, 111, 182, 100, 42, 117, 85, 89, 65, 78, 46, 193, 96, 119, 176, 33, 188, 153, 37, 78, 74, 146, 129, 152, 147, 59, 109, 178, 70, 98, 199, 79, 205, 233, 161, 117, 101, 207, 105, 146, 171, 28, 452, 1215, 865, 236, 267, 96, 392, 402, 166, 212, 69, 185, 94, 25, 68, 98, 124, 264, 231, 49, 77, 98, 144, 36, 251, 309, 145, 29, 192, 206, 114, 118, 114, 171, 195, 56, 95, 135, 148, 142, 80, 56, 198, 190, 208, 438, 290, 65, 130, 76, 78, 24, 91, 108, 95, 169, 232, 76, 141, 401, 299, 140, 112, 94, 154, 107, 126, 83, 114, 115, 123, 28, 278, 331, 141, 118, 78, 135, 193, 130, 68, 117, 116, 95, 82, 89, 152, 149, 157, 222, 166, 72, 89, 195, 96, 73, 94, 128, 18, 80, 307, 262, 197, 39, 139, 191, 189, 105, 131, 223, 236, 49, 76, 190, 128, 153, 228, 7, 155, 140, 174, 119, 141, 187, 254, 92, 49, 101, 169, 244, 225, 221, 308, 350, 225, 22, 204, 253, 169, 335, 100, 98, 92, 29, 166, 125, 139, 64, 239, 152, 72, 211, 262, 308, 169, 228, 237, 106, 208, 155, 128]
692A28k6O2r1k4O9n2J72n0n2J25j57P5Ln3n3L8k1R0j09J9K0J09k4N3j57QK8N1J29j13n1K4
534A70PL5J47j19j65J47J7J3l2j10Q9o6R2j56J21J87j78l5n2K02j85r6J79P8j53L8L4r9p4
391C6R4J06l9n3M5K4K5j32M6Ro8l6M1K9%Q6k05J11q1J39p5J41Q3j93rJ20rj01p5K8J82p0j71
229B8L0L0l6J2J6o3J05L9j0o5O7n5L1R0j8J61j64j19j6M5qn9O1J6J98j29j1j22J49K8m9o7
72A15J22j88J9J9J4J80p5r1J56j28J10n3j19R1j34R5p0N1J29Qj48L0m5O5j1L3N1p1j27J19
-76A47r1N5K1O7l9r1O9r7J78j20j5on6J32J50q2k01J76j30LK20j63m6J1kj8JM1J04n1M8m1
-234A74j34J51P9p6j23J22lr1n1N2lK4n6L5m2JR5j19K2j7K9J2k9k2P8j1l7M4Mo2j7O1K9PN6
-406A82j44Q6m7Nl5M2N9j22N0KJ3k9KN8q5K5RpJ04l7k1K
$$ y = [128, 102, 164, 73, 49, 118, 66, 238, 188, 136, 261, 104, 179, 182, 129, 76, 114, 93, 183, 74, 93, 113, 222, 198, 251, 94, 102, 130, 181, 310, 197, 146, 170, 177, 212, 359, 240, 75, 222, 239, 252, 220, 110, 199, 133, 225, 69, 190, 377, 199, 164, 112, 314, 129, 33, 212, 290, 137, 175, 209, 110, 36, 130, 236, 197, 144, 189, 213, 238, 106, 152, 161, 93, 57, 98, 127, 127, 213, 8, 119, 38, 177, 102, 243, 326, 133, 124, 244, 235, 134, 59, 87, 269, 199, 28, 58, 88, 52, 64, 80, 17, 122, 161, 151, 86, 153, 98, 129, 219, 201, 362, 198, 79, 63, 108, 100, 41, 102, 118, 316, 187, 176, 54, 203, 231, 182, 115, 237, 49, 68, 87, 101, 281, 206, 115, 271, 143, 253, 200, 81, 172, 38, 133, 63, 114, 243, 251, 103, 133, 88, 153, 142, 175, 226, 155, 28, 147, 56, 111, 132, 199, 160, 69, 138, 41, 219, 99, 84, 78, 22, 154, 304, 222, 21, 197, 67, 70, 290, 127, 81, 92, 90, 72, 73, 114, 218, 167, 215, 174, 40, 191, 270, 194, 71, 193, 190, 99, 48, 100, 97, 121, 65, 100, 58, 59, 154, 35, 57, 40, 69, 81, 52, 30, 108, 97, 60, 104, 108, 46, 29, 90, 119, 126, 182, 38, 124, 77, 82, 47, 89, 148, 26, 76, 78, 91, 62, 64, 122, 37, 62, 71, 64, 168, 131, 110, 112]
-514A12
##PAGE=	F1=1912.4
##FIRST=	4521.1612903296090735,	4521.1612903296090735,	0.096799023449420928955
##DATA TABLE=	(F2++(Y..Y)), PROFILE
4521F5Q0k0M2l5r9JR5M1k9No3J4O2l8q6J5N3J23r2j01J72q3J3jj6L0o8L2P4m7q4Q1L8P2j4
4349B32j50J2K8J07o0j8j04mN2O4L2q1l1k7N0j2mML6p6JO2j6J09p9n9J9M7qKJ24j88P9N0L4
4177B27n1j06M5M6R0l1j54Q0o2J5p9M2J46P6j77l4J7Q0k3L2j04J7n0M8L6q6Q4Pm3J01p8%O4
4014A75j02j8KP0m4Q8Q8j27k9n4Q1j09M3J22%q8j1M7j10J93Nj68J98j88Q9p9L5m9O4o6R2K8
3857A78r4P5K19r7k55O8N1m7o4J7rJ84j8q6rk1qL2N0q6qp0R6J23j01R1j06pN7j11J44q4N3
3694A57L5m2j00k3K0N4J8o0J09k6n2q5K13o4j2M4j06n1J5M8mO5M9p2LM9L9j28J4j9O4l7P5
3532A90kn5n5l3K3J19r1M7J3J0o8K5l8L5L4j1j11Q0m2M5l3M0j7P5r1p6J12J35qj68l8J19M2
3369B07N9k08J71l9j43R0J65k01J02k1m1r6J72j48K3m5J15p4n3J05j04P7l9m0R0o8J24K4j46
$$ y = [65, 145, 125, 167, 132, 33, 34, 129, 170, 141, 146, 83, 97, 159, 121, 35, 50, 103, 226, 134, 33, 205, 122, 135, 134, 118, 148, 80, 112, 186, 139, 55, 136, 174, 246, 232, 82, 94, 122, 229, 169, 151, 47, 43, 95, 159, 191, 110, 79, 52, 102, 90, 86, 90, 126, 50, 51, 113, 97, 206, 127, 68, 87, 134, 126, 128, 252, 64, 143, 193, 227, 176, 70, 115, 161, 251, 220, 66, 146, 84, 99, 20, 62, 208, 284, 107, 73, 90, 170, 147, 179, 75, 92, 42, 90, 126, 40, 124, 131, 88, 189, 111, 111, 175, 73, 55, 57, 127, 83, 171, 259, 132, 103, 49, 130, 21, 64, 186, 186, 98, 87, 134, 24, 217, 222, 54, 252, 64, 153, 74, 109, 60, 124, 58, 150, 178, 84, 159, 378, 281, 26, 94, 145, 98, 34, 51, 42, 226, 208, 122, 113, 92, 84, 116, 166, 80, 72, 2, 98, 221, 120, 211, 105, 98, 155, 44, 188, 104, 157, 192, 150, 50, 27, 47, 101, 119, 59, 168, 142, 90, 5, 218, 154, 142, 186, 80, 29, 44, 92, 88, 153, 202, 130, 133, 182, 221, 93, 107, 88, 152, 115, 190, 188, 133, 78, 45, 68, 187, 96, 143, 156, 166, 98, 123, 85, 120, 154, 143, 32, 112, 70, 115, 82, 122, 105, 180, 89, 13, 125, 260, 252, 84, 46, 165, 207, 266, 58, 229, 190, 47, 137, 302, 101, 203, 182, 141, 45, 217, 69, 92, 47, 162, 88, 35, 140, 36, 113, 74, 34, 124, 56, 180, 204, 58]
3227E8k4P1J7J90Lq3j74JJ66j4o9L6o4m7M3j1J10j48k6K19L0r7K4p9M3L1o8n6n6J5J5l0J00
3064A26M0q3J3k1M3n7k3N9j0o6J07Pn0j6Q4l7q8J59o3JR4Q5j67J77j36j03k4J0O7j20N1Q4
2907A43q6n3L40O3k00R9k35l9OJ13J10p8j32N7N8R1j9lm7j37L3Q8k2N5p9p9J81k8o8N4P5K0
2749B81k40N9qO9%r0O2j5O7n5K5K5m8j6P3mJ2m3j9J02j6j61m0J03O1l9j21N8K1nM3J87Jj87
2582A42q1O3o7L5P8P9o7k6j9L6J16p1l5o8k7K8J06j6j67L5J24j22n3M7k5K9L7n5P0J5k1n4
2424F6J24m1%N5J14qk19M8q5L6K9mJ74l6j15p4Q4N1k7k8k0j1j1m4M58k45j31j0K4q9N1K5P8
2262B19o6oo1K5k9j9N1M9q7R1n4j5l1l9J21j13%OJ05n6J3R0K0n9n8KLj5M0J33j14n8j7K5Q
2090A04O4%J5Mj17J4K8m0J22l0MM3r2l1J29j26l0R2j0m3L45J9L115o25k016m88j82J7q3l3
$$ y = [58, 34, 105, 122, 312, 315, 232, 58, 59, 225, 211, 142, 178, 114, 67, 110, 99, 209, 61, 35, 254, 284, 187, 211, 132, 175, 206, 138, 82, 26, 41, 56, 26, 126, 166, 83, 96, 75, 118, 61, 38, 97, 87, 21, 128, 135, 85, 69, 153, 116, 28, 187, 124, 125, 219, 304, 137, 314, 178, 75, 51, 61, 128, 8, 59, 143, 57, 4, 344, 407, 207, 306, 71, 32, 38, 151, 261, 183, 51, 108, 166, 257, 238, 235, 188, 51, 84, 172, 150, 205, 126, 47, 228, 200, 132, 186, 261, 281, 41, 100, 92, 161, 161, 71, 133, 118, 185, 130, 155, 180, 132, 116, 189, 185, 197, 154, 135, 237, 221, 60, 20, 123, 184, 145, 24, 82, 103, 98, 141, 328, 329, 142, 61, 124, 57, 92, 170, 249, 182, 156, 137, 173, 289, 218, 183, 115, 88, 116, 222, 206, 39, 74, 198, 76, 23, 70, 45, 74, 111, 56, 126, 141, 120, 66, 190, 149, 149, 204, 318, 310, 91, 139, 54, 90, 119, 115, 289, 253, 138, 64, 148, 199, 172, 144, 124, 113, 102, 58, 516, 271, 140, 130, 154, 65, 116, 141, 219, 153, 147, 86, 111, 82, 63, 114, 163, 76, 167, 113, 98, 67, 28, 149, 36, 36, 42, 147, 91, 104, 194, 214, 155, 97, 99, 102, 87, 127, 260, 146, 88, 71, 96, 104, 168, 168, 183, 187, 70, 84, 112, 72, 194, 164, 168, 211, 119, 88, 217, 91, 61, 153, 143, 100, 445, 464, 3579, 2954, 938, 450, 268, 285, 202, 169]
1942A69K0J97j99K10J96m24R13M82j228k50P7j33ON3lL9k0n3K8m9P9o5J30j15P1J72j50om1
1799A06k5K07J8k53L7O8j12J52RN4j78n4JO5l5J97j24mR5M8j62K6o6L0Q5j08j7K6qL6l2K9
1642A11k6J04q3N2j6j16J60m4r0L2o7J03m1M9M8j37R6L2m5kN4r0J57Kr8o7M2N5r3R0J4j20
1484F6L38Q25k84o74N9k27K98j7k18N6j90J31p0q5Q2N5k2R1rj70J7M6O3j22K14R1j85j31J38
1341A66rm3J9j4Q3j7j24K1K3K3Qm7n3J36pQ0J82j31k21M7l5kn3O8K8m9N8R1j69J21K53q9k01
1179A43l4k1P9p5K5m1Q1l4K1j12K45Q1j95j8n1M0Pm1m0P2k9k0k0O1K7J6j7M7l0j27nJ70p7
1017A28o7N4N6j33L5K00j5p1j38Q5M8qp4K7J01Kk00M5R0n3N3N4j98J59o9L1l2KJ02M8j72o4
859B6M9O6N8J5ON3Q1q4k29J88J0m5J20k37j5L2r5J58KJj31K03p9l8N1Q0Q8j58R0j0j76J45
$$ y = [169, 189, 386, 187, 397, 593, 169, 1082, 1564, 336, 86, 163, 30, 36, 89, 86, 125, 105, 52, 80, 31, 110, 45, 175, 60, 131, 303, 153, 147, 106, 81, 288, 306, 53, 90, 158, 46, 198, 207, 261, 83, 29, 30, 95, 60, 257, 133, 129, 224, 272, 110, 136, 70, 100, 185, 77, 60, 86, 78, 114, 82, 111, 85, 189, 106, 158, 142, 26, 186, 142, 52, 84, 17, 120, 79, 128, 176, 39, 135, 167, 122, 120, 174, 84, 241, 243, 145, 78, 120, 175, 82, 172, 186, 66, 404, 1229, 945, 271, 330, 103, 401, 384, 166, 222, 32, 163, 93, 8, 90, 145, 123, 214, 205, 35, 52, 98, 161, 39, 253, 344, 159, 28, 166, 157, 114, 133, 119, 202, 185, 61, 82, 105, 128, 136, 89, 36, 172, 165, 245, 427, 296, 75, 122, 87, 85, 32, 100, 128, 79, 137, 228, 59, 180, 433, 344, 143, 109, 88, 167, 92, 117, 76, 157, 123, 144, 32, 277, 358, 163, 145, 94, 134, 141, 100, 60, 132, 103, 83, 63, 124, 151, 167, 150, 197, 167, 40, 35, 205, 128, 61, 115, 171, 38, 73, 273, 258, 187, 49, 134, 182, 174, 100, 127, 228, 230, 30, 75, 165, 112, 165, 219, 21, 180, 111, 142, 110, 112, 214, 262, 90, 26, 75, 141, 199, 214, 220, 273, 354, 270, 41, 229, 239, 194, 314, 77, 62, 94, -1, 157, 159, 160, 29, 232, 153, 115, 166, 246, 334, 176, 266, 256, 80, 225]
702B25m7l1p2P2j03L3K5l0J45o5j2J32j73O0j0m3k5j1j7Q2k0k6L4O7PM1j36RoP2J41j58J3
539A73k0J1J1J32j00j31J81m6K4k8o2O9j18J89k51J35J91j53j0j16K26j91o9J30R7j29P3J3
401B31j53m6Q9J19km8j5K9O2j66M4J3q7rM5jL2J00j91M9o5J45n7R4P8j91J0R4J7q6p0J3J78
239B55p2j72O6L2n2K5l0l0J02M7l3q8J02m1J0J10r4J86j59j04rJ6Qj7N9N9J54j66J5q4R7M1
81B33n5n4J35k31N5K2OK16p6j10J39p2J2o6o5J00j17Mk3O3J32J0j56J0j9L7L0lM4l5j19J04
-76A51q5PN7P4p4n7M9r5J41r3N5j5q6P9J75n7j78K07j67K1K22j65m5j3%l3l4Q0P9o4M0o0o1
$$ y = [225, 178, 147, 75, 147, 44, 77, 102, 72, 217, 152, 140, 272, 99, 159, 149, 106, 81, 70, 53, 135, 115, 89, 123, 190, 197, 238, 102, 111, 105, 177, 318, 160, 173, 153, 164, 175, 307, 207, 76, 257, 211, 235, 207, 145, 214, 96, 285, 34, 169, 360, 207, 197, 81, 307, 116, 47, 177, 274, 145, 218, 231, 78, 32, 121, 240, 238, 190, 175, 204, 266, 100, 144, 157, 70, 61, 106, 105, 137, 237, 46, 95, 30, 175, 118, 212, 290, 99, 109, 203, 220, 134, 64, 77, 255, 183, 11, 77, 109, 57, 82, 52, 22, 124, 171, 138, 50, 152, 111, 121, 231, 137, 323, 164, 60, 51, 67, 75, 58, 117, 176, 330, 164, 179, 95, 192, 233, 178, 124, 259, 28, 83, 105, 111, 327, 251, 141, 280, 208, 220, 154, 89, 189, 72, 76, 53, 116, 248, 258, 102, 112, 93, 130, 160, 157, 201, 166, 47, 151, 66, 73, 130, 204, 130, 73, 122, 27, 168, 75, 130, 115, 29, 108, 283, 226, 48, 255, 88, 109, 331, 166, 121, 108, 108, 75, 41, 121, 200, 136, 176, 116, 55]
$$ [...]
-514A23
##END NTUPLES=	nD NMR SPECTRUM
##END=	
##END=	
