##TITLE=	(1) Jul12-2019.30.fid
F - 01 - 4.0 - C2


(2)  #
##JCAMP-DX=	6.0	$$ MestReNova 14.3.0-30573
##DATA TYPE=	LINK
##BLOCK_ID=	1
##BLOCKS=	2    
##ORIGIN=	Mestrelab Research S.L.
##OWNER=	hrzepa
##$MNOVA/LINK_BLOCK_TYPE=	PAGE
##TITLE=	 #
##JCAMP-DX=	6.0	$$ MestReNova 14.3.0-30573
##DATA TYPE=	LINK
##BLOCK_ID=	2
##BLOCKS=	1    
##ORIGIN=	Mestrelab Research S.L.
##OWNER=	hrzepa
##$MNOVA/LINK_BLOCK_TYPE=	ITEM	$$ Molecule
##$MNOVA/ITEM/POLYGON=	(XY..XY)
5320.79,5835
5938.78,5835
5938.78,6881.61
5320.79,6881.61
5320.79,5835
##$MNOVA/ITEM/Z=	2
##$MNOVA/ITEM/ANGLE=	0
##TITLE=	
##JCAMP-CS=	3.7	$$ MestReNova 14.3.0-30573
##ORIGIN=	Mestrelab Research S.L.
##OWNER=	hrzepa
##BLOCK_ID=	3
##NAMES=	
##ATOMLIST=	
$$ AN	AS	NH
	1	C	 
	2	C	 
	3	C	 
	4	C	 
	5	C	1
	6	C	 
	7	C	 
	8	C	 
	9	C	2
	10	C	2
	11	C	 
	12	C	 
	13	C	 
	14	C	1
	15	O	 
	16	C	3
	17	O	 
	18	C	3
	19	O	 
	20	C	3
	21	O	 
	22	C	3
	23	F	 
	24	F	 
##BONDLIST=	
$$ AN1	AN2	BT
	15	16	S
	17	18	S
	19	20	S
	21	22	S
	1	2	D
	2	3	S
	3	4	D
	4	5	S
	5	6	D
	6	1	S
	3	7	S
	7	8	D
	8	9	S
	9	10	S
	10	4	S
	7	11	S
	11	12	D
	12	13	S
	13	14	D
	14	8	S
	6	15	S
	1	17	S
	13	19	S
	12	21	S
	11	23	S
	2	24	S
##MAXRASTER=	32768
##XY_RASTER=	
$$ AN	X	Y	Z
	1	29633	-25034	0
	2	29633	-23828	0
	3	30678	-23224	0
	4	31723	-23828	0
	5	31723	-25034	0
	6	30678	-25637	0
	7	30678	-22018	0
	8	31723	-21415	0
	9	32768	-22018	0
	10	32768	-23224	0
	11	29633	-21415	0
	12	29633	-20208	0
	13	30678	-19605	0
	14	31723	-20208	0
	15	30678	-26844	0
	16	31723	-27447	0
	17	28588	-25637	0
	18	27544	-25034	0
	19	30678	-18399	0
	20	31723	-17795	0
	21	28588	-19605	0
	22	27544	-20208	0
	23	28588	-22018	0
	24	28588	-23224	0
##STEREOCENTER=	
$$ AN	SD
	4	P
##END=	
##END=	
##TITLE=	Jul12-2019.30.fid
F - 01 - 4.0 - C2

##JCAMP-DX=	6.0	$$ MestReNova 14.3.0-30573
##DATA TYPE=	LINK
##BLOCK_ID=	4
##BLOCKS=	2    
##ORIGIN=	Mestrelab Research S.L.
##OWNER=	hrzepa
##$MNOVA/LINK_BLOCK_TYPE=	ITEM	$$ NMR Spectrum
##$MNOVA/ITEM/POLYGON=	(XY..XY)
5321,5835
8722,5835
8722,8208
5321,8208
5321,5835
##$MNOVA/ITEM/Z=	1
##$MNOVA/ITEM/ANGLE=	0
##TITLE=	Jul12-2019.30.fid
##JCAMP-DX=	6.0	$$ MestReNova 14.3.0-30573
##BLOCK_ID=	5
##DATA TYPE=	MNOVA NMR VIEW DATA
##DATA CLASS=	MNOVA VIEW DATA
##$MNOVA/ITEM/ZOOM/X=	-4.0077130307847514956,	16.00802000001239378
##$MNOVA/ITEM/ZOOM/Y=	-7228.5038031935691833,	79509.7275390625
##END=	
##TITLE=	Jul12-2019.30.fid
##JCAMP-DX=	6.0	$$ MestReNova 14.3.0-30573
##BLOCK_ID=	6
##DATA TYPE=	NMR SPECTRUM
##DATA CLASS=	XYDATA
##NUMDIM=	1
##ORIGIN=	Bruker BioSpin GmbH
##OWNER=	nmr
##.OBSERVE FREQUENCY=	400.32240192000000434
##.OBSERVE NUCLEUS=	^1H
##.SOLVENT NAME=	CDCl3
##.PULSE SEQUENCE=	zg30
##LONGDATE=	2019/07/12 13:51:00.000
##.ACQUISITIONMODE=	SIMULTANEOUS (DQD)
##$ORIGINAL FORMAT=	Bruker XWIN-NMR
##$MNOVA/SCALES_VERSION=	9
##$PARAMETER FILE=	(acqus, ASCII, /Users/hrzepa/Downloads/Polysiphenol%20SI%20NMR%20Original%20Data/6/6c%20-%201H%20-%20400B.19.07.12.030/30/acqus, 0)
$$ ##TITLE= Parameter file, TOPSPIN		Version 3.2
$$ ##JCAMPDX= 5.0
$$ [...]
$$ ##$Sgu3PowerLevels= (0..7)
$$ 0 0 0 0 0 0 0 0
$$ ##$Sgu4PowerLevels= (0..7)
$$ 0 0 0 0 0 0 0 0
$$ ##$Sgu5PowerLevels= (0..7)
$$ 0 0 0 0 0 0 0 0
$$ ##$Sgu6PowerLevels= (0..7)
$$ 0 0 0 0 0 0 0 0
$$ ##$Sgu7PowerLevels= (0..7)
$$ 0 0 0 0 0 0 0 0
$$ ##$Sgu8PowerLevels= (0..7)
$$ 0 0 0 0 0 0 0 0
$$ ##$SguType= 3
$$ ##$ShimPowMaxUA= (0..63)
$$ 130000 130000 130000 130000 130000 130000 130000 130000 130000 130000 130000
$$ 130000 130000 130000 130000 130000 130000 130000 130000 130000 0 0 0 0
$$ 0 0 0 0 0 0 0 0 0 0 0 0 0 0 0 0 0 0 0 0 0 0 0 0 0 0 0 0 0 0 0 0 0 0 0 0
$$ 0 0 0 0
$$ ##$ShimPowMaxUC= (0..63)
$$ 130000 130000 130000 130000 130000 130000 130000 130000 130000 130000 130000
$$ 130000 130000 130000 130000 130000 130000 130000 130000 130000 0 0 0 0
$$ 0 0 0 0 0 0 0 0 0 0 0 0 0 0 0 0 0 0 0 0 0 0 0 0 0 0 0 0 0 0 0 0 0 0 0 0
$$ 0 0 0 0
$$ ##$ShimPowMaxUG= (0..63)
$$ 524287 524287 524287 524287 524287 524287 524287 524287 524287 524287 524287
$$ 524287 524287 524287 524287 524287 524287 524287 524287 524287 0 0 0 0
$$ 0 0 0 0 0 0 0 0 0 0 0 0 0 0 0 0 0 0 0 0 0 0 0 0 0 0 0 0 0 0 0 0 0 0 0 0
$$ 0 0 0 0
$$ ##$ShimPowRcbType= 3
$$ ##$ShimPowRes= (0..63)
$$ 1e-20 1e-20 1e-20 1e-20 1e-20 1e-20 1e-20 1e-20 1e-20 1e-20 1e-20 1e-20
$$ 1e-20 1e-20 1e-20 1e-20 1e-20 1e-20 1e-20 1e-20 0 0 0 0 0 0 0 0 0 0 0 0
$$ 0 0 0 0 0 0 0 0 0 0 0 0 0 0 0 0 0 0 0 0 0 0 0 0 0 0 0 0 0 0 0 0
$$ ##$ShimPowRng0= (0..63)
$$ 1 1 1 1 1 1 1 1 1 1 1 1 1 1 1 1 1 1 1 1 0 0 0 0 0 0 0 0 0 0 0 0 0 0 0 0
$$ 0 0 0 0 0 0 0 0 0 0 0 0 0 0 0 0 0 0 0 0 0 0 0 0 0 0 0 0
$$ ##$ShimPowRng1= (0..63)
$$ 1 1 1 1 1 1 1 1 1 1 1 1 1 1 1 1 1 1 1 1 0 0 0 0 0 0 0 0 0 0 0 0 0 0 0 0
$$ 0 0 0 0 0 0 0 0 0 0 0 0 0 0 0 0 0 0 0 0 0 0 0 0 0 0 0 0
$$ ##$ShimPowRng2= (0..63)
$$ 1 1 1 1 1 1 1 1 1 1 1 1 1 1 1 1 1 1 1 1 0 0 0 0 0 0 0 0 0 0 0 0 0 0 0 0
$$ 0 0 0 0 0 0 0 0 0 0 0 0 0 0 0 0 0 0 0 0 0 0 0 0 0 0 0 0
$$ ##$ShimPowRng3= (0..63)
$$ 1 1 1 1 1 1 1 1 1 1 1 1 1 1 1 1 1 1 1 1 0 0 0 0 0 0 0 0 0 0 0 0 0 0 0 0
$$ 0 0 0 0 0 0 0 0 0 0 0 0 0 0 0 0 0 0 0 0 0 0 0 0 0 0 0 0
$$ ##$ShimSysFunc= (0..63)
$$ 1 2 3 4 5 7 9 11 15 16 8 10 12 14 6 17 13 18 19 20 0 0 0 0 0 0 0 0 0 0
$$ 0 0 0 0 0 0 0 0 0 0 0 0 0 0 0 0 0 0 0 0 0 0 0 0 0 0 0 0 0 0 0 0 0 0
$$ ##$ShimSysMatrix= 0
$$ ##$ShimSysType= 1
$$ ##$TFXNUM= 0
$$ ##$TRIPLO2= 0
$$ ##$VTU= 2
$$ ##$VTUETH= <149.236.99.20>
$$ ##$VTUTY= <no>
$$ ##$WBREFAM= (0..15)
$$ 132.2 106.2 100 100 100 100 100 100 100 100 100 100 100 100 100 100
$$ ##$WBREFLM= (0..15)
$$ 0 0 0 0 0 0 0 0 0 0 0 0 0 0 0 0
$$ ##$WBREFPH= (0..15)
$$ 77.55 -65.76 0 0 0 0 0 0 0 0 0 0 0 0 0 0
$$ ##$WBSGU= (0..15)
$$ 0 0 0 0 0 0 0 0 0 0 0 0 0 0 0 0
$$ ##$XFAC= 2
$$ ##END=
$$ 
##$DECIM=	2496
##$DSPFVS=	20
##XUNITS=	HZ
##YUNITS=	ARBITRARY UNITS
##FIRSTX=	6408.3305663999999524
##LASTX=	-1604.3676804825092859
##DELTAX=	-0.12226593800080123864
##XFACTOR=	1
##YFACTOR=	0.019204892594388636717
##FIRSTY=	12.035586357116699219
##MINY=	-0.36380997300148010254
##MAXY=	72281.390625
##NPOINTS=	65536
##XYDATA=	(X++(Y..Y))
$$ [...]
3689 321 321 321 316 311 307 302 284 267 285 303 317 331 324 317 336 354 323 291 289 286 305 323 318 312 342 372 352 333 314 295 290 285 259 233 238 242 247 252 267 283 256 228 236 243 230
3684 230 216 242 269 295 322 302 281 242 203 194 228 307 385 386 344 299 297 312 284 214 144 150 200 249 255 252 248 242 236 262 287 313 338 330 322 314 306 323 339 334 328 301
3679 301 274 291 307 311 316 342 368 367 366 364 363 368 372 377 381 392 403 370 338 330 322 314 306 321 336 335 291 244 241 279 318 356 352 348 343 350 315 257 243 256 269 242 215 218 221 246
3673 246 271 322 374 428 439 397 355 310 265 254 243 248 296 380 421 418 414 406 399 351 303 290 319 348 334 284 234 254 316 393 399 347 294 288 282 237 192 181 241
3668 241 304 368 347 327 307 287 296 306 315 325 377 428 407 387 366 344 344 344 333 322 353 385 413 440 424 408 427 445 392 338 288 237 288 338 362 386 367
3664 367 348 320 291 263 234 264 293 283 272 284 340 371 331 275 263 320 377 361 303 247 263 296 286 262 238 225 213 200 188 219 250 282 313 329 344
3660 344 359 374 368 362 399 436 436 436 393 350 324 297 270 243 262 280 299 317 339 360 381 402 342 282 265 248 303 359 371 384 381 378 332 286 287 288 288 289 313 336
3655 336 359 383 336 290 315 340 310 280 268 300 314 329 303 278 275 273 314 355 344 334 324 314 343 373 334 294 263 275 287 255 213 171 129 86 91 139
3650 139 184 230 243 256 309 362 365 324 284 287 340 393 430 424 375 326 322 362 390 418 424 431 440 407 354 302 303 304 289 231 187 187 255 323 380 365 324 325 334 344 287
3645 287 230 213 239 243 247 263 322 381 396 404 411 419 383 327 271 284 298 279 260 242 223 219 215 227 282 332 340 331 322 344 367 346 325 352 379 384 389 407 424 397 326
3640 326 297 311 341 370 374 378 382 386 369 352 336 319 341 364 367 328 300 272 263 254 235 216 219 221 269 317 322 327 334 341 375 366 340 357 390 424 393 362 350 381 396 410
3635 410 405 401 389 376 364 352 371 390 390 347 316 285 294 303 303 304 305 306 289 272 254 237 225 213 217 264 337 367 326 285 282 322 344 323 302 324 343 319 289 259
3630 259 228 198 169 183 178 172 204 308 391 402 344 287 268 249 238 228 239 250 223 196 214 233 231 272 359 445 442 396 375 353 323 292 305 317 308 298 286
3626 286 317 346 375 336 296 319 343 348 309 270 230 231 232 245 258 292 327 302 278 294 310 319 285 229 217 243 269 298 327 310 293 275 258 278 299 319 339
3621 339 336 333 330 327 335 344 353 362 358 354 351 347 349 350 352 354 378 402 404 406 401 395 347 298 287 277 266 256 271 286 344 402 390 378 344 310 323 337 307 277 268 260 272 285 296 307
3616 307 340 373 409 445 438 431 390 349 351 353 330 307 356 405 413 421 386 351 363 374 343 312 277 241 249 257 221 185 221 257 272 287 302 317 314 312 353 394 402 409 373
3611 373 338 348 359 391 423 369 316 334 352 372 392 368 345 338 332 325 318 301 284 267 250 251 252 275 298 279 260 284 309 311 314 316 319 318 317 316 315 288 261 278 294 265
3605 265 235 277 320 348 376 332 288 235 182 200 219 265 312 337 362 369 377 364 350 304 258 255 252 259 266 251 237 234 231 229 226 251 277 302 328 270 212 255 297 298
3600 298 299 301 302 271 240 252 264 309 355 379 403 395 386 334 282 253 223 236 249 264 278 293 307 318 328 317 306 362 419 432 445 419 392 387 382 328 274 241
3596 241 208 199 189 201 213 233 253 294 335 346 356 324 291 282 272 335 397 423 450 433 416 386 357 370 383 394 404 393 381 318 255 236 216 219 222 225 228 261
3591 261 294 326 359 330 301 272 243 273 303 290 276 290 304 360 417 418 419 421 422 351 281 257 319 358 312 268 310 378 403 358 270 222 259 313 324 275 227
3587 227 246 309 357 319 265 254 252 251 252 254 254 254 255 255 204 153 203 252 255 258 261 264 278 291 262 233 222 212 202 191 178 165 195 225 263 301 296 291 300 308 317 325 362 398
3581 398 363 328 321 313 306 299 305 311 317 323 340 357 411 466 467 381 277 216 222 228 237 246 264 283 302 320 314 309 346 384 392 401 410 418 410 401 321 241 231 222 255 289 284 280 276 272 307
3576 307 342 377 412 406 400 394 388 375 362 349 337 335 334 333 332 310 288 309 330 321 312 302 293 267 242 259 277 300 323 346 369 406 443 409 375 351 327 347 366 400
3571 400 434 468 502 449 396 386 376 358 339 278 216 194 171 220 268 304 339 375 410 378 345 312 279 313 346 337 327 326 326 368 410 383 355 327 300 301 302
3566 302 303 304 328 353 305 257 266 275 284 293 292 291 289 288 306 323 341 359 321 282 287 292 293 293 294 294 322 350 378 406 417 428 396 364 361 358 355 352 368 385 301 217 229 242 254
3561 254 266 296 327 314 301 300 300 299 298 313 327 341 355 326 296 288 280 287 294 265 236 233 231 249 268 304 339 325 310 328 345 326 308 288 267 268 270 280 290 278 267
3556 267 302 337 351 364 366 368 334 300 316 333 349 366 364 363 326 289 279 269 324 378 371 364 335 306 324 341 309 276 274 272 306 340 353 366 378 391 344 297 286
3551 286 275 262 249 257 265 262 258 275 335 416 412 350 289 259 229 220 211 230 249 246 243 273 303 334 364 309 255 222 189 191 194 233 271 302 333 328 323 324 325 327 328 362 396
3546 396 365 335 310 285 319 354 378 315 227 181 234 287 320 354 393 431 434 436 416 396 355 313 315 316 339 363 312 261 274 288 311 335 358 382 359 335 312
3541 312 289 253 217 181 145 179 214 249 283 298 314 265 215 234 253 273 292 322 352 318 284 279 274 304 335 317 299 280 262 271 280 324 369 353 337 343 348 382
3536 382 416 429 441 425 408 391 375 337 299 298 296 337 378 354 331 347 363 315 267 264 261 258 255 225 195 229 264 269 274 279 283 303 323 307 291 298 305 291 277 288 299
3531 299 310 322 378 435 412 390 368 346 360 373 362 350 317 284 283 282 281 280 294 307 271 234 259 285 310 335 386 437 431 352 316 322 300 278 266 255 286 318
3527 318 362 407 408 409 357 306 297 289 293 298 303 308 316 325 290 256 252 248 245 241 305 370 406 370 326 325 368 410 387 364 341 318 322 326 330 335 363 392 380 368 354 383 431 407
3521 407 373 382 361 341 335 328 321 314 299 285 313 341 322 303 284 265 255 244 277 310 324 338 351 365 370 375 379 384 330 276 294 312 345 378 368 357 386 415 401
3517 401 386 355 324 293 261 266 272 320 368 359 350 341 332 385 438 448 458 406 355 376 397 384 372 360 347 345 343 340 338 348 358 368 378 376 374 371 369 367 365 364 362 324 287 292
3511 292 298 340 382 381 379 372 365 357 350 331 312 364 417 406 395 384 373 377 381 384 388 354 320 286 252 250 248 245 243 236 228 223 219 235 295 371 375 314 253 289 324 343 361 337 312
3506 312 302 292 285 277 302 369 453 465 409 353 335 318 285 253 292 331 346 360 374 388 392 396 400 403 411 420 385 350 346 342 337 333 310 287 264 241 231 221 210 200 212
3501 212 224 236 248 254 259 308 357 333 309 285 261 284 307 331 354 367 379 349 319 288 256 268 280 247 213 222 231 252 272 293 313 347 381 372 363 363 364 408 451
3496 451 453 455 479 502 456 409 405 401 367 333 320 307 273 240 278 316 330 345 359 373 328 282 279 277 264 250 280 353 404 384 334 285 320 356 369 383 335 288
3491 288 262 236 256 276 296 315 332 349 366 383 327 272 316 361 395 428 462 495 487 478 469 461 420 378 337 296 307 318 329 340 324 308 292 277 260 244 249
3487 249 255 254 253 295 338 344 351 358 365 371 377 383 388 330 273 286 300 305 311 316 321 327 332 295 257 259 261 270 236 207 250 333 345 270 196 230 336 402 396 392 388 375 362 327 292 258
3481 258 223 210 197 206 214 266 317 377 438 426 414 385 355 325 296 301 306 332 358 302 245 232 218 199 181 234 286 312 338 343 347 312 278 286 295 291 288 329 369 334
3476 334 299 264 229 272 315 336 358 300 242 227 212 213 213 228 286 341 324 283 285 327 370 394 418 391 364 380 396 382 368 376 384 404 423 421 419 427 435 443 451 437
3471 437 424 411 398 371 345 319 292 280 268 299 330 367 404 398 392 379 366 353 339 333 326 319 312 309 305 259 213 213 213 256 299 326 354 338 322 271 221 272 322 349
3466 349 375 378 380 371 318 266 257 293 329 347 365 313 262 282 346 387 357 327 368 414 416 376 335 321 306 308 352 380 366 335 304 341 378 372 366 374 382 390 398 391 383 376
3461 376 368 358 347 336 325 327 329 331 333 334 335 336 337 315 293 246 243 274 304 295 285 252 219 205 234 261 289 276 264 264 265 243 222 264 306 305 304 329 354 362 327 283 282
3456 282 323 364 358 309 261 255 293 331 353 332 308 284 301 317 295 274 252 230 250 269 289 308 339 370 358 345 325 304 283 262 253 244 257 270 238 206 219
3452 219 275 317 316 314 356 398 398 352 307 317 328 338 348 349 349 350 350 351 352 353 353 377 401 356 311 270 271 291 312 335 358 405 409 352 295 305 314 303 249 238 270 305
3446 305 340 335 329 316 302 331 360 367 374 400 426 438 408 378 390 386 382 381 380 388 396 383 369 365 361 397 433 426 375 325 318 325 332 339 347 352 314 273 275 287 257 247 281 328 331
3441 331 292 296 360 381 357 333 356 380 360 341 361 382 359 336 346 355 343 331 332 332 310 289 284 279 269 302 364 383 357 331 393 455 460 394 355 359 378 396 397
3436 397 397 354 311 297 283 291 299 301 303 305 308 297 287 341 395 423 452 430 408 431 453 454 455 464 473 432 390 359 327 259 192 218 245 272 298 335 372 409 446 382
3431 382 318 290 261 251 240 229 218 276 334 313 292 324 355 365 375 380 384 338 292 326 360 395 429 456 482 444 363 315 338 364 347 320 294 314 335 354
3427 354 373 370 367 368 368 390 412 385 358 331 304 334 364 343 323 308 293 278 263 355 446 500 481 452 422 391 359 370 423 445 396 339 325 318 311 312 312 277 241
3422 241 202 163 161 158 191 225 238 250 269 288 344 399 405 411 367 323 322 322 321 320 269 219 233 247 262 277 270 264 226 188 171 155 198 242 288 291 267 242 236 231 260
3417 260 289 296 304 278 252 262 271 263 255 247 239 232 226 256 285 299 312 323 333 378 380 370 360 346 332 319 305 318 330 321 313 340 368 346 323 334 345 391 438 495 551
3412 551 513 432 382 376 389 359 316 273 278 282 286 290 315 340 380 420 410 399 403 407 337 266 226 257 298 340 347 354 352 307 262 260 295 331 321 312 302 293 289 285 257 273
3407 273 329 385 392 356 297 282 303 325 352 379 370 361 334 308 281 255 251 248 245 242 280 318 279 241 250 301 309 245 206 238 290 342 345 349 352 355 353 350 347 344 347 349 373 397
3402 397 419 440 426 411 403 395 408 421 358 295 267 240 263 287 289 291 291 292 328 364 335 306 278 249 301 353 369 386 410 435 427 418 415 455 492 457 392 369 383
3397 383 396 405 414 424 433 399 365 331 297 326 355 391 356 284 255 276 298 294 291 266 241 277 313 327 342 345 348 373 398 401 403 405 407 353 300 297 293 345 397 428 458
3392 458 463 469 380 292 259 226 243 260 288 317 309 302 274 246 218 191 225 260 258 257 269 281 300 277 269 333 397 389 353 359 397 391 367 344 339 334 301 269 316 362 346
3387 346 330 314 298 317 337 360 297 211 212 281 349 323 298 272 246 233 220 243 267 264 262 259 257 261 264 268 272 290 308 347 387 352 316 331 346 403 460 467 474 428
3382 428 381 385 389 378 366 355 344 319 294 269 244 227 210 243 276 269 261 290 318 293 267 241 215 204 192 245 299 348 397 410 423 379 335 342 348 329 310 291
3377 291 273 285 298 310 323 313 303 315 326 330 333 372 411 404 398 427 456 444 433 457 481 418 356 329 302 287 271 255 240 278 317 356 394 392 390 388 386 350 314
3372 314 340 366 405 401 378 355 382 408 419 386 360 376 433 447 400 352 326 300 286 314 386 415 376 337 343 392 407 421 435 450 458 422 392 362 336 353
3368 353 415 477 447 374 341 352 357 320 285 294 317 339 362 385 419 410 382 354 360 366 350 334 326 317 309 300 283 265 269 273 218 164 157 193 234 275 298 320 276 231 231
3363 231 275 334 349 349 349 322 294 286 320 330 339 330 320 310 300 312 323 298 273 293 357 400 401 379 401 446 448 408 367 315 306 316 325 319 313 313 269 218 210 274 337
3358 337 327 274 261 292 289 242 239 279 297 273 288 347 412 390 377 363 369 374 380 385 352 319 329 339 378 417 384 351 346 342 337 332 330 328 325 323 318 313 330 347 333 319 348
3353 348 377 383 390 396 403 389 375 361 347 317 288 259 230 237 245 275 304 356 407 415 424 400 376 373 371 332 294 250 292 370 449 490 531 525 520 443 366 358 351 343 335 319 304
3348 304 361 417 393 370 324 279 306 333 359 386 388 389 390 391 341 292 313 377 420 377 318 303 333 362 352 342 298 254 232 210 229 248 246 243 283 322 340 357
3343 357 345 332 320 307 309 312 314 316 298 280 261 243 243 244 287 330 294 257 297 337 346 313 286 345 408 384 340 338 339 339 364 389 419 449 429 409 398 388 378 367
3338 367 386 404 423 441 422 403 384 365 373 382 391 400 392 385 399 413 446 480 448 417 387 358 364 371 395 419 393 367 368 369 335 300 270 241 262 283 316 349 331 314
3333 314 335 355 340 325 314 304 315 326 307 287 267 248 227 206 196 272 362 367 308 292 321 350 317 284 290 295 265 235 255 276 247 217 246 275 268 261 273
3329 273 285 238 191 199 293 360 384 367 306 267 228 249 271 292 313 357 401 395 388 388 388 387 387 374 362 371 380 388 397 369 342 326 309 269 271 338 405 434 420 383 346
3324 346 344 385 454 480 453 427 407 387 367 347 372 397 400 403 409 415 455 494 497 457 396 377 411 444 414 341 313 329 353 378 361 344 336 371 429 444 395 346
3319 346 354 406 399 393 400 449 472 495 513 487 424 361 362 405 417 358 284 254 273 293 284 275 242 251 312 373 369 323 278 275 311 346 355 363 336 308 312 316 286 256 220 227
3314 227 261 294 323 352 345 338 315 292 304 317 308 299 290 281 290 300 309 318 342 365 388 412 430 447 429 412 380 348 337 327 346 365 348 331 343 356 368 381 378 376
3309 376 374 371 364 356 349 341 334 326 319 311 342 374 405 437 465 494 480 465 450 434 418 402 442 482 493 432 387 385 398 410 392 374 396 418 412 363 313 307 310 313 318 324 363
3304 363 403 373 343 334 367 419 399 347 339 344 350 329 308 286 265 288 312 335 358 340 323 307 292 297 344 392 396 373 350 324 298 319 341 322 304 317 373 428
3299 428 441 422 403 381 359 339 319 342 365 393 422 405 346 273 243 286 330 375 420 462 504 498 448 399 392 421 449 435 378 353 370 361 351 357 363 368 374 356
3294 356 339 321 303 322 342 361 381 391 401 412 422 397 371 346 321 302 283 307 331 356 382 407 433 443 453 420 388 344 301 300 300 314 328 342 356 353
3290 353 349 346 342 373 404 434 465 443 421 400 378 348 318 331 344 337 329 321 313 300 286 273 260 309 359 365 372 416 460 432 405 376 347 318 289 286 283 280 277 289 300
3285 300 312 323 320 316 356 395 375 355 335 315 313 311 270 230 226 295 347 356 378 400 376 352 321 291 261 230 257 283 309 335 334 332 360 344 295 318 393 426 405
3280 405 384 404 423 423 423 422 422 416 410 404 398 419 440 389 339 304 270 279 288 327 367 364 360 369 377 407 437 455 474 450 425 375 326 319 312 345 377 338 298 318 337 363 346
3275 346 304 334 389 400 359 319 298 276 281 286 334 382 383 384 345 305 325 388 427 394 344 338 346 354 347 339 375 411 449 486 452 418 406 395 427 458 442 426 388
3270 388 350 328 307 314 279 236 265 348 387 372 357 340 322 292 262 276 289 304 320 336 352 342 331 321 311 341 371 401 431 393 355 360 365 354 344 354
3266 354 365 311 258 276 294 296 298 322 346 342 339 357 375 380 385 434 482 427 372 359 347 337 328 361 395 395 396 397 397 354 310 266 222 247 273 319 366 348 331 356
3261 356 382 403 424 374 324 299 274 292 310 320 330 361 393 350 306 306 305 321 337 353 369 394 419 443 468 376 284 253 293 344 396 431 465 444 422 422
3256 422 422 400 377 376 374 373 372 328 283 276 269 262 255 259 263 310 356 324 291 330 370 370 370 392 413 404 395 386 377 380 383 386 390 383 375 347 318 314 309 372 435 472 437 400 362 335 308
3251 308 280 253 297 341 363 385 332 279 268 258 265 273 302 331 349 368 386 404 386 367 370 373 405 436 424 413 412 410 452 494 503 512 545 536 502 469 477 484 440 397
3246 397 425 453 451 450 518 585 611 594 601 608 614 620 626 632 600 568 609 694 708 679 678 676 663 651 655 701 721 698 658 619 619 619 620 620 594 567 583 600 584 568 552 536
3241 536 583 631 703 732 672 613 596 621 629 594 561 572 608 644 679 715 713 667 643 618 620 578 536 537 606 675 743 812 819 783 788 836 880 881 907 932 945 915
3236 915 909 903 902 901 876 894 911 928 944 961 883 763 669 647 656 666 678 689 696 660 624 631 644 658 645 676 708 667 598 529 522 514 506 498 457 416 423 473 489 506
3231 506 525 545 553 560 568 576 575 574 573 573 569 566 563 559 581 602 581 559 557 556 597 638 659 680 673 708 756 733 651 570 574 579 583 587 585 583 581 579 587 594 601 609 534 458 426 394 429 464
3225 464 456 448 403 358 385 412 400 388 377 365 357 349 384 419 436 454 443 474 489 432 375 390 436 438 402 410 455 500 475 451 416 381 346 311 351 391 389 386 406
3220 406 427 447 467 455 444 475 506 510 514 518 522 513 503 422 341 303 265 270 276 321 367 369 372 392 413 433 454 430 407 383 359 346 333 319 306 341 376 411 446
3216 446 453 459 466 473 479 485 426 368 335 303 305 351 387 337 275 257 273 246 197 234 333 432 428 425 428 431 412 393 383 373 341 309 340 371 401 432 436 439 421 404 394
3211 394 385 376 366 387 408 378 349 389 429 433 437 408 379 299 220 234 247 297 347 378 409 390 371 379 387 395 403 427 450 424 397 443 490 471 453 449 445 442 438 407 375
3206 375 366 356 334 311 325 339 332 326 319 312 333 353 352 351 376 401 426 451 431 412 370 329 337 344 349 353 335 274 236 284 339 351 315 323 386 406 388 370 414 458 438
3201 438 417 415 413 375 337 321 306 290 274 300 326 330 334 322 310 319 328 340 352 328 304 356 409 421 390 353 315 287 302 321 341 327 313 367 422 424 383 386 432
3196 432 454 432 429 425 419 413 400 388 376 363 366 369 351 332 348 363 342 322 357 392 405 418 423 428 451 475 482 446 384 322 331 340 349 358 409 459 483 464 438 413 421 429
3191 429 465 502 484 422 383 343 322 302 338 374 408 441 489 495 419 344 318 336 332 329 353 421 457 422 387 396 412 428 442 455 457 416 357 298 262 269 317 366
3186 366 365 320 301 324 348 328 309 332 379 425 424 423 401 379 389 399 409 419 411 402 372 342 374 406 395 383 390 396 403 409 411 414 440 424 407 390 370 351 363 376
3181 376 368 359 417 475 476 405 330 299 285 271 285 342 396 451 466 482 426 327 257 259 289 320 355 389 408 384 360 379 392 406 396 386 376 366 398 431 423
3177 423 415 408 444 440 392 341 332 340 348 344 340 358 376 375 374 373 373 372 371 371 370 378 387 395 403 379 356 332 308 326 345 363 382 420 458 477 453 423 393 384 375 398 463 507 508 456
3171 456 403 390 378 390 403 416 428 406 383 361 339 346 352 359 366 364 361 380 399 379 358 378 398 389 337 304 314 362 367 326 286 311 336 319 258 217 249 286 279
3166 279 290 343 410 477 497 474 432 389 362 335 329 323 389 454 462 399 344 333 339 345 355 408 439 397 332 339 368 353 325 296 267 239 205 214 270 327 354 381
3162 381 367 354 344 378 409 368 313 301 332 363 347 331 358 385 381 378 375 371 361 351 362 374 339 304 312 320 350 380 410 440 443 446 448 451 445 438 432 426 393 360 327 295
3157 295 310 326 342 357 369 381 392 404 421 438 441 400 374 420 466 440 357 317 348 380 401 422 427 388 343 340 353 367 354 341 364 387 371 356 340 325
3152 325 351 378 383 388 406 423 444 378 285 279 310 298 252 250 300 350 332 314 360 407 406 405 368 331 329 326 344 363 368 372 376 381 371 362 353 344 314 285 291 298 295 292 289 286 275
3147 275 265 276 287 291 296 337 377 369 362 362 319 261 290 360 431 422 414 406 397 422 446 471 495 452 409 388 366 311 256 265 275 293 310 328 346 343 340 373 405 362 319
3142 319 326 333 353 373 357 299 228 244 331 417 429 440 452 464 442 421 422 422 379 335 327 320 336 352 368 384 375 366 379 392 359 327 331 334 349 365 380 395 388 380 373
3137 373 366 365 363 398 432 421 410 398 387 361 336 389 443 402 362 372 382 373 364 391 418 393 369 366 364 385 406 448 490 437 383 366 348 368 389 430 472 452
3132 452 432 412 392 402 413 423 434 380 327 352 378 345 312 279 246 268 290 311 333 325 316 276 236 206 247 339 358 286 214 245 276 257 239 314 389 397
3128 397 406 431 456 439 349 307 337 392 403 422 441 445 449 454 458 435 413 391 368 363 357 388 461 504 475 410 345 346 346 397 448 455 462 433 404 402 401 399 397 345 292 304
3122 304 316 315 313 333 353 316 278 340 445 465 400 356 398 425 409 396 426 457 446 416 428 451 473 455 436 376 315 297 279 307 335 362 390 362 334
3118 334 349 364 358 352 346 340 306 272 307 343 353 320 330 425 486 461 422 426 428 431 436 442 437 432 440 492 486 394 324 339 366 349 317 327 386 445 464 483 478 473 485 496
3113 496 494 405 317 314 357 400 406 411 401 392 383 373 423 473 480 486 460 434 408 382 367 352 330 393 455 474 450 427 399 371 343 315 304 292 281 270 262 255 291 326
3108 326 323 320 336 351 358 321 260 285 336 387 400 413 414 414 432 450 471 419 363 349 348 347 343 382 426 427 384 340 324 308 308 351 415 436 440 445 456 467 434 402 379
3103 379 355 374 394 410 425 414 446 475 460 430 399 376 353 346 383 426 426 429 431 439 404 366 371 410 406 402 441 481 478 455 476 500 524 507 490 472 453 429 449
3098 449 494 496 481 467 468 470 425 423 481 538 577 572 530 445 409 444 523 529 480 431 436 441 446 451 466 482 454 426 410 394 354 357 377 398 379 360 389 419 426 434 423
3093 423 412 376 384 380 377 376 376 395 415 410 405 438 427 374 363 405 448 450 452 469 485 430 332 267 274 328 383 401 376 349 365 381 355 306 256 269 282 273 264 267 269 293
3088 293 317 325 333 350 409 465 478 467 499 514 456 363 341 390 396 366 335 342 349 307 308 358 365 334 304 351 398 367 335 334 333 350 368 416 421 357 293 317 341 330
3083 330 318 338 359 358 357 396 436 425 414 417 420 401 382 413 445 440 436 405 374 319 307 359 411 416 420 403 386 345 347 404 461 456 451 427 403 357 312 342 371 377 383
3078 383 394 362 294 269 303 336 308 280 316 353 353 354 369 384 363 342 361 381 378 376 381 387 356 325 330 335 283 274 360 490 545 528 493 459 420 381 391 402 333
3074 333 264 289 314 274 235 245 255 215 175 217 260 281 302 332 361 358 354 396 480 516 480 448 415 413 412 452 492 453 414 422 430 402 375 404 434 399 365 400
3069 400 436 421 407 447 487 477 467 487 507 476 446 438 431 423 416 407 399 354 310 327 344 315 287 303 391 429 395 391 386 370 311 293 346 365 312 279 319 362 361
3064 361 370 421 470 476 455 435 375 316 345 375 382 390 384 378 394 410 460 509 523 537 558 579 549 520 507 494 460 425 410 395 380 365 354 342 299 256 256 328
3059 328 379 357 364 370 372 374 369 364 360 355 346 337 329 320 316 311 306 302 330 358 365 371 386 401 380 315 292 340 373 364 385 477 552 526 446 438 461 485 506 526 510 495 472 450 463
3054 463 476 464 451 419 343 285 327 414 457 466 475 502 530 482 434 386 338 372 406 440 474 463 451 440 428 400 373 350 326 326 398 469 469 454 440 421 401
3049 401 399 396 394 391 419 447 475 503 487 470 453 437 445 454 469 442 404 438 503 525 520 514 485 412 384 428 472 444 398 395 416 437 460 527 577 555 515 519 539 516
3045 516 470 425 427 429 465 502 502 503 493 484 477 470 450 472 494 443 368 365 398 431 457 526 564 530 462 436 449 462 459 500 559 546 514 525 555 543 495 490 523 556
3040 556 559 561 586 610 614 619 644 670 637 604 576 547 502 527 606 685 719 752 779 734 661 631 665 700 705 711 680 650 629 609 610 610 568 526 563 600 597 594 590 587 592
3035 592 596 595 551 498 546 613 609 540 515 542 569 558 590 641 621 576 575 622 625 595 607 667 684 656 628 633 638 624 610 661 669 650 703 833 891 845 800 829
3030 829 858 803 748 772 795 728 661 647 633 614 638 682 653 558 506 533 560 506 451 473 538 540 541 545 549 529 510 512 514 472 430 459 489 486 483 524 564 564 564 567
3025 567 569 527 527 573 577 496 459 553 646 673 699 725 752 725 698 715 731 668 605 642 679 617 554 567 624 655 686 722 715 631 548 567 628 633 637 693 749 768
3020 768 887 1258 1729 1955 1821 1488 1198 1033 940 855 770 674 621 590 559 521 526 549 573 525 476 500 523 475 427 421 416 411 405 443 481 477 472 493
3016 493 513 486 503 591 636 578 519 556 593 531 427 407 458 480 501 570 638 662 687 784 925 977 986 1022 1058 1074 1090 1232 1417 1523 1499 1421 1343
3012 1343 1227 1112 1099 1128 1119 1067 1019 971 849 705 632 630 577 480 459 481 459 415 403 434 414 352 372 464 505 474 474 494 462 386 365 415 434 410
3008 410 430 494 488 439 460 523 510 425 384 414 443 429 430 452 431 368 357 417 451 413 395 419 421 401 440 521 536 480 425 442 478 493 498 546 572 556 539
3004 539 566 547 485 477 541 575 536 516 538 528 474 474 546 589 560 549 582 575 524 516 550 568 515 483 523 546 526 532 611 643 604 561 561 583 563 583 646 674
2999 674 630 585 611 623 564 547 602 654 634 614 665 698 658 593 572 588 561 542 594 640 686 712 738 715 650 634 704 760 730 695 702 674 646 660 761
2995 761 831 814 774 778 771 721 694 753 786 732 678 710 722 648 612 663 749 792 815 837 822 807 811 815 814 771 736 787 796 761 765 812 820 784 783 867 894 777 692
2990 692 693 715 651 587 609 661 628 594 646 700 668 636 690 732 686 644 688 746 761 799 922 984 903 854 948 1060 1028 925 908 931 868 783 784 834
2986 834 798 699 687 711 692 649 692 775 771 713 697 691 598 503 494 560 540 482 467 523 536 524 511 514 474 454 521 569 532 473 500 554 523 470 503 603
2981 603 618 592 610 637 578 516 540 604 583 525 553 660 680 620 602 629 613 570 614 708 717 646 662 711 673 559 531 569 564 497 473 509 502 435 454
2977 454 506 514 471 472 537 515 452 433 454 432 382 419 479 453 376 386 483 493 439 472 553 549 490 473 516 472 390 394 470 459 384 395 518 555 457 401
2973 401 474 547 526 506 556 562 489 502 586 585 493 487 575 621 573 568 646 638 519 487 541 510 376 328 416 504 489 475 527 579 481 382 433 485 457 429
2968 429 456 482 401 320 339 357 300 330 480 544 426 307 374 441 429 417 467 517 487 458 525 591 492 393 385 377 326 275 333 391 377 363 438 514
2964 514 460 406 501 596 561 527 589 651 531 412 426 526 530 492 538 583 497 412 408 405 358 312 395 479 404 330 417 504 462 419 465 510 513 515 553 591
2960 591 500 409 465 521 448 374 418 461 404 347 427 507 431 356 420 527 503 392 391 433 402 371 465 559 581 604 711 818 681 502 503 589 551
2956 551 469 513 599 557 471 514 600 554 423 415 494 447 400 501 601 543 485 571 656 584 469 517 650 600 464 474 571 539 420 425 517 507
2952 507 412 493 660 666 586 603 662 588 427 456 571 557 457 455 540 495 365 406 534 507 394 425 599 615 488 503 603 582 417 417 619
2948 619 691 562 475 532 511 403 397 535 569 516 512 593 573 468 526 670 631 506 551 741 751 560 518 620 646 529 555 725 769 613
2944 613 587 705 719 589 652 858 913 768 705 842 844 702 676 793 792 590 521 710 795 680 635 791 847 702 663 825 861 696 636
2941 636 835 934 774 709 845 913 723 636 809 984 959 936 1056 1136 1016 964 1113 1162 1010 963 1118 1208 1039 993 1204 1322 1125
2937 1125 969 1129 1297 1206 1162 1377 1552 1526 1509 1636 1647 1401 1241 1397 1520 1385 1291 1455 1576 1439 1335 1489 1547 1346 1187
2934 1187 1344 1451 1299 1207 1431 1587 1427 1343 1576 1740 1531 1322 1428 1602 1460 1346 1547 1706 1549 1385 1537 1711 1569 1428
2931 1428 1602 1773 1570 1390 1640 1895 1718 1474 1661 1884 1733 1479 1598 1786 1657 1486 1688 1896 1732 1535 1769 2010 1820
2929 1820 1590 1849 2180 2022 1743 1895 2147 1968 1675 1869 2168 1979 1665 1839 2174 2022 1718 1960 2360 2215 1911 2095 2441
2926 2441 2241 1885 2074 2454 2288 1887 2089 2538 2385 1989 2196 2623 2446 1973 2161 2651 2537 2127 2378 2912 2728 2239 2467
2923 2467 3055 2924 2367 2527 3057 2812 2226 2473 3197 3088 2454 2652 3335 3128 2433 2685 3455 3219 2390 2623 3541 3397 2562
2920 2562 2904 3997 3854 2906 3250 4495 4333 3145 3478 4953 4849 3643 4361 6471 6543 5145 6131 8983 9279 7760
2918 7760 9715 14537 16115 15764 22046 34910 45966 62506 110432 193813 266771 273046 210779 134132 89561
2916 89561 74127 61939 45576 34583 30630 25788 18419 14352 14295 12887 9090 7273 8167 7884 5641 4804 5967
2914 5967 5953 4108 3269 4181 4317 3069 2653 3594 3702 2521 2058 2872 3026 2031 1639 2349 2513 1640 1255 1885 2026 1238
2911 1238 938 1587 1806 1159 886 1450 1640 962 657 1181 1447 930 672 1136 1342 819 555 1018 1279 841 603 1010 1216
2908 1216 776 536 930 1124 707 433 765 953 610 411 751 948 589 374 689 919 621 409 743 992 681 414 648
2906 648 882 642 402 603 760 529 385 704 937 720 547 796 959 671 382 538 693 468 328 593 815 593 371
2903 371 560 750 581 412 639 867 678 489 615 741 566 391 605 819 674 530 686 843 641 439 611 784 598
2900 598 412 554 695 538 380 543 749 626 417 510 689 566 357 459 647 588 444 557 714 594 387 506 711 647
2897 647 440 495 637 588 453 562 757 626 409 434 602 552 415 448 568 476 341 460 666 601 450 517 669 553 350 412
2894 412 618 583 404 440 618 582 402 418 579 553 383 432 625 603 437 401 509 480 365 434 588 588 445 480 601 593 442 460 565
2890 565 541 374 370 453 403 266 336 493 498 360 385 555 562 427 450 560 516 328 347 510 548 384 362 484 555 483 530 663 642 478
2887 478 433 532 531 386 390 538 557 432 393 498 495 406 425 531 543 412 397 526 555 440 444 592 614 435 380 469 478 402 422 586 596 462
2883 462 423 528 590 508 484 605 624 500 447 536 554 429 378 471 492 370 356 486 548 409 339 412 483 409 383 501 522 399 338 478
2879 478 542 463 408 495 540 442 396 494 552 467 387 508 630 550 456 505 550 452 361 413 465 373 345 460 532 460 396 474 575 532 451 513 576
2875 576 495 393 435 463 404 377 435 462 344 250 357 474 448 397 489 578 524 445 452 503 467 399 475 561 562 531 587 678 626 531 580 643 620 527
2871 527 519 548 490 454 504 608 568 472 462 513 478 440 488 570 565 530 538 548 473 437 486 558 543 529 601 683 622 545 554 562 485 429 516 639 619 526
2866 526 520 590 573 504 521 574 541 504 552 622 606 531 542 556 485 400 458 534 524 473 508 575 498 395 378 465 466 424 469 549 543 472 487 567 560 524
2862 524 575 657 597 473 435 528 535 467 443 481 476 465 498 557 530 469 494 554 529 432 421 508 552 502 539 641 656 604 595 633 629 556 527 550 530 450
2858 450 456 504 510 455 485 540 509 420 417 521 582 584 586 638 604 519 505 552 555 497 481 530 536 472 452 497 498 430 405 460 471 435 442 502 489 410 374 432 446
2853 446 400 425 530 562 497 475 517 560 530 499 546 550 481 455 472 488 452 488 564 568 477 458 531 532 451 413 494 531 435 339 365 391 368 389 502
2849 502 572 504 435 457 479 406 333 397 460 415 369 404 483 511 496 508 520 479 439 477 515 508 500 496 491 459 470 532 550 482 414 451 488 479 469 510 551
2844 551 518 485 500 473 372 315 367 420 425 430 500 570 549 527 582 637 606 532 546 561 525 489 529 569 534 457 444 474 471 467 515 562 514 443 425 450
2840 450 454 458 515 572 532 491 502 512 486 460 539 618 619 577 580 583 539 495 516 536 525 513 562 568 487 407 431 456 418 381 450 542 539 493 569 687 730 731
2835 731 782 855 861 867 952 1108 1186 1192 1241 1332 1384 1436 1523 1609 1594 1507 1469 1453 1386 1298 1274 1270 1186 1058 1006 998 941 813 737 704 635 522 487 523 519 471
2831 471 473 519 519 447 397 419 431 401 421 483 512 468 408 390 377 364 403 442 446 429 462 537 556 532 530 571 578 543 521 520 490 439 424 453 452 409 415 465 476
2826 476 445 413 425 413 358 353 391 390 346 353 432 454 476 503 529 498 467 471 476 466 456 496 536 548 560 567 574 565 471 421 457 484 424 394 407 418 429 488 590
2821 590 618 503 420 423 464 462 463 506 547 545 565 584 596 522 472 465 421 377 386 395 380 366 343 363 370 291 248 291 365 395 434 473 479 485 491 497 493 489 486 482 461 440
2816 440 437 434 426 374 346 404 462 476 512 591 635 594 574 597 620 558 498 525 555 586 600 614 580 546 533 521 518 515 512 510 484 458 483 507 532 556 602 733
2811 733 857 1067 1424 1868 1995 1692 1214 937 828 719 571 510 535 517 480 487 518 507 469 518 582 574 518 463 459 455 424 436 500 521 491
2807 491 460 449 437 447 501 541 509 457 449 478 464 451 480 490 456 423 432 454 432 371 381 421 389 325 333 405 477 527 577 603 557 507 529 590 579 510
2803 510 484 498 512 491 469 487 461 431 444 506 495 450 449 501 510 454 441 464 445 363 325 405 485 527 527 489 452 421 433 461 445 430 458 520 539 521
2799 521 502 521 540 521 501 507 470 414 430 477 481 439 440 519 598 587 575 545 515 439 406 423 440 399 402 463 524 534 545 554 519 449 421 439 456 412 368
2794 368 414 461 486 512 538 565 556 546 539 532 523 513 522 488 434 451 544 565 509 454 502 549 518 487 461 436 474 513 569 624 586 549 529 510 491 472 488
2790 488 504 518 531 531 489 427 437 532 583 556 528 547 566 549 532 563 594 545 497 517 538 537 536 576 616 548 481 518 556 543 530 588 645 639 632 617 603
2785 603 588 574 583 591 536 480 502 523 545 567 582 597 576 555 600 645 640 634 651 667 684 701 720 739 694 649 685 720 705 691 652 613 575 536 567 598 564
2781 564 530 515 500 463 426 479 533 536 540 573 606 560 514 477 440 453 466 497 527 493 458 520 583 580 578 600 622 602 581 590 599 586 573 607 641 632 623 604 585
2776 585 565 546 522 498 431 364 360 355 394 433 432 432 432 431 482 532 540 548 568 587 564 541 582 623 563 504 493 483 451 419 453 487 521 555 567 578 547 515 494
2771 494 474 453 432 482 531 509 487 491 496 430 320 286 339 407 432 492 552 566 581 547 513 457 402 482 561 543 525 542 603 621 553 507 548 586 537
2767 537 495 495 471 447 442 524 607 605 568 574 578 538 514 533 525 516 530 544 558 572 563 554 548 543 580 661 670 594 522 536 539 543 568 593 618 643 623 603 564 525 559 636
2762 636 660 613 585 600 573 504 441 479 558 637 671 705 667 587 530 546 562 577 599 622 630 594 585 647 688 656 616 619 642 622 592 604 634 663 661 660 661 662
2757 662 659 698 733 695 633 571 547 523 551 578 605 632 591 551 511 471 481 490 500 510 492 475 479 483 507 531 541 507 494 553 609 593 550 506 504 501 542 625
2752 625 681 666 643 621 615 609 607 604 601 598 583 569 576 583 605 627 635 599 599 670 739 735 722 709 692 674 698 721 745 768 743 718 736 755 750 745 783 821 844 867 911
2747 911 956 981 1006 1014 1022 1074 1198 1355 1468 1579 1775 2029 2282 2486 2690 2894 3098 3275 3453 3641 3742 3780 3775 3720 3622 3492 3363 3177
2744 3177 2905 2575 2330 2153 1977 1794 1612 1434 1257 1139 1107 1080 968 827 772 798 780 711 686 712 738 707 676 695 713 680 646 649 651
2740 651 621 591 561 531 517 504 540 577 590 602 636 670 629 589 526 464 469 474 530 585 602 618 599 580 505 429 433 437 453 469 507 545 502 459 495 531 557
2736 557 583 609 635 580 525 564 603 623 643 627 612 604 596 610 624 612 600 588 576 597 618 654 604 539 517 559 601 609 616 602 588 556 525 572 619 643 666
2731 666 689 712 619 526 498 470 450 431 462 494 511 529 528 526 535 586 635 612 536 503 546 590 569 504 462 462 477 491 544 597 612 626 640 655 609 563 568
2727 568 572 564 555 547 538 550 562 574 587 563 539 594 648 658 667 724 780 791 759 752 744 717 690 711 731 706 638 618 640 673 663 657 652 640 628 652 676 658 640 655
2722 655 671 662 611 559 551 578 605 599 593 635 677 721 723 705 687 687 688 670 653 685 718 714 709 704 700 711 722 712 702 732 762 768 731 668 648 636 625 614 603 627 652
2717 652 639 627 665 703 715 727 738 750 748 746 744 742 695 648 638 627 647 667 730 793 803 813 845 876 806 736 737 739 733 728 744 759 707 655 646 637 653 669 684 700
2712 700 687 673 700 727 661 553 528 576 628 681 695 708 693 677 728 780 775 699 622 618 681 745 770 795 781 767 754 740 728 717 748 780 804 828 831 834
2708 834 828 821 858 894 904 915 925 935 997 1059 1100 1140 1118 1096 1117 1138 1127 1116 1105 1095 1019 943 966 988 956 881 857 905 910 844 803 835 859 882 906 930
2703 930 951 901 866 875 874 872 852 831 869 907 902 897 898 899 922 944 903 862 893 923 895 867 911 997 1011 954 913 914 940 923 906 932 953 931 912 936 924 911 928
2698 928 1016 1097 1107 1089 1072 1036 999 992 1056 1127 1155 1184 1257 1319 1337 1337 1379 1456 1533 1541 1548 1541 1534 1596 1658 1700 1698 1721 1815 1910 1963 1974 2028 2082 2093 2104 2158 2240
2694 2240 2278 2272 2265 2281 2298 2336 2373 2397 2421 2421 2464 2520 2576 2635 2694 2720 2746 2772 2798 2793 2789 2813 2909 3033 3113 3151 3233 3321 3365 3393 3422 3448 3475 3529 3654 3768
2689 3768 3810 3826 3841 3873 3905 3965 4097 4255 4371 4443 4515 4657 4798 4937 5075 5206 5293 5381 5512 5676 5840 6024 6208 6411 6542 6617 6736
2686 6736 6876 7017 7084 7108 7120 7132 7138 7145 7186 7184 7163 7143 7135 7128 7117 7150 7228 7305 7342 7379 7425 7472 7521 7570 7695 7864 8006 8063 8074 8085 8141 8197 8248 8298
2682 8298 8367 8436 8522 8564 8583 8687 8840 8992 9069 9145 9196 9205 9211 9303 9421 9539 9626 9714 9790 9866 9892 9918 10029 10139 10214 10288 10403 10517 10581 10645 10712
2678 10712 10778 10845 10912 10992 11073 11154 11234 11338 11442 11582 11722 11862 12003 12122 12242 12347 12453 12543 12720 12905 13048 13131 13257 13472 13688 13842
2675 13842 13996 14160 14323 14436 14550 14710 14871 15032 15193 15387 15581 15775 15970 16178 16386 16594 16802 17077 17352 17591 17831 18190 18550
2672 18550 18894 19238 19625 20099 20627 21198 21829 22546 23348 24236 25232 26228 27230 28231 29315 30398 31446 32494 33513 34533
2670 34533 35516 36542 37695 38991 40460 42188 44263 46826 49989 53927 58905 65174 73037 82996 95677 111775 131979
2668 131979 156921 187176 222915 263831 309025 357064 406224 454844 501599 545190 583986 615743 637765 647853
2666 647853 645105 630236 605230 572442 533826 490808 444603 396595 348545 302286 259445 221047 187559 158917
2664 158917 134841 114858 98407 84961 74012 65090 57805 51844 47002 42991 39640 36774 34338 32277 30474 28867
2662 28867 27403 26060 24718 23363 22008 20711 19413 18085 16757 15459 14247 13095 12028 11086 10231 9469 8792 8197
2660 8197 7688 7207 6770 6368 6008 5692 5376 5096 4816 4587 4357 4123 3889 3640 3477 3349 3178 2986 2794 2653 2512 2334 2157
2657 2157 2036 1916 1831 1746 1687 1627 1546 1465 1474 1484 1457 1431 1446 1461 1397 1333 1373 1414 1418 1423 1433 1444 1454 1465 1513 1561 1544 1528 1477 1427 1331 1236 1167 1185 1181
2653 1181 1135 1080 1068 1065 1062 1025 988 907 827 837 847 785 723 704 685 666 648 654 661 689 717 709 700 648 596 590 583 577 570 546 522 501 480 499 561 570 507 447 430 406
2648 406 382 373 365 361 357 348 411 477 542 581 620 699 778 775 729 735 813 889 921 882 843 831 818 763 708 714 721 684 648 661 674 687 700 647 595 585 576 591 607 551
2643 551 495 524 554 562 570 550 529 509 488 505 521 494 467 460 453 467 481 454 427 401 374 397 421 401 382 400 419 459 499 520 540 534 455 411 439 505 499 444
2639 444 388 350 311 291 272 295 318 298 277 257 237 268 299 333 367 346 368 393 375 336 339 383 384 343 302 302 302 290 278 309 340 362 384 404 423 434 402
2634 402 352 301 303 305 307 309 310 312 314 316 344 372 384 352 344 379 413 405 357 352 369 343 297 295 335 374 379 341 326 312 317 322 326 331 329 327 284 241 219 239 278 317 351 385
2629 385 374 320 284 292 316 340 355 370 388 406 402 442 481 478 439 401 406 410 384 400 460 476 457 439 460 482 502 522 542 562 561 560 559 558 544 530 520 509 489
2624 489 513 537 517 485 453 462 470 453 435 487 539 550 518 489 460 459 458 439 419 394 413 451 488 462 436 452 469 451 434 416 399 402 406 409 412 415 419 422 425 411 397
2619 397 383 369 361 354 368 382 365 347 373 399 361 323 357 392 417 443 469 495 467 440 456 472 426 381 407 433 440 446 475 503 491 480 468 457 452 447 442 438 431
2614 431 425 419 413 406 400 394 388 381 374 368 361 328 295 304 314 308 302 339 376 354 332 332 331 340 349 380 411 425 439 409 380 371 361 352 342 321 299 300 300 288 276 307 338 341 345 349 353 392
2608 392 432 400 367 364 360 400 440 426 412 398 384 376 368 402 437 451 465 479 493 437 381 325 269 289 310 397 485 536 515 462 410 416 423 429 435 394 353 355 357 382
2603 382 408 390 372 346 319 336 352 386 419 410 401 433 465 476 487 452 417 425 433 438 444 470 497 459 420 454 487 505 522 540 557 544 531 518 505 483 461 439
2599 439 417 410 403 396 389 391 393 395 397 414 430 446 463 453 444 435 426 401 376 372 369 366 363 404 444 432 419 450 481 466 451 480 508 511 515 518 521 511 501 491 481 461 440 419
2593 419 398 435 472 488 504 490 476 534 592 575 559 540 521 513 462 414 438 492 503 472 440 485 531 598 666 639 613 608 603 580 557 584 655 722 718 693 667
2589 667 658 649 705 761 849 937 1004 1070 1245 1420 1559 1698 1837 1976 2165 2354 2590 2826 3012 3198 3346 3494 3560 3627 3619 3568 3459 3279
2585 3279 3078 2878 2694 2511 2263 2015 1767 1519 1383 1248 1191 1135 1069 1003 987 971 933 895 857 819 760 700 662 623 592 560 550 540 586
2582 586 631 627 622 595 568 540 513 509 504 500 496 424 352 358 435 474 441 379 360 406 452 465 478 447 415 419 467 503 468 411 354 347 341 312 284 293 301 332 362 357 352 347
2577 347 342 326 310 316 321 332 343 354 365 377 390 402 414 388 361 334 308 340 371 382 392 388 383 400 417 423 428 412 396 413 429 425 420 375 330 349 412 445 406
2572 406 365 366 383 399 416 432 450 424 377 373 412 451 442 433 422 411 378 346 299 252 257 305 381 413 394 374 315 256 249 285 330 333 312 291 300 308 316 325 350 375
2567 375 375 376 397 375 316 301 344 387 354 321 318 315 312 308 365 421 452 439 419 399 412 425 461 496 496 495 473 451 429 406 437 468 473 435 406 376 380 384 434 483
2562 483 493 459 423 387 384 382 365 347 330 313 335 356 378 399 382 365 330 294 313 376 438 458 451 445 435 426 380 335 272 209 229 320 395 426 426 426 424 421 420 419
2557 419 417 416 372 327 355 382 393 403 371 338 334 330 369 408 410 411 374 337 303 342 435 529 538 476 429 426 400 374 351 328 303 278 254 229 255 281 308 334 318
2552 318 302 329 356 357 359 361 363 419 476 432 388 377 366 355 344 334 324 313 303 288 273 301 330 357 385 413 441 445 449 453 456 442 428 413 399 395 390 386 381 388 394 358
2547 358 321 309 297 284 272 264 256 248 240 232 224 216 208 220 233 245 257 333 409 360 311 306 374 425 433 445 458 425 391 352 313 346 379 387 396 404 413 378 343 325 349 406
2542 406 420 389 358 354 350 347 343 314 285 275 308 361 414 398 382 378 375 371 367 347 327 283 281 291 300 312 324 342 360 335 310 288 265 219 215 264 313 318 279 268 257
2537 257 246 235 259 327 351 332 303 273 284 295 278 261 245 228 251 274 253 233 240 247 254 260 264 269 273 277 293 310 326 343 367 391 371 352 390 428 421 371 348
2532 348 369 402 436 446 413 337 304 363 423 440 414 389 408 440 471 460 406 352 340 406 472 467 419 415 454 450 403 385 409 431 409 393 377 401 426 393
2528 393 360 302 288 312 336 387 396 392 388 381 375 364 353 342 331 387 443 427 411 382 353 323 294 310 325 340 356 328 300 344 388 396 403 368 332 312 291 314
2523 314 337 363 389 416 442 466 489 470 451 471 491 468 402 357 384 395 363 323 326 345 364 362 359 357 354 365 375 386 397 396 396 396 396 375 355 335 315 313 310 351
2518 351 392 410 427 373 319 330 341 395 450 441 432 424 415 416 416 373 330 343 356 369 382 393 404 415 426 470 514 486 458 426 395 364 332 376 419 420 377 348
2514 348 391 434 405 325 288 295 301 278 255 275 294 361 427 494 561 523 485 448 410 365 320 347 374 361 348 378 409 381 353 325 297 270 242 214 186 255
2509 255 324 350 376 397 417 395 372 388 404 420 435 428 420 413 405 433 460 444 428 385 342 371 400 416 433 450 466 482 497 470 443 417 392 409 427 390 354
2505 354 361 368 389 410 388 367 376 384 436 488 493 499 432 366 375 383 392 401 398 395 392 388 386 384 424 465 432 400 367 334 334 333 376 419 440 461 482 503 516 529 542 555 499 442
2499 442 386 330 366 402 438 474 498 523 476 429 392 355 361 367 340 314 359 404 365 326 287 248 292 335 379 422 428 435 441 447 403 358 325 335 372 409 426 444
2495 444 467 490 477 463 462 460 464 425 401 419 459 456 425 437 497 513 456 399 389 379 365 352 389 426 416 407 446 484 474 421 413 406 389 372 391 453 472 419
2490 419 338 300 327 398 449 458 435 413 388 363 347 331 336 341 320 298 313 327 359 390 446 459 456 453 483 513 465 418 420 423 384 344 341 381 392 331 270 280 332
2485 332 341 328 315 356 397 415 390 368 388 403 418 398 378 359 339 340 341 378 415 404 394 383 372 356 339 298 300 307 314 323 332 355 377 364 351 363 376 394 369
2481 369 316 307 322 336 318 299 317 335 353 372 390 409 398 388 377 366 380 394 440 487 494 457 409 361 331 300 306 311 314 317 320 323 323 323 323 323 343 362 382 401 415
2476 415 429 443 457 449 441 432 424 400 376 354 333 329 367 415 463 449 392 334 320 341 362 362 319 278 280 334 388 379 371 365 359 354 393 453 469 437 404 418 433 392 351
2471 351 351 394 401 407 417 426 396 366 360 396 398 356 342 327 308 289 278 311 323 292 283 317 370 380 366 352 333 313 316 363 425 443 438 433 436 439 442 445 435 424 461 498
2465 498 494 447 400 396 413 430 428 426 422 419 416 412 423 433 440 448 458 426 348 356 412 468 430 349 325 387 491 552 538 480 420 404 399 395 350 305 306 307 351 396 430 465
2460 465 457 448 422 396 413 429 415 401 430 458 432 406 358 310 311 313 358 402 446 489 489 490 479 468 458 447 436 425 415 404 379 353 370 388 397 406 437 467 440
2456 440 412 451 490 488 399 329 346 390 390 378 365 355 346 336 326 375 423 471 519 511 503 494 486 494 501 436 372 377 381 429 477 500 524 505 486 474 462 429 395 415
2451 415 435 433 431 364 298 303 309 344 378 342 305 275 245 287 329 328 328 370 412 424 436 405 374 395 416 365 315 285 255 326 397 441 484 506 528 517 507 475
2446 475 443 411 380 348 316 338 359 359 359 385 412 396 379 362 345 400 455 476 498 476 455 464 474 412 350 356 363 369 375 390 404 418 433 411 390 368 347 348 349
2441 349 394 438 446 453 439 425 393 360 342 367 406 373 316 302 360 418 408 397 402 406 410 415 451 488 452 417 401 385 390 396 394 392 346 301 338 375 368 362 374 386 376
2436 376 366 388 410 388 367 377 387 398 408 389 369 350 331 331 332 332 332 334 336 338 340 364 387 368 349 383 416 414 412 387 363 375 386 402 418 384 349 370 391 390
2431 390 390 384 378 372 366 348 330 334 337 342 348 375 402 379 357 385 413 435 457 400 343 350 358 387 416 411 405 436 466 447 428 409 390 403 416 430 443 435 427 420 412 409 407 436
2426 436 464 478 421 343 309 355 402 416 430 394 359 359 402 455 435 385 377 432 487 437 388 408 428 430 431 445 501 552 531 482 433 430 427 448 468 452 437 394
2421 394 352 345 338 364 391 417 444 445 447 448 450 404 358 348 338 405 472 475 478 492 505 468 432 407 382 407 432 442 451 461 470 423 376 337 369 425 439 417 395 411
2416 411 428 423 419 419 418 396 375 379 383 340 297 339 425 491 486 460 434 425 416 373 331 288 245 298 351 353 356 393 430 446 462 424 386 347 309 299 289 280 270 269 267 316
2411 316 364 404 443 417 392 350 308 302 296 320 343 331 318 300 282 314 347 379 411 407 403 410 417 388 359 396 434 471 508 474 440 406 372 393 414 387 361 348
2407 348 378 427 404 361 361 382 404 397 391 406 422 404 387 392 396 406 415 388 361 393 425 458 490 444 398 402 406 451 496 506 515 517 518 470 421 392 363 385 406 420
2402 420 434 426 418 464 510 528 473 424 418 426 434 437 440 443 446 459 473 443 414 359 305 322 339 329 319 309 300 296 293 332 372 426 481 463 446 416 385 398 410 430 450
2397 450 449 447 385 323 305 286 302 318 356 394 373 351 330 308 334 360 364 368 337 306 317 329 354 379 404 429 406 382 402 422 451 481 511 541 525 509 493
2392 493 477 490 503 516 529 464 399 356 313 338 363 344 326 323 321 318 315 329 342 399 456 474 492 467 442 409 376 386 396 379 362 417 472 514 556 527 497
2388 497 497 497 497 497 524 550 534 518 518 518 497 475 465 454 444 434 459 483 465 447 442 436 431 425 398 371 387 403 401 399 398 396 426 457 387 317 307 298 288 279 309 339 372
2382 372 405 416 470 500 459 390 365 354 343 345 348 393 439 425 411 440 469 493 516 519 521 501 481 462 442 464 487 466 445 407 369 360 308 266 295 348 359
2378 359 318 278 336 393 372 350 351 351 373 394 394 395 364 334 347 360 384 408 388 369 376 383 390 397 402 406 411 415 402 389 377 364 374 385 439 492 487 482 520 558 522 485
2373 485 449 412 439 466 422 377 408 438 490 543 586 629 651 673 623 573 565 558 528 499 490 482 459 436 413 390 399 408 417 426 450 474 477 480 464 448 480 512 532 509
2368 509 484 502 527 509 443 420 494 568 567 495 410 396 403 409 403 397 391 385 383 382 380 379 377 374 394 413 441 470 504 495 432 413 418 422 404 385 417 449 422 395 418 442 441
2363 441 441 440 440 431 423 463 502 517 489 478 510 548 514 434 397 415 433 454 474 503 531 521 469 411 395 430 464 445 383 347 312 309 349 400 452 448 444 462 480
2358 480 481 482 505 528 505 482 460 437 409 380 375 413 463 471 455 439 452 465 478 492 456 419 383 347 391 436 459 481 457 434 460 486 477 467 457 447 417
2353 417 387 379 371 401 430 424 418 401 383 387 391 451 512 551 591 581 571 539 507 498 488 514 541 571 601 596 590 562 534 505 477 445 412 454 495 522 463 417 370
2349 370 391 412 359 307 277 334 392 451 451 451 473 494 504 514 488 462 442 421 451 480 418 355 294 320 366 412 384 357 353 349 366 384 336 288 304 321 361
2344 361 401 391 381 396 412 427 443 434 425 395 365 380 395 409 424 433 443 430 418 458 497 535 486 407 328 308 288 292 295 299 303 288 273 322 372 360 349 359
2339 359 369 363 357 352 346 331 316 344 372 371 371 413 455 455 455 455 455 464 472 437 402 413 423 433 443 428 413 436 460 457 383 309 306 319 333 322 354 417 409 372 334 356
2334 356 377 398 419 423 426 429 433 466 500 490 480 451 422 407 435 451 395 286 220 237 254 274 293 304 314 325 335 364 394 423 452 520 588 555 522 485
2330 485 448 411 374 381 389 397 404 380 355 373 392 417 442 424 407 398 389 380 371 399 426 454 481 469 457 445 433 408 383 358 332 368 404 440 475 467 459 451 443 459 475
2325 475 448 421 415 408 402 396 381 366 391 416 455 451 445 481 535 545 485 424 411 441 470 457 444 430 414 398 434 471 488 463 432 401 343 328 360 392 383 375 379
2320 379 384 389 394 383 373 362 351 351 351 351 350 350 349 349 348 399 450 431 413 409 448 488 484 446 409 411 414 410 406 401 397 407 416 425 435 420 405 391 376 391 406 445 441 422 403 381
2315 381 359 355 351 391 430 476 523 526 487 432 449 490 488 445 401 398 395 374 352 330 308 317 325 374 423 437 408 404 399 359 320 326 374 442 466 419 373 335 339 363 386
2309 386 395 403 452 500 522 500 460 420 399 378 400 422 400 379 379 379 454 529 503 478 443 408 416 424 422 421 442 462 450 438 447 456 464 472 458 444 490 536 538 541 519 497
2304 497 453 410 410 410 431 453 464 476 531 585 597 608 548 487 458 428 420 412 404 397 389 381 382 384 428 473 496 520 544 567 535 502 448 394 422 451 436 421 402 383
2299 383 407 432 428 425 465 505 508 511 532 552 564 503 415 371 394 418 400 383 401 419 437 455 424 393 433 474 502 530 458 386 354 321 331 342 375 408 398
2295 398 388 377 367 378 389 383 377 415 452 477 502 456 409 368 327 329 331 332 334 378 423 433 442 430 418 471 523 532 541 517 492 468 443 449 454 459 464 442 420 399 377
2290 377 387 398 408 419 428 436 445 454 473 493 512 532 498 463 429 394 387 379 415 451 471 491 468 446 462 478 452 425 470 516 540 564 555 546 494 442 425 408 412
2285 412 417 397 378 401 425 436 447 414 382 419 457 473 489 481 474 444 415 363 310 329 348 395 443 418 393 361 328 368 407 426 445 442 439 468 496 482 467
2281 467 455 442 451 460 444 427 411 394 392 389 386 384 446 509 528 547 509 470 453 437 432 428 445 462 490 519 547 575 527 479 430 382 416 450 441 432 434 437 440 442 449 457 464
2275 464 471 441 410 380 349 369 389 409 429 397 365 333 301 315 330 345 360 375 390 405 420 425 429 434 439 413 387 382 377 409 441 430 419 395 371 369 366 380 393
2271 393 363 333 356 379 381 382 393 403 457 510 507 503 478 453 417 381 367 352 353 354 397 441 466 492 474 456 429 402 418 434 468 502 493 483 429 374 341 308
2266 308 314 321 371 420 426 431 393 355 355 355 397 440 441 442 422 402 414 427 440 453 438 424 410 396 415 434 474 515 470 425 452 479 470 460 472 485 497 510 501 492
2261 492 472 451 452 453 479 504 486 468 391 314 309 304 316 329 319 310 333 355 378 400 407 414 459 504 523 470 389 352 364 377 391 406 381 357 346 379 447 444 387
2256 387 374 412 450 419 388 405 422 440 457 461 466 470 475 456 437 418 400 398 397 396 394 403 411 420 428 470 512 511 509 516 523 487 451 482 514 503 491 457 424 433 442 449 455 461 467 443
2251 443 419 438 457 473 489 505 522 478 434 390 346 383 421 459 496 485 473 461 450 475 500 457 415 407 471 537 532 456 423 434 444 464 484 482 481 434 387
2246 387 412 437 417 396 354 311 332 352 372 393 351 309 339 368 402 436 398 359 351 342 377 411 420 430 439 448 382 317 378 439 428 373 369 437 526 543 504 466
2242 466 425 385 416 447 454 462 491 520 541 561 539 517 526 535 522 510 455 400 388 377 388 399 388 378 376 374 350 326 362 398 433 469 467 466 464 463 453 442 432 421
2237 421 415 408 401 394 407 420 366 311 291 342 420 456 435 414 433 453 465 477 468 458 450 442 391 339 367 395 423 451 434 417 442 468 448 427 429 430 440 450 439
2232 439 428 495 562 528 495 495 496 518 540 489 439 388 337 311 284 301 317 373 428 462 497 538 579 599 619 579 538 498 458 467 477 488 500 514 571 623
2227 623 603 507 411 411 411 421 432 481 531 554 505 454 403 438 473 466 458 411 364 417 470 495 519 472 425 417 409 444 479 459 438 379 320 274 299 355 412 425
2223 425 439 453 466 448 430 433 436 414 392 414 435 442 448 522 596 594 520 462 448 418 387 403 418 422 425 407 389 452 515 506 498 479 459 483 507 556 605 611 617 681
2218 681 745 777 738 667 596 542 488 476 463 522 581 558 534 489 444 422 399 377 355 386 417 404 392 377 361 345 330 326 323 362 402 381 359 360 360 357 354 394
2213 394 434 448 461 474 487 483 480 476 472 475 477 479 482 503 524 503 481 463 444 426 407 436 466 452 438 406 373 384 395 420 445 427 409 384 359 405 451 457 463 469
2208 469 475 517 558 499 439 410 380 393 407 449 491 490 489 471 453 457 461 424 386 392 398 449 500 480 460 436 411 409 406 397 387 378 369 362 355 420 484 501 518 535 552 517
2203 517 482 469 456 454 452 493 534 493 453 456 459 443 428 434 439 390 341 393 444 439 434 408 381 357 334 353 372 388 405 399 394 390 387 405 423 484 545 534 523 507 491
2198 491 475 459 461 463 464 466 421 375 372 369 419 468 518 567 532 498 506 515 486 457 428 398 373 348 366 383 370 357 387 417 413 409 426 444 490 536 538 541 493 445 440
2193 440 479 498 446 391 379 391 404 397 391 424 456 468 479 482 486 490 493 472 450 471 492 482 472 462 451 457 463 512 561 537 513 488 464 454 445 436 427 409 392 374
2188 374 357 383 409 434 460 464 467 449 431 406 381 399 460 483 434 383 375 381 386 409 475 524 502 451 399 382 365 391 417 429 442 452 462 474 442 392 414
2184 414 476 496 501 506 493 479 465 452 491 531 528 525 526 527 506 486 507 527 527 526 514 502 468 434 467 500 532 565 537 509 481 453 455 456 458 459 499 538 577 617 599
2179 599 581 564 546 573 599 582 565 561 557 553 549 579 609 595 582 588 593 599 605 604 604 585 566 577 632 662 620 523 468 486 503 483 463 443 423 434 445 478 510 481
2174 481 452 467 481 465 450 456 462 453 443 434 425 450 475 457 439 432 425 417 410 458 506 532 558 581 604 583 563 548 533 558 583 577 528 481 506 542 535 485 435 471
2169 471 508 523 538 527 515 482 449 491 533 553 573 553 533 534 535 560 585 589 593 593 594 595 596 597 597 597 598 571 544 539 533 518 503 515 599 671 672 643 614 608 559 491 495
2164 495 535 533 492 494 538 582 558 533 533 534 513 493 497 501 548 596 600 604 587 569 577 584 548 512 512 512 491 470 468 466 485 505 565 626 614 603 591 579 561 585 655 654
2159 654 595 536 553 571 516 462 439 416 415 414 492 569 546 523 544 564 542 519 476 434 434 434 496 557 576 594 668 742 773 804 780 757 733 710 716 722 721 763
2154 763 822 809 738 668 664 661 615 568 566 563 561 558 609 659 638 617 654 690 706 721 723 725 727 729 763 796 829 863 913 963 933 904 858 811 800 790 820 851 817 783
2149 783 783 783 753 810 929 1005 945 885 911 937 912 887 912 937 897 857 843 829 794 758 778 799 769 739 751 763 710 658 714 771 806 841 860 879 847
2145 847 816 851 885 856 826 874 922 892 861 882 903 845 787 807 827 825 824 859 894 864 834 860 886 833 780 800 820 776 732 741 751 681 612 683 755 733
2140 733 711 755 799 738 676 728 822 809 710 703 782 784 743 752 804 751 655 652 734 714 650 667 727 687 646 729 897 892 800 815 917 896 789 794 886 859
2136 859 746 723 843 852 775 803 916 929 798 780 906 882 714 677 785 806 741 792 929 938 802 843 1028 1034 896 965 1179 1180 980 1026
2132 1026 1330 1346 1104 1168 1548 1636 1467 1742 2391 2601 2496 3358 5225 6844 9181 16006 28143 39156 40665 31910 20600
2130 20600 13776 11346 9564 7179 5544 4914 4196 3104 2465 2429 2250 1754 1546 1654 1563 1214 1113 1327 1344 1046 933 1080
2127 1080 1129 919 825 931 922 711 612 714 750 642 588 678 689 557 562 710 747 640 598 700 754 664 657 736 750 620 562 706 812 775
2123 775 736 741 698 569 508 591 601 467 412 501 616 588 560 618 632 559 486 499 552 519 510 545 573 515 459 490 524 558 593 628 612 524 455 458 457
2119 457 414 434 498 531 491 500 581 621 589 594 643 649 583 548 613 633 553 475 498 561 552 513 517 529 497 447 439 454 469 486 503 465 426 434 514 537 460 401
2114 401 414 453 448 478 551 599 546 477 452 460 467 512 599 619 539 476 484 495 464 452 512 598 612 577 543 524 505 536 610 636 591 577 635 641 547 456 494
2110 494 566 538 452 439 483 484 454 466 499 532 528 525 519 471 437 476 494 441 356 342 386 430 474 518 526 463 416 442 504 494 476 459 465 429 407 458 521 513
2105 513 458 446 494 498 491 484 494 460 407 427 477 484 445 450 520 590 569 549 529 509 510 555 577 527 492 500 539 505 427 391 419 447 427 408 410 413 423 476 560
2101 560 571 504 437 381 325 303 354 424 422 371 321 338 356 373 391 422 453 462 472 517 563 501 439 402 365 350 334 390 445 451 456 461 466 450 434 435 436 438 439 429
2096 429 419 431 485 553 549 495 440 462 484 442 400 410 420 430 440 428 416 397 450 554 614 620 583 558 533 484 435 460 485 475 464 479 495 511 526
2091 526 495 463 432 401 438 475 512 549 550 550 551 552 547 543 503 462 481 500 540 581 608 636 591 547 469 390 384 378 428 478 456 434 451 468 463 458 447 435 445 455
2086 455 454 454 475 496 488 480 462 529 602 589 529 469 475 482 467 451 460 469 434 400 469 537 554 484 448 411 413 414 416 417 419 420 446 472 455 437 459 481 461 440 479 519
2081 519 537 555 521 487 453 419 445 471 497 523 499 476 430 385 355 325 367 409 414 418 402 385 405 426 375 323 346 369 392 415 434 453 471 490 492 495 498
2077 498 500 526 551 505 458 484 510 514 518 535 553 549 545 502 459 460 460 449 439 407 375 404 433 419 404 429 454 436 417 427 437 403 370 397 425 409 394 385 377
2072 377 412 447 460 473 417 361 414 510 553 524 494 507 516 481 431 380 369 359 375 391 407 424 477 531 563 596 617 639 617 595 572 548 547 545 543 541 539 537
2067 537 532 527 500 473 515 556 526 496 489 481 473 465 464 463 462 461 476 491 484 478 504 529 512 495 500 506 533 561 569 577 517 458 446 506 549 550 537 524 509 493 487 481 476 470 467 464
2062 464 447 386 348 381 467 510 509 507 502 498 497 495 494 493 461 429 398 366 366 367 368 368 355 341 370 400 455 510 523 535 531 528 482 435 385 335 335 335 351 367 383 400 386
2057 386 373 395 418 482 546 546 545 495 445 431 417 423 429 436 442 475 507 540 572 553 533 513 494 487 480 473 466 493 519 466 414 454 495 500 505 524 542 561 580 575 570 547
2051 547 523 520 559 590 534 490 489 507 481 425 413 452 491 496 501 485 468 442 416 425 435 452 468 464 459 437 416 430 444 435 426 439 451 454 457 460 463 486 509 531 554
2046 554 523 491 509 527 525 523 471 419 450 481 512 544 545 546 547 548 550 551 552 553 546 539 532 525 509 493 476 460 444 427 411 394 408 422 436 450 452 453 455 457 462 467 472 477 489 501
2041 501 561 620 667 670 607 544 530 559 531 503 501 543 579 544 508 472 483 493 520 547 580 570 542 557 596 634 633 632 631 630 603 576 549 521 521 521 523 526 519 555
2036 555 593 589 572 598 621 601 543 485 475 465 447 428 460 492 494 496 497 499 495 491 486 482 495 507 520 532 510 489 467 445 447 448 474 457 442 427 432 436 415 394 423
2031 423 453 417 380 396 455 494 490 476 463 455 447 448 492 552 569 534 499 513 527 541 556 551 547 543 539 490 442 396 350 308 310 327 388 452 515 488 418 407 468
2026 468 531 522 478 505 584 620 580 540 500 460 456 495 553 539 483 471 530 589 543 498 524 550 546 543 540 537 516 495 474 453 403 353 346 339 391 442 494 545 563
2021 563 582 600 618 576 533 490 447 446 445 444 443 453 463 473 483 472 462 454 446 461 519 593 595 552 510 535 560 567 574 581 589 545 501 530 558 578 598 619 639 633 627
2016 627 622 616 594 572 593 614 565 516 511 505 511 518 563 609 640 600 533 509 518 527 496 465 474 483 492 501 476 450 424 398 389 381 372 363 398 434 469 504 501 497 451 404 440 476
2011 476 513 549 566 583 557 531 523 516 509 502 487 473 458 443 446 450 453 456 455 455 478 459 441 423 406 388 373 401 472 500 473 447 460 474 433 392 425 501 558 571
2006 571 569 567 552 537 521 506 521 535 550 564 560 555 550 545 547 548 550 551 504 457 510 563 566 569 572 575 539 503 538 617 611 532 457 453 501 549 559 568 570 571 573 574 558 543 527
2001 527 511 480 449 490 531 515 499 485 472 413 397 481 566 599 560 537 558 542 525 528 573 589 563 538 557 552 546 543 541 554 567 581 594 552 509 510 554 560
1996 560 495 448 445 442 439 439 440 474 508 542 576 535 495 476 529 590 609 605 602 609 617 588 559 557 554 552 549 556 563 534 505 536 567 633 700 674 647 621 595 520 444 408
1991 408 443 520 597 600 602 609 615 621 627 568 508 542 575 568 561 586 610 610 538 485 504 548 549 528 507 520 532 545 558 551 544 558 573 544 515 536 558 583 609 585 560
1986 560 514 468 443 419 447 476 482 489 464 439 450 461 476 490 505 519 512 504 519 576 635 623 564 549 566 583 567 551 562 573 519 465 457 449 516 582 625 596
1981 596 529 461 478 495 512 529 517 505 493 480 493 506 498 489 496 503 543 583 574 523 493 506 527 548 536 524 528 531 514 496 480 465 449 434 458 482 506 530
1976 530 525 521 536 550 584 575 528 481 446 455 486 518 515 468 441 456 484 468 443 419 456 494 493 450 421 435 484 533 515 455 442 472 527 538 538 537 543 506 468
1972 468 474 490 507 490 473 506 538 549 559 557 555 531 507 505 503 500 498 470 443 415 388 403 418 433 448 487 527 526 483 471 460 446 431 415 398 443 488 499 466
1967 466 434 444 439 435 433 431 464 498 531 564 524 483 469 497 515 534 528 565 582 556 530 547 559 527 498 512 559 607 563 520 524 528 532 537 494 452 474 496 511
1962 511 526 476 426 426 425 447 468 479 490 465 439 421 403 407 410 453 496 422 347 337 399 442 486 511 537 512 487 481 474 471 467 522 621 685 678 638 599 554 510
1957 510 470 430 440 451 481 512 507 501 467 432 447 462 454 445 444 485 540 523 456 389 375 360 395 431 497 563 521 479 449 419 411 402 463 524 534 544 584 623
1953 623 611 600 587 574 540 506 493 480 503 526 486 446 471 496 510 524 503 481 470 459 484 509 524 538 518 497 515 534 532 529 530 531 532 533 514 494 511 527
1948 527 512 497 503 509 527 544 512 479 470 461 430 400 412 424 437 449 449 450 450 451 480 508 487 465 464 462 460 459 469 479 510 542 512 483 453 423 387 351 339 398 486
1943 486 575 560 545 514 484 518 553 567 582 560 539 549 560 534 509 519 530 540 550 535 519 453 388 414 440 467 493 498 502 471 439 441 443 424 404 445 486
1939 486 492 497 499 500 502 504 484 463 442 422 399 375 402 430 444 459 423 387 418 450 481 512 537 562 587 612 609 606 552 499 436 373 320 339 400 462 449 436 484
1934 484 531 514 497 492 487 482 477 489 501 491 482 468 454 439 425 434 443 452 461 456 452 404 357 402 448 451 454 464 474 484 493 488 483 478 472 459 446 433 420 439 457 476 494 487
1928 487 481 546 610 622 633 601 569 541 514 487 459 467 475 482 490 496 502 508 514 517 520 524 527 534 542 549 556 499 442 428 414 467 520 531 541 534 528 521 514 547 581 571 561 545 529
1923 529 513 497 487 477 468 458 446 433 421 409 399 389 422 456 453 450 491 531 511 490 470 449 447 444 442 439 413 386 403 419 435 451 466 482 473 464 454 445 458 471
1918 471 484 498 476 455 477 498 505 511 517 524 533 543 552 562 572 583 550 517 523 528 534 539 522 505 488 471 479 487 495 502 485 468 413 358 342 412 525 552 470 387 400
1913 400 413 443 473 460 447 444 441 437 434 429 423 460 497 535 572 537 503 505 507 509 512 537 563 588 614 602 590 535 480 459 438 460 483 497 511 526 540 495 450 448
1908 448 447 484 522 559 597 578 559 541 522 515 509 503 496 491 485 437 388 414 440 465 491 499 507 514 522 538 554 527 499 509 518 528 538 524 510 497 483 496 508 531 468
1903 468 383 384 403 421 438 454 513 572 577 582 587 592 569 546 566 587 546 505 508 510 497 483 448 414 396 379 404 430 486 542 554 567 496 424 425 425 462 498 492 485
1898 485 445 404 465 525 560 595 631 666 660 654 648 642 612 582 595 608 572 537 502 467 451 436 420 405 383 360 410 459 485 511 493 476 437 398 380 363 399
1894 399 436 451 466 473 480 509 537 548 558 569 508 416 367 421 518 538 515 520 524 493 463 432 402 384 365 390 415 445 476 485 494 485 477 512 547 524 501 499 497 443
1889 443 389 378 367 357 348 360 372 418 465 468 472 482 491 501 511 461 410 432 453 429 406 425 445 494 543 550 556 531 506 460 413 449 485 506 484 453 494 560
1884 560 582 530 479 497 514 518 522 567 611 546 438 409 453 497 469 419 411 393 375 360 345 363 381 400 418 432 447 461 475 469 463 479 495 539 582 554 527
1880 527 530 533 539 546 528 554 596 566 473 379 394 481 524 495 466 479 481 482 485 489 477 464 473 483 506 529 509 489 468 446 425 404 420 437 453 469 452 434 416
1875 416 399 379 359 339 320 359 399 395 392 367 342 389 436 462 488 492 496 440 384 400 415 460 506 529 553 534 515 496 476 450 424 441 457 483 508 512 516 540
1870 540 564 545 525 480 435 431 469 507 544 534 524 534 543 552 562 541 520 500 479 477 476 475 473 465 456 457 500 585 628 604 580 565 550 536 521 482 444 416 432 479
1865 479 526 523 478 428 421 437 453 424 396 429 462 467 430 425 463 496 485 452 463 490 475 450 425 445 465 463 462 461 461 461 460 459 457 455 454 462 469 501 490 446 401 434 511
1860 511 545 537 556 574 591 608 622 636 582 485 406 427 496 565 601 637 632 584 524 464 470 476 515 554 583 570 530 490 482 473 464 456 465 475 532 590 606 579 530
1855 530 524 512 499 489 478 508 538 532 526 499 472 467 462 494 526 556 586 566 502 439 418 430 442 457 472 484 495 507 519 511 503 494 486 480 474 444 457 467 476 489 501
1850 501 537 573 597 578 523 468 462 499 530 518 509 500 500 457 393 372 414 456 464 473 477 481 485 489 493 497 501 505 515 526 534 542 567 548 519 489 483 476 492 550 608 594 505 460
1845 460 493 527 499 471 470 469 468 466 457 448 439 430 424 418 434 450 481 512 507 501 495 488 476 508 573 595 565 535 546 556 545 534 558 582 556 530 540 549 558 567 550 533 515
1840 515 498 486 474 462 450 470 490 510 530 519 509 462 416 405 394 431 468 515 519 523 526 569 568 513 458 465 471 457 442 473 504 511 475 482 532 595 587 498 410
1835 410 367 396 459 479 434 390 375 361 382 404 409 415 420 426 450 474 450 427 451 519 536 510 468 426 422 461 487 513 480 448 437 470 512 554 549 500 451 446
1830 446 462 478 433 387 412 436 452 424 425 468 509 507 494 481 447 412 385 401 443 485 519 554 523 493 493 493 493 494 510 526 542 558 547 537 526 515 475 436
1826 436 399 362 370 422 497 573 608 601 554 506 492 478 464 451 451 451 487 523 540 556 536 517 511 506 500 495 531 567 567 567 581 595 558 522 524 526 528 530 538 547 555 563 550 538
1820 538 525 512 507 503 476 450 490 530 534 538 518 498 478 458 485 512 589 666 703 740 669 598 562 527 513 499 501 504 507 510 482 453 461 468 494 520 546 572 557 541
1815 541 526 511 533 556 542 529 523 517 511 506 521 537 552 568 537 507 498 490 516 543 519 495 511 527 507 487 462 438 449 461 475 490 504 519 562 606 571 536
1811 536 545 553 526 498 517 536 591 646 664 681 619 557 532 507 532 557 536 515 494 474 501 528 555 582 590 598 556 514 541 568 576 542 529 516 504 491 484 520
1806 520 556 549 511 474 480 486 509 574 637 701 693 686 635 585 534 483 434 386 367 391 434 477 485 492 500 508 477 446 417 389 395 444 496 504 475 489 543 598 596 523 450
1801 450 449 488 527 528 528 531 534 496 458 432 449 469 445 415 427 482 536 602 625 576 527 535 614 672 658 594 529 503 477 478 478 478 479 516 553 571 546 534 521 508
1796 508 495 477 502 546 589 601 613 582 551 535 519 524 530 509 488 468 447 430 414 397 381 418 454 472 447 415 383 391 399 465 532 553 532 490 492 510 528
1792 528 507 486 508 530 544 558 573 587 630 674 645 572 513 497 498 498 488 478 489 500 533 565 528 492 497 546 526 462 429 438 449 417 384 422 485 505 483
1787 483 462 481 501 483 465 429 392 433 516 594 600 573 546 535 525 532 539 548 558 554 593 632 629 607 585 564 542 522 546 569 550 528 506 484 462 443 468 514
1782 514 517 485 454 491 529 520 512 503 495 450 406 434 461 482 504 525 546 550 553 557 560 568 576 543 510 491 516 521 484 429 417 450 483 487 491 495 499 469 438 479 519 524 529 518
1777 518 464 423 425 443 461 462 464 511 515 465 416 464 512 502 491 438 384 386 387 432 476 471 465 531 597 603 610 573 536 528 520 512 504 536 567 599 630 566 502 480 459 498
1772 498 537 555 572 563 554 545 536 528 521 513 505 476 446 438 430 447 465 525 586 580 574 589 605 645 685 654 622 583 543 576 608 590 572 554 536 507 478 449 421 413 405 468
1767 468 532 542 552 562 572 517 462 450 438 432 426 463 500 543 586 608 629 585 541 518 495 480 465 472 479 474 468 419 370 424 478 489 500 512 524 536 548 534
1762 534 521 551 580 559 538 516 495 525 556 586 616 573 529 528 528 553 579 583 586 571 555 540 525 527 530 532 535 520 505 491 476 476 476 519 562 564 566 568 569 550 531 555
1757 555 578 537 495 496 497 485 474 505 536 540 544 548 552 546 540 534 528 517 507 539 572 557 543 529 515 528 540 553 566 518 469 493 517 548 580 568 557 523 490 499
1752 499 552 576 528 498 512 549 585 552 519 478 437 468 499 530 561 550 538 523 508 514 521 543 565 587 609 568 527 529 532 521 511 522 533 519 505 533 562
1748 562 560 558 594 631 633 563 510 500 496 493 492 491 490 489 488 487 514 542 569 596 557 519 523 527 565 602 574 546 527 508 525 542 523 504 521 538 518 497 512 528 554
1743 554 581 528 475 472 469 487 506 503 500 534 567 553 539 525 511 491 471 486 502 488 474 525 576 578 581 583 585 579 573 603 633 656 680 624 569 532 495 508 521 563
1738 563 604 645 687 654 622 589 556 561 566 571 576 525 474 488 501 521 541 561 581 606 631 621 610 580 550 556 606 611 544 500 526 585 601 621 641 643 603 546
1733 546 562 635 709 709 708 650 591 580 569 561 509 487 537 573 537 486 478 476 474 475 476 502 529 477 425 441 457 473 489 505 520 499 479 489 500 511 522 548 573
1728 573 563 553 581 608 586 564 555 547 560 573 576 579 582 585 616 647 628 609 554 500 509 519 527 534 548 606 654 630 599 610 645 607 553 541 596 651 659 666 625 584
1723 584 521 459 516 574 596 618 602 587 572 557 587 617 647 677 680 683 636 589 609 629 599 568 584 599 578 557 555 554 552 550 593 636 629 621 639 656 652 648 613 579
1718 579 544 509 565 621 641 662 660 657 655 653 593 534 539 587 609 559 509 532 572 568 544 519 541 562 591 663 754 774 729 683 652 620 610 600 631 662 599 537
1714 537 564 591 530 468 444 492 549 606 670 734 728 680 647 615 615 616 645 674 667 660 662 664 666 668 675 683 629 575 536 540 556 572 610 649 651 654 658 663 617 572 579 585 592 599 662
1708 662 724 710 623 527 503 542 581 607 633 637 642 609 575 518 503 535 567 598 630 679 686 652 618 609 600 625 649 694 696 672 648 692 736 745 753 730 707 648 589
1704 589 600 611 613 572 557 585 622 659 635 612 608 603 622 598 576 555 588 621 604 587 542 497 490 525 587 605 572 538 575 611 626 641 681 721 697 673 675
1699 675 677 643 609 604 600 563 525 541 599 621 600 588 575 560 544 572 599 626 654 648 643 637 632 623 614 626 639 651 663 611 558 611 665 668 671 618 566 549 532 587
1694 587 642 619 595 616 637 636 635 644 654 627 600 595 589 562 535 540 545 529 512 557 602 611 620 655 689 687 685 684 683 660 637 624 611 598 585 593 600 608 616 604 592 580 568
1689 568 589 610 632 653 681 709 715 721 766 811 765 719 733 791 777 692 659 726 794 791 778 766 749 732 732 731 731 730 744 758 736 714 676 638 651 663 635 606
1684 606 627 649 668 687 671 654 667 679 692 704 742 781 740 656 627 669 693 673 681 689 694 699 707 716 703 690 740 790 790 790 837 884 895 905 908 910 912 914 881 848 815
1679 815 782 773 764 720 675 659 644 664 685 743 801 831 775 739 746 774 802 841 880 870 859 836 814 813 812 833 854 840 782 725 754 783 769 747 810 869 884
1675 884 875 866 889 913 886 858 830 802 800 798 796 794 831 869 906 944 921 899 898 897 925 953 932 910 941 972 968 921 899 962 1007 965 903 928 987 1004 1007 1011 1011 1012 1022
1670 1022 1033 1043 1053 1108 1163 1218 1273 1305 1337 1326 1230 1115 1044 999 953 892 918 958 955 940 968 1044 1077 1069 1061 1051 1040 1037 1034 1081 1128 1123 1117 1133 1149 1201 1254
1665 1254 1306 1359 1382 1406 1429 1453 1444 1435 1426 1417 1424 1430 1458 1486 1473 1460 1512 1564 1554 1543 1539 1534 1594 1741 1868 1953 2027 2187 2398 2609 2882 3299 4001 5077
1661 5077 6648 8822 11534 14390 16808 18222 18207 16785 14452 11861 9517 7605 6143 5055 4236 3561 3074 2730 2500
1659 2500 2270 2051 1919 1889 1858 1820 1782 1708 1634 1517 1400 1376 1353 1307 1262 1282 1301 1302 1302 1238 1174 1137 1100 1098 1097 1081 1066 1072 1077 1026 975 960 945 948 950 956
1654 956 961 982 1045 1114 1096 1080 1107 1184 1219 1256 1379 1548 1630 1635 1597 1577 1558 1545 1531 1518 1504 1452 1400 1353 1307 1273 1326 1447 1526 1481 1436 1388 1340 1347 1353
1650 1353 1360 1367 1380 1394 1407 1421 1419 1418 1417 1415 1400 1385 1421 1414 1346 1365 1431 1454 1395 1379 1436 1494 1481 1468 1497 1527 1559 1591 1665 1740 1821 1901 2053 2205 2312 2420
1646 2420 2638 2898 3227 3641 4200 4902 5842 7213 9137 11721 14775 17743 19649 19688 17886 15080 12313 10034 8270 6880
1643 6880 5852 5025 4344 3806 3428 3135 2887 2682 2506 2330 2139 2033 1980 1927 1806 1684 1663 1642 1672 1702 1776 1849 1864 1879 1919 1958 1938
1640 1938 1961 2135 2396 2801 3350 4036 4723 5326 5886 6302 6402 6078 5495 4857 4218 3563 2993 2633 2360 2095 1917 1911 1905 1793 1682
1637 1682 1674 1753 1757 1675 1647 1619 1522 1425 1429 1432 1372 1312 1295 1279 1191 1104 1064 1068 1041 1015 1063 1111 1067 1023 1053 1126 1155 1142 1198 1255 1262 1269 1373 1476 1471 1395 1359
1632 1359 1394 1395 1352 1320 1287 1232 1219 1309 1399 1421 1400 1443 1487 1456 1381 1392 1474 1508 1543 1659 1818 1973 2128 2411 2795 3159 3451 3665 3749 3583
1629 3583 3230 2914 2700 2473 2203 1982 1861 1778 1739 1752 1766 1729 1691 1694 1697 1656 1573 1533 1535 1525 1515 1608 1744 1766 1716 1728 1784 1806 1829 1893 1957 1929
1625 1929 1830 1802 1846 1850 1854 1934 2058 2112 2094 2117 2140 2074 1965 1949 2033 2058 2012 2040 2139 2181 2151 2163 2248 2265 2209 2230 2323 2374 2424 2552 2780 2999 3218
1621 3218 3593 4154 4834 5671 6755 7882 8603 8678 8230 7510 6699 5975 5511 5305 5118 4888 4744 4744 4753 4719 4790 4947 5059 5028 5029 5116
1617 5116 5199 5197 5266 5421 5537 5567 5645 5723 5686 5562 5551 5741 5911 5937 6010 6227 6373 6376 6426 6619 6809 6914 7022 7216 7396 7490 7653 7959
1614 7959 8232 8418 8651 9027 9429 9787 10291 10995 11603 11895 11972 11963 11796 11485 11343 11459 11661 11776 11870 12107 12298 12402 12572 12942
1611 12942 13307 13530 13791 14254 14720 14985 15138 15377 15632 15843 16130 16676 17362 18133 19116 20357 21532 22275 22584 22577 22199 21447 20708
1608 20708 20285 20045 19806 19676 19805 19949 19949 19992 20237 20536 20634 20722 20953 21223 21293 21360 21627 21894 21960 22026 22294 22522 22550 22588 22885 23205
1605 23205 23324 23415 23764 24189 24412 24568 24925 25341 25555 25670 25985 26367 26547 26695 27102 27571 27838 28031 28481 28957 29174 29269 29623
1602 29623 30171 30575 30948 31521 32129 32478 32698 33119 33584 33791 33861 34247 34798 35090 35260 35631 36108 36326 36412 36756 37212 37409 37477 37804
1599 37804 38289 38516 38650 39214 40084 40753 41289 42142 43120 43726 44037 44606 45348 45774 45920 46382 47079 47403 47432 47778 48419 48801 48961
1597 48961 49552 50536 51261 51742 52539 53648 54383 54839 55725 57017 57936 58424 59170 60293 61100 61648 62685 64221 65441 66215 67306
1594 67306 68742 69690 70275 71464 73350 74978 76380 78729 82032 84789 86471 88152 90294 92119 93717 96549 100723 104696
1592 104696 108192 113038 119922 127582 135970 147258 161892 177417 192859 210569 232099 256471 285427 325898 384885
1590 384885 467045 583742 761976 1037705 1437741 1961001 2559751 3127098 3517877 3615224 3400526 2962274
1588 2962274 2435321 1930493 1506613 1179990 939886 761465 621722 510484 425863 363174 314412 275201
1587 275201 245324 222671 202689 183698 167435 154344 142374 130841 121405 114295 107673 100893 95347 91412 87476
1585 87476 82940 79180 76668 74157 71161 68710 67137 65306 62750 60510 59092 57587 55587 54131 53628 53082 52037 51308
1583 51308 51372 51349 50789 50546 51023 51358 51043 50814 51071 51126 50614 50304 50656 50965 50725 50528 50778 50884 50437 50075 50312 50548 50401 50397
1580 50397 50929 51376 51307 51382 52169 53099 53645 54234 55272 56224 56695 57166 58116 59108 59738 60455 61603 62607 63022 63579 64817 66141
1577 66141 66939 67737 69230 70981 72508 74293 76800 79450 81796 84572 88561 93153 97471 102105 108013 114925 122501 132115
1575 132115 145176 160678 176561 192487 209338 227195 247002 272753 308852 356466 417507 501378 622724
1574 622724 796188 1046088 1421271 1970359 2665290 3343955 3763696 3755693 3347374 2735626 2139471 1673154
1572 1673154 1335566 1081158 878925 718680 593668 494923 416306 355435 309352 273480 244412 220331
1571 220331 199379 179691 161181 144889 131038 118784 107822 98604 91139 84774 79127 74350 70290 66440 62632
1569 62632 59162 56007 52766 49382 46168 43213 40291 37370 34770 32601 30632 28921 27767 27043 26294 25287 24217 23233
1567 23233 22211 21189 20402 19874 19291 18508 17727 17090 16474 15815 15280 14945 14569 13991 13381 12814 12188 11476 10839 10288 9721 9153
1564 9153 8695 8379 8021 7620 7354 7290 7278 7266 7339 7497 7554 7468 7416 7363 7212 6918 6689 6605 6463 6234 6081 6015 5914 5727 5637 5633 5567 5358
1560 5358 5141 5010 4819 4586 4479 4516 4535 4411 4322 4320 4242 4077 3981 4029 4068 4021 3996 4057 4030 3860 3722 3670 3617 3477 3378 3421 3430 3353 3290 3370
1557 3370 3451 3446 3401 3442 3414 3299 3163 3114 3017 2834 2664 2638 2643 2606 2569 2618 2632 2559 2486 2499 2455 2324 2233 2285 2350 2329 2330 2475 2693 2953 3371
1553 3371 3989 4629 5010 5104 4882 4383 3798 3392 3244 3163 2996 2807 2762 2799 2750 2704 2745 2785 2740 2673 2692 2764 2750 2693 2722 2793 2778 2744 2797
1549 2797 2901 2961 3003 3045 3027 2922 2763 2603 2444 2242 2078 2057 2068 1993 1921 1935 1963 1904 1808 1798 1899 1999 2005 2010 1992 1974 1947 1964 1961 1872 1783
1546 1783 1780 1805 1787 1769 1795 1740 1598 1425 1395 1423 1407 1355 1346 1356 1323 1306 1376 1470 1478 1439 1443 1462 1394 1253 1155 1142 1129 1162 1195 1246 1297 1300 1302 1300 1212 1124
1541 1124 1122 1214 1305 1359 1413 1527 1640 1803 2039 2274 2351 2273 2153 2014 1876 1766 1728 1730 1732 1713 1694 1665 1565 1439 1385 1358 1260 1163 1139 1156
1538 1156 1131 1069 1079 1166 1210 1183 1155 1115 1075 1054 1033 1050 1024 1002 1050 1135 1176 1172 1212 1232 1152 1048 1045 1112 1107 1063 1091 1193 1253 1241 1228 1246 1263 1237 1212
1533 1212 1276 1341 1305 1269 1319 1369 1376 1383 1409 1435 1418 1401 1392 1383 1302 1221 1214 1207 1200 1194 1227 1261 1251 1242 1265 1289 1241 1193 1246 1299 1353 1406 1417 1428 1367 1306 1362 1419 1404
1529 1404 1389 1315 1241 1196 1222 1266 1266 1226 1228 1277 1282 1245 1251 1281 1268 1210 1152 1152 1152 1109 1066 1099 1131 1092 1053 1067 1080 1051 1022 1028 1035 1034 1076 1159 1155 1107 1101 1149 1197 1176
1524 1176 1155 1200 1245 1219 1192 1156 1119 1083 1047 1124 1201 1148 1096 1071 1045 1020 995 971 948 916 971 1054 1093 1062 1030 1077 1123 1169 1215 1262 1310 1285 1260 1283
1520 1283 1305 1227 1149 1200 1251 1231 1210 1274 1337 1329 1321 1353 1386 1418 1450 1589 1727 1766 1762 1829 1982 2115 2247 2515 2926 3479 4233 5406 7124
1516 7124 9428 12219 15113 17403 18395 17864 16090 13655 11160 8980 7225 5901 4867 4035 3436 2982 2602 2309 2131
1514 2131 2040 1932 1781 1631 1525 1439 1396 1383 1371 1339 1307 1283 1259 1192 1125 1133 1142 1107 1073 1096 1120 1101 1039 1018 1083 1124 1078 1041 1003 1003 1003 1045 1086 1028
1510 1028 969 952 936 941 947 1008 1069 1059 1048 1123 1199 1174 1107 1088 1156 1180 1118 1089 1103 1087 1071 1081 1092 1036 980 993 1092 1128 1021 886 836 833 829 896 1006
1505 1006 1100 1108 1096 1128 1163 1111 1056 1087 1132 1134 1082 1031 1020 1009 1045 1082 1118 1155 1227 1299 1300 1300 1304 1307 1332 1357 1443 1530 1638 1746 1847 1948 2094 2241
1501 2241 2416 2633 2863 3178 3682 4386 5327 6584 8453 11097 14313 17327 19201 19210 17452 14689 11915 9687 8004 6637
1499 6637 5516 4654 3978 3446 2997 2635 2343 2137 1968 1800 1680 1560 1490 1420 1283 1146 1093 1126 1137 1105 1076 1089 1100 1068 1021 974 925
1495 925 876 851 827 832 794 764 821 874 842 811 779 745 711 666 665 682 699 718 738 781 782 756 730 744 759 744 730 735 739 766 750 688 627 654 725 752 736
1491 736 713 690 663 637 657 676 714 752 769 743 672 601 569 580 566 553 576 599 554 509 543 648 713 707 691 719 722 653 594 635 682 657 598 611 675
1487 675 696 694 692 708 725 725 725 706 687 675 707 720 689 661 675 690 661 655 693 746 728 689 693 695 654 597 584 615 646 659 672 691 667 614 604 591 578 527
1482 527 518 557 596 614 633 629 626 650 673 653 590 546 573 625 633 644 656 691 683 666 692 718 701 651 644 653 662 688 715 741 696 655 657 680 660 600 611 680 749
1477 749 741 732 684 637 598 631 720 766 764 763 780 797 695 593 591 590 579 568 579 590 566 543 562 581 615 648 682 715 794 873 884 795 676 630 635 598 534
1473 534 514 510 506 507 508 581 654 632 611 589 567 538 508 521 535 567 599 672 745 699 610 577 615 668 720 705 691 691 691 669 648 599 550 544 538 516 494 543 593
1468 593 576 560 615 670 677 684 648 611 585 559 605 651 633 615 602 588 583 649 742 792 738 684 671 657 670 683 696 709 692 675 658 641 638 634 653 671 650
1463 650 628 678 728 687 646 604 563 598 633 662 620 560 573 648 723 699 674 699 725 721 718 715 712 689 666 643 620 601 582 627 673 693 713 755 797 783 769
1459 769 754 740 706 671 716 761 720 679 685 692 647 559 531 575 626 634 671 708 730 753 726 698 635 572 573 575 663 752 802 780 722 665 638 612 571 530 607
1454 607 684 713 669 645 621 614 606 635 663 645 626 671 760 810 789 760 731 724 717 731 745 758 770 733 695 681 667 675 682 691 700 709 718 666 613 626 638 592 547 581
1449 581 615 632 650 667 685 714 742 750 757 697 637 682 727 682 595 556 589 612 636 664 691 691 690 725 760 763 767 770 773 780 786 792 798 744 691 684 749 808 766 678 590
1444 590 614 637 661 685 654 622 655 688 660 632 605 577 591 604 618 632 628 624 619 615 634 653 672 691 690 690 689 688 678 668 659 649 639 629 619 609 593 578 563
1440 563 547 564 580 597 613 628 644 659 674 635 597 623 649 648 647 646 645 599 554 573 592 593 593 572 551 564 577 590 603 630 656 660 665 622 580 574 567 547 526 524
1435 524 522 528 490 484 550 639 685 719 754 770 714 625 578 582 585 613 641 649 656 643 629 661 693 690 686 666 645 625 604 618 633 625 618 661 704 712 720 654 588 572 556
1430 556 580 605 608 610 587 564 562 604 677 678 614 551 573 596 618 641 677 714 750 786 748 709 670 632 622 612 637 663 678 692 707 721 732 743 755 766 735
1425 735 705 675 645 616 587 558 529 545 561 577 593 616 639 661 684 715 747 778 810 768 725 683 640 657 674 690 707 683 660 636 612 645 678 658 638
1421 638 587 493 444 494 608 678 686 693 711 728 709 690 672 654 658 662 666 670 653 636 632 628 624 620 619 618 617 616 615 615 614 613 619 626 632 639 631 623 637 651 695 738 746 754 751 749 711 672
1415 672 651 630 609 588 593 597 623 649 692 735 699 663 681 700 668 637 634 632 580 527 539 550 598 645 650 654 658 662 683 704 675 645 657 669 660 650 644 639 633 628 652
1410 652 676 621 566 554 541 528 515 533 550 614 677 712 675 604 576 619 662 686 710 709 709 673 637 653 670 665 660 624 587 587 586 604 621 675 728 707 687 663
1405 663 640 589 495 416 438 517 553 525 498 524 550 540 530 529 528 527 526 565 604 643 682 678 675 671 668 662 656 629 602 641 681 670 659 615 571 577 583 636 689 663 637
1400 637 629 622 615 607 603 599 551 504 530 556 583 609 588 567 525 482 513 544 503 463 475 488 543 599 613 627 598 570 583 596 609 623 617 611 646 681 660 596 516
1396 516 508 545 582 551 521 536 551 566 582 598 613 629 645 647 649 629 610 615 620 582 544 565 587 587 587 599 611 645 678 621 564 550 536 580 624 596 568 567 566
1391 566 608 650 669 688 635 581 590 598 606 615 620 625 609 593 623 653 640 627 640 654 625 596 586 575 565 554 579 604 586 567 585 602 620 637 676 715 683 650
1386 650 629 608 609 610 589 568 547 526 571 616 617 619 629 639 627 616 602 589 597 606 621 636 579 522 530 538 547 555 582 609 636 664 607 549 492 435 455 476 496 516
1381 516 506 496 485 475 486 496 507 517 547 576 606 635 582 529 519 509 571 634 653 672 668 665 640 614 556 497 510 523 560 597 591 585 571 557 543 529 485
1377 485 440 468 496 542 588 563 538 507 477 543 609 673 665 625 586 597 608 641 674 722 770 718 665 642 619 575 530 515 500 484 469 494 518 543 568
1372 568 548 529 488 447 438 430 465 500 531 562 552 543 541 582 601 548 506 536 569 560 515 514 532 507 473 440 447 453 483 512 541 571 561 550 591 631 627 622 597 571
1368 571 563 555 547 539 526 514 537 560 573 585 547 509 491 473 519 566 545 524 502 481 460 438 452 466 514 562 588 615 577 539 566 592 609 627 594 561 556
1363 556 551 545 540 540 540 590 640 642 644 624 604 615 627 617 607 618 629 618 608 594 581 589 598 629 661 671 681 653 626 599 571 586 600 579 557 539 521 553 585
1358 585 644 702 731 673 637 600 623 646 674 701 664 627 579 531 563 594 588 581 554 526 530 534 539 543 561 579 633 687 684 682 657 633 601 569 588 607 581 554 607
1353 607 660 618 577 571 566 569 573 577 581 604 628 615 603 583 564 609 654 630 606 582 558 576 594 612 630 634 639 644 648 653 658 662 667 651 635 648 617 585 625 696 724 682
1348 682 640 661 681 668 655 620 586 556 527 562 597 564 532 536 539 522 505 539 572 611 651 669 687 665 644 573 501 485 469 518 567 540 514 524 533 554
1344 554 574 595 615 578 540 503 466 512 558 539 521 514 507 536 565 601 637 637 637 628 619 645 672 679 686 657 628 630 632 670 708 682 657 652 648 650 652 617 583 579 576 572 568 565
1339 565 562 558 555 583 612 640 669 650 632 635 638 587 536 557 578 578 577 554 532 568 604 568 532 513 495 498 501 463 426 431 436 458 480 502 524 506 487 541 594 592 590
1334 590 545 500 468 436 476 516 515 514 534 555 514 473 475 477 495 513 488 463 472 482 492 502 480 457 478 499 513 528 522 515 475 434 494 555 569 584 599 614
1329 614 587 559 532 504 496 487 479 470 449 429 451 474 475 475 476 477 534 591 605 619 621 624 666 709 672 592 565 610 653 653 638 624 634 643 653 663 622 580 582 584 568 553
1324 553 580 608 617 627 594 560 514 468 465 462 493 525 514 503 514 525 536 547 491 435 439 514 574 634 694 754 776 725 672 619 581 544 506 468 460 451 464 477
1319 477 464 450 480 509 524 540 572 604 634 592 522 496 510 523 518 512 539 566 593 619 600 580 603 626 635 644 632 619 636 653 649 645 591 538 527 517 532 547
1314 547 540 533 578 624 626 628 582 536 533 530 520 511 524 536 515 494 516 538 540 542 543 545 621 697 700 704 678 651 625 598 574 550 526 502 495 489 504 519 537 555 530 505
1309 505 488 471 453 436 461 487 469 451 452 452 474 496 489 481 545 609 614 618 601 584 554 524 537 549 549 549 549 549 551 554 556 559 592 626 659 693 660 627 594 562 520 479
1304 479 437 396 420 444 468 492 529 566 531 496 515 533 551 569 534 498 463 427 454 481 509 536 545 553 562 571 618 665 640 573 514 527 569 611 594 578 561
1300 561 545 595 644 694 744 697 651 605 558 526 494 505 516 543 570 597 624 577 531 527 524 520 517 470 424 449 475 500 526 548 571 594 617 588 559 530 501
1295 501 481 462 486 510 539 569 598 628 619 609 600 591 598 605 612 618 561 504 448 391 417 444 485 569 652 664 618 572 528 484 482 481 531 581 560 538 528 519 510 500
1290 500 532 564 596 628 603 578 511 443 409 374 339 305 326 346 367 388 458 528 526 525 512 500 487 475 488 502 515 529 521 512 504 496 497 497 498 499 513 528 542 557
1285 557 564 571 535 500 481 463 488 512 561 610 616 622 605 589 572 556 567 578 589 601 578 556 534 512 541 569 555 541 510 478 447 415 483 550 574 598 601
1281 601 603 606 608 572 536 543 550 571 593 572 550 536 522 508 494 485 476 466 457 443 428 414 399 422 444 467 490 512 535 557 580 566 551 537 522 549 576 603 630
1276 630 581 532 483 434 438 443 447 451 514 577 598 618 600 583 566 548 556 564 528 493 520 546 552 557 562 568 551 535 539 544 526 509 514 520 483 446 453 461 447 433 420 407 466
1271 466 525 558 590 580 569 565 562 558 555 528 501 474 447 439 431 466 501 516 531 525 518 523 527 488 450 486 522 515 508 477 445 486 526 565 604 571 538 521 505 510 515 541
1266 541 568 551 535 512 490 489 488 489 491 492 493 524 555 543 530 508 486 507 528 556 585 542 498 499 501 502 503 505 507 531 554 559 563 524 486 502 519 469 420 420 507 550
1261 550 508 465 423 447 471 464 458 451 444 460 476 492 508 521 534 547 560 579 598 573 549 519 488 458 427 459 492 524 557 503 450 439 429 431 434 393 353 343
1256 343 333 366 400 451 502 482 418 380 414 453 449 438 470 518 567 540 514 467 419 412 406 399 392 377 362 389 417 452 487 479 471 496 520 544 568 548 528 510
1251 510 493 494 539 599 588 523 457 488 518 530 541 553 565 547 530 512 495 503 512 520 529 547 564 515 465 451 510 595 637 646 656 663 669 688 706 725 744 727 710
1247 710 694 677 636 596 598 600 574 548 522 496 495 493 492 490 496 501 485 469 462 455 491 527 528 528 548 567 532 453 402 422 447 472 481 489 517 545 552 558 566 574 560 546 556 567
1241 567 577 588 595 603 567 532 545 558 557 512 490 539 612 643 636 629 619 610 607 603 579 554 521 488 526 565 554 544 534 523 515 507 521 534 554 574 551 528 524 519 537
1236 537 554 550 546 542 537 509 480 551 623 612 601 590 580 577 575 551 527 514 501 530 560 581 603 624 645 583 521 487 525 582 595 565 535 519 502 486 469 486
1231 486 503 520 537 508 480 451 423 457 491 526 560 533 506 479 452 437 422 450 478 513 549 563 577 535 494 454 415 416 459 546 589 541 493 462 473
1227 473 500 526 540 510 485 502 536 569 554 538 545 551 576 601 605 608 600 592 584 576 566 557 547 538 517 497 476 456 436 416 439 462 465 467 491 515 567 618 651 641 606
1222 606 572 578 584 581 579 555 531 546 561 560 516 478 483 503 524 520 517 535 553 517 482 492 544 608 630 580 530 513 539 581 623 585 504 467 472 488 505 481 456
1217 456 467 477 447 416 395 417 484 550 561 528 495 505 554 604 640 633 606 622 651 680 667 611 579 548 528 508 532 555 566 576 584 593 568 500 456 484
1213 484 536 544 538 532 558 583 565 547 560 574 587 600 579 558 515 473 505 536 525 514 528 541 562 540 507 545 608 627 569 511 522 532 549 566 539 513
1209 513 504 496 509 522 524 525 526 527 501 475 492 509 502 495 560 625 588 550 534 518 526 534 520 506 487 467 469 471 458 446 434 493 599 662 653 644 660 675 691 706 670
1204 670 635 599 563 579 596 569 542 572 602 589 533 509 556 606 613 596 580 560 541 541 541 584 627 611 595 622 649 641 633 625 617 563 509 527 545 535 526 517 508 513
1199 513 518 567 615 607 598 590 582 603 625 646 668 641 614 588 561 572 582 571 560 510 460 455 493 545 553 546 538 569 599 608 617 604 592 579 566 569 571 574 576 565 553 547 498
1193 498 429 404 452 500 497 495 493 491 475 459 512 566 559 509 500 533 563 549 537 569 604 639 631 622 614 562 513 464 464 463 463 463 470 476 483 489 516 542 549 513 484 455 466 477
1188 477 468 460 452 443 450 457 507 557 579 602 581 560 526 492 480 468 462 457 521 585 628 629 611 593 583 574 608 642 646 650 654 658 651 643 649 699 721 671 597 566 571 577 585 594 583
1183 583 573 522 471 420 411 476 541 561 537 492 490 538 585 593 600 550 500 522 545 546 548 550 552 533 514 496 477 477 478 478 479 514 549 562 576 533 490 476 534 598 618
1178 618 624 630 627 624 620 617 635 653 628 604 606 609 612 614 638 662 614 566 554 541 551 560 569 578 587 597 613 629 623 618 593 569 588 606 600 593 565 536 565 594 580 565 579 594
1172 594 608 622 609 595 581 568 569 569 570 571 579 588 640 692 685 679 672 666 676 685 695 705 678 651 623 668 725 740 713 728 775 778 708 637 615 593 571 549 601 652 661
1167 661 669 641 613 627 642 659 677 622 567 575 583 662 742 750 758 744 731 735 739 722 705 720 736 752 767 754 740 726 713 756 798 798 798 799 800 780 759 809 858 864 870
1162 870 845 820 752 684 633 582 603 624 655 687 675 664 706 748 748 747 725 704 726 747 753 759 765 771 780 789 727 665 688 712 736 760 764 768 772 776 804 832 789 745 744
1157 744 742 813 883 949 1016 1010 1005 1061 1117 1173 1229 1295 1360 1404 1448 1489 1531 1640 1749 1827 1832 1778 1724 1724 1724 1653 1581 1503 1424 1418 1411 1370 1329 1288 1247 1221 1194 1168
1152 1168 1141 1158 1175 1149 1123 1155 1186 1239 1292 1344 1396 1447 1499 1532 1566 1642 1719 1791 1863 1957 2051 2074 2097 2120 2143 2175 2208 2197 2186 2209 2233 2256 2279 2332
1148 2332 2385 2337 2290 2223 2156 2132 2109 2099 2088 1978 1867 1816 1765 1715 1664 1666 1668 1713 1759 1819 1880 1868 1857 1837 1816 1796 1776 1766 1755 1745 1735 1708 1681 1610
1144 1610 1540 1487 1434 1381 1328 1374 1421 1467 1514 1578 1642 1706 1770 1853 1935 2060 2185 2283 2380 2435 2489 2508 2527 2502 2478 2443 2408 2273 2137 2037 1937
1140 1937 1836 1736 1657 1579 1460 1341 1292 1286 1238 1104 1014 1010 1024 1038 1016 993 970 947 936 924 956 988 968 948 972 995 1026 1057 1044 1032 1027 1022 973 925
1136 925 965 1005 999 906 844 868 910 952 1001 1050 1171 1292 1369 1446 1471 1410 1326 1242 1156 1070 1023 1019 1015 968 918 867 860 853 883 956 1006 983 955 970 981 949
1132 949 919 889 900 911 889 867 845 824 825 825 826 827 807 788 795 760 709 701 765 828 834 797 760 766 806 845 842 796 790 826 860 850 805 759 754 749 771 792 817 841 853
1127 853 909 940 972 982 992 963 933 900 910 964 974 968 961 1024 1087 1123 1160 1199 1239 1274 1352 1479 1649 1784 1875 1919 1963 1942 1877 1794 1711 1614 1517 1463
1123 1463 1410 1334 1258 1201 1186 1175 1164 1155 1146 1135 1124 1089 1097 1133 1169 1208 1248 1259 1270 1238 1206 1208 1209 1211 1212 1232 1252 1273 1293 1285 1278 1270 1262 1311 1361 1453 1545 1544 1544 1472 1400
1118 1400 1345 1289 1305 1322 1338 1354 1392 1430 1426 1421 1439 1456 1510 1564 1618 1672 1732 1792 1781 1769 1841 1912 2004 2097 2181 2265 2327 2389 2467 2546 2624 2703 2786 2870 2953
1113 2953 3037 3139 3242 3301 3361 3392 3424 3412 3401 3453 3506 3579 3653 3673 3693 3691 3689 3753 3816 3880 3944 4000 4057 4114 4170 4232 4293 4376 4459 4510 4561 4683 4806
1109 4806 4877 4949 5064 5179 5279 5379 5478 5578 5706 5835 5920 6005 6051 6097 6165 6233 6297 6361 6468 6575 6759 6944 7086 7227 7394 7560 7770
1106 7770 7979 8205 8432 8637 8842 9027 9212 9419 9626 9845 10064 10360 10656 10980 11390 11846 12303 12732 13075 13352 13543 13641 13653 13632
1103 13632 13568 13447 13327 13255 13270 13334 13397 13466 13535 13603 13672 13741 13810 13921 14032 14144 14255 14384 14512 14663 14813 14919 15024 15173 15322 15417 15512
1100 15512 15679 15845 16036 16226 16345 16464 16621 16778 16956 17135 17286 17437 17631 17825 17940 18055 18242 18429 18623 18818 19013 19208 19452
1097 19452 19696 19897 20098 20256 20415 20617 20819 21029 21240 21378 21517 21680 21842 22077 22311 22495 22678 22883 23089 23319 23548 23821 24094
1094 24094 24383 24673 25033 25394 25784 26173 26662 27152 27618 28085 28529 28974 29388 29803 30145 30487 30709 30931 31137 31342 31579 31901 32276
1091 32276 32651 33071 33491 33983 34475 34979 35484 36060 36636 37203 37770 38331 38978 39627 40276 40908 41627 42439 43337 44250 45248 46360
1089 46360 47559 48817 50076 51313 52594 53973 55437 57045 58853 60816 62980 65346 67971 70900 74146 77794 81872
1087 81872 86438 91608 97556 104451 112441 121723 132608 145416 160608 178815 200825 227629 260403 300901 351597
1085 351597 415644 497036 600165 728385 881443 1052908 1229398 1392221 1520673 1596665 1609399 1558535
1083 1558535 1454002 1312775 1154004 994855 847795 719235 610345 519291 443426 380365 327957 284303
1082 284303 247915 217589 192345 171195 153404 138356 125518 114395 104679 96290 89022 82579 76796 71670 67147
1080 67147 63081 59332 55974 52989 50278 47711 45281 42995 40783 38614 36541 34612 32735 30943 29306 27870 26603
1078 26603 25422 24288 23240 22273 21349 20486 19710 18999 18288 17626 16964 16339 15715 15134 14553 14045 13538 13102 12666 12266 11865 11507
1075 11507 11150 10780 10411 10120 9915 9708 9458 9213 9012 8860 8708 8558 8409 8200 7991 7783 7574 7338 7102 6824 6545 6361 6178
1072 6178 6037 5896 5757 5617 5549 5481 5424 5366 5309 5251 5159 5066 5017 4968 4909 4850 4834 4818 4749 4679 4604 4529 4474 4332 4191 4135 4125 4114 4008 3903
1069 3903 3765 3628 3533 3439 3440 3440 3441 3442 3353 3265 3177 3088 3040 2991 2942 2893 2865 2836 2807 2778 2723 2667 2683 2700 2688 2676 2659 2729 2776 2824 2811 2797 2835 2958 3172
1064 3172 3471 3777 4083 4394 4705 5036 5366 5610 5711 5702 5550 5312 5073 4752 4431 4110 3789 3554 3319 3136 3040 2982 2923 2870 2817
1061 2817 2781 2746 2710 2674 2654 2633 2613 2593 2579 2565 2551 2538 2548 2558 2497 2435 2360 2285 2211 2136 2109 2081 2054 2027 2024 2021 1975 1929 1903 1877 1851 1824 1854 1883 1841
1057 1841 1798 1762 1726 1690 1654 1639 1623 1608 1593 1566 1540 1514 1488 1453 1419 1385 1350 1357 1364 1328 1291 1220 1149 1175 1202 1180 1116 1076 1108 1152 1153 1154 1198 1221 1173 1108
1053 1108 1143 1241 1295 1280 1264 1282 1299 1245 1191 1207 1224 1241 1257 1287 1317 1304 1291 1263 1235 1207 1178 1184 1190 1196 1202 1239 1277 1213 1150 1119 1088 1057 1027 1018 1009 1043 1077
1048 1077 1108 1140 1149 1159 1143 1128 1134 1140 1178 1216 1211 1206 1192 1178 1185 1193 1186 1179 1100 1021 1050 1078 1063 1048 1059 1071 1104 1138 1168 1199 1208 1217 1205 1193 1181 1169 1209 1250 1247 1245 1251
1043 1251 1257 1220 1183 1121 1058 1052 1119 1183 1204 1154 1104 1088 1072 1077 1083 1109 1135 1118 1101 1070 1038 1029 1019 1058 1098 1094 1090 1169 1247 1225 1203 1194 1184 1175 1165 1150 1134 1118 1102
1038 1102 1107 1112 1117 1122 1102 1082 1062 1042 1027 1012 997 982 985 988 991 994 974 954 934 914 900 887 830 773 786 799 811 824 852 880 908 936 941 946 951 955 994 1032 1028 1023 1004
1033 1004 986 946 905 908 911 871 831 853 875 875 876 878 879 881 883 941 998 1013 1027 1026 1026 1025 1024 1030 1036 1041 1047 1051 1054 1015 975 946 917 867 817 858 900 942 983 977 970 963 957 934 910
1028 910 887 864 872 880 910 939 958 976 1038 1100 1125 1150 1175 1200 1267 1334 1401 1469 1521 1573 1625 1678 1818 1957 2054 2151 2281 2412 2504 2524 2538 2552 2520 2446
1024 2446 2412 2378 2329 2238 2140 2043 1946 1848 1754 1703 1663 1624 1615 1607 1598 1590 1597 1604 1616 1627 1655 1755 1841 1884 1901 1962 2020 2035 2059 2083 2107 2088 2064 2041 1980 1877
1019 1877 1769 1762 1832 1902 1894 1887 1906 1967 2054 2141 2209 2277 2352 2427 2490 2510 2495 2480 2441 2402 2400 2398 2388 2334 2269 2246 2233 2220 2200 2180 2138 2097 2061 2024 1976 1885
1015 1885 1816 1747 1675 1603 1513 1423 1384 1344 1332 1321 1309 1298 1248 1198 1151 1104 1138 1215 1267 1320 1353 1387 1442 1497 1550 1603 1704 1805 1898 1948 1943 1938 1921 1904
1011 1904 1836 1724 1605 1529 1487 1401 1296 1191 1165 1181 1156 1089 1024 1002 1028 1053 1003 952 870 787 784 780 803 826 798 728 701 746 808 828 785 742 747 751
1007 751 779 807 834 862 853 844 785 726 727 728 707 686 667 647 627 608 603 598 593 589 593 597 606 614 619 696 773 778 762 746 726 705 677 649 715 780 762 745 727 709 669 628
1001 628 652 676 686 697 743 790 798 807 751 695 662 628 673 719 709 699 689 679 655 631 644 656 700 744 723 703 718 733 683 634 658 682 706 730 701 673
997 673 644 615 624 633 642 650 668 687 705 723 719 716 691 666 626 587 613 638 629 621 662 704 739 775 774 774 709 643 642 641 648 654 660 666 622 578 606 633 644 655 645 635 638 641
992 641 625 609 626 687 723 688 640 634 668 658 638 619 640 661 646 630 658 685 706 727 772 774 711 647 653 658 648 637 627 616 605 594 585 576 572 611 650 647 630
987 630 614 641 625 579 533 582 631 631 587 568 549 543 536 552 567 600 632 646 617 585 552 560 568 582 597 633 669 625 580 583 629 650 671 673 676 631 587 616 689
982 689 739 746 736 727 723 720 695 669 637 604 547 533 544 555 569 583 589 595 601 607 629 652 633 615 608 643 679 671 641 611 649 688 711 734 760 742 717 692 707 722
977 722 691 660 698 736 720 662 604 589 595 601 610 619 678 737 750 721 682 686 707 727 700 672 666 660 654 648 641 635 634 634 633 633 596 560 595 631 609 587 610 677 693 667 644
972 644 663 670 678 661 687 702 673 672 671 673 675 696 717 750 740 711 682 653 624 614 647 670 692 674 656 661 667 697 683 639 594 618 643 640 637 634 631 606 582 602 665
967 665 694 680 671 662 657 652 625 599 643 688 713 696 641 586 627 667 663 616 592 641 680 676 628 581 550 518 529 541 566 592 615 637 625 571 537 547 594 641
962 641 647 654 656 659 661 664 680 695 711 727 745 762 780 798 765 732 720 709 707 705 741 778 772 695 612 572 577 581 632 682 676 671 644 617 662 708 681 655 653 652 693 735 713
957 713 691 691 691 668 645 622 599 641 683 653 623 591 558 598 637 660 683 662 642 620 598 648 698 673 648 650 723 775 754 707 660 659 659 659 659 660 661 619 577 551
952 551 526 572 618 643 669 715 762 773 783 794 804 782 760 781 802 826 850 802 754 716 678 683 688 708 729 749 770 746 722 698 674 675 677 699 722 736 750
948 750 693 635 620 605 662 719 701 684 686 687 659 587 542 569 616 663 693 722 713 703 694 684 668 651 656 661 670 679 645 611 599 587 647 706 776 845 843 841 830 820
943 820 766 713 723 733 743 753 754 755 756 757 727 697 738 823 878 860 820 851 900 876 797 718 714 711 751 791 780 769 715 660 650 640 630 620 598 576 598 662
938 662 718 701 616 602 681 760 743 726 723 719 736 754 747 740 733 726 728 729 710 690 699 707 643 580 586 591 618 645 695 744 750 757 780 804 828 852 854 857 817 776 749 722 739
933 739 755 775 796 774 751 771 791 830 869 828 743 712 752 799 803 769 778 790 803 768 733 779 824 833 843 864 885 855 826 771 716 698 679 712 746 714 683
928 683 689 695 701 707 722 737 731 725 737 748 695 642 639 635 632 628 631 633 636 639 720 801 789 777 799 821 822 822 803 783 764 744 729 715 722 729 722 715 744 773 782 790 735 679 692 705
923 705 718 731 756 780 755 729 732 735 738 740 740 740 740 739 743 746 750 754 746 738 731 723 763 803 807 812 825 839 831 823 859 894 822 750 738 726 715 703 705 707 730 753 763 773 718 663
917 663 642 621 600 579 623 666 674 682 658 634 609 585 593 601 608 616 635 654 673 691 694 697 699 702 683 664 645 627 646 666 650 634 627 620 592 563 581 599 552 505 541
912 541 576 612 647 677 706 685 664 626 589 551 513 570 626 647 667 676 685 694 703 679 655 631 608 605 602 599 596 589 583 576 569 552 535 597 659 707 756 712 667 657 647
907 647 672 698 744 790 743 696 719 741 699 614 581 620 651 682 702 721 741 761 804 848 870 892 954 1016 1028 1040 1059 1078 1003 886 838 862 878 895 891
903 891 887 862 836 864 893 859 825 826 870 867 793 732 715 733 751 775 799 729 660 658 656 654 652 666 680 694 708 761 814 831 777 758 782 827 873 917 961 939 874
898 874 855 879 878 878 936 1038 1077 1073 1086 1142 1148 1110 1108 1148 1139 1086 1061 1079 1097 1071 1056 1084 1062 997 976 998 998 956 968 1023 1016 939 885 904 904 862 864 909 919 885
893 885 887 932 918 832 800 869 937 905 845 857 876 894 919 987 1011 963 955 1018 1049 979 914 948 1001 981 964 1018 1051 1012 974 1007 1061 1071 1115 1230 1312 1293
889 1293 1252 1253 1268 1211 1161 1154 1147 1098 1041 1056 1075 1022 990 1059 1148 1136 1111 1128 1115 1002 899 926 994 1019 1036 1096 1124 1080 1071 1134 1138 1041 976 1039 1108 1077
884 1077 1032 1088 1112 1007 915 967 1056 1001 940 1023 1106 1045 994 1087 1148 1065 976 1089 1173 1113 1051 1189 1298 1207 1089 1229 1377 1323 1256 1448 1628
881 1628 1493 1310 1442 1661 1564 1435 1736 2055 1944 1798 2255 2866 2932 3034 4141 5700 6828 9388 16515 26728 33064
878 33064 30219 21028 12928 9451 8357 6774 5002 4177 3861 3113 2305 2100 2190 1908 1506 1478 1575 1355 1078 1117 1300 1225
875 1225 1071 1176 1372 1253 1012 972 1080 1045 892 882 976 926 812 841 942 900 739 721 821 834 758 768 833 811 711 697 767 751 670
872 670 676 786 810 741 759 836 827 751 719 759 756 705 740 807 789 734 766 853 854 792 772 818 864 847 831 829 827 804 780 787 793 778 763 792 821 799 820 848 789
867 789 712 721 772 823 858 893 934 976 953 930 908 887 814 784 792 714 636 644 694 700 662 667 725 783 793 803 809 815 799 783 828 872 851 831 836 840 823 807 801 795 753
862 753 711 745 779 762 745 778 810 806 803 816 829 788 833 925 931 897 864 894 923 917 911 949 987 960 934 941 949 849 748 745 742 775 808 834 861 837 813 796 779
857 779 783 788 782 777 736 694 742 789 801 812 811 810 809 808 793 778 763 748 783 817 758 699 756 813 820 827 836 845 804 763 735 707 679 651 704 758 762 766 814 861 873 885
852 885 894 903 862 820 843 866 889 911 885 858 832 805 792 779 745 711 738 766 714 663 667 671 676 680 720 761 780 799 799 800 779 758 811 863 823 782 749 715 703
847 703 692 695 699 681 663 712 761 775 788 806 824 792 760 725 690 692 693 720 747 825 902 943 984 917 850 819 787 756 724 702 680 694 708 727 745 742 739 731 724
843 724 716 709 736 764 742 720 710 700 740 780 830 879 864 848 868 888 874 788 714 711 715 718 718 718 718 718 749 780 789 798 777 756 785 814 806 799 792 784 817 850 862 873 826
837 826 779 797 815 816 817 818 819 834 849 792 735 762 789 817 844 837 830 823 817 858 900 898 897 914 931 949 966 935 903 872 840 823 805 830 855 874 893 912 931 932 933
832 933 934 935 927 920 956 992 1049 1106 1106 1034 958 925 907 888 876 864 894 925 950 975 927 880 886 892 941 990 973 956 939 923 915 907 942 977 984 991 998 1005 978 951 967 983
827 983 1015 1047 1079 1111 1145 1180 1215 1249 1229 1209 1189 1168 1250 1331 1369 1407 1362 1316 1271 1226 1254 1282 1267 1252 1288 1323 1359 1394 1406 1418 1430 1443 1487 1532 1534 1492
823 1492 1470 1519 1568 1617 1650 1682 1646 1609 1590 1614 1616 1546 1484 1493 1583 1629 1572 1515 1498 1482 1470 1458 1447 1435 1410 1385 1402 1420 1427 1433 1479 1526 1521 1472 1448 1424 1379
818 1379 1333 1336 1381 1400 1419 1437 1456 1455 1412 1392 1373 1371 1368 1366 1364 1372 1381 1389 1398 1427 1456 1413 1328 1267 1278 1318 1358 1333 1308 1283 1259 1285 1311 1319 1283 1191 1099 1062 1096 1140
813 1140 1140 1100 1060 1045 1073 1077 1081 1075 1069 1064 1058 1052 1046 1040 1034 1028 1022 1016 1010 1045 1080 1099 1075 1054 1076 1096 1072 1054 1035 1057 1079 1084 1088 1092 1096 1112 1128 1141 1154 1139 1081 1047 1013 1022 1030
808 1030 1036 1042 1027 969 911 896 942 988 1018 1005 990 975 959 944 944 986 1028 1027 1005 982 1000 1018 982 946 953 960 937 913 889 866 904 942 981 1019 1003 987 970 954
803 954 925 897 868 839 855 872 888 904 909 913 961 1009 981 953 925 897 895 893 891 889 890 891 892 893 923 953 939 926 897 868 911 954 951 948 945 942 900 858 859 860 884 909 890
798 890 871 895 919 944 968 987 1005 981 957 930 904 878 851 853 854 856 857 889 920 951 983 969 956 942 929 907 885 863 841 852 863 831 799 830 861 892 922
793 922 937 951 923 894 875 855 835 816 807 798 789 780 811 842 830 818 834 850 823 795 758 721 785 848 859 869 923 976 937 899 860 821 832 844 812 780 809
789 809 837 865 893 897 900 903 906 921 937 909 881 845 808 815 821 861 901 941 980 989 997 1006 1014 1023 1031 1039 1047 1074 1102 1129 1156 1188 1220 1296 1371 1435 1500 1565 1629 1743 1856
784 1856 2041 2226 2386 2546 2706 2866 2989 3113 3164 3216 3283 3350 3373 3397 3366 3334 3231 3128 3072 3017 3004 2992 2959 2927 2895 2862 2885 2907 2930 2952
780 2952 2987 3023 3058 3093 3125 3157 3226 3295 3231 3081 2936 2791 2690 2589 2388 2187 2050 1913 1776 1639 1474 1308 1243 1178 1163 1147 1132 1116
777 1116 1070 1023 976 929 884 840 795 751 781 812 800 788 792 796 728 661 628 596 607 618 651 684 696 708 731 754 734 714 675 636 640 644 657 670 704 738 720
772 720 702 727 752 766 780 751 722 723 724 726 727 726 724 723 722 726 731 735 740 707 674 712 751 735 720 747 774 783 792 801 810 791 772 775 778 749 721 736 751 748 745 742 739 732 725 674 624
766 624 613 602 634 666 637 608 680 751 790 829 795 762 692 621 623 624 621 617 635 653 695 737 707 677 682 686 691 696 672 649 698 746 800 854 807 760 709 658 628
762 628 599 606 613 663 713 760 808 856 904 850 797 816 834 818 802 743 684 704 724 766 808 793 778 785 792 805 818 788 758 797 836 831 827 765 703 685 666 718
757 718 770 823 875 866 857 892 926 902 878 854 830 779 727 675 624 668 713 757 802 750 699 719 739 766 793 798 804 826 848 827 806 815 824 790 756 769 783 840
752 840 896 867 837 808 778 795 812 829 846 837 828 819 810 826 842 814 787 804 820 837 854 837 821 804 787 787 787 786 786 774 763 751 739 735 730 746 763 780 796 856
748 856 916 885 854 823 792 779 765 730 695 692 689 728 768 725 681 632 670 733 796 793 790 793 796 799 802 828 853 836 818 797 775 796 817 787 757 771 784 775 766 757 748
743 748 762 776 789 803 805 808 811 813 807 800 794 787 818 848 879 910 898 887 876 865 907 950 928 906 936 967 976 985 929 873 882 891 904 916 928 941 923 906 889 871 866 861
737 861 856 851 841 830 820 809 804 799 829 903 935 894 837 822 874 926 931 935 877 818 781 744 765 787 808 830 886 942 890 838 791 743 760 777 799 822 780 738
733 738 749 760 770 781 786 791 796 801 806 811 816 821 847 873 899 925 920 916 911 906 875 843 811 779 796 812 829 846 821 796 772 747 777 806 836 866 894 921 928 934 906 878
728 878 885 893 854 815 840 866 903 940 927 914 934 954 938 922 917 911 885 858 842 826 832 837 884 931 956 981 949 917 906 896 867 839 832 825 872 919 945 971 950
723 950 929 887 844 848 852 877 903 887 872 893 914 887 859 868 876 879 881 884 887 931 976 956 936 926 917 955 993 961 887 821 842 896 907 887 910 971 1032 1016 1000 961
718 961 922 905 887 923 958 971 985 997 1009 1042 1076 1102 1128 1104 1079 1034 988 1007 1026 1030 1034 1060 1086 1109 1132 1133 1135 1128 1121 1150 1180 1153 1127 1111 1181 1230 1193 1108
713 1108 1109 1151 1149 1113 1077 1131 1185 1175 1165 1116 1068 1084 1100 1096 1093 1089 1085 1102 1118 1135 1151 1134 1116 1098 1080 1070 1061 1051 1041 1099 1157 1142 1128 1139 1149 1117 1084 1061
709 1061 1038 1037 1035 1050 1065 1080 1095 1161 1227 1193 1159 1131 1103 1097 1091 1128 1164 1200 1236 1274 1312 1306 1301 1290 1279 1311 1344 1334 1324 1357 1390 1431 1472 1513 1554 1543 1533 1623
704 1623 1714 1734 1753 1730 1707 1728 1749 1791 1834 1840 1845 1893 1942 1980 2019 2015 2010 2040 2070 2122 2174 2195 2216 2216 2216 2285 2354 2351 2348 2348 2349 2392 2436 2470 2504 2496 2487 2444 2401 2401 2401 2462
699 2462 2523 2483 2443 2457 2471 2443 2414 2368 2322 2298 2273 2324 2374 2381 2388 2390 2392 2373 2354 2320 2285 2294 2303 2301 2299 2297 2296 2272 2248 2224 2200 2173 2146 2097 2049 1967 1885 1874 1864 1858
694 1858 1853 1847 1841 1858 1874 1890 1907 1873 1840 1829 1817 1835 1853 1799 1746 1693 1640 1609 1577 1573 1570 1566 1562 1489 1417 1388 1359 1360 1361 1362 1362 1349 1335 1300 1265 1229 1192 1228 1306 1375
689 1375 1372 1341 1309 1336 1363 1322 1282 1256 1301 1350 1398 1441 1484 1506 1527 1488 1448 1430 1412 1416 1419 1444 1469 1462 1455 1427 1398 1442 1486 1530 1574 1541 1507 1474 1441 1438 1435 1432 1429
684 1429 1414 1398 1382 1366 1409 1452 1517 1582 1581 1580 1536 1493 1471 1449 1470 1492 1484 1476 1539 1603 1623 1643 1620 1596 1622 1648 1674 1700 1686 1672 1657 1643 1628 1613 1598 1583 1568
680 1568 1553 1538 1523 1531 1539 1546 1554 1576 1598 1577 1555 1503 1450 1441 1431 1453 1475 1497 1519 1490 1461 1475 1490 1479 1469 1502 1535 1573 1610 1605 1599 1629 1659 1618 1576 1592 1608 1603 1598
675 1598 1580 1563 1567 1570 1555 1539 1596 1652 1694 1735 1734 1732 1757 1782 1806 1831 1825 1819 1856 1893 1895 1897 1920 1944 1982 2020 1987 1953 1966 1978 1990 2003 1969 1935 1944 1953 1997 2040 2062 2084
670 2084 2113 2141 2127 2069 2027 2055 2109 2119 2087 2055 2121 2188 2177 2165 2133 2100 2124 2147 2242 2338 2359 2380 2358 2337 2344 2351 2380 2409 2436 2462 2489 2515 2530 2544 2536 2529 2500
666 2500 2472 2515 2559 2620 2681 2699 2717 2790 2864 2838 2811 2811 2812 2812 2812 2827 2843 2858 2873 2908 2943 2979 3014 3021 3029 3037 3045 3080 3115 3129 3142 3184 3226 3224 3180 3199 3290 3405 3477
661 3477 3473 3468 3482 3497 3534 3571 3565 3559 3568 3578 3630 3683 3740 3796 3810 3824 3864 3904 3965 4027 4051 4075 4142 4209 4281 4353 4446 4539 4535 4530 4569 4608 4702 4797 4870 4944 5030 5117
656 5117 5182 5247 5278 5308 5439 5570 5666 5762 5857 5953 6022 6090 6202 6314 6433 6552 6671 6790 6918 7046 7247 7447 7604 7761 7918 8075 8263
653 8263 8450 8681 8911 9131 9351 9599 9920 10240 10517 10780 11043 11358 11673 11988 12303 12661 13019 13420 13821 14257 14693 15172 15652
650 15652 16125 16598 17115 17631 18161 18692 19179 19666 20099 20532 20941 21350 21729 22064 22333 22529 22672 22772 22815 22757 22628 22426 22180 21891
647 21891 21541 21148 20733 20319 19850 19382 18842 18301 17782 17263 16744 16225 15703 15181 14680 14179 13699 13220 12812 12404 12028 11652 11255
644 11255 10858 10571 10285 9998 9711 9404 9096 8860 8624 8346 8067 7861 7654 7450 7247 7022 6797 6637 6478 6319 6160 6016 5871
642 5871 5727 5583 5461 5340 5219 5098 4996 4895 4793 4692 4622 4552 4482 4412 4366 4319 4201 4082 3982 3883 3883 3884 3841 3798 3734 3669 3632 3594 3556
638 3556 3518 3457 3395 3334 3272 3243 3214 3142 3069 3035 3000 2987 2974 2974 2974 2952 2931 2856 2781 2749 2717 2723 2729 2714 2699 2705 2710 2615 2520 2469 2419 2390 2360 2368 2376 2405 2434 2423 2412
633 2412 2357 2303 2272 2241 2232 2223 2198 2173 2169 2165 2108 2050 2065 2079 2098 2117 2093 2069 2021 1973 1947 1920 1940 1961 1938 1915 1842 1769 1740 1710 1762 1814 1826 1837 1845 1897 1921
629 1921 1873 1809 1745 1748 1751 1726 1702 1677 1652 1650 1648 1689 1730 1720 1710 1700 1690 1666 1643 1619 1596 1575 1555 1556 1557 1520 1484 1490 1496 1496 1495 1495 1495 1488 1482 1476 1470 1539 1608 1634 1660 1631 1602
623 1602 1616 1630 1653 1676 1656 1636 1581 1526 1514 1502 1481 1461 1440 1420 1400 1380 1338 1296 1336 1375 1372 1368 1383 1399 1417 1435 1422 1453 1499 1474 1387 1300 1309 1318 1331 1343 1356
619 1356 1369 1388 1408 1385 1362 1341 1320 1342 1364 1339 1314 1298 1325 1357 1346 1312 1278 1267 1256 1269 1325 1388 1409 1363 1318 1283 1248 1240 1274 1351 1428 1468 1437 1390 1344
615 1344 1316 1289 1255 1264 1297 1329 1324 1276 1252 1228 1251 1273 1296 1318 1323 1327 1298 1270 1248 1270 1315 1361 1370 1335 1304 1272 1252 1232 1211 1191 1221 1252 1285 1275 1234 1194 1177
610 1177 1204 1247 1290 1288 1287 1273 1303 1333 1319 1293 1266 1236 1207 1176 1145 1114 1083 1093 1102 1174 1245 1295 1303 1298 1294 1299 1305 1277 1249 1254 1301 1370 1397 1357 1318 1328 1381 1423 1421 1396
605 1396 1371 1418 1464 1498 1490 1463 1437 1417 1440 1468 1454 1402 1350 1378 1406 1408 1367 1334 1302 1304 1305 1302 1300 1298 1295 1317 1339 1360 1382 1363 1344 1325 1305 1323 1341 1308 1276 1253 1231
600 1231 1230 1230 1242 1254 1316 1378 1353 1328 1302 1277 1270 1264 1235 1207 1265 1323 1331 1339 1293 1246 1279 1311 1344 1376 1445 1513 1518 1523 1492 1461 1400 1338 1313 1287 1284 1281 1299 1318 1317 1317 1317
595 1317 1316 1277 1237 1198 1158 1174 1190 1206 1222 1213 1204 1194 1185 1205 1225 1195 1165 1145 1125 1127 1128 1108 1089 1105 1121 1175 1229 1248 1266 1245 1225 1204 1184 1160 1137 1136 1134 1187 1239
591 1239 1256 1273 1279 1284 1254 1224 1214 1203 1192 1181 1169 1156 1165 1174 1151 1129 1157 1184 1180 1175 1171 1166 1210 1253 1297 1340 1320 1300 1280 1259 1229 1198 1168 1137 1158 1179 1179 1178 1171 1164 1200
586 1200 1236 1253 1271 1288 1306 1323 1340 1285 1230 1216 1202 1209 1216 1253 1290 1227 1163 1162 1161 1138 1115 1133 1151 1169 1187 1220 1252 1242 1231 1196 1161 1169 1177 1168 1159 1192 1226 1257 1288
581 1288 1276 1264 1243 1222 1201 1180 1198 1216 1191 1166 1147 1129 1131 1134 1061 988 1016 1043 1122 1200 1207 1214 1212 1211 1231 1251 1283 1315 1326 1336 1355 1375 1437 1500 1489 1478 1467 1456
576 1456 1421 1386 1351 1316 1295 1274 1253 1232 1254 1276 1255 1234 1212 1189 1210 1230 1265 1299 1290 1281 1260 1240 1220 1199 1207 1214 1222 1229 1235 1240 1245 1251 1252 1252 1253 1254 1319 1384 1377 1370 1349 1329 1286
571 1286 1244 1246 1248 1250 1252 1237 1222 1279 1336 1369 1402 1457 1511 1549 1587 1525 1463 1400 1337 1346 1354 1373 1392 1315 1238 1208 1250 1276 1259 1213 1166 1160 1153 1133 1113 1136 1158 1180 1201
566 1201 1201 1201 1187 1173 1202 1231 1286 1340 1322 1305 1294 1283 1294 1304 1276 1248 1199 1150 1172 1194 1217 1239 1256 1273 1249 1226 1256 1330 1398 1394 1346 1298 1374 1451 1509 1568
562 1568 1555 1542 1515 1488 1503 1519 1528 1537 1474 1411 1413 1416 1439 1463 1444 1425 1405 1386 1391 1397 1402 1407 1432 1457 1484 1512 1546 1623 1717 1738 1707 1676 1662 1648 1597 1545 1536 1528 1537 1546 1534
557 1534 1522 1500 1479 1500 1522 1531 1540 1549 1558 1558 1557 1556 1555 1560 1564 1566 1567 1584 1558 1532 1548 1579 1610 1600 1590 1604 1618 1610 1603 1619 1635 1651 1667 1648 1629 1612 1596 1609 1666 1698 1730 1735
552 1735 1739 1744 1748 1752 1756 1759 1763 1781 1800 1797 1793 1793 1793 1752 1711 1720 1771 1804 1794 1780 1810 1840 1826 1788 1792 1842 1891 1919 1946 1995 2044 2065 2086 2090 2052 2020 2032 2084 2093 2056 2020 2028 2080
546 2080 2079 2078 2102 2125 2149 2173 2195 2216 2224 2188 2194 2242 2324 2363 2385 2408 2437 2466 2452 2481 2568 2697 2828 3002 3236 3543 3946 4421 4853 5098 5059 4776
542 4776 4385 3993 3704 3487 3301 3114 2958 2803 2694 2658 2681 2705 2694 2683 2667 2694 2722 2708 2674 2684 2733 2782 2765 2748 2744 2783 2838 2822 2763 2704 2713
539 2713 2721 2753 2784 2773 2761 2788 2814 2819 2824 2843 2862 2925 2987 3018 3049 3081 3112 3119 3127 3134 3142 3198 3253 3305 3356 3364 3300 3236 3243 3308 3373 3370 3367 3349 3332 3292 3253 3258 3263 3289 3315
534 3315 3376 3438 3499 3560 3608 3657 3662 3667 3663 3659 3698 3738 3722 3706 3711 3717 3718 3719 3721 3722 3743 3765 3743 3721 3740 3758 3777 3795 3864 3933 3930 3927 3952 3976 4001 4026 4070 4115 4116 4117 4070 4023
529 4023 3976 3928 3943 3957 3971 3985 3943 3901 3880 3859 3842 3824 3850 3876 3875 3874 3852 3830 3860 3890 3920 3950 3956 3962 3968 3975 4023 4072 4121 4170 4230 4290 4371 4453 4497 4542 4517 4492
524 4492 4540 4631 4778 5012 5331 5650 5990 6532 7311 8089 8353 7956 7240 6610 6178 5831 5570 5395 5282 5170 5045 5006 5018 5031 5014
521 5014 4997 4959 4920 4885 4850 4837 4824 4809 4794 4822 4850 4854 4859 4863 4867 4877 4886 4967 5047 5101 5155 5209 5263 5317 5371 5381 5392 5434 5475 5589 5702 5787 5871 5935 5998 6039
516 6039 6081 6144 6207 6253 6298 6415 6532 6668 6803 6896 6988 7063 7138 7256 7374 7503 7633 7785 7936 8131 8325 8568 8811 9009 9294 9659
513 9659 10024 10348 10672 11077 11568 12061 12555 13078 13644 14230 14901 15694 16573 17519 18464 19472 20566 21771 23062 24448 25920
511 25920 27438 28957 30409 31603 32229 31907 30365 27818 24827 21980 19611 17614 15901 14388 13127 12067 11128 10333
509 10333 9695 9142 8598 8054 7617 7280 6977 6674 6396 6162 5924 5686 5470 5296 5153 5010 4870 4730 4594 4458 4366 4273 4195 4117
506 4117 4060 4004 3903 3803 3721 3682 3619 3556 3495 3434 3393 3351 3353 3354 3331 3309 3286 3263 3251 3240 3228 3216 3183 3150 3074 2997 2963 2929 2938 2947 2977 3006 3017 2985 2941 2897
501 2897 2897 2896 2893 2932 3020 3107 3136 3164 3238 3354 3477 3556 3557 3515 3443 3370 3273 3176 3060 2945 2877 2852 2788 2724 2678 2675 2655 2592 2534 2477 2441 2404 2368 2404 2477
497 2477 2507 2497 2487 2481 2519 2551 2583 2585 2543 2486 2428 2409 2433 2455 2476 2490 2505 2562 2576 2512 2406 2296 2230 2223 2217 2213 2209 2156 2103 2082 2132 2173 2214 2255 2296 2292 2217
492 2217 2122 2070 2062 2054 2049 2044 2024 2003 1932 1862 1878 1895 1912 1929 1916 1903 1890 1877 1833 1790 1746 1703 1722 1741 1760 1779 1792 1806 1819 1833 1798 1764 1730 1696 1672 1649 1647
488 1647 1645 1674 1703 1668 1632 1661 1690 1719 1747 1776 1804 1768 1731 1717 1702 1687 1672 1680 1688 1660 1631 1598 1565 1510 1456 1437 1419 1465 1511 1535 1560 1548 1537 1518 1499 1501 1504
483 1504 1490 1477 1413 1349 1337 1326 1378 1431 1425 1419 1412 1406 1413 1421 1428 1435 1436 1437 1401 1366 1374 1382 1390 1398 1413 1428 1503 1578 1624 1599 1564 1529 1519 1509 1499 1489 1526 1564 1552 1539 1516 1493
478 1493 1433 1374 1364 1354 1344 1334 1342 1350 1395 1439 1478 1516 1490 1465 1398 1330 1285 1239 1248 1257 1301 1346 1328 1310 1327 1345 1383 1420 1535 1693 1786 1778 1679 1580 1545 1510
474 1510 1474 1439 1362 1284 1299 1315 1346 1376 1342 1309 1284 1260 1287 1313 1346 1380 1349 1318 1250 1182 1164 1147 1172 1197 1172 1147 1187 1227 1246 1265 1265 1264 1300 1335 1360 1384
469 1384 1345 1305 1310 1315 1342 1369 1305 1241 1198 1156 1142 1129 1115 1101 1090 1078 1103 1127 1123 1119 1079 1039 1074 1109 1144 1179 1217 1256 1245 1234 1236 1239 1292 1345 1309 1273 1258 1244
465 1244 1253 1262 1272 1281 1263 1245 1234 1266 1273 1208 1124 1112 1144 1175 1147 1119 1178 1237 1231 1225 1194 1163 1182 1202 1225 1248 1207 1166 1162 1158 1153 1149 1137 1124 1147 1170 1232 1294 1319 1345
460 1345 1295 1246 1246 1247 1236 1225 1192 1159 1139 1118 1118 1119 1149 1180 1175 1169 1155 1142 1149 1157 1156 1156 1155 1155 1150 1145 1141 1136 1132 1127 1123 1119 1141 1164 1136 1109 1102 1095 1066 1038 1044 1050 1055 1061 1072 1083 1094 1104
454 1104 1102 1100 1098 1096 1126 1156 1150 1144 1153 1162 1106 1050 1118 1186 1218 1250 1252 1254 1234 1214 1175 1137 1134 1132 1154 1177 1163 1150 1116 1083 1071 1059 1062 1065 1090 1115 1144 1174 1124 1075 1069 1064 1081
449 1081 1097 1105 1113 1121 1129 1124 1118 1134 1149 1150 1151 1102 1052 1072 1092 1111 1131 1138 1145 1152 1159 1163 1167 1150 1133 1067 1002 962 965 1007 1048 1044 1040 1031 1064 1110 1155 1161 1168 1175 1181 1163 1145 1126 1108 1107
443 1107 1107 1107 1106 1095 1084 1075 1067 1062 1100 1160 1177 1148 1120 1137 1153 1152 1107 1063 1062 1084 1106 1130 1155 1176 1197 1182 1167 1155 1143 1153 1162 1121 1081 1037 1037 1075 1113 1133 1152 1148
438 1148 1144 1119 1093 1108 1122 1125 1085 1040 996 984 973 940 907 951 995 1033 1028 1012 995 997 999 1026 1097 1151 1204 1211 1217 1215 1214 1191 1168 1135 1103 1071 1039 1038 1037 1035 1034 1065 1096
433 1096 1127 1158 1128 1098 1044 1034 1101 1169 1185 1157 1124 1090 1056 1023 1041 1102 1131 1089 1050 1054 1103 1110 1051 992 971 993 1018 1043 1035 1027 1048 1069 1068 1067 1062 1058 1017 976 965
428 965 953 941 930 913 896 958 1020 1032 1044 1034 1024 1016 1008 1000 992 1008 1023 1003 983 951 920 967 1015 1023 1031 1003 975 932 889 925 961 962 963 943 923 948 973 998 1023
424 1023 994 966 973 980 980 980 980 980 951 923 945 967 962 958 918 877 863 849 870 892 936 980 989 997 1030 1063 1060 1057 1031 1004 977 950 975 1000 1025 1050 1042 1034 1026 1018 1036 1054 1051
418 1051 1047 1006 965 975 984 988 993 998 1002 992 981 970 959 952 944 936 929 904 879 905 931 915 899 933 967 1013 1060 1056 1052 1084 1117 1100 1082 1042 1001 996 991 982 974 935 895 918 1012
413 1012 1106 1129 1106 1084 1107 1130 1127 1124 1142 1161 1188 1215 1192 1169 1156 1143 1130 1116 1072 1028 1049 1069 1066 1063 1024 985 951 916 881 846 861 875 854 833 849 866 883
409 883 900 906 912 918 924 917 911 905 899 901 903 884 865 877 889 937 986 966 946 927 907 886 865 880 894 884 874 842 810 833 856 833 811 805 872 944 973 948 924 932 941 957
403 957 973 989 1006 931 857 848 838 857 876 859 842 787 731 738 817 897 906 851 797 804 812 855 898 893 888 904 920 929 938 925 912 884 856 850 843 856 868 881 893 884 876 867
398 867 859 819 779 808 837 853 826 823 821 799 778 732 730 765 801 839 877 878 879 879 880 876 873 870 866 839 811 827 842 842 842 842 842 836 831 825 819 857 894 889 883 889 895 925 912 864 816
393 816 863 911 934 913 893 916 920 925 932 939 909 879 892 906 900 895 890 885 897 910 937 1007 1056 1032 980 928 923 917 912 906 885 863 884 906 916 925 935 945 951 956 962 968 923 878
387 878 879 922 941 917 896 918 961 1004 977 951 939 927 959 990 1008 1026 1044 1061 1044 1026 1048 1071 1065 1016 964 955 998 998 956 914 927 983 995 965 966 967 965 964 983
382 983 1002 1021 1040 1071 1102 1133 1164 1110 1057 1046 1036 1041 1046 1094 1142 1127 1112 1097 1082 1087 1092 1096 1101 1101 1101 1145 1188 1196 1204 1211 1219 1252 1285 1217 1150 1131 1112 1093 1073 1106 1138
377 1138 1213 1288 1288 1288 1245 1202 1178 1154 1172 1191 1194 1197 1200 1203 1237 1271 1263 1254 1211 1168 1197 1226 1227 1227 1270 1314 1314 1315 1387 1459 1464 1469 1474 1479 1490 1502 1470 1438 1385 1332 1336 1412 1473
372 1473 1491 1495 1498 1499 1500 1501 1502 1507 1512 1516 1521 1518 1515 1512 1508 1567 1627 1643 1659 1691 1723 1798 1873 1885 1897 1909 1921 1943 1966 2060 2154 2233 2311 2389 2467 2561 2656 2750 2844 2951 3057
367 3057 3092 3127 3078 3029 2980 2931 2903 2875 2846 2818 2795 2772 2749 2726 2701 2677 2652 2628 2596 2563 2531 2499 2479 2460 2462 2464 2505 2547 2546 2545 2543 2541 2611 2681 2683 2686 2689 2691 2742 2793
362 2793 2887 2982 3064 3147 3281 3502 3711 3919 4157 4481 4887 5293 5666 5952 6015 5821 5410 4999 4635 4313 4020 3813 3691 3569 3452
359 3452 3336 3249 3162 3118 3074 3110 3146 3110 3074 3037 3000 2963 2926 2901 2875 2807 2738 2728 2718 2751 2784 2874 2964 2974 2897 2828 2758 2684 2609 2646 2683 2720 2757 2800
355 2800 2843 2865 2886 2962 3038 3157 3275 3407 3539 3671 3803 3881 3960 3987 3928 3830 3733 3673 3613 3517 3421 3349 3276 3268 3304 3363 3336 3263 3189 3196 3275 3322 3327
351 3327 3288 3250 3198 3147 3127 3178 3301 3424 3479 3534 3550 3565 3508 3451 3382 3313 3265 3217 3135 3052 2991 2929 2933 2936 3011 3087 3138 3190 3174 3158 3183 3279 3378 3477 3513
347 3513 3549 3542 3535 3530 3525 3521 3516 3453 3389 3368 3347 3326 3305 3262 3220 3224 3228 3275 3323 3283 3244 3248 3251 3316 3381 3403 3424 3442 3459 3455 3450 3426 3402 3399 3396 3308 3220 3176 3131 3147 3164 3137
342 3137 3110 3128 3145 3162 3180 3209 3238 3339 3440 3449 3457 3486 3516 3530 3545 3516 3487 3454 3422 3389 3356 3323 3290 3215 3139 3053 2967 2925 2882 2841 2800 2856 2911 2928 2873
337 2873 2838 2802 2755 2709 2619 2529 2495 2461 2427 2393 2387 2380 2352 2325 2304 2284 2290 2339 2392 2446 2464 2482 2507 2490 2422 2354 2369 2455 2526 2553 2561 2570 2576 2581 2551 2521 2527 2533 2515
333 2515 2496 2478 2459 2451 2442 2368 2294 2264 2233 2223 2214 2173 2132 2072 2012 2008 2047 2065 2039 1993 1946 1890 1791 1700 1681 1697 1714 1693 1672 1672 1673 1648 1624 1623 1664 1678 1649 1571
328 1571 1493 1508 1567 1607 1604 1591 1622 1671 1677 1637 1597 1554 1512 1504 1497 1514 1487 1452 1417 1414 1412 1341 1270 1223 1218 1220 1179 1117 1055 1001 989 1016 1042 1042 999 980 961 935 910
323 910 896 925 939 953 967 981 998 972 947 921 928 892 844 797 800 803 785 767 737 707 713 720 737 754 750 745 727 708 671 633 681 772 829 814 770 725 741 757 751
318 751 744 737 730 724 718 690 662 711 761 760 759 755 751 712 672 670 667 700 733 747 760 723 686 669 653 600 547 547 546 546 546 584 622 624 626 591 556 599 643 683 723 698 673 664
313 664 655 646 637 650 664 699 734 753 773 716 659 668 720 738 684 627 570 588 606 651 696 661 627 637 647 656 666 654 641 629 616 607 597 623 649 629 609 639
308 639 669 673 676 629 582 540 499 536 573 603 633 642 650 670 690 645 557 496 507 549 548 510 471 480 489 459 429 464 498 563 628 621 614 606 599 591 584 590 597 603 610 601 593 585 576 558
303 558 540 543 546 569 591 542 492 500 507 514 521 546 570 551 532 568 603 598 593 585 620 675 657 596 579 605 630 624 617 610 604 592 581 569 557 566 576 585 594 612 631 607 582
297 582 604 625 603 539 491 514 522 486 467 491 537 539 488 480 517 554 558 562 544 526 545 564 583 602 549 495 484 474 494 514 556 598 596 595 572 549 535 521 551
293 551 580 586 592 576 560 507 454 443 433 475 517 516 514 486 458 454 449 473 539 622 632 565 499 499 499 504 509 514 519 482 445 408 371 392 412 433 454 498 543 566 588
288 588 622 655 616 578 527 477 470 463 467 472 476 480 437 393 392 392 423 455 486 518 487 457 498 539 534 528 545 561 591 621 608 594 592 590 631 672 662 652 599 546 503
283 503 461 490 520 514 507 458 409 442 474 507 539 503 466 501 537 532 527 544 561 575 590 605 619 589 559 528 498 502 506 488 470 460 450 483 516 500 484 468
278 468 453 442 432 444 455 431 406 424 443 384 326 337 348 349 307 289 343 422 457 478 499 537 576 514 452 407 362 418 474 472 469 467 465 487 508 487 465 478
273 478 491 483 474 427 379 396 413 432 451 419 388 374 360 411 462 491 520 528 535 527 518 459 400 412 423 470 518 479 440 401 362 359 356 353 351 402 454 505 556 532
269 532 508 463 417 389 361 355 348 377 407 400 394 382 370 409 447 445 443 462 482 441 400 424 448 446 445 464 484 480 475 471 467 482 498 513 529 537 545 553 561 517 474 452 430
263 430 446 462 478 494 499 504 474 443 401 360 318 277 279 282 335 387 365 343 357 371 409 447 435 422 398 375 401 427 439 451 441 431 442 454 415 377 408
259 408 439 492 545 522 500 478 456 441 426 462 498 460 422 407 436 435 391 374 357 353 349 393 437 458 435 413 433 484 534 523 512 474 437 422 406 425 445
254 445 496 546 575 533 470 450 435 420 407 394 406 418 448 479 513 505 485 464 438 411 395 423 467 511 493 475 423 372 327 355 411 424 401 378 411 443
250 443 414 384 378 414 448 482 516 550 581 612 610 565 520 518 526 535 510 485 454 424 368 356 371 385 366 347 383 419 432 401 374 390 379 368 348 328 358 388
245 388 396 404 411 419 380 341 299 300 367 434 477 478 456 435 411 387 373 358 366 373 357 342 352 406 433 460 468 476 500 525 506 487 485 482 480 477 481 485 489 493 456 419 383 346
240 346 357 368 379 389 383 377 414 451 476 501 426 351 348 345 414 483 486 489 491 494 466 438 410 382 396 411 425 440 401 362 345 328 376 424 429 434 457 481 403 326
235 326 322 317 355 393 378 363 369 376 397 418 367 317 338 358 379 400 443 486 457 428 442 455 447 438 423 408 437 465 481 497 470 443 456 469 439 409 390 371
230 371 373 375 416 458 521 584 546 509 471 433 430 427 424 421 380 339 341 342 381 420 415 411 445 480 442 405 375 344 386 427 450 472 451 430 443 457 449 441 396 352 350 349
225 349 372 395 375 355 303 252 300 349 352 355 337 318 326 333 362 391 386 382 398 415 445 474 460 447 422 397 415 433 434 434 435 436 439 443 446 450 452 455 458 461 458 456 453 451 449 448 446 445
219 445 443 442 441 439 429 420 410 400 458 517 503 490 420 350 409 468 543 618 593 567 508 448 432 415 423 431 417 404 388 373 379 386 402 418 434 450 444 438 431 425 417 410 380
214 380 351 311 270 273 276 284 292 322 353 361 369 355 342 383 424 422 421 442 464 443 422 412 402 414 426 463 500 486 473 443 414 420 426 456 485 478 471 439 408 397 387
209 387 382 376 406 437 468 498 479 460 468 476 484 492 472 451 430 410 429 448 431 415 439 464 467 470 430 390 350 310 319 327 336 345 359 373 352 330 354 378 366 354 400
204 400 445 470 422 372 365 379 393 436 478 441 404 383 362 363 363 390 416 443 470 514 559 568 506 422 381 376 372 375 378 360 342 337 332 392 453 443 433 424 414 413 412 446
199 446 481 477 473 447 422 425 428 432 435 412 388 364 341 367 393 384 374 404 433 455 406 355 348 376 404 405 405 406 406 415 423 431 439 439 438 437 437 415 394 372 350 339 328 353 377
193 377 403 429 455 481 470 459 412 364 334 304 325 345 328 310 357 405 444 484 445 406 389 372 406 439 447 456 500 543 540 536 533 529 489 449 410 370 340 310
189 310 344 379 391 404 437 471 453 435 417 400 422 445 431 418 393 367 378 388 363 338 378 417 446 474 452 431 424 417 410 403 413 424 384 344 348 352 377 402
184 402 384 365 397 429 408 387 366 345 359 372 435 499 502 505 508 511 476 441 406 371 372 373 374 375 376 378 379 380 387 394 401 408 399 391 382 374 317 260 275 290 294 298 259 220 266 312
178 312 357 403 424 445 466 487 466 444 444 444 456 468 437 406 386 366 346 326 322 318 314 310 350 389 386 339 305 342 382 379 344 308 313 318 335 353 392 431 380 328
174 328 320 312 315 318 321 324 363 401 440 478 438 397 400 402 397 392 344 296 344 392 440 487 452 417 424 432 415 398 403 407 380 353 369 384 420 456 449 442 420 398 419 440 426
168 426 412 376 340 320 300 322 345 324 302 324 345 367 389 411 433 359 285 283 281 315 350 341 332 314 295 276 258 266 273 324 375 359 344 371 398 391 385 400 415
163 415 400 386 372 358 365 372 379 386 369 351 377 403 410 417 424 431 421 411 401 391 379 368 356 344 383 422 417 413 383 353 366 379 380 380 360 339 343 346 392 439 447 456 443
158 443 430 385 341 339 338 360 383 384 385 374 363 351 340 358 376 394 412 401 390 379 368 370 371 373 375 376 377 378 379 385 391 398 404 435 466 496 527 513 500 465 429 394 359
153 359 366 374 357 341 346 351 373 396 375 354 396 438 437 435 422 409 396 383 342 302 261 220 251 281 290 299 288 277 309 341 319 296 295 294 300 306 312 317 338 359 380 401
148 401 404 407 410 412 426 441 455 469 455 441 427 413 362 310 303 339 344 305 288 313 344 332 319 350 402 410 374 338 359 380 400 421 404 387 370 425 499 529 486
143 486 400 361 365 382 400 409 374 319 306 354 403 432 462 473 484 496 507 473 439 381 366 360 353 350 346 359 372 385 398 379 360 320 279 238 196 173 193 260
138 260 327 354 381 383 385 365 346 381 416 408 401 410 420 430 440 450 461 472 483 478 472 466 461 434 408 403 398 417 437 413 389 381 374 385 396 424 409 375 341 336 331 347 363
133 363 421 479 461 399 362 325 329 332 375 418 417 416 426 436 425 413 403 393 383 373 359 345 375 404 396 388 380 372 386 401 372 344 323 303 325 348 376 404 388
128 388 373 370 367 385 403 387 371 399 426 473 521 496 472 436 400 406 413 417 420 423 427 419 412 404 397 392 386 424 462 447 432 439 445 430 415 422 428 421 414 407 399 437 474 439 405 376
123 376 348 363 378 372 365 337 310 278 246 270 365 459 482 449 415 395 375 356 336 294 253 283 313 321 328 306 328 375 350 300 294 359 424 420 415 462 509 513 517 507
118 507 497 488 478 431 383 336 289 352 415 435 455 463 471 458 445 426 407 366 325 331 336 385 434 419 403 367 330 326 322 318 314 321 328 335 341 371 400 429 458 464 469 431 393
113 393 405 416 428 439 441 443 445 447 429 411 415 418 368 319 313 306 371 437 481 524 486 449 411 373 385 398 432 466 516 566 544 523 508 493 478 463 434 405 333
108 333 261 279 296 357 418 423 428 433 438 444 450 457 463 444 424 383 342 358 374 347 320 300 280 303 326 342 359 376 392 354 316 321 326 380 433 415 396 393 390 386 383 386 389
103 389 392 395 403 412 420 428 395 361 327 293 275 256 310 363 361 359 371 426 480 461 414 366 367 368 369 369 375 381 365 349 372 395 375 355 340 325 352 380 389 397 406 415 446 477
97 477 464 452 490 527 521 516 494 473 473 473 503 533 520 507 467 426 429 431 486 542 537 461 403 346 327 307 322 336 350 364 341 319 339 360 455 550 559 497 468 482
92 482 474 424 367 381 420 416 370 325 349 372 388 404 347 291 303 315 327 339 365 390 416 441 411 381 351 320 299 279 301 323 308 292 298 304 329 354 335 317
88 317 342 367 371 374 377 379 381 383 363 342 322 301 306 311 316 320 333 345 358 370 367 364 342 320 348 419 439 388 348 381 435 447 389 330 324 390 477 491 450 409 391 374
83 374 353 376 454 532 555 507 474 484 452 376 310 316 374 390 372 354 334 314 297 281 286 291 285 278 312 347 399 408 373 337 340 385 407 428 430 432 434 436 443 450 462 431
77 431 396 404 428 453 394 336 296 299 339 378 372 324 295 267 279 291 343 395 429 419 384 350 331 356 389 422 385 306 276 317 340 319 312 305 295 286 278 270 262 254 280
72 280 306 318 287 254 292 332 301 250 272 344 374 333 292 292 291 268 246 270 338 377 417 415 414 400 385 370 356 375 394 346 298 323 420 477 462 415 412 429
68 429 402 389 419 471 479 451 466 497 528 529 531 554 577 528 479 472 466 482 498 514 530 510 490 472 455 460 508 572 565 518 470 462 453 451 448 468 487 462 438 435 432 397
63 397 363 400 438 432 427 422 416 455 494 489 485 444 403 463 522 542 561 559 557 538 519 522 524 494 463 505 546 505 464 494 525 523 522 564 606 557 508 481 453 459 464 470 475 456
57 456 438 490 543 544 544 566 588 605 622 639 656 634 612 662 712 693 675 656 638 617 597 577 556 542 527 556 584 596 608 620 632 654 676 677 677 636 595 601
53 601 651 661 671 684 697 676 656 635 615 620 625 655 642 602 563 565 566 600 634 690 745 760 776 796 774 717 703 736 770 754 782 857 933 893 854 857 861 826 791
48 791 775 801 825 849 859 826 737 690 743 796 812 785 804 823 793 764 833 901 901 858 856 896 904 870 894 989 1060 1132 1225 1317 1328 1267 1203 1140 1068 996 1021
43 1021 1047 1030 969 981 1035 1059 1083 1153 1223 1233 1243 1332 1465 1588 1754 1971 2087 1952 1716 1616 1589 1476 1321 1350 1480 1495 1468 1596 1824
40 1824 1910 1923 2177 2618 2955 3248 3866 4727 5442 6300 7926 10384 13329 17565 24688 33792 40191 39383 32046 23244 17161
37 17161 13806 11270 8877 7186 6156 5224 4248 3632 3331 2986 2498 2210 2122 2002 1739 1612 1629 1570 1425 1346 1411 1424 1393 1503
34 1503 1758 1913 1867 1715 1564 1362 1160 1031 989 884 736 684 718 686 568 479 533 650 680 682 683 657 632 624 616 587 558 567 576 585 594 647 700 705
30 705 625 541 542 560 534 522 553 582 567 555 543 528 514 530 547 564 580 639 698 707 630 572 557 556 554 527 499 471 444 448 453 444 392 360 413 482 509 495 481
25 481 421 361 341 320 342 364 371 379 387 395 405 416 426 436 428 420 411 403 446 488 512 493 469 445 440 434 458 482 503 524 525 482 424 366 354 386 394 402 390 378 369 359 358
20 358 401 443 442 419 397 374 352 327 346 369 349 333 389 469 505 465 425 401 420 410 401 373 345 356 366 377 388 409 430 406 339 283 271 303 335 362 390
16 390 374 359 367 375 369 319 297 347 400 409 395 380 406 432 459 485 512 538 510 482 454 426 403 380 358 335 328 321 342 319 290 305 320 291 281 315 388 418 379
11 379 339 316 335 372 409 430 408 386 363 338 313 279 245 282 320 317 314 311 308 323 339 351 364 344 282 198 157 160 163 212 261 310 359 336 313 289 264 261 258 349
6 349 439 429 419 404 390 397 404 417 430 422 414 377 341 305 269 268 267 309 351 342 334 347 360 367 374 402 430 375 320 308 296 298 301 325 348 319 289 332 374 390 406 378
1 378 351 324 297 342 386 402 418 363 307 274 242 282 321 350 378 428 478 493 509 482 455 436 417 398 379 420 461 429 398 379 360 384 408 393 378 385 392
-4 392 344 296 319 343 366 390 414 437 439 441 421 401 389 376 406 437 456 476 424 372 338 303 290 278 258 239 241 243 265 288 289 290 313 336 400 464 490 473 411
-9 411 349 332 359 404 377 305 277 293 353 382 369 340 310 344 378 412 446 432 419 405 392 391 391 391 390 386 382 377 373 389 406 441 476 487 455 406 358 360 405 428
-13 428 408 359 310 301 293 291 289 287 285 297 309 322 334 324 315 349 382 383 383 383 384 372 361 349 337 333 330 369 408 406 405 423 440 435 386 338 333 347 361 335 309 362 415 449
-19 449 440 421 403 425 447 418 389 376 406 441 432 407 382 410 438 425 413 386 402 463 524 518 468 440 455 495 535 506 476 448 419 366 356 414 472 476 407
-23 407 343 322 343 365 367 370 351 332 299 266 276 286 280 275 312 350 398 447 452 457 385 312 282 252 281 310 295 281 307 332 336 340 305 270 257 243 251 259 289 319
-28 319 303 286 248 210 192 174 286 397 417 436 412 389 357 326 337 349 330 310 291 272 266 261 278 295 306 318 286 255 267 279 334 390 403 417 387
-33 387 358 370 383 374 365 341 318 337 356 362 368 374 379 330 280 273 266 285 303 321 339 337 335 332 330 339 349 358 367 368 368 368 369 360 351 343 334 308 282 299 316 318 320 343 366 350 333 274
-38 274 214 231 248 336 425 402 380 379 379 362 345 328 311 283 255 270 285 323 361 328 294 303 312 299 287 310 334 357 381 363 345 349 353 329 304 323 342 331
-43 331 321 310 300 260 220 223 226 242 259 275 292 318 343 369 395 366 338 331 324 331 339 360 424 448 387 309 274 274 273 253 233 258 283 307 332 375 419 362 305
-48 305 302 299 296 292 298 304 267 230 230 229 272 315 349 383 345 307 307 306 327 348 379 410 397 385 396 407 374 342 336 329 323 317 350 382 414 447 423 399 375 351 319 287
-53 287 299 310 316 322 328 334 322 311 300 289 319 348 377 406 438 469 399 330 290 250 282 314 313 312 332 353 379 406 360 315 301 287 316 345 345 345 367 388 407
-58 407 426 423 420 415 411 406 401 395 389 383 377 380 383 383 384 405 383 342 373 427 437 347 257 270 283 295 308 324 339 333 328 296 264 275 286 288 290 270 251 264 276 268 259 271 282
-63 282 294 306 309 312 315 318 306 294 304 313 344 375 362 350 340 330 320 309 290 270 294 318 310 303 318 332 337 342 347 353 338 323 309 294 269 243 261 279 325 371 316
-68 316 262 255 248 284 321 338 356 374 391 359 327 317 306 309 312 272 231 212 193 217 241 239 238 236 234 291 348 384 419 394 368 385 403 423 443 363 283 266 249
-73 249 275 301 368 436 460 484 411 339 309 280 294 307 321 335 363 391 420 448 456 464 429 393 394 395 396 397 377 358 317 276 282 288 250 213 194 175 200 224 270
-78 270 316 363 409 429 448 396 344 365 386 407 428 398 368 381 394 390 387 340 293 281 269 300 331 336 341 367 394 374 355 335 315 357 399 398 397 371 345 319
-82 319 292 267 242 260 278 284 289 295 300 292 285 320 355 372 389 334 280 292 304 316 329 342 355 368 381 386 391 396 401 436 472 407 342 308 275 314 352 344 336 327 319 343
-88 343 366 389 413 408 403 398 393 387 382 355 328 301 275 291 308 281 254 229 205 241 320 394 396 366 335 372 409 410 412 392 372 360 347 334 321 309 296 283 270 270
-92 270 270 292 314 296 279 304 330 342 354 409 464 465 466 445 424 397 369 342 314 310 305 301 296 337 378 376 374 351 328 306 283 306 329 351 374 361 347 355 363 353 342
-97 342 375 408 400 392 384 377 390 404 396 389 346 303 332 361 354 348 319 291 309 327 345 363 307 252 296 341 343 344 346 348 359 370 339 307 324 342 359 376 365 353 363
-102 363 373 343 312 324 337 366 396 353 311 329 348 344 341 338 335 332 329 330 331 289 247 230 214 270 325 368 412 355 298 291 284 299 315 307 300 314 328 308 287 310 333
-107 333 345 357 347 338 322 307 291 276 271 266 283 300 333 366 356 346 339 333 305 277 299 321 343 366 357 348 339 330 344 358 329 300 281 262 314 367 379 390 330
-112 330 270 266 261 300 338 362 385 365 346 326 307 266 226 189 152 158 164 184 205 247 289 307 325 342 360 323 286 293 299 322 344 346 347 318 290 261 232 243 254
-117 254 265 275 260 245 230 214 256 297 295 293 315 337 316 295 286 276 245 214 221 229 258 287 281 275 269 263 258 254 321 388 424 460 424 389 381 373 365 357 344 331 361 391
-122 391 363 335 378 422 425 428 388 347 333 318 347 375 352 329 328 326 314 302 305 350 383 343 280 259 296 333 351 370 361 352 322 292 265 237 210 182 211 241
-127 241 229 218 233 291 326 290 223 228 289 349 337 324 333 342 309 276 286 296 289 281 317 353 406 460 443 425 420 414 409 404 358 313 268 222 214 205 196 188 258 329 328 327
-132 327 313 299 357 416 400 384 368 352 341 329 318 307 314 322 329 336 320 304 289 273 272 270 269 268 333 399 392 386 368 351 377 403 400 397 394 391 371 350 330 309 262 215
-137 215 211 206 262 317 330 342 358 374 390 406 407 409 410 411 414 416 375 334 312 291 269 247 240 233 269 304 301 297 294 291 290 289 289 288 296 305 313 321 333 345 314 283 238 194 192 191 224
-143 224 258 248 239 248 258 267 277 347 418 416 415 400 385 370 354 329 304 279 254 266 279 291 303 338 372 455 452 372 292 278 264 281 297 314 331 326 322 274 226
-148 226 224 221 218 216 265 314 320 326 326 326 325 325 306 287 267 248 209 170 203 236 259 283 263 244 277 311 301 291 300 309 318 327 362 397 389 381 341 301 333 365 353 342 331
-153 331 319 328 337 346 354 347 340 332 325 318 311 304 297 335 373 411 449 428 407 386 365 341 317 293 269 304 340 332 324 343 362 381 400 349 299 291 284 273 262 294 326 304 282
-158 282 260 239 271 303 292 281 313 345 377 409 350 292 305 361 362 291 239 230 229 229 232 234 249 264 236 208 227 246 266 285 281 277 273 269 259 250 240 230 245 259
-163 259 274 288 285 283 280 278 332 386 368 350 329 308 287 266 275 284 314 344 350 356 384 411 400 390 379 368 353 338 272 207 233 260 287 314 326 338 351 363 344
-168 344 326 329 332 366 400 383 367 343 319 331 343 363 384 404 425 448 472 459 446 432 419 354 290 269 248 263 277 274 270 266 263 219 176 212 247 244 240 236 232 250
-173 250 268 221 175 188 201 214 227 234 242 249 257 272 288 324 361 357 353 349 345 332 318 341 363 382 400 369 337 356 374 372 369 336 303 305 308 265 223 230 237 299 362 345
-178 345 328 312 295 315 335 340 346 352 358 351 344 358 372 372 372 321 270 266 263 295 326 367 407 382 358 371 384 361 339 310 282 289 296 312 327 342 358 344 331 317 303
-183 303 308 313 318 322 292 261 266 272 300 328 306 283 284 284 321 357 380 403 361 319 287 255 288 321 351 381 361 340 288 235 247 259 274 290 305 320 293 266 261
-188 261 256 264 271 258 244 298 353 357 362 351 341 330 320 318 316 364 413 448 482 423 322 259 268 298 329 318 306 295 284 253 221 240 259 285 311 316 320 327 334 341 348
-193 348 323 298 295 291 256 220 206 192 214 236 258 280 287 294 332 370 394 347 265 227 268 309 317 325 289 254 269 284 340 395 372 349 298 248 248 248 292 336 358
-197 358 381 362 343 345 348 362 376 340 304 294 284 339 393 375 356 315 275 277 280 282 284 275 265 305 346 357 369 359 350 344 339 333 328 349 370 355 340 341 342 321 300 259
-202 259 218 226 235 256 277 262 247 259 271 284 296 344 393 362 332 249 166 163 159 193 227 261 295 282 269 256 243 238 234 230 226 231 235 240 245 259 272 286 299 293 287 281
-208 281 274 294 313 333 352 327 301 312 322 306 291 311 331 342 353 314 274 301 327 353 379 340 301 327 353 317 282 269 255 275 294 311 328 330 288 246
-212 246 247 276 305 313 320 342 321 288 255 255 254 254 253 297 340 381 422 417 368 284 243 291 338 336 291 259 269 303 337 339 341 321 301 302 302 280 259 266 273 244 215 225
-217 225 235 245 256 282 309 314 276 240 277 335 392 391 389 388 386 378 370 343 316 261 249 278 307 319 331 343 355 332 308 321 334 340 346 330 314 297 280 285 290 274
-222 274 259 294 329 349 369 367 365 359 353 346 340 308 277 245 214 224 235 240 288 360 389 349 267 220 216 236 256 290 323 334 301 268 278 306 291 260 229 231 232 237
-227 237 242 269 296 277 258 239 221 203 186 212 238 268 298 285 272 291 310 285 261 290 319 348 377 360 342 368 393 386 378 370 363 342 321 343 365 329 293
-231 293 301 308 321 333 346 359 319 279 238 198 241 285 285 285 300 315 330 345 290 234 221 208 262 315 326 336 311 285 303 320 279 238 241 243 244 244 224 203 187
-236 187 172 200 227 266 304 321 338 304 270 280 332 382 360 338 316 309 302 273 244 276 308 297 285 317 349 379 408 374 296 243 262 313 321 257 193 195 198
-241 198 222 246 276 307 316 326 315 304 271 239 235 231 270 310 310 310 332 354 354 354 333 311 332 353 330 308 266 223 252 282 288 294 279 264 227 190 197 203 238 272
-246 272 263 255 226 197 210 224 266 307 327 346 273 200 227 297 338 307 292 320 359 355 356 356 392 428 421 414 380 347 334 322 326 329 333 336 345 354 363 373 322 271 248 298
-251 298 357 374 347 320 292 265 309 353 380 406 389 372 358 344 352 359 340 321 280 239 274 309 300 292 319 346 371 395 363 288 240 264 296 329 323 317 326 335 301
-256 301 267 251 235 240 246 254 263 229 194 242 290 240 191 229 310 354 298 228 200 214 228 215 203 212 221 273 325 375 353 289 225 228 231 238 245 230 216 248 280 311
-260 311 343 367 392 344 297 319 342 343 344 331 317 326 334 330 326 307 246 169 165 218 271 235 200 194 259 335 367 355 299 245 233 238 243 202 161 150 209 279 306 290
-265 290 273 281 288 295 302 313 324 291 259 233 207 181 156 153 149 146 143 162 180 176 173 203 234 221 208 224 240 213 186 207 227 248 268 245 221 241 261 239 217 238
-270 238 259 272 284 318 353 363 373 340 308 325 343 317 248 193 210 284 358 353 347 342 336 362 388 343 297 252 207 234 261 304 348 294 240 225 252 283 270
-275 270 212 197 227 256 276 295 293 291 277 262 248 233 224 215 227 240 266 291 274 257 238 218 220 222 216 211 248 286 326 366 363 361 373 386 379 330 278 226 244 261
-280 261 282 302 301 300 298 295 292 290 269 249 229 209 236 263 287 312 314 273 232 234 287 341 328 315 325 377 403 357 286 214 212 253 291 286 239 192 188 228 271 270 245
-285 245 263 322 382 379 332 307 325 354 382 389 396 398 357 295 275 294 313 313 313 308 303 257 212 205 241 253 265 285 305 331 313 272 273 319 366 366 366 345 324 286 248
-290 248 232 215 215 215 193 171 169 168 202 236 233 231 228 225 244 263 280 296 298 256 238 220 224 227 228 229 255 238 195 152 165 178 213 248 253 258 257 300 343 344 277 211 207 202
-295 202 197 193 207 222 186 151 162 173 137 101 142 226 266 234 188 213 269 281 253 226 246 266 260 253 269 284 271 258 267 276 281 286 270 254 274 295 293 292 268 244
-300 244 256 268 287 306 304 301 330 359 364 326 270 257 282 307 282 256 231 206 234 261 286 310 302 252 184 189 269 348 337 283 259 278 297 272 254 279 338
-304 338 353 331 310 288 267 255 287 340 351 326 302 311 320 315 310 306 301 293 285 276 268 287 306 324 343 308 272 237 202 166 129 172 215 273 330 366 403 379 355 331
-309 331 307 317 327 337 347 357 367 377 387 401 415 429 443 437 432 426 420 394 368 342 316 320 324 328 333 298 264 280 296 306 316 305 293 314 335 320 304 306 308 288
-314 288 269 265 261 293 325 305 285 300 316 352 387 344 300 273 246 283 320 356 391 377 362 376 390 368 346 319 291 314 337 321 305 289 273 299 326 302
-319 302 278 277 275 274 273 253 234 265 295 296 297 276 255 261 267 309 350 330 310 326 341 315 289 313 337 348 360 349 339 314 290 286 283 266 250 293 336 362 317 266
-324 266 258 279 301 275 249 226 204 203 202 206 210 213 217 220 224 227 231 253 276 299 322 342 362 320 279 277 318 343 295 220 187 234 280 253 225 198 170 216 261 256 208
-329 208 191 247 319 349 319 288 305 323 294 266 237 208 258 307 356 406 333 261 268 274 272 269 266 264 253 242 231 221 215 210 255 300 295 290 263 237 252 267 283 298
-333 298 354 410 387 365 321 277 283 289 229 168 155 214 291 297 254 211 233 256 229 201 223 246 268 290 280 270 295 321 330 339 348 358 333 308 320 331 343 355
-338 355 316 278 280 283 285 287 313 339 329 319 308 296 306 316 344 371 337 303 296 332 352 300 213 170 220 270 290 310 266 222 216 211 241 271 272 273 273 274 283 292 301 310
-343 310 300 291 302 314 306 298 326 354 311 268 261 254 303 352 380 407 377 348 339 331 279 228 227 226 253 280 256 233 234 235 236 237 212 187 197 208 261 315 319 323 291 259
-348 259 278 296 305 313 322 330 268 206 180 226 285 301 295 290 271 251 254 256 272 288 282 276 274 273 293 313 313 312 333 397 426 383 308 276 288 300 315 329 321 312 304 296 297 299 300
-354 300 302 283 265 247 229 241 254 266 278 245 211 174 181 209 237 225 213 213 213 234 256 266 277 266 256 245 235 246 258 239 221 246 314 399 413 369 325
-358 325 333 340 347 355 361 367 375 341 265 190 196 274 326 306 260 213 186 158 147 178 228 234 224 214 236 258 259 260 266 272 278 285 270 256 263 270 292 314 293 272 253 234 230 270
-364 270 301 288 254 263 278 251 183 158 191 224 217 210 206 202 198 194 240 286 261 235 240 244 248 252 280 309 318 284 244 205 184 164 186 209 232 255 295 335 304 272 235
-369 235 199 205 211 231 250 248 246 245 244 265 285 279 273 245 218 234 250 267 283 309 334 359 385 382 378 332 286 254 221 232 243 235 226 260 295 327 359 348 338 325 313
-374 313 301 289 308 328 326 323 304 284 307 331 311 292 272 252 268 285 301 317 321 325 257 189 154 119 156 193 251 309 295 281 284 288 271 253 260 266 251 236 228
-379 228 220 233 247 237 227 260 294 308 322 293 264 231 199 210 221 253 286 297 309 242 175 147 220 314 337 276 216 197 179 203 227 243 260 233 206
-383 206 213 220 227 234 227 220 213 205 234 262 248 233 217 201 185 168 189 209 187 164 167 171 217 264 249 235 263 291 283 275 266 258 289 319 307 295 301 306 269 232 229 227 225 222 250
-388 250 278 263 248 240 231 222 214 265 316 296 276 296 315 292 226 163 172 209 247 278 309 285 189 127 138 204 270 264 257 250 243 292 341 318 295 288 281 274 267 285 303
-393 303 320 338 334 331 305 280 251 222 264 307 293 278 221 163 165 167 212 256 263 270 320 370 340 309 278 248 263 278 294 309 301 292 283 274 270 265 303 341 310 278 290
-398 290 345 352 287 243 272 346 377 336 295 254 213 193 173 220 266 312 359 307 256 204 153 156 159 162 165 179 192 244 297 329 289 194 99 74 121 170 220
-403 220 248 277 306 335 302 270 238 206 214 223 231 239 227 216 247 278 280 281 240 199 177 155 205 254 269 283 276 269 298 327 285 242 230 218 248 279 321 364 380
-408 380 323 245 238 287 336 318 300 283 265 312 358 333 308 297 286 296 307 311 315 340 365 368 370 351 332 288 244 243 243 259 275 270 265 251 238 268 298 280 263
-412 263 267 272 261 250 260 271 282 294 262 230 228 226 246 265 255 245 235 225 259 293 255 217 212 206 237 267 311 355 349 343 300 256 237 217 261 349 402 384 350
-417 350 315 313 310 317 323 330 337 359 381 354 283 216 221 271 279 269 260 284 307 270 233 260 287 332 377 371 365 327 289 302 314 305 296 306 316 281 203 159 186 238 289
-422 289 252 215 213 211 245 279 275 271 268 264 285 306 291 276 289 302 265 228 250 273 295 318 291 264 287 310 305 300 259 219 221 223 276 329 371 414 407 327 255 225
-427 225 274 323 340 357 338 319 304 289 309 330 317 304 327 350 354 359 363 367 366 365 314 263 267 270 310 349 326 303 280 257 252 247 278 308 258 209 209 210 253 296 261
-432 261 225 242 259 312 365 332 298 300 303 353 404 376 348 342 336 309 281 240 198 221 244 176 107 132 157 175 192 189 185 199 214 207 200 195 190 185 180 186 193 199 205 209 213 217
-437 217 221 253 285 281 277 232 188 265 342 394 445 418 390 340 291 331 372 357 299 247 266 290 314 321 328 338 349 309 269 252 235 218 201 157 113 148 183
-442 183 251 320 309 299 279 260 288 316 293 227 195 235 289 342 307 272 247 222 219 216 233 250 288 326 274 223 221 220 197 173 171 169 127 85 79 145 178 169 164
-447 164 202 263 323 336 349 334 320 305 290 273 256 240 223 220 217 236 254 272 290 272 253 267 281 294 308 338 369 387 363 324 285 265 245 233 221 245
-451 245 269 269 270 289 309 322 292 240 232 247 263 260 257 246 235 272 308 333 315 271 227 233 239 223 207 238 269 300 330 311 292 273 254 258 262 266 270 261 253 222 192
-456 192 183 173 200 226 270 313 350 314 248 225 263 302 300 254 242 273 283 250 220 233 252 271 258 244 256 267 282 253 194 134 151 168 168 169 190 255 297
-461 297 268 236 247 274 302 283 263 257 251 223 195 213 230 268 307 265 224 204 185 230 275 285 294 280 265 316 366 349 332 315 299 281 263 244 226 246
-465 246 265 284 304 296 289 281 274 275 277 278 280 296 312 293 273 276 278 281 283 293 302 290 278 256 234 248 262 278 294 245 197 186 176 216 256 263 270 256 241 253 264 275
-470 275 286 316 346 325 305 326 347 318 289 281 274 266 258 309 360 346 333 306 280 275 270 268 266 214 162 188 214 276 338 352 367 360 352 339 326 263 200 218 236 255
-475 255 273 287 302 280 259 230 201 265 330 370 410 372 333 322 311 336 361 361 361 339 318 256 194 203 213 248 284 298 312 295 278 261 244 235 225 216 206
-480 206 243 279 316 352 351 350 306 262 266 271 233 194 168 143 213 283 343 331 288 244 256 267 279 290 279 267 256 244 242 239 280 321 343 366 316 267 258 249 219
-484 219 188 202 215 250 285 268 252 257 261 230 198 238 278 279 280 281 282 296 311 325 340 316 292 290 288 289 290 248 206 228 249 270 292 299 306 311 316 285 210 160 182 255
-490 255 284 242 200 169 139 108 78 117 156 196 235 260 286 268 250 279 309 267 225 224 223 200 177 203 228 254 280 255 231 250 269 303 338 300 263 262
-494 262 261 221 182 181 265 284 216 127 124 167 211 214 216 240 264 251 238 224 211 264 316 297 278 264 250 237 223 272 321 329 293 270 334 395 369 330 290 288
-499 288 286 262 237 256 275 226 177 171 166 207 249 269 288 317 345 330 315 298 282 287 291 291 291 291 291 272 253 277 301 313 325 316 306 277 248 262 276 271 266 240 213
-504 213 186 158 173 188 183 178 215 253 286 320 281 243 232 221 211 200 207 215 222 229 220 211 245 278 274 269 221 173 196 220 286 352 351 350 327 304 291 278 308 339 300
-509 300 261 265 270 292 315 287 260 279 298 267 236 226 216 206 196 178 160 193 225 239 253 267 281 235 190 195 200 221 242 263 284 296 307 269 230 260 290
-513 290 270 249 234 218 276 334 355 289 223 156 191 226 226 225 234 243 231 218 216 214 233 252 275 298 321 344 312 281 300 318 337 355 309 263 294 324 355 385
-518 385 331 277 272 268 264 259 290 322 338 354 305 257 273 289 327 365 362 358 305 251 246 241 235 230 236 243 228 213 238 264 239 214 208 202 196 190 177 164 187 210 204 197 256 314
$$ [...]
-1604D54
##END=	
##END=	
##END=	
