##TITLE=	Jul15-2016.30.fid
AD37

##JCAMP-DX=	6.0	$$ MestReNova 14.1.1-24571
##DATA TYPE=	LINK
##BLOCK_ID=	1
##BLOCKS=	1    
##ORIGIN=	Mestrelab Research S.L.
##OWNER=	hrzepa
##$MNOVA/LINK_BLOCK_TYPE=	ITEM	$$ NMR Spectrum
##$MNOVA/ITEM/POLYGON=	(XY..XY)
5321,5835
8722,5835
8722,8208
5321,8208
5321,5835
##$MNOVA/ITEM/Z=	0
##$MNOVA/ITEM/ANGLE=	0
##TITLE=	Jul15-2016.30.fid
##JCAMP-DX=	6.0	$$ MestReNova 14.1.1-24571
##BLOCK_ID=	2
##DATA TYPE=	NMR SPECTRUM
##DATA CLASS=	XYDATA
##NUMDIM=	1
##ORIGIN=	Bruker BioSpin GmbH
##OWNER=	nmr
##.OBSERVE FREQUENCY=	100.671616723846995
##.OBSERVE NUCLEUS=	^13C
##.SOLVENT NAME=	CDCl3
##.PULSE SEQUENCE=	zgpg30
##LONGDATE=	2016/07/16 01:07:00.000
##.ACQUISITIONMODE=	SIMULTANEOUS (DQD)
##$ORIGINAL FORMAT=	Bruker XWIN-NMR
##$MNOVA/SCALES_VERSION=	9
##$PARAMETER FILE=	(acqus, ASCII, /Users/hrzepa/Downloads/Polysiphenol%20SI%20NMR%20Original%20Data/5/5a%20-%2013C%20-%20400B.16.07.15.030/30/acqus, 0)
$$ ##TITLE= Parameter file, TOPSPIN		Version 3.2
$$ ##JCAMPDX= 5.0
$$ ##DATATYPE= Parameter Values
$$ ##NPOINTS= 11	$$ modification sequence number
$$ ##ORIGIN= Bruker BioSpin GmbH
$$ ##OWNER= nmr
$$ $$ 2016-07-16 01:07:39.317 +0100  nmr@CZC2524DW0
$$ $$ /opt/topspin/data/brad/nmr/Jul15-2016/30/acqus
$$ $$ process /opt/topspin3.2/prog/mod/shimcntl
$$ ##$ACQT0= -2.05882356948211
$$ ##$AMP= (0..31)
$$ 100 100 100 100 100 100 100 100 100 100 100 100 100 100 100 100 100 100
$$ 100 100 100 100 100 100 100 100 100 100 100 100 100 100
$$ ##$AMPCOIL= (0..19)
$$ 0 0 0 0 0 0 0 0 0 0 0 0 0 0 0 0 0 0 0 0
$$ ##$ANAVPT= -1
$$ ##$AQSEQ= 0
$$ ##$AQ_mod= 3
$$ ##$AUNM= <au_zg>
$$ ##$AUTOPOS= <18 >
$$ ##$BF1= 100.660544
$$ ##$BF2= 400.32
$$ ##$BF3= 100.660544
$$ ##$BF4= 100.660544
$$ ##$BF5= 100.660544
$$ ##$BF6= 100.660544
$$ ##$BF7= 100.660544
$$ ##$BF8= 100.660544
$$ ##$BYTORDA= 0
$$ ##$CAGPARS= (0..11)
$$ 0 0 0 0 0 0 0 0 0 0 0 0
$$ ##$CFDGTYP= 0
$$ ##$CFRGTYP= 9
$$ ##$CHEMSTR= <none>
$$ ##$CNST= (0..63)
$$ 1 1 145 1 1 1 1 1 1 1 1 1 1 1 1 1 1 1 1 1 1 1 1 1 1 1 1 1 1 1 1 1 1 1 1
$$ 1 1 1 1 1 1 1 1 1 1 1 1 1 1 1 1 1 1 1 1 1 1 1 1 1 1 1 1 1
$$ ##$CPDPRG= (0..8)
$$ <waltz16> <> <waltz16> <> <mlev> <mlev> <mlev> <mlev> <mlev>
$$ ##$D= (0..63)
$$ 0 1 0.00345 0 0 0 0 0 0 0.06 0 0.03 2e-05 3e-06 0 0 0.0002 0 0 0 0 0 0
$$ 0 0 0 0 0 0 0 0 0 0 0 0 0 0 0 0 0 0 0 0 0 0 0 0 0 0 0 0 0 0 0 0 0 0 0 0
$$ 0 0 0 0 0
$$ ##$DATE= 1468627658
$$ ##$DE= 6.5
$$ ##$DECBNUC= <off>
$$ ##$DECIM= 704
$$ ##$DECNUC= <off>
$$ ##$DECSTAT= 4
$$ ##$DIGMOD= 1
$$ ##$DIGTYP= 12
$$ ##$DQDMODE= 0
$$ ##$DR= 21
$$ ##$DS= 4
$$ ##$DSPFIRM= 0
$$ ##$DSPFVS= 20
$$ ##$DTYPA= 0
$$ ##$EXP= <c13q>
$$ ##$F1LIST= <111111111111111>
$$ ##$F2LIST= <222222222222222>
$$ ##$F3LIST= <333333333333333>
$$ ##$FCUCHAN= (0..9)
$$ 0 1 2 0 0 0 0 0 0 0
$$ ##$FL1= 83
$$ ##$FL2= 83
$$ ##$FL3= 83
$$ ##$FL4= 83
$$ ##$FOV= 20
$$ ##$FQ1LIST= <freqlist>
$$ ##$FQ2LIST= <freqlist>
$$ ##$FQ3LIST= <freqlist>
$$ ##$FQ4LIST= <freqlist>
$$ ##$FQ5LIST= <freqlist>
$$ ##$FQ6LIST= <freqlist>
$$ ##$FQ7LIST= <freqlist>
$$ [...]
$$ ##$Sgu3PowerLevels= (0..7)
$$ 0 0 0 0 0 0 0 0
$$ ##$Sgu4PowerLevels= (0..7)
$$ 0 0 0 0 0 0 0 0
$$ ##$Sgu5PowerLevels= (0..7)
$$ 0 0 0 0 0 0 0 0
$$ ##$Sgu6PowerLevels= (0..7)
$$ 0 0 0 0 0 0 0 0
$$ ##$Sgu7PowerLevels= (0..7)
$$ 0 0 0 0 0 0 0 0
$$ ##$Sgu8PowerLevels= (0..7)
$$ 0 0 0 0 0 0 0 0
$$ ##$SguType= 3
$$ ##$ShimPowMaxUA= (0..63)
$$ 130000 130000 130000 130000 130000 130000 130000 130000 130000 130000 130000
$$ 130000 130000 130000 130000 130000 130000 130000 130000 130000 0 0 0 0
$$ 0 0 0 0 0 0 0 0 0 0 0 0 0 0 0 0 0 0 0 0 0 0 0 0 0 0 0 0 0 0 0 0 0 0 0 0
$$ 0 0 0 0
$$ ##$ShimPowMaxUC= (0..63)
$$ 130000 130000 130000 130000 130000 130000 130000 130000 130000 130000 130000
$$ 130000 130000 130000 130000 130000 130000 130000 130000 130000 0 0 0 0
$$ 0 0 0 0 0 0 0 0 0 0 0 0 0 0 0 0 0 0 0 0 0 0 0 0 0 0 0 0 0 0 0 0 0 0 0 0
$$ 0 0 0 0
$$ ##$ShimPowMaxUG= (0..63)
$$ 524287 524287 524287 524287 524287 524287 524287 524287 524287 524287 524287
$$ 524287 524287 524287 524287 524287 524287 524287 524287 524287 0 0 0 0
$$ 0 0 0 0 0 0 0 0 0 0 0 0 0 0 0 0 0 0 0 0 0 0 0 0 0 0 0 0 0 0 0 0 0 0 0 0
$$ 0 0 0 0
$$ ##$ShimPowRcbType= 3
$$ ##$ShimPowRes= (0..63)
$$ 1e-20 1e-20 1e-20 1e-20 1e-20 1e-20 1e-20 1e-20 1e-20 1e-20 1e-20 1e-20
$$ 1e-20 1e-20 1e-20 1e-20 1e-20 1e-20 1e-20 1e-20 0 0 0 0 0 0 0 0 0 0 0 0
$$ 0 0 0 0 0 0 0 0 0 0 0 0 0 0 0 0 0 0 0 0 0 0 0 0 0 0 0 0 0 0 0 0
$$ ##$ShimPowRng0= (0..63)
$$ 1 1 1 1 1 1 1 1 1 1 1 1 1 1 1 1 1 1 1 1 0 0 0 0 0 0 0 0 0 0 0 0 0 0 0 0
$$ 0 0 0 0 0 0 0 0 0 0 0 0 0 0 0 0 0 0 0 0 0 0 0 0 0 0 0 0
$$ ##$ShimPowRng1= (0..63)
$$ 1 1 1 1 1 1 1 1 1 1 1 1 1 1 1 1 1 1 1 1 0 0 0 0 0 0 0 0 0 0 0 0 0 0 0 0
$$ 0 0 0 0 0 0 0 0 0 0 0 0 0 0 0 0 0 0 0 0 0 0 0 0 0 0 0 0
$$ ##$ShimPowRng2= (0..63)
$$ 1 1 1 1 1 1 1 1 1 1 1 1 1 1 1 1 1 1 1 1 0 0 0 0 0 0 0 0 0 0 0 0 0 0 0 0
$$ 0 0 0 0 0 0 0 0 0 0 0 0 0 0 0 0 0 0 0 0 0 0 0 0 0 0 0 0
$$ ##$ShimPowRng3= (0..63)
$$ 1 1 1 1 1 1 1 1 1 1 1 1 1 1 1 1 1 1 1 1 0 0 0 0 0 0 0 0 0 0 0 0 0 0 0 0
$$ 0 0 0 0 0 0 0 0 0 0 0 0 0 0 0 0 0 0 0 0 0 0 0 0 0 0 0 0
$$ ##$ShimSysFunc= (0..63)
$$ 1 2 3 4 5 7 9 11 15 16 8 10 12 14 6 17 13 18 19 20 0 0 0 0 0 0 0 0 0 0
$$ 0 0 0 0 0 0 0 0 0 0 0 0 0 0 0 0 0 0 0 0 0 0 0 0 0 0 0 0 0 0 0 0 0 0
$$ ##$ShimSysMatrix= 0
$$ ##$ShimSysType= 1
$$ ##$TFXNUM= 0
$$ ##$TRIPLO2= 0
$$ ##$VTU= 2
$$ ##$VTUETH= <149.236.99.20>
$$ ##$VTUTY= <no>
$$ ##$WBREFAM= (0..15)
$$ 132.2 106.2 100 100 100 100 100 100 100 100 100 100 100 100 100 100
$$ ##$WBREFLM= (0..15)
$$ 0 0 0 0 0 0 0 0 0 0 0 0 0 0 0 0
$$ ##$WBREFPH= (0..15)
$$ 77.55 -65.76 0 0 0 0 0 0 0 0 0 0 0 0 0 0
$$ ##$WBSGU= (0..15)
$$ 0 0 0 0 0 0 0 0 0 0 0 0 0 0 0 0
$$ ##$XFAC= 2
$$ ##END=
$$ 
##$DECIM=	704
##$DSPFVS=	20
##XUNITS=	HZ
##YUNITS=	ARBITRARY UNITS
##FIRSTX=	25277.269301538948639
##LASTX=	-3131.3881192264107085
##DELTAX=	-0.43348832563920591809
##XFACTOR=	1
##YFACTOR=	0.028771941373424522737
##FIRSTY=	10.768060684204101562
##MINY=	-13.971449851989746094
##MAXY=	566.09161376953125
##NPOINTS=	65536
##XYDATA=	(X++(Y..Y))
$$ [...]
$$ plain form
13234 388 370 362 353 344 335 310 286 261 236 239 241 244 247 227 208 188 169 188 208 228 247 327 407 446 386 299 242 221 200 199 197 195 194 203 213 223 233 206 179 153 126
13216 126 155 184 213 242 239 236 233 230 211 191 171 151 168 185 203 220 239 259 279 298 281 264 246 229 258 288 313 339 364 330 275 219 203 245 271 268 249
13200 249 230 209 189 191 194 197 199 257 315 347 321 281 242 254 267 250 175 117 90 102 144 171 198 205 212 219 226 218 211 203 196 201 206 211 215 223 231 238 246 201 157 115 74 51
13181 51 78 143 207 242 228 192 156 145 135 154 173 176 180 154 128 132 135 138 142 156 169 213 256 284 312 290 269 251 234 265 297 302 307 342 377 386 395 401 407 386 317
13163 317 275 233 195 158 120 83 108 133 158 183 141 100 58 17 -8 -33 -58 -84 -52 -21 9 41 80 120 160 200 240 280 319 359 316 272 228 185
13148 185 183 181 179 177 196 215 233 252 282 312 371 430 483 536 520 503 491 479 466 454 376 298 224 150 145 209 262 265 266 266 263 260 257 254 251 248 275 303 330 358 371
13130 371 384 349 313 267 221 175 129 117 105 93 81 78 75 72 69 83 97 111 126 150 175 199 224 225 225 226 227 184 141 130 149 166 183 201 220 264 308 352
13114 352 396 435 475 482 460 398 336 287 267 277 316 358 370 348 326 275 225 193 209 248 286 303 320 337 353 356 358 349 310 244 207 218 230 217 175 160
$$ packed form
13234C88j8qrrrk5k4k5k5LKLLk0j9k0j9J9K0K0J9Q0Q0L9o0q7n7k1k1jkkjRJ0J0J0k7k7k6k7
13216A26K9K9K9K9llllj9k0k0k0J7J7J8J7J9K0K0J9j7j7j8j7K9L0K5K6K5l4n5n6j6M2K6lj9
13200B49j9k1k0KLLKN8N8L2k6m0l9J2J3j7p5n8k7J2M2K7K7PPPPqpqpNNNMQQPQm5m4m2m1k3
13181E1K7O5O4L5j4l6l6j1j0J9J9LMk6k6MLLMJ4J3M4M3K8K8k2k1j8j7L1L2NNL5L5RROOk1o9
13163C17m2m2l8l7l8l7K5K5K5K5m2m1m2m1k5k5k5k6L2L1L0L2L9M0M0M0M0M0L9M0m3m4m4m3
13148A85kkkkJ9J9J8J9L0L0N9N9N3N3j6j7j2j2j3j2p8p8p4p4nO4N3LJ%llllllK7K8K7K8J3
13130C71J3l5l6m6m6m6m6j2j2j2j2llllJ4J4J4J5K4K5K4K5J%JJm3m3j1J9J7J7J8J9M4M4M4
13114C52M4L9M0Pk2o2o2m9k0J0L9M2J2k2k2n1n0l2J6L9L8J7J7J7J6LKrl9o6l7J1J2j3m2j5
$$ plain form
13098 160 174 184 164 146 157 169 181 195 209 214 220 226 232 250 268 286 304 305 307 308 310 284 258 233 207 188 170 151 132 97 61 27 -6 -28 -21 -30 -39 -22 -5 10
13081 10 27 39 51 74 127 200 243 252 232 201 169 137 105 58 40 58 105 157 208 223 189 144 147 188 228 211 165 128 150 185 160 103 47 54 61 68 76 58
13065 58 40 38 95 189 282 311 339 350 362 304 246 184 121 108 95 131 167 204 240 245 251 257 263 251 240 228 217 212 208 204 200 219 237 256 275 306 336 298 260
13048 260 237 214 220 226 255 284 313 341 345 348 352 355 370 385 401 416 365 315 297 338 376 355 263 141 76 69 116 163 190 216 213 210 211 211 261 311 313 316 269 223
13030 223 190 158 155 152 157 162 168 173 188 202 217 231 198 164 131 97 105 114 122 130 158 186 214 242 194 146 98 49 39 29 18 8 64 121 177 233 239 245 250 256 235
13013 235 213 240 267 245 222 200 177 201 224 293 362 420 419 381 314 260 236 243 250 247 244 241 238 221 203 186 169 188 207 227 246 265 284 304 323 291 259 226
12996 226 194 194 194 194 194 199 203 208 213 218 223 228 232 259 286 309 332 317 243 202 162 157 152 147 143 185 227 265 303 284 207 147 117 112 136 175 214 245 276 258 239 182 125
12977 125 98 71 87 103 120 136 157 179 200 221 191 160 179 198 253 308 312 317 265 184 155 186 280 375 437 440 397 355 308 262 227 191 160 128 107 145
$$ packed form
13098A60J4J0k0j8J1J2J2J4J4NOOOJ8J8J8J8JKJKk6k6k5k6j9j8j9j9l5l6l4l3k2PrrJ7J7J5
13081A0J7J2J2K3N3P3M3Rk0l1l2l2l2m7j8J8M7N2N1J5l4m5LM1M0j7m6l7K2L5k5n7n6PPPQj8
13065E8j8kN7R4R3K9K8J1J2n8n8o2o3j3j3L6L6L7L6NOOOj2j1j2j1nmmmJ9J8J9J9L1L0l8l8
13048B60k3k3OOK9K9K9K8MLMLJ5J5J6J5n1n0j8M1L8k1r2j22o5pM7M7K7K6llJ%N0N0KLm7m6
13030B23l3l2llNNONJ5J4J5J4l3l4l3l4QRQQK8K8K8K8m8m8m8m9j0j0j1j0N6N7N6N6OONOk1
13013B35k2K7K7k2k3k2k3K4K3O9O9N8jl8o7n4k4PPllllj7j8j7j7J9J9K0J9J9J9K0J9l2l2l3
12996B26l2%%%%NMNNNNNMK7K7K3K3j5p4m1m0nnnmM2M2L8L8j9p7o0l0nK4L9L9L1L1j8j9n7n7
12977A25k7k7J6J6J7J6K1K2K1K1l0l1J9J9N5N5MNn2q1k9L1R4R5O2Lm3m2m7m6l5l6l1l2k1L8
$$ plain form
12962 145 213 252 239 197 169 141 124 107 89 72 65 58 110 162 185 208 173 137 109 81 78 135 188 241 298 355 376 397 359 321 299 277 314 351 342 333 325
12946 325 316 318 319 380 441 481 521 528 536 543 491 414 336 336 336 336 336 351 365 350 336 313 290 323 355 382 350 291 233 157 80 0 -20 35 90 121 151 200 250
12929 250 271 291 257 224 220 216 241 265 231 197 155 113 101 88 107 126 145 164 179 193 208 222 200 178 156 133 133 132 132 131 187 244 300 356 372 388 404
12913 404 420 414 408 402 396 387 377 367 358 365 373 380 388 360 331 303 275 304 332 360 389 395 400 406 412 365 317 270 223 152 80 70 59 52 74 136 199 217 205 210 215 204 194
12894 194 183 173 142 111 82 53 79 135 171 208 217 197 193 189 196 203 209 216 241 265 290 315 327 340 352 365 332 300 268 236 221 206 191 176 186 195 205 215
12878 215 237 260 282 304 307 309 293 307 333 329 344 359 344 329 314 298 305 312 319 326 325 324 322 321 278 235 192 149 126 104 101 67 16 -6 33 102 160 189 204 220
12860 220 196 142 96 119 199 279 321 333 323 312 328 345 351 356 332 309 296 283 270 257 274 291 292 321 392 462 503 495 447 399 348 297 310 323 362 460
12845 460 600 739 800 762 648 533 478 482 466 450 408 366 347 328 309 290 308 326 344 362 357 353 349 344 290 236 181 127 144 161 178 195 188 181 174 167 117
$$ packed form
12962A45O8L9j3m2k8k8j7j7j8j7ppN2N2K3K3l5l6k8k8lN7N3N3N7N7K1K1l8l8k2k2L7L7rrq
12946C25rKJO1O1M0M0PQPn2p7p8%%%%J5J4j5j4k3k3L3L2K7l2n9n8p6p7q0k0N5N5L1L0M9N0
12929B50K1K0l4l3mmK5K4l4l4m2m2j2j3J9J9J9J9J5J4J5J4k2k2k2k3%j%jN6N7N6N6J6J6J6
12913D04J6oooorj0j0rPQPQk8k9k8k8K9K8K8K9ONOOm7m8m7m7p1p2j0j1pK2O2O3J8j2NNj1j0
12894A94j1j0l1l1k9k9K6N6L6L7Rk0mmPPOPK5K4K5K5J2J3J2J3l3l2l2l2j5j5j5j5J0RJ0J0
12878B15K2K3K2K2LKj6J4K6mJ5J5j5j5j5j6PPPPjjkjm3m3m3m3k3k2ll4n1k2L9O9N8K9J5J6
12860B20k4n4m6K3Q0Q0M2J2j0j1J6J7ONk4k3j3j3j3j3J7J7JK9P1P0M1qm8m8n1n1J3J3L9R8
12845D60J40J39O1l8j14j15n5Mj6j6m2m2j9j9j9j9J8J8J8J8nmmnn4n4n5n4J7J7J7J7ppppn0
$$ plain form
12829 117 67 21 -24 -22 39 123 206 244 223 205 187 193 198 204 209 230 251 272 293 295 297 300 302 305 307 309 312 298 283 269 254 240 226 270 315 337 360 323 286 279 273 236
12811 236 200 178 156 189 222 266 251 174 97 52 67 107 147 163 180 197 213 248 282 316 350 308 266 224 182 160 137 115 93 106 120 133 147 174
12796 174 202 285 369 441 454 402 350 316 282 248 215 194 173 182 190 182 174 225 275 311 346 323 299 297 294 292 289 268 246 225 204 221 239 287 334 347 359 312
12779 312 265 236 207 178 149 146 144 141 138 177 216 226 235 228 221 270 319 316 265 215 214 264 343 426 478 499 520 539 558 505 453 400 348 310 272 235 197 225 254
12762 254 283 311 282 254 225 196 213 230 277 324 360 396 373 350 331 311 291 271 226 181 136 91 78 65 52 39 77 115 154 192 188 184 209 235 295
12747 295 355 356 357 314 270 283 297 288 249 199 199 229 259 292 325 337 348 360 371 388 405 419 433 454 425 378 361 381 402 395 359 343 376 425 475 476 429
12731 429 379 330 332 334 286 239 197 155 162 170 115 61 -7 -45 -36 21 122 223 281 340 349 358 372 386 400 414 394 374 354 334 335 335 336 336 323 310 268 225 179
12714 179 133 136 139 214 290 366 441 424 407 389 372 350 327 304 281 281 280 280 279 269 259 248 238 228 218 207 197 201 204 208 211 251 292 332 372 345 318 291 264
$$ packed form
12829A17n0m6m5KO1Q4Q3L8k1j8j8ONONK1K1K1K1KKLKLKKLj4j5j4j5j4j4M4M5K2K3l7l7pol7
12811B36l6k2k2L3L3M4j5p7p7m5J5M0M0J6J7J7J6L5L4L4L4m2m2m2m2k2k3k2k2J3J4J3J4K7
12796A74K8Q3Q4P2J3n2n2l4l4l4l3k1k1RQqqN1N0L6L5k3k4klklk1k2k1k1J7J8M8M7J3J2m7
12779C12m7k9k9k9k9lkllL9L9J0RppM9M9ln1n0jN0P9Q3N2K1K1J9J9n3n2n3n2l8l8l7l8K8K9
12762B54K9K8k9k8k9k9J7J7M7M7L6L6k3k3j9k0k0k0m5m5m5m5j3j3j3j3L8L8L9L8mmK5K6O0
12747B95O0JJm3m4J3J4rl9n0%L0L0L3L3J2J1J2J1J7J7J4J4K1k9m7j7K0K1pl6j6L3M9N0Jm7
12731D29n0m9KKm8m7m2m2PQn5n4o8l8RN7J01J01N8N9RRJ4J4J4J4k0k0k0k0J%J%j3j3m2m3m6
12714A79m6LLP5P6P6P5j7j7j8j7k2k3k3k3%j%jj0j0j1j0j0j0j1j0MLMLM0M1M0M0k7k7k7k7
$$ plain form
12697 264 293 323 352 381 374 366 358 351 296 242 188 133 158 183 207 232 224 217 210 202 198 194 190 186 204 222 240 258 245 232 220 207 172 137 105 73 61 98 124 120 114
12680 114 108 102 95 118 170 235 251 237 252 316 381 399 416 365 314 251 188 175 161 182 202 223 244 265 286 278 269 225 181 185 190 209 227 216 205 137 68 42
12663 42 64 123 182 205 179 137 124 141 158 155 152 198 244 301 358 346 334 300 266 281 296 317 338 290 242 201 159 147 135 90 46 51 56 96 136 177 217
12647 217 257 296 336 375 339 302 265 228 221 214 206 199 167 135 153 170 237 304 330 307 290 273 253 233 167 102 86 70 81 93 134 175 253 332 342 351 355
12631 355 359 362 366 299 231 164 96 49 1 40 79 98 88 64 41 9 -23 -3 46 72 99 126 153 144 106 86 66 84 131 161 192 212 232 250 268 276 254
12615 254 251 248 277 334 390 417 406 365 340 316 310 334 343 352 377 432 485 509 473 408 358 307 268 229 205 210 221 262 335 408 471 504 505 507 470 434 397 361
12599 361 311 261 195 158 168 177 162 147 136 175 255 335 365 395 423 451 467 452 454 457 438 419 401 382 325 268 244 249 295 340 374 379 360 341 293 245 186
12583 186 157 180 203 220 237 301 365 402 409 384 358 301 243 219 223 210 196 184 172 174 176 191 235 291 347 371 365 315 235 167 157 170 184 230 277 347 418
$$ packed form
12697B64K9L0K9K9pqqpn5n4n4n5K5K5K4K5qppqmmmmJ8J8J8J8j3j3j2j3l5l5l2l2j2L7K6mo
12680A14oopK3N2O5J6j4J5O4O5J8J7n1n1o3o3j3j4K1K0K1K1K1K1qrm4m4MNJ9J8j1j1o8o9k6
12663D2K2N9N9K3k6m2j3J7J7llM6M6N7N7j2j2l4l4J5J5K1K1m8m8m1m2j2j2m5m4NNM0M0M1M0
12647B17M0L9M0L9l6l7l7l7ppqpl2l2J8J7O7O7K6k3j7j7k0k0o6o5j6j6J1J2M1M1P8P9J0RM
12631C55MLMo7o8o7o8m7m8L9L9J9j0k4k3l2l2K0M9K6K7K7K7rl8k0k0J8M7L0L1K0K0J8J8Qk2
12615B54llK9N7N6K7j1m1k5k4oK4RRK5N5N3K4l6o5n0n1l9l9k4NJ1M1P3P3O3L3JKl7l6l7l6
12599C61n0n0o6l7J0Rj5j5j1L9Q0Q0L0L0K8K8J6j5KLj9j9j8j9n7n7k4NM6M5L4Nj9j9m8m8n9
12583A86k9K3K3J7J7O4O4L7Pk5k6n7n8k4Mj3j4j2j2KKJ5M4N6N6K4on0q0o8j0J3J4M6M7P0P1
$$ plain form
12567 418 459 501 493 485 428 370 328 285 331 377 407 437 418 398 397 396 424 452 456 461 436 412 362 313 293 273 250 227 233 240 314 389 460 531 562 535 491 447
12550 447 398 350 350 351 337 323 323 382 424 436 439 441 420 399 378 357 389 421 453 485 534 583 632 681 625 568 512 456 442 428 483 538 566 594 622 650 685
12534 685 721 804 918 1023 1070 1121 1173 1176 1178 1295 1510 1749 2018 2496 3229 4157 5381 7306 9841 11916 12160 10335 7585 5233
12524 5233 3728 2750 2027 1579 1348 1179 980 816 710 620 500 401 362 337 311 314 316 273 230 184 198 199 170 156 200 255 281 273 264 224 155
12510 155 107 117 143 169 209 279 335 333 265 196 124 52 62 71 80 89 81 73 65 57 75 92 109 126 131 136 141 146 154 161 168 176 211 246 281 316 381 446 475 446 394 342
12492 342 286 231 240 249 288 327 295 263 186 109 47 43 76 109 125 142 208 273 307 342 346 351 366 382 368 354 294 233 202 171 193 215 207 200 181 161 191 221
12475 221 237 252 219 186 163 140 117 95 84 73 82 62 38 73 142 211 237 264 241 218 209 201 221 242 281 320 363 347 286 224 208 192 153 113 102 92
12460 92 110 128 145 163 156 150 154 188 226 235 194 152 137 122 136 151 197 243 257 241 210 179 146 113 125 138 148 159 151 114 76 68 98 127 159 190 219 249
$$ packed form
12567D18M1M2qqn7n8m2m3M6M6L0L0j9k0jjK8K8MNk5k4n0m9k0k0k3k3OPP4P5P1P1L1k7m4m4
12550D47m9m8%Jj4j4%N9M2J2LKk1k1k1k1L2L2L2L2M9M9M9M9n6n7n6n6j4j4N5N5K8K8K8K8L5
12534F85L6Q3J14J05M7N1N2LKJ17K15K39K69M78P33R28J224J925K535K075K44j825k750k352
12524E233j505r78p23m48k31j69j99j64j06r0j20r9l9k5k6LKm3m3m6J4Jk9j4M4N5K6qrm0o9
12510A55m8J0K6K6M0P0N6ko8o9p2p2J0RRRqqqqJ8J7J7J7NNNNQPPQL5L5L5L5O5O5K9k9n2n2
12492C42n6n5RRL9L9l2l2p7p7o2mL3L3J6J7O6O5L4L5MNJ5J6j4j4o0o1l1l1K2K2qpj9k0L0L0
12475B21J6J5l3l3k3k3k3k2j1j1Rk0k4L5O9O9K6K7k3k3rqK0K1L9L9M3j6o1o2j6j6l9m0j1j0
12460I2J8J8J7J8poML4L8Rm1m2j5j5J4J5M6M6J4j6l1l1l3l3J2J3J0J1ql7l8qL0K9L2L1K9L0
$$ plain form
12443 249 226 174 117 60 34 37 36 34 5 -24 -21 -18 -15 -12 20 54 85 116 101 56 30 4 1 27 37 47 68 88 109 129 138 146 154 162 182 201 219 237 239 212 172
12426 172 181 210 209 179 149 147 146 94 13 -58 -99 -108 -117 -134 -122 -77 -32 11 54 97 141 170 200 229 258 281 303 326 349 341 334 310 315 327 339 353 367 361 355 377
12408 377 399 407 385 333 281 230 208 220 262 281 270 277 285 291 297 303 309 355 400 403 377 330 283 262 241 224 178 121 64 58 81 118 154 192 229 226 194 151 137
12391 137 164 192 216 241 264 287 288 260 249 237 226 215 204 192 197 202 209 215 220 255 332 409 515 620 648 569 400 231 115 67 46 25 21 46 105
12376 105 165 213 232 220 207 193 178 153 127 85 72 89 107 126 145 177 209 241 273 289 304 292 280 261 272 325 378 423 469 472 446 407 368 357 346
12361 346 346 346 374 402 398 365 293 220 144 117 122 126 121 116 123 160 186 213 228 213 180 147 154 191 229 266 292 288 280 271 261 251 221 191 201 241 264 257 209 161 121
12343 121 80 97 114 110 77 31 -14 -19 -25 -30 -36 -49 -63 -74 -86 -49 16 81 118 132 147 160 172 202 232 260 288 279 241 221 201 196 221 259 297 285 274 301
12327 301 359 392 376 330 285 253 220 188 156 114 72 72 102 132 162 165 168 177 186 196 205 155 105 86 116 163 211 230 249 236 194 167 141 153 165 178 190
$$ packed form
12443B49k3n2n7n7k6Ljkk9k9LLLLL2L4L1L1j5m5k6k6lK6J0J0K1K0K1K0RQQQK0J9J8J8Kk7m0
12426A72RK9jl0l0kjn2q1p1m1rrj7J2M5M5M3M3M3M4K9L0K9K9K3K2K3K3qpk4NJ2J2J4J4ooK2
12408C77K2Qk2n2n2n1k2J2M2J9j1PQOOOOM6M5Lk6m7m7k1k1j7m6n7n7oK3L7L6L8L7ll2m3j4
12391A37K7K8K4K5K3K3Jk8j1j2j1j1j1j2NNPONL5P7P7J06J05K8p9j69j69j16m8k1k1mK5N9
12376A05O0M8J9j2j3j4j5k5k6m2j3J7J8J9J9L2L2L2L2J6J5j2j2j9J1N3N3M5M6Lk6l9l9j1j1
12361C46%%K8K8ml3p2p3p6k7NMnnPL7K6K7J5j5l3l3PL7L8L7K6mqrj0j0l0l0J0M0K3pm8m8m0
12343A21m1J7J7ml3m6m5nonoj3j4j1j2L7O5O5L7J4J5J3J2L0L0K8K8rl8k0k0nK5L8L8j2j1K7
12327C01N8L3j6m6m5l2l3l2l2m2m2%L0L0L0LLRRJ0Rn0n0j9L0M7M8J9J9j3m2k7k6J2J2J3J2
$$ plain form
12311 190 220 250 280 310 331 352 390 398 365 332 298 265 267 299 312 324 331 308 302 296 275 255 234 214 190 167 143 119 96 72 50 28 49 100 150 171 169
12295 169 166 162 158 170 183 197 212 212 241 270 270 232 195 198 231 244 257 288 290 272 253 233 212 219 225 232 239 227 216 205 194 140 86 64 91 139 188 238 288 306
12277 306 295 301 306 290 273 256 239 218 197 216 265 298 301 321 341 337 303 259 263 308 353 359 335 340 346 347 349 373 368 320 273 225 177 130 84 78 102 125 119 110 100
12260 100 90 81 81 111 124 137 137 136 118 128 158 157 175 193 193 192 191 190 183 177 171 165 160 156 168 151 99 47 36 54 79 104 131 158 171 183 196 209 259 308 358 408
12241 408 461 515 567 619 645 641 573 474 432 389 345 300 292 283 274 266 289 312 335 359 350 341 333 324 320 316 313 309 282 254 227 200 168 136 163 190 176 163 149 135 174
12224 174 212 250 289 264 240 215 191 164 137 169 201 235 269 316 334 301 209 120 89 144 259 377 436 428 419 407 394 379 363 347 331 315 299 342
12209 342 386 444 502 462 421 386 350 315 279 249 218 188 157 132 107 140 174 177 180 124 67 9 -49 -42 22 92 161 234 307 323 339 368 367 318 209 116
12193 116 54 46 67 74 81 113 145 177 209 233 257 222 187 178 169 160 151 174 197 220 243 225 206 188 169 140 112 84 55 85 115 145 175 248 321 372 375 348
$$ packed form
12311A90L0L0L0L0K1K1L8Ql3l3l4l3KL2J3J2Pk3ook1k0k1k0k4k3k4k4k3k4k2k2K1N1N0K1k
12295A69lmmJ2J3J4J5%K9K9%l8l7LL3J3J3L1Kj8j9k0k1POPPj2j1j1j1n4n4k2K7M8M9N0N0J8
12277C06j1ONj6j7j7j7k1k1J9M9L3LK0K0ml4m4MM5M5Ok4NOJKK4nm8m7m8m8m7m6oK4K3orj0
12260A00j0r%L0J3J3%jj8J0L0jJ8J8%jjjpooonmJ2j7n2n2j1J8K5K5K7K7J3J2J3J3N0M9N0N0
12241D08N3N4N2N2K6mo8r9m2m3m4m5qrrqK3K3K3K4rrqrmmlmk7k8k7k7l2l2K7K7j4j3j4j4L9
12224A74L8L8L9k5k4k5k4k7k7L2L2L4L4M7J8l3r2q9l1N5J15J18N9qrj2j3j5j6j6j6j6j6M3
12209C42M4N8N8m0m1l5l6l5l6l0l1l0l1k5k5L3L4LLn6n7n8n8PO4P0O9P3P3J6J6K9jm9j09r3
12193A16o2qK1PPL2L2L2L2K4K4l5l5rrrrK3K3K3K3j8j9j8j9k9k8k8k9L0L0L0L0P3P3N1Lk7
$$ plain form
12177 348 320 260 201 150 100 118 137 157 176 167 157 151 146 190 233 260 288 315 342 335 329 254 179 142 106 138 170 223 276 280 283 267 251 265 278 307 335 314
12160 314 294 278 262 293 325 287 220 187 204 225 197 111 26 -33 -92 -103 -113 -57 -2 53 108 93 77 111 144 170 197 174 150 162 174 186 198 206 215
12145 215 224 233 264 295 327 358 353 348 343 338 380 423 396 369 332 294 305 317 309 300 292 283 335 386 437 489 449 409 370 330 290 251 211 171 209 247 282 317 325 283
12128 283 253 252 231 211 192 173 176 180 183 186 224 262 300 338 364 390 366 343 327 311 325 338 358 378 368 358 368 378 417 456 572 688 763 750 650
12113 650 521 432 413 447 482 491 501 494 486 430 374 333 292 251 210 235 260 235 211 202 194 185 176 154 132 110 88 118 147 177 206 176 146 116 86 87 88 89 90
12096 90 69 47 95 142 149 155 162 169 193 217 212 207 189 171 202 233 303 374 429 454 455 407 336 265 245 224 204 184 124 64 53 43 76 109 112 116 128 139 131 74
12078 74 17 -8 16 71 129 188 219 250 272 293 286 278 265 252 268 284 299 313 269 224 162 99 95 91 81 71 91 110 163 215 208 201 196 191 186 181 193 205 217 229
12061 229 231 234 296 357 354 350 289 228 149 99 96 151 210 240 234 228 243 316 399 452 445 378 270 190 140 118 112 105 121 137 183 228 266 304 283 262 248 234 219
$$ packed form
12177C48k8o0n9n1n0J8J9K0J9rj0onM4M3K7K8K7K7pop5p5l7l6L2L2N3N3MLj6j6J4J3K9K8k1
12160C14k0j6j6L1L2l8o7l3J7K1k8q6q5n9n9j1j0N6N5N5N5j5j6L4L3K6K7k3k4J2J2J2J2QR
12145B15RRL1L1L2L1nnnnM2M3k7k7l7l8J1J2qrqrN2N1N1N2m0m0l9m0m0l9m0m0L8L8L5L5Qm2
12128B83l0jk1k0j9j9LMLLL8L8L8L8K6K6k4k3j6j6J4J3K0K0j0j0J0J0L9L9J16J16P5j3j00
12113F50j29q9j9L4L5RJ0pqn6n6m1m1m1m1K5K5k5k4rqrrk2k2k2k2L0K9L0K9l0l0l0l0JJJJ
12096I0k1k2M8M7POPPK4K4nnj8j8L1L1P0P1N5K5Jm8p1p1k0k1k0k0o0o0j1j0L3L3LMJ2J1qn7
12078G4n7k5K4N5N8N9L1L1K2K1pqj3j3J6J6J5J4m4m5o2o3mmj0j0K0J9N3N2ppnnnnJ2J2J2J2
12061B29KLO2O1lmo1o1p9n0lN5N9L0ooJ5P3Q3N3po7j08q0n0k2opJ6J6M6M5L8L8k1k1j4j4j5
$$ plain form
12044 219 205 213 221 285 349 381 354 302 249 244 240 265 290 291 292 293 294 314 334 328 263 172 81 84 88 90 91 93 94 135 176 217 258 296 334 313 292 272 252 233 213 190
12026 190 167 144 120 120 119 118 117 123 129 135 140 169 197 225 253 255 256 258 260 239 219 198 178 155 132 109 86 51 17 11 56 118 151 144 137 179 220 230 191 129 67 2
12008 2 -62 -88 -113 -80 -46 -42 -37 -30 -23 33 119 217 265 235 205 171 137 126 115 103 92 86 81 75 70 56 43 88 134 181 228 245 262 260 257 254 251 322 393 405 417
11990 417 356 296 235 174 165 156 147 138 151 164 177 190 203 215 227 240 230 220 211 201 232 262 293 323 328 332 307 281 239 196 213 229 254 279 275 270 288 305 323
11973 323 340 371 402 355 277 215 202 219 235 234 233 232 230 259 287 256 225 213 201 245 288 309 280 220 160 143 127 169 212 233 254 216 179 167 155 172
11957 172 190 204 217 257 297 310 274 235 197 191 184 178 171 171 170 169 168 194 221 248 274 281 288 238 188 97 36 56 144 226 278 293 307 335 363 388 414 452 441
11941 441 359 277 229 181 152 94 15 -14 8 60 87 115 114 114 116 118 150 182 263 344 394 395 392 389 383 377 356 336 315 294 267 241 215 188 209 229 279 329 381
11924 381 434 427 420 350 280 183 86 13 -11 -20 0 69 140 210 231 222 212 230 247 235 223 211 199 207 214 221 228 193 157 122 87 110 132 155 177 205 232 201
$$ packed form
12044B19j4QQO4O4L2k7n2n3nmK5K5JJJJK0K0oo5r1r1LMKJKJM1M1M1M1L8L8k1k1k0k0j9k0k3
12026A90k3k3k4%jjjOOONK9K8K8K8KJKKk1k0k1k0k3k3k3k3l5l4oM5O2L3ppM2M1J0l9o2o2o5
12008Bo4k6k5L3L4MNPPN6Q6R8M8l0l0l4l4j1j1j2j1ononj4j3M5M6M7M7J7J7klllP1P1J2J2
11990D17o1o0o1o1rrrrJ3J3J3J3J3J2J2J3j0j0rj0L1L0L1L0NMk5k6m2m3J7J6K5K5mnJ8J7J8
11973C23J7L1L1m7p8o2j3J7J6jjjkK9K8l1l1j2j2M4M3K1k9o0o0j7j6M2M3K1K1l8l7j2j2J7
11957A72J8J4J3M0M0J3l6l9l8opop%jjjK6K7K7K6PPn0n0r1o1K0Q8Q2N2J5J4K8K8K5K6L8j1
11941D41q2q2m8m8k9n8p9k9K2N2K7K8j%KKL2L2Q1Q1N0Jllook1k0k1k1k7k6k6k7K1K0N0N0N2
11924C81N3ppp0p0r7r7p3k4rK0O9P1P0K1rj0J8J7j2j2j2j2QPPPl5l6l5l5K3K2K3K2K8K7l1
$$ plain form
11907 201 169 126 84 100 117 160 204 189 174 188 202 216 230 249 268 287 306 336 367 366 316 256 195 164 181 250 319 359 351 310 269 225 181 196 210
11892 210 185 131 64 47 58 70 68 65 62 59 88 116 174 232 246 260 217 174 128 112 145 228 285 273 209 145 130 184 245 277 245 213 180 146 128 109
11876 109 91 72 135 198 260 323 316 308 301 293 298 303 308 313 298 283 268 254 281 308 335 362 342 322 302 283 270 258 246 233 247 261 275 289 256 223 190 157
11860 157 156 155 154 153 151 149 177 205 291 378 396 365 324 312 311 309 273 236 200 163 157 152 146 140 124 108 121 134 192 250 283 256 250 244 234 224 203 182 161 140 97
11842 97 54 10 -32 -9 13 36 59 49 39 30 20 78 137 199 202 199 197 250 303 368 432 471 451 417 384 346 309 300 290 285 279 297 374 455 476 487 556 648
11826 648 740 754 769 734 698 655 750 973 1256 1657 2432 3505 4322 4223 3278 2154 1443 1128 911 690 529 495 461 431 402 396 390 385
11814 385 379 365 352 364 376 379 322 240 158 139 120 101 83 97 112 126 141 143 145 148 150 154 159 163 168 189 211 233 254 231 207 183 159 163 168 172 177 209 240 213 186
11796 186 158 130 132 134 115 96 77 58 87 117 148 180 229 308 395 432 412 343 268 194 175 156 196 236 240 244 219 193 209 226 242 258 240 223 205 187
$$ packed form
11907B01l2m3m2J6J7M3M4j5j5J4J4J4J4J9J9J9J9L0L1jn0o0o1l1J7O9O9M0qm1m1m4m4J5J4
11892B10k5n4o7j7J1J2klllK9K8N8N8J4J4m3m3m6j6L3Q3N7j2o4o4j5N4O1L2l2l2l3l4j8j9
11876A09j8j9O3O3O2O3pqpqNNNNj5j5j5j4K7K7K7K7k0k0k0j9j3j2j2j3J4J4J4J4l3l3l3l3
11860A57jjjjkkK8K8Q6Q7J8l1m1j2jkl6l7l6l7onooj6j6J3J3N8N8L3k7ooj0j0k1k1k1k1m3
11842I7m3m4m2K3K2K3K3j0j0rj0N8N9O2LlkN3N3O5O4L9k0l4l3l8l7rj0noJ8P7Q1K1J1O9R2
11826F48R2J4J5l5l6m3R5K23K83M01P75J073Q17r9r45j124p11l15k17k21j61l4l4l0k9oon
11814C85oj4j3J2J2Ln7q2q2j9j9j9j8J4J5J4J5KKLKMNMNK1K2K2K1k3k4k4k4MNMNL2L1k7k7
11796A86k8k8KKj9j9j9j9K9L0L1L2M9P9Q7L7k0o9p5p4j9j9M0M0MMk5k6J6J7J6J6j8j7j8j8
$$ plain form
11780 187 161 136 110 84 90 96 102 108 143 178 212 247 230 213 196 179 175 171 167 163 191 219 247 275 263 251 239 227 222 217 213 208 210 211 213 215 264 313 331 299 245 190
11762 190 133 75 56 37 -10 -59 -93 -128 -104 -80 -9 60 131 201 199 197 196 194 192 191 189 187 195 202 210 218 238 259 250 241 188 136 143 150 145 141 107 74 62 50 68 134 244
11743 244 324 341 329 298 267 204 142 118 94 100 106 113 121 99 77 57 37 85 134 170 206 242 278 246 215 184 153 143 133 123 113 150 187 223 260 295
11728 295 331 366 401 355 309 263 218 200 182 164 147 146 146 145 145 143 140 138 136 173 210 178 145 141 136 131 127 90 53 66 78 82 87 91 95 110 125 185 246 252 209 145 111
11709 111 82 23 -60 -115 -132 -119 -92 -64 -17 30 48 67 61 55 23 -9 -30 -3 62 127 182 188 153 117 90 63 65 67 88 109 159 210 239 269 229 190 174
11693 174 158 171 185 203 221 238 256 222 187 174 210 258 306 316 276 229 182 201 220 247 273 232 191 144 126 161 195 216 236 257 277 268 259 251 242 265
11677 265 288 326 335 299 233 184 184 220 255 244 233 209 184 171 187 200 183 156 128 143 158 173 188 220 252 284 316 344 371 350 328 309 290 243 196
11662 196 164 161 142 122 85 49 14 -20 0 50 83 117 143 169 211 225 225 226 224 223 216 209 249 290 291 263 251 239 236 233 231 230 235 270 316 313 293 273 249 226 244
$$ packed form
11780A87k6k5k6k6OOOOL5L5L4L5j7j7j7j7mmmmK8K8K8K8j2j2j2j2nnmnKJKKM9M9J8l2n4n5
11762A90n7n8j9j9m7m9l4l5K4K4P1O9P1P0kkjkkjkkQPQQK0K1rrn3n2PPnml4l3j2j2J8O6J10
11743B44Q0J7j2l1l1o3o2k4k4OOPQk2k2k0k0M8M9L6L6L6L6l2l1l1l1j0j0j0j0L7L7L6L7L5
11728B95L6L5L5m6m6m6m5j8j8j8j7j%j%klkkL7L7l2l3mnnml7l7J3J2MNMMJ5J5O0O1Om3o4l4
11709A11k9n9q3n5j7J3K7K8M7M7J8J9ool2l2k1K7O5O5N5Ol5l6k7k7KKK1K1N0N1K9L0m0l9j6
11693A74j6J3J4J8J8J7J8l4l5j3L6M8M8J0m0m7m7J9J9K7K6m1m1m7j8L5L4K1K0K1K0rrqrK3
11677B65K3L8Rl6o6m9%L6L5j1j1k4k5j3J6J3j7k7k8J5J5J5J5L2L2L2L2K8K7k1k2j9j9m7m7
11662A96l2lj9k0l7l6l5l4K0N0L3L4K6K6M2J4%JkjppM0M1Jk8j2j2llkjNL5M6lk0k0k4k3J8
$$ plain form
11644 244 262 296 301 271 241 209 177 174 171 151 161 192 222 254 286 298 310 321 333 327 322 316 310 295 279 247 244 257 270 283 295 292 259 226 223 238 254 221 189
11628 189 159 128 127 126 147 168 156 114 82 51 50 78 118 158 199 241 262 284 273 233 171 109 97 115 152 188 214 210 185 161 107 53 34 45 69 93
11612 93 97 100 76 52 41 59 91 122 161 199 208 218 205 193 182 171 167 193 219 215 202 190 176 161 153 144 152 130 110 89 67 45 55 65 74 84 106 127 149
11595 149 170 175 179 183 188 218 249 278 307 295 255 231 207 191 176 162 148 185 250 326 401 424 397 349 301 273 246 229 243 263 254 218 181 173 215 276 337
11579 337 348 328 326 323 329 335 339 343 327 283 238 222 216 209 204 199 209 219 229 239 246 253 290 327 330 333 287 241 182 124 65 7 39 71 104 136 152 167 231 296 356
11561 356 415 446 476 486 496 477 457 409 362 314 267 272 277 233 189 172 155 138 121 110 100 139 178 230 282 293 254 198 142 132 122 82 43 7 20
11546 20 68 146 226 277 291 305 287 270 239 209 228 246 291 335 350 365 341 317 293 270 222 175 150 173 226 279 306 332 374 415 407 399 346 293 239 186
11530 186 176 167 157 148 156 164 171 179 179 179 179 179 167 155 143 130 136 141 146 151 143 134 175 216 239 262 236 210 214 218 272 325 339 353 366 380 347 313 280 246 219 191 222
$$ packed form
11644B44J8L4Nl0l0l2l2llk0J0L1L0L2L2J2J2J1J2onooj5j6l2lJ3J3J3J2ll3l3lJ5J6l3l2
11628A89l0l1jjK1K1j2m2l2l1jK8M0M0M1M2K1K2j1m0o2o2j2J8L7L6K6mk5k4n4n4j9J1K4K4
11612I3MLk4k4j1J8L2L1L9L8RJ0j3j2j1j1mK6K6mj3j2j4j5qrQk2k0k1k2k2J0J0RJ0K2K1K2
11595A49K1NMMNL0L1K9K9j2m0k4k4j6j5j4j4L7O5P6P5K3k7m8m8k8k7j7J4K0rl6l7qM2O1O1
11579C37J1k0klOOMMj6m4m5j6opnnJ0J0J0J0PPL7L7LLm6m6n9n8n9n8L2L2L3L2J6J5O4O5O0
11561C56N9L1L0J0J0j9k0m8m7m8m7NNm4m4j7j7j7j7j1j0L9L9N2N2J1l9n6n6j0j0m0l9l6J3
11546B0M8P8Q0N1J4J4j8j7l1l0J9J8M5M4J5J5k4k4k4k3m8m7k5K3N3N3K7K6M2M1qqn3n3n4n3
11530A86j0rj0rQQPQ%%%%j2j2j2j3ONNNqrM1M1K3K3k6k6MMN4N3J4J4J3J4l3l4l3l4k7k8L1
$$ plain form
11512 222 253 273 294 284 275 290 305 291 277 270 263 256 250 257 264 271 279 232 185 138 91 100 109 117 126 84 42 0 -41 -45 -49 4 59 80 102 123 145 167 188 210 232 229
11494 229 226 223 220 224 228 232 236 262 289 256 223 182 141 159 177 196 214 173 132 125 119 168 218 255 243 200 156 144 132 91 49 19 -11 -12 36 100 135 110 55
11477 55 18 11 15 18 20 21 52 83 104 126 118 110 55 0 2 6 13 21 -26 -75 -127 -130 -62 5 24 43 62 81 67 54 40 27 48 69 64 59 80 150 264 349 345 292
11459 292 248 234 253 273 294 316 273 231 188 146 114 83 51 20 5 -9 -24 -38 -20 -1 46 94 172 250 269 287 308 328 319 310 263 216 198 181 202
11443 202 222 243 264 262 260 258 256 259 262 266 269 227 186 145 104 144 184 225 265 279 293 307 321 302 283 235 187 146 106 94 132 193 224 216 207 210 212 214 216 211 206 202 197
11425 197 199 202 204 207 200 193 186 179 176 173 200 226 276 326 316 307 319 330 312 294 289 283 334 384 429 424 349 273 246 220 193 166 178 189 200 212 200 188 177 165 198
11407 198 230 263 296 344 393 455 487 438 330 238 176 161 176 175 175 162 149 136 123 83 44 4 -35 -30 -25 -21 -16 0 17 34 51 60 70 79 89 82 74 67 59 59
11390 59 59 59 59 68 77 87 96 98 99 101 103 118 133 148 163 171 179 183 187 189 133 109 86 133 180 223 266 286 247 242 236 192 148 105 61 62 64 65 67 103 139 174 210 204 197 191 184
$$ packed form
11512B22L1K0K1j0rJ5J5j4j4pppoPPPQm7m7m7m7RRQRm2m2m2m1mmN3N5K1K2K1K2K2K1K2K2l
11494B29lllMMMMK6K7l3l3m1m1J8J8J9J8m1m1poM9N0L7j2m3m4j2j2m1m2l0l0jM8O4L5k5n5
11477E5l7pMLKJL1L1K1K2qqn5n5KMPQm7m9n2lO8O7J9J9J9J9j4j3j4j3K1K1nnK1P0J14Q5mn3
11459B92m4j4J9K0K1K2m3m2m3m2l2l1l2l1j5j4j5j4J8J9M7M8P8P8J9J8K1K0rrm7m7j8j7K1
11443B02K0K1K1kkkkLLMLm2m1m1m1M0M0M1M0J4J4J4J4j9j9m8m8m1m0j2L8O1L1qrLKKKnnmn
11425A97KLKLppppllK7K6N0N0j0rJ2J1j8j8noN1N0M5np5p6k7k6k7k7J2J1J1J2j2j2j1j2L3
11407A98L2L3L3M8M9O2L2m9j08r2o2j5J5j%j3j3j3j3m0l9m0l9NNMNJ6J7J7J7RJ0RJ0pqpq%
11390E9%%%RRJ0RKJKKJ5J5J5J5QQMMKn6k4k3M7M7M3M3K0l9nom4m4m3m4JKJKL6L6L5L6opop
$$ plain form
11369 184 212 240 268 296 292 287 283 279 289 299 310 320 327 334 341 347 310 272 235 197 203 208 214 219 249 280 310 340 298 257 215 174 136 98 27 15 69 123 213 243
11352 243 224 175 106 95 135 174 217 260 253 246 205 224 252 280 310 340 326 282 223 222 230 238 250 262 250 237 224 212 243 274 305 336 367 398 425 452 444
11336 444 377 327 305 299 292 287 281 250 218 154 148 169 191 249 248 221 194 164 133 176 219 262 305 356 407 458 509 476 443 410 377 349 321 292 264 300 335
11320 335 371 406 407 408 408 409 417 425 433 441 383 325 271 216 212 267 286 304 317 272 243 244 279 313 350 386 440 494 548 602 611 621 630 640 670 700 710 749 824 839
11302 839 854 929 1052 1146 1227 1367 1588 1810 2102 2610 3321 4210 5433 7267 9486 11017 10902 9231 7094 5369 4151 3189
11293 3189 2380 1827 1492 1217 971 823 761 699 661 622 584 546 500 454 429 374 296 278 285 292 307 351 412 414 363 311 260 208 189 228 308 359
11279 359 351 315 293 270 269 268 267 265 284 303 293 282 255 227 259 291 308 326 343 360 370 380 448 517 506 494 483 472 456 440 425 409 410 411 441 471 518 565
11263 565 588 552 460 398 374 350 304 257 240 223 240 257 303 349 313 276 269 262 273 285 237 190 175 161 147 132 106 80 113 146 152 157 133 109 123 137
$$ packed form
11369A84K8K8K8K8mnmmJ0J0J1J0PPPOl7l8l7l8ONONL0L1L0L0m2m1m2m1l8l8p1j2N4N4R0L0
11352B43j9m9o9j1M0L9M3M3ppm1J9K8K8L0L0j4m4n9jQQJ2J2j2j3j3j2L1L1L1L1L1L1K7K7q
11336D44o7n0k2opnol1l2o4oK1K2N8jk7k7l0l1M3M3M3M3N1N1N1N1l3l3l3l3k8k8k9k8L6L5
11320C35L6L5JJ%JQQQQn8n8n4n5mN5J9J8J3m5k9JL5L4L7L6N4N4N4N4RJ0RJ0L0L0J0L9P5J5
11302H39J5P5J23R4Q1J40K21K22K92N08P11Q89J223J834K219J531j15j671k137j725j218r62
11293C189q09n53l35k75k46j48o2o2l8l9l8l8m6m6k5n5p8j8PPJ5M4O1Kn1n2n1n2j9L9Q0N1
11279C59ql6k2k3jjjkJ9J9j0j1k7k8L2L2J7J8J7J7J0J0O8O9j1j2j1j1j6j6j5j6JJL0L0M7M7
11263E65K3l6r2o2k4k4m6m7j7j7J7J7M6M6l6l7ppJ1J2m8m7j5j4j4j5k6k6L3L3ONk4k4J4J4
$$ plain form
11247 137 150 164 184 205 226 247 234 222 209 197 160 124 146 169 180 192 204 215 167 118 70 21 54 87 120 153 167 181 195 209 216 222 229 236 236 236 236 236
11231 236 222 209 195 181 172 163 213 263 279 296 257 218 193 227 283 338 313 229 178 126 115 104 93 82 36 -10 2 15 64 112 187 261 285 249 247 244
11215 244 243 242 241 240 227 214 200 187 232 276 321 366 369 372 374 377 365 353 341 330 324 319 344 368 387 407 371 335 281 286 356 427 458 489 540 650 738 727 631
11198 631 476 357 238 149 60 11 21 56 92 76 59 102 145 202 259 286 314 303 292 281 270 324 377 431 485 464 443 422 402 341 280 220 159
11184 159 166 173 135 96 63 90 132 174 215 256 327 397 438 479 451 423 378 332 316 301 286 271 257 242 260 278 295 313 314 315 315 316 327 338 349 360 395
11168 395 430 416 402 421 440 459 478 467 456 445 434 420 407 393 380 359 338 319 299 303 336 385 375 330 284 234 185 175 166 157 148 165 183 231 278 298
11152 298 319 290 261 244 228 211 194 206 219 231 243 213 183 154 124 89 55 21 -13 -26 -39 -23 -7 20 48 11 -25 -32 19 106 193 264 334 316 298
11137 298 302 307 311 316 316 317 286 195 109 82 147 242 279 287 309 332 320 249 162 75 46 16 36 56 50 44 37 31 15 -1 48 98 116 85 53 20 22 25 28 31 19 8
$$ packed form
11247A37J3J4K0K1K1K1j3j2j3j2l7l6K2K3J1J2J2J1m8m9m8m9L3L3L3L3J4J4J4J4POPP%%%%
11231B36j4j3j4j4rrN0N0J6J7l9l9k5L4N6N5k5q4n1n2j1j1j1j1m6m6J2J3M9M8P5P4K4l6kl
11215B44jjjjj3j3j4j3M5M4M5M5LLKLj2j2j2j1onK5K4J9K0l6l6n4NP0P1L1L1N1J10Q8j1r6
11198F31j55j19j19q9q9m9J0L5L6j6j7M3M3N7N7K7K8j1j1j1j1N4N3N4N4k1k1k1k0o1o1o0o1
11184A59PPl8l9l3K7M2M2M1M1P1P0M1M1k8k8m5m6j6j5j5j5j4j5J8J8J7J8JJ%JJ1J1J1J1L5
11168C95L5j4j4J9J9J9J9j1j1j1j1j4j3j4j3k1k1j9k0ML3M9j0m5m6n0m9j0rrrJ7J8M8M7K0
11152B98K1k9k9j7j6j7j7J2J3J2J2l0l0k9l0l5l4l4l4j3j3J6J6K7K8l7l6pN1Q7Q7P1P0j8j8
11137B98MNMN%Jl1r1q6k7O5R5L7QK2K3j2p1q7q7k9l0K0K0oopoj6j6M9N0J8l1l2l3KLLLj2j1
$$ plain form
11119 8 -3 -14 -22 -30 -38 -46 -33 -21 21 63 79 95 45 -3 -20 12 46 81 113 146 177 207 179 120 98 125 152 150 138 126 178 231 310 389 437 437 415 393
11102 393 347 301 285 268 289 311 302 294 299 304 221 138 84 31 7 -17 -11 -6 28 63 105 147 169 141 101 91 132 204 256 308 333 357 357 357 357 357 348 338 329 320 298
11084 298 276 255 233 234 234 234 234 271 309 346 383 350 317 284 251 269 288 277 266 176 86 15 -5 -12 -49 -113 -177 -161 -115 -85 -55 -27 0 28 57 78 98
11068 98 138 147 150 181 195 208 210 211 211 211 213 186 175 165 181 196 183 169 151 133 172 211 216 192 183 175 211 247 279 312 297 233 182 160 164 197 215 234 222 211
11051 211 200 188 204 220 236 251 243 235 227 219 184 149 114 79 40 1 -36 -75 -76 -76 -76 -76 -42 -9 52 114 162 180 156 132 118 103 89 74 92 110 155 199
11035 199 227 206 155 104 119 164 191 219 251 283 354 454 573 642 604 497 374 280 245 240 250 230 172 114 123 161 183 205 223 241 259 277 279 281
11020 281 253 225 222 219 176 104 67 78 134 161 149 107 52 -2 -23 -15 5 26 44 63 98 104 70 36 44 80 102 124 147 171 204 237 257 247 215 184 191
11004 191 227 231 205 171 136 139 171 215 259 301 314 284 255 238 221 244 296 361 378 325 273 236 199 175 180 222 265 251 238 242 275 308 311 314 318 319 321 305 290
$$ packed form
11119Hj1j1qqqqJ3J2M2M2J6J6n0m8j7L2L4L5L2L3L1L0k8n9k2K7K7kj2j2N2N3P9P9M8%k2k2
11102C93m6m6j6j7K1K2rqNNq3q3n4n3k4k4ONL4L5M2M2K2k8m0j0M1P2N2N2K5K4%%%%rj0rrk2
11084B98k2k1k2J%%%L7L8L7L7l3l3l3l3J8J9j1j1r0r0p1k0pl7o4o4J6M6L0L0K8K7K8K9K1K0
11068I8M0RLL1J4J3KJ%%Kk7j1j0J6J5j3j4j8j8L9L9Nk4rqL6L6L2L3j5o4n1k2ML3J8J9j2j1
11051B11j1j2J6J6J6J5qqqql5l5l5l5l9l9l7l9j%%%L4L3O1O2M8J8k4k4j4j5j4j5J8J8M5M4
11035A99K8k1n1n1J5M5K7K8L2L2P1J00J19O9l8j07j23r4l5nJ0k0n8n8RL8K2K2J8J8J8J8KK
11020B81k8k8llm3p2l7J1N6K7j2m2n5n4k1QK0K1J8J9L5Ol4l4QL6K2K2K3K4L3L3K0j0l2l1P
11004A91L6Mk6l4l5LL2M4M4M2J3l0k9j7j7K3N2O5J7n3n2l7l7k4NM2M3j4j3ML3L3LLMJKj6j5
$$ plain form
10987 290 274 258 234 209 184 159 167 174 181 188 171 153 119 114 139 163 147 101 60 19 6 -7 -15 -23 -2 18 79 139 198 257 262 239 230 221 191 132 72 43 51 60
10970 60 70 80 84 88 92 96 135 174 172 141 105 98 132 166 204 241 236 202 197 191 183 176 220 264 279 294 330 366 382 349 296 273 280 286 313 340 365 340 287 234 208
10952 208 181 149 118 116 114 134 154 144 135 122 109 146 182 211 240 240 240 264 288 283 278 217 156 135 162 228 264 271 277 286 294 273 252 244 237 209 133 44 -15 -45 -76
10934 -76 -75 -74 -73 -72 -55 -39 -22 -6 17 41 65 89 101 113 125 137 147 157 167 177 173 169 166 162 146 130 160 190 194 148 86 54 67 111 169 227 256 285 314
10917 314 343 355 366 378 390 345 300 255 210 146 83 23 -36 -47 -9 0 10 61 112 177 212 188 116 41 16 54 92 133 174 211 247 235 223 204 186
10902 186 170 154 160 196 213 230 214 168 139 110 92 73 57 40 52 94 135 147 164 180 194 209 226 243 230 217 165 112 81 99 152 205 259 313 322
10887 322 301 249 197 159 149 173 196 213 229 246 263 275 288 284 309 345 380 376 323 269 214 189 194 223 253 254 256 248 240 233 225 226 227 215 174 123 72 69 66 63 60 87
10869 87 114 106 99 91 83 92 100 110 121 164 238 322 407 454 472 474 447 385 324 274 253 242 232 224 215 206 197 186 175 173 142 128 113 86 60 33 6 7 7 8 8 -3 -16
$$ packed form
10987B90j6j6k4k5k5k5QPPPj7j8l4nK5K4j6m6m1m1j3j3qqK1K0O1O0N9N9Nk3rrl0n9o0k9QR
10970F0J0J0MMMML9L9kl1l6pL4L4L8L7nl4noqpM4M4J5J5L6L6J6l3n3k3POK7K7K5k5n3n3k6
10952B08k7l2l1kkK0K0j0rj3j3L7L6K9K9%%K4K4nno1o1k1K7O6L6PORQk1k1qpk8p6q9n9l0l1
10934g6JJJJJ7J6J7J6K3K4K4K4J2J2J2J2J0J0J0J0mmlmj6j6L0L0Mm6o2l2J3M4N8N8K9K9K9
10917C14K9J2J1J2J2m5m5m5m5o4o3o0n9j1L8RJ0N1N1O5L5k4p2p5k5L8L8M1M1L7L6j2j2j9j8
10902A86j6j6OL6J7J7j6m6k9k9j8j9j6j7J2M2M1J2J7J6J4J5J7J7j3j3n2n3l1J8N3N3N4N4R
10887C22k1n2n2l8j0K4K3J7J6J7J7J2J3mK5L6L5mn3n4n5k5NK9L0JKqqpqJJj2m1n1n1llllK7
10869H7K7qpqqRQJ0J1M3P4Q4Q5M7J8Kk7o2o1n0k1j1j0qrrrj1j1kl1j4j5k7k6k7k7J%J%j1j3
$$ plain form
10850 -16 -28 -40 -29 -17 43 104 122 140 158 176 185 194 201 208 169 100 21 -9 16 43 72 101 136 171 205 240 253 265 278 290 293 295 297 299 298 296 265 234 233 232 201
10832 201 141 100 108 136 163 181 199 217 234 221 208 195 182 159 135 85 36 0 11 44 78 77 76 75 74 88 102 166 230 241 252 234 215 252 288 354 420
10816 420 418 415 410 405 350 247 146 94 80 97 100 102 128 154 229 303 340 376 363 350 356 361 367 373 334 295 256 218 201 185 168 152 131 111 91 71 82 94
10800 94 106 118 141 165 188 212 211 211 210 210 178 145 84 22 -7 -38 -20 -1 42 86 129 173 183 194 204 214 197 181 165 148 132 115 147 179 166 153 140
10784 140 127 124 120 165 211 255 299 294 288 266 244 192 140 95 51 36 21 38 54 2 -79 -127 -126 -124 -123 -130 -136 -94 -51 -7 35 30 25 50 75 101 126 153 180 207
10766 207 234 239 243 248 253 249 245 241 237 211 185 159 133 95 57 20 -17 0 19 68 116 148 180 163 145 131 116 131 146 149 152 184 217 223 230 187 145 122 100 126
10749 126 153 156 160 209 258 291 274 238 233 263 293 306 269 220 201 230 260 258 256 282 308 376 416 393 321 235 179 173 166 134 102 70 38 9 -18 2 23 30
10732 30 37 47 56 105 184 244 255 219 183 193 203 221 238 256 273 302 330 359 387 339 290 242 194 183 172 211 279 332 337 282 227 181 134 88 42 44 46
$$ packed form
10850a6j2j2J1J2O0O1J8J8J8J8RRPPl9o9p9l0K5K7K9K9L5L5L4L5J3J2J3J2LKKKjkl1l1jjl1
10832B01o0m1QK8K7J8J8J8J7j3j3j3j3k3k4n0m9l6J1L3L4jjjjJ4J4O4O4J1J1j8j9L7L6O6O6
10816D20klnnn5j03j01n2j4J7LKK6K6P5P4L7L6j3j3ONOOl9l9l9l8j7j6j7j6k1k0k0k0J1J2
10800I4J2J2K3K4K3K4j%j%l2l3o1o2k9l1J8J9M3M4M3M4J0J1J0J0j7j6j6j7j6j7L2L2j3j3j3
10784A40j3lmM5M6M4M4nok2k2n2n2m5m4j5j5J7J6n2q1m8JKJpoM2M3M4M2nnK5K5K6K5K7K7K7
10766B07K7NMNNmmmmk6k6k6k6l8l8l7l7J7J9M9M8L2L2j7j8j4j5J5J5LLL2L3OPm3m2k3k2K6
10749A26K7LMM9M9L3j7l6nL0L0J3l7m9j9K9L0kkK6K6O8M0k3p2q6n6opl2l2l2l2k9k7K0K1P
10732C0PJ0RM9P9O0J1l6l6J0J0J8J7J8J7K9K8K9K8m8m9m8m8j1j1L9O8N3Nn5n5m6m7m6m6KK
$$ plain form
10716 46 47 49 89 129 195 261 290 270 189 108 40 -26 -45 -63 -19 24 39 53 27 1 25 48 78 109 139 170 157 143 130 117 103 90 77 63 28 -6
10701 -6 -42 -77 -74 -70 -17 34 64 94 125 155 156 157 158 160 158 156 154 152 137 121 136 150 177 204 163 121 144 167 190 213 223 232 272 311 293 275 208 141 90 39 37
10683 37 35 71 106 142 177 216 254 243 231 221 210 200 189 153 118 82 46 91 136 182 227 259 292 324 356 357 357 357 358 368 378 388 398 372 345 318 291
10667 291 255 218 181 144 178 213 247 282 274 267 260 253 224 194 165 136 165 195 225 255 284 314 344 373 361 348 335 322 309 296 283 270 253 236 219 202
10651 202 158 114 71 27 50 74 97 120 137 153 169 185 227 270 313 355 331 307 284 260 243 226 209 192 192 192 193 193 185 178 170 162 140 118 97 75 49 23
10635 23 13 63 126 190 192 193 169 203 273 343 388 433 449 465 434 403 343 282 222 162 131 100 91 82 103 123 125 126 157 188 229 271 312 353 335 317 300 282
10618 282 284 287 223 160 143 175 208 242 222 201 181 161 169 178 186 195 191 187 183 179 192 205 218 232 244 256 268 280 298 317 247 148 55 11 7 3 -21 -45 -70 -95
10601 -95 -58 -21 14 51 54 57 31 5 2 0 25 51 88 125 140 106 43 -19 -16 -13 20 55 89 123 62 1 -30 -61 -45 -29 -12 3 23 43 33 24 45 66
$$ packed form
10716D6JKM0M0O6O6K9k0q1q1o8o6j9j8M4M3J5J4k6k6K4K3L0L1L0L1j3j4j3j3j4j3j3j4l5l4
10701fl6l5LMN3N1L0L0L1L0JJJKkkkkj5j6J5J4K7K7m1m2K3K3K3K3J0RM0L9j8j8o7o7n1n1k
10683C7kL6L5L6L5L9L8j1j2j0j1j0j1l6l5l6l6M5M5M6M5L2L3L2L2J%%JJ0J0J0J0k6k7k7k7
10667B91l6l7l7l7L4L5L4L5qpppk9l0k9k9K9L0L0L0K9L0L0K9j2j3j3j3j3j3j3j3j7j7j7j7
10651B02m4m4m3m4K3K4K3K3J7J6J6J6M2M3M3M2k4k4k3k4j7j7j7j7%%J%qpqqk2k2k1k2k6k6
10635B3j0N0O3O4KJk4L4P0P0M5M5J6J6l1l1o0o1o0o0l1l1rrK1K0KJL1L1M1M2M1M1j8j8j7j8
10618B82KLo4o3j7L2L3L4k0k1k0k0QRQRmmmmJ3J3J3J4J2J2J2J2J8J9p0r9r3m4mmk4k4k5k5
10601i5L7L7L5L7LLk6k6lkK5K6L7L7J5l4o3o2LLL3L5L4L4o1o1l1l1J6J6J7J5K0K0j0rK1K1
$$ plain form
10585 66 87 109 124 140 185 230 231 231 202 172 134 95 86 77 87 98 108 118 150 181 144 107 92 77 61 46 95 145 195 244 230 216 156 95 49 52 97
10569 97 141 181 221 231 241 214 187 161 134 115 96 76 57 64 71 108 145 170 196 222 247 251 254 228 202 207 211 216 221 192 164 165 166 223 281 279 228 158 116 108 129
10551 129 141 153 138 122 122 121 150 179 186 193 200 206 213 220 227 233 201 169 137 105 121 136 122 108 102 95 89 82 120 157 165 172 155 138 120 103 79 56 32 9 17 25 34 42
10532 42 56 69 82 96 72 48 28 7 30 102 161 190 169 118 82 46 15 -16 21 58 105 153 170 188 208 228 249 269 245 222 169 116 84 53 71
10517 71 88 99 109 90 71 104 137 140 144 127 111 143 176 210 244 279 313 299 285 270 256 266 276 285 295 307 318 330 341 378 415 393 322 245 198 180
10501 180 163 151 140 177 215 196 177 158 139 146 154 161 169 198 228 258 287 297 306 316 326 318 310 303 295 321 346 371 397 373 348 324 300 243 186 132 126 192 258
10484 258 305 303 272 242 208 175 163 152 140 129 163 197 231 216 171 157 172 187 170 153 107 61 40 19 28 36 64 92 120 148 151 153 156 159 164 168 173 178 206 234
10467 234 213 192 165 139 162 185 205 226 276 325 321 317 283 249 233 216 246 276 252 179 106 82 86 91 99 107 101 96 90 84 101 117 134 150 181 213 244 275 259
$$ packed form
10585F6K1K2J5J6M5M5J%k9l0l8l9rrJ0J1J0J0L2L1l7l7j5j5j6j5M9N0N0M9j4j4o0o1m6LM5
10569I7M4M0M0J0J0k7k7k6k7j9j9k0j9PPL7L7K5K6K6K5MLk6k6NMNNk9k8JJN7N8kn1p0m2qK1
10551A29J2J2j5j6%jK9K9PPPOPPPOl2l2l2l2J6J5j4j4opopL8L7QPj7j7j8j7k4k3k4k3QQRQ
10532D2J4J3J3J4k4k4k0k1K3P2N9K9k1n1l6l6l1l1L7L7M7M8J7J8K0K0K1K0k4k3n3n3l2l1J8
10517G1J7J1J0j9j9L3L3LMj7j6L2L3L4L4L5L4j4j4j5j4J0J0RJ0J2J1J2J1L7L7k2p1p7m7j8
10501A80j7j2j1L7L8j9j9j9j9PQPQK9L0L0K9J0RJ0J0qqpqK6K5K5K6k4k5k4k4n7n7n4oO6O6
10484B58M7kl1l0l4l3j2j1j2j1L4L4L4j5m5j4J5J5j7j7m6m6k1k1RQK8K8K8K8LKLLNMNNK8K8
10467B34k1k1k7k6K3K3K0K1N0M9mml4l4j6j7L0L0k4p3p3k4MNQQonooJ7J6J7J6L1L2L1L1j6
$$ plain form
10450 259 244 228 212 203 195 186 177 168 159 150 142 175 208 241 274 283 293 252 212 188 163 138 113 137 161 185 209 234 259 285 310 279 247 190 132 85 87 110 134
10433 134 158 182 234 236 178 120 107 95 113 131 119 108 73 39 53 98 128 108 69 31 61 91 122 152 172 192 182 172 141 110 129 147 194 241 259
10418 259 277 231 186 141 95 85 75 114 152 176 200 194 189 171 152 134 116 117 117 117 117 114 110 108 107 176 275 382 439 414 339 292 245 249 302 327 352 368 384
10401 384 400 416 352 289 225 162 194 227 259 291 285 278 271 264 274 284 295 305 334 363 393 422 418 414 344 275 212 199 227 255 259 262 265 269 262 254 296 338 350 361
10383 361 343 326 327 329 302 274 239 204 169 134 114 94 74 55 96 138 180 221 234 247 259 272 285 297 310 323 306 290 274 257 239 220 250 281 308
10368 308 336 334 332 331 330 358 387 398 409 390 372 318 264 213 210 243 276 263 251 230 210 190 169 176 182 189 195 194 193 163 133 112 92 121 150 173 197 220 243 243
10351 243 243 193 144 62 -18 -51 -83 -76 -70 -63 -56 -39 -22 24 71 132 194 206 218 247 277 306 336 328 320 312 304 256 208 201 244 306 369 391 365 298 202 121 89
10334 89 98 107 70 32 42 51 60 70 94 118 143 167 149 132 114 97 115 133 152 170 189 207 226 244 238 231 225 218 212 206 199 193 201 210 218 227 252 278 303 329 338 348 357 366
$$ packed form
10450B59j5j6j6rqrrrrrqL3L3L3L3RJ0m1m0k4k5k5k5K4K4K4K4K5K5K6K5l1l2n7n8m7KK3K4
10433A34K4K4N2Kn8n8j3j2J8J8j2j1l5l4J4M5L0k0l9l8L0L0L1L0K0K0j0j0l1l1J9J8M7M7J8
10418B59J8m6m5m5m6j0j0L9L8K4K4onj8j9j8j8J%%%lmkjO9R9J07N7k5p5m7m7MN3K5K5J6J6
10401C84J6J6o4o3o4o3L2L3L2L2opppJ0J0J1J0K9K9L0K9mmp0o9o3j3K8K8MLLMpqM2M2J2J1
10383C61j8j7JKk7k8l5l5l5l5k0k0k0j9M1M2M2M1J3J3J2J3J3J2J3J3j7j6j6j7j8j9L0L1K7
10368C08K8kkjjK8K9J1J1j9j8n4n4n1lL3L3j3j2k1k0k0k1POPOjjl0l0k1k0K9K9K3K4K3K3%
10351B43%n0m9q2q0l3l2POPPJ7J7M6M7O1O2J2J2K9L0K9L0qqqqm8m8pM3O2O3K2k6o7r6q1l2
10334H9RRl7l8J0RRJ0K4K4K5K4j8j7j8j7J8J8J9J8J9J8J9J8opopoopoQRQRK5K6K5K6RJ0RR
$$ plain form
10315 366 410 454 468 482 473 464 406 319 240 211 221 231 239 247 255 263 281 299 268 236 226 216 206 196 190 184 178 172 202 232 262 292 285 278 271 264 257 250 243 236 212 188 164
10296 164 139 155 171 188 204 167 130 93 56 43 29 75 120 158 197 176 155 158 162 165 168 142 116 90 64 103 141 141 111 114 165 204 214 201 189 175 162
10280 162 114 67 79 91 111 132 152 173 160 147 131 115 73 -17 -94 -141 -135 -80 -51 -21 25 72 118 165 166 166 166 166 199 233 266 299 286 273 259 246 261
10264 261 276 291 307 286 266 245 225 165 105 143 182 202 222 242 262 266 270 274 278 299 320 342 363 355 347 338 328 246 134 59 53 105 157 155 152 158 164 170 176 144 113
10246 113 141 168 175 181 188 195 170 144 119 94 73 53 92 130 165 201 177 153 159 164 170 176 124 73 21 -29 -29 -29 -29 -29 38 105 172 239 255 270 286 301 273 245
10229 245 217 188 137 85 0 -25 -5 14 38 61 85 108 132 155 184 212 240 268 244 220 197 173 145 116 88 59 73 86 99 113 143 173 203 234
10214 234 236 238 180 123 98 73 48 23 26 29 32 35 47 60 72 85 101 117 133 149 193 237 257 218 143 98 112 156 178 170 180 190 172 153 194 234 274 314
10198 314 354 394 331 268 205 141 136 131 182 232 265 239 247 254 240 226 212 198 176 155 133 112 118 124 130 136 158 180 201 223 228 234 210 186 137 89 98 156 230 254
$$ packed form
10315C66M4M4J4J4rrn8q7p9k9J0J0QQQQJ8J8l1l2j0j0j0j0ooooL0L0L0L0ppppppppk4k4k4
10296A64k5J6J6J7J6l7l7l7l7j3j4M6M5L8L9k1k1LMLLk6k6k6k6L9L8%l0LN1L9J0j3j2j4j3
10280A62m8m7J2J2K0K1K0K1j3j3j6j6m2r0p7m7ON5K9L0M6M7M6M7J%%%L3L4L3L3j3j3j4j3J5
10264B61J5J5J6k1k0k1k0o0o0L8L9K0K0K0K0MMMMK1K1K2K1qqrj0q2j12p5oN2N2klOOOOl2l1
10246A13K8K7POPPk5k6k5k5k1k0L9L8L5L6k4k4ONOOn2n1n2n0%%%%O7O7O7O7J6J5J6J5k8k8
10229B45k8k9n1n2q5k5K0J9K4K3K4K3K4K3K9K8K8K8k4k4k3k4k8k9k8k9J4J3J3J4L0L0L0L1
10214B34KKn8n7k5k5k5k5LLLLJ2J3J2J3J6J6J6J6M4M4K0l9p5m5J4M4K2qJ0J0j8j9M1M0M0M0
10198C14M0M0o3o3o3o4nnN1N0L3k6QPj4j4j4j4k2k1k2k1OOOOK2K2K1K2NOk4k4m9m8RN8P4K4
$$ plain form
10181 254 219 155 137 149 172 195 200 206 212 218 239 260 232 204 173 142 161 179 224 270 285 301 358 414 421 359 264 169 138 107 149 192 234 276 263 249 206
10165 206 163 134 106 146 187 238 289 271 223 186 197 229 260 229 198 168 137 131 126 120 115 117 119 120 122 145 168 191 213 180 146 112 78 83 87 92 96 88 81 73 65 95
10146 95 125 154 184 206 229 251 273 289 305 318 332 306 250 183 165 212 258 258 258 237 216 221 226 219 162 48 -65 -132 -150 -143 -106 -34 37 62 87 80 74 69
10130 69 64 89 143 179 166 122 77 62 76 111 146 183 219 220 221 189 128 76 23 1 -21 -33 -14 16 47 56 64 45 26 -1 0 32 65 74 54 34 43 54 65
10113 65 78 91 128 166 220 245 234 224 213 203 210 246 281 286 249 184 135 86 107 157 191 225 249 272 266 260 219 179 169 189 235 252 218 185 166 147 129
10097 129 112 121 159 181 203 217 230 261 262 243 224 204 185 194 232 270 279 279 279 277 276 291 305 337 339 280 221 193 194 171 147 126 104 93 83 103 152 219 256
10080 256 263 269 276 283 261 238 200 162 153 145 145 145 174 204 224 245 216 187 150 113 46 -20 -39 -59 -49 -39 12 63 114 166 195 224 303 381 426 472 487 503
10064 503 426 349 272 195 184 173 212 250 264 278 292 306 346 385 424 463 447 430 413 396 348 299 250 202 211 221 231 241 212 183 154 125 103 81 108
$$ packed form
10181B54l5o4j8J2K3K3NOOOK1K1k8k8l1l1J9J8M5M6J5J6N7N6Po2r5r5l1l1M2M3M2M2j3j4m3
10165B06m3k9k8M0M1N1N1j8m8l7J1L2L1l1l1l0l1ononKKJKK3K3K3K2l3l4l4l4NMNMqpqqL0
10146I5L0K9L0K2K3K2K2J6J6J3J4k6n6o7j8M7M6%%k1k1NNpn7j14j13o7j8PL7P2P1K5K5pon
10130F9nK5N4L6j3m4m5j5J4L5L5L7L6JJl2o1n2n3k2k2j2J9L0L1RQj9j9k7JL2L3Rk0k0RJ1J1
10113F5J3J3L7L8N4K5j1j0j1j0PL6L5Nl7o5m9m9K1N0L4L4K4K3oom1m0j0K0M6J7l4l3j9j9j8
10097A29j7RL8K2K2J4J3L1Jj9j9k0j9RL8L8R%%kjJ5J4L2Kn9n9k8Jk3k4k1k2j1j0K0M9O7L7
10080B56POPPk2k3l8l8rq%%K9L0K0K1k9k9l7l7o7o6j9k0J0J0N1N1N1N2K9K9P9P8M5M6J5J6
10064E03p7p7p7p7j1j1L9L8J4J4J4J4M0L9L9L9j6j7j7j7m8m9m9m8RJ0J0J0k9k9k9k9k2k2K7
$$ plain form
10048 108 135 134 133 132 132 121 110 100 91 125 189 240 232 165 98 80 122 171 189 155 62 -24 -81 -87 -63 -37 -11 -13 -15 28 72 114 157 121 57 5 12 59 106
10031 106 108 109 131 153 174 196 143 91 12 -65 -113 -102 -55 -8 -7 -6 -6 -5 41 88 134 181 189 197 205 213 221 228 236 244 260 275 290 306 279 253 227 200 167 134 101
10014 101 68 52 36 21 5 34 64 93 122 144 166 188 210 188 165 144 123 89 84 122 209 300 361 361 312 219 127 70 63 94 96 51 7 -13 14 45
9998 45 75 96 117 137 158 119 80 41 2 -12 -28 -43 -58 -36 -15 6 28 48 69 89 109 130 150 170 191 196 201 206 211 175 138 101 65 70 75 80 85 135 184
9981 184 185 186 155 123 92 61 58 56 54 51 70 89 109 130 142 184 237 241 194 147 166 185 177 169 161 154 179 204 229 254 284 314 314 314 324 334 295 226 166 155 185
9963 185 244 309 346 333 271 220 219 246 273 275 278 251 224 207 190 233 275 313 352 331 310 264 218 202 186 196 206 157 108 41 -25 5 36 58 79 127
9948 127 176 205 185 150 86 14 -57 -100 -93 -36 19 79 139 149 159 207 284 322 291 242 193 149 105 62 18 17 17 16 15 38 60 83 105 112 118 124 131 134 137 82
9930 82 26 5 -14 23 62 107 152 169 186 214 271 319 298 215 102 7 -39 -18 51 141 201 241 253 236 190 131 72 40 8 9 9 10 10 0 -8 -18 -28
$$ packed form
10048A08K7jjj%j1j1j0rL4O4N1qo7o7j8M2M9J8l4r3q6n7oK4K6K6kkM3M4M2M3l6o4n2PM7M7
10031A06KJK2K2K1K2n3n2p9p7m8J1M7M7JJ%JM6M7M6M7QQQQQPQQJ6J5J5J6k7k6k6k7l3l3l3
10014A01l3j6j6j5j6K9L0K9K9K2K2K2K2k2k3k1k1l4nL8Q7R1O1%m9r3r2n7pL1Km5m4k0K7L1
9998D5L0K1K1K0K1l9l9l9l9j4j6j5j5K2K1K1K2K0K1K0K0K1K0K0K1NNNNl6l7l7l6NNNNN0M9
9981A84JJl1l2l1l1lkklJ9J9K0K1J2M2N3Mm7m7J9J9qqqpK5K5K5K5L0L0%%J0J0l9o9o0j1L0
9963A85N9O5L7j3o2n1jK7K7KLk7k7j7j7M3M2L8L9k1k1m6m6j6j6J0J0m9m9o7o6L0L1K2K1M8
9948A27M9K9k0l5o4p2p1m3PN7N5O0O0J0J0M8P7L8l1m9m9m4m4m3m4j%jjK3K2K3K2POOPLLn5
9930H2n6k1j9L7L9M5M5J7J7K8N7M8k1q3j13r5m6K1O9R0O0M0J2j7m6n9n9l2l2J%J%j0qj0j0
$$ plain form
9914 -28 -34 -41 -44 -47 -43 9 93 177 240 302 305 309 312 315 319 322 280 238 195 153 114 76 94 113 107 71 24 26 46 65 88 110 169 228 255 233 198 163 184 206 196 186
9896 186 117 48 -7 -64 -61 -58 -40 -23 22 69 114 159 174 189 182 175 197 219 281 343 375 408 376 344 312 280 278 276 275 273 233 193 154 114 125 137 178 218 290
9879 290 361 374 386 382 379 316 253 191 128 95 62 71 80 119 158 160 162 135 107 126 144 160 176 156 106 46 36 102 198 238 248 249 249 248 246 257 268 220 172 136
9862 136 100 67 34 -2 10 55 99 94 89 83 78 80 82 84 87 42 -1 12 27 84 141 166 143 65 -12 -34 -56 -74 -91 -50 -9 21 51 52 52 57 63 68 73 -10 -94 -113
9844 -113 -73 4 81 162 243 269 296 322 349 343 338 332 327 280 234 188 142 116 91 66 40 21 1 8 73 147 221 239 258 256 254 252 250 273 297 262 227 219 211 259
9826 259 307 332 299 240 180 164 147 130 113 124 135 176 216 226 236 187 138 79 19 19 19 37 56 74 93 131 169 204 238 244 191 76 -38 -117 -137
9811 -137 -131 -125 -126 -127 -69 -11 17 45 74 102 107 111 116 120 112 104 96 89 68 47 26 6 -25 -57 -30 -3 36 75 114 153 164 174 211 248 277 257 206 155 113 72 60
9793 60 48 56 64 102 139 158 178 197 216 248 280 254 227 180 133 115 98 125 152 180 207 157 106 43 8 17 76 136 146 141 136 128 120 106 93 79 66 38 9
$$ packed form
9914b8opllMN2Q4Q4O3O2LMLLMLm2m2m3m2l9l8J8J9ol6m7KK0J9K3K2N9N9K7k2l5l5K1K2j0j0
9896A86o9o9n5n7LLJ8J7M5M7M5M5J5J5ppK2K2O2O2L2L3l2l2l2l2kkjkm0m0l9m0J1J2M1M0P2
9879B90P1J3J2mlo3o3o2o3l3l3RRL9L9KKk7k8J9J8J6J6k0n0o0j0O6R6M0J0J%jkJ1J1m8m8l6
9862A36l6l3l3l6J2M5M4nnonKKKLm5m3J3J5N7N7K5k3p8p7k2k2j8j7M1M1L0L0J%NONNq3q4j9
9844a13M0P7P7Q1Q1K6K7K6K7ononm7m6m6m6k6k5k5k6j9k0PO5P4P4J8J9kkkkK3K4l5l5qqM8
9826B59M8K5l3n9o0j6j7j7j7J1J1M1M0J0J0m9m9n9o0%%J8J9J8J9L8L8L5L4On3j15j14p9k0
9811a37OOjjN8N8K8K8K9K8NMNMqqqpk1k1k1k0l1l2K7K7L9L9L9L9J1J0L7L7K9k0n1n1m2m1j2
9793F0j2QQL8L7J9K0J9J9L2L2k6k7m7m7j8j7K7K7K8K7n0n1o3l5RN9O0J0nnqqj4j3j4j3k8k9
$$ plain form
9777 9 40 71 136 201 207 213 184 155 127 98 104 110 116 122 106 90 74 58 64 71 78 85 92 99 106 113 106 99 92 84 86 87 89 91 124 157 131 105 75 45 16 -13 -5 2 10 18 66 114 163
9755 163 211 189 167 173 228 280 283 218 153 135 116 127 138 171 204 158 83 20 6 21 37 33 29 26 22 40 59 77 96 137 177 218 258 302 345 418 432 372
9739 372 253 164 75 47 19 -7 -35 -12 9 31 53 63 72 52 31 25 19 -41 -103 -119 -76 32 140 159 178 197 217 253 288 295 301 295 288 337 386 423 401
9723 401 353 305 249 193 107 22 -31 -84 -78 -72 -5 61 128 194 193 191 190 188 181 175 113 51 8 25 67 109 151 193 210 167 99 31 19 7 44 81 89 97 103 108 173
9705 173 237 254 272 289 306 293 281 268 255 230 205 180 155 160 166 171 176 168 161 154 147 142 137 132 128 140 152 165 177 201 225 249 273 256 239 166 93 44 54 60 65 81
9687 81 96 111 126 117 108 158 208 225 242 259 276 245 215 185 154 171 187 203 220 253 286 320 353 392 431 440 450 486 523 528 484 427 371 311 252 204 156
9671 156 108 61 79 98 117 136 106 76 46 16 18 20 22 24 16 8 0 -7 31 70 108 147 199 251 303 355 345 335 326 316 289 261 234 206 211 215 221 228 228 258 299 291
9653 291 273 254 232 211 227 244 287 329 332 286 208 131 110 90 100 109 97 85 102 119 155 191 197 203 183 162 142 122 113 104 122 141 89 8 -25 -9 32 75
$$ packed form
9777IL1L1O5O5OOk9k9k8k9OOOOj6j6j6j6OPPPPPPPpppqKJKKL3L3k6k6l0l0k9k9QPQQM8M8M9
9755A63M8k2k2ON5N2Lo5o5j8j9J1J1L3L3m6p5o3j4J5J6mmlmJ8J9J8J9M1M0M1M0M4M3P3J4o0
9739C72j19q9q9k8k8k6k8K3K1K2K2J0Rk0k1ooo0o2j6M3J08J08J9J9J9K0L6L5POopM9M9L7k2
9723D01m8m8n6n6q6q5n3n3OOO7O6O7O6jkjkpoo2o2m3J7M2M2M2M2J7m3o8o8j2j2L7L7QQONO5
9705A73O4J7J8J7J7j3j2j3j3k5k5k5k5NONNqpppnnnmJ2J2J3J2K4K4K4K4j7j7p3p3m9J0ONJ6
9687H1J5J5J5rrN0N0J7J7J7J7l1l0l0l1J7J6J6J7L3L3L4L3L9L9RJ0L6L7Nm4n7n6o0n9m8m8
9671A56m8m7J8J9J9J9l0l0l0l0KKKKqqqpL8L9L8L9N2N2N2N2j0j0rj0k7k8k7k8NMOP%L0M1q
9653B91j8j9k2k1J6J7M3M2Lm6p8p7k1k0J0Rj2j2J7J7L6L6OOk0k1k0k0rrJ8J9n2q1l3J6M1M3
$$ plain form
9636 75 62 49 28 7 13 20 -26 -102 -141 -112 -46 19 30 41 56 70 124 207 290 323 304 256 221 187 209 232 228 223 219 215 226 237 249 260 239 219 198 178
9620 178 186 194 202 210 191 172 153 134 134 134 133 133 167 202 177 153 114 75 65 56 89 123 156 190 218 246 304 362 394 427 401 374 306 239 171 104 101 98 134 200
9602 200 250 251 183 115 85 55 54 53 74 95 87 79 60 42 27 12 10 58 137 216 247 279 311 342 321 299 277 255 254 253 252 251 190 130 128 126 158 190 221 253 212
9585 212 171 130 89 55 20 16 11 42 73 75 27 -34 -66 -59 -52 -74 -96 -117 -139 -101 -62 32 127 192 228 251 273 308 342 318 293 274 256 265 274 275 246 175 103
9568 103 37 -28 -63 -49 5 61 117 174 206 208 225 241 226 182 154 126 112 99 86 73 61 50 22 24 41 58 96 104 111 147 181 185 158 132 103 75 46
9552 46 18 -8 -35 -17 30 78 96 87 78 79 109 130 122 76 29 -22 -45 -42 -9 25 59 123 186 224 214 173 133 97 91 127 163 191 219 245 271 265 230 211 193
9535 193 172 152 131 111 144 176 207 238 261 253 204 154 114 73 5 -62 -114 -136 -132 -99 -70 -41 -11 19 27 36 44 53 70 87 48 8 -9 2 27 51 49 47 62
9518 62 47 -23 -93 -134 -175 -190 -177 -112 -48 14 46 67 87 93 99 106 112 117 122 126 131 122 113 86 88 102 87 91 94 85 75 66 56 46 36 39 71 130 189 228 218 195 171
$$ packed form
9636G5j3j3k1k1OPm6p6l9K9O6O5J1J1J5J4N4Q3Q3L3j9m8l5l4K2K3mnmmJ1J1J2J1k1k0k1k0
9620A78QQQQj9j9j9j9%%j%L4L5k5k4l9l9j0rL3L4L3L4K8K8N8N8L2L3k6k7o8o7o8o7llL6O6
9602B00N0Jo8o8l0l0jjK1K1qqj9j8j5j5kM8P9P9L1L2L2L1k1k2k2k2jjjjo1o0kkL2L2L1L2m1
9585B12m1m1m1l4l5mnL1L1Km8o1l2PPk2k2k1k2L8L9R4R5O5L6K3K2L5L4k4k5j9j8RRJk9p1p2
9568A03o6o5l5J4N4N6N6N7L2KJ7J6j5m4k8k8j4j3j3j3j2j1k8KJ7J7L8QPL6L4Mk7k6k9k8k9
9552D6k8k6k7J8M7M8J8rrJL0K1qm6m7n1k3LL3L4L4O4O3L8j0m1m0l6oL6L6K8K8K6K6ol5j9j8
9535A93k1k0k1k0L3L2L1L1K3qm9n0m0m1o8o7n2k2ML3K9K9L0L0QRQRJ7J7l9m0j7J1K5K4kkJ5
9518F2j5p0p0m1m1j5J3O5O4O2L2K1K0OOPONNMNrrk7KJ4j5MLrj0rj0j0j0LL2N9N9L9j0k3k4
$$ plain form
9499 171 133 66 -11 -59 -53 -18 23 65 79 93 82 70 59 48 52 56 60 64 64 64 64 64 51 39 26 14 -4 -23 -42 -61 -53 -45 -37 -29 -1 26 70 84 77 70 60 51 58
9481 58 64 120 176 227 277 278 279 281 283 313 343 334 296 245 194 185 176 168 159 121 83 18 -46 -95 -114 -100 -86 -64 -41 -18 4 25 45 82 90 67 44 20 -4 15 35
9463 35 54 74 50 26 25 74 153 262 354 396 374 322 284 246 209 171 134 96 42 -11 3 18 37 56 74 93 84 75 37 -1 1 3 54 106 146 187 198
9447 198 209 181 154 156 158 191 224 188 152 114 77 89 101 84 68 81 94 102 110 88 67 81 96 110 124 160 196 232 268 272 276 280 284 268 252 236 220 191 162
9430 162 134 105 103 101 99 97 87 77 68 58 97 136 175 214 218 222 226 230 238 246 204 162 138 114 99 114 115 66 0 -64 -55 3 64 124 147 170 144 118 79 41 32 23
9412 23 28 33 68 102 125 147 140 133 157 180 174 168 145 122 100 79 86 122 159 166 154 143 130 116 108 99 74 78 141 205 229 203 154 105 85 95 110 125 92 30 -10
9394 -10 -2 42 87 153 189 173 128 99 119 159 199 231 262 261 230 189 148 152 156 176 166 125 85 71 87 116 145 146 148 179 211 218 225 232 239 246 254 261 268 254 241 216
9376 216 162 88 43 32 51 107 164 221 277 320 333 310 258 194 130 116 131 178 225 301 376 420 416 392 367 355 373 403 434 459 483 487 441 369 296 273
$$ packed form
9499A71l8o7p7m8OL5M1M2J4J4j1j2j1j1MMMM%%%%j3j2j3j2j8j9j9j9QQQQK8K7M4J4ppj0rP
9481E8ON6N6N1N0JJKKL0L0rl8n1n1rrqrl8l8o5o4m9j9J4J4K2K3K3K2K1K0L7Qk3k3k4k4J9K0
9463C5J9K0k4k4jM9P9J09R2M2k2n2l8l8l7l8l7l8n4n3J4J5J9J9J8J9rrl8l8KKN1N2M0M1J1
9447A98J1k8k7KKL3L3l6l6l8l7J2J2j7j6J3J3QQk2k1J4J5J4J4L6L6L6L6MMMMj6j6j6j6k9k9
9430A62k8k9kkkkj0j0rj0L9L9L9L9MMMMQQm2m2k4k4j5J5Jm9o6o4RN8O1O0K3K3k6k6l9l8rr
9412B3NNL5L4K3K2ppK4K3ook3k3k2k1PL6L7Pj2j1j3j4qrk5MO3O4K4k6m9m9k0J0J5J5l3o2m0
9394a0QM4M5O6L6j6m5k9K0M0M0L2L1jl1m1m1MMK0j0m1m0j4J6K9K9JKL1L2PPPPPQPPj4j3k5
9376B16n4p4m5j1J9N6N7N7N6M3J3k3n2o4o4j4J5M7M7P6P5M4mk4k5j2J8L0L1K5K4Mm6p2p3k3
$$ plain form
9360 273 280 300 321 341 362 360 329 285 241 206 172 167 163 176 190 233 277 305 334 313 293 222 152 131 110 120 131 141 152 160 168 222 276 307 289 296 303 302 253
9343 253 182 111 71 31 60 88 123 158 124 90 71 51 62 72 71 70 118 166 205 243 212 181 150 120 89 58 94 130 166 202 172 141 111 80 96 112
9327 112 127 143 163 183 204 224 236 249 212 176 167 158 149 141 164 187 209 232 210 187 116 44 17 -9 13 35 80 125 141 156 154 152 148 144 101 28 -25 -29 47
9311 47 124 183 192 183 173 161 148 173 198 222 247 257 266 275 285 332 379 403 378 305 203 116 78 85 92 102 112 150 188 255 322 339 356 307 259 243 286 326
9294 326 365 352 340 327 315 312 308 305 302 266 231 195 160 146 133 120 106 122 138 154 170 186 202 218 234 207 180 152 125 50 -24 -84 -84 -52 -19 -12 -6 -24
9278 -24 -43 -12 17 66 115 163 212 279 346 414 481 483 486 459 432 405 379 304 228 181 133 135 137 159 182 205 227 179 130 81 33 26 19 12 5 31 56 82 107
9261 107 101 95 59 23 1 -20 6 34 60 87 84 82 101 119 138 157 167 177 186 196 191 185 180 174 169 163 158 152 132 111 91 71 75 78 82 86 81 76 26 -23 -68 -54 32 118
9242 118 182 198 174 149 111 101 105 108 101 94 120 175 219 264 310 356 378 400 439 448 422 396 366 336 305 244 172 149 177 204 251 268 262 256 248 241 231 221 181
$$ packed form
9360B73PK0K1K0K1kl1m4m4l5l4nmJ3J4M3M4K8K9k1k0p1p0k1k1J0J1J0J1QQN4N4L1j8PPjm9
9343B53p1p1m0m0K9K8L5L5l4l4j9k0J1J0jjM8M8L9L8l1l1l1l0l1l1L6L6L6L6l0l1l0l1J6J6
9327A12J5J6K0K0K1K0J2J3l7l6rrrqK3K3K2K3k2k3p1p2k7k6K2K2M5M5J6J5kkmmm3p3n3mP6
9311D7P7N9Rrj0j2j3K5K5K4K5J0RRJ0M7M7K4k5p3j02q7l8PPJ0J0L8L8O7O7J7J7m9m8j6M3M0
9294C26L9j3j2j3j2lmlll6l5l6l5j4j3j3j4J6J6J6J6J6J6J6J6k7k7k8k7p5p4o0%L2L3POj8
9278b4j9L1K9M9M9M8M9O7O7O8O7KLk7k7k7k6p5p6m7m8KKK2K3K3K2m8m9m9m8ppppK6K5K6K5
9261A07ool6l6k2k1K6K8K6K7lkJ9J8J9J9J0J0RJ0nonononok0k1k0k0MLMMnnn0m9m5J4Q6Q6
9242A18O4J6k4k5l8j0MLppK6N5M4M5M6M6K2K2L9Rk6k6l0l0l1o1p2k3K8K7M7J7ooqpj0j0m0
$$ plain form
9225 181 111 26 -29 -51 -43 -37 -30 -39 -18 30 78 79 80 93 106 117 129 126 95 32 -29 -48 -36 -12 11 25 39 37 64 93 123 154 185 196 206 216 226 233 239 246
9207 246 252 248 244 257 240 214 189 162 134 147 160 202 244 282 319 324 299 273 247 250 283 319 327 302 247 208 198 199 200 204 209 213 217 240 264 302 310 280 220 177 134
9190 134 107 110 146 212 271 300 295 261 241 221 203 184 184 233 301 368 393 368 322 276 250 224 247 271 263 255 218 181 188 196 203 211 215 218 193 167 135 104 122 139
9172 139 144 149 125 100 117 134 152 169 123 77 31 -14 11 36 62 87 89 91 93 95 134 172 211 250 238 227 215 203 199 195 220 246 253 260 218 176 115 53 60 68 54
9155 54 40 55 71 93 115 138 160 163 165 118 71 64 57 51 44 44 45 46 47 59 72 84 97 55 13 12 61 118 175 205 236 239 243 273 303 317 281 244 207 196 185 175
9136 175 164 134 104 123 142 150 158 136 114 134 154 174 194 160 127 93 60 42 24 6 -11 -49 -87 -76 -65 -42 -18 4 28 38 48 28 9 -11 -33 -5
9121 -5 22 44 65 37 10 -1 -13 4 22 35 48 91 133 183 233 283 333 350 366 383 399 389 378 368 357 324 290 256 223 216 210 203 196 171 145 120 94 86
9104 86 77 69 60 70 80 90 99 117 134 151 168 180 193 205 217 202 187 173 158 172 186 201 215 175 134 94 53 86 118 105 92 57 80 140 199 178 156
$$ packed form
9225A81p0q5n5k2QOPrK1M8M8JJJ3J3J1J2ll1o3o1j9J2K4K3J4J4kK7K9L0L1L1J1J0J0J0POP
9207B46OmmJ3j7k6k5k7k8J3J3M2M2L8L7Nk5k6k6LL3L6Qk5n5l9j0JJMNMMK3K4L8Ql0o0m3m3
9190A34k7LL6O6N9K9nl4k0k0j8j9%M9O8O7K5k5m6m6k6k6K3K4qql7l7PQPQMLk5k6l2l1J8J7
9172A39NNk4k5J7J7J8J7m6m6m6m5K5K5K6K5KKKKL9L8L9L9j2j1j2j2mmK5K6PPm2m2o1o2PQj4
9155E4j4J5J6K2K2K3K2LKm7m7ppop%JJJJ2J3J2J3m2m2jM9N7N7L0L1LML0L0J4l6l7l7j1j1j0
9136A75j1l0l0J9J9QQk2k2K0K0K0K0l4l3l4l3j8j8j8j7l8l8J1J1K3K4K2K4J0J0k0j9k0k2K8
9121eK7K2K1k8k7j1j2J7J8J3J3M3M2N0N0N0N0J7J6J7J6j0j1j0j1l3l4l4l3poppk5k6k5k6q
9104H6rqrJ0J0J0RJ8J7J7J7J2J3J2J2j5j5j4j5J4J4J5J4m0m1m0m1L3L2j3j3l5K3O0N9k1k2
$$ plain form
9088 156 135 113 130 148 191 234 265 238 155 73 -12 -97 -146 -137 -94 -52 23 99 164 229 264 299 297 295 243 192 178 165 152 138 128 117 107 96 118 139
9073 139 161 182 176 170 164 158 179 200 221 242 244 247 246 245 213 122 49 5 -12 -2 -6 -10 -6 -2 31 64 108 151 126 100 57 13 0 -14 21 57 93 129 125 121 68 15
9054 15 -14 -44 -44 -44 -42 -39 11 63 126 190 224 258 272 287 253 219 183 147 111 76 74 72 70 68 61 54 47 40 61 83 105 127 153 178 154 130 134 138 142 146 161 176 191
9036 191 206 259 311 309 248 172 96 53 68 111 153 165 119 67 45 36 56 112 169 227 285 313 341 340 309 278 307 346 356 329 301 272 243 227 212 197
9020 197 182 166 149 133 117 130 142 155 168 164 160 185 211 238 266 261 226 179 132 83 34 24 14 4 -5 11 27 44 61 90 119 146 173 177 150 124 127 172
9004 172 216 230 214 198 182 192 201 210 190 139 88 37 15 7 -1 -2 -3 24 53 56 58 45 60 74 87 102 117 122 126 147 138 91 44 -3 -52 -49 -47 -31 13 54 96
8986 96 89 83 82 80 108 136 168 200 232 264 265 266 237 179 126 123 177 230 265 270 243 216 162 108 87 95 95 95 98 100 117 135 150 166 143 91 57 23 15 36 89 143
8968 143 171 199 226 252 289 297 271 246 242 238 234 230 250 270 291 311 274 237 201 164 145 126 106 87 109 130 151 173 189 206 268 331 370 360 309 258 246
$$ packed form
9088A56k1k2J7J8M3M3L1k7q3q2q5q5m9RM3M2P5P6O5O5L5L5kkn2n1j4j3j3j4j0j1j0j1K2K1
9073A39K2K1ooooK1K1K1K1KLjjl2r1p3m4j7J0mmMML3L3M4M3k5k6m3m4j3j4L5L6L6L6mmn3n3
9054A5k9l0%%KLN0N2O3O4L4L4J4J5l4l4l6l6l6l5kkkkppppK1K2K2K2K6K5k4k4MMMMJ5J5J5
9036A91J5N3N2ko1p6p6m3J5M3M2J2m6n2k2rK0N6N7N8N8K8K8jl1l1K9L9J0k7k8k9k9j6j5j5
9020A97j5j6j7j6j6J3J2J3J3mmK5K6K7K8nl5m7m7m9m9j0j0j0rJ6J6J7J7K9K9K7K7Mk7k6LM5
9004A72M4J4j6j6j6J0RRk0n1n1n1k2qqjjK7K9LKj3J5J4J3J5J5NMK1rm7m7m7m9LKJ6M4M1M2
8986I6pojkK8K8L2L2L2L2JJk9n8n3lN4N3L5Nk7k7n4n4k1Q%%LKJ7J8J5J6k3n2l4l4qK1N3N4
8968A43K8K8K7K6L7Qk6k5mmmmK0K0K1K0l7l7l6l7j9j9k0j9K2K1K1K2J6J7O2O3L9j0n1n1j2
$$ plain form
8952 246 234 221 209 211 214 216 218 228 237 245 253 220 157 83 58 90 121 156 191 190 188 186 185 183 182 180 179 168 157 146 135 146 157 168 180 181 182 183 185 144 104 93 82 144
8933 144 206 247 239 218 197 173 150 137 124 141 157 197 238 238 190 109 58 57 55 65 76 133 189 203 167 143 148 163 179 196 213 254 295 333 371 376 333 301
8916 301 298 289 281 274 267 260 253 247 240 254 269 284 298 337 375 414 452 455 458 430 372 305 268 262 255 257 259 248 207 159 111 74 67 69 72 107 172 241 280 269 257 269 281 280
8897 280 249 219 188 188 218 249 281 283 256 196 165 183 200 218 206 180 125 72 49 56 63 62 60 58 57 51 45 39 33 40 47 54 61 49 36 11 -42 -89 -135 -132 -129 -107 -56 24
8878 24 105 158 161 143 125 131 138 132 96 63 31 47 92 142 162 152 141 123 105 71 66 70 74 80 86 85 84 112 141 182 223 216 208 196 184 201 219 259 298 325 322 298
8860 298 273 247 221 183 146 108 71 28 -13 -23 -3 23 50 79 108 120 131 143 154 193 232 268 305 287 239 208 177 167 156 157 188 237 256 242 198
8845 198 158 118 78 38 46 83 101 120 110 70 49 28 10 22 33 15 -29 -74 -79 -35 52 140 201 263 295 327 326 296 259 221 182 143 77 11 -51 -115
8829 -115 -157 -150 -121 -93 -75 -57 -39 -20 -9 0 -37 -75 -103 -131 -157 -182 -150 -89 -27 4 18 32 44 56 69 82 96 109 136 164 190 215 213 181 118 56
$$ packed form
8952B46j2j3j2KLKKJ0RQQl3o3p4k5L2L1L5L5jkkjkjkjj1j1j1j1J1J1J1J2JJJKm1m0j1j1O2
8933A44O2M1qk1k1k4k3j3j3J7J6M0M1%m8q1n1jkJ0J1N7N6J4l6k4NJ5J6J7J7M1M1L8L8Nm3l2
8916C01lrqppppopJ4J5J5J4L9L8L9L8LLk8n8o7l7opKKj1m1m8m8l7pKLL5O5O9L9j1j2J2J2j
8897B80l1l0l1%L0L1L2Kk7o0l1J8J7J8j2k6n5n3k3PPjkkjooooPPPPj2j3k5n3m7m6LLK2N1Q0
8878B4Q1N3Lj8j8OPol6l3l2J6M5N0K0j0j1j8j8l4nMMOOjjK8K9M1M1pqj2j2J7J8M0L9K7lk4
8860B98k5k6k6l8l7l8l7m3m1j0K0K6K7K9K9J2J1J2J1L9L9L6L7j8m8l1l1j0j1JL1M9J9j4m4
8845A98m0m0m0m0QL7J8J9j0m0k1k1j8J2J1j8m4m5nM4Q7Q8O1O2L2L2jl0l7l8l9l9o6o6o2o4
8829a15m2PK9K8J8J8J8J9J1Rl7l8k8k8k6k5L2O1O2L1J4J4J2J2J3J3J4J3K7K8K6K5kl2o3o2
$$ plain form
8813 56 15 3 -22 -48 -47 -17 -3 10 43 76 109 142 121 99 79 59 35 40 29 18 30 41 53 64 49 33 18 2 -11 -26 -40 -55 -65 -75 -38 -1
8798 -1 -9 -46 -67 -88 -105 -123 -110 -67 -9 20 0 -18 -12 22 41 60 83 106 157 208 241 243 194 145 94 44 46 77 109 140 141 112 84 57 41 54 123 192
8781 192 231 240 218 195 171 148 117 87 59 31 8 15 73 130 176 192 158 124 113 132 164 195 187 179 143 106 69 60 88 145 178 212 233 224 183 113 58 2
8765 2 -11 -25 -40 -54 -52 -50 -1 47 80 84 105 126 154 182 159 107 43 8 24 40 29 18 5 -6 -24 -71 -116 -132 -131 -101 -33 63 145 228 277 297 267 208
8748 208 166 124 98 103 140 177 189 202 213 224 182 110 38 -3 14 32 82 131 141 151 92 4 -69 -94 -59 -25 13 52 90 129 115 100 85 71 59
8733 59 48 8 18 86 153 220 287 297 257 177 96 49 1 -16 -33 -9 15 10 5 25 45 65 85 44 3 31 59 98 137 127 116 146 175 204 233 210
8718 210 187 164 141 144 148 152 156 130 103 76 49 6 -35 10 55 82 109 86 64 61 57 103 178 247 267 248 229 231 233 205 178 127 76 54 33 5 -22 -50 -77
8701 -77 -52 -26 -1 24 -1 -27 -54 -80 -100 -121 -141 -162 -141 -120 -69 -18 22 63 55 47 17 -12 -13 -14 -43 -72 -72 -72 -7 58 94 130 111 92 103 114 119 124 99
$$ packed form
8813E6m1j2k5k6JL0J4J3L3L3L3L3k1k2k0k0k4Nj1j1J2J1J2J1j5j6j5j6j3j5j4j5j0j0L7L7
8798aql7k1k1j7j8J3M3N8K9k0j8OL4J9J9K3K3N1N1L3Km9m9n1n0KL1L2L1Jk9k8k7j6J3O9O9
8781A92L9Rk2k3k4k3l1l0k8k8k3PN8N7M6J6l4l4j1J9L2L1qql6l7l7rK8N7L3L4K1rm1p0n5n6
8765Bj3j4j5j4KKM9M8L3MK1K1K8K8k3n2o4l5J6J6j1j1j3j1j8m7m5j6JL0O8R6Q2Q3M9K0l0n9
8748B08m2m2k6NL7L7J2J3J1J1m2p2p2m1J7J8N0M9J0J0n9q8p3k5L5L4L8L9L8L9j4j5j5j4j2
8733E9j1m0J0O8O7O7O7J0m0q0q1m7m8j7j7K4K4nnK0K0K0K0m1m1K8K8L9L9j0j1L0K9K9K9k3
8718B10k3k3k3LMMMk6k7k7k7m3m1M5M5K7K7k3k2lmM6P5O9K0j9j9KKk8k7n1n1k2k1k8k7k8k7
8701g7K5K6K5K5k5k6k7k6k0k1k0k1K1K1N1N1M0M1qql0k9jjk9k9%%O5O5L6L6j9j9J1J1NNk5
$$ plain form
8684 99 75 30 -14 -9 -5 -21 -36 -14 57 100 93 72 80 96 113 131 150 190 230 267 303 313 273 213 153 122 121 152 183 192 202 211 221 250 280 326 342 320 297
8667 297 292 336 372 379 337 294 244 195 145 95 78 61 82 152 219 237 180 123 95 116 139 162 203 245 284 324 342 331 287 243 190 137 116 125 142 158
8651 158 147 136 126 117 138 189 260 301 292 283 299 316 320 294 294 294 281 238 205 201 228 255 257 260 260 261 214 139 79 20 -15 -50 -103 -126 -80 -34 -17 -29 -38 -18 30
8633 30 79 84 60 52 44 42 40 39 37 35 34 30 27 16 -23 -74 -77 -63 -50 -34 -17 5 29 23 17 18 19 69 119 144 170 127 83 54 25 45 65 103 142 180 219 251 283
8615 283 266 249 228 206 185 163 174 185 195 206 231 256 251 247 185 122 101 129 175 220 239 258 237 216 195 174 201 228 214 150 78 5 -28 -13 35 84
8599 84 87 91 85 80 104 128 112 96 50 4 -2 -10 31 73 114 154 126 98 72 46 20 -6 -67 -127 -159 -190 -184 -179 -124 -69 -51 -33 -16 1 54 106 117 79 42
8582 42 5 14 23 52 81 110 138 139 139 139 139 165 191 188 184 178 172 117 61 -11 -85 -90 -95 -73 -51 0 51 52 53 24 -3 -36 -68 -71 -74 -63 -52 -41 -31 -13 3 20 37
8564 37 69 101 117 74 -25 -126 -210 -235 -219 -144 -69 5 17 29 41 52 49 45 42 38 49 61 72 84 27 -29 -86 -143 -146 -149 -103 -58 32 123 194 206 143 20
$$ packed form
8684I9k4m5m4NMj6j5K2P1M3pk1QJ6J7J8J9M0M0L7L6J0m0o0o0l1jL1L1RJ0RJ0K9L0M6J6k2k3
8667B97nM4L6Pm2m3n0m9n0n0j7j7K1P0O7J8n7n7k8K1K3K3M1M2L9M0J8j1m4m4n3n3k1RJ7J6
8651A58j1j1j0rK1N1P1M1rrJ6J7Mk6%%j3m3l3mK7K7KL%Jm7p5o0n9l5l5n3k3M6M6J7j2rK0M8
8633C0M9Nk4qqkkjkkjmlj1l9n1lJ4J3J6J7K2K4ooJJN0N0K5K6m3m4k9k9K0K0L8L9L8L9L2L2
8615B83j7j7k1k2k1k2J1J1J0J1K5K5nmo2o3k1K8M6M5J9J9k1k1k1k1K7K7j4o4p2p3l3J5M8M9
8599H4LMonK4K4j6j6m6m6oqM1M2M1M0k8k8k6k6k6k6o1o0l2l1ONN5N5J8J8J7J7N3N2J1l8l7
8582D2l7RRK9K9K9K8J%%%K6K6lmoon5n6p2p4nnK2K2N1N1JJk9k7l3l2llJ1J1J1J0J8J6J7J7
8564C7L2L2J6m3r9j01q4k5J6P5P5P4J2J2J2J1lmlmJ1J2J1J2n7n6n7n7llM6M5R0R1P1J2o3j23
$$ plain form
8547 20 -75 -113 -94 -76 -54 -32 -45 -58 -120 -182 -192 -202 -162 -123 -68 -13 -23 -33 -39 13 63 112 118 124 130 135 150 166 181 196 164 132 100 68 54 39 24 10
8531 10 -18 -46 -74 -102 -139 -176 -144 -111 -104 -96 -119 -141 -134 -128 -73 -17 65 148 202 256 254 253 203 153 121 89 117 144 161 178 140 102 103 163 223 224 179 133 114
8514 114 95 69 44 78 111 82 52 22 -7 14 36 57 79 69 58 48 38 57 76 95 114 45 -23 -32 -42 -6 30 92 154 164 115 53 20 28 36 45 55
8498 55 50 45 41 36 33 29 26 22 8 -5 9 25 19 14 71 188 299 380 398 386 357 299 225 152 138 123 138 152 153 154 155 156 107 58 68 78 126 175 158 82 21
8480 21 -39 -44 -49 -12 25 34 42 67 92 116 141 128 115 160 206 255 304 295 285 230 174 178 181 216 251 227 203 205 207 180 153 110 67 25 -17 -50 -83 -57 -32 17
8463 17 66 115 165 156 148 139 130 113 96 79 62 26 -8 14 37 1 -35 -72 -109 -75 -40 -6 28 50 72 94 117 94 70 47 24 65 106 88 70 17 -35
8447 -35 -57 -30 17 65 57 49 46 44 41 39 33 27 21 14 46 78 110 142 180 218 197 176 117 58 0 -59 -66 -73 -80 -88 -90 -92 -35 20 79 137 196 255 264 273 253 232 159 86
8428 86 33 49 103 158 157 157 139 120 102 84 88 93 126 160 187 213 181 148 135 121 79 36 26 17 37 57 58 59 60 61 106 151 196 241 255 269 283 298 342 386
$$ packed form
8547B0r5l8J9J8K2K2j3j3o2o2j0j0M0L9N5N5j0j0oN2N0M9OOONJ5J6J5J5l2l2l2l2j4j5j5j4
8531A0k8k8k8k8l7l7L2L3PQk3k2PON5N6Q2Q3N4N4kjn0n0l2l2K8K7J7J7l8l8JO0O0Jm5m6j9
8514A14j9k6k5L4L3k9l0l0k9K1K2K1K2j0j1j0j0J9J9J9J9o9o8rj0L6L6O2O2J0m9o2l3QQRJ0
8498E5nnmnlmlmj4j3J4J6onN7J17J11Q1J8j2k9n8p4p3j4j5J5J4JJJJm9m9J0J0M8M9j7p6o1
8480B1o0nnL7L7RQK5K5K4K5j3j3M5M6M9M9rj0n5n6MLL5L5k4k4KKk7k7m3m3m2m2l3l3K6K5M9
8463A7M9M9N0rqrrj7j7j7j7l6l4K2K3l6l6l7l7L4L5L4L4K2K2K2K3k3k4k3k3M1M1j8j8n3n2
8447c5k2K7M7M8qqlklkooopL2L2L2L2L8L8k1k1n9n9n8n9pppqkkN7N5N9N8N9N9RRk0k1p3p3
8428H6n3J6N4N5j%j8j9j8j8MNL3L4K7K6l2l3j3j4m2m3j0rK0K0JJJJM5M5M5M5J4J4J4J5M4M4
$$ plain form
8410 386 399 363 323 282 239 195 193 191 189 187 164 142 169 195 206 216 157 99 50 1 22 42 73 104 105 106 86 66 46 26 61 96 130 165 156 146 136 126
8394 126 109 91 73 56 34 12 58 105 126 146 167 187 197 207 216 226 220 215 209 203 233 262 242 222 203 183 164 145 141 138 135 132 129 125 122 119 119 120 121 121 115 108 101 94 70
8374 70 45 21 -3 -3 -2 -1 -1 -20 -39 -10 19 27 35 -6 -48 -76 -105 -134 -162 -147 -132 -118 -103 -94 -85 -76 -67 -17 33 84 134 159 183 208 232 264 296 328 360 353 346
8356 346 339 332 288 244 200 156 120 85 50 14 -28 -72 -84 -66 -56 -46 -33 -20 0 49 98 118 103 88 70 51 45 10 -24 -30 -2 26 83 141 172 173 142
8340 142 111 71 30 3 5 29 52 77 102 135 169 152 105 70 64 89 114 170 227 281 336 334 302 285 269 234 170 106 72 105 138 173 208 200 192 184 176 185 194
8324 194 201 209 172 106 41 7 10 43 62 82 128 204 289 374 414 404 373 342 295 247 183 149 146 144 143 143 130 117 106 95 110 153 179 204 190 146 100 84
8307 84 44 -25 -76 -127 -164 -202 -254 -276 -236 -166 -95 -53 -18 15 75 136 173 181 137 92 109 127 144 161 151 142 133 123 59 -4 -82 -130 -116 -54 -20 13 11
8291 11 -38 -77 -87 -76 -66 -99 -133 -120 -58 -7 14 35 56 75 95 91 88 85 81 71 60 49 39 9 -19 -48 -78 -79 -80 -111 -141 -172 -203 -165 -127 -49 27 101
$$ packed form
8410C86J3l6m0m1m3m4kkkkk3k2K7K6J1J0n9n8m9m9K1K0L1L1JJk0k0k0k0L5L5L4L5rj0j0j0
8394A26j7j8j8j7k2k2M6M7K1K0K1K0J0J0RJ0onooL0K9k0k0j9k0j9j9mllllmll%JJ%opppk4
8374G0k5k4k4%JJ%j9j9K9K9QQm1m2k8k9k9k8J5J5J4J5RRRRN0N0N1N0K5K4K5K4L2L2L2L2pp
8356C46ppm4m4m4m4l6l5l5l6m2m4j2J8J0J0J3J3K0M9M9K0j5j5j8j9ol5l4oK8K8N7N8L1Jl1
8340A42l1m0m1k7KK4K3K5K5L3L4j7m7l5oK5K5N6N7N4N5kl2j7j6l5o4o4l4L3L3L5L5qqqqRR
8324A94PQl7o6o5l4LL3J9K0M6P6Q5Q5M0j0l1l1m7m8o4l4lkj%j3j3j1j1J5M3K6K5j4m4m6j6
8307H4m0o9n1n1l7l8n2k2M0P0P1M2L5L3O0O1L7Qm4m5J7J8J7J7j0rrj0o4o3p8m8J4O2L4L3k
8291A1m9l9j0J1J0l3l4J3O2N1K1K1K1J9K0mllmj0j1j1j0l0k8k9l0jjl1l0l1l1L8L8P8P6P4
$$ plain form
8275 101 126 112 69 39 10 27 43 60 76 59 42 74 106 179 252 303 305 285 264 271 277 279 281 234 186 186 185 185 184 171 159 146 133 82 32 30 29 12 -4 -19
8257 -19 -34 -8 46 110 125 85 16 -17 -2 4 10 20 30 75 120 164 209 178 147 116 84 75 66 57 48 47 47 46 46 57 69 79 89 51 -15 -94 -123 -106 -88 -68
8240 -68 -47 -39 -31 -23 -15 -7 0 8 16 34 53 71 89 105 121 167 212 235 257 231 204 225 247 238 230 216 201 216 231 223 215 208 200 225 251 207 164 139 115 159 204 226
8222 226 248 221 194 186 179 171 164 167 170 173 176 160 143 156 169 179 190 151 111 53 -5 4 14 71 129 136 144 124 103 112 122 147 172 167 163 167 171 126 81 51 21 61 100
8203 100 160 220 231 242 249 256 310 363 363 314 223 133 92 52 43 33 59 114 150 137 125 112 127 141 165 190 196 153 101 98 134 169 152 135 120 154 216 278
8187 278 339 401 420 389 328 266 257 247 240 233 244 285 335 335 282 200 134 69 32 45 90 134 124 114 46 -22 -28 -34 -40 -47 -48 -50 6 63 106 148 191 234 238 243 188
8169 188 134 112 91 70 48 51 53 56 58 35 12 48 83 91 98 106 114 83 53 24 -4 21 76 142 159 105 52 55 58 77 96 115 134 129 125 121 116 112 108 104 100 88 77 65
8150 65 54 51 49 47 44 9 -24 -87 -100 -30 40 84 80 100 150 195 210 180 120 75 29 8 -12 -33 -54 -56 -57 -29 47 124 173 159 115 56 -2 -4 -6 54 115 172
$$ packed form
8275A01K5j4m3l0k9J7J6J7J6j7j7L2L2P3P3N1Kk0k1POKKm7m8%j%jj3j2j3j3n1n0kjj7j6j5
8257a9j5K6N4O4J5m0o9l3J5OOJ0J0M5M5M4M5l1l1l1l2rrrrj%j%J1J2J0J0l8o6p9k9J7J8K0
8240f8K1QQQQQPQQJ8J9J8J8J6J6M6M5K3K2k6k7K1K2rqj4j5J5J5qqpqK5K6m4m3k5k4M4M5K2
8222B26K2k7k7qpqpLLLLj6j7J3J3J0J1l9m0n8n8RJ0N7N8PQk0k1RJ0K5K5nmMMm5m5l0l0M0L9
8203A00O0O0J1J1PPN4N3%m9r1r0m1m0rj0K6N5L6j3j2j3J5J4K4K5Om3n2lL6L5j7j7j5L4O2O2
8187B78O1O2J9l1o1o2rj0ppJ1M1N0%n3q2o6o5l7J3M5M4j0j0o8o8ooopjkN6N7M3M2M3M3MNn5
8169A88n4k2k1k1k2LKLKk3k3L6L5QPQQl1l0k9k8K5N5O6J7n4n3LLJ9J9J9J9nmmnmmmmj2j1j2
8150F5j1lkkll5l3o3j3P0P0M4mK0N0M5J5l0o0m5m6k1k0k1k1kjK8P6P7M9j4m4n9n8kkO0O1N7
$$ plain form
8132 172 230 272 256 214 172 132 92 53 13 30 47 64 81 106 132 191 190 170 150 126 101 74 46 18 -9 -23 -38 5 49 71 93 56 19 -14 -48
8117 -48 -116 -125 -75 -26 -32 -38 -46 -53 -60 -68 -80 -91 -64 -8 68 86 40 -5 0 6 12 18 4 -10 -24 -39 -53 -68 -23 20 48 76 44 13 -23 -59 -69 -21 35 91 151
8099 151 212 209 207 204 202 153 105 60 15 9 63 83 103 102 101 41 -18 -25 -31 -37 -43 -56 -69 -23 22 58 94 131 167 190 213 177 140 155 169 183 198 179 161 142
8082 142 123 53 -16 -61 -46 0 46 95 143 125 78 13 8 59 109 128 87 -11 -110 -157 -145 -135 -124 -159 -194 -212 -229 -197 -165 -145 -125 -105 -85 -59 -33
8067 -33 -37 -41 -51 -62 -22 16 29 42 -12 -68 -98 -129 -129 -130 -75 -21 33 88 125 162 195 228 219 150 114 79 89 99 109 119 123 126 129 133 138 144 101 57 1 -54 -61
8049 -61 -67 -20 26 73 119 121 122 124 125 121 117 84 50 -5 -60 -47 -34 10 55 100 145 147 149 152 154 172 190 208 226 217 208 198 189 167 145 123 101 91 81 71 61 86
8031 86 110 134 158 149 139 130 120 50 -20 -74 -70 -24 22 72 122 137 153 199 244 246 247 202 156 104 82 133 213 276 310 312 315 317 318 320 322 288 255 221 188 151 114
8013 114 61 37 68 99 104 109 127 175 256 337 420 503 536 501 411 321 257 192 129 67 53 40 10 -19 -49 -79 -87 -94 -91 -58 -29 -28 -59 -90 -111 -133 -141 -120
$$ packed form
8132A72N8M2j6m2m2m0m0l9m0J7J7J7J7K5K6N9jk0k0k4k5k7k8k8k7j4j5M3M4K2K2l7l7l3l4
8117d8o8rN0M9ooqppqj2j1K7N6P6J8m6m5NOOOj4j4j4j5j4j5M5M3K8K8l2l1l6l6j0M8N6N6O0
8099A51O1lklkm9m8m5m5oN4K0K0jjo0n9poooj3j3M6M5L6L6L7L6K3K3l6l7J5J4J4J5j9j8j9
8082A42j9p0o9m5J5M6M6M9M8j8m7o5nN1N0J9m1r8r9m7J2J0J1l5l5j8j7L2L2K0K0K0K0K6K6
8067c3mmj0j1M0L8J3J3n4n6l0l1%jN5N4N4N5L7L7L3L3ro9l6l5J0J0J0J0MLLMNOm3m4n6n5p
8049f1oM7M6M7M6KJKJmml3l4n5n5J3J3M4M5M5M5KKLKJ8J8J8J8rrj0rk2k2k2k2j0j0j0j0K5
8031H6K4K4K4rj0rj0p0p0n4MM6M6N0N0J5J6M6M5KJm5m6n2k2N1Q0O3L4KLKJKKl4l3l4l3l7l7
8013A14n3k4L1L1NNJ8M8Q1Q1Q3Q3L3l5r0r0o4o5o3o2j4j3l0k9l0l0qpLL3K9Jl1l1k1k2qK1
$$ plain form
7997 -120 -83 -45 -6 32 56 80 104 128 114 100 87 73 81 90 98 106 115 124 133 142 164 185 205 224 196 139 101 64 63 112 131 150 151 123 94 96 107 119 143 198
7979 198 260 294 296 299 307 315 323 332 296 260 210 189 199 238 260 282 291 270 219 167 129 121 145 169 193 218 242 266 272 277 280 284 273 232 178 173 186 169 171 174 143 112
7961 112 51 -8 -19 -30 17 65 91 118 142 166 244 293 290 237 188 168 171 203 243 283 295 308 295 282 240 198 175 152 99 46 35 23 12 1 -12 -25
7946 -25 20 66 130 193 198 203 165 127 148 168 159 150 140 131 141 151 102 54 50 46 43 39 32 24 17 10 71 132 193 254 239 224 209 193 192 191 189 188 174 160 147 133 141 149 157
7926 157 165 173 181 189 197 192 188 183 179 147 116 85 53 44 35 26 18 24 31 37 44 41 38 5 -26 -47 -68 -32 2 15 -20 -102 -155 -181 -177 -145 -84 10 106 172 189 175 160 143 125
7907 125 162 200 237 274 315 356 397 438 410 383 296 210 145 81 75 70 52 33 15 -2 19 41 64 86 85 84 82 81 117 153 188 224 202 179 157 134 180 225
7890 225 267 309 315 271 199 127 64 50 68 85 89 93 68 43 45 47 79 111 98 85 102 119 134 149 108 67 69 121 174 228 265 303 281 260 222 184 146 108
7874 108 139 171 202 234 224 214 234 254 277 300 264 227 174 121 127 132 177 222 238 254 259 265 240 216 224 231 297 364 369 374 349 325 287 249 241 232 230 228 226 224 261 298
$$ packed form
7997a20L7L8L9L8K4K4K4K4j4j4j3j4QRQQRRRRK2K1K0J9k8n7l8l7jM9J9J9Jk8k9KJ1J2K4N5
7979A98O2L4KLQQQRl6l6n0k1J0L9K2K2Rk1n1n2l8qK4K4K4K5K4K4ONLMj1m1n4nJ3j7KLl1l1
7961A12o1n9j1j1M7M8K6K7K4K4P8M9ln3m9k0LL2M0M0J2J3j3j3m2m2k3k3n3n3j1j2j1j1j3j3
7946b5M5M6O4O3NNl8l8K1K0rrj0rJ0J0m9m8mmlmpqppO1O1O1O1j5j5j5j6jjkjj4j4j3j4QQQ
7926A57QQQQQnmnml2l1l1l2rrrqOPOPlll3l1k1k1L6L4J3l5q2n3k6ML2O1R4R6O6J7j4j5j7j8
7907A25L7L8L7L7M1M1M1M1k8k7q7q6o5o4onj8j9j8j7K1K2K3K2jjkjL6L6L5L6k2k3k2k3M6M5
7890B25M2M2Om4p2p2o3j4J8J7MMk5k5KKL2L2j3j3J7J7J5J5m1m1KN2N3N4L7L8k2k1l8l8l8l8
7874A08L1L2L1L2j0j0K0K0K3K3l6l7n3n3ONM5M5J6J6NOk5k4QPO6O7NNk5k4l8l8qrkkkkL7L7
$$ plain form
7855 298 335 371 343 314 286 257 264 271 277 284 282 281 250 219 180 140 148 155 118 31 -16 4 69 135 144 104 55 6 3 0 41 81 91 102 72 42 -17 -77 -66 -54
7838 -54 -43 -31 5 43 80 117 182 247 263 279 264 249 234 220 202 184 166 148 129 110 91 71 45 18 -7 -34 15 65 114 164 191 219 246 274 274 275
7822 275 276 276 270 263 256 250 224 198 173 147 158 169 210 251 230 210 143 75 39 33 70 155 250 315 328 311 308 304 299 294 271 247 224 200 246 292 335 378 399 371
7805 371 340 310 318 326 403 480 551 623 645 667 664 662 659 657 669 680 692 703 770 836 902 969 1087 1205 1373 1540 1749 1958 2208 2557 3030 3641 4409
7791 4409 5433 6855 8729 11161 14047 16916 18821 18964 17238 14406 11437 8948 7029 5596 4536 3752 3146 2625
7783 2625 2242 1983 1823 1693 1562 1487 1412 1369 1326 1257 1188 1161 1192 1273 1354 1368 1284 1132 979 855 790 760 731 679 627 605 582 608 635 661
7770 661 687 664 640 616 593 628 663 698 733 776 818 861 903 1016 1129 1245 1362 1476 1649 1863 2078 2375 2769 3281 3891 4735 5913
7758 5913 7483 9505 12082 15151 18033 19675 19279 17054 13942 10929 8462 6606 5244 4256 3544 2969 2515 2160 1895
$$ packed form
7855B98L7L6k8k9k8k9PPOPkjl1l1l9m0QPl7q7m7K0O5O6Rm0m9m9llM1M0J0J1l0l0n9o0J1J2
7838e4J1J2L6L8L7L7O5O5J6J6j5j5j5j4j8j8j8j8j9j9j9k0k6k7k5k7M9N0M9N0K7K8K7K8%J
7822B75J%oppok6k6k5k6J1J1M1M1k1k0o7o8l6oL7Q5R5O5J3j7lmnnk3k4k3k4M6M6M3M3K1k8
7805C71l1l0QQP7P7P1P2K2K2lklkJ2J1J2J1O7O6O6O7J18J18J68J67K09K09K50L49M73O11P68
7791D409J024J422J874K432K886K869J905J43j726k832k969k489j919j433j060p84o06n21
7783B625l83k59j60j30j31p5p5m3m3o9o9k7L1Q1Q1J4q4j52j53j24o5l0k9n2n2k2k3K6K7K6
7770F61K6k3k4k4k3L5L5L5L5M3M2M3M2J13J13J16J17J14J73K14K15K97L94N12O10Q44J178
7758E913J570K022K577L069K882J642l96k225l112l013k467j856j362r88p12n75m54l55k65
$$ plain form
7750 1895 1689 1512 1393 1298 1202 1110 1019 959 899 868 838 811 785 711 637 602 597 575 553 542 530 520 510 472 465 497 530 567 574 568 562 559 557 583 610 659
7734 659 707 783 859 920 952 985 1048 1121 1222 1384 1596 1854 2180 2568 3043 3598 4280 5184 6432 8078 10187 12880 15937 18533
7724 18533 19624 18691 16175 13066 10204 7896 6150 4882 4017 3398 2886 2448 2099 1818 1587 1365 1171 1009 876 790 732
7715 732 660 589 501 414 369 354 362 370 369 339 321 332 355 377 399 421 404 357 308 309 339 369 376 382 389 396 355 314 303 341 397 424 427 402 344 287 258 228 201
7698 201 174 130 116 137 158 198 208 173 138 87 66 67 99 115 131 136 140 145 149 141 133 167 230 291 352 355 359 317 275 203 132 102 72 72 71 89 107 125 143 140 138
7680 138 135 132 106 80 53 27 20 14 66 118 125 133 111 88 58 27 55 83 120 157 135 113 82 51 -4 -60 -77 -26 73 123 112 101 87 73 94 116 137 159
7664 159 149 140 131 121 140 158 118 77 54 32 40 49 75 130 167 155 107 60 68 76 105 133 162 191 172 154 194 234 263 291 260 229 217 204 192 180 164 148
7647 148 132 116 98 80 62 44 2 -39 -23 -6 31 69 48 27 1 -24 -50 -76 -64 -52 -41 -29 -5 18 42 67 121 176 256 287 262 207 149 120 127
$$ packed form
7750A895k06j77j19r5r6r2r1o0o0l1l0k7k6p4p4l5nk2k2j1j2j0j0l8pL2L3L7PoolkK6K7M9
7734F59M8P6P6O1L2L3O3P3J01J62K12K58L26L88M75N55O82R04J248J646K109K693L057K596
7724A8533J091r33k516l109k862k308j746j268q65o19n12m38l49k81k31k22j94j62j33q6n8
7715G32p2p1q8q7m5j5QQjl0j8J1K3K2K2K2j7m7m9JL0L0POPPm1m1j1L8N6K7Lk5n8n7k9l0k7
7698B01k7m4j4K1K1M0J0l5l5n1k1JL2J6J6NMNMqqL4O3O1O1LMm2m2p2p1l0l0%jJ8J8J8J8lk
7680A38llk6k6k7k6poN2N2PQk2k3l0l1K8K8L7L7k2k2l1l1n5n6j7N1R9N0j1j1j4j4K1K2K1K2
7664A59j0rrj0J9J8m0m1k3k2QRK6N5L7j2m8m7QQK9K8K9K9j9j8M0M0K9K8l1l1j2j3j2j2j6j6
7647A48j6j6j8j8j8j8m2m1J6J7L7L8k1k1k6k5k6k6J2J2J1J2K4K3K4K5N4N5Q0L1k5n5n8k9P
$$ plain form
7632 127 133 112 90 86 81 125 170 202 234 200 167 146 174 205 235 223 212 171 130 114 99 84 69 37 5 -26 -58 -12 33 80 126 104 82 90 98 131 164
7616 164 148 131 90 48 36 23 33 43 53 63 78 93 107 122 95 68 41 14 18 22 26 30 32 33 84 135 183 230 249 267 206 145 105 115 148 181 242 303
7600 303 346 319 262 205 187 169 121 73 44 15 35 55 90 125 112 98 68 37 56 104 135 117 78 40 14 -11 -7 -3 12 28 44 60 135 209 235 260
7584 260 268 277 315 353 347 340 285 230 186 143 169 195 250 306 301 247 193 139 115 120 136 153 172 190 168 145 124 104 98 123 129 134 138 112 103 94 84 75 49 53 86 120
7566 120 155 191 211 231 212 143 52 -8 -17 2 25 47 72 96 68 40 13 -12 -40 -38 -2 62 107 122 89 56 28 30 81 133 173 183 161 138 158 178
7550 178 198 218 215 211 208 205 222 238 255 272 256 239 270 301 311 291 270 278 329 350 323 295 286 307 327 318 313 307 299 292 242 192 142 92 50 9 7 54 123 163 170
7532 170 147 121 94 38 -17 -52 -57 -50 -42 -27 -12 2 17 21 26 58 90 106 93 47 1 2 3 4 4 36 67 129 190 230 270 261 252 241 230 219 208 201 195 159 123
7515 123 107 92 126 159 160 160 92 24 -22 -69 -47 -25 45 117 147 128 105 83 59 36 45 83 133 133 102 71 37 2 -29 -60 -43 -26 8 43 48 54 60 67 122
$$ packed form
7632A27Ok1k2mnM4M5L2L2l4l3k1K8L1L0j2j1m1m1j6j5j5j5l2l2l1l2M6M5M7M6k2k2QQL3L3
7616A64j6j7m1m2j2j3J0J0J0J0J5J5J4J5k7k7k7k7MMMMKJN1N1M8M7J9J8o1o1m0J0L3L3O1O1
7600C03M3k7n7n7j8j8m8m8k9k9K0K0L5L5j3j4l0l1J9M8L1j8l9l8k6k5MMJ5J6J6J6P5P4K6K5
7584B60QRL8L8opn5n5m4m3K6K6N5N6nn4n4n4k4NJ6J7J9J8k2k3k1k0oK5ONMk6rrj0rk6ML3L4
7566A20L5L6K0K0j9o9r1o0rJ9K3K2K5K4k8k8k7k5k8KL6O4M5J5l3l3k8KN1N2M0J0k2k3K0K0
7550A78K0K0lmllJ7J6J7J7j6j7L1L1J0k0k1QN1K1k7k8rK1K0rnoqpn0n0n0n0m2m1kM7O9M0P
7532A70k3k6k7n6n5l5nPQJ5J5J4J5MNL2L2J6j3m6m6JJJ%L2L1O2O1M0M0rrj1j1j1j1pol6l6
7515A23j6j5L4L3J%o8o8m6m7K2K2P0P2L0j9k3k2k4k3RL8N0%l1l1l4l5l1l1J7J7L4L5NOOPN5
$$ plain form
7498 122 178 201 224 198 171 111 51 40 29 64 100 135 171 155 140 78 16 -22 -13 35 83 69 26 1 25 80 136 195 254 285 317 299 282 265 248
7483 248 232 215 178 141 104 67 27 -13 -54 -95 -92 -89 -37 14 28 41 54 67 101 134 168 201 194 187 181 174 167 160 153 146 151 156 161 166 146 126 106 85 43 0 -12 -25
7464 -25 -32 -38 -91 -143 -162 -131 -79 -27 -31 -35 -88 -141 -166 -191 -127 -63 17 98 129 160 176 193 209 225 253 282 310 339 329 319 279 239 189 138 111 133 193
7448 193 282 336 342 290 237 182 127 69 11 -25 -12 20 52 88 124 190 256 262 217 154 90 53 15 4 -7 48 133 202 201 134 36 -56 -100 -104 -78 -65 -81
7432 -81 -109 -137 -110 -84 -9 66 101 137 143 149 159 170 181 192 184 176 167 159 136 113 90 67 69 71 74 76 86 96 77 58 81 104 176 248 271 294 268 242 224 206
7415 206 188 171 160 149 138 127 133 139 146 152 165 177 190 202 170 138 105 73 38 2 -2 -8 0 8 -28 -65 -70 -15 55 126 170 215 210 205 216 228 239 250 210 169
7398 169 129 89 59 29 48 68 103 138 144 150 126 103 79 55 62 68 75 81 76 71 66 61 109 157 238 260 234 208 178 148 160 173 185 197 162 126 91 56 82 108
7380 108 135 161 192 223 254 284 283 282 281 280 269 258 248 237 184 132 79 27 21 15 9 4 1 0 -3 -6 5 16 76 137 183 229 226 224 253 283 284 284 233 183 180 208 245
$$ packed form
7498A22N6K3K3k6k7o0o0j1j1L5L6L5L6j6j5o2o2l8RM8M8j4m3k5K4N5N6N9N9L1L2j8j7j7j7
7483B48j6j7l7l7l7l7m0m0m1m1LLN2N1J4J3J3J3L4L3L4L3ppopppppNNNNk0k0k0k1m2m3j2j3
7464b5pon3n2j9L1N2N2mmn3n3k5k5O4O4Q0Q1L1L1J6J7J6J6K8K9K8K9j0j0m0m0n0n1k7K2O0
7448A93Q9N4On2n3n5n5n8n8l6J3L2L2L6L6O6O6Om5o3o4l7l8j1j1N5Q5O9jo7r8r2m4mK6J3j6
7432h1k8k8K7K6P5P5L5L6OOJ0J1J1J1qqrqk3k3k3k3KKLKJ0J0j9j9K3K3P2P2K3K3k6k6j8j8
7415B06j8j7j1j1j1j1OOPOJ3J2J3J2l2l2l3l2l5l6moQQl6l7nN5P0P1M4M5nnJ1J2J1J1m0m1
7398A69m0m0l0l0J9K0L5L5OOk4k3k4k4POPOnnnnM8M8Q1K2k6k6l0l0J2J3J2J2l5l6l5l5K6K6
7380A08K7K6L1L1L1L0jjjjj1j1j0j1n3n2n3n2ooonljllJ1J1O0O1M6M6lkK9L0J%n1n0lK8L7
$$ plain form
7362 245 223 151 79 8 -3 19 43 47 51 55 60 68 77 85 94 73 53 32 12 0 -10 -21 -32 -20 -7 34 76 117 157 149 141 129 117 105 94 78 62 0 -62 -87
7344 -87 -64 -18 26 26 26 28 31 53 105 169 183 189 196 200 203 165 126 88 49 28 6 -14 -35 -20 -5 8 23 -13 -49 -86 -123 -104 -84 -65 -45 0 47 93 140
7327 140 114 89 63 38 30 21 13 5 0 -5 -10 -15 14 45 46 47 54 62 20 -20 -28 -37 -45 -53 -60 -67 -74 -81 -73 -65 -56 -48 -55 -63 -41 10 61 63 25 -11 -30 -48 1 51 136 221 263 255 212
7306 212 139 63 17 14 11 10 9 39 68 97 126 99 72 44 17 36 56 75 94 136 177 219 260 239 218 197 176 143 110 77 43 85 128 170 212 173 134
7290 134 95 56 71 85 100 114 92 69 47 25 59 93 127 161 159 156 154 152 127 102 162 223 276 270 209 148 119 89 89 88 78 68 58 48 48 48 48 48 36 24
7273 24 12 0 27 54 81 108 108 108 108 108 106 103 101 99 91 84 31 -21 -80 -80 -45 -10 38 87 136 185 159 134 108 83 79 76 73 69 32 -5 -75 -87 -36 15 69 124 111
7254 111 97 84 70 88 107 125 144 154 164 173 183 193 203 213 223 218 213 209 204 199 194 189 184 153 121 89 58 39 19 0 -18 29 78 159 182 137 92 43 -4
7237 -4 -23 -42 -61 -80 -73 -66 -30 5 43 80 48 16 21 26 80 134 198 262 310 299 246 193 137 80 80 79 78 78 51 24 65 107 126 145 164 183 209 236 214 192
$$ packed form
7362B45k2p2p2p1j1K2K4MMMNQRQRk1k0k1k0j2j0j1j1J2J3M1M2M1M0qqj2j2j2j1j6j6o2o2k5
7344h7K3M6M4%%KLK2N2O4J4OPMLl8l9l8l9k1k2k0k1J5J5J3J5l6l6l7l7J9K0J9K0M5M7M6M7
7327A40k6k5k6k5qrqqnnnnK9L1JJPQm2m0qrqqppppQQRQpqK2N1N1Kl8l6j9j8M9N0Q5Q5M2qm3
7306B12p3p6m6lljjL0K9K9K9k7k7k8k7J9K0J9J9M2M1M2M1k1k1k1k1l3l3l3l4M2M3M2M2l9l9
7290A34l9l9J5J4J5J4k2k3k2k2L4L4L4L4klkkk5k5O0O1N3oo1o1k9l0%jj0j0j0j0%%%%j2j2
7273B4j2j2K7K7K7K7%%%%klkkqpn3n2n9%L5L5M8M9M9M9k6k5k6k5mllml7l7p0j2N1N1N4N5j3
7254A11j4j3j4J8J9J8J9J0J0RJ0J0J0J0J0nnmnnnnnl1l2l2l1j9k0j9j8M7M9Q1K3m5m5m9m7
7237dj9j9j9j9PPL6L5L8L7l2l2NNN4N4O4O4M8j1n3n3n6n7%jj%k7k7M1M2J9J9J9J9K6K7k2k2
$$ plain form
7220 192 154 117 129 140 193 245 268 291 248 204 132 59 28 -1 -3 -4 -31 -58 -56 -53 -49 -44 -39 -34 1 37 73 109 104 98 92 87 49 11 -26 -63 -79 -94 -110 -126 -97
7202 -97 -69 -40 -12 -5 2 -15 -34 -36 20 109 198 239 220 205 190 176 161 147 132 127 122 166 210 237 264 242 221 207 194 181 168 176 185 194 203 199 196 192 189 194 198 203 208 201
7183 201 193 186 178 140 103 65 27 5 -17 9 66 123 132 101 70 111 152 183 185 187 239 289 290 255 220 231 242 249 256 263 270 221 173 124 76 59 43 75 108 158
7166 158 208 209 210 196 183 169 156 122 89 55 21 14 6 -1 -9 9 29 48 67 83 98 114 130 93 56 23 -10 -28 3 73 142 212 232 192 122 61 50 94
7149 94 139 155 122 67 13 -19 -52 -55 -58 -26 5 37 69 56 42 78 114 147 180 213 246 241 235 200 165 184 203 203 153 90 56 72 118 157 166 163 159 157 125 94
7132 94 91 117 143 139 106 88 100 109 89 64 39 13 -13 -15 -18 9 36 48 60 103 175 220 236 271 305 332 358 352 316 276 236 207 208 231 255 250 216 173 160
7115 160 158 156 131 106 64 51 78 105 134 163 140 117 94 72 56 39 21 4 -1 -36 -82 -79 -43 -6 31 69 112 126 108 89 106 123 111 98 75 52 59
7099 59 65 80 95 124 124 109 65 18 2 14 27 25 53 99 145 143 142 146 150 154 158 136 115 96 76 49 51 37 22 2 -17 -35 -53 -43 -4 17 38 29 -8 -44 -50
$$ packed form
7220A92l8l7J2J1N3N2K3K3m3m4p2p3l1k9kjk7k7KLMNNNL5L6L6L6noonl8l8l7l7j6j5j6j6K9
7202i7K8K9K8PPj7j9kN6Q9Q9M1j9j5j5j4j5j4j5nnM4M4K7K7k2k1j4j3j3j3QRRRmlmlNMNNp
7183B01qpql8l7l8l8k2k2K6N7N7Rl1l1M1M1L1KKN2N0Jl5l5J1J1PPPPm9m8m9m8j7j6L2L3N0
7166A58N0JJj4j3j4j3l4l3l4l4pqpqJ8K0J9J9J6J5J6J6l7l7l3l3j8L1P0O9P0K0m0p0o1j1M4
7149I4M5J6l3n5n4l2l3llL2L1L2L2j3j4L6L6L3L3L3L3nol5l5J9J9%n0o3l4J6M6L9Rlmkl2l1
7132I4lK6K6ml3j8J2Rk0k5k5k6k6klK7K7J2J2M3P2M5J6L5L4K7K6ol6m0m0k9JK3K4nl4m3j3
7115A60kkk5k5m2j3K7K7K9K9k3k3k3k2j6j7j8j7nl5m6LL6L7L7L8M3J4j8j9J7J7j2j3k3k3P
7099E9OJ5J5K9%j5m4m7j6J2J3kK8M6M6kjMMMMk2k1j9k0k7Kj4j5k0j9j8j8J0L9K1K1rl7l6o
$$ plain form
7081 -50 -42 -5 44 95 122 119 84 49 32 15 28 91 166 212 196 151 115 78 40 2 9 17 24 32 11 -8 -28 -48 -27 -5 15 37 74 112 150 187 189 191 193 195
7064 195 220 245 211 177 159 141 123 105 106 107 108 109 130 152 174 196 259 322 325 259 184 109 15 -47 -49 -1 39 50 70 119 166 184 189 194 197 200 183 165 147 129
7046 129 119 108 41 -24 -34 5 17 29 31 33 35 36 6 -23 -53 -83 -86 -90 -93 -96 -72 -48 -24 0 -5 -11 -16 -21 30 81 102 73 38 2 -35 -74 -59 -45 -30 -16 15
7029 15 48 108 118 100 82 61 40 84 128 169 209 215 172 100 29 -5 8 13 -11 -57 -74 -30 43 79 85 110 135 153 171 187 203 230 227 182 136 122 108
7013 108 94 80 66 53 39 26 45 65 85 104 130 156 140 94 65 37 7 -22 -49 -77 -105 -132 -149 -167 -141 -86 -38 9 76 113 127 140 169 168 148
6998 148 129 108 86 102 118 133 149 183 216 250 283 259 235 213 190 158 156 195 235 258 280 260 211 155 99 24 -20 -9 1 14 26 44 62 77 93
6982 93 94 65 55 46 64 132 186 211 234 228 179 130 100 98 81 63 39 15 34 82 126 170 216 262 258 254 267 250 226 203 160 148 136 124 114 104 121 138
6966 138 156 173 182 191 170 118 62 36 40 45 32 20 9 0 33 97 144 192 192 193 210 197 151 105 42 9 28 77 112 146 144 143 142 140 151 162 171 180 159 108 73
$$ packed form
7081e0QL7M9N1K7ll5l5j7j7J3O3P5M6j6m5l6l7l8l8PQPQk1j9k0k0K1K2K0K2L7L8L8L7KKKK
7064A95K5K5l4l4j8j8j8j8JJJJK1K2K2K2O3O3Lo6p5p5r4o2kM8M0J1K0M9M7J8NNLLj7j8j8j8
7046A29j0j1o7o5j0L9J2J2KKKJl0k9l0l0lmllK4K4K4K4nonnN1N1K1k9l5l6l7l9J5J4J5J4L1
7029A5L3O0J0j8j8k1k1M4M4M1M0Om3p2p1l4J3Nk4m6j7M4P3L6OK5K5J8J8J6J6K7lm5m6j4j4
7013A08j4j4j4j3j4j3J9K0K0J9K6K6j6m6k9k8l0k9k7k8k8k7j7j8K6N5M8M7O7L7J4J3K9jk0
6998A48j9k1k2J6J6J5J6L4L3L4L3k4k4k2k3l2kL9M0K3K2k0m9n6n6p5m4J1J0J3J2J8J8J5J6
6982I3Jk9j0rJ8O8N4K5K3om9m9l0kj7j8k4k4J9M8M4M4M6M6mmJ3j7k4k3m3j2j2j2j0j0J7J7
6966A38J8J7RRk1n2n6k6MNj3j2j1rL3O4M7M8%JJ7j3m6m6o3l3J9M9L5L4kjjkJ1J1RRk1n1l5
$$ plain form
6948 73 39 32 24 0 6 37 67 116 136 154 173 190 207 187 167 149 131 124 145 151 156 168 179 191 203 192 182 171 161 149 137 128 118 135 182 210 239 234 200
6931 200 194 217 249 252 224 196 191 185 180 175 193 212 231 249 223 196 170 144 95 47 -1 -49 -49 -49 -66 -53 -27 -2 24 51 63 74 40 5 -2 37 78 69 32 -5
6914 -5 -16 -26 -48 -69 -41 -13 1 16 61 106 109 113 116 120 121 123 36 -50 -111 -173 -166 -159 -95 -31 59 149 179 159 167 175 165 155 145 135 113 90 68 46 49 53 56 59 70
6895 70 81 92 103 97 91 85 79 88 97 106 116 63 11 -19 0 56 114 145 177 183 189 165 112 48 33 76 118 117 86 72 108 162 187 182 177 182 186 161 137 107 77 77 76
6877 76 117 159 170 182 136 89 73 56 81 106 82 58 64 71 48 25 28 31 64 96 118 139 131 123 87 52 65 79 102 124 117 111 71 32 -6 -45 -38 -30 -23 -15 5
6859 5 26 -1 -29 -40 -51 -62 -73 -70 -68 -36 -5 41 89 136 183 175 166 158 150 147 145 171 198 201 204 203 203 155 47 -55 -100 -70 17 72 126 160 135 75 14 -6 -27
6841 -27 19 67 135 204 237 211 159 107 81 56 65 75 85 95 93 92 91 89 84 79 74 69 70 71 72 74 87 100 114 127 97 68 38 8 26 45 64 82 66 50 63 77
6823 77 114 150 187 224 244 264 254 244 190 135 130 125 102 80 30 -19 -86 -124 -103 -23 45 114 183 252 304 297 254 211 193 175 157 139 97 54 12 -29 -37
$$ packed form
6948G3l4pqk4OL1L0M9K0J8J9J7J7k0k0j8j8pK1ONJ2J1J2J2j1j0j1j0j2j2rj0J7M7K8K9nl4
6931B00oK3L2Lk8k8nonnJ8J9J9J8k6k7k6k6m9m8m8m8%%j7J3K6K5K6K7J2J1l4l5pL9M1rl7l7
6914ej1j0k2k1K8K8J4J5M5M5LMLMJKq7q6o1o2PPO4O4R0R0L0k0QQj0j0j0j0k2k3k2k2LMLLJ1
6895G0J1J1J1ooooRRRJ0n3n2l0J9N6N8L1L2OOk4n3o4j5M3M2jl1j4L6N4K5nnNMk5k4l0l0%j
6877G6M1M2J1J2m6m7j6j7K5K5k4k4OPk3k3LLL3L2K2K1qql6l5J3J4K3K2pom0l9l8l9PQPQK0
6859EK1k7k8j1j1j1j1LKL2L1M6M8M7M7qrqqlkK6K7LLj%m8j08j02m5L0Q7N5N4L4k5o0o1k0k1
6841b7M6M8O8O9L3k6n2n2k6k5RJ0J0J0kjjknnnnJJJKJ3J3J4J3l0k9l0l0J8J9J9J8j6j6J3J4
6823G7L7L6L7L7K0K0j0j0n4n5nnk3k2n0m9o7l8K1Q0O8O9O9O9N2pm3m3j8j8j8j8m2m3m2m1q
$$ plain form
6807 -37 -45 -23 -1 40 82 56 29 -6 -43 -49 -56 -50 -43 -37 -31 49 130 195 200 156 112 100 147 197 246 264 222 171 119 114 108 117 125 183 242 277 313 300 287 208 129
6789 129 80 31 8 -13 16 104 194 226 166 106 100 94 87 81 74 66 88 110 115 120 95 71 47 24 0 -22 10 44 47 51 27 2 -21 -45 -42 -40 -66 -93 -109 -125 -141
6771 -141 -156 -142 -128 -113 -99 -74 -50 -25 0 15 30 46 61 41 21 49 78 109 139 139 140 97 53 10 -32 -51 -69 -57 -46 -27 -9 -39 -70 -107 -144 -151
6756 -151 -158 -117 -76 -64 -53 -37 -20 -33 -46 -44 -41 -84 -127 -154 -122 -54 12 98 183 233 224 177 131 130 128 139 150 161 172 179 186 193 199 165 130 96 61 49 37 24
6738 24 12 31 49 68 86 108 131 150 169 198 178 127 76 101 127 153 178 176 174 172 170 160 151 141 132 132 132 131 131 112 94 75 56 30 4 38 71 75 79 54 78
6721 78 157 208 196 155 132 109 84 59 60 61 61 62 95 128 160 193 219 245 271 298 253 207 162 117 108 99 89 80 93 106 119 132 87 43 -1 -46 -78 -110 -143
6704 -143 -175 -124 -74 -23 26 55 83 111 140 98 56 14 -26 -117 -207 -229 -201 -155 -139 -162 -186 -138 -91 -43 3 20 37 -5 -47 -82 -117 -93 -69 -42 -15
6688 -15 11 38 32 25 19 13 19 26 32 38 69 99 87 45 18 -9 -36 -64 -29 34 79 125 148 141 93 46 32 48 64 50 13 -22 -1 19 44 70 96 121 152 183
$$ packed form
6807c7qK2K2M1M2k6k7l5l7opOPOOQ0Q1O5Nm4m4j2M7N0M9J8m2n1n2noRQN8N9L5L6j3j3p9p9
6789A29m9m9k3k1K9Q8R0L2o0o0oopopqK2K2NNk5k4k4k3k4k2L2L4LMk4k5k3k4LKk6k7j6j6j6
6771a41j5J4J4J5J4K5K4K5K5J5J5J6J5k0k0K8K9L1L0%Jm3m4m3m2j9j8J2J1J9J8l0l1l7l7p
6756a51pM1M1J2J1J6J7j3j3KLm3m3k7L2O8O6Q6Q5N0rm7m6jkJ1J1J1J1PPPOl4l5l4l5j2j2j3
6738B4j2J9J8J9J8K2K3J9J9K9k0n1n1K5K6K6K5kkkkj0rj0r%%j%j9j8j9j9k6k6L4L3MMk5K4
6721G8P9N1j2m1k3k3k5k5JJ%JL3L3L2L3K6K6K6K7m5m6m5m5rrj0rJ3J3J3J3m5m4m4m5l2l2l3
6704a43l2N1N0N1M9K9K8K8K9m2m2m2m0r1r0k2K8M6J6k3k4M8M7M8M6J7J7m2m2l5l5K4K4K7K7
6688a5K6K7opooOPOOL1L0j2m2k7k7k7k8L5O3M5M6K3pm8m7j4J6J6j4l7l5K1K0K5K6K6K5L1L1
$$ plain form
6671 183 184 136 64 21 1 11 18 24 50 45 7 -31 -86 -112 -77 -11 38 89 94 100 105 111 112 114 115 116 105 94 84 73 50 27 -8 -14 38 140 231 293 279 236 207
6653 207 179 154 129 147 194 207 221 236 251 241 231 237 214 160 106 51 -2 -30 -29 14 58 105 152 198 243 271 271 286 302 284 265 247 228 222 216 210 204 152
6637 152 100 33 -3 7 47 73 98 98 98 99 99 92 84 77 70 55 40 27 14 -10 -6 29 66 88 109 131 152 145 137 128 119 101 54 7 -10 -17 -24 -46 -38 -10 18 65 83
6618 83 71 58 44 30 0 -29 -59 -89 -63 -36 -9 16 47 79 110 141 165 189 211 233 200 137 74 41 55 70 87 103 114 126 137 149 134 118 103
6603 103 88 48 7 24 90 147 155 125 95 84 73 90 107 135 134 117 70 26 -17 -50 -54 -52 -51 -47 -44 -50 -56 -13 59 108 107 87 67 82 97 98 71 33 -4 -28
6586 -28 -24 -8 35 93 150 188 196 192 187 213 238 233 199 185 202 200 198 183 167 201 235 239 242 245 249 301 354 358 362 335 308 281 254 223 193 192 221 253 235 159 82 23
6567 23 -35 -65 -95 -119 -144 -120 -95 -79 -62 -75 -88 -57 -27 32 91 153 215 248 280 266 251 188 124 88 51 64 77 86 95 104 113 116 118 121 124 120 117 84 51 25
6550 25 0 13 77 165 224 241 210 137 65 11 7 19 32 18 4 -15 -36 -57 -77 -46 -15 15 46 30 15 30 44 59 74 40 6 -7 -21 -5 10 35
$$ packed form
6671A83Jm8p2m3k0J0POK6nl8l8n5k6L5O6M9N1NONOJKJJj1j1j0j1k3k3l5oN2J02R1O2j4m3k9
6653B07k8k5k5J8M7J3J4J5J5j0j0Ok3n4n4n5n3k8JM3M4M7M7M6M5K8%J5J6j8j9j8j9oooon2
6637A52n2o7l6J0M0K6K5%%J%pqppj5j5j3j3k4ML5L7K2K1K2K1pqrrj8m7m7j7ppk2QK8K8M7J8
6618H3j2j3j4j4l0k9l0l0K6K7K7K5L1L2L1L1K4K4K2K2l3o3o3l3J4J5J7J6J1J2J1J2j5j6j5
6603A03j5m0m1J7O6N7Ql0l0j1j1J7J7K8jj7m7m4m3l3mKJMLooM3P2M9jk0k0J5J5Jk7l8l7k4
6586b8MJ6M3N8N7L8QmnK6K5nl4j4J7kkj5j6L4L4MLLMN2N3MMk7k7k7k7l1l0jK9L2j8p6p7n9
6567B3n8l0l0k4k5K4K5J6J7j3j3L1L0N9N9O2O2L3L2j4j5o3o4l6l7J3J3RRRRLKLLmll3l3k6
6550B5k5J3O4Q8N9J7l1p3p2n4mJ2J3j4j4j9k1k1k0L1L1L0L1j6j5J5J4J5J5l4l4j3j4J6J5K5
$$ plain form
6535 35 59 55 50 22 -6 -34 -63 -68 -73 -59 -74 -80 -37 -6 -4 -19 -4 40 85 87 88 90 92 97 101 106 111 119 127 135 143 178 213 219 224 207 190 202 243 258 223 130 36 -32 -101
6515 -101 -121 -140 -107 -74 -41 -8 11 30 50 70 97 124 151 178 153 128 103 79 112 145 206 267 322 349 313 228 142 85 81 106 152 198 196 195 180 165
6499 165 180 194 176 159 170 182 168 155 141 128 148 168 139 110 109 108 106 105 114 124 133 142 142 142 143 143 134 126 164 202 188 125 73 50 36 22 59 96 132 168 204
6482 204 241 206 171 136 102 60 18 -24 -66 -42 -19 4 27 53 79 55 32 -9 -51 -64 -77 -46 -15 -14 -12 -7 -1 4 9 -3 -17 -30 -44 -13 17 48 78 109
6465 109 140 171 201 175 148 121 94 45 -3 -52 -101 -65 -29 7 43 51 59 96 134 178 222 226 182 132 112 122 131 125 120 84 49 13 -21 -86 -151 -209 -267 -236
6449 -236 -206 -156 -106 -57 -7 17 41 -2 -76 -128 -131 -94 -57 -45 -34 -22 -11 -40 -69 -48 -28 -2 24 50 77 79 82 84 87 101 116 131 146 82 19 -22 -14 11
6432 11 37 36 36 48 60 71 83 83 83 83 83 60 38 65 92 124 157 159 162 151 139 158 176 191 207 223 239 268 298 279 260 197 134 101 68 92 116 138 111
6415 111 69 27 12 -3 -64 -124 -135 -78 28 134 212 241 214 158 116 123 148 143 99 55 51 47 44 40 19 -1 -22 -43 -18 7 33 58 39 20 1 -18 -10
$$ packed form
6535C5K4mnk8k8k8k9nnJ4j5oM3L1Kj5J5M4M5KJKKNMNNQQQQL5L5ONj7j7J2M1J5l5r3r4o8o9
6515a01k0j9L3L3L3L3J9J9K0K0K7K7K7K7k5k5k5k4L3L3O1O1N5K7l6q5q6n7mK5M6M6kjj5j5
6499A65J5J4j8j7J1J2j4j3j4j3K0K0k9k9jjkjRJ0RR%%J%rqL8L8j4o3n2k3j4j4L7L7L6L6L6
6482B04L7l5l5l5l4m2m2m2m2K4K3K3K3K6K6k4k3m1m2j3j3L1L1JKNONNj2j4j3j4L1L0L1L0L1
6465A09L1L1L0k6k7k7k7m9m8m9m9L6L6L6L6QQL7L8M4M4Mm4n0k0J0Ronl6l5l6l4o5o5n8n8L1
6449b36L0N0N0M9N0K4K4m3p4n2lL7L7J2J1J2J1k9k9K1K0K6K6K6K7KLKLJ4J5J5J5o4o3m1QK5
6432A1K6j%J2J2J1J2%%%%k3k2K7K7L2L3KLj1j2J9J8J5J6J6J6K9L0j9j9o3o3l3l3K4K4K2k7
6415A11m2m2j5j5o1o0j1N7J06J06P8K9k7n6m2PK5nm4m4mmlmk1k0k1k1K5K5K6K5j9j9j9j9Q
$$ plain form
6399 -10 -2 5 12 -4 -22 -36 -51 -31 37 106 126 83 39 52 64 96 127 129 131 100 68 96 124 128 133 138 143 147 151 155 159 101 43 16 39 57 74 95 116 142 169 193
6381 193 218 204 161 133 155 191 178 137 95 105 114 123 132 142 153 104 55 9 -35 -22 -9 14 39 63 87 117 146 116 86 86 85 85 84 87 90 151 213 253 292
6364 292 273 254 211 169 127 84 61 37 13 -10 -34 -58 -81 -105 -105 -104 -159 -214 -251 -239 -196 -152 -106 -59 -13 33 54 74 95 116 137 158 179 200 155 111
6349 111 67 23 -6 -37 -8 19 54 89 123 158 113 67 50 34 41 48 110 173 191 159 96 33 21 9 25 40 48 26 -6 9 36 64 94 124 119 113 108 103
6332 103 129 154 121 88 71 55 68 81 43 6 -31 -68 -67 -65 -64 -63 -65 -68 -71 -74 -55 -35 -16 2 16 29 42 55 96 136 176 217 236 256 276 296 296 297 297 298 288
6314 288 278 238 198 165 132 158 184 234 284 275 266 224 182 141 99 105 111 147 183 125 67 66 134 179 175 144 113 93 73 23 -25 -34 -42 -50 -59 -74 -89 -36 17 81
6297 81 145 159 174 152 129 58 -13 -59 -106 -84 -62 -65 -67 -70 -72 -29 13 56 99 97 95 93 91 55 20 -18 0 35 69 58 47 51 54 58 61 103 145 187 230 223 216 210 203
6278 203 232 260 239 219 200 181 162 144 102 59 17 -24 -43 -62 -52 -41 -46 -50 -54 -59 -68 -78 -58 -38 -59 -80 -84 -30 -3 23 54 85 121 157 164 171 145 118 108
$$ packed form
6399a0QPPj6j8j4j5K0O8O9K0m3m4J3J2L2L1KKl1l2K8K8MNNNMMMMn8n8k7K3J8J7K1K1K6K7K4
6381A93K5j4m3k8K2L6j3m1m2J0RRRJ0J1m9m9m6m4J3J3K3K5K4K4L0K9l0l0%j%jLLO1O2M0L9
6364B92j9j9m3m2m2m3k3k4k4k3k4k4k3k4%Jn5n5l7J2M3M4M6M7M6M6K1K0K1K1K1K1K1K1m5m4
6349A11m4m4k9l1K9K7L5L5L4L5m5m6j7j6PPO2O3J8l2o3o3j2j2J6J5Qk2l2J5K7K8L0L0nonn
6332A03K6K5l3l3j7j6J3J3l8l7l7l7JKJJklllJ9K0J9J8J4J3J3J3M1M0M0M1J9K0K0K0%J%Jj0
6314B88j0m0m0l3l3K6K6N0N0rrm2m2m1m2OOL6L6n8n8jO8M5ml1l1k0k0n0m8rqqrj5j5N3N3O4
6297H1O4J4J5k2k3p1p1m6m7K2K2lklkM3M2M3M3kkkkl6l5l8J8L5L4j1j1MLMLM2M2M2M3ppop
6278B03K9K8k1k0j9j9j9j8m2m3m2m1j9j9J0J1nmmnrj0K0K0k1k1mN4K7K6L1L1L6L6PPk6k7j0
$$ plain form
6261 108 157 203 248 248 249 262 275 288 301 322 344 297 250 193 137 80 24 18 12 35 59 74 90 106 122 119 115 63 10 -37 -85 -84 -83 -68 -52 -37 -22 -9 3
6245 3 45 117 191 216 201 186 183 180 145 82 12 -27 -34 -11 9 29 49 69 82 66 18 -60 -117 -126 -76 3 82 112 84 56 63 99 119 139 147 156 151 118 57 -3
6227 -3 -83 -133 -154 -176 -222 -268 -285 -253 -200 -147 -81 -15 -2 -18 -40 -62 -56 -51 -47 -43 -39 -36 -39 -42 -32 6 65 124 152 150 146 141 134 128 93 58 6 -15 -14 -13 -11 -8 18 44
6208 44 22 -30 -81 -83 -64 -15 41 69 64 28 -7 -43 -77 -112 -109 -56 -2 52 85 119 113 58 -20 -69 -65 -33 -16 0 17 35 25 14 -13 -10 15 42 21 -28
6192 -28 -56 -35 5 45 61 78 94 110 129 148 168 187 140 93 45 -1 -6 -11 -82 -153 -170 -128 -56 -13 -11 -39 -77 -115 -139 -103 -31 39 116 192 239 286 293
6176 293 299 277 254 238 222 137 52 14 -24 -62 -100 -138 -177 -166 -155 -87 -19 48 116 150 184 218 253 220 187 155 122 97 72 50 28 29 88 130 144 135
6160 135 127 116 106 86 66 47 27 38 49 109 169 184 199 169 138 111 143 171 199 210 221 233 244 195 146 97 48 31 13 64 115 135 154 174 194
6145 194 236 279 321 364 359 355 351 346 320 294 268 242 248 253 259 265 206 146 87 28 35 42 49 56 81 105 130 155 104 52 1 -50 -56 -63 -69 -76 -75 -74 -73 -72 -58 -44 -30 -16 -2
$$ packed form
6261A08M9M6M5%JJ3J3J3J3K1K2m7m7n7n6n7n6ooK3K4J5J6J6J6lmn2n3m7m8JJJ5J6J5J5J3J2
6245CM2P2P4K5j5j5lll5o3p0l9pK3K0K0K0K0J3j6m8p8n7rN0P9P9L0k8k8PL6K0K0QRnl3o1o0
6227cq0n0k1k2m6m6j7L2N3N3O6O6J3j6k2k2ONMMMLllJ0L8N9N9K8kmnpol5l5n2k1JJKLK6K6
6208D4k2n2n1kJ9M9N6K8nl6l5l6l4l5LN3N4N4L3L4on5p8m9ML2J7J6J7J8j0j1k7LK5K7k1m9
6192b8k8K1M0M0J6J7J6J6J9J9K0J9m7m7m8m6nnp1p1j7M2P2M3Kk8l8l8k4L6P2P0P7P6M7M7P
6176B93Ok2k3j6j6q5q5l8l8l8l8l8l9J1J1O8O8O7O8L4L4L4L5l3l3l2l3k5k5k2k2JN9M2J4r
6160A35qj1j0k0k0j9k0J1J1O0O0J5J5l0l1k7L2K8K8J1J1J2J1m9m9m9m9j7j8N1N1K0J9K0K0
6145A94M2M3M2M3nmmnk6k6k6k6ONOOn9o0n9n9PPPPK5K4K5K5n1n2n1n1opopJJJJJ4J4J4J4J4
$$ plain form
6125 -2 11 25 38 34 30 25 21 9 -2 -43 -84 -119 -153 -137 -122 -27 68 197 267 326 384 485 586 645 645 549 393 304 274 256 238 220 202 221 180 110
6110 110 99 140 181 232 284 309 334 366 456 576 696 908 1336 1941 2644 3760 5644 7894 9259 8846 6997 4950 3514 2631
6099 2631 1965 1438 1127 992 857 748 699 667 577 516 514 524 474 429 383 363 283 204 184 166 149 135 122 102 82 63 43 62 81 96 111 141
6085 141 112 67 22 11 0 19 38 62 87 111 135 134 133 133 132 116 100 85 69 46 23 0 -22 23 69 114 160 145 129 113 98 82 66 51 35 41 48 54
6069 54 61 73 84 96 108 121 134 87 41 12 -16 -44 -73 -74 -75 -75 -76 -71 -67 -62 -57 -33 -9 -44 -78 -120 -162 -145 -128 -101 -74 -47 -20 28 77 127 176 180 184 188 191 251
6051 251 311 337 315 275 206 135 92 90 88 88 87 70 52 35 17 21 24 28 31 72 112 153 193 153 114 77 40 14 37 92 146 161 176 191 206 258 310 301 292 257
6033 257 193 118 92 130 168 209 250 247 244 182 120 99 77 56 35 67 99 131 164 160 157 153 150 136 123 51 -21 -33 -45 -57 -69 -35 -1 32 66 77 87 39
6017 39 -8 -11 -13 -15 -18 -16 -15 -14 -12 -32 -51 -70 -89 -82 -74 -66 -58 -30 -2 25 54 65 76 87 98 79 60 41 22 31 39 47 55 34 13 -7 -29 -12 4 21 38 84 131
$$ packed form
6125bJ3J4J3mmnmj2j1m1m1l5l4J6J5R5R5J29P0N9N8J01J01N9%r6j56q9l0j8j8j8j8J9m1p0
6110A10j1M1M1N1N2K5K5L2R0J20J20K12M28O05P03J116J884K250J365m13j849k047j436q83
6099B631o66n27l11j35j35j09m9l2r0o1kJ0n0m5m6k0q0p9k0j8j7j4j3k0k0j9k0J9J9J5J5L0
6085A41k9m5m5j1j1J9J9K4K5K4K4jj%jj6j6j5j6k3k3k3k2M5M6M5M6j5j6j6j5j6j6j5j6OPO
6069E4PJ2J1J2J2J3J3m7m6k9k8k8k9jj%jNMNNK4K4l5l4m2m2J7J7K7K7K7K7M8M9N0M9MMMLO0
6051B51O0K6k2m0o9p1m3kk%jj7j8j7j8MLMLM1M0M1M0m0l9l7l7k6K3N5N4J5J5J5J5N2N2rrl5
6033B57o4p5k6L8L8M1M1llo2o2k1k2k1k1L2L2L2L3mlmlj4j3p2p2j2j2j2j2L4L4L3L4J1J0m8
6017C9m7lkklKJJKk0j9j9j9PQQQK8K8K7K9J1J1J1J1j9j9j9j9RQQQk1k1k0k2J7J6J7J7M6M7
$$ plain form
5998 131 119 106 100 94 88 82 73 65 57 48 64 80 123 117 98 79 57 35 37 39 80 151 206 212 149 86 31 -23 -75 -127 -148 -120 -61 -2 47 97 88 79 38 -1 -42 -82
5980 -82 -92 -102 -52 -3 38 80 62 45 4 -36 -17 0 -58 -116 -175 -234 -236 -238 -181 -124 -70 -16 37 91 59 26 53 80 108 136 163 189 193 167 124 140 155
5964 155 170 188 207 232 258 284 310 311 312 312 313 318 323 327 332 291 249 208 167 126 85 44 3 17 32 46 61 61 62 62 63 75 87 70 53 13 -26 -17 -8 13 34 -13
5946 -13 -60 -92 -123 -106 -88 -26 35 43 -6 -100 -163 -154 -86 -1 54 58 3 -39 -24 23 70 65 59 53 48 73 99 125 150 158 165 173 180 131 82 33 -15 -35 -55 -75 -95
5928 -95 -84 -72 -60 -48 -64 -80 -96 -112 -66 -20 24 70 90 109 129 149 145 142 69 -2 -57 -113 -99 -86 -52 -18 15 49 68 86 55 25 29 33 38 42 56 70
5912 70 83 97 59 21 -16 -54 -24 4 34 64 71 79 86 94 88 83 78 72 60 47 34 21 28 34 40 46 39 33 27 21 26 31 36 42 9 -23 -7 9 44 79 65 51 50 49 49 48 37
5891 37 26 15 4 49 95 140 186 200 214 227 241 203 166 128 90 111 133 154 176 201 226 202 178 114 50 36 21 37 53 69 85 110 135 160 185
5876 185 120 55 5 15 38 60 86 112 155 197 224 192 134 77 46 14 0 -13 -28 -42 -45 -49 -52 -56 -59 -63 -37 -11 -45 -79 -77 -17 73 164 190 215 181 146
$$ packed form
5998A31j2j3oooorqqrJ6J6M3oj9j9k2k2KKM1P1N5Oo3o3n5n4n2n2k1K8N9N9M9N0rrm1l9m1m0
5980h2j0j0N0M9M1M2j8j7m1m0J9J7n8n8n9n9kkN7N7N4N4N3N4l2l3K7K7K8K8K7K6Mk6m3J6J5
5964A55J5J8J9K5K6K6K6JJ%JNNMNm1m2m1m1m1m1m1m1J4J5J4J5%J%JJ2J2j7j7m0l9RRK1K1m7
5946a3m7l2l1J7J8O2O1Qm9r4o3RO8Q5N5Mn5m2J5M7M7noonK5K6K6K5QPQPm9m9m9m8k0k0k0k0
5928i5J1J2J2J2j6j6j6j6M6M6M4M6K0J9K0K0mlp3p1n5n6J4J3L4L4L3L4J9J8l1l0MMNMJ4J4
5912G0J3J4l8l8l7l8L0K8L0L0PQPQonnoj2j3j3j3POOOpoooNNNOl3l2J6J6L5L5j4j4jj%jj1
5891C7j1j1j1M5M6M5M6J4J4J3J4l8l7l8l8K1K2K1K2K5K5k4k4o4o4j4j5J6J6J6J6K5K5K5K5
5876A85o5o5n0J0K3K2K6K6M3M2K7l2n8n7l1l2j4j3j5j4lmlmlmK6K6l4l4KO0R0R1K6K5l4l5
$$ plain form
5860 146 111 77 84 92 100 108 108 107 107 107 131 155 136 88 80 72 45 48 71 93 132 142 103 35 -15 -66 -88 -61 -3 55 93 132 171 210 240 269 268 217 144 71 38
5842 38 34 48 62 78 94 110 126 125 153 218 284 309 304 297 289 280 271 231 191 151 111 109 108 106 104 99 94 88 83 74 66 59 52 35 46 58 40 -6 -54 -61 -38 29 97 135 125
5822 125 95 66 92 119 108 98 87 77 60 44 28 11 27 42 60 77 115 183 248 285 267 219 170 150 167 184 219 224 193 161 169 205 210 185 179 172 145
5806 145 119 92 65 52 40 29 18 -22 -34 -20 22 23 25 28 31 44 57 70 83 121 159 133 49 -33 -87 -79 -42 -44 -46 -47 -47 24 97 169 241 228 215 202 189
5789 189 119 48 -22 -92 -120 -149 -118 -87 -90 -93 -97 -100 -136 -172 -145 -59 -3 23 70 117 116 115 113 112 133 154 175 196 168 140 112 84 83 82 81 80 93 106 116 126 117
5772 117 49 14 -19 -41 -63 -84 -106 -110 -115 -119 -124 -132 -140 -148 -157 -133 -109 -85 -61 -33 -5 23 51 53 54 55 57 53 48 44 40 63 86 109 132 150 167 181 195 218 183 122 60
5753 60 23 -13 -51 -88 -125 -163 -200 -238 -246 -255 -264 -273 -252 -230 -153 -76 -14 -2 -11 -20 -20 -20 -20 -20 -5 9 70 131 162 143 123 103 88 72 57 41 31 22 12 2 39
5735 39 77 114 152 162 173 183 194 169 144 120 95 93 90 88 85 59 33 7 -18 16 52 87 122 120 118 115 113 93 73 53 34 27 21 14 8 27 45 64 83 90 98 76
$$ packed form
5860A46l5l4PQQQ%j%%K4K4j9m8qqk7LK3K2L9J0l9o8n0n1k2K7N8N8L8L9L9L9L0K9jn1p3p3l3
5842C8mJ4J4J6J6J6J6jK8O5O6K5npqrrm0m0m0m0kjkknnonrqppj7J1J2j8m6m8pK3O7O8L8j0
5822A25l0k9K6K7j1j0j1j0j7j6j6j7J6J5J8J7L8O8O5L7j8m8m9k0J7J7L5Nl1l2QL6Nk5opk7
5806A45k6k7k7j3j2j1j1m0j2J4M2JKLLJ3J3J3J3L8L8k6q4q2n4QL7kkj%P1P3P2P2j3j3j3j3
5789A89p0p1p0p0k8k9L1L1llmll6l6K7Q6N6K6M7M7jjkjK1K1K1K1k8k8k8k8jjjjJ3J3J0J0r
5772A17o8l5l3k2k2k1k2mnmnqqqrK4K4K4K4K8K8K8K8KJJKmnmmK3K3K3K3J8J7J4J4K3l5o1o2
5753F0l7l6l8l7l7l8l7l8qrrrK1K2P7P7O2J2rr%%%%J5J4O1O1L1j9k0k0j5j6j5j6j0rj0j0L7
5735C9L8L7L8J0J1J0J1k5k5k4k5klklk6k6k6k5L4L6L5L5kklkk0k0k0j9popoJ9J8J9J9PQk2
$$ plain form
5717 76 54 36 18 -45 -109 -131 -103 -74 -45 -65 -85 -104 -124 -104 -85 -65 -45 -53 -60 -68 -75 -88 -101 -114 -127 -113 -99 -85 -71 -69 -66 -64 -61 -31 -2 27 57 52 47 42 37
5699 37 45 52 60 67 80 94 107 120 82 44 5 -32 -33 -34 -35 -37 7 51 121 192 250 249 212 176 159 142 125 108 95 81 68 55 41 28 15 1 -3 -8 -13 -18 -7 2
5681 2 13 23 28 33 9 -15 31 78 76 73 75 76 78 79 96 113 81 49 32 15 -30 -77 -82 -88 -94 -99 -107 -115 -123 -130 -138 -146 -153 -161 -112 -63 -14 34 32 30 28 26 41 57 3 -49 -46 -43 -40
5660 -40 -37 21 80 70 59 66 72 108 144 235 326 363 341 334 356 389 422 507 622 748 932 1111 1152 1070 988 1037 1116 1161 1383 1928 2689 3549 4940
5645 4940 7351 10175 11728 10938 8489 6070 4556 3651 2810 2027 1552 1294 1056 847 768 748 665 553 496 499 504 509 583 657 710
5635 710 703 665 567 414 261 241 222 180 138 155 172 164 155 177 198 206 213 276 339 367 337 310 283 267 251 293 336 361 386 501 615 700 648 535 422
5619 422 352 283 272 262 223 184 174 165 166 166 167 168 191 214 178 142 80 17 -15 -48 -58 -68 -18 30 36 42 19 -4 -26 -48 -44 18 58 98 83 68 51 35 18
5603 18 1 3 4 6 8 28 49 69 89 78 66 54 43 54 66 78 90 102 114 126 138 123 109 95 81 43 6 -31 -68 -91 -114 -77 -41 -28 -16 -4 8
$$ packed form
5717G6k2j8j8o3o4k2K8K9K9k0k0j9k0K0J9K0K0qpqpj3j3j3j3J4J4J4J4KLKLL0K9K9L0nnnn
5699C7QPQPJ3J4J3J3l8l8l9l7jjjkM4M4P0P1N8jl7l6j7j7j7j7j3j4j3j3j4j3j3j4mnnnJ1R
5681BJ1J0NNk4k4M6M7klKJKJJ7J7l2l2j7j7m5m7noonqqqpqqpqM9M9M9M8kkkkJ5J6n4n2LLL
5660d0LN8N9j0j1POL6L6R1R1L7k2pK2L3L3Q5J15J26J84J79M1q2q2M9P9M5K22N45P61Q60J391
5645D940K411K824J553p90k449k419j514r05q41p83m75k58k38k09p9k0q3j12n7LNNP4P4N3
5635G10pl8r8j53j53k0j9m2m2J7J7qrK2K1QPO3O3K8l0k7k7j6j6M2M3K5K5J15J14Q5n2j13j13
5619D22p0o9j1j0l9l9j0rJ%JJK3K3l6l6o2o3l2l3j0j0N0M8OOk3k3k2k2MO2M0M0j5j5j7j6j7
5603A8j7KJKKK0K1K0K0j1j2j2j1J1J2J2J2J2J2J2J2j5j4j4j4l8l7l7l7k3k3L7L6J3J2J2J2
$$ plain form
5586 8 28 48 97 146 182 218 195 172 105 37 -29 -37 -15 65 146 168 139 50 -7 -66 -130 -194 -199 -204 -195 -186 -177 -168 -117 -66 -15 35 50 64 20 -24 -32 -41 8 59
5569 59 131 203 177 150 97 43 -9 -63 -74 -85 -95 -106 -97 -88 -108 -128 -128 -128 -69 -10 55 120 157 193 193 192 163 133 90 46 3 -39 -75 -110 -120 -71 0 71
5553 71 87 103 75 47 77 108 179 251 296 283 223 163 162 221 328 406 401 337 246 185 162 139 147 154 161 169 114 59 63 67 54 41 0 -42 -37 -33 -28 -23 -24 -25 -26 -27 14
5534 14 55 38 20 7 -4 -17 -30 -56 -82 -50 -17 15 48 21 -4 -23 -42 -61 -80 -91 -101 -110 -119 -99 -50 -18 14 16 18 22 26 16 36 56 46 7 -31 -40 -19
5517 -19 -5 8 24 40 42 44 45 47 43 38 34 30 42 55 68 81 65 50 34 19 38 58 77 97 125 153 152 150 132 114 129 173 194 216 239 262 258 254 250 246 213 181
5499 181 175 170 180 161 111 61 57 83 108 105 84 64 43 23 16 39 62 56 8 -38 -55 -43 -36 -29 -50 -71 -100 -129 -127 -96 -78 -90 -113 -136 -143 -151 -145 -111 -53 4 62
5481 62 120 149 148 96 45 0 -14 20 55 65 44 -6 -56 -90 -95 -84 -43 -5 32 70 108 123 108 43 -20 -58 -46 -15 15 23 1 -31 -64 -62 -31 0 1 -26
5465 -26 -53 -52 -21 26 45 32 20 20 20 3 16 58 101 146 191 207 224 227 201 188 175 209 243 257 270 281 292 291 260 195 100 14 -41 -85 -128 -141 -124 -122
$$ packed form
5586HK0K0M9M9L6L6k3k3o7o8o6qK2Q0Q1K2k9q9n7n9o4o4nnRRRRN1N1N1N0J5J4m4m4qrM9N1
5569E9P2P2k6k7n3n4n2n4j1j1j0j1RRk0k0%%N9N9O5O5L7L6%jk9l0m3m4m3m2l6l5j0M9P1P1
5553G1J6J6k8k8L0L1P1P2M5j3o0o0jN9J07P8no4r1o1k3k3QPPQn5n5MMj3j3m1m2NMNNjjjjM1
5534A4M1j7j8j3j1j3j3k6k6L2L3L2L3k7k5j9j9j9j9j1j0rrK0M9L2L2KKMMj0K0K0j0l9l8rK1
5517a9J4J3J6J6KKJKmnmmJ2J3J3J3j6j5j6j5J9K0J9K0K8K8jkj8j8J5M4K1K2K3K3mmmml3l2
5499A81onJ0j9n0n0mK6K5lk1k0k1k0pK3K3om8m6j7J2PPk1k1k9k9KL1J8j2k3k3pqOL4N8N7N8
5481F2N8K9jn2n1m5j4L4L5J0k1n0n0l4nJ1M1L8L7L8L8J5j5o5o3l8J2L1L0Qk2l2l3KL1L1Jk7
5465b6k7JL1M7J9j3j2%%j7J3M2M3M5M5J6J7Lk6j3j3L4L4J4J3J1J1jl1o5r5q6n5m4m3j3J7K
$$ plain form
5448 -122 -120 -105 -61 -17 -2 -34 -65 -51 -37 -45 -82 -120 -128 -114 -101 -58 -15 26 38 18 -2 4 11 19 26 51 77 102 128 159 190 190 161 126 120 126 132 89 46 33
5431 33 20 1 -17 11 39 48 27 7 16 8 1 -4 -9 2 14 25 37 15 -6 -28 -50 -35 -20 -5 9 35 61 86 112 123 135 133 102 65 27 20 43 37 31 29 26
5413 26 33 69 117 115 57 0 -30 -60 -50 -40 15 71 86 51 -4 -60 -58 -55 -53 -50 -34 -17 0 15 -4 -24 -44 -65 -38 -12 14 40 73 105 137 170 165 160 156 151
5396 151 152 153 154 155 152 150 147 144 159 175 190 205 210 216 172 128 90 53 84 115 175 236 297 357 358 359 360 361 310 260 209 158 128 99 69 40 47 55 62 69 76 83 90 96 76 56
5376 56 35 15 14 12 11 9 4 0 -5 -11 1 14 31 47 75 153 217 253 237 191 160 130 124 119 113 108 103 99 95 91 74 58 43 28 44 89 145 151 126 101 72 44 58 71
5357 71 85 99 111 123 135 146 124 102 51 0 -41 -81 -100 -70 -13 42 53 64 70 76 82 89 90 92 45 -2 -29 -56 -34 -12 -31 -50 -95 -140 -119 -48 10 40
5340 40 53 65 76 86 55 24 -6 -38 -59 -80 -101 -123 -122 -121 -120 -119 -122 -125 -128 -130 -116 -102 -87 -73 -94 -115 -137 -158 -113 -68 -23 21 7 -6 -21 -35 -7 19 47
5323 47 74 56 37 18 0 3 6 10 13 -17 -48 -79 -110 -79 -49 -18 11 40 69 98 127 126 125 59 -7 -65 -74 -61 -49 -28 -8 12 33 57 82 106 131 128 126 125
$$ packed form
5448a22KJ5M4M4J5l2l1J4J4ql7l8qJ4J3M3M3M1J2k0k0OPQPK5K6K5K6L1L1%k9l5oOOm3m3j3
5431C3j3j9j8K8K8Rk1k0RqpnnJ1J2J1J2k2k1k2k2J5J5J5J4K6K6K5K6J1J2kl1l7l8pK3ookl
5413B6PL6M8kn8n7l0l0J0J0N5N6J5l5n5n6KLKLJ6J7J7J5j9k0k0k1K7K6K6K6L3L2L2L3nnmn
5396A51JJJJlkllJ5J6J5J5NOm4m4l8l7L1L1O0O1O1O0JJJJn1n0n1n1l0k9l0k9PQPPPPPOk0k0
5376E6k1k0jkjknmnoJ2J3J7J6K8P8O4L6j6m6l1l0ononnmmmj7j6j5j5J6M5N6Ok5k5k9k8J4J3
5357G1J4J4J2J2J2J1k2k2n1n1m1m0j9L0N7N5J1J1OOOPJKm7m7k7k7K2K2j9j9m5m5K1P1N8L0
5340D0J3J2J1J0l1l1l0l2k1k1k1k2JJJJlllkJ4J4J5J4k1k1k2k1M5M5M5M4j4j3j5j4K8K6K8
5323D7K7j8j9j9j8LLMLl0l1l1l1L1L0L1K9K9K9K9K9jjo6o6n8rJ3J2K1K0K0K1K4K5K4K5lkj
$$ plain form
5306 125 124 152 208 276 295 282 268 252 236 202 168 136 104 74 73 115 157 187 217 273 280 232 154 63 20 6 -7 -34 -30 -4 51 107 133 133 102 28 -45
5290 -45 -121 -197 -215 -232 -205 -177 -150 -123 -96 -69 -43 -18 11 12 -28 -70 -80 -90 -101 -111 -122 -133 -142 -152 -177 -174 -129 -85 -29 -3 -19 -35 -28 -21 -15 -8 -15 -22 -31 -41
5273 -41 -33 -55 -60 -66 -46 -26 -6 13 11 9 7 4 24 44 63 83 82 81 97 84 10 -63 -95 -97 -58 9 61 112 163 185 180 146 109 71 33 -3 -22 -11 0 -19 -11
5255 -11 -4 0 6 20 35 49 63 77 91 64 8 -11 -1 -7 -14 -17 8 96 214 298 333 316 269 210 152 94 36 -7 -3 33 69 93 117 142 166 178 189 171
5238 171 103 11 -51 -56 -30 -20 -60 -129 -198 -254 -310 -267 -225 -181 -136 -95 -54 -45 -85 -171 -228 -230 -202 -171 -170 -158 -116 -93 -70 -61 -53 -44 -35 -58 -81 -104 -128 -117 -106
5221 -106 -95 -84 -59 -35 -10 13 18 22 -31 -86 -65 -45 -25 -4 -4 -4 -4 -3 -38 -73 -122 -141 -102 -14 47 109 125 141 98 54 13 -28 -10 6 19 31 44 56
5205 56 89 121 154 186 172 158 143 129 132 135 138 141 107 73 39 5 -31 -68 -105 -142 -140 -137 -76 -15 50 116 123 130 127 124 121 118 136 153 170 187 162 137 112 87 127
5187 127 166 205 244 246 249 251 253 223 193 163 133 129 125 120 116 145 173 123 44 14 43 100 97 38 -19 -23 -26 0 26 53 80 64 47 31 15 -7 -30 -54 -77 -75 -74
$$ packed form
5306A25jK8N6O8J9j3j4j6j6l4l4l2l2l0jM2M2L0L0N6Pm8p8r1m3j4j3k7MK6N5N6K6%l1p4p3
5290d5p6p6j8j7K7K8K7K7K7K7K6K5K9Jm0m2j0j0j1j0j1j1rj0k5LM5M4N6K6j6j6PPOPpprj0
5273d1Qk2noK0K0K0J9kkklK0K0J9K0jjJ6j3p4p3l2kL9O7N2N1N1K2nl4l7l8l8l6j9J1J1j9Q
5255a1PMOJ4J5J4J4J4J4k7n6j9J0oplK5Q8J18Q4L5j7m7n9n8n8n8m3ML6L6K4K4K5K4J2J1j8
5238A71o8r2o2nK6J0m0o9o9n6n6M3M2M4M5M1M1Rm0q6n7kK8L1JJ2M2K3K3RQRRk3k3k3k4J1J1
5221a06J1J1K5K4K5K3NMn3n5K1K0K0K1%%%Jl5l5m9j9L9Q8O1O2J6J6m3m4m1m1J8J6J3J2J3J2
5205E6L3L2L3L2j4j4j5j4LLLLl4l4l4l4l6l7l7l7KLO1O1O5O6PPllllJ8J7J7J7k5k5k5k5M0
5187A27L9L9L9KLKKl0l0l0l0mmnmK9K8n0p9l0K9N7ln9n7mlK6K6K7K7j6j7j6j6k2k3k4k3KJ
$$ plain form
5169 -74 -72 -70 -90 -109 -155 -200 -206 -152 -56 10 10 10 9 7 -8 -24 -39 -55 -87 -120 -156 -133 -69 -6 1 9 -15 -40 -35 -31 -9 11 33 55 97 139 212 227 193 129 62
5152 62 25 1 -22 -45 -67 -54 -42 -29 -17 0 17 -24 -65 -102 -139 -117 -94 -69 -44 -19 6 27 49 41 33 12 -7 -4 57 117 148 198 249 255 261 266 272 249 225
5135 225 201 178 140 103 77 81 117 123 68 -16 -104 -164 -171 -129 -93 -58 -20 18 72 127 197 237 215 163 110 86 105 124 144 165 149 133 117 101 77 53
5119 53 32 10 16 51 69 88 88 87 87 86 132 177 181 154 100 45 31 47 66 85 122 130 100 70 22 3 24 44 94 145 201 228 212 196 154 111 68 25 -25
5102 -25 -77 -146 -185 -172 -159 -144 -129 -104 -79 -70 -32 33 100 123 118 125 102 65 28 26 24 -16 -86 -108 -62 2 67 88 109 130 151 180 209 198 157 140 153 164
5086 164 145 109 73 36 -1 -11 -21 -31 -41 -59 -78 -96 -115 -136 -158 -120 -83 -41 0 -18 -36 -86 -136 -155 -125 -62 1 9 16 12 8 -24 -58 -51 -44 -38 -31 -36 -41 -46
5068 -46 -50 -16 16 -8 -33 -29 -25 -47 -70 -52 14 69 95 101 106 110 114 114 114 114 114 131 147 105 63 35 8 10 12 -5 -24 -69 -114 -105 -46 11 20 -2 -25 -51 -77 -91 -105
5050 -105 -60 -16 42 100 129 157 157 157 101 45 4 11 51 90 119 149 148 148 148 148 148 147 134 120 77 34 -16 -67 -59 -50 -40 -30 -20 -10 26 63 100 137 127 117
$$ packed form
5169g4KKk0j9m6m5oN4R6O6%%jkj5j6j5j6l2l3l6K3O4O3PQk4k5NMK2K0K2K2M2M2P3J5l4o4o7
5152F2l7k4k3k3k2J3J2J3J2J7J7m1m1l7l7K2K3K5K5K5K5K1K2qqk1j9LO1O0L1N0N1OONOk3k4
5135B25k4k3l8l7k6ML6On5q4q8o0pM2L6L5L8L8N4N5P0M0k2n2n3k4J9J9K0K1j6j6j6j6k4k4
5119E3k1k2OL5J8J9%j%jM6M5Mk7n4n5j4J6J9J9L7Ql0l0m8j9K1K0N0N1N6K7j6j6m2m3m3m3n0
5102b5n2o9l9J3J3J5J5K5K5RL8O5O7K3nPk3l7l7kkm0p0k2M6O4O5K1K1K1K1K9K9j1m1j7J3J1
5086A64j9l6l6l7l7j0j0j0j0j8j9j8j9k1k2L8L7M2M1j8j8n0n0j9L0O3O3QPmml2l4PPOPnnn
5068d6mL4L2k4k5MMk2k3J8O6N5K6ONMM%%%%J7J6m2m2k8k7KKj7j9m5m5RN9N7Rk2k3k6k6j4j4
5050a05M5M4N8N8K9K8%%n6n6m1PM0L9K9L0j%%%%jj3j4m3m3n0n1QRJ0J0J0J0L6L7L7L7j0j0
$$ plain form
5032 117 107 98 80 62 43 25 0 -24 -50 -75 -64 -52 -41 -29 -45 -60 -76 -91 -64 -36 -8 19 24 30 36 41 12 -17 -46 -76 -106 -137 -109 -81 -65 -48 -32
5016 -32 -16 34 85 111 77 39 1 -10 -22 -28 -33 -39 -44 -7 30 67 104 142 179 217 254 271 288 301 314 293 213 107 0 -43 -87 -132 -176 -173 -169 -165 -162 -114
5000 -114 -66 -17 30 61 92 123 154 118 82 46 10 1 -8 12 32 52 72 53 5 -46 -38 28 94 127 100 48 -4 -58 -111 -135 -160 -184 -209 -205 -200 -144 -88
4984 -88 -7 74 133 132 106 80 87 93 70 47 10 -27 -35 -42 -27 -11 59 130 186 184 116 48 36 24 11 0 -13 -27 -40 -54 -45 -36 -27 -19 -31 -44 -57 -69 -35 -1
4967 -1 88 178 234 241 176 112 89 66 73 80 45 11 6 1 -31 -64 -37 -11 31 73 86 100 116 132 118 105 98 91 55 18 25 32 68 104 120 136 150 115 16 -81
4949 -81 -124 -166 -173 -181 -188 -195 -152 -109 -66 -22 -27 -32 -37 -42 -19 2 24 47 49 51 53 55 74 93 112 132 129 127 125 123 100 78 55 32 12 -7 1 11 50 89 98 58 0 -28
4930 -28 -34 -10 37 86 107 128 83 37 50 63 84 106 127 148 171 194 158 122 59 -3 -7 -11 -17 -23 -29 -35 -21 -6 8 23 50 76 103 130 125 119 114 109 128 147 165
4912 165 184 186 187 189 191 186 181 176 171 149 127 105 83 81 79 76 74 60 45 31 16 47 79 110 141 144 146 119 92 103 115 97 30 -39 -79 -59 -10 46 72 59 45 37
$$ packed form
5032A17j0rj8j8j9j8k5k4k6k5J1J2J1J2j6j5j6j5K7K8K8K7NOONk9k9k9l0l0l1K8K8J6J7J6
5016c2J6N0N1K6l4l8l8j1j2ononL7L7L7L7L8L7L8L7J7J7J3J3k1q0j06j07m3m4m5m4LMMLM8
5000a14M8M9M7L1L1L1L1l6l6l6l6rrK0K0K0K0j9m8n1QO6O6L3k7n2n2n4n3k4k5k4k5MNN6N6
4984h8Q1Q1N9jk6k6POk3k3l7l7qpJ5J6P0P1N6ko8o8j2j2j3j1j3j4j3j4RRRQj2j3j3j2L4L4
4967aQ9R0N6Po5o4k3k3PPl5l4nnl2l3K7K6M2M2J3J4J6J6j4j3ppl6l7PPL6L6J6J6J4l5r9r7
4949h1m3m2pqppM3M3M3M4nnnnK3K1K2K3KKKKJ9J9J9K0lkkkk3k2k3k3k0j9QJ0L9L9Rm0n8k8
4930b8oK4M7M9K1K1m5m6J3J3K1K2K1K1K3K3l6l6o3o2mmooooJ4J5J4J5K7K6K7K7nonnJ9J9J8
4912A65J9KJKKnnnnk2k2k2k2kklkj4j5j4j5L1L2L1L1LKk7k7J1J2j8o7o9m0K0M9N6K6j3j4q
$$ plain form
4894 37 28 20 12 -22 -57 -89 -121 -92 -14 92 199 251 253 225 196 211 226 211 196 182 168 155 141 138 135 103 71 68 65 121 177 203 228 224 220 206 192 179 165
4877 165 131 97 63 29 -32 -94 -125 -107 -91 -76 -58 -40 -8 23 -3 -31 -53 -75 -98 -120 -140 -160 -121 -83 -49 -15 18 52 105 158 152 146 115 84 82 81 94
4861 94 108 121 135 167 200 232 265 253 242 230 219 181 142 74 6 -36 -79 -73 -66 -47 -27 -37 -47 -61 -75 -20 34 95 156 168 180 205 230 285 340 323
4846 323 307 290 274 243 211 180 149 157 165 124 83 40 -3 21 46 99 152 155 159 123 87 50 14 -31 -77 -83 -41 17 47 47 47 13 -21 -101 -181 -180 -110 -15 49
4829 49 78 78 63 48 44 39 64 90 104 119 134 149 183 217 210 154 68 -17 -57 -96 -76 -56 12 81 115 150 181 212 206 151 74 -1 -60 -119 -108 -98 -86 -73
4812 -73 -60 -48 -58 -68 -78 -88 -89 -91 -92 -93 -47 0 -22 -45 -52 -59 -37 -15 -51 -87 -93 -99 -64 -28 -42 -55 -47 -38 -30 -21 -31 -42 -52 -62 -73 -83 -93 -104 -139 -175 -210
4795 -210 -246 -195 -145 -94 -44 -64 -84 -105 -125 -146 -166 -184 -201 -175 -99 -35 0 11 24 35 45 49 53 57 61 52 44 35 27 59 91 123 155 142 129 116 103 114 124
4778 124 85 46 19 -6 16 39 89 138 146 105 43 -18 -42 -16 39 94 104 114 92 70 78 86 77 69 60 52 10 -31 -23 -16 26 68 110 152 189 226 174 122 86
$$ packed form
4894C7rqql4l5l2l2K9P8J06J07N2Kk8k9J5J5j5j5j4j4j3j4lll2l2llN6N6K6K5mmj4j4j3j4
4877A65l4l4l4l4o1o2l1J8J6J5J8J8L2L1k6k8k2k2k3k2k0k0L9L8L4L4L3L4N3N3ool1l1kjJ3
4861I4J4J3J4L2L3L2L3j2j1j2j1l8l9o8o8m2m3OPJ9K0j0j0j4j4N5N4O1O1J2J2K5K5N5N5j7
4846C23j6j7j6l1l2l1l1QQm1m1m3m3K4K5N3N3LMl6l6l7l6m5m6oM2N8L0%%l4l4q0q0JP0R5O4
4829D9K9%j5j5mnK5K6J4J5J5J5L4L4pn6q6q5m0l9K0K0O8O9L4L5L1L1on5p7p5n9n9J1J0J2J3
4812g3J3J2j0j0j0j0jkjjM6M7k2k3ppK2K2l6l6ooL5L6j4j3QRQRj0j1j0j0j1j0j0j1l5l6l5
4795b10l6N1N0N1N0k0k0k1k0k1k0j8j7K6P6O4L5J1J3J1J0MMMMrqrqL2L2L2L2j3j3j3j3J1J0
4778A24l9l9k7k5K2K3N0M9Qm1o2o1k4K6N5N5J0J0k2k2QQrqrqm2m1QPM2M2M2M2L7L7n2n2l6
$$ plain form
4761 86 49 62 75 82 89 95 102 116 130 144 159 165 172 179 186 175 164 153 142 158 175 189 203 189 145 89 84 114 145 178 210 191 143 95 76 76 76 78 79 53 26 1
4742 1 -24 -71 -90 -67 -45 -18 -20 -25 0 32 35 40 75 122 169 176 153 138 124 107 91 66 42 17 -6 16 39 43 77 142 177 151 96 54 62 98 135 112 89
4726 89 67 44 6 -31 -66 -102 -144 -156 -126 -96 -70 -44 -19 6 -22 -51 -78 -105 -102 -70 -54 -38 -31 -25 -19 -12 0 14 28 42 52 62 72 82 117 152 204 227
4709 227 195 163 129 96 75 53 34 14 -9 -3 -14 -24 -28 -31 -51 -42 -16 9 -2 -44 -66 -58 -68 -78 -55 -31 8 18 18 18 16 14 46 78 110 142 184 226 285
4692 285 315 280 244 207 170 119 69 -14 -39 -20 -2 20 42 72 101 131 161 115 69 24 -21 -30 -38 -47 -56 -31 -6 18 42 1 -40 -81 -123 -115 -107 -99 -91 -100 -109 -118
4675 -118 -127 -118 -110 -101 -92 -71 -50 -29 -8 -21 -33 -46 -58 -87 -116 -89 -62 -75 -148 -220 -233 -177 -122 -62 -3 73 151 169 187 148 108 68 29 21 13 5 -2 -48 -94
4658 -94 -140 -186 -223 -261 -239 -217 -192 -167 -141 -116 -128 -140 -153 -165 -155 -145 -135 -125 -131 -137 -143 -149 -92 -35 20 77 156 234 254 274 205 136 66 -2 -55 -109 -104 -99
4641 -99 -99 -100 -101 -102 -45 11 69 126 179 233 227 222 223 224 223 222 202 152 92 31 0 0 28 58 76 65 54 72 106 140 146 152 161 170 109 20 -43 -57 -48 -9 38 86 105
$$ packed form
4761H6l7J3J3PPOPJ4J4J4J5OPPPj1j1j1j1J6J7J4J4j4m4n6nL0L1L3L2j9m8m8j9%%KJk6k7k5
4742Ak5m7j9K3K2K7knK5L2LNL5M7M7Pk3j5j4j7j6k5k4k5k3K2K3ML4O5L5k6n5m2QL6L7k3k3
4726H9k2k3l8l7l5l6m2j2L0L0K6K6K5K5k8k9k7k7LL2J6J6POOPJ2J4J4J4J0J0J0J0L5L5N2K3
4709B27l2l2l4l3k1k2j9k0k3Oj1j0mlk0RK6K5j1m2k2Qj0j0K3K4L9J0%%kkL2L2L2L2M2M2N9
4692B85L0l5l6l7l7n1n0q3k5J9J8K2K2L0K9L0L0m6m6m5m5rqrrK5K5K4K4m1m1m1m2QQQQrrr
4675a18rRQRRK1K1K1K1j3j2j3j2k9k9K7K7j3p3p2j3N6N5O0N9P6P8J8J8l9m0m0l9qqqpm6m6
4658i4m6m6l7l8K2K2K5K5K6K5j2j2j3j2J0J0J0J0ooooN7N7N5N7P9P8K0K0o9o9p0o8n3n4NN
4641i9%jjjN7N6N8N7N3N4onJJjjk0n0o0o1l1%K8L0J8j1j1J8L4L4OORRo1q9o3j4RL9M7M8J9
$$ plain form
4623 105 95 78 91 102 83 51 19 -14 -48 -46 -44 -54 -93 -142 -163 -153 -142 -120 -98 -76 -54 -25 3 31 58 74 60 15 -28 -72 -86 -66 -16 32 51 39
4607 39 28 3 -21 -33 -16 21 58 67 77 82 88 94 100 123 146 168 189 197 175 122 69 57 74 64 24 -20 -36 -17 30 84 137 134 81 11 -28 -39 -50 -53 -56 -31
4590 -31 -6 -33 -89 -146 -172 -189 -206 -220 -233 -198 -134 -70 -35 -7 20 44 68 72 47 38 29 23 17 12 6 23 39 56 72 97 121 146 170 138 106 74 42 51 59 68
4573 68 76 112 148 184 219 198 177 157 136 137 138 139 141 93 46 0 -48 -34 -19 -5 8 6 5 3 2 9 16 -5 -28 -58 -88 -49 -10 8 26 -4 -64 -124 -135 -103 -42
4555 -42 26 96 138 180 182 184 157 129 112 94 123 151 174 148 80 12 -16 -45 -44 -44 -28 -12 68 150 206 213 199 184 204 225 215 206 172 137 132 127 93 59 25
4538 25 -9 -27 -45 -14 16 26 37 48 58 64 70 85 130 176 172 109 47 45 43 41 39 23 7 -8 -24 10 46 81 117 101 86 70 55 46 38 30 22 5 -11 -28 -46
4520 -46 -6 32 72 111 115 119 122 126 93 59 -19 -97 -135 -113 -95 -77 -79 -81 -54 -27 20 67 114 162 165 168 171 174 191 208 156 104 81 59 66 73 39 5 -28 -62 -37
4502 -37 -11 47 47 21 -4 -33 -63 -25 12 82 94 30 -33 -65 -38 15 68 77 85 63 41 18 -3 22 49 104 160 180 199 169 139 75 12 -21 -56 -69 -83
$$ packed form
4623A05j0j7J3J1j9l2l2l3l4KKj0l9m9k1J0J1K2K2K2K2K9K8K8K7J6j4m5m3m4j4K0N0M8J9j2
4607C9j1k5k4j2J7L7L7RJ0NOOOK3K3K2K1Qk2n3n3j2J7j0m0m4j6J9M7N4N3ln3p0l9j1j1llK5
4590c1K5k7n6n7k6j7j7j4j3L5O4O4L5K8K7K4K4Mk5rroonoJ7J6J7J6K5K4K5K4l2l2l2l2RQR
4573F8QL6L6L6L5k1k1k0k1JJJKm8m7m6m8J4J5J4J3kjkjPPk1k3l0l0L9L9J8J8l0o0o0j1L2O1
4555d2O8P0M2M2KKk7k8j7j8K9K8K3k6o8o8k8k9J%J6J6Q0Q2N6Pj4j5K0K1j0rl4l5nnl4l4l4
4538B5l4j8j8L1L0J0J1J1J0OOJ5M5M6mo3o2kkkkj6j6j5j6L4L6L5L6j6j5j6j5rqqqj7j6j7j8
4520d6M0L8M0L9MMLMl3l4p8p8l8K2J8J8kkK7K7M7M7M7M8LLLLJ7J7n2n2k3k2PPl4l4l3l4K5
4502c7K6N8%k6k5k9l0L8L7P0J2o4o3l2K7N3N3RQk2k2k3k1K5K7N5N6K0J9l0l0o4o3l3l5j3j4
$$ plain form
4486 -83 -96 -110 -62 -15 15 -12 -53 -94 -89 -85 -69 -54 -38 -22 22 67 146 165 137 109 76 44 20 -4 -29 -54 -71 -89 -106 -124 -128 -131 -135 -139 -101 -63 -75 -86
4470 -86 -129 -173 -187 -201 -188 -175 -162 -149 -147 -145 -141 -137 -167 -168 -90 36 138 171 157 143 131 119 107 95 84 72 61 50 51 51 52 53 79 105 131 157 122 86 51
4453 51 15 6 -3 -12 -22 -31 -41 -50 -60 -45 -31 -17 -2 23 50 77 103 67 30 -5 -42 -58 -74 -116 -109 -52 34 135 186 183 180 174 168 195 222 199 177 139 101 92
4436 92 84 102 120 137 155 145 135 124 114 111 109 136 163 196 230 195 159 138 116 124 132 129 126 167 209 214 151 43 -34 -36 10 48 56 40 24 56 87 107 127 78
4418 78 29 0 -27 12 53 114 175 178 131 109 116 104 92 91 91 88 86 87 58 18 -21 -60 -70 -49 -28 -5 -12 -31 -51 -63 -75 -75 -44 -5 34 27 19 30 42 41 10
4400 10 -7 -24 -13 -3 22 48 46 44 45 75 105 106 99 91 65 68 79 89 118 117 74 30 -29 -60 -35 18 57 97 105 114 136 187 258 330 332 304 255 206 168 160 180
4383 180 201 191 151 111 71 29 -12 -46 -80 -113 -145 -176 -178 -150 -121 -113 -135 -170 -205 -220 -236 -218 -171 -102 -32 -13 -24 -17 -11 -7 -3 0 3 6 9 34 58 61 15 -68
4365 -68 -153 -197 -192 -153 -84 -1 81 135 160 168 148 120 93 96 129 154 180 158 136 73 10 -4 49 111 143 127 111 140 170 160 101 34 -2 9 20 54 87
$$ packed form
4486h3j3j4M8M7L0k7m1m1NMJ6J5J6J6M4M5P9J9k8k8l3l2k4k4k5k5j7j8j7j8mlmmL8L8j2j1
4470h6m3m4j4j4J3J3J3J3KKMMl0jP8J26J02L3j4j4j2j2j2j2j1j2j1j1J%JJK6K6K6K6l5l6l5
4453E1l6rrrj0rj0rj0J5J4J4J5K5K7K7K6l6l7l5l7j6j6m2PN7Q6J01N1llooK7K7k3k2l8l8r
4436I2qJ8J8J7J8j0j0j1j0lkK7K7L3L4l5l6k1k2QQllM1M2No3j08p7kM6L8Qj6j6L2L1K0K0m9
4418G8m9k9k7L9M1O1O1Lm7k2Pj2j2j%lkJk9m0l9l9j0K1K1K3pj9k0j2j2%L1L9L9pqJ1J2jl1
4400A0j7j7J1J0K5K6kkJL0L0Jpqk6LJ1J0K9jm3m4n9l1K5N3L9M0QRK2N1P1P2Kk8m9m9l8qK0
4383A80K1j0m0m0m0m2m1l4l4l3l2l1kK8K9Qk2l5l5j5j6J8M7O9P0J9j1POMMLLLLK5K4Lm6q3
4365f8q5m4NL9O9Q3Q2N4K5Qk0k8k7LL3K5K6k2k2o3o3j4N3O2L2j6j6K9L0j0n9o7l6J1J1L4L3
$$ plain form
4349 87 147 207 229 202 158 143 161 208 228 218 182 145 157 168 200 232 234 237 210 183 185 187 171 155 139 123 158 194 229 264 240 216 191 167 178 189 151
4333 151 113 29 -53 -107 -161 -150 -139 -128 -117 -93 -70 -46 -23 -33 -43 -7 29 36 -4 -47 -90 -75 -60 -16 28 54 80 106 132 92 52 12 -27 -23 -20 -16 -12
4317 -12 -27 -41 -26 -12 9 31 6 -17 -18 29 99 168 215 261 278 294 303 312 320 329 302 275 248 221 144 68 13 8 28 48 72 95 117 138 160 181 146 111
4301 111 76 41 12 -17 -46 -76 -63 -51 -39 -26 -16 -6 4 14 12 10 8 6 36 66 92 118 96 14 -38 -31 3 37 60 23 -43 -109 -150 -191 -172 -154 -135
4285 -135 -116 -130 -144 -89 -34 27 89 102 115 77 38 0 -37 -90 -143 -146 -150 -155 -161 -170 -120 -6 106 204 242 220 140 43 -53 -118 -123 -74 -24 8 41 74 107
4269 107 121 134 78 23 -32 -88 -74 -61 -50 -40 -29 -18 -19 -19 -19 -20 -40 -60 -51 -41 -27 -14 -65 -116 -140 -104 -36 31 76 61 30 0 22 44 95 146 130
4253 130 114 68 22 -5 -34 -32 -31 -8 13 -12 -39 -74 -110 -143 -177 -167 -127 -104 -81 -65 -48 -2 43 76 109 110 81 41 1 -38 -78 -71 -35 -17 0 -9 -49
4237 -49 -72 -95 -93 -90 -59 -27 22 73 74 75 82 88 95 101 78 55 2 -49 -82 -115 -116 -87 -47 -8 11 -17 -71 -124 -148 -142 -137 -133 -126 -119 -78 -36 3 43 34 -3 -22 -42 -47
$$ packed form
4349H7O0O0K2k7m4j5J8M7K0j0l6l7J2J1L2L2KLk7k7KKj6j6j6j6L5L6L5L5k4k4k5k4J1J1l8
4333A51l8q4q2n4n4J1J1J1J1K4K3K4K3j0j0L6L6Pm0m3m3J5J5M4M4K6K6K6K6m0m0m0l9MLMM
4317a2j5j4J5J4K1K2k5k3jM7P0O9M7M6J7J6RRQRk7k7k7k7p7p6n5nK0K0K4K3K2K1K2K1l5l5
4301A11l5l5k9k9k9l0J3J2J2J3J0J0J0J0kkkkL0L0K6K6k2q2n2PL4L4K3l7o6o6m1m1J9J8J9
4285a35J9j4j4N5N5O1O2J3J3l8l9l8l7n3n3lmnorN0J14J12R8L8k2q0r7r6o5nM9N0L2L3L3L3
4269A07J4J3n6n5n5n6J4J3J1J0J1J1j%%jk0k0RJ0J4J3n1n1k4L6O8O7M5j5l1l0K2K2N1N1j6
4253A30j6m6m6k7k9KJK3K1k5k7l5l6l3l4J0M0K3K3J6J7M6M5L3L3Jk9m0m0l9m0PL6J8J7rm0
4237d9k3k3KLL1L2M9N1JJPOPOk3k3n3n1l3l3jK9M0L9J9k8n4n3k4ONMPPM1M2L9M0rl7j9k0n
$$ plain form
4218 -47 -24 -15 -6 20 76 131 156 147 108 68 57 26 -4 -33 -61 -81 -101 -137 -143 -117 -92 -82 -43 19 53 74 95 127 130 83 35 15 24 46 67 127 187 234
4202 234 251 227 203 177 152 154 157 176 166 128 91 52 12 13 14 1 -40 -74 -109 -112 -87 -56 -25 6 39 3 -32 -67 -103 -94 -85 -76 -66 -41 -15 -19 -22 8 39 70
4184 70 101 44 -12 -69 -126 -108 -89 -71 -52 -44 -36 -28 -20 -20 -20 8 38 41 45 49 52 94 136 148 160 151 141 201 260 342 424 430 378 304 230 221 212 181 150 119 88 87 85
4166 85 113 142 156 170 184 198 194 191 188 185 225 265 275 285 277 269 231 194 165 136 107 78 32 -13 -55 -97 -97 -36 19 75 77 78 80 82 86 90 94 98 69 39 39 39 5 -28
4146 -28 -63 -97 -88 -78 -39 0 24 49 25 0 -18 -37 8 53 98 83 52 22 29 35 42 49 88 127 133 110 79 49 16 -15 -20 -24 -29 -34 -10 13 36 58 55 22 -41
4129 -41 -105 -108 -81 -71 -61 -56 -50 -44 -38 -20 -2 15 33 38 44 49 55 39 22 7 -6 12 62 94 127 136 145 155 164 174 183 204 255 309 334 306 248 194 140 84 28 5
4110 5 -17 -38 -59 -64 -40 -4 30 13 -33 -78 -93 -67 -11 46 75 65 55 44 32 26 19 12 5 16 26 37 47 46 44 42 40 48 55 35 15 7 28 50 42 12 -17 -19 -22
4092 -22 -23 -25 -26 -27 -21 -14 -34 -54 -62 -20 37 66 47 0 -49 -69 -57 -45 -32 -18 -6 5 -11 -58 -68 -29 -3 -6 0 5 9 13 24 35 44 52 18 -64 -134 -174 -177 -150 -139
$$ packed form
4218d7K3RRK6N6N5K5rl9m0j1l1l0k9k8k0k0l6oK6K5J0L9O2L4K1K1L2Lm7m8k0RK2K1O0O0M7
4202B34J7k4k4k6k5KLJ9j0l8l7l9m0JJj3m1l4l5lK5L1L1L1L3l6l5l5l6RRRJ0K5K6mlL0L1L1
4184G0L1n7n6n7n7J8J9J8J9QQQQ%%K8L0LMMLM2M2J2J2rj0O0N9Q2Q2On2p4p4rrl1l1l1l1jk
4166H5K8K9J4J4J4J4mlllM0M0J0J0qql8l7k9k9k9k9m6m5m2m2%O1N5N6KJKKMMMMk9l0%%l4l3
4146b8l5l4RJ0L9L9K4K5k4k5j8j9M5M5M5j5l1l0POPPL9L9Ok3l1l0l3l1nmnnK4K3K3K2ll3o3
4129d1o4lK7J0J0NOOOJ8J8J7J8NONOj6j7j5j3J8N0L2L3RRJ0RJ0RK1N1N4K5k8n8n4n4n6n6k3
4110Ek2k1k1nK4L6L4j7m6m5j5K6N6N7K9j0j0j1j2opppJ1J0J1J0jkkkQPk0k0qK1K2ql0k9kl
4092b2jkjjOPk0k0qM2N7K9j9m7m9k0J2J2J3J4J2J1j6m7j0L9K6lONMMJ1J1RQl4q2p0m0lK7J1
$$ plain form
4073 -139 -127 -117 -107 -97 -87 -39 7 -4 -15 -16 -16 -17 -18 -39 -60 -81 -102 -101 -100 -99 -98 -61 -24 12 50 51 53 54 56 94 133 140 98 46 -6 -61 -117 -94 -70 -47 -24
4055 -24 -19 -15 -10 -5 -19 -33 8 50 39 -19 -51 -83 -68 -53 -38 -22 -15 -7 0 8 36 64 93 121 108 94 81 68 115 162 209 256 282 308 294 251 228 255 325
4039 325 367 340 283 241 200 115 30 4 -21 2 25 49 72 148 223 240 257 255 253 251 249 229 209 189 169 116 62 40 67 84 101 63 24 35 45 56 66
4022 66 65 64 62 61 90 120 145 171 229 227 165 102 54 65 78 32 8 14 0 -15 -20 -25 -31 -36 -34 -33 -31 -29 -20 -11 -2 6 29 51 74 97 108 118 162 147 83 19 11 3 -17
4003 -17 -38 -59 -79 -58 -37 42 122 202 283 299 257 206 184 201 218 177 135 94 53 -2 -57 -15 27 47 66 86 105 145 184 224 264 247 230 213 196
3988 196 207 219 231 242 197 152 107 62 33 4 -25 -54 -71 -88 -105 -122 -84 -46 -9 28 24 20 16 12 -9 -31 -53 -74 -54 -34 -14 5 -22 -51 -79 -108 -103
3972 -103 -98 -152 -206 -200 -195 -189 -183 -184 -186 -187 -189 -206 -223 -201 -149 -117 -134 -167 -171 -145 -119 -150 -181 -169 -156 -144 -131 -103 -75 -47 -19 -52 -85 -119 -152 -147 -141 -136 -130 -125 -119 -114 -108 -86
3953 -86 -63 -41 -18 -8 1 10 18 22 -2 -38 -25 14 55 39 24 25 26 57 88 109 130 72 -15 -80 -97 -84 -71 -88 -106 -96 -86 -80 -104 -138 -124 -62 0 5 11 -8
$$ packed form
4073a39J2J0J0J0J0M8M6j1j1j%jjk1k1k1k1JJJJL7L7L6L8JKJKL8L9Pm2n2n2n5n6K3K4K3K3
4055b4NMNNj4j4M1M2j1n8l2l2J5J5J5J6PQPQK8K8K9K8j3j4j3j3M7M7M7M7K6K6j4m3k3K7P0
4039C25M2k7n7m2m1q5q5k6k5K3K3K4K3P6P5J7J7kkkkk0k0k0k0n3n4k2K7J7J7l8l9J1J0J1J0
4022F6jjkjK9L0K5K6N8ko2o3m8J1J3m6k4Oj4j5nnonKJKKRRRQK3K2K3K3J1J0M4j5o4o4qqk0
4003a7k1k1k0K1K1P9Q0Q0Q1J6m2n1k2J7J7m1m2m1m1n5n5M2M2K0J9K0J9M0L9M0M0j7j7j7j7
3988A96J1J2J2J1m5m5m5m5k9k9k9k9j7j7j7j7L8L8L7L7mmmmk1k2k2k1K0K0K0J9k7k9k8k9N
3972a03Nn4n4ONOOjkjkj7j7K2N2L2j7l3mK6K6l1l1J2J3J2J3K8K8K8K8l3l3l4l3NONONONOK2
3953h6K3K2K3J0RRQMk4l6J3L9M1j6j5JJL1L1K1K1n8q7o5j7J3J3j7j8J0J0Ok4l4J4O2O2NOj9
$$ plain form
3935 -8 -29 -49 -70 -42 -14 12 40 47 54 62 69 54 39 24 9 -12 -34 -55 -77 -48 -19 35 91 106 72 6 -59 -87 -115 -113 -112 -117 -122 -127 -132 -93 -54 -16 22 5 -12
3918 -12 -29 -47 -58 -69 -81 -92 -127 -162 -128 -45 26 68 71 74 51 28 5 -17 -32 -47 -61 -76 -70 -65 -59 -54 -33 -11 -49 -86 -111 -137 -162 -187 -229 -270 -252 -234
3901 -234 -275 -315 -324 -284 -242 -201 -186 -171 -142 -113 -84 -55 -65 -75 -85 -95 -64 -32 -1 29 38 47 56 65 24 -17 -59 -100 -81 -61 -41 -21 -26 -31 -36 -41 -38 -36 -33 -31 2
3883 2 36 70 103 86 68 50 32 76 119 163 207 179 151 124 96 82 68 54 39 87 134 182 229 186 144 101 59 73 87 101 115 92 69 46 23 50
3868 50 77 105 132 79 25 2 27 47 37 18 -1 -9 -17 -25 -33 -36 -39 -41 -44 -41 -38 -35 -33 7 48 89 130 205 279 312 314 294 274 254 234 206 208 253 297 310 323 336
3850 336 349 309 269 230 190 157 124 92 59 74 89 104 119 101 84 67 50 33 17 0 -16 -21 -25 -30 -34 -23 -12 0 10 40 70 97 125 133 110 48 -14
3833 -14 -49 -54 -18 16 28 9 -8 2 57 112 126 111 87 63 20 7 35 64 92 120 109 69 28 17 30 42 57 71 91 111 132 152 129 106 83 60
3818 60 34 7 37 66 76 37 -30 -99 -102 -76 -67 -58 -51 -43 -36 -28 -15 -2 9 20 26 2 -4 -11 -2 5 -2 18 31 43 57 71 47 24 1 -21 -23 -24 -25 -26 23 73 123 174
$$ packed form
3935hk1k0k1K8K8K6K8PPQPj5j5j5j5k1k2k1k2K9K9N4N6J5l4o6o5k8k8KJnnnnL9L9L8L8j7j7
3918a2j7j8j1j1j2j1l5l5L4Q3P1M2LLk3k3k3k2j5j5j4j5ONONK1K2l8l7k5k6k5k5m2m1J8J8
3901b34m1m0rM0M2M1J5J5K9K9K9K9j0j0j0j0L1L2L1L0RRRRm1m1m2m1J9K0K0K0nnnnLKLKL3
3883BL4L4L3j7j8j8j8M4M3M4M4k8k8k7k8j4j4j4j5M8M7M8M7m3m2m3m2J4J4J4J4k3k3k3k3K7
3868E0K7K8K7n3n4k3K5K0j0j9j9qqqqllklLLLKM0M1M1M1P5P4L3Kk0k0k0k0k8KM5M4J3J3J3
3850C36J3m0m0l9m0l3l3l2l3J5J5J5J5j8j7j7j7j7j6j7j6nmnmJ1J1J2J0L0L0K7K8Qk3o2o2
3833a4l5nL6L4J2j9j7J0N5N5J4j5k4k4m3j3K8K9K8K8j1m0m1j1J3J2J5J4K0K0K1K0k3k3k3k3
3818F0k6k7L0K9J0l9o7o9lK6RRPQPQJ3J3J1J1Ok4opRPpK0J3J2J4J4k4k3k3k2kjjjM9N0N0N1
$$ plain form
3799 174 193 212 254 355 416 419 321 223 175 128 80 32 25 18 10 3 -36 -75 -114 -154 -154 -154 -154 -154 -142 -129 -117 -105 -60 -15 9 63 135 148 137 126 139 152 164
3782 164 177 219 261 245 228 212 197 182 167 141 114 88 62 94 127 159 191 174 157 85 13 -65 -84 -36 71 168 207 184 160 119 78 36 -4 32
3767 32 70 107 145 222 300 407 573 772 1029 1380 1986 2854 3899 5239 7151 9554 11504 11823 10312 7948 5918 4565
3758 4565 3625 2835 2222 1819 1514 1201 948 816 742 671 660 695 700 663 627 588 550 482 414 405 397 371 346 321 295 325 355 385 416 409 402 395 389 366
3743 366 343 321 298 328 357 328 298 260 222 188 153 168 241 312 325 248 143 92 71 65 58 53 49 77 105 75 44 39 33 86 139 104 69 34 0 9 19 29
3726 29 39 75 111 147 183 163 143 161 209 249 230 165 71 -13 -68 -77 -27 61 150 276 343 322 301 277 252 180 107 100 152 211 270 273 277 258 240 221 203
3710 203 185 167 149 131 142 152 162 173 223 274 266 257 230 204 177 150 161 173 184 196 213 230 227 253 286 260 211 161 140 120 104 87 81 134 187 181 132
3694 132 83 89 96 71 47 6 -4 22 49 78 108 118 129 138 147 145 114 100 85 92 98 104 111 123 135 163 162 128 93 57 21 28 35 24 43 66 59 72 84 68 53
$$ packed form
3799A74J9J9M2J01O1Lr8r8m8m7m8m8ppqpl9l9l9m0%%%%J2J3J2J2M5M5K4N4P2J3j1j1J3J3J2
3782A64J3M2M2j6j7j6j5j5j5k6k7k6k6L2L3L2L2j7j7p2p2p8j9M8J07R7L9k3k4m1m1m2m0L6
3767C2L8L7L8P7P8J07J66J99K57L51O06Q68J045J340J912K403J950L19j511k364k030j353
3758D565r40p90o13m03l05l13k53j32p4p1j1L5Nl7l6l9l8o8o8rqk6k5k5k6L0L0L0L1pppok3
3743C66k3k2k3L0K9k9l0l8l8l4l5J5P3P1J3p7j05n1k1opnmK8K8l0l1noN3N3l5l5l5l4RJ0J0
3726B9J0L6L6L6L6k0k0J8M8M0j9o5r4q4n5rN0Q8Q9J26O7k1k1k4k5p2p3pN2N9N9LMj9j8j9j8
3710B03j8j8j8j8J1J0J0J1N0N1qrk7k6k7k7J1J2J1J2J7J7lK6L3k6m9n0k1k0j6j7oN3N3om9
3694A32m9OPk5k4m1j0K6K7K9L0J0J1RRkl1j4j5POOPJ2J2K8jl4l5l6l6PPj1J9K3pJ3J2j6j5
$$ plain form
3677 53 37 22 23 24 -16 -87 -172 -256 -300 -314 -309 -304 -314 -295 -231 -168 -103 -38 -9 19 48 78 75 72 69 66 51 35 3 1 54 108 160 212 235 209 151 93 38 -15
3659 -15 -68 -121 -93 -35 6 47 59 70 81 93 87 81 75 70 68 66 64 62 49 36 24 11 -13 -38 -61 -84 -67 -21 23 38 14 -38 -94 -120 -98 -76 -51 -27 -7
3642 -7 12 31 49 52 26 0 2 27 52 20 -11 -49 -87 -141 -166 -140 -114 -103 -62 -20 20 34 48 73 97 63 29 -9 -49 -116 -183 -250 -287 -262 -207 -158 -158
3626 -158 -185 -213 -189 -135 -100 -64 -66 -97 -111 -126 -101 -77 -63 -80 -93 -77 -20 35 52 68 84 100 131 162 208 225 206 158 108 88 74 60 -8 -78 -130
3611 -130 -152 -149 -116 -104 -91 -79 -66 -52 -68 -67 -66 -67 -67 -97 -127 -152 -177 -159 -111 -74 -36 -28 -20 -21 -52 -93 -135 -161 -156 -128 -71 -24 -7 -31 -54 -22 10 2 -35 -60
3594 -60 -55 -70 -84 -89 -93 -97 -100 -96 -63 10 84 117 121 139 157 159 130 130 158 191 194 157 120 97 75 52 30 -26 -83 -98 -82 -65 -49 -30 -11 -8 -5 -2 1 -22 -46 -70
3576 -70 -94 -67 -40 -14 12 57 101 145 189 173 158 142 127 128 130 132 134 97 61 27 -6 -10 14 23 31 28 25 22 19 41 64 30 -4 -12 8 13 18 25 31 38 45 59 74 87
3556 87 99 109 88 68 77 88 98 126 124 91 28 -34 -68 -66 -34 -18 -1 0 1 2 3 5 6 8 9 -10 -31 -39 -17 40 97 114 102 50 0 -22 5 46 88 73 59
$$ packed form
3677E3j6j5JJm0p1q5q4m4j4NNj0J9O4O3O5O5K9K8K9L0llllj5j6l2kN3N4N2N2K3k6n8n8n5n3
3659a5n3n3K8N8M1M1J2J1J1J2ooonkkkkj3j3j2j3k4k5k3k3J7M6M4J5k4n2n6k6K2K2K5K4K0
3642gJ9J9J8Lk6k6KK5K5l2l1l8l8n4k5K6K6J1M1M2M0J4J4K5K4l4l4l8m0o7o7o7l7K5N5M9%
3626a58k7k8K4N4L5L6kl1j4j5K5K4J4j7j3J6N7N5J7J6J6J6L1L1M6J7j9m8n0k0j4j4o8p0n2
3611a30k2LL3J2J3J2J3J4j6JJj%l0l0k5k5J8M8L7L8QQjl1m1m2k6NK8N7M7J7k4k3L2L2ql7k5
3594f0Nj5j4nmmlML3P3P4L3MJ8J8Kk9%K8L3Ll7l7k3k2k3k2n6n7j5J6J7J6J9J9LLLLk3k4k4
3576g0k4K7K7K6K6M5M4M4M4j6j5j6j5JKKKl7l6l4l3mK4RQllllK2K3l4l4qK0NNPOPPJ4J5J3
3556H7J2J0k1k0RJ1J0K8kl3o3o2l4KL2J6J7JJJJKJKJj9k1qK2N7N7J7j2n2n0k2K7M1M2j5j4
$$ plain form
3539 59 53 46 56 37 25 13 0 -14 -9 -4 -17 -1 11 -5 -4 -2 -6 -10 -16 -22 -5 -18 -72 -125 -139 -123 -107 -121 -106 -91 -78 -65 -87 -109 -101 -93 -111 -129 -122 -57 57
3521 57 143 146 91 34 7 -10 -28 -30 -32 -35 -37 -18 0 48 96 124 152 121 90 59 28 -2 -32 -60 -88 -86 -84 -57 -29 -61 -92 -137 -182 -168 -154 -171 -187 -174 -162
3504 -162 -122 -82 -42 -2 -30 -57 -110 -163 -221 -221 -176 -101 -45 -49 -64 -49 -10 29 70 111 86 60 35 10 12 14 15 17 -1 -21 -41 -61 -98 -136 -115 -93 -74 -55
3488 -55 -65 -75 -87 -99 -111 -123 -92 -61 -30 0 9 18 27 36 18 0 -18 -36 -29 -21 -14 -6 -65 -124 -125 -125 -106 -88 -68 -48 -28 21 87 95 33 -28 -63 -99 -128 -157 -156
3470 -156 -106 -43 -11 11 34 51 68 26 -16 -5 5 -13 -81 -162 -214 -188 -93 10 85 138 161 138 114 59 4 -41 -87 -102 -68 1 71 75 29 -13 -27
3455 -27 -2 23 -19 -62 -75 -88 -71 -54 -66 -78 -92 -105 -119 -133 -118 -102 -57 -12 20 52 26 0 4 9 14 19 -9 -38 -35 16 78 141 137 85 28 0 -17 -35
3438 -35 -22 -9 3 16 13 10 7 4 38 71 102 133 124 65 34 4 -5 -14 35 84 100 116 72 29 26 23 20 17 1 -13 29 72 107 143 175 207 208 159 92 55 49 44
3420 44 1 -71 -106 -92 -48 -4 5 15 82 150 197 214 206 168 131 93 53 14 20 26 33 39 44 48 53 57 50 43 23 -25 -80 -135 -148 -131 -98 -36 8 54 55 26 15 3
$$ packed form
3539E9opJ0j9j2j2j3j4NNj3J6J2j6JKmmooJ7j3n4n3j4J6J6j4J5J5J3J3k2k2QQj8j8PO5J14
3521E7Q6Ln5n7k7j7j8kklkJ9J8M8M8K8K8l1l1l1l1l0l0k8k8KKK7K8l2l1m5m5J4J4j7j6J3J2
3504a62M0M0M0M0k8k7n3n3n8%M5P5N6mj5J5L9L9M1M1k5k6k5k5KKJKj8k0k0k0l7l8K1K2J9J9
3488e5j0j0j2j2j2j2L1L1L1L0RRRRj8j8j8j8PQPQn9n9j%J9J8K0K0K0M9O6Qo2o1l5l6k9k9J
3470a56N0O3L2K2K3J7J7m2m2J1J0j8o8q1n2K6R5J03P5N3K3k3k4n5n5m5m6j5L4O9P0Mm6m2j4
3455b7K5K5m2m3j3j3J7J7j2j2j4j3j4j4J5J6M5M5L2L2k6k6MNNNk8k9LN1O2O3mn2n7k8j7j8
3438c5J3J3J2J3llllL4L3L1L1rn9l1l0rrM9M9J6J6m4m3llllj6j4M2M3L5L6L2L2Jm9o7l7on
3420D4m3p2l5J4M4M4RJ0O7O8M7J7ql8l7l8m0l9OOPONMNMppk0m8n5n5j3J7L3O2M4M6Jk9j1j2
$$ plain form
3402 3 -33 -71 -108 -145 -151 -156 -163 -170 -152 -164 -175 -157 -99 -42 14 72 113 124 95 66 42 47 93 139 166 163 117 72 44 17 -8 -34 -55 -46 -38 -59 -107 -155 -164 -144
3384 -144 -145 -176 -216 -256 -274 -263 -238 -214 -203 -193 -182 -172 -126 -81 -37 5 67 99 105 81 61 41 19 -3 -14 -25 -23 8 83 158 204 200 149 98 43 -10 -32
3368 -32 -53 -74 -95 -103 -111 -119 -126 -134 -142 -148 -154 -167 -150 -150 -151 -140 -129 -118 -107 -81 -55 -2 51 118 156 130 75 41 36 43 50 28 6 -14 -36 -33 -30 -26 -23 -12 0 -28 -86 -137
3349 -137 -140 -112 -85 -59 -33 -8 17 1 -14 -30 -46 -59 -71 -83 -96 -119 -143 -107 -72 -56 -40 -26 -12 19 22 -15 -54 -69 -56 -59 -62 -70 -78 -87 -95 -66 -37 -11 15
3332 15 43 40 53 66 53 11 -12 -35 -28 9 57 105 111 88 23 -40 -82 -95 -66 -36 -20 -3 12 29 59 89 136 153 131 108 100 62 7 -48 -74 -100 -103 -77
3316 -77 -10 56 86 88 76 65 63 62 91 119 175 232 245 230 219 208 196 183 152 122 91 60 32 3 -22 -48 -41 14 88 133 143 154 163 172 172 172 172 172 123 73
3299 73 93 112 157 201 196 191 142 93 44 -4 6 17 27 38 78 118 128 138 98 58 18 -22 -29 -36 -13 8 31 53 76 98 91 83 76 68 116 164 212 259 241
3282 241 222 204 185 180 174 168 162 113 65 65 65 52 38 54 70 116 161 138 115 87 59 80 131 175 169 124 79 79 80 126 173 218 214 149 85 58 32 5 -20 -46
$$ packed form
3402Cl6l8l7l7onppJ8j2j1J8N8N7N6N8M1J1k9k9k4NM6M6K7lm6m5k8k7k5k6k1RQk1m8m8rK0
3384a44jl1m0m0j8J1K5K4J1J0J1J0M6M5M4M2O2L2Ok4k0k0k2k2j1j1KL1P5P5M6mn1n1n5n3k2
3368c2k1k1k1qqqpqqooj3J7%jJ1J1J1J1K6K6N3N3O7L8k6n5l4nPPk2k2k0k2LLMLJ1J2k8n8n1
3349a37lK8K7K6K6K5K5j6j5j6j6j3j2j2j3k3k4L6L5J6J6J4J4L1Ll7l9j5J3llqqrqK9K9K6K6
3332A5K8lJ3J3j3m2k3k3PL7M8M8Ok3o5o3m2j3K9L0J6J7J5J7L0L0M7J7k2k3ql8n5n5k6k6lK6
3316g7O7O6L0Kj2j1kjK9K8N6N7J3j5j1j1j2j3l1l0l1l1k8k9k5k6PN5P4M5J0J1RR%%%%m9n0
3299G3K0J9M5M4nnm9m9m9m8J0J1J0J1M0M0J0J0m0m0m0m0ppK3K1K3K2K3K2pqpqM8M8M8M7j8
3282B41j9j8j9nooom9m8%%j3j4J6J6M6M5k3k3k8k8K1N1M4om5m5%JM6M7M5mo5o4k7k6k7k5k6
$$ plain form
3264 -46 -73 -69 -66 -71 -76 -81 -85 -93 -100 -77 -55 -38 -21 -4 12 9 6 2 0 -14 -28 -43 -57 -6 44 65 87 84 82 110 137 168 200 201 203 180 158 149 169 197 225 268 282 252
3245 252 173 76 9 -6 27 51 46 -11 -69 -107 -96 -53 -10 -4 -46 -78 -79 -82 -115 -160 -175 -156 -108 -59 -10 37 85 92 50 -8 -37 -4 58 106 155 176 198
3229 198 180 113 48 11 24 37 26 14 2 -8 -62 -116 -118 -90 -47 -3 38 81 73 16 -29 -46 -53 -61 -53 -17 22 62 54 46 21 -3 -16 -1 22 16 11 37 105
3212 105 174 211 219 177 135 104 103 104 105 106 107 118 99 48 -2 -46 -90 -101 -83 -46 -10 28 66 63 60 57 53 16 -19 -27 -34 -34 -34 -50 -37 -11 14 41 67 75 53 33
3194 33 43 77 141 218 246 208 171 101 30 -43 -117 -122 -127 -95 -63 -31 1 16 31 -2 -36 -40 -44 -2 40 56 23 -11 -46 -52 -58 -15 27 74 122 140 158 169
3178 169 179 190 201 185 169 153 137 98 60 22 -15 -25 -34 -43 -52 -34 -17 0 18 -7 -32 -58 -83 -72 -60 0 60 61 63 38 13 17 70 145 219 253 287 291
3161 291 295 277 258 240 221 139 56 15 23 39 54 23 -7 -55 -103 -112 -72 -31 -20 -18 -16 -33 -50 -66 -83 -75 -66 -28 9 78 147 195 193 173 152 128 105 55 5
3144 5 -45 -95 -67 -40 51 143 193 175 126 77 84 91 98 106 79 52 25 -1 23 48 73 98 86 75 63 51 63 76 88 100 131 162 144 125 98 70 72 74 85
$$ packed form
3264d6k7MLnnnmqpK3K2J7J7J7J6llmkj4j4j5j4N1N0K1K2lkK8K7L1L2JKk3k2rK0K8K8M3J4l0
3245B52p9r7o7j5L3K4nn7n8l8J1M3M3Om2l2jll3m5j5J9M8M9M9M7M8Pm2n8k9L3O2M8M9K1K2
3229A98j8o7o5l7J3J3j1j2j2j0n4n4kK8M3M4M1M3qn7m5j7pqQL6L9M0qqk5k4j3J5K3onK6O8
3212A05O9L7Qm2m2l1jJJJJJ1j9n1n0m4m4j1J8L7L6L8L8lllml7l5qp%%j6J3K6K5K7K6Qk2k0
3194C3J0L4O4P7K8l8l7p0p1p3p4nnL2L2L2L2J5J5l3l4mmM2M2J6l3l4l5ooM3M2M7M8J8J8J1
3178A69J0J1J1j6j6j6j6l9l8l8l7j0rrrJ8J7J7J8k5k5k6k5J1J2O0O0JKk5k5MN3P5P4L4L4M
3161B91Mj8j9j8j9q2q3m1QJ6J5l1l0m8m8rM0M1J1KKj7j7j6j7QRL8L7O9O9M8kk0k1k4k3n0n0
3144En0n0K8K7R1R2N0j8m9m9PPPQk7k7k7k6K4K5K5K5j2j1j2j2J2J3J2J2L1L1j8j9k7k8KKJ1
$$ plain form
3127 85 96 58 20 -10 -42 -73 -104 -130 -155 -111 -68 -34 0 3 7 15 23 30 38 48 58 67 77 130 182 235 287 268 250 231 212 177 142 106 71 53 35 17 0
3110 0 13 28 43 57 71 84 52 20 -24 -10 19 49 55 61 133 205 242 220 162 105 45 -14 -74 -134 -153 -172 -191 -210 -221 -233 -244 -255 -215 -175 -135 -94 -71
3094 -71 -48 -25 -2 9 21 33 45 49 54 58 63 71 80 121 103 35 -33 -105 -177 -148 -118 -58 0 28 57 36 16 10 4 -1 -7 2 12 22 32 18 3 -56 -117 -165 -164
3077 -164 -161 -158 -159 -159 -129 -100 -85 -71 -56 -42 -22 -2 16 36 28 21 14 6 -16 -39 -62 -85 -86 -87 -88 -88 -54 -20 13 48 75 102 129 156 170 185 199 214 223 232 241 251
3058 251 270 290 221 152 74 -3 -77 -152 -177 -153 -107 -61 -43 -25 -7 10 40 70 50 31 39 47 56 64 62 60 58 56 50 44 84 125 152 129 85 42 25 9 -6 -22
3041 -22 -5 12 29 47 104 162 233 275 264 203 169 135 146 157 168 179 141 104 96 88 105 123 71 20 -34 -89 -94 -99 -119 -139 -159 -179 -166 -152 -139 -125 -104
3025 -104 -83 -62 -41 -53 -64 -75 -86 -90 -94 -98 -102 -113 -123 -134 -144 -129 -113 -49 15 17 19 -28 -75 -102 -129 -107 -85 -48 -11 24 61 49 36 -24 -116 -184 -203 -161
3009 -161 -90 -19 22 33 44 57 69 52 35 21 6 41 75 100 125 61 -1 -27 -52 -48 -44 -53 -62 -41 -20 -22 -23 -25 -26 -2 21 45 69 105 141 179 218 250 312
$$ packed form
3127H5J1l8l8l0l2l1l1k6k5M4M3L4L4LMQQPQJ0J0RJ0N3N2N3N2j9j8j9j9l5l5l6l5j8j8j8j7
3110@J3J5J5J4J4J3l2l2m4J4K9L0OOP2P2L7k2n8n7o0n9o0o0j9j9j9j9j1j2j1j1M0M0M0M1K3
3094g1K3K3K3J1J2J2J2MNMNQRM1j8o8o8p2p2K9L0O0N8K8K9k1k0oonoRJ0J0J0j4j5n9o1m8J
3077a64LLj%L0K9J5J4J5J4K0K0J8K0qppqk2k3k3k3jjj%L4L4L3L5K7K7K7K7J4J5J4J5RRRJ0
3058B51J9K0o9o9p8p7p4p5k5K4M6M6J8J8J8J7L0L0k0j9QQRQkkkkooM0M1K7k3m4m3j7j6j5j6
3041b2J7J7J7J8N7N8P1M2j1o1l4l4J1J1J1J1l8l7qqJ7J8n2n1n4n5nnk0k0k0k0J3J4J3J4K1
3025a04K1K1K1j2j1j1j1mmmmj1j0j1j0J5J6O4O4KKm7m7k7k7K2K2L7L7L5L7j2j3o0r2o8j9M2
3009a61P1P1M1J1J1J3J2j7j7j4j5L5L4K5K5o4o2k6k5MMrrK1K1kjkjK4K3K4K4L6L6L8L9L2O2
$$ plain form
2992 312 397 412 339 265 218 170 72 -24 -72 -120 -156 -192 -229 -216 -166 -146 -175 -234 -292 -300 -249 -198 -161 -123 -86 -48 -49 -49 -50 -50 -67 -84 -52 -20 1 22 44
2976 44 66 24 -16 -58 -99 -114 -129 -143 -158 -123 -89 -54 -20 21 62 104 146 146 145 145 145 102 60 20 -20 -14 21 38 55 64 44 41 37 49 61 33 -24 -70 -86
2959 -86 -64 -41 -46 -80 -113 -118 -90 -62 -35 -7 -17 -57 -81 -104 -122 -140 -158 -176 -178 -180 -183 -185 -160 -136 -113 -90 -97 -133 -153 -173 -205 -237 -284 -302 -245 -158 -71 -14 -3
2942 -3 -22 -26 -29 -16 -4 8 21 20 19 34 20 -19 -59 -99 -139 -148 -127 -64 -1 32 65 116 136 79 22 6 19 49 80 108 135 102 0 -89 -130 -146 -133 -77
2925 -77 -21 13 0 -83 -167 -223 -250 -251 -223 -192 -161 -129 -96 -69 -43 -33 6 70 135 168 151 96 11 -28 -18 -18 -17 -13 -10 14 39 5 -29 -75 -122 -109 -97 -72
2909 -72 -48 -23 0 32 64 96 128 120 112 159 207 190 123 68 42 48 55 63 72 63 54 45 36 53 70 87 104 68 32 -2 -38 -70 -102 -74 -47 -9 29 123 217 287
2891 287 308 297 286 252 219 185 152 101 51 1 -48 -71 -95 -118 -141 -116 -92 -67 -43 -26 -9 7 25 27 30 32 35 -3 -43 -82 -121 -150 -179 -207 -236 -228 -220 -212
2875 -212 -204 -166 -127 -89 -51 -84 -117 -150 -184 -163 -143 -123 -103 -112 -120 -128 -136 -157 -179 -141 -103 -57 -12 29 71 110 100 19 -60 -67 -73 -80 -86 -90 -93 -97 -100 -47 5 58 111
$$ packed form
2992C12Q5J5p3p4m7m8r8r6m8m8l6l6l7J3N0K0k9n9n8qN1N1L7L8L7L8j%j%j7j7L2L2K1K1K2
2976D4K2m2m0m2m1j5j5j4j5L5L4L5L4M1M1M2M2%j%%m3m2m0m0OL5J7J7Rk0lmJ2J2k8n7m6j6
2959h6K2K3nl4l3nK8K8K7K8j0m0k4k3j8j8j8j8kklkK5K4K3K3pl6k0k0l2l2m7j8N7Q7Q7N7J1
2942cj9mlJ3J2J2J3jjJ5j4l9m0m0m0rK1O3O3L3L3N1K0n7n7j6J3L0L1K8K7l3j02q9m1j6J3N6
2925g7N6L4j3q3q4n6k7jK8L1L1L2L3K7K6J0L9O4O5L3j7n5q5l9J0%JMLK4K5l4l4m6m7J3J2K5
2909g2K4K5K3L2L2L2L2qqM7M8j7o7n5k6OPQRrrrrJ7J7J7J7l6l6l4l6l2l2K8K7L8L8R4R4P0
2891B87K1j1j1l4l3l4l3n1n0n0m9k3k4k3k3K5K4K5K4J7J7J6J8KLKLl8m0l9l9k9k9k8k9QQQ
2875b12QL8L9L8L8l3l3l3l4K1K0K0K0rqqqk1k2L8L8M6M5M1M2L9j0q1p9popomlmlN3N2N3N3
$$ plain form
2857 111 99 87 75 63 63 64 64 65 34 4 -23 -52 -23 33 102 122 75 28 -21 -71 -102 -133 -134 -135 -180 -224 -237 -201 -155 -110 -91 -72 -40 -9 22 54 71 89
2841 89 106 123 91 59 26 -5 -26 -47 -12 23 27 -17 -64 -111 -92 -73 -54 -36 -30 -24 7 39 66 43 -10 -64 -71 -79 -57 -35 -45 -56 -66 -77 -114 -151 -188 -225
2824 -225 -207 -189 -172 -154 -169 -184 -229 -273 -280 -286 -234 -181 -152 -122 -122 -122 -69 -15 38 91 105 119 75 30 -5 -42 -19 3 47 92 77 63 24 -14 -54 -93 -60
2808 -60 -26 6 39 42 45 48 51 32 14 23 32 39 16 -28 -102 -155 -160 -134 -109 -105 -101 -97 -93 -85 -78 -71 -64 -56 -49 -42 -35 0 35 68 101 89 48 24 0 -36 -73 -91 -139 -174 -180 -204
2788 -204 -229 -225 -221 -217 -213 -227 -242 -254 -267 -257 -217 -136 -56 -5 15 23 31 27 23 19 15 10 4 -1 -7 -2 1 6 10 -1 -14 -27 -40 -52 -65 -78 -91 -83 -76 -96 -116 -147 -149 -109 -68
2769 -68 -34 0 51 72 61 49 63 78 112 117 99 52 19 36 119 203 235 237 256 275 260 244 229 214 216 218 218 218 196 145 112 79 68 86 104 93 72 51
2752 51 28 6 -30 -67 -61 -26 -22 -17 -10 -4 37 80 119 158 133 59 -3 -37 -43 -49 -54 -58 -73 -89 -104 -119 -67 -16 34 86 97 107 118 129 98 67 36 5 3 0 -1
2735 -1 -3 -32 -61 -90 -119 -120 -121 -121 -122 -150 -178 -206 -234 -222 -210 -198 -186 -206 -226 -197 -168 -137 -107 -145 -184 -198 -212 -227 -241 -249 -256 -195 -133 -123 -112 -148 -184 -205 -176
$$ packed form
2857A11j2j2j2j2%J%Jl1l0k7k9K9N6O9K0m7m7m9n0l1l1jjm5m4j3L6M6M5J9J9L2L1L1L2J7J8
2841H9J7J7l2l2l3l1k1k1L5L5Mm4m7m7J9J9J9J8OOL1L2K7k3n3n4pqK2K2j0j1j0j1l7l7l7l7
2824b25J8J8J7J8j5j5m5m4poN2N3K9L0%%N3N4N3N3J4J4m4m5l5l7K3K2M4M5j5j4l9l8m0l9L3
2808f0L4L2L3LLLLj9j8RRPk3m4p4n3nK6K5MMMMQPPPQPPPL5L5L3L3j2m1k4k4l6l7j8m8l5ok4
2788b04k5MMMMj4j5j2j3J0M0Q1Q0N1K0QQmmmmnonoNLNMj1j3j3j3j2j3j3j3QPk0k0l1kM0M1
2769f8L4L4N1K1j1j2J4J5L4Nj8m7l3J7Q3Q4L2KJ9J9j5j6j5j5KK%%k2n1l3l3j1J8J8j1k1k1
2752E1k3k2l6l7OL5MNPOM1M3L9L9k5p4o2l4oonmj5j6j5j5N2N1N0N2J1J0J1J1l1l1l1l1klj
2735akk9k9k9k9jj%jk8k8k8k8J2J2J2J2k0k0K9K9L1L0l8l9j4j4j5j4qpO1O2J0J1l6l6k1K9
$$ plain form
2718 -176 -87 31 117 155 148 112 45 -49 -129 -159 -164 -169 -172 -174 -172 -169 -167 -165 -177 -190 -153 -116 -67 -18 -37 -57 -63 -70 -76 -83 -105 -127 -101 -74 -85 -96 -107 -118 -114 -109 -150 -192
2699 -192 -188 -136 -81 -27 -11 4 19 35 77 118 158 149 98 47 23 30 35 11 -21 -54 -54 -24 -11 0 13 26 65 105 138 122 48 -26 -83 -109 -121 -134 -143 -124
2683 -124 -74 -25 15 6 -23 -53 -72 -90 -79 -68 -40 -12 15 43 27 12 -3 -19 -35 -51 -67 -83 -97 -110 -139 -137 -105 -43 20 55 51 48 43 38 33 28 23 19 -9 -37
2666 -37 -66 -94 -89 -84 -95 -77 -33 10 56 102 114 126 154 154 114 75 33 -7 -14 -21 -9 -27 -75 -92 -78 -34 -15 -25 -45 -64 -44 4 85 165 173 151 142 134 94
2649 94 4 -84 -125 -129 -134 -135 -137 -144 -150 -157 -164 -134 -104 -76 -47 -32 -46 -43 -40 -52 -63 -73 -82 -85 -58 -48 -38 -19 0 19 39 42 45 49 52 25 -2 -59 -115 -182 -248 -264 -251
2630 -251 -218 -215 -241 -267 -266 -236 -222 -208 -193 -177 -162 -146 -144 -143 -108 -44 43 132 170 178 175 172 169 166 174 212 249 258 246 235 232 258 284 261 198 105 35 -4 -10 12 36
2612 36 60 53 17 -10 -37 -37 -37 -38 -40 -70 -101 -116 -131 -117 -103 -88 -74 -107 -140 -156 -142 -97 -52 -5 11 -6 -55 -101 -147 -145 -114 -78 -73 -98 -123 -147 -172 -168 -163 -136
2595 -136 -109 -82 -56 -15 24 81 109 116 123 128 133 124 115 106 97 97 97 98 98 109 121 100 50 3 -43 -62 -81 -72 -64 -85 -105 -135 -166 -146 -127 -127 -127 -128 -128 -90 -51 -63 -74 -68
$$ packed form
2718a76Q9J18Q6L8pl6o7r4q0l0nnlkKLKKj2j3L7L7M9M9j9k0opopk2k2K6K7j1j1j1j1MNm1m2
2699a92MN2N5N4J6J5J5J6M2M1M0rn1n1k4PNk4l2l3%L0J3J1J3J3L9M0L3j6p4p4n7k6j2j3rJ9
2683a24N0M9M0rk9l0j9j8J1J1K8K8K7K8j6j5j5j6j6j6j6j6j4j3k9KL2O2O3L5mlnnnnnmk8k8
2666c7k9k8NNj1J8M4M3M6M6J2J2K8%m0l9m2m0ppJ2j8m8j7J4M4J9j0k0j9K0M8Q1Q0Qk2rqm0
2649I4r0q8m1mnjkpoppL0L0K8K9J5j4LLj2j1j0rlK7J0J0J9J9J9K0LLMLk7k7n7n6o7o6j6J3
2630b51L3Lk6k6JL0J4J4J5J6J5J6KJL5O4Q7Q9L8QllllQL8L7Rj2j1lK6K6k3o3r3p0l9oK2K4
2612C6K4pl6k7k7%%jkl0l1j5j5J4J4J5J4l3l3j6J4M5M5M7J6j7m9m6m6KL1L6Nk5k5k4k5MNK7
2595a36K7K7K6M1L9N7K8PPNNrrrr%%J%J1J2k1n0m7m6j9j9RQk1k0l0l1K0J9%%j%L8L9j2j1O
$$ plain form
2576 -68 -63 -57 -52 -67 -82 -97 -111 -146 -180 -213 -246 -222 -169 -104 -89 -124 -160 -199 -237 -190 -143 -95 -48 -41 -34 -27 -20 -50 -80 -80 -81 -48 -15 -31 -47 -61 -76 -41 -6 -14
2559 -14 -21 -29 -36 -41 -45 -50 -54 -109 -165 -220 -275 -269 -262 -253 -243 -213 -133 -66 -29 -42 -84 -111 -139 -103 -67 -32 3 47 92 137 182 183 185 137 89 56 22 18 14 -48 -110 -152
2540 -152 -144 -102 -59 -14 31 61 92 74 55 82 108 135 161 131 101 70 40 55 70 64 10 -46 -74 -73 -72 -58 -44 -1 41 56 70 25 -19 -69 -119 -110 -101 -113
2524 -113 -124 -135 -146 -112 -78 -43 -9 18 45 73 101 81 62 43 24 13 3 -7 -18 -61 -103 -146 -189 -165 -140 -116 -91 -79 -67 -55 -42 -1 39 80 122
2509 122 116 111 105 100 91 83 75 66 62 57 52 48 45 43 96 149 142 86 43 29 39 79 103 128 132 137 141 145 121 96 72 47 62 78 93 109 96 83 40 -1 -48 -95 -83 -71
2490 -71 -91 -111 -132 -152 -142 -131 -121 -111 -90 -69 -48 -27 -35 -42 -50 -58 -39 -19 -30 -40 -94 -148 -171 -145 -87 -28 -26 -23 -50 -77 -74 -72 -21 28 104 181 232 234 181 99
2472 99 16 -66 -92 -118 -108 -97 -86 -75 -17 39 111 152 154 106 70 63 55 76 99 93 78 63 47 30 17 4 -8 -21 -67 -113 -159 -205 -226 -247 -209 -171 -186
2456 -186 -201 -187 -173 -122 -71 -79 -88 -120 -153 -156 -160 -132 -104 -20 63 96 79 63 96 153 211 226 212 183 105 6 -62 -66 -69 -71 -73 -29 13 56 99 96 93 89 86 66 45
$$ packed form
2576f8NONj5j5j5j4l5l4l3l3K4N3O5J5l5l6l9l8M7M7M8M7PPPPl0l0%jL3L3j6j6j4j5L5L5q
2559a4pqpnmnmn5n6n5n5OPRJ0L0Q0O7L7j3m2k7k8L6L6L5L5M4M5M5M5JKm8m8l3l4mmo2o2m2
2540a52QM2M3M5M5L0L1j8j9K7K6K7K6l0l0l1l0J5J5on4n6k8JJJ4J4M3M2J5J4m5m4n0n0RRj2
2524a13j1j1j1L4L4L5L4K7K7K8K8k0j9j9j9j1j0j0j1m3m2m3m3K4K5K4K5J2J2J2J3M1M0M1M2
2509A22ononrqqrmnnmlkN3N3pn6m3j4J0M0K4K5MNMMk4k5k4k5J5J6J5J6j3j3m3m1m7m7J2J2
2490g1k0k0k1k0J0J1J0J0K1K1K1K1qpqqJ9K0j1j0n4n4k3K6N8N9KLk7k7LKN1M9P6P7N1Kn3q2
2472I9q3q2k6k6J0J1J1J1N8N6P2M1Km8l6pqK1K3oj5j5j6j7j3j3j2j3m6m6m6m6k1k1L8L8j5
2456a86j5J4J4N1N1qrl2l3lmK8K8Q4Q3L3j7j6L3N7N8J5j4k9p8r9o8mlkkM4M2M3M3llmlk0k1
$$ plain form
2439 45 25 4 7 9 11 13 38 62 87 111 87 63 39 14 6 -2 -11 -20 8 36 62 40 0 -40 -25 -9 9 28 18 7 -4 -16 -28 -40 -47 -54 -61 -68 -61 -55 -48 -41 -13
2420 -13 14 -16 -47 -7 31 70 110 110 110 110 110 93 76 59 42 32 23 14 4 37 69 102 134 124 115 105 96 84 73 32 -8 -43 -79 -55 -32 -8 14 -20 -56
2403 -56 -73 -91 -79 -67 -51 -36 -50 -64 -69 -74 -79 -84 -64 -45 0 46 63 30 -33 -97 -133 -169 -176 -183 -160 -138 -116 -94 -104 -113 -122 -131 -148 -164 -122 -79 -33 13 0 -12
2386 -12 -32 -52 -33 14 45 27 -39 -135 -200 -197 -136 -74 -27 20 38 56 96 137 177 217 210 203 206 238 251 214 151 88 58 77 114 122 84 46 7 -32 -18 -4
2369 -4 9 23 33 44 55 66 39 13 -12 -38 -28 -18 -9 0 17 33 76 118 150 123 70 17 5 -5 13 31 36 41 46 51 80 109 138 167 200 233 266 298 292
2352 292 286 280 274 271 267 234 201 216 231 222 154 82 40 7 -26 -55 -85 -85 -85 -106 -126 -118 -109 -122 -136 -149 -163 -162 -161 -160 -159 -118 -77 -94 -112 -81 -49 -18 13 14 15 15 16 4
2333 4 -6 -18 -30 -9 10 30 51 86 122 158 193 158 122 86 51 11 -28 -68 -108 -95 -83 -96 -109 -128 -88 -22 43 40 38 36 34 35 36 37 38 -17 -73 -128 -184 -207
2316 -207 -229 -252 -275 -260 -246 -232 -218 -260 -301 -343 -385 -370 -355 -340 -326 -298 -271 -243 -215 -184 -153 -122 -90 -133 -176 -193 -151 -118 -85 -48 -11 47 106 106 106 102
$$ packed form
2439D5k0k1LKKKK5K4K5K4k4k4k4k5qqrrK8K8K6k2m0m0J5J6J8J9j0j1j1j2j2j2ppppPOPPK8
2420a3K7l0l1M0L8L9M0%%%%j7j7j7j7j0rrj0L3L2L3L2j0rj0rj2j1m1m0l5l6K4K3K4K2l4l6
2403e6j7j8J2J2J6J5j4j4nnnnK0J9M5M6J7l3o3o4l6l6ppK3K2K2K2j0rrrj7j6M2M3M6M6j3j2
2386a2k0k0J9M7L1j8o6r6o5LO1O2M7M7J8J8M0M1M0M0ppLL2J3l7o3o3l0J9L7Ql8l8l9l9J4J4
2369dJ3J4J0J1J1J1k7k6k5k6J0J0RRJ7J6M3M2L2k7n3n3j2j0J8J8NNNNK9K9K9K9L3L3L3L2o
2352B92ooolml3l3J5J5ro8p2m2l3l3k9l0%%k1k0QRj3j4j3j4JJJJM1M1j7j8L1L2L1L1JJ%Jj2
2333Dj0j2j2K1J9K0K1L5L6L6L5l5l6l6l5m0l9m0m0J3J2j3j3j9M0O6O5lkkkJJJJn5n6n5n6k3
2316b07k2k3k3J5J4J4J4m2m1m2m2J5J5J5J4K8K7K8K8L1L1L1L2m3m3j7M2L3L3L7L7N8N9%%m
$$ plain form
2300 102 98 94 91 112 133 154 175 169 163 157 151 119 86 54 21 -7 -36 -5 24 25 26 27 27 36 44 52 61 34 8 41 74 61 48 35 23 43 63 83 104 81 58 35
2282 35 12 -33 -78 -99 -60 -7 45 75 46 -29 -105 -160 -155 -123 -91 -55 -20 6 33 1 -30 -62 -94 -126 -158 -126 -94 -3 88 164 240 218 196 188 180 172 163 137
2266 137 110 83 57 62 68 74 80 63 47 30 14 47 81 114 147 154 160 166 173 203 232 242 281 349 357 319 251 181 111 39 -32 -78 -124 -170 -216 -185 -154 -124 -93
2249 -93 -84 -76 -67 -58 -15 27 87 117 107 97 86 74 60 46 33 19 47 75 103 131 146 162 176 190 197 174 111 48 17 15 13 -17 -78 -138 -158 -148 -132 -116 -98
2232 -98 -80 -58 -37 -15 6 14 23 29 36 13 -39 -76 -112 -155 -198 -241 -284 -295 -306 -315 -324 -312 -270 -245 -220 -200 -181 -161 -141 -100 -59 -20 18 36 24 -27 -79 -82 -56
2215 -56 -46 -36 -55 -74 -91 -109 -103 -67 -49 -30 -31 -33 -34 -36 -29 -23 0 -5 -22 -39 -57 -76 -89 -103 -133 -133 -113 -93 -72 -50 -23 2 45 58 60 61 75 59 10 -67 -157
2197 -157 -197 -178 -129 -97 -66 -69 -131 -194 -197 -158 -119 -76 -33 -5 21 52 24 -42 -109 -154 -140 -120 -100 -50 0 47 36 -39 -115 -150 -184 -160 -136 -107 -78 -79
2181 -79 -80 -89 -98 -107 -116 -80 -45 -9 26 0 -26 -52 -79 -15 47 84 63 25 -11 5 23 37 51 6 -38 -58 -78 -98 -118 -115 -111 -108 -104 -88 -72 -56 -39 -11 17 45
$$ packed form
2300A02mmlK1K1K1K1ooool2l3l2l3k8k9L1K9JJJ%RQQRk7k6L3L3j3j3j3j2K0K0K0K1k3k3k3
2282C5k3m5m5k1L9N3N2L0k9p5p6n5NL2L2L6L5K6K7l2l1l2l2l2l2L2L2R1R1P6P6k2k2qqqrk6
2266A37k7k7k6NOOOj7j6j7j6L3L4L3L3POOPL0K9J0L9O8Ql8o8p0p0p2p1m6m6m6m6L1L1L0L1
2249i3RQRRM3M2O0L0j0j0j1j2j4j4j3j4K8K8K8K8J5J6J4J4Pk3o3o3l1kkl0o1o0k0J0J6J6J8
2232i8J8K2K1K2K1QROPk3n2l7l6m3m3m3m3j1j1rrJ2M2K5K5K0J9K0K0M1M1L9L8J8j2n1n2lK6
2215e6J0J0j9j9j7j8OL6J8J9jkjkPOK3nj7j7j8j9j3j4l0%K0K0K1K2K7K5M3J3KJJ4j6m9p7r0
2197a57m0J9M9L2L1lo2o3lL9L9M3M3K8K6L1k8o6o7m5J4K0K0N0N0M7j1p5p6l5l4K4K4K9K9j
2181g9jrrrrL6L5L6L5k6k6k6k7O4O2L7k1l8l6J6J8J4J4m5m4k0k0k0k0LMLMJ6J6J6J7K8K8K8
$$ plain form
2164 45 74 37 1 -34 -71 -93 -116 -113 -51 14 80 91 102 99 97 94 92 115 139 104 69 50 30 11 -7 -39 -71 -102 -134 -124 -114 -104 -94 -83 -72 -28 -43 -110
2148 -110 -177 -222 -207 -161 -114 -123 -132 -166 -201 -209 -159 -78 2 22 -17 -6 4 11 19 34 49 64 79 42 5 -30 -67 -73 -78 -84 -89 -113 -138 -158 -179 -177 -125 -42 40 74
2130 74 109 84 60 67 74 82 89 93 96 100 103 56 9 -37 -85 -80 -76 -71 -67 -37 -7 22 51 67 83 98 114 113 111 80 49 19 -11 17 46 75 104 133 163 168 174 180 186 154
2111 154 122 90 58 36 15 -5 -26 -25 -25 34 94 125 156 129 101 45 -10 -7 -5 -18 -32 -75 -118 -111 -104 -42 20 9 -69 -165 -212 -208 -173 -153 -132 -77 -21 4
2095 4 30 55 81 75 20 -48 -118 -131 -144 -142 -140 -108 -77 -30 15 59 55 12 -30 -47 -63 -95 -127 -159 -191 -218 -245 -223 -201 -141 -82 -23 35 50 65 52 39 -9
$$ packed form
2164D5K9l7l6l5l7k2k3LO2O5O6J1J1lklkK3K4l5l5j9k0j9j8l2l2l1l2J0J0J0J0J1J1M4j5o7
2148a10o7m5J5M6M7rrl4l5qN0Q1Q0K0l9J1J0PQJ5J5J5J5l7l7l5l7ononk4k5k0k1KN2Q3Q2L4
2130G4L5k5k4PPQPMLMLm7m7m6m8NMNML0L0K9K9J6J6J5J6jkl1l1l0l0K8K9K9K9K9L0NOOOl2
2111A54l2l2l2k2k1k0k1J%N9O0L1L1k7k8n6n5LKj3j4m3m3PPO2O2j1p8r6m7ML5K0K1N5N6K5
2095DK6K5K6on5o8p0j3j3KKL2L1M7M5M4mm3m2j7j6l2l2l2l2k7k7K2K2O0N9N9N8J5J5j3j3m8
$$ [...]
-3131g4
##END=	
##END=	
