##TITLE=	Jun13-2019.130.fid
Br - 06 - 3.0 - C1

##JCAMP-DX=	6.0	$$ MestReNova 14.1.1-24571
##DATA TYPE=	LINK
##BLOCK_ID=	1
##BLOCKS=	1    
##ORIGIN=	Mestrelab Research S.L.
##OWNER=	hrzepa
##$MNOVA/LINK_BLOCK_TYPE=	ITEM	$$ NMR Spectrum
##$MNOVA/ITEM/POLYGON=	(XY..XY)
5321,5835
8722,5835
8722,8208
5321,8208
5321,5835
##$MNOVA/ITEM/Z=	0
##$MNOVA/ITEM/ANGLE=	0
##TITLE=	Jun13-2019.130.fid
##JCAMP-DX=	6.0	$$ MestReNova 14.1.1-24571
##BLOCK_ID=	2
##DATA TYPE=	NMR SPECTRUM
##DATA CLASS=	XYDATA
##NUMDIM=	1
##ORIGIN=	Bruker BioSpin GmbH
##OWNER=	nmr
##.OBSERVE FREQUENCY=	400.32240192000000434
##.OBSERVE NUCLEUS=	^1H
##.SOLVENT NAME=	CDCl3
##.PULSE SEQUENCE=	zg30
##LONGDATE=	2019/06/13 18:19:00.000
##.ACQUISITIONMODE=	SIMULTANEOUS (DQD)
##$ORIGINAL FORMAT=	Bruker XWIN-NMR
##$MNOVA/SCALES_VERSION=	9
##$PARAMETER FILE=	(acqus, ASCII, /Users/hrzepa/Downloads/Polysiphenol%20SI%20NMR%20Original%20Data/5/5a%20-%201H%20-%20400B.19.06.13.130%20-%20ZY/130/acqus, 0)
$$ ##TITLE= Parameter file, TOPSPIN		Version 3.2
$$ ##JCAMPDX= 5.0
$$ ##DATATYPE= Parameter Values
$$ ##NPOINTS= 11	$$ modification sequence number
$$ ##ORIGIN= Bruker BioSpin GmbH
$$ ##OWNER= nmr
$$ $$ 2019-06-13 18:19:01.783 +0100  nmr@CZC2524DW0
$$ $$ /opt/topspin/data/brad/nmr/Jun13-2019/130/acqus
$$ $$ process /opt/topspin3.2/prog/mod/shimcntl
$$ ##$ACQT0= -2.3109243697479
$$ ##$AMP= (0..31)
$$ 100 100 100 100 100 100 100 100 100 100 100 100 100 100 100 100 100 100
$$ 100 100 100 100 100 100 100 100 100 100 100 100 100 100
$$ ##$AMPCOIL= (0..19)
$$ 0 0 0 0 0 0 0 0 0 0 0 0 0 0 0 0 0 0 0 0
$$ ##$ANAVPT= -1
$$ ##$AQSEQ= 0
$$ ##$AQ_mod= 3
$$ ##$AUNM= <au_zg>
$$ ##$AUTOPOS= <1 >
$$ ##$BF1= 400.32
$$ ##$BF2= 400.32
$$ ##$BF3= 400.32
$$ ##$BF4= 400.32
$$ ##$BF5= 400.32
$$ ##$BF6= 400.32
$$ ##$BF7= 400.32
$$ ##$BF8= 400.32
$$ ##$BYTORDA= 0
$$ ##$CAGPARS= (0..11)
$$ 0 0 0 0 0 0 0 0 0 0 0 0
$$ ##$CFDGTYP= 0
$$ ##$CFRGTYP= 9
$$ ##$CHEMSTR= <none>
$$ ##$CNST= (0..63)
$$ 1 1 145 1 1 1 1 1 1 1 1 1 1 1 1 1 1 1 1 1 1 1 1 1 1 1 1 1 1 1 1 1 1 1 1
$$ 1 1 1 1 1 1 1 1 1 1 1 1 1 1 1 1 1 1 1 1 1 1 1 1 1 1 1 1 1
$$ ##$CPDPRG= (0..8)
$$ <> <> <> <> <mlev> <mlev> <mlev> <mlev> <mlev>
$$ ##$D= (0..63)
$$ 0 1 0 0 0 0 0 0 0 0.06 0 0 0 0 0 0 0.0002 0 0 0 0 0 0 0 0 0 0 0 0 0 0 0
$$ 0 0 0 0 0 0 0 0 0 0 0 0 0 0 0 0 0 0 0 0 0 0 0 0 0 0 0 0 0 0 0 0
$$ ##$DATE= 1560446340
$$ ##$DE= 6.5
$$ ##$DECBNUC= <off>
$$ ##$DECIM= 2496
$$ ##$DECNUC= <off>
$$ ##$DECSTAT= 4
$$ ##$DIGMOD= 1
$$ ##$DIGTYP= 12
$$ ##$DQDMODE= 0
$$ ##$DR= 22
$$ ##$DS= 2
$$ ##$DSPFIRM= 0
$$ ##$DSPFVS= 20
$$ ##$DTYPA= 0
$$ ##$EXP= <proton>
$$ ##$F1LIST= <111111111111111>
$$ ##$F2LIST= <222222222222222>
$$ ##$F3LIST= <333333333333333>
$$ ##$FCUCHAN= (0..9)
$$ 0 2 0 0 0 0 0 0 0 0
$$ ##$FL1= 90
$$ ##$FL2= 90
$$ ##$FL3= 90
$$ ##$FL4= 90
$$ ##$FOV= 20
$$ ##$FQ1LIST= <freqlist>
$$ ##$FQ2LIST= <freqlist>
$$ ##$FQ3LIST= <freqlist>
$$ ##$FQ4LIST= <freqlist>
$$ ##$FQ5LIST= <freqlist>
$$ ##$FQ6LIST= <freqlist>
$$ ##$FQ7LIST= <freqlist>
$$ ##$FQ8LIST= <freqlist>
$$ [...]
$$ ##$Sgu3PowerLevels= (0..7)
$$ 0 0 0 0 0 0 0 0
$$ ##$Sgu4PowerLevels= (0..7)
$$ 0 0 0 0 0 0 0 0
$$ ##$Sgu5PowerLevels= (0..7)
$$ 0 0 0 0 0 0 0 0
$$ ##$Sgu6PowerLevels= (0..7)
$$ 0 0 0 0 0 0 0 0
$$ ##$Sgu7PowerLevels= (0..7)
$$ 0 0 0 0 0 0 0 0
$$ ##$Sgu8PowerLevels= (0..7)
$$ 0 0 0 0 0 0 0 0
$$ ##$SguType= 3
$$ ##$ShimPowMaxUA= (0..63)
$$ 130000 130000 130000 130000 130000 130000 130000 130000 130000 130000 130000
$$ 130000 130000 130000 130000 130000 130000 130000 130000 130000 0 0 0 0
$$ 0 0 0 0 0 0 0 0 0 0 0 0 0 0 0 0 0 0 0 0 0 0 0 0 0 0 0 0 0 0 0 0 0 0 0 0
$$ 0 0 0 0
$$ ##$ShimPowMaxUC= (0..63)
$$ 130000 130000 130000 130000 130000 130000 130000 130000 130000 130000 130000
$$ 130000 130000 130000 130000 130000 130000 130000 130000 130000 0 0 0 0
$$ 0 0 0 0 0 0 0 0 0 0 0 0 0 0 0 0 0 0 0 0 0 0 0 0 0 0 0 0 0 0 0 0 0 0 0 0
$$ 0 0 0 0
$$ ##$ShimPowMaxUG= (0..63)
$$ 524287 524287 524287 524287 524287 524287 524287 524287 524287 524287 524287
$$ 524287 524287 524287 524287 524287 524287 524287 524287 524287 0 0 0 0
$$ 0 0 0 0 0 0 0 0 0 0 0 0 0 0 0 0 0 0 0 0 0 0 0 0 0 0 0 0 0 0 0 0 0 0 0 0
$$ 0 0 0 0
$$ ##$ShimPowRcbType= 3
$$ ##$ShimPowRes= (0..63)
$$ 1e-20 1e-20 1e-20 1e-20 1e-20 1e-20 1e-20 1e-20 1e-20 1e-20 1e-20 1e-20
$$ 1e-20 1e-20 1e-20 1e-20 1e-20 1e-20 1e-20 1e-20 0 0 0 0 0 0 0 0 0 0 0 0
$$ 0 0 0 0 0 0 0 0 0 0 0 0 0 0 0 0 0 0 0 0 0 0 0 0 0 0 0 0 0 0 0 0
$$ ##$ShimPowRng0= (0..63)
$$ 1 1 1 1 1 1 1 1 1 1 1 1 1 1 1 1 1 1 1 1 0 0 0 0 0 0 0 0 0 0 0 0 0 0 0 0
$$ 0 0 0 0 0 0 0 0 0 0 0 0 0 0 0 0 0 0 0 0 0 0 0 0 0 0 0 0
$$ ##$ShimPowRng1= (0..63)
$$ 1 1 1 1 1 1 1 1 1 1 1 1 1 1 1 1 1 1 1 1 0 0 0 0 0 0 0 0 0 0 0 0 0 0 0 0
$$ 0 0 0 0 0 0 0 0 0 0 0 0 0 0 0 0 0 0 0 0 0 0 0 0 0 0 0 0
$$ ##$ShimPowRng2= (0..63)
$$ 1 1 1 1 1 1 1 1 1 1 1 1 1 1 1 1 1 1 1 1 0 0 0 0 0 0 0 0 0 0 0 0 0 0 0 0
$$ 0 0 0 0 0 0 0 0 0 0 0 0 0 0 0 0 0 0 0 0 0 0 0 0 0 0 0 0
$$ ##$ShimPowRng3= (0..63)
$$ 1 1 1 1 1 1 1 1 1 1 1 1 1 1 1 1 1 1 1 1 0 0 0 0 0 0 0 0 0 0 0 0 0 0 0 0
$$ 0 0 0 0 0 0 0 0 0 0 0 0 0 0 0 0 0 0 0 0 0 0 0 0 0 0 0 0
$$ ##$ShimSysFunc= (0..63)
$$ 1 2 3 4 5 7 9 11 15 16 8 10 12 14 6 17 13 18 19 20 0 0 0 0 0 0 0 0 0 0
$$ 0 0 0 0 0 0 0 0 0 0 0 0 0 0 0 0 0 0 0 0 0 0 0 0 0 0 0 0 0 0 0 0 0 0
$$ ##$ShimSysMatrix= 0
$$ ##$ShimSysType= 1
$$ ##$TFXNUM= 0
$$ ##$TRIPLO2= 0
$$ ##$VTU= 2
$$ ##$VTUETH= <149.236.99.20>
$$ ##$VTUTY= <no>
$$ ##$WBREFAM= (0..15)
$$ 132.2 106.2 100 100 100 100 100 100 100 100 100 100 100 100 100 100
$$ ##$WBREFLM= (0..15)
$$ 0 0 0 0 0 0 0 0 0 0 0 0 0 0 0 0
$$ ##$WBREFPH= (0..15)
$$ 77.55 -65.76 0 0 0 0 0 0 0 0 0 0 0 0 0 0
$$ ##$WBSGU= (0..15)
$$ 0 0 0 0 0 0 0 0 0 0 0 0 0 0 0 0
$$ ##$XFAC= 2
$$ ##END=
$$ 
##$DECIM=	2496
##$DSPFVS=	20
##XUNITS=	HZ
##YUNITS=	ARBITRARY UNITS
##FIRSTX=	6408.3302564214200174
##LASTX=	-1604.3679904610892208
##DELTAX=	-0.12226593800080123864
##XFACTOR=	1
##YFACTOR=	0.01406416730474521759
##FIRSTY=	9.4002580642700195312
##MINY=	-8.844066619873046875
##MAXY=	26755.83984375
##NPOINTS=	65536
##XYDATA=	(X++(Y..Y))
$$ [...]
3494 830 772 708 644 627 698 789 793 721 649 627 605 627 648 683 718 747 777 810 756 654 553 577 688 799 822 775 727 673 620 608 595 582 570
3490 570 672 774 799 738 667 683 747 810 788 766 701 635 660 684 665 646 674 702 730 758 733 708 682 657 672 686 701 716 702 688 675 661 629 597
3486 597 609 621 592 563 581 686 775 776 702 628 677 727 734 740 781 823 870 830 799 768 732 695 711 726 741 756 719 681 644 606 601 596 591 586 596 606 616 626
3481 626 688 749 738 728 743 759 774 790 797 803 810 816 853 890 855 820 830 841 925 1008 1014 1019 894 769 752 735 718 701 698 695 765 836 749 662 705 749 853
3477 853 957 902 846 848 851 853 856 855 854 854 853 800 748 695 643 658 673 616 558 608 658 707 757 709 662 687 712 745 777 679 580 606 632 658 684 619 553 560 567
3472 567 607 646 643 639 682 725 768 812 785 758 731 704 650 597 674 751 742 733 723 714 757 799 798 797 713 628 675 721 761 800 796 791 817 843 825 808 748 689 702
3467 702 716 730 745 803 861 797 732 668 603 626 649 715 782 808 834 817 800 817 834 850 867 923 979 904 829 764 698 763 828 903 978 922 866 808 750
3463 750 692 634 660 685 710 736 786 836 785 734 688 642 668 695 681 666 652 638 661 684 707 730 709 688 666 645 600 555 583 611 589 567 646 726 727
3459 727 729 686 644 687 729 728 727 718 709 656 603 631 660 688 717 727 737 747 758 737 717 740 763 790 818 773 728 698 669 741 813 782 752 794 836 816 796
3454 796 776 756 776 797 745 694 724 754 712 670 677 685 649 613 666 718 771 823 826 829 831 834 827 821 814 807 801 795 833 870 825 779 733 688 759 830 829 828 810 792 847 901
3449 901 873 845 779 713 699 772 878 839 731 624 638 652 610 569 600 630 613 596 579 562 601 640 723 806 788 771 753 735 749 763 777 791 752
3445 752 713 718 723 727 730 691 651 695 740 740 741 747 753 759 765 770 775 824 872 880 888 794 700 651 601 625 648 662 675 689 703 707 712 717 721 695 669 716 763 750 738 769 800 839
3440 839 877 842 808 737 665 666 667 679 690 702 714 734 755 776 797 752 707 735 763 820 878 863 848 788 728 741 753 802 851 798 745 728 711 796 880 890
3435 890 899 806 714 698 683 673 662 620 665 754 756 672 588 601 613 607 602 620 725 821 918 947 976 898 819 691 651 707 762 780 797 789 780 782 697 623 635
3431 635 695 755 669 583 628 672 665 657 649 641 670 700 686 672 629 586 615 645 668 692 758 825 848 870 892 914 882 849 817 785 818 851 889 840 764 687 730
3426 730 772 799 739 684 629 604 579 602 711 775 752 784 816 842 868 889 909 911 826 644 550 601 740 840 854 811 768 764 759 756 754 707 661 634 608
3422 608 654 700 716 732 704 677 640 604 568 532 601 669 661 566 510 541 619 697 707 717 727 737 733 730 770 810 853 896 895 895 870 846 865 884 888 893 825 757
3417 757 733 709 758 806 803 800 841 881 877 873 869 865 800 734 712 690 689 688 687 686 743 799 812 825 786 746 779 813 798 783 768 753 769 785 728 671 655 639 623 607
3412 607 596 585 574 563 631 699 767 835 823 811 842 874 834 793 753 713 724 735 746 757 777 796 815 834 756 677 730 782 788 793 756 718 676 634 636 638 643
3408 643 649 698 747 776 804 731 658 632 605 622 639 654 669 684 699 723 747 728 708 665 622 578 535 635 735 762 790 774 757 741 725 718 711 704 697 728
3403 728 759 718 676 715 755 867 978 983 988 949 911 885 860 791 723 745 767 788 810 771 731 764 796 784 772 760 748 799 851 829 808 810 812 813 815 842 869
3399 869 897 924 846 768 762 757 756 755 710 666 650 635 663 691 707 724 784 844 810 776 742 708 742 776 708 641 705 770 791 813 745 677 711 745 794 843 848
3394 848 853 815 778 813 848 856 865 873 881 894 907 919 932 888 843 798 754 752 750 704 659 701 744 787 829 846 864 881 898 820 743 709 674 716 757 726 694 711
3390 711 727 700 674 721 768 816 863 867 870 873 876 884 892 900 907 853 798 816 833 796 758 715 759 837 915 897 878 856 834 880 925 916 820 768 803 858 913 842 772
3385 772 759 747 777 808 746 683 644 692 713 735 707 767 862 870 778 686 635 672 703 734 654 574 509 589 746 817 814 812 843 875 804 734 681 628 575 521
3381 521 529 537 588 639 736 833 829 824 803 782 762 741 760 780 800 819 891 962 981 913 850 788 720 652 705 757 763 681 594 595 642 689 721 753 741 730 746 763
3376 763 780 797 808 819 831 842 805 769 689 609 620 632 740 847 915 895 881 867 903 939 873 807 815 824 832 840 844 847 807 767 738 709 724 738 816 894 842
3371 842 789 727 666 706 745 746 747 748 749 802 854 805 756 837 917 896 875 811 747 756 764 742 719 741 762 810 857 803 749 688 627 609 592 653 714 731 748 779
3367 779 810 768 727 746 766 786 806 813 820 784 747 744 741 737 734 770 807 800 793 779 765 750 736 749 762 775 788 823 858 849 840 830 821 811 801 839 877 915 953 966
3362 966 978 918 858 788 718 692 666 680 693 707 721 733 745 757 769 782 794 806 818 813 808 803 797 807 818 828 838 850 863 837 811 850 976 1038 955 824
3357 824 780 809 837 835 833 787 741 714 686 789 892 835 777 719 662 614 566 620 674 682 691 699 707 770 833 795 756 829 902 873 845 838 832 782 733 699 666 734
3353 734 802 859 916 871 826 852 879 906 933 935 937 896 854 808 761 787 813 805 798 791 784 731 679 670 661 704 746 789 832 873 914 853 792 800 809 817 825 794 763 805 847
3348 847 914 982 890 799 728 657 658 660 675 690 706 721 770 819 824 829 752 675 671 667 707 747 787 827 804 781 715 648 679 710 697 684 628 571 645 720 821
3343 821 923 894 864 894 924 910 896 861 827 792 757 774 792 737 682 714 747 783 819 786 797 828 786 731 719 749 736 691 689 757 825 815 732 633 636
3339 636 723 811 762 640 594 621 648 602 602 673 743 741 700 703 749 796 806 816 826 836 798 761 766 772 745 718 763 809 815 822 785 748 758 768 778 788 775 763
3334 763 823 882 826 770 757 745 755 765 731 698 716 734 752 771 736 702 667 633 598 564 602 640 684 728 772 817 812 806 801 796 791 786 781 775 768 760 752 744 711 679 690
3329 690 701 741 781 820 860 800 740 752 764 759 753 748 742 730 718 707 695 689 682 676 670 740 811 881 951 957 964 971 977 941 905 913 920 897 873 850 826 874 921 867 813 836
3324 836 859 883 906 798 691 656 622 656 690 724 758 725 692 702 713 745 777 810 842 799 756 785 815 845 875 832 789 754 719 727 735 763 792 777 761
3320 761 749 736 767 799 793 788 783 777 706 634 693 752 843 934 924 913 867 821 776 730 730 730 802 875 868 860 853 846 935 1025 1013 1000 890 780 771 763 742 722 702 681
3315 681 734 787 797 806 766 726 729 732 712 691 715 738 777 816 898 981 954 927 856 785 758 731 704 677 697 716 779 842 868 895 878 861 830 800 842 884
3311 884 895 905 916 927 864 800 780 760 784 809 833 857 836 816 795 775 804 833 912 903 852 802 789 777 691 605 624 730 791 764 718 673 668 663 658 653 671
3306 671 689 803 917 1002 1000 945 890 807 723 692 748 767 786 766 747 783 820 857 894 903 912 921 930 866 802 862 923 958 906 902 899 863 827 791 755 792 830
3302 830 824 817 829 841 853 865 825 784 815 847 867 887 863 840 795 749 777 804 746 688 732 775 824 872 877 882 790 699 713 814 888 875 872 870 876 882 887 893 891 889
3297 889 844 798 797 795 889 983 957 844 730 704 745 786 789 792 806 819 833 847 844 842 839 837 859 882 861 840 767 695 665 636 655 674 737 799 815 830 802 774
3292 774 803 832 818 804 776 748 721 693 680 667 611 554 582 610 595 579 628 677 769 861 859 857 898 939 943 946 906 866 838 809 781 753 733 713 737 761 785
3287 785 808 789 769 815 861 908 954 901 849 839 830 788 746 777 807 806 805 760 715 766 816 867 917 902 888 873 858 777 697 718 739 790 842 821 801 806 812
3283 812 817 823 772 721 743 765 792 820 847 875 923 971 976 981 904 827 793 760 805 849 851 852 853 854 812 769 750 730 754 778 795 812 829 846 848 850 851 853 896 938 976
3278 976 1013 1011 922 838 755 752 748 745 741 760 778 753 728 731 734 738 741 736 732 765 798 848 810 719 629 648 666 641 616 614 611 676 741 774 719 665 698 764 830 858 885
3273 885 901 917 890 862 907 951 894 837 839 841 843 844 779 713 665 705 774 757 663 569 632 696 716 736 753 770 787 804 910 1016 997 977 1078 1265 1409
3269 1409 1466 1472 1479 1485 1491 1652 1901 2055 2006 1786 1566 1444 1409 1413 1417 1383 1348 1260 1171 1082 993 926 860 837 815 875 936 924 913 910 907 861 814 770 726
3264 726 726 725 757 788 819 851 856 861 823 784 777 769 762 754 707 659 713 767 835 902 868 834 786 738 733 728 767 806 801 797 810 823 763 704 709 715 764 814 777 740 659 579
3259 579 651 723 751 779 729 678 671 664 643 623 602 581 602 623 688 753 780 807 791 775 727 679 674 669 726 782 765 749 721 693 665 637 643 648 698 747 813 879
3255 879 844 808 808 808 851 895 878 862 846 830 798 766 778 790 793 796 727 657 680 703 683 662 754 846 807 769 754 738 723 708 763 818 873 928 895 862 785
3250 785 708 717 726 734 743 753 764 774 784 812 839 765 691 690 689 790 891 945 999 894 788 828 868 865 862 859 856 853 851 874 898 877 857 822 788 825 863 923 982
3245 982 940 898 913 929 901 872 912 952 916 792 720 734 724 671 672 760 778 709 643 664 754 800 802 761 697 634 603 572 571 526 505 571 735 855 894
3241 894 845 818 834 872 909 906 902 901 900 899 898 949 1000 952 904 878 895 899 816 749 770 832 852 814 777 838 899 934 968 1002 1036 1044 1053 1061 1069 1023 977 931 885 899
3236 899 914 928 942 928 914 900 887 942 998 1010 1021 945 869 793 717 696 675 654 632 646 659 716 773 787 802 772 743 789 834 836 837 864 890 872 855 914
3232 914 973 988 1004 1027 1050 971 805 750 840 897 868 858 936 1011 999 910 865 891 917 880 843 878 914 904 894 884 875 854 834 813 793 772 752 731 711
3227 711 734 757 781 804 812 820 784 748 787 826 865 904 918 932 945 959 889 819 793 767 812 856 829 801 774 747 721 694 729 763 779 708 643 665 706 746
3223 746 762 777 748 720 678 635 694 796 860 836 768 743 778 813 779 744 741 738 735 732 794 855 844 832 836 841 831 778 749 807 868 842 802 849 894 851 831
3219 831 853 873 850 826 845 880 916 921 926 913 813 738 751 830 823 767 710 698 685 703 807 912 929 897 865 929 993 938 883 872 860 838 816 837 858
3214 858 828 798 767 737 741 745 793 841 933 1024 1092 1073 989 906 823 740 630 608 696 784 826 869 867 866 820 773 828 883 841 799 801 802 823 843 864 884 861
3210 861 839 772 706 675 644 685 727 758 790 778 766 767 769 771 772 736 699 706 713 729 744 832 920 879 839 871 903 880 858 835 813 820 827 834 841 793 745 770 795 840
3205 840 885 887 888 851 813 877 941 920 898 877 855 863 870 878 885 887 889 848 806 762 717 716 716 808 901 999 1010 940 869 837 804 864 924 937 863 792 807 870 933 899
3200 899 865 837 808 713 704 748 793 828 863 899 934 842 751 760 770 817 864 960 969 876 783 816 848 888 927 967 1007 955 903 923 944 968 993 944 896 874
3196 874 852 885 830 753 762 790 818 742 665 772 878 913 860 813 766 734 701 712 723 648 574 581 675 696 718 744 771 772 772 772 773 837 901 863 825 742 658
3191 658 677 695 741 788 834 881 914 948 886 823 763 791 836 882 824 680 579 565 582 599 621 643 667 690 713 736 744 752 721 691 696 787 879 884 803 721
3187 721 736 751 744 737 773 810 874 938 978 931 834 737 789 841 848 767 736 704 667 630 594 557 644 732 868 917 894 870 885 900 831 763 771 866 891 828
3182 828 750 758 778 797 800 803 800 796 793 789 781 772 807 842 882 922 889 856 829 801 846 892 871 849 872 895 912 930 948 966 897 828 832 836 760 685 633 668 696 724
3177 724 713 703 708 712 739 766 802 838 852 866 840 815 856 898 912 838 791 745 717 690 735 780 805 830 877 924 888 853 865 964 1004 957 950 1030 1062 950
3173 950 803 743 702 660 581 646 772 811 777 743 729 714 721 728 771 815 836 858 868 878 845 812 828 843 837 831 809 787 809 831 836 840 867 893 903 913 850
3168 850 788 751 713 698 683 762 841 847 853 844 834 847 859 841 823 826 830 783 737 762 788 773 757 763 769 773 776 736 696 689 683 654 626 657 688 719 750 769 789 843
3164 843 897 945 847 710 660 762 865 901 936 884 831 778 726 712 699 729 759 781 804 826 848 860 872 862 852 854 856 901 946 948 949 929 908 875 842
3159 842 787 732 717 702 687 672 766 861 883 905 870 836 824 811 819 826 790 754 775 796 838 881 974 1067 1058 1049 1039 1029 976 922 919 917 870 824 893 963 989 1015
3155 1015 1071 1126 1110 1093 1020 948 875 803 790 778 765 752 809 866 850 834 790 746 702 657 710 764 817 870 813 756 699 642 731 819 834 850 823 796
3150 796 769 742 731 720 710 699 833 966 940 914 893 873 852 831 908 984 1017 905 745 672 700 728 764 800 879 958 974 990 963 935 934 932 888 843
3146 843 833 823 812 802 847 891 834 776 805 834 863 891 827 762 799 836 863 890 845 799 778 757 736 716 717 719 765 810 849 888 855 821 827 834 768 701 789
3142 789 877 835 792 785 777 842 907 971 1035 968 902 824 746 668 590 635 681 726 772 831 891 906 922 952 981 967 953 903 853 875 898 874 850 826 802 864
3137 864 925 943 961 965 968 841 714 709 705 700 696 745 794 843 892 908 925 941 957 1025 1093 1089 1084 1019 954 889 824 906 988 1027 1065 994 923 852 781 815 850 840
3133 840 831 811 791 772 752 811 870 799 727 773 819 821 823 793 764 734 704 830 955 950 945 874 802 833 863 933 1002 970 938 949 959 970 980 924 867 883
3128 883 900 829 759 733 706 790 875 916 957 990 1024 1014 1004 997 990 910 830 765 700 736 772 854 937 917 898 909 921 889 857 879 901 880 859 800 742 684
3124 684 625 721 816 839 862 924 986 946 907 846 785 768 750 858 965 970 976 942 909 876 843 804 764 730 696 701 794 837 880 867 854 803 752 750 835 876
3119 876 830 784 738 652 566 521 621 761 814 813 811 805 798 812 826 840 854 898 943 945 946 1010 1074 1114 1067 943 819 742 753 808 863 924 985 1098 1210
3115 1210 1241 1185 1145 1104 1044 896 787 823 922 935 889 843 840 838 861 971 1082 1105 1105 1104 1099 1093 1062 1031 1001 970 934 898 863 827 826 826 788 749 749 836 874
3111 874 911 917 922 927 932 929 927 886 846 818 877 931 985 1001 1017 1033 1049 1040 1031 1022 1012 1033 1053 1141 1228 1245 1175 1086 998 960 1009 1058 1020 977 935 930 926 908 889 799
3106 799 708 722 735 749 763 761 760 860 961 987 1013 908 803 808 812 817 821 833 844 856 868 843 819 867 915 895 875 811 748 787 826 908 990 1035 1079 1051
3101 1051 1023 972 921 913 906 974 1042 1008 975 922 869 825 781 737 838 979 1034 1001 968 929 891 869 848 871 893 883 872 935 997 984 971 958 945 946 946
3097 946 991 1035 937 840 815 790 754 718 682 645 642 638 707 776 756 737 717 697 714 731 749 766 782 798 814 830 876 922 968 1014 975 935 852 769 778 788
3093 788 797 807 762 717 773 830 834 838 842 846 821 795 842 890 938 986 932 878 867 856 888 921 882 842 876 909 859 810 766 722 758 882 1001 974 835 783
3088 783 863 942 928 915 901 888 937 985 1034 1083 1039 995 1024 1053 1090 1126 1091 1055 958 860 923 985 934 883 963 1043 1049 1055 1104 1153 1047 941 878 816 854
3084 854 892 887 882 911 939 968 997 939 882 868 854 853 852 894 936 889 841 896 950 1031 1113 1194 1276 1180 1084 1032 980 995 1010 1098 1185 1077 970 993 1016 1018
3080 1018 1021 1023 1026 1020 1015 1053 1091 1183 1276 1325 1374 1316 1258 1389 1520 1474 1428 1455 1482 1556 1630 1824 2105 2413 2867 3716 5001 6240 6638 5953
3076 5953 4659 3570 3032 2870 2707 2589 2674 2947 3221 3560 4335 5562 6643 6758 5797 4413 3347 2833 2580 2360 2140
3073 2140 2015 1889 1763 1637 1567 1496 1425 1354 1240 1127 1057 987 1039 1091 1143 1195 1207 1219 1275 1330 1259 1187 1120 1054 951 936 1002 1068 1063 1058 1052 1047 1039
3069 1039 1031 1067 1102 1060 1017 1018 1019 930 842 834 914 902 889 882 875 862 848 878 908 805 702 672 786 903 932 947 962 943 925 973 1022 1012 916 863 897
3065 897 968 1039 1122 1117 985 854 794 821 872 836 855 874 896 917 939 960 997 1034 1071 1107 1060 1012 965 917 916 915 1010 1105 1135 1078 1070 1061 998 934 938 942 950 871
3060 871 859 934 1004 987 899 811 801 878 974 1069 1044 933 888 931 970 922 876 918 934 905 904 903 887 827 784 827 864 857 853 893 974 1012 976 939 933 927 964
3056 964 1001 997 992 988 984 976 968 962 957 995 1075 1137 1112 1025 939 977 1016 1013 1011 1009 1006 981 955 973 991 987 983 976 970 973 933 908 972 1051 1087 1051 1015 995 974 954 934 901 869
3051 869 910 950 952 954 969 1028 1018 921 865 896 904 824 750 763 837 910 990 1069 1051 1033 1013 993 961 887 857 915 978 998 993 1076 1152 1141 1085 1072 1083 1051 973
3046 973 895 915 935 955 976 1016 1056 1054 1008 968 1016 1080 1100 1043 985 1023 1062 1035 965 995 1113 1167 1134 1100 1155 1197 1152 1040 1015 1074 1134 1097 1060 1082
3042 1082 1104 1126 1148 1100 1052 1105 1159 1180 1202 1218 1235 1257 1191 1175 1159 1192 1225 1214 1203 1180 1158 1202 1246 1255 1177 1148 1118 1126 1133 1183 1321 1412 1357 1268 1266 1275
3038 1275 1285 1300 1315 1331 1347 1319 1292 1274 1256 1286 1403 1473 1456 1450 1445 1452 1459 1417 1462 1486 1509 1465 1422 1425 1428 1432 1435 1409 1383 1396 1408 1423 1351 1279 1294 1300 1306 1318 1329
3033 1329 1283 1236 1233 1230 1158 1086 1120 1240 1308 1289 1270 1338 1375 1325 1345 1451 1509 1422 1368 1401 1424 1360 1301 1329 1380 1430 1480 1530 1536 1455 1408 1506 1591 1588 1557
3029 1557 1670 1806 1854 1868 1969 2044 2119 2194 2269 2283 2210 2222 2438 2642 2700 2693 2832 2998 3076 3258 3643 4028 4412 5099 6280 7741 9695
3025 9695 12970 17668 21738 22585 19667 15153 11551 9546 8544 7976 7712 7825 8304 9103 10292 12266 15647 20045 23330
3023 23330 22986 18892 13665 9896 7957 6699 5645 5010 4752 4353 3750 3358 3227 3097 2879 2809 2885 2843 2801 3002 3406 3578
3020 3578 3314 2834 2354 2021 1775 1712 1736 1716 1696 1699 1701 1545 1300 1194 1234 1185 1137 1138 1138 1046 954 957 1105 1157 1064 1049 1121 1116 1025 956 973 942 910
3016 910 872 921 970 932 948 964 1019 1073 1124 1175 1095 1015 981 948 876 804 798 879 961 955 922 890 808 727 833 938 910 794 743 780 806 831 848 865
3012 865 839 813 842 872 861 850 875 943 940 849 827 892 913 847 770 779 778 777 787 796 806 816 825 834 843 852 841 829 820 811 922 1076 1097 1032 1011 1033 982 931 956
3007 956 982 935 845 873 987 1058 1041 1049 1101 1046 904 831 844 858 784 788 879 965 964 943 923 897 871 913 955 954 909 954 1085 1115 1058 1006 997 944 804
3003 804 720 781 829 833 905 1065 1185 1160 1074 1032 1031 1030 1057 1127 1129 1045 989 1078 1167 1112 993 962 974 986 971 957 1045 1132 1244 1357 1391 1337 1310 1326
2999 1326 1337 1305 1292 1279 1216 1067 1018 1057 1110 1119 1138 1156 1129 1059 1008 1045 1041 950 880 898 891 841 856 959 1062 1078 1022 1010 1011 1012 1037 1062 1046 1030 1035 1083
2994 1083 1089 1007 963 1005 1004 917 881 932 1000 1024 1041 1101 1159 1173 1186 1199 1137 988 964 1085 1167 1103 1017 1077 1104 1043 985 1072 1158 1100 1013 1013 1080 1059 999
2990 999 983 967 908 891 961 1034 1020 1003 1074 1144 1127 1123 1206 1282 1213 1070 1073 1169 1221 1181 1140 1103 1065 1020 1062 1110 1070 1013 1043 1115 1144 1149 1155 1117 993 911
2986 911 1032 1193 1208 1120 1118 1212 1219 1128 1082 1063 957 845 878 1008 1095 1088 1082 1059 993 974 1042 1149 1111 1017 1069 1180 1205 1092 980 995 1010 1051
2982 1051 1136 1206 1190 1109 1115 1193 1228 1210 1192 1171 1150 1115 1079 1044 1009 1012 1016 1092 1168 1132 1096 1103 1110 1095 1080 1065 1049 1062 1075 1088 1101 1122 1142 1169 1195 1133 1158
2977 1158 1226 1147 1031 1060 1208 1267 1255 1242 1297 1351 1348 1345 1343 1340 1248 1156 1117 1078 1076 1219 1368 1372 1305 1326 1449 1426 1292 1245 1328 1412 1326 1241 1257 1274
2973 1274 1267 1261 1298 1335 1337 1340 1415 1490 1457 1424 1492 1560 1529 1497 1626 1754 1759 1764 1813 1861 1963 2064 2392 2720 3038 3500 4173 4846 5408 5767 5796
2969 5796 5505 4950 4394 3945 3583 3330 3339 3578 3817 4114 4556 5141 5581 5742 5641 5326 4750 4006 3407 3058 2797 2550 2391 2318
2966 2318 2245 2091 1936 1854 1772 1639 1506 1562 1618 1594 1569 1667 1677 1578 1479 1477 1474 1437 1399 1440 1480 1428 1463 1600 1650 1509 1368 1439 1511 1454 1398 1472
2963 1472 1546 1562 1578 1593 1609 1517 1424 1492 1559 1498 1437 1477 1517 1537 1556 1678 1799 1756 1714 1676 1639 1559 1567 1714 1861 1752 1643 1664 1686 1642 1599 1685
2959 1685 1772 1749 1725 1832 1939 1953 1968 2084 2200 2109 2018 2072 2213 2364 2601 2973 3084 2744 2200 1913 1887 1828 1769 1800 1830 1746 1662 1741
2955 1741 1908 1926 1856 1889 2008 2003 1912 1918 1925 1849 1774 1804 1921 1933 1858 1914 2057 2074 2004 2064 2211 2306 2314 2376 2438 2445 2452 2584 2716 2726 2649 2693 2738 2713
2951 2713 2689 2799 2995 3061 3039 3153 3355 3446 3536 3743 4037 4267 4496 4978 5634 6387 7313 8668 10546 12773 15175 17512 19210
2948 19210 19523 18500 16592 14510 12524 11060 10250 9963 10008 10343 11266 12712 14500 16462 18235 19137 18695 17035 14788
2946 14788 12454 10253 8459 7291 6530 5843 5156 4731 4480 4152 3824 3597 3545 3333 3122 3104 3086 2897 2620 2560 2673 2638 2428
2943 2428 2408 2561 2539 2343 2219 2270 2253 2062 2031 2174 2251 2153 2127 2276 2311 2171 2080 2164 2166 2082 2108 2308 2325 2167 2141 2288 2303 2144 2174
2940 2174 2378 2431 2310 2262 2388 2402 2242 2118 2285 2396 2334 2327 2407 2388 2194 2096 2173 2187 2027 2055 2258 2340 2248 2200 2326 2325 2150 2105 2235
2936 2235 2336 2262 2290 2492 2511 2355 2287 2509 2610 2420 2390 2651 2789 2636 2491 2636 2688 2566 2524 2656 2642 2454 2411 2658 2704 2460
2933 2460 2310 2567 2723 2590 2507 2715 2847 2688 2603 2807 2957 2816 2769 3012 3233 3047 2854 3067 3308 3142 2983 3231 3440 3360
2930 3360 3323 3576 3787 3591 3380 3460 3568 3268 3012 3163 3334 3214 3073 3338 3591 3438 3350 3669 3988 3785 3546 3713 3857 3594
2927 3594 3267 3461 3709 3550 3325 3623 3938 3730 3478 3749 4054 3837 3518 3721 3970 3696 3357 3656 4011 3843 3566 3928 4302
2924 4302 4038 3613 3828 4115 3765 3341 3672 4205 3983 3601 3975 4501 4273 3841 4280 4965 4778 4381 4739 5362 5114 4655 5183
2921 5183 5973 5775 5127 5466 6223 5992 5493 6097 7137 6957 6422 7222 8490 8423 7848 8840 10482 10555 10120 11718 14019 14286
2919 14286 13793 15914 19398 20647 21283 25666 32252 36544 41732 55429 76405 99558 135551 203746 293337 351016
2917 351016 330323 245718 157377 106234 85000 70068 56133 49488 47597 42367 34097 28702 26189 22079 16707
2915 16707 13978 13569 11910 9082 8026 8497 7720 5858 5360 6049 5606 4174 3933 4730 4511 3315 3077 3820 3720 2664
2912 2664 2391 2987 2914 2068 1891 2529 2558 1872 1737 2281 2274 1576 1431 1953 2039 1535 1466 1938 1917 1276 1071 1513 1576 1105 1068 1624
2909 1624 1744 1263 1102 1470 1520 1074 948 1323 1437 1025 873 1227 1319 871 628 914 1055 747 643 957 1125 916 853 1076
2906 1076 1096 762 690 1031 1169 853 682 957 1088 908 873 1179 1224 868 657 881 1018 838 745 993 1096 864 778 1051 1178
2903 1178 925 759 923 1000 761 610 846 994 834 673 818 963 759 642 836 942 786 716 923 1042 800 645 857 1069
2900 1069 922 774 873 973 804 634 770 906 836 767 886 1005 860 714 845 975 860 746 907 1068 970 872 992 1112 1000
2897 1000 887 993 1098 984 871 975 1079 973 867 1002 1137 1099 973 975 977 786 683 859 1034 1005 888 923 957 894 832 959
2894 959 1086 926 767 907 1047 985 837 877 1004 929 855 945 1036 946 857 951 1045 943 753 804 943 915 800 873 1034 1070 1019 1095 1172
2890 1172 1081 990 1001 1012 901 791 921 1052 972 805 818 976 974 884 926 967 907 846 917 987 873 759 834 995 974 807 855 1047 1097
2887 1097 1003 988 1060 1064 982 1002 1108 1107 1019 1030 1085 1017 905 951 1084 1076 923 905 973 993 925 930 1022 1005 901 927 1041 1011 894 933 1059 1079
2883 1079 953 933 1000 1012 938 938 1026 1002 935 1027 1163 1100 950 946 1146 1235 1179 1131 1228 1284 1254 1276 1299 1227 1068 1089 1255 1340 1338 1438 1624 1717
2879 1717 1664 1713 1849 1931 1868 1902 2082 2176 2125 2146 2313 2448 2438 2431 2570 2782 2907 2887 2780 2502 2136 1992 2109 2247 2240 2234 2314 2316 2231 2186
2875 2186 2229 2241 2107 1959 1853 1700 1460 1311 1307 1358 1264 1165 1153 1162 1126 1094 1105 1108 1068 1056 1043 986 929 973 1105 1106 963 863 908 973 950 859
2872 859 812 810 809 877 945 948 864 847 917 925 846 861 1022 1112 1058 1007 1101 1219 1249 1262 1275 1208 1097 1080 1208 1264 1174 1051 1014 1029 1000 949 985 1005
2867 1005 981 976 1058 1105 1064 1027 1076 1106 1093 1123 1241 1259 1131 1003 1020 1000 894 823 956 1108 1114 1030 1033 1037 954 882 955 1057 1072 1011 951 928 861
2863 861 859 1002 1105 1063 956 936 985 948 911 960 1080 1112 1039 966 941 915 933 951 972 992 1010 1028 1025 978 973 1056 1159 1175 1215 1299 1278 1170 1126
2859 1126 1226 1350 1330 1189 1135 1113 1048 998 1035 1109 1038 927 960 1101 1198 1193 1145 1095 1045 1039 1120 1206 1205 1158 1155 1195 1191 1160 1216 1310 1317 1300 1284 1317 1263
2855 1263 1204 1232 1340 1362 1347 1477 1674 1726 1704 1682 1719 1669 1517 1452 1443 1434 1337 1328 1406 1483 1561 1639 1716 1706 1617 1616 1647 1591 1429 1268 1258 1248 1238
2851 1238 1228 1291 1354 1344 1335 1296 1258 1263 1355 1394 1288 1178 1214 1381 1403 1277 1239 1346 1452 1404 1356 1368 1380 1348 1316 1319 1321 1280 1239 1300 1361 1320 1279
2847 1279 1300 1322 1301 1279 1246 1214 1225 1235 1311 1386 1389 1391 1398 1404 1449 1493 1532 1484 1364 1330 1330 1329 1241 1240 1294 1348 1328 1309 1430 1464 1386 1309 1400 1492 1510 1529 1508
2842 1508 1488 1467 1447 1519 1592 1533 1475 1537 1599 1618 1637 1635 1634 1589 1544 1532 1520 1575 1630 1722 1726 1687 1735 1845 1956 1883 1810 1775 1740 1705 1670 1727 1783 1796 1809
2838 1809 1775 1741 1701 1749 1816 1884 1826 1768 1790 1812 1790 1769 1799 1830 1789 1747 1868 1989 2037 2085 2226 2368 2428 2401 2324 2246 2163 2081 2017 1953 1933 1913
2834 1913 2009 2104 2156 2209 2280 2351 2379 2406 2318 2230 2142 2054 2027 2001 1931 1861 1848 1835 1822 1808 1858 1907 1913 1919 1935 1952 1867 1782 1789 1796 1737 1677 1735 1881 1983
2830 1983 1998 1994 1990 1980 1971 2109 2247 2280 2225 2154 2169 2203 2237 2253 2269 2212 2156 2128 2100 2116 2132 2202 2271 2297 2323 2353 2382 2339 2296 2326 2356 2391 2339 2334 2328 2317
2826 2317 2306 2370 2434 2474 2427 2383 2339 2385 2432 2471 2423 2351 2280 2284 2289 2360 2432 2575 2631 2604 2578 2638 2697 2654 2612 2651 2690 2657 2624 2712 2800 2783 2679 2665
2821 2665 2739 2850 2875 2854 2834 2715 2683 2797 2910 2898 2799 2768 2882 2964 2958 2904 2938 2960 2983 2980 2977 2974 2971 3062 3154 3197 3154 3172 3276 3336 3250 3169 3088 3070
2817 3070 3052 3099 3146 3126 3105 3121 3225 3328 3344 3357 3371 3433 3408 3387 3454 3515 3489 3480 3471 3462 3453 3504 3642 3713 3697 3630 3650 3717 3784 3820 3856 3892 3928 3983 4038
2813 4038 4026 4014 3985 4044 4127 4209 4277 4344 4411 4478 4602 4726 4978 5374 5870 6220 6200 5802 5333 5010 4813 4704 4695 4774 4858 4854 4875 4895 4915 4849
2809 4849 4770 4692 4709 4727 4794 4860 4883 4906 4880 4853 4831 4810 4827 4931 5078 5139 5164 5190 5260 5242 5215 5188 5204 5220 5231 5329 5428 5439 5406 5373 5413 5453 5480
2805 5480 5593 5730 5868 5930 5993 6128 6263 6380 6497 6460 6422 6373 6410 6471 6532 6574 6616 6759 6903 6959 7014 7070 7125 7163 7200 7282 7363 7377 7391 7405
2802 7405 7419 7500 7582 7735 7889 7979 8068 8163 8258 8439 8707 9004 9302 9623 10031 10579 11215 11779 12198 12507 12728 12874 13021 13277 13679
2799 13679 14161 14788 15601 16558 17607 18743 20117 21694 23366 25037 26903 29030 31395 34136 37735 42698 49442 58596
2796 58596 71202 88425 111010 138966 170691 201631 224560 232709 224074 202924 176786 152245 132877 119810
2795 119810 113032 112090 116658 126947 143379 165648 191765 217155 234929 238154 224163 196728 163916 132934 107292
2793 107292 87370 72491 61591 53290 46411 40614 35890 32016 28578 25443 22743 20359 18121 16002 14202 12701
2791 12701 11460 10486 9832 9332 8832 8468 8307 8244 8035 7649 7263 6850 6349 5744 5225 4846 4467 4155 3930 3705 3481 3251 3109
2788 3109 3019 2843 2660 2622 2648 2586 2497 2407 2399 2246 1957 1756 1714 1673 1619 1566 1556 1546 1525 1504 1488 1473 1411 1436 1461 1399 1312 1224 1204 1184 1092 1000
2784 1000 1039 1078 1107 1136 1165 1194 1190 1185 1143 1100 1026 1039 1095 1064 1015 965 982 1000 952 904 1010 1116 1202 1200 1152 1103 1039 1062 1091 1032 920 894 974 1054
2780 1054 1036 1017 999 981 937 892 920 949 957 965 1046 1127 1106 1085 1063 1042 1015 987 960 932 938 945 951 957 919 881 848 816 838 947 990 945 852 846 936 939 883 827
2775 827 897 966 927 889 855 822 770 805 892 980 1006 1033 1185 1337 1399 1374 1326 1277 1237 1197 1200 1203 1171 1140 1113 1087 983 966 1117 1269 1330 1390 1494
2771 1494 1511 1388 1179 1065 1038 1049 1060 1076 1092 1066 1040 1015 989 937 885 935 984 981 977 1040 1103 1107 1023 945 866 767 668 758 847 875 902 930 958 949 940
2767 940 937 934 958 1068 1232 1395 1410 1426 1479 1533 1487 1353 1293 1319 1368 1417 1472 1527 1558 1590 1728 1952 2130 2221 2317 2413 2473 2446 2304 2075 1798
2763 1798 1607 1554 1589 1537 1398 1308 1305 1288 1271 1297 1323 1382 1354 1331 1308 1272 1237 1268 1300 1329 1272 1191 1110 1097 1084 1071 1059 1072 1085 1141 1198 1255 1313 1414
2759 1414 1515 1542 1569 1634 1699 1672 1557 1486 1502 1535 1569 1564 1559 1493 1426 1465 1591 1732 1786 1822 1858 1939 2020 2049 1990 1794 1598 1439 1281 1143 1004
2755 1004 919 920 930 941 1024 1107 1096 997 966 1022 1080 1051 1003 956 821 686 603 608 592 577 567 557 617 678 694 711 665 619 675 731 707 683 702 722
2751 722 706 690 692 781 859 851 824 797 789 781 841 900 959 932 909 887 885 884 839 793 746 699 725 750 696 642 635 716 787 771 737 703 675 648 615 669 740 812
2746 812 883 955 1013 984 961 937 934 930 854 778 798 818 839 859 909 960 988 1017 951 884 841 885 917 948 964 979 966 954 1008 1063 1098 1046 1021 996 1007 1019
2742 1019 1046 1074 1115 1069 1024 978 960 855 772 776 819 863 868 873 952 1030 1007 984 988 992 974 956 981 1006 1031 1056 1048 1041 1072 1103 1089 988 954 1007 1089 1084 1002
2738 1002 921 951 981 989 997 937 876 834 879 932 898 845 793 845 898 877 857 889 920 930 939 924 908 826 743 711 766 816 865 879 893 928 964 943 923 902
2733 902 882 877 873 993 1114 1172 1143 1120 1096 1042 988 957 1013 996 980 958 1023 1032 955 850 891 984 1077 1107 1136 1160 1183 1133 1084 1084 1084 1011 938 948 959 969
2729 969 980 1006 1032 1057 1083 1000 917 881 932 960 900 851 802 799 796 860 925 996 980 1008 1036 1077 1031 913 882 946 1011 1008 1005 992 979 944 909 951 993 963
2724 963 932 952 973 897 821 803 872 914 956 967 978 988 999 991 984 976 968 1044 1120 1152 1184 1162 1140 1190 1240 1304 1368 1453 1538 1669 1800 1926 2052 2187
2720 2187 2235 2225 2215 2178 2054 1931 1894 1889 1884 1792 1787 1859 1932 1908 1884 1962 2039 2045 2050 2019 1989 1885 1782 1601 1419 1290 1248 1241 1235 1212 1190 1219 1249 1153
2716 1153 1057 1020 1069 1070 1070 981 892 822 898 1008 1118 1135 1153 1146 1139 1088 1037 1075 1112 1150 1187 1278 1369 1387 1406 1550 1694 1795 1895 2002 2108 2112 2117
2712 2117 1981 1846 1783 1721 1702 1683 1663 1644 1812 1979 2135 2292 2361 2256 2147 2039 1997 1955 1812 1668 1637 1606 1575 1544 1470 1395 1321 1247 1296
2708 1296 1345 1321 1298 1351 1404 1327 1249 1263 1278 1292 1306 1313 1321 1285 1249 1183 1117 1123 1130 1163 1196 1185 1175 1099 1023 1048 1074 1088 1103 1045 987 1016 1046 1076 1106 1158
2704 1158 1210 1161 1111 1101 1090 1036 982 1030 1078 1082 1086 1051 1015 913 810 878 1033 1164 1121 1101 1081 1050 1019 1031 1043 1099 1154 1148 1142 1136 1129 1144 1159 1101 1044
2700 1044 953 863 903 944 963 982 1000 1019 1036 1052 1068 1084 1075 1065 1056 1046 1055 1064 1073 1081 1071 1061 1051 1041 1067 1094 1076 1059 1164 1269 1321 1286 1223 1160 1048 1023
2695 1023 1084 1233 1344 1367 1323 1280 1230 1181 1214 1247 1257 1179 1116 1052 1085 1118 1141 1163 1185 1207 1281 1355 1275 1194 1152 1197 1285 1287 1233 1180 1165 1150 1206 1261
2691 1261 1273 1284 1302 1321 1339 1357 1375 1392 1366 1340 1396 1452 1470 1487 1507 1614 1721 1740 1656 1571 1553 1536 1532 1528 1481 1433 1461 1489 1517 1544 1631 1718 1674 1630
2687 1630 1586 1542 1498 1454 1468 1482 1539 1596 1637 1678 1646 1614 1627 1639 1652 1664 1695 1726 1756 1787 1873 1960 1941 1835 1743 1737 1750 1763 1840 1917 2000 1995 2019 2043 2061
2683 2061 2079 2138 2197 2212 2228 2211 2193 2176 2159 2180 2201 2179 2157 2136 2115 2173 2231 2287 2430 2568 2618 2558 2411 2264 2117 2090 2063 2035 2008 1962 1916 1913
2679 1913 1910 1957 2004 2057 2022 2016 2010 2072 2133 2219 2304 2288 2271 2231 2190 2154 2119 2131 2231 2287 2256 2267 2277 2244 2211 2176 2227 2279 2244 2239 2234 2224 2214 2264 2313 2369
2674 2369 2337 2277 2217 2224 2231 2275 2319 2267 2215 2253 2378 2498 2472 2420 2455 2487 2431 2402 2460 2556 2564 2482 2399 2413 2427 2473 2519 2571 2535 2476 2417 2455 2492 2526 2561
2670 2561 2644 2641 2603 2566 2654 2742 2792 2842 2848 2854 2859 2863 2873 2883 2860 2923 3010 3097 3082 3068 3125 3183 3117 3050 2984 2917 2941 2966 3034 3101 3196 3291 3392 3405 3370 3335
2666 3335 3294 3254 3227 3200 3245 3291 3333 3375 3393 3325 3252 3180 3175 3170 3174 3178 3254 3331 3343 3355 3372 3390 3320 3337 3378 3418 3468 3518 3617 3628 3520 3412 3458 3504 3541
2661 3541 3577 3575 3573 3522 3558 3676 3794 3735 3677 3701 3811 3884 3956 3961 3966 3957 3948 4040 4132 4127 4123 4185 4247 4256 4178 4172 4254 4323 4392 4467 4542 4581 4620 4660 4699 4832 4964
2657 4964 5097 5229 5347 5465 5534 5603 5656 5621 5533 5446 5414 5382 5355 5328 5264 5286 5361 5437 5507 5578 5649 5719 5646 5573 5501 5428 5395 5362 5334 5307 5357 5495
2653 5495 5632 5683 5633 5584 5659 5735 5778 5822 5792 5763 5693 5622 5712 5802 5884 5967 6050 6133 6218 6303 6388 6472 6475 6478 6524 6570 6588 6606 6697 6787 6815 6842 6941 7041
2649 7041 7073 7105 7232 7360 7464 7480 7496 7599 7810 8022 8166 8310 8521 8733 8994 9254 9488 9809 10249 10776 11259 11742 12187 12632
2646 12632 12932 13233 13542 13852 14218 14729 15394 16147 17020 18038 19296 20757 22260 23909 25815 28041 30603 33600 37385
2644 37385 42244 48549 56800 67631 81802 99863 121843 146938 172875 196184 212902 219964 216311 203459 185002
2642 185002 165264 147879 134956 127347 125278 128754 137647 151446 168931 187837 204704 215559 217249 208630 191052
2640 191052 167753 142675 119136 98976 82736 69940 59903 51916 45409 39998 35313 31172 27524 24363 21637
2638 21637 19229 17140 15327 13834 12596 11562 10740 10121 9617 9112 8702 8379 7997 7614 7135 6656 6181 5706 5187 4668 4298
2636 4298 3929 3748 3567 3367 3168 2969 2770 2691 2612 2533 2454 2375 2296 2217 2138 2058 1977 1897 1817 1748 1678 1609 1540 1529 1517 1506 1495 1437 1380 1322 1265
2632 1265 1174 1083 1123 1163 1119 1075 1103 1131 1148 1165 1197 1315 1403 1346 1216 1086 1054 1023 1036 1048 1011 973 892 811 830 848 866 885 948 1010 1030 1049 982
2628 982 915 920 926 956 985 1015 1045 964 882 902 922 885 848 811 774 775 777 778 779 740 702 663 624 698 772 845 919 866 812 759 705 734 764 793 822 768 713 659
2623 659 605 614 624 633 643 661 678 740 801 782 763 744 725 810 896 879 863 789 715 714 713 716 719 723 726 726 725 798 870 805 740 723 792 835 791 728 666 668 670 672 674 743
2618 743 811 885 871 757 643 654 752 837 776 681 673 695 717 701 684 729 774 818 863 812 762 729 784 825 779 744 708 739 769 843 916 949 981 970
2614 970 959 912 864 811 846 888 930 1012 1094 1101 963 857 839 889 939 894 848 848 849 867 973 1081 1103 1048 992 1003 1013 951 888 827 765 805 846 889
2610 889 933 934 934 939 945 849 753 741 729 783 838 918 910 850 790 793 795 798 800 864 927 917 908 834 760 681 689 762 834 869 904 892 880 869 857 832 807 826 845 862
2605 862 878 895 912 935 957 936 914 940 966 920 873 918 963 1007 1052 1035 1017 897 778 772 766 716 667 654 640 671 701 794 887 908 929 909 890 871 851
2600 851 725 600 474 348 369 390 454 519 538 558 475 393 383 373 407 441 510 579 604 630 607 585 664 743 725 708 690 672 752 833 782 732 749
2596 749 766 783 800 766 732 698 664 684 705 681 658 684 709 691 674 648 623 597 572 620 668 644 619 654 689 767 845 833 820 764 708 806 904 959 1014
2592 1014 1065 1116 1123 1131 1092 1053 1086 1120 1140 1160 1107 1054 1067 1079 1092 1104 1186 1267 1218 1169 1124 1080 1036 991 949 908 866 824 846 869 891 913 879 846 813
2588 813 779 852 925 922 832 811 878 872 779 665 637 686 735 698 661 667 673 689 705 721 738 677 617 601 584 612 641 669 697 722 746 699 651 667 683 699
2583 699 716 709 703 697 690 681 672 663 654 704 755 762 770 723 677 674 671 708 745 738 732 715 698 611 524 589 697 757 730 734 737 722 663 607 638 689 741 797 853 837 778 731
2578 731 771 809 760 655 550 544 538 614 733 804 788 706 624 667 710 739 769 798 828 866 904 870 836 824 812 801 789 787 785 783 781 802 824 827 743 644 631
2574 631 666 700 740 781 815 850 808 679 550 507 623 739 817 895 897 899 939 979 1001 936 847 759 763 768 700 632 667 702 737 771 793 814 792 770 746
2570 746 722 698 674 714 753 717 594 561 616 708 714 737 761 779 797 744 692 712 732 747 762 778 793 817 840 791 742 704 665 670 675 706 736 766 797 782
2565 782 767 752 737 719 701 785 869 939 1008 1077 1146 1264 1382 1501 1619 1682 1745 1785 1738 1626 1514 1440 1367 1368 1370 1444 1518 1590 1662 1633 1603 1661 1719
2561 1719 1782 1758 1674 1590 1434 1277 1268 1347 1358 1282 1153 1111 1117 1123 1110 1097 1066 947 837 814 839 863 818 774 729 684 708 733 757 781 798 814 740
2557 740 666 533 574 676 779 767 756 787 819 789 760 730 700 744 788 832 876 820 763 750 737 737 737 737 737 683 630 649 668 728 789 777 766 717 667
2553 667 720 773 742 711 680 649 698 747 796 845 830 815 873 930 926 922 918 914 906 899 848 797 753 709 767 825 808 791 775 758 811 863 785 706 674 642 609 577
2548 577 615 653 692 730 680 630 624 618 637 657 676 695 676 657 681 705 779 852 853 854 836 819 802 784 810 835 860 885 881 877 873 869 879 889 855 821 784 748 712
2543 712 675 642 608 580 552 564 663 762 775 765 755 740 725 734 744 756 768 752 780 794 721 574 515 561 607 613 619 669 718 808 898 965 944 860 776 730
2539 730 684 710 737 807 877 895 913 887 861 784 708 733 759 733 708 726 744 785 825 770 715 688 748 851 867 855 843 825 807 778 748 820 892 863
2535 863 834 848 862 853 844 835 826 848 871 894 916 858 800 814 829 821 813 805 797 816 836 855 874 823 773 795 817 810 803 796 789 854 919 882 846 838 831 853 832 779 813 847
2530 847 795 716 682 748 814 813 812 811 811 795 780 838 895 901 907 913 919 981 1042 1022 915 798 681 689 697 693 688 684 679 677 675 672 670 679 687 652 618 625 632 712 792 754 716 722 728
2524 728 755 783 767 752 742 733 724 714 664 614 636 658 679 699 733 811 866 834 703 617 633 736 801 779 742 750 771 792 796 801 849 897 890 882 875 867 790 713
2520 713 683 740 797 767 696 712 786 817 776 735 727 720 713 705 732 759 714 668 696 723 751 778 730 681 632 584 653 722 750 778 794 853 898 857 766 763 837
2515 837 910 926 942 914 887 868 850 831 813 777 742 807 873 906 939 951 876 711 589 601 700 786 785 765 746 704 662 663 665 662 660 658 655 686 716 746 777
2510 777 805 833 818 803 815 827 839 851 854 857 903 950 892 834 820 806 743 680 719 757 811 864 844 825 792 759 769 780 751 721 735 750 745 740 778 817 774
2506 774 731 761 790 722 653 686 719 748 777 763 749 755 761 860 958 1003 903 792 769 752 735 724 713 688 663 638 613 626 639 653 666 738 810 882 955
2502 955 1012 1070 968 865 830 795 760 726 720 714 752 790 792 795 797 799 796 793 790 787 787 787 787 786 761 735 753 772 809 846 752 659 666 673 724 775 737 700 663 625 607 588
2497 588 671 754 752 749 747 745 801 857 869 881 878 876 829 782 793 803 769 736 701 666 761 857 855 854 781 707 679 650 665 681 687 693 743 792 894 995 1024 1053 989
2492 989 926 862 799 795 792 745 698 752 806 860 914 911 908 905 902 888 875 861 848 896 944 993 1041 994 946 899 851 835 818 874 930 1029 1127 1153 1179 1235 1290 1272
2487 1272 1255 1139 1024 982 939 916 893 869 846 907 968 957 945 999 1053 1006 958 928 899 870 841 785 729 717 705 705 705 777 850 856 862 796 729 792 855
2483 855 917 980 923 866 852 839 865 892 918 945 930 915 856 797 795 792 790 788 774 760 789 819 846 873 856 840 880 920 916 912 879 847 886 926 882 838 794 750
2478 750 768 785 802 819 782 745 697 735 812 802 797 792 865 850 784 717 769 820 829 837 765 693 616 626 639 652 628 603 669 736 759 782 756 729 703 676 665
2474 665 654 686 719 806 892 907 921 945 970 892 815 815 815 815 815 788 761 734 707 687 667 719 772 724 675 674 760 886 924 886 848 785 722 706 777 881
2469 881 898 839 780 782 784 785 787 841 895 905 916 874 833 792 750 740 729 714 698 713 642 571 587 690 792 717 642 615 676 754 832 898 876 772 668
2465 668 695 721 703 686 694 703 711 719 700 680 660 640 684 728 766 805 865 838 705 573 561 636 705 775 853 932 885 839 817 883 906 841 807 773 835 897
2461 897 952 1006 936 865 783 787 786 785 746 707 669 630 723 817 834 764 735 793 845 811 812 813 808 803 780 757 734 710 746 782 818 853 810 766 795 825 819 814 808 803
2456 803 864 925 914 903 851 798 790 781 823 865 863 861 864 867 870 873 898 923 876 829 902 974 965 869 801 733 664 596 638 768 854 853 872 891 954 930 885 839 832 825
2451 825 863 900 894 887 858 829 844 859 853 848 843 837 882 926 898 870 915 960 981 916 813 711 705 699 723 747 727 707 740 774 740 706 678 737 796 767 724 681
2446 681 677 672 710 748 787 825 866 907 948 989 954 920 885 850 791 731 716 700 689 678 668 657 701 744 721 697 721 831 941 964 881 798 762 814 870
2442 870 927 888 848 818 788 763 738 714 777 791 806 815 823 905 986 915 845 792 826 879 844 763 681 724 766 765 764 819 874 853 745 705 753 789 825 819 813
2437 813 769 724 687 738 788 751 698 645 688 731 761 791 821 851 843 835 827 819 753 686 664 642 635 628 664 701 721 742 807 871 907 944 907 871 865 859 853 846 831 816
2432 816 801 785 832 879 894 837 732 628 591 554 619 683 675 667 707 747 787 827 822 817 855 894 887 880 873 866 843 820 757 693 720 791 810 756 745 806 866 852
2428 852 832 855 894 861 798 808 873 939 938 938 937 937 850 763 748 733 684 635 586 537 512 486 563 639 742 846 819 748 768 860 927 893 849 878 947 944
2423 944 907 914 962 967 912 900 930 916 852 788 795 801 813 826 882 938 922 907 891 875 842 809 848 888 853 819 828 837 840 843 802 761 722 682 643 604 654 705 799
2419 799 893 938 984 986 988 886 785 785 785 780 776 815 854 788 723 658 592 683 774 821 868 852 835 819 803 853 904 881 859 837 815 793 771 736 701 768 835
2414 835 850 864 879 893 839 786 804 823 907 990 1030 1069 1062 1055 1004 954 911 868 869 870 825 781 736 691 708 725 742 759 684 609 607 605 691 777 790 803 828 854
2410 854 835 817 808 799 790 780 777 774 771 767 775 782 790 798 798 799 800 801 824 847 914 981 932 882 833 783 772 762 795 828 778 728 780 832 815 799 826 854 812 770 729 687
2404 687 688 689 690 691 750 810 869 928 911 894 877 860 826 792 758 724 724 724 768 812 848 883 875 867 880 893 906 919 881 843 878 912 853 795 779 764 837 910 939
2400 939 968 969 969 1042 1115 1089 1063 964 865 785 705 726 747 722 697 744 792 772 753 777 801 817 832 999 1165 1196 1081 955 917 916 916 960 1003 934 778
2395 778 714 795 909 935 888 842 822 802 781 761 791 821 807 794 820 846 872 898 841 784 799 814 808 802 795 789 845 902 856 811 787 763 811 859 924 989
2391 989 952 915 929 942 913 883 887 892 853 813 760 706 754 802 835 869 830 791 828 865 829 794 755 717 780 843 944 1044 1014 984 942 900 858 816 767
2387 767 717 828 938 917 895 873 851 839 826 770 713 742 771 799 828 828 829 786 743 766 790 770 751 701 651 674 697 757 817 877 937 882 826 873 919
2382 919 856 794 833 871 870 869 868 867 826 784 743 702 698 695 764 833 915 997 890 783 800 816 876 936 878 819 834 848 854 860 793 727 760 792 825 858 856 854 853
2378 853 851 826 801 820 839 902 965 955 946 889 831 817 803 800 797 794 791 800 808 817 825 875 924 901 878 883 889 895 901 909 917 925 932 967 1001 963 925 972 1018 992 966 945 924 947
2372 947 969 977 984 948 912 862 813 764 715 783 851 875 899 885 872 820 768 707 733 782 832 778 725 743 762 757 753 792 830 881 931 938 944 958 972 942 913 847
2368 847 780 757 735 724 714 777 839 819 798 845 891 896 814 775 823 906 989 1028 1067 1039 924 809 781 793 805 823 840 803 766 686 605 610 615 692 770
2363 770 810 850 846 843 829 815 801 787 793 799 805 811 774 736 772 807 775 742 710 678 670 662 700 826 897 880 869 858 850 754 697 727 806 797 751 791 882 972 908
2359 908 844 780 716 676 723 796 869 875 881 903 925 875 825 738 652 618 671 731 791 783 775 776 776 777 777 816 856 828 800 764 816 861 907 892 877 862 846 835 823
2354 823 855 887 897 907 917 927 889 851 802 840 894 861 811 760 772 785 798 810 779 747 715 683 750 817 883 950 941 931 960 988 968 861 758 802
2350 802 885 881 833 785 810 834 785 737 683 629 652 761 865 881 874 867 902 849 744 639 687 736 741 745 740 735 730 725 783 841 904 880 828 775 717 658 705
2345 705 751 836 920 939 870 865 947 1037 982 884 786 774 762 701 727 770 812 759 705 792 879 885 803 759 715 739 762 810 859 835 811 853 896 837 778 786
2341 786 794 706 618 608 686 787 888 859 830 802 773 801 828 783 738 785 833 808 783 808 833 858 883 863 844 824 805 798 791 783 776 791 805 776 747 797
2336 797 847 853 859 925 991 927 862 870 877 841 805 833 860 841 734 685 724 809 895 934 974 1007 1041 1075 1022 916 810 820 830 797 763 761 758 756 753 756 759 762 765
2331 765 832 900 972 958 905 851 865 879 843 806 726 646 720 794 816 750 705 659 681 703 718 732 747 762 778 794 809 825 811 797 783 770 768 766 697 629
2327 629 632 723 765 807 860 913 972 944 922 901 875 848 807 767 770 773 854 935 943 952 933 914 895 876 820 764 708 652 699 746 793 840 890 940 921 901 893 929
2322 929 921 827 761 782 845 865 874 883 889 895 848 802 799 796 808 820 832 844 866 887 864 842 861 881 900 919 993 1068 1093 1030 905 823 813 803 823 843 863 882
2318 882 892 901 911 920 907 894 881 867 827 787 791 794 810 825 744 663 681 786 850 827 775 768 779 790 783 863 963 1018 1030 1042 1052 1061 1083 1104 1083 1019 944
2313 944 956 984 968 934 901 864 828 816 805 794 783 744 706 740 774 821 869 873 877 906 935 951 923 893 949 965 894 802 798 868 895 884 917 972 939 870
2309 870 801 799 797 781 765 793 821 789 756 796 836 879 923 864 806 799 792 828 864 856 848 839 831 778 725 744 763 842 920 926 931 897 862 789 717 667 705 796 887 908
2304 908 930 909 887 946 1005 1021 1036 992 948 910 871 746 707 779 852 876 900 924 948 924 899 874 849 842 836 762 688 692 782 916 963 916 868 859 850 955
2300 955 1061 1090 1032 923 901 926 952 966 981 951 922 869 815 863 911 856 801 752 703 689 762 858 955 978 1002 983 963 928 893 859 824 844 863 883
2295 883 903 875 846 861 877 903 929 911 894 853 812 771 730 734 737 784 831 773 715 651 675 770 865 913 874 806 739 666 593 573 554 636 718 765 813 816
2291 816 820 835 849 936 1024 977 931 928 926 914 902 891 879 902 924 947 970 973 975 935 894 799 705 770 836 795 754 757 759 783 806 830 854 850 846 843 839 823 807 835
2286 835 863 845 828 810 792 739 686 705 724 812 900 916 931 910 889 867 846 849 851 854 856 860 864 912 960 932 903 831 759 746 733 720 707 717 726 809 891 905
2281 905 919 889 860 818 777 808 839 841 842 843 845 840 835 873 912 819 726 677 627 651 674 741 808 775 742 811 880 917 954 991 1028 1008 989 926 864 780 696 743
2277 743 790 755 720 728 736 697 658 773 888 896 817 804 879 905 844 788 819 817 815 818 821 800 780 806 920 1009 1012 996 980 902 824 819 814 727 640 605 658 690
2272 690 721 758 796 834 872 866 861 869 877 885 893 902 911 919 928 947 967 914 860 839 817 839 860 850 840 830 820 775 729 809 889 939 901 902 990 1069 1060 1034 1007 968 929
2267 929 884 927 989 1050 1016 981 969 958 946 934 865 797 723 736 781 826 804 781 783 785 831 877 854 832 809 787 728 670 742 814 862 909 913 917 857 797 833
2263 833 869 871 785 743 789 833 877 854 831 811 791 843 896 928 961 994 1027 991 955 919 882 795 707 663 619 665 711 800 889 886 882 835 788 779 770 761 752 778
2258 778 804 830 855 930 1004 947 890 864 837 810 784 789 794 799 804 776 749 721 693 690 688 685 682 714 745 776 808 792 776 760 745 763 782 801 820 814 809 847 885 900
2253 900 915 929 944 925 905 886 866 849 832 858 885 971 1058 1013 969 926 883 840 797 819 840 818 796 807 819 729 639 727 816 832 848 774 701 627 553
2249 553 610 666 678 691 761 830 856 883 863 844 869 893 897 901 862 822 840 858 876 894 906 918 887 856 860 864 935 1007 1101 1108 1010 912 793 760 862 963
2244 963 1051 1051 1057 1063 1012 961 909 858 822 785 737 777 884 903 847 790 779 768 757 745 800 854 902 951 934 829 792 842 932 936 872 896 963 1031 1002 974
2240 974 937 900 814 815 850 886 853 821 840 859 823 875 953 945 841 823 893 963 908 852 854 856 858 860 907 953 898 843 881 919 884 849 828 806 785 764 831
2236 831 899 923 947 980 1013 1002 992 970 948 926 904 962 1020 976 933 907 880 854 828 823 819 814 810 780 749 762 776 791 806 821 836 936 1037 1085 1046 991
2231 991 936 920 903 971 1039 1054 983 920 857 890 924 965 1006 1003 1001 1052 1103 1082 1060 1016 973 929 885 868 850 905 961 991 1022 980 938 908 879 806 733 769
2227 769 805 798 791 802 814 826 838 847 857 828 800 818 923 1028 1046 1032 1018 998 979 960 940 921 902 886 871 855 840 834 827 894 960 1044 1128 1078 940 873
2222 873 892 930 968 974 981 988 995 968 940 913 885 951 1017 981 945 924 903 882 860 890 920 906 893 871 849 871 892 934 976 942 820 734 735 812 890 875 860
2218 860 845 830 823 815 764 713 730 747 764 781 803 826 848 870 858 845 789 733 754 776 847 831 814 796 846 896 858 820 826 831 827 823 863 903 920 937 910 883
2213 883 892 901 910 919 940 962 910 859 882 906 929 952 961 971 937 903 868 833 900 966 949 931 913 896 942 988 933 878 887 897 907 917 913 908 859 811 812 814 815 817 803
2208 803 790 777 764 756 748 740 732 753 775 796 817 820 823 826 829 867 906 944 983 948 913 878 843 893 942 919 896 927 959 946 934 905 876 846 817 819 820 822 823 879 935
2203 935 890 844 819 795 871 948 986 1024 989 954 944 933 923 912 873 833 836 840 855 869 884 898 861 823 829 835 855 874 966 1059 1014 970 970 969 957 944 975 1006
2198 1006 991 976 961 945 933 920 908 895 842 788 735 682 712 742 772 803 831 860 889 918 898 878 930 983 1012 1042 1029 1015 969 922 876 829 867 904
2194 904 941 978 939 900 861 822 838 855 871 887 828 768 780 793 770 747 796 846 928 1010 961 913 891 869 949 1029 949 869 891 913 983 1053 1050 1047 943
2190 943 839 807 775 745 715 757 800 796 792 788 784 829 874 846 818 811 804 840 877 919 961 901 841 864 887 910 933 935 938 897 856 891 927 889 852 833 813 794
2185 794 775 774 773 772 771 845 920 951 982 902 822 873 924 910 897 883 870 943 1015 986 957 968 978 1032 1086 1043 999 1029 1058 1051 1044 1037 1030 1043 1056 1070 1083 1021 959
2181 959 970 981 930 878 870 862 948 1034 989 944 888 831 847 863 875 887 900 912 922 933 943 953 939 924 982 1040 1020 1000 980 960 933 905 922 938 884 831
2176 831 820 810 823 836 922 1008 991 974 957 940 883 825 957 1088 1107 1127 1045 963 903 843 884 926 951 976 1001 1026 1012 999 985 971 997 1023 1049 1075
2172 1075 1044 1012 980 949 923 896 870 844 878 911 945 978 1019 1060 999 939 864 790 788 787 811 836 904 972 962 951 941 930 893 855 817 779 732 686 682 679
2168 679 715 751 830 909 959 1008 1014 1019 957 895 905 915 978 1040 1102 1165 1093 1021 949 878 865 852 883 914 858 803 820 837 836 835 791 746 748 750 751 753 741 729 818
2163 818 908 920 932 901 870 912 954 924 894 915 936 958 979 953 926 943 960 961 962 1006 1050 1008 965 922 879 889 899 865 831 861 890 919 949 892 835 850
2158 850 866 909 951 950 949 912 876 840 803 812 822 904 986 972 959 1018 1078 1052 1026 957 888 938 988 1037 1087 1142 1198 1122 1047 983 919 957 995 939 882 927
2154 927 971 938 905 828 751 723 694 825 956 950 944 938 932 935 938 985 1031 956 881 908 935 993 1052 1080 1152 1237 1235 1182 1130 1055 980 1036 1092 1083 1074 1109 1144 1174
2149 1174 1204 1234 1264 1198 1133 1111 1090 1064 1038 1053 1068 1063 1014 939 950 989 985 967 949 951 954 1024 1094 1122 1063 999 1022 1053 997 951 906 866 826 826 827 849 827
2145 827 821 902 966 987 965 943 954 964 972 980 960 897 850 890 976 1018 988 958 961 963 966 968 961 953 902 851 842 833 891 949 956 876 818 803 784 721 675 716 857 911
2140 911 889 868 875 882 889 896 973 1050 1103 1069 1012 955 936 916 892 867 834 888 976 1021 1022 1024 966 909 873 923 1014 1061 1008 912 898 971 1017 1020 1021 1022 1069 1028 923
2135 923 818 890 963 946 842 776 797 871 857 826 794 817 839 818 797 792 787 849 911 935 871 763 743 788 833 811 789 789 789 832 876 762 647 557
2131 557 553 626 699 734 769 803 837 828 819 862 905 948 992 951 911 871 831 844 857 909 960 961 874 744 701 762 822 888 954 968 982 952 923 910 897 928
2127 928 959 983 1008 1032 1057 1011 965 962 960 1003 1047 1047 1047 956 864 819 861 926 904 835 766 803 841 878 916 875 835 838 841 899 957 1016 1074 1037 1000 963 926 918
2122 918 909 847 871 944 930 869 808 807 806 849 891 902 912 880 847 860 873 886 899 881 863 846 828 853 878 859 840 886 932 934 936 949 961 931 900 913 927
2118 927 940 954 895 837 851 865 857 849 842 834 930 1027 1021 1016 991 965 940 915 845 775 807 839 937 1035 1031 1028 1013 998 939 880 850 821 835 849 827 805 826 848 883
2113 883 918 953 989 1051 1114 1104 1094 1086 1079 999 919 923 927 888 848 901 954 906 857 888 918 905 892 850 808 766 724 777 829 882 934 943 952 860 767 790 813 792
2108 792 771 771 771 771 771 778 784 834 884 909 934 915 896 857 818 779 739 862 984 976 967 965 963 961 959 1031 1102 1048 995 1007 1107 1163 1132 1067 1001 930 859 896 932
2103 932 968 1004 966 928 933 938 982 1025 1025 1025 1044 1064 1039 1015 1011 1007 1004 1000 997 995 948 902 913 924 891 858 829 800 771 742 730 719 707 695 738 780 779 779 839 899 965
2098 965 943 941 939 931 923 897 870 888 905 906 907 908 909 992 1074 1051 941 877 901 942 984 990 996 959 922 923 924 881 838 844 849 898 947 903 858 814 770 844 918 969 933
2093 933 929 926 960 995 981 967 954 940 979 1018 1014 1009 1015 1020 1025 1031 1044 1058 1072 1085 1093 1100 1107 1115 1082 1050 974 897 906 914 928 854 792 729 792 855 908 962 943 924 972 1020
2088 1020 1068 1116 1082 1049 1015 982 989 996 1003 1010 1020 1029 942 856 824 880 886 893 888 883 878 873 922 971 924 878 857 923 951 892 832 859 875 891 905 919 933 947 920 892
2083 892 864 836 921 1006 1067 1041 1015 988 961 934 886 924 962 914 872 831 856 882 990 1097 1185 1127 1021 914 871 828 755 682 681 681 759 837 872 907
2079 907 940 974 1007 1040 1032 1023 1069 1028 932 923 962 1000 924 848 897 946 949 863 778 781 839 897 888 880 862 844 826 808 770 732 767 802 772 742 712 683 772 862
2074 862 909 955 973 991 1010 1028 957 886 859 831 826 820 815 810 864 919 872 824 860 895 930 965 997 1028 958 888 882 875 869 862 882 902 922 941 942 942 942 943 927 912 897
2069 897 882 839 796 797 797 801 806 810 814 891 968 972 977 977 977 1049 1122 1118 1114 1043 971 993 1101 1175 1104 975 933 993 1052 1066 1081 1022 964 929 895 904 914 874 834 838 842
2064 842 919 996 971 947 915 883 895 907 894 881 941 1001 1019 1038 1099 1161 1085 1008 975 943 929 915 829 742 806 869 932 996 998 1001 1076 1151 1199 1246 1222 1197
2060 1197 1093 989 958 927 997 1068 1139 1210 1223 1236 1249 1262 1266 1269 1375 1480 1802 2123 2372 2476 2607 2826 3036 3159 3164 3169 3168 3167 3151 3135 3099
2056 3099 2918 2672 2426 2273 2120 1881 1643 1514 1473 1408 1342 1288 1233 1200 1254 1303 1352 1310 1268 1226 1184 1068 953 909 866 870 874 922 969 1034
2053 1034 1099 1165 1230 1182 1133 1047 961 891 908 1007 1106 1080 1054 1028 1001 986 970 954 938 914 890 939 988 975 961 948 935 951 967 982 998 968 937 1003
2048 1003 1069 1089 1022 961 900 873 846 824 802 725 734 825 916 909 902 896 889 858 827 868 910 924 938 908 879 810 740 724 794 865 935 915 895 864 920 1019 1032
2044 1032 958 884 878 871 888 905 960 1015 1007 912 861 897 947 997 981 964 994 1024 1036 961 886 898 957 1016 1004 992 1023 1055 1039 1023 1051 1079 1105 1131 1089 1048
2040 1048 952 943 987 1031 1040 1048 1188 1327 1400 1473 1546 1619 1676 1733 1685 1549 1409 1357 1322 1287 1187 1086 1116 1146 1156 1166 1104 1041 993 946 1028 1111 1105
2035 1105 1099 1093 1086 1087 1088 1089 1090 1013 936 931 927 918 910 945 980 895 811 831 939 1045 1064 1065 1065 1040 1014 988 963 894 825 829 833 867 901 891 881 783 685 640 681 738 794
2030 794 812 830 787 744 831 918 891 865 905 945 941 850 802 842 929 1017 1061 1105 1095 998 951 903 902 900 966 1032 1067 1015 969 923 877 830 860 977 1070 1076
2026 1076 977 877 823 769 817 865 850 835 839 929 991 965 893 820 868 917 1003 1090 1058 940 821 790 783 776 775 773 829 885 897 909 891 874 856 839 811
2022 811 782 826 871 898 925 952 979 922 866 876 887 867 761 654 634 628 622 669 803 870 850 812 773 779 784 808 918 981 957 895 920 950 981 967 954
2018 954 965 890 796 702 730 846 912 979 1006 1033 1017 1000 905 811 789 767 761 755 750 744 759 775 857 939 980 934 864 794 797 799 802 805 804 804 803 803 871 940 936 931 878
2013 878 824 765 793 881 969 961 953 928 902 949 996 990 984 1015 1047 1059 984 907 916 934 908 868 829 864 900 930 960 931 815 742 757 780 802 787 772 769 766 804
2008 804 843 831 775 763 837 951 978 987 996 984 971 959 946 963 979 996 1012 1094 1176 1156 1136 1107 1078 1049 1020 968 916 907 898 912 926 940 954 933 912 891
2003 891 870 879 888 897 907 929 951 930 908 939 969 956 943 961 978 1034 1089 1103 1030 995 1047 1016 898 790 828 950 986 924 905 971 1036 973 910 880 850
1999 850 820 789 826 863 900 937 912 888 876 909 909 821 731 728 838 860 808 799 848 854 785 716 741 766 792 817 867 918 837 757 701 645 633 621 712 803
1995 803 841 793 798 804 848 892 891 890 883 964 1058 1152 1121 1090 1034 978 922 867 908 949 990 1031 1031 1031 1032 1032 1037 1041 992 1029 1078 1040 955 870 900 930 888 846 875 904
1990 904 890 876 894 913 888 863 828 793 806 905 988 984 904 824 891 957 951 945 952 960 866 771 759 746 733 720 796 871 893 829 821 814 844 875 899 923 851 779
1985 779 765 838 862 886 915 943 972 1000 976 951 927 902 816 730 667 691 758 824 765 706 745 783 821 859 939 1018 996 974 986 998 967 936 914 893 871
1981 871 849 866 882 899 915 935 956 875 794 792 791 790 789 856 923 947 971 1028 1085 1090 1007 935 863 859 854 923 993 961 929 925 920 874 783 739 782 801 776 730 727 794
1976 794 861 934 921 858 795 834 917 954 905 860 858 870 882 889 896 903 911 930 950 874 797 806 901 997 1006 957 908 898 887 919 951 910 869 907 945 939 934 937 939 942 945
1971 945 988 1032 1026 932 867 845 840 834 885 980 1026 985 939 893 914 935 980 1025 968 911 958 1005 981 913 923 1020 1018 929 857 871 886 814 786 846 904 874 824
1967 824 818 854 890 948 1006 988 883 823 850 918 899 855 855 869 882 895 907 906 861 819 864 959 1054 1098 1142 1113 1084 1052 1020 989 957 898 840 853 867 965
1962 965 1062 1087 1112 1073 1034 995 957 941 925 870 816 784 838 887 936 966 996 955 869 874 965 987 922 874 914 992 983 965 946 909 829 767 792 838 885 909
1958 909 933 914 852 792 819 864 867 862 901 956 1011 1057 1102 1075 1047 1036 1025 945 822 783 889 962 948 941 978 970 875 792 853 922 905 782 703 672 641
1953 641 654 755 861 880 908 1022 1167 1167 1044 965 1011 1058 1061 1063 1023 940 825 798 845 849 806 764 762 760 780 801 823 846 830 858 916 886 785 771
1949 771 862 954 950 947 901 854 805 757 810 863 863 863 906 950 943 935 928 921 992 1064 1136 1207 1210 1213 1216 1218 1125 1033 945 858 850 930 1004 1078 1076 1074 1029 983 954 924 900 877
1944 877 891 993 1094 1109 1086 1063 1089 1029 937 933 953 972 959 1033 1107 1093 974 854 839 911 976 1042 1040 1038 1023 1008 999 990 925 948 1019 1004 923 930 1042
1940 1042 1154 1109 1065 1020 975 921 868 945 1022 1038 1055 975 895 792 776 871 966 918 869 864 859 787 715 666 705 724 742 694 645 589 532 606 680 832
1936 832 984 1093 1056 933 897 934 971 921 872 924 976 983 991 998 1006 957 908 961 1014 1029 1045 1060 1076 993 911 930 949 934 918 903 887 821 755 790 826
1931 826 820 813 807 801 752 703 756 809 793 778 806 835 813 792 872 952 947 943 938 933 841 748 757 766 788 810 876 942 913 885 929 973 930 887 887 931 920 836 815 837
1927 837 845 852 906 1004 1064 1052 1056 1103 1111 1076 1040 1048 1047 1003 1000 1041 1042 971 876 824 815 806 799 792 753 714 747 781 820 860 856 853 885 918 953 915 851 861 897 934 926 918 983
1921 983 1048 974 899 926 996 983 896 829 805 818 830 918 1006 1009 1012 1015 1017 970 923 949 1018 1036 980 942 946 918 845 829 886 961 993 982 971 930 890 849 809
1917 809 795 782 842 901 854 806 831 856 860 864 867 871 915 958 1002 1045 952 859 868 964 989 868 748 773 853 846 824 802 814 826 881 936 969 1001 990 979 955
1912 955 931 907 883 864 845 826 808 819 830 884 939 941 944 946 949 882 814 770 814 894 975 988 1002 991 980 968 957 910 863 912 961 987 925 913 900 866 831
1908 831 841 850 827 805 777 836 917 997 982 966 917 868 863 858 832 806 780 754 781 808 834 861 900 939 1022 1105 1004 904 885 953 1002 1052 1102 1151 1126
1903 1126 1014 946 965 939 914 845 863 883 902 994 1085 1128 1083 1043 1004 956 907 853 887 911 936 922 909 954 998 970 942 872 801 807 900 979 971 974 977 953
1899 953 929 905 881 863 844 826 807 825 843 905 967 986 1005 1018 1032 992 865 738 698 749 801 858 915 916 918 937 1044 1100 1068 993 1005 1047 1002 957
1895 957 998 1059 1033 960 886 914 942 1009 1075 1140 1119 1044 970 928 885 794 789 844 899 886 874 915 955 953 950 944 938 975 1012 1066 1120 1102 1083 1049 1015 1049 1082
1890 1082 1112 1055 993 1017 1033 961 823 771 847 923 999 1075 1021 881 750 766 811 857 868 879 955 1032 949 865 808 751 738 724 741 758 774 791 826
1886 826 861 823 786 860 934 936 937 910 884 924 964 1010 968 883 885 966 1047 974 901 863 825 860 895 906 917 929 940 968 997 953 909 964 1019 1031 1043 1024
1882 1024 1005 1029 1054 1118 1182 1120 1059 1019 1066 1107 1148 1097 1046 946 934 914 895 838 780 833 885 894 902 887 872 925 977 1028 992 932 872 891 909 884 858
1878 858 891 924 884 844 865 885 861 838 847 856 908 960 909 858 855 938 1025 1025 978 931 917 904 890 876 920 964 907 849 857 865 911 956 964 885 806 814 853 892 834
1873 834 777 807 837 868 898 833 768 697 714 815 916 892 868 931 993 953 914 904 894 884 874 934 993 950 907 909 910 911 912 918 923 929 935 902 869 836 803 863
1868 863 922 909 897 892 887 839 791 788 786 783 780 805 830 855 880 868 857 889 1008 1074 995 795 681 705 728 757 786 864 942 919 895 903 911 919 927 935 943 945 947 1015
1863 1015 995 952 909 949 989 927 866 862 859 783 707 751 795 795 795 886 978 938 898 867 836 761 686 785 884 930 888 917 945 968 991 1026 1060 999 937 941 1032
1859 1032 1026 934 892 937 977 930 914 898 877 855 892 929 947 879 837 883 947 1010 933 856 779 702 777 852 883 914 898 883 911 940 989 1038 986 933 948
1855 948 962 881 799 827 941 1014 1000 1003 1049 1049 1005 1013 1064 1040 930 915 987 993 855 714 719 763 807 824 840 859 878 928 1022 1071 1032 990 991 1006 1021 1006
1850 1006 991 977 962 956 951 902 852 867 882 896 911 912 913 914 915 935 956 979 1002 1014 1070 1109 1061 998 977 954 887 851 857 867 833 824 901 952 958 974 990 1003 1017
1845 1017 1026 1035 1000 966 968 970 974 979 1036 1136 1165 1106 1065 1111 1130 1105 1065 1069 1099 1043 987 1017 1018 976 937 898 857 816 819 822 830 839 850 947 1004 974 879 828 849 869
1840 869 910 950 991 1031 1035 1039 971 902 882 861 870 836 836 923 1007 1005 992 979 961 943 897 852 908 964 1043 1121 1046 970 967 1050 1071 946 862 865 854 842 846 849 852
1836 852 855 852 848 845 841 835 829 828 828 869 998 1121 1099 1005 998 1006 1014 977 940 976 1011 1059 1108 1054 1001 988 976 1007 1037 1037 1038 1038 1038 1018 998 984 970 988 1094 1165 1091
1831 1091 997 991 1024 970 898 914 996 991 932 872 879 886 892 897 946 995 967 939 983 1027 1034 1040 1046 1052 1064 1077 1089 1101 1041 981 964 947 939 930 1022 1115 996 876 829
1826 829 782 854 926 925 925 937 949 961 973 967 961 956 950 955 961 966 971 934 897 861 824 882 939 930 920 835 837 940 957 922 888 920 953 997 1042 1097 1065 1007 1037 1134
1821 1134 1144 1112 1079 1085 1091 1103 1114 1125 1137 1117 1097 1131 1079 981 970 1035 1101 1065 1029 1041 1054 985 1002 1072 1142 1178 1213 1297 1295 1197 1099 1097 1095 1021 947 946 945 891
1816 891 837 833 828 757 774 844 913 877 841 878 915 978 1041 1197 1266 1240 1214 1305 1308 1200 1092 1081 1069 1005 940 949 957 911 865 950 1035 1030 1025 1020 1015 959 904 920
1812 920 937 915 893 972 1052 1033 1014 1062 1110 1051 905 832 846 837 829 898 968 994 1020 979 937 819 789 921 1054 1129 1117 1082 1046 1039 1031 1072 1026 953 880
1807 880 961 1043 1061 1080 1098 1117 1054 992 1002 1013 930 847 837 827 841 854 935 1015 994 886 846 850 860 870 926 982 945 907 942 978 964 950 939 928 947
1803 947 1010 1097 1097 1018 939 1015 1090 1021 953 956 1002 997 905 885 952 954 912 943 1062 1097 987 912 924 987 1007 984 960 960 959 1011 975 876 821 867 913 870 827
1799 827 886 944 920 896 944 1035 1062 1002 969 979 968 957 1020 1127 1152 1090 1028 1053 1060 1024 990 1000 989 935 883 875 860 845 906 966 986 1006 1025 1045 1060
1794 1060 1075 1090 1105 1056 1008 1002 1039 1059 991 951 954 958 961 967 973 988 1003 1018 1033 966 899 905 911 916 921 998 1119 1145 1084 1006 972 891 809 754 786 815 844 879 914
1790 914 896 878 956 1034 1034 947 956 1053 1054 969 889 896 910 923 980 1037 1039 953 905 945 922 811 774 823 898 886 873 948 982 928 919 996 1066 1049 1016 1027 1031 991
1785 991 993 1037 1010 896 851 894 933 885 880 963 1064 1078 1073 1112 1159 1120 1064 1052 1017 982 967 1040 1095 1063 1055 1090 1073 969 902 980 1076 1084 991 898 844 791
1781 791 784 865 909 867 827 874 950 982 1011 1083 1127 1026 955 971 1054 1050 1003 999 1036 1072 1065 1058 1029 956 925 982 1018 967 875 870 930 946 919 893 866 840 837 921
1776 921 985 1049 1113 1176 1201 1139 1071 1091 1097 1016 936 942 991 953 877 888 931 975 1019 1062 1101 1053 1039 1113 1184 1110 973 923 936 950 969 987 1004 1020 1037
1772 1037 1053 1108 1162 1144 1126 1106 1086 1023 959 861 763 763 908 1025 997 933 956 1017 991 898 892 960 1028 1029 1030 1049 1068 1082 1095 1109 1036 957 965 973 894 815
1767 815 824 860 809 722 780 903 881 770 746 832 918 878 839 886 934 938 942 973 1003 984 966 1001 950 846 742 759 776 782 875 1006 1050 988 927 960
1763 960 992 981 970 976 981 976 1057 1163 1182 1177 1173 1145 1031 884 882 954 1026 1006 986 986 986 931 964 1076 1101 1021 941 937 933 880 915 1006 1097 1093 1175 1318 1316 1183
1758 1183 1051 1105 1160 1113 1066 1053 1041 1092 1143 1227 1167 1002 925 971 931 794 744 827 910 867 825 892 958 894 830 910 989 967 945 974 1003 959 915
1754 915 951 987 927 866 830 880 920 959 997 947 855 849 963 1077 1065 1054 1055 1055 1012 970 1016 1063 1105 1146 1235 1236 1127 1018 1034 1051 1024 998 1048 1098 1017
1750 1017 936 983 1031 982 933 935 1023 1112 1114 1088 1061 1029 997 961 925 835 831 902 886 823 759 861 962 933 903 930 957 912 866 1005 1143 1147 1064 1085
1746 1085 1194 1224 1167 1159 1152 1139 1125 1206 1286 1236 1185 1182 1178 1049 920 925 1016 1065 1026 1026 1026 1021 1017 1022 1028 880 732 713 782 851 833 864 895 920 946 985 1025
1741 1025 963 901 954 1007 1013 931 941 1038 1057 988 962 937 906 874 934 993 957 920 930 1027 1051 988 1018 1049 998 860 776 778 732 686 729 860 918 889
1737 889 919 949 930 912 975 1037 999 960 990 1021 1007 994 1079 1164 1144 1036 1003 1058 990 923 941 1047 1090 987 927 955 939 837 854 1016 1139 1058
1733 1058 994 1017 1033 961 902 930 959 900 870 927 1002 1078 1180 1283 1251 1133 1065 1084 1107 1042 1005 1113 1189 1177 1157 1223 1235 1247 1245 1242 1239 1237 1195 1152
1729 1152 1071 991 1031 1159 1168 1033 982 1077 1103 984 838 895 1011 1039 1019 1043 1090 1051 1050 1136 1179 1134 1117 1187 1249 1167 1116 1211 1305 1254 1150 1191
1725 1191 1268 1259 1165 1158 1197 1192 1140 1132 1143 1153 1155 1200 1232 1176 1127 1165 1200 1148 1075 1046 1042 950 900 937 1018 1012 1022 1119 1213 1221 1152 1128 1103 1035 1012 1077 1144 1123
1721 1123 1044 1052 1105 1115 1109 1147 1168 1102 1061 1108 1114 1034 999 1109 1220 1185 1067 1036 1071 1020 966 956 946 893 889 973 1052 985 885 930 1012 1006 965 1011 1090
1716 1090 1023 899 862 900 938 952 1010 1055 1012 910 895 927 872 851 975 1098 1077 990 989 1087 1097 1035 1060 1088 1030 972 1060 1269 1391 1333 1274 1254
1712 1254 1234 1180 1127 1122 1118 1097 1163 1273 1296 1216 1136 1182 1227 1241 1254 1323 1304 1206 1195 1208 1220 1164 1195 1299 1315 1279 1244 1257 1183 1043 990 990 990 896 889
1708 889 961 945 857 856 931 1006 979 952 998 1044 1037 1030 1096 1162 1117 1072 1070 1069 991 914 967 1020 1008 995 1085 1174 1174 1175 1186 1110 985 946 1013 1080 1080 1080 1041 1003 932
1703 932 948 1017 1086 1094 1103 1167 1143 1125 1194 1263 1245 1140 1123 1182 1241 1242 1243 1299 1267 1154 1129 1180 1230 1210 1189 1266 1256 1132 1094 1162 1230 1216 1201 1285 1281 1121
1699 1121 1048 1139 1230 1202 1174 1248 1322 1234 1146 1102 1058 1018 977 1010 1042 973 903 1023 1142 1114 1085 1100 1114 1088 1062 1036 1010 971 931 964 997 970 942
1695 942 1012 995 886 863 995 1039 959 878 1010 1142 1105 1069 1105 1141 1110 1079 1092 1105 1068 1032 1093 1068 970 959 1131 1216 1085 953 985 1104 1073
1691 1073 1041 1116 1192 1149 1106 1136 1166 1092 1018 1075 1132 1096 1060 1097 1133 1122 1110 1171 1232 1275 1318 1410 1415 1251 1086 1055 1112 1131 1150 1242 1334 1259 1096
1687 1096 1007 1004 1011 1018 1103 1188 1128 1068 1061 1141 1155 1169 1145 1121 1079 1037 1096 1156 1092 1028 1095 1162 1132 1103 1146 1189 1142 1095 1231 1367 1328 1201 1175 1237 1165
1683 1165 1093 1100 1106 1027 948 1081 1214 1183 1065 1097 1217 1215 1067 1028 1076 1053 986 1051 1204 1274 1199 1157 1202 1182 1075 1095 1202 1251 1156 1137 1205 1267
1679 1267 1242 1225 1208 1166 1081 1071 1147 1124 1058 1069 1167 1193 1132 1096 1103 1082 973 938 989 980 927 951 1062 1113 1077 1070 1108 1059 1010 1064 1162 1160 1071 1074 1221
1675 1221 1299 1232 1201 1257 1250 1156 1131 1252 1319 1300 1270 1284 1240 1195 1226 1257 1231 1205 1305 1405 1344 1197 1226 1400 1383 1221 1186 1354 1509 1518 1633
1671 1633 1893 2137 2236 2342 2491 2468 2183 1891 1745 1661 1533 1456 1525 1566 1563 1609 1742 1707 1527 1415 1507 1576 1557 1600 1847 2055 2002 1839
1667 1839 1763 1680 1553 1495 1583 1606 1484 1405 1471 1495 1373 1252 1276 1352 1283 1214 1291 1428 1421 1382 1431 1549 1668 1743 1818 1788 1671 1703 1996 2358
1664 2358 2720 3258 4057 4806 5120 4922 4463 3822 3095 2525 2274 2197 2120 2052 2071 2001 1844 1745 1850 1915 1778 1608 1583 1643 1617 1590 1650
1660 1650 1666 1537 1409 1425 1472 1432 1403 1519 1634 1603 1565 1615 1677 1652 1659 1812 1934 1853 1706 1705 1779 1766 1680 1740 1848 1868 1860 1997 2188 2291
1657 2291 2440 2792 3365 3937 4557 5177 5359 4931 4170 3554 3177 2800 2469 2341 2311 2135 1888 1843 1901 1813 1640 1554 1569 1584 1517 1595
1654 1595 1736 1790 1768 1833 1919 1802 1559 1460 1461 1374 1255 1281 1359 1291 1180 1214 1333 1307 1183 1204 1354 1416 1323 1317 1386 1368 1245 1267 1402 1449
1650 1449 1366 1428 1666 1816 1894 1972 2179 2386 2420 2455 2374 2089 1732 1579 1575 1572 1451 1330 1330 1330 1282 1380 1563 1601 1453 1306 1357 1408 1387 1366
1646 1366 1353 1340 1272 1292 1327 1275 1146 1163 1268 1286 1198 1256 1402 1403 1281 1246 1338 1342 1164 1072 1165 1259 1250 1242 1335 1341 1240 1226 1358 1403 1318 1319 1444
1642 1444 1482 1385 1289 1313 1336 1233 1217 1324 1344 1234 1210 1292 1287 1235 1271 1431 1446 1281 1204 1261 1318 1224 1217 1397 1491 1420 1350 1473 1595 1529 1462
1638 1462 1536 1609 1552 1494 1582 1670 1517 1363 1424 1572 1598 1624 1651 1678 1604 1529 1635 1740 1685 1631 1706 1782 1808 1835 1869 1815 1651 1632 1746 1772 1610
1635 1610 1447 1503 1558 1425 1291 1433 1575 1441 1307 1389 1471 1393 1315 1383 1451 1417 1383 1504 1624 1585 1546 1609 1673 1605 1538 1619 1701 1733 1766 1851
1631 1851 1849 1716 1670 1819 1967 1846 1724 1831 1939 1887 1835 1916 1996 1917 1838 1886 1934 1799 1664 1761 1945 1921 1751 1750 1835 1815 1708 1716 1811 1830
1627 1830 1848 1939 2030 1903 1776 1830 1884 1784 1684 1771 1946 1937 1841 1905 2056 2071 1999 2059 2120 2025 1930 2087 2389 2566 2597 2689 2868 2887 2761
1624 2761 2666 2658 2525 2392 2362 2419 2354 2289 2310 2330 2255 2179 2249 2406 2471 2535 2640 2744 2598 2365 2346 2415 2303 2192 2218 2332 2271 2210 2284 2444
1620 2444 2399 2209 2213 2363 2427 2404 2425 2447 2337 2228 2289 2438 2412 2386 2496 2692 2683 2529 2592 2800 2852 2759 2832 3109 3352 3451 3539 3771 3968
1617 3968 4077 4205 4420 4679 5082 5765 6766 8134 9822 11243 11357 9902 7838 6388 5721 5158 4595 4292 4250 4083 3771
1614 3771 3597 3626 3491 3270 3286 3506 3515 3321 3250 3381 3331 3020 2870 2981 3019 2913 2916 3064 3063 2859 2806 3015 3118 3018 2989 3163 3231 3155
1611 3155 3161 3370 3481 3389 3398 3609 3785 3815 3889 4108 4251 4306 4448 4735 4906 4989 5330 6048 6867 7774 8910 10132 10828 10682 10018
1608 10018 9149 8065 6981 6240 5934 5671 5262 5018 5036 5058 4934 4819 4790 4671 4407 4291 4436 4519 4457 4486 4717 4961 5205 5656
1605 5656 6194 6356 5967 5491 5277 5128 4892 4739 4731 4691 4563 4542 4607 4575 4456 4503 4696 4711 4523 4435 4551 4630 4564 4548 4677 4700 4637 4663
1601 4663 4835 4879 4779 4851 5068 5159 5046 5035 5169 5223 5190 5363 5681 5843 5918 6213 6711 7115 7373 7569 7561 7306 7196 7582 8055 8253
1598 8253 8595 9432 10356 10872 11388 12276 13077 13608 14806 17166 19730 22403 27079 34869 44780 58367 81043 112811 139440
1596 139440 142254 118440 85221 61032 48754 40918 33854 29549 28006 25969 22615 20161 19134 17671 15614 14806
1594 14806 15199 14982 14357 15214 17603 19993 23594 31058 40342 44544 39926 30459 22548 18268 15886 14172 13315 12951 12352
1591 12352 11607 11086 10564 9705 8991 8829 8667 8131 7740 7805 7783 7416 7195 7453 7623 7447 7417 7807 8052 7934 7902 8241 8493 8460
1588 8460 8689 9365 10042 10578 11665 13579 15986 19173 23842 29614 34427 36483 35548 32188 27174 21948 18146 16205 14991
1586 14991 13745 12877 12615 12266 11512 10962 10961 10960 10693 10688 11192 11610 11647 11889 12620 13438 14396 15906 17557 18017 17017 15929 15832 16229
1583 16229 16620 17503 19353 21638 24246 28102 33879 41485 51538 65453 82707 99410 110321 112259 104974 90633
1581 90633 73503 58492 48070 41161 35946 32037 29662 27955 25942 23928 22420 20911 18978 17247 16318 15707 14739
1579 14739 13857 13709 13706 13124 12338 12045 11897 11330 10763 10865 11111 10867 10624 11133 11904 12109 11937 11971 12151 12216 12543 13338 13697 12931
1576 12931 11671 10886 10363 9568 8918 9003 9291 9167 9042 9564 10086 9789 9173 9096 9222 8905 8501 8740 9181 9000 8558 8657 9017
1573 9017 8944 8727 9054 9468 9290 8909 9141 9635 9541 9244 9459 9877 9703 9326 9569 10074 10027 9777 10143 10829 10971 10851 11363 12252
1571 12252 12527 12250 12124 12085 11598 11066 11178 11494 11226 10754 10958 11423 11314 10945 11196 11708 11561 11094 11332 11889 11746 11225 11379
1568 11379 11969 11992 11639 11910 12558 12531 12069 12202 12770 12753 12359 12611 13299 13347 12902 13078 13748 13879 13517 13750 14476 14568 14166 14413
1565 14413 15212 15373 15041 15387 16342 16777 16719 17429 18982 20243 21242 23272 26203 28329 28858 28622 27949 26251 24000 22647
1562 22647 22309 21809 20988 20811 21243 21177 20675 21124 22590 23687 23943 24180 24213 22927 20915 19966 20208 20043 19211 19177 20101 20374
1560 20374 19747 19744 20642 20984 20368 20187 20732 20549 19464 19150 19968 20263 19600 19482 20321 20571 19805 19706 20740 21208 20601 20504 21482
1557 21482 21810 21034 20794 21658 21942 21123 21052 22200 22744 21952 21748 22880 23540 22865 22806 24083 24785 24034 23842 25103 25949 25344
1554 25344 25269 26761 27878 27542 27933 30356 32867 33693 33920 34147 32840 30081 28705 29710 30238 28965 28447 29846 30566 29253
1552 29253 28513 29922 30816 29561 28952 30609 31782 30807 30412 32399 33581 32034 31053 32918 34529 33409 32755 34946 36818
1549 36818 35728 35080 37627 39823 38824 38471 41662 44371 43189 42145 44992 47661 46439 45747 49643 53481 53080 53368 58941
1547 58941 64106 63521 63147 69335 76304 77755 80296 91141 103259 108350 113579 127577 141975 148532 159714 188841
1545 188841 224715 256234 304798 396513 522048 677029 919675 1299092 1708222 1902411 1734414 1323251
1544 1323251 926921 685945 557050 458993 381279 339978 314990 277864 235872 208342 189747 165636 141794
1542 141794 130322 124643 112402 98395 93389 92841 86428 77573 75165 76060 72018 65757 65129 67615 65862 61965 62887
1540 62887 66554 66445 64223 66356 71480 73758 74659 80147 89004 95597 100552 109049 120132 128600 136026 149201 169258
1538 169258 191929 219061 259260 317557 394728 499446 651495 863611 1118412 1361727 1519611 1533074
1536 1533074 1394551 1157552 904350 696535 551036 454045 386267 334670 291959 254724 221962 193033
1535 193033 167298 145273 127836 113919 101339 89779 80368 72758 65438 58586 53534 49927 46030 41914 39133
1533 39133 37332 34892 31890 29992 29008 27268 24849 23417 22877 21815 20158 19372 19333 18540 16978 16171 16105 15400 14010 13492
1531 13492 13874 13617 12610 12242 12585 12289 11212 10775 11071 10844 10011 9817 10335 10214 9279 8867 9138 8886 7851 7456 7815 7768
1528 7768 7007 6769 7272 7251 6565 6284 6737 6784 6171 5966 6457 6425 5688 5473 6013 6146 5556 5372 6068 6474 6236 6434 7389 7908
1525 7908 7509 7197 7375 7175 6226 5597 5697 5593 4868 4461 4821 4977 4502 4288 4757 4964 4498 4236 4572 4647 4077 3768 4076
1522 4076 4239 3842 3708 4230 4433 3838 3389 3637 3797 3346 3040 3333 3539 3173 3010 3558 4020 3960 4104 4835 5248 4684 3976
1519 3976 3875 3775 3177 2724 3017 3310 3023 2735 2874 3013 2657 2387 2693 2999 2724 2449 2678 2820 2463 2194 2523 2852 2589
1517 2589 2325 2628 2931 2650 2368 2595 2821 2499 2176 2390 2605 2366 2126 2366 2606 2265 1924 2152 2468 2261 1967 2210 2540
1514 2540 2329 2032 2268 2591 2346 1956 2100 2388 2228 1923 2068 2358 2179 1856 2012 2313 2119 1781 1951 2266 2134 1858 2002
1511 2002 2292 2155 1874 2040 2350 2223 1893 1982 2274 2138 1828 1883 2112 2003 1720 1916 2287 2273 2086 2312 2712 2746 2490 2516 2717
1508 2717 2535 2180 2216 2427 2318 2034 2085 2310 2219 1954 2138 2497 2457 2242 2383 2699 2696 2403 2480 2731 2701 2497 2590 2974 3034 2919
1505 2919 3088 3431 3531 3456 3345 2828 1431 -139 -628 -247 47 -64 106 568 737 500 488 766 876 695 739 957 898 549
1502 549 519 896 982 778 799 1110 1253 1106 1118 1421 1500 1289 1267 1535 1613 1400 1405 1700 1789 1587 1545 1793 1894 1705 1589 1763 1852
1498 1852 1651 1616 1872 1964 1881 1958 2209 2286 2073 2114 2561 2775 2583 2314 2046 1487 521 -157 -313 -229 -320 -273 64 207 60 -13
1495 -13 202 343 193 145 387 576 474 446 591 608 451 490 819 1007 788 708 917 1066 925 784 933 1064 903 816 1019 1126
1492 1126 943 861 1070 1262 1164 1168 1462 1720 1688 1758 2234 2772 3135 3564 4167 4502 4315 3922 3617 3234 2678 2253 2235 2260 1994 1743
1489 1743 1782 1745 1535 1331 1418 1490 1272 1097 1213 1330 1158 1086 1305 1427 1259 1018 1067 1187 1016 844 964 1148 1042 957 1047 1188
1486 1188 1038 881 1015 1224 1144 1034 1098 1166 1058 886 1004 1090 1003 857 1001 1106 1036 945 1144 1309 1183 985 1077 1295 1222 1033
1483 1033 1018 1161 1129 996 1037 1188 1164 1097 1204 1305 1231 1157 1258 1344 1257 1141 1314 1446 1286 1055 1113 1277 1151 959 1057 1208 1185
1479 1185 1090 1168 1348 1238 1024 1101 1215 1127 964 1062 1226 1129 929 991 1188 1124 933 1003 1222 1237 1122 1211 1399 1327 1094 1123 1319
1476 1319 1312 1090 1072 1224 1173 1021 1071 1280 1285 1102 1122 1264 1202 985 971 1185 1254 1164 1219 1448 1473 1288 1248 1427 1520 1423 1414 1560 1561 1394
1472 1394 1431 1675 1774 1691 1753 2043 2246 2287 2590 3294 3998 4725 6005 7925 9583 9970 8991 7345 5699 4488 3771 3391 3012
1470 3012 2649 2431 2376 2234 1991 1893 1938 1896 1749 1747 1864 1837 1595 1499 1625 1665 1549 1519 1642 1678 1526 1460 1549 1550 1368 1273 1374 1475
1466 1475 1402 1416 1534 1653 1621 1675 1890 2017 1985 2040 2266 2404 2389 2460 2813 3166 3517 4129 5041 6097 7179 8348 9352 9572
1463 9572 8881 7812 6924 6238 5629 5166 4911 4510 3847 3270 3004 2737 2354 2058 2074 2090 1923 1756 1823 1891 1793 1695 1668 1554 1280
1460 1280 1093 1188 1282 1222 1162 1225 1288 1221 1153 1302 1451 1349 1160 1138 1202 1207 1211 1332 1366 1202 1037 1054 1070 985 900 1016 1132 1089 1045 1159
1456 1159 1274 1141 1009 1117 1225 1173 1122 1226 1331 1247 1162 1233 1303 1162 1020 1056 1179 1171 1076 1128 1180 1124 1069 1130 1190 1120 1050 1121 1192 1160
1453 1160 1129 1222 1314 1136 958 984 1097 1088 1080 1247 1414 1421 1283 1239 1282 1245 1208 1317 1426 1395 1277 1316 1354 1257 1072 1076 1225 1264 1215 1289 1362
1449 1362 1271 1092 1050 1153 1145 1049 1086 1122 1052 894 898 1047 1062 989 976 1049 1030 966 1073 1324 1390 1310 1282 1341 1270 1111 1029 1092 1078 978 983 1074
1445 1074 1120 1078 1098 1160 1117 987 981 1063 1070 989 969 993 944 894 949 1005 960 871 914 1044 1017 903 993 1170 1143 914 849 989 1066 998 966 1021
1441 1021 1008 849 768 833 861 803 801 887 929 884 890 984 954 779 693 751 820 802 833 1008 1111 1069 1057 1132 1182 1145 1084 1111 1116 1034 989 1031 1029 939
1437 939 905 958 943 884 899 1001 1005 921 910 985 1018 963 991 1107 1154 1056 1068 1167 1217 1179 1200 1264 1199 990 899 953 1003 908 890 959 955 864 867 1015
1433 1015 1036 911 851 937 978 875 809 888 966 900 867 978 1018 911 877 987 999 866 770 877 929 837 758 825 913 856 810 908 985 917 838
1429 838 904 1013 978 941 1049 1154 1114 1027 1028 1040 907 775 788 838 801 784 854 934 870 846 909 935 817 755 897 1038 976 859 887 954 877
1425 877 812 892 1016 995 929 1010 1122 1032 858 829 973 1029 1007 986 964 943 872 889 914 853 799 891 1026 1016 962 995 1068 1054 1010 1054 1120 1098
1421 1098 1023 1034 1046 970 923 964 1047 1044 1040 1122 1169 1070 1016 1107 1187 1064 880 841 945 963 932 901 923 858 826 939 1078 1071 973 1019 1131 1156 1061
1417 1061 1054 1090 1039 1003 1054 1098 997 867 881 1023 1020 899 864 932 999 999 998 1056 1026 949 1018 1133 1103 971 984 1092 1112 1042 1059 1119 1093 979
1413 979 952 1027 1015 888 848 884 832 737 786 958 1042 1054 1067 1128 1103 966 916 918 921 900 967 1106 1158 1106 1055 1125 1108 1023 1025 1124 1135 990 845
1409 845 884 922 929 936 1035 1047 937 827 871 915 923 930 993 968 861 840 873 905 833 849 943 949 881 900 1016 1044 1015 985 1101 1129 1082 1034 1088 1142 1110
1405 1110 1164 1300 1436 1460 1484 1638 1792 1792 1791 1801 1724 1546 1454 1522 1504 1366 1316 1391 1379 1244 1108 1156 1204 1095 985 1035 1085 1059 1033 1079
1401 1079 1126 1029 932 995 1058 1020 981 1015 1049 996 943 992 1041 947 853 919 985 999 1012 1026 1040 1007 974 985 996 890 783 924 1065 1113 1161 1165 1169
1397 1169 1115 1061 1138 1214 1127 1040 1113 1186 1158 1131 1060 989 928 868 910 951 857 763 799 836 818 800 855 909 879 849 920 992 945 899 954 1009 910 811
1393 811 929 1135 1141 1002 945 975 911 847 861 875 831 787 874 960 938 916 995 1075 982 889 897 906 862 819 935 1051 1005 960 1045 1218 1292 1222 1195
1389 1195 1168 1042 915 972 1028 996 876 903 1076 1111 1000 969 1026 1047 981 1016 1139 1168 1110 1052 1082 1046 923 931 1026 1083 1053 1023 1079 1080 994 957
1385 957 1007 1011 1015 1097 1179 1208 1237 1222 1207 1212 1216 1322 1428 1439 1450 1461 1472 1306 1139 1128 1263 1330 1252 1216 1268 1256 1245 1282 1320 1266 1212 1259 1394 1447
1381 1447 1355 1295 1323 1351 1293 1239 1273 1228 1183 1244 1306 1323 1340 1357 1374 1409 1444 1572 1700 1732 1619 1538 1545 1520 1494 1518 1542 1522 1502 1496 1577 1618 1513
1377 1513 1409 1449 1520 1504 1473 1443 1362 1281 1302 1410 1408 1261 1182 1249 1327 1259 1184 1196 1212 1141 1114 1173 1207 1153 1066 1125 1219 1226 1248 1270 1246 1223 1199 1175
1373 1175 1167 1159 1219 1278 1262 1159 1090 1167 1210 1167 1144 1266 1378 1491 1604 1717 1715 1569 1449 1417 1364 1225 1121 1163 1223 1137 1014 979 965 863
1369 863 827 936 1036 991 978 1052 1137 1077 1017 1102 1193 1197 1128 1205 1344 1396 1346 1296 1293 1289 1348 1408 1462 1370 1269 1313 1415 1371 1262 1240 1248 1169 1023
1365 1023 964 1011 1059 1062 1066 1166 1179 1169 1158 1155 1152 1105 1058 1079 1099 1047 995 923 851 827 889 960 944 889 922 950 979 958 1025 1089 1066 1088 1110 1119 982 808
1361 808 836 992 1061 974 886 865 844 867 890 921 953 979 1005 1034 976 912 935 1037 1052 991 930 987 1043 1094 1146 1171 1110 1054 998 1005 1011 1012 1013 1015 930 908
1356 908 974 1093 1066 967 868 881 894 901 908 1007 1019 979 938 909 881 896 998 1064 985 809 779 814 848 842 924 1013 1103 1116 1129 1162 1049 863 823 876
1352 876 929 919 909 979 1050 931 813 822 831 840 849 866 884 886 976 1076 1032 894 844 917 991 997 1003 1028 1054 1007 961 1004 1048 991 933 967 1000 990 980 940
1348 940 899 902 905 961 1017 972 926 918 910 858 806 797 788 779 770 823 877 829 780 848 917 825 733 798 862 883 904 989 1073 940 807 804 801 871 941 1004 1066 968 870
1343 870 889 907 882 857 930 1003 945 887 966 1044 963 881 964 1047 1029 1010 1041 1071 1058 1045 1030 1016 929 842 859 876 894 911 918 924 887 851 918 985 922 859
1339 859 949 1038 939 840 819 798 850 901 910 919 855 791 867 943 893 844 890 1022 1082 1055 1043 1030 969 907 966 1024 981 938 899 861 822 784 953 1122
1335 1122 1181 1152 1134 1115 1048 980 903 826 793 760 835 911 885 858 921 984 974 965 1044 1123 1179 1147 1110 1074 935 797 827 945 990 948 943 938 860 782
1330 782 739 783 850 917 979 1041 949 856 844 920 923 838 833 828 817 807 835 864 825 786 833 968 977 898 822 833 862 891 940 989 936 884 907 931 911 891
1326 891 923 955 969 895 896 983 1065 1059 1063 1067 969 871 774 763 709 654 683 799 872 857 822 786 789 792 858 925 939 865 822 779 730 681 724 766 768 770 847 969
1321 969 989 923 898 961 979 911 892 960 955 863 792 808 843 835 861 974 1015 968 909 894 855 815 801 873 922 927 946 966 910 855 891 927 922 917 947 1020 1021
1317 1021 935 931 1015 1059 957 863 855 889 879 896 956 998 952 918 928 911 893 909 968 958 862 820 923 990 971 954 981 934 800 723 791 829 781 745
1313 745 855 1005 1010 949 931 939 858 793 873 987 1014 939 865 864 862 846 917 1007 1054 998 942 883 825 824 822 821 819 829 839 854 869 899 1016 1069 977 906 922
1308 922 977 989 983 977 969 960 968 976 984 992 980 968 918 868 869 958 980 914 875 923 971 931 924 1004 1018 887 759 776 859 854 854 941 985 941 902 950 999 960 899 925
1303 925 1004 1083 1107 1218 1294 1225 1036 935 911 887 818 836 854 873 853 921 1033 1057 1037 1017 1046 987 924 947 1038 1042 1034 1027 1058 1088 1047 1005 969 933
1299 933 925 1004 1121 1093 1010 1013 1012 925 831 824 894 963 966 970 978 987 955 1010 1108 1120 1034 948 935 922 830 826 875 923 892 862 952 956 874 792 807 821 786 750 787
1294 787 824 877 930 965 913 837 849 933 930 868 893 994 1095 1064 1033 1001 970 998 1025 1039 965 870 920 1043 1021 864 795 856 917 836 755 805 855
1290 855 881 907 976 1046 957 869 911 952 916 880 917 953 881 809 868 926 957 987 1018 1048 968 887 937 987 895 804 814 824 855 885 916 946 902 859 887
1286 887 916 939 963 986 1009 945 880 917 954 973 993 969 944 965 985 1006 1026 987 948 952 957 913 869 927 985 919 852 916 979 994 1009 1024 1039 1014 989 964
1282 964 938 908 877 977 1078 980 883 887 891 860 829 899 1056 1121 1039 991 1030 1064 1011 969 927 900 874 891 909 958 1007 983 960 927 893 860 827 794
1277 794 761 830 898 896 894 892 890 852 814 935 1057 1041 1026 1010 995 994 993 992 991 921 852 942 1032 960 888 911 935 910 797 728 746 738 731 801 872 818 764 841
1273 841 1005 1062 974 822 757 759 761 840 920 953 986 1013 1040 1054 980 956 931 890 848 854 946 992 951 965 978 968 958 899 927 928 928 923 1006 1110 1127 1097
1268 1097 1066 1062 1058 1054 1050 1021 993 1008 1023 950 877 905 934 944 953 963 973 976 979 1025 1072 1119 1167 1142 1117 1007 898 943 988 953 831 772 859 926 906 871
1264 871 837 872 908 943 978 949 919 933 948 876 803 833 863 832 801 817 921 972 935 881 827 826 825 891 958 988 932 876 907 920 933 990 1047 1119 1104
1260 1104 1066 1027 967 907 870 921 917 913 915 917 869 822 725 716 785 853 922 991 992 905 867 830 776 722 770 905 967 884 796 794 779 763 738 858 990 1034
1255 1034 1029 1024 1060 1010 916 909 924 938 914 891 908 926 901 875 834 792 798 890 964 950 919 887 892 897 902 907 889 871 854 836 863 890 917 944 931 919 907 895
1251 895 817 739 736 821 878 848 818 875 911 860 814 856 938 1021 1031 1040 1043 958 923 887 881 874 819 850 937 1024 1015 1005 954 902 868 921 974 940 916 893 933 973
1246 973 970 966 965 963 917 872 905 939 1039 1140 1159 1091 1067 1043 1011 891 783 819 918 1016 993 970 957 944 887 830 834 838 841 845 773 701 731 848 947 901
1242 901 840 779 773 768 855 942 1000 913 853 880 953 939 902 865 883 813 700 674 773 871 926 981 1020 971 922 960 1015 1070 999 929 928 928 922 916 923 842 762 769
1237 769 871 973 998 937 878 819 827 836 877 918 915 913 897 882 856 917 974 944 847 837 871 905 939 972 1008 956 904 940 1037 1134 1106 1077 1050 1022 989 1043
1233 1043 1112 1182 1155 1128 1113 1098 1034 1057 1137 1217 1201 1185 1209 1232 1154 1076 1112 1148 1112 1075 1085 1094 1060 1026 965 904 886 868 900 931 889 848 841 835 829 823 874
1228 874 924 844 764 797 830 864 897 951 1006 1060 1115 1119 1124 1055 987 965 942 920 898 927 956 942 928 1039 1151 1132 1112 1111 1110 1036 963 1009 1055 1057 1060 1092 1125
1224 1125 1157 1190 1238 1287 1205 1123 1192 1261 1200 1139 1097 1055 1086 1117 1145 1173 1100 1026 1074 1121 1169 1216 1236 1256 1204 1152 1103 1055 1006 958 1064 1171 1147
1219 1147 1123 1118 1114 1036 959 961 964 967 969 1009 1048 1088 1128 1196 1265 1290 1315 1239 1163 1159 1155 1138 1121 1104 1086 1113 1141 1124 1108 1175 1242 1310 1377 1366 1354 1299 1244 1258
1215 1258 1271 1240 1210 1274 1338 1301 1263 1297 1332 1264 1197 1198 1199 1200 1201 1332 1463 1492 1521 1530 1539 1531 1435 1378 1410 1435 1374 1315 1256 1192 1128 1096 1064 1033 1001 979 957
1210 957 935 913 977 1041 1061 1082 1122 1163 1203 1244 1188 1132 1077 1021 1057 1094 1087 1079 1064 1049 1033 1018 1050 1081 1112 1144 1195 1247 1196 1146 1114 1081 1092 1103 1147 1191
1206 1191 1162 1133 1189 1245 1257 1269 1311 1354 1397 1440 1504 1568 1633 1697 1772 1847 1759 1583 1465 1434 1451 1467 1485 1503 1391 1278 1266 1254 1146 1038 1022
1202 1022 1094 1127 1074 1064 1141 1236 1331 1300 1269 1194 1120 1129 1138 1147 1156 1156 1156 1155 1155 1249 1342 1388 1347 1298 1337 1365 1392 1459 1525 1592 1658 1700 1741 1782 1823 1939 2056
1198 2056 2103 2005 1935 2009 2086 2075 2027 1979 1927 1876 1841 1849 1837 1739 1668 1596 1525 1453 1485 1604 1656 1621 1588 1643 1674 1660 1665 1757 1847 1849 1765 1681 1592 1503 1451
1193 1451 1399 1352 1306 1296 1373 1412 1363 1318 1360 1439 1432 1364 1297 1267 1237 1252 1267 1328 1389 1420 1494 1599 1616 1614 1699 1798 1853 1853 1853 1894 1934 1965 1996 2026 2057 2095
1189 2095 2134 2125 2029 1985 2027 2067 2020 1963 1949 1905 1860 1794 1727 1647 1523 1466 1496 1532 1481 1399 1462 1588 1627 1574 1522 1565 1608 1642 1675 1636 1597 1585 1573 1560
1185 1560 1548 1514 1480 1548 1615 1624 1633 1642 1651 1681 1712 1743 1773 1753 1733 1675 1616 1604 1680 1733 1743 1756 1813 1851 1802 1728 1698 1682 1665 1694 1723 1737 1664 1557 1595 1697
1180 1697 1711 1680 1648 1713 1777 1793 1809 1781 1753 1796 1839 1926 2012 1971 1929 1931 1933 1955 1977 2000 2022 1981 1940 2002 2063 2064 2065 2109 2154 2102 2051 2072 2093 2179 2265 2278
1176 2278 2292 2201 2111 2181 2250 2291 2332 2417 2501 2565 2628 2619 2610 2633 2655 2678 2700 2772 2843 2973 3015 3040 3210 3482 3754 3970 4186 4377 4423 4323 4136
1172 4136 3887 3638 3377 3117 2958 2799 2697 2595 2502 2409 2373 2483 2636 2644 2586 2529 2506 2483 2451 2420 2547 2675 2621 2566 2585 2603 2649 2695 2742
1169 2742 2788 2808 2827 2803 2779 2811 2842 2917 2992 2954 2916 3008 3101 3061 3021 3083 3144 3099 3054 3110 3167 3216 3265 3248 3230 3207 3272 3356 3397 3363 3329 3297 3266 3204
1164 3204 3229 3336 3443 3456 3468 3481 3493 3438 3382 3428 3474 3515 3555 3596 3636 3671 3705 3812 3918 3865 3811 3801 3790 3728 3665 3710 3843 3889 3892 3941 4033 4083
1161 4083 4089 4123 4156 4153 4149 4145 4142 4156 4170 4228 4285 4303 4321 4338 4356 4324 4292 4304 4316 4359 4402 4489 4576 4555 4534 4585 4637 4634 4631 4671 4712 4688 4665 4773 4880 4907 4933
1156 4933 4960 4987 4906 4825 4874 4924 4909 4894 4952 5010 5038 5067 5139 5211 5230 5250 5339 5428 5401 5330 5360 5477 5582 5600 5661 5810 5864 5830 5840 5937 6067 6110
1152 6110 6133 6201 6278 6269 6265 6348 6464 6623 6788 6909 6955 7001 7111 7221 7237 7166 7095 7111 7148 7185 7184 7183 7182 7180 7251 7321 7354 7386 7374 7362 7358 7354 7393 7432 7479
1148 7479 7525 7616 7706 7760 7815 7913 8012 8057 8102 8146 8191 8209 8227 8239 8339 8466 8594 8722 8850 8903 8870 8836 8889 9051 9212 9306 9401 9483 9566 9692
1144 9692 9818 9963 10109 10260 10324 10353 10382 10561 10739 10834 10843 10918 11081 11178 11187 11240 11380 11516 11564 11667 11769 11878 11987 12024 12060 12112 12164 12342
1141 12342 12519 12667 12728 12839 12949 13070 13192 13313 13434 13519 13605 13684 13851 14043 14236 14515 14882 15235 15588 15996 16548 17114 17680 18255
1138 18255 18830 19490 20150 20811 21471 22103 22736 23534 24477 25415 26353 27384 28560 29843 31212 32712 34416 36295 38320 40624
1135 40624 43363 46522 50116 54280 59228 65034 71683 79375 88373 99060 111780 127133 145912 169496 199642 238776
1133 238776 289582 354067 432431 520959 610823 689066 741813 758815 737195 682050 604894 519716 438661 368966
1132 368966 312686 268313 233057 204109 179402 157801 138698 121836 107006 94188 83286 74098 66245 59554
1130 59554 53851 49020 44828 41239 38172 35526 33170 31033 29187 27541 25981 24487 23168 21945 20810 19723 18724
1128 18724 17852 17067 16311 15555 14866 14177 13590 13002 12443 11884 11369 10853 10466 10080 9693 9307 8983 8659 8291 7923 7642 7361 7123
1125 7123 6885 6686 6487 6289 6090 6002 5913 5781 5649 5573 5496 5318 5140 4931 4723 4616 4509 4381 4253 4198 4142 4183 4223 4263 4303 4281 4258
1122 4258 4134 4010 3930 3850 3813 3776 3771 3765 3716 3667 3572 3478 3340 3202 3172 3141 3038 2934 2851 2768 2758 2747 2700 2654 2645 2636 2701 2678 2603 2528 2507 2487 2466
1118 2466 2445 2389 2332 2276 2220 2205 2191 2220 2249 2273 2298 2279 2261 2210 2160 2109 2059 1993 1928 1851 1862 1933 1918 1777 1723 1815 1906 1930 1955 1967 1980 1949 1918 1922
1114 1922 1927 1932 1937 1913 1890 1867 1843 1815 1786 1757 1728 1715 1703 1679 1743 1867 1904 1806 1709 1659 1609 1602 1595 1687 1778 1768 1757 1748 1738 1729 1720 1697 1675 1642 1696 1811 1839
1109 1839 1791 1742 1775 1808 1739 1670 1686 1701 1673 1645 1640 1635 1631 1626 1611 1596 1625 1653 1701 1749 1667 1584 1562 1540 1518 1496 1449 1401 1398 1394 1453 1512 1469 1426 1429 1431 1390 1349
1104 1349 1396 1443 1490 1537 1550 1562 1473 1384 1380 1376 1372 1368 1425 1482 1469 1456 1495 1578 1612 1560 1513 1467 1415 1364 1386 1409 1432 1454 1433 1413 1435 1458 1456 1455 1453 1451 1427 1402
1100 1402 1377 1353 1385 1418 1407 1396 1367 1338 1310 1281 1283 1285 1288 1290 1387 1484 1479 1474 1492 1509 1453 1398 1412 1427 1441 1456 1474 1492 1508 1523 1515 1464 1347 1318 1413 1551 1591
1095 1591 1544 1496 1492 1501 1510 1525 1539 1510 1481 1532 1584 1635 1686 1740 1794 1867 1897 1912 1839 1678 1473 1266 1059 811 564 423 369 368 366 404 442 480 517
1091 517 564 612 592 572 581 677 735 706 711 803 868 889 953 1060 1123 1041 906 813 796 865 940 971 902 832 861 889 875 818 784 837 906 932 953 974 926
1087 926 877 867 945 1022 1012 960 908 894 879 912 945 935 924 944 963 1032 1013 989 965 935 906 889 872 899 926 917 908 856 804 793 782 843 905 969 1033 995
1083 995 958 962 967 971 975 952 929 906 883 937 991 1007 1023 1005 1075 1101 1039 974 909 910 912 949 986 1091 1195 1220 1158 1144 1131 1180 1230 1206 1183 1141 1098 1018 938
1078 938 902 954 1001 1048 1110 1172 1139 1105 1075 1131 1150 1082 1075 1155 1282 1409 1484 1559 1586 1526 1501 1563 1642 1722 1745 1768 1752 1737 1713 1776 1839 1815 1736 1658
1074 1658 1579 1500 1365 1316 1320 1324 1316 1308 1300 1292 1299 1305 1360 1328 1260 1192 1220 1248 1235 1223 1253 1326 1374 1334 1244 1155 1130 1105 1124 1142 1243 1343 1403 1462 1524 1630
1069 1630 1716 1715 1671 1627 1577 1527 1524 1520 1561 1601 1548 1495 1485 1476 1551 1626 1628 1630 1676 1722 1768 1814 1838 1861 1885 1908 1914 1919 1881 1843 1823 1804 1741 1678 1586 1495 1453 1411
1065 1411 1419 1513 1611 1621 1548 1519 1487 1411 1301 1234 1241 1248 1217 1185 1197 1209 1221 1233 1245 1257 1261 1265 1268 1272 1271 1270 1272 1273 1241 1251 1292 1245 1172 1186 1247 1308 1298 1287 1349
1060 1349 1411 1482 1553 1603 1566 1497 1472 1461 1449 1407 1365 1425 1485 1429 1373 1316 1260 1228 1196 1163 1131 1123 1116 1064 1013 1018 1023 1031 1039 1060 1124 1169 1127 1071 1016 998 980
1056 980 983 985 1031 1077 1020 962 948 934 996 1059 1121 1183 1118 1052 987 921 973 1024 1076 1127 1161 1196 1186 1177 1065 953 972 991 953 915 1007 1100 1087 1075 1062
1051 1062 1049 1037 1024 1011 999 1039 1080 1121 1162 1077 992 1008 1025 1053 1081 1066 1051 998 945 964 984 965 945 926 907 876 845 887 929 933 937 941 945 948 951 997 1044
1047 1044 1074 1104 1134 1164 1072 981 1020 1059 1002 946 933 920 937 954 1014 1074 960 846 863 879 892 905 874 844 850 857 965 1073 1087 1102 1116 1130 1152
1043 1152 1175 1125 1074 1031 988 1076 1163 1128 1093 1058 1023 1027 1030 1077 1125 1090 1055 1064 1074 1083 1093 1103 1113 1043 973 1004 1036 1037 1037 1038 1039 951 862 879 984 1022 973 979
1038 979 985 988 991 1037 1084 1029 975 973 1058 1089 1121 1153 1184 1227 1183 1116 1048 990 933 948 963 922 881 864 933 1014 1095 1138 1180 1105 1031 999 968 965 962 959 956 918 880
1033 880 918 1043 1108 1085 1024 1051 1092 1133 1126 1033 942 852 910 968 974 892 810 816 834 852 876 900 857 815 817 818 864 909 993 1077 1132 1100 1044 988 965 942 962
1029 962 982 934 885 912 1027 1058 1002 946 978 1020 976 937 985 1059 1132 1081 1029 975 921 969 1017 1033 1049 1016 1070 1108 1146 1117 1088 1088 1089 1090 1091 1090 1090 1090 1089 1100
1024 1100 1110 1121 1131 1101 1070 1040 1010 990 971 951 932 976 1019 1063 1106 1117 1128 1096 1063 1075 1087 1056 1024 1024 1023 979 935 958 980 931 881 872 863 854 845 859 872
1020 872 929 986 979 972 964 957 889 822 754 687 729 771 813 855 898 940 939 937 878 818 861 903 912 921 931 940 920 900 881 861 867 873 835 798 842 886 930 975 1026 1077
1015 1077 1055 1033 1005 977 993 1009 973 938 946 954 938 921 905 888 951 1014 1033 1052 929 805 813 820 868 916 921 926 894 862 831 799 819 839 859 879 894 910
1010 910 925 940 1001 1062 1051 1039 1016 992 1007 1022 1106 1103 995 887 886 972 1009 1046 993 940 887 834 844 855 909 963 986 1010 990 970 978 985 992 1000 993 987 980 973 1007
1006 1007 1040 1074 1107 1092 1076 1061 1046 981 917 876 923 963 1003 1005 1006 990 974 958 941 927 912 897 882 897 912 855 797 810 823 837 850 855 860 909 957 989
1001 989 1021 980 940 910 880 894 908 946 985 1062 1139 1169 1113 984 941 948 955 967 979 912 846 764 828 968 1020 971 922 949 977 960 944 889 834 773 800
997 800 909 1019 974 929 926 923 920 917 1006 1095 1053 1011 1010 1009 1046 1084 1149 1127 1029 931 902 960 974 989 1017 1132 1174 1130 1048 966 951 937 955 974 950 925 951
992 951 976 1002 1028 1018 1008 998 989 965 942 919 896 932 969 962 955 953 950 990 1031 1028 1026 950 875 882 889 853 817 850 884 917 951 949 946 988 1029 977 925 891 944 1064
987 1064 1097 1054 1011 1000 988 977 966 1038 1111 1102 1006 939 871 899 927 962 997 959 921 931 940 949 959 966 974 982 990 979 969 959 948 942 935 929 922 921 920 875 831 894 957
982 957 896 834 854 962 1003 956 924 980 1029 992 998 1004 1048 1093 1081 1069 1058 1046 1025 1003 1049 1094 1121 1060 976 891 946 1002 961 920 909 985 1026 922 817
978 817 799 912 1025 1020 1015 1010 1005 993 981 970 958 970 981 993 1005 962 919 876 833 835 837 840 842 891 940 990 1039 989 939 889 839 887 935 983 1031 1003 975 947
973 947 919 918 917 844 770 848 926 961 996 993 990 921 851 819 874 881 887 858 829 873 916 955 993 930 867 912 957 979 913 907 901 889 878 887 896 905 915 890 865 841 816
968 816 826 837 848 858 881 903 969 1035 1039 1042 973 903 911 918 882 846 855 864 917 970 968 965 890 815 834 852 827 802 794 786 784 781 837 979 1122 1178 1112 1046 1018 990
964 990 1066 1142 1142 1055 964 959 1002 1045 1032 1020 1007 995 956 918 952 986 925 864 905 946 910 875 834 880 956 1033 1013 993 973 954 935 915 844 773 775 776 822
959 822 868 842 815 834 853 871 890 864 838 812 786 782 778 870 961 965 882 836 878 970 974 850 726 742 846 901 955 938 921 948 974 1011 1048 960 871 855
955 855 925 996 979 971 964 994 1025 1039 1053 1000 946 932 1005 1077 1063 1025 986 905 823 825 914 1004 1006 994 981 1031 1080 1045 922 805 775 857 1026 1190 1208
950 1208 1158 1107 1091 1076 1092 1109 1030 951 914 964 1058 1064 1045 1025 1000 975 920 864 882 900 899 898 898 897 913 930 908 886 820 841 862 883 850 904 1031 1070 1012
946 1012 954 986 1018 1057 1009 972 935 950 1052 1111 1083 971 859 852 932 1000 1067 1073 1079 1043 1094 1218 1254 1186 1117 1148 1267 1313 1272 1212 1153 1109 1065 1021
942 1021 977 946 914 926 938 926 914 946 978 979 981 982 983 989 995 957 919 957 995 961 926 965 1004 999 995 1041 1087 1133 1179 1151 1123 1094 1066 1039 1011 946 880 838 884
937 884 934 898 847 882 965 1048 1033 1017 1001 985 962 938 915 892 855 819 825 832 868 904 940 976 931 886 914 941 983 1025 1023 1022 1023 1025 1027 1029 1050 1070 1090 1111 1146
932 1146 1181 1114 1048 1036 1024 1023 935 846 843 887 932 927 922 989 1057 1062 1066 1071 1076 1058 1040 1089 1137 1172 1119 1072 1025 1047 1070 1092 1115 1069 1024 1022 1020 1023 1027 1127 1226 1283
927 1283 1252 1197 1142 1149 1156 1236 1316 1355 1395 1391 1387 1310 1233 1209 1272 1345 1419 1367 1316 1210 1104 1045 1074 1137 1112 1041 970 1010 1050 1018 985 1023 1060 1098 1135 1115
923 1115 1095 1119 1142 1203 1263 1251 1240 1214 1188 1094 1001 980 1046 1111 1090 995 901 854 894 978 1063 1080 1097 1111 1124 1094 1064 1070 1075 1081 1086 1127 1167 1164 1161 1142 1123 1105
918 1105 1086 1057 1028 999 970 963 957 994 1031 1043 1055 1067 1078 1087 1095 1030 966 951 936 926 917 906 983 1054 1125 1141 1157 1129 1014 922 975 1072 1168 1121 1073 1025 978
914 978 995 1013 1030 1048 1055 1062 1113 1163 1142 1121 1100 1079 1084 1089 1095 1100 1046 993 1012 1031 1049 1067 1085 1102 1122 1142 1162 1181 1158 1135 1068 1001 1062 1122 1182 1243 1226 1209
909 1209 1148 1088 1077 1067 1100 1133 1099 1065 1075 1085 1130 1175 1221 1266 1329 1391 1498 1604 1596 1588 1580 1572 1589 1606 1521 1437 1453 1469 1467 1378 1256 1222 1265 1307 1301 1295 1246
905 1246 1196 1182 1167 1152 1137 1164 1190 1217 1244 1237 1230 1179 1129 1157 1185 1219 1166 1166 1167 1206 1245 1254 1263 1272 1281 1314 1347 1390 1346 1265 1270 1352 1433 1360 1287 1213 1140 1115 1090
900 1090 1137 1184 1280 1376 1429 1481 1501 1521 1541 1561 1553 1546 1539 1531 1497 1462 1384 1306 1269 1232 1239 1246 1216 1187 1201 1215 1241 1268 1299 1244 1220 1195 1209 1222 1167 1112 1130 1148
895 1148 1201 1255 1266 1276 1320 1365 1386 1319 1268 1218 1210 1203 1187 1257 1285 1312 1300 1375 1445 1370 1278 1273 1283 1292 1223 1153 1093 1033 990 1093 1265 1350 1422 1494 1615
891 1615 1649 1551 1540 1573 1519 1431 1431 1503 1488 1381 1362 1438 1428 1385 1342 1391 1354 1289 1311 1430 1461 1378 1295 1363 1343 1233 1210 1298 1386 1376 1454 1605 1668
887 1668 1640 1613 1635 1569 1421 1360 1384 1408 1367 1471 1652 1689 1582 1563 1615 1581 1501 1565 1768 1767 1609 1596 1796 1852 1733 1759 1948 1993 1848 1907
883 1907 2241 2431 2397 2567 2976 3008 2657 2626 3033 3238 3045 3171 3878 4324 4341 4852 6176 7239 7824 9599 13316 17585 22881
880 22881 33607 51469 68257 71457 58133 38770 25243 19590 16637 13437 11370 10996 10478 8858 7325 6625 5926
878 5926 4770 3934 3847 3673 3027 2584 2731 2791 2434 2221 2443 2577 2262 1946 2077 2208 2063 1918 1987 2057 1821 1585 1629 1673 1469
875 1469 1266 1357 1448 1321 1194 1259 1324 1172 1019 1145 1270 1207 1144 1207 1271 1233 1196 1285 1374 1274 1175 1270 1364 1212 1060 1104 1149 1121 1093 1212
872 1212 1331 1203 1075 1113 1150 1086 1022 1131 1241 1133 982 1006 1118 1133 1104 1172 1284 1291 1255 1258 1260 1158 1057 1109 1162 1113 1064 1171 1279 1140
868 1140 1001 1036 1072 1005 939 1003 1066 1058 1049 1080 1111 1012 912 947 981 923 865 870 1019 1093 1079 1072 1065 1052 1040 1086 1132 1019 906 955 1005 953 814 791
864 791 914 954 908 884 861 875 890 950 1010 968 927 963 999 991 984 983 982 981 980 1074 1169 1075 982 988 995 935 875 939 1091 1174 1112 1110 1108 1025 942 965 988 1011 1034
859 1034 1091 1148 1132 1116 1134 1152 1126 1101 1062 1024 942 860 838 815 865 915 963 1010 984 959 967 976 984 992 987 983 978 974 1006 1038 940 842 896 951 934 916 953 990 1129
854 1129 1268 1319 1371 1205 952 866 925 989 967 1015 1063 1039 1015 1011 1094 1110 1039 979 1007 1076 1057 1014 1015 1016 973 951 1017 1041 978 956 1020 1099 1133 1124 1114
850 1114 1058 1002 1017 1033 1035 994 962 1018 1073 1042 993 988 959 929 939 1036 1065 1007 941 962 1027 1004 950 984 1036 1088 1112 1137 1115 1006 972 1026 1118 1123 1116 1109 1082
845 1082 1012 947 968 1014 1059 1088 1161 1191 1134 1057 1066 1118 1126 1106 1085 1067 1049 1060 1157 1187 1130 1032 1020 1030 1039 1040 1085 1157 1142 1083 1068 1049 988 920 897 851 806
841 806 806 893 999 1062 1124 1187 1200 1125 1026 1015 1026 1038 1075 1200 1348 1294 1089 928 899 956 1024 1092 1066 1040 1023 1049 1062 987 918 936 1026 1073 1075 1077
837 1077 1087 1010 934 946 1035 1123 1145 1167 1194 1134 1080 1026 1038 1051 1060 1068 1038 1009 988 1055 1170 1199 1155 1198 1259 1320 1273 1225 1303 1380 1441 1415 1394 1373 1414
832 1414 1455 1429 1402 1368 1420 1496 1571 1607 1643 1685 1726 1800 1961 2078 2196 2355 2601 2908 3301 3991 5117 6740 9089 12360 16067 18735
829 18735 18819 16284 12616 9358 7174 5811 4941 4374 3953 3614 3276 3077 2878 2628 2379 2178 1978 1778 1666 1665 1663 1635 1608 1580
826 1580 1552 1477 1403 1459 1514 1515 1516 1516 1517 1474 1432 1389 1346 1329 1312 1295 1278 1315 1353 1391 1429 1385 1341 1340 1340 1273 1205 1210 1216 1138 1059 1034 1095 1148 1201 1186 1172 1152 1132
822 1132 1156 1179 1149 1119 1162 1204 1165 1126 1159 1193 1208 1223 1194 1166 1194 1223 1252 1280 1260 1239 1262 1285 1284 1284 1327 1370 1322 1274 1232 1189 1126 1150 1247 1256 1187 1118
817 1118 1198 1277 1296 1227 1207 1186 1184 1182 1180 1177 1184 1191 1294 1397 1427 1370 1319 1267 1242 1216 1233 1251 1207 1164 1216 1269 1292 1229 1142 1054 1058 1061 1137 1212 1203 1193 1184 1174 1151
812 1151 1127 1104 1080 1066 1051 1080 1109 1070 1030 1067 1190 1231 1185 1092 999 1046 1093 1140 1187 1156 1125 1137 1150 1161 1172 1184 1195 1200 1205 1254 1302 1276 1249 1289 1330
808 1330 1287 1156 1093 1118 1191 1178 1147 1115 1187 1259 1259 1258 1204 1149 1167 1185 1205 1225 1245 1265 1255 1246 1236 1227 1132 1037 966 982 1005 1028 1013 999 991 983 1048 1113 1184
804 1184 1256 1225 1195 1163 1132 1101 1070 1052 1034 1113 1191 1234 1189 1126 1063 1064 1153 1241 1242 1154 1066 1073 1081 1018 956 1018 1081 1110 1052 1043 1034 1005 975 989 1003 1035 1066 1054
799 1054 1042 981 921 963 1004 991 977 963 949 949 948 1021 1093 1142 1192 1198 1204 1147 1090 1100 1110 1147 1096 1046 1082 1117 1153 1150 1147 1124 1101 1078 1055 1120 1185 1177 1170 1129 1089
794 1089 1174 1259 1286 1226 1209 1193 1162 1043 963 971 1007 956 911 953 1042 1132 1126 1120 1067 1014 1004 995 1038 1081 1081 1080 1153 1225 1229 1087 927 912 1019 1126 1117 1020
790 1020 1019 1106 1171 1149 1137 1126 1087 1047 1052 1056 1041 1026 1012 997 1054 1112 1126 1139 1110 1080 1152 1224 1262 1300 1332 1365 1413 1375 1337 1386 1485 1584 1616 1648 1615 1582
785 1582 1596 1697 1756 1729 1751 1772 1836 1812 1794 1775 1772 1768 1765 1761 1766 1770 1731 1692 1701 1710 1676 1641 1644 1647 1650 1652 1629 1606 1602 1684 1741 1710 1662 1613 1551 1489 1427 1365 1351 1337 1227
780 1227 1117 1053 1077 1148 1218 1221 1136 1101 1065 1044 1022 990 1045 1089 1046 1013 981 1007 1034 1006 1065 1174 1196 1112 1029 1022 1015 1052 1089 1076 1063 1006 950 941 931 922
776 922 913 951 989 984 978 1035 1092 1149 1205 1176 1146 1117 1087 1053 1018 984 949 1007 1065 1050 1036 1007 978 1022 1066 1067 1068 1069 1070 1050 1030 999 1056 1126 1108 1044 980 949 918
771 918 983 1048 1090 1046 1023 1044 1047 1006 941 963 1013 1020 985 995 1027 1016 960 903 905 906 949 991 1030 1025 990 1042 1112 1095 1011 1014 1119 1223 1173 1123 1161 1199 1237
767 1237 1275 1222 1168 1159 1149 1139 1129 1076 1023 1059 1094 1130 1166 1169 1173 1134 1094 1133 1172 1115 1058 1097 1223 1306 1301 1227 1153 1117 1082 1107 1132 1084 1036 1047 1058 1069
762 1069 1080 1080 1079 1121 1164 1219 1273 1197 1121 1081 1042 1002 962 978 995 1011 1027 1042 1056 1114 1172 1200 1228 1213 1197 1233 1269 1262 1254 1187 1119 1052 984 973 962 878 794
758 794 840 886 932 978 976 975 973 972 995 1018 998 978 991 1004 974 943 995 1046 1025 1003 976 948 921 893 860 827 837 848 898 948 955 962 961 960 959 958 929 900 871 842
753 842 838 834 830 826 931 1037 1070 1103 1070 1037 1004 971 1007 1042 1006 969 950 931 912 893 883 873 863 853 835 817 842 868 895 923 950 978 1002 1027 950 874
748 874 901 929 884 838 802 765 829 894 929 964 897 830 860 890 920 950 971 993 1014 1035 1113 1190 1225 1259 1247 1236 1151 1067 994 921 979 1037 1125 1212 1141
744 1141 1069 1084 1099 1114 1130 1136 1142 1076 1009 1027 1045 1063 1082 1045 1009 973 936 956 976 953 929 943 958 972 987 1028 1070 1039 1008 993 978 963 949 1017 1085 1101
740 1101 1029 986 942 995 1048 1084 1120 1112 1104 1149 1194 1138 1081 1054 1028 957 887 936 986 1017 961 952 1030 1059 1001 939 877 882 887 957 1028 1025 1023 1044 1065 1042 933 873
735 873 958 1048 1052 996 939 979 1019 1135 1251 1344 1350 1335 1320 1348 1289 1160 1030 976 1009 1020 1031 974 918 877 836 867 899 945 991 994 996 987 978 1013 1047 1070
731 1070 1093 1043 993 1027 1061 1095 1129 1177 1226 1144 1062 1034 1007 979 952 922 892 963 1034 1119 1204 1187 1171 1158 1146 1134 1122 1065 1008 994 981 984 987 917 848 862
726 862 877 892 907 942 978 1014 1049 1043 1036 1029 1023 1054 1085 1044 1003 987 971 942 868 850 918 959 957 945 933 918 904 917 930 947 963 1002 1084 1124 1076 979 969 1002
722 1002 990 962 933 974 1015 1038 1060 1083 1106 1077 1047 1020 993 1022 1094 1147 1113 1044 975 1002 1030 1056 1082 1037 948 910 959 1054 1105 1123 1142 1114 1086 1057 1029
717 1029 1005 982 973 1052 1106 1116 1110 1105 1096 1088 1039 991 986 981 1022 1062 1060 1014 982 1037 1092 1060 1011 1006 1000 951 902 940 1022 1016 957 941 968 995 997 1000 1046 1092 1070 1048 1070
712 1070 1092 1095 1098 1101 1103 1172 1240 1232 1137 1054 1058 1129 1113 1052 990 1082 1175 1216 1258 1227 1196 1134 1072 1083 1094 1102 1110 1075 1039 1103 1167 1231 1295 1292 1289 1285 1282 1195 1109 1094 1080
707 1080 1108 1135 1067 998 988 1065 1142 1132 1125 1117 1148 1179 1168 1158 1220 1283 1303 1324 1388 1452 1455 1458 1505 1552 1501 1450 1361 1271 1244 1303 1436 1481 1413 1346 1375 1404
703 1404 1413 1423 1365 1307 1312 1404 1520 1636 1619 1602 1586 1569 1565 1561 1557 1553 1471 1388 1437 1485 1451 1417 1426 1436 1436 1437 1395 1352 1396 1439 1488 1450 1435 1420 1399 1379 1308 1236
698 1236 1296 1355 1345 1336 1326 1316 1314 1311 1376 1440 1452 1376 1350 1323 1290 1257 1181 1104 1100 1095 1134 1173 1225 1277 1285 1293 1279 1264 1206 1148 1171 1193 1260 1326 1320 1314 1308 1302 1262 1221
693 1221 1181 1140 1141 1141 1185 1229 1226 1222 1219 1216 1186 1155 1169 1182 1240 1298 1312 1326 1255 1184 1185 1187 1211 1235 1303 1371 1334 1298 1262 1226 1234 1242 1207 1172 1119 1066 1114 1163 1212 1260
688 1260 1265 1270 1210 1150 1133 1116 1046 976 1036 1097 1117 1137 1157 1177 1180 1182 1258 1333 1311 1289 1340 1390 1368 1345 1322 1299 1278 1257 1279 1302 1335 1369 1402 1436 1392 1348 1347
684 1347 1347 1307 1266 1299 1331 1308 1284 1261 1238 1284 1329 1375 1421 1434 1448 1389 1331 1278 1226 1246 1266 1221 1176 1233 1290 1362 1434 1404 1375 1371 1368 1365 1361 1319 1277 1278 1279 1264
679 1264 1248 1276 1305 1338 1372 1362 1352 1303 1254 1248 1243 1235 1227 1218 1210 1267 1323 1249 1174 1198 1222 1246 1270 1229 1188 1249 1309 1379 1449 1446 1444 1441 1438 1436 1433 1458 1484 1509 1534 1464 1393
674 1393 1322 1252 1332 1412 1564 1717 1769 1821 1743 1665 1600 1535 1514 1493 1515 1537 1559 1581 1553 1526 1454 1383 1300 1216 1234 1253 1316 1380 1444 1507 1511 1515 1518 1522 1562 1602
670 1602 1570 1537 1565 1592 1547 1502 1471 1439 1481 1522 1539 1556 1573 1590 1557 1524 1491 1458 1497 1536 1575 1615 1602 1590 1577 1564 1530 1495 1504 1512 1563 1614 1591 1569 1521 1473
665 1473 1424 1376 1376 1375 1419 1462 1520 1578 1539 1501 1507 1600 1741 1881 1911 1853 1844 1835 1807 1779 1819 1858 1933 1920 1885 1849 1878 1907 1937 1966 1986 2006 2026 2046 2098 2151
661 2151 2203 2256 2253 2251 2248 2245 2181 2117 2052 1988 1967 1945 1918 1891 1935 1892 1854 1816 1855 1893 1888 1882 1934 1986 1995 2003 2012 2022 2031 2041 2012 1984 1955 1927 1974 2022 2026 2030 1935 1840 1821
656 1821 1890 1995 2012 1954 1895 1924 1952 1937 1922 1901 1880 1821 1762 1756 1837 1914 1990 1980 1971 1961 1952 1942 1933 1923 1914 1903 1893 1839 1785 1771 1757 1786 1816 1860 1904 1948 1992
652 1992 2009 2027 2088 2149 2151 2152 2081 2010 1964 1919 1873 1827 1821 1815 1809 1803 1852 1902 1951 2000 2047 2095 2040 1985 2017 2049 2008 1967 1914 1861 1910 1959 1957 1955 1952 1950 1961 1971 1981 1992
647 1992 1980 1969 2001 2033 2024 2014 2048 2082 2062 2041 2021 2000 1985 1969 1953 1938 1871 1805 1840 1875 1859 1843 1929 2015 2027 2040 2008 1977 2013 2050 2086 2122 2082 2042 2003
642 2003 1963 2007 2052 2140 2228 2218 2208 2154 2101 2122 2143 2165 2186 2231 2276 2321 2366 2318 2270 2352 2435 2432 2430 2427 2424 2481 2538 2696 2854 2888 2922 2883 2845 2844 2844 2916 2988
638 2988 3047 3106 3166 3225 3362 3499 3636 3773 3842 3912 4055 4197 4357 4517 4779 5040 5306 5571 6118 6664 7138 7700 8451 9349 10311
635 10311 11535 13245 15390 18084 21909 27434 34730 44214 57096 73136 87870 94260 88542 74141 58376 46153
633 46153 37792 31660 27009 23743 21261 18825 16477 14514 12928 11426 10069 9020 8116 7205 6382 5863 5547 5224 4901
631 4901 4750 4599 4375 4151 3886 3622 3357 3093 3042 2991 2867 2743 2718 2692 2565 2438 2392 2346 2301 2255 2220 2185 2049 1912 1898 1883 1869 1855
627 1855 1939 2022 1888 1754 1752 1750 1748 1746 1768 1791 1712 1632 1680 1727 1643 1559 1633 1706 1678 1649 1603 1557 1511 1465 1498 1531 1492 1452 1435 1417 1356 1295 1318 1341 1365 1388
623 1388 1424 1461 1425 1389 1398 1406 1342 1278 1336 1394 1379 1364 1383 1401 1420 1439 1418 1398 1334 1270 1374 1479 1424 1369 1370 1372 1374 1375 1376 1377 1334 1291 1292 1294 1339 1384 1409 1433 1457
618 1457 1481 1447 1413 1311 1210 1235 1348 1365 1294 1239 1271 1303 1247 1188 1215 1261 1306 1286 1267 1320 1372 1442 1511 1537 1562 1649 1735 1798 1774 1673 1573 1511
614 1511 1448 1426 1404 1309 1214 1195 1176 1119 1062 1071 1166 1224 1194 1136 1164 1182 1199 1264 1329 1347 1277 1213 1236 1277 1319 1322 1325 1289 1254 1188 1209 1187 1164 1130 1183 1187 1192
610 1192 1198 1205 1212 1219 1238 1257 1286 1229 1210 1278 1442 1519 1496 1474 1446 1418 1337 1256 1181 1106 1109 1198 1221 1156 1081 1093 1152 1211 1212 1214 1215 1217 1192 1167 1142 1117 1139 1162 1184
605 1184 1206 1166 1127 1131 1135 1205 1275 1273 1270 1271 1272 1274 1275 1237 1199 1166 1133 1132 1219 1256 1293 1325 1357 1400 1356 1307 1344 1420 1409 1333 1258 1182 1106 1067 1115 1168 1134 1050 1052 1073
600 1073 1094 1081 1068 1021 973 930 1032 1145 1170 1133 1097 1060 1023 969 1002 1107 1126 1064 1002 1065 1128 1055 982 981 981 946 911 1001 1091 1096 1014 976 1024 1098 1171
596 1171 1249 1328 1355 1382 1415 1360 1292 1224 1281 1338 1270 1202 1208 1213 1188 1163 1138 1113 1070 1028 974 1008 1123 1151 1051 950 961 1060 1158 1169 1164 1159 1148 1137 1118
591 1118 1098 1121 1145 1152 1160 1167 1174 1226 1278 1286 1294 1274 1254 1277 1301 1271 1241 1174 1106 1078 1138 1270 1314 1247 1179 1149 1120 1147 1173 1200 1227 1229 1231 1233 1234 1284 1333 1382 1431
587 1431 1414 1397 1380 1363 1309 1256 1275 1294 1346 1397 1521 1646 1682 1718 1754 1790 1800 1810 1931 2139 2333 2527 2669 2723 2617 2423 2229 2035 1866
583 1866 1697 1667 1725 1704 1683 1667 1652 1648 1644 1573 1503 1501 1586 1723 1861 1867 1872 1834 1795 1706 1617 1601 1585 1526 1467 1451 1436 1465 1495 1524 1554 1476 1398 1272 1232
579 1232 1285 1338 1353 1367 1349 1332 1314 1296 1259 1223 1253 1284 1344 1318 1215 1112 1054 1082 1105 1128 1153 1178 1185 1105 1035 1052 1087 1123 1127 1132 1209 1286 1270 1255 1288
574 1288 1321 1284 1334 1465 1597 1573 1549 1569 1589 1485 1381 1350 1319 1299 1278 1300 1323 1269 1216 1235 1254 1219 1185 1145 1193 1233 1273 1266 1172 1109 1047 1139 1232
570 1232 1229 1225 1266 1306 1287 1268 1249 1229 1196 1162 1230 1298 1332 1366 1400 1434 1341 1248 1257 1265 1264 1262 1261 1259 1239 1220 1243 1267 1300 1333 1366 1399 1403 1407 1411 1415 1385 1354 1454 1554
565 1554 1582 1610 1682 1899 2141 2296 2393 2403 2339 2189 2081 1974 1893 1811 1861 1910 2044 2177 2209 2241 2106 1971 1879 1787 1715 1642 1569 1497 1466 1436
562 1436 1449 1462 1480 1499 1517 1536 1460 1384 1381 1378 1393 1407 1422 1437 1379 1320 1334 1348 1405 1461 1518 1574 1626 1678 1729 1781 1717 1653 1633 1613 1572 1530 1488 1447 1460 1474
557 1474 1560 1647 1650 1653 1584 1515 1497 1480 1462 1445 1404 1364 1425 1487 1550 1613 1676 1739 1776 1813 1801 1788 1733 1590 1491 1479 1476 1473 1426 1466 1540 1614 1563 1511 1485 1458
553 1458 1528 1597 1572 1460 1408 1502 1674 1702 1632 1561 1554 1547 1540 1534 1542 1551 1554 1557 1534 1425 1359 1380 1465 1550 1510 1470 1466 1462 1458 1454 1471 1487 1504 1521 1494 1468 1514 1559 1600
548 1600 1640 1637 1633 1636 1639 1642 1645 1647 1649 1640 1718 1796 1786 1777 1855 1928 1913 1851 1790 1745 1701 1651 1688 1726 1765 1736 1707 1733 1759 1784 1810 1865 1919 1925 2018 2131 2244 2347 2538
543 2538 2764 2844 2736 2628 2546 2464 2382 2300 2207 2115 1978 1842 1833 1825 1778 1732 1688 1731 1768 1806 1760 1714 1711 1709 1764 1819 1802 1785 1778 1772 1765 1759 1743 1728 1712 1697
539 1697 1732 1766 1757 1748 1784 1821 1857 1893 1920 1946 1900 1853 1817 1780 1845 1909 1928 1946 1965 1983 1977 1971 1921 1871 1920 1968 1944 1919 1949 1979 2009 2038 2039 2040 2054 2112 2139 2080
534 2080 1976 1960 2002 2000 1960 1964 2034 2104 2075 2046 2050 2055 2102 2193 2287 2295 2223 2151 2134 2117 2056 1995 1964 1933 1974 2015 2033 2052 2070 2089 2136 2182 2156 2130 2128 2125 2123 2121 2160
530 2160 2200 2138 2076 2071 2067 2105 2144 2227 2309 2313 2229 2180 2175 2214 2296 2425 2511 2465 2376 2343 2398 2406 2415 2444 2559 2634 2622 2553 2527 2573 2619 2590 2561 2533 2504 2519 2534
525 2534 2625 2803 2933 2976 3022 3155 3332 3466 3532 3642 3736 3829 3649 3469 3320 3171 3022 2873 2870 2868 2866 2864 2979 3094 3218 3342 3604 4010
522 4010 4633 5633 6884 7700 7500 6457 5301 4581 4203 3911 3676 3529 3396 3176 2976 2921 2909 2897 2811 2724 2686 2648 2699 2836 2934
519 2934 2887 2816 2746 2740 2733 2732 2731 2738 2746 2731 2861 3040 3220 3279 3338 3295 3252 3203 3154 3265 3376 3349 3322 3304 3286 3282 3423 3676 3929 4151 4459 5012 5711
515 5711 6687 8331 10690 12788 13273 11755 9394 7585 6709 6268 5870 5616 5561 5505 5328 5151 5167 5182 5038 4894 4956 5018 5037 5056
512 5056 5064 5072 5036 5000 5035 5070 4944 4819 4750 4680 4479 4279 4204 4129 4054 3979 3921 3863 3805 3748 3740 3732 3724 3716 3790 3863 4010 4156 4493 4831 5095 5360 5769
508 5769 6178 6556 7021 7851 8972 9553 9031 7658 6286 5375 4754 4254 3928 3769 3610 3336 3062 2861 2659 2592 2524 2457 2389 2361
505 2361 2332 2231 2130 2014 1897 1854 1810 1797 1785 1670 1556 1480 1403 1458 1512 1532 1552 1528 1505 1522 1539 1483 1428 1399 1371 1415 1460 1517 1575 1588 1602 1610
501 1610 1617 1625 1632 1662 1691 1677 1663 1602 1540 1523 1505 1534 1563 1593 1622 1582 1543 1546 1550 1537 1524 1511 1498 1444 1390 1409 1427 1401 1376 1394 1411 1427 1443 1459 1476 1508 1540
496 1540 1572 1604 1621 1638 1611 1584 1585 1586 1587 1589 1587 1585 1584 1582 1592 1602 1613 1623 1590 1558 1569 1580 1561 1541 1521 1502 1452 1403 1353 1304 1325 1347 1368 1390 1422 1455 1487 1520 1473
492 1473 1426 1385 1344 1322 1387 1452 1430 1329 1227 1193 1159 1208 1257 1239 1221 1189 1244 1305 1279 1179 1166 1201 1235 1162 1090 1148 1206 1175 1144 1157 1169 1132 1094
487 1094 1099 1105 1131 1158 1184 1211 1253 1295 1265 1234 1212 1189 1210 1232 1277 1323 1412 1501 1529 1557 1584 1612 1544 1477 1410 1343 1308 1274 1239 1205 1189 1173 1157 1141 1197 1252
483 1252 1308 1364 1332 1300 1201 1102 1053 1092 1125 1159 1174 1190 1206 1222 1181 1139 1145 1238 1366 1407 1371 1336 1308 1281 1254 1226 1189 1151 1157 1163 1202 1241 1280 1318 1343 1368
479 1368 1320 1272 1219 1167 1210 1254 1318 1295 1225 1155 1164 1259 1355 1364 1299 1235 1217 1287 1366 1446 1429 1413 1465 1517 1525 1533 1476 1419 1324 1229 1208 1274 1302 1243 1185 1215 1263
474 1263 1311 1230 1149 1092 1122 1153 1185 1097 1009 943 964 1028 1006 980 955 973 992 1005 1105 1206 1219 1218 1217 1210 1204 1166 1129 1164 1199 1166 1133 1144 1155 1148 1142 1180 1217
470 1217 1210 1202 1127 1052 1053 1141 1186 1143 1064 984 1001 1017 1018 1018 1018 1018 1060 1102 1101 1099 1121 1143 1165 1188 1175 1163 1150 1138 1037 936 966 995 1054 1113 1172 1230 1224 1217 1166
465 1166 1116 999 882 929 1063 1168 1187 1158 1130 1112 1094 1120 1146 1179 1212 1173 1133 1079 1025 1096 1168 1174 1092 1017 941 983 1025 1068 1110 1071 1032 993 954
461 954 926 898 966 1034 1138 1155 1095 1035 1015 1082 1193 1217 1139 1061 1051 1040 1031 1022 1013 1005 1005 1005 1005 1005 1014 1022 1031 1039 985 931 1007 1083 1048 1013 1001 1077 1101 1125 1112 1098
456 1098 1044 990 980 970 935 900 909 918 976 1035 1050 1066 1078 1091 1104 1117 1044 971 903 835 878 1009 1173 1191 1072 953 907 948 981 1014 1053 1091 1050 1009
452 1009 962 1003 1021 1040 1063 1087 1123 1159 1151 1143 1129 1115 1145 1175 1263 1351 1337 1323 1287 1251 1259 1267 1283 1300 1361 1421 1482 1542 1536 1530 1497 1551 1606 1573 1406 1239 1177
447 1177 1202 1201 1199 1198 1197 1196 1109 1070 1031 1017 1002 1032 1061 1061 1062 1063 1063 1085 1106 1026 946 931 916 1032 1148 1194 1239 1241 1242 1180 1117 1098 1079 1012 946 923 900 920 939
442 939 1032 1124 1164 1205 1173 1141 1115 1089 1064 1038 1053 1069 1040 1012 1028 1044 1104 1163 1155 1147 1138 1130 1058 985 1015 1044 1044 1044 1087 1130 1116 1103 1045 988 1025 1061 1025 988
438 988 984 980 976 971 1010 1048 1087 1125 1100 1075 1050 1025 1057 1089 1121 1153 1119 1085 1094 1104 1118 1132 1044 956 995 1034 1029 1024 1012 1000 988 976 976 977 977 978 1003 1028 1009 991 1006
433 1006 1022 1037 1052 1029 1007 1027 1048 1045 1043 1040 1037 1027 1016 1078 1139 1173 1207 1197 1187 1206 1225 1200 1176 1208 1239 1175 1110 1090 1157 1268 1292 1243 1195 1142 1088 1091 1093
428 1093 1053 970 889 895 922 949 972 996 1063 1130 1049 969 939 996 1060 1079 1056 1034 1045 1057 1139 1220 1198 1133 1110 1174 1201 1140 1082 1111 1172 1189 1135 1081 1085 1089
424 1089 1094 1098 1114 1130 1146 1162 1147 1132 1118 1103 1084 1065 1090 1115 1107 1098 1103 1151 1166 1094 1001 908 882 856 932 1008 1057 1107 1113 1118 1106 1093 1080 1067 1008 949 937 1012
419 1012 1076 1053 1013 1017 1053 1045 967 933 968 1002 967 932 941 950 1003 1056 1087 1118 1149 1180 1152 1124 1096 1068 1046 1024 1002 979 1035 1091 1097 1016 910 848 860 914 947
415 947 935 951 967 986 1005 1024 1043 1049 1054 1059 1065 1063 1061 1016 971 1022 1073 1080 1088 1081 1074 1068 1061 1054 1048 1041 1034 1030 1025 1064 1103 1123 1143 1090 1037 1045 1053 1018 983 1019 1055 1091 1128 1095 1063
409 1063 987 911 972 1032 991 949 1001 1052 1103 1155 1116 1077 1039 1000 1036 1072 1108 1144 1136 1127 1075 1023 994 966 937 909 950 991 989 987 1065 1144 1121 1098 1078 1059 996
405 996 933 1057 1182 1205 1228 1153 1077 1075 1072 1114 1156 1096 1037 1047 1057 995 932 952 972 991 1011 1040 1069 1098 1126 1139 1151 1091 1031 1023 1014 1049 1085 1101 1117 1177
400 1177 1237 1239 1242 1172 1102 1106 1110 1114 1119 1182 1245 1236 1226 1218 1209 1157 1105 1077 1049 1022 994 972 950 1001 1051 1046 1040 1034 1029 1015 1001 1025 1050 1082 1027 900 860 909 959 888 818
395 818 817 903 941 978 1041 1103 1142 1093 1016 938 957 976 992 1008 1024 1041 1063 1086 1109 1131 1084 1036 988 941 958 974 991 1008 987 967 990 1013 1063 1113 1090 1068
391 1068 1031 995 958 921 865 809 748 774 825 875 830 785 850 915 937 959 1004 1049 1042 948 893 839 822 806 883 960 989 932 866 886 896 906 895 885 918
387 918 951 1001 1050 1027 1004 1060 1116 1177 1152 1160 1168 1214 1260 1220 1179 1139 1099 1130 1161 1193 1224 1213 1202 1191 1180 1190 1199 1251 1304 1283 1261 1196 1131 1082 1033 1057 1081
382 1081 1109 1138 1122 1107 1189 1272 1224 1176 1210 1245 1256 1179 1140 1101 1062 1023 985 1034 1078 1122 1083 1044 967 890 898 992 1082 1171 1228 1284 1297 1310 1245 1179 1070
378 1070 961 995 1030 997 964 992 1108 1185 1175 1175 1261 1418 1576 1650 1637 1600 1564 1580 1596 1536 1388 1269 1237 1199 1162 1199 1323 1412 1356 1247 1225
374 1225 1246 1268 1276 1283 1253 1223 1200 1264 1328 1305 1271 1238 1243 1248 1236 1224 1255 1287 1261 1235 1253 1270 1306 1342 1426 1424 1373 1322 1339 1355 1408 1460 1446 1431 1407 1469 1483
369 1483 1496 1493 1490 1560 1629 1691 1752 1790 1740 1729 1718 1715 1626 1529 1577 1669 1761 1723 1684 1689 1694 1664 1634 1605 1575 1581 1586 1598 1609 1540 1558 1629 1701 1609 1518 1508 1585 1586 1587
365 1587 1594 1600 1579 1557 1486 1503 1546 1589 1637 1685 1774 1863 1876 1801 1737 1760 1888 2016 2138 2260 2280 2301 2331 2362 2397 2346 2215 2083 1946 1809 1711 1614
361 1614 1590 1565 1570 1574 1578 1583 1613 1643 1673 1702 1637 1572 1551 1529 1496 1462 1473 1483 1474 1466 1530 1593 1579 1564 1616 1668 1681 1607 1533 1547 1577 1608 1600 1593 1617 1642 1600 1558 1558
356 1558 1645 1738 1744 1767 1876 2053 2143 2048 1954 1935 2004 2070 2136 2053 1970 1878 1873 1892 1910 1843 1777 1835 1894 1957 1933 1914 1895 1858 1821 1783 1746 1715 1684 1755 1826
352 1826 1855 1884 1869 1855 1827 1800 1846 1891 1860 1830 1755 1681 1662 1643 1625 1606 1547 1489 1561 1633 1671 1710 1705 1700 1630 1561 1563 1566 1606 1647 1687 1727 1758 1789 1777 1764 1817
347 1817 1870 1850 1830 1812 1793 1775 1756 1760 1764 1812 1859 1806 1752 1771 1790 1844 1897 1849 1801 1746 1690 1707 1724 1634 1544 1556 1567 1586 1605 1580 1555 1645 1735 1781 1827 1819
343 1819 1811 1760 1709 1697 1686 1776 1867 1827 1788 1850 1912 1864 1817 1842 1867 1874 1881 1888 1896 1882 1868 1811 1754 1682 1611 1612 1613 1607 1600 1638 1675 1725 1776 1696 1615 1569 1522 1519 1516 1537
338 1537 1559 1580 1602 1521 1441 1462 1484 1469 1453 1438 1423 1414 1405 1396 1387 1413 1439 1465 1491 1511 1532 1552 1573 1570 1568 1565 1563 1525 1488 1493 1499 1513 1527 1541 1555 1549 1544 1538 1532 1573 1613 1582
333 1582 1550 1478 1407 1407 1408 1416 1423 1431 1438 1439 1440 1398 1355 1284 1213 1215 1217 1212 1207 1202 1197 1194 1191 1144 1098 1096 1095 1166 1238 1258 1278 1299 1319 1294 1269 1245 1220 1230 1241 1208 1176 1106 1036 1038
327 1038 1041 1009 977 1018 1059 1042 1025 1026 1114 1175 1149 1104 1060 1034 1007 1019 1031 1038 958 884 955 1107 1173 1055 937 893 937 1024 1024 995 967 977 987 965 943
323 943 921 899 909 920 930 941 957 973 946 918 955 992 1029 1066 1068 1070 1071 1073 1035 996 958 920 901 882 862 843 869 894 919 945 873 800 801 801 910 1018 1054
319 1054 1090 1010 931 895 859 948 1038 1025 1013 972 931 992 1052 1013 974 1007 1041 976 912 920 928 908 888 868 847 819 791 807 822 882 942 929 916 940 963 914
314 914 865 867 869 916 962 949 936 923 910 959 1009 899 789 721 652 743 835 834 834 833 833 883 933 939 945 905 864 823 782 831 880 886 891 877 862 848 833 879 924
309 924 897 870 842 814 859 903 856 809 834 859 935 1011 1014 1018 912 805 801 797 804 811 819 826 771 717 735 753 751 749 747 745 784 822 904 986 1014 1041 1025 1009 955 901
305 901 847 793 873 952 930 907 857 807 800 793 810 827 843 860 849 838 826 815 807 799 748 697 792 887 938 989 950 910 871 831 865 898 932 965 954 943 932
300 932 921 949 977 932 888 876 864 852 840 848 857 908 960 919 877 836 794 823 851 879 908 874 841 807 774 788 803 817 831 852 872 893 913 980 1047 1040 1034
296 1034 1088 1142 1152 1163 1132 1100 1069 1038 995 952 953 1041 1093 1000 867 821 861 813 728 729 820 911 877 843 876 909 898 887 878 868 815 761 748 735 765 795
291 795 840 886 859 832 832 832 789 745 788 832 744 657 724 791 814 837 896 955 908 775 734 780 844 908 985 1061 1060 973 921 957 965 929 901 917 905 893 929
287 929 965 1000 1036 1032 1028 980 933 922 911 900 888 942 996 1003 923 865 893 895 853 830 851 870 845 840 836 816 751 694 724 799 831 846 862 874 887 911 935 946
282 946 913 874 922 969 930 822 757 822 887 876 865 895 924 885 801 737 760 790 820 856 892 908 925 898 871 883 894 862 830 863 896 923 951 938 838
278 838 778 806 870 891 840 789 869 948 1047 1102 1080 971 883 840 823 806 696 586 607 715 799 839 863 887 908 929 912 895 878 861 822 783 846
274 846 908 943 978 940 902 778 653 609 653 743 833 855 878 890 901 840 779 772 765 720 675 660 731 754 777 763 748 806 865 933 1001 944 887 851 903
269 903 949 995 952 909 866 824 839 855 870 886 862 838 813 789 793 797 802 806 767 729 734 739 766 793 820 847 899 950 958 966 946 926 862 799 792 786 779 773 814 854 872
264 872 802 731 661 686 711 792 872 871 782 729 676 667 657 684 797 911 937 877 817 825 832 830 828 870 911 851 791 755 805 889 974 962 950 1042 1134 1145 1069
260 1069 1013 957 901 844 774 791 813 748 690 719 825 930 887 843 873 902 904 906 908 910 904 899 894 888 816 744 774 803 855 906 914 922 931 940 949 958 963 967 899 831 791 750
255 750 782 814 874 934 994 1054 968 883 870 857 891 925 915 904 925 945 864 783 747 711 719 726 759 791 780 769 775 780 742 704 736 769 758 747 780 813 808 802
250 802 829 942 1050 1013 916 906 998 1090 1035 980 968 957 952 947 942 936 892 848 848 848 787 727 710 693 702 711 719 728 777 827 804 780 804 828 808 788 793 798 802 807 797
245 797 786 848 910 948 986 980 974 995 1015 905 796 799 803 763 723 742 760 779 798 785 772 832 891 942 993 942 892 836 779 767 754 828 903 933 964 948
241 948 932 873 814 852 891 930 969 939 909 878 848 876 903 858 813 797 781 770 760 701 730 812 893 961 1029 1044 972 895 819 809 799 833 867 901 935
236 935 935 935 935 934 875 816 830 843 876 909 941 974 938 903 940 977 1020 1063 1004 946 908 870 837 805 769 821 925 1029 976 923 870 818 841 864 888 911
232 911 846 782 790 798 787 776 766 755 802 848 851 854 848 842 880 918 832 747 685 710 784 859 837 815 837 859 863 779 693 694 765 836 869 816 767 719 777 836 847
227 847 772 675 666 704 741 744 747 749 752 793 833 874 915 820 726 733 740 719 698 779 860 901 943 912 881 855 830 906 982 973 964 912 859 865 871 920 969 978 987 952 918 853
222 853 789 724 659 713 767 777 788 785 783 781 778 762 746 774 801 796 791 786 781 775 768 805 842 837 831 826 820 771 721 671 622 675 728 781 833 835 837 795 753 697 640 685 730
217 730 768 805 842 880 875 871 867 862 783 704 727 750 815 881 903 925 851 777 804 832 754 675 698 721 730 740 749 758 758 758 758 758 785 812 766 721 725 729 835 941 948
212 948 954 917 880 817 754 734 714 743 772 801 830 822 815 807 800 764 728 822 917 860 803 819 834 806 777 761 790 817 757 681 649 688 728 771 813 847 882 916
207 916 950 894 838 782 726 686 646 705 765 744 680 659 725 745 679 617 643 723 803 844 886 925 964 930 896 823 751 808 866 864 862 855 848 839 742 646 637 656
202 656 675 714 795 902 921 861 802 787 773 802 831 823 814 873 931 910 802 699 741 846 863 837 811 869 927 912 855 808 848 886 836 744 653 658 663
198 663 654 645 636 627 677 726 813 901 914 839 765 778 796 813 769 725 681 724 816 864 844 823 844 865 855 846 879 955 998 954 893 877 878 880 882 883 831 734 657 667
193 667 717 767 778 790 786 782 822 862 845 828 811 794 786 777 769 761 748 734 817 899 932 878 845 856 819 738 677 703 719 692 712 775 852 886 875 864 875 887
189 887 898 910 928 946 963 981 912 843 817 791 778 766 824 927 936 857 804 794 790 742 714 773 837 858 879 943 975 921 866 899 929 916 906 940 933 882
184 882 832 825 788 707 672 724 818 825 812 844 915 899 838 820 836 852 881 954 1017 934 788 729 796 906 954 1002 970 938 905 873 847 821 751 682 694
180 694 706 718 730 746 762 705 649 656 663 670 677 728 779 786 794 798 803 764 726 751 777 730 683 747 811 773 735 737 740 814 889 957 1026 963 901 862 823 784 745 778
175 778 812 773 734 747 759 772 785 804 823 842 861 869 876 884 892 903 915 883 851 890 930 926 922 914 906 855 804 808 812 772 732 761 790 776 762 756 751 702 653 734 815
170 815 852 890 839 787 736 685 667 649 704 759 840 920 899 877 877 877 876 876 926 977 897 817 813 808 760 712 736 761 713 664 645 626 651 675 726 776 784 791 811
165 811 832 853 873 878 884 845 806 817 827 794 761 774 788 801 814 777 740 703 667 669 670 672 674 709 744 778 813 799 786 772 759 773 788 802 817 904 992 949
161 949 819 714 754 838 922 903 884 865 847 865 883 829 775 715 656 699 741 778 815 808 802 760 719 779 839 823 808 793 777 793 810 753 696 699 701 704 706
156 706 741 776 810 845 819 793 767 741 803 865 826 786 814 843 799 755 744 733 766 799 781 762 700 637 656 675 694 713 713 713 756 799 828 857 843 828
152 828 800 773 746 718 737 755 774 792 740 687 737 786 827 868 865 863 851 840 828 816 811 805 799 793 871 949 876 803 658 658 760 862 857 764 672 667 683 699
147 699 720 742 764 786 736 686 703 720 736 753 722 691 756 821 886 865 820 775 761 747 733 719 703 686 670 653 722 791 787 784 814 844 831 818 842 867
143 867 848 830 861 892 870 761 756 751 740 729 728 727 726 725 724 723 722 721 681 641 601 561 557 553 593 632 697 762 702 641 631 708 735 763 762 761 722 683 694 793 892 904
138 904 840 777 781 785 786 788 745 703 760 818 857 809 771 820 869 832 764 783 791 800 732 664 645 626 643 746 850 866 820 774 723 671 688 704 721 737 714
133 714 690 710 730 754 777 727 678 664 650 708 767 782 797 812 827 845 862 808 666 555 589 693 709 663 705 794 883 898 914 886 858 817 776 808
129 808 840 854 868 839 809 745 681 719 757 688 619 623 627 663 698 734 770 797 825 809 793 815 837 859 881 821 760 743 726 706 685 665 644 682 719 800
124 800 880 888 895 830 765 700 635 701 767 734 700 667 634 742 850 914 978 916 853 834 814 845 876 906 937 859 781 804 828 807 787 766 746 757 769
120 769 780 791 843 894 945 996 928 859 887 915 845 688 600 657 713 768 760 752 762 772 739 706 667 628 661 695 733 771 765 760 751 741 732 723 737 751 765 779
116 779 793 807 820 834 818 801 784 767 748 728 709 689 748 808 824 840 809 779 850 921 891 860 787 713 630 547 624 700 638 575 556 537 603 668 734
111 734 799 848 898 845 793 720 647 646 645 702 759 744 728 685 641 670 699 702 706 710 713 733 752 771 790 773 756 738 721 770 819 868 917 953 989 982 974 949 923
106 923 897 872 824 776 800 825 798 771 846 920 861 802 844 887 764 641 620 599 636 673 666 659 694 729 764 799 793 787 781 774 774 774 774 775 714 653 693 734 808
102 808 882 913 944 935 926 873 821 762 703 650 596 564 618 697 775 716 657 729 801 844 887 886 886 825 765 777 789 789 790 833 877 846 816 881 946 943 853 807 847
97 847 867 886 911 936 960 983 963 943 940 938 978 1019 940 861 835 895 940 984 961 938 820 701 635 657 696 735 737 738 690 643 642 729 813 810 817 825 805 785 765
92 765 745 758 771 778 785 833 793 730 666 709 752 838 925 900 875 807 738 687 636 687 737 763 790 816 842 854 865 810 754 768 869 970 984 971 958 939
88 939 920 863 805 844 883 871 772 722 672 694 715 804 893 917 854 768 681 640 598 657 717 787 857 883 909 906 903 900 897 943 989 963 936 902 867 832 797 736
83 736 675 715 756 758 759 805 850 881 912 842 771 696 622 678 734 755 776 835 893 920 860 848 837 844 852 898 943 988 945 825 706 621 622 677 731 773 815
79 815 857 898 895 892 888 885 944 1003 1100 1197 1217 1150 1088 1026 951 876 878 966 973 893 818 830 869 909 899 977 1036 1008 934 859 912 966 967 880 803 726 725 811 896 981
74 981 999 1017 971 926 880 834 875 916 957 998 981 965 992 1020 1004 989 974 958 986 1013 968 923 885 847 882 916 927 937 947 957 894 831 874 1003 1097
69 1097 1104 1093 1081 1014 947 894 884 860 748 706 752 827 814 802 877 902 840 780 808 879 906 908 998 1089 1093 1051 1053 1052 1008 964 964 990 972 930 975 1065 1112 1113
65 1113 1114 1095 1032 982 1020 1111 1115 990 908 915 922 931 941 1047 1153 1154 1156 1118 1037 931 913 964 1015 970 925 946 967 945 922 936 950 1008 1065 1123 1180 1136 1092
60 1092 1077 1063 1092 1121 1142 1163 1179 1195 1218 1153 1045 1025 1043 1061 1085 1109 1114 1120 1095 1114 1169 1136 1058 1024 1048 1073 1100 1127 1180 1232 1212 1192 1212 1232 1222 1256
56 1256 1302 1261 1171 1080 1054 1028 1020 1100 1213 1239 1193 1191 1279 1367 1386 1404 1400 1396 1319 1242 1223 1203 1184 1165 1188 1212 1235 1259 1261 1264 1266 1269 1334 1399 1334 1268 1265 1261 1258 1255 1357
51 1357 1459 1430 1401 1367 1334 1300 1267 1255 1243 1231 1219 1210 1200 1147 1094 1223 1353 1351 1350 1428 1507 1484 1461 1527 1593 1557 1521 1567 1612 1556 1500 1540 1580 1576 1573 1587
46 1587 1602 1544 1487 1500 1514 1528 1542 1671 1799 1710 1621 1731 1840 1848 1856 2007 2158 2189 2045 2004 1962 1866 1770 1813 1855 1970 2085 2129 2173 2057 1942
43 1942 2079 2215 2279 2344 2562 2780 2850 2919 3192 3639 4094 4548 5026 5097 4688 4191 3986 3954 3863 3772 4055 4338 4490 4642 5119 5595
39 5595 5901 6207 6965 8013 8871 9903 11663 13858 16116 19217 24349 31368 40158 52637 70368 88883 98077 91329
37 91329 72742 53197 39830 32067 26618 22359 19665 17812 15697 13436 11777 10552 9172 7791 6932 6450 5866 5195
35 5195 4808 4682 4406 4044 3961 4082 4119 4069 4302 4738 4956 4739 4301 3862 3359 2855 2512 2373 2262 2151 2125 2099 2024 1948 1872 1797 1654
32 1654 1511 1531 1639 1702 1678 1636 1593 1515 1436 1430 1424 1415 1406 1398 1389 1365 1341 1360 1380 1285 1190 1200 1298 1313 1242 1176 1198 1172 1146 1149 1239 1284 1330 1375 1420 1365 1224
27 1224 1131 1038 989 940 934 928 890 851 886 920 927 934 942 949 974 1000 1025 1051 905 759 662 710 747 783 867 951 989 941 898 855 843 830 817 804 793 783 729
23 729 675 722 770 817 865 794 724 778 833 864 808 752 783 856 930 936 942 887 832 728 710 744 778 774 769 774 779 784 789 789 790 834 878 904 930 912 895 926 957 988
18 988 1019 1011 1004 997 990 997 1003 967 930 935 941 880 819 785 839 888 936 933 929 926 923 890 857 897 937 925 913 901 889 910 931 952 972 963 954 901 848 830 812 794 775 809 842
13 842 858 786 728 757 862 967 989 1010 988 966 932 897 935 973 924 874 927 979 918 856 839 821 812 803 838 873 830 787 812 836 863 802 808 902 987 985 936
8 936 887 856 824 792 760 802 844 784 724 703 682 734 785 829 873 874 874 847 820 866 912 844 776 752 728 786 845 903 961 935 908 838 768 777 786 795 804 843 883
3 883 922 962 915 868 865 862 841 820 800 779 773 766 760 754 819 885 848 812 862 912 918 924 880 836 864 892 843 793 845 897 930 964 955 945 938 931 924 917 881 844 880 917 908
-2 908 900 848 796 796 796 752 708 709 709 710 711 731 752 729 706 709 711 757 803 769 735 701 667 753 839 852 865 892 919 946 973 916 859 803 746 688 631 646 661 713
-7 713 765 745 725 744 764 740 716 648 581 644 707 761 815 738 662 669 675 610 544 506 467 560 652 702 752 801 851 814 777 784 790 791 791 748 704 759 814 767 721
-12 721 679 638 669 701 681 661 684 708 701 693 730 766 804 842 808 773 798 822 774 726 737 748 758 769 748 727 779 831 858 885 839 793 820 847 831 814
-16 814 741 669 639 610 642 674 705 737 722 708 766 824 864 904 945 985 939 893 804 715 762 810 858 906 888 870 852 833 807 781 755 729 743 757 815
-20 815 873 924 975 1026 1076 961 846 734 796 947 1097 1070 1043 1091 1140 1116 1092 1031 969 981 992 973 954 935 916 891 866 840 815 823 832 841 849 822 795
-25 795 812 829 816 803 791 778 833 889 871 854 773 692 713 734 734 735 780 824 817 809 758 707 753 798 843 888 865 841 818 794 830 865 828 791 746 700 655
-29 655 610 705 800 794 788 848 909 926 943 906 870 833 797 792 788 856 925 902 880 857 835 810 784 832 879 834 789 744 699 660 622 627 632 692 752 811 871 889
-34 889 906 851 796 776 756 809 862 845 829 857 884 827 770 713 656 599 543 558 574 575 575 619 663 674 685 624 563 521 478 538 597 610 622 635 647 659
-38 659 670 580 490 559 627 652 677 728 779 830 881 834 787 701 616 592 656 719 695 653 610 692 775 773 771 769 767 728 689 650 611 637 662 688 713 671 629
-43 629 630 631 686 741 753 764 720 676 734 791 804 817 831 844 799 755 729 790 835 792 761 729 764 800 835 870 844 817 791 764 744 725 638 550 529 594
-47 594 654 714 731 748 766 783 724 666 632 684 743 802 817 833 817 714 617 665 801 850 798 745 771 798 780 763 715 667 620 572 593 614 635 656
-51 656 692 728 692 655 684 713 698 683 679 674 675 676 689 790 842 893 856 818 824 830 858 887 910 933 899 779 707 635 643 652 703 755 807 859 867 875 895 915 891
-56 891 868 826 785 744 703 686 669 696 723 827 932 877 822 769 715 735 754 750 747 816 885 848 812 776 740 734 728 722 716 700 684 668 652 728 803 718 633
-61 633 650 666 725 785 781 776 699 622 617 611 679 746 778 810 842 873 801 728 729 729 811 893 873 853 819 785 751 716 697 677 657 638 594 551 580 610 575 541
-65 541 608 675 748 821 763 705 701 697 737 777 736 694 609 524 559 595 674 753 768 783 754 725 729 733 737 740 760 779 798 818 826 835 844 853 817 782 703 623 629 635 640 646
-70 646 631 616 644 672 703 733 690 648 663 677 649 620 634 648 662 676 706 736 766 797 832 866 800 733 769 806 770 734 695 656 617 578 633 688 743
-75 743 799 847 896 843 789 763 736 782 828 773 718 737 755 762 769 703 638 622 606 634 662 748 835 849 863 848 833 817 802 819 835 779 723 716 709 629 549
-79 549 543 536 574 611 614 617 620 622 638 654 669 685 643 600 631 661 700 738 704 670 731 791 808 825 755 685 687 690 711 733 682 631 700 769 794 819 774 729 728 726
-84 726 672 618 637 655 639 624 565 505 559 612 622 631 702 772 799 826 822 819 771 724 649 574 601 628 700 772 772 772 761 749 782 814 831 848 821 794 767 739
-89 739 711 683 634 585 609 633 708 783 814 845 876 907 891 788 705 709 703 696 647 598 650 703 715 727 739 751 811 871 855 752 654 644 681 718 754 790
-93 790 826 862 813 764 787 810 852 893 862 831 843 855 867 879 803 727 694 662 697 732 700 668 646 711 770 830 769 708 647 585 586 587 587 588 645 702 716
-98 716 730 709 688 668 647 659 671 727 783 796 809 749 689 659 629 643 656 695 734 784 746 689 719 787 768 730 692 750 808 803 798 793 788 712 637 635 632 592
-102 592 551 583 615 640 665 646 627 614 601 660 720 735 750 721 693 711 729 748 766 771 775 847 919 906 805 710 615 571 528 557 586 591 596 601 606 626 646
-107 646 666 687 709 730 752 774 793 812 832 851 877 902 885 867 856 844 833 821 842 862 882 902 802 703 598 580 653 725 760 794 792 789 786 784 785 787 745
-111 745 703 689 674 659 645 610 575 584 592 638 684 730 776 757 738 725 711 643 661 785 908 893 790 687 672 705 739 734 729 758 787 816 846 787 728
-116 728 741 755 728 701 669 724 783 843 777 711 693 676 664 652 631 697 763 741 699 656 710 764 783 802 822 841 863 885 863 842 807 771 780 788 738 688
-120 688 711 734 775 817 859 900 874 847 747 648 637 625 657 690 722 755 714 674 696 717 739 760 716 672 628 583 608 633 730 828 803 779 711 643
-124 643 608 573 610 647 674 701 685 668 671 675 722 769 759 749 696 643 654 666 677 688 695 702 781 860 845 829 885 942 873 804 807 811 836 862 844 825 871 916
-129 916 860 803 783 763 743 723 727 731 735 738 758 777 840 902 881 860 839 818 731 645 660 675 683 691 699 708 687 666 645 624 697 770 799 829 804 779 754 729 762
-134 762 796 786 776 726 675 668 661 641 621 703 785 824 862 857 852 789 725 734 744 769 795 719 642 629 615 645 675 683 691 655 620 600 580 604 628 619 611 645 680
-138 680 757 834 809 785 707 628 681 733 717 700 684 668 651 635 575 515 554 593 632 671 691 711 774 838 823 808 749 690 708 726 700 674 667 661 756 851
-143 851 864 877 846 815 821 828 834 841 836 832 784 735 801 866 932 997 897 798 698 598 674 749 723 697 664 631 641 652 667 682 697 713 720 727 734 741 744 747 750 752
-148 752 718 683 649 614 687 760 760 760 743 727 754 781 796 810 824 839 811 784 757 729 790 850 838 826 806 785 721 657 649 641 676 711 722 732 743 753 719
-152 719 684 693 702 720 737 711 684 709 734 715 696 701 706 754 803 841 879 815 751 746 742 737 732 690 647 765 882 884 886 816 745 726 707 732 757 725 694 706 718
-157 718 751 783 772 762 702 642 713 784 767 751 691 631 673 715 757 799 775 751 727 704 775 847 846 845 831 817 804 790 759 728 741 753 763 772 680 588
-161 588 505 422 498 575 664 754 712 671 681 692 702 712 620 527 467 581 709 837 787 737 697 656 660 663 684 705 726 748 756 763 771 779 716 653 663 672 725
-166 725 777 757 736 698 659 694 728 776 824 799 775 784 794 732 669 643 616 634 651 644 637 630 623 577 531 558 585 664 742 748 754 758 761 721 681 706 730 755 779
-171 779 765 750 692 634 665 695 681 668 622 576 632 688 737 786 704 622 640 659 634 609 628 647 709 772 753 734 787 841 827 812 798 784 812 841 797
-175 797 753 699 645 739 834 951 894 805 715 739 763 787 810 861 912 861 810 795 779 807 835 765 695 668 642 681 719 714 710 731 753 673 593 629 665
-179 665 701 737 754 771 789 806 814 823 789 754 713 672 630 589 581 572 563 555 582 609 680 751 779 807 792 777 751 725 656 587 632 677 621 564 622 680 781
-184 781 883 841 799 757 715 725 736 747 758 744 729 787 845 829 813 754 694 687 679 671 663 703 742 737 733 684 635 659 683 664 644 582 519 568 618 595 572
-188 572 674 776 805 834 790 746 774 803 814 825 836 847 815 784 752 721 729 736 744 752 753 755 684 613 640 668 696 724 726 728 731 733 740 748 828 907 952 996 968 940
-193 940 891 842 866 889 853 817 737 657 733 809 784 758 743 727 712 696 642 588 577 567 622 678 734 789 764 739 714 689 735 781 754 727 663 599 607
-197 607 616 623 631 639 646 623 599 532 465 530 595 584 486 461 523 585 559 501 531 578 625 623 621 619 617 665 713 743 686 622 646 715 741 693 688 782 876 886 808 755
-202 755 746 765 784 762 740 716 692 669 645 651 657 707 757 778 798 746 695 664 633 602 571 573 575 621 667 628 589 545 588 689 790 820 763 674 673 688 659
-207 659 616 616 633 650 652 654 662 670 643 704 813 878 885 892 853 814 748 683 690 696 663 630 670 710 672 635 668 701 671 597 567 623 688 666 601 579 608 636 624
-212 624 612 581 551 544 624 704 783 737 691 683 674 666 658 664 670 676 682 654 626 671 716 700 685 714 742 714 686 608 618 650 682 719 756 812 869 800 732 663 682
-216 682 695 708 719 730 741 751 767 783 803 737 665 593 646 699 750 801 747 605 489 460 507 554 555 556 556 557 514 471 529 587 601 615 556 497 503 509 587
-221 587 665 661 657 652 648 652 655 648 728 769 722 609 583 653 724 699 673 730 786 766 659 564 556 624 693 728 764 756 748 772 796 773 662 519 463 483 504 531
-225 531 558 541 524 495 466 562 657 731 718 681 645 649 653 657 661 654 647 596 546 589 632 675 718 670 623 575 528 478 429 423 417 483 548 619 603 577 551 563 574
-230 574 633 691 749 807 792 777 718 659 647 635 696 756 782 807 765 723 713 790 867 857 752 647 697 746 732 719 705 691 714 737 717 697 659 622
-234 622 628 635 654 673 692 711 731 752 772 793 827 861 896 930 881 831 826 820 815 810 806 801 826 852 877 903 834 765 769 772 683 594 581 655 742 741 694 646 597 548
-239 548 551 642 730 818 839 860 818 777 736 695 695 694 627 559 521 570 642 715 736 758 779 801 815 829 843 857 832 806 780 754 739 725 710 695 718 740
-244 740 763 785 724 664 675 687 658 629 600 571 589 607 624 642 647 652 614 575 589 603 660 718 734 751 767 784 704 624 617 610 635 660 686 711 679 647 639
-248 639 717 734 750 728 706 682 659 631 690 748 807 717 626 567 595 647 698 684 669 660 651 674 784 913 1041 1004 879 754 717 710 704 703 702 767 832
-252 832 800 768 759 837 876 829 729 716 721 726 691 655 692 729 675 621 567 514 515 517 519 521 569 617 665 713 760 806 726 647 603 645 688 643 618 593 635 678
-257 678 682 686 690 694 683 671 704 736 686 637 631 625 654 684 713 742 745 748 794 841 848 855 789 724 664 604 675 745 700 655 653 651 711 771 729 688 645 602 603 604 629 653
-262 653 678 702 698 694 690 686 702 719 736 752 734 715 740 765 776 787 798 809 781 752 723 694 616 539 562 586 621 657 648 640 651 663 674 686 674 661 649 637
-267 637 636 634 633 631 641 650 660 669 649 628 608 588 626 665 631 597 582 568 554 540 561 582 559 536 552 567 583 598 617 636 699 762 755 749 743 737 727 717 750 784
-272 784 821 857 821 784 782 779 732 686 678 669 661 653 651 650 648 647 674 700 727 754 650 546 548 636 700 677 616 642 695 748 733 719 717 715 670 625 620 616 678 741 770
-277 770 712 697 683 736 702 615 528 547 565 584 603 652 701 674 560 491 508 596 685 687 603 524 444 442 440 438 436 457 477 541 605 667 729 785 842 837 746
-281 746 611 563 613 662 644 626 692 758 801 756 711 665 658 651 641 632 623 614 645 675 706 737 742 747 709 670 616 562 509 455 482 508 535 562 504 445 411 463
-286 463 523 583 605 627 606 585 516 533 625 717 732 661 573 485 464 444 533 621 710 799 770 740 711 682 707 732 713 694 708 722 663 604 609 614 619 624 697
-290 697 770 741 713 637 560 557 553 574 594 615 636 624 612 643 674 680 686 649 611 602 592 583 573 606 640 629 619 657 695 661 627 622 618 686 754 751 749 746 744 736 728 719
-296 719 711 659 606 684 762 687 612 638 664 647 630 656 682 762 842 878 915 864 812 761 710 735 760 742 723 752 781 809 838 798 757 717 677 681 686 734
-300 734 782 744 705 667 629 613 598 582 567 633 699 722 744 733 722 638 554 600 645 646 648 672 696 676 656 592 528 536 544 554 564 573 583 589 596 559 523 564
-305 564 604 544 483 545 608 603 599 572 633 688 744 770 796 726 656 578 587 648 710 717 724 659 593 570 547 567 587 636 685 667 649 610 659 760 862 826
-309 826 790 754 719 692 666 683 700 744 787 735 682 620 644 693 741 706 671 654 724 824 836 720 603 588 659 725 791 774 757 740 723 708 693
-313 693 639 586 599 698 798 810 769 728 754 780 729 677 644 698 738 691 626 561 575 588 602 615 654 693 688 684 706 728 751 773 708 642 649 656 664 671 612
-318 612 552 517 569 644 720 738 757 775 794 791 789 786 784 746 707 669 631 618 605 592 579 624 668 713 757 793 828 811 707 633 560 611 663 711 759 676
-322 676 594 594 594 637 681 659 637 616 594 602 609 617 625 630 635 640 645 616 586 601 615 593 571 549 527 608 689 668 647 644 642 639 636 706 776 744 712 685 658 674 690 710
-327 710 730 707 683 665 646 627 608 565 523 524 525 589 652 614 576 591 606 577 548 570 592 614 635 627 618 610 602 528 454 453 451 543 635 626 616 592 567 587 606
-332 606 597 588 622 657 632 606 624 642 615 588 633 679 645 611 650 689 704 719 734 748 706 663 621 579 558 538 518 498 585 672 657 643 653 663 717 771
-336 771 817 863 785 706 686 753 782 724 641 645 668 690 674 658 641 625 597 569 666 763 835 820 781 743 710 677 687 698 769 840 867 894 885 876 823 771
-341 771 707 643 627 612 628 731 823 769 666 562 581 599 617 635 653 672 676 680 684 688 651 614 650 686 681 676 671 667 595 523 611 699 708 718 727 737 735 732 774
-346 774 815 826 837 805 773 766 759 708 658 581 505 530 555 561 566 571 576 602 628 654 681 618 555 574 680 719 758 760 761 762 764 765 766 740 713 687 661 629 597 638
-350 638 678 649 620 634 648 656 663 597 532 524 516 580 645 687 729 815 900 891 882 873 864 875 885 851 818 747 677 649 622 649 675 629 583 617 651 686 720 717 714 711
-355 711 708 698 688 678 668 576 483 493 502 516 530 544 558 570 582 551 519 552 584 617 650 726 802 776 751 690 629 568 506 476 446 459 473 514 556 598
-360 598 640 633 626 619 612 551 489 472 454 483 512 497 482 476 470 565 661 667 673 578 483 456 429 475 520 560 600 597 593 542 491 542 593 628 664 699 734 735 736 694 652
-365 652 605 558 554 551 648 746 771 796 821 846 769 692 664 635 679 722 744 766 788 810 795 779 764 749 701 652 648 643 633 622 655 688 692 697 702 707 733 760 690
-369 690 620 564 595 621 647 565 483 499 660 800 794 719 645 740 835 854 786 663 626 637 648 655 661 668 675 672 668 709 749 760 772 740 708 675 642 609 576
-374 576 559 543 599 655 741 828 783 738 688 637 597 470 380 376 478 580 576 572 640 709 741 773 762 750 715 679 686 694 673 652 674 696 674 653 698 744
-378 744 779 728 652 577 624 670 716 763 733 703 673 643 697 750 808 780 703 627 617 608 634 660 619 578 486 481 581 681 742 715 664 614 563 513 506
-383 506 499 560 622 640 657 657 657 700 743 673 604 552 588 626 577 510 443 435 428 420 413 424 436 520 604 650 696 669 642 641 639 681 723 692 661 648 722 813 816 802
-388 802 787 794 801 735 669 672 674 677 679 637 595 600 692 772 765 740 715 686 657 651 732 776 819 795 771 776 781 742 703 678 653 628 603 651 699 651 604 579 642 700
-392 700 757 754 751 748 744 688 631 622 699 769 752 717 682 707 731 713 694 724 754 688 622 596 657 713 768 762 755 705 655 669 683 698 712 729 745 718 691 700 708
-397 708 717 725 702 679 655 632 593 553 557 561 585 609 589 569 634 698 661 624 588 551 514 478 516 553 591 629 655 681 663 646 617 589 560 532 500 468 509
-402 509 550 552 555 558 560 497 433 414 394 414 434 468 545 643 655 620 630 685 739 695 651 629 607 584 562 614 666 646 625 654 683 712 741 689 637 629 621 674
-406 674 727 707 687 729 772 811 850 802 710 596 569 628 730 763 710 697 729 741 666 635 691 747 716 618 608 703 798 761 725 688 651 635 619 603
-411 603 586 585 583 543 503 502 587 746 904 934 820 692 608 613 661 666 584 472 403 438 561 633 619 587 555 544 533 523 512 572 633 693 753 722
-415 722 692 661 631 635 640 645 650 697 745 748 752 743 733 723 713 735 757 678 598 587 576 609 642 666 691 715 740 700 660 576 493 516 540 564 587 643 698 623
-419 623 548 601 653 663 672 663 655 719 783 764 744 725 706 691 676 662 647 613 578 616 654 634 614 638 662 666 669 673 677 713 749 785 821 788 755 722 689 685 680
-424 680 676 672 643 615 586 557 516 474 564 653 641 628 616 603 535 466 470 474 484 495 505 515 547 579 611 643 731 820 777 735 647 560 603 646 638 629 621 613 649
-429 649 686 679 673 738 803 795 787 785 784 709 635 608 581 655 730 803 876 818 761 769 778 787 795 806 817 784 752 714 676 710 745 729 713 697 682 745 808 828 847 793
-434 793 740 729 719 750 782 808 834 816 712 607 589 596 603 613 622 592 519 462 492 558 581 563 588 674 716 655 594 623 652 682 711 762 812 819 825 808
-438 808 790 729 667 692 716 668 620 599 578 557 536 541 547 552 557 619 680 669 658 673 687 660 634 673 755 766 689 630 658 683 621 536 494 523 553 644 736
-443 736 751 679 557 522 593 663 655 647 640 632 730 828 873 832 736 639 610 581 670 758 771 696 579 549 591 589 525 460 437 413 448 483 561 640 668 697
-447 697 653 609 606 603 600 597 630 662 695 727 740 752 764 776 746 715 728 742 735 728 721 714 680 646 569 491 483 475 467 459 421 383 417 452 507 563 546 529 539 549 559
-452 559 569 561 553 545 537 594 651 690 642 556 556 575 594 565 537 634 730 765 712 665 618 554 491 474 545 673 713 648 583 564 544 568 592 615 637 616 595
-457 595 608 620 633 645 668 691 647 603 643 771 858 800 712 624 628 632 620 608 552 496 513 529 589 649 713 776 787 711 699 687 681 587 524 547 618 689
-461 689 727 765 803 841 860 879 879 793 617 527 625 722 749 688 671 742 763 785 769 752 698 643 607 657 728 710 675 640 672 704 663 623 578 532 560
-465 560 587 626 666 661 657 632 608 583 559 620 680 747 726 689 653 611 570 616 662 714 678 657 636 652 669 677 685 692 700 724 748 772 796 763 729 740 750 733
-470 733 716 700 683 592 502 493 572 613 655 658 661 585 508 426 431 489 548 568 588 608 627 646 666 626 587 620 653 653 653 692 730 745 673 600 615 674 734 755
-475 755 776 787 797 741 684 681 764 847 843 798 752 700 649 548 446 505 563 555 547 539 530 586 643 699 755 735 716 696 677 613 550 563 664 781 811 765
-479 765 719 672 624 649 674 586 499 406 400 481 563 649 736 739 742 745 748 727 707 729 752 678 604 582 647 653 658 658 745 831 830 782 734 688 642 698 755 755 755 756 756
-484 756 721 686 608 529 539 548 596 644 653 574 496 505 548 591 567 543 597 651 705 759 722 685 605 525 443 361 331 389 465 542 618 695 790 799 702 605 530
-489 530 543 632 720 767 727 693 658 665 673 718 764 808 765 674 583 593 690 714 652 529 406 438 469 480 492 547 602 618 633 649 665 705 744 682 620
-493 620 571 523 576 629 626 624 610 684 764 757 702 648 662 675 689 703 680 658 635 613 649 685 698 624 574 524 570 617 605 594 626 659 671 683 652 621
-497 621 595 569 590 699 799 812 697 581 575 655 687 719 685 650 659 668 681 693 662 631 644 658 671 684 730 775 745 627 574 609 661 714 703 691
$$ [...]
-1604E92
##END=	
##END=	
