##TITLE=	Mar05-2018.31.fid
MN 3(1)

##JCAMP-DX=	6.0	$$ MestReNova 14.1.1-24571
##DATA TYPE=	LINK
##BLOCK_ID=	1
##BLOCKS=	1    
##ORIGIN=	Mestrelab Research S.L.
##OWNER=	hrzepa
##$MNOVA/LINK_BLOCK_TYPE=	ITEM	$$ NMR Spectrum
##$MNOVA/ITEM/POLYGON=	(XY..XY)
5321,5835
8722,5835
8722,8208
5321,8208
5321,5835
##$MNOVA/ITEM/Z=	0
##$MNOVA/ITEM/ANGLE=	0
##TITLE=	Mar05-2018.31.fid
##JCAMP-DX=	6.0	$$ MestReNova 14.1.1-24571
##BLOCK_ID=	2
##DATA TYPE=	NMR SPECTRUM
##DATA CLASS=	XYDATA
##NUMDIM=	1
##ORIGIN=	Bruker BioSpin GmbH
##OWNER=	nmr
##.OBSERVE FREQUENCY=	100.64143942070799653
##.OBSERVE NUCLEUS=	^13C
##.SOLVENT NAME=	CDCl3
##.PULSE SEQUENCE=	zgpg30
##LONGDATE=	2018/03/06 02:46:00.000
##.ACQUISITIONMODE=	SIMULTANEOUS (DQD)
##$ORIGINAL FORMAT=	Bruker XWIN-NMR
##$MNOVA/SCALES_VERSION=	9
##$PARAMETER FILE=	(acqus, ASCII, /Users/hrzepa/Downloads/Polysiphenol%20SI%20NMR%20Original%20Data/5/5b%20-%2013C%20-%20400C.18.03.05.031/31/acqus, 0)
$$ ##TITLE= Parameter file, TOPSPIN		Version 3.2
$$ ##JCAMPDX= 5.0
$$ ##DATATYPE= Parameter Values
$$ ##NPOINTS= 11	$$ modification sequence number
$$ ##ORIGIN= Bruker BioSpin GmbH
$$ ##OWNER= nmr
$$ $$ 2018-03-06 02:46:32.062 +0000  nmr@CZC2439F63
$$ $$ /opt/topspin/data/brad/nmr/Mar05-2018/31/acqus
$$ $$ process /opt/topspin3.2/prog/mod/shimcntl
$$ ##$ACQT0= -1.90126054427203
$$ ##$AMP= (0..31)
$$ 100 100 100 100 100 100 100 100 100 100 100 100 100 100 100 100 100 100
$$ 100 100 100 100 100 100 100 100 100 100 100 100 100 100
$$ ##$AMPCOIL= (0..19)
$$ 0 0 0 0 0 0 0 0 0 0 0 0 0 0 0 0 0 0 0 0
$$ ##$ANAVPT= -1
$$ ##$AQSEQ= 0
$$ ##$AQ_mod= 3
$$ ##$AUNM= <au_zg>
$$ ##$AUTOPOS= <2 >
$$ ##$BF1= 100.63037
$$ ##$BF2= 400.2
$$ ##$BF3= 100.63037
$$ ##$BF4= 100.63037
$$ ##$BF5= 100.63037
$$ ##$BF6= 100.63037
$$ ##$BF7= 100.63037
$$ ##$BF8= 100.63037
$$ ##$BYTORDA= 0
$$ ##$CAGPARS= (0..11)
$$ 0 0 0 0 0 0 0 0 0 0 0 0
$$ ##$CFDGTYP= 0
$$ ##$CFRGTYP= 9
$$ ##$CHEMSTR= <none>
$$ ##$CNST= (0..63)
$$ 1 1 145 1 1 1 1 1 1 1 1 1 1 1 1 1 1 1 1 1 1 1 1 1 1 1 1 1 1 1 1 1 1 1 1
$$ 1 1 1 1 1 1 1 1 1 1 1 1 1 1 1 1 1 1 1 1 1 1 1 1 1 1 1 1 1
$$ ##$CPDPRG= (0..8)
$$ <waltz16> <> <waltz16> <> <mlev> <mlev> <mlev> <mlev> <mlev>
$$ ##$D= (0..63)
$$ 0 1 0.00345 0 0 0 0 0 0 0.06 0 0.03 2e-05 3e-06 0 0 0.0002 0 0 0 0 0 0
$$ 0 0 0 0 0 0 0 0 0 0 0 0 0 0 0 0 0 0 0 0 0 0 0 0 0 0 0 0 0 0 0 0 0 0 0 0
$$ 0 0 0 0 0
$$ ##$DATE= 1520304391
$$ ##$DE= 6.5
$$ ##$DECBNUC= <off>
$$ ##$DECIM= 704
$$ ##$DECNUC= <off>
$$ ##$DECSTAT= 4
$$ ##$DIGMOD= 1
$$ ##$DIGTYP= 12
$$ ##$DQDMODE= 0
$$ ##$DR= 21
$$ ##$DS= 4
$$ ##$DSPFIRM= 0
$$ ##$DSPFVS= 20
$$ ##$DTYPA= 0
$$ ##$EXP= <c13>
$$ ##$F1LIST= <111111111111111>
$$ ##$F2LIST= <222222222222222>
$$ ##$F3LIST= <333333333333333>
$$ ##$FCUCHAN= (0..9)
$$ 0 1 2 0 0 0 0 0 0 0
$$ ##$FL1= 83
$$ ##$FL2= 83
$$ ##$FL3= 83
$$ ##$FL4= 83
$$ ##$FOV= 20
$$ ##$FQ1LIST= <freqlist>
$$ ##$FQ2LIST= <freqlist>
$$ ##$FQ3LIST= <freqlist>
$$ ##$FQ4LIST= <freqlist>
$$ ##$FQ5LIST= <freqlist>
$$ ##$FQ6LIST= <freqlist>
$$ ##$FQ7LIST= <freqlist>
$$ [...]
$$ ##$Sgu3PowerLevels= (0..7)
$$ 0 0 0 0 0 0 0 0
$$ ##$Sgu4PowerLevels= (0..7)
$$ 0 0 0 0 0 0 0 0
$$ ##$Sgu5PowerLevels= (0..7)
$$ 0 0 0 0 0 0 0 0
$$ ##$Sgu6PowerLevels= (0..7)
$$ 0 0 0 0 0 0 0 0
$$ ##$Sgu7PowerLevels= (0..7)
$$ 0 0 0 0 0 0 0 0
$$ ##$Sgu8PowerLevels= (0..7)
$$ 0 0 0 0 0 0 0 0
$$ ##$SguType= 3
$$ ##$ShimPowMaxUA= (0..63)
$$ 130000 130000 130000 130000 130000 130000 130000 130000 130000 130000 130000
$$ 130000 130000 130000 130000 130000 130000 130000 130000 130000 0 0 0 0
$$ 0 0 0 0 0 0 0 0 0 0 0 0 0 0 0 0 0 0 0 0 0 0 0 0 0 0 0 0 0 0 0 0 0 0 0 0
$$ 0 0 0 0
$$ ##$ShimPowMaxUC= (0..63)
$$ 130000 130000 130000 130000 130000 130000 130000 130000 130000 130000 130000
$$ 130000 130000 130000 130000 130000 130000 130000 130000 130000 0 0 0 0
$$ 0 0 0 0 0 0 0 0 0 0 0 0 0 0 0 0 0 0 0 0 0 0 0 0 0 0 0 0 0 0 0 0 0 0 0 0
$$ 0 0 0 0
$$ ##$ShimPowMaxUG= (0..63)
$$ 524287 524287 524287 524287 524287 524287 524287 524287 524287 524287 524287
$$ 524287 524287 524287 524287 524287 524287 524287 524287 524287 0 0 0 0
$$ 0 0 0 0 0 0 0 0 0 0 0 0 0 0 0 0 0 0 0 0 0 0 0 0 0 0 0 0 0 0 0 0 0 0 0 0
$$ 0 0 0 0
$$ ##$ShimPowRcbType= 3
$$ ##$ShimPowRes= (0..63)
$$ 1e-20 1e-20 1e-20 1e-20 1e-20 1e-20 1e-20 1e-20 1e-20 1e-20 1e-20 1e-20
$$ 1e-20 1e-20 1e-20 1e-20 1e-20 1e-20 1e-20 1e-20 0 0 0 0 0 0 0 0 0 0 0 0
$$ 0 0 0 0 0 0 0 0 0 0 0 0 0 0 0 0 0 0 0 0 0 0 0 0 0 0 0 0 0 0 0 0
$$ ##$ShimPowRng0= (0..63)
$$ 1 1 1 1 1 1 1 1 1 1 1 1 1 1 1 1 1 1 1 1 0 0 0 0 0 0 0 0 0 0 0 0 0 0 0 0
$$ 0 0 0 0 0 0 0 0 0 0 0 0 0 0 0 0 0 0 0 0 0 0 0 0 0 0 0 0
$$ ##$ShimPowRng1= (0..63)
$$ 1 1 1 1 1 1 1 1 1 1 1 1 1 1 1 1 1 1 1 1 0 0 0 0 0 0 0 0 0 0 0 0 0 0 0 0
$$ 0 0 0 0 0 0 0 0 0 0 0 0 0 0 0 0 0 0 0 0 0 0 0 0 0 0 0 0
$$ ##$ShimPowRng2= (0..63)
$$ 1 1 1 1 1 1 1 1 1 1 1 1 1 1 1 1 1 1 1 1 0 0 0 0 0 0 0 0 0 0 0 0 0 0 0 0
$$ 0 0 0 0 0 0 0 0 0 0 0 0 0 0 0 0 0 0 0 0 0 0 0 0 0 0 0 0
$$ ##$ShimPowRng3= (0..63)
$$ 1 1 1 1 1 1 1 1 1 1 1 1 1 1 1 1 1 1 1 1 0 0 0 0 0 0 0 0 0 0 0 0 0 0 0 0
$$ 0 0 0 0 0 0 0 0 0 0 0 0 0 0 0 0 0 0 0 0 0 0 0 0 0 0 0 0
$$ ##$ShimSysFunc= (0..63)
$$ 1 2 3 4 5 7 9 11 15 16 8 10 12 14 6 17 13 18 19 20 0 0 0 0 0 0 0 0 0 0
$$ 0 0 0 0 0 0 0 0 0 0 0 0 0 0 0 0 0 0 0 0 0 0 0 0 0 0 0 0 0 0 0 0 0 0
$$ ##$ShimSysMatrix= 0
$$ ##$ShimSysType= 1
$$ ##$TFXNUM= 0
$$ ##$TRIPLO2= 0
$$ ##$VTU= 2
$$ ##$VTUETH= <149.236.99.20>
$$ ##$VTUTY= <no>
$$ ##$WBREFAM= (0..15)
$$ 135.5 97.7 100 100 100 100 100 100 100 100 100 100 100 100 100 100
$$ ##$WBREFLM= (0..15)
$$ 0 0 0 0 0 0 0 0 0 0 0 0 0 0 0 0
$$ ##$WBREFPH= (0..15)
$$ 72.26 -67.22 0 0 0 0 0 0 0 0 0 0 0 0 0 0
$$ ##$WBSGU= (0..15)
$$ 0 0 0 0 0 0 0 0 0 0 0 0 0 0 0 0
$$ ##$XFAC= 2
$$ ##END=
$$ 
##$DECIM=	704
##$DSPFVS=	20
##XUNITS=	HZ
##YUNITS=	ARBITRARY UNITS
##FIRSTX=	25273.966162542779784
##LASTX=	-3134.691258222480883
##DELTAX=	-0.43348832563920436378
##XFACTOR=	1
##YFACTOR=	0.053586968807083440458
##FIRSTY=	-41.367473602294921875
##MINY=	-72.99498748779296875
##MAXY=	1858.923095703125
##NPOINTS=	65536
##XYDATA=	(X++(Y..Y))
$$ [...]
12294h56j3j4j3j3K0K0K0K0k5k5k5k5K9K8K9K8JJQm6p1j9L6L6NOK8K8Mm9l3qJ9J9K0K1J4J4
$$ -856 -869 -883 -896 -909 -889 -869 -849 -829 -854 -879 -904 -929 -900 -872 -843 -815 -814 -813 -805 -851 -922 -941 -905 -869 -864 -858 -830 -802 -798 -847 -880 -888 -869 -850 -830 -809 -795 -781
12277g81J4J4k2k1k1k1qpqpJ0J0j6j6J2J3m1m1PON6N7Pm6q2n5JK7J4J4PQPQL1L0N4N4L7j6
$$ -781 -767 -753 -775 -796 -817 -838 -846 -853 -861 -868 -858 -848 -864 -880 -868 -855 -896 -937 -930 -924 -868 -811 -804 -850 -932 -987 -986 -959 -945 -931 -924 -916 -909 -901 -870 -840 -786 -732 -695 -711
12260g11p1p1l7J5Kk4k7jK0M5N8L2k5n1m0l9j4j5N1N1K5K5K3K2K3K2O2O1RRL9L9K7N4J21J74
$$ -711 -782 -853 -890 -875 -873 -897 -924 -925 -905 -860 -802 -770 -795 -846 -886 -925 -939 -954 -903 -852 -827 -802 -779 -757 -734 -712 -650 -589 -580 -571 -532 -493 -466 -412 -291 -117
12244a17J91K80M49N71N48P41J280J685J298Q4j162j601j349r44p03n45l77k54k08j82r5m3
$$ -117 74 354 803 1374 1922 2663 3943 5628 6926 7010 5848 4247 2898 1954 1251 706 329 75 -133 -315 -410 -453
12235d53l7l6KK9om9k3K1L7J1rl6k2k3KKn2n2%%j0j1j1j0m4m3j7j7j4j3K1M8J5k8j8J0OOP
$$ -453 -490 -526 -524 -495 -501 -550 -573 -552 -515 -504 -513 -549 -571 -594 -592 -590 -642 -694 -694 -694 -704 -715 -726 -736 -780 -823 -840 -857 -871 -884 -863 -815 -800 -828 -846 -836 -830 -824 -817
12218h17QJ5J6J6J6j0j0j0j0K5K5jkl0l1K3K2K3K4l0k9o8o8j5j5MLMLL4L5M3O9P1K7k0m6m9
$$ -817 -809 -794 -778 -762 -746 -756 -766 -776 -786 -761 -736 -737 -739 -769 -800 -777 -755 -732 -708 -738 -767 -835 -903 -918 -933 -929 -926 -922 -919 -885 -850 -807 -738 -667 -640 -660 -706 -755
12201g55m8k4k4J2J2J1J2K7K8k5k5o5o4p7n0k3K1N1N1N0N0llk2k2m6m6m2KO3O3K8JJ5N9P3
$$ -755 -803 -827 -851 -839 -827 -816 -804 -777 -749 -774 -799 -864 -928 -1005 -1055 -1078 -1057 -1006 -955 -905 -855 -858 -861 -883 -905 -951 -997 -1039 -1037 -974 -911 -883 -882 -867 -808 -735
12186g35K8j5m2l2nl1n7n5j0J6J6J0J0J0J0jkk7k8k3k4K0K1qrNN7Q7O1J7j0j1J6J4j2l7l6
$$ -735 -707 -722 -764 -796 -801 -832 -889 -944 -954 -938 -922 -912 -902 -892 -882 -883 -885 -912 -940 -963 -987 -967 -946 -954 -963 -958 -901 -814 -753 -736 -746 -757 -741 -727 -739 -776 -812
12170h12ONl1l1l1l2K7K6K7K6QQQQj6j6j6j6l7l8l7l7QPQPj4j4L1L0M7M7K1K0PQj9k0m5m6
$$ -812 -806 -801 -832 -863 -894 -926 -899 -873 -846 -820 -812 -804 -796 -788 -804 -820 -836 -852 -889 -927 -964 -1001 -993 -986 -978 -971 -985 -999 -968 -938 -891 -844 -823 -803 -796 -788 -807 -827 -872 -918
12152i18l1K2L5L6nnj9k0PQK2K3M6M6M2j1o0q6o4j2J9J9N0M9K2K1m6p3m5PNk1k9k9K3K2N0
$$ -918 -949 -927 -892 -856 -861 -866 -885 -905 -898 -890 -868 -845 -799 -753 -711 -722 -782 -868 -932 -944 -925 -906 -856 -807 -785 -764 -810 -883 -928 -921 -916 -937 -966 -995 -972 -950 -900
12136i00M9O1O0%jJ6J7J7J6l5l5l5l5k0k0K3K4L0L0j2j3m9k3K5P9M4rl7l7l7l7j1j1%jk4k4
$$ -900 -851 -790 -730 -730 -731 -715 -698 -681 -665 -700 -735 -770 -805 -825 -845 -822 -798 -768 -738 -750 -763 -812 -835 -810 -731 -687 -696 -733 -770 -807 -844 -855 -866 -866 -867 -891 -915
12120i15jN0O2O2Om8p4k1j1j2rqL3L2P6P5P9N2P4J62J69Q2j00j87j77q8j2j2k4k5n0n1k1k1
$$ -915 -916 -866 -804 -742 -736 -784 -858 -879 -890 -902 -911 -919 -886 -854 -778 -703 -624 -572 -498 -336 -167 -85 -185 -372 -549 -637 -649 -661 -685 -710 -760 -811 -832 -853
12105h53k1k2k9k9l0k9J3J2J3J3pppqk4k5k5k4J2J3J3J3N7N8N8N8J6J6J6J6j1j0j1j1oooo
$$ -853 -874 -896 -925 -954 -984 -1013 -1000 -988 -975 -962 -969 -976 -983 -991 -1015 -1040 -1065 -1089 -1077 -1064 -1051 -1038 -981 -923 -865 -807 -791 -775 -759 -743 -754 -764 -775 -786 -792 -798 -804 -810
12089h10k0k0m6m6llM1M2N8N9L2L2J1J1j5j5m4m3j7j8nnkjOO0M5J8j0j0j1j2l3l3l3l4MNM
$$ -810 -830 -850 -896 -942 -945 -948 -907 -865 -807 -748 -716 -684 -673 -662 -677 -692 -736 -779 -796 -814 -819 -824 -826 -827 -821 -761 -716 -698 -708 -718 -729 -741 -774 -807 -840 -874 -870 -865 -861
12072h61MN2N3N3N2j4j4j5j4LKn0m9n2n2KJj0j0l3l3k5K8Q3Q4L3k0n8l1J6J6rql0k9l0l0J8
$$ -861 -857 -805 -752 -699 -647 -661 -675 -690 -704 -701 -699 -749 -798 -850 -902 -900 -899 -909 -919 -952 -985 -1010 -982 -899 -815 -782 -802 -860 -891 -875 -859 -868 -876 -906 -935 -965 -995 -977
12056i77J7O6O7N6Mj9k0K7K7K6K7PPk8n4o2j0J2J2j5j4j5j5J0J1J0J0k8k8jkL7L6j6j6n0m9
$$ -977 -960 -894 -827 -771 -767 -786 -806 -779 -752 -726 -699 -692 -685 -713 -767 -829 -839 -827 -815 -830 -844 -859 -874 -864 -853 -843 -833 -861 -889 -890 -892 -855 -819 -835 -851 -901 -950
12040i50LLK2K2K2K2O1O0QQk2k2k2k2k4k3k4k3N9N8ONJ5J4M1M1k8k7k8k8J5J4J5J5K7K7k5
$$ -950 -947 -944 -922 -900 -878 -856 -795 -735 -727 -719 -741 -763 -785 -807 -831 -854 -878 -901 -842 -784 -778 -773 -758 -744 -703 -662 -690 -717 -745 -773 -758 -744 -729 -714 -687 -660 -685
12024f85k5j1j0l7l7n1n2KJO4O4M0j4m2o8p0m4jK4J2J2L7L8L7L8ononj4j5L9L8K4K4k9k9l5
$$ -685 -710 -721 -731 -768 -805 -856 -908 -906 -905 -841 -777 -737 -751 -793 -861 -931 -975 -976 -952 -940 -928 -891 -853 -816 -778 -784 -789 -795 -800 -814 -829 -790 -752 -728 -704 -733 -762 -797
12007g97l5l4l5llN0M9N7N7O9M3j1n4q1q1n4rpqj5j5L7L7RRj8j7OOPON3N2K5k0l6l7L1N8L4
$$ -797 -832 -866 -901 -904 -907 -857 -808 -751 -694 -625 -582 -593 -647 -728 -809 -863 -872 -879 -887 -902 -917 -880 -843 -834 -825 -843 -860 -854 -848 -841 -835 -782 -730 -705 -725 -761 -798 -767 -709 -675
11990f75rk4KL2L3j9j8m0l9m0l9PQL1L1L0j3m2m1n4n4k8k8L6L5L6L5K1K2K1K1j6j7j6j6J6
$$ -675 -684 -708 -706 -674 -641 -660 -678 -718 -757 -797 -836 -829 -821 -790 -759 -729 -742 -784 -825 -879 -933 -961 -989 -953 -918 -882 -847 -826 -804 -783 -762 -778 -795 -811 -827 -811
11974h11J7J6J7JJJJJ%%Jm6m6m6m6J5J5J5J5K1K2K1K2m5m6m5m5qrJ9J8l0k9M1O7O0J5j1j2
$$ -811 -794 -778 -761 -760 -759 -758 -757 -756 -756 -756 -755 -801 -847 -893 -939 -924 -909 -894 -879 -858 -836 -815 -793 -838 -884 -929 -974 -982 -991 -972 -954 -984 -1013 -972 -905 -845 -830 -841 -853
11957h53LKLLppo8r4p6k4K7N4P4P5P2P3J3m0n4n4n1n0l6J7P0O9K9L0K3K4K3K4j2j3j2j2oo
$$ -853 -850 -848 -845 -842 -849 -856 -924 -1018 -1094 -1118 -1091 -1037 -963 -888 -816 -743 -730 -770 -824 -878 -929 -979 -1015 -998 -928 -859 -830 -800 -777 -753 -730 -706 -718 -731 -743 -755 -761 -767
11941g67o7o7q3q4l3J9O9P0J2j5JN3N4%l5rJ7J7J%J%m2m3LN6N9Pm0m0j8j8j8j8k8k7k8k8q
$$ -767 -834 -901 -984 -1068 -1101 -1082 -1013 -943 -931 -946 -945 -892 -838 -838 -873 -882 -865 -848 -847 -847 -846 -846 -888 -931 -928 -872 -813 -806 -846 -886 -904 -922 -940 -958 -986 -1013 -1041 -1069 -1077
11924a077pqqQRRQnnnnK5K5M8M9L2k0l4l4NNNNJ3J4J3J3RRRRK5K4J0m3n0n0K6K6MLm1m0K3
$$ -1077 -1084 -1092 -1100 -1092 -1083 -1074 -1066 -1071 -1076 -1081 -1086 -1061 -1036 -988 -939 -907 -927 -961 -995 -990 -985 -980 -975 -962 -948 -935 -922 -913 -904 -895 -886 -861 -837 -827 -870 -920 -970 -944 -918 -914 -911 -952 -992 -969
11905i69K3K3K3ppopPOL3L3k4k5J1N5N5K9kk8m1o7p7l3L3N8N9L2km6l8j1L5L4L6L6lkllNN
$$ -969 -946 -923 -900 -907 -914 -920 -927 -920 -914 -881 -848 -872 -897 -886 -831 -776 -747 -749 -777 -818 -885 -962 -995 -962 -904 -845 -813 -815 -861 -899 -910 -875 -841 -805 -769 -772 -774 -777 -780 -775 -770
11887g70k1k1l6l5rJ7M0mp1p0l8K3M8K1l1l2opk1k1k2k1k5k5J2N6O5O5O5O5K9j5n2n3j8j9
$$ -770 -791 -812 -848 -883 -892 -875 -835 -839 -910 -980 -1018 -995 -947 -926 -957 -989 -995 -1002 -1023 -1044 -1066 -1087 -1112 -1137 -1125 -1069 -1004 -939 -874 -809 -780 -795 -847 -900 -918 -937
11871i37l0mM2Q7Q9M5j4j4j6j7k7k8k7k8J9J9J9J8J8J8J7J8J3J4m9m8l3l3J2J1jjK6K5RRj7
$$ -937 -967 -971 -929 -842 -753 -708 -722 -736 -752 -769 -796 -824 -851 -879 -860 -841 -822 -804 -786 -768 -751 -733 -720 -706 -755 -803 -836 -869 -857 -846 -847 -848 -822 -797 -788 -779 -796
11855g96j7rql5l5m0m0j3j4K2K1K1K2K9L0l3l2qrqqj7j7j7j7oonoL1L1L2L1l7l7l7l7kjkk
$$ -796 -813 -822 -830 -865 -900 -940 -980 -993 -1007 -985 -964 -943 -921 -892 -862 -895 -927 -935 -944 -952 -960 -977 -994 -1011 -1028 -1034 -1040 -1045 -1051 -1020 -989 -957 -926 -963 -1000 -1037 -1074 -1076 -1077 -1079 -1081
11838a081l6l6N3N2OPOPkkL3N9O2Qm7m8rqqrl1l1q0q0m5RO7O7K8K7K4K5K0l1n5n5J0J0J0J0
$$ -1081 -1117 -1153 -1100 -1048 -1042 -1035 -1029 -1022 -1024 -1026 -993 -934 -872 -864 -911 -959 -968 -976 -984 -993 -1024 -1055 -1135 -1215 -1260 -1251 -1184 -1117 -1089 -1062 -1038 -1013 -993 -1024 -1079 -1134 -1124 -1114 -1104 -1094
11820a094OPNNml0m2J1N9J13J16O3L3L3Pm6o4o5o5o4k4L0M9M9nn8m3j7oonmL7L8L7L8M0M1
$$ -1094 -1088 -1081 -1076 -1071 -1075 -1105 -1147 -1136 -1077 -964 -848 -785 -752 -719 -712 -758 -822 -887 -952 -1016 -1040 -1010 -961 -912 -917 -975 -1018 -1035 -1041 -1047 -1052 -1056 -1019 -981 -944 -906 -866 -825
11804h25M1M1O4O5J1J1K2K2K2K2l6l7l6l6l8l7l8l7k5k4K8K9OOk8n5n1LM4P0K8K8k3k4l1l1
$$ -825 -784 -743 -679 -614 -603 -592 -570 -548 -526 -504 -540 -577 -613 -649 -687 -724 -762 -799 -824 -848 -820 -791 -785 -779 -807 -862 -913 -910 -866 -796 -768 -740 -763 -787 -818 -849
11788h49k8k7LN6P9Q0lkkko3o3o3o3j1j2M2M1L2L1L2L2KJKKj3j4j4j3llkll6l6l6l6pqppj7
$$ -849 -877 -904 -901 -845 -766 -686 -689 -691 -693 -695 -758 -821 -884 -947 -958 -970 -928 -887 -855 -824 -792 -760 -758 -757 -755 -753 -766 -780 -794 -807 -810 -813 -815 -818 -854 -890 -926 -962 -969 -977 -984 -991 -1008
11770a008j6j6j7nnonRRJ0ROOOON0N0klK0K1K0K1onnnK4K3K4K3kklkp0p0o6o6k9K4P9P9N6
$$ -1008 -1024 -1040 -1057 -1062 -1067 -1073 -1078 -1069 -1060 -1050 -1041 -1035 -1029 -1023 -1017 -967 -917 -919 -922 -902 -881 -861 -840 -846 -851 -856 -861 -837 -814 -790 -767 -769 -771 -774 -776 -846 -916 -982 -1048 -1077 -1053 -974 -895 -839
11750h39Ln6n5m5m6QPJJJJJ5J6J5J5J6J5J5J6M1M2M2M2jjn4n3k5k4k4k4J8J9J9J8%%%%K9K8
$$ -839 -836 -892 -947 -992 -1038 -1030 -1023 -1022 -1021 -1020 -1019 -1004 -988 -973 -958 -942 -927 -912 -896 -855 -813 -771 -729 -730 -731 -785 -838 -863 -887 -911 -935 -917 -898 -879 -861 -861 -861 -861 -861 -832 -804
11733h04K9K9J3J4J3J3M0M0j3j3m1m1J2J2k8k7k8k8K6K7K6K7RJ0m3m2j4j4j4j3k1k1L2L2n2
$$ -804 -775 -746 -733 -719 -706 -693 -653 -613 -626 -639 -680 -721 -709 -697 -725 -752 -780 -808 -782 -755 -729 -702 -693 -683 -726 -768 -782 -796 -810 -823 -844 -865 -833 -801 -853
11717h53n3k6k5m8m7k4K9O0O1J1J1mnk8k8J6O8O9J6j7j7k0k0l2l1k9k8j2M0O4O3NMk2k2k4
$$ -853 -906 -932 -957 -1005 -1052 -1076 -1047 -987 -926 -915 -904 -908 -913 -941 -969 -953 -885 -816 -800 -817 -834 -854 -874 -906 -937 -966 -994 -1006 -966 -902 -839 -834 -830 -852 -874 -898
11702h98k4K9K8K2K2nnk5k5k1k2pM6Q1N4j9p2n8l3ooK2K2RQm5m4KLKLN5N5O7M0Ln1m9m9n6
$$ -898 -922 -893 -865 -843 -821 -826 -831 -856 -881 -902 -924 -931 -885 -804 -750 -769 -841 -899 -932 -938 -944 -922 -900 -891 -883 -928 -972 -970 -967 -965 -962 -907 -852 -785 -745 -742 -793 -842 -891 -947
11685i47n6l3J9N0N0J%m3m4m7OK2K1jkK1K1om9o7l9L8Q2P4L0NMnoonOOPOM1M0M0M0j0j0j1
$$ -947 -1003 -1036 -1017 -967 -917 -916 -916 -959 -1003 -1050 -1044 -1022 -1001 -1002 -1004 -983 -962 -968 -1017 -1084 -1123 -1085 -1003 -929 -899 -894 -890 -895 -901 -907 -912 -906 -900 -893 -887 -846 -806 -766 -726 -736 -746 -757
11666g57j0k0k0k0j9rrrrm7m6p2k7J4J5J8J7J4J5M9P6N7J3j3j4m0m0m0m0kkK5K4L4L3j9j9
$$ -757 -767 -787 -807 -827 -846 -855 -864 -873 -882 -929 -975 -1047 -1074 -1060 -1045 -1027 -1010 -996 -981 -932 -856 -799 -786 -799 -813 -853 -893 -933 -973 -975 -977 -952 -928 -894 -861 -880 -899
11650h99QRj8j9K6K6k7k7k9k8K4K4J0J0J0J0K8K9K8K9LLLLRJ0RJ0j7j7j7j7J1J2J2J1J1J0
$$ -899 -891 -882 -900 -919 -893 -867 -894 -921 -950 -978 -954 -930 -920 -910 -900 -890 -862 -833 -805 -776 -773 -770 -767 -764 -755 -745 -736 -726 -743 -760 -777 -794 -783 -771 -759 -748 -737 -727
11634g27J1J0l6l7l7l7l9l9J3J3M5M4M4M4M0L9j3j3JJJJj5j4j5j4NNNOj8j7j8j8K0K0K0K0
$$ -727 -716 -706 -742 -779 -816 -853 -892 -931 -918 -905 -860 -816 -772 -728 -688 -649 -662 -675 -674 -673 -672 -671 -686 -700 -715 -729 -724 -719 -714 -708 -726 -743 -761 -779 -759 -739 -719 -699
11617f99J9J9J9J9k6k6K7K6mmnmM4M5J8k6n0k4J1J1p5p5p6p5k3k3k3k3l7l7J5J6rj0rrP6P5
$$ -699 -680 -661 -642 -623 -649 -675 -648 -622 -626 -630 -635 -639 -595 -550 -532 -558 -608 -632 -621 -610 -685 -760 -836 -911 -934 -957 -980 -1003 -1040 -1077 -1062 -1046 -1055 -1065 -1074 -1083 -1007 -932
11601i32P6P5M2M1L9M0k4n1o1j6J3J3J3J4nm8n0oQj8n3n3MMMLKJJKJJKJM5M5M3M2J7k8q7q7
$$ -932 -856 -781 -739 -698 -659 -619 -643 -694 -755 -771 -758 -745 -732 -718 -723 -771 -821 -827 -819 -837 -890 -943 -939 -935 -931 -928 -926 -925 -924 -922 -921 -920 -918 -917 -872 -827 -784 -742 -725 -753 -840 -927
11583i27l3K8M6M7J4J5J5J5J4J5J4J4JJn2n1l0l0K3K3lmllk0k0k0k0J8J7J8J7J3J3J3J3j8
$$ -927 -960 -932 -886 -839 -825 -810 -795 -780 -766 -751 -737 -723 -722 -721 -773 -824 -854 -884 -861 -838 -841 -845 -848 -851 -871 -891 -911 -931 -913 -896 -878 -861 -848 -835 -822 -809 -827
11567h27j9j9j9%%m9m9n3%N8N9J0J0J0J0M0M0L9M0J4J5J4J4k7k8k7k7j0rrj0rrj0rj7j7j7
$$ -827 -846 -865 -884 -884 -884 -933 -982 -1035 -1035 -977 -918 -908 -898 -888 -878 -838 -798 -759 -719 -705 -690 -676 -662 -689 -717 -744 -771 -781 -790 -799 -809 -818 -827 -837 -846 -863 -880 -897
11550h97j7PPPPj6j7j6j6nmmmM9M8K6k7k7k7l0l1L4L3L4L3%J%%J5J4J4J5L3L3J0m3p5p5k5
$$ -897 -914 -907 -900 -893 -886 -902 -919 -935 -951 -956 -960 -964 -968 -919 -871 -845 -872 -899 -926 -956 -987 -953 -920 -886 -853 -853 -852 -852 -852 -837 -823 -809 -794 -761 -728 -718 -761 -836 -911 -936
11533i36k6J3J3J3J3m3m3k0L2OPRJ0K2K2K2K2N9N8OOj8j8j7j8J7J8M7om7m7m7m7KN5P5P5K5
$$ -936 -962 -949 -936 -923 -910 -953 -996 -1016 -984 -978 -971 -962 -952 -930 -908 -886 -864 -805 -747 -741 -735 -753 -771 -788 -806 -789 -771 -724 -730 -777 -824 -871 -918 -916 -861 -786 -711 -686
11516f86k8n0n1rj0j0j0j9j9j6j7oL8K9Lj2J6N1N1j4j4j4j4qqrqJ2J2J1J2KKKKK8K7K8K7o4
$$ -686 -714 -764 -815 -824 -834 -844 -854 -873 -892 -908 -925 -931 -893 -864 -861 -873 -857 -806 -755 -769 -783 -797 -811 -819 -827 -836 -844 -832 -820 -809 -797 -795 -793 -791 -789 -761 -734 -706 -679 -743
11499g43o5j2M9O1L5%JKKl3o0m4%K6K6k3k4k3k4MNMML8L9O1J8m2o8n6n6j5j4j5j4J2J2O4O5
$$ -743 -808 -820 -771 -710 -675 -675 -674 -672 -670 -703 -763 -807 -807 -781 -755 -778 -802 -825 -849 -845 -840 -836 -832 -794 -755 -694 -676 -718 -786 -842 -898 -913 -927 -942 -956 -944 -932 -868 -803
11482h03J1J1m1m2KLKKK8K7L9J4m4q8q9m5oplmL9M0L9L9M1M0j2j2K1K1J9J9k9n5o3j9J8M5
$$ -803 -792 -781 -822 -864 -862 -859 -857 -855 -827 -800 -761 -747 -791 -879 -968 -1013 -1019 -1026 -1029 -1033 -994 -954 -915 -876 -835 -795 -807 -819 -798 -777 -758 -739 -768 -823 -886 -905 -887 -842
11466h42N7J4k0k0k2k3M3M2M3M2j7j7o7o7n6j2N2N2N9O0PPJ9K0J9J9LMm9n0l0l1l1l0J5J5
$$ -842 -785 -771 -791 -811 -833 -856 -813 -771 -728 -686 -703 -720 -787 -854 -910 -922 -870 -818 -759 -699 -692 -685 -666 -646 -627 -608 -605 -601 -650 -700 -730 -761 -792 -822 -807 -792
11450g92J6J5j5j4j5j4K0K0N4Q1O7J4k8n5n7n8opK6K5k7k7k1k1k1k0%%kjJ1j5l0K3N4N4NN
$$ -792 -776 -761 -776 -790 -805 -819 -799 -779 -725 -644 -577 -563 -591 -646 -703 -761 -767 -774 -748 -723 -750 -777 -798 -819 -840 -860 -860 -860 -862 -863 -852 -867 -897 -874 -820 -766 -761 -756
11434g56n0n0n0m9ppppN0M9N0M9N0N1k0m6m7OK8K7K1K1J8J8k2p4r4r3l5J7Lk3LKJJJ4J4M8
$$ -756 -806 -856 -906 -955 -962 -969 -976 -983 -933 -884 -834 -785 -735 -684 -704 -750 -797 -791 -763 -736 -715 -694 -676 -658 -680 -754 -848 -941 -976 -959 -956 -979 -976 -974 -973 -972 -958 -944 -896
11417h96P5O5J2m3m3K4N1J4m0k2k2k6k5J7J8J7J8qpqpJ6J7J7J6k6k6k6k6NMMMMLl8l8k8J7
$$ -896 -821 -756 -744 -787 -830 -806 -755 -741 -781 -803 -825 -851 -876 -859 -841 -824 -806 -814 -821 -829 -836 -820 -803 -786 -770 -796 -822 -848 -874 -869 -865 -861 -857 -853 -850 -888 -926 -954 -937
11400i37L3Om3m4jjL6L6J0J0k0k1M0M0N4K8k8p2q3n8k8kK3K2kkl0l0L2L2KLKLL8L9Lm0n6l0
$$ -937 -904 -898 -941 -985 -986 -987 -951 -915 -905 -895 -915 -936 -896 -856 -802 -774 -802 -874 -957 -1015 -1043 -1045 -1022 -1000 -1002 -1004 -1034 -1064 -1032 -1000 -998 -995 -993 -990 -952 -913 -910 -950 -1006 -1036
11382a036kK4J9pl2l2l2J1L2L1KLM3M4J7k7j9PK6%k8k8m0l9k0K4O4O4M1M0kjm6p2n8j4L9O7
$$ -1036 -1038 -1014 -995 -1002 -1034 -1066 -1098 -1087 -1055 -1024 -1022 -1019 -976 -932 -915 -942 -961 -954 -928 -928 -956 -984 -1024 -1063 -1083 -1059 -995 -931 -890 -850 -852 -853 -899 -971 -1029 -1043 -1004 -937
11366i37O5L9Qj8k0k0NNJ1J1L8L7L7L7J0J1l3l2l3l2L1L1L0L1POPOM1M1L8L8j7o2n1k5l4l4
$$ -937 -872 -833 -825 -843 -863 -883 -878 -873 -862 -851 -813 -776 -739 -702 -692 -681 -714 -746 -779 -811 -780 -749 -719 -688 -681 -675 -668 -662 -621 -580 -542 -504 -521 -583 -634 -659 -693 -727
11349g27l3l3l8l8o2o1m8OL7L7K0J9l9l8lN0J11Q5J3l9k7%L9L9M1M1j0j0j0j0j9j9j9j9j8
$$ -727 -760 -793 -831 -869 -931 -992 -1040 -1034 -997 -960 -940 -921 -960 -998 -1001 -951 -840 -755 -742 -781 -808 -808 -769 -730 -689 -648 -658 -668 -678 -688 -707 -726 -745 -764 -782
11334g82j8K6K6J9J8k5k6K7K6%%J%k5k6k2k2K2K2ooool6l7l6l6j3j2j3j2l4l5kN0O5O5M0M1
$$ -782 -800 -774 -748 -729 -711 -736 -762 -735 -709 -709 -709 -708 -708 -733 -759 -781 -803 -781 -759 -765 -771 -777 -783 -819 -856 -892 -928 -941 -953 -966 -978 -1012 -1047 -1049 -999 -934 -869 -829 -788
11317g88l3n8m8OK0J9K3K3K4K4K4K4P1P1J0Rrj0n4n4n2n2qqJJk6k5p5p5pM5P4P5L4L3j1j1
$$ -788 -821 -879 -927 -921 -901 -882 -859 -836 -812 -788 -764 -740 -669 -598 -588 -579 -588 -598 -652 -706 -758 -810 -818 -826 -825 -824 -850 -875 -950 -1025 -1032 -987 -913 -838 -804 -771 -782 -793
11301g93j1j1l4l5l4l4mmM0O6N3%m7m8k2k2L9M0K6K6l5l5m9m9nnK4K3K1P3P3P3J5J5rrrrm6
$$ -793 -804 -815 -849 -884 -918 -952 -956 -960 -920 -854 -801 -801 -848 -896 -918 -940 -901 -861 -835 -809 -844 -879 -928 -977 -982 -987 -963 -940 -919 -846 -773 -700 -685 -670 -679 -688 -697 -706 -752
11284g52m5j5L9M4M4j5j4J2J2k9k9k0L1P9P8Rm3n7n8j5j5j5j5j5j6p4p4p6k4J3O7J01J02O1
$$ -752 -797 -812 -773 -729 -685 -700 -714 -702 -690 -719 -748 -768 -737 -658 -580 -571 -614 -671 -729 -744 -759 -774 -789 -804 -820 -894 -968 -1044 -1068 -1055 -988 -887 -785 -724
11269g24O1j5j5m0J4R3J82J86J34K6o2r1r2r1l8J2J1j1j0j1j0mmmlpopon2n2k1L3M3M3j5j5
$$ -724 -663 -678 -693 -733 -719 -626 -444 -258 -124 -98 -160 -251 -343 -434 -472 -460 -449 -460 -470 -481 -491 -495 -499 -503 -506 -513 -519 -526 -532 -584 -636 -657 -624 -581 -538 -553 -568
11253e68poL4L4j9p3m2m3k9l0k9l0nnnnL1L1K8K9Kn0k0k0j9j9k0j9JJJ%j3j4j3j4j5j5j5j5
$$ -568 -575 -581 -547 -513 -532 -605 -647 -690 -719 -749 -778 -808 -813 -818 -823 -828 -797 -766 -738 -709 -707 -757 -777 -797 -816 -835 -855 -874 -873 -872 -871 -871 -884 -898 -911 -925 -940 -955 -970 -985
11236i85JKk6k5O7O6K3K3PQL4L4M0M0M1M0K2K3n6n7n0n1M6M5O3O3O7O6J03J56K22L28M49N54
$$ -985 -984 -982 -1008 -1033 -966 -900 -877 -854 -847 -839 -805 -771 -731 -691 -650 -610 -588 -565 -621 -678 -728 -779 -733 -688 -625 -562 -495 -429 -326 -170 52 380 829 1383
11221A383P91J109J379J132M06n45j074j126q92o46n01l95k84k31k53k53j78p3llk3k2l8l7
$$ 1383 2174 3283 4662 5794 6200 5655 4581 3455 2563 1917 1416 1021 737 506 253 0 -178 -251 -254 -257 -280 -302 -340 -377
11211c77o4o4j2j2J4J4opL7L8LLm0m1k7k6P0P1R5R6l6l7r6r6p0p0m8m8J4J4M1M2J5J6K7K7
$$ -377 -441 -505 -517 -529 -515 -501 -507 -514 -477 -439 -436 -433 -473 -514 -541 -567 -497 -426 -331 -235 -271 -308 -404 -500 -570 -640 -688 -736 -722 -708 -667 -625 -610 -594 -567 -540
11195e40l5l5opppm6m6m7m6k8k8jkM6M5j7j6l6l7QPO7O6O6O7MLL1L0M5M4l4l5l8l8l9l8j0
$$ -540 -575 -610 -616 -623 -630 -637 -683 -729 -776 -822 -850 -878 -879 -881 -835 -790 -807 -823 -859 -896 -888 -881 -814 -748 -682 -615 -611 -608 -577 -547 -502 -458 -492 -527 -565 -603 -642 -680 -690
11178f90j1j0j0l3l2l2l3qrJ8J8M4M4K1l2n1n1kkk6k6k6k6J6J7J6J6J1J0L7L7K6K6k5k5J6
$$ -690 -701 -711 -721 -754 -786 -818 -851 -859 -868 -850 -832 -788 -744 -723 -755 -806 -857 -859 -861 -887 -913 -939 -965 -949 -932 -916 -900 -889 -879 -842 -805 -779 -753 -778 -803 -787
11163g87M2L3k1k5JRRMLK9K8l2n9m7OK4K5K8K7j6j7o7o6m3J0O8O8K4K4K5K4K7K6o1o1o5o6
$$ -787 -745 -712 -733 -758 -757 -748 -739 -735 -732 -703 -675 -707 -766 -813 -807 -783 -758 -730 -703 -719 -736 -803 -869 -912 -902 -834 -766 -742 -718 -693 -669 -642 -616 -677 -738 -803 -869
11147h69j3j2QRRQnoM8M7N7N8L1k1q2j35j20r4m8NLLMLN6N7N9O0P1M4j4o6j03p6k5K7Q8Q8
$$ -869 -882 -894 -886 -877 -868 -860 -865 -871 -823 -776 -719 -661 -630 -651 -733 -868 -988 -1082 -1130 -1125 -1122 -1119 -1115 -1112 -1056 -999 -940 -880 -809 -765 -779 -845 -948 -1024 -1049 -1022 -934 -846
11130h46RJ0J0RK7K6K6K7N9O0L6j7l8l8m2m1m6m6POl0l0l0l1mnK2O6P4M7Lm1m2j6ppj6j6L7
$$ -846 -837 -827 -817 -808 -781 -755 -729 -702 -643 -583 -547 -564 -602 -640 -682 -723 -769 -815 -808 -802 -832 -862 -892 -923 -927 -932 -910 -844 -770 -723 -720 -761 -803 -819 -826 -833 -849 -865 -828
11113h28L7k0j9QN2M5M4K0K0k6k7k7k7PQj9k0l7l7J6J5J8J7l5l5l2l2K1K1K3K2K3K2M0M1M0
$$ -828 -791 -811 -830 -822 -770 -725 -681 -661 -641 -667 -694 -721 -748 -741 -733 -752 -772 -809 -846 -830 -815 -797 -780 -815 -850 -882 -914 -893 -872 -849 -827 -804 -782 -742 -701 -661
11098f61M0O1O1km6p0o9p0p0n4j0L8O5O4O4M0L9m3m3m3m3o1o1o1o2%jN2N2N4N4K7K7L8L8j4
$$ -661 -621 -560 -499 -501 -547 -617 -686 -756 -826 -880 -890 -852 -787 -723 -659 -619 -580 -623 -666 -709 -752 -813 -874 -935 -997 -997 -998 -946 -894 -840 -786 -759 -732 -694 -656 -670
11082f70j5j6j5j5j6ONNOJ2J1J2J2k4k3k4k4m0m0J3J3N5N4K9K8nmmnj7j8j8j7K4K4K1K0qo2
$$ -670 -685 -701 -716 -731 -747 -741 -736 -731 -725 -713 -702 -690 -678 -702 -725 -749 -773 -813 -853 -840 -827 -772 -718 -689 -661 -666 -670 -674 -679 -696 -714 -732 -749 -725 -701 -680 -660 -668 -730
11065g30l1l2k0j9k0k0j2j2j2j2%JJ%QPL0L1Qm5p3p4o3j1L9L8L7L6k2k1j4L8L6L5J4J3M0M0
$$ -730 -761 -793 -813 -832 -852 -872 -884 -896 -908 -920 -920 -919 -918 -918 -910 -903 -873 -842 -834 -879 -952 -1026 -1089 -1100 -1061 -1023 -986 -950 -972 -993 -1007 -969 -933 -898 -884 -871 -831 -791
11049g91N1N2PQm3m4m3m3k1k2k2k1k5k5J9J9J1J2L8L8N5N4J1J0MLj1o3j14j14q6l3K4K3N3
$$ -791 -740 -688 -681 -673 -716 -760 -803 -846 -867 -889 -911 -932 -957 -982 -963 -944 -933 -921 -883 -845 -790 -736 -725 -715 -711 -708 -719 -782 -896 -1010 -1096 -1129 -1105 -1082 -1029
11033a029N3N2N2K5K6J7J7o2o2o0o1KJM4M5M4M5K4K5K4K5J3J3m6m5k3L0K8K7qqqrl6l7l6l7
$$ -1029 -976 -924 -872 -847 -821 -804 -787 -849 -911 -971 -1032 -1030 -1029 -985 -940 -896 -851 -827 -802 -778 -753 -740 -727 -773 -818 -841 -811 -783 -756 -764 -772 -780 -789 -825 -862 -898 -935
11017i35l0l0J4J4O4O5O8J5k2k1k5k5p1p0m4m4poN6N5M1M0M1M0L1L0o3o4p9k7NMQQQQLLk3
$$ -935 -965 -995 -981 -967 -903 -838 -770 -755 -777 -798 -823 -848 -919 -989 -1033 -1077 -1084 -1090 -1034 -979 -938 -898 -857 -817 -786 -756 -819 -883 -962 -989 -984 -980 -972 -964 -956 -948 -945 -942 -965
11000i65k3k9k8N1N0M8M8K2K2l2l1l2l1k7k6k7k6J7J7J7J7J2J2J2J2k3k3LMM1M1klk8k8L3
$$ -965 -988 -1017 -1045 -994 -944 -896 -848 -826 -804 -836 -867 -899 -930 -957 -983 -1010 -1036 -1019 -1002 -985 -968 -956 -944 -932 -920 -943 -966 -963 -959 -918 -877 -879 -882 -910 -938 -905
10985i05L4J0J1j5j6J5J4J5J5K6K7K7K6m2m3o6o6m4QM0M0K1K1onj2j1j1j1MNMNJ9K0K0K0j6
$$ -905 -871 -861 -850 -865 -881 -866 -852 -837 -822 -796 -769 -742 -716 -758 -801 -867 -933 -977 -969 -929 -889 -868 -847 -853 -858 -870 -881 -892 -903 -899 -894 -890 -885 -866 -846 -826 -806 -822
10968h22j7j6j6k3k3k2k3%%%JOPL3L4%Jm1m0lM9M6M6L9L9O2J8m4p0p1m5m8k1J6J7j5m1n0n
$$ -822 -839 -855 -871 -894 -917 -939 -962 -962 -962 -962 -961 -955 -948 -915 -881 -881 -880 -921 -961 -964 -915 -869 -823 -784 -745 -683 -665 -709 -779 -850 -895 -943 -964 -948 -931 -946 -987 -1037 -1042
10952a042K4N1Q9Q8O1J8lK5L1j2m0l9l2l1n9n8KLLKJJJJL6L6L7L6l6l6l6l6RJ0RJ0qql1l1
$$ -1042 -1018 -967 -878 -790 -729 -711 -714 -689 -658 -670 -710 -749 -781 -812 -871 -929 -927 -924 -921 -919 -918 -917 -916 -915 -879 -843 -806 -770 -806 -842 -878 -914 -905 -895 -886 -876 -884 -892 -923 -954
10934i54j4K9P7J02Q1N4L2Nj5m1n4n4j3j4L7L6J5l0n5n4k1K3M0J3k0k1OM9N6N5NNl0l0l1l0
$$ -954 -968 -939 -862 -760 -679 -625 -593 -588 -603 -644 -698 -752 -765 -779 -742 -706 -691 -721 -776 -830 -851 -828 -788 -775 -795 -816 -810 -761 -705 -650 -645 -640 -670 -700 -731 -761
10919g61nnnnJ9J9K0J9j8j8j9j8k6k6k5k6m9m9MLK9K9K8K9k3k3k3k3ONNOO5O5O4O5k1k2k1
$$ -761 -766 -771 -776 -781 -762 -743 -723 -704 -722 -740 -759 -777 -803 -829 -854 -880 -929 -978 -974 -971 -942 -913 -885 -856 -879 -902 -925 -948 -942 -937 -932 -926 -861 -796 -732 -667 -688 -710 -731
10902g31k2k1k2k1k2KJJKm2m1m2m1k6k6K6K7NOm4m3K8Q2J18R1M3J7k3k3j8j9L5L4%jk7k6n9
$$ -731 -753 -774 -796 -817 -839 -837 -836 -835 -833 -875 -916 -958 -999 -1025 -1051 -1025 -998 -993 -987 -1031 -1074 -1046 -964 -846 -755 -712 -695 -718 -741 -759 -778 -743 -709 -709 -710 -737 -763 -822
10885h22n9l7J6M8K1J4J3j1j0j1j1K6K6k7k8l7l7j1j1K7K8MNK3P5O1L5K6K7K2K2k3p5o1l4
$$ -822 -881 -918 -902 -854 -833 -819 -806 -817 -827 -838 -849 -823 -797 -824 -852 -889 -926 -937 -948 -921 -893 -889 -884 -861 -786 -725 -690 -664 -637 -615 -593 -616 -691 -752 -786
10870g86j7j7o5o5n8nK4P6R2R1L7j7k8k8nnOOOOl1l1n7n8j9j8L3L4N7N6L0L0l0l1o9m3j2M1
$$ -786 -803 -820 -885 -950 -1008 -1013 -989 -913 -821 -730 -693 -710 -738 -766 -771 -776 -770 -764 -758 -752 -783 -814 -871 -929 -948 -966 -933 -899 -842 -786 -756 -726 -756 -787 -856 -899 -911 -870
10854h70O5O6L5L5j7j8POm3m3k6K8L8J3KKJ%k2k3MML2L2k0k1m4m4k1L1N4N3N7N7J7J7l5l6
$$ -870 -805 -739 -704 -669 -686 -704 -697 -691 -734 -777 -803 -775 -737 -724 -722 -720 -719 -719 -741 -764 -760 -756 -724 -692 -712 -733 -777 -821 -842 -811 -757 -704 -647 -590 -573 -556 -591 -627
10837f27m0m1m1m1J1J1J1J1j9j9j9j9ppl4l4k8k8K5K4K2K1l1l2k6k5%JL5L5j4j4PO0Q4Q3M3
$$ -627 -667 -708 -749 -790 -779 -768 -757 -746 -765 -784 -803 -822 -829 -836 -870 -904 -932 -960 -935 -911 -889 -868 -899 -931 -957 -982 -982 -981 -946 -911 -925 -939 -932 -872 -788 -705 -662
10821f62M2K0l4m1m2m5m4n2n1L6L7RRRRL4L3k0j9m3m2m2m3k1k2k1k2N6N6N6N6J3J2J3J3l3
$$ -662 -620 -600 -634 -675 -717 -762 -806 -858 -909 -873 -836 -827 -818 -809 -800 -766 -733 -753 -772 -815 -857 -899 -942 -963 -985 -1006 -1028 -972 -916 -860 -804 -791 -779 -766 -753 -786
10805g86l2j0M3QQJ1J1j5j5j6j5NONNL6L6j6j7klJn2o7o7m3m4MLMLMNMMK8K9K8K8J6J6J6J6
$$ -786 -818 -828 -785 -777 -769 -758 -747 -762 -777 -793 -808 -803 -797 -792 -787 -751 -715 -731 -748 -750 -753 -752 -804 -871 -938 -981 -1025 -1021 -1018 -1014 -1011 -1007 -1002 -998 -994 -966 -937 -909 -881 -865 -849 -833 -817
10787h17J9J9qql5l6j6L7N0lj1J5P9P9K4k9m1j5j5m1m8OL9J4l5o1m8m9m8m9k6K7K3K4K7K7
$$ -817 -798 -779 -787 -795 -830 -866 -882 -845 -795 -798 -809 -794 -715 -636 -612 -641 -682 -697 -712 -753 -801 -795 -756 -742 -777 -838 -886 -935 -983 -1032 -1058 -1031 -1008 -984 -957 -930
10771i30L7L6j6j6M2M2M2M2ONNOOOk8n5m4RK0ok6%L6L6k2k2k1k2K8K7K8K8j%jjl3l4l3l4P
$$ -930 -893 -857 -873 -889 -847 -805 -763 -721 -715 -710 -705 -699 -693 -687 -715 -770 -814 -805 -785 -791 -817 -817 -781 -745 -767 -789 -810 -832 -804 -777 -749 -721 -722 -722 -723 -724 -757 -791 -824 -858 -851
10753h51POPK2K2K2K2K2K1K2K2OOPOl3l3l3l3l1l2nnL8L7j6j6l7l7J6J6PQm5m5q8q9l0K2O1
$$ -851 -844 -838 -831 -809 -787 -765 -743 -721 -700 -678 -656 -650 -644 -637 -631 -664 -697 -730 -763 -794 -826 -831 -836 -798 -761 -777 -793 -830 -867 -851 -835 -828 -820 -865 -910 -998 -1087 -1117 -1095 -1034
10736a034O1L8L8L7L7j5j6m6m7m7m7K2K3K2K3j8j7j7j7K0K0K0K1j%%%kkk8k8mmK1O5O7K2l8
$$ -1034 -973 -935 -897 -860 -823 -838 -854 -900 -947 -994 -1041 -1019 -996 -974 -951 -969 -986 -1003 -1020 -1000 -980 -960 -939 -940 -940 -940 -940 -942 -944 -972 -1000 -1004 -1008 -987 -922 -855 -833 -871
10720h71l8LMk2k3j8j9QPK6K6%jK3K2K3K2j9k0j9k0NNMNJ6J6J6J6k4k4k4k4K0K1M6M7M2M2
$$ -871 -909 -906 -902 -924 -947 -965 -984 -976 -969 -943 -917 -917 -918 -895 -873 -850 -828 -847 -867 -886 -906 -901 -896 -892 -887 -871 -855 -839 -823 -847 -871 -895 -919 -899 -878 -832 -785 -743 -701
10703g01j1j1j9j8j9j8%%n3n3m4m5QQL1L1L1L2N8N8L2j1j5J3K1K1k4k3LLmmmlk6k5k6k6L3
$$ -701 -712 -723 -742 -760 -779 -797 -797 -797 -850 -903 -947 -992 -984 -976 -945 -914 -883 -851 -793 -735 -703 -714 -729 -716 -695 -674 -698 -721 -718 -715 -719 -723 -727 -730 -756 -781 -807 -833 -800
10686h00L3k0k0MMNMM4M3J5k8m2m2m4m4l1l1mmonM7M8O5O6J2J3K0J9l3l4l6l7l7l6k9k8K4
$$ -800 -767 -787 -807 -803 -799 -794 -790 -746 -703 -688 -716 -758 -800 -844 -888 -919 -950 -954 -958 -964 -969 -922 -874 -809 -743 -731 -718 -698 -679 -712 -746 -782 -819 -856 -892 -921 -949 -925
10669i25K4N9N8N9N8k2k3k2k3pppqJ9J8J8J8k9k9l0k9%%N3N3M9M8l9m0l9l9l9l9l3l4N2N1
$$ -925 -901 -842 -784 -725 -667 -689 -712 -734 -757 -764 -771 -778 -786 -767 -749 -731 -713 -742 -771 -801 -830 -830 -830 -777 -724 -675 -627 -666 -706 -745 -784 -823 -862 -895 -929 -877 -826
10653h26N1jk4k5J7J7M4M3poppM4M5K1l1p5p5n6kJ2J2j1j2N4N3N7Mn3n2klrqJ1O4P3K1l6q9
$$ -826 -775 -776 -800 -825 -808 -791 -747 -704 -711 -717 -724 -731 -687 -642 -621 -652 -727 -802 -858 -860 -848 -836 -847 -859 -805 -752 -695 -691 -744 -796 -798 -801 -810 -818 -807 -743 -670 -649 -685 -774
10636g74j00m7RO3N1kn7n6j9j8PQL1L1NMl2l2l3l2QQQQLLMLM1M0M1M1m3m2m3m2QQQQL4L4L4
$$ -774 -874 -921 -912 -849 -798 -800 -857 -913 -932 -950 -943 -935 -904 -873 -868 -864 -896 -928 -961 -993 -985 -977 -969 -961 -958 -955 -951 -948 -907 -867 -826 -785 -828 -870 -913 -955 -947 -939 -931 -923 -889 -855 -821
10617h21L3j2j2j2j3K8K9K8K8k3k3k3k3o1o1k4K1L7L8J4J4L6L7RJ0j0j0j0j0l4l4l3l4L3L3
$$ -821 -788 -800 -812 -824 -837 -809 -780 -752 -724 -747 -770 -793 -816 -877 -938 -962 -941 -904 -866 -852 -838 -802 -765 -756 -746 -756 -766 -776 -786 -820 -854 -887 -921 -888 -855
10602h55M5J9j6n9n2k5J7J7J8J8L1L1L0L1%J%%K5K5jkJ%m3m3j5j5j5j5K9K9K8K9l9m0l9m0
$$ -855 -810 -791 -807 -866 -918 -943 -926 -909 -891 -873 -842 -811 -781 -750 -750 -749 -749 -749 -724 -699 -700 -702 -701 -701 -744 -787 -802 -817 -832 -847 -818 -789 -761 -732 -771 -811 -850 -890
10586h90j5j6j5j5j1j1j0j1L6L5L6L6LLMLllllJ1J2J1J2k1k2k1k2QPPQm5m5m5m5nnL9L9M0
$$ -890 -905 -921 -936 -951 -962 -973 -983 -994 -958 -923 -887 -851 -848 -845 -841 -838 -841 -844 -847 -850 -839 -827 -816 -804 -825 -847 -868 -890 -882 -875 -868 -860 -905 -950 -995 -1040 -1045 -1050 -1011 -972 -932
10568i32M1mlRQL5L6lkk8k9m6m7klRRN2N3O1O0L4L5NONOl5l4l5l5k5k5k5k6l8l7OOK8K9KK
$$ -932 -891 -895 -898 -889 -881 -846 -810 -813 -815 -843 -872 -918 -965 -967 -970 -961 -952 -900 -847 -786 -726 -692 -657 -652 -646 -641 -635 -670 -704 -739 -774 -799 -824 -849 -875 -913 -950 -944 -938 -910 -881 -879 -877
10549h77m5m5J7J7K5K5jjppK0J9K3K2K3K3j2j2j2j2nnmnJ4J4m5m5j1L3RQL0L1L0L0rqrrk8
$$ -877 -922 -967 -950 -933 -908 -883 -884 -885 -892 -899 -879 -860 -837 -815 -792 -769 -781 -793 -805 -817 -822 -827 -831 -836 -822 -808 -853 -898 -909 -876 -867 -859 -829 -798 -768 -738 -747 -755 -764 -773 -801
10531h01k7n2n1l2J2M8M9J5J6J5J5J4J4l1l0jjk5k5J5N9N7J3k4n0l9m0l0n6o7k2NORQL3L2
$$ -801 -828 -880 -931 -963 -951 -903 -854 -839 -823 -808 -793 -779 -765 -796 -826 -827 -828 -853 -878 -863 -804 -747 -734 -758 -808 -847 -887 -917 -973 -1040 -1062 -1057 -1051 -1042 -1034 -1001 -969
10515i69L3L3%%J%%J%%L3L3L3L3LKm1m2J5J4J4J4J3J3l0n7k9K4L6RLL0N6N5Mk3j1M2M3M3j5
$$ -969 -936 -903 -903 -903 -902 -902 -902 -901 -901 -901 -868 -835 -802 -769 -766 -764 -805 -847 -832 -818 -804 -790 -777 -764 -794 -851 -880 -856 -820 -811 -808 -778 -722 -667 -663 -686 -697 -655 -612 -569 -584
10498e84j5m4m3J7J8MMm0m0K3K3K3K2j7j8j7j7l5l4l5l4k3k4k3k3LLLLJ5J4J4J4jjjjk9l0
$$ -584 -599 -643 -686 -669 -651 -647 -643 -683 -723 -700 -677 -654 -632 -649 -667 -684 -701 -736 -770 -805 -839 -862 -886 -909 -932 -929 -926 -923 -920 -905 -891 -877 -863 -864 -865 -866 -867 -896 -926
10481i26n2n3J5O8J09N5kn5k9k9NNMNk8k8k8k8N4N4N4N5L8L9L9L9l9l8l8l8l2l1l2l2N4N3
$$ -926 -978 -1031 -1016 -948 -839 -784 -786 -841 -870 -899 -894 -889 -885 -880 -908 -936 -964 -992 -938 -884 -830 -775 -737 -698 -659 -620 -659 -697 -735 -773 -805 -836 -868 -900 -846 -793
10465g93N4N3j9j9j9j9KKKK%j%jmnl0n7m3J0N7Q3N8Nqqj4j4j4j4k1k0K3N0L9j4k6k7MNMMj8
$$ -793 -739 -686 -705 -724 -743 -762 -760 -758 -756 -754 -754 -755 -755 -756 -760 -765 -795 -852 -895 -885 -828 -745 -687 -682 -690 -698 -712 -726 -740 -754 -775 -795 -772 -722 -683 -697 -723 -750 -746 -741 -737 -733 -751
10446g51j9j8j9j0j0j1j0mmmmPPOPj9j8o0n9l2K1N2P9M6ol6l6J1J2J1J2QQPQL2L2K9K9Jn2
$$ -751 -770 -788 -807 -817 -827 -838 -848 -852 -856 -860 -864 -857 -850 -844 -837 -856 -874 -934 -993 -1025 -1004 -952 -873 -827 -833 -869 -905 -894 -882 -871 -859 -851 -843 -836 -828 -796 -764 -735 -706 -705 -757
10429g57q3q3m4m3JJM9M9N0M9l5l5l6l5jjO1O0P9P8J7J7LMm2r6r6m4OL1L8L8L9M0j8j7j7j8
$$ -757 -840 -923 -967 -1010 -1009 -1008 -959 -910 -860 -811 -846 -881 -917 -952 -953 -954 -893 -833 -754 -676 -659 -642 -639 -635 -677 -773 -869 -913 -907 -876 -838 -800 -761 -721 -739 -756 -773 -791
10412g91m6m6m6m6RRRRLKLKL6L6L6L6j5j6j6j5n9n8l6J8M8M8N2N2K8K9K8K8j4j4o8o7k9k9
$$ -791 -837 -883 -929 -975 -966 -957 -948 -939 -936 -934 -931 -929 -893 -857 -821 -785 -800 -816 -832 -847 -906 -964 -1000 -982 -934 -886 -834 -782 -754 -725 -697 -669 -683 -697 -765 -832 -861 -890
10396h90k5k6k4K8N2N1onooj7j7L6L7N2N2M9M9M6qo5o5l3l3l3l2K2K2J9J9K5k8j02j28j00
$$ -890 -915 -941 -965 -937 -885 -834 -840 -845 -851 -857 -874 -891 -855 -818 -766 -714 -665 -616 -570 -578 -643 -708 -741 -774 -807 -839 -817 -795 -776 -757 -732 -760 -862 -990 -1090
10381a090j3K4K4llM9N0K1K1l2l1l7l6J7J6L9L9L8L9RRRRkkkkK2K2K2K2OPPOj6j6j6j6MMM
$$ -1090 -1103 -1079 -1055 -1058 -1061 -1012 -962 -941 -920 -952 -983 -1020 -1056 -1039 -1023 -984 -945 -907 -868 -859 -850 -841 -832 -834 -836 -838 -840 -818 -796 -774 -752 -746 -739 -732 -726 -742 -758 -774 -790 -786 -782 -778
10362g78Mk0k0k0k0J4J3J3J3L3L2L2L3m9m9m9m9QPQQk5k6k5k5K7K6K7K7kkkkJ3J2J3J2kkk
$$ -778 -774 -794 -814 -834 -854 -840 -827 -814 -801 -768 -736 -704 -671 -720 -769 -818 -867 -859 -852 -844 -836 -861 -887 -912 -937 -910 -884 -857 -830 -832 -834 -836 -838 -825 -813 -800 -788 -790 -792 -794
10345g94kk0k0O7O8N5N4KKm6m6m7m6J5J4J5J4k8k8k8k8%J%Jl1l2l1l1j8j9N2P9M3jk8k7J6
$$ -794 -796 -816 -836 -769 -701 -646 -592 -590 -588 -634 -680 -727 -773 -758 -744 -729 -715 -743 -771 -799 -827 -827 -826 -826 -825 -856 -888 -919 -950 -968 -987 -935 -856 -813 -814 -842 -869 -853
10329h53J6J5J6nnnoj9k0L3L3N1N0O2L6l1p6o8m1LLMNK9K8K9K9k0k0j9k0j6j7j6j6m7m6k0
$$ -853 -837 -822 -806 -811 -816 -821 -827 -846 -866 -833 -800 -749 -699 -637 -601 -632 -708 -776 -817 -814 -811 -807 -802 -773 -745 -716 -687 -707 -727 -746 -766 -782 -799 -815 -831 -878 -924 -944
10312i44K4K6%J7J8K2K2K2K2n0n0n1n0J9K0K0K0J1J1k3n1l5RP0P0M5M4M5M4k5k4k5k4K8K8
$$ -944 -920 -894 -894 -877 -859 -837 -815 -793 -771 -821 -871 -922 -972 -953 -933 -913 -893 -882 -871 -894 -945 -980 -971 -901 -831 -786 -742 -697 -653 -678 -702 -727 -751 -723 -695
10297f95k5k4m8m7NNK7K7K7K7kklkL8L8L8L8k1k1m7m7l1l0J1J0J4l8n1k4rj0l4l4J3J3J4J3
$$ -695 -720 -744 -792 -839 -834 -829 -802 -775 -748 -721 -723 -725 -728 -730 -692 -654 -616 -578 -599 -620 -667 -714 -745 -775 -764 -754 -740 -778 -829 -853 -862 -872 -906 -940 -927 -914 -900 -887
10280h87kkkkk2k1NNn4n3k2L1L5L6J2J3k0j9k0j9mnmnk9k8k9k9K3K4K3K3MLMLN2N3N2N2J9
$$ -887 -889 -891 -893 -895 -917 -938 -933 -928 -982 -1035 -1057 -1026 -991 -955 -943 -930 -950 -969 -989 -1008 -1012 -1017 -1021 -1026 -1055 -1083 -1112 -1141 -1118 -1094 -1071 -1048 -1044 -1041 -1037 -1034 -982 -929 -877 -825 -806
10263h06K0J9J9k6k5k6k5k2k2k2k1j7j7M5M5L8L7oomlL7L7K4l0o1o1k3k4k3k3K7K6K6K7K9
$$ -806 -786 -767 -748 -774 -799 -825 -850 -872 -894 -916 -937 -954 -971 -926 -881 -843 -806 -812 -818 -822 -825 -788 -751 -727 -757 -818 -879 -902 -926 -949 -972 -945 -919 -893 -866 -837
10247h37L0LLj8j8K6K6J6J5J6J5noooqpqpqqL6L6KLLLKKk4k4K1K0Pm7p4p4m5PQ0Q0L8L9L0
$$ -837 -807 -804 -801 -819 -837 -811 -785 -769 -754 -738 -723 -728 -734 -740 -746 -754 -761 -769 -776 -784 -792 -756 -720 -718 -715 -712 -709 -707 -705 -729 -753 -732 -712 -705 -752 -826 -900 -945 -938 -858 -778 -740 -701 -671
10228f71L0L1L0k1k1k1k1QQQQJ6J7J6J7k1k1k1k1k2k2k3k2j6j5j6j6k3k4k4k4rrN2N2P8P7
$$ -671 -641 -610 -580 -601 -622 -643 -664 -656 -648 -640 -632 -616 -599 -583 -566 -587 -608 -629 -650 -672 -694 -717 -739 -755 -770 -786 -802 -825 -849 -873 -897 -906 -915 -863 -811 -733 -656
10212f56O3L7k2p6p5k2J0L6K2K1k3p5o0l5NMOOK1K1nl1l1K2M8K1k8n4l0lK3K4K4K5KLKKK1
$$ -656 -593 -556 -578 -654 -729 -751 -741 -705 -683 -662 -685 -760 -820 -855 -850 -846 -840 -834 -813 -792 -797 -828 -859 -837 -789 -768 -796 -850 -880 -883 -860 -836 -812 -787 -785 -782 -780 -778 -757
10195g57K2K1K1PQPQj2j2n6n6l9m0j3j3J1J2J1J2J3J3J3J3J4J4J4J4m2m2m2m2k7k7K5K6P1
$$ -757 -735 -714 -693 -686 -678 -671 -663 -675 -687 -743 -799 -838 -878 -891 -904 -893 -881 -870 -858 -845 -832 -819 -806 -792 -778 -764 -750 -792 -834 -876 -918 -945 -972 -947 -921 -850
10179h50P2M5M5mmn5n4JM5O2L5mlnnk3k2m9m9l3l3K0K0J0RJ0J0M1M2j1j1m2m2J0J1j%K6K6
$$ -850 -778 -733 -688 -692 -696 -751 -805 -804 -759 -697 -662 -666 -669 -674 -679 -702 -724 -773 -822 -855 -888 -868 -848 -838 -829 -819 -809 -768 -726 -737 -748 -790 -832 -822 -811 -812 -812 -786 -760
10163g60P1P0M0ln4q0q2n4pK0POK1K0M6M7N0N0mo5j08j09m9nJJMMK2K3K1K1N2K7J5N8P7N0
$$ -760 -689 -619 -579 -582 -636 -716 -798 -852 -859 -839 -832 -826 -805 -785 -739 -692 -642 -592 -596 -661 -769 -878 -927 -932 -931 -930 -926 -922 -900 -877 -856 -835 -783 -756 -741 -683 -606 -556
10146e56ol2l1l2l3l3j3j3J4J3M4M4j0rj7j8j7j8J9J8qn3o8m1J2L8L5QK5K5K8K9k5k4o4o4
$$ -556 -562 -594 -625 -657 -690 -723 -736 -749 -735 -722 -678 -634 -644 -653 -670 -688 -705 -723 -704 -686 -694 -747 -815 -856 -844 -806 -771 -763 -738 -713 -685 -656 -681 -705 -769 -833
10130h33j0j1llk9k9L4L4L4L4J3J4M8P6O1J7k9n6n1n1n2n2J9J9J9J9J9J8J8J9j9j9j9j9k3
$$ -833 -843 -854 -857 -860 -889 -918 -884 -850 -816 -782 -769 -755 -707 -631 -570 -553 -582 -638 -689 -740 -792 -844 -825 -806 -787 -768 -749 -731 -713 -694 -713 -732 -751 -770 -793
10115g93k3k3k3LLLLRJ0L6L6L5L4l5o2m4JK7K7M3M3J5k9n9o0l7l6RJ0J1J1K5N1O1J7j8j7k1
$$ -793 -816 -839 -862 -859 -856 -853 -850 -841 -831 -795 -759 -724 -690 -725 -787 -831 -830 -803 -776 -733 -690 -675 -704 -763 -823 -860 -896 -887 -877 -866 -855 -830 -779 -718 -701 -719 -736 -757
10099g57k0rj0l6l6l6l6J6J6L5L4Q4Q5P4L1j6m3m7k0J6J6l2l3ooqpqqRRQPj9m6n5j2K6K5K9
$$ -757 -777 -786 -796 -832 -868 -904 -940 -924 -908 -873 -839 -755 -670 -596 -565 -581 -624 -671 -691 -675 -659 -691 -724 -730 -736 -744 -751 -759 -767 -758 -749 -741 -734 -753 -799 -854 -866 -840 -815 -786
10082g86K8LKKLJ3J3J4J3l8l7l8l8j8j7j8j8L2L2L1L2N6N5N3N2K2l0q1q0n2n2qqN2N3K0l3
$$ -786 -758 -755 -753 -751 -748 -735 -722 -708 -695 -733 -770 -808 -846 -864 -881 -899 -917 -885 -853 -822 -790 -734 -679 -626 -574 -552 -582 -663 -743 -795 -847 -855 -863 -811 -758 -738 -771
10065g71j7j8NOJ9J9J9J9nnnnJ9J9O3O3K6K6K6K5l6l7o3o3k2k2K1K2j1j1j1j1K0K1K0K0KL
$$ -771 -788 -806 -801 -795 -776 -757 -738 -719 -724 -729 -734 -739 -720 -701 -638 -575 -549 -523 -497 -472 -508 -545 -608 -671 -693 -715 -694 -672 -683 -694 -705 -716 -696 -675 -655 -635 -633 -630
10049f30KKJ9J9m3m3n5n4k9k8j7j6K7K7M4M4M3M4K2K2m0m0n0n0m7m7l6J6M6M5M7ok0k0J9J8
$$ -630 -628 -626 -607 -588 -631 -674 -729 -783 -812 -840 -857 -873 -846 -819 -775 -731 -688 -644 -622 -600 -640 -680 -730 -780 -827 -874 -910 -894 -848 -803 -756 -762 -782 -802 -783 -765
10033g65Mm8m9m9qrO4O3O3O4L3L3L3L3j%%%J2J1J2J1K6K5K5K5m1m2o8o8l2l3L0K9L3L3k9k9
$$ -765 -761 -809 -858 -907 -915 -924 -860 -797 -734 -670 -637 -604 -571 -538 -539 -539 -539 -539 -527 -516 -504 -493 -467 -442 -417 -392 -433 -475 -543 -611 -643 -676 -646 -617 -584 -551 -580 -609
10017f09n8n9n5n6j3L2OOk8k8k8k8M4M5M4M4ooooj1j0j0j0k1k1k2k1J0J0J0J0jjkjK0J9K0
$$ -609 -667 -726 -781 -837 -850 -818 -812 -806 -834 -862 -890 -918 -874 -829 -785 -741 -747 -753 -759 -765 -776 -786 -796 -806 -827 -848 -870 -891 -881 -871 -861 -851 -852 -853 -855 -856 -836 -817 -797
10000g97J9QRQRMMMMk4k5k4k5LLLLLLLLJ0J0J0J0nnnnk6k6k6k5K5K5K5K5QQRQqrrqL5L6RR
$$ -797 -778 -770 -761 -753 -744 -740 -736 -732 -728 -752 -777 -801 -826 -823 -820 -817 -814 -811 -808 -805 -802 -792 -782 -772 -762 -767 -772 -777 -782 -808 -834 -860 -885 -860 -835 -810 -785 -777 -769 -760 -752 -760 -769 -778 -786 -751 -715 -706 -697
9979f97nno5o4l6QJk5k0K5N7L0QQL3L3MMk2k2k3k4LLj0j0j0j0j8j8o0o0l4J1K9L0%%JKM6P3
$$ -697 -702 -707 -772 -836 -872 -864 -863 -888 -908 -883 -826 -796 -788 -780 -747 -714 -710 -706 -728 -750 -773 -797 -794 -791 -801 -811 -821 -831 -849 -867 -927 -987 -1021 -1010 -981 -951 -951 -951 -950 -948 -902 -829
9961h29Q2L9j8j7k0k1%%j%J9J9J9J9LKn9n9n6n7NNJ1J1J1J1%%M5M4K1K1M5M4M5Kl6l5j5j6
$$ -829 -747 -708 -726 -743 -763 -784 -784 -784 -785 -785 -766 -747 -728 -709 -706 -704 -763 -822 -878 -935 -930 -925 -914 -903 -892 -881 -881 -881 -836 -792 -771 -750 -705 -661 -616 -614 -650 -685 -700 -716
9943g16Lk4k8J6M9M9K7j7l6l6m2m2LKK8K8K8K8NMk2k2%jM1M0Ql7l8l8m6m6p2p2m6m6m6m7L4
$$ -716 -713 -737 -765 -749 -700 -651 -624 -641 -677 -713 -755 -797 -794 -792 -764 -736 -708 -680 -675 -671 -693 -715 -715 -716 -675 -635 -627 -664 -702 -740 -786 -832 -904 -976 -1022 -1068 -1114 -1161 -1127
9926a127L4O0O0QRl3l3l0J4L4L3J4J4M0M0L5L5L5L4j1j2j1j1j2j1j2j1l1l0k9k9J3L9M8Lm2
$$ -1127 -1093 -1033 -973 -965 -956 -989 -1022 -1052 -1038 -1004 -971 -957 -943 -903 -863 -828 -793 -758 -724 -735 -747 -758 -769 -781 -792 -804 -815 -846 -876 -905 -934 -921 -882 -834 -831 -873
9911h73o9p0m4mK2N4Q1P9N2K3mj2j2j3j4NMNMk4k4k5k4j5j6j5j5kkjkl8l8POJ0J0J0J0qqq
$$ -873 -942 -1012 -1056 -1060 -1038 -984 -903 -824 -772 -749 -753 -765 -777 -790 -804 -799 -795 -790 -786 -810 -834 -859 -883 -898 -914 -929 -944 -946 -948 -949 -951 -989 -1027 -1020 -1014 -1004 -994 -984 -974 -982 -990 -998
9892i98qj0j0L3L4K3K3mlL2L1j2j2n7n7MNJ9K0ppJ9J8J9J8rj0L5L4K5K4kkQRRRRRRRN9O0L9
$$ -998 -1006 -1016 -1026 -993 -959 -936 -913 -917 -920 -888 -857 -869 -881 -938 -995 -991 -986 -967 -947 -954 -961 -942 -924 -905 -887 -896 -906 -871 -837 -812 -788 -790 -792 -784 -775 -766 -757 -748 -739 -730 -721 -662 -602 -563
9873e63ol6o2o3l7K3N0L7L7JJJJl2l1l2l2J5J5J5J5NMMMJ2J2J2J2JJJJl5l6l6l6j6j6j6j6
$$ -563 -569 -605 -667 -730 -767 -744 -694 -657 -620 -619 -618 -617 -616 -648 -679 -711 -743 -728 -713 -698 -683 -678 -674 -670 -666 -654 -642 -630 -618 -617 -616 -615 -614 -649 -685 -721 -757 -773 -789 -805 -821
9856h21K9K9K9K9J1J1J1J1oon0n0m0m0j4j3kjkjK0K0K0K0K5K5K4K5qqqrN9N9P1M5k0o3m0m0
$$ -821 -792 -763 -734 -705 -694 -683 -672 -661 -667 -673 -723 -773 -813 -853 -867 -880 -882 -883 -885 -886 -866 -846 -826 -806 -781 -756 -732 -707 -715 -723 -731 -740 -681 -622 -551 -506 -526 -589 -629 -669
9838f69n7n7n7n7PPPPppopL0K9k3k3l7l7l7l7L6L7L6L7K6K7K7K7OPm6m5l8l7N1N1O5O6J2J2
$$ -669 -726 -783 -840 -897 -890 -883 -876 -869 -876 -883 -889 -896 -866 -837 -860 -883 -920 -957 -994 -1031 -995 -958 -922 -885 -859 -832 -805 -778 -772 -765 -811 -856 -894 -931 -880 -829 -764 -698 -686 -674
9821f74MLLLm9m9o1l5M3Q8Q9M5J4J4J1J2l9l8r2r1k6k5k5k6l7l8J6J5MMk3k2QPM3P0O4K1l9
$$ -674 -670 -667 -664 -661 -710 -759 -820 -855 -812 -724 -635 -590 -576 -562 -551 -539 -578 -616 -708 -799 -825 -850 -875 -901 -938 -976 -960 -945 -941 -937 -960 -982 -974 -967 -924 -854 -790 -769 -808
9804h08l8j9K5K5j9l5l5J5J5L7L8J2J1JJJ%j2j2j2j2MLLMJ1J1J1J1qrn8n8j9L4R0Q9O2Rj5
$$ -808 -846 -865 -840 -815 -834 -869 -904 -889 -874 -837 -799 -787 -776 -775 -774 -773 -773 -785 -797 -809 -821 -817 -814 -811 -807 -796 -785 -774 -763 -771 -780 -838 -896 -915 -881 -791 -702 -640 -631 -646
9787f46j4k4k3k4k4l5l6l8J4P3P3N3Jn2n1kkk7k8n5n4k7k6j%K9K9K9K9L7L8L7L7j8j8j8j8
$$ -646 -660 -684 -707 -731 -755 -790 -826 -864 -850 -777 -704 -651 -650 -702 -753 -755 -757 -784 -812 -867 -921 -948 -974 -975 -975 -946 -917 -888 -859 -822 -784 -747 -710 -728 -746 -764 -782
9771g82J1J1J1J0PPQPm5m4m5m5j6j6L7L7M3M4j0ropopJ9J9J9J9nonnl4l3o0o0nnM8M8L8L7
$$ -782 -771 -760 -749 -739 -732 -725 -717 -710 -755 -799 -844 -889 -905 -921 -884 -847 -804 -760 -770 -779 -785 -792 -798 -805 -786 -767 -748 -729 -734 -740 -745 -750 -784 -817 -877 -937 -942 -947 -899 -851 -813 -776
9752g76J2J1L8L7L8L8K1K1l2l2n4n5k9k8m8m7k5K8O3O3k1p5m5M2J09J09N1ko1o1k9k9l0k9
$$ -776 -764 -753 -715 -678 -640 -602 -581 -560 -592 -624 -678 -733 -762 -790 -838 -885 -910 -882 -819 -756 -777 -852 -897 -855 -746 -637 -586 -588 -649 -710 -739 -768 -798 -827
9738h27o3o3l3l4k7J7P7P7O0J5j3j3k4k4k3K1P6P5K6K6RRRRNNk1k2l6l6J7J6K0K0J7J7j7o1
$$ -827 -890 -953 -986 -1020 -1047 -1030 -953 -876 -816 -801 -814 -827 -851 -875 -898 -877 -801 -726 -700 -674 -665 -656 -647 -638 -633 -628 -649 -671 -707 -743 -726 -710 -690 -670 -653 -636 -653 -714
9721g14m9k3kK4J1J1K4K5K5K4K2K1l1l1m9m9o1l5J7O1O2O2K9j5o3r0n8n7m6j8K2O6O8K3k9
$$ -714 -763 -786 -788 -764 -753 -742 -718 -693 -668 -644 -622 -601 -632 -663 -712 -761 -822 -857 -840 -779 -717 -655 -626 -641 -704 -794 -852 -909 -955 -973 -951 -885 -817 -794 -823
9706h23l0l2l2k1k1k1k1K1K2K2K2lkN0N1M8M8k2m9l5RL5L5mlonn1p8q6m1rJ7L1L2M2M2J6k9
$$ -823 -853 -885 -917 -938 -959 -980 -1001 -980 -958 -936 -914 -917 -919 -869 -818 -770 -722 -744 -793 -828 -819 -784 -749 -753 -756 -762 -767 -818 -896 -982 -1023 -1032 -1015 -984 -952 -910 -868 -852 -881
9689h81k3MK2M8M4J8QQKLm8m7l2J2M0M0M4M4M5M4KKJKk2k3k2k2o0o1o0o1l5l5J7J8N2N1N2
$$ -881 -904 -900 -878 -830 -786 -768 -760 -752 -750 -747 -795 -842 -874 -862 -822 -782 -738 -694 -649 -605 -603 -601 -600 -598 -620 -643 -665 -687 -747 -808 -868 -929 -964 -999 -982 -964 -912 -861 -809
9672h09N2J3J2J3J2L3L2L2L3k7k6k7k6l8l8j2j1mmL2N8N5J1j5j6j6j5n0p7o8pM4M5J0J1QQ
$$ -809 -757 -744 -732 -719 -707 -674 -642 -610 -577 -604 -630 -657 -683 -721 -759 -771 -782 -786 -790 -758 -700 -645 -634 -649 -665 -681 -696 -746 -823 -891 -898 -854 -809 -799 -788 -780 -772
9656g72on0o5l9j2J4N3N3K5K5k6k7J2L8M9Mn1n0k5J9L1L1L2L1M3kk9k9j2j2j2j1rrM4M3O9
$$ -772 -778 -828 -893 -932 -944 -930 -877 -824 -799 -774 -800 -827 -815 -777 -728 -724 -775 -825 -850 -831 -800 -769 -737 -706 -663 -665 -694 -723 -735 -747 -759 -770 -779 -788 -744 -701 -632
9640f32O8O5K1ml1n6q3j03j03m1KJ5J6J8J8N3N3O5L9j6o0o3o3j9k0L2L2N5K9k0o3l3l3l5l6
$$ -632 -564 -499 -478 -482 -513 -569 -652 -755 -858 -899 -897 -882 -866 -848 -830 -777 -724 -659 -620 -636 -696 -759 -822 -841 -861 -829 -797 -742 -713 -733 -796 -829 -862 -897 -933
9625i33LKK9K9OON6N6M1j2l5l5k5k5k5k5M9M9M9M9J0J0J0J0l7l7j0j1kkn5n5l5l5J8J7J2J2
$$ -933 -930 -928 -899 -870 -864 -858 -802 -746 -705 -717 -752 -787 -812 -837 -862 -887 -838 -789 -740 -691 -681 -671 -661 -651 -688 -725 -735 -746 -748 -750 -805 -860 -895 -930 -912 -895 -883 -871
9609h71j5j5mlK2K3M3M3j0j0n3n3l0K3Q6Q5O3O2MLMLk5k6k5k6l9l8J4J4K2K2l1l1J9J9qql2
$$ -871 -886 -901 -905 -908 -886 -863 -820 -777 -787 -797 -850 -903 -933 -910 -824 -739 -676 -614 -610 -607 -603 -600 -625 -651 -676 -702 -741 -779 -765 -751 -729 -707 -738 -769 -750 -731 -739 -747 -779
9592g79l2onL8L8L9L8jjn3n4MML0L1RRm4m4j4j4j4j4L2L2L6j7o5o4j6j5QQL4L5J7J8rqK5K5
$$ -779 -811 -817 -822 -784 -746 -707 -669 -670 -671 -724 -778 -774 -770 -740 -709 -700 -691 -735 -779 -793 -807 -821 -835 -803 -771 -735 -752 -817 -881 -897 -912 -904 -896 -862 -827 -810 -792 -801 -809 -784 -759
9574g59K4K5l4l4J9J9L7L7j5j6o3o3j1j0M7M6M6M7l2l2l1l2K6K7K6K7QQQRk1k1NOMMm9m9l9
$$ -759 -735 -710 -744 -778 -759 -740 -703 -666 -681 -697 -760 -823 -834 -844 -797 -751 -705 -658 -690 -722 -753 -785 -759 -732 -706 -679 -671 -663 -655 -646 -667 -688 -683 -677 -673 -669 -718 -767 -806
9557h06l9J5J4M6M7K0K0l2l3l3l2j5j4j4j5J2J2J2J1k0k1n5q2o9j6O1Q7O1O0L6L6J9K0l4l4
$$ -806 -845 -830 -816 -770 -723 -703 -683 -715 -748 -781 -813 -828 -842 -856 -871 -859 -847 -835 -824 -844 -865 -920 -1002 -1071 -1087 -1026 -939 -878 -818 -782 -746 -727 -707 -741 -775
9542g75n4n4jkL6L5j8j7j5j5J2J2J1J2J2J2k4k3k4k4J9K0K0J9J3J3J3J3k3k4k4k4J8J8J8J9
$$ -775 -829 -883 -884 -886 -850 -815 -833 -850 -865 -880 -868 -856 -845 -833 -821 -809 -833 -856 -880 -904 -885 -865 -845 -826 -813 -800 -787 -774 -797 -821 -845 -869 -851 -833 -815 -796
9526g96L2L3L3L3MNMMMLMMk4k4k4k4k9l0M1O7M6pm9p5n4n5lmK7K7K7K6j5j4J1J1KLn1n1kk
$$ -796 -764 -731 -698 -665 -661 -656 -652 -648 -644 -641 -637 -633 -657 -681 -705 -729 -758 -788 -747 -680 -634 -641 -690 -765 -819 -874 -877 -881 -854 -827 -800 -774 -789 -803 -792 -781 -779 -776 -827 -878 -880 -882
9508h82kkJ6J6J6J5J7J7l7l6qrM2M3O3L6j0n3n5j1M9N0M0M1j3j2k0k0k0k0m3m3J0J0L5L5R
$$ -882 -884 -886 -870 -854 -838 -823 -806 -789 -826 -862 -870 -879 -837 -794 -731 -695 -705 -758 -813 -824 -775 -725 -685 -644 -657 -669 -689 -709 -729 -749 -792 -835 -825 -815 -780 -745 -736
9492g36Rppl2l2j3J3K3k1o8o7j8j8K5K5K5K5rrrj0OPOOmllmL4L4L4L4k2k2k1k2J6J6j0j1k6
$$ -736 -727 -734 -741 -773 -805 -818 -805 -782 -803 -871 -938 -956 -974 -949 -924 -899 -874 -883 -892 -901 -911 -905 -898 -892 -886 -890 -893 -896 -900 -866 -832 -798 -764 -786 -808 -829 -851 -835 -819 -829 -840 -866
9474h66k6K7K6L9L9J2J2k9k9k9k9l4l4ppM9M9mmk0j9J6M2J7k7n4n3J0J1J1J1RJ0k6n2n1pL9
$$ -866 -892 -865 -839 -800 -761 -749 -737 -766 -795 -824 -853 -887 -921 -928 -935 -886 -837 -841 -845 -865 -884 -868 -826 -809 -836 -890 -943 -933 -922 -911 -900 -891 -881 -907 -959 -1010 -1017 -978
9457i78O5O1L6jjk2k2k3k2j4j5j4j5M4M4rrqqrqnmnnL9L9L9L9J0J0J1J0nonok9l0k9l0j4j5
$$ -978 -913 -852 -816 -817 -818 -840 -862 -885 -907 -921 -936 -950 -965 -921 -877 -886 -895 -903 -911 -920 -928 -933 -937 -942 -947 -908 -869 -830 -791 -781 -771 -760 -750 -755 -761 -766 -772 -801 -831 -860 -890 -904 -919
9439i19j4j5J9J9J8J9L7L7N0K3k1o4o6k3K3K3K6K6M4M4J7J8k0k0p2p3LKLLK4K4km5m8nN6N6
$$ -919 -933 -948 -929 -910 -892 -873 -836 -799 -749 -726 -747 -811 -877 -900 -877 -854 -828 -802 -758 -714 -697 -679 -699 -719 -791 -864 -861 -859 -856 -853 -829 -805 -807 -852 -900 -905 -849 -793
9422g93J0J0m3m3j9j9L4L4N4N4pn2n7l0NMqqM4M5N0M9k1m7k2K2M8M8PONNl9o6n0pK4ll8l8
$$ -793 -783 -773 -816 -859 -878 -897 -863 -829 -775 -721 -728 -780 -837 -867 -862 -858 -866 -874 -830 -785 -735 -686 -707 -754 -776 -754 -706 -658 -651 -645 -640 -635 -674 -740 -790 -797 -773 -776 -814 -852
9405h52J2J1N6N5N2N3QQj9k0j9k0j8j8j9j8k5k6L7L6K9L0j5j5o1o1j8j7J5J5J4J5POPOk3k3
$$ -852 -840 -829 -773 -718 -666 -613 -605 -597 -616 -636 -655 -675 -693 -711 -730 -748 -773 -799 -762 -726 -697 -667 -682 -697 -758 -819 -837 -854 -839 -824 -810 -795 -788 -782 -775 -769 -792 -815
9388h15n2%L1L2L6L5KJKKj1j0N1N1N5N5j2o5m3m3klKJk5k5m6m6m6m6j9j9j9j9L1L1L1L1J6
$$ -815 -867 -867 -836 -804 -768 -733 -731 -730 -728 -726 -737 -747 -696 -645 -590 -535 -547 -612 -655 -698 -700 -703 -701 -700 -725 -750 -796 -842 -888 -934 -953 -972 -991 -1010 -979 -948 -917 -886 -870
9371h70J7j0j0k3k2L8L9M7M7l2l2l0l1l0l0kkM2M2M2M3J6J6l4l4l5l4m5m5m5m4K1K2K2K1N0
$$ -870 -853 -863 -873 -896 -918 -880 -841 -794 -747 -779 -811 -841 -872 -902 -932 -934 -936 -894 -852 -810 -767 -751 -735 -769 -803 -838 -872 -917 -962 -1007 -1051 -1030 -1008 -986 -965 -915
9356i15N0N4%j6j5K5K5llm7m7p5p5k9k9J4M1P0P0L4L4L4L4J2J2J2J2OPqJ9MMOOJ3J3J0J1R
$$ -915 -865 -811 -811 -827 -842 -817 -792 -795 -798 -845 -892 -967 -1042 -1071 -1100 -1086 -1045 -975 -905 -871 -837 -803 -769 -757 -745 -733 -721 -715 -708 -716 -697 -693 -689 -683 -677 -664 -651 -641 -630 -621
9339f21j8j8QRRj8m5n8n9pL7O3L7Qj9j%J2j4k3k3k4k5l8l8l9l8j0j0k4KJ9J9onlkK5N2N5K9
$$ -621 -639 -657 -649 -640 -631 -649 -694 -752 -811 -818 -781 -718 -681 -673 -692 -693 -693 -681 -695 -718 -741 -765 -790 -828 -866 -905 -943 -953 -963 -987 -985 -966 -947 -953 -958 -961 -963 -938 -886 -831 -802
9321h02j6j6ppqpk9k9j7RL7L7Rj6k5k5%jKKMMJ8M4L0K9PPPPk9l0k9l0lmj8QN0N1O8M1M3M3
$$ -802 -818 -834 -841 -848 -856 -863 -892 -921 -938 -929 -892 -855 -846 -862 -887 -912 -912 -913 -911 -909 -905 -901 -883 -839 -809 -780 -773 -766 -759 -752 -781 -811 -840 -870 -873 -877 -895 -887 -837 -786 -718 -677 -634 -591
9302e91L0Lk8k8J2J3j7m4n4n3k1NOk2k8k8J7M3L0L1L2L2QRRRk2k2NNj9j9K5K5J8J8m4m3l5
$$ -591 -561 -558 -586 -614 -602 -589 -606 -650 -704 -757 -778 -773 -767 -789 -817 -845 -828 -785 -755 -724 -692 -660 -652 -643 -634 -625 -647 -669 -664 -659 -678 -697 -672 -647 -629 -611 -655 -698 -733
9285g33l4l7l6k9n6o7j4O0J12J16O3J4J4J1J1ppl4l3n1n0K8K9J1J1l3l3l7l7oM6N0K5j9m5
$$ -733 -767 -804 -840 -869 -925 -992 -1006 -946 -834 -718 -655 -641 -627 -616 -605 -612 -619 -653 -686 -737 -787 -759 -730 -719 -708 -741 -774 -811 -848 -854 -808 -758 -733 -752 -797
9270g97k9K4L7L7l1l2l1l1L9M0M0L9L3L3L0L0J9l4l3J9L2L2k7k6%%J%k4k3k3k4QQQQL6L7L6
$$ -797 -826 -802 -765 -728 -759 -791 -822 -853 -814 -774 -734 -695 -662 -629 -599 -569 -550 -584 -617 -598 -566 -534 -561 -587 -587 -587 -586 -586 -610 -633 -656 -680 -672 -664 -656 -648 -612 -575 -539
9253e39L7j7j7j8j9m4p0q5l3j7j6l9l8J7M5J6l6m7k0j2j2J1J1N5N5K3K3K3K3K4K4K4K4J3J2
$$ -539 -502 -519 -536 -554 -573 -617 -687 -772 -805 -822 -838 -877 -915 -898 -853 -837 -873 -920 -940 -952 -964 -953 -942 -887 -832 -809 -786 -763 -740 -716 -692 -668 -644 -631 -619
9237f19j4j4k7k7L4L5J0J0J0J0NOk2k1j2j3m1r4r2l9PPqrl1l2k1L1O1O0L4j8J2J1lmllPQQ
$$ -619 -633 -647 -674 -701 -667 -632 -622 -612 -602 -592 -587 -581 -603 -624 -636 -649 -690 -784 -876 -915 -908 -901 -909 -918 -949 -981 -1002 -971 -910 -850 -816 -834 -822 -811 -814 -818 -821 -824 -817 -809 -801
9220h01QJKJJl4l4o4j1L9L8O8O8P9P8K9k4o1o1o4o4m4m4J8J8K2K2mml2l2l1l2J4J4l0l0k8
$$ -801 -793 -792 -790 -789 -788 -822 -856 -920 -931 -892 -854 -786 -718 -639 -561 -532 -556 -617 -678 -742 -806 -850 -894 -876 -858 -836 -814 -818 -822 -854 -886 -917 -949 -935 -921 -951 -981 -1009
9203a009k9J6J5K3K3l6l5K2P6P5K3rrl5l5n5kO5O5N9N8J5J4OOl8l9l5l6K6K6P2P1O8O8K1l2
$$ -1009 -1038 -1022 -1007 -984 -961 -997 -1032 -1010 -934 -859 -836 -845 -854 -889 -924 -979 -981 -916 -851 -792 -734 -719 -705 -699 -693 -731 -770 -805 -841 -815 -789 -717 -646 -578 -510 -489 -521
9187e21r5r6o4j2K0K1JJm3m3QRQRj3j2L2L1J2J1J2J1j0j0rj0nmmmpppL7N0K4k8p3o9m3ML0
$$ -521 -616 -712 -776 -788 -768 -747 -746 -745 -788 -831 -823 -814 -806 -797 -810 -822 -790 -759 -747 -736 -724 -713 -723 -733 -742 -752 -757 -761 -765 -769 -776 -783 -790 -753 -703 -679 -707 -780 -849 -892 -888 -858
9169h58K9K9j4j3k1k0M2M1RQj7j8OOk0k0K5K5j9j9mmk9n6n7NO6O5M6M6LKk4k3m7m7k7J6N3
$$ -858 -829 -800 -814 -827 -848 -868 -826 -785 -776 -768 -785 -803 -797 -791 -811 -831 -806 -781 -800 -819 -823 -827 -856 -912 -969 -964 -898 -833 -787 -741 -738 -736 -760 -783 -830 -877 -904 -888 -835
9152h35N3O9O9M2M3ppo7o7r9p1l3J2L5L4J2J1J3J3j3j3%%%%L3L4L3L4k1k2k1k1j6j6j5j6J2
$$ -835 -782 -713 -644 -602 -559 -566 -573 -640 -707 -806 -877 -910 -898 -863 -829 -817 -806 -793 -780 -793 -806 -806 -806 -806 -806 -773 -739 -706 -672 -693 -715 -736 -757 -773 -789 -804 -820 -808
9136h08J2l2l2llM2M1L2L2m7p4o2j7j%K2K2M9M9QRl5l6poJ9K0J5J5k9k9n6n5nK1N4J07R4O8
$$ -808 -796 -828 -860 -863 -866 -824 -783 -751 -719 -766 -840 -902 -919 -920 -920 -898 -876 -827 -778 -770 -761 -796 -832 -839 -845 -826 -806 -791 -776 -805 -834 -890 -945 -950 -929 -875 -768 -674 -606
9119f06L0L0K9K9k2k2k2k2m6m7m6m6J8J9J8J8RRRRj3j3n6n7m7m7k0k1L2L2L1L2L0L1L0L1n
$$ -606 -576 -546 -517 -488 -510 -532 -554 -576 -622 -669 -715 -761 -743 -724 -706 -688 -679 -670 -661 -652 -665 -678 -734 -791 -838 -885 -905 -926 -894 -862 -831 -799 -769 -738 -708 -677 -682
9103f82mm9m9J%k6k6m1m1ML%jK6K6OOOOJ0J0J1J0opNN8O9J6m4m5QO0P2M6K2K1k6p8p5k3M2
$$ -682 -686 -735 -784 -783 -783 -809 -835 -876 -917 -913 -910 -910 -911 -885 -859 -853 -847 -841 -835 -825 -815 -804 -794 -800 -807 -802 -744 -675 -659 -703 -748 -740 -680 -608 -562 -540 -519 -545 -623 -698 -721 -679
9084f79M2%JJJlmlmppppm1m1j5J2J5l7n0n0J8J7J8J7j3j4j4j3k0k0j9k0mmmmj9j8j8j9l7l7
$$ -679 -637 -637 -636 -635 -634 -637 -641 -644 -648 -655 -662 -669 -676 -717 -758 -773 -761 -746 -783 -833 -883 -865 -848 -830 -813 -826 -840 -854 -867 -887 -907 -926 -946 -950 -954 -958 -962 -981 -999 -1017 -1036 -1073 -1110
9066a110l7l7j5j5P3P4O8O9J6J6j0j0j1j0j7j7j7j7k2k2L1L0O0N9POrj0rrM3M3M4M3K5K6k8
$$ -1110 -1147 -1184 -1199 -1214 -1141 -1067 -999 -930 -914 -898 -908 -918 -929 -939 -956 -973 -990 -1007 -1029 -1051 -1020 -990 -930 -871 -864 -858 -867 -877 -886 -895 -852 -809 -765 -722 -697 -671 -699
9050f99k8l6l6l7l6k9k8K4K5L6L7L6L7NOOOjjjjOOOOl6l5l6l6QQQQK9K9K9K9M7M7noL6L5L5
$$ -699 -727 -763 -799 -836 -872 -901 -929 -905 -880 -844 -807 -771 -734 -729 -723 -717 -711 -712 -713 -714 -715 -709 -703 -697 -691 -727 -762 -798 -834 -826 -818 -810 -802 -773 -744 -715 -686 -639 -592 -597 -603 -567 -532 -497
9031d97L5l0k9l0l0m9n0m9n0k6k6k6k6M6M7M6M7L7L7L8L7J2J2m1m1l9m0l9m0rj0j0j0NMMM
$$ -497 -462 -492 -521 -551 -581 -630 -680 -729 -779 -805 -831 -857 -883 -837 -790 -744 -697 -660 -623 -585 -548 -536 -524 -565 -606 -645 -685 -724 -764 -773 -783 -793 -803 -798 -794 -790 -786
9015g86J5J6J5J5K5K6K5K5j6j6j7j6K1K0K1K1l4l4l4l5j0j0qqn1k5K2O6Q1N5%k7k3k2k4k5
$$ -786 -771 -755 -740 -725 -700 -674 -649 -624 -640 -656 -673 -689 -668 -648 -627 -606 -640 -674 -708 -743 -753 -763 -771 -779 -830 -855 -833 -767 -686 -631 -631 -658 -681 -703 -727 -752
8999g52K6K6K6K6o5o6o5o6j9j9L3L3N8N8MNK8K8K7K8llmlrro2o2k5k6k6k5NOONnnnoj%jjN0
$$ -752 -726 -700 -674 -648 -713 -779 -844 -910 -929 -948 -915 -882 -824 -766 -762 -757 -729 -701 -674 -646 -649 -652 -656 -659 -668 -677 -739 -801 -826 -852 -878 -903 -898 -892 -886 -881 -886 -891 -896 -902 -903 -903 -904 -905 -855
8980h55M9M7M7K0k5j5J2j8j7j5j5k3k3k2k3PPQPN3N3K4k1l8o5p6l2K4N1O3J9k8k8l1l1l5l5
$$ -855 -806 -759 -712 -692 -717 -732 -720 -738 -755 -770 -785 -808 -831 -853 -876 -869 -862 -854 -847 -794 -741 -717 -738 -776 -841 -917 -949 -925 -874 -811 -792 -820 -848 -879 -910 -945 -980
8964i80J6J6Lk4OO9J02N9l4r6q5m2J8J8K6K6N3N2K4K4klk4k4K8K9QRj7j8j7j6RN2N7J4m8m7
$$ -980 -964 -948 -945 -969 -963 -894 -792 -733 -767 -863 -948 -990 -972 -954 -928 -902 -849 -797 -773 -749 -751 -754 -778 -802 -774 -745 -737 -728 -745 -763 -780 -796 -787 -735 -678 -664 -712 -759
8947g59j5j4J2J2j5j5j5j5O4O4P6N0J4k9r2r2o6k3J3N8O9K5n3p9o4k0OOK4K5k9k8j7j7L6L6
$$ -759 -774 -788 -776 -764 -779 -794 -809 -824 -760 -696 -620 -570 -556 -585 -677 -769 -835 -858 -845 -787 -718 -693 -746 -825 -889 -909 -903 -897 -873 -848 -877 -905 -922 -939 -903 -867
8931h67L6L6j7j7j8j8L5L4J7J7j0j0LMLMn2n1k6k5J9J8O8O8Ln7q8o2rL5N0K4rn2m5j8J1J1
$$ -867 -831 -795 -812 -829 -847 -865 -830 -796 -779 -762 -772 -782 -779 -775 -772 -768 -820 -871 -897 -922 -903 -885 -817 -749 -746 -803 -891 -953 -962 -927 -877 -853 -862 -914 -959 -977 -966 -955
8915i55m0m0K0K1M7M8J6J7J7J7M0M1j3j2j2j2M0M1MMNMK7K7k5k6o7o8m4RN0N0%%RQQQl3l2
$$ -955 -995 -1035 -1015 -994 -947 -899 -883 -866 -849 -832 -792 -751 -764 -776 -788 -800 -760 -719 -715 -711 -706 -702 -675 -648 -673 -699 -766 -834 -878 -869 -819 -769 -769 -769 -760 -752 -744 -736 -769 -801
8898h01J6J7J2m1l8l7nmnnL6L6j6j7KKK9K8k4k4n1n1K4K4k9k9j6j6J1J0K8K9N8Nj9j9L1L0
$$ -801 -785 -768 -756 -797 -835 -872 -877 -881 -886 -891 -855 -819 -835 -852 -850 -848 -819 -791 -815 -839 -890 -941 -917 -893 -922 -951 -967 -983 -972 -962 -934 -905 -847 -842 -861 -880 -849 -819
8881h19L3L2OOL1L0L1L1k8k8k8k8J3J4J6l6n0m9NN8N1N2L2k1n8n7l5l4l8l8o8j5M6M6Q0K6
$$ -819 -786 -754 -748 -742 -711 -681 -650 -619 -647 -675 -703 -731 -718 -704 -688 -724 -774 -823 -818 -760 -709 -657 -625 -646 -704 -761 -796 -830 -868 -906 -974 -989 -943 -897 -817 -791
8866g91j7j8n0KM0M0M3M3N0N1l7l7j5j4j4j4J3J3J3J4KLKLj%jjRQm4m4m4m4QRK7K6K7K6J0
$$ -791 -808 -826 -876 -874 -834 -794 -751 -708 -658 -607 -644 -681 -696 -710 -724 -738 -725 -712 -699 -685 -683 -680 -678 -675 -676 -676 -677 -678 -669 -661 -705 -749 -793 -837 -829 -820 -793 -767 -740 -714 -704
8848g04J0J0J0%%j%l5l4l3l2kM1O1O0L9L8L9L8k6k7k6k7k6k7k6k7K0K0K0K0J8J9M2kn8q4n9
$$ -704 -694 -684 -674 -674 -674 -675 -675 -710 -744 -777 -809 -811 -770 -709 -649 -610 -572 -533 -495 -521 -548 -574 -601 -627 -654 -680 -707 -687 -667 -647 -627 -609 -590 -548 -550 -608 -692 -751
8831g51l3kK5N2N3J0l4l6l6jjjjonooMMKKo4r1n6j2klJ%JJK7K7N8N9J4J5rrJ7J7J4J3l0l1
$$ -751 -784 -786 -761 -709 -656 -646 -680 -716 -752 -753 -754 -755 -756 -762 -767 -773 -779 -775 -771 -769 -767 -831 -922 -978 -990 -992 -995 -994 -994 -993 -992 -965 -938 -880 -821 -807 -792 -801 -810 -793 -776 -762 -749 -779 -810
8812h10j1j1j1j2K4K3K4K3M2M2M2M1J4J3J1J2j3l9m8nOORQOPOOj4j4j4j4l1l1l2l1j6j6j6
$$ -810 -821 -832 -843 -855 -831 -808 -784 -761 -719 -677 -635 -594 -580 -567 -556 -544 -557 -596 -644 -649 -643 -637 -628 -620 -614 -607 -601 -595 -609 -623 -637 -651 -682 -713 -745 -776 -792 -808 -824
8795h24j6M0M0M0M0j0j1l7l7j9j9K5K5j6j5j5j5L4L3N7N7P2J9j3j3j5j5m1m2opooj3j4j3j3
$$ -824 -840 -800 -760 -720 -680 -690 -701 -738 -775 -794 -813 -788 -763 -779 -794 -809 -824 -790 -757 -700 -643 -571 -552 -565 -578 -593 -608 -649 -691 -697 -704 -710 -716 -729 -743 -756 -769
8779g69k5k4k4k4J1J2J2J2O9O9M2M3j1j2p2p3l3l3l3l4j7j8j8j8J1J1J1J1mnmnrj0J6J7l0
$$ -769 -794 -818 -842 -866 -855 -843 -831 -819 -750 -681 -639 -596 -607 -619 -691 -764 -797 -830 -863 -897 -914 -932 -950 -968 -957 -946 -935 -924 -928 -933 -937 -942 -951 -961 -945 -928 -958
8763i58l1J4J4Q4Q3Q7L4J1J1PPn1n1n1n1QQJ1m2o3o2j7L7L4L4L7L7J5J5k9l0n1n2qqJ1J1l3
$$ -958 -989 -975 -961 -877 -794 -707 -673 -662 -651 -644 -637 -688 -739 -790 -841 -833 -825 -814 -856 -919 -981 -998 -961 -927 -893 -856 -819 -804 -789 -818 -848 -899 -951 -959 -967 -956 -945 -978
8746i78l3QQL4L4N0N0N0M9L0L0L0L0l4l4l4l3l1l1l0l1m3m3m2m3LMN6N7N9O0PPk7k6K6K7k
$$ -978 -1011 -1003 -995 -961 -927 -877 -827 -777 -728 -698 -668 -638 -608 -642 -676 -710 -743 -774 -805 -835 -866 -909 -952 -994 -1037 -1034 -1030 -974 -917 -858 -798 -791 -784 -811 -837 -811 -784 -786
8730g86ln1n2k6K7N1N0j7j7j7j7K6K5K6K6L0L1K7K7nn8o9m4ool9o6m0J4N2P8P5K2j8m4l3n
$$ -786 -789 -840 -892 -918 -891 -840 -790 -807 -824 -841 -858 -832 -807 -781 -755 -725 -694 -667 -640 -645 -703 -772 -816 -822 -828 -867 -933 -973 -959 -907 -829 -754 -732 -750 -794 -827 -832
8714h32L0L0PPj6j7jN2O3L7j2j3J3J2OOm7m6j4j4L6L6J2m0n2k6kj%%j%jjkkM8M8K8k4j0J7
$$ -832 -802 -772 -765 -758 -774 -791 -792 -740 -677 -640 -652 -665 -652 -640 -634 -628 -675 -721 -735 -749 -713 -677 -665 -705 -757 -783 -785 -786 -786 -786 -787 -787 -788 -789 -791 -793 -745 -697 -669 -693 -703 -686
8696f86RQJ0J1k9k8k8k8K6K7K7K7J3J3RJ0k3p5o1l4jk%%J2J2j5j5l3l4j1M3N1N1K8K8l5l5
$$ -686 -677 -669 -659 -648 -677 -705 -733 -761 -735 -708 -681 -654 -641 -628 -619 -609 -632 -707 -768 -802 -803 -805 -805 -805 -793 -781 -796 -811 -844 -878 -889 -846 -795 -744 -716 -688 -723 -758
8679g58l5l5L0K9K9K9QRL2L2Qm5o7o8k0k0k0k1K7K7N3N3%Jm9m9m4PO3O3N4Jk2k2nonolllm
$$ -758 -793 -828 -798 -769 -740 -711 -703 -694 -662 -630 -622 -667 -734 -802 -822 -842 -862 -883 -856 -829 -776 -723 -723 -722 -771 -820 -864 -857 -794 -731 -677 -676 -698 -720 -725 -731 -736 -742 -745 -748 -751 -755
8661g55k1k1NNL1L0Qm5m4m3OOJ3J3O2O2N3%n8n8p0p0m0m0j8L5N8N8K7K8KJool2l2l1l0mmJ
$$ -755 -776 -797 -792 -787 -756 -726 -718 -763 -807 -850 -844 -838 -825 -812 -750 -688 -635 -635 -693 -751 -821 -891 -931 -971 -989 -954 -896 -838 -811 -783 -781 -780 -786 -792 -824 -856 -887 -917 -921 -925 -924
8643i24Jn1n2lmM9M9Q3Q4qn9q0k6L0Q4N1jn6n6ppM6M5L3L2NOjjjjl5l6l5l6LLLLLLL0K9M1
$$ -924 -923 -974 -1026 -1029 -1033 -984 -935 -852 -768 -776 -835 -915 -941 -911 -827 -776 -777 -833 -889 -896 -903 -857 -812 -779 -747 -742 -736 -737 -738 -739 -740 -775 -811 -846 -882 -879 -876 -873 -870 -867 -864 -834 -805 -764
8624g64M0l9l9n6n6k5K9O2O2MMk5k6o6o7m8MP2P2M1M1M1M2M3M3l6l6k0k0K5K4M4M5J2m0n3
$$ -764 -724 -763 -802 -858 -914 -939 -910 -848 -786 -782 -778 -803 -829 -895 -962 -1010 -1006 -934 -862 -821 -780 -739 -697 -654 -611 -647 -683 -703 -723 -698 -674 -630 -585 -573 -613 -666
8609f66n4l0l0J3J4j3j2m5m5%jM9N0K0l2l1K3M6K0j4m0p1p0n7n7K3K3L6L6L6L6jj%jK2K2K2
$$ -666 -720 -750 -780 -767 -753 -766 -778 -823 -868 -868 -869 -820 -770 -750 -782 -813 -790 -744 -724 -738 -778 -849 -919 -976 -1033 -1010 -987 -951 -915 -879 -843 -844 -845 -845 -846 -824 -802 -780
8592g80K2j9k0PPM3M4%jPOl8l8o6o7m0m1J1J0J0J1L8L8L8L9KKO0O0J6l8l3l4n0n0p3p3nM7
$$ -780 -758 -777 -797 -790 -783 -740 -696 -696 -697 -690 -684 -722 -760 -826 -893 -933 -974 -963 -953 -943 -932 -894 -856 -818 -779 -777 -775 -715 -655 -639 -677 -710 -744 -794 -844 -917 -990 -995 -948
8575i48M7ol0l0L1Q3O7K3k9k8J5J6J5J6K7K6O8O8L6rk5KJ5J5k7k8j8j9m5m4k4k4L8L8J4J3
$$ -948 -901 -907 -937 -967 -936 -853 -786 -763 -792 -820 -805 -789 -774 -758 -731 -705 -637 -569 -533 -542 -567 -565 -550 -535 -562 -590 -608 -627 -672 -716 -740 -764 -726 -688 -674 -661
8560f61l0l0l3l4J1J1K9K9L0K9j0j1j0j1K5K4l7l8l0k9l0l0OPk0m7k9J5K9Mopnnj5K9Q3J10
$$ -661 -691 -721 -754 -788 -777 -766 -737 -708 -678 -649 -659 -670 -680 -691 -666 -642 -679 -717 -747 -776 -806 -836 -830 -823 -843 -890 -919 -904 -875 -871 -877 -884 -889 -894 -909 -880 -797 -687
8543f87Q7M2Nk2m4m5m6m6l6l6K6N2L3j2k6JJ9J8l4p8p2p2m2j6M3Q6J04P7M9K2qrk0k1NOJ9
$$ -687 -600 -558 -553 -575 -619 -664 -710 -756 -792 -828 -802 -750 -717 -729 -755 -754 -735 -717 -751 -829 -901 -973 -1015 -1031 -988 -902 -798 -721 -672 -650 -658 -667 -687 -708 -703 -697 -678
8527f78J9k5k5l3l3opK7K8K7K7j0rL1L2J1l3n3n2QQL4L5j5j5j6j5J8J8k0m7n1n0j5J2K8K8
$$ -678 -659 -684 -709 -742 -775 -781 -788 -761 -733 -706 -679 -689 -698 -667 -635 -624 -657 -710 -762 -754 -746 -712 -677 -692 -707 -723 -738 -720 -702 -722 -769 -820 -870 -885 -873 -845 -817
8511h17K9L0k5k5k4k5l6l5l4l4JK7K8Jpqqpj4J3N0M9K9MJ7J8J2J2J1J2%Jjjj0l7k2k2RRJ0
$$ -817 -788 -758 -783 -808 -832 -857 -893 -928 -962 -996 -995 -968 -940 -939 -946 -954 -962 -969 -983 -970 -920 -871 -842 -838 -821 -803 -791 -779 -768 -756 -756 -755 -756 -757 -767 -804 -826 -848 -839 -830 -820
8493h20Rj9k0j7j8OL3O8O9K2nK5kl2l3KK8jk6k5JL1L1L1L1K3lm1m1l8l7l5l6L5O1M4M4lm6
$$ -820 -811 -830 -850 -867 -885 -879 -846 -778 -709 -687 -692 -667 -669 -701 -734 -732 -704 -705 -731 -756 -755 -724 -693 -662 -631 -608 -611 -652 -693 -731 -768 -803 -839 -804 -743 -699 -655 -658 -704
8476g04k2k2MLLL%%jkjk8o3o4OL3L4Qj8RM4M4Rj7j9PL6Rk6k6J1L6L7J0j2j2j4j4j8j7j7j7
$$ -704 -726 -748 -744 -741 -738 -735 -735 -735 -736 -738 -739 -767 -830 -894 -888 -855 -821 -813 -831 -822 -778 -734 -725 -742 -761 -754 -718 -709 -735 -761 -750 -714 -677 -667 -679 -691 -705 -719 -737 -754 -771 -788
8458g88rrM3M4J4J4J4J4MNMMk8k9k9k9LKKKK2K3K3K4M9P5R2L0m8r3r5n1qJ9K2nNMMLMMLMj5
$$ -788 -797 -806 -763 -719 -705 -691 -677 -663 -659 -654 -650 -646 -674 -703 -732 -761 -758 -756 -754 -752 -730 -707 -684 -660 -611 -536 -444 -414 -462 -555 -650 -701 -709 -690 -668 -673 -668 -664 -660 -657 -653 -649 -646 -642 -657
8439f57j5j5j5J%n2n3k3k2k3k3j7j7j7j8jkkkK5K6K5K5mlmmL6L5L5L6KKLKJ8J8J8J8K3K4l0
$$ -657 -672 -687 -702 -701 -701 -753 -806 -829 -851 -874 -897 -914 -931 -948 -966 -967 -969 -971 -973 -948 -922 -897 -872 -876 -879 -883 -887 -851 -816 -781 -745 -743 -741 -738 -736 -718 -700 -682 -664 -641 -617 -647
8420f47k9LKLLj6j6j6j6k1k1k0k1J1J1J1J1jjL3N9L5k8p9p9n5n6lkNNN7N8M9M9M9M9N2N2N3
$$ -647 -676 -673 -671 -668 -665 -681 -697 -713 -729 -750 -771 -791 -812 -801 -790 -779 -768 -769 -770 -737 -678 -643 -671 -750 -829 -884 -940 -943 -945 -940 -935 -878 -820 -771 -722 -673 -624 -572 -520 -467
8403d67N2m0m1m0m1m4m4m3m4QQPQL9M0nnLLLKj2j3j2j3QQM7M7j2r9j25j26q0k8j3j3LMM8M7
$$ -467 -415 -455 -496 -536 -577 -621 -665 -708 -752 -744 -736 -729 -721 -682 -642 -647 -652 -649 -646 -643 -641 -653 -666 -678 -691 -683 -675 -628 -581 -593 -692 -817 -943 -1023 -1051 -1064 -1077 -1074 -1070 -1022 -975
8385i75J9K0J9J9L3L3L0L0K9k5n6n6LMMLmnnmk0k1k0k0L2L1L2L2J6J6J6J6qrqrJ1J1J2J1L0
$$ -975 -956 -936 -917 -898 -865 -832 -802 -772 -743 -768 -824 -880 -877 -873 -869 -866 -870 -875 -880 -884 -904 -925 -945 -965 -933 -902 -870 -838 -822 -806 -790 -774 -782 -791 -799 -808 -797 -786 -774 -763 -733
8367g33L0O0Pn4n5j4j3JKm2m2m1m2K1K0O0N9M5pn7n6n7n6j1M2Q8Q8O8J6n1n1j7j8RRppJ9J9
$$ -733 -703 -643 -636 -690 -745 -759 -772 -771 -769 -811 -853 -894 -936 -915 -895 -835 -776 -731 -738 -795 -851 -908 -964 -975 -933 -845 -757 -689 -673 -724 -775 -792 -810 -801 -792 -799 -806 -787 -768
8351g68J2J2J1J2k4k4k4k4K0K0K0K0MMNMj7j7j7j7NNk1k2p2p3l3J0M5P2Q4Q4M4J8nm9q2q2
$$ -768 -756 -744 -733 -721 -745 -769 -793 -817 -797 -777 -757 -737 -733 -729 -724 -720 -737 -754 -771 -788 -783 -778 -799 -821 -893 -966 -999 -989 -944 -872 -788 -704 -660 -642 -647 -696 -778 -860
8334h60m1K2P0P0M8M7l6l6l6l6o1o0o1o1J3J3L9M0qqJ0N4P9N2K6K6ppppJ5J5J4J5jjj%KLK
$$ -860 -901 -879 -809 -739 -691 -644 -680 -716 -752 -788 -849 -909 -970 -1031 -1018 -1005 -966 -926 -934 -942 -932 -878 -799 -747 -721 -695 -702 -709 -716 -723 -708 -693 -679 -664 -665 -666 -667 -667 -665 -662 -660
8316f60LJ4J4J5J4lmmmK2K1M4M5L5j0m7m6n1n1n1n1RRRRKKKKj8j8j8j8m0m0l8l8K0O3N3K7
$$ -660 -657 -643 -629 -614 -600 -603 -607 -611 -615 -593 -572 -528 -483 -448 -458 -505 -551 -602 -653 -704 -755 -746 -737 -728 -719 -717 -715 -713 -711 -729 -747 -765 -783 -823 -863 -901 -939 -919 -856 -803 -776
8299g76MLJ2L7N7J3m3o9j5j4j4j4K2M8N8J4jjmmj%j%kjN1N1LMJKpl3j8K5K9Ll3l3m2m3m3m2
$$ -776 -772 -769 -757 -720 -663 -650 -693 -762 -777 -791 -805 -819 -797 -749 -691 -677 -678 -679 -683 -687 -688 -688 -689 -689 -691 -692 -641 -590 -587 -583 -582 -580 -587 -620 -638 -613 -584 -581 -614 -647 -689 -732 -775 -817
8279h17K6K7K7K6L0K9K9L0l2l2l2l2LKk3k4L5L5j8j8n1n2j6J0Ql7p8j05n3K6O7O8O7O7J5J4
$$ -817 -791 -764 -737 -711 -681 -652 -623 -593 -625 -657 -689 -721 -718 -716 -739 -763 -728 -693 -711 -729 -780 -832 -848 -838 -830 -867 -945 -1050 -1103 -1077 -1010 -942 -875 -808 -793 -779
8264g79mnmmPPL4L4K6K6k7k6k7k7K6K7J6J6j1j0K6K5k7k8o7o8j5j5K1K2K1K1M1M0j2j3j1j1
$$ -779 -783 -788 -792 -796 -789 -782 -748 -714 -688 -662 -689 -715 -742 -769 -743 -716 -700 -684 -695 -705 -679 -654 -681 -709 -776 -844 -859 -874 -853 -831 -810 -789 -748 -708 -720 -733 -744 -755
8247g55j2j1J5J6J6J5j6j6j5j6k1k1OON6N7PPmL9O8O8K0K1l3l3o3o4j0j1J6J5j0j1J5J6J4
$$ -755 -767 -778 -763 -747 -731 -716 -732 -748 -763 -779 -800 -821 -815 -809 -753 -696 -689 -682 -686 -647 -579 -511 -491 -470 -503 -536 -599 -663 -673 -684 -668 -653 -663 -674 -659 -643 -629
8231f29l0o0o0l4RN3N2KKj1j1j1j2lmlmm1m2j5j5K6K5%m3k6J9M5M4qpJ8J9L7L7j6j6j2j3M0
$$ -629 -659 -719 -779 -813 -804 -751 -699 -697 -695 -706 -717 -728 -740 -743 -747 -750 -754 -795 -837 -852 -867 -841 -816 -816 -859 -885 -866 -821 -777 -785 -792 -774 -755 -718 -681 -697 -713 -725 -738 -698
8214f98M0J0J0m3m3k2k1NOL3L4j7p8r5n2K9N4N1N0M9M9M8Lk5k4n8n8k9J4J3J3J6J5KJn1n1
$$ -698 -658 -648 -638 -681 -724 -746 -767 -762 -756 -723 -689 -706 -784 -879 -931 -902 -848 -797 -747 -698 -649 -601 -598 -623 -647 -705 -763 -792 -778 -765 -752 -736 -721 -719 -718 -769 -820
8198h20l4l4J9J8N4N4K8K8J4J4j3j2k0j9j9j9K9K9K9K9rqrqk7k8k4k4QN3K8K8mml1l0%Jk5
$$ -820 -854 -888 -869 -851 -797 -743 -715 -687 -673 -659 -672 -684 -704 -723 -742 -761 -732 -703 -674 -645 -654 -662 -671 -679 -706 -734 -758 -782 -774 -721 -693 -665 -669 -673 -704 -734 -734 -733 -758
8181g58k6l6l7j0j0K0K1K0K0J8J7m4m4l6l6K6K5O8O7N3%p6p6k9K3O1O0K0K0K8K9K8K8J%k5
$$ -758 -784 -820 -857 -867 -877 -857 -836 -816 -796 -778 -761 -805 -849 -885 -921 -895 -870 -802 -735 -682 -682 -758 -834 -863 -840 -779 -719 -699 -679 -651 -622 -594 -566 -565 -565 -590
8165e90k6p7p7m5QM8M7N5Jq2q2n9n9k0j9J2O5N1N0j3o6p1p2m3RM4M4P0P0L8j6j2j3N2N1QP
$$ -590 -616 -693 -770 -815 -807 -759 -712 -657 -656 -738 -820 -879 -938 -958 -977 -965 -900 -849 -799 -812 -878 -949 -1021 -1064 -1055 -1011 -967 -897 -827 -789 -805 -817 -830 -778 -727 -719 -712
8149g12QQL1L0k2p4p5k2L4L3L7L7JJk5k5QRQQj0j0j1j0l3l3j9L3O7O6K6K5l0l1n6n7p6p6m4
$$ -712 -704 -696 -665 -635 -657 -731 -806 -828 -794 -761 -724 -687 -686 -685 -710 -735 -727 -718 -710 -702 -712 -722 -733 -743 -776 -809 -828 -795 -728 -662 -636 -611 -641 -672 -728 -785 -861 -937 -981
8133i81RK6K6K9K9J1J0j6j6J8J8J8J8mnm2j5L5R8R1M7K6N2M7K0l8q2n7j4L9L8Pl7l8OL6Rl7
$$ -981 -972 -946 -920 -891 -862 -851 -841 -857 -873 -855 -837 -819 -801 -805 -810 -852 -867 -832 -734 -643 -596 -570 -518 -471 -451 -489 -571 -628 -642 -603 -565 -558 -595 -633 -627 -591 -582 -619
8116f19o5n1n1l6l5K6K6M1M2J6J5k1k2K3K2NMk2k2NONOK8K9K8K9K4K4l8l7l1l1L0L1K3K3K3
$$ -619 -684 -735 -786 -822 -857 -831 -805 -764 -722 -706 -691 -712 -734 -711 -689 -684 -680 -702 -724 -719 -713 -708 -702 -674 -645 -617 -588 -564 -540 -578 -615 -646 -677 -647 -616 -593 -570 -547
8100e47K3j1j1J6J6QQl5l6j7j8RRoooorrn3n3k6k7J8M4L9ol8l8j7K6M6M5j3j4j4j3KJp7p7
$$ -547 -524 -535 -546 -530 -514 -506 -498 -533 -569 -586 -604 -595 -586 -592 -598 -604 -610 -619 -628 -681 -734 -760 -787 -769 -725 -686 -692 -730 -768 -785 -759 -713 -668 -681 -695 -709 -722 -720 -719 -796 -873
8082h73o8o7ooK1K1K1K1Q1Q1M4%l9l9k4n1o7k2L0N6K4k1OOooopL1L1L1L1KLKKj3j4j3j4jj
$$ -873 -941 -1008 -1014 -1020 -999 -978 -957 -936 -855 -774 -730 -730 -769 -808 -832 -883 -950 -972 -942 -886 -862 -883 -877 -871 -877 -883 -889 -896 -865 -834 -803 -772 -770 -767 -765 -763 -776 -790 -803 -817 -818 -819
8064h19kjN0N0K3k2n3n3n6n6K2K3K2K2J2J3J2J2N5N5KLPQQPLLLLnmnnk9l0K3K4M7M8onn2n2
$$ -819 -821 -822 -772 -722 -699 -721 -774 -827 -883 -939 -917 -894 -872 -850 -838 -825 -813 -801 -746 -691 -689 -686 -679 -671 -663 -656 -653 -650 -647 -644 -649 -653 -658 -663 -692 -722 -699 -675 -628 -580 -586 -591 -643 -695
8045f95n1n0JK8L9nj1J6kkl5l4l5l4nmq8q8m6J6O9O9L2L3L2L3J4J4J3J4NNONm1m1m1m1M1M1
$$ -695 -746 -796 -795 -767 -728 -733 -744 -728 -730 -732 -767 -801 -836 -870 -875 -879 -967 -1055 -1101 -1085 -1016 -947 -915 -882 -850 -817 -803 -789 -776 -762 -757 -752 -746 -741 -782 -823 -864 -905 -864 -823
8027h23M1M1nnnnK2K1K1K1MNm5m6j9K6K5j9n4n4mml4l5oL7N1N1N4N4NNm7m6k7%M6Q9J19P5
$$ -823 -782 -741 -746 -751 -756 -761 -739 -718 -697 -676 -672 -667 -712 -758 -777 -751 -726 -745 -799 -853 -857 -861 -895 -930 -936 -899 -848 -797 -743 -689 -684 -679 -726 -772 -799 -799 -753 -664 -545 -470
8010d70Nm0m6m5m8m8n4n4J6M3Nl9k8jOOPQPQPQj0j0j1j0j6j7j7j7NMNMKJJJO4O3J1J1LLLL
$$ -470 -465 -505 -551 -596 -644 -692 -746 -800 -784 -741 -736 -775 -803 -804 -798 -792 -785 -777 -770 -762 -755 -747 -757 -767 -778 -788 -804 -821 -838 -855 -850 -846 -841 -837 -835 -834 -833 -832 -768 -705 -694 -683 -680 -677 -674 -671
7990f71lllll2l2l1l2j2j2j1j2J7J6J7J7j6j6j6j6nnmnRRJ0RM3M2M2M3j5j5j5j5k5k6k6k6
$$ -671 -674 -677 -680 -683 -715 -747 -778 -810 -822 -834 -845 -857 -840 -824 -807 -790 -806 -822 -838 -854 -859 -864 -868 -873 -864 -855 -845 -836 -793 -751 -709 -666 -681 -696 -711 -726 -751 -777 -803 -829
7973h29L4L4L3L4KKKKj1j2o2o3n4k7J9O4R2O6J1j6l2l2J8J9L5L5L2L2L0k3o5r1p2m6rj0LL
$$ -829 -795 -761 -728 -694 -692 -690 -688 -686 -697 -709 -771 -834 -888 -915 -896 -832 -740 -674 -663 -679 -711 -743 -725 -706 -671 -636 -604 -572 -542 -565 -630 -721 -793 -839 -848 -858 -855 -852
7956h52MLO8O8Q0N3L6j7l9m0K0M7k3p6p7k5M5J9l4l4rrk7k7%%L6L7L7L6j7j7RRL3L3k0k0k9
$$ -852 -848 -845 -777 -709 -629 -576 -540 -557 -596 -636 -616 -569 -592 -668 -745 -770 -725 -706 -740 -774 -783 -792 -819 -846 -846 -846 -810 -773 -736 -700 -717 -734 -725 -716 -683 -650 -670 -690 -719
7939g19k8k9k9J4J4M1M0L3L3k0k0k6k7j%JKJJj0rj0j0J1J2J1J1K2K2l1l1J3J3J3J3ppK8N5
$$ -719 -747 -776 -805 -791 -777 -736 -696 -663 -630 -650 -670 -696 -723 -724 -724 -723 -721 -720 -719 -729 -738 -748 -758 -747 -735 -724 -713 -691 -669 -700 -731 -718 -705 -692 -679 -686 -693 -665 -610
7922f10N1jm3p0m1m2j7j7J3J3O5O4N6K9j4o7n8n7rqM8M7M8M7k1k2k2k2k9k9k9k9QRQQnono
$$ -610 -559 -560 -603 -673 -714 -756 -773 -790 -777 -764 -699 -635 -579 -550 -564 -631 -689 -746 -755 -763 -715 -668 -620 -573 -594 -616 -638 -660 -689 -718 -747 -776 -768 -759 -751 -743 -748 -754 -759 -765
7905g65kkkkl3l2K1K0kkn5n5lmJ9J9j3o7l7l6K1K1M7M7K5K5k8k8k0j9j9k0MLLLJ5J6M1M2K1
$$ -765 -767 -769 -771 -773 -806 -838 -817 -797 -799 -801 -856 -911 -914 -918 -899 -880 -893 -960 -997 -1033 -1012 -991 -944 -897 -872 -847 -875 -903 -923 -942 -961 -981 -977 -974 -971 -968 -953 -937 -896 -854 -833
7887h33K1P1P1L7j6J3J4M0M0J7l5o8o7p1p1J2J1J2J2J2J2J2J2O5O6J3J3l2l3l2l3nnM8M8M0
$$ -833 -812 -741 -670 -633 -649 -636 -622 -582 -542 -525 -560 -628 -695 -766 -837 -825 -814 -802 -790 -778 -766 -754 -742 -677 -611 -598 -585 -617 -650 -682 -715 -720 -725 -677 -629 -589
7872e89M0j3j3k0k0k1k0nmn7n8m0m1J2J2L5L6j8j7%Jk6k6n9o0l6J6P3P4N4Jj8j7OOjjjjJ0
$$ -589 -549 -562 -575 -595 -615 -636 -656 -661 -665 -722 -780 -820 -861 -849 -837 -802 -766 -784 -801 -801 -800 -826 -852 -911 -971 -1007 -991 -918 -844 -790 -789 -807 -824 -818 -812 -813 -814 -815 -816 -806
7854h06J0J0Rj8j9j9j8QQQQj9k0j9j9JKn2n1k2k2k1k2L8L8L8L8l8l8J5J5J1J2J1J2K9L0Lm1
$$ -806 -796 -786 -777 -795 -814 -833 -851 -843 -835 -827 -819 -838 -858 -877 -896 -895 -893 -945 -996 -1018 -1040 -1061 -1083 -1045 -1007 -969 -931 -969 -1007 -992 -977 -966 -954 -943 -931 -902 -872 -869 -910
7837i10m8k2kK5O0N9O2O2L2L2L1L1N8L2j5n9o4l8kkj7j6j6j6MMMMJ1J1J1J1j4j3j3j3opop
$$ -910 -958 -980 -982 -957 -897 -838 -776 -714 -682 -650 -619 -588 -530 -498 -513 -572 -636 -674 -676 -678 -695 -711 -727 -743 -739 -735 -731 -727 -716 -705 -694 -683 -697 -710 -723 -736 -742 -749 -755 -762
7820g62j2j3j2j3klklj7j6L6L7K2K2K2K2J8J8J6J5Pl7l8PK6K7k4k3j4j3j4j3k6k6k5k6K3K2
$$ -762 -774 -787 -799 -812 -814 -817 -819 -822 -839 -855 -819 -782 -760 -738 -716 -694 -676 -658 -642 -627 -620 -657 -695 -688 -662 -635 -659 -682 -696 -709 -723 -736 -762 -788 -813 -839 -816 -794
7804g94P3P3N0Ok3k2M5M6M5M6N7N8N8N8OOOOM3M4R6R5J07J06N5N4J10J11J10J11J39J39K16
$$ -794 -721 -648 -598 -592 -615 -637 -592 -546 -501 -455 -398 -340 -282 -224 -218 -212 -206 -200 -157 -113 -17 78 185 291 346 400 510 621 731 842 981 1120 1336
7789A336L05L99M52N09O67Q52J046J277J682K299L056L907M804N225M328J707j725m393n362
$$ 1336 1641 2040 2492 3001 3668 4520 5566 6843 8525 10824 13880 17787 22591 27816 32144 33851 32126 27733 22371
7781B2371m865l861k973k251j630j226r87p93n92m35l70l18k44j91j84j83n7n7qpM5R8P0j7
$$ 22371 17506 13645 10672 8421 6791 5565 4578 3785 3193 2758 2388 2070 1826 1635 1451 1268 1211 1154 1146 1139 1184 1282 1352 1335
7771A335j06j94k04j52r9r9r6r6r5r6m7m8P6P6N3N2N3N2L6L6L6L6J07J06J06J06J24J24K47
$$ 1335 1229 1035 831 679 580 481 385 289 194 98 51 3 79 155 208 260 313 365 401 437 473 509 616 722 828 934 1058 1182 1429
7758A429K47L04L04L73M25N10O68Q56J084J402J913K555L311M227N125N303L877P76k726n036
$$ 1429 1676 1980 2284 2657 3082 3592 4260 5116 6200 7602 9515 12070 15381 19608 24733 30036 33913 34689 31963 26927
7749B6927n511m776l738k816k095j538j169r22p28n35m12l60k72k11k11j53j53j27j28j27
$$ 26927 21416 16640 12902 10086 7991 6453 5284 4362 3634 3099 2687 2327 2055 1844 1633 1480 1327 1200 1072 945
7741I45j27j23j23p0p0RQQQjkkjj7j7j7j8%%%jJ1J1R9R8J09J09N6N5J04J03J03J03K13K13
$$ 945 818 695 572 502 432 441 449 457 465 464 462 460 459 442 425 408 390 390 390 390 389 400 411 510 608 717 826 882 937 1041 1144 1247 1350 1563 1776
7725A776K46L50L91M43N30P06R67J213J560K089K760L569M458N197M945L008l38l542n243
$$ 1776 2022 2372 2763 3206 3736 4442 5409 6622 8182 10271 13031 16600 21058 26255 31200 34208 33870 30328 25085
7717B5085n244m336l385k597j928j409j093r01p24n58m52l85k79k08k08j44j44r0r1p7p7p7
$$ 25085 19841 15505 12120 9523 7595 6186 5093 4192 3468 2910 2458 2073 1794 1586 1378 1234 1090 1000 909 832 755 678
7708F78p7o9o8o8o9j10j09k2k2pqpqJ2J2J1J2%JJ%nnonk9l0k9k9KKKKm5m5m5m5o0n9poK3K3
$$ 678 601 532 464 396 327 217 108 86 64 57 49 42 34 46 58 69 81 81 82 83 83 78 73 67 62 33 3 -26 -55 -53 -51 -49 -47 -92 -137 -182 -227 -287 -346 -353 -359 -336 -313
7689c13K3K3l0k9l0l0j3j3j3j3N9N9L0j5m8p5o3o3QQQQL8L8J3l1m0LK9K9kjjkL2L3L2L2l8
$$ -313 -290 -267 -297 -326 -356 -386 -399 -412 -425 -438 -379 -320 -290 -305 -353 -428 -491 -554 -546 -538 -530 -522 -484 -446 -433 -464 -504 -501 -472 -443 -445 -446 -447 -449 -417 -384 -352 -320 -358
7672c58l9J5J4RRm5m4m0m1k3m9o1j8M4M4M2M3j1j0ononj9j9j6j6l9ON2P8P9N2Nl9n1n1n4n4
$$ -358 -397 -382 -368 -359 -350 -395 -439 -479 -520 -543 -592 -653 -671 -627 -583 -541 -498 -509 -519 -525 -530 -536 -541 -560 -579 -595 -611 -650 -644 -592 -514 -435 -383 -378 -417 -468 -519 -573 -627
7655f27l8l8k0m7o1j8O5R0O9O9P1P0PPQPK1K2l2l1o9o8o9o8o1o2l3J1M1M2M4M4J7J7l6l6j6
$$ -627 -665 -703 -723 -770 -831 -849 -784 -694 -625 -556 -485 -415 -408 -401 -393 -386 -365 -343 -375 -406 -475 -543 -612 -680 -741 -803 -836 -825 -784 -742 -698 -654 -637 -620 -656 -692 -708
7639g08j6L6L7J0J1J0J0J2J2J2J2J8J9J9J8j3j3j4j3ppop%%%%L8L7L8L7l0l1l1l0j6j5j5j6
$$ -708 -724 -688 -651 -641 -630 -620 -610 -598 -586 -574 -562 -544 -525 -506 -488 -501 -514 -528 -541 -548 -555 -561 -568 -568 -568 -568 -568 -530 -493 -455 -418 -448 -479 -510 -540 -556 -571 -586 -602
7622f02k1k1k1k2j2j3M1M0P5P4N1jm3m2k0k0K4K4k6k6KN5N5Lp9p9k7K6K7k6m5m6l3l2L7O3
$$ -602 -623 -644 -665 -687 -699 -712 -671 -631 -556 -482 -431 -432 -475 -517 -537 -557 -533 -509 -535 -561 -559 -504 -449 -446 -525 -604 -631 -605 -578 -604 -649 -695 -728 -760 -723 -660
7607f60O4J0j1j0MML0L1L5L6j8j7j7j8j7j7m0m0m0m1MMMMMMPPJ6O9N2K6j1l7k5k4k2k3m6m6
$$ -660 -596 -586 -597 -607 -603 -599 -569 -538 -503 -467 -485 -502 -519 -537 -554 -571 -611 -651 -691 -732 -728 -724 -720 -716 -712 -708 -701 -694 -678 -609 -557 -531 -542 -579 -604 -628 -650 -673 -719 -765
7589g65k1L2N5N5J0Rm3m3l5l5J8J8M0M0J4J3RJ0RRk1k0NOJ7J8l6l5n3n2J%j1j2j2j1j1j1N9
$$ -765 -786 -754 -699 -644 -634 -625 -668 -711 -746 -781 -763 -745 -705 -665 -651 -638 -629 -619 -610 -601 -622 -642 -637 -631 -614 -596 -632 -667 -720 -772 -771 -771 -782 -794 -806 -817 -828 -839 -780
7572g80Q5O7J3qqQRj0o4n7lN1N1J9J8M5M5M8M7M5M4K2l1o9m3nnl0l0m4m4m5m4j4j4j4j4l5
$$ -780 -695 -628 -615 -623 -631 -623 -614 -624 -688 -745 -748 -697 -646 -627 -609 -564 -519 -471 -424 -379 -335 -313 -344 -413 -456 -461 -466 -496 -526 -570 -614 -659 -703 -717 -731 -745 -759 -794
7556g94l5J7J8M7M7K1K1K0K0oorrqrQPPQJ8J8J9J8QPQPl5l5l2l2nM9O8O8J7l6p2m6j2J4JJ
$$ -794 -829 -812 -794 -747 -700 -679 -658 -638 -618 -624 -630 -639 -648 -656 -665 -657 -650 -643 -635 -617 -599 -580 -562 -554 -547 -539 -532 -567 -602 -634 -666 -671 -622 -554 -486 -469 -505 -577 -623 -635 -621 -620 -619
7537f19J1J0J0J1QRQRj7j6J8M5N1jp3j00n1L6O8J5k8k8l2l1NNNNK4K3K4K3qrl6l5o8o9m2J1
$$ -619 -608 -598 -588 -577 -569 -560 -552 -543 -560 -576 -558 -513 -462 -463 -536 -636 -687 -651 -583 -568 -596 -624 -656 -687 -682 -677 -672 -667 -643 -620 -596 -573 -581 -590 -626 -661 -729 -798 -840 -829
7520h29N2J05J08N6J2J2m5m4l7l8j6L7N2K6Ok0l4l3l5l5K8K9K8K9j8j8j8j7jjjjJ6J5J2J3
$$ -829 -777 -672 -564 -508 -496 -484 -529 -573 -610 -648 -664 -627 -575 -549 -543 -563 -597 -630 -665 -700 -672 -643 -615 -586 -604 -622 -640 -657 -658 -659 -660 -661 -645 -630 -618 -605
7504f05jn4p4p3j7L7N9O0M9M9N0M9m2m2m2m2qqqrK1K1m8p6o3j1M7M6M4M4j1o4p1j7KKK8K7
$$ -605 -606 -660 -734 -807 -824 -787 -728 -668 -619 -570 -520 -471 -513 -555 -597 -639 -647 -655 -663 -672 -651 -630 -678 -754 -817 -828 -781 -735 -691 -647 -658 -722 -793 -810 -808 -806 -778 -751
7488g51P8P7K7k5m9m8k6k5k6k5J7J7J7J7O3O2O2O2j7j7q4j11r0kO8O7N0km2o9m9MM2O9K7k7
$$ -751 -673 -596 -569 -594 -643 -691 -717 -742 -768 -793 -776 -759 -742 -725 -662 -600 -538 -476 -493 -510 -594 -705 -795 -797 -729 -662 -612 -614 -656 -725 -774 -770 -728 -659 -632 -659
7472f59j0J7PPRRj2j2o1o1%N4L9J2J%jjpppoMMq4q4n3n3%%L5L4L5L5klN0N0QQRRL2N9O7K3
$$ -659 -669 -652 -645 -638 -629 -620 -632 -644 -705 -766 -766 -712 -673 -661 -660 -660 -661 -662 -669 -676 -683 -689 -685 -681 -765 -849 -902 -955 -955 -955 -920 -886 -851 -816 -818 -821 -771 -721 -713 -705 -696 -687 -655 -596 -529 -506
7452e06l6o2o4l7QL5K2K1lmlml3l3N5N5K6K6K6K6K3K4k9k9l9l8l9l8j4j3j3j4LLKLk3k3k2
$$ -506 -542 -604 -668 -705 -697 -662 -640 -619 -622 -626 -629 -633 -666 -699 -644 -589 -563 -537 -511 -485 -462 -438 -467 -496 -535 -573 -612 -650 -664 -677 -690 -704 -701 -698 -696 -693 -716 -739 -761
7435g61k3l4l4oL8N2N2N4N5RQRQk9k9OL2K1k4n0m9rqrqOPPPk2k1k2k2L7L7L7L7MMMML1L2L2
$$ -761 -784 -818 -852 -858 -820 -768 -716 -662 -607 -598 -590 -581 -573 -602 -631 -625 -593 -572 -596 -646 -695 -704 -712 -721 -729 -723 -716 -709 -702 -724 -745 -767 -789 -752 -715 -678 -641 -637 -633 -629 -625 -594 -562 -530
7416e30L1KJj6J0J4l1n7n7k2k3k2k2J3J3l9m0opopk9k9K4K3K4K4K3K4O0O0L7j6l3l3l7l7o
$$ -530 -499 -497 -496 -512 -502 -488 -519 -576 -633 -655 -678 -700 -722 -709 -696 -735 -775 -781 -788 -794 -801 -830 -859 -835 -812 -788 -764 -741 -717 -657 -597 -560 -576 -609 -642 -679 -716 -722
7400g22opoJ6J5l3l4k2L1N4N4QQQQk9k9K4K3k6k6k6k5n5n4n4n4L1L2L1L2N3N3N2N3pqqqn9
$$ -722 -728 -735 -741 -725 -710 -743 -777 -799 -768 -714 -660 -652 -644 -636 -628 -657 -686 -662 -639 -665 -691 -717 -742 -797 -851 -905 -959 -928 -896 -865 -833 -780 -727 -675 -622 -629 -637 -645 -653 -712
7383g12o0opj2j2L7L7N4Kn7n7n3n4NN8M2M1M2M2j8p1m0m1K3K3K3K3K4K3K3K3jjkjnoM7M8J8
$$ -712 -772 -778 -785 -797 -809 -772 -735 -681 -679 -736 -793 -846 -900 -895 -837 -795 -754 -712 -670 -688 -759 -799 -840 -817 -794 -771 -748 -724 -701 -678 -655 -656 -657 -659 -660 -665 -671 -624 -576 -558
7365e58J9l4l4J4J3J3J4o2o2l9J4L4L5j5j4j3j3j3j2k3k3n2%P6P6K6K6lmlll8l8l8l8j8j8
$$ -558 -539 -573 -607 -593 -580 -567 -553 -615 -677 -716 -702 -668 -633 -648 -662 -675 -688 -701 -713 -736 -759 -811 -811 -735 -659 -633 -607 -610 -614 -617 -620 -658 -696 -734 -772 -790 -808
7349h08j8j8j8j7j7j8L4L3L3L4llmlL0L0L0L0rrrrl9l8J4J4K0K1J9J9M1J5l2p7q1n6l3pL0
$$ -808 -826 -844 -862 -879 -896 -914 -880 -847 -814 -780 -783 -786 -790 -793 -763 -733 -703 -673 -682 -691 -700 -709 -748 -786 -772 -758 -738 -717 -698 -679 -638 -623 -655 -732 -813 -869 -902 -909 -879
7332h79N6M3M3M9M9K0k3m9n0JJL4L4L4L3l1l1l1l1J4J4J4J3L1L0K8K7J7k7n5n5rrrj0qqM4
$$ -879 -823 -780 -737 -688 -639 -619 -642 -691 -741 -740 -739 -705 -671 -637 -604 -635 -666 -697 -728 -714 -700 -686 -673 -642 -612 -584 -557 -540 -567 -622 -677 -686 -695 -704 -714 -722 -730 -686
7316f86M5jj%jj5j6j5j6j5j6L7L8N2N3J2j5m7r1r3m8J4J4J6J7N3N3%%JKJJkkkkK1K0K0K0N
$$ -686 -641 -642 -643 -643 -644 -659 -675 -690 -706 -721 -737 -700 -662 -610 -557 -545 -560 -607 -698 -791 -839 -825 -811 -795 -778 -725 -672 -672 -672 -671 -669 -668 -667 -669 -671 -673 -675 -654 -634 -614 -594 -589
7298e89NMN%j%%ppppl5l5l4l5m6m7m6m6J5J5M1M1POO0N9L1L1k1k2K5K6M9N0nm8o2l5oL8L0
$$ -589 -584 -580 -575 -575 -576 -576 -576 -583 -590 -597 -604 -639 -674 -708 -743 -789 -836 -882 -928 -913 -898 -857 -816 -809 -803 -743 -684 -653 -622 -643 -665 -640 -614 -565 -515 -520 -568 -630 -665 -671 -633 -603
7279f03Mk7k6k8k8l0l1k8J5N1N2K5j8n1n2RN3O2O3J2J3kkk8k8l8l8j2j2M9M8nmk5k4m9m8n2
$$ -603 -599 -626 -652 -680 -708 -738 -769 -797 -782 -731 -679 -654 -672 -723 -775 -766 -713 -651 -588 -576 -563 -565 -567 -595 -623 -661 -699 -711 -723 -674 -626 -631 -635 -660 -684 -733 -781 -833
7263h33qM0O7P1P2P3P2L8L7n1n1l4l4pqooooj0j0j0j0k9k9k9k8j4j4L9L9P1P0M3km3m2PPJ9
$$ -833 -841 -801 -734 -663 -591 -518 -446 -408 -371 -422 -473 -507 -541 -548 -556 -562 -568 -574 -580 -590 -600 -610 -620 -649 -678 -707 -735 -749 -763 -724 -685 -614 -544 -501 -503 -546 -588 -581 -574 -555
7246e55K0J9K0j0j0o2o2l5l5J8J8N8N8NNl0l0p9q0j9L3O8M2ro3o4j1L6L5j4j5K7K7K7K7k1
$$ -555 -535 -516 -496 -506 -516 -578 -640 -675 -710 -692 -674 -616 -558 -553 -548 -578 -608 -687 -767 -786 -753 -685 -643 -652 -715 -779 -790 -754 -719 -733 -748 -721 -694 -667 -640 -661
7230f61k1m4m4m1J3L5L6K8K8K8K8M3M2M3M3j8j8m4m4k3k3L0L0N4N4JJm9m9p2p2k2L1N4N3J1
$$ -661 -682 -726 -770 -811 -798 -763 -727 -699 -671 -643 -615 -572 -530 -487 -444 -462 -480 -524 -568 -591 -614 -584 -554 -500 -446 -445 -444 -493 -542 -614 -686 -708 -677 -623 -570 -559
7214e59J0m3m2k6k6K8K7K5K5K5K4k6k7k6k6RJ0J0J0pom1o7n1K%JjN2Q7O1j1o3n0k4j5j5j0
$$ -559 -549 -592 -634 -660 -686 -658 -631 -606 -581 -556 -532 -558 -585 -611 -637 -628 -618 -608 -598 -605 -611 -652 -719 -770 -768 -768 -767 -768 -716 -629 -568 -579 -642 -692 -716 -731 -746 -756
7198g56j0%N2K3K3OPOOk1k1j8j8k8K4M8M8LLK9K9K4K4k9k9m6m6m7m6J3J2J2J2k4k4K8K9mn
$$ -756 -766 -766 -714 -691 -668 -662 -655 -649 -643 -664 -685 -703 -721 -749 -725 -677 -629 -626 -623 -594 -565 -541 -517 -546 -575 -621 -667 -714 -760 -747 -735 -723 -711 -735 -759 -731 -702 -706 -711
7181g11mn%%M7M8m0j29j04n3K0P2P5K3j3j3j6j6J5J4J5J5MNMNO5O5J2J2j4j4j4j5L1L1L1L1
$$ -711 -715 -720 -720 -720 -673 -625 -665 -794 -898 -951 -931 -859 -784 -761 -774 -787 -803 -819 -804 -790 -775 -760 -756 -751 -747 -742 -677 -612 -600 -588 -602 -616 -630 -645 -614 -583 -552 -521
7165e21l0k9l0l0k9l0l0k9L2L2L2L1K9K9K5K5Om7p0p0m4m3m4m4L3L3L3L3N5N5N5N5l0l0l1
$$ -521 -551 -580 -610 -640 -669 -699 -729 -758 -726 -694 -662 -631 -602 -573 -548 -523 -517 -564 -634 -704 -748 -791 -835 -879 -846 -813 -780 -747 -692 -637 -582 -527 -557 -587 -618
7149f18l0MLMMppM5M6J2J3J2J3OOm7m7l9l9l9m0k8k9k9k8J1J0J1J1llmlK4K4P4P4Nm8j8j8
$$ -618 -648 -644 -641 -637 -633 -640 -647 -602 -556 -544 -531 -519 -506 -500 -494 -541 -588 -627 -666 -705 -745 -773 -802 -831 -859 -848 -838 -827 -816 -819 -822 -826 -829 -805 -781 -707 -633 -628 -676 -694 -712
7132g12mnnmK5K6K6K6rqqrJ1J1m1m2n9n8%N3P6P6Q0P9NNNMl2l2j3M1M7ok6k5nmnml9l8l9l9
$$ -712 -716 -721 -726 -730 -705 -679 -653 -627 -636 -644 -652 -661 -650 -639 -680 -722 -781 -839 -839 -786 -710 -634 -554 -475 -470 -465 -460 -456 -488 -520 -533 -492 -445 -451 -477 -502 -507 -511 -516 -520 -559 -597 -636 -675
7113f75o0o1p2m6kN2P6P6L3L3L3L3K6K6k6k7m4m5m4m5l7l8J5J5JJJJj5j4j5j4j4j3L9L9N8
$$ -675 -735 -796 -868 -914 -916 -864 -788 -712 -679 -646 -613 -580 -554 -528 -554 -581 -625 -670 -714 -759 -796 -834 -819 -804 -803 -802 -801 -800 -815 -829 -844 -858 -872 -885 -846 -807 -749
7097g49N8L5j8j8j7j9j9o4l7L8R1M8nJ3L9O2O2Om8k7k7l0l0j4j4j3j4K1K1K1K1k3k4k4k4m0
$$ -749 -691 -656 -674 -692 -709 -728 -747 -811 -848 -810 -719 -671 -676 -663 -624 -562 -500 -494 -542 -569 -596 -626 -656 -670 -684 -697 -711 -690 -669 -648 -627 -650 -674 -698 -722 -762
7081g62l9J3J4K3K3K4K3OOONk5k5k4k5K8K8K5K5J9k5o1o2lmM1M0J8J8m4m3RJ0RRm4m5m4m5
$$ -762 -801 -788 -774 -751 -728 -704 -681 -675 -669 -663 -658 -683 -708 -732 -757 -729 -701 -676 -651 -632 -657 -718 -780 -783 -787 -746 -706 -688 -670 -714 -757 -748 -738 -729 -720 -764 -809 -853 -898
7064h98k7k8N0N0M3J7MM9O0J6j8j8J3J4J4J4mmmmj0j1j0j1J0J0K2nn2r7r6n2KK9LL0P9J06
$$ -898 -925 -953 -903 -853 -810 -793 -789 -740 -680 -664 -682 -700 -687 -673 -659 -645 -649 -653 -657 -661 -671 -682 -692 -703 -693 -683 -661 -666 -718 -815 -911 -963 -961 -932 -929 -899 -820 -714
7048g14R3R2P7P6J5J5l2l2l2l2l5l6l5l6k0k0j7j7QN3M3J6mmook7k8QN2O1L4lm7o8o9k6L5
$$ -714 -621 -529 -452 -376 -361 -346 -378 -410 -442 -474 -509 -545 -580 -616 -636 -656 -673 -690 -682 -629 -586 -570 -574 -578 -584 -590 -617 -645 -637 -585 -524 -490 -493 -540 -608 -677 -703 -668
7031f68Q2Q3L4j0j4J3J0j6m7m6m8m8nnoopl4m3JK9K8j2j3j4j5J2J3O5O6J6l7n0n1n4n3p0p0
$$ -668 -586 -503 -469 -479 -493 -480 -470 -486 -533 -579 -627 -675 -680 -685 -691 -697 -704 -738 -781 -780 -751 -723 -735 -748 -762 -777 -765 -752 -687 -621 -605 -642 -692 -743 -797 -850 -920 -990
7015i90k1L2O1O0L7L8L6L6qqk3k4KLM9M9M9M9J5J4m7m7l6l6j0rJ5J5J5J5opK0K0O5O5K2K1
$$ -990 -1011 -979 -918 -858 -821 -783 -747 -711 -719 -727 -750 -774 -772 -769 -720 -671 -622 -573 -558 -544 -591 -638 -674 -710 -720 -729 -714 -699 -684 -669 -675 -682 -662 -642 -577 -512 -490 -469
6998d69RQj8j8l9l9l9l9j4j3j3j4J8J8J8J8l1l1n4n4l2K1N3N4M7M7Jn2p6k4L7L8J2m1n5n6
$$ -469 -460 -452 -470 -488 -527 -566 -605 -644 -658 -671 -684 -698 -680 -662 -644 -626 -657 -688 -742 -796 -828 -807 -754 -700 -653 -606 -605 -657 -733 -757 -720 -682 -670 -711 -766 -822
6982h22%jj%mlM1M0J6J6J6J6%J%%J4J4J4J4j0j0L4L4K4K4kkn1n0n0n0m7m7m7m7j%P9P9P9P8
$$ -822 -822 -823 -824 -824 -828 -831 -790 -750 -734 -718 -702 -686 -686 -685 -685 -685 -671 -657 -643 -629 -639 -649 -615 -581 -557 -533 -535 -537 -588 -638 -688 -738 -785 -832 -879 -926 -927 -927 -848 -769 -690 -612
6964f12%%L3L4L3L4nmon0j17j16o6mN6N6L2j2l0l0n7n7n4j1J8J8%%N3N3M3M4M0M0L3j2m0m0
$$ -612 -612 -612 -579 -545 -512 -478 -483 -487 -493 -543 -660 -776 -842 -846 -790 -734 -702 -714 -744 -774 -831 -888 -942 -953 -935 -917 -917 -917 -864 -811 -768 -724 -684 -644 -611 -623 -663 -703
6948g03J8J9M4M5NMMNm5m4m5m5ppopK3K3K3K4k9l0klK2K2P2P2M2kk9l0l0l0llN1N2N2N1l6
$$ -703 -685 -666 -622 -577 -572 -568 -564 -559 -604 -648 -693 -738 -745 -752 -758 -765 -742 -719 -696 -672 -701 -731 -733 -736 -714 -692 -620 -548 -506 -508 -537 -567 -597 -627 -630 -633 -582 -530 -478 -427 -463
6930d63l7l7l7l4l4l4l4J7J7l5l6KKK9K8mnl1l1ooM4M4j6o0n0k3KKMMQQO1O1O2O2RRkjjkK0
$$ -463 -500 -537 -574 -608 -642 -676 -710 -693 -676 -711 -747 -745 -743 -714 -686 -690 -695 -726 -757 -763 -769 -725 -681 -697 -757 -807 -830 -828 -826 -822 -818 -810 -802 -741 -680 -618 -556 -547 -538 -540 -541 -542 -544 -524
6911e24J9ppk5k4p7p8m3m4j4j4J9P2Q3N7K7K7jko1o2o2o2J2J2J1J2j6j5j6j6n5n5MN6O8O7
$$ -524 -505 -512 -519 -544 -568 -645 -723 -766 -810 -824 -838 -819 -747 -664 -607 -580 -553 -554 -556 -617 -679 -741 -803 -791 -779 -768 -756 -772 -787 -803 -819 -874 -929 -925 -869 -801 -734
6895g34M4M4J2J1j5j5J3J2ro1o3l7kkKJN5N5M6M7opl0k9mlK4K4K5K4ppppj3j4j3j3NNk1k1
$$ -734 -690 -646 -634 -623 -638 -653 -640 -628 -637 -698 -761 -798 -800 -802 -800 -799 -744 -689 -643 -596 -602 -609 -639 -668 -672 -675 -651 -627 -602 -578 -585 -592 -599 -606 -619 -633 -646 -659 -654 -649 -670 -691
6877f91j9j9L3L2N0K4n2j05p1j9K0M6K5%j1j0%%N2N3Q8Q7K9k3k2k1k4k5l3l3l3l4%Jk0p3p0
$$ -691 -710 -729 -696 -664 -614 -590 -642 -747 -818 -837 -817 -771 -746 -746 -757 -767 -767 -767 -715 -662 -574 -487 -458 -481 -503 -524 -548 -573 -606 -639 -672 -706 -706 -705 -725 -798 -868
6861h68j8L7L7L0L1N7N8K1K1onj8j7j7j7j2j2j3j2%%%%%%%%L7L7L7L7M7M7ook5k4k5k4k2k1
$$ -868 -886 -849 -812 -782 -751 -694 -636 -615 -594 -600 -605 -623 -640 -657 -674 -686 -698 -711 -723 -723 -723 -723 -723 -723 -723 -723 -723 -686 -649 -612 -575 -528 -481 -487 -493 -518 -542 -567 -591 -613 -634
6843f34k2k1j7j8j7j8K9K9K8K9ONOOnnonJ6J6J7J6l0l0l0l0K1K2K1K2k5k4k7k6l8o4p9k6L8
$$ -634 -656 -677 -694 -712 -729 -747 -718 -689 -661 -632 -626 -621 -615 -609 -614 -619 -625 -630 -614 -598 -581 -565 -595 -625 -655 -685 -664 -642 -621 -599 -624 -648 -675 -701 -739 -803 -882 -908 -870
6826h70L8M1M1L9L9J8l5m4j7J8J8K6K6Nm8o5l9L1L1mmnmM0M0M0L9J4J4l8l9j6j6j6j5pppo
$$ -870 -832 -791 -750 -711 -672 -654 -689 -733 -750 -732 -714 -688 -662 -657 -705 -770 -809 -778 -747 -751 -755 -760 -764 -724 -684 -644 -605 -591 -577 -615 -654 -670 -686 -702 -717 -724 -731 -738 -744
6809g44j9j9JN4R0L8j7j7j8j9j8j8l4l3l3l3j2j3M1M0MNMMM4M4K0l2m0m0J0RM5M5M4M5j3j2
$$ -744 -763 -782 -781 -727 -637 -599 -616 -633 -651 -670 -688 -706 -740 -773 -806 -839 -851 -864 -823 -783 -779 -774 -770 -766 -722 -678 -658 -690 -730 -770 -760 -751 -706 -661 -617 -572 -585 -597
6793e97j0j0k2K3Q3Q2O0J6l2n9m6m7m8m9K2K1K1K1l3l4l4l4qrl5RK4mJ5J5kjjkjjjkl2l3l0
$$ -597 -607 -617 -639 -616 -533 -451 -391 -375 -407 -466 -512 -559 -607 -656 -634 -613 -592 -571 -604 -638 -672 -706 -714 -723 -758 -749 -725 -729 -714 -699 -701 -702 -703 -705 -706 -707 -708 -710 -742 -775 -805
6775h05k9K2O6M2M2K6K5K6K6k0k1k0k0OOOOLLKLo3o3l6RJ0RJ2J2noonNNONLMLLK0J9K0K0N2
$$ -805 -834 -812 -746 -704 -662 -636 -611 -585 -559 -579 -600 -620 -640 -634 -628 -622 -616 -613 -610 -608 -605 -668 -731 -767 -758 -748 -739 -727 -715 -720 -726 -732 -737 -732 -727 -721 -716 -713 -709 -706 -703 -683 -664 -644 -624 -572
6755e72N1%jRJ0j6o0m5jj2l9k4KJk6m9m8J1N5L8J1K9K9nmnnmnmnK1K2K1K1J2J2J1J2J8J7k6
$$ -572 -521 -521 -522 -513 -503 -519 -579 -624 -625 -637 -676 -700 -698 -697 -723 -772 -820 -809 -754 -716 -705 -676 -647 -652 -656 -661 -666 -670 -675 -679 -684 -663 -641 -620 -599 -587 -575 -564 -552 -534 -517 -543
6737e43k7m1m1j4j4J8J8J9J8k1k2k2k2J9J8J9J8j9j9j9j9L1L1L0L1j7j8j7j7J6J6j0j0rj0
$$ -543 -570 -611 -652 -666 -680 -662 -644 -625 -607 -628 -650 -672 -694 -675 -657 -638 -620 -639 -658 -677 -696 -665 -634 -604 -573 -590 -608 -625 -642 -626 -610 -620 -630 -639 -649
6722f49L4L5N9N8j8j9mK3Ql5n4k8J7J6rqrrl0l0J4J4J2J3l2l2KKk4k5J2J2J4J3rJ7K7j7o8
$$ -649 -615 -580 -521 -463 -481 -500 -504 -481 -473 -508 -562 -590 -573 -557 -566 -574 -583 -592 -622 -652 -638 -624 -612 -599 -631 -663 -661 -659 -683 -708 -696 -684 -670 -657 -666 -649 -622 -639 -707
6705g07o7k7k6ONM7M7L2j1l1l1J5J5J6J5JK%jj6m2n1pN1P7M6Kj9j9k1k2j6j6j6j6n4n3n2p
$$ -707 -774 -801 -827 -821 -816 -769 -722 -690 -701 -732 -763 -748 -733 -717 -702 -701 -699 -699 -700 -716 -758 -809 -816 -765 -688 -642 -640 -659 -678 -699 -721 -737 -753 -769 -785 -839 -892 -944 -951
6688i51L6L5Km2n8n7j1M2O8O8P2P1M8M7j4j4lmlmL6L5L6L6kkkkj8j8j7j8m7m6m6m7jkjkL7
$$ -951 -915 -880 -878 -920 -978 -1035 -1046 -1004 -936 -868 -796 -725 -677 -630 -644 -658 -661 -665 -668 -672 -636 -601 -565 -529 -531 -533 -535 -537 -555 -573 -590 -608 -655 -701 -747 -794 -795 -797 -798 -800 -763
6670g63L7K3l0m3m3k1k0LKKLKLM6M7K9K9j4j5k2k2K2K2O7O8O4O5J4l9p0p1j9j9k0j9J6J6J6
$$ -763 -726 -703 -733 -776 -819 -840 -860 -857 -855 -853 -850 -848 -845 -799 -752 -723 -694 -708 -723 -745 -767 -745 -723 -656 -588 -524 -459 -445 -484 -554 -625 -644 -663 -683 -702 -686 -670 -654
6653f54J5J%J%poppOOOOk3k2MNM2M2J0m2p5p5j1M2L2L2L6L6K6K6j8j8p2p3k2K9N7N6j9k0k5
$$ -654 -639 -638 -638 -637 -637 -644 -650 -657 -664 -658 -652 -646 -640 -663 -685 -681 -676 -634 -592 -582 -624 -699 -774 -785 -743 -711 -679 -643 -607 -581 -555 -573 -591 -663 -736 -758 -729 -672 -616 -635 -655 -680
6635f80k5k5k5rrnom0J2K7K6k6k6k7k6J5J6R2R2Q9L5l1l1l2l2nojjjjJJ%JnonoppN4N5KKK
$$ -680 -705 -730 -755 -764 -773 -778 -784 -824 -812 -785 -759 -785 -811 -838 -864 -849 -833 -741 -649 -560 -525 -556 -587 -619 -651 -656 -662 -663 -664 -665 -666 -665 -664 -664 -663 -668 -674 -679 -685 -692 -699 -645 -590 -588 -586 -584
6615e84KJ6J6o3o3o4o5k0k0J9J8J8J9%j%%L2L3L3L3KLLL%jL0k4m3m4m6m7QRQRK5K6K5K6J3
$$ -584 -582 -566 -550 -613 -676 -740 -805 -825 -845 -826 -808 -790 -771 -771 -772 -772 -772 -740 -707 -674 -641 -639 -636 -633 -630 -630 -631 -601 -625 -668 -712 -758 -805 -797 -788 -780 -771 -746 -720 -695 -669 -656
6597f56J4N4N4J4l9n4n3j4j3j4j4J6J6J6J5j2j3j3j3k5k4k5k5l6l5l6l6L4L3L3L4K2K2K3K2
$$ -656 -642 -588 -534 -520 -559 -613 -666 -680 -693 -707 -721 -705 -689 -673 -658 -670 -683 -696 -709 -734 -758 -783 -808 -844 -879 -915 -951 -917 -884 -851 -817 -795 -773 -750 -728
6582g28J7J8J7J7k0k0k0k0j1j1j1j1K2K2K2K2j2j2j2j2M7M8M7M8J0J1J1J0k0k0OOm2m2oL7
$$ -728 -711 -693 -676 -659 -679 -699 -719 -739 -750 -761 -772 -783 -761 -739 -717 -695 -707 -719 -731 -743 -696 -648 -601 -553 -543 -532 -521 -511 -531 -551 -545 -539 -581 -623 -629 -592
6566e92O5L8Qj9n2p8p7n1j7K6J6j0n0p8m5%K7K7j4j4llN6N5L1j4l3l3LKKLK5K6j8j8KLK8K9
$$ -592 -527 -489 -481 -500 -552 -630 -707 -758 -775 -749 -733 -743 -793 -871 -916 -916 -889 -862 -876 -890 -893 -896 -840 -785 -754 -768 -801 -834 -831 -829 -827 -824 -799 -773 -791 -809 -807 -804 -776 -747
6549g47rrrrj1j1j1j2L7L7pl2k5L7O3O2K3K3lmn4n3n4n3m5m4L5L5L7L6k4k5k0k0POM0M0L9
$$ -747 -756 -765 -774 -783 -794 -805 -816 -828 -791 -754 -761 -793 -818 -781 -718 -656 -633 -610 -613 -617 -671 -724 -778 -831 -876 -920 -885 -850 -813 -777 -801 -826 -846 -866 -859 -853 -813 -773 -734
6532g34M0nnnnk7k7k6k5K5N2O1J8KLj%K6K6N1N1M9K4j7o0q2q1m0m0llM1M1M5M6JJnnK1K1l
$$ -734 -694 -699 -704 -709 -714 -741 -768 -794 -819 -794 -742 -681 -663 -661 -658 -659 -659 -633 -607 -556 -505 -456 -432 -449 -509 -591 -672 -712 -752 -755 -758 -717 -676 -631 -585 -584 -583 -588 -593 -572 -551 -554
6514e54mllk6k6k6k6rrj0rL9L8ooj4j4j4j4j7j8j7j7j8j8K6K6J9J8J8J7k0m7n6j3LLL2L2M0
$$ -554 -558 -561 -564 -590 -616 -642 -668 -677 -686 -696 -705 -666 -628 -634 -640 -654 -668 -682 -696 -713 -731 -748 -765 -783 -801 -775 -749 -730 -712 -694 -677 -697 -744 -800 -813 -810 -807 -775 -743 -703
6497g03M0l6l6j8K5M5M5L3L4L3L4J3J3J1J0J4l0n0m9m6m6p0k5L9O6O5L9J0l4p3p3m3m3m2m3
$$ -703 -663 -699 -735 -753 -728 -683 -638 -605 -571 -538 -504 -491 -478 -467 -457 -443 -473 -523 -572 -618 -664 -734 -759 -720 -654 -589 -550 -540 -574 -647 -720 -763 -806 -848 -891
6481h91j7j7O3O2N9N9lkk0k0j7j8j7K7P7P7N6nl2l3k5k5k6k5l7l7o0j6O1Q8Q8O2J6j0k7n2
$$ -891 -908 -925 -862 -800 -741 -682 -685 -687 -707 -727 -744 -762 -779 -752 -675 -598 -542 -547 -579 -612 -637 -662 -688 -713 -750 -787 -847 -863 -802 -714 -626 -564 -548 -558 -585 -637
6466f37o0n9oL7K4K4j8j7pon1n0n0n0noN1N2K5K5J9J9k5k5NMNNrrj0rl3l3l3l4QQQQL1L1L0
$$ -637 -697 -756 -762 -725 -701 -677 -695 -712 -719 -725 -776 -826 -876 -926 -931 -937 -886 -834 -809 -784 -765 -746 -771 -796 -791 -787 -782 -777 -786 -795 -805 -814 -847 -880 -913 -947 -939 -931 -923 -915 -884 -853 -823
6447h23L1L3L4P4P5M4rm1m0j6j6K8K8k3k4m9n0j0j0j1j0K5K5K5K6M8M7M8M8J3J3l2l1p1p0
$$ -823 -792 -759 -725 -651 -576 -532 -541 -582 -622 -638 -654 -626 -598 -621 -645 -694 -744 -754 -764 -775 -785 -760 -735 -710 -684 -636 -589 -541 -493 -480 -467 -499 -530 -601 -671
6432f71m0J3K6%m0m0NN7Q5N9J1j5k8k8jjK5K5opopopppm0l9m0m0J8J9J8J9O1O1J4m0o1l4k6
$$ -671 -711 -698 -672 -672 -712 -752 -747 -690 -605 -546 -535 -550 -578 -606 -607 -608 -583 -558 -564 -571 -577 -584 -590 -597 -604 -611 -651 -690 -730 -770 -752 -733 -715 -696 -635 -574 -560 -600 -661 -695 -721
6414g21k6m1m1L6L7K7%J1O3P3M6Jk6m9m8n0n0rrrrRQRRM0M0N5K8l2l3l4l5l7l8qJ8M4M5M6
$$ -721 -747 -788 -829 -793 -756 -729 -729 -718 -655 -582 -536 -535 -561 -610 -658 -708 -758 -767 -776 -785 -794 -785 -777 -768 -759 -719 -679 -624 -596 -628 -661 -695 -730 -767 -805 -813 -795 -751 -706 -660
6397f60M6O5O5K9j6m5m5m6m6k7jj6j5kkkkkkkjQQRJ0K6N3N3K6k3k3k4k5RRQRjj%jjjkkj0l6
$$ -660 -614 -549 -484 -455 -471 -516 -561 -607 -653 -680 -681 -697 -712 -714 -716 -718 -720 -722 -724 -726 -727 -719 -711 -702 -692 -666 -613 -560 -534 -557 -580 -604 -629 -620 -611 -603 -594 -595 -596 -596 -597 -598 -599 -601 -603 -613 -649
6376f49k2k1JJJKpqppnonokkQL5N3K6j8m5l0J5K9Ll5l5pJ9K3K2kkj7j7j6j6L8O4O2L6kk9j6
$$ -649 -671 -692 -691 -690 -689 -687 -694 -702 -709 -716 -721 -727 -732 -738 -740 -742 -734 -699 -646 -620 -638 -683 -713 -698 -669 -666 -701 -736 -743 -724 -701 -679 -681 -683 -700 -717 -733 -749 -711 -647 -585 -549 -551 -580 -596
6357e96j6JKK8N6L9J4j4j5m0m1m1m1l0l1p4p5j4j4M7M8P5P5J1m2j0M3O5L9k8q1o8m2rrppM0
$$ -596 -612 -611 -609 -581 -525 -486 -472 -486 -501 -541 -582 -623 -664 -694 -725 -799 -874 -888 -902 -855 -807 -732 -657 -646 -688 -698 -655 -590 -551 -579 -660 -728 -770 -779 -788 -795 -802 -762
6340g62M1L9L8l5o3n2JJ1j6m1m1k2k2NNL4L4Om7m8MM9M9K5jJ0O4Q3Q3K1l2p0m4%%k0k0m6m6
$$ -762 -721 -682 -644 -679 -742 -794 -793 -782 -798 -839 -880 -902 -924 -919 -914 -880 -846 -840 -887 -935 -931 -882 -833 -808 -809 -799 -735 -652 -569 -548 -580 -650 -694 -694 -694 -714 -734 -780 -826
6324h26j9j8j8j9j8j8K6K6L6L7J0J0l0k9M9N0O3O2O0N9J5l8k6KJ0j7o1o2n8n9PO0R8P1K5K5
$$ -826 -845 -863 -881 -900 -918 -936 -910 -884 -848 -811 -801 -791 -821 -850 -801 -751 -688 -626 -566 -507 -492 -530 -556 -554 -544 -561 -622 -684 -742 -801 -794 -734 -636 -565 -540 -515
6308e15pn9j05j05m2J1M3M2J2J2J2J2RRj7j7k9k9J5J4j9j9j9j9l0l0K3K3L2L1L2L2L7L8j5
$$ -515 -522 -581 -686 -791 -833 -822 -779 -737 -725 -713 -701 -689 -680 -671 -688 -705 -734 -763 -748 -734 -753 -772 -791 -810 -840 -870 -847 -824 -792 -761 -729 -697 -660 -622 -637
6293f37j6l1l2rM4L1L0L4L4%j%%RROOJ2m1r7r6n0KK5K6O6O6J3J4L5L5j7j8l4l4l4l5opM6M7
$$ -637 -653 -684 -716 -725 -681 -650 -620 -586 -552 -552 -553 -553 -553 -544 -535 -529 -523 -511 -552 -649 -745 -795 -793 -768 -742 -676 -610 -597 -583 -548 -513 -530 -548 -582 -616 -650 -685 -691 -698 -652 -605
6275f05M6M6opk7k8k7k7l1l1K2K3J5J5l8l7M2M3M0L9L4j8m1m2l9l9m0l9J2J1J2J1l5l4l5l5
$$ -605 -559 -513 -519 -526 -553 -581 -608 -635 -666 -697 -675 -652 -637 -622 -660 -697 -655 -612 -572 -533 -499 -517 -558 -600 -639 -678 -718 -757 -745 -734 -722 -711 -746 -780 -815 -850
6259h50L1L1L1L0kkkkk0j9k0j9J%%JrqqrK9K9K9K9KKJKK5K6K6K6k4k3k4k3mlmmJ3J3J3J3j9
$$ -850 -819 -788 -757 -727 -729 -731 -733 -735 -755 -774 -794 -813 -812 -812 -812 -811 -820 -828 -836 -845 -816 -787 -758 -729 -727 -725 -724 -722 -697 -671 -645 -619 -643 -666 -690 -713 -717 -720 -724 -728 -715 -702 -689 -676 -695
6240f95j9j9j9p0o9j3M0O9M3PQJ6J6J6J6K4K3K4K4j1j0j0j0j8j8j8j8m2m3J0J1J0J0J1J0O4
$$ -695 -714 -733 -752 -822 -891 -904 -864 -795 -752 -745 -737 -721 -705 -689 -673 -649 -626 -602 -578 -589 -599 -609 -619 -637 -655 -673 -691 -733 -776 -766 -755 -745 -735 -724 -714 -650
6224f50O4J2J1lln5n6k9l0K3K3K4K3K3K3k5k5k5k6k5k5K8K7K1K1l3l2opppk5k5K8K8j7j8j7
$$ -650 -586 -574 -563 -566 -569 -624 -680 -709 -739 -716 -693 -669 -646 -623 -600 -625 -650 -675 -701 -726 -751 -723 -696 -675 -654 -687 -719 -725 -732 -739 -746 -771 -796 -768 -740 -757 -775 -792
6208g92j7NONOL0K9L0L0L6L7L3L3Om6o9o9lk%jO3Q9N1kNMKJo6o6o5o6k6k7k6k6POONK0ok2
$$ -792 -809 -804 -798 -793 -787 -757 -728 -698 -668 -632 -595 -562 -529 -523 -569 -638 -707 -710 -712 -712 -713 -650 -561 -510 -512 -507 -503 -501 -500 -566 -632 -697 -763 -789 -816 -842 -868 -861 -855 -849 -844 -824 -830 -852
6189h52L0M3J7j4j5J4N8N8J5k8k8K3K2N3N4%%kklm8n6n6poJ4J4J4J4N7N7MMnml1l1J0J0L6
$$ -852 -822 -779 -762 -776 -791 -777 -719 -661 -646 -674 -702 -679 -657 -604 -550 -550 -550 -552 -554 -557 -605 -661 -717 -724 -730 -716 -702 -688 -674 -617 -560 -556 -552 -557 -561 -592 -623 -613 -603 -567
6171e67L6M7M7J8k5k1k1k4k4m2m3m2m3K6K6K6K5j6j6j6j6J3J3J4J3J3J3J3J4j8j8j7j8K5K4
$$ -567 -531 -484 -437 -419 -444 -465 -486 -510 -534 -576 -619 -661 -704 -678 -652 -626 -601 -617 -633 -649 -665 -652 -639 -625 -612 -599 -586 -573 -559 -577 -595 -612 -630 -605 -581
6156e81k8k8l0l0mmm5m6j7K6O8O7J7J8L2L2ONk7k8k8k8n2n3%JL5L5L5L6K5K6%jK5K4km6l7
$$ -581 -609 -637 -667 -697 -701 -705 -750 -796 -813 -787 -719 -652 -635 -617 -585 -553 -547 -542 -569 -597 -625 -653 -705 -758 -758 -757 -722 -687 -652 -616 -591 -565 -565 -566 -541 -517 -519 -565 -602
6139f02j0jkk1k1ONK5K5k8k7qqM4M3P6M9l5p9n7n8qpJ9K0K0K0K0J9ln7n6n7qpN0M9K3K3J4
$$ -602 -612 -613 -615 -636 -657 -651 -646 -621 -596 -624 -651 -659 -667 -623 -580 -504 -455 -490 -569 -626 -684 -692 -699 -680 -660 -640 -620 -600 -581 -584 -641 -697 -754 -762 -769 -719 -670 -647 -624 -610
6122f10J4J3J4K7K7k2k3L5Q8O2RmmlmPO0L0L0P9P9Q9Q8J88L47M58O16J004J410J227L30p57
$$ -610 -596 -583 -569 -542 -515 -537 -560 -525 -437 -375 -366 -370 -374 -377 -381 -374 -314 -284 -254 -175 -96 -7 81 269 616 1074 1690 2694 4104 5331 5661 4904
6108D904j233j048p13n28m74l56k33j96j41j07n3r2r2o5j2j3j2j0rl4l5J9J8mlmmL2L2k1k1
$$ 4904 3671 2623 1910 1382 908 552 319 123 -18 -125 -178 -270 -362 -427 -439 -452 -464 -474 -483 -517 -552 -533 -515 -519 -522 -526 -530 -498 -466 -487 -508
6095e08n4n4L6Q9L4j9l8l8m4m4QRK1K2l2l2k8k9K5K4J9K0J6J6kn4k5k4l3l3l3l3k1k1KN5P5
$$ -508 -562 -616 -580 -491 -457 -476 -514 -552 -596 -640 -632 -623 -602 -580 -612 -644 -672 -701 -676 -652 -633 -613 -597 -581 -583 -637 -662 -686 -719 -752 -785 -818 -839 -860 -858 -803 -728
6079g28P5K5K5l2l2l2l1KKLKk1k2k2k2L4L3L4L3K1K0l2l3k5k6K7K8P2P1M3km6p2p5m8j3j3
$$ -728 -653 -628 -603 -635 -667 -699 -730 -728 -726 -723 -721 -742 -764 -786 -808 -774 -741 -707 -674 -653 -633 -665 -698 -723 -749 -722 -694 -622 -551 -508 -510 -556 -628 -703 -751 -764 -777
6063g77j2j1O6O6O6O6J1J1J1J2n1n0n0n0QQQQM8M7j4n8m4j7J8J7j9j9k0j9k0k0L3L3K5K4N1
$$ -777 -789 -800 -734 -668 -602 -536 -525 -514 -503 -491 -542 -592 -642 -692 -684 -676 -668 -660 -612 -565 -579 -637 -681 -698 -680 -663 -682 -701 -721 -740 -760 -780 -747 -714 -689 -665 -614
6047f14N1K1K1nnl8l8l8l8K1K0ool5l4J8J8K8K9K6K6Nl9l1mK0pm3m4k2k2L0L1N0N0K2k2m7
$$ -614 -563 -542 -521 -526 -531 -569 -607 -645 -683 -662 -642 -648 -654 -689 -723 -705 -687 -659 -630 -604 -578 -573 -612 -643 -647 -627 -634 -677 -721 -743 -765 -735 -704 -654 -604 -582 -604 -651
6030f51m7m9mL4L4J0J0K9K8KKl7l8J6J5N0N0kll6l6o1o1k5KMk3j2J4%%K7N4O2J8o5r2l7M3
$$ -651 -698 -747 -751 -717 -683 -673 -663 -634 -606 -604 -602 -639 -677 -661 -646 -596 -546 -548 -551 -587 -623 -684 -745 -770 -768 -764 -787 -799 -785 -785 -785 -758 -704 -642 -624 -689 -781 -818 -775
6013g75O8O8J9J8J4j3k4k5OOk0k0j9j8QPJ9J8j7m5k8kj8j8k0k0j8j8J1L7L7J0j8j7J7M3M2
$$ -775 -707 -639 -620 -602 -588 -601 -625 -650 -644 -638 -658 -678 -697 -715 -707 -700 -681 -663 -680 -725 -753 -755 -773 -791 -811 -831 -849 -867 -856 -819 -782 -772 -790 -807 -790 -747 -705
5997g05J6OOJ9J9qpj5j5j5j5l2l3OL2M1M1J7J7%%J1L8M6M6j6o0q3q4m8k2J4J4J5J6opmnj3
$$ -705 -689 -683 -677 -658 -639 -647 -654 -669 -684 -699 -714 -746 -779 -773 -741 -700 -659 -642 -625 -625 -625 -614 -576 -530 -484 -500 -560 -643 -727 -775 -797 -783 -769 -754 -738 -744 -751 -755 -760 -773
5980g73J3M9N0Rj7k8k7j3J4K5K5LLN3N3K8j6m5m4j9j9J7M4N8L2J1j6k8k9l0l0j8j8j8j8o7
$$ -773 -760 -711 -661 -652 -669 -697 -724 -737 -723 -698 -673 -670 -667 -614 -561 -533 -549 -594 -638 -657 -676 -659 -615 -557 -525 -514 -530 -558 -587 -617 -647 -665 -683 -701 -719 -786
5964g86o8o7o8NNONL5L5L5L5K0K1K0K0M4M4j7j8J3J3jn5m0m0%JJKJKkjjkk9l0L2L2N1N1N1
$$ -786 -854 -921 -989 -984 -979 -973 -968 -933 -898 -863 -828 -808 -787 -767 -747 -703 -659 -676 -694 -681 -668 -669 -724 -764 -804 -804 -803 -802 -800 -799 -797 -799 -800 -801 -803 -832 -862 -830 -798 -747 -696 -645
5946f45N0k2k2k3k2opllqM5P3P4Rm4j5j4llklk9k9k9l0%j%jJ5J5J5J5N2N1j0j0j5j4J3J2K8
$$ -645 -595 -617 -639 -662 -684 -690 -697 -700 -703 -711 -666 -593 -519 -510 -554 -569 -583 -586 -589 -591 -594 -623 -652 -681 -711 -711 -712 -712 -713 -698 -683 -668 -653 -601 -550 -560 -570 -585 -599 -586 -574 -546
5928e46K8KKKKKKk4k4k4k4qrqqJ6J5J6J6l0l0l0l0J4J5J1J1k5p7p0p1k2L2M2M2Pm6k0L3R9
$$ -546 -518 -516 -514 -512 -510 -508 -506 -530 -554 -578 -602 -610 -619 -627 -635 -619 -604 -588 -572 -602 -632 -662 -692 -678 -663 -652 -641 -666 -743 -813 -884 -906 -874 -832 -790 -783 -829 -849 -816 -717
5910g17R9P1J7j3j3m3m3k5k5k5k5K5K5K6K5J6J6J6J7J4J5l0k9KJKKj2j3j3j3j9j9j9k0J5J5
$$ -717 -618 -547 -530 -543 -556 -599 -642 -667 -692 -717 -742 -717 -692 -666 -641 -625 -609 -593 -576 -562 -547 -577 -606 -604 -603 -601 -599 -611 -624 -637 -650 -669 -688 -707 -727 -712 -697
5894f97J4J5L3L3L3L3k4k3n0n0n5n4PQN6N7N7N7J0J0l4l4JKK8K8K3K4K3K3J5J5mm8p3p2n0
$$ -697 -683 -668 -635 -602 -569 -536 -560 -583 -633 -683 -738 -792 -785 -777 -721 -664 -607 -550 -540 -530 -564 -598 -597 -595 -567 -539 -516 -492 -469 -446 -431 -416 -420 -468 -541 -613 -663
5878f63m9m4m4m4m5%jJJM5P1Q2L7J4J3J0J1rj0rrK0K0J9K0OPn3n2k3K1K2K3qrn3n2popok0
$$ -663 -712 -756 -800 -844 -889 -889 -890 -889 -888 -843 -772 -690 -653 -639 -626 -616 -605 -614 -624 -633 -642 -622 -602 -583 -563 -557 -550 -603 -655 -678 -657 -635 -612 -620 -629 -682 -734 -741 -747 -754 -760 -780
5860g80k1k0k0K0K0J1j6k3K0L8L8KLK9K9J0Rj1o5o4l8KN4L7L7M0M0kln6n5l8l8J5J5M3M2K0
$$ -780 -801 -821 -841 -821 -801 -790 -806 -829 -809 -771 -733 -731 -728 -699 -670 -660 -651 -662 -727 -791 -829 -827 -773 -736 -699 -659 -619 -621 -624 -680 -735 -773 -811 -796 -781 -738 -696 -676
5844f76l3o5o5j3L9M7no1o0popoJ5J5J6J7L4O0M9mn8n8K7K6L9L9L8L9k0k0j9k0MLMMl5l5l5
$$ -676 -709 -774 -839 -852 -813 -766 -771 -832 -892 -899 -905 -912 -918 -903 -888 -872 -855 -821 -761 -712 -716 -774 -832 -805 -779 -740 -701 -663 -624 -644 -664 -683 -703 -699 -696 -692 -688 -723 -758 -793
5826g93l5K7K7P7P6O3J0j3j4ool2l2j3j3J4J4nmM5M5L1k1p6p7m4RL2L3K8K8N5N5M8M8nml4
$$ -793 -828 -801 -774 -697 -621 -558 -548 -561 -575 -581 -587 -619 -651 -664 -677 -663 -649 -654 -658 -613 -568 -537 -558 -634 -711 -755 -746 -714 -681 -653 -625 -570 -515 -467 -419 -424 -428 -462
5810d62l4l4l3o4o3m1J3L1L1L5L4N1N0K6k7p1r6p4m7j2j1M3M4L6L7J0J1ooonK4K4k9k9kkK3
$$ -462 -496 -530 -563 -627 -690 -731 -718 -687 -656 -621 -587 -536 -486 -460 -487 -558 -654 -728 -775 -787 -798 -755 -711 -675 -638 -628 -617 -623 -629 -635 -640 -616 -592 -621 -650 -652 -654 -631
5793f31K3j1l7k7K5L6J0k4k5opK0K0O6O6M3j0l1l2l4l5ONN5N5on9n8onokkklkkj2j2j2j2L
$$ -631 -608 -619 -656 -683 -658 -622 -612 -636 -661 -667 -674 -654 -634 -568 -502 -459 -469 -500 -532 -566 -601 -595 -590 -535 -480 -486 -545 -603 -609 -614 -620 -622 -624 -626 -629 -631 -633 -645 -657 -669 -681 -678
5775f78MLLrj0rj0M5M6M5M5j5j6j5j6RJ0k6n2m0J2L1L0Qm4p9n3J2O5P7N2RJ0QQJ5J5J5J6K
$$ -678 -674 -671 -668 -677 -687 -696 -706 -661 -615 -570 -525 -540 -556 -571 -587 -578 -568 -594 -646 -686 -674 -643 -613 -605 -649 -728 -781 -769 -704 -627 -575 -566 -556 -548 -540 -525 -510 -495 -479 -477
5758d77Kn1n0n1n1JJkk8j7L7Q6Q6L1k2j7j7m7m7o9o9j6j6J1J1j6j5QRL5L4K4K4k9k9LMLLK9
$$ -477 -475 -526 -576 -627 -678 -677 -676 -678 -706 -723 -686 -600 -514 -483 -505 -522 -539 -586 -633 -702 -771 -787 -803 -792 -781 -797 -812 -804 -795 -760 -726 -702 -678 -707 -736 -733 -729 -726 -723 -694
5741f94K8K9K9J9J8J9J9J6J6l7l8k3k3k2k2L5O1J9k6n0n1k7k7M7M7K0K0QPQPnnonK4K3K3K4
$$ -694 -666 -637 -608 -589 -571 -552 -533 -517 -501 -538 -576 -599 -622 -644 -666 -631 -570 -551 -577 -627 -678 -705 -732 -685 -638 -618 -598 -590 -583 -575 -568 -573 -578 -584 -589 -565 -542 -519 -495
5724d95J3J4J3J4j6j5n0p6m1K1K7J%K6J0J0J9J9M6M5k1k2p1p2m5jMLNM9O3L6k9p2q8o2qL6
$$ -495 -482 -468 -455 -441 -457 -472 -522 -598 -639 -618 -591 -590 -590 -564 -554 -544 -525 -506 -460 -415 -436 -458 -529 -601 -646 -647 -643 -640 -635 -586 -523 -487 -516 -588 -676 -738 -746 -710
5707g10N3K6J0j6k9k9qqopjK4L7qj8PNk1jkllk3k2k3k3L2L2Pl7m9nK1K1K9L0LLj5j5j2j3l
$$ -710 -657 -631 -621 -637 -666 -695 -703 -711 -717 -724 -725 -701 -664 -672 -690 -683 -678 -699 -700 -702 -705 -708 -731 -753 -776 -799 -767 -735 -728 -765 -814 -819 -798 -777 -748 -718 -715 -712 -727 -742 -754 -767 -770
5689g70M1L1NKJ%jm9n0LLJ7J6J7J7POOPK1K2M8M7O3O3J0J0k9k8p6p5r2mL5L5n0n0k3k4K0K0
$$ -770 -729 -698 -693 -691 -690 -690 -691 -740 -790 -787 -784 -767 -751 -734 -717 -710 -704 -698 -691 -670 -648 -600 -553 -490 -427 -417 -407 -436 -464 -540 -615 -707 -711 -676 -641 -691 -741 -764 -788 -768 -748
5671g48l3l3k5k5K8K8N5N6Q5L2k1k1k4k4rj0pok0L3N6N6L9M0j0j0L0Q4Q3L1l0l0l3l3llkl
$$ -748 -781 -814 -839 -864 -836 -808 -753 -697 -612 -580 -601 -622 -646 -670 -679 -689 -696 -702 -722 -689 -633 -577 -538 -498 -508 -518 -488 -404 -321 -290 -320 -350 -383 -416 -419 -422 -424 -427
5654d27j8j8j5j4J3O6P1J9M6J35J49R8J26L21M83N36P91J443K000J559J40j215j600j195p50
$$ -427 -445 -463 -478 -492 -479 -413 -342 -323 -277 -142 7 105 231 552 1035 1571 2362 3805 5805 7364 7504 6289 4689 3494 2744
5643B744o63o34m41k58k05k00j47j00r9j26p4l4l4o0pJ1J1l3l3M6J34J98J97J41j8j22j22
$$ 2744 2081 1447 1006 748 543 343 196 96 -3 -129 -203 -237 -271 -331 -338 -327 -316 -349 -382 -336 -202 -4 193 334 316 194 72
5632G2j16j16o4o4n1n0n1n0RRRRL2L2k6p9n0n1L1L1M5pn3%J11K34K31J09o5j52j40q8p2p3
$$ 72 -44 -160 -224 -288 -339 -389 -440 -490 -481 -472 -463 -454 -422 -390 -416 -495 -545 -596 -565 -534 -489 -496 -549 -549 -438 -204 27 136 71 -81 -221 -309 -381 -454
5617d54p3k0PPm3m2l5l6l5l6n2n3M0R3O6O6J7J7qpK0J9onoolmmml4l4o4j1K5K4K8K7J3J4m0
$$ -454 -527 -547 -540 -533 -576 -618 -653 -689 -724 -760 -812 -865 -825 -732 -666 -600 -583 -566 -574 -581 -561 -542 -548 -553 -559 -565 -568 -572 -576 -580 -614 -648 -712 -723 -698 -674 -646 -619 -606 -592 -632
5599f32m0jjN2N2O4O5k6p9q4l2j2j2l8l9j2j2J0RJ0RK6K6K7K6j6j6j6j5RRRRllN1J05P5K2
$$ -632 -672 -673 -674 -622 -570 -506 -441 -467 -546 -630 -662 -674 -686 -724 -763 -775 -787 -777 -768 -758 -749 -723 -697 -670 -644 -660 -676 -692 -707 -698 -689 -680 -671 -674 -677 -626 -521 -446 -424
5582d24o8o8p5p4j7L7L4L4j6j6j2j3l8l7m6k0J9J8K7K7N1N1L0j4j6j6J6J7K5N2M7Mm1o8o4
$$ -424 -492 -560 -635 -709 -726 -689 -655 -621 -637 -653 -665 -678 -716 -753 -799 -819 -800 -782 -755 -728 -677 -626 -596 -610 -626 -642 -626 -609 -584 -532 -485 -481 -522 -590 -654
5567f54l8kkKJ%%j8m5m4j8K1K1QL4M7M6K2K2MNm6m6m1j3K4K4K1K2nnJ5J5j1n5o1l4j4J2J%
$$ -654 -692 -694 -696 -694 -693 -693 -693 -711 -756 -800 -818 -797 -776 -768 -734 -687 -641 -619 -597 -593 -588 -634 -680 -721 -734 -710 -686 -665 -643 -648 -653 -638 -623 -634 -689 -750 -784 -798 -786 -785 -785
5549g85KKL4L4j6j6QN2O9M2jkk7k8k7jL7L8J4J5J4J4j8j9pK0M8M8J2j5k2k2KJj3l9r4j21r2
$$ -785 -783 -781 -747 -713 -729 -745 -737 -685 -616 -574 -575 -577 -604 -632 -659 -660 -623 -585 -571 -556 -542 -528 -546 -565 -572 -552 -504 -456 -444 -459 -481 -503 -501 -500 -513 -552 -646 -767 -859
5532h59m7jK5L3L3L4L5RJ0QQRj8k7k8j0J7L7O5M8K2J0l4r4r4m6J7J0j6nM9Q2K9j6j7M1M0M1
$$ -859 -906 -907 -882 -849 -816 -782 -747 -738 -728 -720 -712 -703 -721 -748 -776 -786 -769 -732 -667 -619 -597 -587 -621 -715 -809 -855 -838 -828 -844 -849 -800 -718 -689 -705 -722 -681 -641 -600
5516f00M1k4k3k4k3NOOOJ1J1L5L4M2j1m3m3j0rL4L4J4J4m8m7rrL5O1O1Qm2r5q2l0KK8M2M1
$$ -600 -559 -583 -606 -630 -653 -648 -642 -636 -630 -619 -608 -573 -539 -497 -508 -551 -594 -604 -613 -579 -545 -531 -517 -565 -612 -621 -630 -595 -534 -473 -465 -507 -602 -684 -714 -712 -684 -642 -601
5499f01%jJ3J4J3J3qrrrKLm2m2n5n5k9k8J5J5J4J5N7N7J3J3L7L8L7L8k3k3k2k3j6j6m3m2m7
$$ -601 -601 -602 -589 -575 -562 -549 -557 -566 -575 -584 -582 -579 -621 -663 -718 -773 -802 -830 -815 -800 -786 -771 -714 -657 -644 -631 -594 -556 -519 -481 -504 -527 -549 -572 -588 -604 -647 -689 -736
5482g36m7klMLL1L0K6K7j7j8%j%jJ7J7k7k7j6j6K8K8J9K0J9J9K9K9N2N1J7l7n1n1j4j5J3J2
$$ -736 -783 -785 -788 -784 -781 -750 -720 -694 -667 -684 -702 -702 -703 -703 -704 -687 -670 -697 -724 -740 -756 -728 -700 -681 -661 -642 -623 -594 -565 -513 -462 -445 -482 -533 -584 -598 -613 -600 -588
5465e88j5j5j5j6l7l8l8l7kjjjN0M9M9N0j8j8j9j8k5k6k5k5l0k9KN5O5O4POK7K7N3N3J1J0
$$ -588 -603 -618 -633 -649 -686 -724 -762 -799 -801 -802 -803 -804 -754 -705 -656 -606 -624 -642 -661 -679 -704 -730 -755 -780 -810 -839 -837 -782 -717 -653 -646 -640 -613 -586 -533 -480 -469 -459
5449d59k1p5q5q5n7lK7K7L0L0K7K7K7K6K7K7K7K7n0n0n0m9j3j2J4J4M9M8NNPPPPPPOPl6l7
$$ -459 -480 -555 -640 -725 -782 -785 -758 -731 -701 -671 -644 -617 -590 -564 -537 -510 -483 -456 -506 -556 -606 -655 -668 -680 -666 -652 -603 -555 -550 -545 -538 -531 -524 -517 -510 -503 -497 -490 -526 -563
5431e63l6l7mml1l0m5m4j3M1M9M8ooK4P6P6K4qrj1j2L9M0Pm5k8k9l1l2m5m5jjNMNNJ8J8J9
$$ -563 -599 -636 -640 -644 -675 -705 -750 -794 -807 -766 -717 -669 -675 -681 -657 -581 -505 -481 -489 -498 -509 -521 -482 -442 -435 -480 -508 -537 -568 -600 -645 -690 -691 -692 -687 -683 -678 -673 -655 -637 -618
5414f18J8j1j1j1j1j5j5j4j5j0j0L4L4M0M1O3O3M8on2n1l0K3K0K0M7M7K0o9j05p8l7l7l0l0
$$ -618 -600 -611 -622 -633 -644 -659 -674 -688 -703 -713 -723 -689 -655 -615 -574 -511 -448 -400 -406 -458 -509 -539 -516 -496 -476 -429 -382 -362 -431 -536 -614 -651 -688 -718 -748
5399g48L1L2J4J5J4J5JJM4M5L7L7qpl3l2n9n8j1j1J6J5j%jjj6j7J0RJ7J6k8k8j2j3j2j3PP
$$ -748 -717 -685 -671 -656 -642 -627 -626 -625 -581 -536 -499 -462 -470 -477 -510 -542 -601 -659 -670 -681 -665 -650 -651 -651 -652 -653 -669 -686 -676 -667 -650 -634 -662 -690 -702 -715 -727 -740 -733 -726
5381g26OPRRL5L5P3P2N9Nj4j5m4p1n8oK5K4JKJKJ7J7J7J7L2L3L2L3k6k5k6k6m5m5m2m3QO1
$$ -726 -720 -713 -704 -695 -660 -625 -552 -480 -421 -416 -430 -445 -489 -560 -618 -624 -599 -575 -574 -572 -571 -569 -552 -535 -518 -501 -469 -436 -404 -371 -397 -422 -448 -474 -519 -564 -606 -649 -641 -580
5364e80M5K0%%kkm4m5m5m4n4n4o6l9K1P4O1L4J4J3J2J2NNM8M9K8K8l5l4m1m1j5j5L9L9O3O3
$$ -580 -535 -515 -515 -515 -517 -519 -563 -608 -653 -697 -751 -805 -871 -910 -889 -815 -754 -720 -706 -693 -681 -669 -664 -659 -611 -562 -534 -506 -541 -575 -616 -657 -672 -687 -648 -609 -546 -483
5347d83L9nk5k4k9k9l0k9m2m2l9m0PN1M1J5nnpoppopM4M3M4M3L0L0om9p7n1oK0pl4l2oLLL2
$$ -483 -444 -449 -474 -498 -527 -556 -586 -615 -657 -699 -738 -778 -771 -720 -679 -664 -669 -674 -681 -687 -694 -701 -707 -714 -670 -627 -583 -540 -510 -480 -486 -535 -612 -663 -669 -649 -656 -690 -722 -728 -725 -722 -690
5329f90L1QQl5l6l1l2k8k8J0N5L0L0K0J9opl6l6kM3M1J4pJ8N6Q1O7O6N2K6k9p2n7j4K1K1J3
$$ -690 -659 -651 -643 -678 -714 -745 -777 -805 -833 -823 -768 -738 -708 -688 -669 -675 -682 -718 -754 -756 -713 -672 -658 -665 -647 -591 -510 -443 -377 -325 -299 -328 -400 -457 -471 -450 -429 -416
5312d16J3l0l1j8j8j8j8k5k6L6L7k6k5k4k3K8N5L2k9o8m2JJLLLMk3k3k2k3LKN6N5K7K7k6k6
$$ -416 -403 -433 -464 -482 -500 -518 -536 -561 -587 -551 -514 -540 -565 -589 -612 -584 -529 -497 -526 -594 -636 -635 -634 -631 -628 -625 -621 -644 -667 -689 -712 -709 -707 -651 -596 -569 -542 -568 -594
5295e94k1k2k1k2j6j6L7L6N4N4JKl9l8l9l8n3n2m9n0m4jK8K7LLLKK6K6K6K6O4O5P6N0Km1m4
$$ -594 -615 -637 -658 -680 -696 -712 -675 -639 -585 -531 -530 -528 -567 -605 -644 -682 -735 -787 -836 -886 -930 -931 -903 -876 -873 -870 -867 -865 -839 -813 -787 -761 -697 -632 -556 -506 -504 -545 -589
5278e89J%%KLk9k9k8k7J7M4Lm1m8k1l8l9mnM9M8k7k8k8k7K6K5K6K6k3k2M9P4K9j5lK3K6K7
$$ -589 -588 -588 -588 -586 -583 -612 -641 -669 -696 -679 -635 -632 -673 -721 -742 -780 -819 -823 -828 -779 -731 -758 -786 -814 -841 -815 -790 -764 -738 -761 -783 -734 -660 -631 -646 -649 -626 -600 -573
5262e73K8K8k8k7k7k7j3j3j0j0j5K8N7N7llmlmmnmm2m2j6K8L2OK3K4JJJJL6L6L3L4J9k4n3
$$ -573 -545 -517 -545 -572 -599 -626 -639 -652 -662 -672 -687 -659 -602 -545 -548 -551 -555 -558 -562 -566 -571 -575 -617 -659 -675 -647 -615 -609 -586 -562 -561 -560 -559 -558 -522 -486 -453 -419 -400 -424 -477
5244d77n2J1J1J1J1pqqpn6n6n6n5QQQQmnmnPPOPK5K5K5K5J8J7l5l6QPPQj0j1j0j0K0K0l2l3
$$ -477 -529 -518 -507 -496 -485 -492 -500 -508 -515 -571 -627 -683 -738 -730 -722 -714 -706 -710 -715 -719 -724 -717 -710 -704 -697 -672 -647 -622 -597 -579 -562 -597 -633 -625 -618 -611 -603 -613 -624 -634 -644 -624 -604 -636 -669
5224f69j4j3j4j4k7k8k7k8N0N0M9N0NOONjjjjj1j0j1j1M0M0M0M0j7j6j7j6m6m6POk6k7k6k7
$$ -669 -683 -696 -710 -724 -751 -779 -806 -834 -784 -734 -685 -635 -630 -624 -618 -613 -614 -615 -616 -617 -628 -638 -649 -660 -620 -580 -540 -500 -517 -533 -550 -566 -612 -658 -651 -645 -671 -698 -724 -751
5207g51qqqqJ5J6J5J5J6J6l7l6pqppJKKJP1P0J8J8L6L7L6L7j0j0rj0j9j8L4L5kjn4n4m1m0
$$ -751 -759 -767 -775 -783 -768 -752 -737 -722 -706 -690 -727 -763 -770 -778 -785 -792 -791 -789 -787 -786 -715 -645 -627 -609 -573 -536 -500 -463 -473 -483 -492 -502 -521 -539 -505 -470 -472 -473 -527 -581 -622 -662
5189f62M4M5L8om7k1K2M9N2K5J3L8K0J9m3q8p6n0m5j8OL3M8M7J3j3l8j2N7N7K0k5jjjk8k7
$$ -662 -618 -573 -535 -541 -588 -609 -587 -538 -486 -461 -448 -410 -390 -371 -414 -502 -578 -628 -673 -691 -685 -652 -604 -557 -544 -557 -595 -607 -550 -493 -473 -498 -499 -500 -501 -529 -556
5173e56jLMLLJ2j5n1n0nL9J1J2k1o5n3k6PL4L5J0j9j8j8j7M2Q6P4M7j7o2l8l8l0l0k8k9K4
$$ -556 -557 -554 -550 -547 -544 -532 -547 -598 -648 -653 -614 -603 -591 -612 -677 -730 -756 -749 -715 -680 -670 -689 -707 -725 -742 -700 -614 -540 -493 -510 -572 -610 -648 -678 -708 -736 -765 -741
5156g41N1L3L4Pj9l0J5K0K0K3K3K7K8ql5n1k4K0O4M9Nk1k0k4k3k4k3l8l8l7l8m6m6n9l2L5
$$ -741 -690 -657 -623 -616 -635 -665 -650 -630 -610 -587 -564 -537 -509 -517 -552 -603 -627 -607 -543 -494 -489 -510 -530 -554 -577 -601 -624 -662 -700 -737 -775 -821 -867 -926 -958 -923
5141i23O1O3L7K7K6K2K3j1n5m3j7NL2J8J8llllNMm8m9l4l4l0l1K5P8P8K5j6j5j9j9j7j6LN6
$$ -923 -862 -799 -762 -735 -709 -687 -664 -675 -730 -773 -790 -785 -753 -735 -717 -720 -723 -726 -729 -724 -720 -768 -817 -851 -885 -915 -946 -921 -843 -765 -740 -756 -771 -790 -809 -826 -842 -839 -783
5124g83M8on7n7LN5K5K5L0L0L0L0J5J5J5J5K7K7K7K8K3K4k9l0n3n4%jk3k4k4k4%jj%J9K0J9
$$ -783 -735 -741 -798 -855 -852 -797 -772 -747 -717 -687 -657 -627 -612 -597 -582 -567 -540 -513 -486 -458 -435 -411 -440 -470 -523 -577 -577 -578 -601 -625 -649 -673 -673 -674 -675 -675 -656 -636 -617
5107f17J9k2k2k3k2kkjkJ8J8J8J8M0L9M0L9J4J5l9l9opopo3o4j1j1K0J9K0J9kjkjkjkknnn
$$ -617 -598 -620 -642 -665 -687 -689 -691 -692 -694 -676 -658 -640 -622 -582 -543 -503 -464 -450 -435 -474 -513 -519 -526 -532 -539 -602 -666 -677 -688 -668 -649 -629 -610 -612 -613 -615 -616 -618 -619 -621 -623 -628 -633 -638
5088f38nl0l1K2K2J3J2J2J3kkkkj8j7j7j8J0RJ0RK5K5K2K3k8p2m7m7j5j6RRM0J3m2q5q0l7
$$ -638 -643 -673 -704 -682 -660 -647 -635 -623 -610 -612 -614 -616 -618 -636 -653 -670 -688 -678 -669 -659 -650 -625 -600 -578 -555 -583 -655 -702 -749 -764 -780 -771 -762 -722 -709 -751 -836 -916 -953
5071i53%K7O5O5O7O7K2K2k2k2l4l4J0J0N0N0J4k9l6j0J6J6m6m6m7m6KKK9K9M8M8Nk2rL5N8
$$ -953 -953 -926 -861 -796 -729 -662 -640 -618 -640 -662 -696 -730 -720 -710 -660 -610 -596 -625 -661 -671 -655 -639 -685 -731 -778 -824 -822 -820 -791 -762 -714 -666 -661 -683 -692 -657 -599
5055e99J4l5o2p3p3n1qJ1J1llN8N8N1N2PPj9j9QPRRl5l5l3l3j5m1n0pM8P4O4L8J0J1OOL0L0
$$ -599 -585 -620 -682 -755 -828 -879 -887 -876 -865 -868 -871 -813 -755 -704 -652 -645 -638 -657 -676 -668 -661 -652 -643 -678 -713 -746 -779 -794 -835 -885 -892 -844 -770 -706 -668 -658 -647 -641 -635 -605 -575
5037e75L0j4m7m8k8J6O7O8L6pm4m4k5k5KJJ6J6j0j1n9n8m0NM8M8L1j2j9j8k1k2l5l4l5l5K6
$$ -575 -545 -559 -606 -654 -682 -666 -599 -531 -495 -502 -546 -590 -615 -640 -638 -637 -621 -605 -615 -626 -685 -743 -783 -778 -730 -682 -651 -663 -682 -700 -721 -743 -778 -812 -847 -882 -856
5021h56K6K6K6K6K6K6K6j9k0k0k0o0n9p2m5J6O9M1M1Q9Q9J01P4Nm9p8p9m5QK2K2KKK9K8M8
$$ -856 -830 -804 -778 -752 -726 -700 -674 -693 -713 -733 -753 -813 -872 -944 -989 -973 -904 -863 -822 -733 -644 -543 -469 -464 -513 -591 -670 -715 -707 -685 -663 -661 -659 -630 -602 -554
5005e54M9K1K2RRl5l5o1o0q4q3m0J3M7P4R4R3O4J0LL%jm6m6m6m6p0o9o6o7l5J7N2P9O5O6M9
$$ -554 -505 -484 -462 -453 -444 -479 -514 -575 -635 -719 -802 -842 -829 -782 -708 -614 -521 -457 -447 -444 -441 -441 -442 -488 -534 -580 -626 -696 -765 -831 -898 -933 -916 -864 -785 -720 -654 -605
4989f05P6Q2K9k2m8o2o3l7l7M7M7P0P1L8j4o4o4k0k1k1k1J4J4J4J4MLLLn2n2m8m9k0L2J8r
$$ -605 -529 -447 -418 -440 -488 -550 -613 -650 -687 -640 -593 -523 -452 -414 -428 -492 -556 -576 -597 -618 -639 -625 -611 -597 -583 -579 -576 -573 -570 -622 -674 -722 -771 -791 -759 -741 -750
4973g50j4j5j6j6mnnnO4O5O5O4j7j7j8j7k9l0KN5N8N7J6J7m3m3m3m3k6k6k6k6NOOOK1K1O5
$$ -750 -764 -779 -795 -811 -815 -820 -825 -830 -766 -701 -636 -572 -589 -606 -624 -641 -670 -700 -698 -643 -585 -528 -512 -495 -538 -581 -624 -667 -693 -719 -745 -771 -766 -760 -754 -748 -727 -706 -641
4956f41O5N0M9K3K3K3K2lml7l7l7l7o9o8poQRj8j8JJJJJ0J0J0J0M3M3J5l9l1K2L1Nj8QO8O8
$$ -641 -576 -526 -477 -454 -431 -408 -386 -389 -393 -430 -467 -504 -541 -610 -678 -685 -691 -683 -674 -692 -710 -709 -708 -707 -706 -696 -686 -676 -666 -623 -580 -565 -604 -635 -613 -582 -577 -595 -587 -519 -451
4938d51L0k2o9o8n7nJ0J0noonl6l6l6l6N3N3N4N3K4K5K4K5l7l7l6l7qqqqk8k8k8k8j2j2J5
$$ -451 -421 -443 -512 -580 -637 -642 -632 -622 -627 -633 -639 -644 -680 -716 -752 -788 -735 -682 -628 -575 -551 -526 -502 -477 -514 -551 -587 -624 -632 -640 -648 -656 -684 -712 -740 -768 -780 -792 -777
4921g77J5J2J2N7N6M5M5KJk8k9n4n5k2k2K1M7N5Km5p2m0J2M3M3QQL4L5NOk2k1NMNMLKLLqq
$$ -777 -762 -750 -738 -681 -625 -580 -535 -533 -532 -560 -589 -643 -698 -720 -742 -721 -674 -619 -617 -662 -734 -774 -762 -719 -676 -668 -660 -626 -591 -586 -580 -602 -623 -618 -614 -609 -605 -602 -600 -597 -594 -602 -610
4903f10j1j1l6p9o9m3%%KJM5M5M5M5R7R7P6L2ol2m6m6l9l8l9l9l5l5J0RQQl1l2k0M1O8O9R
$$ -610 -621 -632 -668 -747 -816 -859 -859 -859 -857 -856 -811 -766 -721 -676 -579 -482 -406 -374 -380 -412 -458 -504 -543 -581 -620 -659 -694 -729 -719 -710 -702 -694 -725 -757 -777 -736 -668 -599 -590
4886e90Rj7j7j1j0ppPN1Q6Q5O4K1J8J9k1k2k1k1k8k8k8k8l9m0j3j3K6K6j7j7PL3M3jl7l7N
$$ -590 -581 -598 -615 -626 -636 -643 -650 -643 -592 -506 -421 -357 -336 -318 -299 -320 -342 -363 -384 -412 -440 -468 -496 -535 -575 -588 -601 -575 -549 -566 -583 -576 -543 -500 -501 -538 -575 -570
4869e70MK2K1nnl1l2l2l2RRl2l1J2P4J06O1Jm3l5j0j3j3j1j2m4m5m4m5j1j2j1j2j7j7j8j7
$$ -570 -566 -544 -523 -528 -533 -564 -596 -628 -660 -651 -642 -674 -705 -693 -619 -513 -452 -451 -494 -529 -539 -552 -565 -576 -588 -632 -677 -721 -766 -777 -789 -800 -812 -829 -846 -864 -881
4853h81k2k3K2K2M1M1M1M0M6M6KKKLK8K9JKm3m3nnM0L9L1L2L1L2%JJ%n1n1q0k8J9J8K2K2j4
$$ -881 -903 -926 -904 -882 -841 -800 -759 -719 -673 -627 -625 -623 -621 -618 -590 -561 -560 -558 -601 -644 -649 -654 -614 -575 -544 -512 -481 -449 -449 -448 -447 -447 -498 -549 -629 -657 -638 -620 -598 -576 -590
4835e90j4j0j1K2P4P1P1OPl8l7q5q6n3jj0j0K0K0K3K3K3K3l4l5l5l4RRJ3J3K3P7P0O9J3l9
$$ -590 -604 -614 -625 -603 -529 -458 -387 -381 -374 -412 -449 -534 -620 -673 -674 -684 -694 -674 -654 -631 -608 -585 -562 -596 -631 -666 -700 -691 -682 -669 -656 -633 -556 -486 -417 -404 -443
4819d43p2p2l6l7j0j0%JK6K7qqqqj0j1L3L3K7K7j8j7k5k5k5k5K2K3K0J9j6o9l9l9L5L5L4L5
$$ -443 -515 -587 -623 -660 -670 -680 -680 -679 -653 -626 -634 -642 -650 -658 -668 -679 -646 -613 -586 -559 -577 -594 -619 -644 -669 -694 -672 -649 -629 -610 -626 -695 -734 -773 -738 -703 -669 -634
4803f34K9K9K8K9%%J%jj%jj%jjJ7J8J7J7J%%%m2m2o6o6k1K3M2M3K2K1Qj9o3j07r0k9J1L8M1
$$ -634 -605 -576 -548 -519 -519 -519 -518 -518 -519 -520 -520 -521 -522 -522 -523 -524 -507 -489 -472 -455 -454 -454 -454 -454 -496 -538 -604 -670 -691 -668 -626 -583 -561 -540 -532 -551 -614 -721 -811 -840 -829 -791 -750
4784g50J5%JkjmlmmL6L5L6L5M6M5KJl7l8j1j1k0j9j8K6N6N6J5J5rrJ7J7QQn3n4l4l4J0J0J
$$ -750 -735 -735 -734 -736 -737 -741 -744 -748 -752 -716 -681 -645 -610 -564 -519 -517 -516 -553 -591 -602 -613 -633 -652 -670 -644 -588 -532 -517 -502 -511 -520 -503 -486 -478 -470 -523 -577 -611 -645 -635 -625 -624
4766f24JJJJ9J8J9J8onook9k8k9k9rrrrJ1J0J1J0k2k2k0j9QN1M2J6M0M0L8L8j9j9j9j9n7n7
$$ -624 -623 -622 -621 -602 -584 -565 -547 -553 -558 -564 -570 -599 -627 -656 -685 -694 -703 -712 -721 -710 -700 -689 -679 -701 -723 -743 -762 -754 -703 -661 -645 -605 -565 -527 -489 -508 -527 -546 -565 -622 -679
4748f79n6n7J4J4J3J4j5j4M7M7J5J4J5J4oonoL9M0L9M0j2j1j1j1l8l8l9l8L4L4L5L4l4l5l4
$$ -679 -735 -792 -778 -764 -751 -737 -752 -766 -719 -672 -657 -643 -628 -614 -620 -626 -631 -637 -598 -558 -519 -479 -491 -502 -513 -524 -562 -600 -639 -677 -643 -609 -574 -540 -574 -609 -643
4732f43l5J2J2J1J2nnnnnmK2O6R6O9K3k2n0p8o2o2n9j6L1N6M3jk7k8j0j1j0j1K8K8K7K8J2
$$ -643 -678 -666 -654 -643 -631 -636 -641 -646 -651 -656 -660 -638 -572 -476 -407 -384 -406 -456 -534 -596 -658 -717 -733 -702 -646 -603 -604 -631 -659 -669 -680 -690 -701 -673 -645 -618 -590 -578
4716e78J1QRk8p2p0k6J3M0K8K8J8J8l6l5mmnmM0M0L9M0RRm4m4k5k5k5k5j4j3j3j3QQK6jj7
$$ -578 -567 -559 -550 -578 -650 -720 -746 -733 -693 -665 -637 -619 -601 -637 -672 -676 -680 -685 -689 -649 -609 -570 -530 -521 -512 -556 -600 -625 -650 -675 -700 -714 -727 -740 -753 -745 -737 -711 -712 -729
4698g29K7O9M2J0J0QRRRRJ0j1j1j0j1K6K6K5K6n5n4n3n3r0o4j7K7L3OjM3P2P3K2K2j0j1j1
$$ -729 -702 -633 -591 -581 -571 -563 -554 -545 -536 -527 -517 -528 -539 -549 -560 -534 -508 -483 -457 -512 -566 -619 -672 -762 -826 -843 -816 -783 -777 -778 -735 -663 -590 -568 -546 -556 -567 -578
4682e78j0J9K0l4l3m1m2j4L1L2L3L5L5JJJJk1k2k2k2j5j5j5j5J6J6J6J6POOO%%n0n0QN2M2
$$ -578 -588 -569 -549 -583 -616 -657 -699 -713 -682 -650 -617 -582 -547 -546 -545 -544 -543 -564 -586 -608 -630 -645 -660 -675 -690 -674 -658 -642 -626 -619 -613 -607 -601 -601 -601 -651 -701 -693 -641 -599
4665e99J6j3j2j5j4n3n2n3n3k0j9L2L3L3L3L3L3L5L5j8j8k9k9K4K4J0J0J0RM3M3j0j0j1j1
$$ -599 -583 -596 -608 -623 -637 -690 -742 -795 -848 -868 -887 -855 -822 -789 -756 -723 -690 -655 -620 -638 -656 -685 -714 -690 -666 -656 -646 -636 -627 -584 -541 -551 -561 -572 -583
4649e83j1j0L7L8L8L7RQm4m5l5l6l5l6p1p2m3%L7L6L7L8J0j5k6J9P2P2K3K2k2k1k1k2nnnn
$$ -583 -594 -604 -567 -529 -491 -454 -445 -437 -481 -526 -561 -597 -632 -668 -739 -811 -854 -854 -817 -781 -744 -706 -696 -711 -737 -718 -646 -574 -551 -529 -551 -572 -593 -615 -620 -625 -630 -635
4633f35L1L0L0L1K4K5l7l7J3J2L9L9J2J1l2l2k9k9l0k9%%M4M4J4J4l0l0RJ0j9p2j35q3MN8
$$ -635 -604 -574 -544 -513 -489 -464 -501 -538 -525 -513 -474 -435 -423 -412 -444 -476 -505 -534 -564 -593 -593 -593 -549 -505 -491 -477 -507 -537 -528 -518 -537 -609 -744 -827 -823 -765
4617g65N0N1K7K8K3K3llJ7J6J7J7j0rj3j2n7j09j10n6J3J3J7J6M5M4P5K1j2j2m2m1j6j6K8
$$ -765 -715 -664 -637 -609 -586 -563 -566 -569 -552 -536 -519 -502 -512 -521 -534 -546 -603 -712 -822 -878 -865 -852 -835 -819 -774 -730 -655 -634 -646 -658 -700 -741 -757 -773 -745
4602g45K9LMk3k2j2j2j1j2mmmmK1K0K0K0RQQQJ5J5J4J5j5j4j5j5J4J4J3J4klkll4l4K9Q3R9
$$ -745 -716 -713 -709 -732 -754 -766 -778 -789 -801 -805 -809 -813 -817 -796 -776 -756 -736 -727 -719 -711 -703 -688 -673 -659 -644 -659 -673 -688 -703 -689 -675 -662 -648 -650 -653 -655 -658 -692 -726 -697 -614 -515
4584e15M7%%mnmnk9k9J4J5K5K6l7l6m1m1K1K0MMLMk1k0o5o5j8j8K5K6M4M5M5M5l5l4l5l4j3
$$ -515 -468 -468 -468 -472 -477 -481 -486 -515 -544 -530 -515 -490 -464 -501 -537 -578 -619 -598 -578 -574 -570 -567 -563 -584 -604 -669 -734 -752 -770 -745 -719 -675 -630 -585 -540 -575 -609 -644 -678 -691
4567f91j2M9M9rj0j0j0J0J0J0Rk3k3k3k4J3J3J3J3K9K8K9K8m2m2m2m3l6l7PQN1N1PPllllN
$$ -691 -703 -654 -605 -614 -624 -634 -644 -634 -624 -614 -605 -628 -651 -674 -698 -685 -672 -659 -646 -617 -589 -560 -532 -574 -616 -658 -701 -737 -774 -767 -759 -708 -657 -650 -643 -646 -649 -652 -655 -650
4549f50NMNk9k8k8k9m6m7p4k2K9N6N9L3K9K9L1k1m5m4L1L2J8J8k7k6L0K9LLk1k0k1k0k5k4
$$ -650 -645 -641 -636 -665 -693 -721 -750 -796 -843 -917 -939 -910 -854 -795 -762 -733 -704 -673 -694 -739 -783 -752 -720 -702 -684 -711 -737 -707 -678 -675 -672 -693 -713 -734 -754 -779 -803
4533h03PO1O6O5L8j6k0k0LLJ8J7M4M3K3K3n7n6m5m5j%m4m3m3m3MMM8M9K0K0ooj7j7RJ0J7J7
$$ -803 -796 -735 -669 -604 -566 -582 -602 -622 -619 -616 -598 -581 -537 -494 -471 -448 -505 -561 -606 -651 -652 -652 -696 -739 -782 -825 -821 -817 -769 -720 -700 -680 -686 -692 -709 -726 -717 -707 -690 -673
4516f73M4M4NNL2L2M5M5J2m2q3j10j00m8LK9L1Ml5o2m9m9j3j2j3j3M6M7M6M7J7J8J8J8kkk
$$ -673 -629 -585 -580 -575 -543 -511 -466 -421 -409 -451 -534 -644 -744 -792 -789 -760 -729 -725 -760 -822 -871 -920 -933 -945 -958 -971 -925 -878 -832 -785 -768 -750 -732 -714 -716 -718 -720
4500g20lM0M0L9M0j3j2j2j3QPQPj8j7j8j8K4K4K4K4j4j4j4j5pqpqrrqpL4O0P3K1k2m8n1k5
$$ -720 -723 -683 -643 -604 -564 -577 -589 -601 -614 -606 -599 -591 -584 -602 -619 -637 -655 -631 -607 -583 -559 -573 -587 -601 -616 -623 -631 -638 -646 -655 -664 -672 -679 -645 -585 -512 -491 -513 -561 -612 -637
4482f37qqpoJ1J2J1J2NNNNk7k6k6k6j5j5j5j5kkkkrqnoQO0M5J9J4J4L9L9j2j1J4M1J1m2o8
$$ -637 -645 -653 -660 -666 -655 -643 -632 -620 -615 -610 -605 -600 -627 -653 -679 -705 -720 -735 -750 -765 -767 -769 -771 -773 -782 -790 -795 -801 -793 -733 -688 -669 -655 -641 -602 -563 -575 -586 -572 -531 -520 -562 -630
4463f30m1PL3K1l1o0q7m6M1P9N2ol3j2M0N0K4J8J9J7J6J0RRRJ0J1l4l3p3p3k4K8L9J3j3j3
$$ -630 -671 -664 -631 -610 -641 -701 -788 -834 -793 -714 -662 -668 -701 -713 -673 -623 -599 -581 -562 -545 -529 -519 -510 -501 -492 -482 -471 -505 -538 -611 -684 -708 -680 -641 -628 -641 -654
4447f54J1J2J2J1MLLLJ9J9qqQPl7l6j3j3J4J4K0K0m1m2m0m0L8L9N1N1K5K5L8L8L8L8mlmmo7
$$ -654 -643 -631 -619 -608 -604 -601 -598 -595 -576 -557 -565 -573 -565 -558 -595 -631 -644 -657 -643 -629 -609 -589 -630 -672 -712 -752 -714 -675 -624 -573 -548 -523 -485 -447 -409 -371 -375 -378 -382 -386 -453
4430d53o8o7o7L4L4L4L4k3k3k2k3jjk8k7MMM9M8J8J9J9J8j1j2j2j1M5M5M5M5NOl9l8o3o4l1
$$ -453 -521 -588 -655 -621 -587 -553 -519 -542 -565 -587 -610 -611 -612 -640 -667 -663 -659 -610 -562 -544 -525 -506 -488 -499 -511 -523 -534 -489 -444 -399 -354 -349 -343 -382 -420 -483 -547 -578
4413e78K1K6K5KKJ8J8l5l6m1m1m1m1m9m8k6K8O5O6O9O9M7M6l8l8lN0K0K0m8m8m8m9l9l9M8
$$ -578 -557 -531 -506 -504 -502 -484 -466 -501 -537 -578 -619 -660 -701 -750 -798 -824 -796 -731 -665 -596 -527 -480 -434 -472 -510 -513 -463 -443 -423 -471 -519 -567 -616 -655 -694 -646
4398f46M9O6O5Qm6m5m6JJj4o7l7l7J0J0J1J0L2L3k0k0m3m3M4M5K4K4k9k8k2k3k2k2rrrrLL
$$ -646 -597 -531 -466 -458 -504 -549 -595 -594 -593 -607 -674 -711 -748 -738 -728 -717 -707 -675 -642 -662 -682 -725 -768 -724 -679 -655 -631 -660 -688 -710 -733 -755 -777 -786 -795 -804 -813 -810 -807
4381h07LLL1L0j9j9m5PL0L1k8k8K5K5qqqqJ7J7J7J7M1M1M2M1%%J%K0K0K0K0klklnoonK1K1
$$ -807 -804 -801 -770 -740 -759 -778 -823 -816 -786 -755 -783 -811 -786 -761 -769 -777 -785 -793 -776 -759 -742 -725 -684 -643 -601 -560 -560 -560 -559 -559 -539 -519 -499 -479 -481 -484 -486 -489 -494 -500 -506 -511 -490 -469
4362d69l1l1m7m7OOj3j2j3j3K3K3K2K3N3N3j0n4k7k7l0l0PPN9O0L8L7L8L8K4K5k9k8l3l3l2
$$ -469 -500 -531 -578 -625 -619 -613 -626 -638 -651 -664 -641 -618 -596 -573 -520 -467 -477 -531 -558 -585 -615 -645 -638 -631 -572 -512 -474 -437 -399 -361 -337 -312 -341 -369 -402 -435 -467
4346d67l3o1o0l3J2N0N1%Jk1k0k0k0o4o4j1j1J8J9J9J9Q2Q1N3Qm1o7n5n5l5l5J8J8OPOPj0
$$ -467 -500 -561 -621 -654 -642 -592 -541 -541 -540 -561 -581 -601 -621 -685 -749 -760 -771 -753 -734 -715 -696 -614 -533 -480 -472 -513 -580 -635 -690 -725 -760 -742 -724 -718 -711 -705 -698 -708
4329g08j0j0j0kjkjK2K3K3K2l0l0l1l0J9J9l1l1NM9K4K4J7J6J7J7OONOj3j4J2l3n5n4mnLM
$$ -708 -718 -728 -738 -740 -741 -743 -744 -722 -699 -676 -654 -684 -714 -745 -775 -756 -737 -768 -799 -794 -745 -721 -697 -680 -664 -647 -630 -624 -618 -613 -607 -620 -634 -622 -655 -710 -764 -768 -773 -770 -766
4311g66NNK7N3O3J9k2k3k5k5j9j8j9j9l7l7J5J6L9L9L8L9L0L0k2k3J0J1J0J1K6K7K7K7j1j1
$$ -766 -761 -756 -729 -676 -613 -594 -616 -639 -664 -689 -708 -726 -745 -764 -801 -838 -823 -807 -768 -729 -691 -652 -622 -592 -614 -637 -627 -616 -606 -595 -569 -542 -515 -488 -499 -510
4296e10j0j1%%k6k6m6m5kkK7K7K7K7L1L1L1L0K0K0K0J9l1l2l2l2l0l0llj5j5n6n7j6K8L0K9
$$ -510 -520 -531 -531 -531 -557 -583 -629 -674 -676 -678 -651 -624 -597 -570 -539 -508 -477 -447 -427 -407 -387 -368 -399 -431 -463 -495 -525 -555 -558 -561 -576 -591 -647 -704 -720 -692 -662 -633
4279f33j6j6m2m2m9m9nnMNL0L1Q7Q7O7K4k3k3k5k6j1j0J5J6J1J0O8O9L2l0n7n6m0l9m0l9n
$$ -633 -649 -665 -707 -749 -798 -847 -852 -857 -853 -848 -818 -787 -700 -613 -546 -522 -545 -568 -593 -619 -630 -640 -625 -609 -598 -588 -520 -451 -419 -449 -506 -562 -602 -641 -681 -720 -725
4263g25nK1K2LML0N7M2kk0j9L6L6J0J0k0k0POJ5J5k9k9j3j4j3j4l9l9l8l9k6k6J9J8K7K7q
$$ -725 -730 -709 -687 -684 -680 -650 -593 -551 -553 -573 -592 -556 -520 -510 -500 -520 -540 -533 -527 -512 -497 -526 -555 -568 -582 -595 -609 -648 -687 -725 -764 -790 -816 -797 -779 -752 -725 -733
4247g33n1n7j3K4N1L7L6L9L8llllj9j9j9j9ononj2j2L2L3M7M8MLPPOPJJJJjkm5m6l1l1j5K9
$$ -733 -784 -841 -854 -830 -779 -742 -706 -667 -629 -632 -635 -638 -641 -660 -679 -698 -717 -723 -728 -734 -739 -751 -763 -731 -698 -651 -603 -599 -596 -589 -582 -576 -569 -568 -567 -566 -565 -566 -568 -613 -659 -690 -721 -736 -707
4227g07N5J1p5j01p0rJ9K0M3Q7Q4M1j9o2n5k9J1J1J3J2L0L1l2l1n0m9ooK1K0K1K1J0J1J1J0
$$ -707 -652 -641 -716 -817 -887 -896 -877 -857 -814 -727 -643 -602 -621 -683 -738 -767 -756 -745 -732 -720 -690 -659 -691 -722 -772 -821 -827 -833 -812 -792 -771 -750 -740 -729 -718 -708
4212g08J1J0J1J1J4J5J4J5qqqqMLm0m0mnmnK0K0K0J9LKK5K6K4k0l9l9m4m4m5m4M5M5M5M5k
$$ -708 -697 -687 -676 -665 -651 -636 -622 -607 -615 -623 -631 -639 -635 -632 -672 -712 -716 -721 -725 -730 -710 -690 -670 -651 -648 -646 -621 -595 -571 -591 -630 -669 -713 -757 -802 -846 -801 -756 -711 -666 -668
4194f68jkjK0K1K2K1QL4M4%o7o7j6j7J8J7rrNNMm1q7q8l7l8LLKLJ3J4J5J6O8R6N2Qj5j6QP
$$ -668 -669 -671 -672 -652 -631 -609 -588 -580 -546 -502 -502 -569 -636 -652 -669 -651 -634 -643 -652 -647 -642 -638 -679 -766 -854 -891 -929 -926 -923 -921 -918 -905 -891 -876 -860 -792 -696 -644 -636 -651 -667 -659 -652
4175f52J1J1j6j6ppj6m2k3K2M5M5Pl7k8jM6M5J2j5j2L1M7K0l7l7K3O7Q1N3Rl6k2k3k5k5l4
$$ -652 -641 -630 -646 -662 -669 -676 -692 -734 -757 -735 -690 -645 -638 -675 -703 -704 -658 -613 -601 -616 -628 -597 -550 -530 -567 -604 -581 -514 -433 -380 -371 -407 -429 -452 -477 -502 -536
4159e36l4l2l2p0m3L7Q1L3k9n7l1OL3K0k4m6k0L5O1M2J6nl2l4l4J7J7M4M3k6n4l8OL2L2ON
$$ -536 -570 -602 -634 -704 -747 -710 -629 -596 -625 -682 -713 -707 -674 -654 -678 -724 -744 -709 -648 -606 -590 -595 -627 -661 -695 -678 -661 -617 -574 -600 -654 -692 -686 -654 -622 -616 -611
4143f11L3L2J0J0j6j6J4J5p1p1m2LL2L2N1P8O2J7l8l8m1m1onM7M6klklj8j8j8j7llklj9j8
$$ -611 -578 -546 -536 -526 -542 -558 -544 -529 -600 -671 -713 -710 -678 -646 -595 -517 -455 -438 -476 -514 -555 -596 -602 -607 -560 -514 -516 -519 -521 -524 -542 -560 -578 -595 -598 -601 -603 -606 -625 -643
4126f43j9j9mlmlLLLKJ9J8J8J8k4k4k4k4RRRRPPPPj3j3j5j4k2m8n7j4J3J3rrN9Q6M5%j3J4
$$ -643 -662 -681 -685 -688 -692 -695 -692 -689 -686 -684 -665 -647 -629 -611 -635 -659 -683 -707 -698 -689 -680 -671 -664 -657 -650 -643 -656 -669 -684 -698 -720 -768 -825 -839 -826 -813 -822 -831 -772 -686 -641 -641 -654 -640
4107f40M9M9L1L2k1k1l4l5J8J8L3L2POn3n2n3n3J6J6J6J6K3K4K1K0J9k5j07j33j03p6n4k6
$$ -640 -591 -542 -511 -479 -500 -521 -555 -590 -572 -554 -521 -489 -482 -476 -529 -581 -634 -687 -671 -655 -639 -623 -600 -576 -555 -535 -516 -541 -648 -781 -884 -960 -1014 -1040
4092a040QL4P4P4M6M7ppN6N7N6N6j5j5j6j5l7l6l7l6k1k1k1k1J3J4J5J5L5O1P2K7k5k5k8k8
$$ -1040 -1032 -998 -924 -850 -804 -757 -764 -771 -715 -658 -602 -546 -561 -576 -592 -607 -644 -680 -717 -753 -774 -795 -816 -837 -824 -810 -795 -780 -745 -684 -612 -585 -610 -635 -663 -691
4076f91rqqqK4K5K4K5J1J1O1O0J1m3q0n4k1k1m6m6k3k2L0L0L9L9J3J3j0j0J6J6J5J5J5J5j1
$$ -691 -700 -708 -716 -724 -700 -675 -651 -626 -615 -604 -543 -483 -472 -515 -595 -649 -670 -691 -737 -783 -806 -828 -798 -768 -729 -690 -677 -664 -674 -684 -668 -652 -637 -622 -607 -592 -603
4060f03j1j1j0RRRRk4k4k3k4qqqqMMOOj7J0N2J04R1O5L1L0k5k4n2n1k8k9k9k8l1l0l0l1L0
$$ -603 -614 -625 -635 -626 -617 -608 -599 -623 -647 -670 -694 -702 -710 -718 -726 -722 -718 -712 -706 -723 -713 -661 -557 -466 -401 -370 -340 -365 -389 -441 -492 -520 -549 -578 -606 -637 -667 -697 -728 -698
4043f98L0L1L0QRRQL3L3POM3M2m6m5k7k6k7k6k1k1k1k1lkklklklM0L9L9L9k6k6k6k6RRj3j4
$$ -698 -668 -637 -607 -599 -590 -581 -573 -540 -507 -500 -494 -451 -409 -455 -500 -527 -553 -580 -606 -627 -648 -669 -690 -693 -695 -697 -700 -702 -705 -707 -710 -670 -631 -592 -553 -579 -605 -631 -657 -648 -639 -652 -666
4024f66j7L7N7N6J9k5k5K0J7J7LK9Pl8o1o1nL9M0M0J9J9K0J9ONm6m7l3l2mmK4N1L4j0k7k7
$$ -666 -683 -646 -589 -533 -514 -539 -564 -544 -527 -510 -507 -478 -471 -509 -570 -631 -636 -597 -557 -517 -498 -479 -459 -440 -434 -429 -475 -522 -555 -587 -591 -595 -571 -520 -486 -496 -523 -550
4008e50K0K1j2n7m6k0lmn1n2k6J8M6M6MNNNQQQQj3j3j3j3J7J7l6l6noklj5K8R0Q9N2Rj9k0
$$ -550 -530 -509 -521 -578 -624 -644 -647 -651 -702 -754 -780 -762 -716 -670 -666 -661 -656 -651 -643 -635 -627 -619 -632 -645 -658 -671 -654 -637 -673 -709 -714 -720 -722 -725 -740 -712 -622 -533 -481 -472 -491 -511
3990e11j2j1J4J5%Jn3n2m8m7NNj2j2K2N0M5Kk4k5noM7M8KKk4k5lmK3K3K6K7k6k7j0j1J6J6
$$ -511 -523 -534 -520 -505 -505 -504 -557 -609 -657 -704 -699 -694 -706 -718 -696 -646 -601 -599 -623 -648 -653 -659 -612 -564 -562 -560 -584 -609 -612 -616 -593 -570 -544 -517 -543 -570 -580 -591 -575 -559
3972e59OOk1k0J4J4J4J4PPNML9no8o8k1k1k1k2KJJJk5k5K8K7N7N7MMQRQQl9m0m0m0llO8R4
$$ -559 -553 -547 -568 -588 -574 -560 -546 -532 -525 -518 -513 -509 -470 -475 -543 -611 -632 -653 -674 -696 -694 -693 -692 -691 -716 -741 -713 -686 -629 -572 -568 -564 -556 -547 -539 -531 -570 -610 -650 -690 -693 -696 -628 -534
3953e34R6N2Mk3m5p2n8n8l8l7J5J6k7k6k6k7j0rM1M1R6P0j2n6n4k8qJ9O4O4O6O6jjn4n4NM
$$ -534 -438 -386 -382 -405 -450 -522 -580 -638 -676 -713 -698 -682 -709 -735 -761 -788 -798 -807 -766 -725 -629 -559 -571 -627 -681 -709 -717 -698 -634 -570 -504 -438 -439 -440 -494 -548 -543 -539
3937e39NMj9j9j9j9m0m0l8l7j7K7N5N4N7N6N7N7%%%J%%J%MNMMopopNNMNjkkkm4m5m4m4j5j5
$$ -539 -534 -530 -549 -568 -587 -606 -646 -686 -724 -761 -778 -751 -696 -642 -585 -529 -472 -415 -415 -415 -415 -414 -414 -414 -413 -413 -409 -404 -400 -396 -402 -409 -415 -422 -417 -412 -408 -403 -404 -406 -408 -410 -454 -499 -543 -587 -602 -617
3916f17j4j5n2n2L7L6N5N5l4l3m7m7NNM2M2J9l5k9k9K0K0OPPPk0k0k0k0pqM5M5QQQQmnn5n5
$$ -617 -631 -646 -698 -750 -713 -677 -622 -567 -601 -634 -681 -728 -723 -718 -676 -634 -615 -650 -679 -708 -688 -668 -662 -655 -648 -641 -661 -681 -701 -721 -728 -736 -691 -646 -638 -630 -622 -614 -618 -623 -678 -733
3898g33p7n1rM4O3L6KKL2L2L3L2rrj0rl2l2MK9J0m4p8n1j9PN0J03J28J01K6k8k9k9l3l3m0
$$ -733 -810 -861 -870 -826 -763 -727 -725 -723 -691 -659 -626 -594 -603 -612 -622 -631 -663 -695 -691 -662 -652 -696 -774 -825 -844 -837 -787 -684 -556 -455 -429 -457 -486 -515 -548 -581 -621
3882f21m1m0m0jjjjn9n9poNNNNK9K9L0K9N6N5LLj0j1j0j0M0M1m6m5mK2L8j4m3j6J8J8K7K6
$$ -621 -662 -702 -742 -743 -744 -745 -746 -805 -864 -871 -877 -872 -867 -862 -857 -828 -799 -769 -740 -684 -629 -626 -623 -633 -644 -654 -664 -624 -583 -629 -674 -678 -656 -618 -632 -675 -691 -673 -655 -628 -602
3864f02K7K6k9k9K4K4M5M4M5M5mlmmj9j9j9j9L8L8L7L8n7n6n7n7k0j9k0k0%J%%MNMNN5N5N2
$$ -602 -575 -549 -578 -607 -583 -559 -514 -470 -425 -380 -384 -387 -391 -395 -414 -433 -452 -471 -433 -395 -358 -320 -377 -433 -490 -547 -567 -586 -606 -626 -626 -625 -625 -625 -621 -616 -612 -607 -552 -497 -445
3846d45N2Om7j8j7k1k0k1k1k5k4k5k5J4J4J3J4K7K7k6k6m0l9l6l6j6L7O0O0J8J9nmJ5O9Q8
$$ -445 -393 -387 -434 -452 -469 -490 -510 -531 -552 -577 -601 -626 -651 -637 -623 -610 -596 -569 -542 -568 -594 -634 -673 -709 -745 -761 -724 -664 -604 -586 -567 -572 -576 -561 -492 -404
3831d04Q8L0k4m6m7j7j7j7j7k0k1k0k0K3K4K6K7oM8O7O7j8p0o7o7l2l2l2l2J3J4J3J3n4n5
$$ -404 -316 -286 -310 -356 -403 -420 -437 -454 -471 -491 -512 -532 -552 -529 -505 -479 -452 -458 -410 -343 -276 -294 -364 -431 -498 -530 -562 -594 -626 -613 -599 -586 -573 -627 -682
3815f82n5n5j4j4j4j4OOONJ2J2J2J2j8j7L5L5M7M7M8M7K3K3K9K8Q8J76K04K05N1j08j76j77
$$ -682 -737 -792 -806 -820 -834 -848 -842 -836 -830 -825 -813 -801 -789 -777 -795 -812 -777 -742 -695 -648 -600 -553 -530 -507 -478 -450 -362 -186 18 223 274 166 -10 -187
3801a87n3n3n3n3o8o9j5j6M4M3M4M3n7n6n7n7jkjkL0K9k3k3k1k1NNK6K5K6K5j2j3o5o5j6j7
$$ -187 -240 -293 -346 -399 -467 -536 -551 -567 -523 -480 -436 -393 -450 -506 -563 -620 -621 -623 -624 -626 -596 -567 -590 -613 -634 -655 -650 -645 -619 -594 -568 -543 -555 -568 -633 -698 -714 -731
3784g31L7L7K7K8JKj4j3j4j3MNMNJ5J6J5J6%%j%QPQQK9K9k3k4k0k0L3L2M4M4rrN1N1N5N5J09
$$ -731 -694 -657 -630 -602 -601 -599 -613 -626 -640 -653 -649 -644 -640 -635 -620 -604 -589 -573 -573 -573 -574 -574 -566 -559 -551 -543 -514 -485 -508 -532 -552 -572 -539 -507 -463 -419 -428 -437 -386 -335 -280 -225 -116
3766a16J61K33M10N66O71Q91J349J694J377K33j070j670j494r79o63n24l47j90j37j48r6k6
$$ -116 45 278 688 1254 1925 2816 4165 5859 7236 7469 6399 4729 3235 2256 1593 1069 722 532 395 247 151 125
3756A25K7J2O5J19J20Lj04r6r7j22j22r6r6j06j06q0q0o6o7j3j4M6M5M6M6j1j1n3n3q5n8J5
$$ 125 152 164 229 348 468 471 367 271 174 52 -70 -166 -262 -368 -474 -554 -634 -700 -767 -780 -794 -748 -703 -657 -611 -622 -633 -686 -739 -824 -882 -867
3742h67N9O5L8onj8j8RQN7N7N6N7J2J2J3J2K5K5K6K5k8k9n5n5m2m2K0J9M3M3J6J6ppL7L7M6
$$ -867 -808 -743 -705 -711 -716 -734 -752 -743 -735 -678 -621 -565 -508 -496 -484 -471 -459 -434 -409 -383 -358 -386 -415 -470 -525 -567 -609 -589 -570 -527 -484 -468 -452 -459 -466 -429 -392 -346
3726c46M6on1o5l8K2K1l8o6m8nk1k1j8j8LLMLL1L2L1L2K4K5K5K5j0j0j0rJ4J4o4o5m1m1K1
$$ -346 -300 -306 -357 -422 -460 -438 -417 -455 -521 -569 -574 -595 -616 -634 -652 -649 -646 -642 -639 -608 -576 -545 -513 -489 -464 -439 -414 -424 -434 -444 -453 -439 -425 -489 -554 -595 -636 -615
3709f15K0O1O1P3M6j9o2m1m2n0p7q4m1M0Q4O2O2L0L1MMj9k0o3o3MMNMk3k3K0K1J9J9ppk9k8
$$ -615 -595 -534 -473 -400 -354 -373 -435 -476 -518 -568 -645 -729 -770 -730 -646 -584 -522 -492 -461 -457 -453 -472 -492 -555 -618 -614 -610 -605 -601 -624 -647 -627 -606 -587 -568 -575 -582 -611 -639
3692f39klK4K3K3K3mnmnl9l8PO0N6Lk5k6k6k7k6k7ononK2K3K3K3j4j4j3j4k7k6k7k7J5J5N8
$$ -639 -641 -644 -620 -597 -574 -551 -555 -560 -564 -569 -608 -646 -639 -579 -523 -520 -545 -571 -597 -624 -650 -677 -683 -688 -694 -699 -677 -654 -631 -608 -622 -636 -649 -663 -690 -716 -743 -770 -755 -740 -682
3675f82N9J4J4J4J4mnmnmnmnL9L8L8L8j7j7j7j7lmlmm2m2p1j9L2L2L5L6KLKKk6k6k6k6k6k5
$$ -682 -623 -609 -595 -581 -567 -571 -576 -580 -585 -589 -594 -598 -603 -564 -526 -488 -450 -467 -484 -501 -518 -521 -525 -528 -532 -574 -616 -687 -706 -674 -642 -607 -571 -569 -566 -564 -562 -588 -614 -640 -666 -692 -717
3656g17j0M2O6O6M4M3M1M1M1M1k9k9k9k9k2k2k3k2popok2k2k2k2j6j7j7j6K1K1J8J8L0k2n4
$$ -717 -727 -685 -619 -553 -509 -466 -425 -384 -343 -302 -331 -360 -389 -418 -440 -462 -485 -507 -514 -520 -527 -533 -555 -577 -599 -621 -637 -654 -671 -687 -666 -645 -627 -609 -579 -601 -655
3640f55n4j7j6j6j7J0J0J0J1K5K5K6K5noooK4K4K4K4O1O1L3j0m8m8n1n0k5k6K8K8MNNMl9m0
$$ -655 -709 -726 -742 -758 -775 -765 -755 -745 -734 -709 -684 -658 -633 -638 -644 -650 -656 -632 -608 -584 -560 -499 -438 -405 -415 -463 -511 -562 -612 -637 -663 -635 -607 -603 -598 -593 -589 -628 -668
3623f68l9m0K0K0K0K0J4J4J4J4j0j1j0j0NNMNk5k5%M4M1kk8k8mmnmK5K5K5K5OOOOM0M0j2j3
$$ -668 -707 -747 -727 -707 -687 -667 -653 -639 -625 -611 -621 -632 -642 -652 -647 -642 -638 -633 -658 -683 -683 -639 -598 -600 -628 -656 -660 -664 -669 -673 -648 -623 -598 -573 -567 -561 -555 -549 -509 -469 -481 -494
3605d94k5k5k4k5KKLKrqrrRRQRRRRQK5K4K5K5mmn7n7m6m6M1M2O8O8K7%m5q8p8n2nL8J5J5M8
$$ -494 -519 -544 -568 -593 -591 -589 -586 -584 -593 -601 -610 -619 -610 -601 -593 -584 -575 -566 -557 -549 -524 -500 -475 -450 -454 -458 -515 -572 -618 -664 -623 -581 -513 -445 -418 -418 -463 -551 -629 -681 -686 -648 -633 -618 -570
3585e70M8mnm7m6OOrj0rj0J8J8J8J8l3l4l4l4J7J7J7J6J4J3J3J3pqqprqM4M5L7L6j6j6k5k6
$$ -570 -522 -526 -531 -578 -624 -618 -612 -621 -631 -640 -650 -632 -614 -596 -578 -611 -645 -679 -713 -696 -679 -662 -646 -632 -619 -606 -593 -600 -608 -616 -623 -632 -640 -596 -551 -514 -478 -494 -510 -535 -561
3567e61K7K7J7J8l6l5onnnJ4J5J4J5j0j0M4M3kkkkL1L2L1L2K8K8k5k5m4m5m5m5J5J5l5l5j2
$$ -561 -534 -507 -490 -472 -508 -543 -549 -554 -559 -564 -550 -535 -521 -506 -516 -526 -482 -439 -441 -443 -445 -447 -416 -384 -353 -321 -293 -265 -290 -315 -359 -404 -449 -494 -479 -464 -499 -534 -546
3551e46M1J2J1M6M5M6M5KJn2n1J2J2M2j0m9m8n2n2nononnnnooool5l4K3P7Q1Q2L3L2l1l1l2
$$ -546 -505 -493 -482 -436 -391 -345 -300 -298 -297 -349 -400 -388 -376 -334 -344 -393 -441 -493 -545 -550 -556 -561 -567 -572 -577 -582 -587 -593 -599 -605 -611 -646 -680 -657 -580 -499 -417 -384 -352 -383 -414 -446
3532d46l1l6l6J7J7l0l1l0l0JKJKj4j3j4j3m3m3J0RJ1J0J1J0J3J2J2J2k2k2m5m5jN2P1P2N5
$$ -446 -477 -513 -549 -532 -515 -545 -576 -606 -636 -635 -633 -632 -630 -644 -657 -671 -684 -727 -770 -760 -751 -740 -730 -719 -709 -696 -684 -672 -660 -682 -704 -749 -794 -795 -743 -672 -600 -545
3516e45LrJ7M0L9j2j1k5k5K8K8J6J6j0j0l2l2l2l2l0l1n7n8m7m7OOL8L8L9L8J9K0J9K0k2k1
$$ -545 -542 -551 -534 -494 -455 -467 -478 -503 -528 -500 -472 -456 -440 -450 -460 -492 -524 -556 -588 -618 -649 -706 -764 -811 -858 -852 -846 -808 -770 -731 -693 -674 -654 -635 -615 -637 -658
3500f58m9m8m9m9k6K6Q5Q5N9N9K1l1n4n4k1k1m4m4j7L5K2mL0N7M0M1J3J3J3J3L3L2L3L3n9
$$ -658 -707 -755 -804 -853 -879 -853 -768 -683 -624 -565 -544 -575 -629 -683 -704 -725 -769 -813 -830 -795 -773 -777 -747 -690 -650 -609 -596 -583 -570 -557 -524 -492 -459 -426 -485
3485d85o0n6n6l6J7M0M0L5L5QRJ5J6J6J5klkll5l6l5l5kkkjj4j3J3J3J9J8l4l4l5l5l2l1k8
$$ -485 -545 -601 -657 -693 -676 -636 -596 -561 -526 -518 -509 -494 -478 -462 -447 -449 -452 -454 -457 -492 -528 -563 -598 -600 -602 -604 -605 -619 -632 -619 -606 -587 -569 -603 -637 -672 -707 -739 -770 -798
3467g98K4Q3Q3L3L4L3L4L5L6j7j7m0l9m0m0rj0l6l6j9k0L3L4K6K5%jK4K3mlm1m1j4j5j0rl6
$$ -798 -774 -691 -608 -575 -541 -508 -474 -439 -403 -420 -437 -477 -516 -556 -596 -605 -615 -651 -687 -706 -726 -693 -659 -633 -608 -608 -609 -585 -562 -566 -569 -610 -651 -665 -680 -690 -699 -735
3451g35l6J3J3J3J3L2L1L1L1M3M3L9M0Nm7j8j8k8k8k8k8k9k9k9k9l9m0M9M9J5J6J6J5L7L8
$$ -735 -771 -758 -745 -732 -719 -687 -656 -625 -594 -551 -508 -469 -429 -424 -471 -489 -507 -535 -563 -591 -619 -648 -677 -706 -735 -774 -814 -765 -716 -701 -685 -669 -654 -617 -579
3436e79j6j6J6J7J9l3m4m4k1k1k7k7K5K6OOk0k1ppJ9J9%JN3N3O0O0PPK3K3klm0l9j3j3J1J1
$$ -579 -595 -611 -595 -578 -559 -592 -636 -680 -701 -722 -749 -776 -751 -725 -719 -713 -733 -754 -761 -768 -749 -730 -730 -729 -676 -623 -563 -503 -496 -489 -466 -443 -445 -448 -488 -527 -540 -553 -542 -531
3418e31J1J1MLm9m9m3m3RJ0MNN4N4j1o3o0o0o5o6l4K0L2L2L5L6POPPN1N0j1j1POPOm0m0MM
$$ -531 -520 -509 -505 -502 -551 -600 -643 -686 -677 -667 -663 -658 -604 -550 -561 -624 -684 -744 -809 -875 -909 -889 -857 -825 -790 -754 -747 -741 -734 -727 -676 -626 -637 -648 -641 -635 -628 -622 -662 -702 -698 -694
3400f94QQQQPPPPJ1J1k1L2O3L6j0o2k4L0M0M0ppppnmnmj%jjj6j6j6j6j6j7j7j8k9n4p0j6j
$$ -694 -686 -678 -670 -662 -655 -648 -641 -634 -623 -612 -633 -601 -538 -502 -512 -574 -598 -568 -528 -488 -495 -502 -509 -516 -521 -525 -530 -534 -535 -535 -536 -537 -553 -569 -585 -601 -617 -634 -651 -669 -698 -752 -822 -838 -839
3381h39%MLJ2J3l1l2L2L3L2L2K9L0K9L0nnmnJ5J5J5J5l6l6l6l6j5j5J7O9J10J10N0l8p2m6
$$ -839 -839 -835 -832 -820 -807 -838 -870 -838 -805 -773 -741 -712 -682 -653 -623 -628 -633 -637 -642 -627 -612 -597 -582 -618 -654 -690 -726 -741 -756 -739 -670 -560 -450 -400 -438 -510 -556
3365e56lK5K2K2K4K3mnK1M7K4k8n9n9l6l6l6l6J4J4J3J4J6J6M2M2klm6m7o4o5J5J4RJ0RRJ8
$$ -556 -559 -534 -512 -490 -466 -443 -447 -452 -431 -384 -360 -388 -447 -506 -542 -578 -614 -650 -636 -622 -609 -595 -579 -563 -521 -479 -481 -484 -530 -577 -641 -706 -691 -677 -668 -658 -649 -640 -622
3348f22J7rrm2m2J9J9J4J5M0M1NNNNM1M1lmk8k9J5J5M3M3J6J6kkk9k9l5l5l5l6J8J8J7J8k4
$$ -622 -605 -614 -623 -665 -707 -688 -669 -655 -640 -600 -559 -554 -549 -544 -539 -498 -457 -460 -464 -492 -521 -506 -491 -448 -405 -389 -373 -375 -377 -406 -435 -470 -505 -540 -576 -558 -540 -523 -505 -529
3330e29k4k3k4K9K9l2l2n9n8q5l1L5Q9P7N1RJ0PQKKKKk9k8k9k8j1j1L4L3M2M2M2M2j0rp1p2
$$ -529 -553 -576 -600 -571 -542 -574 -606 -665 -723 -808 -839 -804 -715 -638 -587 -578 -568 -561 -553 -551 -549 -547 -545 -574 -602 -631 -659 -670 -681 -647 -614 -572 -530 -488 -446 -456 -465 -536 -608
3313f08o5o5k1k1l0l0J5J4M2M1mn7n8nP6J03N8Ol9j3L5L5Om6m7k0K4K3rrj0rL2L2L2L2OON
$$ -608 -673 -738 -759 -780 -810 -840 -825 -811 -769 -728 -732 -789 -847 -852 -776 -673 -615 -609 -648 -661 -626 -591 -585 -631 -678 -698 -674 -651 -660 -669 -679 -688 -656 -624 -592 -560 -554 -548 -543
3297e43Mk2m9o6j2L2Nk9k9K3K4K3K3mnmmj7j6NN8P3M6Om6m7m7n0n0MMMLO3O2RJ0J3J3J3J3
$$ -543 -539 -561 -610 -676 -688 -656 -651 -680 -709 -686 -662 -639 -616 -620 -625 -629 -633 -650 -666 -661 -603 -530 -484 -478 -524 -571 -618 -668 -718 -714 -710 -706 -703 -640 -578 -569 -559 -546 -533 -520 -507
3279e07j5j5j4j5j1j2j3j3l5o1k3L0M4M4noK2K1j3l9l5J8M0M0j0j0j0j0j7j8j8j7l3l3j0M3
$$ -507 -522 -537 -551 -566 -577 -589 -602 -615 -650 -711 -734 -704 -660 -616 -621 -627 -605 -584 -597 -636 -671 -653 -613 -573 -583 -593 -603 -613 -630 -648 -666 -683 -716 -749 -759 -716
3263g16L4L5L8L8MMMLK9K8K8K9j4j3j4j3l9l9l8l9K1K0K1K0k3k4k0k0J2O5M9K2l2n8m6m5j6
$$ -716 -682 -647 -609 -571 -567 -563 -559 -556 -527 -499 -471 -442 -456 -469 -483 -496 -535 -574 -612 -651 -630 -610 -589 -569 -592 -616 -636 -656 -644 -579 -530 -508 -540 -598 -644 -689 -705
3247g05j6L7L7K5K5k8k7LKk2o7m7lK2K2j0j0P8P8P8P9K6K6j5j6j6j5K8K8K8K9m6m5m6m5q3
$$ -705 -721 -684 -647 -622 -597 -625 -652 -649 -647 -669 -736 -783 -786 -764 -742 -752 -762 -684 -606 -528 -449 -423 -397 -412 -428 -444 -459 -431 -403 -375 -346 -392 -437 -483 -528 -611
3232f11q3n6j1LLNNL9L9L9L9J9K0J7J8m1o6p5l1J5M2K9K9J1J0m2m2j9k0J6M2K0k5n1n1j7j8
$$ -611 -694 -750 -761 -758 -755 -750 -745 -706 -667 -628 -589 -570 -550 -533 -515 -556 -622 -697 -728 -713 -671 -642 -613 -602 -592 -634 -676 -695 -715 -699 -657 -637 -662 -713 -764 -781 -799
3215g99L6L5K4K4K3K4J6J7J6J6J4J3J4J4k4k3k4k4J6J6J6J5O3O3O3O3PPm3m3k7J8J7k7o0o1
$$ -799 -763 -728 -704 -680 -657 -633 -617 -600 -584 -568 -554 -541 -527 -513 -537 -560 -584 -608 -592 -576 -560 -545 -482 -419 -356 -293 -286 -279 -322 -365 -392 -374 -357 -384 -444 -505
3200e05j0j0l6l6J7J7M5M5J7k7n8n8rqONNNL9L8j6j6l3n9p4k1K1K1K4K5J6J7J7J6J7J7J6J7
$$ -505 -515 -525 -561 -597 -580 -563 -518 -473 -456 -483 -541 -599 -608 -616 -610 -605 -600 -595 -556 -518 -534 -550 -583 -642 -716 -737 -716 -695 -671 -646 -630 -613 -596 -580 -563 -546 -530 -513
3183e13k8k8k7k8K3K2K2K1nl1m6ON5N6N8N8j9j9m6m6p3p2k9k9j7j7RL6M3j0m0m0j6j6j4j4
$$ -513 -541 -569 -596 -624 -601 -579 -557 -536 -541 -572 -618 -612 -557 -501 -443 -385 -404 -423 -469 -515 -588 -660 -689 -718 -735 -752 -743 -707 -664 -674 -714 -754 -770 -786 -800 -814
3168h14N1P7O6J3m4m3j4L8L3L3J0J0LKKKL1L2j7o9p0m4LK9J3J3J2J1J5l9o7o7j0M2P5P4N9
$$ -814 -763 -686 -620 -607 -651 -694 -708 -670 -637 -604 -594 -584 -581 -579 -577 -575 -544 -512 -529 -598 -668 -712 -709 -680 -667 -654 -642 -631 -616 -655 -722 -789 -799 -757 -682 -608 -549
3152e49N9k0k0noL5L5ln6p1p0m1m1MLK0K1k3k4j5j5M6P2M5qn3n3j7L6L6j7k3k4J8J7M9M9N
$$ -549 -490 -510 -530 -535 -541 -506 -471 -474 -530 -601 -671 -712 -753 -749 -746 -726 -705 -728 -752 -767 -782 -736 -664 -619 -627 -680 -733 -750 -714 -678 -695 -718 -742 -724 -707 -658 -609 -604
$$ [...]
-3135f00
##END=	
##END=	
