##TITLE=	Mar05-2018.30.fid
MN 3(1)

##JCAMP-DX=	6.0	$$ MestReNova 14.1.1-24571
##DATA TYPE=	LINK
##BLOCK_ID=	1
##BLOCKS=	1    
##ORIGIN=	Mestrelab Research S.L.
##OWNER=	hrzepa
##$MNOVA/LINK_BLOCK_TYPE=	ITEM	$$ NMR Spectrum
##$MNOVA/ITEM/POLYGON=	(XY..XY)
5321,5835
8722,5835
8722,8208
5321,8208
5321,5835
##$MNOVA/ITEM/Z=	0
##$MNOVA/ITEM/ANGLE=	0
##TITLE=	Mar05-2018.30.fid
##JCAMP-DX=	6.0	$$ MestReNova 14.1.1-24571
##BLOCK_ID=	2
##DATA TYPE=	NMR SPECTRUM
##DATA CLASS=	XYDATA
##NUMDIM=	1
##ORIGIN=	Bruker BioSpin GmbH
##OWNER=	nmr
##.OBSERVE FREQUENCY=	400.20240119999999706
##.OBSERVE NUCLEUS=	^1H
##.SOLVENT NAME=	CDCl3
##.PULSE SEQUENCE=	zg30
##LONGDATE=	2018/03/05 14:32:00.000
##.ACQUISITIONMODE=	SIMULTANEOUS (DQD)
##$ORIGINAL FORMAT=	Bruker XWIN-NMR
##$MNOVA/SCALES_VERSION=	9
##$PARAMETER FILE=	(acqus, ASCII, /Users/hrzepa/Downloads/Polysiphenol%20SI%20NMR%20Original%20Data/5/5b%20-%201H%20-%20400C.18.03.05.030/30/acqus, 0)
$$ ##TITLE= Parameter file, TOPSPIN		Version 3.2
$$ ##JCAMPDX= 5.0
$$ ##DATATYPE= Parameter Values
$$ ##NPOINTS= 11	$$ modification sequence number
$$ ##ORIGIN= Bruker BioSpin GmbH
$$ ##OWNER= nmr
$$ $$ 2018-03-05 14:32:20.973 +0000  nmr@CZC2439F63
$$ $$ /opt/topspin/data/brad/nmr/Mar05-2018/30/acqus
$$ $$ process /opt/topspin3.2/prog/mod/shimcntl
$$ ##$ACQT0= -2.36344537815126
$$ ##$AMP= (0..31)
$$ 100 100 100 100 100 100 100 100 100 100 100 100 100 100 100 100 100 100
$$ 100 100 100 100 100 100 100 100 100 100 100 100 100 100
$$ ##$AMPCOIL= (0..19)
$$ 0 0 0 0 0 0 0 0 0 0 0 0 0 0 0 0 0 0 0 0
$$ ##$ANAVPT= -1
$$ ##$AQSEQ= 0
$$ ##$AQ_mod= 3
$$ ##$AUNM= <au_zg>
$$ ##$AUTOPOS= <2 >
$$ ##$BF1= 400.2
$$ ##$BF2= 400.2
$$ ##$BF3= 400.2
$$ ##$BF4= 400.2
$$ ##$BF5= 400.2
$$ ##$BF6= 400.2
$$ ##$BF7= 400.2
$$ ##$BF8= 400.2
$$ ##$BYTORDA= 0
$$ ##$CAGPARS= (0..11)
$$ 0 0 0 0 0 0 0 0 0 0 0 0
$$ ##$CFDGTYP= 0
$$ ##$CFRGTYP= 9
$$ ##$CHEMSTR= <none>
$$ ##$CNST= (0..63)
$$ 1 1 145 1 1 1 1 1 1 1 1 1 1 1 1 1 1 1 1 1 1 1 1 1 1 1 1 1 1 1 1 1 1 1 1
$$ 1 1 1 1 1 1 1 1 1 1 1 1 1 1 1 1 1 1 1 1 1 1 1 1 1 1 1 1 1
$$ ##$CPDPRG= (0..8)
$$ <> <> <> <> <mlev> <mlev> <mlev> <mlev> <mlev>
$$ ##$D= (0..63)
$$ 0 1 0 0 0 0 0 0 0 0.06 0 0 0 0 0 0 0.0002 0 0 0 0 0 0 0 0 0 0 0 0 0 0 0
$$ 0 0 0 0 0 0 0 0 0 0 0 0 0 0 0 0 0 0 0 0 0 0 0 0 0 0 0 0 0 0 0 0
$$ ##$DATE= 1520260340
$$ ##$DE= 6.5
$$ ##$DECBNUC= <off>
$$ ##$DECIM= 2496
$$ ##$DECNUC= <off>
$$ ##$DECSTAT= 4
$$ ##$DIGMOD= 1
$$ ##$DIGTYP= 12
$$ ##$DQDMODE= 0
$$ ##$DR= 22
$$ ##$DS= 2
$$ ##$DSPFIRM= 0
$$ ##$DSPFVS= 20
$$ ##$DTYPA= 0
$$ ##$EXP= <proton>
$$ ##$F1LIST= <111111111111111>
$$ ##$F2LIST= <222222222222222>
$$ ##$F3LIST= <333333333333333>
$$ ##$FCUCHAN= (0..9)
$$ 0 2 0 0 0 0 0 0 0 0
$$ ##$FL1= 90
$$ ##$FL2= 90
$$ ##$FL3= 90
$$ ##$FL4= 90
$$ ##$FOV= 20
$$ ##$FQ1LIST= <freqlist>
$$ ##$FQ2LIST= <freqlist>
$$ ##$FQ3LIST= <freqlist>
$$ ##$FQ4LIST= <freqlist>
$$ ##$FQ5LIST= <freqlist>
$$ ##$FQ6LIST= <freqlist>
$$ ##$FQ7LIST= <freqlist>
$$ ##$FQ8LIST= <freqlist>
$$ ##$FRQLO3= 12442.5500000119
$$ ##$FRQLO3N= 2
$$ [...]
$$ 90 74 58 42 26 10 0 0
$$ ##$Sgu3PowerLevels= (0..7)
$$ 0 0 0 0 0 0 0 0
$$ ##$Sgu4PowerLevels= (0..7)
$$ 0 0 0 0 0 0 0 0
$$ ##$Sgu5PowerLevels= (0..7)
$$ 0 0 0 0 0 0 0 0
$$ ##$Sgu6PowerLevels= (0..7)
$$ 0 0 0 0 0 0 0 0
$$ ##$Sgu7PowerLevels= (0..7)
$$ 0 0 0 0 0 0 0 0
$$ ##$Sgu8PowerLevels= (0..7)
$$ 0 0 0 0 0 0 0 0
$$ ##$SguType= 3
$$ ##$ShimPowMaxUA= (0..63)
$$ 130000 130000 130000 130000 130000 130000 130000 130000 130000 130000 130000
$$ 130000 130000 130000 130000 130000 130000 130000 130000 130000 0 0 0 0
$$ 0 0 0 0 0 0 0 0 0 0 0 0 0 0 0 0 0 0 0 0 0 0 0 0 0 0 0 0 0 0 0 0 0 0 0 0
$$ 0 0 0 0
$$ ##$ShimPowMaxUC= (0..63)
$$ 130000 130000 130000 130000 130000 130000 130000 130000 130000 130000 130000
$$ 130000 130000 130000 130000 130000 130000 130000 130000 130000 0 0 0 0
$$ 0 0 0 0 0 0 0 0 0 0 0 0 0 0 0 0 0 0 0 0 0 0 0 0 0 0 0 0 0 0 0 0 0 0 0 0
$$ 0 0 0 0
$$ ##$ShimPowMaxUG= (0..63)
$$ 524287 524287 524287 524287 524287 524287 524287 524287 524287 524287 524287
$$ 524287 524287 524287 524287 524287 524287 524287 524287 524287 0 0 0 0
$$ 0 0 0 0 0 0 0 0 0 0 0 0 0 0 0 0 0 0 0 0 0 0 0 0 0 0 0 0 0 0 0 0 0 0 0 0
$$ 0 0 0 0
$$ ##$ShimPowRcbType= 3
$$ ##$ShimPowRes= (0..63)
$$ 1e-20 1e-20 1e-20 1e-20 1e-20 1e-20 1e-20 1e-20 1e-20 1e-20 1e-20 1e-20
$$ 1e-20 1e-20 1e-20 1e-20 1e-20 1e-20 1e-20 1e-20 0 0 0 0 0 0 0 0 0 0 0 0
$$ 0 0 0 0 0 0 0 0 0 0 0 0 0 0 0 0 0 0 0 0 0 0 0 0 0 0 0 0 0 0 0 0
$$ ##$ShimPowRng0= (0..63)
$$ 1 1 1 1 1 1 1 1 1 1 1 1 1 1 1 1 1 1 1 1 0 0 0 0 0 0 0 0 0 0 0 0 0 0 0 0
$$ 0 0 0 0 0 0 0 0 0 0 0 0 0 0 0 0 0 0 0 0 0 0 0 0 0 0 0 0
$$ ##$ShimPowRng1= (0..63)
$$ 1 1 1 1 1 1 1 1 1 1 1 1 1 1 1 1 1 1 1 1 0 0 0 0 0 0 0 0 0 0 0 0 0 0 0 0
$$ 0 0 0 0 0 0 0 0 0 0 0 0 0 0 0 0 0 0 0 0 0 0 0 0 0 0 0 0
$$ ##$ShimPowRng2= (0..63)
$$ 1 1 1 1 1 1 1 1 1 1 1 1 1 1 1 1 1 1 1 1 0 0 0 0 0 0 0 0 0 0 0 0 0 0 0 0
$$ 0 0 0 0 0 0 0 0 0 0 0 0 0 0 0 0 0 0 0 0 0 0 0 0 0 0 0 0
$$ ##$ShimPowRng3= (0..63)
$$ 1 1 1 1 1 1 1 1 1 1 1 1 1 1 1 1 1 1 1 1 0 0 0 0 0 0 0 0 0 0 0 0 0 0 0 0
$$ 0 0 0 0 0 0 0 0 0 0 0 0 0 0 0 0 0 0 0 0 0 0 0 0 0 0 0 0
$$ ##$ShimSysFunc= (0..63)
$$ 1 2 3 4 5 7 9 11 15 16 8 10 12 14 6 17 13 18 19 20 0 0 0 0 0 0 0 0 0 0
$$ 0 0 0 0 0 0 0 0 0 0 0 0 0 0 0 0 0 0 0 0 0 0 0 0 0 0 0 0 0 0 0 0 0 0
$$ ##$ShimSysMatrix= 0
$$ ##$ShimSysType= 1
$$ ##$TFXNUM= 0
$$ ##$TRIPLO2= 0
$$ ##$VTU= 2
$$ ##$VTUETH= <149.236.99.20>
$$ ##$VTUTY= <no>
$$ ##$WBREFAM= (0..15)
$$ 135.5 97.7 100 100 100 100 100 100 100 100 100 100 100 100 100 100
$$ ##$WBREFLM= (0..15)
$$ 0 0 0 0 0 0 0 0 0 0 0 0 0 0 0 0
$$ ##$WBREFPH= (0..15)
$$ 72.26 -67.22 0 0 0 0 0 0 0 0 0 0 0 0 0 0
$$ ##$WBSGU= (0..15)
$$ 0 0 0 0 0 0 0 0 0 0 0 0 0 0 0 0
$$ ##$XFAC= 2
$$ ##END=
$$ 
##$DECIM=	2496
##$DSPFVS=	20
##XUNITS=	HZ
##YUNITS=	ARBITRARY UNITS
##FIRSTX=	6407.6102564186803647
##LASTX=	-1605.0879904638193238
##DELTAX=	-0.12226593800080109986
##XFACTOR=	1
##YFACTOR=	0.015461463339048965929
##FIRSTY=	12.51361083984375
##MINY=	6.0248894691467285156
##MAXY=	40093.5859375
##NPOINTS=	65536
##XYDATA=	(X++(Y..Y))
$$ [...]
3316 1337 1294 1251 1290 1329 1299 1269 1265 1261 1257 1253 1276 1298 1351 1403 1354 1304 1185 1067 1069 1072 1104 1136 1216 1296 1306 1317 1317 1316 1316 1315 1298 1280 1263 1245 1204 1162 1230 1297
3311 1297 1269 1241 1213 1185 1182 1178 1174 1170 1214 1257 1301 1344 1355 1365 1375 1385 1333 1281 1284 1288 1278 1209 1173 1236 1308 1321 1314 1307 1285 1263 1208 1212 1251 1289 1331 1373 1359 1344 1296
3306 1296 1307 1381 1454 1472 1490 1493 1497 1441 1384 1393 1401 1410 1419 1457 1495 1468 1381 1260 1138 1114 1150 1211 1213 1193 1173 1192 1212 1232 1251 1271 1291 1366 1441 1431 1361 1287 1272
3302 1272 1311 1290 1214 1197 1263 1329 1337 1285 1224 1222 1278 1334 1383 1372 1299 1226 1206 1244 1283 1262 1188 1113 1114 1214 1274 1275 1256 1237 1242 1247 1215 1243 1305 1307 1248 1189 1203
3297 1203 1218 1232 1246 1229 1211 1215 1279 1349 1360 1349 1337 1363 1388 1410 1432 1386 1280 1234 1247 1264 1281 1242 1203 1178 1153 1187 1221 1246 1271 1297 1322 1375 1429 1423 1417
3293 1417 1369 1321 1332 1343 1339 1335 1330 1326 1384 1443 1403 1362 1342 1321 1360 1399 1361 1323 1337 1351 1423 1376 1336 1297 1316 1336 1297 1257 1277 1296 1257 1217 1269 1321 1373 1424
3288 1424 1433 1442 1451 1459 1459 1459 1400 1341 1405 1469 1533 1597 1650 1703 1756 1809 1893 1977 2061 2145 2273 2402 2352 2302 2234 2166 2197 2228 2289 2350 2272 2194 2082 1971 1799
3284 1799 1628 1578 1528 1478 1428 1431 1435 1438 1441 1443 1445 1348 1251 1245 1239 1233 1227 1214 1202 1190 1177 1188 1199 1210 1221 1310 1399 1389 1379 1350 1321 1292 1263 1251 1240 1287 1335 1302 1269
3279 1269 1236 1203 1196 1189 1182 1175 1173 1170 1168 1166 1231 1297 1363 1428 1535 1642 1593 1446 1316 1286 1287 1228 1194 1161 1123 1086 1068 1051 1128 1206 1205 1145 1063 1080 1213 1345
3275 1345 1441 1438 1367 1296 1278 1260 1300 1340 1281 1222 1226 1230 1234 1238 1253 1268 1283 1297 1320 1342 1365 1387 1369 1350 1332 1313 1370 1426 1344 1261 1216 1171 1186 1200 1223 1247 1270
3270 1270 1294 1304 1314 1324 1334 1318 1303 1287 1271 1260 1248 1236 1224 1250 1275 1241 1208 1255 1303 1252 1201 1209 1217 1225 1233 1266 1300 1334 1368 1339 1311 1282 1253 1315 1377 1379 1381
3266 1381 1375 1369 1363 1357 1331 1305 1279 1253 1251 1248 1345 1442 1433 1425 1357 1290 1269 1248 1287 1325 1370 1414 1360 1306 1315 1323 1332 1341 1389 1438 1427 1416 1417 1418 1420 1421 1432 1443 1455 1466 1483 1499
3261 1499 1457 1414 1425 1435 1386 1278 1222 1265 1308 1253 1172 1151 1189 1227 1279 1330 1323 1315 1278 1240 1262 1284 1296 1307 1260 1212 1230 1248 1325 1402 1385 1368 1351 1335 1334
3256 1334 1333 1332 1331 1306 1281 1256 1231 1324 1418 1373 1328 1298 1267 1296 1326 1313 1300 1287 1274 1310 1346 1382 1418 1480 1542 1564 1487 1390 1352 1334 1315 1260 1205 1288 1371 1338
3252 1338 1305 1271 1238 1293 1347 1342 1338 1319 1300 1341 1381 1356 1332 1307 1282 1319 1356 1294 1232 1272 1313 1294 1276 1240 1204 1267 1330 1374 1418 1403 1388 1317 1247 1176 1105
3248 1105 1172 1240 1307 1375 1400 1425 1390 1356 1367 1378 1334 1290 1202 1173 1210 1247 1221 1194 1168 1142 1187 1232 1276 1321 1301 1280 1263 1246 1272 1356 1386 1355 1317 1337
3244 1337 1354 1311 1300 1288 1273 1257 1264 1271 1282 1292 1306 1379 1452 1465 1432 1398 1398 1339 1268 1256 1307 1357 1373 1388 1404 1420 1375 1330 1288 1247 1201 1214 1253 1292 1301 1310 1357
3239 1357 1344 1288 1291 1316 1342 1333 1323 1374 1424 1351 1277 1269 1321 1369 1417 1465 1513 1509 1446 1416 1386 1416 1446 1476 1506 1569 1632 1691 1751 1818 1825 1810 1795 1795 1854 1913 1913 1883
3234 1883 1853 1820 1786 1770 1754 1737 1721 1694 1666 1639 1612 1577 1542 1507 1472 1472 1471 1470 1469 1483 1497 1455 1414 1359 1364 1395 1426 1419 1413 1407 1400 1392 1383 1315 1248 1250 1253 1315 1376 1395 1413
3229 1413 1490 1568 1543 1518 1493 1467 1428 1388 1408 1427 1442 1456 1471 1486 1515 1544 1514 1483 1445 1406 1367 1328 1334 1340 1346 1352 1312 1272 1371 1469 1419 1368 1317 1267 1290 1314
3225 1314 1337 1361 1341 1322 1362 1402 1368 1334 1360 1385 1398 1411 1425 1438 1418 1397 1377 1357 1343 1328 1314 1300 1313 1325 1338 1351 1383 1416 1448 1480 1484 1488 1492 1496 1475 1454
3221 1454 1493 1531 1494 1457 1519 1581 1631 1681 1671 1662 1732 1802 1812 1823 1741 1660 1678 1695 1681 1666 1652 1637 1643 1649 1655 1660 1650 1640 1629 1619 1557 1496 1533 1570 1541 1512 1542
3216 1542 1571 1539 1507 1475 1443 1452 1461 1416 1372 1294 1316 1374 1373 1276 1179 1177 1174 1197 1219 1300 1382 1332 1283 1292 1302 1333 1364 1335 1306 1263 1219 1275 1330 1354 1377 1341 1305
3212 1305 1275 1245 1314 1383 1391 1398 1406 1414 1419 1424 1429 1434 1384 1335 1344 1354 1341 1328 1315 1302 1253 1203 1212 1221 1233 1245 1257 1269 1248 1228 1267 1305 1256 1207 1257 1307 1371 1434 1399 1364
3207 1364 1271 1179 1225 1331 1382 1333 1307 1341 1337 1274 1248 1221 1248 1274 1300 1326 1366 1406 1445 1485 1416 1346 1336 1385 1404 1323 1246 1268 1329 1389 1397 1404 1358 1312 1267
3202 1267 1221 1253 1285 1318 1350 1294 1239 1282 1326 1325 1323 1322 1321 1378 1435 1433 1431 1371 1310 1294 1376 1442 1508 1520 1533 1443 1353 1323 1292 1312 1332 1352 1372 1363 1354 1285 1216 1242
3198 1242 1267 1292 1318 1304 1291 1336 1382 1377 1372 1308 1244 1207 1169 1231 1292 1300 1308 1317 1325 1283 1240 1257 1333 1387 1343 1324 1364 1383 1401 1424 1446 1421 1397 1392 1446 1467 1388 1307
3193 1307 1325 1406 1388 1293 1199 1241 1283 1326 1368 1427 1487 1487 1488 1480 1472 1465 1457 1488 1519 1451 1383 1324 1266 1267 1268 1358 1449 1479 1510 1435 1360 1417 1474 1459 1346 1232 1218
3189 1218 1238 1259 1285 1312 1316 1320 1324 1329 1346 1364 1382 1400 1406 1413 1420 1426 1431 1437 1382 1328 1269 1210 1249 1289 1317 1344 1372 1400 1372 1344 1316 1288 1305 1322 1338 1355 1423 1490 1499 1507
3184 1507 1486 1464 1443 1422 1376 1330 1344 1357 1370 1384 1397 1410 1408 1407 1346 1285 1296 1308 1320 1332 1288 1245 1201 1157 1194 1230 1266 1303 1316 1328 1341 1354 1384 1415 1346
3179 1346 1278 1312 1346 1321 1295 1257 1219 1279 1340 1301 1263 1284 1305 1380 1455 1431 1407 1333 1258 1243 1228 1224 1221 1218 1215 1242 1270 1297 1325 1372 1419 1466 1513 1513 1514 1514 1514 1503
3175 1503 1492 1482 1471 1510 1548 1528 1507 1440 1372 1364 1356 1376 1396 1357 1318 1297 1276 1255 1233 1246 1258 1270 1282 1278 1273 1268 1264 1273 1282 1291 1300 1317 1333 1291 1248 1261 1275 1288 1301
3170 1301 1284 1266 1249 1232 1248 1264 1221 1177 1207 1236 1265 1295 1356 1418 1344 1271 1250 1289 1327 1306 1314 1322 1325 1329 1334 1338 1342 1347 1363 1380 1397 1413 1423 1432 1442 1451 1431 1411 1358
3165 1358 1363 1433 1503 1478 1453 1460 1467 1474 1481 1467 1453 1346 1239 1240 1339 1416 1434 1420 1406 1389 1371 1361 1351 1340 1330 1337 1343 1345 1348 1392 1376 1356 1396 1499 1543 1486 1428 1414
3161 1414 1400 1360 1261 1203 1145 1149 1212 1289 1366 1383 1401 1446 1433 1393 1353 1390 1427 1402 1318 1246 1234 1283 1333 1405 1478 1452 1426 1413 1400 1442 1485 1509 1474 1438 1462
3156 1462 1523 1584 1547 1451 1412 1432 1415 1397 1428 1459 1431 1402 1390 1377 1365 1353 1377 1401 1425 1449 1441 1433 1369 1305 1314 1382 1395 1348 1301 1314 1349 1384 1370 1356 1343 1329
3152 1329 1353 1376 1340 1304 1311 1317 1323 1329 1340 1351 1362 1374 1436 1498 1461 1424 1366 1308 1283 1258 1319 1440 1488 1437 1380 1382 1404 1426 1461 1496 1501 1506 1459 1412 1364 1317 1371
3147 1371 1425 1402 1281 1185 1188 1308 1427 1463 1499 1436 1373 1343 1312 1281 1250 1294 1338 1382 1426 1393 1360 1356 1353 1444 1535 1527 1519 1534 1549 1505 1461 1380 1300 1318 1337
3143 1337 1352 1366 1282 1198 1236 1274 1312 1350 1363 1377 1390 1403 1439 1475 1452 1428 1388 1347 1306 1266 1262 1258 1314 1370 1396 1422 1448 1474 1494 1514 1474 1434 1469 1503 1439
3139 1439 1375 1351 1328 1305 1281 1264 1247 1289 1331 1434 1537 1561 1486 1395 1364 1353 1342 1353 1364 1346 1327 1296 1265 1292 1320 1326 1332 1338 1344 1379 1413 1448 1482 1464 1445
3135 1445 1426 1408 1421 1434 1477 1519 1533 1547 1468 1389 1329 1369 1416 1404 1326 1249 1227 1205 1269 1334 1338 1343 1338 1333 1328 1323 1297 1271 1344 1416 1485 1553 1522 1492 1520 1549 1519
3130 1519 1429 1368 1406 1444 1383 1277 1231 1284 1337 1429 1520 1553 1586 1558 1531 1503 1476 1432 1388 1373 1359 1402 1445 1428 1412 1445 1478 1452 1426 1444 1462 1480 1499 1494
3126 1494 1490 1525 1501 1472 1541 1580 1521 1393 1324 1352 1321 1250 1239 1290 1341 1305 1270 1333 1396 1395 1395 1334 1274 1279 1285 1237 1189 1152 1215 1314 1354 1346 1339 1327 1316 1274 1231
3121 1231 1288 1345 1436 1528 1560 1592 1513 1433 1414 1394 1442 1489 1519 1489 1461 1552 1643 1616 1481 1406 1389 1372 1311 1251 1289 1328 1355 1382 1409 1436 1472 1509 1546 1583
3117 1583 1602 1620 1621 1562 1517 1592 1633 1614 1533 1510 1544 1518 1425 1332 1374 1416 1446 1475 1504 1534 1538 1543 1607 1671 1656 1640 1625 1610 1601 1592 1531 1470 1418 1485 1578 1612 1598
3113 1598 1585 1568 1551 1510 1470 1488 1507 1458 1409 1459 1508 1463 1418 1431 1503 1528 1435 1379 1382 1431 1481 1534 1587 1605 1624 1642 1661 1636 1611 1587 1562 1494 1426 1497 1567
3108 1567 1554 1540 1527 1513 1467 1422 1435 1449 1454 1459 1463 1468 1432 1396 1420 1443 1456 1469 1422 1375 1368 1361 1453 1545 1512 1480 1507 1533 1532 1530 1528 1527 1484 1442 1498 1554 1530 1506 1482
3104 1482 1458 1478 1498 1517 1537 1524 1510 1556 1602 1535 1468 1401 1334 1374 1415 1455 1496 1509 1523 1536 1550 1505 1460 1475 1490 1470 1450 1430 1410 1415 1420 1425 1429 1399 1368 1436
3099 1436 1504 1457 1410 1462 1574 1611 1550 1515 1538 1531 1524 1521 1518 1486 1454 1421 1389 1352 1315 1377 1439 1474 1510 1486 1462 1389 1315 1341 1426 1450 1375 1325 1335 1379 1422 1470
3095 1470 1517 1531 1546 1560 1575 1561 1546 1532 1518 1520 1522 1465 1408 1383 1357 1431 1505 1523 1542 1561 1579 1641 1703 1627 1550 1565 1579 1653 1726 1680 1634 1647 1660 1643 1626
3091 1626 1610 1593 1586 1579 1572 1565 1586 1608 1724 1841 1773 1646 1581 1634 1654 1614 1615 1616 1582 1548 1574 1599 1635 1670 1646 1622 1587 1551 1516 1481 1400 1319 1336 1354 1334 1315
3086 1315 1296 1276 1389 1502 1516 1530 1464 1398 1470 1542 1583 1623 1604 1585 1601 1616 1632 1648 1632 1617 1602 1586 1539 1491 1503 1515 1568 1622 1617 1553 1475 1515 1613 1651
3082 1651 1592 1474 1378 1401 1453 1505 1506 1506 1506 1505 1505 1505 1453 1401 1408 1415 1448 1482 1515 1548 1484 1419 1414 1409 1364 1318 1302 1403 1461 1458 1438 1417 1456 1495 1535 1574 1525 1477 1484
3077 1484 1491 1517 1484 1470 1574 1683 1674 1521 1368 1375 1383 1390 1397 1408 1420 1490 1560 1586 1612 1578 1544 1547 1551 1554 1557 1579 1601 1623 1645 1606 1567 1551 1593 1583 1514 1504 1553
3073 1553 1614 1615 1614 1671 1717 1663 1576 1549 1530 1511 1518 1584 1628 1611 1595 1638 1674 1650 1567 1543 1553 1504 1455 1465 1531 1538 1486 1434 1444 1514 1550 1586 1551 1517 1538 1559
3068 1559 1567 1516 1465 1473 1492 1512 1531 1550 1545 1481 1417 1412 1516 1620 1662 1645 1632 1619 1603 1586 1545 1504 1519 1533 1519 1445 1371 1357 1351 1345 1309 1333 1416 1499 1486 1474
3064 1474 1449 1425 1426 1486 1530 1574 1561 1549 1540 1530 1521 1511 1522 1534 1541 1549 1587 1566 1542 1576 1627 1619 1549 1479 1430 1381 1394 1466 1536 1546 1534 1522 1555 1588 1561 1534 1563
3059 1563 1592 1617 1643 1673 1644 1614 1645 1697 1749 1746 1743 1692 1642 1525 1527 1565 1602 1588 1574 1630 1686 1683 1680 1693 1706 1660 1614 1597 1581 1564 1548 1551 1553 1556 1559 1587 1616 1585
3055 1585 1554 1550 1545 1541 1537 1600 1664 1668 1672 1663 1654 1547 1439 1520 1602 1624 1646 1653 1661 1669 1677 1725 1774 1763 1752 1763 1774 1726 1677 1643 1610 1576 1543 1570 1598 1626 1653 1650 1647 1585
3050 1585 1522 1539 1556 1573 1590 1611 1632 1653 1673 1713 1753 1793 1832 2059 2285 2401 2397 2329 2261 2185 2109 2051 1992 1934 1876 1851 1826 1794 1880 2040 2199 2299
3046 2299 2400 2445 2372 2156 1939 1842 1863 1817 1771 1753 1735 1717 1699 1696 1693 1690 1686 1701 1715 1729 1743 1679 1616 1552 1488 1463 1437 1503 1569 1649 1610 1545 1540 1571 1602
3042 1602 1638 1673 1660 1647 1634 1620 1661 1702 1742 1783 1808 1834 1761 1688 1735 1782 1730 1678 1647 1616 1585 1554 1601 1647 1635 1622 1680 1738 1737 1736 1789 1842 1835 1829 1788 1747
3037 1747 1705 1664 1691 1718 1744 1771 1750 1728 1707 1685 1690 1694 1639 1584 1577 1571 1564 1557 1569 1581 1593 1605 1632 1658 1626 1593 1600 1607 1555 1502 1508 1514 1520 1525 1609 1693 1678 1663 1672 1682 1692
3032 1692 1701 1740 1778 1725 1671 1696 1839 1888 1817 1737 1716 1753 1790 1836 1882 1829 1776 1785 1793 1861 1929 1988 2048 2008 1969 1915 1861 1808 1754 1769 1783 1797 1812 1750 1689
3028 1689 1627 1565 1625 1684 1685 1685 1733 1782 1732 1682 1724 1767 1824 1763 1752 1861 1962 1945 1924 1902 1874 1845 1862 1879 1895 1912 1855 1797 1740 1682 1720 1757 1794 1831
3024 1831 1804 1777 1750 1722 1730 1738 1746 1754 1790 1826 1862 1899 1936 1974 1986 1880 1821 1881 1926 1971 1950 1930 1909 1888 1873 1857 1901 1944 1957 1969 1981 1993 2066 2138 2283
3019 2283 2427 2766 3303 3812 4045 3872 3501 3132 2764 2521 2397 2345 2292 2323 2354 2355 2357 2237 2118 1999 1879 1895 1911 1868 1824 1852 1879 1906
3016 1906 1933 1916 1898 1829 1760 1707 1773 1780 1787 1764 1860 1964 1948 1905 1981 2088 2196 2241 2404 2627 2849 2952 2856 2654 2452 2355 2258 2169 2079 2016 2071
3012 2071 2238 2404 2653 2902 3163 3226 3054 2882 2668 2454 2317 2180 2102 2025 1949 1874 1897 1920 1946 1972 1978 1924 1873 1920 1967 1916 1783 1709 1734
3009 1734 1759 1799 1840 1821 1802 1723 1645 1665 1685 1707 1730 1723 1716 1689 1663 1665 1668 1648 1627 1739 1851 1848 1746 1667 1647 1698 1749 1745 1741 1775 1810 1814 1819 1800 1781 1822 1862
3004 1862 1918 1975 1994 1915 1829 1843 1884 1826 1708 1649 1729 1808 1829 1850 1871 1892 1869 1847 1825 1802 1773 1744 1716 1687 1669 1651 1633 1616 1584 1553 1582 1610 1602 1594 1615
3000 1615 1637 1588 1540 1591 1642 1665 1688 1711 1734 1766 1798 1753 1610 1490 1470 1486 1503 1531 1558 1615 1672 1668 1664 1660 1656 1644 1632 1679 1726 1669 1612 1654 1696 1726 1757
2996 1757 1787 1817 1758 1699 1699 1699 1700 1701 1731 1761 1666 1571 1615 1658 1690 1722 1754 1786 1828 1869 1851 1833 1778 1723 1698 1673 1691 1710 1738 1706 1635 1663 1731 1798 1821 1843
2991 1843 1865 1888 1808 1729 1748 1768 1711 1655 1658 1661 1692 1724 1730 1736 1763 1849 1932 1915 1809 1763 1815 1867 1887 1907 1963 2019 2034 2148 2338 2469 2462 2455 2473 2492 2361
2987 2361 2230 2198 2166 2153 2141 2159 2176 2209 2242 2374 2506 2510 2515 2490 2464 2402 2340 2337 2334 2173 2012 2029 2046 1949 1852 1785 1718 1659 1601 1680 1760 1749 1738 1698
2983 1698 1657 1590 1523 1634 1744 1748 1751 1811 1870 1794 1659 1637 1713 1739 1706 1680 1712 1701 1691 1684 1677 1684 1691 1698 1705 1708 1710 1771 1833 1808 1782 1816 1851 1857 1863 1869 1875 1841 1807 1803
2978 1803 1799 1704 1608 1691 1833 1844 1756 1694 1691 1671 1651 1733 1816 1842 1869 1896 1922 1863 1804 1843 1883 1908 1932 1928 1923 1868 1814 1760 1705 1689 1673 1686 1700 1688 1676 1724
2974 1724 1771 1793 1815 1837 1860 1809 1758 1806 1854 1815 1775 1795 1814 1760 1706 1790 1874 1849 1824 1898 1972 1971 1970 1969 1967 1941 1914 1986 2058 1988 1918 1947 1976 1972 1967 2016 2065
2969 2065 2054 1945 1891 1936 1945 1895 1904 1972 1990 1910 1885 1919 1912 1905 1979 2151 2243 2236 2255 2274 2228 2084 1995 2005 1990 1916 1903 1950 1950 1890 1867 1944 2039 2074 2142 2210
2965 2210 2245 2163 2109 2116 2153 2130 2145 2160 2127 2093 2119 2145 2145 2145 2240 2335 2416 2437 2614 3069 3560 3774 3702 3432 3086 2798 2612 2544 2504 2404 2342
2961 2342 2398 2479 2619 2902 3382 3834 4009 3893 3580 3149 2778 2590 2522 2444 2365 2294 2223 2099 1975 1995 2133 2163 2075 1991 2025 2039 1994 1953
2957 1953 1971 1969 1908 1942 2036 2011 1867 1853 2037 2160 2165 2174 2303 2407 2392 2392 2591 2779 2848 2918 3106 3203 3102 2980 2918 2837 2637 2393 2347 2349 2292
2954 2292 2262 2429 2652 2758 2870 2983 3027 2873 2657 2560 2517 2356 2202 2167 2195 2222 2217 2270 2340 2291 2212 2193 2224 2136 2045 2072 2156 2122 2087 2171
2950 2171 2241 2193 2122 2111 2137 2103 2032 2080 2094 1989 1898 2006 2134 2144 2057 2030 2053 2016 1980 2003 2032 2002 1935 1986 2121 2137 2127 2176 2268 2240 2183 2186 2223
2946 2223 2141 2056 2089 2139 2071 2007 2061 2142 2164 2126 2148 2182 2097 2009 2039 2108 2059 1953 1967 2041 2056 2037 2138 2231 2205 2120 2154 2205 2138 2026 2111 2218
2942 2218 2206 2100 2113 2183 2134 1993 1972 2052 2133 2180 2287 2358 2310 2199 2206 2290 2255 2214 2293 2439 2388 2243 2216 2345 2355 2265 2295 2394 2374 2290 2325
2938 2325 2478 2433 2258 2202 2305 2347 2258 2287 2351 2295 2195 2293 2456 2499 2373 2366 2500 2574 2615 2775 3022 3151 3235 3518 3931 4225 4244 4203
2935 4203 4138 3875 3462 3247 3254 3143 2937 2929 3149 3310 3378 3565 3915 4068 3951 3835 3814 3596 3241 3004 3010 2956 2770 2702 2836 2851 2728
2931 2728 2724 2836 2829 2634 2637 2836 2836 2629 2541 2718 2775 2540 2424 2586 2688 2579 2589 2816 2925 2816 2826 3056 3168 2982 2916 3110 3187 2928
2928 2928 2728 2830 2932 2819 2766 2961 3037 2817 2716 2915 3054 2903 2871 3138 3286 3139 3051 3279 3508 3403 3357 3576 3677 3441 3324
2925 3324 3599 3815 3695 3576 3761 3945 3754 3563 3761 3960 3820 3740 4034 4209 4004 3918 4319 4601 4344 4087 4404 4720 4581 4443
2922 4443 4776 5110 4909 4709 5033 5358 5121 5003 5498 5993 5803 5613 6130 6648 6434 6162 6543 7043 6899 6755 7442 8129 8004
2919 8004 7880 8594 9308 9026 8744 9530 10515 10511 10507 11756 13203 13372 13343 14724 16224 16263 16301 18370 20794 21560 22840 27431 33249
2916 33249 37390 43470 56542 74876 98269 141641 221302 320072 383612 368779 288459 195993 130697 92975
2915 92975 67428 48488 37870 32356 26506 20537 17353 15790 12903 9501 7969 7584 6059 4020 3479 3848 3364
2913 3364 2365 2429 3087 2813 1945 1903 2376 2195 1578 1703 2185 1971 1323 1322 1756 1634 1076 1101 1483 1397 955 1047 1496 1506 1159 1239
2909 1239 1595 1538 1204 1321 1714 1645 1219 1205 1546 1556 1210 1170 1408 1345 1005 1041 1353 1360 1089 1125 1358 1285 1013 1068 1400 1431 1184
2906 1184 1155 1403 1416 1153 1117 1279 1275 1073 1079 1362 1429 1218 1230 1440 1444 1172 1152 1409 1531 1375 1329 1481 1487 1294 1201 1306 1301 1098 1103 1385
2902 1385 1504 1345 1265 1383 1413 1245 1181 1314 1369 1305 1346 1504 1545 1467 1483 1618 1627 1437 1382 1524 1584 1446 1452 1576 1564 1355 1279 1401 1451
2899 1451 1304 1296 1485 1616 1549 1542 1732 1802 1673 1545 1614 1669 1526 1442 1556 1649 1544 1488 1552 1595 1520 1499 1597 1682 1569 1457 1542 1616 1571 1531
2895 1531 1610 1651 1572 1494 1535 1554 1455 1370 1484 1590 1577 1564 1670 1760 1652 1588 1644 1660 1558 1456 1472 1529 1468 1466 1582 1663 1624 1586 1666 1682 1580
2891 1580 1537 1612 1669 1607 1545 1602 1711 1701 1632 1682 1726 1651 1576 1620 1704 1670 1636 1721 1737 1634 1535 1555 1622 1629 1637 1703 1728 1634 1536 1557 1566 1456 1395 1532
2887 1532 1691 1652 1567 1600 1654 1648 1642 1695 1777 1740 1733 1785 1846 1788 1727 1784 1882 1861 1840 1937 2004 1952 1844 1855 1914 1913 1912 1970 1997 1906 1811 1835 1889 1824 1760 1814
2883 1814 1912 1892 1777 1780 1815 1791 1788 1903 2041 1981 1834 1806 1835 1864 1860 1915 1921 1809 1694 1697 1799 1783 1675 1686 1744 1802 1793 1903 2008 1995 1886 1896
2879 1896 1999 2043 1991 1999 2073 2088 2042 1995 1987 1978 1966 1954 1974 1934 1854 1892 1983 1956 1869 1901 2000 1980 1896 1812 1813 1814 1774 1794 1829 1745 1662 1697 1857 1958 1961 1964
2875 1964 1950 1936 1824 1712 1677 1642 1667 1692 1702 1712 1681 1709 1785 1742 1643 1663 1768 1874 1888 1902 1914 1927 1940 1953 2037 2121 2067 2013 2059 2105 2092 2079
2871 2079 2091 2103 2056 2009 2024 2040 1997 1953 1939 1925 1910 1896 1912 1929 1886 1843 1878 1913 1849 1786 1860 1935 1911 1887 1911 1935 1900 1864 1868 1871 1874 1877 1868 1859 1791 1723 1750
2866 1750 1777 1745 1713 1753 1793 1735 1676 1676 1675 1675 1674 1780 1885 1852 1820 1898 1976 1995 2014 1956 1898 1840 1782 1852 1921 1931 1941 1955 1969 2035 2101 2193 2166 2074 2041
2862 2041 2111 2182 2117 2053 2069 2084 2100 2116 2159 2201 2185 2110 2043 2094 2173 2253 2256 2259 2203 2146 2182 2217 2153 2090 2089 2088 2028 1967 1926 1884 1901 1919 1917 1915 1913 1912 1896 1881
2857 1881 1925 1969 2024 2079 1996 1913 1932 1952 1971 1991 1972 1953 1875 1797 1783 1769 1755 1741 1770 1799 1769 1739 1825 1911 1935 1900 1846 1851 1915 1979 2035 2032 1964 1895 1920
2853 1920 1945 1911 1877 1851 1826 1800 1775 1797 1820 1787 1754 1802 1908 1920 1872 1840 1868 1914 1960 1977 1934 1891 1908 1937 1967 1905 1843 1863 1944 2024 2045 2061 2078 2091
2849 2091 2104 2129 2155 2121 2087 2046 2005 1990 2034 2094 2153 2115 2017 1975 1992 2028 2064 2141 2160 2073 1987 2008 2029 1991 1893 1861 1928 1973 1958 1952 2005 2054 2044 2032 2021
2845 2021 2006 1991 1995 2000 1982 1904 1825 1804 1848 1951 2041 2072 2044 2016 2020 2082 2145 2148 2154 2159 2160 2162 2183 2204 2166 2128 2147 2166 2124 2022 1941 1920 1962 2064 2198 2272
2840 2272 2243 2154 2096 2097 2061 2025 2043 2061 2079 2097 2106 2114 2093 2072 2033 1993 2053 2112 2117 2122 2098 2073 2165 2257 2250 2244 2196 2149 2131 2113 2140 2167 2095 2023 1980 1938 1926 1913
2835 1913 1990 2067 2085 2103 2093 2083 2073 2062 2127 2192 2158 2124 2131 2138 2119 2101 2093 2145 2175 2086 2014 2001 2085 2170 2199 2228 2162 2096 2100 2164 2209 2135 2059 2102 2203 2245
2831 2245 2208 2172 2191 2211 2239 2268 2238 2207 2244 2280 2257 2234 2219 2205 2249 2294 2368 2442 2545 2649 2703 2756 2758 2760 2768 2895 3018 3081 3066 3051 3127 3203 3305
2827 3305 3347 3315 3164 2996 2887 2774 2601 2428 2314 2261 2209 2218 2226 2235 2243 2201 2159 2117 2075 2084 2093 2103 2112 2078 2044 2068 2093 2064 2034 2034 2034 2103 2172 2181 2191 2228
2823 2228 2265 2243 2221 2185 2149 2213 2276 2249 2222 2196 2169 2176 2183 2189 2196 2151 2106 2061 2016 2025 2033 2041 2049 2136 2222 2250 2277 2237 2197 2187 2177 2233 2289 2315 2342 2302 2263 2322
2818 2322 2382 2415 2447 2381 2315 2287 2258 2230 2202 2181 2159 2196 2234 2297 2361 2432 2384 2324 2265 2297 2329 2333 2338 2343 2348 2354 2360 2367 2373 2438 2503 2598 2692 2687 2681 2735 2788 2857 2925
2813 2925 3053 3181 3360 3538 3680 3821 3881 3823 3693 3563 3474 3385 3362 3339 3350 3479 3601 3723 3846 3969 4091 4214 4279 4344 4387 4430 4649
2810 4649 4987 5122 4900 4392 3883 3503 3242 3070 2899 2794 2689 2591 2494 2547 2719 2827 2936 2913 2890 2872 2855 2837 2819 2832 2844 2857 2869
2807 2869 2817 2766 2813 2860 2975 3091 3108 3067 3039 3129 3279 3311 3290 3328 3422 3456 3430 3463 3641 3819 3999 4239 4596 5071 5625 6179 6772 7484
2803 7484 8273 9061 9818 10377 10778 10980 11079 11060 10933 10608 10086 9367 8544 7780 7158 6596 6054 5572 5159 4746 4401 4056 3849 3642
2800 3642 3443 3243 3076 2969 2930 3010 3119 3169 3205 3241 3273 3305 3279 3253 3287 3320 3182 3044 3044 3044 2993 2941 2957 3092 3227 3303 3360 3417 3460 3504 3448
2796 3448 3393 3264 3136 3142 3149 3095 2981 2933 3004 3195 3387 3514 3522 3447 3371 3288 3205 3183 3160 3138 3115 3141 3166 3196 3225 3304 3442 3737 4151 4646 5142
2793 5142 5517 5774 5845 5659 5242 4687 4158 3766 3473 3180 2981 2882 2865 2848 2825 2802 2839 2875 2811 2747 2781 2816 2812 2808 2804 2800 2719 2638 2656 2674 2657
2789 2657 2640 2623 2606 2609 2612 2675 2737 2766 2795 2764 2734 2670 2606 2601 2596 2657 2718 2680 2642 2583 2524 2465 2406 2437 2469 2500 2531 2573 2614 2655 2696 2749 2801 2794 2787 2738 2689
2784 2689 2639 2590 2584 2578 2632 2685 2689 2693 2756 2819 2856 2893 2930 2967 2970 2972 2916 2859 2767 2675 2721 2767 2773 2780 2727 2674 2650 2626 2601 2577 2579 2580 2642 2703 2764 2825 2787 2750 2738
2780 2738 2726 2715 2703 2685 2667 2650 2632 2668 2705 2742 2778 2799 2819 2840 2861 2883 2905 2868 2831 2846 2861 2876 2891 2834 2776 2896 3016 3124 3232 3280 3329 3274
2776 3274 3218 3163 3108 3077 3047 3016 2986 2958 2930 2962 2993 3030 3066 3202 3337 3324 3312 3299 3286 3192 3098 3004 2909 2855 2802 2847 2892 2844 2796 2808 2820 2905 2991
2772 2991 3017 3043 2999 2955 2970 2985 2982 2979 2977 2974 2972 2971 3029 3087 3091 3095 3040 2984 2911 2837 2862 2887 2907 2927 2947 2967 2993 3019 3045 3071 3062 3054 3045 3036 2980 2923 2925 2928 2957 2986 3015
2767 3015 3044 2992 2941 2949 2957 2927 2898 2928 2958 3022 3087 3151 3216 3256 3297 3337 3378 3418 3459 3499 3540 3508 3476 3444 3413 3381 3349 3317 3285 3240 3196 3151 3106 3195 3283
2762 3283 3313 3342 3350 3358 3307 3256 3200 3145 3150 3154 3185 3216 3247 3278 3313 3348 3383 3417 3558 3698 3839 3979 4148 4317 4486 4655 4723 4791 4826 4743 4563 4382
2758 4382 4266 4268 4289 4310 4397 4485 4622 4759 4956 5152 5243 5334 5323 5311 5146 4920 4728 4655 4597 4658 4830 5002 5055 4988 4886 4784 4681 4520
2755 4520 4325 4248 4242 4237 4238 4240 4368 4496 4684 4871 4882 4893 4896 4900 4849 4679 4538 4458 4362 4207 4117 4146 4280 4355 4412 4468 4549 4630 4707 4785 4770 4696 4644
2751 4644 4711 4765 4761 4763 4825 4871 4918 4968 5018 5071 5123 5228 5333 5402 5353 5232 5111 5079 5047 5074 5102 5115 5128 5200 5273 5295 5317 5357 5457 5518 5460 5341
2747 5341 5281 5268 5255 5303 5411 5504 5477 5425 5432 5504 5518 5508 5499 5490 5481 5471 5462 5517 5571 5626 5681 5778 5875 5873 5871 5921 5971 6021 6071 6064 6058 5992 5927 6048 6169 6230 6292
2743 6292 6345 6399 6551 6703 6781 6859 6937 7015 7074 7133 7192 7251 7338 7425 7612 7798 7952 8106 8260 8414 8548 8683 8817 8951 9026 9101 9248 9513
2739 9513 9804 10096 10427 10876 11321 11765 12158 12551 13018 13484 13996 14626 15378 16328 17747 19840 22441 25399 28732 32422 35910
2737 35910 38172 38548 37460 35677 33894 32247 30797 29786 29448 30143 31985 34809 38385 42628 47623 52940 57585 60534
2734 60534 61465 60735 58857 55961 52154 48031 44342 41672 40071 39231 39064 39544 40618 42213 44561 48035 53053 60108
2732 60108 70131 84663 105248 132983 167879 207794 246640 275391 286063 276404 250960 217890 184702 156405
2730 156405 135505 122744 117934 120917 132091 152008 180352 214774 249789 276904 287206 276223 246843 207288
2729 207288 166428 130088 100671 78352 62166 50505 42049 35950 31552 28317 25912 24123 22848 21925 21436 21600
2727 21600 22754 24842 27761 31305 35047 38285 40297 40470 38625 34941 30188 25522 21529 18277 15540 13258 11490
2725 11490 10281 9427 8718 8127 7677 7424 7308 7192 6898 6604 6557 6945 7497 8048 8438 8708 8814 8642 8240 7641 6885 6130 5394
2722 5394 4776 4250 3843 3556 3387 3258 3129 2917 2704 2492 2279 2226 2173 2120 2067 2114 2160 2207 2254 2292 2330 2376 2303 2223 2144 2057 1971 1870
2718 1870 1770 1808 1846 1920 1994 1969 1943 1944 1945 1946 1947 1971 1996 1961 1926 1959 1992 2025 2058 2068 2079 2090 2101 2077 2054 2030 2006 2058 2109 2161 2212 2256 2301 2411 2404 2327
2714 2327 2250 2165 2081 2047 2014 1980 1946 1924 1903 1940 1978 2061 2144 2287 2430 2468 2506 2485 2464 2421 2379 2337 2295 2281 2266 2311 2356 2322 2288 2313 2338 2363 2388
2710 2388 2412 2437 2485 2534 2523 2512 2413 2314 2353 2393 2418 2443 2467 2492 2540 2588 2635 2683 2675 2667 2659 2652 2577 2503 2527 2552 2627 2703 2778 2853 2913 2974 3034 3095 3221 3346
2706 3346 3530 3774 4029 4165 4188 4151 4094 4036 3975 3913 3828 3743 3632 3580 3672 3882 4029 4177 4338 4500 4598 4499 4335 4231 4140 4049 3936 3824
2702 3824 3810 3796 3682 3567 3453 3339 3335 3330 3385 3439 3508 3576 3743 3910 4096 4281 4407 4533 4727 4921 5228 5594 6032 6589 7315 8239
2699 8239 9344 10567 11878 13189 14521 15912 17245 18222 18528 18082 17072 15865 14783 13899 13327 13110 13273 13793 14525 15454
2697 15454 16443 17550 18662 19577 19968 19529 18160 16276 14325 12493 10853 9333 8089 7201 6591 6100 5637 5234 4913 4652
2694 4652 4486 4379 4302 4224 4143 4062 4079 4096 4179 4262 4345 4428 4546 4665 4724 4783 4787 4792 4804 4816 4853 5008 5251 5613 6049 6545 7165 7904 8751
2691 8751 9598 10386 11173 11959 12625 12938 12816 12269 11524 10708 9952 9420 9164 9147 9407 9903 10597 11333 12010 12686 13422 13973 13930 13214
2688 13214 12064 10752 9441 8218 7115 6216 5515 4936 4475 4148 3880 3647 3473 3335 3256 3216 3175 3139 3102 3043 2984 3024 3064 3044
2685 3044 3025 3005 2986 2983 2981 3078 3175 3302 3430 3557 3685 3702 3720 3678 3636 3488 3340 3290 3241 3243 3244 3276 3307 3361 3415 3568 3720 3804 3888 3834 3780 3705
2681 3705 3631 3616 3601 3571 3541 3482 3422 3424 3425 3397 3369 3262 3156 3149 3142 3171 3200 3229 3258 3278 3297 3375 3454 3478 3501 3525 3548 3629 3710 3821 3932 4068 4205
2677 4205 4401 4597 4909 5222 5666 6110 6510 6792 6983 7055 7011 6848 6530 6213 5937 5721 5590 5578 5616 5773 6022 6389 6785 7180
2674 7180 7428 7558 7557 7496 7363 7172 6979 6906 7039 7291 7617 8061 8694 9603 10967 12766 14955 17501 20339 23295 26063 28159
2671 28159 29254 29282 28370 26627 24338 21930 19745 18074 17022 16643 16961 17952 19420 21165 22845 24249 25046 25092 24272 22622
2669 22622 20375 17852 15289 12924 10899 9309 8076 7119 6379 5836 5424 5070 4797 4524 4353 4182 3925 3668 3443 3336
2666 3336 3355 3373 3300 3227 3157 3087 3047 3006 2943 2880 2816 2753 2746 2739 2672 2606 2587 2568 2609 2649 2619 2589 2559 2529 2510 2490 2530 2569 2630 2691 2692 2693 2655 2617 2717 2817
2662 2817 2816 2815 2873 2932 2931 2930 2962 3112 3380 3649 3865 4081 4318 4554 4761 4968 5153 5338 5452 5446 5387 5327 5359 5391 5311 5232 5212 5192 5203 5214 5284
2658 5284 5355 5418 5481 5485 5488 5420 5352 5224 5097 4824 4550 4336 4122 3897 3671 3505 3339 3308 3276 3245 3213 3165 3116 3127 3137 3169 3201 3292 3383 3319
2654 3319 3255 3295 3454 3604 3635 3642 3648 3654 3660 3665 3671 3614 3556 3499 3441 3469 3497 3525 3553 3531 3509 3547 3585 3616 3647 3619 3591 3523 3454 3385 3316 3244 3172 3198 3225 3174
2650 3174 3123 3211 3299 3359 3419 3509 3599 3734 3869 4143 4476 4722 4870 4914 4860 4727 4594 4553 4513 4445 4377 4408 4439 4506 4573 4738 4963 5173 5284
2646 5284 5386 5488 5506 5386 5165 4944 4756 4569 4440 4312 4229 4146 4063 3981 3922 3863 3903 3943 3936 3929 3921 3914 3813 3711 3748 3785 3781 3777 3833 3888 3963 4037
2643 4037 4053 4068 4099 4131 4162 4193 4186 4178 4230 4282 4297 4312 4327 4341 4451 4561 4611 4661 4650 4640 4658 4677 4700 4723 4686 4649 4702 4755 4901 5047 5156 5166 5140
2639 5140 5172 5244 5316 5422 5528 5633 5738 5872 6007 6158 6309 6519 6729 6962 7196 7423 7651 7846 7942 7996 8049 8111 8174 8178 8181 8363 8545
2635 8545 8794 9043 9336 9748 10123 10498 10722 10947 11172 11396 11608 11820 12225 12828 13610 14511 15673 17192 19151 21466 24236
2633 24236 27362 30590 33540 35838 37147 37425 36714 35380 33849 32389 31206 30493 30373 30919 32136 33965 36387 39099
2630 39099 41810 44000 45438 46020 45771 44869 43770 42794 42174 42157 42893 44648 47551 51879 58065 66720 78579 94552 115471
2628 115471 141722 172682 205961 237459 262027 275162 274504 260830 237737 210252 183430 160999 145151 136779
2626 136779 136172 143359 157952 178837 203749 228661 248573 258635 255896 240378 214782 183608 151515 122151
2625 122151 97411 77695 62534 51131 42523 35933 30697 26530 23057 20020 17240 14816 12746 11032 9610 8465
2623 8465 7608 6949 6389 6026 5830 5752 5687 5503 5190 4876 4495 4115 3739 3363 3086 2808 2546 2284 2021 1759 1675 1591 1508 1424 1394
2620 1394 1365 1336 1306 1276 1246 1216 1186 1237 1287 1238 1190 1164 1138 1112 1086 1024 962 999 1036 1111 1186 1122 1059 1054 1050 1046 1041 1033 1025 1017 1009 1076 1143 1151 1100 1046 1092 1217
2615 1217 1341 1334 1326 1319 1311 1259 1208 1156 1104 1143 1182 1220 1259 1318 1378 1378 1378 1375 1371 1309 1246 1166 1087 1067 1047 1084 1121 1157 1194 1203 1211 1219 1228 1146 1064 1081 1098 1132 1167 1201
2610 1201 1235 1199 1163 1067 972 1047 1122 1098 1074 1121 1167 1155 1142 1107 1071 1036 1000 992 984 976 967 1051 1135 1160 1184 1188 1191 1195 1198 1227 1255 1283 1311 1364 1417 1371 1325 1257
2606 1257 1189 1180 1171 1186 1202 1277 1352 1315 1279 1301 1324 1306 1287 1269 1251 1287 1323 1300 1276 1311 1346 1321 1297 1357 1417 1398 1280 1181 1141 1121 1100 1146 1192 1237 1283
2601 1283 1201 1119 1097 1075 1161 1247 1273 1300 1236 1173 1169 1164 1123 1081 1039 998 1020 1043 1066 1088 1138 1188 1178 1169 1226 1283 1281 1279 1239 1199 1159 1119 1103 1088 1073 1057 1077
2597 1077 1096 1175 1254 1261 1268 1275 1282 1282 1283 1224 1165 1197 1230 1262 1294 1277 1260 1302 1344 1416 1488 1421 1355 1357 1360 1363 1365 1459 1553 1608 1564 1474 1443 1472 1501 1520 1539 1499 1459
2592 1459 1480 1501 1523 1544 1508 1471 1435 1398 1391 1384 1378 1371 1493 1614 1637 1601 1578 1655 1734 1714 1661 1707 1863 1959 1941 1923 2000 2077 2152 2227 2199 2171 2021 1812
2588 1812 1644 1575 1638 1760 1888 1957 1948 1940 1964 2087 2233 2280 2171 2062 1970 1879 1788 1697 1718 1740 1662 1585 1580 1576 1513 1449 1451 1453 1455 1457 1418 1380 1400 1421 1509
2583 1509 1598 1627 1656 1675 1695 1615 1535 1489 1443 1456 1469 1471 1472 1473 1475 1453 1430 1468 1505 1538 1571 1466 1361 1382 1403 1424 1445 1434 1423 1411 1400 1386 1373 1418 1464
2579 1464 1531 1597 1604 1612 1641 1670 1799 1927 1986 2044 2043 2042 1987 1932 1877 1821 1786 1751 1716 1681 1723 1764 1865 1966 2054 2142 2323 2503 2610 2617 2582 2546 2607
2575 2607 2668 2729 2791 2742 2693 2644 2595 2538 2480 2423 2365 2339 2312 2289 2266 2347 2486 2599 2594 2526 2458 2382 2306 2123 1940 1855 1771 1709 1647 1585 1523 1465 1408
2571 1408 1411 1413 1407 1401 1394 1388 1362 1337 1319 1301 1258 1334 1474 1614 1644 1555 1440 1385 1395 1405 1418 1432 1389 1346 1302 1259 1280 1301 1322 1344 1398 1452 1506 1560 1556 1552 1456
2567 1456 1361 1326 1410 1460 1451 1383 1314 1302 1289 1348 1406 1366 1325 1362 1400 1378 1356 1367 1379 1390 1401 1413 1424 1435 1446 1461 1476 1439 1402 1442 1600 1703 1687 1627
2562 1627 1627 1623 1560 1507 1514 1544 1573 1586 1598 1611 1624 1639 1654 1768 1882 1832 1782 1731 1681 1668 1655 1701 1747 1691 1635 1587 1538 1469 1518 1639 1760 1720 1680 1698
2558 1698 1776 1819 1743 1645 1607 1625 1642 1604 1566 1510 1454 1428 1402 1443 1484 1466 1388 1331 1373 1415 1456 1420 1383 1406 1429 1505 1580 1557 1533 1520 1507 1524 1541 1574
2554 1574 1607 1671 1734 1703 1672 1672 1671 1678 1685 1751 1818 1863 1909 1984 2059 2079 2099 1987 1875 1806 1835 1902 1910 1895 1881 1962 2043 2054 2065 2106 2147 2185 2223 2161 2100 2008
2550 2008 1916 1923 1930 1924 1917 1990 2161 2334 2447 2541 2634 2729 2824 2859 2895 2889 2884 2780 2676 2625 2574 2582 2591 2701 2811 2922 3032 3091 3149 3147 3006 2776 2545
2546 2545 2444 2344 2250 2157 2063 1970 1936 1901 1867 1833 1761 1690 1678 1666 1759 1851 1885 1919 1833 1748 1723 1697 1763 1829 1821 1714 1646 1716 1834 1892 1837 1781 1781
2542 1781 1781 1804 1826 1789 1752 1636 1519 1542 1564 1578 1593 1608 1623 1567 1510 1454 1398 1395 1391 1447 1503 1501 1499 1527 1555 1555 1555 1555 1556 1538 1520 1502 1484 1481 1478 1475 1472 1485 1497 1510
2537 1510 1523 1535 1548 1561 1574 1593 1613 1632 1652 1692 1733 1773 1814 1840 1867 1835 1802 1736 1670 1703 1736 1764 1792 1761 1730 1639 1549 1558 1567 1546 1525 1534 1543 1535 1528 1550 1573
2532 1573 1562 1551 1481 1411 1411 1410 1410 1410 1399 1388 1378 1367 1381 1395 1409 1423 1377 1331 1285 1240 1308 1375 1443 1511 1518 1525 1531 1538 1483 1427 1432 1436 1499 1562 1566 1570 1526 1482 1576 1670
2527 1670 1616 1561 1506 1452 1417 1382 1407 1431 1458 1485 1512 1539 1490 1440 1390 1340 1305 1270 1293 1317 1332 1348 1462 1576 1614 1652 1630 1609 1521 1434 1406 1378 1365
2523 1365 1353 1370 1388 1381 1374 1368 1361 1396 1430 1406 1381 1334 1288 1340 1392 1418 1444 1470 1496 1483 1471 1459 1446 1425 1404 1383 1362 1337 1313 1288 1263 1281 1298 1257 1215 1312
2519 1312 1410 1448 1486 1502 1518 1504 1491 1481 1472 1463 1454 1424 1394 1464 1533 1550 1566 1484 1402 1393 1383 1403 1424 1475 1527 1579 1631 1594 1558 1521 1484 1474 1464 1454 1444 1407
2515 1407 1369 1362 1354 1424 1493 1503 1513 1459 1404 1448 1492 1492 1492 1491 1491 1478 1465 1452 1440 1455 1471 1486 1502 1433 1365 1356 1347 1359 1370 1382 1394 1396 1397 1362 1386 1395 1344 1331 1318 1354
2510 1354 1390 1423 1455 1486 1458 1463 1469 1454 1439 1390 1401 1431 1460 1438 1415 1381 1405 1452 1499 1488 1418 1374 1389 1390 1330 1275 1279 1325 1372 1363 1354 1318 1283 1214 1204 1265 1326
2505 1326 1364 1343 1276 1209 1164 1178 1212 1246 1281 1315 1362 1350 1313 1275 1291 1307 1293 1280 1274 1269 1263 1258 1252 1247 1182 1177 1237 1356 1420 1425 1393 1361 1385 1468 1562 1557 1473 1389
2500 1389 1404 1420 1378 1276 1237 1336 1469 1502 1417 1332 1304 1276 1277 1338 1421 1504 1465 1366 1326 1346 1358 1370 1408 1506 1580 1595 1588 1581 1567 1553 1509 1465 1493 1520 1547
2496 1547 1575 1549 1522 1551 1581 1576 1512 1452 1490 1574 1599 1525 1451 1395 1339 1314 1288 1275 1263 1306 1350 1374 1339 1303 1327 1359 1390 1425 1461 1471 1481 1492 1502 1485 1467
2492 1467 1416 1425 1455 1484 1458 1432 1471 1511 1491 1471 1440 1408 1377 1346 1326 1306 1346 1385 1404 1423 1442 1461 1479 1498 1487 1477 1429 1382 1360 1398 1494 1589 1583 1518 1439
2488 1439 1360 1337 1314 1266 1218 1271 1383 1480 1517 1528 1539 1516 1434 1352 1329 1333 1337 1340 1404 1451 1499 1491 1483 1450 1416 1378 1400 1456 1512 1512 1512 1578 1645 1646 1587 1539 1491 1465
2483 1465 1499 1541 1583 1570 1557 1536 1516 1519 1580 1649 1659 1607 1554 1617 1680 1683 1686 1684 1681 1620 1558 1533 1507 1456 1405 1437 1528 1561 1533 1529 1526 1518 1511 1491 1471 1510 1550 1506 1463
2478 1463 1420 1376 1379 1382 1444 1507 1502 1498 1523 1548 1560 1571 1522 1474 1480 1487 1493 1500 1515 1531 1517 1503 1517 1530 1485 1439 1473 1507 1482 1456 1496 1536 1576 1616 1614 1611 1609 1607 1645 1682
2473 1682 1661 1639 1629 1620 1611 1601 1568 1534 1560 1586 1606 1626 1617 1608 1562 1517 1412 1308 1334 1359 1355 1352 1368 1383 1370 1356 1342 1328 1315 1301 1303 1305 1307 1309 1346 1382 1419 1455
2469 1455 1407 1359 1311 1263 1339 1415 1461 1507 1458 1409 1419 1429 1433 1438 1383 1328 1366 1403 1500 1597 1583 1570 1557 1544 1583 1623 1525 1426 1458 1490 1522 1554 1592 1630 1638 1646
2464 1646 1670 1694 1658 1623 1595 1567 1538 1510 1493 1476 1459 1442 1465 1488 1511 1534 1527 1519 1511 1503 1434 1364 1354 1344 1378 1412 1387 1362 1358 1354 1350 1346 1410 1473 1478 1483 1414 1345 1336 1326
2459 1326 1364 1402 1380 1358 1398 1438 1419 1400 1343 1287 1363 1439 1485 1431 1341 1310 1392 1474 1460 1446 1421 1395 1370 1344 1331 1318 1304 1291 1292 1294 1355 1416 1439 1463 1487
2455 1487 1510 1583 1656 1669 1683 1642 1601 1560 1518 1557 1596 1575 1554 1559 1564 1570 1575 1546 1517 1489 1460 1513 1566 1560 1553 1494 1434 1434 1433 1447 1460 1473 1487 1482 1476 1412 1347 1341 1334 1328 1322
2450 1322 1350 1378 1407 1435 1419 1403 1386 1370 1387 1405 1422 1439 1445 1451 1457 1463 1414 1364 1374 1384 1395 1406 1417 1428 1413 1399 1385 1370 1387 1403 1420 1437 1456 1475 1435 1395
2446 1395 1403 1412 1321 1230 1197 1164 1190 1217 1314 1410 1408 1406 1424 1441 1459 1476 1462 1447 1492 1537 1511 1484 1458 1432 1413 1395 1376 1357 1301 1244 1247 1250 1284 1318 1351 1385 1397
2441 1397 1408 1419 1430 1491 1552 1481 1411 1388 1484 1524 1446 1410 1435 1455 1416 1354 1351 1409 1468 1402 1336 1270 1204 1310 1417 1456 1376 1304 1291 1335 1380 1427 1473 1460
2437 1460 1447 1379 1312 1304 1295 1236 1177 1178 1178 1199 1221 1242 1264 1343 1423 1443 1463 1413 1362 1371 1380 1456 1532 1508 1485 1477 1468 1460 1451 1460 1468 1476 1484 1460 1435 1411 1386 1396 1407 1447 1486
2432 1486 1429 1372 1414 1456 1466 1476 1486 1497 1530 1564 1499 1434 1368 1303 1336 1370 1382 1394 1407 1419 1485 1550 1556 1562 1570 1578 1527 1476 1450 1423 1396 1369 1372 1375 1358 1282 1241
2427 1241 1300 1362 1423 1469 1575 1646 1619 1499 1438 1436 1434 1418 1402 1416 1430 1431 1431 1491 1551 1503 1455 1506 1557 1514 1472 1488 1505 1509 1513 1546 1579 1588 1596 1545 1494 1402 1311
2423 1311 1357 1404 1400 1396 1422 1448 1437 1426 1415 1404 1391 1379 1461 1543 1470 1337 1280 1323 1350 1378 1411 1444 1462 1479 1397 1316 1286 1257 1326 1395 1454 1513 1542 1571 1547
2419 1547 1523 1499 1475 1455 1435 1415 1394 1387 1380 1349 1318 1249 1279 1386 1434 1440 1446 1540 1634 1613 1474 1368 1322 1336 1350 1339 1327 1330 1334 1437 1539 1502 1466 1429 1392
2414 1392 1382 1373 1363 1353 1315 1276 1337 1397 1367 1337 1367 1396 1310 1224 1236 1249 1300 1351 1454 1557 1585 1495 1401 1426 1482 1479 1457 1434 1459 1484 1508 1533 1552 1572
2410 1572 1532 1493 1482 1471 1461 1450 1479 1508 1478 1390 1306 1341 1438 1475 1423 1372 1375 1379 1391 1402 1413 1425 1371 1318 1322 1386 1463 1422 1384 1405 1463 1462 1399 1336 1350 1365
2406 1365 1380 1395 1361 1327 1352 1378 1414 1451 1458 1465 1484 1502 1580 1658 1609 1559 1510 1461 1422 1384 1405 1426 1451 1476 1442 1408 1371 1335 1357 1380 1310 1241 1306 1371 1363 1296
2401 1296 1255 1332 1405 1478 1460 1441 1391 1342 1431 1520 1500 1480 1461 1441 1437 1434 1430 1426 1419 1411 1403 1396 1378 1361 1403 1444 1352 1260 1228 1254 1286 1219 1151 1183 1295 1347 1380 1413
2397 1413 1395 1377 1378 1440 1513 1487 1382 1277 1306 1335 1423 1511 1497 1484 1471 1457 1440 1423 1406 1389 1388 1387 1386 1385 1384 1383 1382 1381 1392 1403 1414 1425 1442 1459 1476 1493 1417 1342
2392 1342 1366 1389 1374 1360 1345 1330 1335 1341 1346 1351 1375 1399 1423 1446 1492 1537 1523 1508 1461 1413 1366 1318 1333 1348 1364 1379 1421 1463 1407 1350 1314 1278 1380 1483 1474 1465
2388 1465 1456 1447 1394 1341 1288 1235 1260 1285 1364 1442 1477 1413 1372 1389 1431 1472 1418 1364 1332 1300 1327 1354 1364 1374 1384 1393 1431 1469 1506 1544 1514 1485 1456 1427 1414 1402
2383 1402 1389 1377 1431 1485 1401 1317 1285 1253 1320 1387 1434 1481 1469 1457 1435 1414 1452 1490 1444 1398 1412 1425 1391 1356 1342 1387 1414 1343 1275 1307 1412 1516 1489
2379 1489 1461 1407 1352 1357 1361 1354 1346 1338 1330 1307 1283 1318 1354 1385 1416 1387 1359 1356 1354 1351 1349 1381 1412 1385 1357 1342 1327 1312 1297 1256 1215 1214 1312 1404 1436 1449 1461 1493 1525 1497
2374 1497 1469 1473 1476 1420 1364 1396 1428 1459 1491 1467 1443 1419 1396 1427 1458 1489 1520 1529 1538 1488 1437 1453 1469 1425 1382 1368 1354 1399 1445 1471 1498 1465 1432 1414 1396 1374
2370 1374 1352 1367 1323 1253 1281 1318 1294 1218 1201 1284 1367 1395 1422 1447 1473 1399 1325 1299 1273 1246 1319 1439 1499 1421 1343 1367 1391 1359 1327 1376 1484 1519 1455
2366 1455 1417 1439 1421 1403 1420 1437 1454 1470 1406 1341 1277 1212 1244 1276 1308 1340 1317 1294 1270 1247 1257 1267 1278 1288 1316 1345 1318 1291 1350 1467 1508 1450 1397 1343
2362 1343 1343 1342 1352 1361 1312 1262 1219 1177 1195 1212 1309 1407 1405 1404 1374 1343 1312 1282 1276 1270 1264 1259 1248 1237 1286 1334 1353 1372 1391 1410 1452 1494 1476 1459 1477 1496 1455 1414 1386
2357 1386 1358 1277 1196 1211 1325 1417 1450 1439 1429 1414 1400 1402 1403 1346 1288 1273 1258 1243 1228 1212 1196 1239 1282 1323 1363 1305 1246 1255 1263 1271 1279 1294 1308 1323 1337 1372 1406
2353 1406 1381 1356 1348 1341 1393 1444 1447 1449 1452 1454 1413 1371 1330 1288 1280 1272 1323 1374 1379 1384 1389 1393 1424 1455 1485 1516 1491 1466 1441 1416 1369 1322 1275 1227 1269 1311 1353 1395 1448 1501
2348 1501 1416 1331 1332 1334 1336 1338 1302 1267 1331 1394 1455 1516 1577 1638 1632 1627 1561 1496 1447 1398 1349 1300 1308 1316 1323 1331 1303 1276 1307 1339 1357 1375 1334 1292 1291 1289 1347 1405 1392 1380
2343 1380 1308 1236 1265 1294 1323 1353 1400 1448 1397 1346 1318 1291 1323 1355 1305 1255 1206 1156 1225 1294 1363 1433 1510 1588 1567 1546 1543 1541 1538 1535 1476 1416 1357 1297 1370 1443
2338 1443 1457 1470 1493 1515 1446 1376 1409 1560 1665 1571 1439 1426 1433 1439 1441 1442 1444 1445 1408 1371 1334 1297 1316 1335 1354 1373 1357 1341 1325 1310 1288 1267 1246 1225 1249 1272
2334 1272 1236 1200 1195 1190 1244 1299 1360 1422 1483 1545 1524 1503 1481 1460 1464 1467 1471 1474 1500 1526 1552 1577 1550 1523 1514 1564 1623 1563 1435 1307 1304 1300 1356 1413 1390 1368 1346 1323
2329 1323 1411 1499 1452 1404 1396 1448 1441 1316 1250 1302 1379 1457 1453 1450 1446 1442 1446 1450 1362 1274 1247 1339 1401 1403 1370 1396 1484 1572 1614 1656 1600 1543 1523 1503 1484 1464 1474 1483 1493
2325 1493 1503 1474 1446 1417 1388 1361 1334 1405 1477 1459 1442 1424 1407 1477 1547 1519 1432 1437 1560 1679 1680 1607 1533 1453 1372 1365 1359 1352 1345 1393 1440 1487 1535 1531 1528 1506 1425
2320 1425 1347 1387 1454 1461 1420 1438 1512 1527 1520 1514 1564 1613 1664 1714 1824 1935 1870 1806 1742 1677 1687 1697 1766 1836 1832 1828 1824 1820 1832 1845 1797 1750 1726 1702 1737 1772 1699
2315 1699 1627 1554 1482 1428 1373 1378 1383 1346 1309 1331 1354 1348 1343 1337 1331 1315 1298 1281 1265 1295 1324 1354 1384 1316 1248 1240 1232 1293 1354 1415 1476 1382 1287 1292 1296 1361 1425 1490 1555
2311 1555 1615 1675 1734 1794 1815 1836 1798 1760 1826 1893 1901 1908 1873 1838 1862 1886 1819 1752 1684 1617 1596 1576 1555 1534 1541 1548 1496 1444 1437 1430 1453 1476 1424 1372 1379 1387 1385 1384 1442
2306 1442 1500 1481 1461 1412 1363 1282 1201 1126 1051 1026 1100 1217 1334 1341 1348 1355 1363 1361 1360 1358 1357 1349 1342 1335 1328 1369 1410 1391 1373 1368 1362 1363 1364 1355 1446 1540 1535 1481 1486 1518 1491 1415 1398
2301 1398 1477 1496 1437 1378 1454 1529 1521 1512 1532 1553 1462 1371 1339 1307 1333 1359 1326 1293 1297 1301 1334 1367 1363 1358 1449 1540 1512 1424 1374 1423 1478 1534 1498 1461 1410 1359 1367 1375
2296 1375 1345 1315 1345 1374 1391 1409 1427 1444 1451 1457 1463 1470 1442 1415 1387 1360 1405 1450 1496 1541 1474 1406 1477 1548 1569 1589 1510 1432 1361 1289 1317 1345 1276 1208 1238 1268
2292 1268 1234 1199 1231 1321 1344 1366 1393 1419 1401 1382 1364 1346 1330 1314 1394 1473 1458 1384 1370 1414 1411 1407 1437 1467 1482 1497 1516 1475 1398 1320 1340 1420 1431 1384 1340
2287 1340 1356 1338 1319 1334 1349 1311 1273 1294 1315 1299 1284 1291 1357 1377 1337 1301 1325 1330 1335 1340 1345 1371 1338 1305 1331 1362 1394 1369 1345 1281 1217 1254 1351 1385 1359 1333 1367
2283 1367 1385 1344 1341 1337 1343 1349 1351 1353 1274 1135 1046 1096 1172 1188 1153 1178 1250 1322 1364 1406 1420 1375 1327 1337 1369 1341 1291 1241 1323 1405 1425 1387 1323 1320 1374 1428 1425 1363
2278 1363 1334 1305 1295 1285 1305 1325 1305 1285 1364 1502 1581 1561 1508 1514 1530 1546 1562 1578 1548 1459 1369 1339 1357 1376 1398 1420 1469 1518 1468 1418 1371 1324 1280 1237
2274 1237 1212 1248 1309 1370 1368 1366 1364 1362 1288 1214 1241 1328 1341 1295 1278 1321 1342 1303 1263 1284 1326 1309 1267 1283 1341 1399 1402 1404 1399 1394 1415 1436 1457 1419 1381 1403 1451 1500
2269 1500 1493 1486 1440 1395 1345 1355 1395 1434 1473 1512 1450 1329 1282 1333 1381 1370 1340 1309 1290 1272 1273 1333 1407 1383 1349 1374 1413 1353 1237 1221 1318 1416 1415 1354 1323
2265 1323 1292 1312 1333 1363 1335 1309 1284 1292 1299 1332 1365 1415 1406 1367 1387 1434 1482 1434 1386 1345 1304 1322 1340 1330 1320 1330 1399 1438 1379 1342 1364 1418 1412 1384 1357 1386
2261 1386 1415 1444 1473 1483 1492 1462 1491 1522 1453 1312 1229 1269 1308 1212 1116 1100 1083 1126 1169 1303 1438 1473 1509 1542 1575 1549 1523 1424 1325 1325 1325 1366 1408 1391
2257 1391 1373 1396 1419 1383 1346 1383 1421 1398 1376 1384 1391 1369 1347 1331 1316 1301 1285 1334 1383 1333 1283 1269 1254 1269 1284 1341 1398 1396 1394 1366 1338 1311 1283 1305 1326 1289
2252 1289 1251 1297 1344 1353 1263 1182 1200 1294 1389 1377 1366 1407 1449 1468 1388 1301 1273 1305 1337 1313 1290 1265 1240 1274 1309 1382 1456 1430 1405 1415 1425 1406 1386 1449 1513
2248 1513 1517 1521 1515 1509 1533 1557 1590 1622 1516 1411 1429 1447 1435 1424 1397 1371 1374 1378 1381 1385 1289 1194 1190 1187 1243 1299 1334 1368 1343 1319 1357 1395 1374 1353 1312 1271 1229 1188
2243 1188 1219 1249 1221 1192 1222 1252 1282 1312 1340 1368 1336 1304 1266 1228 1190 1152 1204 1256 1249 1242 1321 1401 1382 1362 1369 1376 1382 1389 1410 1430 1391 1353 1271 1189 1245 1302 1359
2239 1359 1417 1376 1334 1308 1282 1315 1348 1397 1446 1356 1267 1281 1296 1310 1324 1347 1370 1393 1416 1397 1378 1359 1340 1341 1342 1343 1344 1399 1454 1450 1446 1420 1395 1428 1461 1475 1488
2234 1488 1443 1397 1431 1466 1441 1417 1355 1293 1231 1169 1200 1230 1260 1290 1365 1440 1416 1392 1443 1494 1486 1477 1439 1401 1363 1325 1358 1390 1422 1455 1402 1349 1355 1361 1390 1419
2230 1419 1448 1476 1534 1591 1553 1515 1434 1412 1456 1500 1541 1583 1529 1475 1415 1414 1417 1361 1241 1181 1185 1249 1313 1318 1301 1283 1343 1402 1366 1330 1333 1395 1479 1464 1402 1339
2225 1339 1273 1208 1227 1306 1385 1404 1395 1385 1372 1359 1391 1423 1432 1382 1375 1428 1477 1466 1439 1412 1325 1238 1235 1290 1346 1342 1332 1322 1313 1303 1303 1363 1422 1423 1428 1434 1435 1437 1408 1379
2220 1379 1350 1321 1362 1402 1384 1365 1386 1407 1406 1345 1284 1283 1303 1324 1328 1333 1341 1350 1349 1408 1468 1467 1441 1415 1385 1355 1414 1472 1435 1398 1414 1490 1532 1475 1413 1411 1428 1446 1463
2216 1463 1481 1476 1412 1373 1394 1471 1488 1487 1486 1425 1365 1330 1355 1380 1345 1271 1197 1218 1239 1257 1274 1292 1310 1346 1383 1390 1397 1421 1444 1445 1387 1345 1363 1381 1340 1308 1336
2211 1336 1424 1452 1421 1450 1504 1500 1415 1331 1342 1352 1364 1375 1420 1405 1334 1263 1248 1233 1226 1218 1185 1152 1152 1212 1272 1272 1260 1247 1290 1333 1341 1348 1355 1363 1338 1314 1349 1385 1377
2206 1377 1369 1335 1301 1307 1372 1437 1443 1389 1336 1308 1280 1258 1236 1309 1382 1454 1468 1415 1363 1370 1378 1359 1341 1313 1345 1380 1356 1359 1421 1505 1491 1422 1412 1462 1512 1474 1437
2202 1437 1421 1465 1514 1504 1436 1368 1321 1334 1373 1412 1443 1474 1475 1476 1460 1443 1427 1410 1436 1463 1466 1411 1369 1387 1400 1355 1285 1215 1242 1329 1368 1348 1305 1262 1316 1370
2198 1370 1365 1359 1332 1305 1308 1311 1311 1311 1311 1311 1331 1351 1372 1392 1330 1268 1265 1262 1318 1375 1401 1428 1387 1347 1336 1325 1287 1249 1270 1291 1295 1300 1304 1309 1325 1341 1328 1314 1224 1133 1141 1149
2192 1149 1151 1152 1213 1273 1243 1212 1182 1151 1162 1174 1185 1197 1217 1237 1316 1396 1364 1333 1332 1330 1384 1438 1392 1347 1368 1389 1391 1332 1281 1329 1411 1433 1369 1305 1336 1367 1340
2188 1340 1312 1314 1316 1276 1237 1256 1276 1264 1253 1272 1290 1284 1277 1329 1382 1426 1469 1454 1438 1415 1392 1369 1346 1345 1344 1342 1341 1404 1467 1471 1474 1450 1427 1502 1577 1547 1518 1518 1519 1527 1535
2183 1535 1524 1453 1343 1332 1440 1548 1476 1404 1392 1379 1404 1429 1395 1361 1399 1438 1506 1575 1485 1395 1404 1413 1407 1400 1424 1447 1456 1466 1505 1544 1530 1517 1474 1431 1395
2179 1395 1360 1423 1486 1482 1477 1473 1468 1468 1467 1467 1467 1463 1460 1426 1393 1323 1253 1322 1391 1390 1389 1389 1388 1325 1263 1299 1336 1313 1289 1266 1243 1261 1278 1296 1313 1322 1330 1339 1347 1319 1290 1321 1352
2173 1352 1403 1455 1447 1439 1400 1362 1382 1403 1394 1385 1376 1367 1337 1307 1277 1247 1272 1297 1323 1348 1341 1335 1299 1262 1265 1267 1369 1470 1423 1377 1331 1284 1275 1266 1316 1366 1306 1246 1284
2169 1284 1323 1331 1339 1403 1466 1468 1411 1387 1461 1542 1564 1526 1488 1465 1441 1388 1335 1331 1327 1421 1516 1527 1539 1550 1561 1484 1406 1408 1508 1560 1553 1548 1603 1699 1737 1746 1695 1614
2164 1614 1532 1546 1560 1531 1501 1527 1553 1530 1448 1402 1455 1525 1594 1610 1626 1589 1553 1576 1599 1585 1571 1528 1485 1493 1502 1536 1571 1492 1354 1356 1535 1717 1721 1625 1589
2160 1589 1595 1601 1581 1562 1531 1500 1499 1497 1479 1460 1441 1422 1440 1458 1376 1295 1306 1317 1388 1458 1510 1562 1515 1468 1441 1413 1385 1357 1388 1418 1448 1479 1534 1590 1646 1701
2155 1701 1683 1664 1646 1627 1637 1648 1658 1668 1647 1626 1605 1585 1543 1501 1519 1536 1526 1517 1537 1557 1577 1597 1588 1579 1612 1646 1680 1714 1722 1729 1737 1744 1774 1803 1774 1744 1692 1641
2151 1641 1649 1656 1694 1731 1709 1687 1738 1788 1780 1771 1777 1783 1848 1913 1962 2010 1999 1988 1962 1936 1911 1885 1867 1849 1831 1814 1778 1743 1708 1673 1645 1616 1588 1560 1529 1498 1526
2146 1526 1555 1614 1674 1634 1595 1632 1669 1706 1743 1720 1697 1674 1651 1621 1591 1560 1530 1510 1490 1470 1450 1476 1502 1528 1554 1610 1666 1624 1581 1572 1563 1554 1545 1542 1539 1537 1534 1523
2141 1523 1511 1441 1370 1448 1527 1606 1684 1648 1611 1575 1539 1477 1415 1354 1292 1348 1403 1360 1317 1292 1267 1243 1218 1205 1193 1181 1168 1249 1330 1352 1373 1348 1322 1297
2137 1297 1272 1347 1423 1439 1455 1424 1393 1422 1450 1402 1353 1305 1257 1260 1264 1267 1271 1318 1365 1274 1182 1231 1279 1328 1376 1389 1401 1413 1426 1416 1406 1396 1387 1374 1362 1349 1337
2133 1337 1321 1304 1288 1272 1339 1406 1414 1422 1425 1428 1430 1433 1507 1580 1555 1529 1517 1505 1493 1482 1445 1408 1371 1335 1350 1365 1380 1395 1379 1364 1348 1332 1310 1288 1266 1244 1302
2128 1302 1359 1317 1275 1286 1296 1306 1316 1345 1373 1343 1312 1298 1285 1271 1258 1297 1336 1316 1296 1272 1248 1225 1201 1247 1294 1341 1387 1469 1550 1532 1514 1522 1530 1478 1427
2124 1427 1455 1484 1513 1541 1466 1390 1414 1437 1455 1474 1492 1510 1524 1537 1452 1366 1384 1401 1418 1435 1450 1466 1481 1496 1485 1475 1365 1255 1269 1282 1296 1309 1326
2120 1326 1343 1262 1180 1220 1261 1242 1223 1248 1274 1240 1206 1256 1306 1297 1287 1285 1283 1282 1280 1308 1337 1366 1394 1438 1481 1430 1378 1384 1450 1482 1415 1323 1291 1318 1345 1397 1449
2115 1449 1500 1552 1524 1497 1376 1256 1265 1372 1458 1484 1481 1479 1472 1466 1458 1449 1440 1432 1439 1446 1394 1342 1319 1295 1271 1247 1277 1306 1335 1365 1387 1410 1432 1455 1435 1416 1397 1377
2111 1377 1382 1386 1391 1396 1441 1487 1473 1459 1449 1440 1431 1421 1419 1417 1415 1413 1478 1543 1510 1476 1499 1522 1486 1449 1428 1407 1386 1365 1431 1498 1525 1453 1395 1397 1396 1335 1306 1335 1308 1222
2106 1222 1178 1234 1322 1351 1350 1348 1402 1456 1446 1435 1425 1415 1508 1602 1580 1460 1352 1363 1399 1436 1443 1450 1402 1353 1360 1427 1476 1405 1313 1339 1390 1440 1433 1425 1417 1409 1469 1530
2101 1530 1597 1546 1431 1316 1332 1347 1363 1379 1395 1411 1404 1397 1390 1384 1350 1315 1281 1247 1299 1350 1401 1452 1418 1384 1350 1316 1367 1419 1410 1402 1391 1381 1370 1359 1393 1427
2097 1427 1401 1375 1356 1336 1317 1297 1308 1319 1330 1341 1386 1430 1415 1401 1384 1368 1352 1336 1346 1356 1347 1279 1246 1331 1383 1376 1326 1336 1369 1401 1422 1444 1469 1495 1462
2092 1462 1488 1552 1497 1350 1262 1274 1346 1396 1387 1356 1325 1345 1364 1383 1402 1354 1305 1315 1326 1347 1367 1329 1290 1255 1221 1245 1270 1266 1263 1259 1256 1304 1351 1398 1446 1429
2088 1429 1413 1397 1381 1328 1275 1320 1366 1437 1509 1481 1453 1399 1346 1351 1357 1407 1456 1506 1555 1507 1459 1470 1482 1482 1483 1425 1366 1369 1372 1376 1379 1367 1355 1347 1338 1318 1356 1362 1268 1144
2083 1144 1079 1113 1147 1189 1232 1334 1436 1444 1453 1402 1351 1344 1338 1332 1325 1312 1299 1286 1272 1260 1248 1296 1343 1353 1364 1374 1384 1409 1434 1459 1484 1442 1401 1418 1436 1468
2079 1468 1501 1434 1368 1366 1364 1361 1359 1342 1325 1368 1410 1416 1422 1428 1434 1403 1372 1440 1508 1497 1487 1476 1466 1428 1390 1412 1434 1414 1395 1376 1356 1367 1377 1328 1279 1284 1288 1293 1297 1273
2074 1273 1249 1324 1399 1415 1432 1388 1345 1360 1375 1390 1405 1358 1311 1322 1334 1265 1195 1224 1254 1282 1311 1339 1368 1358 1348 1338 1328 1334 1340 1346 1352 1282 1211 1240 1268 1246
2069 1246 1224 1261 1299 1302 1305 1307 1310 1330 1349 1369 1389 1353 1317 1380 1442 1440 1437 1434 1431 1379 1327 1374 1420 1444 1468 1492 1516 1417 1317 1317 1316 1351 1386 1421 1456 1357 1258 1259 1259 1298
2065 1298 1337 1376 1415 1367 1318 1269 1221 1260 1299 1338 1377 1338 1300 1320 1341 1367 1392 1418 1444 1384 1323 1361 1399 1414 1429 1444 1459 1421 1382 1443 1504 1458 1413 1427
2060 1427 1442 1410 1378 1347 1315 1350 1385 1361 1336 1303 1270 1297 1323 1305 1287 1369 1450 1381 1312 1303 1294 1347 1399 1452 1505 1490 1476 1462 1448 1415 1382 1408 1434 1346 1259
2056 1259 1270 1282 1275 1269 1262 1256 1287 1317 1348 1378 1336 1294 1350 1407 1418 1430 1442 1454 1398 1341 1343 1346 1306 1267 1287 1306 1306 1305 1305 1305 1342 1380 1418 1456 1445 1433 1422 1411 1328
2051 1328 1245 1241 1336 1429 1463 1528 1592 1563 1395 1250 1203 1195 1188 1186 1184 1241 1297 1353 1410 1372 1334 1355 1376 1376 1375 1275 1175 1152 1129 1106 1083 1017 952 1065 1178
2047 1178 1230 1283 1335 1388 1377 1366 1356 1345 1338 1332 1325 1319 1312 1305 1299 1292 1319 1346 1373 1399 1366 1332 1298 1264 1310 1356 1303 1251 1158 1066 1092 1217 1383 1489 1530 1511 1428
2043 1428 1345 1317 1290 1278 1265 1312 1359 1362 1364 1366 1369 1404 1440 1475 1511 1439 1367 1354 1341 1325 1308 1292 1275 1309 1344 1319 1293 1261 1229 1295 1362 1343 1325 1365 1406 1415 1424
2038 1424 1432 1441 1454 1466 1479 1491 1470 1448 1427 1405 1395 1384 1433 1482 1523 1564 1598 1633 1657 1581 1525 1527 1543 1500 1457 1473 1485 1439 1429 1419 1426 1434 1441 1448 1380 1312 1244 1275
2033 1275 1332 1330 1308 1285 1310 1335 1360 1385 1286 1187 1132 1175 1230 1286 1289 1291 1313 1334 1297 1259 1270 1280 1291 1301 1336 1372 1308 1244 1212 1179 1245 1311 1358 1405 1392 1379
2029 1379 1316 1252 1288 1323 1311 1298 1286 1273 1315 1357 1340 1323 1329 1335 1341 1348 1350 1353 1355 1358 1315 1273 1231 1189 1201 1213 1225 1237 1260 1282 1304 1327 1324 1322 1319 1317 1316 1316 1315 1315 1329 1343
2024 1343 1358 1372 1371 1369 1368 1367 1349 1331 1372 1414 1416 1417 1445 1473 1454 1376 1321 1384 1447 1451 1396 1342 1259 1177 1087 1115 1169 1223 1224 1226 1267 1308 1319 1330 1351 1373 1394 1415 1427
2019 1427 1439 1451 1463 1439 1415 1390 1366 1375 1384 1393 1402 1375 1348 1381 1532 1631 1532 1347 1280 1336 1392 1455 1518 1573 1628 1624 1620 1651 1683 1744 1804 1910 2015 2087 2159
2015 2159 2302 2385 2462 2737 3274 4010 4943 5995 7034 7876 8288 8265 7745 6870 5771 4731 3874 3214 2752 2486 2293 2099 1911
2012 1911 1841 1851 1861 1779 1698 1687 1677 1528 1379 1386 1393 1370 1348 1385 1422 1400 1378 1346 1313 1340 1367 1420 1473 1427 1381 1378 1374 1370 1366 1405 1443 1422 1401 1380 1359 1338
2008 1338 1318 1371 1424 1379 1274 1232 1289 1379 1410 1348 1286 1319 1353 1377 1400 1384 1428 1469 1411 1320 1288 1316 1345 1318 1291 1348 1405 1403 1400 1404 1408 1353 1297 1261 1225 1248
2003 1248 1271 1319 1366 1385 1403 1441 1479 1418 1357 1346 1336 1296 1256 1331 1405 1381 1356 1307 1259 1270 1280 1332 1384 1336 1289 1283 1277 1272 1266 1333 1401 1369 1337 1435 1533 1515
1999 1515 1398 1323 1348 1374 1340 1297 1255 1268 1281 1289 1297 1245 1193 1184 1174 1165 1155 1164 1173 1241 1310 1375 1440 1366 1293 1322 1351 1380 1409 1394 1378 1304 1229 1268 1307 1247 1187
1994 1187 1233 1279 1325 1371 1346 1322 1297 1273 1283 1294 1304 1315 1333 1351 1310 1268 1222 1176 1268 1360 1360 1360 1359 1359 1393 1427 1402 1377 1443 1508 1435 1361 1401 1440 1380 1321
1990 1321 1333 1345 1357 1369 1346 1323 1299 1276 1307 1339 1310 1282 1261 1241 1160 1080 1164 1249 1333 1417 1448 1478 1370 1262 1270 1278 1287 1295 1376 1457 1439 1422 1379 1337 1294
1986 1294 1252 1314 1377 1380 1324 1326 1427 1432 1337 1268 1297 1302 1247 1247 1306 1308 1251 1210 1268 1328 1289 1272 1353 1432 1412 1378 1403 1389 1374 1389 1403 1417 1431 1402 1373 1348 1323
1981 1323 1336 1408 1449 1392 1380 1467 1552 1538 1480 1482 1504 1525 1524 1523 1525 1528 1473 1478 1506 1434 1391 1348 1359 1369 1377 1385 1397 1409 1404 1459 1480 1402 1339 1336 1352 1368 1410 1451 1496
1976 1496 1441 1353 1364 1412 1460 1475 1490 1505 1520 1540 1560 1560 1501 1461 1521 1614 1647 1566 1485 1459 1433 1443 1454 1464 1474 1480 1487 1493 1500 1481 1461 1442 1423 1397 1370 1344 1317
1972 1317 1330 1343 1356 1369 1371 1373 1375 1376 1396 1415 1438 1361 1239 1217 1271 1325 1361 1397 1433 1469 1498 1528 1459 1389 1332 1276 1278 1281 1292 1303 1314 1325 1316 1306 1356 1406 1384
1967 1384 1362 1340 1318 1342 1366 1330 1294 1292 1290 1287 1285 1296 1307 1322 1337 1336 1396 1424 1353 1274 1294 1385 1416 1379 1342 1360 1379 1369 1358 1348 1338 1342 1346 1351 1355 1328 1301 1334 1366
1963 1366 1372 1378 1385 1391 1383 1375 1368 1360 1307 1255 1301 1348 1342 1337 1311 1226 1132 1136 1219 1303 1338 1373 1408 1344 1261 1237 1272 1307 1301 1295 1389 1482 1425 1369 1312 1256 1258 1261 1323 1386 1366 1347
1957 1347 1387 1427 1400 1373 1345 1318 1328 1338 1349 1359 1284 1209 1272 1336 1288 1240 1252 1263 1278 1292 1306 1320 1294 1267 1241 1215 1240 1266 1292 1318 1345 1372 1400 1427
1953 1427 1340 1253 1305 1357 1359 1362 1364 1366 1338 1309 1339 1370 1343 1315 1288 1260 1245 1230 1215 1200 1242 1285 1328 1371 1323 1275 1286 1297 1355 1413 1395 1277 1154 1129 1180
1949 1180 1232 1264 1296 1328 1360 1329 1298 1366 1434 1406 1377 1448 1518 1555 1591 1627 1663 1655 1647 1639 1630 1618 1606 1654 1701 1624 1546 1568 1589 1550 1512 1605 1699 1645 1493 1400
1945 1400 1405 1456 1506 1562 1619 1575 1532 1583 1635 1613 1532 1522 1610 1664 1619 1598 1637 1626 1555 1487 1479 1492 1505 1463 1420 1429 1438 1448 1457 1392 1327 1361 1395 1421 1447 1472 1498
1940 1498 1496 1495 1553 1611 1664 1717 1770 1823 1779 1736 1692 1649 1575 1501 1487 1472 1505 1537 1570 1602 1550 1498 1541 1583 1540 1437 1446 1555 1641 1669 1729 1790 1796 1704 1667
1936 1667 1729 1792 1797 1781 1766 1715 1665 1675 1684 1655 1626 1597 1567 1567 1566 1566 1565 1521 1476 1432 1388 1355 1322 1348 1374 1403 1433 1462 1491 1513 1535 1557 1579 1525 1471 1476 1481 1478 1475
1931 1475 1471 1468 1519 1571 1623 1674 1602 1530 1458 1386 1406 1426 1446 1467 1353 1240 1225 1211 1183 1154 1225 1296 1365 1435 1445 1455 1483 1511 1539 1567 1502 1437 1471 1564
1927 1564 1599 1535 1493 1511 1534 1499 1463 1487 1521 1495 1445 1494 1570 1547 1487 1427 1391 1355 1320 1284 1383 1482 1522 1562 1471 1380 1348 1316 1297 1277 1390 1503 1493
1923 1493 1384 1328 1371 1423 1377 1331 1384 1435 1387 1363 1399 1422 1385 1348 1370 1418 1406 1373 1339 1327 1316 1364 1471 1492 1415 1341 1366 1435 1505 1481 1458 1438 1418
1919 1418 1398 1377 1392 1406 1421 1435 1401 1366 1430 1494 1411 1328 1305 1281 1289 1296 1361 1485 1548 1473 1387 1360 1396 1431 1371 1311 1236 1162 1186 1210 1268 1327 1325 1324 1268 1211
1914 1211 1219 1345 1412 1361 1347 1392 1421 1390 1356 1381 1397 1293 1246 1317 1453 1471 1388 1363 1374 1326 1281 1295 1374 1453 1437 1420 1393 1365 1338 1310 1331 1352 1372
1910 1372 1393 1400 1408 1415 1422 1481 1540 1537 1533 1505 1418 1350 1400 1499 1479 1361 1303 1313 1323 1336 1350 1386 1422 1359 1296 1322 1348 1375 1401 1352 1303 1353 1403 1452 1501 1451 1401
1906 1401 1355 1309 1322 1336 1336 1337 1337 1337 1338 1338 1339 1339 1372 1405 1378 1351 1377 1402 1368 1334 1345 1357 1369 1381 1444 1508 1472 1437 1374 1310 1247 1183 1182 1180 1108 1154 1300 1387 1334
1901 1334 1221 1157 1152 1209 1266 1298 1330 1362 1394 1370 1347 1323 1300 1293 1286 1279 1272 1291 1311 1379 1448 1470 1492 1464 1437 1444 1452 1460 1468 1424 1380 1365 1410 1453 1396 1316 1296 1315
1896 1315 1335 1358 1381 1436 1491 1457 1482 1519 1457 1348 1299 1332 1306 1215 1183 1187 1192 1170 1149 1183 1218 1222 1227 1310 1394 1388 1382 1400 1417 1401 1385 1386 1329 1245 1261 1349 1379
1892 1379 1300 1221 1250 1280 1240 1200 1229 1257 1256 1254 1347 1439 1442 1446 1396 1346 1346 1345 1395 1444 1384 1324 1290 1256 1221 1187 1189 1191 1163 1135 1212 1289 1316 1343 1382 1422 1352 1283
1887 1283 1295 1307 1230 1153 1200 1247 1224 1202 1267 1333 1309 1286 1355 1424 1444 1463 1416 1368 1320 1272 1277 1282 1238 1193 1258 1323 1279 1235 1262 1289 1286 1284 1317 1350 1334 1317
1883 1317 1306 1294 1253 1212 1189 1166 1074 982 1033 1084 1106 1127 1169 1212 1205 1198 1221 1244 1158 1073 1116 1159 1172 1185 1238 1291 1294 1297 1314 1330 1317 1304 1326 1348 1340 1332 1385
1878 1385 1438 1422 1406 1387 1368 1349 1330 1358 1387 1327 1266 1258 1250 1272 1293 1388 1483 1389 1296 1282 1268 1284 1300 1356 1411 1338 1265 1251 1237 1272 1307 1397 1487 1468 1449
1874 1449 1503 1558 1483 1409 1401 1392 1321 1249 1261 1373 1404 1296 1237 1276 1266 1158 1064 1109 1198 1288 1372 1456 1471 1487 1540 1593 1560 1428 1325 1320 1323 1325 1374 1423
1870 1423 1402 1381 1384 1386 1418 1450 1427 1403 1328 1253 1270 1405 1485 1446 1342 1298 1312 1325 1373 1422 1412 1343 1319 1414 1453 1373 1243 1232 1285 1338 1355 1372 1389 1407
1866 1407 1458 1509 1462 1414 1385 1356 1357 1357 1414 1471 1472 1474 1523 1631 1682 1614 1572 1649 1692 1617 1507 1457 1428 1400 1447 1554 1638 1603 1624 1705 1785 1747 1675 1662 1667
1861 1667 1673 1711 1749 1728 1707 1712 1716 1721 1726 1713 1700 1673 1588 1554 1719 1940 2102 2205 2308 2377 2446 2509 2571 2641 2592 2536 2481 2360 2179 2020 1979 2000 1962
1857 1962 1873 1784 1691 1599 1571 1543 1516 1488 1494 1499 1538 1577 1621 1724 1805 1767 1728 1748 1794 1781 1715 1709 1726 1742 1763 1785 1776 1768 1757 1745 1682 1619 1573 1646 1722 1680
1853 1680 1639 1658 1672 1628 1598 1628 1658 1628 1600 1632 1667 1643 1583 1641 1730 1699 1600 1559 1537 1516 1493 1470 1477 1484 1445 1405 1425 1445 1461 1476 1492 1508 1482 1457 1442
1849 1442 1368 1255 1261 1335 1408 1401 1394 1387 1379 1371 1362 1413 1463 1434 1404 1415 1367 1270 1292 1381 1471 1428 1386 1343 1300 1319 1339 1358 1377 1363 1350 1366 1382 1366 1351 1434 1518
1844 1518 1540 1562 1585 1607 1633 1659 1685 1712 1648 1584 1579 1574 1558 1542 1527 1511 1489 1467 1504 1541 1526 1511 1445 1378 1370 1480 1620 1642 1563 1483 1495 1507 1469 1432 1394
1840 1394 1356 1322 1287 1316 1345 1333 1381 1466 1431 1367 1361 1414 1467 1446 1424 1436 1448 1404 1419 1467 1456 1370 1343 1382 1420 1386 1411 1505 1599 1624 1709 1823 1879 1825
1836 1825 1771 1812 1854 1755 1656 1623 1649 1624 1599 1577 1556 1528 1500 1501 1503 1497 1492 1546 1600 1541 1483 1429 1375 1291 1268 1307 1287 1221 1215 1267 1261 1185 1168 1250 1273 1216 1217 1281
1831 1281 1345 1308 1271 1372 1474 1483 1492 1531 1570 1530 1489 1508 1527 1485 1443 1500 1557 1492 1427 1392 1357 1290 1223 1255 1288 1295 1301 1312 1323 1287 1312 1435 1499 1458 1417
1827 1417 1472 1526 1513 1499 1486 1472 1393 1313 1332 1352 1342 1333 1383 1434 1388 1342 1392 1442 1451 1401 1359 1316 1225 1194 1228 1262 1232 1202 1307 1412 1419 1366 1406 1446 1413
1823 1413 1380 1406 1432 1385 1337 1349 1360 1330 1300 1328 1357 1329 1301 1372 1443 1374 1304 1351 1497 1596 1596 1629 1662 1637 1612 1642 1673 1630 1527 1532 1636 1669 1564
1818 1564 1428 1391 1396 1402 1413 1425 1368 1311 1354 1396 1360 1323 1386 1448 1409 1370 1391 1470 1502 1435 1390 1405 1401 1337 1255 1272 1322 1371 1427 1483 1405 1327 1344 1361 1328
1814 1328 1235 1215 1294 1347 1342 1338 1394 1446 1439 1461 1543 1649 1697 1680 1604 1500 1456 1474 1491 1381 1271 1300 1329 1331 1334 1389 1445 1418 1292 1276 1398 1491 1485 1504
1810 1504 1582 1615 1548 1504 1519 1540 1502 1463 1484 1516 1488 1438 1389 1355 1321 1383 1444 1434 1364 1328 1391 1423 1395 1348 1300 1283 1266 1309 1351 1348 1344 1430 1516 1508 1499 1491 1483
1806 1483 1454 1425 1465 1564 1565 1448 1398 1407 1367 1327 1345 1482 1502 1402 1307 1330 1373 1357 1345 1393 1432 1413 1401 1389 1359 1330 1370 1410 1413 1416 1428 1499 1532 1446 1410
1801 1410 1493 1563 1573 1583 1653 1647 1522 1463 1522 1637 1632 1632 1690 1707 1604 1489 1434 1368 1303 1275 1367 1368 1250 1156 1261 1394 1408 1358 1426 1553 1561 1515 1468
1797 1468 1450 1431 1409 1387 1406 1366 1319 1390 1477 1505 1484 1464 1498 1532 1477 1422 1403 1384 1394 1405 1316 1226 1192 1276 1367 1340 1346 1411 1444 1358 1273 1305 1285 1206 1202
1793 1202 1316 1413 1392 1321 1369 1465 1443 1333 1283 1289 1296 1306 1316 1306 1296 1279 1262 1272 1163 1051 1138 1260 1263 1201 1259 1377 1376 1286 1315 1395 1357 1285 1212
1789 1212 1266 1320 1324 1329 1384 1439 1425 1410 1377 1344 1215 1204 1236 1268 1278 1289 1323 1357 1334 1311 1378 1325 1223 1240 1275 1309 1282 1255 1299 1343 1318 1293 1323 1353
1785 1353 1333 1313 1401 1488 1447 1407 1432 1458 1434 1410 1409 1408 1358 1307 1319 1331 1343 1355 1363 1371 1329 1287 1333 1378 1354 1330 1318 1305 1196 1205 1249 1293 1276 1258 1326 1395
1780 1395 1407 1419 1471 1404 1288 1291 1327 1363 1356 1350 1397 1444 1343 1242 1288 1334 1373 1412 1475 1420 1322 1224 1281 1337 1356 1375 1505 1515 1424 1333 1353 1372 1282 1193
1776 1193 1234 1275 1286 1298 1300 1302 1304 1306 1392 1478 1376 1274 1324 1375 1396 1416 1463 1510 1448 1386 1412 1438 1414 1391 1447 1504 1452 1400 1431 1463 1366 1268 1251 1234 1217
1772 1217 1200 1240 1281 1252 1223 1366 1510 1540 1472 1454 1436 1412 1388 1428 1469 1440 1412 1494 1577 1492 1406 1409 1412 1415 1418 1484 1549 1466 1383 1328 1274 1249 1224 1295 1365
1768 1365 1326 1288 1250 1213 1225 1237 1313 1390 1377 1364 1410 1456 1374 1291 1341 1392 1294 1195 1213 1230 1247 1264 1230 1196 1152 1207 1387 1509 1461 1414 1417 1419 1333 1246
1763 1246 1315 1384 1284 1185 1190 1194 1150 1105 1187 1269 1262 1256 1232 1209 1185 1162 1321 1480 1412 1284 1281 1376 1385 1295 1294 1391 1397 1305 1279 1313 1307 1302 1316 1331 1257 1182 1202
1759 1202 1221 1170 1120 1207 1294 1332 1369 1426 1483 1412 1341 1363 1385 1379 1313 1297 1400 1416 1372 1369 1366 1298 1230 1251 1392 1467 1423 1384 1403 1386 1309 1305 1301 1232 1162 1184
1755 1184 1324 1344 1244 1200 1275 1347 1299 1275 1309 1337 1305 1312 1319 1323 1326 1404 1481 1465 1330 1308 1405 1453 1381 1372 1482 1559 1517 1509 1561 1517 1355 1219 1201 1217
1750 1217 1234 1306 1379 1382 1385 1403 1422 1391 1360 1381 1402 1341 1219 1201 1380 1466 1432 1380 1387 1394 1341 1343 1463 1518 1454 1418 1500 1494 1369 1261 1272 1335 1338 1345 1411 1427
1746 1427 1384 1360 1396 1435 1415 1430 1564 1648 1614 1656 1758 1789 1622 1493 1482 1536 1470 1385 1418 1485 1553 1587 1621 1535 1448 1446 1563 1663 1565 1466 1485 1549
1742 1549 1494 1382 1387 1448 1508 1539 1570 1512 1455 1433 1412 1390 1369 1398 1426 1425 1306 1222 1335 1434 1414 1353 1411 1452 1493 1505 1636 1738 1721 1689 1658 1693 1610
1738 1610 1516 1541 1581 1620 1601 1581 1562 1542 1545 1547 1555 1444 1369 1413 1519 1506 1480 1454 1445 1318 1225 1250 1298 1345 1328 1430 1540 1530 1511 1609 1671 1614 1504
1734 1504 1394 1354 1313 1219 1244 1306 1249 1207 1283 1389 1376 1289 1320 1355 1389 1329 1387 1449 1510 1511 1512 1580 1529 1496 1463 1452 1441 1440 1440 1464 1370 1236 1221 1314 1289
1730 1289 1224 1276 1391 1387 1358 1329 1381 1434 1391 1349 1313 1277 1218 1257 1328 1338 1334 1389 1439 1390 1277 1262 1319 1375 1361 1406 1480 1455 1377 1399 1422 1347 1194 1180
1726 1180 1287 1334 1325 1376 1492 1549 1507 1464 1447 1431 1404 1376 1391 1347 1283 1358 1480 1503 1426 1408 1442 1377 1276 1275 1379 1385 1319 1312 1378 1344 1228 1210 1299
1722 1299 1388 1426 1464 1531 1599 1537 1474 1464 1455 1415 1434 1484 1435 1313 1329 1451 1475 1389 1401 1518 1575 1477 1437 1493 1549 1498 1505 1569 1533 1396 1318 1316 1314 1238
1717 1238 1261 1360 1360 1281 1301 1446 1493 1376 1318 1386 1395 1284 1232 1291 1351 1308 1264 1330 1396 1270 1144 1245 1347 1308 1270 1321 1371 1320 1270 1387 1505
1714 1505 1441 1377 1423 1468 1433 1398 1452 1506 1393 1280 1296 1312 1246 1179 1296 1414 1397 1321 1368 1415 1339 1263 1318 1433 1462 1432 1489 1545 1489 1433 1411 1388
1710 1388 1295 1261 1342 1424 1333 1242 1336 1429 1404 1319 1337 1355 1264 1173 1270 1426 1422 1319 1271 1283 1241 1200 1254 1367 1366 1306 1332 1358 1330 1301 1323 1344 1264 1185
1706 1185 1260 1394 1407 1420 1526 1632 1563 1493 1552 1670 1645 1521 1503 1584 1607 1530 1528 1585 1595 1546 1599 1652 1606 1500 1464 1487 1403 1319 1350 1440 1482 1465
1702 1465 1484 1504 1401 1298 1306 1373 1353 1274 1317 1360 1295 1171 1187 1302 1296 1192 1197 1301 1370 1341 1336 1391 1375 1300 1331 1362 1354 1346 1500 1654 1616 1479 1534
1698 1534 1727 1817 1689 1614 1678 1705 1732 1756 1840 1792 1626 1524 1542 1510 1359 1316 1393 1467 1422 1381 1458 1535 1553 1571 1648 1675 1582 1557 1591 1596 1602 1679 1815
1694 1815 1811 1689 1612 1654 1666 1560 1458 1474 1457 1381 1358 1395 1378 1301 1294 1346 1343 1282 1305 1388 1387 1268 1254 1358 1404 1332 1349 1484 1547 1491 1485 1597 1607
1689 1607 1498 1439 1498 1601 1585 1599 1731 1789 1728 1700 1791 1883 1916 1948 2040 2007 1856 1789 1842 1872 1783 1694 1724 1759 1676 1596 1635 1683 1672 1627 1701 1745
1686 1745 1669 1601 1592 1542 1432 1394 1475 1514 1435 1385 1454 1526 1479 1435 1510 1561 1553 1594 1695 1727 1641 1620 1718 1776 1715 1640 1763 1915 1948 1945 1941 1923 1787 1732
1681 1732 1795 1859 1805 1750 1814 1853 1773 1787 1920 1973 1829 1685 1738 1763 1670 1581 1611 1669 1608 1547 1605 1678 1632 1586 1658 1686 1596 1505 1533 1536 1420 1319
1678 1319 1416 1505 1474 1503 1651 1790 1732 1644 1754 1888 1903 1918 2051 2198 2147 2076 2124 2196 2070 1850 1749 1705 1542 1429 1513 1672 1633 1544
1674 1544 1574 1608 1524 1420 1514 1629 1547 1371 1393 1457 1401 1301 1399 1586 1574 1508 1561 1652 1545 1379 1411 1574 1617 1488 1477 1595 1594 1419 1363
1671 1363 1452 1482 1423 1483 1612 1681 1652 1682 1767 1734 1692 1768 1915 1864 1719 1693 1809 1806 1659 1571 1625 1561 1397 1353 1426 1440 1395 1409 1482 1437 1292
1667 1292 1267 1352 1377 1308 1297 1322 1288 1241 1313 1457 1402 1209 1214 1423 1514 1465 1476 1515 1435 1212 1186 1364 1483 1430 1377 1410 1443 1372 1420 1547 1556 1466
1663 1466 1495 1626 1639 1478 1435 1526 1558 1455 1411 1502 1535 1428 1381 1476 1512 1412 1431 1580 1610 1503 1456 1546 1636 1591 1546 1582 1619 1517 1415 1498
1659 1498 1582 1527 1472 1520 1568 1518 1467 1577 1686 1578 1470 1492 1514 1431 1468 1615 1644 1531 1478 1567 1596 1452 1366 1417 1467 1459 1450 1536 1563 1489 1535 1747
1655 1747 1840 1716 1711 1885 1940 1819 1756 1910 2065 1965 1866 1878 1890 1724 1558 1631 1705 1640 1576 1609 1643 1578 1512 1620 1728 1618 1508 1620
1652 1620 1732 1665 1599 1689 1778 1689 1601 1654 1708 1662 1616 1687 1758 1690 1622 1715 1808 1683 1558 1614 1669 1551 1432 1624 1876 1904 1813 1896 1980 1878
1648 1878 1776 1901 2026 2013 1999 2109 2220 2152 2084 2206 2328 2192 2057 2063 2070 1900 1671 1705 1858 1877 1776 1741 1824 1804 1783 1831 1879 1749
1645 1749 1619 1674 1729 1685 1641 1748 1856 1713 1571 1667 1882 1886 1830 1935 2040 1925 1751 1760 1887 1807 1667 1740 1931 1909 1768 1867 2085 2055
1641 2055 1828 1777 1923 1922 1801 1795 1907 1846 1666 1651 1833 1868 1785 1848 1971 1910 1730 1720 1828 1759 1571 1578 1703 1691 1559 1590 1739 1755 1573
1638 1573 1524 1593 1591 1530 1601 1732 1692 1455 1421 1584 1610 1437 1431 1624 1677 1533 1471 1606 1633 1541 1541 1661 1646 1514 1460 1604 1609 1496 1480 1661
1634 1661 1699 1618 1631 1763 1761 1640 1644 1846 1875 1706 1658 1808 1899 1792 1690 1785 1777 1650 1595 1738 1777 1697 1709 1840 1882 1726 1672 1815 1900 1786
1630 1786 1735 1881 1889 1700 1643 1784 1866 1750 1648 1743 1810 1678 1637 1794 1817 1643 1620 1873 2122 2093 2068 2160 2248 2217 2330 2640 2826 2735
1627 2735 2664 2869 3035 2924 2823 2841 2804 2569 2377 2461 2491 2244 2041 2114 2173 2033 1889 2022 2140 2060 1944 2026 2107 1991 1898 2002 2076
1624 2076 1952 1832 1910 1998 1967 1978 2109 2155 2003 1934 2141 2353 2288 2190 2369 2598 2628 2562 2694 2836 2860 2880 3020 3154 3091 3082 3350 3727
1620 3727 4046 4499 5387 6903 9011 11470 13336 13426 11736 9585 8028 7068 6228 5547 5221 4926 4275 3659 3400 3269 2940
1618 2940 2597 2610 2722 2557 2365 2450 2594 2461 2263 2342 2480 2341 2161 2258 2361 2186 1932 2033 2269 2227 2054 2157 2354 2274 2066
1615 2066 2057 2146 2037 1952 2144 2390 2281 2013 2101 2392 2406 2209 2210 2383 2359 2190 2220 2353 2288 2089 2168 2350 2256 2080 2182 2422 2385 2175
1611 2175 2242 2486 2454 2296 2414 2711 2730 2549 2646 2885 2848 2658 2825 3278 3534 3627 3996 4682 5249 5931 7285 9103 10645 11460
1608 11460 11682 11266 10018 8283 6903 5999 5213 4427 3997 3948 3780 3408 3233 3287 3142 2837 2808 3037 3068 2884 2977 3278 3381
1605 3381 3202 3142 3265 3190 2832 2672 2809 2748 2465 2379 2590 2603 2365 2325 2581 2719 2627 2812 3250 3411 3151 2951 3075 3081 2840 2798
1602 2798 2978 2960 2669 2575 2813 2931 2828 2922 3273 3506 3493 3678 4091 4385 4536 5042 6073 7618 9949 13111 15689 15695 13170
1600 13170 10130 8104 6830 5629 4785 4612 4498 4022 3665 3865 4065 3860 3774 4226 4679 4797 5430 7178 9124 9856 9203
1597 9203 7952 6582 5277 4407 4080 3872 3515 3356 3621 3827 3593 3360 3538 3717 3624 3532 3764 3876 3599 3321 3372 3423 3122
1594 3122 2820 3014 3207 2958 2708 2914 3120 2892 2664 2812 2961 2812 2664 2931 3197 3091 2985 3255 3524 3408 3292 3597 4020
1591 4020 3979 3820 3948 4077 3787 3437 3469 3620 3385 3151 3378 3606 3433 3260 3508 3874 3742 3492 3656 4018 4058 4037 4498 5157
1588 5157 5625 6290 7564 8956 9624 9699 9575 9096 7921 6628 5991 5709 5148 4586 4532 4755 4577 4201 4246 4488 4350 4014 4093
1586 4093 4370 4210 3852 4024 4393 4352 4034 4131 4505 4437 4171 4360 4826 4904 4784 5052 5597 5829 6061 7052 8716 10314 11794
1583 11794 13510 14871 14892 13765 12498 11428 10238 9048 8435 8177 7552 6809 6663 6874 6652 6074 5882 5967 5580 4916 4776
1580 4776 5072 5004 4659 4759 5294 5476 5223 5316 5687 5542 4963 4903 5357 5415 5037 5080 5558 5709 5426 5562 6055 6074 5657 5680 6218
1577 6218 6274 5815 5658 6015 5976 5502 5477 5967 6111 5740 5790 6433 6734 6679 7331 8972 10515 11068 11053 10760 9815 8594 8099 8277
1574 8277 7977 7005 6454 6654 6601 6033 5990 6699 7034 6697 6622 7140 7336 6780 6492 6796 6777 6165 5953 6492 6809 6453 6286 6711
1571 6711 6793 6203 5939 6426 6683 6267 6143 6771 7144 6766 6640 7344 7913 7731 7697 8336 8683 8278 8225 9002 9460 8929 8477 8776
1568 8776 8918 8307 8009 8699 9246 8883 8669 9285 9615 9035 8721 9555 10343 10063 9719 10205 10555 10075 9871 10736 11546 11447 11546 12792
1565 12792 13939 13938 13641 14017 14091 13177 12484 13098 13922 13835 13986 15285 16469 16268 15623 15649 15508 14299 13233 13472 13854 13246 12797
1563 12797 13733 14839 14719 14460 15349 16094 15375 14519 15046 15897 15521 15056 15976 17050 16740 16173 16990 18096 17816 17320 18287 19539
1560 19539 19486 19324 20864 22878 23665 24572 27575 31327 33299 34040 35295 35845 33903 31229 30572 31221 30880 30440 31860 33760
1557 33760 33879 33513 35403 38597 40565 42474 47112 53740 60250 68724 84041 107826 138218 172883 206084 226484
1555 226484 224611 203105 173489 144987 121271 105192 98013 95659 92632 88997 87459 85789 79885 71865 67287 65763
1554 65763 62616 58347 57362 58723 57751 55636 57674 62817 64992 64110 65326 68114 67301 64258 65528 70544 72988 74166
1551 74166 80922 91048 95122 93775 97295 107273 115234 120281 130433 144053 150116 149593 155201 167120 173144 176448
1549 176448 195538 230937 264873 302395 374770 491509 643024 875754 1289006 1876235 2410570 2593130
1548 2593130 2336036 1838121 1371499 1059239 873063 755961 675216 599645 504886 403126 326173 279410
1546 279410 242577 207921 185807 175868 162724 141874 124386 114444 103513 89272 80135 78178 74915 67152 61644
1545 61644 61077 59678 55488 54264 58263 63013 67380 74715 82499 82252 72752 63053 58775 56198 52278 50613 52998 54948
1542 54948 53687 53098 56276 60442 62951 65461 68527 68784 65300 62489 63555 66163 68021 70788 75488 78962 78884 77817
1540 77817 78635 80124 80716 82298 86648 92146 96814 101997 109391 117457 124358 131536 141983 156505 174819 198790 232458
1538 232458 279539 343616 432577 564172 764486 1049548 1395892 1726623 1938233 1957184 1783032 1484552
1537 1484552 1157073 874661 665795 520877 417775 341934 287575 248686 217589 191239 171655 159453
1535 159453 151405 146092 147149 158264 178677 204470 229591 244906 241270 217750 183429 149237 120306 97271
1533 97271 80527 69400 61162 53773 48086 44744 41994 38529 35578 34227 32995 30447 27899 26813 26082 24463 23041
1531 23041 22978 23113 22177 21180 21283 21505 20674 19725 19800 19816 18573 17131 16915 17055 16291 15409 15619 16107 15789 15353 15910 16526 15854
1529 15854 14747 14531 14671 13993 13196 13428 14015 13704 12957 12996 13392 13013 12437 12707 13332 13147 12684 12904 13401 13283 13283 14608 16606
1526 16606 17832 18306 18810 18800 17460 15605 14699 14387 13540 12337 11875 11928 11434 10664 10625 10942 10558 9738 9580 9858 9582 9109
1523 9109 9495 10476 10878 10767 11026 11483 11355 10870 10909 11225 10788 9916 9647 9892 9667 9086 9089 9527 9501 9198 9632 10659 11068 10805
1520 10805 10690 10693 10112 9174 8899 9296 9394 9215 9561 10262 10182 9349 8789 8742 8422 7745 7479 7727 7613 7063 6895 7241 7235 6874 6923
1517 6923 7407 7405 6889 6640 6827 6674 6165 6072 6493 6692 6614 7005 7753 7872 7161 6637 6707 6575 6008 5777 6140 6346 6118 6003 6244
1514 6244 6164 5649 5381 5627 5688 5314 5201 5524 5498 5036 4861 5280 5525 5335 5368 5836 6104 5858 5785 6227 6440 6138 5886 6069 6094
1511 6094 5685 5483 5796 5939 5568 5375 5696 5847 5485 5231 5492 5656 5464 5480 5931 6152 5780 5511 5757 5988 5784 5733 6196 6748
1508 6748 7102 7792 9155 10560 11292 11550 11530 10972 9741 8649 8230 7948 7311 6753 6630 6534 6162 5992 6336 6742 6713 6630 6903
1505 6903 7011 6605 6184 6198 6299 6044 5883 6236 6711 6830 6851 7148 7317 6893 6339 6221 6254 6010 5890 6284 6772 6824 6714 6801 6759
1502 6759 6203 5548 5328 5241 4876 4526 4612 4788 4609 4390 4606 4928 4893 4834 5131 5515 5542 5461 5736 5998 5745 5290 5191 5205 4942 4690
1499 4690 4951 5405 5583 5755 6363 7303 8126 8859 9710 10211 9802 8898 8192 7645 6900 6150 5914 5925 5660 5266 5228 5359 5213 4933
1496 4933 4930 5083 4960 4692 4781 5002 4946 4722 4775 5031 5089 5003 5195 5563 5654 5607 5916 6408 6702 7025 7784 8587 8796 8479 8361 8543
1493 8543 8665 8779 9249 9832 9901 9374 8847 8358 7592 6730 6303 6252 6082 5853 5980 6355 6533 6567 6799 7118 7002 6490 6176 6174 6053
1490 6053 5714 5574 5753 5815 5688 5838 6263 6490 6534 6934 7704 8276 8453 8432 8250 7633 6678 5999 5688 5378 5011 5000 5253 5309 5077
1487 5077 4965 5020 4799 4289 3978 4031 4025 3807 3787 4021 4136 3919 3821 3909 3878 3624 3569 3879 4071 4011 4069 4409 4631 4617 4604 4751 4701 4465
1483 4465 4427 4729 4913 4798 4743 4878 4894 4570 4365 4380 4276 3955 3753 3895 3919 3689 3578 3715 3793 3700 3725 4081 4319 4290 4262 4500
1480 4500 4678 4649 4738 5080 5482 5853 6343 6870 6805 6119 5433 5182 5051 4726 4520 4713 4905 4768 4632 4752 4872 4735 4598 4812
1477 4812 5026 4911 4796 5120 5563 5741 5800 5940 5961 5640 5378 5492 5724 5705 5805 6367 7206 7971 9171 11296 13776 15317 15235
1474 15235 13784 11740 9824 8501 7844 7385 6720 6055 5659 5381 4974 4685 4664 4702 4455 4149 4094 4099 3896 3694 3778 3980 4004 3910
1471 3910 3959 4008 3911 3815 3998 4182 4064 3827 3792 3876 3784 3633 3647 3720 3586 3452 3517 3700 3679 3657 3867 4077 4025 3855 3965 4193 4243 4233
1468 4233 4422 4611 4546 4421 4572 4921 5083 5126 5319 5512 5472 5312 5337 5421 5208 4875 4740 4803 4722 4523 4593 4782 4764 4626 4731 5113
1465 5113 5447 5721 6244 7122 8242 9718 11591 13344 14134 13776 12764 11475 9928 8440 7410 6815 6288 5762 5453 5341
1462 5341 5099 4738 4551 4562 4439 4119 3977 4034 4103 4113 4217 4380 4329 4079 3919 3877 3738 3539 3576 3732 3758 3666 3765 4062 4307 4433
1459 4433 4562 4691 4601 4312 4168 4222 4133 3845 3705 3684 3564 3325 3212 3297 3248 3002 2874 2944 2910 2758 2763 2965 2960 2757 2636 2792 2898
1456 2898 2807 2799 2911 2854 2599 2452 2582 2668 2555 2522 2687 2792 2699 2601 2702 2752 2684 2683 2800 2868 2738 2615 2689 2763 2639 2545 2649 2708 2649
1452 2649 2653 2855 2998 2943 2889 2954 2920 2767 2676 2782 2828 2677 2522 2486 2450 2295 2199 2302 2419 2417 2438 2577 2667 2559 2511 2660 2761 2742 2728
1449 2728 2833 2889 2747 2658 2768 2872 2779 2683 2706 2774 2643 2538 2630 2732 2715 2757 2917 3067 3019 3014 3207 3409 3493 3527 3678 3702 3527 3340
1445 3340 3351 3362 3175 3013 3049 3099 3031 3000 3167 3334 3303 3240 3295 3336 3179 2994 3006 3019 2833 2622 2609 2655 2503 2368 2431 2553 2478 2322
1442 2322 2364 2455 2428 2344 2378 2418 2338 2215 2289 2368 2249 2099 2147 2249 2232 2160 2285 2470 2457 2371 2405 2537 2471 2399 2446 2537 2431 2310 2387 2558
1438 2558 2610 2544 2675 2861 2928 2953 3097 3285 3275 3093 3029 3009 2792 2538 2481 2593 2585 2499 2532 2609 2488 2311 2252 2332 2294 2180 2263 2406 2352
1435 2352 2140 2047 2098 2090 2020 2146 2336 2329 2221 2233 2338 2324 2168 2129 2235 2221 2094 2164 2363 2445 2350 2315 2379 2384 2339 2414 2556 2580 2500 2617
1431 2617 2909 3003 2894 2844 2942 2941 2735 2529 2495 2461 2366 2272 2277 2282 2205 2128 2190 2252 2198 2144 2228 2253 2198 2242 2384 2428 2320 2272 2345 2319 2179 2138
1427 2138 2198 2160 2033 2044 2172 2201 2046 1991 2089 2128 2055 2042 2163 2225 2142 2059 2111 2104 1998 1991 2125 2160 2010 1959 2096 2175 2097 2018 2035 2052 1904
1423 1904 1755 1824 1893 1873 1853 1936 2018 1957 1956 2079 2104 1935 1826 1940 2114 2164 2215 2328 2441 2387 2333 2377 2422 2273 2125 2115 2105 2066 2027 2166
1420 2166 2305 2288 2272 2294 2258 2119 2080 2232 2324 2230 2136 2217 2297 2282 2266 2370 2374 2193 2072 2128 2184 2056 1927 1976 2026 1944 1863 1992 2122 2097
1416 2097 1973 1930 1947 1867 1788 1850 1913 1907 1901 1994 2087 2027 1966 2124 2281 2214 2146 2214 2281 2202 2063 2069 2193 2244 2295 2472 2768 3081 3512 4268 5024
1412 5024 5293 5048 4559 4011 3444 2997 2748 2618 2422 2226 2184 2262 2214 2107 2105 2222 2220 2098 2076 2172 2254 2217 2194 2172 2079 1987 2071 2214
1409 2214 2219 2105 2086 2185 2247 2191 2201 2270 2319 2308 2356 2464 2481 2439 2430 2480 2499 2518 2717 2975 3095 3096 3281 3664 4190 4835 6019 7955 10315
1405 10315 12161 12519 11254 9139 7222 5948 5109 4415 3919 3723 3646 3457 3208 3072 3054 2962 2870 2845 2820 2637 2453 2417 2500 2495
1402 2495 2431 2466 2560 2533 2388 2341 2413 2443 2414 2448 2541 2530 2460 2489 2577 2558 2480 2537 2793 2950 2989 3074 3218 3315 3411 3583 3874 4205 4537 5123
1399 5123 6144 7751 9952 12112 13126 12347 10262 8138 6686 5731 4974 4479 4261 4074 3769 3567 3563 3555 3428 3307 3304 3235 3048
1396 3048 2999 3069 3143 3098 3113 3246 3315 3265 3315 3482 3516 3430 3404 3497 3540 3464 3438 3610 3755 3702 3640 3696 3718 3621 3583 3664 3707 3632 3655 3798 3898
1392 3898 3879 3887 4092 4334 4635 5256 6075 6593 6439 5793 5147 4609 4189 3920 3849 3873 3779 3667 3614 3553 3432 3328 3423 3502 3463 3373 3402
1389 3402 3442 3423 3404 3444 3467 3373 3329 3403 3462 3324 3133 3141 3258 3375 3505 3635 3754 3873 4046 4277 4418 4360 4284 4326 4294 4142 3932 3840
1385 3840 3739 3519 3358 3395 3573 3693 3787 4001 4194 4329 4463 4656 4762 4750 4733 4835 4962 4971 5028 5284 5602 5722 5788 5972 6189 6208
1382 6208 6127 6105 6123 6022 5918 5932 5952 5852 5760 5787 5930 6073 6242 6610 6996 7264 7433 7720 8014 8110 7945 7780 7653 7467 7244 7140
1379 7140 7156 7112 7043 7092 7260 7428 7529 7749 8021 8175 8306 8497 8717 8879 9003 9245 9539 9714 9825 10055 10307 10361 10237 10113 10024
1376 10024 9936 9806 9736 9675 9495 9200 8905 8666 8308 7951 7712 7632 7553 7480 7408 7439 7469 7454 7498 7495 7294 6994 6752 6628 6445 6207 6027
1373 6027 5958 5888 5782 5735 5773 5692 5607 5641 5777 5794 5755 5834 6052 6210 6222 6174 6119 6006 5825 5704 5594 5424 5217 5129 5099 4950 4736 4581
1369 4581 4504 4307 4012 3835 3787 3679 3474 3268 3161 3053 2889 2825 2896 2967 2946 2925 3061 3198 3156 3115 3061 3007 2893 2780 2764 2748 2673 2598
1366 2598 2580 2561 2484 2406 2458 2510 2462 2415 2447 2479 2412 2345 2368 2392 2316 2240 2282 2323 2335 2346 2354 2362 2271 2180 2200 2219 2179 2140 2166 2191 2079 1966 2012 2057
1362 2057 2004 1951 1939 1927 1856 1786 1826 1866 1847 1828 1929 2030 1953 1876 1837 1798 1759 1721 1808 1895 1883 1871 1920 1968 1918 1868 1943 2017 1954 1890 1894 1897 1871 1845
1358 1845 1871 1896 1783 1670 1734 1799 1764 1729 1785 1841 1798 1755 1804 1852 1802 1752 1806 1860 1816 1771 1831 1890 1890 1890 1953 2015 1979 1943 1981 2019 1922 1825 1919 2072
1353 2072 2108 2046 2032 2018 1899 1780 1776 1773 1769 1766 1812 1859 1735 1611 1595 1698 1705 1712 1754 1796 1778 1761 1762 1764 1706 1648 1776 1904 1893 1882 1956 2029 2044 2058 2122
1349 2122 2185 2328 2590 3064 3658 4291 4805 5114 4988 4407 3707 3199 2889 2567 2245 2073 2020 1930 1839 1868 1897 1795 1693 1698 1822 1847
1346 1847 1753 1775 1797 1787 1658 1625 1711 1698 1566 1482 1517 1456 1394 1357 1438 1453 1467 1493 1518 1412 1307 1304 1420 1537 1534 1560 1585 1574 1562 1617 1671 1634
1342 1634 1597 1607 1734 1771 1688 1597 1625 1586 1547 1508 1587 1615 1524 1451 1496 1497 1498 1550 1602 1630 1539 1479 1538 1523 1507 1536 1566 1535 1505 1529 1552 1546 1540 1579 1618 1605
1338 1605 1592 1560 1646 1732 1700 1677 1654 1606 1497 1430 1481 1499 1458 1425 1451 1477 1443 1458 1533 1548 1503 1474 1505 1539 1513 1512 1629 1686 1625 1585 1604 1564 1464
1334 1464 1406 1466 1459 1452 1506 1619 1709 1681 1705 1788 1808 1769 1747 1784 1766 1688 1648 1726 1745 1645 1599 1612 1599 1468 1417 1485 1552 1501 1418 1454 1489 1406 1314 1341
1329 1341 1368 1276 1210 1262 1372 1423 1409 1394 1324 1254 1229 1322 1385 1389 1420 1511 1540 1450 1423 1515 1603 1572 1488 1464 1439 1355 1298 1359 1425 1371 1277 1301 1292 1224 1237
1325 1237 1369 1504 1521 1433 1464 1499 1416 1307 1395 1570 1627 1623 1619 1622 1507 1385 1382 1478 1456 1347 1356 1424 1432 1373 1313 1257 1201 1157 1232 1367 1382 1406 1430
1321 1430 1447 1463 1407 1350 1393 1435 1492 1550 1582 1496 1432 1487 1641 1676 1708 1858 2136 2295 2305 2255 2203 2032 1837 1701 1663 1625 1585 1544 1511 1478 1482
1317 1482 1603 1639 1556 1444 1530 1631 1613 1464 1433 1470 1507 1488 1527 1604 1562 1468 1433 1457 1480 1473 1465 1532 1480 1379 1398 1475 1434 1389 1461 1629 1679 1653
1313 1653 1686 1749 1693 1581 1528 1536 1545 1502 1518 1575 1514 1427 1460 1552 1525 1401 1396 1457 1459 1365 1390 1516 1583 1547 1511 1512 1454 1343 1350 1459 1508 1430 1353 1410 1467
1309 1467 1437 1408 1477 1546 1525 1503 1541 1579 1525 1472 1478 1483 1422 1362 1518 1675 1679 1682 1686 1689 1650 1611 1572 1532 1551 1570 1589 1608 1549 1489 1530 1512 1470 1546 1768 1930
1305 1930 2009 2148 2376 2486 2474 2462 2443 2424 2275 2127 2045 1963 1756 1668 1731 1794 1770 1746 1782 1817 1645 1473 1487 1620 1659 1638 1717 1797 1734 1671
1301 1671 1667 1664 1614 1565 1615 1664 1621 1578 1634 1690 1710 1730 1750 1769 1660 1551 1659 1768 1748 1728 1738 1748 1765 1782 1937 2093 2299 2506 2917 3329
1297 3329 3521 3515 3403 3292 3058 2824 2620 2416 2236 2056 2015 1973 1869 1764 1798 1833 1785 1738 1749 1761 1748 1735 1781 1885 1904 1804 1771 1797
1294 1797 1762 1728 1697 1666 1603 1539 1575 1610 1552 1495 1532 1569 1539 1449 1421 1511 1554 1538 1585 1691 1781 1813 1873 1994 2064 2075 2150 2283 2391 2498 2550 2602
1290 2602 2458 2314 2200 2085 2000 1915 1889 1863 1760 1657 1692 1728 1668 1608 1647 1686 1664 1641 1619 1596 1499 1403 1483 1622 1643 1545 1503 1579 1592 1487
1286 1487 1478 1528 1492 1396 1402 1526 1614 1583 1577 1689 1731 1575 1412 1368 1362 1357 1358 1360 1362 1364 1459 1613 1698 1585 1457 1448 1454 1401 1373 1465 1550 1518 1466 1474 1543 1611 1654
1282 1654 1697 1627 1558 1547 1537 1523 1509 1524 1540 1494 1449 1461 1533 1547 1441 1395 1468 1482 1436 1416 1515 1593 1552 1545 1597 1630 1545 1492 1499 1487 1415 1377 1398 1390 1382 1430
1277 1430 1478 1491 1385 1335 1404 1472 1480 1466 1451 1371 1231 1228 1344 1429 1395 1332 1387 1451 1395 1314 1352 1398 1386 1380 1375 1368 1301 1253 1324 1437 1432 1438 1444 1451 1398 1365 1450
1273 1450 1481 1393 1335 1396 1512 1509 1450 1510 1598 1626 1599 1631 1703 1716 1707 1698 1638 1578 1543 1626 1681 1618 1532 1506 1519 1472 1418 1482 1582 1562 1478 1395 1394 1393 1362 1331
1269 1331 1327 1322 1381 1560 1653 1628 1537 1506 1499 1374 1248 1242 1318 1335 1293 1252 1283 1313 1344 1374 1347 1320 1264 1207 1221 1235 1340 1445 1464 1363 1255 1266 1323
1264 1323 1262 1200 1258 1353 1330 1285 1299 1392 1427 1399 1372 1378 1384 1386 1388 1403 1358 1276 1313 1371 1370 1340 1369 1455 1423 1295 1286 1343 1399 1393 1446 1555 1546 1468 1391 1398 1405 1412 1419
1260 1419 1503 1586 1530 1475 1515 1556 1566 1577 1595 1614 1533 1452 1380 1307 1271 1335 1440 1446 1335 1225 1221 1217 1243 1269 1308 1347 1356 1365 1384 1402 1362 1321 1358 1395 1462
1255 1462 1528 1523 1519 1484 1449 1513 1578 1582 1587 1563 1539 1534 1589 1644 1600 1483 1425 1425 1425 1399 1373 1429 1484 1481 1477 1520 1562 1506 1450 1416 1382 1407 1432 1462 1491 1490 1489 1459 1429
1251 1429 1429 1429 1464 1500 1476 1452 1477 1502 1468 1434 1474 1515 1525 1536 1567 1599 1531 1464 1488 1513 1531 1550 1611 1573 1458 1403 1428 1453 1423 1392 1391 1389 1328 1267 1344 1421
1246 1421 1399 1377 1379 1381 1354 1326 1326 1326 1325 1325 1280 1236 1221 1206 1302 1397 1430 1463 1474 1426 1353 1378 1529 1621 1575 1528 1574 1620 1528 1435 1489 1542 1536 1530 1565 1599 1495
1242 1495 1391 1362 1332 1302 1272 1301 1330 1359 1387 1409 1430 1392 1354 1435 1516 1498 1480 1436 1392 1349 1305 1314 1323 1273 1223 1315 1408 1361 1315 1355 1395 1375 1356 1376 1396
1237 1396 1357 1318 1398 1478 1380 1282 1244 1205 1226 1247 1356 1466 1459 1353 1245 1236 1264 1292 1375 1458 1442 1426 1417 1409 1400 1391 1388 1385 1382 1379 1407 1435 1364 1293 1285 1278 1270 1262 1337
1233 1337 1411 1386 1362 1321 1280 1209 1138 1173 1208 1243 1277 1312 1347 1244 1140 1208 1277 1285 1294 1326 1358 1334 1310 1339 1427 1445 1365 1330 1394 1434 1414 1409 1463 1514 1505
1228 1505 1434 1362 1346 1330 1375 1421 1436 1452 1373 1293 1218 1241 1327 1412 1325 1239 1272 1306 1310 1314 1305 1296 1287 1278 1360 1442 1408 1275 1242 1308 1345 1323 1369 1415 1398 1381 1425
1224 1425 1469 1483 1497 1469 1441 1360 1279 1261 1342 1374 1347 1333 1379 1424 1410 1425 1499 1536 1474 1406 1396 1353 1310 1302 1392 1461 1470 1446 1423 1396 1368 1396 1423 1395 1366
1220 1366 1377 1447 1484 1421 1357 1351 1366 1380 1367 1354 1344 1334 1359 1442 1493 1444 1387 1389 1382 1374 1416 1458 1445 1431 1433 1494 1551 1510 1439 1428 1437 1445 1443 1441 1439 1437 1450 1463 1419 1316
1215 1316 1295 1414 1565 1618 1596 1574 1517 1460 1491 1522 1523 1524 1506 1487 1528 1569 1654 1740 1749 1659 1583 1606 1659 1653 1668 1682 1752 1822 1804 1786 1775 1764 1783 1921 2033
1210 2033 2026 1948 1930 2009 2088 2095 2102 2011 1861 1714 1686 1687 1687 1748 1809 1842 1755 1684 1672 1712 1692 1650 1608 1621 1635 1677 1720 1792 1864 1889 1915 1849 1783 1767 1870
1206 1870 1972 2016 2076 2195 2318 2322 2303 2343 2401 2460 2546 2632 2700 2708 2721 2853 3011 3050 3032 3014 2959 2904 2815 2726 2667 2608 2590 2573 2500 2427 2391 2414 2379
1202 2379 2225 2104 2101 2196 2232 2212 2193 2177 2161 2172 2302 2439 2457 2413 2487 2558 2509 2372 2295 2276 2198 2061 2042 2130 2219 2254 2289 2354 2418 2450 2481 2575
1198 2575 2670 2711 2812 2920 2909 2806 2763 2811 2799 2704 2608 2608 2608 2550 2492 2471 2451 2408 2485 2633 2781 2791 2801 2950 3098 3215 3332 3389 3446 3407 3368
1194 3368 3344 3201 2966 2849 2837 2824 2651 2478 2502 2646 2795 3064 3522 3981 4346 4592 4782 4852 4682 4313 3870 3428 3085 2743 2511
1191 2511 2399 2332 2264 2205 2145 2127 2110 2099 2089 2095 2220 2337 2454 2548 2643 2707 2772 2710 2648 2646 2643 2581 2519 2428 2336 2248 2160 2171 2182 2105 2029 2012 1995 1912
1187 1912 1829 1806 1782 1748 1715 1710 1706 1671 1637 1661 1686 1676 1666 1686 1706 1661 1617 1671 1725 1692 1660 1627 1594 1524 1455 1445 1434 1441 1449 1555 1661 1688 1716 1744 1772
1183 1772 1782 1791 1772 1752 1650 1547 1544 1540 1531 1522 1573 1623 1625 1627 1689 1750 1744 1737 1731 1724 1705 1686 1726 1766 1772 1779 1845 1911 1870 1829 1886 1944 1848 1751 1753 1756 1728 1701 1674 1647 1608
1178 1608 1570 1630 1691 1642 1593 1639 1686 1628 1511 1431 1450 1484 1517 1656 1794 1804 1814 1824 1834 1813 1792 1771 1751 1738 1726 1714 1702 1618 1534 1588 1643 1651 1660 1669
1174 1669 1677 1728 1780 1831 1882 1886 1890 1894 1899 1868 1837 1807 1776 1821 1866 1911 1956 1950 1944 1997 2051 2058 2066 2074 2082 2074 2067 2060 2052 2019 1986 2012 2038 1991 1945 1898 1852 1871 1890 1909 1928 1905
1169 1905 1882 1860 1837 1765 1693 1680 1667 1707 1748 1887 2026 2065 2104 2144 2183 2159 2135 2171 2206 2195 2184 2172 2161 2101 2041 2041 2040 1999 1957 2038 2218 2305 2392 2492
1164 2492 2592 2763 3053 3481 3909 4149 4191 4171 4270 4367 4345 4167 3871 3474 3077 2863 2767 2621 2475 2401 2445 2465 2367 2342 2318 2272 2227 2181
1161 2181 2135 2125 2115 2104 2094 2099 2103 2167 2231 2300 2370 2380 2390 2385 2380 2507 2633 2742 2733 2776 2937 3127 3198 3284 3370 3407 3444 3473 3503 3504 3386 3236 3086
1157 3086 3044 3002 3019 3037 3113 3190 3318 3447 3651 3736 3821 3906 3968 3912 3785 3657 3681 3705 3630 3556 3540 3525 3509 3494 3562 3630 3699 3767 3777 3787 3948
1153 3948 4228 4489 4751 5020 5288 5531 5774 5918 6062 6179 6295 6261 6108 5960 5812 5755 5698 5595 5492 5460 5547 5748 5949 6197 6563
1150 6563 7020 7595 8353 9309 10500 11968 13649 15448 17006 18049 18380 18039 17152 15908 14560 13331 12372 11768 11472 11531
1148 11531 11825 12238 12737 13236 13715 14074 14224 14176 13879 13384 12860 12395 12038 11740 11526 11509 11660 11930 12412 13171 14142 15231 16474
1145 16474 17915 19588 21539 23699 25859 27843 29470 30873 32078 32921 33092 32744 32119 31515 31029 30801 31008 31936 33696
1143 33696 36296 39727 43848 48404 53231 58117 62777 66844 70076 72477 74115 75161 75805 76252 76452 76295 75560 74153
1140 74153 71864 68666 64707 60234 55557 50939 46627 42908 39905 37733 36555 36366 36863 37715 38784 40131 41533 42578
1138 42578 42991 42889 42605 42122 41353 40227 38994 37879 37096 36668 36481 36412 36536 36937 37694 38728 40063 41834 44084 46849
1136 46849 50069 53724 57839 62468 67563 73171 79317 86213 94327 104062 115930 130449 148662 172058 202809 244124
1134 244124 300012 374692 470309 584322 707488 823968 914607 962638 958976 905426 813731 701345 586056
1132 586056 481093 393156 323300 269109 227144 194137 167500 145451 126845 111006 97500 86092 76622 68681
1130 68681 61887 55978 50979 46939 43573 40700 38184 35915 33765 31723 29880 28244 26727 25308 24088 23068 22166
1128 22166 21270 20373 19608 18843 18138 17432 16861 16289 15721 15213 14810 14525 14208 13831 13395 12900 12435 11970 11549 11128 10707 10286 9959
1126 9959 9632 9305 9096 9004 9030 9027 9024 8992 8960 8898 8836 8835 8834 8774 8713 8593 8472 8253 8033 7866 7698 7531 7363 7224 7085 6945 6806 6735 6663
1122 6663 6533 6402 6310 6217 6125 6033 6053 6073 5955 5837 5778 5719 5628 5418 5192 4965 4761 4557 4503 4448 4394 4340 4303 4265 4228 4190 4231 4271 4311 4351
1118 4351 4385 4419 4447 4475 4496 4418 4264 4169 4214 4259 4248 4237 4193 4148 4045 3941 3863 3786 3708 3630 3617 3603 3642 3682 3713 3645 3500 3415 3487 3559 3536 3513
1114 3513 3506 3499 3394 3228 3118 3106 3135 3163 3233 3303 3373 3443 3432 3420 3349 3279 3278 3278 3179 3079 3108 3137 3106 3076 3084 3091 3040 2929 2847 2864 2881 2898 2899 2900 2960 3021
1110 3021 3022 3023 2965 2906 2860 2814 2709 2604 2703 2801 2841 2880 2885 2890 2796 2702 2712 2722 2634 2545 2544 2543 2546 2549 2591 2693 2722 2652 2603 2613 2589 2466 2377 2426 2490 2555
1106 2555 2577 2599 2562 2525 2533 2541 2549 2557 2531 2504 2418 2333 2352 2372 2392 2411 2409 2406 2403 2401 2413 2424 2376 2329 2335 2342 2349 2355 2375 2394 2355 2315 2357 2398 2381 2363 2358 2353 2348 2342 2374 2406
1101 2406 2339 2272 2252 2232 2253 2215 2198 2299 2363 2368 2309 2249 2190 2131 2192 2314 2337 2242 2184 2246 2307 2249 2146 2162 2235 2250 2218 2187 2152 2117 2168 2219 2172
1097 2172 2124 2117 2109 2105 2101 2100 2160 2252 2226 2175 2125 2166 2207 2282 2356 2333 2250 2223 2315 2403 2372 2267 2162 2148 2135 2154 2174 2193 2213 2208 2203 2138 2074 2077 2081 2085 2088 2088 2088 2088
1092 2088 2088 2105 2122 2138 2155 2088 2020 2012 2004 2047 2089 2074 1999 1951 2022 2093 2045 1935 1883 1930 1976 2080 2184 2260 2218 2171 2184 2192 2142 2088 2093 2132 2052 1929 1865
1087 1865 1863 1862 1896 1989 2063 2018 1893 1867 1956 2044 2071 2098 2066 1974 1892 1908 1997 2026 2000 1974 1944 1915 1911 1908 1964 2020 1977 1934 1891 1848 1840 1832 1923 2014 1988 1961 1934
1083 1934 1908 1894 1880 1870 1860 1940 2079 2181 2185 2132 2080 2028 1975 1957 2037 2098 2100 2050 2059 2070 2022 1950 1976 2075 2115 2077 2039 2097 2154 2132 2110 2147 2185 2151 2118
1079 2118 2143 2169 2150 2131 2142 2153 2164 2175 2216 2257 2255 2252 2250 2247 2236 2225 2352 2479 2595 2711 2768 2825 2871 2918 2909 2899 2849 2859 2894 2830 2711 2651 2650 2650 2572
1074 2572 2495 2477 2459 2331 2203 2214 2225 2162 2099 2065 2032 2068 2103 2139 2175 2136 2097 2035 1973 1892 1910 2011 2111 2138 2165 2192 2219 2200 2180 2164 2147 2116
1070 2116 2145 2236 2268 2280 2350 2476 2543 2476 2410 2438 2467 2412 2356 2400 2444 2419 2394 2395 2456 2504 2553 2579 2606 2598 2650 2803 2956 2998 2981 2997 3013 3006 3000 2996 2934
1066 2934 2813 2691 2665 2639 2481 2324 2267 2270 2235 2140 2049 2017 1967 1916 1932 2006 2032 1999 1969 1998 2005 2011 2021 2030 2034 2038 2075 2052 1991 1930 1898 1867 1744 1680 1757
1062 1757 1835 1840 1786 1792 1857 1884 1911 1971 2032 2088 2144 2256 2368 2419 2410 2431 2452 2472 2433 2398 2363 2322 2281 2184 2087 2012 1995 2044 2094 2073 2052 2057 2062 2023 1926 1858
1057 1858 1849 1832 1815 1857 1899 1876 1792 1742 1791 1863 1875 1867 1859 1829 1800 1800 1800 1777 1754 1753 1812 1828 1784 1685 1646 1731 1816 1862 1809 1730 1651 1629 1607 1544 1540 1602 1664 1705
1053 1705 1746 1787 1828 1796 1765 1734 1702 1673 1644 1750 1856 1909 1902 1834 1766 1673 1639 1707 1774 1760 1685 1671 1715 1711 1708 1730 1811 1885 1899 1891 1884 1793 1702 1713 1782 1819
1048 1819 1796 1806 1816 1814 1753 1665 1677 1699 1661 1630 1658 1704 1751 1775 1740 1673 1607 1638 1729 1752 1717 1774 1831 1818 1745 1742 1839 1884 1829 1800 1829 1837 1785 1733 1741 1744 1689
1044 1689 1637 1645 1696 1748 1744 1741 1722 1703 1685 1666 1663 1660 1713 1766 1776 1726 1676 1686 1719 1751 1784 1817 1853 1830 1781 1732 1664 1596 1627 1717 1775 1734 1713 1751 1789 1728 1611
1039 1611 1593 1629 1664 1706 1748 1784 1820 1857 1893 1891 1889 1828 1766 1761 1755 1749 1743 1672 1601 1589 1577 1594 1611 1680 1750 1778 1707 1659 1669 1655 1641 1630 1620 1598 1577 1575 1632 1690
1035 1690 1649 1574 1559 1576 1593 1673 1753 1784 1815 1787 1758 1753 1748 1704 1719 1740 1662 1588 1612 1699 1786 1740 1694 1654 1615 1714 1812 1866 1919 1932 2005 2012 1920 1832 1843 1925
1030 1925 2008 2037 2066 2190 2313 2338 2363 2290 2217 2144 2071 2050 2030 1950 1870 1862 1854 1846 1837 1853 1868 1824 1780 1856 1932 1949 1965 2000 2034 2162 2289 2405 2422 2396
1026 2396 2370 2356 2343 2230 2117 2081 2045 2009 1973 1954 1934 1915 1896 1894 1892 1831 1769 1718 1667 1714 1761 1768 1775 1722 1669 1674 1679 1683 1688 1667 1645 1683 1721 1758 1795 1772 1749
1022 1749 1764 1778 1789 1800 1793 1727 1638 1649 1684 1719 1757 1794 1831 1808 1757 1805 1902 1900 1822 1743 1722 1701 1680 1660 1658 1657 1656 1655 1678 1700 1624 1548 1599 1650 1602 1554 1596
1017 1596 1638 1580 1464 1440 1515 1624 1673 1721 1769 1754 1739 1770 1801 1831 1862 1937 2011 2043 1975 1850 1724 1691 1658 1656 1653 1650 1648 1740 1833 1787 1741 1759 1778 1737
1013 1737 1696 1738 1780 1822 1863 1779 1695 1671 1646 1662 1678 1694 1710 1683 1656 1629 1602 1596 1589 1583 1577 1629 1681 1674 1666 1644 1621 1599 1577 1615 1652 1631 1609 1622 1635 1703 1772
1008 1772 1789 1746 1704 1720 1756 1791 1767 1743 1806 1810 1748 1686 1694 1701 1705 1709 1735 1702 1610 1577 1642 1707 1716 1725 1808 1890 1874 1858 1865 1872 1784 1697 1698 1758 1786 1813 1833 1853 1817
1004 1817 1781 1787 1853 1863 1814 1773 1792 1777 1762 1740 1778 1782 1786 1767 1748 1675 1603 1577 1650 1727 1803 1846 1888 1960 1972 1926 1820 1710 1660 1670 1680 1635 1590 1597 1604 1612
999 1612 1619 1682 1745 1746 1688 1671 1713 1718 1722 1684 1646 1608 1569 1542 1516 1548 1581 1575 1569 1527 1543 1621 1639 1562 1486 1505 1624 1742 1762 1704 1647 1554 1520 1553 1645 1682 1659
995 1659 1632 1605 1574 1544 1574 1604 1574 1545 1553 1561 1514 1467 1480 1553 1566 1520 1535 1550 1562 1574 1604 1635 1567 1499 1448 1396 1374 1353 1379 1406 1442 1419 1421 1523 1657
990 1657 1733 1734 1735 1673 1612 1579 1546 1543 1540 1540 1540 1540 1540 1644 1749 1738 1628 1536 1543 1586 1630 1647 1664 1652 1639 1665 1690 1715 1740 1766 1791 1816 1841 1788 1736 1683 1630 1632
986 1632 1635 1578 1521 1473 1425 1436 1447 1499 1551 1544 1478 1419 1459 1499 1539 1533 1527 1462 1396 1403 1409 1416 1422 1469 1517 1564 1611 1610 1609 1608 1608 1628 1649 1650 1591 1545 1598 1651 1704 1677 1650
981 1650 1622 1595 1603 1610 1617 1625 1639 1653 1608 1563 1568 1573 1522 1472 1486 1560 1631 1602 1557 1572 1610 1589 1579 1569 1556 1543 1558 1574 1536 1499 1514 1628 1671 1577 1447 1416 1460
976 1460 1444 1387 1428 1582 1677 1642 1608 1599 1590 1533 1476 1479 1481 1549 1616 1624 1632 1546 1460 1513 1565 1572 1578 1554 1531 1600 1669 1678 1629 1635 1741 1820 1840 1781 1721 1717 1713 1720 1727 1675 1623
971 1623 1581 1539 1557 1575 1559 1543 1531 1519 1541 1622 1666 1611 1539 1467 1488 1509 1535 1561 1587 1613 1644 1675 1647 1618 1609 1600 1591 1582 1562 1542 1522 1501 1522 1543 1564 1585 1585
967 1585 1585 1585 1584 1563 1541 1578 1615 1612 1609 1546 1483 1480 1477 1533 1590 1605 1619 1605 1590 1538 1486 1494 1502 1522 1542 1536 1530 1534 1599 1632 1566 1490 1513 1628 1645 1572 1498 1558 1617 1629
962 1629 1641 1594 1546 1504 1461 1518 1575 1580 1586 1572 1499 1410 1420 1467 1455 1367 1337 1415 1553 1645 1738 1775 1812 1802 1791 1722 1653 1581 1509 1575 1642 1655 1668 1710 1752
957 1752 1723 1693 1663 1634 1609 1584 1619 1653 1643 1632 1651 1670 1595 1521 1546 1570 1568 1566 1565 1563 1541 1520 1557 1595 1621 1648 1674 1701 1655 1609 1622 1636 1605 1574 1572 1571 1597 1624
953 1624 1650 1676 1645 1613 1680 1747 1764 1780 1738 1695 1669 1644 1717 1791 1847 1904 1862 1820 1836 1852 1897 1943 1892 1841 1761 1680 1640 1599 1618 1637 1625 1614 1662 1709 1690
949 1690 1671 1712 1752 1738 1725 1741 1757 1750 1742 1735 1728 1758 1788 1819 1750 1655 1620 1683 1746 1796 1846 1895 1945 1918 1891 1864 1837 1810 1783 1894 2006 2023 2041 2117 2194 2245
944 2245 2296 2446 2595 2613 2630 2647 2664 2609 2553 2438 2323 2169 2016 2040 2065 2016 1968 1979 1990 1976 1962 1948 1934 1885 1836 1846 1856 1822 1788 1783 1779 1779 1778 1830
940 1830 1882 1891 1780 1644 1568 1540 1512 1547 1582 1567 1551 1565 1579 1615 1651 1746 1841 1824 1807 1849 1892 1894 1897 1952 2007 1955 1786 1747 1827 1907 1868 1808 1806 1822 1779
936 1779 1703 1745 1795 1785 1757 1728 1726 1723 1721 1718 1697 1676 1655 1633 1650 1667 1684 1701 1757 1814 1811 1808 1842 1875 2008 2141 2225 2309 2333 2358 2412 2467 2544 2620 2699 2659 2583
931 2583 2507 2372 2178 2009 1960 2006 2053 2048 2043 2033 2024 2015 2006 1993 1980 1967 1954 1934 1914 1894 1874 1888 1903 1917 1932 2009 2087 2164 2242 2275 2308 2341 2374 2418 2463 2508
927 2508 2553 2711 2869 2936 3003 3030 3175 3479 3782 4157 4651 5499 6861 8852 11120 12855 13679 14169 15412 17729 20047 20662
924 20662 19259 17198 15969 15654 15339 14200 12310 10313 8751 7706 7016 6551 6085 5650 5214 4936 4778 4611 4445 4217
922 4217 3989 3939 3889 3836 3783 3730 3677 3564 3450 3369 3406 3515 3625 3866 4226 4780 5533 6716 8413 10204 11559 12407 13256 14725
919 14725 16629 17933 17772 16449 14928 13995 13419 12484 10876 9002 7404 6207 5367 4687 4205 3841 3476 3235 3113 3014 2914
916 2914 2822 2730 2614 2498 2383 2267 2265 2262 2259 2257 2200 2143 2086 2029 1972 1915 1857 1800 1757 1713 1768 1883 1989 1997 1965 1933 1921 1909 1897 1885 1819 1754 1748 1801 1861
912 1861 1823 1745 1667 1666 1666 1665 1664 1664 1665 1665 1666 1664 1663 1661 1660 1680 1699 1778 1857 1819 1780 1741 1703 1699 1695 1750 1805 1813 1821 1828 1836 1848 1859 1871 1882 1845 1809 1773 1736 1711 1685 1660 1635 1666
906 1666 1696 1668 1639 1610 1580 1550 1521 1645 1769 1893 2017 2040 2063 2027 1990 1883 1776 1746 1815 1904 1895 1809 1723 1672 1621 1571 1520 1564 1608 1593 1578 1652
903 1652 1725 1740 1754 1760 1765 1791 1876 1932 1889 1737 1645 1669 1752 1747 1741 1696 1651 1606 1562 1577 1593 1609 1625 1575 1526 1477 1427 1458 1489 1521 1552 1649 1747 1785 1823 1848
898 1848 1873 1957 2041 2114 2187 2161 2135 2141 2147 2094 2041 2033 2025 1958 1891 1925 1959 1933 1908 1913 1919 1865 1811 1826 1840 1755 1671 1656 1641 1627 1612 1659 1707 1655 1603 1568 1533 1498
894 1498 1463 1444 1426 1466 1506 1531 1556 1481 1407 1438 1469 1499 1530 1593 1657 1680 1605 1528 1510 1552 1593 1616 1638 1631 1624 1649 1673 1757 1840 1897 1954 2011 2068 2076 2085 1995 1905
889 1905 1802 1700 1657 1614 1626 1638 1650 1662 1651 1639 1598 1558 1589 1620 1553 1485 1481 1477 1473 1469 1447 1426 1404 1383 1484 1585 1626 1668 1674 1681 1629 1576 1534 1492 1450 1408
885 1408 1468 1529 1530 1531 1589 1648 1647 1646 1632 1618 1633 1649 1652 1656 1600 1544 1572 1599 1627 1654 1595 1536 1576 1616 1605 1593 1523 1452 1477 1502 1497 1492 1541 1590 1580 1569 1580 1590 1600
880 1600 1611 1594 1577 1560 1543 1526 1510 1552 1595 1773 1952 2095 2119 2011 1844 1669 1554 1517 1480 1447 1413 1392 1370 1348 1327 1357 1387 1418 1448 1469 1489
876 1489 1510 1530 1583 1635 1677 1837 2078 2259 2255 2132 1996 1919 1860 1802 1750 1697 1645 1593 1631 1670 1649 1629 1598 1568 1568 1568 1553 1537 1552 1566 1586 1606 1627 1647
872 1647 1651 1656 1660 1665 1645 1626 1606 1586 1559 1532 1505 1478 1487 1495 1504 1512 1512 1512 1512 1511 1530 1548 1626 1704 1721 1739 1697 1655 1677 1699 1662 1625 1661 1697 1637 1578 1550 1582 1584 1586 1614 1701
867 1701 1730 1698 1657 1615 1576 1537 1531 1625 1696 1707 1689 1671 1683 1636 1576 1516 1511 1507 1507 1507 1540 1514 1460 1405 1449 1551 1591 1572 1530 1488 1527 1565 1604 1643 1642 1642 1641 1641 1638
862 1638 1635 1595 1614 1652 1630 1550 1470 1495 1580 1631 1682 1659 1636 1612 1589 1638 1688 1734 1779 1835 1832 1727 1622 1580 1598 1560 1462 1415 1428 1407 1386 1402 1477 1519 1561
858 1561 1584 1607 1569 1471 1421 1431 1403 1376 1366 1356 1350 1343 1352 1420 1455 1489 1532 1575 1599 1563 1542 1621 1734 1786 1731 1675 1619 1563 1527 1550 1599 1648 1635 1621 1552 1483
853 1483 1465 1506 1513 1521 1496 1472 1447 1423 1395 1366 1338 1310 1375 1440 1483 1466 1456 1505 1550 1536 1494 1452 1466 1480 1428 1375 1381 1388 1429 1471 1546 1561 1554 1548 1596 1645 1627 1610
849 1610 1536 1463 1440 1477 1513 1491 1444 1397 1481 1565 1577 1530 1484 1496 1510 1525 1484 1443 1511 1578 1590 1603 1628 1714 1799 1825 1783 1741 1699 1657 1649 1700 1751 1743 1708 1672
844 1672 1671 1609 1489 1429 1430 1431 1434 1437 1439 1442 1386 1331 1341 1411 1551 1691 1716 1642 1535 1487 1538 1588 1597 1606 1615 1624 1604 1585 1512 1439 1457 1573 1667 1702 1674 1646 1618 1590
840 1590 1582 1633 1685 1676 1672 1667 1696 1665 1639 1671 1666 1662 1652 1641 1690 1739 1699 1659 1619 1579 1600 1620 1618 1557 1485 1474 1517 1502 1479 1456 1528 1600 1625 1649 1673 1697 1630 1563
835 1563 1555 1547 1587 1626 1666 1705 1716 1728 1680 1632 1608 1583 1618 1653 1575 1497 1557 1618 1593 1568 1543 1518 1537 1557 1636 1714 1705 1697 1688 1679 1678 1678 1678 1677 1639 1600 1568 1535 1470 1505
830 1505 1615 1667 1618 1570 1577 1584 1588 1593 1657 1720 1664 1608 1651 1694 1769 1844 1918 1993 2039 2086 2033 1981 1900 1819 1797 1775 1735 1695 1714 1733 1751 1769 1787 1805 1759 1713
826 1713 1667 1621 1630 1638 1746 1854 1812 1770 1788 1805 1801 1797 1853 1908 1941 1974 1909 1843 1791 1740 1787 1834 1837 1840 1902 1964 1917 1870 1882 1953 1935 1817 1725 1693 1722 1751
821 1751 1785 1818 1816 1815 1813 1811 1858 1905 1985 2005 1972 1938 1904 1870 1804 1797 1855 1914 1865 1816 1866 1915 1933 1950 1967 1984 1926 1868 1944 2021 2006 1931 1890 1948 1980 1952 1987
817 1987 2080 2139 2138 2137 2195 2229 2203 2155 2107 2044 1981 1978 2033 2054 1976 1898 1919 1989 2000 1990 1981 1996 2012 2082 2153 2134 2055 2032 2068 2064 2001 1973 2044 2158 2173 2153 2193
812 2193 2239 2226 2249 2273 2276 2280 2246 2271 2356 2382 2405 2487 2621 2655 2610 2566 2525 2483 2442 2401 2391 2380 2310 2240 2241 2243 2244 2246 2218 2191 2219 2247 2264 2221 2179 2196 2259
808 2259 2323 2387 2450 2430 2350 2303 2257 2266 2276 2226 2176 2165 2153 2175 2137 2038 1938 1936 1994 2018 1982 1951 1978 2004 2029 1999 1969 1921 1872 1883 1893 1946 1999 1992 1986 1991 1997
803 1997 2003 2009 1954 1899 1844 1790 1776 1762 1748 1734 1779 1823 1809 1794 1733 1671 1709 1746 1762 1779 1795 1812 1746 1681 1675 1669 1622 1575 1528 1481 1498 1515 1592 1668 1675 1682 1689 1696 1714
798 1714 1732 1750 1767 1782 1796 1810 1824 1811 1798 1725 1653 1622 1592 1621 1650 1623 1596 1629 1661 1606 1550 1494 1438 1494 1549 1546 1542 1513 1484 1455 1426 1474 1522 1569 1617 1541
794 1541 1464 1487 1509 1520 1532 1563 1653 1702 1651 1623 1654 1695 1677 1603 1589 1591 1593 1559 1585 1604 1525 1390 1354 1365 1377 1395 1412 1503 1594 1586 1577 1565 1552 1638 1724 1734
790 1734 1745 1756 1766 1799 1832 1765 1699 1696 1693 1690 1686 1676 1666 1655 1645 1610 1575 1540 1505 1514 1523 1532 1541 1522 1502 1483 1464 1439 1414 1488 1562 1593 1623 1614 1665 1745 1727 1635 1603
785 1603 1628 1652 1582 1511 1577 1642 1708 1773 1719 1664 1610 1556 1622 1689 1755 1822 1929 2037 2045 2054 2031 2009 1986 1964 1956 1948 1941 1933 1883 1832 1722 1613 1650 1687 1724 1762
780 1762 1782 1803 1824 1844 1886 1927 1870 1813 1795 1776 1758 1740 1764 1788 1753 1717 1723 1730 1736 1742 1741 1739 1738 1737 1707 1678 1708 1738 1826 1914 1942 1971 2062 2153 2145 2137 2136 2136 2135 2134 2192 2250
775 2250 2309 2367 2360 2354 2288 2223 2219 2214 2151 2088 1994 1901 1907 1913 1920 1926 1874 1821 1899 1978 1997 2016 1925 1835 1804 1772 1762 1751 1710 1670 1697 1724 1691 1658 1743 1827 1773 1719 1737
771 1737 1756 1774 1793 1830 1868 1876 1884 1818 1751 1744 1737 1823 1908 1934 1960 1980 2000 2020 2040 2124 2208 2262 2316 2267 2218 2228 2298 2364 2331 2298 2265 2266 2267 2238 2209 2241 2274 2247
766 2247 2219 2186 2153 2119 2086 2056 2027 1898 1770 1795 1821 1788 1754 1775 1795 1760 1726 1772 1877 1912 1848 1773 1798 1827 1797 1764 1791 1920 2048 2101 2155 2070
762 2070 1985 1947 1909 1931 1953 1912 1871 1860 1849 1959 2070 2120 2171 2114 2056 1999 1942 1909 1876 1843 1810 1764 1718 1702 1686 1655 1625 1653 1682 1696 1710 1695 1679 1697
758 1697 1716 1730 1744 1748 1693 1638 1642 1731 1820 1774 1669 1601 1632 1697 1702 1697 1692 1742 1793 1785 1778 1770 1763 1814 1865 1890 1856 1808 1760 1807 1914 1986 1960 1894 1827 1857 1886 1859
753 1859 1832 1777 1780 1810 1839 1863 1887 1881 1875 1856 1837 1837 1897 1981 1967 1837 1708 1653 1658 1658 1659 1651 1642 1578 1514 1531 1608 1629 1590 1554 1576 1618 1659 1657 1596 1542 1588 1721
749 1721 1855 1850 1786 1757 1728 1695 1663 1674 1686 1698 1709 1796 1883 1868 1794 1795 1855 1820 1724 1682 1739 1773 1748 1747 1805 1788 1673 1575 1576 1650 1724 1706 1630 1553 1535 1601
744 1601 1667 1675 1624 1593 1622 1614 1606 1577 1548 1526 1503 1501 1599 1674 1690 1698 1707 1656 1605 1564 1582 1576 1511 1483 1554 1659 1704 1652 1601 1604 1608 1649 1690 1705 1660 1629 1597 1592 1586 1598
739 1598 1610 1563 1456 1392 1426 1461 1496 1532 1568 1583 1537 1521 1565 1578 1532 1472 1472 1527 1522 1507 1493 1533 1574 1619 1664 1686 1649 1579 1567 1552 1537 1517 1556 1599 1582
735 1582 1553 1583 1613 1583 1529 1535 1540 1486 1405 1383 1423 1463 1495 1526 1591 1596 1577 1557 1568 1519 1467 1416 1420 1424 1387 1349 1370 1392 1422 1452 1482 1513 1534 1556 1522 1488 1428
730 1428 1427 1531 1636 1683 1729 1717 1705 1676 1648 1650 1651 1632 1613 1594 1575 1597 1618 1640 1661 1666 1672 1655 1578 1465 1412 1426 1500 1555 1610 1609 1549 1473 1496 1559 1621 1583
726 1583 1546 1512 1478 1475 1531 1610 1589 1508 1426 1477 1528 1514 1500 1516 1532 1570 1608 1617 1625 1570 1515 1559 1603 1676 1749 1723 1697 1723 1748 1714 1680 1633 1585 1597 1609 1612 1615
722 1615 1617 1620 1562 1505 1542 1579 1508 1377 1323 1367 1465 1563 1528 1494 1506 1518 1569 1561 1510 1557 1677 1738 1718 1699 1705 1712 1678 1644 1674 1703 1786 1927 2032 2038 1947 1856
717 1856 1818 1781 1759 1736 1774 1811 1784 1758 1701 1645 1594 1544 1552 1561 1602 1643 1654 1665 1661 1657 1753 1848 1789 1730 1770 1810 1765 1720 1734 1748 1733 1719 1674 1629 1648 1666 1784
713 1784 1901 1913 1924 1995 2066 2084 2102 2119 2137 2081 2024 2027 2030 1973 1916 1859 1802 1823 1844 1865 1886 1905 1924 1943 1962 1919 1876 1893 1909 1952 1994 1977 1960 1916 1872
708 1872 1827 1783 1802 1821 1840 1859 1843 1827 1811 1795 1834 1873 1912 1951 1892 1833 1774 1715 1664 1612 1660 1707 1641 1575 1608 1641 1661 1681 1671 1662 1649 1636 1682 1729 1786
704 1786 1843 1900 1957 1892 1826 1860 1894 1922 1951 2000 2107 2173 2140 2107 2074 2034 1994 2014 2033 2070 2108 2007 1905 1842 1778 1744 1710 1700 1690 1739 1788 1712 1635
700 1635 1696 1758 1801 1843 1856 1869 1806 1743 1740 1736 1746 1755 1764 1774 1768 1762 1776 1849 1881 1813 1742 1731 1771 1811 1756 1701 1722 1742 1792 1842 1829 1815 1857 1899 1895 1831 1805 1877
695 1877 1959 2040 2029 2018 2028 2038 2048 2058 1987 1916 1944 1972 1977 1982 1987 1992 2013 2034 2025 2016 1963 1909 1915 1920 1903 1886 1905 2024 2128 2133 2101 2069 2091 2114 2077 2041 2044 2048 2111
691 2111 2174 2189 2205 2247 2289 2291 2233 2172 2170 2176 2123 2071 2077 2085 2033 1924 1814 1792 1830 1893 1957 2055 2153 2146 2080 2045 2011 2032 2053 2030 2007 1980 2013 2106 2198 2235 2272
686 2272 2330 2387 2448 2509 2578 2706 2833 2902 2846 2789 2848 3006 3111 3156 3182 3208 3233 3259 3274 3349 3394 3340 3252 3224 3279 3335 3394 3453 3521 3588 3557 3526 3457
682 3457 3387 3318 3248 3227 3206 3185 3164 3183 3203 3223 3242 3247 3252 3353 3453 3471 3429 3387 3404 3408 3411 3418 3426 3433 3440 3443 3447 3431 3355 3258 3259 3308 3358 3354 3350 3361 3373 3384 3395 3529
677 3529 3664 3793 3921 3990 3960 3887 3814 3791 3769 3747 3724 3783 3841 3800 3760 3760 3761 3702 3643 3599 3555 3451 3348 3348 3349 3290 3231 3225 3218 3153 3087 3046 3005 3023 3041
673 3041 3003 2964 2981 2999 2985 2912 2816 2820 2881 2943 2915 2888 2953 3078 3129 3082 3048 3074 3158 3243 3338 3432 3527 3621 3619 3616 3673 3730 3787 3844 3841 3839 3811 3782 3758 3733 3600
668 3600 3526 3575 3722 3775 3729 3689 3748 3827 3905 3931 3957 4051 4146 4241 4336 4436 4536 4576 4616 4677 4737 4797 4858 4889 4921 4953 4985 5105 5226 5346 5467
665 5467 5645 5824 5943 6062 6102 6142 6182 6222 6322 6421 6421 6422 6436 6451 6465 6480 6561 6643 6724 6805 6806 6807 6947 7087 7229 7371 7414 7457 7560 7663 7766
661 7766 7869 7842 7815 7887 7959 8037 8116 8135 8153 8175 8196 8214 8350 8632 8973 9263 9492 9659 9826 9894 9962 10078 10254 10451 10530 10445 10162 9769
657 9769 9376 9005 8694 8420 8265 8156 8047 7886 7725 7589 7452 7374 7297 7205 7112 7085 7175 7274 7253 7129 7005 6942 6878 6755 6632 6558 6484
654 6484 6409 6335 6265 6196 6126 6057 5920 5783 5714 5764 5826 5828 5773 5718 5730 5743 5657 5571 5538 5505 5471 5438 5317 5195 5014 4833 4720 4608 4495 4382
650 4382 4345 4309 4272 4236 4123 4010 3995 3981 3997 4014 3931 3848 3802 3756 3810 3863 3882 3901 3860 3820 3844 3868 3892 3916 3887 3858 3830 3801 3896 3991 4027 4062 4088 4114
646 4114 4081 4048 4052 4056 4119 4182 4298 4415 4472 4528 4558 4588 4618 4648 4690 4733 4768 4803 4861 4799 4676 4613 4658 4763 4872 4922 4918 4914 4907 4899 5008 5118 5227 5336
642 5336 5421 5505 5590 5674 5797 5920 6043 6165 6396 6626 6797 6968 7163 7359 7554 7750 7926 8103 8280 8457 8688 8920 9152 9384 9696
639 9696 10008 10380 10751 11243 11734 12230 12725 13248 13829 14493 15275 16139 17063 18039 19074 20212 21549 23060 24689 26555 28618
636 28618 30944 33546 36474 39838 43707 48247 53613 59967 67415 76168 86407 98347 112142 127716 144715 162227
634 162227 178880 192723 201784 204713 201164 191957 178744 163356 147354 131866 117540 104679 93226 83158 74353
633 74353 66694 60000 54215 49156 44689 40727 37279 34324 31724 29387 27326 25575 24021 22537 21171 19927 18881
631 18881 17916 16951 16150 15467 14824 14181 13520 12978 12508 12038 11572 11105 10738 10370 10105 9839 9573 9307 9095 8884 8672 8461 8202
628 8202 7943 7743 7543 7418 7292 7167 7041 6859 6677 6555 6433 6321 6210 6098 5987 5916 5845 5774 5702 5639 5575 5452 5329 5202 5075
625 5075 5086 5097 5009 4920 4831 4742 4744 4745 4687 4629 4607 4585 4504 4423 4474 4526 4546 4446 4412 4377 4334 4292 4291 4289 4288 4286 4306 4325 4246 4167 4118 4070 4022 3974 3944 3915 3885
620 3885 3855 3831 3806 3782 3757 3692 3627 3621 3615 3508 3401 3295 3188 3209 3230 3251 3271 3228 3185 3142 3099 3130 3161 3133 3105 3038 2971 3003 3035 3086 3136 3127 3119 3144 3169
616 3169 3194 3219 3251 3282 3373 3464 3561 3659 3891 4123 4429 4676 4800 4745 4576 4407 4167 3928 3656 3385 3251 3118 3051 2984 2977 2969 2955 2942 2928
612 2928 2914 2840 2765 2750 2735 2711 2688 2664 2640 2664 2687 2711 2734 2726 2719 2711 2704 2679 2654 2689 2723 2709 2696 2682 2668 2708 2747 2787 2826 2849 2873 2902 2932 2985 3137 3372
608 3372 3606 3793 3980 4080 4081 3944 3748 3519 3291 3158 3025 2891 2758 2718 2679 2639 2599 2538 2477 2515 2553 2538 2522 2506 2491 2387 2284 2239
605 2239 2195 2183 2171 2218 2266 2287 2308 2329 2351 2319 2287 2196 2104 2174 2244 2254 2264 2263 2262 2261 2260 2173 2087 2171 2255 2345 2317 2256 2196 2190 2185 2180 2175 2194 2213 2172 2132 2139 2147 2154
600 2154 2162 2165 2169 2172 2176 2208 2239 2271 2303 2242 2180 2178 2176 2162 2147 2192 2237 2188 2140 2091 2043 2062 2082 2101 2121 2156 2191 2227 2262 2318 2375 2332 2289 2293 2297 2301 2305 2269 2233 2257
595 2257 2280 2243 2206 2169 2131 2178 2225 2173 2121 2093 2066 2038 2011 2041 2072 2103 2133 2159 2185 2211 2237 2319 2401 2383 2366 2312 2259 2205 2152 2200 2248 2236 2225 2279 2333
590 2333 2388 2442 2458 2474 2490 2506 2558 2610 2662 2714 2844 2974 2927 2821 2854 3007 3177 3289 3343 3338 3264 3190 3312 3434 3373 3193 3124 3173 3189 3145 3223
587 3223 3420 3550 3680 3931 4242 4420 4479 4678 5074 5431 5668 6024 6577 7036 7298 7699 8298 8874 9390 10126 10980 11511 11923 12948
584 12948 14882 17281 20352 25169 32479 42815 58650 83515 115699 144006 154312 142021 115765 88736 67841
582 67841 52832 41660 33768 28526 24621 21311 18803 17206 15895 14584 13562 12896 12142 11031 10077 9479 8997 8456
580 8456 8059 7939 7786 7435 7262 7366 7495 7426 7422 7616 7739 7664 7498 7391 7209 6967 7034 7537 8303 9424 11535 14794 18107 19640
577 19640 18636 15852 12736 10214 8562 7504 6747 6108 5669 5350 5088 4826 4572 4318 4152 3986 3959 3931 3887 3842 3797 3753 3781
574 3781 3810 3846 3763 3637 3512 3509 3507 3406 3186 3097 3127 3076 2907 2836 2885 2955 2908 2864 2938 2974 2951 2932 2972 2989 2947 2942 2937 2886 2835 2849 2981 3026 2951 2936
570 2936 3040 3091 3023 2860 2815 2801 2728 2626 2642 2643 2585 2530 2535 2553 2512 2470 2488 2525 2502 2475 2508 2603 2580 2528 2477 2452 2428 2403 2379 2343 2308 2290 2333 2378
566 2378 2306 2270 2294 2302 2309 2321 2333 2376 2420 2423 2485 2565 2525 2457 2389 2315 2241 2227 2212 2247 2283 2337 2450 2500 2432 2360 2406 2439 2353 2271 2308 2404 2441 2419 2398 2383
561 2383 2368 2353 2338 2360 2382 2266 2150 2178 2207 2236 2265 2285 2305 2326 2346 2395 2445 2491 2537 2520 2443 2464 2604 2803 2883 2860 2836 2836 2836 2737 2639 2595 2552 2508
557 2508 2465 2419 2373 2327 2281 2286 2291 2237 2182 2232 2281 2323 2365 2436 2388 2310 2292 2341 2330 2225 2179 2251 2323 2349 2375 2419 2463 2379 2294 2337 2379 2391 2404 2383 2361
553 2361 2340 2318 2437 2556 2547 2537 2503 2469 2485 2501 2544 2588 2562 2536 2557 2578 2529 2480 2477 2474 2471 2468 2488 2508 2498 2488 2529 2570 2542 2513 2602 2690 2779 2867 2854 2840
548 2840 2757 2674 2697 2720 2674 2627 2610 2592 2624 2655 2702 2748 2706 2663 2634 2604 2644 2684 2732 2779 2778 2776 2853 2931 3008 3085 3127 3168 3206 3244 3210 3118 3033 3046 3151
544 3151 3256 3297 3339 3482 3624 3828 4031 4235 4300 4209 4059 3940 3822 3729 3636 3532 3427 3323 3218 3211 3204 3148 3092 3153 3214 3275 3336 3359 3382
541 3382 3336 3289 3368 3447 3477 3506 3477 3447 3487 3526 3553 3581 3539 3497 3566 3635 3674 3714 3770 3826 3813 3799 3852 3904 3956 4008 4002 3995 3989 3982 4010 4037 4065 4092 4171 4249 4218
536 4218 4188 4153 4118 4152 4186 4210 4234 4169 4104 4125 4146 4168 4189 4192 4196 4229 4262 4334 4406 4317 4228 4203 4297 4357 4358 4310 4262 4259 4257 4332 4407 4412 4418 4355 4293 4260 4227 4304
531 4304 4382 4410 4438 4434 4429 4425 4420 4408 4395 4452 4508 4589 4669 4582 4494 4505 4516 4528 4539 4535 4531 4527 4523 4498 4474 4399 4325 4386 4446 4438 4429 4436 4442 4518 4593 4586 4580 4622 4665 4719 4773 4861
526 4861 5069 5394 5600 5594 5390 5202 5133 5094 5054 5094 5133 5184 5176 5197 5336 5606 5875 6134 6275 6369 6464 6577 6632 6480 6209 5981 5753 5616
523 5616 5479 5463 5446 5370 5294 5283 5273 5233 5192 5140 5087 5064 5041 4967 4892 4917 4941 5016 5090 5106 5121 5188 5255 5304 5293 5266 5357 5477 5597 5659 5721 5753 5785
519 5785 5847 5910 5972 6035 6031 6027 6023 6019 5978 5937 6031 6125 6285 6386 6376 6248 6185 6242 6401 6561 6669 6777 6786 6795 6915 7036 7096 7157 7229 7301 7440 7579
515 7579 7689 7918 8173 8368 8485 8601 8786 9089 9484 9879 10182 10485 10831 11177 11582 11987 12495 13003 13541 14079 14585 15092 15602
512 15602 15993 16297 16542 16694 16728 16651 16456 16207 15760 15163 14448 13689 12871 12072 11391 10824 10316 9782 9248 8747 8246 7831 7416 7061
509 7061 6705 6453 6201 5949 5696 5433 5170 5084 4999 4914 4829 4774 4719 4640 4561 4383 4205 4092 3979 3926 3872 3865 3857 3790 3723 3666 3609 3611 3613 3491 3369
505 3369 3345 3322 3300 3279 3287 3295 3321 3347 3314 3281 3301 3320 3281 3241 3137 3033 3068 3103 3124 3145 3166 3187 3132 3078 3082 3087 3093 3099 3104 3110 3237 3365 3492 3619 3732
501 3732 3844 4090 4534 5201 6303 8113 10595 12989 13997 13131 11039 8880 7314 6247 5537 5209 5238 5470 5820 6204 6470
498 6470 6369 5834 5201 4687 4271 3914 3683 3571 3500 3310 3127 3063 3063 3063 3075 3088 3041 2994 2988 2982 2976 2970 2949 2927 3005 3083 3200 3316 3294 3273 3280 3288 3333
494 3333 3377 3623 3987 4373 4818 5532 6602 8164 10951 15616 21111 24643 24100 20197 15543 11927 9459 7662 6380 5694
492 5694 5284 4767 4249 3929 3728 3516 3303 3285 3268 3162 3057 3060 3063 3019 2975 2930 2886 2813 2741 2698 2656 2617 2579 2610 2640 2595 2549 2593 2636 2561 2486
488 2486 2500 2514 2447 2381 2502 2624 2728 2832 3013 3193 3299 3523 4016 4787 5915 7794 10331 12512 13085 11799 9633 7585
486 7585 6108 5145 4496 4044 3673 3362 3147 3051 2971 2832 2700 2627 2612 2596 2584 2572 2510 2448 2475 2502 2475 2448 2422 2395 2393 2392 2361 2330 2236 2143 2098
482 2098 2054 2062 2070 2108 2145 2179 2212 2315 2418 2412 2407 2398 2389 2287 2127 1982 1956 1969 1981 2030 2080 2045 2009 1974 1939 1969 1999 2030 2060 1959 1858 1831 1923 2000
478 2000 1958 1949 1999 2039 1961 1919 1937 1944 1952 1962 1973 1995 2017 1969 1922 1931 1941 1882 1823 1776 1730 1753 1776 1786 1797 1857 1917 1945 1974 1913 1853 1809 1765 1830 1895 1916 1936
473 1936 1957 1977 2005 2032 1971 1909 1880 1850 1890 1929 1911 1893 1904 1915 1885 1854 1755 1655 1624 1592 1630 1667 1671 1675 1708 1742 1746 1751 1755 1759 1787 1815 1813 1811 1808 1806 1852 1899 1894 1888
468 1888 1932 1975 1970 1964 1909 1854 1800 1746 1722 1698 1755 1811 1818 1824 1759 1694 1758 1821 1837 1853 1868 1884 1906 1928 1841 1754 1709 1664 1707 1751 1712 1673 1723 1773 1786 1799 1762
464 1762 1726 1691 1657 1691 1726 1728 1729 1731 1733 1763 1793 1734 1675 1634 1593 1661 1729 1766 1803 1751 1699 1701 1704 1737 1769 1741 1713 1685 1657 1693 1729 1765 1801 1815 1828 1812 1796 1803
459 1803 1810 1758 1706 1712 1717 1693 1668 1598 1527 1555 1583 1631 1679 1667 1655 1711 1766 1722 1678 1587 1497 1505 1513 1579 1645 1651 1657 1671 1685 1729 1772 1848 1923 1899 1875 1818 1761 1763 1766
454 1766 1786 1807 1828 1849 1782 1715 1707 1699 1714 1729 1705 1740 1740 1641 1516 1491 1579 1668 1663 1659 1661 1663 1665 1667 1717 1767 1818 1868 1829 1790 1752 1713 1695 1678 1660 1642 1704 1765 1767
449 1767 1770 1784 1799 1813 1828 1851 1874 1798 1723 1694 1665 1696 1726 1728 1730 1731 1733 1713 1694 1675 1655 1699 1744 1788 1833 1853 1873 1864 1854 1776 1698 1680 1661 1709 1756 1744 1732 1789
445 1789 1846 1804 1762 1667 1573 1508 1443 1472 1501 1629 1757 1756 1756 1785 1814 1811 1808 1746 1684 1720 1756 1763 1769 1748 1726 1733 1741 1743 1744 1686 1629 1599 1568 1598 1627 1628 1629 1650 1730 1795
440 1795 1762 1689 1616 1604 1592 1610 1628 1627 1625 1624 1623 1656 1690 1665 1639 1673 1706 1740 1773 1725 1677 1689 1700 1744 1789 1833 1878 1853 1829 1805 1781 1759 1737 1745 1753 1763 1773 1723
435 1723 1674 1709 1743 1778 1812 1796 1780 1724 1728 1790 1754 1644 1594 1684 1774 1768 1762 1710 1657 1664 1670 1722 1773 1765 1756 1796 1835 1815 1795 1793 1791 1760 1728 1657 1585 1553 1620 1729
431 1729 1779 1730 1681 1683 1685 1687 1689 1773 1857 1882 1907 1875 1844 1862 1881 1872 1863 1784 1706 1667 1628 1588 1549 1589 1630 1670 1711 1710 1709 1709 1708 1683 1657 1632 1607 1641 1675 1709 1744 1724
426 1724 1703 1772 1841 1859 1877 1825 1773 1808 1843 1770 1696 1616 1536 1545 1554 1630 1707 1694 1682 1685 1689 1692 1696 1691 1686 1681 1675 1718 1760 1753 1745 1684 1622 1610 1598 1587 1575 1564 1553 1655
421 1655 1757 1751 1744 1675 1607 1607 1608 1622 1635 1649 1663 1684 1705 1637 1569 1634 1699 1814 1928 1938 1947 1907 1867 1797 1728 1707 1687 1718 1750 1652 1555 1574 1593 1661 1730 1753
416 1753 1777 1712 1647 1660 1672 1659 1646 1712 1838 1892 1827 1736 1704 1700 1697 1718 1739 1760 1782 1769 1757 1745 1733 1764 1795 1776 1757 1778 1798 1769 1740 1761 1782 1773 1765 1767 1769
412 1769 1771 1773 1695 1617 1609 1601 1645 1690 1685 1681 1682 1683 1685 1686 1696 1705 1744 1783 1790 1797 1694 1592 1613 1633 1604 1575 1520 1465 1518 1572 1612 1652 1544 1436 1441 1447 1482 1517 1566 1615
407 1615 1582 1549 1493 1554 1619 1683 1716 1750 1753 1757 1706 1654 1672 1690 1679 1669 1610 1550 1559 1568 1578 1587 1525 1463 1470 1477 1533 1590 1577 1564 1501 1438 1444 1450 1473 1496 1519 1542 1525
402 1525 1508 1491 1473 1473 1472 1471 1470 1494 1518 1542 1565 1522 1480 1437 1394 1435 1476 1517 1559 1574 1589 1604 1619 1624 1629 1585 1541 1444 1348 1293 1358 1464 1569 1518 1467 1496 1584
398 1584 1601 1520 1473 1525 1574 1623 1650 1678 1679 1621 1548 1476 1465 1513 1566 1618 1613 1548 1500 1510 1547 1583 1617 1709 1802 1835 1797 1759 1751 1743 1752 1820 1948 2076 2140 2105
393 2105 2027 1948 1872 1795 1665 1536 1469 1501 1537 1573 1585 1598 1666 1734 1774 1754 1708 1663 1694 1726 1735 1686 1607 1587 1589 1592 1574 1555 1566 1577 1529 1480 1461 1442 1475
389 1475 1509 1569 1628 1692 1696 1674 1652 1688 1723 1660 1597 1587 1577 1567 1557 1580 1604 1569 1474 1408 1442 1548 1595 1610 1626 1612 1598 1578 1616 1655 1634 1616 1597 1578 1559
385 1559 1542 1585 1657 1669 1639 1609 1634 1659 1679 1699 1718 1738 1700 1663 1684 1706 1687 1668 1622 1577 1590 1662 1731 1700 1651 1662 1692 1722 1769 1815 1802 1790 1727 1665 1702
381 1702 1739 1650 1561 1571 1581 1553 1525 1496 1468 1484 1500 1575 1651 1694 1737 1750 1764 1751 1739 1756 1773 1754 1735 1716 1698 1688 1679 1669 1660 1672 1685 1698 1710 1769 1827 1886
376 1886 1944 2009 2073 2078 2084 2061 2039 2017 1995 1951 1908 1924 1940 1909 1878 1907 1935 1957 1979 1903 1826 1801 1776 1751 1726 1771 1817 1862 1907 1979 2050 2122 2193 2123 2053 2016
372 2016 1980 2022 2123 2191 2160 2093 2085 2137 2188 2223 2258 2293 2329 2323 2317 2371 2425 2460 2496 2591 2685 2774 2863 3011 3159 3220 3281 3341 3402 3365 3329 3292 3255 3196 3136
367 3136 3077 3018 2977 2936 2895 2854 2757 2659 2660 2661 2737 2812 2828 2844 2771 2698 2625 2552 2542 2532 2581 2631 2589 2548 2566 2584 2661 2738 2756 2774 2796 2818 2899 2980 2986 2992 2997
363 2997 3003 3185 3366 3610 3855 4167 4539 4937 5216 5393 5452 5309 4968 4603 4297 4051 3806 3535 3383 3303 3222 3173 3123 3173 3222 3144 3067
360 3067 2989 2911 2823 2734 2744 2754 2606 2459 2489 2519 2491 2463 2533 2662 2755 2730 2676 2621 2503 2385 2370 2474 2546 2500 2429 2357 2338 2319 2399 2478 2607
356 2607 2736 2806 2876 2931 2986 3100 3214 3289 3365 3380 3396 3289 3181 3132 3084 3044 3004 3024 3043 3029 3015 2972 2928 2892 2856 2850 2844 2768 2691 2714 2736 2711 2686
352 2686 2721 2756 2796 2836 2969 3102 3142 3083 3070 3116 3122 3029 2961 2953 2965 2976 3017 3058 3082 3045 2983 2921 2917 2913 2969 3024 3042 3060 3070 3140 3173 3147 3125 3162 3233 3304
347 3304 3314 3264 3212 3159 3103 3047 2991 2934 2937 2940 2975 3011 3077 3142 3134 3126 3174 3221 3209 3138 3067 3055 3077 3099 3124 3149 3149 3149 3149 3149 3132 3114 3097 3080 3063 3047 3031 3014 3002
343 3002 2989 3036 3082 3121 3159 3160 3221 3295 3310 3303 3295 3310 3325 3245 3165 3100 3094 3149 3205 3175 3086 2996 2966 3006 3047 3091 3135 3100 3065 3030 2995 2933 2870 2808 2746 2745 2745 2740
338 2740 2736 2696 2597 2528 2518 2537 2557 2525 2492 2469 2506 2562 2618 2517 2317 2207 2276 2392 2450 2413 2376 2353 2329 2404 2479 2497 2515 2533 2551 2519 2486 2453 2421
334 2421 2446 2472 2517 2622 2687 2653 2540 2427 2398 2369 2399 2429 2387 2345 2303 2261 2252 2242 2232 2222 2249 2277 2245 2213 2205 2198 2132 2065 2073 2082 2090 2099 2086 2074 2061 2049 2082
329 2082 2116 2149 2183 2185 2188 2190 2193 2206 2220 2174 2128 2064 2001 1997 1993 2046 2098 2151 2203 2178 2152 2127 2101 2035 1968 1901 1834 1830 1825 1760 1696 1667 1637 1706 1775 1785 1795 1801 1807 1810
325 1810 1753 1670 1687 1768 1791 1714 1638 1663 1687 1653 1618 1695 1771 1749 1727 1684 1640 1657 1673 1653 1633 1613 1594 1566 1539 1571 1604 1602 1601 1600 1599 1605 1611 1617 1623 1635 1646 1598 1549
320 1549 1470 1391 1372 1352 1386 1419 1393 1368 1379 1391 1403 1415 1523 1631 1561 1491 1482 1473 1464 1455 1422 1389 1356 1324 1345 1367 1389 1411 1424 1437 1450 1463 1458 1454 1311 1168
315 1168 1179 1190 1202 1213 1274 1334 1394 1455 1438 1422 1406 1389 1400 1411 1422 1433 1440 1447 1454 1461 1435 1408 1322 1236 1320 1405 1391 1376 1373 1370 1366 1363 1376 1389 1402 1414 1428 1441 1455
311 1455 1468 1528 1589 1550 1512 1454 1397 1399 1401 1464 1526 1530 1533 1482 1431 1381 1330 1401 1473 1485 1497 1513 1528 1484 1440 1419 1397 1375 1354 1346 1339 1331 1324 1368 1413 1457 1501 1470 1439
306 1439 1408 1377 1426 1475 1465 1455 1447 1439 1431 1422 1384 1346 1309 1271 1314 1358 1343 1327 1391 1455 1459 1463 1442 1421 1400 1379 1333 1287 1301 1314 1311 1307 1303 1300 1341 1382 1453 1524 1544 1564
301 1564 1445 1326 1260 1194 1227 1259 1327 1395 1403 1412 1400 1389 1437 1484 1473 1462 1392 1321 1370 1418 1407 1395 1318 1240 1262 1283 1296 1309 1322 1334 1394 1454 1342 1229
297 1229 1218 1306 1401 1436 1426 1416 1403 1389 1332 1276 1319 1361 1430 1499 1469 1438 1391 1344 1356 1368 1376 1384 1334 1283 1300 1317 1304 1292 1261 1229 1228 1227 1233 1240 1306 1372 1404 1437
292 1437 1439 1442 1341 1240 1168 1097 1128 1159 1249 1339 1364 1388 1383 1378 1389 1399 1350 1301 1356 1411 1368 1265 1194 1223 1291 1359 1386 1413 1410 1407 1390 1374 1358 1341 1346 1352 1357 1362
287 1362 1389 1417 1385 1353 1383 1412 1343 1274 1308 1341 1375 1408 1410 1411 1320 1228 1184 1237 1273 1249 1232 1274 1309 1344 1359 1374 1369 1305 1293 1380 1468 1456 1393 1389 1405 1421 1394
283 1394 1366 1339 1312 1298 1283 1329 1374 1380 1386 1393 1399 1396 1394 1421 1448 1469 1490 1453 1415 1383 1352 1321 1290 1277 1265 1311 1358 1333 1309 1194 1079 1053 1165 1293 1361 1321
279 1321 1282 1299 1315 1358 1400 1383 1366 1335 1303 1271 1239 1266 1292 1318 1345 1330 1316 1302 1287 1265 1243 1321 1398 1388 1377 1308 1239 1218 1197 1276 1354 1353 1353 1323 1292 1299
274 1299 1305 1311 1317 1357 1397 1378 1358 1268 1178 1223 1268 1327 1327 1301 1274 1313 1351 1333 1315 1275 1294 1316 1280 1206 1191 1275 1358 1426 1436 1413 1330 1216 1102 1047 992 961
270 961 989 1044 1098 1127 1155 1184 1212 1238 1263 1289 1314 1331 1348 1309 1270 1242 1274 1309 1285 1197 1170 1203 1237 1235 1233 1231 1229 1190 1151 1177 1263 1351 1439 1430 1361 1328 1354 1343
265 1343 1333 1268 1203 1197 1191 1214 1236 1263 1289 1287 1344 1402 1400 1323 1247 1197 1206 1250 1353 1460 1508 1460 1413 1361 1310 1330 1350 1404 1398 1335 1273 1266 1259 1252 1246 1240 1233 1243 1253 1263
260 1263 1273 1316 1360 1400 1440 1411 1323 1234 1205 1201 1196 1196 1195 1213 1231 1253 1275 1314 1412 1478 1444 1340 1295 1349 1404 1382 1360 1339 1317 1317 1316 1316 1315 1309 1304 1298 1293 1314 1336 1357
255 1357 1379 1368 1358 1348 1337 1293 1250 1265 1281 1278 1275 1272 1270 1248 1227 1205 1184 1198 1213 1227 1241 1210 1179 1207 1294 1369 1346 1283 1220 1270 1319 1310 1300 1235 1171 1205 1239
251 1239 1246 1253 1168 1082 1070 1157 1248 1339 1351 1362 1374 1386 1411 1436 1402 1368 1316 1263 1270 1277 1258 1239 1279 1319 1331 1343 1355 1366 1374 1382 1291 1200 1168 1136 1167 1199 1214 1288
246 1288 1385 1383 1284 1186 1220 1253 1249 1244 1239 1234 1252 1269 1287 1304 1343 1382 1362 1342 1354 1365 1377 1389 1409 1429 1542 1655 1606 1457 1332 1265 1280 1295 1313 1331 1319
242 1319 1307 1294 1282 1340 1398 1397 1396 1339 1283 1285 1288 1257 1225 1293 1360 1317 1274 1201 1128 1090 1052 1113 1173 1144 1115 1146 1176 1243 1309 1237 1106 1060 1113 1221 1231 1186
237 1186 1141 1188 1236 1204 1172 1171 1169 1184 1199 1244 1289 1348 1407 1465 1425 1309 1253 1295 1337 1278 1219 1259 1299 1315 1332 1344 1357 1291 1165 1076 1086 1137 1187 1244 1301
233 1301 1242 1183 1223 1263 1289 1315 1311 1307 1249 1192 1173 1254 1303 1292 1284 1335 1395 1395 1373 1351 1327 1302 1278 1254 1203 1153 1103 1052 1083 1113 1143 1174 1208 1242 1276 1310 1290
229 1290 1270 1190 1111 1101 1092 1141 1191 1217 1243 1239 1235 1221 1207 1193 1178 1088 998 1021 1143 1256 1230 1156 1141 1194 1248 1246 1243 1236 1229 1222 1215 1229 1244 1259 1273 1248 1223 1257
224 1257 1292 1237 1182 1227 1271 1325 1379 1374 1369 1333 1297 1360 1423 1395 1368 1337 1306 1259 1152 1119 1184 1268 1293 1298 1303 1258 1214 1169 1125 1154 1184 1213 1243 1271 1298 1267
220 1267 1235 1244 1253 1262 1271 1272 1274 1275 1276 1206 1137 1071 1104 1181 1257 1241 1225 1222 1219 1276 1333 1329 1326 1323 1320 1322 1325 1269 1212 1177 1141 1205 1268 1243 1218 1223 1228 1244 1260 1273 1286 1266 1188 1087
214 1087 1085 1146 1207 1238 1269 1299 1229 1083 937 894 950 1009 1068 1071 1074 1135 1257 1327 1298 1230 1162 1186 1210 1263 1317 1298 1279 1201 1123 1105 1087 1128 1169 1156 1144
210 1144 1190 1296 1353 1310 1264 1218 1175 1073 1003 1033 1091 1090 1030 969 960 950 999 1049 1070 1090 1081 1072 1137 1203 1169 1136 1163 1191 1159 1128 1090 1052 1113 1174 1205 1236
206 1236 1208 1180 1235 1289 1284 1280 1269 1259 1245 1231 1225 1159 1096 1133 1180 1168 1103 1097 1157 1216 1180 1144 1143 1141 1140 1139 1145 1151 1157 1163 1290 1417 1367 1316 1248 1179 1171 1162 1162 1163 1134 1104
200 1104 1145 1186 1226 1267 1352 1437 1423 1410 1363 1315 1239 1162 1159 1155 1152 1149 1189 1228 1209 1189 1201 1213 1165 1118 1122 1126 1160 1194 1229 1265 1241 1217 1239 1262 1225 1188 1123 1058
196 1058 1092 1126 1166 1205 1214 1224 1201 1177 1154 1131 1161 1192 1166 1141 1202 1322 1404 1388 1308 1228 1172 1115 1179 1243 1248 1253 1251 1250 1189 1128 1120 1112 1104 1097 1111 1125 1080 1035 1066
191 1066 1098 1188 1279 1319 1360 1400 1440 1347 1253 1203 1252 1324 1396 1375 1354 1340 1327 1254 1181 1062 943 907 970 1050 1130 1157 1184 1191 1199 1206 1214 1257 1301 1285 1269 1268
187 1268 1267 1168 1068 1052 1036 1079 1122 1176 1231 1255 1280 1238 1195 1183 1170 1189 1207 1166 1125 1196 1267 1338 1409 1359 1309 1259 1209 1184 1160 1135 1111 1120 1129 1109 1089 1090
182 1090 1092 1153 1213 1296 1379 1324 1268 1223 1178 1110 1042 1014 1085 1193 1241 1233 1224 1152 1080 1034 987 1039 1091 1104 1117 1160 1203 1210 1216 1223 1230 1244 1259 1214 1170 1153 1137 1121
178 1121 1105 1168 1230 1194 1158 1156 1154 1152 1150 1180 1210 1141 1072 1073 1074 1075 1076 1116 1157 1197 1238 1221 1205 1248 1291 1292 1293 1234 1176 1155 1134 1114 1093 1166 1239 1238 1139 1060 1121 1268
173 1268 1357 1297 1238 1233 1229 1233 1236 1180 1124 1165 1206 1147 1089 1062 1036 1068 1101 1098 1095 1095 1096 1141 1247 1315 1284 1248 1212 1170 1128 1095 1062 1087 1113 1153 1192 1232 1271 1231
168 1231 1191 1151 1111 1114 1116 1118 1120 1103 1087 1070 1054 1041 1028 1074 1121 1133 1145 1157 1169 1147 1126 1104 1083 1113 1144 1174 1204 1219 1233 1248 1262 1278 1294 1250 1207 1164 1120
163 1120 1136 1152 1155 1157 1160 1163 1203 1243 1223 1204 1215 1226 1237 1248 1264 1280 1296 1312 1328 1344 1304 1264 1261 1318 1316 1196 1069 1061 1157 1253 1213 1173 1133 1093 1142 1191 1241
159 1241 1290 1233 1176 1119 1062 1082 1101 1120 1140 1132 1124 1116 1108 1072 1036 1000 963 1010 1057 1103 1150 1176 1201 1168 1134 1138 1141 1145 1148 1128 1107 1146 1185 1218 1250 1224 1197 1146 1095
154 1095 1142 1190 1229 1268 1248 1228 1231 1234 1238 1241 1248 1255 1262 1269 1230 1191 1152 1113 1179 1245 1252 1259 1256 1254 1252 1249 1199 1148 1196 1244 1295 1345 1297 1248 1220 1191 1162 1134 1146 1158 1171 1183
149 1183 1173 1163 1213 1262 1208 1155 1161 1166 1155 1143 1131 1120 1088 1057 1029 1001 1038 1135 1224 1214 1169 1123 1131 1139 1127 1114 1161 1208 1157 1106 1114 1122 1075 1027 1079 1190 1275
145 1275 1261 1207 1154 1204 1254 1205 1098 1012 1025 1078 1131 1144 1158 1231 1304 1299 1294 1260 1225 1196 1167 1167 1168 1170 1172 1204 1236 1192 1149 1105 1062 1135 1209 1184 1158 1134 1110
140 1110 1086 1062 1074 1085 1097 1108 1123 1137 1211 1285 1245 1205 1195 1185 1175 1165 1214 1263 1229 1195 1190 1185 1134 1084 1092 1160 1211 1163 1046 988 1023 1117 1160 1143 1115 1147
136 1147 1175 1144 1064 984 999 1015 1030 1046 1031 1017 1057 1096 1195 1294 1271 1247 1223 1199 1129 1060 1089 1118 1073 1029 1083 1137 1169 1202 1205 1208 1169 1130 1147 1164 1124 1024
131 1024 961 997 1083 1169 1202 1235 1158 1080 1062 1045 1051 1057 1063 1069 1113 1158 1144 1130 1062 995 957 920 866 812 897 982 1065 1149 1203 1257 1218 1180 1142 1103 1084 1065 1139
127 1139 1212 1206 1100 1017 992 1045 1098 1154 1210 1270 1330 1291 1193 1096 1098 1100 1102 1088 1075 1160 1245 1183 1121 1089 1056 980 905 928 951 973 995 988 980 1058 1135 1153 1171
122 1171 1138 1104 1130 1156 1116 1075 1094 1113 1080 1048 1074 1101 1061 1022 1041 1060 1097 1133 1110 1087 1094 1101 1137 1174 1177 1180 1174 1226 1273 1220 1134 1108 1149 1190 1141 1093 1068
118 1068 1142 1250 1298 1269 1180 1120 1061 1043 1024 1006 987 966 944 1022 1099 1132 1165 1198 1231 1172 1113 1114 1115 1126 1138 1150 1162 1152 1143 1134 1124 1189 1254 1220 1186 1144
113 1144 1102 1119 1137 1149 1161 1193 1285 1318 1253 1210 1226 1248 1210 1110 1010 975 940 1004 1068 1147 1225 1205 1185 1228 1270 1253 1237 1189 1141 1153 1165 1146 1126 1107
109 1107 1088 1028 968 967 966 966 966 986 1065 1129 1095 1027 1018 995 971 951 931 933 934 935 936 995 1053 1111 1170 1161 1153 1085 1017 977 936 955 974 997 1019 1042 1064 1069 1074 1020 965
104 965 959 953 1006 1059 1111 1162 1115 1068 1079 1090 1101 1112 1075 1039 1062 1144 1230 1217 1170 1183 1193 1202 1215 1228 1283 1338 1215 1093 1089 1085 1082 1078 1049 1019 1049 1079 1057 1035
99 1035 1073 1111 1130 1150 1169 1188 1220 1251 1223 1195 1156 1117 1078 1039 1023 1007 991 975 1027 1078 1130 1182 1257 1331 1307 1282 1334 1386 1439 1491 1511 1532 1493 1455 1418
95 1418 1382 1286 1191 1204 1217 1230 1243 1194 1145 1155 1166 1176 1186 1196 1206 1234 1263 1292 1320 1298 1276 1254 1232 1217 1202 1187 1173 1103 1034 965 896 881 866 910 955
91 955 1050 1146 1143 1140 1132 1124 1116 1107 1083 1058 1033 1008 1038 1067 1097 1127 1119 1111 1103 1095 1076 1057 1038 1019 1016 1012 1068 1123 1160 1198 1136 1074 1041 1008 994 1040 1117 1095 1000 964 1030 1097
86 1097 1108 1119 1107 1096 1025 954 1059 1163 1129 1095 1111 1126 1142 1157 1151 1144 1137 1130 1158 1186 1214 1242 1236 1230 1225 1219 1185 1150 1116 1082 1128 1174 1161 1148 1153 1159 1164 1169 1115 1061
81 1061 1006 952 1031 1110 1130 1150 1187 1223 1201 1178 1145 1111 1018 925 938 950 963 975 1040 1104 1070 1035 1039 1043 1046 1050 1053 1057 1061 1064 1139 1214 1151 1087 1087 1086 1086 1085 1069 1052 1036
76 1036 1019 978 936 955 973 1037 1101 1066 1031 1074 1117 1160 1203 1239 1275 1272 1169 1045 979 974 968 1017 1067 1117 1167 1147 1128 1108 1089 1019 949 978 1067 1157 1147 1099
71 1099 1050 1080 1111 1082 993 949 1004 1093 1122 1089 1056 1019 982 1026 1071 1057 1042 1068 1094 1120 1146 1113 1081 1049 1017 1039 1061 1084 1106 1097 1089 1021 953 1010 1068 1126
67 1126 1183 1147 1111 1075 1038 1105 1171 1138 1106 1055 1004 959 914 927 1038 1128 1158 1116 1075 1089 1103 1124 1146 1108 1070 1104 1138 1172 1205 1201 1196 1192 1187 1154 1121 1088 1055
62 1055 1089 1122 1096 1071 1041 1011 1041 1071 1079 1087 1036 985 969 952 995 1038 1041 1043 986 929 954 978 944 909 987 1064 1086 1108 1103 1158 1181 1105 1026 1046 1096 1087 1109 1131
58 1131 1150 1168 1198 1229 1219 1111 1010 969 987 1005 1018 1032 1045 1059 1060 1061 970 878 871 962 1032 1042 1030 1019 1004 989 981 972 963 955 928 900 932 965 987 1009 1031 1053
53 1053 1066 1079 1034 930 895 978 1061 1025 950 934 1016 1098 1175 1252 1270 1288 1244 1200 1157 1113 1108 1103 1098 1094 1064 1035 1013 991 986 1099 1216 1215 1187 1217 1244 1212 1165
49 1165 1177 1227 1157 1069 1100 1157 1154 1141 1246 1317 1329 1340 1411 1459 1388 1226 1183 1238 1175 1082 1108 1193 1160 1063 1084 1211 1278 1249 1338 1497 1596 1609 1742
45 1742 2005 2149 2127 2045 1997 1948 1880 1930 1987 1926 1784 1760 1874 1870 1799 1847 2036 2166 2130 2153 2325 2496 2675 2972 3445 4037 4718 5596 6263
41 6263 6178 5511 4903 4654 4464 4165 4143 4464 4666 4622 4776 5197 5500 5584 6025 7062 8099 8996 10408 12722 15313 18232 22774
38 22774 29917 39552 53413 75700 106652 136297 149335 138832 112664 85031 64124 49586 38787 31035 25995
36 25995 22339 19020 16373 14626 13155 11532 10106 9225 8543 7674 6806 6396 6185 5795 5524 5615 5706 5646 5705 6285 6984 7253
34 7253 7007 6440 5754 5044 4452 4109 3885 3602 3318 3238 3157 2938 2719 2747 2775 2704 2633 2648 2662 2573 2364 2298 2350 2328 2306 2337 2367 2298 2229
30 2229 2200 2170 2141 2112 2125 2137 2059 1980 1949 2036 2057 2077 2041 2005 1969 1933 1966 1999 2124 2249 2358 2348 2227 2105 2027 1950 1812 1675 1700 1724 1749 1774
26 1774 1790 1807 1764 1721 1682 1643 1545 1446 1555 1664 1634 1604 1568 1532 1496 1460 1473 1485 1406 1327 1302 1396 1423 1450 1512 1573 1504 1435 1391 1467 1475 1484 1506 1528 1551
22 1551 1573 1558 1543 1558 1573 1620 1667 1625 1583 1561 1539 1468 1338 1275 1330 1404 1477 1504 1531 1488 1446 1490 1535 1534 1533 1535 1597 1591 1467 1350 1353 1387 1363 1340 1376 1450
18 1450 1404 1348 1411 1515 1501 1416 1331 1368 1404 1393 1383 1372 1361 1423 1484 1546 1607 1555 1503 1451 1398 1381 1363 1375 1387 1377 1366 1306 1245 1243 1241 1308 1375 1303 1231 1209
13 1209 1186 1259 1331 1315 1299 1301 1303 1375 1447 1414 1382 1301 1219 1260 1301 1293 1285 1273 1260 1252 1243 1259 1335 1378 1303 1226 1209 1219 1230 1288 1346 1334 1323 1330 1337 1344 1351 1373 1396 1418
8 1418 1441 1435 1429 1452 1476 1427 1377 1377 1378 1321 1264 1336 1408 1436 1465 1444 1423 1429 1435 1511 1586 1554 1522 1421 1320 1296 1273 1279 1285 1240 1195 1258 1321 1276 1230 1215 1199 1198 1196 1224
3 1224 1253 1288 1324 1310 1297 1258 1220 1212 1204 1180 1156 1221 1286 1259 1232 1205 1178 1160 1142 1154 1166 1189 1212 1166 1120 1115 1109 1193 1277 1299 1320 1273 1226 1159 1093 1095 1098 1150 1201
-1 1201 1253 1304 1248 1192 1185 1179 1209 1240 1270 1301 1286 1272 1258 1244 1279 1314 1299 1285 1220 1156 1180 1204 1223 1241 1210 1179 1228 1276 1239 1201 1203 1263 1283 1204 1087 1068
-6 1068 1170 1271 1281 1191 1089 986 985 985 1054 1123 1131 1138 1196 1253 1237 1221 1235 1249 1302 1355 1280 1204 1157 1109 1151 1192 1204 1216 1172 1129 1128 1186 1267 1249 1167 1085
-10 1085 1135 1185 1171 1157 1143 1129 1125 1120 1215 1309 1267 1224 1240 1257 1287 1316 1287 1257 1224 1190 1256 1321 1325 1329 1333 1337 1280 1222 1199 1274 1306 1198 1083 1026 1028 1029 1034 1040 1136
-15 1136 1231 1268 1304 1257 1209 1162 1114 1147 1181 1155 1129 1105 1082 1157 1233 1253 1274 1294 1314 1293 1271 1249 1228 1229 1230 1324 1418 1384 1252 1120 1086 1111 1135 1165 1196
-19 1196 1188 1180 1172 1164 1202 1241 1220 1199 1260 1320 1322 1323 1312 1300 1289 1278 1301 1324 1347 1371 1398 1426 1513 1600 1603 1605 1549 1493 1513 1534 1555 1575 1511 1446 1441 1436 1406 1376 1286 1197
-24 1197 1166 1135 1163 1191 1147 1102 1058 1014 1031 1049 1067 1084 1131 1179 1127 1075 1104 1133 1161 1190 1200 1210 1220 1230 1206 1181 1157 1132 1152 1173 1193 1213 1233 1254 1274
-28 1274 1294 1232 1169 1107 1044 1039 1033 1087 1140 1188 1235 1223 1211 1201 1191 1182 1172 1184 1196 1207 1219 1196 1173 1150 1127 1133 1139 1145 1150 1162 1174 1186 1198 1116 1033 1050 1066 1105
-33 1105 1143 1178 1213 1232 1191 1181 1270 1358 1346 1219 1092 1088 1084 1081 1077 1117 1156 1196 1236 1204 1172 1141 1109 1134 1160 1125 1091 1034 977 1058 1140 1136 1132 1128 1124 1113 1102 1111
-38 1111 1180 1234 1188 1110 1090 1131 1171 1117 1062 1084 1106 1127 1149 1113 1077 1040 1004 1061 1119 1177 1234 1225 1217 1208 1200 1211 1222 1174 1125 1121 1116 1171 1225 1152 1080 1066 1053 1081
-42 1081 1110 1139 1168 1140 1112 1083 1055 1081 1107 1074 1041 1097 1154 1182 1209 1166 1123 1051 978 1021 1063 1106 1149 1127 1106 1137 1169 1171 1074 977 979 1043 1107 1078 1049 1102
-47 1102 1156 1150 1145 1095 1045 1093 1142 1219 1295 1234 1172 1149 1127 1134 1141 1156 1172 1187 1202 1187 1173 1099 1025 991 958 1024 1089 1133 1177 1161 1146 1162 1179 1196 1212 1197 1183
-51 1183 1168 1153 1129 1106 1082 1059 1043 1027 1071 1115 1154 1193 1231 1270 1287 1303 1260 1217 1175 1133 1091 1049 1110 1171 1232 1293 1220 1146 1112 1176 1223 1209 1143 1136 1162
-55 1162 1188 1118 1049 1008 968 957 946 997 1048 1070 1091 1118 1144 1111 1078 1052 1025 1059 1092 1157 1223 1229 1235 1220 1205 1189 1174 1167 1161 1124 1088 1061 1034 1066 1098 1114 1131
-60 1131 1048 966 1018 1070 1063 1056 1080 1104 1128 1152 1107 1063 1048 1033 1057 1082 1165 1249 1194 1140 1115 1090 1085 1080 1016 952 1005 1058 1141 1223 1202 1180 1189 1197 1176 1154 1192 1230
-65 1230 1211 1191 1112 1033 1086 1139 1133 1127 1081 1035 989 943 985 1027 1069 1111 1090 1070 1050 1030 1012 995 948 902 927 953 1038 1124 1131 1139 1088 1036 1045 1054 1003 952 997 1043
-69 1043 1089 1134 1150 1165 1180 1195 1219 1243 1168 1093 1095 1097 1098 1100 1118 1136 1153 1171 1170 1168 1167 1165 1180 1195 1187 1120 1049 1036 1119 1202 1259 1217 1098 1038 1073 1107 1080 993 966
-74 966 939 938 937 974 1010 951 892 851 870 884 899 935 970 980 989 1019 1107 1196 1225 1228 1231 1174 1118 1077 1095 1110 1124 1101 1077 1054 1030 1027 1024 1021 1018 1068 1118 1142 1107 1112
-79 1112 1117 1063 1009 971 993 1015 1037 1052 1127 1201 1217 1165 1113 1061 1009 1002 1054 1109 1106 1087 1129 1170 1152 1162 1231 1289 1248 1151 1053 1049 1044 1080 1116 1185 1195 1171 1147
-83 1147 1124 1100 1077 1114 1124 1075 1033 1051 1124 1138 1127 1117 1163 1208 1198 1189 1180 1170 1123 1075 1122 1170 1184 1139 1071 1004 1009 1073 1137 1142 1110 1077 1071 1064 1046 1028 1069 1111
-88 1111 1047 984 1020 1055 1085 1114 1084 1054 1036 1017 998 979 960 940 979 1018 1091 1163 1136 1109 1069 1029 959 889 871 853 865 877 952 1028 1073 1118 1123 1127 1102 1076
-93 1076 1022 967 972 977 934 891 878 864 883 901 890 879 863 846 929 1011 1026 1041 997 952 913 873 893 912 915 918 892 865 923 980 978 976 936 897 996 1094 1140 1186
-97 1186 1173 1160 1103 1046 990 933 880 827 872 918 982 1046 1051 1056 968 880 930 981 1021 1062 1102 1143 1140 1136 1133 1129 1117 1105 1093 1081 1027 973 978 984 996 1009 1022 1034 1095
-102 1095 1156 1118 1081 1020 959 928 897 925 952 980 1008 1008 1008 1067 1126 1075 1024 1033 1041 1003 964 925 887 914 940 967 994 908 822 835 848 851 853 856 858 891 923 1015
-107 1015 1106 1087 1069 1050 1031 1010 988 967 946 889 833 875 917 946 975 1004 1033 1051 1069 1087 1106 1091 1075 1060 1045 1046 1047 1108 1168 1149 1130 1111 1093 1149 1205
-111 1205 1202 1199 1134 1069 1004 939 917 895 972 1049 1072 1094 1058 1021 1050 1079 1108 1136 1158 1179 1142 1104 1083 1061 1040 1019 1084 1150 1215 1280 1219 1157 1154 1152 1170 1189
-115 1189 1109 1028 978 928 976 1025 1053 1082 1111 1140 1170 1200 1229 1259 1187 1114 1140 1167 1146 1126 1106 1085 1108 1131 1094 1058 949 839 846 952 1034 1018 970
-119 970 982 1035 1089 1087 1085 1075 1066 1056 1047 1060 1073 1086 1099 1141 1182 1125 1067 1057 1047 1036 1026 1065 1104 1045 985 971 957 942 928 904 880 955 1030 1018 1007 996 984
-124 984 987 989 991 994 1016 1039 1061 1084 1098 1112 1126 1140 1092 1044 1056 1067 1106 1145 1184 1222 1175 1127 1139 1151 1129 1108 1086 1065 1055 1045 1036 1026 972 918 940 1062 1142
-128 1142 1124 1128 1191 1262 1234 1133 1091 1072 1053 1038 1023 1039 1054 1070 1086 1077 1068 1059 1051 1077 1102 1029 956 984 1012 981 950 953 956 959 963 954 945 935 926 954 982 1010 1038 1034
-133 1034 1030 1027 1023 1039 1055 1011 968 954 940 986 1031 1024 1016 1068 1120 1114 1107 1101 1095 1037 979 1020 1060 1078 1096 1113 1131 1142 1154 1106 1058 1075 1092 1050 1008 955 901 907 913 947
-138 947 981 1016 1050 1047 1044 1041 1038 1089 1140 1132 1124 1128 1131 1134 1137 1074 1011 947 884 887 891 894 898 929 961 993 1024 999 974 948 923 932 941 950 959 995 1032 1068 1104 1061 1018 974 931 909
-144 909 887 963 1040 1051 1063 1074 1085 1009 932 888 962 1041 1120 1148 1175 1161 1147 1133 1120 1120 1120 1061 1002 1033 1064 1095 1126 1121 1117 1113 1108 1159 1211 1163 1115 1065 1015 965
-148 965 915 946 978 1009 1041 1031 1021 1103 1185 1227 1150 1042 933 961 988 1016 1044 1066 1089 1053 1016 996 977 958 938 998 1057 1018 979 974 970 965 960 912 864 876
-153 876 887 924 961 938 915 942 969 995 1022 1011 1000 989 978 1033 1088 1083 1078 1075 1071 1068 1065 1061 1058 1055 1051 1023 995 1027 1058 1072 1086 1041 996 1002 1009 1015 1021 1043 1064 1085 1107 1110
-158 1110 1112 1056 999 1002 1005 1008 1010 967 924 940 956 960 963 908 852 886 919 952 986 1028 1070 1112 1154 1081 1009 936 864 901 939 976 1013 1037 1060 985 909 880 850 879
-162 879 909 949 989 969 950 991 1032 1073 1114 1123 1132 1082 1032 1031 1030 1029 1029 1057 1085 1015 944 906 868 928 989 996 1003 1011 1018 1059 1100 1092 1084 1049 1014 980 945 991 1036 973 910
-167 910 938 967 995 1024 1014 1005 1085 1165 1141 1117 1044 970 997 1023 980 937 960 983 1005 1028 1037 1047 1006 966 966 966 966 966 929 891 903 915 953 992 922 851 859 867 924
-172 924 981 1006 1031 967 903 825 747 758 769 785 802 819 836 853 869 886 903 849 794 769 744 817 891 895 899 884 870 924 979 1030 1081 1082 1084 999 914 898 883
-177 883 918 953 899 845 946 1047 1078 1109 1075 1040 1055 1069 1040 1011 982 953 1020 1087 1155 1222 1214 1207 1150 1094 1091 1089 1017 946 960 974 987 1001 950 898 955 1012
-181 1012 999 985 972 958 934 910 886 862 871 880 889 898 975 1053 1078 1044 999 1013 1059 1106 1079 1053 1026 1000 998 997 995 994 995 997 998 1000 1038 1076 1082 1029 924 879 908 996
-186 996 1040 1026 999 972 987 1003 1018 1034 1013 992 925 858 837 875 966 1056 1064 1012 961 969 1007 1046 1038 1031 1092 1154 1091 1027 992 1017 1008 999 982 965 952 939 945 1011
-191 1011 1077 1083 1053 1022 988 954 971 988 1005 1022 989 955 986 1018 1050 1023 947 870 901 1030 1130 1131 1084 1037 984 931 998 1064 1095 1066 1054 1041 1059 1077
-195 1077 1109 1201 1263 1266 1181 1096 1063 1089 1154 1220 1234 1188 1166 1145 1119 1094 1110 1127 1094 1062 1010 958 995 1032 1059 1087 1045 1003 1030 1057 1084 1111 1116 1121 1116 1052
-199 1052 976 999 1051 1103 1051 999 946 894 885 875 865 856 856 855 855 855 902 948 946 943 899 856 921 987 980 974 997 1020 1027 1033 990 947 984 1020 987 954 934 914 944 974
-204 974 940 906 941 976 1014 1051 1088 1125 1111 1097 1034 970 1014 1058 1073 1087 1060 1033 1055 1078 1051 1025 998 972 910 849 896 943 1028 1112 1088 1004 921 936 975
-208 975 954 907 859 897 935 978 1021 1064 1106 1103 1099 1095 1091 1029 966 904 841 836 831 875 920 904 889 873 858 867 876 886 895 858 821 853 885 917 949 981 1013 1033 1054
-213 1054 1075 1096 1080 1064 1078 1092 1116 1139 1093 1047 969 891 961 1031 973 915 886 858 883 908 904 899 926 952 1008 1064 1027 990 982 975 1023 1071 1030 989 907 825
-217 825 798 772 760 847 998 1089 1045 941 864 845 843 840 841 842 836 831 856 880 901 921 1011 1101 1066 1030 995 959 935 912 888 864 854 843 833 822 820 819 906 1052
-222 1052 1110 1069 985 960 948 936 957 979 1016 1053 1090 1127 1121 1115 1109 1102 1095 1087 1030 973 1013 1052 1023 994 1028 1062 1066 1070 1051 1032 1043 1053 1053 1053 1024 994 983 971 930
$$ [...]
-1605H35
##END=	
##END=	
