##TITLE=	Mar19-2018.41.fid
TH010 13C

##JCAMP-DX=	6.0	$$ MestReNova 14.1.1-24571
##DATA TYPE=	LINK
##BLOCK_ID=	1
##BLOCKS=	1    
##ORIGIN=	Mestrelab Research S.L.
##OWNER=	hrzepa
##$MNOVA/LINK_BLOCK_TYPE=	ITEM	$$ NMR Spectrum
##$MNOVA/ITEM/POLYGON=	(XY..XY)
5321,5835
8722,5835
8722,8208
5321,8208
5321,5835
##$MNOVA/ITEM/Z=	0
##$MNOVA/ITEM/ANGLE=	0
##TITLE=	Mar19-2018.41.fid
##JCAMP-DX=	6.0	$$ MestReNova 14.1.1-24571
##BLOCK_ID=	2
##DATA TYPE=	NMR SPECTRUM
##DATA CLASS=	XYDATA
##NUMDIM=	1
##ORIGIN=	Bruker BioSpin GmbH
##OWNER=	nmrsu
##.OBSERVE FREQUENCY=	100.671616723846995
##.OBSERVE NUCLEUS=	^13C
##.SOLVENT NAME=	CDCl3
##.PULSE SEQUENCE=	zgpg30
##LONGDATE=	2018/03/19 22:59:00.000
##.ACQUISITIONMODE=	SIMULTANEOUS (DQD)
##$ORIGINAL FORMAT=	Bruker XWIN-NMR
##$MNOVA/SCALES_VERSION=	9
##$PARAMETER FILE=	(acqus, ASCII, /Users/hrzepa/Downloads/Polysiphenol%20SI%20NMR%20Original%20Data/4/4d%20-%2013C%20-%20400B.18.03.19.041/41/acqus, 0)
$$ ##TITLE= Parameter file, TOPSPIN		Version 3.2
$$ ##JCAMPDX= 5.0
$$ ##DATATYPE= Parameter Values
$$ ##NPOINTS= 11	$$ modification sequence number
$$ ##ORIGIN= Bruker BioSpin GmbH
$$ ##OWNER= nmrsu
$$ $$ 2018-03-19 22:59:10.488 +0000  nmrsu@CZC2524DW0
$$ $$ /opt/topspin/data/brad/nmr/Mar19-2018/41/acqus
$$ $$ process /opt/topspin3.2/prog/mod/shimcntl
$$ ##$ACQT0= -2.05882356948211
$$ ##$AMP= (0..31)
$$ 100 100 100 100 100 100 100 100 100 100 100 100 100 100 100 100 100 100
$$ 100 100 100 100 100 100 100 100 100 100 100 100 100 100
$$ ##$AMPCOIL= (0..19)
$$ 0 0 0 0 0 0 0 0 0 0 0 0 0 0 0 0 0 0 0 0
$$ ##$ANAVPT= -1
$$ ##$AQSEQ= 0
$$ ##$AQ_mod= 3
$$ ##$AUNM= <au_zg>
$$ ##$AUTOPOS= <12 >
$$ ##$BF1= 100.660544
$$ ##$BF2= 400.32
$$ ##$BF3= 100.660544
$$ ##$BF4= 100.660544
$$ ##$BF5= 100.660544
$$ ##$BF6= 100.660544
$$ ##$BF7= 100.660544
$$ ##$BF8= 100.660544
$$ ##$BYTORDA= 0
$$ ##$CAGPARS= (0..11)
$$ 0 0 0 0 0 0 0 0 0 0 0 0
$$ ##$CFDGTYP= 0
$$ ##$CFRGTYP= 9
$$ ##$CHEMSTR= <none>
$$ ##$CNST= (0..63)
$$ 1 1 145 1 1 1 1 1 1 1 1 1 1 1 1 1 1 1 1 1 1 1 1 1 1 1 1 1 1 1 1 1 1 1 1
$$ 1 1 1 1 1 1 1 1 1 1 1 1 1 1 1 1 1 1 1 1 1 1 1 1 1 1 1 1 1
$$ ##$CPDPRG= (0..8)
$$ <waltz16> <> <waltz16> <> <mlev> <mlev> <mlev> <mlev> <mlev>
$$ ##$D= (0..63)
$$ 0 1 0.00345 0 0 0 0 0 0 0.06 0 0.03 2e-05 3e-06 0 0 0.0002 0 0 0 0 0 0
$$ 0 0 0 0 0 0 0 0 0 0 0 0 0 0 0 0 0 0 0 0 0 0 0 0 0 0 0 0 0 0 0 0 0 0 0 0
$$ 0 0 0 0 0
$$ ##$DATE= 1521500349
$$ ##$DE= 6.5
$$ ##$DECBNUC= <off>
$$ ##$DECIM= 704
$$ ##$DECNUC= <off>
$$ ##$DECSTAT= 4
$$ ##$DIGMOD= 1
$$ ##$DIGTYP= 12
$$ ##$DQDMODE= 0
$$ ##$DR= 21
$$ ##$DS= 4
$$ ##$DSPFIRM= 0
$$ ##$DSPFVS= 20
$$ ##$DTYPA= 0
$$ ##$EXP= <c13q>
$$ ##$F1LIST= <111111111111111>
$$ ##$F2LIST= <222222222222222>
$$ ##$F3LIST= <333333333333333>
$$ ##$FCUCHAN= (0..9)
$$ 0 1 2 0 0 0 0 0 0 0
$$ ##$FL1= 83
$$ ##$FL2= 83
$$ ##$FL3= 83
$$ ##$FL4= 83
$$ ##$FOV= 20
$$ ##$FQ1LIST= <freqlist>
$$ ##$FQ2LIST= <freqlist>
$$ ##$FQ3LIST= <freqlist>
$$ ##$FQ4LIST= <freqlist>
$$ ##$FQ5LIST= <freqlist>
$$ ##$FQ6LIST= <freqlist>
$$ ##$FQ7LIST= <freqlist>
$$ [...]
$$ ##$Sgu3PowerLevels= (0..7)
$$ 0 0 0 0 0 0 0 0
$$ ##$Sgu4PowerLevels= (0..7)
$$ 0 0 0 0 0 0 0 0
$$ ##$Sgu5PowerLevels= (0..7)
$$ 0 0 0 0 0 0 0 0
$$ ##$Sgu6PowerLevels= (0..7)
$$ 0 0 0 0 0 0 0 0
$$ ##$Sgu7PowerLevels= (0..7)
$$ 0 0 0 0 0 0 0 0
$$ ##$Sgu8PowerLevels= (0..7)
$$ 0 0 0 0 0 0 0 0
$$ ##$SguType= 3
$$ ##$ShimPowMaxUA= (0..63)
$$ 130000 130000 130000 130000 130000 130000 130000 130000 130000 130000 130000
$$ 130000 130000 130000 130000 130000 130000 130000 130000 130000 0 0 0 0
$$ 0 0 0 0 0 0 0 0 0 0 0 0 0 0 0 0 0 0 0 0 0 0 0 0 0 0 0 0 0 0 0 0 0 0 0 0
$$ 0 0 0 0
$$ ##$ShimPowMaxUC= (0..63)
$$ 130000 130000 130000 130000 130000 130000 130000 130000 130000 130000 130000
$$ 130000 130000 130000 130000 130000 130000 130000 130000 130000 0 0 0 0
$$ 0 0 0 0 0 0 0 0 0 0 0 0 0 0 0 0 0 0 0 0 0 0 0 0 0 0 0 0 0 0 0 0 0 0 0 0
$$ 0 0 0 0
$$ ##$ShimPowMaxUG= (0..63)
$$ 524287 524287 524287 524287 524287 524287 524287 524287 524287 524287 524287
$$ 524287 524287 524287 524287 524287 524287 524287 524287 524287 0 0 0 0
$$ 0 0 0 0 0 0 0 0 0 0 0 0 0 0 0 0 0 0 0 0 0 0 0 0 0 0 0 0 0 0 0 0 0 0 0 0
$$ 0 0 0 0
$$ ##$ShimPowRcbType= 3
$$ ##$ShimPowRes= (0..63)
$$ 1e-20 1e-20 1e-20 1e-20 1e-20 1e-20 1e-20 1e-20 1e-20 1e-20 1e-20 1e-20
$$ 1e-20 1e-20 1e-20 1e-20 1e-20 1e-20 1e-20 1e-20 0 0 0 0 0 0 0 0 0 0 0 0
$$ 0 0 0 0 0 0 0 0 0 0 0 0 0 0 0 0 0 0 0 0 0 0 0 0 0 0 0 0 0 0 0 0
$$ ##$ShimPowRng0= (0..63)
$$ 1 1 1 1 1 1 1 1 1 1 1 1 1 1 1 1 1 1 1 1 0 0 0 0 0 0 0 0 0 0 0 0 0 0 0 0
$$ 0 0 0 0 0 0 0 0 0 0 0 0 0 0 0 0 0 0 0 0 0 0 0 0 0 0 0 0
$$ ##$ShimPowRng1= (0..63)
$$ 1 1 1 1 1 1 1 1 1 1 1 1 1 1 1 1 1 1 1 1 0 0 0 0 0 0 0 0 0 0 0 0 0 0 0 0
$$ 0 0 0 0 0 0 0 0 0 0 0 0 0 0 0 0 0 0 0 0 0 0 0 0 0 0 0 0
$$ ##$ShimPowRng2= (0..63)
$$ 1 1 1 1 1 1 1 1 1 1 1 1 1 1 1 1 1 1 1 1 0 0 0 0 0 0 0 0 0 0 0 0 0 0 0 0
$$ 0 0 0 0 0 0 0 0 0 0 0 0 0 0 0 0 0 0 0 0 0 0 0 0 0 0 0 0
$$ ##$ShimPowRng3= (0..63)
$$ 1 1 1 1 1 1 1 1 1 1 1 1 1 1 1 1 1 1 1 1 0 0 0 0 0 0 0 0 0 0 0 0 0 0 0 0
$$ 0 0 0 0 0 0 0 0 0 0 0 0 0 0 0 0 0 0 0 0 0 0 0 0 0 0 0 0
$$ ##$ShimSysFunc= (0..63)
$$ 1 2 3 4 5 7 9 11 15 16 8 10 12 14 6 17 13 18 19 20 0 0 0 0 0 0 0 0 0 0
$$ 0 0 0 0 0 0 0 0 0 0 0 0 0 0 0 0 0 0 0 0 0 0 0 0 0 0 0 0 0 0 0 0 0 0
$$ ##$ShimSysMatrix= 0
$$ ##$ShimSysType= 1
$$ ##$TFXNUM= 0
$$ ##$TRIPLO2= 0
$$ ##$VTU= 2
$$ ##$VTUETH= <149.236.99.20>
$$ ##$VTUTY= <no>
$$ ##$WBREFAM= (0..15)
$$ 132.2 106.2 100 100 100 100 100 100 100 100 100 100 100 100 100 100
$$ ##$WBREFLM= (0..15)
$$ 0 0 0 0 0 0 0 0 0 0 0 0 0 0 0 0
$$ ##$WBREFPH= (0..15)
$$ 77.55 -65.76 0 0 0 0 0 0 0 0 0 0 0 0 0 0
$$ ##$WBSGU= (0..15)
$$ 0 0 0 0 0 0 0 0 0 0 0 0 0 0 0 0
$$ ##$XFAC= 2
$$ ##END=
$$ 
##$DECIM=	704
##$DSPFVS=	20
##XUNITS=	HZ
##YUNITS=	ARBITRARY UNITS
##FIRSTX=	25277.269301538948639
##LASTX=	-3131.3881192264107085
##DELTAX=	-0.43348832563920591809
##XFACTOR=	1
##YFACTOR=	0.027946297351993575064
##FIRSTY=	-12.889825820922851562
##MINY=	-27.919565200805664062
##MAXY=	533.56890869140625
##NPOINTS=	65536
##XYDATA=	(X++(Y..Y))
$$ [...]
$$ plain form
12374 -707 -720 -704 -688 -640 -593 -594 -596 -592 -588 -554 -521 -526 -532 -538 -543 -510 -477 -444 -411 -427 -443 -459 -474 -439 -403 -367 -331 -346 -360 -374 -388 -433 -478 -551 -574 -537 -500 -490
12358 -490 -479 -507 -534 -512 -491 -469 -448 -427 -405 -423 -440 -457 -475 -440 -405 -373 -341 -361 -430 -517 -575 -587 -600 -561 -523 -511 -498 -533 -567 -556 -516 -494 -522 -564
12343 -564 -607 -623 -639 -624 -609 -594 -578 -549 -520 -491 -461 -466 -471 -476 -480 -492 -505 -517 -529 -516 -504 -491 -479 -451 -423 -382 -370 -416 -512 -598 -655 -681 -708 -733 -758 -791
12328 -791 -824 -808 -792 -738 -683 -628 -574 -558 -543 -528 -512 -576 -640 -704 -767 -735 -703 -642 -580 -551 -521 -540 -589 -620 -601 -543 -486 -483 -480 -507 -534 -537 -539 -542 -545 -576 -608
12312 -608 -570 -533 -499 -464 -499 -562 -589 -567 -556 -574 -576 -548 -489 -430 -468 -507 -545 -583 -568 -552 -537 -521 -482 -442 -401 -360 -254 -118 -7 34 23 43 102
12297 102 191 342 639 1045 1343 1323 998 604 299 96 -76 -199 -273 -350 -428 -491 -486 -441 -396 -396 -396 -385 -374 -393 -412 -431 -451 -470 -490 -489 -488 -487
12283 -487 -486 -477 -468 -458 -449 -447 -445 -443 -441 -431 -422 -432 -412 -385 -406 -467 -528 -529 -529 -532 -534 -549 -592 -647 -653 -604 -555 -504 -452 -439 -426 -462 -498 -507 -516 -524 -533 -542 -552 -591 -629 -657 -685 -663
12264 -663 -642 -610 -579 -596 -613 -595 -577 -559 -541 -534 -526 -519 -511 -544 -577 -610 -643 -634 -625 -616 -607 -631 -655 -678 -702 -679 -656 -633 -610 -602 -595 -587 -579 -550 -520 -490 -461 -478 -495 -513
$$ packed form
12374g07j3J6J6M8M7jkMML4L3noonL3L3L3L3j6j6j6j5L5L6L6L6j5j4j4j4m5m5p3k3L7L7J0
12358d90J1k8k7K2K1K2K1K1K2j8j7j7j8L5L5L2L2k0o9q7n8j2j3L9L8J2J3l5l4J1M0K2k8m2
12343e64m3j6j6J5J5J5J6K9K9K9L0nnnmj2j3j2j2J3J2J3J2K8K8M1J2m6r6q6n7k6k7k5k5l3
12328g91l3J6J6N4N5N5N4J6J5J5J6o4o4o4o3L2L2O1O2K9L0j9m9l1J9N8N7LLk7k7lklll1l2
12312f08L8L7L4L5l5o3k7K2J1j8kK8N9N9l8l9l8l8J5J6J5J6L9M0M1M1J06J36J11M1j1K0N9
12297A02Q9J51K97M06K98k0l25l94l05k03j72j23p4p7p8o3NM5M5%%J1J1j9j9j9k0j9k0JJJ
12283d87JRRJ0RKKKKJ0Rj0K0K7k1o1o1j%lkj5m3n5oM9M9N1N2J3J3l6l6rrqrrj0l9l8k8k8K2
12264f63K1L2L1j7j7J8J8J8J8PQPQl3l3l3l3RRRRk4k4k3k4K3K3K3K3QPQQK9L0L0K9j7j7j8
$$ plain form
12247 -513 -530 -547 -565 -582 -599 -609 -619 -628 -638 -589 -541 -492 -443 -400 -357 -337 -366 -459 -580 -702 -794 -861 -878 -871 -863 -821 -749 -693 -638 -592 -546 -499 -453 -439 -425
12232 -425 -413 -400 -410 -450 -475 -500 -508 -546 -582 -589 -556 -493 -429 -394 -395 -395 -399 -403 -418 -462 -516 -570 -591 -562 -514 -466 -448 -460 -485 -510 -495 -481 -505 -579 -663 -718 -757
12216 -757 -768 -744 -692 -611 -559 -554 -599 -634 -640 -619 -597 -574 -551 -547 -543 -567 -591 -614 -609 -572 -536 -524 -541 -591 -670 -754 -789 -762 -706 -645 -585 -553 -520 -522 -523 -554 -586 -623
12199 -623 -661 -686 -682 -649 -616 -582 -548 -520 -492 -497 -532 -564 -596 -630 -663 -680 -696 -712 -728 -728 -729 -699 -670 -627 -584 -580 -626 -678 -701 -655 -578 -530 -511 -493 -446 -386 -375
12183 -375 -403 -432 -447 -461 -476 -491 -488 -485 -483 -480 -519 -559 -599 -638 -626 -614 -602 -590 -582 -573 -565 -556 -567 -578 -560 -541 -522 -502 -531 -560 -614 -667 -681 -646 -573 -529 -536 -572 -602
12166 -602 -603 -594 -584 -549 -515 -529 -544 -566 -588 -561 -534 -505 -476 -476 -476 -502 -528 -525 -522 -560 -599 -665 -730 -731 -684 -615 -546 -522 -498 -474 -451 -473 -496 -519 -542 -517 -492 -440
12150 -440 -389 -384 -429 -496 -562 -567 -571 -576 -580 -597 -614 -631 -648 -638 -628 -618 -657 -721 -756 -741 -727 -754 -782 -760 -739 -704 -669 -634 -599 -597 -596 -595 -593 -624 -655 -685 -716 -668 -621
12133 -621 -574 -526 -540 -554 -568 -582 -615 -648 -681 -714 -680 -647 -615 -584 -575 -595 -599 -603 -586 -570 -553 -537 -543 -549 -553 -557 -544 -502 -448 -444 -482 -520 -561 -602 -623 -645 -693 -741
$$ packed form
12247e13j7j7j8j7j7j0j0rj0M9M8M9M9M3M3K0k9r3j21j22r2o7j7PQM2P2N6N5M6M6M7M6J4J4
12232d25J2J3j0m0k5k5ql8l6pL3O3O4L5j%mmj5m4n4n4k1K9M8M8J8j2k5k5J5J4k4p4q4n5l9
12216g57j1K4N2Q1N2Nm5l5oK1K2K3K3MMk4k4k3NL7L6J2j7n0p9q4l5K7N6O1O0L2L3kjl1l2l7
12199f23l8k5ML3L3L4L4K8K8nl5l2l2l4l3j7j6j6j6%jL0K9M3M3Mm6n2k3M6P7M8J9J8M7O0J1
12183c75k8k9j5j4j5j5LLKLl9m0m0l9J2J2J2J2QRQRj1j1J8J9J9K0k9k9n4n3j4L5P3M4pl6l0
12166f02jRJ0L5L4j4j5k2k2K7K7K9K9%%k6k6LLl8l9o6o5jM7O9O9K4K4K4K3k2k3k3k3K5K5N2
12150d40N1Nm5o7o6nmnmj7j7j7j7J0J0J0l9o4l5J5J4k7k8K2K1L5L5L5L5KJJKl1l1l0l1M8M7
12133f21M7M8j4j4j4j4l3l3l3l3L4L3L2L1Rk0mmJ7J6J7J6oommJ3M2N4Ml8l8m1m1k1k2m8m8
$$ plain form
12117 -741 -749 -708 -632 -584 -587 -618 -663 -708 -722 -708 -661 -614 -582 -550 -519 -487 -483 -479 -475 -471 -490 -508 -526 -544 -577 -610 -641 -672 -673 -644 -603 -562 -529 -497 -498 -527 -584 -641
12100 -641 -670 -699 -720 -742 -763 -784 -777 -769 -762 -755 -718 -682 -646 -609 -610 -610 -611 -611 -587 -562 -538 -513 -507 -502 -480 -487 -542 -597 -651 -706 -747 -758 -754 -720 -701 -682 -662 -641 -630 -618
12083 -618 -607 -595 -601 -606 -611 -616 -580 -543 -509 -474 -474 -504 -533 -533 -517 -501 -532 -562 -578 -594 -610 -626 -645 -664 -683 -702 -694 -685 -676 -667 -650 -633 -615 -598 -551 -504 -516 -528 -496
12066 -496 -463 -431 -399 -437 -474 -480 -438 -376 -314 -308 -302 -345 -387 -430 -472 -488 -503 -519 -534 -559 -584 -551 -517 -435 -353 -304 -304 -334 -394 -457 -490 -519 -547 -574 -601 -617
12050 -617 -634 -651 -668 -661 -653 -587 -520 -508 -497 -544 -591 -629 -666 -704 -741 -747 -752 -758 -763 -778 -794 -750 -706 -646 -586 -585 -584 -598 -613 -628 -642 -652 -661 -611 -562 -572 -583 -593 -604
12033 -604 -610 -616 -622 -629 -628 -626 -625 -624 -640 -655 -671 -686 -690 -693 -695 -696 -676 -627 -566 -555 -580 -606 -634 -662 -647 -631 -616 -600 -602 -604 -605 -607 -610 -613 -615 -618 -614 -609 -605 -600 -591 -582 -573 -564 -542 -521 -499 -478
12013 -478 -471 -464 -457 -450 -470 -490 -510 -530 -554 -578 -602 -626 -656 -686 -657 -628 -593 -558 -523 -488 -506 -524 -542 -560 -563 -565 -568 -571 -601 -631 -661 -690 -645 -600 -554 -509 -491 -473
11996 -473 -454 -436 -459 -482 -505 -529 -536 -543 -550 -558 -623 -688 -694 -701 -679 -657 -635 -613 -624 -634 -645 -655 -679 -703 -724 -745 -747 -700 -621 -542 -497 -452 -466 -480 -478 -475 -472 -470 -478 -487 -495
$$ packed form
12117g41qM1P6M8ll1m5m5j4J4M7M7L2L2L1L2MMMMj9j8j8j8l3l3l1l1jK9M1M1L3L2jk9n7n7
12100f41k9k9k1k2k1k1PQPPL7L6L6L7j%j%K4K5K4K5ONK2pn5n5n4n5m1j1ML4J9J9K0K1J1J2
12083f18J1J2onnnL6L7L4L5%l0k9%J6J6l1l0j6j6j6j6j9j9j9j9QRRRJ7J7J8J7M7M7j2j2L2
12066d96L3L2L2l8l7oM2O2O2OOm3m2m3m2j6j5j6j5k5k5L3L4Q2Q2M9%l0o0o3l3k9k8k7k7j6
12050f17j7j7j7PQO6O7J2J1m7m7l8l7l8l7ononj5j6M4M4O0O0JJj4j5j5j4j0rN0M9j0j1j0j1
12033f04ooopJKJJj6j5j6j5mlkjK0M9O1J1k5k6k8k8J5J6J5J6kkjkllklMNMNRRRRK2K1K2K1
12013d78PPPPk0k0k0k0k4k4k4k4l0l0K9K9L5L5L5L5j8j8j8j8lklll0l0l0k9M5M5M6M5J8J8
11996d73J9J8k3k3k3k4pppqo5o5opK2K2K2K2j1j0j1j0k4k4k1k1kM7P9P9M5M5j4j4KLLKqrq
$$ plain form
11978 -495 -504 -519 -534 -549 -564 -562 -559 -557 -555 -555 -556 -556 -557 -550 -543 -536 -529 -527 -524 -523 -522 -523 -552 -593 -585 -545 -506 -522 -538 -525 -512 -498 -485 -493 -501 -548 -624 -712 -750 -722 -693 -697 -730 -747 -763
11959 -763 -744 -724 -705 -685 -680 -675 -670 -665 -633 -602 -608 -664 -713 -713 -692 -672 -662 -622 -533 -444 -415 -435 -455 -476 -493 -482 -420 -358 -317 -306 -309 -313 -323 -364 -415 -466 -509 -522
11942 -522 -524 -525 -557 -619 -680 -712 -703 -694 -700 -676 -644 -611 -605 -600 -609 -617 -658 -729 -785 -840 -848 -826 -777 -759 -769 -779 -751 -693 -635 -606 -597 -588 -564 -569 -580 -591 -557 -523 -506 -519 -545
11925 -545 -571 -583 -595 -608 -620 -639 -658 -644 -601 -552 -502 -501 -529 -550 -542 -522 -503 -519 -536 -553 -569 -607 -645 -684 -722 -742 -762 -752 -712 -665 -647 -660 -673 -690 -708
11909 -708 -696 -685 -662 -640 -619 -598 -585 -600 -616 -602 -557 -512 -466 -419 -405 -390 -405 -419 -478 -536 -573 -561 -535 -508 -478 -448 -453 -457 -530 -602 -648 -693 -709 -724 -722 -719
11894 -719 -686 -654 -646 -639 -680 -721 -777 -832 -818 -805 -783 -762 -789 -817 -789 -762 -734 -707 -724 -741 -758 -775 -765 -755 -744 -734 -677 -620 -562 -505 -526 -546 -566 -586 -589 -592
11878 -592 -595 -598 -606 -614 -622 -630 -626 -622 -618 -613 -636 -659 -681 -704 -727 -751 -725 -699 -643 -586 -530 -474 -466 -458 -450 -442 -471 -501 -531 -560 -598 -635 -672 -709 -731 -752 -774 -796 -758 -720 -732
11860 -732 -743 -723 -703 -683 -664 -688 -713 -709 -704 -641 -579 -539 -549 -612 -705 -782 -810 -805 -800 -762 -724 -625 -526 -457 -456 -506 -556 -610 -664 -671 -678 -685 -693 -745 -798 -782 -766 -737 -708
$$ packed form
11978d95rj5j5j5j5KLKK%j%jPPPPKLJJjk9m1QM0L9j6j6J3J3J4J3qqm7p6q8l8K8K9ml3j7j6
11959g63J9K0J9K0NNNNL2L1on6m9%K1K0J0M0Q9Q9K9k0k0k1j7J1O2O2M1J1lmj0m1n1n1m3j3
11942e22kjl2o2o1l2RRoK4L2L3ONrqm1p1n6n5qK2M9J8j0j0K8N8N8K9RRK4nj1j1L4L4J7j3k6
11925e45k6j2j2j3j2j9j9J4M3M9N0Jk8k1QK0J9j6j7j7j6l8l8l9l8k0k0J0M0M7J8j3j3j7j8
11909g08J2J1K3K2K1K1J3j5j6J4M5M5M6M7J4J5j5j4n9n8l7J2K6K7L0L0nmp3p2m6m5j6j5KL
11894g19L3L2QPm1m1n6n5J4J3K2K1k7k8K8K7K8K7j7j7j7j7J0J0J1J0N7N7N8N7k1k0k0k0ll
11878e92llqqqqMMMNk3k3k2k3k3k4K6K6N6N7N6N6QQQQk9l0l0k9l8l7l7l7k2k1k2k2L8L8j2
11860g32j1K0K0K0J9k4k5MNO3O2M0j0o3r3p7k8NNL8L8R9R9O9Jn0n0n4n4pppqn2n3J6J6K9K9
$$ plain form
11843 -708 -680 -651 -689 -728 -767 -805 -787 -769 -750 -732 -685 -639 -624 -668 -699 -672 -597 -521 -477 -493 -524 -555 -610 -665 -691 -717 -658 -600 -541 -483 -469 -455 -440 -426
11829 -426 -394 -362 -398 -435 -481 -528 -545 -562 -556 -551 -546 -541 -566 -591 -586 -582 -579 -577 -624 -671 -638 -605 -543 -481 -456 -432 -476 -520 -578 -636 -646 -655 -627 -599 -571 -543 -543 -544 -545 -546 -534
11811 -534 -522 -510 -497 -473 -449 -424 -400 -411 -422 -432 -443 -508 -574 -590 -606 -589 -571 -553 -535 -571 -607 -672 -737 -779 -822 -849 -817 -758 -700 -686 -673 -717 -762 -806
11796 -806 -850 -873 -897 -873 -849 -817 -814 -828 -783 -699 -615 -582 -608 -629 -650 -625 -601 -553 -505 -506 -507 -534 -561 -558 -556 -543 -531 -567 -604 -586 -568 -521 -474 -493 -511 -530 -549
11780 -549 -518 -488 -457 -426 -443 -461 -478 -496 -523 -551 -529 -507 -470 -433 -445 -457 -445 -433 -450 -467 -509 -552 -565 -578 -579 -580 -580 -581 -573 -565 -557 -548 -550 -552 -553 -555 -569 -583 -597 -611
11763 -611 -613 -616 -619 -622 -608 -593 -579 -565 -624 -683 -742 -801 -808 -815 -823 -830 -818 -807 -795 -783 -729 -676 -622 -569 -579 -590 -600 -611 -604 -597 -590 -584 -618 -653 -688 -723 -706 -689 -672 -655
11745 -655 -663 -671 -678 -686 -647 -608 -599 -589 -656 -723 -774 -766 -720 -674 -673 -673 -653 -634 -585 -536 -472 -408 -393 -377 -387 -396 -406 -415 -440 -464 -489 -514 -509 -504 -499 -494 -493 -491 -460 -430 -374 -318
11727 -318 -298 -336 -419 -501 -552 -544 -522 -499 -502 -505 -515 -524 -563 -602 -637 -673 -660 -647 -641 -635 -599 -564 -535 -505 -525 -545 -546 -547 -548 -548 -591 -633 -721 -808 -836 -806 -723 -641 -599
$$ packed form
11843g08K8K9l8l9l9l8J8J8J9J8M7M6J5m4l1K7P5P6M4j6l1l1n5n5k6k6N9N8N9N8J4J4J5J4
11829d26L2L2l6l7m6m7j7j7ONNNk5k5NMLKm7m7L3L3O2O2K5K4m4m4n8n8j0rK8K8K8K8%jjjJ2
11811e34J2J2J3K4K4K5K4j1j1j0j1o5o6j6j6J7J8J8J8l6l6o5o5m2m3k7L2N9N8J4J3m4m5m4
11796h06m4k3k4K4K4L2Lj4M5Q4Q4L3k6k1k1K5K4M8M8jjk7k7LKJ3J2l6l7J8J8M7M7j9j8j9j9
11780e49L1L0L1L1j7j8j7j8k7k8K2K2L7L7j2j2J2J2j7j7m2m3j3j3jj%jQQQRkkjkj4j4j4j4
11763f11klllJ4J5J4J4n9n9n9n9ppqpJ2J1J2J2N4N3N4N3j0j1j0j1PPPOl4l5l5l5J7J7J7J7
11745f55qqpqL9L9RJ0o7o7n1QM6M6J%K0J9M9M9O4O4J5J6j0rj0rk5k4k5k5NNNNJKL1L0N6N6
11727c18K0l8q3q2n1QK2K3llj0rl9l9l5l6J3J3OOL6L5K9L0k0k0jjj%m3m2q8q7k8L0Q3Q2M2
$$ plain form
11710 -599 -615 -687 -758 -775 -791 -778 -765 -730 -694 -688 -681 -661 -641 -591 -541 -533 -524 -516 -507 -519 -531 -542 -554 -558 -561 -565 -568 -584 -599 -599 -540 -470 -400 -382 -422 -488 -553 -592 -631 -585
11693 -585 -539 -463 -388 -367 -347 -395 -444 -486 -528 -541 -554 -587 -621 -654 -688 -708 -728 -748 -768 -761 -754 -747 -740 -687 -633 -580 -527 -508 -490 -501 -512 -519 -525 -532 -539 -545 -550 -556 -562 -614
11676 -614 -667 -670 -673 -645 -616 -588 -559 -558 -556 -584 -612 -642 -673 -655 -637 -592 -547 -544 -589 -669 -749 -783 -816 -800 -783 -767 -750 -719 -687 -655 -623 -644 -665 -687 -708 -682 -657
11660 -657 -631 -606 -575 -545 -515 -484 -475 -465 -524 -583 -627 -670 -684 -698 -706 -714 -722 -730 -718 -705 -693 -681 -700 -718 -687 -657 -605 -554 -524 -543 -601 -658 -677 -647 -573 -499 -491
11644 -491 -482 -490 -498 -506 -514 -550 -586 -592 -598 -595 -592 -638 -684 -682 -679 -647 -616 -589 -563 -536 -510 -522 -534 -517 -500 -510 -519 -529 -539 -585 -632 -676 -672 -634 -596 -613 -680 -751 -793 -784 -775 -758
11625 -758 -712 -635 -559 -510 -491 -487 -483 -483 -513 -592 -671 -709 -698 -665 -632 -597 -562 -548 -584 -662 -741 -790 -810 -817 -825 -801 -777 -743 -709 -675 -641 -641 -642 -643 -643 -631 -619 -607 -595
11609 -595 -623 -650 -665 -651 -620 -589 -606 -623 -650 -677 -655 -633 -615 -597 -596 -566 -513 -460 -437 -414 -389 -394 -430 -465 -497 -500 -469 -439 -404 -368 -363 -387 -415 -415 -385 -355 -353
11592 -353 -380 -390 -400 -413 -426 -439 -451 -442 -433 -407 -410 -441 -471 -502 -532 -572 -583 -564 -544 -539 -564 -620 -676 -725 -745 -749 -724 -693 -661 -628 -595 -611 -628 -645 -661 -651 -641
$$ packed form
11710e99j6p2p1j7j6J3J3L5L6OPK0K0N0N0QRQRj2j2j1j2mlmlj6j5%N9P0P0J8m0o6o5l9l9M6
11693e85M6P6P5K1K0m8m9m2m2j3j3l3l4l3l4k0k0k0k0PPPPN3N4N3N3J9J8j1j1popponoon2
11676f14n3llK8K9K8K9JKk8k8l0l1J8J8M5M5Lm5q0q0l4l3J6J7J6J7L1L2L2L2k1k1k2k1K6K5
11660f57K6K5L1L0L0L1RJ0n9n9m4m3j4j4qqqqJ2J3J2J2j9j8L1L0N2N1L0j9n8n7j9L0P4P4Q
11644d91Rqqqql6l6ooLLm6m6KLL2L1K7K6K7K6j2j2J7J7j0rj0j0m6m7m4ML8L8j7o7p1m2RRJ7
11625g58M6P7P6M9J9MM%l0p9p9l8J1L3L3L5L5J4l6p8p9m9k0pqK4K4L4L4L4L4%jj%J2J2J2J2
11609e95k8k7j5J4L1L1j7j7k7k7K2K2J8J8JL0N3N3K3K3K5nl6l5l2lL1L0L5L6Nk4k8%L0L0K
11592c53k7j0j0j3j3j3j2RRK6ll1l0l1l0m0j1J9K0Nk5n6n6m9k0mK5L1L2L3L3j6j7j7j6J0J0
$$ plain form
11576 -641 -630 -620 -616 -612 -608 -603 -578 -553 -545 -507 -463 -419 -422 -425 -415 -406 -397 -388 -397 -407 -387 -367 -342 -318 -382 -446 -493 -541 -539 -538 -542 -547 -551 -556 -571 -586 -601 -616 -636 -657 -677 -698 -698
11558 -698 -697 -668 -638 -616 -593 -619 -645 -677 -709 -672 -635 -634 -633 -631 -579 -522 -465 -454 -442 -414 -385 -344 -331 -361 -440 -542 -644 -693 -742 -742 -742 -730 -719 -707 -695 -688 -681
11542 -681 -674 -667 -641 -615 -590 -564 -560 -557 -553 -550 -560 -571 -582 -592 -596 -599 -602 -606 -598 -591 -583 -576 -611 -646 -681 -716 -720 -724 -659 -595 -560 -524 -519 -513 -542 -571 -600 -629 -606 -584 -512 -441 -426
11523 -426 -411 -399 -386 -407 -457 -519 -531 -538 -545 -549 -552 -573 -594 -615 -636 -643 -649 -656 -662 -691 -719 -748 -777 -728 -679 -630 -581 -578 -576 -573 -571 -564 -556 -549 -542 -558 -573 -540 -507 -492 -478 -512
11505 -512 -546 -566 -586 -536 -487 -421 -354 -356 -358 -425 -491 -558 -624 -661 -698 -686 -674 -683 -691 -699 -707 -701 -695 -689 -684 -667 -651 -605 -559 -538 -517 -497 -476 -453 -430 -382 -383 -455 -557
11488 -557 -624 -642 -636 -629 -619 -610 -603 -597 -659 -721 -737 -753 -767 -781 -755 -701 -635 -618 -653 -688 -696 -704 -716 -728 -710 -692 -693 -694 -695 -697 -689 -681 -742 -803 -855 -907 -890 -873 -835 -796 -731
11470 -731 -666 -617 -618 -639 -661 -635 -608 -631 -653 -680 -706 -703 -699 -646 -593 -578 -612 -635 -609 -548 -517 -558 -599 -643 -686 -707 -728 -701 -673 -653 -632 -612 -592 -577 -563 -549
11455 -549 -535 -534 -533 -561 -590 -622 -654 -686 -718 -713 -708 -750 -793 -839 -856 -832 -759 -671 -633 -652 -670 -630 -589 -549 -508 -549 -589 -629 -670 -626 -583 -588 -593 -597 -601 -605 -609 -606 -602 -599 -595
$$ packed form
11576f41J1J0MMMNK5K5QL8M4M4llJ0RRRrj0K0K0K5K4o4o4m7m8KJmnmnj5j5j5j5k0k1k0k1%
11558f98JK9L0K2K3k6k6l2l2L7L7JJKN2N7N7J1J2K8K9M1J3l0p9j02j02m9m9%%J2J1J2J2PP
11542f81PPK6K6K5K6MLMLj0j1j1j0mllmQPQPl5l5l5l5mmO5O4L5L6NOk9k9k9k9K3K2P2P1J5
11523d26J5J2J3k1n0o2j2ppmlk1k1k1k1popok9k8k9k9M9M9M9M9LKLKPQPPj6j5L3L3J5J4l4
11505e12l4k0k0N0M9O6O7kko7o6o7o6l7l7J2J2rqqqOOONJ7J6M6M6K1K1K0K1K3K3M8jp2j02
11488e57o7j8OPJ0RPOo2o2j6j6j4j4K6N4O6J7l5l5qqj2j2J8J8jjjkQQo1o1n2n2J7J7L8L9O5
11470g31O5M9jk1k2K6K7k3k2k7k6LMN3N3J5l4k3K6O1L1m1m1m4m3k1k1K7K8K0K1K0K0J5J4J4
11455e49J4JJk8k9l2l2l2l2NNm2m3m6j7K4P3Q8L8j9j8M0M1M0M1m1m0m0m1M4M3nnmmmmLMLM
$$ plain form
11437 -595 -595 -594 -620 -645 -669 -643 -579 -515 -474 -482 -515 -577 -618 -659 -672 -686 -646 -606 -596 -586 -580 -575 -520 -466 -455 -444 -482 -520 -597 -674 -702 -730 -730 -730 -729 -729 -702 -675 -678
11420 -678 -680 -668 -656 -645 -633 -663 -693 -674 -655 -600 -546 -492 -437 -436 -435 -434 -433 -462 -491 -521 -550 -547 -544 -541 -538 -544 -550 -555 -561 -535 -510 -530 -550 -610 -621 -586 -581 -640 -729 -801 -825
11402 -825 -819 -813 -803 -794 -791 -787 -784 -780 -782 -784 -786 -787 -810 -833 -855 -878 -833 -789 -803 -817 -827 -838 -789 -741 -668 -595 -581 -567 -582 -598 -669 -740 -791 -793 -725 -656 -621 -587 -552 -517
11385 -517 -495 -473 -452 -430 -443 -456 -469 -482 -501 -519 -508 -496 -461 -426 -450 -474 -471 -469 -466 -463 -501 -539 -577 -615 -632 -650 -668 -685 -676 -667 -657 -648 -662 -676 -691 -705 -692 -679
11368 -679 -667 -654 -632 -611 -590 -568 -584 -599 -615 -630 -603 -576 -548 -521 -516 -510 -505 -500 -512 -523 -535 -546 -580 -614 -647 -681 -669 -657 -645 -634 -648 -663 -704 -744 -747 -700 -623
11352 -623 -545 -519 -494 -497 -501 -515 -529 -542 -556 -519 -483 -505 -527 -547 -566 -556 -546 -524 -502 -509 -516 -536 -557 -521 -486 -468 -499 -562 -625 -632 -640 -657 -704 -725 -698 -654 -639
11336 -639 -641 -644 -648 -652 -632 -613 -593 -573 -582 -591 -599 -608 -629 -650 -671 -692 -683 -674 -664 -655 -646 -637 -628 -618 -629 -639 -649 -660 -658 -656 -654 -652 -644 -635 -627 -619 -638 -657 -675 -694 -733 -772 -810 -849 -861
11317 -861 -873 -881 -890 -858 -777 -706 -666 -658 -649 -614 -578 -521 -464 -466 -468 -504 -541 -519 -497 -511 -524 -537 -550 -564 -577 -590 -603 -616 -628 -601 -545 -511 -527 -542 -509 -467 -454
$$ packed form
11437e95%Jk6k5k4K6O4O4M1ql3o2m1m1j3j4M0M0J0J0ONN5N4J1J1l8l8p7p7k8k8%%J%K7K7l
11420f78kJ2J2J1J2l0l0J9J9N5N4N4N5JJJJk9k9l0k9LLLLoonoK6K5k0k0o0j1L5Nn9q9p2k4
11402h25OOJ0RLMLMkkkjk3k3k2k3M5M4j4j4j0j1M9M8P3P3J4J4j5j6p1p1n1kO8O9L5L4L5L5
11385e17K2K2K1K2j3j3j3j3j9j8J1J2L5L5k4k4LKLLl8l8l8l8j7j8j8j7RRJ0Rj4j4j5j4J3J3
11368f79J2J3K2K1K1K2j6j5j6j5K7K7K8K7NONNj2j1j2j1l4l4l3l4J2J2J2J1j4j5m1m0lM7P7
11352f23P8K6K5lmj4j4j3j4L7L6k2k2k0j9J0J0K2K2ppk0k1L6L5J8l1o3o3pqj7m7k1K7M4J5
11336f39klmmK0J9K0K0rrqrk1k1k1k1RRJ0RRRRJ0j1j0j0j1KKKKQRQQj9j9j8j9l9l9l8l9j2
11317h61j2qrL2Q1P1M0QRL5L6N7N7kkl6l7K2K2j4j3j3j3j4j3j3j3j3j2K7N6L4j6j5L3M2J3
$$ plain form
11301 -454 -481 -507 -525 -543 -532 -521 -475 -430 -452 -523 -594 -616 -610 -604 -617 -629 -593 -557 -562 -566 -571 -576 -600 -623 -674 -676 -664 -652 -637 -622 -610 -597 -585 -573 -617 -662 -676 -691
11284 -691 -690 -688 -736 -784 -823 -863 -862 -811 -705 -599 -540 -480 -472 -464 -486 -508 -531 -555 -578 -602 -610 -618 -626 -634 -611 -588 -564 -541 -544 -548 -551 -555 -574 -594 -613 -632 -649 -666 -596 -527
11267 -527 -468 -438 -433 -477 -560 -643 -680 -717 -746 -774 -764 -704 -636 -598 -589 -580 -594 -607 -620 -633 -583 -533 -483 -433 -475 -516 -558 -599 -618 -638 -608 -578 -561 -543 -555 -567
11251 -567 -536 -504 -502 -500 -517 -533 -549 -566 -562 -558 -525 -491 -479 -467 -503 -540 -557 -573 -560 -518 -476 -484 -551 -618 -638 -659 -680 -700 -711 -722 -733 -743 -729 -715 -697 -680 -648
11235 -648 -567 -452 -366 -356 -414 -520 -627 -704 -732 -719 -706 -707 -709 -710 -711 -681 -652 -622 -592 -579 -567 -554 -542 -564 -587 -610 -632 -623 -614 -604 -595 -610 -624 -638 -653 -671
11220 -671 -689 -707 -726 -714 -702 -691 -679 -664 -649 -634 -618 -645 -671 -697 -723 -728 -732 -733 -734 -725 -667 -622 -607 -615 -652 -691 -700 -678 -656 -631 -607 -625 -642 -660 -677 -649 -620 -591
11203 -591 -562 -552 -543 -582 -651 -730 -761 -732 -704 -694 -685 -675 -666 -663 -659 -656 -653 -628 -603 -577 -552 -542 -533 -523 -514 -477 -441 -404 -368 -408 -449 -490 -531 -575 -620 -664 -709 -696 -682
11186 -682 -669 -656 -616 -575 -581 -588 -594 -570 -546 -552 -549 -547 -547 -546 -541 -536 -515 -523 -543 -563 -585 -607 -587 -567 -558 -579 -630 -652 -620 -560 -513 -467 -468 -469 -481 -492 -491 -460 -429 -399 -396 -393 -400
$$ packed form
11301d54k7k6j8j8J1J1M6M5k2p1p1k2OOj3j2L6L6nmnnk4k3n1kJ2J2J5J5J2J3J2J2m4m5j4j5
11284f91JKm8m8l9m0JN1J06J06N9O0QQk2k2k3k4k3k4qqqqK3K3K4K3lmlmj9k0j9j9j7j7P0O9
11267e27N9L0Nm4q3q3l7l7k9k8J0O0O8L8RRj4j3j3j3N0N0N0N0m2m1m2m1j9k0L0L0J7J8j2j2
11251e67L1L2KKj7j6j6j7MML3L4J2J2l6l7j7j6J3M2M2qo7o7k0k1k1k0j1j1j1j0J4J4J8J7L2
11235f48Q1J15Q6J0n8j06j07p7k8J3J3jkjjL0K9L0L0J3J2J3J2k2k3k3k2RRJ0Rj5j4j4j5j8
11220f71j8j8j9J2J2J1J2J5J5J5J6k7k6k6k6nmjjRN8M5J5ql7l9rK2K2K5K4j8j7j8j7K8K9K9
11203e91K9J0Rl9o9p9l1K9K8J0RJ0RLMLLK5K5K6K5J0RJ0RL7L6L7L6m0m1m1m1m4m5m4m5J3J4
11186f82J3J3M0M1opoK4K4oLK%JNNK1qk0k0k2k2K0K0Rk1n1k2L2O0M7M6jjj2j1JL1L1L0LLp
$$ plain form
11168 -400 -408 -415 -422 -443 -463 -437 -411 -396 -430 -465 -501 -515 -529 -525 -550 -593 -605 -588 -570 -569 -568 -566 -565 -544 -522 -501 -479 -462 -444 -428 -411 -368 -355 -374 -393 -435 -478 -521
11151 -521 -564 -553 -543 -532 -522 -522 -522 -522 -523 -486 -450 -413 -376 -378 -379 -364 -378 -430 -483 -553 -594 -605 -615 -623 -631 -640 -648 -656 -665 -647 -629 -613 -597 -615 -664 -696 -727 -733 -739 -759 -750 -692
11133 -692 -604 -534 -463 -439 -463 -507 -551 -562 -544 -525 -536 -567 -597 -629 -661 -620 -579 -538 -497 -455 -413 -419 -426 -479 -533 -537 -541 -520 -499 -478 -457 -433 -409 -385 -361 -378
11117 -378 -396 -413 -430 -455 -480 -505 -530 -498 -466 -434 -402 -445 -489 -532 -576 -672 -769 -805 -791 -776 -761 -714 -666 -646 -626 -606 -586 -556 -527 -497 -468 -465 -462 -459 -456 -461 -465
11101 -465 -499 -532 -582 -631 -632 -632 -628 -624 -649 -675 -671 -667 -662 -658 -636 -613 -591 -568 -587 -606 -578 -550 -483 -446 -451 -505 -562 -590 -588 -587 -586 -585 -612 -638 -686 -704 -661 -569 -476 -432 -449
11084 -449 -495 -562 -630 -678 -677 -620 -564 -534 -504 -537 -569 -602 -635 -638 -640 -641 -642 -613 -555 -486 -465 -470 -475 -434 -393 -424 -455 -487 -518 -528 -539 -549 -560 -517 -474 -500 -526 -578
11067 -578 -630 -633 -636 -648 -661 -674 -687 -635 -584 -532 -481 -492 -503 -513 -524 -581 -638 -656 -625 -576 -557 -567 -578 -576 -574 -572 -570 -523 -477 -488 -548 -603 -610 -597 -585 -572 -558 -545
11051 -545 -531 -566 -601 -636 -671 -696 -720 -745 -770 -729 -687 -646 -604 -601 -597 -593 -589 -564 -538 -512 -486 -502 -518 -534 -550 -544 -537 -531 -525 -523 -521 -520 -518 -563 -607 -649 -691 -695 -651 -616 -610
$$ packed form
11168d00qppk1k0K6K6J5l4l5l6j4j4Mk5m3j2J7J8JJKJK1K2K1K2J7J8J6J7M3J3j9j9m2m3m3
11151e21m3J1J0J1J0%%%jL7L6L7L7kjJ5j4n2n3p0m1j1j0qqrqqrJ8J8J6J6j8m9l2l1ook0RN8
11133f92Q8P0P1K4k4m4m4j1J8J9j1l1l0l2l2M1M1M1M1M2M2opn3n4mmK1K1K1K1K4K4K4K4j7
11117c78j8j7j7k5k5k5k5L2L2L2L2m3m4m3m4r6r7l6J4J5J5M7M8K0K0K0K0L0K9L0K9LLLLnm
11101d65l4l3n0m9j%MMk5k6MMNMK2K3K2K3j9j9K8K8O7L7nn4n7k8KJJJk7k6m8j8M3R2R3M4j7
11084d49m6o7o8m8JN7N6L0L0l3l2l3l3lkjjK9N8O9K1nnM1M1l1l1l2l1j0j1j0j1M3M3k6k6n2
11067e78n2llj2j3j3j3N2N1N2N1j1j1j0j1n7n7j8L1M9J9j0j1KKKKM7M6j1o0n5pJ3J2J3J4J3
11051e45J4l5l5l5l5k5k4k5k5M1M2M1M2LMMMK5K6K6K6j6j6j6j6OPOOKKJKm5m4m2m2mM4L5O
$$ plain form
11033 -610 -604 -569 -506 -472 -488 -504 -492 -451 -433 -465 -516 -568 -604 -641 -677 -714 -734 -754 -745 -735 -716 -698 -736 -824 -895 -916 -880 -844 -844 -844 -873 -903 -862 -821 -751 -681
11017 -681 -669 -657 -674 -692 -679 -665 -678 -691 -695 -650 -583 -517 -508 -500 -492 -483 -501 -518 -536 -553 -553 -554 -554 -554 -544 -534 -525 -515 -522 -529 -537 -544 -557 -571 -584 -597 -593 -588 -583 -579 -595 -611 -559
10999 -559 -479 -440 -470 -525 -581 -594 -559 -501 -444 -407 -370 -362 -354 -375 -396 -418 -439 -436 -432 -428 -425 -420 -415 -410 -406 -438 -470 -502 -534 -495 -457 -418 -379 -372 -366 -359 -352 -374 -396 -418 -440
10981 -440 -433 -427 -420 -413 -408 -404 -448 -492 -530 -567 -575 -583 -547 -510 -542 -575 -578 -582 -586 -590 -599 -608 -616 -625 -639 -652 -597 -542 -495 -448 -450 -452 -450 -447 -444 -441 -455 -469 -484 -498 -501 -504 -507 -510 -499 -488 -422
10960 -422 -356 -313 -329 -371 -413 -459 -504 -550 -596 -618 -640 -662 -685 -672 -660 -648 -636 -617 -598 -553 -508 -480 -511 -585 -629 -621 -614 -604 -595 -622 -649 -676 -703 -734 -765 -796
10945 -796 -826 -796 -766 -736 -706 -672 -639 -605 -571 -574 -576 -579 -581 -580 -579 -578 -577 -576 -576 -516 -457 -400 -343 -258 -172 -74 22 125 229 345 558 861 1193 1384 1320 1027
10929 1027 674 374 133 -40 -155 -231 -306 -378 -450 -448 -445 -442 -439 -442 -446 -449 -452 -455 -458 -462 -465 -485 -505 -525 -545 -499 -453 -406 -360 -378 -395 -412 -430 -440 -450 -460 -470
10913 -470 -459 -447 -436 -425 -410 -395 -380 -365 -368 -371 -375 -378 -323 -268 -239 -268 -323 -377 -406 -435 -432 -430 -427 -424 -452 -480 -508 -536 -527 -518 -509 -500 -500 -501 -502 -503 -515 -527 -539 -550 -504 -459
$$ packed form
11033f10OL5O3L4j6j6J2M1J8l2n1n2l6l7l6l7k0k0RJ0J9J8l8q8p1k1L6L6%%k9l0M1M1P0P0
11017f81J2J2j7j8J3J4j3j3mM5O7O6RQQRj8j7j8j7%j%%J0J0RJ0ppqpj3j4j3j3MNNMj6j6N2
10999e59Q0L9l0n5n6j3L5N8N7L7L7QQk1k1k2k1LMMLNNNMl2l2l2l2L9L8L9L9POPPk2k2k2k2
10981d40POPPNMm4m4l8l7qqL6L7l2l3lmmmrrqrj4j3N5N5M7M7kkKLLLj4j4j5j4llllJ1J1O6
10960d22O6M3j6m2m2m6m5m6m6k2k2k2k3J3J2J2J2J9J9M5M5K8l1p4m4QPJ0Rk7k7k7k7l1l1l1
10945g96l0L0L0L0L0L4L3L4L4lklkJJJJJ%O0N9N7N7Q5Q6R8R6J03J04J16K13L03L32J91o4k93
10929A027l53l00k41j73j15p6p5p2p2KLLLlmllllmlk0k0k0k0M6M6M7M6j8j7j7j8j0j0j0j0
10913d70J1J2J1J1J5J5J5J5llmlN5N5K9k9n5n4k9k9LKLLk8k8k8k8RRRR%jjjj2j2j2j1M6M5
$$ plain form
10895 -459 -442 -475 -528 -552 -555 -529 -494 -488 -493 -498 -479 -460 -470 -480 -543 -606 -665 -675 -641 -577 -511 -474 -482 -489 -529 -568 -581 -595 -569 -514 -463 -461 -525 -589 -640 -643 -614 -585
10879 -585 -568 -551 -534 -517 -501 -484 -467 -450 -464 -478 -492 -505 -532 -558 -584 -610 -653 -696 -738 -781 -794 -807 -761 -716 -646 -576 -565 -553 -542 -530 -548 -566 -555 -543
10864 -543 -474 -404 -409 -413 -448 -482 -512 -541 -571 -601 -611 -621 -602 -582 -551 -520 -548 -576 -592 -608 -624 -640 -665 -690 -655 -621 -553 -486 -449 -461 -493 -524 -557 -590 -634
10849 -634 -648 -649 -651 -653 -655 -600 -545 -514 -513 -535 -587 -651 -686 -658 -600 -548 -496 -472 -447 -440 -433 -426 -419 -414 -409 -405 -402 -396 -419 -425 -432 -442 -452 -444 -465 -484 -474 -482 -490 -508 -527 -545 -564 -571
10830 -571 -579 -587 -594 -618 -642 -623 -575 -537 -500 -490 -480 -482 -484 -487 -491 -528 -594 -641 -688 -700 -663 -636 -640 -645 -650 -657 -664 -634 -604 -576 -548 -541 -563 -584 -577 -576 -574 -571 -568 -580 -591 -603 -614
10811 -614 -614 -613 -612 -612 -620 -628 -637 -645 -641 -637 -633 -629 -632 -634 -636 -639 -641 -643 -646 -648 -678 -707 -734 -762 -754 -718 -697 -677 -639 -602 -564 -527 -490 -452 -418 -383 -396 -458 -492 -527 -527 -528 -529 -529 -544 -559 -572
10791 -572 -585 -557 -499 -431 -413 -476 -568 -643 -719 -786 -803 -790 -777 -762 -748 -734 -720 -685 -649 -673 -696 -715 -734 -724 -713 -690 -667 -587 -508 -491 -523 -544 -535 -518 -501
10775 -501 -541 -581 -617 -654 -632 -610 -568 -526 -484 -443 -438 -433 -428 -424 -436 -449 -461 -474 -457 -441 -425 -409 -439 -469 -528 -587 -596 -605 -554 -504 -521 -538 -554 -571 -554 -537 -519
$$ packed form
10895d59J7l3n3k4lK6L5OnnJ9J9j0j0o3o3n9j0L4O4O6L7qpm0l9j3j4K6N5N1Ko4o4n1lK9K9
10879e85J7J7J7J7J6J7J7J7j4j4j4j3k7k6k6k6m3m3m2m3j3j3M6M5P0P0J1J2J1J2j8j8J1J2
10864e43O9P0nml5l4l0k9l0l0j0j0J9K0L1L1k8k8j6j6j6j6k5k5L5L4O8O7L7j2l2l1l3l3m4
10849f34j4jkkkN5N5L1Jk2n2o4l5K8N8N2N2K4K5PPPPNNMLOk3opj0j0Qk1j9J0qqj8j9j8j9p
10830e71qqpk4k4J9M8L8L7J0J0kklml7o6m7m7j2L7K7mnnppL0L0K8K8Pk2k1PJKLLj2j1j2j1
10811f14%JJ%qqrqMMMMlkklkklkl0k9k7k8QL6K1K0L8L7L8L7L7L8L4L5j3o2l4l5%jj%j5j5j3
10791e72j3K8N8O8J8o3r2p5p6o7j7J3J3J5J4J4J4L5L6k4k3j9j9J0J1K3K3Q0P9J7l2k1RJ7J7
10775e01m0m0l6l7K2K2M2M2M2M1NNNMj2j3j2j3J7J6J6J6l0l0n9n9rrN1N0j7j7j6j7J7J7J8
$$ plain form
10759 -519 -502 -507 -512 -517 -522 -510 -499 -487 -475 -451 -428 -404 -380 -392 -403 -415 -427 -461 -495 -529 -563 -585 -607 -629 -651 -656 -661 -666 -671 -676 -681 -687 -692 -697 -702 -707 -712 -689 -666 -643 -620 -642
10741 -642 -664 -686 -708 -673 -639 -653 -668 -692 -715 -739 -763 -724 -684 -645 -605 -640 -675 -710 -745 -748 -751 -724 -698 -701 -705 -756 -807 -868 -899 -887 -825 -748 -671 -640 -609 -622
10725 -622 -635 -649 -662 -632 -601 -571 -541 -548 -555 -562 -569 -567 -565 -563 -561 -561 -561 -531 -502 -439 -376 -355 -382 -429 -476 -496 -516 -486 -456 -426 -396 -406 -416 -426 -436 -497 -558 -561 -515 -476
10708 -476 -487 -535 -583 -622 -661 -700 -739 -713 -687 -661 -635 -660 -685 -711 -736 -718 -700 -682 -664 -653 -642 -661 -679 -719 -758 -748 -738 -707 -675 -643 -611 -609 -606 -603 -600 -617
10693 -617 -633 -677 -672 -605 -538 -469 -399 -433 -467 -501 -535 -531 -528 -573 -619 -607 -596 -610 -624 -648 -613 -526 -439 -400 -420 -437 -453 -448 -443 -487 -530 -594 -657 -633 -608 -588 -569
10677 -569 -598 -627 -613 -599 -556 -512 -516 -521 -525 -529 -539 -549 -559 -568 -605 -642 -678 -715 -715 -715 -715 -715 -705 -695 -686 -676 -674 -671 -669 -667 -635 -602 -570 -538 -571 -604 -638 -671 -705 -739 -717
10659 -717 -637 -567 -498 -473 -449 -454 -460 -494 -529 -543 -557 -521 -486 -445 -404 -392 -381 -365 -349 -363 -376 -393 -409 -426 -442 -473 -504 -535 -565 -568 -571 -573 -576 -582 -589 -565 -542 -497
10642 -497 -452 -476 -500 -487 -474 -462 -449 -429 -408 -423 -497 -550 -604 -612 -620 -612 -603 -624 -645 -678 -711 -715 -719 -667 -615 -612 -609 -619 -628 -638 -647 -649 -650 -652 -654 -697 -740 -715 -690 -658 -627
$$ packed form
10759e19J7nnnnJ2J1J2J2K4K3K4K4j2j1j2j2l4l4l4l4k2k2k2k2nnnnnnonnnnnK3K3K3K3k2
10741f42k2k2k2L5L4j4j5k4k3k4k4L9M0L9M0l5l5l5l5llK7K6lmn1n1o1l1J2O2P7P7L1L1j3
10725f22j3j4j3L0L1L0L0ppppKKKK%%L0K9O3O3K1k7m7m7k0k0L0L0L0L0j0j0j0j0o1o1lM6L9
10708d76j1m8m8l9l9l9l9K6K6K6K6k5k5k6k5J8J8J8J8J1J1j9j8m0l9J0J0L1L2L2L2KLLLj7
10693f17j6m4NO7O7O9P0l4l4l4l4MLm5m6J2J1j4j4k4L5Q7Q7L9k0j7j6NNm4m3o4o3K4K5K0J9
10677e69k9k9J4J4M3M4mnmmj0j0j0rl7l7l6l7%%%%J0J0RJ0KLKKL2L3L2L2l3l3l4l3l4l4K2
10659g17Q0P0O9K5K4nol4l5j4j4L6L5M1M1J2J1J6J6j4j3j7j6j7j6l1l1l1l0llklopK4K3M5
10642d97M5k4k4J3J3J2J3K0K1j5p4n3n4qqQRk1k1l3l3mmN2N2LLj0rj0rkjkkm3m3K5K5L2L1
$$ plain form
10624 -627 -645 -663 -671 -678 -686 -694 -678 -662 -646 -630 -624 -618 -612 -606 -600 -594 -638 -681 -678 -675 -643 -610 -601 -591 -611 -631 -661 -690 -670 -650 -652 -654 -655 -657 -676 -695 -714 -733 -667 -602 -586 -570 -610
10606 -610 -650 -689 -727 -701 -645 -626 -655 -710 -735 -711 -688 -690 -692 -694 -697 -698 -700 -731 -762 -712 -662 -583 -503 -470 -437 -473 -509 -541 -573 -538 -503 -444 -415 -429 -491 -562 -603
10590 -603 -615 -626 -641 -656 -700 -744 -786 -828 -801 -773 -714 -654 -654 -702 -765 -798 -799 -770 -714 -658 -600 -542 -524 -506 -557 -607 -639 -670 -698 -726 -725 -676 -605 -534 -519 -504
10574 -504 -490 -475 -472 -468 -465 -461 -467 -472 -478 -484 -488 -493 -527 -560 -570 -579 -520 -461 -447 -433 -419 -405 -404 -402 -431 -459 -456 -454 -481 -507 -559 -611 -614 -617 -555 -492 -416 -369 -377 -434 -510 -556 -556 -526
10555 -526 -511 -496 -508 -520 -532 -544 -558 -572 -586 -600 -604 -609 -643 -678 -682 -686 -691 -695 -660 -625 -628 -680 -749 -768 -747 -696 -651 -606 -589 -571 -566 -560 -505 -451 -436 -421 -435 -450 -457
10538 -457 -464 -472 -479 -503 -526 -521 -515 -514 -513 -482 -451 -431 -410 -438 -466 -502 -537 -523 -480 -457 -483 -529 -575 -560 -544 -529 -514 -535 -557 -578 -600 -591 -581 -601 -621 -598 -574 -551
10522 -551 -528 -530 -532 -534 -536 -550 -564 -578 -593 -600 -607 -614 -621 -611 -601 -591 -581 -581 -580 -579 -578 -555 -532 -510 -487 -481 -476 -471 -466 -483 -499 -516 -533 -547 -561 -575 -589 -603 -617 -630 -644 -625
10504 -625 -606 -587 -568 -527 -487 -477 -466 -467 -468 -515 -562 -598 -585 -554 -523 -542 -609 -678 -747 -758 -769 -751 -733 -714 -696 -648 -600 -608 -617 -625 -634 -589 -544 -498 -453 -442 -430
$$ packed form
10624f27j8j8qpqqJ6J6J6J6OOOOOOm4m3LLL2L3RJ0k0k0l0k9K0K0kkjkj9j9j9j9O6O5J6J6m0
10606f10m0l9l8K6N6J9k9n5k5K4K3kkkljkl1l1N0N0P9Q0L3L3l6l6l2l2L5L5N9K9j4o2p1m1
10590f03j2j1j5j5m4m4m2m2K7K8N9O0%m8o3l3jK9N6N6N8N8J8J8n1n0l2l1k8k8JM9P1P1J5J5
10574e04J4J5LMLMonoomnl4l3j0rN9N9J4J4J4J4JKk9k8LKk7k6n2n2llO2O3P6M7qn7p6m6%L0
10555e26J5J5j2j2j2j2j4j4j4j4mnl4l5mmnmL5L5ln2o9j9K1N1M5M5J7J8NON5N4J5J5j4j5p
10538d57pqpk4k3NOJJL1L1K0K1k8k8l6l5J4M3K3k6m6m6J5J6J5J5k1k2k1k2RJ0k0k0K3K4K3
10522e51K3kkkkj4j4j4j5ppppJ0J0J0J0%JJJK3K3K2K3ONNNj7j6j7j7j4j4j4j4j4j4j3j4J9
10504f25J9J9J9M1M0J0J1jjm7m7l6J3L1L1j9o7o9o9j1j1J8J8J9J8M8M8qrqrM5M5M6M5J1J2
$$ plain form
10488 -430 -468 -505 -559 -613 -667 -720 -788 -855 -873 -892 -887 -883 -906 -880 -812 -744 -674 -603 -618 -632 -647 -661 -649 -636 -624 -611 -595 -580 -564 -548 -549 -551 -552 -553 -517 -480 -444
10471 -444 -408 -406 -405 -403 -402 -406 -410 -385 -359 -351 -342 -383 -453 -522 -541 -520 -500 -478 -456 -434 -412 -405 -399 -392 -386 -393 -400 -381 -362 -346 -379 -451 -522 -586 -600 -553 -476 -388 -330 -305 -310 -357
10453 -357 -404 -423 -443 -450 -457 -463 -470 -458 -446 -434 -422 -414 -407 -400 -392 -427 -461 -495 -529 -573 -617 -657 -697 -684 -623 -573 -554 -600 -676 -735 -745 -706 -667 -646 -675 -732 -789 -808
10437 -808 -777 -734 -690 -644 -597 -566 -535 -553 -570 -598 -625 -652 -679 -662 -646 -631 -617 -658 -729 -809 -839 -799 -728 -710 -740 -774 -759 -686 -614 -570 -526 -511 -497 -515
10422 -515 -533 -551 -569 -546 -522 -548 -573 -599 -625 -583 -540 -506 -471 -466 -461 -463 -464 -465 -466 -461 -455 -449 -443 -469 -495 -521 -547 -521 -495 -468 -442 -424 -406 -391 -375 -437 -530 -580 -571 -529
10405 -529 -488 -443 -398 -438 -479 -519 -559 -553 -547 -541 -535 -518 -501 -484 -468 -425 -383 -399 -415 -468 -521 -573 -626 -628 -631 -574 -518 -487 -457 -485 -514 -526 -537 -520 -502 -425 -348
10389 -348 -298 -307 -365 -452 -522 -592 -629 -607 -588 -569 -600 -631 -603 -575 -535 -495 -513 -532 -554 -577 -569 -562 -567 -572 -607 -642 -665 -689 -712 -736 -719 -703 -686 -669 -653 -636 -620
10373 -620 -603 -618 -632 -646 -661 -641 -621 -658 -695 -767 -809 -768 -667 -590 -573 -616 -660 -681 -702 -724 -745 -772 -800 -827 -854 -859 -864 -869 -874 -847 -819 -821 -823 -799 -776 -695 -615
$$ packed form
10488d30l8l7n4n4n4n3o8o7j8j9NMk3K6O8O8P0P1j5j4j5j4J2J3J2J3J6J5J6J6jkjjL6L7L6
10471d44L6KJKJmmK5K6QRm1p0o9j9K1K0K2K2K2K2POPOppJ9J9J6l3p2p1o4j4M7P7Q8N8K5nm7
10453c57m7j9k0ppopJ2J2J2J2QPPQl5l4l4l4m4m4m0m0J3O1N0J9m6p6n9j0L9L9K1k9n7n7j9
10437h08L1M3M4M6M7L1L1j8j7k8k7k7k7J7J6J5J4m1p1q0l0M0P1J8l0l4J5P3P2M4M4J5J4j8
10422e15j8j8j8K3K4k6k5k6k6M2M3L4L5NNkjjjNOOOk6k6k6k6K6K6K7K6J8J8J5J6o2r3n0RM2
10405e29M1M5M5m0m1m0m0OOOOJ7J7J7J6M3M2j6j6n3n3n2n3klN7N6L1L0k8k9j2j1J7J8P7P7
10389c48N0rn8q7p0p0l7K2J9J9l1l1K8K8M0M0j8j9k2k3QPnnl5l5k3k4k3k4J7J6J7J7J6J7J6
10373f20J7j5j4j4j5K0K0l7l7p2m2M1J01P7J7m3m4k1k1k2k1k7k8k7k7nnnnK7K8kkK4K3Q1Q0
$$ plain form
10357 -615 -537 -488 -448 -468 -524 -581 -616 -591 -577 -562 -574 -585 -594 -604 -584 -564 -566 -568 -570 -572 -545 -518 -551 -583 -611 -639 -637 -636 -602 -567 -533 -499 -472 -445 -443 -500 -584 -668
10340 -668 -729 -732 -696 -660 -650 -640 -572 -504 -461 -478 -531 -585 -643 -700 -747 -793 -813 -775 -691 -606 -577 -548 -537 -526 -545 -563 -512 -462 -411 -360 -383 -406 -429 -452 -467
10325 -467 -481 -495 -510 -480 -450 -478 -507 -538 -568 -540 -512 -500 -488 -506 -523 -548 -572 -596 -621 -629 -638 -647 -655 -662 -669 -617 -565 -564 -563 -591 -619 -596 -572 -548 -524 -509 -494 -478
10308 -478 -463 -455 -448 -440 -432 -456 -480 -505 -529 -567 -605 -642 -680 -738 -795 -826 -799 -742 -684 -682 -680 -688 -697 -675 -654 -643 -632 -593 -554 -539 -553 -551 -549 -534 -520 -505 -491 -501 -512
10292 -512 -522 -532 -530 -527 -527 -526 -515 -533 -600 -667 -701 -685 -649 -612 -580 -548 -516 -484 -446 -408 -372 -335 -290 -274 -311 -347 -373 -400 -426 -453 -480 -507 -551 -565 -559 -553 -545 -538
10275 -538 -553 -568 -584 -599 -625 -650 -674 -698 -705 -682 -646 -610 -591 -572 -603 -633 -657 -681 -675 -669 -646 -623 -601 -578 -549 -520 -474 -458 -502 -545 -590 -635 -660 -685 -726 -738
10259 -738 -710 -682 -652 -622 -608 -594 -563 -562 -564 -567 -571 -575 -592 -610 -614 -589 -572 -554 -567 -610 -661 -712 -762 -812 -886 -911 -877 -843 -820 -826 -831 -806 -761 -686 -610 -563 -561 -559 -543
10243 -543 -556 -582 -607 -634 -662 -709 -756 -754 -753 -722 -691 -661 -630 -619 -608 -597 -586 -597 -609 -620 -631 -646 -661 -676 -691 -712 -733 -706 -680 -688 -725 -774 -774 -710 -647 -584
$$ packed form
10357f15P8M9M0k0n6n7l5K5J4J5j2j1rj0K0K0kkkkK7K7l3l2k8k8KJL4L5L4L4K7K7Kn7q4q4
10340f68o1lL6L6J0J0O8O8M3j7n3n4n8n7m7m6k0L8Q4Q5K9K9J1J1j9j8N1N0N1N1k3k3k3k3j5
10325d67j4j4j5L0L0k8k9l1l0K8K8J2J2j8j7k5k4k4k5qrrqppN2N2JJk8k8K3K4K4K4J5J5J6
10308d78J5QPQQk4k4k5k4l8l8l7l8n8n7l1K7N7N8KKqrK2K1J1J1L9L9J5j4KKJ5J4J5J4j0j1
10292e12j0j0KL%JJ1j8o7o7l4J6L6L7L2L2L2L2L8L8L6L7M5J6l7l6k6k7k6k7k7k7m4j4OOQP
10275e38j5j5j6j5k6k5k4k4pK3L6L6J9J9l1l0k4k4OOK3K3K2K3K9K9M6J6m4m3m5m5k5k5m1j2
10259g38K8K8L0L0J4J4L1Jklmmj7j8mK5J7J8j3m3n1n1n0n0p4k5L4L4K3onK5M5P5P6M7KKJ6
10243e43j3k6k5k7k8m7m7KJL1L1L0L1J1J1J1J1j1j2j1j1j5j5j5j5k1k1K7K6ql7m9%O4O3O3
$$ plain form
10227 -584 -521 -499 -527 -572 -588 -569 -550 -578 -607 -640 -673 -657 -641 -637 -633 -629 -625 -606 -587 -590 -642 -713 -783 -796 -759 -696 -633 -567 -501 -474 -447 -420 -394 -392 -389 -436 -483 -515
10211 -515 -547 -578 -610 -645 -680 -714 -749 -726 -702 -678 -655 -641 -628 -585 -542 -531 -520 -559 -597 -661 -724 -777 -761 -697 -633 -623 -662 -684 -676 -688 -699 -729 -758 -766 -725
10195 -725 -623 -522 -485 -516 -571 -595 -571 -517 -448 -409 -403 -426 -472 -517 -565 -612 -596 -580 -564 -548 -573 -599 -622 -644 -635 -577 -547 -517 -510 -504 -497 -491 -511 -530 -566 -573 -545
10179 -545 -517 -487 -457 -462 -468 -473 -478 -496 -514 -532 -549 -546 -543 -540 -537 -543 -549 -538 -557 -603 -649 -713 -748 -738 -729 -717 -705 -696 -686 -675 -664 -638 -583 -517 -451 -415 -409 -438 -496 -553 -610
10162 -610 -655 -671 -661 -650 -665 -680 -678 -647 -615 -613 -614 -615 -618 -621 -622 -623 -624 -625 -623 -621 -609 -566 -505 -474 -495 -546 -584 -621 -658 -694 -707 -671 -615 -559 -546 -561 -588 -614 -641 -638 -622
10144 -622 -607 -603 -598 -624 -649 -672 -696 -690 -684 -690 -696 -719 -712 -703 -693 -682 -671 -665 -658 -651 -644 -643 -643 -613 -583 -607 -632 -625 -590 -549 -538 -538 -538 -541 -544 -596 -648 -662 -676 -690 -705 -676 -647 -618
10125 -618 -589 -548 -507 -466 -425 -446 -466 -487 -508 -487 -466 -445 -424 -425 -425 -425 -426 -436 -447 -458 -468 -472 -476 -529 -582 -576 -569 -533 -497 -469 -441 -434 -476 -543 -610 -619 -579 -544 -510
10108 -510 -521 -532 -552 -572 -591 -611 -617 -622 -627 -633 -650 -668 -686 -703 -730 -757 -781 -805 -792 -730 -679 -658 -632 -606 -582 -558 -561 -565 -568 -571 -611 -652 -692 -733 -753 -774 -794 -815
$$ packed form
10227e84O3K2k8m5j6J9J9k8k9l3l3J6J6MMMMJ9J9ln2p1p0j3L7O3O3O6O6K7K7K7K6KLm7m7l2
10211e15l2l1l2l5l5l4l5K3K4K4K3J4J3M3M3J1J1l9l8o4o3n3J6O4O4J0l9k2Qj2j1l0k9qM1
10195g25J02J01L7l1n5k4K4N4O9L9Ok3m6m5m8m7J6J6J6J6k5k6k3k2RN8L0L0POPOk0j9l6pK8
10179e45K8L0L0nonnj8j8j8j7LLLLooJ1j9m6m6o4l5J0RJ2J2RJ0J1J1K6N5O6O6L6Ok9n8n7n7
10162f10m5j6J0J1j5j5KL1L2KjjlljjjjKKJ2M3O1L1k1n1l8l7l7l6j3L6N6N6J3j5k7k6k7LJ6
10144f22J5MNk6k5k3k4OOook3PRJ0J1J1OPPPJ%L0L0k4k5PL5M1J1%%lln2n2j4j4j4j5K9K9K9
10125f18K9M1M1M1M1k1k0k1k1K1K1K1K1j%%jj0j1j1j0mmn3n3OPL6L6K8K8Pm2o7o7rM0L5L4
10108e10j1j1k0k0j9k0onnoj7j8j8j7k7k7k4k4J3O2N1K1K6K6K4K4lmllm0m1m0m1k0k1k0k1
$$ plain form
10091 -815 -794 -773 -703 -633 -576 -519 -491 -464 -464 -465 -495 -524 -543 -561 -579 -597 -611 -625 -570 -515 -477 -438 -449 -460 -486 -512 -508 -505 -470 -435 -399 -364 -356 -348 -339 -331 -340 -349 -360
10074 -360 -370 -394 -447 -501 -524 -508 -492 -517 -571 -620 -670 -736 -773 -762 -722 -681 -668 -689 -710 -747 -755 -723 -662 -588 -563 -579 -595 -614 -634 -621 -609 -596 -583 -543 -502
10059 -502 -464 -427 -373 -367 -431 -494 -537 -549 -577 -604 -653 -673 -651 -629 -622 -616 -626 -607 -562 -517 -512 -537 -549 -561 -574 -588 -604 -619 -651 -654 -638 -622 -604 -587 -576 -566 -556
10043 -556 -545 -525 -505 -486 -468 -441 -444 -489 -535 -564 -593 -620 -647 -657 -638 -636 -634 -612 -590 -551 -542 -571 -600 -647 -665 -633 -601 -551 -530 -544 -558 -574 -590 -596 -602 -608 -613 -628
10027 -628 -642 -657 -671 -669 -667 -624 -552 -497 -472 -487 -502 -537 -572 -607 -641 -648 -655 -661 -668 -645 -622 -600 -577 -593 -610 -567 -525 -452 -379 -377 -424 -460 -496 -536 -575 -588 -601 -614
10010 -614 -628 -570 -512 -457 -402 -393 -433 -463 -462 -449 -435 -478 -522 -545 -568 -591 -614 -629 -643 -658 -672 -707 -741 -776 -811 -783 -755 -729 -702 -621 -570 -608 -696 -749 -752 -728
9995 -728 -703 -710 -716 -723 -729 -736 -742 -749 -755 -713 -671 -687 -704 -684 -663 -643 -623 -608 -593 -633 -674 -705 -687 -638 -589 -604 -618 -633 -647 -658 -669 -679 -690 -677 -664 -650 -637 -592 -547
9978 -547 -501 -456 -423 -389 -355 -322 -335 -348 -361 -374 -395 -415 -436 -457 -417 -378 -398 -417 -430 -443 -456 -469 -494 -519 -544 -570 -600 -630 -602 -573 -553 -532 -512 -491 -478
$$ packed form
10091h15K1K1P0P0N7N7K8K7%jl0k9j9j8j8j8j4j4N5N5L8L9j1j1k6k6MLL5L5L6L5QQRQrrj1
10074c60j0k4n3n4k3J6J6k5n4m9n0o6l7J1M0M1J3k1k1l7qL2O1P4K5j6j6j9k0J3J2J3J3M0M1
10059e02L8L7N4Oo4o3m3j2k8k7m9k0K2K2POj0J9M5M5Nk5j2j2j3j4j6j5l2lJ6J6J8J7J1J0J0
10043e56J1K0K0J9J8K7lm5m6k9k9k7k7j0J9KKK2K2L9Rk9k9m7j8L2L2N0K1j4j4j6j6ooonj5
10027f28j4j5j4KKM3P2N5K5j5j5l5l5l5l4ppopK3K3K2K3j6j7M3M2P3P3Km7l6l6m0l9j3j3j3
10010f14j4N8N8N5N5Rm0l0JJ3J4m3m4k3k3k3k3j5j4j5j4l5l4l5l5K8K8K6K7Q1N1l8q8n3lK4
9995g28K5popopopoM2M2j6j7K0K1K0K0J5J5m0m1l1J8M9M9j5j4j5j4j1j1j0j1J3J3J4J3M5M5
9978e47M6M5L3L4L4L3j3j3j3j3k1k0k1k1M0L9k0j9j3j3j3j3k5k5k5k6l0l0K8K9K0K1K0K1J3
$$ plain form
9963 -478 -464 -452 -489 -556 -624 -665 -707 -718 -730 -693 -655 -601 -547 -534 -571 -626 -681 -690 -700 -700 -701 -653 -604 -583 -562 -590 -618 -598 -578 -558 -538 -572 -606 -640 -674 -701
9947 -701 -728 -706 -655 -631 -656 -701 -745 -785 -825 -817 -740 -641 -571 -551 -562 -593 -624 -607 -591 -572 -552 -562 -572 -558 -544 -559 -574 -560 -546 -532 -518 -516 -515 -579 -643 -657
9931 -657 -622 -568 -543 -557 -571 -616 -661 -741 -821 -879 -889 -855 -821 -784 -747 -770 -794 -817 -840 -853 -866 -850 -833 -814 -795 -776 -757 -701 -645 -638 -631 -650 -670 -689 -709 -689
9916 -689 -670 -622 -573 -530 -486 -491 -497 -532 -568 -603 -639 -620 -600 -551 -503 -495 -487 -544 -602 -642 -623 -588 -553 -556 -559 -611 -664 -713 -762 -743 -724 -687 -650 -613 -576 -568 -559 -547 -594
9899 -594 -675 -756 -767 -720 -655 -619 -615 -641 -685 -730 -727 -724 -711 -697 -683 -670 -675 -681 -686 -691 -678 -664 -651 -637 -626 -614 -602 -591 -583 -576 -598 -620 -605 -590 -575 -560 -502 -443 -414
9882 -414 -385 -373 -361 -398 -436 -445 -453 -462 -471 -448 -425 -402 -379 -388 -397 -435 -474 -524 -575 -596 -617 -612 -607 -602 -597 -578 -559 -540 -520 -548 -576 -604 -633 -615 -598 -610 -622 -669 -715 -733
9865 -733 -750 -761 -772 -734 -696 -650 -603 -626 -648 -628 -607 -633 -658 -667 -618 -571 -582 -627 -702 -765 -770 -737 -675 -609 -573 -572 -572 -574 -575 -567 -558 -549 -540 -539 -538 -536 -535 -550 -566 -581 -597 -602
9846 -602 -607 -612 -617 -653 -690 -677 -665 -598 -531 -480 -487 -535 -582 -603 -625 -629 -634 -638 -642 -654 -666 -677 -689 -722 -756 -720 -685 -665 -645 -626 -606 -595 -583 -572 -560 -559 -557 -555 -554 -540 -525
$$ packed form
9963d78J4J2l7o7o8m1m2j1j2L7L8N4N4J3l7n5n5rj0%jM8M9K1K1k8k8K0K0K0K0l4l4l4l4k7
9947g01k7K2N1K4k5m5m4m0m0QP7R9P0K0j1l1l1J7J6J9K0j0j0J4J4j5j5J4J4J4J4KJo4o4j4
9931f57L5N4K5j4j4m5m5q0q0n8j0L4L4L7L7k3k4k3k3j3j3J6J7J9J9J9J9N6N6PPj9k0j9k0K0
9916f89J9M8M9M3M4nol5l6l5l6J9K0M9M8QQn7n8m0J9L5L5lln2n3m9m9J9J9L7L7L7L7QRJ2m7
9899e94q1q1j1M7O5L6Mk6m4m5LLJ3J4J4J3nonnJ3J4J3J4J1J2J2J1QPk2k2J5J5J5J5N8N9K9
9882d14K9J2J2l7l8rqrrK3K3K3K3rrl8l9n0n1k1k1NNNNJ9J9J9K0k8k8k8k9J8J7j2j2m7m6j8
9865g33j7j1j1L8L8M6M7k3k2K0K1k6k5rM9M7j1m5p5o3nL3O2O6L6J%kjQRRRJJKJj5j6j5j6n
9846f02nnnl6l7J3J2O7O7N1pm8m7k1k2mnmmj2j2j1j2l3l4L6L5K0K0J9K0J1J2J1J2JKKJJ4J5
$$ plain form
9829 -525 -478 -489 -548 -607 -634 -602 -580 -559 -534 -509 -522 -535 -549 -562 -546 -529 -513 -496 -547 -598 -634 -610 -586 -562 -563 -565 -562 -559 -585 -612 -618 -625 -601 -578 -586 -593 -600 -607 -586 -564
9811 -564 -543 -521 -534 -546 -559 -572 -597 -622 -558 -495 -448 -401 -423 -445 -524 -603 -646 -630 -609 -589 -564 -540 -490 -441 -441 -441 -472 -503 -533 -564 -571 -578 -584 -591 -544 -497 -450 -404
9795 -404 -403 -403 -403 -403 -421 -440 -459 -477 -454 -431 -408 -385 -398 -412 -425 -438 -445 -452 -458 -465 -500 -536 -523 -510 -507 -504 -501 -498 -556 -614 -672 -729 -744 -758 -726 -625 -494 -412 -391 -400
9777 -400 -441 -511 -583 -625 -627 -630 -630 -631 -595 -559 -571 -584 -567 -549 -580 -611 -660 -708 -708 -707 -695 -682 -699 -716 -733 -751 -739 -727 -722 -718 -713 -708 -685 -661 -637 -614 -599 -585 -571 -556
9760 -556 -582 -608 -633 -659 -641 -624 -656 -687 -725 -762 -750 -738 -772 -807 -812 -816 -785 -754 -722 -691 -674 -658 -671 -684 -707 -730 -704 -679 -603 -527 -473 -468 -523 -579 -608 -637
9745 -637 -636 -636 -665 -693 -719 -745 -702 -659 -624 -590 -614 -639 -633 -628 -622 -616 -657 -698 -739 -780 -791 -801 -811 -822 -804 -787 -730 -645 -575 -563 -576 -588 -553 -517 -482 -447 -448 -450 -451
9728 -451 -453 -498 -543 -530 -516 -480 -443 -406 -369 -377 -385 -393 -401 -415 -429 -443 -457 -528 -598 -606 -555 -515 -505 -533 -561 -569 -577 -585 -593 -569 -545 -521 -498 -517 -536 -497 -457 -417 -378 -397
9710 -397 -416 -422 -427 -432 -438 -460 -483 -505 -528 -583 -639 -671 -644 -586 -557 -567 -576 -556 -536 -555 -603 -614 -567 -537 -538 -563 -588 -556 -524 -473 -423 -373 -322 -348 -374 -400 -426 -445
$$ packed form
9829e25M7j1n9n9k7L2K2K1K5K5j3j3j4j3J6J7J6J7n1n1l6K4K4K4jkLLk6k7opK4K3qpppK1K2
9811e64K1K2j3j2j3j3k5k5O4O3M7M7k2k2p9p9m3J6K1K0K5K4N0M9%%l1l1l0l1ppopM7M7M7M6
9795d04J%%%j8j9j9j8K3K3K3K3j3j4j3j3ppopl5l6J3J3LLLLn8n8n8n7j5j4L2J01J31Q2K1r
9777d00m1p0p2m2kl%jL6L6j2j3J7J8l1l1m9m8%JJ2J3j7j7j7j8J2J2NMNNK3K4K4K3J5J4J4J5
9760e56k6k6k5k6J8J7l2l1l8l7J2J2l4l5nmL1L1L2L1J7J6j3j3k3k3K6K5P6P6N4Nn5n6k9k9
9745f37J%k9k8k6k6M3M3L5L4k4k5ONOOm1m1m1m1j1j0j0j1J8J7N7Q5P0J2j3j2L5L6L5L5jkj
9728d51km5m5J3J4L6L7L7L7qqqqj4j4j4j4p1p0qN1M0J0k8k8qqqqK4K4K4K3j9j9L9M0M0L9j9
9710c97j9onnok2k3k2k3n5n6l2K7N8K9j0rK0K0j9m8j1M7L0jk5k5L2L2N1N0N0N1k6k6k6k6j9
$$ plain form
9694 -445 -463 -482 -501 -522 -544 -565 -587 -582 -576 -571 -566 -597 -628 -656 -683 -667 -591 -516 -499 -518 -537 -560 -582 -605 -627 -650 -672 -672 -671 -671 -671 -669 -668 -725 -782 -786 -790 -794 -798 -749 -700 -651
9676 -651 -602 -633 -664 -695 -727 -713 -698 -684 -670 -684 -698 -653 -608 -596 -584 -572 -561 -546 -531 -516 -502 -535 -568 -601 -634 -664 -694 -665 -636 -633 -630 -627 -624 -611 -598 -584 -571
9660 -571 -525 -478 -491 -503 -543 -583 -623 -663 -708 -753 -739 -726 -701 -677 -653 -629 -615 -600 -645 -689 -671 -653 -635 -616 -618 -619 -565 -510 -469 -477 -487 -448 -375 -331 -338 -394 -462
9644 -462 -530 -601 -672 -681 -691 -642 -593 -557 -521 -486 -450 -463 -477 -546 -615 -643 -621 -611 -630 -659 -688 -660 -631 -585 -539 -493 -446 -384 -321 -289 -307 -321 -334 -351 -368
9628 -368 -407 -446 -485 -523 -525 -526 -500 -425 -345 -333 -397 -491 -549 -558 -538 -518 -520 -523 -525 -527 -537 -546 -497 -447 -443 -439 -435 -431 -433 -435 -436 -438 -428 -417 -405 -392 -370 -319 -257 -243 -281 -320 -361
9610 -361 -402 -430 -457 -485 -512 -528 -543 -558 -573 -591 -609 -627 -644 -682 -720 -729 -737 -769 -801 -775 -748 -711 -673 -636 -599 -618 -638 -657 -676 -688 -700 -711 -723 -718 -713 -708 -703 -676
9593 -676 -649 -622 -594 -598 -602 -605 -609 -591 -572 -554 -535 -517 -499 -482 -464 -433 -402 -401 -399 -401 -403 -464 -525 -591 -657 -664 -672 -628 -585 -600 -615 -610 -605 -571 -536 -505 -474 -444 -413 -436 -460
9575 -460 -484 -507 -518 -528 -538 -548 -559 -569 -579 -590 -598 -606 -614 -623 -595 -568 -554 -569 -610 -652 -637 -621 -627 -633 -612 -590 -569 -578 -599 -621 -594 -567 -542 -517 -525 -562 -583 -603 -626
$$ packed form
9694d45j8j9j9k1k2k1k2NONNl1l1k8k7J6P6P5J7j9j9k3k2k3k2k3k2%J%%KJn7n7mmmmM9M9M9
9676f51M9l1l1l1l2J4J5J4J4j4j4M5M5J2J2J2J1J5J5J5J4l3l3l3l3l0l0K9K9LLLLJ3J3J4J3
9660e71M6M7j3j2m0m0m0m0m5m5J4J3K5K4K4K4J4J5m5m4J8J8J8J9kjN4N5M1qj0L9P3M4pn6o8
9644d62o8p1p1rj0M9M9L6L6L5L6j3j4o9o9k8K2J0j9k9k9K8K9M6M6M6M7O2O3L2j8j4j3j7j7
9628c68l9l9l9l8kjK6P5Q0J2o4r4n8rK0K0klkkj0rM9N0MMMMkkjkJ0J1J2J3K2N1O2J4l8l9m1
9610c61m1k8k7k8k7j6j5j5j5j8j8j8j7l8l8rql2l2K6K7L7L8L7L7j9k0j9j9j2j2j1j2NNNNK7
9593f76K7K7K8mmlmJ8J9J8J9J8J8J7J8L1L1JKkko1o1o6o6pqM4M3j5j5NNL4L5L1L1L0L1k3k4
9575d60k4k3j1j0j0j0j1j0j0j1qqqrK8K7J4j5m1m2J5J6ooK1K2K1rk1k2K7K7K5K5ql7k1k0k3
$$ plain form
9559 -626 -648 -669 -690 -703 -687 -687 -688 -660 -631 -603 -574 -557 -539 -521 -503 -485 -468 -450 -432 -417 -402 -387 -372 -379 -387 -394 -401 -407 -413 -419 -425 -455 -484 -525 -594 -644 -664 -644 -624 -624
9541 -624 -625 -596 -567 -548 -529 -483 -438 -422 -456 -520 -585 -618 -650 -680 -709 -723 -687 -652 -666 -711 -756 -762 -739 -722 -705 -702 -671 -616 -561 -488 -444 -461 -477 -494 -511 -518 -496
9525 -496 -433 -371 -325 -309 -308 -306 -319 -362 -418 -473 -506 -538 -583 -658 -734 -810 -839 -868 -843 -819 -745 -672 -630 -588 -546 -504 -520 -536 -553 -569 -571 -573 -575 -577 -562 -547 -532 -517
9509 -517 -508 -499 -490 -481 -519 -556 -594 -632 -634 -637 -639 -642 -658 -675 -672 -620 -553 -515 -546 -606 -643 -631 -599 -568 -566 -564 -563 -561 -549 -537 -525 -513 -525 -538 -550 -563 -529 -495 -461 -426 -438
9491 -438 -450 -462 -474 -486 -498 -510 -522 -566 -610 -653 -697 -655 -613 -570 -528 -489 -449 -409 -370 -411 -453 -494 -535 -535 -535 -535 -535 -552 -569 -586 -603 -598 -593 -588 -583 -530 -477 -445 -462
9474 -462 -503 -544 -559 -574 -557 -541 -494 -448 -430 -412 -443 -474 -493 -512 -531 -550 -584 -618 -652 -686 -678 -670 -633 -596 -549 -502 -503 -505 -531 -557 -553 -550 -563 -577 -591 -604 -613 -622 -631
9457 -631 -639 -653 -667 -651 -606 -577 -597 -637 -676 -664 -651 -637 -623 -585 -517 -468 -468 -502 -535 -523 -511 -486 -462 -437 -413 -461 -510 -558 -606 -651 -695 -740 -784 -767 -750 -733
9442 -733 -716 -682 -648 -613 -579 -541 -503 -465 -427 -421 -415 -409 -402 -390 -377 -364 -351 -350 -349 -378 -407 -419 -432 -395 -358 -357 -355 -383 -411 -465 -518 -586 -624 -614 -555 -507 -488 -511 -563
$$ packed form
9559f26k2k1k1j3J6%jK8K9K8K9J7J8J8J8J8J7J8J8J5J5J5J5pqppooool0k9m1o9n0k0K0K0%
9541f24jK9K9J9J9M6M5J6l4o4o5l3l2l0k9j4L6L5j4m5m5oK3J7J7LL1N5N5P3M4j7j6j7j7pK2
9525d96O3O2M6J6JKj3m3n6n5l3l2m5p5p6p6k9k9K5K4P4P3M2M2M2M2j6j6j7j6kkkkJ5J5J5J5
9509e17RRRRl8l7l8l8klklj6j7LN2O7L8l1o0l7J2L2L1KKJKJ2J2J2J2j2j3j2j3L4L4L4L5j2
9491d38j2j2j2j2j2j2j2m4m4m3m4M2M2M3M2L9M0M0L9m1m2m1m1%%%%j7j7j7j7NNNNN3N3L2j7
9474d62m1m1j5j5J7J6M7M6J8J8l1l1j9j9j9j9l4l4l4l4QQL7L7M7M7jkk6k6MLj3j4j4j3rrr
9457f31qj4j4J6M5K9k0m0l9J2J3J4J4L8O8M9%l4l3J2J2K5K4K5K4m8m9m8m8m5m4m5m4J7J7J7
9442g33J7L4L4L5L4L8L8L8L8OOOPJ2J3J3J3JJk9k9j2j3L7L7JKk8k8n4n3o8l8J0N9M8J9k3n2
$$ plain form
9425 -563 -601 -638 -617 -595 -573 -551 -578 -605 -632 -659 -644 -630 -586 -542 -520 -499 -527 -554 -602 -650 -698 -746 -759 -772 -756 -740 -760 -779 -741 -654 -583 -562 -579 -595 -595
9409 -595 -594 -594 -593 -565 -537 -538 -539 -569 -598 -579 -559 -548 -536 -525 -514 -510 -506 -502 -498 -482 -466 -499 -532 -586 -640 -694 -748 -739 -730 -672 -614 -551 -488 -466 -493 -547 -601 -590 -578 -558
9392 -558 -538 -518 -498 -529 -560 -590 -621 -620 -618 -617 -616 -590 -563 -537 -511 -547 -583 -618 -654 -677 -699 -653 -607 -591 -574 -587 -600 -568 -536 -505 -473 -510 -546 -582 -619 -626 -633 -641
9376 -641 -648 -617 -587 -585 -584 -618 -653 -648 -594 -514 -465 -467 -499 -530 -561 -564 -567 -565 -563 -610 -686 -760 -786 -732 -649 -580 -542 -534 -526 -549 -573 -626 -680 -683 -686 -689 -692 -670 -649 -629 -610 -638
9357 -638 -695 -717 -689 -637 -614 -620 -626 -606 -586 -595 -605 -606 -607 -637 -667 -683 -698 -714 -729 -739 -748 -757 -767 -744 -721 -699 -676 -624 -572 -520 -467 -437 -407 -426 -445 -500 -556 -582
9341 -582 -608 -591 -574 -586 -598 -632 -665 -698 -732 -704 -676 -648 -621 -603 -586 -617 -649 -619 -590 -560 -530 -546 -561 -606 -680 -764 -800 -776 -722 -701 -709 -716 -693 -641 -588 -533
9325 -533 -479 -504 -530 -555 -581 -547 -513 -479 -445 -446 -446 -476 -506 -527 -548 -520 -492 -472 -452 -462 -472 -472 -472 -473 -473 -469 -466 -511 -556 -591 -625 -630 -635 -599 -564 -529 -493 -481 -470 -458
9308 -458 -446 -492 -538 -554 -571 -622 -672 -701 -681 -646 -611 -573 -535 -497 -459 -460 -510 -555 -571 -558 -544 -556 -567 -514 -460 -422 -442 -479 -515 -541 -566 -591 -617 -603 -588
$$ packed form
9425e63l8l7K1K2K2K2k7k7k7k7J5J4M4M4K2K1k8k7m8m8m8m8j3j3J6J6k0j9L8Q7P1K1j7j6%
9409e95J%JK8K8jjl0k9J9K0J1J2J1J1MMMMJ6J6l3l3n4n4n4n4RRN8N8O3O3K2k7n4n4J1J2K0
9392e58K0K0K0l1l1l0l1JKJJK6K7K6K6l6l6l5l6k3k2M6M6J6J7j3j3L2L2L1L2l7l6l6l7ppq
9376f41pL1L0KJl4l5NN4Q0M9kl2l1l1llKKm7p6p4k6N4Q3O9L8QQk3k4n3n4llllK2K1K0J9k8
9357f38n7k2K8N2K3ooK0K0rj0jjl0l0j6j5j6j5j0rrj0K3K3K2K3N2N2N2N3L0L0j9j9n5n6k6
9341e82k6J7J7j2j2l4l3l3l4K8K8K8K7J8J7l1l2L0K9L0L0j6j5m5p4q4l6K4N4K1qpK3N2N3N5
9325e33N4k5k6k5k6L4L4L4L4j%l0l0k1k1K8K8K0K0j0j0%%j%MLm5m5l5l4nnL6L5L5L6J2J1J2
9308d58J2m6m6j6j7n1n0k9K0L5L5L8L8L8L8jn0m5j6J3J4j2j1N3N4L8k0l7l6k6k5k5k6J4J5
$$ plain form
9293 -588 -574 -560 -534 -507 -481 -454 -509 -564 -619 -674 -683 -691 -699 -708 -706 -704 -703 -701 -681 -661 -690 -719 -745 -772 -749 -727 -694 -660 -627 -593 -612 -630 -649 -667 -666 -665 -694 -722 -727 -731 -687
9275 -687 -642 -596 -549 -502 -455 -462 -470 -477 -484 -463 -441 -419 -398 -393 -387 -431 -475 -521 -568 -585 -603 -583 -563 -539 -574 -648 -721 -783 -786 -742 -699 -652 -605 -602 -599 -595 -592 -560 -528 -495
9258 -495 -463 -468 -472 -477 -482 -483 -485 -486 -488 -533 -578 -623 -668 -622 -576 -559 -542 -548 -555 -512 -470 -468 -467 -466 -465 -448 -431 -414 -397 -342 -286 -267 -306 -374 -443 -515 -588 -627 -666 -636 -607 -601
9240 -601 -595 -619 -643 -623 -604 -613 -623 -657 -691 -695 -699 -676 -652 -629 -606 -590 -575 -608 -642 -696 -750 -735 -720 -687 -654 -594 -535 -483 -479 -517 -556 -593 -630 -681 -703 -665 -578
9223 -578 -470 -363 -313 -312 -332 -352 -378 -404 -459 -515 -498 -482 -495 -508 -528 -547 -567 -587 -601 -616 -630 -644 -658 -672 -686 -700 -669 -639 -608 -577 -575 -572 -520 -469 -441
9208 -441 -412 -413 -415 -444 -474 -503 -532 -488 -443 -398 -354 -381 -408 -435 -462 -466 -470 -475 -479 -443 -407 -440 -473 -501 -529 -528 -527 -511 -495 -479 -463 -529 -594 -657 -671 -636 -601 -612 -623
9191 -623 -655 -686 -668 -650 -610 -570 -531 -491 -485 -480 -474 -468 -535 -602 -633 -606 -597 -588 -604 -621 -625 -630 -634 -639 -645 -651 -658 -664 -643 -623 -602 -581 -548 -515 -482 -449 -457 -465 -473 -481 -464 -447 -515 -583
9172 -583 -631 -620 -613 -605 -601 -596 -563 -529 -552 -575 -598 -621 -618 -615 -612 -609 -579 -548 -567 -586 -599 -612 -625 -638 -675 -712 -749 -786 -739 -692 -645 -598 -546 -493 -470 -447 -434 -420 -475
$$ packed form
9293e88J4J4K6K7K6K7n5n5n5n5rqqrKKJKK0K0k9k9k6k7K3K2L3L4L3L4j9j8j9j8JJk9k8nmM4
9275f87M5M6M7M7M7pqppK1K2K2K1NOm4m4m6m7j7j8K0K0K4l5p4p3o2lM4M3M7M7LLMLL2L2L3
9258d95L2nmnnjkjkm5m5m5m5M6M6J7J7opM3M2KJJJJ7J7J7J7N5N6J9l9o8o9p2p3l9l9L0K9O
9240f01Ok4k4K0J9rj0l4l4mmK3K4K3K3J6J5l3l4n4n4J5J5L3L3O0N9N2Ml8l9l7l7n1k2L8Q7
9223e78J08J07N0Jk0k0k6k6n5n6J7J6j3j3k0j9k0k0j4j5j4j4j4j4j4j4L1L0L1L1KLN2N1K8
9208d41K9jkk9l0k9k9M4M5M5M4k7k7k7k7mmnmL6L6l3l3k8k8JJJ6J6J6J6o6o5o3j4L5L5j1j1
9191f23l2l1J8J8M0M0L9M0ONOOo7o7l1K7RRj6j7mnmnoopoK1K0K1K1L3L3L3L3qqqqJ7J7o8o8
9172e83m8J1PQMNL3L4k3k3k3k3LLLLL0L1j9j9j3j3j3j3l7l7l7l7M7M7M7M7N2N3K3K3J3J4n5
$$ plain form
9155 -475 -529 -580 -631 -652 -674 -635 -597 -587 -578 -614 -651 -671 -633 -584 -536 -553 -570 -573 -576 -628 -680 -741 -803 -810 -758 -671 -585 -564 -542 -543 -544 -545 -545 -543 -541 -538 -536 -517 -497 -478 -458
9138 -458 -498 -539 -579 -619 -623 -626 -629 -633 -643 -652 -662 -672 -645 -618 -593 -568 -551 -564 -560 -556 -576 -596 -616 -636 -669 -701 -747 -765 -736 -678 -618 -587 -592 -597 -603 -610 -634 -657 -681 -705
9120 -705 -680 -655 -631 -606 -598 -591 -583 -576 -603 -630 -655 -680 -675 -641 -623 -605 -627 -649 -670 -692 -692 -691 -689 -687 -676 -635 -611 -587 -556 -525 -477 -458 -466 -474 -465 -486 -529 -542 -572 -602 -612
9103 -612 -592 -589 -586 -576 -565 -558 -550 -572 -643 -712 -782 -798 -764 -709 -654 -622 -590 -558 -526 -511 -496 -531 -596 -650 -676 -652 -629 -629 -659 -699 -740 -751 -733 -702 -671 -667 -662 -592
9086 -592 -522 -483 -494 -526 -558 -553 -548 -515 -482 -471 -490 -521 -552 -577 -602 -643 -654 -629 -604 -627 -680 -694 -678 -681 -684 -671 -658 -645 -632 -597 -561 -526 -491 -473 -455 -437 -420
9070 -420 -421 -422 -472 -522 -576 -630 -683 -737 -776 -815 -785 -755 -714 -673 -632 -591 -569 -548 -526 -505 -492 -479 -495 -512 -529 -546 -563 -580 -599 -618 -636 -655 -678 -702 -637 -572
9054 -572 -533 -493 -482 -472 -521 -570 -619 -668 -693 -718 -674 -630 -608 -586 -612 -639 -629 -618 -578 -538 -536 -534 -561 -588 -613 -637 -632 -627 -656 -685 -712 -690 -620 -551 -481 -460 -492
9038 -492 -525 -521 -469 -407 -375 -375 -374 -400 -455 -492 -479 -436 -393 -396 -398 -425 -451 -429 -377 -357 -386 -455 -523 -555 -587 -618 -650 -620 -590 -605 -621 -619 -567 -514 -460 -461 -461 -491 -521
$$ packed form
9155d75n4n1n1k1k2L9L8J0Rl6l7k0L8M9M8j7j7lln2n2o1o2pN2Q7Q6K1K2jjj%KKLKJ9K0J9K0
9138d58m0m1m0m0mllmj0rj0j0K7K7K5K5J7j3MMk0k0k0k0l3l2m6j8K9N8O0L1nnopk4k3k4k4
9120g05K5K5K4K5QPQPk7k7k5k5NL4J8J8k2k2k1k2%JKKJ1M1K4K4L1L1M8J9qqRk1m3j3l0l0j0
9103f12K0LLJ0J1PQk2p1o9p0j6L4N5N5L2L2L2L2J5J5l5o5n4k6K4K3%l0m0m1j1J8L1L1MNP0
9086e92P0L9j1l2l2NNL3L3J1j9l1l1k5k5m1j1K5K5k3n3j4J6llJ3J3J3J3L5L6L5L5J8J8J8J7
9070d20jjn0n0n4n4n3n4l9l9L0L0M1M1M1M1K2K1K2K1J3J3j6j7j7j7j7j7j9j9j8j9k3k4O5O5
9054e72L9M0J1J0m9m9m9m9k5k5M4M4K2K2k6k7J0J1M0M0KKk7k7k5k4NNk9k9k7K2P0O9P0K1l2
9038d92l3MN2O2L2%Jk6n5l7J3M3M3lkk7k6K2N2K0k9o9o8l2l2l1l2L0L0j5j6KN2N3N4j%l0l0
$$ plain form
9021 -521 -523 -524 -496 -467 -518 -568 -618 -668 -666 -665 -634 -603 -586 -569 -552 -534 -550 -565 -551 -537 -496 -455 -503 -550 -584 -619 -624 -629 -624 -619 -614 -609 -609 -609 -610 -610 -567 -524 -480 -437 -429 -420 -414
9003 -414 -407 -444 -511 -565 -560 -529 -498 -532 -567 -616 -666 -687 -707 -708 -708 -735 -761 -791 -762 -681 -570 -509 -547 -651 -755 -757 -700 -607 -514 -485 -456 -456 -456 -480 -505 -530 -555
8987 -555 -555 -554 -554 -554 -618 -683 -760 -808 -804 -741 -677 -671 -683 -695 -711 -727 -744 -761 -748 -736 -705 -673 -671 -669 -664 -659 -654 -648 -644 -641 -665 -720 -768 -757 -713 -669 -643 -618 -641 -665 -654 -644
8969 -644 -584 -524 -476 -429 -410 -392 -391 -390 -388 -387 -414 -440 -466 -493 -482 -472 -461 -451 -461 -471 -479 -487 -513 -509 -495 -529 -599 -668 -712 -755 -783 -812 -781 -751 -715 -679 -673 -666 -653
8952 -653 -640 -637 -663 -688 -665 -612 -558 -563 -567 -513 -459 -471 -484 -497 -510 -492 -474 -456 -438 -450 -462 -475 -487 -452 -418 -383 -349 -371 -393 -415 -438 -453 -467 -482 -497 -493 -489
8936 -489 -487 -485 -523 -591 -625 -590 -529 -518 -570 -622 -656 -642 -596 -550 -535 -521 -506 -491 -525 -558 -591 -624 -630 -635 -641 -646 -634 -621 -611 -601 -591 -630 -701 -771 -835 -899 -934 -969
8919 -969 -911 -853 -795 -736 -727 -717 -707 -698 -622 -547 -503 -508 -529 -549 -573 -596 -631 -665 -700 -734 -729 -723 -718 -713 -659 -605 -564 -552 -580 -608 -596 -554 -521 -488 -438 -418 -422 -455 -502
8902 -502 -550 -590 -629 -626 -593 -534 -475 -457 -468 -495 -522 -551 -580 -580 -581 -582 -582 -576 -570 -564 -558 -601 -645 -703 -732 -729 -696 -661 -656 -659 -662 -666 -669 -667 -635 -619 -604 -585 -566 -547 -528 -518 -507
$$ packed form
9021e21kjK8K9n1n0n0n0KJL1L1J7J7J7J8j6j5J4J4M1M1m8m7l4l5nnNNNN%%j%M3M3M4M3QRO
9003d14Pl7o7n4NL1L1l4l5m9n0k1k0j%k7k6l0K9Q1J11O1l8j04j04kN7R3R3K9K9%%k4k5k5k5
8987e55%J%%o4o5p7m8MO3O4Oj2j2j6j6j7j7J3J2L1L2KKNNNOMLk4n5m8J1M4M4K6K5k3k4J1J0
8969f44O0O0M8M7J9J8JJKJk7k6k6k7J1J0J1J0j0j0qqk6MJ4l4p0o9m4m3k8k9L1L0L6L6OPJ3
8952f53J3Lk6k5K3N3N4nmN4N4j2j3j3j3J8J8J8J8j2j2j3j2L5L4L5L4k2k2k2k3j5j4j5j5MM
8936d89KKl8o8l4L5O1J1n2n2l4J4M6M6J5J4J5J5l4l3l3l3ononJ2J3J0J0J0l9p1p0o4o4l5l5
8919i69N8N8N8N9RJ0J0RP6P5M4nk1k0k4k3l5l4l5l4NONNN4N4M1J2k8k8J2M2L3L3N0K0ml3m7
8902e02m8m0l9LL3N9N9J8j1k7k7k9k9%jj%OOOOm3m4n8k9LL3L5NllmlKL2J6J5J9J9J9J9J0J1
$$ plain form
8884 -507 -467 -427 -392 -358 -366 -403 -443 -483 -495 -507 -506 -505 -533 -561 -550 -539 -528 -516 -536 -556 -559 -591 -634 -676 -721 -765 -753 -741 -729 -717 -698 -680 -661 -642 -615 -589 -601
8868 -601 -643 -669 -646 -595 -544 -519 -524 -513 -501 -500 -500 -512 -554 -608 -662 -659 -656 -670 -684 -698 -712 -691 -670 -648 -627 -624 -620 -617 -614 -610 -605 -584 -593 -640 -687 -687 -688 -673 -659 -645 -631 -639
8849 -639 -646 -653 -660 -647 -634 -592 -549 -573 -596 -620 -643 -639 -634 -657 -679 -679 -631 -566 -530 -532 -562 -595 -598 -598 -598 -596 -593 -566 -539 -512 -485 -487 -489 -521 -553 -526 -500 -474 -447 -448 -448 -447 -445 -443
8830 -443 -411 -397 -432 -535 -638 -702 -718 -675 -633 -636 -639 -669 -698 -678 -658 -637 -615 -594 -573 -577 -582 -586 -590 -566 -541 -517 -492 -502 -513 -493 -474 -458 -441 -424 -408 -447 -486
8814 -486 -496 -506 -501 -496 -490 -485 -503 -522 -540 -558 -561 -564 -570 -576 -627 -727 -843 -930 -961 -962 -928 -865 -796 -757 -748 -739 -706 -673 -643 -612 -582 -601 -661 -750 -825 -851 -838 -825 -787
8797 -787 -750 -712 -674 -674 -674 -645 -615 -600 -586 -620 -655 -653 -650 -648 -646 -602 -557 -513 -469 -446 -423 -448 -474 -502 -530 -509 -487 -498 -510 -521 -532 -523 -515 -535 -556 -575 -595 -614 -634
8780 -634 -638 -643 -619 -594 -600 -606 -612 -618 -623 -628 -603 -548 -493 -486 -539 -591 -613 -636 -658 -680 -695 -709 -655 -601 -541 -481 -490 -499 -520 -540 -561 -582 -607 -632 -687 -771 -833 -847 -838 -799 -738
8763 -738 -677 -614 -551 -544 -536 -558 -579 -574 -568 -562 -556 -575 -594 -565 -535 -483 -431 -429 -426 -452 -479 -476 -474 -499 -525 -502 -478 -491 -504 -517 -530 -488 -447 -454 -462 -505 -547 -560 -573 -545 -516
$$ packed form
8884e07M0M0L5L4ql7m0m0j2j2JJk8k8J1J1J1J2k0k0ll2m3m2m5m4J2J2J2J2J9J8J9J9K7K6j2
8868f01m2k6K3N1N1K5nJ1J2J%j2m2n4n4LLj4j4j4j4K1K1K2K1LMLLMNK1rm7m7%jJ5J4J4J4q
8849f39pppJ3J3M2M3k4k3k4k3MNk3k2%M8O5L6kl0l3l%%KLK7K7K7K7kkl2l2K7K6K6K7j%JKK
8830d43L2J4l5j03j03o4j6M3M2lll0k9K0K0K1K2K1K1mnmmK4K5K4K5j0j1K0J9J6J7J7J6l9l9
8814d86j0j0NNONj8j9j8j8lloon1j00j16q7l1jL4O3O9L9RRL3L3L0L1L0j9o0q9p5k6J3J3L8
8797g87L7L8L8%%K9L0J5J4l4l5KLKKM4M5M4M4K3K3k5k6k8k8K1K2j1j2j1j1RQk0k1j9k0j9k0
8780f34mnK4K5oooonnK5N5N5Pn3n2k2k3k2k2j5j4N4N4O0O0rrk1k0k1k1k5k5n5q4o2j4RL9O1
8763g38O1O3O3PQk2k1NOOOj9j9K9L0N2N2KLk6k7LKk5k6K3K4j3j3j3j3M2M1pqm3m2j3j3K8K9
$$ plain form
8745 -516 -526 -584 -652 -670 -631 -592 -577 -561 -545 -530 -511 -493 -475 -457 -423 -389 -404 -418 -449 -480 -481 -483 -488 -494 -499 -504 -506 -508 -510 -512 -493 -474 -428 -383 -330 -326 -363 -399 -430 -461
8728 -461 -492 -523 -551 -579 -607 -635 -622 -610 -597 -584 -604 -623 -642 -662 -690 -719 -747 -776 -772 -769 -766 -762 -732 -701 -669 -637 -563 -460 -349 -286 -304 -371 -413 -456 -489 -522
8712 -522 -555 -588 -572 -556 -540 -524 -554 -585 -616 -646 -646 -646 -646 -646 -646 -646 -646 -646 -638 -629 -621 -612 -614 -616 -618 -620 -623 -626 -600 -573 -534 -494 -543 -592 -617 -642 -637 -632 -667 -701 -736 -770 -735 -700 -665
8692 -665 -631 -632 -634 -636 -638 -604 -570 -535 -501 -477 -452 -532 -613 -712 -763 -769 -746 -728 -710 -720 -729 -717 -706 -665 -624 -662 -701 -739 -778 -767 -757 -746 -735 -712 -689 -666 -643 -646
8676 -646 -649 -653 -656 -612 -569 -574 -580 -576 -573 -540 -507 -501 -496 -490 -484 -479 -475 -471 -467 -489 -512 -535 -557 -531 -504 -477 -451 -491 -531 -572 -612 -631 -651 -621 -562 -497 -482 -486 -490 -470 -450 -460 -470
8657 -470 -491 -512 -534 -555 -542 -529 -565 -602 -642 -683 -674 -666 -586 -506 -467 -478 -505 -532 -562 -592 -617 -642 -667 -692 -701 -709 -717 -725 -711 -696 -682 -668 -653 -637 -596 -554 -541 -578
8641 -578 -655 -733 -745 -756 -739 -721 -716 -711 -735 -759 -732 -705 -648 -591 -575 -558 -571 -584 -576 -567 -559 -551 -568 -586 -556 -527 -474 -451 -470 -537 -592 -597 -565 -532 -541 -550 -559 -567 -559 -552 -544 -536
8623 -536 -554 -572 -616 -660 -689 -669 -608 -547 -521 -495 -518 -541 -575 -610 -615 -619 -603 -586 -570 -553 -541 -529 -448 -368 -329 -290 -319 -349 -403 -457 -510 -564 -580 -597 -613 -630
$$ packed form
8745e16j0n8o8j8L9L9J5J6J6J5J9J8J8J8L4L4j5j4l1l1jknonnkkkkJ9J9M6M5N3Ml7l6l1l1
8728d61l1l1k8k8k8k8J3J2J3J3k0j9j9k0k8k9k8k9MLLML0L1L2L2P4J03J11O3j8o7m2m3l3l3
8712e22l3l3J6J6J6J6l0l1l1l0%%%%%%%%QRQRkkkkllK6K7L9M0m9m9k5k5NNl5l4l5l4L5L5L5
8692f65L4jkkkL4L4L5L4K4K5q0q1r9n1oK3J8J8j0rJ2J1M1M1l8l9l8l9J1J0J1J1K3K3K3K3l
8676f46lmlM4M3noMLL3L3ONOONMMMk2k3k3k2K6K7K7K6m0m0m1m0j9k0L0N9O5J5mmK0K0j0j0
8657d70k1k1k2k1J3J3l6l7m0m1RQQ0Q0L9j1k7k7l0l0k5k5k5k5rqqqJ4J5J4J4J5J6M1M2J3l7
8641e78p7p8j2j1J7J8NNk4k4K7K7N7N7J6J7j3j3QRQQj7j8L0K9N3K3j9o7n5nL2L3rrrqQPQQ
8623e36j8j8m4m4k9K0O1O1K6K6k3k3l4l5nmJ6J7J6J7J2J2Q1Q0L9L9k9l0n4n4n3n4j6j7j6j7
$$ plain form
8607 -630 -643 -657 -670 -684 -686 -688 -690 -692 -690 -689 -623 -557 -517 -546 -605 -663 -690 -717 -715 -713 -685 -656 -628 -600 -579 -558 -537 -516 -505 -495 -515 -534 -545 -557 -499 -442 -455 -468 -511
8590 -511 -554 -552 -551 -550 -549 -539 -529 -519 -509 -493 -478 -416 -354 -310 -314 -340 -366 -393 -419 -418 -417 -456 -525 -577 -580 -570 -589 -618 -647 -655 -663 -622 -581 -590 -600 -610 -620 -619 -617 -616 -615 -591
8572 -591 -567 -612 -656 -661 -666 -622 -578 -518 -458 -447 -436 -476 -515 -555 -594 -613 -632 -651 -670 -637 -605 -602 -598 -629 -659 -640 -622 -606 -589 -547 -504 -473 -491 -545 -569 -539 -480
8556 -480 -457 -482 -532 -581 -634 -686 -670 -655 -610 -565 -540 -515 -539 -564 -571 -578 -585 -592 -584 -577 -569 -561 -536 -512 -487 -462 -451 -440 -429 -418 -453 -488 -454 -420 -428 -436 -443 -451 -418 -384 -337
8538 -337 -320 -332 -393 -475 -556 -578 -550 -485 -420 -384 -397 -448 -499 -558 -568 -535 -473 -420 -395 -404 -443 -494 -545 -598 -651 -650 -649 -648 -647 -657 -666 -627 -587 -613 -638 -664 -689 -675
8522 -675 -660 -599 -537 -464 -420 -435 -509 -596 -684 -720 -697 -651 -605 -585 -564 -583 -602 -621 -639 -628 -616 -604 -592 -582 -572 -562 -552 -575 -597 -650 -702 -730 -758 -738 -717
8506 -717 -675 -633 -621 -608 -605 -603 -551 -499 -474 -448 -451 -455 -442 -428 -415 -402 -402 -401 -446 -491 -510 -470 -417 -394 -422 -450 -430 -411 -391 -371 -419 -468 -507 -546 -585 -624 -657 -690
8490 -690 -723 -755 -739 -722 -656 -590 -541 -493 -493 -493 -515 -536 -558 -579 -557 -535 -513 -490 -523 -555 -588 -620 -604 -588 -572 -556 -548 -540 -581 -622 -694 -767 -809 -852 -882 -911 -907
$$ packed form
8607f30j3j4j3j4kkkkKJO6O6M0k9n9n8k7k7KKK8K9K8K8K1K1K1K1J1J0k0j9j1j2N8N7j3j3m3
8590e11m3KJJJJ0J0J0J0J6J5O2O2M4mk6k6k7k6JJl9o9n2lJ0j9k9k9qqM1M1rj0j0j0JKJJK4
8572e91K4m5m4nnM4M4O0O0J1J1m0l9m0l9j9j9j9j9L3L2LMl1l0J9J8J6J7M2M3L1j8n4k4L0N9
8556d80K3k5n0m9n3n2J6J5M5M5K5K5k4k5ppppQPQQK5K4K5K5J1J1J1J1l5l5L4L4qqpqL3L4M7
8538c37J7j2o1q2q1k2K8O5O5L6j3n1n1n9j0L3O2N3K5rl9n1n1n3n3JJJJj0rL9M0k6k5k6k5J4
8522f75J5O1O2P3M4j5p4q7q8l6K3M6M6K0K1j9j9j9j8J1J2J2J2J0J0J0J0k3k2n3n2k8k8K0K1
8506g17M2M2J2J3LKN2N2K5K6lmJ3J4J3J3%Jm5m5j9M0N3K3k8k8K0J9K0K0m8m9l9l9l9l9l3l3
8490f90l3l2J6J7O6O6M9M8%%k2k1k2k1K2K2K2K3l3l2l3l2J6J6J6J6QQm1m1p2p3m2m3l0k9M
$$ plain form
8474 -907 -843 -735 -657 -627 -597 -562 -527 -522 -517 -521 -526 -531 -535 -571 -606 -642 -678 -725 -773 -821 -869 -834 -800 -765 -731 -713 -696 -679 -661 -631 -600 -569 -538 -554 -570 -585 -601
8458 -601 -595 -588 -582 -575 -576 -577 -577 -578 -588 -598 -607 -617 -570 -524 -477 -430 -472 -513 -555 -596 -591 -586 -580 -575 -574 -573 -538 -563 -631 -699 -767 -835 -843 -793 -707 -621 -555 -489 -439 -448 -499 -550 -556 -562
8439 -562 -523 -483 -444 -404 -407 -410 -412 -415 -425 -436 -446 -456 -421 -387 -352 -317 -310 -302 -295 -287 -295 -304 -312 -320 -306 -293 -279 -265 -295 -325 -354 -384 -441 -498 -555 -611 -616 -621 -626 -631 -618 -606 -594
8420 -594 -581 -556 -531 -505 -480 -496 -513 -529 -545 -534 -522 -511 -500 -459 -418 -426 -434 -448 -461 -445 -429 -405 -381 -406 -431 -479 -527 -576 -624 -611 -598 -585 -572 -569 -566 -514 -462
8404 -462 -444 -425 -436 -446 -408 -369 -334 -298 -316 -383 -437 -462 -472 -453 -431 -437 -461 -456 -452 -478 -503 -527 -553 -579 -606 -633 -610 -588 -606 -624 -642 -661 -663 -666 -667 -668 -621 -544
8388 -544 -459 -423 -480 -585 -680 -745 -787 -780 -749 -718 -709 -700 -690 -681 -693 -705 -667 -630 -593 -555 -567 -579 -567 -556 -545 -533 -554 -575 -547 -519 -508 -498 -516 -535 -551 -567
8372 -567 -583 -599 -577 -555 -534 -512 -468 -424 -380 -337 -373 -410 -447 -484 -513 -543 -573 -602 -592 -582 -572 -562 -605 -648 -692 -735 -712 -689 -617 -545 -499 -452 -454 -456 -425 -394
8356 -394 -412 -430 -445 -461 -476 -491 -529 -566 -601 -635 -609 -533 -470 -436 -445 -482 -504 -525 -513 -472 -400 -328 -283 -268 -267 -266 -295 -354 -425 -497 -537 -577 -617 -658 -663 -668 -672 -675
$$ packed form
8474i07O4J08P8L0L0L5L5NNmnnml6l5l6l6m7m8m8m8L5L4L5L4J8J7J7J8L0L1L1L1j6j6j5j6
8458f01OPOPjj%jj0j0rj0M7M6M7M7m2m1m2m1NNONJJL5k5o8o8o8o8qN0Q6Q6O6O6N0rn1n1oo
8439e62L9M0L9M0llklj0j1j0j0L5L4L5L5PQPQqrqqJ4J3J4J4l0l0k9l0n7n7n7n6nnnnJ3J2J2
8420e94J3K5K5K6K5j6j7j6j6J1J2J1J1M1M1qqj4j3J6J6K4K4k5k5m8m8m9m8J3J3J3J3LLN2N2
8404d62J8J9j1j0L8L9L5L6j8o7n4k5j0J9K2ok4NMk6k5k4k6k6k7k7K3K2j8j8j8j9kljjM7P7
8388e44Q5L6n7j05r5o5m2PL1L1RRJ0Rj2j2L8L7L7L8j2j2J2J1J1J2k1k1K8K8J1J0j8j9j6j6
8372e67j6j6K2K2K1K2M4M4M4M3l6l7l7l7k9l0l0k9J0J0J0J0m3m3m4m3K3K3P2P2M6M7kkL1L1
8356c94j8j8j5j6j5j5l8l7l5l4K6P6O3L4rl7k2k1J2M1P2P2M5J5JJk9n9p1p2m0m0m0m1nnml
$$ plain form
8340 -675 -651 -597 -532 -516 -539 -561 -585 -609 -627 -615 -573 -531 -516 -531 -559 -586 -586 -586 -559 -531 -528 -553 -563 -572 -593 -615 -636 -658 -657 -657 -656 -656 -643 -630 -617 -603 -600 -596 -592 -588 -597
8322 -597 -605 -641 -677 -715 -724 -680 -637 -618 -599 -582 -565 -528 -521 -515 -480 -416 -380 -376 -371 -375 -380 -414 -448 -465 -481 -498 -515 -511 -508 -504 -500 -513 -526 -538 -551 -600 -649 -697 -744 -735 -696
8304 -696 -674 -652 -629 -607 -568 -559 -578 -598 -619 -641 -611 -580 -550 -520 -493 -466 -439 -412 -412 -412 -412 -412 -413 -413 -414 -415 -415 -416 -360 -305 -283 -310 -368 -426 -457 -487 -489 -490 -489 -488 -517 -546
8286 -546 -556 -566 -521 -475 -462 -497 -563 -629 -660 -691 -663 -635 -617 -599 -611 -622 -594 -567 -509 -452 -437 -422 -505 -588 -637 -685 -675 -665 -637 -610 -612 -614 -636 -659 -691 -752
8271 -752 -806 -811 -747 -683 -662 -641 -621 -600 -600 -601 -630 -659 -680 -700 -661 -623 -588 -554 -598 -671 -693 -666 -610 -553 -522 -490 -459 -428 -438 -449 -490 -530 -570 -611 -592 -574
8255 -574 -618 -661 -705 -748 -725 -702 -677 -652 -616 -551 -476 -451 -526 -631 -691 -701 -693 -684 -672 -660 -639 -617 -655 -692 -683 -674 -635 -597 -547 -496 -475 -455 -447 -440 -462 -484 -485 -485
8239 -485 -515 -545 -577 -608 -611 -613 -595 -576 -558 -540 -532 -524 -516 -508 -486 -464 -442 -420 -408 -396 -443 -490 -532 -574 -557 -541 -548 -556 -564 -572 -580 -588 -597 -605 -601 -596 -621 -646 -663 -680 -642 -603 -570
8220 -570 -587 -634 -682 -647 -611 -575 -540 -579 -618 -657 -696 -682 -667 -653 -639 -646 -654 -662 -669 -625 -581 -537 -493 -515 -537 -559 -581 -579 -577 -575 -573 -579 -584 -589 -595 -577 -559 -541 -523 -521 -519 -517
$$ packed form
8340f75K4N4O5J6k3k2k4k4j8J2M2M2J5j5k8k7%%K7K8Lk5j0rk1k2k1k2J%J%J3J3J3J4LMMMr
8322e97ql6l6l8rM4M3J9J9J7J7L7POL5O4L6MNmnl4l4j7j6j7j7MLMMj3j3j2j3m9m9m8m7RL9
8304f96K2K2K3K2L9Rj9k0k1k2L0L1L0L0K7K7K7K7%%%%j%jj%jN6N5K2k7n8n8l1l0kjJJk9k9
8286e46j0j0M5M6J3l5o6o6l1l1K8K8J8J8j2j1K8K7N8N7J5J5q3q3m9m8J0J0K8K7kkk2k3l2o1
8271g52n4nO4O4K1K1K0K1%jk9k9k1k0L9L8L5L4m4p3k2K7N6N7L1L2L1L1j0j1m1m0m0m1J9J8
8255e74m4m3m4m3K3K3K5K5L6O5P5K5p5j05o0j0QRJ2J2K1K2l8l7RRL9L8N0N1K1K0QPk2k2j%
8239d85l0l0l2l1lkJ8J9J8J8QQQQK2K2K2K2J2J2m7m7m2m2J7J6pqqqqqrqMNk5k5j7j7L8L9L3
8220e70j7m7m8L5L6L6L5l9l9l9l9J4J5J4J4pqqpM4M4M4M4k2k2k2k2KKKKonnoJ8J8J8J8KKK
$$ plain form
8202 -517 -515 -545 -575 -659 -743 -787 -762 -701 -669 -669 -670 -673 -676 -674 -673 -672 -671 -647 -623 -599 -574 -575 -576 -577 -578 -607 -636 -665 -644 -617 -619 -658 -697 -704 -681 -645 -610 -593 -575 -614 -652 -681
8184 -681 -661 -609 -557 -513 -470 -466 -492 -526 -531 -524 -518 -537 -556 -575 -594 -593 -592 -588 -585 -577 -540 -491 -442 -425 -436 -474 -541 -608 -675 -729 -754 -755 -726 -683 -640 -596 -553 -481 -410 -379
8166 -379 -376 -387 -398 -447 -495 -544 -593 -627 -661 -681 -673 -649 -625 -640 -684 -707 -701 -712 -723 -738 -724 -686 -619 -577 -564 -562 -561 -574 -588 -602 -615 -605 -595 -596 -627 -660 -663 -645
8150 -645 -596 -570 -572 -573 -544 -537 -531 -522 -514 -499 -485 -472 -460 -480 -530 -564 -597 -617 -637 -646 -626 -581 -566 -592 -617 -649 -680 -710 -739 -733 -697 -679 -662 -659 -685 -695 -705 -709 -713 -717 -721
8132 -721 -698 -675 -652 -629 -609 -589 -598 -656 -753 -820 -798 -726 -651 -577 -558 -540 -569 -599 -626 -654 -635 -587 -527 -517 -551 -585 -563 -541 -501 -461 -450 -439 -471 -503 -565
8117 -565 -627 -688 -750 -782 -814 -788 -761 -705 -649 -600 -552 -601 -651 -694 -738 -723 -707 -666 -624 -614 -652 -706 -760 -759 -757 -720 -683 -676 -669 -700 -732 -705 -678 -650 -622 -596 -570
8101 -570 -595 -650 -659 -619 -569 -549 -568 -588 -578 -569 -559 -550 -544 -538 -532 -526 -518 -510 -502 -494 -514 -534 -554 -574 -593 -613 -593 -543 -497 -499 -531 -563 -558 -552 -576 -600 -630 -661 -633 -604 -595 -585
8083 -585 -635 -684 -725 -767 -779 -790 -760 -729 -698 -668 -674 -680 -686 -692 -684 -676 -619 -562 -525 -489 -522 -554 -591 -627 -664 -701 -656 -611 -569 -527 -537 -595 -641 -657 -638 -590 -556 -523
$$ packed form
8202e17Kl0l0q4q4m4K5O1L2%jllKJJJK4K4K4K5jjjjk9k9k9K1K7kl9l9pK3L6L5J7J8l9l8k9
8184f81K0N2N2M4M3Mk6l4nPOj9j9j9j9JJMLQL7M9M9J7j1l8o7o7o7n4k5jK9M3M3M4M3P2P1L1
8166c79Lj1j1m9m8m9m9l4l4k0QK4K4j5m4k3Oj1j1j5J4L8O7M2J3KJj3j4j4j3J0J0jl1l3lJ8
8150f45M9K6kjK9PORQJ5J4J3J2k0n0l4l3k0k0rK0M5J5k6k5l2l1l0k9OL6J8J7Lk6j0j0mmmm
8132g21K3K3K3K3K0K0rn8r7o7K2P2P5P4J9J8k9l0k7k8J9M8O0J0l4l4K2K2M0M0J1J1l2l2o2
8117e65o2o1o2l2l2K6K7N6N6M9M8m9n0m3m4J5J6M1M2J0l8n4n4JKL7L7PPl1l2K7K7K8K8K6K6
8101e70k5n5rM0N0K0j9k0J0RJ0ROOOOQQQQk0k0k0k0j9k0K0N0M6kl2l2NOk4k4l0l1K8K9RJ0
8083e85n0m9m1m2j2j1L0L1L1L0ooooQQN7N7L7L6l3l2l7l6l7l7M5M5M2M2j0n8m6j6J9M8L4L3
$$ plain form
8066 -523 -503 -483 -463 -444 -451 -458 -465 -473 -494 -514 -535 -556 -570 -584 -597 -611 -666 -721 -773 -825 -801 -728 -667 -636 -609 -612 -616 -591 -552 -513 -473 -432 -471 -510 -549 -587 -583 -578 -573
8049 -573 -569 -568 -568 -616 -665 -671 -678 -636 -594 -608 -621 -635 -649 -600 -552 -542 -582 -614 -617 -609 -602 -625 -647 -620 -593 -519 -445 -371 -297 -264 -230 -246 -261 -299 -336 -373 -411 -434 -457
8032 -457 -480 -504 -545 -586 -628 -669 -662 -656 -699 -741 -783 -825 -818 -810 -797 -784 -770 -757 -713 -670 -626 -582 -566 -549 -505 -460 -456 -481 -538 -596 -629 -662 -693 -724 -752 -750 -715 -650
8016 -650 -579 -537 -526 -515 -509 -503 -526 -549 -567 -586 -576 -565 -572 -578 -585 -592 -585 -577 -570 -563 -577 -591 -604 -616 -605 -565 -525 -514 -497 -481 -466 -452 -424 -396 -353 -340 -364 -418 -486 -555
7998 -555 -603 -650 -667 -655 -650 -675 -698 -692 -650 -609 -595 -582 -570 -559 -580 -631 -669 -707 -698 -688 -655 -621 -617 -613 -610 -607 -577 -546 -534 -551 -619 -687 -727 -737 -733 -729 -727 -695 -663 -661
7981 -661 -668 -676 -703 -701 -683 -694 -704 -684 -610 -536 -501 -515 -548 -582 -616 -651 -642 -603 -565 -556 -556 -557 -541 -554 -572 -561 -552 -572 -603 -634 -615 -566 -540 -515 -487 -460 -473 -485 -497
7964 -497 -510 -486 -461 -437 -412 -436 -459 -482 -505 -545 -586 -626 -666 -657 -648 -639 -630 -633 -636 -639 -642 -616 -589 -565 -540 -583 -654 -678 -653 -626 -598 -596 -595 -605 -616 -626 -636 -619 -603 -586
7947 -586 -569 -595 -622 -648 -674 -727 -779 -800 -772 -733 -693 -651 -608 -596 -584 -631 -678 -691 -705 -689 -672 -633 -593 -554 -514 -544 -573 -603 -633 -588 -544 -500 -455 -472 -489
$$ packed form
8066e23K0K0K0J9pppqk1k0k1k1j4j4j3j4n5n5n2n2K4P3O1L1K7lmK5L9L9M0M1l9l9l9l8MNN
8049e73MJ%m8m9opM2M2j4j3j4j4M9M8J0m0l2lQPk3k2K7K7P4P4P4P4L3L4j6j5l8l7l7l8k3k3
8032d57k3k4m1m1m2m1POm3m2m2m2PQJ3J3J4J3M4M3M4M4J6J7M4M5Mk5n7n8l3l3l1l1k8KL5O5
8016f50P1M2J1J1OOk3k3j8j9J0J1poppPQPPj4j4j3j2J1M0M0J1J7J6J5J4K8K8M3J3k4n4o8o9
7998e55m8m7j7J2Nk5k3OM2M1J4J3J2J1k1n1l8l8RJ0L3L4MMLLL0L1J2j7o8o8m0j0MMKL2L2K
7981f61pqk7KJ8j1j0K0P4P4L5j4l3l4l4l5RL9L8R%jJ6j3j8J1Rk0l1l1J9M9K6K5K8K7j3j2j2
7964d97j3K4K5K4K5k4k3k3k3m0m1m0m0RRRRllllK6K7K4K5m3p1k4K5K7K8KJj0j1j0j0J7J6J7
7947e86J7k6k7k6k6n3n2k1K8L9M0M2M3J2J2m7m7j3j4J6J7L9M0L9M0l0k9l0l0M5M4M4M5j7j7
$$ plain form
7932 -489 -506 -523 -516 -508 -500 -492 -484 -477 -469 -461 -432 -403 -374 -345 -310 -275 -339 -402 -476 -550 -607 -635 -630 -576 -519 -461 -442 -422 -462 -501 -510 -519 -499 -478 -484 -491 -497 -503 -459 -415 -430 -445
7913 -445 -462 -479 -522 -565 -582 -550 -499 -478 -471 -464 -488 -512 -518 -523 -469 -416 -418 -421 -394 -367 -344 -320 -323 -384 -463 -542 -595 -648 -660 -672 -654 -636 -641 -646 -621 -597 -571 -545 -578
7897 -578 -611 -578 -545 -513 -480 -448 -415 -382 -350 -383 -416 -449 -482 -459 -436 -412 -389 -429 -469 -510 -550 -568 -586 -604 -622 -644 -666 -684 -702 -690 -619 -525 -432 -392 -410
7881 -410 -451 -492 -511 -471 -411 -352 -324 -395 -508 -622 -617 -611 -606 -600 -627 -653 -680 -706 -706 -705 -705 -704 -683 -662 -640 -619 -594 -569 -544 -519 -512 -506 -499 -493 -479 -465 -451 -437 -425 -413
7864 -413 -400 -388 -413 -437 -462 -487 -475 -463 -451 -439 -435 -431 -397 -364 -318 -273 -253 -292 -347 -403 -403 -403 -424 -444 -465 -485 -454 -423 -392 -360 -351 -342 -391 -441 -487 -534 -482 -430
7848 -430 -406 -381 -386 -391 -392 -392 -422 -452 -477 -502 -498 -493 -495 -497 -470 -443 -386 -330 -305 -329 -368 -407 -449 -491 -525 -559 -534 -510 -510 -509 -509 -509 -489 -468 -503 -539 -540 -493 -427 -390 -399 -408
7829 -408 -418 -428 -464 -500 -535 -571 -579 -588 -597 -606 -587 -569 -551 -532 -534 -536 -538 -540 -587 -633 -651 -668 -678 -688 -669 -600 -514 -458 -440 -423 -408 -393 -378 -364 -365 -366 -367 -368 -368 -367 -366 -366 -387
7811 -387 -408 -430 -451 -473 -496 -518 -540 -501 -462 -423 -384 -415 -446 -477 -508 -481 -453 -397 -340 -324 -309 -265 -172 -91 -59 -55 -51 -60 -70 -21 28 81 133 186 239 264
$$ packed form
7932d89j7j7PQQQQPQQK9K9K9K9L5L5o4o3p4p4n7k8NN4N7N8J9K0m0l9rrK0K1opooM4M4j5j5
7913d45j7j7m3m3j7L2N1K1PPk4k4onN4N3klK7K7K3K4lo1p9p9n3n3j2j2J8J8nnK5K4K6K6l3
7897e78l3L3L3L2L3L2L3L3L2l3l3l3l3K3K3K4K3m0m0m1m0j8j8j8j8k2k2j8j8J2P1R4R3M0j8
7881d10m1m1j9M0O0N9K8p1j13j14NONOk7k6k7k6%J%JK1K1K2K1K5K5K5K5POPOJ4J4J4J4J2J2
7864d13J3J2k5k4k5k5J2J2J2J2MML4L3M6M5K0l9n5n6%%k1k0k1k0L1L1L1L2RRm9n0m6m7N2N2
7848d30K4K5nnj%l0l0k5k5MNkkK7K7N7N6K5k4l9l9m2m2l4l4K5K4%J%%K0K1l5l6jM7O6L7rr
7829d08j0j0l6l6l5l6qrrrJ9J8J8J9kkkkm7m6j8j7j0j0J9O9Q6N6J8J7J5J5J5J4jjjj%JJ%k1
7811c87k1k2k1k2k3k2k2L9L9L9L9l1l1l1l1K7K8N6N7J6J5M4R3Q1L2MMrj0M9M9N3N2N3N3K5
$$ plain form
7795 264 288 372 455 560 666 818 1068 1357 1704 2116 2625 3238 3988 5002 6351 8141 10460 13329 16375 18631 19062 17381
7786 17381 14347 11148 8480 6486 4983 3837 2986 2341 1834 1432 1129 922 774 672 570 501 433 366 299 294 290 357 482 626
7775 626 672 630 529 451 433 421 409 341 274 228 182 136 90 48 5 -8 -21 12 45 23 2 -4 48 126 204 222 239 227 274 381 548 744 939
7761 939 1165 1390 1651 1911 2289 2765 3365 4142 5228 6687 8639 11200 14290 17282 19092 18842 16640 13477 10377 7847
7752 7847 5925 4493 3469 2739 2195 1788 1465 1202 946 689 496 302 145 -12 -66 -60 -28 3 -18 -41 -75 -108 -142 -175 -200 -225
7741 -225 -191 -157 -179 -202 -165 -128 -84 -40 3 47 15 -17 -50 -82 -11 59 130 201 246 292 308 324 323 321 378 435 562 688 916 1144 1405 1725 2134
7727 2134 2662 3345 4225 5443 7093 9224 11944 15036 17775 19010 18166 15609 12385 9441 7164 5441 4150 3205 2535
7718 2535 2008 1598 1236 933 669 464 336 208 113 18 -41 -101 -190 -279 -299 -318 -308 -298 -317 -336 -384 -433 -410 -386 -363 -340 -345 -350 -414 -478 -526
$$ packed form
7795B64K4Q4Q3J05J06J52K50K89L47M12N09O13P50J014J349J790K319K869L046K256M31j681
7786A7381l034l199k668j994j503j146q51o45n07m02l03k07j48j02j02o9o8o7o7nmO7J25J44
7775F26M6m2j01p8j8j2j2o8o7m6m6m6m6m2m3j3j3L3L3k2k1oN2P8P8J8J7j2M7J07J67J96J95
7761I39K26K25K61K60L78M76O00P77J086J459J952K561L090K992J810k50k202l163l100k530
7752G847j922j432j024p30n44m07l23k63k56k57j93j94j57j57n4OL2L1k1k3l4l3l4l3k5k5
7741b25L4L4k2k3L7L7M4M4M3M4l2l2l3l2P1P0P1P1M5M6J6J6jkN7N7J27J26K28K28K61L20M09
7727B134N28O83Q80J218J650K131K720L092K739J235q44k557l224k944k277j723j291r45o70
7718B535n27m10l62l03k64k05j28j28r5r5n9o0q9q9k0j9J0J0j9j9m8m9K3K4K3K3nno4o4m8
$$ plain form
7705 -526 -573 -592 -610 -655 -700 -686 -671 -658 -644 -631 -617 -600 -583 -566 -549 -515 -482 -449 -416 -422 -427 -492 -557 -584 -612 -580 -549 -534 -520 -564 -609 -595 -580 -507 -434 -417
7689 -417 -400 -442 -484 -545 -606 -636 -616 -575 -534 -519 -504 -455 -407 -427 -496 -545 -564 -583 -631 -647 -614 -610 -606 -581 -555 -499 -444 -432 -419 -352 -284 -282 -349 -422 -467 -470 -472
7673 -472 -473 -474 -486 -498 -510 -521 -522 -523 -552 -582 -661 -741 -788 -787 -751 -716 -736 -756 -782 -808 -775 -742 -710 -678 -675 -672 -636 -599 -563 -526 -534 -542 -607 -672 -725 -748 -720 -643 -580
7656 -580 -565 -579 -593 -602 -612 -621 -631 -622 -613 -604 -595 -551 -508 -493 -479 -471 -463 -512 -561 -657 -723 -735 -699 -650 -601 -579 -556 -497 -437 -436 -435 -399 -363 -395 -477 -518 -529 -561 -592 -594
7639 -594 -597 -599 -601 -621 -640 -660 -679 -681 -682 -683 -684 -634 -584 -566 -597 -653 -709 -710 -711 -725 -740 -723 -658 -591 -523 -512 -501 -522 -543 -564 -585 -577 -568 -530 -492 -437 -382 -395 -458 -531
7622 -531 -575 -580 -585 -547 -508 -469 -431 -437 -444 -450 -457 -476 -494 -513 -532 -502 -473 -443 -414 -378 -343 -338 -332 -317 -303 -344 -385 -400 -366 -330 -343 -396 -419 -404 -388 -404 -419 -435 -451
7605 -451 -482 -513 -544 -575 -628 -682 -696 -681 -664 -697 -758 -820 -795 -770 -716 -662 -649 -637 -654 -670 -669 -668 -666 -665 -663 -662 -661 -659 -665 -671 -677 -683 -671 -658 -646 -633 -593 -552 -511 -471 -430
7587 -430 -390 -382 -422 -474 -526 -581 -635 -685 -734 -725 -715 -692 -669 -646 -624 -643 -662 -681 -700 -692 -684 -676 -668 -631 -595 -558 -521 -521 -521 -522 -522 -533 -545 -557 -569 -543 -517 -521 -525 -563 -602
$$ packed form
7705e26m7j9j8m5m5J4J5J3J4J3J4J7J7J7J7L4L3L3L3ono5o5k7k8L2L1J5J4m4m5J4J5P3P3J7
7689d17J7m2m2o1o1l0K0M1M1J5J5M9M8k0o9m9j9j9m8j6L3MMK5K6N6N5J2J3O7O8Ko7p3m5lk
7673d72jjj2j2j2j1jjk9l0p9q0m7JL6L5k0k0k6k6L3L3L2L2LLL6L7L6L7qqo5o5n3k3K8P7O3
7656e80J5j4j4rj0rj0RRRRM4M3J5J4QQm9m9r6o6j2L6M9M9K2K3N9O0JJL6L6l2q2m1j1l2l1k
7639e94lkkk0j9k0j9kjjjN0N0J8l1n6n6jjj4j5J7O5O7O8J1J1k1k1k1k1QRL8L8N5N5j3o3p3
7622e31m4nnL8L9L9L8opopj9j8j9j9L0K9L0K9L6L5NOJ5J4m1m1j5L4L6j3n3k3J5J6j6j5j6j6
7605d51l1l1l1l1n3n4j4J5J7l3o1o2K5K5N4N4J3J2j7j6JJKJKJJKooooJ2J3J2J3M0M1M1M0M1
7587d30M0Qm0n2n2n5n4n0m9RJ0K3K3K3K2j9j9j9j9QQQQL7L6L7L7%%j%j1j2j2j2K6K6mml8l9
$$ plain form
7569 -602 -582 -561 -539 -517 -495 -473 -525 -577 -629 -681 -671 -662 -653 -643 -604 -564 -524 -484 -477 -469 -461 -453 -473 -494 -514 -535 -550 -566 -523 -479 -459 -439 -477 -516 -514 -512 -510 -507 -513 -518 -465
7551 -465 -412 -362 -312 -322 -331 -396 -462 -496 -481 -489 -497 -502 -506 -513 -520 -526 -533 -527 -522 -516 -510 -474 -438 -405 -372 -391 -458 -515 -542 -579 -617 -652 -687 -666 -645 -624 -603 -598 -592 -586 -580 -582 -584 -585 -587
7532 -587 -575 -562 -550 -538 -529 -520 -512 -503 -491 -479 -507 -564 -597 -581 -521 -490 -511 -562 -598 -634 -655 -675 -637 -599 -590 -581 -572 -562 -533 -504 -504 -504 -503 -502 -502 -501 -559 -617 -617 -567 -521 -505
7514 -505 -519 -532 -541 -550 -559 -568 -538 -508 -478 -448 -431 -414 -466 -518 -593 -669 -703 -688 -629 -571 -539 -507 -527 -548 -539 -531 -520 -509 -548 -586 -565 -544 -523 -501 -497 -493 -489 -485 -494 -504
7496 -504 -543 -582 -570 -559 -547 -536 -515 -493 -521 -549 -578 -607 -606 -606 -595 -585 -574 -564 -564 -564 -563 -563 -568 -573 -578 -583 -554 -525 -498 -520 -557 -595 -587 -579 -581 -583 -585 -588 -565 -543 -567 -592 -654
7478 -654 -687 -676 -615 -556 -496 -463 -430 -392 -354 -316 -278 -311 -343 -376 -408 -417 -427 -370 -314 -288 -312 -377 -442 -457 -472 -486 -501 -531 -561 -542 -523 -515 -506 -498 -489 -460 -430
7462 -430 -400 -371 -370 -369 -417 -465 -485 -504 -524 -543 -552 -561 -540 -520 -515 -510 -534 -559 -603 -647 -642 -637 -678 -719 -731 -743 -735 -727 -768 -810 -807 -805 -734 -634 -562 -549 -571 -623 -685 -718
7444 -718 -698 -620 -533 -506 -531 -555 -567 -578 -590 -602 -624 -645 -667 -688 -718 -748 -762 -717 -642 -568 -558 -549 -547 -545 -543 -542 -538 -534 -501 -468 -441 -413 -454 -495 -547 -599 -651 -703
$$ packed form
7569f02K0K1K2K2K2K2n2n2n2n2J0RRJ0L9M0M0M0PQQQk0k1k0k1j5j6M3M4K0K0l8l9KKKLonN3
7551d65N3N0N0j0ro5o6l4J5qqnmppopONOOL6L6L3L3j9o7n7k7l7l8l5l5K1K1K1K1NOOOkkjk
7532e87J2J3J2J2RRQRJ2J2k8n7l3J6O0L1k1n1l6l6k1k0L8L8RRRJ0K9K9%%JJ%Jn8n8%N0M6J6
7514e05j4j3rrrrL0L0L0L0J7J7n2n2p5p6l4J5N9N8L2L2k0k1RQJ1J1l9l8K1K1K1K2MMMMrj0
7496e04l9l9J2J1J2J1K1K2k8k8k9k9J%J1J0J1J0%%J%nnnnK9K9K7k2l7l8QQkkklK3K2k4k5o2
7478f54l3J1O1N9O0L3L3L8L8L8L8l3l2l3l2rj0N7N6K6k4o5o5j5j5j4j5l0l0J9J9QRQRK9L0
7462d30L0K9JJm8m8k0j9k0j9rrK1K0NNk4k5m4m4NNm1m1j2j2QQm1m2LKP1J00P2J3k2n2o2l3
7444g18K0P8Q7K7k5k4j2j1j2j2k2k1k2k1l0l0j4M5P5P4J0RKKKJMML3L3K7K8m1m1n2n2n2n2
$$ plain form
7428 -703 -714 -725 -737 -748 -717 -687 -656 -626 -570 -514 -462 -410 -371 -392 -448 -505 -547 -590 -628 -667 -677 -628 -547 -495 -476 -458 -441 -425 -407 -390 -402 -414 -417 -419 -376 -333
7412 -333 -305 -335 -418 -500 -551 -543 -519 -495 -457 -420 -432 -443 -471 -498 -477 -456 -439 -422 -435 -448 -488 -528 -539 -550 -590 -629 -620 -610 -603 -595 -588 -581 -550 -519 -538 -556 -583 -610
7396 -610 -637 -665 -633 -602 -571 -540 -545 -549 -553 -558 -561 -564 -538 -512 -473 -434 -464 -494 -566 -639 -676 -655 -595 -535 -545 -613 -701 -759 -746 -703 -654 -606 -559 -513 -505 -557 -592 -597 -574
7379 -574 -551 -527 -502 -524 -546 -567 -589 -589 -588 -588 -587 -587 -587 -586 -586 -578 -571 -563 -556 -606 -657 -658 -659 -634 -609 -633 -656 -696 -736 -746 -757 -758 -759 -730 -702 -672 -641 -640 -640 -637 -635 -633 -630 -657 -683 -710
7359 -710 -736 -684 -633 -581 -530 -530 -530 -557 -585 -616 -618 -589 -561 -536 -540 -530 -520 -524 -558 -575 -592 -636 -680 -739 -768 -745 -692 -637 -612 -595 -579 -554 -499 -441 -412 -424 -485
7343 -485 -554 -594 -605 -616 -618 -621 -624 -627 -600 -572 -545 -518 -488 -459 -432 -404 -372 -369 -399 -459 -515 -542 -538 -534 -525 -516 -491 -495 -512 -530 -549 -569 -561 -553 -546 -538 -545 -552 -560 -569 -596 -652 -707 -732
7324 -732 -730 -699 -666 -663 -663 -663 -681 -670 -630 -590 -578 -566 -541 -516 -523 -558 -597 -606 -604 -602 -599 -597 -565 -533 -508 -483 -485 -488 -477 -438 -387 -336 -296 -285 -310 -364 -455 -546 -607 -638 -646
7306 -646 -655 -660 -665 -646 -598 -569 -539 -540 -570 -583 -596 -610 -623 -653 -653 -608 -562 -514 -467 -410 -353 -296 -239 -223 -208 -241 -274 -298 -322 -375 -429 -464 -499 -505 -510 -503 -495 -487 -479 -477 -475
$$ packed form
7428g03j1j1j2j1L1L0L1L0N6N6N2N2L9k1n6n7m2m3l8l9j0M9Q1N2J9J8J7J6J8J7j2j2lkM3M3
7412c33K8l0q3q2n1QK4K4L8L7j2j1k8k7K1K1J7J7j3j3m0m0j1j1m0l9RJ0PQPPL1L1j9j8k7k7
7396f10k7k8L2L1L1L1nmmnllK6K6L9L9l0l0p2p3l7K1O0O0j0o8q8n8J3M3M9M8M7M6Qn2l5nK3
7379e74K3K4K5k2k2k1k2%J%J%%J%QPQPn0n1jjK5K5k4k3m0m0j0j1jjK9K8L0L1J%LKKLk7k6k7
7359g10k6N2N1N2N1%%k7k8l1kK9K8K5mJ0J0ml4j7j7m4m4n9k9K3N3N5K5J7J6K5N5N8K9j2o1
7343d85o9m0j1j1klllK7K8K7K7L0K9K7K8L2Ll0o0n6k7MMRRK5mj7j8j9k0QQPQppqrk7n6n5k5
7324g32KL1L3L%%j8J1M0M0J2J2K5K5pl5l9rKKLKL2L2K5K5klJ1L9N1N1M0J1k5n4r1r1o1l1q
7306f46rnnJ9M8K9L0jl0j3j3j4j3l0%M5M6M8M7N7N7N7N7J6J5l3l3k4k4n3n4l5l5onPQQQKK
$$ plain form
7288 -475 -473 -471 -482 -492 -502 -513 -513 -513 -514 -514 -481 -449 -465 -482 -439 -396 -382 -369 -369 -369 -369 -370 -384 -398 -412 -426 -448 -469 -491 -512 -525 -539 -552 -565 -543 -521 -499 -477 -487 -496
7271 -496 -535 -573 -653 -732 -736 -682 -617 -553 -488 -423 -371 -378 -437 -495 -499 -444 -418 -451 -499 -548 -570 -593 -581 -568 -556 -544 -531 -519 -507 -494 -462 -429 -426 -423 -443 -464 -416
7255 -416 -368 -360 -353 -375 -397 -449 -502 -554 -607 -614 -621 -628 -635 -658 -680 -654 -627 -604 -581 -558 -536 -493 -450 -477 -503 -532 -560 -589 -618 -615 -611 -607 -604 -615 -626 -637 -648 -632 -616 -600
7238 -600 -584 -563 -542 -521 -500 -506 -511 -517 -523 -549 -574 -600 -626 -600 -574 -548 -523 -519 -516 -513 -510 -488 -466 -494 -521 -567 -613 -610 -607 -613 -619 -624 -630 -652 -673 -695 -717 -731 -745 -711 -676 -659
7219 -659 -641 -653 -665 -658 -650 -643 -635 -601 -567 -534 -500 -498 -496 -494 -492 -482 -472 -462 -453 -460 -467 -524 -580 -616 -651 -733 -814 -860 -857 -833 -808 -757 -705 -653 -602 -533 -464 -370 -325 -349 -402
7202 -402 -442 -482 -482 -482 -483 -483 -470 -458 -445 -432 -422 -411 -400 -389 -384 -379 -404 -428 -485 -543 -551 -560 -550 -541 -532 -523 -510 -498 -534 -570 -559 -549 -538 -527 -519 -512 -504 -496 -518 -540 -563 -585
7183 -585 -550 -516 -482 -448 -454 -460 -466 -473 -516 -559 -602 -645 -630 -615 -601 -586 -570 -554 -594 -634 -620 -557 -507 -486 -514 -571 -613 -655 -645 -634 -624 -614 -640 -666 -693 -719 -732
7167 -732 -744 -755 -765 -739 -683 -619 -603 -623 -673 -724 -746 -726 -676 -612 -597 -632 -637 -603 -570 -550 -530 -510 -490 -489 -487 -485 -484 -474 -465 -456 -447 -483 -518 -554 -589 -618 -646 -674 -702
$$ packed form
7288d75KKj1j0j0j1%%j%L3L2j6j7M3M3J4J3%%%jj4j4j4j4k2k1k2k1j3j4j3j3K2K2K2K2j0r
7271d96l9l8q0p9mN4O5O4O5O5N2pn9n8mN5K6l3m8m9k2k3J2J3J2J2J3J2J2J3L2L3LLk0k1M8
7255d16M8QPk2k2n2n3n2n3ppppk3k2K6K7K3K3K3K2M3M3k7k6k9k8k9k9LMMLj1j1j1j1J6J6J6
7238f00J6K1K1K1K1onook6k5k6k6K6K6K6K5MLLLK2K2k8k7m6m6LLoonok2k1k2k2j4j4L4L5J7
7219f59J8j2j2PQPQL4L4L3L4KKKKJ0J0J0Rppn7n6l6l5q2q1m6LK4K5N1N2N2N1O9O9R4M5k4n3
7202d02m0m0%%j%J3J2J3J3J0J1J1J1NNk5k4n7n8qrJ0RRRJ3J2l6l6J1J0J1J1QPQQk2k2k3k2
7183e85L5L4L4L4ooopm3m3m3m3J5J5J4J5J6J6m0m0J4O3N0K1k8n7m2m2J0J1J0J0k6k6k7k6j3
7167g32j2j1j0K6N6O4J6k0n0n1k2K0N0O4J5l5nL4L3K0K0K0K0JKKJJ0RRRl6l5l6l5k9k8k8k8
$$ plain form
7151 -702 -734 -767 -799 -831 -815 -800 -725 -651 -641 -631 -621 -611 -586 -560 -534 -508 -540 -572 -603 -635 -640 -644 -649 -653 -660 -667 -674 -681 -704 -727 -691 -655 -644 -634 -623 -613 -595 -577 -559
7134 -559 -541 -494 -447 -459 -472 -542 -612 -651 -641 -603 -566 -525 -484 -472 -459 -447 -435 -442 -450 -457 -465 -427 -389 -410 -431 -424 -417 -411 -404 -443 -481 -520 -559 -539 -519 -499 -479 -459 -439
7117 -439 -419 -399 -399 -400 -401 -402 -397 -393 -448 -503 -555 -608 -630 -603 -547 -492 -532 -572 -586 -600 -611 -622 -619 -568 -516 -513 -582 -651 -664 -677 -657 -637 -617 -597 -595 -593 -591 -590 -606 -623 -640
7099 -640 -656 -662 -668 -616 -563 -515 -467 -419 -371 -356 -341 -385 -429 -469 -508 -547 -586 -659 -732 -746 -759 -746 -733 -720 -707 -704 -701 -659 -588 -517 -496 -504 -512 -482 -451 -420 -390 -371
7082 -371 -353 -335 -316 -360 -404 -389 -374 -352 -329 -366 -402 -422 -442 -446 -479 -539 -600 -631 -613 -580 -546 -499 -422 -361 -329 -320 -342 -383 -425 -496 -567 -633 -670 -681 -662 -607
7067 -607 -553 -526 -499 -497 -496 -524 -552 -584 -616 -606 -567 -506 -445 -440 -436 -429 -422 -444 -466 -477 -488 -525 -562 -585 -558 -503 -447 -395 -373 -393 -413 -460 -506 -551 -596 -596 -568 -539
7050 -539 -540 -541 -542 -545 -548 -563 -579 -565 -552 -533 -515 -440 -364 -317 -299 -324 -348 -389 -430 -470 -511 -528 -546 -563 -581 -612 -644 -674 -704 -690 -648 -605 -592 -598 -604 -612 -620 -661 -702
7033 -702 -700 -670 -625 -580 -546 -542 -513 -484 -458 -433 -443 -482 -504 -527 -548 -569 -618 -618 -602 -585 -566 -547 -516 -486 -514 -543 -557 -571 -585 -599 -610 -620 -631 -641 -648 -654 -661 -667
$$ packed form
7151g02l2l3l2l2J6J5P5P4J0J0J0J0K5K6K6K6l2l2l1l2nmnmppppk3k3L6L6J1J0J1J0J8J8J8
7134e59J8M7M7j2j3p0p0l9J0L8L7M1M1J2J3J2J2pqpqL8L8k1k1PPOPl9l8l9l9K0K0K0K0K0K0
7117d39K0K0%jjjNMn5n5n2n3k2K7N6N5m0m0j4j4j1j1LN1N2Lo9o9j3j3K0K0K0K0KKKJj6j7j7
7099f40j6ooN2N3M8M8M8M8J5J5m4m4m0l9l9l9p3p3j4j3J3J3J3J3LLM2P1P1K1qqL0L1L1L0J9
7082c71J8J8J9m4m4J5J5K2K3l7l6k0k0ml3o0o1l1J8L3L4M7P7O1L2Rk2m1m2p1p1o6l7j1J9N5
7067f07N4K7K7KJk8k8l2l2J0L9O1O1NMPPk2k2j1j1l7l7k3K7N5N6N2K2k0k0m7m6m5m5%K8K9
7050e39jjjllj5j6J4J3J9J8P5P6M7J8k5k4m1m1m0m1j7j8j7j8l1l2l0l0J4M2M3J3ooqqm1m1
7033g02KL0M5M5L4MK9K9K6K5j0l9k2k3k1k1m9%J6J7J9J9L1L0k8k9j4j4j4j4j1j0j1j0popo
$$ plain form
7017 -667 -645 -624 -602 -580 -547 -514 -540 -566 -563 -559 -555 -552 -584 -616 -590 -563 -532 -501 -499 -498 -528 -557 -558 -509 -451 -423 -473 -523 -543 -564 -585 -605 -614 -622 -631 -639 -584 -528 -504 -528
7000 -528 -579 -629 -624 -618 -613 -607 -631 -655 -658 -662 -666 -669 -657 -645 -633 -622 -597 -573 -549 -525 -543 -560 -578 -596 -621 -647 -643 -639 -605 -571 -593 -615 -601 -538 -457 -405 -401 -397 -395 -392 -395 -398 -402
6981 -402 -405 -450 -495 -540 -585 -574 -563 -552 -541 -535 -529 -524 -520 -575 -659 -695 -683 -625 -566 -535 -552 -582 -582 -543 -504 -499 -494 -489 -484 -493 -502 -511 -519 -529 -539 -550 -560 -636 -713 -759 -756 -753 -750
6962 -750 -744 -738 -705 -671 -638 -604 -582 -559 -507 -455 -409 -362 -375 -387 -387 -387 -386 -386 -436 -486 -536 -586 -573 -560 -546 -533 -571 -610 -619 -628 -562 -496 -461 -475 -513 -550 -561 -572 -583
6945 -583 -594 -576 -557 -509 -460 -412 -363 -392 -421 -480 -538 -579 -621 -603 -586 -601 -616 -602 -588 -561 -535 -538 -541 -557 -572 -647 -722 -763 -805 -788 -771 -716 -662 -636 -611 -626
6930 -626 -640 -624 -609 -561 -513 -563 -613 -658 -703 -690 -676 -647 -618 -618 -618 -645 -672 -669 -666 -641 -615 -563 -511 -466 -470 -506 -542 -557 -572 -598 -652 -705 -708 -682 -656 -626 -596 -539
6913 -539 -483 -448 -463 -508 -554 -589 -625 -631 -637 -644 -650 -627 -604 -580 -557 -536 -516 -474 -482 -521 -560 -554 -547 -541 -534 -524 -513 -503 -493 -486 -479 -471 -464 -484 -504 -523 -543 -560 -577 -594 -611
6896 -611 -620 -630 -639 -649 -623 -598 -572 -547 -561 -574 -586 -549 -471 -394 -408 -492 -571 -601 -604 -607 -632 -657 -624 -590 -551 -511 -531 -550 -551 -551 -522 -493 -496 -500 -503 -506 -513 -521 -528 -535 -564 -593
$$ packed form
7017f67K2K1K2K2L3L3k6k6LMMLl2l2K6K7L1L1KJl0k9jM9N8K8n0n0k0k1k1k0rqrqN5N6K4k4
7000e28n1n0NONOk4k4lmmlJ2J2J2J1K5K4K4K4j8j7j8j8k5k6MML4L4k2k2J4O3Q1N2MMKLllm
6981d02lm5m5m5m5J1J1J1J1OONMn5q4l6J2N8N9L1j7l0%L9L9NNNNrrrqj0j0j1j0p6p7m6LLL
6962g50OOL3L4L3L4K2K3N2N2M6M7j3j2%%J%n0n0n0n0J3J3J4J3l8l9rrO6O6L5j4l8l7j1j1j1
6945e83j1J8J9M8M9M8M9k9k9n9n8m1m2J8J7j5j5J4J4K7K6llj6j5p5p5m1m2J7J7N5N4K6K5j5
6930f26j4J6J5M8M8n0n0m5m5J3J4K9K9%%k7k7LLK5K6N2N2M5ml6l6j5j5k6n4n3lK6K6L0L0N7
6913e39N6L5j5m5m6l5l6oopoK3K3K4K3K1K0M2ql9l9OPOPJ0J1J0J0PPQPk0k0j9k0j7j7j7j7
6896f11rj0rj0K6K5K6K5j4j3j2L7P8P7j4q4p9l0llk5k5L3L4L9M0k0j9j%K9K9lmllpqppk9k9
$$ plain form
6877 -593 -622 -651 -663 -674 -685 -696 -708 -719 -730 -742 -715 -688 -661 -634 -605 -576 -547 -518 -515 -511 -480 -449 -416 -412 -460 -556 -652 -699 -697 -666 -651 -665 -661 -657 -629 -601 -573 -545
6861 -545 -530 -515 -473 -432 -395 -408 -451 -495 -495 -494 -494 -493 -505 -517 -529 -541 -510 -478 -447 -415 -469 -523 -547 -571 -571 -572 -527 -482 -413 -403 -403 -403 -317 -133 89 252 277
6845 277 164 -34 -175 -200 -225 -273 -320 -318 -258 -227 -255 -322 -389 -430 -471 -471 -472 -442 -413 -416 -418 -421 -424 -439 -454 -469 -484 -487 -489 -492 -495 -469 -444 -418 -392 -383 -375 -366 -358 -419 -480
6827 -480 -541 -602 -585 -568 -505 -442 -392 -401 -445 -489 -494 -500 -536 -632 -704 -717 -643 -569 -522 -535 -514 -493 -477 -462 -530 -599 -669 -679 -634 -590 -532 -474 -485 -495 -514 -533
6812 -533 -551 -570 -608 -645 -618 -591 -557 -581 -658 -734 -788 -783 -742 -702 -628 -555 -482 -409 -387 -365 -391 -418 -438 -458 -448 -439 -399 -359 -371 -413 -456 -499 -514 -529 -517 -505
6796 -505 -493 -481 -477 -473 -522 -600 -685 -771 -817 -814 -769 -725 -679 -633 -590 -576 -595 -614 -606 -597 -589 -580 -556 -531 -479 -427 -378 -359 -364 -418 -502 -587 -642 -667 -689 -712 -732 -753 -762
6779 -762 -772 -798 -794 -757 -721 -668 -644 -646 -678 -711 -715 -702 -690 -659 -657 -647 -638 -630 -622 -613 -605 -597 -589 -589 -588 -588 -587 -558 -529 -501 -474 -453 -461 -503 -544 -563 -582 -628 -675 -687 -669 -639 -609
6760 -609 -602 -596 -587 -579 -583 -557 -531 -535 -533 -530 -530 -529 -529 -529 -513 -526 -562 -598 -653 -678 -675 -673 -668 -664 -642 -620 -599 -577 -564 -552 -539 -527 -541 -556 -570 -585 -582 -579 -576 -573 -585 -597 -559 -522 -472
$$ packed form
6877e93k9k9j2j1j1j1j2j1j1j2K7K7K7K7K9K9K9K9LML1L1L3Mm8r6r6m7KL1J5j4MMK8K8K8K8
6861e45J5J5M2M1L7j3m3m4%J%Jj2j2j2j2L1L2L1L2n4n4k4k4%jM5M5O9J0%%Q6J84K22J63K5
6845B77j13j98j41k5k5m8m7KO0L1k8o7o7m1m1%jL0K9lkllj5j5j5j5lkllK6K5K6K6RQRQo1o1
6827d80o1o1J7J7O3O3N0rm4m4nol6r6p2j3P4P4M7j3K1K1J6J5o8o9p0j0M5M4N8N8j1j0j9j9
6812e33j8j9l8l7K7K7L4k4p7p6n4NM1M0P4P3P3P3K2K2k6k7k0k0J0RM0M0j2m2m3m3j5j5J2J2
6796e05J2J2MMm9p8q5q6m6LM5M4M6M6M3J4j9j9QRQRK4K5N2N2M9J9nn4q4q5n5k5k2k3k0k1r
6779g62j0k6ML7L6N3K4kl2l3mJ3J2L1KJ0RQQRQQQ%J%JK9K9K8K7K1qm2m1j9j9m6m7j2J8L0L0
6760f09PORQmK6K6mKL%J%%J6j3l6l6n5k5LKNMK2K2K1K2J3J2J3J2j4j5j4j5LLLLj2j2L8L7N0
$$ plain form
6741 -472 -423 -442 -461 -490 -519 -548 -577 -600 -623 -646 -669 -674 -680 -686 -692 -680 -668 -656 -644 -610 -576 -542 -508 -518 -528 -537 -547 -570 -592 -614 -636 -635 -634 -633 -632 -631 -630 -630 -629 -645 -661
6723 -661 -677 -693 -683 -672 -661 -650 -636 -622 -608 -593 -589 -586 -533 -480 -472 -464 -456 -448 -489 -529 -570 -610 -651 -692 -733 -774 -784 -794 -736 -677 -643 -609 -604 -599 -629 -660 -690 -721 -690
6706 -690 -660 -629 -598 -553 -508 -464 -419 -378 -337 -345 -354 -380 -406 -403 -399 -383 -367 -380 -393 -407 -421 -435 -448 -454 -460 -496 -531 -584 -636 -639 -642 -653 -665 -648 -630 -609 -588 -567 -545
6689 -545 -571 -596 -622 -647 -646 -644 -643 -641 -630 -620 -609 -598 -614 -631 -647 -663 -621 -579 -537 -495 -505 -515 -524 -534 -515 -497 -479 -461 -465 -469 -472 -476 -465 -454 -443 -432 -426 -419 -412 -406 -357
6672 -357 -308 -327 -347 -394 -442 -489 -536 -522 -507 -492 -478 -451 -424 -426 -429 -414 -399 -420 -500 -581 -662 -693 -666 -620 -603 -615 -627 -628 -629 -600 -571 -543 -514 -535 -556 -574 -591
6655 -591 -579 -566 -597 -628 -609 -591 -605 -620 -634 -649 -632 -614 -596 -579 -554 -529 -504 -479 -471 -462 -454 -446 -425 -404 -413 -422 -460 -498 -487 -477 -429 -381 -369 -416 -478 -540 -537 -534 -519
6639 -519 -503 -556 -609 -588 -568 -547 -526 -537 -547 -605 -663 -734 -776 -756 -687 -613 -569 -555 -540 -555 -570 -615 -660 -643 -625 -608 -591 -617 -643 -640 -637 -631 -625 -648 -671 -716 -761
6623 -761 -757 -753 -723 -694 -665 -635 -614 -592 -600 -608 -634 -660 -665 -621 -539 -456 -420 -383 -385 -387 -437 -488 -530 -573 -546 -520 -505 -489 -523 -557 -584 -612 -590 -568 -513 -458 -404 -400 -470
$$ packed form
6741d72M9j9j9k9k9k9k9k3k3k3k3noooJ2J2J2J2L4L4L4L4j0j0rj0k3k2k2k2JJJJJJ%Jj6j6
6723f61j6j6J0J1J1J1J4J4J4J5MLN3N3QQQQm1m0m1m0m1m1m1m1j0j0N8N9L4L4NNl0l1l0l1L1
6706f90L0L1L1M5M5M4M5M1M1qrk6k6LMJ6J6j3j3j4j4j4j3ool6l5n3n2llj1j2J7J8K1K1K1K2
6689e45k6k5k6k5JKJKJ1J0J1J1j6j7j6j6M2M2M2M2j0j0rj0J9J8J8J8mmlmJ1J1J1J1OPPOM9
6672c57M9j9k0m7m8m7m7J4J5J5J4K7K7klJ5J5k1q0q1q1l1K7M6J7j2j2jjK9K9K8K9k1k1j8j7
6655e91J2J3l1l1J9J8j4j5j4j5J7J8J8J7K5K5K5K5QRQQK1K1rrl8l8J1J0M8M8J2m7o2o2LLJ5
6639e19J6n3n3K1K0K1K1j1j0n8n8p1m2K0O9P4M4J4J5j5j5m5m5J7J8J7J7k6k6LLOOk3k3m5m5
6623g61MML0K9K9L0K1K2qqk6k6nM4Q2Q3L6L7kkn0n1m2m3K7K6J5J6l4l4k7k8K2K2N5N5N4Mp0
$$ plain form
6606 -470 -541 -575 -560 -560 -589 -629 -668 -650 -632 -565 -498 -440 -382 -373 -364 -386 -408 -429 -451 -492 -533 -545 -556 -587 -617 -648 -678 -701 -724 -697 -671 -632 -594 -604 -614 -660
6590 -660 -706 -753 -799 -781 -764 -747 -730 -681 -632 -612 -593 -570 -548 -555 -562 -611 -660 -679 -698 -673 -647 -592 -537 -543 -549 -555 -561 -572 -582 -593 -603 -627 -651 -690 -699 -677 -625 -561
6574 -561 -496 -449 -431 -445 -460 -468 -476 -485 -493 -483 -472 -462 -451 -434 -416 -399 -382 -406 -430 -455 -479 -496 -513 -547 -551 -535 -520 -553 -615 -671 -698 -664 -582 -480 -408 -377 -395
6558 -395 -432 -468 -508 -547 -573 -598 -651 -704 -738 -741 -714 -687 -673 -689 -687 -686 -680 -674 -695 -717 -687 -627 -584 -542 -528 -514 -500 -487 -454 -422 -419 -417 -452 -488 -510 -503 -490 -477 -451
6541 -451 -396 -354 -342 -381 -450 -515 -550 -554 -528 -491 -482 -485 -488 -465 -441 -467 -493 -506 -520 -504 -489 -478 -467 -471 -505 -555 -634 -713 -763 -779 -765 -766 -767 -740 -713 -687 -660 -650
6524 -650 -640 -631 -621 -575 -529 -483 -437 -447 -458 -468 -479 -473 -468 -463 -458 -494 -531 -538 -545 -492 -440 -436 -433 -435 -437 -439 -441 -461 -480 -530 -608 -674 -691 -668 -646 -602 -558 -543 -529 -560 -590
6506 -590 -592 -593 -564 -535 -556 -576 -564 -551 -539 -527 -558 -588 -570 -552 -550 -549 -577 -604 -617 -630 -614 -597 -599 -601 -554 -507 -459 -411 -431 -452 -494 -537 -549 -562 -556 -551 -545 -539 -574 -608
6489 -608 -642 -676 -682 -688 -693 -699 -663 -627 -591 -555 -593 -631 -666 -701 -670 -589 -523 -486 -506 -575 -634 -664 -671 -677 -681 -686 -701 -716 -701 -687 -667 -647 -677 -706 -693 -680 -637 -594 -601
$$ packed form
6606d70p1l4J5%k9m0l9J8J8O7O7N8N8RRk2k2k1k2m1m1j2j1l1l0l1l0k3k3K7K6L9L8j0j0m6
6590f60m6m7m6J8J7J7J7M9M9K0J9K3K2ppm9m9j9j9K5K6N5N5ooooj1j0j1j0k4k4l9rK2N2O4
6574e61O5M7J8j4j5qqrqJ0J1J0J1J7J8J7J7k4k4k5k4j7j7l4mJ6J5l3o2n6k7L4Q2J02P2L1j8
6558c95l7l6m0l9k6k5n3n3l4lK7K7J4j6KJOOk1k2L0O0M3M2J4J4J4J3L3L2LKl5l6k2PJ3J3K6
6541d51N5M2J2l9o9o5l5mK6L7RllK3K4k6k6j3j4J6J5J1J1ml4n0p9p9n0j6J4jjK7K7K6K7J0
6524f50J0RJ0M6M6M6M6j0j1j0j1ONNNl6l7ppN3N2MLkkkkk0j9n0p8o6j7K3K2M4M4J5J4l1l0
6506e90kjK9K9k1k0J2J3J2J2l1l0J8J8KJk8k7j3j3J6J7kkM7M7M8M8k0k1m2m3j2j3ONOOl5l4
6489f08l4l4oonoL6L6L6L6l8l8l5l5L1Q1O6L7k0o9n9l0pomnj5j5J5J4K0K0l0k9J3J3M3M3p
$$ plain form
6472 -601 -608 -615 -623 -648 -673 -669 -665 -648 -631 -661 -691 -737 -753 -756 -760 -748 -736 -707 -708 -730 -752 -743 -705 -669 -633 -645 -656 -688 -721 -740 -729 -699 -669 -636 -604 -565 -525 -471 -446
6455 -446 -455 -493 -516 -539 -552 -565 -594 -593 -583 -572 -560 -547 -529 -510 -491 -473 -441 -408 -425 -442 -432 -421 -424 -455 -489 -523 -587 -652 -720 -787 -821 -827 -792 -757 -732 -736 -717
6439 -717 -669 -639 -609 -581 -553 -509 -494 -515 -536 -559 -582 -558 -534 -511 -487 -470 -452 -435 -417 -419 -421 -412 -375 -333 -340 -384 -428 -481 -505 -496 -487 -459 -432 -415 -428 -452 -446 -413
6423 -413 -380 -372 -413 -476 -538 -573 -608 -642 -675 -677 -650 -642 -633 -631 -659 -657 -626 -589 -553 -563 -574 -578 -581 -584 -588 -588 -588 -589 -589 -590 -590 -590 -591 -609 -627 -662 -668 -643 -618 -592 -565 -531 -497 -461
6404 -461 -425 -415 -375 -337 -329 -362 -424 -470 -516 -544 -542 -556 -571 -569 -568 -567 -565 -526 -486 -430 -404 -427 -450 -502 -554 -608 -632 -613 -595 -601 -607 -614 -620 -635 -649 -664 -679 -711 -743 -774
6386 -774 -804 -805 -776 -763 -750 -751 -753 -770 -758 -721 -684 -647 -610 -609 -637 -648 -660 -647 -634 -593 -552 -517 -511 -547 -583 -608 -634 -657 -680 -664 -619 -573 -557 -561 -565 -581 -627 -663
6370 -663 -670 -637 -603 -603 -602 -602 -601 -596 -590 -585 -579 -573 -568 -562 -556 -547 -537 -529 -521 -538 -584 -614 -644 -637 -630 -624 -617 -610 -603 -596 -590 -577 -564 -551 -538 -507 -476 -448 -420 -415 -459 -549 -610 -628 -617 -617 -618 -611 -556
6349 -556 -469 -382 -335 -289 -272 -255 -298 -341 -384 -427 -465 -503 -512 -520 -479 -437 -455 -472 -491 -510 -530 -549 -584 -619 -653 -688 -691 -694 -697 -700 -733 -765 -798 -830 -796 -762 -729 -695
$$ packed form
6472f01ppqk5k5MMJ7J7l0l0m6j6lmJ2J2K9jk2k2RL8L6L6j2j1l2l3j9J1L0L0L3L2L9M0N4K5
6455d46rl8k3k3j3j3k9JJ0J1J2J3J8J9J9J8L2L3j7j7J0J1ll1l4l4o4o5o8o7l4oL5L5K5mJ9
6439g17M8L0L0K8K8M4J5k1k1k3k3K4K4K3K4J7J8J7J8kkRL7M2pm4m4n3k4RRK8K7J7j3k4OL3
6423d13L3Qm1o3o2l5l5l4l3kK7QRKk8KL1L7L6j0j1mllm%%j%j%%jj8j8l5oK5K5K6K7L4L4L6
6404d61L6J0M0L8Ql3o2m6m6k8Kj4j5KJJKL9M0N6K6k3k3n2n2n4k4J9J8oopoj5j4j5j5l2l2l1
6386g74l0jK9J3J3jkj7J2L7L7L7L7Jk8j1j2J3J3M1M1L5Ol6l6k5k6k3k3J6M5M6J6mmj6m6l6
6370f63pL3L4%J%JNONOONOORJ0QQj7m6l0l0PPOPPPPOJ3J3J3J3L1L1K8K8Nm4r0o1j8J1%jPN5
6349e56Q7Q7M7M6J7J7m3m3m3m3l8l8rqM1M2j8j7j9j9k0j9l5l5l4l5lllll3l2l3l2L4L4L3L4
$$ plain form
6332 -695 -623 -552 -480 -409 -416 -424 -432 -439 -414 -389 -334 -279 -284 -289 -352 -416 -439 -463 -486 -509 -520 -531 -542 -553 -582 -611 -581 -551 -497 -443 -488 -532 -588 -645 -686 -697 -663 -581
6316 -581 -478 -405 -373 -341 -311 -281 -276 -272 -267 -262 -287 -311 -336 -360 -418 -476 -534 -591 -629 -667 -646 -626 -566 -507 -506 -505 -503 -502 -470 -439 -460 -481 -502 -522 -551 -580 -608 -637
6299 -637 -629 -621 -613 -605 -570 -535 -500 -464 -417 -370 -326 -282 -314 -405 -462 -520 -514 -509 -504 -499 -471 -442 -414 -386 -389 -392 -425 -458 -498 -537 -527 -517 -518 -520 -495 -471 -445 -479 -509 -539 -523
6281 -523 -506 -490 -473 -475 -478 -480 -483 -478 -473 -468 -463 -474 -484 -495 -506 -517 -528 -539 -550 -542 -534 -526 -517 -509 -501 -493 -485 -527 -570 -613 -656 -671 -687 -703 -718 -639 -560 -481 -401 -398 -395 -392 -388 -438 -487
6262 -487 -537 -586 -609 -631 -585 -539 -479 -419 -414 -468 -512 -556 -535 -514 -481 -448 -444 -440 -445 -449 -409 -368 -343 -377 -407 -437 -466 -496 -525 -555 -516 -477 -453 -489 -502 -515 -483
6246 -483 -451 -466 -480 -466 -451 -398 -344 -339 -334 -353 -371 -419 -466 -504 -542 -511 -481 -488 -495 -531 -568 -576 -585 -593 -601 -607 -613 -619 -625 -590 -554 -587 -620 -671 -722 -724 -726 -677 -628 -579 -530 -554
6228 -554 -578 -572 -567 -535 -503 -536 -569 -631 -634 -602 -569 -552 -534 -487 -440 -376 -312 -337 -362 -430 -498 -563 -628 -704 -721 -687 -653 -633 -672 -727 -782 -777 -773 -719 -665 -607 -548
6212 -548 -519 -490 -518 -547 -546 -545 -548 -551 -555 -558 -572 -585 -570 -554 -503 -453 -510 -567 -595 -623 -602 -580 -557 -533 -509 -486 -456 -427 -398 -369 -381 -394 -406 -419 -432 -445 -458 -472
$$ packed form
6332f95P2P1P2P1pqqpK5K5N5N5nno3o4k3k4k3k3j1j1j1j1k9k9L0L0N4N4m5m4n6n7m1j1L4Q2
6316e81J03P3L2L2L0L0NMNNk5k4k5k4n8n8n8n7l8l8K1K0O0N9JJKJL2L1k1k1k1k0k9k9k8k9
6299f37QQQQL5L5L5L6M7M7M4M4l2r1n7n8ONNNK8K9K8K8lll3l3m0l9J0J0jkK5K4K6l4l0l0J6
6281e23J7J6J7klklNNNNj1j0j1j1j1j1j1j1QQQRQQQQm2m3m3m3j5j6j6j5P9P9P9Q0LLLMn0m9
6262d87n0m9k3k2M6M6O0O0Nn4m4m4K1K1L3L3MMnmM0M1K5l4l0l0k9l0k9l0L9L9K4l6j3j3L2
6246d83L2j5j4J4J5N3N4NNj9j8m8m7l8l8L1L0ppl6l7qrqqooooL5L6l3l3n1n1kkM9M9M9M9k4
6228e54k4ONL2L2l3l3o2lL2L3J7J8M7M7O4O4k5k5o8o8o5o5p6j7L4L4K0l9n5n5NMN4N4N8N9
6212e48K9K9k8k9JJllmlj4j3J5J6N1N0n7n7k8k8K1K2K3K4K4K3L0K9K9K9j2j3j2j3j3j3j3j4
$$ plain form
6195 -472 -485 -498 -511 -525 -550 -576 -602 -628 -603 -577 -555 -533 -531 -588 -611 -635 -620 -605 -591 -576 -592 -609 -625 -641 -645 -648 -652 -656 -661 -666 -671 -676 -654 -632 -610 -588 -584 -580 -576 -572 -550
6177 -550 -527 -472 -475 -526 -578 -633 -688 -654 -620 -586 -552 -559 -566 -524 -482 -448 -414 -409 -404 -441 -478 -466 -453 -421 -388 -404 -421 -430 -440 -449 -459 -454 -449 -444 -440 -439 -439 -439 -439 -496 -553 -577
6159 -577 -542 -502 -491 -530 -598 -672 -717 -747 -748 -737 -727 -714 -702 -709 -715 -722 -729 -748 -767 -786 -806 -773 -741 -709 -677 -638 -599 -561 -522 -531 -540 -520 -500 -436 -373 -345 -377 -448
6143 -448 -520 -566 -612 -606 -600 -623 -647 -628 -609 -590 -572 -547 -522 -546 -570 -595 -620 -616 -612 -626 -639 -652 -665 -630 -595 -560 -525 -498 -471 -444 -416 -465 -514 -563 -612 -644 -676
6127 -676 -708 -740 -715 -690 -666 -641 -644 -647 -650 -653 -648 -643 -639 -634 -654 -673 -692 -712 -670 -628 -586 -544 -492 -440 -388 -337 -344 -352 -360 -367 -348 -329 -358 -388 -407 -426 -495 -563 -601 -640 -646
6109 -646 -652 -662 -622 -545 -497 -494 -492 -461 -431 -431 -432 -432 -432 -425 -417 -410 -402 -394 -385 -425 -465 -497 -529 -472 -416 -384 -353 -370 -388 -423 -459 -495 -530 -549 -567 -586 -604 -624 -643 -614 -584
6091 -584 -559 -533 -538 -542 -582 -623 -587 -503 -440 -446 -499 -552 -566 -580 -565 -549 -514 -479 -444 -409 -427 -444 -461 -479 -496 -513 -531 -548 -565 -581 -614 -618 -601 -585 -566 -548 -555
6075 -555 -563 -588 -585 -561 -567 -570 -545 -491 -438 -441 -445 -437 -430 -435 -470 -489 -508 -529 -550 -585 -620 -653 -687 -684 -652 -636 -620 -617 -614 -610 -607 -583 -559 -547 -565 -610 -655 -643 -632 -615 -598 -583
$$ packed form
6195d72j3j3j3j4k5k6k6k6K5K6K2K2Kn7k3k4J5J5J4J5j6j7j6j6mlmmnnnnK2K2K2K2MMMMK2
6177e50K3N5ln1n2n5n5L4L4L4L4ppM2M2L4L4NNl7l7J2J3L2L3j6j7rj0rj0NNNMJ%%%n7n7k4
6159e77L5M0J1l9o8p4m5l0jJ1J0J3J2poppj9j9j9k0L3L2L2L2L9L9L8L9rrK0K0O4O3K8l2p1
6143d48p2m6m6OOk3k4J9J9J9J8K5K5k4k4k5k5MMj4j3j3j3L5L5L5L5K7K7K7K8m9m9m9m9l2l2
6127f76l2l2K5K5K4K5llllNNMNk0j9j9k0M2M2M2M2N2N2N2N1pqqpJ9J9k9l0j9j9o9o8l8l9o
6109f46oj0M0P7M8LKL1L0%j%%PQPQQRm0m0l2l2N7N6L2L1j7j8l5l6l6l5j9j8j9j8k0j9K9L0
6091e84K5K6nmm0m1L6Q4O3on3n3j4j4J5J6L5L5L5L5j8j7j7j8j7j7j8j7j7j6l3mJ7J6J9J8p
6075e55qk5LK4olK5N4N3lmQPnl5j9j9k1k1l5l5l3l4LL2J6J6LLMLK4K4J2j8m5m5J2J1J7J7J5
$$ plain form
6057 -583 -568 -563 -587 -612 -606 -575 -544 -494 -474 -486 -498 -528 -528 -500 -471 -481 -520 -571 -594 -592 -560 -528 -495 -474 -482 -480 -478 -478 -478 -496 -514 -530 -546 -556 -537 -535 -532 -521 -509 -498
6039 -498 -487 -502 -518 -532 -545 -553 -531 -510 -517 -540 -562 -584 -607 -635 -634 -591 -548 -510 -473 -464 -456 -488 -520 -523 -525 -539 -554 -529 -474 -440 -455 -500 -544 -595 -645 -666 -687 -711
6023 -711 -735 -700 -665 -647 -629 -640 -651 -617 -584 -580 -576 -579 -582 -585 -589 -588 -587 -587 -586 -578 -570 -562 -554 -544 -534 -525 -515 -565 -615 -635 -656 -660 -665 -611 -557 -528 -499 -529 -558 -583 -608 -633 -658
6004 -658 -644 -629 -615 -601 -605 -608 -671 -734 -806 -879 -853 -827 -809 -791 -772 -754 -709 -664 -677 -691 -674 -657 -640 -623 -582 -542 -502 -461 -471 -481 -490 -500 -467 -435 -431 -428 -448
5988 -448 -467 -430 -394 -435 -526 -615 -704 -789 -825 -793 -693 -606 -569 -575 -551 -495 -438 -439 -439 -493 -546 -571 -595 -580 -565 -552 -539 -557 -606 -665 -675 -618 -560 -530 -499 -498
5973 -498 -497 -553 -609 -680 -722 -711 -651 -557 -491 -488 -514 -514 -514 -526 -567 -600 -584 -539 -493 -479 -465 -451 -437 -452 -467 -452 -437 -425 -413 -456 -499 -507 -465 -423 -430 -472 -514 -559
5956 -559 -604 -622 -640 -658 -676 -674 -672 -670 -667 -713 -760 -747 -734 -731 -727 -694 -661 -620 -580 -569 -557 -564 -570 -576 -582 -582 -583 -583 -584 -587 -589 -592 -595 -630 -664 -668 -622 -565 -507 -476 -445 -388 -331 -304
5937 -304 -277 -278 -279 -339 -399 -461 -522 -525 -528 -543 -558 -573 -588 -606 -625 -643 -662 -653 -645 -637 -629 -613 -597 -582 -566 -563 -560 -557 -555 -573 -591 -609 -627 -606 -585 -621 -656 -666 -627 -571 -545
$$ packed form
6057e83J5Nk4k5OL1L1N0K0j2j2l0%K8K9j0l9n1k3KL2L2L3K1qKK%%j8j8j6j6j0J9KLJ1J2J1
6039d98J1j5j6j4j3qK2K1pk3k2k2k3k8JM3M3L8L7RQl2l2lkj4j5K5N5L4j5m5m4n1n0k1k1k4
6023g11k4L5L5J8J8j1j1L4L3MMlllmJJ%JQQQQJ0J0RJ0n0n0k0k1mnN4N4K9K9l0k9k5k5k5k5
6004f58J4J5J4J4mlo3o3p2p3K6K6J8J8J9J8M5M5j3j4J7J7J7J7M1M0M0M1j0j0rj0L3L2MLk0
5988d48j9L7L6m1r1q9q9q5l6L2J00Q7L7oK4N6N7j%n4n3k5k4J5J5J3J3j8m9n9j0N7N8L0L1J
5973d98Jn6n6p1m2J1O0R4O6Lk6%%j2m1l3J6M5M6J4J4J4J4j5j5J5J5J2J2m3m3qM2M2pm2m2m5
5956e59m5j8j8j8j8KKKLm6m7J3J3LML3L3M1M0J1J2pooo%j%jlklll5l4mM6N7N8L1L1N7N7K7
5937c04K7jjo0o0o2o1llj5j5j5j5j8j9j8j9RQQQJ6J6J5J6LLLKj8j8j8j8K1K1l6l5j0L9N6K6
$$ plain form
5919 -545 -534 -552 -615 -678 -700 -723 -687 -651 -623 -595 -597 -599 -618 -636 -655 -673 -659 -644 -629 -615 -605 -596 -571 -574 -608 -642 -676 -711 -720 -700 -656 -583 -504 -455 -429 -433 -460 -487
5903 -487 -487 -486 -498 -511 -550 -590 -624 -629 -593 -558 -539 -550 -561 -542 -517 -493 -455 -388 -311 -263 -279 -323 -350 -376 -405 -433 -449 -465 -509 -552 -581 -581 -540 -499 -470 -471 -512
5887 -512 -553 -566 -549 -531 -544 -548 -553 -560 -566 -598 -629 -659 -689 -747 -775 -788 -801 -783 -717 -621 -525 -491 -486 -481 -447 -446 -446 -444 -441 -444 -446 -461 -506 -561 -616 -630 -616 -611 -606 -599 -593 -590 -587 -584
5868 -584 -581 -579 -577 -575 -573 -543 -513 -482 -452 -423 -393 -406 -448 -469 -490 -484 -478 -477 -476 -458 -470 -503 -536 -588 -610 -628 -647 -664 -680 -643 -605 -637 -668 -683 -697 -662 -628 -588 -549
5851 -549 -509 -470 -490 -511 -531 -551 -556 -562 -567 -572 -603 -635 -618 -601 -597 -593 -589 -585 -586 -588 -638 -688 -684 -679 -605 -502 -412 -371 -370 -399 -392 -355 -320 -315 -331 -346 -366 -434 -519 -605 -632 -610
5833 -610 -583 -555 -554 -553 -533 -514 -494 -475 -468 -462 -455 -448 -464 -479 -524 -569 -577 -584 -543 -501 -505 -508 -541 -573 -588 -603 -619 -634 -640 -646 -602 -559 -516 -474 -452 -480 -539 -598 -611 -624 -620
5815 -620 -616 -563 -480 -412 -392 -415 -468 -521 -574 -588 -553 -496 -439 -428 -417 -450 -484 -517 -551 -595 -639 -683 -726 -699 -671 -644 -616 -565 -513 -434 -404 -425 -446 -471 -495
5800 -495 -526 -558 -589 -621 -607 -592 -578 -564 -572 -580 -588 -595 -535 -475 -414 -354 -330 -306 -282 -259 -297 -335 -373 -412 -450 -488 -510 -474 -436 -398 -406 -413 -414 -415 -461 -507 -525 -483 -442
$$ packed form
5919e45J1j8o3o3k2k3L6L6K8K8kkj9j8j9j8J4J5J5J4J0RK5ll4l4l4l5rK0M4P3P9M9K6mk7k7
5903d87%Jj2j3l9m0l4nL6L5J9j1j1J9K5K4L8O7P7M8j6m4k7k6k9k8j6j6m4m3k9%M1M1K9jm1
5887e12m1j3J7J8j3mnpol2l1l0l0n8k8j3j3J8O6R6R6L4NNL4J%KLlkj5m5n5n5j4J4NNPOLLL
5868e84LKKKKL0L0L1L0K9L0j3m2k1k1OOJJJ8j2l3l3n2k2j8j9j7j6L7L8l2l1j5j4L5L4M0L9
5851e49M0L9k0k1k0k0nonnl1l2J7J7MMMMjkn0n0MNP4J03R0M1Jk9PL7L5Nj6j5k0o8q5q6k7K2
5833f10K7K8JJK0J9K0J9POPPj6j5m5m5qpM1M2mll3l2j5j5j6j5ooM4M3M3M2K2k8n9n9j3j3M
5815f20MN3Q3O8K0k3n3n3n3j4L5N7N7J1J1l3l4l3l4m4m4m4m3K7K8K7K8N1N2P9L0k1k1k5k4
5800d95l1l2l1l2J4J5J4J4qqqpO0O0O1O0K4K4K4K3l8l8l8l9l8l8k2L6L8L8qpjjm6m6j8M2M1
$$ plain form
5783 -442 -459 -517 -575 -587 -600 -552 -504 -456 -407 -418 -428 -487 -546 -552 -558 -534 -511 -490 -470 -478 -487 -492 -496 -501 -505 -512 -518 -524 -531 -566 -601 -637 -672 -642 -611 -580 -549 -535 -521 -506 -492
5765 -492 -470 -449 -398 -346 -311 -275 -288 -301 -363 -425 -487 -548 -602 -656 -660 -665 -636 -607 -607 -607 -624 -642 -610 -578 -565 -552 -589 -625 -628 -630 -633 -636 -646 -655 -665 -674 -610 -546 -483 -419
5748 -419 -392 -365 -338 -311 -318 -325 -316 -336 -378 -421 -465 -509 -540 -571 -569 -538 -473 -408 -393 -407 -427 -446 -468 -490 -492 -495 -543 -592 -603 -565 -488 -442 -418 -394 -402 -440 -482 -494
5731 -494 -458 -422 -393 -393 -406 -419 -413 -406 -400 -394 -390 -386 -383 -381 -399 -446 -476 -507 -527 -547 -567 -588 -581 -575 -553 -560 -572 -584 -598 -613 -588 -564 -541 -518 -501 -514 -510 -505 -490 -474 -458 -442
5713 -442 -448 -455 -459 -463 -475 -457 -439 -450 -501 -552 -572 -562 -534 -506 -476 -446 -471 -497 -522 -547 -594 -641 -656 -641 -614 -587 -588 -588 -585 -582 -609 -635 -665 -695 -696 -697 -681 -665 -679 -693
5696 -693 -677 -662 -647 -681 -739 -767 -762 -729 -687 -645 -629 -613 -610 -577 -560 -544 -553 -561 -587 -583 -574 -566 -555 -545 -546 -547 -577 -607 -643 -678 -662 -616 -567 -519 -501 -513 -527 -542 -529
5679 -529 -516 -503 -489 -504 -518 -533 -518 -471 -424 -390 -357 -353 -350 -352 -354 -404 -453 -485 -488 -490 -522 -567 -613 -612 -610 -609 -609 -608 -607 -630 -654 -676 -698 -667 -607 -548 -519 -524 -559 -577 -596
5661 -596 -637 -649 -626 -573 -521 -468 -416 -364 -337 -340 -329 -317 -292 -297 -288 -278 -261 -274 -317 -360 -390 -390 -380 -369 -384 -429 -504 -579 -658 -707 -721 -705 -660 -615 -569 -524 -497
$$ packed form
5783d42j7n8n8j2j3M8M8M8M9j1j0n9n9ooK4K3K1K0qrnmnmpoopl5l5l6l5L0L1L1L1J4J4J5J4
5765d92K2K1N1N2L5L6j3j3o2o2o2o1n4n4mnK9K9%%j7j8L2L2J3J3l7l6lkllj0rj0rO4O4O3O4
5748d19K7K7K7K7ppRk0m2m3m4m4l1l1KL1O5O5J5j4k0j9k2k2klm8m9j1L8P7M6K4K4ql8m2j2
5731d94L6L6K9%j3j3OPOOMMLKj8m7l0l1k0k0k0k1POK2pj2j2j4j5K5K4K3K3J7j3MNJ5J6J6J6
5713d42opmmj2J8J8j1n1n1k0J0K8K8L0L0k5k6k5k5m7m7j5J5K7K7j%LLk7k6l0l0jjJ6J6j4j4
5696f93J6J5J5l4n8k8NL3M2M2J6J6LL3J7J6rqk6MRQJ1J0jjl0l0l6l5J6M6M9M8J8j2j4j5J3
5679e29J3J3J4j5j4j5J5M7M7L4L3MLkkn0m9l2lkl2m5m6JKJ%JJk3k4k2k2L1O0N9K9nl5j8j9
5661e96m1j2K3N3N2N3N2N2K7lJ1J2K5nRJ0J7j3m3m3l0%J0J1j5m5p5p5p9m9j4J6M5M5M6M5K7
$$ plain form
5645 -497 -499 -484 -470 -428 -387 -345 -303 -272 -241 -182 -123 -78 -62 -77 -92 -132 -142 -97 -22 60 144 292 489 705 950 1306 1761 2052 1931 1452 914
5632 914 558 339 189 40 -63 -108 -166 -253 -349 -387 -388 -359 -325 -290 -284 -277 -250 -223 -196 -169 -157 -145 -163 -180 -234 -289 -388 -488 -536 -526 -500 -474 -500
5617 -500 -526 -552 -578 -594 -611 -598 -586 -559 -533 -576 -618 -591 -564 -567 -570 -592 -615 -637 -660 -712 -764 -767 -770 -732 -693 -654 -615 -582 -549 -545 -541 -550 -558 -613 -667 -705 -685 -628 -572
5600 -572 -551 -530 -577 -624 -677 -729 -732 -735 -738 -740 -713 -687 -607 -527 -448 -368 -356 -343 -331 -318 -357 -396 -406 -415 -435 -454 -518 -583 -600 -558 -506 -482 -490 -527 -578 -630 -645 -660
5584 -660 -645 -631 -619 -607 -595 -583 -587 -590 -594 -597 -603 -608 -613 -619 -612 -605 -598 -591 -564 -537 -510 -483 -505 -528 -550 -573 -545 -518 -519 -550 -563 -526 -469 -413 -421 -430 -468 -506 -525 -543 -562 -580
5566 -580 -562 -545 -527 -510 -506 -503 -499 -496 -475 -455 -464 -473 -451 -429 -429 -478 -528 -578 -601 -625 -626 -626 -637 -677 -705 -685 -605 -526 -486 -445 -434 -424 -452 -480 -508 -536 -586 -636 -637 -638
5548 -638 -601 -564 -514 -493 -515 -587 -659 -731 -766 -752 -717 -681 -689 -697 -705 -712 -713 -714 -715 -716 -717 -718 -719 -720 -675 -630 -584 -539 -526 -512 -499 -485 -492 -499 -505 -512 -533 -553 -574 -595 -574 -554 -484
5530 -484 -414 -372 -329 -336 -342 -366 -390 -414 -438 -423 -408 -393 -379 -387 -394 -402 -410 -454 -497 -512 -526 -524 -523 -472 -421 -407 -393 -378 -364 -372 -379 -358 -336 -312 -287 -311 -336 -403 -469 -495
$$ packed form
5645d97kJ5J4M2M1M2M2L1L1N9N9M5J6j5j5m0j0M5P5Q2Q4J48J97K16K45L56M55K91j21m79n38
5632I14l56k19j50j49j03m5n8q7r6l8jK9L4L5OPK7K7K7K7J2J2j8j7n4n5r9j00m8J0K6K6k6
5617e00k6k6k6j6j7J3J2K7K6m3m2K7K7llk2k3k2k3n2n2llL8L9L9L9L3L3MMrqn5n4l8K0N7N6
5600e72K1K1m7m7n3n2lllkK7K6Q0Q0P9Q0J2J3J2J3l9l9j0rk0j9o4o5j7M2N2K4ql7n1n2j5j5
5584f60J5J4J2J2J2J2mlmlonnoPPPPK7K7K7K7k2k3k2k3K8K7jl1j3L7N7N6qrl8l8j9j8j9j8
5566e80J8J7J8J7MLMLK1K0rrK2K2%m9n0n0k3k4j%j1m0k8K0Q0P9M0M1J1J0k8k8k8k8n0n0jj
5548f38L7L7N0K1k2p2p2p2l5J4L5L6qqqpjjjjjjjjM5M5M6M5J3J4J3J4ppopk1k0k1k1K1K0P0
5530d84P0M2M3pok4k4k4k4J5J5J5J4qpqqm4m3j5j4KJN1N1J4J4J5J4qpK1K2K4K5k4k5o7o6k6
$$ plain form
5512 -495 -472 -441 -410 -379 -349 -343 -386 -467 -548 -593 -590 -545 -500 -490 -480 -470 -461 -466 -472 -508 -543 -580 -617 -654 -691 -677 -663 -620 -576 -526 -475 -454 -433 -419 -405 -391 -376
5496 -376 -403 -429 -426 -422 -401 -379 -406 -434 -417 -400 -383 -366 -356 -345 -334 -323 -318 -314 -358 -402 -430 -457 -455 -454 -432 -410 -417 -425 -455 -485 -516 -546 -594 -641 -630 -570 -509 -478 -456
5479 -456 -434 -424 -415 -434 -453 -415 -377 -388 -399 -454 -509 -514 -520 -498 -475 -521 -568 -607 -647 -638 -629 -559 -490 -462 -483 -492 -501 -514 -526 -520 -514 -509 -503 -539 -576 -524 -473 -420 -367 -383
5462 -383 -399 -421 -443 -465 -487 -467 -447 -400 -353 -327 -349 -393 -437 -464 -492 -520 -548 -543 -538 -503 -469 -473 -477 -481 -485 -467 -449 -431 -413 -426 -438 -450 -462 -474 -487 -549 -610 -646
5446 -646 -681 -648 -614 -555 -496 -477 -506 -555 -576 -566 -557 -566 -576 -585 -595 -598 -601 -605 -608 -654 -699 -696 -693 -647 -602 -585 -569 -558 -547 -506 -466 -454 -443 -481 -519 -611 -703 -746 -789
5429 -789 -753 -716 -679 -643 -629 -616 -604 -592 -607 -652 -706 -711 -680 -620 -556 -523 -548 -574 -572 -570 -551 -531 -512 -493 -454 -414 -443 -473 -495 -517 -510 -503 -517 -531 -544 -558 -593
5413 -593 -628 -659 -691 -691 -642 -603 -595 -585 -576 -569 -561 -542 -522 -502 -483 -467 -452 -436 -420 -408 -397 -385 -373 -429 -484 -509 -484 -470 -455 -469 -531 -599 -667 -679 -690 -688 -686 -654
5396 -654 -623 -598 -574 -609 -643 -626 -608 -591 -573 -582 -591 -600 -610 -587 -564 -541 -518 -483 -448 -413 -378 -429 -481 -493 -475 -476 -525 -604 -683 -768 -854 -936 -969 -948 -898 -861 -824
$$ packed form
5512d95K3L1L1L1L0Om3q1q1m5LM5M5J0J0J0Rnol6l5l7l7l7l7J4J4M3M4N0N1K1K1J4J4J4J5
5496c76k7k6LMK1K2k7k8J7J7J7J7J0J1J1J1NMm4m4k8k7KJK2K2pql0l0l1l0m8m7J1O0O1L1K2
5479d56K2J0Rj9j9L8L8j1j1n5n5noK2K3m6m7l9m0RRP0O9K8k1rrj3j2OONOl6l7N2N1N3N3j6
5462c83j6k2k2k2k2K0K0M7M7K6k2m4m4k7k8k8k8NNL5L4mmmmJ8J8J8J8j3j2j2j2j2j3o2o1l6
5446f46l5L3L4N9N9J9k9m9k1J0Rrj0rj0llmlm6m5LLM6M5J7J6J1J1M1M0J2J1l8l8r2r2m3m3
5429g89L6L7L7L6J4J3J2J2j5m5n4nL1O0O4L3k5k6KKJ9K0J9J9L9M0k9l0k2k2PPj4j4j3j4l5
5413e93l5l1l2%M9L9QJ0RPQJ9K0K0J9J6J5J6J6J2J1J2J2n6n5k5K5J4J5j4o2o8o8j2j1KKL2
5396f54L1K5K4l5l4J7J8J7J8rrrj0K3K3K3K3L5L5L5L5n1n2j2J8jm9p9p9q5q6q2l3K1N0L7L7
$$ plain form
5380 -824 -778 -732 -686 -640 -649 -657 -692 -727 -727 -677 -598 -519 -436 -382 -382 -432 -491 -550 -554 -557 -555 -552 -550 -547 -549 -550 -551 -552 -585 -617 -649 -681 -694 -708 -691 -675 -653 -631 -554 -477 -438 -467
5362 -467 -533 -569 -573 -576 -634 -691 -707 -674 -637 -600 -554 -479 -395 -360 -386 -441 -499 -527 -527 -527 -525 -523 -549 -574 -541 -508 -459 -410 -391 -371 -391 -411 -430 -450 -468 -486 -475 -464
5345 -464 -432 -401 -428 -455 -508 -561 -554 -548 -550 -552 -553 -555 -592 -628 -635 -642 -629 -615 -661 -707 -723 -739 -696 -653 -624 -596 -568 -540 -555 -571 -586 -602 -584 -567 -549 -531 -471 -412 -383
5329 -383 -403 -459 -514 -543 -572 -603 -634 -662 -642 -576 -511 -501 -491 -464 -437 -439 -442 -475 -508 -511 -515 -503 -491 -480 -468 -443 -419 -453 -487 -517 -547 -577 -607 -590 -572 -554 -536
5313 -536 -548 -560 -572 -584 -574 -563 -553 -543 -519 -495 -471 -447 -423 -398 -413 -457 -499 -491 -415 -339 -341 -343 -345 -346 -344 -342 -339 -337 -346 -356 -366 -376 -423 -470 -517 -564 -597 -629 -603 -528
5295 -528 -442 -386 -382 -407 -425 -444 -464 -484 -493 -502 -540 -578 -562 -547 -532 -517 -496 -476 -456 -436 -435 -434 -482 -529 -538 -547 -556 -565 -601 -636 -685 -704 -688 -622 -536 -479 -463 -447 -433
5278 -433 -419 -418 -416 -445 -473 -485 -496 -508 -520 -506 -493 -477 -462 -420 -348 -267 -236 -265 -324 -370 -416 -446 -476 -506 -537 -512 -487 -463 -438 -406 -374 -342 -310 -355 -400 -445
5263 -445 -490 -491 -491 -446 -401 -391 -429 -509 -589 -648 -708 -718 -728 -723 -717 -682 -646 -613 -580 -615 -650 -642 -634 -627 -619 -593 -568 -542 -516 -511 -506 -500 -495 -522 -548 -575 -601 -610 -619 -628 -637 -633 -630 -577
$$ packed form
5380h24M6M6M6M6rql5l5%N0P9P9Q3N4%n0n9n9mlKLKLkjjjl3l2l2l2j3j4J7J6K2K2P7P7L9k9
5362d67o6l6mln8n7j6L3L7L7M6P5Q4L5k6n5n8k8%%KKk6k5L3L3M9M9J9K0k0k0j9k0j8j8J1J1
5345d64L2L1k7k7n3n3POkkjkl7l6ppJ3J4m6m6j6j6M3M3K9K8K8K8j5j6j5j6J8J7J8J8O0N9K9
5329c83k0n6n5k9k9l1l1k8K0O6O5J0J0K7K7kll3l3lmJ2J2J1J2K5K4l4l4l0l0l0l0J7J8J8J8
5313e36j2j2j2j2J0J1J0J0K4K4K4K4K4K5j5m4m2QP6P6kkkjKKLKrj0j0j0m7m7m7m7l3l2K6P5
5295e28Q6N6Mk5j8j9k0k0rrl8l8J6J5J5J5K1K0K0K0JJm8m7rrrrl6l5m9j9J6O6Q6N7J6J6J4
5278d33J4JKk9k8j2j1j2j2J4J3J6J5M2P2Q1L1k9n9m6m6l0l0l0l1K5K5K4K5L2L2L2L2m5m5m5
5263d45m5j%M5M5J0l8q0q0n9o0j0j0NOL5L6L3L3l5l5QQPQK6K5K6K6NNONk7k6k7k6rrrrMLN3
$$ plain form
5244 -577 -525 -485 -446 -435 -425 -449 -472 -496 -519 -516 -512 -460 -407 -397 -386 -425 -464 -508 -552 -531 -509 -502 -544 -604 -664 -678 -643 -566 -490 -459 -427 -445 -462 -503 -544 -536 -528
5228 -528 -507 -486 -465 -444 -423 -403 -431 -460 -540 -620 -651 -682 -658 -633 -608 -583 -553 -523 -522 -521 -525 -529 -562 -595 -573 -552 -531 -509 -512 -514 -546 -578 -614 -651 -599 -546 -483 -419
5211 -419 -404 -390 -416 -442 -469 -495 -491 -487 -457 -427 -417 -457 -515 -573 -593 -565 -534 -504 -481 -459 -407 -355 -337 -319 -330 -342 -340 -338 -385 -432 -481 -531 -512 -493 -456 -419 -431
5195 -431 -444 -515 -586 -658 -729 -744 -759 -745 -730 -700 -670 -640 -610 -568 -525 -541 -557 -552 -547 -541 -536 -525 -514 -557 -600 -631 -592 -517 -471 -484 -497 -512 -527 -558 -589 -577 -536
5179 -536 -474 -411 -349 -287 -287 -317 -330 -344 -342 -340 -340 -339 -371 -432 -477 -522 -540 -558 -536 -484 -450 -446 -453 -459 -470 -480 -534 -559 -535 -481 -460 -508 -588 -639 -612 -585 -579 -573 -567 -561 -569
5161 -569 -577 -601 -596 -567 -538 -507 -476 -487 -497 -508 -519 -552 -586 -637 -657 -639 -620 -599 -578 -584 -590 -596 -602 -608 -614 -620 -626 -622 -618 -597 -606 -645 -684 -667 -649 -632 -614 -627 -639 -615 -592
5143 -592 -569 -545 -552 -558 -578 -627 -691 -755 -779 -773 -742 -712 -679 -647 -604 -560 -517 -473 -443 -412 -384 -355 -392 -459 -537 -566 -549 -531 -510 -490 -497 -503 -481 -458 -411 -364 -348
5127 -348 -381 -444 -507 -474 -442 -440 -438 -436 -434 -417 -400 -386 -373 -389 -455 -549 -643 -696 -699 -701 -703 -699 -694 -631 -567 -528 -488 -449 -410 -395 -381 -367 -353 -351 -350 -348 -346 -384 -422 -460 -497
$$ packed form
5244e77N2M0L9J1J0k4k3k4k3LMN2N3J0J1l9l9m4m4K1K2Pm2o0o0j4L5P7P6L1L2j8j7m1m1QQ
5228e28K1K1K1K1K1K0k8k9q0q0l1l1K4K5K5K5L0L0JJmml3l3K2K1K1K2lkl2l2l6l7N2N3O3O4
5211d19J5J4k6k6k7k6MML0L0J0m0n8n8k0K8L1L0K3K2N2N2J8J8j1j2KKm7m7m9n0J9J9L7L7j2
5195d31j3p1p1p2p1j5j5J4J5L0L0L0L0M2M3j6j6NNONJ1J1m3m3l1L9P5M6j3j3j5j5l1l1J2M1
5179e36O2O3O2O2%l0j3j4KK%Jl2o1m5m5j8j8K2N2L4Mpoj1j0n4k5K4N4K1m8q0n1K7K7OOOOq
5161e69qk4NK9K9L1L1j1j0j1j1l3l4n1k0J8J9K1K1ooooooooMMK1rl9l9J7J8J7J8j3j2K4K3
5143e92K3K4pok0m9o4o4k4OL1L0L3L2M3M4M3M4L0L1K8K9l7o7p8k9J7J8K1K0poK2K3M7M7J6
5127c48l3o3o3L3L2KKKKJ7J7J4J3j6o6r4r4n3lkkMNO3O4L9M0L9L9J5J4J4J4KJKKl8l8l8l7
$$ plain form
5110 -497 -494 -490 -486 -482 -491 -499 -508 -516 -525 -533 -542 -550 -525 -501 -476 -451 -483 -514 -546 -578 -567 -557 -547 -537 -544 -551 -558 -565 -575 -586 -596 -607 -639 -671 -704 -736 -757 -777 -798 -819 -793 -767 -740
5091 -740 -714 -694 -673 -653 -632 -619 -606 -593 -580 -553 -526 -499 -472 -495 -518 -541 -564 -586 -608 -601 -594 -548 -502 -515 -528 -530 -533 -535 -538 -551 -565 -578 -592 -578 -565 -551 -538 -494
5075 -494 -450 -392 -363 -396 -457 -505 -552 -583 -615 -645 -675 -642 -579 -535 -490 -483 -505 -539 -574 -616 -658 -647 -607 -556 -505 -484 -462 -462 -492 -504 -517 -521 -525 -529 -533 -530 -526 -522 -519 -515
5057 -515 -511 -508 -504 -498 -493 -488 -482 -504 -525 -547 -569 -572 -576 -596 -587 -544 -502 -441 -410 -429 -448 -466 -484 -493 -453 -424 -424 -435 -445 -430 -415 -401 -416 -464 -512 -548 -584 -588 -562 -539 -517
5039 -517 -493 -468 -447 -425 -433 -472 -513 -525 -508 -491 -472 -482 -523 -564 -584 -574 -552 -529 -522 -514 -535 -557 -568 -578 -587 -596 -555 -484 -415 -376 -386 -426 -480 -535 -540 -546 -486 -426
5023 -426 -400 -422 -486 -550 -596 -643 -659 -676 -656 -635 -642 -649 -647 -615 -571 -575 -616 -628 -588 -518 -463 -407 -350 -293 -281 -270 -259 -247 -265 -283 -301 -319 -345 -371 -397 -423 -484
5007 -484 -544 -564 -534 -494 -453 -459 -464 -492 -519 -498 -476 -458 -440 -426 -411 -421 -480 -539 -549 -529 -508 -485 -461 -496 -531 -567 -602 -651 -701 -750 -799 -792 -784 -728 -671 -667 -663 -659
4990 -659 -655 -638 -621 -653 -684 -666 -648 -660 -671 -699 -727 -667 -606 -563 -519 -524 -529 -524 -519 -514 -509 -550 -591 -583 -575 -516 -458 -448 -439 -457 -475 -463 -452 -471 -491 -510 -529 -510 -491 -472
$$ packed form
5110d97LMMMrqrqrqrqK5K4K5K5l2l1l2l2J1J0J0J0ppppj0j1j0j1l2l2l3l2k1k0k1k1K6K6K7
5091g40K6K0K1K0K1J3J3J3J3K7K7K7K7k3k3k3k3k2k2PPM6M6j3j3klklj3j4j3j4J4J3J4J3M4
5075d94M4N8K9l3o1m8m7l1l2l0l0L3O3M4M5Pk2l4l5m2m2J1M0N1N1K1K2%l0j2j3mmmmLMMLM
5057e15MLMONNOk2k1k2k2lmk0RM3M2O1L1j9j9j8j8rM0K9%j1j0J5J5J4j5m8m8l6l6mK6K3K2
5039e17K4K5K1K2ql9m1j2J7J7J9j0m1m1k0J0K2K3PQk1k2j1j0rrM1P1O9L9j0m0n4n5noO0O0
5023d26K6k2o4o4m6m7j6j7K0K1ppKL2M4mm1j2M0P0N5N6N7N7J2J1J1J2j8j8j8j8k6k6k6k6o1
5007d84o0k0L0M0M1onk8k7K1K2J8J8J4J5j0n9n9j0K0K1K3K4l5l5l6l5m9n0m9m9PQN6N7MMM
4990f59MJ7J7l2l1J8J8j2j1k8k8O0O1M3M4nnNNNNm1m1QQN9N8J0Rj8j8J2J1j9k0j9j9J9J9J9
$$ plain form
4973 -472 -453 -471 -490 -511 -532 -536 -570 -615 -610 -567 -523 -509 -524 -561 -599 -638 -677 -708 -739 -769 -798 -775 -722 -670 -646 -628 -610 -596 -582 -583 -613 -627 -641 -639 -637 -635 -632 -618
4957 -618 -604 -591 -579 -605 -660 -713 -737 -725 -683 -657 -630 -632 -635 -635 -636 -628 -591 -554 -546 -553 -561 -572 -583 -604 -655 -688 -720 -720 -690 -678 -666 -632 -628 -625 -593 -532 -500 -518 -566 -576
4939 -576 -538 -502 -514 -568 -622 -648 -645 -626 -636 -656 -675 -671 -637 -601 -594 -595 -566 -556 -546 -514 -481 -448 -416 -391 -365 -342 -319 -355 -420 -469 -518 -538 -558 -594 -601 -572 -542
4923 -542 -483 -424 -360 -325 -326 -357 -409 -460 -512 -563 -560 -527 -510 -494 -484 -474 -464 -454 -468 -482 -496 -510 -532 -553 -526 -499 -464 -429 -423 -417 -411 -406 -449 -492 -577 -661 -710 -700
4907 -700 -660 -620 -577 -534 -542 -551 -560 -568 -565 -562 -558 -555 -499 -442 -440 -496 -575 -624 -621 -559 -492 -454 -450 -504 -553 -572 -562 -552 -535 -518 -530 -542 -558 -573 -589 -604 -626 -647 -669 -690
4889 -690 -645 -599 -508 -416 -370 -383 -452 -520 -605 -690 -788 -857 -848 -781 -680 -608 -601 -594 -560 -525 -516 -507 -497 -488 -448 -408 -436 -464 -471 -478 -485 -492 -495 -497 -500 -503 -513 -523 -533 -543 -534 -525
4871 -525 -517 -508 -503 -499 -544 -588 -592 -597 -601 -605 -637 -668 -631 -594 -547 -499 -500 -502 -500 -498 -467 -436 -450 -465 -479 -494 -523 -553 -583 -613 -633 -654 -674 -694 -711 -729 -713 -669 -598 -527 -475
4853 -475 -473 -500 -528 -529 -531 -547 -564 -530 -467 -401 -365 -340 -315 -276 -237 -251 -294 -341 -389 -437 -485 -528 -541 -524 -507 -511 -545 -564 -583 -618 -683 -748 -783 -770 -758 -744 -729
$$ packed form
4973d72J9j8j9k1k1ml4m5NM3M4J4j5l7l8l9l9l1l1l0k9K3N3N2K4J8J8J4J4jl0j4j4KKKLJ4
4957f18J4J3J2k6n5n3k4J2M2K6K7kl%jQL7L7Qpqj1j1k1n1l3l2%L0J2J2L4MLL2O1L2j8m8j0
4939e76L8L6j2n4n4k6LJ9j0k0j9ML4L6PjK9J0J0L2L3L3L2K5K6K3K3l6o5m9m9k0k0l6pK9L0
4923e42N9N9O4L5jl1n2n1n2n1LL3J7J6J0J0J0J0j4j4j4j4k2k1K7K7L5L5OOONm3m3q5q4m9J0
4907g00M0M0M3M3qrrqLLMLN6N7Kn6p9m9LO2O7L8Mn4m9j9J0J0J7J7j2j2j6j5j6j5k2k1k2k1
4889f90M5M6R1R2M6j3o9o8q5q5r8o9RO7J01P2PPL4L5RRJ0RM0M0k8k8pppplkllj0j0j0j0RR
4871e25QRNMm5m4mnmml2l1L7L7M7M8jkKKL1L1j4j5j4j5k9l0l0l0k0k1k0k0j7j8J6M4P1P1N2
4853d75Kk7k8jkj6j7L4O3O6L6K5K5L9L9j4m3m7m8m8m8m3j3J7J7ml4j9j9l5o5o5l5J3J2J4J5
$$ plain form
4837 -729 -698 -667 -636 -605 -588 -571 -554 -537 -497 -456 -429 -431 -444 -457 -426 -394 -383 -403 -407 -412 -425 -469 -495 -522 -533 -544 -556 -567 -532 -496 -463 -429 -427 -453 -463 -473 -455
4821 -455 -437 -419 -401 -375 -349 -336 -352 -395 -437 -433 -428 -437 -447 -456 -465 -483 -502 -550 -597 -632 -667 -669 -642 -602 -563 -551 -539 -510 -481 -452 -423 -423 -423 -452 -482 -522 -562 -572 -552
4804 -552 -516 -509 -553 -596 -615 -635 -651 -667 -653 -591 -539 -517 -544 -571 -570 -569 -540 -511 -531 -551 -555 -558 -561 -564 -533 -502 -471 -440 -431 -423 -464 -534 -586 -589 -592 -595 -627 -659 -690 -722 -661
4787 -661 -601 -540 -479 -494 -508 -523 -537 -505 -473 -441 -409 -439 -469 -499 -529 -512 -495 -478 -461 -494 -528 -561 -594 -595 -596 -598 -599 -569 -539 -509 -479 -500 -521 -542 -563 -617 -671
4771 -671 -664 -608 -567 -525 -480 -436 -363 -291 -268 -245 -248 -252 -295 -387 -479 -542 -552 -533 -522 -510 -497 -483 -505 -527 -549 -571 -571 -570 -570 -570 -573 -575 -578 -581 -571 -561 -552 -542 -528 -514 -501
4753 -501 -487 -480 -474 -467 -461 -438 -415 -392 -369 -341 -312 -333 -353 -427 -501 -575 -649 -665 -682 -650 -618 -574 -529 -534 -539 -521 -502 -484 -465 -471 -476 -481 -486 -493 -501 -517 -564 -591 -569 -492 -414
4735 -414 -359 -353 -387 -422 -463 -503 -515 -526 -519 -512 -551 -590 -606 -574 -504 -434 -406 -428 -471 -514 -547 -580 -583 -586 -552 -517 -483 -449 -420 -390 -430 -469 -521 -573 -623 -672 -661
4719 -661 -600 -551 -531 -524 -517 -511 -505 -500 -495 -489 -484 -528 -573 -617 -661 -694 -727 -731 -734 -697 -660 -645 -678 -744 -809 -817 -775 -712 -649 -612 -575 -551 -528 -505 -481 -488 -494 -472 -449 -436 -423
$$ packed form
4837g29L1L1L1L1J7J7J7J7M0M1K7kj3j3L1L2J1k0mnj3m4k6k7j1j1j2j1L5L6L3L4Kk6j0j0J8
4821d55J8J8J8K6K6J3j6m3m2MNrj0rrj8j9m8m7l5l5kK7M0L9J2J2K9K9K9K9%%k9l0m0m0j0K0
4804e52L6Pm4m3j9k0j6j6J4O2N2K2k7k7JJK9K9k0k0mlllL1L1L1L1RQm1p0n2llll2l2l1l2O1
4787f61O0O1O1j5j4j5j4L2L2L2L2l0l0l0l0J7J7J7J7l3l4l3l3jjkjL0L0L0L0k1k1k1k1n4n4
4771f71PN6M1M2M5M4P3P2K3K3lmm3r2r2o3j0J9J1J2J3J4k2k2k2k2%J%%lkllJ0J0RJ0J4J4J3
4753e01J4POPOK3K3K3K3K8K9k1k0p4p4p4p4j6j7L2L2M4M5nnJ8J9J8J9onnnpqj6m7k7K2P7P8
4735d14N5Ol4l5m1m0j2j1PPl9l9j6L2P0P0K8k2m3m3l3l3llL4L5L4L4K9L0m0l9n2n2n0m9J1
4719f61O1M9K0PPOONNONm4m5m4m4l3l3mlL7L7J5l3o6o5qM2O3O3L7L7K4K3K3K4poK2K3J3J3
$$ plain form
4701 -423 -479 -535 -592 -650 -658 -666 -695 -724 -705 -685 -635 -585 -584 -583 -630 -677 -737 -768 -752 -687 -631 -605 -569 -533 -498 -464 -473 -482 -491 -501 -536 -572 -559 -545 -543 -541 -568 -595 -571
4684 -571 -547 -524 -500 -491 -481 -472 -462 -455 -447 -440 -432 -413 -393 -373 -354 -398 -443 -487 -531 -573 -614 -683 -703 -665 -626 -585 -544 -557 -570 -584 -597 -626 -655 -655 -655 -703 -751 -778 -755
4668 -755 -726 -696 -663 -630 -615 -600 -635 -669 -675 -682 -640 -597 -546 -494 -492 -490 -527 -564 -602 -639 -628 -617 -606 -595 -563 -531 -486 -470 -533 -645 -746 -818 -828 -808 -805 -802 -804
4651 -804 -836 -879 -873 -842 -812 -778 -744 -703 -662 -621 -580 -531 -482 -437 -392 -426 -528 -618 -658 -669 -649 -627 -634 -665 -695 -727 -760 -780 -800 -817 -834 -809 -735 -674 -643
4636 -643 -644 -674 -706 -709 -674 -639 -604 -569 -544 -548 -552 -527 -492 -458 -454 -479 -506 -533 -551 -539 -520 -529 -570 -610 -612 -614 -615 -617 -634 -651 -668 -685 -664 -643 -605 -597 -589 -582 -576 -570 -591 -612
4618 -612 -650 -658 -619 -579 -549 -548 -575 -572 -541 -510 -492 -503 -528 -552 -570 -588 -574 -530 -478 -426 -425 -452 -480 -507 -537 -566 -583 -599 -616 -632 -607 -581 -554 -527 -518 -480 -441
4602 -441 -433 -458 -484 -511 -539 -575 -611 -598 -585 -575 -565 -528 -491 -485 -527 -589 -651 -679 -678 -643 -578 -514 -479 -474 -470 -482 -493 -505 -517 -552 -587 -638 -660 -627 -594 -559 -525
4586 -525 -492 -459 -409 -389 -439 -488 -536 -583 -570 -488 -429 -399 -424 -448 -475 -502 -506 -511 -515 -520 -541 -563 -583 -603 -576 -520 -453 -434 -441 -448 -458 -468 -474 -480 -516 -551 -585 -620 -585
$$ packed form
4701d23n6n6n7n8qqk9k9J9K0N0N0JJm7m7o0l1J6O5N6K6L6L6L5L4rrrj0l5l6J3J4KKk7k7K4
4684e71K4K3K4RJ0RJ0PQPQJ9K0K0J9m4m5m4m4m2m1o9k0L8L9M1M1j3j3j4j3k9k9%%m8m8k7K3
4668g55K9L0L3L3J5J5l5l4opM2M3N1N2KKl7l7l8l7J1J1J1J1L2L2M5J6o3j12j01p2j0K0LLk
4651h04l2m3OL1L0L4L4M1M1M1M1M9M9M5M5l4j02r0m0j1K0K2pl1l0l2l3k0k0j7j7K5P4O1L1
4636f43jl0l2lL5L5L5L5K5mmK5L5L4Mk5k7k7j8J2J9rm1m0kkjkj7j7j7j7K1K1L8QQPOOk1k1
4618f12l8qL9M0L0Jk7LL1L1J8j1k5k4j8j8J4M4N2N2Jk7k8k7l0k9j7j6j7j6K5K6K7K7RL8L9
4602d41Qk5k6k7k8l6l6J3J3J0J0L7L7Om2o2o2k8JL5O5O4L5NMj2j1j2j2l5l5n1k2L3L3L5L4
4586e25L3L3N0K0n0m9m8m7J3Q2N9L0k5k4k7k7mnmnk1k2k0k0K7N6O7J9ppj0j0ool6l5l4l5L5
$$ plain form
4569 -585 -551 -538 -526 -543 -560 -585 -610 -606 -602 -582 -562 -543 -523 -556 -589 -593 -596 -619 -641 -710 -778 -827 -828 -777 -677 -579 -510 -490 -470 -485 -501 -516 -532 -510 -488 -466 -444
4553 -444 -459 -473 -487 -501 -508 -515 -524 -532 -583 -663 -753 -793 -763 -703 -640 -607 -616 -625 -587 -549 -479 -409 -380 -401 -445 -489 -507 -524 -529 -534 -539 -544 -523 -502 -531 -559 -543 -526 -510 -493
4536 -493 -482 -470 -460 -450 -499 -577 -617 -609 -548 -487 -492 -496 -493 -490 -487 -483 -533 -582 -610 -589 -561 -533 -547 -562 -566 -522 -456 -390 -403 -416 -429 -442 -417 -392 -366 -341 -335 -330 -294 -259
4518 -259 -253 -247 -287 -327 -375 -374 -315 -256 -239 -271 -322 -343 -354 -365 -375 -384 -385 -386 -387 -388 -396 -404 -439 -473 -497 -473 -429 -386 -386 -434 -505 -575 -610 -646 -612 -579 -518 -457 -446 -434
4501 -434 -469 -504 -538 -571 -614 -627 -599 -522 -453 -432 -450 -468 -475 -481 -458 -406 -360 -363 -405 -447 -438 -429 -470 -510 -554 -599 -614 -629 -598 -566 -535 -503 -519 -535 -551 -567 -561 -555
4485 -555 -519 -484 -452 -419 -436 -453 -454 -456 -457 -459 -460 -460 -490 -520 -583 -646 -686 -677 -613 -519 -460 -450 -446 -443 -414 -355 -311 -317 -362 -407 -427 -446 -496 -545 -586 -628 -640 -652 -631 -609
4467 -609 -559 -508 -508 -507 -556 -604 -631 -657 -634 -612 -595 -578 -590 -603 -579 -554 -530 -506 -498 -491 -484 -477 -454 -431 -458 -484 -498 -511 -524 -537 -553 -570 -584 -598 -581 -534 -471 -467
4451 -467 -494 -520 -551 -581 -554 -526 -498 -470 -473 -475 -477 -480 -484 -489 -465 -440 -408 -377 -395 -412 -446 -480 -465 -450 -424 -398 -401 -405 -429 -453 -428 -403 -364 -326 -336 -347 -395 -443 -477
$$ packed form
4569e85L4J3J2j7j7k5k5MMK0K0J9K0l3l3mlk3k2o9o8m9jN1J00R8O9K0K0j5j6j5j6K2K2K2K2
4553d44j5j4j4j4pprqn1q0r0m0L0O0O3L3rrL8L8P0P0K9k1m4m4j8j7nnnnK1K1k9k8J6J7J6J7
4536d93J1J2J0J0m9p8m0QO1O1nmLLLMn0m9k8K1K8K8j4j5mM4O6O6j3j3j3j3K5K5K6K5ONL6L5
4518b59OOm0m0m8JN9N9J7l2n1k1j1j1j0rjjjjqql5l4k4K4M4M3%m8p1p0l5l6L4L3O1O1J1J2
4501d34l5l5l4l3m3j3K8P7O9K1j8j8poK3N2M6lm2m2RRm1m0m4m5j5j5L1L2L1L2j6j6j6j6OO
4485e55L6L5L2L3j7j7jkjkj%l0l0o3o3m0RO4R4N9J0MLK9N9M4om5m5k0j9n0m9m1m2j2j2K1K2
4467f09N0N1%Jm9m8k7k6K3K2J7J7j2j3K4K5K4K4QPPPK3K3k7k6j4j3j3j3j6j7j4j4J7M7O3M
4451d67k7k6l1l0K7K8K8K8lkklmnK4K5L2L1j8j7l4l4J5J5K6K6lmk4k4K5K5L9L8j0j1m8m8l4
$$ plain form
4434 -477 -452 -420 -419 -467 -544 -606 -638 -617 -566 -524 -482 -468 -453 -440 -426 -442 -458 -481 -504 -528 -551 -533 -516 -498 -481 -463 -445 -428 -410 -405 -400 -395 -390 -385 -380 -375 -369 -376 -382 -388 -394
4416 -394 -452 -510 -568 -625 -612 -599 -586 -573 -601 -630 -658 -687 -690 -693 -694 -694 -660 -578 -522 -467 -455 -442 -429 -416 -403 -390 -377 -364 -414 -465 -515 -565 -622 -678 -704 -681 -603
4400 -603 -526 -505 -484 -492 -500 -508 -516 -457 -399 -344 -289 -277 -314 -324 -334 -350 -367 -384 -400 -417 -433 -450 -466 -467 -467 -467 -467 -480 -492 -504 -517 -506 -494 -483 -472 -442 -412 -382 -353
4383 -353 -310 -268 -285 -301 -347 -393 -439 -485 -551 -617 -624 -631 -579 -528 -476 -424 -411 -398 -444 -490 -512 -533 -555 -576 -649 -722 -736 -750 -714 -678 -586 -494 -441 -437 -464 -491
4368 -491 -485 -478 -472 -465 -484 -502 -521 -539 -574 -608 -584 -559 -498 -437 -362 -317 -342 -416 -481 -517 -527 -537 -545 -553 -561 -569 -577 -585 -603 -621 -666 -660 -596 -502 -442 -450 -490 -530 -515 -500 -490
4350 -490 -480 -470 -460 -496 -532 -569 -605 -575 -545 -515 -485 -511 -536 -561 -587 -569 -551 -534 -516 -510 -504 -557 -610 -636 -662 -629 -596 -587 -579 -570 -562 -533 -505 -477 -449 -472 -495 -488
4333 -488 -433 -368 -333 -358 -413 -445 -448 -470 -491 -485 -479 -473 -466 -494 -521 -549 -576 -585 -594 -544 -494 -469 -443 -417 -392 -409 -426 -444 -461 -456 -452 -447 -443 -464 -485 -507 -528 -582 -636 -621
4316 -621 -557 -505 -483 -500 -518 -537 -557 -517 -478 -472 -466 -459 -453 -422 -390 -417 -444 -445 -447 -448 -450 -474 -498 -523 -547 -510 -472 -468 -512 -584 -684 -796 -859 -849 -791 -740 -719 -737
$$ packed form
4434d77K5L2Jm8p7o2l2K1N1M2M2J4J5J3J4j6j6k3k3k4k3J8J7J8J7J8J8J7J8NNNNNNNOpooo
4416c94n8n8n8n7J3J3J3J3k8k9k8k9llj%L4Q2N6N5J2J3J3J3J3J3J3J3n0n1n0n0n7n6k6K3P8
4400f03P7K1K1qqqqN9N8N5N5J2l7j0j0j6j7j7j6j7j6j7j6j%%%j3j2j2j3J1J2J1J1L0L0L0K9
4383c53M3M2j7j6m6m6m6m6o6o6ppN2N1N2N2J3J3m6m6k2k1k2k1p3p3j4j4L6L6R2R2N3Mk7k7
4368d91OPOPj9j8j9j8l5l4K4K5O1O1P5M5k5p4o5l6j0j0qqqqqqj8j8m5OO4R4O0qm0m0J5J5J0
4350d90J0J0J0l6l6l7l6L0L0L0L0k6k5k5k6J8J8J7J8OOn3n3k6k6L3L3RQRQK9K8K8K8k3k3P
4333d88N5O5L5k5n5l2lk2k1OOOPk8k7k8k7rrN0N0K5K6K6K5j7j7j8j7NMNMk1k1k2k1n4n4J5
4316f21O4N2K2j7j8j9k0M0L9OOPOL1L2k7k7jkjkk4k4k5k4L7L8Mm4p2j00j12o3J0N8N1K1j8
$$ plain form
4299 -737 -755 -775 -795 -742 -690 -637 -585 -525 -466 -466 -465 -463 -462 -460 -458 -467 -475 -483 -492 -500 -509 -517 -525 -506 -487 -468 -449 -430 -411 -392 -373 -363 -353 -343 -333 -369 -406 -442 -479 -475 -472 -468 -464 -474
4280 -474 -484 -493 -503 -520 -538 -496 -454 -420 -385 -410 -434 -425 -416 -407 -398 -425 -451 -478 -504 -543 -581 -620 -658 -669 -679 -630 -582 -546 -510 -474 -438 -460 -482 -503 -525 -562 -599
4264 -599 -635 -672 -682 -692 -701 -711 -658 -604 -550 -496 -470 -443 -416 -390 -416 -442 -466 -490 -493 -467 -430 -442 -483 -524 -509 -494 -456 -418 -379 -341 -322 -303 -284 -264 -292 -319
4249 -319 -347 -374 -374 -375 -375 -375 -315 -256 -255 -254 -306 -359 -412 -464 -524 -584 -546 -508 -501 -495 -488 -482 -469 -457 -444 -432 -430 -429 -428 -426 -403 -379 -356 -333 -331 -329 -327 -326 -323 -320 -376 -432 -469 -507 -544
4229 -544 -582 -579 -576 -514 -452 -420 -388 -414 -441 -472 -502 -473 -445 -474 -502 -531 -559 -541 -523 -505 -487 -465 -443 -480 -516 -511 -507 -443 -379 -347 -316 -284 -253 -274 -295 -316 -337
4213 -337 -318 -299 -280 -260 -303 -345 -387 -429 -451 -472 -493 -515 -536 -558 -579 -601 -594 -587 -580 -573 -588 -603 -549 -445 -348 -281 -264 -297 -313 -329 -349 -368 -377 -386 -395 -404 -416 -429
4197 -429 -441 -454 -449 -444 -495 -545 -536 -477 -430 -412 -436 -460 -486 -512 -487 -461 -436 -411 -401 -391 -382 -372 -413 -454 -436 -418 -365 -312 -262 -212 -217 -271 -297 -323 -332 -342 -351 -360 -401
4180 -401 -443 -481 -519 -524 -480 -447 -443 -451 -460 -470 -481 -493 -504 -516 -528 -577 -625 -615 -605 -582 -559 -567 -625 -706 -787 -773 -760 -738 -716 -655 -565 -488 -460 -462 -463 -465 -467 -528 -589
$$ packed form
4299g37j8k0k0N3N2N3N2O0N9%JKJKKrqqrqrqqJ9J9J9J9J9J9J9J9J0J0J0J0l6l7l6l7MLMMj0
4280d74j0rj0j7j8M2M2L4L5k5k4RRRRk7k6k7k6l9l8l9l8j1j0M9M8L6L6L6L6k2k2k1k2l7l7
4264e99l6l7j0j0rj0N3N4N4N4K6K7K7K6k6k6k4k4lK6L7j2m1m1J5J5L8L8L9L8J9J9J9K0k8k7
4249c19k8k7%j%%O0N9JJn2n3n3n2o0o0L8L8POPOJ3J2J3J2KJJKK3K4K3K3KKKJLLn6n6l7l8l7
4229e44l8LLO2O2L2L2k6k7l1l0K9K8k9k8k9k8J8J8J8J8K2K2l7l6NMO4O4L2L1L2L1k1k1k1k1
4213c37J9J9J9K0m3m2m2m2k2k1k1k2k1k2k1k2PPPPj5j5N4J04R7O7J7l3j6j6k0j9rrrrj2j3
4197d29j2j3NNn1n0RN9M7J8k4k4k6k6K5K6K5K5J0J0RJ0m1m1J8J8N3N3N0N0nn4k6k6rj0rrm1
4180d01m2l8l8nM4L3Mqrj0j1j2j1j2j2m9m8J0J0K3K3qn8q1q1J4J3K2K2O1R0P7K8kjkko1o1
$$ plain form
4163 -589 -620 -651 -682 -714 -679 -644 -609 -574 -566 -559 -551 -543 -580 -618 -656 -693 -689 -685 -681 -677 -681 -685 -690 -694 -698 -703 -707 -711 -664 -616 -569 -521 -555 -588 -622 -655 -647 -639 -659 -629 -558 -486 -470 -454
4144 -454 -493 -532 -571 -611 -617 -623 -629 -635 -608 -582 -555 -529 -539 -549 -500 -452 -391 -331 -329 -328 -350 -373 -396 -419 -424 -430 -435 -440 -462 -485 -507 -530 -526 -522 -518 -514 -498 -481 -465 -449 -449 -449 -449
4125 -449 -449 -427 -405 -383 -361 -324 -288 -254 -221 -212 -253 -325 -397 -438 -479 -520 -561 -551 -542 -477 -412 -362 -362 -393 -423 -443 -462 -481 -500 -494 -489 -483 -477 -498 -520 -541 -562 -543 -525
4108 -525 -506 -487 -484 -481 -420 -358 -345 -332 -319 -306 -311 -317 -322 -328 -351 -374 -397 -420 -431 -442 -453 -464 -467 -470 -472 -475 -478 -481 -484 -486 -467 -447 -427 -407 -362 -316 -329 -343 -389 -436 -483 -529
4090 -529 -546 -563 -607 -602 -553 -503 -529 -584 -594 -554 -527 -530 -534 -538 -486 -433 -421 -409 -396 -384 -367 -350 -332 -315 -308 -302 -324 -347 -372 -397 -421 -446 -467 -488 -480 -472 -423 -373 -324
4073 -324 -275 -303 -331 -389 -446 -442 -438 -433 -429 -453 -478 -502 -526 -532 -538 -544 -550 -537 -524 -511 -497 -505 -512 -490 -468 -436 -403 -371 -338 -360 -383 -405 -427 -482 -538 -594 -650 -662 -674 -641
4056 -641 -608 -577 -604 -648 -691 -691 -691 -661 -632 -583 -535 -516 -496 -463 -430 -363 -356 -385 -415 -418 -422 -432 -443 -453 -464 -499 -535 -571 -606 -617 -628 -639 -650 -625 -601 -548 -494
4040 -494 -452 -410 -371 -333 -296 -318 -396 -473 -520 -567 -545 -523 -472 -420 -398 -376 -395 -414 -502 -589 -647 -704 -693 -682 -680 -679 -677 -676 -643 -610 -606 -603 -605 -608 -640 -671 -646 -620 -643
$$ packed form
4163e89l1l1l1l2L5L5L5L5QPQQl7l8l8l7MMMMmmnmmnmmM7M8M7M8l4l3l4l3QQk0L0P1P2J6J6
4144d54l9l9l9m0ooooK7K6K7K6j0j0M9M8O1O0KJk2k3k3k3nonnk2k3k2k3MMMMJ6J7J6J6%%%
4125d49%K2K2K2K2L7L6L4L3Rm1p2p2m1m1m1m1J0RO5O5N0%l1l0k0j9j9j9ONOOk1k2k1k1J9J8
4108e25J9J9LLO1O2J3J3J3J3nonok3k3k3k3j1j1j1j1llkllllkJ9K0K0K0M5M6j3j4m6m7m7m6
4090e29j7j7m4NM9N0k6n5j0M0K7lmmN2N3J2J2J3J2J7J7J8J7POk2k3k5k5k4k5k1k1QQM9N0M9
4073c24M9k8k8n8n7MMNMk4k5k4k4ooooJ3J3J3J4qpK2K2L2L3L2L3k2k3k2k2n5n6n6n6j2j2L3
4056f41L3L1k7m4m3%%L0K9M9M8J9K0L3L3O7Pk9l0lmj0j1j0j1l5l6l6l5j1j1j1j1K5K4N3N4
4040d94M2M2L9L8L7k2p8p7m7m7K2K2N1N2K2K2j9j9q8q7n8n7J1J1KJKJL3L3MLkll2l1K5K6k3
$$ plain form
4023 -643 -667 -681 -695 -660 -625 -612 -598 -614 -630 -614 -599 -583 -568 -579 -590 -602 -613 -575 -537 -548 -558 -625 -691 -727 -764 -734 -704 -673 -643 -611 -579 -547 -515 -514 -512 -510
4007 -510 -509 -504 -499 -494 -490 -535 -581 -607 -583 -520 -485 -500 -545 -586 -578 -531 -484 -409 -334 -308 -282 -302 -322 -342 -362 -368 -374 -351 -327 -361 -395 -399 -404 -394 -385 -375 -365 -405 -444 -454
3990 -454 -464 -447 -430 -413 -396 -385 -374 -412 -451 -481 -512 -543 -574 -560 -545 -501 -457 -392 -328 -304 -329 -397 -464 -506 -547 -567 -587 -578 -569 -566 -563 -609 -654 -671 -687 -655 -622
3974 -622 -572 -521 -540 -558 -606 -655 -634 -614 -565 -515 -564 -612 -645 -678 -651 -625 -612 -598 -558 -518 -502 -536 -601 -666 -696 -726 -697 -669 -624 -580 -535 -490 -445 -399 -412
3959 -412 -425 -459 -494 -558 -622 -666 -710 -754 -798 -833 -868 -900 -932 -916 -851 -755 -659 -593 -526 -480 -502 -577 -652 -673 -693 -699 -705 -681 -658 -658 -658 -628 -599 -544 -488 -492 -496 -468
3942 -468 -441 -414 -386 -434 -481 -526 -570 -576 -533 -517 -501 -490 -478 -467 -456 -469 -483 -496 -510 -536 -562 -588 -613 -646 -678 -710 -743 -670 -596 -523 -450 -464 -477 -491 -505
3927 -505 -498 -492 -485 -478 -448 -418 -417 -417 -455 -492 -471 -450 -439 -427 -416 -404 -425 -447 -468 -490 -454 -418 -382 -347 -349 -351 -351 -352 -371 -362 -310 -258 -231 -204 -218 -261 -319 -348 -366 -384
3910 -384 -426 -467 -477 -438 -394 -351 -334 -317 -296 -276 -297 -348 -408 -468 -470 -473 -489 -505 -494 -482 -472 -492 -524 -557 -536 -515 -494 -473 -480 -488 -493 -499 -499 -469 -456 -443 -459 -475
$$ packed form
4023f43k4j4j4L5L5J3J4j6j6J6J5J6J5j1j1j2j1L8L8j1j0o7o6l6l7L0L0L1L0L2L2L2L2JKK
4007e10JNNNMm5m6k6K4O3L5j5m5m1QM7M7P5P5K6K6k0k0k0k0ooK3K4l4l4mnJ0RJ0J0m0l9j0
3990d54j0J7J7J7J7J1J1l8l9l0l1l1l1J4J5M4M4O5O4K4k5o8o7m2m1k0k0RRLLm6m5j7j6L2L3
3974f22N0N1j9j8m8m9K1K0M9N0m9m8l3l3K7K6J3J4M0M0J6l4o5o5l0l0K9K8M5M4M5M5M5M6j3
3959d12j3l4l5o4o4m4m4m4m4l5l5l2l2J6O5R6R6O6O7M6k2p5p5k1k0ooK4K3%%L0K9N5N6mmK8
3942d68K7K7K8m8m7m5m4oM3J6J6J1J2J1J1j3j4j3j4k6k6k6k5l3l2l2l3P3P4P3P3j4j3j4j4
3927e05POPPL0L0J%l8l7K1K1J1J2J1J2k1k2k1k2L6L6L6L5kk%jj9RN2N2K7K7j4m3n8k9j8j8
3910c84m2m1j0L9M4M3J7J7K1K0k1n1o0o0klj6j6J1J2J0k0l2l3K1K1K1K1pqno%L0J3J3j6j6
$$ plain form
3893 -475 -491 -507 -534 -561 -529 -497 -484 -471 -458 -445 -423 -401 -362 -353 -385 -418 -469 -491 -503 -516 -526 -537 -540 -543 -506 -440 -382 -354 -350 -375 -402 -428 -438 -477 -559 -611 -603
3877 -603 -564 -555 -576 -565 -525 -484 -444 -431 -419 -418 -417 -417 -416 -424 -433 -441 -450 -481 -513 -542 -572 -582 -563 -503 -443 -402 -390 -394 -397 -420 -472 -524 -547 -561 -575 -587 -599 -595 -592 -604 -588
3859 -588 -560 -531 -551 -570 -554 -538 -522 -506 -498 -490 -483 -475 -482 -490 -497 -504 -424 -344 -235 -125 -81 -37 74 187 387 587 953 1318 1548 1444 1086 669 338
3845 338 105 -88 -223 -303 -324 -346 -367 -392 -418 -443 -468 -426 -384 -342 -300 -345 -389 -365 -341 -269 -197 -214 -230 -215 -199 -184 -168 -132 -95 -128 -160 -221 -282
3831 -282 -342 -403 -431 -460 -488 -516 -534 -553 -571 -589 -562 -534 -478 -421 -338 -256 -241 -227 -282 -336 -420 -504 -546 -588 -561 -534 -502 -471 -468 -466 -490 -514 -508 -502 -515 -528 -541
3815 -541 -554 -564 -574 -585 -595 -552 -509 -466 -423 -472 -521 -540 -559 -567 -576 -633 -690 -701 -712 -722 -733 -730 -728 -677 -625 -546 -466 -402 -398 -444 -491 -541 -592 -567 -542 -516 -491
3799 -491 -498 -505 -511 -518 -516 -513 -511 -509 -506 -504 -501 -499 -538 -577 -616 -655 -694 -733 -772 -811 -758 -704 -650 -596 -555 -515 -474 -433 -359 -285 -266 -307 -340 -373 -381 -389 -379 -368 -332 -297 -308 -379
3781 -379 -466 -552 -577 -602 -597 -593 -571 -549 -556 -564 -519 -474 -458 -442 -434 -426 -447 -468 -463 -457 -448 -498 -549 -600 -600 -540 -488 -437 -430 -424 -418 -411 -435 -458 -497 -536 -546 -556 -522 -489 -456 -423
$$ packed form
3893d75j6j6k7k7L2L2J3J3J3J3K2K2L9Rl2l3n1k2j2j3j0j1llL7O6N8K8Mk5k7k6j0l9q2n2Q
3877f03L9Rk1J1M0M1M0J3J2JJ%Jqrqrl1l2k9l0j0J9O0O0M1J2mlk3n2n2k3j4j4j2j2MLj2J6
3859e88K8K9k0j9J6J6J6J6QQPQpqppQ0Q0J09J10M4M4J11J13K00K00L66L65K30j04l58m17l31
3845C38k33j93j35q0k1k2k1k5k6k5k5M2M2M2M2m5m4K4K4P2P2j7j6J5J6J5J6L6L7l3l2o1o1
3831b82o0o1k8k9k8k8j8j9j8j8K7K8N6N7Q3Q2J5J4n5n4q4q4m2m2K7K7L2L1LKk4k4OOj3j3j3
3815e41j3j0j0j1j0M3M3M3M3m9m9j9j9qrn7n7j1j1j0j1LKN1N2P9Q0O4Mm6m7n0n1K5K5K6K5
3799d91ppopKLKKLKLKl9l9l9l9l9l9l9l9N3N4N4N4M1M0M1M1P4P4J9m1l3l3qqJ0J1L6L5j1p1
3781c79q7q6k5k5NMK2K2pqM5M5J6J6QQk1k1NORn0n1n1%O0N2N1POOPk4k3l9l9j0j0L4L3L3L3
$$ plain form
3762 -423 -445 -467 -489 -511 -523 -535 -547 -558 -555 -551 -573 -595 -602 -550 -482 -414 -373 -332 -320 -308 -312 -315 -348 -381 -447 -514 -580 -646 -654 -662 -670 -678 -675 -672 -614 -557 -503 -508 -575 -642 -657
3745 -657 -614 -557 -530 -526 -522 -490 -459 -440 -421 -461 -501 -540 -578 -557 -537 -538 -539 -539 -540 -582 -624 -637 -649 -670 -691 -688 -627 -571 -545 -498 -452 -446 -440 -433 -427 -441 -456 -440 -425 -353
3727 -353 -280 -267 -253 -311 -368 -425 -482 -461 -441 -420 -399 -430 -461 -492 -523 -510 -497 -487 -478 -488 -557 -626 -636 -598 -561 -520 -479 -438 -397 -356 -315 -321 -327 -333 -339 -382 -425
3711 -425 -467 -510 -483 -455 -428 -401 -410 -419 -429 -438 -419 -400 -380 -361 -398 -435 -472 -509 -461 -413 -365 -317 -325 -333 -341 -350 -355 -361 -366 -372 -340 -309 -278 -246 -260 -274 -288 -302 -293 -284 -275 -265
3693 -265 -269 -273 -335 -398 -410 -423 -435 -447 -484 -520 -556 -592 -607 -622 -578 -534 -475 -417 -388 -359 -356 -354 -351 -348 -357 -365 -373 -381 -416 -451 -486 -521 -562 -602 -643 -683 -637 -592 -547 -501
3676 -501 -493 -484 -475 -467 -425 -384 -401 -418 -461 -504 -548 -591 -608 -626 -584 -543 -487 -432 -435 -438 -466 -494 -522 -550 -542 -534 -526 -518 -510 -502 -494 -486 -494 -501 -506 -512 -496 -450 -388 -385 -438 -492 -546 -599
3657 -599 -680 -702 -662 -623 -615 -666 -699 -702 -702 -672 -598 -524 -457 -390 -381 -373 -352 -331 -370 -408 -447 -486 -466 -447 -453 -460 -466 -473 -478 -484 -519 -554 -588 -622 -598 -573 -580 -586 -593 -600 -561 -522
3638 -522 -484 -445 -491 -536 -582 -628 -622 -616 -610 -604 -608 -613 -617 -621 -633 -644 -656 -667 -618 -569 -519 -470 -430 -389 -398 -407 -406 -405 -404 -403 -403 -403 -373 -343 -322 -301 -329 -357 -329 -300 -243 -185 -185
$$ packed form
3762d23k2k2k2k2j2j2j2j1LMk2k2pN2O8O8M1M1J2J2mll3l3o6o7o6o6qqqqLLN8N7N4no7o7j5
3745f57M3N7K7MML2L1J9J9m0m0l9l8K1K0jj%jm2m2j3j2k1k1LO1N6K6M7M6OOPOj4j5J6J5P2
3727c53P3J3J4n8n7n7n7K1K0K1K1l1l1l1l1J3J3J0Rj0o9o9j0L8L7M1M1M1M1M1M1oooom3m3
3711d25m2m3K7K8K7K7rrj0rJ9J9K0J9l7l7l7l7M8M8M8M8qqqrnonoL2L1L1L2j4j4j4j4RRRJ0
3693b65mmo2o3j2j3j2j2l7l6l6l6j5j5M4M4N9N8K9K9LKLLrqqql5l5l5l5m1m0m1m0M6M5M5M6
3676e01QRRQM2M1j7j7m3m3m4m3j7j8M2M1N6N5llk8k8k8k8QQQQQQQQqpnoJ6M6O2Ln3n4n4n3
3657e99q1k2M0L9Qn1l3l%L0P4P4O7O7RQK1K1l9l8l9l9K0J9opopnol5l5l4l4K4K5poppL9L9
3638e22L8L9m6m5m6m6OOOOmnmmj2j1j2j1M9M9N0M9M0M1rrJJJJ%%L0L0K1K1k8k8K8K9N7N8%
$$ plain form
3620 -185 -184 -230 -276 -288 -251 -214 -226 -293 -361 -382 -404 -441 -478 -476 -425 -371 -345 -369 -393 -443 -492 -542 -591 -631 -670 -640 -611 -577 -543 -558 -573 -574 -575 -526 -477 -475 -472 -499
3603 -499 -526 -516 -507 -497 -487 -532 -578 -585 -544 -481 -468 -512 -556 -571 -587 -602 -617 -571 -524 -477 -430 -430 -429 -429 -429 -420 -411 -401 -392 -425 -457 -490 -522 -530 -537 -545 -553 -538 -524 -509 -494
3586 -494 -506 -517 -528 -539 -504 -469 -433 -398 -380 -362 -345 -327 -349 -371 -393 -415 -474 -534 -564 -594 -589 -584 -530 -476 -440 -404 -398 -391 -407 -422 -438 -453 -427 -401 -375 -349 -352
3569 -352 -354 -357 -360 -411 -462 -498 -474 -455 -436 -413 -390 -397 -403 -410 -417 -416 -415 -463 -512 -504 -496 -459 -422 -422 -423 -492 -561 -603 -646 -688 -731 -730 -729 -679 -629 -581 -532 -539 -604 -661 -718 -730 -742
3551 -742 -688 -634 -629 -625 -603 -581 -510 -439 -425 -411 -446 -481 -485 -490 -494 -499 -492 -486 -479 -473 -483 -494 -505 -516 -515 -514 -513 -512 -484 -457 -429 -401 -412 -422 -433 -443 -481 -518 -556 -593 -604 -614
3533 -614 -625 -636 -597 -558 -521 -483 -517 -581 -612 -584 -550 -517 -509 -501 -476 -450 -424 -399 -428 -458 -487 -517 -534 -552 -520 -488 -469 -450 -430 -411 -396 -380 -394 -408 -378 -348
3517 -348 -366 -385 -422 -460 -497 -534 -532 -531 -529 -528 -496 -464 -432 -400 -428 -457 -486 -514 -465 -415 -403 -440 -468 -446 -411 -405 -438 -500 -534 -539 -559 -579 -598 -616 -576 -535 -534 -582
3501 -582 -659 -706 -704 -702 -667 -631 -567 -502 -494 -486 -479 -471 -469 -468 -515 -563 -602 -640 -676 -712 -730 -698 -645 -592 -581 -570 -562 -554 -552 -599 -635 -642 -627 -611 -593 -575 -547 -519 -559 -599 -605
$$ packed form
3620a85Jm6m6j2L7L7j2o7o8k1k2l7l7KN1N4K6k4k4n0m9n0m9m0l9L0K9L4L4j5j5jjM9M9KLk7
3603d99k7J0RJ0J0m5m6pM1O3J3m4m4j5j6j5j5M6M7M7M7%J%%RRJ0Rl3l2l3l2qpqqJ5J4J5J5
3586d94j2j1j1j1L5L5L6L5J8J8J7J8k2k2k2k2n9o0l0l0NNN4N4L6L6OPj6j5j6j5K6K6K6K6l
3569c52klln1n1l6K4J9J9K3K3poppJJm8m9QQL7L7%jo9o9m2m3m2m3JJN0N0M8M9po5n7n7j2j2
3551g42N4N4NMK2K2P1P1J4J4l5l5mnmnPOPOj0j1j1j1JJJJK8K7K8K8j1j0j1j0l8l7l8l7j1j0
3533f14j1j1L9L9L7L8l4o4l1K8L4L3QQK5K6K6K5k9l0k9l0j7j8L2L2J9J9K0J9J5J6j4j4L0L0
3517c48j8j9l7l8l7l7KJKJL2L2L2L2k8k9k9k8M9N0J2l7k8K2L5Ol3o2l4nk0k0j9j8M0M1Jm8
3501e82p7m7KKL5L6O4O5QQPQKJm7m8l9l8l6l6j8L2N3N3J1J1QQKm7l6pJ5J6J8J8K8K8m0m0o
$$ plain form
3483 -605 -611 -588 -564 -556 -547 -538 -529 -536 -543 -500 -458 -457 -457 -486 -515 -512 -509 -536 -562 -548 -534 -471 -407 -366 -325 -313 -301 -334 -367 -429 -492 -542 -593 -642 -642 -594 -547 -526 -506 -484 -463
3465 -463 -510 -557 -565 -573 -581 -589 -589 -588 -588 -588 -601 -615 -628 -641 -582 -522 -462 -403 -320 -237 -165 -161 -216 -271 -330 -390 -410 -430 -450 -470 -495 -519 -544 -568 -566 -563 -511 -460 -386 -313
3448 -313 -249 -255 -348 -441 -469 -497 -506 -515 -524 -533 -542 -552 -561 -570 -567 -564 -562 -559 -538 -518 -497 -476 -449 -421 -393 -365 -381 -397 -412 -428 -444 -460 -476 -492 -494 -496 -499 -501 -491 -481 -471 -461 -450
3429 -450 -438 -426 -414 -403 -391 -379 -367 -381 -396 -410 -424 -453 -483 -512 -542 -547 -553 -528 -504 -448 -392 -358 -372 -398 -423 -422 -421 -402 -384 -366 -348 -357 -367 -376 -386 -391 -396 -401 -407 -387
3412 -387 -367 -369 -420 -501 -582 -631 -650 -645 -591 -520 -479 -493 -555 -602 -579 -526 -474 -477 -530 -602 -675 -709 -694 -656 -618 -606 -594 -574 -553 -533 -512 -505 -499 -492 -485 -447 -408 -370
3395 -370 -332 -336 -339 -277 -215 -193 -220 -268 -317 -356 -396 -435 -475 -481 -486 -492 -498 -499 -501 -503 -504 -472 -439 -436 -433 -415 -398 -450 -501 -543 -586 -579 -572 -568 -563 -559 -554 -559 -564 -568 -573 -548 -523 -498 -473 -484
3375 -484 -496 -507 -519 -521 -523 -525 -527 -516 -506 -496 -485 -509 -533 -557 -581 -555 -529 -522 -486 -433 -428 -461 -463 -434 -405 -403 -401 -406 -411 -412 -414 -405 -348 -272 -197 -157 -165 -215 -265 -291 -317 -314 -311
3357 -311 -325 -339 -327 -315 -343 -420 -498 -526 -517 -509 -497 -485 -495 -505 -516 -526 -541 -555 -570 -584 -575 -566 -558 -551 -568 -615 -645 -627 -588 -578 -598 -618 -578 -538 -498 -458 -467 -477
$$ packed form
3483f05oK3K4QRRRppM3M2J%k9k9LLk7k6J4J4O3O4M1M1J2J2l3l3o2o3n0n1m9%M8M7K1K0K2K1
3465d63m7m7qqqq%J%%j3j4j3j3N9O0O0N9Q3Q3P2Mn5n5n9o0k0k0k0k0k5k4k5k4KLN2N1P4P3
3448c13O4or3r3k8k8rrrrrj0rrLLKLK1K0K1K1K7K8K8K8j6j6j5j6j6j6j6j6kklkJ0J0J0J0J1
3429d50J2J2J2J1J2J2J2j4j5j4j4k9l0k9l0noK5K4N6N6L4j4k6k5JJJ9J8J8J8rj0rj0nnnoK0
3412c87K0kn1q1q1m9j9NN4P1M1j4o2m7K3N3N2ln3p2p3l4J5L8L8J2J2K0K1K0K1POPPL8L9L8
3395c70L8mlO2O2K2k7m8m9l9m0l9m0onoojkkjL2L3LLJ8J7n2n1m2m3PPMNMNnnmnK5K5K5K5j1
3375d84j2j1j2kkkkJ1J0J0J1k4k4k4k4K6K6PL6N3Nl3kK9K9KKnnjkRN7P6P5M0qn0n0k6k6LL
3357c11j4j4J2J2k8p7p8k8RQJ2J2j0j0j1j0j5j4j5j4RRQPj7m7l0J8L9J0k0k0M0M0M0M0rj0
$$ plain form
3340 -477 -488 -500 -522 -575 -638 -652 -609 -566 -569 -601 -626 -602 -560 -518 -530 -571 -595 -570 -524 -506 -539 -602 -656 -681 -656 -630 -605 -580 -604 -628 -648 -668 -638 -609 -623
3325 -623 -637 -650 -664 -630 -595 -609 -624 -651 -679 -621 -563 -531 -547 -605 -662 -681 -699 -669 -639 -620 -602 -538 -474 -421 -417 -455 -492 -495 -498 -501 -504 -541 -577 -592 -558 -523 -487
3309 -487 -452 -417 -421 -474 -516 -528 -511 -493 -474 -455 -455 -455 -484 -513 -476 -440 -452 -464 -455 -447 -438 -429 -423 -418 -412 -406 -411 -417 -422 -427 -406 -384 -362 -341 -354 -367 -381 -394 -397 -400 -403 -406 -375 -345
3290 -345 -343 -342 -373 -404 -370 -335 -329 -371 -449 -497 -509 -471 -414 -356 -349 -391 -449 -478 -449 -391 -360 -359 -361 -363 -397 -430 -449 -468 -487 -505 -502 -498 -494 -490 -507 -523 -491 -458 -422 -387
3273 -387 -351 -316 -359 -402 -445 -488 -515 -543 -521 -470 -414 -408 -443 -508 -563 -617 -644 -671 -659 -646 -634 -622 -613 -605 -597 -588 -572 -557 -541 -525 -513 -501 -489 -477 -508 -540 -571
3256 -571 -603 -596 -589 -533 -477 -425 -372 -388 -404 -476 -549 -600 -602 -598 -593 -634 -676 -686 -696 -677 -658 -594 -531 -503 -534 -571 -607 -617 -628 -604 -580 -527 -474 -437 -399 -431 -462
3240 -462 -506 -550 -558 -507 -454 -402 -401 -459 -484 -509 -489 -469 -485 -500 -516 -532 -512 -493 -474 -454 -426 -398 -370 -342 -353 -365 -377 -388 -395 -402 -380 -358 -341 -324 -376 -428 -517
3224 -517 -605 -658 -653 -593 -533 -470 -406 -324 -241 -162 -84 -33 -41 -65 -89 -60 -31 22 77 113 89 31 -27 -55 -82 -139 -138 -68 59 157 256 360 464 640
$$ packed form
3340d77j1j2k2n3o3j4M3M3ll2k5K4M2M2j2m1k4K5M6J8l3o3n4k5K5K6K5K5k4k4k0k0L0K9j4
3325f23j4j3j4L4L5j4j5k7k8N8N8L2j6n8n7j9j8L0L0J9J8O4O4N3Ml8l7lllll7l6j5L4L5L6
3309d87L5L5mn3m2j2J7J8J9J9%%k9k9L7L6j2j2RQRRONOOnonnK1K2K2K1j3j3j4j3llllL1L0
3290c45KJl1l1L4L5Om2p8m8j2L8N7N8Pm2n8k9K9N8L1Jkkl4l3j9j9j9j8LMMMj7j6L2L3L6L5
3273c87L6L5m3m3m3m3k7k8K2N1N6Ol5o5n5n4k7k7J2J3J2J2RQQRJ6J5J6J6J2J2J2J2l1l2l1
3256e71l2PPN6N6N2N3j6j6p2p3n1kMNm1m2j0j0J9J9O4O3K8l1l7l6j0j1K4K4N3N3L7L8l2l1
3240d62m4m4qN1N3N2Jn8k5k5K0K0j6j5j6j6K0J9J9K0K8K8K8K8j1j2j2j1ppK2K2J7J7n2n2q9
3224e17q8n3NO0O0O3O4Q2Q3P9P8N1qk4k4K9K9N3N5L6k4n8n8k8k7n7JP0J27R8R9J04J04J76
$$ plain form
3210 640 915 1348 1781 1971 1750 1299 848 541 333 163 -5 -114 -163 -178 -192 -203 -214 -231 -249 -266 -284 -327 -371 -415 -458 -455 -452 -449 -446 -437 -429 -421
3196 -421 -412 -411 -411 -410 -409 -468 -528 -585 -641 -672 -654 -586 -489 -434 -449 -479 -510 -524 -508 -451 -395 -395 -425 -438 -451 -460 -470 -496 -492 -458 -423 -387 -351 -325 -300 -316 -362 -386 -409
3179 -409 -434 -460 -449 -438 -410 -412 -434 -457 -497 -508 -488 -468 -448 -428 -385 -371 -381 -421 -480 -509 -497 -486 -493 -500 -507 -513 -515 -516 -501 -515 -558 -601 -587 -573 -592 -611 -631 -650
$$ packed form
3210F40K75M33M33J90k21m51m51l07k08j70j68j09m9j5j4j1j1j7j8j7j8m3m4m4m3LLLLRQQ
3196d21RJ%JJn9o0n7n6l1J8O8R7N5j5l0l1j4J6N7N6%l0j3j3rj0k6ML4L5L6L6K6K5j6m6k4k3
3179d09k5k6J1J1K8kk2k3m0j1K0K0K0K0M3J4j0m0n9k9J2J1pppokjJ5j4m3m3J4J4j9j9k0j9
$$ [...]
-3131c78
##END=	
##END=	
