##TITLE=	May03-2019.70.fid
Cl - 02 - 2.0

##JCAMP-DX=	6.0	$$ MestReNova 14.1.1-24571
##DATA TYPE=	LINK
##BLOCK_ID=	1
##BLOCKS=	1    
##ORIGIN=	Mestrelab Research S.L.
##OWNER=	hrzepa
##$MNOVA/LINK_BLOCK_TYPE=	ITEM	$$ NMR Spectrum
##$MNOVA/ITEM/POLYGON=	(XY..XY)
5321,5835
8722,5835
8722,8208
5321,8208
5321,5835
##$MNOVA/ITEM/Z=	0
##$MNOVA/ITEM/ANGLE=	0
##TITLE=	May03-2019.70.fid
##JCAMP-DX=	6.0	$$ MestReNova 14.1.1-24571
##BLOCK_ID=	2
##DATA TYPE=	NMR SPECTRUM
##DATA CLASS=	XYDATA
##NUMDIM=	1
##ORIGIN=	Bruker BioSpin GmbH
##OWNER=	nmr
##.OBSERVE FREQUENCY=	400.32240192000000434
##.OBSERVE NUCLEUS=	^1H
##.SOLVENT NAME=	DMSO
##.PULSE SEQUENCE=	zg30
##LONGDATE=	2019/05/03 18:16:00.000
##.ACQUISITIONMODE=	SIMULTANEOUS (DQD)
##$ORIGINAL FORMAT=	Bruker XWIN-NMR
##$MNOVA/SCALES_VERSION=	9
##$PARAMETER FILE=	(acqus, ASCII, /Users/hrzepa/Downloads/Polysiphenol%20SI%20NMR%20Original%20Data/4/4b%20-%201H%20-%20400B.19.05.03.070%20-%20ZY/70/acqus, 0)
$$ ##TITLE= Parameter file, TOPSPIN		Version 3.2
$$ ##JCAMPDX= 5.0
$$ ##DATATYPE= Parameter Values
$$ ##NPOINTS= 11	$$ modification sequence number
$$ ##ORIGIN= Bruker BioSpin GmbH
$$ ##OWNER= nmr
$$ $$ 2019-05-03 18:16:40.718 +0100  nmr@CZC2524DW0
$$ $$ /opt/topspin/data/brad/nmr/May03-2019/70/acqus
$$ $$ process /opt/topspin3.2/prog/mod/shimcntl
$$ ##$ACQT0= -2.3109243697479
$$ ##$AMP= (0..31)
$$ 100 100 100 100 100 100 100 100 100 100 100 100 100 100 100 100 100 100
$$ 100 100 100 100 100 100 100 100 100 100 100 100 100 100
$$ ##$AMPCOIL= (0..19)
$$ 0 0 0 0 0 0 0 0 0 0 0 0 0 0 0 0 0 0 0 0
$$ ##$ANAVPT= -1
$$ ##$AQSEQ= 0
$$ ##$AQ_mod= 3
$$ ##$AUNM= <au_zg>
$$ ##$AUTOPOS= <47 >
$$ ##$BF1= 400.32
$$ ##$BF2= 400.32
$$ ##$BF3= 400.32
$$ ##$BF4= 400.32
$$ ##$BF5= 400.32
$$ ##$BF6= 400.32
$$ ##$BF7= 400.32
$$ ##$BF8= 400.32
$$ ##$BYTORDA= 0
$$ ##$CAGPARS= (0..11)
$$ 0 0 0 0 0 0 0 0 0 0 0 0
$$ ##$CFDGTYP= 0
$$ ##$CFRGTYP= 9
$$ ##$CHEMSTR= <none>
$$ ##$CNST= (0..63)
$$ 1 1 145 1 1 1 1 1 1 1 1 1 1 1 1 1 1 1 1 1 1 1 1 1 1 1 1 1 1 1 1 1 1 1 1
$$ 1 1 1 1 1 1 1 1 1 1 1 1 1 1 1 1 1 1 1 1 1 1 1 1 1 1 1 1 1
$$ ##$CPDPRG= (0..8)
$$ <> <> <> <> <mlev> <mlev> <mlev> <mlev> <mlev>
$$ ##$D= (0..63)
$$ 0 1 0 0 0 0 0 0 0 0.06 0 0 0 0 0 0 0.0002 0 0 0 0 0 0 0 0 0 0 0 0 0 0 0
$$ 0 0 0 0 0 0 0 0 0 0 0 0 0 0 0 0 0 0 0 0 0 0 0 0 0 0 0 0 0 0 0 0
$$ ##$DATE= 1556903799
$$ ##$DE= 6.5
$$ ##$DECBNUC= <off>
$$ ##$DECIM= 2496
$$ ##$DECNUC= <off>
$$ ##$DECSTAT= 4
$$ ##$DIGMOD= 1
$$ ##$DIGTYP= 12
$$ ##$DQDMODE= 0
$$ ##$DR= 22
$$ ##$DS= 2
$$ ##$DSPFIRM= 0
$$ ##$DSPFVS= 20
$$ ##$DTYPA= 0
$$ ##$EXP= <proton>
$$ ##$F1LIST= <111111111111111>
$$ ##$F2LIST= <222222222222222>
$$ ##$F3LIST= <333333333333333>
$$ ##$FCUCHAN= (0..9)
$$ 0 2 0 0 0 0 0 0 0 0
$$ ##$FL1= 90
$$ ##$FL2= 90
$$ ##$FL3= 90
$$ ##$FL4= 90
$$ ##$FOV= 20
$$ ##$FQ1LIST= <freqlist>
$$ ##$FQ2LIST= <freqlist>
$$ ##$FQ3LIST= <freqlist>
$$ ##$FQ4LIST= <freqlist>
$$ ##$FQ5LIST= <freqlist>
$$ ##$FQ6LIST= <freqlist>
$$ ##$FQ7LIST= <freqlist>
$$ ##$FQ8LIST= <freqlist>
$$ ##$FRQLO3= 19394.9549999833
$$ [...]
$$ ##$Sgu3PowerLevels= (0..7)
$$ 0 0 0 0 0 0 0 0
$$ ##$Sgu4PowerLevels= (0..7)
$$ 0 0 0 0 0 0 0 0
$$ ##$Sgu5PowerLevels= (0..7)
$$ 0 0 0 0 0 0 0 0
$$ ##$Sgu6PowerLevels= (0..7)
$$ 0 0 0 0 0 0 0 0
$$ ##$Sgu7PowerLevels= (0..7)
$$ 0 0 0 0 0 0 0 0
$$ ##$Sgu8PowerLevels= (0..7)
$$ 0 0 0 0 0 0 0 0
$$ ##$SguType= 3
$$ ##$ShimPowMaxUA= (0..63)
$$ 130000 130000 130000 130000 130000 130000 130000 130000 130000 130000 130000
$$ 130000 130000 130000 130000 130000 130000 130000 130000 130000 0 0 0 0
$$ 0 0 0 0 0 0 0 0 0 0 0 0 0 0 0 0 0 0 0 0 0 0 0 0 0 0 0 0 0 0 0 0 0 0 0 0
$$ 0 0 0 0
$$ ##$ShimPowMaxUC= (0..63)
$$ 130000 130000 130000 130000 130000 130000 130000 130000 130000 130000 130000
$$ 130000 130000 130000 130000 130000 130000 130000 130000 130000 0 0 0 0
$$ 0 0 0 0 0 0 0 0 0 0 0 0 0 0 0 0 0 0 0 0 0 0 0 0 0 0 0 0 0 0 0 0 0 0 0 0
$$ 0 0 0 0
$$ ##$ShimPowMaxUG= (0..63)
$$ 524287 524287 524287 524287 524287 524287 524287 524287 524287 524287 524287
$$ 524287 524287 524287 524287 524287 524287 524287 524287 524287 0 0 0 0
$$ 0 0 0 0 0 0 0 0 0 0 0 0 0 0 0 0 0 0 0 0 0 0 0 0 0 0 0 0 0 0 0 0 0 0 0 0
$$ 0 0 0 0
$$ ##$ShimPowRcbType= 3
$$ ##$ShimPowRes= (0..63)
$$ 1e-20 1e-20 1e-20 1e-20 1e-20 1e-20 1e-20 1e-20 1e-20 1e-20 1e-20 1e-20
$$ 1e-20 1e-20 1e-20 1e-20 1e-20 1e-20 1e-20 1e-20 0 0 0 0 0 0 0 0 0 0 0 0
$$ 0 0 0 0 0 0 0 0 0 0 0 0 0 0 0 0 0 0 0 0 0 0 0 0 0 0 0 0 0 0 0 0
$$ ##$ShimPowRng0= (0..63)
$$ 1 1 1 1 1 1 1 1 1 1 1 1 1 1 1 1 1 1 1 1 0 0 0 0 0 0 0 0 0 0 0 0 0 0 0 0
$$ 0 0 0 0 0 0 0 0 0 0 0 0 0 0 0 0 0 0 0 0 0 0 0 0 0 0 0 0
$$ ##$ShimPowRng1= (0..63)
$$ 1 1 1 1 1 1 1 1 1 1 1 1 1 1 1 1 1 1 1 1 0 0 0 0 0 0 0 0 0 0 0 0 0 0 0 0
$$ 0 0 0 0 0 0 0 0 0 0 0 0 0 0 0 0 0 0 0 0 0 0 0 0 0 0 0 0
$$ ##$ShimPowRng2= (0..63)
$$ 1 1 1 1 1 1 1 1 1 1 1 1 1 1 1 1 1 1 1 1 0 0 0 0 0 0 0 0 0 0 0 0 0 0 0 0
$$ 0 0 0 0 0 0 0 0 0 0 0 0 0 0 0 0 0 0 0 0 0 0 0 0 0 0 0 0
$$ ##$ShimPowRng3= (0..63)
$$ 1 1 1 1 1 1 1 1 1 1 1 1 1 1 1 1 1 1 1 1 0 0 0 0 0 0 0 0 0 0 0 0 0 0 0 0
$$ 0 0 0 0 0 0 0 0 0 0 0 0 0 0 0 0 0 0 0 0 0 0 0 0 0 0 0 0
$$ ##$ShimSysFunc= (0..63)
$$ 1 2 3 4 5 7 9 11 15 16 8 10 12 14 6 17 13 18 19 20 0 0 0 0 0 0 0 0 0 0
$$ 0 0 0 0 0 0 0 0 0 0 0 0 0 0 0 0 0 0 0 0 0 0 0 0 0 0 0 0 0 0 0 0 0 0
$$ ##$ShimSysMatrix= 0
$$ ##$ShimSysType= 1
$$ ##$TFXNUM= 0
$$ ##$TRIPLO2= 0
$$ ##$VTU= 2
$$ ##$VTUETH= <149.236.99.20>
$$ ##$VTUTY= <no>
$$ ##$WBREFAM= (0..15)
$$ 132.2 106.2 100 100 100 100 100 100 100 100 100 100 100 100 100 100
$$ ##$WBREFLM= (0..15)
$$ 0 0 0 0 0 0 0 0 0 0 0 0 0 0 0 0
$$ ##$WBREFPH= (0..15)
$$ 77.55 -65.76 0 0 0 0 0 0 0 0 0 0 0 0 0 0
$$ ##$WBSGU= (0..15)
$$ 0 0 0 0 0 0 0 0 0 0 0 0 0 0 0 0
$$ ##$XFAC= 2
$$ ##END=
$$ 
##$DECIM=	2496
##$DSPFVS=	20
##XUNITS=	HZ
##YUNITS=	ARBITRARY UNITS
##FIRSTX=	6408.3302564214200174
##LASTX=	-1604.3679904610892208
##DELTAX=	-0.12226593800080123864
##XFACTOR=	1
##YFACTOR=	0.016157703384792925644
##FIRSTY=	13.608814239501953125
##MINY=	-2.7753245830535888672
##MAXY=	22016.517578125
##NPOINTS=	65536
##XYDATA=	(X++(Y..Y))
$$ [...]
2820A327l6L0L0L0L0j5j6j5j6l8l9K4K4P5P4k9l0m4m4J8J8N2N1N2N2J3J3J3J3m0m0K2K3no
2815A571nnk3k3k4k3OOn6n6nmmnO6O5l8l9j0rj0j0o8o7onL5L5L5L5onook4k4k4k5K8K7K7K7
2810A348LLKLl8l8J08J07jkO1O1j5j6j5j6j1j2j2j1M2M2M1M2l2l2L0L0M1M0M1M0J15J14N3
2806B116N2K9L0J33J33R4R3L0L1J2J3J2J2P0O9J32J32L1L2L1L1K9K9K9K8N0N0n5n4j09j09
2802C206j09j09p1p1rrm3m4m4m4m1m2m1m1q2q2q1q2o2o3%%k8k7k8k7M9M8M9M9onooJ1J1J1
2798B131J1L8L8L8L8JJO3O3l3l3l3l3J2J3r2r1K7K6Q9R0O1O2m3m2l0k9l0k9j5j5j5j6n0n0
2793B123n0n1k2k2M1M0M4M4j8j8J1J2n1n1LKo0o0K0K1K0K0j2j2N0N0k4k3Q0Q1QPQQJ9K0K0
2789B278J9P5P4P4P4p7p8p8p8rrrrl3l2K9L0N2N3rj0p5p6p6p5l0l1l0l0ppopN1N2n3n2J7J7
$$ y = [1327, 1291, 1321, 1351, 1381, 1411, 1396, 1380, 1365, 1349, 1311, 1272, 1296, 1320, 1395, 1469, 1440, 1410, 1366, 1322, 1340, 1358, 1410, 1461, 1513, 1565, 1578, 1591, 1604, 1617, 1577, 1537, 1559, 1582, 1577, 1571, 1566, 1561, 1538, 1515, 1491, 1468, 1474, 1480, 1424, 1368, 1363, 1359, 1355, 1350, 1416, 1481, 1443, 1404, 1394, 1385, 1375, 1365, 1297, 1230, 1224, 1219, 1254, 1289, 1324, 1359, 1353, 1348, 1342, 1336, 1312, 1288, 1264, 1239, 1267, 1294, 1321, 1348, 1351, 1354, 1356, 1359, 1321, 1283, 1391, 1498, 1497, 1495, 1556, 1617, 1602, 1586, 1571, 1555, 1544, 1532, 1520, 1509, 1551, 1593, 1634, 1676, 1644, 1612, 1642, 1672, 1713, 1753, 1794, 1834, 1949, 2063, 2116, 2168, 2197, 2227, 2360, 2493, 2587, 2680, 2710, 2741, 2753, 2766, 2778, 2790, 2860, 2929, 3061, 3193, 3224, 3256, 3287, 3318, 3347, 3376, 3405, 3433, 3483, 3533, 3478, 3424, 3315, 3206, 3097, 2988, 2917, 2846, 2837, 2828, 2785, 2741, 2697, 2653, 2612, 2570, 2529, 2488, 2406, 2324, 2243, 2161, 2099, 2036, 2036, 2036, 2008, 1981, 1953, 1926, 1975, 2023, 2072, 2121, 2115, 2110, 2104, 2098, 2109, 2120, 2131, 2142, 2180, 2218, 2256, 2294, 2295, 2296, 2359, 2422, 2389, 2356, 2323, 2290, 2302, 2315, 2223, 2132, 2159, 2185, 2274, 2364, 2425, 2487, 2444, 2402, 2372, 2343, 2313, 2284, 2269, 2254, 2239, 2223, 2173, 2123, 2073, 2022, 2000, 1978, 2019, 2059, 2103, 2147, 2129, 2111, 2122, 2134, 2083, 2032, 2035, 2037, 1977, 1917, 1937, 1958, 1978, 1998, 1986, 1974, 2024, 2074, 2050, 2027, 2107, 2188, 2196, 2203, 2211, 2219, 2238, 2258, 2278, 2297, 2372, 2446, 2520, 2594, 2517, 2439, 2361, 2283, 2274, 2265, 2256, 2247, 2214, 2182, 2211, 2241, 2293, 2346, 2337, 2327, 2252, 2176, 2100, 2025, 1995, 1964, 1934, 1904, 1897, 1890, 1884, 1877, 1928, 1980, 1927, 1875, 1892, 1909]
2784A909J7J7j8j8Q6Q5P9P8o7o8n4n4n4n5J1J1J0J1L1L1l1l1j4j4M8M8M4M4j8j8k2k2k1k2
2780A959N5N5N5N5LMLMo1o0KKl6l7l7l6O3O4O3O4L2L2L3L2R1R1L2L3P8J41J65O0PPO3O3P2
2775C216P3J35J34J11J11J38J38O3%p4j38j16j16j21j20j38j39j07j07j35j35o7ml4l4l1l0
2772B473L0L1O5Ml5l5K4K3k8k9nN8N6ol0l0JJL2L2N0N0N0M9j3j3j3j3j7j6j7j6rrqrK8K8K4
2767B758K4l4r7o5kN8N9m4j06p4j0N0N0M7j5j5M8J08J08Q4K2l9l9j2j2J7J6J6J6R4R4J29O7
2763C301J4J4J0J0k1k2n2n3j3j3p8j40j49q7K2Q4P3J1j3j3P5P5N1j1q5k3Q6J49J09M7K3K3
2759C404POOPJKKJR1R1N9O0R9J00P2J0j7j7k1k1m1m2K7Q9Q3Q3J14J14R5L2L2L2rp2m0m1o5
2755D333j28r3J2L9k3q5q6J8J8j4j3K1K1N2N2J7J6J3P6R8R9O7J30J88J88J91J92K31K32K31
$$ y = [1909, 1926, 1943, 1925, 1907, 1993, 2078, 2157, 2235, 2168, 2100, 2046, 1992, 1938, 1883, 1894, 1905, 1915, 1926, 1957, 1988, 1957, 1926, 1912, 1898, 1946, 1994, 2038, 2082, 2064, 2046, 2024, 2002, 1981, 1959, 2014, 2069, 2124, 2179, 2182, 2186, 2189, 2193, 2132, 2072, 2074, 2076, 2040, 2003, 1966, 1930, 1993, 2057, 2120, 2184, 2216, 2248, 2281, 2313, 2404, 2495, 2527, 2560, 2638, 2779, 2944, 3004, 3011, 3018, 3081, 3144, 3216, 3289, 3424, 3558, 3669, 3780, 3918, 4056, 4119, 4119, 4045, 3907, 3791, 3675, 3554, 3434, 3296, 3157, 3050, 2943, 2808, 2673, 2606, 2602, 2568, 2534, 2503, 2473, 2503, 2534, 2599, 2603, 2568, 2533, 2557, 2580, 2552, 2523, 2518, 2576, 2632, 2626, 2596, 2566, 2567, 2568, 2600, 2632, 2682, 2732, 2782, 2831, 2818, 2805, 2792, 2779, 2762, 2746, 2729, 2713, 2704, 2695, 2687, 2678, 2706, 2734, 2758, 2782, 2748, 2651, 2586, 2584, 2642, 2701, 2657, 2551, 2477, 2467, 2517, 2567, 2614, 2599, 2584, 2632, 2740, 2848, 2932, 2954, 2915, 2876, 2864, 2852, 2869, 2885, 2901, 2917, 3011, 3105, 3234, 3301, 3315, 3329, 3339, 3349, 3328, 3306, 3254, 3201, 3188, 3175, 3097, 2957, 2808, 2721, 2743, 2827, 2900, 2911, 2898, 2885, 2960, 3035, 3086, 3075, 2990, 2967, 3053, 3202, 3311, 3358, 3381, 3404, 3411, 3417, 3423, 3430, 3431, 3433, 3435, 3436, 3527, 3618, 3677, 3737, 3836, 3936, 4008, 4018, 4001, 3984, 3963, 3942, 3901, 3859, 3886, 3975, 4058, 4141, 4255, 4369, 4464, 4496, 4528, 4560, 4551, 4479, 4439, 4398, 4333, 4205, 4112, 4124, 4163, 4140, 4055, 3969, 3987, 4005, 3991, 3978, 3999, 4020, 4072, 4124, 4141, 4157, 4170, 4246, 4344, 4443, 4510, 4640, 4828, 5016, 5207, 5399, 5630, 5862, 6093]
2751F093K94M07M69N08N07O17P21P18P18O75N70L19Qj92k95l51l52k09o3L7J40K54M41O03
2748A2637O03N69M23J87j24m47o75p35o73n29l42j71k6Q9Q8N2n2j31j32j38j38k48k47k48
2745I592k47j76j77j42p9k4J00J04J05J52K78L49L48L22K59J28Mj34k59l48m11m15m14l40
2742H575k14j49q6m4J7M9M9rj0j84j83k47k46k43k44j81j81j65j65j31pL0L0k4k5kkO0O0P9
2739F207P9M8M8L5L5O9J94K75K75K87K87K71L34M19N44N85O47O96Q20R23R23R38R39P50L76
2736A7004N7k34m43n67o76n51l60j53K1K28L76M38M03M03L30J22j66m58o25p50q30q31o98
2733A2040m90l57k33r9K6O7O7O0N9O0N9M3M3M3M3Q3Q3Q3Q3J99J98L02L03M32M32M33M32M44
2729A4938M44N93N94O56P18P66Q91R93J117J132J194J345J469J564J625J703J828J975K100
$$ y = [6093, 6387, 6794, 7263, 7771, 8278, 8895, 9616, 10334, 11052, 11727, 12297, 12616, 12624, 12432, 12137, 11786, 11434, 11225, 11162, 11199, 11339, 11593, 12034, 12637, 13240, 13809, 14232, 14419, 14295, 13848, 13173, 12438, 11765, 11236, 10894, 10723, 10697, 10786, 10874, 10926, 10874, 10743, 10611, 10473, 10335, 10087, 9840, 9592, 9345, 9169, 8992, 8850, 8771, 8747, 8847, 8951, 9056, 9208, 9486, 9835, 10183, 10505, 10764, 10892, 10896, 10762, 10503, 10155, 9744, 9329, 8915, 8575, 8361, 8212, 8126, 8082, 8099, 8148, 8197, 8188, 8178, 7994, 7811, 7564, 7318, 7075, 6831, 6650, 6469, 6304, 6139, 6008, 6001, 6031, 6061, 6037, 6012, 6010, 6008, 6068, 6128, 6207, 6286, 6334, 6382, 6417, 6452, 6521, 6715, 6990, 7265, 7552, 7839, 8110, 8444, 8863, 9407, 9992, 10639, 11335, 12155, 13078, 14001, 14939, 15878, 16628, 17004, 17061, 16827, 16384, 15817, 15141, 14590, 14230, 14077, 14098, 14326, 14702, 15140, 15543, 15946, 16276, 16398, 16232, 15774, 15149, 14399, 13569, 12738, 12040, 11550, 11193, 10960, 10861, 10887, 10954, 11021, 11081, 11140, 11200, 11259, 11302, 11345, 11388, 11431, 11514, 11597, 11680, 11763, 11962, 12160, 12462, 12765, 13197, 13629, 14062, 14494, 14938, 15382, 15975, 16569, 17225, 17943, 18709, 19600, 20593, 21710, 22842, 24036, 25381, 26850, 28414, 30039, 31742, 33570, 35545, 37645]
2727C7645K259K468K653K715K797L087L520M144M760N551O366P240P967Q426Q737R028R683
2725A29046J0889J2906J5693J9356K3722K8807L4670M1544M9486N7919O5530P0196O8741N7958
2723F86463L6790P659k3740n0945o9451p7682p6892o9780n9508m8619l8680l0320k3541j8292
2722A43462j4174j0982q778p525p151p281p406p362p071o447n574m562l606k936k478k102
2720C8027j811j624j561j549j486j346j221j084q76o99m92l12j87MJ30K64L89O22Q31J080
2717B7099J371J720K177K707L164L624L916M116M115L843L385K867K409K268K560L206M246
2715G8793N634P256R088J0710J1703J1495R561N777M64n399j0568j4019j5355j4981j3484
2713G6675j1612r611p823o243n037m018l145k520k064j824j616j458j333j192j067r98q72
$$ y = [37645, 39904, 42372, 45025, 47740, 50537, 53624, 57144, 61288, 66048, 71599, 77965, 85205, 93172, 101598, 110335, 119363, 129046, 139935, 152841, 168534, 187890, 211612, 240419, 275089, 316633, 366119, 424038, 489568, 559764, 628505, 686463, 723253, 730912, 707172, 656227, 586776, 509094, 432202, 362422, 302914, 254295, 215615, 185295, 161754, 143462, 129288, 118306, 109528, 102003, 94852, 87571, 80165, 72803, 65732, 59285, 53711, 49149, 45543, 42607, 40129, 38027, 36216, 34592, 33031, 31482, 29996, 28650, 27429, 26345, 25469, 24770, 24278, 23966, 23779, 23783, 23913, 24177, 24566, 25188, 26019, 27099, 28470, 30190, 32367, 35074, 38238, 41862, 45778, 49894, 54009, 57852, 61237, 64104, 66513, 68781, 71341, 74547, 78793, 84427, 91683, 100771, 111481, 123184, 134679, 144240, 150017, 150481, 145082, 134514, 120495, 105140, 90159, 76675, 65063, 55452, 47629, 41386, 36349, 32331, 29186, 26666, 24602, 22778, 21162, 19704, 18371, 17179, 16112, 15114, 14242]
2711A4242p42o16n20m57l84l22k32k31k28k28j37j37k3k2o9o9l8Q7K29L53L91M53M67M68L78
2708A2613K53M5p9k28l52m33m32l84k59j29P8K58L84M03L41L12K49J26q2k56l19l42l42k78
2705A1147p0J73K98L97N22P32Q57Q95Q32P69O44N44M82M35L72K46J82J97K60K85K85M27O35
2702B1546O74N49L72K47Qk00m41o48q93j267j499j623j582j457j375j168r33p25m86k78j22
2700H699LJ07K31M24O32P52Q77R38R38J043J104J116R08N82K91J09M7j5p7j86l11n59p67p94
2697A6092o68n07l82l30l30l71l71l71l72l32l32l59m85n51o14o18n55m55l92l82l19k57j94
2694F545j93j94j60j59j60j59o4o4J0Rl7l6l6l7jjp4p4j29j29j29j30j30j31j30j30o3o3r4
2691C857r4j68j67p4p4j09j09NOK3K4qpj7j7j6j7m1m2m1m1m5m6PPj5j5o7o7j15j14m2m2JJ
$$ y = [14242, 13500, 12884, 12364, 11907, 11523, 11201, 10969, 10738, 10510, 10282, 10145, 10008, 9985, 9963, 9894, 9825, 9787, 9874, 10103, 10456, 10847, 11300, 11767, 12235, 12613, 12866, 12911, 12832, 12604, 12252, 11819, 11387, 11003, 10744, 10615, 10693, 10951, 11335, 11738, 12079, 12391, 12640, 12766, 12684, 12428, 12109, 11767, 11425, 11147, 11077, 11250, 11548, 11945, 12467, 13199, 14056, 14951, 15783, 16552, 17196, 17740, 18222, 18657, 19029, 19275, 19457, 19654, 19914, 20199, 20484, 20911, 21546, 22220, 22769, 23141, 23388, 23396, 23196, 22755, 22107, 21214, 19947, 18448, 16825, 15243, 13786, 12411, 11243, 10310, 9585, 9099, 8821, 8699, 8702, 8809, 9040, 9464, 10096, 10848, 11725, 12663, 13601, 14644, 15748, 16864, 17772, 18354, 18645, 18754, 18801, 18786, 18709, 18523, 18212, 17653, 16886, 16092, 15424, 14917, 14535, 14205, 13875, 13504, 13133, 12762, 12390, 12058, 11726, 11367, 10882, 10331, 9717, 9099, 8544, 8089, 7697, 7315, 6996, 6739, 6545, 6352, 6158, 5998, 5839, 5679, 5520, 5456, 5392, 5402, 5411, 5374, 5338, 5302, 5265, 5264, 5263, 5189, 5115, 4986, 4857, 4728, 4598, 4468, 4337, 4207, 4077, 4014, 3951, 3857, 3763, 3595, 3428, 3354, 3280, 3171, 3062, 3067, 3073, 3096, 3120, 3112, 3105, 3088, 3071, 3055, 3038, 2997, 2955, 2914, 2873, 2828, 2782, 2789, 2796, 2781, 2766, 2699, 2632, 2517, 2403, 2361, 2319, 2320, 2321]
2686B321JJL4L5J07J08O1O2O2O1N0M9klj3j4m4m5j5j6L7L7K4K5K4K5J33J33P0P1k7k8k7k8
2682C269j21j21K4K5n6n5n6n6jjjjk3k3Q0Q1l2l1L1L1L9L9L9L9R3R4j1j0NONOl6l6K6K7qq
2678C272qqm4m4m4m5R5R4j0j0J4J3P6P6L4L4L3L4LMMLQ8Q7Q8Q7K9K9J33J33K54K54K54K54
2673E266M50M51N54N54O27O26P20R28J219J594J848K222K624K914K774J817K58j364k570l028
2671B0484k955k415j765j224p86m94k70o3k1j46m24o32q05q04p03m94l10k48k62k63j83n8
2668E159k4k5M5M5M5M5N3N3N3N2j4j4J31J32K10K11K73K73K98K97M22N47O47P72Q24Q86R74
2665A2370J037J187J395J685K143K657L281M022M813N217M844L299N96k403m774n789n580
2663C0000m733l693k674j801j051n10j11m9k89p47j138j429j491j367j083p92o16m90m57l32
$$ y = [2321, 2322, 2323, 2357, 2392, 2499, 2607, 2668, 2730, 2792, 2853, 2903, 2952, 2950, 2947, 2934, 2920, 2876, 2831, 2816, 2800, 2837, 2874, 2898, 2923, 2947, 2972, 3105, 3238, 3308, 3379, 3352, 3324, 3297, 3269, 3148, 3027, 3051, 3076, 3020, 2965, 2909, 2853, 2852, 2851, 2850, 2849, 2826, 2803, 2883, 2964, 2932, 2901, 2932, 2963, 3002, 3041, 3080, 3119, 3212, 3306, 3295, 3285, 3290, 3296, 3301, 3307, 3271, 3235, 3261, 3288, 3280, 3272, 3264, 3256, 3212, 3168, 3124, 3079, 3174, 3268, 3258, 3248, 3262, 3275, 3351, 3427, 3461, 3495, 3528, 3562, 3565, 3569, 3573, 3576, 3664, 3751, 3839, 3926, 3955, 3984, 4117, 4250, 4504, 4758, 5012, 5266, 5716, 6167, 6721, 7275, 7902, 8528, 9248, 10176, 11395, 12989, 14837, 17059, 19683, 22597, 25371, 27188, 27446, 26082, 23512, 20484, 17529, 15114, 13349, 12125, 11339, 10845, 10575, 10512, 10491, 10345, 9921, 9289, 8484, 7680, 6977, 6483, 6173, 5925, 5663, 5400, 5217, 5159, 5135, 5110, 5155, 5200, 5245, 5290, 5343, 5396, 5449, 5501, 5487, 5473, 5604, 5736, 5946, 6157, 6430, 6703, 7001, 7298, 7720, 8267, 8914, 9686, 10510, 11396, 12370, 13407, 14594, 15989, 17674, 19817, 22474, 25755, 29777, 34590, 39807, 44651, 47950, 48546, 46143, 41369, 35580, 30000, 25267, 21574, 18900, 17099, 16048, 15538, 15427, 15378, 15089, 14342, 13204, 11775, 10284, 8917, 7834, 7042, 6426, 5936, 5479, 5147]
2660E147k80k18j59r6j28j27j15j14j15j14r5r4r5r4l1l1l1l1j01j00M5M4L1L0l1l2k2k2J23
2657C144J24R8R9R9R9K43K42L34L34K60N2j10l17l87l88k55k55j66j67j04j04j24j23o1o1
2654B506n0m9m9n0ppN5N5K2K1m1m1K1K0K1K0K5K4K4K5R1R2R1R1jjjjN1N0J12J13J13J12J75
2650C632J75J97J97J98J97J63J63O0N9R3R3R3R3J23J23J19K44L11L73M13M12M54N16N28O53
2646I682P44R51J211J502J851K059K191K191J875J251M26m46j056j430j410j118p00k42K16
2644A9748O73J060J351J478J415J072L64n36j409k023k314k288j996j675j383j041p49m92
2642A1255l67l23l22l82n07o24o24n22n22m19m18k34k33j30j29jjjjM5M4J49J48J38J38J41
2639F298K04K98M23M81O06P40Q64R94J119J177J052Q02L46j36n10p55p56o28m83k65NL35N64
$$ y = [5147, 4867, 4649, 4490, 4394, 4266, 4139, 4024, 3910, 3795, 3681, 3586, 3492, 3397, 3303, 3272, 3241, 3210, 3179, 3078, 2978, 3023, 3067, 3098, 3128, 3097, 3065, 3043, 3021, 3144, 3268, 3366, 3465, 3564, 3663, 3906, 4148, 4482, 4816, 5076, 5128, 5018, 4701, 4314, 3926, 3671, 3416, 3250, 3083, 2979, 2875, 2751, 2628, 2567, 2506, 2456, 2407, 2358, 2308, 2301, 2294, 2349, 2404, 2426, 2447, 2406, 2365, 2386, 2406, 2427, 2447, 2472, 2496, 2520, 2545, 2636, 2728, 2819, 2910, 2909, 2908, 2907, 2906, 2957, 3007, 3119, 3232, 3345, 3457, 3632, 3807, 4004, 4201, 4399, 4596, 4759, 4922, 4982, 5041, 5134, 5227, 5320, 5413, 5536, 5659, 5778, 6022, 6333, 6706, 7119, 7531, 7985, 8501, 9029, 9682, 10426, 11377, 12588, 14090, 15941, 18000, 20191, 22382, 24257, 25508, 25934, 25488, 24432, 23002, 21592, 20474, 19774, 19532, 19748, 20421, 21481, 22832, 24310, 25725, 26797, 27161, 26625, 25216, 23193, 20879, 18591, 16595, 14920, 13537, 12496, 11747, 11255, 10888, 10565, 10243, 9861, 9354, 8730, 8106, 7584, 7062, 6643, 6225, 5991, 5758, 5628, 5499, 5498, 5497, 5496, 5495, 5540, 5584, 5733, 5881, 6019, 6157, 6298, 6502, 6800, 7223, 7704, 8310, 9050, 9914, 10908, 12027, 13204, 14256, 15058, 15404, 15268, 14758, 14003, 13247, 12619, 12136, 11871, 11876, 12211, 12775]
2636A2775O83P46P88P26M67n4o34j113j426j426j305j117q65o35m49l04k26k26k35k36l39
2633E595l39k89k89k58k58k31k31k26k27j60r7j29j29j06m3j7j6r6r6l3l3k7k7k7k7j3j4p5
2630B082p6mml6l5L1L2Mn8n7n6JKL1L0l2l2m6m5J6J7M9M8j0j0JO2N9N8J00R9P9J6J5J19J53
2626B603R2K6K7Q4Q5O2O2jjJ4J5J8m4n6n6M0M1M6j6m4m3k7k7n5j17j40j40q2q2r5r6r2r1p1
2621A839rqp1q7q6J4J3m7m8j6j6K8K8N9N9L4L4KLl7l8O7O7L7L7NON8N8N8N8KJKJK2K2K1K2
2617B194k2k2k3k2J7J7J7J7K7K7l5l5K8K7j4j19j74j12m9n0m6m7m7m7k0k0k0k0kjL0L0n6n5
2612A373PP%jo3o3J2J1J2J2l3l3kkk1k2M0M1J8J9P4P4N0n5r9j00k7k6P8P8L0L1p4p4K5K4o
2608A315pj0j0j0j0lmO0N9J1J1J1J1RJ0J0RL7L6L7L6k8k8n9o0L4L4J0n2j5M8M3j9q0q0k1k2
$$ y = [12775, 13458, 14204, 14992, 15718, 16185, 16131, 15497, 14384, 12958, 11532, 10227, 9110, 8245, 7610, 7161, 6857, 6631, 6405, 6170, 5934, 5595, 5256, 4967, 4678, 4420, 4162, 3931, 3700, 3474, 3247, 3087, 2990, 2861, 2732, 2626, 2583, 2566, 2550, 2454, 2358, 2325, 2292, 2265, 2238, 2211, 2184, 2171, 2157, 2082, 2006, 2002, 1998, 1962, 1927, 1958, 1990, 1994, 1936, 1879, 1823, 1824, 1826, 1857, 1887, 1855, 1823, 1777, 1732, 1748, 1765, 1814, 1862, 1852, 1842, 1843, 1905, 1964, 2022, 2122, 2221, 2300, 2316, 2331, 2450, 2603, 2695, 2721, 2748, 2832, 2917, 2979, 3041, 3040, 3039, 3053, 3068, 3086, 3042, 2986, 2930, 2970, 3011, 3057, 3041, 2997, 2954, 2927, 2900, 2845, 2728, 2588, 2448, 2366, 2284, 2189, 2093, 2001, 1910, 1839, 1830, 1822, 1751, 1664, 1578, 1592, 1605, 1558, 1510, 1494, 1478, 1506, 1534, 1593, 1652, 1686, 1720, 1722, 1725, 1688, 1650, 1717, 1784, 1821, 1858, 1863, 1869, 1927, 1985, 2043, 2101, 2103, 2104, 2106, 2107, 2129, 2151, 2172, 2194, 2172, 2150, 2127, 2105, 2122, 2139, 2156, 2173, 2200, 2227, 2192, 2157, 2185, 2212, 2198, 2079, 1905, 1793, 1744, 1694, 1648, 1601, 1554, 1507, 1487, 1467, 1447, 1427, 1425, 1424, 1454, 1484, 1428, 1373, 1380, 1387, 1387, 1386, 1323, 1260, 1272, 1283, 1295, 1307, 1274, 1241, 1239, 1237, 1216, 1194, 1234, 1275, 1293, 1312, 1386, 1460, 1510, 1455, 1356, 1256, 1229, 1203, 1281, 1359, 1389, 1420, 1346, 1272, 1297, 1321, 1315, 1308, 1298, 1288, 1278, 1268, 1265, 1261, 1321, 1380, 1391, 1402, 1413, 1424, 1433, 1443, 1453, 1462, 1499, 1535, 1572, 1608, 1580, 1552, 1493, 1433, 1467, 1501, 1511, 1459, 1444, 1492, 1535, 1516, 1436, 1356, 1335, 1313]
2603A313j4j3M5M4j0p3o5o5n7NL3L3k8k7L4L5nonoJ4J4m4m5l9K3N0N1j6j5J6J6L4L4L0K9M7
2599A367j7q1q1l7K6R1R0J3n0p3p3p4j3R2R2O1m2n5Q%o3n9LK6K7K6K6K8l4j35p2L0R1L4l0
2595A142j0j1j5j5J4J3J4J4l5l5K7K7K3K3qrQRQQl7l7K6K6J4J4J1J0N2j0l8l8N2N2K5l7o6
2590A211o5m2K0N9N9l3r6o6mN1N1k7k7l1L2M0M1j0p3o5kO9O9j0p2m1K2mm%%K8K9K5K4ko5o1
2585A030o1mnM8M7N8N9OOK5K4k7k8K7K6m2m3KO5O5Kn6n6o3kL7L6l2l3l4l5l1l1LO4L4k9ml
2581A045O5O5Q2Q2O4Kk7k8l1l1K5K5ooO4O4J5r0r9NN5N4k4k4k4k4k1k1K8K7Ko0p3p2LO5O6
2576A242Ln9n9mN9J6J6n3n3n1n2K1K1L9L8j3j3qppqn8n8ooKKJKJ6J6l2l2k3L9L9k3n4n3L6
2571H76L6l7l6L6L6K5K4K5K4j9j9k0j9PPPQo8o8K6Q9N7m7n1J2KKk9L3O2O2k7k8m3m2m2m3L6
$$ y = [1313, 1299, 1286, 1331, 1375, 1365, 1292, 1227, 1162, 1105, 1110, 1143, 1176, 1148, 1121, 1155, 1190, 1185, 1179, 1174, 1168, 1182, 1196, 1152, 1107, 1068, 1091, 1141, 1192, 1176, 1161, 1177, 1193, 1227, 1261, 1291, 1320, 1367, 1350, 1269, 1188, 1151, 1177, 1268, 1358, 1371, 1321, 1248, 1175, 1101, 1088, 1180, 1272, 1333, 1291, 1236, 1244, 1244, 1181, 1122, 1125, 1151, 1178, 1204, 1230, 1258, 1224, 1089, 1017, 1047, 1138, 1172, 1142, 1132, 1121, 1106, 1091, 1105, 1118, 1132, 1146, 1111, 1076, 1103, 1130, 1153, 1176, 1168, 1159, 1167, 1176, 1184, 1192, 1155, 1118, 1144, 1170, 1184, 1198, 1209, 1219, 1271, 1261, 1223, 1185, 1237, 1289, 1314, 1277, 1211, 1146, 1104, 1124, 1183, 1242, 1209, 1113, 1047, 1043, 1094, 1145, 1118, 1091, 1060, 1092, 1132, 1173, 1163, 1090, 1025, 1023, 1092, 1161, 1151, 1079, 1038, 1060, 1056, 1052, 1052, 1052, 1080, 1109, 1134, 1158, 1156, 1091, 1030, 969, 965, 960, 1008, 1055, 1113, 1172, 1178, 1184, 1209, 1233, 1206, 1178, 1205, 1231, 1189, 1146, 1148, 1213, 1278, 1280, 1224, 1168, 1105, 1103, 1140, 1176, 1144, 1111, 1077, 1042, 1011, 980, 983, 1047, 1081, 1052, 1048, 1045, 1110, 1175, 1257, 1339, 1403, 1405, 1378, 1350, 1319, 1288, 1313, 1338, 1332, 1326, 1390, 1454, 1469, 1379, 1280, 1285, 1340, 1394, 1370, 1346, 1322, 1298, 1277, 1256, 1284, 1311, 1313, 1253, 1180, 1108, 1111, 1176, 1242, 1245, 1186, 1127, 1123, 1182, 1198, 1214, 1161, 1108, 1057, 1005, 1026, 1047, 1086, 1124, 1111, 1098, 1090, 1083, 1076, 1068, 1010, 952, 946, 940, 942, 944, 945, 947, 963, 979, 947, 915, 892, 931, 970, 947, 893, 840, 876, 912, 875, 839, 875, 911, 936, 960, 985, 1009, 990, 971, 951, 932, 939, 946, 953, 961, 893, 825, 851, 940, 997, 950, 899, 911, 913, 915, 886, 919, 981, 1043, 1016, 988, 945, 903, 861, 818, 854]
2567H54L6K3l9o1JL4L5PQR7R7M9j3n1n1j6j5L6L6K3K3rqL1L0m5j07p8j7N6N5J7m6m1m2l8l8
2562H33l8l8j8j8n3RN1N1N4N5j7j6n2J1O0O0onQP0J9m4q3q4OOL5L6L6L6j%j%qrqqOOOOr1r0
2557G72M5M5L5L5MLJJJJk3k3k4k3j6j5j6j5k5k6k5k5M0M0L9M0J4J4J4J4L9L8j3j3L4L5l9l8
2552I45k9k8k9k8L7L8l5l5llklK9K9R5R5%j04j12n0POk1k0L7L8POrrK3K2K7K6K6K6k1k0k1
2547I37k1NNo7o8K1K1j0j0k2k1k1k1n7n6J6J7N1N1N1N0m4m4m4m4NNNNL3L4L3L4l8l8ppN3N3
2543H45k0k0j5j6j6j6K5K4K5K4j3j3m5m4lkO6O6O5Kr1r1n8M5Q1Q0J7J6J6J6o3o3m7J6P4P4
2538I41l9j02o1%L5L5Q7Q8L6o8j08m6M7M8M4M4qrl1l2jjJ4J5J4J4n8n8k6k7l4l5J8J7M0M0
2534H33L9M0kkkkK3K3l1r4j00l6N9N9lmmlL3L3LKm4m4QRMMm4m4o2%N9N8L9L8L4L5k7q8l7K5
$$ y = [854, 890, 913, 874, 813, 814, 848, 883, 890, 898, 995, 1092, 1141, 1128, 1077, 1026, 1010, 995, 1031, 1067, 1090, 1113, 1104, 1096, 1127, 1157, 1112, 1005, 927, 910, 966, 1021, 1038, 992, 951, 909, 871, 833, 795, 757, 739, 721, 668, 677, 728, 779, 833, 888, 871, 855, 803, 814, 874, 934, 928, 923, 931, 1001, 1020, 976, 893, 809, 815, 821, 856, 892, 928, 964, 963, 963, 962, 962, 954, 945, 937, 929, 935, 941, 947, 953, 862, 772, 817, 862, 897, 932, 936, 939, 940, 941, 942, 943, 920, 897, 873, 850, 834, 819, 803, 788, 763, 737, 712, 687, 727, 767, 806, 846, 860, 874, 888, 902, 941, 979, 966, 953, 987, 1022, 983, 945, 916, 888, 859, 831, 868, 906, 871, 836, 833, 830, 828, 825, 854, 883, 978, 1073, 1073, 969, 857, 807, 814, 820, 799, 779, 816, 854, 861, 867, 858, 849, 872, 894, 921, 947, 973, 999, 978, 958, 937, 916, 921, 926, 859, 791, 812, 833, 823, 813, 791, 770, 749, 728, 671, 615, 631, 648, 699, 750, 801, 851, 807, 763, 719, 675, 680, 685, 690, 695, 728, 762, 795, 829, 791, 753, 746, 739, 792, 845, 825, 805, 790, 774, 758, 742, 767, 791, 816, 840, 827, 814, 769, 725, 722, 720, 786, 852, 917, 919, 828, 737, 679, 724, 805, 885, 902, 918, 934, 950, 887, 824, 777, 793, 867, 941, 902, 800, 739, 739, 774, 809, 896, 984, 1020, 952, 844, 798, 845, 893, 937, 981, 973, 964, 933, 901, 900, 899, 913, 928, 942, 956, 898, 840, 814, 787, 753, 718, 736, 753, 793, 833, 872, 912, 910, 908, 906, 904, 927, 950, 919, 825, 725, 689, 748, 807, 804, 800, 796, 793, 826, 859, 862, 864, 820, 776, 784, 793, 797, 801, 757, 713, 651, 651, 710, 768, 807, 845, 879, 914, 887, 799, 762, 787]
2529G87K4K5llkjjjm5m6PPJ9K0J3J3M4o1r9l7N2N3N2N2Rn5j9j9jj%jN2N2j0j0lmlmk1k2k2
2523G87k1m2m2K1K1k6k7kN9N1j2l5l5K3K3K3K4KKkkL5k8r0k8R0R0j2p5j7M6j6p9p0qJ6J5N9
2519G18N9po9l7K5K0m1k3k4P7P7J2J2J2J2J9K0l9l8o0Lk8k9n4QL5L6kkkjj8j7j7j8J0RP2P1
2514G81K9K9K5K5k2q5q4k3K4K3l1l2j9M3M3k0j9k0M0L9l1l0l1l0KKKKj8j8j8j8J0J1J1J0K1
2509F23K0K1K0opppO9O9OPK8K9Nn7k0M2MMk8k8L1L1n0j12n1J3rrN4N4M2k0q6q5J0P2P2Rk2
2505G31k2k6k6MMMML2L2l0l1ppN1N2Rn4j8j8M9N0j3j3l6l6K3K3Rn2p6p6M0J03O7O8J3J3m9
2500G91m9l9l9K7Q9Q1J8m6m7K4K4l8l9N3N2j2p5k2L9NNlN9O0ll7l7l7l7m4J8Q6Q7j6j6j6j6
2495H50o8o8onJ7J6J7J7M3M3M2M3o4o4jkj2j2j2j2J7J8m5m5K4K4K4K4K7K7K6K7ppqpj9k0j9
$$ y = [787, 811, 836, 833, 830, 828, 827, 826, 825, 780, 734, 741, 748, 767, 787, 800, 813, 857, 796, 697, 660, 712, 765, 817, 869, 878, 823, 804, 785, 784, 783, 783, 782, 834, 886, 876, 866, 863, 859, 856, 852, 831, 809, 787, 766, 724, 682, 703, 724, 698, 671, 669, 728, 779, 767, 732, 697, 720, 743, 766, 790, 792, 794, 792, 790, 825, 797, 707, 679, 769, 859, 847, 772, 755, 801, 785, 706, 636, 628, 644, 659, 718, 777, 770, 701, 664, 689, 709, 668, 645, 621, 698, 775, 787, 799, 811, 823, 842, 862, 823, 785, 725, 728, 700, 671, 617, 625, 660, 696, 694, 692, 690, 689, 671, 654, 637, 619, 629, 638, 710, 781, 810, 839, 864, 889, 867, 782, 698, 675, 699, 722, 691, 659, 640, 683, 726, 706, 687, 667, 707, 746, 715, 685, 654, 624, 626, 628, 630, 632, 614, 596, 578, 560, 570, 581, 592, 602, 623, 643, 664, 684, 678, 671, 664, 657, 726, 795, 801, 808, 836, 865, 870, 813, 793, 835, 839, 843, 815, 787, 818, 849, 799, 687, 636, 649, 640, 631, 685, 739, 781, 761, 675, 590, 600, 672, 744, 753, 731, 709, 683, 657, 661, 665, 669, 673, 705, 737, 707, 676, 669, 662, 713, 765, 774, 720, 702, 684, 733, 783, 770, 757, 721, 685, 708, 731, 740, 688, 612, 536, 576, 679, 746, 814, 827, 840, 791, 742, 703, 664, 691, 780, 861, 879, 833, 786, 810, 834, 796, 757, 810, 862, 850, 775, 753, 792, 797, 802, 799, 858, 918, 915, 878, 841, 804, 767, 723, 741, 827, 914, 898, 882, 866, 850, 782, 714, 708, 703, 720, 736, 753, 770, 813, 856, 898, 941, 877, 813, 812, 810, 798, 786, 774, 762, 779, 797, 752, 707, 731, 755, 779, 803, 830, 857, 883, 910, 903, 896, 888, 881, 862, 842, 823]
2491H23k0k5k6k5k5ppK5K4K3K3Q2Q2m8j10j02KR1R2N5m8p8j6M6M7j2j2p5p4n5n5M9M9O9P0
2486H32QPm5m5J8J7ooN7N6noo9o8M8M8M8M8%%L1L2k2k1q4q4K0K1K0K1k8k8k7k8PPOPk2k2k2
2481G21k2L5L5L4L5n1n2n1n1J7J7J7J7l3l2l2l3K6K6K5K6onN7N7K9K9l3l4jj%jn5n5M8M9l
2477G49lo6o5J8J9J8J8K3K2K2K2j0j0j1j0J3J4J3J3l0l0l0l0J9K0J9J9l2l1l2l2j1j0N2N1
2472G01l4l3llKKO4O4K9L0p5p5rqrqL7L8k1k1J3P5J03jo3jO2O2k6k7NNm9m8j8j7oonok6k6
2467F68L7L6J2J1k0k0K0K1K1K0o2o2J%l9l9K3K3M7M7M6M7k8k8k8k8l6l6mnL8L7j5j4n2n1M3
2463F31M2M1M0RRMMMLMMLML7L7L8L7pqppM7M7M8M7j2j2j2j2n6n5O0N9J4J4j8j7o3o3l1l2n3
2458H22n4k2k3L3L2k0k0L7L7j5j4K4K4ppN3N3k0j9l9l8J3J4k8k8k8k8M7M6J6J5o1o2J1J2O4
$$ y = [823, 803, 778, 752, 727, 702, 695, 688, 713, 737, 760, 783, 865, 947, 899, 789, 687, 689, 780, 872, 927, 879, 801, 785, 831, 878, 866, 854, 779, 705, 650, 595, 644, 693, 762, 832, 840, 847, 802, 757, 775, 792, 786, 780, 837, 893, 888, 882, 813, 745, 793, 841, 889, 937, 937, 937, 968, 1000, 978, 957, 873, 789, 809, 830, 850, 871, 843, 815, 788, 760, 767, 774, 780, 787, 765, 743, 721, 699, 734, 769, 803, 838, 787, 735, 684, 633, 650, 667, 684, 701, 668, 636, 604, 571, 597, 623, 648, 674, 668, 663, 720, 777, 806, 835, 802, 768, 767, 766, 766, 765, 710, 655, 703, 752, 749, 746, 680, 615, 633, 652, 670, 688, 711, 733, 755, 777, 767, 757, 746, 736, 749, 763, 776, 789, 759, 729, 699, 669, 688, 708, 727, 746, 714, 683, 651, 619, 608, 598, 650, 701, 667, 634, 631, 628, 630, 632, 696, 760, 789, 819, 744, 669, 660, 652, 643, 635, 672, 710, 689, 668, 681, 756, 859, 858, 795, 794, 856, 918, 892, 865, 870, 875, 826, 778, 760, 743, 737, 731, 726, 720, 694, 668, 705, 741, 753, 764, 744, 724, 744, 765, 786, 806, 744, 682, 683, 683, 644, 605, 628, 651, 698, 745, 791, 838, 810, 782, 754, 726, 690, 654, 650, 645, 683, 720, 705, 691, 639, 588, 631, 673, 714, 754, 763, 772, 776, 780, 784, 787, 791, 795, 798, 802, 839, 876, 914, 951, 944, 936, 929, 922, 969, 1016, 1064, 1111, 1099, 1087, 1075, 1063, 1007, 952, 1012, 1071, 1085, 1099, 1081, 1064, 1001, 938, 907, 875, 822, 768, 746, 723, 756, 788, 768, 748, 785, 822, 807, 793, 817, 841, 834, 827, 880, 933, 913, 894, 855, 817, 830, 844, 816, 788, 760, 732, 779, 825, 841, 856, 795, 733, 744, 756, 820]
2453H20O5O4O5l4l4l4l4k0k1k1k1J2J2J3J2K5K6K1K1l5r8j21j8Q6Q5kjJ6J7n6n6jjn0m9j3
2449F40M9K3m0k8L6O5O5On7j09m6N6N6K5l6j5M7QQononMMMMJ6J7J7J7j9j8j5j5n0J2L2L3J1
2444G85P4P4J1r9r8l0l0m0m1J7Q0M4M5M4M4l7j00n2J1N8mn9n8k9k9RP1R5R5K7K6j3j3j3j3
2440H52m6m6QP1N8nk2k2M2k1n9n9K4K5K4K4L3L3n6n7j8M4M3j8j4j4j8j8j1j1j1j1J0J0k2k1
2435G21j8j7L4L5lkl4l3j0rrj0k3k4M9M9J0RJ0Rk1k1M1M2J4J5J4J5ppJ6P9J5m8p5j3K7K7l1
2430H16l2m1m1j4M8O9O9J1J1k7k6k6k6NNJJN0j3m0m0PPn2n1k4L9O3O2lo5o9oJ7m4o4o4K3Q5
2426F21N4qrj0J9J8M2M3J2J1N7N7O1jk5k5k9k8o5o5L9L9J%K7K8no7r8l6M4M5j4j3k0j9j9j9
2421F43M5M6J4J4K3K3mo7m6m6J4P7P0Pn9n8j7j7j7j8OOk5k6Q6Q6K3K4L2L2l1r3p2L2O7Nl4
$$ y = [820, 885, 949, 1014, 980, 946, 912, 878, 858, 837, 816, 795, 807, 819, 832, 844, 869, 895, 916, 937, 902, 804, 683, 665, 751, 836, 834, 833, 849, 866, 810, 754, 753, 752, 702, 653, 640, 689, 712, 672, 644, 680, 745, 810, 816, 759, 650, 604, 660, 716, 741, 705, 690, 737, 745, 753, 747, 742, 736, 731, 735, 739, 743, 747, 763, 780, 797, 814, 795, 777, 762, 747, 697, 709, 741, 774, 785, 859, 933, 944, 845, 747, 717, 687, 647, 606, 623, 703, 747, 792, 836, 880, 843, 743, 691, 702, 760, 756, 697, 639, 610, 581, 590, 661, 756, 851, 878, 904, 891, 878, 865, 852, 806, 760, 768, 839, 897, 892, 870, 848, 890, 869, 810, 751, 775, 800, 824, 848, 881, 914, 858, 801, 783, 827, 870, 852, 838, 824, 806, 788, 777, 766, 755, 744, 754, 764, 742, 721, 703, 686, 720, 755, 752, 750, 716, 683, 673, 664, 655, 645, 622, 598, 647, 696, 706, 715, 725, 734, 713, 692, 733, 775, 789, 804, 818, 833, 826, 819, 835, 914, 929, 881, 806, 793, 820, 847, 816, 784, 743, 702, 688, 736, 805, 874, 885, 896, 869, 843, 817, 791, 796, 801, 802, 803, 853, 840, 800, 760, 767, 774, 722, 671, 647, 686, 749, 811, 808, 743, 674, 668, 685, 641, 577, 513, 536, 621, 675, 667, 658, 648, 667, 685, 727, 770, 782, 793, 850, 907, 968, 967, 942, 917, 888, 860, 795, 730, 769, 808, 809, 809, 836, 864, 859, 792, 694, 658, 702, 747, 733, 720, 700, 681, 662, 643, 688, 734, 748, 762, 785, 808, 804, 737, 691, 645, 659, 736, 806, 813, 754, 696, 679, 662, 645, 627, 633, 639, 614, 588, 674, 760, 783, 807, 839, 871, 840, 747, 675, 707, 774, 779, 745]
2416G45l3l4l4j8M5P1P2J4J5m4m4l4K8K8l4nnK2K2m3m3J9J9L8L9L4L5Qn5q5k4O7O7l3l4RR
2412H04m9n0rN3N3j0l8l8K1K0J0RRRK0K0K5l9q2q1J8J8L4L4LKl8l9K4K4K6K6l7l6j9j8M3M4
2407G66ppppO6O6L9k3OPLKj8j7M4M5J4J4j7j7kjkklmL6k7m9J4L8L7k3k4k4k3n3n4J0R%jl1
2402G73l2J4J3J4J3poppj4j5j5j5L9L8k3k4l9m0l9l9J7J6P9P9M2M2n5n4p8M7L9L9o7o6L7L8
2398G37j6j6j6j6N6N6m9m8m5m4J8J8J4J4P7P6k8k9k9k8m8m8N7N6K6K5l7l7j2j1j2j1j1j2N1
2393F78N1K3K2K2K3p0p0p0p0N1N0N0N1onool5l5K7K6N2N2N1N2m7m7m7m7kllkOOOOk9k8L3L4
2388G44k2k2k1k2k5k6k5k5OOOOP5P6P5P5p1p0qql0l0l1l0K1K2K1K1l5l4l5l5K8K8R0R0j5j5
2384G55j5j5LKLLl6l7K7K6j4j3M9M9k0j9k0k0N0N1j2j2j5j5j4j5M7M7j5j6k5k6k6k6JJO3O2
$$ y = [745, 712, 678, 644, 626, 671, 742, 814, 828, 843, 799, 755, 721, 749, 777, 743, 738, 733, 755, 777, 734, 691, 710, 729, 767, 806, 840, 875, 883, 828, 743, 719, 786, 853, 820, 786, 795, 804, 755, 705, 696, 749, 802, 792, 754, 716, 737, 757, 767, 776, 785, 794, 814, 834, 859, 820, 738, 657, 675, 693, 727, 761, 764, 766, 728, 689, 713, 737, 763, 789, 752, 716, 697, 679, 722, 766, 759, 752, 745, 738, 804, 870, 909, 886, 892, 899, 902, 904, 886, 869, 913, 958, 972, 986, 969, 952, 950, 949, 947, 945, 942, 938, 974, 947, 898, 912, 950, 987, 964, 940, 916, 893, 840, 786, 796, 805, 805, 804, 773, 741, 755, 768, 782, 795, 788, 782, 775, 768, 754, 739, 724, 709, 748, 786, 763, 739, 700, 660, 621, 582, 599, 615, 694, 773, 815, 857, 802, 748, 670, 717, 756, 795, 728, 662, 699, 737, 721, 705, 689, 673, 729, 785, 736, 688, 643, 599, 617, 635, 649, 663, 740, 816, 788, 759, 730, 702, 654, 606, 663, 719, 745, 770, 733, 696, 684, 673, 661, 650, 639, 627, 678, 729, 752, 774, 796, 819, 749, 679, 609, 539, 590, 640, 690, 741, 735, 730, 724, 718, 683, 648, 675, 701, 753, 805, 856, 908, 861, 814, 767, 720, 718, 715, 712, 710, 716, 722, 728, 734, 705, 677, 710, 744, 722, 700, 679, 657, 632, 606, 581, 556, 562, 568, 574, 580, 655, 731, 806, 881, 810, 740, 732, 724, 694, 664, 633, 603, 624, 646, 667, 688, 653, 619, 584, 549, 577, 605, 695, 785, 770, 755, 740, 725, 728, 730, 733, 736, 700, 663, 690, 716, 702, 689, 738, 787, 767, 748, 728, 708, 758, 809, 797, 785, 770, 755, 741, 726, 773, 820, 805, 789, 764, 738, 712, 686, 687, 688, 751, 813]
2379H13k8k8k8k8mnN8N8l1l0L1L2k0k1k1k0l4l3K9K9K8K9K9K8oopoJ6J6J6J6kklkj6j7j7j6
2374G97KLLLL0L0l2l2k7k7k7k6j6j5M8M7J6J6J7J6o1o0KKj4j5M5M4J12N0rqm6m6k8L3L6L6
2369H99l2l3j8j8L0L0mo6q9J4N9N9k7k8K9K9k3k3N4N4k2q4r6l3K1K1j6j5k0M4Q6Q7L2l0o4
2365H07o4j6j6OOL7L7M0M0J0Rnmmnj4j4j4j4K6K7K7K6ppppj0j0m5J7ONJ0RK7K6K6K6j2j3j3
2360I49j3j2j2j2j3K7K7K6K7mmmmj0j0j0j0N2N3jo4n3J0Q6Q5K9L0K9K9q8q9l6O8Q2K1n3n3
2355A075N6N5lo6n4n5J4J5M1M2J0J0J0J0m2m3J2J2M2M3LLKLj%l2l2q9q9MMJ5J5J4J5K7K8K7
2351A101K8l3l2l2l3J3J2J2J2jkp4p4J5J6J5J5l8l9l8l9QRQQJ4J4J4J4K1K2rj0k5k6K6K7J4
2346I33J4n8n8l7l7L6L6K5K5K5K6QRm3m3N6N6l7l8M9M9llm6m6m5m6N6N5MLk8k8k8k8l8l7J5
$$ y = [813, 785, 757, 729, 701, 697, 692, 750, 808, 777, 747, 778, 810, 790, 769, 748, 728, 694, 661, 690, 719, 747, 776, 805, 833, 827, 821, 814, 808, 824, 840, 856, 872, 870, 868, 865, 863, 847, 830, 813, 797, 799, 802, 805, 808, 838, 868, 836, 804, 777, 750, 723, 697, 681, 666, 714, 761, 777, 793, 810, 826, 765, 705, 707, 709, 695, 680, 725, 769, 881, 931, 922, 914, 868, 822, 794, 827, 863, 899, 867, 834, 816, 798, 828, 858, 854, 788, 699, 713, 772, 831, 804, 776, 805, 834, 811, 788, 842, 896, 874, 790, 694, 661, 682, 703, 687, 672, 652, 696, 782, 869, 901, 871, 807, 743, 727, 711, 717, 723, 760, 797, 837, 877, 887, 896, 891, 887, 883, 878, 864, 850, 836, 822, 848, 875, 902, 928, 921, 914, 907, 900, 890, 880, 835, 852, 858, 863, 873, 882, 909, 935, 961, 987, 975, 962, 949, 936, 924, 912, 900, 887, 914, 941, 967, 994, 990, 986, 982, 978, 968, 958, 948, 938, 990, 1043, 1042, 978, 925, 935, 1021, 1106, 1135, 1165, 1194, 1223, 1135, 1046, 1010, 1078, 1160, 1181, 1128, 1075, 1131, 1186, 1183, 1117, 1063, 1008, 1022, 1037, 1078, 1120, 1130, 1140, 1150, 1160, 1118, 1075, 1087, 1099, 1141, 1184, 1187, 1190, 1192, 1195, 1194, 1194, 1162, 1130, 1041, 952, 956, 960, 975, 990, 1004, 1019, 1046, 1074, 1101, 1129, 1096, 1064, 1032, 999, 1012, 1024, 1036, 1048, 1047, 1045, 971, 897, 912, 928, 943, 958, 920, 881, 843, 804, 812, 821, 829, 837, 851, 865, 879, 893, 914, 936, 927, 917, 892, 866, 892, 919, 933, 947, 889, 831, 794, 757, 793, 829, 854, 879, 904, 930, 938, 947, 904, 861, 917, 973, 936, 898, 947, 996, 993, 990, 944, 898, 853, 807, 863, 918, 922, 925, 897, 869, 841, 813, 775, 738, 753]
2341G53J4K2K2K2K1n2n2n3n2J4J5j7j7j1j0O2O3K0K0J16J16R0l5o9o9l4l3l4l4p2p1rrN0N1
2337G38j2j2OOO9O8K4K4l9l8n3n3RJ0j4j4j5j4K4K3K4K3L5L6L5L5r3r4J1J0k9l0k9l0j4j4
2333F13j4j4K6K6l6l6K6K6K6K6P8P9k6k6j9j9M3M4r5r4RJ0J4J5J5J4PPPPRRn3n2P7P8J6J6
2328H39j0rrro5o4lkk0k1k0k1R4R4O1o5o7o7j2j2mllmO2O1O2O2j7j6p9p9L2L2L9q5n7n8Q1
2323F38Q0K2K2K2K1l5l6K7K6K1K0K0K0o6o7o7o7k1k2M1M1J4J3J4J3O7O6l7l7m8m8J4J4lmm
2319F74mqrqrJ4J4J4J3K0K1Q2Q3k3k3k3k2LLMLJ0J0n3n2J3J4J3J4RJ0RJ0J1J1J2J1k3k2k3
2314H03k2j8j7j8j7MNNMn2n2R3R3P4P4l1l0J1J0n2n1l0l0L3L2llllj2j3j2j2jjjjj4j4j4j4
2309G00mmmlJ3J4J4J4l5l5L4L4K4l9mlN5N6j7j7m2m3L3R6O8Nm9m9K8K8oo9m6J7QRMLLMj7j7
$$ y = [753, 767, 789, 811, 833, 854, 802, 750, 697, 645, 659, 674, 657, 640, 629, 619, 681, 744, 764, 784, 900, 1016, 1106, 1071, 1002, 933, 899, 866, 832, 798, 726, 655, 646, 637, 687, 738, 726, 714, 720, 726, 795, 863, 887, 911, 872, 834, 781, 728, 737, 747, 733, 719, 704, 690, 714, 737, 761, 784, 819, 855, 890, 925, 832, 738, 749, 759, 730, 700, 671, 641, 627, 613, 599, 585, 611, 637, 601, 565, 591, 617, 643, 669, 747, 826, 800, 774, 755, 736, 779, 823, 728, 634, 643, 653, 667, 682, 697, 711, 718, 725, 732, 739, 748, 757, 704, 652, 729, 807, 823, 839, 829, 820, 811, 802, 737, 673, 670, 668, 648, 627, 607, 586, 680, 774, 835, 770, 703, 636, 624, 612, 608, 605, 602, 598, 660, 721, 783, 845, 828, 812, 733, 654, 686, 718, 757, 672, 615, 557, 638, 718, 740, 762, 784, 805, 770, 734, 761, 787, 808, 828, 848, 868, 802, 735, 668, 601, 580, 558, 599, 640, 654, 667, 681, 694, 761, 827, 790, 753, 705, 657, 671, 685, 682, 678, 674, 670, 662, 653, 645, 636, 650, 664, 678, 691, 711, 732, 814, 897, 874, 851, 828, 806, 809, 812, 816, 819, 829, 839, 786, 734, 747, 761, 774, 788, 797, 807, 816, 826, 837, 848, 860, 871, 848, 826, 803, 781, 763, 746, 728, 711, 715, 720, 725, 729, 677, 625, 718, 811, 885, 959, 928, 898, 909, 919, 867, 816, 786, 756, 789, 821, 818, 815, 812, 809, 797, 784, 772, 760, 759, 758, 757, 756, 742, 728, 714, 700, 696, 692, 688, 685, 698, 712, 726, 740, 705, 670, 704, 738, 762, 723, 719, 716, 771, 827, 810, 793, 751, 708, 741, 837, 905, 910, 861, 812, 840, 868, 862, 793, 747, 764, 772, 781, 785, 788, 791, 795, 778, 761]
2304G61j3j2J6Q0M4M4m1m2m2m2l2l2K0K0%%%JLMP2P2N9lk0k0l2l1%%L7L6L7L7mlmlj3j3J5
2299I56J4n7j20n2J2M9j4k7k6K1K0j0j0mlllQPQQJ2J2J3J2J4J4J4J4OOkO1R2L0k5k4K8K9k4
2294A056k3RJ0j8j8LO5O6Km0m1m5m5%%%%%%%%mmmnk7k8k7k8j0j1j1j1qqK3K3RJ0m3m3o2o3
2289F49N1N2j0j1j1j0N9N9K8K8L3L3l9m0KKR6R6M2M2l1l1o6o7l5l5k8k8k8k8m9m9m9n0M6M6
2284F69M6M6j4j4j4j4N6N7N7N7l5l6o6o7O6O5J4J4n9n8pok1k1k1k1L7L8L7L7l4l4l4l4K6K6
2280G38K6K6l6l5l6l5L2L3L3L2n0n0KJJ8J9l4l4mmM8M8J5J6J6J5k3k3k3k3k4k5L8L8J3J2J2
2275G72J3K0K0K0K0q5q6k4k3M9M8j3j4onK5K6L3L2k9l0N6N7m8m7o0o0k9k9qqpqL1L1%%l6l5
2271E63O8O8O2O1kjm4m5m4m5L8L9OPo4o4jkM5M5j8j8lmN9N9l7l8K6K5J1J2n1n1J8J8q6q6M7
$$ y = [761, 748, 736, 752, 832, 876, 920, 879, 837, 795, 753, 721, 689, 709, 729, 729, 729, 729, 730, 733, 737, 809, 881, 940, 937, 917, 897, 865, 834, 834, 834, 871, 907, 944, 981, 977, 974, 970, 967, 954, 941, 956, 970, 913, 793, 741, 753, 802, 788, 761, 735, 756, 776, 766, 756, 752, 749, 746, 743, 751, 758, 766, 774, 786, 798, 811, 823, 837, 851, 865, 879, 885, 891, 889, 950, 1042, 1072, 1047, 1023, 1051, 1080, 1056, 1033, 1042, 1052, 1034, 1016, 1019, 1084, 1150, 1152, 1112, 1071, 1026, 981, 981, 981, 981, 981, 981, 981, 981, 981, 977, 973, 969, 964, 937, 909, 882, 854, 844, 833, 822, 811, 803, 795, 818, 841, 850, 860, 817, 774, 712, 649, 700, 752, 742, 731, 720, 710, 769, 828, 856, 884, 917, 950, 911, 871, 873, 875, 971, 1067, 1109, 1151, 1120, 1089, 1023, 956, 921, 886, 858, 830, 802, 774, 725, 676, 627, 577, 623, 669, 715, 761, 747, 733, 719, 705, 761, 818, 875, 932, 897, 861, 795, 728, 794, 859, 873, 887, 828, 770, 763, 757, 736, 715, 694, 673, 710, 748, 785, 822, 788, 754, 720, 686, 712, 738, 764, 790, 754, 719, 683, 648, 680, 713, 746, 778, 728, 678, 680, 681, 699, 718, 684, 650, 646, 642, 690, 738, 753, 769, 785, 800, 777, 754, 731, 708, 684, 659, 697, 735, 748, 760, 772, 785, 805, 825, 845, 865, 780, 694, 670, 647, 696, 744, 731, 717, 711, 706, 731, 757, 790, 822, 793, 763, 819, 876, 828, 781, 721, 661, 632, 603, 595, 587, 580, 572, 603, 634, 634, 634, 598, 563, 631, 699, 761, 822, 820, 819, 775, 730, 686, 641, 679, 718, 724, 731, 667, 603, 602, 600, 645, 690, 672, 654, 651, 647, 706, 765, 728, 690, 716, 741, 752, 764, 713, 662, 680, 698, 612, 526, 573]
2266E73M7M6M7J4J3M5M4p3p3j1j1L0L0l2l3%jjjL3L2l0l0mmK7K7m2m2K0J9J9J8J9J8O3O3l8
2261H21l7m9J3j8j8L3R6R5L4p4p4m6m6k7k7L6L5j1j2K0K0K8K9l5l4J2J1J1J2K3K4K4K3J1J0
2257I13k1k1m4m4N6N7J4m8j2j3j0j0m6J7N7N6L3k9o3o2p1qO3O3M3j9m1K2M1M2k5q8q7k5M0
2253G30M0j4j4j3M9J9J8J8Q1P7J4l3r6o0o1K3Q5Q5K2l6l7K2K2k1k1k1k1jkkkl3l4klj3j2M5
2248G98M6K4l8l8K4N3N3rrj8q0j11m9P9P9K0K1L2L1L2L2K9K8l3l4p1p2m1m1j1j1N1N2M5M5
2244I08J5J4j1j0K0K1k6k7NNLLk8k8n8n8n8n8N2N3N2N3poooL7L8k6k5k1k2M1M1K9K9l4l4l2
2239H38l3l2l3o1o2M2M2J4J4J3J4M8M8j4j5K4K4ppn0n1J2J2L9L8k3k4j3j3j2j3J7J7J7J7j1
2235H16j1j0j1p8p8O8O8qqK3K3L7L7L7L7q2q2k0j9M6M7j6j6%jo3o3k3k3L9M0N0N0M9N0o4o5
$$ y = [573, 620, 666, 713, 727, 740, 785, 829, 756, 683, 672, 661, 691, 721, 689, 656, 656, 655, 654, 653, 686, 718, 688, 658, 654, 650, 677, 704, 662, 620, 640, 659, 678, 696, 715, 733, 796, 859, 821, 784, 735, 748, 730, 712, 745, 841, 936, 970, 896, 822, 776, 730, 703, 676, 712, 747, 736, 724, 744, 764, 792, 821, 786, 752, 764, 775, 786, 798, 821, 845, 869, 892, 903, 913, 892, 871, 827, 783, 839, 896, 910, 862, 850, 837, 827, 817, 771, 788, 845, 901, 934, 905, 842, 780, 709, 701, 764, 827, 870, 851, 810, 832, 873, 915, 890, 802, 715, 690, 730, 770, 756, 742, 729, 778, 797, 815, 833, 914, 991, 1005, 972, 876, 816, 755, 778, 863, 948, 970, 934, 897, 919, 941, 920, 899, 878, 857, 856, 854, 852, 850, 817, 783, 781, 778, 765, 753, 798, 844, 868, 830, 792, 816, 869, 922, 913, 904, 886, 806, 695, 646, 725, 804, 824, 845, 877, 908, 940, 972, 1001, 1029, 996, 962, 891, 819, 778, 737, 726, 715, 766, 818, 863, 908, 923, 937, 926, 916, 936, 957, 931, 904, 909, 914, 917, 920, 892, 864, 806, 748, 690, 632, 684, 737, 789, 842, 835, 829, 823, 817, 854, 892, 866, 841, 820, 798, 839, 880, 909, 938, 904, 870, 838, 805, 773, 740, 679, 617, 659, 701, 715, 729, 742, 756, 804, 852, 838, 823, 847, 871, 864, 857, 807, 756, 768, 780, 819, 857, 834, 810, 797, 784, 772, 759, 776, 793, 810, 827, 816, 805, 795, 784, 706, 628, 696, 764, 756, 748, 771, 794, 831, 868, 905, 942, 860, 778, 758, 739, 785, 832, 816, 800, 800, 799, 736, 673, 650, 627, 666, 706, 756, 806, 855, 905, 841, 776]
2230G76L6L6Mn9k3k3j1j1R3R3P4P4L9L9j6p8m7J5L1L1k7k8l9m0rqn2n2n5OL4L4k4k5j9k0L9
2225G88L9J8m3m4J9M4M5J7J8K8K8Ko2o9o9nN8L0K9L4L3klN6N6M3k0m6m7K0K0m2m2p2p2lN9
2221H43N1N1m9m9J1J0J0J1j5j5J6J7n4n5k7L5N1N1qqL2L2l0l0k4k5k1k1m1K2Q4K2m7m7k4L8
2217G97LLOPqrJ9J8k2q4n0N5R8L7k6k7K2K1j0j0j3j3j3j3kkkkMMMMmmlmJ0J0J1J0l8l8l8l8
2211F70O2O1jjJ0Rk1k2k0k1J1J1M2M2o1o2PQQPj2j3J9J9M0L9k2k3%J%%m7m8J6J5P9P8J7J6
2206I13n5n5QPL8L7k5k5K6K6K7K6k5k4q7q7k1k2M1M1N5N5K4K3l3l3kjj7j7m8m8%j%%K2K2K3
2202G88K2M0M1k2k3QPk4k4P5P6P6P5M2M1o3o2j3j2j2j2oooorrrrl8l7l8l8M6M6M5M6n7n6N
2197H88OP0O9L8L8r4r4o2o3K7K7N8N8PPQPK7K7p8p7j9j8j9j9L7L7L7L7K1K0N2N2J6J7q1q1
$$ y = [776, 812, 848, 852, 793, 770, 747, 736, 725, 818, 911, 985, 1059, 1098, 1137, 1121, 1043, 996, 1011, 1042, 1073, 1046, 1018, 979, 939, 930, 922, 870, 818, 763, 769, 803, 837, 813, 788, 769, 749, 788, 827, 845, 802, 758, 777, 821, 866, 883, 901, 929, 957, 959, 897, 828, 759, 754, 812, 842, 871, 905, 938, 936, 933, 989, 1045, 1088, 1068, 1022, 975, 995, 1015, 973, 931, 859, 787, 784, 843, 894, 945, 896, 847, 858, 868, 878, 889, 874, 859, 875, 892, 838, 783, 756, 791, 842, 893, 885, 877, 909, 941, 911, 881, 857, 832, 811, 790, 749, 771, 855, 877, 830, 783, 759, 797, 800, 803, 809, 816, 808, 799, 818, 836, 814, 730, 680, 735, 833, 870, 844, 817, 839, 860, 850, 840, 827, 814, 801, 788, 786, 784, 782, 780, 784, 788, 792, 796, 792, 788, 785, 781, 791, 801, 812, 822, 784, 746, 708, 670, 732, 793, 792, 791, 801, 810, 789, 767, 747, 726, 737, 748, 790, 832, 771, 709, 716, 724, 732, 739, 727, 714, 733, 752, 792, 831, 809, 786, 786, 787, 787, 787, 740, 692, 708, 723, 802, 880, 897, 913, 858, 803, 811, 818, 856, 893, 868, 843, 869, 895, 922, 948, 923, 899, 812, 725, 704, 682, 723, 764, 819, 874, 898, 921, 888, 855, 853, 852, 835, 818, 770, 722, 722, 721, 721, 721, 743, 765, 788, 810, 850, 891, 869, 846, 854, 861, 837, 813, 888, 964, 1040, 1115, 1157, 1198, 1135, 1073, 1060, 1048, 1036, 1024, 1018, 1012, 1006, 1000, 991, 982, 973, 964, 926, 889, 851, 813, 859, 905, 950, 996, 939, 883, 888, 894, 964, 1033, 1071, 1109, 1015, 921, 859, 796, 823, 850, 908, 966, 973, 980, 988, 995, 1022, 1049, 971, 894, 875, 857, 838, 819, 856, 893, 930, 967, 988, 1008, 1060, 1112, 1128, 1145, 1064, 983]
2192I83J3J17R4L1OOKKK6K5K6K5LLLLk5k4L8L8l6l6l6l6q0q0j7j8K0K0K0J9k3k4QPl6l5K6
2187A058K7j4j4j5j4k9k9l0k9J4J3m9m9J0J0J0J0K7K8mmm2m2K0K0l3l4K9K9K3K3K3K3k6k7
2183I13k6k6O6O6L8k3o2o1L8L9kll8K5J03J02Q0J7k7k7o6lK8K7L2L2nnmnk4k4q3q3m9J3J3
2179I86m9o4o3L6L7K6K7l6l6j8j8j8j7K1K1K5K4QP1P0Qm6m6J3J3n1n1J1J2o9o8lN9K8l5l1
2174G77L2L8L7J4m8k6k7l0l0noN7J20M3o0r5l2O8O8M8j4n1J0L5L4RRQRm2m1m2m2LMLLJ7J6
2169H71J6J7j3j2j2j2NOOOj6j6j7j6K8K8K8K8K2K3K2K3k2k2k1k2j9j8j9j8ononk2k2k3k2k5
2165G18k4L7L8qqN5N5K8K7K8K7kko4o4n2n1R4R5K1K0K1K1l0l0k9l0OPOPL7L8k5k4q1q1j9j8
2160G44P3P4J2J1P1P0P1P0K7K6l6l6M5M4M5M4o6o6o6o6K4K3K4K3K3K4K3K4K7K8K7K8L0L0j16
$$ y = [983, 996, 1113, 1207, 1238, 1244, 1250, 1252, 1254, 1280, 1305, 1331, 1356, 1359, 1362, 1365, 1368, 1343, 1319, 1357, 1395, 1359, 1323, 1287, 1251, 1171, 1091, 1074, 1056, 1076, 1096, 1116, 1135, 1112, 1088, 1096, 1103, 1067, 1032, 1058, 1085, 1071, 1057, 1042, 1028, 999, 970, 940, 911, 925, 938, 889, 840, 850, 860, 870, 880, 907, 935, 931, 927, 885, 843, 863, 883, 850, 816, 845, 874, 897, 920, 943, 966, 940, 913, 887, 861, 927, 993, 1031, 1008, 946, 885, 923, 962, 960, 957, 919, 944, 1047, 1149, 1229, 1246, 1219, 1192, 1126, 1123, 1151, 1178, 1210, 1242, 1237, 1232, 1228, 1223, 1199, 1175, 1092, 1009, 960, 973, 986, 937, 873, 810, 846, 883, 909, 936, 900, 864, 846, 828, 810, 793, 814, 835, 860, 884, 892, 963, 1033, 1041, 995, 949, 962, 975, 924, 873, 884, 896, 827, 759, 756, 815, 843, 808, 777, 809, 847, 884, 898, 850, 824, 797, 767, 737, 732, 726, 783, 903, 946, 886, 791, 759, 827, 895, 943, 929, 878, 888, 923, 957, 966, 975, 983, 992, 950, 909, 867, 825, 828, 832, 835, 838, 855, 871, 887, 904, 891, 879, 867, 855, 860, 866, 872, 878, 862, 846, 829, 813, 841, 869, 897, 925, 947, 970, 992, 1015, 993, 971, 950, 928, 909, 891, 872, 854, 848, 843, 837, 832, 810, 788, 765, 743, 718, 694, 731, 769, 761, 753, 808, 863, 891, 918, 946, 973, 971, 969, 905, 841, 789, 738, 832, 927, 948, 968, 989, 1010, 980, 950, 921, 891, 897, 904, 910, 917, 954, 992, 967, 943, 862, 781, 762, 744, 817, 891, 903, 914, 985, 1055, 1126, 1196, 1223, 1249, 1213, 1177, 1222, 1266, 1311, 1355, 1289, 1223, 1157, 1091, 1115, 1138, 1162, 1185, 1208, 1232, 1255, 1279, 1306, 1334, 1361, 1389, 1419, 1449, 1333]
2156A333j15j39j40l5l6l1l2l1l2M8M8j5j5N5N4N4N4M6M6M6M6klkkL3L4k9k9RRJ0Rn0n1KK
2151A149k5k4M8M9L5L5L6L5l9l9l9l8k9l0q1q1J2J1J1J1m6m7NNj4j4j5j4K7K8k5k5%J%%O1
2147I34O1j1j2k7k7MMj3j3j4j3j3j3J9J8m0m1J1J2N7N8N7N8m3m3J0Rm6m6m7m6N9N9QPj3j2
2142I12j3j3mmmmmmmmL7L7L7L7k3k2k3k3J9J8J8J9QRRQMMk7k7L6L6j6j6n5n4klqqK3K3J2J3
2137I54J3J2J5J4J5J4K5K5K5K5K5K5K5K5RRRRmmK7K7N1N1jkJ2J2J2J2M5M5M6M5mmmmnmmmJ9
2131A633J9J9J9J1J1J1J1j9j8L4L3J1J1J2J1mml5l5rj0L9L9J1n3o9o9j1j1M0M1ONL7L7L1L2
2127A817k1k0j5j4j5j5L4L4LKp2p2n5PJ2J1k0j9L4k8q3q3LO5O5Lm7m6r9r8j9M5M4j9j8j8J3
2122A296n0r4r3j9M4L6L6p1p1l4K8M5M6%JQ7Q8L6o8p1p2PPM2k1o8o8j0rP6P6M9j4m9n0RRM9
$$ y = [1333, 1218, 1079, 939, 904, 868, 837, 805, 774, 742, 790, 838, 823, 808, 863, 917, 971, 1025, 1071, 1117, 1163, 1209, 1207, 1204, 1202, 1200, 1233, 1267, 1238, 1209, 1218, 1227, 1237, 1246, 1196, 1145, 1147, 1149, 1124, 1100, 1148, 1197, 1232, 1267, 1303, 1338, 1299, 1260, 1221, 1183, 1154, 1124, 1043, 962, 974, 985, 996, 1007, 961, 914, 919, 924, 910, 896, 881, 867, 894, 922, 897, 872, 872, 873, 873, 873, 934, 995, 984, 972, 945, 918, 922, 926, 913, 900, 886, 873, 860, 847, 866, 884, 844, 803, 814, 826, 883, 941, 998, 1056, 1013, 970, 980, 989, 943, 897, 850, 804, 863, 922, 930, 937, 924, 912, 899, 886, 882, 878, 874, 870, 866, 862, 858, 854, 891, 928, 965, 1002, 979, 957, 934, 911, 930, 948, 966, 985, 993, 1002, 1011, 1019, 1023, 1027, 1000, 973, 1009, 1045, 1029, 1013, 958, 904, 902, 899, 891, 883, 906, 929, 941, 954, 967, 979, 994, 1008, 1023, 1037, 1062, 1087, 1112, 1137, 1162, 1187, 1212, 1237, 1246, 1255, 1264, 1273, 1269, 1265, 1292, 1319, 1370, 1421, 1420, 1418, 1430, 1442, 1454, 1466, 1511, 1556, 1602, 1647, 1643, 1639, 1635, 1631, 1626, 1622, 1618, 1614, 1633, 1652, 1671, 1690, 1701, 1712, 1723, 1734, 1715, 1697, 1731, 1764, 1775, 1786, 1798, 1809, 1805, 1801, 1766, 1731, 1722, 1712, 1751, 1790, 1801, 1748, 1679, 1610, 1599, 1588, 1628, 1669, 1675, 1680, 1717, 1754, 1785, 1817, 1796, 1776, 1761, 1747, 1732, 1717, 1751, 1785, 1788, 1790, 1718, 1646, 1591, 1598, 1610, 1621, 1601, 1582, 1616, 1588, 1505, 1422, 1425, 1490, 1555, 1558, 1511, 1465, 1366, 1268, 1249, 1294, 1338, 1319, 1301, 1283, 1296, 1246, 1152, 1059, 1040, 1084, 1120, 1156, 1085, 1014, 980, 1008, 1053, 1099, 1099, 1100, 1187, 1275, 1311, 1243, 1172, 1100, 1107, 1114, 1156, 1135, 1067, 999, 989, 980, 1056, 1132, 1181, 1167, 1118, 1068, 1077, 1086, 1135]
2118A135N0j6p8r0k7L7L8j1j0j1j1K7K6K6K7k9k8pN4J2r2o9pM7j6p4j1O2O2l4l4L0R2L0l3
2113A067j8j8k2k2k5k6k2k2j9M3J2J1j1N0N1j2j0j0M8M8L2L3l3r4p6j2J0J1k7k7k3k3j2N0
2109I02J6J5qqN4N5n6n5n1n1J1P3P4J1o5o6%O2M4M4M8M7k3k4k4k3NNNMn0n0n0n0rj0j0rN0
2104H33N0j2j1n1n1J1J2J1J2J2J2O0O0O0O0j7j7j8j7j3j3j4j3k2k2M0M1JKJKk6k5L6L7K7K6
2100A064K7K6rrp1p1K4K3K4K4pqppj3j4j4j3P1P1l3l3PQO9P0n2n2J1J0j3j3j3j3K1K1K0K1
2095A147k2k2k2k2O3O4JJl9m0l9l9L8L9L8L9%JJ%n9n9M5M5ooooJ5J5J4J5rrqrk1k1k1k1RR
2090A093RRJ7J7m5m5o1o1n8n7J2P4J02J01K4K4K3K4j%%jRRn4n4J4J4J4J4k6k7k6k7L6L6L5
2086A167L6kjO1O1K9L0kkj1j0p0o9NO7R9L6o4o5lN9Q6K3m1m2J8J7M9M9J2J2J3J2J3J3m5m6
$$ y = [1135, 1185, 1169, 1091, 1001, 974, 1011, 1049, 1038, 1028, 1017, 1006, 1033, 1059, 1085, 1112, 1083, 1055, 1048, 1102, 1114, 1022, 953, 946, 993, 977, 903, 892, 954, 1016, 982, 948, 978, 1070, 1100, 1067, 1049, 1031, 1009, 987, 962, 936, 914, 892, 873, 916, 928, 939, 928, 978, 1029, 1017, 1007, 997, 1045, 1093, 1125, 1158, 1125, 1031, 955, 943, 953, 964, 937, 910, 887, 864, 852, 902, 918, 933, 925, 917, 971, 1026, 970, 915, 864, 813, 824, 897, 971, 982, 917, 851, 851, 913, 957, 1001, 1049, 1096, 1073, 1049, 1025, 1002, 1007, 1012, 1017, 1021, 971, 921, 871, 821, 812, 802, 792, 783, 833, 883, 871, 860, 809, 758, 769, 781, 792, 804, 816, 828, 888, 948, 1008, 1068, 1051, 1034, 1016, 999, 986, 973, 959, 946, 924, 902, 942, 983, 984, 986, 987, 989, 963, 938, 974, 1011, 1038, 1064, 1091, 1117, 1108, 1099, 1028, 957, 981, 1004, 1028, 1052, 1045, 1037, 1030, 1023, 1010, 996, 982, 969, 1040, 1111, 1078, 1045, 1052, 1060, 1129, 1199, 1147, 1095, 1106, 1116, 1103, 1090, 1077, 1064, 1085, 1106, 1126, 1147, 1125, 1103, 1081, 1059, 1122, 1186, 1187, 1188, 1149, 1109, 1070, 1031, 1069, 1108, 1146, 1185, 1185, 1186, 1187, 1187, 1128, 1069, 1114, 1159, 1153, 1147, 1141, 1135, 1150, 1165, 1179, 1194, 1185, 1176, 1168, 1159, 1138, 1117, 1096, 1075, 1084, 1093, 1102, 1111, 1128, 1145, 1100, 1055, 994, 933, 875, 818, 830, 904, 1006, 1107, 1131, 1155, 1178, 1202, 1201, 1201, 1201, 1200, 1209, 1218, 1164, 1110, 1124, 1138, 1152, 1166, 1140, 1113, 1087, 1060, 1096, 1132, 1167, 1203, 1201, 1200, 1261, 1322, 1351, 1381, 1379, 1377, 1366, 1356, 1286, 1217, 1222, 1289, 1388, 1424, 1360, 1295, 1292, 1351, 1437, 1460, 1419, 1377, 1395, 1412, 1461, 1510, 1522, 1534, 1547, 1559, 1572, 1585, 1540, 1494]
2081A494j2N1N1j2m5m4m8m8NONNl1l2L1L1JKl0l0m6m6N8J21J11Pl4l5j6j7m8m8J9J9m3m3P
2077A316Pk3k4K0K0K0K0k2k2k3k2k9l0q7q8LO7L4k7J4J4J0RQQQQl1l0l1l1mnnnK7K7K7K6k0
2072A134k0k0k0j6j6j6j6K1K0K1K0k0k1k0k0J1J2k0k0l1l0P3P3N4N4qqq1q0K4K3N0M9n4n5
2067A047j4j5M7M8mnl5l6N3N2K2K2QQk4k3k6k6k6k6J9J9J9J9j4j4j5j4KJJKK3K3K3K4n3n2
2063A060J0J1l3l3r5r5mmJ00J00R2R2n3n3n8n7ONM5M4M5M5M6M5j7j7L4L3LKl1l1l0l1J9J9
2058A214J9K0o3o3%%qpppk3k3L6L5Mn9k4k4LKKKL1L0L0L1j3j2p5p5K0K1K0K0J3J2J3J3J3J3
2053A134m5m5N0J13J12N0mmqpNNn3n3k6L6O3O4l7l7K6K6O4O4JKMNMMj2j1j2j2L5L5Qn4p1p0
2049A349p0p1o6mK3K3j1j1j1j1j5j5j5j5l1l2Qn5r0k7P9P9K7K6K7K7k2k1k1k2k5k5k6k5l7
$$ y = [1494, 1482, 1533, 1584, 1572, 1527, 1483, 1435, 1387, 1392, 1398, 1403, 1408, 1377, 1345, 1376, 1407, 1408, 1410, 1380, 1350, 1304, 1258, 1316, 1437, 1548, 1555, 1521, 1486, 1470, 1453, 1405, 1357, 1376, 1395, 1352, 1309, 1316, 1323, 1300, 1276, 1296, 1316, 1336, 1356, 1334, 1312, 1289, 1267, 1238, 1208, 1121, 1033, 1036, 1103, 1137, 1110, 1124, 1138, 1148, 1157, 1165, 1173, 1181, 1189, 1158, 1128, 1097, 1066, 1062, 1057, 1052, 1047, 1074, 1101, 1128, 1154, 1134, 1114, 1094, 1074, 1058, 1042, 1026, 1010, 1031, 1051, 1072, 1092, 1072, 1051, 1031, 1011, 1022, 1034, 1014, 994, 963, 933, 1006, 1079, 1133, 1187, 1179, 1171, 1090, 1010, 1034, 1057, 1107, 1156, 1102, 1047, 1033, 1018, 1065, 1113, 1109, 1104, 1069, 1033, 1086, 1138, 1160, 1182, 1190, 1198, 1174, 1151, 1125, 1099, 1073, 1047, 1066, 1085, 1104, 1123, 1109, 1095, 1080, 1066, 1068, 1069, 1070, 1072, 1095, 1118, 1141, 1165, 1112, 1060, 1070, 1081, 1048, 1015, 920, 825, 821, 817, 917, 1017, 1109, 1201, 1148, 1095, 1037, 980, 986, 991, 1036, 1080, 1125, 1170, 1216, 1261, 1244, 1227, 1261, 1294, 1297, 1299, 1268, 1237, 1207, 1176, 1195, 1214, 1233, 1253, 1190, 1127, 1127, 1127, 1119, 1112, 1105, 1098, 1075, 1052, 1088, 1123, 1127, 1068, 1044, 1020, 1023, 1025, 1027, 1029, 1060, 1090, 1120, 1151, 1138, 1126, 1051, 976, 996, 1017, 1037, 1057, 1070, 1082, 1095, 1108, 1121, 1134, 1089, 1044, 1094, 1207, 1319, 1369, 1365, 1361, 1353, 1346, 1351, 1356, 1303, 1250, 1224, 1260, 1323, 1387, 1350, 1313, 1339, 1365, 1429, 1493, 1494, 1496, 1500, 1505, 1509, 1513, 1501, 1490, 1478, 1466, 1501, 1536, 1544, 1490, 1419, 1349, 1279, 1208, 1142, 1138, 1161, 1184, 1173, 1162, 1151, 1140, 1125, 1110, 1095, 1080, 1049, 1017, 1025, 970, 880, 853, 932, 1011, 1038, 1064, 1091, 1118, 1096, 1075, 1054, 1032, 1007, 982, 956, 931, 894]
2044H94l7O3O3K9l3l3K9QQJ2J3R2R2K9L0rj0rrrqN3N4KKJKj1j1R2J55J19J5k7k7l4l4p3j0
2040A473Nn8j22j23o5o5o5o5J6J7J7J6noook8k8nN8O9Pn8n8mno3o3M1J03M1k2m0m0J9J9KK
2035I05O5O4L9L8o1o2o7mK3K3l5l4K4K4J8m5m4J7N4N4mmJ2J2J3J2k1k2k1k1O9P0M2k0RQM0
2030A170k3q9r0J3P5R7L4J0J0k9l0l0l0jjkjM2M2k1k1K6K6K6K7J1J2n1n1J7J7J7J7L2L3l0
2026A254k9k9k8LLk4k4QPj2j2j1j2L9M0k3k3L3L4LKk1k1M2M2L9M0k3k2mllmk5k5k6k5j7j6
2021A127j7j7J6J5J5J5jkl2l3K2K2m1m0j3j3J8J8MML5L5L6L7k6k6l4l4klmmo7o6K6K7K6K6
2017A049Q1Q0J9J8pqK5K4j4j4p6p6L3L3KKl4l3l4l4k3k4L9L9K8K8llk2k3q4q5OOOOk0k0M2
2012I29M2NNNNl6l5l6l5ppppM6M6j6j6j5j4j5j5k5k5L7L7J9K0J9K0L9M0o4o5j6j6J5J5J7J6
$$ y = [894, 857, 920, 983, 1012, 979, 946, 975, 983, 991, 1003, 1016, 1108, 1200, 1229, 1259, 1250, 1240, 1231, 1222, 1213, 1205, 1258, 1312, 1314, 1316, 1317, 1319, 1308, 1297, 1389, 1544, 1663, 1678, 1651, 1624, 1590, 1556, 1483, 1473, 1478, 1420, 1298, 1175, 1110, 1045, 980, 915, 931, 948, 965, 981, 976, 970, 964, 958, 930, 902, 897, 955, 1024, 1031, 973, 915, 911, 906, 843, 780, 821, 924, 965, 943, 903, 863, 882, 901, 903, 905, 970, 1034, 1073, 1111, 1050, 988, 921, 917, 940, 963, 928, 894, 918, 942, 960, 915, 871, 888, 942, 996, 992, 988, 1000, 1012, 1025, 1037, 1016, 994, 973, 952, 1021, 1091, 1133, 1113, 1122, 1130, 1170, 1147, 1058, 968, 981, 1056, 1153, 1187, 1197, 1207, 1178, 1148, 1118, 1088, 1087, 1086, 1084, 1083, 1125, 1167, 1146, 1125, 1151, 1177, 1203, 1230, 1241, 1253, 1202, 1151, 1168, 1185, 1202, 1219, 1251, 1284, 1254, 1225, 1196, 1168, 1171, 1174, 1150, 1126, 1134, 1141, 1129, 1117, 1106, 1094, 1133, 1173, 1150, 1127, 1160, 1194, 1197, 1199, 1178, 1157, 1199, 1241, 1280, 1320, 1297, 1275, 1271, 1268, 1265, 1261, 1236, 1211, 1185, 1160, 1143, 1127, 1110, 1093, 1109, 1124, 1139, 1154, 1153, 1151, 1119, 1086, 1108, 1130, 1089, 1049, 1036, 1023, 1041, 1059, 1063, 1067, 1102, 1137, 1173, 1210, 1184, 1158, 1124, 1090, 1088, 1085, 1081, 1077, 1010, 944, 970, 997, 1023, 1049, 1130, 1210, 1229, 1247, 1240, 1232, 1257, 1281, 1267, 1253, 1177, 1101, 1134, 1167, 1169, 1171, 1137, 1104, 1070, 1036, 1013, 989, 1028, 1067, 1095, 1123, 1120, 1117, 1095, 1072, 988, 903, 909, 915, 921, 927, 907, 887, 929, 971, 976, 981, 986, 991, 955, 920, 884, 849, 842, 835, 828, 821, 867, 913, 897, 881, 866, 852, 837, 822, 797, 772, 809, 846, 865, 885, 904, 924, 963, 1003, 939, 874, 858, 842, 857, 872, 889, 905]
2007I05m5m6k7k7L6L5nnK6K7OOk5k5k1k2M2M1L1L2l1l0j8j7J4J4K7K6K6K6q1q1j9j9M4M5j8
2002H47j8rrrrk9k8L4L5K0K1K0K1J2J3j9j9m6m7N7N8KKLKJ9K0m4m3n7n7NNMNL5L6R3R3L0L0
1997A079L1L2l2l1l2l2L0L1l7l7l8l7nnnnj6j7M6M5k3k3k2k3k7k7k7k6L5L5L6L5M8M8j4j4
1993I76j9j9n7q9j1R2J30O7l7l7K2K1j9j8j5j5m9J4N9K7p2p3QL9k7q9k8L4P3J0n5n4J0J1J0
1989H20J0l1l1L1L2nnlkJ2M3O1jk6k6L2L2k4k5L8L7lmlln8n8MNJ0J0j1K0J8m3q3n2K3Q4N2
1984H77N2PPQPj0j0qrJ5M6Mn7r6l4O9O9K2m0m2K0Lk8J4P6Q4k0p9m7qpnn%%%%n7n7NOj0j0j1
1979G41j0N5N5qpo8o7m0K2M9M9j0rj%LLj8M4P1P1RRn3n4m0m0K2K3N7N8nnj4j4j4j3MMNMqr
1973H51N4N4N8N8m2m3o0KK9K9kkkkP1P1K9p4j35p2L2L2J6J6N1j2r5r5ONn8n8j6Q7Q6K4LLP
$$ y = [905, 860, 814, 787, 760, 796, 831, 826, 821, 847, 874, 880, 886, 861, 836, 815, 793, 835, 876, 907, 939, 908, 878, 860, 843, 857, 871, 898, 924, 950, 976, 895, 814, 795, 776, 820, 865, 847, 829, 820, 811, 802, 793, 764, 736, 770, 805, 825, 846, 866, 887, 899, 912, 893, 874, 828, 781, 838, 896, 898, 900, 903, 905, 924, 944, 900, 857, 800, 743, 748, 753, 757, 762, 797, 833, 926, 1019, 1049, 1079, 1110, 1142, 1110, 1079, 1047, 1015, 1045, 1076, 1039, 1002, 964, 927, 922, 917, 912, 907, 891, 874, 920, 965, 942, 919, 897, 874, 847, 820, 793, 767, 802, 837, 873, 908, 956, 1004, 990, 976, 957, 938, 881, 792, 781, 873, 1003, 1070, 1033, 996, 1018, 1039, 1020, 1002, 987, 972, 923, 937, 996, 1023, 951, 878, 886, 925, 898, 809, 781, 815, 888, 898, 843, 789, 799, 810, 820, 830, 799, 768, 799, 831, 826, 821, 818, 816, 828, 871, 932, 931, 905, 879, 911, 943, 919, 894, 932, 969, 966, 962, 959, 956, 898, 840, 844, 849, 859, 869, 858, 878, 896, 853, 770, 718, 741, 825, 877, 929, 936, 943, 951, 958, 948, 938, 930, 921, 936, 982, 986, 929, 833, 799, 868, 937, 959, 919, 877, 897, 900, 872, 886, 962, 1046, 1026, 947, 900, 892, 885, 880, 875, 875, 875, 875, 875, 818, 761, 766, 772, 762, 752, 741, 731, 786, 841, 833, 826, 758, 691, 651, 673, 722, 771, 761, 752, 751, 751, 754, 757, 739, 783, 854, 925, 934, 943, 890, 836, 796, 756, 778, 801, 858, 916, 911, 906, 892, 878, 864, 851, 855, 859, 864, 868, 860, 851, 905, 959, 1017, 1075, 1033, 990, 930, 932, 961, 990, 988, 986, 984, 982, 1053, 1124, 1153, 1079, 944, 872, 904, 936, 952, 968, 1019, 1007, 912, 817, 823, 828, 770, 712, 696, 783, 869, 893, 896, 899, 906]
1968I06OOOK0J9m3m3RRRRk4k3k4k3J2J3J2J2k4k4M1J03L7k6k5L6M1k2m5m5M7M6M3M3po9o9
1964I49pK4K4l4l4l2l2l2l1N1N1j1j2qrrqL0L1l2l2m4m5J7J8L3L3L3L2LLn9o0o5o6L8L8K5
1959G71K5K5K5k3k4k3k3l4l4K9K9O6O6LMP0P0PQj4j3j4j3r5r4J0J0NOOOO0O0kkj5j5j4j5L6
1954I30L6L5L6m6m6m6m6M8M9j4j4mmnmm4m3J9J9LLLLL0L1L0L0l6l7l7l7M8M8M8M7o4o5lkL6
1949I35L7k6k6j1j0j1j0K5K6K6K6M1M1k1k2k6k7q9q9L9L8L9L8N3N3j0j0q7q8J7J7QRRRN4N5
1945A032N5N4j5j6j5j6l2l2l2l2L2L3L3L3RRRQrrj0rl5l5l4l5K0J9K0K0j7j7j6j7j7j7j6j7
1940H86LLLLl5l4k9k8k8P6J57R4m5m5J4J3k1k1M2M1L4L4L3L4J2J1J2J2n9n8n9n9K3K3K3K3
1936A088N2N3n1n1j4j3j4j4J5J5q9q8N3N4N4N4M9M8j3j4KKJKn0n0n0n0N8N8mnM5M5k0q2p4
$$ y = [906, 912, 918, 924, 944, 963, 920, 877, 886, 895, 904, 913, 889, 866, 842, 819, 831, 844, 856, 868, 844, 820, 861, 964, 1001, 975, 950, 986, 1027, 1005, 960, 915, 962, 1008, 1051, 1094, 1087, 1018, 949, 942, 966, 990, 956, 922, 890, 858, 826, 795, 846, 897, 886, 874, 866, 857, 848, 840, 870, 901, 869, 837, 793, 748, 765, 783, 816, 849, 882, 914, 917, 920, 861, 801, 736, 670, 708, 746, 771, 796, 821, 846, 823, 799, 776, 753, 719, 685, 714, 743, 809, 875, 878, 882, 952, 1022, 1029, 1037, 1023, 1010, 996, 983, 888, 794, 804, 814, 819, 825, 831, 837, 897, 957, 955, 953, 938, 923, 909, 894, 930, 966, 1001, 1037, 991, 945, 899, 853, 901, 950, 936, 922, 918, 914, 909, 905, 861, 818, 837, 856, 859, 862, 865, 868, 898, 929, 959, 989, 953, 916, 879, 842, 890, 938, 986, 1033, 969, 904, 901, 899, 935, 972, 946, 920, 909, 899, 888, 878, 903, 929, 955, 981, 1022, 1063, 1042, 1020, 994, 967, 878, 789, 828, 866, 905, 943, 996, 1049, 1039, 1029, 942, 854, 871, 888, 896, 905, 914, 923, 977, 1032, 1087, 1141, 1126, 1110, 1095, 1079, 1047, 1015, 983, 951, 983, 1016, 1049, 1082, 1091, 1100, 1109, 1117, 1108, 1099, 1089, 1080, 1045, 1010, 976, 941, 961, 980, 1000, 1020, 1003, 986, 970, 953, 936, 919, 903, 886, 889, 892, 895, 898, 863, 829, 800, 772, 744, 820, 977, 1071, 1026, 981, 995, 1008, 987, 966, 1008, 1049, 1083, 1117, 1150, 1184, 1196, 1207, 1219, 1231, 1172, 1114, 1055, 996, 1019, 1042, 1065, 1088, 1140, 1193, 1142, 1091, 1077, 1064, 1050, 1036, 1051, 1066, 977, 889, 942, 996, 1050, 1104, 1153, 1201, 1188, 1174, 1176, 1178, 1179, 1181, 1131, 1081, 1031, 981, 1039, 1097, 1093, 1088, 1133, 1178, 1158, 1076, 1002]
1931A002j1M7j6l6l6K2K3j6j5QP1R0K7l7l7j6j6j5j6P5P6qj12p4j3RQk2k3M0L9J8J8K2K1K8
1927A125R1N1n2j14j15K4K5jkjkNMNMj5j5j5j5J3J2P1P1j5p8m2m2L7L7L8L7r9r9j6Q8J00L8
1922A138k5k5k1k1k1k1opopL2L3L2L3l6l5l5l5qqqqK7K7Q5Q5Rn4n3QkkKKP0P1QRj7j8j7j7
1917A158n6n6OOK0K1K0K0K5K6l7l7J9J9J8J9K7K6K7K6N8N7m6m7l7l7l8l7L2L2L2L3LMLMLL
1913A319LLL8L8L8L8j06j07klO6O6O7O6J0J1J0J1J1J0J1J0J7J7J6J7n3n2J0J0J1J0J1J0M3
1908A675M3M3M3k4k5k4k5O2O3O2O3M6M6j7j6m0m0K3K2L7L7L8L7O7O7MNL1L1Q6Q7P6k7j15j15
1904B326K1K1K5K5NO8L3p1o6mJ7J8%%J%q9q9q8q9j24j24j9k0J3J3J3J4p7p6p7p6J0RJ0J0L5
1900A598L5l1r3p9j7OOQRP1P1l1l2l1l2J3J2RRL1l1n9n8k3k3L9L9K2K1K2K2L4L3L4L3K5K5
$$ y = [1002, 991, 1038, 1022, 986, 950, 972, 995, 979, 964, 972, 1043, 1133, 1160, 1123, 1086, 1070, 1054, 1039, 1023, 1098, 1174, 1166, 1054, 980, 967, 976, 984, 962, 939, 979, 1018, 1036, 1054, 1076, 1097, 1125, 1216, 1267, 1215, 1101, 986, 1010, 1035, 1034, 1032, 1031, 1029, 1034, 1038, 1043, 1047, 1032, 1017, 1002, 987, 1000, 1012, 1083, 1154, 1139, 1061, 1019, 977, 1014, 1051, 1089, 1126, 1027, 928, 912, 1000, 1100, 1138, 1113, 1088, 1067, 1046, 1025, 1004, 998, 991, 985, 978, 1010, 1043, 1075, 1108, 1072, 1037, 1002, 967, 959, 951, 943, 935, 962, 989, 1074, 1159, 1168, 1114, 1061, 1069, 1067, 1065, 1067, 1069, 1139, 1210, 1218, 1227, 1210, 1192, 1175, 1158, 1102, 1046, 1052, 1058, 1078, 1099, 1119, 1139, 1164, 1190, 1153, 1116, 1135, 1154, 1172, 1191, 1218, 1244, 1271, 1297, 1355, 1412, 1366, 1319, 1282, 1245, 1207, 1170, 1202, 1234, 1266, 1299, 1302, 1306, 1309, 1313, 1316, 1319, 1322, 1325, 1363, 1401, 1439, 1477, 1371, 1264, 1262, 1259, 1325, 1391, 1458, 1524, 1534, 1545, 1555, 1566, 1577, 1587, 1598, 1608, 1625, 1642, 1658, 1675, 1622, 1570, 1580, 1590, 1601, 1611, 1622, 1632, 1675, 1718, 1761, 1804, 1780, 1755, 1731, 1706, 1768, 1831, 1893, 1956, 2002, 2048, 2031, 2015, 1975, 1935, 1958, 1980, 2017, 2054, 2092, 2129, 2196, 2263, 2267, 2272, 2303, 2334, 2420, 2507, 2583, 2556, 2441, 2326, 2347, 2368, 2393, 2418, 2423, 2491, 2524, 2453, 2387, 2383, 2400, 2418, 2418, 2418, 2419, 2419, 2330, 2241, 2153, 2064, 1940, 1816, 1797, 1777, 1790, 1803, 1816, 1830, 1753, 1677, 1600, 1524, 1534, 1543, 1553, 1563, 1598, 1633, 1602, 1509, 1430, 1413, 1419, 1425, 1433, 1442, 1513, 1584, 1553, 1521, 1490, 1458, 1471, 1483, 1492, 1501, 1532, 1501, 1442, 1384, 1361, 1338, 1377, 1416, 1438, 1459, 1481, 1503, 1537, 1570, 1604, 1637, 1662, 1687]
1895A687O0kj18j18n3Rm8m9m4m5l9l9K3K3j2j1j1j1k0j9j9j9K2K2ko3p0oN8N8J7J6J6J7OO
1891A222O4O4J0n2n3J0L8L9r9j00l5K8K7l5o7o7lO0M1M1M1M0M8j5m3m2klkkJ2J2J2J3k3k3
1886A156k3k3J3J2n0n0K4K5K5K4klkll0l1l0l1K5K4K4K4KJJKj0j1j0j0M1M2k1k1JJJJJ6J7
1881A141J6J6k9l0k9k9k9k9L3L4k8k8L5L5L7L6k5k6NONOj1j0j1j0J3J3J3J3j5j5j5j6%jO1
1877A132O2k5k4k5k4m8m8J4J5l6l6l6l6K7K8K7K8J4J5J4J4l5l5l5l5K3K4K3K4M9N0j3j3l3
1873A046l3L0L0k3k2k2k3K5K5K5K5l0l0k9l0j%j%J8J7J8J8KKKKk1k1k2k1K1K2K1K1oooon2
1868I65n1J3P5P2Rn6n5J1J2P0P0Q4K2m7m7p3p3qN5R9L7k8k8l8l7pom5m6J7J7J7J6M4M4J3m9
1863A068m9J3j4j4J4P6R1K9l6l6mmlmM8M8n2n1j6M7N1j1n1J2L6L5k5k5P5P5K0m2o9p0j5j5
$$ y = [1687, 1747, 1745, 1627, 1509, 1456, 1465, 1417, 1368, 1324, 1279, 1240, 1201, 1224, 1247, 1235, 1224, 1213, 1202, 1182, 1163, 1144, 1125, 1147, 1169, 1167, 1104, 1034, 1028, 1086, 1144, 1161, 1177, 1193, 1210, 1216, 1222, 1286, 1350, 1360, 1308, 1255, 1265, 1303, 1342, 1243, 1143, 1108, 1136, 1163, 1128, 1061, 994, 991, 1051, 1092, 1133, 1174, 1214, 1262, 1247, 1204, 1162, 1160, 1157, 1155, 1153, 1165, 1177, 1189, 1202, 1179, 1156, 1133, 1110, 1123, 1135, 1085, 1035, 1059, 1084, 1109, 1133, 1131, 1128, 1126, 1123, 1093, 1062, 1032, 1001, 1026, 1050, 1074, 1098, 1100, 1101, 1102, 1104, 1094, 1083, 1073, 1063, 1104, 1146, 1125, 1104, 1105, 1106, 1107, 1108, 1124, 1141, 1157, 1173, 1144, 1114, 1085, 1056, 1027, 998, 1031, 1065, 1037, 1009, 1044, 1079, 1116, 1152, 1127, 1101, 1106, 1112, 1117, 1123, 1112, 1102, 1091, 1081, 1094, 1107, 1120, 1133, 1118, 1103, 1088, 1072, 1072, 1071, 1132, 1194, 1169, 1145, 1120, 1096, 1048, 1000, 1014, 1029, 993, 957, 921, 885, 912, 940, 967, 995, 1009, 1024, 1038, 1052, 1017, 982, 947, 912, 935, 959, 982, 1006, 1055, 1105, 1092, 1079, 1046, 1013, 1043, 1073, 1050, 1028, 1006, 983, 1008, 1033, 1058, 1083, 1053, 1023, 994, 964, 963, 963, 962, 962, 980, 997, 1015, 1033, 1035, 1037, 1039, 1041, 1020, 999, 977, 956, 977, 999, 1020, 1041, 1035, 1029, 1023, 1017, 965, 914, 927, 1002, 1074, 1083, 1027, 972, 983, 995, 1065, 1135, 1219, 1241, 1194, 1147, 1074, 1001, 993, 1048, 1147, 1184, 1156, 1128, 1090, 1053, 1046, 1040, 995, 949, 966, 983, 1000, 1016, 1060, 1104, 1117, 1068, 1019, 1032, 1018, 1004, 1018, 1094, 1185, 1214, 1178, 1142, 1138, 1134, 1131, 1127, 1175, 1223, 1171, 1120, 1104, 1151, 1202, 1191, 1140, 1152, 1188, 1223, 1198, 1173, 1248, 1323, 1343, 1301, 1232, 1162, 1147, 1132]
1859A132j6j5J4J4P2P2M9j3m8J4L3l0n3n3L8L9L8L8M4M4j8j8J6J6j5j5L6L6k7k6l1l0JJk7
1855A312k7L5L5J4J3J3J4L4L4k4k4J4P7P6J5j1j0j5j4j3j3j3j2j3j3j3j3K1K1K0K1n6n7l3
1850A395K9K2m1l2l3J2J2J3J2p8p8n0J2K0K0l9l9qrN4N3N2N2j0j1m1m0m9J4L6k6n4RR5R6n
1846A365nJJJKM5M5j9q2k1M2J0n2m1K1J4J4m1m1K1K2ono4o4l2L0N8N7J8J7j4j5ppopj7j7M5
1841A266M6K4K4ppL7L7k1k1m1K1Q4Q5K5p9n1N3J13N0j1j2Q4Q4j6j6J4P6jj04o4kmo7p1qJ5
1837A535J5J3J4J3J3J5J5m8m8l9l8O5O5n0n0n1n0P6P6J3J4ooooJKJKj8j8j8j8Q1Q1k2k3j9
1832A576j9j9j8LMMLm4m5J8J8K7K6K6K7rrrqj0j0j0j0L5L5L6L5n1n1N2N3ppj1j1n0j13l6O8
1827A489J08M6n8n8K8K8K9K8rj0rj0l6l6l6l6l2l2L0L1M4M4M5M4opool0k9k9k9l0k9k9k9r
$$ y = [1132, 1116, 1101, 1115, 1129, 1201, 1273, 1322, 1309, 1261, 1275, 1308, 1278, 1225, 1172, 1210, 1249, 1287, 1325, 1369, 1413, 1395, 1377, 1393, 1409, 1394, 1379, 1415, 1451, 1424, 1398, 1367, 1337, 1338, 1339, 1312, 1285, 1320, 1355, 1369, 1382, 1395, 1409, 1443, 1477, 1453, 1429, 1443, 1520, 1596, 1611, 1600, 1590, 1575, 1561, 1548, 1535, 1522, 1510, 1497, 1484, 1471, 1458, 1479, 1500, 1520, 1541, 1485, 1428, 1395, 1424, 1446, 1405, 1373, 1340, 1352, 1364, 1377, 1389, 1311, 1233, 1183, 1195, 1215, 1235, 1196, 1157, 1149, 1140, 1194, 1247, 1299, 1351, 1341, 1330, 1289, 1249, 1200, 1214, 1250, 1224, 1170, 1179, 1274, 1370, 1365, 1360, 1361, 1362, 1363, 1365, 1410, 1455, 1436, 1354, 1333, 1375, 1385, 1333, 1292, 1313, 1327, 1341, 1300, 1259, 1280, 1302, 1296, 1291, 1227, 1163, 1131, 1161, 1219, 1276, 1294, 1311, 1297, 1282, 1275, 1268, 1262, 1255, 1238, 1221, 1266, 1312, 1336, 1360, 1353, 1346, 1383, 1420, 1399, 1378, 1337, 1358, 1442, 1527, 1552, 1473, 1422, 1475, 1588, 1638, 1627, 1615, 1699, 1783, 1767, 1751, 1765, 1841, 1840, 1736, 1672, 1670, 1666, 1599, 1528, 1520, 1535, 1550, 1563, 1577, 1590, 1603, 1618, 1633, 1585, 1537, 1498, 1460, 1525, 1590, 1540, 1490, 1439, 1389, 1465, 1541, 1554, 1568, 1562, 1556, 1550, 1544, 1545, 1547, 1548, 1550, 1532, 1514, 1496, 1478, 1559, 1640, 1618, 1595, 1576, 1557, 1538, 1520, 1523, 1527, 1531, 1534, 1490, 1445, 1463, 1481, 1508, 1534, 1560, 1587, 1578, 1569, 1560, 1552, 1542, 1532, 1522, 1512, 1547, 1582, 1618, 1653, 1602, 1551, 1603, 1656, 1649, 1642, 1631, 1620, 1570, 1457, 1421, 1489, 1597, 1643, 1585, 1527, 1555, 1583, 1612, 1640, 1631, 1621, 1612, 1602, 1566, 1530, 1494, 1458, 1426, 1394, 1424, 1455, 1499, 1543, 1588, 1632, 1626, 1619, 1613, 1607, 1577, 1548, 1519, 1490, 1460, 1431, 1402, 1373, 1364]
1823A364rrrR0Q9K8K7J9J8m4j06k9P4N1j1l1L1K8l5m4m4J5J4rrj0rL6L6k7k6o9o9L5L6L5L5
1818A462o9o9ppN5N5mnnmm0l9l9m0NNMNJ3J3J4J3o5o5Q1Q1K5K5l7l7ooooklkkl0l0L3L3KL
1813A302LKl7l8K5K5poN5N6J7J7J7J6%%%%%%j%K8K7K7K8j9j8j8j8m4m4N9J23N8m5m6m5p5p6
1808A348j3j3M3M3M3M3n8n9MMK2K2K2K3p3p2j0j0J4J5J4J5nnnmJKo1o1J3J3J2J3k5k5k5k5
1803A180J4J5J5J5O5O5l8l9l2l2l2l2L3L3L3L3j6j7p8p9L4L3R6R5K7K6K7K6M2M2k0k0K3K4
1799A561K4K3k4k4k5k4llklK0J9m3m3j2j2j2j2k7k8k7k8N0N0j2j2n4n4N0N0N4N3N4N3j0j0
1795A557j0j0M3M3M3M4P9Q0k5k4J0J1J14J15O2O2O3O2P0P0P0P1K4K5K5K4ppp0j32j22j7N9
1791B402mj00j01m3m2j2j3p5p5o7o8o8o8J4J4q9r0p0p0qql0k9L2L3ppppj0rN2N3k0j9k0k0
$$ y = [1364, 1355, 1346, 1337, 1427, 1516, 1544, 1571, 1590, 1608, 1564, 1458, 1429, 1503, 1554, 1543, 1512, 1543, 1571, 1536, 1492, 1448, 1463, 1477, 1468, 1459, 1449, 1440, 1476, 1512, 1485, 1459, 1390, 1321, 1356, 1392, 1427, 1462, 1393, 1324, 1317, 1310, 1365, 1420, 1416, 1411, 1406, 1402, 1362, 1323, 1284, 1244, 1249, 1254, 1258, 1263, 1276, 1289, 1303, 1316, 1251, 1186, 1267, 1348, 1373, 1398, 1361, 1324, 1318, 1312, 1306, 1300, 1298, 1295, 1293, 1291, 1261, 1231, 1264, 1297, 1299, 1302, 1305, 1307, 1270, 1232, 1257, 1282, 1275, 1269, 1324, 1380, 1397, 1414, 1431, 1447, 1447, 1447, 1447, 1447, 1447, 1447, 1446, 1446, 1474, 1501, 1528, 1556, 1537, 1519, 1501, 1483, 1439, 1395, 1454, 1577, 1635, 1590, 1544, 1499, 1424, 1348, 1335, 1322, 1365, 1408, 1451, 1494, 1436, 1377, 1381, 1385, 1407, 1429, 1451, 1474, 1401, 1329, 1319, 1309, 1323, 1338, 1352, 1367, 1362, 1357, 1352, 1348, 1349, 1351, 1290, 1229, 1242, 1255, 1267, 1280, 1255, 1230, 1205, 1180, 1194, 1209, 1224, 1239, 1304, 1369, 1331, 1292, 1260, 1228, 1196, 1164, 1197, 1230, 1263, 1296, 1280, 1263, 1185, 1106, 1140, 1173, 1269, 1364, 1391, 1417, 1444, 1470, 1512, 1554, 1534, 1514, 1537, 1561, 1585, 1608, 1584, 1560, 1535, 1511, 1508, 1505, 1503, 1500, 1520, 1539, 1496, 1453, 1441, 1429, 1417, 1405, 1378, 1350, 1323, 1295, 1345, 1395, 1383, 1371, 1317, 1263, 1313, 1363, 1417, 1470, 1524, 1577, 1567, 1557, 1547, 1537, 1580, 1623, 1666, 1710, 1789, 1869, 1844, 1820, 1830, 1841, 1955, 2070, 2132, 2194, 2257, 2319, 2389, 2459, 2529, 2600, 2624, 2649, 2674, 2698, 2691, 2684, 2614, 2482, 2360, 2343, 2402, 2398, 2298, 2197, 2154, 2112, 2100, 2087, 2012, 1937, 1870, 1802, 1734, 1666, 1680, 1694, 1605, 1515, 1445, 1375, 1367, 1359, 1329, 1300, 1332, 1365, 1358, 1351, 1344, 1337, 1327, 1318, 1370, 1423, 1403, 1384, 1364, 1344]
1786A344POOON3N3n1n1l7l7l7l7MLMLk0k0M3M2lmN9N8J5J4J5J4n8n8n8n8J6J6m6m6L3L3L4
1781A260L3o1o2JJO1O2m2m3nmnnj1j1N1N1j7j7j6j7M4M3j9j9j9j9M3M4J5J6J5J6n1n1n0n1
1777A161M3M2M3M2l4l4O6O6K8l3l8K5L1l1l2L2L3k9n3N2J01L8k0k0K0Q2Q2J9l3l4l8l7L2L2
1773A604L2L3RQk6L6R6R5P3J0jjmnL1L1L1L1m8m8J4J4ppj0j1jo4r1r1n5n5n6n5J2J1J1J1l2
1768A525l3l2l3j9k0j9j9J0J0J1J0pqqqL7L6L3L3mo6j29o6J4J4m0m1l0L2O0N9j5j6j6j6j5
1764A224j4M8M8m9m8k1M1L0K9L0L0oo8l3l2K8K8K9K8l2l2l2l1k7k7L6L6Q6Q5K4K3k9l0l0l0
1759A312n2n2J1J0RRJ0RjjkjPPOPL1L1L1L1L0L1l1l2l1l1L2L1mlmmj9k0M3M3LMMMk5k4q7q7
1754A235L4L5L4L4k7k6k6k6RRRQN3N2rj0j4j4j4j3lllkJ9J9K0J9P9P9k6k5k4k3L8L9o0n9M4
$$ y = [1344, 1351, 1357, 1363, 1369, 1422, 1475, 1424, 1373, 1336, 1299, 1262, 1225, 1229, 1232, 1236, 1239, 1219, 1199, 1242, 1284, 1281, 1277, 1336, 1394, 1409, 1423, 1438, 1452, 1394, 1336, 1278, 1220, 1236, 1252, 1206, 1160, 1193, 1226, 1260, 1293, 1232, 1170, 1171, 1172, 1233, 1295, 1253, 1210, 1205, 1201, 1196, 1191, 1180, 1169, 1220, 1271, 1254, 1237, 1221, 1204, 1248, 1291, 1272, 1253, 1234, 1215, 1258, 1302, 1317, 1333, 1348, 1364, 1313, 1262, 1212, 1161, 1204, 1246, 1289, 1331, 1297, 1263, 1329, 1395, 1423, 1390, 1352, 1377, 1408, 1377, 1345, 1377, 1410, 1381, 1328, 1380, 1481, 1519, 1499, 1479, 1499, 1581, 1663, 1682, 1649, 1615, 1577, 1540, 1572, 1604, 1636, 1669, 1678, 1686, 1660, 1696, 1792, 1887, 1960, 1970, 1969, 1968, 1964, 1959, 1990, 2021, 2052, 2083, 2035, 1987, 2001, 2015, 2008, 2001, 1991, 1980, 1979, 1915, 1824, 1733, 1678, 1623, 1567, 1512, 1524, 1535, 1546, 1557, 1525, 1492, 1460, 1427, 1408, 1388, 1369, 1350, 1360, 1370, 1381, 1391, 1384, 1376, 1368, 1360, 1397, 1433, 1466, 1499, 1495, 1429, 1300, 1234, 1248, 1262, 1222, 1181, 1151, 1183, 1243, 1302, 1287, 1271, 1255, 1239, 1224, 1210, 1258, 1306, 1257, 1209, 1188, 1229, 1259, 1288, 1318, 1348, 1342, 1274, 1241, 1209, 1237, 1265, 1294, 1322, 1290, 1258, 1226, 1195, 1168, 1141, 1177, 1213, 1299, 1384, 1408, 1431, 1402, 1372, 1342, 1312, 1260, 1208, 1219, 1229, 1238, 1247, 1257, 1266, 1265, 1264, 1262, 1261, 1268, 1275, 1281, 1288, 1319, 1350, 1381, 1412, 1442, 1473, 1442, 1410, 1379, 1348, 1380, 1411, 1407, 1404, 1400, 1396, 1377, 1357, 1400, 1443, 1446, 1450, 1454, 1458, 1433, 1409, 1322, 1235, 1269, 1304, 1338, 1372, 1345, 1319, 1293, 1267, 1276, 1285, 1294, 1302, 1355, 1407, 1398, 1388, 1374, 1360, 1346, 1333, 1330, 1327, 1324, 1322, 1341, 1360, 1380, 1399, 1478, 1557, 1531, 1506, 1482, 1459, 1497, 1536, 1476, 1417, 1461]
1749A461M5M8M9n6n5k0k0j9k0l7l6K6K5K9K8l4l4J5J5P8P7JJo1o2JJO3O3L4L4p0p0q9q9J4
1745A336J5J7J8J7J8qrqrP2P1RQlmJo2p1p1L2R4N9mk7k7k1k1k1k0M0M0M1M0n0n0q5k3J4J3
1740A361J8J7K5K5l7l7k5k4M1J03P4J2n3n3J8J8K2m1q8q9o5kQ0P9N7ok7k7P0O9L5k7n9ML6
1736A504L6L6L6Ln9q6q7nonol1l1l2l1P2P3M5j7%%K7K7nml6l6RJ0m9m9m0K3N0N0J5J5J5J5
1731A446MNMN%%l1l2qqo6o6k0M3L8L9M6M5j7j7noo8o9j1j1N1N1M3M3j9j9l1l0L1L2m1m1m1
1726A269m1RQQRL7L7k6k5j9j9Q5Q5llK8K9kkjkJ4J3J4J3j4j4j4j4L9L8QPP7P6J4J4o3o4jj
1721A603nnonP4P4P4P4l4l5l4l4K9K9K8K9k7k6n8n8J49J49M6M5M9M8j2p5j4J11P6J4LO6J72
1717B514J73J89J89J97J98K81M06N07O32Q31J039J310J850K669L293K540K52k305l595l215
$$ y = [1461, 1506, 1554, 1603, 1547, 1492, 1472, 1452, 1433, 1413, 1376, 1340, 1366, 1391, 1420, 1448, 1414, 1380, 1395, 1410, 1488, 1565, 1566, 1567, 1506, 1444, 1445, 1446, 1509, 1572, 1606, 1640, 1570, 1500, 1411, 1322, 1336, 1351, 1368, 1386, 1403, 1421, 1413, 1404, 1396, 1387, 1459, 1530, 1539, 1547, 1544, 1540, 1541, 1479, 1408, 1337, 1369, 1463, 1522, 1518, 1491, 1464, 1443, 1422, 1401, 1381, 1421, 1461, 1502, 1542, 1492, 1442, 1357, 1334, 1348, 1361, 1379, 1396, 1421, 1446, 1409, 1372, 1347, 1323, 1364, 1467, 1541, 1553, 1500, 1447, 1465, 1483, 1505, 1464, 1376, 1287, 1222, 1220, 1300, 1379, 1436, 1430, 1403, 1376, 1446, 1515, 1550, 1523, 1464, 1468, 1504, 1540, 1576, 1612, 1615, 1556, 1470, 1383, 1378, 1372, 1367, 1361, 1330, 1299, 1267, 1236, 1308, 1381, 1426, 1409, 1409, 1409, 1436, 1463, 1458, 1454, 1418, 1382, 1391, 1401, 1352, 1303, 1263, 1286, 1336, 1386, 1401, 1416, 1431, 1446, 1450, 1455, 1459, 1464, 1464, 1464, 1433, 1401, 1393, 1385, 1319, 1253, 1233, 1276, 1314, 1353, 1399, 1444, 1427, 1410, 1405, 1399, 1331, 1262, 1251, 1240, 1291, 1342, 1385, 1428, 1409, 1390, 1359, 1329, 1360, 1392, 1351, 1310, 1269, 1228, 1237, 1245, 1253, 1262, 1299, 1336, 1310, 1285, 1266, 1247, 1332, 1417, 1414, 1411, 1439, 1468, 1466, 1464, 1463, 1461, 1475, 1488, 1502, 1515, 1501, 1487, 1473, 1459, 1498, 1536, 1544, 1551, 1628, 1704, 1718, 1732, 1669, 1605, 1604, 1603, 1598, 1593, 1587, 1582, 1656, 1730, 1804, 1878, 1844, 1809, 1775, 1741, 1770, 1799, 1827, 1856, 1829, 1803, 1745, 1687, 1836, 1985, 2031, 2076, 2125, 2173, 2161, 2086, 2072, 2183, 2259, 2273, 2276, 2342, 2514, 2687, 2876, 3065, 3262, 3460, 3741, 4147, 4654, 5286, 6117, 7156, 8466, 10316, 12985, 16278, 18818, 19070, 16765, 13170, 9955]
1714I955k259j516j141p75m01l04l05k09q5m2j04j59r7p4p5j05m4M0M0M3M4%jl1l1mnN8N8
1711B471O7O8P1P1J24J87J86J87J52K15K99L61M39N85P15Q60J034J347J798K360L233M542
1708B1372N499M896K123j725m729n790n201m017k844j867j227q74o81m93l03l04l51l50k44
1706B890j82j12j13p3p3p3p2K5K6K6K6R2R1j9q1o8o8L2L1L7L7R5R5R1K8L6J40K29K29K05K67
1702C794L89M52N80Q08J095J366J800K611L310K790N97k087l639l494k459j566j118q06n30
1700C893l83l59l58k44r8r2r2j22n9l5r8j17j17m1K2j3j3J1J2J2J2k7k6n4n4n2J0L7L7%jl2
1696A559l1N1N2K8l4q5k2M2M3N1N1K0J9J8J8P6P7Nn8q1q1m2K1K4l8m8J4L7L8p6p6pN6P6P7
1692A774J8J8J0J0J0J0J4J4M9j4m3m4qp1r3l0P7P6J3J4J3J3N2N2P9P9l0r2j1R2Q0Q0K1K0J4
$$ y = [9955, 7696, 6180, 5039, 4264, 3863, 3559, 3254, 3045, 2960, 2918, 2814, 2655, 2558, 2484, 2409, 2304, 2260, 2300, 2340, 2383, 2427, 2427, 2426, 2395, 2364, 2360, 2355, 2413, 2471, 2538, 2606, 2677, 2748, 2872, 3059, 3245, 3432, 3584, 3799, 4098, 4459, 4898, 5483, 6198, 7058, 8092, 9439, 11237, 13597, 16830, 21372, 26871, 31767, 33890, 32165, 27436, 21646, 16445, 12428, 9584, 7717, 6490, 5616, 4935, 4442, 4139, 3835, 3484, 3134, 2890, 2708, 2596, 2483, 2410, 2337, 2264, 2192, 2217, 2243, 2269, 2295, 2387, 2478, 2459, 2378, 2310, 2242, 2274, 2305, 2342, 2379, 2474, 2569, 2660, 2688, 2724, 2864, 3093, 3322, 3527, 3794, 4183, 4635, 5215, 6023, 7118, 8484, 10284, 12895, 16205, 18995, 19592, 17505, 13866, 10372, 7913, 6347, 5229, 4423, 3893, 3510, 3151, 2793, 2549, 2451, 2359, 2267, 2145, 2086, 2051, 1953, 1836, 1719, 1678, 1700, 1687, 1674, 1685, 1697, 1709, 1721, 1694, 1668, 1614, 1560, 1508, 1518, 1555, 1592, 1592, 1591, 1559, 1528, 1579, 1631, 1659, 1625, 1540, 1518, 1560, 1603, 1654, 1705, 1725, 1744, 1762, 1780, 1856, 1933, 1938, 1880, 1799, 1718, 1676, 1697, 1721, 1683, 1635, 1649, 1686, 1724, 1648, 1572, 1565, 1621, 1697, 1774, 1792, 1810, 1820, 1830, 1840, 1850, 1864, 1878, 1927, 1913, 1870, 1826, 1818, 1747, 1654, 1624, 1701, 1777, 1790, 1804, 1817, 1830, 1882, 1934, 2013, 2092, 2062, 1970, 1959, 2051, 2131, 2211, 2232, 2252, 2266]
1687B266m9m9J4K4K4p6p7j00j00j28j27r7l3L5L5%%J%J8J9j3j2MNn5n4jO1L0l3n7n8KJJ2J2
1683A444M3M3J8J9J8J8J4J4M5M4Q4Q3J4J5kO0R2K9m3m3m6m7OOL7L8Q0Q1M6n9p8p8K6K6K1m1
1678B027ooL6L5j7j6m8m7m7m7n9n9n8n9K7K8K7K7oopoo7o7j02m0M6M6N0N0L2L2L2L2J8J9J9
1674A813J9P3P4P3P3L8L8KO5J57J57J65J65K87L50L18L18K91L53L91K45K5j20j10nL0l2k07
1670E046l94m54m54l68l69l16k54j47q5l9l9J7J7K9L0m3m3m4m4PQN1N1N1N2K9L0J44J44J29
1667B742J29J02J02J28J90K11K12K11K73M07N12O28P74R15R16O85L32L8o5q8q7j25k29m85
1664H428p56r62r62q52o66n03l57k34j30q5q6q5q5l4l3n5n5jO2Q5K3j1j1J1J1k0k0OPR6R6
1660B822Q5K2j2j2K8R0J17J80K27K88L96M58M71M08K73Q5m7m6l3l3k9j33l28n16n59m97l63
$$ y = [2266, 2217, 2168, 2182, 2206, 2230, 2154, 2077, 1977, 1877, 1749, 1622, 1525, 1492, 1527, 1562, 1562, 1562, 1563, 1563, 1581, 1600, 1587, 1575, 1579, 1584, 1529, 1475, 1474, 1535, 1565, 1532, 1475, 1417, 1419, 1420, 1432, 1444, 1487, 1530, 1548, 1567, 1585, 1603, 1617, 1631, 1676, 1720, 1804, 1887, 1901, 1916, 1914, 1974, 2066, 2095, 2052, 2009, 1963, 1916, 1922, 1928, 1965, 2003, 2083, 2164, 2210, 2151, 2073, 1995, 2021, 2047, 2068, 2027, 2021, 2015, 2051, 2086, 2069, 2053, 2005, 1958, 1911, 1864, 1805, 1746, 1688, 1629, 1656, 1684, 1711, 1738, 1732, 1726, 1719, 1713, 1646, 1579, 1477, 1437, 1483, 1529, 1579, 1629, 1661, 1693, 1725, 1757, 1775, 1794, 1813, 1832, 1905, 1979, 2052, 2125, 2163, 2201, 2203, 2268, 2425, 2582, 2747, 2912, 3199, 3549, 3867, 4185, 4476, 4829, 5220, 5465, 5490, 5370, 5260, 5255, 5285, 5253, 5046, 4652, 4198, 3744, 3376, 3007, 2691, 2437, 2290, 2205, 2166, 2127, 2144, 2161, 2190, 2220, 2177, 2134, 2090, 2046, 2053, 2061, 2112, 2163, 2214, 2266, 2295, 2325, 2469, 2613, 2742, 2871, 2973, 3075, 3203, 3393, 3604, 3816, 4027, 4300, 4707, 5219, 5847, 6621, 7536, 8452, 9137, 9469, 9507, 9442, 9354, 9267, 9142, 8913, 8428, 7672, 6710, 5748, 4896, 4230, 3727, 3370, 3136, 3006, 2921, 2835, 2750, 2665, 2631, 2598, 2543, 2488, 2487, 2549, 2634, 2657, 2646, 2635, 2646, 2657, 2637, 2617, 2623, 2630, 2726, 2822, 2907, 2929, 2917, 2905, 2933, 3023, 3140, 3320, 3547, 3835, 4231, 4689, 5160, 5568, 5841, 5926, 5879, 5833, 5800, 5767, 5738, 5605, 5277, 4761, 4202, 3705, 3342]
1657C342k58j75j74j27o4l3L0K9L0QRM0M0K6K6K6K7o1o0o5kk3k4p1p2k3k2QQk2k2NNj6p9q0
1652B186j6J1J1n7n8J3J4n5n6j7M5O3O2K0J9m2m3m3m3m4m3M3M2M3M2k1k1M1M1kkklK0K0K0
1648B188K0o1o1o1o1M8M9j5j4o1o2JJJJJJj%j%qqrqppqpOOONJ4J4J4J4j9j8j9j9M4M3j9j9
1642A904n3n3RJ0K6K7K7K6o9p0ppj4j3j4j4kkkkj5j6j5j5K3K4K4K3l5l5l6l5N7N7N7N7M2M3
1638A912j9j9qqqqk0k0k0k1RQQRM2M1M2M2rrp1p1NONOJ4J5J4J5L4L4L4L4o7o7o7o8kkkkOO
1632A753O8O8J00J01mmK2K2m0m1K2K2Q4Q4j1j1p3p4j0j1j0j1J8J9J8J8l1l0L2L2j9k0k0k0
1628B043JJo2o1m2m2K0K1K1K1m1m1L2L1L2L2J6J5J6J6K2K2m0m0L0K9L0K9POOON9N8m6m6l5
1624B126l5K7K7l7l7l7l7q1q1O4O5L4L4L4L5lkkkKJO4O4L2L2p3p2p4p5j1j2M1M2M1M2k3k3
$$ y = [3342, 3084, 2909, 2735, 2608, 2544, 2511, 2541, 2570, 2600, 2608, 2617, 2657, 2697, 2723, 2749, 2775, 2802, 2741, 2681, 2616, 2614, 2591, 2567, 2496, 2424, 2401, 2379, 2387, 2395, 2373, 2351, 2356, 2361, 2345, 2266, 2186, 2170, 2181, 2192, 2135, 2077, 2090, 2104, 2049, 1993, 1976, 2021, 2084, 2146, 2166, 2185, 2143, 2100, 2057, 2014, 1970, 1927, 1970, 2012, 2055, 2097, 2076, 2055, 2096, 2137, 2135, 2133, 2131, 2128, 2148, 2168, 2188, 2208, 2147, 2086, 2025, 1964, 2012, 2061, 2046, 2032, 1971, 1909, 1910, 1911, 1912, 1913, 1914, 1915, 1914, 1914, 1913, 1913, 1905, 1897, 1888, 1880, 1873, 1866, 1858, 1851, 1857, 1863, 1869, 1874, 1888, 1902, 1916, 1930, 1911, 1893, 1874, 1855, 1899, 1942, 1923, 1904, 1851, 1798, 1807, 1817, 1843, 1870, 1897, 1923, 1854, 1784, 1777, 1770, 1756, 1743, 1729, 1715, 1713, 1711, 1709, 1707, 1692, 1676, 1661, 1646, 1669, 1693, 1717, 1740, 1705, 1670, 1634, 1599, 1656, 1713, 1770, 1827, 1869, 1912, 1893, 1874, 1866, 1858, 1850, 1842, 1822, 1802, 1782, 1761, 1770, 1778, 1786, 1795, 1837, 1878, 1920, 1962, 1953, 1944, 1873, 1802, 1807, 1813, 1818, 1824, 1838, 1853, 1867, 1882, 1916, 1950, 1984, 2018, 1951, 1884, 1817, 1749, 1747, 1745, 1743, 1741, 1747, 1753, 1821, 1889, 1989, 2090, 2086, 2082, 2104, 2126, 2086, 2045, 2067, 2089, 2173, 2257, 2246, 2235, 2162, 2088, 2078, 2067, 2057, 2046, 2064, 2083, 2101, 2119, 2088, 2058, 2090, 2122, 2103, 2083, 2063, 2043, 2044, 2045, 1983, 1922, 1880, 1838, 1858, 1879, 1900, 1921, 1880, 1839, 1871, 1902, 1934, 1966, 1982, 1997, 2013, 2029, 2051, 2073, 2033, 1993, 2023, 2052, 2082, 2111, 2118, 2124, 2130, 2136, 2195, 2253, 2207, 2161, 2126, 2091, 2118, 2145, 2108, 2071, 2034, 1997, 1916, 1835, 1899, 1964, 1998, 2032, 2066, 2101, 2098, 2096, 2094, 2092, 2094, 2095, 2159, 2223, 2255, 2287, 2214, 2142, 2068, 1993, 1982, 1970, 2011, 2053, 2094, 2136, 2113, 2090]
1619B090L9M0MNMNm4m4m4m5L2L1L1L2k7k7k7k7JKJKj1j0j1j1L1L1l1l1p4p3L1L0M9M9j4j3
1615A976N9N9mlkkkko2o1JJM5M5j7j8k3k4k3k4J9J8J8J8L3L4l0k9p3p3ppK0Q2J10Oo4%J03
1610B097J03M2M2M2M2j4j4j4j4J8J9J8J9n2n2J1J1O2O3m2m1l8l7K4K5LLLLl4l5K8K7J9J8q6
1605B269q5n9n8MMK2K2K2K1j1j2j2j2m1m0O4O4K4K5K5K4J2J2n1n0mmmmk7k7L5L5Q3Q3K1K1
1601B391qqN4N4j4j5j5j4m4m4J8J8N0M9N0M9J4J3n0m9N1N1N1N1J2J2J2J2K5K5l8l7j5j5Q9
1597B785Q9N0N0N0N0J2J2J2J3qppqQ0Q1k4k4J5J5J5J5m4m4J8J8M3M3M3M3lmllJ28J28j8j7
1592C594L4L4L4L4Q1Q1J43J43J98J98J99J98K95K96L58L58N12N12M37M37L85J76j81n57p18
1589G281p19n84n83n35l26j69j69j35p2m1m1j10m8J02J64O4q1r6l4J0n3j59j59j31j30j31
$$ y = [2090, 2129, 2169, 2173, 2178, 2182, 2187, 2143, 2099, 2055, 2010, 2042, 2073, 2104, 2136, 2109, 2082, 2055, 2028, 2029, 2031, 2032, 2034, 2023, 2013, 2002, 1991, 2022, 2053, 2022, 1991, 1917, 1844, 1875, 1905, 1954, 2003, 1989, 1976, 2035, 2094, 2090, 2087, 2085, 2083, 2081, 2079, 2017, 1956, 1957, 1958, 2003, 2048, 2031, 2013, 1990, 1966, 1943, 1919, 1938, 1956, 1974, 1992, 2025, 2059, 2029, 2000, 1927, 1854, 1847, 1840, 1860, 1942, 2052, 2058, 1994, 1994, 2097, 2200, 2242, 2284, 2326, 2368, 2354, 2340, 2326, 2312, 2330, 2349, 2367, 2386, 2334, 2282, 2293, 2304, 2366, 2429, 2387, 2346, 2308, 2271, 2295, 2320, 2323, 2326, 2329, 2332, 2298, 2263, 2291, 2318, 2337, 2355, 2269, 2184, 2125, 2067, 2071, 2075, 2097, 2119, 2141, 2162, 2151, 2139, 2127, 2115, 2074, 2034, 2098, 2162, 2186, 2211, 2236, 2260, 2272, 2284, 2233, 2183, 2179, 2175, 2171, 2167, 2140, 2113, 2148, 2183, 2266, 2349, 2370, 2391, 2383, 2375, 2429, 2483, 2469, 2454, 2439, 2425, 2381, 2337, 2355, 2373, 2423, 2472, 2522, 2571, 2585, 2598, 2548, 2499, 2550, 2601, 2652, 2703, 2715, 2727, 2739, 2751, 2776, 2801, 2763, 2726, 2711, 2696, 2785, 2874, 2924, 2974, 3024, 3074, 3086, 3098, 3110, 3123, 3115, 3108, 3101, 3093, 3173, 3254, 3230, 3206, 3221, 3236, 3251, 3266, 3222, 3178, 3196, 3214, 3257, 3300, 3343, 3386, 3383, 3379, 3376, 3373, 3501, 3629, 3611, 3594, 3628, 3662, 3696, 3730, 3811, 3892, 4035, 4178, 4376, 4574, 4773, 4971, 5266, 5562, 5920, 6278, 6790, 7302, 7739, 8176, 8561, 8737, 8556, 7999, 7281, 6562, 5978, 5395, 4860, 4534, 4365, 4196, 4061, 3989, 3948, 3907, 3797, 3749, 3851, 4015, 4079, 3998, 3902, 3868, 3878, 3825, 3666, 3507, 3376, 3246, 3115]
1586C115j31p3p2o9o8n1J1J2n1m7m6N0M9Lo0n6n6k4k4L4L5K1m1ooJ0Rn2n3m0m1K9R0P4P3J5
1581B563J4kkl3l3J2J3P2P1K0m2m3K0N7N6kkj2j2m7J6J03J03Jo2o3%nmJ9Q2K4l9kO0Q4Q4L1
1577C100L1N8N8m0j03o8o8p0o9mN8L6k6n4RL1L0k8k8L2L3k9r2n6M8J25O3llopMML6L6P0P1
1572C179QQ%jl2l2k5k5L7L8MLO3O2O2JK7R0J48Q6k8r0l5l5l9l9n1n1n0n1%%%%K6K6Q8Q9J40
1567C601J41P6J3N3J14J38J38J48J47Q1Q1R1K9j00k03j94r0m7m8k1M2J10J10J38J38R9nj5
1564D765Q8J22N8k1k0J0n2r1r1k9k9m3J9M7M6L9M0M7j6rN3J19J18Q6Q5J48J48K05K04K40K39
1560F525K57L18L50L50L26L87L90L91M01N05O50P12P79R24J132J278J447J676J941K211K448
1558B5398K718K876K648J966R47k79j465k288k599k421k066j713j442j164r36q10p07o12n07
$$ y = [3115, 2984, 2911, 2839, 2770, 2702, 2651, 2662, 2674, 2623, 2576, 2530, 2580, 2629, 2632, 2572, 2516, 2460, 2436, 2412, 2446, 2481, 2502, 2461, 2455, 2449, 2459, 2468, 2416, 2363, 2323, 2282, 2311, 2401, 2475, 2548, 2563, 2577, 2575, 2573, 2540, 2507, 2519, 2532, 2604, 2675, 2695, 2653, 2610, 2630, 2687, 2743, 2741, 2739, 2727, 2715, 2668, 2684, 2787, 2890, 2891, 2829, 2766, 2766, 2761, 2757, 2776, 2858, 2882, 2843, 2841, 2901, 2985, 3069, 3100, 3131, 3189, 3247, 3207, 3104, 3036, 2968, 2898, 2829, 2825, 2883, 2919, 2893, 2839, 2848, 2879, 2909, 2881, 2853, 2885, 2918, 2889, 2797, 2741, 2789, 2914, 2977, 2974, 2971, 2965, 2958, 2962, 2966, 3002, 3038, 3108, 3179, 3187, 3195, 3195, 3194, 3162, 3130, 3105, 3080, 3117, 3155, 3159, 3162, 3225, 3287, 3349, 3350, 3377, 3467, 3615, 3701, 3673, 3583, 3548, 3513, 3474, 3435, 3384, 3333, 3283, 3232, 3232, 3232, 3232, 3232, 3258, 3284, 3372, 3461, 3601, 3742, 3818, 3831, 3884, 3998, 4136, 4274, 4422, 4569, 4650, 4731, 4822, 4851, 4751, 4548, 4354, 4264, 4217, 4169, 4148, 4190, 4300, 4410, 4548, 4686, 4785, 4780, 4765, 4853, 4975, 5033, 5012, 4992, 5002, 4950, 4859, 4768, 4739, 4710, 4667, 4686, 4733, 4779, 4818, 4858, 4905, 4889, 4880, 4933, 5052, 5170, 5256, 5341, 5489, 5637, 5842, 6046, 6286, 6525, 6782, 7100, 7450, 7800, 8126, 8513, 8903, 9294, 9695, 10200, 10850, 11562, 12341, 13265, 14397, 15675, 17122, 18798, 20739, 22950, 25398, 28116, 30992, 33640, 35606, 36553, 36274, 34809, 32521, 29922, 27501, 25435, 23722, 22280, 21116, 20180, 19370, 18663, 18051, 17544]
1555A7544n08n08n32n33n22n23m71m70n27n26n58n57m44m43l70l71l33l33k60k60k24k25j93
1553G853j93j44j43j37j36o8L5P1P1J2J2O4O4J32J31K71K71K98L61M52N99Q09R97J195J381
1549A4258J622J851J876J440M88o57j607k169k289j977j496j059q10o22m59k72j38p5k6k6
1547G853k2k3R3R2J13J13N3n0j40k01k25k25k18k19j04j04p6p7J6J7m6m5j5M8K9p6j07j06
1544F348m2m2L1L1l5l6o7o7L9L9L9L9R7R7K5K4J22J22J25J26J8Q0J97J97J61R9R9R9M7j6m9
1540G947n0k4L8R7R7L6L6L6L6J4J4J4J4p6p6j06j07j08j07qN5MMQ8J49J32J32J33J32J46Q4
1536H776M6M7m4m4k7L5%jm4m5l3K9J01J02K0q4o1KK3K3M0J02R3L1O3J67K17K17J71J72J69
1532A0263J70J69J70J95J95J22J22R5R6J47J48K20K20K73K72J82J83K37L00L02K40K51K51
$$ y = [17544, 17036, 16528, 15996, 15463, 14941, 14418, 13947, 13477, 12950, 12424, 11866, 11309, 10865, 10422, 10052, 9681, 9348, 9015, 8755, 8495, 8271, 8046, 7853, 7660, 7516, 7373, 7236, 7100, 7032, 7067, 7138, 7209, 7221, 7233, 7297, 7361, 7493, 7624, 7895, 8166, 8464, 8825, 9277, 9876, 10685, 11682, 12877, 14258, 15880, 17731, 19607, 21047, 21535, 20878, 19271, 17102, 14813, 12836, 11340, 10281, 9471, 8849, 8390, 8118, 7980, 7905, 7879, 7853, 7831, 7808, 7901, 7993, 8106, 8219, 8272, 8222, 8082, 7881, 7656, 7431, 7213, 6994, 6890, 6786, 6710, 6633, 6649, 6666, 6620, 6575, 6560, 6608, 6637, 6561, 6454, 6348, 6306, 6264, 6295, 6326, 6291, 6255, 6188, 6121, 6160, 6199, 6238, 6277, 6374, 6471, 6496, 6520, 6642, 6764, 6889, 7015, 7033, 7113, 7310, 7507, 7668, 7767, 7866, 7965, 8012, 7996, 7947, 7897, 7873, 7911, 8008, 8105, 8141, 8177, 8213, 8249, 8263, 8277, 8291, 8305, 8229, 8153, 8047, 7940, 7832, 7725, 7717, 7772, 7776, 7780, 7868, 8017, 8149, 8281, 8414, 8546, 8692, 8776, 8822, 8869, 8825, 8781, 8754, 8789, 8789, 8788, 8744, 8699, 8666, 8695, 8796, 8898, 8918, 8834, 8773, 8775, 8798, 8821, 8861, 8963, 9056, 9087, 9150, 9317, 9534, 9751, 9922, 10094, 10263, 10433, 10602, 10772, 10967, 11162, 11284, 11406, 11501, 11597, 11744, 11892, 12112, 12332, 12605, 12877, 13059, 13242, 13479, 13779, 14081, 14321, 14572, 14823]
1529A4823L30L92M92M92N28N29O54O55N58M13K87J82N4m9jJ03J87K49L46M49N40O45Q52J081
1526B4791J171J233J291J353J211Q57L56q1m17m78k73J8J77L02M86O95Q13Q13Q64R89J031
1524C7202J094J266J473J562J624J795K087K230K292K556K930L243L451L825M449N066N855
1522H4000O822Q029R137J0343J1653J2943J3374J2667J1034Q997P242O701Q063J1266J5497
1520B37768K0363K6285L3313M0664M7277N2007N4212N5150N8436O7892Q4070J04050J23222
1518A004709J34639J26279Q5439J1535p5188j43768j73981j68202j43102j14031q8007o6423
1517C89899m9475l6624k6395j7702j0185l656K312P511J1332J2288Q823M8j2345k4032l0616
1515B21183l1074k7720k3353j9239j5536j2480j0193q373o751n498m625m018l394k901k609
$$ y = [14823, 15153, 15545, 16037, 16529, 17057, 17586, 18240, 18895, 19453, 19866, 20153, 20335, 20389, 20340, 20339, 20442, 20629, 20878, 21224, 21673, 22213, 22858, 23710, 24791, 25962, 27195, 28486, 29839, 31050, 31907, 32263, 32182, 31765, 31287, 31014, 31032, 31209, 31511, 31997, 32692, 33505, 34318, 35182, 36171, 37202, 38296, 39562, 41035, 42597, 44221, 46016, 48103, 50333, 52625, 55181, 58111, 61354, 64805, 68630, 73079, 78145, 84000, 90822, 98851, 107988, 118331, 129984, 142927, 156301, 168968, 180002, 188999, 196241, 202942, 211005, 222271, 237768, 258131, 284416, 317729, 358393, 405670, 457677, 511889, 567039, 625475, 693367, 777437, 881487, 1004709, 1139348, 1265627, 1351066, 1362601, 1287413, 1143645, 969664, 801462, 658360, 544329, 456322, 389899, 340424, 303800, 277405, 259703, 249518, 245862, 248174, 255685, 267017, 279305, 288128, 288176, 275831, 251799, 221183, 190109, 162389, 139036, 119797, 104261, 91781, 81588, 73215, 66464, 60966, 56341, 52323, 48929, 46028, 43419]
1513D3419k331k040j723j514j341j048q47q46q28q28q98j106j337j338j273j211j074r48q14
1511B0074p51o79n54m32m94n43m18k63k63l24l25j37j37r6r7o1o1LO6L8q6k28k29k36k37k52
1508A3278k52j90j89k03k02j39j40o8o7r9r9j58j59r6r6q6q5j17j17j37j37RRL1L2J36J36
1504A0795J22J23J98L23L81L82M55M56N68O31N96L88J57n0l04n13n08m46l82l82l80k55j32
1502A2223o9p2p2L6L5J09J08J08J09J75J75K79K80L34L33L73L73M05N29P02P65Q17R42J153
1499B0150J362J465J466J421J296R75O01L54L54P18J175J630K087K573L113L820M693N713
1497E4966P001Q514J0386J2809J5678J8782K1735K4085K4791K1756J3313J8j4329k4940k9058
1495A65507k7308k2442j7171j2637r006n971l334j130M76J099L78j578m149o270p143o770
$$ y = [43419, 41088, 39048, 37325, 35811, 34470, 33422, 32575, 31729, 30901, 30073, 29175, 28069, 26732, 25394, 24121, 22910, 21836, 20888, 20074, 19323, 18644, 18090, 17658, 17164, 16621, 16203, 15940, 15677, 15353, 15028, 14891, 14754, 14658, 14561, 14500, 14439, 14442, 14508, 14546, 14460, 14232, 14003, 13767, 13530, 13278, 13026, 12836, 12647, 12444, 12242, 12103, 11963, 11895, 11828, 11729, 11630, 11472, 11313, 11217, 11121, 11035, 10950, 10833, 10716, 10579, 10442, 10451, 10460, 10491, 10523, 10659, 10795, 10917, 11040, 11238, 11561, 11942, 12324, 12779, 13235, 13803, 14434, 15030, 15418, 15575, 15525, 15221, 14708, 14200, 13754, 13372, 12990, 12610, 12355, 12223, 12154, 12082, 12010, 12046, 12081, 12190, 12298, 12406, 12515, 12690, 12865, 13144, 13424, 13758, 14091, 14464, 14837, 15242, 15771, 16473, 17238, 18055, 18997, 20150, 21512, 22977, 24443, 25864, 27160, 28135, 28736, 29090, 29444, 30162, 31337, 32967, 35054, 37627, 40740, 44560, 49253, 54966, 61967, 70481, 80867, 93676, 109354, 128136, 149871, 173956, 198747, 220503, 233816, 233834, 219505, 194565, 165507, 138199, 115757, 98586, 85949, 76943, 70972, 67638, 66508, 66984, 68083, 68461, 66883, 62734, 56464, 49321, 42551]
1493D2551n716m511l517k810k200j741j336j045p28n20m31m32l96l96k92k92j74j73k35k36
1490A5370k97k97l28l28l57l58l57l57l27l28k23k23j9j9J27J26J84J85Q0Q0k42k42m70m71
1487A0909m42m42k13k13k8k9J17J17N8N8K9j79l35l34j19j19m8m7N6N6p6p7j39j39j01j01
1484H219j31j32k42k42j37j38m6m5m6m6j35j36j97j98k27k27j22j23j50j50j50j50l6l6r9
1481D878r8j05j06Q3Q2p1p0P6P5Q9Q9R0Q9J89J90J58J58J24J23O1O0j01j02j29j29m5J7N7
1478E732J83K34K35K35K35J61L6KKr3r3j97j97k32k32j57l2l4l5k7k6N1N1M7M8jo3l5Q9J67
1474F054J67K37K38L48L49K86K87L61L61L92L92L58L58L92M55N69O94P67Q93Q47N57M7m94
1471A4915q55r80r38q13n59l50j76n2L2L2lj26k33l58m05m68m55m55m24l62l24k01j14n2l2
$$ y = [42551, 36835, 32324, 28807, 25997, 23797, 22056, 20720, 19675, 18947, 18427, 17996, 17564, 17168, 16772, 16480, 16188, 16014, 15841, 15606, 15370, 15073, 14776, 14448, 14120, 13763, 13405, 13048, 12691, 12364, 12036, 11813, 11590, 11571, 11552, 11679, 11805, 11989, 12174, 12254, 12334, 12092, 11850, 11380, 10909, 10467, 10025, 9812, 9599, 9571, 9542, 9659, 9776, 9834, 9892, 9921, 9742, 9407, 9073, 8954, 8835, 8787, 8740, 8796, 8852, 8776, 8699, 8560, 8421, 8320, 8219, 8088, 7956, 7714, 7472, 7335, 7197, 7151, 7106, 7060, 7014, 6879, 6743, 6546, 6348, 6121, 5894, 5772, 5649, 5499, 5349, 5199, 5049, 5013, 4977, 4878, 4780, 4675, 4569, 4652, 4734, 4663, 4593, 4669, 4744, 4833, 4922, 5012, 5101, 5290, 5480, 5638, 5796, 5920, 6043, 6104, 6164, 6063, 5961, 5832, 5703, 5658, 5675, 5732, 5915, 6149, 6384, 6619, 6854, 7015, 7051, 7053, 7055, 6962, 6869, 6672, 6475, 6243, 6011, 5854, 5822, 5788, 5753, 5726, 5700, 5751, 5802, 5849, 5897, 5896, 5833, 5798, 5887, 6054, 6221, 6458, 6696, 7044, 7393, 7679, 7966, 8327, 8688, 9080, 9472, 9830, 10188, 10580, 11035, 11604, 12298, 13065, 13958, 14805, 15362, 15409, 14915, 14060, 13080, 12142, 11329, 10770, 10420, 10244, 10192, 10224, 10256, 10253, 10127, 9894, 9536, 9131, 8663, 8208, 7753, 7329, 6967, 6643, 6442, 6328, 6276, 6244]
1468F244l2k9k8K8K8K8K8poK5K5k1k0q2q3j83j84p9p9q3q3j44j45q8q8J6J6R3R3J56J55J80
1464E651J80J80J80K64K65L27L27L74L74L98L98M23K99Q1m3k6q8k20l44m27m26m97m97m80
1461F673m80m04l41k51j27m1K1L4L4L8L9k8k8r0r0j09j08j09j08k2k3Q2Q2J41J42L7L8k7k6
1458D949k7k6M6M7M6M6Q0P9M6p9q1q0k6k6m5m5N9N9P3P4J34J97K11Q7J5J6K9L0l3l3j3j3j2
1454E784j3nnKLJ55K80L61M24M11M11K28J9o8N7L06N14P12R19J144J517J991K282J736K81
1451A9446j372j997j427l87K83K84j68o25r67j030q20n29l09j00K06N80R05J113J025N67m3
1448A4635m18l35M0K82M06L46L46M32P04J112J258Q70J84l41m87l73j03L28Q07J147J293J406
1445B3539J593J685J685J743J806J904K215L026L837L287O87k817n167n292l898k382j445
$$ y = [6244, 6212, 6183, 6155, 6183, 6211, 6239, 6267, 6260, 6254, 6279, 6304, 6283, 6263, 6181, 6098, 5915, 5731, 5652, 5573, 5490, 5407, 5263, 5118, 5030, 4942, 4958, 4974, 5067, 5160, 5316, 5471, 5651, 5831, 6011, 6191, 6455, 6720, 7047, 7374, 7748, 8122, 8520, 8918, 9341, 9640, 9721, 9678, 9652, 9564, 9344, 9000, 8573, 8147, 7650, 7153, 6673, 6193, 5789, 5448, 5197, 5070, 5029, 5050, 5084, 5118, 5156, 5195, 5167, 5139, 5049, 4959, 4850, 4742, 4633, 4525, 4503, 4480, 4562, 4644, 4785, 4927, 4964, 5002, 4975, 4949, 4922, 4896, 4942, 4989, 5035, 5081, 5161, 5240, 5286, 5207, 5126, 5046, 5020, 4994, 4949, 4904, 4963, 5022, 5095, 5169, 5303, 5500, 5711, 5798, 5813, 5829, 5858, 5888, 5855, 5822, 5809, 5796, 5784, 5771, 5766, 5761, 5763, 5766, 5921, 6201, 6562, 6986, 7397, 7808, 8036, 8055, 7987, 8044, 8350, 8864, 9576, 10495, 11639, 13156, 15147, 17429, 19165, 19446, 18074, 16077, 14650, 14263, 14546, 14830, 14662, 14037, 13070, 12040, 11220, 10691, 10382, 10282, 10488, 11068, 11973, 13086, 14111, 14678, 14635, 14217, 13882, 13922, 14204, 14610, 14956, 15302, 15734, 16438, 17550, 18808, 19678, 19862, 19521, 19034, 18661, 18558, 18886, 19693, 20840, 22133, 23539, 25132, 26817, 28502, 30245, 32051, 33955, 36170, 39196, 43033, 46320, 47007, 44190, 39023, 33731, 29833, 27451, 26006]
1443B6006j014j014j224j410j271r18o53m66k68M4L76N22M13J7o40j201j361j007n24k95l06
1441A3806m09l63j75J48M19L59p8o16r29q81o11k78L4K81N10P51R80R72P43L97M3j92j92L56
1438A5075J293J761J034o82k284k829k392j742j265r23n71k26m0N3N3m3k30m31m30l64k59
1435D558k03j42j17n6K1Q2J02M0j08j08l2l1P2P2nnj51j50k44k43k43k43q1q2j9j9K5K5K1
1432B736K1Ko1j30j30j09j09j05j05m3J9j6j6k0j9M2M3k1k2KO5P9J7poN6N6K5K5K8K8%o2n1
1428B212n2k4k4k5k5ONl1l1K7K7L1l1n8n8N6N5opJJk6k6j6M7J5m7n7n8JJL0K9R1R2Q6Q6K8
1423B325K8L8J01J21J21N5m8j39k01j43q1n7n8r4r3k5L7L5L5k4k3o3o3n8n9nN8K3K3p3p3p3
1419A547p3k9l0KJL2L3Qn3k0M2O6O6J1J1J2J1j2j1M7M7o1j23m3O1J8J7q0q0l5l6K6K7O9O9
$$ y = [26006, 24992, 23978, 22754, 21344, 20073, 19155, 18502, 18036, 17768, 17812, 18188, 18710, 19123, 19140, 18500, 17299, 15938, 14931, 14407, 14112, 13806, 13397, 13034, 12859, 13007, 13426, 13785, 13707, 13091, 12162, 11281, 10670, 10392, 10426, 10707, 11217, 11968, 12948, 13920, 14663, 15060, 15103, 14911, 14719, 15075, 16368, 18129, 19163, 18481, 16197, 13368, 10976, 9234, 7969, 7046, 6475, 6249, 6209, 6262, 6315, 6272, 6042, 5611, 5181, 4817, 4558, 4355, 4213, 4096, 4040, 4061, 4143, 4245, 4285, 4177, 4069, 4037, 4006, 4078, 4150, 4145, 4140, 3989, 3839, 3595, 3352, 3109, 2866, 2785, 2703, 2684, 2665, 2690, 2715, 2736, 2757, 2759, 2698, 2568, 2438, 2329, 2220, 2115, 2010, 1967, 1986, 1970, 1954, 1934, 1915, 1957, 2000, 1979, 1957, 1959, 2024, 2103, 2120, 2113, 2107, 2163, 2219, 2244, 2269, 2297, 2325, 2325, 2263, 2212, 2160, 2136, 2112, 2087, 2062, 2068, 2073, 2042, 2011, 2038, 2065, 2096, 2065, 2007, 1949, 2005, 2060, 2054, 2047, 2048, 2049, 2023, 1997, 1981, 2028, 2043, 1996, 1939, 1881, 1882, 1883, 1913, 1942, 2033, 2125, 2211, 2297, 2325, 2353, 2391, 2492, 2613, 2734, 2789, 2741, 2602, 2401, 2258, 2177, 2120, 2062, 1968, 1875, 1850, 1887, 1922, 1957, 1933, 1910, 1847, 1784, 1726, 1667, 1662, 1720, 1743, 1766, 1693, 1620, 1547, 1474, 1445, 1415, 1417, 1418, 1450, 1483, 1491, 1438, 1418, 1460, 1526, 1592, 1603, 1614, 1626, 1637, 1625, 1614, 1661, 1708, 1647, 1524, 1481, 1542, 1560, 1577, 1497, 1417, 1382, 1346, 1372, 1399, 1468, 1537]
1415A537PPr1r1k8k8M4M4M4M4N5N4qqj6j6j6j6O8O9OOmmN9N8m2m1O2J25P4l0p1p1n2n2J0J1
1410A699K5K6p9p8J2J3J2J3j8j7j7j7L9L9L9M0l6l5mmL0L0l2l2MMO6O6K5K5K6K5j8j8n0m9
1406A754n6n6OPQ5Q5N4N5OOk6k5R2R2K9l3K9J33J12M9M0J44J79J17O9P0R7R7n5n4q6q6o1o1
1402B808JJk1k2q4q3j74j73p0o9%J%%PPPPmmmmJ17J17N4N5K3K4K4K3L5L5J38J39J79J80J48
1397C418J49J48J47J17J16J05J04J36J35P6P5M4M4m9m9j11j12q1q2n0n0mmo7o7n4n5n5n5q7
1393C782q7j18j19q5q6J8J8J6J5j6j5j2j1R3R3Q1Q1Q2Q1Q2Q2J86J86K58K58K28K27K59K58
1390E835J97J96J36J36O0o4j29j30j71k95k80k80k25k25j97j96j34j34j52j52r0r0j46j46
1387C324j%o6o7l5l5p8p9K5K6N1N2N2N2P3P4J6J5M5J08J36J35J3J3N2J56J26K2j7j8K8K8m1
$$ y = [1537, 1544, 1551, 1460, 1369, 1341, 1313, 1357, 1401, 1445, 1489, 1544, 1598, 1590, 1582, 1566, 1550, 1534, 1518, 1586, 1655, 1661, 1667, 1663, 1659, 1718, 1776, 1734, 1693, 1755, 1880, 1954, 1924, 1853, 1782, 1730, 1678, 1688, 1699, 1724, 1750, 1671, 1593, 1605, 1618, 1630, 1643, 1625, 1608, 1591, 1574, 1613, 1652, 1691, 1731, 1695, 1660, 1656, 1652, 1682, 1712, 1680, 1648, 1652, 1656, 1722, 1788, 1813, 1838, 1864, 1889, 1871, 1853, 1803, 1754, 1698, 1642, 1648, 1655, 1740, 1825, 1879, 1934, 1940, 1946, 1920, 1895, 1987, 2079, 2108, 2075, 2104, 2237, 2349, 2398, 2438, 2582, 2761, 2878, 2947, 3017, 3114, 3211, 3156, 3102, 3016, 2930, 2869, 2808, 2809, 2810, 2789, 2767, 2683, 2600, 2426, 2253, 2183, 2114, 2114, 2115, 2115, 2115, 2122, 2129, 2136, 2143, 2139, 2135, 2131, 2127, 2244, 2361, 2415, 2470, 2493, 2517, 2541, 2564, 2599, 2634, 2772, 2911, 3090, 3270, 3418, 3567, 3715, 3862, 3979, 4095, 4200, 4304, 4440, 4575, 4651, 4726, 4770, 4814, 4765, 4716, 4605, 4493, 4412, 4330, 4280, 4230, 4226, 4222, 4155, 4088, 4034, 3979, 3924, 3869, 3782, 3695, 3577, 3458, 3373, 3287, 3305, 3323, 3339, 3354, 3338, 3323, 3311, 3300, 3393, 3486, 3567, 3648, 3730, 3811, 3893, 3975, 4161, 4347, 4605, 4863, 5091, 5318, 5577, 5835, 6032, 6228, 6364, 6500, 6560, 6496, 6367, 6237, 6066, 5771, 5491, 5211, 4986, 4761, 4564, 4368, 4234, 4100, 3948, 3796, 3706, 3616, 3470, 3324, 3323, 3323, 3257, 3190, 3155, 3120, 3042, 2963, 2988, 3014, 3065, 3117, 3169, 3221, 3294, 3368, 3384, 3399, 3444, 3552, 3688, 3823, 3836, 3849, 3901, 4057, 4183, 4205, 4188, 4170, 4198, 4226, 4185]
1383D185j04j25j26r8r8j13j14j72j72j27o5o9o9j27j27r7r6o1o2o2o2J1J0POk9r2r1l0J3
1379A844J2m6m6j9k0Q1Q1N1j2l9l9M9M9j3j4M0M0k3k2nnmnM5M5K1m1j5M8P0P1j2j3j2j2p8
1375B052p8j3N0J8m5j3M9R3L1l6r9o2%K4K4l6l6l7l6J0J1J0J1mmN8N8R1R2J19J18M0k2RJ0
1370B457j4p6p6j4J1J1J4J5P4P3M7j6k9k9M1M0K3K3m9n0l0k9l0l0nnO4O4L7k5POM6j6l4l3
1366B463LMk8k8L0K9R8R9J09M8k8k9K4Q7Q2Q2P9P9M1k1k8k8KO5O5Lj0j0P3P3J5m8LKj4p7p1
1362C238rm5m4k1M2M5j7p2j0J03J03N7nK6K5j0p2m1K1R8R8M9N0K5K4K1Q4J18J18K8l4M2J47
1358D182J70J09O3O3R4L2m1m2PPPQk3k3j6j5J6J5R1R0P3J1k4k4PPL6R9R5R5J6J5O7O7Q5Q5
1353E504Q6Q5Q8Q9J78J78J97J34N5N5O5O6K0K0P6J80K50J88Q1Q0J49J49J86J85J73J10J09
$$ y = [4185, 4081, 3956, 3830, 3732, 3634, 3521, 3407, 3235, 3063, 2936, 2871, 2802, 2733, 2606, 2479, 2382, 2286, 2225, 2163, 2101, 2039, 2050, 2060, 2067, 2073, 2044, 1952, 1861, 1831, 1844, 1856, 1810, 1764, 1745, 1725, 1806, 1887, 1938, 1926, 1887, 1848, 1897, 1946, 1933, 1919, 1959, 1999, 1976, 1954, 1949, 1944, 1940, 1935, 1980, 2025, 2046, 2005, 1990, 2038, 2108, 2179, 2167, 2154, 2142, 2130, 2052, 1974, 1961, 2011, 2029, 1984, 1971, 2020, 2113, 2144, 2108, 2009, 1947, 1947, 1971, 1995, 1959, 1923, 1886, 1850, 1860, 1871, 1881, 1892, 1888, 1884, 1942, 2000, 2091, 2183, 2302, 2420, 2460, 2438, 2447, 2457, 2443, 2367, 2291, 2277, 2288, 2299, 2313, 2328, 2402, 2475, 2522, 2506, 2477, 2448, 2489, 2529, 2552, 2575, 2526, 2476, 2446, 2417, 2387, 2357, 2352, 2347, 2411, 2475, 2512, 2487, 2494, 2500, 2546, 2530, 2496, 2463, 2466, 2470, 2442, 2414, 2444, 2473, 2571, 2670, 2779, 2827, 2799, 2770, 2794, 2881, 2963, 3045, 3124, 3203, 3244, 3223, 3195, 3167, 3169, 3234, 3299, 3302, 3292, 3282, 3355, 3428, 3443, 3395, 3398, 3400, 3386, 3309, 3238, 3229, 3184, 3140, 3119, 3161, 3206, 3189, 3117, 3107, 3210, 3313, 3370, 3365, 3391, 3416, 3406, 3334, 3293, 3314, 3412, 3510, 3559, 3609, 3634, 3658, 3679, 3763, 3881, 3999, 4027, 3993, 4035, 4182, 4352, 4461, 4524, 4587, 4681, 4713, 4672, 4630, 4637, 4644, 4651, 4659, 4636, 4613, 4597, 4582, 4598, 4613, 4704, 4794, 4867, 4878, 4854, 4830, 4837, 4844, 4880, 4979, 5074, 5169, 5185, 5200, 5267, 5334, 5419, 5504, 5590, 5675, 5763, 5852, 6030, 6208, 6405, 6539, 6594, 6649, 6714, 6780, 6800, 6820, 6896, 7076, 7326, 7514, 7595, 7675, 7824, 7973, 8159, 8344, 8517, 8627, 8736]
1350H736J71K05K05J50J50K08K71K37K38K58L21L05L04L09L09L48L49M00M01M34M34N28N28
1347A5799N57N56N95O56O83O82P39P38Q12Q11Q67Q67R04R66J051J114J184J183J192J191J234
1344C4381J297J350J351J332J270J270J269J267J204J070R24P51N63L94J66k5j70k72l76n20
1342D8496o66p59q63r93j139j220j219j291j290j291j290j254j253j297j296j230j084r89
1340B8072r90r88r89r11q08p72p71p23o61n93n31m44m43l94l31k24j63j14j13j14j14j52k15
1337A6514k90k90m02n07m79m17l29k66j94j93j58j58r6r5j75j75j52q9j15j76k46k46l00l63
1334A0603l28l27l10l10l44k83k39k40k70k09j35j36j08m6lo5j27j26m5J8m4j07j40j39p9
1331F461j5l7r9j64j65j57j58j57j58j08j08j05j04j7M5OPl0r2n7n7j6j7p9p8l0l0n8j19j96
$$ y = [8736, 8907, 9112, 9317, 9467, 9617, 9825, 10096, 10333, 10571, 10829, 11150, 11455, 11759, 12068, 12377, 12725, 13074, 13474, 13875, 14309, 14743, 15271, 15799, 16356, 16912, 17507, 18163, 18846, 19528, 20267, 21005, 21817, 22628, 23495, 24362, 25266, 26232, 27283, 28397, 29581, 30764, 31956, 33147, 34381, 35678, 37028, 38379, 39711, 40981, 42251, 43520, 44787, 45991, 47061, 47985, 48736, 49299, 49693, 49859, 49834, 49664, 49392, 49016, 48496, 47830, 47071, 46208, 45215, 44076, 42856, 41637, 40346, 39056, 37765, 36475, 35221, 33968, 32671, 31375, 30145, 29061, 28072, 27082, 26094, 25105, 24194, 23386, 22614, 21843, 21120, 20459, 19866, 19335, 18891, 18448, 18054, 17723, 17499, 17336, 17222, 17109, 16995, 16881, 16729, 16514, 16224, 15934, 15532, 15025, 14546, 14129, 13800, 13534, 13340, 13147, 12989, 12831, 12735, 12640, 12465, 12290, 12138, 12049, 11934, 11758, 11512, 11266, 10966, 10603, 10275, 9948, 9638, 9328, 8984, 8701, 8462, 8222, 7952, 7743, 7608, 7472, 7364, 7318, 7315, 7250, 7123, 6997, 6952, 6970, 6926, 6819, 6679, 6540, 6461, 6446, 6409, 6310, 6146, 5981, 5824, 5666, 5509, 5351, 5243, 5135, 5030, 4926, 4909, 4954, 4960, 4967, 4937, 4845, 4788, 4731, 4715, 4698, 4619, 4541, 4511, 4481, 4423, 4304, 4108]
1327D108j97j96j96j05m2p4p3r6l3ooo9p0j05m2j9j9j5j5n2n3n3n2J1J1n2n1j2j1j2j1L0L0
1323B453p0p0l0L2kkk5k5k4k5n1n2J1J1MMMNJ0J1J1J1K3K4K4K4n7n7n7n7N4N3rqq3q2q2q2
1319A819K9L0K9L0nmj02j02k5P9N5pm5m6n0m9n4n3N0N1k0j9k0k0l0l0l0l0L8L8k5k4l4l3l4
1314A357l4J6J7J6J6LLLLK6K5K5K5RQQRL4L4p0j32m4O0L7k6k1M1L7k6o0o1kkqrqrO9O8On7
1309A386n8M7K3l9r8l6P1P1k7k7k7k7k2k2Q2Q2l1l1l1l1J0J1J0J1m2m1O3O3RRn2n3l2l1L1
1305A221L1pql8l9P6P5J4J3M6M6M6M7k4k3k3k3p3p3j1j1K8K8lmJJl1l1n8n9MMk5k6P9P9O1
1300A310O1jjj9k0j9j9JKKJl3l3K9K8M0M0M0M0l2l1l2l2mmmmO0O1O1O1LKLLn7n7NOK2K2q2
1295A419q2J6J6j5j5J9K0K0J9k4k5POk0k1M2M2K1K0K1K1P5P6k9k8M5M6j7j6j12j12n0m9qq
$$ y = [4108, 3911, 3715, 3519, 3414, 3372, 3298, 3225, 3129, 3096, 3090, 3084, 3015, 2945, 2840, 2798, 2779, 2760, 2745, 2730, 2678, 2625, 2572, 2520, 2531, 2542, 2490, 2439, 2427, 2416, 2404, 2393, 2423, 2453, 2383, 2313, 2283, 2315, 2313, 2311, 2286, 2261, 2237, 2212, 2161, 2109, 2120, 2131, 2135, 2139, 2143, 2148, 2158, 2169, 2180, 2191, 2214, 2238, 2262, 2286, 2229, 2172, 2115, 2058, 2112, 2165, 2156, 2148, 2065, 1983, 1901, 1819, 1848, 1878, 1907, 1937, 1932, 1928, 1826, 1724, 1699, 1778, 1833, 1826, 1781, 1735, 1685, 1636, 1582, 1529, 1579, 1630, 1610, 1591, 1571, 1551, 1521, 1491, 1461, 1431, 1469, 1507, 1482, 1458, 1424, 1391, 1357, 1323, 1339, 1356, 1372, 1388, 1391, 1394, 1397, 1400, 1426, 1451, 1476, 1501, 1510, 1518, 1526, 1535, 1569, 1603, 1533, 1401, 1357, 1417, 1454, 1428, 1407, 1448, 1485, 1459, 1399, 1338, 1336, 1334, 1326, 1317, 1309, 1300, 1369, 1437, 1443, 1386, 1328, 1375, 1398, 1359, 1261, 1225, 1296, 1367, 1340, 1313, 1286, 1259, 1237, 1215, 1297, 1379, 1348, 1317, 1286, 1255, 1265, 1276, 1286, 1297, 1255, 1214, 1277, 1340, 1349, 1358, 1306, 1253, 1221, 1190, 1221, 1252, 1245, 1237, 1199, 1160, 1236, 1311, 1325, 1338, 1384, 1430, 1476, 1523, 1499, 1476, 1453, 1430, 1357, 1284, 1273, 1262, 1290, 1318, 1315, 1311, 1312, 1313, 1282, 1251, 1193, 1134, 1138, 1142, 1117, 1091, 1170, 1249, 1310, 1371, 1370, 1369, 1350, 1330, 1311, 1292, 1293, 1295, 1297, 1298, 1265, 1232, 1261, 1289, 1329, 1369, 1409, 1449, 1417, 1386, 1354, 1322, 1318, 1314, 1310, 1306, 1366, 1427, 1488, 1549, 1552, 1554, 1557, 1560, 1503, 1446, 1451, 1457, 1479, 1501, 1419, 1337, 1353, 1369, 1354, 1339, 1358, 1378, 1398, 1417, 1393, 1368, 1375, 1381, 1361, 1340, 1382, 1424, 1445, 1465, 1486, 1507, 1582, 1658, 1629, 1601, 1646, 1692, 1675, 1659, 1547, 1435, 1385, 1336, 1328, 1320]
1291A320qqj0rrj0P1P0l3l4L9L8J1J1MO7O0m5p2p2K6K5l1l1l1l1J4J4P6P7j4j3j4j3K6K5K6
1286A512K6J4J5J5J4o9o9l7l8M0L9o4j27j07kllqqR6R6j4j3j3j3L8L8PPl2l3L1L0J1J1n1n1
1282A285o0o1M4M3L5L4k8k8n5n6n5n6N0N0j3j3M2M1k1q4n7M6Q2J9l8l9m2m3N9N8K7K7n4n5
1278A084QQK9K9O0O0j6j6j5j6o2o2JJL2L2L2L2J8J8J3J4J3n0j5j5j0rj0j0QQn0n0k2M0ONK5
1273A148K4K5K5j5j4M4M4L6k6n4n3o3o2j%j9j8M3M4L7L7L8L7L3L4k9k9n8n8QP0O5Kj00j00
1269A095p9j7N2N2M7M6K4l9o1KK4K5k6k6k6k6L8L7L8L7QPQPK2K1K2K2M1M2k0k1j7j7J9m4o3
1264A254o3L4L3J0n2n2J0N7N7kkNNNNk8k9k8k8RRRJ0J7J7q2q3nN8N7mm5m6J4J3k2k2k2k1J7
1259A069J8J8J7k2k3k3k2j2j2N0N0L4L3k9k9m8m7J7P9O0ko1JJ4J3m6m5K9K9l4l3K5K6K6K5
$$ y = [1320, 1312, 1304, 1294, 1285, 1276, 1266, 1337, 1407, 1374, 1340, 1379, 1417, 1428, 1439, 1443, 1510, 1570, 1525, 1453, 1381, 1407, 1432, 1401, 1370, 1339, 1308, 1322, 1336, 1412, 1489, 1475, 1462, 1448, 1435, 1461, 1486, 1512, 1538, 1552, 1567, 1582, 1596, 1527, 1458, 1421, 1383, 1423, 1462, 1398, 1271, 1164, 1162, 1159, 1156, 1148, 1140, 1236, 1332, 1318, 1305, 1292, 1279, 1317, 1355, 1362, 1369, 1337, 1304, 1335, 1365, 1376, 1387, 1336, 1285, 1225, 1164, 1208, 1251, 1286, 1320, 1292, 1264, 1209, 1153, 1098, 1042, 1092, 1142, 1129, 1116, 1158, 1199, 1178, 1094, 1037, 1083, 1165, 1184, 1146, 1107, 1065, 1022, 1081, 1139, 1166, 1193, 1139, 1084, 1092, 1100, 1129, 1158, 1218, 1278, 1262, 1246, 1231, 1215, 1153, 1091, 1092, 1093, 1125, 1157, 1189, 1221, 1239, 1257, 1270, 1284, 1297, 1247, 1232, 1217, 1207, 1198, 1188, 1178, 1186, 1194, 1144, 1094, 1072, 1112, 1118, 1123, 1148, 1172, 1197, 1222, 1207, 1193, 1237, 1281, 1317, 1291, 1237, 1184, 1121, 1059, 1058, 1058, 1039, 1021, 1064, 1108, 1145, 1182, 1220, 1257, 1290, 1324, 1295, 1266, 1208, 1150, 1158, 1228, 1293, 1295, 1195, 1095, 1016, 999, 1051, 1103, 1150, 1196, 1220, 1181, 1120, 1122, 1146, 1171, 1145, 1119, 1093, 1067, 1105, 1142, 1180, 1217, 1225, 1232, 1240, 1247, 1269, 1290, 1312, 1334, 1375, 1417, 1397, 1376, 1359, 1342, 1361, 1317, 1254, 1191, 1225, 1258, 1268, 1216, 1164, 1174, 1231, 1288, 1286, 1284, 1289, 1294, 1299, 1304, 1276, 1247, 1219, 1191, 1200, 1209, 1218, 1228, 1245, 1262, 1180, 1097, 1092, 1150, 1207, 1203, 1158, 1112, 1126, 1139, 1117, 1095, 1073, 1052, 1069, 1087, 1105, 1122, 1100, 1077, 1054, 1032, 1020, 1008, 1058, 1108, 1142, 1175, 1146, 1117, 1069, 1022, 1039, 1118, 1178, 1176, 1115, 1116, 1130, 1143, 1097, 1052, 1081, 1110, 1076, 1043, 1068, 1094, 1120, 1145]
1255A145j2j2j2j2K7K6K6K6K5K5p5p5k8L4L8k4k7L6mlrrK6l7l6l7K2K3jjL9k4n5PL1L0qqq
1250A069qMLMML4L5L5L5j5j5m9J2L0L0k8k8j7j6j7j7K5K5K4K5k9k8L4L3KJKKQQM3j9p7p6j5
1245A073M7K3l8r8l4K3K3l1l1k7L5J04J04K1K2m0m1ppopL4L3L4L4j0rrrK1K1m1m2ooopLLL
1241A149MJ6J6J6J6o5o5o5o5k4k3Q1Q0L3L3p1p2J8J7J7J7NMMNONn6n7M9M9N0M9k8k7L5L5L
1236A194Ln9n9J0J0J0J0k1k1q3q4M2M1M1M2o4o3kjN0M9N0M9K7K6K7K6l9l8l9l8K4K3K4K4N
1231A196On7n7J7J6m6m6J0J0J0J0N0N0j2j3K3K3K3K2j7j6j7j7n6n5OPk1k2M1M1J1J2m8m7K
1227A039O4K9K9LLM2k0o3%O0O1k5q7q8k5J6J5J6J5Nn7n7NK4K3K7K8J4J4J1J0K9l4KJL3L2k9
1222A165l0lmllR7R6J0r4m2m3m5m5l3K9L3k9%O4N9lk2k1L7L8m5m5K4Q7L1L0L1L1l0r2n7n7
$$ y = [1145, 1133, 1121, 1109, 1097, 1124, 1150, 1176, 1202, 1227, 1252, 1177, 1102, 1074, 1108, 1146, 1122, 1095, 1131, 1127, 1124, 1115, 1106, 1132, 1095, 1059, 1022, 1044, 1067, 1066, 1065, 1104, 1080, 1025, 1032, 1063, 1093, 1085, 1077, 1069, 1061, 1065, 1068, 1072, 1076, 1110, 1145, 1180, 1215, 1200, 1185, 1136, 1148, 1178, 1208, 1180, 1152, 1135, 1119, 1102, 1085, 1110, 1135, 1159, 1184, 1155, 1127, 1161, 1194, 1196, 1197, 1199, 1201, 1209, 1217, 1260, 1241, 1164, 1088, 1073, 1120, 1143, 1105, 1007, 973, 996, 1019, 988, 957, 930, 965, 1069, 1173, 1194, 1216, 1176, 1135, 1128, 1121, 1115, 1108, 1142, 1175, 1209, 1243, 1233, 1224, 1215, 1206, 1227, 1248, 1207, 1165, 1159, 1153, 1147, 1140, 1143, 1146, 1149, 1153, 1169, 1185, 1201, 1217, 1152, 1087, 1022, 957, 933, 910, 991, 1071, 1104, 1137, 1066, 994, 1012, 1029, 1046, 1063, 1068, 1072, 1076, 1081, 1087, 1092, 1036, 979, 1028, 1077, 1127, 1176, 1148, 1121, 1156, 1191, 1194, 1197, 1138, 1079, 1089, 1099, 1109, 1119, 1098, 1077, 994, 910, 952, 993, 1034, 1076, 1012, 949, 947, 946, 996, 1045, 1095, 1144, 1171, 1197, 1224, 1250, 1211, 1173, 1134, 1096, 1120, 1143, 1167, 1191, 1196, 1202, 1145, 1088, 1105, 1121, 1075, 1029, 1039, 1049, 1059, 1069, 1119, 1169, 1157, 1144, 1167, 1190, 1213, 1235, 1218, 1202, 1185, 1168, 1112, 1057, 1063, 1070, 1049, 1027, 1068, 1109, 1120, 1132, 1084, 1037, 1039, 1103, 1132, 1161, 1164, 1167, 1209, 1189, 1126, 1126, 1186, 1247, 1222, 1135, 1047, 1022, 1038, 1053, 1069, 1084, 1089, 1032, 975, 980, 1004, 1027, 1054, 1082, 1096, 1110, 1121, 1131, 1160, 1126, 1128, 1129, 1162, 1194, 1165, 1135, 1132, 1128, 1125, 1122, 1219, 1315, 1325, 1231, 1189, 1146, 1101, 1056, 1023, 1052, 1085, 1056, 1056, 1120, 1179, 1176, 1154, 1133, 1170, 1208, 1163, 1118, 1142, 1229, 1260, 1290, 1321, 1352, 1322, 1230, 1173, 1116]
1218A116pqpqO3O3K2q3q2k0M2M3qpppLMLLj6j7M6M5L4L4L4L4l3l3l3l3L8L7L7L7J4J4J4J4
1213A385K1K2K2K1q1q1q1q2M6M7M6M6POPPk7k7k7k7pqppM2M2o1o2n1n2J1J1K5K6Q7Q8l0l0
1208A267l0l1m3m3J9J9K3K3K2K3M9M9M8M9q0q0j7j8O5O4O4O5ppppQPr6r7qqqqJ4J5J4J4nn
1203A316mnQRQQJ5J6J5J5l8l8K5K4j1j1j1j1L3L3L3L3j08j09mmPPPPNMMNrrqr%J%JK9K9K9
1198A337K9j0rj0j0QPn5n5RRRRNNNNK6K7K7K7qqrqn1n1J2J1K6K5K6K6j6j6j5j6l2l3l2l3J
1193A194JJ05J04j8j9j9j9J0RRRj5j6j5j6n5n6POK7K6l6l7m8m9N5N5O7O7MMp4p5p5p5LMO5
1188A114O6K1K1K2K1j8j7M5M4qqrqJ4J3J4J4j2j1j2j2PPOPK5K5K5K5O9O9l5l4n3n3J0J0p9
1184A325p8j7j6O3O2%Jj1j0j0j0%%%%k8k9k8k8K9K9O5Km3m3m8m7J9J9K3K3J2P3P4J1m4m3J4
$$ y = [1116, 1109, 1101, 1094, 1086, 1149, 1212, 1234, 1151, 1069, 1049, 1091, 1134, 1126, 1119, 1112, 1105, 1108, 1112, 1115, 1118, 1102, 1085, 1131, 1176, 1210, 1244, 1278, 1312, 1279, 1246, 1213, 1180, 1218, 1255, 1292, 1329, 1343, 1357, 1371, 1385, 1406, 1428, 1450, 1471, 1390, 1309, 1228, 1146, 1192, 1239, 1285, 1331, 1338, 1344, 1351, 1358, 1331, 1304, 1277, 1250, 1243, 1235, 1228, 1221, 1263, 1305, 1244, 1182, 1131, 1079, 1090, 1101, 1126, 1152, 1239, 1327, 1297, 1267, 1237, 1206, 1163, 1120, 1139, 1158, 1181, 1204, 1226, 1249, 1298, 1347, 1395, 1444, 1364, 1284, 1267, 1249, 1314, 1378, 1442, 1507, 1500, 1493, 1486, 1479, 1487, 1494, 1398, 1301, 1293, 1285, 1277, 1269, 1283, 1298, 1312, 1326, 1321, 1316, 1312, 1307, 1315, 1324, 1332, 1340, 1355, 1371, 1386, 1401, 1363, 1325, 1350, 1374, 1363, 1352, 1341, 1330, 1363, 1396, 1429, 1462, 1354, 1245, 1241, 1237, 1244, 1251, 1258, 1265, 1270, 1274, 1278, 1283, 1274, 1265, 1257, 1248, 1248, 1249, 1249, 1250, 1279, 1308, 1337, 1366, 1356, 1347, 1337, 1327, 1335, 1342, 1287, 1232, 1241, 1250, 1259, 1268, 1273, 1278, 1283, 1288, 1314, 1341, 1368, 1395, 1387, 1379, 1370, 1362, 1311, 1260, 1272, 1283, 1309, 1334, 1360, 1386, 1370, 1354, 1339, 1323, 1291, 1258, 1226, 1193, 1194, 1195, 1300, 1404, 1386, 1367, 1348, 1329, 1339, 1348, 1357, 1366, 1351, 1335, 1320, 1304, 1249, 1193, 1200, 1206, 1233, 1259, 1223, 1186, 1138, 1089, 1144, 1199, 1266, 1333, 1337, 1341, 1267, 1192, 1117, 1042, 1045, 1049, 1114, 1180, 1201, 1222, 1244, 1265, 1247, 1230, 1275, 1319, 1311, 1303, 1294, 1286, 1300, 1313, 1327, 1341, 1329, 1318, 1306, 1294, 1301, 1308, 1314, 1321, 1346, 1371, 1396, 1421, 1490, 1559, 1524, 1490, 1437, 1384, 1394, 1404, 1325, 1247, 1230, 1214, 1277, 1339, 1339, 1340, 1329, 1319, 1309, 1299, 1299, 1299, 1299, 1299, 1271, 1242, 1214, 1186, 1215, 1244, 1309, 1311, 1268, 1225, 1177, 1130, 1149, 1168, 1191, 1214, 1226, 1299, 1373, 1384, 1340, 1297, 1311]
1179A311J5qpN5N5n4n3k6L7kjl6K6M0k3q1j8O7O7RRjjjjj4j4m9J4N8N9O2O2k8k9k9k8mnmm
1174A425J9J9J9J9N0N0M9N0m0m0O4J27P2l2o7nP0P0k7k7lO0N9lp1p0m7J5M7M8j1j0L3L3k9
1170A916k9l4l4j0N2P6J5q6q6JJ04Q2J9J9J9J5J5l4l4P0P0L5L5L5L5MNMMk3k3M0L9M5M5M4
1165B450M5nmJ6P8J08Mq0p9j7j7j7j7J8J7m5m5NMO7O7LMLMpqN6J18J22J8o2o1M1J04K3q0q3
1161B748q3k7k7LLKLK9K9l4l3K5K4l7l7m5m5N9N9L1L0L1L1L7L8L8L8jkO2O1L0L1l2l2J%j03
1156B905j03j8j7j8j7l6l5K6K7n0m9n0n0l7l6K5K6J5J5J5J5J8J9J9J9N2N2N2N2l5l5l5l5M7
1152B743M6n8n7m9m8J4J4p9p9j7j6M3M3M3M3k8k7k8k8l8l9l9l9l1l1j%R9R9K6K5l3l3l4l3
1147B373M5M6k8k7l4l4J9J8P0P1J8J8q3q4n2n3J8J8M9M9m0m1qrk0j9L3L2L3L2m0m1L0L1L0
$$ y = [1311, 1326, 1318, 1311, 1366, 1421, 1367, 1314, 1288, 1325, 1323, 1322, 1286, 1312, 1352, 1329, 1248, 1230, 1297, 1364, 1373, 1382, 1381, 1380, 1379, 1378, 1364, 1350, 1301, 1315, 1373, 1432, 1494, 1556, 1528, 1499, 1470, 1442, 1438, 1433, 1429, 1425, 1444, 1463, 1482, 1501, 1551, 1601, 1650, 1700, 1660, 1620, 1684, 1811, 1883, 1851, 1784, 1779, 1849, 1919, 1892, 1865, 1862, 1922, 1981, 1978, 1907, 1837, 1790, 1805, 1852, 1900, 1889, 1879, 1912, 1945, 1916, 1887, 1853, 1819, 1809, 1861, 1937, 1952, 1866, 1780, 1781, 1885, 1967, 1986, 2005, 2024, 2039, 2054, 2020, 1986, 2056, 2126, 2161, 2196, 2231, 2266, 2270, 2275, 2279, 2283, 2260, 2237, 2277, 2316, 2361, 2406, 2450, 2495, 2490, 2486, 2502, 2580, 2688, 2692, 2612, 2533, 2516, 2499, 2482, 2465, 2483, 2500, 2455, 2410, 2415, 2419, 2486, 2553, 2556, 2560, 2563, 2567, 2560, 2552, 2608, 2726, 2848, 2866, 2804, 2743, 2784, 2888, 2911, 2831, 2748, 2665, 2638, 2611, 2614, 2617, 2619, 2622, 2651, 2680, 2646, 2613, 2638, 2662, 2625, 2588, 2543, 2498, 2557, 2616, 2647, 2677, 2708, 2739, 2776, 2814, 2852, 2890, 2889, 2887, 2949, 3010, 3040, 3071, 3039, 3007, 3008, 3008, 2905, 2802, 2784, 2767, 2749, 2732, 2696, 2661, 2687, 2714, 2664, 2615, 2565, 2515, 2478, 2442, 2467, 2493, 2508, 2523, 2538, 2553, 2571, 2590, 2609, 2628, 2680, 2732, 2784, 2836, 2801, 2766, 2731, 2696, 2743, 2789, 2731, 2674, 2625, 2577, 2591, 2605, 2526, 2447, 2430, 2414, 2457, 2500, 2543, 2586, 2558, 2531, 2503, 2475, 2437, 2398, 2359, 2320, 2289, 2258, 2257, 2257, 2356, 2455, 2481, 2506, 2473, 2440, 2406, 2373, 2418, 2464, 2436, 2409, 2375, 2341, 2360, 2378, 2448, 2519, 2537, 2555, 2472, 2388, 2336, 2283, 2301, 2319, 2368, 2417, 2377, 2336, 2328, 2319, 2299, 2280, 2313, 2345, 2378, 2410, 2370, 2329, 2359, 2390, 2420]
1143B420L0ONk6k6L5L4j7j7j9j9P4P5j9j8L3L4l3l2l3l3NMMNK4K4K4K4n1n1n2n1LLLLJ6J6
1138B407J6J6P6P6P6P6j6j6J5J5N1N2k1k1N1N2k1k1l1l1Q3Q3L4L4j8j8n0n1KJM4M3k9k9j5
1134B915j5j5j5RRRRK7K7K7K7j1j1j2j1m0l9N3N4M2M2J1J1j1j2j1j2K0J9K0K0n6n5j8M5Q1
1130C133Q2K7l5p5p4m5J8N1j1o1o2L2R5K8p6n1J1M2M2j2j2O1O0J5J4l7l8NNNNN1N1N1N1MN
1125C355MNMMNMK1K1K1K0k3k4j9k0K0Q3Q2K0j9j9N0M9kkK9K9J2J2O1O0N4qk4k5J7J7j5j4j
1120C844kN1N0O3O2j0j1J0RM1M1M0M1M1M1PQL1R4P9J7ooO8O9l1l1M4J06J07M4K6K6K2K3M0
1116E048L9M4j8j8j8M1M0K9K8K8K9rj0R1R1O4JKO3M6M6N0N0M8M8M8M8L0L0kjRQJ09J09O6N
1112F312k3k3O6O7L5L5O2O2O3O2L2L2J31J32J35P2M9M8Q5J48J43J44O5O5R7R6J39J38J97J98
$$ y = [2420, 2450, 2456, 2461, 2435, 2409, 2444, 2478, 2461, 2444, 2425, 2406, 2480, 2555, 2536, 2518, 2551, 2585, 2552, 2520, 2487, 2454, 2459, 2463, 2467, 2472, 2496, 2520, 2544, 2568, 2517, 2466, 2414, 2363, 2366, 2369, 2372, 2375, 2391, 2407, 2423, 2439, 2515, 2591, 2667, 2743, 2727, 2711, 2726, 2741, 2792, 2844, 2823, 2802, 2853, 2905, 2884, 2863, 2832, 2801, 2884, 2967, 3001, 3035, 3017, 2999, 2949, 2898, 2900, 2901, 2945, 2988, 2959, 2930, 2915, 2900, 2885, 2870, 2879, 2888, 2897, 2906, 2933, 2960, 2987, 3014, 3003, 2992, 2980, 2969, 2929, 2890, 2943, 2997, 3039, 3081, 3092, 3103, 3092, 3080, 3069, 3057, 3077, 3096, 3116, 3136, 3080, 3025, 3007, 3052, 3133, 3215, 3242, 3207, 3132, 3058, 3013, 3031, 3082, 3071, 3010, 2948, 2980, 3075, 3103, 3027, 2976, 2987, 3029, 3071, 3059, 3047, 3108, 3168, 3183, 3197, 3160, 3122, 3127, 3132, 3137, 3142, 3193, 3244, 3295, 3346, 3350, 3355, 3359, 3364, 3368, 3372, 3377, 3381, 3402, 3423, 3444, 3464, 3441, 3417, 3398, 3378, 3398, 3481, 3563, 3583, 3564, 3545, 3595, 3644, 3642, 3640, 3669, 3698, 3710, 3722, 3783, 3843, 3897, 3889, 3865, 3840, 3857, 3874, 3859, 3845, 3844, 3842, 3893, 3943, 4006, 4068, 4058, 4047, 4057, 4066, 4107, 4148, 4188, 4229, 4270, 4311, 4318, 4326, 4357, 4451, 4530, 4547, 4541, 4535, 4603, 4672, 4641, 4610, 4654, 4760, 4867, 4911, 4937, 4963, 4985, 5008, 5048, 5087, 5131, 5113, 5095, 5077, 5118, 5158, 5187, 5215, 5243, 5272, 5263, 5253, 5344, 5435, 5499, 5500, 5502, 5565, 5611, 5657, 5707, 5757, 5805, 5853, 5901, 5949, 5979, 6009, 6007, 6006, 6015, 6023, 6132, 6241, 6307, 6312, 6289, 6266, 6332, 6399, 6434, 6469, 6531, 6593, 6656, 6718, 6750, 6782, 6913, 7045, 7180, 7252, 7301, 7349, 7434, 7582, 7725, 7869, 7934, 7999, 8096, 8192, 8331, 8469, 8666, 8864]
1108H864J35P3J04J66J44J43J71K34K28J65J43J42J95J95J64J64J39J39J04J67K42K43K46
1105A2710K47K56K56K29J66J96J95K54K54L15L14L45L46L52L53M21M84M35M35M38M39M97M97
1102B0434N60N59O01O01P05P05P86P86Q89Q90R65R66J056J160J282J343J393J456J589J736
1100D0462J896K043K219K364K536K765L031L343L738M175M609N129N799O569P385Q321R353
1098A15737J0579J1989J3589J5425J7608K0041K2681K5577K8759L2057L5114L7562L8873L8386
1096D63977L5495K9777K1189J0316j808j3756k4133l1941l6746l8538l7645l4705l0650k6148
1094B84684k1635j7214j3034r292n902k855j32J993L302L641K996J320j322m638q110j1186
1092B02616j3577j5011j5532j5144j4125j2768j1333r925q573p387o368n508m696l972l368
$$ y = [8864, 8999, 9072, 9176, 9342, 9486, 9629, 9800, 10034, 10262, 10427, 10570, 10712, 10907, 11102, 11266, 11430, 11569, 11708, 11812, 11979, 12221, 12464, 12710, 12957, 13213, 13469, 13698, 13864, 14060, 14255, 14509, 14763, 15078, 15392, 15737, 16083, 16435, 16788, 17209, 17693, 18128, 18563, 19001, 19440, 19937, 20434, 20994, 21553, 22154, 22755, 23460, 24165, 24951, 25737, 26626, 27516, 28481, 29447, 30503, 31663, 32945, 34288, 35681, 37137, 38726, 40462, 42358, 44401, 46620, 48984, 51520, 54285, 57316, 60659, 64397, 68572, 73181, 78310, 84109, 90678, 98063, 106384, 115737, 126316, 138305, 151894, 167319, 184927, 204968, 227649, 253226, 281985, 314042, 349156, 386718, 425591, 463977, 499472, 529249, 550438, 560754, 558946, 545190, 521057, 489116, 452370, 413832, 376187, 341482, 310832, 284684, 263049, 245835, 232801, 223509, 217607, 214752, 214620, 216613, 219915, 223556, 226552, 227872, 226550, 221912, 213802, 202616, 189039, 174028, 158496, 143352, 129227, 116459, 105126, 95201, 86628, 79241, 72873, 67365, 62669, 58697, 55329]
1090E5329k802k324j878j526j176q65o65n60n91o96q54j167j515j827k047k152k159k055j862
1088B6608j676j535j390j198j053j009r47q71p66o93n89n15n14m81m19l77l77m32m32m04l40
1086A0590l10l10k53j91k22k22k04j42j41k04k40k40k39k40j53r0j21j22j49q7q2j46j10m7
1083F325m8j10j77j15m9n0j56j55r3r4j23j24r3r2r4r3PPm8j10j37j37j01j02l6K6po9r7l4
1079C821J4J5m4m4l7l6l3l3rN3N8on4QP3P3L3L3R5R5P4P3P0P0P3J1n5n4j9M3M0L9L8L7J00
1075D615J00J12J13M3j8j08j07j07j07q1j8R2R2J01J01K05K68K65J62j0j56k80l43k71j67
1072D496j32j31o3o2N9O0J16J15K9p5j27j89k30k30j72j72p8p9m7m8O1O1jjp6p6j39j38p9
1068B652p8p9p9n0n0n0n0k7k7k7k6l4l4l4l4M1M2M1M2l4l5l4l4k7k6k6k7J1J1J1J1l3l4l3
$$ y = [55329, 52527, 50203, 48325, 46799, 45623, 44758, 44093, 43533, 42942, 42246, 41392, 40225, 38710, 36883, 34836, 32684, 30525, 28470, 26608, 24932, 23397, 22007, 20809, 19756, 18747, 17800, 16929, 16163, 15470, 14881, 14366, 13852, 13371, 12952, 12575, 12198, 11766, 11334, 10930, 10590, 10280, 9970, 9717, 9526, 9304, 9082, 8878, 8736, 8595, 8391, 8151, 7911, 7672, 7432, 7279, 7189, 7068, 6946, 6797, 6710, 6628, 6482, 6372, 6325, 6277, 6167, 5990, 5875, 5826, 5776, 5620, 5465, 5372, 5278, 5155, 5031, 4938, 4846, 4752, 4659, 4666, 4673, 4625, 4515, 4378, 4241, 4140, 4038, 4002, 4028, 4021, 3952, 3855, 3821, 3835, 3850, 3806, 3762, 3725, 3689, 3656, 3623, 3614, 3667, 3725, 3719, 3665, 3673, 3746, 3819, 3852, 3885, 3980, 4075, 4149, 4222, 4292, 4362, 4435, 4446, 4391, 4337, 4318, 4361, 4401, 4440, 4478, 4515, 4615, 4715, 4827, 4940, 4983, 4965, 4857, 4750, 4643, 4536, 4455, 4437, 4529, 4621, 4722, 4823, 5028, 5296, 5561, 5723, 5713, 5557, 5277, 4934, 4663, 4496, 4364, 4233, 4170, 4108, 4167, 4227, 4343, 4458, 4487, 4412, 4285, 4096, 3866, 3636, 3464, 3292, 3214, 3135, 3088, 3040, 3101, 3162, 3161, 3160, 3084, 3008, 2869, 2731, 2652, 2574, 2495, 2416, 2366, 2316, 2266, 2216, 2189, 2162, 2135, 2109, 2075, 2041, 2007, 1973, 2014, 2056, 2097, 2139, 2105, 2070, 2036, 2002, 1975, 1949, 1923, 1896, 1907, 1918, 1929, 1940, 1907, 1873, 1840]
1064A840l3K9K9L0K9K0K0m2m2l8l8l8l8K3K3K3K3q6q6q6q6L6L6L6L7j0j0j0j0L0L0kjn4n3
1060A531R2R2M4M3j9j8l6l5l5l6M0L9QQjko4o4p1p1L3L3N2N3N2N2n3n2n3n3N3N4N4N3l2l2
1055A659l2l2K6K5K6K6l2l1L1L1l1l1P3P4k1k0k0k1k1k2k2k1M8M9M8M9k1k1k1k0l2l1L1L1
1051A724N0N0j2j2mllmN5N4m9m9l5l5O9O8O8O8ONo2o2J%L4L4k9k9k2k2M0J03P7k7o9o8N1N1
1046B012N1N1L3L4k9k9N5N4qqK0K1K0K0P8P9k5k6o3o4jjo1o1JJNNO0O1J7q8j23o0L3R6L7k6
1042B171j%nnKKO4O4L3L3L3L2K9K9Q7Q7J0n2j6j7rqM9N0L6k7n4n4QPQQnmmmK0J9K0K0M3M3
1037B742o1o1n2n2k5L8mm%%L1L1l1l1rrrrK2K2K1K2L3L2pN6M6j6p8p7mO0K4K4K9L0L0L0Q8
1032B872Q8K4l9JO5J18N7Jo0o5kO2O1O6O6P3P4J1J1N5N5K7l4p4p4j3N0N5pp2p3J8J7J7J8k
$$ y = [1840, 1807, 1836, 1865, 1895, 1924, 1944, 1964, 1922, 1880, 1842, 1804, 1766, 1728, 1751, 1774, 1797, 1820, 1734, 1648, 1562, 1476, 1512, 1548, 1584, 1621, 1611, 1601, 1591, 1581, 1611, 1641, 1639, 1638, 1584, 1531, 1623, 1715, 1759, 1802, 1783, 1765, 1729, 1694, 1659, 1623, 1663, 1702, 1710, 1718, 1717, 1715, 1651, 1587, 1516, 1445, 1478, 1511, 1563, 1616, 1668, 1720, 1667, 1615, 1562, 1509, 1562, 1616, 1670, 1723, 1691, 1659, 1627, 1595, 1621, 1646, 1672, 1698, 1666, 1635, 1666, 1697, 1666, 1635, 1708, 1782, 1761, 1741, 1721, 1700, 1679, 1657, 1635, 1614, 1662, 1711, 1759, 1808, 1787, 1766, 1745, 1725, 1693, 1662, 1693, 1724, 1774, 1824, 1812, 1800, 1796, 1793, 1790, 1786, 1841, 1895, 1846, 1797, 1762, 1727, 1796, 1864, 1932, 2000, 2006, 2011, 1949, 1887, 1888, 1888, 1922, 1956, 1927, 1898, 1876, 1854, 1894, 1997, 2074, 2047, 1978, 1910, 1961, 2012, 2063, 2114, 2147, 2181, 2152, 2123, 2178, 2232, 2224, 2216, 2236, 2257, 2277, 2297, 2375, 2454, 2429, 2403, 2340, 2276, 2275, 2274, 2213, 2152, 2153, 2154, 2159, 2164, 2224, 2285, 2302, 2214, 2091, 2031, 2064, 2160, 2197, 2171, 2170, 2170, 2165, 2160, 2162, 2164, 2228, 2292, 2325, 2358, 2391, 2423, 2452, 2481, 2568, 2655, 2665, 2613, 2597, 2580, 2571, 2563, 2612, 2662, 2698, 2671, 2617, 2563, 2571, 2578, 2586, 2594, 2589, 2585, 2581, 2577, 2597, 2616, 2636, 2656, 2699, 2742, 2681, 2620, 2568, 2516, 2491, 2529, 2525, 2521, 2521, 2521, 2552, 2583, 2552, 2521, 2512, 2503, 2494, 2485, 2507, 2529, 2550, 2572, 2605, 2637, 2630, 2686, 2732, 2716, 2638, 2561, 2557, 2617, 2641, 2665, 2694, 2724, 2754, 2784, 2872, 2960, 2984, 2945, 2946, 3011, 3129, 3186, 3187, 3127, 3062, 3060, 3122, 3183, 3249, 3315, 3388, 3462, 3473, 3484, 3539, 3594, 3621, 3587, 3513, 3439, 3426, 3476, 3531, 3524, 3452, 3379, 3397, 3414, 3431, 3449, 3447]
1028C447kklN3N2j0rl8l8O7O6N2N2j0j0NNNNJ0J1J0J0M8M7j5j5J7J6J6J6O9P0OPK0K0K0K0
1023D090k6k5L7L7NOOOP4P3J2J1n2n2N2N1J02J01L9L9J3J3J3J3L5L5L5L5l6l7K6K6J15J15
1019D987J15J14j5j5M7M7P4P4P4P4P0P0P0P0N3N3N3N2J10J10K14K14J99K00J37J37K50K50
1015G888K50K50K12K12K08L33M81N44N65N66N30L23J18ol8K5J00J63K37L62M20N45P49Q74
1012A5911Q96Q34O82M74K52K52M42P33R12J037J262J554J782J990K310K684L043L334L688
1010D4072M228N102O141P462R083J0825J2697J4471J5843J6176J4804J1364O499J612j673
1008A78706k607j401J360N061R468J4249J9137K3753K7524K9230K6994J9467P710m891j4083
1006C39677j7535j5698j0582l981L381J1044J8488K5189L0637L3677L1638K1907M897j4676
$$ y = [3447, 3445, 3443, 3440, 3493, 3545, 3535, 3526, 3488, 3450, 3517, 3583, 3635, 3687, 3677, 3667, 3672, 3677, 3682, 3687, 3697, 3708, 3718, 3728, 3776, 3823, 3808, 3793, 3810, 3826, 3842, 3858, 3927, 3997, 4003, 4010, 4030, 4050, 4070, 4090, 4064, 4039, 4076, 4113, 4118, 4124, 4130, 4136, 4210, 4283, 4295, 4306, 4254, 4202, 4254, 4305, 4407, 4508, 4547, 4586, 4599, 4612, 4625, 4638, 4673, 4708, 4743, 4778, 4742, 4705, 4731, 4757, 4872, 4987, 5102, 5216, 5201, 5186, 5233, 5280, 5354, 5428, 5502, 5576, 5646, 5716, 5786, 5856, 5909, 5962, 6015, 6067, 6177, 6287, 6501, 6715, 6914, 7114, 7251, 7388, 7638, 7888, 8138, 8388, 8600, 8812, 9020, 9353, 9834, 10378, 10943, 11509, 12039, 12362, 12480, 12474, 12436, 12461, 12561, 12724, 12961, 13323, 13743, 14288, 15037, 15911, 16807, 17641, 18323, 18797, 19049, 19301, 19743, 20476, 21388, 22425, 23687, 25241, 27023, 29013, 31323, 34007, 37050, 40384, 44072, 48300, 53402, 59543, 67005, 76088, 86913, 99610, 114081, 129924, 146100, 160904, 172268, 178767, 180379, 178706, 176099, 174698, 176058, 181119, 190587, 204836, 223973, 247726, 275250, 304480, 331474, 350941, 358651, 353760, 339677, 322142, 306444, 295862, 291881, 295262, 306306, 324794, 349983, 380620, 414297, 445935, 467842, 472739, 458063]
1005D58063l0189l7440l6651l0953k3259j5171p144K26O505J1522J4558J4260Q979j232j3749
1003C18325k4293k9824l0078k6627k1611j6247j1125o593k857J2J879K170M33l352q165j2532
1001A29515j5322j5945j4989j3117j1049r095p405n949m801l844l132k674k302j927j532j324
999A5108j197j072r67q42p75p13o29n68n30n31m52l26l00l00l47l47l05j80j46j47k60k59
996C915j56j55j11j10j10j10k13k13o7o8r6r6r6r6j20j19j6j6rrp2p2OOr8r9j02j02KKo2o2
992A276o2o2m1m2K1K0m1m2j0j1L4L5p0p0l5l5l5l5l7l8l8l7P9P8J7J6K6K5K6K5J0J1J0J1J0
988I89J0J1J0ppppk2k3k2k3KJKJONONNNO7O7M1M0P2P2j9j8j8j9j5j6Q8Q9L9L8P0P0J36J36
983A860K52L15L56M60O00P05Q76J270J721J658R20K6k71%L9o06j456j851j621j227r04o75
$$ y = [458063, 427874, 390434, 353783, 322830, 299571, 284400, 277256, 277482, 283987, 295509, 310067, 324327, 333306, 332074, 318325, 294032, 264208, 234130, 207503, 185892, 169645, 158520, 151927, 149070, 149082, 150961, 153131, 153564, 150212, 142047, 129515, 114193, 98248, 83259, 70142, 59093, 49998, 42593, 36644, 31843, 27999, 24867, 22193, 19891, 17964, 16432, 15108, 13911, 12839, 11872, 11030, 10255, 9542, 8913, 8345, 7815, 7284, 6832, 6506, 6206, 5906, 5559, 5212, 4907, 4727, 4581, 4434, 4174, 3915, 3759, 3604, 3493, 3383, 3273, 3163, 2950, 2737, 2670, 2602, 2506, 2410, 2314, 2218, 2098, 1979, 1963, 1947, 1938, 1929, 1857, 1785, 1791, 1797, 1699, 1600, 1498, 1396, 1398, 1400, 1338, 1276, 1214, 1152, 1111, 1069, 1090, 1110, 1069, 1027, 1017, 1006, 1040, 1075, 1005, 935, 900, 865, 830, 795, 758, 720, 682, 645, 724, 802, 819, 835, 861, 886, 912, 937, 947, 958, 968, 979, 989, 999, 1010, 1020, 1013, 1006, 999, 992, 970, 947, 925, 902, 904, 905, 907, 908, 914, 919, 925, 930, 935, 940, 1007, 1074, 1115, 1155, 1227, 1299, 1280, 1262, 1244, 1225, 1210, 1194, 1282, 1371, 1410, 1448, 1518, 1588, 1724, 1860, 2112, 2427, 2783, 3243, 3843, 4548, 5424, 6694, 8415, 10073, 10993, 11019, 10748, 10748, 10787, 10181, 8725, 6874, 5253, 4026, 3122, 2447]
980B447m38k50j54j55q9r0J4J4j7j7j7j7J4J4J3J4rqrqm2m3J3J2K9r6n7n8M5M4M4M4Q2Q2N1
976A402N1J03J03K08K07K07K07L24M48N21N22P00R09J189J481K088K796L423L631L132J759
973B5411l54k558l545k922j386m29q19j776k386k262j622j082p42n34l47l46k98k97k27k27
971A252j22LL6L7L1L2p3p2j42j42o7N9N0N1N8N8k1k1k1k1J0J0P8K03K41J17l4l4l4l4m1Q3
967A530J76J76K17L43L52L53M80P71J039J246J647K271K569J863O25j65l23o14j523k480k642
964G911k017j394j020p33m42k62k63l02j79j02j03p4p3p4p3q7q7J8J7rrj0rrqrrp2p2m2m1
961C62m3m2K0J9J2J2M3M3l3l4kkN5N5m9m9l8l7K4K5k3k3L9L9J7J7m6m6k2k3RRn7n7k5k6k0
956A03k0J1J1NNL6L7P6P6k7k8m0m0K2K3N6N6ooj0j0N2N2n2n2n2n2J%O3O3K8K8mlK9K9K9K9
$$ y = [2447, 2009, 1759, 1605, 1450, 1361, 1271, 1285, 1299, 1282, 1265, 1248, 1231, 1245, 1259, 1272, 1286, 1277, 1269, 1260, 1252, 1210, 1167, 1180, 1192, 1221, 1125, 1068, 1010, 1055, 1099, 1143, 1187, 1269, 1351, 1402, 1453, 1556, 1659, 1867, 2074, 2281, 2488, 2812, 3260, 3781, 4303, 5003, 5912, 7101, 8582, 10670, 13466, 16889, 20520, 23652, 25411, 25057, 22499, 18954, 16032, 14646, 14217, 13398, 11622, 9236, 6974, 5352, 4270, 3528, 2994, 2647, 2301, 2003, 1706, 1479, 1252, 1130, 1133, 1169, 1206, 1237, 1269, 1196, 1124, 982, 840, 773, 832, 882, 933, 991, 1049, 1028, 1007, 986, 965, 975, 985, 1063, 1266, 1507, 1624, 1590, 1556, 1522, 1488, 1447, 1530, 1706, 1882, 2099, 2442, 2794, 3147, 3627, 4398, 5437, 6683, 8330, 10601, 13170, 15033, 15658, 15493, 15170, 14556, 13033, 10553, 7911, 5894, 4500, 3480, 2747, 2305, 2043, 1780, 1478, 1299, 1197, 1094, 1020, 947, 873, 800, 713, 626, 644, 661, 652, 643, 633, 624, 615, 607, 598, 589, 517, 445, 403, 362, 319, 277, 297, 316, 328, 340, 383, 426, 393, 359, 357, 355, 410, 465, 416, 367, 329, 292, 316, 341, 318, 295, 334, 373, 390, 407, 361, 315, 293, 270, 279, 288, 231, 174, 149, 123, 103, 83, 94, 105, 110, 115, 151, 188, 264, 340, 313, 285, 245, 205, 227, 250, 306, 362, 356, 350, 340, 330, 382, 434, 382, 330, 278, 226, 227, 227, 290, 353, 381, 409, 405, 402, 431, 460, 489, 518]
951E18j6j6m7m7o5o4lkK8K7K7K8L2L3l0l0kkkkJ7J7J8J7M8M8M8M8ppppP5P4P5P4j8j7j8j8
946H25p0p0pqk5k6k5k6m9n0J3J3lmK7K8m3m3j2j1j0rN2N3M1M0RJ0QRQRK1K1m1m1k0k0M3M3
942F60M0M0RQKKJKN5N4N5N4M3M3M2M3J44J44Q2Q2J8J8m4m4j1j1J35J35J77J78J46J45J49J49
937B745J00np2j34j33j33j34p1K2J27J69J69K01K00J98R4k2j26j71k35k05k06q6q5k3k3K9
934B190K9M9J13R9nj35j99j83j83j56j56q0q1j8j8M9M9M9M8J0J0r4r4j54j54n0n0n1n1n1n1
930F81L8L9k4k4l6l7K6K6l2l3l3l2n8n7NNL1L2%%L4L5L4L4RJ0n3n3K3K2N4N4j6j6m8m7m4m5
926E04J02J01L7L7NOk9l0KKN8N7mnq1q2K3K3K1K1m2m2j7j8J3J3j6j5m8m7N2N2K1K1n5n4QP
921F01o4o5lkO9O8OOl5l5mmK7K7R0R0k4k4QPKKJKppppk8k8KLO4O4KJL9L8k4k3o0n9LLj1j2
$$ y = [518, 502, 486, 439, 392, 327, 263, 260, 258, 286, 313, 340, 368, 400, 433, 403, 373, 371, 369, 367, 365, 382, 399, 417, 434, 482, 530, 578, 626, 619, 612, 605, 598, 673, 747, 822, 896, 878, 861, 843, 825, 755, 685, 678, 670, 645, 619, 594, 568, 519, 469, 482, 495, 492, 488, 515, 543, 500, 457, 445, 434, 424, 415, 467, 520, 561, 601, 610, 620, 628, 637, 645, 654, 675, 696, 655, 614, 594, 574, 617, 660, 700, 740, 749, 757, 759, 761, 762, 764, 819, 873, 928, 982, 1025, 1068, 1110, 1153, 1297, 1441, 1523, 1605, 1623, 1641, 1597, 1553, 1542, 1531, 1666, 1801, 1978, 2156, 2302, 2447, 2596, 2745, 2845, 2840, 2768, 2634, 2501, 2368, 2234, 2163, 2185, 2312, 2481, 2650, 2851, 3051, 3249, 3343, 3321, 3195, 3024, 2789, 2584, 2378, 2292, 2207, 2184, 2161, 2190, 2219, 2268, 2381, 2480, 2475, 2340, 2141, 1958, 1775, 1619, 1463, 1383, 1302, 1284, 1266, 1315, 1364, 1413, 1461, 1471, 1481, 1387, 1293, 1139, 985, 935, 885, 834, 783, 732, 681, 719, 758, 734, 710, 674, 637, 663, 689, 657, 624, 591, 559, 501, 444, 449, 454, 485, 517, 517, 517, 551, 586, 620, 654, 663, 673, 620, 567, 590, 612, 666, 720, 704, 688, 640, 593, 549, 504, 606, 707, 744, 781, 786, 792, 763, 733, 735, 737, 795, 852, 848, 843, 762, 680, 703, 726, 747, 768, 726, 684, 667, 649, 662, 675, 659, 644, 596, 549, 601, 653, 674, 695, 640, 586, 594, 601, 537, 472, 469, 467, 536, 604, 610, 616, 581, 546, 542, 538, 565, 592, 682, 772, 748, 724, 732, 739, 741, 743, 744, 746, 739, 732, 725, 718, 690, 662, 664, 667, 731, 795, 797, 798, 837, 875, 851, 828, 768, 709, 712, 715, 704, 692]
915F92m3m3J7J6J21J21Q1Q1o4o4n6n5OPLKk9k9kkN9O0N7N7m7m8k9l0L2L3onl7l7j2j2N0N0
911H95L7L7k5k5j8j8J3J3M3M3J2J2j5j4j5j5M3M4M3M3j9j9j9j9O2O1m2m2n9n8MMK2K2K2K3
906A076L3L4L3L4j1j1N2N2l4l4K9K9M9N0j3j3l9m0K3K2j8j8j8j8n2n2q3q2l6l6O7O8m6m7j5
902I35j6j6j6M7M6O1O1jjk7k7k7k8L8L8L8L8j7j7j7j6K5K5K6K5ONOOj5j4M7M8L2L2L2L2J2
897A406J2n1n1pqqqK7K8K7K7l4l3l4l4N2N2n2n2M7M7M6M7J5J4m8m8m5m5m6m5N7N6noL0K9L0
893A389K9N2N1N2N1L0K9L0K9N2N1j0j1K0K0K4K5O8J31R6qj1N2P2P3J0J0P2P3J05J05J05J05
889B971J25J26J88J88K79K80K79K79K93K94L56L56M03M03M37M99N57O62P52Q56J000J270J607
886A4460J961K389K992L757M650N698O758P377O982N678M367L951M181L585J235k192m875
$$ y = [692, 649, 606, 623, 639, 760, 881, 962, 1043, 979, 915, 859, 804, 810, 817, 820, 822, 793, 764, 762, 760, 819, 879, 936, 993, 946, 898, 869, 839, 871, 904, 898, 893, 856, 819, 807, 795, 845, 895, 932, 969, 944, 919, 901, 883, 896, 909, 952, 995, 1007, 1019, 1004, 990, 975, 960, 1003, 1047, 1090, 1133, 1114, 1095, 1076, 1057, 1119, 1180, 1138, 1096, 1037, 979, 983, 987, 1009, 1031, 1053, 1076, 1109, 1143, 1176, 1210, 1199, 1188, 1240, 1292, 1258, 1224, 1253, 1282, 1331, 1381, 1368, 1355, 1316, 1276, 1299, 1321, 1303, 1285, 1267, 1249, 1197, 1145, 1062, 980, 944, 908, 975, 1043, 997, 950, 935, 919, 903, 887, 934, 980, 1041, 1102, 1101, 1100, 1073, 1046, 1019, 991, 1029, 1067, 1105, 1143, 1126, 1109, 1092, 1076, 1101, 1126, 1152, 1177, 1183, 1188, 1194, 1200, 1185, 1171, 1218, 1266, 1298, 1330, 1362, 1394, 1406, 1418, 1367, 1316, 1309, 1301, 1293, 1285, 1312, 1340, 1367, 1394, 1360, 1327, 1293, 1259, 1311, 1363, 1311, 1259, 1306, 1353, 1399, 1446, 1461, 1475, 1427, 1379, 1334, 1289, 1243, 1198, 1255, 1311, 1306, 1300, 1330, 1359, 1389, 1418, 1470, 1521, 1573, 1624, 1654, 1683, 1713, 1742, 1794, 1845, 1835, 1824, 1844, 1864, 1888, 1913, 1981, 2112, 2208, 2200, 2189, 2241, 2313, 2386, 2396, 2406, 2478, 2551, 2656, 2761, 2866, 2971, 3096, 3222, 3410, 3598, 3877, 4157, 4436, 4715, 5008, 5302, 5658, 6014, 6417, 6820, 7257, 7756, 8313, 8975, 9727, 10583, 11583, 12853, 14460, 16421, 18810, 21802, 25559, 30209, 35907, 42665, 50042, 57024, 62702, 67069, 71020, 75201, 78786, 80021, 77829, 72954]
884G2954n700n242n106n813o925p300o650n361m100l060k286j662j118o61l44n3J53L61N67
882A2654N66N28M03L09L09J37j55n13q04r81r81j062j061j128j127j003q78o72n48m10k86
879C297k09k09j39j39j48j48q6q6l1l1l0l1p9p9K5K5Q5Q6j9j9K8K8R1R0k0k0M2M3J42J43J50
875B752J50K20L45M08M07K06kkln5k62n41o66n39l30j85j85j32j32k9k8%Jo2o2O0O1jkJ3J3
871A418q4q3l0R5K5K6j3j3j2j3K8K8K7K8R1R2R1R1J08J08J71J70J51J51L04L04M03N27P12
868D901R19J200J490J506J131L54l53q37r61r74q48n44mL68L69Q5l73p42r49j022q98o00l91
865B827k24j61j35j34j30j30n8n7n8n7n7n8n7n8j7j8j8j7N1N1N1N2L0L0R3R3J70J71J71J70
861B516K45K44L26L89M90O98Q14Q14O94O95O32O32O87O87P14O52N70M46M1m16o92o93n97p21
$$ y = [72954, 67254, 62012, 56906, 51093, 44168, 36868, 30218, 24857, 20757, 17697, 15411, 13749, 12631, 11970, 11626, 11573, 11726, 12087, 12654, 13220, 13748, 14151, 14460, 14769, 14906, 14751, 14238, 13434, 12453, 11472, 10410, 9349, 8221, 7094, 6091, 5213, 4541, 3993, 3583, 3297, 3088, 2879, 2740, 2601, 2453, 2305, 2219, 2133, 2102, 2071, 2041, 2010, 1931, 1852, 1877, 1902, 1987, 2073, 2054, 2035, 2063, 2091, 2182, 2272, 2252, 2232, 2274, 2317, 2459, 2602, 2752, 2902, 3122, 3467, 3875, 4282, 4488, 4486, 4484, 4481, 4426, 4164, 3623, 2957, 2418, 2088, 1903, 1718, 1586, 1454, 1425, 1397, 1397, 1398, 1336, 1274, 1334, 1395, 1394, 1392, 1405, 1418, 1334, 1251, 1221, 1316, 1341, 1367, 1354, 1341, 1329, 1316, 1344, 1372, 1399, 1427, 1518, 1610, 1701, 1792, 1900, 2008, 2179, 2349, 2500, 2651, 2955, 3259, 3662, 4189, 4901, 5820, 7020, 8510, 10016, 11147, 11501, 11148, 10311, 9350, 8376, 7528, 6984, 6980, 7348, 7717, 7802, 7429, 6687, 5738, 4716, 3818, 3218, 2827, 2603, 2442, 2307, 2173, 2043, 1913, 1855, 1798, 1740, 1683, 1626, 1568, 1511, 1453, 1436, 1418, 1400, 1383, 1434, 1485, 1536, 1588, 1618, 1648, 1741, 1834, 2004, 2175, 2346, 2516, 2761, 3005, 3331, 3720, 4210, 4908, 5722, 6536, 7230, 7925, 8557, 9189, 9876, 10563, 11277, 11929, 12499, 12945, 12986, 12570, 11878, 11185, 10588, 9867]
858I867r79j103j052p60m98l73m09n35o10m85l29k65k96k96j37j3l2r5j49q7J3J3J7J7P3P3
855A570l1l1k0k1M2M1P4P3P3P3J2J2P5P4J45J46K69L31L92O00P45O19L96L96O01Q09O86L11
852H462L8k6j07l16n97p22o68m59j17Qj94n69q50p89n48l40k59j97j03j04r9r9o3o3j26j25
849I68j8j8j8j8n7n7ONL7L6L7L6M7M7j6j5j4j5j4j4k7k6k6k6R7R7R8R7N5N6J31K55K93K92
844B311L50L49J63m5j52k8O8n8l38m63l73k49j39j39j00r9r9r9l2l1l2l2O0N9llr1r2J3J2
841F88K0J9K0J9M4M4o0n9k3k3L9L9kkkkK2K3K3K2M1M1k2k1n8n8M7M6m5m5m4m5j3j3m8J5Q2
836G09Q2j8j8mmmmk2k3k2k2k4k4P6P6K6l6l6K7J04J04L8k3JJO0O0RJ0OOj1p4p7j5oo8o4kL4
831H28L3k5k5l2l2l1l2PPn5n6M3M3M3M3O2O2%%M9M9K1m1j4j4j8j7M9M9N0M9P6P7J8J8L5R8
$$ y = [9867, 8888, 7785, 6733, 5973, 5475, 5102, 4693, 4158, 3548, 3063, 2734, 2469, 2173, 1877, 1740, 1727, 1695, 1600, 1451, 1364, 1377, 1390, 1407, 1424, 1497, 1570, 1539, 1508, 1488, 1467, 1509, 1550, 1624, 1697, 1770, 1843, 1855, 1867, 1942, 2016, 2161, 2307, 2576, 2907, 3299, 3899, 4644, 5263, 5659, 6055, 6656, 7465, 8151, 8462, 8500, 8474, 8367, 8051, 7454, 6732, 6064, 5605, 5488, 5496, 5302, 4733, 3883, 3094, 2546, 2206, 1947, 1750, 1647, 1543, 1444, 1345, 1282, 1219, 1093, 968, 950, 932, 914, 896, 839, 782, 788, 793, 830, 866, 903, 939, 986, 1033, 1017, 1002, 988, 973, 959, 945, 918, 892, 866, 840, 937, 1034, 1132, 1229, 1284, 1340, 1471, 1726, 2019, 2311, 2661, 3010, 3173, 3128, 2976, 2948, 3016, 2958, 2620, 2157, 1784, 1535, 1396, 1257, 1157, 1058, 959, 860, 828, 797, 765, 733, 793, 852, 849, 846, 755, 663, 676, 688, 708, 727, 747, 766, 810, 854, 794, 735, 712, 689, 728, 767, 765, 763, 761, 759, 781, 804, 827, 849, 890, 931, 909, 888, 830, 772, 819, 865, 820, 775, 731, 686, 673, 660, 612, 627, 709, 791, 773, 755, 751, 747, 743, 739, 717, 694, 672, 650, 626, 602, 678, 754, 780, 744, 708, 735, 839, 943, 981, 958, 959, 960, 1020, 1080, 1089, 1099, 1105, 1111, 1100, 1026, 949, 934, 928, 860, 796, 794, 828, 861, 836, 811, 779, 747, 716, 684, 691, 698, 643, 587, 630, 673, 716, 759, 821, 883, 883, 883, 932, 981, 1002, 961, 947, 933, 915, 898, 947, 996, 1046, 1095, 1171, 1248, 1266, 1284, 1319, 1417]
827A417R8L5j0j0j4j4m5m5m6m5j20j20n7n7K6K6K6K6KLKLLLo0o0p2p3j0j0k0j9k0k0O1O1O1
822I06O1M9N0K7l6l2L1N4N3rrJ9Q0J11J10J15J14L0L0O5Kp5p6p9q0p5p6j4j3p8p9p4p5n0J2
818I89M0L9J%J%N4N3M9N0l7r8o4M0R8L6k3k2M6J08J09M6J5J6J1J2K4K5K4K5L4L5L4L4OONO
813A827K0K1K1K0N0M9P6J39J31J31J34J35K20K21K27K27K59L64M57N19N74N74M72K42lj08
810F999j76j76l30m75n32m70l92l92m19l57k72k08j71j09q2q1j36j36k2M1M1k2l4l4l9l8q1
807A897q1n3QQPn2n1l5l4K8K8j2j2j1j2J3J4J4J3P0P0P3J2K8K9Q7Q8J39J40J44J44J82K45
803C128L56L55L71L71L31J86r4l65m89m88m32l69k76j72p9p9p2p3p7p7q1j8J3J3m1m1K9R1
800A921R2K9j3j2p9p8o1o1o1o1l3l3L0K9l4l3lkk7k8n8n8J1J2J2J2k3k3k2k3M6M7K3l9r6l4
$$ y = [1417, 1515, 1550, 1540, 1530, 1516, 1502, 1457, 1412, 1366, 1321, 1201, 1081, 1024, 967, 993, 1019, 1045, 1071, 1073, 1076, 1078, 1081, 1084, 1087, 1027, 967, 895, 822, 812, 802, 782, 763, 743, 723, 784, 845, 906, 967, 1016, 1066, 1093, 1057, 1025, 1056, 1110, 1163, 1154, 1145, 1164, 1244, 1355, 1465, 1580, 1694, 1724, 1754, 1819, 1821, 1746, 1670, 1591, 1511, 1436, 1360, 1346, 1333, 1255, 1176, 1102, 1027, 977, 989, 1029, 1068, 1069, 1069, 1070, 1070, 1124, 1177, 1226, 1276, 1239, 1141, 1077, 1117, 1215, 1251, 1228, 1206, 1252, 1360, 1469, 1515, 1530, 1546, 1557, 1569, 1593, 1618, 1642, 1667, 1701, 1736, 1770, 1804, 1810, 1816, 1821, 1827, 1847, 1868, 1889, 1909, 1959, 2008, 2084, 2223, 2354, 2485, 2619, 2754, 2974, 3195, 3422, 3649, 3908, 4272, 4729, 5248, 5822, 6396, 6868, 7110, 7107, 6999, 6823, 6647, 6317, 5842, 5310, 4840, 4448, 4056, 3637, 3280, 3008, 2800, 2629, 2520, 2438, 2357, 2221, 2085, 2063, 2104, 2145, 2123, 2089, 2055, 2016, 1978, 1897, 1816, 1763, 1771, 1779, 1786, 1734, 1683, 1648, 1614, 1642, 1670, 1658, 1646, 1635, 1623, 1636, 1650, 1664, 1677, 1747, 1817, 1890, 1902, 1930, 1959, 2046, 2134, 2273, 2413, 2557, 2701, 2883, 3128, 3484, 3839, 4210, 4581, 4912, 5098, 5004, 4639, 4150, 3662, 3230, 2861, 2585, 2413, 2334, 2255, 2183, 2110, 2033, 1956, 1875, 1857, 1870, 1883, 1842, 1801, 1830, 1921, 2013, 2042, 2029, 2017, 1938, 1860, 1799, 1738, 1677, 1616, 1583, 1550, 1580, 1609, 1575, 1542, 1539, 1537, 1510, 1482, 1424, 1366, 1377, 1389, 1401, 1413, 1390, 1367, 1345, 1322, 1368, 1415, 1438, 1399, 1303, 1269]
795A269P0O9K6l7l2l3MLLLj1j2j1j2L8L8k4k5m6m6N2N1Mj01q1j9L4k8n2n2N1N2K0K0M3M2M2
791A312M3P1P2Lo0k1k1k5k4m3m3m3m3L5L5k7k8nnl3l2OO8M0k1l4K8R0Q9J4m8m4m4M3M2M2o1
786A328j25o3M2M1l6l7rN3P8P8J9J9l8l8qpN8N8mmj8j9m9n0j2j2l5r8p9j6M9M8k1k1j7j7R
782A047P1L6L7K5K6K5K6q1q1j13n0k5L7J05J06P8J6j1j1K9K9k9k9m5J8M5M5k2k2k2k2J6J6
777A270J6J6j7j8j7j7n1n2m7m7K0Q3Q2K0m9m9N4J17Q5K2m2m2l8l7K6K5L5L5L4L5jkjkk6k6
773A394L7L6opooj5j5j5j5K0K0K0K0p6p6j2N1J9m4m0K2N8N8l9l8J8P9M5M5j8j7RP2R3R3R3
769A857R3K9l4KJk8k9r0r1o4o5l7K5K5K6l3l4l8l9p3j1P3P4k7k7L0K9L0K9J5J5J6J5J8J8K2
764A722K2K1Q3Q3K1l3l2j0N4O4O5Mn8m1K2M5M5j8j7j7j8o6o5l9K4K4K4Mn8l8K4j5j6o0o1n7
$$ y = [1269, 1339, 1408, 1434, 1397, 1365, 1332, 1336, 1339, 1342, 1345, 1334, 1322, 1311, 1299, 1337, 1375, 1351, 1326, 1280, 1234, 1286, 1337, 1341, 1240, 1159, 1140, 1174, 1146, 1094, 1042, 1093, 1145, 1165, 1185, 1228, 1270, 1312, 1355, 1426, 1498, 1501, 1441, 1420, 1399, 1374, 1350, 1307, 1264, 1221, 1178, 1213, 1248, 1221, 1193, 1188, 1183, 1150, 1118, 1124, 1192, 1232, 1211, 1177, 1205, 1295, 1384, 1398, 1350, 1306, 1262, 1305, 1347, 1389, 1328, 1203, 1140, 1182, 1223, 1187, 1150, 1141, 1194, 1272, 1350, 1369, 1388, 1350, 1312, 1304, 1297, 1355, 1413, 1409, 1405, 1387, 1368, 1319, 1269, 1257, 1245, 1210, 1112, 1033, 1017, 1066, 1114, 1093, 1072, 1055, 1038, 1047, 1118, 1154, 1191, 1216, 1242, 1267, 1293, 1212, 1131, 1018, 968, 943, 980, 1085, 1191, 1269, 1285, 1274, 1263, 1292, 1321, 1292, 1263, 1218, 1236, 1281, 1326, 1304, 1282, 1260, 1238, 1254, 1270, 1286, 1302, 1285, 1267, 1250, 1233, 1182, 1130, 1083, 1036, 1056, 1139, 1221, 1241, 1192, 1143, 1197, 1314, 1399, 1421, 1379, 1337, 1299, 1262, 1288, 1313, 1348, 1383, 1417, 1452, 1451, 1449, 1448, 1446, 1420, 1394, 1431, 1467, 1461, 1454, 1448, 1442, 1427, 1412, 1397, 1382, 1402, 1422, 1442, 1462, 1386, 1310, 1298, 1349, 1368, 1324, 1284, 1306, 1364, 1422, 1383, 1345, 1363, 1442, 1487, 1532, 1514, 1497, 1506, 1578, 1671, 1764, 1857, 1950, 1979, 1945, 1947, 1948, 1920, 1891, 1801, 1710, 1646, 1581, 1544, 1569, 1594, 1620, 1587, 1553, 1515, 1476, 1403, 1392, 1465, 1539, 1512, 1485, 1515, 1544, 1574, 1603, 1618, 1633, 1649, 1664, 1682, 1700, 1722, 1744, 1765, 1848, 1931, 1952, 1919, 1887, 1877, 1931, 1995, 2060, 2064, 2006, 1965, 1987, 2032, 2077, 2059, 2042, 2025, 2007, 1941, 1876, 1837, 1861, 1885, 1909, 1913, 1855, 1817, 1841, 1826, 1810, 1750, 1689, 1632]
760A632n6m0K3N1N0ppN6N5k2k2J23J23L7L8L7L7k1k1k2k1k1k1M1M1K4K4l8l8R4R4O1o5q7q8
755B044l3l3K4K4Q7Q6j8j8q0q0j8j8j8j8J4J4J4J3L3L2L2L2j0rrj0j05j06j05j06POPPlkl
751A674kM2M3J06J05M2M1M2M1J7J6J7J6m7m7m8m7j3j4R0R1M1M1M1M1n9n8Q7Q7N5N4m9n0o6
747B330o7mmP1P2P1P1P1P0O2O3K7r7j31j31r5r5r5r5P1P2P1P1k7k8K7K7N0p5j04j04oN7N6
743B252nk2k1k5k5J9K0l9l9lN8Q6Q6NNONK2K2K2K2k7k7k7k7mmlmM5M5M5M5OOPOJ1J2J1J2M
738B583MMLn5n5n5n6J1J0n2n2j6j6J5J5oopoNNMNP9P9P9P9j1j0M8M8M1k2q7q7l6K8N4N4qq
733B602l9l9k8k8jjk6q8n8NK8K7k8k7K5Q8Q8K5J1J1PPM8M7M4M3M0k3j29j30m6J6M4M3K6K6
728B610K6K6L9L9L9L9l9l8j01j01k7k7k6k7N5N6N6N6k1k0J1J1L5L4k7k8OOO7J29J56L2q3j46
$$ y = [1632, 1576, 1536, 1559, 1610, 1660, 1653, 1646, 1702, 1757, 1735, 1713, 1836, 1959, 1996, 2034, 2071, 2108, 2087, 2066, 2044, 2023, 2002, 1981, 2022, 2063, 2087, 2111, 2073, 2035, 2129, 2223, 2284, 2219, 2132, 2044, 2011, 1978, 2002, 2026, 2113, 2199, 2181, 2163, 2083, 2003, 1985, 1967, 1949, 1931, 1945, 1959, 1973, 1986, 2019, 2051, 2083, 2115, 2105, 2096, 2087, 2077, 1972, 1866, 1761, 1655, 1662, 1668, 1675, 1682, 1679, 1677, 1674, 1672, 1714, 1757, 1863, 1968, 2010, 2051, 2093, 2134, 2151, 2167, 2184, 2200, 2153, 2106, 2058, 2011, 1998, 1984, 2074, 2165, 2206, 2247, 2288, 2329, 2270, 2212, 2299, 2386, 2441, 2495, 2446, 2396, 2330, 2263, 2259, 2255, 2326, 2398, 2469, 2540, 2611, 2681, 2743, 2806, 2833, 2736, 2605, 2474, 2379, 2284, 2189, 2094, 2165, 2237, 2308, 2379, 2352, 2324, 2351, 2378, 2428, 2353, 2249, 2145, 2139, 2196, 2252, 2247, 2225, 2204, 2179, 2154, 2173, 2193, 2154, 2115, 2112, 2170, 2256, 2342, 2347, 2352, 2358, 2363, 2385, 2407, 2429, 2451, 2424, 2397, 2370, 2343, 2339, 2335, 2332, 2328, 2373, 2418, 2463, 2508, 2514, 2520, 2527, 2533, 2544, 2556, 2567, 2579, 2583, 2587, 2591, 2594, 2539, 2484, 2429, 2373, 2384, 2394, 2342, 2290, 2274, 2258, 2273, 2288, 2282, 2276, 2269, 2263, 2268, 2273, 2277, 2282, 2361, 2440, 2519, 2598, 2587, 2577, 2625, 2673, 2714, 2692, 2605, 2518, 2482, 2510, 2564, 2618, 2610, 2602, 2563, 2524, 2496, 2468, 2467, 2466, 2440, 2352, 2294, 2299, 2327, 2354, 2326, 2299, 2324, 2412, 2500, 2525, 2536, 2547, 2554, 2561, 2609, 2656, 2700, 2743, 2783, 2760, 2631, 2501, 2455, 2471, 2515, 2558, 2584, 2610, 2636, 2662, 2701, 2740, 2779, 2818, 2779, 2741, 2640, 2539, 2512, 2485, 2459, 2432, 2487, 2543, 2599, 2655, 2634, 2614, 2625, 2636, 2671, 2705, 2678, 2650, 2656, 2662, 2729, 2858, 3014, 3046, 2963, 2817]
724B817j17n5l1l1LKL4L4r2r1n8O7J05J05RRJ20J19J20J19Q5Q5R7k8o3jJ42K05J69M4k8k7
720C868rj0rrj26j26j26j26n0n1n0n1L4L3L4L4qpN5N5P7P6J08J08PPk4k5L8L8O9O9R4R4K06
716D297K05J77L02M54N16M55K47R8R7J29J29K11K73M46O54Q63R88J251J876K515K390J096
713A9669o09j693j694j093p18p55q80r42r42q25n34j98R3L74N81Q88J263J608J609J320J028
710A7550R38J146J101N61k09o66p38o13n67n67n90n90n85m60k24j5R6R6lj27j98J1N92J216
708A7155J679K136K620L243M003N042O005N713L000j450n328o950o275m736l424k551j865
705A8017j325q77l36K38O95R74R74P76M02J18J19L60N69M77K70P4n0j46j46n6j80o46j187
703A9114j405j281j175j300j463j400j161p86m63q8J43L51N35P43R10R09Q55P30O05P30J084
$$ y = [2817, 2700, 2645, 2614, 2583, 2586, 2588, 2622, 2656, 2564, 2473, 2415, 2482, 2587, 2692, 2701, 2710, 2830, 2949, 3069, 3188, 3273, 3358, 3455, 3427, 3364, 3363, 3505, 3710, 3879, 3923, 3895, 3868, 3859, 3849, 3840, 3831, 3705, 3579, 3453, 3327, 3277, 3226, 3176, 3125, 3159, 3192, 3226, 3260, 3252, 3245, 3300, 3355, 3432, 3508, 3616, 3724, 3731, 3738, 3714, 3689, 3727, 3765, 3834, 3903, 3997, 4091, 4297, 4502, 4679, 4981, 5435, 5951, 6406, 6653, 6751, 6848, 6977, 7106, 7317, 7590, 8036, 8690, 9553, 10541, 11792, 13668, 16183, 18573, 19669, 19060, 17367, 15673, 14580, 13862, 13107, 12227, 11285, 10343, 9518, 8984, 8786, 8879, 9253, 9834, 10722, 11985, 13593, 15202, 16522, 17550, 18488, 19634, 20735, 21296, 21087, 20421, 19683, 19070, 18503, 17936, 17346, 16756, 16171, 15711, 15487, 15472, 15568, 15664, 15661, 15534, 15336, 15347, 15939, 17155, 18834, 20970, 23590, 26833, 30836, 35878, 41883, 47596, 50596, 49146, 43818, 36868, 30593, 25857, 22433, 19882, 18017, 16692, 15815, 15479, 15717, 16412, 17386, 18360, 19136, 19538, 19656, 19775, 20135, 20704, 21181, 21451, 21525, 21475, 21329, 21183, 21127, 20947, 20301, 19114, 17709, 16428, 15253, 13953, 12490, 11090, 9929, 9143, 8680, 8592, 8735, 9086, 9621, 10364, 11274, 12183, 13038, 13768, 14373, 15103, 16187]
700A6187J457J059l14j879k585k243j452q24n32l90j83J29L38N71O96P89O65M06L1l38n47
698A1041o52p15q01r27q72p48o18m94l65k42j95j96k01j39p0p0p5p5p6p5k4k5LO5Q3Q2k1q3
694C515n2RQ1J44J49J50J22J22J47J47J01kj02j02n2N3J95L82M63M64L40K37J77L3k05l91
691F125m82m82m49m48l99k96j82j20q7q6p5p6p9j7K1K1K4K5MLn8n9l3l3kkL7L6OOmnj04j05
687B625q1j8k3k2L3L3k2k3NJ10J92J92J27O3L0l2p8p8j46k09j89j25o1o1K6K6K9l2j23j22
683B046k3k2m0m1m4J7M4M3j5j6J0J0j3p6r3l0Q2J45R8R8M0M0j4j4j18j17%J%JJ3J4P6P6m5
679B133m5j43j42r8PR3R4j6j6j5j6J1J2n1n1n5n5QPN1N1j2j1L3L4L4L4J0J0r4r4p2p2L3L2
675A629j0j1N3N2R2R3L0L0q7q8q7q8RRRQk6k6L6L6L0L0K9L0k3k4k3k3L6L7k6k6MNn8n8N4N4
$$ y = [16187, 17644, 18703, 18389, 16510, 13925, 11682, 10230, 9406, 8874, 8484, 8301, 8430, 8768, 9339, 10035, 10824, 11489, 11895, 11926, 11588, 11041, 10389, 9674, 8873, 7946, 7074, 6326, 5708, 5214, 4849, 4607, 4412, 4216, 4015, 3876, 3806, 3736, 3661, 3586, 3510, 3435, 3411, 3386, 3389, 3454, 3537, 3619, 3598, 3515, 3463, 3472, 3553, 3697, 3846, 3996, 4118, 4240, 4387, 4534, 4635, 4633, 4531, 4429, 4377, 4430, 4625, 5007, 5470, 5934, 6274, 6511, 6688, 6721, 6516, 6125, 5643, 5161, 4712, 4264, 3865, 3569, 3387, 3267, 3180, 3094, 3019, 2943, 2864, 2847, 2868, 2889, 2913, 2938, 2942, 2945, 2887, 2828, 2795, 2762, 2760, 2758, 2795, 2831, 2837, 2843, 2839, 2834, 2730, 2625, 2544, 2526, 2503, 2481, 2514, 2547, 2525, 2502, 2507, 2617, 2809, 3001, 3128, 3191, 3221, 3189, 3111, 3033, 2887, 2678, 2489, 2364, 2303, 2242, 2268, 2294, 2323, 2291, 2168, 2046, 2023, 2001, 1961, 1920, 1876, 1893, 1937, 1980, 1965, 1949, 1959, 1969, 1956, 1880, 1787, 1757, 1839, 1984, 2082, 2180, 2220, 2260, 2246, 2232, 2114, 1997, 1997, 1998, 1998, 1999, 2012, 2026, 2102, 2178, 2133, 2088, 1945, 1803, 1705, 1712, 1805, 1899, 1883, 1867, 1852, 1836, 1847, 1859, 1808, 1757, 1702, 1647, 1655, 1662, 1713, 1764, 1752, 1741, 1774, 1808, 1842, 1876, 1886, 1896, 1802, 1708, 1636, 1564, 1597, 1629, 1619, 1608, 1661, 1713, 1805, 1898, 1928, 1958, 1871, 1783, 1696, 1608, 1617, 1626, 1635, 1643, 1617, 1591, 1627, 1663, 1693, 1723, 1752, 1782, 1759, 1735, 1712, 1689, 1725, 1762, 1736, 1710, 1714, 1719, 1661, 1603, 1657, 1711]
670A711N3N4rrrrn7n7NNK8K7K8K7L2L1L2L1l4l4l4l4l7l6K6K5l0l1L2L2j8j7j8j8k2k2k2k2
665A600n7n7NOJ9K0J9J9%%%%JJKJn8n9n8n9L8L7L8L7M9M9j6p8m8J5P9Q0K2K2K3K2n0n0J3J3
660A640l2l2o6mLMQPJ6J5J1J2M6j6j6M6L2L2L5L6N0M9j3j3p9p9q0p9J6J6K0K0K5Q7N3N2K7
656A849K8%o2o7o7rrm0m1K2K2kjkkJ3J2J3J2J%JJk7k6P3P4K7l6l9K2Nn7j16n3j3j3j0rK0K0
651A514K1K0k6k5k5k5l9l8K4K3K8K8l1l0j2N2P4P4L5k9n5n6PPPPmnnmM4M4M4M4KJL3L3n4n5
646A648MLl0r2o1JL2L3k6k6qpppl9l9l9l9N7N7N7N7J1J0J0J1l9l8p0o9j5j5M4M4O9OJ0J0P1
641A579P0RQO6O6K5q0j04m2K0K1JKl0l0r0r1k2M1P5P5J7J7k9k8nN7M5j6m1m0j8j8j7j8L7L8
637A550M1k1l3l2O3O4N2j1l9l8q4q3j9M4O8OJ3J3L5L6o9o9l0l1l0l0L7L7L7L7N5N5N9mq8q9
$$ y = [1711, 1764, 1818, 1809, 1800, 1791, 1782, 1725, 1668, 1673, 1678, 1706, 1733, 1761, 1788, 1820, 1851, 1883, 1914, 1880, 1846, 1812, 1778, 1741, 1705, 1731, 1756, 1726, 1695, 1727, 1759, 1741, 1724, 1706, 1688, 1666, 1644, 1622, 1600, 1543, 1486, 1491, 1497, 1516, 1536, 1555, 1574, 1574, 1574, 1574, 1574, 1575, 1576, 1578, 1579, 1521, 1462, 1404, 1345, 1383, 1420, 1458, 1495, 1544, 1593, 1577, 1499, 1451, 1466, 1545, 1625, 1647, 1669, 1692, 1714, 1664, 1614, 1627, 1640, 1608, 1576, 1510, 1506, 1509, 1513, 1521, 1528, 1544, 1559, 1570, 1582, 1628, 1612, 1596, 1642, 1674, 1706, 1741, 1777, 1827, 1876, 1863, 1850, 1771, 1692, 1612, 1533, 1549, 1565, 1585, 1605, 1630, 1717, 1770, 1822, 1849, 1877, 1877, 1815, 1748, 1681, 1672, 1663, 1623, 1582, 1604, 1626, 1624, 1623, 1621, 1619, 1632, 1644, 1657, 1669, 1670, 1670, 1671, 1672, 1645, 1619, 1692, 1766, 1793, 1757, 1718, 1740, 1745, 1688, 1572, 1519, 1506, 1493, 1483, 1474, 1494, 1514, 1535, 1555, 1529, 1504, 1479, 1454, 1415, 1377, 1401, 1424, 1452, 1480, 1449, 1419, 1407, 1459, 1533, 1607, 1642, 1613, 1558, 1502, 1509, 1516, 1523, 1530, 1526, 1521, 1516, 1512, 1556, 1600, 1644, 1688, 1690, 1691, 1724, 1757, 1703, 1648, 1652, 1655, 1625, 1533, 1472, 1473, 1505, 1538, 1512, 1486, 1478, 1471, 1464, 1457, 1418, 1379, 1340, 1301, 1358, 1415, 1472, 1529, 1540, 1550, 1560, 1571, 1532, 1494, 1424, 1355, 1340, 1325, 1369, 1413, 1482, 1488, 1498, 1508, 1579, 1649, 1658, 1666, 1732, 1798, 1823, 1743, 1639, 1597, 1617, 1638, 1639, 1641, 1611, 1581, 1491, 1400, 1378, 1419, 1494, 1569, 1586, 1603, 1574, 1546, 1541, 1598, 1643, 1627, 1586, 1546, 1528, 1510, 1493, 1475, 1512, 1550, 1591, 1570, 1537, 1505, 1568, 1632, 1684, 1673, 1634, 1596, 1512, 1429, 1410, 1454, 1522, 1528, 1541, 1554, 1589, 1625, 1556, 1487, 1457, 1426, 1396, 1366, 1403, 1440, 1477, 1514, 1569, 1624, 1683, 1679, 1591, 1502]
632A502o5lQ2Q2Q9K7j9k0k3k3k4k3k4k3j2j2J9K0K3K4l8l9l8l7l4l4L9J01O6O6K7K8K7K7j8
628A740j9q0q1k1k1k0k1NNONL7L6J4m9m6J8Q2Q2O2O1mo6n5PL0L0l8l8K4K4K3K3Q2Q2K4l8k
623A903lRRRRj4j4M4M5mo7o2M1P2Rj1j1K2K2K2K2J9K0J9J9J6J5J6J5O5O4OOnN6Q0Q0oo8p3
618B396j0j9q1j01j01M7J10P5P4rj0j0rL0L1k8k8MO6O3O2J3J3J4J3n4n4N3J15P3J0m8J4N5
614B769N4N9N8Q6Q5K3K3J12J11N3N3R0J52J53R0O1O2J20J20Q5Q5Q5Q5J60J60J96J33K3K4j5
611E355M7Q0Q1Q5Q4J29J28J56K19K20K21J63J62J78J78M9n5n8n7o4o4o3o2j25j25j04j03o8
607F587o9o9qK4K4K6Q9J22J84K32K32K98K99L72L72L62K58J19J4j21k67l12l11k58k58j92
604G749j91j29j29o8o7l6K6Q2J45J79J17P3P2J27J27J36P3k0j24j32j31j34j96k08k08k08
$$ y = [1502, 1437, 1434, 1516, 1598, 1687, 1714, 1695, 1675, 1652, 1629, 1605, 1582, 1558, 1535, 1523, 1511, 1530, 1550, 1573, 1597, 1559, 1520, 1482, 1445, 1411, 1377, 1416, 1517, 1583, 1649, 1676, 1704, 1731, 1758, 1740, 1721, 1641, 1560, 1539, 1518, 1498, 1477, 1482, 1487, 1493, 1498, 1535, 1571, 1585, 1536, 1490, 1508, 1590, 1672, 1734, 1795, 1791, 1725, 1670, 1677, 1707, 1737, 1699, 1661, 1685, 1709, 1732, 1755, 1837, 1919, 1943, 1905, 1903, 1900, 1909, 1918, 1927, 1936, 1922, 1908, 1952, 1997, 1993, 1926, 1864, 1905, 1977, 1986, 1975, 1964, 1986, 2008, 2030, 2052, 2071, 2091, 2110, 2129, 2145, 2160, 2176, 2191, 2256, 2320, 2326, 2332, 2327, 2383, 2463, 2543, 2537, 2469, 2396, 2386, 2367, 2286, 2185, 2084, 2131, 2241, 2316, 2390, 2381, 2371, 2361, 2352, 2382, 2413, 2385, 2357, 2361, 2427, 2490, 2552, 2565, 2578, 2592, 2605, 2551, 2497, 2550, 2665, 2738, 2748, 2700, 2714, 2769, 2823, 2882, 2940, 3026, 3111, 3134, 3157, 3269, 3380, 3433, 3486, 3576, 3728, 3881, 3971, 4032, 4094, 4214, 4334, 4419, 4504, 4589, 4674, 4834, 4994, 5190, 5323, 5346, 5370, 5355, 5402, 5482, 5563, 5648, 5732, 5861, 5989, 6145, 6364, 6584, 6805, 6968, 7130, 7308, 7486, 7535, 7480, 7422, 7365, 7301, 7237, 7174, 7112, 6987, 6862, 6758, 6655, 6587, 6518, 6449, 6441, 6465, 6489, 6515, 6604, 6726, 6910, 7142, 7374, 7672, 7971, 8343, 8715, 9077, 9335, 9454, 9468, 9347, 9080, 8768, 8457, 8199, 7941, 7749, 7558, 7429, 7300, 7232, 7165, 7129, 7155, 7237, 7382, 7561, 7678, 7751, 7823, 7950, 8077, 8213, 8286, 8266, 8142, 8010, 7879, 7745, 7549, 7341, 7133, 6925]
601F925k08k18j55q7q6o9o8o8o8p6p5o7j30j28o5mlj39k01j65o2m7j09j30j30n3n2p5j38j35
597C914p3m9m9k5k5L7L7m2m3p3p4q1q0q1q1J1J2J1J2pqJo2p0pN7N8L1L2%Jm8m8m7m8J4J4r
593C112p2q3k2L8k5o0n9l2l2m9m9N5N5KLKLl4l4K9K9RQRQJ%L2L1m1m0j7M5jo4o0LJ2J1J6J6
587B755J7J6j8M4L4L4L7L8M8M8j4j4N6N6pop6p6p7p6L9L8L8L8K2K2m0m0n6n6M8M8l4l4l4l5
583B783k7k8k7k8lllkL6L6L6L6ooook3k3k3k3J4J5m8m8k0j9M3M3J4J4J4J3RRn4n4K4K4K4K4
578B731j0j0p2p2m5m4m5m5k5k5k5k5KJKKJKO4O4L6L7k6k6p3p3j0j1N9N8m6m6o3o3o3o2n0m9
574A955N4N5K0K1K1K1J6J7m5m6RRRRM8M9j4j4j22j22k2k2o8j30n3N1R2L0NNPn4n5QR5R4nn
569A923N6N5L3l0m8J4J4m8p9j7M8M9J0J1n2n2p8p9p8p9kkkkm4m4m4m4K6K6K6K6K0J9K0K0n9
$$ y = [6925, 6717, 6499, 6344, 6257, 6171, 6102, 6034, 5966, 5898, 5822, 5747, 5680, 5550, 5422, 5357, 5353, 5350, 5211, 5010, 4845, 4783, 4736, 4627, 4497, 4367, 4314, 4262, 4187, 4049, 3914, 3841, 3792, 3743, 3718, 3693, 3730, 3767, 3725, 3682, 3609, 3535, 3454, 3374, 3293, 3212, 3223, 3235, 3246, 3258, 3251, 3243, 3244, 3182, 3112, 3105, 3162, 3220, 3251, 3283, 3283, 3284, 3236, 3188, 3141, 3093, 3107, 3121, 3112, 3040, 2957, 2935, 2973, 2948, 2888, 2829, 2797, 2765, 2716, 2667, 2722, 2777, 2779, 2782, 2784, 2787, 2753, 2719, 2748, 2777, 2786, 2794, 2803, 2811, 2812, 2812, 2844, 2875, 2834, 2794, 2777, 2822, 2821, 2757, 2697, 2700, 2712, 2723, 2739, 2755, 2772, 2788, 2770, 2814, 2848, 2882, 2919, 2957, 3005, 3053, 3039, 3025, 3081, 3137, 3130, 3124, 3048, 2972, 2895, 2819, 2858, 2896, 2934, 2972, 2994, 3016, 2976, 2936, 2880, 2824, 2872, 2920, 2886, 2852, 2818, 2783, 2756, 2728, 2701, 2673, 2670, 2667, 2664, 2662, 2698, 2734, 2770, 2806, 2800, 2794, 2788, 2782, 2759, 2736, 2713, 2690, 2704, 2719, 2671, 2623, 2603, 2584, 2627, 2670, 2684, 2698, 2712, 2725, 2734, 2743, 2689, 2635, 2659, 2683, 2707, 2731, 2721, 2711, 2639, 2567, 2522, 2478, 2433, 2388, 2363, 2338, 2313, 2288, 2290, 2291, 2293, 2295, 2296, 2298, 2362, 2426, 2462, 2499, 2473, 2447, 2374, 2301, 2291, 2280, 2339, 2397, 2351, 2305, 2242, 2179, 2116, 2054, 2004, 1955, 2009, 2064, 2084, 2105, 2126, 2147, 2163, 2180, 2135, 2089, 2098, 2107, 2116, 2125, 2173, 2222, 2208, 2194, 2072, 1950, 1928, 1906, 1838, 1708, 1655, 1706, 1798, 1828, 1833, 1838, 1845, 1791, 1736, 1744, 1839, 1933, 1928, 1923, 1979, 2034, 2067, 2037, 1989, 2003, 2017, 1969, 1890, 1873, 1921, 1970, 1980, 1991, 1939, 1887, 1809, 1730, 1652, 1573, 1571, 1569, 1567, 1565, 1521, 1477, 1433, 1389, 1415, 1441, 1467, 1493, 1513, 1532, 1552, 1572, 1513]
564A513n8MML4L3k5k5LO6P0Pk9L3L0l3r2r1QRK8K8K9K8l6l7O7O8K2K1K2K2k6k6L6L6o9p0m1
560A563K0MLMLj9q2q2j9rrm1K2P3P2J4J4J2J1J1J2L7L7k6k5n0n0k7L6Rn4m9J2L6L6M0M0N6
555A635N6m8m8k8k8k9k8K8K8K9K8opo3o2J8J22J18J4l4r6j03m1RRJ3J3l7l6l7l6j9j8j8j8
551A280Q7Q8O0lk6k6L2L2o1o1l4K8J9J8K2K3LLKLk7k8k8k7OOOOJ5J5J5J5M2M2k0k0k2k3k3
546A439k2N7N6qp1j3M8M5j7m4m3N6N7O2O2O2O3j9j8NO7N5pp3p2l2l2l2l3j2j2j2j3l4l5l4
542A446l4K7K8l5l4rqrrk2k2JO3R6L4l2l1M8M9j4j4%J%%m0m0J05J05mmmlO3O3%JM3M4M4M3
537A936j1j2j1j1OPPPm2m2m1m2k9k8k9k9j4j4j4j4M1M0M1M0MLMLm9n0J2J3kllkL0K9L0L0m
532A787mmnj5j6j6j6Q8Q9K6K6J7J7J7J7O1O2O2O2mlllrrrrL1L1L1L2k1k0q3q2L1L2l1l0NN
$$ y = [1513, 1455, 1459, 1463, 1497, 1530, 1505, 1480, 1483, 1549, 1619, 1626, 1597, 1630, 1660, 1627, 1535, 1444, 1452, 1461, 1489, 1517, 1546, 1574, 1538, 1501, 1568, 1636, 1658, 1679, 1701, 1723, 1697, 1671, 1707, 1743, 1674, 1604, 1563, 1583, 1587, 1590, 1594, 1597, 1578, 1496, 1414, 1395, 1386, 1377, 1336, 1358, 1431, 1503, 1517, 1531, 1543, 1554, 1565, 1577, 1614, 1651, 1625, 1600, 1550, 1500, 1473, 1509, 1518, 1464, 1415, 1427, 1463, 1499, 1539, 1579, 1635, 1691, 1643, 1595, 1567, 1539, 1510, 1482, 1510, 1538, 1567, 1595, 1589, 1582, 1519, 1457, 1475, 1597, 1715, 1729, 1695, 1599, 1496, 1455, 1464, 1473, 1486, 1499, 1462, 1426, 1389, 1353, 1334, 1316, 1298, 1280, 1367, 1455, 1515, 1512, 1486, 1460, 1492, 1524, 1463, 1402, 1368, 1396, 1415, 1433, 1455, 1478, 1481, 1484, 1486, 1489, 1462, 1434, 1406, 1379, 1385, 1391, 1397, 1403, 1418, 1433, 1448, 1463, 1505, 1547, 1527, 1507, 1485, 1462, 1439, 1417, 1474, 1530, 1522, 1451, 1438, 1486, 1531, 1514, 1470, 1427, 1483, 1540, 1602, 1664, 1726, 1789, 1770, 1752, 1757, 1824, 1879, 1872, 1799, 1727, 1695, 1663, 1631, 1598, 1586, 1574, 1562, 1549, 1515, 1480, 1446, 1412, 1439, 1467, 1432, 1398, 1389, 1381, 1372, 1363, 1341, 1319, 1320, 1383, 1479, 1513, 1481, 1450, 1498, 1547, 1533, 1519, 1519, 1520, 1520, 1520, 1480, 1440, 1545, 1650, 1646, 1642, 1638, 1635, 1698, 1761, 1761, 1762, 1805, 1849, 1893, 1936, 1925, 1913, 1902, 1891, 1897, 1904, 1911, 1918, 1876, 1834, 1793, 1751, 1722, 1694, 1665, 1636, 1622, 1608, 1594, 1580, 1621, 1661, 1702, 1742, 1746, 1749, 1753, 1756, 1707, 1657, 1669, 1682, 1680, 1677, 1674, 1672, 1702, 1731, 1761, 1791, 1787, 1783, 1779, 1774, 1759, 1743, 1727, 1711, 1799, 1888, 1914, 1940, 1957, 1974, 1991, 2008, 2069, 2131, 2193, 2255, 2251, 2248, 2245, 2242, 2233, 2224, 2215, 2206, 2237, 2268, 2299, 2331, 2310, 2290, 2207, 2125, 2156, 2188, 2157, 2127, 2132, 2137]
527B137NNn7n8ONK7K8K8K8j3j3o7o7m7P7J12J11j4j3j4j3K8K9K8K9k5k5M0J03J14N3j3j3K6
522B567K5jkL7J01O4l9p6j3Q4Q3K1q3o0LK2K3l6l5n6n5k5k4RQn3n4m2m3K0K0j8j8J0P1Q0Q0
518B595K1K1j8j8j8j8J7J6J7J7M4M4j9j8M2M2M2M2l9m0m0m0M0L9M0L9L4L3M1k1n1J1P6P6j5
514C034j5j5j6J1J0M1M2l5l5j2N0O3JQRk7k8mN9J05M3k2k2K5K4l7l8qpqpJ7J7P5P6O1jo4j
509C369N3N3K5K6N2N2N3N2L9L9L8L9K2K2M6J08J29O7L7k5l8l8j0j1J2J2J2J2N3N2N2N2M5M4
505D545M5M4N6N6N6N6N3N3rrm7m7N9J22J29O6M3M2R5R5R5R5J37J38J38J37J27J27J27J27J64
501F915J65J32J33K05K04K67K67K34K33J95K57K73K10K14K76L98L99M06M06N46O08N76N77
498A4096O05O68P04P03Q38R82J005J005R56R55Q83Q20P52O90N02K33p5l45o04q34r65j028
$$ y = [2137, 2142, 2147, 2090, 2032, 2038, 2043, 2070, 2098, 2126, 2154, 2141, 2128, 2061, 1994, 1947, 2024, 2136, 2247, 2233, 2220, 2206, 2193, 2221, 2250, 2278, 2307, 2282, 2257, 2297, 2400, 2514, 2567, 2554, 2541, 2567, 2592, 2591, 2589, 2626, 2727, 2791, 2752, 2676, 2663, 2747, 2830, 2851, 2768, 2708, 2711, 2733, 2756, 2720, 2685, 2629, 2574, 2549, 2525, 2534, 2542, 2489, 2435, 2393, 2350, 2370, 2390, 2372, 2354, 2364, 2435, 2515, 2595, 2616, 2637, 2619, 2601, 2583, 2565, 2582, 2598, 2615, 2632, 2676, 2720, 2701, 2683, 2725, 2767, 2809, 2851, 2812, 2772, 2732, 2692, 2732, 2771, 2811, 2850, 2884, 2917, 2958, 2937, 2886, 2897, 2973, 3049, 3034, 3019, 3004, 2988, 2999, 3009, 3050, 3092, 3057, 3022, 3010, 3060, 3123, 3124, 3132, 3141, 3114, 3086, 3082, 3141, 3246, 3289, 3267, 3245, 3270, 3294, 3257, 3219, 3211, 3204, 3196, 3189, 3206, 3223, 3298, 3374, 3435, 3434, 3370, 3369, 3422, 3475, 3500, 3526, 3578, 3630, 3683, 3735, 3774, 3813, 3851, 3890, 3912, 3934, 3980, 4088, 4217, 4284, 4321, 4296, 4258, 4220, 4210, 4199, 4211, 4223, 4235, 4247, 4300, 4352, 4404, 4456, 4501, 4545, 4590, 4634, 4690, 4746, 4802, 4858, 4911, 4964, 4955, 4946, 4899, 4852, 4911, 5033, 5162, 5228, 5271, 5313, 5408, 5503, 5598, 5693, 5830, 5968, 6106, 6243, 6370, 6497, 6624, 6751, 6915, 7080, 7212, 7345, 7550, 7754, 8021, 8288, 8522, 8755, 8950, 9207, 9480, 9690, 9904, 10180, 10578, 10977, 11383, 11789, 12335, 12943, 13519, 14096, 14701, 15369, 16073, 16776, 17614, 18596, 19601, 20606, 21562, 22517, 23400, 24220, 24972, 25662, 26164, 26397, 26322, 25977, 25373, 24539, 23574, 22546]
495B2546j132j235j257j194j118j057r56q53p55o92o54o53n81n81n27m24l78l78l72l73l07
493G069l06k38j75j75k38k41k42j76j15j08j08j05j04j06j05j06j06m7m7j3p4r7r6l8l9j13
490C751j13q5k4j8j8j4j5llj04j04m3J8K3m0q0j7POo1o2o1o1l0k9k9l0j7j8M1M1j6p8p8j5
485B621%%r6r6m4J8K3m0k7L5L2l1n6n5KLMMMMj8j8j8j8l8l7K4K5j1j1j1j1K8K8l4l4k1k1k1
481B088k1k9k9k9k9RRn4n4p3p3j1j1n1n0M9N0L0l3LLj4j4j4j3M7M7M7M8L4L4p0p0o2o2%%J6
476A648J6J6J6L5L6k7k7n1n0N4N4o0n9LLOPOOq2q2k0j9J7J7J8J7J4J3m9m9%%O2O2M3M3k0k0
471A597LKKKRJ0J0J0opo9o8K3K3K4K3ONNOM5M6M5M6J08J08MMNONNOOOOk6k7k6k7m0m1K2K1
466A917k5k5k5k6m2m3J9K0%%J04J04P3P4J1J1M1M1J45J45O9O9O6O5M1k1J1J14J69O4n8n8L5
$$ y = [22546, 21414, 20179, 18922, 17728, 16610, 15553, 14597, 13744, 12989, 12297, 11643, 10990, 10409, 9828, 9301, 8877, 8499, 8121, 7749, 7376, 7069, 6763, 6525, 6350, 6175, 5937, 5696, 5454, 5278, 5163, 5055, 4947, 4842, 4738, 4632, 4527, 4421, 4315, 4268, 4221, 4208, 4134, 4037, 3941, 3903, 3864, 3751, 3638, 3553, 3529, 3511, 3493, 3479, 3464, 3461, 3458, 3354, 3250, 3207, 3225, 3248, 3208, 3128, 3111, 3118, 3124, 3063, 3001, 2940, 2879, 2849, 2820, 2791, 2761, 2744, 2726, 2767, 2808, 2792, 2714, 2636, 2621, 2621, 2621, 2525, 2429, 2385, 2403, 2426, 2386, 2359, 2394, 2426, 2395, 2339, 2284, 2286, 2289, 2293, 2297, 2301, 2305, 2287, 2269, 2251, 2233, 2195, 2158, 2182, 2207, 2196, 2185, 2174, 2163, 2191, 2219, 2185, 2151, 2130, 2109, 2088, 2067, 2038, 2009, 1980, 1951, 1960, 1969, 1915, 1861, 1788, 1715, 1704, 1693, 1642, 1592, 1641, 1691, 1721, 1688, 1691, 1694, 1680, 1666, 1652, 1639, 1686, 1733, 1780, 1828, 1862, 1896, 1826, 1756, 1694, 1632, 1632, 1632, 1648, 1664, 1680, 1696, 1731, 1767, 1740, 1713, 1662, 1612, 1666, 1720, 1660, 1601, 1604, 1607, 1613, 1620, 1626, 1632, 1550, 1468, 1448, 1429, 1446, 1463, 1481, 1498, 1512, 1525, 1476, 1427, 1427, 1427, 1489, 1551, 1594, 1637, 1617, 1597, 1600, 1602, 1604, 1606, 1615, 1625, 1635, 1645, 1639, 1632, 1563, 1495, 1518, 1541, 1565, 1588, 1594, 1599, 1604, 1610, 1655, 1701, 1746, 1792, 1900, 2008, 2012, 2016, 2021, 2027, 2032, 2037, 2043, 2049, 2055, 2061, 2035, 2008, 1982, 1955, 1915, 1874, 1896, 1917, 1892, 1867, 1842, 1816, 1774, 1731, 1750, 1770, 1770, 1770, 1874, 1978, 2051, 2125, 2136, 2147, 2188, 2229, 2374, 2519, 2588, 2657, 2723, 2788, 2829, 2808, 2819, 2933, 3102, 3166, 3108, 3050, 3085]
462C085L5L5L5j4j4m6m5p4p5j32j33j35p2L5L4K5l7j12j75j50j50r2r2j2j1J9K0q1q1n4RJ4
458A559J5m4m4lkklK2K3K2K2k6k6k6k6rj0rrrrM9M9Rn3q0q1J3J4J3J4M8M9j0j0j5M8P6P5N2
453A666N1K5l8l8l9O5J26P6J3r4r3n8n9k7k7j8j9j8j9n3n4M6M6lo6r8l5N2N1L2l0n4RP0O9
449A457k3q6n5PJ%MNo2o1o2M3J13N0j9q1q4q5j9M3Q1Q1j9j9jjL0L0LKL4L4L1L1l1l1j0j0K2
444A343K1l9m0rqJ5J6j6j5l0l0L3L2k6k7k6k7O0N9llj%j%M3M4j9j8m9m9p9q0M4M4J3J3k0k1
439A144q3q3k4k3Q1Q0P1P0QQp3p2P3P4j6j5J5J6L0L1l1l2k2k2k2k1n8n9M6M6N9N9m5m5J4J4
435A193J4J4j6j6j6j6J2J2J2J2J0J1J0J0J4J3j7j8m6m6J6J6j8j9J3J3M2M2J1J0J4J4M6M5k7
430A364k7n8n8o9o9o9o8M3M2M3M3j0j0K1K2k9k9l2P3J14Rj12j13qrrqO3O4m0m1N2N2N2N2j0
$$ y = [3085, 3120, 3155, 3190, 3176, 3162, 3116, 3071, 2997, 2922, 2790, 2657, 2522, 2450, 2485, 2519, 2544, 2507, 2395, 2220, 2070, 1920, 1828, 1736, 1724, 1713, 1732, 1752, 1671, 1590, 1536, 1545, 1559, 1574, 1530, 1486, 1483, 1481, 1479, 1476, 1498, 1521, 1543, 1565, 1539, 1513, 1487, 1461, 1452, 1442, 1433, 1424, 1415, 1406, 1455, 1504, 1513, 1460, 1380, 1299, 1312, 1326, 1339, 1353, 1401, 1450, 1440, 1430, 1415, 1463, 1539, 1614, 1666, 1717, 1742, 1704, 1666, 1627, 1692, 1818, 1894, 1907, 1813, 1720, 1662, 1603, 1576, 1549, 1531, 1512, 1494, 1475, 1422, 1368, 1414, 1460, 1457, 1391, 1293, 1258, 1310, 1361, 1393, 1363, 1309, 1318, 1388, 1457, 1434, 1348, 1293, 1300, 1301, 1301, 1305, 1310, 1248, 1187, 1125, 1168, 1281, 1331, 1312, 1231, 1147, 1062, 1043, 1086, 1167, 1248, 1229, 1210, 1209, 1208, 1238, 1268, 1271, 1273, 1307, 1341, 1372, 1403, 1372, 1341, 1331, 1321, 1343, 1364, 1325, 1285, 1276, 1268, 1283, 1299, 1283, 1268, 1238, 1208, 1241, 1273, 1247, 1220, 1194, 1167, 1227, 1286, 1283, 1280, 1279, 1279, 1278, 1278, 1321, 1365, 1346, 1328, 1279, 1230, 1151, 1071, 1115, 1159, 1172, 1185, 1165, 1144, 1061, 978, 954, 931, 1012, 1092, 1163, 1233, 1241, 1249, 1176, 1104, 1177, 1251, 1235, 1220, 1235, 1251, 1281, 1312, 1281, 1249, 1227, 1205, 1183, 1162, 1104, 1045, 1091, 1137, 1196, 1255, 1210, 1165, 1179, 1193, 1207, 1221, 1205, 1189, 1173, 1157, 1169, 1181, 1193, 1205, 1215, 1226, 1236, 1246, 1260, 1273, 1256, 1238, 1192, 1146, 1162, 1178, 1160, 1141, 1154, 1167, 1209, 1251, 1262, 1272, 1286, 1300, 1346, 1391, 1364, 1337, 1279, 1221, 1152, 1083, 1014, 946, 989, 1031, 1074, 1117, 1107, 1097, 1118, 1140, 1111, 1082, 1050, 1123, 1237, 1246, 1134, 1021, 1013, 1004, 995, 987, 1050, 1114, 1074, 1033, 1085, 1137, 1189, 1241, 1231]
426A231rrrn3n2J0J1j1j1j0j1L8L8PPo0o1KKkllkr1r0N5N5M6M5J4J5K5K5K5K5M1M0k2k3k7
421A198k8k8k8QPPQk4k3k4k4m3m4J9J8N3N3Q4Q4l7l7noQQn5n4q7q6m5N9O3%n6PM0M1j8j8o
416I89oo8o8P6P6k8k7J4J4J4J5l2l1P3P2M0M0k3k3n1n1m8m7K3Q5Q6K3k4k5LLl5l6r4r4j7M5
412H63N0j3k5L8O1O2k0j9p8p8n6OP2P1O2%l0r2n0J2L6L5j2j1J9J9pqqqMML5L5m7m7j9M2lm
407H91%Jj4j4J0P2N7oo5kO2O2l9l8LLLMj1j1j1j2llL2l1q8q8o0JO8J30J31O8J3m9q0q0k6k6
402H54L6L6LLk9k8MMk4k3o3jO4O4M3j8m6m6j1j1j1j0M5M5M5M5l9m0l9l9M9M9j3j4l4l5K8K7
397H70k3k3k3k3l7l7O7O7P7P7J5J5j8j7j8j7L5L6k7k7n4n4QQJ2J2J2J2j8j7M5M5k3k4k4k4
393H85l2l2l3l2M7M7j6j5QRQQl8l9K4K4K6K6K7K6k9l0l0k9K9L0K9L0N9O0J8q6j25o3%%K5K5
$$ y = [1231, 1222, 1213, 1204, 1151, 1099, 1109, 1120, 1109, 1098, 1088, 1077, 1115, 1153, 1160, 1167, 1107, 1046, 1048, 1050, 1048, 1045, 1042, 1040, 949, 859, 914, 969, 1015, 1060, 1074, 1089, 1114, 1139, 1164, 1189, 1230, 1270, 1248, 1225, 1198, 1170, 1142, 1114, 1122, 1129, 1136, 1144, 1120, 1097, 1073, 1049, 1006, 962, 981, 999, 1052, 1105, 1189, 1273, 1236, 1199, 1194, 1188, 1196, 1204, 1149, 1095, 1008, 922, 877, 936, 999, 999, 943, 950, 990, 1031, 1013, 995, 989, 983, 915, 847, 923, 999, 971, 944, 958, 972, 986, 1001, 969, 938, 1011, 1083, 1123, 1163, 1140, 1117, 1066, 1015, 967, 920, 943, 1028, 1114, 1137, 1113, 1088, 1091, 1094, 1059, 1023, 929, 835, 818, 863, 913, 900, 875, 913, 974, 1036, 1016, 997, 919, 841, 785, 791, 863, 934, 996, 996, 966, 874, 824, 836, 872, 907, 895, 884, 903, 922, 915, 907, 899, 891, 895, 899, 934, 969, 922, 875, 856, 898, 895, 891, 891, 892, 878, 864, 874, 946, 1003, 997, 932, 930, 992, 1054, 1015, 977, 980, 983, 986, 990, 979, 968, 957, 945, 942, 939, 971, 940, 852, 764, 704, 705, 773, 903, 1034, 1102, 1115, 1066, 986, 906, 880, 854, 890, 926, 929, 932, 903, 875, 879, 883, 859, 836, 773, 772, 836, 900, 943, 925, 879, 833, 822, 811, 800, 790, 835, 880, 925, 970, 931, 891, 852, 813, 862, 911, 898, 884, 850, 815, 843, 870, 847, 824, 801, 778, 741, 704, 771, 838, 915, 992, 1007, 1022, 1004, 987, 969, 952, 987, 1023, 996, 969, 915, 861, 869, 877, 889, 901, 913, 925, 907, 890, 935, 980, 957, 933, 909, 885, 853, 821, 788, 756, 803, 850, 834, 819, 827, 836, 844, 852, 814, 775, 799, 823, 849, 875, 902, 928, 899, 869, 839, 810, 839, 869, 898, 928, 987, 1047, 1065, 979, 854, 791, 791, 791, 816, 841]
388H41K4K5kjkkj8j9j8j9N7N7onN2N3N3N3m7m6m7m6m3m3K0K0J6J6J6J6qrqrOONOK0K0K0K0
383A024rj0R5R4NNn7n8m9m9J3J3O4O4KJk1k1k1k1k1k1M1M2l2l1l2l1L1L1L0L1rrN3N3NNNN
378A210M5M5M5M5l1l0l1l0K3K4K3K4j4j5j4j4J0Rn2n3OOOOk7k8k7k7L2L1l1l1j9k0j9j9j6
374A042j5M7M7R2R2j1j2o6o6mml3l3L0K9rrj0rK3K3K3K3mnmmp1p1L3L3M5M5M4M5l7l7l6l7
369A129J2J3J2J3k7k7k7k6LLLLL5L5k7k7K6K5K6K6j5j6j5j6j5j5j6j5J8J9J8J9nnnnj1j2j1
364A100j1JJK8K9M5j8m5m4j6j5j6j5K7K7N0J13J16N4j2j1jjk8k9k0M2L8L8K6K6K6K6OPOPL9
359A596M0P1P0Q6Q6J09J72J75J14M8M9j4j4j18j18j04j05j04j04j02j02l3K9LLk4k5K0J9j2
356A711j2l1l0l4K8M6M6j2j2N5N5pp0j5Q9O2jj8j7M5M5Q0J41J42Q0K0K0M7M7M4M4J55K17K31
$$ y = [841, 865, 890, 888, 887, 885, 883, 865, 846, 828, 809, 866, 923, 917, 912, 964, 1017, 1070, 1123, 1076, 1030, 983, 937, 894, 851, 871, 891, 907, 923, 939, 955, 947, 938, 930, 921, 927, 933, 938, 944, 964, 984, 1004, 1024, 1015, 1005, 1100, 1194, 1199, 1204, 1147, 1089, 1040, 991, 1004, 1017, 1081, 1145, 1147, 1148, 1127, 1106, 1085, 1064, 1043, 1022, 1063, 1105, 1073, 1042, 1010, 979, 1010, 1041, 1071, 1102, 1093, 1084, 1137, 1190, 1195, 1200, 1205, 1210, 1255, 1300, 1345, 1390, 1359, 1329, 1298, 1268, 1291, 1315, 1338, 1362, 1348, 1333, 1319, 1305, 1315, 1324, 1272, 1219, 1225, 1231, 1237, 1243, 1216, 1188, 1161, 1134, 1166, 1197, 1166, 1135, 1116, 1096, 1077, 1058, 1042, 1027, 1074, 1121, 1213, 1305, 1294, 1282, 1216, 1150, 1146, 1142, 1109, 1076, 1106, 1135, 1126, 1117, 1107, 1098, 1121, 1144, 1167, 1190, 1186, 1181, 1177, 1173, 1102, 1031, 1064, 1097, 1142, 1187, 1231, 1276, 1239, 1202, 1166, 1129, 1141, 1154, 1166, 1179, 1152, 1125, 1098, 1072, 1075, 1078, 1081, 1084, 1119, 1154, 1127, 1100, 1126, 1151, 1177, 1203, 1188, 1172, 1157, 1141, 1126, 1111, 1095, 1080, 1098, 1117, 1135, 1154, 1149, 1144, 1139, 1134, 1123, 1111, 1100, 1089, 1090, 1091, 1119, 1148, 1193, 1175, 1130, 1086, 1070, 1055, 1039, 1024, 1051, 1078, 1128, 1241, 1357, 1411, 1399, 1388, 1387, 1386, 1358, 1329, 1309, 1351, 1389, 1427, 1453, 1479, 1505, 1531, 1537, 1544, 1550, 1557, 1596, 1636, 1707, 1777, 1863, 1949, 2058, 2230, 2405, 2519, 2567, 2616, 2602, 2588, 2470, 2352, 2248, 2143, 2039, 1935, 1833, 1731, 1698, 1727, 1730, 1733, 1709, 1684, 1704, 1723, 1711, 1699, 1668, 1638, 1604, 1632, 1678, 1724, 1712, 1700, 1755, 1810, 1803, 1733, 1718, 1807, 1869, 1868, 1850, 1833, 1878, 1923, 2003, 2144, 2286, 2366, 2386, 2406, 2453, 2500, 2544, 2588, 2743, 2960, 3191]
352C191K32L04L67L78L77K69J24n4j58k55k54k66k66k39j76j06j05r8r8m7J6M2M3n9n9n9n9
348B985q1q1j2N0O3O3O7O7KKKKPQL0R3Q9K7LMK6K7N4J16J93J93J41J41J84K87L75L75L61L62
344F225K47J02l4j80k10k11k24k24k55k55k25k26k30j67r2r1j51j50j16j15n4n3j1j1p4p3
341C142n3n3k2k2k0k0j9k0J4J5J5J4K4K4mo6n3n4M6M6P0P0M3M3N3J15J43J42J04J03P2P2k6
337C938k7k7k7q8q9q9q8l3l3l3l3j17j17n5n5p3p2p3p2l7l6l6l6l2l3L0L0L0L0L0L0J0J1n1
333B677n2j6j6j7j6n3n2n3n2J3J4J4J4mmo6o6r0r0J5J4%%%%j13j14rrP9P8k6k5l6l6K6K7k2
328A934k1M1M1OOn7n6M0L9M0M0PPPQj1j1j1j1k4k4k4k3o0o0o0o0M2M2k1k1J9J9m4m4j2j2j3
324A658j2l0l0l1l0j2j2j1j2k9l0k9k9m2m2m2m2jjkjopN6N6J3J4m9m9J8J9m4m4N3N2n1n1P
$$ y = [3191, 3423, 3727, 4094, 4472, 4849, 5118, 5242, 5188, 5030, 4775, 4521, 4255, 3989, 3750, 3574, 3468, 3363, 3265, 3167, 3120, 3136, 3178, 3221, 3162, 3103, 3044, 2985, 2904, 2823, 2811, 2861, 2924, 2987, 3054, 3121, 3123, 3125, 3127, 3129, 3136, 3144, 3174, 3267, 3356, 3383, 3386, 3390, 3416, 3443, 3497, 3613, 3806, 3999, 4140, 4281, 4465, 4752, 5127, 5502, 5863, 6225, 6472, 6574, 6540, 6360, 6150, 5939, 5715, 5491, 5236, 4981, 4756, 4530, 4300, 4133, 4041, 3950, 3799, 3649, 3533, 3418, 3364, 3311, 3300, 3289, 3215, 3142, 3089, 3036, 3014, 2992, 2972, 2952, 2933, 2913, 2927, 2942, 2957, 2971, 2995, 3019, 3015, 2949, 2896, 2842, 2888, 2934, 3004, 3074, 3117, 3160, 3213, 3328, 3471, 3613, 3717, 3820, 3892, 3964, 3938, 3911, 3884, 3857, 3769, 3680, 3591, 3503, 3470, 3437, 3404, 3371, 3254, 3137, 3082, 3027, 2954, 2882, 2809, 2737, 2700, 2664, 2628, 2592, 2560, 2527, 2557, 2587, 2617, 2647, 2677, 2707, 2717, 2728, 2677, 2625, 2609, 2593, 2576, 2560, 2507, 2455, 2402, 2350, 2363, 2377, 2391, 2405, 2401, 2397, 2331, 2265, 2175, 2085, 2100, 2114, 2114, 2114, 2114, 2114, 2001, 1887, 1878, 1869, 1948, 2026, 2000, 1975, 1939, 1903, 1929, 1956, 1934, 1913, 1954, 1995, 2001, 2007, 1950, 1894, 1934, 1973, 2013, 2053, 2060, 2067, 2074, 2082, 2071, 2060, 2049, 2038, 2014, 1990, 1966, 1943, 1883, 1823, 1763, 1703, 1745, 1787, 1766, 1745, 1764, 1783, 1739, 1695, 1683, 1671, 1658, 1646, 1616, 1586, 1555, 1525, 1513, 1501, 1490, 1478, 1449, 1419, 1390, 1361, 1319, 1277, 1235, 1193, 1192, 1191, 1189, 1188, 1182, 1175, 1231, 1287, 1300, 1314, 1265, 1216, 1234, 1253, 1209, 1165, 1218, 1270, 1219, 1168, 1175]
319A175PPQm6m5J8J7JKKJO6O6LLm3m2m2m3K7K7K7K7j8j7j7j8LKLKj2j1j2j2m8m8J4J5l2l3
314I84l2l3N0M9j2j3nnonQ5Q4Mj00j13rK7l5l6K7Q5K3l3l3J03J02K8p5n2J1k6k6k2k2L7L7
309A043k5k6k0k0q2q3nnonllklm4m3O0O1J5J5J5J5L2L3L2L3qqqqk6k7L6L5n4n4RQo4o5klR2
304H32R1K9K9m3m3K0K0L4L4L4L4j8j8M4M4m4m5J9J8j9j8j8j9o3o4M0M0N3N3rrj7j8m8m8N2
$$ y = [1175, 1182, 1189, 1197, 1151, 1106, 1124, 1141, 1142, 1144, 1146, 1147, 1213, 1279, 1282, 1285, 1242, 1200, 1158, 1115, 1142, 1169, 1196, 1223, 1205, 1188, 1171, 1153, 1156, 1158, 1161, 1163, 1151, 1140, 1128, 1116, 1068, 1020, 1034, 1049, 1017, 984, 952, 919, 969, 1018, 1006, 993, 988, 983, 977, 972, 1057, 1141, 1145, 1045, 932, 923, 950, 915, 879, 906, 991, 1014, 981, 948, 1051, 1153, 1181, 1106, 1054, 1065, 1039, 1013, 991, 969, 1006, 1043, 1018, 992, 972, 952, 870, 787, 782, 777, 771, 766, 763, 760, 758, 755, 711, 668, 728, 789, 804, 819, 834, 849, 881, 914, 946, 979, 971, 963, 955, 947, 921, 894, 930, 965, 911, 857, 866, 874, 810, 745, 743, 740, 832, 923, 952, 981, 938, 895, 915, 935, 969, 1003, 1037, 1071, 1053, 1035, 1079, 1123, 1079, 1034, 1053, 1071, 1052, 1034, 1016, 997, 934, 870, 910, 950, 1003, 1056, 1047, 1038, 1021, 1003, 955, 907, 959]
$$ [...]
-1604E46
##END=	
##END=	
