##TITLE=	Apr16-2019.11.fid
Br - 06 - 2.0

##JCAMP-DX=	6.0	$$ MestReNova 14.1.1-24571
##DATA TYPE=	LINK
##BLOCK_ID=	1
##BLOCKS=	1    
##ORIGIN=	Mestrelab Research S.L.
##OWNER=	hrzepa
##$MNOVA/LINK_BLOCK_TYPE=	ITEM	$$ NMR Spectrum
##$MNOVA/ITEM/POLYGON=	(XY..XY)
5321,5835
8722,5835
8722,8208
5321,8208
5321,5835
##$MNOVA/ITEM/Z=	0
##$MNOVA/ITEM/ANGLE=	0
##TITLE=	Apr16-2019.11.fid
##JCAMP-DX=	6.0	$$ MestReNova 14.1.1-24571
##BLOCK_ID=	2
##DATA TYPE=	NMR SPECTRUM
##DATA CLASS=	XYDATA
##NUMDIM=	1
##ORIGIN=	Bruker BioSpin GmbH
##OWNER=	nmr
##.OBSERVE FREQUENCY=	100.671616723846995
##.OBSERVE NUCLEUS=	^13C
##.SOLVENT NAME=	DMSO
##.PULSE SEQUENCE=	zgpg30
##LONGDATE=	2019/04/16 22:10:00.000
##.ACQUISITIONMODE=	SIMULTANEOUS (DQD)
##$ORIGINAL FORMAT=	Bruker XWIN-NMR
##$MNOVA/SCALES_VERSION=	9
##$PARAMETER FILE=	(acqus, ASCII, /Users/hrzepa/Downloads/Polysiphenol%20SI%20NMR%20Original%20Data/4/4a%20-%2013C%20-%20400B.19.04.16.011%20-%20ZY/11/acqus, 0)
$$ ##TITLE= Parameter file, TOPSPIN		Version 3.2
$$ ##JCAMPDX= 5.0
$$ ##DATATYPE= Parameter Values
$$ ##NPOINTS= 11	$$ modification sequence number
$$ ##ORIGIN= Bruker BioSpin GmbH
$$ ##OWNER= nmr
$$ $$ 2019-04-16 22:10:48.035 +0100  nmr@CZC2524DW0
$$ $$ /opt/topspin/data/brad/nmr/Apr16-2019/11/acqus
$$ $$ process /opt/topspin3.2/prog/mod/shimcntl
$$ ##$ACQT0= -2.05882356948211
$$ ##$AMP= (0..31)
$$ 100 100 100 100 100 100 100 100 100 100 100 100 100 100 100 100 100 100
$$ 100 100 100 100 100 100 100 100 100 100 100 100 100 100
$$ ##$AMPCOIL= (0..19)
$$ 0 0 0 0 0 0 0 0 0 0 0 0 0 0 0 0 0 0 0 0
$$ ##$ANAVPT= -1
$$ ##$AQSEQ= 0
$$ ##$AQ_mod= 3
$$ ##$AUNM= <au_zg>
$$ ##$AUTOPOS= <19 >
$$ ##$BF1= 100.660544
$$ ##$BF2= 400.32
$$ ##$BF3= 100.660544
$$ ##$BF4= 100.660544
$$ ##$BF5= 100.660544
$$ ##$BF6= 100.660544
$$ ##$BF7= 100.660544
$$ ##$BF8= 100.660544
$$ ##$BYTORDA= 0
$$ ##$CAGPARS= (0..11)
$$ 0 0 0 0 0 0 0 0 0 0 0 0
$$ ##$CFDGTYP= 0
$$ ##$CFRGTYP= 9
$$ ##$CHEMSTR= <none>
$$ ##$CNST= (0..63)
$$ 1 1 145 1 1 1 1 1 1 1 1 1 1 1 1 1 1 1 1 1 1 1 1 1 1 1 1 1 1 1 1 1 1 1 1
$$ 1 1 1 1 1 1 1 1 1 1 1 1 1 1 1 1 1 1 1 1 1 1 1 1 1 1 1 1 1
$$ ##$CPDPRG= (0..8)
$$ <waltz16> <> <waltz16> <> <mlev> <mlev> <mlev> <mlev> <mlev>
$$ ##$D= (0..63)
$$ 0 1 0.00345 0 0 0 0 0 0 0.06 0 0.03 2e-05 3e-06 0 0 0.0002 0 0 0 0 0 0
$$ 0 0 0 0 0 0 0 0 0 0 0 0 0 0 0 0 0 0 0 0 0 0 0 0 0 0 0 0 0 0 0 0 0 0 0 0
$$ 0 0 0 0 0
$$ ##$DATE= 1555449047
$$ ##$DE= 6.5
$$ ##$DECBNUC= <off>
$$ ##$DECIM= 704
$$ ##$DECNUC= <off>
$$ ##$DECSTAT= 4
$$ ##$DIGMOD= 1
$$ ##$DIGTYP= 12
$$ ##$DQDMODE= 0
$$ ##$DR= 21
$$ ##$DS= 4
$$ ##$DSPFIRM= 0
$$ ##$DSPFVS= 20
$$ ##$DTYPA= 0
$$ ##$EXP= <c13q>
$$ ##$F1LIST= <111111111111111>
$$ ##$F2LIST= <222222222222222>
$$ ##$F3LIST= <333333333333333>
$$ ##$FCUCHAN= (0..9)
$$ 0 1 2 0 0 0 0 0 0 0
$$ ##$FL1= 83
$$ ##$FL2= 83
$$ ##$FL3= 83
$$ ##$FL4= 83
$$ ##$FOV= 20
$$ ##$FQ1LIST= <freqlist>
$$ ##$FQ2LIST= <freqlist>
$$ ##$FQ3LIST= <freqlist>
$$ ##$FQ4LIST= <freqlist>
$$ ##$FQ5LIST= <freqlist>
$$ ##$FQ6LIST= <freqlist>
$$ [...]
$$ 90 74 58 42 26 10 0 0
$$ ##$Sgu3PowerLevels= (0..7)
$$ 0 0 0 0 0 0 0 0
$$ ##$Sgu4PowerLevels= (0..7)
$$ 0 0 0 0 0 0 0 0
$$ ##$Sgu5PowerLevels= (0..7)
$$ 0 0 0 0 0 0 0 0
$$ ##$Sgu6PowerLevels= (0..7)
$$ 0 0 0 0 0 0 0 0
$$ ##$Sgu7PowerLevels= (0..7)
$$ 0 0 0 0 0 0 0 0
$$ ##$Sgu8PowerLevels= (0..7)
$$ 0 0 0 0 0 0 0 0
$$ ##$SguType= 3
$$ ##$ShimPowMaxUA= (0..63)
$$ 130000 130000 130000 130000 130000 130000 130000 130000 130000 130000 130000
$$ 130000 130000 130000 130000 130000 130000 130000 130000 130000 0 0 0 0
$$ 0 0 0 0 0 0 0 0 0 0 0 0 0 0 0 0 0 0 0 0 0 0 0 0 0 0 0 0 0 0 0 0 0 0 0 0
$$ 0 0 0 0
$$ ##$ShimPowMaxUC= (0..63)
$$ 130000 130000 130000 130000 130000 130000 130000 130000 130000 130000 130000
$$ 130000 130000 130000 130000 130000 130000 130000 130000 130000 0 0 0 0
$$ 0 0 0 0 0 0 0 0 0 0 0 0 0 0 0 0 0 0 0 0 0 0 0 0 0 0 0 0 0 0 0 0 0 0 0 0
$$ 0 0 0 0
$$ ##$ShimPowMaxUG= (0..63)
$$ 524287 524287 524287 524287 524287 524287 524287 524287 524287 524287 524287
$$ 524287 524287 524287 524287 524287 524287 524287 524287 524287 0 0 0 0
$$ 0 0 0 0 0 0 0 0 0 0 0 0 0 0 0 0 0 0 0 0 0 0 0 0 0 0 0 0 0 0 0 0 0 0 0 0
$$ 0 0 0 0
$$ ##$ShimPowRcbType= 3
$$ ##$ShimPowRes= (0..63)
$$ 1e-20 1e-20 1e-20 1e-20 1e-20 1e-20 1e-20 1e-20 1e-20 1e-20 1e-20 1e-20
$$ 1e-20 1e-20 1e-20 1e-20 1e-20 1e-20 1e-20 1e-20 0 0 0 0 0 0 0 0 0 0 0 0
$$ 0 0 0 0 0 0 0 0 0 0 0 0 0 0 0 0 0 0 0 0 0 0 0 0 0 0 0 0 0 0 0 0
$$ ##$ShimPowRng0= (0..63)
$$ 1 1 1 1 1 1 1 1 1 1 1 1 1 1 1 1 1 1 1 1 0 0 0 0 0 0 0 0 0 0 0 0 0 0 0 0
$$ 0 0 0 0 0 0 0 0 0 0 0 0 0 0 0 0 0 0 0 0 0 0 0 0 0 0 0 0
$$ ##$ShimPowRng1= (0..63)
$$ 1 1 1 1 1 1 1 1 1 1 1 1 1 1 1 1 1 1 1 1 0 0 0 0 0 0 0 0 0 0 0 0 0 0 0 0
$$ 0 0 0 0 0 0 0 0 0 0 0 0 0 0 0 0 0 0 0 0 0 0 0 0 0 0 0 0
$$ ##$ShimPowRng2= (0..63)
$$ 1 1 1 1 1 1 1 1 1 1 1 1 1 1 1 1 1 1 1 1 0 0 0 0 0 0 0 0 0 0 0 0 0 0 0 0
$$ 0 0 0 0 0 0 0 0 0 0 0 0 0 0 0 0 0 0 0 0 0 0 0 0 0 0 0 0
$$ ##$ShimPowRng3= (0..63)
$$ 1 1 1 1 1 1 1 1 1 1 1 1 1 1 1 1 1 1 1 1 0 0 0 0 0 0 0 0 0 0 0 0 0 0 0 0
$$ 0 0 0 0 0 0 0 0 0 0 0 0 0 0 0 0 0 0 0 0 0 0 0 0 0 0 0 0
$$ ##$ShimSysFunc= (0..63)
$$ 1 2 3 4 5 7 9 11 15 16 8 10 12 14 6 17 13 18 19 20 0 0 0 0 0 0 0 0 0 0
$$ 0 0 0 0 0 0 0 0 0 0 0 0 0 0 0 0 0 0 0 0 0 0 0 0 0 0 0 0 0 0 0 0 0 0
$$ ##$ShimSysMatrix= 0
$$ ##$ShimSysType= 1
$$ ##$TFXNUM= 0
$$ ##$TRIPLO2= 0
$$ ##$VTU= 2
$$ ##$VTUETH= <149.236.99.20>
$$ ##$VTUTY= <no>
$$ ##$WBREFAM= (0..15)
$$ 132.2 106.2 100 100 100 100 100 100 100 100 100 100 100 100 100 100
$$ ##$WBREFLM= (0..15)
$$ 0 0 0 0 0 0 0 0 0 0 0 0 0 0 0 0
$$ ##$WBREFPH= (0..15)
$$ 77.55 -65.76 0 0 0 0 0 0 0 0 0 0 0 0 0 0
$$ ##$WBSGU= (0..15)
$$ 0 0 0 0 0 0 0 0 0 0 0 0 0 0 0 0
$$ ##$XFAC= 2
$$ ##END=
$$ 
##$DECIM=	704
##$DSPFVS=	20
##XUNITS=	HZ
##YUNITS=	ARBITRARY UNITS
##FIRSTX=	25277.269301538948639
##LASTX=	-3131.3881192264107085
##DELTAX=	-0.43348832563920591809
##XFACTOR=	1
##YFACTOR=	0.030261750193665355041
##FIRSTY=	4.4558935165405273438
##MINY=	-9.4591522216796875
##MAXY=	1390.3046875
##NPOINTS=	65536
##XYDATA=	(X++(Y..Y))
$$ [...]
9647ElL2L9M0NOL4Jl8p2o3k9j4K1P0P1N8K5L7L6L7LkkmmJ7J7J4J5k2n6r0r0l6K0M5M5kk%%
9628A64ML8J9J9J0J0J0J1kkkkQQk7o1p2l8KL4QQJ0J0ppppK8K8noRRQRM6M6j2m6j0K4LLJ3J4
9608C00L3jl3l4l3l4j7J8L1L2OOl0o3p6m2opk2k2j9k0j5J9N3N5O0K7J2J2J8J7j6j7mmj7n1
9592A16m5j1K2K3nl8l9mM9M9L7Lj3j3M0L9J7j6l0k9K1N4L4k3o4o4l1l1j0K3L8L8L4L3%%l4
9576A70l3ML8L3L3m4m4m1m0L8L9lllkNML9L9J2J2m5m4k5k5L2L1L2L2kln9n9o0n8j4j4K0J9
9559A1J11J11J11J11J3J2K9om8j03j24r0k9K7L1L1llL1L0K7K6p3p3q9n6oN2J04J05Q2K4ll7
9544C36n5n6k7k8POl1l1l1l1MNO1O1P5P5J8J9j5j5j5j5J5J4j9j9klkkk5k4k4k4l0l1l0l0j9
9527F2j9L8L7P1P0K3l3m1m0L5L5K5K5K4K5OPk8k7k2k1k2k1j9j8j7j6l4JM1P5P6P6K0j4j5J9
$$ plain form
9647 5 2 34 73 113 118 124 158 159 121 49 -14 -43 -57 -36 34 105 163 188 225 261 298 301 299 297 293 289 306 323 337 352 330 274 184 94 58 78 123 168 166 164 164 164
9628 164 168 206 225 244 254 264 274 285 283 281 279 277 285 293 266 205 133 95 97 131 139 147 157 167 160 153 146 139 167 195 190 184 193 202 210 219 265 311 299 253 243 267 270 273 286 300
9608 300 333 332 299 265 232 198 181 199 230 262 268 274 244 181 105 63 57 50 28 6 -13 -33 -48 -29 24 79 139 166 178 190 208 225 209 192 188 184 167 116
9592 116 71 60 82 105 100 62 23 19 68 117 154 157 144 131 171 210 227 211 181 152 173 227 261 238 174 110 79 48 38 61 99 137 171 204 204 204 170
9576 170 137 141 179 212 245 201 157 116 76 114 153 150 147 144 142 147 151 190 229 241 253 208 164 139 114 146 177 209 241 239 236 177 118 58 0 -14 -28 -8 11
9559 11 122 233 344 455 468 480 509 503 455 352 228 138 109 136 167 198 195 192 223 253 280 306 233 160 71 15 9 61 165 270 352 376 373 336
9544 336 281 225 198 170 177 183 152 121 90 59 63 68 129 190 265 340 358 377 362 347 332 317 332 346 327 308 306 303 301 299 274 250 226 202 172 141 111 81 62
9527 62 43 81 118 189 259 282 249 208 168 203 238 263 288 312 337 343 350 322 295 273 252 230 209 190 172 155 139 105 106 147 222 298 374 394 380 365 384
9511C84J7j7p5p5m0oKKN8N8M3Rooj7j6j6j7LLl2l1m6m6j2j3RRRRJ1J1J1J1L4L4L2L3L2kj7
9494C34j6RRQRl8l8l8l8m8m9m9m8l9m0lL1N0N1L8Nk0k0k2k3k7k9K8K7M6M5P7P7P9M4j9n2n7
9477B54n6k5k4l3l2JKJKJKK7K7M6J2j4j4j5j6JKL4L3Jl4l3%J4J3m1m1K1K1K1K2K2K3j1j1k8
9460A75k7k8k7K0K0j3j3RRJ0RJ7J7N1N1K6K7qpj%jjl2l2l2l2k9k9K7K8K9K9nno0o1o1n9k2
9442c1k1L4L4K9K8K9K8L8L8L8L8MLl0l1k8k8k9k8MMNMl5l4K2K2jjjjL3L3L3L3KJKKm1m1m1
9424A19m2L3L3L3L3j%l5l5k6k6QPn0n0m9n0noP5P3OPPPMLLMM2M2M2M2K8K8K9K8opooM4M4M0
9405D64M0k9r7j15j15o8o8nO4P5P6K3K3J5J5m2m1m7m7RJ0N2N3J9J8k1k1k1k1rrrrJ5J4J4J4
9389B19o0o1J9J8L4L4m5m5l6l6K1K1nmmnj%jjJ1J1J0J1K0J9J9J9NNNNJ7J7J7J7J2J1k3k2m6
$$ plain form
9511 384 401 384 309 234 194 188 190 192 250 308 351 360 354 348 331 315 299 282 285 288 256 225 179 133 121 108 117 126 135 144 155 166 177 188 222 256 288 321 353 351 334
9494 334 318 327 336 344 353 315 277 239 201 153 104 55 7 -32 -72 -75 -44 6 57 95 100 80 60 38 15 -12 -41 -13 14 60 105 182 259 338 382 363 311 254
9477 254 198 173 149 116 84 85 87 88 90 91 93 120 147 193 205 191 177 162 146 147 149 183 216 217 183 150 150 164 177 136 95 116 137 158 180 202 225 214 203 175
9460 175 148 120 93 113 133 120 107 116 125 135 144 161 178 229 280 306 333 325 318 317 317 316 315 283 251 219 187 158 129 156 184 213 242 237 232 172 111 50 -9 -31
9442 -31 -52 -18 16 45 73 102 130 168 206 244 282 286 289 259 228 200 172 143 115 119 123 128 132 97 63 85 107 106 105 104 103 136 169 202 235 237 238 240 242 201 160 119
9424 119 77 110 143 176 209 208 208 173 138 112 86 94 101 51 1 -48 -98 -103 -109 -34 39 45 52 59 66 70 73 76 80 122 164 206 248 276 304 333 361 355 348 342 336 380 424 464
9405 464 504 475 378 263 148 80 12 7 71 146 222 245 268 283 298 256 215 168 121 130 140 192 245 264 282 261 240 219 198 189 180 171 162 177 191 205 219
9389 219 159 98 117 135 169 203 158 113 77 41 62 83 78 74 70 65 64 64 63 62 73 84 94 105 125 144 163 182 187 192 197 202 219 236 253 270 282 293 270 248 202
9371B02m6m6m6qqqqK6K7K6K7M4M5J0J1k1k1k0k1j4j3M2M3N3N3llj0j0o2o3m4K3M2M1oooor
9354B07rM8M7LLLLj3j3K1N5M1j7l8l9k7k7k7k7J3J3J0J1j6n0n0j6LLNOL8L9K3j0k1k2J0J0
9337A93J6J6lL1N4N4j3p0p0p0j7j7j0j0K2K2J1k3l6l5QM3Qk5n5n4KL6J2J1J4J4N0N0J5j8k1
9321A35J3K6K6K5K5K5K5k6k6k7k6j8j8j7j8J1J2J2J1l6l7l6l6PPQPPQPPK2K1K1K1M1M1L9L9
9304C28Ll2j3j3J0J0k5n9n8k3J1J2QPQPK5K4J0k4k3k2RRKKL4L3M1Ol1l1o2o1l6K0N0N1L9O
9287B52k2k2m1m1k5k4J1M4M5J1k5k4k6k5QRj%j7j7LLLMQQRQJ6J7L3L4N8N7M3Rl4l4l7l6p6
9269A66p5k8K9L6L6K0K1ml8n2n3ooJ1J1J3J2k1k1J2J2J2J1M6M6K9K9K2K2Qk7m9m9NNj5j4j5
9253A41j4J1J2J2J1J0J0RJ0M7M6L3kk7k8NMJ6J5j9j9%J%%k3k3n4n4l0K7P2P2O0K7k5q0r6r5
$$ plain form
9371 202 156 110 64 56 48 40 32 58 85 111 138 182 227 237 248 227 206 186 165 151 138 180 223 276 329 326 323 313 303 241 178 134 157 199 240 234 228 222 216 207
9354 207 198 246 293 296 299 302 305 292 279 300 355 396 379 341 302 275 248 221 194 207 220 230 241 225 175 125 109 112 115 120 126 164 203 226 216 195 173 183 193
9337 193 209 225 222 253 307 361 348 278 208 138 121 104 94 84 106 128 139 116 80 45 53 96 104 79 24 -30 -28 8 20 31 45 59 109 159 174 156 135
9321 135 148 174 200 225 250 275 300 274 248 221 195 177 159 142 124 135 147 159 170 134 97 61 25 32 39 47 54 61 69 76 83 105 126 147 168 209 250 289 328
9304 328 331 299 286 273 283 293 268 209 151 128 139 151 159 166 174 181 206 230 240 216 193 171 180 189 191 193 227 260 301 307 276 245 183 122 86 106 156 207 246 252
9287 252 230 208 167 126 101 77 88 132 177 188 163 139 113 88 96 105 104 104 87 70 73 76 79 83 91 99 108 116 132 149 182 216 274 331 374 383 349 315 278 242 166
9269 166 91 63 92 128 164 184 205 201 163 111 58 52 46 57 68 81 93 72 51 63 75 87 98 144 190 219 248 270 292 300 273 224 175 180 185 170 156 141
9253 141 127 138 150 162 173 183 193 202 212 259 305 338 336 309 281 286 290 306 321 302 283 283 284 284 284 261 238 184 130 100 127 199 271 331 358 333 253 157 62
9236F2l9nk0k1k1J2N5N7K1j3j6j6jjK4K5J2k2j0K4L6L7J1J2nnLKj4j4m1m1qpOPk6k5J3M7M5
9218A40M4ppl9l8j9J6L1L1JKL5L6J0J0QQMl1l0LJ%l1l2opk3k4J7J7J9j5j1j1j2j3J5J5J5J6
9200A38L9L9K4j0l8l9polkllqrrrK8K7K8K8J9K0KLj5j6n1q4r6o2k4J0K8K7L0K9K0K0N5N4M0
9182B14M0Ll1l0l0K4K5jj%jJ5J5J5J5K1K2J0k5l2KL8P1M9ql0l1m7m7m5m5pK8O3O2L5Jj2j2
9165C33ML9L8Nn4n3n6n5p7p6k9K8M0M1J1J0L4L5L4L4L2L1klJ7J7J6J7j5j4l3%K5K6K7K7j0
9149D44j0LL7L2jo1r4p0l5%%j6j6j7j6JKJJppqpk5k5k3k3J2M5P7M3om1k3k3j1j1j1j1NNL6
9131A46L6Ll1m4m3%L5J3J4l1o4m2J3L3L3LLK7K7K7K7M3M2O2K8j2j1j4j4j1j2j1j2rj0K2K2
9115B88ll7p3p2l4%J6J5JJJJppl9l9k4RM6M6M0L9OORRQRJ9J9J9K0qqm1m2j5j6J8J9nnnnL1
$$ plain form
9236 62 23 18 -2 -23 -44 -32 23 80 101 88 72 56 55 54 78 103 115 93 83 107 143 180 191 203 198 193 196 198 184 170 129 88 80 73 79 86 60 35 48 95 140
9218 140 184 177 170 131 93 74 90 121 152 153 155 190 226 236 246 254 262 266 235 205 208 209 209 178 146 140 133 110 86 103 120 139 124 113 102 90 77 92 107 122 138
9200 138 177 216 240 230 192 153 146 140 137 135 132 129 121 112 103 94 122 149 177 205 224 244 246 249 234 218 167 83 -13 -75 -99 -89 -61 -34 -4 25 45 65 120 174 214
9182 214 254 257 226 196 166 190 215 214 213 213 212 227 242 257 272 293 315 325 300 268 270 308 379 428 420 390 359 312 265 220 175 168 196 259 321 356 357 345 333
9165 333 337 376 414 419 365 312 256 201 124 48 19 47 87 128 139 149 183 218 252 286 318 349 347 344 361 378 394 411 396 382 349 349 374 400 427 454 444
9149 444 434 437 474 506 505 444 350 280 245 245 245 229 213 196 180 181 183 184 185 178 171 163 156 131 106 83 60 72 117 194 237 231 190 167 144 133 122 111 100 105 110 146
9131 146 182 185 154 110 67 67 102 115 129 98 34 -8 5 38 71 74 77 104 131 158 185 228 270 332 360 348 337 323 309 298 286 275 263 254 244 266 288
9115 288 285 248 175 103 69 69 85 100 101 102 103 104 97 90 51 12 -12 -3 43 89 129 168 174 180 189 198 206 215 234 253 272 292 284 276 235 193 178 162 180 199 194 189 184 179 210
9096B10L1kloppokkL2L2nnk3J0QRJ0J1KLKKl2l2l2l2k8k9j4K1N3N4ml8l5l5l8l7k2k2qK6O0
9077G0O0K5rNOLMj5j5j3j3m7j3M4M5L5Jl7p0q8l2L7P0L4J%L3M2j4l6l7K3K3K0K1j3m7o0lM8
9059H8M8nnjkkkL3L4J8j5k5k4PQKKLKm2m3qrkkkkj%j9J4O1O0O1O0J9j6JJj4m8o1nL7L8j8n1
9039A73m7j3K2K3PQQQnnQM1N1J6o4r7r1l4J2M6K2j3m8m6J1J1J2J1ool8l8j8J6N3N1Q7Q6P0
9022B84L6Mk9o7o6l6kL4L4M3Rk9k8m5m4m2m2JL6M8M8Jl2m6m5K0N3K2j2lL0L1llL1M4M4qpq
9005B56qm7m8j0K4L5L4jl5k1k0k3k3l2l3KJMMNMj9k0mK9M5M5L2kj8j8k1k0n7n6n5n4j0K4L9
8987g2L9M7M7M6M5M0NK5K5K4K3j4m8l4l5klmmJ5j9m9m8j3K1L8L8K8oj5J8N1N2Kl2l2KN1N0
8970C02L8Lk5k5l0k9ll7n0m9k1J3K9K8jjL1L1J8j5n2n2l7l6kkkj%JK1N6R1R1Q7N4j0m4k1k0
$$ plain form
9096 210 241 239 236 230 223 216 210 208 206 238 270 265 260 237 247 255 264 274 285 287 290 292 294 262 230 198 166 138 109 95 116 169 223 219 181 146 111 73 36 14 -8 -16 10 70
9077 70 130 155 146 151 157 160 164 149 134 121 108 61 48 92 137 172 173 136 66 -22 -54 -17 53 87 88 88 121 163 149 113 76 99 122 142 163 150 103 43 40 88
9059 88 136 131 126 125 123 121 119 152 186 204 189 164 140 147 155 157 159 162 164 122 79 71 62 60 58 56 54 53 53 34 48 109 169 230 290 309 293 294 295 281 233 172 167 204 242 224 173
9039 173 126 113 135 158 165 173 181 189 184 179 187 228 279 295 231 134 43 9 21 67 89 76 28 -18 -7 4 16 27 21 15 -23 -61 -79 -63 -10 41 128 214 284
9022 284 320 324 295 228 162 126 124 158 192 235 244 215 187 142 98 56 14 15 51 99 147 148 116 70 25 45 98 120 108 105 135 166 163 160 191 235 279 271 264 256
9005 256 248 201 153 143 167 202 236 235 200 179 159 136 113 81 48 50 51 55 59 64 68 49 29 25 54 99 144 176 174 156 138 117 97 40 -16 -71 -125 -135 -111 -72
8987 -72 -33 14 61 107 152 192 197 222 247 271 294 280 232 198 163 161 158 154 150 165 146 97 49 36 57 95 133 161 155 140 158 209 261 263 231 199 201 252 302
8970 302 340 343 318 293 263 234 231 194 144 95 74 87 116 144 143 142 173 204 222 207 155 103 66 30 28 26 24 23 23 24 45 101 192 283 370 424 414 370 349 329
8953C29k3k2k1k1k0k1k3k4k4k4j7j7j8j7NOL9L9K9K9K9K8rroppK7Q5J20P2po3r7q5n0PPj6
8936B03j6j5j6k3k3J5M8L0L0kjk0k0J1J2J3k0l5l5qpqql5l5l5l4QPQPMKMMj7j7J6J5N5N4M0
8918A56Nj2j2J8J7J2k2l7l7k2k3qK6M2M2J0J0k3k2m2pK2K3Rk4l4l4J8J8L5Jj2j2K1N5N4K1
8902B32l2l2j9J5O4O4N0J5l2o5m7m6j1K3L9L8L1L2k5k5l2l3K4N8K6l0n2n3l1l1l0k9PM1N3
8887A57N4K9nk0k0J3J2k2n6o0k6j3j3pppol1l3KKkkk2J3J6J5J8J7J5J5J5J5M1M1M1M0J2J2
8870B43J0J0nl9m0nJKMMl9l8p1o9n1j6KL5N9N8K4j1k2k2J0RPPPPPPQPL8L8K4j1k2k3k5k5L2
8851A26L2L2L2LLLLk1k0j8j9LL7M9M9J1k3l5l6PM0M1Om2m1j0rj1j1j1j1J3J3J3J3k6k7j3K0
8834A65Rk6l6l6%L5M6M7K8oJ3J3K6K7l2o5n4k0mL0O0O0K6pk2J2Rk4l9m0l9l9m2rL0K9L9L9
$$ plain form
8953 329 306 284 263 242 222 201 178 154 130 106 89 72 54 37 42 48 87 126 155 184 213 241 232 223 217 210 203 230 315 435 507 500 437 340 255 205 212 219 203
8936 203 187 172 156 133 110 125 173 203 233 231 230 210 190 201 213 226 206 171 136 128 121 113 105 70 35 0 -34 -26 -19 -11 -4 0 2 6 10 -7 -24 -8 7 62 116 156
8918 156 161 149 137 155 172 184 162 125 88 66 43 35 61 103 145 155 165 142 120 78 71 93 116 125 101 67 33 51 69 104 105 93 81 102 157 211 232
8902 232 200 168 149 164 228 292 342 357 325 260 213 167 156 179 218 256 287 319 294 269 237 204 228 286 312 282 230 177 146 115 85 56 63 104 157
8887 157 211 240 235 215 195 208 220 198 142 82 56 43 30 23 16 9 3 -28 -61 -59 -57 -59 -61 -83 -70 -54 -39 -21 -4 11 26 41 56 97 138 179 219 231 243
8870 243 253 263 258 219 179 174 175 177 181 185 146 108 37 -32 -83 -99 -97 -62 -3 55 79 68 46 24 34 43 50 57 64 71 78 85 93 100 138 176 200 189 167 144 119 94 126
8851 126 158 190 222 225 228 231 234 213 193 175 156 159 196 245 294 305 282 247 211 218 258 299 305 263 222 212 203 192 181 170 159 172 185 198 211 185 158 145 165
8834 165 174 148 112 76 76 111 157 204 232 226 239 252 278 305 273 208 154 134 130 160 220 280 306 299 277 289 298 274 235 195 156 117 75 66 96 125 164 203
8818B03L9M0M3M4Ok8n9o0m6j3PPk4k5l6l5l3l3K1N6N5K2qrK2K1K8om4m3j0rrrMNNNK2K3Pk6
8800A20k4k3L1L0M7M6Rk4j3j3M2M1L8L9MMJ6J7J4m2p4p3j7J6RQJ1J0K3K2j1j2k5k6RQJ7J7
8783B71J6J5k9o3o2k9k2k1n0m9QO3N4K0lL0O1K8l1l2l3l4jjL6P0P0P1L5Kk4k4ONjl6m9m8k0
8766A99J4K8K9L3L3L3L3J6J7j8j8o9o9n6k3j1m5m1pK0N4L6L7J0J1J0J0K1K1J9J9K1j2n0n0
8751B55l9l9onK2K3M1Qk9k9o3o3p4l8K0K0K8K7N9O0K1j2OPK7K7K5K6l7p1n3k0K3K2J0k4l0
8735A25l0j8J7K6K7onnnonPOPPj3j4j3j3L7L7K2j2l6l7lkJ9N4O7O6Kl3j3j3j2j3j2j2m5m4
8717A06m7j3opl6l8j1j1K3K3L4L6k1k1l1l3KJK5K5L8M0Rk5o0o0m0oQRJ8J7N2N1O5O6K8ol6
8700A68l6k1k1QPPPk5k5m2m1l6l5J9J9J0k5l7l6qK6M1M1QQrrJ4J4L0L1J8J8L5L5L2L1kkml
$$ plain form
8818 203 242 282 325 369 375 347 288 228 182 169 176 183 159 134 98 63 30 -3 18 74 129 151 143 134 156 177 205 199 155 112 102 93 84 75 79 84 89 94 116 139 146 120
8800 120 96 73 104 134 181 227 236 212 199 186 228 269 307 346 350 354 370 387 401 359 285 212 195 211 220 228 239 249 272 294 283 271 246 220 229 237 254 271
8783 271 287 302 273 210 148 119 97 76 26 -23 -15 48 102 122 119 149 210 238 207 175 142 108 107 106 142 212 282 353 388 390 366 342 348 353 352 316 267 219 199
8766 199 213 241 270 303 336 369 402 418 435 417 399 330 261 205 182 171 126 85 78 98 152 188 225 235 246 256 266 287 308 327 346 367 355 305 255
8751 255 216 177 171 166 188 211 252 260 231 202 139 76 2 -36 -16 4 32 59 118 178 199 187 193 200 227 254 279 305 268 197 144 124 147 169 179 155 125
8735 125 95 77 94 120 147 141 136 131 126 120 115 122 128 135 142 129 115 102 89 126 163 185 173 137 100 97 95 114 168 235 301 303 270 257 244 232 219 207 195 150 106
8717 106 59 46 40 33 -3 -41 -52 -63 -40 -17 17 53 32 11 -20 -53 -51 -50 -25 0 38 78 87 62 2 -58 -98 -104 -96 -87 -69 -52 0 51 116 182 210 204 168
8700 168 132 111 90 98 105 112 119 94 69 27 -14 -50 -85 -66 -47 -37 -62 -99 -135 -143 -117 -76 -35 -27 -19 -28 -37 -23 -9 21 52 70 88 123 158 190 221 219 217 213 210
8682B10lmJ2J2m4m4l4l3l4l4%j%jK5K4K3K2Pk8o3o2m4j1K7K6K7K6oqoommL3O8M9M9MMLMj1
8664A70j0j0j1popprrrqLLk8k8l2%J5J5j0j1rj1NMk7k8nK9M2M4L8L9L9L8J%J%j4j3j6j6k1
8645A24n6n5k1N9O0L9j8l7lL1L1LLK0K0OOK1K1J5j9l4l3mmJ3J3K2K3Pk7m0l9J5J5K3K3K3K4
8628B70PPQPPPk8k7l1l2l2l2n3n3j9j8L8L9L8L9M9N0M9M9m8m8m8m8pqqqJ4J3k0k0m6m6j1j2
8611a2ppppK3K2K2K3ppK7K7M8M8qrlmlmrrP0P0kjkkk7k8k8k8j1j1j1j2klL1L1lmL1L0QPk7
8590B13k7m6m6m6m7%%j%j1j2j2j2onK8K8RJ0J0J1P3P4M0L9j9j8j9j9k5k4k5k4ppP2P2M9M8
8573C18pqk3k2n7n6m4m4lO5P2P2lln2n2j2N6P8P7M0k7m8m9j9j9l7l8p2p1LLO0N9M3M3RRJ5
8556B56J5J5J5j1j0m5m5PPk7k8k0k0N9N9j3j3j3j3k7k8k8k8RRRRK0K1K0K1lllkK8K9k8k8m2
$$ plain form
8682 210 207 203 215 227 183 139 105 72 38 4 4 3 3 2 27 51 74 96 103 75 12 -50 -94 -105 -78 -52 -25 1 -5 -13 -19 -25 -29 -33 0 68 117 166 170 174 177 181 170
8664 170 160 150 139 132 126 119 112 103 94 85 77 80 83 55 27 -5 -5 10 25 15 4 -5 -16 -11 -7 -34 -62 -67 -38 4 48 86 125 164 202 203 203 204 204 190 177 161 145 124
8645 124 68 13 -8 51 111 150 132 95 92 123 154 157 160 180 200 206 212 233 254 269 250 216 183 179 175 188 201 223 246 253 226 186 147 162 177 200 223 246 270
8628 270 277 284 292 299 306 313 285 258 227 195 163 131 78 25 6 -12 26 65 103 142 191 241 290 339 291 243 195 147 140 132 124 116 130 143 123 103 57 11 0 -12
8611 -12 -19 -26 -33 -40 -17 5 27 50 43 36 63 90 138 186 178 169 166 162 159 155 146 137 207 277 275 274 272 270 243 215 187 159 148 137 126 114 112 109 140 171 168 164 195 225 233 240 213
8590 213 186 140 94 48 1 1 1 0 0 -11 -23 -35 -47 -53 -58 -30 -2 7 17 27 38 111 185 225 264 245 227 208 189 164 140 115 91 84 77 149 221 270 318
8573 318 311 303 280 258 201 145 101 57 54 119 191 263 260 257 205 153 141 197 275 352 392 365 317 268 249 230 193 155 83 12 15 18 78 137 180 223 232 241 256
8556 256 271 286 301 290 280 235 190 197 204 177 149 129 109 168 227 214 201 188 175 148 120 92 64 73 82 91 100 120 141 161 182 179 176 173 171 199 228 200 172 130
8539A30m2J4J4LLLLM2M1j4j5l2l1K5K4OOONM9M9ppn6n5r0q8pqppK7K6O1O1RQM2M2K6K6l1l1
8520B23rrrqpoK4K5m0r7q1m7%L4J6J7M8M7M8M7M9N0Mn2n6k1J2J2l3l3l3l4KJN7N8N8N8k0k1
8503B74l7l8lmj2j2m5m6n7n5K2K2N4N5N4N4K9K9Mn2r8r8n4LK7K9O6O5M0M0M0M0QQm9m8k7k7
8487B01OPJ8J7J8J8j9j8n2n2l2l2JKJ8J7J7J8O2O3N9O0J2m4o8o9m2m2m3m2KKKKL2L2L2L2J5
8470B10J5k0j9j6j7j6j6k9k9NNl1l2l1l1J0J1J0J1j8j9L6L4J0k4n5k3L7O9Q5Q5O2K8J3J3r
8454C14rrrl1l1l1l1MNMNj0rj0j0j3j4j3j4K0K0j2j2K3N8L6L7ll6p2p1p7m4k5QL3L1N4K0m
8437G2lK6K6Nk9m2m1j0K4L9M0M3M3M4M3J0Rk4k4m0m0l8l7j4K1L3L3J0k4o1o1l1l0LKK6K7n
8420B5nqK5M0M0LLLLl5l5jkj2j1j2j2K8K9K9K8K3K2Qk7l1l1%%K6K6qql0l0MMP3P2P3P2LKn4
$$ plain form
8539 130 88 102 116 119 122 125 128 170 211 197 182 150 119 144 168 174 180 186 191 240 289 282 275 219 164 74 -14 -21 -29 -36 -43 -16 10 71 132 141 149 191 233 259 285 254 223
8520 223 214 205 196 188 181 175 199 224 184 87 6 -41 -41 -7 9 26 74 121 169 216 265 315 319 267 211 190 202 214 181 148 115 81 83 84 141 199 257 315 295 274
8503 274 237 199 196 192 180 168 123 77 20 -35 -13 9 63 118 172 226 255 284 288 236 138 40 -14 -11 16 45 111 176 216 256 296 336 344 352 303 255 228 201
8487 201 207 214 232 249 267 285 266 248 196 144 112 80 81 83 101 118 135 153 215 278 337 397 409 365 297 228 186 144 101 59 61 63 65 67 99 131 163 195 210
8470 210 225 205 186 170 153 137 121 92 63 68 73 42 10 -21 -52 -42 -31 -21 -10 -28 -47 -11 23 33 9 -46 -69 -32 37 122 207 269 297 310 323 314
8454 314 305 296 287 256 225 194 163 167 172 176 181 171 162 152 142 129 115 102 88 108 128 116 104 127 185 221 258 255 219 147 76 -1 -45 -70 -62 -29 2 56 76 72
8437 72 69 95 121 126 97 55 14 4 28 67 107 150 193 237 280 290 299 275 251 211 171 133 96 82 103 136 169 179 155 94 33 2 -28 -25 -23 3 30 25
8420 25 20 12 37 77 117 120 123 126 129 94 59 58 56 44 33 21 9 37 66 95 123 146 168 176 149 118 87 87 87 113 139 131 123 93 63 67 71 144 216 289 361 364 366 312
8401C12n4j4j5j4j5k7k7K9K9N5N4jkk3k2k2k3k5k5QRJ8J8J8J8l9l9J8J7L1L0llKJKKkkK9K8
8383C31k4r1n3n3jjjjJ2J2k2k2n8n7k4k4K6K5K6K4J3J3J3J3J4J5J1J1J8m9j08j08j9M9O7O6
8368D3L8L7j9j9M8M7M7M8k4k5k4k4RRRRk0k0J4J4K3K3j2j1KLKLj2j2M3M3ol9j9j8J3M6K5l1
8350B63o9p0n6k2j0K5M1M1MLk8k8l2JL9L9%%j9J5L4L4L6L6M1M1K7qm1m1pK6L1ln9n8n8k3r
8334A36qk6k5j1K3L9L9N8K4k8o2m3m3j8J6L1L1ONMMj5m9m9j6M9M9N1N1K2K1j3m8k9Nj6j7O
8317A54OL9M0J8J8J4J5jn8p6m3LL8K0K1oom1p5n2j8J7J8L7L8L8L7J6J6J4J4ml8j8j9mlk3J1
8300A57N7N6M5J0j7j7l8mK5K5K5K5K0j2n1n0o3o3o1o1k0J2lmL0O4O5L0j9k0k0k0J5M9K7K8
8285B22j2m6k7k7jkJJj6J8L3L3J3J3k1k1l9l8J7J8RRJ0Rj2j1j2j2jjjjlln8n7n5k2ppkjkj
$$ plain form
8401 312 258 244 229 215 200 173 146 175 204 259 313 312 310 287 265 243 220 195 170 178 187 205 223 241 259 220 181 199 216 247 277 274 271 273 274 276 278 276 274 303 331
8383 331 307 216 163 110 109 108 107 106 118 130 108 86 28 -29 -53 -77 -51 -26 0 24 37 50 63 76 90 105 116 127 145 96 -12 -120 -139 -90 -23 43
8368 43 81 118 99 80 128 175 222 270 246 221 197 173 182 191 200 209 189 169 183 197 220 243 231 220 222 225 227 230 218 206 249 292 286 247 228 210 223 269 294 263
8350 263 194 124 68 46 36 61 102 143 147 150 122 94 62 63 102 141 141 141 122 137 171 205 241 277 318 359 386 378 337 296 289 315 346 343 284 226 168 145 136
8334 136 128 102 77 66 89 128 167 225 249 221 159 116 73 55 71 102 133 139 144 148 152 137 88 39 23 72 121 172 223 245 266 253 205 176 181 165 148 154
8317 154 160 199 239 257 275 289 304 303 245 169 126 129 167 187 208 202 196 155 80 28 10 27 45 82 120 158 195 211 227 241 255 251 213 195 176 172 169 146 157
8300 157 214 270 315 325 308 291 253 249 274 299 324 349 369 357 306 256 193 130 69 8 -12 0 -3 -7 23 87 152 182 163 143 123 103 118 167 194 222
8285 222 210 164 137 110 109 107 108 109 93 111 144 177 190 203 182 161 122 84 101 119 128 137 147 156 144 133 121 109 108 107 106 105 102 99 41 -16 -71 -93 -100 -107 -109 -110 -112 -113
8265a13N9N9M5J1j7j6l7nO5O6L3m5o6o4l1LL2O6M9N0K7K7M6J2l3l4k0J3O0O0L0m9p8m4J1J2
8250A84K1K2j0j0k9OK0K0J7J8J7J7lklkm4m3p8p7j6j6M0M1L0L0mmJ0J0J0J0l1l1l1l2lmml
8233D3k3k1J0J2JJJJL2L2L3L2L7L7MLk1k2k1k1j2j1j2j1L2L1kkqrM8M8K7K6pqk9k9k9l0m6
8215A17m6J0J0N7N7K3K3l9l8l9l9j6j6j7j6j9j9N9O0N9O0K6K6OOPOJ9J8J8J9j5j5j4j5l0l1
8199B62o4o4rrK5K5MMLML7L6L6L7L9L9j7j7k2k2J2J3J8J7q1q2p8m5k7k8OM1N3N2K4rm6m5m4
8182G8j1QM1M1M0RQONOOk2k1k1k2rj0K5K4K7K8K7K8j9j8j9j8j%J8j5l1l1l1l0lL2M5M4K0j4
8164B20j5K0M3M4Qk6l3l3jjPPk5k5m6j2K5K6J7J8J8J8qpqpj9j8lL0O1O1K5qm4m4j3j2KJl2
8146B11l2j9k0L5L5M0Nrj0j8j9j8j9m0m0k4QM5M5J3J4J4J5J4J5j2j1j1j1j3j2l2KM8M8ppO
$$ plain form
8265 -113 -54 5 50 61 44 28 -9 -14 51 117 150 105 39 -25 -56 -53 -21 45 94 144 171 198 244 256 223 189 169 182 242 302 332 283 205 161 172 184
8250 184 205 227 217 207 178 184 204 224 241 259 276 293 290 288 285 283 239 196 118 41 25 9 49 90 120 150 146 142 152 162 172 182 151 120 89 57 54 50 46 43
8233 43 20 -1 9 21 22 23 24 25 57 89 122 154 191 228 232 235 214 192 171 150 138 127 115 104 136 167 165 163 155 146 194 242 269 295 288 280 251 222 193 163 117
8215 117 71 81 91 148 205 228 251 212 174 135 96 80 64 47 31 12 -7 52 112 171 231 257 283 289 295 302 308 327 345 363 382 367 352 338 323 293 262
8199 262 198 134 125 116 141 166 170 174 177 181 218 254 290 327 366 405 388 371 349 327 339 352 370 387 306 224 146 101 74 46 52 93 146 198 222 213 167 122 78
8182 78 67 75 116 157 197 206 214 220 225 231 237 215 194 173 151 142 132 157 181 208 236 263 291 272 254 235 217 216 216 234 219 188 157 126 96 93 125 170 214 234 220
8164 220 205 225 268 312 320 294 261 228 227 226 233 240 215 190 144 132 157 183 200 218 236 254 246 239 231 224 205 187 184 214 275 336 361 353 309 265 252 240 242 243 211
8146 211 179 160 140 175 210 250 255 246 236 218 199 181 162 122 82 58 66 111 156 169 183 197 212 226 241 229 218 207 196 183 171 139 141 189 237 230 223 229
8130B29NNOj3j3j3j3J1J0RQJ4k0l5l4j9j8n1n0nK8J0J0M2M3Nk8n0n0j5K0M1M1K8nj2j3l3%
8113G5L5L4Jl3k7PNl0l1l1l1l1OL9L9Oj6j5L9L9L2L2J7j7n7n8n5n6j5M1Q6Q6N7K4j4j3j%l5
8096A34l4l9l8l8l8k5k5k3k3J7N1O6O5Q4Q3M7J3m1m1j0rJ6J7J6J7j3j2j2j3j8j8j8j7kkjk
8080A14rj0K5K4L9L8K4j0o9o9l7l7L1L0llm3m2mO3Q1M7l1l2NNNNpopok0k0L7L6M7M8J3J3l2
8062B33l3o2o2j2N5J12P7Rn9r7o2k8OK2K3L8L8L8L8m2m2m2m2K4K4K4K4j7j6M0M0QRQQK8K7
8046C37n1n2n7n7k3k3POM1M0P1P0J4J3j3j4j4j4oom1m0k6k6QPj2j2j2j2K5K6rqk2k1J3J2J2
8029A31J1m5m6poK7K7L1L2m8m8k0k1J3J4j4j3m5m5o5l2OOL2L1K9K9K5rk1k2J9N1N3J8j3j3
8013E2JL6O0R4R3O1J4j9n6n6o7l4K7K7K0J9j5j4%%%JppN1Q4N3J8j7j7k7k7k8k7rrk2n6o2k9
$$ plain form
8130 229 234 239 245 232 219 206 193 204 214 223 231 245 225 190 156 137 119 68 18 13 41 51 61 103 146 151 123 73 23 8 28 69 110 138 133 121 108 75 75
8113 75 110 144 145 112 85 92 97 67 36 5 -26 -57 -51 -12 27 33 17 2 41 80 112 144 161 144 87 29 -26 -82 -97 -56 30 116 173 197 183 170 169 169 134
8096 134 100 61 23 -15 -53 -78 -103 -126 -149 -132 -81 -15 50 134 217 264 277 236 195 185 176 192 209 225 242 229 217 205 192 174 156 138 121 119 117 116 114
8080 114 105 95 120 144 183 221 245 235 166 97 60 23 54 84 81 78 35 -7 -11 52 133 180 149 117 122 127 132 137 130 124 117 111 91 71 108 144 191 239 252 265 233
8062 233 200 138 76 64 119 231 308 317 258 161 99 71 77 99 122 160 198 236 274 232 190 148 106 130 154 178 202 185 169 209 249 257 266 274 282 310 337
8046 337 286 234 177 120 97 74 81 87 128 168 239 309 323 336 323 309 295 281 275 269 228 188 162 136 144 151 139 127 115 103 128 154 145 137 115 94 107 119 131
8029 131 142 97 51 44 38 65 92 123 155 107 59 39 18 31 45 31 18 -27 -72 -137 -169 -163 -157 -125 -94 -65 -36 -11 -20 -41 -63 -44 7 60 78 65 52
8013 52 53 89 149 243 336 397 411 392 336 280 213 179 206 233 253 272 257 243 243 243 243 244 237 230 281 365 418 436 419 402 375 348 320 293 284 275 253 197 135 106
7996A06RM4L4L4L6L6j3j3j3j3j0j1NL9K8K9L1L1rrm4m3m1m2J3J3J8j7l2l1KLK3j0l1KJ5J5
7979A84j2j2l3%ol9j9j8QQOOJ3k0l4l2K1N6L8L7K1K1M0Ol2l3l3l2l7lN5N5j4m7k8k9l1l1m9
7962d9j5K8O1M3M3Ll0l1MJ9K0l3l3j8J6lmj2j2K0K1N2N2L7Lk9k9j6J7K2K1K4K4j7j6J5J5j9
7946A94n3n3j9J2J3J5J5j6j7j4j4J3M7M7J3%%lkK8K7O0N9L4Jj5j5JJl3l3m5m6j4j4rm4n6n6
7929Il7nJ0J1nnnnooooK5K6j0m4l7lRRJ4J3M7M6M3M2M2M3M5M5K6pn1j07r7o3l2l4l1l1l0l0
7911a88QM2N0N0N1N2kln8n8PPO3O3L4L5L5L4M4M4J0J0k5k4k5k4k3k2k2k2j6j5J8J8j3j3j3
7895A09j4klklmmmmL3L3L3L2j6j7j6j7%%j%k1k2J3J2J3J3J3J3K6K5K5K5k5k5RRJ7J8J7J8j
7877C05%%%k5k5k5k5l2l1l1l2K1K0N5N4QQQPO1O1K7K7o8o8l4l5m8m9q3q2k4k4N5N4L5L6L5
$$ plain form
7996 106 115 159 193 227 263 299 286 273 260 247 237 226 231 270 298 327 358 389 380 371 327 284 243 201 214 227 245 228 196 165 167 170 193 183 152 154 169 184
7979 184 172 160 127 127 121 82 63 45 53 61 67 73 86 66 32 0 21 77 115 152 173 194 234 240 208 175 142 110 73 70 125 180 166 119 91 62 31 0 -49
7962 -49 -64 -36 25 68 111 114 84 53 57 76 96 63 30 12 28 25 21 9 -3 17 38 90 142 179 182 153 124 108 125 147 168 192 216 199 183 198 213 194
7946 194 141 88 69 81 94 109 124 108 91 77 63 76 123 170 183 183 183 180 178 206 233 293 352 386 387 372 357 358 359 326 293 248 202 188 174 165 121 65 9
7929 9 -28 -33 -23 -12 -17 -22 -27 -32 -38 -44 -50 -56 -31 -5 -15 -59 -96 -99 -90 -81 -67 -54 -7 39 82 124 166 209 254 299 325 318 267 160 63 0 -32 -66 -97 -128 -158 -188
7911 -188 -180 -138 -88 -38 13 65 63 60 2 -56 -49 -42 21 84 118 153 188 222 266 310 320 330 305 281 256 232 209 187 165 143 127 112 130 148 135 122 109
7895 109 95 93 90 88 85 81 77 73 69 102 135 168 200 184 167 151 134 134 134 133 133 112 90 103 115 128 141 154 167 193 218 243 268 243 218 227 236 253 271 288 306 305
7877 305 305 305 305 280 255 230 205 173 142 111 79 100 120 175 229 237 245 253 260 321 382 409 436 368 300 266 231 183 134 51 -31 -55 -79 -24 30 65 101 136
7860A36L5K1K0K1K0K0J9J9J9m4m4m3m4K0K0N4N4J7J7j7j6llkll2l2JKk0k0k0k1K7K6pqlll
7843A80lj3j4j4j3jjjjlmllK4K5j0j0J6J6J6J5nnl8l9p5p4n6J1L9L9RRK4K4l3l2j8j8J6J6
7825hO1O2ONK9K9K9K9pqK7K6l4l4l4l5n7n7n7n7K4K3K4K2J0RJ0J0LMMMPPPQppM9N0j4j3j4
7806A35j3J9K0J9J9K6K7Qo0o6o5RRj1j1j1j1JKL5L5L6L5L5L6M1M1o0o0l5l4l4l4j7j8j7j7
7790A4ONN8N9M5j1n9n8n3n2j9j8L3L4L3L4M7M6J3J3m7m8m7m6n0n0OPM4M4M3M5J1J1k3k3K4
7774G1K4j1j0l3l4K3K3NOONJ2J1J1J1J7J7M8M7jn7m7j2J6j7n2n3k0k0k0k1K6K7N9O0K5K5K5
7758A92K5J2J3k1k1k1k1J3J3J2J2J2J1jjq1q0n4n3K6K4L5L6JJOOk9k8m8m8kN5R9J00M3Rj5
7741B32j5j8j7qqqqk2k2k2k2l7l6l6l7K6K6K7K5N8N7M3Rj2j2j4j4lklkJ6J7j6j5j4K0K0j4
$$ plain form
7860 136 171 192 212 233 253 273 292 311 330 286 242 199 155 175 195 249 303 320 337 320 304 301 298 296 293 261 229 230 232 212 192 172 151 178 204 197 189 186 183 180
7843 180 177 164 150 136 123 122 121 120 119 116 112 109 106 130 155 145 135 151 167 183 198 193 188 150 111 36 -38 -94 -83 -44 -5 4 13 37 61 28 -4 -22 -40 -24 -8
7825 -8 53 115 121 126 155 184 213 242 235 227 254 280 246 212 178 143 86 29 -28 -85 -61 -38 -14 8 18 27 37 47 50 54 58 62 69 76 83 91 84 77 126 176 162 149 135
7806 135 122 141 161 180 199 225 252 260 200 134 69 78 87 76 65 54 43 44 46 81 116 152 187 222 258 299 340 280 220 185 151 117 83 66 48 31 14
7790 14 20 25 83 142 187 176 117 59 6 -46 -65 -83 -50 -16 17 51 98 144 157 170 123 75 28 -18 -68 -118 -112 -105 -61 -17 26 71 82 93 70 47 71
7774 71 95 84 74 41 7 30 53 58 64 70 75 87 98 109 120 137 154 202 249 248 191 144 132 148 131 79 26 6 -14 -34 -55 -29 -2 57 117 142 167 192
7758 192 217 229 242 221 200 179 158 171 184 196 208 220 231 230 229 148 68 14 -39 -13 11 46 82 83 84 90 96 67 39 -9 -57 -59 -4 95 195 238 247 232
7741 232 217 199 182 174 166 158 150 128 106 84 62 25 -11 -47 -84 -58 -32 -5 20 78 135 178 187 175 163 149 135 132 130 127 125 141 158 142 127 113 133 153 139
7724A39j0j0K2K2J9J9J7J7K0j4m9n0j0K3Ln4p7p6m1oK6O0M2M3J8J8J8J8J2J2L0lk4k5n9n9
7709C1p2l9KL6K8K7mmONOOK3K3K4K3J7J8J7J8J3J3J6J5K9O3O2K9lmonj4j4j4j4m9m8m7m6P
7691A74M1P3L9k2n5n8k4k3k3n2n2m5j2M8Q3O6L2lmk8k9NNJ7J6J7J7j3j2j2j3%J%%OOK2N5O1
7674C04O0M6J2m6p9q0m6l1LJ8J8ml7l8lL9M0M1M2K9K9K8K7Ll1o3o4m2L6O8O9K8nk0k1k4k3
7658B83k4k4k6k5k6k6m1m1lL0L3L3L4L3J9j4MNk5k6k5k5nopqJ0k5k4J0O2O3K7ok1k0J1J2Q
7641B04Rm6m6m0pQQk7k6k7k5lklkL1L2L2L2N4N4L8Lj4m7o2o2mL1J1J1j0j1j0j1M1M0K6rm3
7623A28m2j2j1j0j0j1j0k1j9L3L4K1j3OOL9L9L9L9P1P0J3k1k6PK0K0k0k0k0k0QQPQlklkj9
7606C01k0J5J4j7j8nK9pm2k0k1PQNNJ0k4l9l9NMj1m4m2m1pK8O0O1K4qj8j7k0j9ooK9K8L8L8
$$ plain form
7724 139 129 119 141 163 182 201 218 235 255 241 192 142 132 155 158 104 27 -49 -90 -96 -70 -10 32 75 93 111 129 147 159 171 201 198 174 149 90 31
7709 31 -41 -80 -78 -42 -14 13 9 5 11 16 22 28 51 74 98 121 138 156 173 191 204 217 233 248 277 340 402 431 428 424 418 413 399 385 371 357 308 260 213 167 174
7691 174 215 288 327 305 250 192 168 145 122 70 18 -27 -39 9 92 158 190 187 183 155 126 131 136 153 169 186 203 190 178 166 153 153 154 154 154 160 166 188 243 304
7674 304 364 410 422 376 297 217 171 140 143 161 179 175 138 100 97 136 176 217 259 288 317 345 372 375 344 281 217 175 211 279 348 376 371 351 330 306 283
7658 283 259 235 209 184 158 132 91 50 47 77 110 143 177 210 229 215 219 224 199 173 148 123 118 112 105 97 107 82 58 68 130 193 220 214 193 173 184 196 204
7641 204 213 167 121 81 74 82 90 63 37 10 -15 -18 -20 -23 -25 6 38 70 102 156 210 248 251 237 190 128 66 62 93 104 115 105 94 84 73 114 154 180 171 128
7623 128 86 74 63 53 43 32 22 1 -18 15 49 70 57 63 69 108 147 186 225 296 366 379 358 332 339 359 379 359 339 319 299 307 315 322 330 327 325 322 320 301
7606 301 281 296 310 293 275 270 299 292 250 230 209 216 224 229 234 244 220 181 142 147 151 140 96 54 13 6 34 94 155 179 171 153 136 116 97 91 85 114 142 180 218
7588B18L5L5j1o6o7o7j6J7kjK7K8K5K6Mk9l0NN7N8P6M3J3k2l8l9oopok1k1J2J3QQk6k5l0l1
7571A41l0l0K0J9J9J9QRRQJ3J3jl6n1n1j9k0j8j8J4J3Nk8o3o4kL2J5J5J3M6Q2Q2L9Nl0l1M
7554A51L7J9J8NMNNl8l8k3J1M9M9N1N0K5K4j0j0k4k3k4k3lkklK3K3J1k4j9J4K6K5ll7j7j8
7537B84k2k1k2k2j4j3j2j1L2O6M7M7K8K8J3k1m8m9m8m8n6k2L9L8J0J0J0J0KJJKllllJ1J1J1
7520B60J1k2k3k2k2L6L6LKj0rj0j0m7m7m7m7o5o6J3J3N3N1N3N2QPPQj3j3m6m7l4l3K2K2K3
7504D7K2K3K2L8L8L9L8JJl3l2l4l3l3l4J9J9J5J5J8l9q3q2j1M6M7M8j0rrj0j5j5j4j5l4l4
7488h3%%M3M2M4M3P5P5J9J8n6n7j06p1pM8N4N3M8M7J3J3J7J7J7J6qqo5o5QPM1M1J9K0J9J9
7471C50pqqpj1j1K2K3J5J4k0j9k0j9k0k0m9m9QM3N7K4l5l4j0j0J2k3l8nL4O9N6N7K5K5k5k6
$$ plain form
7588 218 253 288 277 211 144 77 61 78 76 75 102 130 155 181 185 156 126 131 188 246 322 365 378 356 318 279 273 267 260 254 233 212 224 237 245 253 227 202 172 141
7571 141 111 81 101 120 139 158 166 175 184 192 205 218 217 181 130 79 60 40 22 4 18 31 36 8 -55 -119 -121 -89 -74 -59 -46 0 82 164 203 208 178 147 151
7554 151 188 207 225 230 234 239 244 206 168 145 156 205 254 305 355 380 404 394 384 360 337 313 290 287 285 283 280 303 326 337 313 294 308 334 359 356 319 302 284
7537 284 262 241 219 197 183 170 158 147 179 245 292 339 367 395 408 387 339 290 242 194 138 116 155 193 203 213 223 233 235 236 237 239 236 233 230 227 238 249 260
7520 260 271 249 226 204 182 218 254 257 259 249 240 230 220 173 126 79 32 -33 -99 -86 -73 -20 31 84 136 144 151 158 166 153 140 94 47 13 -20 2 24 47
7504 47 69 92 114 152 190 229 267 268 269 236 204 170 137 104 70 89 108 123 138 156 117 34 -48 -59 -13 34 82 72 63 54 44 29 14 0 -15 -49 -83
7488 -83 -83 -83 -40 2 46 89 164 239 258 276 220 163 57 -14 -21 27 81 134 182 229 242 255 272 289 306 322 314 306 241 176 184 191 232 273 292 312 331 350
7471 350 343 335 327 320 309 298 320 343 358 372 352 333 313 294 274 254 205 156 164 207 264 288 253 219 209 199 211 188 150 145 179 248 304 361 386 411 386 360
7455C60k6k6j1j2j2j1l9l9nnK0K0L3O7Q2M8J3J2J0J0k4k5k3k2k1k1J7N2L2L2mnmnm6m7m7m6
7438B82k8k8k8k8l1l0k8k8K8O2L0mQM1N2mo1o0l1l0j8j8j8j8K6K6K4K4J4k1n4n3k8K8N3N3
7423A04j0j1K7O1M5M5J3J4J4J3L3jl6l7n8k4QRk5n9o3k9j7j6j1j2Pk6n4n4k2k3L7L8L7L7N
7407d1OL8M0J8J7j6j6QRk5k6J2J1J1J2K0K0J9K0K6K5n3n4m0l9J7J6L8L8NMJ0J0M3M4K2K2j2
7390B59j2m5m5m5m5m4m2m0m0j0M7P1P2M3M4M3M4mmlmj8j9pK6K0l8j01j02o4qL8L8KLl1l1K2
7374c0K2P7P9K2K2l4l4j3j3j2j3nnnnjjL3L3K3K3j1j1j5j6j5j5MNMMJ9J8J9J8j3j3j3j4n3
7356F5n4LLO5O5O5O4J5J5J4J5k4k4k3k4kkN5N4K1K2J8J7j9p5r6o3nnllL1L2L1L2k1k1k2k1
7340A95J6J5J6J6j1j1j1j1KKl2l3j2j3K2K1KKl3l2k6k6QQN1N2N1N2k8k8k7k8k8k8k7k8N1N2
$$ plain form
7455 360 334 308 297 285 273 262 223 184 179 174 194 214 247 314 396 444 457 469 479 489 465 440 417 395 374 353 370 422 454 486 482 477 473 468 422 375 328 282
7438 282 254 226 198 170 139 109 81 53 81 143 173 169 177 218 270 266 205 145 114 84 66 48 30 12 38 64 88 112 126 105 51 -2 -30 -2 51 104
7423 104 94 83 110 171 216 261 274 288 302 315 348 347 311 274 216 192 200 209 184 125 62 33 16 0 -11 -23 -16 -42 -96 -150 -172 -195 -158 -120 -83 -46 -41
7407 -41 -35 3 43 61 78 62 46 54 63 38 12 24 35 46 58 78 98 117 137 163 188 135 81 41 2 19 35 73 111 116 120 130 140 183 227 249 271 259
7390 259 247 202 157 112 67 23 -19 -59 -99 -109 -62 9 81 124 168 211 255 251 247 244 240 222 203 196 222 242 204 103 1 -63 -71 -33 5 7 10 -21 -52 -30
7374 -30 -8 69 148 170 192 158 124 111 98 86 73 68 63 58 53 52 51 84 117 140 163 152 141 126 110 95 80 84 89 93 97 116 134 153 171 158 145 132 118 65
7356 65 11 14 17 82 147 212 276 291 306 320 335 311 287 264 240 238 236 291 345 366 388 406 423 404 329 233 170 165 160 157 154 185 217 248 280 259 238 216 195
7340 195 211 226 242 258 247 236 225 214 216 218 186 153 141 128 150 171 173 175 142 110 84 58 66 74 125 177 228 280 252 224 197 169 141 113 86 58 109 161
7323A61N1N2J3J2J3J3MMk9l0J1J0M5M4J1J0k4k3j8j8n2n2l3l2JJ%%%%J4J4J4J5l1l0MMl1l2
7306H6l1l1o3o5l0l1N1N0J7J6J0J0M3M5J1J1J1J1NNNMJ6J7J6J6k1k0k1k1k2k2k2k2noooLL
7288A7L7L7M5M5j2j2j0j1M7M6J4J5J4J5N3N3Nn1p7p6j5M3M9pp0p0l1K6N0N0L1L0L0L1j6j7
7273C08j6j6K2K2j2j2JJl3l3j6j7j7j7mnK9K9m5m5j1j1llklJ2J2J3J2J7J7j7j7j3j3j4j3J5
7256A02J6J5J6L6L5L6L6QRk5k5l2l2KJLKLKj5j4J9J9K2K2K2K2k3k3J1J1RRk5k5j6j6n0n0l0
7239H7l0MMl2l2LKM5M4M5M4K1K1K0K1l0k9MNl7l6l6l6rrqrM9N0M9M9popoJKl2l3k7k7K9K9
7220A50K9K9mnM5M6J1J2LLKLm5m5m5m5l2l3KKL0L1mll8l8J9J8K9K8k8k8LKN9N9M3M3RRj7j7
7202B92j6j7klklqqK6K6l4l3l3l4J1J1M5M5k0k0n4n4qqpqK3K3K4K3P4P3J8J7j5j4J5J6k3p9
$$ plain form
7323 161 212 264 277 289 302 315 319 323 294 264 275 285 330 374 385 395 371 348 330 312 260 208 175 143 144 145 145 145 145 145 159 173 187 202 171 141 145 149 118 86
7306 86 55 24 -39 -104 -134 -165 -114 -64 -47 -31 -21 -11 32 77 88 99 110 121 126 131 136 140 156 173 189 205 184 164 143 122 100 78 56 34 29 23 17 11 14 17
7288 17 54 91 136 181 169 157 147 136 183 229 243 258 272 287 340 393 398 347 270 194 179 222 271 264 194 124 93 119 169 219 250 280 310 341 325 308
7273 308 292 276 298 320 308 296 297 298 265 232 216 199 182 165 161 156 185 214 169 124 113 102 99 96 94 91 103 115 128 140 157 174 157 140 127 114 100 87 102
7256 102 118 133 149 185 220 256 292 300 309 284 259 227 195 197 198 201 203 206 208 193 179 198 217 239 261 283 305 282 259 270 281 290 299 274 249 233 217 167 117 87
7239 87 57 61 65 33 1 4 6 51 95 140 184 205 226 246 267 237 208 212 217 180 144 108 72 63 54 46 37 86 136 185 234 227 221 214 208 209 211 179 146 119 92 121 150
7220 150 179 208 204 199 244 290 301 313 316 319 321 324 279 234 189 144 112 79 81 83 113 144 140 137 99 61 80 98 127 155 127 99 102 104 163 222 265 308 317 326 309 292
7202 292 276 259 257 254 252 249 241 233 259 285 251 218 185 151 162 173 218 263 243 223 169 115 107 99 92 84 107 130 154 177 251 324 342 359 344 330 345 361 338 259
7184B59q1q1k9l0NNJ5J4J4J5j4j4j4j3N5N5J0m7n2j9J6J5RRQRK7K6qpQQO4O5N1N0k8k8k2k3
7167C02nnPQK4K5l2l2l1l2opooj8j9l1l2j2M5P0O9L1L1mlrrK5K4n6n6p4p3j9k0L7L7M1M1Q
7149B28P%Jj7j6j7j7M0M0j5j5l2l2k7k7J7P3N4mo4o5j8O1R5R6L0K9mmmnl8l9n5n6JJL4L3%
7132B69%k1k0J4J4k5k4RRj7j8%%l0k9l0l0L3L2kjo0n9J9K0J1J0K8K7K1K1MMM1M1PQO2O3M6
7115D47M5%jl4l5q7q7l1l0jkj8j8M1M1M1M1j4j3m8m8k8k8o2o2k0k1L4L5J8J9l9l7l8l9J9J8
7099d2L9L8j7j7J4J4k0k0k0k0J4J3J5J4M9M9L7L8m2p5p1mN5R0O1po9o8n2n3l4L3P5P5O2pj2
7082A35j3j7j6m2m2oqkjJ4J5N1N0J7J6j2j2j2j2K8K8l8r5o9j5L1O4P4L9MMJ2J1k3k2l5l5l1
7066C5l1%N6R8O5J1k3ooqpm2m1n1n0ONM9M8M8M8JKJKj8j8J7J6L0K9L0L0nml9l9k7k7K9K9K6
$$ plain form
7184 259 178 97 68 38 43 48 63 77 91 106 92 78 64 51 106 161 171 124 72 53 69 84 93 102 110 119 146 172 164 157 165 173 237 302 353 403 375 347 325 302
7167 302 297 292 299 307 331 356 324 292 261 229 223 216 210 204 186 167 136 104 92 137 207 276 307 338 334 331 322 313 338 362 306 250 176 103 84 64 101 138 179 220 228
7149 228 235 235 236 219 203 186 169 209 249 234 219 187 155 128 101 118 191 245 241 177 112 94 155 250 346 376 405 401 397 393 388 350 311 256 200 201 202 236 269 269
7132 269 269 248 228 242 256 231 207 216 225 208 190 190 190 160 131 101 71 104 136 134 133 73 14 33 53 64 74 102 129 150 171 175 179 220 261 268 276 338 401 447
7115 447 492 492 491 457 422 335 248 217 187 186 184 166 148 189 230 271 312 298 285 237 189 161 133 71 9 -11 -32 2 37 55 74 35 -2 -40 -79 -60 -42
7099 -42 -3 35 18 1 15 29 9 -11 -31 -51 -37 -24 -9 5 54 103 140 178 136 61 -10 -14 41 131 192 185 116 48 -4 -57 -91 -58 17 92 154 147 135
7082 135 122 105 89 47 5 -1 -9 -11 -12 2 17 68 118 135 151 139 127 115 103 131 159 121 26 -43 -58 -27 37 111 150 154 158 170 181 158 136 101 66 35
7066 35 4 4 60 158 223 234 211 205 199 191 184 142 101 50 0 6 11 60 108 156 204 205 207 208 210 192 174 191 207 237 266 296 326 321 317 278 239 212 185 214 243 269
7048B69K7K6K6m6m6m6m6lmL0L0K7K6l0l0l3l3l3l3KKKLPQO1O1M7j0n7n7m4m4J2J2N6N5P1L8
7031C03po3q4n1j6J8L5L4M1M0l9l9k0k0k1k0MMO1O1L1L2k5k6m5m6m5m6K7K7ppl5l5%jL8L7
7014I5MLmmmmn6n5k0j9O7J01Q1K4l1l1l5l4oonoopoorj0K5K5N0N1opjkL2L2J1J2k2k3nnm0
6995A38l9n6n6l8mN5J10R8O4Rk4qqrrM4M5J7l9o4o4ppK8K7O4O3QPm0m1m1m0j7j7j6j7MNO1
6978A86O1M6M6n3n4pK7J0m7n4KK4K3K7K6K6K7o3o3k9k9NOONJ5J6J5J5l1l0k9k8mL0M3M3jl5
6961A73l5jK6K6K9K8K9K9Nn2q2q2m8j4L9L8OPNNK7qjL3L0ll5l6mlj4j5l3JN6N6M4Rj8j7j8
6943A82j8m8j4M5M6J2J2J2J2jjjjK2K2j3j2l8l8jL3M3M3rrKL6L3%l4o8n1n1j8j9j8j8llL1
6926I9L1J8J8j6j6j4j4K0K0K9K9K9K9k8k9j3K1K9K9K9K9j4m9k9k9j3j2l1LO5O5J9l7p1p2l6
$$ plain form
7048 269 296 322 348 302 256 210 164 161 157 187 217 244 270 240 210 177 144 111 78 80 82 84 87 94 102 163 224 271 261 204 147 103 59 71 83 139 194 265 303
7031 303 296 233 149 98 82 100 135 169 210 250 211 172 152 132 111 91 95 99 160 221 252 284 259 233 188 142 97 51 78 105 98 91 56 21 21 20 58 95
7014 95 99 102 98 94 90 86 30 -25 -45 -64 3 104 185 209 178 147 112 78 72 66 61 55 49 42 36 30 21 11 36 61 111 162 156 149 148 146 178 210 221 233 211 188 183 178 138
6995 138 99 43 -13 -51 -55 0 110 208 272 281 257 249 241 232 223 267 312 329 290 226 162 155 148 176 203 267 330 338 345 305 264 223 183 166 149 133 116 120 125 186
6978 186 247 293 339 286 232 225 252 262 215 161 163 187 210 237 263 289 316 253 190 161 132 137 143 149 154 169 185 200 215 184 154 125 97 93 123 166 209 208 173
6961 173 138 137 163 189 218 246 275 304 309 257 175 93 45 31 70 108 114 121 126 131 158 150 149 182 212 209 174 138 134 131 117 102 69 70 126 182 226 235 217 200 182
6943 182 164 116 102 147 193 205 217 229 241 240 239 238 237 259 281 268 256 218 180 179 212 255 298 289 280 282 318 351 351 317 249 198 147 129 110 92 74 71 68 99
6926 99 130 148 166 150 134 120 106 126 146 175 204 233 262 234 205 192 213 242 271 300 329 315 266 237 208 195 183 152 155 220 285 304 267 196 124 88
6910H8jQM3O0N9L7L8L5L5K2j1j2K2K4K4j7p5p2j5K6K6k9o2l0LL2kn8n8k6QJ0k4j8J6K8K9j7
6893A46j6J7J7K3K3j1j1k0j9L8L7M2M2K8pn8n9m6j1JKLMQRQRj1j2j3j3j2m6m4j0L5O9Q3Q3
6877C08Q9N4rm3k5k6k8k8k8k7k7k7n7n7k3k3j8j7J9N3N3N3N3N3J3k1k0J3K4K4l2o6m1qK7K8
6861B13J2J3J2J3j3j4j3j3k5k5k5k6j3j3J8J9K9nnK9J5J4J7J7J8J8j6j5l5l4lkj7n1o5o4P
6845b8PPPNMNNkl%%M6Q1N9N9M5J2k9o4m9n0n0n0mK9L0nl1l1J%L1L0O5O4N8N8N5N4J4m3o5o6
6826B61j4K0JJj9j9l8mK3K2j0m4l1LJ6J6k4k3j1K3Rk5l8l7lkkkJ1J2M5M6J0J1J0J0j7j7n1
6809A19n0KLLLl5l5j0M6R5R6L9Nl1l0l3l3l3l3K4K3K2K3K2K2M0M0M0M0J8J9J9J9Q7Q8J1o8
6793E77p0j4K5rq0p9n9l%l3j2j1j8j8j9j8l2l1l2l1j8j7L8L9OPk8k8K8K8K8K8l1l1LLK7K6
$$ plain form
6910 88 87 95 138 198 257 294 332 367 402 424 413 401 423 447 471 454 379 307 292 318 344 315 253 223 226 258 256 198 140 114 122 132 108 90 106 134 163 146
6893 146 130 147 164 187 210 199 188 168 149 187 224 266 308 336 329 271 212 166 155 156 158 161 165 173 182 190 199 188 176 163 150 138 92 48 38 73 142 225 308
6877 308 397 451 442 399 374 348 320 292 264 237 210 183 126 69 46 23 5 -12 7 60 113 166 219 272 285 264 244 257 281 305 273 207 166 158 185 213
6861 213 225 238 250 263 250 236 223 210 185 160 135 109 96 83 101 120 149 144 139 168 183 197 214 231 249 267 251 236 201 167 164 162 145 94 29 -35 -28
6845 -28 -21 -14 -7 -2 2 7 12 10 7 7 7 53 134 193 252 297 309 280 216 167 117 67 17 13 42 72 67 36 5 6 6 37 67 132 196 254 312 367 421 435 392 327 261
6826 261 247 267 268 269 250 231 193 189 212 234 224 180 149 152 168 184 160 137 126 149 158 133 95 58 55 53 51 49 60 72 117 163 173 184 194 204 187 170 119
6809 119 69 71 74 77 80 45 10 0 46 141 237 276 281 250 220 187 154 121 88 112 135 157 180 202 224 264 304 344 384 402 421 440 459 546 634 645 577
6793 577 507 493 518 509 429 350 291 288 288 255 243 232 214 196 177 159 127 96 64 33 15 -2 36 75 81 88 60 32 60 88 116 144 113 82 85 88 115 141
6777A41K6K6j1j1j1j1J4J4J5J4j3j2j3j3%jL3L4j1j0j1j1N7N7%%j6j6J8J8rj0o6o5rrrqK1
6760A32K1K0K1J5J5m1m2n6n5J%%jj%j6j5PO5Q7Q6J1J2j8j7j7j7j4j3j4j4OPOOJ0J0J0J0k1
6743A86k1k2k1J4J5J4J4OONOl6l5l5l6oppoj0j0M6M7K3K3j1j1K6K6qqk4k4k4k4j0j0M7M7L3
6725A78L2k3k4k6k5k5k6l6l6M2M2K3K4K3K4j8j8n1n1l9m0l7l8o0k7K2P8J20Q6J9l7n0j6M3
6711E3P8O5O5L3L4lkllL9L9LLo0r3j05m7K5N9M3M3J7J6j7j7j2j3j2j2K4K5K4K5nmK9L0M2M2
6694D48j4j5n1n1n2n1QQQQL7L6LLmmlmlmlll0k9l0k9m2m1L8L7N7N7k2k2n8n8K2K1O1O1NNl0
6675B70k9o3o4m5m4N6N7M2M2l7l7j6j6M0M1j6j7J8J8MMMMl8l8mnK2K1K1K1OOn0n1j2j2K2K1
6658A46k0j9k0k0P1P2P5Ql0k9K3K3L6L6m3m4n6n6k2k2L0L0L0L0qrrqK6K7l0k9l4l4K2K3J4
$$ plain form
6777 141 167 193 182 171 160 149 163 177 192 206 193 181 168 155 155 154 187 221 210 200 189 178 235 292 292 292 276 260 278 296 287 277 211 146 137 128 119 111 132
6760 132 153 173 194 209 224 183 141 85 30 31 31 31 30 29 29 13 -2 5 70 157 243 254 266 248 231 214 197 183 170 156 142 148 155 161 167 177 187 197 207 186
6743 186 165 143 122 136 151 165 179 185 191 196 202 166 131 96 60 54 47 40 34 24 14 60 107 130 153 142 131 157 183 175 167 143 119 95 71 61 51 98 145 178
6725 178 210 187 163 137 112 87 61 25 -11 31 73 96 120 143 167 149 131 80 29 -10 -50 -87 -125 -185 -212 -190 -112 8 94 113 76 26 10 53
6711 53 131 196 261 294 328 325 323 320 317 356 395 398 401 341 248 143 96 121 180 223 266 283 299 282 265 253 240 228 216 240 265 289 314 309 305 334 364 406 448
6694 448 434 419 368 317 265 214 222 230 238 246 283 319 322 325 321 317 314 310 307 303 300 297 267 238 208 179 137 96 134 171 228 285 263 241 183 125 147 168 229 290 295 300 270
6675 270 241 178 114 69 25 81 138 180 222 185 148 132 116 156 197 181 164 182 200 204 208 212 216 178 140 136 131 153 174 195 216 222 228 178 127 115 103 125 146
6658 146 126 107 87 67 138 210 285 293 263 234 257 280 316 352 309 265 209 153 131 109 139 169 199 229 221 212 203 195 221 248 218 189 155 121 143 166 180
6642A80J4o0o1k6M3L8L8J1J1k3k2MMQ0P9N0j7n8n9K2K1K2K1L0L0m9m9m0m0l9m0l4l4K3K2L3
6626A25L3L3L3kkkkJ6J7j8j7m7m6j2j3l4l4%%L8L9L9L8J6J6m1m1l7l6lkKLKLJ9J9J8J9J0R
6609A58J0J0J1J1m3m4r2n7pM8P0O9L8L9l3l4o7o7l1l3l3l2J%N7N7L6L6L6L6P0P0J4J4j7j8
6593B83n1n1m0m0m0m1L4L4L4L4O8O9O8O8J7J6j7j7m4m3m4m3l8l7l7l7j1j1j2j1rj0M5M4O1
6578A91K8j0j0nmJ4j9m5m5m5m5k3J0K4K5M9M9M9M9L4L3%jJ%J9j4m9m9j4K0L0L0kkl2l1%%J2
6561B22k3l8l7j9j9j7j7j5J8N6N7L1L1L0K9Rk5m3p7p8p6m3qNNPQKKLKN8N9P6M3Ml0j3j3pq
6543A51nnJL4L5Jl6l6nnK1K1K1K0k1k2J2J2J8J8J6J7j3m6k7k7J3J3J3J3RQQRpoK7K8ppopJ6
6524B67J5J5J6J6J6L3jm1p5m3rk4k3J4M8N8K5j1j1k7k7k7k7J4J3M5M5L6Kl2KK7K7k9o3m1p
$$ plain form
6642 180 194 134 73 47 90 128 166 177 188 165 143 147 151 231 310 360 343 285 226 248 269 291 312 342 372 323 274 234 194 155 115 81 47 70 92 125
6626 125 158 191 224 222 220 218 216 232 249 231 214 167 121 109 96 62 28 28 28 66 105 144 182 198 214 173 132 95 59 56 54 56 59 61 64 83 102 120 139 149 158
6609 158 168 178 189 200 157 113 21 -36 -43 5 75 144 182 221 188 154 87 20 -11 -44 -77 -109 -108 -108 -51 6 42 78 114 150 220 290 304 318 301 283
6593 283 232 181 141 101 61 20 54 88 122 156 224 293 361 429 446 462 445 428 384 341 297 254 216 179 142 105 94 83 71 60 51 41 86 130 191
6578 191 219 209 199 194 190 204 185 140 95 50 5 -18 -8 16 41 90 139 188 237 271 304 304 303 304 304 323 309 260 211 197 217 247 277 275 273 241 210 210 210 222
6561 222 199 161 124 105 86 69 52 37 55 111 168 199 230 260 289 298 273 230 153 75 -1 -44 -52 -47 -42 -35 -27 -25 -23 -20 -18 40 99 175 218 222 192 179 166 159 151
6543 151 146 141 142 176 211 212 176 140 135 130 151 172 193 213 192 170 182 194 212 230 246 263 250 204 177 150 163 176 189 202 211 219 227 236 229 223 250 278 271 264 258 251 267
6524 267 282 297 313 329 345 378 377 336 261 218 209 185 162 176 224 282 307 296 285 258 231 204 177 191 204 249 294 330 332 300 302 329 356 327 264 223 216
6508B16K5rl7l7l9l9J7J7J7J8n2n1l0K7L7j9n9k4L7L7QQK2N5N5K2onqpKLL6L6RQRRrj0rrk4
6489B47k5k4k4l7l7K1N4O2K7pqk1k1k1k1M1M0K6qk1k0k2k2ppK7K7L5L5L5L5j3j2m6m7n4n5
6473A32l9oL4L5KLmnL0K9K1K1j3j2j3j2K1K1k3k3n7n7k4k5k4k4jkl0l1j8M9M5M6J1J2O8O8
6457B05O5O5j5j4m6m6m6m6m3m2rqJ5J5J4J5K3K2K3K2L4L3jjJ1J0J1J1j7j7j7j7k9k9k9k9l8
6441E5l7LP2R6R7K2K1pppqj9j9n3n3m1m1qpPQM0P4O7%o2o2JKJKj0j0j0rrrM7M8P3P3J6J6l5
6422C18l6l6l6%j%jK4K3N7N8RRk4k5m5m5m4m5j8j8j8j7j8j8L9L9J2J2J2J2J1J1m5m6k2k2k2
6405D4k3j4j4j4j5RRM1M3N7N7N7N7lln9n9n7n6K3K2QQQQl7l6llM9M9J5J5K5K5rqk5k5RRj2
6387A72j1j1j2nno1o2j4j5M1M2OOOPllklL6L6L6L6opK8K7MLn3n3k4k4k3k4RJ0RJ0L6L6L6L6
$$ plain form
6508 216 241 232 195 158 119 80 97 114 131 149 97 46 16 43 80 61 2 -22 15 52 60 68 90 145 200 222 216 211 203 196 198 201 237 273 282 290 299 308 299 289 280 271 247
6489 247 222 198 174 137 100 121 175 237 264 257 249 228 207 186 165 206 246 272 264 243 223 201 179 172 165 192 219 254 289 324 359 346 334 288 241 187 132
6473 132 93 87 121 156 158 161 157 152 182 211 232 253 240 228 215 203 224 245 222 199 142 85 61 36 12 -12 -13 -15 -45 -76 -94 -45 0 46 57 69 137 205
6457 205 270 335 320 306 260 214 168 122 79 37 28 20 35 50 64 79 102 124 147 169 203 236 235 234 245 255 266 277 260 243 226 209 180 151 122 93 55
6441 55 18 21 93 189 286 308 329 322 315 308 300 281 262 209 156 115 74 66 59 66 74 114 188 255 255 193 131 132 134 135 137 127 117 107 98 89 80 127 175 248 321 337 353 318
6422 318 282 246 210 210 209 209 208 232 255 312 370 379 388 364 339 294 249 205 160 142 124 106 89 71 53 92 131 143 155 167 179 190 201 156 110 88 66 44
6405 44 21 7 -7 -21 -36 -27 -18 23 66 123 180 237 294 291 288 229 170 113 57 80 102 110 118 126 134 97 61 58 55 104 153 168 183 208 233 224 216 191 166 175 184 172
6387 172 161 150 138 133 128 67 5 -9 -24 17 59 65 71 77 84 81 78 76 73 109 145 181 217 211 204 232 259 263 266 213 160 136 112 89 65 74 84 93 103 139 175 211 247
6369B47J9J8j5j5qpqqjjL3L2L4L5k3k2m4m4j0j1rj0rj0j2j2J9J9k4n8n8k4K2K1K4K4J8J8J7
6352A57J8J1J0M5M5K5K6qqQRK8oj9j9J3J3J7J7J7J7k9k8o1o0k5QK3K3k0k0k0k0J3J3J4J3J
6335B41JJJk1k1k1k1o4o5k7PJ9J9j0j0J3M7N9O0L8LK3K3K8K8J3k1n3n3m1pJ6J6L7Lj6j7J3
6319B41J4J8j6l1l0k3k2J2J2L1L1L1L1poppn3n3l8mJ1J2j8j9L2O6M4j2n7n6l6K2N1N2L8Nn1
6302B08q4o5o5j6J8kjL1L2L2L2J6J6oK9N2J8j7j7k3k3k3k3J7J8J8J8K3K3l4l3k2k1k0j9K9
6287A16O3O3K9k0k0k2k3J3J3J3J3K1K1K2K1mmkkj1K4L3k2o7j01j02o8J0M5M6J3j5j6j7j8p
6271C8pk6QN4N5P5M2RJ0j4K0L8NML9M3Qk6k6n2n2n2n2k0k0l9nL4L3P0P0N5N5J7j6m5m5m6m5
6254A94j2K2N5N6oo3n0j6K1K1N5N5O6L3l1o5n1n1l4o7p1o9k5L1M4M4J5J4mmmmm2m2nK9J8J8
$$ plain form
6369 247 266 284 269 254 246 239 231 223 222 221 254 286 320 355 332 310 266 222 212 201 192 182 173 163 151 139 158 177 153 95 37 13 35 56 80 104 122 140 157
6352 157 175 186 196 241 286 311 337 329 321 329 338 366 360 341 322 335 348 365 382 399 416 387 359 298 238 213 221 244 267 247 227 207 187 200 213 227 240 241
6335 241 242 243 244 223 202 181 160 96 31 4 11 30 49 39 29 42 89 148 208 246 249 272 295 323 351 364 343 290 237 196 189 205 221 258 261 245 228 241
6319 241 255 273 257 226 196 173 151 163 175 206 237 268 299 292 286 279 272 219 166 128 124 135 147 129 110 142 208 252 240 183 127 91 113 164 216 254 259 208
6302 208 124 59 -6 -22 -4 -6 -7 24 56 88 120 136 152 146 175 227 245 228 211 188 165 142 119 136 154 172 190 213 236 202 169 147 126 106 87 116
6287 116 179 242 271 251 231 209 186 199 212 225 238 259 280 302 323 319 315 313 311 300 324 357 335 268 167 65 -3 7 52 98 111 96 80 63 45 38
6271 38 31 5 13 67 122 197 239 248 258 244 264 302 307 311 350 393 401 375 349 297 245 193 141 121 101 62 57 91 124 194 264 319 374 391 375 330 285 239 194
6254 194 182 204 259 315 309 246 196 180 201 222 277 332 398 431 400 335 284 233 199 132 61 -8 -33 -2 42 86 101 115 111 107 103 99 57 15 10 39 57 75
6238G5L3O7N3J8j6j7M8M8j0m4k7QK0K0k4k3k4k4kkkkk5k5k6k5j1j1j1j2LLKLM4M5M3M3j0m4
6220A59k4k5l9l8n5k2K4N7M0M1jkkjKLj1m4m8j4K0K1j1j0j0j0kl%%N3Q9Q7N3J7j7j%KJJJl5
6202B46l6l5l6J5J5J4J5%JJ%J7J7J7J8J2J2ll6p0o9l4%OOOOl5p0o7l3J6M9L1K9M0Nl0k9qK7
6184C0M0L9j7n0n0j6J7J7K0K0K6K6K4K4%l3j5j4K7K6K7K7M6M6J2J2PQQQqrqqm3m2m0m0j0K4
6167A58L7L7k0n3o7o6k0J3K8K9L1L2K9K9J3k2l6l6k3k2J1J2J1J2k3k2j1j0K3K3J2J3J3J2K3
6151A70K3j2m6k9OLl1l0l0JKJ9J9J9J9jjjjQPQPk3k3m2qL8L8K5rrrQk6m6m5J0M6N7N8K2j1
6133A80j3j3j6j5k9l0NMPOK6qj7j7L8L7K7K7ppm0l9k3J1N8R3J06J07N9Mm6p9o8l3KKm2m1q
6116B08pj%l5l4l8l8J8J9J0J0J0J0K4K5M3J0l7l6k3J0J0J0J0J0K7qm5m5lmmlJJKJk9k9m8j4
$$ plain form
6238 75 108 175 228 246 230 213 261 309 299 255 228 236 256 276 252 229 205 181 179 177 175 173 148 123 97 72 61 50 39 27 30 33 35 38 82 127 170 213 203 159
6220 159 135 110 71 33 -22 -44 -20 37 77 118 117 115 113 112 114 117 106 62 14 0 20 41 30 20 10 0 -2 -5 -5 -5 48 137 224 277 294 277 276 276 278 279 280 281 246
6202 246 210 175 139 154 169 183 198 198 199 200 200 217 234 251 269 281 293 290 254 184 115 81 81 87 93 99 105 70 0 -67 -100 -84 -35 -4 25 65 70 40 11 3 30
6184 30 70 109 92 42 -8 -24 -7 10 30 50 76 102 126 150 150 117 102 88 115 141 168 195 241 287 299 311 318 326 334 342 334 325 317 309 266 224 184 144 134 158
6167 158 195 232 212 159 92 26 6 19 47 76 107 139 168 197 210 188 152 116 93 71 82 94 105 117 94 72 61 51 74 97 109 122 135 147 170
6151 170 193 181 135 106 112 115 84 54 24 25 27 46 65 84 103 102 101 100 99 107 114 122 129 106 83 41 33 71 109 134 125 116 107 115 89 43 -2 8 54 111 169 191 180
6133 180 167 154 138 123 94 64 69 73 80 86 112 104 87 70 108 145 172 199 192 185 145 106 83 94 152 245 351 458 517 521 475 396 328 295 297 299 257 216 208
6116 208 201 200 200 165 131 93 55 73 92 102 112 122 132 156 181 224 234 197 161 138 148 158 168 178 188 215 207 162 117 114 110 106 103 104 105 107 108 79 50 2 -12
6098a2K4K4ppM7M7J3k1k5L2N0J7l6l6l7l8j0j0M6M6L4L5%Jj8j9J7N0N9K5j1j1j0j0m4m4m7
6082A14m8j4j4PQM1M1L9L9j7j8k8k8OOL0L1L0L1kkl6l6j5j5j5j5l4l4M5M4M0M0j4j4L6P0N0
6066C49ql9l9J4J4KLKKK3K3l3l4K1K0K1K0k8k7OOJ3J2J3J2m0m0m0m0j2j3j2j3k9k9NNk6k7
6049E7L0L1mmmmJ2J2J1J2PQk6k7ppqpJ6J6J6J7pqppL0L0O3O4rj0rrm3m3m3m3J6J7J6J6l2l2
6030I7l1l2POPPl4l3%%J%L4L4O8O8J1J2n4n3n3n4L3L2L3L3j6j5j5j6kkkkK8K8poj%L3L3J2
6011A89J2J2J2l9l8l9l8K1K1K1K1j9j9j9j9JJJJK2K1K2K2K3K2l4l4J0J1J0J0PPPPj7j7j7j7
5994A48POPOk3k3L3L3K2K1K1K1j2j3j3j2QRk6k5m4m4j0j1%%j%J1J1J1J1qqK6K5jjjjj4j3j3
5975A20j3popoj8j7j7j7M3M3J0Rj3j2m2m3l7L0O9P0JJj6j6J5J4J5J5k4k3poppm1m0m3m3J4
$$ plain form
6098 -12 12 36 29 22 69 116 129 108 83 115 165 182 146 110 73 35 25 15 61 107 141 176 176 177 159 140 157 207 266 291 280 269 259 249 205 161 114
6082 114 66 52 38 45 53 94 135 174 213 196 178 150 122 128 134 164 195 225 256 254 252 216 180 165 150 135 120 86 52 97 141 181 221 207 193 229 299 349
6066 349 341 302 263 277 291 293 296 298 300 323 346 313 279 300 320 341 361 333 306 312 318 331 343 356 368 328 288 248 208 196 183 171 158 129 100 105 110 84 57
6049 57 87 118 114 110 106 102 114 126 137 149 156 164 138 111 104 97 89 82 98 114 130 147 140 132 125 118 148 178 241 305 296 286 277 268 225 182 139 96 112 129 145 161 129 97
6030 97 66 34 41 47 54 61 27 -6 -6 -6 -5 -5 29 63 131 199 210 222 168 115 62 8 41 73 106 139 123 108 93 77 75 73 71 69 97 125 118 112 111 111 144 177 189
6011 189 201 213 225 186 148 109 71 92 113 134 155 136 117 98 79 80 81 82 83 105 126 148 170 193 215 181 147 157 168 178 188 195 202 209 216 199 182 165 148
5994 148 155 161 168 174 151 128 161 194 216 237 258 279 267 254 241 229 237 246 220 195 151 107 97 86 86 86 85 85 96 107 118 129 121 113 139 164 163 162 161 160 146 133 120
5975 120 107 100 94 87 81 63 46 29 12 55 98 108 117 104 92 50 7 -30 0 69 139 140 141 125 109 124 138 153 168 144 121 114 108 101 94 53 13 -30 -73 -59
5958e9J3P4P5L6l1m0nK7K7J7J7j%k4k3m1m0mmL0L0j5j5KLM0M1K4K4j6j6j6j6o9o8j3j3j3j2
5941g4K2K2P6P8M4M3K0J9J9J9L1L1k5k6m6m6j2j2L5L4%%k1k2l9l8j6j6KJm8m7l0l1MML4L3
5925B2L9k9m7m7kkJ5J5J8J7j6j6L2L2k4k3mmJ3J2jjkjm0m0n4n5l8mN3N4O4L1ppj5j5L9L8K5
5907B5rk4QK4K6J1J0J1J1QRj8n2l3l2JKLMnK8L1kmL1M3M3L1L0M3P8P3M0j8j8k5k4k5k5k9l0
5889B51k9l0%JK0j5n0n1l6l5qrK6K6N2N2L8Lk2k3j0K4O1O2K6qm0m1m1m0LL8M8qn8r2r3o0J1
5872e7M4K6K7J7J6J7J7llllJ6J6J6J6j2j1j2j1lkl6l7k9k9MMK5K7qpMMK2K1nmnmjkjjl2l1
5853a3KKj6j7J8J8L3L4L4L4L7L6L6L7J1J2J1J2k0j9j9k0j3j4j3j3j1j1j2j1mmK9L0K2K3l4
5837B07l4l0l1l0l0LLLLlmlmQQO5O4K7K8j8p5r4o0%L3J1J0J2J3M4M4M4M5j8j8j9j8M0L9L9
$$ plain form
5958 -59 -46 28 103 139 108 68 63 90 117 134 151 150 150 126 103 62 22 18 14 44 74 59 44 46 49 89 130 154 178 162 146 130 114 45 -23 -36 -49 -62 -74
5941 -74 -52 -30 46 124 168 211 231 250 269 288 319 350 325 299 253 207 195 183 218 252 252 252 231 209 170 132 116 100 102 103 55 8 -22 -53 -49 -45 -11 22
5925 22 61 32 -15 -62 -64 -66 -51 -36 -18 -1 -17 -33 -1 31 7 -16 -20 -24 -11 1 0 -1 -3 -4 -44 -84 -138 -193 -231 -235 -182 -128 -64 -33 -40 -47 -62 -77 -38 0 25
5907 25 16 -8 0 24 50 61 71 82 93 101 110 92 40 7 -25 -24 -22 -19 -15 -20 8 39 37 33 64 107 150 181 211 254 332 405 445 427 409 384 360 335 310 281 251
5889 251 222 192 192 193 213 198 148 97 61 26 18 9 35 61 113 165 203 206 184 161 151 175 236 298 324 316 276 235 194 154 157 195 243 235 177 85 -8 -68 -57
5872 -57 -13 13 40 57 73 90 107 104 101 98 95 111 127 143 159 147 136 124 113 110 108 72 35 6 -23 -19 -15 10 37 29 22 26 30 52 73 68 64 59 55 54 52 51 50 18 -13
5853 -13 -11 -9 -25 -42 -24 -6 27 61 95 129 166 202 238 275 286 298 309 321 301 282 263 243 230 216 203 190 179 168 156 145 141 137 166 196 218 241 207
5837 207 173 143 112 82 52 55 58 61 64 61 57 54 50 58 66 131 195 222 250 232 157 63 3 3 36 47 57 69 82 126 170 214 259 241 223 204 186 226 265 304
5819C04L9j9j9n2n3p2p3l8l8N0N1N2N1ooookkjkM1M0M1M1J0J1j3K2K5l1p6p7m9m9m9m7n7n7
5802a22k3k2J8J9N2N3K6K7K7K7L2L2L3L2j0j0j0j0J7J7J7J6m4m5j1j0OOOPkkl5l5k1k1J2J3
5786F2K3K3K3K2J2J2J2J1L2L2L1L2j7j7j7j7llllk1k1k1k0L2L3L3L3M9M9M6M6kn9q0m6k2k2
5769B54n3n4j0j0K4K4RQk5k5k4k4k4k3L3L2L3L3L1L1L0L1K9K9nnj3j3j3j4LMl1l1l4l4M4M5
5753B62K1K1N5N5K3K2n6n7l7l7klooK8K8K2K2j2j2M4M4M8j9n6n5o0n9k7k6L0L0J3J3m4m4j5
5737A48j5j4j5k3k2J2J2L8L8L9L8N3N3J9J9o2o3o3o3L1L1klk1k0k1k0L6L6L6L6llL1L1qqp
5720B81qK0J9K0K0K1K2K2K1k1k0k1k1k8k8k9k8L3L2O2O3Rn9n5n4J0J1J0J1ONOOJJL5L5J2J2
5704D34J3J2j3j3K1K1RRJ0RopN0N1N0N1N1N0M8M7J17J86K61L75N80O48M64P9l20m77m83m27
$$ plain form
5819 304 343 324 305 253 200 128 55 17 -21 29 80 132 183 177 171 165 159 157 155 154 152 193 233 274 315 325 336 323 345 370 339 263 186 137 88 39 -8 -65 -122
5802 -122 -145 -167 -149 -130 -78 -25 1 28 55 82 114 146 179 211 201 191 181 171 188 205 222 238 194 149 138 128 134 140 146 153 151 149 114 79 58 37 49 62
5786 62 85 108 131 153 165 177 189 200 232 264 295 327 310 293 276 259 256 253 250 247 226 205 184 164 196 229 262 295 344 393 439 485 483 424 344 298 276 254
5769 254 201 147 137 127 151 175 184 192 167 142 118 94 70 47 80 112 145 178 209 240 270 301 330 359 354 349 336 323 310 296 299 303 272 241 207 173 217 262
5753 262 283 304 359 414 437 459 403 346 309 272 270 267 261 255 283 311 333 355 343 331 375 419 467 448 392 337 277 218 191 165 195 225 238 251 207 163 148
5737 148 133 119 104 81 59 71 83 121 159 198 236 289 342 361 380 318 255 192 129 160 191 189 186 165 145 124 104 140 176 212 248 245 242 273 304 296 288 281
5720 281 273 293 312 332 352 373 395 417 438 417 397 376 355 327 299 270 242 275 307 369 432 441 382 327 273 283 294 304 315 321 326 332 338 339 340 375 410 422 434
5704 434 447 459 446 433 454 475 484 493 503 512 506 499 549 600 650 701 752 802 850 897 1014 1200 1461 1836 2416 3064 3528 3607 3287 2810 2327 1900
5690A900l85l06k13j56j04j04n8n9n8n8m9m9n0m9j1j1j0j1K8K7K8K8K8K8rm4o2o2k7OJ1J1
5676A50m3m4J%J%J9J9J9J9RQRQL2L2K0j5m2qNMl6l6KL5K3K4rqJ9K0Nk8l5l6llmlL0L1N4N3
5657B98N2N2Qk6m0m0J2J3ll6n8n8%L4L5L5LMQQQQj4j3j4j4popoK0K0M0Nj3j4K0N4K6rJ3J3
5639D11L0L0N4J12J71J72Q4j8j04j38j22j23j05p1n7n6l4l3kjqm2k3k3%j%%L9M0M0M0K5K5
5624C12J1k4m3m2l0MJ4J4l7l8k5J0K2K2qm3n7n7j6j6j4j4J7N0O4O4L0nj9j9jkL4O8O6L3nn
5607C15k4n9r3r4p6m4k5RL7L7O9P1P8M5K4j0n2q5o7o5k6PM4M5L8L8MNj8j8J6J6J6J6J4J4J0
5591B12k5q0q1o0nO3O5L8L7MLl8l9j5M0M2Rm7m6k2J2M9M9M0M0Kl1j9j9k1k0l1l1l1l0l7l8
5575f1mmM5M5M5M6J8J9j6j5NNk9k8n0m8m5J2P6J12P2J5m0m0m3m3J3J3J3J2J1J1J0J1j1j0m5
$$ plain form
5690 1900 1515 1209 996 840 736 632 574 515 457 399 350 301 251 202 191 180 170 159 187 214 242 270 298 326 317 273 211 149 122 128 139 150
5676 150 107 63 64 64 65 65 84 103 122 141 150 158 167 175 207 239 259 244 202 194 199 203 167 131 133 168 191 215 206 198 217 237 242 214 179 143 140 137 133 130 160 191 245 298
5657 298 350 402 410 384 344 304 316 329 326 290 232 174 174 208 243 278 281 285 293 301 309 317 303 290 276 262 255 249 242 236 256 276 316 321 308 294 314 368 394 385 398 411
5639 411 441 471 525 637 808 980 1064 1046 942 804 682 559 454 383 326 270 236 203 201 200 192 150 127 104 104 103 103 103 142 182 222 262 287 312
5624 312 323 299 256 214 184 188 202 216 179 141 116 126 148 170 162 119 62 5 -11 -27 -41 -55 -38 12 76 140 170 165 146 127 126 124 158 226 292 325 320 315
5607 315 291 232 139 45 -31 -75 -100 -91 -54 -17 52 123 201 246 270 260 208 123 56 -9 -35 -28 16 61 99 137 141 146 128 110 126 142 158 174 188 202 212
5591 212 187 107 26 -34 -39 24 89 127 164 168 171 133 94 79 119 161 170 123 77 55 67 116 165 205 245 247 216 197 178 157 137 106 75 44 14 -23 -61
5575 -61 -65 -69 -24 21 66 112 130 149 133 118 123 128 99 71 21 -27 -72 -60 16 128 200 215 175 135 92 49 62 75 88 100 111 122 132 143 132 122 77
5559G7m4j8j7J5J7L7L7L8L7PPPPo2o1j4M2N8N8K7K8j4j3m7m7k1k2n1n2JN6N7%k9k8M7M7Q6
5543B53Q5J8l9m8j4J9K0k8k9k8k8J0J0M4M4j5j5m9m9%j%%L2L2L2L2L1L1kln1n0j7j7j9j8j9
5526A54j8KLl1l1llklpppoooK6K5J1k4l8l8k5k5RR%%KJM6Q1N9Lm5m5j5j5M0L9L9L9O3O2K5
5507C38rj4j5j6j7l1l0LLj8j9j6j6qK6M1M1j4j5JL5M4M4M7M7J5J6j8j8k9k8NNm2m3qK7K4j0
5490C28k4k4k6o0m1m0j6j6j6j6j%l5l4JJKLN2Q6R8R8L8j9o4o3l1LJ5J6%l4o9o9l8lL3L4K8
5473I7K8onj3j2j3j2L0K9L0L0k1k1p7p7j7j7J8J7L3L4L4L4J0J1k3k3K2K3P9P9J0J1k3k4k3
5458B52k4k3k3K8K8K8K8J9K0J9J9mlp9p9n5KK7K6ONONL3L3jjl4l4q8q7k0L5O1O0K8K8ooj9
5440B10k0j9k0K9K8K9K8N1N0K6l0n7n6k6k7k2k2k2k2K8K8K8K8QQQPJ2J2J3J2J8J9J9J9l0k9
$$ plain form
5559 77 33 15 -2 13 30 67 104 142 179 186 193 200 207 145 84 70 112 170 228 255 283 269 256 209 162 141 119 68 16 17 73 130 130 101 73 120 167 253
5543 253 338 356 317 269 255 274 294 266 237 209 181 191 201 245 289 274 259 210 161 161 160 160 160 192 224 256 288 319 350 348 345 294 244 227 210 191 173 154
5526 154 136 138 141 110 79 76 73 71 68 61 54 47 41 35 29 55 80 91 67 29 -9 -34 -59 -50 -41 -41 -41 -39 -38 8 89 148 151 106 61 46 31 71 110 149 188 251 313 338
5507 338 329 315 300 284 267 236 206 209 212 194 175 159 143 135 161 202 243 229 214 215 250 294 338 385 432 447 463 445 427 398 370 375 380 338 295 287 314 338 328
5490 328 304 280 254 194 153 113 97 81 65 49 48 48 13 -21 -20 -19 -17 -14 38 124 222 320 358 339 275 212 181 184 199 215 215 181 112 43 5 2 35 69 97
5473 97 125 119 114 101 89 76 64 94 123 153 183 162 141 64 -13 -30 -47 -29 -12 21 55 89 123 133 144 121 98 120 143 222 301 311 322 299 275 252
5458 252 228 205 182 210 238 266 294 313 333 352 371 367 364 285 206 151 153 180 206 212 217 223 228 261 294 293 292 258 224 136 49 29 64 125 185 213 241 235 229 210
5440 210 190 171 151 180 208 237 265 316 366 392 362 305 249 223 196 174 152 130 108 136 164 192 220 228 236 244 251 263 275 288 300 318 337 356 375 345 316
5424C16k9k9J6J6J6J6l1l0o5o4o7o6J1J2QQQQJ9J8J8J9K2K3K3K2l1l2m8j5J1M4Q1Q1L2k4m9
5408B68m9l7l6kl%jJJ%L4M7M6J8j6l1l1j5j4J9J9j1j1KL6N5K1l7l7k3k2k3k2LMJKm0p3p3l9
5391f9J5J6J7J8K9L0L1L0M2M1OOK7pm3m2jL4Jl2k0J4K7K6J7J6J6J6J9K0K0J9L2L3J7j7m6m7
5374C11m7m6%L5L4Jm1m0m3m2l1l0j6J8L8L7ONPPPPlkk2J3M7M7J5J5j1j1m5m5m6m5qK5L8L8
5357A77OOK2K2K2K3J6J6j8j8K8K9K9K8J8J9l9l8l8l7mmk5k6RQJ5J5j9j9j5j5j5j5j1j1K3K4
5340A88O0O0O0O1J8J9j5j6o1o2k8k7J0J1M4M4llo0o0j4j4K0K0k5k5k5k6K5K5K5K5MMMMJ4J4
5324B95J5J4RRm8m8p2p3POL4L4k3k3noK9K9j1j1j1j1%jL4L3NNn2n2k9l0K6K7K0K0K0K0O8O7
5306C20L4L5j2j2j2j2k0k1n4n4llllJ5J4J5J5j8j7j8j7m1m0oK9K8nj8j8l2l1o1o2l2K3R0Q9
$$ plain form
5424 316 287 258 274 290 306 322 291 261 196 132 65 -1 10 22 30 38 46 54 73 91 109 128 150 173 196 218 187 155 107 92 103 147 228 309 341 317 268
5408 268 219 182 146 144 141 141 140 141 142 142 176 223 269 287 271 240 209 194 180 199 218 207 196 198 234 289 310 273 236 213 191 168 146 149 153 154 156 116 43 -30 -69
5391 -69 -54 -38 -21 -3 26 56 87 117 159 200 206 212 239 232 189 147 146 180 181 149 129 143 170 196 213 229 245 261 280 300 320 339 371 404 421 404 358 311
5374 311 264 218 218 253 287 288 247 207 164 122 91 61 45 63 101 138 144 149 156 163 170 177 174 172 150 163 210 257 272 287 276 265 220 175 129 84 76 101 139 177
5357 177 183 189 211 233 255 278 294 310 292 274 302 331 360 388 406 425 386 348 310 273 269 265 240 214 223 231 246 261 242 223 208 193 178 163 152 141 164 188
5340 188 248 308 368 429 447 466 451 435 374 312 284 257 267 278 322 366 363 360 300 240 226 212 232 252 227 202 177 151 176 201 226 251 255 259 263 267 281 295
5324 295 310 324 333 342 294 246 174 101 108 114 148 182 159 136 131 125 154 183 172 161 150 139 139 138 172 205 210 215 163 111 82 52 78 105 125 145 165 185 253 320
5306 320 354 389 377 365 353 341 321 300 246 192 189 186 183 180 195 209 224 239 221 204 186 169 128 88 82 111 139 134 116 98 66 35 -26 -88 -120 -97 -7 82
5290H2P3J5qrl2l1n1j7L0K9om0j5j4J7J7RQM1M0N3J8j9j9NMMMk5k6k6k5ooooJ3J2J3J3l0k9
5272E4j5J9L7L8L9M0RRM1M1N4K0m0m0l1l1LLj2j2m5m6m7m8j0K3J5J4j7j8NONNJ5J5J5J5nn
5254A18nnmmmmNMk7k7k1J4N0N1N1N1J3k0l4l4lkpqppj%l4l4j4j4K0J9j8j9j9j8K2K2K3K2k2
5236F9k2J2J1L0K9L0K9j7j8j7j8lmllK0K0K1K0J2J1J2J2j2j2j1j2JJl3l3j5j6J9J9j9k0J5
5219A05J4J5J6M9M9L3L4o8o8q1q1k4k4L6L8P2P1KKl1l2kklkrj0j0j0pqpqj8j8J6J5J7J6J7
5202I4J6J5J4J4J4NONOj2j2j2j2j0j0rj0K1K1N5N6jj%jmnmml8l7kL2L9Oj0m5n1n1l9nK7K7
5183H8K9K9kkkkK6K6qqLLKLopooL0L0K9K8l2o6p9k2J6J7j2j1LL6L5%l2o5m9m8j4j3j2j1j6
5165i8J7N3N2L6Kj3j3J4J4L3jk0k0k2k2oolmK4N9R0N7j0m4k6k7l7l7n5k2j4j3k9NL9P2N3N4
$$ plain form
5290 82 155 170 162 153 121 90 39 22 52 81 75 35 20 6 23 40 49 57 98 138 191 209 190 171 176 180 184 188 163 137 111 86 80 74 68 62 75 87 100 113 83 54
5272 54 39 58 95 133 172 212 221 230 271 312 366 386 346 306 275 244 247 250 238 226 181 135 88 40 30 53 68 82 65 47 52 58 63 68 83 98 113 128 123 118
5254 118 113 108 104 100 96 92 97 101 74 47 26 40 90 141 192 243 256 236 202 168 165 163 156 148 141 134 133 133 99 65 51 37 57 76 58 39 20 2 24 46 69 91 69
5236 69 47 59 70 100 129 159 188 171 153 136 118 115 111 108 105 125 145 166 186 198 209 221 233 221 209 198 186 187 188 155 122 107 91 110 129 110 90 105
5219 105 119 134 150 199 248 281 315 247 179 98 17 -7 -31 5 43 115 186 188 190 159 127 125 123 120 118 109 99 89 79 72 64 57 49 31 13 29 44 61 77 94
5202 94 110 125 139 153 167 172 178 183 189 177 165 153 141 131 121 112 102 123 144 199 255 254 253 253 252 248 243 239 235 197 160 158 190 229 235 225 180 129 78 39 34 61 88
5183 88 117 146 144 142 140 138 164 190 182 174 177 180 182 185 179 172 166 160 190 220 249 277 245 179 100 78 94 111 99 88 91 127 162 162 130 65 16 -32 -46 -59 -71 -82 -98
5165 -98 -81 -28 24 60 62 49 36 50 64 97 96 76 56 34 12 6 0 -3 -7 17 76 166 223 213 169 143 116 79 42 -13 -35 -49 -62 -91 -86 -47 25 78 132
5148A32N1J8LKK5K4K2K2Pk8m2m2RQj4p1q1m7J0M4N5K1l8p2n6k2J2J3P8P9P9P9L0L0k6k7o4
5132B23o4qqj8j8j7j8qqrqJ8J7J7J8J0J1J1J0noonj1j1m5m5k6k7PPJ6J6j7j7l9l8nnK9K9O2
5114IO3P8P8K1K1J%J%L6L5KKk9k9l0k9k9k9l0k9p3p2o7j1L8R3J16Q2L0mm4m4k3k4L2L3onn
5096A59om4m4m5m3QQPQPQQQJ1J2J1J2k0j9J4J4N6N5kjPPPQJJJJm7m6m7m7JJj8J6M4M5M7M7
5077B11RQj0K4O1O1Nk9j5J9J7j8o5o5l0M%%n4n5m6m6rK4M6M7J5J4K9K9K7K7j3m8k8k8j4j4
5060I0j2j2J8N1Q3M9%l4j7j7k0j9k0j9k1k1J3J2J5J5k0j9QQM0M0K6qrK6N7N7%l5pprj0k2k3
5043B27k2k3j1j0j0j1ooooj7j6j6j6J4J5J5J5j%%jopQM2N5N4J9j5l3l2l5l5%j%jnml9l8l5
5024@l3j%MLMMK9K9L0L0K1K1K2K1j4j4j4j4l2l3JJJ6J7J6J7O6O7j2j3k9k9K7K7L5L5L1L1j1
$$ plain form
5148 132 183 201 204 206 231 255 277 299 306 278 236 194 203 211 197 126 45 -2 8 52 107 128 90 18 -38 -60 -48 -35 43 122 201 280 310 340 314 287 223
5132 223 159 151 143 125 107 90 72 64 56 47 39 57 74 91 109 119 130 141 151 146 140 134 129 118 107 62 17 -9 -36 -29 -22 -6 10 -7 -24 -63 -101 -106 -111 -82 -53 9
5114 9 72 150 228 249 270 271 271 272 272 308 343 345 347 318 289 259 230 201 172 142 113 40 -32 -99 -110 -72 21 137 219 249 245 201 157 134 110 142 175 169 164 159
5096 159 153 109 65 20 -23 -15 -7 0 8 15 23 31 39 50 62 73 85 65 46 60 74 130 185 183 182 189 196 203 211 212 213 214 215 168 122 75 28 29 30 12 28 72 117 164 211
5077 211 220 228 218 242 303 364 369 340 325 344 361 343 278 213 183 187 187 187 133 78 32 -14 -23 1 47 94 109 123 152 181 208 235 222 174 146 118 104 90
5060 90 78 66 84 135 218 267 267 233 216 199 179 160 140 121 100 79 92 104 119 134 114 95 103 111 151 191 217 209 200 226 283 340 340 305 298 291 282 272 250 227
5043 227 205 182 171 161 151 140 134 128 122 116 99 83 67 51 65 80 95 110 109 109 109 108 102 95 103 145 200 254 273 258 225 193 158 123 123 122 122 121 116 112 73 35 0
5024 0 -33 -34 -34 -30 -27 -23 -19 10 39 69 99 120 141 163 184 170 156 142 128 96 63 64 65 81 98 114 131 197 264 252 239 210 181 208 235 270 305 336 367 356
5007C56o8r3r3qrrqPQM2M1j4j4j4j5M4M3M3M4j7j8n1n1k1k0J3J4k0k0k0j9KLL7L7P6P6llR
4990B87RRRJ0J0J0J1k2k2n6n6n1n1NOK7K8poJ6J6J7J6J7J6J7J7QRQQl4l4l4l4RQQRMLMMO8
4971B96O8L3m5n8n7J6J7j9j9j9j8l1l2l1l1j1j1j2j1K7K7K8K7O4O4O4O4j3j4j3j4k6k5o0n9
4955A66m9m8m8m8L0L2L1L2J4J5J5J5MMMMJ5J4k0j9MLL8L8j2j2m6m6j3j3K1K1mmnmOPOPJ4J4
4937A83J4J4j1j1j1j1RRJ0RnnK8K9J8J8J9J8J7J8l9l9p9q0m5m6L5L4L4L5J6J6j8j8l2l2l2
4921F9l2KKN9N8J1J0m5m6j2j2j2j2ppppl0l1l0l1OOOOK3K4K4K2J5J6J5J5j4j5l3JL1L1JJk
4903F9L1Q9R0P1L8k2k3j6j5Nk9m2qNMl7l8mmjjjjJ1J0RRj5m9o3o3m9m9PQK1K1K1K1lllkJ0
4884IJ2J1J1L0K9M9J5m2m2JN8N1J6j7j7m8m8l3JJ6J6J9J8m5m5k8LL0L0L3L3L2L3L0L1j7n0
$$ plain form
5007 356 288 195 102 94 85 76 68 75 83 125 166 152 138 124 109 153 196 239 283 266 248 197 146 125 105 118 132 112 92 72 53 55 58 95 132 208 284 281 278 287
4990 287 296 305 314 324 334 344 355 333 311 255 199 148 97 102 108 135 163 156 150 166 182 199 215 232 248 265 282 290 299 307 315 281 247 213 179 188 196 204 213 217 220 224 228 296
4971 296 364 397 352 294 237 253 270 251 232 213 195 164 132 101 70 59 48 36 25 52 79 107 134 198 262 326 390 377 363 350 336 310 285 225 166
4955 166 117 69 21 -27 3 35 66 98 112 127 142 157 161 165 169 173 188 202 182 163 167 170 208 246 234 222 176 130 117 104 125 146 142 138 133 129 135 142 148 155 169 183
4937 183 197 211 200 189 178 167 176 185 195 204 199 194 222 251 269 287 306 324 341 359 320 281 202 122 77 31 66 100 134 169 185 201 183 165 133 101 69
4921 69 37 39 41 100 158 169 179 134 88 76 64 52 40 33 26 19 12 -18 -49 -79 -110 -104 -98 -92 -86 -63 -39 -15 7 22 38 53 68 54 39 6 7 38 69 70 71 69
4903 69 100 189 279 350 388 366 343 327 312 317 288 246 238 243 247 210 172 168 164 163 162 161 160 171 181 190 199 184 135 72 9 -40 -89 -82 -74 -53 -32 -11 10 7 4 1 -1 9
4884 9 21 32 43 73 102 151 166 124 82 83 141 192 208 191 174 126 78 45 46 62 78 97 115 70 25 -3 0 30 60 93 126 158 191 221 252 235 185
4868A85q4n0j0j0ooM9Q2Q1M6K2j2l0k9l8l8%L3O4O4K8npprrK4K4K4K4l8l8l8l8m1m0ppM4M4
4850B41j3j2m6m6m6m5l3l3K3K2L4L4L3L4J9J9J5J5L7l1n0m9K1K1K1K1K4K3K4K4J3J3k2k1L0
4835C14L0k7k7k5k5k6k5lmllM8M9M9M8L8L8j8j8j2j2j1j2m1m0mO4N5j2m9m8k9k9k9k9K8K8
4819B28K8K8K3K4K4K3l0l0k9l0KLL6L7NOk8k9RJ0RRl5l5jjoooo%j%jkllkOPrm2r6r5r4l7Q
4799a32M2K9K9J8N1O5O5M3RnoKJKKk8k8j3K1J6J6j5j6j9j9j6j7k9NO5O6M9M9M7M8M1Qj3m7
4782C86p1j06j18o2PM0M2Rl2o5o4l2nK8O5O7O4L0l1o5n7k4J1J2J0J1J1J0J7J7j7j6%%L8P1
4766A81P0O9J2k3l3l4n2j9J2M6M6J3k1n5l8l8KKKLJKJKL4L5K0j4m4m4j0j0J5M9K9L0j2j1j1
4749B07j2J6J6J7J6jjn7n8k3k2J1J1poK7K8L9L9M0L9J4J4k0j9l4l4r0r1j2j2j3j2MMLMkkk
$$ plain form
4868 185 101 51 41 31 25 19 68 150 231 277 299 287 257 228 190 152 152 185 249 313 341 336 329 322 313 304 328 352 376 400 362 324 286 248 207 167 160 153 197 241
4850 241 228 216 170 124 78 33 0 -33 -10 12 46 80 113 147 166 185 200 215 252 221 171 122 143 164 185 206 230 253 277 301 314 327 305 284 314
4835 314 344 317 290 265 240 214 189 186 182 179 176 224 273 322 370 408 446 428 410 398 386 375 363 322 282 278 342 397 385 336 288 259 230 201 172 200 228
4819 228 256 284 307 331 355 378 348 318 289 259 261 264 300 337 342 348 320 291 300 310 319 328 293 258 257 256 250 244 238 232 232 231 231 230 228 225 222 220 226 233 224 182 86 -9 -103 -140 -132
4799 -132 -90 -61 -32 -14 37 102 167 210 219 214 208 210 211 213 215 187 159 146 167 183 199 184 168 149 130 114 97 68 73 138 204 253 302 349 397 438 446 433 386
4782 386 315 209 91 29 36 76 118 127 95 30 -34 -66 -71 -43 22 89 153 183 152 87 30 6 17 29 39 50 61 71 88 105 88 72 72 72 110 181
4766 181 251 320 332 309 276 242 190 171 183 229 275 288 267 212 174 136 138 140 142 145 146 148 149 151 185 220 240 226 182 138 128 118 133 182 211 241 229 218 207
4749 207 195 211 227 244 260 259 258 201 143 120 98 109 120 113 107 134 162 201 240 280 319 333 347 327 308 274 240 150 59 47 35 22 10 14 18 21 25 23 21 19
4732A9kJ2J2J2J2J7J7J7J7J7J7J8J7%%%%j9k0k0j9MNMNj5j5j6j5m7m6m7m7j6j6j6j6L4L5L5
4715f6L5RRJ0QN3N3N2N3oppok2k1k1k2OOPOK4K3N8N8K4K5l2l2j1j1K2K3L9L9MNj8j8j9j8j7
4697B97j7j7j7l4l5K2K2llo0o0l8l9l7l8o6o5qrN4N5N4N4J4J3J4J3k2k2L4L4N2N2nnPPk8k7
4680A43LKKL%J%Jk2k1n3LN8N7R3L6l7l6m0m0J1J1J1J1KLLKk3k2k3k3l9l9l8l9k4k3L4L3M5
4662B6M6J2J2j7j8j7j8k8k9K7K6J3J3m3m2n2n2K6K7N8N8N8N8K1K1K1K1mmnmm6m7m6m7L8L8
4646A01L8L7k3k4k3k4q6q6o0mL0O4Q1Q2L8L9j7j8j2j3j3j2L5L6j9j9kL2M6M7O5O5M8J4l6o9
4630C38q4q4n5k0L7L7L4Jj4j5l8l8jL3M3M3M2M1K4l2n4k0QQk4k4J6J7j6j5k2J2K4K4ml7l8
4614A47mL8L8Ll1k5k5k6k7k4k4J0J0JJJJJ0RPQNk9m3m3NMMMjkjjj7j8j8j7L3L4KJJ5N0L1L0
$$ plain form
4732 19 17 29 41 53 65 82 99 116 133 150 167 185 202 202 202 202 202 183 163 143 124 128 133 137 142 127 112 96 81 34 -12 -59 -106 -122 -138 -154 -170 -136 -101 -66
4715 -66 -31 -22 -13 -3 5 58 111 163 216 210 203 196 190 168 147 126 104 110 116 123 129 153 176 234 292 316 341 309 277 266 255 277 300 339 378 382 387 369 351 332 314 297
4697 297 280 263 246 212 177 199 221 218 215 155 95 57 18 -19 -57 -123 -188 -196 -205 -151 -96 -42 12 26 39 53 66 44 22 56 90 142 194 189 184 191 198 170 143
4680 143 146 148 150 153 153 154 154 155 133 112 59 62 120 177 270 306 269 233 193 153 164 175 186 197 199 202 205 207 184 162 139 116 77 38 0 -39 -63 -86 -52 -19 26
4662 26 72 84 96 79 61 44 26 -2 -31 -4 22 35 48 5 -37 -89 -141 -115 -88 -30 28 86 144 165 186 207 228 224 220 215 211 165 118 72 25 63 101
4646 101 139 176 153 129 106 82 -4 -90 -150 -154 -124 -60 21 103 141 180 163 145 133 120 107 95 130 166 147 128 126 158 204 251 316 381 429 443 407 338
4630 338 254 170 115 95 132 169 203 204 190 175 137 99 98 131 174 217 259 300 324 292 238 218 226 234 210 186 202 219 203 188 166 178 202 226 222 185 147
4614 147 143 181 219 222 191 166 141 115 88 64 40 50 60 61 62 63 64 74 83 90 98 103 74 31 -12 -7 -3 1 5 4 2 1 0 -17 -35 -53 -70 -37 -3 -1 0 15 65 96 126
4595A26K1K0K0K0jkjkMNk8k7l4jN7N8M0Ol1o5m7RN4N5L6L6kl5o2o1m9j5L0L1L2L2klklPPP
4576B40Pk3k3J1J1J7J7j7j7J7J7j7j7m8m9j4j5K4K4K3K4L1L1L1L1j1j2j1j1K1K2K1K2l4l3
4561B90o8o7n4n4k0k0MLLMJKn4n5J3J4J4J3L7L9L8L8J9J8J9J8L3L3L3L3m8m7j4j4mml8l8N
4544A25NNNQRM2M2PPm9n0mmmmoonoj9j9J5J5k5k6RQJ2J1k2k3L2L2Q8Q8KLKKMMk9l0m9m9o6
4524H7o6mmL1L0J3J2k1k1j3j3O7O6K8K9n1n1o7o6m3J4N3N4M0M1M2M1N9N9J4J3k1k0m7m7j3
4508B25j3j1j1m1m2oN0P1P1J9l8q2q1j3M4O3K9j0m3k9OM0M1j4j4l7l7k0k0j9j9J5J4mmK9L0
4492A39K4K5j0rM6M6O3O3nml9l9k6k6rrj1j1k8k9J4J5J4J4j2j3j2j2l2l2l2l2NMK1K2K2K1
4476A26j2j2l6l6K1K0K9K8k8k8k6k6QQK1K1K2K1K4K5K6pl8l8k7Ojl4m6m4k8PK3K4L1O6P8P9
$$ plain form
4595 126 147 167 187 207 206 204 203 201 205 210 182 155 121 120 177 235 275 281 250 185 138 147 201 256 292 328 326 291 229 168 119 104 134 165 197 229 227 224 222 219 226 233 240
4576 240 247 224 201 212 223 240 257 240 223 240 257 240 223 175 126 112 97 121 145 168 192 223 254 285 316 305 293 282 271 292 314 335 357 323 290
4561 290 222 155 101 47 27 7 11 14 17 21 22 24 -30 -85 -72 -58 -44 -31 6 45 83 121 140 158 177 195 228 261 294 327 279 232 218 204 200 196 158 120 125
4544 125 130 135 140 148 157 199 241 248 255 206 156 152 148 144 140 134 128 123 117 98 79 94 109 84 58 67 75 87 98 76 53 85 117 205 293 295 298 300 302 306 310 281 251 202 153 87
4524 87 21 17 13 44 74 87 99 78 57 44 31 98 164 192 221 170 119 52 -14 -57 -43 10 64 104 145 187 228 287 346 360 373 352 332 285 238 225
4508 225 212 201 190 149 107 101 151 222 293 312 274 192 111 98 142 205 234 224 181 152 158 198 239 225 211 174 137 117 97 78 59 74 88 84 80 109 139
4492 139 163 188 178 169 215 261 324 387 382 378 339 300 274 248 239 230 219 208 180 151 165 180 194 208 196 183 171 159 127 95 63 31 36 40 61 83 105 126
4476 126 114 102 66 30 51 71 100 128 100 72 46 20 28 36 57 78 100 121 145 170 196 189 151 113 86 92 91 57 11 -33 -61 -54 -31 -7 24 90 168 247
4459B47M3Rl2o5o6o6rK6K3K2rrqqrql0l1MLK7K7J0J0J3J3M5M4K8pk2k1mmJ3J3L4L5L2L2J8
4442C63j6n2n2l9nJ2M5O0K6j1m5o0k7L1L1K6K6j1m5n1n0j6J8L9L9M0Pl9p4m2pj8j8j8J6N5
4426A38N5L8L8L3%l8l8k8k8n9o0n6k2L6L7L5L5k2k1k9k9j4J9M0L9M2M2L7L6J2m4n7n6j3M4
4411A42N0N1llj0j1k2n6m5J1L3L4k3k2k2k3JKJJn1n1mN1O0N9PPk9k9l0k9l8l7J8J7L1L0L1
4394I9L1N1N1nnj6j6j6j6L8L7L4L4ro6q5q6k9N0Q1M7J8J9J6J6PQm9m9n8n7jjJ8J8J8J8J7J7
4377A79J7J7J9J9J8J9o3o4k9k9J0RM4M4M0L9ONJ2J2k2k2m4m4m4m4m9m8QQJ6J5J5J5l2l2k9
4361iK5O9O8onML7L7Ll0l1KJK4K3K4K4l7l7l4l5j4K1L5L5rrj0rnnM9N0K6pk2k2k6k7QPl1l1
4342A21l2l1j6j6J7J8L3L3L2L1J9j5l0l0k7k7k7k7NNNNK8K9onook6RL4L3k1k1j6j7j4j5l3
$$ plain form
4459 247 290 299 267 202 136 70 61 87 110 132 123 114 106 98 89 81 51 20 24 27 54 81 91 101 114 127 172 216 244 237 215 194 190 186 199 212 246 281 313 345 363
4442 363 347 295 243 204 199 211 256 316 342 331 286 226 199 230 261 287 313 302 257 206 156 140 158 197 236 276 283 244 170 128 121 103 85 67 83 138
4426 138 193 231 269 302 302 264 226 198 170 111 51 -5 -27 9 46 81 116 94 73 44 15 1 20 60 99 141 183 220 256 268 224 167 111 98 142
4411 142 192 243 240 237 227 216 194 138 93 104 137 171 148 126 104 81 82 84 85 86 35 -16 -20 31 91 150 157 164 135 106 76 47 9 -28 -10 7 38 68 99
4394 99 130 181 232 227 222 206 190 174 158 196 233 267 301 292 226 141 55 26 76 157 204 222 241 257 273 280 288 239 190 132 75 74 73 91 109 127 145 162 179
4377 179 196 213 232 251 269 288 225 161 132 103 113 122 166 210 250 289 295 300 312 324 302 280 236 192 148 104 55 7 15 23 39 54 69 84 52 20 -9
4361 -9 16 85 153 147 142 146 183 220 223 193 162 164 165 189 212 236 260 223 186 152 117 103 124 159 194 185 176 166 157 152 147 196 246 272 265 243 221 195 168 176 183 152 121
4342 121 89 58 42 26 43 61 94 127 159 190 209 194 164 134 107 80 53 26 31 36 41 46 74 103 97 92 86 80 54 63 97 130 109 88 72 55 41 26 -7
4325g%L6L7M1M1K6qk8k8MMPPPPllllklL2L2M0M0K6rk2k2PPj4m8o1o2k1J3N0N0K4K5K2K3j0
4306B51m5n7n7k6PK2K2NNk9k9jjN5N6L3L2k3k4n6n6%JJ1J2K9K8JJ%Jnol9l9J6J5J6J5L7L7
4289B15K0K0nnK9L0K0K0LLo2o2o1o2J5J4J5J4L5L4L4L4k2k2k2k2K4K4K4K4J1J2k3k2lmllm
4272B67mlmooonk7k7o1o0l9l8J8J7O2O2K9K8LMj4j3kkL2L2L1L2k5k5n7n6k2k3MNl0k9ooP4
4254A04P3M2M3j5j4J1J0k4k3k1k0J3J3j1j1K3K3K5K4rj0k9k9K7K8O3O3POl2l2j6j5OPn1q4
4237A65p5j8M9N0K5K5rrQQK5K4J8J7J8J7M9M9M9M9m4m4o0o1k4k4J0J0PPj0j0kjj9j8k5k4K9
4221B31K9kn8p9m6L0K9J4J4NMMNK3K3K3K3k7k7k7k7lmmlK4K5j0rj1j2M5M5N7N7L2k4m7m7l3
4203B42l3PQM1M1k3k2k3k2NNL9L9JKJJK9K9M2M3L5k2o7o7o5l1j7j6mmooj0m4n7n7j8J4L0L0
$$ plain form
4325 -7 -7 29 66 107 148 174 166 138 110 114 118 125 132 139 146 143 140 137 134 132 129 161 193 233 273 299 290 268 246 253 260 246 198 137 75 54 67 117 167 191 216 238 261 251
4306 251 206 149 92 66 73 95 117 122 127 98 69 68 67 122 178 211 243 220 196 140 84 84 85 96 108 137 165 166 167 167 168 163 157 118 79 95 110 126 141 178 215
4289 215 235 255 250 245 274 304 324 344 347 350 288 226 165 103 118 132 147 161 196 230 264 298 276 254 232 210 234 258 282 306 317 329 306 284 281 277 274 271 267
4272 267 263 260 256 250 244 238 233 206 179 118 58 19 -19 -1 16 78 140 169 197 200 204 190 177 175 173 205 237 268 300 275 250 193 137 115 92 96 101 71 42 36 30 104
4254 104 177 219 262 247 233 244 254 230 207 186 166 179 192 181 170 193 216 241 265 256 246 217 188 215 243 306 369 376 382 350 318 302 287 293 300 249 165
4237 165 90 72 121 171 196 221 212 203 211 219 244 268 286 303 321 338 387 436 485 534 490 446 386 325 301 277 287 297 304 311 301 291 289 288 269 251 226 202 231
4221 231 260 258 200 121 75 105 134 148 162 167 171 175 180 203 226 249 272 245 218 191 164 161 157 153 150 174 199 189 180 169 157 202 247 304 361 393 369 322 275 242
4203 242 209 216 224 265 306 283 261 238 216 221 226 265 304 305 307 308 309 338 367 409 452 487 465 398 331 266 235 218 202 198 194 188 182 172 128 71 14 -4 10 40 70
4185G0OONOj5j4J9J9K5K5j0m4m0oL0K9J4J4M6M6M7J2kkj1j1m5m5l3l3j8J5K8K7mnj6j7J6J5
4168A49%l4l4JO3O3N0J6k1k1k4k3ppK4K5M4J0m8m7m8j3M5M5Nk8k9NK3K2j0rK9K9K9K9j%j6
4151B86m9p3p2l7lkl%%J7J7L7Kk3k2k5k5%%L8P1P1P1L7L7rm2k4k3k1k2k1k1lml7l7m0m1J6
4134B1J6P0P0L1l6n1j6L9L9L7L7L6L7RQRQk9l0o4o3n2n2K6K7L7L7L7L7K4K4rj0onnooom0m0
4116A90l4l4%JJ3J4M7M8L9L9L9L9jkjjLKLLm2m2pqk2k2k2k1ooK9K8M8M7rrK5K5K5K5N7N8N8
4097F16N7N8N8N7N8Q5Q4Q5Q5J18J19J09J44K67M26N60O73P62P95P10N07J94j00m09o13p03
4086D802p03o28n15l89l22k45k11j69j35j18j18p1p1L1L1N6N7K2K3%JL4L5R4R3J73J73K88
4074B218K88L45L44L76L75M32N00O53R02J254J684K110K405K418K035J217K01q38j628k099
$$ plain form
4185 70 76 82 87 93 78 64 83 102 127 152 142 98 58 52 82 111 125 139 185 231 278 290 288 286 275 264 219 174 141 108 90 105 133 160 156 151 135 118 134 149
4168 149 149 115 81 82 145 208 258 274 253 232 208 185 178 171 195 220 264 274 226 179 131 118 163 208 213 185 156 161 184 206 196 187 216 245 274 303 302 302 286
4151 286 237 164 92 55 52 50 47 47 47 64 81 118 120 97 75 50 25 25 25 63 134 205 276 313 350 341 299 275 252 231 209 188 167 164 160 123 86 46 5 21
4134 21 37 107 177 208 172 121 105 144 183 220 257 293 330 339 347 356 364 335 305 241 178 126 74 100 127 164 201 238 275 299 323 314 304 298 293 288 282 276 270 230 190
4116 190 156 122 122 123 136 150 197 245 284 323 362 401 400 398 397 396 399 401 404 407 365 323 316 308 286 264 242 221 215 209 238 266 314 361 352 343 368 393 418 443 500 558 616
4097 616 673 731 789 846 904 989 1073 1158 1243 1361 1480 1589 1733 2000 2426 2986 3659 4421 5216 5926 6433 6627 6527 6118 5505 4802
4086 4802 4099 3471 2956 2567 2245 2000 1789 1620 1485 1367 1249 1178 1107 1138 1169 1225 1282 1304 1327 1327 1328 1362 1397 1491 1584 1757 1930 2218
4074 2218 2506 2851 3195 3571 3946 4378 4878 5531 6433 7687 9371 11481 13886 16304 18339 19556 19757 18919 17291 15192
4065A5192k258k142j938j611j273r39o91n37m24l62k48j75j07r8k9L9L9M3M4K2K3P9Q0J01
4055B830J01J89L01L98M65N28N95O86P98R15J027J232J616K240L030L915M660M939M510L231
4046C8206J266q91k812m108m674m623m148l464k810k210j691j258r19o51m92l56k44j65r8
4038C858j19j18j14j14j7j6M0M0L7L6J24K37L11L78M60N74O88Q02R43J101J388J816K387L178
4028A7900M112N083N733N665M632K666J51k311m195n257n482n143m449l612k856k246j737
4020H654j354r98p49n63m50l86l17k54j86j11m3noJ6J5M7M6J30J30J60K29L03M17M99O13P25
4009F562Q39J023J317J782K393L198M035M720M969M416L037J002j190l029m181m670m602m141
4001A7480l440k693k082j607j223r57p09n62m50l62k95k44j75j50j49r3k5J5J5k3k3k0j9J1
$$ plain form
4065 15192 12934 10792 8854 7243 5970 5031 4340 3803 3379 3017 2769 2594 2487 2389 2360 2399 2438 2481 2525 2547 2570 2649 2729 2830
4055 2830 2931 3120 3421 3819 4284 4812 5407 6093 6891 7806 8833 10065 11681 13921 16951 20866 25526 30465 34975 38206
4046 38206 39472 38581 35769 31661 26987 22364 18216 14752 11942 9732 8041 6783 5864 5213 4721 4365 4121 3956 3858
4038 3858 3739 3621 3507 3393 3376 3360 3400 3440 3477 3513 3637 3874 4185 4563 5023 5597 6285 7087 8030 9131 10519 12335 14722 17900
4028 17900 22012 27095 32828 38493 43125 45791 45942 43631 39436 34179 28697 23554 19105 15493 12637 10391 8654
4020 8654 7300 6302 5553 4990 4540 4154 3837 3583 3397 3286 3243 3238 3232 3248 3263 3310 3356 3486 3616 3776 4005 4308 4725 5224 5837 6562
4009 6562 7401 8424 9741 11523 13916 17114 21149 25869 30838 35254 38291 39293 38103 35074 30893 26223 21621 17480
4001 17480 14040 11347 9265 7658 6435 5478 4769 4207 3757 3395 3100 2856 2681 2531 2382 2289 2264 2279 2294 2271 2248 2228 2209 2220
3991B220P8J42J42J70J70K40L53N04O62R01J151J454J793K159K409K318J844J013m7j086j876
3982A6714k311k379k186j893j570j232r27o78m88l74k68k67k04k03j24j24m5m5n1n2n2n1l1
3972A159l0l0l1nnL1L1J8N1J04J61J68K02K71L50M46N25O28P07P41O62M61J32j95m77o51p53
3960D671p78p22n91m21k94k14j92j92j54j54p5p5l4l4o8o8q3q2k7k6k3k4k3k4MMMMj3j4j4
3947B68j3l3l3KJK8K8k9k8J1J1J1J1popopoooQPQQklklk5k6k6k6j7j7J7J7MMMMK2K1j2j2P
3927A44OPPL1L1L1L1J3J3J4J3j3j3K1K1NNm8m8j4M3M5M5QPm8m9o6o7rj0J6J7j8j7NONOm1m0
3909I5J6J6L1L0k5k6nmnmQQQQK2K2K3K2kkjkJ0J0J1J0J8J8j6j7k8k9K8K7RJ0RRJ7J7o3o2m2
3890A79m2qqk3k4k3k4N8N8N8N9NOp3p3l7l8lmk1k1J3J3J8J8J8J8J8J8J8J8M3M4RJ0J5J4J5
$$ plain form
3991 2220 2298 2440 2582 2752 2922 3162 3515 4019 4681 5582 6733 8187 9980 12139 14548 16866 18710 19723 19676 18590 16714
3982 16714 14403 12024 9838 7945 6375 5143 4216 3538 3050 2676 2408 2141 1937 1734 1610 1486 1441 1396 1345 1293 1241 1190 1159
3972 1159 1129 1099 1068 1063 1058 1089 1120 1138 1189 1293 1454 1622 1824 2095 2445 2891 3416 4044 4751 5492 6154 6615 6747 6552 6075 5424 4671
3960 4671 3893 3171 2580 2159 1865 1651 1459 1267 1113 959 884 809 775 741 673 605 522 440 413 387 364 340 317 293 297 301 305 309 296 282 268
3947 268 255 222 189 191 192 220 248 219 191 202 213 224 235 228 222 215 209 202 196 190 184 192 199 207 215 213 210 208 205 180 154 128 102 85 68 85 102 106 110 114 118 140 161 149 137 144
3927 144 150 157 164 195 226 257 288 301 314 328 341 328 315 336 357 362 367 319 271 257 300 345 390 398 405 357 308 242 175 166 156 172 189 171 154 159 165 170 176 135 95
3909 95 111 127 158 188 163 137 132 128 123 119 127 135 143 151 173 195 218 240 238 236 235 233 243 253 264 274 292 310 294 277 249 220 248 275 284 294 303 312 329 346 283 221 179
3890 179 137 129 121 98 74 51 27 85 143 201 260 265 271 198 125 88 50 47 43 22 1 14 27 45 63 81 99 117 135 153 171 214 258 267 277 292 306 321
3874C21J5l9l9l9l9j%%%k2k2J3J2K9L0L0L0J9K0J9K0K7K7Ln4p6p5l2K5K3K3K7K7L7L6k0k0
3858C35kklkj1j0j1j0k2k2p5p5n4KN0N0PPQPK0K1N4N4OOk7k8kkkjK9L0k6k7k5k4RRkjkjm0
3838A95l9J7J7j4j5j5j4M0M0L9M0l2l3l1K6O6O5J3J3m1m0m1m1k2k2k2k2k2k2k3k2J2J2J1J2
3823H5J4J3J4J4k1k0J3J3K6K6l1l0j%%%j8j8j8j8j6j6j5j6L1L2L3L2J1J1J1J1J0J0k3k4k7
3807I8k7k8k7J6J6J7J6K1K1Ok7l0l0ML7L8Mk8PL8L9PPJ1J1k3k3k0k0k0k1J5J5J5J5mnnnJ2
3790A43J2J4J3J7N0L2k5o2k9L0O3O3K8j0m3p3p2r1n7j0K2O3O2M0M0L7L8K6pqK7K0K1l7p0l3
3774B34l3l5l5j4j5j5j5L3L4L3L3M5M6O2K8ol9n5n4m1pQPO2O1L0K9M5P9O0O0M3M4Rp0j11j11
3758D29o0n9n3n2j9j8l3l3NL9M1M1j3j3opppk9l0NMK8K8K7K8J4J4L3J00R3R3k7k7n7n7k3k3
$$ plain form
3874 321 336 297 258 219 180 179 179 179 179 157 135 148 160 189 219 249 279 298 318 337 357 384 411 414 360 284 209 177 202 225 248 275 302 339 375 355 335
3858 335 333 331 328 326 315 305 294 284 262 240 165 90 36 38 88 138 145 152 160 167 187 208 262 316 322 328 301 273 271 269 267 266 295 325 299 272 247 223 232 241 239 238 236 235 195
3838 195 156 173 190 176 161 146 132 172 212 251 291 259 226 195 221 287 352 365 378 337 297 256 215 193 171 149 127 105 83 60 38 50 62 73 85
3823 85 99 112 126 140 119 99 112 125 151 177 146 116 115 115 115 115 97 79 61 43 27 11 -4 -20 11 43 76 108 119 130 141 152 162 172 149 125 98
3807 98 71 43 16 32 48 65 81 102 123 129 102 72 42 46 83 121 125 97 104 142 181 188 195 206 217 194 171 151 131 111 90 105 120 135 150 146 141 136 131 143
3790 143 155 169 182 199 249 281 256 194 165 195 258 321 349 339 296 223 151 60 3 -7 15 78 140 180 220 257 295 321 314 306 333 353 374 337 267 234
3774 234 201 166 131 117 102 87 72 105 139 172 205 250 296 358 386 380 341 286 232 191 184 192 199 261 322 352 381 426 505 565 625 668 712 721 651 540 429
3758 429 369 310 257 205 186 168 135 102 107 146 187 228 215 202 196 189 182 175 146 116 121 125 153 181 208 236 250 264 297 397 490 583 556 529 472 415 392 369
3742C69RRk5k4k4k3k3k4oopoJ%l3l3L6L6P0P0N5N5jkj0j0j0j0k7k6QPj1j2m1m1OP5R7R7J26
3724F91J93K63L32L78L78K12l5k64l31k90k23j62j63j24j24r4r3r3r3n6n7k2k3j9j9j4j5k9
3712A04L9N8N7l2l2l2l2RQQRllklP5P6M2M2L5L5L5L5j4j3p1p0p4p5j8j8mllmj1j2o4o4l7L0
3694CM9M9M6M6M5M6j5j6J8J9J6J6m1m0PQQPl1l2l1l1k8k8k8k8j4j3M3M3L6L5m3m3RRQRj9k0
3677G4L7L7KKKJNNl0k9J1J1J1J1K0K1K1K1J0J1k3k3n2n1MNM7M7J3J3opopj7j7j7j8qrM8M8
3658B18m6m5k7M1N4N4KKOPOPm2m1qpQQRQJ7J8j6j7k7k7OPllklj4j4m4m4k6M2Q3Q3oooom5m5
3638A16q3j6K1K1K4K3Ok9o3o3m3j0NNL9L8L8L8K1K1K1K0PPOPJ9K0J9J9J7J7J5J5L4%j5j4j8
3621C05j8j7j8kklkK9K9onK9K8J5j8k9NLl1l5l4l6l7m4m5l0ML2L3L3L3rm2m5j1kl7l3%M3M3
$$ plain form
3742 369 378 387 362 338 314 291 268 244 238 232 225 219 220 220 187 154 190 226 296 366 421 476 475 473 463 453 443 433 406 380 388 395 384 372 331 290 296 371 468 565 691
3724 691 884 1147 1479 1857 2235 2447 2412 2148 1817 1527 1304 1142 979 855 731 637 544 451 358 302 245 223 200 181 162 148 133 104
3712 104 143 201 258 226 194 162 130 139 147 155 164 161 158 156 153 228 304 346 388 423 458 493 528 514 501 430 360 286 211 193 175 171 168 165 161 150 138 74 10 -27 3
3694 3 52 101 147 193 238 284 269 253 271 290 306 322 281 241 248 256 264 271 240 208 177 146 118 90 62 34 20 7 50 93 129 164 121 78 87 96 104 113 94 74
3677 74 111 148 150 152 154 155 160 165 135 106 117 128 139 150 170 191 212 233 243 254 231 208 156 105 109 114 161 208 221 234 228 221 215 208 191 174 157 139 131 122 170 218
3658 218 172 127 100 141 195 249 251 253 259 266 272 279 237 196 188 181 189 197 206 214 231 249 233 216 189 162 168 175 172 169 167 164 150 136 92 48 22 64 147 230 224 218 212 206 161 116
3638 116 33 17 38 59 83 106 112 83 20 -43 -86 -96 -91 -86 -47 -9 29 67 88 109 130 150 157 164 170 177 196 216 235 254 271 288 303 318 352 352 337 323 305
3621 305 287 270 252 250 248 245 243 272 301 295 290 319 347 362 344 315 320 323 292 257 223 187 150 106 61 31 35 67 100 133 166 157 115 70 59 57 20 -13 -13 30 73
3604G3rqJ6N0O5O5Q0Q0P6J9m0p4n8n9n7n8k0J3J3J3%l4n3n4l9pPOO3O2M2j4l8l9m4m4m5m4
3587i5%%%%L8L8L6L6O6L2l2o5l1k9K3K3M0L9j7j7m4m2j0j0NMMNK6K7K7K7L6L5KKJ8J9j5j6
3570A85j2j3M4M4J3J3k2k1J2J2k2k2l7l7l7l7rqqqL9L9L9L9lllmj7j8j8j7L2L3L2L3K2K2j2
3553B65m6o1mO1O0L1k4k7k7nnnnJ3J3J2J3mlmlj6j5m9n0k7k7OPN9N9L5k2n8n9nok9k8k8k8
3535c6N4N6K1K2j0j0K4K4L1L0mlK4K4K4K4m0l9m0l9J4J5j9k0K0J9K0J9k5k6k5k5K1K1N5N6
3520B57M0M1l9l8k0j9J4J5L9L9L9L9K6K6l4j01q0j2L6J03J49K16J89L0j52k19j73j05n9n9
3507A88k1k1L7L8L8L8k5k5RRPQm9m9n1n1K8K9qqpqL2L1k5k6j3j3K1K1qqqqJ0J1M4M4J8J9j6
3489B32j6k6k6N3N3M8M9qqj3j2K1K1QRm8m8n0m9p9p9m5K0M1M0L7L7L7L7L9L9m0m0p3p2l9l9
$$ plain form
3604 73 64 56 72 122 187 252 332 412 488 507 467 393 335 276 219 161 141 154 167 180 180 146 93 39 0 -7 0 6 69 131 173 159 121 82 38 -6 -51 -95
3587 -95 -95 -95 -95 -95 -57 -19 17 53 119 151 119 54 23 -6 17 40 80 119 102 85 41 -1 -11 -21 -16 -12 -8 -3 23 50 77 104 140 175 177 179 197 216 201 185
3570 185 173 160 204 248 261 274 252 231 243 255 233 211 174 137 100 63 54 46 38 30 69 108 147 186 183 180 177 173 156 138 120 103 135 168 200 233 255 277 265
3553 265 219 158 154 215 275 306 282 255 228 223 218 213 208 221 234 246 259 255 252 248 245 229 214 165 115 88 61 67 74 133 192 227 205 147 88 83 77 48 20 -8 -36
3535 -36 18 74 95 117 107 97 121 145 176 206 202 199 223 247 271 295 255 216 176 137 151 166 147 127 147 166 186 205 180 154 129 104 125 146 201 257
3520 257 297 338 299 261 241 222 236 251 290 329 368 407 433 459 425 324 244 232 268 371 520 736 925 955 803 584 411 306 247 188
3507 188 167 146 183 221 259 297 272 247 256 265 272 280 231 182 131 80 108 137 129 121 114 106 138 169 144 118 105 92 113 134 126 118 110 102 112 123 167 211 229 248 232
3489 232 216 190 164 217 270 318 367 359 351 338 326 347 368 376 385 337 289 239 190 111 32 -13 7 48 88 125 162 199 236 275 314 274 234 161 89 50 11
3473A1m9n1j7j6N0M9M7M8Ok8rrj1j1KL6O6L3k5n9k1L5N6N5L2km0m0j5j6J8J8M6M6L1lo5o5
3456A33n3j8K3K3K5K5J1J0J1J1K5K5K4K5QQQQj7j8j7j7j8j8j8j8jkjkNMn2n2m6m5l1LN1N1
3439G3N4N3M4M3J2J2J5M9L0L1LLl0l1m4m4j1j0rqK3K4Ll2j2j2RJ0J0RM1M0Ll1m5m5RRj6j6
3422B16m8m9n6k3J5J5NNj4J9N2N2pm0m5m5J0M5M1Pk9k8ONNOL1L1M7J4j8n2l5l5J0J1J3J3K5
3405A75N9N7K3j1m4o0n9l5%k0j9mllmLLL7L7O6O6M8J5k8o3o4l1j%KJj0j0j0j0JJ%JjjL3L3
3386A70j%%jk1k1k1k1mlmlj1j1K3N7O1Nj8j8J4J4J4J4l2l2j9J4Jl3k9NL5P0P1L7J1J1RRJ8
3368C60J7L6Ll6l5lmj2j2m6m6l6l6l3l4j4K0N8N7N6N5jjJJJJJ7J7j7j7k9k9k6k7k9NPk7l6
3351A26lL3L2QPONk7o2m1J7L0L0k2k3qqrqK9K9K7K7ol9n5n4J5J4J4J5K7K7K7K7N6N6Rm8p2
$$ plain form
3473 11 -38 -89 -106 -122 -72 -23 24 72 78 50 41 32 21 10 12 48 114 147 122 63 42 77 133 188 220 218 178 138 123 107 125 143 189 235 266 263 198 133
3456 133 80 62 85 108 133 158 169 179 190 201 226 251 275 300 308 316 324 332 315 297 280 263 245 227 209 191 190 188 187 185 190 194 142 90 44 -1 -32 -29 22 73
3439 73 127 180 224 267 279 291 306 355 385 416 419 422 392 361 317 273 262 252 243 235 258 282 285 253 241 229 238 248 258 267 308 348 351 320 275 230 239 248 232 216
3422 216 168 119 63 40 55 70 75 80 66 85 137 189 182 142 97 52 62 107 148 155 126 98 104 109 114 120 151 182 229 243 225 173 138 103 113 124 137 150 175
3405 175 234 291 314 303 259 199 140 105 105 85 66 62 59 56 52 55 58 95 132 198 264 312 327 299 236 172 141 140 140 142 143 133 123 113 103 104 105 105 106 105 104 137 170
3386 170 169 169 169 168 147 126 105 84 80 77 73 70 59 48 71 128 189 194 176 158 172 186 200 214 182 150 131 145 146 113 84 89 124 194 265 302 313 324 333 342 360
3368 360 377 413 416 380 345 342 338 326 314 268 222 186 150 117 83 69 89 147 204 260 315 314 313 314 315 316 317 334 351 334 317 288 259 233 206 177 182 189 162 126
3351 126 123 156 188 196 203 209 214 187 125 84 101 131 161 139 116 108 100 91 83 112 141 168 195 189 150 95 41 56 70 84 99 126 153 180 207 263 319 328 280 208
3334B08p3m2m2qqqpOOom0m1qK8K7L5L6K4j1l5jL4L5KKLKK7K6K6K6l5l5k0J3K9K8mlrrm3m3
3315I2l9l8k2RL9L8M1M1J9J9j5j4j7j7J7J7K5K5qrppk6PL4L4LKj7j8j7j8jjN6N5M7M8j0rn3
3297C05n2n3n3mnmnOOO3O2M8M8J4J4k2k2n6n6q2q3k6k6mlL1L0L8L9j9j8k7k7k7k7k3k3L2L2
3280B1O1O0MMk0k0k0k0J3J3J3J3k2k3J2J1M1M1OPJ3J4k1n5n9lK0K0klL2L2L8L9NMk8k8k7k8
3263A58poppj3j3j2j3jjL4L3M5M6M5M5J2J3J2J2j3j3j4j3k9k9k9k9k8k9ONL0L0L0K9J5J4j9
3246B89k0o0o0o1o0k0j9J3J4M7M6j0j0J1J1M5M5pom0m0k8k7k7k7L4L6L5L5j9j8j8j9KKKKj2
3230F1j2j2j2J5J4J5J5k9k9o2o3jjL3L2%%j%J5J5M8M9K9L0nn%%J%mmnmk2k1n6n5L0L0L0L1
3211I0qqK6K6KLl1l1m8m7j4j4jjL4L2K9K9K7K7n4q8o8j1J5J5J9J8M1M2QQj6j7J8J8L3L3O4
$$ plain form
3334 208 135 93 51 43 35 27 20 26 32 26 -14 -55 -63 -35 -8 27 63 87 76 41 40 74 109 111 113 116 118 145 171 197 223 188 153 133 146 175 203 199 196 187 178 135 92
3315 92 53 15 -7 2 41 79 120 161 180 199 184 170 153 136 153 170 195 220 212 203 196 189 163 170 204 238 241 243 226 208 191 173 172 171 227 282 329 377 367 358 305
3297 305 253 200 147 143 138 134 129 135 141 204 266 314 362 376 390 368 346 290 234 152 69 43 17 13 10 41 71 109 148 129 111 84 57 30 3 -20 -43 -11 21
3280 21 82 142 146 150 130 110 90 70 83 96 109 122 100 77 89 100 141 182 188 195 208 222 201 146 87 84 104 124 122 119 151 183 221 260 265 269 241 213 186 158
3263 158 151 145 138 131 118 105 93 80 79 78 112 145 190 236 281 326 338 351 363 375 362 349 335 322 293 264 235 206 178 149 155 160 190 220 250 279 294 308 289
3246 289 269 209 149 88 28 8 -11 2 16 63 109 99 89 100 111 156 201 194 188 148 108 80 53 26 -1 33 69 104 139 120 102 84 65 67 69 71 73 61
3230 61 49 37 25 40 54 69 84 55 26 -36 -99 -100 -101 -68 -36 -36 -36 -37 -37 -22 -7 41 90 119 149 144 139 139 139 140 140 136 132 127 123 101 80 24 -31 -1 29 59 90
3211 90 82 74 100 126 128 131 100 69 21 -26 -40 -54 -55 -56 -22 10 39 68 95 122 68 -20 -88 -99 -84 -69 -50 -32 9 51 59 67 51 34 52 70 103 136 200
3194B00O3L2k5n0m9q1q1m6m6L0L0K9L0N6N7K2K2L0K9k7k7n7n7k2k3m7m8j4j4%%%%K0J9K0J9
3178fL3L4L3L4K1K1K1K1jjjjJ%l3l3j%L4L4P7P8N2ll2l2l6l5o1o0J8J9N3N3k6k6n1n0LMom0
3160A09k1L5M8J4LLl2l2l2l1n1n0n1n1L9L9L8L8M6M5j1j1m6m5m2J4P9J13P3J7LLl4o8n7%M6
3144A40M5kkl6l6k3k4L4L3J9J9P1P2J7n0m7m6k1k2J3J2J9J9J9J9L0L0K9L0rrrrj4j4K0J9J6
3127C52J6J5J6m2m3m2m2n1n1j1N8O6O6J4J4k5k6k5k5J9J9j5j4k6k6L0L1O1O1O1O1R1R2J37
3113H16K04K31K99M34N92N45J61l51o43o06m02k69k00j29j29m6m6J0J1l0r8o6o6RRJ3J3J3
3100B79J4K3K3K4K3m1m2m1m2j2j2j2j3kkl2l2l4L4P5P5J6J6m1m1l1l2M7M8MNMMKKn4n5k2k3
3084A02k3k2RJ0RJ0j4j4l2JK9L0L1L2L1L1J6j8l4l4kkj4j5j7j7Jl3l3JK6K7onL9L9j5j5KL6
$$ plain form
3194 200 263 295 270 220 171 90 9 -37 -83 -53 -23 6 36 92 149 171 193 223 252 225 198 141 84 62 39 -8 -56 -70 -84 -84 -84 -84 -84 -64 -45 -25 -6
3178 -6 27 61 94 128 149 170 191 212 211 210 209 208 209 209 176 143 142 142 176 210 287 365 417 414 382 350 314 279 218 158 176 195 248 301 275 249 198 148 151 155 149 109
3160 109 88 123 171 185 188 191 159 127 95 64 13 -37 -88 -139 -100 -61 -23 15 61 106 95 84 38 -7 -49 -35 44 157 230 247 250 253 219 151 94 94 140
3144 140 185 183 181 145 109 86 62 96 129 148 167 238 310 327 277 230 184 163 141 154 166 185 204 223 242 272 302 331 361 352 343 334 325 311 297 317 336 352
3127 352 368 383 399 357 314 272 230 179 128 117 175 241 307 321 335 310 284 259 234 253 272 257 243 217 191 221 252 313 374 435 496 587 679 816
3113 816 1020 1251 1550 1984 2576 3121 3282 2931 2288 1682 1280 1011 811 682 553 507 461 471 482 452 354 288 222 231 240 253 266 279
3100 279 293 316 339 363 386 345 303 262 220 208 196 184 171 169 167 135 103 69 103 178 253 269 285 244 203 172 140 187 235 239 244 248 252 254 256 202 147 125 102
3084 102 79 57 66 76 85 95 81 67 35 36 65 95 126 158 189 220 236 218 184 150 148 146 132 117 100 83 84 51 18 19 45 72 66 61 100 139 124 109 111 147
3066A47L5Kl8l8m1m0j8j6J6J7K9L0L0K9K0K0j4j5J5J4L3%p1p2n8k4J6J7J9J9K3K3K3K3RJ0
3051A74M4M3M4M3J0J0j1j1j0j1n7n7m2rK8K8lmJKK0j4k9k9k9k9k7QM3M3L8MKL5N0J5k0k0n0
3034B23n1m8m9j9J5nmj0rm1l9k3J1M9M8L7L8%l4m0m0nL0O4O4O6O6O2O2J4m2r6r6m0opqnno2
3016F5o3m6j4M4M3M6M5L0L1k7k6j6j6J8J9J6J6j8j8k7k8k5k6J9N3L3L4O1O1O1O2LKLLl4l3
3000C51l4l4j4j4j4j4k5k4RJ0JKJKK7K7K4K5qm1n5n4m4j0K7K8K0K0L3O6O6L2k7o1l5%J2J2
2984B87k2k1k2k2j0rM4M5O2K8j2m7p1p2n9k5J9K0K1K2J2J1pK7L3L3KJ%%l4l4j4j5K0K0jkL3
2967B41L3K2K2l4l5j3j3j3j3qqqqj9k0k0k0N3N3K0J9K3K4K3K4kkkkl1l1LLJ4J3k0k0RJ0m7
2950B20m7n8n8k4k5J3J3O9O9N3N3k6k6k8k8k8k8k4k5J0RN0M9ppk4k3k4k3l2l3K4K4L4L5L4
$$ plain form
3066 147 182 184 146 108 67 27 9 -7 9 26 55 85 115 144 164 184 170 155 170 184 217 217 146 74 16 -8 8 25 44 63 86 109 132 155 164 174
3051 174 218 261 305 348 358 368 357 346 336 325 268 211 169 160 188 216 213 209 210 212 232 218 189 160 131 102 75 83 126 169 207 211 213 248 298 313 293 273 223
3034 223 172 124 75 56 71 66 62 52 43 2 -37 -60 -49 0 48 85 123 123 89 49 9 4 34 98 162 228 294 356 418 432 390 294 198 158 152 145 137 132 127 65
3016 65 2 -44 -58 -14 29 75 120 150 181 154 128 112 96 114 133 149 165 147 129 102 74 49 23 42 95 128 162 223 284 345 407 410 412 415 418 384 351
3000 351 317 283 269 255 241 227 202 178 187 197 198 200 201 203 230 257 281 306 298 257 202 148 104 94 121 149 169 189 222 288 354 386 359 298 263 263 275 287
2984 287 265 244 222 200 190 181 225 270 332 360 348 301 230 158 99 74 93 113 134 156 168 179 172 199 232 265 267 268 268 268 234 200 186 171 191 211 210 208 241
2967 241 274 296 318 284 249 236 223 210 197 189 181 173 165 146 126 106 86 139 192 212 231 254 278 301 325 323 321 319 317 286 255 258 261 275 288 268 248 257 267 220
2950 220 173 115 57 33 8 21 34 103 172 225 278 252 226 198 170 142 114 90 65 75 84 134 183 176 169 145 122 98 75 43 10 34 58 92 127 161
2934A61L5j8j7j8j7j1j0m5m4j3j1K0K2MMLMKJN8N8L3L2k4k3k5k4k5k4k4k3L4L3NMMNK5K6l1
2917A46l1nonoJ6J7R1R1O5lo6o7m5m5m5m5L3L3L3L4k1k0k1k0j5j5j5j4j5j4K0K0K8K7K8K7
2901A70j3j3j4j3n5n4j3N3N0N0K0K0N1N0N1N0K5K5qrl0l0l0k9l2l2l2l2kjkkJ8J9J8J8ppp
2884B21on0m9QPM4M4J0J0k7k8k7k7n4n3K6K5j2j3K2K1KKJKK4K4K3K4l9l8l8l9k1k0k0k1M2
2867@M1R5R4Q1J2k8k8j5j4j4j4M7M7K9l9m1m1j2j1OOOPrrk1n5m6j2M5M6K7K7nnmK9M4M4j6
2850B94j7l5jRJ0k1k0lL0J2J2k9k9k8k9l5l5k0J3K9L0L1L1PPPPj5j5j5j4k4k4L1L1L7Lj1j2
2833A99k5k5k3k3j2K2N6N6N5ko8o7o0mK1K1K3K2K3K2kjkkj6j7m8m9k0J3N0N1ppopk0k0J4J4
2816A29j8j8nK9K1j4m9m8k7k7j2K1N7N7K2j2%%kkj2j2j2j2l6l5kkK1K1N2N1M1j6m1m1K0K0
$$ plain form
2934 161 196 178 161 143 126 115 105 60 16 3 -8 12 34 38 42 45 49 51 52 110 168 201 233 209 186 161 137 112 88 64 41 75 108 113 117 121 126 151 177 146
2917 146 115 110 104 99 93 109 126 217 308 373 370 304 237 192 147 102 57 90 123 156 190 169 149 128 108 93 78 63 49 34 20 40 60 88 115 143 170
2901 170 157 144 130 117 62 8 -5 48 98 148 168 188 239 289 340 390 415 440 432 423 393 363 333 304 272 240 208 176 174 173 171 169 187 206 224 242 235 228 221
2884 221 215 165 116 124 131 175 219 229 239 212 184 157 130 76 23 49 74 62 49 71 92 94 96 97 99 123 147 170 194 155 117 79 40 19 -1 -21 -42 0
2867 0 41 136 230 311 323 295 267 252 238 224 210 257 304 333 294 253 212 200 189 195 201 207 214 205 196 175 120 74 62 107 153 180 207 202 197 193 222 266 310 294
2850 294 277 242 241 250 260 239 219 216 246 258 270 241 212 184 155 120 85 65 78 107 137 168 199 206 213 220 227 212 197 182 168 144 120 151 182 219 222 211 199
2833 199 174 149 126 103 91 113 169 225 280 278 210 143 83 79 100 121 144 166 189 211 209 208 206 204 188 171 123 74 54 67 117 168 161 154 148 141 121 101 115 129
2816 129 111 93 88 117 138 124 75 27 0 -27 -39 -18 39 96 118 106 106 106 104 102 90 78 66 54 18 -17 -19 -21 0 21 73 124 165 149 108 67 87 107
2799A07Rk5k0L7Q2Q2j2j1j5j4j8p4p6p6m3m4J3J2N7N5k3k2k8k9k8k8K9L0K9L0K9K9L0K9J0
2784A13J0J0J0n3n4k0j8L2L3%jJ8J9J8J9M4M5J0J1k6k6k6k6J6J5P3P2PPm9m9k2k1k1k2j8j9
2768A11j9j8K3K3j0j1l7l7l7l7QRj3p0p1j5K8K9kkL2L2LMl1l0JKN7N8L4L4%J%%J%o6o7l1l1
2750a45K0N4O7O6M7J3J3M7Q5Q6L1m9j12j13l8M2O2O2L2L1Jl3j4j4j6j6j6j6nonnk3k2RJ0q
2734A22m2m3qJ2J2nK9O7O7N2J8j0m4n8n9j5J9%%k9k9k9k9j7j7j7j7kkL4O6N5K1QQJ3J3J3J3
2717A70J1J1J1J1l0l1l0l1j2j3j3j3L3L3jjJ0J0RJ0klklm2m3o0k8L2L2N4K0qqK4K5J7J8j4
2700A53j5l9nL1L0J3k2n9n9n4n5j8J6J9K0K1K2K5K7qpk3k3J0J0kklkK6K7K6K6L8L7m1m1q0
2683A9p8k3k2M0M1P0P2L8j9k0k1K5K4K5K5M0M1j6j6J4J4J4J4j2j3m6m7j5j5j5j6k7k7o0o0
$$ plain form
2799 107 116 91 71 108 190 272 260 249 234 220 202 128 52 -24 -67 -111 -98 -86 -29 26 3 -19 -47 -76 -104 -132 -103 -73 -44 -14 15 44 74 103 113
2784 113 123 133 143 90 36 16 -2 30 63 63 62 80 99 117 136 180 225 235 246 220 194 168 142 158 173 246 318 325 332 283 234 212 191 170 148 130 111
2768 111 92 74 97 120 110 99 62 25 -12 -49 -41 -32 -45 -115 -186 -201 -173 -144 -146 -148 -116 -84 -81 -77 -108 -138 -137 -135 -78 -20 14 48 48 49 49 49 50 50 -16 -83 -114 -145
2750 -145 -125 -71 -4 62 109 122 135 182 267 353 384 335 223 110 72 114 176 238 270 301 302 269 255 241 225 209 193 177 172 166 161 156 133 111 120 130 122
2734 122 80 37 29 41 53 48 77 144 211 263 281 271 227 169 110 95 114 114 114 85 56 27 -2 -19 -36 -53 -70 -72 -74 -40 26 81 102 110 118 131 144 157 170
2717 170 181 192 203 214 184 153 123 92 80 67 54 41 74 107 106 105 115 125 134 144 142 139 137 134 92 49 -11 -39 -7 25 79 99 91 83 107 132 149 167 153
2700 153 138 99 94 125 155 168 146 87 28 -26 -81 -99 -83 -64 -44 -23 -1 24 51 43 36 13 -10 0 10 8 6 3 1 27 54 80 106 144 181 140 99 19
2683 19 -59 -82 -104 -64 -23 47 119 157 138 118 97 122 146 171 196 236 277 261 245 259 273 287 301 289 276 230 183 168 153 138 122 95 68 8 -52
2668e2j1j1j0j1RRRQJ1J1J1J1j4j4J9K0K4K6K6K6MNMMM9M9Kn5p3p3j9j9L7L9L9L9J0J0M4M4
2651B37qrqqk3k2n6n7K4K5K4K4M0L9j7j7j4j4j4j5rj0K4K4NNONj0j1j0j0J6J5J7J8K5O0L8
2634C29L8L6Kl9p3q3q4l8J8L3L4k0j9j0rj0rJ9J8J9J9N5N5ll7k9Nj6j6l3l3l4l3k1k1J3J3
2618C6J9J9J9J9K1K1K1K1%%%jJ8J7J5J6ml7n0n0NL8K0K0K4K4Rk5k3k3QRK2K2j4m7m0pN0M9
2601B41J2k3l7l7k6k6RQJ3J4J3J4N6N6J8j5k9k8LLJ5J5J5J5j5j4m8m9l8l9l4l5l9J5O4O4M4
2585A75M4J0J0j3j3J9J8K8om1m1k8PM5P9Q8N5j4p1q7n3j9k0nnonl6l6K1K0lkllj4j3j4j4M4
2567I8M3O3K9k5k4k7k6k7k6k7k6onmlK0N4N4K0l9l9k6QL8L8J5m1p4p3m0pL0L1L1L3M9N0L5
2551A74Jqrj1j1j0j1j1j1j1j0j1j1L6L7L6L6J1J1L0mm7m6j5j5J6J6J6J6K7K7N9N9L1ll8l7
$$ plain form
2668 -52 -63 -74 -84 -95 -86 -77 -68 -60 -49 -38 -27 -16 -30 -44 -25 -5 19 45 71 97 101 106 110 114 163 212 214 159 86 13 -6 -25 12 51 90 129 139 149 193 237
2651 237 229 220 212 204 181 159 103 46 70 95 119 143 183 222 205 188 174 160 146 131 122 112 136 160 165 170 176 181 171 160 150 140 156 171 188 206 231 291 329
2634 329 367 403 405 366 293 210 126 88 106 139 173 153 134 124 115 105 96 115 133 152 171 226 281 278 241 212 217 201 185 152 119 85 52 31 10 23 36
2618 36 55 74 93 112 133 154 175 196 196 196 196 195 213 230 245 261 257 220 170 120 125 163 183 203 227 251 260 235 212 189 197 206 228 250 236 189 149 142 192 241
2601 241 253 230 193 156 130 104 113 121 134 148 161 175 231 287 305 290 261 233 236 239 254 269 284 299 284 270 222 173 135 96 62 27 -12 3 67 131 175
2585 175 219 229 239 226 213 232 250 278 272 231 190 162 169 214 293 381 436 422 351 264 211 192 172 167 162 156 151 115 79 100 120 117 115 112 109 95 82 68 54 98
2567 98 141 204 233 208 184 157 131 104 78 51 25 19 14 10 7 27 81 135 155 116 77 51 59 97 135 150 109 35 -38 -78 -85 -55 -24 7 40 89 139 174
2551 174 175 167 158 147 136 126 115 104 93 82 72 61 50 86 123 159 195 206 217 247 243 196 150 135 120 136 152 168 184 211 238 297 356 387 384 346 309
2535C09j5J9J9j5l6l6mnJ%%%KLK1j2p5p4m2m3J8J8J9J8j2j3m6m5k9k8NOj4j4M2M3P5P6J9J9
2517A74l5l5l5l5j7j6M0L9M3M3M3M3M3M4j3j3n9n8k5k5l3l3l3l3K2K3K2K3k0k0k0k0J2J2J2
2502F0J2j3j3j4j3J4J3J4J3lkllJ9K0j5j5m0l9opL4L4L4L5K5K6l0l1m7m7m7m7L5L4L4L5M4
2486A00M5J1J1k4k4k4k3QQQQL5L6JKl5l4l5l5j3j4K0K1J4J4J4J4M3M4J0J0l9l8l8l8J1J2M5
2469A31M5N0N0N0N0L3L2k4k4n8n9k4k5j%l5l4m3m2qrMMLMm9m8j5j5POOOJ9J8P5P5O4O5j5j4
2452B55o3o4k9k9onn8n6rN9N3N5J5J4J4J5J9J9j5j5J7J7j7j8m6m6j2j2L6L6lp1n0j8J6J5K
2435A5LLLj6j4J7J8K2K2j2j2k2k1L5L5%%L4L4ONk8k8MLMLJ7J7M6M6L1l7l3l2K4K5K4K4J4J4
2418B93J4J4j6j5j6j6K1K1j2j3k9k8K7K8QQQQpqqpm8m8RQkkkkK0K0j3j4J5J5J5J4j3j2K1K1
$$ plain form
2535 309 294 313 332 317 281 245 241 236 237 237 237 237 239 242 263 251 176 102 60 17 35 53 72 90 78 65 19 -26 -55 -83 -78 -72 -86 -100 -58 -15 60 136 155 174
2517 174 139 104 69 34 17 1 41 80 123 166 209 252 295 339 326 313 254 196 171 146 113 80 47 14 36 59 81 104 84 64 44 24 36 48 60
2502 60 72 59 46 32 19 33 46 60 73 70 68 65 62 81 101 86 71 31 -8 -14 -21 13 47 81 116 141 167 137 106 59 12 -35 -82 -47 -13 21 56 100
2486 100 145 156 167 143 119 95 72 80 88 96 104 139 175 176 178 143 109 74 39 26 12 32 53 67 81 95 109 152 196 206 216 177 139 101 63 74 86 131
2469 131 176 226 276 326 376 409 441 417 393 335 276 252 227 226 226 191 157 114 72 64 55 59 63 66 70 21 -27 -42 -57 -50 -44 -38 -32 -13 5 80 155 219 284 269 255
2452 255 192 128 99 70 64 59 1 -55 -64 -5 48 103 118 132 146 161 180 199 184 169 186 203 186 168 122 76 64 52 88 124 121 50 0 -18 -2 13 15
2435 15 18 21 24 8 -6 11 29 51 73 61 49 27 6 41 76 76 76 110 144 150 155 127 99 103 106 110 113 130 147 193 239 270 233 200 168 192 217 241 265 279 293
2418 293 307 321 305 290 274 258 279 300 288 275 246 218 245 273 281 289 297 305 298 290 282 275 227 179 188 196 194 192 190 188 208 228 215 201 216 231 246 260 247 235 256 277
2399B77j8j8J7J6J2J2m2m3o6l2J6P3O3K8noJ8J8j6j6QPQQJ4J3J4J4n2n1n2n1p4p4p3p4j4j5
2383a56M2M2P1P0L7L8J9K0K0J9k2k3J1J2L4L5O8O8M8M8qrm9m9m9m9k9l0MMj9j9J4J5NOp0p0
2367I9o6j0L7L7J2J1M2M2J0m6o8l3J3J2J5J5jjjjL4L5L5L5J5J5j9j9l4l4rM7N1N2N1N2L4k2
2350D37r0r1p3l9kkmnnnqqm1m2k7k9k9k9m2m2J8N2L2L1L4L3N8N8K4K4J9J8J8J8l2l2l1l2k0
2333A14k0k0j9lkL0L0K0j3j3K0M4M4j2m5k8OMl0n4n3p3m0%L3J6J6K6K6K7K6J0RRRk8k8k7k7
2316a6J0J0J0J0rqOM0M4M4J0J0pm1n4n3k1J2ppm6m6j2j2L5L6L5L4N8N7N7N7J8J7J7J7J7J7
2300C39J8J7m4m4m3m4J%JJN8N8JKjjkjl8l9m3K5Q1Q0K6m2q7j9M0M0L1L1lln6n5n6n6LLL6L7
2282B52J2J2k2k2rrrj0m6m6m6m6j8j9J4J4J5J6j9j7OQPQM5M5j1j2m9m8L0L0M9M9l0k9lkkl
$$ plain form
2399 277 259 241 258 274 286 298 256 213 147 115 131 204 267 295 290 284 302 320 304 288 296 303 311 319 333 346 360 374 322 271 219 168 94 20 -53 -127 -141 -156
2383 -156 -114 -72 -1 69 106 144 163 183 203 222 200 177 188 200 234 269 337 405 453 501 493 484 435 386 337 288 259 229 233 237 218 199 213 228 233 239 169 99
2367 99 33 23 60 97 109 120 162 204 214 168 100 67 80 92 107 122 121 120 119 118 152 187 222 257 272 287 268 249 215 181 172 219 270 322 373 425 459 437
2350 437 347 256 183 144 142 140 136 131 126 121 113 105 64 22 -5 -34 -63 -92 -134 -176 -158 -106 -74 -43 -9 24 82 140 164 188 207 225 243 261 229 197 166 134 114
2333 114 94 74 55 52 50 80 110 130 117 104 124 168 212 200 155 127 133 137 107 53 0 -73 -113 -113 -80 -64 -48 -22 4 31 57 67 76 85 94 66 38 11 -16
2316 -16 -6 4 14 24 15 7 13 53 97 141 151 161 154 113 59 6 -15 -3 -10 -17 -63 -109 -121 -133 -98 -62 -27 7 65 122 179 236 254 271 288 305 322 339
2300 339 357 374 330 286 243 199 200 200 201 202 260 318 319 321 320 319 317 316 278 239 196 221 302 382 408 366 279 260 300 340 371 402 399 396 340 285 229 173 176 179 215 252
2282 252 264 276 254 232 223 214 205 195 149 103 57 11 -7 -26 -12 2 17 33 14 -3 3 11 18 26 71 116 105 93 44 -4 26 56 105 154 124 95 92 90 88 85
2264H5J5J4j9k0J4J3J4J4J9K0K0J9j8j7j8j8n1n1K8K8j5j5m9m8RRM2M3J9J9j5j5OPk5k5ML7
2248G9L8Mk8k8LMOPOPK0K1j4m9o1k6L0L1M4M4M4M5J0J0J1J0J7J7j7j7k8k9k9k9%%%%k2k1k2
2230H8k2mmj7n0o5l2M5M6L1k3m5j1L2L1L4L4JJl3l2%JL4L4N5N6J7j6pqK2K2j1m5k5k6qqK6
2213A18K6K7K7K5K5K5j0m6m7k0k0j9k0l9m0l6l7j3K1N6N6O1K6j1j2JJL3L2J7j8n1n1k1L5O0
2197A61O0RRQRl4l4l5l4K7K6ppn9o0K0K0J0J0J0J0K2K1K2K2JKKKK3K4K3K4NOOOK8K8k9k8m5
2179B84m5m4m5K3K3K3K3l0l1l0l1j3j3j2j3k7k7k6k7N7N9N8N9K9L0L2L1R3J27R4J4p5j08q0
2164C82m7l1l2MMK2K1l6l5n9o0k5k6M0L9M0L9k1k1k1k1QQQQo0o0l6K2M1M2RRKl2m5J2O8O9
2147B29M8rn0n0n4n3kjjkP6P6N1on1n1k0k0K9L0nmm8m8m8m8PPOPO5O5O6O6l0l0l0l0j6j6j6
$$ plain form
2264 85 100 114 95 75 89 102 116 130 149 169 189 208 190 173 155 137 86 35 63 91 76 61 12 -36 -27 -18 24 67 86 105 90 75 81 88 63 38 42 79
2248 79 117 121 93 65 68 72 78 85 91 98 118 139 125 76 15 -11 19 50 94 138 182 227 237 247 258 268 285 302 285 268 240 211 182 153 153 153 153 153 131 110 88
2230 88 66 62 58 41 -9 -74 -106 -61 -15 16 -7 -52 -63 -31 0 34 68 69 70 37 5 5 6 40 74 129 185 202 186 179 171 193 215 204 159 134 108 100 92 118
2213 118 144 171 198 223 248 273 263 217 170 150 130 111 91 52 12 -24 -61 -74 -53 3 59 120 146 135 123 124 125 158 190 207 189 138 87 66 101 161
2197 161 221 230 239 247 256 222 188 153 119 146 172 165 158 99 39 59 79 89 99 109 119 141 162 184 206 207 209 211 213 236 260 283 307 312 318 324 330 358 386 357 329 284
2179 284 239 195 150 173 196 219 242 212 181 151 120 107 94 82 69 42 15 -11 -38 19 78 136 195 224 254 286 317 410 537 631 645 570 462 382
2164 382 335 304 272 276 280 302 323 287 252 193 133 108 82 122 161 201 240 219 198 177 156 164 172 180 188 128 68 32 54 95 137 146 155 157 125 80 92 160 229
2147 229 277 268 218 168 114 61 59 58 57 55 131 207 258 252 201 150 130 110 139 169 164 160 112 64 16 -32 -25 -18 -12 -5 60 125 191 257 227 197 167 137 121 105 89
2129H9j6ooooL0L1O4O5N8N9KKm5m4j1j1K9K8ooopoom4m3J3J3K0K1K0K0J6J6m1m1rrrqJ2J1
2111B27J2J2n3n3n3n3j8j8j7j8M0M1M1M1M7M7M8M7poopn6n7n6n7L1L1L1L1MMMMmnmnRQQQL4
2092B57L4L3L4m4m4m3m4j8j9j8j9j5j6j6j6K3K3K3K3J8J7N0N0j3m7k8k8o0n9m3j1PPQRPOJ9
2076D7N3K6rk1k1OOk8k8j7j5J7J8K2K1K2K2J0J0RJ0M3M2M2M3ononj1j1j1j1j1j1j1j1k0k0
2059A80k0k0KKj1m5n9k6L1L0Pk7k6POPj0K4N4N4L3O8P6J9m8m8k0k0k1k0KKKKJ6J6J4J4k1n5
2041A71n4k1M0M0K7ok6k6m7j4K5K5ppN0N0L5Jqpj0rk3k3l6o9n8k3L2O8P4J8n0n0k5k5L1L2
2025I5L7L7j9k0J6J6J6J6j0j0j0j0m2m2J4J5L4L3L4L3L6L6m3m4m1m2qqJ5J5j9j9j5j4K0K0
2009A22poK7K8K1K2K1K1l0l0l0l1J2J1J2J1j4j4j4j3k8k8k8k7l6l7L0Q7O6L2jkL4L5L4L4o
$$ plain form
2129 89 73 67 61 55 49 79 110 174 239 297 356 358 360 315 271 260 249 278 306 300 294 288 281 275 269 225 182 195 208 228 249 269 289 305 321 280 239 230 221 212 204 216 227
2111 227 239 251 198 145 92 39 21 3 -14 -32 8 49 90 131 178 225 273 320 313 307 301 294 238 181 125 68 99 130 161 192 196 200 204 208 204 199 195 190 199 207 215 223 257
2092 257 291 324 358 314 270 227 183 165 146 128 109 94 78 62 46 69 92 115 138 156 173 223 273 260 213 185 157 97 38 -5 -16 -9 -2 6 15 22 28 47
2076 47 100 126 117 96 75 81 87 59 31 14 -1 16 34 56 77 99 121 131 141 150 160 203 245 287 330 324 319 313 308 297 286 275 264 253 242 231 220 200 180
2059 180 160 140 142 144 133 88 29 3 34 64 71 44 18 25 31 38 28 52 106 160 193 261 337 356 308 260 240 220 199 179 181 183 185 187 203 219 233 247 226 171
2041 171 117 96 136 176 203 197 171 145 98 84 109 134 127 120 170 220 255 256 248 241 231 222 199 176 140 71 13 -10 22 90 164 182 132 82 57 32 63 95
2025 95 132 169 150 130 146 162 178 194 184 174 164 154 112 70 84 99 133 166 200 233 269 305 262 218 177 135 127 119 134 149 130 111 96 82 102 122
2009 122 115 109 136 164 185 207 228 249 219 189 159 128 140 151 163 174 160 146 132 119 91 63 35 8 -28 -65 -35 52 118 150 149 147 181 216 250 284 278
1993B78opoqrqrLKl1l2l2l1KLJ1J2J2J2j0rrj0rj0K4K5rrrrKKKKM0M1POk2k3k2k3LLLLKJL4
1972A73L3M7J3m4m5l2Jj7j8j7j6j7j7poM8M7Ok7k8OJ7J6%L4M2M1O3K9k5k4n7n7k7K9N2N1m
1955B63l9n3n4MMLMKJKKqqm2p7p1l8lkKKL7L6M8N0L4Jj5j5j7j7l8l9mL0K0j2k5k6k1k1J7N0
1937c3L4L5L7L7M8M7j3m7l7l7nnk7k7j2K1K1K1j1j1j3j2K2K1K0K0K0K1J8J8J5J4j3o9r1q9
1921f2l3K3K6K6K5K6K6K7M2M3O0K5pm0n6n5m4rK8K8j0j1KL5M3j2l6l5onm0l9klllL6L8L7L7
1904A22K2K2M1Pk6k6m6j3k0k1j8j8l1l2l1l0L3O6M8M8L1L0kj%L3O9O9O1K8j3m7l0l1l2l3k3
1888B06k4k1k1J5M9M7J3k7o0o3k9PPJ1J1OM0K1K1j9j9j7j7J2M6K7K7K5K5M5J0l9l9m1m1o4
1872A30o3k8k7k0J2M8M8Ok7qrj3j3M1M1J4k0k0J5K2K3K5K4L2L1m8m8o0n9k5k5mnmnL6L6L6
$$ plain form
1993 278 272 265 259 251 242 234 225 228 230 199 167 135 104 106 109 120 132 144 156 146 137 128 118 109 99 123 148 139 130 121 112 114 116 118 120 160 201 208 214 192 169 147 124 127 130 133 136 138 139 173
1972 173 206 253 266 222 177 145 146 129 111 94 78 61 44 37 31 79 126 132 105 77 83 100 116 116 150 192 233 296 325 300 276 219 162 135 164 216 267 263
1955 263 224 171 117 121 125 128 132 134 135 137 139 131 123 81 4 -67 -105 -108 -110 -108 -106 -69 -33 15 65 99 100 85 70 53 36 -2 -41 -45 -15 5 -7 -32 -58 -79 -100 -83 -33
1937 -33 1 36 73 110 158 205 192 145 108 71 66 61 34 7 -5 16 37 58 47 36 23 11 33 54 74 94 114 135 153 171 186 200 187 118 27 -62
1921 -62 -95 -72 -46 -20 5 31 57 84 126 169 229 254 247 207 151 96 52 43 71 99 89 78 80 115 158 146 110 75 69 64 24 -15 -17 -20 -23 -26 10 48 85 122
1904 122 144 166 207 214 188 162 116 103 83 62 44 26 -5 -37 -68 -98 -65 1 49 97 128 158 156 155 155 188 257 326 387 415 402 355 325 294 262 229 206
1888 206 182 161 140 155 204 251 264 237 177 114 85 92 99 110 121 127 167 188 209 190 171 154 137 149 195 222 249 274 299 344 354 315 276 235 194 130
1872 130 67 39 12 -8 4 52 100 106 79 71 62 49 36 77 118 132 112 92 107 129 152 177 201 233 264 216 168 108 49 24 -1 -5 -10 -14 -19 17 53 89
1855H9L7M7M7rrn7n7n7n6ooK9K7RRRRK6K6K6K6J0J0k3k4k2k2p9p8k5k5L1L2L0L0O5O4M0M0
1839B13l9l9opopl4l5l5l3j%L2L4J2J2J2J3J4J5j5j5L2J00J00L2LKjkl2l3l3l2k2k1k1k2O
1822A41NN8N8M8j9q3q3l6l6K0K0K4K5rm3l4L3O6L2k1n4l8l8J0J0RJ0J4J4k0k0l7l7l8l7j6
1806a02j5j4j3RM3K4K4OOO3R8R2N7M1Ql1l2l1l1K4N8M0L9KKl6p0n8n9n9n9k2J2K7K7l0l0P
1790A7M1O8O7L4L4J9j4n0m9m3qk6k5k1J4M8M9K3j0k6k5RJ0RRlmlm%%KKkL3O7O8K8ok1k0rr
1771B73qrl4l4l4l4m5m4l0MK0J9K2K2KJj7J7M5M5K4l2n2j8L8L8K3K4K3K3k2k2k3k2o2o1l6
1755B4J9N8N7K7K7kkkkqpK4K4L0mm2m2m4m4J4M7M0Ok9l0NNMNM3M4M3M4QQQRk9k8k9k8k2k1
1736B08k2k1n2n1QM2M0M0NOPk8l8l9j9L7O0O0J0k4qpqm3n7n8j7j7j4j5k3J0M5M5N3J9j9j9
$$ plain form
1855 89 126 173 220 211 202 145 88 31 -25 -31 -37 -8 19 28 37 46 55 81 107 133 159 169 179 156 132 110 88 9 -69 -94 -119 -88 -56 -26 4 69 133 173 213
1839 213 174 135 129 122 116 109 75 40 5 -28 -29 -29 3 37 49 61 73 86 100 115 100 85 117 217 317 349 352 354 353 351 319 286 253 221 199 178 157 135 141
1822 141 146 204 262 310 291 208 125 89 53 73 93 117 142 133 90 56 89 155 187 166 112 74 36 46 56 65 75 89 103 83 63 26 -11 -49 -86 -102
1806 -102 -117 -131 -144 -135 -92 -68 -44 -38 -32 31 129 221 278 319 327 296 264 233 202 226 284 324 363 365 367 331 261 203 144 85 26 4 16 43 70 40 10 17
1790 17 58 126 193 227 261 280 266 216 167 124 116 90 65 44 58 106 155 178 168 142 117 126 136 145 154 151 147 144 140 140 140 142 144 142 175 242 310 338 332 311 291 282 273
1771 273 265 256 222 188 154 120 75 31 1 5 25 44 66 88 90 91 74 91 136 181 205 173 121 103 141 179 202 226 249 272 250 228 205 183 121 60 24
1755 24 43 101 158 185 212 210 208 206 204 196 189 213 237 267 263 221 179 135 91 105 152 192 198 169 139 144 149 153 158 201 245 288 332 340 348 356 365 336 308 279 251 229 208
1736 208 186 165 113 62 70 112 152 192 197 203 210 182 144 105 86 123 183 243 253 229 221 214 206 163 106 48 31 14 0 -15 -38 -28 17 62 115 134 115 96
1720I6lmJ5j9m2m1k9NL4L5K2j1nmK7K7J9J9K0J9m4m4k9NJ6J6J7J8J0J0k4k4o1n9m6j2K6K6
1703a9onJ1J1J2J3K8O3O2K9l3l2llPk7m2m1k8k8M5M7M9j8n5n5k2M5O4O5J7J8j7j6j3j2M4M4
1687A99%%l4l3o1o0k6k7QQQQP4P4J9J8J5J6J5J5J0J1m7m6p3p4n3J3M8M9N3N4J1J1k3k3m2m1
1670G4m2m1%jJ8Q5Q2Q1OOj4j4j4j4K3K2l3l4k5k5k6k5nnK8K9PQPQJ1J0k3k3k3k4J1J1lklk
1652A06L6L6L7L6rqrrm5m5m6m5K3K4K3K4L0L0K9L0j4j5m8m9j0j0m1m0KN9O0Kk3k4k7k7NON
1635E9NK5K5K5K5oopok0k1k0k0K4K4K4K4J6J5J6J6J3J3J3J3l5l5l5l5k2k3k3k3J2J1J2J2m7
1619C8m6RRQPk5k7k2k3J1J1L3L3%jrqO9O9N7N6K2K3l4l5l4l5L5L4L4L4l0l0l0l0%JJJmmml
1600A61%JJJm3m2r5r6n4KN3Q7Q0Q2M9N0j3j2j3j2J2J2J3J2l5l6kkJ5J5m2m2J3J3k0k1l7l8
$$ plain form
1720 96 93 89 104 85 43 2 -27 -22 12 47 69 58 53 49 76 103 122 141 161 180 136 92 63 68 84 100 117 135 145 155 131 107 46 -13 -59 -71 -45 -19
1703 -19 -25 -30 -19 -8 4 17 45 108 170 199 166 134 131 128 135 108 66 25 -3 -31 14 61 110 92 37 -18 -40 5 69 134 151 169 152 136 123 111 155 199
1687 199 199 199 165 132 71 11 -15 -42 -34 -26 -18 -10 64 138 157 175 190 206 221 236 246 257 210 164 91 17 -36 -23 25 74 127 181 192 203 180 157 115 74
1670 74 32 -9 -9 -10 8 93 175 256 262 268 254 240 226 212 235 257 224 190 165 140 114 89 84 79 107 136 143 151 158 166 177 187 164 141 118 94 105 116 113 111 108 106
1652 106 142 178 215 251 242 234 225 216 171 126 80 35 58 82 105 129 159 189 218 248 234 219 171 122 112 102 61 21 23 82 142 144 121 97 70 43 48 54 59
1635 59 64 89 114 139 164 158 152 145 139 119 98 78 58 82 106 130 154 170 185 201 217 230 243 256 269 234 199 164 129 107 84 61 38 50 61 73 85 38
1619 38 -8 1 10 18 25 0 -27 -49 -72 -61 -50 -17 16 16 15 6 -2 67 136 193 249 271 294 260 225 191 156 191 225 259 293 263 233 203 173 173 174 175 176 172 168 164 161
1600 161 161 162 163 164 121 79 -16 -112 -166 -164 -111 -24 56 138 187 237 224 212 199 187 199 211 224 236 201 165 163 161 176 191 149 107 120 133 113 92 55 17
1584A7lmlllkK3K3l3l2k7k6L0K9L4L4%Jk2k1J2J2jjkjONOON4N5jkL6L6J7n0n6n6mlk0j9j9
1564B2j9nnonL0L1L2L1PPPPJ5J5J6J5J5J5J4J5k8k7k8k8k3k3k3k3L1L0L1L1LMLMl9l9l8l9
1546C3M3M3M3M3mnnnNOONk9k9m4j0K8R5R5K7k4n9l1Lll6o7o7k2M5M2M1J1J0J1J0KKKKJ7J6
1528B46j7j7rrrrj9j9n0n0k9K7N2N2J9K0J9K0L3L4j%m9m9m9m9K5K5K5K5k3k3k3k3kjL2L2J2
1511A69J2k2k1M2M2j5j5k5k5QRm1m2m2m0k6k5L0L0ONONL1L2llK9K8K9K8L6L6KKn5n5k1k2m9
1494G0m9j5j4llmll2l2K4K4L3L3jjL3L2k4k5k8k8K9L0O7J00P9K2j8j7k2k1p7p8m3m3LKL5L7
1477G2L5L5k1k2k4k4k4k4K6K5K6K5pqJ2k3j8j8j8j9j4J8N6N6L6L6L4L3j4m8o0o1l4%L8L7M3
1461A62M2K8pj6j7j8j9RQM0M0%l3l6kK0j5k7k7m3m2k8OM3M3Qk6l5l5K0N5J9j5j3K2N5N4K0
$$ plain form
1584 17 14 10 7 4 1 -1 22 45 12 -20 -47 -73 -43 -14 20 54 54 55 33 12 24 36 35 34 32 31 37 42 48 54 108 163 162 160 196 232 249 199 143 87 83 80 60 41 22
1564 22 3 -2 -7 -13 -18 12 43 75 106 113 120 127 134 149 164 180 195 210 225 239 254 226 199 171 143 120 97 74 51 82 112 143 174 177 181 184 188 149 110 72 33
1546 33 76 119 162 205 201 196 191 186 191 197 203 208 179 150 106 96 124 219 314 341 317 258 227 230 227 191 124 57 35 80 122 163 174 184 195 205 207 209 211 213 230 246
1528 246 229 212 203 194 185 176 157 138 88 38 9 36 88 140 159 179 198 218 251 285 284 284 235 186 137 88 113 138 163 188 165 142 119 96 94 93 125 157 169
1511 169 181 159 138 180 222 207 192 167 142 150 159 118 76 34 -6 -32 -57 -27 3 9 14 20 25 56 88 85 82 111 139 168 196 232 268 270 272 217 162 141 119 70
1494 70 21 6 -8 -11 -14 -18 -21 -53 -85 -61 -37 -4 29 28 27 60 92 68 43 15 -13 16 46 113 213 292 314 296 279 257 236 159 81 38 -5 -2 0 35 72
1477 72 107 142 121 99 75 51 27 3 29 54 80 105 98 90 102 79 61 43 25 6 -8 10 66 122 158 194 228 261 247 199 139 78 44 44 82 119 162
1461 162 204 232 225 209 192 174 155 164 172 212 252 252 219 183 181 201 186 159 132 89 47 19 25 68 111 119 93 58 23 43 98 117 102 89 111 166 220 240
1445B40j5l0l1JJJ3J3J3J3j9j8j8j9pqK7O2N4K1l8l7m2m1m1m1l3l1l0l0J8N2O4Qn5n4n7%N0
1428d5M8N2N1O9L5k3k3pK7K6pj6j7j8j9j7j6l6kJ0J0J2J2J7J7J8J7L4L5N4K0m6m6m8m8j2j1
1412A07j2j1J9J9J9K0k0k0j7j8qK5O0O1Kl2j3j3NONNk0k0k0k0nnk2J2M8Q2Q4N0RQNMk4n9l9
1394B57l9n2n2n2n1k2k3J1J1J5J6J5J6K8K9onL4L4N3J9l2l3n1j7J4M9M9J4m2p5p6m1J0M4K7
1379G6K7L0L1jjkL3M4M4Nn2n3n4j1j2j1j1m6m4QRol9m0oL9L9Ml0k5k4PPK3K4K2K3L6L6k1k0
1361E8l3l2K3K4j0j0J9K0J8n0o2o4oO1P9Q0R3R4K9l8p9p9q4q2m1m0L9L8O9O9K9l9n5n4k5k5
1345f6ppN0M9O3O4QPj2j2m7m6j3j3K1K1j6j7j7j6L8L9L9L9j9j8j8j9j2j2j2j2Q1Q1Q6J7m3
1329B49m3m7m7j0rM6M7L2L2kkM3M2RRm7m7m7m7l0l0K7K6L7L7L7L7NONNpom1m1nmnnj4j4p1
$$ plain form
1445 240 225 195 164 165 166 179 192 205 218 199 181 163 144 137 129 156 218 272 293 255 218 176 135 94 53 20 -11 -41 -71 -53 -1 63 71 16 -38 -95 -95 -45
1428 -45 3 55 106 175 210 187 164 157 184 210 203 187 170 152 133 116 100 64 62 72 82 94 106 123 140 158 175 209 244 298 318 272 226 178 130 118 107
1412 107 95 84 103 122 141 161 141 121 104 86 78 103 163 224 226 194 181 168 173 179 184 189 169 149 129 109 104 99 77 89 137 219 303 353 362 370 375 379 355 296 257
1394 257 218 166 114 62 11 -11 -34 -23 -12 3 19 34 50 78 107 101 96 130 164 217 236 204 171 120 103 117 166 215 229 187 112 36 -5 5 49 76
1379 76 103 133 164 163 162 160 193 237 281 286 234 181 127 116 104 93 82 36 -8 0 9 3 -36 -76 -82 -43 -4 0 -30 -55 -79 -72 -65 -42 -18 4 27 63 99 78 58
1361 58 25 -7 16 40 30 20 39 59 77 27 -35 -99 -105 -44 35 115 208 302 331 293 214 135 51 -31 -72 -112 -73 -35 34 103 132 93 38 -16 -41 -66
1345 -66 -73 -80 -30 19 82 146 154 161 149 137 90 44 31 18 39 60 44 27 10 -6 32 71 110 149 130 112 94 75 63 51 39 27 108 189 275 292 249
1329 249 206 159 112 102 93 139 186 218 250 248 246 289 331 340 349 302 255 208 161 131 101 128 154 191 228 265 302 307 313 318 323 316 310 269 228 223 219 214 209 195 181 110
1311A10p0l3l2K3K2J8J8j6j6J5J6N0M9RRQRj7j8j5j5M8Q2O1Nk8k8LLK0K1j4j3l2l2l3l2n6
1295I9n6n5n6L3L2jjm9m9J9P5P2L9j8j7onook4k3k5k4J6J6J6J5R4R5O0O1kkkkl3l3l3l3j3
1277A68j3j3j3l0k9l0k9J6J7J6J7L4L5JJlmL1L0k0k0k0k0j9k0J5J5PQk6k6nnnnqqqqJ2J2M6
1259I4M6J2J3l9m0J9P6O3K9k2k3k4k4m3m2m0m0k6PK0K1K8K7pm2k8NJ7J8j1j1rrJ2M6M6J2j1
1243A20j1K0K1j8j7j8j7MNMMK0J9J9J9oorqk0n4n2j8L3O7O9L5j1j1j3j3m0m0n9k4ONM1M2L
1225I1LLKJ8J8J8J8mmooKl2m7m7J1J0ml8l4l5JL4K9K9kkNOk7k5nK8M4M3L1L0L0L1JKn5n5n0
1206F0n1l4jN5N5M3J0l8l7m0l8LLLKN0N0K6l1m8m7PM2L3L2JJj2j1j2j2j4j4j4j4l4l5K1K2
1189a8J2J2m3m4l6l5M4M3P6P7M4M3j5j5K0J9K9K8O3O3RRm8m7rqK6K5l8l7mnO3O3K9K8j3j2
$$ plain form
1311 110 40 7 -25 -2 20 38 56 40 24 39 55 105 154 163 172 180 189 172 154 139 124 172 254 315 320 292 264 267 270 290 311 297 284 252 220 187 155 99
1295 99 43 -12 -68 -35 -3 -4 -5 -54 -103 -84 -9 63 102 84 67 61 56 50 44 20 -3 -28 -52 -36 -20 -4 11 105 200 260 321 319 317 315 313 280 247 214 181 168
1277 168 155 142 129 99 70 40 11 27 44 60 77 111 146 147 148 145 141 172 202 182 162 142 122 103 83 98 113 120 128 102 76 71 66 61 56 48 40 32 24 36 48 94
1259 94 140 152 165 126 86 105 181 244 273 251 228 204 180 137 95 55 15 -11 -4 16 37 65 92 85 43 15 20 37 55 44 33 24 15 27 73 119 131 120
1243 120 109 129 150 132 115 97 80 84 89 93 97 117 136 155 174 168 162 153 145 125 71 19 1 34 101 170 205 194 183 170 157 117 77 18 -6 0 5 46 88 91
1225 91 94 97 99 117 135 153 171 167 163 157 151 153 121 74 27 38 48 44 6 -28 -63 -62 -28 1 30 28 26 31 37 10 -15 -20 8 52 95 126 156 186 217 218 220 165 110 60
1206 60 9 -25 -26 29 84 127 137 99 62 22 -16 -13 -10 -7 -5 45 95 121 90 42 -5 2 44 77 109 110 111 99 88 76 64 50 36 22 8 -26 -61 -40 -18
1189 -18 -6 6 -37 -81 -117 -152 -108 -65 11 88 132 175 160 145 165 184 213 241 304 367 376 385 337 290 281 273 299 324 286 249 245 240 303 366 395 423 410 398
1173C98m7m7m7m6m7m7l5l4K1K2NMk9k9J6J7J7J6K4K5j0rJ3J4J4J3j6j6j6j7j1j1m5m6JJJJ
1156A8n6n8k3k3M1M1M1M1J5J6J6J6L3L4%%K5K6K5K5K6K5qqm9m8m9m8popoj0rm3m2poM6M5L9
1138H1k8o9p0k3k3L3L3M4M3M5M4K8K9K8K8oopoL5L6k1k1p2p2p2p1o1o0J9J8N9N8N7N8LLn0
1122D4m8QP7L9L8llllj4j5j5j5mnL0L0%J%%K5K5rrKJKJopooj1j1M6M6L2L3k4k4l3l3JJK8K8
1102B31K8K7l7l7l7l7p1o9j4j4L5L6O6O6O3mk3k3J9J9J9J9K5K4K9l9o7o6QQL1L1k6k6k8k8
1086A38NOK1K2K1K1k2k3J3M6K3j2k6k7k9o3p6p5m1qK7K8L9OqqJ7J8Mk8l5jL3L3M7M7M5M5Q
1069B31k5poJ8J9J9J8K3K3K3K3k5k6m2qK8O1O2K7j4m7n0j6j6j6p1p0n6n5j9J6L6L5K3j1k3
1054H2k2K9L0J7j6n2n1j1K3L7L8K0J9K0J9L4L4K0j5n5n5j1M5N9K6l2o5k9ONk8o0k6L2L2J6
$$ plain form
1173 398 351 304 257 211 164 117 82 48 69 91 96 100 71 42 58 75 92 108 132 157 147 138 151 165 179 192 176 160 144 127 116 105 60 14 15 16 17 18
1156 18 -38 -96 -119 -142 -101 -60 -19 22 37 53 69 85 118 152 152 152 177 203 228 253 279 304 296 288 239 191 142 94 87 81 74 68 58 49 6 -36 -43 -49 -3 42 81
1138 81 53 -16 -86 -109 -132 -99 -66 -22 21 66 110 138 167 195 223 217 211 204 198 233 269 248 227 155 83 11 -60 -121 -181 -162 -144 -85 -27 30 88 91 94 44
1122 44 -4 4 81 120 158 155 152 149 146 132 117 102 87 83 78 108 138 138 139 139 139 164 189 180 171 173 174 176 177 171 164 158 152 141 130 176 222 254 287 263 239 206 173 174 175 203 231
1102 231 259 286 249 212 175 138 67 -2 -16 -30 5 41 107 173 236 232 209 186 205 224 243 262 287 311 340 301 234 168 176 184 215 246 220 194 166 138
1086 138 143 149 170 192 213 234 212 189 202 248 271 259 233 206 177 114 38 -37 -78 -86 -59 -31 8 14 6 -2 15 33 37 9 -26 -27 6 39 86 133 178 223 231
1069 231 206 199 193 211 230 249 267 290 313 336 359 334 308 266 258 286 347 409 436 422 375 325 309 293 277 206 136 80 25 6 22 58 93 116 105 82
1054 82 60 89 119 136 120 68 17 6 29 66 104 124 143 163 182 216 250 270 255 200 145 134 179 238 264 232 167 138 144 149 121 61 35 67 99 115
1038A15J5J3J3Kl1j3j2j5j4j5j4K0J9K0K0N1N1N1N1KKKKl1l1l1l1l8l7J9J9J2J3J3J2KKKK
1021B32l3l3n2j8J9J8J8J9Ok7rqppppL5L6L3L3j5n0l0l0poK9O3M8J4k1k1k2k3n4n4j0K4NN
1004H6j0rj1j1nl9l5kN7R2P5P5M9M8J3k1j3K1J9j6m3m3p6p7o1k7J1J1K8K9K8K8JJJ%k2k2k2
987A08k3PPK7oj5J7llK4K5K4K4LMNN%L5O8O8J6m0m3m2k5k5RJ0PQk6k6ooK8K7J7J7Ll2m3m3
968A86l0MJ7J8j7n2l2l1%%J2J3J3J3l1l1pN1P5P5M2Pk9k9j9J5J1k2n7n6j4K0%JJ5J5Jl3o6
951D8o5m3J4L4L4L8L8K4K3rj0J6J7J6J6qrrrrqOM1M0M0Pk6%L3J3J2j0j0K2K2Nk9m4m4l3l4
933A50n2j8L9M0PQQPM0L9Rk6ookk%%L2O7M5M5Ml0j1j1j1j1o6o5n8k4rrRRRRqroprK5K5rk5
913A36k4j2K2L2L2L4L4nmmmn7n6k3k3k8k9k5k6oK8O5J01R8O4K6qk0j9n3n3p8m3J5J4Ok8l0
$$ plain form
1038 115 130 143 156 158 127 114 102 87 73 58 44 64 83 103 123 174 225 276 327 329 331 333 335 304 273 242 211 173 136 155 174 186 199 212 224 226 228 230 232
1021 232 199 166 114 96 115 133 151 170 176 149 140 132 125 118 111 104 139 175 208 241 226 176 146 116 109 103 132 195 243 257 236 215 193 170 116 62 52 76 81 86
1004 86 76 67 56 45 40 1 -34 -36 21 113 188 263 312 360 373 352 339 360 379 363 320 277 201 124 63 36 47 58 86 115 143 171 172 173 174 174 152 130 108
987 108 85 92 99 126 120 105 122 119 116 140 165 189 213 216 220 225 230 230 265 333 401 417 377 334 292 267 242 251 261 268 276 250 224 218 212 240 267 284 301 304 272 229 186
968 186 156 160 177 195 178 126 94 63 63 63 75 88 101 114 83 52 45 96 171 246 288 295 266 237 218 233 244 222 165 109 95 115 115 116 131 146 147 114 48
951 48 -17 -60 -46 -12 22 60 98 122 145 136 126 142 159 175 191 183 174 165 156 147 139 145 186 226 266 273 247 247 280 293 305 295 285 307 329 334 305 261 217 184 150
933 150 98 80 119 159 166 174 182 189 229 268 277 251 245 239 237 235 235 235 267 334 379 424 428 398 387 376 365 354 288 223 165 141 132 123 132 141 150 159 151 142 136 129 120 145 170 161 136
913 136 112 100 122 154 186 220 254 249 245 241 237 180 124 101 78 50 21 -4 -30 -36 -8 57 158 256 320 346 338 318 299 246 193 115 72 87 101 107 79 49
897D9MJ8j7k7k7%L4L3%j1j1K1K1M5M4J1J1k6k6NOOk8o0k6L1O5L3%KL%Jk2k1k0j9k1J3J3k1
879H6j7j7k0j9m5m5j2j2J2J1J2J1L4L3N2J9j7j8J4J4K1K0K1K1J4J5J4J5mmmml3l3n2j8M9M8
862A62N1N1J9K0l7l6k6k5RRj4j3K1K1K1K1K2K1l6l5l6l6k1k2k1k1NOL9L9K8K8ook7k7k7k8
846I3MMNMMMMMppopn1n0j7j7N7N9N9N9L6L5KJJ5J4k0j9m5m5m5m5m1m0m0m1j9k0J4J5kjN4N4
827A5k9l1MLOOOOJ6J6J7J6J3J3J3J3M5M5j2j2j7j6j7j7k2k2k3k2J7J7j7j7rpK4K6L4L4L4L4
809A83opool2l3l2l3k2k1k1k2nnK9K9J0QJ0J0J5J6J5J5L2L3kkJ6J7Jl3m2m3J6M9N6N5K0j3
792B49j4j4J6J6l0o4o4l0NMPOJ4J4J4J4lml5l6J6N0N0J7mmK8K9%%%%k1k1k1k1llL1L1J2J1
774B42k2k3l9l9l9l8k4k2PRqm0m1pL9L9L7L9L2klL2M5M4j3m8k8k9k9k8j5J9L5L4K2K2j2j1
$$ plain form
897 49 53 71 54 27 0 0 34 67 67 56 45 66 87 132 176 187 198 172 146 151 157 163 135 75 49 80 145 178 178 180 183 183 184 162 141 121 102 81 94 107 86
879 86 69 52 32 13 -32 -77 -89 -101 -89 -78 -66 -55 -21 12 64 83 66 48 62 76 97 117 138 159 173 188 202 217 213 209 205 201 168 135 83 65 114 162
862 162 213 264 283 303 266 230 204 179 188 197 183 170 191 212 233 254 276 297 261 226 190 154 133 111 90 69 74 80 119 158 186 214 208 202 175 148 121 93
846 93 97 101 106 110 114 118 122 126 119 112 106 99 48 -2 -19 -36 21 80 139 198 234 269 271 272 287 301 281 262 217 172 127 82 41 1 -39 -80 -99 -119 -105 -90 -92 -93 -39 15
827 15 -14 -45 -41 -38 -32 -26 -20 -14 2 18 35 51 64 77 90 103 148 193 181 169 152 136 119 102 80 58 35 13 30 47 30 13 4 -3 21 47 81 115 149 183
809 183 177 170 164 158 126 93 61 28 6 -15 -36 -58 -63 -68 -39 -10 0 8 18 28 43 59 74 89 121 154 152 150 166 183 184 151 109 66 82 131 187 242 262 249
792 249 235 221 237 253 223 159 95 65 70 74 81 87 101 115 129 143 140 136 101 65 81 131 181 198 194 190 218 247 247 247 247 247 226 205 184 163 160 157 188 219 231 242
774 242 220 197 158 119 80 42 18 -4 3 12 4 -36 -77 -84 -45 -6 31 70 102 100 97 129 174 218 205 157 129 100 71 43 28 47 82 116 138 160 148 137
757A37n0n0m9m9j2j2rj0K9O2O2K8j9j9k1k0j7j7J7J7L9M0OPk1k1L6L6K1K2j3j3J2J3J2J2o8
741A18o7o5rK1K0j0ql1l1LLK9K9lmk2k3L4L3N3N2J6J7n9r2p0j5N6N5K5K6mmK9L0RRRQQQPQ
723A98j9j8j9j8n4n5j0M6L7j9o3o1L6L6L7L7k5k6k5k4NMn0n1L8L8L7L8N0N1J6J7MNMNQRQR
705B36mlmlj6j5J8J9m0l9m0l9L4L3%%%j%%n1n0J7P3P8M4J0J0L2L1L2L1l1l1l1l1nmmmlmL1
687B76L0k3k4k3k4nnnnK8K9k7k8j9j9L7L7KJKKK1K2k4q0q8n3NL8Qk6onQRM2P6O4Rl7l7k5k4
668A34k4k5J7J8j7j7j5j5J8J9L1L1k5k6l0l0MMM2M3QRl3l2l3l3J5J4M8M9j6j6n0n0m1m2L7
652b9L7lkljK4K6K6K6O4O4L0L0l6l7l6l6k7k6PPL8L7j6j7l1KL8L8K4j1k6k5j0j0j0rj2j2j2
635H1j2RRRRK6K6pqj3j4J9J9K7pk2k2l4l4l4l3MKKKQk4l8l8K8O1O2K9j3j3j5j5J7J6J8J8N
$$ plain form
757 137 87 37 -12 -61 -73 -85 -94 -104 -75 -13 49 77 58 39 18 -2 -19 -36 -19 -2 37 77 83 90 69 48 84 120 141 163 150 137 149 162 174 186 118
741 118 51 -14 -23 -2 18 8 0 -31 -62 -59 -56 -27 2 -1 -5 -27 -50 -16 17 70 122 138 155 96 4 -66 -81 -25 30 55 81 77 73 102 132 141 150 159 167 175 183 190 198
723 198 179 161 142 124 70 15 5 51 88 69 6 -55 -19 17 54 91 66 40 15 -9 -4 0 -50 -101 -63 -25 12 50 100 151 167 184 188 193 197 202 210 219 227 236
705 236 232 229 225 222 206 191 209 228 188 149 109 70 104 137 137 137 137 136 136 136 85 35 52 125 203 247 257 267 299 330 362 393 362 331 300 269 264 260 256 252 249 245 276
687 276 306 283 259 236 212 207 202 197 192 220 249 222 194 175 156 193 230 232 233 235 237 258 280 256 176 88 35 40 78 86 60 54 49 57 66 108 184 248 257 220 183 158 134
668 134 110 85 102 120 103 86 71 56 74 93 124 155 130 104 74 44 48 52 94 137 145 154 121 89 56 23 38 52 100 149 133 117 67 17 -24 -66 -29
652 -29 8 5 3 0 -1 23 49 75 101 165 229 259 289 253 216 180 144 117 91 98 105 143 180 164 147 116 118 156 194 218 207 181 156 146 136 126 117 105 93 81
635 81 69 78 87 96 105 131 157 150 142 129 115 134 153 180 173 151 129 95 61 27 -6 -2 0 2 4 12 -12 -50 -88 -60 1 63 92 79 66 51 36 53 69 87 105 110
617A10L8L9Mm5m5l2KK4K4K7K6j%l4l5l4l4l4l3K5K5J0k3k6k7ONj%L3L3N9N9M5J0J1J0QRm9
599A89n0l4j%Jl2l2jj%jPQPQL6L6kl5j9j9j9j9JL5M7M8Pk6m2m1j9j9L8L8K0K0K0J9L6L6k0
581B25k1o3o3m0J6K8nl9l8J1J1J2J2LMl0k9J4J6M9N0J5J5j9j8l5l4l4l4nnnnMLMLL2L2L3L2
563A02j8j8j7j8l1l0K6K5M2M2j5j5j2j3K1K1n5n4k1k1M1M1P1P2M4j4o0o0jkjjKKLKL8L8L8
546A94L8l3l2l3l3k8k8k7k7L3L4R1R0M1M1l8l8o5o5l1l1K3K2j1j1j0j0qpM4P9R1L4j1j1j5
531B52j5j3j4K0K0j0j0rj0MLl0l0p2p3l7l9J4J4J4J4PQPQnnonK6K5K6K6M1M1M0M1l4l5l4l5
513A30J5J4o0o0l0L7L4L3k8k9k8k8kmN2N3O8O7j1j2k4k4N5N4J0J0k5k4o2o2m4K3L4L3j9k0
497A26%%%%nol9l9k1j9k0k1m2m2m2m2L5L4O8O8O2O3OOk7k7PPk0k1k0k1J1J0J1J0qqm0m2n8
$$ plain form
617 110 148 187 191 146 101 69 71 95 119 146 172 171 171 137 102 68 34 0 -33 -8 17 27 4 -22 -49 -43 -38 -39 -39 -6 27 86 145 190 200 211 221 229 238 189
599 189 139 105 104 104 105 73 41 40 39 39 38 45 53 60 68 104 140 138 103 84 65 46 27 28 63 110 158 165 139 97 56 37 18 56 94 114 134 154 173 209 245 225
581 225 204 141 78 38 54 82 77 38 0 11 22 34 46 49 53 23 -6 8 24 73 123 138 153 134 116 81 47 13 -21 -26 -31 -36 -41 -37 -34 -30 -27 5 37 70 102
563 102 84 66 49 31 0 -30 -4 21 63 105 90 75 63 50 71 92 37 -17 -38 -59 -18 23 94 166 210 196 136 76 75 73 72 71 73 75 78 80 118 156 194
546 194 232 199 167 134 101 73 45 18 -9 24 58 149 239 280 321 283 245 180 115 84 53 76 98 87 76 66 56 48 41 85 164 255 289 278 267 252
531 252 237 224 210 230 250 240 230 221 211 215 218 188 158 86 13 -24 -63 -49 -35 -21 -7 0 8 15 23 18 13 7 2 28 53 79 105 146 187 227 268 234 199 165 130
513 130 145 159 99 39 9 46 80 113 85 56 28 0 -2 -6 46 99 167 234 223 211 187 163 218 272 282 292 267 243 181 119 75 98 132 165 146 126
497 126 126 126 126 126 121 115 76 37 16 -3 -23 -44 -86 -128 -170 -212 -177 -143 -75 -7 55 118 124 130 103 76 83 90 70 49 29 8 19 29 40 50 42 34 -6 -48 -106
480a06n8K1K1Q5Q5M4k3k4k5R1R0O8j2m6m7j0j1m5m5k1k1j8j9j2K3L6L8J3J3J3J3K4K3K4K4
464B06J9K0L7Ll0o3l2KJ9K0J9K0rm3n7n8l0l0LMK9K9mnk5k6RQj4j4l2%K8K8k4k2LL6J7J8J1
447G0J1J1J1N0M9K5l1o9o9l7l6j2K2L6L7KLk9k9k0J2K8K9rrqrK3K2L9Ok6n9n9k5L1O3M8M8
430A40K2K2j2j2poppKKK1j3m5m5l3JRRK6O0O5O5L3L3J9J9l8l7k4k5k4k4j9j9n2n3m2m0L6L8
412C8K2K2K2K2J6J7J6J7l0k9K8K7L8L8j9j8l5l4j%kjjjM6M6j0j0m3m3J3J3L4L3%%QRQQm8m8
394A68m7m8k5k4RRN2N1N2N2l1l0MLj1j1j1j2o1o1n9kM2M2M7M6K0J9K0J9J9J9l7l7n2n1NNJ1
377A04J1J0J1l1l2l1l2NNL8L9%%%jmnmnMMN8N9Q6N2j8p4p2j7K8K8kkonn8j15j11n4J7P5M5
359@M6M1M1M1M2PQQQk9k9k9k9k7k7k7k7l5l6l6l6J6J5R1R0N3lk8k8KJL6L6jjn7n8n4n5k1k1
$$ plain form
480 -106 -164 -143 -122 -37 48 92 69 45 20 111 201 269 257 211 164 154 143 98 53 32 11 -7 -26 -38 -15 21 59 72 85 98 111 135 158 182 206
464 206 225 245 282 285 255 192 160 162 181 201 220 240 231 188 131 73 43 13 16 20 49 78 74 69 44 18 27 35 21 7 -25 -25 3 31 7 -15 -12 24 41 59 70
447 70 81 92 103 153 202 227 196 127 58 21 -15 -27 -5 31 68 70 73 44 15 -5 7 35 64 55 46 38 29 52 74 113 119 93 34 -25 -50 -19 44 92 140
430 140 162 184 172 160 153 147 140 133 135 137 158 145 100 55 22 23 32 41 67 127 192 257 290 323 342 361 323 286 262 237 213 189 170 151 99 46 4 -36 0 38
412 38 60 82 104 126 142 159 175 192 162 133 161 188 226 264 245 227 192 158 157 157 155 154 153 152 198 244 234 224 181 138 151 164 198 231 231 231 239 248 256 264 216 168
394 168 121 73 48 24 33 42 94 145 197 249 218 188 192 195 184 173 162 150 89 28 -31 -33 9 51 98 144 164 183 203 222 241 260 223 186 134 83 88 93 104
377 104 115 125 136 105 73 42 10 15 20 58 97 97 97 97 96 92 87 83 78 82 86 144 203 289 341 323 249 177 160 188 216 214 212 206 201 143 28 -83 -137 -120 -45 0
359 0 46 87 128 169 211 218 226 234 242 213 184 155 126 99 72 45 18 -17 -53 -89 -125 -109 -94 -3 87 140 137 109 81 83 84 120 156 155 154 97 39 -15 -70 -91 -112
341a12N7N6N7N7PPM0M1j3j3j5j6m4p8n6jN2N3K3K3j2j2j2j2K0K1K1K0j3j2m7m6M8M9M9M8K
325B37KKJJ3J2J2J3J4J4m2m3n5n5n5n5j5j5M0M1L0L0K9L0M5M6l4l3m3m3m2m3m9n1m7m6m6J0
309a91Q0Q1L7L9j7j8K1K0K1K1l3l2l1l3nol9l9j5j5M2M1L6L5%KL1L0L1L1K9K9K9K9J5J6J6
293B88J5j0rj0j0l9l9l9l8lkkkNNNNlmlmL1L1L1L1k3k3k3k3%j%jrrrrjjkjrj0j0j0M1M1M1
272A79M1k9l0l0k9m2m2m0m2k0k0L7L7L2L3L4L3K3K3Jn6q7n3PM0J5J7J8J8j7j8j7j7M8N0M9
257A46N0L9L9j8j8j1j1m3m3m8j5K1K2Nk8m3m4m7m9j1K3M3M1J1J1K4K4K4K4L1L0K8K9Ll0l0
241A79LPOk5k6MLl2o6o0k7K2P7R5R5Qm8n8k3J4M8M0M0RRJ2J3m3m4n0m9j6j6k4k4k5k4L4L4
224G2L4L4M5M4M3M2L0mm2m2lmlll2l1k9l0k5RRk5l3l3l1l3L0O3M5M4J1J0J0J0j9j9l8mM3M3
$$ plain form
341 -112 -55 1 58 115 122 129 169 210 197 184 169 153 109 31 -25 -26 26 79 102 125 113 101 89 77 97 118 139 159 146 134 87 41 89 138 187 235 237
325 237 239 241 242 255 267 279 292 306 320 278 235 180 125 70 15 0 -15 25 66 96 126 155 185 230 276 242 209 166 123 81 38 -11 -62 -109 -155 -201 -191
309 -191 -111 -30 7 46 29 11 32 52 73 94 61 29 -2 -35 -40 -46 -85 -124 -139 -154 -112 -71 -35 0 0 2 33 63 94 125 154 183 212 241 256 272 288
293 288 303 293 284 274 264 225 186 147 109 106 104 102 100 105 110 115 120 117 113 110 106 137 168 199 230 207 184 161 138 138 137 137 136 127 118 109 100 99 98 96 95 86 76 66 56 97 138 179
272 179 220 191 161 131 102 60 18 -22 -64 -84 -104 -67 -30 2 35 69 102 125 148 149 93 6 -47 -40 0 15 32 50 68 51 33 16 -1 47 97 146
257 146 196 235 274 256 238 227 216 173 130 82 67 88 110 115 87 44 0 -47 -96 -107 -84 -41 0 11 22 46 70 94 118 149 179 207 236 239 209 179
241 179 182 189 195 170 144 148 151 119 53 -7 -34 -12 65 160 255 263 215 157 134 148 196 236 276 285 294 306 319 276 232 182 133 117 101 77 53 28 4 38 72
224 72 106 140 185 229 272 314 344 340 298 256 253 249 246 243 211 180 151 121 96 105 114 89 56 23 -8 -41 -11 52 97 141 152 162 172 182 163 144 106 102 145 188
207A88M5M5j4j4j5j4l0l0l1l0LLj6J8K4K3K6K6K0K0J9K0N7N8M2Rn8n7n8n8k0J3J2k3p1j06
191B6p1l8j7J7N4N4N3K0m0m0m4m4m4m4rrK6K5N2N3N0N1M4J0k7k7rrrrJ5J4M8M9K5K5rrl5l6
174A32l3l4jL2L2kj9j9k0j9j0K3N9N9M4J0nnJ6J5k2n6k9k9l1l2n3n2j6J9K1K0K3K3L0L1L0
158A32L1K6K6pqMML5L6ol9k0k0rqm2m2nonoppl8l8PM0K2K2K8K7ooj3j3K2K1K1K1N3N3L3jl8
139B74l8opoo%Jl3l3l5l4l3l2J1M6K6K6j7j7j5j5j3K1L6L6K6K6ppLLj0m3m9j5K0K0j5j4%L5
121A10N0N1P1L6k1n5p0p0q9n5LKQk6k6QO3O3N1J7j6j6j6j6k9OM4P8Q7N2J2k2n2q7q5n1J4P1
105I5P4J6j1j1j3j3oK8M2M2ONL9L8K2K1j3j2jklmj3m7o2o2o2o2k9k7ppk6PL4L2K1j3oopqK0
86IK2K2K2K6K5K3l3p9p9RO5O5O5L4L5J9J9l8l8n9o0llK6K7K6K6ppppn4n5n4n4M2M1P6P6k0
$$ plain form
207 188 233 278 264 250 235 221 191 161 130 100 103 106 90 108 132 155 181 207 227 247 266 286 343 401 443 452 394 337 279 221 201 214 226 203 132 26
191 26 -45 -83 -100 -83 -29 25 78 98 58 18 -26 -70 -114 -158 -167 -176 -150 -125 -73 -20 30 81 125 135 108 81 72 63 54 45 60 74 122 171 196 221 212 203 168 132
174 132 99 65 64 96 128 126 107 88 68 49 39 62 121 180 224 234 229 224 240 255 233 177 148 119 88 56 3 -49 -65 -46 -25 -5 18 41 71 102 132
158 132 163 189 215 208 200 204 208 243 279 273 234 214 194 185 177 135 93 88 82 77 71 64 57 19 -19 -12 28 50 72 100 127 121 115 102 89 111 132 153 174 227 280 313 312 274
139 274 236 230 223 217 211 211 212 179 146 111 77 44 12 23 69 95 121 104 87 72 57 44 65 101 137 163 189 182 175 178 181 171 128 79 64 84 104 89 75 75 110
121 110 160 211 282 318 297 242 172 102 13 -42 -39 -37 -29 -55 -81 -73 -10 53 104 121 105 89 73 57 28 34 78 156 243 295 307 285 233 146 61 10 24 95
105 95 169 185 174 163 150 137 131 159 201 243 249 254 293 331 353 374 361 349 348 346 343 339 326 279 217 155 93 31 2 -25 -32 -39 -65 -58 -24 8 29 16 10 4 -3 -11 9
86 9 31 53 75 101 126 149 116 37 -42 -33 32 97 162 196 231 250 269 231 193 134 74 71 68 94 121 147 173 166 159 152 145 91 36 -18 -72 -30 11 87 163 143
69A43k0k0j9L0L0mlJ5J6j9j8m8m9L1L1P3P2L9L8k7k7o1r5j00m2K6N9L4Jj2j3pppqj0j1K3K3
52E7K5K5rrk4k5k4k4o5o5o6o5J4J5M8M8M4M5M4M3MMMMJ6J6J5J6K3K2j1j1k9l0MNllklj6j7
34D0j6j7K6K6N8N7J4k1n6n6nK9M0M0j0o7o8o8l1l1KLJJJ5N0M7M8M8M8Nk9m4m4qppprj1j0j0
15c4J%J6M8M7M8nnNL8N4N4KKKKMMMMNONNmlmlk9k8k9k8%J%%J0Rol9n7n6k1J3%%j7J7N7N8N7
-7B10N7K9nk4n7p0o9l4%RJ0J2J1j9j9j9k0qrK2K2K2j1k7k6J8J9L8Ml5l4k2J2M5M6L4%j0j1
-24I1j2j2o7o8j2j1J1J1J1J1N6N8k2k1%%L4L5L6L6k1k0j6j5j6j5n9n8k5k5J3J3M7M6POPOR
-41D9QRQL5L4L5L4j2j2K2K1L6L5KJk0j9k0k0kkkkRQRRJ4J4m2m2o0o1k6k7k3k5k4k5K4K3K4
-59cK3j9j8L7L7N1N0J6J7L5L6L6L5L6L5m3m4o5o5o6o5k4k3N5N5K4K3j1j0l4l3JJK3K4j0j0
$$ plain form
69 143 123 103 84 114 144 140 137 152 168 149 131 83 34 65 96 169 241 280 318 291 264 203 108 8 -34 -8 51 85 86 74 61 54 47 40 32 22 11 34 57
52 57 82 107 98 89 65 40 16 -8 -73 -138 -204 -269 -255 -240 -192 -144 -100 -55 -11 32 36 40 44 48 64 80 95 111 134 156 145 134 105 75 79 84 81 78 76 73 57 40
34 40 24 7 33 59 117 174 188 167 111 55 50 79 119 159 149 82 14 -54 -85 -116 -114 -111 -110 -109 -94 -44 3 51 99 147 152 123 79 35 27 20 13 6 -3 -14 -24 -34
15 -34 -33 -33 -17 31 78 126 121 116 121 159 213 267 269 271 273 275 279 283 287 291 296 302 307 312 308 305 301 298 269 241 212 184 184 185 185 185 195 204 198 159 102 46 25 38 38 38 21 38 95 153 210
-7 210 267 296 291 267 210 140 71 37 37 46 56 68 79 60 41 22 2 -6 -15 7 29 51 40 13 -13 5 24 62 66 31 -3 -25 -13 32 78 112 112 102 91
-24 91 79 67 0 -68 -80 -91 -80 -69 -58 -47 9 67 45 24 24 24 58 93 129 165 144 124 108 93 77 62 3 -55 -80 -105 -92 -79 -32 14 21 27 34 40 49
-41 49 57 66 74 109 143 178 212 200 188 210 231 267 302 304 305 285 266 246 226 224 222 220 218 227 235 244 253 267 281 239 197 137 76 50 23 0 -25 -49 -74 -50 -27 -3
-59 -3 20 1 -17 20 57 108 158 174 191 226 262 298 333 369 404 361 317 252 187 121 56 32 9 64 119 143 166 155 145 111 78 79 80 103 127 117 107
-75A07J9K0J9K0j9j9j8j9JJJK%J%Jj7j8j7j7OOL7L8Nk9m3m4k4k4J0RJ3J4J4J4L5L5L5L5MM
-93A98MMj4j4j3j4JKl3l2K6K5Jn6o4o3rK4L1kj3j4PQPPLKLLK3K3M2Pk0k0J1J2k7k7j3J9K1
-112F6j2k6k6npopM1M1M1M2J9K0J9K0J1J1k4k3m2m2p4p2l0MJ9J9K5K5N7N7M2Qj1m4n7n6k1
-128BJ2M9M8L5KMLl0l0m3j0N2Q6O3K8opk2k2J2J2j0j1o7o7o0n9J9J8PQQPk4k3k4k4j2j1M5
-146d2M4L4L4k2k3k8l0k9l0L6L5L5L5MNMNPPPPLMLLL8L7Ll1k9K7N0N0J2J3J2J3k1k0k1k0M
-164B25MNMJ3J4l2q8r4n9mmoppoJ4J4M4M5M4j2n9n8j2j2K2K0L1L1llJ1J2J1J1K5K4l2l1l7
-181E8l7K0J9MNn3n1j6j5J8J9J5J5M9M9jjL2L3N0N1J5J5J8j5n1n0k3J2J1k2m8m7j6j5L3L4
-197A14J9j5m7m8j2K2L9L9j7n1m3j0KLK2K3K3K3K1K1LL6N6N6K4K4J3J3J3J3qqm4p7q5n0j4
$$ plain form
-75 107 126 146 165 185 166 147 129 110 111 112 113 115 115 116 116 117 100 82 65 48 54 60 97 135 140 111 68 24 0 -24 -14 -5 8 22 36 50 85 120 155 190 194 198
-93 198 202 206 192 178 165 151 152 154 121 89 115 140 141 85 21 -42 -51 -27 4 2 -11 -25 -18 -10 -3 4 7 9 12 15 38 61 103 110 90 70 81 93 66 39 26 45 66
-112 66 54 28 2 -3 -10 -16 -23 18 59 100 142 161 181 200 220 231 242 218 195 153 111 37 -35 -65 -61 -42 -23 2 27 84 141 183 191 180 136 79 23 2
-128 2 14 63 111 146 148 152 155 125 95 52 42 94 180 243 271 265 258 236 214 226 238 228 217 150 83 23 -36 -17 1 8 16 24 31 7 -16 -40 -64 -76 -87 -42
-146 -42 2 36 70 48 25 -3 -33 -62 -92 -56 -21 14 49 53 58 62 67 74 81 88 95 98 102 105 108 146 183 186 155 126 153 203 253 265 278 290 303 282 262 241 221 225
-164 225 229 234 238 251 265 233 145 51 -8 -12 -16 -22 -29 -36 -42 -28 -14 30 75 119 107 48 -10 -22 -34 -12 8 39 70 67 64 75 87 98 109 134 158 126 95 58
-181 58 21 41 60 64 69 16 -35 -51 -66 -48 -29 -14 1 50 99 98 97 129 162 212 263 278 293 311 296 245 195 172 184 195 173 125 78 62 47 80 114
-197 114 133 118 71 23 11 33 72 111 94 43 0 -10 -8 -5 17 40 63 86 107 128 131 167 223 279 303 327 340 353 366 379 371 363 319 242 157 107 93
-213I3K0Pk6o1o0k5k5qK6M5P8Q1M7J1J2RRQPPPL9L9K4j0l3l3l6l5o9o8l2LJ1J1J3J3lkllj9
-231F9j8J5J6l3l3qM9L7L7PPRRQRL4L5L4L4J8J8k0n4n8n9k6k7KKJKJ8J9L7Lk7k8NMj5j6m9
-250F7m9JJKJL6L5L6L6j2j1j2j1K3K3K3K3L2L1klJ4J4k0k0o7o8j1j1J%JJk6k7n7n8o6l2lN2
-267a13P4P3K1K2K3K3K3K3j5j4J8J9j9k0n4n4k4k3L1L2L5L5L5L6RJ0RJ0PPk7k7l6l7K1K0L1
-283A84L1L1L1L5L5k2k2o6o6o2o3qM7L6Jm3m4m4m5k2k2L4L4R7R8R8R8M8M8j0j1j04j39j07
-298H6k8K3K3noj4j4m8m7m1m0J7J6L3L3L1L3N4N4llkkkjrqqqMMMLJ2J1k3k2l7l7l6l6k0k0
-317g9L7L7J3J3J4J3k3k4k3k3J3J3J3J2K4K4K4K4K4K5K4K4l5l6l5l5qqM9M9K9K9K9K9KJKJ
-333B62OONOJ8J8l9l9k8k9k8k9k3k4n7n7rrM8M6M6M5j1j1J1J2J1J2j5j6j5j5k4k4J0J0L1L1
$$ plain form
-213 93 113 120 94 33 -27 -52 -77 -85 -59 -14 64 145 192 203 215 224 233 241 248 255 262 301 340 364 354 321 288 252 217 148 80 48 51 62 73 86 99 96 94 91 88 69
-231 69 51 66 82 49 16 8 57 94 131 138 145 154 163 171 180 214 249 283 317 335 353 333 279 221 162 136 109 111 113 114 116 134 153 190 193 166 138 143 147 132 116 67
-250 67 18 19 20 22 23 59 94 130 166 154 143 131 120 143 166 189 212 244 275 273 270 284 298 278 258 191 123 112 101 102 102 103 104 78 51 -6 -64 -130 -162 -165 -113
-267 -113 -39 34 55 77 100 123 146 169 154 140 158 177 158 138 84 30 6 -17 14 46 81 116 151 187 196 206 215 225 232 239 212 185 149 112 133 153 184
-283 184 215 246 277 312 347 325 303 237 171 109 46 38 85 121 122 79 35 -9 -54 -76 -98 -64 -30 67 165 263 361 409 457 447 436 332 193 86
-298 86 58 81 104 99 93 79 65 17 -30 -71 -111 -94 -78 -45 -12 19 52 106 160 157 154 152 150 148 147 138 130 122 114 118 122 126 129 141 152 129 107 70 33 -3 -39 -59 -79
-317 -79 -42 -5 8 21 35 48 25 1 -22 -45 -32 -19 -6 6 30 54 78 102 126 151 175 199 164 128 93 58 50 42 91 140 169 198 227 256 258 259 261 262
-333 262 268 274 279 285 303 321 282 243 215 186 158 129 106 82 25 -32 -41 -50 -2 44 90 135 124 113 124 136 147 159 144 128 113 98 74 50 60 70 101 132
-350A32L1L1j8j9n2n3JKJJm9m7QQJ3J1J3J3K9K8K9K8kllkJ0J0QQK5j0m7m7k8k9MLJ4k0n4n5
-368g7l5kL3kk7k8K8O2N1J8LLml7n0n1l1LL9L8K5qqK5N5N7K4K5J1J1k1k1k8NK1K0K1K1J9J9
-385B07l0o4o4l0J1J2Jl3l4%L1L3M5J2k4k4k3J1K6K6OPJ8N3N0J5LL%J%%J%l3l3n0n1n1n0l2
-403e4l2k9k9%N7P7M3J1J0QRO6O6M2j5n0n0j9j9OOPOJ4J5J5J5%J%JOOPOK0K1J8J8l2o7m7m7
-422H7k4k4k4k3PORRkL2J3J3qqqq%JL2L2K8pm1m2l9oRJ0j0ropJ6N0Q5Q5N1nl0k9l1l0o3o2
-441B9k5RK3K3J3J3M5M4M1Pl1l0j3j3K1K1L0L1pm1l7l7l6l7n2j9L7L9J5j8j8J5M3M4J1J2K
-457A54Jl2l2m0m0l5l6j9L8N8K5l4l3k1J2K0J9N4N4M9J5j%%%L4L3K0K0J8J8j6n0q4n0MNOP
-474A41j2j1j2j2NMk7k8JL4J5J5onn8n7m4J1M0P3O4O3K8oj5j5j7j7m1m0o0k4K1K3j0rj9k0
$$ plain form
-350 132 163 194 176 157 105 52 53 55 56 57 8 -39 -31 -23 -10 1 14 27 56 84 113 141 139 136 133 131 141 151 159 167 192 182 135 88 60 31 35 38 52 32 -22 -77
-368 -77 -112 -114 -81 -83 -110 -138 -110 -48 3 21 24 27 23 -14 -64 -115 -146 -143 -104 -66 -41 -49 -57 -32 23 80 104 129 140 151 130 109 81 86 107 127 148 169 188 207
-385 207 177 113 49 19 30 42 43 10 -24 -24 7 40 85 97 73 49 26 37 63 89 95 102 120 173 223 238 241 244 244 245 245 245 246 246 213 180 130 79 28 -22 -54
-403 -54 -86 -115 -144 -144 -87 -10 33 44 54 62 71 137 203 245 230 180 130 111 92 98 104 111 117 131 146 161 176 176 177 177 178 184 190 197 203 223 244 262 280 248 181 134 87
-422 87 63 39 15 -8 -1 5 14 23 21 53 66 79 71 63 55 47 47 48 80 112 140 133 92 50 11 5 14 24 14 5 -1 -8 8 58 143 228 279 274 244 215 184 154 91 29
-441 29 4 13 36 59 72 85 130 174 215 222 191 161 148 135 156 177 207 238 231 190 153 116 80 43 -9 -28 9 48 63 45 27 42 85 129 140 152 154
-457 154 155 123 91 51 11 -24 -60 -79 -41 17 42 8 -25 -46 -34 -14 5 59 113 162 177 176 176 176 176 210 243 263 283 301 319 303 253 169 119 123 128 134 141
-474 141 129 118 106 94 99 103 76 48 49 83 98 113 107 102 44 -13 -57 -46 -6 67 131 194 222 216 201 186 169 152 111 71 11 -13 8 31 21 12 -7 -27
-490b7k0k0JKLMk3J2M7M5%l3j4j3PM0K4K4kL2O7O6Mn1n2n2kL2J3J4k5k4j0K4ONk7k6RRRRP
-509I4Pj2K2N1N0L8Mj7j8j9j9m9n0m9m8m8m8j0K4N1N1N2N2L4%j5j4kjkjNMNNk8k8k8k9qpr
-527a0qllmlM6M6j0j0j3j4M4M3L1L2L1L1k0k1n4n5llL1L1N2N2J9J8j1j1j1j0L6L7KLk1k0k1
-544B46k0l2l2l1l2J1J0J1J1K1K1K0K1K1K1K0K1J4J3J4J3j7j8j7j8l2l2l2l1L3L3L3L3M3M3
-560C83M3M3k4k4k4k5J4J4k0k0jjjjl1l1l2l1m2m2qqrqrrPQPPk0k1k1k0nmnmJ3J2M6M7kjl6
-579A04l5j6j7j4j4k8NJ9K0L3L3L3L3LLl1l1j6j7J8J7J0J0nl9n5n4j0M5N4N4N7N7N1N1J5J5
-595C58j5m9o4o4m8m7m5m4ML7J9J9j2j2j1j2nmK9K9L9L9j9n4o1k7QPKKL5L6K1K0K0K1LLj8
-612A40J6Ml0k7OL4L5N6K1k0k1k2k3l6l5%L3K1j3k3k4j0K4K4j1m6m7l3%J0J2j9k0j5j6jL3
$$ plain form
-490 -27 -47 -67 -66 -64 -61 -57 -80 -68 -21 24 24 -9 -23 -36 -29 11 35 59 57 89 156 222 226 175 123 71 69 101 114 128 103 79 69 93 99 104 77 51 60 69 78 87 94
-509 94 101 89 111 162 212 250 254 237 219 200 181 132 82 33 -15 -63 -111 -121 -97 -46 5 57 109 143 143 128 114 112 111 109 108 113 117 122 127 99 71 43 14 6 -1 -10
-527 -10 -18 -21 -24 -28 -31 15 61 51 41 28 14 58 101 132 164 195 226 206 185 131 76 73 70 101 132 184 236 255 273 262 251 240 230 266 303 305 308 287 267 246
-544 246 226 194 162 131 99 110 120 131 142 163 184 204 225 246 267 287 308 322 335 349 362 345 327 310 292 260 228 196 165 198 231 264 297 340 383
-560 383 426 469 445 421 397 372 386 400 380 360 359 358 357 356 325 294 262 231 189 147 139 131 122 114 105 96 103 111 118 125 105 84 63 43 38 34 29 25 38 50 96 143 141 140 104
-579 104 69 53 36 22 8 -20 -15 4 24 57 90 123 156 159 162 131 100 84 67 85 102 112 122 117 78 23 -31 -41 4 58 112 169 226 277 328 343 358
-595 358 343 294 230 166 118 71 26 -18 -14 23 42 61 49 37 26 14 9 5 34 63 102 141 122 68 7 -20 -12 -5 -3 -1 34 70 91 111 131 152 155 158 140
-612 140 156 160 130 103 109 143 178 234 255 235 214 192 169 133 98 98 131 152 139 116 92 82 106 130 119 73 26 -7 -7 3 15 -4 -24 -39 -55 -56 -23
-628b3L2L3L4L3J2k2n9n8k2k3J2J2K6K6K6K7L8L7k0n4n7k1L4L6O0O0M5J1k0k1J0RKl2m6m7
-644I0JKJKnnl9l9k0k1J2J3O1O2M7J3m4m4m2J4N5R0Q9N6mn9q1m7pK8nl8o8o7l5l5QPQPJ0J0
-662a9J0R%j%jJ3J3J4J4NNK7qk5RM2M2Jl4j4j4JKJJj5j6j6j5rj0K5K5L9M0L7L8j2m6o1o0n5
-680a8n6j9J5M8M7J2k1j4j4J7J6j3j4j3j4J2J2J3J1%%J%m1m2qrMMLMO1N9O1O1j3j2j2j2K2
-698A38K2j2j2p2p0l8l7L1L0L0L1QRO2O2N5jm9q4r0n4NL8K8K8L0L0K9L0mmk5k6k5k5j9j9L7
-714F7L8O7O8L3L4m1m0m1m0n0n0j6j6M4M3J0ROOOPl8l8lL0J0m6o8o8l7l7l7l7M4M4M4M4L4
-731a5L2L4L3j8j8n1n1L5L5L6L5rrm0l8pM8P4P4M7M7l2l2J0RJ0J0nmK9K9ONm9m9m0nk5k5l2
-748H4l3l3l1qrK6K5K1K0K1K1K8K9K8K8l1l1l1l1jkkk%J%%PPK1N6N9N9K4j0k7k8o3o4m3m2
$$ plain form
-628 -23 9 42 76 109 121 99 40 -18 -40 -63 -51 -39 -13 13 39 66 104 141 121 67 10 -11 23 59 119 179 224 235 215 194 204 213 215 183 137 90
-644 90 91 93 94 96 91 86 47 8 -12 -33 -21 -8 53 115 162 175 131 87 45 59 114 204 293 349 345 286 205 158 151 179 174 136 68 1 -34 -69 -61 -54 -46 -39 -29 -19
-662 -19 -9 0 0 -1 -1 -2 11 24 38 52 57 62 89 81 56 65 107 149 150 116 102 88 89 91 92 93 78 62 46 31 22 12 37 62 101 141 178 216 204 158 97 37 -18
-680 -18 -74 -93 -78 -30 17 29 8 -6 -20 -3 13 0 -14 -27 -41 -29 -17 -4 7 7 7 8 8 -33 -75 -83 -92 -88 -84 -81 -77 -16 43 104 165 152 140 128 116 138
-698 138 160 148 136 64 -6 -44 -81 -50 -20 10 41 49 58 120 182 237 236 187 103 13 -41 -36 2 30 58 88 118 147 177 173 169 144 118 93 68 49 30 67
-714 67 105 172 240 273 307 266 226 185 145 95 45 29 13 57 100 110 119 125 131 137 144 106 68 65 95 105 59 -9 -77 -114 -151 -188 -225 -181 -137 -93 -49 -15
-731 -15 17 51 84 66 48 -3 -54 -19 16 52 87 78 69 29 -9 -16 32 106 180 227 274 242 210 220 229 239 249 244 240 269 298 304 309 260 211 171 166 141 116 84
-748 84 51 18 -13 -21 -30 -4 21 42 62 83 104 132 161 189 217 186 155 124 93 92 90 88 86 86 87 87 87 94 101 122 178 237 296 320 310 283 255 192 128 85 43
-766D3m1m0o8l3PM1L9L9M0M1M5M4M2M2Rk4n8k4K5K5oomlmlk6k7k4k4k5RK3K3L4L4L2L2j6m9
-783A64o2o2J4M9L0K9JJl1l1j3K1K0j3n5n6k2k4NMMNj4j3j3j3QQRQJ0J1J0J1L4L5O7O7L1m
-801B30m1m0l2l2KKJ6J6j7j8o9o8j2j2M4M4M5M5K0K0j3j4l9l8nnJ3J4J4J4MMl0l0J9J9J9J9
-817A08l1l1M8M8L3L2k4k4j8j8j8j8K0K1K1K1L0K9k7k7ppK7K7N4N5N4N5j8j7p4p4o6o6J2J3
-833A43N4N3Rm9o9l5kkNOL8L9K9K8noj9j9j9k0j9j9j9j9L4L3O5O4K7l0n5n4j1j1j1j1M3M2
-849B08J8l8n4n3jjj5j4m9m8J2J2M5M6j8j8j7j7ononK0J9K0K0K2K3K3K3k0j9n4n3m6m7J0J0
-866g3L0L0K8L0J8J7J8J8K6K6l0l0n9n7k5k4O2O3K9K9j0j1M6M6L5L5k1k2J6J6J5J6n0m9m9
-881A39n0m7m7QQK7K6pqm1m1L7L7L9L9m0m0l8l7J8J8M1M3mo1q1q2j5M1M6M6M8N0onooJ8J7
$$ plain form
-766 43 2 -38 -106 -139 -132 -91 -52 -13 27 68 113 157 199 241 250 226 168 144 169 194 188 182 178 175 171 168 142 115 91 67 42 51 74 97 131 165 197 229 213 164
-783 164 102 40 54 103 133 162 163 164 133 102 89 110 130 117 62 6 -16 -40 -35 -31 -27 -22 -36 -49 -62 -75 -67 -59 -50 -42 -32 -21 -11 0 34 69 136 203 234 230
-801 230 189 149 117 85 87 89 105 121 104 86 17 -51 -63 -75 -31 13 58 103 123 143 130 116 77 39 34 29 42 56 70 84 88 92 62 32 51 70 89 108
-817 108 77 46 94 142 175 207 183 159 141 123 105 87 107 128 149 170 200 229 202 175 168 161 188 215 269 324 378 433 415 398 324 250 184 118 130 143
-833 143 197 250 259 210 141 106 104 102 107 113 151 190 219 247 242 236 217 198 179 159 140 121 102 83 117 150 215 279 306 276 221 167 156 145 134 123 166 208
-849 208 226 188 134 81 80 79 64 50 1 -47 -35 -23 22 68 50 32 15 -2 -8 -13 -19 -24 -4 15 35 55 77 100 123 146 126 107 53 0 -46 -93 -83 -73
-866 -73 -43 -13 15 45 63 80 98 116 142 168 138 108 49 -8 -33 -57 5 68 97 126 116 105 151 197 232 267 246 224 240 256 271 287 237 188 139
-881 139 89 42 -5 3 11 38 64 57 49 8 -33 4 41 80 119 79 39 1 -36 -18 0 41 84 80 19 -62 -144 -159 -118 -72 -26 22 72 66 61 55 49 67 84
-898H4J8J8K6K7ppJ0J0J0J0j7j8n1n1M0L9j7n1l9J8M0M0jjkjj3j3j3j3k5k5k5k4j8j9J8J8
-914b5M0P5N3ko5o4j1j0j2j2j2j2k2k2J2J1P1P0L8L7J4J4J5J4k8k8k8k8nnK8K9K9K8nnn5n5
-931F7n6n4p3p2j7j6J6J5N0N0L6L7ONM3P8N7Jn1n1KKJKKK%%J%m9m8k6K9O4L1nl8j3K1K0j5
-949E4k7k7k9l0j2j2K2K2K1K0N5N6K8K9n0n0k1k1J4J3j3j2K1K2L8L8j8j8J%L5L4qqqqKKKK
-966A59L5L5JJl4l4l4l4n6n4n3LL7L6j5j6J0RRRK1K1K1K0J2J2k3n6o1oJ6J5l6l7l7l8KJN8
-983h1N8N9O0LMn5n4k1k1j4j4m8m8K2K1N6N5J9K0K1K0l3l2l3l2JKL6L5L8L8L8L8j5j5m9m8
-999C1l6l6kkL4L3L4L3L2L2lkn6n6k2k1J8J9K0J9JKKJJ2J1J1J2MNL8L8L3L3jjJ%J%l9m0m0
-1018A53l9J6J6j8j8l9m0l9l9l6l5kjL4L4L3L3N4N4P0L7l4o7p0l5J3J4J6J6j%j%rrm1l9J2
$$ plain form
-898 84 102 120 146 173 166 159 169 179 189 199 182 164 113 62 102 141 124 73 34 52 92 132 131 130 128 127 114 101 88 75 50 25 0 -24 -42 -61 -43 -25
-914 -25 15 90 143 141 76 12 1 -9 -21 -33 -45 -57 -79 -101 -89 -78 -7 63 101 138 152 166 181 195 167 139 111 83 78 73 101 130 159 187 182 177 122 67
-931 67 11 -43 -116 -188 -205 -221 -205 -190 -140 -90 -54 -17 -11 -6 37 115 172 173 122 71 73 75 76 78 80 82 82 82 83 83 34 -14 -40 -11 53 84 79 41 28 49 69 54
-949 54 27 0 -29 -59 -71 -83 -61 -39 -18 2 57 113 141 170 120 70 49 28 42 55 42 30 51 73 111 149 131 113 114 114 149 183 175 167 159 151 153 155 157 159
-966 159 194 229 230 231 197 163 129 95 39 -15 -68 -65 -28 8 -7 -23 -13 -4 5 14 35 56 77 97 109 121 98 42 -19 -25 -9 6 -30 -67 -104 -142 -140 -139 -81
-983 -81 -23 36 96 99 103 48 -6 -27 -48 -62 -76 -124 -172 -150 -129 -73 -18 1 21 42 62 29 -3 -36 -68 -67 -65 -29 6 44 82 120 158 143 128 79 31
-999 31 -5 -41 -43 -45 -11 22 56 89 121 153 150 148 92 36 14 -7 11 30 50 69 70 72 74 75 87 98 109 121 125 130 168 206 239 272 271 270 271 271 272 272 233 193 153
-1018 153 114 130 146 128 110 71 31 -8 -47 -83 -118 -120 -121 -87 -53 -20 13 67 121 191 228 194 127 57 22 35 49 65 81 80 80 79 79 70 61 20 -19 -7
-1034gM6J3k1k1k1QPk1n5l4l5OM0P6P4O7L4J9J8j8j8l7lLKNNJ7J7J6J7J1J2k3k2mlmll4l3
-1052I6l3l3qqqooollQM2M2RkkL0L1J5J6J6J6N4N4J6j8n0n0j5J9NNPPM2M1K7pj9j9j9j9LL6
-1071C03L6Lm6m6l3%j5j6jL3M0Ol0k9k1k1k1k2JJL4L4MLl0l1j8j8j8j8l9l8noK8K9K7K7j9
-1088F8n3j1M5M3QklOOk8k8M1M1M1M1K0K1l6l6j7j8n1n1lkllk7k6PPj3j2j2j3M3M2M3M3L3
-1105A51L3jjl5l6jkJ4J3J4J4J5J6J5J5l1l2o1o2m8PN4N5K9K8k8k8l9l9OO3P9M6J1J2K2K2
-1121B90j2j2n1n1q6q4n3n3j9j9j0rj0rL1L1L1L1llq2q1l2l1K5K5M7M8M7M8L3L3L3L4m1m0
-1137dm0m1J2J2M5M5ONk8k8nnK7K9jjjjO1O1O0O1M0M1l9p3o4rO0O0M7M8K3l3p1p0p4p4m3m2
-1154drrJ8J7J8J7K0K0K0K0POPPM2M2QQk8k9OOJ7J8j6j7NMNMl1l2K5K5K7K7ppJ5J4M8M8j7
$$ plain form
-1034 -7 39 52 31 10 -11 -3 4 -17 -72 -106 -141 -135 -95 -19 55 122 156 175 193 175 157 120 117 120 122 127 132 149 166 182 199 210 222 199 177 173 170 166 163 129 96
-1052 96 63 30 22 14 6 0 -6 -12 -15 -18 -10 32 74 83 81 79 109 140 155 171 187 203 257 311 327 309 259 209 194 213 218 223 230 237 279 320 347 340 321 302 283 264 267 303
-1071 303 339 342 296 250 217 217 202 186 185 218 258 264 234 205 184 163 142 120 121 122 156 190 194 197 167 136 118 100 82 64 25 -13 -18 -24 4 33 60 87 68
-1088 68 15 4 49 92 100 98 95 101 107 79 51 92 133 174 215 235 256 220 184 167 149 98 47 44 42 39 36 9 -17 -10 -3 -16 -28 -40 -53 -10 32 75 118 151
-1105 151 184 183 182 147 111 110 108 122 135 149 163 178 194 209 224 193 161 100 38 -10 -3 51 106 135 163 135 107 68 29 35 98 177 223 234 246 268 290
-1121 290 278 266 215 164 78 -6 -59 -112 -131 -150 -160 -169 -179 -188 -157 -126 -95 -64 -67 -70 -152 -233 -265 -296 -271 -246 -199 -151 -104 -56 -23 10 43 77 36 -4
-1137 -4 -44 -85 -73 -61 -16 29 35 40 12 -16 -21 -26 1 30 29 28 27 26 87 148 208 269 309 350 311 238 174 165 225 285 332 380 403 370 299 229 155 81 38 -4
-1154 -4 -13 -22 -4 13 31 48 68 88 108 128 135 141 148 155 197 239 247 255 227 198 204 210 227 245 229 212 217 221 226 230 199 167 192 217 244 271 264 257 272 286 334 382 365
-1173C65j8n1n2l7l7mlj3j3m7m7L1L2L1L2J3J3k1k1l8l9l8l8LMMLM9M8J4J4RRQRl4l3l4l4
-1190C9k5k4QQJ3J2J5J5L4O8M7j0o3o3rj0lkK9K9kl5l6kOOQQJ7J6J7J6LKKKj1j2j2j2PPQP
-1209A18J3J4J4J3N0N1L5Kj0j1J9K0j7n0l1l1j5j5j5j5kjn4n4k8K8P3P4K8nJ3J4J5J6j8j8
-1224B20l0k9k9k9m9m9QPj4j4j4j5k9k9k6k7PM1N4N3K1j2OPM2M2Pk7oK8M1M1K0K0J8J9Kl1
-1241B45j2j2j5j4j4j4L5L5%l4j2K2jjj4m9k7k7j2K1LKmmlmJ0J0J1J0rj0rj0l4l5l2l3j8J5
-1258d4N2N2L7L7L5L5j8n3l3l4k0k0k0j9NNL6L7N2J8j8j8j4J9N4N5K1j2n0n0m1m2qrk5k4j0
-1274c2K4L5L5j8j9k7k8j3K0K8L0llnooooqqqJ6J5lL1O3O3K8oj0j0J9K0Ml0m5m4NONOLMLM
-1294A23nnllKL5L5Jk0j9k3k2L2L1L2L2K7K7K8K7k6k7k6k6J1J2J1J2j4j4j4j4k8k7k8k7k3
$$ plain form
-1173 365 347 296 244 207 170 166 163 150 137 90 43 74 106 137 169 182 195 174 153 115 76 38 0 3 7 11 14 63 111 125 139 148 157 165 174 140 107 73 39
-1190 39 14 -10 -2 6 19 31 46 61 95 163 210 200 137 74 65 55 52 50 79 108 106 71 35 33 39 45 53 61 78 94 111 127 130 132 134 136 125 113 101 89 96 103 111 118
-1209 118 131 145 159 172 222 273 308 310 300 289 308 328 311 261 230 199 184 169 154 139 137 136 82 28 0 28 101 175 203 198 211 225 240 256 238 220
-1224 220 190 161 132 103 54 5 13 20 6 -8 -22 -37 -66 -95 -121 -148 -141 -100 -46 7 28 16 22 29 71 113 120 93 87 115 156 197 217 237 255 274 276 245
-1241 245 233 221 206 192 178 164 199 234 234 200 188 210 209 208 194 145 118 91 79 100 103 105 101 97 94 90 100 110 121 131 122 112 103 93 59 24 -8 -41 -59 -44
-1258 -44 8 60 97 134 169 204 186 133 100 66 46 26 6 -13 -8 -3 33 70 122 140 122 104 90 109 163 218 239 227 177 127 86 44 36 27 2 -22 -32
-1274 -32 -8 27 62 44 25 -2 -30 -43 -23 5 35 32 29 24 18 12 6 0 -8 -16 -24 -8 7 4 35 98 161 189 183 173 163 182 202 206 176 131 87 92 98 103 109 112 116 119 123
-1294 123 118 113 110 107 109 144 179 180 160 141 118 96 128 159 191 223 250 277 305 332 306 279 253 227 238 250 261 273 259 245 231 217 189 162 134 107 84
-1310H4k3L4L4ppppNONNklkkkkklj9j9j9k0p7p9p8p9J4J4J4J4M0L9L9M0L2L2L1L2J2J3J2J2
-1329A04k6k6k5k6K8K7O2O2L1L1k5k5n6n6q9r0n7n6%jPOM0M0L2L2L1L1prqrL5L6L6L6L3L4
-1345A83jjo0o1lmL8L9L8L9KJKKk9k9k9k9kjjkK8K8K7K8J6J6j7j8k9l0o1o2n1j9J9J8M9N0
-1362H4M8rn6n6J9K0rj0OL9N0N1J8J9lklkJJJJLLLLj1j0K1K1K8om4m4m7m7m8m6n0n0l6jK3
-1381a27K3rrk8k8J0M3M5M5J3J3K2K4Qk5m0m2k9NM0L9P3P3N3K0k0n3n6k2L5L4K4rk4k4J0J0
-1397A17J0J0m0m0lL1L6L6LKrm2m3rL5L6LLlkllJ5J5J5J5L2L1N1J7k0k0k2k3%%l5l4k9l0k5
-1415G8k6L7R4Q1M8llnnk4k3n8n7n0n0L0K9J9J9l7l7PQQQkkkkRQRQj5j5o9o7nN1N2N3O0O1
-1433B20N8N8k7o1m0J7K9K8k4k4j1j0m4m4l2l3K5K4mlo0n9l5l5l5l4j%L4L3J5J5j9j9N4N3
$$ plain form
-1310 84 61 95 129 122 115 108 101 106 112 117 122 120 117 115 113 111 109 107 104 85 66 47 27 -50 -129 -207 -286 -272 -258 -244 -230 -190 -151 -112 -72 -40 -8 23 55 67 80 92 104
-1329 104 78 52 27 1 29 56 118 180 211 242 217 192 136 80 -9 -99 -156 -212 -212 -213 -206 -200 -160 -120 -88 -56 -25 6 -1 -10 -18 -27 8 44 80 116 149 183
-1345 183 182 181 121 60 57 53 91 130 168 207 209 210 212 214 185 156 127 98 96 95 94 92 120 148 175 203 219 235 218 200 171 141 80 18 -33 -52 -33 -15 34 84
-1362 84 132 123 67 11 30 50 41 31 37 76 126 177 195 214 211 209 206 204 205 206 207 208 211 214 217 220 209 199 220 241 269 263 219 175 128 81 33 -13 -63 -113 -149 -150 -127
-1381 -127 -104 -113 -122 -150 -178 -168 -125 -80 -35 -22 -9 13 37 45 20 -20 -62 -91 -86 -46 -7 66 139 192 212 192 139 83 61 96 130 154 145 121 97 107 117
-1397 117 127 137 97 57 54 85 121 157 160 162 153 111 68 59 94 130 133 136 133 131 128 125 140 155 170 185 217 248 299 316 296 276 254 231 231 231 196 162 133 103 78
-1415 78 52 89 183 264 312 309 306 301 296 272 249 191 134 84 34 64 93 112 131 94 57 64 72 80 88 86 84 82 80 89 97 106 114 99 84 15 -52 -57 -6 46 99 159 220
-1433 220 278 336 309 248 208 225 254 282 258 234 223 213 169 125 93 60 85 109 105 102 42 -17 -52 -87 -122 -156 -157 -157 -123 -90 -75 -60 -79 -98 -44 9
-1449IllRJ0RJ0M8M8M8M9j7j7j7j6j2j2j2j1k8k8N1N1M3M3l6l7j7j6j7j7j5j5J8J9RRJ0Rq
-1466A48qK6K7OOPOK0K1J8J8qm3n6n5m7j3K4K5mlmlkkkkJ8J9Nk8l0LL9L9k6k7j1K2KLMMpp
-1485A22qpL9L9N7K4l5l4l5l5LL7L7Lk7k8m9j4K6K7M6J2k9o2p6p5m5J2L7L7J2J2M7M6L0L0
-1501A76J6j9l4l4k2J3RQJ4J3J8N2L3L2ppqpmlmlj8j8j7j8k3k2k3k3POOPL2L2J8j7k5k6J0
-1519A20M4L7L7Ll2n2n1j6J7j4j4m6m5mml8l9qrrqk7k7k7k7NNk5k4j3N6P3P4L1L1klJ1J2J0
-1536BJ2MMNMj7j5o9o9o6LO6O6L0K9K9K9MMMMnmnmJ9K0J9K0L1L0m4m4l3L4N3N2n7n8l9K9L5
$$ plain form
-1449 9 6 3 12 22 31 41 89 137 185 234 217 200 183 167 155 143 131 120 92 64 115 166 209 252 216 179 162 146 129 112 97 82 100 119 128 137 147 156 148
-1466 148 140 166 193 199 205 212 218 238 259 277 295 287 244 188 133 86 73 97 122 118 115 111 108 106 104 102 100 118 137 142 114 84 87 126 165 139 112 101 123 125 128 132 136 129 122
-1485 122 114 107 146 185 242 266 231 197 162 127 130 167 204 207 180 152 103 89 115 142 188 200 171 109 33 -42 -87 -75 -38 -1 11 23 70 116 146 176
-1501 176 192 173 139 105 83 96 105 113 127 140 158 210 243 275 268 261 253 246 242 239 235 232 214 196 179 161 138 116 93 70 77 83 89 96 128 160 178 161 136 110 120
-1519 120 164 201 238 241 209 157 106 90 107 93 79 33 -12 -16 -20 -58 -97 -105 -114 -123 -131 -158 -185 -212 -239 -234 -229 -254 -278 -291 -235 -162 -88 -57 -26 -28 -31 -20 -8 2
-1536 2 14 18 22 27 31 14 -1 -70 -139 -205 -202 -136 -70 -40 -11 18 47 51 55 59 63 58 54 49 45 64 84 103 123 154 184 140 96 63 97 150 202 145 87 48 77 112
$$ [...]
-3131B38
##END=	
##END=	
