##TITLE=	May06-2016.20.fid
AD38

##JCAMP-DX=	6.0	$$ MestReNova 14.1.1-24571
##DATA TYPE=	LINK
##BLOCK_ID=	1
##BLOCKS=	1    
##ORIGIN=	Mestrelab Research S.L.
##OWNER=	hrzepa
##$MNOVA/LINK_BLOCK_TYPE=	ITEM	$$ NMR Spectrum
##$MNOVA/ITEM/POLYGON=	(XY..XY)
5321,5835
8722,5835
8722,8208
5321,8208
5321,5835
##$MNOVA/ITEM/Z=	0
##$MNOVA/ITEM/ANGLE=	0
##TITLE=	May06-2016.20.fid
##JCAMP-DX=	6.0	$$ MestReNova 14.1.1-24571
##BLOCK_ID=	2
##DATA TYPE=	NMR SPECTRUM
##DATA CLASS=	XYDATA
##NUMDIM=	1
##ORIGIN=	Bruker BioSpin GmbH
##OWNER=	nmr
##.OBSERVE FREQUENCY=	400.20240119999999706
##.OBSERVE NUCLEUS=	^1H
##.SOLVENT NAME=	DMSO
##.PULSE SEQUENCE=	zg30
##LONGDATE=	2016/05/06 12:32:00.000
##.ACQUISITIONMODE=	SIMULTANEOUS (DQD)
##$ORIGINAL FORMAT=	Bruker XWIN-NMR
##$MNOVA/SCALES_VERSION=	9
##$PARAMETER FILE=	(acqus, ASCII, /Users/hrzepa/Downloads/Polysiphenol%20SI%20NMR%20Original%20Data/4/4a%20-%201H%20-%20400C.16.05.06.020/20/acqus, 0)
$$ ##TITLE= Parameter file, TOPSPIN		Version 3.2
$$ ##JCAMPDX= 5.0
$$ ##DATATYPE= Parameter Values
$$ ##NPOINTS= 11	$$ modification sequence number
$$ ##ORIGIN= Bruker BioSpin GmbH
$$ ##OWNER= nmr
$$ $$ 2016-05-06 12:32:06.287 +0100  nmr@CZC2439F63
$$ $$ /opt/topspin/data/brad/nmr/May06-2016/20/acqus
$$ $$ process /opt/topspin3.2.2/prog/mod/shimcntl
$$ ##$ACQT0= -2.20588235294118
$$ ##$AMP= (0..31)
$$ 100 100 100 100 100 100 100 100 100 100 100 100 100 100 100 100 100 100
$$ 100 100 100 100 100 100 100 100 100 100 100 100 100 100
$$ ##$AMPCOIL= (0..19)
$$ 0 0 0 0 0 0 0 0 0 0 0 0 0 0 0 0 0 0 0 0
$$ ##$ANAVPT= -1
$$ ##$AQSEQ= 0
$$ ##$AQ_mod= 3
$$ ##$AUNM= <au_zg>
$$ ##$AUTOPOS= <58 >
$$ ##$BF1= 400.2
$$ ##$BF2= 400.2
$$ ##$BF3= 400.2
$$ ##$BF4= 400.2
$$ ##$BF5= 400.2
$$ ##$BF6= 400.2
$$ ##$BF7= 400.2
$$ ##$BF8= 400.2
$$ ##$BYTORDA= 0
$$ ##$CAGPARS= (0..11)
$$ 0 0 0 0 0 0 0 0 0 0 0 0
$$ ##$CFDGTYP= 0
$$ ##$CFRGTYP= 9
$$ ##$CHEMSTR= <none>
$$ ##$CNST= (0..63)
$$ 1 1 145 1 1 1 1 1 1 1 1 1 1 1 1 1 1 1 1 1 1 1 1 1 1 1 1 1 1 1 1 1 1 1 1
$$ 1 1 1 1 1 1 1 1 1 1 1 1 1 1 1 1 1 1 1 1 1 1 1 1 1 1 1 1 1
$$ ##$CPDPRG= (0..8)
$$ <> <> <> <> <mlev> <mlev> <mlev> <mlev> <mlev>
$$ ##$D= (0..63)
$$ 0 1 0 0 0 0 0 0 0 0.06 0 0 0 0 0 0 0.0002 0 0 0 0 0 0 0 0 0 0 0 0 0 0 0
$$ 0 0 0 0 0 0 0 0 0 0 0 0 0 0 0 0 0 0 0 0 0 0 0 0 0 0 0 0 0 0 0 0
$$ ##$DATE= 1462534325
$$ ##$DE= 6.5
$$ ##$DECBNUC= <off>
$$ ##$DECIM= 2496
$$ ##$DECNUC= <off>
$$ ##$DECSTAT= 4
$$ ##$DIGMOD= 1
$$ ##$DIGTYP= 12
$$ ##$DQDMODE= 0
$$ ##$DR= 22
$$ ##$DS= 2
$$ ##$DSPFIRM= 0
$$ ##$DSPFVS= 20
$$ ##$DTYPA= 0
$$ ##$EXP= <proton>
$$ ##$F1LIST= <111111111111111>
$$ ##$F2LIST= <222222222222222>
$$ ##$F3LIST= <333333333333333>
$$ ##$FCUCHAN= (0..9)
$$ 0 2 0 0 0 0 0 0 0 0
$$ ##$FL1= 90
$$ ##$FL2= 90
$$ ##$FL3= 90
$$ ##$FL4= 90
$$ ##$FOV= 20
$$ ##$FQ1LIST= <freqlist>
$$ ##$FQ2LIST= <freqlist>
$$ ##$FQ3LIST= <freqlist>
$$ ##$FQ4LIST= <freqlist>
$$ ##$FQ5LIST= <freqlist>
$$ ##$FQ6LIST= <freqlist>
$$ ##$FQ7LIST= <freqlist>
$$ ##$FQ8LIST= <freqlist>
$$ ##$FRQLO3= 12442.5500000119
$$ ##$FRQLO3N= 2
$$ [...]
$$ 90 74 58 42 26 10 0 0
$$ ##$Sgu3PowerLevels= (0..7)
$$ 0 0 0 0 0 0 0 0
$$ ##$Sgu4PowerLevels= (0..7)
$$ 0 0 0 0 0 0 0 0
$$ ##$Sgu5PowerLevels= (0..7)
$$ 0 0 0 0 0 0 0 0
$$ ##$Sgu6PowerLevels= (0..7)
$$ 0 0 0 0 0 0 0 0
$$ ##$Sgu7PowerLevels= (0..7)
$$ 0 0 0 0 0 0 0 0
$$ ##$Sgu8PowerLevels= (0..7)
$$ 0 0 0 0 0 0 0 0
$$ ##$SguType= 3
$$ ##$ShimPowMaxUA= (0..63)
$$ 130000 130000 130000 130000 130000 130000 130000 130000 130000 130000 130000
$$ 130000 130000 130000 130000 130000 130000 130000 130000 130000 0 0 0 0
$$ 0 0 0 0 0 0 0 0 0 0 0 0 0 0 0 0 0 0 0 0 0 0 0 0 0 0 0 0 0 0 0 0 0 0 0 0
$$ 0 0 0 0
$$ ##$ShimPowMaxUC= (0..63)
$$ 130000 130000 130000 130000 130000 130000 130000 130000 130000 130000 130000
$$ 130000 130000 130000 130000 130000 130000 130000 130000 130000 0 0 0 0
$$ 0 0 0 0 0 0 0 0 0 0 0 0 0 0 0 0 0 0 0 0 0 0 0 0 0 0 0 0 0 0 0 0 0 0 0 0
$$ 0 0 0 0
$$ ##$ShimPowMaxUG= (0..63)
$$ 524287 524287 524287 524287 524287 524287 524287 524287 524287 524287 524287
$$ 524287 524287 524287 524287 524287 524287 524287 524287 524287 0 0 0 0
$$ 0 0 0 0 0 0 0 0 0 0 0 0 0 0 0 0 0 0 0 0 0 0 0 0 0 0 0 0 0 0 0 0 0 0 0 0
$$ 0 0 0 0
$$ ##$ShimPowRcbType= 3
$$ ##$ShimPowRes= (0..63)
$$ 1e-20 1e-20 1e-20 1e-20 1e-20 1e-20 1e-20 1e-20 1e-20 1e-20 1e-20 1e-20
$$ 1e-20 1e-20 1e-20 1e-20 1e-20 1e-20 1e-20 1e-20 0 0 0 0 0 0 0 0 0 0 0 0
$$ 0 0 0 0 0 0 0 0 0 0 0 0 0 0 0 0 0 0 0 0 0 0 0 0 0 0 0 0 0 0 0 0
$$ ##$ShimPowRng0= (0..63)
$$ 1 1 1 1 1 1 1 1 1 1 1 1 1 1 1 1 1 1 1 1 0 0 0 0 0 0 0 0 0 0 0 0 0 0 0 0
$$ 0 0 0 0 0 0 0 0 0 0 0 0 0 0 0 0 0 0 0 0 0 0 0 0 0 0 0 0
$$ ##$ShimPowRng1= (0..63)
$$ 1 1 1 1 1 1 1 1 1 1 1 1 1 1 1 1 1 1 1 1 0 0 0 0 0 0 0 0 0 0 0 0 0 0 0 0
$$ 0 0 0 0 0 0 0 0 0 0 0 0 0 0 0 0 0 0 0 0 0 0 0 0 0 0 0 0
$$ ##$ShimPowRng2= (0..63)
$$ 1 1 1 1 1 1 1 1 1 1 1 1 1 1 1 1 1 1 1 1 0 0 0 0 0 0 0 0 0 0 0 0 0 0 0 0
$$ 0 0 0 0 0 0 0 0 0 0 0 0 0 0 0 0 0 0 0 0 0 0 0 0 0 0 0 0
$$ ##$ShimPowRng3= (0..63)
$$ 1 1 1 1 1 1 1 1 1 1 1 1 1 1 1 1 1 1 1 1 0 0 0 0 0 0 0 0 0 0 0 0 0 0 0 0
$$ 0 0 0 0 0 0 0 0 0 0 0 0 0 0 0 0 0 0 0 0 0 0 0 0 0 0 0 0
$$ ##$ShimSysFunc= (0..63)
$$ 1 2 3 4 5 7 9 11 15 16 8 10 12 14 6 17 13 18 19 20 0 0 0 0 0 0 0 0 0 0
$$ 0 0 0 0 0 0 0 0 0 0 0 0 0 0 0 0 0 0 0 0 0 0 0 0 0 0 0 0 0 0 0 0 0 0
$$ ##$ShimSysMatrix= 0
$$ ##$ShimSysType= 1
$$ ##$TFXNUM= 0
$$ ##$TRIPLO2= 0
$$ ##$VTU= 2
$$ ##$VTUETH= <149.236.99.20>
$$ ##$VTUTY= <no>
$$ ##$WBREFAM= (0..15)
$$ 135.5 97.7 100 100 100 100 100 100 100 100 100 100 100 100 100 100
$$ ##$WBREFLM= (0..15)
$$ 0 0 0 0 0 0 0 0 0 0 0 0 0 0 0 0
$$ ##$WBREFPH= (0..15)
$$ 72.26 -67.22 0 0 0 0 0 0 0 0 0 0 0 0 0 0
$$ ##$WBSGU= (0..15)
$$ 0 0 0 0 0 0 0 0 0 0 0 0 0 0 0 0
$$ ##$XFAC= 2
$$ ##END=
$$ 
##$DECIM=	2496
##$DSPFVS=	20
##XUNITS=	HZ
##YUNITS=	ARBITRARY UNITS
##FIRSTX=	6407.6102564186803647
##LASTX=	-1605.0879904638193238
##DELTAX=	-0.12226593800080109986
##XFACTOR=	1
##YFACTOR=	0.014716498866268828971
##FIRSTY=	10.5233306884765625
##MINY=	4.1861462593078613281
##MAXY=	6885.876953125
##NPOINTS=	65536
##XYDATA=	(X++(Y..Y))
$$ [...]
2277H07Q1Q0M8M8k4k3q8q8j2P2R6Rqrl0l1l6l6J9o7l0N6J37N1%%M4m2r3r3J7J8k6k5O4O5p
2273I44oL6L6n9n8n9K7K1K1L8L9nmRRJ0RL8L7ooq0q1k8N6R5R4q6j71p6O7P7qq5%P5P5l8l8
2268I19l8l8Q5Q6R0NJ8J8J3J2o0o1o1o0k8k8M3M4k2k2k1k2L5L6L5L6l5l6QQk1k0k1k1K9K8
2264I33K9K8k9k9k9k9n0m9n0n0O7O6K4K4N6N6j6j5MMMMO2O2nj49j91m8J05J05N7N7j4j5o3
2259I16o4M0J25J02J7j10j10n4L1N5N5MMMMkjp3p3j2j1O0O0K9K9p2p1qrO3O2L7L6l5l5rrj0
2255I65rl7l7O2O3l3l2l3l3K2K2K2K2PPl6l6L1L0L0L1J2J3J2J3p0p1p6J0K3K2j5j5NMNNN4
2250I59N3J1J1K5K5O8O7j7j7j7j7n2n2rrL4L5l7l6l2l1J1J2ononK5K6p4p4o1o0L9L9O6O6o
2245I49nL0L1L0L0j1j0j1j1NMNMK2K2k0k1l0l0J2J3j1j0J1J0KJKJl2l3l2l3K8K8M9M9K8K7
$$ y = [807, 888, 968, 1016, 1064, 1040, 1017, 929, 841, 829, 901, 997, 1006, 998, 989, 959, 928, 892, 856, 875, 808, 778, 834, 971, 1022, 1022, 1022, 1066, 1024, 931, 838, 855, 873, 847, 822, 886, 951, 944, 938, 974, 1010, 951, 893, 834, 861, 882, 903, 941, 980, 975, 971, 980, 989, 999, 1008, 1046, 1083, 1077, 1071, 991, 910, 882, 938, 1033, 1127, 1041, 870, 794, 861, 938, 930, 845, 845, 920, 995, 957, 919, 881, 843, 928, 1014, 1104, 1109, 1127, 1145, 1158, 1170, 1110, 1049, 988, 928, 900, 872, 915, 959, 937, 915, 894, 872, 907, 943, 978, 1014, 979, 943, 951, 959, 938, 918, 897, 876, 905, 933, 962, 990, 961, 932, 903, 874, 824, 775, 725, 675, 742, 808, 832, 856, 912, 968, 952, 937, 941, 945, 949, 953, 1015, 1077, 1072, 923, 732, 684, 789, 894, 951, 1008, 994, 979, 916, 852, 892, 1017, 1119, 1136, 1026, 916, 862, 893, 948, 1003, 1007, 1011, 1015, 1019, 1017, 1016, 943, 870, 858, 847, 907, 967, 996, 1025, 953, 882, 874, 865, 928, 990, 1027, 1063, 1028, 993, 984, 975, 965, 956, 919, 882, 944, 1007, 974, 942, 909, 876, 898, 920, 942, 964, 971, 978, 942, 906, 937, 967, 997, 1028, 1040, 1053, 1065, 1078, 1008, 937, 861, 871, 894, 916, 901, 886, 891, 895, 900, 905, 959, 1012, 1023, 1034, 1059, 1084, 1152, 1219, 1202, 1185, 1168, 1151, 1099, 1047, 1038, 1029, 1063, 1098, 1061, 1025, 993, 962, 973, 985, 979, 974, 968, 963, 988, 1014, 940, 866, 805, 745, 784, 823, 889, 955, 949, 944, 974, 1005, 1035, 1065, 1054, 1044, 1033, 1022, 1027, 1031, 1036, 1040, 1062, 1084, 1064, 1043, 1013, 983, 995, 1008, 997, 987, 998, 1008, 1010, 1011, 1013, 1014, 982, 949, 917, 884, 912, 940, 989, 1038, 1066, 1093]
2241A093j5j5PPQPJ7J7k6k5n7n7J4J4k9l0J3J3L0K9p1p0k3k3M8M8j2j1j2j1K7K7j6j6j9j8
2236H63K4K4j1j1n4n4l6l6O4O4N4N3m7m6n8n7J8J03J03J8k9k9L1L2m0l9n6n6O8O7N8k8l4N2
2232I75J08K1j05j05lQ3qqK8K7J0p5n7K9P5P6k8k7m4m4K5J10O8j9j6j7N0N0n7n6p2p2J2R8
2228A032M9N0k1k2k1k2RQRQj4j4l6l5n5n5J6J6j14j15nQ0R8R7LLj0j0j0j1k4k4J8J9L6L6L7
2223A006L6N1N1k0k1m2m2J%mnJ7J7k1k1m2m2j5j4Q0Q0N8k7p4p3q0PN8N8LKM4M5%j%jm3m2m3
2218I41m3J4J4L6L6K3K4p1p1r5qJ20J19lj47j30J2N9k7o4o5JQ7Q7Jn5n4L9M0QPQQo6o6j5P2
2214G76N1N2L0K9L1n5r8j2Q6Q7K0K0l5l6l5l6%j%jLLMLKLm1m0L5L5L5L4M1M0l1l1nmnmn5n4
2209H41M5M6K7K7K7K7ooooJ2J1J2J1k0k1k1k0qqpqK5K4m7m6J6J6K7n9p3J3N9N9K2K2k0k1j1
$$ y = [1093, 1078, 1063, 1070, 1077, 1085, 1092, 1109, 1126, 1100, 1075, 1018, 961, 975, 989, 960, 930, 943, 956, 986, 1015, 944, 874, 851, 828, 876, 924, 912, 901, 889, 878, 905, 932, 916, 900, 881, 863, 887, 911, 900, 889, 835, 781, 745, 709, 773, 837, 891, 944, 897, 851, 793, 736, 754, 857, 960, 978, 949, 920, 951, 983, 943, 904, 848, 792, 860, 927, 985, 957, 923, 975, 1083, 1104, 999, 894, 891, 974, 966, 958, 986, 1013, 1023, 948, 891, 920, 995, 1071, 1043, 1016, 972, 928, 953, 1063, 1131, 1112, 1096, 1079, 1129, 1179, 1122, 1066, 994, 922, 934, 1032, 1081, 1131, 1110, 1088, 1067, 1045, 1054, 1062, 1071, 1079, 1065, 1051, 1015, 980, 925, 870, 886, 902, 788, 673, 668, 748, 846, 943, 946, 949, 939, 929, 919, 908, 884, 860, 878, 897, 933, 969, 1006, 1042, 1093, 1144, 1124, 1103, 1061, 1019, 1020, 1020, 1016, 1011, 1028, 1045, 1024, 1003, 961, 919, 904, 890, 970, 1050, 1108, 1081, 1007, 934, 854, 861, 919, 977, 980, 982, 1026, 1071, 1071, 1070, 1070, 1069, 1026, 984, 941, 898, 912, 926, 962, 998, 1021, 1045, 974, 903, 808, 800, 920, 1039, 1036, 889, 759, 771, 830, 803, 739, 674, 675, 762, 849, 850, 795, 741, 780, 820, 828, 835, 843, 851, 785, 719, 704, 776, 827, 879, 909, 938, 969, 914, 816, 804, 890, 977, 997, 1017, 982, 946, 911, 875, 875, 874, 874, 873, 876, 879, 883, 886, 888, 891, 850, 810, 845, 880, 915, 949, 990, 1030, 999, 968, 963, 959, 954, 950, 895, 841, 886, 932, 959, 986, 1013, 1040, 1034, 1028, 1022, 1016, 1028, 1039, 1051, 1062, 1042, 1021, 1000, 980, 972, 964, 957, 949, 974, 998, 951, 905, 921, 937, 964, 905, 832, 845, 904, 963, 985, 1007, 987, 966, 955]
2204I55j0j1j1M1M0lkk5k5k5k4K8K8K8K8J3J3J2J3m5m5kko4o4m1M5N4N4J6J6O1O1J8J8n7n7
2199A029j4j3QQRQl1l1J1J2k1k0M5M5J4p2j05L9R9R9m9m9KJKKLKLLmlmlN2N1j9k0PPl6l6O0
2194A091O0j1j1K0J9k3k4m2m2m2m2L6L6j0r5q3LN0N0j9j8K4K5kjkjL9L9lmL1L1L7m9m6m5r
2190I67qRRQRm3m3K8K9k7k7k7k7O7O7mmj8j7K5K5l2l3J1J0J25J25J05l8p8p8J3J2m1m2m1m2
2185I74L8L9nmm5m4N5N5j3j3n5n6k9k9J4J4QQN2N1J0J0P6P6k4j11o7J8kkm5M0P2P2k3k3l0
2181A062l0l0l0j1j2N5N5K6o0j1j2J8J7n3n4K5K6j7j8o1o2J0J0ppn5L0O6O7%Jk0k0k0k0M8
2176I06M7M8M8K2K2p2p3j3P3P3j3n8n8PQO1O2Rp6n3n3j5j6l3l4O6O6M5M5L9L9Lq2l5l5llm
2171I60ln7n6l9M7M5m0l5N0N7N7l7l8POl7l6J6J6N9N9N6N6m4m3MMMMK7K7j6j5k5k5k4k5PQ
$$ y = [955, 945, 934, 923, 964, 1004, 1001, 999, 974, 949, 924, 900, 928, 956, 984, 1012, 1025, 1038, 1050, 1063, 1018, 973, 971, 969, 905, 841, 800, 845, 899, 953, 969, 985, 1046, 1107, 1125, 1143, 1086, 1029, 1015, 1002, 1010, 1018, 1027, 1035, 1004, 973, 984, 996, 975, 955, 1000, 1045, 1059, 987, 882, 921, 1020, 1119, 1070, 1021, 1023, 1024, 1026, 1028, 1031, 1033, 1036, 1039, 1035, 1032, 1028, 1025, 1077, 1128, 1109, 1089, 1096, 1103, 1067, 1031, 1091, 1151, 1140, 1129, 1149, 1168, 1145, 1121, 1079, 1037, 995, 953, 989, 1025, 1015, 920, 837, 840, 890, 940, 921, 903, 927, 952, 950, 949, 947, 946, 985, 1024, 1021, 1017, 1048, 1079, 1116, 1067, 1021, 976, 967, 959, 968, 977, 985, 994, 951, 908, 936, 965, 938, 911, 884, 857, 924, 991, 987, 983, 965, 948, 973, 998, 966, 933, 944, 954, 1079, 1204, 1309, 1271, 1193, 1115, 1128, 1140, 1099, 1057, 1016, 974, 1012, 1051, 1046, 1042, 997, 953, 1008, 1063, 1050, 1037, 982, 926, 897, 868, 882, 896, 904, 912, 964, 1015, 1025, 1035, 1111, 1187, 1163, 1052, 985, 1003, 1001, 999, 954, 994, 1066, 1138, 1115, 1092, 1062, 1032, 1002, 972, 961, 949, 1004, 1059, 1085, 1025, 1014, 1002, 1020, 1037, 984, 930, 955, 981, 964, 946, 885, 823, 833, 843, 836, 829, 774, 804, 870, 937, 937, 938, 918, 898, 878, 858, 906, 953, 1001, 1049, 1071, 1093, 1021, 948, 935, 1008, 1081, 1068, 1010, 952, 959, 967, 1028, 1090, 1099, 1023, 970, 917, 902, 886, 853, 819, 885, 951, 996, 1041, 1080, 1119, 1122, 1040, 1005, 970, 967, 964, 960, 957, 900, 844, 805, 852, 897, 857, 822, 872, 929, 986, 949, 911, 918, 924, 887, 851, 867, 883, 942, 1001, 1057, 1113, 1069, 1026, 1030, 1034, 1038, 1042, 1069, 1096, 1080, 1065, 1040, 1015, 991, 966, 973, 981]
2167I81l6l5K8K8K8K9j1j2j1j1m7m8mnJ0J1J0J1PPPQk8k8M4M4J0J1J0J1M3M4%Jr9r8p6J0O8
2162I12O7k7k8m0m0KKM0M0Q3Q2N3N2j9j8k6k6r2r2o4K2P4P4j0j1L3L3J6J6n5n5j4j4K9K9m4
2158I84m5k6N9O9j5o3o2L1L2j2j2L3L4l9l8l0l1M1M1PPPPJ1J1J1J1O8O8n5n5n3L4K7K8j5j5
2153A055q1q1j2P3L6m9q0PQ1Q2mmmmQ1Q1N8k8q7q7m4m5KQ6Q7Jq6q6J7J03M2M1M7M7rqqqo9
2148A143o9o9o9%J%%K1K1K0K1K5K5m6m6o8o9LLQ4Q4O0k5r1r2O1O0JJm1m2n8n8P1P0K6K5j7
2144I66j8n7n8O5O6L4n2llj4j4K3K4O2k4k9N7J17L2p2p2%%j%L7L6L6L7n9n9n8n9K4K3K3K4
2139A034k9k8k9k9l7l8m8L7J17L2m3m3K6K5K6K6P3P3k7k7K8K8m4m4P3P3k7j13r1N1N7k9o6
2135I87o6j%rqrql7l8L4L5onnnN4N4j7j8K8K8j4j01p9O3J29Q8k9k9J1J1k2k2k2k3ONM8M9K2
$$ y = [981, 945, 910, 938, 966, 994, 1023, 1012, 1000, 989, 978, 931, 883, 879, 874, 884, 895, 905, 916, 923, 930, 937, 945, 917, 889, 933, 977, 987, 998, 1008, 1019, 1062, 1106, 1106, 1107, 1008, 910, 834, 844, 912, 979, 952, 924, 884, 844, 846, 848, 888, 928, 1011, 1093, 1146, 1198, 1179, 1161, 1135, 1109, 1017, 925, 861, 883, 957, 1031, 1021, 1010, 1043, 1076, 1092, 1108, 1053, 998, 984, 970, 999, 1028, 984, 939, 913, 972, 1041, 1026, 963, 901, 932, 964, 952, 940, 973, 1007, 968, 930, 900, 869, 910, 951, 958, 965, 972, 979, 990, 1001, 1012, 1023, 1091, 1159, 1104, 1049, 996, 1030, 1057, 1085, 1070, 1055, 974, 893, 881, 954, 990, 941, 861, 868, 949, 1031, 1027, 1023, 1019, 1015, 1096, 1177, 1235, 1207, 1120, 1033, 989, 944, 946, 1032, 1119, 1120, 1034, 948, 965, 1068, 1110, 1151, 1198, 1245, 1236, 1228, 1220, 1212, 1143, 1074, 1005, 936, 936, 937, 937, 937, 958, 979, 999, 1020, 1045, 1070, 1024, 978, 910, 841, 844, 847, 931, 1015, 1075, 1050, 959, 867, 928, 988, 989, 990, 949, 907, 849, 791, 862, 932, 958, 983, 966, 948, 891, 833, 898, 964, 998, 946, 943, 940, 926, 912, 935, 959, 1021, 997, 968, 1025, 1142, 1174, 1102, 1030, 1030, 1030, 1029, 1029, 1066, 1102, 1138, 1175, 1116, 1057, 999, 940, 964, 987, 1010, 1034, 1005, 977, 948, 919, 882, 844, 796, 833, 950, 982, 939, 896, 922, 947, 973, 999, 1072, 1145, 1118, 1091, 1119, 1147, 1103, 1059, 1132, 1205, 1178, 1065, 974, 1025, 1082, 1053, 987, 921, 920, 920, 911, 903, 894, 886, 849, 811, 845, 880, 874, 869, 864, 859, 913, 967, 950, 932, 960, 988, 974, 873, 794, 857, 986, 1074, 1045, 1016, 1027, 1038, 1016, 994, 972, 949, 955, 960, 1008, 1057, 1079]
2130A079K3m8m9l8l8L4L3k6k7p0o9K4K5j5j5O3J05O4k2l5N0J14K8o2j04o8k4MMPPKKKKL2L1
2126A025j1n3m4M1N7J4m2m3K6K6j6j5j6j5lkO4O4Mq1m1M5Q5M3jm4l2J1N5N5kjp4p3m2m2m2
2121H80m3J9J8O2O1k8k8k8k8PPPPL5L6L6L6K5K5m6m6n1n1qrR0R0O7j9m4m5opM6M6K5K5k0k0
2116A123JJK1K0k3k3J8J7k0k0k7N8P9om0m1K5K6o5o4PPKJJJkklkJ7J7k6k6L7L8onk0k0o2o3
2111I51o7o7O1O2L1L2L1L2LLLLppL6L6J4J4k9k9K0K1Kq3j07k1N3N4j0j0j0j0N4N4L2L3j08
2107A070j07q5JQ8Q8N0N1mnk5k6J3J2rrk7k7m8m9LKKLk5k4J04J05PQN1N1m2m1m2m1l6l7l6
2102I64l6j4j4n8n7J9J9R0R0QPo3o4J1J1N4N4M9M8n2n2M5M4k7k6o5o4O4O5O8O9l1l2j2j3j3
2098A086j3m9n0n0n0L8L7N8N9l8l8MNj4j3j4j4J4J5ppn7n7j4j5R9R8K7K6llJ8J8J4J4N7N7
$$ y = [1079, 1102, 1054, 1005, 967, 929, 963, 996, 970, 943, 873, 804, 828, 853, 838, 823, 886, 991, 1055, 1033, 998, 1048, 1162, 1190, 1128, 1024, 956, 932, 936, 940, 947, 954, 956, 958, 960, 962, 994, 1025, 1014, 961, 917, 958, 1015, 1029, 987, 944, 970, 996, 980, 965, 949, 934, 931, 929, 993, 1057, 1061, 980, 939, 984, 1069, 1112, 1111, 1067, 1035, 1046, 1101, 1156, 1154, 1153, 1079, 1006, 964, 922, 880, 837, 856, 874, 936, 997, 969, 941, 913, 885, 892, 899, 906, 913, 948, 984, 1020, 1056, 1081, 1106, 1060, 1014, 963, 912, 904, 895, 985, 1075, 1142, 1123, 1079, 1034, 1028, 1021, 1067, 1113, 1138, 1163, 1143, 1123, 1124, 1125, 1146, 1166, 1143, 1120, 1138, 1155, 1135, 1115, 1088, 1146, 1225, 1219, 1179, 1138, 1163, 1189, 1124, 1060, 1067, 1074, 1076, 1077, 1078, 1079, 1077, 1075, 1072, 1070, 1087, 1104, 1078, 1052, 1089, 1127, 1121, 1116, 1096, 1076, 1014, 951, 884, 817, 878, 940, 971, 1003, 1034, 1066, 1069, 1072, 1075, 1078, 1071, 1064, 1100, 1136, 1150, 1164, 1135, 1106, 1126, 1147, 1149, 1066, 959, 938, 991, 1045, 1035, 1025, 1015, 1005, 1059, 1113, 1145, 1178, 1070, 963, 878, 879, 967, 1055, 1105, 1156, 1152, 1147, 1122, 1096, 1109, 1121, 1112, 1103, 1076, 1049, 1001, 952, 955, 957, 959, 962, 937, 913, 1017, 1122, 1129, 1137, 1188, 1239, 1197, 1156, 1114, 1073, 1037, 1000, 964, 928, 914, 900, 842, 785, 804, 823, 913, 1003, 1011, 1018, 955, 891, 902, 913, 967, 1021, 1070, 1118, 1066, 1014, 1059, 1103, 1076, 1050, 985, 921, 985, 1050, 1118, 1187, 1156, 1124, 1112, 1099, 1086, 1073, 1024, 974, 924, 874, 912, 949, 1007, 1066, 1028, 990, 994, 999, 985, 972, 958, 944, 958, 973, 966, 959, 902, 845, 831, 816, 915, 1013, 1040, 1066, 1063, 1060, 1078, 1096, 1110, 1124, 1181, 1238]
2093A238L4L5j23j23q6q5J4J5J3J3l0k9J1J2J1J1L6L6L6L6j7j8j7j8L2L1L2L1POOPl2l3l2
2089A060l2l9l9NML2L1L2L1j9j9K4K3k6k7J6J7L5L5l7l6k7k6k7k6n3n2M7M8j9k0K4K4K0K0
2085A004n2n1p5p5k5N9P4L2J8J8RJ0RRK9L0K6K6Q3M1m2j27r9n6J4J5K6K6K7K6J9J9J9K0m5
2080A041m6k7N9P4j1n8n7NOLLmm6p3J3P1K8j3j4P0P0k9j16l0J13J18L2k2k2k8k7L3L2j0j0
2076A128p8p8l5l6K2K1K1K1K2K1K1K1l1l2p4p4K0K0K0K1mlL9M0J2J3J3J2k2k2o0o0PR3K7n9
2072I67j29m4N9O0P4P4N0l5o8o9K6K6m5m6klJ4J4n2n2K7J12J12K6k1k0k7k6OOM9M9k5k5J2
2067A074J2J2p4p4J1O5O5n8n8J4J4J4J4oonok5k4k5k4j4j4Q1Q0N6l0j05j05oQ0L2L2j0rL2
2063A010L3l5l6PPN9N9J6J6j%p2p2l8l8NNN7N8j4j4j0j1L3L2M9M8K6o0r3r4KJL1L1L1L1M0
$$ y = [1238, 1272, 1307, 1184, 1061, 975, 890, 904, 919, 932, 945, 915, 886, 897, 909, 920, 931, 967, 1003, 1039, 1075, 1058, 1040, 1023, 1005, 1037, 1068, 1100, 1131, 1138, 1144, 1150, 1157, 1125, 1092, 1060, 1028, 989, 950, 955, 959, 991, 1022, 1054, 1085, 1066, 1047, 1071, 1094, 1068, 1041, 1057, 1074, 1109, 1144, 1107, 1071, 1044, 1018, 991, 965, 912, 860, 907, 955, 936, 916, 940, 964, 984, 1004, 952, 901, 826, 751, 726, 785, 859, 891, 909, 927, 936, 946, 955, 964, 993, 1023, 1049, 1075, 1158, 1199, 1157, 1030, 931, 875, 889, 904, 930, 956, 983, 1009, 1028, 1047, 1066, 1086, 1041, 995, 968, 1027, 1101, 1090, 1032, 975, 980, 986, 989, 992, 988, 942, 869, 882, 953, 981, 968, 954, 1024, 1094, 1065, 949, 919, 1032, 1150, 1182, 1160, 1138, 1110, 1083, 1116, 1148, 1138, 1128, 1050, 972, 937, 901, 923, 944, 965, 986, 1008, 1029, 1050, 1071, 1040, 1008, 934, 860, 880, 900, 920, 941, 937, 934, 973, 1013, 1025, 1038, 1051, 1063, 1041, 1019, 959, 899, 906, 999, 1026, 967, 838, 794, 853, 913, 987, 1061, 1111, 1076, 1008, 939, 965, 991, 946, 900, 898, 895, 909, 923, 871, 819, 846, 958, 1070, 1096, 1075, 1055, 1028, 1002, 1008, 1014, 1063, 1112, 1087, 1062, 1074, 1086, 1098, 1024, 950, 961, 1026, 1091, 1033, 975, 989, 1003, 1017, 1031, 1025, 1019, 1014, 1008, 983, 959, 934, 910, 896, 882, 963, 1043, 1099, 1069, 964, 859, 853, 933, 965, 997, 987, 978, 1010, 1043, 1008, 972, 979, 986, 1045, 1104, 1120, 1136, 1135, 1135, 1063, 991, 953, 915, 920, 925, 982, 1040, 1026, 1012, 1002, 991, 1024, 1056, 1105, 1153, 1179, 1119, 1026, 932, 934, 935, 966, 997, 1028, 1059, 1099]
2058A099M0M0M0j01j01n8n8NMMNOPP7P8l1l1l1l1o2o2j0P6N3N3j3j2j6j5K7K7K6K5m6m6j1
2054I57j1m8m9j7O8O8j7k8k7L8L9j7j7N5N5k3k2p0J5K1K1j7j7nnmno1o1J4R9R2Nj2j2M2M1
2049A085M2M2o3o2j10k5J0J0J5J6L1L1o8o9j5j6N5N6N0N0PPqqqqK8K8m4m3j3j3Q2Q1Lq2q3
2045I91LL5L6jkQ2Q1N8k7m8m8j1j0j8j7j7j7onp2p2O4J50Q2o1q8q7L1L2j1j2L0P4O9j6r4r3
2040I85J1J1J1J1k3k4o6o7kkM0M1J4J5N2N2J9o7o6J9J0J0J6J5R0R0m1j28o0K5J4J4K4K3J0
2036A076l3qP8P5j1n9n9k2k2j3j4j3j4K7K7K7K7l8l9L4L3l8l8l8l9L5L4rrK7K6j7j7J3J3J2
2032A014J3OPl4l4J6N9M5m0o9J6O2O3k3k3J6J7j9o3m4M2M2M2M7M7l1l0p4p4q4q4j0P6K4o2
2027H56n9K6O7K5l7M8Q5Q4j0j1l3l3p7p6J5J4N7N8NONOJ3J4J3J4M9N0n1n1L5L5M1m6m9n0n0
$$ y = [1099, 1139, 1179, 1219, 1118, 1017, 959, 901, 906, 910, 914, 919, 925, 932, 1009, 1087, 1056, 1025, 994, 963, 901, 839, 829, 905, 958, 1011, 998, 986, 970, 955, 982, 1009, 1035, 1060, 1014, 968, 957, 946, 898, 849, 832, 900, 968, 951, 923, 896, 934, 973, 956, 939, 994, 1049, 1026, 1004, 934, 949, 970, 991, 974, 957, 952, 947, 943, 938, 877, 816, 830, 929, 1021, 1026, 1014, 1002, 1044, 1085, 1127, 1169, 1106, 1044, 934, 909, 919, 929, 944, 960, 991, 1022, 954, 885, 870, 854, 909, 965, 1015, 1065, 1072, 1079, 1071, 1063, 1055, 1047, 1075, 1103, 1059, 1016, 1003, 990, 1072, 1153, 1156, 1074, 991, 994, 1029, 1065, 1064, 1062, 1144, 1225, 1283, 1256, 1208, 1160, 1149, 1139, 1121, 1104, 1087, 1070, 1064, 1059, 987, 915, 979, 1129, 1211, 1150, 1062, 975, 1006, 1038, 1027, 1015, 1045, 1119, 1188, 1172, 1078, 985, 996, 1007, 1018, 1029, 1006, 982, 916, 849, 847, 845, 885, 926, 940, 955, 1007, 1059, 1078, 1011, 945, 964, 974, 984, 1000, 1015, 1105, 1195, 1154, 1026, 966, 991, 1005, 1019, 1043, 1066, 1076, 1043, 1035, 1113, 1188, 1177, 1118, 1059, 1037, 1015, 1002, 988, 975, 961, 988, 1015, 1042, 1069, 1031, 992, 1026, 1059, 1021, 983, 945, 906, 941, 975, 966, 957, 984, 1010, 993, 976, 989, 1002, 1014, 1027, 1033, 1040, 1006, 972, 988, 1047, 1092, 1052, 983, 999, 1061, 1124, 1101, 1078, 1094, 1111, 1092, 1029, 985, 1027, 1069, 1111, 1158, 1205, 1174, 1144, 1070, 996, 912, 828, 818, 894, 918, 856, 797, 823, 890, 915, 878, 926, 1011, 1095, 1085, 1074, 1041, 1008, 931, 855, 870, 884, 941, 999, 1004, 1010, 1015, 1021, 1034, 1048, 1061, 1075, 1124, 1174, 1123, 1072, 1107, 1142, 1183, 1137, 1088, 1038, 988]
2023I88n0l5N1P3P4l6l6l7l6K0K1K0K0K0K0K0K0PPPPk9l0p2p2L1L0Q0pl4l4LLK6K6R1R2J7
2018A266o9r2r3m8m7kQ4J20L4p3j59p2J3N9O0O3O3O8j7j09j09M2M3k4k4k3k4mmnmJ1J0J1J1
2014I56LKO9O9Lq2j25l9R7R7N1l5n4n4M0M0M1M1l0l0N0N0m5m4n1L5L0L0QPJ3J3l3N2R5J0p8
2009A202p7J7J6k2k2k2k2qqqqM3M3%Jn6n6j3j4j3j3N8N9n6n6l3N3N0M9J3J2j9j9j9j9l7l7
2005I59L7J23O8j9j17j16M7J32R9m4j30m4Q4Q4J7J6k6k6m6m6K5K6o8o8Q1Q0Nj38j38NQ8Q8
2001A038llKLm1m0k3k2k3k3M1M1P8P8P7qo0o0mmmmm6m6qqJ2p2p3J3J10J09j3j4J3J2J2J2J0
1996A059J0J0RJ0J0J0J0m2m1m1m2J3J2N5N5k1k1k7O0M5M5k1k1M9M9OOl5l5l4l5j9k0j9j9n
1992A025nO1O1O8j8p0o9jjjjM9N0K6n9p8p7m0m0L4L4L4L4j7j8j7j7J5J5J4J5k3k3N2J38J00
$$ y = [988, 938, 903, 954, 1027, 1101, 1065, 1029, 992, 956, 976, 997, 1017, 1037, 1057, 1077, 1097, 1117, 1124, 1131, 1138, 1145, 1116, 1086, 1014, 942, 973, 1003, 1083, 1076, 1042, 1008, 1011, 1014, 1040, 1066, 1157, 1249, 1266, 1197, 1105, 1012, 964, 917, 915, 999, 1119, 1153, 1080, 921, 849, 862, 921, 981, 1044, 1107, 1175, 1158, 1049, 940, 982, 1025, 1001, 977, 954, 930, 926, 922, 917, 913, 924, 934, 945, 956, 959, 961, 1030, 1099, 1102, 1020, 895, 856, 953, 1050, 1101, 1066, 1012, 958, 998, 1038, 1079, 1120, 1090, 1060, 1110, 1160, 1115, 1071, 1020, 1055, 1085, 1115, 1123, 1130, 1143, 1156, 1123, 1175, 1270, 1280, 1202, 1125, 1142, 1158, 1136, 1114, 1092, 1070, 1062, 1054, 1046, 1038, 1081, 1124, 1124, 1125, 1069, 1013, 1000, 986, 973, 960, 1018, 1077, 1021, 965, 932, 985, 1035, 1084, 1097, 1109, 1090, 1071, 1052, 1033, 996, 959, 996, 1119, 1187, 1168, 1051, 935, 982, 1114, 1213, 1169, 1039, 995, 1079, 1163, 1180, 1196, 1170, 1144, 1098, 1052, 1077, 1103, 1035, 967, 1048, 1128, 1133, 995, 857, 862, 950, 1038, 1035, 1032, 1034, 1037, 996, 956, 933, 911, 888, 865, 906, 947, 1025, 1103, 1180, 1172, 1112, 1052, 1048, 1044, 1040, 1036, 990, 944, 936, 928, 940, 868, 795, 808, 918, 1027, 1014, 1000, 1013, 1025, 1037, 1049, 1059, 1069, 1079, 1088, 1098, 1108, 1118, 1128, 1086, 1045, 1004, 962, 975, 987, 1042, 1097, 1076, 1055, 1028, 1088, 1133, 1178, 1157, 1136, 1185, 1234, 1240, 1246, 1211, 1176, 1142, 1107, 1088, 1068, 1049, 1030, 1025, 1020, 1081, 1142, 1210, 1192, 1122, 1053, 1052, 1051, 1050, 1049, 1098, 1148, 1174, 1115, 1037, 960, 920, 880, 914, 948, 982, 1016, 999, 981, 964, 947, 962, 977, 991, 1006, 983, 960, 1012, 1150, 1250]
1987A250J5q9q9m4m5m4m4L3L2L3L2j8j8j8j9l5l5PPRQQRJ7J7J7J8M1M1jkm3m2m3m3ooopLK
1982I02KKppL6L7o7o7m4M2J13J13J24L8j9k0P0P0K9n7j09j08m1m1KKk1k1K2K1O3O2o1o0m2
1978I58M3O7O7NNNMp7p7ooj1j1o0K6M4M4M4M3P4j2o3o4k5k5o3o3N4J40O9j7K0K0J5J5qrqr
1973A148l2l3J1J0PQPPM3M2k9l0j9k0K3K3k1k1k0k1M2M3K4o1m0M5L4L4l8l9L3L3M5M6N0l5
1969A299o1o2K8K8K9n6q0p9j0rO1O2K7K8K8K7o0o0o0o0j6j7j6j7j0j1O0O1M7M7NMk3k3K0J9
1964A150p3p3k6N9R7J1opO6O6l4l4k0k0k1k0K6K7K6K6n4n4qP8N5l0p1p1l4N1M6M6l4l4QRK7
1960A150K7p3p2l5l5PQnmL8L8k2k3mQ1O2k4m2m2J3J4l0k9M8M9ON%j%jk9k9M2M2rqn2n1l7l6
1955I37K9L0or2m9L7J23J22mq9p2J4RQN7J42J02m0j02j03J7J7o8o9L2L1J1J1P6P7J8o7o8J9
$$ y = [1250, 1265, 1176, 1087, 1043, 998, 954, 910, 943, 975, 1008, 1040, 1022, 1004, 986, 967, 932, 897, 904, 911, 920, 928, 936, 945, 962, 979, 996, 1014, 1055, 1096, 1095, 1093, 1050, 1008, 965, 922, 916, 910, 904, 897, 900, 902, 904, 906, 899, 892, 928, 965, 898, 831, 787, 829, 942, 1055, 1179, 1217, 1198, 1178, 1248, 1318, 1347, 1290, 1181, 1073, 1032, 991, 993, 995, 974, 953, 975, 996, 1059, 1121, 1060, 1000, 958, 1001, 1068, 1135, 1140, 1145, 1150, 1154, 1077, 1000, 994, 988, 977, 966, 906, 932, 976, 1020, 1064, 1107, 1181, 1169, 1106, 1042, 1017, 992, 929, 866, 920, 1060, 1129, 1112, 1132, 1152, 1167, 1182, 1174, 1165, 1157, 1148, 1116, 1083, 1094, 1104, 1111, 1119, 1126, 1133, 1176, 1218, 1189, 1159, 1140, 1120, 1143, 1166, 1145, 1124, 1104, 1083, 1125, 1168, 1192, 1131, 1091, 1136, 1170, 1204, 1166, 1127, 1160, 1193, 1238, 1284, 1334, 1299, 1238, 1176, 1204, 1232, 1261, 1205, 1125, 1046, 1036, 1027, 1088, 1150, 1177, 1205, 1233, 1260, 1200, 1140, 1080, 1020, 1004, 987, 971, 954, 944, 933, 993, 1054, 1101, 1148, 1153, 1157, 1134, 1111, 1131, 1150, 1077, 1004, 978, 1037, 1134, 1145, 1139, 1132, 1198, 1264, 1230, 1196, 1176, 1156, 1135, 1115, 1141, 1168, 1194, 1220, 1166, 1112, 1104, 1182, 1237, 1207, 1136, 1065, 1031, 1082, 1128, 1174, 1140, 1106, 1114, 1123, 1150, 1177, 1104, 1032, 997, 962, 969, 977, 972, 968, 1006, 1044, 1022, 999, 995, 1076, 1138, 1114, 1072, 1030, 1043, 1057, 1027, 998, 1046, 1095, 1101, 1106, 1106, 1105, 1105, 1104, 1075, 1046, 1088, 1130, 1121, 1113, 1061, 1010, 973, 937, 966, 996, 990, 898, 849, 886, 1009, 1131, 1127, 1038, 966, 980, 989, 997, 1054, 1196, 1298, 1258, 1156, 1053, 1070, 1087, 1019, 950, 982, 1013, 1024, 1035, 1111, 1188, 1206, 1139, 1071, 1090]
1951A090J3J4k4k4k2k1K0K1K9K9m2m2J0J0N9k7m7m8M7M7k2k1K1K1J4J3RRrr4m5m6j7j8K6K6
1946I59N1N1QQmmnmpoppQRo3o4L1L0L1L0j%M2M2PPl6l5L4L5P2P3k1j05j06k1k6k7k6N9P6P6
1941A164J0Rl3l4l4l4j4j4K4K4M8l7o0o0J9K0J9K0kkn0L5J07J08M1M1j%m4m3K0K1k2k2J9J8
1937A261k5k4nnmnk1k2K2K1o3o2QRrqn7L0L5L6jkj4j4j4j4O1O0j1j0J8J9J3J3m5j31j31m6
1932H63L9L9M5M4J24J23M3m2m0l9m6m5J2J1J2J1k5k5k5k5M1M1l0l1L2L2l9l9J5J6J5J6j7j7
1928A089j6j7K6K7j7j7OOM8M9K4K5j9j8K4K3K4K3m2m3q0q0q3LK6K6M8M7kq7p0k7J4J4M2M1
1924A037kkMNMNK7K7J0p7m8L7J07O5l2l2l4l5RRP5P6k2j06o4K1L5L5l1l1j6j7j6j7k7k7J6
1919I68J5oolmJM4P0j5n5j2N8N8m4m3kM2J3p3m6lJ9J8O4O4P8P7POm1m1m1m1p9q0K1K0R0Q9
$$ y = [1090, 1103, 1117, 1093, 1069, 1047, 1026, 1046, 1067, 1096, 1125, 1083, 1041, 1051, 1061, 1120, 1093, 1046, 998, 1045, 1092, 1070, 1049, 1070, 1091, 1105, 1118, 1127, 1136, 1127, 1033, 988, 942, 925, 907, 933, 959, 1010, 1061, 1069, 1077, 1073, 1069, 1064, 1060, 1053, 1047, 1040, 1033, 1041, 1050, 987, 923, 954, 984, 1015, 1045, 1044, 1044, 1086, 1128, 1135, 1142, 1106, 1071, 1105, 1140, 1212, 1285, 1264, 1159, 1053, 1032, 1006, 979, 953, 1012, 1088, 1164, 1174, 1183, 1150, 1116, 1082, 1048, 1034, 1020, 1044, 1068, 1116, 1079, 1019, 959, 978, 998, 1017, 1037, 1035, 1033, 983, 1018, 1125, 1233, 1274, 1315, 1314, 1314, 1270, 1227, 1247, 1268, 1246, 1224, 1243, 1261, 1236, 1212, 1207, 1202, 1198, 1193, 1172, 1150, 1172, 1193, 1130, 1068, 1076, 1085, 1076, 1068, 1011, 1041, 1076, 1112, 1111, 1109, 1095, 1081, 1067, 1053, 1114, 1174, 1163, 1153, 1171, 1190, 1203, 1216, 1171, 1040, 909, 863, 902, 941, 986, 1030, 1154, 1277, 1320, 1278, 1238, 1199, 1153, 1108, 1120, 1131, 1143, 1154, 1129, 1104, 1079, 1054, 1095, 1136, 1106, 1075, 1107, 1139, 1100, 1061, 1076, 1092, 1107, 1123, 1106, 1089, 1073, 1056, 1082, 1109, 1092, 1075, 1081, 1087, 1135, 1184, 1208, 1233, 1214, 1196, 1220, 1243, 1267, 1290, 1248, 1205, 1125, 1045, 962, 965, 991, 1017, 1065, 1112, 1110, 1023, 953, 926, 940, 954, 996, 1037, 1035, 1033, 1037, 1042, 1046, 1051, 1078, 1105, 1115, 1038, 990, 1027, 1134, 1199, 1167, 1135, 1101, 1066, 1075, 1084, 1159, 1235, 1213, 1107, 1043, 1064, 1099, 1134, 1103, 1072, 1056, 1039, 1023, 1006, 979, 952, 968, 983, 977, 971, 968, 964, 965, 1009, 1079, 1064, 1009, 997, 1055, 1113, 1069, 1026, 1024, 1066, 1079, 1006, 960, 957, 976, 994, 1058, 1122, 1200, 1277, 1284, 1290, 1249, 1208, 1167, 1126, 1047, 967, 988, 1008, 1098, 1187]
1914A187J8J8l5l4RRpopok3k3J9K0%%%%rj0O2O2m8m8r1r1k6k5J7J7L6L7L6L7oopoJ2J1l1l1
1909A031m5m6K6K6K9L0K9L0%J%Jm8m9onM5M6M6M5m8m8m8m8L5L5L5L5k8k7p0p1KJM4M5nnnm
1904A011J3J3N6N6JJJJJ5J5q4q5K7K7P0O9K8K9j5j5j8j8K4K5N3N4m6m7jjp2p2j6j5j6j5j6
1900A037j5j6j5k9k9M3M2MLM1M1j2r7n0m9MMNM%%M3M3kjkjN3N4J1J1K5K6r8r8kQ3L5L5J5J4
1895A160k3k2o1K5M8M9N0N0PPqrm6m5j00j4L8L8n1n1K0K0J1J2J1J1OOONj9j9j9j9n1n1r9j3
1890H60K3K3K9K8N8N8j4j3n6n5j3j3M4M3k8k7j2j2L1L1J9J8k4k4O1O2J5p1r6j1O4O4M1M1M7
1886A191m0j04j04rj0M9N0M9M9K0K0K0K0K8K7m4m5q8q9J1J1Q2Q1j8j8K1K0K1K0q5q6M3M3K5
1882A161K4j8j8k1k1K2K2J9J9J9J9L4L4l7l7l5l4L7L6k5k6k5k6poppo5o6O3O3M6M7k5k5M8
$$ y = [1187, 1205, 1223, 1188, 1154, 1163, 1172, 1165, 1159, 1152, 1146, 1123, 1100, 1119, 1139, 1139, 1139, 1139, 1139, 1130, 1120, 1182, 1244, 1196, 1148, 1057, 966, 940, 915, 932, 949, 985, 1022, 1058, 1095, 1089, 1083, 1076, 1070, 1082, 1093, 1062, 1031, 986, 940, 966, 992, 1021, 1051, 1080, 1110, 1110, 1111, 1111, 1112, 1064, 1015, 1009, 1004, 1049, 1095, 1141, 1186, 1138, 1090, 1042, 994, 1029, 1064, 1099, 1134, 1106, 1079, 1009, 938, 940, 941, 985, 1030, 1025, 1020, 1015, 1011, 1024, 1037, 1093, 1149, 1150, 1151, 1152, 1153, 1168, 1183, 1099, 1014, 1041, 1068, 1138, 1207, 1235, 1264, 1249, 1234, 1216, 1198, 1222, 1247, 1300, 1354, 1308, 1261, 1260, 1259, 1187, 1115, 1099, 1084, 1068, 1053, 1037, 1022, 1006, 991, 962, 933, 976, 1018, 1022, 1025, 1066, 1107, 1095, 998, 948, 899, 903, 907, 912, 916, 916, 916, 959, 1002, 1000, 999, 997, 996, 1049, 1103, 1114, 1125, 1150, 1176, 1078, 980, 978, 1061, 1096, 1131, 1146, 1160, 1137, 1115, 1054, 1079, 1127, 1176, 1226, 1276, 1283, 1290, 1282, 1273, 1227, 1182, 1082, 1068, 1106, 1144, 1093, 1042, 1062, 1082, 1093, 1105, 1116, 1127, 1133, 1139, 1145, 1150, 1131, 1112, 1093, 1074, 1023, 972, 873, 860, 883, 906, 935, 963, 1021, 1079, 1065, 1052, 996, 941, 928, 915, 959, 1002, 974, 947, 935, 923, 954, 985, 1004, 1022, 998, 974, 1035, 1097, 1112, 1041, 945, 934, 998, 1062, 1103, 1144, 1191, 1151, 1047, 943, 934, 924, 973, 1023, 1072, 1121, 1141, 1161, 1181, 1201, 1229, 1256, 1212, 1167, 1079, 990, 1001, 1012, 1094, 1175, 1157, 1139, 1160, 1180, 1201, 1221, 1136, 1050, 1093, 1136, 1161, 1185, 1167, 1149, 1128, 1107, 1129, 1151, 1170, 1189, 1208, 1227, 1261, 1295, 1258, 1221, 1186, 1152, 1189, 1225, 1200, 1174, 1149, 1123, 1116, 1110, 1103, 1096, 1031, 965, 1028, 1091, 1137, 1184, 1159, 1134, 1182]
1877A182M8k3k3m0l9LMN7N7j5j4n4n4j1j1j8j7K5K6kklkmmmmM5M5k6k7K5K4K4K5n7n7n7n6
1873I66L5L5L5L5l9m0MLNMMNM9M9M9M9j9j9o1o2J8J7k5k6o7o7k0j9PR2R5Rm2%P1P0k2k3J9
1868A174O2j4r8r6j1M0M0N4l3p2k9M0M1J0J0MMn2j39m1M4P0K6K6O9O0k5p0k8K5K5O5O5O8j8
1863A296r8r8MMLMPOn9o0j9O7Q6M3j0j0j2j3NNNNn3n3J7O0L6m9p1p0PQPQO0O0J7J8n1n0m8
1858A014m7K9P2N4l2l7l8NOK1J06J49J05k3j08j11k6M0M1n5n4j6j6j6j6RQQRj3j3K7K7jm4
1854A064k7N8Q9M7MNJKJKNNo6o7klklMMLMK7K8K7K7J3J2l1l1j2j3j2j3n0n0n0n0ooO6O6K2
1849A092K3K3K3mlm6m6N2N3J0J0RJ0l4l4l7l7L4L4nmm8m7l1l0L9Q3P7rl0l0M0M0l0p3LR0O3
1844A230J9KJkjn5n5J7J7kkm5m5m1m0N9J01R6J1l9l9j3j3j3j3m5m4K4K4j9o3k0O5P7qp8l6
$$ y = [1182, 1230, 1207, 1184, 1144, 1105, 1108, 1112, 1169, 1226, 1211, 1197, 1143, 1089, 1078, 1067, 1049, 1032, 1057, 1083, 1081, 1079, 1076, 1074, 1070, 1066, 1062, 1058, 1103, 1148, 1122, 1095, 1120, 1144, 1168, 1193, 1136, 1079, 1022, 966, 1001, 1036, 1071, 1106, 1067, 1027, 1031, 1034, 1039, 1043, 1047, 1052, 1101, 1150, 1199, 1248, 1229, 1210, 1149, 1087, 1105, 1122, 1097, 1071, 1004, 937, 917, 898, 905, 997, 1092, 1101, 1059, 1059, 1130, 1200, 1178, 1155, 1174, 1236, 1222, 1124, 1028, 1017, 1057, 1097, 1151, 1118, 1046, 1017, 1057, 1098, 1108, 1118, 1122, 1126, 1074, 935, 894, 938, 1008, 1034, 1060, 1129, 1189, 1164, 1094, 1066, 1091, 1116, 1181, 1246, 1314, 1296, 1198, 1100, 1104, 1108, 1111, 1115, 1122, 1128, 1069, 1009, 990, 1057, 1143, 1186, 1176, 1166, 1154, 1141, 1146, 1151, 1156, 1161, 1108, 1055, 1072, 1132, 1168, 1119, 1048, 978, 985, 993, 1000, 1008, 1068, 1128, 1145, 1163, 1112, 1062, 1014, 967, 996, 1068, 1122, 1090, 1053, 1015, 1020, 1026, 1047, 1153, 1302, 1407, 1384, 1276, 1165, 1139, 1179, 1220, 1165, 1111, 1095, 1079, 1063, 1047, 1056, 1064, 1072, 1081, 1068, 1055, 1082, 1109, 1108, 1064, 1037, 1095, 1184, 1231, 1235, 1240, 1241, 1243, 1244, 1246, 1251, 1256, 1190, 1123, 1121, 1118, 1116, 1113, 1117, 1121, 1124, 1128, 1155, 1183, 1210, 1237, 1250, 1262, 1231, 1200, 1188, 1175, 1163, 1150, 1100, 1050, 1000, 950, 944, 938, 1004, 1070, 1092, 1115, 1138, 1161, 1157, 1154, 1108, 1062, 1114, 1167, 1177, 1187, 1196, 1206, 1172, 1138, 1101, 1064, 1098, 1132, 1127, 1123, 1075, 1028, 997, 967, 1006, 1089, 1166, 1157, 1127, 1097, 1137, 1177, 1147, 1074, 1077, 1167, 1230, 1249, 1251, 1252, 1250, 1249, 1194, 1139, 1156, 1173, 1171, 1169, 1124, 1079, 1038, 998, 1057, 1158, 1254, 1265, 1226, 1187, 1174, 1161, 1148, 1135, 1090, 1046, 1070, 1094, 1075, 1012, 992, 1057, 1134, 1126, 1048, 1012]
1840A012O8O8nr0pP9Q9M7Pl5n7n7j5j5j4j5OPPOqrrqj%M2M2l9m0p7p8JQ6Q6JK4K4J8J8m1m1
1835A077K9L0MMM7M7l7l6RR5R3Pl9m0p4p5p5p4k2k2M4M4L5n0o8o8J2R7N5l1r6r6N5N6O2O2
1830A061K0K0k4k4P5P6j7j8J9K0J6p0p0J5M0M0L9M0l7j23p5p5o4o4m1M5J24J24k8k8L9L8Q1
1826A174Q1nnm8m8L2L2L3L2%J%%k2k1o5o5k2k1k2k2jjM2M1N2N1m8m9k6k6k6k6j1j1L2L2K7
1822A071K8m4m4k8k8M3M3l9l9n0L6J14K7m1m2L8J23Q0nJ8J9J3J3l3l3l4l3n6n5j3j3M2M3M2
1817A163M2LMm0m0J7J6k6k6K9K9qqrP6P7rr8r7llL3L3j0j0NMNNr5r5m3M2N0N0N5N5j3j4j3
1812A133j4rrj0rk0k0k1k0K7K8K7K7nnL8L8m5m4n0L6O3O3O8O8k0k0k0k0p9q0j27m3N3N4j3
1808A020j3ppO5O5N2N2j9j9n5n5j2j2M9N0OOl2l2M0L9k1k2k1k1j8j8N4N4J2J3J2J3n4n5pP7
$$ y = [1012, 1080, 1148, 1143, 1053, 1046, 1125, 1214, 1261, 1268, 1233, 1176, 1119, 1104, 1089, 1075, 1060, 1066, 1073, 1080, 1086, 1078, 1069, 1060, 1052, 1051, 1051, 1093, 1135, 1096, 1056, 979, 901, 902, 988, 1074, 1075, 1099, 1123, 1141, 1159, 1118, 1077, 1106, 1136, 1140, 1144, 1191, 1238, 1201, 1165, 1174, 1269, 1362, 1369, 1330, 1290, 1216, 1141, 1066, 992, 970, 948, 992, 1036, 1071, 1021, 953, 885, 897, 994, 1049, 1018, 922, 826, 881, 937, 999, 1061, 1081, 1101, 1077, 1053, 1128, 1204, 1187, 1169, 1188, 1208, 1224, 1154, 1084, 1099, 1139, 1179, 1218, 1258, 1221, 1098, 1023, 948, 884, 820, 779, 824, 948, 1072, 1044, 1016, 1055, 1093, 1174, 1255, 1250, 1245, 1197, 1149, 1181, 1213, 1246, 1278, 1278, 1279, 1279, 1279, 1257, 1236, 1171, 1106, 1084, 1063, 1041, 1019, 1018, 1017, 1059, 1100, 1152, 1203, 1155, 1106, 1080, 1054, 1028, 1002, 991, 980, 1012, 1044, 1071, 1099, 1055, 1011, 983, 955, 998, 1041, 1002, 963, 913, 949, 1063, 1090, 1049, 1007, 1045, 1168, 1248, 1243, 1261, 1280, 1293, 1306, 1273, 1240, 1206, 1173, 1117, 1062, 1049, 1036, 1078, 1121, 1163, 1205, 1208, 1212, 1172, 1132, 1149, 1165, 1139, 1113, 1142, 1171, 1163, 1155, 1146, 1222, 1299, 1290, 1192, 1095, 1092, 1089, 1122, 1155, 1145, 1135, 1140, 1144, 1149, 1154, 1059, 964, 921, 963, 1013, 1063, 1118, 1173, 1160, 1146, 1133, 1119, 1110, 1101, 1091, 1082, 1062, 1042, 1021, 1001, 1028, 1056, 1083, 1110, 1105, 1100, 1138, 1176, 1131, 1087, 1037, 1073, 1136, 1199, 1267, 1335, 1315, 1295, 1275, 1255, 1176, 1096, 969, 926, 979, 1033, 1020, 1007, 1000, 993, 1058, 1123, 1175, 1227, 1208, 1189, 1134, 1079, 1067, 1055, 1104, 1154, 1160, 1166, 1134, 1102, 1142, 1181, 1160, 1138, 1117, 1096, 1078, 1060, 1114, 1168, 1180, 1193, 1205, 1218, 1164, 1109, 1102, 1179]
1804A179N8k8j7j8J6J6J6J5K8K7j5j6k4k5k4k4l6l6J0R6O8j8j17j16rP7K8K9j1j1L2L2qrq
1799A157rk3k2p1J4N4N3j3j2NNNNL3L3l9l8N7N7j5j4pon0m9m5m6K6K5J01J01K1o5o3o3O0O0
1795A222J3J3n8n8N8N9J2p4o7J8J8o8p0J7L4L4LMMMJ2J2N5N4o0o0j8j7L9L8L9L9l8l7ONl2
1790A155l3L9L8N8N7m2m3j7j6j7j7L5L5qqn8n9J3J2J1J1l2l2P0P0kko9o9N9N9M6M6LLjjjj
1785A292rrq1q0r6r6L3L2P4P3L1L1J9J9k3k4JJ%Jj7j8K5K6l1l1l1l1kklkK2K2k1k1J3J3J3
1781A113J3R0R0J9J8l7l8l7l8J5J4k9k8k1k1k0k1M2M3k9k9n4n4P4P4n3n3n3n4L8L8Q0Q1N5
1777A228N4m5m5o6o6k4k3M0M0P7P8J3p2p5J1N2Rq4q5l4N2R8R8J14K8n3n2o0n9o0n9M3M3M4
1772A160M3L1L2L2L1onj06j06o3o2k0k0P9P9QPJ6J5J8J9K7P0K8n8n5L0M4Jn4n5j4j4NNNNo
$$ y = [1179, 1237, 1209, 1192, 1174, 1190, 1206, 1222, 1237, 1265, 1292, 1277, 1261, 1237, 1212, 1188, 1164, 1128, 1092, 1102, 1198, 1266, 1248, 1131, 1015, 1006, 1083, 1111, 1140, 1129, 1118, 1150, 1182, 1174, 1165, 1157, 1148, 1125, 1103, 1032, 1046, 1100, 1153, 1140, 1128, 1133, 1138, 1143, 1148, 1181, 1214, 1175, 1137, 1194, 1251, 1236, 1222, 1215, 1209, 1159, 1110, 1065, 1019, 1045, 1070, 1171, 1272, 1293, 1228, 1165, 1102, 1162, 1222, 1235, 1248, 1190, 1132, 1190, 1249, 1261, 1187, 1120, 1138, 1156, 1088, 1018, 1035, 1069, 1103, 1106, 1110, 1114, 1118, 1130, 1142, 1197, 1251, 1191, 1131, 1113, 1096, 1135, 1173, 1212, 1251, 1213, 1176, 1182, 1187, 1155, 1122, 1161, 1199, 1257, 1314, 1272, 1229, 1212, 1196, 1179, 1162, 1197, 1232, 1224, 1216, 1158, 1099, 1112, 1124, 1135, 1146, 1114, 1082, 1152, 1222, 1220, 1218, 1149, 1080, 1139, 1198, 1244, 1290, 1293, 1296, 1295, 1294, 1293, 1292, 1283, 1274, 1193, 1113, 1017, 921, 954, 986, 1060, 1133, 1164, 1195, 1214, 1233, 1210, 1186, 1187, 1188, 1188, 1189, 1172, 1154, 1179, 1205, 1174, 1143, 1112, 1081, 1079, 1077, 1074, 1072, 1094, 1116, 1095, 1074, 1087, 1100, 1113, 1126, 1216, 1306, 1325, 1343, 1306, 1268, 1231, 1193, 1208, 1222, 1193, 1165, 1144, 1123, 1103, 1082, 1124, 1167, 1138, 1109, 1055, 1001, 1075, 1149, 1096, 1043, 990, 936, 974, 1012, 1092, 1173, 1228, 1282, 1237, 1192, 1126, 1060, 1036, 1013, 1053, 1093, 1170, 1248, 1261, 1189, 1114, 1125, 1177, 1186, 1102, 1017, 983, 1035, 1133, 1231, 1345, 1373, 1320, 1268, 1208, 1149, 1089, 1030, 1073, 1116, 1160, 1203, 1234, 1266, 1298, 1329, 1323, 1318, 1212, 1106, 1043, 981, 961, 941, 1020, 1099, 1107, 1114, 1130, 1145, 1163, 1182, 1209, 1279, 1307, 1249, 1194, 1224, 1268, 1269, 1215, 1160, 1146, 1132, 1137, 1142, 1147, 1152, 1146]
1768A146oL7L7RQQRj3j3K7K7k5o7r2nQ0P9L7n0q6m4K6O8M4m2o3o2j7j6N5N4M5M4k8k7m5m6
1763A093K6K5O5O5opJ1J0l3l3j08j09qrM7M7M7M6J0RJ0Rk9k9J4J3j0j1j0j0l5l5l5l5K0J9
1759A034K0J9O8O8l2l2j%jjLM%%o4j08o0K6J49J49P4j2k6k6l1l1m5m6m3m3P2J14O7j9j4j4
1754A218j9j9j9k0j9j9O5O6J9o7o4K2km5l7M9O5K3j7j7N2N2qrp4p4n5L0K5K5J5J5J4J5j2j2
1750A162O0N9o1o2o2o1J3J3J4J3n7n7j5j4O8O7K8K8KM5O9j7o1o1NNn5n4K0J06O5k1l4QONR
1745A178Ql8l8q1q1L5L6L6L5j1j2n5n4J6J7J10J11Q3kq3q2k3k3k3k3N1N1N1N1qpqpL4L4L5
1741A313L4m5m4kkJ9J9k4k5jkM1M2n8n8n8n8M2M1Q4Q4K0K1K6n9j27j27k9N7Q3kk0k0N5N5j1
1737A264j1K9J14M2m3r2r2LKl7l8L4L4kjjkj6j7M9N0Qp7l5N1O8O8n5n6j1j1j1j1m6m7llQR
$$ y = [1146, 1140, 1177, 1214, 1223, 1231, 1239, 1248, 1235, 1222, 1249, 1276, 1251, 1184, 1092, 1087, 1167, 1246, 1283, 1233, 1147, 1103, 1129, 1197, 1241, 1199, 1136, 1074, 1057, 1041, 1096, 1150, 1195, 1239, 1211, 1184, 1139, 1093, 1119, 1144, 1209, 1274, 1268, 1261, 1272, 1282, 1249, 1216, 1108, 999, 991, 982, 1029, 1076, 1123, 1169, 1179, 1188, 1198, 1207, 1178, 1149, 1163, 1176, 1166, 1155, 1145, 1135, 1100, 1065, 1030, 995, 1015, 1034, 1054, 1073, 1141, 1209, 1177, 1145, 1144, 1144, 1143, 1142, 1145, 1149, 1149, 1149, 1085, 977, 917, 943, 1092, 1241, 1315, 1303, 1277, 1251, 1220, 1189, 1144, 1098, 1055, 1012, 1084, 1198, 1265, 1246, 1232, 1218, 1199, 1180, 1161, 1141, 1122, 1103, 1168, 1234, 1253, 1186, 1122, 1144, 1142, 1097, 1060, 1109, 1174, 1197, 1180, 1163, 1215, 1267, 1259, 1250, 1176, 1102, 1047, 1077, 1102, 1127, 1142, 1157, 1171, 1186, 1174, 1162, 1222, 1281, 1220, 1158, 1096, 1035, 1048, 1061, 1075, 1088, 1031, 974, 959, 945, 1013, 1080, 1108, 1136, 1138, 1183, 1252, 1235, 1174, 1113, 1118, 1123, 1068, 1014, 1034, 1140, 1205, 1184, 1150, 1158, 1164, 1169, 1178, 1186, 1148, 1110, 1029, 948, 983, 1019, 1055, 1090, 1079, 1067, 1012, 958, 974, 991, 1101, 1212, 1295, 1293, 1210, 1128, 1105, 1082, 1059, 1036, 1087, 1138, 1189, 1240, 1232, 1225, 1217, 1210, 1244, 1278, 1313, 1347, 1302, 1258, 1256, 1254, 1273, 1292, 1268, 1243, 1242, 1240, 1281, 1323, 1265, 1207, 1149, 1091, 1133, 1174, 1258, 1342, 1362, 1383, 1409, 1350, 1223, 1096, 1067, 1124, 1207, 1205, 1185, 1165, 1220, 1275, 1264, 1253, 1282, 1396, 1438, 1395, 1303, 1211, 1214, 1216, 1179, 1141, 1175, 1209, 1207, 1206, 1205, 1203, 1187, 1170, 1219, 1269, 1277, 1200, 1165, 1216, 1284, 1352, 1297, 1241, 1230, 1219, 1208, 1197, 1151, 1104, 1101, 1098, 1106, 1115]
1732A115l5l4L4L4L4L5PQn8n9r7j2L9M0M3M2M3M3RJ0RJ0j2j1M2m3j30m3O0O0j2j1L1L1l7l6
1728A149N8N8Qp7l4N1J6J5n0n0k9k8O6O6nr0k5O1O8j7o4o3K1K1N9N8Mq2q1LM7M6M7M7J2p3
1723A213o7o8M6M5LLl6l6JKNq0p9NL2L2l5l4O8O8llJ6J6k6k7N8N9N8N8llm6m6K8K7K8K7l8
1718A268l7NNJ6J6J5J6L0L1m2m1K0J9J9K0n3n2j0rj8j8o0o0RJ0N2N2M4M3j04j05p9O3J02J7
1714A184l8l9K8K7l6l7POj3j3j4j3M6M7M3M4l2p5l0N5O8K5j7j6L5L6rj0o0j03n9K8R1M8PP
1710A218MMl9l9K3K3K2K3RRM7M6J0p5j23q0nnkkN8N8L7m8o9k6J6J6K4K3K1K0n1r5p8PN4J2
1705A047l0l0J8J9R0R0L4L5K9L0Kq3q5jO4K0n0n0LLm0m0K4K5K4K5J6J7J6J7N9O0j2j2k0j9
1701A295K3K4l1l0p3p2O4O5K0J9o5j08r0mP4P3Lq2q2KN1R4J01N8j5j5o1o1o1o2O8O8lmNNl9
$$ y = [1115, 1080, 1046, 1080, 1114, 1148, 1183, 1190, 1198, 1140, 1081, 984, 972, 1011, 1051, 1094, 1136, 1179, 1222, 1231, 1241, 1250, 1260, 1248, 1237, 1279, 1236, 1106, 1063, 1123, 1183, 1171, 1160, 1191, 1222, 1185, 1149, 1207, 1265, 1273, 1196, 1162, 1213, 1229, 1244, 1194, 1144, 1115, 1087, 1153, 1219, 1214, 1124, 1099, 1160, 1228, 1211, 1147, 1084, 1105, 1126, 1185, 1243, 1247, 1165, 1084, 1087, 1134, 1180, 1227, 1274, 1286, 1213, 1146, 1078, 1124, 1169, 1172, 1175, 1139, 1103, 1104, 1106, 1111, 1031, 952, 957, 989, 1021, 986, 952, 1020, 1088, 1085, 1082, 1098, 1114, 1088, 1061, 1119, 1178, 1236, 1294, 1291, 1288, 1242, 1196, 1224, 1251, 1279, 1306, 1268, 1231, 1236, 1241, 1257, 1273, 1288, 1304, 1334, 1365, 1323, 1282, 1302, 1321, 1340, 1360, 1307, 1255, 1245, 1236, 1218, 1200, 1140, 1080, 1089, 1099, 1151, 1203, 1247, 1290, 1186, 1081, 1002, 1065, 1167, 1184, 1146, 1107, 1135, 1162, 1126, 1089, 1096, 1102, 1089, 1076, 1062, 1049, 1095, 1142, 1185, 1229, 1197, 1122, 1092, 1147, 1215, 1240, 1223, 1207, 1242, 1278, 1269, 1259, 1199, 1096, 1037, 1065, 1156, 1204, 1211, 1218, 1222, 1226, 1187, 1148, 1171, 1194, 1216, 1239, 1248, 1257, 1304, 1350, 1360, 1285, 1162, 1082, 1077, 1072, 1070, 1068, 1126, 1184, 1221, 1173, 1104, 1078, 1094, 1110, 1134, 1157, 1178, 1198, 1147, 1052, 974, 981, 1035, 1047, 1017, 987, 1005, 1024, 1114, 1204, 1238, 1273, 1302, 1332, 1334, 1251, 1166, 1165, 1229, 1249, 1199, 1149, 1152, 1155, 1115, 1075, 1099, 1124, 1148, 1173, 1189, 1206, 1222, 1239, 1298, 1358, 1346, 1334, 1314, 1295, 1318, 1342, 1311, 1281, 1208, 1136, 1200, 1265, 1285, 1304, 1239, 1131, 1041, 1037, 1111, 1184, 1187, 1105, 1023, 1025, 1076, 1170, 1271, 1329, 1314, 1299, 1238, 1177, 1116, 1054, 1122, 1190, 1187, 1183, 1188, 1193, 1154]
1696A154l8O5O6K2K3J1J2J4J5j3L0M9k2o2j9K0k4j12j13m6N5P9L6l3l3J4J3k9p1l2L9R3M9
1692A212m2m2kM1Ro3n9J1O3O4l2l2QRRRklM1M0O5O6q8q7k8M2K7j7%%llN7N8J4J4KKKJrrq1
1687A264q1j5j6j5j6k4k3j9j9K4R6Q0L7kkm7m7j%jjllO9O8oop6j19r9%P1P0M1M1l1l0l9l8
1682A082MM%JP2P2j7j7o0n9N6N7L8m7q1NN1N1o7o7m6m6J5J5n7n6L8L9L8L8L1L1L1L1OONOL8
1677A241L9L8L8rqqqk4k3k4k3qpQ7Q7Lq2p2p2m9L7L2L1llM0M0p4p5l2l1K1K2%Jm7m7mmK3K4
1672A067M5M5j8j8K4K5K0K0m6m6m1M5O8O8j7j7N0M9J9o6o1o1M1M0O2O2l0l1l0l0q2q1j0j0
1668A055J5J5L7L7j6j5k6N9J21L5o3o4K6J11L9m6o0o0j8j7p6RQ5Q4K3o3j5j4K8K8o6o6q7j
1664A034P9Q0l2l1qP8M0M0k6k6mmL9L9k6k5nmL7L7n8n7r1oJ8J8o7o7N7N6J3p2k9N6N1N0j6
$$ y = [1154, 1116, 1181, 1247, 1269, 1292, 1303, 1315, 1329, 1344, 1331, 1361, 1410, 1388, 1326, 1307, 1327, 1303, 1191, 1078, 1032, 1087, 1166, 1202, 1169, 1136, 1150, 1163, 1134, 1063, 1031, 1070, 1163, 1212, 1170, 1128, 1126, 1167, 1176, 1113, 1054, 1065, 1128, 1192, 1160, 1128, 1136, 1145, 1154, 1163, 1161, 1158, 1199, 1239, 1304, 1370, 1282, 1195, 1167, 1209, 1236, 1219, 1219, 1219, 1216, 1213, 1270, 1328, 1342, 1356, 1358, 1360, 1362, 1363, 1354, 1345, 1264, 1183, 1168, 1152, 1137, 1121, 1097, 1074, 1055, 1036, 1060, 1156, 1236, 1273, 1271, 1269, 1222, 1175, 1174, 1174, 1173, 1172, 1169, 1166, 1235, 1303, 1297, 1291, 1215, 1096, 997, 997, 1068, 1138, 1179, 1220, 1189, 1159, 1120, 1082, 1086, 1090, 1090, 1091, 1163, 1235, 1218, 1201, 1141, 1082, 1138, 1195, 1233, 1186, 1105, 1110, 1161, 1212, 1145, 1078, 1032, 986, 1001, 1016, 959, 903, 941, 980, 1018, 1056, 1087, 1118, 1149, 1180, 1186, 1192, 1197, 1203, 1241, 1280, 1318, 1356, 1347, 1339, 1331, 1323, 1299, 1276, 1252, 1229, 1221, 1214, 1301, 1388, 1391, 1309, 1237, 1165, 1116, 1153, 1185, 1216, 1213, 1210, 1250, 1290, 1216, 1141, 1109, 1078, 1099, 1121, 1121, 1122, 1075, 1028, 1024, 1020, 1043, 1067, 1112, 1157, 1139, 1121, 1145, 1170, 1190, 1210, 1164, 1118, 1077, 1122, 1190, 1258, 1241, 1224, 1274, 1323, 1342, 1276, 1215, 1154, 1195, 1235, 1297, 1359, 1329, 1298, 1268, 1238, 1156, 1075, 1065, 1055, 1070, 1085, 1122, 1159, 1143, 1128, 1102, 1161, 1282, 1317, 1254, 1190, 1216, 1327, 1366, 1320, 1260, 1200, 1182, 1165, 1089, 1098, 1183, 1267, 1290, 1227, 1212, 1198, 1226, 1254, 1188, 1122, 1035, 1034, 1113, 1193, 1161, 1130, 1122, 1200, 1240, 1280, 1254, 1228, 1224, 1220, 1259, 1298, 1272, 1247, 1242, 1238, 1275, 1312, 1254, 1197, 1106, 1100, 1118, 1136, 1069, 1002, 1059, 1115, 1128, 1056, 1027, 1083, 1134, 1184, 1168]
1659A168j5J6J7N9N9j8j7k9N7N5l0m8m8K6K7j6j6POPOOOM9M9m8m9n3L2N1N2p2p1n0n0K1K1
1655A167j4j5N2N1L6n0r3pK9L0l7l6MNo2o1%Q5Q1Q0J6J6k6k7k3k3K0K0N0N0N6l0j03j04qr
1650A120m2m3m2m3M4M5M1M2nm8k3M8O4K1k1k1N6N6J4J3K8K7P0O9llm6m6k0k1o3o3NMM8M7K8
1646A337K8m3m4n1n0K1K0O8O8mmr1r1o0J1N5N5N9O0NOl7l7PPPQj1j1j1j0N3N3j8j8p0o9k9
1641A169P1J18P4n2n1J0J1l3l2mmmmP0P0k7k7ON0%p0p0K9P0O9k6k6o7o6J2N5K1q0q9j9L6L5
1637A225KJKJmnO7O7j9k0k0j9j3j3j6j6pn1o6NO6O6l3j19k7N8R5J0L1L1K6K5J%J%n1n2K0K0
1632A269l1l1l1l0J5J5J6J5M2M2%jN8N8O3k2l4l5LKl0l1J3J2l5l5l0k9n8K7P9Q0jjjjjjL6
1627A376L6L4n2m6m7j3j4K9K9N8N8N9N8jkp3p2m4m3m3m4qrqrR0R1M7M8n1n1n1n1O6O5K0o6
$$ y = [1168, 1153, 1169, 1186, 1245, 1304, 1286, 1269, 1240, 1297, 1352, 1322, 1274, 1226, 1252, 1279, 1263, 1247, 1254, 1260, 1267, 1273, 1279, 1285, 1334, 1383, 1335, 1286, 1233, 1265, 1316, 1368, 1296, 1225, 1175, 1125, 1146, 1167, 1153, 1138, 1190, 1241, 1277, 1227, 1134, 1127, 1156, 1186, 1149, 1113, 1117, 1122, 1060, 999, 999, 1084, 1165, 1245, 1261, 1277, 1251, 1224, 1201, 1178, 1198, 1218, 1268, 1318, 1374, 1344, 1241, 1137, 1129, 1120, 1078, 1035, 993, 950, 994, 1039, 1080, 1122, 1117, 1069, 1046, 1094, 1158, 1179, 1158, 1137, 1193, 1249, 1263, 1276, 1304, 1331, 1401, 1470, 1467, 1464, 1418, 1372, 1352, 1331, 1268, 1205, 1210, 1214, 1262, 1309, 1337, 1365, 1322, 1278, 1227, 1177, 1198, 1218, 1286, 1354, 1350, 1346, 1255, 1164, 1104, 1115, 1170, 1225, 1284, 1344, 1349, 1355, 1318, 1281, 1288, 1295, 1302, 1310, 1299, 1288, 1277, 1267, 1320, 1373, 1355, 1337, 1267, 1198, 1169, 1240, 1358, 1432, 1380, 1329, 1339, 1350, 1317, 1285, 1281, 1277, 1273, 1269, 1339, 1409, 1382, 1355, 1361, 1411, 1411, 1341, 1271, 1300, 1370, 1439, 1413, 1387, 1320, 1254, 1266, 1321, 1342, 1262, 1173, 1154, 1190, 1225, 1227, 1228, 1230, 1231, 1227, 1222, 1289, 1356, 1337, 1317, 1297, 1278, 1265, 1252, 1236, 1220, 1213, 1162, 1096, 1101, 1167, 1233, 1200, 1081, 1054, 1112, 1207, 1217, 1248, 1279, 1305, 1330, 1331, 1331, 1332, 1332, 1281, 1229, 1249, 1269, 1238, 1207, 1176, 1146, 1161, 1176, 1192, 1207, 1249, 1291, 1291, 1290, 1348, 1406, 1469, 1447, 1413, 1378, 1381, 1383, 1353, 1322, 1335, 1347, 1312, 1277, 1247, 1218, 1160, 1187, 1266, 1346, 1345, 1344, 1343, 1342, 1341, 1340, 1376, 1412, 1446, 1394, 1348, 1301, 1288, 1274, 1303, 1332, 1390, 1448, 1507, 1565, 1564, 1562, 1489, 1417, 1373, 1330, 1287, 1243, 1235, 1226, 1218, 1209, 1299, 1390, 1437, 1485, 1434, 1383, 1332, 1281, 1347, 1412, 1432, 1366]
1623A366j11k5N1N0j3j2j2j2J3J4J3J4r4r5k3k3L4L3L4L3N3N2j9j9q0q0K0K0L9L8J10J10Q4
1619A563Q4J00J00j8j05j50o4n0r2j10k5K8K9qrlkJ6J6j9o3o5K1P0O9k5k4j8j7l3l4RR4P5
1614A340j0j9K4L7L7rrj0rm0m1N9O0L1L2rrM1Q3Q9Lo2j9J03J47P6o7q5m2p1j57j33m8L3L2
1610A378nnN0N1m7m7pL6K0o6j14p0QR5P5P6OPl4p6n8K8N0N0J3J2M8M8k4k4p2p2l0k9nnk7k6
1605A208nnL8L8M5M4K4K3LLj8j9m0m1L0P3K7n9n4j1ppm7m7L3L3mnK9J14J06O4j6j02j25m0
1601A283M5M6Mq1o1K4J4J4L6L5L6L6m8m8nmQQj3j3nnk7k6m0m1O0N9N1N0PQj8j9N3R5L3n3r8
1596A400n4qqm3m2oP9P4P4LKLKj3j3n5n6n1n2K0K0O3O4qqK1K1K0K1m4m4K7K7j5j4LQ9P3j2
1592A560l1l0j7j6n8n9RRN1N2O6O6K4K3N6N5l9l9K9J15J09J10J20J21R7J2o0o1m4m4j21j21
$$ y = [1366, 1255, 1230, 1281, 1331, 1318, 1306, 1294, 1282, 1295, 1309, 1322, 1336, 1242, 1147, 1124, 1101, 1135, 1168, 1202, 1235, 1288, 1340, 1321, 1302, 1222, 1142, 1162, 1182, 1221, 1259, 1369, 1479, 1563, 1647, 1747, 1847, 1829, 1724, 1574, 1510, 1460, 1368, 1258, 1233, 1261, 1290, 1282, 1273, 1270, 1268, 1284, 1300, 1281, 1218, 1153, 1174, 1244, 1313, 1288, 1264, 1246, 1229, 1196, 1162, 1171, 1265, 1340, 1330, 1311, 1335, 1372, 1409, 1400, 1391, 1381, 1372, 1332, 1291, 1350, 1410, 1441, 1473, 1464, 1455, 1496, 1579, 1668, 1671, 1609, 1590, 1693, 1840, 1916, 1849, 1764, 1722, 1651, 1494, 1361, 1313, 1346, 1378, 1373, 1368, 1418, 1469, 1422, 1375, 1368, 1404, 1424, 1358, 1244, 1174, 1182, 1277, 1352, 1428, 1434, 1441, 1407, 1331, 1273, 1301, 1351, 1401, 1414, 1426, 1474, 1522, 1498, 1474, 1402, 1330, 1300, 1271, 1266, 1261, 1234, 1208, 1203, 1198, 1236, 1274, 1319, 1363, 1387, 1410, 1413, 1416, 1398, 1379, 1339, 1298, 1328, 1401, 1428, 1369, 1315, 1304, 1297, 1290, 1243, 1196, 1229, 1262, 1258, 1253, 1282, 1396, 1502, 1566, 1550, 1448, 1323, 1283, 1328, 1374, 1378, 1297, 1236, 1260, 1274, 1288, 1324, 1359, 1395, 1431, 1383, 1335, 1330, 1326, 1334, 1342, 1329, 1316, 1311, 1306, 1279, 1253, 1213, 1172, 1232, 1291, 1342, 1392, 1399, 1407, 1389, 1370, 1423, 1518, 1551, 1498, 1400, 1346, 1338, 1330, 1287, 1245, 1239, 1318, 1392, 1466, 1469, 1471, 1474, 1476, 1463, 1450, 1395, 1339, 1288, 1236, 1256, 1276, 1339, 1403, 1395, 1387, 1408, 1429, 1449, 1470, 1426, 1382, 1409, 1436, 1421, 1407, 1410, 1499, 1572, 1560, 1529, 1499, 1482, 1466, 1408, 1349, 1358, 1367, 1418, 1470, 1536, 1602, 1626, 1649, 1705, 1760, 1721, 1682, 1711, 1826, 1935, 2045, 2165, 2286, 2383, 2395, 2335, 2274, 2230, 2186, 2065, 1944]
1588A944j37j37j01j5Pl7o7k4K0K1o6o6ONKKKKj3j3j6j6j0n2qP8J23Q1j8j8m0m1m0m1J5J5
1583A347J4J5oonok3k2K0O2K1o4j07k2P2K8p1p0PQJ1J0O2J04L2n4l9Mkm4k7k6J3J4N7N7O6
1579A430k0k0K4O1J8n7n7j7j6j9j8K5K4L5L6L5L5k8k9k8k9OPOOm1m1KJJ4J4J5J4L4L5qqqp
1574A426p8p9K3K3j5j5N9J44N0l6o6K0M0M0L6P9O0k6j16j17L6L5NNl8l8l6l7L5L5J4J4n7n7
1570A368N2N2N2N1l3l3j04j04j1j0O1O1K7K6p4p3onnoK4K3k0j9L1L2L2L1J7J6n4n5m4m5Q5
1566A340Q4RRN2N2K2K1p8p9kkM1M1M8M7k4k3mllmj4j4K9K9p3p3l0l0M5M5M5M5J1J1J1J1p4
1561A518p4l1l1LLM6M6j5j6j5j5J7J8k5k5M1M2l0l0%%P2P2M9M8n1n1J5J5N7N8K4K3j9j9m7
1556A673m6m2m1o4K2R8N5o3o2L1L2%m4jQ4J04J8k8k9rj0rrj5j5q6q6kkjkL7L6l4p6J2R7R8
$$ y = [1944, 1807, 1670, 1569, 1554, 1561, 1524, 1457, 1433, 1453, 1474, 1408, 1342, 1348, 1353, 1355, 1357, 1359, 1361, 1348, 1335, 1319, 1303, 1293, 1241, 1233, 1311, 1434, 1515, 1497, 1479, 1439, 1398, 1358, 1317, 1332, 1347, 1361, 1376, 1370, 1364, 1359, 1353, 1330, 1308, 1328, 1390, 1411, 1347, 1240, 1218, 1290, 1318, 1247, 1177, 1184, 1192, 1203, 1213, 1275, 1379, 1411, 1357, 1318, 1322, 1320, 1276, 1249, 1223, 1236, 1250, 1307, 1364, 1430, 1410, 1390, 1414, 1475, 1493, 1436, 1379, 1362, 1346, 1327, 1309, 1334, 1358, 1393, 1429, 1464, 1499, 1471, 1442, 1414, 1385, 1391, 1398, 1404, 1410, 1369, 1328, 1330, 1331, 1345, 1359, 1374, 1388, 1422, 1457, 1449, 1441, 1433, 1426, 1348, 1269, 1292, 1315, 1300, 1285, 1344, 1488, 1538, 1502, 1436, 1456, 1496, 1536, 1572, 1651, 1711, 1685, 1569, 1452, 1488, 1523, 1528, 1533, 1495, 1457, 1421, 1384, 1419, 1454, 1468, 1482, 1425, 1368, 1420, 1472, 1524, 1575, 1542, 1509, 1405, 1301, 1290, 1280, 1341, 1402, 1429, 1455, 1381, 1308, 1302, 1297, 1292, 1286, 1310, 1333, 1313, 1294, 1325, 1357, 1389, 1420, 1437, 1453, 1399, 1344, 1300, 1255, 1340, 1424, 1433, 1442, 1494, 1546, 1568, 1589, 1511, 1432, 1430, 1428, 1469, 1510, 1558, 1605, 1581, 1558, 1554, 1551, 1548, 1544, 1530, 1516, 1545, 1574, 1501, 1428, 1398, 1368, 1413, 1458, 1503, 1548, 1559, 1570, 1581, 1592, 1518, 1444, 1413, 1382, 1385, 1388, 1434, 1480, 1465, 1449, 1434, 1419, 1436, 1454, 1429, 1404, 1445, 1487, 1457, 1427, 1427, 1427, 1499, 1571, 1620, 1668, 1617, 1566, 1581, 1596, 1653, 1711, 1735, 1758, 1739, 1720, 1673, 1627, 1585, 1544, 1480, 1502, 1600, 1655, 1592, 1530, 1561, 1593, 1593, 1549, 1548, 1632, 1736, 1754, 1726, 1697, 1688, 1678, 1669, 1660, 1645, 1630, 1544, 1458, 1456, 1454, 1453, 1451, 1488, 1524, 1490, 1414, 1426, 1523, 1621]
1552A621J2j6K7M9l7q8m4N4N5j5j5j5j5J6J6J6J6JJJJk7k7J5J6j7j7j6j7j3j4K9L0k2k1o5
1547A475o4m1m1MMM4Q6J11K4m4m5jQ5M5LQN1P3P3nr0r0q9k4k3LMM7M6JJJ4N7K7n8j03o1J9
1543A526J9k1k1J6J6k6o9n0L6N2RJ1J1RQj3j4N8N7M3M3L0j3o2K4R5N2o8j10m0M6O7K3j4K9
1538A759L4L3nm9m0M5Q9Q9j6j01l3N3P5L2L2P5P5j1o1o0l0l0l0l0L2L3j1j0m0m0m0m0K0K1
1534A820K1K1K1K0K1K1k5k6k5k6N1N0N1N0J00R9N1l6q3m1L0L0m5m5kkJ6J7J6J7M1M2KKM2Q5
1530B381J11K6j8K5R5R5J7J7J6J7P0O9P0O9P0O9P0O9llmlJ7J7J7J7Q1Q0RJ0L5L6P6P6Q5M2
1526C923J6J01J73J30N7l0RR4Q3Q4J12J12M0M1K1K0J21J20J82J82J82J82J20J19J92J91J61
1522F738J62J85K70K88K87J74J73J71L15M51N37N21M35M60O03P12Q54R58J043J129J272J486
$$ y = [1621, 1633, 1617, 1644, 1693, 1656, 1568, 1524, 1578, 1633, 1618, 1603, 1588, 1573, 1589, 1605, 1621, 1637, 1638, 1639, 1640, 1641, 1614, 1587, 1602, 1618, 1601, 1584, 1568, 1551, 1538, 1524, 1553, 1583, 1561, 1540, 1475, 1411, 1370, 1329, 1333, 1337, 1381, 1467, 1578, 1602, 1558, 1513, 1512, 1597, 1642, 1645, 1653, 1704, 1777, 1850, 1845, 1755, 1665, 1576, 1552, 1529, 1532, 1536, 1583, 1629, 1630, 1631, 1645, 1702, 1729, 1671, 1568, 1507, 1526, 1545, 1524, 1503, 1519, 1535, 1509, 1440, 1390, 1426, 1478, 1487, 1498, 1509, 1518, 1526, 1513, 1499, 1557, 1614, 1657, 1700, 1730, 1717, 1655, 1679, 1774, 1826, 1758, 1648, 1608, 1654, 1721, 1744, 1730, 1759, 1793, 1826, 1821, 1772, 1732, 1777, 1866, 1955, 1939, 1838, 1805, 1858, 1933, 1965, 1997, 2072, 2147, 2136, 2075, 2015, 1985, 1955, 1925, 1895, 1927, 1960, 1949, 1939, 1899, 1859, 1819, 1779, 1799, 1820, 1841, 1862, 1883, 1903, 1924, 1945, 1920, 1894, 1869, 1843, 1894, 1944, 1995, 2045, 2145, 2244, 2295, 2259, 2176, 2135, 2165, 2195, 2150, 2105, 2103, 2101, 2117, 2134, 2150, 2167, 2208, 2250, 2252, 2254, 2296, 2381, 2492, 2518, 2500, 2525, 2620, 2715, 2732, 2749, 2765, 2782, 2852, 2921, 2991, 3060, 3130, 3199, 3269, 3338, 3335, 3332, 3328, 3325, 3342, 3359, 3376, 3393, 3474, 3554, 3563, 3573, 3608, 3644, 3720, 3796, 3881, 3923, 3939, 4040, 4213, 4343, 4400, 4370, 4379, 4473, 4556, 4640, 4752, 4864, 4904, 4945, 4966, 4986, 5107, 5227, 5409, 5591, 5773, 5955, 6075, 6194, 6386, 6577, 6738, 6900, 7085, 7355, 7643, 7930, 8104, 8277, 8448, 8763, 9214, 9751, 10272, 10707, 11167, 11770, 12482, 13336, 14294, 15337, 16466, 17738, 19224]
1520A9224J857K240K669L025L453L901M386M964N735O669P840R220J1076J3511J6623K0300
1518A36693K4439K8299K9299K4007J0622q284k6121l6531l7530l1879k4202j7545j2778r514
1516D8975p144n389m105l138k424j875j390j042p86n93l35p4O9q8m59j016j501j760j760j437
1513A2728j123r07p08n94n08m63l78k76k75k65k65k24j39j77k62k04j18j01j00j63j62l3l4
1511E249j28j28j11k5j5j02r1r0o7o7j38j38k5k6k5k5nnnnq1q2q2q1o4o4o3o4%J%%p0p0k8
1506C280k7l3l2l3l3m6m6llrrn2n1J4J4k8k9l2l2p5p5J5J4J4J5MLMMK2K2K1K2k5k5k5k5m3
1502B677m2m3m3j1j2j2j1o4o3L7L6k8k8j1P5P0j6nnP4P3k6k6j8j8j8j9K1K0p5p4l3N2N2l3
1497B453m9m9M5M6Q2Q2J24J25J53J52L3L3L3J76K80K81L39L39M00M85N41O83Q65J065J082
$$ y = [19224, 21081, 23321, 25990, 29015, 32468, 36369, 40755, 45719, 51454, 58123, 65963, 75183, 86259, 99770, 116393, 136693, 161132, 189431, 218730, 242737, 253359, 245075, 218954, 182423, 144893, 113014, 88812, 71267, 58489, 48975, 41831, 36442, 32337, 29199, 26775, 24900, 23510, 22468, 21682, 21089, 20754, 20680, 20749, 20661, 20202, 19186, 17685, 15925, 14165, 12728, 11605, 10698, 9990, 9396, 8888, 8425, 8047, 7771, 7496, 7231, 6966, 6742, 6603, 6426, 6164, 5960, 5842, 5741, 5641, 5478, 5316, 5283, 5249, 5121, 4993, 4882, 4857, 4842, 4740, 4649, 4559, 4492, 4425, 4287, 4149, 4124, 4098, 4073, 4048, 4043, 4038, 4033, 4028, 3947, 3865, 3783, 3702, 3638, 3574, 3511, 3447, 3447, 3448, 3448, 3448, 3378, 3308, 3280, 3253, 3220, 3188, 3155, 3122, 3076, 3030, 3027, 3024, 3015, 3006, 2954, 2903, 2917, 2931, 2903, 2874, 2842, 2810, 2735, 2660, 2675, 2689, 2703, 2718, 2722, 2725, 2729, 2733, 2755, 2777, 2798, 2820, 2795, 2770, 2745, 2720, 2677, 2635, 2592, 2549, 2538, 2526, 2514, 2503, 2439, 2376, 2413, 2449, 2421, 2393, 2382, 2457, 2527, 2511, 2506, 2501, 2575, 2648, 2622, 2596, 2578, 2560, 2542, 2523, 2544, 2564, 2489, 2415, 2382, 2434, 2486, 2453, 2404, 2355, 2400, 2446, 2528, 2610, 2734, 2859, 3012, 3164, 3197, 3230, 3263, 3439, 3719, 4000, 4339, 4678, 5078, 5563, 6104, 6787, 7652, 8717, 9799]
1494I799Q25J62o10j240j440j320j062p65n08l50k66j62p6m8m8r3r3L5L5n4n5n5n5r2r1m9
1491B324m9m0l9m0m0p3p2N1N0J1p6l7M8P1j4n8K9J01J5j12j12m9L5j2j3JJP2P3R2R1J2p4q2
1487B085q2L6L5J1p5p5J1N0N0J2J3K8K8K8K8P3P4n5n5kkr7r6q2Lkkj4j5Q0Q0Q8Mp8p7K3K4
1482B055m3m3K8J13J13K8j8j8K0J9klR2R2N0l6l0l0j1j0n3n4n7n7j5j4o6o5k2k3J7J6J7J6
1478B006q1q0M3M3K0n2p8l6K4K4j6j6l2l2l2l3N5N4N0N0J1o1m5kLLo5o6o1o1J0J1J9J9K0J9
1474A635QPQPL8L8nnkkp3p3opL7L6l0k9l0l0P4P3LKk8k8k8k8J08J08M9k3l1l2l6l6J1J1J1
1469A702J1m2m3m2m3j5j6K7K7PPl6l6RQRRk4k3k3k3M0M0J3n8p5lQ2J25J20P7k9p2o2o1p9j21
1465A387q1j0J9J9K9L0L0L0LLLLK6K6k9j00q2j1P4P3KJo4o5n3L1Q4Q4Q4Q4J0p6q2NN0N1rr
$$ y = [9799, 10624, 10786, 10176, 8936, 7496, 6176, 5114, 4349, 3841, 3491, 3225, 3063, 2987, 2939, 2891, 2798, 2705, 2740, 2775, 2721, 2666, 2611, 2556, 2464, 2373, 2324, 2275, 2235, 2196, 2156, 2116, 2043, 1971, 2022, 2072, 2083, 2007, 1970, 2018, 2089, 2075, 2017, 2046, 2147, 2162, 2050, 1938, 1889, 1924, 1912, 1899, 1900, 1901, 1973, 2046, 2138, 2229, 2241, 2167, 2085, 2003, 2039, 2074, 2085, 2010, 1935, 1946, 1996, 2046, 2058, 2071, 2099, 2127, 2155, 2183, 2256, 2330, 2275, 2220, 2218, 2216, 2119, 2023, 1941, 1944, 1942, 1940, 1926, 1911, 1991, 2071, 2159, 2163, 2085, 2008, 2031, 2055, 2012, 1969, 1997, 2110, 2223, 2251, 2233, 2215, 2235, 2254, 2252, 2249, 2341, 2433, 2483, 2447, 2417, 2387, 2376, 2366, 2313, 2259, 2202, 2145, 2130, 2116, 2050, 1985, 1963, 1940, 1957, 1973, 1990, 2006, 1925, 1845, 1888, 1931, 1951, 1899, 1821, 1785, 1809, 1833, 1817, 1801, 1769, 1737, 1705, 1672, 1727, 1781, 1831, 1881, 1892, 1831, 1786, 1784, 1787, 1790, 1725, 1659, 1598, 1537, 1547, 1558, 1577, 1596, 1616, 1635, 1643, 1650, 1658, 1665, 1703, 1741, 1736, 1731, 1729, 1727, 1654, 1581, 1575, 1568, 1605, 1641, 1611, 1582, 1552, 1522, 1596, 1669, 1672, 1674, 1646, 1618, 1590, 1562, 1670, 1778, 1827, 1804, 1773, 1741, 1705, 1669, 1680, 1691, 1702, 1713, 1671, 1628, 1586, 1543, 1528, 1512, 1539, 1566, 1573, 1580, 1544, 1508, 1517, 1525, 1534, 1543, 1519, 1496, 1473, 1450, 1490, 1530, 1543, 1485, 1410, 1407, 1489, 1614, 1734, 1811, 1782, 1710, 1648, 1587, 1508, 1387, 1306, 1296, 1315, 1334, 1363, 1393, 1423, 1453, 1456, 1459, 1462, 1465, 1491, 1517, 1488, 1388, 1306, 1295, 1369, 1442, 1444, 1445, 1381, 1316, 1263, 1294, 1378, 1462, 1546, 1630, 1640, 1564, 1482, 1487, 1537, 1588, 1579, 1570]
1460A570n2n2qrqqo9o9k6k6noO1O0O0k6m9m9O9O9M6m0m3m2K3K4L5L5L5L5L0L0m1m2J2J2M4
1455A580m2p9ON3N3j5j4l1l1m7L8O2O2m6m5M8M9l4j20p8RK4K4l6l6l0N6J31J31O2k4j9j9M4
1451A686M4JKm2m2N9N8N7N6p2p2n2n2M7M8%Jm3m2%%M4M3j8j8o1o1QQN1N1j7j7l9l8j9j8K4
1447A565K5R0R0R6J0r5r5n3R1J14J15K4K3O4O4J07J06Q9Q8Q8Q8J64J64J93N0j35k79k97k12
1443B342j11j10l4l4l7l7%%m1j26j27m1M2M2M7M7L4L5o6o5q3q2l1N5J6J6p4p4m6L9O2O2m4
1439A576m3k0O6O6O5%%L7L8o3o2k6k5M6M6K2K2k0k0m1m1o2o2k7k8k8k8K9K9K9K8mlJ7J8M8
1435A579M9NOl0l1n1n2ppJ4J4ooO6O5l3l3j1j2J4J3qqlmL4L4K5o1q2q1L7P9L6n1j23q1J8J8
1430A325j0j0O1O2MLM7M6K7K7k4J8%q6q4KO4O4n8j01m2M5O0J8poO2O2j4j5OPj9j9o1o2N6N5
$$ y = [1570, 1518, 1466, 1458, 1449, 1441, 1433, 1364, 1295, 1269, 1243, 1238, 1232, 1293, 1353, 1413, 1387, 1338, 1289, 1358, 1427, 1473, 1433, 1390, 1348, 1371, 1395, 1430, 1465, 1500, 1535, 1565, 1595, 1554, 1512, 1524, 1536, 1580, 1538, 1459, 1465, 1518, 1571, 1556, 1542, 1511, 1480, 1433, 1471, 1533, 1595, 1549, 1504, 1552, 1601, 1567, 1447, 1369, 1378, 1402, 1426, 1390, 1354, 1324, 1380, 1511, 1642, 1704, 1680, 1661, 1642, 1686, 1730, 1731, 1733, 1691, 1649, 1708, 1766, 1823, 1879, 1807, 1735, 1683, 1631, 1678, 1726, 1726, 1727, 1684, 1642, 1642, 1642, 1686, 1729, 1711, 1693, 1632, 1571, 1579, 1587, 1638, 1689, 1672, 1655, 1616, 1578, 1559, 1541, 1565, 1590, 1680, 1770, 1866, 1876, 1781, 1686, 1633, 1724, 1838, 1953, 1977, 2000, 2064, 2128, 2235, 2341, 2430, 2518, 2606, 2694, 2858, 3022, 3215, 3265, 3130, 2851, 2554, 2342, 2231, 2121, 2087, 2053, 2016, 1979, 1979, 1979, 1938, 1812, 1685, 1644, 1686, 1728, 1775, 1822, 1856, 1891, 1825, 1760, 1677, 1595, 1564, 1619, 1635, 1651, 1577, 1503, 1457, 1496, 1558, 1620, 1576, 1533, 1513, 1579, 1645, 1710, 1710, 1710, 1747, 1785, 1722, 1660, 1634, 1609, 1655, 1701, 1723, 1745, 1725, 1705, 1664, 1623, 1561, 1499, 1472, 1444, 1416, 1388, 1417, 1446, 1475, 1503, 1499, 1496, 1513, 1531, 1579, 1628, 1633, 1639, 1609, 1578, 1527, 1475, 1468, 1461, 1475, 1489, 1483, 1477, 1543, 1608, 1575, 1542, 1531, 1519, 1533, 1546, 1538, 1530, 1527, 1523, 1557, 1591, 1616, 1555, 1473, 1392, 1429, 1508, 1544, 1493, 1370, 1289, 1307, 1325, 1315, 1305, 1366, 1428, 1432, 1435, 1482, 1528, 1555, 1582, 1558, 1576, 1576, 1490, 1406, 1408, 1472, 1536, 1478, 1377, 1335, 1380, 1440, 1458, 1451, 1445, 1507, 1569, 1555, 1540, 1546, 1553, 1534, 1515, 1454, 1392, 1448, 1503]
1425A503N6N5M3M3k9k8NNl6q0p5J1K9j3jM1O3k3p1p1n0n0k0O4J05K0q0j22k4O3L6L6Q4J26
1421A615N1l5l8M7K9n6j51o6N8N8qql7l7j6j5P0P1jjl5l5l5l5L6L7J27J28O6p6j49j06k7k7
1417A399k5k4L3L2L3L3onm9m8M8M9K7K7m1m1m0m1j7j7N4N4N0N0NMm1q4l9M6R0M7n1r4l0N6
1413A444M8M8J9J9k3k4JJK2K2K5K6MML0K9j0j1m8nLq3j00j4Q4Q4K0o6o3k1J3J3k7k7l5l5O5
1408A432O4K9L0P1P2O6O6l3l4m6m5lkK0K0K0K0j9j9K4K3k5k6k5k6K4K4K3K4j2j2j2j2l4l4
1404A633L7L7NMMMJ5J5ppL2L2o8o8k1k1JJk5k5M6M6l2l2l1l2J4J3J4J4K7K8K7K7PPM9N0q2
1399A738q1n8K7O0O0poJ5J6n1n1l2N4J6o9q2MJ07J07K7K6j6j6K1K1Q7Q7lq8q3q3m7m7k6k6
1395A601N0N0N0M9m0m1KKm7m7m8m7MMJ27J26P9ql1l0m9m8n4L2M7M7J0J0L8L8mnqpL5L5K3K3
$$ y = [1503, 1559, 1614, 1657, 1700, 1671, 1643, 1648, 1653, 1617, 1537, 1462, 1473, 1502, 1489, 1488, 1529, 1592, 1569, 1498, 1427, 1377, 1327, 1307, 1371, 1476, 1496, 1416, 1294, 1270, 1333, 1369, 1405, 1489, 1615, 1666, 1631, 1593, 1640, 1669, 1613, 1462, 1396, 1454, 1512, 1504, 1496, 1459, 1422, 1406, 1391, 1461, 1532, 1531, 1530, 1495, 1460, 1425, 1390, 1426, 1463, 1590, 1718, 1784, 1708, 1559, 1453, 1426, 1399, 1374, 1350, 1383, 1415, 1448, 1481, 1475, 1470, 1421, 1373, 1421, 1470, 1497, 1524, 1483, 1442, 1402, 1361, 1344, 1327, 1381, 1435, 1485, 1535, 1540, 1544, 1503, 1419, 1380, 1426, 1516, 1563, 1512, 1418, 1388, 1444, 1492, 1540, 1559, 1578, 1555, 1531, 1532, 1533, 1555, 1577, 1602, 1628, 1632, 1636, 1666, 1695, 1685, 1674, 1626, 1621, 1624, 1541, 1441, 1427, 1511, 1595, 1615, 1549, 1486, 1465, 1478, 1491, 1464, 1437, 1402, 1367, 1432, 1496, 1525, 1555, 1626, 1698, 1764, 1830, 1797, 1763, 1717, 1672, 1669, 1667, 1687, 1707, 1727, 1747, 1728, 1709, 1733, 1756, 1731, 1705, 1680, 1654, 1678, 1702, 1725, 1749, 1737, 1725, 1713, 1701, 1667, 1633, 1670, 1707, 1712, 1716, 1720, 1724, 1739, 1754, 1747, 1740, 1772, 1804, 1736, 1668, 1647, 1626, 1627, 1628, 1603, 1578, 1624, 1670, 1638, 1606, 1575, 1543, 1557, 1570, 1584, 1598, 1625, 1653, 1680, 1707, 1714, 1721, 1770, 1820, 1738, 1657, 1599, 1626, 1686, 1746, 1739, 1733, 1748, 1764, 1713, 1662, 1630, 1684, 1700, 1631, 1549, 1553, 1660, 1767, 1794, 1820, 1804, 1788, 1809, 1830, 1917, 2004, 2001, 1913, 1830, 1747, 1700, 1653, 1627, 1601, 1651, 1701, 1751, 1800, 1760, 1719, 1721, 1723, 1676, 1629, 1581, 1534, 1538, 1542, 1669, 1795, 1874, 1866, 1835, 1805, 1756, 1708, 1654, 1686, 1733, 1780, 1790, 1800, 1838, 1876, 1872, 1867, 1859, 1852, 1887, 1922, 1945, 1968]
1390A968k0k0j1j1J0J0j4j4j4j5N1N1k0k0J3J3k5k4MR0J12K5q0q0m2m2M5M5KKMMM7M7k2k2
1386B047N0N0J7J8lmm2m2K9L0J8J8k5k5l8l9L2P5L2n4p3J3R2R3J7o8n1n0j3j4m7m8k7N9P4
1381B101L1j1j1J6J7k7k6J6J5L8L7N3N3j9j8j5j4K8K9O0O0J8J8q8q8o7o7K7K7R9R8MNl9l8
1377B322l1l0J3J2L0L0K9L0M3M3J%M1M1lkk3k3o5o6J2J2J2J1M3M3k9k8rqL4L4M0M0J8J8l2
1373B603l2l2l2MLM7M6M3M4JJM8M8ONPOOPm6m6K5K5P8P8L6L5p0o9RR4Q3M1K5O8N8N9o7o8R
1368C186RN2N2QRl4l5M2M1jjP8P8P7P8N8N7J5J4JJP2P2P2P2k8k8m8m8K3K3Q2Q2J1J1m4m3K8
1363D094K8P3P2P3P3K4K4K4K4m3m3N7N7R2R2R2R2qqL4L5Q4Q5Q4Q4O9O9K6K7J31J31Q9Q9N6
1359E982N7J28J28J04J04O1O1J03J02J73J74K04K04P5P6J65J64K36K36K40K40J11J12J63J63
$$ y = [1968, 1948, 1928, 1917, 1906, 1916, 1926, 1912, 1898, 1884, 1869, 1920, 1971, 1951, 1931, 1944, 1957, 1932, 1908, 1912, 2002, 2114, 2139, 2059, 1979, 1937, 1895, 1940, 1985, 1987, 1989, 1993, 1997, 2044, 2091, 2069, 2047, 2097, 2147, 2164, 2182, 2179, 2175, 2133, 2091, 2120, 2150, 2168, 2186, 2161, 2136, 2098, 2059, 2091, 2166, 2198, 2144, 2071, 2084, 2176, 2269, 2286, 2218, 2167, 2117, 2104, 2090, 2043, 1995, 1968, 2027, 2101, 2132, 2121, 2110, 2126, 2143, 2116, 2090, 2106, 2121, 2159, 2196, 2249, 2302, 2283, 2265, 2250, 2236, 2264, 2293, 2353, 2413, 2431, 2449, 2361, 2273, 2206, 2139, 2166, 2193, 2292, 2390, 2394, 2399, 2360, 2322, 2291, 2261, 2274, 2286, 2316, 2346, 2375, 2405, 2448, 2491, 2492, 2492, 2533, 2574, 2571, 2569, 2546, 2523, 2458, 2392, 2404, 2416, 2428, 2439, 2482, 2525, 2496, 2468, 2459, 2451, 2485, 2519, 2559, 2599, 2617, 2635, 2603, 2571, 2539, 2507, 2511, 2514, 2561, 2607, 2650, 2694, 2695, 2696, 2744, 2792, 2798, 2803, 2810, 2816, 2822, 2829, 2783, 2737, 2762, 2787, 2865, 2943, 2979, 3014, 2944, 2875, 2884, 2978, 3061, 3102, 3127, 3195, 3253, 3312, 3245, 3177, 3186, 3195, 3247, 3299, 3307, 3316, 3282, 3247, 3289, 3330, 3329, 3328, 3406, 3484, 3561, 3639, 3697, 3754, 3769, 3783, 3784, 3785, 3857, 3929, 4001, 4073, 4045, 4017, 3969, 3921, 3944, 3967, 4049, 4131, 4142, 4153, 4109, 4066, 4094, 4122, 4195, 4267, 4340, 4413, 4437, 4461, 4485, 4509, 4466, 4423, 4480, 4537, 4629, 4721, 4813, 4905, 4897, 4889, 4923, 4958, 5042, 5127, 5211, 5295, 5364, 5433, 5459, 5486, 5617, 5748, 5837, 5926, 5982, 6039, 6167, 6295, 6399, 6503, 6564, 6625, 6728, 6830, 7003, 7177, 7381, 7585, 7660, 7736, 7901, 8065, 8301, 8537, 8777, 9017, 9128, 9240, 9403, 9566]
1356I566J63J63J62J62J61J62K68K68K25K25J82J81J81J82L39L39K97K11K38L80L95L95L34
1353A5179L33M05M05M11M10M16M17L98M84N40N83O15O15P17P18P50P49Q21Q21Q65Q65Q69R54
1350B9340J091J233J294J337J401J445J512J654J845K045K147K291K512K768L068L325L652
1348F3960M022M358M786N312N968O611P324Q173R116J0153J1266J2469J3754J5141J6540J8059
1346B17012J9686K1214K2611K3716K4429K4357K3131K0456J6261J0410L190m682j2360j8928
1344C90503k3865k6851k7964k7622k6280k4387k2188j9863j7608j5601j3861j2262j0863r597
1343A11691q484p521o693n960n304m768m340l961l590l286l030k812k555k288k088j981j839
1341D1191j688j488j410j367j354j312j201j116r93r07q73q31p73p30o97o97o68n82n25m83
$$ y = [9566, 9729, 9892, 10054, 10216, 10377, 10539, 10807, 11075, 11300, 11525, 11707, 11888, 12069, 12251, 12590, 12929, 13226, 13437, 13675, 14055, 14450, 14845, 15179, 15512, 15917, 16322, 16733, 17143, 17559, 17976, 18374, 18858, 19398, 19981, 20596, 21211, 21928, 22646, 23396, 24145, 24966, 25787, 26652, 27517, 28386, 29340, 30431, 31664, 32958, 34295, 35696, 37141, 38653, 40307, 42152, 44197, 46344, 48635, 51147, 53915, 56983, 60308, 63960, 67982, 72340, 77126, 82438, 88406, 95017, 102341, 110514, 119630, 129783, 141049, 153518, 167272, 182413, 198953, 217012, 236698, 257912, 280523, 304239, 328668, 353025, 376156, 396612, 412873, 423283, 426473, 421791, 409431, 390503, 366638, 339787, 311823, 284201, 257921, 233534, 211346, 191483, 173875, 158274, 144413, 132151, 121288, 111691, 103207, 95686, 88993, 83033, 77729, 72961, 68621, 64660, 61070, 57784, 54754, 51942, 49387, 47099, 45011, 43030, 41191, 39503, 38015, 36605, 35238, 33884, 32572, 31371, 30255, 29262, 28355, 27482, 26651, 25878, 25148, 24451, 23754, 23086, 22504, 21979, 21496]
1338B1496m35m35n09n95n92n07l98l55l73l74l52l52l51l52k77k77k76k77k53k52k52k52j97
1335A3203j96k39k39k18k18k18k18k19k19j20j19j29j29j72j71j52j53j52j52j04j04j04j05
1333I353j67j68j62j62j03j7OOj07j07j99j98k11o8L1L2m2j27j50j51j79j80n2n1j0j1j0j0
1329F786m1m1m0m1m3m2j14j14p1p2%%j8j8j18j17p6p5l3l3m5m5j37j36j19K4J19L4q2q3J2
1325E221J2o1o0o1o1m1m2J%o8o8kkk8j14o6o5m5m5kkK0K0k2k3j5j5n8n9r2r3KJkq8q7kK8K8
1321C944L4L3K0J9n2n2j2j2j1j2j7j7L1n4q8q9POo6o6k0O6R7J1l5l5J9J9J9J9n3n3l5N0Q0
1316C695on1n2q5q5j33m7M4M4k1k2L4L4L4L3l5l6L6L6rrrrO4O4qpl7l7L4L5L3L2l8l9n9o0
1312C358rP8M2M1k4k4RQN2N1L9L8L8L8L4L4l3l2J21K06J15k8o7J9J42J42J16L0n0n0JJJJl4
$$ y = [21496, 21061, 20626, 20117, 19522, 18930, 18423, 18025, 17670, 17297, 16923, 16571, 16219, 15868, 15516, 15239, 14962, 14686, 14409, 14156, 13904, 13652, 13400, 13203, 13007, 12768, 12529, 12311, 12093, 11875, 11657, 11438, 11219, 11099, 10980, 10851, 10722, 10550, 10379, 10227, 10074, 9922, 9770, 9666, 9562, 9458, 9353, 9186, 9018, 8856, 8694, 8591, 8574, 8580, 8586, 8479, 8372, 8173, 7975, 7764, 7696, 7727, 7759, 7717, 7590, 7440, 7289, 7110, 6930, 6878, 6827, 6817, 6806, 6796, 6786, 6745, 6704, 6664, 6623, 6580, 6538, 6424, 6310, 6239, 6167, 6167, 6167, 6149, 6131, 6013, 5896, 5820, 5745, 5712, 5679, 5634, 5589, 5452, 5316, 5197, 5221, 5340, 5374, 5292, 5209, 5221, 5233, 5172, 5112, 5051, 4990, 4949, 4907, 4908, 4908, 4840, 4772, 4770, 4768, 4740, 4626, 4560, 4495, 4450, 4405, 4403, 4401, 4421, 4441, 4419, 4396, 4381, 4366, 4308, 4249, 4157, 4064, 4066, 4067, 4065, 3977, 3890, 3888, 3916, 3944, 3978, 4011, 4031, 4050, 3998, 3946, 3934, 3922, 3911, 3899, 3882, 3865, 3896, 3842, 3754, 3665, 3672, 3678, 3612, 3546, 3526, 3592, 3689, 3700, 3665, 3630, 3649, 3668, 3687, 3706, 3653, 3600, 3565, 3615, 3695, 3689, 3638, 3586, 3501, 3416, 3283, 3236, 3280, 3324, 3303, 3281, 3315, 3349, 3383, 3416, 3381, 3345, 3381, 3417, 3408, 3399, 3390, 3381, 3445, 3509, 3501, 3494, 3457, 3420, 3454, 3489, 3522, 3554, 3516, 3477, 3418, 3358, 3349, 3427, 3469, 3510, 3486, 3462, 3471, 3479, 3531, 3582, 3621, 3659, 3697, 3735, 3769, 3803, 3770, 3738, 3859, 4065, 4180, 4152, 4085, 4104, 4246, 4388, 4504, 4534, 4484, 4434, 4435, 4436, 4437, 4438, 4404]
1308D404l4p7p8j2j1r3j78j28j28l4l3k7k6o9p0j2j2j12j12n9n8n3n4l5N0M9l5m6m6qql6l5
1303B784l6l6l3l3l3l3J9J8J9J8MLl9m0k9l0k9k9n2n2K0J9K7K7m5m4p2p3p2p2j1j1L2L3j8
1299B101j7j7j7K4K3K3K4K8K9j4j4n7n6M4M3M4M3n6n7m7m8mnp5p5mmJ1J1J1J1klklL4L3L4
1295A994L3j00j00p7QO1O1K4K3QPo4o4M9M8N3l2k1k0J7J6qrrrLLO9O9k5j11p3J2M4m2q9q8
1290A661j2j2j2j2L7L7M3m3m5m5K1K2l9l8N6N6mq8m1m1K1K1Q7Q6L9m6m2m1J7J8n4n4m1m2N4
1286A524N3L4n1n1L5J33J33Oq0j05k0N6N5ooL7L6o5o4m2M4J6J7m9m9o0o0NOM5m1o4o4J9J9
1281A396O1O2NO%%J9o7j10k4N9N8o5o5j5j4K7K8R1R1L9m6m8m7n3n3JKM4M4M3M3n7n7q4q5J6
1277A245J6M5M5KKjjjj%jjjm6m5lkN8N8J5J6k4k3k3k4L8L7onl0l0l0l0N2N2N2N2j2j2L0L1
$$ y = [4404, 4370, 4293, 4215, 4203, 4192, 4099, 3921, 3793, 3665, 3631, 3598, 3571, 3545, 3476, 3406, 3394, 3382, 3270, 3158, 3099, 3041, 2988, 2934, 2899, 2949, 2998, 2963, 2917, 2871, 2863, 2855, 2819, 2784, 2748, 2712, 2679, 2646, 2613, 2580, 2599, 2617, 2636, 2654, 2658, 2661, 2622, 2582, 2553, 2523, 2494, 2465, 2413, 2361, 2381, 2400, 2427, 2454, 2409, 2365, 2293, 2220, 2148, 2076, 2065, 2054, 2086, 2119, 2101, 2084, 2067, 2050, 2074, 2097, 2120, 2144, 2172, 2201, 2187, 2173, 2116, 2060, 2104, 2147, 2191, 2234, 2178, 2121, 2074, 2026, 2022, 2017, 1942, 1867, 1863, 1859, 1870, 1881, 1892, 1903, 1901, 1898, 1896, 1893, 1927, 1960, 1994, 2027, 1927, 1827, 1750, 1758, 1819, 1880, 1904, 1927, 1935, 1942, 1878, 1814, 1863, 1911, 1964, 1932, 1911, 1891, 1908, 1924, 1916, 1907, 1898, 1889, 1892, 1895, 1964, 2033, 2008, 1897, 1824, 1836, 1880, 1838, 1749, 1661, 1649, 1637, 1625, 1613, 1650, 1687, 1730, 1687, 1642, 1597, 1618, 1640, 1601, 1563, 1619, 1675, 1671, 1583, 1542, 1501, 1522, 1543, 1630, 1716, 1755, 1709, 1667, 1626, 1643, 1661, 1607, 1553, 1512, 1470, 1524, 1577, 1611, 1560, 1509, 1544, 1677, 1810, 1816, 1736, 1631, 1611, 1667, 1722, 1716, 1710, 1747, 1783, 1718, 1654, 1612, 1656, 1672, 1689, 1640, 1591, 1531, 1471, 1476, 1482, 1527, 1486, 1422, 1358, 1377, 1396, 1457, 1519, 1524, 1530, 1530, 1530, 1549, 1482, 1372, 1348, 1407, 1465, 1400, 1335, 1320, 1306, 1333, 1361, 1452, 1543, 1582, 1536, 1488, 1441, 1388, 1335, 1336, 1338, 1382, 1426, 1469, 1512, 1455, 1398, 1314, 1229, 1245, 1261, 1306, 1351, 1353, 1355, 1354, 1353, 1352, 1351, 1351, 1350, 1349, 1348, 1302, 1257, 1254, 1252, 1310, 1368, 1383, 1399, 1375, 1352, 1329, 1305, 1343, 1380, 1374, 1369, 1339, 1309, 1279, 1249, 1301, 1353, 1405, 1457, 1445, 1433, 1463, 1494]
1272A494nnnnl5l4O0O0L6n0p3p2K8K8j4j5LLM7M6L5L6o7j54j25m0N8N8K5o0o0K6J15J16J7
1268A472o8q2MK2K2k8k8O6O7M8l7l2l2O8O8mlj5j4K8K8M2M1jjp8p8j26m0L4L4k7k7L6J22N1
1263A532l5r8r7K5K6L1L0m1m1K0J9j8j7m3M3R5R5JJk0k1m4m4k3k3k4k5m5m6RJ0RRM3M3%%j7
1259A319j7j6j7K4K4K4K4QPk9l0K3J08O6k0p4p3pqP2P1P6rn7n6L7L8n2n2J4J5Nq1j01j7J3
1254A252J3k5k4N5N6L3n4l3l4MMN8N7O3k3n7n7RRJ4J5ppj2j2L1L1LKM5M6n3n2rj0ppJ4J4P7
1249A422P7Q2lj4j5k0j9o4o4PQM5M5P2j4j05j06pP8K1o5J0J0mnO2O1L8m7r9r9M5M6N1l5j02
1245A293j02lQ2P2j4l2l1k4k4kkP5P5MLRQQRqqpqn4n4M6M6L4L4o6o5k1k1P3P4P7rl1l2J2J2
1240A428o0n9n8n7oQ0Q5Q6l7l7J2J2J2J1k5k5J8J8l4l3q1ML9L9M5M4K1K2k2k1O8O9pr2j32
$$ y = [1494, 1489, 1484, 1479, 1474, 1439, 1405, 1465, 1525, 1561, 1511, 1438, 1366, 1394, 1422, 1408, 1393, 1396, 1399, 1446, 1492, 1527, 1563, 1496, 1342, 1217, 1177, 1235, 1293, 1318, 1258, 1198, 1224, 1339, 1455, 1472, 1404, 1322, 1326, 1348, 1370, 1342, 1314, 1380, 1447, 1495, 1458, 1426, 1394, 1462, 1530, 1526, 1523, 1508, 1494, 1522, 1550, 1592, 1633, 1632, 1631, 1553, 1475, 1349, 1309, 1343, 1377, 1350, 1323, 1359, 1481, 1532, 1497, 1399, 1302, 1327, 1353, 1384, 1414, 1373, 1332, 1352, 1371, 1353, 1336, 1293, 1336, 1431, 1526, 1527, 1528, 1508, 1487, 1443, 1399, 1376, 1353, 1329, 1304, 1259, 1213, 1222, 1232, 1241, 1250, 1293, 1336, 1336, 1336, 1319, 1302, 1286, 1269, 1293, 1317, 1341, 1365, 1373, 1380, 1351, 1321, 1344, 1452, 1518, 1498, 1424, 1351, 1344, 1336, 1408, 1479, 1555, 1546, 1489, 1433, 1470, 1508, 1456, 1404, 1418, 1433, 1438, 1357, 1256, 1239, 1252, 1265, 1240, 1216, 1271, 1327, 1360, 1306, 1273, 1239, 1243, 1247, 1305, 1362, 1425, 1402, 1345, 1288, 1297, 1306, 1320, 1335, 1328, 1321, 1309, 1297, 1328, 1359, 1362, 1364, 1409, 1455, 1402, 1350, 1341, 1331, 1324, 1317, 1331, 1345, 1422, 1499, 1581, 1578, 1564, 1549, 1529, 1510, 1446, 1382, 1389, 1397, 1442, 1487, 1559, 1545, 1440, 1334, 1327, 1405, 1426, 1361, 1371, 1381, 1377, 1372, 1434, 1495, 1533, 1486, 1387, 1288, 1333, 1379, 1430, 1395, 1293, 1191, 1188, 1270, 1342, 1328, 1296, 1265, 1241, 1217, 1215, 1213, 1288, 1363, 1367, 1370, 1379, 1387, 1395, 1404, 1396, 1388, 1381, 1373, 1319, 1265, 1311, 1357, 1391, 1425, 1359, 1294, 1273, 1252, 1325, 1399, 1476, 1467, 1436, 1404, 1416, 1428, 1368, 1309, 1251, 1194, 1188, 1268, 1353, 1439, 1402, 1365, 1377, 1389, 1401, 1412, 1387, 1362, 1380, 1398, 1364, 1331, 1250, 1254, 1293, 1332, 1377, 1421, 1442, 1464, 1442, 1421, 1489, 1558, 1551, 1459, 1327]
1236A327m7%%K5K5K4K5j1j1j1j1MLP5P4m0m0m1m0RRRRK4K4K5K4M0M0klo9p0m6L9M8M7RJ0j5
1231A491j6k6O0M4m1p9OP9P9p2p3PPOPpqpqK6K5m5m6L7L8rr5l8M8L7L8K0K0K1K0L3L4j0rJ5
1226A609J4J5J5o7o8o7o8OOM9M8M0M0o1o0n9n9J2J2nnmnQ3Q2k0j07j6O9O3k1MMkjk2k3j6j7
1221A398q9kK0K1n8n9M2M1R4R3K2K2m4m5jkpqqpP3P3P8pm2m3N3N2mnp5p6o4o3k0k1j6j6J04
1216A404J04Q5n8j29j30KQ7R3Po5K0R6R5m2m2K4K4%q6l7l8k4k4P0P0L9m6rP6P3j2l0l1K0K0
1212A606q1q0k6k7J7J6K8K8K8K9N9O0j2j1l7l6l7l7l9l8LMj2j2L1L0J0J0J1J0J1J1o1o0L3
1208A429L3j0j0k9l0k9k9MNMMO1O1J8J7l0l0l0l0L4L5qpP9Q0L6L7j4j4j5j4m9m9ooLLKLO4
1203A573O4l6l6RJ0l4l3L9L9llqpppj1j2j2j2o8o7L1L2K2K1K2K1R1R1o6o6k8k8k9k8r9r8N8
$$ y = [1327, 1280, 1280, 1280, 1305, 1330, 1354, 1379, 1368, 1357, 1346, 1335, 1339, 1342, 1417, 1491, 1451, 1411, 1370, 1330, 1339, 1348, 1357, 1366, 1390, 1414, 1439, 1463, 1503, 1543, 1541, 1538, 1469, 1399, 1353, 1392, 1440, 1487, 1496, 1506, 1491, 1475, 1449, 1509, 1553, 1512, 1433, 1439, 1518, 1597, 1525, 1452, 1459, 1466, 1472, 1479, 1472, 1464, 1457, 1449, 1475, 1500, 1455, 1409, 1446, 1484, 1475, 1380, 1342, 1390, 1427, 1465, 1485, 1505, 1526, 1546, 1579, 1613, 1603, 1594, 1609, 1623, 1638, 1653, 1586, 1518, 1451, 1383, 1389, 1395, 1444, 1492, 1532, 1572, 1511, 1451, 1392, 1333, 1345, 1357, 1352, 1347, 1343, 1338, 1421, 1503, 1483, 1376, 1360, 1429, 1492, 1471, 1475, 1479, 1477, 1476, 1454, 1431, 1415, 1398, 1309, 1307, 1327, 1348, 1290, 1231, 1273, 1314, 1408, 1501, 1523, 1545, 1501, 1456, 1455, 1453, 1446, 1438, 1430, 1423, 1496, 1569, 1647, 1640, 1598, 1555, 1608, 1660, 1656, 1651, 1576, 1500, 1436, 1373, 1353, 1332, 1316, 1300, 1404, 1508, 1593, 1535, 1406, 1276, 1278, 1365, 1458, 1465, 1400, 1420, 1516, 1611, 1569, 1527, 1551, 1575, 1575, 1489, 1452, 1414, 1390, 1366, 1436, 1506, 1545, 1499, 1490, 1566, 1639, 1627, 1597, 1566, 1586, 1606, 1525, 1445, 1419, 1392, 1409, 1425, 1453, 1481, 1509, 1538, 1597, 1657, 1645, 1634, 1597, 1561, 1524, 1487, 1448, 1410, 1413, 1417, 1405, 1393, 1424, 1454, 1464, 1474, 1485, 1495, 1506, 1517, 1456, 1396, 1429, 1462, 1452, 1442, 1413, 1383, 1354, 1325, 1329, 1334, 1338, 1342, 1403, 1464, 1482, 1499, 1469, 1439, 1409, 1379, 1413, 1448, 1440, 1433, 1512, 1592, 1628, 1665, 1651, 1637, 1622, 1608, 1559, 1510, 1504, 1498, 1501, 1504, 1506, 1509, 1573, 1637, 1601, 1565, 1574, 1584, 1550, 1517, 1556, 1595, 1592, 1589, 1581, 1574, 1567, 1560, 1549, 1537, 1525, 1513, 1445, 1378, 1409, 1441, 1463, 1484, 1506, 1527, 1618, 1709, 1643, 1577, 1549, 1521, 1492, 1464, 1365, 1267, 1325]
1198A325N8R4R5K3K3j7j6j6j6ppqpn1n2K0J9l0k9O5O4K1o6lQ3O9p4j12o9nnkkL4L5rqNNNN
1193A437J2J3J2J3J9J8J9J9K7K6m4m5l8l8N6N6K8n8j01j5L6L6n4n3j9O7M2%j6j6j9j9N0M9
1189A500N0N0j8j8j8j8J0RJ0J0mmlmrrm6m7l8M7K5j7k7J5N6J3n0n0J9J9kjkjnnO6O6N9O0N4
1184A742N4j6j01j01j6L1L2pok8k9J4J5llp2p1OM9Pp9p8PN4N4nnL7L8MMM2M1K9n6q0q0k5k4
1179A375J7J8R1R1M0m6n7n7J0Rj6j5K7K7k6k6P4P4J8J8J8J7j7j8o1o1l3l4l4l4j3j2L0L1N
1175A430Nl7l8N0N0M4M4k2j07j07k2R4R5M8l8m8m8J7J8mlmmM1M1l1l0o7o7o2o1jQ5J08J08
1171A477k0j9j9k0J7J8J7J7k4k4k3k4K2K3O5O5j7j8K0K0M2m2l8l7K5K4j8j8J7J8n4n4m1m1
1167A336N9N9P9P9k1k0K5K5K6K5n9n8n9n8k4k3M8M8ooonk6k6M0M0l8j23n2L4mmrP6J08K3k4
$$ y = [1325, 1383, 1477, 1572, 1595, 1618, 1601, 1585, 1569, 1553, 1546, 1539, 1531, 1524, 1473, 1421, 1441, 1460, 1430, 1401, 1466, 1530, 1551, 1485, 1482, 1565, 1634, 1560, 1448, 1379, 1374, 1369, 1367, 1365, 1399, 1434, 1425, 1417, 1422, 1427, 1432, 1437, 1449, 1462, 1474, 1487, 1506, 1524, 1543, 1562, 1589, 1615, 1571, 1526, 1488, 1450, 1506, 1562, 1590, 1532, 1431, 1416, 1452, 1488, 1434, 1381, 1362, 1429, 1471, 1471, 1455, 1439, 1420, 1401, 1451, 1500, 1550, 1600, 1582, 1564, 1546, 1528, 1538, 1547, 1557, 1567, 1563, 1559, 1556, 1552, 1543, 1534, 1488, 1441, 1403, 1450, 1475, 1458, 1431, 1446, 1502, 1515, 1465, 1415, 1434, 1453, 1451, 1450, 1448, 1447, 1442, 1437, 1503, 1569, 1628, 1688, 1742, 1796, 1780, 1679, 1578, 1562, 1593, 1625, 1618, 1612, 1584, 1555, 1569, 1584, 1581, 1578, 1506, 1435, 1441, 1490, 1497, 1418, 1340, 1347, 1401, 1455, 1450, 1445, 1482, 1520, 1524, 1528, 1570, 1611, 1640, 1584, 1504, 1424, 1399, 1375, 1392, 1410, 1501, 1592, 1632, 1586, 1529, 1472, 1482, 1491, 1475, 1460, 1487, 1514, 1488, 1462, 1536, 1610, 1628, 1646, 1664, 1681, 1664, 1646, 1585, 1524, 1491, 1457, 1423, 1389, 1376, 1364, 1394, 1425, 1430, 1435, 1398, 1360, 1410, 1460, 1504, 1548, 1526, 1419, 1312, 1290, 1384, 1479, 1527, 1489, 1441, 1393, 1410, 1428, 1424, 1421, 1417, 1413, 1454, 1495, 1464, 1434, 1367, 1300, 1238, 1177, 1176, 1261, 1369, 1477, 1457, 1438, 1419, 1399, 1416, 1434, 1451, 1468, 1444, 1420, 1397, 1373, 1395, 1418, 1483, 1548, 1531, 1513, 1533, 1553, 1595, 1553, 1515, 1478, 1503, 1527, 1509, 1491, 1508, 1526, 1472, 1418, 1377, 1336, 1395, 1454, 1533, 1612, 1591, 1571, 1596, 1621, 1647, 1672, 1613, 1555, 1496, 1438, 1414, 1391, 1439, 1487, 1481, 1475, 1469, 1464, 1438, 1412, 1452, 1492, 1454, 1331, 1279, 1313, 1309, 1305, 1296, 1372, 1480, 1503, 1479]
1162A479k3K5K6m6m5P2P2M8l6n3n3j5j5k5k5O9P0L5n0n0L6P3P3L6L5p1p2p1p2J9K0J9J9j7
1158A487j7N4N4L8L8mnj6j5j5j6n7n7l4N1O2O1nmj7j6j6j6J3J3Q0P9P0j5r6r5J3J4J3J3k2
1153A615k3k2k2n4n4J7J8j2j2j2j2M6M6M7M6k1k2q7q7k0O6O1O1k3k3k3k3RJ0RJ0O5O6r1r1
1149A458j3j4j3j3M2M2jjm3m4j9j9N8J01Q3ll0k9j3j4J0Rl3l4j3j4L0K9L3L2N2N1o4j08q8
1145A407lJ0J0noK5K5K5K5%%J9J9m0q2j2P3O9j7j14p0K9P2L0n5l9LO9O8P0j6l9l9JKm2m2K0
1140A450K0J9K0K5K4LMK3K3m3m2k3O3L9mk2k2k5k5OORRj8K5L3n2j10k5N0R2L7n0r1m9rL3N4
1136A457N5mmk6k5K1K2K1K2K5K5K5K5j2j2j1j2N4N4j7j7o5o4k2k2l0l0o7o7L8J23Q1no0o1
1131A415NON0N0p4p3l0N6J8o7n0L7K5K5j3j2L0L0L4L3J3J3j7j6K6K7k4k4M7M7K6K5j7j8J4
$$ y = [1479, 1456, 1481, 1507, 1461, 1416, 1488, 1560, 1608, 1572, 1519, 1466, 1451, 1436, 1411, 1386, 1455, 1525, 1560, 1510, 1460, 1496, 1569, 1642, 1678, 1713, 1642, 1570, 1499, 1427, 1446, 1466, 1485, 1504, 1487, 1470, 1524, 1578, 1616, 1654, 1650, 1645, 1629, 1614, 1599, 1583, 1526, 1469, 1435, 1486, 1548, 1609, 1604, 1600, 1583, 1567, 1551, 1535, 1548, 1561, 1641, 1720, 1790, 1775, 1679, 1584, 1597, 1611, 1624, 1637, 1615, 1592, 1570, 1548, 1494, 1440, 1457, 1475, 1463, 1451, 1439, 1427, 1473, 1519, 1566, 1612, 1591, 1569, 1482, 1395, 1375, 1441, 1502, 1563, 1540, 1517, 1494, 1471, 1480, 1490, 1499, 1509, 1574, 1640, 1549, 1458, 1445, 1431, 1418, 1405, 1447, 1489, 1488, 1487, 1444, 1400, 1381, 1362, 1420, 1521, 1604, 1601, 1571, 1542, 1529, 1515, 1525, 1534, 1501, 1467, 1454, 1440, 1470, 1499, 1532, 1564, 1616, 1667, 1603, 1495, 1407, 1404, 1414, 1424, 1419, 1413, 1438, 1463, 1488, 1513, 1513, 1513, 1532, 1551, 1511, 1429, 1417, 1490, 1559, 1542, 1428, 1358, 1387, 1459, 1489, 1434, 1395, 1398, 1467, 1535, 1605, 1589, 1550, 1511, 1512, 1514, 1472, 1430, 1450, 1470, 1489, 1509, 1534, 1558, 1561, 1565, 1588, 1611, 1568, 1526, 1503, 1566, 1605, 1601, 1579, 1557, 1532, 1507, 1513, 1519, 1528, 1537, 1519, 1544, 1577, 1525, 1415, 1390, 1440, 1532, 1569, 1519, 1428, 1379, 1370, 1403, 1457, 1512, 1508, 1504, 1478, 1453, 1474, 1496, 1517, 1539, 1564, 1589, 1614, 1639, 1627, 1615, 1604, 1592, 1646, 1700, 1683, 1666, 1601, 1537, 1515, 1493, 1463, 1433, 1366, 1299, 1337, 1460, 1541, 1536, 1476, 1415, 1420, 1426, 1476, 1526, 1452, 1379, 1349, 1405, 1423, 1356, 1306, 1343, 1368, 1393, 1380, 1368, 1398, 1428, 1462, 1495, 1508, 1521, 1504, 1488, 1514, 1541, 1517, 1493, 1540, 1587, 1613, 1638, 1621, 1603, 1617]
1127A617J3qqo1o1O7O7NMMNl9l9l8l9m7m6K4K5K8K7K8K8K4K5K4K4j3j4n6n6K4K4K4K4k7k7
1123A556J5J6K7K8O6O5j6j02n3n4J2J2M9M9N3l3n5n6noL7L8J7J8k5k6L0L0j2j3p3p2jjL5L6
1118A586L5L5J5J4k9k9K0J9k3k4qqqpk9k8k9k8L5L5L5L6mmmml3l3l3l2L5L6L6L6N6N7j5n7
1113A652m1M3O0J7m0m1K8K8M4M4n6n6onL7L6M7M7k5k4j9j9j9j9N9N9J6J5M0L9jjK1O4N1l5
1109B040q2MN1N0m5m5lkK8K8K8K8PPM9N0JKJKP4P3NOJ1N4M1m5j3P2J40R7J3l0rqN3N4R7R6
1104B980k0k0P9J22O1k5k7N9J04J9q4q4K3K4K4K3P4P3P4P3N8N9N8N8O6O5J09J08R9R9J00R9
1100D530N7N6J28J28J14J14O5J52K25K26J60J60J70J70K41K41K16K16K39L25M31M32L71L71
1097I538M49N34N63N63O81P66Q61J004J154J298J462J661J888K202K505K705K959L330L765
$$ y = [1617, 1630, 1622, 1614, 1553, 1492, 1559, 1626, 1631, 1635, 1639, 1644, 1605, 1566, 1528, 1489, 1442, 1396, 1420, 1445, 1473, 1500, 1528, 1556, 1580, 1605, 1629, 1653, 1640, 1626, 1570, 1514, 1538, 1562, 1586, 1610, 1583, 1556, 1571, 1587, 1614, 1642, 1708, 1773, 1757, 1655, 1602, 1548, 1560, 1572, 1621, 1670, 1723, 1690, 1635, 1579, 1574, 1568, 1605, 1643, 1660, 1678, 1653, 1627, 1657, 1687, 1675, 1662, 1589, 1517, 1516, 1515, 1550, 1586, 1621, 1656, 1671, 1685, 1656, 1627, 1647, 1666, 1643, 1619, 1611, 1603, 1595, 1588, 1559, 1531, 1502, 1474, 1509, 1544, 1579, 1615, 1611, 1607, 1603, 1599, 1566, 1533, 1500, 1468, 1503, 1539, 1575, 1611, 1667, 1724, 1709, 1652, 1611, 1654, 1714, 1731, 1691, 1650, 1678, 1706, 1750, 1794, 1738, 1682, 1676, 1671, 1708, 1744, 1791, 1838, 1813, 1789, 1770, 1751, 1732, 1713, 1772, 1831, 1847, 1862, 1902, 1941, 1940, 1939, 1960, 2024, 2075, 2040, 1958, 1962, 2013, 2063, 2018, 1973, 1970, 1968, 1996, 2024, 2052, 2080, 2087, 2094, 2143, 2193, 2194, 2196, 2197, 2199, 2273, 2346, 2351, 2357, 2368, 2422, 2463, 2418, 2405, 2477, 2617, 2714, 2727, 2697, 2688, 2680, 2733, 2787, 2884, 2980, 2960, 2940, 3019, 3141, 3202, 3177, 3150, 3209, 3313, 3332, 3248, 3164, 3187, 3211, 3235, 3258, 3332, 3405, 3479, 3552, 3610, 3669, 3727, 3785, 3851, 3916, 4025, 4133, 4232, 4331, 4431, 4530, 4587, 4643, 4771, 4899, 5013, 5127, 5192, 5344, 5569, 5795, 5955, 6115, 6285, 6455, 6696, 6937, 7153, 7369, 7608, 7933, 8364, 8796, 9167, 9538, 9987, 10521, 11084, 11647, 12328, 13094, 13955, 14959, 16113, 17411, 18873, 20534, 22422, 24624, 27129, 29834, 32793, 36123, 39888]
1095C9888M251M723N266N850O450O857P057O935O278N038L182R06j577l903n872p192p849
1093G6288p832p404o691n806m954m126l434k835k261j834j555j412j325j240j278j279j303
1091A9719j303j194j109j004j005r13q28p53o67n96n11m34l48k92k91l73l72l21k35j89j88
1088F793k32j45o1o1p9j64j66j65j28j28j31j32j31j31o6o6o6o6r5r4j4P1M2M3q1q0j19j18
1085D230j18j18r4r5r4r5l6l7OPk9k9k9k9o6o5o6o5j4j4j4j4n0m9M5M5J1p4j46n9M1M2K9n6
1081B901p6J0N5N6lmr9r8o2K4K9n6o7J8O5O5k9k9k8k9kkkkl8l8NNj4j4K8K9j6j6N5N5J2J3
1076B701Q3Q4O5O4J02J02Q0nn6n7k8k7M4M4K9L0J01J01L8L9J35K77K53J10Mq1j82j83j64p9
1072C624K8K8N6J43K06K07K96K96J82p5k58k59k35k34j64j63n8n8n8K7J20K05J93J93N1j50
$$ y = [39888, 44139, 48862, 54128, 59978, 66428, 73285, 80342, 87277, 93555, 98593, 101775, 102681, 101104, 97201, 91329, 84137, 76288, 68456, 61052, 54361, 48555, 43601, 39475, 36041, 33206, 30945, 29111, 27556, 26144, 24819, 23579, 22301, 21022, 19719, 18416, 17222, 16113, 15109, 14104, 13191, 12363, 11610, 10943, 10347, 9836, 9402, 9054, 8762, 8471, 8098, 7726, 7405, 7170, 6981, 6793, 6561, 6416, 6355, 6294, 6215, 6051, 5885, 5720, 5592, 5464, 5333, 5201, 5070, 4939, 4873, 4807, 4741, 4675, 4580, 4486, 4472, 4543, 4585, 4628, 4547, 4467, 4348, 4230, 4112, 3994, 3900, 3805, 3711, 3616, 3580, 3543, 3549, 3556, 3527, 3498, 3469, 3440, 3374, 3309, 3243, 3178, 3164, 3150, 3136, 3122, 3072, 3023, 3068, 3113, 3124, 3050, 2904, 2845, 2886, 2928, 2957, 2901, 2825, 2835, 2890, 2946, 2943, 2939, 2840, 2742, 2680, 2704, 2733, 2677, 2610, 2628, 2693, 2758, 2729, 2700, 2672, 2643, 2641, 2639, 2637, 2635, 2597, 2559, 2564, 2569, 2555, 2541, 2569, 2598, 2582, 2566, 2621, 2676, 2688, 2701, 2784, 2868, 2933, 2997, 3099, 3201, 3281, 3276, 3220, 3163, 3135, 3108, 3152, 3196, 3225, 3255, 3356, 3457, 3495, 3534, 3669, 3946, 4199, 4309, 4313, 4232, 4050, 3867, 3703, 3624, 3652, 3680, 3736, 3879, 4085, 4292, 4588, 4884, 5066, 4991, 4733, 4474, 4239, 4005, 3841, 3678, 3620, 3562, 3504, 3531, 3651, 3856, 4049, 4242, 4293, 4143]
1069D143l03l03k16j31j07j08p7p7N1N1N6N7m3m4j15j16j16j15q0q1l7l7j10j10q6jK6K6j2
1066A985j2M1M1kkm2m2m2m2O1O2O1O1j8j9r0r0o8o7O0O1J02J01N0l6m1m1mlm6m5llL4L4l8
1061A958l8MMMMmmm6m7N9N9J6J7K6K7K7K7LLLLk1k1K2K2L0L1L0L1llm5m5J7J8p7p7kQ4M0m4
1056B092L2L1L2n3m3m2m2m2n5L1P4j2o2o2NML7L6L7L7n0m9opLLK4K4k7k7k4k5K1O4M4m0j31
1052A832j31l0N5mm7m5jQl4l4N2Q4Q4l8l9k6k6O9O8N8k8n1n0k1k1K2K3K0K1n1n1m8m9N1N0
1047A672N8N8J5J6j7j7o0o0klM0M1L1L2L1L1PPOPP6P6kq7r1m9l5l5j6j7N5N5m3m3OR2N1Pn
1043A888ol0l1l0l1M9M9OOn4n3l4N3O1J9j9K4Q7Q8J9J9mmnmn1n1n1n2rrn2n2K2K2K3K2L0K9
1038A884P8qo2o2MMopL6L6j1j2j2j1M8M8k4k3o9o8k3O4P7qp7p8K5J11J06J05opk7k8l4l3O1
$$ y = [4143, 3840, 3537, 3321, 3190, 3083, 2975, 2898, 2821, 2872, 2923, 2979, 3036, 2993, 2949, 2834, 2718, 2602, 2487, 2407, 2326, 2289, 2252, 2142, 2032, 1946, 1945, 1971, 1997, 1985, 1973, 2014, 2055, 2053, 2051, 2009, 1967, 1925, 1883, 1944, 2006, 2067, 2128, 2110, 2091, 2001, 1911, 1843, 1776, 1836, 1897, 1999, 2100, 2150, 2114, 2073, 2032, 2028, 2025, 1979, 1934, 1931, 1928, 1962, 1996, 1958, 1920, 1924, 1928, 1932, 1936, 1932, 1928, 1882, 1835, 1894, 1953, 1969, 1986, 2012, 2039, 2066, 2093, 2096, 2099, 2102, 2105, 2084, 2063, 2085, 2107, 2137, 2168, 2198, 2229, 2226, 2223, 2178, 2133, 2150, 2168, 2091, 2014, 2012, 2096, 2136, 2092, 2124, 2155, 2187, 2134, 2091, 2049, 2007, 1965, 1910, 1941, 2015, 2003, 1941, 1879, 1884, 1888, 1925, 1961, 1998, 2035, 1985, 1936, 1930, 1923, 1926, 1929, 1953, 1977, 1950, 1923, 1899, 1874, 1895, 1959, 2003, 1963, 1832, 1701, 1671, 1726, 1722, 1675, 1630, 1629, 1637, 1603, 1569, 1621, 1705, 1789, 1751, 1712, 1686, 1660, 1729, 1797, 1855, 1827, 1776, 1726, 1705, 1684, 1706, 1729, 1749, 1770, 1719, 1668, 1620, 1571, 1622, 1672, 1730, 1788, 1803, 1819, 1802, 1785, 1725, 1665, 1663, 1660, 1700, 1741, 1772, 1804, 1835, 1866, 1873, 1880, 1886, 1893, 1969, 2045, 2043, 1956, 1865, 1816, 1781, 1746, 1730, 1713, 1768, 1823, 1780, 1737, 1743, 1835, 1886, 1893, 1888, 1882, 1852, 1821, 1791, 1760, 1809, 1858, 1864, 1870, 1816, 1763, 1729, 1782, 1843, 1862, 1843, 1867, 1954, 2042, 2061, 2080, 2076, 2072, 2067, 2063, 2012, 1961, 1910, 1858, 1849, 1840, 1788, 1736, 1758, 1780, 1803, 1825, 1855, 1884, 1962, 1954, 1892, 1830, 1834, 1838, 1832, 1825, 1861, 1897, 1886, 1874, 1862, 1851, 1899, 1947, 1923, 1900, 1831, 1763, 1740, 1804, 1881, 1873, 1796, 1718, 1743, 1854, 1960, 2065, 2059, 2052, 2025, 1997, 1963, 1930, 1991]
1033A991O1L3n1m7m6k6k6M6M6M7M7k4k4l5l5j7O8R2Oj2j2NNo6o6m1m1L0L0J48J48P1p2j41
1029B092j41J5J02N7N8K0K0k1k1J6J6N7k8opO1k5p7p7N5N5N5N5O9O8K6K5M8M7k4k4n9n9M0
1025B488M1j1j0l8M9J8J8j9j9P2P1P2P2k7k7m9m8J4J4n7n7j%M2M2R1R1m1j27n9K6M3M4J2J1
1021B741J1J2L4L3J05J06J09J09O7O7J26J27K6K7M7M8M7M8O2O3M5m1m0M6O4O3J02J02J22J23
1017D601J56J56J56J56J33J32R0Q9R3R3J65J64J68J68K11K11K07K06J36J35K04K04J82J82
1014H398K28K29K76K76L41M25M26M26M21N06N67N67M12R8j26j27L7K36K91K90M25N69O79O79
1011A6549P61Q47Q24O82M45K46K14L57O63R19J138J337J580J950K272K586K946L316L585L841
1009D7058M255M968N992P277Q837J0749J2854J4937J6607J7150J5629J1491N465n58m336m936
$$ y = [1991, 2052, 2085, 2034, 1987, 1941, 1915, 1889, 1935, 1981, 2028, 2075, 2051, 2027, 1992, 1957, 1940, 2008, 2100, 2106, 2094, 2082, 2087, 2092, 2026, 1960, 1919, 1878, 1908, 1938, 2086, 2234, 2305, 2233, 2092, 1951, 1966, 2068, 2125, 2183, 2203, 2223, 2202, 2181, 2197, 2213, 2270, 2242, 2236, 2229, 2290, 2265, 2188, 2111, 2166, 2221, 2276, 2331, 2400, 2468, 2494, 2519, 2567, 2614, 2590, 2566, 2507, 2448, 2488, 2529, 2518, 2508, 2470, 2519, 2537, 2555, 2536, 2517, 2589, 2660, 2732, 2804, 2777, 2750, 2701, 2653, 2667, 2681, 2624, 2567, 2566, 2566, 2608, 2650, 2741, 2832, 2791, 2664, 2605, 2631, 2674, 2718, 2730, 2741, 2752, 2764, 2798, 2831, 2936, 3042, 3151, 3260, 3327, 3394, 3520, 3647, 3673, 3700, 3747, 3795, 3842, 3890, 3952, 4015, 4060, 4019, 3979, 4025, 4089, 4152, 4254, 4356, 4478, 4601, 4757, 4913, 5069, 5225, 5358, 5490, 5580, 5669, 5762, 5855, 6020, 6184, 6352, 6520, 6731, 6942, 7149, 7355, 7491, 7626, 7830, 8034, 8216, 8398, 8626, 8855, 9131, 9407, 9748, 10173, 10599, 11025, 11446, 11952, 12519, 13086, 13498, 13596, 13470, 13343, 13380, 13616, 13907, 14197, 14622, 15191, 15870, 16549, 17310, 18157, 18981, 19663, 20108, 20354, 20568, 20925, 21588, 22507, 23645, 24982, 26562, 28512, 30784, 33370, 36316, 39632, 43217, 47058, 51313, 56281, 62273, 69550, 78387, 89136, 101990, 116927, 133534, 150684, 166313, 177804, 183269, 182711, 178375, 173439]
1007A73439k875O36M799R336J4297J9462K4542K9023L1250K8823J9905N833q865j8883k1630
1005C09092j8120j1328l652M119J1910J9320K6140L2148L6059L4552K3793L868j9221l6740
1003D11940m3276l9848l1314k1875j2941m757K521Q667J3718J7060J6861J0927q04j5063k6851
1001B84965l2492l1664k6649k0340j4305q967m469r01J824L564L861J891k475q155j3278j6161
1000A16249j6477j4851j2443j0074p970o173m810l811l107k564k076j704j501j302j085r43
998B5358q77q77q20q19p45o60n98n13m83m82m34m34l55l55l12l12k83k84k83k84k88k88k64
995A4308j79j89j89k55k55j53j53j96j96j99k00j78j79j32j33j32j32j65j64j58j59j83r7
992A0332n0r3j93j94r6r5j40j40m0Kp8j63j21l5n1r4o4o5r1r1p4J3k5j10j02j01j18j60j47
$$ y = [173439, 170564, 171200, 175999, 185335, 199632, 219094, 243636, 272659, 303909, 332732, 352637, 358470, 349605, 330722, 309092, 290972, 279644, 275992, 280111, 292021, 311341, 337481, 369629, 405688, 440240, 464033, 467901, 448680, 411940, 368664, 328816, 297502, 275627, 262686, 257929, 260450, 269117, 282835, 299895, 316756, 327683, 326879, 311816, 284965, 252473, 220809, 194160, 173820, 159515, 150548, 146079, 145178, 147002, 150566, 154427, 156318, 153843, 145688, 132410, 116249, 99772, 84921, 72478, 62404, 54434, 48261, 43451, 39640, 36533, 33969, 31893, 30189, 28688, 27386, 26301, 25358, 24481, 23604, 22784, 21965, 21220, 20560, 19962, 19449, 18966, 18484, 18050, 17616, 17261, 16906, 16594, 16282, 15999, 15715, 15432, 15148, 14860, 14572, 14308, 14129, 13940, 13751, 13496, 13241, 13088, 12935, 12739, 12543, 12344, 12144, 11966, 11787, 11655, 11522, 11390, 11258, 11093, 10929, 10771, 10612, 10429, 10332, 10282, 10189, 9996, 9802, 9706, 9611, 9471, 9331, 9291, 9293, 9215, 9052, 8931, 8896, 8845, 8751, 8687, 8622, 8531, 8440, 8366, 8379, 8354, 8244, 8142, 8041, 7923, 7763, 7616]
988G616nM6Lo7o6o2j05j31m6K4j8q9q9rrj10j09m6m6n9j03r3qQl5o7o7k7k7j8j8j8j7q2q1
984E970l8l9l7l8q1q0n4n4n4n3nnmnn8n8j6j5o4o4k2k1lmlmL7L7L7L8o7o6o6o7o9p0o9p0o
979D690oooQRK1O5N7k8p7p7KKl8l8J6N9M1m5p6p6q7jO4O4J7o8m9m9n5n4KKl5l5K4J10J10K4
975D481n9n9PPPPN0M9K3K4m3m3l7M8J00J00k5k6J7J8L5L5L5L6klP0O9M7M6M7M7l0l0pP9P3
970E193P3P8P8N1N0N1N0K1K0K0K0l0l1l6N0M9N0N4N5O5O5ool9l9l9m0j2j3j07j07l8M7kjn8
966E536n8j6j5p2p2p2p1m6m5q8q7o8o8o8o8n2n3j19j19j28m3m8m8o8o9o9o8o1o0j8j7l1l1
962C520l1l1n2n2n3n2opppr6r5MMl0k9L7L7l0j15p9QK9n6n6L0N0l5j02j6K9K9l8l7%J%%oo
957B654p8p7QQl5l5K8K8K8K9L0L0j3j3p8p7l2N4P1j4o1o1L1L1j2j2j5j4j5j5j7j7q8q8N1N1
$$ y = [7616, 7611, 7657, 7660, 7593, 7527, 7465, 7360, 7229, 7183, 7207, 7189, 7100, 7011, 7002, 6993, 6883, 6774, 6728, 6682, 6623, 6520, 6427, 6419, 6427, 6392, 6325, 6258, 6231, 6204, 6186, 6168, 6150, 6133, 6051, 5970, 5932, 5893, 5856, 5818, 5737, 5657, 5603, 5549, 5495, 5442, 5437, 5432, 5428, 5423, 5365, 5307, 5291, 5276, 5212, 5148, 5126, 5105, 5102, 5098, 5095, 5091, 5128, 5165, 5202, 5240, 5173, 5107, 5041, 4974, 4905, 4835, 4766, 4696, 4690, 4684, 4678, 4672, 4680, 4689, 4710, 4775, 4832, 4804, 4727, 4650, 4652, 4654, 4616, 4578, 4594, 4653, 4694, 4649, 4573, 4497, 4410, 4409, 4473, 4537, 4554, 4486, 4437, 4388, 4333, 4279, 4281, 4283, 4248, 4213, 4237, 4347, 4457, 4481, 4422, 4363, 4370, 4377, 4384, 4391, 4441, 4490, 4513, 4537, 4494, 4451, 4414, 4462, 4562, 4662, 4637, 4611, 4628, 4646, 4681, 4716, 4751, 4787, 4785, 4782, 4852, 4921, 4968, 5014, 5061, 5108, 5078, 5048, 5041, 5120, 5193, 5266, 5344, 5422, 5473, 5523, 5574, 5624, 5645, 5665, 5685, 5705, 5675, 5644, 5608, 5658, 5707, 5757, 5811, 5866, 5931, 5996, 5990, 5984, 5945, 5906, 5867, 5827, 5815, 5802, 5695, 5588, 5550, 5597, 5595, 5594, 5536, 5478, 5462, 5447, 5375, 5303, 5231, 5160, 5114, 5069, 4981, 4894, 4826, 4758, 4690, 4622, 4570, 4517, 4398, 4279, 4151, 4108, 4060, 4012, 3944, 3875, 3806, 3738, 3677, 3617, 3599, 3582, 3551, 3520, 3489, 3458, 3406, 3354, 3301, 3249, 3243, 3236, 3229, 3222, 3126, 3031, 3035, 3039, 3009, 2980, 3017, 3054, 3024, 2909, 2830, 2838, 2867, 2811, 2755, 2785, 2835, 2800, 2698, 2682, 2711, 2740, 2702, 2665, 2665, 2666, 2666, 2666, 2660, 2654, 2576, 2499, 2507, 2515, 2480, 2445, 2473, 2501, 2529, 2558, 2588, 2618, 2605, 2592, 2514, 2437, 2405, 2459, 2530, 2516, 2455, 2394, 2425, 2456, 2444, 2432, 2417, 2403, 2388, 2373, 2356, 2339, 2251, 2163, 2214, 2265]
952B265N0N1onj06j05jjM2M2M5M4q4q3n2n2m6m6kQ4Q3jm8m7j0j0O3O3J1p4j1j1j7j7k8k8J4
948A966J5K6K6k1j06r1pj6j7k0k0N1N2L9L9l3l2l0l1J3J3k2k1K1K2l8l9Q5Q5L7m8m8L8K4K3
944A935p1p0LLLLm8m8m8m8j3j3j4j3L5L6P8P8kkM1M1l6l5l5l5J7J7J6J7J9K0N7N7L7m8%jQ2
939B015Q2J25J25J44J44L6n0q4q4j37n2O9P0P5P5K01K01J58J59J46J47R9m5j90j90j22j22
935B995o0K6Q2Q3J98K83K97K97J09l5j48k35k44k45k01k02j71q6N7K00K26K26J01m2j02j02
932C307j57k44k60j75p1p1m6m6N3N4O0O0j2j1j23j23j23j23q4q3m1m1m0m0m0m0K0K0K0K1n
929A616nm7m8o8o9LLj0j0L2L3poppM3M2M3M2JJJ%l5l5L4L4m7r0m8L8P7rn1pJ5J6n3n3o2o2
923A238J0RL6L5l6l5N2N2N3N2%%m4m3OOONj0j0j0j0m0m0KLQ6Q5L7m9m1K%m4n8j5JJj5j4N7
$$ y = [2265, 2315, 2366, 2360, 2355, 2249, 2144, 2143, 2142, 2184, 2226, 2271, 2315, 2231, 2148, 2096, 2044, 1998, 1952, 1950, 2034, 2117, 2116, 2068, 2021, 2011, 2001, 2064, 2127, 2138, 2064, 2053, 2042, 2025, 2008, 1980, 1952, 1966, 1981, 2007, 2033, 2012, 1906, 1815, 1808, 1792, 1775, 1755, 1735, 1786, 1838, 1877, 1916, 1883, 1851, 1821, 1790, 1803, 1816, 1794, 1773, 1794, 1816, 1778, 1739, 1824, 1909, 1946, 1898, 1850, 1888, 1912, 1935, 1864, 1794, 1797, 1800, 1803, 1806, 1758, 1710, 1662, 1614, 1601, 1588, 1574, 1561, 1596, 1632, 1710, 1788, 1786, 1784, 1825, 1866, 1830, 1795, 1760, 1725, 1742, 1759, 1775, 1792, 1811, 1831, 1888, 1945, 1982, 1934, 1934, 1933, 2015, 2097, 2222, 2347, 2491, 2635, 2671, 2621, 2537, 2453, 2316, 2264, 2333, 2403, 2478, 2553, 2754, 2955, 3113, 3272, 3418, 3565, 3664, 3619, 3429, 3239, 3117, 2995, 2935, 2961, 3043, 3126, 3324, 3607, 3904, 4201, 4310, 4275, 4127, 3892, 3648, 3403, 3202, 3000, 2829, 2743, 2800, 3000, 3226, 3452, 3553, 3511, 3409, 3307, 3150, 2906, 2646, 2471, 2400, 2329, 2283, 2237, 2290, 2344, 2404, 2464, 2452, 2441, 2318, 2195, 2072, 1949, 1865, 1782, 1741, 1700, 1660, 1620, 1580, 1540, 1560, 1580, 1600, 1621, 1616, 1611, 1564, 1516, 1448, 1379, 1382, 1385, 1375, 1365, 1397, 1430, 1423, 1417, 1410, 1403, 1446, 1488, 1531, 1573, 1574, 1575, 1576, 1576, 1541, 1506, 1540, 1574, 1527, 1437, 1389, 1427, 1504, 1495, 1444, 1437, 1452, 1468, 1415, 1362, 1300, 1238, 1248, 1257, 1293, 1328, 1292, 1257, 1309, 1361, 1414, 1466, 1466, 1466, 1422, 1379, 1385, 1391, 1397, 1402, 1392, 1382, 1372, 1362, 1322, 1282, 1284, 1287, 1373, 1458, 1495, 1446, 1405, 1407, 1407, 1363, 1305, 1290, 1291, 1292, 1277, 1263, 1320]
918A320N7KKKKJ5J5k7k8m4m4jknoonO3O3K0K0p4p3l1l1J9J9n2n3j8j8j7j8qrL5L4l1l2J2J1
913A078M3M4M3M4QRN1N2m2m1q0q0m9K2Q0Q0j2n5kP0R7N4k1o5k5k5k7k8l5l4QQN6N7N7N6M7
909A443M7q2q1p2p1%%M3M2%%k2k3P7P7N9N9j3j3n4n5n4n5QQQQm5m5N5N4j2j2j5j5k4o6q2j1
904A066P1P2k1o5k5P4R9K7o0o0k2k1RQQ1Q0QQQQj2j2n5n5j1j0j0j1k6k6J6J7L8L9L9L9j%j
899A303%m0m0m0l9m4m3m3m3Q8Q9Q9Q9p2p3p2p2MNM7M7j3j4n7n6M6M7k4k5P0P0K8K7K2K2n0
895A233m9m8m8nnm6m6K5K5J4J3N7N6pon0n0k6k6k6k6L9L9J10J10J1J1l2l2m2m1N8N8kjkjj6
890A226j6j6j6m1m2L0L0J7J7J8J7J9K0n2n2n3n2J8J9L5L6o5o4pqO4O4n9n9J3J2J7J7J7J7K0
886A141K1p9p9J4J4J4J3O6O6K4K3k1k0k1k0K0K0K0K0nnmnj6j5j6j5NNP6P7KKLKLMm0l9llm6
$$ y = [1320, 1377, 1379, 1381, 1383, 1385, 1400, 1415, 1388, 1360, 1316, 1272, 1271, 1269, 1264, 1258, 1252, 1247, 1310, 1373, 1393, 1413, 1339, 1266, 1235, 1204, 1223, 1242, 1190, 1137, 1119, 1101, 1084, 1066, 1058, 1049, 1084, 1118, 1087, 1055, 1067, 1078, 1121, 1165, 1208, 1252, 1260, 1269, 1320, 1372, 1330, 1289, 1209, 1129, 1080, 1102, 1182, 1262, 1250, 1195, 1193, 1263, 1360, 1414, 1393, 1328, 1303, 1278, 1251, 1223, 1188, 1154, 1162, 1170, 1226, 1283, 1340, 1396, 1443, 1490, 1408, 1327, 1255, 1184, 1184, 1184, 1227, 1269, 1269, 1269, 1247, 1224, 1301, 1378, 1437, 1496, 1483, 1470, 1416, 1361, 1307, 1252, 1260, 1268, 1276, 1284, 1239, 1194, 1249, 1303, 1291, 1279, 1264, 1249, 1225, 1159, 1077, 1066, 1137, 1209, 1188, 1123, 1098, 1172, 1271, 1298, 1238, 1178, 1156, 1135, 1144, 1152, 1233, 1313, 1321, 1329, 1337, 1345, 1333, 1321, 1266, 1211, 1200, 1190, 1180, 1169, 1143, 1117, 1133, 1150, 1188, 1227, 1266, 1305, 1304, 1304, 1303, 1303, 1263, 1223, 1183, 1144, 1100, 1057, 1014, 971, 1059, 1148, 1237, 1326, 1254, 1181, 1109, 1037, 1041, 1046, 1093, 1140, 1127, 1113, 1056, 1000, 1046, 1093, 1069, 1044, 1114, 1184, 1212, 1239, 1261, 1283, 1233, 1184, 1136, 1088, 1083, 1078, 1032, 986, 1011, 1036, 1050, 1063, 1120, 1176, 1169, 1163, 1113, 1063, 1037, 1011, 985, 959, 998, 1037, 1147, 1257, 1268, 1279, 1247, 1215, 1173, 1132, 1190, 1248, 1246, 1245, 1243, 1242, 1226, 1210, 1194, 1178, 1137, 1095, 1125, 1155, 1172, 1189, 1207, 1224, 1243, 1263, 1211, 1159, 1106, 1054, 1072, 1091, 1126, 1162, 1097, 1033, 1026, 1018, 1082, 1146, 1087, 1028, 1041, 1053, 1070, 1087, 1104, 1121, 1141, 1162, 1083, 1004, 1018, 1032, 1046, 1059, 1125, 1191, 1215, 1238, 1217, 1197, 1176, 1156, 1176, 1196, 1216, 1236, 1231, 1226, 1222, 1217, 1201, 1186, 1170, 1155, 1160, 1165, 1241, 1318, 1320, 1322, 1325, 1327, 1330, 1334, 1294, 1255, 1252, 1249, 1203]
881A203m6QPQPm1m1m2m1K6K7K6K7K9L0K8K7l7q0n3J8O9O8n6n6K3K3Ql4k4M8M7k4n9j7K6K6
876A158m3m2K8K9kkjkM4M3M3M4qppqo2o3k0j9n7n6O9P0rn2K8R9N9j3NM9M8Nj1j0n0n0j0j0
871A207l3p6n2J9N0Pppj0rj0rk9l0mO7J01%m2m1j9o1p7oQ2Q3j3j3L9L9L9L9L7L7l4l4J4J5
867A259k8k8l3l4RRl5l5j8O8Q3lp8p8L6L5L6L5K4K4m8m7J0J1l3l2J2J3P9P9O3k2m5m5nnmn
862A224N5N4r7r8k3O3O2k3k0k1M6M6L6L6o4o4n8n9J3J3O8O9mln7n6r4r5J8J03L3n4l0l1J3
858A001J2K5J10M4m1p5J2N7N8kllkoooop5p4OR2P4P3k0k1j0j0j0j0RJ0RJ0O4O3J2p4q0q0l7
853A090l7j1P5J18L2m6m6n2n2jkjkm2m3K9K9j2j3O0N9J5J6k7k8mmmmq3q2l1N5M8M9N4N4K8
848A184K8j5j5K2K2k1k0j8j7j7j7j9k0j4j4%Q6Q6%j8j8k3k4n0n0K1K1n4n4j1j2klP3J58J16
$$ y = [1203, 1157, 1165, 1172, 1180, 1187, 1146, 1105, 1063, 1022, 1048, 1075, 1101, 1128, 1157, 1187, 1215, 1242, 1205, 1125, 1072, 1090, 1159, 1227, 1171, 1115, 1138, 1161, 1169, 1135, 1111, 1159, 1206, 1182, 1123, 1106, 1132, 1158, 1115, 1073, 1101, 1130, 1128, 1126, 1125, 1123, 1167, 1210, 1253, 1297, 1289, 1282, 1275, 1267, 1205, 1142, 1122, 1103, 1046, 990, 1059, 1129, 1120, 1068, 1096, 1195, 1254, 1241, 1246, 1295, 1343, 1348, 1337, 1327, 1277, 1227, 1217, 1207, 1174, 1098, 1046, 1065, 1115, 1122, 1115, 1108, 1098, 1089, 1079, 1070, 1041, 1011, 1007, 1074, 1175, 1175, 1133, 1092, 1073, 1012, 935, 929, 1011, 1094, 1081, 1068, 1107, 1146, 1185, 1224, 1261, 1298, 1264, 1230, 1244, 1259, 1231, 1203, 1170, 1136, 1145, 1154, 1119, 1084, 1066, 1134, 1217, 1214, 1136, 1058, 1094, 1129, 1165, 1200, 1224, 1248, 1200, 1153, 1163, 1174, 1141, 1109, 1121, 1134, 1213, 1292, 1355, 1333, 1288, 1243, 1238, 1233, 1229, 1224, 1279, 1333, 1236, 1138, 1115, 1178, 1240, 1217, 1197, 1176, 1222, 1268, 1304, 1340, 1276, 1212, 1154, 1095, 1108, 1121, 1189, 1258, 1254, 1251, 1194, 1138, 1044, 949, 967, 1070, 1103, 1049, 1019, 988, 1001, 1013, 1038, 1148, 1192, 1151, 1076, 1088, 1145, 1203, 1201, 1198, 1195, 1193, 1187, 1181, 1175, 1169, 1094, 1020, 1026, 1118, 1192, 1265, 1245, 1224, 1214, 1204, 1194, 1184, 1193, 1203, 1212, 1222, 1286, 1349, 1361, 1287, 1207, 1127, 1090, 1053, 1042, 1117, 1235, 1267, 1221, 1175, 1123, 1071, 1070, 1068, 1067, 1065, 1023, 980, 1009, 1038, 1026, 1013, 1073, 1132, 1147, 1163, 1136, 1108, 1104, 1100, 1096, 1092, 1009, 927, 896, 951, 999, 1048, 1102, 1156, 1184, 1212, 1197, 1182, 1204, 1226, 1205, 1185, 1167, 1150, 1133, 1116, 1097, 1077, 1063, 1049, 1049, 1135, 1221, 1221, 1203, 1185, 1162, 1138, 1088, 1038, 1059, 1080, 1026, 972, 961, 949, 947, 944, 1017, 1175, 1291]
844A291L1m4m4j6j5j6j5l9l9m0l9N0N0QPRRl4l3K4K4K4K5K1K2j6j6k6N9O4k1p6RQ4Q4L0L0
839A426P3P2J66J65J28J28J14J99K60K60L68N12N48O92J271J928J806K94j651k536j999r43
837C281m19m19l95j94p3p3o3o3j9o1q8kJm2o1K5K4K5M4Q6L5n0p0k6J3l0p5p4n5n4j1j1N0N0
833A206N1N0M1M1n9n9k7k6k7k7o9o9OR1Q7Km1KPPJ0RN1N0m9n0K6K5K5K5k8k9O7J10L5j07j16
828A241k9M1M2k5k4l2l1j8K4L9m7m4M2O3O3llj7j6j7j6nonnL6L5o4o4j10j10oP9J34M9n2n2
823A087O1J04L1n5k1K2pqqrrrk1k2N0N0J4J5K7P1L7m8j21p9j0j0qqjkM2M1pon0n0K8K8m3m3
819A053j4j3j4j3N5N6L7m8o6K0O6O6J6J5J0J0j6j02o9P5J30M5j12j12j5j6K8K7N1N1p8p8O2
815A107O1J6p1mQ1M2j01q1MJ8J8llM0L9K2K2m5m4k4O2O8j9q4JM8M8n9n9M0M1K2K3K2K2K2K2
$$ y = [1291, 1322, 1278, 1234, 1218, 1203, 1187, 1172, 1133, 1094, 1054, 1015, 1065, 1115, 1123, 1130, 1139, 1148, 1114, 1081, 1105, 1129, 1153, 1178, 1199, 1221, 1205, 1189, 1163, 1222, 1286, 1265, 1189, 1198, 1282, 1366, 1396, 1426, 1499, 1571, 1737, 1902, 2030, 2158, 2272, 2471, 2731, 2991, 3359, 3871, 4419, 5111, 6382, 8310, 10116, 10410, 8759, 6223, 4224, 3281, 2862, 2443, 2048, 1854, 1781, 1708, 1645, 1582, 1563, 1502, 1414, 1412, 1413, 1371, 1310, 1335, 1359, 1384, 1428, 1514, 1549, 1499, 1429, 1403, 1416, 1386, 1311, 1237, 1182, 1128, 1117, 1106, 1156, 1206, 1257, 1307, 1348, 1389, 1330, 1271, 1244, 1218, 1191, 1164, 1095, 1026, 1032, 1123, 1210, 1212, 1171, 1173, 1180, 1187, 1197, 1206, 1257, 1307, 1258, 1208, 1234, 1259, 1284, 1309, 1281, 1252, 1319, 1429, 1464, 1357, 1241, 1212, 1253, 1295, 1270, 1246, 1214, 1183, 1165, 1189, 1228, 1181, 1137, 1179, 1242, 1305, 1302, 1299, 1282, 1266, 1249, 1233, 1228, 1222, 1217, 1212, 1248, 1283, 1219, 1155, 1045, 935, 929, 1008, 1142, 1191, 1139, 1087, 1148, 1252, 1283, 1228, 1207, 1229, 1222, 1214, 1206, 1197, 1188, 1179, 1158, 1136, 1186, 1236, 1250, 1265, 1292, 1363, 1400, 1352, 1231, 1152, 1142, 1132, 1124, 1116, 1115, 1113, 1155, 1196, 1189, 1183, 1133, 1083, 1111, 1139, 1096, 1053, 1039, 1026, 1012, 999, 1054, 1110, 1147, 1099, 1033, 1053, 1119, 1185, 1201, 1216, 1226, 1236, 1220, 1118, 1049, 1124, 1254, 1299, 1187, 1075, 1060, 1044, 1072, 1099, 1150, 1201, 1123, 1045, 1107, 1168, 1184, 1113, 1109, 1190, 1232, 1131, 1050, 1054, 1072, 1090, 1087, 1084, 1124, 1163, 1185, 1207, 1162, 1118, 1094, 1156, 1224, 1205, 1121, 1122, 1170, 1218, 1159, 1100, 1140, 1181, 1203, 1226, 1248, 1270, 1292, 1314]
810A314m9m9j1j2j1j2j1j0L2L2m3m3K9K8j1j2j2j1K3K3O6O6qrn2n2MMNMm8m8m7m8P1P2P7r
805A232k0j9k0k0n0L6Q7Q7p8p8lQ3O5k1r5r6RQRRN5N5O1k5n4n4J3J2L3L3K8K8rr4n2L4N4N5
801A298J7J7O7O8K5K5M7M7M7M7O2O2J14J14K78M22M44L02M1k72m82m81l92k50j07k1J5J4j08
797A460j94j15K9R0Nn1n1M3M4K0K1K1K0k6k7M0L9n2j38o6K0K4K3m2m2J9J8J9J9RQRRJ3J2O1
793A291k5l2l3L4L4j2j2L0L1j1j0n4n3m8m8Q1Q0M9M8k3k2j00r9k4O2L9m6m1M4L9M0k7k7K3
789A178K2k0k1m5m6kll5l4PN0K1o5o2K3O0O0nm8j4P2P1j4q0l8N5N6J9o7m2%j4j5j0rO4J07
784A176O0k6p3p3K1K2j1j0j1j0L8L8L7L8n0m9ppK0K0K0K0jjm3m3j6j6K7K7K3K4m8m8J2J3J3
780A106J3j9j9j9j8L9L9L9M0l1l1j3P3M8l8j06o3L7P9L7m8o6k4M7M8k8k7J3J3L8ml5N2Q2l
$$ y = [1314, 1265, 1216, 1205, 1193, 1182, 1170, 1159, 1149, 1181, 1213, 1170, 1127, 1156, 1184, 1173, 1161, 1149, 1138, 1161, 1184, 1250, 1316, 1308, 1299, 1247, 1195, 1199, 1203, 1208, 1212, 1164, 1116, 1069, 1021, 1092, 1164, 1241, 1232, 1212, 1193, 1173, 1153, 1103, 1139, 1226, 1313, 1235, 1157, 1154, 1237, 1302, 1281, 1186, 1090, 1099, 1107, 1116, 1125, 1180, 1235, 1296, 1271, 1217, 1163, 1176, 1188, 1221, 1254, 1282, 1310, 1301, 1207, 1155, 1189, 1243, 1298, 1315, 1332, 1399, 1467, 1492, 1517, 1564, 1611, 1658, 1705, 1767, 1829, 1943, 2057, 2335, 2757, 3201, 3503, 3544, 3272, 2790, 2309, 1917, 1667, 1560, 1539, 1554, 1568, 1460, 1266, 1151, 1180, 1270, 1275, 1224, 1173, 1216, 1260, 1280, 1301, 1322, 1342, 1316, 1289, 1329, 1368, 1316, 1178, 1112, 1132, 1156, 1179, 1137, 1095, 1114, 1132, 1151, 1170, 1179, 1187, 1196, 1205, 1218, 1230, 1291, 1266, 1234, 1201, 1235, 1269, 1257, 1245, 1275, 1306, 1295, 1285, 1231, 1178, 1130, 1082, 1163, 1243, 1292, 1340, 1317, 1295, 1195, 1096, 1072, 1134, 1173, 1127, 1086, 1130, 1169, 1209, 1182, 1155, 1178, 1200, 1180, 1159, 1114, 1068, 1066, 1063, 1028, 994, 1001, 1051, 1072, 1007, 945, 968, 1028, 1088, 1083, 1035, 1021, 1093, 1164, 1150, 1070, 1032, 1087, 1143, 1162, 1095, 1053, 1053, 1039, 1024, 1014, 1005, 1069, 1176, 1236, 1210, 1137, 1064, 1085, 1107, 1096, 1086, 1075, 1065, 1103, 1141, 1178, 1216, 1166, 1117, 1110, 1103, 1123, 1143, 1163, 1183, 1182, 1181, 1138, 1095, 1079, 1063, 1090, 1117, 1140, 1164, 1116, 1068, 1080, 1093, 1106, 1119, 1100, 1081, 1062, 1044, 1083, 1122, 1161, 1201, 1170, 1139, 1126, 1199, 1247, 1209, 1103, 1040, 1077, 1156, 1193, 1145, 1079, 1055, 1102, 1150, 1122, 1095, 1108, 1121, 1159, 1155, 1120, 1172, 1254, 1251]
775A251m8nM8Ol4QP3P2n3n3J9J8k4k5O1O1j0j0RRRJ0l7l6l6l6nmmml3l3l2l3L7L8nnonnnR2
770A235R2r4r3m5m4N5N5P7P6P7P7p9p8p8p8M8M7M8M8J83J83Q4Q3J02J03K20L05M46N89M21
766D065o4n85p28n13l14j95j09m4m5o3o4o3o4m4m5K7K7O7O8O8O7r2r2QPl0l1l1l1l6l7l6l7
762A011mmL8L8LLM6M6q8q8J2J2K5K4j8j8P1P0jjOOPOo5o5L4L5M1M0M1M0LMm0m0l3l4l3l4O1
757A157O0O0O0o4o5o5o4k9k9O5O6J3p3l5N0N5l1l1N5K8n8m7m6K9L0L0L0J7J7k5k6L6L6ppj6
753A176j5k7N9J03J7q6q6j1j2j1j1O3O4K1K0k3k4k4k4o6o5p1J4J05J04m7m7RRRRM4M5M9l6
749A234n8n8k1k1m8m8K4K3O9O9n4n4l1N5OPppL6L6l5l5QQMNM1M2j5j01n9K8J14J15J1p4k2
744A187k1M4M4noonLLLLPPl6l7J3J2l1l0popoM5M5KLn2n1qrN6N5N5N5m8m8m9m8M9M9OOk0k1
$$ y = [1251, 1203, 1198, 1246, 1252, 1218, 1226, 1299, 1371, 1318, 1265, 1284, 1302, 1278, 1253, 1314, 1375, 1365, 1355, 1364, 1373, 1382, 1392, 1355, 1319, 1283, 1247, 1242, 1238, 1234, 1230, 1197, 1164, 1132, 1099, 1136, 1174, 1169, 1164, 1158, 1153, 1148, 1143, 1235, 1327, 1233, 1140, 1095, 1051, 1106, 1161, 1238, 1314, 1391, 1468, 1389, 1311, 1233, 1155, 1203, 1250, 1298, 1346, 1529, 1712, 1796, 1879, 1981, 2084, 2304, 2609, 3055, 3644, 4065, 4001, 3416, 2688, 2175, 1861, 1666, 1557, 1513, 1468, 1405, 1341, 1278, 1214, 1170, 1125, 1152, 1179, 1246, 1314, 1382, 1449, 1357, 1265, 1273, 1280, 1250, 1219, 1188, 1157, 1121, 1084, 1048, 1011, 1007, 1003, 1041, 1079, 1082, 1085, 1131, 1177, 1089, 1001, 1013, 1025, 1050, 1074, 1056, 1038, 1109, 1179, 1178, 1177, 1183, 1189, 1196, 1202, 1137, 1072, 1106, 1141, 1182, 1222, 1263, 1303, 1306, 1310, 1270, 1230, 1197, 1163, 1130, 1096, 1157, 1217, 1277, 1337, 1273, 1208, 1143, 1079, 1050, 1021, 1086, 1152, 1165, 1092, 1057, 1107, 1162, 1131, 1100, 1155, 1183, 1125, 1078, 1032, 1061, 1091, 1121, 1151, 1168, 1185, 1160, 1134, 1170, 1206, 1199, 1192, 1176, 1161, 1134, 1193, 1296, 1313, 1227, 1141, 1130, 1118, 1107, 1096, 1159, 1223, 1244, 1264, 1241, 1217, 1193, 1169, 1103, 1038, 967, 981, 1086, 1190, 1143, 1096, 1105, 1114, 1123, 1132, 1176, 1221, 1270, 1234, 1176, 1118, 1097, 1076, 1028, 980, 1004, 1027, 1096, 1165, 1111, 1057, 1026, 1081, 1087, 1094, 1087, 1080, 1116, 1152, 1117, 1082, 1090, 1098, 1102, 1107, 1148, 1190, 1175, 1074, 1015, 1043, 1157, 1272, 1283, 1209, 1187, 1166, 1210, 1254, 1249, 1243, 1237, 1232, 1235, 1238, 1241, 1244, 1251, 1258, 1222, 1185, 1198, 1210, 1179, 1149, 1142, 1136, 1129, 1123, 1168, 1213, 1215, 1218, 1166, 1115, 1107, 1098, 1154, 1209, 1264, 1319, 1271, 1223, 1174, 1126, 1175, 1224, 1230, 1236, 1216, 1195]
739A195k1k0Q9R0J8J8o6o7o6o7K5K4K5K4j2j2j2j2k0k0K3K3OPo5o4L8L8L8L9r5r5NNO3O3r
734A133qJ1J1N3N4k4k5o7o7m4m4N5N6k5k4P5P5M2M2n8n8k0k0k0k0l9l9O1O2J7J8k5k5o0o1
730I92L9L9M2M1l0l0K1K1K1K1l7l7L5L5j3j4n6n6NNNNJ4J3J3J3K0K0K1K0rj0n2n2L3L3L2L3
725A196l3l4J0RJ9J8J3J3J3p3o7o7J9J9J9K0L5L5L5L6L8L8qr4q2Lpql1l1M1M0p0p0p6J0N9
721I87N9j1r7n3L3P9P9J9J9J9J9o5o6L4L4k0k1lQ3P2j5l2l2j3j3j3j3J8J7k6k5j4j4j4j4l6
716I61l6L5L5P9P9QQk2k3K1K0l2l2J1J1J0J0J0J0k3k3J26J25mj46j09L3J44N8m3m2m2m2JJ
712A177rqL4J20Q7n5j17l2L3L2l3l4M4M4M4M4Q3Q2m5q8jQ4Q2mp4p4l7l6k8k7M3Q5M8l8p6J0
708A360Q8J31J13J12R7R7lmr7r8j41j40m4m5m4m4j8j9Q2Q1L2L2l9m0j1j1K7K6J1p5r8r9LK
$$ y = [1195, 1174, 1154, 1243, 1333, 1351, 1369, 1303, 1236, 1170, 1103, 1128, 1152, 1177, 1201, 1189, 1177, 1165, 1153, 1133, 1113, 1136, 1159, 1165, 1172, 1107, 1043, 1081, 1119, 1157, 1196, 1101, 1006, 1011, 1016, 1079, 1142, 1133, 1125, 1136, 1147, 1200, 1254, 1230, 1205, 1138, 1071, 1027, 983, 1038, 1094, 1069, 1045, 1120, 1195, 1237, 1279, 1221, 1163, 1143, 1123, 1103, 1083, 1044, 1005, 1066, 1128, 1145, 1163, 1138, 1113, 1053, 992, 1031, 1070, 1112, 1153, 1123, 1093, 1114, 1135, 1156, 1177, 1140, 1103, 1138, 1173, 1160, 1146, 1090, 1034, 1039, 1044, 1049, 1054, 1068, 1081, 1094, 1107, 1127, 1147, 1168, 1188, 1179, 1169, 1117, 1065, 1098, 1131, 1163, 1196, 1163, 1129, 1139, 1148, 1167, 1185, 1198, 1211, 1224, 1151, 1084, 1017, 1036, 1055, 1074, 1094, 1129, 1164, 1199, 1235, 1273, 1311, 1303, 1209, 1127, 1130, 1123, 1115, 1084, 1053, 1094, 1134, 1064, 994, 918, 928, 987, 1046, 1035, 938, 885, 918, 997, 1076, 1095, 1114, 1133, 1152, 1087, 1021, 1055, 1089, 1069, 1048, 1045, 1128, 1200, 1185, 1153, 1121, 1108, 1095, 1082, 1069, 1087, 1104, 1078, 1053, 1039, 1025, 1011, 997, 961, 925, 960, 995, 1074, 1153, 1161, 1169, 1147, 1124, 1145, 1165, 1133, 1101, 1112, 1123, 1133, 1143, 1153, 1163, 1140, 1117, 1243, 1368, 1364, 1218, 1109, 1142, 1286, 1344, 1301, 1259, 1217, 1175, 1176, 1177, 1168, 1160, 1194, 1314, 1401, 1346, 1229, 1197, 1230, 1262, 1229, 1195, 1239, 1283, 1327, 1371, 1454, 1536, 1491, 1403, 1402, 1486, 1568, 1564, 1490, 1416, 1379, 1343, 1315, 1288, 1331, 1416, 1464, 1426, 1350, 1360, 1448, 1579, 1692, 1804, 1901, 1998, 1995, 1991, 1894, 1796, 1655, 1515, 1471, 1426, 1382, 1338, 1320, 1301, 1383, 1464, 1496, 1528, 1489, 1449, 1438, 1427, 1454, 1480, 1491, 1416, 1318, 1219, 1222, 1224]
703A224LKJ7J7O0O0MMo8o8k1k0K2K2k0k0K3K3J1J1J1J1l2l3J4J00J07K1k5k5j9k0r1r1n9n8
699A097J3J3J9J9J9J9J4J4k8k9m9m9ooL2L1j1j1j1j2K7K6L0n5r8j2P1P2NOL2L2l9m0J7J7J7
694A186J7j0j0L3L3J9J9q1q2ppqpK5K6K5K6j9j8j9j8J6J6J6J6M6M5k6k6j1j1j1j1j0j0j0j0
690A142J6J7k7k6m1m1KKK8K8K7K8m9m8N1N1jkm4m4M7M7NMl5l6l5l6l1l1O9O8l6l7POK2K2K2
685A111K2l6l6l6l6K8K9K8K8KLKKm3m3N7N7J1J2o1o0M4M3k8k8j3j4N8N8O9P0l0l0j1j0n4n3
681A112o7o7k3k4L8L9L8L9%JJJN9O0o4o3n1L5N8N7L1L2j2j2j5j4K8K8p0p0m7L9N0N0j5j6k4
676A142k3k4k4Q7Q7j3j3J2J3J8o7o0o0OOJ2J3J2J2KKp0p0QQP9P9N8N8j3j3J1J1n5n5j5P1P2
672A304j5p5p5J9K0K3K3K3K3m4m4N1N1J4p1j18j17J1R6N4l2l0l1L5L5pqqpLMLMM1M1kkmmL8
$$ y = [1224, 1227, 1229, 1246, 1263, 1323, 1383, 1387, 1391, 1323, 1255, 1234, 1214, 1236, 1258, 1238, 1218, 1241, 1264, 1275, 1286, 1297, 1308, 1276, 1243, 1257, 1357, 1464, 1485, 1460, 1435, 1416, 1396, 1305, 1214, 1155, 1097, 1110, 1123, 1142, 1161, 1180, 1199, 1213, 1227, 1199, 1170, 1121, 1072, 1066, 1060, 1092, 1123, 1112, 1101, 1090, 1078, 1105, 1131, 1161, 1106, 1008, 996, 1067, 1139, 1144, 1150, 1182, 1214, 1175, 1135, 1152, 1169, 1186, 1203, 1193, 1183, 1216, 1249, 1268, 1287, 1206, 1124, 1117, 1110, 1102, 1095, 1120, 1146, 1171, 1197, 1178, 1160, 1141, 1123, 1139, 1155, 1171, 1187, 1233, 1278, 1252, 1226, 1215, 1204, 1193, 1182, 1172, 1162, 1152, 1142, 1158, 1175, 1148, 1122, 1081, 1040, 1042, 1044, 1072, 1100, 1127, 1155, 1106, 1058, 1109, 1160, 1159, 1157, 1113, 1069, 1116, 1163, 1168, 1172, 1137, 1101, 1066, 1030, 999, 968, 1037, 1105, 1069, 1032, 1039, 1045, 1067, 1089, 1111, 1133, 1097, 1061, 1025, 989, 1017, 1046, 1074, 1102, 1104, 1107, 1109, 1111, 1068, 1025, 1082, 1139, 1150, 1162, 1101, 1041, 1085, 1128, 1100, 1072, 1059, 1045, 1103, 1161, 1230, 1300, 1270, 1240, 1229, 1219, 1165, 1112, 1045, 978, 955, 931, 969, 1008, 1046, 1085, 1085, 1086, 1087, 1088, 1147, 1207, 1143, 1080, 1029, 1064, 1122, 1179, 1210, 1242, 1230, 1218, 1203, 1189, 1217, 1245, 1175, 1105, 1058, 1097, 1147, 1197, 1182, 1166, 1142, 1119, 1095, 1071, 1158, 1245, 1232, 1219, 1231, 1244, 1262, 1195, 1135, 1075, 1081, 1087, 1099, 1112, 1124, 1136, 1138, 1140, 1070, 1000, 1008, 1016, 1095, 1174, 1232, 1290, 1277, 1264, 1275, 1286, 1231, 1176, 1161, 1232, 1304, 1289, 1214, 1139, 1158, 1178, 1201, 1224, 1247, 1270, 1226, 1182, 1233, 1284, 1298, 1227, 1109, 992, 1003, 1099, 1153, 1121, 1091, 1060, 1095, 1130, 1123, 1115, 1107, 1100, 1103, 1107, 1110, 1114, 1155, 1196, 1194, 1192, 1188, 1184, 1222]
667A222L9K5K5j8j7M6M7Q9Mq3j68j31m6P3P2Lq3n0L6K5K6%J%Jp1p1K9K9M9M9M7M6qn1p5J1
662A122J06J05L1n5q2q3j6j7PPo1o2P5J18J8o7m7L7P9qn5j2L0L0l3l3O6O7J5J5n6n7m4m4N5
658A151N6L5L5l6l6%j%%LLLMj7j6n4n4oQ0Q2ll4QK2K2j4j4N7N8M0M0o1o0l8l9MMm8m9noK9
653A145K8j3n7l2N4L0j4n0pL8L7kjM0M1K0J9k3k3q9q9J2J1JKJJl3l3RJ0J0J0J1J0M5M6M5M6
648A256m7m6mmLLMLK8K8l8l8j0P7P6ro0o0L5L5m6m6llj3j2j3j3K1K2k1k2M1M0J7o9o7o7N6
643A034N6L0L0m1m1j8j8j7j8j9j8N2N3N0N0OPN7N7O2k3j19j19MNRJ0l3l4k3k3J9K0rrL4L3
639A096K2K2j5j6n3L3P5j0r7r6N4J41L5j08p5J0J9o6o1K4P1P0L2L3j4j4j4j5K7K7K7K7m3m3
634A105k5O0J11K5n0n0j3j3j3j3M6M7M7M6k8k7k8k8o0o0j4P2M6m0j32m6O6J08J4p1p6RN6N6
$$ y = [1222, 1261, 1286, 1311, 1293, 1276, 1322, 1369, 1458, 1462, 1379, 1211, 1080, 1034, 1107, 1179, 1182, 1099, 1049, 1085, 1110, 1136, 1136, 1137, 1137, 1138, 1067, 996, 1025, 1054, 1103, 1152, 1199, 1245, 1237, 1186, 1111, 1122, 1228, 1333, 1364, 1309, 1227, 1144, 1128, 1111, 1118, 1125, 1064, 1002, 1077, 1195, 1213, 1146, 1099, 1136, 1215, 1207, 1152, 1140, 1170, 1200, 1167, 1134, 1200, 1267, 1282, 1297, 1241, 1184, 1140, 1096, 1151, 1207, 1242, 1277, 1241, 1205, 1205, 1204, 1204, 1204, 1207, 1210, 1213, 1217, 1200, 1184, 1130, 1076, 1070, 1150, 1232, 1229, 1195, 1203, 1225, 1247, 1233, 1219, 1276, 1334, 1374, 1414, 1353, 1293, 1255, 1216, 1220, 1224, 1176, 1127, 1122, 1116, 1145, 1173, 1160, 1103, 1071, 1125, 1155, 1141, 1091, 1084, 1122, 1159, 1157, 1156, 1196, 1237, 1257, 1276, 1253, 1230, 1141, 1052, 1064, 1075, 1076, 1078, 1079, 1080, 1047, 1014, 1023, 1033, 1043, 1053, 1064, 1074, 1119, 1165, 1210, 1256, 1209, 1163, 1159, 1155, 1158, 1161, 1165, 1168, 1196, 1224, 1186, 1148, 1138, 1215, 1291, 1282, 1222, 1162, 1197, 1232, 1186, 1140, 1137, 1134, 1121, 1109, 1096, 1083, 1104, 1126, 1105, 1083, 1124, 1164, 1181, 1112, 1045, 978, 1034, 1090, 1120, 1150, 1109, 1068, 1050, 1032, 1015, 997, 978, 960, 1012, 1065, 1115, 1165, 1171, 1178, 1235, 1292, 1354, 1331, 1212, 1093, 1097, 1102, 1111, 1121, 1088, 1054, 1031, 1008, 1027, 1047, 1038, 1029, 1063, 1096, 1118, 1140, 1125, 1109, 1056, 1089, 1164, 1154, 1057, 961, 1015, 1156, 1191, 1083, 1008, 1018, 1037, 971, 910, 934, 1005, 1075, 1107, 1140, 1126, 1112, 1098, 1083, 1110, 1137, 1164, 1191, 1148, 1105, 1080, 1140, 1251, 1276, 1226, 1176, 1163, 1150, 1137, 1124, 1170, 1217, 1264, 1310, 1282, 1255, 1227, 1199, 1139, 1079, 1065, 1137, 1183, 1143, 1011, 965, 1031, 1139, 1153, 1082, 1006, 1015, 1071, 1127]
630A127k6k5M0M1nr1r0nO1O1O6O6K7K6j6j6NNNOn1n0qqQPQPL3L2L3L2K0K0k3k3j1j1q3q2L4
625A146L4L5L4LLm0l9J6J7k4k4mL8K5o1r8j2O2O2QPMNkm4o9J7M6M5k1k0m2m1KKO2O3qqN8N9
620A296J5J6m4m3m1m0J6N9J7o8m3M2L2L2kkjkllllj3j4K9L0n0n0qpQQQQJ5J6k8k7J5J4J5J4
615A210j3j3j4j3K6K6j2j2l7M8P2P1p6p6K4K4qqqrL8L7L7L7k6k6k6k6k0k0k0j9M6M6K3o3n4
611A166n5O3O3Qp7l4N1M1M1pP9J11K5j30j30o2K3J9J8j5j4j5j4M2M1M2M2mmmlj1j0j0j0rj0
606A247O2O1m9m8m9m9lkO3O4K3o2n7n7k6k6J7J6M4M3L8L9Qp7k9k9j5j5LQ9O6k0o6o6LLKLN7
601A206N8j4j4N9O0o9p0J0RRRM1M1l0l0l6l7l6l7j4j4K8K9M2M2jjj4j3j4j4lmlmJ1J0k6k7
597A139o1K4J00R9P9pl0l0l5l5l5l5K1K2K1K1L8L8L8L8l7l8l8l7K6K7r6r7r0mP5P6O5O5k9
$$ y = [1127, 1101, 1076, 1116, 1157, 1152, 1061, 971, 966, 1027, 1088, 1154, 1220, 1247, 1273, 1257, 1241, 1246, 1251, 1256, 1262, 1211, 1161, 1153, 1145, 1153, 1160, 1168, 1175, 1208, 1240, 1273, 1305, 1325, 1345, 1322, 1299, 1288, 1277, 1194, 1112, 1146, 1180, 1215, 1249, 1252, 1255, 1215, 1176, 1192, 1209, 1185, 1161, 1157, 1195, 1220, 1159, 1061, 1049, 1111, 1173, 1181, 1188, 1192, 1197, 1195, 1151, 1082, 1099, 1145, 1190, 1169, 1149, 1107, 1066, 1068, 1070, 1132, 1195, 1187, 1179, 1237, 1296, 1311, 1327, 1283, 1240, 1199, 1159, 1175, 1234, 1251, 1183, 1140, 1182, 1214, 1246, 1244, 1242, 1241, 1239, 1236, 1233, 1230, 1227, 1214, 1200, 1229, 1259, 1209, 1159, 1151, 1144, 1152, 1160, 1168, 1176, 1191, 1207, 1179, 1152, 1167, 1181, 1196, 1210, 1197, 1184, 1170, 1157, 1183, 1209, 1197, 1185, 1148, 1196, 1268, 1339, 1263, 1187, 1211, 1235, 1227, 1219, 1211, 1202, 1240, 1277, 1314, 1351, 1325, 1299, 1273, 1247, 1227, 1207, 1187, 1168, 1214, 1260, 1283, 1220, 1166, 1111, 1174, 1237, 1245, 1168, 1134, 1185, 1226, 1267, 1260, 1339, 1450, 1475, 1345, 1215, 1153, 1176, 1195, 1213, 1198, 1184, 1169, 1155, 1197, 1238, 1280, 1322, 1318, 1314, 1310, 1307, 1296, 1286, 1276, 1266, 1257, 1247, 1309, 1370, 1321, 1273, 1224, 1175, 1172, 1170, 1233, 1297, 1320, 1258, 1201, 1144, 1118, 1092, 1109, 1125, 1169, 1212, 1250, 1289, 1297, 1220, 1191, 1162, 1147, 1132, 1135, 1224, 1290, 1270, 1204, 1138, 1141, 1144, 1146, 1149, 1206, 1264, 1250, 1236, 1295, 1355, 1286, 1216, 1226, 1235, 1244, 1253, 1294, 1335, 1305, 1275, 1239, 1202, 1166, 1129, 1115, 1101, 1129, 1158, 1200, 1242, 1241, 1240, 1226, 1213, 1199, 1185, 1182, 1178, 1175, 1171, 1182, 1192, 1166, 1139, 1078, 1102, 1202, 1301, 1380, 1373, 1343, 1313, 1278, 1243, 1208, 1173, 1194, 1216, 1237, 1258, 1296, 1334, 1372, 1410, 1373, 1335, 1297, 1260, 1286, 1313, 1217, 1120, 1030, 1026, 1101, 1177, 1242, 1307, 1278]
592A278l0m6M0O4O3n5n5j2j2j8j9j8j8N6N6j5j5o2o3j9k0L9L8J04J05M5m0o4o3p4p4N0M9J1
588A206p5p5J1L0L0l6l7M0L9l1l2O2O2L9m7o6o7%%N8N9J6J6OOOPr1r1L8L8N8N8m1m2nnm8m8
583A048PPP9P9J3J3N6N6m9m8m9m8L0L0j3j3m4m5m5m5J2J1Q3Q3L2L2j0j1l3l2L8L9rqrrJ3J3
579A254n8n8N6N7N7N7l6l5l6l5J1J1J1J1k6k6k6k6J0RN3N2M1M1q7q7NNNOk3k2k2k2M1M1M1
574A250M1o8o7k4k5QQPQm8m7nnOOOON6N6j5j6j0j0j0j0J1J2Q3Q2l0l1J2J3l3l3j5P0J1p5p0
569A105J6J13J12Rp7j02j03q5JQ2Q2M5M4k2k3k2k3J4J3q2q1kQ4M6m0n9K7P3P3k8k9M3M3L0
565A277L0j2j3ONl7l8j2j2N4N4N5l1q2q3k1k1K7n8o3o3N5N4J01J4l7l7L1L1J3p3r0mM3M2N5
561A160N5O0k6n8n8k1k1K3K3K3K3j5j4K9K9n6n6J0RL4n1m7m6L2L2P5P5KLm1m0n5n5M0M0O9
$$ y = [1278, 1248, 1202, 1242, 1306, 1369, 1314, 1259, 1247, 1235, 1217, 1198, 1180, 1162, 1218, 1274, 1259, 1244, 1182, 1119, 1100, 1080, 1119, 1157, 1261, 1366, 1411, 1371, 1307, 1244, 1170, 1096, 1146, 1195, 1206, 1131, 1056, 1067, 1097, 1127, 1091, 1054, 1094, 1133, 1102, 1070, 1132, 1194, 1233, 1186, 1120, 1053, 1053, 1053, 1111, 1170, 1186, 1202, 1208, 1214, 1220, 1227, 1136, 1045, 1083, 1121, 1179, 1237, 1196, 1154, 1149, 1144, 1096, 1048, 1055, 1062, 1141, 1220, 1233, 1246, 1302, 1358, 1309, 1261, 1212, 1164, 1194, 1224, 1211, 1198, 1154, 1109, 1064, 1019, 1031, 1042, 1125, 1208, 1240, 1272, 1262, 1251, 1218, 1186, 1224, 1263, 1254, 1246, 1237, 1228, 1241, 1254, 1196, 1138, 1194, 1251, 1308, 1365, 1329, 1294, 1258, 1223, 1234, 1245, 1256, 1267, 1241, 1215, 1189, 1163, 1173, 1182, 1235, 1287, 1328, 1369, 1282, 1195, 1200, 1205, 1210, 1216, 1193, 1171, 1149, 1127, 1168, 1209, 1250, 1291, 1223, 1156, 1132, 1107, 1115, 1123, 1130, 1138, 1090, 1043, 1038, 1033, 1039, 1045, 1051, 1057, 1113, 1169, 1154, 1138, 1128, 1118, 1108, 1098, 1109, 1121, 1204, 1286, 1256, 1225, 1237, 1250, 1217, 1184, 1169, 1239, 1250, 1175, 1105, 1121, 1234, 1346, 1355, 1278, 1176, 1073, 988, 989, 1071, 1153, 1198, 1242, 1220, 1197, 1175, 1152, 1166, 1179, 1097, 1016, 1014, 1098, 1144, 1104, 1045, 1072, 1145, 1218, 1190, 1161, 1204, 1247, 1277, 1307, 1295, 1282, 1288, 1293, 1256, 1218, 1206, 1194, 1248, 1302, 1357, 1326, 1244, 1161, 1140, 1119, 1146, 1088, 1025, 962, 1017, 1071, 1172, 1186, 1149, 1112, 1143, 1174, 1187, 1114, 1024, 1020, 1063, 1105, 1160, 1215, 1275, 1249, 1191, 1133, 1112, 1091, 1114, 1137, 1160, 1183, 1168, 1154, 1183, 1212, 1156, 1100, 1110, 1119, 1153, 1102, 1055, 1009, 1041, 1073, 1148, 1223, 1225, 1228, 1187, 1147, 1092, 1037, 1077, 1117, 1186]
556A186j6j1j1J1J1J1J1J4J3l0k9n1n0ppK7K8j5j5R0Q9M7M6KKKKl2l3p6p5M0M0LKk0O5J36
552A400N1o2o3k5k5J4J3J4J3o8o7MLl2l3NMJ0p6l9M7J41N5m8m9J5J6O3k2q7q6QQL7L8L2L2
547A241Q9Kj00j01rP6P1P1QPP9P9M2M1M2M1J0Rl4l3M1M0M1M0Q0Q0Q0P9J64J63J34M9K0o6j23
543B453j23q8q7j53j53j56p1j8j9l5l5l5l5J0J0J1J0m1m2m1m1K6K6L2n4m4m5pqJJP2P2RQR
538A419Rk5k4kQ5N5N5J8J7K4K3p7p7PPj0r6o4K3M0M0k0k0k0k1j4j5j5j5o6o5L4L5J7J8J7J8
534A315j2j3j2j2N6N6J3J3K5K6j7j6k5k5o8o8J4J4J4J4k5k4M6M7M7M6n3n3ppL6L6M7M6k8j14
530A332n8K8O6k1n3n3n4n3qP8J20L5p2p2l4l4L7L8Q1Q0NMNMj7j7K1K0j8j04j04j8K8K7L3L2
525A284J2J1J1J1N3N3J0J0M7M7R5Rk5k6J26J26R2R2M9N0M3M4Q7Q6O2O2L9m6j12j12p4p5o4
$$ y = [1186, 1170, 1159, 1148, 1159, 1170, 1181, 1192, 1206, 1219, 1189, 1160, 1109, 1059, 1052, 1045, 1072, 1100, 1085, 1070, 1160, 1249, 1296, 1342, 1344, 1346, 1348, 1350, 1318, 1285, 1209, 1134, 1174, 1214, 1217, 1219, 1199, 1264, 1400, 1451, 1389, 1326, 1301, 1276, 1290, 1303, 1317, 1330, 1262, 1195, 1199, 1202, 1170, 1137, 1142, 1146, 1156, 1080, 1041, 1088, 1229, 1284, 1236, 1187, 1202, 1218, 1281, 1259, 1172, 1086, 1094, 1102, 1139, 1177, 1209, 1241, 1330, 1332, 1232, 1131, 1122, 1198, 1269, 1340, 1348, 1355, 1434, 1513, 1555, 1596, 1638, 1679, 1689, 1698, 1664, 1631, 1672, 1712, 1753, 1793, 1873, 1953, 2033, 2112, 2276, 2439, 2573, 2622, 2642, 2576, 2453, 2330, 2242, 2155, 2002, 1849, 1693, 1622, 1604, 1585, 1550, 1515, 1480, 1445, 1455, 1465, 1476, 1486, 1445, 1403, 1362, 1321, 1347, 1373, 1405, 1351, 1307, 1262, 1255, 1247, 1248, 1249, 1321, 1393, 1402, 1410, 1419, 1428, 1403, 1379, 1377, 1462, 1517, 1572, 1590, 1607, 1631, 1654, 1577, 1500, 1507, 1514, 1504, 1408, 1344, 1367, 1407, 1447, 1427, 1407, 1387, 1366, 1352, 1337, 1322, 1307, 1241, 1176, 1210, 1245, 1262, 1280, 1297, 1315, 1303, 1290, 1278, 1266, 1322, 1378, 1391, 1404, 1429, 1455, 1438, 1422, 1397, 1372, 1304, 1236, 1250, 1264, 1278, 1292, 1267, 1243, 1289, 1336, 1383, 1429, 1376, 1323, 1316, 1309, 1345, 1381, 1428, 1474, 1446, 1332, 1274, 1302, 1368, 1347, 1294, 1241, 1187, 1134, 1126, 1204, 1324, 1359, 1287, 1215, 1181, 1147, 1184, 1222, 1303, 1383, 1388, 1392, 1397, 1401, 1384, 1367, 1388, 1408, 1390, 1286, 1182, 1164, 1192, 1219, 1252, 1284, 1296, 1307, 1318, 1329, 1382, 1435, 1445, 1455, 1502, 1549, 1644, 1653, 1628, 1602, 1728, 1854, 1946, 2038, 2087, 2137, 2180, 2224, 2311, 2397, 2459, 2521, 2560, 2514, 2402, 2290, 2216, 2141, 2077]
521B077o3o4o4j25j25n0L5O5k0r0r0r4qP3P2K3K2m9m8p4p4l1l0N6N6J3J3L2L1J0J1l0l0M1
517A471M1j6j6K7J12P2p0j05j9K4K4j3j4k8k8p1p1ooL7L7j2j3j2j2N1N1N2N1j3j3j3j3J0J0
513A506L1L1L4L3l8l8j0rj0j0nmm8m8K3K2K2K2Q0Q0Nq0n5L0P7P7kkk3k4rrJ2J3N4N5R2R1N0
508B016l5n7K9O3O3K6K6J13J13J07J94L36L37K35L5j19k05k64k64j79r3j14j15q3LM5m0j16
504B057j16J5J02O7O7KJM0M0lq9o3P9J13K7n9o0POj%M2M2n7n7nQ1O4O3O9O9J08J09L7L6o0
500B773o0j8j7L0L1M9J34J66Q1L4L4R4R5J37J37J59J58Q7Q8J07J07K01K02J59P3P3P3J08K2
497E317n8n9j7j7j98j97r6j1n3j39j32j31r5r4j07j06l6l5NOr8j83k00j13o7o8q9r0m8m7p4
493B670p4n3n2l2l2k6j12j53j52k6O0M1m5r1r1KKKKo7o8k5k4LLLLn5n5n5n5k4k5k4k4N6N6
$$ y = [2077, 2014, 1950, 1886, 1761, 1636, 1586, 1621, 1686, 1666, 1576, 1486, 1392, 1384, 1457, 1529, 1552, 1574, 1525, 1477, 1403, 1329, 1298, 1268, 1324, 1380, 1393, 1406, 1438, 1469, 1479, 1490, 1460, 1430, 1471, 1512, 1496, 1480, 1507, 1619, 1691, 1621, 1516, 1497, 1521, 1545, 1532, 1518, 1490, 1462, 1391, 1320, 1314, 1308, 1345, 1382, 1370, 1357, 1345, 1333, 1384, 1435, 1487, 1538, 1525, 1512, 1499, 1486, 1496, 1506, 1537, 1568, 1602, 1635, 1597, 1559, 1549, 1540, 1530, 1520, 1515, 1511, 1463, 1415, 1438, 1460, 1482, 1504, 1584, 1664, 1669, 1589, 1534, 1564, 1641, 1718, 1716, 1714, 1691, 1667, 1658, 1649, 1661, 1674, 1728, 1783, 1875, 1966, 2016, 1981, 1924, 1953, 2016, 2079, 2105, 2131, 2244, 2357, 2464, 2658, 2994, 3331, 3566, 3601, 3482, 3277, 3013, 2749, 2570, 2477, 2363, 2248, 2165, 2168, 2213, 2173, 2057, 1941, 1956, 2058, 2125, 2192, 2194, 2195, 2235, 2275, 2272, 2183, 2120, 2199, 2312, 2339, 2280, 2220, 2227, 2233, 2232, 2232, 2274, 2316, 2259, 2202, 2197, 2278, 2342, 2405, 2474, 2543, 2651, 2760, 2797, 2833, 2773, 2713, 2695, 2678, 2708, 2739, 2788, 2922, 3088, 3169, 3203, 3237, 3331, 3426, 3563, 3700, 3859, 4017, 4104, 4192, 4299, 4406, 4607, 4809, 4968, 5041, 5114, 5187, 5295, 5317, 5259, 5200, 5183, 5166, 4968, 4771, 4675, 4664, 4611, 4472, 4340, 4209, 4114, 4020, 3913, 3807, 3771, 3736, 3741, 3747, 3649, 3466, 3266, 3153, 3086, 3018, 2929, 2839, 2791, 2744, 2670, 2596, 2543, 2491, 2459, 2427, 2401, 2289, 2136, 1984, 1958, 2018, 2059, 2014, 1923, 1832, 1834, 1836, 1838, 1840, 1773, 1705, 1680, 1656, 1659, 1662, 1665, 1668, 1613, 1558, 1503, 1448, 1424, 1399, 1375, 1351, 1407, 1463]
488A463L3n3p4p4K1K0J26J26J06l7r6r6K3K3o3o4M1J25O0k5k6O0Q0ok4k3l3l3q0MO6O5q6q6
484A463rrj0rOOOOl5l6l5l5K7K8K8K8J4J3N6N7L9L9o0o1K2K2K8n9n6n7L8L8J10J09J44J43
480A999J0j33j73q6j0rm7m7K3K4m8m8j1j1j1j1O2O1O7j9l8l8q1q1n3L2Q4Q4p5p5p5p5J2J1
476A214l1l1k8k8J5J5OOP8P7O1O1J8J7O2O1rj0J01J01J02J01K91K91J40j75l59l59j94j93
472A401m4m3K8K7j0j1O1O1J3J2l0l0l1l0J2J3r9r9n7n6P0P1P0P1k5k4k4k4p8p7P9J65J17k6
468A453o9o9M1M1M1M1j8j8N3N4MNMNppR2J79J41kj59j59j15j16p3p4N7N7J4J4j2j3L0L0ll
463A439M0M0L4L4qrJ7J7j12j11J9J8J9J9RJ0RJ0J8J8k1k2J8O1J8o7j35m9llk1k2%%k2k1M9
459A290N0P1P2n7n7l2l3l2l3kkK0J9j7j7P8P8J2p3m9olkk1k1n5n5J7J6K5K5p0p0j9O7J38N2
$$ y = [1463, 1496, 1443, 1369, 1295, 1316, 1336, 1462, 1588, 1694, 1657, 1561, 1465, 1488, 1511, 1448, 1384, 1425, 1550, 1610, 1585, 1559, 1619, 1699, 1693, 1669, 1646, 1613, 1580, 1500, 1504, 1570, 1635, 1549, 1463, 1454, 1445, 1435, 1426, 1432, 1438, 1444, 1450, 1415, 1379, 1344, 1309, 1336, 1364, 1392, 1420, 1434, 1447, 1503, 1560, 1599, 1638, 1578, 1517, 1539, 1561, 1589, 1530, 1474, 1417, 1455, 1493, 1603, 1712, 1856, 1999, 2009, 1876, 1703, 1617, 1607, 1598, 1551, 1504, 1527, 1551, 1503, 1455, 1444, 1433, 1422, 1411, 1473, 1534, 1601, 1582, 1544, 1506, 1425, 1344, 1291, 1323, 1407, 1491, 1416, 1341, 1266, 1191, 1203, 1214, 1183, 1152, 1124, 1096, 1111, 1126, 1132, 1138, 1216, 1293, 1354, 1415, 1433, 1450, 1512, 1573, 1564, 1554, 1655, 1756, 1858, 1959, 2250, 2541, 2681, 2506, 2147, 1788, 1594, 1401, 1357, 1314, 1342, 1369, 1359, 1348, 1409, 1470, 1483, 1495, 1465, 1435, 1404, 1374, 1386, 1399, 1300, 1201, 1144, 1088, 1158, 1229, 1299, 1370, 1345, 1321, 1297, 1273, 1195, 1118, 1197, 1362, 1479, 1453, 1384, 1315, 1356, 1397, 1438, 1479, 1461, 1443, 1496, 1550, 1554, 1559, 1563, 1568, 1561, 1554, 1646, 1825, 1966, 1964, 1805, 1646, 1531, 1415, 1342, 1268, 1325, 1382, 1396, 1410, 1398, 1385, 1415, 1445, 1442, 1439, 1479, 1519, 1553, 1587, 1579, 1570, 1587, 1604, 1492, 1381, 1400, 1418, 1437, 1456, 1465, 1475, 1484, 1494, 1512, 1530, 1509, 1487, 1505, 1566, 1584, 1517, 1382, 1333, 1330, 1327, 1306, 1284, 1284, 1284, 1262, 1241, 1290, 1340, 1411, 1483, 1426, 1369, 1337, 1304, 1272, 1239, 1237, 1235, 1255, 1274, 1257, 1240, 1318, 1396, 1408, 1335, 1286, 1280, 1277, 1275, 1254, 1233, 1178, 1123, 1140, 1156, 1181, 1206, 1136, 1066, 1047, 1114, 1252, 1304]
454A304j4j4KKm6m5N5N4l2l3j9K4L0n6n3L3Q2Q1Pp9j09j09l7M8O8K4J2J1J4J5K8P0M4m1q6
450A235m3lkJ8J9Ql6n9K6O9O8k6k6N4N4J1J1kjkkn2n3n2n2j5j5l6l6N1N0k0k1k2k3K1K0M3
445A159M3Q5Q6m9m9m9m9J1J2J1J2OOl6l7j9j9N2N2k3k3kkk2k2M9N0N5N5j6j6j8j8o1o1N9N9
441A271J6J6j6j7j6j6k9l0l0k9M8M7K6K7n5n4J6J7O3O3l7l8o0o0L9M0rj0rj0L8L7l4l4n2n1
436A068J9K0nnnnk7k7J5J6J6J6k6k7p5p4N3N4K7K7j7j6M3M3%%k4k3J9J9k8k8k8k8N9O0J6J7
432A139noonKLLKM2M2M1M2j7j7j8j7j7j7j8j7l1l2l1l2QQQPJ3J3J2J3P0P0K0o5q9m7K4K4M1
427A160M1K3o2j12k6P2P2L6n0k9J4J8k5k2K1K8K8m1m1j1j1N4N5P1j5o6o7qrL4L4KKo7o6%M2
422A079K7o0n3j1N9O0J7J6k5k6j8j8j8j8NNoP9J02J7j10j11jQ3J8o8k8N7N4l1k6J7J8k6pP9
$$ y = [1304, 1290, 1276, 1278, 1280, 1234, 1189, 1244, 1298, 1266, 1233, 1214, 1238, 1268, 1212, 1159, 1192, 1274, 1355, 1362, 1283, 1174, 1065, 1028, 1076, 1144, 1168, 1180, 1191, 1205, 1220, 1248, 1318, 1362, 1321, 1235, 1192, 1189, 1187, 1205, 1224, 1232, 1196, 1137, 1163, 1232, 1300, 1274, 1248, 1302, 1356, 1367, 1378, 1376, 1375, 1373, 1371, 1319, 1266, 1214, 1162, 1147, 1132, 1096, 1060, 1111, 1161, 1141, 1120, 1098, 1075, 1096, 1116, 1159, 1202, 1287, 1373, 1324, 1275, 1226, 1177, 1188, 1200, 1211, 1223, 1229, 1235, 1199, 1162, 1143, 1124, 1176, 1228, 1205, 1182, 1180, 1178, 1156, 1134, 1183, 1233, 1288, 1343, 1327, 1311, 1293, 1275, 1214, 1153, 1212, 1271, 1287, 1303, 1287, 1270, 1254, 1238, 1209, 1179, 1149, 1120, 1168, 1215, 1241, 1268, 1213, 1159, 1175, 1192, 1255, 1318, 1281, 1243, 1183, 1123, 1162, 1202, 1193, 1183, 1174, 1164, 1202, 1239, 1205, 1171, 1119, 1068, 1087, 1107, 1102, 1097, 1092, 1087, 1060, 1033, 1048, 1064, 1080, 1096, 1070, 1043, 968, 894, 947, 1001, 1028, 1055, 1038, 1022, 1065, 1108, 1108, 1108, 1084, 1061, 1080, 1099, 1071, 1043, 1015, 987, 1046, 1106, 1122, 1139, 1134, 1128, 1122, 1117, 1119, 1122, 1125, 1127, 1169, 1211, 1252, 1294, 1277, 1260, 1242, 1225, 1208, 1191, 1173, 1156, 1125, 1093, 1062, 1030, 1038, 1046, 1054, 1061, 1074, 1087, 1099, 1112, 1182, 1252, 1272, 1207, 1118, 1071, 1095, 1119, 1160, 1201, 1224, 1162, 1050, 1024, 1096, 1168, 1204, 1154, 1125, 1139, 1157, 1132, 1110, 1131, 1159, 1187, 1146, 1105, 1094, 1083, 1137, 1192, 1263, 1248, 1182, 1115, 1107, 1098, 1132, 1166, 1168, 1170, 1103, 1037, 1037, 1079, 1106, 1046, 993, 982, 1041, 1101, 1118, 1134, 1109, 1083, 1065, 1047, 1029, 1011, 1016, 1021, 1015, 1094, 1196, 1213, 1103, 992, 991, 1074, 1092, 1024, 996, 1053, 1107, 1076, 1050, 1067, 1085, 1059, 1052, 1131]
418A131P9pr5n2J8J9j08j07l7l6O9O8O8O8j8j8N3N3m3m2%%M6M6M3M3m1q4m0M7O1J9NNJJm2
413A173m2o5o5j9O7R7J0ppM8M9n2n2q5q5j3j3J2J2J3J2N8N8J5J5mnp1j15n0R2J34R0j2j3j6
409A164j5q1q1pQ0P7rk7k7qrn1n1llL9M0P5P6k4o7k8N8J4p0r0m6N3N2K3K2K2K3L0L0m2m1r
404A089qO3O3L9M0j0r5p7l5L6L6jjpoj2r8r4rN4R8N8k7p6l4L6P9J6p1m3%M5M6OOJ07J08L6
400A357j07j15l0L6n1r3n1J9O1Oq0p8QP5P5L8L7OPl7l6l7l7NOM9M9N4l2o3o3LLn2n2M7M8L6
395A011L7ooqqL4L5L0L0j2j3KKKKK6K6NMM0M0o0o1o5o6L4L4M2M2%jj4j4j4j4K1K0K6n9n5n4
390A015O9O8P8P7k2k2m6m6mln3n3M7M7n5n5l2N4M0L9k6k6rrL3L4p8p9q4KK4K3J8J04Q7Kp4
385A085p4J5J5J5J5L4L3l7l8k4k4M8M7J3J2n7K8J18J18M3m3o8o8l1l1o1o1l8M7M6M7L0L0l
$$ y = [1131, 1210, 1203, 1108, 1056, 1074, 1093, 985, 878, 841, 805, 874, 942, 1010, 1078, 1060, 1042, 1095, 1148, 1105, 1063, 1063, 1063, 1109, 1155, 1198, 1241, 1200, 1116, 1076, 1123, 1184, 1203, 1208, 1213, 1214, 1215, 1173, 1131, 1066, 1001, 982, 1049, 1146, 1156, 1149, 1142, 1190, 1239, 1187, 1135, 1050, 965, 952, 939, 951, 963, 976, 988, 1046, 1104, 1119, 1134, 1130, 1125, 1054, 939, 889, 981, 1115, 1205, 1193, 1180, 1164, 1149, 1068, 987, 980, 1060, 1137, 1128, 1101, 1074, 1066, 1057, 1006, 955, 952, 949, 988, 1028, 1103, 1179, 1155, 1088, 1060, 1118, 1132, 1062, 972, 926, 979, 1031, 1054, 1076, 1098, 1121, 1151, 1181, 1139, 1098, 1089, 1081, 1144, 1207, 1246, 1286, 1276, 1181, 1104, 1069, 1105, 1141, 1140, 1139, 1132, 1126, 1114, 1016, 922, 913, 967, 1065, 1123, 1096, 1020, 986, 1022, 1101, 1117, 1046, 1003, 1003, 1048, 1094, 1100, 1106, 1213, 1321, 1357, 1250, 1135, 1105, 1141, 1090, 997, 946, 965, 1026, 1032, 952, 874, 882, 957, 1032, 1070, 1107, 1113, 1120, 1083, 1047, 1010, 973, 978, 984, 1033, 1082, 1136, 1104, 1041, 978, 981, 984, 932, 880, 927, 975, 1011, 1048, 1042, 1036, 1028, 1020, 1054, 1089, 1119, 1149, 1137, 1124, 1126, 1128, 1130, 1132, 1158, 1184, 1189, 1193, 1233, 1273, 1213, 1152, 1087, 1021, 1055, 1089, 1131, 1173, 1173, 1172, 1158, 1144, 1130, 1116, 1137, 1157, 1183, 1124, 1069, 1015, 1084, 1152, 1230, 1307, 1285, 1263, 1217, 1171, 1167, 1164, 1111, 1058, 1105, 1152, 1097, 1042, 1010, 1064, 1104, 1143, 1117, 1091, 1082, 1073, 1106, 1140, 1062, 983, 899, 901, 925, 948, 966, 1070, 1157, 1159, 1085, 1011, 1026, 1041, 1056, 1071, 1105, 1138, 1101, 1063, 1039, 1015, 1063, 1110, 1123, 1135, 1078, 1106, 1224, 1342, 1385, 1342, 1274, 1206, 1175, 1144, 1083, 1022, 984, 1031, 1077, 1124, 1154, 1184, 1181]
381A181lm6m6K5K5m6m6n1n0n6L0R9R9jq7k1K3k5j11q7%J02J03L7L7noj2j2L0L1KKK3K4M9N0
377A261k1k2r5r6m3M2L8L8J%M5M6K3K4j3j3q0p9m6L9N9J5n1n1m8m7p3J4R4R4qqNM9J7o9q5
372I56m2K9K8P4P4O5O4l5l5QQj4j3l9l9K7K6j1r8r7j2L7L8k8k9M0L9L9M0k5k6J8J7L9L8nn
368A151POM9M9k2k2K1K1J4J5l1l1m1q5j05k1P8J19N5l1K3J08L5n2j05o3QPnnmnm8m8K3O6N3
363A184l3n3n3l0l1M1M1RJ0RJ0N6N7j5j5J1J2M9N0k8j13j13k7O7O7k7k8J2J2J4J4k1K3M6l9
359A168o4o4L1L0%j%jJ7J8J7J7m1m1L1L1J3J4J4J4j4j4j4j4j4j5j4j4OOOORRl3p6k3O2J07
354A169O4l2l2L6L7M0M0M0M0l0l0k9l0o9o9L4J20O2k5j6j6m6q9k2J21J30M3n4j2N9J6n8n7
350A335lmmlM1M1n9n9j6j5j6j5L4L5L4L5L8L9l3l2O1O1J8J9jjm0m1J0N3J1p5j10k5M9N0M6
$$ y = [1181, 1178, 1132, 1086, 1111, 1136, 1090, 1044, 993, 943, 887, 917, 1016, 1115, 1114, 1027, 1006, 1029, 1004, 893, 806, 806, 908, 1011, 1048, 1085, 1080, 1074, 1062, 1050, 1080, 1111, 1113, 1115, 1138, 1162, 1211, 1261, 1240, 1218, 1123, 1027, 984, 1026, 1064, 1102, 1103, 1103, 1148, 1194, 1217, 1241, 1228, 1215, 1135, 1056, 1010, 1049, 1108, 1123, 1072, 1021, 973, 926, 853, 867, 961, 1055, 1047, 1039, 1044, 1093, 1110, 1041, 956, 914, 943, 971, 1045, 1119, 1184, 1248, 1213, 1178, 1186, 1194, 1180, 1167, 1128, 1089, 1116, 1142, 1131, 1033, 936, 924, 961, 999, 971, 942, 982, 1021, 1060, 1100, 1075, 1049, 1067, 1084, 1123, 1161, 1156, 1151, 1158, 1164, 1213, 1262, 1240, 1218, 1239, 1260, 1274, 1289, 1258, 1227, 1186, 1101, 996, 975, 1053, 1172, 1227, 1196, 1219, 1327, 1362, 1310, 1205, 1142, 1150, 1157, 1152, 1147, 1143, 1138, 1090, 1042, 1065, 1131, 1184, 1151, 1098, 1045, 1015, 984, 1025, 1066, 1075, 1085, 1094, 1104, 1160, 1217, 1202, 1187, 1198, 1210, 1259, 1309, 1281, 1168, 1055, 1028, 1095, 1162, 1135, 1107, 1119, 1131, 1145, 1159, 1138, 1161, 1207, 1168, 1104, 1040, 1071, 1101, 1101, 1100, 1100, 1099, 1116, 1134, 1151, 1168, 1127, 1086, 1117, 1148, 1161, 1175, 1189, 1203, 1189, 1175, 1161, 1147, 1133, 1118, 1104, 1090, 1096, 1102, 1108, 1114, 1123, 1132, 1099, 1023, 1000, 1062, 1169, 1233, 1201, 1169, 1205, 1242, 1282, 1322, 1362, 1402, 1372, 1342, 1313, 1283, 1214, 1145, 1179, 1299, 1361, 1336, 1320, 1304, 1258, 1169, 1147, 1268, 1398, 1441, 1387, 1375, 1434, 1450, 1392, 1335, 1332, 1328, 1324, 1321, 1362, 1403, 1344, 1285, 1269, 1254, 1238, 1223, 1257, 1292, 1326, 1361, 1399, 1438, 1405, 1373, 1434, 1495, 1513, 1532, 1531, 1530, 1490, 1449, 1459, 1512, 1523, 1448, 1338, 1313, 1362, 1412, 1458]
346A458M7M6M6N6N6N5N6J5J4k8k8L9M0l0k9m4jK3o2j01j01o3o4noklj8K6N2l4o5k2K0K0J2
341A375J2J2J1qrL4L5n9n9J2J3OOOOl4l4O6O6l6l7OOM7M7Q4Q4L2n4l0J3RJ0J3J2j2j3j2j3
336A613p1p2p2p2jjkjk3k3K0K0J1J0J1J1L1L0j3j2jjm4m3J8J9n3n3QRl4l4J7J6J7J7L3L4r
332A310rk9k9r5r5J9J05O5k1o2k0K1k3q4m1L7P9N4N4N6N7j%j%j9j9q5q5QR4M5M6L4L3rrl6
327A345l5l6l6j7j7K6K6O3O2rrNMj6j02r9n5J5J5NNNNj3j3L1L0k3k3k3k3lkO4O3M8l7n6j4
322A156K8K8L0L0N4N4j8j8n5n5j2j3L5L5L0K9Mq2j01n7k0k0j7j7J23J24Q0Q0k0k0j15j14j20
318A046l5P5P4N7N8j4j4l8l8l8l8P5P6K4o2j0j1K6K7j8j9J9J9jq7q7kO8O7k7k7QRRQLLm0l9
313A106j0rj0rp4p3k2O4Q8Q8poOPl6l6r0r0J1J0L4L5P7P7R8R9n9n8o0n9J1J2O5O5P1j5p9p9
$$ y = [1458, 1505, 1551, 1597, 1653, 1709, 1764, 1820, 1835, 1849, 1821, 1793, 1832, 1872, 1842, 1813, 1769, 1768, 1791, 1729, 1628, 1527, 1464, 1400, 1395, 1389, 1387, 1384, 1366, 1392, 1444, 1410, 1345, 1323, 1343, 1363, 1375, 1387, 1399, 1410, 1402, 1393, 1427, 1462, 1403, 1344, 1356, 1369, 1375, 1381, 1387, 1393, 1359, 1325, 1391, 1457, 1421, 1384, 1390, 1396, 1443, 1490, 1574, 1658, 1690, 1636, 1606, 1619, 1628, 1638, 1651, 1663, 1651, 1638, 1626, 1613, 1542, 1470, 1398, 1326, 1325, 1324, 1322, 1321, 1298, 1275, 1295, 1315, 1326, 1336, 1347, 1358, 1389, 1419, 1406, 1394, 1393, 1392, 1348, 1305, 1323, 1342, 1289, 1236, 1244, 1253, 1219, 1185, 1202, 1218, 1235, 1252, 1285, 1319, 1310, 1301, 1272, 1243, 1148, 1053, 1072, 1177, 1242, 1221, 1159, 1139, 1160, 1137, 1053, 1012, 1049, 1128, 1182, 1236, 1292, 1349, 1348, 1348, 1347, 1347, 1328, 1309, 1224, 1139, 1147, 1241, 1286, 1332, 1366, 1399, 1390, 1381, 1345, 1310, 1274, 1238, 1221, 1204, 1230, 1256, 1319, 1381, 1372, 1363, 1368, 1372, 1356, 1254, 1155, 1100, 1115, 1130, 1135, 1140, 1145, 1150, 1137, 1124, 1155, 1185, 1162, 1139, 1116, 1093, 1090, 1088, 1152, 1215, 1263, 1226, 1170, 1156, 1184, 1212, 1242, 1272, 1326, 1380, 1362, 1344, 1289, 1234, 1222, 1209, 1244, 1279, 1309, 1338, 1342, 1260, 1159, 1102, 1082, 1062, 1045, 1028, 1151, 1275, 1355, 1435, 1415, 1395, 1280, 1166, 1046, 1011, 1086, 1160, 1217, 1275, 1261, 1247, 1209, 1171, 1133, 1095, 1170, 1246, 1270, 1208, 1198, 1187, 1213, 1240, 1222, 1203, 1222, 1241, 1240, 1153, 1066, 1064, 1132, 1199, 1172, 1145, 1153, 1162, 1171, 1179, 1182, 1185, 1145, 1106, 1096, 1087, 1077, 1068, 994, 921, 899, 963, 1051, 1139, 1132, 1126, 1132, 1139, 1103, 1067, 977, 887, 898, 908, 942, 977, 1054, 1131, 1229, 1328, 1269, 1211, 1151, 1092, 1103, 1115, 1180, 1245, 1316, 1301, 1222, 1143]
309A143m1m2L3L3L2L3L9L9M4m1p7p7j1j0P2P2J20L4r4r5n7n8l0l0J3J3J6J6J7J6J8J7J8J8
305A193j1j1L2L2n5n5M6M5k2k1k2k2k1k2mQ2R8J2r1r1mnmml7l8Q6Q6k0j07o3K2Q5Q5M7M7j2
300A256j1n5n5l8l8l7l8Q1Q1N8k8l6l6L0L1J5J6k8k7n5n5j2j2J8J7J7J8nnnnl0l0p8QR7R8
296A122LLj3j3j3j4k5k6k6k5P5P5k5k5pqqqk3k3k3k3M3M3%JpoL6L7OPPPJ5J5k3k2kQ5Q4jn1
290A224n0J6J5p3p4l0l1LMLLPOOOmllmppn0m9O2O2O8j8l2l2NOP1P2K0o5j00j01M6M6L1n6p
285I86pK8K8r6r5l9M6P0P0j3j2j2j3M2M1M1M1L3L3rj0o8o7o8o8L2L1M2m3n7K9R9R9J2p4k5
281A027k5MMM2M2k5j11o8J8Q3Q4J7J7J2J2l1l1ppL5L6kklkrrj5j5K9n6n7K9J13J13l8l9J2
276A177J3o3j48j10k4K2K3M1M1M1M1O3O4rqppppl2l1l2l1l2l1k6k6lQ3L5L4l7l8ONL6L6L5
$$ y = [1143, 1102, 1060, 1093, 1126, 1158, 1191, 1230, 1269, 1313, 1272, 1195, 1118, 1107, 1097, 1169, 1241, 1361, 1395, 1301, 1206, 1149, 1091, 1061, 1031, 1044, 1057, 1073, 1089, 1106, 1122, 1140, 1157, 1175, 1193, 1182, 1171, 1203, 1235, 1180, 1125, 1171, 1216, 1194, 1173, 1151, 1129, 1108, 1086, 1082, 1164, 1262, 1274, 1183, 1092, 1088, 1083, 1079, 1075, 1038, 1000, 1086, 1172, 1152, 1045, 982, 1004, 1089, 1174, 1221, 1268, 1256, 1245, 1190, 1135, 1097, 1059, 1022, 984, 1065, 1146, 1204, 1176, 1140, 1104, 1134, 1165, 1180, 1196, 1168, 1141, 1086, 1031, 1019, 1007, 1025, 1042, 1059, 1077, 1072, 1067, 1062, 1057, 1027, 997, 919, 927, 1024, 1122, 1125, 1128, 1115, 1102, 1089, 1075, 1050, 1024, 998, 973, 1048, 1123, 1098, 1073, 1066, 1058, 1050, 1042, 1019, 996, 973, 950, 993, 1036, 1036, 1037, 1030, 1024, 1060, 1097, 1103, 1110, 1117, 1124, 1139, 1154, 1131, 1109, 1107, 1192, 1276, 1275, 1224, 1174, 1190, 1205, 1132, 1058, 1028, 997, 1000, 1004, 1007, 1010, 1017, 1023, 1029, 1035, 1031, 1028, 1025, 1021, 1014, 1007, 957, 908, 970, 1032, 1100, 1082, 1050, 1018, 1023, 1029, 1100, 1172, 1192, 1127, 1027, 926, 972, 1018, 1049, 993, 986, 979, 1007, 1035, 939, 844, 805, 851, 921, 991, 978, 966, 954, 941, 983, 1024, 1065, 1106, 1139, 1172, 1163, 1153, 1085, 1018, 950, 882, 914, 945, 987, 944, 887, 916, 1015, 1114, 1126, 1052, 1027, 1002, 1006, 1010, 1052, 1094, 1069, 958, 890, 908, 991, 1075, 1092, 1109, 1121, 1133, 1102, 1071, 1064, 1057, 1092, 1128, 1126, 1124, 1121, 1119, 1110, 1101, 1086, 1071, 1100, 1044, 987, 1016, 1129, 1242, 1204, 1165, 1177, 1190, 1127, 979, 869, 845, 867, 890, 931, 972, 1013, 1054, 1117, 1181, 1172, 1164, 1157, 1150, 1143, 1136, 1104, 1073, 1041, 1010, 978, 947, 921, 895, 892, 975, 1010, 1044, 1007, 969, 975, 980, 1016, 1052, 1087]
271A087L6j2j2j3j2N4N4j7j8nnM4m3o7o7l0l0k0k0J03J03j3r8n6L0RRn8n7K7K6j6j6k6k5P5
267I21P5O4O4ppo4o4j7O8O2k3o4o4J0R6M7M7q0q0n7K8R2R2J7o9n6n7j8j9L4L4rrQQQQj0j1
262I98K7K7Jq4p9p9J2J1J1J1P7P6L0n6q3KM9M9M1M1kko3o3k1k0L2L3L3L2n1n1K0K0OOONll
257I96llj2j1n5n4M9M9k3k2K0J9K0J9k4k4J8J9k2k2K1K1l7l7l7l6qqj4P2P3P2OPOPPOO3O3
252A181j8j03p3p4pqJ6J7J6J7K9L0j4j3l3l2R1R1M8l8l2l3noonO0O1N5N5J2p4r8r7j1j2j1
248I76j2K1K1K0K1J1J2l2l1k6k5k5k6K0K0K0K0N9N9L6m9l4l4L1L2O2O3J9J9rj0n2n3J2J2o
244A142r2j36n1K4K4J8J8O0O1KKKKn5n4M6M6r3r3j8O8N4l2p0J6P9P8M0M1l4l5j05j06k5k5
239G99J8J7O0N9O0O0O1O2L9m7p5p4l8l7l8l9L3L3K4K4m7m8o6o7L3L4L3L3rj0k6k7lQ2O0O0
$$ y = [1087, 1123, 1111, 1099, 1086, 1074, 1128, 1182, 1165, 1147, 1142, 1137, 1181, 1138, 1071, 1004, 974, 944, 924, 904, 1007, 1110, 1097, 999, 943, 973, 982, 991, 933, 876, 903, 929, 913, 897, 871, 846, 921, 996, 1060, 1124, 1117, 1110, 1046, 982, 965, 1033, 1095, 1072, 1008, 944, 954, 1050, 1097, 1144, 1064, 984, 927, 955, 1047, 1139, 1156, 1087, 1031, 974, 956, 937, 971, 1005, 996, 987, 995, 1003, 1011, 1019, 1009, 998, 1025, 1052, 1053, 969, 890, 811, 823, 834, 845, 856, 933, 1009, 1039, 983, 900, 902, 951, 1000, 1041, 1082, 1080, 1078, 1015, 952, 931, 911, 943, 976, 1009, 1041, 990, 939, 959, 979, 985, 991, 997, 1002, 999, 996, 993, 990, 978, 967, 912, 858, 907, 956, 933, 911, 931, 950, 970, 989, 965, 941, 959, 978, 956, 934, 955, 976, 939, 902, 865, 829, 821, 813, 799, 871, 944, 1016, 1022, 1029, 1035, 1042, 1049, 1055, 1118, 1181, 1163, 1060, 987, 913, 906, 898, 914, 931, 947, 964, 993, 1023, 1009, 996, 963, 931, 1022, 1113, 1161, 1123, 1091, 1058, 1053, 1047, 1041, 1036, 1096, 1157, 1212, 1267, 1279, 1205, 1107, 1010, 999, 987, 976, 964, 985, 1006, 1026, 1047, 1058, 1070, 1038, 1007, 981, 956, 931, 905, 925, 945, 965, 985, 1044, 1103, 1139, 1090, 1056, 1022, 1053, 1085, 1147, 1210, 1229, 1248, 1239, 1229, 1177, 1124, 1136, 1148, 1142, 1050, 914, 863, 887, 911, 929, 947, 1007, 1068, 1070, 1072, 1074, 1076, 1021, 967, 1013, 1059, 966, 873, 855, 923, 977, 945, 875, 891, 970, 1048, 1088, 1129, 1095, 1060, 955, 849, 824, 799, 817, 834, 894, 953, 1013, 1073, 1134, 1196, 1235, 1188, 1113, 1039, 1001, 964, 926, 887, 920, 953, 977, 1001, 954, 906, 840, 773, 806, 840, 873, 906, 897, 887, 861, 834, 831, 913, 973, 1033]
235A033O0O0J8o8j19j19JKk0k0K6K6R3R2K7n8q2q1O7O8M7M6l2l2j1j1RJ0q6q5kQ3Q4k%%O5
230A089O6K5K5j8j8%J%Jn3n3n3n3l5l5QPm1m1N8N9l0l0J7J02N8k7j6j7kllkJ5J5J5J5K2K2
226A090n0n0m6m5llJ4J5ppM7M7M7M7k8k7k8k8j0j0rj0nnnnL2L1L2L2n5n5J7J7M9N0PPK9K9
221A148P2P2m0l9m0l9n4n4J8J7l8l9k1O5P9pn3n3K9K9j4j4n3n3j0j1NNNNL4L5P7P7r5r4k0
216I31O6K1o5m4M2P3j3l1l1k7k8q1NO1k5m2m3N1N0k0k1M6M7M6M6P1P1n7n7j2j1l0j15j04j8
212G52K9K8J12J12O0k5POk0k0n9n9L6L6P5j1q7m3N6N6m1m1j1j1qrN6R9O0q2q2MR8N7k2k1J8
207A105J9K4K4m5m5j3K9J5o9n8K8P0K7l7l7L2L2J0J0J1J0m6m6m6m6J4J5J4J4k0k0MML2P4L3
203A122n3j32m7K9K8m6m6N7J43N0l6p3J2J5J5k3k3l0l0J2J3N9N8L5n0p4p5K0O2J6p0m5L9O8
$$ y = [1033, 1093, 1153, 1171, 1103, 984, 865, 866, 868, 848, 828, 854, 880, 973, 1065, 1092, 1034, 952, 871, 938, 1006, 1053, 1099, 1067, 1035, 1024, 1013, 1022, 1032, 946, 861, 859, 942, 1026, 1024, 1024, 1024, 1089, 1155, 1180, 1205, 1187, 1169, 1169, 1170, 1170, 1171, 1118, 1065, 1012, 959, 924, 889, 897, 904, 863, 822, 880, 939, 909, 879, 896, 998, 1056, 1029, 1013, 996, 994, 991, 988, 986, 1001, 1016, 1031, 1046, 1068, 1090, 1040, 990, 944, 899, 896, 893, 907, 922, 915, 908, 955, 1002, 1049, 1096, 1068, 1041, 1013, 985, 975, 965, 956, 946, 941, 936, 931, 926, 958, 989, 1021, 1053, 998, 943, 960, 977, 1026, 1076, 1083, 1090, 1119, 1148, 1220, 1292, 1252, 1213, 1173, 1134, 1080, 1026, 1044, 1061, 1023, 984, 963, 1028, 1107, 1100, 1047, 994, 1023, 1052, 1038, 1024, 971, 918, 908, 897, 902, 907, 912, 917, 951, 986, 1063, 1140, 1045, 951, 931, 997, 1018, 953, 909, 951, 1024, 1011, 980, 949, 922, 894, 813, 818, 879, 854, 812, 769, 820, 870, 850, 829, 875, 922, 968, 1014, 1085, 1156, 1099, 1042, 1030, 1019, 989, 874, 770, 752, 781, 809, 921, 1033, 1093, 1068, 1075, 1081, 1061, 1041, 982, 923, 959, 995, 1070, 1059, 972, 929, 985, 1041, 1000, 959, 948, 937, 929, 920, 976, 1075, 1135, 1053, 971, 975, 1073, 1130, 1108, 1087, 1105, 1124, 1148, 1172, 1127, 1082, 1069, 1098, 1113, 1044, 986, 1014, 1084, 1111, 1074, 1037, 1069, 1101, 1111, 1121, 1132, 1142, 1096, 1050, 1004, 958, 972, 987, 1001, 1015, 995, 975, 979, 983, 1015, 1089, 1122, 1069, 937, 890, 919, 947, 901, 855, 912, 1055, 1105, 1069, 996, 1008, 1023, 1038, 1015, 992, 962, 932, 944, 957, 1016, 1074, 1109, 1059, 985, 910, 930, 992, 1008, 938, 893, 932, 1000]
199A000O8L1L0n1n2K4J09R0Mp0p1m5m5k4k4KKK4K3L2L1j2j1QQj3j3l4l3l3l4L2L2J0J0R1R0
194A186L8m7m7m8j0j0n2n3j0rL4L4L4L4k8k8p1p1j%M2M2N9N9j3j3j5j4N1N2k4j09j75q9K1
190G49J07P5j1n8K8J25J26N5l2q2q3p3p4k1O4K3K3j5j5K0K0kjK5K5j8j7LMj7j8J4J4J4J4K4
186A015K4j9j9LLo8o8L2L2j1j0l8l8l7l8K3K3K2K3O0O0l4l5M0J26Kq3n2L3P1j5jkppqpk4k3
181I48o6K0J5J5%%M2M3RRQ0Q0k0k0m1m2QPQPjkkko9o8k6k6n2n2J9J9L2L2J1J1j%%jo5o6O6
176H59J52Q5jj9j8K0J9k3k3J3J2l0l0J4J5K5o0o8J7L5L5%%%%j1j0j1j1l3l3J0J0K9K9L0K9
171A057o4o4PPj%k2k2L9L8k8k7o4K2P3P4K4K5j8j9k5k5J7J7ppn1n0l4l4L7L8l0k9M3M2K1K1
166I81%%o1o2o7J9L8L8K2K2J1J1j0j0KKM5M5K7K8p3p2j4j4K8K9J5J5opl2l2M0L9j7j7j7j6
$$ y = [1000, 1068, 1099, 1129, 1078, 1026, 1050, 1159, 1249, 1253, 1183, 1112, 1067, 1022, 998, 974, 976, 978, 1002, 1025, 1057, 1088, 1076, 1065, 1073, 1081, 1068, 1055, 1021, 988, 955, 921, 953, 985, 995, 1005, 1096, 1186, 1224, 1177, 1130, 1082, 1072, 1062, 1010, 957, 947, 938, 972, 1006, 1040, 1074, 1046, 1018, 947, 876, 875, 875, 917, 959, 1018, 1077, 1064, 1051, 1036, 1022, 1073, 1125, 1101, 992, 817, 728, 749, 856, 931, 920, 862, 890, 1015, 1141, 1196, 1164, 1082, 999, 926, 852, 831, 895, 918, 941, 926, 911, 931, 951, 949, 948, 973, 998, 980, 963, 966, 970, 953, 935, 949, 963, 977, 991, 1015, 1039, 1020, 1001, 1004, 1007, 939, 871, 903, 935, 924, 914, 876, 838, 801, 763, 786, 809, 831, 854, 914, 974, 940, 905, 945, 1071, 1073, 990, 938, 971, 1042, 1027, 1026, 1024, 1017, 1010, 1002, 995, 971, 948, 882, 902, 917, 932, 932, 932, 974, 1017, 1026, 1035, 1115, 1195, 1175, 1155, 1114, 1072, 1080, 1087, 1095, 1102, 1101, 1099, 1097, 1095, 1026, 958, 932, 906, 854, 802, 821, 840, 872, 904, 915, 926, 925, 925, 925, 924, 859, 793, 859, 1011, 1096, 1095, 1076, 1058, 1078, 1097, 1074, 1051, 1064, 1076, 1046, 1016, 1030, 1045, 1070, 1010, 942, 959, 994, 1029, 1029, 1029, 1029, 1029, 1018, 1008, 997, 986, 953, 920, 930, 940, 969, 998, 1028, 1057, 993, 929, 936, 943, 942, 942, 920, 898, 937, 975, 947, 920, 856, 878, 951, 1025, 1049, 1074, 1056, 1037, 1012, 987, 1004, 1021, 1014, 1007, 956, 906, 872, 838, 875, 913, 883, 854, 897, 939, 960, 981, 981, 981, 920, 858, 791, 810, 848, 886, 908, 930, 941, 952, 942, 932, 934, 936, 981, 1026, 1053, 1081, 1008, 936, 922, 908, 936, 965, 980, 995, 989, 982, 950, 918, 958, 997, 980, 963, 946, 930]
162I30N6N7N6N7o6o5m5m4J6J7N4N5N2l2q5q4K0K1k2k2j7j7K6K6P6P6k4k3k3k3J9K0k8k9k8
157I57k8l7l7l6l7O6O5O6O5qrl0l0j8j8P7P7qr4j64q0O0O0K3K2ppO5O4L9M0o1o0q7q7M2M1
153H86N5N5J2J2m1m0m1m1J1J0j1j1j7j8K6K5L0L1j3j2m7m6OR1P7P7m7m6JJM4M4l7l7n8n8J3
148H86J2J3J3J0J1J1J0O5O4Qo4n2j0N8N7J8n5j06o4K1O5M0l1n1n1J6J6K0J9J9K0L2L2L2L3
144A117k6k6o9o8j0rrj0j2j2j2j2j8j7j8j8M3M3M3M3J6J6J6J6rqn0m9K5O8M1l0o5o6k6k7O8
140H79O9O8O9j4j3j4j3mmm6m6k9k8k9k8j5j5N7N7N2N2j9j9L4L4l7l6j2j3j2j2QQQPl5l5L6
135I10L7K4K5j9j8ooL7L7L9L9mmo4o4pO5R8N5m5q8m3K8O9lq4q4m5m5L6L7L7L6j1j1j1j1L1
130I67L0j2j2j7j8j7j7L8L7L8L8kjLq2j23j23K9K8K5K5K5K5LKLLJ4J4J5J4qqqqJ6J6N4N3P4
$$ y = [930, 986, 1043, 1099, 1156, 1090, 1025, 980, 936, 952, 969, 1023, 1078, 1130, 1098, 1013, 929, 949, 970, 948, 926, 909, 892, 918, 944, 1020, 1096, 1072, 1049, 1026, 1003, 1022, 1042, 1014, 985, 957, 929, 892, 855, 819, 782, 848, 913, 979, 1044, 1036, 1027, 997, 967, 949, 931, 1008, 1085, 1077, 983, 819, 739, 799, 859, 882, 904, 897, 890, 955, 1019, 1058, 1098, 1037, 977, 890, 803, 845, 886, 941, 996, 1008, 1020, 979, 939, 898, 857, 868, 878, 867, 856, 839, 821, 847, 872, 902, 933, 920, 908, 861, 815, 821, 912, 989, 1066, 1019, 973, 974, 975, 1019, 1063, 1026, 989, 931, 873, 886, 898, 911, 924, 934, 945, 956, 966, 1031, 1095, 1103, 1039, 987, 977, 1035, 1092, 1110, 1055, 949, 885, 906, 971, 1011, 980, 929, 878, 894, 910, 930, 949, 968, 988, 1020, 1052, 1084, 1117, 1091, 1065, 996, 928, 918, 909, 900, 890, 878, 866, 854, 842, 824, 807, 789, 771, 814, 857, 900, 943, 959, 975, 991, 1007, 998, 990, 940, 891, 916, 984, 1025, 995, 930, 864, 838, 811, 879, 948, 1016, 1085, 1071, 1058, 1044, 1031, 1027, 1023, 977, 931, 902, 874, 845, 817, 802, 787, 844, 901, 953, 1005, 986, 967, 1001, 1035, 998, 962, 950, 937, 925, 913, 921, 929, 937, 944, 909, 874, 910, 947, 971, 996, 977, 959, 953, 947, 984, 1021, 1060, 1099, 1095, 1091, 1027, 963, 956, 1021, 1119, 1174, 1129, 1041, 998, 1026, 1095, 1092, 1008, 924, 879, 834, 870, 907, 944, 980, 969, 958, 947, 936, 967, 997, 985, 973, 956, 938, 921, 904, 942, 979, 1017, 1055, 1053, 1052, 1055, 973, 850, 727, 756, 784, 809, 834, 859, 884, 887, 889, 892, 895, 909, 923, 938, 952, 944, 936, 928, 920, 936, 952, 1006, 1059, 1133]
125A133j3o4o4k4k5k4k5jjMML2J18J07l6j21j20jjK7K7P0P0J4J5lq9j32m6K9K9n5n6K4J11
121I13M5M5N0N0L2L2j1j2o9o9q0NM2m3m4M3R7J1q7q6m2M5mmJ0RJ0J0l0k9O5O5R2Pp3p3j5j6
117H91j5j5J5J6N8N9KKLKj1j1j1j1k0k0K3K2J3J3k9l0l5l5L6L6qpL5L5n6n5j0P7N7k9j7j8
112I52L6L6l6l5n6n5M4M5oonoK3K3K3K3LMm0l9k4k3J9K0J7J8J8J7lkllk5k5k5k5M2M3l0k9
107I05M8M9K5o0n6n5j7j8PQN0N0J2J3N5N5l4l5l5l5o3o3j7O9J10K4n1n0m1m1m1m1J6J5Q7Q6
103I31O8O8l2l2nnm8m8n8n8j5j5M9M8M8M9L3L3o7o6mlL9M0l1l1O9O9ONOOL7L7l4l4ppqpo6
98I60o6NNM0M0L9M0J1J0J1J0q9r0J1J0M8M9k3k3o1o0j8j7O0N9m0m0LLM5M6j7j6n9n9J4J3J4
93H68J4j8j8j8j9j6j7K7K6R3R2qpLLl9m0J4J3n7n8L6L6L6L6JJp0p0r5r4L4L4Q7Q7M5M4J5J6
$$ y = [1133, 1120, 1056, 992, 968, 943, 919, 894, 893, 892, 896, 900, 932, 1050, 1157, 1121, 1000, 880, 879, 878, 905, 932, 1002, 1072, 1086, 1101, 1098, 1009, 877, 831, 860, 889, 834, 778, 802, 913, 958, 1003, 1053, 1103, 1135, 1167, 1156, 1144, 1075, 1006, 926, 931, 973, 930, 886, 929, 1026, 1037, 950, 864, 822, 867, 863, 859, 869, 878, 888, 898, 868, 839, 904, 969, 1061, 1068, 995, 922, 907, 891, 876, 861, 876, 892, 950, 1009, 1011, 1013, 1016, 1018, 1007, 996, 985, 974, 954, 934, 957, 979, 992, 1005, 976, 946, 911, 876, 912, 948, 940, 933, 968, 1003, 947, 892, 882, 959, 1016, 987, 970, 952, 988, 1024, 988, 953, 897, 842, 886, 931, 925, 919, 914, 908, 931, 954, 977, 1000, 1003, 1007, 967, 928, 904, 881, 900, 920, 937, 955, 973, 990, 987, 985, 982, 979, 954, 929, 904, 879, 921, 964, 934, 905, 953, 1002, 1027, 967, 911, 856, 839, 821, 828, 836, 886, 936, 948, 961, 1016, 1071, 1037, 1002, 967, 932, 869, 806, 789, 858, 968, 992, 941, 891, 850, 809, 768, 727, 743, 758, 845, 931, 999, 1067, 1035, 1003, 998, 993, 945, 897, 839, 781, 766, 751, 800, 848, 896, 945, 978, 1011, 944, 878, 874, 871, 910, 950, 919, 888, 957, 1026, 1032, 1037, 1043, 1049, 1086, 1123, 1089, 1055, 1048, 1041, 1033, 1026, 960, 894, 899, 904, 944, 984, 1023, 1063, 1074, 1084, 1095, 1105, 1016, 926, 937, 947, 995, 1044, 1021, 998, 937, 877, 859, 842, 902, 961, 921, 881, 884, 887, 932, 978, 961, 945, 886, 827, 841, 854, 868, 882, 864, 846, 828, 809, 793, 776, 803, 829, 922, 1014, 1006, 999, 1002, 1005, 966, 926, 940, 953, 896, 838, 874, 910, 946, 982, 983, 984, 914, 844, 749, 655, 689, 723, 810, 897, 942, 986, 1001, 1017]
88A017n6n6rj0L3L3M2M2jjo2o1j9j8R8R8K7K7n9n9n8n9J6J6N9N9l6l7l7l7k5k6mmL3L4l8l9
84H23j1j2O0N9mmmmm1m0m6M0N4N4j1j2Q2Q2Q8Jn3n4n9n9rqqrL2L2L2L2l5l4L6L7J7J8mnM1
79A094M1l4j20j16l0M4M5O1O1Q2Q2p1p1p1p1k9k9J4J4MMl9l8l2l2M0M0M2M2k9k9J8J8J8J8
74I41l7l7NNJ7J6J6J6j0j0K8K7K1o4q8q7j8j9n6n6M3J27Q5%J1J2P2P2R1Or8r9k5O0J2J2nn
70I81m2m2k8N7N3N2llo9o9n4L1J12J12J9J8n2n3j01j01jjM4M4M4M4K4K4m8m8j1j1n4n4ONl8
65G87l8RQN2N1N8N7L9m6n9K7J6J7p0p0J1R6M8M9j8j8k4k4o6o7M0M0L9M0jkMq2p7p7M6M6Q7
60I28Q7L5n1k5k6J2J2n8n8J3J3j4j3j4j4L0K9K9K9lllllllln5n4P3P4K5K4O2O3K7n7n3n2j3
56I84j3l5l4K3K3m8m9rrL4L3N6N5Q2lp3p3j0j0Ol6k0O6P5L2o6o7m5m5m5m5K9K9P1P2N6N5N6
$$ y = [1017, 961, 905, 896, 886, 919, 952, 994, 1036, 1035, 1034, 972, 911, 892, 874, 972, 1070, 1097, 1124, 1065, 1006, 948, 889, 905, 921, 980, 1039, 1003, 966, 929, 892, 867, 841, 837, 833, 866, 900, 862, 823, 812, 800, 860, 919, 915, 911, 907, 903, 862, 822, 776, 816, 870, 924, 913, 901, 983, 1065, 1153, 1154, 1101, 1047, 988, 929, 920, 912, 904, 895, 927, 959, 991, 1023, 988, 954, 990, 1027, 1044, 1062, 1058, 1053, 1094, 1135, 1101, 981, 865, 835, 879, 924, 985, 1046, 1128, 1210, 1139, 1068, 997, 926, 897, 868, 882, 896, 900, 904, 865, 827, 795, 763, 803, 843, 885, 927, 898, 869, 887, 905, 923, 941, 904, 867, 872, 877, 894, 910, 926, 942, 932, 922, 950, 977, 998, 934, 846, 759, 741, 722, 666, 610, 653, 780, 865, 865, 876, 888, 960, 1032, 1123, 1129, 1031, 932, 907, 967, 979, 991, 986, 981, 939, 897, 869, 926, 979, 1031, 1028, 1025, 956, 887, 833, 864, 976, 1088, 1107, 1125, 1073, 1020, 919, 818, 817, 816, 860, 904, 948, 992, 1016, 1040, 992, 944, 933, 922, 868, 814, 820, 825, 787, 749, 758, 766, 818, 869, 927, 984, 1023, 977, 918, 945, 961, 978, 908, 838, 849, 945, 993, 1042, 1024, 1006, 982, 958, 892, 825, 865, 905, 944, 984, 983, 981, 985, 903, 826, 749, 795, 841, 928, 1015, 1050, 999, 974, 948, 960, 972, 914, 856, 869, 882, 868, 855, 841, 827, 857, 886, 915, 944, 941, 938, 935, 932, 929, 926, 923, 920, 865, 811, 884, 958, 983, 1007, 1069, 1132, 1159, 1102, 1049, 997, 984, 971, 936, 902, 925, 948, 900, 851, 842, 833, 867, 900, 956, 1011, 1093, 1090, 1017, 944, 934, 924, 930, 894, 874, 940, 1015, 1047, 981, 914, 869, 824, 779, 734, 763, 792, 863, 935, 991, 1046, 1102]
51A102N6j7j6n3n4j6O9P0j6j06j07o0K6L6L7l0k9K4K5K4K5nnL8L8l6l6OM9J3p1k9N6R3M9n0
46A100m9j7j7j6j7l0l0l0l0P4P3L1L0%jm3m3p3p3jkmmmmR3R3M4m1n3j1LLj1j1j1j2J2J1N5
42I84N4n3n2M6Q9M3m3n9j6lkm3m3n8n7J4J4rj0RR4O4k1o8o7KLLLN1N1QRmnm7m6J5J5J5J5K3
36I18K3K3K3L1L2L1L2n1n1pqk0k0K3K3l8l8l7l8L3L3L3L3J5J5n6n6k3k4K0K0J3J3J4J3m0m1
32H66L1L2L7L7noj6j7o0n9J5J6J5J6n1n1n2n1L9L9L9L9n8n9J7J02N1l5p7l5N0N0j9j9o4o3
28F94j2P4J60J60O2q0j37r4K9P1J0p5l6N1J12K7m8m7L1L1j1j2PPQPn4n3j1j0llklJ6J7J6J6
23I15M0M0n6n5k6N9J11J11K0K0k2k3n6n7j3j3n3n3k9N6J04J05m7m7l6l5O4O5j2j1j2j1QQR
19A068QM7M8k4k3J7J7n4n4j2j1j2j2RRRRn5n5n5n5l2l1L9M0J6J6N8N9M7M6n4n3n5n5J6J6m
$$ y = [1102, 1158, 1141, 1125, 1072, 1018, 1002, 1071, 1141, 1125, 1019, 912, 852, 878, 914, 951, 921, 892, 916, 941, 965, 990, 985, 980, 1018, 1056, 1020, 984, 990, 1039, 1052, 981, 952, 1008, 1101, 1150, 1100, 1051, 1034, 1017, 1001, 984, 954, 924, 894, 864, 938, 1011, 1042, 1072, 1072, 1071, 1028, 985, 912, 839, 838, 836, 832, 828, 824, 820, 913, 1006, 1050, 1009, 956, 945, 948, 951, 940, 929, 918, 906, 918, 929, 984, 1038, 985, 933, 979, 1068, 1111, 1068, 1009, 993, 990, 988, 945, 902, 844, 787, 801, 815, 806, 796, 805, 899, 963, 942, 874, 807, 809, 812, 815, 818, 869, 920, 928, 937, 933, 928, 881, 835, 850, 865, 880, 895, 918, 941, 964, 987, 1018, 1050, 1081, 1113, 1062, 1011, 1004, 996, 976, 956, 979, 1002, 964, 926, 889, 851, 884, 917, 950, 983, 998, 1013, 957, 901, 878, 854, 874, 894, 907, 920, 934, 947, 907, 866, 897, 929, 966, 1003, 998, 992, 976, 959, 899, 840, 855, 871, 886, 902, 851, 800, 748, 697, 736, 775, 814, 853, 795, 736, 753, 855, 906, 871, 794, 759, 809, 859, 840, 821, 757, 694, 682, 756, 916, 1076, 1138, 1058, 921, 827, 856, 927, 937, 862, 826, 877, 989, 1016, 968, 921, 952, 983, 972, 960, 967, 974, 982, 989, 935, 882, 871, 861, 858, 855, 853, 850, 866, 883, 899, 915, 955, 995, 939, 884, 858, 917, 1028, 1139, 1159, 1179, 1157, 1134, 1078, 1021, 1008, 995, 942, 889, 860, 916, 1020, 1125, 1078, 1031, 995, 960, 1024, 1089, 1077, 1066, 1054, 1043, 1051, 1059, 1068, 1076, 1123, 1171, 1147, 1124, 1141, 1158, 1104, 1050, 1038, 1027, 1015, 1003, 1012, 1021, 1030, 1039, 984, 929, 874, 819, 787, 756, 795, 835, 851, 867, 925, 984, 1031, 1077, 1023, 970, 915, 860, 876, 892, 888]
14H88mmmN9O0l5l5m0M5M0M0n1n1n1n1M6M5M5M6j7j7M8M9L8m9m3m3Q5Q5O1k4p6p6l8l8k9k9
9H75M3M2l2l3j4P1N2l4k3k4L5L5L5L5k0j9l0N5N0l5j11j10JJJJO3O2o5o6k8k8J5J5Q4Q3J3
5I95J2k7k8k8k7m8m8N2N1K7K7p3p4n1n2K0J9Q6Q5j4j5k4k4J9J8M3M2M2M2j6j6n9n9k4k5M7
1H95M7RRRJ0k7k6k6k6MLLMm5m5K7K6n2n3M7M7R2R1l7l7J7J7J8J7N5N6m5m4j8j7j8j7K6K7m5
-4I78m5p7p7noM5M4M5M4LKM6M5J4J4n7n7r0q9L9L9L3L2rj0qppp%%M3M3J4J5q0q0qP7P8qj0
-10I56j1K7K7n6n7mQ1P3P4k1k0p8p8K2K2RRk1K2L1n4n1L4O6O6k8k8KKl8l9L8Q1J0p6j16l1
-14H45J5J5KJP2P3L5L6n9n9k1O5O5k1j01j01n5L1O8O8MML2P6N9k7r9n5M3M3mmmmo4o4k1k1
-19H68o8o9L5J20J07K2p8l5J1J0k9l0K6K6K6K5kkkkLMLLj0j1j0j1K0K0k3k3k9k9M2Q4M8l8
$$ y = [888, 884, 880, 876, 935, 995, 960, 925, 885, 930, 970, 1010, 959, 908, 857, 806, 852, 897, 942, 988, 971, 954, 1002, 1051, 1089, 1040, 997, 954, 1039, 1124, 1185, 1161, 1085, 1009, 971, 933, 904, 875, 918, 960, 928, 895, 881, 952, 1004, 970, 947, 923, 958, 993, 1028, 1063, 1043, 1024, 994, 1049, 1099, 1064, 953, 843, 844, 845, 846, 847, 910, 972, 907, 841, 813, 785, 800, 815, 899, 982, 995, 1007, 980, 952, 924, 897, 849, 801, 853, 904, 931, 958, 885, 811, 760, 708, 728, 747, 833, 918, 904, 889, 865, 841, 860, 878, 921, 963, 1005, 1047, 1031, 1015, 956, 897, 873, 848, 895, 942, 951, 960, 969, 979, 952, 926, 900, 874, 878, 881, 884, 888, 843, 798, 825, 851, 799, 746, 793, 840, 932, 1023, 986, 949, 966, 983, 1001, 1018, 1073, 1129, 1084, 1040, 1022, 1005, 987, 970, 996, 1023, 978, 933, 856, 779, 774, 768, 813, 857, 902, 946, 949, 951, 997, 1042, 1056, 1070, 1013, 956, 866, 777, 816, 855, 888, 920, 911, 901, 893, 886, 879, 872, 872, 872, 915, 958, 972, 987, 907, 827, 819, 896, 974, 966, 956, 945, 972, 999, 943, 886, 882, 963, 1036, 1110, 1089, 1069, 991, 913, 935, 957, 966, 975, 954, 976, 1007, 953, 902, 936, 1002, 1068, 1040, 1012, 1014, 1016, 978, 939, 977, 1058, 1068, 992, 876, 845, 860, 875, 877, 878, 950, 1023, 1058, 1094, 1035, 976, 955, 1020, 1085, 1064, 963, 862, 807, 838, 906, 974, 978, 982, 1014, 1090, 1149, 1122, 1023, 968, 1011, 1054, 1050, 1046, 1042, 1038, 974, 910, 889, 868, 800, 731, 766, 886, 993, 1015, 937, 902, 913, 923, 894, 864, 890, 916, 942, 967, 965, 963, 961, 959, 962, 966, 969, 972, 962, 951, 941, 930, 950, 970, 947, 924, 895, 866, 908, 992, 1040, 1002]
-23A002n8n8PPpm9l1N4P0K8l6l7MMNNNNP2P3L0K9l8l7l8l8LMl9m0o5o5O4O3Q2Q2k1j07j46
-28G88n9M4M3K4K4K4K4OOJJM4m2l6l7M1M2n9n9%jm3m3MMMML1L2j2j2qrL4L4J9J9k3k3L0L0
-33H91P3P3RJ0l3l3M9M9L1n4o8J7PPl6l6O4O4j1j1n4n4k6k6k6k6QRN1N1K6K6j7j7qrqrl3l3
-38H87L8L8l4l3l3l3j0j1j1j1M7M6M6M7j9j9o2o1K2K3K2K3l9l8l8l8l7l6OOm1m1L4J19P1j6
-42H14mnM8M8MNJ3J4L4L5l7l6l7l6L6L7M1m3r2r1M1J26N2N2J5J4LKm1m1k4k3J9K0l7l7L4L5
-47I58m1m0m1m1M0M0M0M0j8j7LMK1K2k1k1m9n0N1N0k1k0M5M5L3n3j23l9NMl3l3OPM9M9M0M0
-52I31l1l1l4l4RRM7M6MMl5l5QRj0j0L3L3Q0P9k0k1r1r2o8J8L7L7O5O4K0K0J5J4jq7n0L6J07
-56A075K1q3q2j0rJ2J1j9j9K4K4NNl8l8OOK8K8nmO1O2J9o7q9r0j4j5N2N1Q2mk7k7pqn0n0k5
$$ y = [1002, 944, 886, 893, 900, 893, 844, 813, 867, 937, 965, 929, 892, 896, 900, 905, 910, 915, 920, 992, 1065, 1095, 1124, 1086, 1049, 1011, 973, 976, 980, 941, 901, 836, 771, 835, 898, 980, 1062, 1041, 934, 788, 729, 773, 816, 840, 864, 888, 912, 918, 924, 925, 926, 970, 928, 892, 855, 896, 938, 879, 820, 820, 819, 776, 733, 737, 741, 745, 749, 780, 812, 800, 788, 780, 771, 805, 839, 858, 877, 854, 831, 861, 891, 964, 1037, 1046, 1056, 1023, 990, 1039, 1088, 1119, 1065, 997, 1014, 1021, 1028, 992, 956, 1020, 1084, 1073, 1062, 1008, 954, 928, 902, 876, 850, 858, 867, 918, 969, 995, 1021, 1004, 987, 979, 970, 962, 953, 920, 887, 925, 963, 929, 896, 863, 830, 820, 809, 798, 787, 834, 880, 926, 973, 954, 935, 873, 812, 834, 857, 879, 902, 863, 825, 787, 749, 712, 676, 682, 688, 647, 606, 640, 759, 830, 814, 810, 805, 853, 901, 905, 910, 923, 937, 971, 1006, 969, 933, 896, 860, 896, 933, 974, 931, 839, 748, 789, 915, 967, 1019, 1034, 1048, 1051, 1053, 1012, 971, 947, 924, 943, 963, 926, 889, 923, 958, 917, 877, 836, 795, 835, 875, 915, 955, 937, 920, 923, 927, 948, 970, 949, 928, 879, 829, 880, 930, 909, 889, 934, 979, 1012, 959, 836, 797, 802, 806, 773, 740, 746, 753, 802, 851, 891, 931, 900, 869, 835, 801, 810, 819, 866, 912, 916, 920, 885, 850, 858, 867, 857, 847, 880, 913, 993, 1072, 1052, 1031, 940, 848, 780, 798, 835, 872, 937, 1001, 1021, 1041, 1056, 1070, 1069, 982, 932, 968, 1075, 1096, 1013, 931, 921, 912, 924, 935, 916, 897, 921, 945, 950, 955, 917, 879, 885, 891, 919, 947, 942, 938, 999, 1061, 1080, 1013, 924, 834, 820, 805, 857, 908, 990, 986, 959, 932, 925, 917, 867, 817, 792]
-61G92k5l1N5Q4Q4l9l8QRj3j2J3J2J3J3j1j1j0j1k4k4J9J9N1N1N1N1j0j0q2q1k8k8J5J6K1
-66H89K1%%J4J5J5J4m4m4m4m4J7J6O0N9l9m0m4M1R3R4%jK6K6NNj4j4l5l6k8k9J4J5M7M7k5
-70A052k4LLLLn4n5n5n5opooR5R5l3l3PPl6l6KLKLK3K3j9k0o8o8MLj3j3j3j3O5O5K1K2PPN0
-76I35N0q5q6J4J5J04J04NMo2o3o2o3rj0L2L3mnmnN0N0PP%%j%O7O7l3l2NONNj8j8j8j9l9m0
-81H89LLK4K4j9j9j6j6Q4Q4j9j8j8j9n8n8j6j6N2N1k0k0l1l1l1l1J7J7J7J7P1P0k9l0MMM6
-86I62M6ooooPPo5o4m2m2L0K9LMO9O9P1j6o7o7J1J0J0J1N0N1K7n8p7p7J7J7M4M3M3M4K5K5
-90A126j8j8p7p8n4L2Q9R0rr4p1J3MLj9k0j9j9m5m5N5N5L3L3l9l8K9L0J1p4n9K8M5M4mnnn
-95I05J7J6O6k1q3q3j7j7K9K9j3j4nnO7O6J7J6jq7j17l1P2P2N2N3j4j3m9L6O0N9o5o6k3k3
$$ y = [792, 767, 736, 791, 875, 959, 920, 882, 890, 899, 886, 874, 887, 899, 912, 925, 914, 903, 893, 882, 858, 834, 853, 872, 923, 974, 1025, 1076, 1066, 1056, 974, 893, 865, 837, 852, 868, 889, 910, 910, 910, 924, 939, 954, 968, 924, 880, 836, 792, 809, 825, 885, 944, 905, 865, 821, 862, 955, 1049, 1049, 1048, 1074, 1100, 1105, 1110, 1096, 1082, 1047, 1011, 983, 954, 968, 983, 1030, 1077, 1052, 1028, 1031, 1034, 1037, 1040, 986, 931, 876, 821, 815, 808, 802, 796, 891, 986, 953, 920, 927, 934, 898, 862, 864, 867, 869, 872, 895, 918, 899, 879, 811, 743, 747, 750, 737, 724, 711, 698, 763, 828, 849, 871, 878, 885, 935, 985, 900, 814, 828, 843, 947, 1051, 1056, 1060, 998, 935, 873, 810, 801, 791, 823, 856, 852, 847, 843, 838, 888, 938, 945, 952, 952, 952, 951, 951, 1018, 1085, 1052, 1020, 1025, 1031, 1036, 1041, 1023, 1005, 987, 968, 929, 889, 892, 895, 919, 943, 924, 905, 889, 873, 957, 1041, 1022, 1004, 986, 967, 909, 851, 835, 819, 871, 922, 902, 882, 851, 820, 789, 758, 775, 792, 809, 826, 897, 967, 938, 908, 912, 916, 962, 1008, 1002, 996, 990, 984, 991, 998, 933, 869, 827, 785, 815, 844, 847, 851, 920, 989, 1060, 1044, 977, 910, 921, 931, 941, 952, 1002, 1053, 1080, 1022, 945, 868, 885, 902, 946, 989, 1032, 1076, 1101, 1126, 1108, 1090, 1013, 935, 881, 913, 1002, 1092, 1083, 989, 918, 931, 935, 938, 919, 899, 880, 861, 816, 771, 826, 881, 914, 947, 908, 870, 899, 929, 940, 866, 807, 835, 880, 924, 920, 915, 910, 905, 922, 938, 1004, 983, 900, 817, 800, 783, 812, 841, 828, 814, 809, 804, 871, 937, 954, 970, 969, 882, 765, 734, 806, 878, 930, 983, 969, 956, 907, 943, 1003, 1062, 997, 931, 908, 885]
-99H85mlKKoP9P9or0r0NMp3p4N0M9J6p0k7N8O1O1K3K3m7m6m6m7L6L6L7L6n5n5M5M5m1m1k4
-104G87O2K8n7n2L4L8L8M3M4K4K4j9j9o5o5p0J5M6M7RRK2K3K2K2k6k7p0o9P1P2P7rm0m0K0
-109I49K1m7j33j32m7O1O0O5O6M6M5k6k5k3k2k2k2j4j3L0K9L1L2L1L1Q2Q2j8j8n3n4n3n4k9
-113H56l0M2M2K6K6j7j6J0J1J0J1k2k1k2k1k4k4J9J8oom9m9j8j8j8j8J5J5k2k2n8K8Q0Q0p
-117H01qN9N9O4k1m4m5N3N3j9j8m8m9m8m8N1N1N0N1nonoK0J9n1n2ooL7L7k3k4k4k3J9J8J9
-122H82J9QQQQLLN1l4j18j18k4J19J19L3J9K0lkkln6n6j04j9L0K9L5L5j4j5j4j4JJJJo7o6
-127G04m9L7Q2ln0n0M8M7NNNMNNK9L0L0K9p2p2k0O5J14J15j3r8n2L3M6M5lq9m1m1K3K4m3m3
-131G91M5J31Q3Q2NNj14j15o4Q0Q9Nq5q5l9M7R3R3K7j16j40n4P4P5m9m8m8m8P4P4LLj04j04
$$ y = [885, 881, 878, 880, 882, 876, 955, 1034, 1028, 938, 848, 853, 857, 784, 710, 760, 809, 825, 755, 728, 786, 847, 908, 931, 954, 907, 861, 815, 768, 804, 840, 877, 913, 858, 803, 848, 893, 852, 811, 787, 849, 877, 820, 768, 802, 840, 878, 921, 965, 989, 1013, 994, 975, 910, 845, 775, 790, 836, 883, 892, 901, 923, 946, 968, 990, 964, 937, 867, 798, 869, 941, 1018, 1009, 969, 929, 949, 970, 923, 790, 658, 611, 672, 732, 797, 863, 909, 954, 928, 903, 880, 858, 836, 814, 800, 787, 817, 846, 877, 909, 940, 971, 1053, 1135, 1117, 1099, 1046, 992, 939, 885, 856, 826, 868, 910, 936, 962, 945, 929, 939, 950, 960, 971, 949, 928, 906, 885, 861, 837, 856, 874, 868, 862, 813, 764, 746, 728, 710, 692, 707, 722, 700, 678, 620, 648, 728, 808, 801, 793, 852, 911, 975, 954, 910, 865, 918, 971, 952, 934, 886, 837, 789, 741, 792, 843, 893, 944, 939, 933, 928, 922, 942, 961, 910, 858, 852, 846, 883, 920, 897, 873, 849, 826, 845, 863, 882, 901, 909, 917, 925, 933, 936, 939, 990, 956, 838, 720, 696, 815, 934, 967, 986, 1006, 1003, 1001, 999, 996, 940, 884, 780, 761, 791, 820, 855, 890, 876, 861, 847, 833, 834, 835, 836, 837, 770, 704, 655, 692, 774, 771, 721, 671, 719, 766, 771, 776, 781, 785, 790, 795, 824, 854, 884, 913, 841, 769, 749, 814, 928, 1043, 1030, 932, 880, 913, 959, 1004, 1001, 912, 871, 830, 853, 877, 834, 791, 836, 967, 1050, 1132, 1137, 1142, 1028, 913, 849, 929, 1018, 1023, 938, 853, 814, 861, 954, 1047, 1074, 958, 818, 764, 838, 913, 864, 816, 768, 720, 794, 868, 871, 874, 770, 666]
-135F66N4N3O5O6ono0o0J1J2N1N2RQM6M5M5M6n8n8J3J3m2m1m2m1KKKKL9L9L9L8J1J1o0o0l0
-140H77l0l1l0L9L8mmJJM4M4l4l4l3l4P3P2KJj9j9j9j9J2J2J2J2K8K8j4j5n2n2rrk2k2k3k2
-145G46O6O6onrrrrl3l2J1J0m3m4Q4Q5m0m1LK%%%%NOM9M8L9M0l2l2K0J9K0J9o2o3k0k0ono
-150H12oj0rj0rl8l7L3L4M7M7M7M8k1k0k1k0K0J9K0K0L5L5n9n9k4O2J4J4k6k7J6J6PQN0N0
-155A058n2n2n3n2j2j3j3j3n1n1k8N8O1O0noJ4J4k8k9j3j2n6n5N1N1QQM0M1M0M0l5l5l5l5
-159H10L0L0L0L0lkm6m5o1o0J9J05J04J03k3j09q4JM7M7l8l9l9l9PPM9N0N8N8j4j3j11j12
-163G47m0J03J23L8l3l3llllL1L1L2L1ONr4r5mmmnqrL4L4L0L0o9p0qpL5L6J5J5n7n6j9j9j6
-168G14j7L6P9J03J7k4k4J3J4KKLKl8l7L3L4k0k0o3o2K7K8K7K7q0q1J9O1N3l2p5l1K0O3Q5
$$ y = [666, 720, 773, 838, 904, 898, 893, 833, 773, 784, 796, 847, 899, 908, 916, 962, 1007, 1052, 1098, 1040, 982, 995, 1008, 966, 925, 883, 842, 844, 846, 848, 850, 889, 928, 967, 1005, 1016, 1027, 967, 907, 877, 847, 816, 786, 825, 863, 859, 855, 856, 857, 901, 945, 911, 877, 844, 810, 883, 955, 957, 958, 939, 920, 901, 882, 894, 906, 918, 930, 958, 986, 972, 957, 905, 853, 844, 835, 813, 791, 768, 746, 812, 878, 872, 867, 858, 849, 840, 831, 798, 766, 777, 787, 744, 700, 784, 869, 829, 788, 791, 793, 793, 793, 793, 793, 798, 804, 853, 901, 940, 980, 948, 916, 936, 955, 975, 994, 932, 869, 849, 829, 823, 818, 812, 806, 796, 787, 777, 768, 730, 693, 726, 760, 807, 854, 901, 949, 928, 908, 887, 867, 887, 906, 926, 946, 981, 1016, 957, 898, 874, 936, 950, 964, 938, 911, 927, 943, 950, 958, 1008, 1058, 1006, 954, 901, 849, 837, 824, 811, 798, 747, 696, 668, 726, 787, 847, 842, 836, 850, 864, 836, 807, 794, 782, 726, 671, 722, 773, 781, 789, 829, 870, 910, 950, 915, 880, 845, 810, 840, 870, 900, 930, 927, 925, 879, 834, 773, 713, 732, 837, 941, 1044, 1021, 912, 828, 829, 876, 923, 885, 846, 807, 768, 775, 782, 831, 881, 939, 997, 983, 970, 859, 747, 707, 810, 933, 971, 938, 905, 902, 899, 896, 893, 924, 955, 987, 1018, 1024, 1029, 935, 840, 836, 832, 828, 823, 815, 806, 840, 874, 904, 934, 865, 795, 787, 780, 815, 851, 866, 881, 824, 768, 749, 730, 714, 697, 733, 812, 915, 932, 908, 884, 897, 911, 913, 915, 918, 920, 882, 845, 878, 912, 892, 872, 809, 747, 774, 802, 829, 856, 776, 695, 714, 775, 828, 796, 721, 690, 710, 773, 858]
-173H58Q5K8K9j4j5p5p6l0N6Q6%r8r8l5N1L0j4qL4P3P3j0r5n6L0O9K6j7j6K7K6p3p3N8N9l8
-177H57l9L7P9j5j02m0J03J37N1k1k0J7J7m9m9m3m4j6O8M8MJ5N9J3p2j06k0J08O5r9r8kjj9
-181H23j9K4K3K9K8K8K8mmm8m7RRRRO7O7O6O7n2n1n1n1j2j1j2j1l6l5O4O5qqj0j1k8p1r5j0
-186G30M8M8N3N4OPo4o4RJ0N2N3%Jm2m2P3P4Kq4q4O0J47O2q4j27l1N5M9Oppm4m3m4m3m6m6
-191F97K4O8L4n1m8L7R7R8l0j15l4N2O8K5K0O3O0J7l1l1p2j14r0N3J46J02jq7o6k3j3j3j0
-195H32j0k3k2M9M9J9K0J9K0QQRQn7n8j5j5N6N6J3J3o0n9j6j7j5j6j6j5M5M5n4r7k4O1J31
-199H72Q9k3o7m7ml1l2pP7P1K9m3m2m2m2m2m2L7L6ooPQQQl7l7OOR5R6R5R5j9k0k0j9%%J%Q
-204A016Ql5l5mnJ6J6m7m7m8m7j8j8N4N3L9M0o0j03n3L3P2j3q1q0rP7O6K4j8j9KLKKK6K6K7
$$ y = [858, 943, 971, 1000, 986, 971, 896, 820, 790, 846, 932, 932, 834, 736, 701, 752, 782, 768, 760, 794, 867, 940, 930, 835, 779, 809, 878, 904, 887, 871, 898, 924, 851, 778, 836, 895, 857, 818, 855, 934, 919, 817, 777, 880, 1017, 1068, 1047, 1027, 1044, 1061, 1012, 963, 920, 876, 860, 928, 976, 980, 995, 1054, 1067, 995, 889, 869, 977, 1042, 943, 845, 843, 842, 823, 804, 828, 851, 880, 908, 936, 964, 960, 956, 908, 861, 870, 879, 888, 897, 964, 1031, 1097, 1164, 1112, 1061, 1010, 959, 947, 936, 924, 913, 877, 842, 906, 971, 963, 955, 945, 934, 906, 835, 740, 730, 778, 826, 879, 933, 939, 946, 882, 818, 827, 837, 889, 942, 942, 943, 901, 859, 932, 1006, 1008, 924, 840, 900, 1047, 1109, 1025, 898, 867, 922, 971, 977, 970, 963, 919, 876, 832, 789, 743, 697, 721, 789, 823, 772, 724, 761, 858, 956, 926, 811, 777, 829, 897, 922, 942, 1005, 1065, 1082, 1051, 1020, 948, 834, 744, 797, 943, 1045, 1044, 957, 891, 868, 855, 842, 832, 822, 799, 777, 826, 875, 894, 914, 933, 953, 961, 969, 978, 986, 929, 871, 856, 841, 897, 953, 966, 979, 919, 860, 844, 827, 812, 796, 780, 765, 810, 855, 801, 704, 680, 741, 872, 961, 938, 871, 824, 820, 789, 757, 750, 827, 898, 927, 884, 842, 800, 758, 716, 674, 711, 747, 741, 735, 742, 750, 758, 766, 729, 692, 698, 704, 799, 895, 990, 1085, 1066, 1046, 1026, 1007, 1007, 1007, 1008, 1008, 1016, 1024, 989, 954, 950, 945, 961, 977, 930, 883, 835, 788, 770, 752, 806, 859, 898, 938, 878, 775, 722, 755, 827, 814, 733, 653, 644, 721, 787, 811, 793, 774, 776, 779, 781, 783, 809, 835, 862]
-209H62K6l3l2J0J0l7l8L4L4J%k1k1L0L0j4j3r4r4k2k3KKK2J08J22P8%q7q6q7L7L7L9L9O0
-213H81O1lkkkm7m8k4O1M6M6L0L0n1n2l3N1J3p3j10k5K5K5j2j2ooJ2R8Q8Kp3p3l8l9l3l3P8
-218G50J64O4k2m8m8M6M6L9L9j3r8p6p6j0rL3L3P5P6kko8o8p8QQ8Q8j6j5j6j6n3n3l1l2j4
-222F85j5Q0Q0M0m5k9N7J06K0n4n4k1k0J%o4o4p0J6L0L0qq%jj%N7N8j4j4m6m7lmM1M0M0M0
-227H39N8N8J5J4l6l6l6l6L0L0L0L0j2j3j2j2J2J2l1l0J1J1J1J1J%JJK9K9j3j4L0L1p0p0k9
-232H44k8J4J4O4O3J8o9q4JK0J9RRl3l3o7o6O2O1j5j5j8j9Ol6o4K2L5rm5lJ18J18R8J3k7k6
-236I51l1l2llllKKo8j12n9K7M8M7O0O0O0O0m6m7lmK6K6j6n9l5N1O7K4l5l5l8l8n6n6j4j3
-241G02k9k8J4J4J8J8J8J8M7M8M7M8l8l7l7l8k7k7M3M4rj0j0rkkm1m2R4J36O7p5j51j08oQ0
$$ y = [862, 888, 855, 823, 833, 843, 806, 768, 802, 836, 837, 837, 816, 795, 825, 855, 841, 828, 734, 640, 618, 595, 597, 599, 621, 729, 851, 929, 929, 842, 756, 669, 706, 743, 782, 821, 881, 942, 939, 937, 935, 933, 886, 838, 814, 875, 921, 967, 997, 1027, 976, 924, 891, 942, 955, 882, 772, 747, 772, 797, 785, 773, 767, 761, 773, 871, 959, 961, 888, 815, 777, 738, 705, 672, 750, 914, 978, 956, 908, 860, 906, 952, 991, 1030, 1017, 919, 843, 767, 757, 748, 781, 814, 889, 965, 963, 961, 893, 825, 747, 755, 843, 931, 915, 900, 884, 868, 815, 762, 731, 699, 685, 670, 750, 830, 870, 825, 796, 853, 959, 979, 925, 871, 850, 830, 831, 831, 767, 703, 633, 649, 679, 709, 701, 693, 693, 692, 691, 691, 748, 806, 792, 778, 732, 685, 682, 678, 719, 759, 799, 839, 897, 955, 970, 984, 948, 912, 876, 840, 870, 900, 930, 960, 948, 935, 923, 911, 923, 935, 904, 874, 885, 896, 907, 918, 919, 919, 920, 921, 950, 979, 966, 952, 982, 1013, 943, 873, 844, 816, 830, 844, 908, 971, 989, 920, 836, 837, 857, 876, 885, 894, 861, 828, 761, 695, 757, 818, 803, 788, 770, 751, 757, 721, 657, 679, 714, 705, 660, 657, 775, 893, 991, 1004, 977, 951, 920, 888, 885, 882, 879, 876, 878, 880, 812, 700, 641, 668, 716, 763, 823, 883, 943, 1003, 957, 910, 907, 903, 929, 955, 939, 880, 845, 896, 963, 987, 952, 917, 879, 841, 785, 729, 715, 702, 673, 645, 659, 673, 691, 709, 727, 745, 792, 840, 887, 935, 897, 860, 823, 785, 758, 731, 774, 818, 809, 799, 789, 780, 778, 776, 735, 693, 787, 923, 990, 915, 764, 656, 650, 730]
-245G30R6N2L4L4M4m3j15p3N3R6K2o2m1m0m3m3KM5L1n5l4N1O4K2mlooK1K1k2k1%JM4M3n7n7
-250G81J4J4L0L1m1m2r5r6j8O8L1j2J0R5J26Q3J3J3K7K8m5m4klnnm7q9j14k8O8O9k6k6K1K0
-254H04K1K0K7K7Rp7q1NP4P4L4n1p5p4%J%%M6M5M6M5K1K0K1K0o4o4o5o4l5l6j3P3J00R9L4
-259I67L3qrn1n2pppqJ0J0n7n6j1P4R7R7n0m9n0n0L1L1J3p3j04j9N6N6m6m5m6m5L9L9Q2Q2
-263H67MMO9P0K3o4n7n8j1j1j1j1Q6Q7j8j02j06k1K6K6L5L5pqk4k4P1P0M4m1o5o5M2M2j%n2
-268H44n2n1n2M7M6LLK2K2O5O5LMr7r6l0l0J3J3O0N9N9O0JJm1m2l2l2M0L9K4K3j9k0o6o6k3
-272G67k3k7k7M5M4k6k6J6J6K0J9J9J9j5j4N6N7L9L8l2l3k0k1k1k0K4K3j8j9j3j3qqk9N7N1
-277H97N1n4n4n4n3NOM9M9L3L2r0r0o4K1M4M5JJJJN2N2L4n1r1nM1M1O3O2M5m1j38n3N1N1J4
$$ y = [730, 826, 878, 912, 946, 990, 947, 832, 759, 812, 908, 930, 868, 827, 787, 744, 701, 703, 748, 779, 724, 690, 741, 805, 827, 823, 820, 814, 808, 829, 850, 828, 807, 807, 808, 852, 895, 838, 781, 795, 809, 839, 870, 829, 787, 692, 596, 578, 646, 677, 665, 675, 770, 896, 979, 992, 1005, 1032, 1060, 1015, 971, 969, 966, 961, 956, 909, 820, 706, 678, 746, 815, 789, 763, 784, 804, 825, 845, 872, 899, 908, 831, 750, 755, 829, 903, 937, 886, 811, 737, 737, 738, 738, 738, 784, 829, 875, 920, 941, 961, 982, 1002, 938, 874, 809, 745, 710, 674, 661, 734, 834, 933, 967, 1000, 992, 983, 932, 880, 873, 866, 859, 851, 861, 871, 814, 758, 747, 821, 918, 1015, 965, 916, 866, 816, 847, 878, 891, 818, 714, 695, 751, 807, 761, 716, 670, 625, 664, 703, 785, 867, 871, 875, 944, 1014, 1037, 973, 916, 858, 847, 836, 825, 814, 900, 987, 969, 867, 761, 740, 766, 792, 827, 862, 855, 847, 823, 799, 870, 940, 984, 943, 878, 813, 855, 897, 896, 896, 844, 792, 741, 689, 736, 782, 785, 788, 810, 832, 897, 962, 965, 969, 872, 776, 746, 716, 729, 742, 802, 861, 920, 980, 981, 982, 941, 899, 867, 835, 875, 914, 938, 961, 942, 922, 856, 790, 767, 744, 717, 690, 735, 779, 753, 727, 743, 759, 779, 798, 817, 836, 821, 807, 863, 920, 959, 997, 965, 932, 912, 891, 870, 850, 874, 897, 879, 860, 847, 834, 826, 818, 789, 846, 897, 948, 894, 840, 786, 733, 738, 744, 793, 842, 875, 907, 817, 727, 663, 684, 728, 773, 774, 775, 776, 777, 829, 881, 915, 864, 773, 768, 809, 850, 913, 975, 1020, 979, 841, 788, 839, 890, 904]
-281I04J3N6N7p9p9k7N8J1J0n6n5k6k6J6J7l3l3L8L8l6l7Q7Q7N0l5l6N0P6P5RRm1m0m1m1p0
-286H70p0K9L0m7m7m7m7J2J2P8P8O4k2j6j6KLLLK6K7Rp6j07k0P7P7K1o6j7j7J1J0J1J0JKJ
-290H52Jr0q9o8o8K1K2O4O4N8N8m2m2KLM5M5O6O5rr5p0J5J11K4p2p3K3K2k9l0pqJ0J1J0J1
-295H11%JK2K2R5R5rr4j18l2P1P1l0l0l0l1j5j5j5j5J6J5J6J6M3M3M4M3m2m1JJl8l7ONj4j4
-300H17N7N7l3l3RN2K4o2k1O4L2n3n3L2J9o7q5%N0Po3o4N9N8N9N8QQo4o4o6o7m4M2P1P1MN
-304H24o2o3j3P3P0K7j8j8l4p8n9K6J28J27N2l3k4k4J3J4M2M2n8n8MMr1r0p6RO1O1N0N0m5
-309H33m5o9J5J1J0k9k9J4J4J4J4k9k9j6j5n3n4k8N8J29M3m7m7P0P1M6m0l5l4NOM8M8LLj8
-313H38j9j1j2J0J0P0P0l0l0k5k4P0P0M6m1q3KN2N2p1p1k4k4k4k4j4j3K8K9O4O3K1K1L4L5
$$ y = [904, 917, 973, 1030, 951, 872, 845, 903, 914, 924, 868, 813, 787, 761, 777, 794, 761, 728, 766, 804, 768, 731, 818, 905, 955, 920, 884, 934, 1010, 1085, 1094, 1103, 1062, 1022, 981, 940, 870, 800, 829, 859, 812, 765, 718, 671, 683, 695, 773, 851, 915, 893, 877, 861, 863, 866, 869, 872, 898, 925, 934, 858, 751, 731, 808, 885, 906, 840, 823, 806, 817, 827, 838, 848, 849, 851, 852, 853, 763, 674, 606, 538, 559, 581, 645, 709, 767, 825, 783, 741, 743, 746, 791, 836, 902, 967, 958, 863, 793, 808, 919, 943, 871, 798, 821, 843, 814, 784, 777, 769, 779, 790, 800, 811, 811, 812, 834, 856, 951, 1046, 1037, 943, 825, 793, 864, 935, 905, 875, 845, 814, 799, 784, 769, 754, 770, 785, 801, 817, 860, 903, 947, 990, 948, 907, 908, 909, 871, 834, 840, 845, 831, 817, 874, 931, 898, 865, 874, 926, 950, 888, 867, 931, 963, 910, 857, 889, 908, 841, 756, 756, 806, 813, 750, 686, 745, 803, 862, 920, 928, 936, 872, 808, 742, 675, 631, 673, 744, 815, 819, 824, 762, 699, 686, 759, 829, 856, 838, 820, 786, 708, 649, 675, 803, 930, 982, 949, 925, 901, 914, 928, 970, 1012, 954, 896, 900, 904, 813, 723, 647, 656, 717, 778, 828, 878, 833, 788, 719, 734, 745, 755, 726, 697, 711, 725, 739, 753, 724, 695, 679, 664, 611, 557, 529, 587, 716, 759, 712, 665, 735, 806, 852, 812, 777, 743, 748, 754, 802, 850, 853, 856, 838, 819, 808, 796, 806, 816, 886, 956, 926, 896, 871, 847, 917, 987, 1033, 992, 909, 911, 963, 1015, 944, 873, 849, 825, 801, 777, 763, 750, 778, 807, 871, 934, 955, 976, 1010, 1045]
-317A045l7l7L2L3Rp6p3p3l5l5K2K1n0n0KJj5j5m2M3R5R5m0m1j9j9N0N1k2k1RQN1N1J2J2l1
-322I11l1k2k2N0N0m1m1KKJ3J3L0K9Kq4o8J8Q2mn0n0L0L1j3j2m3m3k5O0J22L7r1r0l0N5QP
-326G92j5j5K8K8P6P7p6p5p2J4O5O6L3L3r0r0n5L2K5K6M2M1jjl7l7NOM8M7n2n3k3k3m0l9o6
-331F24J9M3M2NOj7j6L9L8mnJ%K1K2qqO3O4nnm7m8k9l0k9l0PPPPK2K2K2K3rrO3O3j8j9l9m0
-336H15j8j9Q1Q1j8j8j7j8M7M7n3n3o9p0k6k7K1K1M3M2N4N3m6m6opJ6J5%J%Jn6n6J5J6K1K1
-341G88K1K1O1O1l9l9K3K2R4R3p0p1JJL9L9mmn8n7j5j4o5o4k2k1O5O4K2K2k2k1%jL9L9l3l2
$$ y = [1045, 1008, 971, 1003, 1036, 1045, 969, 896, 823, 788, 753, 775, 796, 746, 696, 698, 699, 684, 669, 627, 670, 765, 860, 820, 779, 760, 741, 791, 842, 820, 799, 808, 816, 867, 918, 930, 942, 911, 880, 858, 836, 886, 936, 895, 854, 856, 858, 871, 884, 914, 943, 945, 861, 793, 811, 893, 889, 839, 789, 819, 850, 837, 825, 782, 739, 714, 774, 896, 933, 842, 752, 722, 777, 785, 792, 777, 762, 790, 818, 894, 971, 895, 820, 748, 762, 827, 893, 926, 959, 869, 779, 724, 756, 781, 807, 849, 890, 889, 888, 851, 814, 819, 825, 873, 920, 868, 815, 792, 769, 729, 690, 624, 643, 686, 728, 733, 739, 722, 706, 745, 783, 779, 774, 775, 775, 796, 818, 810, 802, 865, 929, 924, 919, 872, 824, 795, 765, 736, 706, 713, 720, 727, 734, 756, 778, 800, 823, 814, 805, 868, 931, 913, 894, 855, 815, 797, 778, 859, 940, 922, 904, 887, 869, 916, 963, 910, 857, 788, 718, 692, 665, 686, 707, 750, 792, 846, 899, 853, 807, 801, 794, 810, 825, 825, 826, 826, 827, 771, 715, 730, 746, 767, 788, 809, 830, 891, 952, 913, 874, 897, 919, 1013, 1106, 1036, 965, 966, 967, 1006, 1045, 1041, 1037, 979, 922, 907, 893, 828, 764, 742, 721, 786, 850, 872, 894, 872, 851, 851, 850, 889, 928, 895, 863]
$$ [...]
-1605F75
##END=	
##END=	
